##TITLE=	Oct25-2021.42.ser
TM-VI-136solid hsqc

##JCAMP-DX=	6.0	$$ MestReNova 14.3.0-30573
##DATA TYPE=	LINK
##BLOCK_ID=	1
##BLOCKS=	2    
##ORIGIN=	Mestrelab Research S.L.
##OWNER=	hrzepa
##$MNOVA/LINK_BLOCK_TYPE=	ITEM	$$ NMR Spectrum
##$MNOVA/ITEM/POLYGON=	(XY..XY)
5321,5835
8722,5835
8722,8208
5321,8208
5321,5835
##$MNOVA/ITEM/Z=	0
##$MNOVA/ITEM/ANGLE=	0
##TITLE=	Oct25-2021.42.ser
##JCAMP-DX=	6.0	$$ MestReNova 14.3.0-30573
##BLOCK_ID=	2
##DATA TYPE=	MNOVA NMR VIEW DATA
##DATA CLASS=	MNOVA VIEW DATA
##$MNOVA/2D/THRESHOLD=	7.3173236846923828125
##$MNOVA/ITEM/ZOOM/X=	-0.57569381887933257502,	10.597560000003785063
##$MNOVA/ITEM/ZOOM/Y=	-9.5463849045685140737,	230.0176000018207958
##END=	
##TITLE=	Oct25-2021.42.ser
##JCAMP-DX=	6.0	$$ MestReNova 14.3.0-30573
##BLOCK_ID=	3
##DATA TYPE=	nD NMR SPECTRUM
##DATA CLASS=	NTUPLES
##NUMDIM=	2
##ORIGIN=	Bruker BioSpin GmbH
##OWNER=	nmr
##.OBSERVE FREQUENCY=	400.20200099999999566
##.OBSERVE NUCLEUS=	^1H
##.SOLVENT NAME=	CDCl3
##.PULSE SEQUENCE=	hsqcetgpsi2.ph
##LONGDATE=	2021/10/25 17:13:00.000
##.ACQUISITIONMODE=	SIMULTANEOUS (DQD)
##$ORIGINAL FORMAT=	Bruker XWIN-NMR
##$MNOVA/SCALES_VERSION=	9
##$PARAMETER FILE=	(acqu2s, ASCII, /private/var/folders/f6/rjf_tdyn2v98c5c0wvkgn4s80000gn/T/hO$3TE3zSpetSnEARrW0Zg/42/acqu2s, 0)
$$ ##TITLE= Parameter file, TOPSPIN		Version 3.2
$$ ##JCAMPDX= 5.0
$$ ##DATATYPE= Parameter Values
$$ ##NPOINTS= 241	$$ modification sequence number
$$ ##ORIGIN= Bruker BioSpin GmbH
$$ ##OWNER= nmr
$$ $$ 2021-10-25 17:22:34.771 +0100  nmr@CZC2439F63
$$ $$ /opt/topspin/data/agmb/nmr/Oct25-2021/42/acqu2s
$$ $$ process /opt/topspin3.2/prog/mod/go
$$ ##$ACQT0= 0
$$ ##$BF1= 100.63037
$$ ##$FnMODE= 6
$$ ##$NUC1= <13C>
$$ ##$NusJSP= 0
$$ ##$NusT2= 1
$$ ##$NusTD= 240
$$ ##$O1= 11069.4607123918
$$ ##$SFO1= 100.641439460712
$$ ##$SW= 240.006397974962
$$ ##$SW_h= 24154.5893719807
$$ ##$TD= 240
$$ ##END=
$$ 
##$PARAMETER FILE=	(acqus, ASCII, /private/var/folders/f6/rjf_tdyn2v98c5c0wvkgn4s80000gn/T/hO$3TE3zSpetSnEARrW0Zg/42/acqus, 0)
$$ ##TITLE= Parameter file, TOPSPIN		Version 3.2
$$ ##JCAMPDX= 5.0
$$ ##DATATYPE= Parameter Values
$$ ##NPOINTS= 12	$$ modification sequence number
$$ ##ORIGIN= Bruker BioSpin GmbH
$$ ##OWNER= nmr
$$ $$ 2021-10-25 17:22:38.212 +0100  nmr@CZC2439F63
$$ $$ /opt/topspin/data/agmb/nmr/Oct25-2021/42/acqus
$$ $$ process /opt/topspin3.2/prog/mod/shimcntl
$$ ##$ACQT0= 1000000
$$ ##$AMP= (0..31)
$$ 100 100 100 100 100 100 100 100 100 100 100 100 100 100 100 100 100 100
$$ 100 100 100 100 100 100 100 100 100 100 100 100 100 100
$$ ##$AMPCOIL= (0..19)
$$ 0 0 0 0 0 0 0 0 0 0 0 0 0 0 0 0 0 0 0 0
$$ ##$ANAVPT= -1
$$ ##$AQSEQ= 0
$$ ##$AQ_mod= 3
$$ ##$AUNM= <au_zg>
$$ ##$AUTOPOS= <51 >
$$ ##$BF1= 400.2
$$ ##$BF2= 100.63037
$$ ##$BF3= 400.2
$$ ##$BF4= 400.2
$$ ##$BF5= 400.2
$$ ##$BF6= 400.2
$$ ##$BF7= 400.2
$$ ##$BF8= 400.2
$$ ##$BYTORDA= 0
$$ ##$CAGPARS= (0..11)
$$ 0 0 0 0 0 0 0 0 0 0 0 0
$$ ##$CFDGTYP= 0
$$ ##$CFRGTYP= 9
$$ ##$CHEMSTR= <none>
$$ ##$CNST= (0..63)
$$ [...]
$$ 0 0 0 0
$$ ##$ShimPowMaxUC= (0..63)
$$ 130000 130000 130000 130000 130000 130000 130000 130000 130000 130000 130000
$$ 130000 130000 130000 130000 130000 130000 130000 130000 130000 0 0 0 0
$$ 0 0 0 0 0 0 0 0 0 0 0 0 0 0 0 0 0 0 0 0 0 0 0 0 0 0 0 0 0 0 0 0 0 0 0 0
$$ 0 0 0 0
$$ ##$ShimPowMaxUG= (0..63)
$$ 524287 524287 524287 524287 524287 524287 524287 524287 524287 524287 524287
$$ 524287 524287 524287 524287 524287 524287 524287 524287 524287 0 0 0 0
$$ 0 0 0 0 0 0 0 0 0 0 0 0 0 0 0 0 0 0 0 0 0 0 0 0 0 0 0 0 0 0 0 0 0 0 0 0
$$ 0 0 0 0
$$ ##$ShimPowRcbType= 3
$$ ##$ShimPowRes= (0..63)
$$ 1e-20 1e-20 1e-20 1e-20 1e-20 1e-20 1e-20 1e-20 1e-20 1e-20 1e-20 1e-20
$$ 1e-20 1e-20 1e-20 1e-20 1e-20 1e-20 1e-20 1e-20 0 0 0 0 0 0 0 0 0 0 0 0
$$ 0 0 0 0 0 0 0 0 0 0 0 0 0 0 0 0 0 0 0 0 0 0 0 0 0 0 0 0 0 0 0 0
$$ ##$ShimPowRng0= (0..63)
$$ 1 1 1 1 1 1 1 1 1 1 1 1 1 1 1 1 1 1 1 1 0 0 0 0 0 0 0 0 0 0 0 0 0 0 0 0
$$ 0 0 0 0 0 0 0 0 0 0 0 0 0 0 0 0 0 0 0 0 0 0 0 0 0 0 0 0
$$ ##$ShimPowRng1= (0..63)
$$ 1 1 1 1 1 1 1 1 1 1 1 1 1 1 1 1 1 1 1 1 0 0 0 0 0 0 0 0 0 0 0 0 0 0 0 0
$$ 0 0 0 0 0 0 0 0 0 0 0 0 0 0 0 0 0 0 0 0 0 0 0 0 0 0 0 0
$$ ##$ShimPowRng2= (0..63)
$$ 1 1 1 1 1 1 1 1 1 1 1 1 1 1 1 1 1 1 1 1 0 0 0 0 0 0 0 0 0 0 0 0 0 0 0 0
$$ 0 0 0 0 0 0 0 0 0 0 0 0 0 0 0 0 0 0 0 0 0 0 0 0 0 0 0 0
$$ ##$ShimPowRng3= (0..63)
$$ 1 1 1 1 1 1 1 1 1 1 1 1 1 1 1 1 1 1 1 1 0 0 0 0 0 0 0 0 0 0 0 0 0 0 0 0
$$ 0 0 0 0 0 0 0 0 0 0 0 0 0 0 0 0 0 0 0 0 0 0 0 0 0 0 0 0
$$ ##$ShimSysFunc= (0..63)
$$ 1 2 3 4 5 7 9 11 15 16 8 10 12 14 6 17 13 18 19 20 0 0 0 0 0 0 0 0 0 0
$$ 0 0 0 0 0 0 0 0 0 0 0 0 0 0 0 0 0 0 0 0 0 0 0 0 0 0 0 0 0 0 0 0 0 0
$$ ##$ShimSysMatrix= 0
$$ ##$ShimSysType= 1
$$ ##$TFXNUM= 0
$$ ##$TRIPLO2= 0
$$ ##$VTU= 2
$$ ##$VTUETH= <149.236.99.20>
$$ ##$VTUTY= <no>
$$ ##$WBREFAM= (0..15)
$$ 135.5 97.7 100 100 100 100 100 100 100 100 100 100 100 100 100 100
$$ ##$WBREFLM= (0..15)
$$ 0 0 0 0 0 0 0 0 0 0 0 0 0 0 0 0
$$ ##$WBREFPH= (0..15)
$$ 72.26 -67.22 0 0 0 0 0 0 0 0 0 0 0 0 0 0
$$ ##$WBSGU= (0..15)
$$ 0 0 0 0 0 0 0 0 0 0 0 0 0 0 0 0
$$ ##$XFAC= 2
$$ ##END=
$$ 
##$DECIM=	4464
##$DSPFVS=	20
##.ACQUISITIONSCHEME=	ECHO-ANTIECHO
##NTUPLES=	nD NMR SPECTRUM
##VAR_NAME=	FREQUENCY1,	FREQUENCY2,	SPECTRUM
##SYMBOL=	F1,	F2,	Y
##.NUCLEUS=	13C,	1H
##.OBSERVE FREQUENCY=	100.64143946071199309,	400.20200099999999566
##VAR_TYPE=	INDEPENDENT,	INDEPENDENT,	DEPENDENT
##VAR_FORM=	AFFN,	AFFN,	ASDF
##VAR_DIM=	512,	512,	262144
##UNITS=	HZ,	HZ,	ARBITRARY UNITS
##FIRST=	23146.756194512010552,	4241.1435120000014649,	-0.22233478724956512451
##LAST=	-960.65624510154020754,	-230.39266631542668051,	-0.22989752888679504395
##MIN=	-960.65624510154020754,	-230.39266631542668051,	-4.88686370849609375
##MAX=	23146.756194512010552,	4241.1435120000014649,	101.65093231201171875
##FACTOR=	1,	1,	0.0048363228956280739784
##PAGE=	F1=23146.8
##FIRST=	23146.756194512010552,	4241.1435120000014649,	-0.22233478724956512451
##DATA TABLE=	(F2++(Y..Y)), PROFILE
$$ [...]
##PAGE=	F1=8333.2
##FIRST=	23146.756194512010552,	4241.1435120000014649,	-0.28593781590461730957
##DATA TABLE=	(F2++(Y..Y)), PROFILE
2815 -8 -116 -24 -58 6 96 -69 0 60 -57 -108 7 -60 -75 -100 103 -99 -61 56 98 -57 48 -72 -54 21 51 -54 31 -51 1 -9
2552 -9 92 7 -8 117 -5 89 -17 21 47 78 68 64 20 48 -71 -65 47 79 92 15 -13 -110 29 108 -5 44 7 81 19 -19 -46 38 -75
2264 -75 -199 -132 -88 -26 26 -60 -26 24 -58 124 87 38 54 87 140 -51 -219 -11 0 47 -65 -45 -94 -59 -58 2 -150 44 -105 -14 37
1992 37 -148 62 24 -64 -105 -6 -61 -62 -139 8 20 -143 44 6 28 -76 94 34 -41 83 56 -57 -35 28 -45 -64 88 -18 87 -96
1730 -96 -98 -34 -83 -3 -56 -26 -58 2 -9 -10 13 -83 26 -74 -40 50 92 -43 48 31 107 -11 19 -148 -56 13 22 -41 35 54 111 -16 -11 -29
1432 -29 21 15 15 70 -34 29 117 -100 -203 32 95 4 -4 -79 -60 2 19 28 103 43 78 45 -43 148 80 36 -57 -89 -34 -28 -64 2 119 43 41
1126 41 70 0 11 74 -25 -7 39 24 28 -43 -1 42 -11 -1 50 80 -14 -64 71 -28 -23 -27 25 59 -97 35 97 -36 -42 -81 -120 22 -43 -53 -13
820 -13 81 65 37 24 13 -62 -127 58 -59 -73 96 78 55 36 -13 -48 -56 28 35 92 13 199 48 0 -1 -2 101 21 -18 -57 -72 -20 55 73 -83
513 -83 -78 -69 -42 11 121 -48 46 116 -11 2 -110 -15 79 47 32 84 -129 19 113 107 14 35 -49 -47 -28 -32 -37 -41 -1 88 33 43 -41 93 59 -2
198 -2 -39 -97 38 -39 -49 -65 -14 -10 95 68 13 1 -42 -28 3 64 16 -68 152 -54 -85 -43 -1 -63 -37 -30 0 -65 70 16 46 -54 -26 -51
-99 -51 9 -130 -77 -24 16 32 23 41 -14 3 -17 -103 -25 38 -35
-230c5
##PAGE=	F1=8238.85
##FIRST=	23146.756194512010552,	4241.1435120000014649,	-0.26865109801292419434
##DATA TABLE=	(F2++(Y..Y)), PROFILE
4241 25 8 -35 -16 -14 -27 -64 -63 9 29 28 34 62 43 -47 -142 -2 67 3 51 28 -73 -23 -4 29 -213 54 153 59 -118 27 -85 -44 -60 106
3944 106 -60 -86 -105 -55 -9 24 26 -23 8 87 -118 74 103 121 106 -11 -99 8 39 165 64 32 -17 -144 30 21 163 5 -66 -27
3681 -27 -76 -46 231 166 40 80 102 -96 136 49 4 62 0 88 93 63 70 -19 -2 -20 -55 -13 16 -1 -55 -70 -94 -30 -34 -97 -103 -3 -92 -47 -1
3375 -1 -63 31 61 -48 37 -14 -68 -7 116 50 53 -103 -9 -12 101 32 -38 14 -31 -16 196 16 23 65 3 -82 55 -3 -11 97 37 33 104 -8
3077 -8 137 -9 -3 -62 -74 -69 22 -63 25 123 53 -20 -2 -60 -125 37 142 -43 -4 42 -50 17 -80 23 43 2 62 34 8 -34 -100 -60 -39 -16
2780 -16 105 -57 22 104 4 -28 0 -35 -59 -108 139 -94 -10 66 108 -81 18 -73 -30 18 42 -20 64 -55 -12 -33 74 -3 -17 85 -31
2509 -31 99 -24 13 24 72 41 76 21 23 -82 -66 52 77 2 34 -29 -139 32 103 8 71 27 90 21 -40 -26 41 -5 -157 -71 -55 -50 32
2220 32 -32 -1 -12 -31 96 77 35 60 82 142 -24 -235 -4 -19 6 -79 -40 -65 -54 -41 -24 -97 63 -85 -1 12 -116 40 49 -69 -67 -32
1940 -32 -34 -51 -145 -42 72 -145 -4 -16 65 -41 125 50 -18 64 -8 -29 -7 -15 -56 -38 82 -10 63 -119 -80 -88 -42 52 -33 -3 -121 -58
1660 -58 -31 -8 -32 -77 41 -23 -74 56 66 -29 97 52 67 -15 7 -143 -55 17 53 -12 24 70 130 -42 -21 -21 2 11 2 35 -16 27 112 -98
1362 -98 -210 26 86 2 33 -65 -71 -15 -9 -23 121 44 49 -36 -32 145 62 44 -85 -76 -19 -47 -61 22 90 42 5 26 -68 18 66 -38 -9 62 23
1056 23 53 -40 -3 17 -21 9 63 62 -33 -58 104 -73 -6 -2 -7 25 -86 97 99 -2 -12 -67 -123 9 -17 -48 -22 87 119 64 7 -12 -59 -141
758 -141 51 -38 -50 81 77 64 32 -48 -2 -29 13 44 72 -27 146 21 -39 -24 -52 83 26 8 -29 -108 -63 89 69 -120 -103 -47 -3 52
478 52 104 -29 47 95 -8 -25 -132 -29 4 24 29 112 -35 24 149 48 2 77 -29 -70 -76 -36 -15 -21 -8 61 18 49 -17 115 71 23 -18
190 -18 -119 43 -21 -49 -91 44 23 80 38 35 -13 -59 -55 16 36 18 -43 141 -31 -57 -22 47 -24 -63 -37 1 -133 42 34 47 -7 -30 -25 -34 -128
-117 -128 -100 -33 39 36 38 7 -53 5 -19 -100 20 51 -22
-230b2
##PAGE=	F1=8144.49
##FIRST=	23146.756194512010552,	4241.1435120000014649,	-0.12424965947866439819
##DATA TABLE=	(F2++(Y..Y)), PROFILE
4241 22 23 -29 -5 0 -48 -23 -15 58 50 4 -4 62 43 -15 -139 -26 54 0 63 29 -27 -42 -20 14 -181 51 108 63 -90 60 -77 -60 -37 131
3944 131 -15 -46 -90 -82 -26 65 47 -23 35 79 -58 75 92 66 59 -17 -23 -16 52 180 99 14 -48 -140 98 6 169 5 -71 -31 -132 -69 239
3655 239 172 48 89 112 -40 123 51 18 74 -74 71 62 76 63 -47 65 31 -10 -21 -20 -43 -80 -84 -65 -22 -14 -86 -101 45 -58 -8 24
3375 24 -37 23 84 -34 20 -15 -20 -30 150 98 34 -133 -13 0 58 8 -52 52 -33 -17 199 18 29 73 33 -57 105 27 -47 63 71 88
3095 88 144 9 148 19 24 -86 -34 -99 -1 -39 72 156 43 0 1 -28 -109 41 68 -51 -59 38 -53 19 -59 4 58 11 25 35 -62 -65 -79
2806 -79 -104 13 -38 81 -27 41 120 48 18 -21 -35 -59 -74 175 -74 7 59 111 -63 -13 -64 -3 -6 29 -17 48 -65 -39 -31 56 3 -16 59
2517 59 -46 95 -35 6 -20 38 -5 78 7 -24 -76 -51 53 78 -92 45 -13 -136 7 74 13 78 40 88 25 -84 7 66 68 -96 3
2246 3 0 -52 46 7 0 -1 14 68 73 48 53 92 144 28 -241 -7 -56 -29 -93 -26 -18 -32 -5 -6 -28 91 -61 7 0 -91 17 56 -65 -17 -75 -12
1931 -12 -53 -131 -49 96 -136 -39 -23 103 7 111 56 -9 8 -85 -9 7 -58 -35 4 72 17 44 -117 -40 -119 14 111 14 10 -162 -105 -44
1651 -44 -12 -68 -88 25 23 -106 49 31 -38 111 56 35 -21 -20 -94 -42 12 106 38 39 68 94 -31 0 -2 -12 3 -3 7 10 61 100 -90 -176 16
1345 16 67 -17 61 -70 -46 -36 -19 -62 119 30 22 -95 5 142 43 35 -93 -49 5 -67 -63 53 66 48 -51 -16 -129 2 52 -57 0 59
1065 59 39 55 -52 -29 0 -38 22 47 45 -42 -39 131 -101 22 24 -16 12 -65 142 94 29 33 -52 -115 -22 -3 -27 -20 76 163 85 -16 -28 -26 -133
758 -133 20 -13 -13 46 74 72 17 -82 43 -3 -9 31 30 -32 99 -16 -61 -34 -51 49 35 64 0 -136 -92 105 41 -146 -108 -15 13 66 77
470 77 -11 58 65 27 -17 -137 -37 -50 0 13 97 42 35 151 -16 16 99 -8 -81 -103 -29 2 -15 -32 15 -21 58 37 141 65 55 7 -134
181 -134 62 8 -35 -75 81 55 52 17 53 -30 -51 -43 -3 -21 14 -25 92 -2 -42 14 107 19 -51 -29 -13 -152 13 25 37 33 -26 -1 -59 -95
-117 -95 -105 -37 32 26 23 -32 -67 -1 -7 -71 70 73 -10
-230a0
##PAGE=	F1=8050.14
##FIRST=	23146.756194512010552,	4241.1435120000014649,	-0.14719493687152862549
##DATA TABLE=	(F2++(Y..Y)), PROFILE
4241 15 26 -13 -10 17 -60 4 18 82 42 -13 -39 32 41 39 -116 -75 32 8 81 30 26 -30 -31 -1 -127 32 36 73 -43 77 -42 -45 -11 137 25
3935 25 -1 -68 -83 -15 114 49 -35 31 62 17 83 87 11 11 -30 39 -62 32 121 108 18 -63 -115 165 -18 158 28 -71 -27 -149 -71 228
3655 228 159 27 68 99 19 78 46 30 75 -136 46 16 68 24 -87 113 61 0 -32 -63 -67 -83 -69 -17 -7 7 -39 -92 104 -36 25 49
3375 49 5 33 96 -9 10 -13 15 -46 153 100 -4 -154 -26 0 25 -12 -47 77 -19 6 160 29 45 77 28 -43 122 40 -45 39 104
3104 104 100 159 38 136 36 53 -94 0 -102 -5 -10 119 161 19 17 -1 -3 -83 36 -7 -27 -109 45 -37 47 -18 -2 44 27 8 49 -109
2824 -109 -91 -48 -135 79 -55 33 9 48 103 70 32 -42 -50 -62 -19 178 -55 4 50 108 -22 -34 -53 10 -47 18 -35 1 -76 -68 -7 30 17
2535 17 -9 56 -28 76 -49 2 -51 0 -43 72 -18 -64 -62 -28 43 80 -158 25 11 -95 -31 43 22 63 31 77 30 -130 40 98 125 -27
2255 -27 55 56 -43 57 27 -12 52 68 52 79 80 19 91 132 85 -238 -32 -83 -56 -99 -9 30 -7 33 22 30 112 -38 7 -1 -73 1 36 -57 20
1948 20 -108 4 -72 -108 -37 83 -130 -44 -15 127 58 61 53 -18 -57 -155 -3 16 -72 0 47 64 42 35 -86 -12 -119 68 147 59 4 -157
1668 -157 -118 -37 -16 -83 -114 -11 57 -125 25 0 -55 82 48 33 -28 -61 -16 -25 7 156 78 64 51 27 5 31 15 -21 -3 -3 1 24 112 86
1371 86 -79 -105 4 33 -38 75 -80 -7 -63 -7 -68 90 8 -3 -115 48 130 36 17 -67 -17 23 -61 -59 74 57 50 -100 -33 -151 -21
1100 -21 24 -77 19 26 59 41 -70 -73 -6 -57 25 -2 37 -33 -18 146 -95 39 40 -4 32 -57 145 96 52 84 -48 -110 -58 0 3 -12 59 179
802 179 85 -35 -34 26 -98 -19 6 24 4 67 66 -3 -99 72 9 -28 -4 -7 0 70 -66 -51 -11 -6 11 42 135 30 -140 -100 96 -2 -142 -95
505 -95 6 12 48 45 1 72 35 82 22 -127 -46 -68 -19 -14 43 77 34 135 -52 61 99 19 -71 -103 -27 4 -26 -59 -24 -75 49 88 163 49
207 49 72 37 -127 79 37 -12 -24 84 72 22 21 64 -32 -29 8 -40 -75 14 -31 27 15 -34 40 138 68 0 -10 -30 -120 -18 -10 32 51 -11 11
-99 11 -53 -48 -80 -31 -5 2 -20 -59 -48 -18 7 -32 93 94 -10
-230a0
##PAGE=	F1=7955.78
##FIRST=	23146.756194512010552,	4241.1435120000014649,	-0.1079371720552444458
##DATA TABLE=	(F2++(Y..Y)), PROFILE
4241 6 9 3 -31 27 -53 16 43 87 26 -26 -44 -2 35 108 -75 -118 12 29 80 30 56 1 -31 -9 -70 17 -31 87 5 69 2 -1 13 120 44
3935 44 20 -45 -71 14 146 34 -64 9 38 81 89 77 -22 -23 -48 67 -104 -8 27 85 41 -59 -82 202 -44 139 58 -60 -13 -133 -48
3664 -48 205 133 -15 28 69 57 16 26 39 62 -159 26 -15 59 -29 -121 113 51 -17 -32 -88 -62 -67 -41 33 13 21 23 -84 135 -40 49 56
3375 56 61 59 105 22 23 -14 16 -62 134 56 -45 -145 -38 -8 5 -32 -24 82 0 49 113 45 63 76 -2 -46 105 22 -9 30 114 76 137 80
3077 80 108 35 73 -85 19 -89 26 24 141 125 -14 7 -5 11 -68 23 -51 14 -133 55 5 84 19 2 2 35 17 61 -114 -104 -5 -141
2797 -141 126 -70 -21 39 31 59 80 35 -49 -60 -55 25 132 -47 2 45 94 16 -45 -35 10 -82 8 -51 -40 -76 -88 10 -12 17 -8 75 14 49
2500 49 -59 5 -51 -24 -51 63 -48 -81 -53 -9 23 70 -176 -29 19 -37 -57 30 49 43 10 56 38 -152 56 110 155 37 66 90 -36
2229 -36 56 15 -22 116 112 54 94 116 -39 57 103 123 -217 -67 -85 -65 -79 6 69 7 56 18 62 112 -21 2 4 -53 4 -1 -53 39 -106 15
1931 15 -95 -82 -26 48 -125 -29 0 128 96 1 40 -41 -99 -204 -12 25 -44 24 72 56 51 33 -36 -21 -91 109 140 74 -20 -118 -89 -10 -16
1642 -16 -73 -147 -45 72 -125 -5 -15 -57 36 29 52 -38 -96 57 -19 10 171 81 79 32 -28 33 54 25 -31 -18 -2 19 15 141 62 -64 -23
1353 -23 -6 -8 -49 76 -73 17 -87 21 -35 35 -4 -27 -96 68 104 40 3 -17 12 22 -22 -39 77 58 41 -113 -17 -131 -30 -7 -79
1082 -79 38 -20 70 23 -74 -114 0 -68 15 -69 42 -19 -11 142 -57 27 38 12 65 -69 117 114 60 117 -56 -116 -78 5 41 2 56 171
802 171 67 -29 -34 72 -51 -46 11 51 -22 45 44 -20 -86 75 7 -42 -50 -20 49 66 -111 -9 35 43 -17 48 195 64 -109 -90 71 -45
522 -45 -100 -80 1 4 13 17 6 82 22 135 69 -110 -53 -55 -40 -47 -21 69 4 112 -51 113 84 44 -42 -85 -46 -11 -49 -70 -38 -125 11 102 163
216 163 28 67 64 -93 81 43 1 32 57 76 1 50 68 -20 -14 74 -67 -84 30 -55 -20 13 -35 46 123 110 66 15 -34 -66 -47 -57 32 49
-82 49 11 9 -17 -11 -29 -17 -55 -25 -72 -62 -14 -39 15 -4 83 93 -20
-230b0
##PAGE=	F1=7861.43
##FIRST=	23146.756194512010552,	4241.1435120000014649,	-0.071274675428867340088
##DATA TABLE=	(F2++(Y..Y)), PROFILE
4241 -7 -21 9 -60 24 -25 10 63 86 22 -45 -18 -17 22 173 -26 -130 5 53 53 24 41 26 -19 -3 -25 15 -67 99 42 43 38 53 42 81 29
3935 29 6 -25 -58 44 147 32 -98 -16 11 116 82 57 -28 -30 -58 59 -116 -50 -38 33 63 -44 -58 189 -69 111 70 -45 8 -99
3672 -99 -12 168 100 -57 -6 34 59 -34 -6 45 35 -145 28 -9 64 -69 -134 75 12 -43 -20 -80 -39 -52 -31 68 43 22 80 -77 116
3401 116 -69 62 37 117 95 113 44 46 -20 -12 -82 110 -11 -69 -106 -43 -17 -3 -53 3 73 6 89 80 57 71 76 -28 -63 61 -23 37 28 96
3104 96 48 88 122 71 17 68 -61 34 -72 74 48 127 63 -41 -34 -10 15 -71 16 -55 57 -128 55 59 106 34 6 -61 22 47 46 -90 -108
2815 -108 38 -128 125 -82 -62 47 -8 5 90 47 -38 -54 -35 36 56 -52 10 37 61 37 -51 -3 8 -92 0 -46 -51 -64 -90 -6 -66 -6
2535 -6 -17 102 53 23 -59 14 -25 -21 -28 55 -66 -81 -50 -5 3 43 -143 -90 3 9 -53 46 87 40 -2 26 48 -142 47 90 158 82 50 99 -34
2229 -34 49 -9 -24 149 134 67 111 135 -98 0 60 126 -170 -85 -70 -50 -31 15 84 7 50 -34 67 89 -10 2 9 -26 24 -43 -63 44 -67
1940 -67 20 -107 -53 -25 17 -110 -21 17 104 111 -42 16 -59 -103 -225 -34 31 13 27 69 44 50 26 12 -63 -38 130 93 52 -54 -78 -31 23
1651 23 -14 -46 -173 -53 66 -108 -31 -12 -31 7 0 57 -50 -106 102 -33 21 138 42 71 18 -41 25 56 26 -47 -45 -8 50 -11 123 23
1371 23 -51 30 -9 -53 -49 60 -40 16 -95 58 25 -29 2 -37 -52 48 65 42 -3 27 29 7 29 -11 67 62 27 -88 17 -97 -19 -19 -50
1082 -50 37 -52 64 12 -54 -125 9 -63 4 -128 63 -16 -25 121 -10 -5 23 21 77 -87 84 137 55 113 -71 -128 -65 21 79 25 78 157
802 157 44 8 -33 94 -12 -42 4 57 -17 10 19 -27 -44 54 -1 -49 -86 -8 88 86 -131 51 77 61 -36 64 224 107 -51 -72 46
531 46 -66 -34 -73 -24 7 -13 3 7 88 32 168 97 -86 -49 -32 -63 -77 -67 39 -48 84 -26 132 57 54 -8 -62 -79 -36 -68 -61 -21 -156
242 -156 -38 73 134 1 53 71 -46 65 21 -4 67 12 73 -2 85 63 -10 -23 119 -65 -38 68 -77 -35 -6 -50 39 80 139 118 43
-29 43 -24 -19 -63 -92 25 43 34 -1 30 1 26 -2 -85 -33 -105 -42 8 -51 12 4 59 62 -33
-230c3
##PAGE=	F1=7767.08
##FIRST=	23146.756194512010552,	4241.1435120000014649,	-0.052088569849729537964
##DATA TABLE=	(F2++(Y..Y)), PROFILE
4241 -27 -56 -2 -84 13 10 -11 73 91 32 -74 15 -5 7 216 6 -107 12 72 13 11 -7 22 0 6 6 20 -55 99 60 15 58 97 73 42
3944 42 -15 -29 -13 -39 63 122 70 -119 -34 -12 116 55 33 -16 -4 -50 36 -91 -74 -39 -32 65 -31 -51 128 -92 74 55 -35 30 -66 17
3664 17 120 62 -80 -17 3 33 -47 -38 47 4 -110 56 33 75 -78 -121 38 -25 -59 -4 -45 -20 -54 -53 81 77 12 120 -69 62 -107
3392 -107 57 0 153 129 109 39 49 -29 -45 -104 83 -79 -72 -62 -41 -11 1 -70 20 63 -8 100 61 58 61 79 -29 -81 2 -82 68 27 61
3104 61 39 33 145 33 -3 37 -28 53 -60 93 39 93 10 -40 -88 -25 5 -79 28 -37 89 -103 42 98 104 29 3 -126 -8 90 -7
2832 -7 -63 -105 67 -109 76 -84 -77 29 -54 -42 100 76 -21 -41 -14 14 -7 -59 23 15 8 36 -57 37 11 -80 -5 -21 -31 -45 -75 -60 -115 -48
2535 -48 -26 123 62 -2 -52 24 2 5 5 49 -63 -78 -45 -15 -4 7 -76 -112 -17 34 -24 80 115 54 1 -1 58 -119 23 53 142 101 42 89
2237 89 -30 51 -18 -22 125 126 79 122 123 -123 -55 13 99 -107 -66 -65 -26 19 14 72 0 25 -113 53 52 -4 12 2 -7 53 -71 -86 36 -13 20
1931 20 -102 -19 -34 3 -79 -37 27 59 106 -63 -12 -58 -74 -211 -60 30 69 16 44 24 52 2 42 -107 27 135 32 9 -88 -64 27
1660 27 53 -18 -16 -183 -31 42 -82 -46 9 16 19 -38 21 -61 -87 118 -61 21 64 -16 42 11 -15 -18 49 17 -69 -80 -18 74 -40 67 -25 -51
1362 -51 38 -1 -94 -48 27 11 -4 -81 87 92 -70 22 -27 -5 -5 18 36 -14 49 26 -9 59 4 59 61 24 -51 48 -87 -10 10 2 7 -47 43 9
1047 9 -19 -102 17 -31 10 -160 93 -31 -52 92 22 -29 3 25 48 -92 70 139 46 72 -88 -133 -22 42 103 56 117 142 24 60 -36
776 -36 94 11 -3 -5 42 10 -32 7 -20 8 23 -7 -47 -101 13 92 118 -119 115 90 38 -55 92 217 148 9 -61 34 -53 23 -73 -43 27
487 27 -14 7 6 93 57 174 96 -52 -28 -20 -85 -100 -74 10 -101 49 1 100 18 42 20 -48 -102 -59 -67 -41 12 -160 -67 25 80 -31 45 53 -8
181 -8 39 -16 -28 76 -39 62 9 104 50 -24 -57 131 -33 36 113 -79 -24 -32 -76 35 41 155 143 66 -8 6 -59 -99 1 44 51 -8 65
-108 65 -3 63 2 -74 -1 -106 -11 10 -38 3 -2 55 14 -41
-230d1
##PAGE=	F1=7672.72
##FIRST=	23146.756194512010552,	4241.1435120000014649,	-0.081827305257320404053
##DATA TABLE=	(F2++(Y..Y)), PROFILE
4241 -48 -80 -33 -92 4 36 -45 68 97 47 -99 26 21 11 226 7 -68 31 79 -13 -3 -63 -8 21 8 31 14 -8 80 53 -2 61 115 94
3952 94 26 -73 -56 -12 -3 71 96 143 -103 -41 -28 89 19 16 5 41 -23 18 -43 -68 16 -90 44 -23 -52 47 -104 29 29 -33 41 -43 36 68
3655 68 26 -80 -2 -15 1 -17 -57 41 -16 -78 92 86 74 -60 -95 40 -36 -54 11 -6 -17 -75 -90 76 103 0 139 -60 6 -130 28
3384 28 -37 151 153 87 5 14 -27 -64 -115 43 -122 -66 -38 -36 6 25 -72 20 62 -35 71 43 39 34 81 -5 -92 -57 -129 63 30 28 47 -15 143
3077 143 0 -13 3 8 72 -48 65 -3 63 -8 -6 -125 -53 -21 -72 61 -23 106 -74 26 102 93 26 -1 -163 -36 130 -85 -54 -93
2815 -93 72 -92 20 -75 -61 -9 -88 -76 95 113 -11 -43 0 -24 -27 -58 26 -18 -51 15 -60 72 23 -55 0 8 -1 -28 -50 -129 -144 -92 -25 124
2517 124 37 -36 -46 30 14 38 29 40 -34 -73 -38 -31 7 -19 -1 -74 -19 38 8 116 116 68 14 -16 59 -109 2 29 114 95 66 73 -22 65 3
2211 3 -20 52 85 85 118 84 -95 -84 -28 57 -47 -16 -85 -12 47 0 35 -9 -2 -170 36 19 0 24 -23 -13 77 -72 -114 9 25 11 -88 15
1913 15 -51 4 -33 -65 28 3 89 -71 -34 -36 -37 -158 -79 24 99 9 10 2 58 -43 50 -118 95 131 -7 -27 -110 -79 67 70 -27 2 -175
1625 -175 6 11 -51 -53 43 69 62 -77 -52 -63 -53 116 -91 -3 -26 -64 1 10 23 -69 51 -7 -86 -104 -23 72 -61 0 -68 -65 10 17 -128 -49
1327 -49 -14 58 -26 -46 98 140 -67 37 2 32 -73 -32 32 -31 55 -4 -22 47 -1 59 51 42 -31 64 -113 -24 78 56 -36 -7 11 2 9 -61
1030 -61 16 16 33 -162 117 -55 -74 65 32 -18 -13 27 -7 -76 74 104 48 16 -108 -122 31 64 95 91 145 120 3 93 -50 87 26 56
750 56 -10 10 37 -68 15 3 47 -6 -5 -27 -96 25 59 141 -91 169 81 -5 -89 117 184 170 45 -63 36 -6 49 -72 -30 54 4 22
470 22 7 98 76 158 72 -16 0 -21 -96 -112 -42 -3 -130 16 23 37 -27 17 45 -44 -103 -68 -45 -32 43 -140 -61 -9 27 -56 49 18 6 16
172 16 -49 -52 71 -85 38 30 95 41 -65 -100 116 8 92 146 -66 -8 -51 -96 47 26 162 153 76 4 19 -34 -75 -29 48 61 0 74 -11
-117 -11 75 -6 -26 61 -81 11 4 3 -1 -15 81 -21 -38
-230c8
##PAGE=	F1=7578.37
##FIRST=	23146.756194512010552,	4241.1435120000014649,	-0.32189732789993286133
##DATA TABLE=	(F2++(Y..Y)), PROFILE
4241 -62 -85 -76 -83 3 37 -81 47 96 53 -97 3 50 47 208 -22 -36 49 72 -10 -5 -95 -44 34 -3 49 -9 45 48 29 -6 55 101 93 40 -124
3935 -124 -46 -19 46 75 87 210 -48 -36 -35 49 -12 15 29 78 16 16 1 -33 90 -120 6 -16 -47 -16 -93 -12 15 -29 35 -30 47 20 0
3646 0 -72 24 -22 -18 32 -54 24 -21 -57 106 123 58 -37 -74 89 -19 -32 26 10 -26 -95 -114 60 105 -11 139 -57 -18 -122 -17 -50 111
3366 111 163 54 -39 -45 -7 -69 -101 -12 -130 -67 -38 -29 22 62 -58 4 75 -51 18 21 -2 -10 69 31 -95 -100 -152 20 40 11 52 -53 120
3077 120 -25 -4 -3 40 78 -30 9 -54 50 3 36 -124 -78 -65 -37 94 -28 104 -52 18 80 92 41 -1 -149 -36 154 -150 -66
2824 -66 -70 61 -76 0 -57 -25 -56 -96 -93 60 133 -19 -64 12 -61 0 -47 14 -50 -93 -17 -56 90 45 -28 18 28 22 -13 -25 -180 -155 -119 -15
2526 -15 98 -3 -78 -49 22 10 60 35 20 6 -62 -35 -44 34 -25 54 -1 1 29 29 137 86 65 20 -17 48 -118 -1 33 77 80 109 56 -19 85
2220 85 44 -16 -37 24 88 98 31 -28 -79 -51 15 -9 35 -118 -20 40 -27 -12 -15 -18 -168 27 7 0 29 -64 -41 90 -45 -134 -39 32 -13 -75
1922 -75 48 -81 5 18 -80 18 -54 68 -78 -40 -7 -16 -71 -81 23 97 19 -20 -11 56 -101 50 -88 147 131 -11 -39 -113 -99 85 67
1651 67 -34 7 -147 43 -13 -20 -59 79 115 112 -106 -129 -48 -26 108 -116 -48 -108 -79 -41 19 46 -96 65 -45 -83 -103 -11 38 -78 -52
1380 -52 -89 -83 -19 41 -143 -50 -44 74 -28 -2 93 157 -30 30 35 60 -133 -75 47 -45 64 -55 -37 2 -20 60 27 75 -35 71 -152
1108 -152 -55 147 86 -65 41 -29 -11 15 -24 6 55 58 -140 127 -72 -75 50 31 30 -19 29 -51 -50 82 40 65 -20 -125 -99 68 84 50
828 50 120 135 80 -21 86 -79 85 44 100 -13 -30 42 -91 37 39 52 -26 6 6 -80 19 8 132 -69 204 73 -38 -133 115 138
566 138 159 42 -72 40 54 42 -69 16 71 25 29 10 105 78 125 40 9 21 -23 -89 -108 11 -5 -130 -1 38 -17 -72 0 69 -44 -90
286 -90 -65 -9 -40 55 -105 -37 -18 -3 -59 64 -9 0 5 -65 -54 70 -113 -3 45 66 48 -118 -132 90 33 99 150 -50 4 -53 -86 74
6 74 23 157 163 66 11 33 4 -26 -49 49 67 26 61 -6 74 -27 35 117 -48 13 9 59 5 -29 115 -24 -30
-230c0
##PAGE=	F1=7484.01
##FIRST=	23146.756194512010552,	4241.1435120000014649,	-0.40183758735656738281
##DATA TABLE=	(F2++(Y..Y)), PROFILE
4241 -63 -69 -116 -59 15 14 -105 21 84 44 -60 -37 80 104 171 -54 -22 56 50 10 14 -96 -61 34 -19 55 -43 78 22 7 4 43 60 69 63 -156
3935 -156 0 -24 95 79 87 229 20 -23 -38 13 -30 29 52 80 55 30 21 14 141 -111 -38 0 -28 -41 -61 -39 22 -10 14 -22 51 -16 -14 -65
3637 -65 36 -24 -29 64 -30 0 -18 -48 76 133 40 -24 -74 156 4 -2 37 -8 -34 -98 -107 42 80 -18 120 -59 -3 -86 -62 -31 54 162 28
3349 28 -70 -88 19 -67 -56 -65 -109 -79 -46 -20 22 92 -33 -17 96 -40 -26 1 -62 -66 33 61 -92 -117 -146 -42 54 16 37 -87 81 -41
3069 -41 21 31 54 61 -9 -33 -79 48 21 54 -90 -81 -120 5 105 -46 79 -33 21 53 110 69 6 -86 -6 153 -175 -96 -41 49 -58
2797 -58 28 -38 11 -91 -77 -90 3 119 -38 -89 27 -86 42 -30 -5 -60 -89 -49 -48 88 72 -4 39 32 39 5 -3 -195 -156 -123 -6 49 -39
2509 -39 -112 -56 0 3 64 28 -12 40 -39 -41 -49 66 -14 76 52 22 11 39 136 42 47 14 -17 32 -132 9 50 28 69 133 38 -33 103 75 -15
2202 -15 -107 -36 94 68 -18 43 -51 -51 -17 -3 58 -141 -44 8 -55 -55 -16 -21 -106 28 17 -5 20 -103 -64 96 -5 -139 -86 13 -53 -67 78
1913 78 -117 0 67 -67 -4 -105 46 -88 -27 12 -30 27 -67 33 80 38 -42 -5 37 -150 56 -41 164 140 8 -21 -96 -96 93 42
1651 42 -31 3 -102 71 -25 4 -65 106 151 149 -119 -170 -19 -23 94 -136 -86 -163 -51 -77 38 44 -90 79 -85 -53 -80 13 -12 -92 -79
1380 -79 -82 -83 -25 59 -120 -47 -46 52 -3 32 82 144 5 0 56 80 -169 -97 83 -43 81 -102 -63 -43 -29 45 -10 104 -46 80 -167 -71
1100 -71 181 84 -56 72 -74 -29 0 -3 -5 60 63 -103 126 -74 -54 46 25 91 -8 30 -56 -25 84 -26 85 -15 -119 -71 76 106
837 106 -16 135 81 25 -43 41 -120 86 61 89 -21 -67 27 -99 60 77 29 -37 28 37 -53 1 -28 88 -64 216 84 -37 -162
583 -162 76 91 122 6 -73 38 100 26 -62 67 67 29 22 10 113 66 74 11 14 32 -10 -69 -86 57 -1 -115 3 51 -33 -102 0 96 -38
295 -38 -87 -61 20 -58 46 -71 -19 -4 -5 -33 80 -13 -19 7 -72 -24 80 -115 -50 40 31 71 -160 -136 66 25 64 130 -45 23 -33 -41 102
6 102 9 131 174 45 13 47 49 30 -52 47 71 62 46 11 72 -44 82 125 -20 -10 34 100 25 -41 126 4 -23
-230b3
##PAGE=	F1=7389.66
##FIRST=	23146.756194512010552,	4241.1435120000014649,	-0.18123938143253326416
##DATA TABLE=	(F2++(Y..Y)), PROFILE
4241 -47 -39 -136 -32 36 -15 -109 2 70 24 -6 -70 118 152 127 -64 -21 51 13 21 48 -73 -50 18 -28 42 -66 77 19 5 25 26 7 38
3952 38 68 -160 62 -21 119 86 80 189 70 -14 -41 -11 -34 54 71 46 81 56 18 50 154 -69 -85 27 0 -37 -27 -46 42 22 -11 -9
3672 -9 44 -47 -16 -57 23 -30 -46 54 6 -21 -21 -43 4 128 35 -19 -93 204 10 24 37 -51 -39 -82 -89 30 39 -25 92 -54 37 -39 -86 10
3375 10 6 158 33 -69 -77 38 -60 8 -83 -68 -87 -42 -16 6 93 -5 -32 112 -2 -43 -7 -119 -125 -15 74 -87 -106 -117 -99 73 31 5
3095 5 -116 31 -40 55 94 40 31 1 -42 -64 40 26 34 -43 -53 -169 25 84 -63 38 -6 28 33 137 86 17 -1 31 131 -158 -133 -19
2815 -19 43 -43 81 -20 31 -103 -42 -64 -41 70 -55 -97 40 -96 69 -13 -23 -37 -31 -65 -42 79 99 9 50 27 51 30 20 -175 -152
2544 -152 -107 -5 -6 -60 -117 -56 -25 6 52 18 -55 51 -10 -51 -44 88 0 66 55 16 -12 47 114 4 32 -4 -27 20 -128 25 56 -31 65
2255 65 109 22 -63 117 75 -22 -133 -78 98 40 -50 86 -17 -35 -39 -21 40 -139 -68 -28 -74 -81 -13 -15 -15 31 33 -12 7 -120 -57 94 17 -129
1957 -129 -97 -9 -95 -62 107 -144 -12 100 -34 -41 -145 20 -92 -1 13 -73 108 -49 50 66 50 -52 22 10 -168 70 -9 136
1712 136 144 26 15 -66 -61 101 2 -16 -5 -50 85 -26 12 -65 120 171 170 -113 -157 13 -46 76 -145 -91 -186 9 -96 59 24 -70
1450 -70 74 -111 0 -53 37 -52 -96 -87 -62 -57 -2 62 -56 -39 -20 3 36 44 76 113 9 -36 60 89 -175 -90 119 -29 88 -117 -91 -56
1170 -56 -12 9 -53 111 -51 91 -142 -48 171 55 -14 68 -111 -37 -22 1 -16 21 40 -62 123 -60 -19 40 10 127 18 29 -29
916 -29 -2 83 -69 91 27 -76 -40 65 127 -68 132 6 -24 -44 -10 -161 82 67 10 -43 -91 4 -96 79 105 7 -44 56 46 -18
653 -18 -17 -28 26 -67 204 104 -7 -147 13 51 78 -41 -52 31 107 22 -50 92 43 17 13 8 123 53 10 -7 3 34 18 -44 -54 75 8
365 8 -97 24 60 -8 -107 15 117 -25 -104 -62 35 -67 24 -56 -20 16 3 6 89 12 -37 9 -77 27 95 -100 -77 15 1 92 -179 -104
85 -104 47 -7 17 102 -49 61 6 16 116 -28 77 169 28 15 54 88 79 -45 50 63 93 43 32 70 -46 97 71 -3 -49 64 102
-187 102 47 -45 97 46 -20
-230b0
##PAGE=	F1=7295.31
##FIRST=	23146.756194512010552,	4241.1435120000014649,	-0.080431655049324035645
##DATA TABLE=	(F2++(Y..Y)), PROFILE
4241 -16 -4 -132 -14 58 -37 -96 -3 67 -1 30 -75 163 160 82 -46 -21 37 -30 -2 75 -41 -29 -9 -20 18 -67 52 42 25 43 1 -40
3961 -40 20 39 -129 105 -14 108 94 59 120 79 -21 -44 -30 -28 78 80 4 77 87 7 59 141 -15 -129 55 26 -37 -10 -34 61 56 -28
3681 -28 16 28 -72 -7 -33 -3 -43 -78 4 43 -33 -38 -32 -83 128 39 -8 -111 211 -8 40 18 -92 -52 -63 -85 28 2 -32 65 -25 81
3401 81 1 -90 58 -17 155 72 -40 -13 39 -39 69 -51 -17 -76 -23 -25 -11 56 32 -37 106 42 -40 -6 -154 -168 -52 65 -79 -76 -71 -132
3121 -132 96 36 -27 -131 -29 -21 88 152 0 7 -4 -24 -29 13 18 0 -6 -9 -193 4 42 -63 -1 35 26 16 159 72 22 68 49 94 -118
2832 -118 -164 -12 36 -35 115 -6 24 -92 -6 -23 -42 11 -63 -87 38 -96 65 4 -25 10 58 -57 -35 78 114 5 48 20 59 60
2570 60 51 -129 -137 -76 -5 -42 -67 -89 -41 -40 26 40 8 -101 43 19 -56 -24 95 1 37 19 -22 -34 55 74 -17 28 -28 -43 16 -102 34 42
2272 42 -92 57 45 13 -87 133 44 -39 -108 -87 87 24 -54 88 1 -20 -42 -46 -4 -117 -78 -57 -72 -88 -7 -3 65 24 33 -7 8 -102 -20
1983 -20 82 1 -111 -56 -12 -115 -54 132 -147 -29 109 -1 -87 -172 -11 -82 28 1 -113 154 -42 55 68 47 -52 62 -2 -148
1738 -148 79 -7 71 123 26 54 -33 -1 118 -33 2 -17 -10 84 -25 -1 -54 115 164 178 -93 -102 38 -81 60 -132 -64 -176 77 -99
1476 -99 67 0 -65 45 -115 58 -42 48 -58 -76 -84 -49 -19 31 49 32 -32 13 -47 74 29 75 72 -18 -62 62 81 -155 -59 121 -21
1205 -21 69 -91 -101 -26 27 -38 -84 85 -48 95 -94 2 139 9 31 37 -125 -31 -37 -4 -27 -44 4 -26 124 -33 13 30 -24 122 52
933 52 31 -1 32 85 -81 78 83 -2 -2 54 139 -77 109 -55 -46 -19 -45 -189 70 54 -108 -75 -100 -16 -93 91 116 13 -49 84 34 19
653 19 -33 6 -25 -63 176 104 30 -80 -47 22 50 -78 -10 33 69 34 -28 79 8 1 22 10 131 41 -56 -16 -7 35 50 -23 -24 64 35 -78
356 -78 38 65 39 -85 30 115 -8 -130 -67 35 -60 -3 -67 -30 29 2 40 88 54 -51 0 -74 79 109 -79 -69 -18 -20 90 -179 -49
85 -49 22 -43 -11 81 -54 112 59 55 106 -78 9 130 26 18 53 112 105 -35 57 32 107 52 41 60 -32 79 -17 3 -84 76 63 60 -33 45
-213 45 80 -22
-230b2
##PAGE=	F1=7200.95
##FIRST=	23146.756194512010552,	4241.1435120000014649,	-0.064667321741580963135
##DATA TABLE=	(F2++(Y..Y)), PROFILE
4241 20 25 -112 -9 66 -45 -82 3 78 -23 33 -54 196 128 45 -20 -15 18 -67 -62 73 -9 -25 -38 -1 -1 -50 23 74 46 46 -27 -67 21 -11 -60
3935 -60 107 -12 70 101 39 60 55 -44 -49 -52 -14 87 75 -13 36 112 -1 40 116 29 -158 60 30 -63 -11 -16 72 80 -26 51 13 -85 13 11 -20
3629 -20 -53 -111 -62 65 -36 -64 -12 -151 138 40 8 -108 178 -43 44 -11 -107 -86 -60 -102 40 -14 -34 50 23 110 24 -82 98 -18
3366 -18 149 124 -2 70 28 -4 103 11 37 -42 4 -48 -16 -4 86 -34 69 73 -38 -3 -158 -182 -53 43 -65 -39 -14 -133 118 18
3104 18 -51 -126 -86 11 111 177 -50 5 -20 0 -5 -35 7 -6 5 28 -179 -42 1 -41 -18 86 14 -10 170 34 17 104 35 45 -82 -171
2824 -171 -17 20 -30 112 0 -3 -67 22 17 3 -29 -60 -76 13 -86 45 21 -11 60 132 -31 -15 89 112 -16 35 12 55 81 74 -69 -104
2544 -104 -40 6 -40 -62 -44 -14 -39 59 42 0 -135 30 49 -45 10 86 -18 10 -14 -75 -42 61 25 -27 30 -50 -41 17 -69 30 19 -141 31
2255 31 -17 18 -82 144 -5 -59 -47 -67 51 17 -23 65 -3 -18 -23 -58 -45 -91 -73 -74 -46 -82 0 16 108 -2 7 20 34 -55 27 56 -51 -95
1957 -95 13 10 -95 -39 145 -127 -47 94 18 -130 -184 -46 -54 50 -12 -115 166 -47 43 88 39 -48 92 12 -101 70 -30 -2 69
1703 69 11 75 -2 62 146 -45 16 -37 1 63 -31 -32 -37 91 121 175 -61 -34 51 -108 59 -94 -29 -138 120 -98 49 -20 -86 2 -102
1432 -102 101 -56 42 -30 -33 -73 -56 11 54 27 110 -35 34 -76 96 0 74 29 -51 -63 76 54 -117 -24 78 -33 32 -37 -77 26
1170 26 65 -80 -90 31 -47 89 -52 41 114 -39 44 3 -113 -19 -45 -22 -43 -115 -26 -4 123 2 34 19 -70 85 82 41 2 87 89 -77
890 -77 54 123 67 46 57 131 -44 78 -81 -33 16 -58 -196 55 33 -214 -107 -100 -38 -97 94 116 44 -50 106 22 47 -51 54 -47
627 -47 -42 145 67 48 10 -79 6 48 -85 37 48 1 46 2 41 -26 -4 56 24 124 25 -104 -22 -3 34 65 -10 -10 51 86 -50 25 65 87
330 87 -42 34 81 3 -143 -63 28 -42 -32 -95 -36 31 -17 54 76 88 -60 -27 -48 109 112 -64 -38 -44 -33 55 -168 4 -13 -59 -16 63 -60
41 -60 151 113 62 77 -113 -45 58 30 14 50 110 104 -13 59 -23 96 56 35 33 -17 37 -96 4 -99 59 5 55 0 1 89 -30
-230c0
##PAGE=	F1=7106.6
##FIRST=	23146.756194512010552,	4241.1435120000014649,	0.18593893945217132568
##DATA TABLE=	(F2++(Y..Y)), PROFILE
4241 49 44 -91 -14 49 -43 -78 21 91 -32 12 -23 191 84 21 -9 -1 -7 -81 -135 41 18 -47 -51 13 -8 -31 8 97 41 31 -55 -68 24 -53 34
3935 34 68 -18 27 103 40 33 28 -72 -59 -80 8 70 61 3 -32 120 -3 6 87 51 -158 27 2 -110 -12 0 80 91 -6 79 19 -79 42 66
3637 66 -11 -45 -116 -119 62 -34 -86 14 -178 145 31 19 -82 121 -70 39 -34 -94 -135 -80 -112 59 -16 -27 45 70 118 28 -77 123
3375 123 -9 134 156 22 128 20 32 102 63 84 1 29 -73 -7 -60 150 -33 9 75 -45 -1 -143 -170 -19 21 -50 -12 39 -109
3121 -109 127 -16 -73 -103 -118 47 117 162 -82 26 -32 20 -5 -96 1 30 -2 49 -129 -81 -22 -7 -6 129 1 -40 167 -1 0 110
2859 110 0 -14 -63 -139 -19 -4 -13 85 -5 -39 -43 38 38 57 -42 -55 -84 -28 -68 31 38 9 84 144 -8 25 105 97 -47 19 0 38 86 69 -3
2552 -3 -58 -14 35 -5 -47 -8 13 -30 93 65 -12 -144 27 79 -22 51 67 -51 0 -17 -113 -32 61 -20 -41 22 -59 -7 21 -45 8 7 -168
2264 -168 -13 -39 33 -42 134 -54 -74 22 -39 -2 7 33 40 -27 -31 8 -47 -56 -74 -58 -74 -4 -68 3 46 109 -44 -39 69 73 -2 63 22 -113 -86
1957 -86 63 40 -46 -16 137 -102 -60 72 30 -158 -179 -76 -15 61 -24 -71 155 -54 21 119 43 -42 93 42 -48 40 -59 -46 -1 -4 71
1686 71 22 111 182 -28 18 -62 -8 23 -38 -67 -19 55 53 150 -25 16 58 -110 70 -41 -13 -82 111 -100 10 -28 -118 -34 -85 121 -86
1415 -86 32 16 12 -57 -72 28 57 5 145 -52 38 -75 107 -22 67 -8 -65 -38 106 18 -73 -1 12 -59 13 19 -25 70 75 -103 -75 -32
1135 -32 -49 72 -29 39 100 -76 9 -17 -86 -15 -55 -56 -71 -168 -43 -3 107 44 37 19 -103 42 96 50 -11 148 84 -75 38 134 97
863 97 100 71 99 2 64 -66 8 37 -64 -185 50 23 -257 -124 -103 -63 -110 80 108 71 -39 118 29 60 -77 85 -38 -6 116 7
601 7 32 76 -74 2 71 -55 71 64 -67 39 34 0 -48 0 97 48 93 5 -117 -37 11 28 61 -8 -8 63 149 -11 -12 58 115 10 24 26 6
295 6 -130 -44 18 -32 -61 -120 -34 22 -48 54 63 95 -62 -66 5 107 98 -54 -7 -51 -38 3 -154 35 -54 -51 -13 36 -71 153 154 53 38 -118
-3 -118 -64 -18 28 -1 52 78 81 29 45 -82 61 39 18 -5 -17 -12 -131 2 -93 19 -38 38 50 -18 69 -43
-230d3
##PAGE=	F1=7012.25
##FIRST=	23146.756194512010552,	4241.1435120000014649,	0.22214211523532867432
##DATA TABLE=	(F2++(Y..Y)), PROFILE
4241 60 45 -74 -16 8 -36 -81 52 88 -22 -6 -1 131 60 12 -23 12 -41 -67 -184 -2 38 -83 -45 17 -11 -27 6 100 5 9 -71 -56 13
3952 13 -58 130 8 -22 -1 93 62 32 21 -85 -70 -107 29 30 41 31 -101 110 3 -24 49 52 -128 -36 -45 -149 0 11 83 96 24 81
3672 81 46 -53 68 109 16 -16 -77 -151 35 -35 -95 38 -165 133 25 8 -47 61 -71 32 -35 -74 -181 -115 -83 73 -18 -13 41 91
3410 91 108 16 -78 126 -2 104 144 27 134 23 54 75 75 106 35 45 -83 7 -80 197 -39 -48 52 -46 0 -125 -145 23 4 -40
3147 -40 -6 71 -72 119 -51 -104 -74 -112 69 102 121 -77 57 -23 39 -11 -149 4 94 -15 57 -64 -79 -27 22 16 149 1 -52 149
2885 149 -12 -23 102 -34 -79 -64 -77 -8 -27 24 59 -17 -71 -28 42 35 76 -39 -55 -102 -63 -46 35 50 25 70 81 -6 74 112 81 -67 4
2596 4 -19 16 75 26 50 -13 -11 67 36 -27 8 26 -30 118 105 -33 -122 37 105 4 77 44 -74 8 4 -123 -11 59 -47 -66 -2 -46 49
2307 49 24 -30 -29 8 -168 -67 -11 52 10 83 -92 -78 67 -26 -56 -15 89 30 -51 -53 32 -18 -33 -70 -38 -57 40 -49 -3 77 77 -86 -87 115
2010 115 94 33 83 -8 -146 -86 54 50 3 9 113 -89 -64 70 42 -161 -152 -86 18 63 -35 -13 129 -45 9 147 69 -36 65 64 -7
1738 -7 5 -78 -35 -55 -13 46 40 131 218 3 4 -79 -16 -23 -34 -88 -6 22 -7 96 3 39 63 -85 83 -2 -23 -22 54 -99 -25 -27 -140 -51 -73
1432 -73 120 -110 32 60 35 -36 -68 39 49 -13 128 -80 30 -51 117 -20 52 -36 -57 3 138 -10 -30 7 -39 -77 38 67 28
1178 28 84 49 -108 -63 -85 -46 52 -20 0 80 -89 -59 -20 -61 -23 -65 -95 -102 -195 -48 -15 71 80 30 30 -97 10 90 44 -21 185 64 -82
890 -82 38 117 76 139 81 50 32 83 -21 63 25 -77 -156 63 45 -218 -111 -112 -82 -124 49 91 61 -13 119 55 61 -103 90 -11 30
618 30 81 -42 -3 87 -41 12 108 7 76 64 -111 14 50 -28 -51 1 110 63 41 -8 -93 -66 24 19 49 -18 -4 103 193 28 -51 32
338 32 112 59 9 -26 0 -88 -11 5 -43 -84 -125 -31 7 -73 52 60 66 -53 -104 64 76 64 -41 4 -44 -36 -38 -142 37 -85 -32 -19 -6 -87
41 -87 117 170 50 -5 -97 -46 -66 17 -29 48 25 47 86 18 -113 14 2 -1 -40 -35 -54 -120 0 -81 -27 -49 21 101 -21 22 -57
-230e7
##PAGE=	F1=6917.89
##FIRST=	23146.756194512010552,	4241.1435120000014649,	0.073686204850673675537
##DATA TABLE=	(F2++(Y..Y)), PROFILE
4241 51 32 -56 -8 -38 -28 -77 96 54 0 -5 4 33 60 6 -52 19 -76 -32 -186 -33 45 -107 -28 11 -26 -40 6 84 -41 -6 -71 -49 -12 -20
3944 -20 191 -47 -9 -13 68 86 41 33 -74 -74 -117 38 -11 17 41 -133 92 22 -37 1 43 -87 -97 -89 -158 16 21 78 100 50 48 74 -16 82
3646 82 126 40 17 -9 -153 1 -36 -95 51 -132 101 36 -23 -21 12 -40 25 -16 -66 -202 -144 -10 68 -34 -3 29 84 93 -4 -79 101 2
3366 2 63 90 24 98 34 53 39 52 91 49 51 -75 16 -54 198 -54 -79 14 -25 2 -114 -121 44 -5 -36 -26 65 -40 98 -69 -140 -48 -70
3077 -70 76 69 74 -35 82 8 59 5 -175 22 148 -10 69 -9 -36 -22 36 25 143 22 -29 115 1 -48 90 -54 -128 -74 -18 9
2815 9 -43 72 50 -28 -92 -24 32 19 46 -38 -59 -102 -75 -21 50 53 25 24 -21 -20 107 103 68 -66 -2 -40 6 53 -37 78 16 -36 80 59 -4
2509 -4 15 18 -46 126 144 -61 -80 44 117 24 71 25 -70 25 24 -121 2 62 -41 -93 -30 -11 99 28 -13 -72 9 -147 -108 47 63 46
2229 46 -4 -112 -81 75 -39 -91 -49 113 36 -53 -77 25 11 6 -73 -13 -29 72 -27 -17 100 38 -106 -119 122 75 43 100 -26 -135
1966 -135 -87 -9 24 21 33 90 -87 -60 100 52 -128 -104 -71 31 64 -44 7 83 -15 20 151 103 -29 23 65 14 -15 -77 21 -75 -20 14
1686 14 42 116 239 26 -21 -76 5 -52 -5 -83 0 9 -35 21 10 43 65 -43 88 2 -46 26 -12 -75 -32 -27 -136 -46 -64 107 -112 49
1406 49 93 24 -12 -29 52 42 -31 81 -105 22 -16 130 4 29 -46 -44 47 152 -23 8 12 -56 -74 101 105 58 72 2 -104 -73 -114 -29
1126 -29 30 -16 -43 40 -75 -130 -15 -53 -35 -63 -118 -118 -190 -48 -29 26 93 21 40 -58 -12 64 13 -19 178 28 -88 51 78 23 141 77
846 77 -4 28 126 39 118 -7 -93 -108 94 98 -115 -64 -124 -81 -124 15 59 10 22 110 80 63 -112 79 18 55 31 -54 -36 45 0 30 144
557 144 78 50 42 -115 -10 45 -47 -40 -6 78 56 -8 -3 -49 -102 22 14 39 -41 14 143 188 56 -66 -18 75 89 -4 -57 -4 -26 26 -10 -71
260 -71 -95 -113 -28 -4 -83 54 76 13 -35 -126 93 37 15 -25 0 -32 -31 -50 -131 24 -89 -20 -42 -50 -99 68 154 57 -53 -69 -13 -68 7 -54
-38 -54 24 -29 6 129 -6 -97 -27 -33 -21 -62 -55 -76 -87 -4 -81 -63 -32 17 133 -28 -37 -67
-230f7
##PAGE=	F1=6823.54
##FIRST=	23146.756194512010552,	4241.1435120000014649,	0.15858739614486694336
##DATA TABLE=	(F2++(Y..Y)), PROFILE
4241 33 12 -31 8 -71 -21 -63 135 -3 24 10 -1 -67 58 -15 -82 21 -96 4 -145 -37 34 -106 -18 6 -59 -54 -4 56 -73 -12 -52
3970 -52 -57 -30 42 196 -78 23 -13 33 91 50 46 -44 -59 -104 27 -32 -13 19 -105 76 51 -30 -49 30 -66 -116 -103 -133 18 29 62 102 65
3681 65 0 75 16 83 122 43 34 49 -129 -18 -30 -92 50 -100 66 67 -56 -8 -23 10 19 3 -75 -187 -151 73 40 -59 -9 12 63 83 -21
3392 -21 -75 53 13 19 22 30 49 46 38 9 21 42 46 47 -63 16 5 149 -70 -78 -22 14 7 -109 -99 37 -14 -30 -58 23 -26 74 -70 -161 -27
3086 -27 -18 77 26 40 27 91 49 80 46 -168 52 168 17 93 16 21 -16 35 11 118 54 13 71 14 -63 74 -53 -143 -83 3 16 -53 106
2797 106 57 -32 -100 -26 13 10 -4 -48 -57 -65 -65 6 58 43 4 -33 -111 -25 108 83 53 -44 5 -57 17 28 -85 80 29 -78 61 49 17 30
2500 30 2 -68 117 160 -85 -39 34 114 35 40 16 -39 32 24 -124 0 66 -6 -103 -41 32 120 32 9 -99 0 -111 -120 102 60 50 -99 -116
2211 -116 -90 54 -67 -100 -78 88 45 -21 -103 -17 25 40 -67 11 -1 83 -1 -24 107 13 -92 -131 78 19 34 119 -30 -94 -74 -90 -28
1940 -28 0 47 83 -84 -53 142 49 -60 -44 -35 20 67 -45 -32 20 26 48 121 122 -23 -11 50 21 -11 -55 92 -68 -31 -9 21 69 231 26
1651 26 -57 -53 59 -45 46 -55 2 17 -28 -51 -7 49 56 0 84 -24 -65 49 -45 -11 -5 -40 -112 -24 -55 87 -91 71 112 -4 10 31
1371 31 59 43 -47 37 -110 15 12 134 31 0 -36 -39 79 136 -16 36 24 -49 -53 163 131 54 56 -40 -93 -106 -118 1 3 -17 -58 -5 -44 -176
1073 -176 -11 -63 -32 -34 -107 -102 -152 -48 -32 -5 69 10 32 -19 -37 26 -33 -15 128 -11 -82 63 25 -20 93 55 -57 -3 163 98 162 -37
793 -37 -92 -42 129 157 4 5 -132 -61 -96 0 12 -54 59 89 85 72 -90 67 41 62 -16 -25 -45 -17 24 48 165 129 4 10 -80 -20 30 -60
496 -60 -28 -22 19 31 -34 15 -12 -129 3 17 33 -70 47 150 129 64 -45 -87 13 90 -17 -60 2 38 59 -23 -98 -84 -100 -23 -7 -74
216 -74 56 107 -41 -16 -122 77 7 -27 -11 -1 -21 -25 -34 -117 14 -66 -25 -70 -73 -90 34 110 58 -94 -43 8 -38 9 -58 -25 -69 -40 128
-73 128 -12 -43 -52 -43 -45 -67 -56 -66 -63 -16 -94 -81 -9 30 133 -49 -91 -66
-230f6
##PAGE=	F1=6729.18
##FIRST=	23146.756194512010552,	4241.1435120000014649,	0.010866111144423484802
##DATA TABLE=	(F2++(Y..Y)), PROFILE
4241 17 -1 -1 24 -74 -12 -46 146 -61 33 26 -11 -133 28 -65 -106 26 -88 26 -82 -24 10 -91 -23 13 -96 -55 -27 23 -79 -20 -21
3970 -21 -79 -25 96 147 -75 58 -12 0 75 57 43 -13 -27 -70 7 -22 -52 -19 -31 68 75 -14 -85 15 -81 -75 -80 -90 -2 29 40 93 71 -30
3672 -30 34 34 76 113 32 28 70 -89 -10 -14 -95 41 -80 53 100 -74 1 -49 52 10 5 -83 -140 -127 126 0 -76 -32 1 38 83 -18 -62
3384 -62 0 32 -13 -32 54 14 59 21 -8 1 -14 39 35 -62 7 67 74 -76 -56 -52 48 13 -102 -71 19 -18 -5 -80 -29 -35 47 -60 -150 -10 15
3077 15 88 -15 23 85 81 84 91 81 -141 80 156 58 123 11 59 -15 34 -16 88 80 45 32 1 -60 54 -38 -120 -83 -20 5 -65 108 70 -27
2780 -27 -95 -22 -12 22 -37 -57 -41 0 -48 39 48 20 -28 -81 -154 0 87 71 26 -11 32 -69 48 6 -90 65 33 -112 21 20 29 58 -1 -76
2482 -76 98 138 -86 -13 7 104 38 12 20 -2 19 4 -133 -17 56 35 -81 -26 64 109 35 31 -98 -16 -66 -99 127 37 29 -159 -106 -101 30
2194 30 -88 -90 -89 28 47 32 -127 -77 20 54 -38 29 14 74 24 -13 94 13 -45 -123 0 -40 20 129 -24 -44 -38 -144 -79 -41 48 94 -69
1905 -69 -49 156 20 28 10 5 -5 75 -30 -111 -40 58 80 58 108 -22 -26 33 22 10 -19 137 -56 -49 -16 -13 10 191 9 -96 -28 111 -6
1616 -6 103 -17 5 35 -7 -94 -33 70 34 28 77 -63 -70 47 -20 80 30 -70 -85 3 -48 63 -64 86 113 -28 29 82 43 42 -56 16
1336 16 -84 0 20 114 41 -36 -11 -36 95 96 5 49 41 -43 -28 191 133 28 54 -58 -72 -140 -112 35 -27 -30 -35 -28 -18 -186 -8 -83 -6 21
1038 21 -66 -51 -90 -45 -16 -9 11 -5 0 -14 -67 -16 -75 -22 64 -45 -65 66 -33 -28 9 25 -93 -41 162 136 185 -40 -64 28 150 191 90
750 90 72 -131 -47 -42 15 -29 -101 88 55 66 85 -40 56 46 55 -30 17 -34 -69 14 54 168 140 -45 -13 -27 -13 24 -69 -27 -28 -24 8 -30 30
443 30 -5 -133 -20 29 21 -97 81 115 41 53 -3 -140 -50 70 -28 -41 26 85 77 -30 -105 -54 -103 -14 0 -45 48 132 -78 -5 -90 29
163 29 -4 -45 -10 12 -11 -26 -8 -88 17 -28 -35 -88 -62 -54 23 54 40 -106 -15 8 -8 15 -31 -78 -86 -90 83 5 17 -56 -24 -73 -60 -29 -27 -62 -39
-160 -39 -104 -82 -1 52 102 -79 -119 -49
-230d9
##PAGE=	F1=6634.83
##FIRST=	23146.756194512010552,	4241.1435120000014649,	-0.17128217220306396484
##DATA TABLE=	(F2++(Y..Y)), PROFILE
4241 6 -2 21 32 -50 2 -35 114 -94 20 34 -16 -153 -24 -129 -119 35 -53 25 -25 -14 -16 -80 -31 36 -110 -38 -53 -4 -69 -36 7 -101
3961 -101 -7 105 70 -41 68 -16 -22 54 60 23 4 -1 -29 -5 12 -88 -53 49 61 74 -6 -92 -2 -117 7 -40 -48 -33 15 22 68 76 -15 -33
3664 -33 38 66 114 21 20 58 -41 19 6 -104 29 -72 68 112 -78 15 -73 67 2 -19 -77 -70 -80 132 -32 -71 -59 5 9 89 9 -41 -36
3375 -36 56 -31 -59 85 -1 73 4 -12 -3 -49 38 16 -75 -9 102 13 -63 -31 -69 54 18 -90 -35 9 -4 45 -74 -56 -55 25 -44 -109 0
3086 0 18 112 -47 17 117 55 94 89 77 -120 85 126 85 142 -16 56 -20 43 -38 59 82 42 13 -38 -39 38 -14 -79 -74 -60 -12 -80 85 84 -17
2780 -17 -76 -3 -38 56 -32 -50 -5 61 -38 75 28 -12 -64 -104 -152 47 72 83 -10 22 74 -74 82 -11 -60 46 34 -118 -18 -4 25 90
2500 90 12 -56 75 79 -56 -2 -23 95 34 9 34 10 -15 -25 -132 -32 21 53 -35 4 66 85 41 43 -74 -30 -20 -53 118 -2 6 -156
2220 -156 -86 -101 23 -87 -73 -82 -31 36 84 -143 -121 8 53 17 34 13 55 42 15 66 29 16 -99 -76 -73 13 112 -11 4 15 -153 -106
1940 -106 -79 32 108 -47 -44 114 -27 110 49 34 -34 84 4 -172 -71 67 99 -14 62 -27 -25 18 29 31 9 140 -53 -65 -10 -40
1677 -40 -31 133 -3 -130 -27 124 44 142 13 15 37 0 -92 -46 100 4 37 69 -95 -55 27 46 162 39 -104 -67 27 -45 40 -52 82
1406 82 91 -34 43 93 3 26 -54 12 -27 -23 3 66 29 -72 19 -18 95 44 35 45 54 -48 -9 175 103 6 68 -48 -38 -155 -112 62 -55
1117 -55 -53 11 -15 -12 -169 1 -106 34 84 -20 14 -21 -34 14 15 -56 -30 -39 -43 -96 -57 -88 -34 9 -68 -48 59 -82 3 -75 0 -100 -67 118
820 118 131 176 -19 -20 84 148 185 110 106 -120 -60 19 58 -42 -118 104 14 39 89 12 34 30 38 7 47 -18 -101 -31 44 161 111 -85 -22 19
522 19 -3 37 -71 -34 -10 -19 5 -10 19 -33 -113 -36 43 -5 -115 106 57 -42 27 34 -147 -88 47 -33 -11 56 94 68 -30 -81 -13 -118 -3
233 -3 8 -4 25 125 -95 -8 -40 -16 -5 -29 -25 39 0 -33 7 -39 29 9 -29 -80 -27 -3 28 8 12 -75 21 0 -2 14 22 -103 -85 -133 16 35
-82 35 54 -47 0 -103 -45 12 28 -77 -72 -89 -70 -11 73 58 -104 -113 -19
-230a9
##PAGE=	F1=6540.48
##FIRST=	23146.756194512010552,	4241.1435120000014649,	0.066579550504684448242
##DATA TABLE=	(F2++(Y..Y)), PROFILE
4241 -3 8 29 25 -18 26 -30 52 -93 -7 40 -10 -139 -63 -172 -125 37 -12 7 8 -15 -38 -87 -22 70 -81 -17 -70 -19 -57 -51 24 -114 -6 54
3944 54 -2 7 41 -23 -24 38 57 -4 3 -6 0 -3 55 -103 -68 95 43 48 -15 -71 -22 -138 90 -8 -11 -55 -9 7 31 84 37 -95 34 50 124 23
3629 23 38 39 4 55 17 -115 16 -73 101 98 -80 31 -97 54 6 -61 -60 8 -31 101 -37 -43 -78 21 -24 96 52 -16 -40 71 -39
3357 -39 -64 103 -11 79 -17 -4 -3 -44 46 -8 -89 -36 97 -11 -28 -4 -66 28 18 -69 -6 17 34 111 -43 -41 -62 44 -23 -63 2 0 140
3069 140 -63 9 116 25 71 72 33 -122 53 91 85 134 -48 16 -26 63 -48 36 61 10 20 -85 -7 33 5 -48 -63 -83 -14 -92 58 92
2789 92 -3 -45 28 -60 94 -4 -24 48 94 -38 100 11 -49 -92 -100 -126 86 78 118 -41 54 118 -68 101 -20 -29 21 33 -91 -39 -9 7
2509 7 110 28 -21 56 5 -4 3 -35 87 20 29 50 -11 -60 -55 -107 -32 -32 35 15 32 40 58 54 49 -51 -41 21 -4 87 -46 -4 -98 -68 -82 26 -67
2185 -67 -60 -68 -68 15 107 -148 -127 4 48 82 25 -3 35 48 46 29 39 72 -63 -116 -71 20 63 3 50 63 -130 -101 -102 5 104 -33 -35 26 -73
1878 -73 152 68 45 -55 88 44 -172 -61 53 97 -69 2 -32 -18 3 40 37 14 115 -50 -65 -4 -42 -32 73 0 -154 -54 89
1625 89 86 146 31 35 11 -10 -53 -35 117 -22 26 54 -112 -25 1 109 196 6 -124 -63 40 -45 28 -62 62 48 -27 47 67 -40 -12
1353 -12 -43 2 45 -51 -33 4 10 -95 47 21 81 -3 58 30 57 -52 5 135 44 10 80 -18 -2 -148 -129 73 -69 -72 68 18 -21 -134
1073 -134 22 -130 74 133 5 66 36 -13 46 52 -104 -58 -62 -80 -110 -92 -64 -32 -25 -78 -37 47 -107 52 -125 -8 -73 -75 53 78 131 7
793 7 13 103 125 148 67 91 -99 -100 65 101 -24 -119 97 -19 20 77 44 -4 -1 14 76 49 -11 -126 -88 23 154 61 -106 -27 43 0 63
505 63 -64 -37 34 34 18 3 -17 -84 -82 -33 55 -38 -129 119 4 -94 -4 51 -100 -86 39 -27 20 74 66 28 -31 -33 20 -123 8 19 36 -9
207 -9 78 -96 -18 12 -34 -9 5 -50 59 4 -44 1 21 40 38 1 -47 13 33 34 -14 -5 -16 59 -1 -16 6 84 -83 -80 -159 -44 55 60 -32 0 -120
-117 -120 -20 48 80 -85 -104 -47 -55 -28 83 24 -114 -78 10
-230A0
##PAGE=	F1=6446.12
##FIRST=	23146.756194512010552,	4241.1435120000014649,	0.26731792092323303223
##DATA TABLE=	(F2++(Y..Y)), PROFILE
4241 -15 22 19 3 -1 56 -23 -9 -70 -33 49 9 -115 -53 -164 -122 19 13 -14 17 -21 -48 -110 10 105 -15 -18 -73 -20 -52 -49 26 -117 -45 -43 -48 49
3926 49 -13 -26 -8 27 45 -31 -17 -48 7 0 89 -86 -67 90 12 19 -38 -37 -37 -118 130 6 28 -58 -38 -10 -3 89 93 -123 28 26 128 31 85
3620 85 36 42 78 11 -124 -1 -75 130 70 -85 39 -115 32 25 -100 -50 77 -2 57 -10 -11 -89 36 -49 100 86 3 -22 67 -48 -59
3349 -59 96 -23 62 -48 10 -7 -3 61 -32 -89 -70 60 -1 22 32 -44 -9 14 -41 0 30 92 160 -6 1 -39 133 0 -36 -7 -14 162 -59
3060 -59 -6 92 2 19 46 -15 -137 -4 56 64 95 -73 -39 -33 85 -51 19 30 -22 43 -113 24 32 8 -42 -56 -73 5 -95 46 82 12
2780 12 -10 63 -71 116 18 4 106 96 -43 96 7 -81 -107 -74 -94 86 93 156 -48 80 145 -47 93 -20 -23 -13 26 -41 -39 5 -12
2509 -12 101 18 -2 39 -47 42 9 -20 70 -4 49 63 -57 -102 -79 -65 -21 -81 -5 55 42 8 29 73 55 -47 -56 51 28 52 -77 -4 -30
2220 -30 -65 -48 17 -43 -57 -61 -84 -9 92 -147 -96 14 41 132 10 -28 19 42 64 0 28 101 -21 -113 -54 38 4 12 90 79 -99 -74 -118
1931 -118 -26 77 -36 -18 -62 -91 136 72 43 -67 82 68 -110 -27 26 74 -90 -48 -27 -16 -9 47 25 -3 87 -32 -45 -3 -18 6 21
1660 21 17 -164 -93 34 108 114 43 60 -34 -28 -7 -15 107 -42 4 27 -115 5 -18 129 174 -47 -122 -65 42 -40 30 -83 31 -2 -19 36
1380 36 24 -59 -61 -29 -32 111 -64 -74 -47 -3 -96 67 68 52 -42 58 15 57 -39 18 95 -17 44 72 15 13 -131 -156 64 -68 -67 124 43
1091 43 -22 -85 44 -153 97 162 8 85 71 11 67 79 -114 -72 -54 -95 -102 -115 -15 -8 -45 -73 -31 29 -100 82 -124 8 -28 -66 0
820 0 -1 66 19 19 82 93 109 0 38 -69 -141 80 115 2 -126 61 -37 8 45 45 -47 -32 -14 122 32 -10 -157 -126 8 149 12 -108
540 -108 -41 44 4 88 -52 -26 90 101 34 1 -59 -133 -52 -14 68 -59 -142 123 -34 -106 -34 50 -29 -52 49 -13 42 67 25 -34 -33 20 38
251 38 -96 27 36 59 -41 6 -89 -21 55 -15 -22 37 -73 54 -7 -48 -24 74 42 59 40 -3 46 38 43 -8 -1 30 77 15 -29 4 131 -34 -79
-55 -79 -159 -89 48 49 -17 -29 -111 12 62 112 -67 -118 3 -38 -36 75 11 -106 -36 27
-230B7
##PAGE=	F1=6351.77
##FIRST=	23146.756194512010552,	4241.1435120000014649,	0.19196879863739013672
##DATA TABLE=	(F2++(Y..Y)), PROFILE
4241 -19 27 1 -29 -11 75 -11 -48 -48 -40 60 41 -96 1 -106 -113 -15 18 -31 15 -16 -46 -137 48 128 63 -52 -70 -18 -55 -20 23 -109 -110 -151
3944 -151 -60 64 -68 -17 20 16 28 -55 -46 -97 0 -10 104 -44 -56 53 -25 17 -57 -14 -44 -65 114 15 77 -51 -64 -33 -25 82 115 -111
3664 -111 23 6 105 27 128 54 62 83 0 -125 -25 -81 139 49 -84 36 -117 19 46 -114 -58 113 -4 14 35 2 -103 39
3419 39 -47 104 100 15 1 45 -64 -50 69 -35 12 -82 22 -12 42 71 -46 -69 -98 10 24 76 87 -7 -38 4 -6 -18 30 146 164 16
3139 16 42 12 265 16 -33 -23 -15 178 -38 -16 63 -7 -41 20 -32 -137 -54 26 50 40 -83 -90 -36 98 -58 7 7 -38 68 -113 46
2867 46 21 -12 -53 -52 -42 33 -95 52 49 25 20 83 -67 107 21 19 154 84 -52 60 10 -101 -106 -36 -60 46 88 169 -28 93 142 -14
2587 -14 64 -13 -42 -50 13 12 -25 20 -13 61 -25 -20 23 -58 59 9 15 44 -36 51 67 -100 -129 -84 -32 -14 -99 -37 79 35 -5 -8 86 66 -65 -82
2272 -82 60 35 28 -80 -3 3 -83 -16 -16 -27 -60 -68 -103 -35 50 -147 -54 28 22 153 0 -55 5 34 66 -7 -1 99 9 -79 -48 63 -32 5 110
1966 110 57 -77 -38 -142 -53 37 -53 -5 -105 -69 77 73 38 -77 64 70 -26 3 0 34 -79 -75 -6 -24 -12 36 0 -23 71 2 -9 -2 12 60
1668 60 -22 28 -161 -118 0 110 58 62 83 -74 -36 16 -11 77 -53 -17 -9 -106 19 -27 93 120 -84 -99 -65 41 -26 40 -95 -3 -39
1397 -39 -18 4 -14 -42 -95 -20 -84 151 -49 -106 -76 -10 -77 75 97 7 -65 30 7 68 -11 28 68 -56 92 36 40 0 -116 -175 35 -57
1117 -57 -32 171 44 6 -29 52 -171 101 176 3 69 81 36 67 80 -88 -65 -19 -86 -70 -119 29 26 -57 -52 -23 3 -72 65 -92 43
846 43 5 -51 -34 -68 10 9 0 31 64 88 -49 -26 -30 -159 64 86 0 -148 -4 -41 -6 4 32 -66 -47 -43 110 10 -5 -188 -127 13 135
557 135 -20 -91 -64 40 16 101 -43 -8 133 143 41 -11 -80 -159 -26 9 82 -52 -152 111 -67 -83 -52 43 20 -17 65 0 43 41 10
286 10 -90 -34 56 40 -34 61 74 54 -59 -57 -76 -8 83 31 -40 55 -79 21 -38 -33 -53 101 41 69 61 27 71 8 57 19 14 31 64 42 -24
-20 -24 23 149 10 -83 -131 -125 8 39 3 -66 -72 49 57 116 -18 -110 39 -15 -30 48 11 -84 -1 23
-230B3
##PAGE=	F1=6257.41
##FIRST=	23146.756194512010552,	4241.1435120000014649,	0.072284147143363952637
##DATA TABLE=	(F2++(Y..Y)), PROFILE
4241 -1 22 -14 -65 -39 65 -2 -59 -43 -26 67 78 -87 56 -33 -100 -39 13 -39 15 1 -33 -160 62 129 124 -105 -73 -23 -66 24 26 -86 -164
3952 -164 -225 -47 51 -101 5 52 12 12 -76 -70 -109 -5 -40 93 6 -41 21 -55 51 -54 -19 -48 -8 59 31 130 -46 -84 -52 -32 59 89
3672 89 -75 23 -1 48 1 134 78 60 72 0 -112 -51 -90 122 44 -67 25 -100 18 50 -93 -72 102 -32 -27 77 -12 -134 25
3419 25 -11 106 93 23 12 21 -85 -38 35 -38 -60 -100 23 -13 62 67 -42 -33 -107 -31 49 115 145 26 -52 -10 28 -36 7 171 116 22 58 75
3121 75 360 18 -42 -35 -9 190 -9 -4 46 -10 -82 2 -7 -103 -69 8 64 -5 -82 -124 -33 99 -69 -2 -1 -37 85 -92 51 -6 -45 -65 -45
2832 -45 -8 44 -94 68 2 25 37 74 -48 67 16 8 181 69 -65 11 12 -108 -90 -3 -19 -9 47 139 0 87 107 19 30 -3 -64 -68
2552 -68 1 51 -2 14 15 -2 -80 -69 6 -31 40 0 50 17 -61 38 61 -117 -131 -58 -24 -25 -79 -35 91 24 5 -49 79 75 -89 -111 46 24
2255 24 17 -54 -4 -13 -112 0 -63 -17 -65 -86 -142 -55 3 -141 -27 34 -15 148 -1 -81 -11 39 63 13 -34 73 17 -39 -67 82 -30 -24 95
1966 95 13 -63 -4 -178 -67 3 -66 -8 -85 -17 8 79 37 -84 37 58 37 16 -20 -12 -52 -78 24 -38 -3 2 -37 -21 65 40 23 11 30 101
1668 101 -52 22 -153 -115 1 91 -1 96 95 -83 -28 12 -31 46 -54 -24 -45 -83 6 -23 26 67 -80 -62 -58 46 -2 42 -81 -37 -50 -26
1388 -26 -45 -44 -7 -94 -16 -126 158 -10 -124 -84 -20 -49 66 94 -41 -65 -12 9 93 10 25 51 -60 122 -16 46 -32 -99 -166 -8 -50
1117 -50 16 196 27 62 25 37 -171 98 184 4 36 72 54 54 55 -45 -39 23 -69 -21 -102 43 53 -56 -20 -16 -30 -39 -3 -63 78 4 -35
828 -35 -59 -93 -6 -8 -25 -32 44 82 -58 -74 8 -150 32 23 -43 -173 -85 -42 -34 -25 30 -42 -40 -62 50 -4 12 -199 -97 33 105 -34 -63 -84
531 -84 48 37 100 -43 -1 142 142 42 -23 -73 -152 0 25 100 -19 -149 74 -105 -44 -50 37 27 -12 75 -1 17 18 37 -110 -30 62 33
251 33 35 108 132 33 -58 -89 -58 15 96 89 -52 64 -61 -24 -72 0 -69 104 46 66 43 23 90 -35 74 54 24 -11 31 64 -13 52 135 22
-47 22 -83 -80 -150 -52 37 32 -76 -16 76 46 97 46 -85 51 18 -20 8 5 -55 22 2
-230B
##PAGE=	F1=6163.06
##FIRST=	23146.756194512010552,	4241.1435120000014649,	-0.14312586188316345215
##DATA TABLE=	(F2++(Y..Y)), PROFILE
4241 39 14 -22 -90 -60 23 -4 -60 -54 0 64 108 -91 68 14 -81 -19 18 -37 22 15 -15 -169 40 109 149 -143 -89 -33 -77 62 34 -40 -172
3952 -172 -242 -20 23 -102 42 73 24 4 -81 -73 -69 4 -77 60 42 -29 12 -69 99 -24 -51 -60 26 -1 52 169 -45 -101 -50 -26 27 33 -38
3664 -38 31 -3 -31 -40 95 99 38 53 20 -81 -71 -99 86 50 -35 20 -70 13 27 -47 -72 55 -65 -64 95 -47 -180 1 41 102 81 38
3384 38 5 9 -99 -23 1 -26 -131 -88 13 -7 44 42 -18 2 -96 -54 63 122 179 45 -58 -32 55 -25 -28 156 41 19 59 127 361 7
3104 7 -48 -38 -10 194 15 35 43 -10 -85 -8 32 -40 -45 3 103 -24 -70 -136 -21 87 -70 -12 -4 -37 88 -62 40 -42 -66 -65 -35 16 24
2815 24 -95 86 -37 8 41 37 -26 14 24 -17 187 55 -77 -20 6 -107 -67 9 23 -55 -15 74 10 64 54 41 10 4 -71 -56 -2 63 28
2526 28 -18 65 -66 -114 -116 -6 1 7 -13 71 0 -63 22 41 -99 -108 -6 -34 -49 -33 -2 91 16 29 -79 45 78 -104 -125 13 8 14 -14 -6 -54
2220 -54 -123 0 -93 -2 -67 -105 -191 -65 -23 -118 -27 24 -63 125 0 -102 -33 69 63 49 -61 44 0 -10 -104 85 2 -66 48 -22 -52
1948 -52 19 -208 -70 -15 -65 -33 -25 40 -36 93 42 -84 0 48 59 19 -24 -52 -27 -65 49 -52 5 -33 -80 7 60 65 41 43 28 117 -58
1660 -58 1 -140 -91 19 50 -44 140 96 -57 -13 -4 -58 35 -38 -11 -69 -50 -20 -11 -38 30 -39 -14 -45 59 22 30 -46 -65 -40 -46 -95 -71 18 -56
1353 -56 -16 -130 141 35 -129 -83 -39 -23 33 63 -77 -40 -39 17 117 12 9 34 -37 112 -64 30 -62 -72 -120 -60 -60 51 181 6 124
1082 124 66 7 -146 101 183 13 10 59 68 37 19 -8 -6 49 -65 30 -70 14 68 -38 6 -20 -59 -13 -89 -60 93 -24 -16 -91 -77 20 -15
793 -15 -40 -92 31 71 -35 -91 35 -127 2 -47 -100 -185 -154 -53 -67 -24 51 11 -18 -64 -10 -14 38 -179 -58 47 64 -36 -34 -85 76
522 76 61 89 -49 -15 115 111 45 -26 -50 -122 32 22 120 23 -128 9 -145 -12 -28 32 6 -42 76 -26 -30 18 86 -88 -22 36 25 79
242 79 151 191 15 -46 -86 -42 35 96 136 -51 74 -27 -61 -86 37 -69 93 61 54 -1 -17 102 -65 79 78 19 -62 7 70 -18 66 95
-38 95 0 -73 -14 -159 -110 41 67 -49 32 79 45 62 99 -57 52 59 -23 -25 -16 -31 40 -25
-230b5
##PAGE=	F1=6068.71
##FIRST=	23146.756194512010552,	4241.1435120000014649,	-0.45084649324417114258
##DATA TABLE=	(F2++(Y..Y)), PROFILE
4241 89 11 -23 -95 -53 -30 -13 -61 -63 18 47 119 -111 27 14 -57 45 38 -30 28 4 -4 -160 3 77 137 -134 -117 -31 -74 78 39 27 -133
3952 -133 -211 6 0 -81 82 75 52 3 -55 -53 -3 23 -106 11 50 -31 17 -65 130 26 -91 -80 38 -42 55 171 -45 -114 -21 -14 -4 -23
3672 -23 -14 43 -17 -105 -80 45 113 10 26 43 -37 -73 -97 40 54 -1 26 -34 -7 -4 6 -47 8 -81 -92 87 -85 -219 -15 84 84 74 60
3384 60 -12 15 -91 -8 -32 -8 -179 -47 0 7 3 7 10 28 -79 -55 65 87 166 47 -61 -60 67 16 -61 115 -21 18 69 158 266 -5
3104 -5 -41 -33 -23 178 28 80 46 -9 -57 -22 52 19 2 5 139 -14 -49 -121 -5 64 -47 -19 -10 -50 79 -29 18 -65 -58 -59 -26 33 -13 -89
2806 -89 101 -55 -19 39 -15 -14 -27 54 -37 182 46 -74 -24 -6 -102 -47 -5 55 -78 -71 2 -8 33 7 46 10 9 -62 -26 0 50 63 -60
2517 -60 106 -101 -113 -130 -6 8 -16 -14 72 -2 -35 9 9 -56 -69 43 -33 -72 13 40 72 11 43 -87 -5 81 -106 -112 -23 -4 11 23 -8 -79
2220 -79 -89 -8 -85 23 -65 -110 -228 -63 -22 -69 -45 6 -102 88 -6 -116 -53 120 61 76 -85 24 -29 2 -142 67 42 -98 -7
1966 -7 -28 -38 28 -209 -68 -21 -54 -71 36 77 -50 110 47 -71 -45 43 47 27 -3 -72 -11 -49 60 -53 -5 -39 -117 42 54 69 40 79
1686 79 15 114 -31 -18 -123 -64 23 -3 -54 172 94 -14 -6 -1 -63 41 -9 14 -76 -17 -34 0 -72 6 8 42 -32 73 40 14 -9 -79 -24 -77
1388 -77 -123 -99 19 1 -16 -91 119 69 -123 -81 -58 -5 -18 25 -82 1 -29 28 114 -1 -14 14 -4 63 -91 0 -75 -36 -48 -108 -87 50
1108 50 123 -10 166 87 -22 -100 111 169 20 7 57 81 22 -12 0 26 46 -70 66 -36 -42 85 -8 6 -33 -62 8 -147 -77 79
846 79 -52 12 -132 -51 67 0 -39 -130 24 39 -10 -79 38 -104 -13 -96 -124 -173 -187 -75 -86 8 83 55 4 -52 -34 -25 59 -137 -24 35
566 35 27 -38 -11 -56 116 78 69 -48 -43 69 74 50 -17 -35 -87 63 0 135 56 -98 -66 -174 -9 7 26 -8 -88 71 -70 -81 44 122
286 122 -43 -20 -8 21 80 170 218 9 -35 -63 -38 38 78 154 -40 79 0 -75 -66 55 -61 79 79 44 -41 -79 98 -65 58 74 4
15 4 -80 8 59 -56 52 48 -33 -52 46 -146 -143 41 95 -6 50 55 52 21 117 -36 61 84 -47 -33 -42 -21 58 -48
-230d8
##PAGE=	F1=5974.35
##FIRST=	23146.756194512010552,	4241.1435120000014649,	-0.40033566951751708984
##DATA TABLE=	(F2++(Y..Y)), PROFILE
4241 122 16 -21 -78 -17 -68 -18 -64 -54 21 17 108 -143 -34 -20 -36 118 63 -23 25 -31 -16 -129 -17 48 104 -75 -140 -8 -41 74 29
3970 29 93 -76 -161 24 -10 -50 118 60 80 4 2 -19 40 30 -122 -38 31 -52 6 -52 129 76 -114 -97 44 -55 26 131 -44 -115 23
3699 23 0 -31 -54 -4 53 -54 -144 -97 19 120 -4 -6 49 0 -57 -73 0 50 23 42 1 -42 -18 45 -5 -4 -70 -104 68 -106 -223 -12
3419 -12 102 50 70 73 -35 34 -55 -3 -62 0 -194 9 -8 28 -25 -19 25 36 -73 -37 53 20 108 47 -59 -89 66 65 -75 69 -44 24
3139 24 103 163 84 -13 -19 -26 -37 130 30 96 39 -2 -20 -52 41 49 53 0 149 14 -25 -81 6 34 1 -12 -16 -68 63 6 -8 -60 -22 -58 -22
2832 -22 45 -42 -70 110 -49 -45 36 -62 -22 -42 89 -30 172 45 -47 -16 -23 -93 -38 -38 67 -78 -98 -41 -39 6 -14 44 22 9 -52 -5 0 22
2535 22 85 -87 116 -90 -94 -107 9 -25 -22 5 54 0 14 -10 -28 -1 -33 65 0 -76 34 67 37 6 36 -77 -51 94 -101 -74 -52 -15
2255 -15 2 49 -15 -68 -10 -12 -44 51 -60 -91 -233 -54 -8 -9 -60 -4 -115 37 -25 -124 -61 174 50 78 -114 21 -52 3 -163 40 73
1983 73 -100 -43 -4 -20 22 -174 -72 -30 -54 -105 70 76 -46 115 41 -45 -96 37 29 49 49 -65 -1 -37 58 -39 -39 2 -127 61 54 52 32
1695 32 97 5 100 16 -30 -96 -47 1 -49 -33 176 99 18 -19 36 -43 46 15 30 -71 7 -12 -1 -74 -13 36 93 -28 70 51 10 12 -73 -15
1397 -15 -113 -114 -120 0 60 -14 -30 110 84 -114 -76 -58 6 -75 3 -59 41 13 40 75 -7 -42 0 23 0 -91 -32 -73 0 22 -140 -118 14
1108 14 39 -22 179 88 -37 -51 115 146 21 28 80 96 5 -30 -27 62 20 -68 71 -16 -96 114 13 -23 -39 -27 33 -147 -92 41 -55 51
828 51 -162 -49 96 27 -25 -130 20 -7 -2 -48 17 -80 -17 -102 -92 -139 -179 -95 -76 46 105 60 19 -38 -26 -44 66 -98 4 -4 7 -44
548 -44 4 -1 151 82 39 -34 -65 26 47 50 1 -42 -60 84 -32 134 66 -80 -120 -180 -38 37 20 6 -119 59 -115 -120 80 124 -7 -28
268 -28 -55 23 42 160 190 7 -40 -38 -48 20 41 135 -24 64 0 -63 -16 41 -59 60 85 48 -50 -133 75 -45 16 38 -9 -56 31 45 -113
-20 -113 18 14 -53 -27 81 -120 -143 26 101 24 33 18 61 -17 95 -25 77 71 -83 -7 -48 -25 71 -56
-230e6
##PAGE=	F1=5880
##FIRST=	23146.756194512010552,	4241.1435120000014649,	-0.090834274888038635254
##DATA TABLE=	(F2++(Y..Y)), PROFILE
4241 121 21 -17 -51 23 -66 -13 -59 -17 14 -17 82 -166 -74 -60 -30 148 73 -20 16 -67 -55 -78 -9 28 74 7 -141 26 17 65 6 126
3961 126 -32 -115 36 -10 -20 143 43 82 4 73 10 35 13 -137 -79 0 -82 -40 -38 104 109 -102 -95 58 -46 -27 65 -50 -102 58 18
3690 18 -54 -58 0 53 -102 -141 -87 21 113 1 -38 34 9 -35 -35 -22 38 40 59 34 -74 -5 62 34 23 -37 -104 54 -102 -174 12 98 5
3401 5 65 60 -52 50 -8 -15 -79 -11 -187 63 -7 51 -16 -24 19 31 -76 -10 25 -56 31 61 -46 -110 56 83 -68 39 -28 38 152 138
3121 138 -188 -22 14 -19 -42 54 26 67 13 7 0 -98 12 46 97 -17 131 44 -1 -33 2 5 61 12 -13 -74 49 39 -29 -34 22 -59 -20 51
2824 51 -42 -42 103 -34 -53 27 -89 -42 -28 106 0 155 51 -9 -28 -40 -73 -35 -64 61 -57 -96 -40 -52 -12 -13 46 30 3 -48 -4 -11
2544 -11 -4 79 -81 92 -47 -82 -67 26 -84 -21 32 20 0 65 -44 -62 48 -16 56 58 -60 17 63 0 1 16 -62 -76 119 -92 -27 -63
2264 -63 -31 -13 61 -34 -33 81 -5 2 68 -56 -51 -209 -46 -5 31 -58 4 -103 -16 -51 -126 -56 213 38 58 -143 35 -52 3 -156 16
1992 16 89 -71 -40 38 -2 10 -118 -89 -49 -81 -126 70 38 -47 94 16 -18 -144 26 31 83 121 -40 12 -30 54 -17 -75 77 -102 52
1721 52 62 14 26 80 5 73 56 -39 -61 -39 -28 -64 2 150 112 25 -52 99 -19 27 13 17 -62 26 36 -20 -57 -27 33 121 -37 35 57 23
1423 23 17 -49 -15 -143 -71 -123 -24 108 -10 22 119 88 -105 -62 -34 8 -116 8 -23 62 62 51 14 12 -77 0 36 -49 -72 -46 -68 28 70 -144
1126 -144 -129 -30 -33 -28 170 77 -34 -17 97 124 18 57 126 110 -19 -36 -84 95 -13 -50 40 -15 -120 146 7 -62 -16 34 61 -96
863 -96 -87 -6 -32 89 -156 -77 88 55 -7 -94 18 -49 -10 -11 -16 -47 -13 -68 -25 -95 -144 -98 -46 53 105 29 27 -36 -14 -67 53 -81 31 -51
566 -51 4 -50 20 66 163 74 -2 -15 -66 -2 29 42 24 -68 -47 87 -63 110 59 -81 -124 -161 -85 39 15 51 -115 33 -144 -136 113 102
286 102 4 -40 -94 36 -6 136 116 -7 -64 -20 -67 -8 -9 90 -9 24 -36 -38 50 5 -71 34 66 69 -29 -153 41 -31 -29 -13 -16 -9 62 39 -150
-20 -150 -4 10 -41 -2 75 -100 -119 -10 79 30 -5 -12 61 -40 45 -23 84 17 -105 42 -20 -32 66 -46
-230d6
##PAGE=	F1=5785.65
##FIRST=	23146.756194512010552,	4241.1435120000014649,	0.12905970215797424316
##DATA TABLE=	(F2++(Y..Y)), PROFILE
4241 90 19 -12 -25 40 -29 -7 -37 36 16 -45 56 -153 -67 -82 -47 109 60 -24 9 -70 -103 -21 8 14 60 75 -105 52 81 62 -22 105 -10
3952 -10 -71 53 -8 2 158 42 45 -1 128 22 0 -16 -161 -101 -21 -97 -107 -34 70 118 -60 -68 78 -24 -77 5 -72 -80 62 41 -72
3681 -72 -49 3 41 -135 -108 -61 24 85 22 -56 12 -13 -21 -4 -17 26 58 72 62 -92 12 61 62 65 2 -94 47 -78 -86 47 85 -37 57 21
3384 21 -54 50 21 -45 -77 -40 -171 103 2 72 26 -12 3 24 -75 17 -13 -108 -33 93 -21 -114 36 54 -49 34 -5 63 192 94 -481
3112 -481 -34 53 -8 -47 -26 17 8 -34 13 -2 -142 -13 32 125 -41 100 67 18 1 -13 -11 110 48 5 -58 39 56 -41 -8 54 -52 -10
2832 -10 49 -20 -14 73 -17 -37 1 -87 -55 1 91 26 123 48 16 -72 -54 -41 -26 -56 44 -14 -82 -1 -28 -26 -5 52 27 -8 -45 -10 -29 -18 48 -52
2517 -52 54 -6 -84 -41 26 -140 -30 41 -26 -3 98 -80 -77 86 -16 36 109 -34 -32 37 -20 0 1 -52 -72 144 -78 14 -54 -49 -38 52
2237 52 -66 -8 143 12 27 64 -58 -11 -168 -39 -34 34 -38 29 -85 -47 -75 -122 -38 225 45 36 -156 66 -28 9 -119 4 99 -22
1975 -22 0 77 8 8 -65 -116 -71 -129 -138 49 -13 -56 47 -29 -2 -175 16 65 123 177 -13 35 -23 53 -4 -88 140 -49 30 73 -38 19
1695 19 29 11 30 62 -57 -27 -33 -40 -43 33 111 125 11 -90 153 -23 -18 -25 -26 -60 50 80 -55 -40 -27 5 116 -49 -25 59 36 14 -17 -24
1397 -24 -157 -15 -105 -43 138 -3 48 134 93 -100 -37 2 -5 -122 36 6 58 88 61 -39 55 -122 18 31 -74 -45 -35 -66 46 85
1135 85 -118 -108 -53 -67 -19 152 54 -12 -4 48 110 16 72 175 111 -47 -38 -143 113 -43 -24 -14 -24 -111 158 -25 -71 36 96 80 -30
863 -30 -69 -50 -6 104 -107 -109 54 73 9 -38 8 -71 -19 23 -42 -5 -5 -18 32 -55 -99 -84 -20 16 94 -1 35 -46 -20 -88 27 -75 54 -76
566 -76 8 -47 40 130 145 52 -49 -4 -44 -17 15 32 40 -92 -48 76 -87 65 47 -87 -77 -118 -123 -1 5 102 -77 -7 -145 -129 138 78
286 78 0 -47 -117 62 -39 119 33 -33 -95 -12 -83 -38 -59 41 4 -24 -92 -12 115 -29 -90 3 23 97 -5 -130 9 -48 -58 -52 -17 31
6 31 95 48 -134 2 37 0 19 37 -97 -86 -64 34 20 -45 -25 51 -44 -15 -32 69 -50 -94 92 30 -30 39 -22
-230b2
##PAGE=	F1=5691.29
##FIRST=	23146.756194512010552,	4241.1435120000014649,	0.28072029352188110352
##DATA TABLE=	(F2++(Y..Y)), PROFILE
4241 43 8 -7 -9 21 19 -12 -1 85 36 -52 39 -88 -19 -77 -80 21 30 -32 13 -31 -136 23 9 -2 63 104 -35 60 118 66 -48 37 -1 -20
3944 -20 80 -2 13 160 59 -19 -9 149 14 -24 -26 -191 -97 -8 -77 -154 -37 32 107 -13 -23 96 1 -91 -24 -111 -59 35 70 -81 -47
3672 -47 -2 22 -135 -67 -37 5 36 34 -50 4 -51 -18 2 12 23 79 83 81 -98 5 52 75 81 33 -77 36 -44 10 71 67 -63 46 -19 -34
3375 -34 31 15 -78 -62 -76 -152 123 18 91 79 2 -8 21 -60 36 -44 -113 -69 125 9 -98 8 -3 -27 45 -6 97 200 52 -609
3112 -609 -38 84 5 -68 -84 3 -45 -95 11 -22 -160 -22 26 131 -63 76 79 40 15 -27 -12 128 73 29 -22 28 44 -45 -4 62 -22
2841 -22 8 40 0 2 27 1 -9 -45 -63 -49 35 52 24 79 21 9 -123 -58 -6 -3 -9 19 37 -69 49 15 -43 -7 53 19 -23 -35 -4 -43 -15
2535 -15 15 -20 29 8 -91 -40 -1 -171 -55 22 -78 -6 107 -95 -68 113 -16 31 126 -13 -93 7 -20 0 0 -43 -50 154 -56 40 -30
2264 -30 -58 -64 17 -99 -10 150 40 22 41 -71 6 -122 -26 -94 1 -13 54 -79 -37 -90 -110 -18 215 86 25 -137 111 6 25 -60
2001 -60 0 108 30 55 96 8 23 -27 -139 -81 -168 -150 24 -47 -62 -10 -82 -3 -183 18 121 161 180 0 61 -15 51 -12 -68 151 6
1730 6 13 79 -90 0 -35 19 -18 32 -84 -8 -23 -20 -9 43 80 126 -8 -116 164 -59 -75 -83 -78 -66 83 93 -91 -33 -16 -33 90 -48 -87
1441 -87 59 25 13 10 -43 -153 34 -73 -50 145 0 45 140 97 -100 -8 26 -35 -87 71 27 35 76 71 -62 99 -171 43 9 -82 -24
1170 -24 -3 -57 59 70 -73 -63 -34 -58 6 130 23 27 -1 -19 103 12 59 196 93 -67 -35 -172 103 -69 -7 -74 -30 -88 134 -61
907 -61 -29 92 130 79 14 -55 -74 6 77 -33 -109 25 83 17 6 -16 -76 -19 47 -44 34 6 18 42 -26 -60 -62 -18 -40 92 1 52 -56 -39
610 -39 -99 5 -53 60 -73 7 -32 60 173 102 18 -87 -7 -6 -24 4 27 42 -88 -61 65 -103 17 44 -73 -1 -51 -128 -76 -16 138
338 138 -18 -49 -125 -110 161 67 0 -41 -115 94 -37 120 -23 -48 -115 -10 -88 -58 -88 13 21 -55 -141 9 164 -43 -104 -22 -22 111
76 111 -6 -73 -9 -88 -59 -55 -11 54 128 67 -60 35 75 53 34 -3 -102 -53 -117 -13 8 -67 -27 35 -33 -73 -52 34 -95 -47 120 75 -13 0
-222@R
-230I
##PAGE=	F1=5596.94
##FIRST=	23146.756194512010552,	4241.1435120000014649,	0.17027962207794189453
##DATA TABLE=	(F2++(Y..Y)), PROFILE
4241 -3 -1 0 -1 -15 58 -29 42 111 66 -38 25 16 43 -52 -106 -66 3 -38 26 28 -136 46 -15 -25 72 96 50 61 115 71 -70 -46 2 35 107 8
3926 8 8 149 83 -83 -20 138 0 -14 7 -212 -66 42 -29 -156 -43 -10 83 12 28 104 23 -58 -23 -157 -51 -5 101 -69 -57 -20
3664 -20 1 -108 -37 -20 -29 -20 22 -25 7 -77 -14 -10 53 28 94 96 83 -93 -35 43 75 48 44 -55 14 -8 78 72 41 -68 31 -36 6 3 -16 -94 -48
3340 -48 -109 -127 125 31 106 116 9 -13 19 -35 39 -50 -74 -79 135 37 -74 -25 -57 -8 63 -37 131 167 29 -467 -27 89 14 -107
3077 -107 -105 -13 -71 -151 5 -45 -146 -18 30 108 -80 63 74 66 18 -25 -2 115 69 36 22 8 4 -47 -26 41 26 28 27 5 4 -20 22 12 -108
2771 -108 -29 -31 66 6 -7 36 -27 -23 -142 -42 18 25 58 -12 74 -58 84 41 -64 -20 36 16 -36 -18 16 -41 0 3 -3 30 1 -91 -58 -48 -172
2465 -172 -83 -11 -126 -6 102 -76 -40 137 0 45 103 -5 -132 -9 -12 -8 0 -26 -23 143 -33 47 5 -48 -83 -37 -116 -37 113 74 5
2194 5 6 -93 0 -75 -1 -164 -45 4 66 -88 6 -95 -92 -3 191 153 21 -90 155 29 43 4 0 117 72 97 94 -7 44 1 -143 -69
1913 -69 -166 -158 1 -43 -53 -58 -120 -12 -168 35 173 193 119 -11 77 -9 39 -38 -27 105 45 13 79 -115 -31 -91 30 -50 -7 -106 -12 -9
1633 -9 21 11 35 66 106 -25 -118 117 -105 -121 -127 -112 -73 117 71 -115 -31 -8 -72 65 -18 -118 56 -12 15 27 -69 -137 67 -41 -44 128
1353 128 -5 22 126 95 -97 11 25 -73 -25 92 48 10 37 82 -50 119 -199 61 -20 -82 -18 29 -29 66 36 -31 -20 18 -24 40
1091 40 98 -7 76 8 -82 89 0 19 167 62 -70 -21 -151 69 -95 -9 -120 -22 -77 84 -74 48 121 130 59 25 -55 -70 4 10
828 10 34 -61 19 90 13 24 -57 -80 -13 57 -19 64 22 29 7 -12 -31 -47 -31 -78 106 37 79 -57 -53 -95 0 -3 44 -56 0 -12 71 188 47
522 47 -17 -102 -19 29 -21 -2 29 30 -48 -77 65 -114 -12 58 -34 65 31 -99 -156 -50 148 40 -73 -102 -91 182 69 11 -20 -84 121
251 121 -3 130 -39 -29 -107 -11 -77 -63 -87 9 37 -51 -164 30 186 -34 -102 -37 -49 97 -33 -5 -13 -118 -38 -25 1 64 158 82 31
-20 31 69 102 89 36 -17 -97 -22 -145 -42 -3 -64 -30 24 -25 -117 -76 -2 -100 8 118 89 5 -31 36
-230C6
##PAGE=	F1=5502.58
##FIRST=	23146.756194512010552,	4241.1435120000014649,	-0.13717128336429595947
##DATA TABLE=	(F2++(Y..Y)), PROFILE
4241 -42 -4 6 2 -45 85 -41 81 107 80 -15 0 122 95 -19 -103 -112 -7 -36 39 77 -102 54 -47 -51 76 78 118 74 82 72 -88 -111
3961 -111 4 72 112 21 -8 123 96 -114 -33 112 -4 19 71 -210 -16 110 10 -121 -43 -56 51 7 79 107 40 6 -7 -195 -58
3707 -58 -39 123 -34 -72 -42 -19 -72 -20 -7 -47 -70 -15 -2 3 -76 1 -16 81 35 89 113 65 -78 -80 34 60 -21 35 -41 -16 24 98 51 3
3410 3 -58 8 -23 57 -15 -47 -81 -40 -125 -91 112 34 112 131 11 -26 8 -18 18 -30 -14 -79 116 55 -54 -53 -86 9 82 -71 148 101 8
3121 8 -283 -19 63 4 -145 -104 -30 -72 -180 6 -64 -112 -12 36 61 -93 52 48 90 28 -12 10 84 31 20 69 -18 -41 -57 -64 -7 75 39
2832 39 15 -2 -3 -48 35 9 -166 -6 -25 95 -34 -50 11 -75 -56 -109 -7 28 44 105 -44 75 -46 83 20 -84 -30 0 19 -43 0
2561 0 36 -20 20 14 -8 51 0 -84 -78 -90 -150 -97 -35 -160 0 93 -44 -17 160 28 65 58 -7 -128 -6 -15 -30 -12 6 -5 117 -17 41
2272 41 43 -16 -80 -84 -109 -71 60 111 3 -30 -115 -10 -28 33 -215 -82 11 61 -95 53 -96 -72 -2 160 222 13 -34 170 30 50
2010 50 56 3 122 91 99 80 -38 51 35 -121 -40 -118 -149 -17 -4 -35 -83 -129 -15 -140 55 200 214 29 -41 71 -9 16 -66 7 37
1738 37 68 27 80 -98 -58 -122 45 -53 -28 -108 -34 1 66 8 24 57 65 -40 -98 34 -133 -140 -134 -106 -66 130 37 -117 -26 -15 -102 60 34
1450 34 -104 51 -56 14 29 -95 -116 84 -23 -24 98 -18 -11 97 77 -90 12 5 -97 34 85 78 -5 -8 90 -14 106 -178 69
1196 69 -49 -70 -24 43 15 60 -5 -17 -7 78 5 65 53 -26 124 36 -118 55 -17 -33 89 35 -62 3 -89 33 -120 -23 -145 1 -87
925 -87 29 -58 121 112 107 37 12 -66 -35 -4 -75 69 12 25 91 -3 18 -100 -90 -8 50 24 83 37 25 -43 -14 -17 -43 -32 -81 121 80 110 -48
618 -48 -49 -74 15 58 14 -47 -15 5 68 178 0 -35 -83 -24 48 -9 -10 28 13 17 -82 79 -122 -12 82 10 93 110 -51 -207 -79 135 85
330 85 -70 -94 -88 186 73 22 11 -28 133 44 133 -27 22 -71 -14 -53 -54 -56 15 44 -20 -159 51 173 -14 -84 -44 -40 52 -65 51 -6
50 -6 -101 -11 9 13 77 175 77 90 81 99 90 19 0 -70 6 -127 -38 -18 -38 -40 26 -31 -143 -90 -21 -79 45 93 72 12 -40 49
-230D9
##PAGE=	F1=5408.23
##FIRST=	23146.756194512010552,	4241.1435120000014649,	-0.34594652056694030762
##DATA TABLE=	(F2++(Y..Y)), PROFILE
4241 -69 -6 10 3 -49 109 -29 100 79 62 2 -41 194 121 14 -64 -108 0 -23 45 97 -48 60 -55 -67 71 70 143 103 49 69 -99
3970 -99 -134 3 68 83 24 -27 94 87 -103 -45 85 8 47 124 -184 36 158 9 -84 -33 -92 13 -16 122 110 51 72 1 -218 -77
3707 -77 -53 126 12 -77 -52 -38 -38 -10 11 -28 -105 -57 -1 -23 -53 29 5 85 33 62 124 31 -50 -95 25 27 -90 11 -47 -42 47 74 23 -35
3410 -35 -48 -22 -3 104 -8 -51 -47 -32 -116 -44 84 26 106 134 19 -59 -15 -18 -26 3 35 -81 84 65 -44 -66 -89 22 104 -72 141 23
3130 23 -41 -455 -47 20 -24 -153 -106 -44 -67 -169 16 -79 -79 -10 33 2 -106 36 6 101 47 -6 24 60 -20 -7 121 -36 -68 -81 -104
2859 -104 -75 101 40 10 -5 -10 -44 35 -21 -198 -9 -47 118 -65 -74 11 -97 -65 -44 38 31 39 104 -66 42 -37 47 -39 -92 -24 -46 18 -47
2570 -47 14 37 13 32 24 -31 69 26 -75 -90 -105 -113 -94 -37 -177 11 85 -33 -24 175 52 74 11 -16 -85 13 -32 -65 -34 46 -1 86 -14
2281 -14 35 76 28 -50 -95 -81 -91 17 149 27 -62 -123 -6 13 68 -229 -99 8 47 -81 72 -95 -60 -11 126 272 -9 9 135
2027 135 11 40 83 17 116 81 56 73 -73 38 75 -76 -12 -55 -111 -35 42 -30 -87 -107 -6 -109 64 199 223 -32 -75 48 -19 -11
1765 -11 -79 18 -14 86 43 84 -49 -54 -124 69 -37 -21 -85 -56 1 98 -2 18 35 17 -60 -66 -43 -134 -131 -102 -64 -36 102 13 -99 -7 -33
1476 -33 -115 73 84 -63 44 -74 7 13 -108 -86 87 -23 1 75 -29 -48 68 49 -82 -2 -11 -92 66 54 110 -6 -40 86 26 76
1213 76 -106 77 -66 -41 -34 27 60 40 -48 -41 -32 116 15 65 0 -21 157 77 -122 -1 -33 -85 -12 29 -51 31 -14 19 -129 -40 -147 33
933 33 -102 -7 -30 150 86 75 27 -9 -78 23 -19 -145 72 69 25 70 -31 3 -126 -99 -7 25 69 97 47 21 -75 -31 -20 -42 -3 -61 113
645 113 102 132 -38 -28 -40 35 95 -8 -46 -29 20 54 156 -24 -14 -33 -18 39 2 -27 18 7 79 -65 95 -124 9 105 34 73 161
373 161 -7 -213 -87 108 105 -50 -96 -103 152 69 16 51 35 124 84 120 -8 80 -26 -18 -19 -35 -4 8 28 15 -134 66 128 -1 -54 -53
93 -53 -6 -8 -78 82 0 -38 8 21 15 100 170 54 86 63 68 56 -13 31 -28 35 -64 0 -32 0 -45 41 -44 -144 -85 -21 -59 51 68 42 0 -25
-222 -25 42
-230D2
##PAGE=	F1=5313.88
##FIRST=	23146.756194512010552,	4241.1435120000014649,	-0.44817107915878295898
##DATA TABLE=	(F2++(Y..Y)), PROFILE
4241 -78 -19 9 0 -31 143 7 92 47 19 13 -87 214 118 46 0 -68 17 -3 42 95 11 68 -23 -64 60 79 122 129 37 62 -91 -111 5
3952 5 30 32 14 -34 75 59 -63 -54 65 30 46 132 -148 69 156 -34 -74 -17 -103 -27 -35 150 114 61 113 -1 -222 -100 -46 107 53 -67
3672 -67 -42 -54 -7 1 30 11 -124 -83 -29 -65 -24 54 48 68 16 28 119 -6 -18 -72 16 -21 -127 -21 -73 -50 51 28 5 -60 -50 -48 1 137
3375 137 24 -29 -13 -15 -81 0 45 14 89 136 35 -104 -43 -36 -79 33 56 -85 64 69 -37 -64 -78 24 135 -22 116 -35 -97 -865
3112 -865 -103 -8 -53 -119 -127 -49 -60 -119 27 -92 -54 -20 23 -51 -113 16 -34 93 65 -19 40 59 -58 -23 176 -32 -69 -112 -134 -141 100
2841 100 39 13 7 -8 -10 26 -66 -195 -42 -92 129 -86 -71 27 -93 -52 17 77 40 15 55 -68 1 -35 -7 -99 -78 -4 -85 7 -57 21 23
2552 23 46 30 16 -64 64 70 -64 -88 -88 -74 -85 -29 -175 29 70 -66 -66 170 56 65 -30 -27 -28 41 -49 -101 -50 77 -9 58 -17 43 97 73
2255 73 -2 -63 -46 -89 -6 177 65 -80 -109 14 43 87 -210 -94 0 38 -40 56 -99 -64 -21 96 293 -40 34 53 -12 19 82 40
1992 40 93 40 -9 80 -96 23 103 -24 1 -15 -48 -46 67 -52 -80 -69 11 -82 61 189 219 -28 -94 21 -34 -29 -70 1 -35 105 50
1721 50 90 3 -14 -103 95 -25 1 -45 -64 -13 111 3 19 -5 -22 -84 -30 -77 -116 -100 -49 -1 7 34 6 -65 27 -41 -107 81 98 -26 27
1432 27 -59 -5 -18 -110 -49 78 -34 28 70 -27 -87 52 21 -82 -19 -7 -57 58 21 128 2 -49 57 57 52 -12 99 -65 1 -34 -16
1161 -16 91 14 -85 -91 -80 116 5 42 -53 2 164 112 -100 -66 -40 -128 -102 45 -44 48 48 34 -110 -58 -131 56 -102 -17 -16 134 69 44
881 44 28 -29 -84 90 -38 -174 65 80 9 20 -61 -5 -128 -94 -6 -12 101 113 50 26 -73 -57 -39 -37 42 -43 74 100 133 -36 0 3 42
592 42 88 -8 -33 -32 41 41 132 -18 50 33 -10 6 3 -56 0 19 114 -31 104 -110 33 114 32 26 164 18 -183 -69 81 102 -30 -88
312 -88 -123 76 57 -10 95 86 98 98 96 5 112 9 -21 13 -12 51 -24 -17 37 -95 63 69 -9 -23 -63 29 -59 -64 91 2 36 17 3 0 131
6 131 149 28 36 22 22 4 -50 52 12 66 22 63 -36 34 -31 57 -43 -123 -65 -13 -52 43 60 18 -25 0 18
-230A8
##PAGE=	F1=5219.52
##FIRST=	23146.756194512010552,	4241.1435120000014649,	-0.2203464508056640625
##DATA TABLE=	(F2++(Y..Y)), PROFILE
4241 -65 -51 2 -3 -3 179 54 62 25 -24 28 -112 191 95 72 71 -12 38 16 34 83 68 66 37 -38 43 84 79 129 46 46 -60 -51 17 -5 -8 0 -24 76
3909 76 26 -20 -52 60 46 16 90 -118 71 107 -85 -87 -2 -88 -63 -32 156 111 73 117 -10 -205 -119 -32 74 76 -52 -24 -64 19 18 34
3629 34 33 -135 -79 -70 -94 7 68 76 46 -8 10 94 -40 1 -37 11 -71 -123 -53 -102 -41 34 -15 5 -55 -63 -50 -9 159 67 0 2 3 -33 21 2
3314 2 11 69 139 53 -134 -63 -60 -120 48 45 -80 72 71 -26 -54 -66 5 176 58 88 -53 -38 -414 -97 6 -47 -55 -155 -39 -43 -51 33 -101
3025 -101 -28 -37 18 -86 -102 0 -53 70 69 -40 52 86 -58 -16 222 -7 -53 -135 -147 -178 89 45 21 30 4 40 27 -105 -166 -92 -137 120
2745 120 -89 -53 48 -82 -33 53 95 59 -10 -2 -49 -15 -39 -53 -117 -41 13 -98 -8 -70 20 4 67 11 -3 -99 31 105 -44 -75 -53 -43
2465 -43 -90 -34 -153 47 42 -129 -127 142 36 38 -66 -33 14 65 -50 -126 -48 78 -24 33 -11 70 100 106 41 -11 -15 -58 -18 184 93 -75
2185 -75 -75 37 58 86 -172 -72 -10 38 14 22 -109 -81 -18 83 286 -66 42 -39 -27 0 55 57 51 -17 -67 97 -92 29 98 19 3 -10
1905 -10 22 -40 53 -88 -64 -33 25 -61 53 192 199 30 -86 3 -48 -27 -42 -31 -35 119 41 93 35 40 -71 111 -31 21 -4 -51 -32 102
1625 102 37 19 -50 -42 -106 4 -55 -94 -52 3 63 46 -50 6 -22 67 -21 -84 60 59 -17 -5 -33 -28 -58 -112 -16 57 -38 49 70 -12 -121 46
1327 46 0 -95 -23 22 -9 19 8 115 9 -40 5 70 46 57 131 -45 38 -22 -72 99 -8 -111 -147 -122 86 -13 9 -93 32 145
1065 145 117 -64 -116 -42 -156 -151 74 -35 48 88 64 -59 -79 -102 59 -77 -4 -22 95 72 19 27 -43 -84 145 -53 -157 71 45 -14
802 -14 -48 -84 -10 -109 -66 0 -53 114 127 43 37 -46 -78 -58 -22 72 -27 19 92 113 -45 36 45 31 47 14 8 -20 72 34 105 11 138 95 -8
496 -8 -37 -14 -87 -17 37 112 1 106 -76 43 97 19 -11 122 25 -140 -36 67 85 -19 -50 -122 -17 40 -39 132 111 62 89 73 13
225 13 106 27 -20 35 7 91 -76 -81 39 -48 34 15 -38 1 -64 44 -74 -30 91 -2 80 14 -19 -29 157 125 17 -12 -27 -19 -41 -76 54
-64 54 36 97 100 129 -23 41 0 57 -18 -90 -42 -12 -51 44 76 2 -48 14 -12
-230a2
##PAGE=	F1=5125.17
##FIRST=	23146.756194512010552,	4241.1435120000014649,	0.14360460638999938965
##DATA TABLE=	(F2++(Y..Y)), PROFILE
4241 -29 -91 -9 -1 24 198 93 33 18 -49 56 -97 149 64 82 129 43 58 26 24 71 113 38 97 5 15 64 41 100 60 18 -12 25 41 -1
3944 -1 -12 -3 -5 83 6 6 -32 74 45 -25 25 -102 47 42 -98 -101 0 -60 -87 -11 136 93 83 91 -15 -163 -124 -27 38 85 -44 -17 -60 32
3646 32 34 13 14 -139 -52 -99 -90 45 75 60 29 -21 20 60 -65 -1 -25 10 -101 -93 -77 -105 -29 0 -40 21 -17 -74 -16 -19 175 93 24 5 8 6
3331 6 9 -31 17 56 135 62 -130 -71 -78 -129 50 12 -58 98 70 -14 -49 -58 -33 212 132 70 -27 276 2310 87 73 11 16 -159 -4 0 6
3042 6 32 -100 8 -54 28 -97 -63 -12 -39 40 61 -49 53 131 -16 7 239 20 -36 -130 -139 -169 92 56 31 42 26 95 51 -120 -127 -138
2762 -138 -158 94 -68 -38 64 -78 -25 68 89 73 -18 -27 -21 0 -35 -70 -82 2 14 -81 -13 -79 9 -10 67 -13 -9 -129 -16 111 -13 -57
2482 -57 -20 -25 -112 -62 -113 58 2 -185 -169 100 0 0 -88 -27 30 76 -29 -139 -37 38 -42 17 13 102 84 114 61 30 6 -4 -26 159 95
2194 95 -38 -32 40 61 74 -128 -37 -21 41 65 -9 -121 -99 -1 92 256 -76 40 -101 -26 -5 6 51 -2 -66 -97 111 -54 61 58 41
1922 41 10 -21 80 -10 9 -103 -35 -12 29 -44 43 208 159 97 -54 -3 -53 -6 1 -59 -34 119 12 95 38 74 -45 104 -44 34 23
1651 23 -23 -36 78 90 15 -76 -43 -121 32 2 -71 9 43 117 58 -113 3 20 97 25 -58 1 -14 -34 -53 -24 -61 -89 -128 0 23 -22 63
1362 63 47 6 -147 43 -18 -113 -6 67 30 -25 20 77 6 -24 -54 61 49 73 153 -13 42 -8 -121 88 -26 -126 -188 -140 48 -23
1100 -23 -15 -104 53 108 83 -24 -133 -42 -163 -152 97 -18 41 103 89 8 -103 -64 41 -38 18 -39 60 86 0 15 -47 -78 173 -43 -104
828 -104 96 -4 -36 -110 -90 -13 -86 -21 12 -87 110 130 24 44 -9 -83 -60 1 64 0 -30 96 81 -59 77 70 14 3 43 70 1 105
548 105 29 71 46 215 132 -12 -69 -39 -102 -31 45 79 16 114 -25 37 55 16 -12 53 22 -103 -4 73 67 -14 11 -82 -84 30 -46 150 112
260 112 21 67 54 18 72 38 -10 42 18 95 -130 -135 22 0 -11 -20 -77 15 -41 35 -41 10 98 -8 81 11 -24 -59 166 108 24 -19 -73 -45
-38 -45 -70 -85 41 41 120 141 176 -2 12 25 27 20 -63 -22 -26 -49 59 105 -13 -57 9 -39
-230c9
##PAGE=	F1=5030.81
##FIRST=	23146.756194512010552,	4241.1435120000014649,	0.075868740677833557129
##DATA TABLE=	(F2++(Y..Y)), PROFILE
4241 18 -111 -20 8 47 181 115 32 21 -52 86 -45 106 39 70 157 90 75 20 15 58 134 -18 126 50 -25 7 20 53 67 -21 28 93
3961 93 67 46 22 5 8 67 10 15 4 101 34 -58 -30 -96 14 0 -57 -97 -17 -35 -98 12 98 60 89 57 -13 -98 -105 -39 7 89 -47 -31 -36 26
3646 26 41 -18 -28 -135 -16 -105 -59 89 90 9 19 -13 51 29 -78 -15 -44 9 -94 -59 -87 -67 -24 -37 -39 46 43 -69 37 -13 179 88 43
3357 43 11 -5 22 -24 -39 23 53 121 60 -98 -73 -86 -107 43 -26 -22 116 68 -11 -58 -53 -76 221 163 61 19 849 7479 474 173 105
3086 105 84 -119 56 61 34 29 -85 47 -53 51 -85 0 -24 -7 13 56 -33 42 176 47 32 212 31 -29 -94 -110 -120 120 63 39
2824 39 30 47 140 88 -109 -88 -158 -146 58 -31 -34 71 -78 -28 80 71 66 -7 -6 4 34 -7 -51 -15 28 -1 -40 -2 -74 -9 -19 48 -34 9 -142
2517 -142 -60 90 16 -46 -1 -19 -137 -105 -60 60 -36 -198 -171 60 -44 -39 -82 -2 20 69 1 -141 -38 -29 -56 15 55 114 55 94 51 52
2237 52 18 57 -35 102 77 24 7 18 52 64 -85 0 -21 38 99 -23 -129 -101 16 111 209 -73 28 -107 -15 0 -58 18 -50 -78 -103
1966 -103 118 3 96 -3 36 37 -17 111 37 -39 -71 9 -6 26 -24 26 219 98 125 -13 -3 -45 20 51 -64 -35 102 -39 102 21
1703 21 65 -39 70 -47 41 29 6 -12 47 141 11 -68 -34 -127 50 59 -45 75 69 158 38 -128 -2 49 105 78 -43 -76 -85 -55 -96
1432 -96 -42 -103 -97 -155 -5 -16 7 65 -12 17 -156 37 -35 -119 24 101 47 -50 38 32 -2 -9 -103 34 49 42 144 19 8 -10 -146 62 -51
1143 -51 -134 -207 -128 20 -9 -22 -81 62 64 18 7 -114 -38 -144 -120 99 3 40 97 101 72 -120 -24 18 -4 32 -55 39 97 -9 -3 -39 -61
855 -61 164 -1 -37 122 -37 -56 -141 -74 -16 -71 32 28 -109 91 116 -14 44 20 -70 -38 30 27 44 -63 108 52 -69 120 67 12 -20
583 -20 57 124 18 126 19 26 64 249 138 -15 -74 -55 -95 -40 37 32 15 134 27 28 0 25 13 -13 17 -82 16 96 55 -11 70 -12 -89
295 -89 44 -16 141 95 -18 46 37 18 33 55 2 35 15 52 -166 -154 -7 38 -49 -39 -104 19 10 21 25 49 113 -11 63 15 -5 -76 154
6 154 94 34 19 -106 -54 -83 -81 22 34 123 139 187 8 -43 23 -28 46 -52 -2 -51 -49 73 128 -33 -48 -10 -56
-230e6
##PAGE=	F1=4936.46
##FIRST=	23146.756194512010552,	4241.1435120000014649,	-0.12475559860467910767
##DATA TABLE=	(F2++(Y..Y)), PROFILE
4241 63 -90 -27 24 64 125 122 64 22 -40 98 16 69 27 40 146 120 85 -2 12 46 123 -91 108 71 -68 -70 4 8 61 -59 39 126 80
3952 80 112 66 8 18 8 34 17 47 123 26 -74 -61 -92 -15 -4 6 -81 -52 -23 -98 22 55 20 90 35 -9 -24 -58 -57 -14 90 -45 -56 6
3655 6 17 33 -37 -56 -123 12 -93 -23 121 113 -35 12 6 75 4 -81 -25 -75 5 -52 -34 -78 0 -25 -66 -18 67 105 -53 81 0 153 62
3366 62 62 30 -27 17 -57 -14 18 54 103 55 -65 -78 -83 -75 32 -60 14 105 62 -24 -79 -42 -98 191 143 56 54 1452 13119 914 266
3095 266 187 144 -50 122 116 26 22 -60 68 -26 71 -58 69 -42 13 2 75 0 31 205 97 50 144 20 -30 -44 -67 -56 161 57
2832 57 50 4 58 165 111 -82 -50 -142 -107 26 4 -30 67 -69 -29 94 51 29 13 38 25 59 42 -5 50 20 -23 1 16 -58 -32 -17 20
2544 20 -44 36 -132 -85 55 33 -48 4 -16 -142 -132 -6 56 -52 -163 -132 31 -86 -64 -47 33 -4 42 27 -136 -67 -94 -57 27 98 91
2272 91 30 55 25 69 19 106 -41 25 55 99 32 -20 33 67 -43 27 -4 28 119 -23 -124 -85 14 125 160 -67 4 -69 -5 -1 -125 -24
1992 -24 -80 -38 -96 119 54 104 -62 2 78 10 112 87 -66 -4 61 -2 23 3 0 204 30 101 19 4 -21 40 92 -40 -33 78 -106 110
1712 110 -4 19 -58 25 -38 45 11 23 29 25 177 9 -38 -24 -122 56 90 -21 129 84 185 0 -96 -6 58 95 114 -39 -132 -114 -60
1441 -60 -113 -69 -138 -77 -169 -18 -56 32 46 -88 21 -148 31 -39 -97 57 101 38 -46 38 5 -7 2 -130 5 40 -1 97 37 -43 -30 -141
1161 -141 28 -93 -144 -208 -100 13 29 -13 -31 63 35 -51 22 -75 -24 -106 -76 78 20 47 77 107 115 -123 9 5 9 23 -65 31 94 -12
881 -12 -19 -26 -34 119 52 22 122 -39 -82 -138 -42 -18 -68 84 40 -116 59 91 -70 39 37 -48 -5 58 -10 83 -80 112 40 -67 152 39
601 39 31 -25 49 148 13 125 -1 -17 52 229 119 -14 -52 -57 -74 -44 22 -12 10 154 68 27 -51 33 36 -55 12 -75 26 119 46 -16 100
312 100 64 -37 84 39 105 65 -53 30 19 11 3 76 11 16 -7 -25 -178 -134 -41 59 -56 -51 -108 14 75 17 96 83 129 -11 58 29 14
23 14 -74 130 78 30 72 -119 -54 -87 -79 0 25 101 106 163 3 -104 -6 -94 44 -59 23 -77 -62 66 129 -43 -24 -34 -65
-230f5
##PAGE=	F1=4842.11
##FIRST=	23146.756194512010552,	4241.1435120000014649,	-0.2591190338134765625
##DATA TABLE=	(F2++(Y..Y)), PROFILE
4241 88 -36 -27 38 77 50 116 102 15 -23 83 47 39 29 5 102 127 85 -27 19 44 84 -156 53 55 -100 -135 -26 -27 47 -78 10 110 73
3952 73 157 88 -9 35 -86 59 14 85 121 33 -73 -63 -85 -39 15 42 -71 -92 -19 -87 14 19 -10 95 36 -9 32 3 -58 -30 82 -25
3672 -25 -75 55 27 19 -30 -45 -108 22 -80 -3 116 125 -40 5 16 72 -18 -77 -23 -90 -3 3 -21 -56 71 -19 -79 10 73 144 -45 87 0
3384 0 84 41 81 50 -35 3 -69 37 2 51 87 56 -55 -86 -70 -58 22 -74 36 71 48 -45 -100 -16 -82 128 93 45 56 1751 16152
3112 16152 1171 312 214 187 7 158 128 -5 5 -39 62 23 75 -27 124 -63 2 22 126 41 30 208 104 59 57 -7 -29
2876 -29 -9 -22 -4 187 40 65 -17 57 165 98 -50 -9 -96 -54 2 20 -12 51 -52 -25 102 39 -27 28 67 43 61 97 48 96 -12 -41
2596 -41 21 22 -49 -54 1 1 -45 42 -99 -89 21 38 -63 3 -9 -118 -122 38 52 -35 -101 -73 16 -117 -64 -2 62 -34 2 40 -125 -109 -124 -42
2299 -42 48 119 43 26 15 0 94 8 124 -40 -52 46 162 37 -61 13 83 -10 34 21 21 130 -17 -104 -67 -14 123 126 -71 -29 -16 0
2019 0 -22 -175 -55 -88 39 -89 117 78 78 -101 -48 113 42 85 118 -57 53 108 15 23 36 -22 163 -25 49 32 27 11 48 106 1
1747 1 -19 58 -171 98 -34 -37 -90 -6 -31 43 -19 12 62 21 192 9 -5 -9 -101 52 95 -8 154 93 196 -30 -45 -13 49 75 124 -40
1467 -40 -132 -94 -48 -94 -80 -145 -36 -146 -17 -90 29 -2 -139 24 -127 30 -15 -49 83 65 16 -21 15 7 2 9 -135 -5 32 -25 31
1196 31 34 -83 -52 -107 -7 -144 -155 -198 -70 20 73 4 22 60 39 -99 16 -37 -1 -64 -38 39 26 53 53 117 129 -116 26 5 0 -12 -72
907 -72 36 73 -10 -24 -21 -9 47 78 59 90 -21 -114 -111 -11 -21 -70 122 41 -106 16 69 -121 34 35 -27 13 76 -31 88 -86 95
636 95 45 -49 161 6 56 -19 33 138 -7 102 -23 -44 16 169 91 -17 -15 -55 -53 -38 16 -40 11 157 86 37 -80 32 30 -61 8 -79
356 -79 28 124 33 -35 93 121 34 136 93 49 24 -75 17 4 5 -15 88 2 -13 -47 -106 -167 -93 -68 63 -33 -58 -95 -4 125 25 140
76 140 105 133 -10 79 46 10 -57 104 58 15 103 -109 -54 -91 -89 -25 18 65 69 121 -11 -147 -42 -147 21 -70 49 -94 -93 37 105 -29
-204 -29 2 -47 -73
-230g3
##PAGE=	F1=4747.75
##FIRST=	23146.756194512010552,	4241.1435120000014649,	-0.36201259493827819824
##DATA TABLE=	(F2++(Y..Y)), PROFILE
4241 86 16 -23 46 85 -11 93 111 2 -6 51 21 15 43 -17 46 113 71 -43 34 57 29 -192 -4 7 -113 -156 -75 -57 31 -71 -43 54 53
3952 53 157 78 -44 74 -176 66 -2 106 90 52 -59 -41 -77 -60 40 29 -79 -115 -16 -63 -6 1 -20 109 56 -11 53 55 -26 -39 54
3681 54 14 -83 91 66 11 -10 -5 -94 12 -74 -1 68 110 -8 2 4 41 -42 -69 -21 -77 -13 45 -13 -32 116 -2 -72 36 55 143 -60 54
3392 54 -22 -15 45 94 54 -22 -10 -55 98 -13 47 79 70 -71 -87 -53 -70 16 -61 37 38 26 -60 -107 26 -34 54 45 22 30 1561 14760 1102
3104 1102 294 185 202 22 139 86 -42 -19 -31 38 72 58 -1 151 -78 -38 67 186 80 35 183 63 58 -16 -33 -17 0 18 16
2850 16 177 19 79 -19 44 145 50 -21 38 -41 0 -11 16 19 28 -51 -24 89 33 -88 29 59 57 45 138 96 117 -45 -49 9 4 -59 -72 38
2552 38 4 -39 15 -54 -81 -5 38 -84 5 4 -75 -75 68 50 11 -45 -14 9 -127 -46 21 66 -61 -39 43 -106 -133 -107 -19 66 108 0 52
2264 52 -8 -18 121 -12 112 -33 -110 49 197 28 -91 4 103 7 20 38 27 139 -16 -76 -63 -61 110 117 -89 -62 23 -1 -63 -189
2001 -189 -60 -78 120 -80 107 72 40 -118 -99 117 52 41 121 -19 65 140 51 18 57 -26 120 -53 4 24 64 42 50 82 37 5 45
1730 45 -212 40 -66 -73 -112 -10 -40 32 -51 -31 55 36 190 11 18 19 -63 41 89 -13 141 98 186 -41 -6 -37 32 55 123 -38 -69
1458 -69 -43 -30 -54 -59 -111 14 -79 6 -117 -5 -73 -139 31 -107 28 39 5 96 12 -4 5 -11 33 23 14 -127 4 27 -23 -21 16 -92 -53
1170 -53 -54 -39 -179 -153 -181 -54 29 89 22 54 55 79 -110 1 -18 14 -36 -8 1 31 48 34 131 117 -112 26 8 -31 -57 -78 53 36 -8
881 -8 -24 -33 -5 -31 52 67 41 -1 -137 -72 -4 -27 -70 135 26 -76 -24 59 -140 27 14 -11 5 77 -37 56 -81 60 57 -20 146 -8
601 -8 67 -8 28 106 -22 68 -36 -42 -23 97 71 -33 21 -60 -36 -20 24 -46 15 134 85 52 -83 24 3 -32 0 -86 23 97 13 -68 67
312 67 151 84 169 118 -10 -22 -82 8 1 9 -32 73 -25 -54 -85 -155 -141 -56 -77 58 -2 -61 -85 -44 136 28 144 108 116 -11 109 49 -25
23 -25 -35 85 40 7 97 -81 -58 -98 -114 -43 7 37 46 78 -22 -161 -55 -178 2 -69 64 -100 -131 4 64 7 19 -44 -81
-230h1
##PAGE=	F1=4653.4
##FIRST=	23146.756194512010552,	4241.1435120000014649,	-0.11542296409606933594
##DATA TABLE=	(F2++(Y..Y)), PROFILE
4241 57 36 -14 53 92 -33 51 69 -9 8 20 -59 -1 62 -30 2 83 47 -41 48 76 -23 -192 -27 -44 -105 -124 -120 -80 18 -47 -91 -13 28 119
3944 119 54 -73 128 -217 50 -44 105 45 75 -43 -3 -72 -81 61 -11 -98 -104 -9 -29 -28 5 -8 124 76 -13 36 81 30 -39 5 57 -91
3664 -91 96 109 21 -4 29 -80 -12 -71 -1 2 76 23 4 -10 3 -56 -57 -33 -48 -18 60 -11 -15 120 20 -48 52 19 101 -96 8 -50 -102
3375 -102 70 100 36 -1 -26 -30 144 -18 52 82 94 -95 -71 -35 -99 18 -22 23 25 5 -57 -92 71 23 -5 26 -11 0 1005 9879 771
3104 771 229 132 174 -3 75 12 -70 -43 -35 21 96 32 17 150 -85 -84 112 216 111 32 139 -4 42 -53 -45 1 -7 49 9 134 3
2832 3 85 -5 29 115 -5 1 87 6 35 -16 7 55 8 -90 -36 59 29 -137 15 28 56 23 156 125 119 -53 -46 -26 -25 -86 -83 76 27 -29 -27 -13
2517 -13 -65 -13 38 -100 11 20 -37 -14 83 43 62 -19 36 9 -116 -27 7 44 -79 -70 37 -82 -114 -64 -4 76 72 -23 94 -18 -32 132
2237 132 -37 82 -25 -138 57 194 21 -98 12 114 2 -4 27 45 142 -19 -50 -76 -100 89 125 -108 -79 41 -3 -109 -163
2001 -163 -44 -53 166 -68 83 57 20 -116 -125 87 32 -5 102 21 28 154 93 0 52 -4 95 -48 -12 3 93 59 59 29 51 35 36 -212
1721 -212 -64 -89 -71 -107 12 -54 18 -72 -94 7 62 169 15 36 63 -19 23 79 -31 100 94 154 -37 10 -79 20 36 124 -38 28 4
1450 4 -17 -20 -14 -50 65 4 42 -139 -51 -141 -100 32 -100 16 105 46 94 -30 -15 20 -21 68 44 17 -116 18 19 -9 -37 4 -74 -27 -1
1161 -1 -63 -175 -120 -153 -54 31 61 33 44 42 126 -94 -4 -20 4 -32 14 -17 49 38 24 135 86 -113 24 1 -67 -85 -80 77 -7 -7 -26 -62
863 -62 -29 -94 -8 54 0 11 -134 -21 -25 -36 -67 123 0 -28 -43 58 -116 14 -17 6 -15 56 -40 16 -62 22 63 6 117 3 52 7
583 7 42 62 -12 32 -36 -13 -52 39 66 -58 48 -72 -20 2 32 -34 14 96 72 62 -69 14 -14 14 -11 -86 8 43 -7 -105 40 162 95
295 95 165 107 -63 -64 -80 7 12 26 -60 28 -63 -93 -103 -155 -105 -36 -67 48 5 -59 -92 -100 104 12 119 91 82 -14 123 31 -70 -15 71 29 22
-12 22 61 -47 -64 -111 -142 -46 -11 30 43 44 -23 -146 -38 -194 0 -43 58 -99 -155 -17 19 44 17 -26 -85
-230h5
##PAGE=	F1=4559.04
##FIRST=	23146.756194512010552,	4241.1435120000014649,	0.12082402408123016357
##DATA TABLE=	(F2++(Y..Y)), PROFILE
4241 11 18 -2 62 96 -12 -5 -6 -14 21 3 -162 -12 75 -47 -17 42 17 -32 54 83 -62 -160 2 -74 -78 -61 -136 -88 12 -23 -106 -57 3 66
3944 66 40 -76 175 -194 26 -103 84 9 86 -29 41 -75 -94 80 -36 -115 -60 3 6 -45 24 14 124 80 -11 -4 80 84 -29 -57 84
3672 84 -110 65 116 42 -25 36 -62 -46 -56 10 -42 50 23 8 2 -16 -43 -39 -56 -28 -16 60 -17 -12 89 31 -17 51 -20 38 -127 -17 -60 -133
3375 -133 87 107 13 6 -49 -10 162 -12 71 94 122 -104 -41 -15 -122 16 24 7 32 3 -33 -57 94 75 -39 42 -46 -18 410 4386
3112 4386 392 152 94 107 -46 5 -47 -82 -53 -36 24 82 14 28 135 -87 -105 135 203 131 16 91 -67 11 -42 -42 16 -8 68 -9
2850 -9 79 0 78 7 21 86 -43 19 126 31 37 -16 7 76 1 -162 -56 23 23 -168 -10 0 27 2 154 132 107 -29 -37 -63 -47 -102 -79
2561 -79 92 56 -17 -58 10 -44 0 33 -105 19 34 -25 31 87 24 85 -24 79 12 -97 -23 -33 15 -86 -75 19 -64 -57 -27 -8 74 31
2281 31 -29 125 -27 -47 118 -57 51 -17 -137 61 152 30 -75 27 108 -16 -22 -8 60 135 -17 -30 -89 -112 58 131 -112 -70 45
2027 45 0 -138 -115 -17 -11 160 -54 48 51 24 -99 -108 40 -1 -38 79 38 -26 148 115 -27 18 29 90 -21 -5 -17 90 58 81 -24
1756 -24 45 64 28 -169 -179 -91 -39 -79 41 -48 11 -77 -151 -55 89 131 23 53 108 13 0 60 -52 46 72 103 -38 15 -124 19 11 130
1476 130 -48 114 21 -7 -6 34 8 109 67 70 -152 -75 -174 -56 15 -103 -10 150 60 75 -49 -14 17 -9 99 59 22 -105 10 -2
1213 -2 4 -14 13 -55 4 27 -80 -129 -56 -107 -65 23 1 31 -4 20 139 -65 10 -32 -32 -42 29 -8 82 35 22 116 42 -108 39 -15 -89 -80 -74
907 -74 92 -43 -5 -31 -88 -62 -124 -63 33 -18 16 -102 44 -56 -39 -59 96 -20 29 -30 47 -71 -4 -48 30 -22 19 -42 0 -32 -5 59
627 59 21 90 27 18 24 65 1 17 -4 -29 27 -64 10 70 -79 62 -81 -3 19 23 -16 5 63 56 59 -49 1 -5 59 -24 -72 -15 -24 -22 -136 20 160
303 160 82 126 74 -100 -91 -75 15 26 44 -97 -34 -92 -111 -92 -121 -64 -26 -48 35 -18 -54 -112 -150 46 -22 85 65 38 -15 114 1 -90 -3
15 -3 56 30 56 17 -21 -69 -128 -153 -30 -43 41 49 16 -23 -108 -6 -200 8 6 39 -94 -148 -27 -18 57 3 0 -82
-230h2
##PAGE=	F1=4464.69
##FIRST=	23146.756194512010552,	4241.1435120000014649,	-0.027711525559425354004
##DATA TABLE=	(F2++(Y..Y)), PROFILE
4241 -36 -15 7 73 93 32 -63 -73 -8 39 0 -241 -24 71 -80 -15 -5 -12 -27 49 71 -82 -115 70 -75 -35 -5 -112 -73 20 -8 -83 -61
3961 -61 -19 26 51 -51 198 -129 11 -150 51 -6 77 -19 75 -85 -88 94 -23 -119 -4 22 34 -56 37 30 95 66 -3 -48 69 109 -9
3690 -9 -118 91 -136 10 67 60 -65 15 -35 -80 -25 35 -44 52 -9 4 55 -11 2 -13 -75 -30 -10 65 -36 -24 42 21 6 36 -45 -18 -131
3401 -131 -8 -43 -96 71 118 8 -3 -76 0 148 -1 94 111 141 -86 -9 3 -119 -3 55 -5 43 31 7 -19 77 125 -53 75 -66
3139 -66 -21 50 787 150 97 89 23 -81 -33 -49 -83 -46 -20 42 44 15 32 114 -97 -86 142 176 142 2 54 -98 -27 7 -28 14 5 70 -18
2850 -18 38 7 62 5 30 63 -49 31 145 31 4 -15 17 72 7 -229 -67 -1 15 -177 -42 -7 -31 -18 137 117 84 13 -25 -81 -45
2579 -45 -84 -52 76 71 -12 -64 10 -24 30 12 -100 25 41 -36 50 82 -10 66 -43 112 17 -87 -36 -71 0 -82 -53 -9 -60 4 -19 -30 59
2290 59 9 -38 124 -44 -62 92 -67 24 -6 -118 61 76 55 -35 27 84 -39 -21 -50 58 118 -3 -13 -79 -90 12 120 -86 -35
2036 -35 44 7 -139 -71 11 40 118 -41 15 58 35 -71 -52 -2 -27 -54 69 19 -65 119 95 -51 -22 49 82 12 15 -27 49 47 106 -53 33
1747 33 84 23 -100 -250 -66 0 -50 52 -11 17 -71 -170 -101 110 82 34 63 133 23 -23 22 -61 -5 26 44 -58 27 -149 29 -18 128
1476 128 -73 154 0 2 -8 70 41 131 80 77 -144 -52 -158 -33 -22 -103 -45 153 54 41 -52 -10 -2 10 117 73 29 -96 -32 -27 18 29
1196 29 42 -53 17 21 -91 -63 10 -45 -71 13 -54 19 -74 -7 101 -39 41 -40 -75 -54 27 23 110 47 22 73 -7 -87 76 -27 -80 -54 -66 80
898 80 -60 4 -33 -89 -73 -121 -78 16 -19 15 -53 119 -68 -25 -46 74 -20 78 3 11 -42 -25 -62 52 2 -18 -33 14 -8 -22 47 23 76 37
601 37 -13 35 82 -74 33 -43 -21 63 -67 8 68 -85 66 -81 11 22 -10 -6 -8 46 40 42 -28 -16 22 87 -35 -46 -43 -81 -30 -158 6 143
303 143 72 76 37 -117 -97 -75 25 28 51 -135 -97 -103 -89 -64 -80 -26 -14 -37 14 -60 -51 -120 -164 -6 -53 58 43 -4 -14 90 -23 -61 -2 37
6 37 43 85 -18 -10 -76 -147 -130 -3 -82 54 53 -13 -31 -57 17 -193 16 72 19 -85 -110 -35 -40 42 -8 24 -73
-230g3
##PAGE=	F1=4370.34
##FIRST=	23146.756194512010552,	4241.1435120000014649,	-0.20635704696178436279
##DATA TABLE=	(F2++(Y..Y)), PROFILE
4241 -68 -31 9 82 71 72 -98 -89 6 66 3 -262 -43 49 -117 -8 -48 -35 -32 35 46 -81 -77 137 -68 16 18 -60 -41 37 -1 -39 -35 -43 14 78
3935 78 -14 193 -60 10 -158 21 -4 46 -13 86 -94 -58 92 10 -108 41 44 53 -63 26 30 44 47 6 -80 60 98 14 -162 90 -151
3664 -151 -45 -23 57 -103 -13 -2 -109 10 55 -12 73 -49 -9 117 5 60 15 -78 -55 -3 88 -64 -46 0 -8 11 18 -44 -52 -103 26 -12
3384 -12 -28 20 125 32 -20 -92 1 108 7 108 126 144 -47 6 14 -89 -49 52 -14 48 81 53 -3 29 181 -58 100 -63 -26 -26 -388
3112 -388 80 76 106 -53 -103 -30 20 -83 -25 12 58 14 26 27 87 -118 -45 150 173 147 7 33 -93 -55 80 -10 -8 24 53 -5 19 26 47
2824 47 -7 54 45 -34 32 134 11 -46 -17 25 48 12 -246 -55 -13 0 -168 -68 0 -100 -42 104 86 52 53 -11 -77 -24 -34 -2 41 62
2544 62 -22 -55 -7 -14 60 -19 -92 32 41 -54 52 74 -53 15 -51 131 24 -92 -56 -78 4 -75 -13 -39 -78 33 -37 -55 24 13 -58 90
2264 90 -58 -69 70 -71 0 14 -99 58 -14 78 1 -1 47 -55 -2 -72 39 93 22 -2 -44 -40 -40 93 -30 9 43 19 -118 -53 36 76
1983 76 73 -30 -4 62 27 -38 17 -31 -36 -60 74 -17 -75 68 36 -58 -35 42 54 37 34 -24 -7 38 115 -45 29 87 19 -36 -242 -24 21 -49
1686 -49 37 43 29 -61 -146 -112 117 37 40 52 124 11 -39 -28 -49 -43 -36 -2 -92 46 -140 42 -46 100 -104 143 -47 16 -7 84 46 118 50
1397 50 70 -105 7 -104 -28 -67 -82 -69 115 46 1 -58 -10 -34 23 118 92 34 -83 -88 -31 41 67 71 -68 1 -8 -95 -9 43 18 -60 11 -74
1100 -74 7 -137 -34 34 -19 71 -34 -98 -60 3 59 105 63 22 26 -49 -57 115 -21 -44 -32 -65 45 -58 26 -22 -57 -41 -102 -57 5 -12 11
811 11 -1 186 -41 7 -35 62 10 102 31 -42 -50 -41 -56 57 46 -41 -3 36 -5 -40 32 24 78 16 -28 41 88 -142 7 -80 -8 81 -74 22
513 22 50 -78 60 -76 24 13 -59 -9 -25 38 27 16 -10 -36 44 95 -36 -22 -66 -111 -33 -170 -3 102 79 39 7 -112 -79 -77 25
242 25 11 42 -154 -149 -99 -32 -38 -53 0 0 -45 -10 -95 -50 -96 -125 -34 -60 43 37 -41 -15 62 -27 6 -10 17 66 91 -37 -8 -87 -160 -76 23 -121
-73 -121 57 52 -42 -46 -13 21 -159 21 129 9 -67 -55 -41 -39 24 -4 43 -68
-230f8
##PAGE=	F1=4275.98
##FIRST=	23146.756194512010552,	4241.1435120000014649,	-0.23397259414196014404
##DATA TABLE=	(F2++(Y..Y)), PROFILE
4241 -76 -14 0 86 31 81 -94 -43 29 103 8 -221 -65 20 -132 -11 -69 -46 -33 19 21 -64 -59 165 -76 61 9 -6 -8 54 1 -1 -10 -66 28
3944 28 99 11 172 -15 9 -124 5 8 0 -13 77 -94 -15 60 24 -83 64 64 66 -68 -9 18 -5 38 15 -98 48 71 31 -180 95
3672 95 -138 -79 -115 28 -130 -34 23 -127 27 50 25 83 -72 -28 137 12 98 35 -72 -87 3 118 -90 -67 -28 -40 2 15 -25 -65
3410 -65 -59 63 14 15 -36 114 72 -26 -89 2 50 13 105 131 129 -8 -4 6 -50 -103 20 -20 53 126 89 -22 -24 228 -68 97 -36 -45 36 -243
3112 -243 93 72 128 -105 -116 -5 131 -85 2 45 60 16 32 19 49 -137 -18 161 196 151 29 24 -61 -57 153 13 -37 33 25 22 13 47
2832 47 40 -13 85 32 -15 19 96 -14 -90 -19 22 20 3 -192 -25 -22 -28 -151 -78 11 -155 -64 62 51 16 70 -1 -64 -1 23 51 10 36 -51
2535 -51 -47 -28 -21 68 -49 -83 43 38 -58 53 68 -90 -35 -34 134 35 -101 -73 -50 22 -65 24 -52 -113 11 -65 -71 -30 33 -77 45 -52 -62
2246 -62 55 -74 -24 41 -94 49 -95 80 13 -48 9 -65 17 -64 16 66 49 -5 -2 26 -82 67 37 45 43 32 -90 -61 51 69 47 -13
1966 -13 -8 50 -2 -13 64 -55 -34 -70 83 -39 -64 8 -36 -45 0 21 8 43 42 -18 -44 36 88 -6 34 74 13 -5 -168 17 19 -79 5 86 36
1660 36 -54 -100 -95 98 7 34 14 90 -11 -42 -70 -16 -61 -98 -27 -119 53 -113 51 -63 48 -129 100 -92 29 7 85 39 64 13
1397 13 62 -42 68 -41 -22 -103 -42 -69 58 40 -32 -74 -14 -66 24 106 112 27 -62 -111 6 74 79 75 -85 -25 -35 -88 13 27 61 -33 24
1108 24 -60 8 -167 -50 -9 -5 82 -18 -95 -61 -39 84 60 65 21 -1 -76 -45 127 -1 -6 -33 -72 8 -49 59 5 1 21 -92 -30 -5 -4 11
811 11 44 227 15 50 -40 49 63 95 23 -86 -80 -45 -40 36 81 -42 44 43 -29 -68 13 37 88 -24 -21 54 88 -169 -51 -102 20 79 -86
522 -86 35 27 -73 42 -77 36 0 -102 -22 -47 29 20 -9 -3 -46 54 87 -21 -8 -77 -107 -32 -167 -4 43 93 20 -17 -91 -42 -72 10
242 10 -20 24 -141 -179 -86 32 -25 -40 12 14 -69 -29 -108 -45 -42 -51 -31 -38 35 47 -72 -19 39 -8 78 -26 -2 92 77 -41 1 -101 -154 -11
-55 -11 45 -150 46 43 -62 -62 0 13 -91 29 153 4 -36 -3 -35 -10 31 16 55 -70
-230g0
##PAGE=	F1=4181.63
##FIRST=	23146.756194512010552,	4241.1435120000014649,	-0.20222568511962890625
##DATA TABLE=	(F2++(Y..Y)), PROFILE
4241 -63 26 -23 86 -15 59 -48 43 56 140 6 -141 -76 0 -106 -28 -55 -43 -21 5 -2 -35 -61 139 -107 84 -12 26 9 58 2 13
3970 13 -11 -90 54 96 12 140 6 -3 -73 4 31 -48 -24 61 -78 16 -3 -3 -43 72 74 74 -69 -48 6 -29 49 21 -105 21 53 34 -170
3681 -170 110 -100 -81 -172 -21 -147 -44 33 -132 8 15 46 58 -78 -50 84 -3 93 38 -66 -107 13 134 -99 -78 -46 -60 -5 38
3427 38 -5 -72 -15 82 30 8 -62 80 107 -18 -74 4 -5 15 94 120 99 6 -35 -25 -27 -141 -19 -23 72 138 97 -66 -57 235 -85 71 -2
3139 -2 -73 90 -26 91 56 143 -128 -121 17 227 -87 37 56 50 50 24 20 2 -131 -20 170 228 158 41 20 -18 -34 202 44 -53 32
2867 32 9 49 8 60 48 2 105 23 -11 -4 45 -32 -108 -14 16 9 -21 -89 0 -37 -68 -138 -72 17 -176 -76 35 22 -22 58 -4 -52 11 55
2570 55 83 -1 8 -89 -41 -39 -44 47 -58 -73 60 38 -39 62 62 -104 -59 0 124 48 -95 -80 3 43 -48 44 -39 -143 -49 -89 -77 -95 53
2281 53 -75 14 -22 -45 35 -83 -44 60 -112 34 -141 55 0 -81 -15 -67 18 -29 -1 39 66 -26 23 98 -94 54 98 58 44 43 -66
2010 -66 -80 50 15 39 9 -10 29 -33 -12 65 -81 -25 -86 83 -22 -48 -37 -91 -19 72 10 -33 22 29 -26 -42 37 29 42 39 53 -2 -18 -77 44
1703 44 4 -117 -23 100 33 -51 -66 -70 51 0 16 -33 53 -32 -39 -78 30 -58 -137 -28 -114 32 -91 49 -61 -9 -137 50 -113 31
1441 31 29 88 37 -11 5 61 17 94 4 -7 -120 0 -43 0 30 -54 -89 -15 -85 19 86 116 0 -32 -73 73 102 64 48 -88 -40 -36 -68
1152 -68 6 -16 69 -5 42 -37 30 -150 -49 -3 0 67 -4 -77 -63 -85 89 -4 47 18 -3 -85 -64 102 14 7 -53 -81 -5 -42 93 43 66 80
855 80 -103 -21 -21 2 20 77 232 77 86 -70 19 115 67 -19 -88 -95 -41 -28 1 83 -28 99 31 -68 -105 -6 63 95 -59 -3 88 86 -131 -104
557 -104 -94 70 59 -99 33 15 -79 11 -81 49 -7 -122 -36 -71 18 22 -25 -14 -37 60 74 5 -4 -77 -85 -29 -145 0 -11 92 11 -43 -67
268 -67 0 -48 -10 -55 5 -97 -178 -67 71 -19 -34 9 25 -94 -29 -101 -28 14 13 -10 0 29 60 -97 -26 18 17 109 -45 -18 109 63 -38
-20 -38 28 -107 -121 29 57 -165 27 16 -66 -70 -24 2 -6 37 127 -1 4 31 -1 38 69 37 66 -76
-230g6
##PAGE=	F1=4087.28
##FIRST=	23146.756194512010552,	4241.1435120000014649,	-0.06794001162052154541
##DATA TABLE=	(F2++(Y..Y)), PROFILE
4241 -41 66 -49 88 -49 23 21 129 82 158 -8 -56 -67 2 -50 -52 -12 -32 2 -1 -29 0 -69 74 -145 84 -18 31 9 48 -5 9 -43
3961 -43 -115 72 63 -11 95 22 -31 -42 6 66 -88 -47 55 -53 13 -77 -63 3 72 73 70 -61 -62 2 -25 75 24 -103 -22 54 19 -144 118
3672 118 -52 -61 -186 -75 -152 -42 21 -127 -43 -30 50 2 -82 -72 -21 -39 46 30 -67 -103 28 121 -89 -70 -57 -62 0 81 -1 -87 16 79
3392 79 39 -36 -38 38 122 -6 -61 8 -42 14 89 95 59 -10 -74 -67 -31 -147 -48 -22 105 115 71 -107 -59 194 -105 44 16 -90 83 -136
3112 -136 51 13 143 -130 -107 26 264 -79 76 40 35 89 7 40 -41 -83 -29 191 268 174 25 20 20 -6 204 76 -48 26 21 52 -3
2841 -3 60 68 39 108 21 -28 -31 1 -35 -101 1 22 19 -47 18 -5 -59 -106 -134 -60 16 -161 -71 47 6 -59 25 -28 -46 11 51 76 7 -11 -114
2535 -114 -28 -31 -69 1 -42 -57 77 42 -3 71 50 -91 -48 29 105 61 -67 -70 64 65 -19 40 -7 -145 -119 -110 -82 -146 66 -50 6 12 -32 -1
2237 -1 -99 -53 51 -149 10 -142 22 -15 -77 -22 -58 -8 21 -16 19 76 -60 26 161 -79 56 138 52 48 49 -47 -85 37 -57 30 33 -25
1957 -25 17 -40 -38 29 -109 -10 -104 67 23 -34 -56 -109 5 138 28 -50 -25 0 -55 -12 38 -37 83 37 39 -28 -63 -20 51 -5 -132 -36 89
1668 89 28 -50 -60 -50 -9 7 -2 -59 33 -36 -45 -49 74 -38 -144 -14 -75 -13 -83 34 -43 -45 -131 6 -106 21 36 104 34 -80 39 61
1388 61 44 74 23 12 -114 29 -3 -49 3 -69 -88 -8 -79 19 65 91 -48 2 14 127 101 30 9 -75 -34 -11 -41 -10 -47 47 6 46 -30
1100 -30 66 -91 -27 38 -10 29 -3 -59 -67 -118 76 -55 19 13 11 -81 -100 65 11 -12 -68 -84 12 -43 113 75 122 110 -129 -25 -36 12 41
811 41 91 202 115 101 -116 -27 148 42 -74 -43 -70 -35 -24 -25 54 -14 142 9 -100 -128 -22 86 93 -64 14 139 72 -45 -116 -53
548 -53 131 29 -102 15 27 -89 -29 -80 55 -7 -112 -39 -87 9 33 -24 -42 -18 67 61 28 0 -69 -64 -20 -110 0 -33 65 4 -70 -53 28
260 28 -4 -24 -79 -11 -33 -141 -45 66 -5 -30 0 39 -102 -10 -83 -1 46 31 12 35 22 60 -114 -32 -1 35 82 -61 -25 107 59 -41
-20 -41 63 -90 -62 27 52 -162 10 -36 -61 -74 -70 -11 56 30 62 -7 46 48 56 88 111 44 79 -76
-230g6
##PAGE=	F1=3992.92
##FIRST=	23146.756194512010552,	4241.1435120000014649,	0.18058969080448150635
##DATA TABLE=	(F2++(Y..Y)), PROFILE
4241 -23 85 -66 88 -53 2 87 180 96 149 -31 2 -42 23 2 -71 32 -18 19 -1 -58 31 -68 1 -168 77 5 21 0 34 -29 1
3970 1 -85 -138 71 10 -48 35 43 -63 -49 -7 106 -111 -74 58 -37 -30 -127 -116 42 62 64 47 -37 -42 7 -9 98 28 -87 -66 64 -7 -115
3681 -115 100 -12 -36 -169 -117 -134 -25 -4 -121 -104 -60 47 -63 -97 -92 -131 -78 -18 23 -70 -75 42 84 -72 -47 -58 -56 12 119 -18 -113
3410 -113 35 62 51 -81 19 8 122 -7 -53 11 -43 9 93 68 17 -48 -107 -91 -54 -128 -63 -21 133 77 21 -120 -37 128 -120 35
3147 35 10 -79 49 -299 10 -46 125 -120 -71 31 235 -61 114 13 21 107 -10 68 -68 -7 -10 232 321 196 -7 33 49 6 163
2894 163 94 -31 22 58 27 -12 49 97 78 99 21 -57 -54 -18 -25 -81 24 52 41 -62 91 -41 -79 -122 -136 -59 11 -121 -46 100 7 -90
2614 -90 -10 -69 -32 8 25 38 27 -22 -110 0 -11 -81 -53 -15 -38 81 42 31 65 24 -56 -19 28 71 64 -27 -36 115 89 16 21 18 -109 -167 -130
2307 -130 -91 -160 79 -16 10 23 -33 -48 -118 -51 15 -189 -18 -111 7 -4 -40 -15 -33 -52 76 -35 15 84 -93 20 201 -56 61
2054 61 154 38 52 47 -27 -60 21 -104 7 46 -60 22 -10 -79 -18 -128 14 -115 43 62 -21 -52 -97 17 151 69 -46 -82 -33 -95
1791 -95 18 43 -82 108 25 38 -55 -114 -17 40 -2 -112 -36 73 31 -45 -70 -42 -58 18 -12 -43 33 -17 -72 -5 96 -11 -123 1 -27
1520 -27 -58 -76 8 -20 -48 -114 -27 -84 6 15 124 16 -120 89 54 32 28 15 24 -89 40 35 -85 -43 -87 -67 3 -49 28 55 42 -103 27
1231 27 103 131 65 -14 -13 -53 -15 22 -14 -19 -40 18 -2 23 -41 99 -17 6 73 -31 -21 -11 -37 -67 -129 43 -65 2 10 23 -69 -110 47 -11
933 -11 -52 -60 -82 46 -54 106 87 164 109 -147 -20 -40 22 62 83 152 118 95 -150 -73 152 36 -107 20 -12 -28 -22 -24 15 -18 161 -15
653 -15 -104 -118 -23 89 82 -38 26 180 39 41 -91 -2 180 0 -91 -11 53 -87 -73 -68 41 1 -75 -25 -87 0 49 -7 -72 -8 66 49 28
365 28 11 -60 -55 -4 -78 -12 -12 19 -7 -87 -53 26 46 -21 -86 -18 34 -76 -27 30 21 -33 -9 63 -86 16 -57 26 47 0 27 59 16 38 -121
58 -121 -35 -22 33 14 -63 -16 91 61 -55 88 -49 10 -12 20 -137 -2 -113 -61 -75 -100 -35 62 -7 -6 -3 77 55 121 117 126 29 96 -66
-230f6
##PAGE=	F1=3898.57
##FIRST=	23146.756194512010552,	4241.1435120000014649,	0.23672603070735931396
##DATA TABLE=	(F2++(Y..Y)), PROFILE
4241 -12 78 -62 79 -28 11 120 185 90 117 -47 17 -22 47 32 -76 55 -5 10 0 -73 53 -47 -56 -163 78 56 18 -12 22 -64
3979 -64 -1 -105 -152 51 -46 -78 -27 68 -86 -85 -40 135 -115 -86 57 -47 -95 -128 -132 54 30 50 4 4 -5 17 -4 97 35 -54 -86 64
3699 64 -37 -92 49 10 -21 -143 -127 -79 11 -30 -127 -148 -63 42 -119 -117 -103 -200 -105 -68 24 -69 -32 45 39 -66 -25 -43 -58 19 127 -53
3419 -53 -141 43 44 61 -107 76 1 113 -20 -36 14 -12 3 99 55 -18 -77 -130 -73 -73 -102 -68 -26 137 52 -25 -98 -9 64 -120 47 -12
3139 -12 -40 24 -239 3 -96 85 -107 -24 39 168 -40 148 -1 6 93 -27 82 -77 57 36 230 322 197 -27 58 59 1 103
2894 103 89 -10 20 92 -13 -9 32 123 99 98 23 -88 -73 -11 -14 -62 43 103 53 -62 116 -84 -83 -105 -131 -76 1 -77 -5 166 21 -112
2614 -112 -29 -108 -2 11 2 -3 44 -26 -75 31 11 -68 -101 0 -23 65 26 46 41 -11 -14 7 -2 20 54 2 19 137 107 41 0 23 -52 -176 -146
2307 -146 -97 -142 95 6 15 5 -41 -86 -132 -46 -26 -212 -45 -76 20 39 4 -4 0 -94 128 -51 36 96 -113 25 206 -42 59 150 28
2036 28 46 34 -3 -4 15 -105 -25 44 -106 31 38 -110 -51 -131 45 -115 23 62 -6 -39 -71 13 100 106 -36 -120 -41 -122 30 56 -88 117
1756 117 4 45 -75 -148 -52 16 2 -73 -30 62 45 -32 -69 -45 -75 17 -13 3 40 24 -112 24 87 12 -88 11 2 -74 -55 -18 -5 -25 -88
1467 -88 -42 -70 -5 -24 128 -24 -130 117 42 0 -5 -7 26 -50 42 64 -99 -91 -108 -37 14 -9 53 61 -5 -144 35 152 80 14 -65 -5 -35
1178 -35 3 42 7 -20 -2 9 -27 -19 -60 109 39 32 74 -49 -71 -16 1 -52 -117 -6 -33 4 13 23 -46 -63 61 -37 -85 -29 -84 74 -83 70
881 70 77 197 91 -139 7 -24 20 67 56 94 93 80 -147 -97 130 49 -105 68 53 -11 -12 1 -15 -41 149 -46 -77 -69 -8 64 64 -8 34
592 34 184 -7 85 -65 30 202 -23 -66 -31 70 -64 -102 -52 8 26 -22 1 -76 -25 60 17 -82 -21 40 36 -5 25 -52 -48 22 -65 -37 34
303 34 -29 -26 -86 -57 -3 79 -12 -72 -11 86 -12 -21 -12 51 -47 -11 93 -54 35 -22 45 28 -47 32 64 12 4 -116 -36 -43 15 -50 -51 11 78 50 -73
-20 -73 85 0 70 -59 -32 -92 -13 -191 -76 -73 -84 -75 7 -71 -42 19 89 57 164 107 105 1 108 -49
-230d9
##PAGE=	F1=3804.21
##FIRST=	23146.756194512010552,	4241.1435120000014649,	0.045964851975440979004
##DATA TABLE=	(F2++(Y..Y)), PROFILE
4241 -2 48 -38 55 8 47 111 156 64 78 -39 -9 -19 61 45 -64 51 12 -21 -10 -61 56 -6 -93 -136 88 113 40 -23 8 -99 1 -81
3961 -81 -148 23 -86 -84 -72 83 -95 -118 -74 141 -106 -67 37 -88 -147 -82 -104 34 -22 34 -38 59 23 32 -15 61 44 -7 -74 44 -56
3690 -56 -72 -24 15 -20 -114 -101 4 61 -44 -144 -168 -51 32 -149 -128 -101 -213 -106 -86 21 -66 12 33 5 -78 -23 -16 -80 10 101 -91
3419 -91 -159 38 38 59 -118 100 7 97 -31 2 20 33 0 94 64 -42 -79 -143 -12 -65 -77 -66 -41 118 52 -41 -57 13 14 -101 64 -35
3139 -35 6 9 4 29 -117 29 -95 15 49 105 -27 174 4 -10 65 -51 66 -84 69 65 75 167 148 -8 81 46 -4 57 57 8 17 97
2859 97 -47 7 18 131 95 116 26 -115 -94 13 -14 -41 53 157 42 -60 99 -102 -65 -62 -112 -101 -11 -40 40 206 39 -127 -21
2605 -21 -115 42 26 0 -25 48 -28 -27 47 27 -30 -128 -10 -23 31 -4 32 6 -37 25 23 -42 -40 39 11 83 119 107 37 -13 5 -7 -151 -145 -91 -114
2290 -114 111 12 18 -20 -36 -94 -133 -47 -45 -203 -60 -56 51 96 32 -3 24 -116 167 -45 80 105 -121 45 174 -45 50 132 19 21
2027 21 7 21 62 20 -75 -50 31 -145 21 78 -114 -64 -120 70 -109 16 25 8 -25 -44 -1 14 115 -39 -116 -8 -119 25 71 -63
1765 -63 114 -23 49 -81 -156 -91 -14 -5 -38 -23 53 67 -12 -45 -58 -64 -4 -13 50 40 73 -146 22 48 31 -51 12 5 -57 -22 -38 -3 3 -53 -28
1458 -28 -79 -6 -58 98 -74 -125 103 35 -16 -9 -32 22 -11 40 83 -86 -120 -121 -12 15 20 91 80 -25 -156 25 151 2 -19 -116 24
1187 24 -22 23 48 27 -23 37 28 -50 -56 -74 89 66 37 46 -46 -104 -7 62 -19 -88 -67 13 10 19 9 -8 31 88 -48 -93 10 -91 77 -128 17
881 17 58 221 74 -99 50 4 -1 44 18 42 58 70 -103 -92 86 64 -78 78 106 33 9 31 -30 -68 111 -86 -36 -5 10 25 43
610 43 -2 42 144 -40 75 -71 36 201 -39 -33 -33 61 -20 -100 -46 -22 68 28 28 -75 -77 61 40 -63 -55 -6 19 -60 30 -51 -25 60 -78
321 -78 -62 74 -64 -53 -64 -48 -34 75 -14 -42 10 109 16 -30 -40 70 -66 0 117 -27 37 21 50 9 -74 28 46 7 -18 -102 -41 -67
41 -67 -8 -74 -28 50 85 14 -82 57 34 90 -80 -80 -27 -27 -239 -100 -63 -30 -121 -77 -135 -37 55 78 49 171 60 69 -21 108 -34
-230c4
##PAGE=	F1=3709.86
##FIRST=	23146.756194512010552,	4241.1435120000014649,	0.11204014718532562256
##DATA TABLE=	(F2++(Y..Y)), PROFILE
4241 12 11 -2 24 37 88 72 119 34 49 0 -60 -32 63 60 -41 37 36 -58 -39 -27 39 47 -105 -100 90 156 84 -30 -11 -115 10 -16 -121 0
3944 0 -96 -65 -86 76 -89 -121 -79 129 -88 -21 3 -145 -155 -15 -52 -5 -75 17 -63 116 39 53 -29 -3 55 38 -39 11 -60 -48 -97 4
3664 4 -23 -80 -52 83 104 -45 -163 -179 -46 10 -146 -118 -90 -177 -78 -66 2 -58 47 10 -11 -88 -47 10 -116 -1 61 -116 -156 18 45
3392 45 44 -128 88 9 69 -21 56 32 73 -3 78 88 -50 -53 -141 72 -23 -50 -56 -58 97 67 -20 -18 34 -17 -61 67 -44 36 -1 252 63
3104 63 -106 -24 -87 37 47 75 -25 191 26 -26 42 -84 19 -101 22 46 -223 -128 62 48 83 14 8 42 7 20 16 64 -58 27
2841 27 15 118 73 144 32 -143 -120 38 -26 -17 53 194 10 -70 62 -80 -36 -18 -85 -113 -20 -13 78 198 46 -136 1 -77 89 53
2579 53 23 -20 34 -25 13 31 38 19 -127 -38 -35 -4 -35 -4 -27 -36 61 38 -55 -89 27 4 129 63 79 2 -11 -18 -1 -111 -115 -71 -101 113 7
2272 7 21 -23 -5 -68 -117 -56 -34 -164 -59 -54 75 136 37 -13 17 -118 184 -1 127 104 -120 69 117 -60 37 102 8 -18 -29 38 115
2001 115 24 -46 -56 11 -154 -17 87 -91 -67 -100 77 -101 18 -12 16 -8 -18 -15 -54 94 -56 -73 56 -89 19 71 -26 105 -49
1747 -49 43 -75 -142 -108 -47 -27 -15 -9 40 84 6 -11 -73 -50 -50 -22 67 30 111 -155 -9 -4 46 -11 9 -3 -31 1 -43 -6 22 -16 13 -107 3
1441 3 -66 37 -111 -120 61 46 2 8 -42 23 13 31 90 -57 -118 -115 6 7 32 128 101 -6 -134 2 118 -64 -17 -151 54 -14 47 52
1161 52 46 -42 53 60 -59 -60 -84 47 69 17 14 -16 -108 12 125 27 -45 -121 40 -7 19 -11 40 128 100 -40 -69 44 -93 58 -175 -32
881 -32 47 226 57 -41 82 31 -45 0 -20 2 30 71 -45 -71 27 63 -45 56 137 104 32 46 -35 -76 61 -119 -10 40 15 -5 21
610 21 -29 50 82 -36 36 -111 30 190 -49 -4 -17 31 29 -60 -50 -26 113 55 33 -96 -139 50 47 -27 -90 -54 -3 -113 18 -59 21 98
330 98 -111 -84 82 -83 -85 -26 -18 -40 32 -34 -5 37 101 -5 -41 -50 68 -75 28 124 -23 30 66 43 -6 -59 17 3 -2 -7 -85 -56 -95 -28
32 -28 -53 -7 78 111 -36 -74 24 37 59 -60 -94 41 -46 -238 -117 -48 22 -155 -149 -174 -15 87 47 24 141 -7 45 -23 90 -25
-230b5
##PAGE=	F1=3615.51
##FIRST=	23146.756194512010552,	4241.1435120000014649,	0.41654071211814880371
##DATA TABLE=	(F2++(Y..Y)), PROFILE
4241 28 -21 28 0 46 108 30 90 22 34 55 -108 -43 60 84 -15 38 54 -80 -80 10 9 104 -94 -61 66 175 126 -26 -34 -104 23 61 -79
3952 -79 -15 -76 -34 -78 47 -69 -84 -39 119 -69 29 -23 -193 -114 38 -5 -45 -96 5 -66 158 58 75 -21 -69 68 72 -2 -15 -52 -19
3681 -19 -150 -17 -21 -33 -8 120 114 -43 -166 -194 -52 -18 -107 -92 -76 -105 -27 -21 -26 -41 61 -8 -16 -76 -81 22 -145 3 38 -111 -131 -9
3401 -9 59 22 -133 62 0 32 9 97 52 93 -16 59 105 -44 -18 -115 146 38 -16 -37 -61 94 82 21 8 59 -17 -8 50 -40 39 -3 413
3112 413 77 -77 -53 -84 43 26 75 -24 193 51 -39 35 -120 -39 -126 -48 7 -479 -371 4 121 55 -27 41 58 -33 23 18 16 -42 41
2841 41 27 90 47 155 38 -177 -143 52 -37 9 46 198 -22 -88 27 -25 -12 5 -61 -99 -17 9 93 153 34 -138 22 -14 117 83
2579 83 65 4 7 -16 32 -15 48 64 -97 -60 -42 -27 -46 -45 -46 -3 93 59 -21 -102 18 -6 140 0 28 -45 1 -31 -30 -76 -66 -51 -104 96 0
2272 0 24 6 41 -22 -86 -66 -7 -108 -48 -58 70 140 31 -23 -19 -111 176 63 148 94 -115 78 54 -79 23 63 -6 -59 -63 44 131 15
1992 15 -41 -47 -16 -125 -71 62 -56 -71 -71 64 -92 23 -18 17 13 6 -12 -70 59 -78 -22 122 -56 31 45 4 92 -64 35 -59 -115 -99
1712 -99 -73 -49 2 12 15 84 16 8 -76 -55 -112 -46 50 19 123 -135 -52 -54 55 36 14 0 -24 0 -35 0 23 11 67 -136 16 -45 -30 -121
1415 -121 -122 16 70 46 22 -28 38 14 9 85 -32 -96 -93 23 -7 33 143 108 36 -92 -27 79 -95 13 -155 73 -4 73 65 62 -73 41
1135 41 84 -44 -30 -98 4 64 -14 -1 25 -85 24 155 71 3 -145 31 -61 2 -35 82 177 93 -17 -20 69 -75 33 -202 -65
881 -65 52 202 34 16 83 36 -101 -43 -51 -23 17 79 -3 -46 -33 37 -20 25 143 173 44 46 -29 -50 13 -124 -15 47 4 -16 5 -65 54
592 54 28 3 1 -158 39 178 -52 11 2 3 70 6 -52 2 136 47 7 -129 -178 28 33 0 -108 -82 -29 -143 -8 -80 76 116 -147 -111
312 -111 58 -88 -109 15 20 -12 -28 -62 23 57 79 -62 -40 -53 52 -66 70 117 -46 30 104 28 -31 -15 6 -53 -19 36 -74 -85 -124
41 -124 -36 -10 5 74 138 -83 -55 6 14 -6 -10 -65 94 -62 -193 -116 -39 31 -159 -180 -175 -9 91 10 -11 88 -69 37 -3 61 -19
-230a9
##PAGE=	F1=3521.15
##FIRST=	23146.756194512010552,	4241.1435120000014649,	0.32466769218444824219
##DATA TABLE=	(F2++(Y..Y)), PROFILE
4241 33 -40 43 -6 41 94 3 75 39 25 104 -124 -35 60 104 7 63 53 -82 -107 34 -23 144 -59 -20 15 168 138 -5 -42 -64 46
3970 46 116 -34 -24 -32 -7 -66 9 -37 -24 29 124 -51 65 -20 -208 -43 53 18 -70 -71 5 -62 173 93 91 15 -111 83 90 22 -23 -36 4
3681 4 -177 -48 -12 23 9 96 82 -50 -140 -205 -51 -37 -45 -58 -62 -16 28 25 -48 -14 48 -18 -21 -36 -101 26 -145 29 48 -73 -93 -33 72
3392 72 8 -123 47 -17 0 43 95 72 92 -41 47 99 -26 7 -59 181 95 22 -24 -40 104 90 57 25 85 14 43 20 -32 27 9 485
3112 485 65 -40 -41 -89 44 -8 85 -10 169 68 -47 33 -144 -90 -144 -98 -5 -528 -409 3 177 9 -61 78 100 -28 21 18 -17
2859 -17 -10 45 52 63 28 123 39 -213 -146 52 -31 25 34 167 -35 -92 11 41 -1 1 -48 -64 2 31 78 99 8 -128 29 36 115 106 117 43 -16
2552 -16 -6 28 -74 61 95 -56 -59 -24 -32 -33 -71 -43 39 119 83 52 -73 0 -11 121 -38 -18 -79 15 -32 -65 -65 -19 -45 -105 63 -4 25 45
2255 45 79 16 -51 -66 10 -49 -42 -57 30 115 27 -16 -66 -105 142 105 127 83 -102 61 4 -93 3 24 -15 -77 -76 44 107 -9 -54 -35 -57 -68
1957 -68 -112 15 -26 -81 -30 43 -77 23 7 18 33 21 15 -35 34 -96 0 155 -40 66 2 24 74 -60 35 -37 -82 -75 -90 -58 19 34
1677 34 -17 59 11 0 -61 -80 -174 -82 14 14 114 -97 -88 -89 46 90 34 21 -49 -20 -19 23 12 22 105 -143 21 -13 -74 -109 -134 -13 96 88
1380 88 22 2 69 -1 -20 68 -32 -70 -70 45 -24 33 129 94 70 -48 -62 43 -89 48 -116 85 11 93 82 64 -103 14 84 -6 13
1108 13 -120 -27 58 -36 -5 54 -50 15 132 94 44 -129 -5 -130 -25 -59 95 159 83 4 40 81 -31 17 -199 -72 63 152 1
855 1 56 52 17 -144 -66 -65 -42 13 86 10 -21 -77 -4 -6 4 120 199 36 38 -12 -2 -23 -92 -39 22 -6 -12 3 -76 49 -5 52 -15 -186 67 161
540 161 -40 6 11 1 88 67 -38 35 118 18 -43 -142 -163 1 -3 -1 -102 -90 -53 -148 -39 -110 116 99 -169 -149 23 -79 -110 57 42
268 42 27 -72 -72 36 62 69 -120 -23 -59 34 -39 118 103 -82 41 132 6 -73 35 4 -104 -42 90 -70 -124 -143 -31 17 9 34 141
-3 141 -110 -37 8 -16 -72 36 -18 111 -62 -124 -95 -51 -16 -130 -168 -148 -32 58 -18 -38 28 -105 28 25 30 -13
-230a3
##PAGE=	F1=3426.8
##FIRST=	23146.756194512010552,	4241.1435120000014649,	-0.15749536454677581787
##DATA TABLE=	(F2++(Y..Y)), PROFILE
4241 21 -45 40 0 34 54 -7 66 77 9 120 -96 -9 63 102 23 104 31 -75 -99 52 -47 150 -8 26 -38 139 109 26 -19 -7 77 129
3961 129 4 -25 20 11 -58 -22 -2 33 89 139 -38 79 10 -180 23 29 20 -81 -15 18 -71 158 138 93 69 -117 102 99 33 -8 -13 12 -186
3672 -186 -78 -5 78 0 35 22 -69 -85 -189 -18 -31 21 -22 -36 68 66 53 -49 14 6 -20 -28 10 -90 35 -113 62 82 -10 -58 -39 82
3392 82 5 -89 58 -31 -7 52 47 77 72 -72 45 71 2 22 17 165 121 58 -31 4 97 94 70 35 99 35 78 -8 -28 24 28 469 38 1 2
3086 2 -93 46 -43 85 18 118 74 -49 25 -146 -125 -144 -115 -19 -508 -417 -22 192 -33 -66 110 153 30 29 5 -23 21 42 81 48 15
2815 15 48 30 -233 -115 41 1 20 20 111 -23 -65 21 95 1 -20 -43 -26 32 52 41 61 -13 -104 29 43 84 112 161 92 -19 3 12 -115
2526 -115 71 113 -25 -36 22 -28 -10 -76 -20 65 131 95 128 -18 -36 -11 96 -33 -35 -89 19 -33 -77 -80 -4 -54 -83 30 -6 21 60 83
2246 83 24 -19 -54 7 -1 -52 -49 -34 80 34 11 -100 -101 91 88 77 81 -80 19 -23 -92 -21 -6 -12 -62 -59 47 61 -39 -69 -32 -108 -10 -127 -35
1940 -35 -13 -91 14 32 -56 17 34 31 40 12 61 20 25 -109 -18 143 -39 116 -35 31 42 -35 49 -8 -49 -61 -95 -54 28 44 -48 10 -6 -31
1642 -31 -33 -109 -216 -123 -20 17 95 -62 -105 -101 13 135 66 41 -92 -41 0 59 -1 18 108 -114 13 4 -83 -92 -154 -36 110 100 19 33
1362 33 109 -18 -46 47 -58 -47 -57 68 -43 35 102 67 67 -17 -100 4 -60 66 -47 104 37 98 86 41 -122 -10 62 48 39 -144 -46
1091 -46 48 -34 -10 60 -18 -14 66 88 61 -88 -45 -171 -52 -75 74 97 88 15 90 79 22 10 -180 -54 62 91 -32 66 1 -10 -152 -61
811 -61 -53 -61 7 83 5 4 -88 -48 2 0 72 160 11 30 13 40 -48 -36 -51 -7 -1 -7 13 -45 32 -21 88 -25 -186 90 135 -11 -23 3 31 76
496 76 89 -10 39 64 2 -95 -111 -99 -19 -51 -27 -81 -92 -73 -135 -62 -132 127 51 -167 -189 -3 -53 -81 95 31 46 -75 -45 30 56 83 -146
207 -146 -8 -67 24 -5 155 88 -107 47 151 -17 -121 73 12 -129 -68 125 -69 -160 -137 -13 13 11 -18 116 -115 -25 22 -42 -107
-47 -107 56 17 89 -36 -53 -63 -88 -94 -83 -134 -108 -67 0 -25 -34 -21 -102 0 40 3 -5
-230e
##PAGE=	F1=3332.44
##FIRST=	23146.756194512010552,	4241.1435120000014649,	-0.41478115320205688477
##DATA TABLE=	(F2++(Y..Y)), PROFILE
4241 0 -45 29 5 34 6 -18 56 110 -21 93 -39 21 67 72 33 142 1 -65 -53 80 -54 111 39 71 -72 93 54 46 27 45 109 109
3961 109 37 -13 66 23 -46 -39 26 67 106 143 -29 82 46 -115 62 -20 11 -79 36 37 -93 119 173 82 109 -102 122 102 32 18 19 7
3681 7 -188 -95 -9 115 -17 -18 -35 -92 -17 -136 46 -4 71 11 9 126 78 51 -37 29 -51 -26 -34 33 -58 56 -72 79 113 53 -35 -22 92
3392 92 8 -46 85 -38 5 24 -27 62 43 -97 51 43 35 36 89 106 110 80 -59 57 51 97 62 39 100 2 93 -29 -28 42 33 369 17 44
3095 44 48 -83 46 -67 70 46 58 67 -41 6 -129 -136 -130 -120 -105 -706 -700 -169 159 -58 -33 130 178 96 46 -26 -10 45 34 94 45 4
2815 4 -40 13 -220 -50 24 51 -5 9 50 0 -12 44 119 10 -41 -43 -6 64 66 -1 41 -17 -71 36 13 40 100 178 146 1 10 -2 -122 64
2517 64 118 -20 -9 74 -30 7 -67 7 52 125 79 172 41 -82 -8 89 1 -13 -77 12 -46 -58 -112 -28 -64 -39 3 -6 15 38 54 -4 9 -37
2220 -37 -8 29 -74 -40 -99 52 54 42 -114 -92 38 18 29 90 -52 -33 -33 -71 -37 -21 -2 -26 -20 58 18 -62 -67 -31 -151 21 -120 -77 -16
1931 -16 -98 47 37 -35 10 33 58 34 -25 100 61 23 -117 -59 104 -38 160 -49 27 -6 0 71 26 -24 -71 -87 -49 20 43 -65 -48 -29
1651 -29 -64 -5 -123 -223 -149 -37 21 76 -40 -102 -91 -38 153 94 36 -124 -45 18 85 -5 12 84 -52 -8 -2 -65 -74 -174 -63 108 73
1380 73 37 56 145 -28 -61 34 -85 -25 -50 87 -66 37 92 45 26 0 -130 -36 -29 69 23 132 64 89 66 -4 -125 -23 30 100 31
1108 31 -161 -54 35 -10 -28 48 4 -44 -9 61 51 -44 -68 -153 -68 -76 33 31 108 9 117 64 64 0 -171 -19 41 36 -53 47 -46 -25 -119 -36
811 -36 -17 -83 -9 66 -2 24 -66 -82 9 5 16 80 -19 17 34 56 -67 17 -26 -20 21 -13 24 13 11 -30 107 -42 -165 84 106 20 -73 -15 76
505 76 36 56 14 6 6 30 -117 -38 -21 -21 -85 -65 -59 -96 -89 -117 -68 -123 117 -3 -145 -209 -21 -16 -34 126 -8 31 -32 14 7 46 107 -130 -18
198 -18 -70 18 30 171 74 -105 27 151 -35 -150 94 22 -125 -94 128 -61 -180 -97 14 -16 8 -52 76 -105 -12 33 -56 -98 46
-55 46 27 46 7 5 -31 -134 -155 -41 -104 -68 -93 -64 -15 0 -48 -66 -48 26 -20 0
-230@
##PAGE=	F1=3238.09
##FIRST=	23146.756194512010552,	4241.1435120000014649,	-0.25079619884490966797
##DATA TABLE=	(F2++(Y..Y)), PROFILE
4241 -12 -43 17 7 39 -29 -40 41 116 -62 34 11 40 64 28 37 158 -17 -47 13 125 -47 40 59 101 -70 41 -2 36 73 77 131 84 71
3952 71 16 94 27 -18 -41 45 68 70 121 -25 86 60 -35 63 -71 -4 -66 59 51 -109 69 179 72 112 -87 136 102 25 43 60 2
3681 2 -188 -90 -31 122 -23 -31 -67 -107 44 -69 115 26 100 42 72 145 70 30 -27 19 -99 -40 -32 22 -28 79 -53 75 114 92 -28
3410 -28 9 95 5 -13 108 -41 18 -28 -99 38 18 -104 60 39 61 59 131 32 72 84 -89 99 -27 97 47 35 103 -42 81 -45
3147 -45 -23 74 15 232 19 76 66 -51 39 -74 52 57 16 47 -23 -13 -104 -113 -105 -124 -208 -940 -1010 -303 109 -59 24 123 156 112 52 -68
2867 -68 8 61 21 81 45 -9 -105 -1 -173 31 6 98 -37 12 4 15 40 60 105 33 -42 -45 -13 89 70 -32 35 1 -44 62 -17 9 77
2579 77 157 190 34 20 -10 -98 34 111 -36 6 98 -45 21 -59 21 8 104 39 168 91 -114 7 105 40 33 -55 4 -73 -22 -141 -81 -58
2299 -58 2 -19 -9 10 2 10 -58 40 -26 -27 40 -84 -30 -140 35 82 42 -122 -78 5 -59 9 107 -24 -73 -32 -35 -20 -19 5 3 12 69 -1 -78 -45
1983 -45 -20 -162 18 -102 -97 -28 -101 50 56 -17 10 8 86 23 -82 106 71 14 -117 -84 63 -26 176 -39 15 -68 35 88 61 -10 -102
1712 -102 -66 -53 0 42 -55 -97 -50 -85 12 -118 -194 -140 -27 20 56 -30 -87 -64 -85 139 100 9 -127 -27 39 80 13 18 60 22 -38 -31 -35 -51
1415 -51 -177 -93 95 23 84 78 163 -33 -71 37 -80 -6 -36 93 -87 39 117 40 -26 12 -136 -67 -10 72 68 154 80 76 30 -59 -117 -23
1135 -23 -1 135 0 -160 -55 24 17 -63 36 29 -55 -64 32 26 -9 -70 -83 -75 -63 -2 -12 123 -10 121 41 75 -20 -177 22 13 -2 -49 10 -75
837 -75 -15 -60 -4 23 -101 -37 36 -6 29 -27 -92 14 14 -25 8 -41 -8 37 45 -84 51 34 -14 43 -28 18 61 -8 -32 123 -60 -131 49
548 49 85 30 -132 -32 106 -18 -13 23 -39 -23 102 -91 48 30 7 -74 -96 -46 -98 -103 -95 -53 -77 101 -36 -114 -198 -39 14 11 142 -51
268 -51 -2 36 81 -22 38 114 -82 -54 -69 3 62 164 58 -73 -24 118 -41 -141 100 17 -107 -112 108 -41 -172 -33 44 -42 -1
15 -1 -50 47 -88 13 37 -59 -57 24 20 6 45 48 -3 -164 -160 -17 -92 -37 -103 -109 -1 41 -46 -15 -91 -10 -42 2
-230B
##PAGE=	F1=3143.74
##FIRST=	23146.756194512010552,	4241.1435120000014649,	-0.06550286710262298584
##DATA TABLE=	(F2++(Y..Y)), PROFILE
4241 -3 -36 9 15 35 -41 -72 24 92 -99 -23 27 41 47 -11 37 137 -21 -17 75 170 -31 -31 45 103 -43 -3 -42 -2 92 83 139 76 106 57 96 16
3926 16 27 -33 58 43 6 84 -30 93 45 28 35 -100 -30 -42 48 58 -95 17 157 75 75 -79 140 94 19 59 96 9 -187 -60 -62 100
3646 100 -7 0 -67 -107 82 -26 147 42 112 67 131 128 59 7 -25 -7 -115 -59 -26 -7 -17 88 -68 65 79 86 -38 35 81 -7 -3 108
3366 108 -46 8 -80 -148 24 12 -86 69 67 65 87 134 -17 32 71 -95 120 -99 88 38 18 119 49 17 -66 -13 93 -12 131 40
3104 40 79 44 -4 23 -58 48 49 7 22 1 -26 -76 -52 -59 -85 -44 -203 -183 23 102 -43 73 52 156 134 24 -99 23 76 6 42 39
2824 39 -24 -121 -7 -114 102 -6 123 -55 34 -17 11 65 61 58 64 -13 -51 -39 109 66 -47 32 33 -31 100 -18 3 53 108 209 60
2552 60 34 -9 -63 -5 85 -53 18 75 -65 40 -64 7 -36 81 -7 133 126 -110 48 131 63 82 -25 12 -98 12 -154 -137 -34
2299 -34 20 -48 -26 10 -8 -23 -106 76 -24 -45 32 -60 -15 -141 27 108 -8 -142 -63 5 -93 14 129 -3 -82 -19 2 31 0 3 10 18
2019 18 70 4 -93 -8 5 -125 -2 -81 -85 -39 -95 25 83 -3 24 -7 95 19 -128 68 56 -4 -100 -71 39 -4 156 -19 3 -125 57
1747 57 92 90 -3 -135 -36 -61 -8 58 -17 -119 -65 -92 18 -96 -142 -86 7 10 33 -20 -72 -31 -107 107 80 -15 -102 1 64 38 57 36 59
1458 59 81 -62 -65 1 -14 -148 -107 75 -20 141 111 160 -34 -84 51 -34 6 -9 79 -101 46 164 51 -53 31 -110 -74 -2 87 82
1196 82 152 71 65 -3 -99 -102 -23 -33 142 -35 -140 -48 22 33 -108 36 66 -35 -82 14 15 26 -63 -7 -79 -46 -19 -31 113 -35 119 22
916 22 55 -44 -178 62 -3 -29 -22 -22 -76 14 0 26 43 -106 -69 -3 -12 13 11 -74 17 22 -37 -22 -47 -46 22 23 -97 65 106 -1 44 -41 -11 69
601 69 -20 -18 141 -60 -87 8 77 0 -180 -37 100 -68 -80 17 -65 -20 178 -25 110 39 64 -7 -108 -44 -88 -113 -72 -20 -10 91 -39
330 -39 -88 -165 -60 17 31 134 -75 -29 97 126 -49 33 90 -19 -91 -68 -35 82 144 42 -26 -85 48 -35 -107 91 -9 -89 -120 82
67 82 -9 -138 25 65 -40 -20 -19 47 -67 48 34 -46 2 10 10 -14 52 76 18 -157 -103 -8 -101 -25 -109 -123 2 57 -28 30 -109 -50 -58 0
-230@
##PAGE=	F1=3049.38
##FIRST=	23146.756194512010552,	4241.1435120000014649,	-0.13615533709526062012
##DATA TABLE=	(F2++(Y..Y)), PROFILE
4241 22 -16 3 40 13 -31 -101 7 55 -118 -43 0 29 14 -37 38 85 -24 21 110 189 -15 -68 12 84 -10 -29 -63 -51 80 74 132 87 130
3952 130 89 77 -9 72 -19 72 3 -51 56 -39 97 18 53 -4 -94 -70 -12 19 64 -49 -27 119 90 22 -65 133 73 21 70 106 25 -175
3672 -175 -21 -90 61 23 44 -50 -95 83 -25 126 36 111 81 163 91 53 -2 -23 -29 -88 -75 -25 -32 -23 79 -96 67 25 32 -60 37 38 -24
3384 -24 -7 82 -54 -23 -109 -171 28 29 -47 75 109 39 103 105 -18 10 46 -68 119 -126 72 39 -18 136 418 -126 -101 -4 75 -31
3121 -31 100 62 49 -1 35 9 -12 68 39 29 8 23 -26 -44 35 24 55 718 2645 3056 1253 183 -20 81 -103 333 339 -23 -101
2867 -101 40 93 2 -4 26 -37 -92 -4 -77 133 -15 114 -44 66 -26 0 56 54 -2 91 42 -56 -70 126 57 -48 26 64 -29 132 10
2596 10 18 33 62 193 68 46 -4 -38 -29 41 -53 40 17 -74 73 -81 -25 -48 65 -45 94 140 -73 111 142 68 116 10 34 -99 33
2325 33 -147 -176 -4 11 -83 -62 16 23 -35 -123 112 -26 -65 12 -6 17 -101 22 118 -96 -176 -55 31 -69 26 148 7 -56 11 30
2062 30 93 25 -4 -3 -5 58 24 -111 28 38 -45 -16 -54 -41 -40 -79 -8 113 15 49 13 74 21 -139 1 35 -20 -60 -24 31 11 112 -2
1773 -2 0 -154 61 84 111 11 -149 -6 -57 10 91 39 -105 -73 -91 20 -64 -85 -4 54 -9 11 -2 -67 -9 -100 76 49 -18 -65 31 91
1493 91 -28 110 59 88 106 -70 -88 46 28 -80 -93 42 -34 175 154 142 -24 -95 58 36 2 16 45 -100 58 195 64 -34 50
1240 50 -60 -53 5 105 78 120 43 60 -19 -105 -79 -32 -69 123 -52 -111 -36 20 36 -148 40 111 8 -70 12 35 73 -61 31 -80 -33
968 -33 -24 -38 79 -55 122 11 21 -55 -148 93 0 -54 10 -36 -54 43 41 57 27 -99 -98 -45 -25 -8 37 -31 19 30 -25 -17 -42 -77 6 4 -101
662 -101 69 164 4 25 -44 -50 34 -25 23 153 -29 -40 -12 69 -69 -196 -23 61 -90 -103 8 -57 1 201 44 126 15 125 90
408 90 -96 -48 -64 -110 -49 16 46 79 -22 -74 -127 -70 -12 16 101 -76 -35 119 130 -63 36 54 40 -96 -71 -98 84 127 32 14 -121 -37
128 -37 -27 -77 65 -50 -73 -115 58 20 -92 52 67 -3 -37 15 74 -48 80 25 -14 67 12 -4 -19 23 91 31 -116 -14 1 -114 -34
-143 -34 -121 -103 -5 37 -14 52 -99 -74 -63 -3
-230c
##PAGE=	F1=2955.03
##FIRST=	23146.756194512010552,	4241.1435120000014649,	-0.21247775852680206299
##DATA TABLE=	(F2++(Y..Y)), PROFILE
4241 50 15 -1 84 -22 -12 -115 -1 21 -113 -9 -50 12 -27 -53 46 26 -43 52 105 167 -2 -50 -13 66 7 -36 -68 -86 53 68 114 96
3961 96 128 88 46 -38 98 -2 82 -44 -79 59 -44 88 0 34 -40 -60 -114 10 -8 72 5 -60 81 103 -21 -30 119 39 29 84 80
3690 80 38 -145 6 -106 24 54 67 -30 -77 50 -52 66 18 90 82 157 52 42 2 -10 -28 -34 -88 -33 -41 -36 63 -107 84 -14 -46 -87
3410 -87 14 -26 -32 -8 39 -58 -53 -113 -172 41 56 -5 68 137 -7 94 65 28 8 20 -23 106 -97 49 40 -74 129 1031 -330 -146
3147 -146 -2 14 -33 117 66 5 -39 47 8 57 105 50 62 21 33 -17 -5 114 137 303 2068 7498 8553 3272 332 0 41
2911 41 -316 760 828 -53 -82 64 108 19 -39 17 -43 -37 3 -79 114 -22 74 -11 92 -39 -2 30 58 -49 103 112 -55 -88 137 42
2649 42 -41 15 91 -27 138 39 31 18 45 154 64 46 3 -32 -17 -5 -36 74 -46 -62 105 -101 -54 -13 62 -72 64 128 -22 172
2386 172 120 64 134 45 50 -66 41 -127 -185 16 -9 -113 -107 25 80 -30 -100 136 -23 -86 -12 51 66 -36 14 100 -179 -212 -59 59
2124 59 -9 28 151 3 -6 64 43 128 45 -10 -15 -37 38 43 -125 43 59 48 -10 -18 20 -32 -57 -25 143 45 78 61 33 16 -108 -56 23 -21
1826 -21 0 26 31 13 66 8 11 -141 50 69 120 41 -142 15 -32 52 125 92 -60 -72 -87 19 -24 -42 72 87 -35 0 16 -77 -8 -76
1546 -76 52 28 -6 -35 53 111 -93 148 75 129 95 -57 -93 94 57 8 -51 -1 -15 163 179 120 7 -90 37 93 -16 19 0 -81 68
1275 68 183 61 17 52 -10 -17 22 101 73 71 13 64 -20 -74 -46 -47 -106 86 -47 -86 -25 9 36 -157 30 145 60 -40 17 82 125 -65
995 -65 22 -69 -28 -36 -39 39 -62 121 5 -8 -44 -81 113 12 -74 29 -28 -26 57 62 82 -18 -89 -122 -74 -38 -17 50 21 18 44 -5 -11 -41 -83
688 -83 7 -7 -89 68 198 1 3 -38 -74 -22 -28 87 142 22 3 -7 48 -149 -170 5 8 -73 -76 4 -24 18 145 77 96 -21 157 171 -57
400 -57 -45 -30 -90 -35 41 70 54 -5 -64 -92 -54 -57 -29 54 -66 -28 90 97 -57 49 39 82 -59 -70 -161 64 118 33 36 -113 -99 -25 -78 23
102 23 -85 -54 -96 28 35 -53 40 52 45 -44 35 108 -37 92 12 33 130 23 -32 -18 -21 95 34 -68 62 29 -111 -56 -129 -61 -17 0 -17
-187 -17 50 -74 -82 -55 -5
-230e
##PAGE=	F1=2860.68
##FIRST=	23146.756194512010552,	4241.1435120000014649,	-0.08027312159538269043
##DATA TABLE=	(F2++(Y..Y)), PROFILE
4241 61 50 -7 132 -55 -1 -111 -1 -4 -89 59 -88 -4 -62 -65 56 -6 -79 62 63 113 6 8 -14 62 5 -36 -61 -101 29 82 92 83 93
3952 93 54 15 -53 97 15 72 -98 -75 87 -32 62 -1 -9 -71 -20 -142 19 -21 75 43 -74 55 95 -39 22 100 -4 31 102 27 41
3681 41 -94 6 -103 7 70 48 -15 -60 1 -71 5 -1 40 71 123 22 5 14 12 0 20 -101 -48 -39 -51 46 -87 97 -19 -113 -101 -15 -84
3392 -84 -29 6 -10 -54 -55 -101 -151 45 65 17 44 127 -60 62 32 93 14 5 14 92 -39 23 31 -131 103 1658 -491 -180 -4 -63 -22
3121 -22 147 48 -17 -43 30 21 128 137 89 86 60 20 -6 31 153 234 558 3460 12375 14042 5222 466 14 -16 -509 1241 1381
2885 1381 -63 -64 88 108 52 -53 16 -40 17 16 -113 52 -32 14 21 100 -69 12 9 80 -57 95 171 -47 -86 135 17 -30 -2 110
2622 110 -9 107 40 23 9 60 116 67 31 16 -35 26 -30 -17 101 -90 -33 117 -112 -66 49 72 -96 36 88 20 196 69 58
2369 58 137 64 32 -14 39 -103 -161 20 -22 -120 -131 35 122 -20 -50 139 -15 -99 -32 76 116 35 4 58 -215 -227 -68 64 46 20
2106 20 127 -11 46 125 42 116 46 -9 -16 -52 24 55 -123 24 56 114 3 19 69 -24 -40 -13 162 86 93 100 -10 -2 -56 -71 21 -5 64 53
1808 53 26 10 41 11 23 -101 29 51 111 74 -124 28 6 90 141 118 -4 -59 -78 13 15 -23 110 79 -60 4 24 -99 -28 -55 30 26
1528 26 1 -18 68 110 -136 149 80 157 65 -33 -80 126 48 87 0 -45 18 110 161 99 63 -55 -10 110 -37 -10 -40 -51 66 133 36 67
1248 67 27 22 17 45 66 66 27 2 81 -21 -21 -9 -54 -133 38 -23 -74 -23 -11 46 -118 -4 149 105 -3 20 127 155 -69 -11 -48 -25 -66
960 -66 -26 18 -56 93 -3 -21 -24 -6 121 19 -78 25 -11 -8 55 71 95 -74 -91 -138 -77 -35 -5 53 59 10 69 12 -29 -52 -54 27 -17 -61 65
653 65 207 -9 -7 -29 -66 -77 -35 151 108 67 39 10 16 -207 -111 39 -30 -21 -25 2 15 25 40 55 44 -51 139 193 -1 -29 3 -54 -35 39
356 39 70 13 4 -49 -54 -13 -92 -90 17 -63 -22 23 43 -36 67 54 93 1 -51 -192 29 114 39 37 -72 -105 -29 -109 -25 -99 -33 -65 -12 29 -33
50 -33 6 33 69 -41 40 125 -44 79 0 81 181 30 -70 -16 -53 86 34 -43 95 76 -78 -74 -117 -10 -28 -31 -34 31 -46 -87 -40 0
-230@
##PAGE=	F1=2766.32
##FIRST=	23146.756194512010552,	4241.1435120000014649,	0.11704155802726745605
##DATA TABLE=	(F2++(Y..Y)), PROFILE
4241 53 78 -15 162 -67 -6 -91 9 -22 -58 122 -90 -21 -73 -77 59 3 -109 52 -4 48 12 76 3 66 -10 -43 -51 -99 13 112 69 43
3961 43 35 6 -7 -43 80 23 32 -153 -57 116 -2 23 -1 -54 -102 -5 -146 19 -17 58 54 -67 40 57 -37 66 78 -54 19 115 -28
3690 -28 35 -29 -16 -81 11 56 -10 -10 -51 -40 -54 -26 -24 -37 48 75 8 -60 30 38 41 52 -114 -55 -42 -70 28 -49 82 6 -130 -87 -29 -106 -21 29
3375 29 -54 -49 -25 -80 -107 30 33 5 3 78 -99 19 15 140 12 1 28 79 7 -7 13 -157 99 2013 -487 -177 3 -121 -11 179
3112 179 22 -4 -10 -3 38 160 143 132 90 104 -13 3 52 144 265 677 4124 14574 16471 6020 491 18 -56 -602 1407
2894 1407 1554 -100 -70 99 81 83 -57 24 -27 57 35 -151 -26 -47 -49 30 92 -105 36 4 104 -25 72 199 -44 -65 106 -17
2649 -17 -22 -20 116 26 51 15 -4 6 87 98 82 11 37 -33 74 -17 -8 100 -106 -7 100 -100 -68 104 87 -120 0 32 52 164 11
2377 11 52 123 51 -24 30 30 -82 -111 13 -21 -93 -112 45 123 -15 3 121 -10 -100 -38 60 139 92 -5 4 -195 -211 -74 43 78 10 80
2097 80 -27 89 167 31 80 21 -4 -14 -42 21 63 -100 -19 36 127 4 42 85 -25 -35 24 154 121 79 97 -43 -28 -8 -34 21 16 115
1817 115 42 15 13 38 8 20 -61 1 34 78 94 -114 39 43 102 128 106 40 -33 -66 0 42 -26 99 29 -72 21 14 -120 -58 -42 2 40 -5
1520 -5 -13 76 80 -144 115 81 155 35 -13 -59 117 -3 127 37 -68 41 36 99 81 123 0 -62 82 -47 -59 -61 -23 50 73 -3 91 -15
1240 -15 35 42 57 15 45 4 15 108 -37 31 19 -39 -136 -16 8 -73 -31 -25 70 -43 -58 122 133 34 18 146 137 -60 -33 -32 -23 -101 7 27
942 27 -42 31 -11 -15 -17 43 119 13 -61 7 3 -4 48 81 84 -121 -107 -137 -55 0 18 50 68 1 100 29 -66 -72 -2 53 -33 -22 57 187 -22 -8 -18
618 -18 -25 -113 -48 186 64 81 67 31 -7 -224 -45 60 -38 49 15 -11 52 26 -45 -1 -2 -64 84 153 52 0 27 -14 -48 12 69 -28 9
330 9 -25 -7 25 -107 -137 5 -72 -26 -47 -14 -14 77 78 70 54 -7 -170 -10 103 41 23 -29 -59 -32 -148 -66 -96 -19 -21 -56 10 -32 -16 22 45
23 45 -37 40 110 -66 47 -11 110 209 31 -97 -10 -62 62 42 -49 81 122 -18 -73 -79 26 -34 -43 -49 11 -22 -95 -26 16
-230A6
##PAGE=	F1=2671.97
##FIRST=	23146.756194512010552,	4241.1435120000014649,	0.30386534333229064941
##DATA TABLE=	(F2++(Y..Y)), PROFILE
4241 35 94 -24 161 -52 -24 -57 32 -32 -22 146 -59 -38 -54 -87 48 41 -106 39 -72 -10 16 116 23 56 -30 -62 -47 -88 -6 145
3979 145 49 -8 -24 -27 -26 -12 63 10 -31 -200 -43 124 32 -19 -18 -84 -138 -28 -136 23 2 14 44 -38 32 1 -28 78 47 -97 -3 111
3699 111 -67 31 34 -44 -41 23 10 -86 -22 -50 -54 -4 -24 -52 -120 19 27 12 -135 50 63 76 54 -118 -48 -58 -94 2 -11 35 33 -88 -48 -22
3401 -22 -80 -20 42 -84 -50 11 -50 -46 9 -35 -34 -40 5 -115 -19 12 150 -2 -4 21 60 13 -43 -2 -133 144 1946 -290 -126 28 -128
3130 -128 -10 203 -1 29 44 -35 39 130 114 148 72 126 -59 9 47 107 215 585 3658 12801 14397 5185 378 20 -55 -551
2902 -551 1132 1201 -154 -88 90 34 97 -61 31 0 74 54 -163 -90 -64 -101 9 79 -123 54 11 107 31 41 191 -56 -31 54 -52
2649 -52 -22 -31 102 74 -4 -10 -33 6 97 100 98 3 61 -20 96 26 -7 73 -99 0 67 -62 -76 120 99 -136 -47 -16 83 93 -24 45 84 6
2351 6 -94 49 16 -72 -52 -3 -12 -42 -55 50 86 -18 43 93 -16 -90 -25 26 119 120 -11 -45 -142 -168 -68 17 91 1 35 -26 119 169 16
2062 16 58 -14 -4 -28 -10 23 74 -65 -64 24 88 -21 41 63 -38 -34 72 115 131 27 52 -59 -43 11 33 11 30 140 5 1 31 46 1
1773 1 -4 -47 -30 20 20 92 -115 50 66 89 87 61 58 -3 -53 -15 43 -41 54 -35 -59 39 0 -133 -82 -34 -24 58 -10 -12 80 25 -120 66 80 118
1458 118 18 -11 -41 62 -75 116 45 -62 36 -39 26 65 163 59 -84 31 -45 -99 -63 -10 30 32 -38 89 -52 42 63 47 -23 2
1196 2 5 41 130 -71 64 31 -3 -116 -73 37 -72 -41 -14 98 28 -108 85 138 63 16 132 75 -36 -26 -33 -25 -116 57 59 -24 -45 -13
916 -13 1 -37 51 107 1 -31 -10 16 -8 48 97 53 -143 -125 -113 -24 60 31 40 52 3 126 49 -97 -88 56 67 -56 15 46 138 -35 -11
627 -11 -1 31 -121 -61 179 28 65 85 57 0 -195 1 54 -17 115 27 -44 78 29 -60 -45 -22 -54 26 83 81 28 30 21 -69 -20 84 -55
338 -55 14 2 39 34 -107 -145 16 -86 -37 -90 -61 -9 67 77 25 81 47 -102 -45 78 26 -1 -7 1 -25 -169 -85 -90 -24 28 -88 -10 -40 -9
41 -9 24 -12 -44 40 67 -91 8 -15 116 210 33 -89 0 -64 27 58 -64 47 142 48 -53 -35 33 -34 -46 -46 0 -6 -96 -16 40
-230D0
##PAGE=	F1=2577.61
##FIRST=	23146.756194512010552,	4241.1435120000014649,	0.39690247178077697754
##DATA TABLE=	(F2++(Y..Y)), PROFILE
4241 21 100 -32 129 -23 -38 -7 65 -26 22 125 -19 -55 -13 -90 23 69 -56 39 -121 -52 19 111 35 27 -48 -80 -56 -71 -39 160 37
3970 37 -51 -72 -40 -42 22 54 -26 -97 -224 -46 103 49 -51 -52 -93 -171 -80 -135 41 31 -47 27 3 24 -51 -24 59 7 -122 -24 86 -84
3690 -84 28 79 -59 5 28 -53 -154 -54 -47 -42 54 -3 -81 -175 -5 -6 26 -182 72 92 85 38 -97 -30 -79 -113 -23 14 -23 34 -12 -7 -10 -18 -31
3384 -31 31 -89 -61 28 -13 17 -1 -111 -78 -73 -60 -107 -43 19 127 -18 -28 12 34 -24 -77 -7 -65 217 1538 -13 -46 60 -84 -20
3121 -20 197 -21 50 94 -63 21 49 62 122 38 114 -96 10 27 72 115 342 2352 8288 9224 3222 174 25 -21 -337 877
2894 877 891 -47 -73 70 -10 94 -67 32 38 72 63 -137 -116 -80 -131 -27 63 -103 63 20 78 84 8 153 -79 8 0 -76 -38 -26 70 119
2614 119 -27 -15 -50 7 80 111 96 11 74 -2 81 68 -1 49 -73 -23 37 -3 -96 93 102 -124 -85 -38 119 21 -26 29 25 -50 -139 39 3
2325 3 -79 -12 -31 -9 6 6 49 35 -23 62 65 -37 -82 2 8 65 116 -4 -79 -91 -117 -45 13 104 -13 19 0 137 135 11 73 -35 -15 -62 29
2019 29 21 90 -35 -79 42 26 -62 17 22 -47 -26 110 59 105 -52 -6 -57 -32 0 90 -13 29 140 -32 -3 53 50 0 -37 -62 -62 12 -50 80
1721 80 -119 57 75 67 35 4 46 17 -46 -29 16 -51 2 -74 -22 41 -3 -131 -88 -30 -38 71 3 -9 77 -33 -76 24 75 58 18 -23 -28 -9
1423 -9 -129 67 15 -36 9 -104 -19 56 170 104 -58 -15 -34 -109 -56 -16 24 23 -54 83 -63 57 91 26 -36 -49 17 62 124 -108 67
1152 67 22 27 -87 -125 49 -58 -46 25 119 53 -132 56 112 76 18 105 8 0 6 -47 -34 -94 97 93 -7 -103 -7 22 -71 34 88 -12 -10
863 -10 -19 31 -10 54 121 17 -132 -132 -71 -6 113 18 20 28 27 133 68 -103 -85 103 61 -86 44 34 67 -49 -26 25 80 -100 -67 146 8
575 8 35 83 95 38 -133 14 23 18 158 17 -88 83 34 -3 -41 -11 -22 0 23 73 41 10 44 -90 -34 103 -58 16 25 66 6 -99 -106
286 -106 30 -93 -46 -94 -88 -29 43 49 -20 86 91 -16 -70 43 -7 -37 -8 39 -9 -164 -71 -90 -41 78 -97 -29 -44 19 28 -63 -60 39 15 -107
-12 -107 -30 -15 108 187 45 -42 5 -89 -9 68 -56 23 123 101 -28 -9 7 -27 -55 -28 0 -4 -77 -8 55
-230E5
##PAGE=	F1=2483.26
##FIRST=	23146.756194512010552,	4241.1435120000014649,	0.24716924130916595459
##DATA TABLE=	(F2++(Y..Y)), PROFILE
4241 16 95 -34 78 0 -36 52 104 0 74 79 5 -69 22 -79 -5 61 18 47 -140 -73 22 74 43 0 -57 -81 -75 -47 -76 145 30 -61 -101
3952 -101 -45 -49 45 50 -72 -140 -216 -63 70 44 -56 -82 -87 -186 -133 -153 73 58 -109 10 46 18 -82 -28 29 -38 -125 -31 49 -86 23
3681 23 94 -60 44 21 -101 -195 -99 -30 -18 97 16 -94 -181 -14 -18 33 -179 83 125 67 19 -48 -8 -93 -109 -29 34 -71 2 53 2
3410 2 -19 50 -40 0 -64 -71 17 20 62 4 -153 -97 -85 -97 -76 -50 35 91 -25 -71 21 11 -86 -96 -8 13 266 1025 191 26 78 -17 -38 148
3112 148 -42 36 120 -90 -4 -38 14 68 -2 78 -101 13 19 50 16 90 928 3753 4022 1186 -35 35 28 47 1453 1618 488
2876 488 21 57 -27 93 -61 31 78 60 56 -80 -101 -94 -141 -54 41 -46 65 23 31 113 -17 100 -97 48 -30 -84 -65 -10 39 150 -2
2605 -2 1 -56 8 40 119 66 23 64 8 43 79 18 58 -35 -70 19 60 -116 45 94 -77 -93 -31 148 -21 -7 2 -31 -93 -140 14 0 -98 -11
2307 -11 -78 -19 25 37 42 -3 -12 62 44 -64 -83 32 22 5 88 16 -90 -61 -82 -6 36 124 -39 38 43 140 90 27 110 -22 -29 -96 72 11
2010 11 107 -24 -57 87 -22 -93 -12 -13 -39 -6 122 7 57 -135 -47 -30 8 -36 104 -43 14 126 -51 6 65 45 8 -56 -86 -85 8
1738 8 -116 71 -117 51 79 50 -9 -36 15 17 -46 -33 -29 -49 -39 -66 23 17 9 -117 -74 -39 -35 73 32 -4 62 -72 -30 0 55 -4 31 -38 -15
1432 -15 -61 -137 8 -41 -15 -27 -149 -20 53 145 130 0 -37 -21 -89 -53 -35 33 37 -52 90 -44 79 130 15 -35 -82 24 69 84 -130
1161 -130 47 -5 27 -71 -163 39 -28 -40 82 125 22 -120 41 51 70 28 92 -19 40 51 -50 -48 -46 97 106 7 -130 -3 34 -89
898 -89 15 60 -31 -11 -24 46 -8 53 145 -1 -90 -123 -30 -10 122 -12 -7 19 74 121 75 -82 -63 126 39 -112 57 16 -1 -59 -53 59
618 59 98 -55 -64 116 -2 8 55 144 90 -61 0 -14 49 173 -1 -127 64 38 78 5 21 26 10 -11 35 31 -18 47 -106 -14 104 -43
338 -43 15 36 64 -36 -79 -35 32 -85 -46 -67 -89 -64 22 21 -48 84 105 56 -85 11 -50 -79 -18 46 7 -140 -28 -94 -53 113 -92 -45
58 -45 -37 49 25 -68 -78 35 -23 -111 -63 -13 96 150 67 20 -2 -151 -37 50 -11 22 79 133 -6 -9 -33 -15 -77 -7 7 -13 -40 -3 45
-230D5
##PAGE=	F1=2388.91
##FIRST=	23146.756194512010552,	4241.1435120000014649,	0.11884526163339614868
##DATA TABLE=	(F2++(Y..Y)), PROFILE
4241 15 76 -31 27 2 -15 105 139 34 119 30 6 -81 34 -55 -25 22 81 44 -137 -69 27 31 57 11 -50 -54 -90 -17 -96 99 23 -29 -115
3952 -115 -55 -37 48 42 -106 -149 -173 -80 46 27 -35 -84 -70 -169 -161 -179 105 71 -151 -6 79 21 -82 -38 6 -79 -108 -28 19 -79 16 80 -60
3664 -60 56 13 -107 -200 -135 6 0 108 24 -77 -142 -6 -5 22 -137 73 148 35 8 10 4 -87 -71 -5 50 -93 -45 80 -29 -60 107
3392 107 -31 -29 -14 -66 -2 43 79 16 -140 -76 -77 -96 -32 -38 58 56 -24 -117 56 10 -142 -92 -20 71 260 618 249 68 65 32 -51 82 -63
3104 -63 0 114 -115 -18 -89 -7 14 -38 39 -72 24 42 36 -51 -58 -28 1227 1090 -125 -187 39 81 567 3235 3829 1519 186 60
2859 60 -9 106 -37 37 102 53 40 -16 -60 -111 -139 -56 11 21 67 16 -12 115 -33 43 -92 80 -15 -81 -88 6 30 161 57 17 -59 12
2579 12 -4 124 21 19 24 3 9 56 44 107 5 -120 9 107 -118 9 83 -9 -63 -7 152 -31 4 -39 -60 -110 -105 -13 2 -112 -43 -136
2299 -136 -40 3 26 31 -21 21 53 36 -85 -90 44 53 -25 58 44 -77 -48 -78 37 71 144 -71 72 80 120 65 65 137 24 -31 -106 115 1
2010 1 113 -40 -15 137 -40 -94 -33 -31 -12 14 99 -22 15 -192 -60 17 68 -81 71 -55 -7 106 -51 30 57 36 24 -47 -92 -90 4
1738 4 -162 72 -109 39 81 34 -28 -44 -18 -4 -46 -24 -73 -35 -64 -25 58 -32 20 -94 -53 -68 -23 60 52 -3 26 -78 4 -9 19 -52 50
1450 50 -45 2 -70 -103 -28 -100 -11 -58 -164 5 48 98 139 50 -31 -5 -55 -55 -50 42 58 -42 108 -9 95 168 34 -43 -83 9 62 28 -120
1161 -120 23 -46 -11 -79 -185 10 11 -27 137 116 -29 -78 33 -30 47 40 106 1 77 95 -29 -54 -1 45 92 16 -139 -12 32 -68
898 -68 6 22 -62 -29 -33 43 -12 39 156 6 -31 -107 -14 -29 76 -42 -34 35 129 104 64 -46 -33 113 9 -121 54 -10 -41 -63 -82 86
618 86 77 -1 -52 103 -14 -9 9 184 127 -5 -28 -38 61 168 -21 -137 31 46 131 50 60 72 37 -27 -10 4 -32 28 -116 33 78 -24
338 -24 14 36 39 -56 -37 43 22 -58 -34 -27 -61 -88 22 23 -56 82 91 99 -88 -2 -83 -116 -23 39 20 -113 24 -95 -42 118 -85 -54 -21 60
41 60 11 -21 -97 27 -38 -107 -86 -6 85 103 89 63 -24 -230 -52 0 52 36 33 153 8 -18 -58 -3 -97 5 17 -25 -6 -1 5
-230E
##PAGE=	F1=2294.55
##FIRST=	23146.756194512010552,	4241.1435120000014649,	0.11026118695735931396
##DATA TABLE=	(F2++(Y..Y)), PROFILE
4241 12 40 -26 -9 -15 12 129 155 56 136 -7 -6 -88 18 -27 -29 -20 97 15 -129 -41 35 7 72 69 -20 -5 -84 17 -84 30 13 33 -116
3952 -116 -63 0 36 27 -112 -133 -104 -75 49 17 -7 -50 -44 -121 -157 -187 123 64 -162 -20 99 40 -55 -53 -7 -101 -80 -29 7 -60 15 47 -69
3664 -69 38 20 -73 -171 -139 51 8 89 16 -35 -79 12 20 -7 -84 42 140 10 3 45 2 -62 -13 35 56 -92 -90 64 -83 -116 137 5
3384 5 -30 42 -41 -14 47 75 21 -82 -26 -54 -72 13 -5 83 27 -25 -148 100 34 -172 -66 -48 91 189 345 188 71 21 41 -52 42
3112 42 -78 -28 79 -122 -13 -84 3 -17 -63 11 -30 43 91 22 -84 -89 -407 790 542 -601 -256 25 129 1088 5570 6706
2885 6706 2689 348 65 28 125 -5 49 98 61 30 36 -17 -130 -132 -39 -16 68 69 2 -39 100 -34 -12 -59 95 31 -71 -89 14 47
2622 47 147 118 18 -61 18 -39 130 -11 -3 -34 -18 -1 25 60 170 30 -153 0 126 -102 4 72 49 -4 18 121 -22 -11 -87
2369 -87 -52 -104 -59 -48 3 -101 -81 -180 -58 -44 -8 18 -24 69 46 43 -88 -91 22 70 -13 45 69 -40 -39 -101 74 93 144 -94 95 93 78
2080 78 67 106 138 77 -13 -84 148 0 102 -76 16 160 -31 -67 -36 -33 19 19 50 -34 5 -207 -54 68 122 -119 15 -33 -24 82 -48
1808 -48 50 31 31 30 -15 -69 -73 -2 -178 74 -97 35 76 13 -22 -22 -43 -35 -40 -4 -96 -15 -74 11 69 -85 9 -66 -39 -106 -15 36 48 -9 -25 -55
1493 -55 21 -8 -20 -72 61 -43 30 -51 -60 -25 -127 -19 -79 -143 27 30 32 127 66 -12 9 -23 -55 -48 33 75 -38 121 24 97 189 79 -65
1205 -65 -60 -32 40 -14 -82 7 -84 -66 -100 -190 -22 48 -8 176 99 -55 -22 24 -106 18 45 141 40 105 126 5 -44 18 -35 62 20 -151
925 -151 -35 20 -16 -1 -21 -101 -40 -47 9 -28 14 143 34 17 -98 -34 -50 5 -50 -48 69 172 90 39 -4 -13 61 -17 -105 37 -43 -43 -56 -97
627 -97 90 25 43 -32 97 -34 -21 -35 187 132 19 -57 -38 51 155 -38 -107 10 60 132 50 92 94 48 -36 -44 -20 -11 -11 -116 85 42 -9
338 -9 24 25 6 -38 20 104 14 -10 -7 16 -11 -79 42 50 -59 75 68 108 -80 -1 -92 -132 -22 42 33 -90 63 -91 -9 90 -81 -51 -2 52
41 52 -6 49 -116 14 -33 -98 -93 7 69 50 93 69 -43 -282 -57 -66 100 48 8 167 19 -14 -47 6 -100 13 31 -35 3 -2 -42
-230d2
##PAGE=	F1=2200.2
##FIRST=	23146.756194512010552,	4241.1435120000014649,	0.068752929568290710449
##DATA TABLE=	(F2++(Y..Y)), PROFILE
4241 4 -5 -22 -20 -44 28 115 145 49 115 -35 -19 -84 -7 -9 -16 -42 62 -32 -129 0 42 7 74 149 26 49 -51 53 -48 -46 2 95 -108 -55
3944 -55 50 21 9 -93 -113 -25 -38 80 14 4 0 -13 -57 -134 -164 120 36 -143 -22 109 68 -17 -67 -19 -95 -42 -43 12 -32 26 9 -84 0
3655 0 47 -28 -120 -108 79 6 49 -6 5 -19 32 40 -44 -50 8 96 4 -3 33 -18 -28 38 66 45 -76 -118 28 -126 -156 136 55 1 87 -4 -12
3349 -12 39 67 15 -9 25 -28 -49 45 42 101 3 -36 -153 123 64 -171 -30 -77 79 53 77 62 36 -35 13 -43 41 -85 -34 30 -94 -1
3069 -1 -42 36 -23 -80 -10 -5 62 140 7 -89 -57 -442 1171 966 -594 -242 -10 159 1404 7092 8562 3375 413 48 53 133
2841 133 9 55 71 85 32 78 11 -144 -121 -15 -26 73 73 -10 -52 77 -17 -61 -17 96 77 -50 -61 14 71 107 145 5 -50 20 -56 129
2561 129 -20 -29 -91 -52 6 18 58 216 23 -159 -9 116 -85 22 56 69 56 44 72 -10 -52 -128 -23 -89 -26 -96 -5 -62 -96 -182 -61
2290 -61 -95 -35 8 -21 110 45 65 -73 -75 -28 57 34 54 75 6 -24 -126 92 90 116 -99 98 85 29 82 130 125 108 17 -50 159 9 77
2001 77 -118 26 143 -14 -29 -23 -28 40 4 0 -39 29 -178 -44 98 146 -137 -31 23 -26 56 -58 47 -3 30 17 20 -27 -46 -11 -156
1730 -156 67 -80 47 58 -14 -6 9 -57 -60 -27 18 -90 8 -71 12 64 -110 -26 -42 -41 -132 -19 17 30 -16 -76 -18 27 2 -42 -61 51 -43
1441 -43 63 -35 -37 11 -106 -22 -87 -97 30 -5 -42 90 47 0 16 4 -40 -29 2 84 -42 116 54 88 179 124 -82 -35 -94 8 -25 -29
1161 -29 3 -102 -104 -112 -179 -47 75 13 192 81 -34 32 20 -140 -6 37 171 53 121 138 25 -19 19 -104 33 27 -167 -57 8
907 8 39 -17 -62 -127 -27 -54 -49 -48 -4 113 63 38 -102 -81 -61 -41 -28 -41 100 188 79 11 36 -13 -18 -33 -65 11 -72 -24 -39 -91 62 -33 71
601 71 -5 75 -54 -29 -60 137 104 14 -73 -22 25 142 -45 -43 21 75 96 3 104 82 26 -35 -57 -28 40 -60 -104 118 19 8 53 11 -20
312 -20 6 69 137 14 51 27 59 45 -46 71 67 -71 56 52 91 -67 0 -73 -122 -18 53 47 -69 72 -88 31 39 -73 -32 12 39 -22
32 -22 106 -133 -7 -22 -80 -80 28 41 3 76 45 -42 -270 -58 -117 114 45 0 171 27 5 -6 12 -85 28 50 -46 -10 -3 -73
-230g3
##PAGE=	F1=2105.84
##FIRST=	23146.756194512010552,	4241.1435120000014649,	0.27530184388160705566
##DATA TABLE=	(F2++(Y..Y)), PROFILE
4241 -9 -42 -18 -10 -68 25 73 113 20 77 -47 -20 -65 -15 -6 8 -43 4 -72 -136 40 41 17 51 203 68 89 0 87 -17 -113 0 127 -93
3952 -93 -24 93 20 -6 -68 -103 45 20 128 2 -5 42 20 4 -108 -120 90 -9 -102 -10 110 89 12 -76 -34 -67 6 -62 21 -6 46 -29
3672 -29 -89 -32 81 -8 -59 -58 74 -7 8 -41 23 24 42 43 -77 -45 -12 33 9 -13 -17 -51 -1 65 63 22 -50 -123 -4 -134 -155 105 94 38 111
3366 111 29 -11 31 72 13 51 55 -14 -48 54 91 103 -4 -55 -136 100 71 -150 0 -81 44 -117 -247 -79 -21 -77 -23 -32 50 -90 -28
3095 -28 -12 -27 2 2 71 -12 -94 -32 -17 67 163 1 -63 -17 -373 1238 1093 -444 -160 -58 160 1363 6782 8157 3153 345
2867 345 1 44 120 -9 38 39 115 40 119 22 -140 -100 9 -11 39 82 -20 -65 48 20 -91 9 97 96 -15 -16 17 78 45 121 -6
2596 -6 -21 8 -55 102 -14 -34 -125 -86 15 42 45 228 -8 -144 -8 91 -78 42 23 43 93 72 30 -2 -97 -149 5 -78 -18 -154 -23
2325 -23 -15 -80 -134 -43 -123 -36 4 -26 126 50 94 -52 -44 -79 27 95 71 50 42 -10 -127 90 67 63 -86 94 72 -7 84 130 115 106 34 -29
2027 -29 139 19 53 -144 21 97 -3 0 -2 -30 46 -22 -24 -43 71 -124 -40 96 128 -130 -46 93 -15 30 -85 19 -34 28 -3 41
1765 41 11 -22 -17 -98 48 -56 66 26 -39 -1 28 -66 -60 -19 29 -61 36 -61 -26 58 -90 -67 -27 -55 -131 -36 17 28 -10 -106 12 33 27 -39
1467 -39 -21 16 -50 96 -40 -39 57 -49 -9 -83 -48 25 -49 -109 33 26 -9 8 31 -12 -1 -38 84 -48 97 88 76 143 138 -73 -21 -153 -26
1178 -26 -12 14 -2 -93 -102 -92 -153 -60 92 33 177 74 19 78 27 -120 -23 24 175 23 129 125 18 5 21 -129 13 49 -168 -62
916 -62 10 72 -42 -87 -120 5 -40 -102 -54 -3 90 80 28 -112 -134 -58 -34 14 -20 105 181 60 -5 64 -27 -98 -34 -16 -17 -84 -12 -11 -60 9
618 9 -72 87 28 35 -59 -31 -64 49 58 3 -67 -7 -4 131 -33 29 61 74 54 -51 90 42 -21 -18 -53 -20 94 -95 -78 123 19 30 97
330 97 5 -37 53 87 140 13 109 59 97 96 -13 93 40 -93 26 48 58 -59 -13 -41 -94 -18 54 55 -43 55 -87 53 -10 -55 -5 16 32
41 32 -35 130 -132 -38 -16 -49 -50 47 8 -28 46 14 -14 -191 -54 -128 102 24 -4 148 30 21 39 22 -60 53 75 -69 -34 -4 -74
-230g4
##PAGE=	F1=2011.49
##FIRST=	23146.756194512010552,	4241.1435120000014649,	0.51361620426177978516
##DATA TABLE=	(F2++(Y..Y)), PROFILE
4241 -21 -58 -7 4 -79 10 25 75 -10 56 -40 -3 -30 8 -14 34 -40 -43 -81 -143 64 28 19 4 200 79 100 48 106 -11 -151 9 119 -77
3952 -77 12 112 41 -12 -54 -101 99 73 167 -31 -22 60 55 50 -93 -78 38 -67 -56 17 105 89 20 -67 -46 -38 61 -75 21 3 59 -60 -74
3664 -74 -43 99 -20 -2 -9 42 -38 -15 -77 12 48 39 27 -107 -59 -16 -20 8 -16 -74 -80 10 67 25 0 -17 -102 -19 -106 -118 47 102 43 121 48
3357 48 -22 32 92 30 86 54 -25 -72 41 120 85 15 -66 -100 38 41 -127 13 -54 -1 -227 -463 -164 -82 -85 -34 -30 30 -103 -31 -36 52 -5
3069 -5 26 94 5 -104 -53 -53 51 150 6 -9 14 -269 830 725 -261 -38 -95 128 1000 4804 5717 2157 195 -56 5 96 -55
2832 -55 -2 20 138 44 163 25 -109 -66 33 15 -11 95 -35 -90 7 71 -94 6 119 85 31 20 32 60 -16 60 -9 13 -15 -44 38
2561 38 -16 -11 -126 -108 6 75 33 209 -44 -118 1 69 -76 45 -33 -12 90 103 13 4 -123 -149 20 -78 -32 -203 -38 4 -46 -54 -9
2290 -9 -117 -17 12 -42 118 51 116 -38 -7 -99 5 145 81 -3 49 -8 -95 81 43 3 -60 96 64 -22 64 114 117 84 7 -25 93 17
2010 17 45 -139 18 44 0 20 22 -43 47 -45 -5 -44 103 -61 -43 70 79 -101 -30 144 -6 5 -110 -13 -52 22 -12 42 29 -10 -17 -14 29
1721 29 -25 68 -11 -48 -16 22 -73 -24 -21 21 -24 67 -50 -88 58 -41 -90 -21 -67 -102 -60 38 55 17 -110 25 44 65 -15 39 -28 -62 124
1432 124 -53 -42 83 7 12 -68 -11 33 -80 -147 -27 29 -43 -15 58 18 18 -68 77 -48 75 131 72 94 110 -40 -20 -183 -49 4 31
1161 31 -21 -64 -70 -37 -116 -65 104 44 134 83 71 110 47 -64 -34 16 148 -23 130 93 1 20 36 -112 -3 84 -135 -49 27 69 -60
890 -60 -92 -73 43 1 -119 -36 19 95 75 6 -115 -171 -41 10 63 2 81 159 26 -8 68 -40 -146 -23 26 -42 -78 -20 16 -12 -42 -77
610 -77 100 58 0 -37 -23 -57 -39 14 11 -38 -3 -25 116 -3 80 98 45 26 -66 52 1 -72 14 -40 -11 119 -101 -42 107 28 49 142 15
321 15 -49 80 73 114 -1 141 69 116 130 -3 101 -25 -110 -8 45 15 -66 -39 -19 -65 -21 29 47 -13 36 -87 42 -40 -29 11 10 32
41 32 -44 121 -102 -68 -15 -11 -17 51 -20 -37 19 -4 25 -87 -42 -91 84 -10 -22 93 32 13 65 46 -38 80 100 -109 -48 -7 -56
-230e6
##PAGE=	F1=1917.14
##FIRST=	23146.756194512010552,	4241.1435120000014649,	0.40301623940467834473
##DATA TABLE=	(F2++(Y..Y)), PROFILE
4241 -25 -51 19 8 -74 2 -8 46 -22 68 -16 30 15 58 -24 44 -50 -64 -65 -136 67 5 4 -46 145 46 74 74 103 -29 -151 28 90 -65 27
3944 27 112 73 -4 -60 -94 131 97 171 -80 -23 56 90 76 -88 -56 -23 -127 -14 53 98 70 8 -38 -44 -28 107 -73 14 -6 56 -75 -44
3664 -44 -30 89 -42 44 30 13 -86 -11 -99 -10 52 17 1 -141 -76 -13 -47 -8 -4 -105 -83 12 62 -26 -12 13 -54 -13 -59 -75 -19 77 0 124
3366 124 43 -38 45 115 61 98 25 -56 -106 16 115 51 66 -62 -53 -27 -11 -113 3 -19 -45 -190 -367 -126 -114 -55 -9 -37 -22 -123 -51
3095 -51 -38 109 -18 19 103 23 -100 -55 -84 20 120 16 54 45 -114 413 350 -46 81 -101 81 524 2330 2686 970 54
2867 54 -92 -37 77 -94 -45 14 142 38 192 26 -55 -26 51 28 -49 99 -66 -130 -44 113 -68 -24 161 66 73 33 59 31 -50 -6
2605 -6 -4 35 -38 -32 -47 -41 24 -107 -102 -21 92 32 174 -64 -87 12 59 -60 29 -97 -69 47 130 20 19 -124 -137 22 -90 -56 -218 -37
2325 -37 -17 -11 25 21 -84 4 32 -68 99 39 116 -42 21 -68 2 167 73 -66 26 -27 -47 74 32 -42 -31 103 51 -23 30 99 116 65
2045 65 -64 -21 39 3 53 -102 22 4 -3 33 49 -66 54 -56 41 -40 110 -1 -52 36 29 -65 3 157 -18 -16 -107 -19 -51 12 -3 31
1765 31 27 -7 -13 68 18 0 40 -44 -37 -34 2 -72 40 -34 -1 2 89 -44 -143 58 -1 -86 -17 -62 -55 -82 65 95 62 -97 16 54 104 15 99
1458 99 -53 -66 139 -52 -27 77 41 34 -46 10 59 -84 -141 -74 58 -82 -40 69 37 22 -75 72 -39 61 175 72 47 49 -4 -25
1196 -25 -173 -50 7 17 -50 -37 -35 38 -72 -64 113 41 77 104 98 128 66 -12 -42 19 103 -51 128 57 3 19 52 -82 -28 114 -70 -22
916 -22 49 37 -59 -85 0 67 65 -90 5 58 121 50 -11 -98 -176 -9 54 104 16 42 131 -11 3 44 -41 -150 -12 55 -60 -60 -39 30 31 -63
618 -63 -53 111 68 -6 4 -8 -52 -88 -5 47 4 -7 -32 91 23 89 102 -5 17 -25 10 -17 -105 48 -28 -16 106 -77 -6 85 26 45 173
330 173 39 -57 82 44 59 -32 131 52 104 145 -16 93 -93 -105 -38 32 -30 -87 -64 -22 -46 -26 -13 18 12 35 -84 0 -45 -8 13 0
50 0 29 -43 93 -51 -85 -15 21 5 33 -37 -31 4 -7 53 -8 -28 -24 71 -51 -48 21 36 -23 66 80 -18 95 113 -153 -47 -17 -37
-230c7
##PAGE=	F1=1822.78
##FIRST=	23146.756194512010552,	4241.1435120000014649,	0.22774304449558258057
##DATA TABLE=	(F2++(Y..Y)), PROFILE
4241 -16 -28 56 -5 -59 20 -22 24 -19 97 6 79 61 109 -28 29 -72 -73 -48 -103 57 -17 -16 -80 70 -16 19 73 78 -50 -120 42 67 -58
3952 -58 7 108 92 14 -75 -71 141 85 132 -115 -4 40 120 84 -81 -50 -71 -172 20 87 97 43 -9 1 -28 -43 126 -61 12 -21 39
3681 39 -64 -12 -7 56 -50 75 66 11 -130 18 -99 -26 35 -20 -29 -170 -83 -16 -54 -35 21 -96 -50 18 63 -70 -16 27 7 2 -8 -53 -73
3392 -73 33 -68 122 13 -42 74 126 86 91 -18 -83 -131 -12 80 7 126 -48 -8 -55 -54 -104 -26 -6 -72 -84 -114 -32 -100 -6 34 -48 -79
3112 -79 -139 -68 -31 119 -30 -11 96 33 -77 -22 -87 -8 96 25 99 78 63 309 297 152 166 -68 40 162 553 512 144 -26 -85
2859 -85 -55 71 -101 -65 6 123 26 179 23 -1 7 49 7 -52 74 -117 -173 -100 126 -24 -62 199 56 88 28 82 13 -39 -49 3
2596 3 32 -41 -29 -116 -78 54 -88 -62 -44 82 37 129 -63 -47 10 60 -19 5 -142 -99 -19 146 32 49 -103 -124 16 -109 -76 -187
2334 -187 -20 -67 13 85 37 -40 19 61 -96 78 18 89 -60 38 1 7 156 57 -107 -7 -64 -15 76 37 -63 -5 103 17 -31 1 95
2062 95 98 62 -148 1 -3 -14 62 -54 25 -15 -9 44 77 -87 72 -53 84 -34 95 50 -68 4 8 -40 38 135 -52 -34 -67 12 -32 2
1782 2 11 29 15 -5 -8 120 13 14 -8 -62 -10 -36 -14 -53 109 -46 -21 12 88 -45 -170 46 0 -66 -10 -32 -4 -90 74 116 110 -81 -6
1493 -6 54 128 46 132 -34 -58 132 -27 6 49 54 53 -26 24 80 -61 -96 -94 89 -102 -48 53 41 14 -58 78 -24 54 195 74 9 -17
1213 -17 17 -37 -134 -27 -8 -21 -71 -27 -19 109 -30 -54 115 25 30 119 96 132 71 10 -48 23 53 -51 122 30 35 11 48 -66 -64 112 2
925 2 7 68 -11 -42 -77 77 76 136 -34 49 101 138 10 -25 -65 -146 27 63 132 26 10 105 -34 23 3 -26 -122 -17 70 -72 -37 -46 20 49
627 49 -37 -16 113 43 15 42 7 -50 -83 12 91 42 -11 -28 55 23 60 64 -53 27 49 -11 -5 -106 64 -23 -35 68 -36 14 71 4 9 180
330 180 63 -62 62 19 -12 -57 89 18 64 144 -29 75 -122 -72 -59 10 -74 -111 -68 -55 -36 -28 -50 -18 23 52 -85 -53 -44 2 5 -14 17
41 17 -25 53 -6 -83 -12 39 11 2 -44 -24 -6 -7 51 17 -23 46 55 -84 -62 -39 43 -74 51 107 5 89 108 -178 -36 -28 -30
-230c0
##PAGE=	F1=1728.43
##FIRST=	23146.756194512010552,	4241.1435120000014649,	-0.014983392320573329926
##DATA TABLE=	(F2++(Y..Y)), PROFILE
4241 4 -1 84 -29 -39 66 -19 5 -18 107 7 131 93 137 -25 -8 -97 -98 -53 -40 48 -32 -30 -83 7 -82 -46 59 47 -51 -74 37 57 -54
3952 -54 -36 109 82 36 -79 -32 133 58 67 -112 23 21 137 80 -58 -46 -88 -181 51 106 109 18 -21 34 -5 -66 111 -47 18 -23 26 -30
3672 -30 13 13 14 -33 86 100 38 -143 59 -87 -29 0 -62 -59 -178 -75 -26 -57 -57 41 -64 7 37 72 -86 -23 17 58 14 27 -55 -95 -9
3384 -9 -116 108 -32 -20 117 115 86 67 -66 -77 -135 -40 33 -36 160 -42 13 -30 -65 -81 -55 -26 -69 -132 -197 -84 -51 29 64 -59 -102 -137
3104 -137 -65 -33 85 -38 -53 70 32 -43 49 -60 -17 94 26 110 101 188 414 432 246 209 -3 17 5 -135 -349 -169 -61 -48 -38
2850 -38 68 -76 -55 -15 86 10 114 12 28 24 18 -47 -18 14 -173 -197 -145 104 22 -83 206 53 71 24 83 14 3 -57 12 9 -21 -36
2570 -36 -136 -106 71 -77 4 -36 57 39 73 -55 3 -6 60 36 -18 -147 -91 -84 143 32 96 -69 -113 7 -122 -80 -122 -3 -114 31
2307 31 122 32 -9 25 94 -114 58 -1 47 -77 50 86 0 116 45 -100 -28 -105 -17 77 44 -58 15 87 -44 -54 -17 101 61 70 -200
2036 -200 44 -25 -20 51 -23 16 -19 -16 44 99 -93 87 -33 95 -31 71 90 -88 -28 19 -41 61 99 -86 -49 -8 61 -6 -9 16 53
1765 53 6 -4 -1 129 9 17 -54 -64 21 -21 -19 -11 148 -50 -20 2 54 -48 -159 18 -38 -47 -1 14 36 -76 58 101 150 -68 -34 37 129
1476 129 80 120 20 -46 103 6 37 23 66 71 -20 33 65 -27 -37 -94 98 -90 -30 11 34 8 -22 100 -6 47 174 73 -18 -63 26
1205 26 -59 -88 3 -34 -68 -70 -31 -27 151 6 -36 108 3 7 112 77 121 58 6 -45 12 6 -40 118 17 76 2 21 -64 -95 73 57 35
916 35 81 -62 -24 -70 139 80 185 16 78 141 115 -30 -41 -28 -91 55 36 147 38 -3 85 -29 39 -35 -5 -85 -43 78 -83 -3
653 -3 -31 -9 31 22 24 102 -7 38 49 12 -45 -37 65 116 61 -8 -26 12 -10 16 7 -71 53 117 -1 23 -80 55 -24 -52 34 2 8 71 -24 -41
338 -41 164 69 -61 24 2 -72 -52 44 -15 20 129 -26 56 -98 -24 -67 -7 -113 -123 -48 -102 -27 -23 -55 -43 19 68 -100 -93 -61 0 1 -26 0
41 0 11 9 3 -61 -7 39 6 -23 -44 -28 -23 -13 19 1 -36 91 27 -94 -52 -66 40 -115 33 104 34 63 87 -172 -20 -27 -28
-230b8
##PAGE=	F1=1634.08
##FIRST=	23146.756194512010552,	4241.1435120000014649,	-0.19353337585926055908
##DATA TABLE=	(F2++(Y..Y)), PROFILE
4241 28 25 84 -46 -21 123 -3 -14 -35 76 -18 172 106 134 -16 -49 -117 -142 -76 42 43 -36 -32 -54 -28 -131 -93 56 33 -27 -34 10 44 -52
3952 -52 -79 106 41 46 -56 3 112 42 7 -74 45 4 131 73 -18 -31 -73 -146 75 101 127 -5 -25 47 16 -75 77 -37 26 -2 29
3681 29 9 31 23 -21 -1 80 123 73 -110 95 -79 -25 -44 -92 -83 -148 -52 -39 -67 -66 36 -34 64 68 80 -70 -40 -8 71 6 39 -52 -81 -36 -113
3375 -113 74 -80 16 166 83 63 36 -104 -35 -118 -64 -8 -71 143 -58 1 24 -46 -36 -61 -52 -37 -357 -683 -295 9 37 63 -63 -76
3112 -76 -113 -36 -52 38 -41 -90 24 22 -13 138 -18 -3 109 21 90 108 211 476 484 212 215 71 5 -10 -130 -387 -185 -89 -8 0 54 -42
2832 -42 -32 -47 40 -16 16 -4 21 24 -31 -112 33 -59 -205 -188 -166 65 60 -69 175 40 35 32 58 25 44 -40 17 -25 7 -46 -106 -107 84 -63
2535 -63 85 12 36 36 7 -50 57 -30 50 87 -42 -119 -52 -129 119 16 150 -26 -105 -1 -115 -66 -47 -7 -133 40 147 18 -7
2281 -7 29 124 -119 35 -13 9 -74 68 154 -30 58 45 -50 -25 -138 -44 66 38 -37 27 55 -112 -82 -31 112 18 73 -194 90 -27
2019 -27 -7 13 -22 -1 -13 -19 29 105 -81 79 -3 70 -26 52 114 -102 -65 38 -69 61 65 -87 -58 39 90 15 -23 11 102 4 -7 14 109
1730 109 0 21 -79 -50 47 -8 -15 38 135 -41 1 -16 -2 -44 -113 -8 -90 -40 0 58 51 -46 26 56 181 -49 -51 8 113 113 73 81 -43
1441 -43 64 31 47 15 91 89 -31 34 7 -2 7 -86 80 -52 9 -34 22 13 23 130 12 36 118 67 -34 -78 36 -88 -56 25 -60 -105 -45
1152 -45 -31 -42 152 32 -17 92 -19 6 79 55 94 35 -4 -27 -20 -34 -41 122 14 93 0 -15 -57 -101 22 84 57 93 -97 -17 -56 172
872 172 85 185 41 83 172 48 -62 -59 -4 -29 58 -3 147 52 -9 73 -1 40 -60 13 -55 -75 81 -89 48 1 -36 -15 74 65 85 -58
592 -58 35 26 5 -32 17 127 112 53 0 -33 -26 -61 -19 -33 -49 88 150 33 42 -39 29 -17 -47 20 31 -25 84 -37 -75 129 53 -51 -21 -10
295 -10 -97 -11 26 -34 -3 106 -9 45 -38 16 -60 -12 -145 -116 -18 -140 -19 -7 -21 -43 9 58 -131 -99 -110 -12 7 -34 -13 58 -31 -18 -25
6 -25 -3 25 1 -28 -35 -42 -46 -28 -23 -22 -65 97 -10 -71 -25 -61 14 -132 17 61 61 26 57 -149 4 -5 -21
-230b1
##PAGE=	F1=1539.72
##FIRST=	23146.756194512010552,	4241.1435120000014649,	-0.14203494787216186523
##DATA TABLE=	(F2++(Y..Y)), PROFILE
4241 43 48 47 -50 -8 160 21 -24 -62 16 -56 185 98 110 0 -70 -131 -183 -93 117 37 -37 -29 -4 -38 -152 -103 75 42 5 -17 -24 9 -54 -101
3944 -101 85 -11 38 -7 14 88 53 -22 -21 60 -6 99 73 24 -8 -43 -81 84 69 131 -31 -29 44 28 -60 46 -25 24 30 47 34 40 24 -45
3646 -45 34 57 119 90 -46 112 -84 -22 -75 -100 -90 -82 -19 -48 -79 -66 0 -30 96 99 85 -33 -55 -35 40 -24 25 -24 -42 -38 -61 32 -109 45
3349 45 201 45 39 16 -119 16 -92 -82 -44 -83 87 -94 -36 68 -17 23 -33 -42 21 -230 -445 -141 98 37 50 -51 -8 -78 0 -85
3086 -85 9 -30 -103 -32 14 -2 206 24 23 121 14 56 99 145 420 417 117 185 129 0 8 3 -261 -159 -123 16 42 29 -19 -19 -70 -2 -56
2797 -56 -75 -13 -11 15 -77 -158 74 -113 -192 -142 -159 33 84 -26 134 12 6 45 25 30 52 -14 7 -67 28 -52 -57 -82 103 -29 164 78 24
2509 24 32 -56 -42 101 -41 30 114 -73 -78 -4 -143 76 -8 185 20 -97 0 -83 -41 8 -37 -116 38 166 7 -30 34 141 -109 11
2246 11 -24 -8 -44 94 186 -74 -4 58 12 -5 -153 -67 40 12 -16 27 17 -155 -101 -52 122 -9 57 -146 116 -17 22 -33 -43 -12
1983 -12 -2 -13 1 85 -54 38 25 26 -13 38 116 -96 -92 36 -109 36 35 -49 -56 53 77 21 -42 14 155 7 -16 41 85 -13 33 -86 -20
1695 -20 56 -14 -17 70 75 -19 30 -33 -56 -26 -45 -19 -130 -40 -14 77 29 -17 -5 0 210 -20 -49 -19 94 134 20 113 -54 36 42 36 33 123 98
1388 98 -51 27 -64 0 20 -79 44 -3 60 -61 8 27 65 148 29 26 56 56 -35 -62 56 -107 -39 25 -74 -118 -17 -18 -41 113 45 -12 75
1100 75 -37 16 34 39 59 13 -3 10 -64 -65 -53 131 12 69 4 -44 -35 -76 -2 89 68 100 -102 -20 -27 170 86 130 40 74 187 -27 -78 -61
802 -61 0 18 37 -31 128 55 -19 64 32 24 -74 25 -32 -91 77 -88 110 37 -34 -62 82 104 77 -82 7 -3 -12 -8 53 168 88 25 13 -47
505 -47 -52 -97 -34 -39 1 119 140 67 29 -3 4 6 -13 25 46 -70 99 -22 -67 85 24 -30 -58 -18 -79 45 47 -36 5 77 7 46 31 33 -41 -4
190 -4 -164 -92 4 -145 -15 16 40 -25 3 16 -163 -73 -172 -35 19 -35 -14 97 -63 -46 20 2 1 5 -8 -11 -56 -53 -45 -57 -32 -92 73 -42
-108 -42 -23 -12 -44 -35 -126 2 -12 74 -6 30 -128 34 34 -7
-230g
##PAGE=	F1=1445.37
##FIRST=	23146.756194512010552,	4241.1435120000014649,	-0.18188518285751342773
##DATA TABLE=	(F2++(Y..Y)), PROFILE
4241 45 60 -11 -43 -3 160 47 -17 -75 -37 -79 166 77 78 21 -62 -135 -187 -82 146 16 -44 -31 46 -31 -145 -78 100 63 26 -24 -43 -41
3961 -41 -58 -97 44 -53 15 52 -4 67 86 -16 19 71 -9 50 84 44 9 -22 -14 73 21 107 -55 -39 46 28 -38 32 -5 9 57 65 38 38 20
3655 20 -58 69 20 86 80 16 103 -88 -23 -78 -90 -75 -5 15 -56 -86 -64 -50 -58 96 120 89 0 -53 -56 -15 -64 0 22 0 -14 5 4 -107 46
3349 46 196 16 36 27 -104 40 -68 -92 -83 -65 29 -134 -71 75 5 72 15 18 110 1114 2371 1241 269 76 68 -10 75 -42 30
3095 30 -109 9 1 -83 -76 20 -9 218 59 46 114 7 22 73 22 356 422 37 109 148 2 12 30 -218 -167 -137 30 69 4 -5 -19 -72
2815 -72 -35 -99 -134 0 -46 8 -100 -168 83 -128 -139 -75 -125 25 88 24 115 -18 0 37 8 21 26 11 -22 -116 37 -50 -28 -48 131 35
2535 35 226 126 16 33 -97 -15 129 -28 10 110 -108 -40 33 -132 24 -27 180 61 -89 17 -38 -16 33 -80 -77 29 178
2299 178 3 -51 37 138 -83 -7 -45 -9 5 119 175 -106 -53 74 48 17 -151 -58 6 -22 -9 7 -19 -149 -102 -80 123 -12 20 -95
2036 -95 113 0 58 -61 -60 -2 11 2 -27 43 -27 -25 35 -14 9 23 99 -62 -92 6 -141 -7 2 7 -44 36 36 13 -59 32 179 12 -20 71
1738 71 75 -20 45 -87 19 45 -32 -33 69 -3 15 47 -36 -78 2 22 -6 -149 -37 -34 63 -22 -6 -27 -46 233 13 -24 -34 83 124 -7
1458 -7 110 -63 27 46 21 68 145 87 -63 18 -100 -17 0 -76 3 39 111 -60 -9 38 89 135 36 22 13 38 -23 -21 78 -106 -27 2 -73 -99
1161 -99 -9 3 -11 54 43 -31 59 -46 28 1 35 30 -2 9 58 -94 -71 -54 133 6 20 12 -62 -11 -31 15 91 63 91 -70 -26 14 135
872 135 75 40 27 65 179 -72 -76 -27 -4 43 9 -39 89 35 -35 49 51 3 -86 31 -12 -77 63 -82 155 68 1 -80 43 133 84 -74
592 -74 -23 -9 -31 17 56 169 58 -8 29 -55 -55 -98 -30 -18 56 126 102 81 -15 8 -8 46 32 32 44 -104 105 11 -24 43 -1 0 -67 -21 -41
286 -41 92 87 -23 37 48 14 58 89 25 -18 6 -160 -62 11 -108 -19 42 105 -5 0 -40 -170 -29 -217 -62 37 -27 -3 115 -86 -53
15 -53 67 10 -30 20 30 25 -64 -25 -54 -66 -31 -100 48 -50 32 -37 -35 -95 -102 -9 -89 68 -21 10 -120 61 75 9
-230I
##PAGE=	F1=1351.01
##FIRST=	23146.756194512010552,	4241.1435120000014649,	-0.22227409482002258301
##DATA TABLE=	(F2++(Y..Y)), PROFILE
4241 39 53 -66 -33 -2 121 63 6 -57 -62 -71 120 50 49 41 -39 -127 -145 -41 113 -19 -64 -38 82 -11 -111 -43 103 77 22 -42 -36 -82 -62
3952 -62 -77 3 -72 -7 99 -37 49 118 12 35 77 -4 -1 96 28 11 -19 29 50 -25 60 -67 -50 69 17 -31 34 18 -3 71 67 33 26 14
3655 14 -61 100 -23 40 56 51 72 -70 -24 -55 -77 -48 52 37 -66 -80 -60 -90 -107 74 127 92 7 -20 -75 -63 -89 -3 53 23 28 55 11
3366 11 -79 23 141 5 53 68 -63 19 -56 -98 -125 -27 5 -161 -83 52 15 85 54 111 229 4019 8503 4206 553 184 138
3130 138 61 149 -13 52 -106 26 45 -37 -88 39 -23 163 82 59 90 5 -4 31 -134 383 641 -3 -7 121 33 21 37 -145 -140 -107 45
$$ [...]
-230d7
##END NTUPLES=	nD NMR SPECTRUM
##END=	
##END=	
