##TITLE=	Nov18-2021.73.fid
TM-VI-171 CDCl3 Sc+ Bz-pyr. 13C

##JCAMP-DX=	6.0	$$ MestReNova 14.3.0-30573
##DATA TYPE=	LINK
##BLOCK_ID=	1
##BLOCKS=	2    
##ORIGIN=	Mestrelab Research S.L.
##OWNER=	hrzepa
##$MNOVA/LINK_BLOCK_TYPE=	ITEM	$$ NMR Spectrum
##$MNOVA/ITEM/POLYGON=	(XY..XY)
5321,5835
8722,5835
8722,8208
5321,8208
5321,5835
##$MNOVA/ITEM/Z=	0
##$MNOVA/ITEM/ANGLE=	0
##TITLE=	Nov18-2021.73.fid
##JCAMP-DX=	6.0	$$ MestReNova 14.3.0-30573
##BLOCK_ID=	2
##DATA TYPE=	MNOVA NMR VIEW DATA
##DATA CLASS=	MNOVA VIEW DATA
##$MNOVA/ITEM/ZOOM/X=	-31.150195598113686657,	251.15679998888273872
##$MNOVA/ITEM/ZOOM/Y=	-260.45673942565917969,	2734.9389190673828125
##END=	
##TITLE=	Nov18-2021.73.fid
##JCAMP-DX=	6.0	$$ MestReNova 14.3.0-30573
##BLOCK_ID=	3
##DATA TYPE=	NMR SPECTRUM
##DATA CLASS=	XYDATA
##NUMDIM=	1
##ORIGIN=	Bruker BioSpin GmbH
##OWNER=	nmr
##.OBSERVE FREQUENCY=	100.64143946071199309
##.OBSERVE NUCLEUS=	^13C
##.SOLVENT NAME=	CDCl3
##.PULSE SEQUENCE=	zgpg30
##LONGDATE=	2021/11/19 00:25:00.000
##.ACQUISITIONMODE=	SIMULTANEOUS (DQD)
##$ORIGINAL FORMAT=	Bruker XWIN-NMR
##$MNOVA/SCALES_VERSION=	9
##$PARAMETER FILE=	(acqus, ASCII, /private/var/folders/f6/rjf_tdyn2v98c5c0wvkgn4s80000gn/T/ZoEmiJvmShi5U1GTh9kuAg/73/acqus, 0)
$$ ##TITLE= Parameter file, TOPSPIN		Version 3.2
$$ ##JCAMPDX= 5.0
$$ ##DATATYPE= Parameter Values
$$ ##NPOINTS= 11	$$ modification sequence number
$$ ##ORIGIN= Bruker BioSpin GmbH
$$ ##OWNER= nmr
$$ $$ 2021-11-19 00:25:49.678 +0000  nmr@CZC2439F63
$$ $$ /opt/topspin/data/agmb/nmr/Nov18-2021/73/acqus
$$ $$ process /opt/topspin3.2/prog/mod/shimcntl
$$ ##$ACQT0= -2.26890760309556
$$ ##$AMP= (0..31)
$$ 100 100 100 100 100 100 100 100 100 100 100 100 100 100 100 100 100 100
$$ 100 100 100 100 100 100 100 100 100 100 100 100 100 100
$$ ##$AMPCOIL= (0..19)
$$ 0 0 0 0 0 0 0 0 0 0 0 0 0 0 0 0 0 0 0 0
$$ ##$ANAVPT= -1
$$ ##$AQSEQ= 0
$$ ##$AQ_mod= 3
$$ ##$AUNM= <au_zg>
$$ ##$AUTOPOS= <49 >
$$ ##$BF1= 100.63037
$$ ##$BF2= 400.2
$$ ##$BF3= 100.63037
$$ ##$BF4= 100.63037
$$ ##$BF5= 100.63037
$$ ##$BF6= 100.63037
$$ ##$BF7= 100.63037
$$ ##$BF8= 100.63037
$$ ##$BYTORDA= 0
$$ ##$CAGPARS= (0..11)
$$ 0 0 0 0 0 0 0 0 0 0 0 0
$$ ##$CFDGTYP= 0
$$ ##$CFRGTYP= 9
$$ ##$CHEMSTR= <none>
$$ ##$CNST= (0..63)
$$ 1 1 145 1 1 1 1 1 1 1 1 1 1 1 1 1 1 1 1 1 1 1 1 1 1 1 1 1 1 1 1 1 1 1 1
$$ 1 1 1 1 1 1 1 1 1 1 1 1 1 1 1 1 1 1 1 1 1 1 1 1 1 1 1 1 1
$$ ##$CPDPRG= (0..8)
$$ <waltz16> <> <waltz16> <> <mlev> <mlev> <mlev> <mlev> <mlev>
$$ ##$D= (0..63)
$$ 0 1 0.00345 0 0 0 0 0 0 0.06 0 0.03 2e-05 3e-06 0 0 0.0002 0 0 0 0 0 0
$$ 0 0 0 0 0 0 0 0 0 0 0 0 0 0 0 0 0 0 0 0 0 0 0 0 0 0 0 0 0 0 0 0 0 0 0 0
$$ 0 0 0 0 0
$$ ##$DATE= 1637281548
$$ ##$DE= 6.5
$$ ##$DECBNUC= <off>
$$ ##$DECIM= 704
$$ ##$DECNUC= <off>
$$ ##$DECSTAT= 4
$$ ##$DIGMOD= 1
$$ ##$DIGTYP= 12
$$ ##$DQDMODE= 0
$$ ##$DR= 21
$$ ##$DS= 4
$$ ##$DSPFIRM= 0
$$ ##$DSPFVS= 20
$$ ##$DTYPA= 0
$$ ##$EXP= <c13>
$$ ##$F1LIST= <111111111111111>
$$ ##$F2LIST= <222222222222222>
$$ ##$F3LIST= <333333333333333>
$$ ##$FCUCHAN= (0..9)
$$ [...]
$$ ##$Sgu3PowerLevels= (0..7)
$$ 0 0 0 0 0 0 0 0
$$ ##$Sgu4PowerLevels= (0..7)
$$ 0 0 0 0 0 0 0 0
$$ ##$Sgu5PowerLevels= (0..7)
$$ 0 0 0 0 0 0 0 0
$$ ##$Sgu6PowerLevels= (0..7)
$$ 0 0 0 0 0 0 0 0
$$ ##$Sgu7PowerLevels= (0..7)
$$ 0 0 0 0 0 0 0 0
$$ ##$Sgu8PowerLevels= (0..7)
$$ 0 0 0 0 0 0 0 0
$$ ##$SguType= 3
$$ ##$ShimPowMaxUA= (0..63)
$$ 130000 130000 130000 130000 130000 130000 130000 130000 130000 130000 130000
$$ 130000 130000 130000 130000 130000 130000 130000 130000 130000 0 0 0 0
$$ 0 0 0 0 0 0 0 0 0 0 0 0 0 0 0 0 0 0 0 0 0 0 0 0 0 0 0 0 0 0 0 0 0 0 0 0
$$ 0 0 0 0
$$ ##$ShimPowMaxUC= (0..63)
$$ 130000 130000 130000 130000 130000 130000 130000 130000 130000 130000 130000
$$ 130000 130000 130000 130000 130000 130000 130000 130000 130000 0 0 0 0
$$ 0 0 0 0 0 0 0 0 0 0 0 0 0 0 0 0 0 0 0 0 0 0 0 0 0 0 0 0 0 0 0 0 0 0 0 0
$$ 0 0 0 0
$$ ##$ShimPowMaxUG= (0..63)
$$ 524287 524287 524287 524287 524287 524287 524287 524287 524287 524287 524287
$$ 524287 524287 524287 524287 524287 524287 524287 524287 524287 0 0 0 0
$$ 0 0 0 0 0 0 0 0 0 0 0 0 0 0 0 0 0 0 0 0 0 0 0 0 0 0 0 0 0 0 0 0 0 0 0 0
$$ 0 0 0 0
$$ ##$ShimPowRcbType= 3
$$ ##$ShimPowRes= (0..63)
$$ 1e-20 1e-20 1e-20 1e-20 1e-20 1e-20 1e-20 1e-20 1e-20 1e-20 1e-20 1e-20
$$ 1e-20 1e-20 1e-20 1e-20 1e-20 1e-20 1e-20 1e-20 0 0 0 0 0 0 0 0 0 0 0 0
$$ 0 0 0 0 0 0 0 0 0 0 0 0 0 0 0 0 0 0 0 0 0 0 0 0 0 0 0 0 0 0 0 0
$$ ##$ShimPowRng0= (0..63)
$$ 1 1 1 1 1 1 1 1 1 1 1 1 1 1 1 1 1 1 1 1 0 0 0 0 0 0 0 0 0 0 0 0 0 0 0 0
$$ 0 0 0 0 0 0 0 0 0 0 0 0 0 0 0 0 0 0 0 0 0 0 0 0 0 0 0 0
$$ ##$ShimPowRng1= (0..63)
$$ 1 1 1 1 1 1 1 1 1 1 1 1 1 1 1 1 1 1 1 1 0 0 0 0 0 0 0 0 0 0 0 0 0 0 0 0
$$ 0 0 0 0 0 0 0 0 0 0 0 0 0 0 0 0 0 0 0 0 0 0 0 0 0 0 0 0
$$ ##$ShimPowRng2= (0..63)
$$ 1 1 1 1 1 1 1 1 1 1 1 1 1 1 1 1 1 1 1 1 0 0 0 0 0 0 0 0 0 0 0 0 0 0 0 0
$$ 0 0 0 0 0 0 0 0 0 0 0 0 0 0 0 0 0 0 0 0 0 0 0 0 0 0 0 0
$$ ##$ShimPowRng3= (0..63)
$$ 1 1 1 1 1 1 1 1 1 1 1 1 1 1 1 1 1 1 1 1 0 0 0 0 0 0 0 0 0 0 0 0 0 0 0 0
$$ 0 0 0 0 0 0 0 0 0 0 0 0 0 0 0 0 0 0 0 0 0 0 0 0 0 0 0 0
$$ ##$ShimSysFunc= (0..63)
$$ 1 2 3 4 5 7 9 11 15 16 8 10 12 14 6 17 13 18 19 20 0 0 0 0 0 0 0 0 0 0
$$ 0 0 0 0 0 0 0 0 0 0 0 0 0 0 0 0 0 0 0 0 0 0 0 0 0 0 0 0 0 0 0 0 0 0
$$ ##$ShimSysMatrix= 0
$$ ##$ShimSysType= 1
$$ ##$TFXNUM= 0
$$ ##$TRIPLO2= 0
$$ ##$VTU= 2
$$ ##$VTUETH= <149.236.99.20>
$$ ##$VTUTY= <no>
$$ ##$WBREFAM= (0..15)
$$ 135.5 97.7 100 100 100 100 100 100 100 100 100 100 100 100 100 100
$$ ##$WBREFLM= (0..15)
$$ 0 0 0 0 0 0 0 0 0 0 0 0 0 0 0 0
$$ ##$WBREFPH= (0..15)
$$ 72.26 -67.22 0 0 0 0 0 0 0 0 0 0 0 0 0 0
$$ ##$WBSGU= (0..15)
$$ 0 0 0 0 0 0 0 0 0 0 0 0 0 0 0 0
$$ ##$XFAC= 2
$$ ##END=
$$ 
##$DECIM=	704
##$DSPFVS=	20
##XUNITS=	HZ
##YUNITS=	ARBITRARY UNITS
##FIRSTX=	25274.001712016048259
##LASTX=	-3134.6557087493106337
##DELTAX=	-0.43348832563920586258
##XFACTOR=	1
##YFACTOR=	0.083584533534718397085
##FIRSTY=	11.392010688781738281
##MINY=	-11.825925827026367188
##MAXY=	2486.30810546875
##NPOINTS=	65536
##XYDATA=	(X++(Y..Y))
$$ [...]
13399B8j8ojljJ8M8O4N2L0K0J9Oj7l0j5J4L1K7Pj6l5m5m0k5lJ7K4J2rk6k7j4NJ4Rj1k8k8q
13381C9J1J6J0J1K1K8J9Kj2j5qjQJ5K3K4K0J2KnokMPOlj0j3qlKOJ2J3Nrj5mJ7L1L0J6kj7k6
13362B51l0k8k1nJ4L3M4M4K8Jl1m7m6l7l0k0nL%oML0M1K9Pmpj3k2j6JJ4J1J%OQORJ9K3J5L
13343B77MJ8K2RopJ0L2N1O6P9Q7Q9R3J07J22J14N7m9j60k20k07j49r4n6l1j8k3l4k7nJ0PO
13328A74K1L9L4J6Jnj2k1k3k3k0j2NNj8m6m6k2prjK6M3L0OJ0L5N1L6Qj5k4k5j7lKmj6k2j8
13311A33q%ORQRK0L5L3Pl0m7l1lJj7l0j5J7M2M4L0J0j1k6k8j3J0J7Nj0nJ5K8K5J7K2L0K5J0
13294C34NQLj0j8j1pj4k2j5JOjprqj1j7k8l3k1OK4K2J6K4L3K3rl7m3l0j2KNkpplopLJ6K0K1
13274A77K3K2Pj8l0k2j0nKQKj6k6j8mrk9m4l7qL2N5M8J9KQJ8J6J7L4M4J8k6m7k4LMrj1LRJ
$$ y = [28, 10, 4, 3, 0, -1, 17, 65, 129, 181, 211, 231, 250, 256, 239, 209, 194, 208, 239, 266, 273, 257, 222, 177, 137, 112, 109, 126, 150, 162, 153, 127, 100, 86, 91, 105, 114, 103, 75, 47, 39, 50, 66, 76, 87, 108, 136, 155, 157, 145, 130, 122, 121, 129, 144, 167, 191, 211, 223, 225, 220, 214, 212, 216, 223, 229, 226, 216, 203, 195, 192, 194, 200, 212, 225, 230, 221, 206, 202, 219, 250, 280, 296, 294, 277, 251, 221, 193, 172, 167, 181, 214, 258, 302, 330, 331, 300, 253, 207, 170, 140, 120, 115, 118, 118, 112, 116, 146, 187, 216, 223, 219, 212, 199, 177, 161, 162, 176, 187, 188, 188, 194, 202, 208, 217, 236, 259, 274, 277, 281, 299, 321, 330, 324, 317, 327, 359, 410, 476, 555, 642, 731, 824, 931, 1053, 1167, 1224, 1175, 1015, 795, 588, 439, 345, 289, 258, 240, 217, 183, 156, 151, 161, 168, 174, 195, 234, 268, 284, 285, 280, 268, 247, 224, 201, 181, 169, 174, 179, 161, 115, 69, 47, 40, 31, 30, 56, 99, 129, 135, 145, 180, 231, 267, 275, 260, 236, 211, 194, 191, 193, 189, 173, 151, 133, 125, 125, 131, 140, 148, 157, 177, 212, 245, 252, 222, 175, 144, 141, 142, 125, 95, 80, 97, 139, 183, 213, 223, 212, 186, 158, 145, 155, 172, 177, 167, 162, 177, 205, 230, 247, 269, 299, 324, 334, 339, 347, 350, 340, 322, 311, 304, 290, 268, 253, 254, 260, 259, 252, 243, 235, 224, 207, 179, 146, 125, 131, 155, 177, 193, 217, 250, 273, 264, 227, 184, 154, 142, 144, 149, 147, 140, 133, 130, 124, 117, 120, 136, 156, 177, 200, 222, 229, 211, 181, 159, 149, 144, 146, 154, 156, 140, 114, 96, 92, 83, 54, 10, -27, -35, -3, 52, 100, 119, 121, 129, 147, 163, 180, 214, 258, 276, 250, 203, 179, 182, 186, 177, 166, 169, 178, 179]
13256A79j6k7l3l5k8lK7M6L3kk5j7J2K8K1NJJ6M3O0M8Mm0n3l5k1k8l6l0j6j4j5mJ0Oj0qJ5
13239E8L5L2K2K5L4K4mk7k7j1jpj5j3OK1J6nj8j0NJ0Kqj0qjPJ6J9J6RNLnj6k7k1KL1M1L0J0
13221B45oj8k9l0pK2L0J6PJ7L0J7j6l9l4j2J1K5K8K5J4lk5l9l0%K6J9j5m5m5k1NK6L6K8kl6
13204A75m0j5J4J7QLRJ4J5J5J5J0JmmnpmKMmj5j3l%pj6j4pmorlQJ6J4jk0l1k9j3J0K9K9J1
13185A45pkJ7K1Jk2k4j4j5k5k9j5J0L5M6M0J8Jlqk7m3l4kK3J9%rj1j1qLJ9L1L3K6Qj4k5k1
13168A27j0jRK7M1L6J0j7l2l3k5rRK3L2L2K0nl1l8l2k4j5mKj1k6j6J9M3K8pk8l1l3l6k4QK9
13151GK5QLJ7L7M6L8K2J4J6J5ll2m4k8pKlkQJ2MkJRNj5l4l0kK3K5Lj8k2j4j2j4oK0M6M9L0
13132A97J0Jlj6k9l5k3kK1L9M3K9OrpMNqk2k8k0JK1K8J8jj1qNJ4J4MroJ4L4L2Nk0k4qQJ2M
$$ y = [179, 163, 136, 103, 68, 40, 37, 64, 110, 143, 141, 116, 99, 111, 139, 160, 165, 166, 182, 225, 285, 333, 337, 297, 244, 209, 188, 160, 124, 94, 78, 64, 49, 45, 55, 61, 51, 43, 58, 93, 125, 147, 172, 206, 230, 226, 199, 172, 161, 160, 153, 138, 125, 131, 152, 168, 163, 145, 135, 140, 150, 152, 144, 134, 126, 125, 132, 148, 167, 183, 192, 197, 200, 195, 179, 152, 131, 133, 164, 205, 235, 245, 239, 221, 192, 162, 155, 177, 207, 223, 230, 247, 277, 294, 278, 239, 205, 193, 204, 229, 257, 282, 296, 293, 268, 229, 199, 199, 225, 244, 229, 184, 139, 118, 123, 149, 185, 213, 211, 175, 135, 120, 134, 151, 159, 162, 171, 185, 200, 215, 230, 240, 241, 237, 233, 228, 221, 217, 219, 223, 219, 204, 191, 188, 188, 181, 165, 151, 144, 140, 134, 125, 122, 130, 146, 160, 159, 139, 108, 79, 66, 76, 105, 134, 145, 138, 136, 153, 174, 175, 153, 129, 115, 100, 75, 46, 31, 41, 76, 122, 162, 180, 181, 178, 170, 143, 100, 66, 64, 87, 106, 106, 97, 86, 75, 67, 70, 89, 120, 153, 179, 187, 173, 148, 127, 117, 116, 125, 152, 193, 229, 239, 222, 190, 157, 132, 123, 132, 155, 187, 219, 239, 234, 203, 165, 133, 109, 94, 90, 92, 81, 55, 39, 58, 101, 129, 122, 94, 63, 30, -6, -30, -22, 7, 32, 40, 43, 60, 97, 143, 181, 203, 217, 233, 248, 245, 213, 169, 141, 134, 136, 133, 131, 139, 151, 155, 153, 154, 163, 168, 153, 119, 89, 87, 110, 135, 138, 120, 98, 84, 72, 58, 52, 72, 118, 167, 197, 207, 208, 205, 189, 160, 125, 102, 100, 121, 160, 203, 232, 238, 229, 222, 226, 231, 223, 201, 173, 153, 154, 175, 203, 221, 220, 209, 201, 206, 220, 234, 238, 229, 223, 237, 271, 303, 308, 288, 264, 256, 264, 276, 280]
13113B80oj0j0j5k4l2k6qRJ3RJ1J7J7Ooj5j7qJ4M1N0L1Omnj7l7l9pL2M0K1LMJ0PKPPpk4k1
13094B99kMqk6k7j8j2j5k0j7lJ4J9Jk4k8qJ8L2L4L6L3K1Ojj%KNjk5m7m2j1J9K2Jk9m4l6j1
13077A10RJ1LjKNJ2K2K1jk0qK6L5Ok3j9LJ4J8L4M7K7j8m0k3OJ3RRJ5J3POJ0J5J6J3P%lmpj6
13057C61k2k7l1l8l7k2nOQJ0K0L2L8L0J4kkJ0J8J9J4PMOJ8K1Nj6j2J7L8L2J9J7J5jj0PL6M9
13040F46M8N2N9O5Q2J23J67K01K66M02N26M52J07l34o03n96m34k83j98j40q5n1m3m1l3k5k0
13028C10rNNokK4M7L7J0JJ6K6J9J2K2L7M2M4N8Q2J00J21J58K10K72L45M02L50J17k29m97n51
13015A578m39k99k07j42q5m6l4l0j7qrlJ1J9Rjkjj1k2j9j6k4l4l0j4ookKnk6l6j5K4N5O3M7
12998B19K1ok2k9k7k6j9j0nlKJ4L6N4N9N6M8L7J3j9m4m4k3j0j3k0j0PJ0nj9j7j2j4k3k2j4
$$ y = [280, 274, 264, 254, 239, 215, 183, 157, 149, 158, 171, 180, 191, 208, 225, 231, 225, 210, 193, 185, 199, 240, 290, 321, 327, 323, 318, 301, 264, 225, 218, 250, 290, 311, 314, 318, 328, 335, 337, 344, 351, 344, 320, 299, 297, 301, 293, 267, 240, 222, 210, 195, 175, 158, 155, 169, 188, 189, 165, 137, 129, 147, 179, 213, 249, 282, 303, 309, 308, 307, 307, 309, 314, 313, 288, 241, 199, 188, 207, 229, 230, 201, 157, 121, 110, 119, 130, 133, 132, 134, 139, 151, 173, 194, 193, 173, 165, 191, 226, 232, 209, 190, 193, 207, 225, 259, 306, 333, 315, 275, 252, 258, 271, 280, 289, 304, 317, 324, 330, 340, 355, 371, 384, 391, 391, 388, 384, 377, 361, 339, 312, 281, 243, 206, 184, 179, 185, 193, 203, 223, 255, 293, 323, 337, 335, 333, 343, 361, 380, 394, 401, 405, 411, 429, 450, 455, 439, 427, 444, 482, 514, 533, 550, 565, 564, 554, 561, 597, 646, 694, 746, 805, 870, 952, 1075, 1242, 1443, 1709, 2111, 2637, 3089, 3196, 2862, 2259, 1663, 1229, 946, 748, 608, 523, 472, 429, 388, 355, 330, 310, 301, 306, 311, 305, 303, 327, 374, 411, 421, 422, 438, 464, 483, 495, 517, 554, 596, 640, 698, 780, 880, 1001, 1159, 1369, 1641, 1986, 2388, 2738, 2855, 2626, 2129, 1578, 1139, 840, 633, 491, 406, 360, 326, 296, 279, 271, 262, 259, 270, 289, 298, 297, 295, 294, 283, 261, 242, 226, 202, 168, 138, 124, 118, 112, 110, 112, 107, 81, 45, 30, 54, 109, 172, 219, 240, 234, 212, 183, 156, 130, 111, 101, 96, 93, 95, 109, 145, 199, 258, 314, 362, 399, 412, 393, 349, 305, 282, 272, 259, 239, 229, 236, 246, 241, 222, 205, 193, 179, 156, 134, 120]
12982A20j3k0k2rJ1K1K0J6J5J6J6J7K3K8K7K0J0LKLNJ2K7M7O6P8J01J38J53R9k6j46j86j44
12967E28p9l8k5k2j7rLPKpkJ1Pj9m1m2l0j9oJ5L3L1J2nj5k5k6j1J0Qj7l8l6j6RL1M2L7J7j
12950B57plKJ7L4M1L2K3K5L0K1J1K2N2Q2J02J32J74K11K45L11M03M18K51p9l97n38m92l71
12937A009k66j83j01l8k2l9n3m5l1k3j4kLqk6l8l6j7NJ5Kk1k7j1J0J6J1J0J4J2jj6k4k8l4
12922Cl4k2KK3L1K7J7Lj8l5l3pJ9K6J8J0Lnj1%K6M4M4L4K2RjKJ5J4pk6k2oKJMQMm%J2J0j3
12903A89l3l1j2MPKkjM%j7l6m0k7j8j8j1J3L4L2J1j0j2%K0L6L6K0QJ4K5J6j0k7j6NJ3J1QJ0
12886A97Mj4k9l0j6LJ1J1J0J8K9L6K7J1oj8k5k3j5j3k3l4k7%L1L8J9pk5l3m1m6m2k3NK6K4
12870A0J3KLJ3K2K5K3J4OmroMQJj6k7k5k1j9j9j8j8k5l1j9OK3J5mqPK1K0RPJ9L4L3J4pj2j
$$ y = [120, 107, 87, 65, 56, 67, 88, 108, 124, 139, 155, 171, 188, 211, 239, 266, 286, 296, 299, 301, 304, 309, 321, 348, 395, 461, 539, 640, 778, 931, 1030, 1004, 858, 672, 528, 449, 411, 386, 364, 347, 338, 341, 348, 350, 343, 341, 352, 359, 340, 299, 257, 227, 208, 202, 217, 250, 281, 293, 288, 273, 248, 222, 211, 221, 229, 212, 174, 138, 122, 131, 162, 204, 241, 258, 257, 250, 247, 249, 266, 300, 341, 373, 396, 421, 451, 472, 483, 505, 557, 639, 741, 873, 1047, 1258, 1503, 1814, 2217, 2635, 2886, 2807, 2410, 1872, 1380, 1009, 743, 560, 459, 421, 399, 360, 307, 262, 231, 208, 194, 192, 195, 187, 161, 123, 87, 70, 75, 90, 92, 71, 44, 33, 43, 59, 70, 80, 94, 106, 105, 89, 65, 37, 3, -31, -53, -51, -28, 3, 30, 47, 50, 32, -3, -36, -43, -24, 2, 20, 30, 33, 28, 17, 17, 43, 87, 131, 165, 187, 196, 195, 197, 212, 226, 219, 193, 171, 165, 167, 168, 172, 180, 184, 180, 180, 192, 202, 189, 156, 125, 113, 117, 124, 126, 124, 123, 127, 127, 110, 74, 34, 7, -11, -29, -40, -27, 7, 39, 50, 40, 28, 28, 48, 84, 120, 140, 148, 162, 187, 203, 193, 166, 150, 155, 168, 179, 187, 197, 201, 187, 158, 128, 112, 115, 126, 137, 147, 165, 194, 230, 257, 268, 262, 244, 219, 196, 181, 168, 145, 111, 84, 84, 115, 153, 172, 165, 140, 107, 66, 20, -22, -45, -40, -14, 10, 23, 25, 28, 41, 63, 88, 111, 125, 131, 127, 118, 112, 116, 124, 125, 109, 82, 57, 36, 17, -2, -20, -38, -63, -94, -113, -107, -84, -69, -73, -81, -74, -53, -33, -24, -17, 2, 36, 69, 83, 76, 64, 63]
12851F3Nj3l7l0J1N8P3M5Mk3k5j1QK3K9J9pl8n4m0mL0M1L5J8%j8k9k4j0oj6k5j6MJ8J8J4J2
12834A02J3J0Knj2j3j2j2j4j4qKNLkoojJ2K5K0ok9k6OL4L1Nj9k4j4kNLjNK1K6J1rrJ4L4K8
12815A73Kk4l8l6k1kRJ3K5M5N6L4pl7m2l1j5OK7K4Jj9rJ6K7J7jj3k7l9m2k7nJ1J7J0pl1m4
12798dl5qJ3K4K8M3N8N4L1KpQK4K6Qj1k3l0l4l1j6%Moj3oJ2K4K2J3OOMnj7k4j8kQMqj7j7j7
12779G3j6j2ljnnJJ0J0NPJ0OMJ1J9Rk0l7k4OJ8Qnnmj1j3jK0L4L4K5J8J4J3J2Kqj4j2j2j6k1
12760A24j7nKLNJ0J1Omj4j6pJ0K8L5K8J2nj8k6k9k3j0J0K3K6J8NllRJ7J1rk7k1JJ6J1K%OJ
12741A93j4k9l7l0j1J3K7J7%oOQmj2MK7K7QnJOkj0pKMmqkPJ1J0J1Pmk0k9k1KJ9J8lj8j4QL2
12721A78M2L8K9K6K5J5nk5l4k8j5mMJ1J5Qpk2k6j6KJ4J0lj2j5j8k5k4j4JQQJ1J5R%KJ9L5L1
$$ y = [63, 68, 55, 18, -12, -1, 57, 130, 175, 179, 156, 131, 120, 128, 151, 180, 199, 192, 154, 100, 60, 56, 86, 127, 162, 180, 180, 162, 133, 109, 99, 93, 77, 52, 36, 40, 58, 76, 90, 102, 115, 125, 127, 122, 110, 97, 85, 73, 59, 45, 37, 39, 44, 47, 45, 39, 33, 32, 44, 69, 89, 83, 54, 28, 34, 68, 99, 104, 85, 61, 47, 45, 50, 53, 52, 57, 78, 104, 115, 106, 97, 111, 145, 173, 175, 151, 113, 77, 56, 54, 63, 76, 101, 146, 202, 236, 229, 192, 150, 119, 104, 110, 137, 161, 162, 143, 134, 150, 177, 194, 193, 180, 153, 114, 72, 45, 40, 51, 68, 78, 71, 40, -4, -39, -47, -34, -10, 18, 61, 119, 173, 204, 206, 199, 207, 231, 257, 265, 254, 231, 201, 167, 136, 120, 120, 124, 118, 105, 99, 111, 135, 157, 170, 176, 182, 186, 181, 164, 140, 122, 120, 128, 132, 124, 107, 90, 73, 57, 45, 42, 41, 36, 31, 32, 42, 52, 57, 64, 74, 80, 84, 95, 114, 123, 103, 66, 42, 48, 66, 74, 69, 64, 60, 49, 36, 35, 55, 89, 123, 148, 166, 180, 193, 205, 207, 199, 185, 173, 161, 145, 124, 107, 102, 104, 107, 112, 122, 133, 139, 135, 121, 105, 98, 108, 136, 171, 199, 211, 206, 188, 162, 133, 110, 100, 110, 133, 159, 177, 182, 179, 176, 185, 202, 213, 204, 177, 156, 157, 173, 184, 186, 186, 192, 193, 179, 150, 113, 83, 72, 85, 112, 129, 129, 123, 129, 137, 133, 121, 125, 152, 179, 187, 182, 183, 189, 187, 177, 170, 172, 176, 172, 164, 162, 169, 180, 190, 201, 208, 204, 184, 155, 134, 136, 155, 173, 170, 152, 138, 146, 178, 220, 258, 287, 313, 338, 353, 348, 323, 289, 261, 246, 242, 246, 257, 272, 280, 273, 251, 225, 209, 211, 225, 235, 232, 220, 205, 187, 162, 138, 124, 125, 133, 141, 152, 167, 176, 176, 178, 197, 232, 263]
12704B63Nk4m7n2m6l6k5j0J0K1J2jjJ2K2K5L3M5L3j0m8m6j4QPNJ2J2kj7j6j6k8l9l2j2KRJ6
12687C0K2K3K3L4M7L8Oj9j8nnj4j7jJ1Nj7l8m1k6lJ9L4L9L1J2mpKRLj0j5qNJ8K5J7kj7j3N
12669A78Nj5l1j8PJ2jpLJ0L%QJ9J7QMJj3k7k5j4j3k0k1j0JOJ1J6J8J9K7L0J6j3k5pJ6J5jj1
12650A78nKjj0j6j0OK2K0Jj4rkj3k6j9KJ4RRJ8J8NlMJ0kj8j5ljlRL0L9K5Mnqj3j9k1k2k8k9
12631A10j4J1K4J3j0k2j7nlj1j7j2jPJ0J9L5N6O5N6L4J3Lkj1k3k9k8k7l3l4k3rKRJ8K5J4q
12614A85k3j9%J0N%OK3L3K5Lj3j5j2j8l3l8k3jOpk4k2jJ7J9ROJj5l3k7LK7J8ljK0K0pk8j4
12596E9K0L6K5J0%kl%OQRRMnrmK%j5k5k7k3j5mMQPJ1J7J1qk7k5mK2L8L2J7J0K2L3K3kj3kJ1
12576B41RLOJ7J8MpoQK0J9%l0m4l2rLmrlM%ojJ0J3Q%knj1j6k0k1j5nMOj%RJ4OpqJJj5k9k4
$$ y = [263, 268, 244, 197, 145, 99, 63, 38, 28, 38, 59, 71, 70, 69, 81, 103, 128, 161, 206, 239, 229, 181, 135, 121, 129, 136, 141, 153, 165, 163, 146, 130, 114, 86, 47, 15, 3, 5, 14, 30, 52, 75, 98, 132, 179, 217, 223, 204, 186, 181, 176, 162, 145, 144, 155, 160, 143, 105, 64, 38, 35, 54, 88, 127, 158, 170, 166, 159, 161, 170, 173, 163, 148, 140, 145, 163, 188, 205, 203, 186, 173, 178, 183, 168, 137, 119, 126, 138, 137, 130, 133, 143, 146, 146, 154, 173, 190, 198, 202, 203, 190, 163, 138, 124, 111, 91, 70, 60, 61, 67, 78, 94, 112, 131, 158, 188, 204, 191, 166, 159, 175, 190, 189, 178, 173, 175, 174, 164, 148, 138, 144, 166, 186, 187, 173, 164, 162, 149, 123, 104, 106, 120, 129, 138, 156, 174, 179, 176, 180, 190, 188, 170, 155, 152, 151, 148, 157, 187, 226, 251, 255, 250, 242, 229, 210, 189, 167, 139, 110, 96, 107, 131, 144, 134, 112, 95, 90, 87, 76, 59, 47, 46, 53, 63, 82, 117, 173, 238, 294, 328, 341, 344, 342, 331, 308, 279, 251, 224, 191, 157, 134, 125, 127, 136, 154, 179, 193, 185, 162, 143, 143, 153, 158, 158, 164, 187, 220, 245, 248, 235, 220, 208, 190, 157, 119, 96, 95, 101, 94, 70, 48, 47, 64, 83, 92, 98, 99, 84, 51, 24, 27, 54, 72, 69, 68, 88, 108, 101, 73, 59, 79, 115, 140, 150, 150, 148, 145, 145, 151, 159, 168, 177, 181, 176, 167, 163, 165, 165, 150, 125, 98, 75, 60, 56, 60, 68, 75, 86, 103, 114, 106, 79, 54, 50, 72, 110, 142, 159, 169, 191, 224, 247, 245, 232, 230, 241, 250, 253, 259, 276, 294, 298, 291, 285, 293, 313, 332, 332, 302, 258, 226, 217, 220, 216, 207, 204, 208, 208, 202, 201, 211, 224, 232, 232, 230, 225, 214, 198, 178, 157, 142, 137, 141, 147, 146, 146, 155, 169, 175, 168, 160, 161, 162, 147, 118, 94]
12554I4pKpk1k6j3J5M4N2K7j0k9k4k0l3m2k3J1L2L1J4JnMK1L7L4J4kqqmMJ4K0J9J3J0Joj0
12536B16j3k0k9j8RK9K1kj7j7j8k2k3k2k3k2rJ5L0K6J2MJ1K4L4L5K6J8J0KprKJ7J5pl0l1j5
12519B02NRjj3k0j9j7j3rj0j1rNK2K9J5rj7pJ0J8J1jj0j0rj5k4j9J0M2N0K9PLJ2J2lk1k7k4
12502A73j9k3k7k5j6j6k5k8j7LPJ%PJ0QNOKqpJ0K5K6J6J0QNPJ6K1J6J1J1J1%j9l4l9l6k0Q
12483F4K6J9kj2%J4J2kj4j1J1L3L5J1j9l3k7j5KJ8K4Rj1j4pj0k2j5J3L8L6J9Lj0k3k4qRJ4
12467A31J2J6J6RjkMMMJ0J6Orj5j0j3k1j6J1L2K4kk4l0k6k0j0LJ4J6Mk0m2n0l5nK5L5K3Lr
12449E8j1j4j6rJ1K9L4K3Oj2k0j4JJ4J4J3K0K6K5K0K5L7L5J4j4k9l2k3qJ3L3M1L0kl3m1j8
12433B26J0J6Kqpkoj4k1k8l2k4mJ5K2K1K2K3K2K1J9J6J1Mpk4m3n0m0j9lMMkp%J0J2Jj2j6j1
$$ y = [94, 87, 89, 82, 61, 35, 22, 37, 81, 133, 160, 150, 121, 97, 77, 44, 2, -21, -10, 22, 53, 67, 68, 63, 67, 88, 125, 159, 173, 171, 163, 155, 151, 155, 169, 189, 208, 221, 231, 232, 226, 216, 203, 183, 154, 136, 145, 174, 195, 193, 176, 159, 141, 119, 96, 74, 51, 29, 20, 35, 65, 91, 103, 107, 118, 142, 176, 211, 237, 255, 265, 267, 260, 251, 253, 270, 285, 278, 248, 217, 202, 207, 216, 215, 202, 182, 163, 146, 133, 124, 114, 103, 94, 99, 121, 150, 165, 156, 139, 132, 142, 160, 171, 170, 160, 150, 141, 126, 102, 83, 93, 135, 185, 214, 221, 224, 236, 248, 245, 224, 197, 173, 154, 131, 104, 79, 63, 47, 22, -6, -23, -20, -13, -12, -12, -5, 5, 13, 18, 24, 26, 18, 11, 21, 46, 72, 88, 98, 106, 111, 118, 134, 155, 171, 182, 193, 204, 204, 185, 151, 112, 76, 56, 64, 90, 109, 107, 95, 95, 109, 121, 119, 105, 94, 105, 138, 173, 184, 165, 132, 105, 90, 92, 110, 134, 143, 132, 118, 111, 101, 79, 64, 77, 115, 151, 170, 173, 163, 140, 116, 108, 117, 131, 143, 159, 175, 184, 183, 181, 185, 189, 193, 203, 219, 225, 216, 201, 191, 178, 157, 141, 152, 184, 208, 206, 182, 152, 126, 106, 96, 99, 113, 129, 133, 113, 71, 21, -14, -19, 6, 41, 64, 67, 58, 47, 33, 17, 8, 19, 48, 82, 105, 111, 99, 79, 65, 66, 80, 94, 107, 127, 153, 178, 198, 223, 260, 295, 309, 295, 266, 234, 211, 203, 216, 249, 290, 320, 318, 285, 244, 226, 236, 252, 254, 246, 239, 237, 231, 217, 196, 168, 136, 112, 108, 123, 145, 166, 188, 211, 233, 254, 273, 289, 300, 304, 297, 273, 230, 180, 140, 121, 118, 122, 126, 124, 117, 117, 127, 139, 140, 128, 112, 101]
12415A01lKJj4l3l4j0K2L2K2J0PPJrk0k2rJ4K4Qk1l4j5J5L4K7%k1j8NK0J3NK4O1P3L8j7m8
12397B38m3k1%J3Oj6l5l1j0QJ6J4Oj0k7k8j2JJnooj4k7k8j4KJ0QL%lnokJ3L2L9K6RMJ0Lj8
12378I5k8j0J7K3Pj3k0j7j0NK6L0Rj5j6MJ5Kj7j5MJ5LrKK9M1J9j7l2k0NK5L7L4J2k0l6k8l
12361A33J3J2Koqnmrj4j0JJ0J4J8J7Pnj0%QPLQJ3Rnj5j4oKP%j0j6j1pj2j1PL6M8M1K3J0lj0
12341B58j3j7k8l2j2J5K2NoRK7K5Pkkqk1k7j9rpj1j4j3nOJ9K8L1K5Rj3k8k2lJ0Omj1j4j4j2
12323A35mPJ6J3Kj1j7k0k7l2k0NK2J7J0K3M4M6K0pj6j3qojKKJ0K4K6J0rj1JMnj5k0k4k9k8
12305A16j0J1J7J1%lmm%PJ4Pj3l4m5m1k1J1L8M4K1j0j7OL8N3M4J4k0l9l5j6nj5l1l9l0j1J0
12288A9K0J3nj0NK2J5j%K3M2L4Rpj1j1j0qklj0j5j4p%NOQJ1J5J2Nnj2j8j3KK1K5J4LPJ8J4
$$ y = [101, 98, 100, 101, 87, 54, 20, 10, 32, 64, 86, 96, 103, 110, 111, 102, 82, 60, 51, 65, 89, 97, 76, 42, 27, 42, 76, 103, 103, 82, 64, 69, 89, 102, 107, 131, 192, 265, 303, 286, 238, 195, 174, 174, 187, 193, 177, 142, 111, 101, 109, 125, 139, 145, 135, 108, 80, 68, 69, 70, 65, 59, 53, 39, 12, -16, -30, -28, -18, -10, -7, -7, -10, -15, -21, -23, -10, 22, 61, 87, 96, 100, 110, 113, 95, 67, 57, 74, 97, 104, 91, 71, 54, 44, 49, 75, 105, 114, 99, 83, 87, 102, 104, 87, 72, 76, 91, 94, 85, 87, 116, 157, 176, 159, 127, 107, 112, 137, 174, 208, 220, 200, 164, 136, 133, 146, 158, 160, 154, 146, 141, 137, 128, 114, 104, 105, 115, 129, 147, 164, 171, 166, 156, 156, 164, 171, 174, 182, 195, 204, 199, 184, 170, 164, 166, 173, 173, 163, 147, 136, 129, 117, 106, 113, 149, 197, 238, 261, 271, 268, 258, 245, 228, 200, 168, 156, 171, 193, 198, 192, 201, 228, 253, 260, 258, 256, 248, 227, 200, 181, 172, 165, 154, 140, 127, 122, 128, 147, 175, 206, 231, 240, 227, 199, 177, 174, 184, 190, 186, 175, 161, 147, 135, 131, 138, 154, 167, 169, 158, 141, 121, 94, 62, 42, 47, 69, 86, 96, 119, 163, 209, 229, 222, 206, 193, 185, 179, 178, 180, 182, 192, 216, 242, 252, 243, 232, 233, 237, 232, 217, 197, 173, 144, 116, 106, 117, 134, 145, 145, 142, 138, 134, 134, 141, 155, 162, 149, 115, 70, 29, 8, 19, 57, 101, 122, 112, 95, 101, 139, 192, 236, 250, 230, 191, 156, 140, 135, 120, 89, 50, 20, 9, 19, 39, 52, 47, 37, 42, 64, 79, 78, 78, 101, 143, 177, 186, 179, 168, 157, 147, 139, 137, 134, 124, 109, 95, 88, 88, 93, 99, 107, 118, 133, 145, 150, 145, 133, 115, 102, 104, 125, 150, 164, 167, 174, 192, 206]
12269B06nk3k3j0%%qj8k2k1j3m%oj8k2j1NJ1JrqKJ4K3K9K2RjOJ8J9J0QJ3J3mk0k2qOJ3J1M
12250A67nj0okkprnmmpqj0j4j4j1nLJ1J7J0J%J1K3K1QnnPJ7J7QmmQK8L8L1J1lnpj9l8m9m5
12229A30l4j9JK0K2%k1j9NK3J5oj8j3%J2J4RNOQ%j1j3JJ1Kj9l7l7k3kJ3J7J4J4J9K0J6J6J6
12212A57J0rk2j4RJ8Oj2k1j7j0rj2k2k1qJ2K6L1L4L6L5K5Nk5n4o6m7j5PJ6K1K6J7KoLJ6L0
12195A52M0M0J3k6l4KL6L1JqLKl0n8n7l0mJ1J4J3RQRKqj0KJ3Qpj7j7j4lJ9M1L9J2k0l1k3j6
12177A07k1k2pJ4K6K4J9J7J0lrkOJj2j3pqk2k7j2J1J9J3O%j0k3j6J4N1O4M5J5kjmk6n5o0l2
12159F8LJ4KrpjLJ2L3M9M7K8Pqk3l8m3l1j0OQJmMK6M2L4Pj1nJ4K3K1J4Mj3l2l6k2qj0j9k2
12140A18rPRrl5m6k7J0L2K9J7K1L5L8J7j2l5l9k6kJ7J8Prk1k2j1PJ8J1oj6j1kOJ6K1J6jj2
$$ y = [206, 201, 178, 155, 145, 145, 145, 137, 119, 97, 76, 63, 59, 59, 53, 35, 13, 2, 7, 18, 19, 10, 2, 4, 18, 41, 70, 92, 101, 100, 106, 124, 143, 153, 161, 174, 187, 183, 163, 141, 133, 139, 152, 163, 167, 162, 152, 146, 144, 142, 135, 126, 121, 117, 113, 106, 98, 88, 74, 60, 49, 44, 47, 58, 75, 85, 86, 86, 97, 120, 141, 149, 144, 139, 146, 163, 180, 188, 184, 180, 188, 216, 254, 285, 296, 293, 288, 281, 262, 224, 175, 130, 96, 77, 78, 98, 120, 120, 99, 80, 85, 108, 123, 117, 99, 86, 86, 98, 112, 121, 126, 132, 140, 140, 129, 116, 117, 128, 130, 111, 74, 37, 14, 12, 25, 42, 56, 70, 89, 109, 125, 141, 157, 167, 158, 136, 122, 131, 149, 155, 143, 122, 105, 95, 86, 74, 52, 31, 23, 35, 61, 92, 126, 162, 197, 222, 227, 202, 148, 82, 35, 20, 27, 43, 64, 90, 107, 109, 103, 106, 122, 152, 192, 232, 245, 219, 185, 187, 223, 254, 255, 247, 250, 252, 222, 164, 107, 77, 73, 84, 98, 111, 120, 128, 137, 139, 131, 121, 123, 136, 144, 137, 120, 103, 89, 86, 105, 146, 185, 197, 177, 146, 123, 107, 86, 64, 57, 71, 97, 121, 140, 157, 167, 164, 155, 153, 159, 160, 148, 135, 128, 120, 98, 71, 59, 70, 89, 102, 108, 108, 98, 75, 59, 73, 124, 188, 233, 248, 246, 245, 241, 215, 160, 100, 68, 71, 85, 87, 78, 71, 70, 73, 85, 118, 167, 214, 242, 249, 241, 218, 180, 137, 106, 96, 102, 110, 111, 107, 111, 137, 179, 213, 220, 209, 204, 218, 241, 262, 276, 280, 267, 235, 199, 177, 169, 159, 140, 118, 109, 116, 125, 116, 81, 35, 8, 18, 50, 79, 96, 117, 152, 190, 207, 195, 160, 121, 95, 93, 110, 128, 135, 126, 105, 83, 72, 79, 97, 108, 102, 86, 75, 73, 79, 95, 116, 132, 131, 119]
12123A19j2qj3k5l2k8j4NK5L5L4K8K3J1pj3MK0J1j6l3k4popJK0K8K1J7K8M3L9J5j2j5kKj6
12106B39l6l6j7OK2L1L3K3QKMjj8l8m4m2l9l9m0l1j5J2L0K6%k0j5J4L5L5K1J3J6J8Qj6l5m0
12089G4k9j4jJ3K9M5M9L1ol6l9j1K2L1J4oj4j5k2l4l9l7k7j5NK3K4J3NQJ7J5Kj1j8j7j7j3
12073aoJLlpkRJ5J7J7J5PlqlOJ1J1Kj4k8k7pJ8K9K3J0kjJ3K9L0Qj7k5j2QK1K6K2Pj1j7j5j4
12053A35j9k0oJ4K6K7K4K3K9L3K6Nk2l9l7k1mQJ3J5J7J8J2Mmj0j2j6k5l6m3l6qL2N2L8Prl
12037A88Nkj5j4kPRPNONLmj1rKJ4J2kj0mN%j2j8pJ0J3jj6j7o%nj2j1j0j2rPK7L0J7Kl%LNL
12015A73qk3l2k0PK6K5Nj6j5J1L9M7K8Jk0k7k3nK1L8L6K1QKmrmKql0m6l8j4J3L7M8L3%k9k8
11998B22j1lj4k1j7j4k2k8j5J1K4J6NJ1K8L5J9lj0jPNJJJrk3l4l8m1l8k3JJ9J8J0OMKkKRQ
$$ y = [119, 107, 99, 86, 61, 29, 1, -13, -8, 17, 52, 86, 114, 137, 148, 141, 128, 132, 152, 163, 147, 114, 90, 83, 77, 70, 71, 91, 119, 140, 157, 185, 228, 267, 282, 270, 255, 253, 255, 239, 203, 167, 150, 156, 178, 209, 242, 265, 273, 275, 279, 278, 260, 222, 178, 136, 97, 58, 18, -13, -28, -16, 14, 40, 40, 20, 5, 19, 54, 89, 110, 123, 139, 157, 165, 149, 114, 74, 45, 31, 30, 43, 72, 117, 166, 197, 191, 155, 116, 105, 127, 158, 172, 166, 152, 137, 115, 81, 42, 5, -22, -37, -32, -9, 15, 28, 33, 41, 58, 73, 75, 64, 46, 29, 12, -1, -7, -6, -3, -6, -13, -15, -6, 9, 26, 43, 58, 65, 62, 54, 51, 57, 68, 79, 81, 67, 39, 12, 5, 23, 52, 75, 85, 83, 82, 95, 124, 154, 162, 145, 120, 108, 116, 137, 163, 185, 192, 181, 164, 149, 135, 116, 96, 90, 104, 130, 157, 181, 204, 233, 266, 292, 297, 275, 236, 199, 178, 174, 182, 195, 210, 227, 245, 257, 261, 257, 247, 235, 219, 194, 158, 115, 79, 71, 103, 155, 193, 200, 191, 188, 193, 191, 176, 162, 160, 167, 176, 183, 188, 194, 199, 202, 198, 187, 178, 180, 194, 206, 204, 194, 190, 195, 195, 183, 165, 158, 168, 181, 180, 164, 147, 141, 141, 136, 124, 113, 103, 91, 82, 89, 116, 146, 163, 165, 162, 162, 165, 170, 173, 165, 142, 110, 90, 97, 123, 148, 153, 137, 122, 133, 172, 219, 247, 248, 228, 201, 178, 173, 194, 232, 268, 289, 297, 299, 295, 286, 282, 284, 276, 246, 200, 162, 148, 161, 198, 246, 279, 279, 250, 222, 211, 208, 194, 173, 156, 142, 120, 92, 77, 88, 112, 128, 133, 144, 172, 207, 226, 223, 213, 212, 219, 224, 225, 226, 227, 218, 195, 161, 123, 82, 44, 21, 22, 41, 59, 69, 75, 79, 81, 79, 81, 90, 98]
11979I8nj4pQJ4RNRJ1Lj3k0j2JQJ2K0L0L0J7Jqj0jJ5K3J4kj1nrl3n2l8pJ1NJOPkqMJ4J0nj2
11959A12qMJ9L4L9K6J3J2J1ql7m9l3qJ0J8K3K4J8J2J0QLjjlj0j1nrk8m6l8oK6L6L3K9L3L2
11941B84J6j1l4l9k8j8j5j1jQOjmJKKNOmk0k3mK1L5L2K5K1J7J4J0pl3n5n9m7l4k0LK7L8L2
11923A37J9J3J6K0K1J8Lj9l5l4j9jJ2J6Rnj4j2mljPK6L5K5Kj8k9l2l1j8kPok8l8l1k0j8j4
11906d6RM1N4M4L2L5M0K6nk7k8j6olkqj5j8j3qnKJ3K2K3J9J6J1J1J6K1J3mqLJ4Rkpqj9l2k9
11887A65j7nLK0L8M0K1jj1j6k4l6l8l2j6jKrj9rJ5L2L3K8K7K2J2RK7M6L9Ll2m2l2j9j4j2q
11871A89KJ5J7Qln%K%jLJ0J0ml0m6l0J0L9L2%k3k7k8l9m4l3j0Jnj5j6mPLnNL8P5Q1N4J5j1
11852B37j8j2mnj2j4rqj6k3j3RJ7J3PJ0J0Mlj2k5l8l2j3nj8k9j3K2M3L6K2K3L4L8K5Lj1qO
$$ y = [98, 93, 79, 72, 80, 94, 103, 108, 117, 128, 131, 118, 98, 86, 87, 95, 107, 127, 157, 187, 204, 205, 197, 187, 186, 201, 224, 238, 236, 225, 220, 211, 178, 126, 88, 81, 92, 97, 98, 104, 111, 109, 101, 105, 119, 129, 124, 112, 104, 108, 127, 161, 200, 226, 239, 251, 262, 254, 217, 168, 135, 127, 137, 155, 178, 202, 220, 232, 242, 250, 253, 252, 251, 248, 238, 227, 222, 213, 185, 139, 101, 95, 121, 157, 190, 219, 252, 284, 300, 289, 255, 216, 188, 170, 155, 144, 143, 151, 157, 156, 152, 153, 155, 157, 162, 168, 164, 144, 121, 117, 138, 173, 205, 230, 251, 268, 282, 292, 285, 252, 197, 138, 91, 57, 37, 40, 67, 105, 137, 156, 169, 185, 205, 226, 244, 247, 228, 193, 159, 140, 139, 151, 167, 176, 171, 157, 145, 141, 138, 137, 144, 170, 205, 230, 232, 214, 185, 153, 122, 104, 102, 109, 103, 75, 37, 6, -14, -32, -46, -37, 4, 58, 102, 134, 169, 209, 235, 230, 203, 175, 159, 153, 150, 148, 140, 125, 107, 94, 86, 81, 83, 96, 118, 141, 160, 176, 187, 198, 214, 235, 248, 244, 236, 239, 253, 262, 260, 253, 245, 226, 194, 165, 148, 143, 146, 166, 204, 244, 265, 264, 253, 237, 213, 177, 139, 107, 91, 90, 92, 83, 64, 55, 70, 102, 135, 163, 190, 212, 224, 233, 260, 306, 345, 348, 316, 274, 242, 223, 209, 197, 189, 191, 206, 223, 231, 228, 223, 223, 225, 225, 224, 227, 237, 247, 243, 213, 167, 137, 147, 186, 218, 218, 195, 168, 140, 101, 57, 24, 14, 15, 10, -5, -21, -25, -18, -15, -20, -15, 23, 98, 179, 233, 248, 237, 219, 207, 203, 198, 186, 172, 163, 155, 139, 116, 103, 112, 129, 142, 149, 159, 169, 173, 170, 158, 133, 95, 63, 50, 45, 27, -2, -15, 7, 50, 86, 108, 131, 165, 203, 228, 231, 220, 212, 218]
11835B18J2QNOMoqNJ6Lk0k3nNmj3lJ0Lj5j8lQJrnJ0K3K2Qj2k2j7kN%rj0mjl%MLj0k5k9j4P
11813I6J8J3MLJ1K1J8lk5l6k8qJ1K6L4L3K3Qj0k3k5j5lMjon%QK3L8M6L1Kk1k7k0j0jQJ2Pm
11795B27j2j2o%%%LQOkrj4k0k8k9j2J1K5K7K8L2L1K8K3J8QmlNNj1k3j7qqj8k1j6j2j1mRJ3
11776B07Lo%J8K9J9kk0k6k1j7k1k8k2lJ6J0j7l7k7J1M5M9K9Qlm%%oj8k5j7PK1J1j4l2l3k5
11759E9j0J0L4M6L5J1pj5j3j1oLJ0J5J0kj6j8lJ3J0j7l9l7j5KJ0J9L1K9J1%MRkj9k0rrk7m0
11741C6l0pPJ6K2K2J7J4K2L6L7K3%j5j4LK4L2K2R%j1k8m4m6k7nNPQJ1J0nj9k1mJ5J5%nPK3
11723A62K6J8Qkj1j6j2kOJ5K4K5J2lnoj4k4k1j0mpmKjj2j2OK6L2K5J6Kj9l4k7qJJlrk0k7j7
11704G7KJ2Oj%jj4k7l2k2rLJ5K4K4J5RJ1J9K3K1J4J2J4J6J7J8K0J6Kj2k1k1j4oKQQ%j0j4j0
$$ y = [218, 230, 238, 243, 249, 253, 247, 239, 244, 260, 263, 243, 220, 215, 220, 216, 203, 200, 210, 213, 198, 180, 177, 185, 186, 177, 172, 182, 205, 227, 235, 223, 201, 184, 182, 187, 187, 178, 168, 164, 163, 160, 160, 164, 167, 157, 132, 103, 89, 96, 114, 127, 131, 134, 145, 166, 184, 181, 156, 120, 92, 84, 95, 121, 155, 188, 211, 219, 209, 186, 161, 146, 143, 147, 146, 140, 135, 135, 143, 166, 204, 250, 281, 283, 262, 235, 215, 205, 204, 212, 224, 231, 227, 215, 203, 197, 197, 197, 197, 200, 208, 214, 212, 203, 189, 169, 141, 112, 100, 111, 136, 163, 191, 223, 254, 282, 305, 323, 331, 327, 324, 329, 334, 323, 300, 283, 275, 267, 249, 228, 212, 200, 189, 185, 194, 207, 210, 204, 204, 222, 251, 270, 268, 248, 222, 201, 184, 163, 135, 113, 110, 126, 136, 119, 82, 55, 66, 111, 160, 189, 197, 194, 190, 190, 190, 184, 166, 141, 124, 131, 152, 163, 149, 117, 84, 59, 49, 59, 93, 139, 174, 185, 178, 163, 150, 139, 133, 136, 146, 161, 171, 169, 153, 135, 132, 145, 155, 138, 99, 62, 47, 49, 59, 78, 109, 138, 149, 149, 153, 162, 160, 141, 121, 112, 103, 76, 36, 6, -1, 6, 22, 44, 66, 83, 97, 119, 155, 192, 215, 215, 200, 186, 189, 213, 245, 267, 276, 276, 265, 237, 193, 147, 120, 115, 120, 127, 135, 146, 156, 151, 132, 111, 107, 122, 137, 137, 132, 139, 162, 188, 206, 214, 212, 201, 185, 173, 171, 177, 192, 216, 241, 253, 250, 245, 239, 225, 201, 180, 170, 166, 159, 155, 157, 156, 144, 132, 138, 164, 196, 221, 237, 239, 220, 186, 159, 151, 152, 153, 150, 141, 121, 94, 77, 79, 91, 97, 96, 96, 95, 81, 54, 22, 0, -9, -6, 9, 33, 57, 72, 81, 92, 111, 134, 155, 169, 181, 195, 211, 228, 246, 266, 282, 284, 272, 251, 230, 216, 210, 212, 220, 228, 228, 218, 204, 194]
11685A94LJ3J5Nrk1k7k0oLlj7k2j4%J2K1K6K1J1QJ8K5J3pj5roqql%oj6k5k9k3oJ9L5K5%k3
11667A44k7j7oJJ2K7L1J1j9l3j5QJ5Lrj3j0JJ6J9Nj5k4k4k5k1lJ6J3jLK5L8L0J7J6J2pk5k7
11649A42k4l1l9k1K0M6L3kk7l1k4k3k2j1J6M5M0lm8m7rL1M8L6J3j0k6k3kK2L0J8lj9k3j1P
11633F8J4Lj2j9j6q%J1J8K0J3NQJ8K1QqnJ4K3J3JOJ5jl0l6j0J1Mj3rRJ3ok3k1qjnrj2pQK5
11614I0L2K1jj5j7j3oKJ4K2J9Qlj7l5m7l9rK2L7L5K6J6Nmqqq%J5K0Oj2j4lMLQJ6J3lj0%Kk0
11594A44m4l7oJ9K5K2J6Jj8j9nkj4k1j5qj6j5J4M6M3Nk9l0j1MJ1J1lk4k7jL1L3J3KJ6K8K2
11578A61PJ0K8L8L1J6Kj3l4m9m4k4kJ0Rmk0k5j4PK0J1orJ1L7N2M5K0j0k9l0j7rj3k0j2LRp
11560A36k5k9j7kOJ1J3J6J9K4K5K3J8Pj1l3m5l9j9jJ4K5L2L2K7K2K1K2J5jk1l1k4qnj9l7k9
$$ y = [194, 197, 210, 225, 230, 221, 200, 173, 153, 147, 150, 147, 130, 108, 94, 94, 106, 127, 153, 174, 185, 193, 211, 236, 249, 242, 227, 218, 212, 204, 196, 193, 193, 187, 171, 146, 117, 94, 88, 107, 142, 167, 167, 144, 117, 100, 94, 95, 107, 134, 165, 176, 157, 124, 109, 117, 132, 135, 126, 113, 103, 104, 120, 139, 144, 129, 105, 81, 56, 35, 32, 48, 61, 60, 63, 88, 126, 156, 173, 189, 201, 194, 169, 142, 118, 87, 48, 27, 47, 93, 126, 124, 97, 66, 42, 19, -3, -14, 2, 47, 87, 84, 36, -11, -20, 11, 59, 95, 108, 98, 72, 49, 47, 69, 99, 117, 114, 95, 72, 61, 68, 82, 85, 73, 54, 38, 30, 30, 41, 59, 79, 92, 97, 105, 123, 144, 152, 144, 139, 153, 176, 189, 190, 196, 211, 210, 180, 144, 134, 145, 149, 136, 127, 136, 149, 143, 120, 99, 91, 90, 85, 76, 64, 57, 65, 90, 122, 143, 142, 127, 110, 97, 91, 93, 107, 129, 148, 156, 153, 136, 101, 54, 15, 6, 28, 65, 100, 126, 142, 147, 143, 135, 127, 119, 119, 134, 154, 160, 148, 134, 131, 135, 138, 146, 162, 175, 172, 162, 162, 164, 144, 100, 63, 57, 76, 101, 123, 139, 140, 122, 103, 98, 96, 82, 61, 46, 38, 22, 7, 21, 67, 110, 115, 86, 56, 45, 49, 60, 71, 68, 44, 17, 16, 47, 80, 93, 95, 111, 139, 161, 168, 178, 206, 244, 275, 291, 293, 280, 246, 197, 153, 129, 127, 137, 146, 142, 122, 97, 83, 90, 110, 121, 115, 106, 117, 154, 206, 251, 271, 261, 232, 202, 185, 176, 163, 143, 131, 134, 143, 136, 111, 82, 65, 63, 69, 80, 93, 109, 128, 152, 177, 200, 218, 225, 214, 181, 136, 97, 78, 77, 91, 116, 148, 180, 207, 229, 250, 272, 287, 286, 265, 234, 210, 202, 197, 178, 141, 112]
11544A12kJ5J0KJ2L2L9K2kj6k0j4oKORJ3K0K4K1Qj2k7k7oJ6K2J0kjNJj0j6rkmj1j1oKOJ3K5
11525B43L0K0ml3n4n4l1jJ8J5NNJ3J6Qmj3j8j9j2j%pj1%J6K5J5nk0j7PL0L1J0j6k8k6j5JJ6
11507A35K2K1K2K9K7Rj0j4onj5k6k8k0oLRJ3K0K7K8J6mk2k9j5J4L8K7j5n2n5l1kJ2Pnj1JJ9
11490A28J6j2l3k5jJ0J4K8M3L3Mj2jJ5J6Ll%J0J3Qlropj2j2QK3J5pj3ljrkK5M5M3K3ll0n0
11471B69m4k5j6j5ML8M7K2jNJ9J9J6K6L4L2L1M0N2N3N5O0N0M3Q2J61K22K65L75N44N75K83
11457C321k29o17o73m95l10k11j57j08p6n8l6j3j0j7j4lrk2k1pnj0qKOkj0j5k2k1pN%qjJ6
11441A55J5oj8nRQnj1kJ4J9J4KlLQMrk4l2l0j7lKjJ0L4N2L9Qj3j5j1pJJ0Rkj7l0l6l2j1J3
11422H9J5KnMJ3Opj5j4nJ1K3K0NqpKRROLPJ9K7J9Jj4j8k1l3m2m0k8j8j0jJ3K0J8J0NRJ2Op
$$ y = [112, 110, 125, 135, 137, 149, 181, 220, 242, 240, 224, 204, 190, 184, 186, 192, 201, 214, 234, 258, 279, 287, 275, 248, 221, 215, 231, 253, 263, 261, 260, 265, 266, 256, 240, 231, 229, 225, 214, 203, 197, 199, 205, 218, 243, 273, 293, 289, 256, 202, 148, 117, 116, 134, 149, 154, 159, 172, 188, 196, 192, 179, 161, 142, 130, 129, 129, 122, 111, 111, 127, 152, 167, 162, 142, 125, 132, 162, 193, 203, 187, 159, 133, 118, 119, 135, 157, 178, 200, 229, 256, 265, 255, 241, 235, 230, 215, 189, 161, 141, 135, 138, 147, 160, 180, 207, 235, 251, 247, 225, 196, 181, 195, 233, 260, 245, 193, 138, 107, 105, 117, 124, 119, 108, 109, 128, 144, 132, 99, 74, 73, 83, 97, 125, 168, 201, 205, 193, 192, 207, 223, 226, 223, 223, 233, 246, 254, 251, 242, 236, 229, 217, 205, 213, 236, 251, 244, 231, 228, 227, 218, 216, 241, 286, 329, 352, 349, 319, 269, 225, 200, 184, 169, 173, 211, 258, 280, 279, 284, 303, 322, 338, 364, 398, 430, 461, 501, 553, 606, 661, 721, 771, 814, 896, 1057, 1279, 1544, 1919, 2463, 3038, 3321, 3092, 2475, 1802, 1307, 997, 786, 629, 521, 445, 387, 351, 338, 328, 311, 297, 294, 285, 263, 242, 235, 230, 220, 212, 214, 220, 218, 208, 193, 171, 150, 143, 148, 148, 140, 139, 155, 170, 164, 146, 141, 150, 158, 153, 142, 140, 154, 173, 187, 189, 186, 189, 197, 201, 192, 168, 136, 106, 89, 86, 88, 87, 97, 131, 183, 222, 230, 217, 202, 191, 184, 185, 195, 204, 202, 185, 155, 119, 87, 76, 89, 104, 106, 101, 105, 118, 124, 117, 102, 88, 83, 94, 117, 137, 142, 134, 127, 129, 138, 147, 153, 156, 163, 182, 209, 228, 229, 215, 197, 176, 143, 101, 61, 33, 15, 5, 4, 17, 37, 55, 65, 70, 79, 91, 97, 90]
11403I0j5j0NJ6K4K8K2Orj2oj4k9l0qJ2J4M%komQJ9K1K1K1J2j7m0k7J3L2Qk7l1mK0J7lk1k3
11385G5j4kQJ6K2K2J7RLjknnpj0j2j3pMJ5K0J6P%nppjQJ9K5K6J7jj7k1j3pj3j8j3kjj1k2j8
11365G4kJ8L1K6J0lppj1j7j1JPPJ3K4K8J9NKMQPJrk6l8l1qJ3J7Lj7l1l0j5PJ9Qj2j7%K3L3
11346A16K6J6Nrk1j8pmk0l3k5jJ8K3K5L6M8M2J3k0l0j2J2J0pj4lKj3k6j4J4K0%j8j8oMRJ0
11328A30jk1l7l7l1k7k1jK6L9L8L4L7M1L0J0mkKkrqooj1j5j4j1njJpj5j2jjrqJ0K5J9L%J1
11309A33K0J8J3J0nk3l2k4j5j1rLJ6J8J2%rj3rkmj5j8qNJ1J5K2K3Rj0j6j0pj7k6k1nQJ1J2
11291E0J4K0K4K0J6J4J5J6Pj2k7k5lJ6J5oj8kK3L0J3oj1j3k2l3l0j4PK8M1L9J9j3l8m6l8k2
11275D8pk%PJ7J7Pkpj1k0k7j8lQJ8K6K4Pj3k0rMJ0NmpJJ4K5K4J9J3%j8k5j7j3k1k4kK4K5K
$$ y = [90, 75, 65, 70, 86, 110, 138, 160, 166, 157, 145, 139, 125, 96, 66, 58, 70, 84, 88, 88, 86, 80, 76, 84, 103, 124, 145, 166, 178, 161, 121, 94, 107, 139, 147, 120, 89, 85, 105, 122, 119, 98, 75, 61, 59, 67, 83, 105, 127, 144, 153, 156, 155, 153, 148, 143, 136, 126, 114, 101, 94, 98, 113, 133, 149, 156, 156, 151, 144, 137, 136, 144, 163, 188, 214, 231, 230, 213, 192, 179, 172, 159, 141, 128, 126, 125, 114, 92, 74, 72, 90, 121, 147, 157, 154, 147, 140, 129, 112, 101, 102, 109, 116, 129, 153, 181, 200, 205, 207, 211, 219, 226, 227, 218, 192, 154, 123, 115, 128, 145, 148, 131, 100, 70, 55, 62, 81, 89, 77, 60, 60, 83, 116, 142, 158, 163, 154, 133, 115, 108, 104, 84, 51, 26, 25, 43, 66, 91, 127, 175, 217, 230, 210, 180, 168, 180, 190, 183, 169, 166, 168, 155, 129, 115, 129, 149, 149, 131, 113, 107, 111, 120, 130, 129, 108, 71, 34, 3, -24, -45, -46, -20, 19, 57, 91, 128, 169, 199, 209, 205, 203, 205, 203, 194, 186, 180, 174, 163, 148, 134, 123, 118, 117, 118, 111, 96, 84, 83, 82, 73, 65, 75, 100, 119, 122, 122, 133, 153, 171, 184, 194, 189, 166, 134, 110, 95, 84, 75, 78, 94, 112, 124, 124, 115, 102, 93, 91, 87, 72, 54, 46, 51, 62, 77, 99, 122, 131, 121, 105, 95, 88, 71, 45, 24, 19, 27, 38, 50, 64, 84, 108, 128, 144, 158, 173, 189, 196, 184, 157, 132, 129, 145, 160, 154, 136, 134, 157, 187, 200, 194, 183, 170, 148, 115, 85, 71, 78, 106, 147, 186, 205, 192, 154, 108, 70, 48, 41, 39, 39, 46, 63, 80, 87, 85, 78, 67, 47, 20, 2, -1, 7, 25, 51, 75, 82, 69, 49, 40, 44, 54, 59, 55, 48, 49, 63, 88, 112, 131, 144, 144, 126, 101, 84, 71, 50, 26, 24, 48, 73, 75]
11256G5j1nL%%J4K6J6koOJ6J5PjljMNPPJj8l1k4%J1Jj0jK2L4K4Kk2l9m3l3k0pLJ4J6J1J0K5
11236I8M5M8K9ll0l8k6j0nqlJ3K2Pk0l1k6j8oJ7M5N4L2Nqj0j3j2KK2L2K3J0POJj0j3rnmln
11217B02j4l2m2l9k9k6j6J3M8N6L5QLJ0J6K0K5K0lk6k6rnk4m1l9k1%J9K3Rj5k6j5jNJ1J9J8
11200A11Lj2j1ml%J6L5L8K0MLJ1J2Npj8k4j8j0qrqKJ1R%nqj3j5qKJ4K2K5J6pl1m0l2j4mLP
11181F0QKk%MLlomKQJ9K3J4pj8j4nkKJ6L2L3K4K2K9K8J1j1k0j6j5k1l1l5k5j2oppNJ6J0j0
11162I4k1j1%KjMJ2J5J3Oj1l5n0l6lK2L0K9L2L4K7J2LNJ5K1Rj4k3rJ4J8lk5l2j9mRJ7J8J3
11144A77Jj1k1k2qJ1K1J2kKJ8L1K0nk9l7l1k4k0j7mJ6L5M1L5K6J5kk4m2l7j0J8L0K8K8L3K9
11128B81Nk6l7l1j9j0LJ9K1Mj5j6kPjj5j4JJ8K4Pk2m4m1k0JPPJ0J3J0OQKj6l9m3k1QK7L5M4
$$ y = [75, 64, 59, 62, 62, 62, 76, 102, 118, 116, 110, 116, 132, 147, 154, 153, 150, 149, 153, 158, 165, 172, 173, 155, 124, 100, 100, 111, 112, 102, 101, 123, 157, 181, 183, 161, 122, 79, 46, 26, 19, 22, 36, 52, 63, 73, 98, 143, 191, 220, 217, 187, 149, 123, 113, 108, 100, 97, 110, 132, 139, 119, 88, 62, 44, 38, 55, 100, 154, 186, 191, 183, 173, 160, 148, 150, 172, 204, 227, 237, 244, 250, 251, 241, 228, 219, 214, 210, 207, 202, 188, 156, 114, 75, 46, 20, 4, 17, 65, 121, 156, 164, 167, 177, 193, 213, 238, 258, 255, 229, 203, 194, 189, 165, 124, 85, 64, 64, 83, 106, 115, 100, 74, 59, 58, 63, 74, 93, 111, 114, 102, 91, 87, 84, 84, 100, 135, 173, 193, 197, 200, 211, 223, 228, 221, 203, 179, 161, 151, 143, 134, 126, 128, 139, 148, 148, 143, 135, 122, 107, 99, 101, 115, 137, 162, 178, 171, 140, 100, 68, 54, 50, 53, 60, 68, 70, 68, 68, 72, 75, 72, 66, 62, 64, 72, 91, 114, 128, 121, 103, 89, 84, 82, 84, 100, 132, 165, 189, 211, 240, 268, 279, 268, 248, 232, 217, 196, 165, 130, 105, 93, 87, 80, 73, 78, 94, 104, 94, 73, 62, 62, 64, 63, 67, 79, 94, 107, 113, 102, 67, 17, -19, -22, 0, 30, 59, 91, 125, 152, 164, 167, 172, 187, 208, 217, 203, 180, 171, 185, 203, 200, 175, 143, 124, 120, 129, 146, 164, 177, 178, 167, 146, 124, 116, 127, 148, 160, 158, 160, 178, 209, 229, 224, 195, 158, 127, 103, 83, 66, 62, 78, 113, 154, 189, 215, 230, 228, 204, 162, 125, 115, 133, 163, 191, 219, 252, 281, 286, 260, 223, 192, 173, 163, 166, 185, 206, 210, 195, 179, 177, 184, 183, 168, 154, 155, 173, 197, 204, 182, 138, 97, 77, 78, 85, 92, 102, 115, 125, 131, 139, 141, 125, 86, 43, 22, 30, 57, 92, 136]
11109A36N0M0K0nk2k4qK1M0L4J3NJ5J9kl5o0o6n5l0LK8K7RkLJ0J5J8K5K6J8RKlkKOJj1j3j
11091B56Jj7m1m1j5RJ0J%QJ4Pnj4j8j6qMJ4J6R%LJ7K7K0kk6l4k6j8j4qNJ9K4J2mj0mJ0K1J7
11072B03mk5k3JK2J4oj0MPj0k4j7kmj6j5MK3K9K0Mj3j7qLmk1k0LL2M0L0J5Lqj3qmpj3j1MK0
11053A78K4J6kj7k0rMPlj6j8j2prj8k3j8%J9K9K0Kj1j4qj0j6j6mJ3K0K0K0K1J4MjPJ1J1RJ3
11035B10J5Rnj3j4j2j0j1j9k9l3j6J2K3Rj8k6oK2L3J7pk0j3JJ5K0J6Mk%Kpj2LK4K2pk8j9J
11017A31kk2l2k2qLJ0J2%j2qJ1K2J4jj4j8j2J1L4K6ok7rK3L6K1%j8l1l4k1oorjJ7K0Lj3nJ8
10999G5L6L3J7pk6l3l0k1JK9M8M6K7J0MKmj0oMQQMJjkmj3j8j5nkoj0pnqj3j4rmKRJ3J1J0J5
10979A40K7M1M5L4J2pj3j1j2j9j8kJ2Prj7nJ5K1J1oj5j3opj1j2j3k6m5m6j5K5M5L2Lk3k8j2
$$ y = [136, 186, 226, 246, 241, 219, 195, 187, 208, 248, 282, 295, 300, 315, 334, 332, 297, 237, 171, 116, 86, 89, 117, 144, 153, 151, 154, 164, 179, 197, 222, 248, 266, 275, 277, 274, 272, 274, 280, 281, 270, 257, 256, 257, 240, 199, 158, 143, 152, 162, 163, 163, 171, 185, 192, 187, 173, 155, 139, 131, 135, 149, 165, 174, 174, 177, 194, 221, 241, 239, 213, 179, 153, 135, 121, 113, 118, 137, 161, 173, 169, 159, 155, 165, 186, 203, 199, 174, 151, 152, 174, 188, 182, 172, 176, 183, 173, 149, 132, 130, 126, 110, 95, 99, 122, 151, 171, 175, 162, 145, 137, 140, 136, 115, 95, 98, 130, 170, 200, 215, 218, 210, 197, 189, 185, 178, 165, 154, 158, 178, 202, 218, 216, 199, 179, 170, 174, 181, 178, 162, 144, 132, 125, 116, 98, 75, 57, 57, 76, 105, 125, 127, 116, 102, 94, 84, 68, 52, 48, 61, 81, 101, 121, 142, 156, 160, 159, 166, 177, 188, 197, 210, 225, 234, 229, 216, 202, 190, 180, 169, 150, 121, 88, 72, 84, 107, 116, 98, 72, 66, 88, 121, 138, 131, 111, 98, 99, 114, 134, 150, 154, 152, 152, 154, 147, 135, 138, 162, 184, 177, 149, 130, 131, 129, 107, 75, 53, 45, 48, 58, 70, 70, 58, 50, 61, 83, 97, 96, 82, 64, 52, 63, 97, 123, 117, 90, 81, 104, 140, 161, 161, 143, 112, 78, 57, 51, 45, 36, 35, 52, 72, 75, 62, 57, 75, 111, 144, 161, 154, 128, 95, 65, 44, 45, 74, 122, 168, 195, 205, 209, 211, 207, 197, 191, 195, 203, 211, 215, 216, 215, 213, 209, 196, 178, 163, 158, 156, 150, 140, 133, 128, 120, 107, 93, 84, 80, 82, 91, 104, 115, 125, 140, 167, 208, 253, 287, 299, 292, 279, 268, 256, 237, 219, 217, 229, 236, 227, 210, 205, 220, 241, 252, 246, 231, 218, 212, 205, 194, 182, 169, 143, 98, 52, 37, 62, 107, 139, 142, 119, 91, 79]
10962G9J3K2J3KORrm1n4l7qJ0K5L2K6Kj3mK5M8N7N6M8L3J2ok3l3l4k3rjlj0j8k6l1k3nJ6K4
10944A47J6JqlMMpj4pPJ4PkoJJ6K5K2J0Mkj8m7n6k4L2O5N1J5rj2j4j5lJ8L3K4%k2l1k9k2j7
10926A48j6j4qLRLopKQOOJ1J3RLNQlk3l9l9k4mJ9K7J3rpK2M3L0mk2j4mmrj2k1l4l5j3J1J8
10906D6RKQJ6J8J2MmqojMNPQJ0Plk1l0k1JJ7J9J7J8J4mk1j6LJ3J0J0J7K0Jk2k9j3RJ7J1%p
10887A47o%MNNMPJ2J7K0J8J2Kqk1k7k3j5j4j9k3k2k1k1rK1M8L9kl7l4jK9L7L5L6L5K7J0nj0
10869B52j0j2j5j7rJRJ1J0J1Qjj2j5mRJ4J2NLORNpk3l0k0lM%j0j2lOJ0OLK%jllonMJ9K9K7
10848B54J9J3Lj2k5j8kJk0m1l7j1J1J4PMMRJ1RKjNJ3J0nk3k8k5k0j7j1LK2L0K1lk2k4rNNo
10829A15rMJ8J0j9m3m0j3QJ0OQK0K4K2J9K0J5Jj5k4k3k1j0RK8K6Mj7j5QK7K7Rj3k9l0j2QJ6
$$ y = [79, 92, 114, 127, 129, 135, 144, 135, 94, 40, 3, -5, 5, 30, 62, 88, 90, 77, 73, 98, 146, 203, 259, 307, 340, 352, 346, 323, 290, 256, 233, 224, 223, 220, 210, 192, 166, 135, 112, 107, 123, 147, 163, 164, 156, 153, 157, 161, 154, 140, 133, 140, 154, 161, 159, 153, 154, 170, 195, 217, 227, 231, 229, 211, 164, 108, 84, 116, 181, 232, 247, 238, 226, 212, 197, 194, 212, 245, 269, 269, 247, 216, 187, 165, 148, 132, 118, 110, 113, 122, 125, 119, 112, 114, 122, 128, 134, 145, 158, 167, 170, 175, 183, 180, 157, 118, 79, 55, 51, 70, 97, 110, 101, 94, 116, 159, 189, 185, 163, 149, 145, 141, 132, 120, 99, 65, 30, 17, 28, 46, 55, 57, 65, 81, 99, 111, 115, 111, 103, 97, 96, 100, 105, 112, 120, 130, 137, 134, 113, 83, 62, 63, 80, 99, 116, 134, 148, 144, 123, 107, 110, 123, 133, 143, 160, 180, 181, 159, 130, 117, 126, 143, 154, 154, 147, 141, 141, 145, 150, 155, 159, 166, 178, 195, 215, 233, 245, 247, 239, 218, 191, 168, 153, 139, 120, 97, 75, 54, 33, 24, 45, 93, 132, 130, 93, 59, 58, 87, 124, 159, 195, 230, 257, 267, 262, 252, 242, 230, 215, 198, 189, 190, 199, 210, 220, 231, 239, 238, 226, 211, 207, 216, 230, 242, 247, 250, 256, 265, 270, 263, 240, 210, 190, 187, 191, 191, 181, 169, 166, 172, 182, 188, 191, 193, 193, 192, 189, 186, 180, 175, 179, 198, 227, 254, 273, 286, 289, 277, 252, 234, 232, 233, 213, 172, 135, 124, 135, 149, 156, 160, 164, 173, 184, 193, 195, 194, 199, 212, 222, 217, 194, 166, 141, 121, 104, 93, 96, 118, 148, 169, 166, 144, 120, 111, 116, 121, 115, 106, 110, 128, 138, 119, 76, 36, 23, 31, 41, 47, 55, 75, 99, 121, 140, 160, 175, 176, 161, 137, 114, 93, 83, 92, 120, 146, 150, 133, 118, 126, 153, 180, 189, 176, 147, 117, 105, 113, 129]
10812A29Mo%J3J8J2PQPlj4j5mPJ1%j2j6kJ1J1jlQJ6QPK2L7K6%j0MK0K4K2J7%k7l5j1J7J9K
10793C28rrk0m3m9k2J0J8LjJ4K7J8jqlok2l1j8kok8l5j2K1L6L1J1j3l1l2j9prpJ6M2M2J1j9
10775A66j8KJ7J3kj3j3rrj1pLJ1R%NJ8K7K4J3J2K0K9L2K5Pj0k0j7r%QJ6J5Nmpnk%NJ0Pnj8
10756C20k8k8k2j7j1j0j9l5m2k3J3L7L1Prj0okLMpj5qJ4L2L7M0M1L0J0LJ0J5KkK0O5J09J37
10739F86J37Q0k9j34j68j28q1o2n6l1ook6l8l0j9j0%QJ3J2J4K0K3J4JokRJ4MqmJ4K1Mj7j6
10722A97jLpoJ1J7nl3k4J1L2J9j2l2m2m4l1pJ6J9J3J0Rlj6pJ9M0M4M1L5J2k1l9k3KP%LJ6J2
10704B35j0k4j6npk1k4j2JJ3J7J8J6J4J1Lqj3j1j0j3j1nnj4k5k0j0k%J0J8J9J6K2K7J8j1l2
10688A49k6ML2L5J5j8m3n0m2k3lK0M3N9O2M9K1j6m2l8j0J6J7jj7k0k1k4j8LK5L0J3j2k6k3
$$ y = [129, 133, 127, 127, 140, 158, 170, 177, 185, 192, 189, 175, 160, 156, 163, 174, 174, 162, 146, 144, 155, 166, 165, 162, 170, 186, 194, 201, 223, 260, 286, 286, 276, 280, 300, 324, 346, 363, 363, 336, 301, 290, 307, 326, 328, 319, 310, 290, 247, 198, 176, 186, 204, 207, 206, 220, 247, 265, 264, 256, 253, 247, 225, 194, 176, 174, 168, 140, 105, 93, 114, 150, 181, 192, 179, 148, 116, 97, 90, 81, 74, 90, 132, 174, 185, 166, 148, 150, 167, 180, 178, 165, 152, 143, 134, 123, 116, 119, 130, 139, 139, 144, 162, 189, 213, 226, 238, 258, 287, 319, 344, 351, 341, 321, 304, 295, 295, 303, 319, 334, 339, 335, 328, 323, 321, 321, 326, 336, 343, 338, 320, 292, 264, 242, 225, 214, 204, 185, 150, 108, 85, 98, 135, 166, 173, 164, 154, 148, 146, 149, 153, 146, 131, 123, 137, 169, 206, 246, 287, 317, 327, 330, 340, 355, 357, 355, 375, 440, 549, 686, 823, 903, 874, 740, 572, 444, 363, 301, 245, 214, 208, 202, 176, 138, 108, 89, 79, 79, 87, 100, 112, 126, 146, 169, 183, 184, 178, 176, 185, 199, 203, 195, 191, 205, 226, 230, 213, 197, 196, 199, 192, 186, 197, 214, 209, 176, 152, 163, 195, 214, 202, 170, 128, 84, 53, 46, 62, 81, 94, 104, 113, 110, 94, 87, 106, 146, 190, 231, 266, 278, 257, 218, 195, 197, 204, 204, 207, 223, 235, 225, 201, 185, 180, 173, 152, 128, 116, 117, 130, 147, 165, 181, 195, 206, 209, 201, 188, 177, 167, 154, 143, 138, 133, 119, 94, 74, 64, 62, 62, 72, 90, 109, 125, 147, 174, 192, 181, 149, 123, 127, 159, 194, 209, 191, 148, 98, 56, 33, 30, 50, 93, 152, 214, 263, 284, 268, 226, 188, 178, 194, 211, 210, 193, 173, 152, 128, 110, 113, 138, 168, 181, 169, 143, 120]
10672A20kK5L9K9NjJ8L6J9j3k9k0j3k0k3qLoj9qK2K9Lk5k7qLlj0pNJ5J6RJJJ4L4M7M2J5j3
10654B95k5j8j2k0l2l2k0j1j1j4rLK0L7M2L0Nj2rNJ1PMJ0J9K1Qj0k3k9l3l4k1PK7J8qj8kJ2
10636A78nl5m7l2rRK8M4M0J4j3j5MK2K6J6jk2l3k8j2jj0l0m1l6j1J2K1Oj2qJ4K7J5oj0Jjk2
10619C7l7k5%J2RJ1K5L2K6J5J6K1J8PlpqnLJ3K4K4J4qk8l3j6jKjQK8L3J1j5j7PL0L0J2jpk0
10600B36m6o4n5k5LJ0PNjj4j8kK5L7L4L0K9J3j6k9rK1L1K5K6M0M1J9oj3qj2k5l1j8MJ3Oj0
10584B53k1j9oJ2K5K3Jk3k9j1J2J8Pj%Kmj1pnj0k2k2lK1K9K0Lj2j5j2rj0j0kJ1K1J4mk0k5
10566A59k2j6j0lJ1K7M4N3N1L3Lk7l8l1j4kkooojOJ0mk8l7j9J5L4L6K4J2joNK0J3j0k3qQJ
10548B45j4nK7M6L2Qlnj6k9k8j6j0j7j0J4L5K7Kj0JJ3Nj3j9j1moj0j0j3j1%J7K1Ppqoj5k7
$$ y = [120, 118, 143, 182, 211, 216, 215, 233, 269, 288, 275, 246, 226, 213, 193, 170, 162, 165, 159, 140, 132, 154, 183, 186, 161, 134, 126, 129, 126, 116, 109, 114, 129, 145, 154, 155, 156, 170, 204, 251, 293, 308, 295, 270, 252, 240, 220, 188, 156, 136, 125, 114, 100, 91, 94, 114, 151, 193, 223, 228, 216, 207, 212, 223, 230, 234, 244, 263, 284, 292, 282, 259, 230, 197, 163, 142, 149, 176, 194, 186, 168, 166, 178, 173, 138, 91, 59, 50, 59, 87, 131, 171, 185, 172, 157, 161, 183, 209, 225, 224, 202, 169, 141, 129, 128, 118, 88, 47, 11, 0, 12, 33, 39, 27, 19, 33, 60, 75, 69, 59, 60, 59, 37, 0, -25, -25, -13, -4, 7, 32, 64, 90, 105, 121, 142, 160, 167, 164, 157, 149, 144, 147, 160, 184, 208, 222, 214, 186, 153, 137, 136, 138, 137, 145, 173, 206, 217, 202, 185, 192, 222, 252, 264, 263, 256, 236, 190, 126, 71, 46, 49, 59, 66, 71, 70, 56, 38, 36, 61, 98, 132, 162, 191, 204, 188, 159, 150, 171, 202, 227, 253, 293, 334, 353, 347, 334, 326, 314, 289, 258, 240, 244, 257, 263, 253, 232, 213, 207, 219, 244, 267, 268, 245, 216, 205, 217, 235, 242, 241, 241, 243, 239, 228, 221, 216, 206, 184, 162, 159, 180, 209, 229, 232, 220, 205, 193, 184, 174, 164, 162, 173, 194, 208, 204, 184, 159, 137, 121, 111, 108, 119, 146, 190, 243, 294, 327, 330, 303, 265, 234, 220, 218, 216, 210, 204, 198, 197, 203, 213, 209, 181, 144, 125, 140, 174, 210, 234, 246, 245, 239, 244, 264, 277, 267, 244, 236, 244, 245, 231, 226, 253, 299, 331, 339, 336, 331, 315, 286, 258, 242, 232, 215, 205, 219, 254, 281, 283, 273, 274, 287, 292, 279, 260, 249, 245, 239, 229, 219, 206, 195, 195, 212, 233, 240, 233, 225, 219, 204, 177]
10530A77k0PK6K2%k5l5k3NK4J8jrjjj4k1j1J%onmqj2nJ0J8J8K1J6Jj2%K5L8K6Pmj8l7m4k9
10511A15j2nkPJ6J3PJ2K4K2J5J6K8L4K0lk4l8l6j5J3K8J9mk4l7l6j9J2L0K7J2NQJ5J4Jk1l6
10494B01k4RL8M2L0J8Oj5l4l6k3j1m%LJ%J0J2j1m4m5nL2K4j5l6k6j1j0rLK4L4K5Lk4l8l0n
10477E9K1L7M4M5L2Ok0l0k0%K0K3J0nrj0k5m6m9l5k4k3pL2O8O0J3l3m8l5j0J0J8J4RJ3K3K2
10460A50J3PLmj4qJ8M6N4L9J2j8m0m6l3j1QK0J8Kj9k5j1PJ2MJNRMnj0r%J5K3J6jj9l5m3l9
10442I6j5J3K5J6PJ4K1J3nj2kJ0J3J1RMpk0k6k2j6j6k3l3l5k0KK2L2L5L4J7qk3j1J0J8OjO
10425A39J3%k9l9j7J3J9Jj4jK3L4K6J5J3Qj2m1n8n1k5JJ9L1L3L0K5J7RKmj2j9j9qJ0K3L2L5
10408B22K7jl2m9m2k5j1lLPJ0J6K5K2Qrj3j0lMJ4J9J4ONJ0Pnj9k8k7j4MJ6Prj5pLJ1K3L4K8
$$ y = [177, 157, 164, 190, 212, 212, 187, 152, 129, 134, 158, 176, 175, 166, 165, 164, 150, 129, 118, 119, 119, 113, 108, 104, 96, 84, 79, 89, 107, 125, 146, 162, 163, 151, 151, 176, 214, 240, 247, 243, 225, 188, 144, 115, 103, 98, 96, 103, 119, 132, 139, 151, 175, 197, 212, 228, 256, 290, 310, 307, 283, 245, 209, 194, 207, 235, 254, 250, 226, 189, 153, 134, 146, 176, 203, 215, 220, 228, 243, 257, 258, 237, 201, 177, 186, 224, 266, 296, 314, 320, 305, 271, 235, 212, 201, 197, 197, 200, 201, 201, 211, 223, 212, 168, 123, 118, 150, 174, 159, 123, 97, 86, 76, 67, 70, 94, 128, 153, 156, 132, 94, 64, 59, 80, 117, 161, 206, 238, 244, 224, 194, 174, 174, 194, 217, 227, 222, 213, 203, 178, 132, 83, 48, 24, 1, -6, 26, 94, 154, 167, 134, 86, 51, 41, 51, 69, 83, 92, 105, 128, 150, 163, 170, 173, 169, 155, 147, 165, 211, 265, 304, 316, 298, 258, 212, 179, 168, 176, 196, 214, 216, 197, 172, 161, 168, 180, 184, 185, 190, 199, 203, 198, 188, 179, 179, 194, 217, 233, 232, 213, 178, 135, 96, 81, 94, 119, 135, 142, 156, 177, 190, 185, 173, 171, 181, 194, 205, 214, 218, 211, 191, 165, 143, 127, 111, 88, 55, 20, 0, 2, 24, 56, 91, 125, 142, 134, 111, 100, 110, 128, 134, 133, 139, 152, 152, 123, 84, 67, 80, 99, 100, 86, 85, 108, 142, 168, 183, 196, 204, 192, 151, 93, 42, 17, 18, 37, 68, 101, 131, 156, 173, 182, 184, 180, 168, 149, 130, 122, 132, 155, 187, 222, 249, 248, 216, 167, 125, 100, 89, 86, 89, 96, 106, 122, 147, 169, 177, 168, 155, 145, 142, 146, 160, 179, 193, 199, 204, 214, 221, 216, 197, 169, 142, 128, 132, 148, 155, 146, 131, 124, 127, 138, 161, 195, 223]
10389B23Jk3k4qPJ6J8J1nk0k3j8j2qLJ4J6PLPJ3J2N%lkLQLj3k6k4qQOqj7j1%MKQK1L3L2K3
10369B54J8J9J3Jj4k3k1j1%NPLnk0k9k1%Qnk3k2p%npNJ8J9J1Jpj3qQK1K0Q%%JkpnKOlk4l7
10349A29k6JJ9J3mmJ5K8J3k2n4o0m3j6J1L2M2L1J0%Lkk3m5m0j3MKjOJ8J9J3J2Lk0l8k6kMj7
10331b8l4k2PL0L7K7Ok1k9j0K8N4N7M4K3Kj8k8k3j6j0%J0J3kk0j9LJ9J0j0j5LK0K0Mj2k1j9
10314F0j1k%kNL0N4N1K1rj9j0mnj0j2j0lRK6L1J9lj0JJ1%k1k5j2jj1k5k5j3prqkOJ3K2K7K0
10295A37Nmpqj1qmoj4j1OK5L4L6L9L2J0j6k1KK8L0Rj4j7kJ6J1j8m5m3j6J4K7K0Qnj0j0rj5
10277A75k8l5k9j4pqkJ2K3J5%lJ3K7K5Nk2m2m3j8J4L0K3RQJ3Pj0j3JJ8J8RJ0L1N0M6J9j4k9
10260B84k7j7j2j0lOOj0l0m3m1k5NL3M4L0Qrj7k1k0pQPqj5lJ8K0NqnJ0J7J7J6J9J2j1l0k9
$$ y = [223, 224, 201, 177, 169, 176, 192, 210, 221, 216, 196, 173, 155, 143, 135, 138, 152, 168, 175, 178, 185, 198, 210, 215, 215, 212, 210, 213, 221, 224, 211, 185, 161, 153, 161, 167, 159, 142, 131, 131, 135, 137, 145, 166, 199, 231, 254, 272, 291, 304, 305, 291, 268, 247, 236, 236, 241, 248, 251, 246, 226, 197, 176, 176, 184, 179, 156, 134, 127, 127, 122, 115, 120, 138, 157, 168, 169, 162, 149, 141, 149, 170, 190, 198, 198, 198, 199, 197, 190, 185, 187, 193, 190, 166, 129, 103, 104, 123, 136, 132, 128, 143, 171, 184, 162, 108, 48, 5, -11, 0, 32, 74, 105, 115, 115, 118, 116, 93, 48, 8, -5, -1, 1, 0, 6, 24, 43, 56, 68, 71, 51, 13, -13, -15, -11, -28, -62, -84, -77, -47, -10, 17, 23, 2, -27, -37, -9, 45, 102, 146, 169, 171, 153, 125, 102, 86, 76, 76, 86, 99, 97, 77, 58, 61, 80, 90, 80, 65, 68, 88, 108, 112, 100, 79, 60, 49, 47, 47, 45, 50, 80, 134, 185, 206, 197, 178, 168, 164, 159, 149, 137, 127, 124, 133, 159, 190, 209, 206, 196, 197, 208, 208, 187, 162, 150, 149, 138, 113, 88, 75, 68, 59, 51, 49, 55, 68, 90, 117, 137, 142, 138, 131, 123, 112, 104, 100, 94, 80, 69, 75, 100, 134, 170, 209, 241, 251, 235, 214, 216, 244, 274, 283, 269, 252, 250, 266, 277, 259, 214, 171, 155, 169, 196, 216, 224, 219, 209, 199, 190, 175, 147, 112, 83, 69, 62, 54, 52, 64, 87, 102, 102, 99, 112, 139, 164, 169, 147, 105, 62, 44, 58, 88, 111, 120, 128, 141, 148, 138, 125, 126, 144, 162, 171, 181, 212, 262, 308, 327, 313, 284, 257, 240, 228, 218, 215, 221, 227, 217, 187, 144, 103, 78, 83, 116, 160, 190, 198, 189, 172, 151, 131, 124, 132, 139, 131, 116, 113, 131, 151, 156, 148, 143, 153, 170, 187, 203, 222, 234, 223, 193, 164]
10242A64pQLj1j3jK2M4N2L3ol5l8k8k5k1oJ3Rj4k7j9njlJQJ2J5K2L3L5K3Nj9m0m6k8NL2M0
10224A86L1J7Kj7l6m0k4J1L6M0K8K1J8J3LkJol0m7l7qJ0J2ROok0k0mJ2J6J9K7K3%k6k8rMM
10206A89LRRmk2k1%J5J1jmPJ9J7QLKJnj1j5j7j8j2pqj4rJ2K6K2Pjjqk6l2k0nqj5j2%NLNJ5
10186I2J8Qpj5j6nJ5K7J6j3k4pJ5J9J0QJ1kk8m7m4l0j6nJ7L6M6M3L1Rj4k4j3%jj1j1RL0L5
10169A62K6J1jj4k9m5m5l2j5qqML5O2O4L5jk7l9m0l6k7j4%J6K6K9K9K3Lk3l5k0J0K1Oj6k1
10152F6rNNoj2jK4L9K9Kj2j3qrqlj%OJ5J4%oQK7K9J4kj9l8m3j9J6L2J3k2m1m0k4kK2K9K1J1
10133H9J5K7L2J9MnmjKOJ3K0J7Kj5k9l2l1k2j2lKJ0K2K6J0j5l0k0jOok4l2k4lJ7L2L2J4j3
10115I5k8j8PK0J1LQJ5Oj2j7mNKkLOMQK2K5Nj4lK1K1j0l3j9J5L1K1OOJ6K0J5Mj3l0l6k3ol
$$ y = [164, 157, 165, 168, 157, 144, 143, 165, 209, 261, 294, 288, 253, 215, 187, 162, 141, 135, 148, 157, 143, 116, 97, 92, 91, 88, 89, 97, 109, 124, 146, 179, 214, 237, 242, 223, 183, 137, 109, 114, 146, 186, 217, 234, 236, 219, 183, 143, 119, 130, 166, 206, 234, 255, 273, 286, 289, 287, 288, 282, 252, 205, 168, 160, 170, 182, 191, 197, 191, 171, 151, 147, 159, 175, 194, 221, 244, 244, 218, 190, 181, 185, 189, 192, 201, 210, 206, 184, 163, 163, 178, 189, 188, 184, 191, 210, 227, 235, 238, 240, 241, 236, 225, 210, 193, 175, 163, 156, 148, 134, 125, 137, 163, 185, 192, 191, 190, 182, 156, 124, 104, 99, 91, 76, 64, 64, 69, 72, 77, 92, 110, 118, 111, 96, 80, 75, 90, 117, 133, 120, 96, 89, 104, 123, 133, 141, 152, 150, 122, 75, 31, 1, -15, -20, -3, 33, 79, 122, 153, 162, 148, 124, 111, 111, 110, 99, 88, 97, 127, 162, 188, 199, 198, 184, 155, 110, 65, 33, 18, 10, 2, 6, 41, 103, 167, 202, 201, 174, 135, 95, 59, 32, 18, 18, 34, 60, 89, 118, 141, 144, 121, 86, 66, 76, 97, 103, 87, 66, 57, 62, 67, 61, 49, 48, 72, 111, 140, 142, 130, 117, 109, 100, 92, 89, 88, 88, 94, 109, 123, 123, 117, 125, 152, 181, 195, 193, 174, 136, 93, 74, 90, 122, 135, 113, 72, 32, 8, 6, 28, 57, 78, 89, 104, 131, 163, 182, 186, 181, 177, 176, 178, 184, 197, 217, 234, 236, 221, 192, 160, 129, 107, 95, 92, 94, 104, 126, 152, 162, 147, 117, 97, 96, 102, 96, 72, 40, 16, 13, 30, 62, 94, 108, 95, 67, 49, 56, 76, 87, 90, 98, 113, 119, 107, 90, 86, 91, 93, 91, 94, 100, 104, 112, 134, 159, 164, 150, 147, 168, 189, 179, 146, 127, 142, 173, 194, 200, 206, 222, 242, 257, 261, 248, 218, 182, 159, 153, 150]
10096A50j6k1oJ7K6J7RQQ%nmmj4k5k2j1qj2rPJ7Qj4k6j7LJ5J2joMK2L4L0J8J2J7K4K0kl0m6
10078A79l8j4J5L8M2J6k7o1o0l8j4OK3L3K2NJ0L4M8K4j8m3m1k5j1jJ1K0J8Oj3k0j3NJ4Nj1
10062A26j6r%NOQNLJJjkKJ0J2%j9l0k2lPNOJ7K8J9%%K2L8K2nj7j0JQRPkn%Lmj3rKmk2l1k2
10040A27j0plRJ4NnjNpk6k9j1PJ5J8J9J5N%MJ4J7J2Jj3k6k8j6PK8L3K0%roLPOPkk3m2l6qJ3
10020A03J3%moj8m4o6o8m3kL6N7N8N3N0M4K3mk2k0rnj1j9j8mK0L8M0K9J6J1J2J2J2J0jk8n5
10003A90n4k8JPrl0m4m2k5NL4M7M2L0K0J2J0J6K6K7J2j0k8l9m5m1k2jJ1J1RJ5K3L3L4K6Pr
9987B21oOMj3k4j5lj4l5l6j0J1Pj1j5kNMjJ%k%PJ4J2ROPJ1J7K2K3J6Omj1j9k1j4mJlnmlJQ
9966A44Rpk8l0nJ9J9J3J9L2J9j6l8k7nlj7k3pJ0RjkJ2K2J5kj2j0kNJ2K5L3K9J8J9K7K4Lj6
$$ y = [150, 134, 113, 107, 124, 150, 167, 176, 184, 192, 192, 187, 183, 179, 165, 140, 118, 107, 99, 87, 78, 85, 102, 110, 96, 70, 53, 56, 71, 83, 82, 76, 80, 102, 136, 166, 184, 196, 213, 237, 257, 255, 225, 179, 141, 127, 142, 180, 222, 238, 211, 150, 90, 52, 38, 44, 67, 100, 122, 127, 137, 171, 219, 243, 225, 182, 141, 116, 105, 104, 115, 135, 153, 159, 146, 126, 113, 118, 132, 137, 126, 110, 101, 101, 106, 112, 120, 125, 128, 129, 130, 129, 127, 129, 139, 151, 151, 132, 102, 80, 77, 84, 89, 95, 112, 140, 159, 159, 159, 181, 219, 241, 236, 219, 209, 210, 218, 227, 234, 232, 227, 227, 230, 226, 213, 204, 206, 202, 180, 149, 127, 117, 110, 107, 116, 130, 135, 130, 129, 134, 127, 101, 72, 61, 68, 83, 101, 120, 135, 140, 140, 144, 158, 175, 187, 188, 175, 149, 121, 105, 112, 140, 173, 193, 193, 184, 178, 181, 188, 194, 201, 199, 176, 134, 98, 90, 103, 116, 116, 112, 106, 88, 44, -22, -90, -133, -135, -99, -42, 16, 69, 119, 163, 186, 182, 160, 140, 131, 126, 115, 96, 78, 74, 94, 132, 172, 201, 217, 228, 240, 252, 264, 274, 273, 245, 190, 136, 108, 109, 116, 107, 77, 33, -9, -34, -29, 5, 52, 94, 124, 144, 156, 166, 182, 208, 235, 247, 237, 209, 170, 125, 84, 62, 61, 72, 83, 92, 107, 130, 163, 197, 223, 230, 221, 215, 221, 225, 212, 188, 173, 170, 156, 121, 85, 75, 86, 93, 82, 67, 65, 70, 74, 73, 74, 74, 72, 72, 79, 93, 105, 114, 120, 127, 138, 155, 177, 200, 216, 222, 218, 207, 188, 167, 153, 149, 150, 147, 142, 138, 135, 136, 144, 153, 146, 118, 88, 83, 102, 121, 134, 153, 185, 204, 188, 150, 123, 118, 115, 98, 75, 68, 78, 87, 86, 84, 96, 118, 133, 131, 119, 109, 107, 112, 124, 149, 182, 211, 229, 248, 275, 299, 302, 286]
9948B86k1j6pRK9L5J5j5k6j5kjkMOjj1j5j4k0l0l6k8j1J2K6K7K0J8K3K2Lj9k9j9jJ7L0K8R
9931B80j5k5j4krk4k2jJ6Pj4j4OK3J8Nklrj9k4k3k4l1l9l9k3OL9N2L6J2PJ9J6kpJ5L9L6J0
9913B57j1j6j7k0j4opk2l5l3k0qKJ5K6K9J9Kj2qJ2K8J8j4l3k3kQOPJ4J6J0NJpj8k5k7k5j6
9895E6LK4L0J6nk0k7k9k9k1j1LK0L8L8K3jj7j9j8j5rLQJj3j6JK0K5J8J9K6K2ol3k9nPpj8k
9877E1L1M9L9J1j9l1k1%Qkj3pRJ3Kj7k8l1k1JK4L0K3J7K2K5K1J7J9J6%j6j9rKOMJMRQj0l5
9858A83m7l1lRLmMJ5J5NjNJ1J0kj9l0l5l0j3J0L1M3M8L8J5j8l3k1JNoj2JJ3RlnjL%jLJ0K3
9839A98L4L3J1k8n8o4m2pK4L6K9J1qk4k4nK3L6L0J9J3%k3m2l7j8JRJ2J0Kl%MMLJ0J3Jj9j6
9821A48OJ8J3LMPKlnqj1oJ1J9Nj3j2MJ9J9Rpk3k9k0nQK3L2J8j2k8rK2K7Ql%Lnj1j0j2k1k9
$$ y = [286, 265, 249, 242, 251, 280, 315, 330, 315, 289, 274, 272, 271, 269, 273, 279, 278, 267, 252, 238, 218, 188, 152, 124, 113, 125, 151, 178, 198, 216, 239, 261, 264, 245, 216, 197, 196, 213, 243, 271, 280, 265, 240, 226, 224, 215, 191, 169, 168, 184, 191, 177, 163, 169, 192, 210, 215, 213, 210, 201, 182, 158, 135, 111, 80, 41, 2, -21, -15, 24, 76, 112, 124, 131, 150, 166, 164, 157, 172, 211, 247, 257, 246, 230, 213, 193, 179, 173, 166, 144, 109, 76, 56, 48, 50, 65, 91, 120, 139, 141, 129, 121, 133, 161, 179, 165, 132, 109, 107, 115, 121, 128, 142, 158, 168, 173, 174, 167, 149, 124, 97, 72, 56, 59, 83, 113, 129, 124, 104, 77, 48, 19, -2, -13, -10, 10, 48, 86, 109, 108, 91, 72, 54, 39, 30, 33, 41, 42, 29, 13, 14, 34, 59, 77, 96, 122, 144, 138, 105, 76, 71, 78, 71, 53, 51, 82, 131, 170, 181, 162, 131, 110, 110, 118, 116, 103, 96, 105, 118, 120, 103, 75, 44, 23, 24, 48, 78, 101, 118, 140, 165, 186, 203, 222, 238, 238, 222, 203, 194, 196, 202, 206, 207, 211, 220, 228, 218, 183, 136, 105, 102, 111, 114, 110, 114, 129, 144, 149, 148, 153, 164, 174, 172, 153, 123, 88, 58, 45, 55, 86, 129, 177, 215, 230, 212, 179, 158, 159, 164, 158, 146, 147, 160, 169, 166, 161, 160, 163, 163, 162, 165, 175, 198, 232, 265, 276, 248, 190, 126, 84, 77, 101, 137, 166, 177, 169, 145, 121, 116, 139, 175, 205, 224, 237, 237, 214, 172, 135, 117, 118, 127, 139, 149, 151, 148, 148, 152, 156, 159, 169, 182, 183, 164, 148, 154, 172, 185, 188, 192, 199, 201, 198, 193, 185, 174, 168, 179, 198, 203, 190, 178, 182, 201, 220, 229, 222, 199, 170, 150, 145, 153, 176, 208, 226, 214, 186, 177, 199, 226, 234, 231, 231, 234, 229, 218, 208, 196, 175, 146]
9802A46k4j5qkM%qj1lNkrKL1O0O6M2J1oKJ1ml5m9l4rkj0j8j8j3mNJ1RPPRJ2J4J2jj6j6%J4
9782A63J6J3J8J6mk9l8k4jJ4J8J1lj7k0j2jJ2K7L2J9kj3j3j2pJ1K7J4k3l6pK8K3j7m0k8qp
9765A00j9j9qMRQLKJ2K9L1J2j3k1j3j1j9k1j3l%OJ2J1KKJ5K0Mj8j4J1K8K4J5J0Npj6j8k4l5
9746H3m0k4jJ2P%jMRJ1J1RJ6K9L7K9J3Kklnmpj5j9mK2L5J9rk2rJ7K9J5j0k5k0j3k1l4k9nJ7
9727A04J5ok9l8k7kK0K9K5K1K3K6K4K0J3Mk%OJj0j1jNok3k5j4JJ7L2L3J4j5k7j2J2J5mk8l1
9710A49j3Jpk3k6rL%nOJ9J6KjJ0J5J3J3J8Qj8m0l3pQLlJJ2J4PknlnqlQJ5Lj9k7j5PK1K8L2
9689A60K4%k9m7m8l9k7j2RK1K2J7J8L0L9L9K5%k8m3l4j2krj2OK9L0J3jLJ0Mj1k0j1JPN%KQ
9671A37J1Lj2k0k0j6j2nQK0K4J7Mj7l1k2QL4L3J2oj0qJJ5K2Qj3j7KK2L4L7L3J4j1j8nM%lP
$$ y = [146, 122, 107, 99, 97, 101, 101, 93, 82, 79, 84, 82, 73, 75, 106, 166, 232, 274, 285, 279, 281, 292, 288, 253, 204, 170, 161, 159, 149, 131, 113, 100, 96, 101, 112, 121, 128, 135, 144, 156, 170, 182, 181, 165, 149, 149, 163, 179, 192, 210, 226, 222, 193, 155, 131, 130, 144, 162, 173, 170, 153, 133, 121, 120, 132, 159, 191, 210, 208, 195, 182, 170, 163, 174, 201, 215, 192, 156, 149, 177, 200, 183, 143, 115, 107, 100, 81, 62, 54, 58, 67, 75, 78, 80, 92, 121, 152, 164, 151, 130, 117, 106, 87, 66, 53, 50, 50, 56, 68, 79, 81, 83, 98, 118, 122, 104, 90, 101, 129, 153, 168, 178, 183, 176, 160, 142, 118, 83, 43, 19, 18, 30, 37, 37, 36, 40, 49, 60, 71, 80, 96, 125, 162, 191, 204, 206, 204, 201, 196, 192, 185, 170, 151, 147, 169, 204, 223, 214, 192, 183, 200, 229, 244, 234, 209, 189, 176, 155, 121, 92, 87, 104, 119, 113, 84, 46, 19, 17, 37, 66, 91, 112, 135, 161, 185, 205, 218, 222, 220, 220, 226, 227, 217, 206, 205, 210, 204, 181, 156, 142, 143, 160, 192, 225, 239, 224, 197, 185, 197, 212, 208, 180, 149, 136, 137, 130, 107, 81, 72, 75, 75, 70, 76, 95, 111, 113, 112, 122, 137, 150, 163, 181, 189, 171, 131, 98, 91, 99, 102, 99, 100, 112, 126, 133, 131, 126, 123, 118, 110, 107, 115, 130, 133, 114, 87, 72, 79, 100, 128, 160, 184, 184, 155, 108, 60, 21, -6, -18, -9, 12, 34, 51, 69, 99, 138, 177, 202, 202, 174, 131, 97, 85, 83, 74, 62, 68, 97, 127, 140, 139, 142, 152, 156, 145, 125, 114, 115, 122, 127, 127, 129, 137, 148, 151, 139, 119, 99, 83, 71, 66, 74, 94, 118, 135, 139, 122, 91, 69, 77, 111, 144, 156, 150, 140, 132, 133, 148, 170, 178, 165, 148, 150, 172, 206, 243, 276, 290, 279, 261, 256, 260, 260, 257, 264]
9653B64J3Kj5j7j0oJJ2J0rl0k3mKj5k5j1J4L0L3K4Rj1j9j4jJ2J7Rj4l4l7l2m1n4m6j4J6K7
9636A3L6N3O4M6J2qoKkprjJ2K1J0j6l7l1j0%jNK6L7K5kj9k2k3k7l1k2mJ2J5Pkj2k1k6j7OK9
9617G5L5K6J8J7J6J3ROJomOJ0%j3k1k8l9m3l0j0QJ7K3K9K2NnLK0K4J0qj4j1qpKJ8L1L2K2J3
9599B64ROok8m1l4j1Mjj9k4j2LOOJ5K8L0K2J8J7J2ok4k8j9j4k3l7m2k5J2M9O9O1L0rl8m5l0
9581A45oJ3J7Rkj1j1jJ0J7J5J6J7J5R%j0k2l2k4lJ3Pj3k0j5rj4j5oJ0K3L2L0J2j9m1l4rJ2
9564A05K2K8L4L1J3j0k0k0j6j4oNR%j4j9j9j5j2plKNPRJ2J2J0mk6l5k3lol1m4k8QK6K8L2M5
9546F8M5K2%MK3K8RrmRQoj1j%j6l0j9QJ9J0lplllLRJ1Qjj9l8m2k4nPJ6L1L5J6j6k7j6jJLJ2
9525A01K3K7L5M3L9J8nj1kM%qj2nJ7L5K5k0o4p1m5j6JPJ2J3J5K4K8J5j4l1k0PK3J9Jk1l1k8
$$ y = [264, 277, 279, 264, 247, 237, 231, 232, 244, 254, 245, 215, 192, 188, 190, 175, 150, 139, 153, 183, 216, 240, 249, 238, 219, 205, 204, 216, 233, 242, 228, 194, 157, 125, 84, 30, -16, -30, -14, 13, 49, 102, 166, 212, 224, 216, 210, 212, 210, 203, 194, 193, 205, 226, 236, 220, 183, 152, 142, 142, 141, 146, 172, 209, 234, 232, 213, 191, 168, 141, 110, 88, 84, 96, 111, 118, 116, 104, 83, 57, 40, 46, 75, 110, 136, 154, 171, 187, 200, 209, 215, 216, 210, 206, 212, 222, 222, 209, 188, 160, 121, 78, 48, 38, 46, 63, 86, 115, 137, 142, 137, 140, 160, 184, 194, 186, 172, 161, 153, 146, 148, 166, 197, 229, 251, 264, 273, 279, 273, 245, 204, 170, 159, 163, 162, 143, 119, 107, 110, 116, 122, 137, 165, 195, 217, 235, 252, 264, 258, 234, 206, 187, 173, 150, 113, 71, 46, 58, 107, 176, 237, 267, 258, 220, 175, 145, 139, 152, 169, 178, 176, 165, 154, 153, 163, 180, 195, 211, 228, 243, 252, 252, 242, 220, 188, 164, 161, 174, 181, 168, 148, 133, 124, 110, 95, 89, 99, 122, 154, 184, 196, 177, 136, 102, 93, 105, 127, 155, 189, 220, 233, 223, 203, 183, 167, 153, 147, 152, 161, 161, 147, 128, 109, 94, 82, 75, 72, 74, 79, 86, 95, 107, 119, 129, 125, 99, 64, 41, 38, 32, 1, -43, -71, -63, -37, -9, 23, 68, 113, 135, 135, 139, 162, 190, 199, 190, 186, 195, 203, 197, 186, 185, 185, 169, 139, 120, 128, 147, 157, 154, 147, 144, 141, 138, 141, 150, 161, 169, 168, 149, 111, 69, 45, 40, 47, 63, 94, 129, 145, 129, 102, 86, 85, 86, 89, 101, 124, 151, 186, 229, 268, 286, 281, 270, 268, 272, 272, 264, 252, 247, 264, 299, 324, 304, 240, 169, 124, 108, 109, 116, 128, 141, 156, 180, 208, 223, 209, 178, 158, 165, 188, 207, 208, 187, 156, 128]
9508A28j6qpj2j0jJ3K7L5K9J5nk4l2j9MJ5jk8l7k3KK5M1M8L6J3KPQj1l1k9qPJj8l1k5LL8N2
9489A73K9j1l4l3k2j5jK3L3J8j1k3j0RJ5J2RMj0l3m9l8nK5K4lk3j4J6L6L2J5nk2l2k3MK8K6
9472A14Lj4j3rnkMKj1k4j7JJ0MOK6M3L3Jk9l6k0KJ9K0OqnJ4L5L6J8%j2j8k0j3JJ5J7J2J3K6
9454B25L5K8Pj3k2k3j7pNJ5J9J4%j6k3j6qj5k9k4LK4J5rk0pOKj5k3j9j2qlLPJqnJ3L1K5Nq
9435A33KK0J7mk3j5J4M0M5L2Rj5l3l6k1KJ0mk6k9j4JMMNPKMJ1Pj4l4l5j5OJ9L1M1L9K5Mj2
9417B04j9j4lKqk1k0pMJ1J5J8Rj0j7jK1K5J4%j0j7k5l3l7l3k0JJ9L1L2J7j6m6n1k2OJ9K5L7
9399H0M7L3Lj9j5JQ%j3k0j9j1kJ5M3O6O0K1k2k8oJ1jk4l2j9kOPM%j1k4k9j8PK0J3pk0j7qm
9381G4looMK3L6L0J2LJ2K7L1K5J4Kj4k2k2j4rrrppj0j4j2jON%jONj1k9l0j0J2K6L5M0K9jk9
$$ y = [128, 112, 104, 97, 85, 75, 74, 87, 114, 149, 178, 193, 188, 164, 132, 113, 117, 132, 131, 103, 66, 43, 45, 70, 111, 159, 195, 208, 210, 217, 225, 214, 183, 154, 146, 153, 154, 136, 105, 80, 83, 121, 173, 202, 191, 157, 124, 102, 87, 86, 109, 142, 160, 149, 126, 116, 125, 140, 152, 161, 165, 155, 122, 73, 35, 30, 55, 79, 76, 53, 39, 55, 91, 123, 138, 133, 111, 79, 56, 60, 88, 114, 117, 103, 90, 81, 76, 74, 78, 80, 69, 45, 28, 29, 39, 43, 49, 75, 118, 151, 152, 123, 87, 67, 69, 88, 108, 114, 106, 101, 115, 150, 186, 204, 204, 192, 174, 154, 141, 142, 157, 174, 186, 199, 225, 260, 288, 295, 282, 260, 237, 220, 213, 218, 233, 252, 266, 266, 250, 227, 211, 203, 188, 159, 135, 138, 162, 177, 168, 148, 141, 147, 149, 134, 111, 92, 80, 72, 69, 72, 79, 80, 72, 67, 80, 111, 136, 141, 133, 135, 155, 172, 168, 145, 130, 144, 184, 229, 261, 270, 255, 222, 186, 165, 167, 177, 173, 147, 118, 104, 105, 109, 113, 118, 125, 127, 131, 142, 149, 135, 101, 66, 51, 57, 76, 107, 148, 187, 212, 216, 204, 185, 171, 168, 170, 162, 141, 121, 114, 118, 129, 144, 162, 171, 161, 144, 143, 164, 189, 203, 203, 193, 176, 151, 118, 81, 48, 28, 29, 48, 79, 111, 128, 112, 66, 15, -7, -1, 18, 43, 80, 127, 160, 163, 144, 129, 130, 138, 138, 125, 105, 86, 75, 73, 88, 131, 197, 257, 278, 256, 228, 222, 233, 232, 208, 176, 157, 155, 161, 168, 172, 172, 161, 137, 108, 90, 97, 117, 130, 123, 103, 86, 78, 74, 71, 65, 59, 63, 86, 122, 152, 164, 167, 179, 206, 237, 262, 276, 278, 264, 242, 220, 206, 197, 188, 179, 172, 165, 155, 141, 129, 128, 134, 139, 139, 138, 144, 149, 138, 109, 79, 69, 81, 107, 142, 182, 211, 210, 181]
9361A81l1j1QJ3Nmj6l0l7k1QK6K7K3L0M0K9%k3k4j4j5k0qJ4K4J1LJ2K3J3j3l0l1k7k6j5J0
9345A04L0K6Jk2k9k1j3j4j6rRK9L5K3PNK1L4K8NrkJ0Oj2k4j4MJ6J4Kj8l1l0j3PK1K6K7J9M
9327B36noJNNJj6l9n4m0j1MjplPJ1QLmj1j2nPJ9K8K9J1k2m5l6lK3K3PkLJ3K2K8K5Pj7k8j4
9307A45MRkj3j4j4j8j5jJ8K8L4M4N5N0L1Rlj0k1l3l6k9k0j5k4l3k8pJ3J6RJ2K5L0K2J2RQ%
9290B47j0j2j4j5pJ7L9L7J4nqj4k9l8k5mlk1l4k9j5j0oLRlk0j8NK0QqoONj2j9lJ3J4OPJ8K8
9271A08L6L8K3rl5l6j4krj8pJ8L1K2J0J1J5Oj6k3mJ8J4j6l7k3NK0Rqj7j3oNJ7K1J8J5J4J5
9254A96J1K%PJ3J1lj9k3j1J0K4K1Lj4j5j1j2j7oK4M6L3jk3j9j2j7k6k3j2jJ0K6L8L5K6J7J1
9237B99Kj2j8j3llj4l2l8k4%K2L5M6M4K0j6l6k4%Qjqj0j4j0J1L5L4Qj5j4lnk0l3l8l6k5qR
$$ y = [181, 150, 139, 147, 160, 165, 161, 145, 115, 78, 57, 65, 91, 118, 141, 171, 211, 240, 240, 217, 193, 179, 164, 144, 136, 150, 174, 185, 188, 200, 223, 236, 223, 193, 162, 135, 109, 94, 104, 134, 160, 161, 139, 110, 89, 76, 62, 46, 37, 46, 75, 110, 133, 140, 145, 166, 200, 228, 233, 224, 222, 232, 238, 226, 202, 188, 192, 208, 222, 224, 206, 175, 145, 132, 139, 160, 186, 213, 232, 236, 231, 225, 226, 231, 236, 237, 221, 182, 128, 88, 77, 81, 80, 73, 70, 77, 88, 96, 99, 95, 84, 72, 67, 74, 93, 121, 150, 161, 139, 94, 58, 55, 78, 101, 108, 106, 109, 122, 144, 172, 197, 204, 187, 159, 145, 149, 158, 156, 143, 129, 115, 97, 82, 81, 99, 127, 161, 205, 260, 310, 341, 350, 347, 337, 316, 283, 247, 218, 198, 183, 159, 126, 98, 91, 104, 120, 129, 141, 166, 196, 218, 230, 239, 247, 247, 237, 225, 211, 196, 189, 206, 245, 282, 296, 291, 283, 269, 240, 202, 177, 173, 170, 149, 115, 86, 71, 61, 55, 58, 67, 64, 44, 26, 31, 51, 59, 51, 45, 51, 56, 44, 25, 22, 35, 49, 55, 62, 80, 108, 144, 182, 205, 196, 161, 125, 111, 109, 100, 82, 75, 93, 124, 146, 156, 167, 182, 188, 172, 149, 145, 163, 177, 161, 124, 101, 106, 126, 135, 127, 110, 97, 91, 96, 113, 134, 152, 167, 181, 196, 207, 209, 209, 216, 229, 240, 237, 218, 195, 184, 194, 218, 239, 242, 228, 213, 202, 190, 173, 167, 191, 237, 270, 269, 246, 227, 215, 198, 172, 149, 137, 136, 146, 172, 210, 245, 271, 288, 299, 301, 289, 271, 258, 255, 252, 238, 206, 168, 144, 144, 166, 201, 247, 291, 311, 295, 259, 235, 235, 243, 242, 234, 224, 210, 200, 211, 246, 280, 288, 273, 259, 256, 251, 231, 198, 160, 124, 99, 91, 100]
9219A00J8K7L4L2J8%rj1ok%j0k4k4pPpl2m3l4j6n%QJ7L2M5M4K1nrJ2L5L8L1L0L6L3Pl1n0l5
9201B65jJ6Kk3l3k2nLjj2j6lJ9K9J8Joj6l2m0j7J4J8qk4j3OPjKJ4J9K2K7L0J8ok4l0k4j5o
9182A52rk2l4l1j4KJ3J8J8J0OJ4K1J0j1j6kNj2l5l7j6J2L1L8L3J5ok0k5k7l1l0j9NL6N6N5
9166A53M0K1J0kj4j6qoj7k9k9j7pLJ6K6K4J3Mlj2j5j0nqoJ8M3M2J5jJ2K7J4j5k9k6k5k7k1
9149A33rpj8k9k4j5rkJ4L1L6K6J2LlojJ2K1J5ok1j3J0K8L1K0Prk5l5k6pJ1J7Rknk%oj4j3l
9130A26%nnQJ8J4MNJ3J4J0J0J0JqJJ9K1jk6l9l9l5k1OK8K6Oj3j7j1JJ1J4Pmj1j4j3oOJ2J2
9111A35J0RKpr%KprJ3M0M2J5qpJjj0j6j5j9k7l2k2nJj4l7m0k2RL2M6N4M9L4J5Mmk4m6m9k2
9092F1J2K6J1j4k8j8NK0J9QPJ8K6J7nk6l0j8kOOMLmj7k1nJ9K9L1L4L7K2rk8k4qmj1j5j1JJ4
$$ y = [100, 118, 145, 179, 211, 229, 229, 220, 209, 203, 201, 201, 191, 167, 143, 136, 143, 136, 104, 61, 27, 11, 6, 6, 14, 31, 63, 108, 152, 173, 168, 159, 171, 206, 244, 275, 305, 341, 374, 381, 350, 300, 265, 264, 280, 282, 259, 226, 204, 199, 202, 201, 189, 173, 170, 189, 218, 236, 237, 231, 215, 183, 143, 126, 140, 158, 150, 126, 113, 119, 126, 125, 127, 141, 160, 182, 209, 239, 257, 251, 227, 197, 173, 158, 152, 143, 121, 87, 56, 42, 44, 57, 75, 93, 103, 109, 123, 144, 154, 143, 127, 125, 130, 118, 83, 46, 30, 42, 73, 111, 144, 159, 153, 133, 108, 81, 50, 20, 1, 6, 42, 98, 153, 193, 214, 224, 222, 208, 192, 184, 178, 161, 132, 103, 86, 79, 82, 98, 124, 148, 161, 165, 162, 150, 135, 125, 120, 112, 106, 124, 167, 209, 224, 223, 235, 262, 276, 261, 232, 206, 181, 154, 133, 124, 117, 99, 70, 46, 31, 22, 20, 34, 65, 101, 127, 139, 142, 139, 133, 132, 144, 165, 180, 174, 153, 140, 150, 178, 209, 229, 236, 227, 202, 167, 141, 134, 145, 162, 171, 169, 164, 162, 162, 156, 142, 129, 126, 126, 121, 116, 124, 142, 156, 160, 165, 178, 192, 202, 212, 222, 223, 215, 216, 235, 256, 255, 229, 190, 151, 116, 95, 101, 129, 155, 161, 148, 131, 120, 121, 132, 146, 153, 149, 138, 124, 111, 105, 111, 123, 135, 145, 154, 156, 149, 140, 140, 142, 135, 126, 139, 179, 221, 236, 228, 221, 222, 221, 211, 195, 180, 161, 134, 102, 80, 75, 76, 62, 25, -15, -37, -28, 4, 50, 104, 153, 187, 202, 206, 202, 178, 132, 83, 61, 73, 99, 110, 96, 68, 50, 55, 75, 94, 102, 109, 127, 153, 170, 165, 139, 109, 91, 89, 95, 101, 105, 108, 104, 87, 66, 61, 80, 109, 140, 174, 211, 233, 224, 196, 172, 164, 160, 149, 134, 123, 124, 138]
9074A38J9J1j0k8k9j6MK3L5K9RplJ4K2J2pk2j8kJ3J2lj4rPJ6J1jqoMJ3J0Jllj0k6l3j8KJ5
9055A44K0K2J2qj9qKj3m1m8k7mPJ6K9L1J5lnMJ1J1Npj7j3QK3K1J0PJ1J2RJ1J5Rqk1k5k3k5
9037A50k1nJ6L1K9J5nk1l3k5LM2O8O1L6J4Mqk1k5j5oj3k7l5k8j1QK2K1Ppj1j0j9k4j3J2K5
9020A81K4J9J9J7Q%kmj3j6qLMljRJ5RJPK2K8J8Krj3j8k4k8j7jOpk3k5j5j1j7k3j3MJ8K6K6
9001A75J5rl6m7l5j0J2K8L6L1J4nq%RJ1J2Qjj2rJ0L2L4J9jj3j7j2mKlj2k2k3k3k5k4j8q%J0
8983H1K4L9L8J6j1k3k3k3l2k9qK0L1K4J4J2J1jj5j6JK1K4J0pj3j1qlKOKkOJ9J4j7l9k7RL1
8965A47K5J0Kok1k6j0PLj7k5j5lmj1mJ6L6M3L8K3Nj0j5j0lpk0k2pJ7K8K6K0J4R%%PJ1Mrk2
8946B24l3m1l0%K6K7Pj0j5j4j0kNLlJJ5K4Rj5k7j4RK0J1kqmj0k5l4j7PJ7J5J7K8K9J3pj6j9
$$ y = [138, 157, 168, 158, 130, 101, 85, 89, 112, 147, 176, 185, 178, 175, 189, 211, 223, 216, 194, 176, 174, 187, 199, 196, 182, 173, 180, 196, 207, 206, 198, 192, 196, 209, 219, 220, 217, 214, 204, 178, 145, 127, 129, 144, 164, 186, 198, 190, 171, 163, 165, 152, 111, 63, 36, 32, 39, 55, 84, 115, 130, 127, 122, 126, 137, 148, 153, 146, 129, 116, 124, 147, 168, 178, 185, 196, 208, 217, 228, 243, 252, 244, 223, 198, 175, 150, 129, 124, 140, 171, 200, 215, 210, 189, 156, 131, 134, 176, 244, 305, 341, 355, 359, 351, 330, 305, 290, 284, 271, 244, 209, 181, 170, 178, 200, 221, 228, 221, 210, 200, 181, 157, 144, 156, 181, 205, 224, 243, 260, 268, 268, 266, 262, 249, 233, 225, 228, 232, 229, 228, 237, 252, 261, 262, 269, 291, 319, 337, 339, 330, 317, 299, 275, 247, 230, 229, 235, 228, 205, 180, 165, 154, 137, 114, 101, 105, 123, 149, 175, 190, 181, 145, 98, 63, 53, 65, 93, 129, 160, 174, 169, 161, 161, 170, 181, 193, 201, 200, 188, 179, 189, 221, 255, 274, 273, 260, 243, 231, 227, 229, 226, 214, 192, 169, 146, 121, 97, 79, 71, 71, 81, 105, 144, 182, 198, 187, 164, 141, 118, 86, 57, 49, 69, 100, 124, 138, 150, 161, 160, 145, 129, 130, 151, 175, 185, 178, 165, 154, 146, 143, 145, 151, 153, 151, 157, 176, 190, 173, 134, 107, 116, 147, 172, 182, 184, 178, 157, 131, 121, 128, 131, 114, 89, 74, 71, 67, 56, 52, 68, 104, 147, 185, 208, 213, 203, 188, 178, 175, 168, 148, 126, 119, 136, 164, 190, 210, 224, 233, 233, 233, 240, 251, 255, 246, 224, 191, 150, 120, 120, 146, 173, 180, 170, 155, 141, 131, 129, 134, 137, 134, 135, 150, 174, 183, 168, 141, 127, 136, 156, 167, 165, 157, 153, 143, 118, 84, 67, 74, 91, 106, 123, 151, 180, 193, 186, 170, 151]
8928A51k0j3MJ2OjJ0K8K4ol4l5rK3M2L8J0l1n9n6k4K0N2N9L4kk8k5pJ0J5J9K0J3mj5pJ0J5
8911B39Mrj4k1l4l1qJ9J9qk9k9j6mLRJ2J0QJj2j8jL4N7M9K0mj1plkj1k4k5j8j9l2l0MM1M2
8893A51J4m%nk4l0nK5K9J7J2J6RnqOK1K7K3Qj6l2l0j4qj8k7k2j5r%J5K4K0J7K1J9Jj6rRNk7
8874A65m7k8J1L3K6Mj3j6mJ6K7J9Jj9l2m1l1OM7O4M7K2J2J3Rnj9k4j4PK3K1Kj7k9l6m6m7l3
8857G4j4oqqmlJJ0K3K5J8J0J1J0Jj0j4r%J2K0K1J4QNOPJ5K4K1Nj2k0j2%J2J5Nj3k6k6j7rl
8838A59LMJl%QJ1RPMrk5k5lK1K4Nj6k4j8rjKKLPJ4K1K3J8Nj7k9j9PK5J8kj0njqj4j2qorj2
8817A16j7k2j6MK7L3J9jj2qLQNjJROj3k8k2LK4K6J8J4J3J4J2J1OMLKqj7k3k9m3m7k0K4M4K3
8799A45j2k9k4k2k0kK6M0K8ROJ9L5L5J6j4l9m6m5m4l7qL2N5M3J5jMJ4J5J2J1Omk3l2k5pMK
$$ y = [151, 131, 118, 122, 134, 140, 139, 149, 177, 201, 195, 161, 126, 117, 140, 182, 220, 230, 199, 140, 84, 60, 80, 132, 191, 225, 223, 195, 170, 163, 173, 188, 207, 227, 240, 236, 221, 214, 224, 239, 243, 234, 220, 199, 165, 134, 126, 145, 164, 156, 127, 98, 82, 78, 81, 90, 102, 112, 120, 121, 109, 91, 90, 124, 181, 230, 250, 246, 235, 228, 225, 223, 212, 188, 163, 145, 126, 94, 64, 68, 109, 151, 165, 161, 161, 156, 132, 102, 97, 122, 151, 168, 180, 196, 205, 200, 192, 198, 219, 246, 269, 277, 261, 229, 199, 185, 177, 159, 132, 110, 95, 86, 86, 101, 125, 145, 162, 183, 202, 203, 187, 178, 187, 192, 165, 118, 90, 101, 134, 160, 164, 151, 135, 131, 147, 174, 193, 194, 175, 143, 102, 71, 77, 124, 188, 235, 257, 269, 282, 291, 286, 267, 243, 229, 236, 259, 280, 282, 265, 236, 200, 154, 107, 74, 60, 54, 46, 38, 34, 31, 32, 42, 65, 90, 108, 118, 129, 139, 140, 130, 116, 107, 107, 119, 139, 160, 174, 182, 187, 193, 200, 215, 239, 260, 265, 253, 233, 221, 221, 233, 248, 253, 240, 214, 188, 171, 162, 159, 162, 166, 167, 164, 164, 172, 183, 192, 199, 203, 194, 169, 144, 141, 162, 186, 191, 175, 151, 133, 124, 123, 125, 127, 130, 137, 151, 172, 195, 213, 218, 201, 172, 153, 160, 185, 203, 201, 191, 186, 185, 177, 163, 151, 143, 137, 128, 116, 99, 77, 61, 65, 92, 125, 144, 143, 131, 123, 126, 134, 139, 138, 139, 148, 154, 141, 113, 91, 94, 118, 144, 162, 176, 189, 203, 215, 226, 232, 236, 239, 241, 233, 216, 193, 164, 121, 74, 54, 78, 122, 145, 133, 104, 80, 58, 38, 36, 62, 102, 130, 139, 145, 164, 199, 234, 250, 236, 197, 151, 106, 62, 25, 17, 49, 104, 147, 162, 161, 165, 179, 194, 206, 217, 223, 219, 196, 164, 139, 132, 136, 138]
8782A38rj4rjQJ2J0PNLnj9k5j8qj1j8j2J0K5K5K0K0K0Lj9l0k4rLOOPJ1J4J5J3J2Ppj9j5J1
8763A39M0N1M1J6j5l7l9j8QK3K6K0Rj0k8k6rONnj3k2l0k9j1OKj4k1qJ2K2J9J5J5QknLJ6K3
8745A83K0J3O%MJ4K1Qj8l8l1pJ3J9J8J9J3%j0j1pj2k0j9mJ6K8L1K4Oj2j7pKJpro%MJj0k1j7
8726A81NK5K5Lk0l4m4m6l5j2QJ2QPJ6K6K8J3qj7nJ3J2oj6qK%%J6L4M0L4L1K4Ok3m2m5l8k2
8708A48ML0L5K4Rjj1k2k0nQMj0k5l4l8k7mJ4J3jqnkJOJ8L0L3K5PppQJ9J7%j7k6k4j4JJ1J6
8689A73K3K9K7J2k%J6K3Qj0j1QJ9Ok2l3j6QJ2M%LJj1j6j1qj3j7rKJpj2rj3k1k1j5rj4k3k9
8671B3k6j5KJ0J0J6L1L9K1qj9LL6N1L8Pk4l7k5nlj7k5j2J3L1L5K6Pk1m2l8j2J3J9J0KjjLJ3
8653A28L4N5N8L4ml5n3n7m5k3ppj6j1J0K6K8K0J6K0K4K5K2J9J0nk7m8m7j5K9N0L9J8PNKnj8
$$ y = [138, 129, 115, 106, 105, 113, 125, 135, 142, 147, 150, 145, 126, 101, 83, 75, 64, 46, 34, 44, 69, 94, 114, 134, 154, 157, 138, 108, 84, 75, 78, 84, 90, 97, 108, 122, 137, 150, 162, 169, 162, 143, 128, 139, 179, 230, 271, 287, 272, 235, 196, 178, 186, 209, 235, 255, 264, 254, 226, 200, 191, 197, 202, 197, 184, 162, 132, 103, 92, 98, 100, 86, 65, 57, 69, 91, 110, 125, 140, 148, 146, 141, 144, 160, 183, 203, 216, 222, 222, 226, 240, 261, 269, 251, 213, 182, 175, 188, 207, 225, 244, 257, 257, 247, 236, 229, 217, 197, 178, 174, 190, 218, 249, 273, 279, 267, 250, 243, 245, 246, 239, 230, 224, 224, 228, 229, 219, 198, 181, 186, 211, 236, 239, 219, 185, 141, 95, 60, 48, 56, 68, 76, 83, 99, 125, 153, 166, 158, 141, 136, 149, 161, 155, 139, 131, 133, 133, 133, 149, 183, 223, 257, 288, 312, 318, 295, 253, 208, 170, 148, 152, 182, 217, 241, 250, 249, 238, 216, 196, 191, 199, 203, 193, 168, 134, 96, 69, 65, 79, 92, 91, 83, 78, 76, 77, 83, 101, 131, 164, 189, 196, 189, 182, 190, 209, 226, 226, 209, 183, 159, 145, 146, 157, 173, 196, 225, 252, 264, 262, 262, 278, 301, 309, 299, 288, 296, 315, 321, 299, 266, 250, 258, 270, 274, 274, 277, 278, 267, 251, 240, 232, 219, 202, 193, 195, 196, 189, 177, 168, 155, 134, 113, 98, 89, 75, 52, 23, -3, -18, -16, -6, 4, 20, 51, 90, 111, 103, 84, 87, 123, 174, 212, 219, 195, 158, 133, 128, 125, 108, 83, 71, 84, 115, 150, 176, 183, 162, 120, 82, 70, 83, 102, 112, 114, 113, 112, 115, 128, 162, 217, 275, 309, 305, 270, 217, 160, 115, 92, 85, 78, 62, 51, 61, 87, 115, 135, 151, 171, 195, 220, 242, 261, 271, 266, 239, 191, 144, 129, 158, 208, 247, 265, 272, 277, 279, 274, 256]
8636B56l3m1l7k4j8j5kK3L9K9RMJ2J9J6QLmj1j8k3k0kK4L5J8pj6j0ll%J0J8K2K7K3Pj8l5l6
8618B26k4lJ8K4Qj0j2jkj8k9k6j8j3oOJ1%j5j4JJ7K8K7J8ml0m7m6k7%J8J3pk0j4QK6L2L1K9
8600A55K7J7%j9k5j2J3L3K8Lk2k0OL0K0j6l7k4LJ7K3L5M0K1prJ0Ol6p4o7k4PJ6J5Rlj8j6J
8583A06J7K7L4L1Ml5m8k2J1K2J0%KJ3K6L9L9J7k4o3q2p7n7l2rLRJ9L8N2M1J5mkPJ4J6J8J3
8566A88pk4j8RK6K3Qjoj3j6j2j0j2j7j7j5j8k5k7k4k2j0J7M0L9J0k0k5nK3L5K0j1k7j3J1J8
8550G2O%LRNKLKoq%Ojj5k2k5k6j4RL0L0J6J4K8L4J6j1k4j3QK5L6M3M0K6Nj5l2m2m1l6k2nJ2
8531A22K2J8jj5j4NJ7Pj2j9lJ9K7K1J3J0J1J2J5J4Mj4k7k6j7j3j3j3nJnj7j6LK7K8J4JNJ1
8513A97J0krj0mK%j5k7k1PK8J8oj1MJ7J1nj7k8l3k0J1L7L4J5PJ3J8J4J1Lj9l9l4lK4K5J2j
$$ y = [256, 223, 182, 145, 121, 103, 88, 86, 109, 148, 177, 186, 190, 202, 221, 237, 245, 248, 244, 233, 215, 192, 172, 170, 194, 229, 247, 240, 224, 214, 211, 208, 208, 218, 236, 258, 285, 308, 315, 297, 262, 226, 202, 199, 217, 241, 249, 239, 227, 226, 224, 206, 177, 151, 133, 120, 114, 120, 131, 131, 116, 102, 103, 120, 148, 175, 193, 189, 159, 112, 66, 39, 39, 57, 70, 63, 43, 29, 37, 63, 95, 126, 155, 182, 199, 199, 180, 155, 143, 156, 189, 217, 220, 198, 178, 184, 214, 234, 218, 181, 157, 160, 177, 200, 235, 275, 296, 289, 280, 290, 296, 260, 186, 119, 95, 102, 118, 133, 142, 139, 121, 105, 106, 123, 150, 184, 215, 219, 184, 136, 114, 125, 147, 157, 157, 159, 172, 198, 237, 276, 293, 269, 206, 124, 47, -10, -42, -51, -48, -39, -20, 18, 70, 111, 126, 122, 120, 127, 141, 157, 175, 188, 181, 157, 139, 148, 174, 197, 205, 204, 198, 185, 169, 157, 147, 135, 118, 101, 86, 68, 43, 16, -8, -30, -40, -23, 17, 56, 66, 46, 21, 16, 39, 74, 94, 83, 56, 43, 54, 72, 78, 78, 81, 90, 95, 97, 100, 102, 96, 88, 88, 94, 93, 78, 56, 31, 5, -9, 0, 30, 60, 76, 90, 118, 152, 168, 157, 133, 120, 128, 153, 189, 232, 272, 298, 303, 288, 256, 214, 173, 137, 115, 110, 122, 144, 162, 161, 146, 132, 137, 154, 161, 149, 130, 127, 146, 173, 194, 207, 217, 228, 240, 255, 269, 273, 259, 232, 206, 189, 176, 163, 150, 145, 146, 141, 124, 108, 111, 138, 166, 180, 181, 186, 197, 207, 205, 196, 186, 182, 184, 184, 169, 142, 121, 128, 156, 174, 168, 157, 161, 178, 189, 184, 167, 139, 106, 86, 97, 134, 168, 183, 190, 203, 221, 235, 246, 249, 230, 191, 157, 154, 178, 203, 215, 214]
8495B14j1k8m3m7m4l4j0K1M4L3NrkJ1K1L2M2L6J8LjkKK1L9K8j0l4j4K4L6K2OLok6l8l2j7j4
8478B39j8j7j1oqr%J6L0K9J9J1RJk0m1l6oJ8K5J9J5J4Nqk1k8k2lK0L3K7J0j0k7l7l6k5j3k
8461A36RJ7J4jj1pRJ9J7OjjMNmk1k9k4j1jNPOJrk0k1jL5O2N1Nm0n4l9k0j1j5k8l1j3J8L7K9
8442G9J4J1J1NjMMj6l6k8JJ3mj8%K4K5ROK3L4K4jj7k0j2%J9L7M0K1pk4l0l2l4k0QL1K8J4Q
8423A93MnqOK7K3nk6k1pkkQJ9J8QKknjKpl2m9l5lK0K2J8J9J7Onj4j4j3qqj7k7k0jJ6J9J6J9
8404A45K2J2j1l2l2j1K1M4N0M3L4K0pm0n5l4OL7M2L6L2K8J7jk0l4m5n2n4n0m3k9j1joj7j0
8387fJ6M0K9%j5JK9L7K4MnjPKk4m8m1JM1M8K6Npj3j0JJ4J2JMK5L6J6k2m6l9j5KNNJ5L0L8K7
8368B49J2KklQK7L7K2j0l4l7k5lK6L7J5k8n0l8k0j8k7k3rOJ3K3L0K8J6Jj2k2k3j5j4k3k8j5
$$ y = [214, 203, 175, 132, 85, 41, 7, -3, 18, 62, 95, 100, 91, 89, 100, 121, 153, 195, 231, 249, 252, 251, 249, 251, 272, 311, 339, 329, 295, 281, 305, 341, 363, 369, 372, 366, 340, 302, 270, 253, 239, 221, 204, 193, 187, 179, 170, 170, 186, 216, 245, 264, 275, 284, 285, 265, 224, 188, 182, 200, 225, 244, 259, 273, 278, 270, 249, 221, 199, 196, 216, 249, 276, 286, 276, 249, 212, 176, 151, 138, 136, 145, 162, 176, 175, 164, 157, 166, 185, 202, 208, 207, 206, 210, 215, 211, 190, 161, 137, 126, 125, 130, 137, 143, 144, 135, 115, 94, 93, 128, 190, 241, 246, 206, 152, 113, 93, 82, 67, 39, 8, -5, 13, 50, 79, 93, 104, 115, 120, 119, 123, 127, 111, 75, 47, 48, 61, 57, 39, 39, 63, 88, 97, 103, 126, 160, 184, 183, 166, 146, 134, 134, 153, 190, 230, 251, 244, 220, 190, 158, 124, 104, 112, 143, 171, 185, 193, 197, 192, 184, 190, 217, 240, 235, 209, 188, 181, 179, 177, 185, 204, 222, 230, 232, 230, 225, 224, 226, 219, 187, 138, 103, 100, 120, 142, 160, 179, 196, 202, 197, 183, 169, 156, 148, 140, 123, 96, 76, 75, 91, 110, 126, 145, 167, 179, 168, 136, 104, 93, 114, 158, 208, 251, 285, 305, 298, 258, 203, 169, 175, 212, 254, 290, 322, 350, 367, 366, 346, 312, 267, 215, 161, 111, 68, 39, 28, 27, 21, 4, -6, 10, 50, 79, 79, 64, 65, 94, 131, 155, 159, 154, 153, 160, 162, 138, 90, 49, 50, 91, 139, 165, 170, 163, 150, 140, 141, 155, 167, 168, 172, 197, 233, 249, 227, 181, 142, 127, 129, 134, 139, 154, 184, 222, 249, 261, 263, 261, 258, 266, 293, 330, 352, 342, 308, 271, 246, 243, 269, 306, 321, 293, 243, 205, 185, 167, 140, 117, 108, 114, 127, 150, 180, 208, 224, 225, 213, 191, 168, 153, 139, 116, 88, 73]
8351G3RJ9J4J2J6J4jj4qQJ2KnlNPkj2j7j3opj7k4j7lLpj3lJ9L2L3L2L6L5J9j2l7m1l0j1QK1
8332A26K0Mk0l4l2j4PK2K8K9K7K5K1J7J1JlNJ5J1j7m4m1rK2L0K5J6%k4l7k3%Mpj3jQO%PJ1
8314A79Jj5j8j1j0j5qJ4L0K9J5Lpj6k3k1j7k8m2m0j5J1K1K7M0N1M0Nk1j6J0L0L1J7Lqj2j2
8298B02j2j3j4j0jRJ9K9L2K5Ok0m3n1m0k2rpj2j7j3KJ6J7Jj4qJ3K3J8J2J1OmlJ7L8L4J1j1
8280B17k1k3k3k3l1l8k9JL1L8L4L9M4K2j8l6j3K0L2K2Nj7m0l7kL2L3Mk2l4m4n5n0k3MJ6K0
8264C5K3K6K4K1J9J8K2L2L6K4kk3k5j1NJ5J2lk5l4k1NK6L0J9%j3j7j9k5l6l6j7RK7K9K2J6
8248A88J2J0QLqk8m5m4k3LJ7J7J9K9M1L9J2k6m7l6mJ4%k7k9oJ6J2pj6j7j7j9rQK4L3L5L2J8
8231A82Jrj0qmQK3K6J4joj5l2l8j8J5K8J1j7l0k5j3%J0J8K5K8K4Rqj2o%qj6j2KJ2J2J1J2J3
$$ y = [73, 82, 101, 115, 127, 143, 157, 156, 142, 134, 142, 154, 156, 151, 148, 153, 160, 158, 146, 129, 116, 110, 103, 86, 62, 45, 42, 45, 38, 25, 22, 41, 73, 106, 138, 174, 209, 228, 216, 179, 138, 108, 97, 105, 126, 146, 150, 130, 96, 64, 50, 57, 79, 107, 136, 163, 188, 209, 226, 237, 238, 235, 240, 255, 266, 249, 205, 164, 155, 177, 207, 232, 248, 248, 224, 187, 164, 164, 168, 161, 148, 147, 155, 161, 161, 168, 179, 180, 165, 147, 136, 126, 111, 103, 117, 147, 176, 191, 194, 187, 171, 148, 127, 110, 82, 40, 0, -15, -4, 17, 44, 84, 135, 175, 180, 159, 143, 153, 183, 214, 231, 234, 226, 214, 202, 190, 177, 163, 153, 152, 161, 180, 209, 241, 266, 272, 252, 209, 158, 118, 96, 87, 80, 68, 51, 38, 40, 56, 73, 74, 60, 52, 65, 88, 106, 118, 129, 135, 131, 128, 145, 183, 217, 228, 217, 196, 173, 150, 127, 96, 58, 29, 30, 61, 99, 133, 172, 216, 238, 220, 184, 171, 191, 223, 245, 250, 233, 193, 156, 154, 186, 219, 223, 201, 167, 123, 68, 18, -5, -1, 15, 35, 58, 84, 108, 129, 148, 166, 188, 220, 256, 280, 278, 255, 230, 219, 224, 239, 251, 248, 223, 189, 168, 173, 199, 229, 248, 248, 235, 218, 199, 174, 138, 102, 85, 94, 121, 150, 172, 188, 200, 210, 218, 221, 213, 185, 140, 96, 73, 76, 93, 110, 129, 158, 199, 238, 250, 224, 177, 141, 137, 151, 151, 124, 95, 89, 105, 117, 110, 94, 77, 60, 41, 32, 40, 64, 97, 132, 164, 182, 183, 174, 164, 156, 152, 160, 183, 209, 223, 222, 216, 201, 169, 131, 113, 128, 156, 167, 150, 120, 95, 82, 82, 92, 110, 135, 163, 187, 196, 188, 176, 170, 170, 162, 146, 134, 136, 148, 160, 171, 183, 196]
8212A96Rlk0l1k8oK2L5K4kk8l4k4lJ1J8K3K6J9jj9k7k7k4k0j4j5k5l0kM1P2O0K5%lJmj1pK
8195A76RO%kkqj8k0j0PJ3N%QK0J4ok3k4j7rMJ5J4%rqnj6l1k7%K6L2K8K6K3Nk3l7k6jJ0kj2
8175A05lK6N6O5M8J4j2j4LQoj6lJ5J1j3k1jK1K2Qrk5l8l4j1J2J4OLKjpprk0k2mK2K5Mj4j4
8156A86qlQK6K8Nk3l3l1k9k5j3LJ4J5Ppk2k6j1OJ0KkJMjonLJ5K5L0K3Qj0k2k5k1j4n%%JJ2
8137I0K8M0L7K2J4J2Qmj6k4k7k9j8OJ9Oj7k0onk0k4pPQJ4L2L9J6j2j8qpj1kJ4J1pj7j5j4j5
8119H0nJ4J8kj9j4NJ6J8J1ok4k2JK6L2K3J6Rkj2j2%RJ2J6K1K1J4kj2j0MJ8K3J4rl8o0n5k1
8101I6J3J0k0l8j4L1N9N0J8j6l8m1k3MK8M2M4L8L1K7K2Nj1j5qkmprj6k2j7LK3L0K4Rqj6pP
8083B82%k3k8rPkj0kNj3l6l6j6kJ1L2M3J3k9l1NK6Kk7k2KPjmlj5k7k5j0olJ7M5M7K1nolj8
$$ y = [196, 205, 202, 182, 151, 123, 117, 139, 174, 198, 196, 168, 134, 110, 107, 118, 136, 159, 185, 204, 203, 184, 157, 130, 106, 86, 72, 57, 32, 2, 0, 41, 113, 173, 198, 198, 195, 196, 192, 181, 174, 176, 185, 191, 191, 189, 187, 179, 161, 141, 131, 138, 151, 156, 156, 164, 184, 198, 192, 169, 145, 128, 119, 123, 138, 152, 152, 143, 135, 130, 114, 83, 56, 56, 82, 114, 142, 168, 191, 196, 173, 136, 110, 109, 119, 117, 105, 102, 128, 184, 249, 297, 311, 299, 285, 288, 296, 290, 274, 271, 286, 297, 284, 263, 262, 283, 305, 313, 304, 279, 241, 207, 196, 208, 222, 228, 231, 233, 232, 225, 218, 209, 189, 167, 163, 185, 210, 214, 200, 186, 178, 175, 183, 209, 237, 242, 219, 186, 155, 126, 101, 88, 91, 105, 120, 127, 120, 98, 72, 61, 67, 77, 79, 77, 78, 82, 81, 75, 70, 73, 88, 113, 143, 166, 174, 164, 142, 117, 96, 82, 77, 77, 77, 78, 90, 118, 158, 195, 217, 231, 243, 251, 247, 231, 207, 180, 151, 133, 139, 158, 164, 147, 127, 121, 116, 96, 72, 65, 72, 80, 94, 126, 165, 181, 169, 151, 143, 136, 125, 123, 137, 148, 141, 124, 109, 95, 80, 75, 89, 107, 105, 86, 72, 77, 93, 111, 122, 116, 92, 70, 71, 97, 129, 152, 168, 177, 175, 163, 151, 151, 160, 172, 188, 209, 230, 244, 242, 230, 220, 224, 242, 265, 279, 270, 232, 172, 117, 96, 109, 119, 99, 61, 47, 78, 137, 187, 205, 189, 151, 110, 87, 91, 119, 161, 205, 243, 274, 301, 323, 328, 317, 302, 294, 292, 288, 281, 272, 256, 234, 217, 220, 243, 273, 297, 306, 298, 282, 275, 282, 282, 259, 231, 222, 229, 227, 217, 215, 220, 207, 171, 135, 119, 117, 128, 160, 203, 216, 187, 156, 161, 187, 189, 162, 140, 142, 149, 148, 144, 141, 126, 99, 74, 64, 58, 55, 72, 117, 164, 185, 180, 174, 171, 153]
8064A53l9l5oJ8J4mnJ7L5K6Jj3kJ5K3J9QKLPLj3k3j3OMj9l6k2MRlj1jQLj2k4k3lK2L5K8J1
8045A67jj1j8j9oOKj5k0j0j%PK8M0L4J8J0Plj8k1oJ1J1jj3j4j1j1j2qQK1K2J4MKNJ4K5K6R
8026B72j8l0k3j3j6k7l4l4l3k8qJ6K7K2K2M0O2O1L3kk2k2j6j4j7j7j2KJ6K2J4KmQK8L8K9L
8010C27k2l7l4j3OPj4k8j6J0K4J6MKPNmj6k5k6rJ8L5K7Oommj1k0k3k1j3QL8N4L8Kk2j8lK%
7991B47QK2K0nk9k9oJ2J0lqKJ9L4L4J6rk6k6k4k9l5k8j2%JOJ2Mj9l4k2jLj1j8oNjj6l0k9j2
7973a3J8N1O4M6J2j9k9k1kJ3K0J8J5RjqnKqk7k5QM0L9J8J0J8J3j1k6j3Kj0l5l7lL4M4K4nk9
7955A91m0l4j1J5K9K4Ppqnqj7k0rQJ6RlpkNOJnj3k0k1j0RK5K9K5J6PmpJJ2J3jj3rPJ8J6Pp
7934B15k1l0k1JK2K4QnqmJQK1K2Qj1j0OJ0j0l3k4JJ3lj3LK5K8Oj2j1oj0j6oJ4K9K7J3Kjjn
$$ y = [153, 114, 79, 73, 91, 105, 101, 96, 113, 148, 174, 175, 162, 160, 175, 198, 217, 225, 227, 230, 237, 240, 227, 204, 191, 197, 201, 182, 146, 124, 128, 137, 134, 123, 122, 130, 133, 121, 97, 74, 71, 93, 128, 156, 167, 166, 155, 137, 118, 112, 118, 120, 105, 85, 75, 74, 74, 81, 109, 149, 183, 201, 211, 218, 215, 197, 176, 170, 181, 192, 191, 178, 164, 153, 142, 130, 122, 130, 151, 173, 187, 191, 193, 198, 212, 237, 263, 272, 254, 224, 201, 188, 172, 145, 111, 77, 44, 16, 8, 24, 51, 73, 95, 135, 197, 258, 291, 289, 267, 245, 229, 215, 198, 181, 169, 171, 187, 209, 223, 225, 221, 229, 257, 295, 324, 327, 305, 268, 234, 221, 227, 234, 220, 192, 176, 186, 210, 226, 230, 232, 239, 244, 240, 224, 199, 173, 164, 182, 217, 244, 250, 244, 240, 236, 225, 205, 182, 161, 148, 156, 194, 248, 286, 288, 266, 248, 245, 247, 247, 255, 277, 297, 292, 263, 234, 228, 240, 250, 247, 239, 241, 260, 294, 328, 344, 335, 309, 283, 259, 230, 195, 167, 155, 155, 156, 162, 174, 178, 159, 125, 103, 102, 105, 94, 76, 70, 75, 74, 58, 28, -1, -13, 5, 56, 120, 166, 178, 159, 130, 109, 107, 120, 140, 158, 173, 182, 181, 173, 168, 170, 162, 135, 110, 118, 158, 197, 215, 225, 243, 256, 245, 219, 206, 208, 198, 163, 126, 123, 157, 201, 225, 220, 191, 151, 117, 106, 121, 150, 174, 181, 174, 166, 161, 153, 136, 116, 107, 115, 131, 140, 137, 130, 128, 133, 139, 140, 135, 122, 102, 81, 71, 80, 105, 134, 159, 175, 182, 178, 171, 172, 184, 197, 196, 183, 174, 181, 199, 215, 222, 215, 194, 164, 143, 144, 166, 190, 198, 193, 185, 181, 182, 190, 211, 233, 241, 230, 220, 226, 236, 226, 193, 169, 170, 183, 180, 167, 170, 195, 223, 229, 217, 206, 200, 190, 174, 168, 182, 211, 238, 251, 253, 252, 251, 246]
7915B46j0j3j1lMKj2l4m2k8ML6M7K9ol1k3OK8K0lj3%K4L7K7Kk4l5k9j7oNJ8K0Nj1j1%Kk%J3
7897B11J8J2KL%j6l6l9j8RK7K4Qj1k4k3j1RK1J2qj4OK2Pk5l2mK2K4K0L3M0K0prJ0J0j5l0j2
7879B36J7K6J3kn%J1J7J2kj0mNJj4k8l3k6rJ0K1J6LonMJ8L1L8L4J5j2l7m7m0k6j9j7oJ4L1
7861B25K8Oj0pRJ5J0J3L4N0L4nl4m2m6n0l6ML6L1Kj5pPJ7J8Nk0l4j5K0L0J4jjj1l1l2jK9K4
7843B63lj3lRJ2J3J8J6QLQJ6K2K2J5Nmj0k2l1k7j3oj8l1l0j9nJ0K4K2Lj3rKNKQJ3Kk1l6l5
7825A72k3lK2L7L0J5K1L4L6K3K4L8M4K7J2J4J7Mj3j6rnlQJ9J8J2PNkj5k3j9j6j9k5k2pPMp
7807D23lJ7L1J8qj4%J5J9J9K2K1J9K6M9P3P8N6J9oJK6L8K8J1RJ9L8O6R9J12J06R9J09J22J37
7791A894J75K47L17L68M37N53O94Q60J116J523K075K787L688M513M515K996J66k735m418m568
$$ y = [246, 236, 223, 212, 209, 213, 215, 203, 169, 127, 99, 103, 139, 186, 215, 209, 178, 155, 161, 189, 209, 206, 193, 193, 217, 254, 281, 283, 259, 224, 195, 178, 172, 177, 195, 215, 220, 209, 198, 198, 200, 198, 198, 211, 229, 241, 243, 246, 246, 230, 194, 155, 137, 146, 173, 197, 205, 194, 170, 147, 136, 145, 166, 178, 170, 156, 162, 184, 191, 166, 134, 130, 152, 176, 196, 229, 269, 289, 282, 273, 283, 293, 278, 248, 236, 253, 279, 292, 290, 285, 285, 296, 313, 325, 323, 313, 309, 314, 315, 301, 273, 240, 214, 205, 215, 236, 252, 255, 249, 244, 248, 266, 297, 335, 369, 384, 372, 335, 288, 248, 222, 203, 186, 180, 194, 225, 253, 259, 249, 242, 251, 266, 276, 289, 323, 373, 407, 402, 368, 326, 280, 230, 194, 198, 234, 265, 267, 252, 245, 252, 269, 287, 292, 272, 238, 223, 243, 273, 287, 286, 285, 274, 243, 211, 210, 239, 263, 260, 247, 244, 253, 265, 278, 296, 312, 320, 323, 331, 347, 369, 391, 406, 411, 407, 397, 375, 344, 317, 304, 298, 280, 249, 219, 200, 195, 205, 229, 251, 254, 241, 232, 234, 239, 241, 249, 262, 264, 243, 207, 172, 149, 146, 168, 205, 235, 250, 271, 305, 341, 364, 388, 426, 470, 497, 509, 523, 540, 544, 531, 515, 506, 501, 498, 506, 525, 543, 555, 562, 567, 565, 550, 527, 508, 492, 473, 448, 426, 419, 426, 430, 423, 420, 437, 468, 486, 478, 464, 464, 479, 498, 517, 539, 560, 579, 605, 654, 727, 805, 861, 880, 874, 875, 901, 939, 967, 978, 987, 1006, 1044, 1110, 1209, 1321, 1427, 1526, 1635, 1757, 1894, 2069, 2316, 2633, 3001, 3438, 3991, 4685, 5545, 6661, 8184, 10259, 13046, 16734, 21247, 25762, 28758, 28924, 26189, 21771, 17203]
7783A7203l819k921k181j609j188r11p10n35m03l29k73k06j56j42j24q2m9m8m3qK6K4mk8n4
7772A430q1q4o3n1n9n1j1K3K0JkK%NK4L4K0J5L5N4N3N6Q0R6Q2O9R1J35J73K15K63K95L21L99
7757C589N47P30R45J267J735K335L112M067M772M360K287q39l542m731m483l611k744k038
7749G758j475j079q42o79n35m27l60k90k06j38j02o7l8l5n9p1o4o3o7n4k8j4j7j8j7k3k8j2
7737I50K0L7L9M1M1K3krjkj7k0j0RM1R2J32J34J24J40J65J65J64K08K78L26L65M60O13P86
7724E292J003J345J836K475L313M242M690L824J413j650l943m701m241l355k541j890j381
7717E731j024p89o08m59l74l36k88k14j51j18r8p7o3o5o8o4o5p1p3o4m9l4j7jLll%pl0m8n0
7703D23l6k5j9rKPmk7m4m6l8k9k3j0RK5L1L2L0K2J2NQQ%qnjrk1k1mQKj5k4j7lPONJ2K5K7J5
$$ y = [17203, 13384, 10463, 8282, 6673, 5485, 4574, 3864, 3329, 2926, 2597, 2324, 2118, 1962, 1820, 1696, 1614, 1565, 1517, 1474, 1466, 1492, 1516, 1512, 1484, 1430, 1349, 1265, 1202, 1151, 1092, 1041, 1030, 1053, 1073, 1074, 1072, 1074, 1074, 1079, 1103, 1137, 1157, 1172, 1207, 1261, 1314, 1370, 1450, 1546, 1628, 1697, 1788, 1923, 2096, 2311, 2574, 2869, 3190, 3589, 4136, 4866, 5811, 7078, 8813, 11148, 14260, 18327, 23099, 27459, 29746, 28907, 25365, 20634, 16151, 12540, 9796, 7758, 6283, 5204, 4362, 3683, 3148, 2721, 2361, 2071, 1865, 1727, 1625, 1558, 1520, 1485, 1426, 1355, 1291, 1228, 1161, 1107, 1079, 1065, 1048, 1030, 1013, 990, 962, 950, 970, 1007, 1046, 1087, 1128, 1151, 1149, 1140, 1139, 1137, 1120, 1100, 1090, 1099, 1140, 1232, 1364, 1498, 1622, 1762, 1927, 2092, 2256, 2464, 2742, 3068, 3433, 3893, 4506, 5292, 6295, 7640, 9476, 11951, 15264, 19506, 24196, 28020, 29433, 27783, 23840, 19139, 14898, 11543, 9002, 7112, 5731, 4707, 3918, 3310, 2851, 2477, 2141, 1853, 1639, 1488, 1370, 1272, 1195, 1132, 1067, 999, 935, 870, 799, 726, 662, 613, 579, 562, 561, 564, 561, 558, 558, 551, 521, 473, 423, 387, 362, 343, 334, 336, 343, 339, 312, 268, 222, 184, 155, 132, 122, 131, 156, 187, 219, 249, 271, 283, 288, 296, 304, 304, 296, 291, 290, 281, 260, 239, 235, 243, 245, 230, 206, 189, 186, 193, 199, 204, 216, 241, 268, 283]
7683B83kpkMJpj6k0j7j1rpLJ6K0Mj3j1PJ8J7J2J3J6K0K6K7J4kqJQLj1k1k8l3l5k9j3LJ0Lj
7664B26OK1K5Pj8l1l0k9l4l5k4mJ8L8M2K5NOK1K7J1nkO%k3m1l8j7RK0J6RJ7L8M5K0k6n7n7
7647A87l0OK4J4j3k7j6QJ9K2K2J6kk6l0rJ4K1J3KnkQJ3Kj3j1PJ5%j5pK2L9L2J2j3l7m8l2%
7629A82J2j0l2k2J3L0J7ljPok9l3qJ5J2nj3pKJ0J7J7Lj8k8j7KJ5J9J6J5J2Lj4l1l3j6JM%%
7611I8LKmlQJ2NOK0L2K8J8J9J8lm1n6l5PL3L1J1j1j8j3qj1k0k2qJ1K4K2J5PjmjMNoj8k2j7
7592A17nQK4K9J4j8l3qL6N7M3J4mj3k6l3k3qnj3j2kM%klj0k3k9k2j1pmJ1L3M3L4J3rk2j8k
7574A15J1Pj3l3l3j7LJ1Kj5k3j2QK6L3L2L1L0L0K9K5J1j1l3m3l9k8j7j3j4j5pJ1K8L0J5mj2
7557A06%K2L6L0J1pj4rjLnj9k8k3pJlnJPLj1rJ2L0K4mk8l6l0j9LK5L5K8J4NLJNJ9L3L3K6K1
$$ y = [283, 281, 274, 272, 276, 277, 270, 254, 234, 217, 206, 197, 190, 193, 209, 229, 233, 220, 209, 216, 234, 251, 263, 276, 292, 312, 338, 365, 379, 377, 369, 370, 378, 381, 370, 349, 321, 288, 253, 224, 211, 214, 224, 227, 226, 232, 253, 278, 285, 267, 236, 206, 177, 143, 108, 84, 80, 98, 136, 178, 203, 208, 214, 235, 262, 273, 268, 266, 272, 272, 249, 208, 170, 153, 162, 182, 198, 207, 224, 262, 307, 327, 301, 244, 187, 157, 163, 187, 201, 188, 161, 145, 153, 172, 194, 216, 232, 230, 204, 174, 165, 179, 200, 213, 215, 210, 208, 216, 229, 231, 218, 207, 214, 229, 229, 214, 207, 229, 268, 300, 312, 299, 262, 214, 182, 182, 194, 184, 152, 130, 143, 173, 190, 187, 186, 193, 187, 158, 125, 117, 132, 144, 139, 126, 119, 121, 131, 148, 165, 168, 150, 122, 105, 107, 122, 141, 157, 172, 184, 187, 173, 142, 109, 93, 94, 98, 98, 98, 101, 103, 99, 96, 104, 116, 121, 127, 147, 179, 207, 225, 244, 262, 259, 218, 162, 127, 134, 167, 198, 209, 198, 180, 167, 159, 148, 128, 106, 98, 109, 133, 155, 170, 177, 176, 172, 171, 175, 180, 174, 156, 134, 117, 112, 120, 144, 173, 187, 169, 136, 128, 164, 221, 264, 278, 274, 261, 235, 202, 179, 171, 166, 153, 141, 139, 143, 143, 141, 138, 128, 105, 76, 54, 43, 36, 32, 43, 76, 119, 153, 166, 157, 135, 117, 115, 126, 133, 120, 87, 54, 37, 40, 51, 53, 38, 15, 3, 11, 37, 70, 102, 133, 163, 193, 222, 247, 258, 247, 214, 171, 132, 104, 87, 74, 60, 45, 38, 49, 77, 107, 122, 118, 106, 106, 128, 164, 194, 205, 198, 184, 175, 174, 177, 172, 153, 125, 102, 95, 96, 93, 88, 89, 96, 99, 88, 79, 91, 121, 145, 141, 113, 77, 47, 28, 31, 56, 91, 119, 133, 138, 141, 142, 147, 166, 199, 232, 258, 279]
7538B79K3K3J6Nrl2n5o4n0l4k9l0l0k0j1JK0M4N5M2J4op%%j2k3j8jK1L9M6L6J2j1k2k5k6j9
7521A42JJ4%l1m6k8MK7M0M7M1J8oj1%J2J9K2J4ql0l6k8j9j4oMRQPJ1J4J3Npk1k6j7jJ4K2K7
7503B00J8j4n1o3m4j4NOmj8j6QL3L4Rj2j1qj0pJ6M1M4K6J0%oj0rrj9l2k7j6j4k0j1J6M2N2
7485A15N3N5L9Ll6m5k8j4j9l7m2k0K2N7N7K4j1k4j8j0mKNLjNJ3Oj7l3k9qJ1K5M0M8M4K6Kk2
7468B37m6n4l8pJ5J4nk6l2j8J1L9M4K8Lj0j6j7j0J2L2L0Oj2rNJ0Lkoj5k2j7%J1P%moj4k3j8
7450H0KJ5Pj3k0qJ1J4NllJLPJ5J8J3NLPROPRPjomqk2l7l7k0nmj6k4j5KJ7J5JmJ6L9L7Pk2k4
7429H2oOJnlK%lMJ9K9K6K3K6L2K7Pj2k1j8j1KJ3J8Rmj0pj2l0m2l0MK8K5Jj5j0KMnj6j8j0M
7409A06J0NopkM%j1j5j4j2j0lJ2K8M0M6L9J5j1k1j1lj3k9l2j6JOMKLJ2L3N2M8K0pmJ5J7pk8
$$ y = [279, 302, 325, 341, 346, 337, 305, 250, 186, 136, 102, 73, 43, 13, -7, -18, -17, 3, 47, 102, 144, 158, 152, 145, 145, 145, 133, 110, 92, 91, 112, 151, 197, 233, 245, 234, 212, 187, 161, 142, 143, 157, 157, 126, 80, 52, 56, 83, 123, 170, 211, 229, 223, 212, 212, 224, 243, 265, 279, 271, 241, 205, 177, 158, 144, 138, 142, 151, 159, 166, 177, 191, 204, 209, 202, 181, 155, 138, 137, 151, 173, 200, 218, 204, 153, 90, 46, 32, 37, 43, 39, 21, 5, 13, 46, 80, 89, 77, 66, 58, 48, 41, 57, 98, 142, 168, 178, 178, 172, 162, 153, 144, 125, 93, 66, 50, 36, 16, 5, 21, 63, 115, 168, 223, 262, 265, 229, 184, 156, 142, 123, 86, 44, 24, 46, 103, 160, 184, 173, 149, 131, 121, 117, 119, 124, 127, 126, 131, 144, 150, 133, 100, 71, 63, 74, 99, 139, 187, 231, 257, 259, 237, 191, 137, 99, 92, 107, 121, 116, 90, 58, 40, 51, 90, 134, 162, 165, 155, 139, 122, 112, 124, 156, 186, 192, 180, 171, 176, 186, 189, 187, 181, 166, 144, 127, 127, 138, 145, 145, 141, 135, 121, 98, 80, 82, 97, 104, 91, 71, 63, 74, 88, 93, 90, 87, 88, 91, 98, 113, 131, 144, 149, 152, 159, 168, 174, 181, 190, 197, 196, 190, 186, 178, 156, 119, 82, 62, 57, 53, 37, 13, -2, 0, 17, 32, 33, 29, 45, 84, 121, 128, 106, 82, 76, 82, 83, 78, 75, 77, 77, 74, 78, 97, 126, 152, 175, 201, 233, 260, 267, 255, 234, 216, 205, 207, 220, 238, 247, 243, 233, 226, 214, 184, 142, 112, 116, 144, 169, 170, 155, 145, 147, 151, 146, 130, 112, 102, 106, 116, 121, 115, 108, 106, 110, 110, 99, 84, 70, 58, 48, 45, 57, 85, 125, 171, 210, 225, 214, 193, 182, 179, 166, 137, 105, 89, 90, 96, 100, 102, 105, 117, 150, 202, 250, 270, 263, 259, 274, 291, 284, 256]
7390B56k4oMKJLNJOJ2J2Nllpj2j3rqj7k0rNKj2j5lN%qplk%PJ4J3Lrk2l4l5k3j1njJ3K8K4J
7369A01k6l7k5KK8L8K6NlOJ9K0J4J1J5J9J1qk7k6lK6L7K4NJQPmj7k5l4l8k6J3N7P1M1ml3l5
7351B34k7j7pjpj6j1Jkk0l1j5J6L3L0K2J1j0k8k4kJ3J2OLlj5k2j5KJ8K9K1ql9m6j8J6L5M2
7334A60M1L1J1LJ5K3Lk7m0l2k7k9j9OK2J6%j4j9k1j6njkMK0L2L0J9J3J0NnoKJ3J5Nj3k6l0
7316A67l0k7k1nJ8L1K7J2mj9k9l0j6ljrj1jJ5K4K5J8Poj6j5LK9M0K5lj6j2qj3j6rJNJ0J6J4
7298A67Jj6j9j0nqj1mQJ8K1J3kmJ1L2L2J0j3j9j4j3k3l0k6j1J%ppknj5j6MK6K6RJPJ5J9K0
7279A61J8Oj6l3l5k7j4RL4L9J6j4k7k6k2k0pJ7M1N1M7K8Oj2j9k4k5j0J8L7L0Nj4j7j9k6l0
7263A26k2lJ4K1J0j7l9l8j5J1K3K4K2J6J0RJ3J2MjKLnj3qJkj0kJ9L3K3MjKlj4j8j1j0k4m2
$$ y = [256, 232, 226, 230, 232, 233, 236, 241, 242, 248, 260, 272, 277, 274, 271, 264, 252, 239, 230, 222, 205, 185, 176, 181, 183, 171, 156, 153, 158, 158, 150, 143, 140, 138, 138, 145, 159, 172, 175, 166, 144, 110, 75, 52, 41, 36, 35, 48, 76, 100, 101, 75, 38, 13, 15, 43, 81, 107, 112, 109, 115, 134, 154, 168, 179, 194, 213, 224, 216, 189, 163, 160, 186, 223, 247, 252, 253, 261, 268, 264, 247, 222, 188, 150, 124, 137, 194, 265, 306, 302, 269, 234, 207, 190, 183, 182, 175, 159, 148, 149, 147, 127, 96, 81, 97, 130, 160, 182, 193, 183, 155, 131, 129, 142, 154, 160, 163, 160, 145, 123, 108, 110, 128, 157, 178, 170, 131, 85, 67, 83, 118, 160, 201, 232, 243, 246, 261, 284, 287, 260, 220, 188, 161, 132, 113, 119, 141, 157, 157, 143, 124, 103, 87, 82, 81, 79, 83, 103, 135, 165, 184, 197, 207, 212, 207, 201, 203, 216, 231, 236, 223, 197, 167, 137, 110, 89, 84, 102, 133, 160, 172, 168, 149, 120, 90, 74, 71, 70, 61, 50, 49, 64, 88, 113, 131, 138, 132, 116, 101, 104, 133, 173, 198, 195, 179, 167, 159, 146, 130, 121, 122, 127, 137, 153, 167, 168, 152, 133, 123, 118, 110, 99, 95, 103, 121, 142, 155, 153, 149, 160, 192, 224, 234, 221, 202, 188, 175, 152, 122, 96, 85, 86, 86, 79, 72, 70, 65, 50, 34, 38, 64, 90, 99, 100, 107, 122, 141, 161, 179, 185, 169, 136, 101, 74, 60, 69, 103, 142, 158, 144, 117, 91, 69, 49, 42, 59, 100, 151, 198, 226, 232, 220, 201, 177, 152, 142, 160, 197, 227, 232, 218, 201, 182, 156, 126, 104, 101, 115, 136, 146, 129, 90, 52, 37, 48, 71, 95, 117, 133, 143, 152, 165, 177, 181, 180, 182, 185, 180, 167, 159, 160, 158, 148, 146, 165, 198, 221, 225, 224, 226, 223, 209, 191, 180, 170, 146, 104]
7245A04m2j9QJ6MqqMJ2J5J8K6K8J7jj3j6j5j4j1kOJ3K1K9K7J0j0j8j1mlJJ3K1Rj7k8qL0N2
7227B36L7Nj8k3k4l1l6k8j2%QJ8K7J8j1l7m0k2mKjnn%QJ1OjNJ5J2j0l3l2oL0N0M5J9j8l9k9
7209H7KK9L3K4J4Qkrrkk%J2L2L2%l8m5k0NP%MK1L1K7J4JpoMJ1Moj1qj5l2m5l8j6QK5L0K2P
7189A83mpj1k5l7k6PL7L5Pj9k1jK0L0K4J1Jjjrk2k6j7mJNJ1J2LroJ2K1J3NOJj7k7j0K0K3o
7170A82k9k2KJ1Kj1j3lJ3L1L5K3Lrj3j4j5j1kMM%JRK2L0K4Lj7j9oMjpkKnj9j4J1K9J9rk2j8
7150A83rrqkMMQJ7K1PrpNPj0k5k3nJ4K6K9K2J1kj1k4l5l4k2j1pkJ4K8K9K1J3Qmk4m6n6n1l0
7131EoLLlPK7M3N1M8L5J3oj5k1k9l3k5j3j0j0MK2J6j2k6rJ8K5J9K5L9M7L6K0ROJ1J9J8jk8
7113C22l8k3KJ5Lk3m2l9j4J1K1J5Pmj4j8rKJonMOjonnrmJ1K4J7Loj1j4j5lJ4K3K0J5J3J1N
$$ y = [104, 62, 43, 51, 67, 71, 63, 55, 59, 71, 86, 104, 130, 158, 175, 174, 161, 145, 130, 116, 105, 103, 109, 122, 143, 172, 199, 209, 199, 181, 170, 166, 163, 164, 177, 198, 207, 190, 162, 154, 184, 236, 273, 278, 260, 237, 213, 182, 146, 118, 106, 106, 114, 132, 159, 177, 166, 129, 89, 67, 63, 65, 64, 59, 54, 54, 62, 73, 79, 78, 83, 98, 110, 100, 67, 35, 29, 59, 109, 154, 173, 155, 116, 87, 89, 118, 151, 175, 189, 197, 195, 186, 177, 175, 173, 173, 185, 217, 249, 249, 211, 166, 146, 151, 158, 158, 162, 183, 214, 241, 255, 256, 249, 243, 247, 258, 262, 256, 245, 237, 222, 190, 145, 107, 91, 99, 124, 154, 176, 183, 179, 172, 161, 136, 99, 73, 80, 117, 152, 159, 140, 119, 118, 138, 168, 192, 203, 204, 203, 202, 193, 171, 145, 128, 124, 125, 130, 141, 153, 156, 147, 141, 153, 174, 187, 192, 198, 199, 182, 155, 145, 165, 188, 182, 153, 131, 133, 144, 146, 135, 122, 119, 132, 163, 198, 221, 224, 215, 202, 188, 173, 162, 160, 164, 168, 168, 169, 178, 200, 230, 254, 257, 240, 221, 215, 219, 218, 211, 209, 211, 206, 187, 173, 184, 213, 232, 223, 201, 183, 174, 165, 157, 155, 159, 163, 171, 188, 209, 216, 207, 200, 205, 212, 202, 177, 154, 149, 163, 189, 218, 240, 251, 249, 238, 214, 179, 145, 123, 112, 105, 103, 117, 145, 174, 195, 208, 216, 212, 188, 142, 86, 35, 5, -1, 2, 5, 2, 9, 36, 79, 130, 178, 213, 226, 220, 205, 184, 155, 122, 97, 84, 74, 64, 68, 90, 106, 94, 68, 59, 77, 102, 121, 146, 185, 232, 268, 288, 297, 303, 314, 333, 351, 350, 322, 284, 261, 263, 278, 281, 258, 216, 177, 163, 174, 195, 210, 217, 213, 199, 181, 172, 174, 175, 169, 164, 168, 174, 173, 167, 162, 157, 148, 144, 155, 179, 196, 199, 193, 182, 168, 153, 150, 164, 187, 207, 222, 235, 246, 251]
7094B51mj3j5oRJ5Kj2rJ2K4J2j2l2m0l8k7j0%pj7j7o%MJ5L4M2K9MnMK0K4Pj8l9m3k4LK1J6
7076A54lk4l5k6jL1M6L7J7JlLK1M3M7K0j7l5k1lok5l6l6l2l1j8PL0L7L1J5j0l0l1j0J5K6J8
7059A66Nj1k0j6MK1J5mpOJ0j2l8l3qRJ0J8L7M5K8KnOPj2l6m2k7rKMOJ2J5Mj0rRK6K2Mj2k1
7040A61k7j9PK9J6k6n1l5j1j4l0j7K9O0M2nk8k2qlQL3N5M7J8knlj4j7nPpl1k9NL0K2jnJnk0
7021A30k2r%oj3oKpk7l5j8PJ5Lj4qK1N2N7M7L4J6j6m8n0j6J8K6J4QJ3J9J7QkokKkj6k2j2j
7002A51kj4k1j6mRK3K9K1Npqj1j3oRK4K9K3J3Jj1k1j9j0JPPQJ4K0J4lj2KK9M2K7Jj9l2l8l4
6984B08j8qj2j3PL1K5j3m8m2j3J0J4J5J9J9J0%llpj1j3j8k5k2j2j0j6j1J3L1J3k7l9rK7K9
6967G8OoKQKplJ6M1N5M7K2LPK0J3k0m5l2kPj6l7l1p%pj1jPkj3j1JJ0J1J3K1J8jk1l1k4j5k
$$ y = [251, 247, 234, 219, 213, 222, 237, 239, 227, 218, 230, 254, 266, 254, 222, 182, 144, 117, 107, 107, 100, 83, 66, 60, 60, 64, 79, 113, 155, 184, 188, 183, 187, 207, 231, 238, 220, 181, 138, 114, 117, 138, 154, 151, 127, 92, 66, 65, 96, 142, 179, 196, 197, 194, 197, 218, 261, 308, 328, 311, 276, 255, 252, 246, 221, 185, 149, 117, 86, 68, 75, 105, 142, 173, 188, 178, 148, 117, 107, 122, 148, 166, 171, 160, 140, 124, 128, 149, 164, 160, 153, 159, 169, 157, 119, 86, 78, 87, 97, 115, 152, 197, 225, 227, 222, 228, 235, 223, 187, 145, 118, 109, 111, 115, 121, 133, 148, 152, 142, 133, 142, 168, 190, 194, 182, 161, 134, 115, 122, 151, 167, 141, 90, 55, 44, 30, 0, -17, 12, 72, 114, 109, 81, 59, 51, 48, 56, 89, 144, 191, 209, 207, 202, 199, 185, 168, 163, 170, 163, 132, 103, 108, 138, 160, 159, 154, 155, 150, 130, 108, 99, 99, 93, 80, 74, 76, 69, 42, 7, -11, -4, 11, 14, 0, -8, 13, 65, 122, 169, 203, 219, 203, 155, 105, 89, 107, 133, 147, 155, 168, 187, 204, 212, 210, 204, 202, 204, 202, 186, 164, 152, 151, 149, 135, 114, 98, 94, 103, 126, 155, 176, 181, 174, 166, 155, 142, 136, 145, 169, 198, 221, 234, 235, 224, 203, 184, 174, 175, 182, 189, 197, 211, 231, 245, 242, 230, 232, 261, 303, 330, 331, 312, 280, 242, 208, 190, 182, 170, 157, 164, 195, 220, 207, 159, 117, 104, 114, 128, 143, 162, 181, 191, 191, 188, 185, 178, 167, 154, 136, 111, 89, 77, 67, 51, 40, 53, 84, 97, 70, 31, 22, 49, 78, 84, 78, 80, 88, 90, 83, 80, 96, 137, 192, 239, 261, 264, 271, 291, 304, 284, 239, 207, 205, 212, 196, 159, 128, 121, 121, 114, 103, 102, 109, 107, 94, 83, 84, 94, 105, 118, 139, 157, 156, 135, 104, 80, 65, 63]
6948F3J2K4K6J9Mj7l4l4j0J8K6J2kpoJK1N0N9L5ql3l5k5j5qjMMPK0L9M6K7nk3j4PJ1nk3k6
6930B04j5nj%jpj1j3rkJ2K8K6Jk6k7qJ1J5J7K4K4Kk2k9j4JMLQJ2Lk1l7k9oQLJJ2K0Oj7k3j1
6910A11looNJ3J0JKJj0j7jK7M1K7Mj2k2k7j9OL0L3J5ok0k2j9j2ooqKK1K9J3j4k5j3NQKOK1
6891A59K4Jl4n1l2MK5J6rk1j4%PQRJ6J8J4Mrj2jK1L6L3J6Jj0k3l4l5k0qj0j5rJ7M5O2N5K3
6873B67j8m4l5lK4L0K2Qpk0k1oJ7L1K9J7Mj0k3k7j1K0M5M1J5qj1nmplQJ0Kj2k5l3l4l1k5k1
6856A46j3%RJ0Jqj5k3j7LK1J5j3l1k1KJ6J5Q%j1j9j2RK9L4K3Kk0k8k3j1PK4L5L1J6QJ2J3k
6838B22k0j8JJ1LqoPJ3QkpkOQLj%PJ2J4J1MkJJ1J0lj0jQol1l3j2jj4l6m2l8l4k6rQJ9K6L6
6817H7M5M6L9K9Qj6k6pJ3Rj7l2k3rMK0L4L0Mj3nJ0Mj7k8j6%QPPLj1l0m5m9l8oL1N2M0Mk9l8
$$ y = [63, 75, 99, 125, 144, 148, 131, 97, 63, 53, 71, 97, 109, 107, 100, 94, 95, 116, 166, 225, 260, 252, 219, 184, 159, 144, 136, 135, 139, 143, 150, 170, 209, 255, 282, 277, 254, 240, 247, 258, 253, 230, 204, 189, 184, 183, 183, 182, 175, 164, 151, 142, 140, 152, 180, 206, 207, 181, 154, 146, 157, 172, 189, 213, 237, 239, 217, 188, 174, 175, 179, 182, 190, 202, 205, 184, 147, 118, 112, 120, 123, 124, 136, 156, 162, 145, 122, 111, 108, 102, 96, 101, 114, 124, 125, 127, 128, 118, 101, 100, 127, 168, 195, 199, 187, 165, 138, 119, 125, 155, 188, 203, 197, 177, 155, 136, 124, 118, 112, 104, 106, 127, 156, 169, 155, 130, 117, 122, 130, 132, 138, 159, 183, 184, 150, 99, 67, 71, 96, 112, 103, 82, 68, 68, 75, 83, 92, 108, 126, 140, 144, 135, 123, 122, 143, 179, 212, 228, 229, 219, 196, 162, 127, 107, 99, 89, 74, 65, 82, 127, 189, 244, 267, 249, 205, 170, 167, 191, 221, 243, 251, 244, 224, 203, 197, 214, 245, 274, 291, 295, 285, 262, 235, 224, 244, 289, 330, 345, 337, 326, 321, 317, 310, 307, 315, 325, 327, 315, 290, 257, 223, 192, 167, 146, 133, 133, 142, 152, 153, 145, 130, 107, 90, 93, 114, 129, 116, 85, 64, 66, 82, 97, 105, 105, 94, 75, 63, 72, 101, 135, 158, 160, 140, 112, 89, 78, 85, 109, 144, 175, 191, 199, 211, 224, 222, 202, 184, 185, 196, 199, 191, 185, 192, 205, 213, 211, 204, 202, 208, 216, 219, 218, 218, 225, 237, 251, 262, 266, 264, 265, 276, 286, 283, 273, 272, 280, 274, 243, 210, 198, 197, 183, 147, 105, 67, 33, 7, -2, 6, 25, 51, 87, 132, 178, 217, 246, 254, 238, 212, 205, 218, 227, 210, 178, 155, 146, 150, 170, 204, 234, 238, 225, 220, 230, 234, 217, 189, 173, 173, 181, 188, 195, 198, 187, 157, 112, 63, 25, 19, 50, 102, 142, 146, 117, 79]
6799G9k7j2nqqkJ0K0K6K7K2J5PMNOPOQJ1J2Oqk1k3j2MJ2J9L3N5O2L9nl7l5j9j2k0k4j9j1j1
6780A76j4q%mj7k4j1QJ2mk4k3KK8L5K5J3QKj1k5k7j7kJ1J9J9J2Koj5j7%L5N6L9ml6l7j9LK7
6762A87M3L6Kl3l7j9ooqLJ3Pj3k9l1j9ML0M4M2K6J4J2J9K3K2J9J5Mj2l1m1l3j2J8M0M6L5J9
6745C93Mj2k7l0k3j7k6m1l5nK5K9J7OJ0J9K0Nk5n0m8k7pnpokJJ2L4M5K2j5k9j5mj7k9j7J5
6728A38L7L2J2pj9k0j4lQJ9K5K4J7J2J0QJnrj4j8j5kMkj5j6qkoj0j0okjnj0j4j0%J5L1M1L9
6709B30K1L%J1K1K3J4jj7k5k0pMLqk2k5k1j3rrj0j4j2KK7M5L6Qj4k0k3l2l3j7mj1k3j4J7L6
6691I7L1J4KKJ0K8M8M6J5k0l1k3j0onj1k2l4l0j2%pk2k5j3JQQJmqrqj2j5j1%Olj5j2RL7M4
6672C9L1Jk3l1k1nJ2K6L2K5Oj2rJ6L3K8J4J0Qpk6k5pQJj1j2mLOJ0J8K4L2K8J1j3j9pJ3J9J5
$$ y = [79, 52, 40, 35, 27, 19, 17, 27, 47, 73, 100, 122, 137, 144, 148, 153, 159, 166, 172, 180, 191, 203, 209, 201, 180, 157, 145, 149, 161, 180, 213, 268, 330, 369, 364, 327, 292, 273, 261, 241, 217, 198, 187, 176, 162, 154, 154, 150, 133, 109, 98, 106, 118, 114, 90, 67, 69, 97, 132, 157, 170, 178, 180, 169, 144, 117, 100, 98, 109, 128, 147, 159, 161, 155, 140, 123, 123, 158, 214, 253, 249, 213, 176, 157, 160, 187, 230, 266, 268, 235, 198, 179, 173, 167, 159, 162, 175, 182, 169, 140, 109, 90, 94, 124, 168, 210, 236, 250, 262, 281, 304, 326, 345, 360, 364, 352, 321, 280, 247, 235, 253, 293, 339, 374, 393, 397, 385, 358, 328, 305, 288, 262, 221, 186, 181, 206, 235, 252, 258, 268, 287, 307, 312, 287, 237, 189, 162, 155, 150, 143, 137, 135, 136, 148, 182, 227, 249, 234, 205, 190, 186, 169, 140, 123, 138, 175, 207, 219, 212, 193, 173, 159, 156, 164, 183, 208, 232, 249, 261, 271, 279, 280, 275, 266, 252, 234, 219, 217, 221, 219, 204, 188, 180, 178, 172, 162, 152, 146, 144, 143, 138, 128, 114, 104, 104, 119, 150, 191, 230, 251, 254, 254, 265, 286, 309, 323, 322, 305, 280, 260, 253, 257, 260, 252, 230, 205, 184, 171, 162, 153, 143, 129, 117, 119, 146, 191, 227, 235, 221, 201, 178, 146, 113, 96, 92, 81, 58, 44, 61, 97, 128, 142, 144, 146, 156, 184, 232, 278, 293, 273, 242, 219, 209, 203, 198, 187, 165, 131, 101, 89, 89, 82, 60, 35, 22, 23, 31, 39, 40, 36, 28, 19, 11, -1, -16, -27, -27, -21, -24, -39, -51, -42, -5, 39, 70, 71, 48, 17, -4, -9, 3, 29, 61, 86, 92, 80, 71, 87, 120, 148, 162, 172, 180, 173, 147, 122, 115, 123, 124, 113, 101, 97, 100, 106, 116, 134, 158, 190, 218, 229, 216, 197, 190, 203, 222, 237]
6654B37Mj2k5k0jJ6J9J9K5K5Oj5k2k2k7l0pL2N3L7J1knj2j7j1mqk1k6k0qJ1K9L5J6j4l2k6
6637A88j1jrk4l1j2K2M7M2J9ok2k9k6j5mjkklqqQL0L3J1j9l2k4jJ9K1PmPL0L4J1j5j7jQJr
6618B02poj3k6l0j7KJ7J8Pj0j9j0J0K6K4J0%morj0j1j4k1k7j8%J5K4L1L8L7K3J0J0J8K3J4
6601C01rl4m6m0k2p%NJ8L0L2K6K0J5Kk2l6j9J6L8L0Nj5k4k9k8j8mL%n%RJ2PkoonopmJ1L2M0
6581B58K2krPK0J6Jj0j9k3j6OJ8%l9o4n9l5j1J0K1J8PKJ0J8J3QNjk0l7k8ML3M1K9J2kj0j2
6563A82j4k1k6k4j3kJ0K6L9M3L2K1J1nk4k6mK1K5Rqj6j8j1RK7L1J7NNOmj4j7j8k6l2k2nLn
6546A67j3qLRKrqJ2L4L0nl9l8mK4K5J1QJ6K3K5K7J8ml0l3k0j4k4k8j1J2J0mmJ6K8K0Jqppq
6527A95oljMJ7L2L0J8PMkj3k0j4jMMkj4k8l3k2j2j4j9j2PJ8Pj2k0j7j1nQJ9K0J3J2K3L2K0
$$ y = [237, 241, 229, 204, 184, 183, 199, 218, 237, 262, 287, 293, 278, 256, 234, 207, 177, 170, 202, 255, 292, 303, 301, 296, 284, 267, 256, 252, 244, 223, 197, 177, 169, 180, 209, 244, 260, 246, 214, 188, 177, 176, 167, 143, 112, 100, 122, 169, 211, 230, 224, 202, 173, 147, 132, 128, 127, 125, 123, 120, 112, 104, 112, 142, 175, 186, 167, 135, 111, 110, 129, 150, 157, 153, 160, 190, 224, 235, 220, 203, 202, 210, 211, 202, 195, 189, 176, 150, 120, 103, 105, 122, 140, 147, 137, 118, 108, 118, 144, 168, 178, 178, 174, 168, 159, 149, 138, 124, 103, 76, 58, 58, 73, 97, 128, 166, 203, 226, 236, 246, 264, 287, 301, 292, 258, 212, 172, 150, 143, 143, 148, 166, 196, 228, 254, 274, 289, 291, 269, 233, 214, 230, 268, 298, 303, 288, 264, 235, 207, 189, 185, 188, 188, 183, 183, 192, 204, 211, 209, 203, 197, 192, 186, 179, 175, 186, 218, 258, 280, 278, 269, 276, 296, 312, 313, 303, 284, 261, 245, 251, 269, 269, 230, 166, 107, 72, 61, 71, 92, 110, 117, 119, 129, 147, 160, 168, 173, 172, 152, 115, 87, 91, 124, 165, 194, 206, 204, 194, 182, 168, 147, 121, 97, 84, 82, 92, 118, 157, 200, 232, 253, 264, 259, 235, 209, 205, 226, 251, 260, 252, 236, 218, 207, 216, 243, 274, 291, 296, 301, 307, 303, 289, 272, 254, 228, 196, 174, 169, 172, 167, 154, 146, 149, 158, 160, 151, 143, 155, 189, 219, 214, 175, 137, 133, 157, 182, 193, 201, 217, 240, 265, 292, 310, 306, 276, 243, 223, 209, 185, 157, 146, 158, 168, 164, 160, 176, 204, 224, 225, 217, 210, 203, 195, 189, 186, 185, 189, 206, 238, 268, 286, 293, 297, 295, 282, 262, 248, 247, 251, 255, 253, 239, 211, 178, 156, 144, 130, 111, 99, 106, 124, 131, 119, 99, 82, 71, 66, 74, 93, 113, 126, 138, 161, 193, 213]
6509B13qk6j9PK6L0K1J3Pjj6k8l2l0k5j7j1olMJ4J8J9J1Nlomkrk2k8k0rqj6j7lJ5L1M1N1N0
6490B07L0KqOK5K7J4%oj2k0k9k6k0j9k5k4rJ7L5L2J5lj0lJkqnLKqlK3M7M9L0J7J2%k3m1k9
6471B61JK0J1k0m8n1k8jPrk1rJ3K3J5J0J7K4K1RJrk3l3l0j1NJ3J1Npj6j4KJ5J4LkQJ7Rj2k5
6453A66j5J1K8K3QNJ8L2L1J4mj3j2j5k1k0oPlk9m4l1lJ0Lmjjj2j7pJ0J2LJJ1J9J3RJ8L1K6
6435B51Mk0k8k2j3pKJ7L0K9J2prkLllOQj1l8m2k3noj3qLKj1j9j1MK1K9K8J8POOmj8j7KJ8J5
6415A81PJ1K6L0K1J1Pnk9m1k8LK1J8Krj6j5mJ7K9J8j0l3l3j6OK0K4J2j5m1m6k7%J5J2OPJ1
6397A47J1QRPJj2j8j0LQK%RK1K2J2KKPJ2J6J4ll7o2n8k3J3L3L1J8RM%ljNPnk3k8j0J2J7Jj0
6377A60mJ3K0J0JRK2K2Kk2l0j9JJ9K5J9Lj5k6k4j1PK2K3Rj1k4k9k4j7jJ6K7K3Qj1l1l7k0J4
$$ y = [213, 205, 179, 160, 167, 193, 223, 244, 257, 264, 263, 247, 219, 187, 157, 132, 115, 104, 98, 95, 99, 113, 131, 150, 161, 166, 163, 157, 153, 151, 142, 120, 92, 72, 63, 55, 39, 22, 19, 34, 65, 106, 157, 207, 237, 239, 231, 237, 262, 289, 303, 303, 297, 285, 265, 236, 210, 190, 171, 146, 122, 113, 130, 165, 197, 212, 209, 199, 196, 197, 195, 187, 182, 185, 187, 179, 176, 199, 246, 295, 325, 342, 354, 354, 331, 290, 261, 262, 282, 293, 273, 225, 174, 146, 145, 152, 143, 122, 113, 126, 149, 164, 174, 191, 215, 236, 245, 246, 237, 214, 181, 151, 140, 145, 158, 169, 174, 167, 151, 137, 139, 154, 168, 171, 169, 177, 194, 203, 191, 166, 151, 162, 190, 213, 221, 226, 244, 276, 307, 321, 317, 304, 292, 277, 256, 236, 230, 237, 234, 205, 161, 130, 127, 137, 140, 136, 135, 134, 122, 105, 98, 108, 120, 123, 124, 135, 154, 167, 176, 194, 225, 251, 255, 235, 207, 185, 172, 165, 167, 184, 214, 243, 255, 248, 239, 237, 240, 237, 234, 240, 248, 237, 199, 157, 134, 129, 123, 110, 102, 105, 107, 96, 77, 66, 70, 91, 120, 148, 166, 173, 179, 185, 181, 163, 146, 148, 166, 181, 188, 199, 225, 255, 276, 287, 294, 289, 260, 219, 191, 194, 215, 233, 235, 226, 210, 195, 191, 208, 237, 255, 245, 212, 179, 163, 169, 189, 213, 225, 210, 169, 123, 96, 96, 111, 123, 129, 136, 147, 158, 166, 175, 182, 183, 171, 153, 143, 146, 154, 156, 156, 165, 186, 208, 220, 222, 224, 231, 243, 259, 273, 270, 233, 171, 113, 90, 103, 136, 167, 185, 194, 198, 198, 195, 194, 199, 206, 201, 178, 150, 140, 152, 169, 170, 160, 156, 169, 189, 199, 200, 209, 231, 253, 255, 233, 203, 184, 185, 204, 229, 248, 251, 236, 210, 186, 175, 182, 204, 227, 236, 225, 201, 172, 148, 131, 130, 146, 173, 196, 204, 193, 162, 125, 105, 119]
6360A19L8L3J6RJ2PooQJ9J1pj5j3JK3M0L0pl6l4j3rk5l5k5oPJ1J0J%J8N0O5M1rn0o2m8k8j6
6342A19j3rKROoj5rNJ4J3POJ1J6PmML8O7O2K6j8m6n7n2m0k9l0l2j4K2M7M6K8J5QMLjj4m0n8
6323I8n0j8J9M1M5L6K4J5J2J0QOPKj0j8k2k8l8l8k0J3L7M2K2j8n1m8oL9N2L9L2L6K9Oj7k5
6307B63k4k0j9j9k7l2k5j0LK0M4N6L5mj9jJ5Kk2l4l7m2l9j3J6K6J7J0Olj5j0J1K4J3lp%%j3
6289A23k9k8j1QJ5J6K1K3J8ONJ3J5Jj5j9k3l4m1k5KJ5J1J3K4K8Nk4l3j7MJ6J8K2K6K7K0J1
6273B07OQQONPLpj1KJ2Lk0k7nK6K9Pk1k8j4JJj4k0oJ8K8J6kj9k9l6l4k4j6pOK2K3Nj2j4%J8
6253A01K7K6J9J3J1J0Lj0k2l3m1l4mL5M9K9NLJ4J0oj1%J5K2K4J9Lj6k2j3jKJJMPRKj5k9j9
6235A88J2L7K9j1m9n9m0j0J3J9J0nj8k4k1j0%nk7m0k5J7N2O1M6L2L2L1K1Pj0l6o7p9n2kK9
$$ y = [119, 157, 190, 206, 215, 227, 234, 228, 222, 230, 249, 260, 253, 238, 225, 226, 249, 289, 319, 312, 276, 242, 229, 220, 195, 160, 135, 129, 136, 147, 157, 158, 158, 176, 226, 291, 332, 323, 273, 211, 163, 135, 119, 106, 97, 99, 108, 114, 108, 93, 84, 89, 103, 116, 123, 129, 140, 156, 163, 159, 163, 201, 268, 330, 356, 338, 292, 235, 183, 143, 114, 84, 52, 38, 60, 107, 153, 181, 196, 204, 208, 211, 210, 196, 156, 98, 48, 30, 49, 90, 135, 171, 195, 210, 222, 232, 240, 246, 253, 255, 245, 227, 205, 177, 139, 101, 81, 94, 131, 173, 195, 177, 126, 78, 72, 111, 163, 202, 234, 270, 299, 305, 288, 263, 239, 219, 200, 181, 154, 122, 97, 87, 90, 110, 154, 210, 245, 241, 222, 221, 236, 238, 216, 182, 145, 103, 64, 51, 67, 93, 110, 120, 126, 123, 108, 98, 109, 133, 146, 143, 136, 136, 136, 123, 94, 66, 55, 63, 78, 94, 115, 138, 156, 162, 167, 180, 195, 196, 181, 162, 139, 105, 64, 39, 41, 56, 67, 80, 104, 132, 137, 113, 80, 63, 67, 83, 101, 123, 149, 176, 196, 207, 213, 221, 229, 235, 240, 247, 250, 243, 232, 234, 246, 249, 229, 202, 197, 223, 252, 259, 238, 210, 196, 197, 198, 184, 164, 158, 176, 204, 220, 218, 199, 170, 134, 100, 76, 60, 53, 59, 81, 104, 109, 97, 83, 83, 101, 128, 154, 173, 186, 197, 207, 210, 200, 178, 145, 104, 70, 66, 101, 150, 179, 184, 187, 201, 211, 205, 194, 194, 209, 231, 255, 274, 277, 261, 239, 226, 225, 227, 228, 229, 233, 240, 249, 251, 236, 207, 188, 200, 237, 266, 255, 206, 147, 107, 97, 110, 129, 139, 134, 116, 92, 71, 61, 61, 56, 29, -11, -36, -19, 33, 94, 140, 172, 204, 235, 256, 263, 253, 217, 150, 71, 19, 17, 46]
6219D6K5RKOMKJ1K4K5J3NLNNQJ2Noj0mlj3j5lRJj6j9KK1K0MroMRlj8k3j7ojNJ4K1J8QKMNn
6197A80j8k8k9k2qJ2J9QojK3M3L9J6%%J1J3J0PMpk0k0mJ1Qj0k7l0k0mJ2K4K7K4J8J6J8K2K5
6179C36J4j5m3m2j4J0Nj2j8j4j5k2j9nKkKK0L2K1KNK4L5K2Jj0rrj3j8k3k0j7j7k2j9lJ7K6
6162A73J8NnnNK2K8J2j5l4l3k4j3kPJ3J7J9Ok7n0m2oJ4J0KQJ8J3OJ3J9Qj1j8j3qJK2M1L1J
6144B26k8m2m7l5lK8L3J3LJ1J3jj3j1lopLJ2Opj2j3j6j0QK3J4kkJ7L4L4K8J5nk7l5k6j1mK
6126A57J4K2J3nj5%L1M7L3Kj7rL%j6k4j7rljkpj7k9l2k1PL6L8J3j6k4j1lpj5j6pLPmk5k9%
6106D5L8N3L4J1KJ%pj3j7j0J2L0L5K4J2mk1l1j3J8L4J6j6m4o3o9m8j2J1J1JMJ5J8J8K6L2J7
6090A50qj9kL1N8O5N3L0Nj1j5lJ5K0ll3l1J1M6L5qm0m0k5j5j0j2k2l1k5j3j6l9n3l9j1NNM
$$ y = [46, 71, 80, 82, 88, 92, 94, 105, 129, 154, 167, 172, 175, 180, 185, 193, 205, 210, 204, 194, 190, 187, 174, 159, 156, 165, 166, 150, 131, 133, 154, 174, 178, 169, 163, 167, 176, 173, 155, 132, 115, 109, 108, 113, 127, 148, 166, 174, 176, 180, 185, 180, 162, 134, 105, 83, 75, 87, 106, 114, 108, 107, 130, 173, 212, 228, 228, 228, 239, 252, 262, 269, 273, 266, 246, 226, 222, 233, 241, 231, 204, 174, 154, 150, 162, 186, 213, 237, 255, 271, 289, 311, 336, 350, 335, 292, 250, 236, 246, 251, 239, 221, 207, 192, 170, 151, 146, 148, 146, 148, 168, 200, 221, 223, 228, 252, 287, 309, 310, 300, 291, 282, 269, 251, 228, 208, 191, 174, 152, 133, 130, 147, 173, 191, 196, 191, 186, 191, 213, 241, 253, 238, 204, 171, 147, 134, 132, 139, 152, 169, 188, 194, 167, 117, 75, 69, 83, 93, 95, 103, 121, 134, 140, 153, 172, 180, 169, 151, 138, 130, 131, 153, 194, 225, 226, 198, 156, 109, 74, 71, 99, 132, 145, 148, 159, 172, 171, 158, 147, 144, 138, 131, 134, 146, 152, 145, 133, 120, 104, 94, 102, 125, 139, 137, 135, 152, 186, 220, 248, 263, 258, 231, 196, 170, 159, 155, 157, 171, 193, 206, 201, 186, 186, 217, 264, 297, 299, 282, 273, 276, 276, 260, 236, 219, 210, 207, 206, 204, 197, 180, 151, 119, 98, 105, 141, 179, 192, 176, 152, 141, 138, 131, 116, 100, 93, 96, 103, 99, 74, 45, 45, 83, 136, 170, 181, 183, 184, 184, 177, 164, 147, 137, 149, 179, 214, 238, 250, 246, 225, 194, 181, 199, 233, 249, 233, 189, 126, 57, 9, -3, 8, 19, 20, 24, 39, 57, 75, 101, 133, 150, 142, 123, 121, 152, 210, 275, 328, 358, 363, 352, 337, 334, 349, 369, 366, 333, 302, 313, 359, 394, 386, 346, 306, 281, 266, 256, 244, 222, 191, 166, 153, 137, 98, 45, 6, -5, 0, 5, 9]
6073IOQJ0Okj1rjOPRJ8K3K0J7J9J9QkkPJ1Jj5l0m1l6j3J6L3L0J4%mNK3L1J5j5l3k5qklPK2
6053A48K9J9OKJmlPJ4J1LJ0K2K0ol0l2j6nqqRL8M9K1k7n8m4pJ2Jj8j4NK2K5J7NoqLJ6J0j2
6034B19l2l4k6j5pLJ3K0J6PKLLoj9k5k5k0j2kNJprKJ0PlpnKK0M5N3L7J2NPjj6j7JJ4Rjpk0
6013B00m1m6k5NK0K1K4L1K5Lk0k2oJ3J6kk6l9m0m0l7k0J3M5N2M3L5L4K9J4ok4l5l8l8l7l4
5997D7k6j1OJ7K5L1L7M0L7J9j8n0m9j3K0K5J9J7J4lj8qJ0Qj3j7%J3Jj5j5kJ0K0K8L0K0J2P
5980B55mk4l7l6k4k2k0j5qomQK0K0J2J0J3J6J5J2Kj3k0j1LLrj1MJ2kj5j3jjj4j7JK4K9K0J4
5962A66K2L1K6Oj4k1j7j1j3j4mJ8L8M0K4Nqk3l5l6j5J0J9RjLJ5K0J5Nj1l2m6m1j7J8M3M9L3
5945B56Rnnnj4k5k3j0%MOJ0J1R%j5k8l4k9k2j6qJOLjKQJ5K4M3N9N6L6J6J0Lqj3o%pk6l8m0
$$ y = [9, 15, 23, 33, 39, 37, 26, 17, 16, 22, 29, 38, 56, 79, 99, 116, 135, 154, 162, 160, 158, 165, 176, 177, 162, 132, 91, 55, 42, 58, 91, 121, 135, 135, 131, 136, 159, 190, 205, 190, 157, 132, 124, 122, 119, 126, 148, 177, 196, 202, 204, 205, 201, 198, 205, 219, 230, 233, 243, 265, 285, 279, 249, 217, 201, 196, 188, 180, 189, 227, 276, 297, 270, 212, 168, 161, 173, 174, 156, 142, 147, 169, 194, 211, 216, 210, 202, 205, 221, 231, 219, 187, 153, 127, 112, 105, 108, 121, 141, 157, 164, 166, 169, 172, 166, 147, 122, 97, 77, 65, 63, 68, 69, 62, 53, 55, 65, 72, 69, 62, 57, 59, 79, 124, 177, 214, 226, 231, 238, 237, 221, 204, 205, 219, 228, 227, 220, 200, 159, 113, 88, 93, 113, 134, 158, 189, 214, 217, 197, 175, 169, 182, 198, 196, 170, 131, 91, 51, 14, -6, 7, 52, 104, 147, 182, 216, 245, 259, 253, 229, 194, 156, 118, 81, 47, 21, 10, 16, 33, 58, 89, 126, 166, 203, 222, 204, 154, 105, 92, 112, 137, 156, 173, 187, 184, 166, 158, 168, 176, 163, 146, 146, 159, 160, 145, 130, 128, 138, 158, 186, 216, 236, 248, 255, 251, 227, 190, 154, 130, 108, 88, 73, 65, 59, 55, 63, 83, 103, 115, 125, 138, 154, 169, 181, 183, 170, 150, 139, 142, 145, 136, 125, 129, 141, 139, 124, 111, 110, 109, 95, 78, 79, 103, 132, 152, 166, 188, 219, 245, 251, 237, 216, 199, 188, 175, 161, 157, 175, 213, 253, 277, 282, 274, 251, 216, 180, 165, 175, 194, 203, 202, 205, 220, 240, 255, 260, 249, 217, 171, 130, 113, 131, 174, 223, 256, 265, 260, 255, 250, 236, 211, 188, 178, 178, 182, 188, 198, 209, 218, 218, 203, 175, 141, 112, 90, 74, 66, 67, 73, 76, 75, 77, 85, 100, 124, 167, 226, 282, 318, 334, 344, 347, 339, 326, 320, 320, 313, 287, 249, 209]
5926B09l9l4k3j2oqj0oLJ0Rkj2pJ7M2M5K8J0Kmj6k8k8j4OJ9J5mk6l4k1onk1l6l3j2J5L2L9
5908E4M1M3L8K4LnMJ4J2MMJ4J9Oj7l4m1m2l9l1j1J3L3L6K4J1J6M1N8M6Ql0m5m0k2KK6N0P1
5891C58Q5Q6O3J8l3o9p7n7k6KJ0Kpqqk0m0n2m2j5J6L3K6Oj0j0NJ9K6L3L1J4j7l9m1l5l7m2
5875A48l3pK7N3O0M3J0j4j3NJ4Lj0j4j6k7l4j7J3K8J2j2j5RL6M5L6J9Lrj9k4k7l0l3k5jK0
5858B04J9ql3l6k4j6j0jRMj0j1RK6K2PMRjk8m2k6KJ6J1NJ2K5K8J2j5l2j8J5M3L8J2j6k9k3
5841A53%K5L4J6j2k6k4j9j9qJ2L0L2K4Rnj4rNQql0l3j5OJ6J2Lm%PQkrkJ1J4NmomMJ8K6J6j0
5821B31l2m2l7j7J0L6L9K4J0J1J9K4J6Jj4j9j3qj7l1k4J1L9L9J5ok0l2l4j4J7K8J5%QK4K8
5805B85K1J9J8Qj5l5m7n8o1m7j1K0K7J7QJj0j9j7kQNoj2j4oJ0K5K3PKJ6K8J7rl0l6l6l0oK5
$$ y = [209, 170, 136, 113, 101, 95, 87, 77, 71, 74, 84, 93, 91, 79, 72, 89, 131, 176, 204, 214, 216, 212, 196, 168, 140, 126, 132, 151, 166, 162, 136, 102, 81, 75, 70, 49, 13, -20, -32, -17, 15, 54, 95, 138, 176, 200, 203, 198, 202, 216, 228, 232, 236, 250, 269, 275, 258, 224, 183, 141, 102, 71, 60, 73, 106, 142, 166, 177, 193, 234, 292, 338, 346, 316, 271, 231, 209, 211, 237, 287, 358, 443, 529, 592, 610, 577, 508, 431, 374, 348, 350, 360, 362, 355, 347, 339, 319, 279, 227, 185, 170, 186, 219, 245, 251, 241, 231, 236, 255, 281, 314, 345, 359, 342, 303, 262, 227, 190, 148, 115, 108, 135, 188, 248, 291, 301, 287, 274, 279, 293, 296, 286, 272, 256, 229, 195, 178, 191, 219, 231, 219, 204, 213, 249, 294, 330, 349, 352, 343, 324, 300, 273, 243, 210, 185, 184, 204, 223, 215, 182, 146, 122, 106, 96, 95, 104, 108, 98, 87, 96, 122, 144, 151, 155, 164, 163, 135, 93, 67, 69, 85, 96, 101, 113, 138, 166, 178, 163, 131, 113, 128, 171, 209, 221, 205, 176, 153, 153, 178, 212, 228, 216, 190, 166, 147, 128, 120, 132, 162, 194, 218, 227, 222, 208, 199, 204, 212, 204, 174, 141, 126, 132, 148, 160, 163, 159, 159, 166, 174, 172, 163, 161, 172, 186, 191, 187, 181, 177, 181, 199, 225, 241, 231, 199, 157, 120, 103, 113, 149, 188, 212, 222, 233, 252, 276, 292, 293, 279, 260, 247, 239, 222, 191, 167, 178, 217, 256, 271, 265, 245, 213, 179, 165, 182, 210, 225, 225, 233, 257, 285, 306, 325, 343, 351, 336, 301, 254, 196, 135, 88, 77, 97, 124, 141, 149, 150, 140, 121, 104, 102, 110, 115, 109, 97, 83, 77, 87, 112, 135, 142, 144, 160, 188, 205, 196, 166, 130, 94, 64, 58, 83]
5787H3M1L0J0JKNJ5L0M0L5J4lrqj2j4j7j9k0k4k0rPJ7Qrj8rJmj9k7k9l2l0j4NRKNL4O0N4K7
5768A89J0RMj3k3k0j0rj5j6j5k1k2pJ7L3L3K8K4J5JnKRRRK0K7J2j6l6l6k6j1J1L1K8Mj1LK1
5750B37J4j2k1oRNjMJ1Kj0j2lmj0lJ9L6L2J3Klrj6k1j9j3lJ0J8Rj2k9k2%J1Jj8k4pJ8L1K6
5731B30J4Knj1k0k5k3j3kLLNQROKLJ1J4J1NMRJ2ROPMoj2jK7M3K6nk1k2k5m3n3m0j5JOJ6L1
5712A85L2Rk5m2k7J2M0L8J9J4L6M9K3l2o4n6l1j8j6qlj4l1k9rPJ2K1M0N0L4Mj5j2KQNmj2j6
5694A76j4rqkJ0K0K1J0mj0rkQJ4J7J4QJJQJ9K1RjKJ5J9Nj6l1l8l0mL2N1L5Kj8j7j2j9k2j1
5676B41Kkj6k2j4rj6j3MK1J6mj0PK8L3K9L0L1K3Jk3l2k3rLJ3K1K3J2nj5k1k4k8k5nJ9K6J4
5658B81ok0k2j6j4k1l0k7mK7M2L0Oj6k9l0j6OJ6QmkJj2l1k9KK9L0J5L%pj6j0J1K4J7Mjlj0
$$ y = [83, 124, 154, 164, 165, 167, 172, 187, 217, 257, 292, 306, 303, 294, 286, 274, 260, 243, 224, 204, 180, 160, 151, 158, 175, 183, 174, 156, 147, 148, 144, 125, 98, 69, 37, 7, -7, -2, 7, 9, 14, 48, 108, 162, 189, 199, 208, 212, 199, 176, 156, 146, 137, 122, 106, 91, 70, 48, 41, 58, 91, 124, 152, 176, 191, 192, 187, 189, 198, 207, 216, 236, 263, 275, 259, 223, 187, 161, 150, 161, 192, 220, 224, 213, 216, 237, 251, 239, 218, 212, 221, 226, 225, 229, 240, 242, 232, 220, 217, 213, 203, 200, 219, 255, 287, 300, 302, 299, 290, 274, 253, 234, 221, 218, 228, 246, 255, 243, 214, 192, 192, 203, 204, 186, 162, 155, 173, 204, 230, 244, 246, 241, 230, 210, 185, 162, 149, 147, 150, 153, 158, 166, 175, 181, 183, 186, 197, 211, 222, 227, 231, 240, 252, 261, 267, 274, 278, 272, 260, 259, 286, 329, 355, 350, 329, 307, 282, 239, 186, 146, 131, 132, 138, 154, 185, 217, 226, 201, 159, 132, 144, 184, 222, 241, 255, 291, 340, 363, 331, 267, 211, 180, 162, 146, 138, 135, 121, 90, 61, 52, 59, 71, 92, 132, 182, 216, 220, 205, 193, 195, 203, 208, 204, 192, 176, 162, 153, 145, 143, 153, 173, 194, 204, 200, 190, 181, 179, 187, 201, 218, 232, 240, 241, 242, 250, 269, 290, 299, 298, 300, 315, 334, 339, 323, 292, 254, 224, 220, 252, 303, 338, 340, 322, 305, 293, 274, 252, 241, 243, 241, 225, 203, 189, 180, 164, 151, 155, 176, 192, 188, 178, 185, 213, 246, 275, 305, 336, 359, 360, 337, 305, 282, 273, 276, 289, 310, 333, 345, 340, 325, 304, 280, 252, 227, 222, 241, 267, 281, 275, 255, 233, 217, 203, 182, 152, 125, 121, 148, 190, 220, 226, 210, 181, 151, 135, 141, 157, 165, 161, 159, 160, 148, 117, 88, 90, 119, 149, 164, 167, 167, 160, 144, 134, 145, 169, 186, 190, 189, 186, 176]
5640A76k3k5pK3M5M2J6k2m5m2k4rrj4rMJ3J0OOJ4K3K9L2K6J3JlLONJmj1k1l1l4k6j1NJ4J5
5622A58J7J8J5Kj2j2lPPONJ0J7K2J8jk5l4j6J7M8N7L8Oj9l2l6l6k3OL3L0Oq%J3Rnj5k0k3j8
5604B27nRJ5J7J8J1j1l5m3l3k0nJ0J7Pqj3qnlNJ4J9K2K5J6j1l3k3MJ7Lj3j5j1rpj0k1l0j7
5586F7MPrj0RJ9Lj4pJ1J5J3K1K9J6j3k9k7j7qPK1K6K2J6NkQK9L5K0LKnm1p3n6j0J1j1l4j8
5568C5J7M0L9K8Rj2k7k9k6k1rkoj2KL4N6M9K9J4PRJ6J7jk9l2pK1L1K6J7LpLL1N1N6O7Q4R0
5550F61J17K18L57L74J73j35l24l16k20j62j40j03n0k1j9j6pqj8k3k4k5k0jK0J9mk9m0l3p
5536A94K2L1J0j7k1mJ5J9J4QOMmj7k6j4J1K2Oj3mK0K5Lk5k7j1OJ2Mj3k9l0j6JJpnNJ1jj9k4
5518A23j4jNJ2J6J4jj1qMNpj3PL2L4J1j0mJ5J6j3m2m7l1j7j2pQJ7J1QJ7K4J5l%K0L2K1ONJ2
$$ y = [176, 153, 128, 121, 144, 189, 231, 247, 225, 180, 138, 114, 105, 96, 82, 73, 77, 90, 100, 106, 112, 126, 149, 178, 210, 236, 249, 250, 247, 250, 256, 261, 262, 258, 247, 226, 195, 161, 135, 124, 129, 143, 158, 175, 193, 208, 210, 198, 186, 183, 190, 197, 203, 208, 218, 235, 257, 275, 274, 249, 215, 199, 216, 264, 321, 359, 365, 346, 314, 278, 242, 219, 225, 258, 288, 294, 286, 286, 299, 308, 303, 288, 268, 245, 227, 222, 231, 246, 263, 281, 292, 281, 246, 203, 170, 150, 145, 155, 172, 179, 171, 158, 150, 145, 142, 147, 161, 180, 202, 227, 243, 232, 199, 176, 180, 197, 200, 187, 172, 161, 152, 145, 135, 114, 84, 67, 71, 78, 69, 59, 68, 87, 90, 76, 69, 80, 95, 108, 129, 158, 174, 161, 132, 105, 88, 80, 87, 108, 134, 156, 172, 177, 175, 183, 212, 247, 267, 270, 272, 267, 226, 153, 97, 87, 98, 87, 53, 35, 52, 92, 131, 159, 168, 156, 129, 100, 74, 53, 44, 42, 36, 24, 26, 60, 116, 165, 194, 208, 215, 224, 240, 257, 256, 227, 195, 188, 209, 240, 266, 283, 286, 279, 282, 313, 364, 420, 487, 571, 661, 778, 996, 1353, 1727, 1900, 1765, 1441, 1125, 905, 743, 603, 500, 450, 429, 410, 394, 387, 379, 361, 338, 314, 289, 269, 268, 288, 307, 303, 274, 234, 201, 194, 216, 247, 257, 240, 219, 215, 230, 249, 263, 271, 277, 281, 277, 260, 234, 220, 231, 253, 259, 246, 242, 262, 287, 290, 265, 238, 227, 233, 245, 249, 236, 207, 177, 161, 162, 163, 156, 151, 156, 167, 166, 147, 123, 109, 108, 113, 125, 141, 155, 154, 143, 135, 139, 144, 137, 124, 131, 163, 197, 208, 198, 194, 209, 225, 212, 170, 123, 92, 75, 63, 56, 64, 81, 92, 100, 117, 141, 156, 153, 153, 173, 205, 226, 232, 237, 249]
5499B49J3J0J0RONJ3J8Nj7l7m3l4j8j0k2m1l5jK6K1JPL5N1L8J9Qjj9l3l4k6k4k0j3prj2qP
5481H7J5J1LjKNNKkkkJJ0J8J8Nn%J3J2rk8k5j1KJ2K1K2Qj1j3QL2L5J9NLMkj5j7qmj2j3OK9
5461B33K6Jj6j4pj7k7k1jJ1J5J4J5PklLLlkJ3K6J5j4l5l3j9j3k4l4k1RL2L2J5LKKLJ0L1N0
5443B65M7K1j3l4l6k4j8j7j0OK2K0OjKLjjJ3K6J5j8m2l7j3OMmoKQMkkNOnj9k7k6k1k0j7pJ1
5423G1K6K7J3OJ3K6L1L2L5L1J2j1k0qJj0l3l9j9J2K8J1k4m2k2J6L9L1Rj2k9m0l2nJ8J4koJ
5406A49MmmJ0K0J3JmnprLK0L3L5L3L0J6ok2k2j1ool%kj7l4l9l5j8PK9K9Lk1j7RL0L0K4K2J6
5387B74lk4k9k0j2j0rlLJ4L0M2L2Mk1k7k3k0j4pkj4l5m5l5j6pj2j0RM0N5M3J9Mlj2k4k2mJ3
5370A19J4jj0rPK9M8M6K1j5l5l3k1j2j2j3j3rj0j1j2lJ4K9L8M1M0L1J2j1k3k7k9k5j2RK3K4
$$ y = [249, 262, 272, 282, 291, 297, 302, 315, 333, 338, 321, 284, 241, 207, 189, 179, 157, 116, 81, 80, 106, 127, 128, 135, 170, 221, 259, 278, 286, 285, 266, 233, 199, 173, 149, 129, 116, 109, 100, 88, 80, 87, 102, 113, 116, 115, 117, 122, 127, 129, 127, 125, 123, 124, 134, 152, 170, 175, 170, 170, 183, 195, 186, 158, 133, 122, 124, 136, 157, 179, 187, 176, 163, 171, 203, 238, 257, 262, 265, 269, 267, 252, 235, 227, 223, 211, 198, 204, 233, 259, 260, 244, 230, 223, 206, 179, 158, 157, 168, 183, 197, 212, 219, 217, 214, 217, 220, 217, 215, 228, 254, 269, 255, 220, 187, 168, 155, 131, 97, 76, 85, 117, 149, 164, 167, 169, 171, 174, 184, 215, 265, 312, 333, 320, 286, 250, 226, 208, 191, 181, 187, 209, 229, 235, 234, 236, 239, 238, 237, 250, 276, 291, 273, 231, 194, 181, 187, 191, 187, 181, 183, 191, 195, 193, 191, 196, 202, 197, 178, 151, 125, 104, 84, 67, 60, 71, 97, 124, 137, 143, 156, 182, 213, 245, 280, 311, 323, 312, 292, 284, 285, 275, 242, 203, 184, 196, 224, 235, 211, 169, 147, 163, 202, 233, 242, 230, 201, 161, 129, 124, 142, 156, 154, 148, 149, 153, 149, 145, 155, 175, 188, 189, 185, 180, 173, 164, 167, 187, 220, 255, 288, 318, 334, 328, 306, 284, 273, 267, 261, 258, 258, 256, 239, 205, 166, 131, 113, 120, 149, 178, 181, 160, 143, 152, 182, 212, 236, 258, 274, 271, 247, 218, 198, 186, 176, 167, 164, 167, 181, 211, 253, 285, 289, 268, 241, 218, 198, 184, 177, 175, 161, 126, 81, 46, 30, 23, 11, 1, 10, 50, 105, 148, 167, 171, 168, 156, 132, 110, 106, 119, 133, 132, 122, 113, 120, 149, 197, 243, 264, 249, 214, 181, 160, 148, 136, 123, 110, 101, 91, 80, 68, 65, 79, 108, 146, 187, 227, 258, 270, 259, 236, 209, 180, 155, 143, 152, 175, 199]
5353A99J8J8J8Rj5l7l9j8J4L2L0J1rk2k3j5lKLQK0K0Lj7j6OK1J5kmPJ5Oj0k3k2j5j5k2k4j1
5335A13J2K5K1J5K0K5J7mj6j6j3j4j8j4j0j5k7l4k6qRJ2QLQJ5J6QPJ3K3K5J5%pjJ2J6Mj4k5
5317A80k5j6qKJ0J0LKJ3K3K2R%LLlj0oJ3K9K7Pj7k7k9l3l7l4k3j7k3k9j9lPOPJ4K1K2J7J0
5299A01JnKK3L6L4K0J3J4J4QMPOj0l3m7m0j8%J0Qok1l0k5j6j5k2k4j7nMJ5K8L7K9K0K3L2K5
5282A80ll1m5m5l3kL8O2N4K7%k4m5m8k4J1K8K5J9J6J2J3J6J7kk5l1k0j8k8k7%K9L6K5J3On
5265A71j0lNkj8k4rMMmnOK5M0M3L0J0%nj3k3j9QL5L9J8j1k7k3j1lj0k3l0k6j8j3kJ9M4N4L8
5247B61Rj3j7lP%k5m9m9k1J8L9L1Oj0oJ0J8J0pk3k6j5OK0J8Jj2k1k3j7pNJ1J3K0K7K1OJJ3
5229B27K8K9J7Lj0k0k1j4pqj3j4j1%K2M4L9Pk0j2J5K2Kj5j1%KjLNqk1k2qQJ5J7J4J1Lj3l5
$$ y = [199, 217, 235, 253, 262, 247, 210, 171, 153, 167, 199, 229, 240, 231, 209, 186, 171, 168, 170, 173, 181, 201, 221, 224, 207, 191, 197, 218, 233, 231, 227, 234, 249, 255, 245, 222, 200, 185, 170, 148, 124, 113, 125, 150, 171, 186, 206, 231, 248, 244, 228, 212, 199, 185, 167, 153, 143, 128, 101, 67, 41, 33, 42, 54, 62, 65, 73, 88, 104, 112, 119, 132, 155, 180, 195, 195, 188, 187, 199, 215, 219, 205, 180, 155, 139, 131, 133, 143, 153, 156, 158, 171, 194, 216, 225, 225, 228, 231, 228, 218, 212, 225, 254, 281, 288, 271, 244, 215, 182, 145, 111, 88, 71, 48, 19, 0, -3, 4, 10, 17, 31, 52, 74, 91, 101, 102, 97, 99, 122, 158, 192, 212, 225, 239, 253, 261, 265, 272, 278, 268, 235, 188, 148, 130, 130, 140, 148, 142, 121, 91, 66, 50, 35, 13, -11, -28, -33, -29, -14, 14, 51, 80, 100, 123, 155, 180, 177, 146, 101, 56, 23, 21, 59, 121, 175, 202, 202, 178, 133, 85, 61, 72, 100, 125, 144, 160, 172, 185, 201, 218, 216, 191, 160, 140, 122, 94, 67, 67, 96, 132, 157, 170, 176, 171, 161, 158, 163, 161, 143, 119, 110, 114, 118, 114, 109, 115, 140, 180, 223, 253, 263, 263, 258, 245, 222, 203, 211, 246, 285, 303, 292, 265, 242, 231, 228, 218, 195, 165, 139, 121, 108, 106, 125, 169, 223, 261, 270, 257, 240, 237, 244, 244, 219, 170, 121, 100, 118, 157, 188, 194, 184, 178, 188, 206, 216, 209, 186, 160, 145, 151, 171, 189, 190, 178, 157, 134, 117, 110, 115, 126, 139, 159, 186, 207, 213, 214, 227, 255, 284, 301, 304, 294, 274, 253, 239, 232, 224, 211, 197, 186, 186, 208, 252, 291, 298, 278, 266, 281, 303, 305, 290, 279, 279, 281, 280, 283, 288, 280, 259, 237, 229, 237, 252, 269, 283, 294, 297, 284, 249]
5211B49m9m0j2RQmpjPJ0J4J6J1KLJ3K0J0qj8j6lKkj2r%%j7l4l1j6jPJ8K9K5QprkJ0K7M1L3
5191B74Qj7k5k6k5j4J0L2L2J1qj6j8k3k7k4j8j8k3j9JK5L1J7kj0j0j6k5k3qLNPJ8K2J3LRK0
5174A46K1J0JkljPJ1Jj2nK3M5M2K8K2K4K8K7J8ql8n2m1k3j6j8j7j0nlKQPlj8l2m2m1l2k0r
5156B0NK4L6L0Rj3k6k6qK0L4K6J1O%rnK4N4M4kl2k3PJ8Kk5n3o3m5lL1L6K8L1L7L0J5QJ4J5
5138B82Lj4k8l1k5qJ0J9K3K1J6Jj5k0j9j7j4plrj3oJpj8j2J1K2J8K0L8M9L2PKJ4J0j1k9j9
5121B74MK2K2Nj5k3j5llk1l9m1k6lJ5J7Lj5k6k7k3j5pkoqKJ8K2J5QJ0J2Poj6j9j7nJ2K6K9
5102A42K3J5J0jj6k7j9PL3L5Rl3o1o4m1pK0L2L2K8J7lk0j7OK7L0K4K2K2J1%KJ7K2J3NRRjo
5085C06KJ2Mj0j6j3k0l4l4k1j4k0l0l2l5l9k7KK8L3J5lpLJ5K0J3jmJ3L9M9L5J0onlrk2l1k5
$$ y = [249, 200, 160, 148, 157, 165, 161, 154, 153, 160, 170, 184, 200, 211, 213, 216, 229, 249, 259, 251, 233, 217, 214, 216, 214, 202, 193, 193, 193, 176, 142, 111, 95, 94, 101, 119, 148, 173, 181, 174, 165, 163, 173, 200, 241, 274, 282, 265, 240, 214, 189, 175, 185, 217, 249, 260, 252, 236, 218, 195, 168, 144, 126, 108, 85, 66, 67, 92, 123, 140, 138, 128, 118, 102, 77, 54, 46, 49, 54, 61, 79, 101, 114, 117, 126, 146, 167, 177, 178, 176, 173, 172, 179, 190, 191, 179, 174, 197, 242, 284, 312, 334, 358, 386, 413, 431, 423, 385, 333, 292, 269, 253, 235, 218, 208, 203, 200, 202, 210, 217, 214, 196, 164, 122, 81, 49, 29, 20, 25, 49, 85, 115, 124, 111, 85, 59, 51, 71, 105, 131, 142, 148, 148, 139, 134, 158, 212, 256, 254, 222, 199, 206, 224, 226, 201, 148, 85, 40, 37, 68, 104, 132, 163, 200, 230, 245, 253, 267, 282, 285, 271, 243, 212, 187, 179, 189, 208, 231, 252, 268, 269, 254, 234, 215, 198, 184, 177, 174, 165, 152, 146, 147, 140, 122, 110, 121, 143, 161, 181, 219, 268, 300, 307, 309, 323, 333, 322, 293, 274, 278, 300, 322, 327, 312, 289, 274, 271, 268, 247, 208, 167, 141, 138, 153, 170, 173, 158, 132, 105, 82, 67, 60, 58, 52, 44, 46, 64, 86, 101, 109, 119, 131, 138, 132, 116, 97, 80, 75, 87, 113, 142, 165, 180, 190, 189, 173, 146, 127, 134, 167, 202, 211, 178, 117, 53, 12, 5, 25, 57, 89, 117, 134, 131, 111, 94, 100, 127, 157, 181, 203, 225, 236, 236, 238, 255, 277, 290, 295, 304, 313, 312, 306, 308, 320, 324, 314, 298, 285, 265, 231, 197, 176, 162, 142, 112, 80, 45, 6, -21, -19, 9, 42, 57, 54, 47, 50, 65, 85, 98, 97, 93, 106, 145, 194, 229, 239, 233, 228, 225, 216, 194, 163, 138]
5067A38j0MQO%oj1pKJ0MnNL3N7M6J2j8k3j2rj9k9l2k2mK1M5N1L0kk2j4PJ7Nj4k1j3LRP%nn
5047B17nj5k8l3k2p%%QK5L2J7qk1j5nPJ7J8RlpJLlqJJ2J1nj5rQK5K3Nj3j6lRJ2J1Rol1m9l6
5027A17pJ6K2J9J4Lj4l0m0m2l5j2J3K9L7M8N9N2K8QQJ1Kj7k5j9j3j0rorj0qnkLJ4K0J0j5l4
5009A71k9mK4L6K3lj2LK8L0Rj8l0k9k4k2k1k1j3OK2J6rl1k9pJ9L8M3L1J1mjJ2J7Roj4qOJ7
4992B36K1K4K0nn1p9o3k0MjoQJ9RnoLKjJ6M0M3K3QJ2J6OjJ0K2J7ok4k9l0k6j7lNMLkj2k1j7
4972A46qrk0k4oJ8L0K3J1NNJj3k9l6k1OK8L1J8nk2k5nJ9K6J0oqmj1k8k9j4kj6l3k6RM2M8L3
4954A09K4L0L6K4Mj3j9k2k1pJ9L8L4Qj4j9j1lKRJ3Lj3j6KK5K7Oj8k8k1r%Mlj3j7oJ1J8J5P
4936A95Jknqj6k5k3kK3K9J5lrj7l3m4l1lK1L5M6N0L6J0pnnj9l4k9oJ7K9K9J7ql0l3j4J3K9
$$ y = [138, 128, 132, 140, 146, 146, 140, 129, 122, 124, 134, 138, 133, 138, 171, 228, 274, 286, 268, 245, 233, 224, 205, 176, 144, 122, 118, 139, 184, 235, 265, 263, 241, 227, 234, 251, 256, 242, 221, 208, 211, 220, 227, 227, 222, 217, 212, 197, 169, 136, 114, 107, 107, 107, 115, 140, 172, 189, 181, 160, 145, 140, 147, 164, 182, 191, 188, 181, 182, 185, 182, 174, 175, 187, 198, 193, 178, 169, 177, 202, 225, 230, 217, 201, 198, 207, 219, 230, 239, 233, 202, 153, 117, 110, 126, 148, 167, 181, 184, 170, 140, 100, 58, 23, 11, 24, 53, 90, 138, 197, 249, 277, 285, 293, 304, 306, 289, 264, 245, 232, 222, 213, 207, 198, 188, 180, 175, 173, 176, 190, 210, 220, 205, 171, 142, 138, 162, 198, 221, 218, 206, 209, 237, 267, 276, 258, 228, 199, 175, 153, 132, 111, 98, 104, 126, 142, 133, 102, 73, 66, 85, 123, 166, 197, 208, 204, 203, 215, 232, 241, 235, 221, 213, 219, 236, 257, 281, 301, 296, 245, 166, 103, 83, 87, 86, 80, 88, 107, 116, 111, 105, 108, 110, 109, 125, 165, 208, 231, 239, 251, 267, 273, 272, 282, 304, 321, 315, 291, 262, 232, 206, 189, 186, 191, 195, 198, 196, 184, 163, 146, 138, 129, 109, 85, 79, 97, 127, 150, 161, 166, 171, 172, 159, 130, 94, 73, 79, 107, 138, 156, 151, 129, 104, 99, 118, 144, 154, 148, 140, 136, 125, 97, 68, 54, 52, 36, 3, -23, -14, 28, 76, 109, 133, 163, 199, 223, 227, 214, 195, 173, 152, 145, 164, 202, 236, 244, 230, 211, 200, 197, 199, 208, 221, 224, 211, 195, 197, 222, 249, 255, 237, 209, 188, 179, 179, 183, 180, 167, 150, 144, 155, 173, 188, 195, 196, 194, 189, 181, 165, 140, 117, 115, 138, 167, 182, 179, 170, 153, 120, 76, 45, 42, 63, 98, 144, 194, 230, 240, 233, 228, 223, 204, 170, 141, 135, 152, 181, 210, 227, 219, 189, 156, 142, 155, 184]
4918A84K8J2pj7j6j2pKJ3J5Kj2oJ4K0Nj8k7k7l0l0k1oOQJ5L1N1N7M9L2K4K3K6K3J4Nok1m1
4900C55n6o1n4l5qJ5K1J0KNJ2J2J3K3L2L0K6M7Q4J07J05J01J16J40J36R3K6m5j00j25j21j02
4887H04r4j02j09r8p1l9j2%KMJ5K5J8nj9j6j0j6k0mJ6J7JjJ7K8Ml4m8k7%J1RJ4K1J9kk3k8
4870B47k1j6j9k0qOJ2Lj3k0j6lJ4K5K5Oj9l8l4j2QRj1k9k8j1OJ6K2K5K0OpnJ3L1L0Nk7m5l1
4852I6%K0K2J4RRPQJ5J6Lj1j2k%j1k3k7l3l9k7LL0L1K0J9K8K9K0K2L1K5jk0qJ7K3Jk6l7k9
4834B12j3LOok6l2j6RK1J5Nk%J0K2K3J1opRK0J1oj1nnk2m0l7j6PK1K0J0%lMOnk1l4m1m2l4
4815A5j6mkkJ2M1N5M8L4K2J0lmJ4L6M1K9Pj0k0k0j9k2k3j5lpk9l9k1PJ6J1J4K3K1Lq%J1Rl
4797B09j3j8j8j2jRJ7K3K3Oj8k7j0J3K3J7Ork3k7j3NJj7k5j7jQQLloOK7L5J4k2l9k8%J5J0
$$ y = [184, 212, 224, 217, 200, 184, 172, 165, 167, 180, 195, 197, 185, 179, 193, 213, 218, 200, 173, 146, 116, 86, 65, 59, 65, 73, 88, 119, 170, 227, 276, 308, 332, 355, 381, 404, 418, 423, 417, 396, 355, 299, 238, 184, 149, 141, 156, 177, 187, 189, 194, 206, 218, 231, 254, 286, 316, 342, 389, 473, 580, 685, 786, 902, 1042, 1178, 1271, 1297, 1252, 1152, 1027, 906, 804, 710, 608, 499, 401, 330, 291, 279, 279, 281, 285, 300, 325, 343, 338, 319, 303, 293, 277, 257, 253, 269, 286, 287, 286, 303, 331, 335, 301, 253, 226, 226, 237, 246, 260, 281, 300, 298, 275, 247, 226, 210, 191, 171, 163, 169, 181, 184, 171, 151, 135, 132, 146, 171, 196, 202, 183, 145, 111, 99, 107, 116, 105, 76, 48, 37, 43, 59, 81, 106, 126, 132, 125, 120, 133, 164, 194, 199, 172, 127, 96, 96, 116, 138, 152, 161, 170, 177, 185, 200, 216, 219, 208, 196, 194, 194, 183, 160, 133, 100, 61, 34, 37, 67, 98, 118, 137, 165, 194, 214, 236, 267, 292, 291, 271, 263, 280, 303, 304, 278, 241, 212, 199, 202, 208, 202, 176, 144, 128, 137, 158, 173, 178, 176, 176, 186, 208, 231, 242, 236, 229, 238, 258, 269, 263, 252, 247, 242, 220, 180, 143, 127, 134, 155, 175, 185, 185, 182, 186, 192, 187, 166, 132, 91, 49, 15, -1, -5, -7, -9, 3, 44, 99, 147, 181, 203, 213, 210, 206, 220, 256, 297, 326, 333, 323, 303, 283, 264, 242, 219, 204, 201, 194, 165, 126, 105, 112, 128, 139, 153, 176, 197, 200, 192, 192, 203, 212, 209, 196, 178, 160, 148, 147, 156, 173, 196, 219, 225, 207, 180, 170, 183, 206, 223, 229, 220, 197, 170, 157, 162, 163, 146, 121, 104, 103, 111, 119, 122, 119, 113, 119, 146, 181, 195, 173, 134, 106, 106, 121, 131]
4779A31jlKLJMJ6L0L5L9L7K0j5m9n3k4J0J9Qoj4j3nJ1K8L4J9kj0mM%j4k8l2k5j1LJ2J4J6J4
4760B01%k8m8m3k0KPPK2M6N2K3j9m4l6j3KQK1M1M3J6j7k1%J6J2JLJ4K2K6K4J6%j0qnj0j8j5
4743B70qj2k3k5j5lMMkj4j7qRJ5J1ROnj8j2J0J6jk0j5OJ8J7J4J2PJLJ1J1kj9k9l0k2j1kJM
4724A46J3J4Lj2j2LJ6J3Kpj3j3nRK4L4M2M1L3J8Lj8l8m7l6j9j3j7j8j5k4m2m4j6K3M3L5J8
4707A24PMRJ9K5J9P%koj2mJ3J9kl2m5l0nJ1J7J7J7J1LmonPK6M2L5J1omJ2K0J2Lpj5k3k4j3
4688B45JJ2J1mk6l8l3j1PJ3J1RMOJ4K1J2qk0k3k5l2k7pJ5K5K8L3K7Lk3k4mPnk5l6l5k3jK5
4670I9L5K9K6L1L5K0j0l0l3k0kJ2J4Mj0j1jJ0Rkj0kK0M3M8L3Mk6m1l8k3j8k1j5LJ1ok9k7L
4653A14L0L2J9RRJ4J8J4nj6nJ8K2kj8oJ5J3kj2j6k1k5k2j6k3k6qJ4J6NJ3L8M2J3k2l0j7rj2
$$ y = [131, 130, 127, 129, 132, 133, 137, 153, 183, 218, 257, 294, 314, 299, 250, 197, 173, 183, 202, 210, 204, 190, 177, 172, 183, 211, 245, 264, 262, 252, 248, 252, 252, 238, 210, 178, 153, 142, 145, 157, 171, 187, 201, 201, 173, 125, 82, 62, 64, 71, 78, 100, 146, 198, 221, 202, 158, 122, 109, 111, 119, 140, 181, 224, 240, 223, 202, 202, 218, 230, 231, 234, 248, 270, 296, 320, 336, 336, 326, 318, 313, 303, 285, 270, 262, 250, 227, 202, 187, 184, 188, 192, 190, 176, 159, 151, 160, 175, 186, 195, 201, 196, 178, 166, 176, 192, 191, 171, 156, 162, 180, 197, 211, 223, 230, 231, 234, 245, 256, 254, 235, 206, 176, 154, 143, 141, 142, 146, 159, 173, 176, 164, 152, 155, 171, 184, 186, 179, 166, 153, 148, 157, 181, 215, 257, 298, 331, 349, 352, 334, 296, 249, 213, 194, 181, 164, 146, 131, 107, 65, 21, 5, 28, 71, 106, 124, 131, 135, 144, 163, 188, 207, 214, 214, 212, 206, 194, 190, 203, 222, 220, 188, 143, 113, 108, 119, 136, 153, 170, 181, 184, 180, 174, 169, 176, 202, 244, 279, 290, 284, 280, 292, 312, 324, 327, 320, 305, 282, 258, 245, 246, 258, 269, 265, 239, 201, 168, 157, 164, 177, 188, 197, 201, 207, 221, 242, 254, 246, 226, 203, 178, 146, 119, 112, 127, 152, 180, 213, 240, 243, 220, 196, 192, 199, 194, 169, 133, 98, 75, 74, 99, 134, 163, 189, 220, 255, 275, 265, 235, 202, 182, 180, 192, 206, 210, 200, 189, 188, 198, 207, 205, 195, 193, 213, 256, 304, 337, 341, 315, 274, 236, 213, 195, 174, 159, 162, 173, 167, 138, 111, 114, 144, 176, 195, 204, 213, 227, 245, 259, 254, 238, 233, 251, 273, 271, 253, 247, 262, 275, 273, 261, 245, 224, 199, 177, 161, 138, 112, 104, 118, 134, 139, 152, 190, 232, 245, 223, 193, 176, 167, 155]
4636A55j7j5nJ4L2L7K5J5J8J8Nj1j7j9k0j9j9l2n2n7k7RK4K1K3K7J1j6j9PK8J6j1k2k0j7j5
4620E5oJ0J9K0J9K0J6QJ0K2L1K7J2Jnj0j6j7qMKj5l3l0qJ3K0J2LnqmOJ6J7Qpk1l4l9l4k2j4
4601C5j2j6j6j0%QRPJ6K1J9NlNK5L7L0J6NKmj7l0l1j9rkJ0K8L3J2j6k2mJ8K5J9Pnj2jK3L4
4582B20J2k3l7k2oqj2nRPj5l5l1pJ5K3K5K6K8K4J9K1K5K1MqoMNoj9k0j3j4k6l8l8k3pkj1j9
4564C7pJ8M3M8L3Oj5j9pMKpj0jJ3K0J5Mpj0nlqk0l2l0j2J1K0Qrj3lJnoPK3L1L4L4K7Qj0j1
4545A97PK4L1K9J6ok5k9k2k0k6k4j0OJ6J9K2J9J1Jqj9k4j4QK5K5J6J2PJoplmj3k0k2j6nOP
4526A82%okRK1L2L0J0k1m1l7k1j0j2j6j5jJ7K9K3MnkkmJJ8J8lk3j0K1L5K8K3K0jl6n2l8j8
4509A45j5j8oJ2K1J8J1pk3k0QL1K1llK1L6K6RNJ1J0%mKJ2Qqk4k3j2qk0l2l4l0k6j4QL2M1L3
$$ y = [155, 138, 123, 118, 132, 164, 201, 226, 241, 259, 277, 282, 271, 254, 235, 215, 196, 177, 145, 93, 36, 9, 18, 42, 63, 86, 113, 124, 108, 89, 96, 124, 140, 129, 107, 87, 70, 55, 49, 59, 78, 98, 117, 137, 153, 161, 171, 193, 224, 251, 263, 264, 259, 249, 233, 216, 208, 212, 214, 199, 166, 136, 128, 141, 161, 173, 176, 171, 163, 159, 165, 181, 198, 206, 199, 178, 144, 105, 71, 49, 35, 23, 7, -9, -19, -19, -11, -2, 5, 21, 42, 61, 66, 63, 68, 93, 130, 160, 176, 181, 183, 179, 162, 132, 101, 82, 73, 71, 81, 109, 142, 154, 138, 116, 112, 130, 155, 174, 181, 176, 164, 163, 186, 220, 232, 209, 172, 150, 144, 136, 124, 119, 128, 135, 120, 85, 54, 47, 62, 85, 110, 136, 164, 188, 207, 228, 253, 274, 278, 270, 264, 268, 273, 267, 248, 228, 215, 201, 175, 137, 99, 76, 69, 67, 56, 37, 30, 48, 91, 139, 172, 178, 163, 144, 137, 141, 143, 136, 126, 125, 138, 158, 173, 177, 170, 160, 155, 152, 144, 124, 92, 62, 50, 61, 81, 89, 80, 67, 64, 65, 60, 54, 61, 84, 115, 149, 183, 210, 218, 208, 197, 204, 228, 259, 288, 304, 298, 273, 244, 222, 202, 176, 152, 142, 148, 164, 183, 205, 224, 235, 236, 228, 209, 185, 171, 179, 204, 229, 245, 257, 264, 265, 259, 252, 249, 245, 232, 212, 190, 174, 169, 175, 182, 182, 176, 174, 183, 204, 236, 266, 276, 255, 214, 177, 156, 146, 134, 118, 103, 102, 119, 148, 171, 175, 170, 168, 166, 162, 163, 181, 199, 196, 173, 163, 184, 219, 247, 270, 290, 289, 253, 201, 163, 145, 130, 112, 106, 118, 139, 157, 168, 161, 138, 118, 126, 157, 178, 175, 172, 193, 229, 255, 264, 269, 280, 290, 290, 286, 288, 300, 308, 300, 276, 253, 241, 233, 213, 181, 147, 117, 91, 77, 85, 117, 158, 191]
4490A91J7kk0k7k1q%QK0K0jk6k5lPj0k7j7J1L0K4Oprmjqk4l2k5rJ1K2K7K2J5J7K7K9J0j6k7
4472A65j8MK6L8K8%k6k6oOjj9k9k0KK7L3J6j1k0j2nprkmk2l8l0pQQRK0K7J9OLJ1J7J8J7J6
4454B12Rqk3k2j0oj7k8j4J5L1K1jqLJ3J9K1K2J0j3l2l7k8j1KNj0k9k6KK7L0J9J9K3J6mj4q
4436A70KMMJ1J2MonJLkj0j5rOK3K1O%J6L1K0pj9j2nrqOJ4Lj5k7l0l1l5k9j3QK2K4J9J9K4K6
4417B12J8jj5k1k7k8j7RL0K4lk9l6k8j1KONQRjj5k1mK2L7L6K5J0kqrj3k2k5k0j9k3j4J5L6
4399I2K4mj2NJ6On%PJj0j3j3j4j3lPNljQJ7L0N1O5N2J1k6l3j1K2M6N4M4K6J4PLj0l1n3o1n0
4380B47k4jKj2k2j0J6K7Ok5k8%K8J8j5l3j8%QJ3K4L2K0jj5k4l5l4nL4N0L3J1kj5l3m2l2k0
4363A23j9j7KK7L7K7J0%opqoJJ3K3K4J1qk4l1k8j6pnj0mJ5K2J0nkJ7K6J5KLJ3J8J3%j0j2r
$$ y = [191, 208, 206, 186, 159, 138, 130, 130, 138, 158, 178, 177, 151, 126, 123, 130, 120, 93, 76, 87, 117, 141, 147, 140, 131, 127, 126, 118, 94, 62, 37, 28, 39, 61, 88, 110, 125, 142, 169, 198, 208, 192, 165, 147, 151, 177, 215, 243, 243, 217, 191, 185, 191, 190, 171, 142, 122, 124, 151, 184, 200, 189, 169, 157, 152, 145, 136, 134, 130, 108, 70, 40, 33, 41, 49, 58, 78, 105, 124, 130, 133, 144, 161, 179, 196, 212, 221, 213, 190, 168, 158, 152, 135, 107, 93, 108, 139, 160, 159, 151, 154, 167, 186, 207, 229, 239, 226, 194, 157, 129, 118, 120, 125, 115, 86, 60, 62, 89, 119, 138, 157, 180, 196, 192, 178, 170, 172, 176, 180, 191, 203, 207, 201, 196, 197, 200, 198, 188, 173, 164, 170, 193, 214, 220, 220, 236, 267, 287, 280, 261, 249, 244, 235, 227, 233, 247, 250, 235, 208, 178, 147, 112, 83, 70, 78, 100, 124, 143, 162, 186, 212, 230, 229, 214, 193, 166, 138, 121, 130, 160, 184, 181, 152, 116, 88, 77, 79, 85, 90, 98, 107, 106, 91, 70, 66, 88, 125, 161, 186, 196, 194, 186, 177, 164, 142, 117, 97, 78, 55, 41, 56, 92, 116, 112, 100, 105, 121, 127, 122, 122, 129, 130, 120, 107, 94, 80, 67, 64, 71, 76, 73, 72, 80, 97, 127, 178, 243, 295, 306, 280, 247, 236, 258, 304, 358, 402, 428, 442, 449, 452, 442, 411, 358, 297, 247, 223, 222, 224, 212, 190, 180, 196, 223, 229, 204, 176, 176, 204, 222, 207, 174, 156, 156, 164, 177, 201, 233, 253, 252, 237, 213, 178, 144, 139, 173, 223, 256, 267, 265, 250, 217, 175, 143, 123, 104, 87, 89, 116, 153, 180, 190, 190, 184, 177, 169, 163, 164, 177, 200, 224, 235, 227, 203, 172, 144, 128, 121, 116, 106, 102, 117, 139, 149, 144, 142, 159, 185, 200, 202, 205, 218, 236, 249, 249, 239, 227, 218]
4345B18j2j9j6RM2N7M0Ok5l4k1NK1Rj7k9j5Mjk1k9j3J3K5K1J0jnkPJ3PjJJ3J7J1MPJ6J4Mk
4326C31qj9m1n4n0l4j5KJ9K9L5L4K8J1j3k2j1MOkollj0j2%J9L9M6K9ql1k0ORj2k3qQlk5k9
4308A93pJ2J5Plqqmoj3j2OK7L1K4K3L3L4J8nj4j2j4j7j3JJ0Orj5rjmrkR%k4l5j2J9K7J2JP
4288B59J4J5J6J9J4ok5l1k8k7l3l0j2J0K2J6OMJ3J6%j6j1RK3J8J0J0Rlk1l1k7j7oQK1K4J0
4271B42j6l2k4MK8L0Ok1l7l8k9k2j9j4LK6L7K6J2QRkj9j7jJ0MPK7M3K5j3l3k0JPmj5j4lNR
4253A76J0J6K1J5kj8j8j5j1rpj2k4k4JK8L1J5K%%oj2k1l1l2j2J4K0QjJ1K4K7K3K1J3KkMLo
4235B22j2jJ2Qmmjnj6j5JJ0Nmrj5k2k2rMJj3k1j3MJ4J6J7K1J7jk5l5j8OK0J9J7J7J4PJpj3
4216A68j5lJ3J5MqqjLJ2K0K0Oj2j6roj0j3j7k9m7n0k3J9M6M1K0PMMKKJ0J4QkpkNJ0J1RJ1J6
$$ y = [218, 206, 187, 171, 180, 222, 279, 319, 325, 300, 266, 245, 250, 271, 280, 263, 234, 219, 223, 222, 201, 172, 159, 172, 197, 218, 228, 227, 222, 220, 227, 240, 247, 246, 247, 260, 277, 288, 292, 299, 315, 329, 333, 331, 323, 304, 263, 209, 159, 125, 110, 112, 131, 160, 195, 229, 257, 268, 255, 233, 222, 226, 232, 230, 224, 221, 218, 208, 196, 196, 215, 254, 300, 329, 321, 290, 270, 276, 285, 273, 250, 242, 250, 247, 222, 193, 186, 198, 213, 220, 217, 209, 201, 197, 191, 178, 166, 172, 199, 230, 254, 277, 310, 344, 362, 357, 343, 331, 317, 300, 287, 288, 298, 304, 295, 280, 271, 270, 266, 257, 255, 264, 264, 240, 205, 193, 212, 239, 251, 252, 259, 273, 288, 304, 323, 337, 331, 306, 275, 247, 220, 187, 157, 145, 155, 177, 193, 199, 203, 216, 232, 232, 216, 205, 214, 237, 255, 265, 275, 284, 281, 260, 229, 202, 185, 179, 187, 208, 232, 242, 226, 194, 170, 174, 202, 232, 238, 217, 180, 142, 113, 91, 72, 58, 61, 87, 124, 150, 162, 170, 179, 177, 158, 141, 140, 150, 154, 161, 188, 231, 256, 243, 210, 190, 191, 198, 194, 179, 165, 162, 167, 176, 186, 202, 223, 238, 236, 218, 200, 185, 174, 165, 158, 146, 122, 98, 99, 127, 158, 173, 175, 175, 175, 169, 157, 136, 105, 73, 61, 75, 95, 103, 102, 113, 137, 164, 187, 208, 221, 223, 221, 225, 228, 222, 210, 209, 221, 229, 225, 221, 220, 215, 199, 184, 185, 195, 200, 196, 187, 172, 150, 128, 119, 123, 124, 111, 90, 77, 81, 95, 111, 128, 149, 166, 165, 140, 105, 87, 93, 113, 132, 149, 166, 180, 187, 188, 181, 168, 153, 150, 163, 178, 182, 174, 166, 165, 168, 180, 200, 220, 226, 214, 198, 189, 183, 173, 160, 143, 114, 67, 17, -6, 13, 59, 100, 120, 127, 131, 135, 137, 139, 149, 163, 171, 169, 162, 160, 165, 175, 186, 195, 206, 222]
4196B22K1J4kj7j7jJ7J5jj4oK3M0K4j4l7k5JJ1Kj0j4j5j7j5j0j0j5j5mJ1J6J0kj2j4j0jJ0
4180A39K0K3J2j1l0l0j3LJ2K1L0L3K7J9J5J2J2J9K8K4%l2n6o1n4l6j2RJ6J4J3J9K5K4J4jj3
4164B34j1kLlo%QPnj4j7k3l1k9j5OJ8J9J4RJ3K4L4L2J4pk3k7k5k0j4j2j1j5k8l9l2jL7N1L8
4146A51J8J1J3J4J2J5K1J5kj7j4NK0K2J1Jj2k0k2j2lqj8k2j4lJ0K7L5K1rk9j5J4K6J0j1j5
4129B26kJ3J8Rrk2k2j8j4j4oJ1K6K3J2OJ0J1nl0l7j3J8L1J6jrj2j8j4PK7K2MoMJ4J7J5J9J6
4112C23Ooj2j2j1mRJ9J9J1kj9l2l3k3j5j3j2rmk%kmnLJ2J3MMJ7K5J8Mnj3k2k5j2Jnj8j5J0
4092A63L5L9K4Mqj0mLQJ3K0J4qk9l2j8m%jjnj2j2lKqk5k8j3PJ2%j0nJ1J7Onm%pk0j9mJ1J2
4073A06Noj5pK2M7M0Nj9rJ2J9J2Nok4l7k3J0K9J9lj6rNJ7J5J0J1K1K7J2j7l8l7j9qj0j9j7
$$ y = [222, 243, 257, 255, 238, 221, 220, 237, 252, 251, 237, 231, 254, 294, 318, 304, 267, 242, 243, 254, 256, 246, 232, 217, 200, 185, 175, 165, 150, 135, 131, 142, 158, 168, 166, 154, 140, 130, 129, 139, 159, 182, 194, 183, 153, 123, 110, 113, 125, 146, 176, 209, 236, 255, 270, 282, 294, 313, 341, 365, 365, 333, 277, 216, 162, 126, 114, 123, 139, 153, 166, 185, 210, 234, 248, 247, 234, 223, 221, 224, 221, 215, 215, 223, 230, 225, 211, 194, 171, 140, 111, 96, 102, 120, 139, 153, 162, 175, 199, 233, 265, 279, 272, 249, 222, 197, 177, 163, 151, 140, 125, 97, 58, 26, 25, 62, 113, 151, 169, 180, 193, 207, 219, 234, 255, 270, 268, 251, 237, 242, 262, 284, 295, 296, 284, 264, 242, 230, 227, 219, 201, 179, 165, 162, 172, 199, 234, 255, 246, 217, 202, 216, 242, 252, 241, 226, 224, 237, 255, 264, 255, 233, 211, 193, 179, 165, 159, 170, 196, 219, 231, 237, 247, 258, 253, 223, 186, 173, 191, 222, 238, 237, 228, 216, 198, 184, 191, 218, 240, 244, 238, 242, 256, 273, 288, 307, 323, 329, 323, 311, 299, 288, 284, 293, 312, 331, 342, 340, 321, 289, 256, 233, 218, 205, 193, 184, 180, 178, 178, 176, 172, 167, 170, 182, 195, 199, 203, 220, 245, 263, 267, 262, 249, 227, 202, 190, 191, 186, 168, 153, 163, 198, 237, 261, 265, 257, 247, 243, 246, 254, 267, 287, 301, 293, 264, 232, 214, 210, 210, 209, 208, 203, 191, 179, 176, 178, 170, 145, 117, 104, 111, 123, 123, 113, 108, 119, 136, 142, 137, 133, 133, 126, 106, 87, 83, 94, 106, 111, 105, 90, 83, 105, 152, 192, 197, 178, 169, 181, 200, 212, 217, 211, 187, 150, 127, 137, 166, 185, 182, 166, 157, 162, 179, 194, 204, 215, 236, 263, 275, 258, 220, 183, 164, 156, 146, 127, 110]
4055A10mJ0J1QRJ7J2oj6KL1M5L1Mk0k7j6LJ2lk3k5j1%%lnj0j5j6j1rj2qKQjj6k1j6qMJ9K9
4036F5K6J3KjNJ4J6Rmj0lLKLJ1J7J1kmOJ4J5J6K0K4J4lj9k3j8j0MK2L6L6J6j2k6l0l4m6m7
4018A28k1J1J9KqQK7K7RJRK0K2J0mj5j6pNPjj2k1k1j1MJ2RJ0J9K2Rj2j9j0%pk3l2k5j0NRK
3999A31kPK3K2Jj3nJ4J8J3J3J5PqpJ2K0jk7l4j6QK6K5mm5o1l4RK6J8J6K3K0qk9k0J1L3L6K8
3981B61J3ok3l1l0k8k2qLQQJ1J9L1M5M9K6j8m5l0MJ8%k2k4j3mMRJ1PLNJ1J7K4K9K1Jj5j5o
3963B98%kj0k2m0m8l4j1L%mKJ5K5L5L9L3J4mj0qj0k0l0l1j7NK5K4ll6n0l6qOLlLK1L2K4PK
3944A79J6L5L7K2OJRK0K7K8K2J3Jj2k9n2p0o9m9k5j0jJ2K6L4K8J4kj2j3j1j0rlJ0J4jk1k0
3927A35NK7K1KnOJ6J9K0K4K1QKJ3K5J7j8n8p6o5l4kJ5J3N%lmpj3j6j2NL0M3L4Pj7k3j2J0K4
$$ y = [110, 106, 116, 127, 135, 144, 161, 173, 167, 151, 153, 184, 229, 260, 264, 244, 217, 201, 204, 216, 213, 190, 165, 154, 154, 154, 151, 146, 136, 121, 105, 94, 85, 73, 65, 67, 75, 74, 58, 37, 21, 13, 17, 36, 65, 91, 104, 106, 105, 110, 124, 140, 149, 145, 135, 132, 135, 137, 140, 151, 168, 179, 177, 173, 179, 193, 208, 224, 244, 268, 282, 279, 260, 237, 219, 209, 213, 235, 271, 307, 323, 311, 285, 255, 221, 175, 128, 107, 118, 137, 139, 131, 139, 166, 193, 202, 203, 212, 232, 254, 264, 260, 245, 229, 222, 227, 234, 233, 221, 200, 179, 168, 172, 184, 193, 203, 222, 244, 253, 241, 222, 212, 212, 205, 182, 150, 125, 115, 120, 129, 131, 129, 136, 159, 181, 182, 169, 164, 178, 196, 209, 222, 237, 244, 236, 229, 241, 261, 260, 233, 199, 183, 191, 217, 242, 238, 193, 132, 98, 107, 133, 151, 167, 190, 210, 202, 173, 153, 164, 197, 233, 261, 274, 268, 245, 214, 184, 156, 134, 126, 129, 137, 145, 156, 175, 206, 251, 300, 326, 308, 263, 233, 237, 255, 255, 233, 209, 196, 192, 196, 205, 216, 223, 226, 231, 242, 259, 283, 312, 333, 334, 319, 304, 298, 298, 296, 286, 264, 224, 176, 142, 131, 134, 134, 130, 132, 147, 172, 207, 246, 279, 293, 289, 279, 271, 261, 241, 211, 180, 163, 168, 193, 217, 214, 178, 128, 92, 84, 90, 93, 90, 93, 114, 146, 170, 177, 179, 195, 230, 267, 289, 295, 296, 305, 325, 352, 380, 402, 415, 416, 404, 375, 323, 253, 184, 135, 110, 100, 99, 111, 137, 171, 199, 213, 211, 199, 186, 175, 165, 156, 153, 163, 177, 176, 155, 135, 140, 167, 188, 190, 185, 191, 207, 226, 246, 270, 291, 299, 301, 314, 339, 356, 338, 280, 204, 139, 105, 103, 118, 131, 136, 136, 133, 129, 122, 109, 93, 81, 86, 116, 159, 193, 200, 183, 160, 148, 158, 182]
3909A82K7K0J5J3Qrl0l9k8jK4L3K4Oqj4j1kRJ5Lj7k6qK1L9L4J1j5k9k2jJ2Kj6k2j2%KJknq
3890A76nPK1K2J0pk0k0rPJ3J3RQ%rj1poj6k0qJ3K4K4K3K1Rj1k2j0J1J6Kj4j5jONMJ3K4K3R
3871C02nnPJ9K6J5j3m7o0m3j5loj4j6j4j0JJ7K7K6J9Q%j0k1k6j7RL3L5J1j6j8JK4L3K9J0j5
3854B78l6l9l0j9oJ4K9J8rk6j4J%j1jK7N0N5M7L3J0j4j9lJ1Mj8l6l8l1k5k1k0k2j7lK3M0L5
3837B17Rj9k3lJ5K0K1K9L4J2k5m0k0RRj6m1m0k3MK5L8L1J1j3l2m4m3k3OK5K5J6J2J6J7J3Q
3821B17KjkLJqk0k0rLQQKj1k4k7j7mkrj2rnLK3M3M5K5KnJPQQMLNJ2J2ok1j6NK1K1J5Nj7m7
3799B20n9l4J1L8L0Nj5j4mLKmmjoj9k4kL1L9J3j9k4lJ7J4pk6l4k6j1LJ0J6K2K3Qrj3JQqk7
3781A21k2QL7M2L1K0J0lj6j5njqj9k5k3j9j3JK2M1M2K6Ono%J0K5K9J3j7l0j3QQrj4%J1J0%
$$ y = [182, 209, 229, 244, 257, 265, 256, 226, 187, 159, 158, 182, 215, 239, 245, 237, 223, 212, 210, 219, 234, 237, 220, 194, 186, 207, 246, 280, 291, 276, 247, 225, 224, 236, 238, 222, 200, 188, 188, 190, 191, 189, 184, 176, 171, 178, 199, 221, 231, 224, 204, 184, 175, 182, 195, 208, 217, 225, 225, 216, 205, 198, 192, 176, 156, 148, 161, 185, 209, 232, 253, 262, 251, 229, 219, 230, 246, 248, 234, 219, 218, 224, 229, 233, 246, 270, 293, 302, 297, 292, 299, 318, 344, 359, 346, 299, 239, 196, 181, 178, 172, 158, 142, 128, 118, 119, 136, 163, 189, 208, 216, 216, 206, 185, 159, 142, 151, 184, 219, 230, 214, 196, 197, 221, 254, 283, 293, 278, 242, 203, 173, 154, 148, 162, 191, 209, 200, 174, 160, 161, 161, 150, 149, 176, 226, 281, 328, 361, 371, 357, 338, 335, 346, 350, 332, 296, 258, 227, 202, 181, 161, 139, 122, 119, 142, 182, 217, 226, 207, 184, 181, 196, 216, 237, 266, 300, 312, 287, 247, 227, 236, 245, 229, 188, 148, 125, 129, 154, 192, 223, 234, 221, 189, 145, 102, 79, 85, 110, 135, 151, 163, 179, 196, 209, 217, 219, 218, 216, 219, 220, 212, 192, 172, 163, 166, 174, 182, 184, 173, 149, 122, 105, 101, 99, 90, 78, 69, 64, 67, 90, 133, 178, 203, 205, 200, 201, 208, 216, 224, 228, 231, 236, 248, 260, 254, 233, 217, 222, 243, 264, 279, 284, 267, 220, 161, 127, 138, 176, 206, 211, 196, 182, 178, 181, 183, 179, 175, 174, 168, 149, 125, 123, 154, 193, 206, 187, 163, 160, 177, 191, 184, 158, 124, 98, 87, 90, 100, 116, 138, 161, 169, 160, 147, 148, 156, 148, 121, 99, 107, 144, 186, 217, 237, 247, 244, 228, 213, 208, 207, 199, 180, 155, 132, 113, 100, 101, 123, 164, 206, 232, 238, 233, 227, 227, 237, 262, 291, 304, 287, 257, 244, 252, 260, 251, 237, 237, 248, 258, 258]
3763B58j1k2k2lJ9J9%j2lJ0J3J7K4J6j9n0m4qK3L9M8M6J7k4m3l6k5k9l5k6j5rmJ6L8M1K1j0
3746B15l0l0j0J5K7K0Lj1k0k2j8j1j1j3mJ8L5L0J7J0J4J8K0J7Qqk2k8l6m5m0j3J1J4%pKJ1
3730A26J8L0M4M0Rk3l0pK4L4K0kj1jJ0Orj5j0mooLQ%j2j5j1kRK3K8J1j7l0k0JQKmkK%lMK6
3710B46M5M8L6K0kl1n9o5n1l9l9l9j7K3N9P0M9J5j3j8j0qj8k1qKkj3j0jJnjPLj4j6OL0L4K6
3692B20K8L6L1J6LKPJ4K3K4Pj8l0j9j0k0l7l8j9MK0K8L0J6j3l8m0k3lJ0J6J6Mj5k6k0KK5L2
3675B45K1%j2j3j7l2m7m0j2J7K4K3K5K7J7ok5l3l1j6J6M6M6J5k3m3m3l3j8LJ1jk5l2j3K2M7
3659I0N1L8K0J0Mql0m3k9RL8L6J0k0l9m6l4lL4M9L5Kj8k0qLJ1J3J0Kj0j3pjmj6k1pJ3K1J5
3641A37MNJ0QjpplMJ3J5%k0k1mJ0OjPJ8J4jmPJ8J4Ojmj1j6j0OK1J8jj6j1J0K0Nj6j6jJ0Mo
$$ y = [258, 247, 225, 203, 200, 219, 238, 238, 226, 223, 233, 246, 263, 287, 303, 284, 234, 190, 182, 205, 244, 292, 338, 355, 331, 288, 252, 227, 198, 163, 137, 122, 113, 109, 125, 163, 204, 225, 215, 185, 155, 145, 160, 187, 207, 210, 199, 179, 157, 139, 128, 117, 104, 100, 118, 153, 183, 200, 210, 224, 242, 262, 279, 287, 279, 257, 229, 193, 148, 108, 95, 106, 120, 120, 113, 115, 126, 144, 174, 218, 258, 267, 244, 214, 207, 231, 265, 285, 283, 272, 271, 281, 287, 278, 263, 253, 249, 243, 237, 240, 248, 248, 236, 221, 210, 208, 217, 240, 268, 279, 262, 232, 212, 213, 221, 223, 219, 217, 219, 219, 216, 220, 246, 291, 339, 375, 395, 393, 362, 303, 238, 187, 148, 109, 70, 53, 76, 135, 205, 254, 269, 256, 238, 228, 220, 202, 181, 173, 175, 173, 160, 150, 149, 150, 145, 144, 151, 154, 140, 124, 130, 160, 194, 220, 248, 284, 315, 331, 334, 336, 343, 357, 380, 404, 411, 393, 363, 344, 334, 314, 277, 239, 220, 224, 244, 272, 302, 318, 305, 267, 227, 204, 201, 211, 227, 243, 247, 232, 206, 186, 188, 213, 245, 266, 266, 254, 241, 224, 192, 145, 105, 93, 110, 134, 157, 182, 209, 226, 220, 195, 162, 131, 115, 131, 177, 223, 238, 215, 172, 129, 96, 78, 81, 92, 91, 66, 34, 21, 43, 90, 141, 179, 199, 209, 213, 205, 175, 132, 103, 112, 150, 186, 196, 176, 137, 91, 57, 54, 88, 137, 172, 174, 156, 136, 128, 131, 142, 155, 165, 167, 157, 144, 137, 136, 132, 116, 95, 88, 101, 122, 137, 141, 146, 156, 164, 163, 156, 149, 146, 150, 163, 178, 178, 158, 137, 133, 143, 149, 148, 155, 173, 187, 186, 182, 189, 207, 221, 227, 226, 222, 211, 195, 185, 191, 212, 230, 229, 213, 202, 212, 232, 237, 221, 205, 204, 214, 218, 212]
3621B12j4k2k8k3rmJK0M5N1K4j5l0k3oJ0J8Rrj5kJ7J8Okoj4k3j6JJ2J2Pjj6k3oL1N9O1M4K6
3603C77Rqk3k9k4j2Jok9m9l6kK3K1Okm%QJ7J3nj7j1%jqqJJ4K3K4Ok4m0k5MJ1j2l7m2k9j5l
3584E7J3K7K4Jk3j9J0L2K6RNJ8K2J8K1L1K1j7m8m0%K8K9J6Ojorj1j9l1l4k6j1KJ0J2Olj0j8
3566A18k9l3j8QL0M4M9M2K6J7K5L4J9j2l2l6m0m8l7qJ7J7M%MOOOkk0l1k0LJ9J7PnpjKjjJ7
3547A56M9O0L4nk5k6k3k2j8j4j8j7%K4K9J0j2k4k2oJ4K6J4opQJ2NOK6M0K5KkN%k0l5k9j5p
3529A92qj1j5k4l3k5mJ1PrpJ6L4K1pj7lJ5J9J6J3R%KJ5K3J2oj4j6k8m6n1l3j0OJ1J6K2K7L1
3512A51K8J8LmkPJ1Q%oj0qJJ3K1Ok1m2l2mJ8K0J6J5J5J0NJ2K7L6K7J3NPOrl8n6n0k1LJj2j5
3493A73kQMmnmomJ0K9L9L1J6OJoj5j8j0MJ3J2Kqj4j5j4j6j9j7j1nJPRmk4l1j1J3J8OkLJ1J1
$$ y = [212, 198, 176, 148, 125, 116, 112, 113, 133, 178, 229, 253, 238, 208, 185, 179, 189, 207, 216, 207, 192, 190, 207, 225, 231, 229, 223, 209, 186, 170, 171, 183, 195, 202, 201, 185, 162, 156, 187, 246, 307, 351, 377, 386, 378, 355, 326, 302, 290, 291, 285, 256, 207, 171, 169, 192, 213, 219, 217, 213, 213, 221, 238, 251, 246, 229, 218, 218, 217, 209, 201, 202, 216, 239, 263, 269, 245, 205, 180, 184, 195, 183, 146, 104, 75, 60, 57, 70, 97, 121, 122, 99, 80, 90, 122, 148, 157, 162, 180, 202, 220, 241, 272, 293, 276, 228, 188, 188, 216, 245, 261, 267, 266, 260, 251, 240, 221, 190, 156, 130, 119, 121, 131, 143, 149, 146, 136, 118, 89, 56, 38, 46, 76, 120, 169, 211, 237, 254, 279, 313, 332, 320, 288, 252, 212, 164, 127, 119, 136, 153, 157, 157, 161, 167, 173, 179, 177, 157, 126, 106, 109, 128, 145, 152, 147, 140, 139, 141, 140, 139, 156, 205, 265, 299, 294, 269, 243, 220, 198, 180, 166, 148, 131, 131, 155, 184, 194, 182, 158, 136, 130, 144, 170, 184, 178, 171, 179, 191, 196, 202, 228, 268, 293, 295, 293, 298, 298, 278, 243, 214, 199, 192, 184, 173, 158, 134, 101, 76, 72, 83, 90, 81, 74, 90, 124, 145, 138, 121, 118, 133, 152, 168, 181, 190, 190, 192, 207, 230, 242, 236, 222, 206, 178, 132, 81, 48, 38, 44, 55, 71, 93, 120, 151, 179, 197, 200, 196, 194, 201, 212, 220, 220, 214, 204, 196, 197, 210, 231, 237, 216, 174, 142, 138, 156, 176, 192, 207, 222, 232, 237, 249, 276, 312, 339, 352, 357, 364, 370, 361, 323, 267, 217, 196, 199, 200, 188, 173, 171, 179, 183, 179, 174, 170, 164, 160, 170, 199, 238, 269, 285, 291, 292, 286, 271, 253, 243, 247, 260, 272, 274, 266, 252, 237, 223, 207, 188, 171, 160, 155, 156, 163, 172, 168, 144, 113, 102, 115, 133, 139, 137, 140, 151, 162]
3473A62%j6l0k5KK4K2KKK3L1Ok1k4r%OK3L6K3mj6j0rj8k0j0lj1k1k3k1j3MK3K2PKJ5J8lj9
3454A27oJ9K0%j5j5j3j2%K0K3Kj9j6JJ0OJjlrj2lJ7L1L4K5J9J8J8Qpj5j3%J4K4K1Mj2k0j6
3436B55j8k5k4j7j5k7l8k4QK9K8J4J1J8K5K6K1J4Lorj3k9n1n6l3MK7L4L4L3K4J0JKPLj1k5
3419B10l2k1JK2K6J8J2Pjj5k4k2j6j3j5k0k9k8rJ9L0J8LMJ2J4J3K2L5L9K5Mj1k0j8j3j0j2
3403B05j4oMRPKklLJ5J7jk3k2mQJrmJ2J8Nj4j9JL1M4K5lj9j4m%OJ5J9J0rk4k8j7njj4k1rJ4
3382A82K5J6ONNLJMKkjLmj6j4RK9L0J5%j8m0m3j9OOj3j9pQJ8L0M2M3K8J0j0l5n2l9mK0J3l
3363B20pjj0k7l6k8j0LPNPJ8L0K3jk2k8j9mJ8L7L8J6nnJ3J8Pmqj3k5l2j8RL7N3N7M2J3j5k4
3345C29j6j1j4k1k0j8j5j9k5l0k3kK4L1K2Noj5k0k0j0JLkoj0j3j5oJ3L6N2N0K1j7l2oL1L7
$$ y = [162, 162, 146, 116, 91, 93, 117, 139, 141, 143, 166, 197, 203, 182, 158, 149, 149, 155, 178, 214, 237, 233, 217, 207, 198, 180, 160, 150, 147, 136, 115, 92, 71, 58, 62, 85, 107, 114, 116, 131, 149, 146, 127, 121, 140, 160, 160, 145, 130, 117, 105, 105, 125, 148, 150, 131, 115, 116, 126, 132, 133, 132, 129, 120, 108, 105, 122, 153, 187, 212, 231, 249, 267, 275, 268, 253, 240, 240, 254, 278, 299, 303, 291, 271, 255, 237, 212, 188, 171, 156, 129, 91, 67, 75, 104, 132, 146, 157, 175, 200, 226, 247, 261, 264, 258, 249, 236, 207, 156, 100, 67, 71, 98, 132, 166, 199, 223, 233, 234, 236, 243, 246, 235, 210, 178, 157, 158, 180, 206, 224, 236, 243, 242, 227, 203, 181, 165, 152, 137, 117, 88, 60, 51, 70, 100, 118, 121, 125, 137, 151, 164, 186, 221, 260, 285, 289, 278, 258, 240, 227, 217, 205, 191, 185, 189, 198, 205, 207, 205, 202, 205, 220, 237, 236, 213, 191, 187, 195, 196, 187, 183, 195, 213, 218, 204, 185, 186, 217, 261, 286, 283, 264, 250, 246, 246, 252, 267, 286, 296, 287, 263, 235, 218, 213, 212, 198, 177, 168, 182, 207, 223, 229, 234, 239, 242, 243, 247, 249, 247, 246, 249, 245, 229, 215, 224, 253, 283, 298, 298, 280, 240, 197, 178, 184, 190, 177, 158, 151, 159, 177, 207, 249, 292, 320, 330, 320, 285, 233, 194, 190, 210, 223, 220, 213, 212, 202, 175, 139, 111, 101, 104, 111, 116, 123, 141, 171, 194, 193, 171, 143, 124, 120, 138, 175, 213, 229, 224, 219, 232, 250, 257, 253, 245, 232, 207, 175, 157, 166, 203, 256, 313, 355, 368, 353, 329, 313, 302, 288, 267, 247, 229, 214, 195, 170, 140, 117, 115, 139, 170, 192, 197, 191, 176, 156, 136, 126, 127, 130, 128, 122, 112, 99, 84, 78, 91, 127, 179, 229, 250, 233, 201, 195, 226, 263]
3328B63J1j1JK5K6%k6l3k6j6oMOMLOJ6L1M2L9J6j8l9m1k5qPJ1Mj0j8j7qnppkPJ6J5Poj6j7
3309A98j0jJ4K8L3J9pk0kL5N2K5k2n2m6k4mRJ5Pj1k2j8j3j9k6k0j1j3j6j1KRRJ9L5L5J5mo
3292A81RK6L3K4jl2n2m8k2RK9K6QlOK1K1Mj2j4qJJ0J2kk2k4pQRRNqk7k6QL5K6pk7l0l2m1l4
3273D1lL7O3O0L4Mqnok0l5l5k3nJ4L9N0L6J0nmkmpmJJ4L1L3Qk2k6lJ5RnrjOJ2J2Mj0j7j6j6
3253B42j9j5m%pqMJ9J7Kj3k1j9j0MRLkJOPlj7l1k8oJ7K3J2Lmk2m5l8%L3L4J2Jkrj7nK1L5K8
3233A88J7J8K1J3lj4j2lKKKJ2K0J5%lOJ2LmNJ8Qj9m0l9k7j9k3l9n0l3QL8L5J2LJ3K1J5OPR
3214B01J0J1J1kk0k4mK0K8J7QNMkj0pRK4K5Mj9k2qNJ0Nok2k5jL3M8L4J4NLMLJj0k6k8j7qj3
3195B68j8qKkj3j3pj1k3k8k0qPL0M5L6Qj3rNJ2J3J6J6kk8l5j1K0K1qk8j8J1K3Qj2k3k3k3k0
$$ y = [263, 274, 263, 264, 289, 315, 315, 289, 256, 230, 214, 208, 212, 218, 222, 225, 231, 247, 278, 320, 359, 375, 357, 318, 277, 252, 244, 251, 262, 266, 256, 238, 221, 213, 208, 201, 194, 192, 199, 215, 230, 237, 231, 215, 198, 188, 187, 201, 229, 262, 281, 274, 254, 252, 287, 339, 364, 342, 290, 244, 220, 216, 225, 240, 247, 236, 214, 196, 183, 164, 138, 118, 107, 94, 78, 67, 69, 78, 87, 106, 141, 176, 191, 187, 181, 190, 216, 249, 273, 272, 240, 188, 140, 118, 127, 156, 182, 190, 187, 193, 214, 235, 239, 227, 213, 205, 206, 216, 228, 226, 204, 180, 173, 181, 190, 199, 204, 196, 169, 143, 151, 186, 212, 205, 178, 148, 116, 75, 41, 38, 75, 138, 198, 232, 236, 228, 223, 217, 197, 162, 127, 104, 99, 113, 152, 202, 238, 248, 243, 239, 237, 233, 226, 222, 223, 237, 268, 301, 309, 287, 261, 258, 273, 282, 277, 268, 267, 273, 285, 297, 301, 291, 274, 258, 242, 223, 208, 204, 204, 197, 189, 193, 212, 229, 231, 218, 197, 178, 168, 172, 181, 184, 182, 183, 189, 196, 193, 176, 145, 117, 111, 128, 151, 163, 166, 162, 140, 95, 57, 57, 90, 124, 136, 137, 135, 126, 109, 104, 125, 160, 188, 205, 223, 244, 257, 254, 240, 228, 225, 227, 229, 231, 243, 263, 278, 278, 275, 281, 293, 296, 292, 297, 315, 323, 304, 264, 225, 198, 179, 156, 117, 67, 34, 42, 80, 115, 127, 130, 143, 164, 179, 185, 192, 201, 211, 222, 233, 231, 211, 187, 183, 203, 231, 248, 256, 261, 265, 263, 253, 246, 255, 279, 304, 308, 289, 267, 259, 264, 274, 279, 273, 251, 226, 225, 258, 306, 340, 354, 359, 362, 366, 369, 370, 360, 334, 306, 289, 281, 268, 250, 242, 244, 242, 229, 216, 209, 198, 175, 147, 127, 119, 126, 156, 201, 237, 245, 232, 223, 228, 240, 253, 269, 285, 283, 255, 220, 209, 229, 250, 242, 214, 196, 207, 230, 238, 226, 203, 180, 157, 137]
3177A37rKPONPQPPOPMmj7k2qJ9L3J9j1k9j5J9N0O0N1L5J3j6m2m6k6nj4l7m0j3J3J2ljJ7L1
3158B17K0pk6k1KK3J9lj5kJ9K8K0kl2n7n6k6PJ4QJ0J8J2rk0j3KQOM%jJMOJ3L0L5J8rj5MJ9
3139B53J2LLjk0m1m0k0LJ8K3J7JnOJ7Pj1j0J0K1Pj4j8oMJ0J0NkLJ3J9Nj2j3PK8K5Nj5k4k7
3121B56l3l3k3lRNrj5j0k%LJ0K4L1K5J8J4J1ol3m9m1j4OQNJ1K0K2K5L4M5L6Ml1m0k6j0j3k2
3103B09j9%J7J7Kj3j5mQJ2P%jKJmmjPK1L7M4L0jk2j9%QLpj6k3k2j1%lj1jK5L6J8j1j6%J5J0
3083C05ok0k3k0k2k8k6qJ8K8K1J8K8L1J3j4k4j6j0j4k1k2j9j3j2j6k7l2k2jJ5K0K2K3K1J6
3067A63J2PjokJ0J5J0JKOJ0ROOJ1J6Nk5m8l4RM0M2K8K2K1J4lj5j7j6j6j2j1j5k1j5jLmpKJ2
3048B13Qqj0OK1K1J8K9M4M1J4j8l1l0k8k8k9l3l9l7k1kLkJJ3K3J7RJ3J6Oj3j7QM3N7L3mk5
$$ y = [137, 128, 130, 137, 143, 148, 155, 163, 170, 177, 183, 190, 194, 190, 173, 151, 143, 162, 195, 214, 203, 174, 159, 178, 228, 288, 339, 374, 387, 371, 329, 283, 257, 252, 238, 201, 161, 148, 161, 173, 170, 169, 186, 217, 237, 230, 204, 183, 185, 208, 227, 224, 209, 207, 226, 254, 274, 272, 240, 183, 127, 101, 108, 122, 130, 140, 158, 170, 161, 141, 128, 130, 138, 144, 148, 148, 147, 148, 152, 158, 171, 201, 236, 254, 245, 230, 234, 253, 265, 268, 271, 270, 250, 209, 169, 149, 152, 170, 193, 210, 211, 206, 212, 229, 236, 225, 215, 225, 246, 253, 239, 221, 215, 219, 229, 239, 244, 242, 245, 258, 277, 282, 270, 257, 264, 292, 317, 322, 307, 283, 256, 223, 190, 167, 164, 173, 178, 169, 154, 144, 142, 142, 145, 155, 179, 210, 235, 253, 267, 278, 272, 239, 190, 149, 135, 141, 149, 154, 165, 185, 207, 232, 266, 311, 347, 351, 320, 280, 254, 244, 231, 209, 190, 190, 207, 224, 226, 213, 198, 194, 202, 214, 221, 221, 220, 222, 223, 219, 215, 214, 221, 242, 279, 323, 353, 352, 330, 311, 311, 319, 322, 315, 299, 276, 254, 243, 243, 240, 229, 228, 253, 289, 307, 296, 280, 280, 295, 305, 299, 279, 256, 236, 214, 186, 160, 152, 170, 198, 219, 237, 265, 296, 309, 295, 271, 255, 245, 231, 210, 188, 169, 156, 144, 128, 101, 69, 47, 46, 61, 81, 103, 126, 147, 163, 175, 182, 181, 175, 173, 183, 198, 208, 209, 211, 217, 227, 236, 242, 248, 259, 275, 280, 255, 207, 173, 182, 222, 264, 292, 314, 335, 349, 346, 331, 314, 298, 282, 270, 259, 244, 223, 208, 207, 210, 206, 199, 201, 213, 221, 213, 203, 209, 230, 251, 269, 298, 342, 383, 397, 379, 348, 318, 290, 262, 233, 200, 161, 124, 103, 101, 104, 102, 103, 116, 139, 156, 165, 178, 194, 200, 187, 170, 178, 221, 278, 311, 307, 282]
3031B82k5j7j7j7mJ5K4K2J3kk1l0k0opk1k5k0k1l3k6NL0K5OKJ5K4K0J2Mpj0JJ6J3qk5j7J0
3014A60L0K7J2OJ3J9Oj9l0j6NJ3Okqj2oJ4L7M9M6L7J9j0l6l8j6KJj1k4k9k1KK4K1nk7k5j7
2996A97j6j6%K1J8pk8j7J8M6N0L6K7K4K0Lj3j1J0J7kl3m5l6k2j7j5qLOMPJ7K5J6ok4j9%J0
2979B40Jj7k7k5j4mOJ0J5L0M8M6J6k3m0k9j2kKJ3J7RnmOQlj9k2j6q%J2K4K5J7Mj0k7m1l7j5
2961A49J2K5K8K4J4Lpj0pljjj1k5k9j7noj2jJ5J9J2J1J6J0j7l6k3QK8L1K6K8L6M6N1M3J9l
2943D40j2j4k8m7n1l3j3rj6k1j1RK1J6%j4j4rpnKKpk1k1rklMK0L4L1K3J8J5J0OJ2K0J4ok8
2925B96l2k1pkqj7j9j4lRJ5J1JnjJ0J7J0lj5j8j7j6j6j3mNMpj8j5mQJ2J7J8Nj8k4lK9M0L1
2906B18K3K8L0J6ok6l9m9m4j6J8L0K0J3K2K5Kk6k7jK1K1J1Mlj1qOJ0ql1l6j9%QJ0Onj0lPM
$$ y = [282, 257, 240, 223, 206, 202, 217, 241, 263, 276, 274, 253, 223, 203, 197, 190, 169, 144, 124, 103, 70, 44, 49, 79, 104, 110, 112, 127, 151, 171, 183, 187, 180, 170, 171, 187, 200, 192, 167, 150, 160, 190, 217, 229, 235, 248, 267, 273, 254, 224, 208, 213, 226, 232, 230, 222, 210, 204, 218, 255, 304, 350, 387, 406, 396, 360, 322, 306, 308, 309, 298, 274, 245, 224, 226, 250, 271, 266, 239, 214, 197, 181, 165, 165, 186, 204, 197, 169, 152, 170, 216, 266, 302, 329, 353, 373, 376, 363, 352, 362, 379, 377, 344, 299, 263, 241, 224, 209, 201, 204, 210, 214, 221, 238, 263, 279, 273, 249, 230, 230, 240, 241, 224, 197, 172, 158, 154, 160, 170, 185, 215, 263, 309, 325, 302, 262, 233, 221, 219, 221, 234, 251, 260, 255, 251, 257, 265, 262, 243, 221, 205, 197, 197, 209, 233, 258, 275, 279, 269, 242, 201, 164, 149, 161, 186, 214, 238, 252, 255, 248, 238, 231, 228, 227, 226, 215, 190, 161, 144, 139, 133, 121, 120, 135, 154, 166, 177, 193, 203, 186, 150, 127, 135, 163, 194, 220, 248, 284, 330, 381, 424, 443, 440, 428, 414, 386, 339, 288, 255, 242, 233, 217, 196, 185, 194, 215, 231, 231, 217, 203, 194, 187, 182, 184, 186, 179, 158, 137, 128, 126, 123, 127, 147, 181, 212, 235, 253, 268, 278, 284, 296, 316, 330, 324, 296, 264, 243, 236, 234, 226, 209, 190, 176, 173, 182, 197, 208, 209, 204, 203, 213, 230, 240, 237, 222, 204, 187, 171, 155, 142, 138, 143, 147, 140, 122, 107, 103, 111, 123, 140, 158, 163, 145, 121, 118, 147, 187, 218, 241, 269, 299, 315, 309, 283, 244, 195, 151, 135, 153, 183, 203, 216, 238, 263, 265, 239, 212, 211, 232, 253, 264, 268, 265, 254, 246, 252, 262, 254, 223, 187, 168, 168, 176, 186, 192, 187, 177, 174, 181, 185]
2888A85opjlj0nJ6L3L0J8J2Qmk4m1n3n6m1j6J%jJ3L0L7M0M6N2L7Oj5j6j1j3j5j4j4k0j6%J8
2870A80K3J1mj5j8j0MJ3J2RJ9L5L4Ll0l6j3QNj7k5j2Jpk6l0j0J5J8%j4mK0L7K8nl3l7j5J0
2853A24J8J5J5K3L0K5J2JJKlj1j3n%%JRJ6Nj7l0k5j2j1j5j2MJ6J1kj1j2j1j7j6nJ2J6MjJ0
2835A41K1J0j8l5k5nMNJ1J5Oj8l3k7j2kRK8M4L7J3JPJ4Mk0l4k8j7j5j6j7j0pno%J1K1K5K3
2817A00K4L1L2K3J1ONjroLKj1j6oJj1l0k6LK9K9Rrj6j1nqj7j9nK1L9M0L2J9Mj2k6l1k7rJ8
2798A70M1M9M1L3K3Pj2k5k3j7j5j9k3l2l9l7j6J3K7K3J2QOjj1j7j1JJ1J3J4J1RMjnj1j7j3
2782A71LJ0pl3l7rK3L5K5J1OQJ4J6jk7l6j2K2L1J5qk0j9qJ1K9L3K2J1%j1j9k0j5j7k0j3kM
2764A66kjJ0J6OpnRJ4Ooj2j3pNJ4J2kj1mOKpjK4L9K3j4l7l3j8j1rjJ0RKmpj9l3l2oK7M5M5
$$ y = [185, 179, 172, 171, 168, 158, 153, 169, 202, 232, 250, 262, 270, 266, 242, 201, 148, 92, 51, 35, 36, 36, 35, 48, 78, 115, 155, 201, 253, 290, 296, 281, 265, 254, 241, 226, 212, 198, 178, 162, 162, 180, 203, 214, 210, 195, 177, 167, 171, 184, 196, 205, 224, 259, 293, 296, 266, 230, 217, 225, 230, 213, 188, 176, 177, 170, 144, 114, 104, 119, 137, 137, 123, 119, 139, 176, 204, 199, 166, 129, 114, 124, 142, 157, 172, 195, 225, 250, 262, 263, 264, 266, 263, 252, 239, 234, 234, 234, 235, 244, 260, 265, 248, 218, 193, 181, 170, 155, 143, 147, 163, 174, 172, 161, 149, 138, 121, 105, 100, 112, 128, 132, 131, 141, 162, 172, 154, 119, 94, 89, 93, 98, 109, 124, 130, 112, 79, 52, 40, 38, 47, 75, 119, 156, 169, 170, 177, 191, 195, 175, 141, 113, 96, 81, 65, 48, 38, 31, 26, 20, 20, 31, 52, 77, 100, 124, 155, 187, 210, 221, 227, 232, 231, 222, 216, 219, 221, 210, 194, 188, 189, 178, 148, 122, 125, 154, 183, 192, 183, 167, 156, 151, 143, 126, 107, 102, 123, 162, 202, 234, 253, 257, 245, 219, 188, 161, 152, 170, 211, 260, 301, 334, 357, 364, 352, 327, 304, 287, 272, 253, 230, 198, 159, 122, 106, 119, 146, 169, 181, 189, 195, 194, 183, 166, 155, 156, 167, 180, 194, 205, 214, 218, 217, 212, 201, 184, 171, 174, 184, 177, 144, 107, 98, 121, 156, 181, 192, 198, 206, 220, 236, 235, 208, 172, 160, 182, 213, 228, 220, 200, 181, 173, 184, 213, 246, 268, 279, 279, 268, 249, 229, 214, 197, 177, 164, 162, 166, 164, 163, 173, 189, 195, 188, 183, 192, 206, 212, 206, 194, 181, 174, 179, 193, 205, 203, 192, 188, 194, 196, 189, 188, 212, 251, 274, 260, 223, 190, 172, 161, 152, 151, 161, 170, 172, 168, 161, 142, 109, 77, 71, 98, 143, 188]
2744A88L8K3kl2m9l8j3NPNQK0K3J9J3J4J1pk3k1kJ1Kj3k0j7qMK0L1L4K7J8Jj5j5LJ8Rj2k7
2727B38k2pQK2K0pm2n1k6PJ8J0JNJ5J8J2lj2j1nrk3k8j2J4K5J9J1J5K3K2J1lq%J8L4L6J5j5
2709C33l3k3kPpk7l9l8l3k4%K7M1L3J3ok0l0k2OM4O7O5M2J2j9m1m4k7KK2K1Lj7k4k1k2l1l8
2692A50k8j0PJ4J0Kpj1mOJ2J1J0QLmlNLrj8pJ7L3K3kk4k8j5oj0j9j7o%mpLJ4J6J9K8L1Qk7
2672A67l3kK8J9qj7JJ2Lj4j9j9k6l8m0k6jK6M3L2Mj6j6mRK0L3L5J7j7m2m0j4J4L0K7J2oj6
2655A18k1j6jJ8K8K4QKOJ6K0K0J8J4Kj2k2k0j0nnmjlj6k7j9JJ2QNJ4K7L1K9L1K8J2lmNKj1
2637B99j8j6j7k7k9j1J6L3K6kk9k7OL3K4pj5RK8J7lmKlk0k8k3rOJ6J1oj6lJ6K0J4J8K0Ok0
2619B87k8j2J0J7J9K5L2L3L0K2Jl1n2n2m4l7k5JL0L9K2rk7k4qjnpJ1L0K6%k0j6mjKJ1J7J1
$$ y = [188, 226, 249, 247, 215, 166, 128, 115, 120, 127, 132, 140, 160, 183, 202, 215, 229, 240, 233, 210, 189, 187, 198, 200, 187, 167, 150, 142, 146, 166, 197, 231, 258, 276, 277, 262, 247, 250, 268, 277, 265, 238, 216, 209, 217, 239, 259, 252, 210, 159, 133, 140, 158, 168, 169, 174, 189, 207, 219, 216, 204, 193, 188, 179, 156, 128, 116, 130, 155, 174, 185, 200, 223, 245, 256, 253, 245, 245, 263, 297, 333, 348, 333, 300, 277, 275, 282, 275, 248, 209, 171, 138, 114, 114, 141, 182, 215, 228, 222, 202, 172, 150, 156, 200, 267, 332, 374, 386, 367, 326, 282, 255, 257, 279, 300, 303, 286, 262, 241, 219, 188, 150, 122, 112, 119, 133, 143, 145, 138, 127, 123, 129, 141, 152, 162, 170, 173, 169, 166, 171, 174, 165, 147, 140, 157, 190, 213, 211, 187, 159, 144, 138, 128, 109, 92, 86, 86, 82, 75, 78, 92, 108, 127, 155, 186, 194, 167, 134, 132, 160, 179, 171, 154, 155, 167, 170, 156, 137, 118, 92, 54, 14, -12, -13, 13, 56, 88, 92, 76, 60, 56, 65, 85, 118, 153, 170, 153, 111, 71, 57, 71, 101, 128, 140, 134, 118, 97, 81, 80, 98, 126, 150, 158, 160, 166, 182, 202, 222, 240, 254, 256, 244, 222, 202, 192, 187, 182, 178, 177, 174, 158, 131, 112, 113, 125, 133, 138, 152, 179, 210, 239, 270, 298, 310, 307, 303, 308, 310, 299, 281, 265, 248, 221, 192, 181, 197, 230, 256, 254, 225, 198, 204, 237, 261, 254, 239, 248, 276, 293, 290, 286, 288, 285, 265, 237, 214, 205, 211, 227, 238, 232, 216, 213, 229, 249, 263, 281, 301, 307, 287, 259, 247, 257, 274, 293, 318, 350, 383, 413, 435, 436, 405, 353, 301, 257, 220, 195, 196, 226, 265, 287, 278, 251, 227, 219, 218, 213, 206, 217, 247, 273, 273, 253, 237, 233, 232, 234, 245, 262, 273]
2602B73ok2l5m0k8kJ5J3QJ7J9ll1l2rNmj5j0jMPJ1PjjJ0J5J0OJ5K7K4J2%j5l1l2j5OJ1ORK0
2583B17K0%k5l4k9j3LJ3J7J3ROjqj0mOJj5k8j3J9L8J9j7k8qRkk0j1J9L9L4J8Omj2j2lLmj0
2564A98rMJ7K4J9jk2k7j7qj0j3oOJ9K8L2K3lk2j7OJ9J4mk0k5j3J2K8J9JmQJ4Jj3j4j1j2j1
2546B10LJ6J1j3l0k5qOJ0J2J2J0QRJ3K0K6K2Oj0j4m%j1k4j9mNkrpmj1j7j6pmqplkmKK3L9L5
2526B35K0PLrk2k0JJ8J0j5l0k2lJ3J9J8J1OMLKJJ5L3L3Qk6l5j6RJ8Nj3k3j8mOjj4k0j3onk
2507A81J1J5ml6n5m8l1j6LK6M8M9L1PqnRK2J9jj7j7pjoj4j8j6j1%J6K6K6J6Noj8k8k6j3MJ3
2489A25J1LJMMqk2l1k8j9pNJ4J2QJ4L5N1M8L1J7OklKll5o7o3k4Mmk4j6J5L3K5J2OLmoNJ7J8
2469A63RLLOJ7L0L2J8%kJ2K7K6Ok0m6n2l8j3jpj0MK7L9L7K9J8jk5l8l1j5qj0j4j4qNJ8J8N
$$ y = [273, 267, 245, 210, 170, 142, 140, 155, 168, 176, 193, 212, 209, 178, 146, 137, 142, 138, 123, 113, 112, 116, 123, 134, 141, 140, 139, 149, 164, 174, 180, 195, 222, 246, 258, 258, 243, 212, 180, 165, 171, 182, 188, 197, 217, 237, 237, 212, 178, 149, 136, 139, 152, 169, 182, 191, 197, 196, 188, 178, 174, 180, 181, 166, 138, 125, 144, 182, 201, 184, 156, 148, 157, 155, 135, 124, 143, 182, 216, 234, 240, 236, 224, 212, 209, 212, 208, 198, 189, 193, 210, 234, 253, 252, 230, 203, 186, 178, 168, 155, 149, 155, 174, 202, 234, 257, 254, 232, 215, 221, 240, 254, 250, 230, 205, 192, 204, 232, 251, 252, 248, 256, 270, 271, 258, 244, 233, 221, 210, 213, 229, 240, 227, 197, 172, 164, 170, 180, 192, 204, 214, 222, 231, 244, 264, 290, 312, 318, 308, 294, 290, 290, 279, 255, 236, 232, 237, 235, 226, 219, 215, 204, 187, 171, 164, 160, 152, 145, 142, 140, 136, 138, 161, 200, 235, 255, 262, 265, 256, 234, 214, 215, 233, 243, 228, 198, 176, 173, 186, 205, 223, 234, 240, 244, 247, 249, 250, 265, 298, 331, 339, 313, 278, 262, 271, 289, 294, 281, 258, 240, 236, 242, 241, 227, 207, 194, 188, 183, 181, 192, 207, 203, 167, 112, 64, 33, 17, 20, 46, 94, 143, 174, 181, 173, 168, 177, 199, 218, 217, 200, 183, 176, 175, 169, 155, 137, 121, 110, 110, 126, 152, 178, 194, 199, 193, 175, 147, 121, 108, 112, 125, 136, 139, 140, 144, 148, 140, 118, 87, 59, 40, 33, 38, 52, 64, 72, 86, 121, 172, 220, 251, 268, 274, 272, 269, 271, 268, 233, 166, 103, 79, 83, 79, 55, 39, 54, 87, 112, 124, 130, 133, 129, 123, 128, 145, 163, 172, 175, 178, 184, 201, 231, 263, 281, 281, 279, 291, 318, 344, 350, 330, 284, 232, 194, 181, 180, 173, 163, 167, 194, 233, 270, 299, 317, 316, 291, 253, 222, 207, 199, 189, 175, 161, 153, 158, 176, 194, 199]
2451A99mKJ9K2RmkPPoj5j1OK6L5K4ll3m4l5k0j0pnkJ0K6L1J4j4k3jK6K4jj7lJ8K1Nj0r%MJ
2432B57rk1k2nK0K8J1j4k1pJ1J2OKjmmRL1L6J6j4k9k3j1nqj4j2kP%j5k2j5qj0j0RK7J9j2l0
2413A53k2lPK1M3N2K3k9o0n2k8qJ6M4O0M0%k5k2mJ0J5J4OnkJ2K3K2J2MKmj7k0j0LJj3k2j2
2395B25J1K8K8J1j6l6l5j7LJ2J4K0K9L2K0Jj4k3l1l6l3j8LK3L1K4Ok0m4n6n0l2j2OJ8K3J4
2379A09lj4mJ0J0jrnkj1j7j0OJ5J5J2Lj0rRK9K7NlJ5L2K3lj2JJ4J4OJj0k5l4k1PK0Pj9l5l1
2360A02j5MJ5K2K2J9J0%mljrk4l1j9%PLjLJ3K3K9K7J1onJ1K2J4pj8j9j9j6lJ4K6L3L9M5L9
2342C53J8ok4l0k1NK1Qk4l7j8QJ7J8L4M5K4k9p0p1l7pJqj1LJ6Ml2n5m2qJ7J9J3OjMK5M9N0
2324B27K6%qnl%LLmj3j3mPJ8K2J7Pkkkj1j9j7nNLqj9k3k4k9l5k7nK2L2K7K1K1K2J8J1Mj1l1
$$ y = [199, 195, 197, 216, 238, 247, 243, 241, 248, 255, 249, 234, 223, 229, 255, 290, 314, 311, 278, 234, 199, 179, 169, 162, 157, 155, 165, 191, 222, 236, 222, 199, 198, 224, 248, 247, 230, 227, 245, 266, 271, 261, 252, 252, 256, 257, 248, 227, 205, 200, 220, 248, 259, 245, 224, 217, 228, 240, 246, 248, 247, 243, 239, 248, 279, 315, 331, 317, 288, 265, 254, 249, 241, 227, 215, 213, 220, 220, 205, 183, 168, 160, 150, 140, 149, 176, 195, 183, 153, 131, 128, 135, 156, 199, 251, 274, 245, 185, 133, 105, 97, 113, 157, 217, 257, 257, 232, 210, 206, 216, 231, 245, 251, 246, 244, 256, 279, 301, 313, 317, 319, 315, 298, 278, 268, 271, 272, 259, 237, 225, 236, 264, 292, 303, 287, 251, 216, 199, 202, 214, 228, 248, 277, 309, 329, 330, 316, 293, 262, 226, 193, 175, 178, 201, 232, 256, 262, 242, 198, 142, 92, 60, 48, 54, 72, 95, 109, 106, 92, 88, 98, 108, 107, 98, 93, 91, 80, 63, 53, 59, 74, 89, 101, 104, 94, 85, 94, 123, 150, 155, 152, 167, 199, 222, 219, 207, 208, 222, 236, 242, 243, 233, 208, 174, 153, 160, 180, 187, 168, 133, 102, 87, 91, 106, 128, 150, 169, 179, 179, 175, 172, 171, 162, 138, 107, 88, 88, 95, 98, 97, 100, 113, 136, 165, 192, 203, 197, 192, 203, 225, 239, 232, 214, 195, 176, 160, 157, 171, 197, 230, 269, 314, 353, 371, 365, 341, 311, 290, 295, 316, 324, 300, 263, 245, 253, 270, 288, 322, 367, 391, 362, 292, 221, 184, 177, 178, 170, 159, 162, 178, 182, 150, 95, 53, 45, 62, 81, 94, 100, 99, 103, 128, 177, 227, 253, 253, 245, 240, 237, 237, 240, 243, 239, 226, 213, 209, 216, 234, 256, 273, 280, 278, 276, 274, 263, 244, 227, 222, 227, 230, 222, 203, 180, 156, 127, 92, 65, 60, 82, 114, 141, 162, 183, 205, 223, 234, 238, 227, 196]
2305A96m3l2jL0M1K9Prj3j4j0mRK2K6K0J0mj4j5kQLpqMJ0NkKKoj8j8mJ7L3L5J6rk1j0KOL%
2285B72j4l1l2oK0J4j1j8lJ4J6J0%rpPJ7Lk3k9j3NQOOJj1j0J5M1M5K6Jj7k3j5JPnk0k9l6l8
2266A35k9j1lj0j8j5qjJ7M7N6K7j1k1oKmkJ5K6J5lpjNQJ3J1lj9k9k5j6%J2J3MmJJ2J8J2lj6
2247A84k2k2j5kK1M3M7K1qj5kNMJ4L2L1Oj6j3nj5l0k5kJ3J5QJj1k0j5JJ0J1J0Nj0j6%K7L4
2229B79J6JKNkj3j1oppkjj7l4l5k0oJ0L4N6M5Jl8l7qJ6J7Onj4k1j9rmrk0j9mJ2J6Qnj6k1j3
2210A01QK9L2J2j5k5j0J7L6L8K5Pj2k5k8j5NJ8Qj7k9k0l%qj3pPK6M8O6N8K5j6m1m0k5r%jm
2192B03m%JJMJ7K9L1K2Mj4k9l7l4k7k1j8k2k6k0MK8L0J3J0L4N9N4K0qj5j4j7j8j5j1oNJ3J
2175B27k2l1j2J3J9J5J4J4Qkqrppj0j7k5j6J0K3J1nLK6L3K1J6J6Jl4o2n9l9k4j3MK2L6M6N1
$$ y = [196, 153, 121, 120, 150, 191, 220, 227, 218, 205, 191, 181, 177, 186, 208, 234, 254, 264, 260, 246, 231, 229, 237, 240, 233, 225, 229, 239, 244, 242, 244, 246, 240, 222, 204, 200, 217, 250, 285, 301, 292, 271, 261, 263, 269, 272, 272, 258, 227, 195, 189, 209, 223, 212, 194, 191, 205, 221, 231, 231, 222, 215, 222, 239, 242, 219, 190, 177, 182, 190, 196, 202, 203, 192, 182, 197, 238, 283, 309, 310, 293, 270, 255, 256, 263, 258, 238, 209, 173, 135, 106, 95, 92, 82, 64, 49, 41, 40, 57, 104, 160, 187, 176, 155, 149, 151, 147, 145, 160, 186, 201, 198, 191, 190, 195, 203, 216, 227, 224, 205, 176, 151, 135, 135, 147, 160, 164, 160, 161, 173, 191, 203, 200, 184, 162, 140, 125, 123, 144, 187, 234, 255, 247, 232, 230, 235, 239, 253, 285, 316, 322, 306, 293, 288, 273, 243, 218, 216, 229, 244, 252, 253, 242, 222, 207, 208, 218, 229, 239, 244, 234, 218, 218, 245, 279, 295, 296, 298, 303, 301, 288, 277, 271, 264, 257, 255, 254, 237, 203, 168, 148, 142, 152, 186, 242, 287, 288, 250, 213, 205, 221, 238, 244, 239, 225, 204, 185, 176, 172, 163, 143, 124, 120, 132, 148, 156, 151, 135, 114, 101, 109, 138, 170, 182, 167, 142, 132, 149, 185, 223, 248, 255, 243, 218, 190, 175, 180, 198, 206, 189, 160, 140, 137, 137, 129, 116, 109, 116, 142, 190, 256, 314, 339, 323, 282, 242, 217, 208, 208, 207, 203, 199, 199, 200, 201, 205, 222, 251, 282, 304, 308, 294, 265, 228, 194, 167, 146, 128, 106, 80, 60, 64, 92, 122, 135, 145, 179, 238, 292, 312, 304, 289, 275, 258, 240, 225, 214, 208, 213, 226, 227, 205, 174, 162, 175, 194, 209, 223, 237, 245, 243, 235, 226, 219, 212, 202, 185, 160, 144, 154, 177, 188, 183, 186, 212, 245, 266, 282, 298, 299, 265, 203, 144, 105, 81, 68, 72, 94, 130, 176, 227]
2157B27M1J5nopk3m0k9lPlj2mO%j5k3k0j2JJ6K7K7K0RlpOK7L5K4J1J0J2jk3l2k1ojjNP%j1
$$ y = [227, 268, 283, 278, 272, 265, 242, 202, 173, 170, 177, 174, 162, 158, 164, 164, 149, 126, 106, 94, 95, 111, 138, 165, 185, 194, 191, 184, 190, 217, 252, 276, 287, 297, 309, 308, 285, 253, 232, 226, 225, 224, 229, 236, 236, 225]
$$ [...]
-3135A49
##END=	
##END=	
