##TITLE=	Nov18-2021.70.fid
TM-VI-171 CDCl3 Sc+ Bz-pyr.

##JCAMP-DX=	6.0	$$ MestReNova 14.3.0-30573
##DATA TYPE=	LINK
##BLOCK_ID=	1
##BLOCKS=	2    
##ORIGIN=	Mestrelab Research S.L.
##OWNER=	hrzepa
##$MNOVA/LINK_BLOCK_TYPE=	ITEM	$$ NMR Spectrum
##$MNOVA/ITEM/POLYGON=	(XY..XY)
5321,5835
8722,5835
8722,8208
5321,8208
5321,5835
##$MNOVA/ITEM/Z=	0
##$MNOVA/ITEM/ANGLE=	0
##TITLE=	Nov18-2021.70.fid
##JCAMP-DX=	6.0	$$ MestReNova 14.3.0-30573
##BLOCK_ID=	2
##DATA TYPE=	MNOVA NMR VIEW DATA
##DATA CLASS=	MNOVA VIEW DATA
##$MNOVA/ITEM/ZOOM/X=	-4.0107147498308073352,	16.011019999997905927
##$MNOVA/ITEM/ZOOM/Y=	-461.46302855014801025,	5067.484619140625
##END=	
##TITLE=	Nov18-2021.70.fid
##JCAMP-DX=	6.0	$$ MestReNova 14.3.0-30573
##BLOCK_ID=	3
##DATA TYPE=	NMR SPECTRUM
##DATA CLASS=	XYDATA
##NUMDIM=	1
##ORIGIN=	Bruker BioSpin GmbH
##OWNER=	nmr
##.OBSERVE FREQUENCY=	400.20240119999999706
##.OBSERVE NUCLEUS=	^1H
##.SOLVENT NAME=	CDCl3
##.PULSE SEQUENCE=	zg30
##LONGDATE=	2021/11/18 13:27:00.000
##.ACQUISITIONMODE=	SIMULTANEOUS (DQD)
##$ORIGINAL FORMAT=	Bruker XWIN-NMR
##$MNOVA/SCALES_VERSION=	9
##$PARAMETER FILE=	(acqus, ASCII, /private/var/folders/f6/rjf_tdyn2v98c5c0wvkgn4s80000gn/T/E+wgdhFMQwKAqwn9zIow1w/70/acqus, 0)
$$ ##TITLE= Parameter file, TOPSPIN		Version 3.2
$$ ##JCAMPDX= 5.0
$$ ##DATATYPE= Parameter Values
$$ ##NPOINTS= 11	$$ modification sequence number
$$ ##ORIGIN= Bruker BioSpin GmbH
$$ ##OWNER= nmr
$$ $$ 2021-11-18 13:27:15.939 +0000  nmr@CZC2439F63
$$ $$ /opt/topspin/data/agmb/nmr/Nov18-2021/70/acqus
$$ $$ process /opt/topspin3.2/prog/mod/shimcntl
$$ ##$ACQT0= -2.10084033613445
$$ ##$AMP= (0..31)
$$ 100 100 100 100 100 100 100 100 100 100 100 100 100 100 100 100 100 100
$$ 100 100 100 100 100 100 100 100 100 100 100 100 100 100
$$ ##$AMPCOIL= (0..19)
$$ 0 0 0 0 0 0 0 0 0 0 0 0 0 0 0 0 0 0 0 0
$$ ##$ANAVPT= -1
$$ ##$AQSEQ= 0
$$ ##$AQ_mod= 3
$$ ##$AUNM= <au_zg>
$$ ##$AUTOPOS= <49 >
$$ ##$BF1= 400.2
$$ ##$BF2= 400.2
$$ ##$BF3= 400.2
$$ ##$BF4= 400.2
$$ ##$BF5= 400.2
$$ ##$BF6= 400.2
$$ ##$BF7= 400.2
$$ ##$BF8= 400.2
$$ ##$BYTORDA= 0
$$ ##$CAGPARS= (0..11)
$$ 0 0 0 0 0 0 0 0 0 0 0 0
$$ ##$CFDGTYP= 0
$$ ##$CFRGTYP= 9
$$ ##$CHEMSTR= <none>
$$ ##$CNST= (0..63)
$$ 1 1 145 1 1 1 1 1 1 1 1 1 1 1 1 1 1 1 1 1 1 1 1 1 1 1 1 1 1 1 1 1 1 1 1
$$ 1 1 1 1 1 1 1 1 1 1 1 1 1 1 1 1 1 1 1 1 1 1 1 1 1 1 1 1 1
$$ ##$CPDPRG= (0..8)
$$ <> <> <> <> <mlev> <mlev> <mlev> <mlev> <mlev>
$$ ##$D= (0..63)
$$ 0 1 0 0 0 0 0 0 0 0.06 0 0 0 0 0 0 0.0002 0 0 0 0 0 0 0 0 0 0 0 0 0 0 0
$$ 0 0 0 0 0 0 0 0 0 0 0 0 0 0 0 0 0 0 0 0 0 0 0 0 0 0 0 0 0 0 0 0
$$ ##$DATE= 1637242035
$$ ##$DE= 6.5
$$ ##$DECBNUC= <off>
$$ ##$DECIM= 2496
$$ ##$DECNUC= <off>
$$ ##$DECSTAT= 4
$$ ##$DIGMOD= 1
$$ ##$DIGTYP= 12
$$ ##$DQDMODE= 0
$$ ##$DR= 22
$$ ##$DS= 2
$$ ##$DSPFIRM= 0
$$ ##$DSPFVS= 20
$$ ##$DTYPA= 0
$$ ##$EXP= <proton>
$$ ##$F1LIST= <111111111111111>
$$ ##$F2LIST= <222222222222222>
$$ ##$F3LIST= <333333333333333>
$$ ##$FCUCHAN= (0..9)
$$ 0 2 0 0 0 0 0 0 0 0
$$ ##$FL1= 90
$$ ##$FL2= 90
$$ ##$FL3= 90
$$ [...]
$$ ##$Sgu3PowerLevels= (0..7)
$$ 0 0 0 0 0 0 0 0
$$ ##$Sgu4PowerLevels= (0..7)
$$ 0 0 0 0 0 0 0 0
$$ ##$Sgu5PowerLevels= (0..7)
$$ 0 0 0 0 0 0 0 0
$$ ##$Sgu6PowerLevels= (0..7)
$$ 0 0 0 0 0 0 0 0
$$ ##$Sgu7PowerLevels= (0..7)
$$ 0 0 0 0 0 0 0 0
$$ ##$Sgu8PowerLevels= (0..7)
$$ 0 0 0 0 0 0 0 0
$$ ##$SguType= 3
$$ ##$ShimPowMaxUA= (0..63)
$$ 130000 130000 130000 130000 130000 130000 130000 130000 130000 130000 130000
$$ 130000 130000 130000 130000 130000 130000 130000 130000 130000 0 0 0 0
$$ 0 0 0 0 0 0 0 0 0 0 0 0 0 0 0 0 0 0 0 0 0 0 0 0 0 0 0 0 0 0 0 0 0 0 0 0
$$ 0 0 0 0
$$ ##$ShimPowMaxUC= (0..63)
$$ 130000 130000 130000 130000 130000 130000 130000 130000 130000 130000 130000
$$ 130000 130000 130000 130000 130000 130000 130000 130000 130000 0 0 0 0
$$ 0 0 0 0 0 0 0 0 0 0 0 0 0 0 0 0 0 0 0 0 0 0 0 0 0 0 0 0 0 0 0 0 0 0 0 0
$$ 0 0 0 0
$$ ##$ShimPowMaxUG= (0..63)
$$ 524287 524287 524287 524287 524287 524287 524287 524287 524287 524287 524287
$$ 524287 524287 524287 524287 524287 524287 524287 524287 524287 0 0 0 0
$$ 0 0 0 0 0 0 0 0 0 0 0 0 0 0 0 0 0 0 0 0 0 0 0 0 0 0 0 0 0 0 0 0 0 0 0 0
$$ 0 0 0 0
$$ ##$ShimPowRcbType= 3
$$ ##$ShimPowRes= (0..63)
$$ 1e-20 1e-20 1e-20 1e-20 1e-20 1e-20 1e-20 1e-20 1e-20 1e-20 1e-20 1e-20
$$ 1e-20 1e-20 1e-20 1e-20 1e-20 1e-20 1e-20 1e-20 0 0 0 0 0 0 0 0 0 0 0 0
$$ 0 0 0 0 0 0 0 0 0 0 0 0 0 0 0 0 0 0 0 0 0 0 0 0 0 0 0 0 0 0 0 0
$$ ##$ShimPowRng0= (0..63)
$$ 1 1 1 1 1 1 1 1 1 1 1 1 1 1 1 1 1 1 1 1 0 0 0 0 0 0 0 0 0 0 0 0 0 0 0 0
$$ 0 0 0 0 0 0 0 0 0 0 0 0 0 0 0 0 0 0 0 0 0 0 0 0 0 0 0 0
$$ ##$ShimPowRng1= (0..63)
$$ 1 1 1 1 1 1 1 1 1 1 1 1 1 1 1 1 1 1 1 1 0 0 0 0 0 0 0 0 0 0 0 0 0 0 0 0
$$ 0 0 0 0 0 0 0 0 0 0 0 0 0 0 0 0 0 0 0 0 0 0 0 0 0 0 0 0
$$ ##$ShimPowRng2= (0..63)
$$ 1 1 1 1 1 1 1 1 1 1 1 1 1 1 1 1 1 1 1 1 0 0 0 0 0 0 0 0 0 0 0 0 0 0 0 0
$$ 0 0 0 0 0 0 0 0 0 0 0 0 0 0 0 0 0 0 0 0 0 0 0 0 0 0 0 0
$$ ##$ShimPowRng3= (0..63)
$$ 1 1 1 1 1 1 1 1 1 1 1 1 1 1 1 1 1 1 1 1 0 0 0 0 0 0 0 0 0 0 0 0 0 0 0 0
$$ 0 0 0 0 0 0 0 0 0 0 0 0 0 0 0 0 0 0 0 0 0 0 0 0 0 0 0 0
$$ ##$ShimSysFunc= (0..63)
$$ 1 2 3 4 5 7 9 11 15 16 8 10 12 14 6 17 13 18 19 20 0 0 0 0 0 0 0 0 0 0
$$ 0 0 0 0 0 0 0 0 0 0 0 0 0 0 0 0 0 0 0 0 0 0 0 0 0 0 0 0 0 0 0 0 0 0
$$ ##$ShimSysMatrix= 0
$$ ##$ShimSysType= 1
$$ ##$TFXNUM= 0
$$ ##$TRIPLO2= 0
$$ ##$VTU= 2
$$ ##$VTUETH= <149.236.99.20>
$$ ##$VTUTY= <no>
$$ ##$WBREFAM= (0..15)
$$ 135.5 97.7 100 100 100 100 100 100 100 100 100 100 100 100 100 100
$$ ##$WBREFLM= (0..15)
$$ 0 0 0 0 0 0 0 0 0 0 0 0 0 0 0 0
$$ ##$WBREFPH= (0..15)
$$ 72.26 -67.22 0 0 0 0 0 0 0 0 0 0 0 0 0 0
$$ ##$WBSGU= (0..15)
$$ 0 0 0 0 0 0 0 0 0 0 0 0 0 0 0 0
$$ ##$XFAC= 2
$$ ##END=
$$ 
##$DECIM=	2496
##$DSPFVS=	20
##XUNITS=	HZ
##YUNITS=	ARBITRARY UNITS
##FIRSTX=	6407.6102040000005218
##LASTX=	-1605.0880428824991668
##DELTAX=	-0.12226593800080109986
##XFACTOR=	1
##YFACTOR=	0.02087675069354965815
##FIRSTY=	6.6274957656860351563
##MINY=	-0.78260862827301025391
##MAXY=	4606.80419921875
##NPOINTS=	65536
##XYDATA=	(X++(Y..Y))
$$ [...]
2851C326K3K2L9N6O5O4M3Ok4j6K5N6M3kl7l8k8l1l9l3oK1K3rn0o5m7l3m8p2o2k6kqj8j1pj5
2846C085j6KJ6Kk4l0j8j8l1k8JL0M0L3K2J4J3K0L4M4N3O3N1Ql2k2L7P7O0K4J8K8J0k5j5N0
2841C576R3N7j3k5K7O2K3m4p1n8n3p3q1n5k3rpnk4o9r2n3J1K0l8q7o8j7jl4p0p5n7l1lK4L4
2837B691J2l4p1p1m3k4l5n1l3J4L7Pm1m9j7RLk4m6n5n1l4pJ2J6J1RJ7K2J7%j9k5j8j7l3m5
2832B034k2K6M7J9k3k7LJ5rl9m0k3k4l9l2QM8M9J4k0k7k0j0%Onl5n5k9K8O2M2%j8pKj2l1l8
2828A818l1k2k1k5k4j1J8M2L3j7o6o3oN1N6J2k6k0J9L7J9j4k1mOpk9k6LK2J4nj0kjlRL5M1
2823A781J8j0pJ5J8nl1l8l0j0K1M3K5k4m9k7P%l2l6JL7M0K2J3Ook0j6mOJ3K9N4O5M1j0n6o2
2818A782k8M%k7l1kJ5nk9j2L0M1J6mOJ3lk1j6j0k5l1KM4L1l2o7k5M3O3L4%j3k1j7J5N2M2j7
$$ plain form
2851 3326 3349 3371 3410 3466 3531 3595 3638 3644 3620 3604 3629 3685 3728 3726 3689 3651 3623 3592 3553 3520 3514 3535 3558 3549 3499 3434 3387 3354 3306 3234 3172 3146 3144 3136 3118 3107 3100 3085
2846 3085 3069 3071 3087 3089 3065 3035 3017 2999 2968 2940 2941 2971 3011 3044 3066 3080 3093 3113 3147 3191 3244 3307 3358 3366 3334 3312 3349 3426 3486 3510 3528 3556 3566 3541 3526 3576
2841 3576 3669 3726 3713 3688 3715 3777 3800 3756 3685 3627 3574 3501 3420 3365 3342 3333 3326 3321 3297 3228 3136 3083 3094 3114 3076 2989 2921 2904 2903 2869 2799 2724 2667 2636 2633 2657 2691
2837 2691 2703 2669 2598 2527 2484 2460 2425 2374 2341 2355 2392 2399 2358 2309 2292 2301 2304 2280 2234 2179 2128 2094 2087 2099 2115 2126 2135 2152 2174 2191 2191 2172 2147 2129 2112 2079 2034
2832 2034 2012 2038 2085 2104 2081 2054 2057 2072 2063 2024 1984 1961 1937 1898 1866 1874 1922 1971 1985 1965 1938 1918 1908 1908 1914 1909 1874 1819 1790 1818 1880 1922 1922 1904 1897 1899 1887 1856 1818
2828 1818 1787 1765 1744 1719 1695 1684 1702 1744 1777 1760 1694 1631 1625 1676 1732 1744 1718 1698 1717 1754 1773 1759 1738 1734 1740 1733 1704 1678 1681 1703 1717 1712 1702 1700 1699 1696 1705 1740 1781
2823 1781 1799 1789 1782 1797 1815 1810 1779 1741 1711 1701 1722 1765 1790 1766 1717 1690 1697 1697 1665 1629 1630 1667 1707 1729 1742 1748 1742 1722 1706 1702 1708 1721 1750 1804 1869 1910 1900 1844 1782
2818 1782 1754 1758 1758 1731 1700 1698 1713 1708 1679 1667 1697 1738 1754 1750 1756 1769 1766 1745 1729 1719 1694 1663 1665 1709 1740 1708 1641 1616 1659 1722 1756 1756 1743 1722 1705 1720 1772 1814 1797
2813A797o4m9jK1J1jj2l3m2mO8J00P0K1RK4K7L1N8R5R0M1nj7j5k3k4lK7M3M5L7J3l0p0q5q6
2809B064p9n4oL0J7j9k7jJ9J2J0L5N6M4Qj8k5k1kK5L3J0k1k7j5jJ2M1N9L1k2l1K6Q4P7K2j3
2804B333oOj0l4l7rK8N8O9N7K7mk5l7l4oL5M6Rm8p3n4k3oKJ8L3K9Pk3m8n2k7K%k9m4k1RP%
2799B125K8O4M5k0n4j9J4pl6rM8O7M6L8M7K5l5p0m6rok6k7j0J1L2N2M6J2k1k7k5k7j9J2K2
2795B241j1n1m3j1ok4j7QNk7l4JK9J2k0k2KK1K0Pj6l0j0K6K3l4q3p1k8rj0%J4ml6l9qJ6J4
2790A795L%nj4j4j4k7m1l5j9k2l6k1K5M7K6Jknk5m0k7rj3j7PL4K3orJ0Ll9o2l0K2L7Qk2k2
2785A465jJ7J7Oj4k9l4j7J0K3RpQL9L6j1m8l9j3qjL8O9L6m1p1k8J1qm4l6KK4J9Qj7n5o8k2
2780A225M7P0L5j1l6m4l3LL9L1j1k6J5O0N4J5mPJ6Rpj9k2mL1M6Jp3j01o0j3j2k4J4Q7J12N6
$$ plain form
2813 1797 1733 1684 1683 1704 1715 1714 1702 1669 1627 1623 1691 1791 1861 1882 1891 1915 1942 1973 2031 2126 2216 2257 2252 2235 2220 2197 2173 2170 2197 2240 2285 2322 2335 2305 2235 2150 2064
2809 2064 1985 1931 1925 1955 1972 1953 1926 1925 1944 1956 1966 2001 2057 2101 2109 2091 2066 2045 2043 2068 2101 2111 2090 2063 2048 2047 2059 2100 2159 2190 2168 2137 2163 2247 2324 2346 2333
2804 2333 2327 2333 2323 2289 2252 2243 2271 2329 2398 2455 2482 2478 2453 2416 2382 2376 2411 2457 2466 2418 2345 2291 2268 2262 2264 2282 2315 2344 2351 2328 2280 2228 2201 2203 2203 2174 2130 2109 2118 2125 2125
2799 2125 2153 2217 2262 2242 2188 2169 2183 2176 2140 2131 2179 2246 2292 2330 2377 2402 2367 2297 2251 2242 2236 2210 2183 2173 2184 2216 2268 2314 2326 2305 2278 2253 2226 2207 2219 2241
2795 2241 2230 2179 2136 2125 2119 2095 2078 2086 2091 2064 2030 2031 2060 2072 2052 2030 2032 2053 2073 2080 2064 2034 2024 2050 2073 2039 1956 1885 1857 1848 1838 1838 1852 1848 1812 1773 1765 1781 1795
2790 1795 1798 1798 1793 1779 1765 1751 1724 1683 1648 1629 1607 1571 1550 1575 1622 1648 1649 1647 1642 1617 1577 1550 1541 1528 1511 1518 1552 1575 1569 1560 1570 1573 1534 1472 1442 1464 1501 1509 1487 1465
2785 1465 1464 1481 1498 1504 1490 1461 1427 1410 1420 1443 1452 1445 1453 1492 1528 1517 1469 1430 1417 1409 1408 1446 1515 1551 1510 1439 1411 1422 1414 1370 1334 1336 1360 1379 1387 1370 1315 1247 1225
2780 1225 1272 1342 1377 1366 1330 1286 1253 1256 1295 1326 1315 1289 1304 1364 1418 1433 1429 1436 1452 1461 1454 1435 1413 1409 1440 1486 1487 1414 1313 1253 1240 1228 1204 1218 1305 1417 1473
2776A473j3k9j1j8m1k8K5N6K4k6l6j4%jPK1K0KJJ6J7ok9l5l4l6k2J3L6K6M%J0Pqj6j3j3j5
2771A314mJ0RjkMMLK4N1M2qm9m2j3kj2qJ2K1Rj0k3l1l5l1j3J1L6N3M9K2lrqk7m7k7L5Q3Q0
2766A467L4j4m7n4l0J4L5Km6o3m7l6l0mL4L4j4n0k0M5P4N2J8kj6k8k1OK5K7K4K2Ll9o8n5j7
2762A215MKkMJ2J7L0L9L0Nj4j4lJLQRNmj1j4j2j2j9k3j3QK6K4J2N%olJ4K7J6KJ6L7J5m1o2
2756A333j6K5mn4m5J7M2Lk9mM2M2RoKOnj3j7k3k7j0J1Pj1mL1M0km7m1ML2K7J6J5J0jpoj4k3
2751A305rK4K5k3p0n6JL7K7RJ2K0J4PJ5K2J1j3k3oJ1Qrk5k0%K1K3Nj7j6OK9K9J3KPMk2m3k3
2746A312K9M9J3l2l8k2k5l6j6K3K6pj7K0M2Rk8jN9O6On5o0k5RL3L3Pl1l8j3Opk3rK2M1L9K9
2741A390J0k0m2l1PM2N5M3Qm0o6m2KJ9nk9j8%j1l5k4K5N7M1NoJKKK2M0K1k0l5j3LJJ6M7M5
$$ plain form
2776 1473 1460 1431 1420 1402 1361 1333 1358 1414 1438 1412 1376 1362 1362 1361 1368 1389 1409 1411 1412 1428 1445 1439 1410 1375 1341 1305 1283 1296 1332 1358 1362 1362 1372 1379 1371 1355 1342 1329 1314
2771 1314 1310 1320 1329 1328 1326 1330 1334 1337 1361 1412 1454 1446 1397 1355 1342 1340 1328 1320 1332 1353 1362 1352 1329 1298 1263 1232 1219 1230 1266 1319 1368 1390 1387 1378 1370 1343 1296 1269 1304 1387 1467
2766 1467 1501 1487 1440 1386 1356 1370 1405 1407 1361 1298 1251 1215 1185 1181 1215 1249 1235 1185 1165 1210 1284 1336 1354 1352 1336 1308 1287 1293 1318 1345 1369 1391 1394 1355 1287 1232 1215
2762 1215 1219 1221 1219 1223 1235 1252 1282 1321 1351 1356 1342 1328 1325 1326 1329 1337 1346 1351 1347 1336 1322 1310 1298 1279 1256 1243 1251 1277 1301 1313 1318 1318 1312 1309 1323 1350 1366 1368 1384 1421 1436 1395 1333
2756 1333 1317 1342 1338 1284 1239 1256 1298 1301 1272 1268 1310 1352 1361 1355 1357 1363 1358 1345 1328 1305 1278 1268 1279 1286 1275 1271 1302 1342 1340 1293 1252 1256 1288 1315 1331 1346 1356 1355 1348 1342 1328 1305
2751 1305 1296 1320 1345 1322 1252 1196 1197 1234 1261 1270 1282 1302 1316 1323 1338 1360 1371 1358 1335 1329 1340 1348 1339 1314 1294 1294 1315 1338 1343 1326 1310 1316 1345 1374 1387 1389 1396 1400 1378 1335 1312
2746 1312 1341 1390 1403 1371 1333 1311 1286 1250 1234 1257 1283 1276 1259 1279 1321 1330 1302 1301 1360 1426 1432 1377 1317 1292 1301 1334 1367 1374 1343 1305 1292 1298 1291 1268 1259 1281 1322 1361 1390
2741 1390 1400 1380 1338 1307 1314 1356 1411 1454 1462 1422 1356 1314 1316 1335 1330 1301 1283 1283 1272 1237 1213 1238 1295 1336 1341 1335 1336 1338 1340 1362 1402 1423 1403 1368 1355 1358 1359 1375 1422 1467
2737A467j2o8o3k3l%J5L2K4RK1L0j6q3p8LO7N7K1Kj2l8m0jK6J4MK9N2L4J2J8K0j5l1K8R5P0
2732A667k2o0rL8J3l4m2j7klj2k8m1k4J6L3Qj9j3J4L1L8L8J7k4n0m3k5k3k1jK5K9J0j6l3l4
2727A381j7OJ8J6J6J0j0k6mM6O5L0j0j5nj3k3nL0M9L6Ll3n6l8RM2L7J9J3Jk4k7J1M4K6j1j1
2723A580J8K2ok9l4m4m5j3L2L8PpMkl6m5j1J7nm0l4MK4J0k1m3m4j6K2L1Jk7j9KMlJ3L9K9j9
2718A354n2l3J9N4L8rl7k6LJl0m0jM3L3j2k7kJ5nk1PN6O5J9l5m7j7J7K6J2jJLqj9qL1O1N2
2713A480Ql6n1l8nK6L9J5k8n1k9J5L3J2j8j6J4L8L0Lj9k2j8j8k0j9j2pmQK7L6L1L0M5M5rq6
2708A429j05l9M3O2K5j3k2k1j8pQJ5K1L2L2lm2l3K6O7M8om8o3o1l8NL9L6Mj7mJ8J8pk3jL4
2704A391L2lj5K5O8M6k1o2n2k0J0L7M4Mm5m0J2L1j1n3l7J0M6O3N4mp4p5OO5K3m5l5L1O0L9
$$ plain form
2737 1467 1455 1387 1324 1301 1298 1298 1313 1345 1369 1378 1399 1429 1413 1330 1252 1255 1322 1379 1400 1402 1390 1352 1312 1311 1337 1351 1355 1384 1436 1470 1482 1500 1520 1505 1474 1502 1597 1667
2732 1667 1645 1585 1576 1614 1627 1593 1551 1534 1532 1529 1517 1489 1448 1424 1440 1473 1481 1462 1449 1463 1494 1532 1570 1587 1563 1513 1470 1445 1422 1401 1400 1425 1454 1464 1448 1415 1381
2727 1381 1364 1370 1388 1404 1420 1430 1420 1394 1390 1436 1501 1531 1521 1506 1501 1488 1465 1460 1490 1539 1575 1578 1545 1489 1451 1460 1502 1539 1558 1571 1572 1548 1521 1532 1576 1602 1591 1580
2723 1580 1598 1620 1614 1585 1551 1507 1462 1449 1481 1519 1526 1519 1523 1521 1485 1440 1429 1446 1441 1401 1367 1371 1395 1405 1384 1341 1297 1281 1303 1334 1335 1308 1289 1291 1295 1292 1305 1344 1373 1354
2718 1354 1302 1269 1288 1342 1380 1371 1334 1308 1311 1312 1282 1242 1241 1284 1317 1305 1278 1276 1291 1286 1265 1272 1328 1393 1412 1377 1330 1313 1330 1356 1368 1367 1368 1371 1363 1344 1336 1367 1428 1480
2713 1480 1488 1452 1401 1363 1358 1384 1423 1438 1410 1359 1330 1345 1378 1390 1372 1356 1370 1408 1438 1441 1422 1400 1382 1364 1344 1325 1313 1306 1302 1310 1337 1373 1404 1434 1479 1524 1515 1429
2708 1429 1324 1285 1328 1390 1415 1402 1380 1359 1341 1334 1342 1357 1378 1410 1442 1439 1397 1364 1390 1457 1505 1499 1451 1388 1327 1289 1294 1333 1369 1373 1356 1352 1370 1388 1381 1358 1357 1391
2704 1391 1423 1420 1405 1430 1498 1544 1523 1461 1409 1389 1399 1436 1480 1484 1439 1399 1411 1442 1431 1378 1341 1351 1397 1460 1514 1510 1436 1361 1367 1432 1455 1410 1375 1406 1466 1505
2699A505K5K0j0m7l0K0K3k4l7RM8L9K1K6J4k7m3lL3J3k2oL9N0J7j2j3rj4j2OL1M2K1k1m3j5
2695A614L5M6Ok9k2MJ3K8N3M8j7p9n4L3P9M0k2l1jJ2j1l7m0k7j8j3KK3K4Kj5nPrl6k4K3M5
2690A647J9j0o%k1m8l5MK4K0J8K1J6Jqqj2qJ3L8L3jk9l0qK3M3L3PJK6N7N9L5Km1q2p4rN1L6
2685A797k5m3NM8K7k9n9m3KL4L0ol4j1M0P0N3J3k3m4m1j0J3ml8k7K9O8N1J5PJ3rn4p6m9NL1
2680A726Ql0k4K1M1ln2k7M0N2j2o1k3M9P4N1L4M3N2M1Rl5o7n9j4K5K1oj9k2k3j1K1M8L8kl7
2676A867m6m3k3J5N4O5M6K4J6J5Kj9k7kL9N0J3l4m2k4k6l9j7M3P9N8J9LKJJ8M0K0m0o2j0M5
2671B080L4JJ9N6M0olM0M4Jj8RK5J3J5M2M3J0nJ4J0k7l8QL9J5j2J1L9J3k5j2K9L6J0JOj1l9
2667B507l4jJ9K5M3N8L9kpL2N5L9J9K1K2MpJ1L1K5QJ3M0N9N0J8rj2MJ1MJ4N7J04J00N9L5M1
$$ plain form
2699 1505 1530 1550 1540 1493 1463 1483 1506 1482 1445 1454 1502 1541 1562 1588 1602 1575 1532 1529 1562 1575 1553 1547 1586 1636 1653 1641 1628 1619 1605 1593 1599 1630 1672 1693 1672 1629 1614
2695 1614 1649 1695 1701 1672 1650 1654 1667 1695 1748 1796 1779 1700 1646 1679 1758 1798 1776 1745 1744 1756 1745 1708 1668 1641 1623 1610 1612 1635 1659 1661 1646 1641 1648 1639 1603 1579 1602 1647
2690 1647 1666 1656 1650 1650 1629 1581 1546 1550 1574 1594 1612 1633 1649 1650 1642 1634 1622 1614 1627 1665 1698 1697 1668 1638 1630 1653 1696 1729 1736 1737 1763 1820 1879 1914 1916 1875 1793 1719 1710 1761 1797
2685 1797 1772 1729 1734 1782 1809 1780 1721 1678 1680 1714 1744 1738 1704 1693 1733 1803 1856 1869 1846 1802 1761 1751 1764 1760 1722 1695 1724 1792 1843 1858 1865 1878 1869 1815 1739 1690 1695 1726
2680 1726 1734 1704 1680 1701 1742 1739 1687 1660 1700 1752 1740 1679 1656 1705 1779 1830 1864 1907 1959 2000 2009 1974 1907 1848 1834 1859 1880 1874 1855 1833 1810 1799 1820 1868 1906 1904 1867
2676 1867 1821 1778 1755 1770 1824 1889 1935 1959 1975 1990 1992 1973 1946 1944 1983 2033 2046 2012 1970 1946 1920 1881 1864 1907 1986 2044 2063 2066 2068 2069 2087 2127 2147 2107 2045 2035 2080
2671 2080 2114 2115 2134 2190 2230 2224 2221 2261 2305 2306 2288 2297 2322 2335 2350 2392 2435 2445 2440 2454 2464 2437 2399 2407 2446 2461 2449 2460 2499 2512 2487 2475 2504 2540 2550 2551 2557 2546 2507
2667 2507 2473 2472 2491 2516 2559 2617 2656 2654 2647 2679 2734 2773 2792 2813 2835 2839 2832 2843 2874 2899 2907 2920 2960 3019 3069 3087 3078 3066 3070 3081 3085 3099 3156 3260 3360 3419 3454 3495
2662C495M3K6K7N8P7N5K8M2P5P4M1J6K2L3L4L7N0O4O2M8L6L7N2P6R4R9R5Q5Q2R6J41K00K29
2658E729K14J91J98K25K42K67L37M34M84M58M11M05M31M47M43M38M31M17M29M89N64O03O15
2655A4902O71Q06R99J221J483J801K159K535K893L163L263L193L047K889K693K410K077J771
2653E3976J502J218Q88N21Q9m34j003j521j938k285k559k704k691k580k426k214j932j653
2651C2254j462j345j227j096j014j011j050j087j113j124j088r93q67p47o43n45m49l49k44
2648A4800j31j7J01K21L34M27N18O27P41Q29Q77Q96Q96Q94R18R90J093J189J292J438J628
2646C0561J811J953K069K172K238K240K172K015J748J406J087Q51O51L96O3l01o72j066j499
2644D9895j964k434k864l176l305l267l129k915k597k189j784j471j246j049q58p11o20n46
$$ plain form
2662 3495 3538 3564 3591 3649 3726 3781 3809 3851 3926 4000 4041 4057 4079 4112 4146 4183 4233 4297 4359 4407 4443 4480 4532 4608 4702 4801 4896 4981 5063 5159 5300 5500 5729
2658 5729 5943 6134 6332 6557 6799 7066 7403 7837 8321 8779 9190 9595 10026 10473 10916 11354 11785 12202 12631 13120 13684 14287 14902
2655 14902 15573 16379 17378 18599 20082 21883 24042 26577 29470 32633 35896 39089 42136 45025 47718 50128 52205 53976
2653 53976 55478 56696 57584 58105 58194 57760 56757 55236 53298 51013 48454 45750 43059 40479 38053 35839 33907 32254
2651 32254 30792 29447 28220 27124 26110 25099 24049 22962 21849 20725 19637 18644 17777 17030 16387 15842 15393 15044 14800
2648 14800 14669 14652 14753 14974 15308 15735 16253 16880 17621 18450 19327 20223 21119 22013 22931 23921 25014 26203 27495 28933 30561
2646 30561 32372 34325 36394 38566 40804 43044 45216 47231 48979 50385 51472 52323 52974 53370 53433 53132 52460 51394 49895
2644 49895 47931 45497 42633 39457 36152 32885 29756 26841 24244 22055 20271 18800 17554 16505 15647 14936 14316 13770
2641A3770m54l78l65m14m58m54m23m18m44m67m61m44m41m44m31m01l63l27k91k70k62k52k22
2639D886j95j92j91j63j20j07j29j32q5l9m1p1p4m6l7p0j02j04r5r7r3o1j7%j9m1m1k7k0l5
2635B442o2p8n3%L0Kn3p2l6JKk3m0m3m8m7k4OJ3ok2k0k1m0n5m3oK1J7rl2l0qJ3J2pj9j4KO
2630A656pk1j3K1M5K2l6p0m5QK7Mj8j4jok0l3m7o2n1pM1N7L3nl4m4k6NJ6%oK3N4L8j7n5m5
2625A367j6MJ2J9J4MQK2J6k8o3m8%K3Mk3k7k1k2k1oJ2J6QJ0J9J8JrLJ8J6J%K3L5J3k4l5j0
2620A333J3mm3n9k8J6L4L3L8N1L6j4n6m7j3nk4k5NK2QpKRrj9J6N8L7k9o0k4J8Rj9j4J1J1q
2616A253mK6L5Kl6l7j4%jlj%jJJjRL9O6N7J8oMK2J3k1m8m7k3RL5M6L8J4j6m9p1p2m8j1K5M9
2610A252M9Pn6q2m3J5L2QJK1K9J3RL7N5K7j4k5j8k4l8k6OK4K9L8M3J1l7m6j0J8Jj8J0O0O4
$$ plain form
2641 13770 13316 12938 12573 12159 11701 11247 10824 10406 9962 9495 9034 8590 8149 7705 7274 6873 6510 6183 5892 5622 5360 5108 4886
2639 4886 4691 4499 4308 4145 4025 3918 3789 3657 3572 3533 3492 3421 3347 3301 3264 3194 3092 2988 2893 2796 2703 2642 2625 2625 2606 2565 2524 2497 2477 2442
2635 2442 2380 2302 2249 2249 2279 2281 2228 2156 2120 2121 2123 2100 2060 2017 1969 1922 1898 1904 1917 1911 1889 1869 1848 1808 1753 1710 1704 1725 1742 1733 1701 1671 1663 1676 1688 1681 1662 1648 1650 1656
2630 1656 1649 1628 1615 1636 1681 1703 1667 1597 1552 1560 1587 1591 1573 1559 1558 1552 1532 1499 1452 1390 1339 1332 1373 1430 1463 1458 1424 1380 1354 1359 1375 1375 1369 1392 1446 1484 1467 1412 1367
2625 1367 1351 1355 1367 1386 1400 1404 1412 1434 1450 1422 1359 1311 1311 1334 1338 1315 1288 1267 1245 1224 1218 1230 1246 1254 1264 1283 1301 1302 1293 1296 1314 1330 1331 1331 1354 1389 1402 1378 1343 1333
2620 1333 1346 1342 1299 1240 1212 1228 1262 1295 1333 1384 1420 1406 1350 1303 1290 1285 1261 1236 1241 1263 1271 1264 1266 1275 1266 1247 1263 1321 1358 1329 1269 1245 1263 1272 1253 1239 1250 1261 1253
2616 1253 1249 1275 1310 1312 1276 1239 1225 1225 1224 1221 1220 1220 1219 1220 1221 1220 1229 1268 1334 1391 1409 1403 1407 1429 1442 1421 1373 1326 1303 1312 1347 1393 1431 1445 1429 1380 1309 1237 1189 1178 1203 1252
2610 1252 1301 1308 1252 1170 1127 1142 1174 1182 1183 1204 1233 1246 1255 1292 1347 1374 1360 1335 1317 1293 1255 1229 1235 1259 1288 1326 1369 1380 1343 1297 1287 1305 1306 1288 1298 1358 1422
2606A422J8k2j3J9K8Rrj1j0j5j5LJ5kk6j0L3M1jk6J2N1J3o8q3j5L9J7l1l4oJ4K0K9K5lk9k3
2601A356kRJ8L8M6J6k1k3JLj0mJ9K0pj9nJ2J9K7M0L0Kj1qj1k2j1J7Rm7o9jQ9Q5mo4k9L4L8
2596A560ok6%K9K2oj8mJ8L2L0J6NRK1J7mk2j5oj7l6l5j5KJ4L9O3M7j6o6n7j5Pnj8j6kK0N1
2591A597N5J5m0m9j3Pj8m8l8nOnnJ1J3j2l2j1L2M3J5mK5O5O3K4kj0l4o9n6J6O3L1l0m0k0l0
2587A510o3n6j2J4J9L7N2J1n9o0K3Q4N1rk1kmj7KK7J5j4j3J1K4K7M6N3J2m1m7j7j1l4l1%J2
2582A519j2k6LM9P1O2K0m6r6p7j6K2J7K2M6L2l4p4l6J9J0l9l8J8N0J6l1l2nkk8m1qM4O4L3
2578A476j8l8k1JKjRJ4j1m3m3j0J0KmK6O4O7L2knJj3l8m0j1K2K5J2QJ1Oj0pJ2J9rm1l3J6N5
2573A492N1J9rj9k5k3lL2M6K1k6n0l8nK5M1K5k4p2p0j4L7L2ol0l1l6m2k5J3L5K9J4ll8o9n2
$$ plain form
2606 1422 1440 1418 1405 1424 1452 1461 1452 1441 1431 1416 1401 1404 1419 1417 1391 1381 1414 1455 1454 1428 1440 1491 1504 1436 1353 1338 1377 1394 1363 1329 1323 1337 1357 1386 1411 1408 1379 1356
2601 1356 1354 1363 1381 1419 1465 1481 1460 1437 1438 1441 1431 1427 1446 1466 1459 1440 1435 1447 1466 1493 1533 1563 1565 1554 1546 1535 1513 1502 1519 1528 1481 1412 1411 1500 1585 1581 1517 1488 1522 1560
2596 1560 1554 1528 1528 1557 1579 1573 1555 1551 1569 1601 1631 1647 1652 1661 1682 1699 1695 1673 1658 1652 1635 1599 1564 1549 1551 1565 1604 1667 1714 1698 1632 1575 1560 1567 1562 1544 1528 1526 1546 1597
2591 1597 1652 1667 1627 1578 1565 1572 1554 1506 1468 1463 1469 1464 1459 1470 1483 1471 1439 1428 1460 1503 1518 1514 1539 1604 1667 1691 1689 1679 1645 1576 1520 1536 1599 1630 1600 1560 1540 1510
2587 1510 1447 1391 1379 1393 1412 1449 1501 1512 1453 1393 1416 1500 1551 1542 1521 1519 1515 1498 1500 1527 1542 1528 1515 1526 1550 1577 1623 1676 1688 1647 1600 1583 1572 1538 1507 1507 1519
2582 1519 1507 1481 1484 1533 1604 1666 1686 1640 1544 1467 1451 1473 1490 1512 1558 1590 1556 1482 1446 1465 1475 1436 1398 1416 1466 1482 1451 1419 1414 1412 1384 1343 1335 1379 1443 1476
2578 1476 1458 1420 1399 1400 1402 1401 1410 1424 1413 1370 1327 1317 1327 1329 1325 1351 1415 1482 1514 1512 1507 1508 1495 1457 1417 1406 1428 1453 1465 1473 1484 1490 1480 1473 1485 1504 1495 1454 1421 1437 1492
2573 1492 1543 1562 1553 1534 1509 1486 1483 1515 1561 1582 1556 1506 1468 1463 1488 1529 1554 1530 1458 1388 1374 1411 1443 1437 1407 1376 1340 1298 1273 1286 1321 1350 1364 1361 1323 1254 1202
2568A202OK5l0q4m9M5R4N5nj8J2L0J3j0j7j2j0j5j6KL2N1N0M1L4L5K9J0k6o5q2m8J5M3J1l6
2564A312l6J0M4L1rm1m2j2M0P4N6jm8n4k6MK4K4Jk8l1pJ3Kk6m7n0l6mL2M4J0l9n4j7L1M8K7
2559A219rk9k3%J0j0m4n1j9J7K4J0lrj5j2PK1Ml6m3mL4L2PJROjJ5L7K1k5m5j6J9K4K0K3J1
2554A177l4p3o4k5j0k4k0K2P1Q1N0Kl6n1m3k3mJ0J7PrlK9M9L2mj4lLoj8k7l6k6JJ9kk8j8K0
2550I89L2%l3l8j9J3M7N3J0m1l9J4M8L0%qj0k3l2k7l3m7k6L0O1K7k1k0J7L3K4J6Oj6k7j4n
2545I71k9n4l4MJ0j0rJ3J6OJ7L9K5nlK7J6m0o4k3K6L1J8J9J0l1o4m0MK0J4K8M7K5l0n3k2J8
2540H93J9j2l3k5KK3J5j1k2j1jmML4M8J0m9o3k9jkML9O5M3NoJ2Rk9o7n6JN2N3J8ppnj4j4J1
2535H92K6pn7o2j8J8Pj0J0M5M3Mk7j3K8N0L2j5m8m1nJ7Kk8l8k5qKJ5K7K4NpOK8L0Kl5m8l0
$$ plain form
2568 1202 1208 1233 1203 1119 1070 1115 1209 1264 1259 1241 1253 1283 1296 1286 1269 1257 1247 1232 1216 1218 1250 1301 1351 1392 1426 1461 1490 1500 1474 1409 1327 1279 1294 1337 1348 1312
2564 1312 1276 1286 1330 1361 1352 1311 1269 1257 1297 1371 1427 1426 1378 1324 1298 1302 1326 1350 1351 1323 1292 1285 1298 1300 1274 1227 1177 1141 1137 1169 1213 1223 1184 1130 1113 1144 1192 1219
2559 1219 1210 1181 1158 1158 1168 1158 1114 1063 1044 1061 1085 1095 1092 1083 1068 1056 1063 1084 1088 1052 1009 1005 1039 1071 1078 1079 1088 1094 1093 1108 1145 1166 1141 1096 1080 1099 1123 1143 1166 1177
2554 1177 1143 1070 1006 981 971 947 927 949 1020 1101 1151 1153 1117 1066 1023 1000 996 1006 1023 1030 1021 1018 1047 1096 1128 1124 1110 1107 1110 1104 1086 1059 1023 997 998 1017 1015 987 969 989
2550 989 1021 1021 988 950 931 944 991 1044 1054 1013 974 988 1036 1066 1066 1058 1048 1025 993 966 933 886 860 890 951 978 957 937 954 987 1011 1027 1033 1017 990 976 971
2545 971 942 888 854 858 868 858 849 862 878 884 901 940 965 960 957 984 1000 960 896 873 899 930 948 967 977 946 882 842 846 866 880 908 955 980 950 897 875 893
2540 893 912 900 867 842 844 867 882 871 849 838 837 833 837 871 919 929 880 817 788 787 785 789 828 893 936 941 935 947 956 927 860 804 805 857 910 928 921 914 909 895 881 892
2535 892 918 911 854 792 774 792 799 789 799 844 887 891 864 851 879 929 961 946 898 857 852 869 871 843 805 780 772 774 789 816 840 845 838 844 872 902 904 869 821 791
2530G91lMqj2MJ7Oj7j9OL2M1M1L0Ll5n9m9j8LJ3J7J8J0NJ5L3K9ll5l8k3k0l4l7nM3O4L7ok4
2525H17j0OLJJ4K9J7j7m0l7j5PK5L2J7j1k4j6mkJ2L6M3Pk9k0K0L0Kk1j3ok2k8kL0K5qk5j5
2520H08ljOJ9J8lk4k9k8k3MM4M9mn9m7K0N7K3k0nL9L9j6m9k2J7Pl7m7j1K1J1j6j9JJ5Kk3l5
2516F79j9J0K7J6lmJ6K2Lj6oK4L9K3j2l5l7k3j1mPK7M0K3j2k9k1j4k4k7LM2N2M1K8J1k4m8
2511G64k2L1N1J8j7j1RMk3m3m4l9k5lJ5Pj3j7jJ3J3RJ0Oj0j9kK7L4J7kPK2Ql2n3k3K3L7J6
2506G42OK5L3Lm0m7j3K2K1kj9j1NQj1l3l3j6kRL1N3M9J5j2j2ok2l7k6mJnLJ2Kj5JL9M8J0l0
2501G42l2j6mPK6K8mm5n7m3k3%L3N3L2j0k6jL0L6J9%mJ2L3K3k5o3l3L2M6j6p9n8J5N3K4j6
2496F89j6QJ6QJMKj0k4l0k1%K0K5J7PLpk0j6J3L9K3k1m1j6J4Oj8j2K3L6jm9m9%N7Q0N7J0k8
$$ plain form
2530 791 788 792 784 772 776 793 799 782 763 769 801 842 883 913 916 881 822 773 755 758 771 788 806 816 821 836 869 898 895 860 822 799 779 745 708 703 746 810 847 841 817
2525 817 807 813 816 817 831 860 877 860 820 783 768 775 800 832 849 838 814 798 794 792 804 840 883 890 861 841 861 891 893 872 859 853 831 803 801 831 856 848 823 808
2520 808 805 804 810 829 847 844 820 791 763 740 744 788 837 833 774 727 747 804 827 807 802 841 880 864 815 793 810 817 780 733 722 743 754 738 719 720 735 737 714 679
2516 679 660 670 697 713 710 706 722 744 747 731 725 749 788 811 799 764 727 704 693 689 696 723 763 786 774 745 724 710 686 659 662 704 756 797 825 836 812 764
2511 764 742 773 824 842 825 814 823 827 804 761 717 678 653 650 665 672 659 642 641 654 667 676 686 692 682 663 661 688 722 739 737 744 766 774 742 689 666 689 726 742
2506 742 748 773 806 809 769 722 709 731 752 750 731 720 725 733 722 689 656 640 638 647 678 731 780 795 783 771 765 743 706 680 676 677 672 675 687 689 674 675 714 762 772 742
2501 742 710 694 690 697 723 751 747 702 645 602 579 579 612 665 697 687 661 660 690 726 745 745 741 753 786 809 784 721 688 720 766 750 671 613 628 681 705 689
2496 689 673 681 697 705 706 710 712 702 678 648 627 627 647 672 689 696 699 692 672 656 669 708 731 710 669 653 667 673 655 643 666 702 701 652 603 603 660 740 797 807 779
2491G79m0k2MJ6Mk3l7j4L4O0L1j5j7K8M4qp6q1k9J6K0K1L5L5Kj9PM9M8mn9p5o2m5k7LM6P3
2487G02O6M6L3L2J5j6l6k4rj4k3%L9L8ol9l1j8k9l9j4J4Qj5lL3L2j6m6j0N2P1L6j1k1mMk1
2482G76m9l5J4L8Km6l9J1M1L8M0N5M1ql0OM1J7m1o2l5rklkj4k6j6PJ2oj9j7jK8O0O1J7k6k0
2477G99Oj4n5l6N0R9M9k6l6jQmJ9O6N7j9p7n7pJ0lKK2K8J8K2L9L6Kk9k7qj0l8o8o9l7OL0K4
2472G71OQK6L1J1j0kJ5Nl0n1m2j9oNJ9K3Qj4k3k7k9j4K1M9M6K5J2J4Rlj0kRJ3J0j0l9n1k2
2467G32J4Rk8m0rK8L6K6K1J8RLRPqj9j3qj3j8lJ3J5Mj7m9p4n3J5P0O8M2L4L2nn0n4k1nj6n
2462F97L0M0Pj5QL4J1m4p3n5k2KK3M1M4K2oj8j1nj1j2J0L8K7k8o0k6L1L3k0n0k3Plj6J0M9
2458F66N0K3J1J5nm5n5j0M2M5Pl0l6k6k0j2NK7K9%l3l7j6LJ0K1L5K3j7l9j3K7L3Jl0l9l0o
$$ plain form
2491 779 739 717 721 737 741 718 681 667 701 761 792 777 760 788 832 824 748 667 638 654 674 695 730 765 767 748 755 804 852 848 789 714 652 607 580 583 629 702
2487 702 768 814 847 879 894 878 842 818 809 795 772 772 811 849 843 804 773 755 726 687 673 687 695 680 677 710 742 726 680 670 722 793 829 818 797 793 797 776
2482 776 727 692 706 744 746 700 661 672 713 751 791 846 887 879 849 855 896 913 872 810 775 766 764 761 759 745 719 703 710 722 716 697 680 679 707 767 828 845 819 799
2477 799 805 791 736 700 750 849 898 872 836 835 843 839 858 924 981 962 885 828 821 831 828 830 852 880 898 920 959 995 997 968 941 933 923 885 817 748 711 717 747 771
2472 771 777 785 811 842 853 843 841 856 861 831 780 738 719 713 718 737 760 768 754 731 704 675 661 682 731 777 802 814 828 837 834 824 822 831 844 854 844 805 754 732
2467 732 746 755 727 687 678 706 742 768 789 807 816 819 828 835 827 808 795 787 774 756 753 766 781 785 768 719 645 592 607 677 745 787 821 853 848 798 744 723 718 702 697
2462 697 727 767 774 759 767 801 812 768 695 640 618 620 643 684 728 750 744 726 715 710 699 687 697 735 762 734 674 648 679 712 692 642 619 626 623 607 617 666
2458 666 716 739 750 765 760 715 660 650 692 737 744 714 678 652 632 620 625 652 681 681 648 611 595 598 608 629 664 687 670 631 618 645 678 679 649 610 580 574
2453E74K6M1K5%mMjk0k2j0pj7j3J0J6rl1j9J4L7M0L6K1ql6l2lJ7Mk4m1l0oJ1J9L0M0K9ol5
2448F20k5MQj4k6mK5K2pj9jK0J3j8l4j9QJ4pk4j1K4M1K2j5l4j8J2J9rl8k1K9N3K0k7k3J9L6
2443F15Ol4l4rOrl8n2l2J6N8O3L7Rj1k5k7rK0L7M3M5L3mm5m9k7k3m0k3L2N9J3m6m8qOj4k2
2438D69%K0J9J6K2K7K5K5J9kk6k8j1lj2j9pRJ2QQJ4K1K2J0j2k2k1k6m0l4KL1J8qrROlJ7L9
2433E85J5l1k0M3O0po9n4nO%K5M1lo3n1K7O3K5k1j7%nj8j3j2k9l3NM5M7J1j8k9k3j1%oj5J0
2429D55N8O2jn1j7N2N7nm3j7Nk6n7k7L7O5L9Lk0k6j0K8N0K1k5l0MK0mk5j5Knj7lK6M4M7L7
2424F88Rl6o1m2q%j0oJ3K2J2jk0m9o3k6K9L8jk3J3N5M9J6%kk5m9l9LK4Mk1j4J3K6J2qj3RL4
2419E52L6J6OJ5Rl6p0l9L1N7J1m6m8j2J7K1Qj6l9m0j7KLPL1M9L0qk3j0KMLjj8l0qM0O0L2o
$$ plain form
2453 574 600 641 666 666 662 666 665 645 623 613 606 589 576 586 602 593 562 543 557 594 634 670 691 683 647 615 612 629 633 609 568 538 532 543 562 592 632 661 655 620
2448 620 595 599 607 593 567 563 588 610 603 584 583 603 616 598 564 545 553 567 560 536 525 549 590 612 597 563 545 557 576 567 529 508 537 590 610 583 560 579 615
2443 615 621 587 553 544 550 541 503 451 419 435 493 556 593 602 591 566 539 530 550 587 630 675 708 704 659 610 583 560 520 497 529 588 601 555 507 499 505 491 469
2438 469 469 489 508 524 546 573 598 623 642 640 614 586 575 572 560 541 534 543 555 563 571 585 606 628 638 626 604 583 557 517 483 485 516 534 526 517 526 532 529 546 585
2433 585 600 569 549 592 652 645 576 522 517 523 523 548 589 586 523 472 499 562 587 566 549 549 544 526 513 501 472 439 444 489 536 547 529 500 477 466 466 460 445 455
2429 455 513 575 574 523 506 558 615 610 567 550 555 529 472 445 482 547 586 589 569 543 533 561 611 632 607 577 581 601 597 572 557 559 554 537 534 560 604 651 688
2424 688 697 661 600 558 550 550 540 534 547 569 581 580 560 511 448 422 451 489 488 465 478 533 582 598 598 596 571 522 483 486 510 514 493 479 492 518 530 522 509 518 552
2419 552 588 604 610 625 634 598 528 489 520 577 588 542 494 482 499 520 528 512 473 433 416 418 421 428 459 508 538 530 507 497 499 503 506 505 487 457 449 489 549 581 575
2414E75j7j5k7l7rM7O5K1l9m6mL1K9R%NQOkj7k8rL4O1L1l3p4o7l9j3J3L2K1j6m0k3J6M0M5
2409E34L3km2n3k4ok9m1J0P5O2j6m9KN0K3l7m6j1J2J6L3N7M9J8kpl2p4p7k0M1N1J1k4j9J6
2405D82M3L9Ok5l9l9k9%M0M8J2k3j0K4J8j8k1J1J0m1o3mO6O1kk9KL1J6ppLlk7m8n2k6K7O5
2400D91N1%k9j8MONNkk2l1j6LJ1J8K8J7j2k7lK1J3j0qRKk5l2nJ7K1J7J7Lj6j3J4K4KqJ6M2
2395E80K9j3l4k8k0j8rRJ7Qmj1k2l5k8PM3M2Pk2j8PJ7Mj5j5lQJ6K6K9J5rk5l4n1o8m4J9N6
2390D13K5k8l1RK8Kj8%K6K4jj0jPQJj6l2k0J5M1L2ROJ2NlNJ1j1m3m1%K9L1K5K5Mm8q7p0j2
2385C21K5K2MjRJ1mj2RN2P6N4Nk9l9l1j0J9K7j1n3m6JJ9pj4K8N1On1l2M0O9K7j2rRQRK6K4
2380E90k3p5p8l5NJ3NLJ6L4M8N4L9Mm5p1m9RM0J0l8m1KK8J6KJ5K6J0j3j1J4L2L4K2jk1j9k
$$ plain form
2414 575 558 543 516 479 470 517 582 603 564 518 514 545 574 583 583 588 596 602 600 583 555 546 580 641 672 639 565 498 459 446 459 491 512 496 456 433 449 489 534
2409 534 567 565 523 470 446 440 411 370 380 455 517 501 452 454 504 527 490 444 433 445 461 494 551 600 618 616 609 577 503 426 406 447 498 509 485 466 482
2405 482 525 564 570 545 506 467 438 438 478 526 538 515 505 529 547 529 508 519 529 488 425 421 487 548 546 517 519 550 566 559 552 555 552 525 477 425 399 426 491
2400 491 542 542 513 495 499 505 510 515 513 491 460 444 447 458 476 504 521 509 482 479 500 513 503 495 504 506 481 449 444 461 482 499 516 519 503 490 504 528 530 522 538 580
2395 580 609 596 562 534 514 496 487 496 513 521 517 506 484 449 421 428 471 513 520 498 480 487 504 508 493 478 475 483 499 525 554 569 560 535 501 450 382 338 357 413
2390 413 438 410 379 388 416 418 400 400 426 450 449 439 438 445 453 454 438 406 386 401 442 474 483 489 501 506 503 508 519 508 465 424 424 453 484 509 534 538 490 403 333 321
2385 321 346 368 372 371 380 391 387 375 384 436 512 566 571 542 503 472 462 481 508 497 444 398 399 418 411 397 425 476 482 431 399 439 508 535 523 514 523 531 540 566 590
2380 590 567 492 414 379 384 397 402 405 421 455 503 557 596 600 555 484 435 444 484 494 456 415 417 445 461 463 478 504 514 501 490 504 536 570 592 591 570 551 549
2375E49Jk1k7JK6Pk8k6J6M5K9nk5k5k4l6m0k0J8L7J4k2l0pLrj0J4K8J3lOJ6%j7jJ9Ok2j8J2
2370D44J3k1m1k9j0KK1M4M3J6jLkj9k3NK7K4J1Lj1l2m2k7kRJ0kl1n1k7L4O8M5nl4l9l1oL0
2365C66M3K1ljRNJJ3K5Rj6k3j3%J2K3J6j4l7k5MJ9J3jj4k0qJ3Rj2j0L1O1M3Nj1j6l2k8J5M4
2360E16Pn5o5l0j1j9pK3K9J3RJ9Ll0l3kJ7RJ0K7J7j8l2qJ4K0L5M9J5n1o7j3L3J4k4k2j0j4
2355C68mL9O3L5NJ4J5k8n9k0L0J3l1j7L2K5l1m4OL6J8LJ6Rl1m2kK9J4j2j0pk1k4lQj6l3rK7
2350C61L6K8J9Lk6l5j0RmrK3N6M1jk3k1k8m0l6j4LJ7L3L0j1n2m7mJ7PlQJ4QLRJ3J0J2Rj0l5
2345C60l0kJ7P%J5M3N9O0M2Rk5l2j5KPNnk4l4rL0L0j4m7l5j1j1k2j3K%pLL3N6N5L0j1m0l7
2340D41j3nj8rL5O3M2J1J2K1kl2k8rl1o9m6K9O6K0l7l5LJ0j6l5l1j5OK2J8%jK2L1Qj7j1QR
$$ plain form
2375 549 550 529 502 503 529 536 508 482 498 543 572 567 542 517 493 457 417 397 415 452 466 444 414 407 410 401 391 405 433 446 443 449 465 465 448 447 466 472 450 432 444
2370 444 457 436 395 366 356 358 379 423 466 482 481 484 482 463 440 445 472 496 507 510 499 467 425 398 396 405 415 413 382 331 304 338 406 451 446 412 373 342 336 366
2365 366 409 430 427 426 435 440 441 454 479 488 472 449 436 436 448 471 487 473 436 411 415 434 447 446 432 412 404 417 426 414 404 435 496 539 544 533 517 485 457 472 516
2360 516 523 468 403 373 362 343 336 359 388 401 410 429 432 402 369 367 384 393 403 430 447 429 397 389 403 423 458 507 522 471 404 391 424 438 414 392 382 368
2355 368 364 403 466 501 506 520 535 507 448 428 458 471 440 423 455 480 449 405 411 447 465 468 484 493 462 420 418 447 461 449 439 432 411 387 384 392 376 343 334 361
2350 361 397 425 444 447 421 386 376 385 381 372 395 451 492 491 468 447 419 379 343 329 332 349 382 412 401 349 302 298 315 322 319 327 341 349 352 361 374 384 396 405 395 360
2345 360 330 328 345 352 352 367 410 469 529 571 580 555 523 508 510 517 522 517 493 459 450 480 510 496 449 414 403 392 370 357 359 359 352 355 388 444 499 529 518 478 441
2340 441 428 423 405 396 431 494 536 547 559 580 578 546 518 509 478 409 363 392 458 478 441 406 409 419 403 368 337 322 328 350 368 368 367 389 420 428 411 400 408 417
2335D17kprj8k1mRkrJ2K8Nj9LN0N6K0jQpn0o7k7J5J8J0L0N4L8nl0k5j3j3j9k1rJ4K1Jj2J2
2330D31M4K5k9m4jK2j7m7j3L9L5oj7jJoJ1L1J2k5j9J5Mn1o4oM9K7l9p2m7J0N9P0L5j0k1JN
2325C91j4j2K5N3M1J5Kkj2kK8M4K0j3j4kj1l3l8k7k6l5m0k8jK7M2L0J1RK1J6j0k0oMOL5Q3
2321E57Q1Po7o4j7jj3rJ3Ml2m1j2K0K9K9K0kk2j4J4K1Qjkj2l0l1k1k0j4K0N0L2j0j3J6Kn8
2316D17p6j4M6M0J0K1M6K3k1j7L0L9j4o9p4m1rJ1K6K9K3J0jonQK5K9J8ll5o1n8j5L9N8M0J0
2311D79%MJ1J6K0J3ql4l8j4J5J8pk9k5j1j2k2k0rmmPJ6Nj3kL1M2J9NK9N3L6jj3j%l0o8p8l8
2306C38L5P8N3pl0kRl6q0n9OM1K0k0m3l6JM8O2L2OK3M4K3k1l2j4qk2j5J1J8JLK6K7jj2NJ0
2301D82j7l6j0K4J9j6l5j6J9M4L7Lk6k1OJ2pj7n%mOK0Nl1k1L6N9Ko0l7L2M6km0l6l0l1pM0
$$ plain form
2335 417 415 408 399 381 360 356 365 363 354 366 394 399 380 383 433 489 509 508 516 509 459 392 365 380 398 408 438 492 530 525 495 470 457 444 425 404 395 409 430 431 419 431
2330 431 475 500 471 427 426 448 431 384 371 410 445 439 422 421 422 416 427 458 470 445 426 441 445 394 330 324 373 400 361 289 242 252 311 381 416 406 385 386 391
2325 391 377 365 390 443 484 499 501 499 487 485 513 557 577 564 550 548 537 504 466 439 413 378 338 310 309 336 378 408 419 428 449 465 455 435 429 433 439 474 557
2321 557 638 645 578 514 497 496 483 474 487 491 459 418 406 426 455 484 504 502 480 466 480 501 509 508 506 494 464 433 412 392 378 398 448 480 470 457 473 475 417
2316 417 341 327 373 413 423 444 490 513 492 475 505 544 530 461 387 346 337 348 374 403 426 436 435 429 424 432 457 486 504 501 466 405 347 332 371 429 469 479
2311 479 479 483 494 510 530 543 535 501 463 449 464 482 475 446 421 410 398 376 356 347 343 339 346 362 367 354 352 383 425 444 449 478 531 567 566 553 552 552 522 454 376 338
2306 338 373 451 504 497 467 465 474 438 358 299 305 346 366 346 303 267 268 316 378 410 416 439 483 506 485 453 439 431 409 394 405 423 424 427 453 480 479 467 472 482
2301 482 465 429 419 443 462 446 411 395 414 458 495 498 472 451 457 469 462 445 440 440 436 442 462 467 436 415 451 510 512 452 415 447 493 491 451 415 385 354 347 387
2296C87N7K9MJ6K0j8n6l5K4M0rn8m4RL0PpJ6L6Mm4l7K1N3J8k4k0mk4m7j4N6P4K3j7%K9J1l4
2292D72n0k9qmkOJ7K1K2K0J4J1J4J5Kk6m8m4qL9N3K1k6m1j5J4Qk3m3l0KL0L2J7JlJnj8k1n
2287C83J8K0j0n0o3k0N2Q7N2j1l4j0Kk3m1qL9M1Jk2JK9K0j4k8j0J2J7J3J0%j5j7J0L7K8LL
2282E02K7K1l1o9l7L0N8M0J6Rqk7j8J5K5Jk0k5l3m5j4N0O9Jp6p1KM2K0j0nJ3J4jj3j2J0M3
2277D93M8Jn8p1m0k0l0l4j1J1K2M5P4O5Mm4k5K1J8k5m0oK5J2j8k4j4j2k2k2kK4L6J6j9l6j7
2273C25K1L6K6Rnk1l6k4J0K9J1j2KL3L6Mk2j3Ljj2nJ4J1j0j7OK9K2nk2j4KLqk0j8lK0K7J4
2268D25j0k3j8jK0M3M7J7k9m1mM1M2Mk5k7j6j0rllj0j5j0JQJ5J0j6m7l7K2P0M7j7m1oK9J5
2263D38oJ2L9J2n0o5rL9J7k5j7K7K1l3m8L0J19J05nr8r2k0L9M8K2rk9k9rNJpOL1L3Oj9j5J
$$ plain form
2296 387 444 473 477 493 513 495 439 404 428 468 459 401 357 366 396 403 396 412 448 452 408 371 392 445 463 439 419 415 391 344 330 386 460 483 466 466 495 506 472
2292 472 422 393 385 381 379 385 402 423 445 465 479 490 504 519 521 495 447 403 395 434 487 508 482 441 426 440 448 425 382 352 354 384 416 433 434 431 432 427 409 388 383
2287 383 401 421 411 361 298 278 330 417 469 458 424 414 416 393 352 344 383 424 425 403 404 433 453 439 411 401 413 430 443 453 453 438 421 431 468 496 499 502
2282 502 529 550 519 450 413 443 501 541 557 566 558 531 513 528 553 554 534 509 476 431 417 467 536 537 461 390 392 434 454 444 439 452 466 465 452 440 450 493
2277 493 541 542 484 413 373 353 323 289 278 289 311 356 430 495 499 455 430 451 469 444 404 398 423 435 417 393 379 367 345 323 321 345 381 397 378 342 325
2273 325 346 382 408 417 412 391 355 331 341 370 381 369 371 404 440 444 422 409 412 411 399 394 408 419 409 392 398 427 449 444 422 408 410 413 405 385 367 364 384 411 425
2268 425 415 392 374 373 393 436 483 500 471 430 426 467 509 513 488 461 445 435 426 423 420 410 395 385 386 394 409 419 403 356 319 341 411 458 441 400 394 423 438
2263 438 432 444 483 495 445 380 371 410 427 402 385 412 433 400 352 382 501 606 601 503 411 391 430 478 500 491 462 433 424 429 430 423 429 460 493 499 480 465 466
2258D66PPJ7L3K2k3o1n6j8J2J4MNMj5m0l9mK8K7OLJ5J5mj4NJ9Lk9l6kL4L5lm9n5j7L5N0K4
2253D25%QK5J4j1k3k2k8l2j2K2K9Mj0KJ1%kK1L5J4j7j4Mkk3j9Njl7m3J0O5N3Jj7K9P0N0rl3
2248E42oJ4k6q0o5J9Q2O1Jk6j9k3m2l8nK0K5K7K9Rk8m1j5J3Lk6l3j5MJ3J3J3J7K1Qk4n2n1
2243C19k2KJ7L3L8Ql0k9NPl6m2K4Q0M3l5m1K4N8K8KK3M3J1l5l9j5j%RJ3rk9j2K7L7J0j0OK2
2239E04Jm2n1pM0L5j6m9l7j6j5j5J6M2J1n5o6JO5N4%k1MK7K0nk8m3l6KM3M7J8mMK4L3L0J5
2234E30pl3m2k7lJ2Oj5l0j8J2K6J5MJ2J9ml9m3rK5K7J0oj5j7nJ4L1L9L7Rm4o9k6M6N6j1p3
2229C94n7PM2L0QlpjJ5J7j0l8k1K8M8K2j6k7j8LL3O1N3Pl0l3l3n6p1k7M9Q0M3pqJ9J8k0n5
2224D39n1k6j0oOL2N3N1L1Rj4m3o3n1nL4M0K0PJ0Nj2k2kL4M5J9k7n6n7l8j2J4K8J8j5m3l9
$$ plain form
2258 466 473 480 497 530 552 529 468 412 394 406 420 424 429 433 418 378 339 335 363 390 396 399 414 429 425 411 416 435 438 409 373 371 405 440 437 388 333 316 351 401 425
2253 425 425 433 458 472 461 438 416 388 356 344 366 395 399 389 391 402 402 400 421 456 470 453 439 443 441 418 399 404 403 366 323 333 398 451 452 435 464 534 584 575 542
2248 542 536 550 524 444 379 398 480 541 542 516 497 474 432 394 389 409 434 461 490 499 471 430 415 428 431 405 372 357 361 374 387 400 417 438 446 422 370 319
2243 319 297 299 316 349 387 395 365 336 341 348 312 270 294 374 417 382 341 365 423 451 453 476 519 530 495 456 441 440 440 449 462 453 424 412 439 476 486 476 482 504
2239 504 505 463 412 405 445 480 464 415 378 362 347 332 348 390 401 346 280 281 346 400 400 379 383 410 430 425 397 354 318 320 363 410 428 424 428 452 485 515 530
2234 530 523 490 448 421 418 430 436 421 391 373 385 411 426 430 442 461 457 418 375 366 391 418 428 422 407 390 385 399 430 469 506 515 471 402 376 422 478 467 394
2229 394 337 344 386 416 424 421 414 413 428 445 435 397 376 404 452 474 458 431 413 416 449 510 563 570 540 507 474 418 347 320 369 449 492 485 477 496 514 494 439
2224 439 388 362 352 346 352 384 437 488 519 528 514 471 408 357 352 386 426 446 453 463 468 456 434 432 466 511 530 503 447 390 352 340 354 382 400 385 342 303
2220C03oK5L4L8M5M0Ol9n2l1j3j4pK5N3M2J4J4L7K6l0p4m9J3L8%m1l2J5M8L3pl1k0LMj6k7
2215C67j4J2K9L8M7M3Ql8n4l2oknMJ6K4L0L3Rm4p5l9K9N1J1k6j8Lqk3pJ9Nl3k6L4P3L5l0n3
2210C87k9lPJ4J9J3NQMk1l3KN3N8K2J6N0N0k2q8p2oK4RKRml8m4j2J7K4L3M1J6l4n1k4lj4q
2205C77L3N2J0l9k3K9L8lk6lK6K4%k0l3l2j3QQOK5M9L7mk0%J1j2k8qK0K0jj1rrj0j0j5k0k
2200D22L7N6K6j5j9%kl2n0k6K2N6N0Rl1k7J2L3Qk6k3JMj0mJ3jl0j9L3M8j3q0o7J2O0L3k6n6
2195C78n0k9rQJ5J0K%MLMK4O1Q0N0j6n6m2OL9M8M2K1j8m9l8JJ8jj3J1M1K8k2o4o6l7jK2L0
2190D35K4K3K8L0J9Mj2k8l8k0J5L0jm4m6j1J5RJPQj1k4%L5M1J2j1kK1L1J9ol1l7j5J3Mm2o6
2186C79l3K1L4RjJ7K3KmK8N3K7j3j3Mj1n0m7QM8L2mj9k3l2k8kJ2rk2MM3L9J0KJ0kl1k8J7M5
$$ plain form
2220 303 297 322 356 394 439 479 485 446 394 363 350 336 329 354 407 449 463 477 514 540 510 436 387 400 438 438 397 365 380 428 461 454 423 403 406 410 394 367
2215 367 353 365 394 432 479 522 530 492 438 406 400 398 393 397 413 437 467 500 509 465 390 351 380 431 442 416 398 401 393 370 363 382 387 354 328 362 435 470 440 387
2210 387 358 355 362 376 395 408 413 421 425 404 371 373 426 484 506 522 572 622 600 512 440 434 458 467 469 478 474 436 392 380 397 421 454 495 511 477 426 402 399 385 377
2205 377 410 462 472 433 410 439 477 474 448 445 471 495 495 475 442 410 397 405 413 419 444 493 530 526 506 506 517 505 477 469 489 509 508 497 488 479 469 459 444 424 422
2200 422 459 515 541 526 507 507 505 473 423 397 419 475 525 534 503 476 488 521 529 503 480 481 485 475 471 484 483 453 434 467 515 502 422 355 367 427 460 434 378
2195 378 328 299 290 298 313 323 325 325 329 332 336 360 421 501 551 535 479 437 443 482 530 572 593 575 526 488 489 507 506 493 504 545 573 551 487 421 384 383 405 435
2190 435 459 482 510 540 559 563 551 523 485 465 480 510 509 465 419 408 423 432 433 440 448 437 413 413 448 489 501 490 488 509 540 559 553 522 485 470 483 487 445 379
2186 379 346 367 401 410 409 426 449 451 447 475 528 555 542 529 533 522 472 425 433 481 513 509 490 467 435 407 405 417 408 386 390 433 472 482 484 494 492 461 433 450 495
2181D95K2r%L3L5j0o6q3m5J7N9N6K7KllKJ4K1Oj9k1OK4J0j3pJ2Rk1m4l9k1j9l3l9k1J4M0M5
2176D33L4K4J5Kj0j6j6j9k2j2PK6L8L4Ol2m3rL0K4j5k7PM2L8J4%j1k8l5j7Jrk6k4nPOLmj3
2171C98nL0N3J9m6o5j7L7L9J0kOJ1Jmklj3j9j0PJ5J1%j5l1l3kM3N3Qm9n2LN4N2K1OJ0Rkoj
2165E19mj5j3k%j3k0jK8M5L8J1k1m2m0l0k5j7jJ0LlJ2L7L5J0jRJ1qj7jMj5l2j6J1RroK7N1
2160E18M2Pl1n0l9j2ok7m5l1PK9K4J2J1K0K6J8mk2k0kMlkLj8n6n6OO8O5J6nQJ3mrJ0J2rj4
2155D54PJ1k4n1k0L9O2L5kj5kJ7K0pm8o0k6J6K6J2NJ0J5J0Jj5k7k1LJ8J9L3O9P7K5m7o9m7
2150E03l5m2k0K9N0J5l1l6j5qj9j6QL5M7M2J7j1k2j4kJ2L7O3M4j7o3n1k5l6o5m8J2N3M1J6
2146D48J1J0qk6j2K6O1O8M6Ok0j9j6l8o0m1J4M3K2qj2qk1j6K0N0L1mNL8L2j7m1j5J6%l4l4
$$ plain form
2181 495 517 508 508 541 576 566 500 417 372 389 448 504 531 533 530 527 529 543 564 570 551 530 536 560 570 557 550 562 571 550 506 467 446 427 394 355 334 348 388 433
2176 433 467 491 506 508 498 482 466 447 425 413 420 446 484 518 524 492 449 440 470 494 479 452 459 501 539 553 553 542 514 479 462 463 454 428 404 399 406 412 415 411 398
2171 398 393 423 476 495 449 384 367 404 443 453 451 457 468 469 465 463 460 447 428 418 425 440 451 451 436 405 372 370 413 466 474 425 373 376 430 482 503 509 519 528 526 520 519
2165 519 515 500 487 485 485 472 452 451 479 524 562 573 552 510 470 440 415 398 397 407 410 407 419 456 491 501 500 509 520 512 495 494 498 483 451 435 446 455 446 440 467 518
2160 518 560 567 536 486 447 435 429 402 357 326 333 362 386 398 409 429 455 473 469 447 427 425 429 426 424 427 409 353 297 303 371 436 452 447 455 468 464 455 465 477 468 454
2155 454 461 472 448 397 377 416 478 513 511 496 494 511 531 524 476 416 390 406 432 444 449 459 474 484 485 470 443 422 425 443 462 495 564 641 666 619 550 503
2150 503 468 426 406 435 485 500 469 433 418 410 391 375 383 418 465 507 524 513 491 477 475 487 524 587 631 614 551 500 475 439 374 326 338 391 432 448
2146 448 459 469 461 435 423 449 510 578 624 630 610 591 575 537 477 436 450 493 515 507 495 487 466 450 470 520 551 547 552 590 622 605 564 549 565 565 531 497
2141D97jJ3j5n4n3j0L8M1Qj0QK6Kl6l5MK6Rk0l9m9l8LM0K5k0k8J1K1k4n6j7L8L7JmJ3Mk0j
2136C35M7N4Rk2qRPJ4M4O4M4Nk4l9l1J4O1M6l0p7n1j8l3m8kN9M7k0m6%M4L4Lpqk3l4j9MJ5
2132D19J9K0Pk4m7l3KJ9K4M0N8M4jl0mM8N7Mn2n3kL9L8J8J2Kl4q5r7n5JK0%j8qJ3J8OML2N9
2127D80M7pn4n6k8j2j6j6KK9M2M2L3J7lk6l9k8QM1M4J6j6m0o1p0m1J7N0L1llJ1pm9n1%N5P0
2122D09M9J8j0qK5M5Jo1m6M5R4L1o1o6rJ2k0k9PL1Rj8pJ7J8Kpj4k0oK6L8Ll8l4J0L4J4k2k7
2117D35%K3J0k7n3m6j7J4M1O3N9J7l5n1k8KJ8K6L2K2KnKnk6j8K8N2Qn4n6kL0Qj4jJ9RpNL7
2112E17M5J5k6n3n6l1J3M9N0J6k2m3m3k5LL0M4M6L5%n5q6n7RM1J4k3j5K9M2Nm6n1oM5N5K1
2107D86k0k9j0NjrOK6J6j9m0k8lPJ3L2N5N6L4J0K%j2l6n5n1j8K1L5J7j4k7j5MJ4J1LljLok7
$$ plain form
2141 497 496 509 494 440 387 377 415 456 464 454 462 488 490 454 419 423 449 458 438 399 350 312 315 355 380 360 332 343 364 340 284 267 305 342 343 339 352 356 336 335
2136 335 382 436 445 423 415 424 431 445 489 553 597 602 578 539 508 522 583 629 599 522 471 453 420 372 370 429 476 456 410 410 454 488 491 484 476 453 419 400 404 419
2132 419 438 458 465 441 394 361 363 382 406 446 504 548 547 517 513 561 618 622 570 517 515 554 592 610 622 624 590 505 408 353 354 374 374 356 348 361 379 385 389 421 480
2127 480 527 520 466 410 382 370 354 338 340 369 411 453 486 503 500 474 435 407 415 456 500 516 500 460 399 329 288 305 355 386 383 380 391 384 335 284 284 339 409
2122 409 458 476 466 458 483 528 529 468 422 467 561 592 531 465 456 468 448 419 426 457 466 448 441 458 476 478 471 457 437 431 457 495 498 460 426 436 470 484 462 435
2117 435 435 458 468 441 388 342 325 339 380 443 502 519 484 433 405 407 425 451 483 505 507 502 504 499 473 455 483 535 543 489 433 431 461 469 455 454 473 482 475 480 517
2112 517 562 577 551 498 442 411 424 473 523 539 517 474 431 406 409 439 483 529 564 564 509 423 366 375 416 430 407 392 421 463 468 422 371 365 410 465 486
2107 486 466 437 427 432 431 422 428 454 470 451 411 383 380 387 400 432 487 543 577 587 589 589 577 541 486 435 417 438 473 490 476 449 434 438 452 463 466 463 462 465 459 432
2102D32l6j7J9M1L5J5kj4k1j8j2j3j6nJ8K5OkK7N8L6k7n5j4L3J7l2m1nPl2n7j0O0O3%m0qM2
2097D57M2MrJ5L2J2k4m3l3nK4L6J8j6l6k6jK2L5L8K4nl1m2l2j0J6K4Kl4m2j1K0K6K0K5K7K
2093E21k8k3J1J9j3l5kN1N4qo5n0L4J01Q7Qn8o1k8j2k5l0j8nokJ5K1O%K4L6Km6m3J1M4K1j1
2088D97lK4K3lj6ojj0j5pMJ3K5L1J0l4n8m5j3J1K8M3M0Qk1j4J2J7lj3J0M6N6K0l9q0n8J4O0
2083E53L4k5k6L1P1M9Lk2m5q1q1rO8O0ql1J0K7k2o5l2K7K6k4m2j2J9J5OQOnmRQn%L5N1J0m4
2078E43n1lM3M4Ql5n6m8k0KJj1qJ6L5L1Qj5k2nL1N7N6L3J1j3n6r2p3MP3P9M0J3Pol1k7J3M8
2073F24L4j1l8k3J3L7L6J5rk2j2J3M0N7N9M5K2Oj%%nrpPK9M1K7jj9l1m3m9k5K1M2K1j3k5k2
2069H24j7pRNl4o7n4j3Kj6l2l1l5l1NN9O5Rm4m8k8k4k4lJ6RnQK9K5RJ4K9J5k1l3qRJj1j1r
$$ plain form
2102 432 396 379 398 439 474 489 487 473 452 434 422 409 393 388 406 431 437 435 462 520 556 529 474 460 493 510 478 437 432 439 407 350 340 400 463 463 423 415 457
2097 457 499 503 494 509 541 553 529 486 453 448 472 508 526 510 474 448 447 469 504 542 566 561 530 488 456 446 462 486 488 454 412 401 421 447 467 492 519 521
2093 521 493 470 481 500 487 452 450 501 555 547 482 432 466 567 654 662 604 543 515 503 478 448 430 425 419 417 432 453 459 459 483 519 521 475 432 443 487 508 497
2088 497 494 518 541 538 522 516 515 505 490 483 487 500 525 556 566 532 474 429 416 427 455 498 538 546 525 511 523 540 537 524 534 580 636 656 617 537 479 493 553
2083 553 587 562 536 567 638 687 690 668 623 542 461 452 520 580 572 541 551 578 556 491 459 486 512 488 446 434 453 468 474 482 488 483 479 488 496 491 491 526 577 587 543
2078 543 492 489 532 576 584 549 493 445 425 427 428 417 409 425 460 491 499 484 462 457 488 545 601 634 645 632 576 484 411 415 488 567 607 620 627 621 590 563 576 624
2073 624 658 647 609 586 599 636 672 687 678 656 644 657 697 754 813 858 880 886 885 885 885 880 871 864 871 900 941 968 967 948 917 874 825 800 821 863 884 871 846 824
2069 824 807 800 809 814 780 713 659 646 648 632 600 569 534 503 508 567 632 641 597 549 521 497 473 470 486 495 490 498 527 552 561 575 604 619 598 565 557 566 567 556 545 536
2063E36JK7M5K1k7l9kL1L1L1M2K1l6n8j0L4no9n7J0K9k0m1RN5L4k0k9MK8K2J0jpqrj7k4mK3
2058E61Qm0m7J2O0K6k9k0K8K5j3LO5O1l9j13p0J6L1j2j9K4M9L1J3J6Kl6n6l5LK7M1M3J9k7
2054F08n8n1j9J4L6M0K0joj2l3l6K2R1P5j5o5j8L6J1l6k2K5J9k7l2QK1rj8J3K5nj7J4L3Lk7
2049F07j6ql1m5qL1J5qK0O9O3J1rJ5J9j3k2NQl9o2mP1O9qn9l6J5K6nk5mL5M2Kl7l2kMj3kM9
2044F88Q6M9k8o8m3LK3J0pnQJ4Kj0mJ5K0NkJ2K4Mk9l9j8RK3K0Jj7oL3M9No1p5l1QOkK1M1K2
2039G56j4j4J2J4j4j4L5P3L9l2n8k3K3M0L5K6Kl2n0l2lKqj0pj1qK5O4N4lm8l1K2N3M6J8nj9
2034I03k4k8k9j6J3K6J2lJ7M9L5k2m3oK4om7l3J0J6%J9N8N2OqK8M8K1KJ8J6m1r3o2K4O4L0
2030A030k3m0j8J9N5O8N0J2j6k6j9mJ5J3j4l1jM5N2Ql8n0l4j7j0j2j6oK7N8M5Lj5J7N4N0K5
$$ plain form
2063 536 537 564 609 630 603 564 562 593 624 655 697 718 682 624 614 648 643 574 517 527 556 536 495 504 559 593 573 544 548 576 598 608 607 600 592 583 566 542 538 561
2058 561 569 529 482 494 554 580 551 531 559 584 571 574 639 700 661 548 478 494 525 513 494 518 567 598 611 627 629 593 537 502 505 532 573 616 635 608
2054 608 550 499 480 494 530 570 590 589 583 571 538 502 524 615 690 675 610 592 628 639 603 581 606 625 598 566 574 595 586 568 581 606 601 584 598 631 634 607
2049 607 591 583 552 507 499 530 545 537 557 626 689 700 691 706 725 712 690 695 703 664 602 598 669 738 730 671 635 650 676 671 646 642 677 719 721 684 652 650 654 641 639 688
2044 688 774 823 795 727 684 687 710 720 713 708 716 730 732 722 718 733 753 758 756 768 792 796 767 728 710 719 742 762 763 746 740 773 822 827 766 691 660 668 674 672 693 734 756
2039 756 742 728 740 754 740 726 761 834 873 841 783 760 783 823 858 884 886 854 804 772 769 771 763 753 746 735 727 752 816 870 867 819 788 810 863 909 927 922 903
2034 903 879 851 822 806 819 845 857 854 871 920 955 933 890 884 908 902 855 822 832 848 848 867 925 977 983 975 1003 1051 1072 1074 1092 1108 1067 974 912 936 1000 1030
2030 1030 1007 967 949 968 1023 1091 1141 1153 1137 1111 1092 1088 1103 1116 1102 1071 1070 1115 1167 1175 1137 1087 1053 1036 1026 1014 998 992 1019 1077 1122 1125 1110 1127 1181 1231 1256
2025A256K1L5K0k8o1m5oJ1NPK6L6J7qj4ML1N0N3L7J2pj0nnmJ2L2L1Qj4j3J0L8M9K8qk1J2N3
2020A645M9Pj3J0L4J9j2k1j5j1oJ1J9NoJ4M1L6J7K6N5N6K1NK7M6K6pj4kJkPK9L9K7NpRM6P6
2015B292O4J3k0NO4R8P2J4k1qK7L8K3J6L4M7K8J1L8Q3Q0K2j6NM6N7N7P5R6R1P1O5O5M8K0K0
2011C720M7O9O6N3M7N0O3Q9J15J20R6O3M4O4J17J54J27N2J8P1J56J90J70J49J46J33J08J12
2007F409J59K04K08J93K02K38K69K73K61K62L01L78M55M86M76M72N15N93O73P34P88Q58R51
2005A6358J054J153J270J436J640J825J982K192K518K899L220L467L732M066M404M650M796
2002F2662M868M861M752M550M269L896L418K866K265J608Q86J34o13j360k116k830l442l949
2000H6725m380m729m947n017m972m844m630m338m002l665l344l030k714k402k129j921j771
$$ plain form
2025 1256 1277 1312 1332 1304 1243 1198 1192 1203 1208 1215 1241 1277 1294 1286 1272 1276 1307 1357 1410 1447 1459 1452 1442 1437 1432 1428 1440 1472 1503 1511 1497 1484 1494 1532 1581 1609 1601 1580 1592 1645
2020 1645 1694 1701 1688 1698 1732 1751 1739 1718 1703 1692 1686 1697 1716 1721 1715 1729 1770 1806 1823 1849 1904 1960 1981 1986 2013 2059 2085 2078 2064 2062 2063 2061 2068 2097 2136 2163 2168 2161 2170 2216 2292
2015 2292 2356 2369 2349 2354 2418 2516 2588 2602 2581 2573 2600 2638 2661 2677 2711 2758 2786 2797 2835 2918 2998 3020 3004 3009 3055 3112 3169 3244 3340 3431 3502 3567 3632 3680 3700 3720
2011 3720 3767 3836 3902 3955 4002 4052 4115 4204 4319 4439 4535 4598 4642 4706 4823 4977 5104 5156 5174 5245 5401 5591 5761 5910 6056 6189 6297 6409
2007 6409 6568 6772 6980 7173 7375 7613 7882 8155 8416 8678 8979 9357 9812 10298 10774 11246 11761 12354 13027 13761 14549 15407 16358
2005 16358 17412 18565 19835 21271 22911 24736 26718 28910 31428 34327 37547 41014 44746 48812 53216 57866 62662
2002 62662 67530 72391 77143 81693 85962 89858 93276 96142 98407 100015 100901 101035 100422 99062 96946 94116 90674 86725
2000 86725 82345 77616 72669 67652 62680 57836 53206 48868 44866 41201 37857 34827 32113 29711 27582 25661 23890
1998B3890j627j458j299j181j093j002r05q18p26o25n60n61n78n37m57m20m38m34l78l32l39
1996H122l40k83k14k07k45k59k28j84j43j15j23j78k16j81j21j22j62j47o7l1r9j76j55o4
1993D062j1k8n4o0o9r5j07r3p9q1p6n7m8o0o0m3m4p6q8m2J9K0k9n7m0k8n7p9m8kjm1o1l6j1
1988B340j4k9l0l3n6p5n6j5Jk5m6k2J9J8k3n1l2rk1l9j7L0L2k2o4m9j8k8n1l3J5K2k1m4rK4
1984A569Ll3k0K3K6j8l7lK8jn8o7j5L9M9K8Rjrj7j4j0j6k5k0lKk5n8o4l6kQMJ2K7J8k0m5j8
1979A210L6M3j9q3p3mL7Qm3n3k5qj7k5mK9M6L6Pj9k1NK9K5mk9m1n6p8o5%P1P6No7o7oM3L1
1974I30j5m5l3ML6M1J1l0l9JM9N7L0Ojj4l8l6nOk7n7m1plqK5O9O0jl4j4jl7p1n7k1j8l3j9
1969F20K5N5N3M1L7L0J5N%kj1k5m0l4lL2K7orL2N0Pl9j5L9L5k4m7mL7K5krj4l3l0RL2kl7q
$$ plain form
1998 23890 22263 20805 19506 18325 17232 16230 15325 14507 13781 13156 12596 12035 11457 10920 10463 10043 9605 9171 8793 8461 8122
1996 8122 7782 7499 7285 7078 6833 6574 6346 6162 6019 5904 5781 5603 5387 5206 5085 4963 4801 4654 4587 4556 4457 4281 4126 4062
1993 4062 4051 4023 3969 3909 3840 3745 3638 3545 3466 3385 3309 3252 3204 3144 3084 3041 2997 2921 2833 2791 2810 2830 2801 2744 2704 2676 2619 2540 2492 2490 2489 2448 2387 2351 2340
1988 2340 2326 2297 2267 2234 2178 2103 2047 2032 2033 2008 1962 1940 1959 1977 1954 1903 1871 1862 1841 1802 1785 1815 1847 1825 1761 1712 1694 1666 1615 1582 1597 1619 1598 1554 1545 1569
1984 1569 1572 1539 1519 1542 1568 1550 1513 1510 1538 1537 1479 1412 1397 1436 1485 1513 1522 1521 1512 1495 1481 1471 1455 1430 1410 1407 1409 1384 1326 1262 1226 1224 1232 1236 1248 1275 1293 1273 1228 1210
1979 1210 1246 1289 1270 1187 1114 1110 1147 1155 1112 1059 1034 1026 1009 984 980 1009 1055 1091 1098 1079 1058 1063 1092 1117 1113 1084 1043 987 909 844 844 915 991 996 929 862 856 899 930
1974 930 915 870 837 841 877 918 929 899 860 861 910 967 997 1003 1002 988 950 914 909 915 888 831 790 783 780 772 797 866 926 925 891 877 876 839 768 711 690 672 639 620
1969 620 645 700 753 794 831 861 876 881 881 879 868 843 803 769 766 798 825 819 810 842 892 899 860 845 884 919 895 848 844 881 906 904 895 881 848 818 827 859 857 820 812
1964H12N3N0k4p6n1mol3j9M0P2L5l3p2o2k9J3O1R0O3j4o4m3RK3qk5qJ2J5K6M9N2J2l0l3oP
1960H54lj1KK1K3lm7p3n7j5Q%LL7N7K4k7k8J3L0Kk4j1J7K7K0J3PJMJ7J3j8n4o7n7m2k1QL4
1955F77N1N2L9Nl5l9MN1M8J4MK7L7Qk6l3l2m5n0mN7N7j7q2o1J8P0N7J4k0l5l4pK7L3Mj6PM0
1950H65L4nk4KL1K4j5m4m3j8J1K9L4K3NqpNJ0j1m6o3l9KK5J7pl0l8j4L0N8M3RjJ7K2%j9rJ5
1945H70K3J3KPJ7K6K0NnJJ0Jj8k7j7kMJ2J9J7J0K2M2K7l1p9o3jM7N5M2L0K0J7K1J8j1m6m7
1940A051j4J1%k2k9j2J2K8K7Nj7j6J4M2M8L4J8J8K8L4J3k8n2l2J0K6K4M1P1O1Mk8J8Q3P5o
1936A540o0k5N5J03R3N7L4L2M0M7N7O8P2O0N0P2J07J03O0M2R8J64J48O7K4N2Q5P0N6R3J39
1932C603J30Q2O0O4M6Jj8MJ8lk6k0j4m1p6q9q9j08j37j32r1n8o1p7p1n2n6r7j47j60j21o6
$$ plain form
1964 812 865 915 891 815 764 760 754 721 702 742 814 849 816 744 682 653 666 727 817 880 866 802 759 768 791 783 758 750 762 777 803 852 904 916 886 853 847 854
1960 854 851 840 842 863 886 883 836 763 706 691 699 699 702 739 796 820 793 765 778 808 810 786 775 792 819 839 852 859 860 864 881 894 876 822 755 698 656 635 643 677
1955 677 728 780 819 824 789 750 754 805 853 867 871 898 935 943 917 884 852 807 757 753 810 867 850 768 707 725 795 852 866 846 811 777 770 797 830 834 818 825 865
1950 865 899 894 870 872 903 927 912 868 825 807 818 847 881 904 909 901 894 899 909 898 852 789 750 752 777 794 787 757 719 705 735 793 836 845 844 861 883 883 864 855 870
1945 870 893 906 908 915 932 958 978 983 978 979 989 990 972 945 928 926 930 942 961 978 988 1010 1052 1079 1048 969 906 905 952 1007 1049 1079 1099 1116 1137 1155 1144 1098 1051
1940 1051 1037 1048 1048 1026 997 985 997 1025 1052 1057 1040 1024 1038 1080 1128 1162 1180 1198 1226 1260 1273 1245 1193 1161 1171 1197 1221 1262 1333 1394 1398 1370 1388 1471 1546 1540
1936 1540 1480 1455 1510 1613 1706 1763 1797 1829 1869 1916 1973 2041 2113 2173 2223 2295 2402 2505 2565 2607 2705 2869 3017 3084 3108 3160 3245 3315 3371 3464 3603
1932 3603 3733 3815 3875 3939 3985 3986 3968 3972 3990 3987 3961 3941 3927 3886 3810 3721 3632 3524 3387 3255 3164 3106 3045 2968 2897 2845 2789 2692 2545 2385 2264 2198
1928B198l8m5n8o1o3o7n8l6l0n3p2n4k2k1m9n4k1J2Qj5k6k1k6m3m7k3J8M1K6j7m7m4k0j0k1
1924A141l1k2jJ9K8K5Kk7l6k3j1j0rMPrk6j5J0K1J3OKj4m0n0l4mJ9L1K7Pj1pJ2J7kj0NJ7q
1919A013m9n2j5J3lk9j2M0O2J9m1m8PN5M1ql1j5Joj3LJ9Ok1j9J7N0M0Kk1j0J6K6J1j5l6m1
1914I56k7lJ4J6J0J0J5K1K2K0Ol3p5p0jP8R1L7j1qJ2J1LJ2J6j9o5n6PM8J4m9o8m2j7mK8P1
1910I70P1Mo9p3qO2P6L8j3m2l4j1ok4l3j0J7J7LJ5M2K7l8q7p5l2pLK4M0K6JJRj3m8l9J1L5
1905H30J4pJ2L3K1MJ6K2j8o6n0J7M9J1l8l5LK4J2oqJ%k1n3o5l0K8N7M1J6J4K1J4MJ1K3Qk7
1900H82m5l1j1j1j0J0L0J5k7n0l0RK4Lk7k9J6Q1J06N6k5n6j5L2K5j3j7J6K8kl9m5l3k2oJ3
1896H02J0j6k5ML1J6nJ6N4N1Ok5j7kmj1j0j2j7j6mnpNK3Ol1l5KK0j5m0KP3Q5L1k2l3j8mRJ6
$$ plain form
1928 2198 2160 2115 2057 1996 1933 1866 1808 1772 1742 1689 1617 1563 1541 1520 1471 1417 1396 1408 1416 1401 1375 1354 1328 1285 1238 1215 1233 1274 1300 1283 1236 1192 1172 1162 1141
1924 1141 1110 1088 1087 1106 1134 1159 1161 1134 1098 1075 1064 1054 1045 1049 1056 1047 1021 1006 1016 1037 1050 1056 1058 1044 1004 954 920 916 935 966 993 1000 989 982 994 1011 1009 999 1004 1021 1013
1919 1013 964 912 897 910 907 878 866 906 968 987 946 898 905 960 1001 993 962 947 948 942 929 932 951 957 936 917 934 984 1024 1026 1005 995 1011 1037 1048 1033 997 956
1914 956 929 926 940 956 966 976 991 1012 1034 1054 1060 1027 952 882 881 959 1050 1087 1076 1068 1080 1091 1094 1106 1122 1103 1038 982 989 1037 1051 1002 934 892 875 871 899 970
1910 970 1041 1045 976 903 895 957 1033 1071 1058 1016 982 971 965 941 908 898 915 932 935 950 992 1019 981 894 819 787 780 783 807 847 873 874 875 884 871 823 784 795 830
1905 830 844 837 849 882 903 907 923 945 927 861 811 828 877 888 850 815 818 842 854 848 840 841 841 820 767 702 672 700 757 798 814 828 849 863 867 878 901 909 882
1900 882 837 806 795 784 774 784 814 829 802 752 722 731 755 758 731 702 718 799 905 961 936 880 865 897 922 909 892 908 936 934 895 850 817 795 789 802
1896 802 812 796 771 775 806 822 817 833 887 938 944 919 902 900 896 885 875 863 846 830 826 821 814 819 842 848 817 782 784 804 789 749 751 824 909 940 918 885 867 863 872 888
1891H88Oj0oJ3J4j4l5k0J4K5J0oMK1J3k9o3n5k4j0j5NN3O2Ln4l5K6M0LqK7K7l1o6j9M6L6k3
1886H13l3J6L6j6o2l6L0N3J6k4l1rK2N8Q1N6k1r6r8l2K8K4j5k6KL2M6O0O7L8j6m5k5jj9n7
1881H16n3kM2M1J1j0j1QL5M9M0J8%j1j7j2Lpn1r0o8kL3Pl3l0J1N0O8O9M7Qj9j4RJ8Rpj6j5
1877I24kJ5Nl0m6j1M4N3J3k4j7J8L9L2Ro%J7J9LnJ3K9Rl7m4QO9P0J3m2m6%M6N0J5j0QM1M2
1872A284J4J3N1P9N4QqKNPL9Q3P6J2l9k2L9P7O6K7j3l1j2K4L8J5j5j9j5k7m6m1j3Kmj2j7k6
1867A655l9l3rJ2J0lk2n3p9p2k9QMk0k8j8j7l6n4n5m0j1J5J9mk8l1k2j6mK1K8om1k1M0O8L2
1862A121j8k2j%k7m6m3k7j0Jjj4j6oQJ8L6N1K8k9o2l4RJ8J4M1O4K1o4r7n1NJ8K2M3M7Nl2k0
1858I50J6J1l0n3l7j5ooqqNK8M3L2J3OPKpj4k2l7l2%K3Jl1k3J7L6K0PJ0Qqj5rplJ7L5J0n1
$$ plain form
1891 888 894 884 878 891 905 891 856 836 850 875 885 879 883 904 917 888 825 770 746 736 721 726 779 841 844 790 755 781 821 824 816 843 870 839 773 754 800 836 813
1886 813 780 796 832 816 754 718 748 801 817 793 762 753 775 833 914 970 949 853 755 723 751 775 760 734 736 768 814 874 941 979 963 918 893 892 873 816
1881 816 763 761 803 844 855 845 834 842 877 926 966 984 984 973 956 944 947 940 889 799 731 729 762 769 736 706 717 767 835 904 951 959 940 926 935 953 962 955 939 924
1877 924 922 937 942 912 866 855 899 952 965 941 924 942 981 1013 1022 1016 1016 1033 1052 1055 1050 1063 1092 1101 1064 1020 1028 1097 1167 1180 1138 1092 1092 1138 1188 1203 1193 1201 1242 1284
1872 1284 1298 1311 1362 1441 1495 1503 1495 1497 1502 1509 1548 1631 1707 1719 1680 1658 1697 1774 1840 1867 1854 1823 1811 1835 1873 1888 1873 1854 1839 1812 1766 1725 1712 1714 1710 1698 1681 1655
1867 1655 1616 1583 1574 1586 1596 1593 1571 1518 1439 1367 1338 1346 1350 1330 1302 1284 1267 1231 1177 1122 1082 1071 1086 1105 1101 1073 1042 1020 1004 1000 1021 1049 1043 1002 981 1021 1089 1121
1862 1121 1103 1081 1080 1080 1053 1007 964 937 927 928 927 913 897 891 899 917 953 1004 1032 1003 941 907 916 934 948 989 1053 1074 1010 913 862 867 885 907 950 997 1002 970 950
1858 950 966 977 947 894 857 842 836 830 822 814 819 847 890 922 935 941 948 950 943 929 907 870 838 838 861 862 831 808 825 861 881 888 898 906 898 883 874 867 864 881 916 926 875
1852H75p2k1M8O8L9kk6l2qK6L6J1j6j9j8l7n2l5JK5K6J2j6l5j5L5N1J2j9PM4K4k5m0k1k3m0
1848G68j5M0N6J4j2J2L7K4MQLl7o6m3LQk1l4j8KJ1J9J5j6m6k6L3O5L7qj3K0L8K3%%Mrk7j9
1843H34J2J7k3n1j7L6L4j7l1J6N5L3rj4%j4l5j9J7J3k8n2m3l4l2j3J8K1m%M1N8J9k6rL6M2
1838H31Kk4jK9K4j2l4j9J3K0qm1m4k0MK0L8M9L4lk4j5pk1k8pJ4Jk9l2nJ6J5J2J9K0Nj4j5J
1834G64K0K4Nk1j9K6P0N6nm5l4lJj3j3J0K9J9j4m3l9PN6N6Ln0n0pK6J9j3l6k9jK7L2J7jj0
1829H21j1j1NL1M2K2oj7j7k1k2kJ7Jl4l6NL3J0k9l1JJ6ol1k2J4M4M1Mm0n2k5J2K6K3L0M0K3
1824H48j5k8KL1Rm0n2j3K4J5k4m6l4jL1M9M7K3rk3j5kjj2k5l4k8mK1J3k9n4k5K9M9K9J8L1
1819G55K7j0k1K5O5J8p1q8qO4M7rj8QOk9m0qJ6MmK3N5M9Rj6j6rj3k4k4k0j3lJ6L2K4qm0l4
$$ plain form
1852 875 803 782 830 898 937 935 909 877 869 895 931 942 926 907 889 852 800 765 766 791 817 829 813 778 763 798 849 861 842 849 893 917 892 852 831 808 768
1848 768 753 793 849 863 851 863 900 924 928 936 939 902 836 793 796 804 783 749 731 733 744 763 778 762 716 690 723 788 825 817 804 824 862 885 885 885 889 880 853 834
1843 834 846 863 840 789 772 808 842 825 794 810 865 898 889 875 875 861 826 807 824 837 809 757 714 680 648 635 653 674 670 670 711 769 788 762 753 789 831
1838 831 833 809 808 837 861 849 815 796 809 829 821 780 736 716 720 740 778 827 861 858 834 819 812 791 763 756 770 771 742 710 705 721 736 748 767 787 792 778 763 764
1834 764 784 808 813 792 773 799 869 925 920 875 841 838 839 826 813 823 852 871 857 814 775 782 838 894 897 847 797 790 816 835 822 786 757 756 783 815 832 831 821
1829 821 810 799 804 835 877 899 893 876 859 838 816 814 831 832 798 762 767 800 810 781 750 751 767 761 730 708 722 766 807 811 771 719 694 706 732 755 785 825 848
1824 848 833 805 807 838 847 807 755 742 766 781 757 711 677 676 707 756 803 826 817 794 779 777 776 764 739 705 677 673 694 707 678 624 599 628 677 706 724 755
1819 755 782 772 751 776 841 859 788 700 692 756 803 794 776 784 790 761 721 713 729 733 729 752 807 856 865 849 833 824 811 787 763 743 730 727 743 775 799 791 751 717
1814G17JK2Nk3k5%J8J5Mj2k9k8J8P8Q3K1l1j5L0K1m1p5l5K2L0jj8kJ7J1rk0k2k4k7k3j1ok0
1810F16l6k0L1P2N6Mk8rK1J3j9k7nJ5QnOK4K6J2LL%j0rJ%k3l7k1J0J7oj7PM5N0Rm3m8MO8P4
1804H32J0n4n5oK1Lj2J2L4Rm4o0k5J2J6PJ3L0L2J0k6n7o5l7%J1jjK4L9K2qj5j3k1k7kL9N1
1800F98K8QPOnnJ8L0jm8o7m8j7J1K7K0lk5k7k1j7%L9O3M6J3QJ5rn3n5j3J1oj0K6N1K4j5j7
1795F87j0m2p4l5N2Q5M1j4k1oKLMj1k9j5K7L3j3l9pK8%m7k4N5R5M6l6o6l4J7M4M0K5J3%l1
1790G43o3n7kM4K9k9o2m4JL8N3M0Mj8nJ7J4qj8j7l0l5%M7M8J0kK3J4n0r6n5K7O2L4JnJNJ8
1785F77L6L8J5j9m1l4jK7J2l2m2KM1K0l1m3j0J9K0J3J6J7QJMJ4L1M4K6l7r6q7j9L6L5Lj8k5
1781F20k1j3mpjL0O7N7Nk6%L2J8k4m1k4rlNJ3Nj2j4knk0k0PL0K4kj4j2j6k7l0j4PJ2ORL0M8
$$ plain form
1814 717 718 740 745 722 697 697 715 730 734 722 693 665 683 761 844 865 834 819 849 870 829 754 719 741 771 770 752 750 767 778 769 749 727 703 676 653 642 636 616
1810 616 580 560 591 663 719 723 695 686 707 720 701 674 669 684 692 687 693 717 743 755 758 761 761 751 742 743 743 720 683 662 672 689 683 666 673 718 768 777 734 686 690 758 832
1804 832 842 788 733 727 748 751 739 751 785 794 750 690 665 677 693 700 713 743 775 785 759 702 637 600 600 611 610 609 633 672 694 686 671 658 637 610 608 647 698
1800 698 726 734 741 747 742 737 755 785 784 736 669 621 604 615 642 662 659 634 607 586 569 569 608 671 717 730 738 753 744 691 636 623 634 628 618 644 695 719 704 687
1795 687 677 635 561 526 578 663 704 690 669 663 665 668 672 661 632 617 644 677 664 625 618 646 646 599 575 630 725 771 735 669 635 652 696 736 761 774 774 743
1790 743 680 623 621 665 694 665 603 559 560 598 651 691 695 677 672 689 703 695 677 660 630 595 595 642 690 700 698 721 735 685 589 534 561 623 657 658 653 654 659 677
1785 677 713 751 766 747 706 672 671 698 710 678 636 638 679 699 668 625 615 634 654 667 683 700 708 709 713 727 758 802 828 791 695 608 589 625 660 663 645 620
1781 620 599 586 582 575 574 604 671 728 733 707 707 739 757 733 692 668 659 656 661 674 679 667 653 651 646 626 606 613 643 667 665 651 639 623 596 566 552 559 571 577 586 616 664
1775F64M5K7J8J9J2jnkj6n0o0k8Kj1m4l1L6Q7P4K1j7j8pnqj0j1j1j0mLONoj9k3j4%OJpj2j3
1770E83qlKJ5L6N0L1j1k4K4Q4P9jp1o6j1J6ok6j3Nkj5pJ4J3j7m2m3k1J0K9J8j8m3k7J0K3J6
1765E83K1M6N0J7j2lJ9J7nj4lLj0l0m2l4j4KLjJ7L9K7j8l6KM1J4m6n6oL2J2j3LL6L7J2KJ2
1760G04J1j8m4l1J7M9L2j9m5k8mj0k9k4NK6K6K2J1j9n3m9pK3J5KJ7L4K7Rmj3k2j1J8K8lk9
1756F14j7Lj0l1j8J2J7RK7N0K0m1n6j2K2Nj0RJ5k4n5k1L6M3J6J6M1K6l2o3j9M4N0lm8l0L3
1751F18P8N7qm6k9NPj4j0J4Rk6l5KL2Jn6p1l2OJ3J5L6M9L0mlL3M8J2m0m9j2K0K3Prk1k5pK6
1746F44L1Mj7nPj7l7j1L7L8kj6J4K5j7n6l7J2L1J3PJ6J4j1l1k3LK1K4J6O%nj7pL2O1K0o4r1
1741F12k6L5J3m0k6L2L5k3m3PM5J6k2pK0Ml2k9jMlK3O7O4ko2n8j2J4ll2k6K0O5O2J0m5o3m7
$$ plain form
1775 664 709 736 754 773 785 784 779 777 761 711 651 623 625 614 570 539 575 662 736 757 740 722 715 710 702 692 681 670 660 656 659 665 670 664 645 622 608 608 614 615 608 596 583
1770 583 575 572 574 589 625 675 706 695 671 695 779 858 857 786 720 709 725 719 693 680 685 683 668 661 675 688 671 629 586 565 575 604 622 604 561 534 544 567 583
1765 583 604 650 700 717 705 702 721 738 733 719 716 719 709 679 637 603 589 591 594 593 610 649 676 658 622 624 665 679 633 577 571 603 615 602 605 641 678 690 692 704
1760 704 715 697 653 622 639 688 720 701 656 628 624 614 585 561 566 592 618 640 651 632 579 530 523 546 561 563 580 614 641 650 646 633 611 600 618 646 643 614
1756 614 597 600 590 559 541 553 570 579 606 656 676 635 579 567 589 594 584 593 608 584 529 508 544 587 603 619 660 686 654 591 572 616 666 663 615 585 618
1751 618 696 753 745 699 670 675 682 668 658 672 681 655 620 622 654 655 599 528 496 502 515 530 566 615 645 641 638 671 719 731 691 642 630 650 673 680 671 650 625 618 644
1746 644 675 679 662 657 664 647 610 599 636 674 672 656 670 695 678 622 585 597 628 641 648 664 678 667 636 613 616 637 661 677 683 683 678 661 654 686 747 767 703 612
1741 612 586 621 634 594 568 600 635 612 569 576 621 637 615 608 628 632 600 571 570 574 571 594 661 725 723 661 603 591 605 602 570 544 564 629 691 701 656 593 546
1737E46j7RK3Pk5k6J3M2J7k2j3K9M3J9KQQj3k5j2PJ8L3M5K5k6n8l6lkk1k0jjk4l5nM5O7M4
1732F65pm4m4j8LQQRKjJ2K8J4l2n7l2J5L5K7J4Pkj1kJ6K5J0j9l0rL4M9On3n7PN4K6l1l7J0
1727E98M1K9Pol5p3p5j7M8O7N2M0L6J0l6n8l3J9M9L2j3l9k9oKpqLJ2J6K7M4L5mm8o4m5jM8
1722F18O6L0l1n6k4J4K1K2L8M0rq1j00n3OL3L5L6L1Pk8n5n8l0J5M0K0j7j9QJ3k2m2j1L4L7
1717E28J2MK6L8K9K2K9K5jk6l2k7k2rRRj8m0k9nkj7k1KL3N0M9L4J0j1j6j8k7l0jM7O4L2j3
1713F87k8pJ8J9nl6m8l3j0lj1kK4M0K3MLJ0MJRJ2j0l3k3PK4K5L4L7Rl8n9l9rOJ4J8Pj0j5j1
1708F05j6j9NL3J7m2p2l8J4L0J6%qj6qJ8L3K2J8M4N6K5k2l7l2l6l1RM9K9k4m3j1J2OJ0L9N1
1703F86J7k9m4l0rKj2n4p7l0N5Q7L7j8j1J2qm6m3rKrKL3L6kk9j5J6L2L7M4L9J4k2m6m7k8n
$$ plain form
1737 546 529 538 561 568 543 517 530 572 589 567 554 583 626 645 647 655 663 650 625 613 620 638 671 716 741 715 657 621 618 616 595 575 574 573 549 514 509 554 621 665
1732 665 658 614 570 552 555 563 571 580 582 581 593 621 635 603 546 514 529 564 591 605 612 610 599 597 613 638 648 629 599 590 624 673 679 626 569 576 630 656 625 588 598
1727 598 639 668 675 669 634 561 486 469 517 584 636 676 712 722 686 628 595 614 663 695 682 643 614 608 610 603 595 598 610 626 653 697 732 728 680 616 571 570 618
1722 618 684 714 683 627 603 617 638 660 698 738 729 648 548 495 501 534 569 605 636 643 615 560 502 472 487 527 547 530 511 519 532 510 468 457 491 528
1717 528 540 544 570 608 637 659 688 713 712 686 654 627 605 596 605 614 596 556 527 522 520 503 482 484 517 567 616 650 660 649 633 615 588 558 557 604 668 700 687
1713 687 659 652 670 689 684 648 600 567 557 554 543 541 565 605 628 632 635 645 649 650 659 671 661 628 605 612 636 661 695 732 741 703 644 605 596 602 616 634 641 631 616 605
1708 605 589 570 575 608 625 583 511 473 487 517 533 533 525 509 501 519 552 574 592 636 692 717 695 658 626 590 559 568 617 646 622 579 568 580 586 596 635 686
1703 686 703 674 630 600 591 593 581 527 450 420 475 562 599 581 570 582 574 528 485 476 478 469 471 504 540 538 509 494 510 542 579 623 662 676 654 608 561 533 528
1698E28OQK7N7N7mo9o0J5O2K7l1l6KJ6j2l3j6J3J6%j0rqJL1N5L6j8m7j2L3K5l0n5j9J9Rl0
1693E44l6oK6L5L1J2j6k8mL1L0MKL3L7j3o7n8jM0L7J0j0k2k1kK5L2J5ooRJ6kl3m4j5K6L8J2
1689F55j7k3k3k8k4JJ7jk1mL3L4jj6J6L9J8k2k7j2j7l8l3LK4Pj0RM8O7M9J7qk6l5l2j7ppj5
1684E73j6nJ7L7M2K3qk5j1J7K8J4j0k2k6k3j7j1j2qJ0L7N1L8J7Jk8o4p0k2K8K1j8j4L0M2L
1679F19k1J4M7K3k2j8J3Ml1l1LRk0k1K2L7j0m7pM3J3o5q4k1L0Pl0lP2J08O6kk5PL7K0k3l0
1674F83J2M5K0l2n2k5J0J7Pnj1j2j2k0l2k7KK3J3j8l2k5j7rK0O0P1L4j7m4l7j3Jj1m1m4mM0
1670E18L7J7L0N6J7p9j26o3L6O9M0J6K0J6JJPjj4kK0J4j5k0JQj7m0m1l5k4MM0M4J7nnmj0L
1665E31L1K3l2p2m8%J0j0rJ3K3J9L4O2N6J7mJ5L3Rk5k1QJ2k3n0k9J4J8k9q1p5j6M3N0J3j6
$$ plain form
1698 528 534 542 569 626 683 679 610 550 565 627 654 623 587 589 605 593 560 544 557 573 573 563 554 546 547 578 633 669 651 604 592 625 650 620 565 546 565 574 544
1693 544 508 502 528 563 594 606 590 562 558 589 619 623 625 658 695 682 615 557 556 596 633 643 633 611 590 588 613 645 660 654 648 657 673 671 638 594 579 605 643 655
1689 655 638 615 592 564 540 541 558 557 536 532 565 599 598 582 598 637 655 633 606 594 577 539 506 509 533 540 530 539 587 654 703 720 712 686 651 619 602 595 588 573
1684 573 557 552 569 606 648 671 663 638 627 644 672 686 676 654 628 605 588 577 565 557 567 604 655 693 710 711 683 619 549 527 555 576 558 544 574 616 619
1679 619 598 612 659 682 660 642 655 659 628 597 600 609 589 568 590 627 617 570 563 606 619 554 470 449 479 486 456 453 525 633 699 697 672 679 716 736 713 683
1674 683 695 740 760 728 676 651 661 678 685 680 669 657 645 625 593 566 568 591 604 586 554 529 512 503 523 583 654 688 671 627 590 577 578 567 526 482 478 518
1670 518 555 572 602 658 675 596 470 407 443 512 552 568 588 604 605 606 613 612 598 596 616 630 615 595 596 604 587 547 506 471 447 451 491 535 552 547 542 538 528 531
1665 531 562 585 553 481 433 433 443 433 424 437 460 479 513 575 631 648 644 659 692 701 676 655 663 675 652 602 573 587 605 576 495 420 404 447 497 510 494
1660D94pK1L1K4K1M0N5L5j1m5m1pK0K2Lj9k8j7koj7pK4L6Kl3k1J9L0Jk6l1k8k2JK9K4rj2L9
1655E82Q2N0k1n4l1j0j0lK4L2Lk0MM8M3l0r9r1k0L2J5k1j6J2Km3m6J1N8L6pj1Opl3j6K8K8
1651E07j2j9L1O8L7j1j8J2L3L7M5M1Mm2n4k8PK5K4Mk8m4k3J2J9lj6ML1L3Lk7l7k7j3j0j4j0
1646E41%J0J4J5Nk6n6m0K3P4N9nm8m6k1JJ4J5jj9rK6M4J8j8l2l0l4k5J9O7N8j1n7k4L9M5j1
1642E74n6m0jJ1%PL6N5M4Rl3p1q0m8%L5M5M6L4%m1n1k1J4K9L2L2J7j6m5n3m0j0K9O4O2K6q
1637E87j2jjnLJ8K4K0Qj7m1l0K0N3J4o5r7m7L0O6M5Jl4m0j4L6P5P4K7k6l8KM1L2pj9jj2n8
1632F11p6k9K5K2qKL7L0k1m4j2K5K6J0nk7m5k1L1M9J5j7rRKj1rpk0j7J9M4J2l4k9K1M5J3l6
1627E71n5l7jK1J1j5j9KOj5j7K1L7ml9OP4O0k3n6j1L1J7lJ0Lm4o5j5L5J1m1k7L1M5Kj3L3O5
$$ plain form
1660 494 487 508 539 563 584 624 679 714 703 658 617 610 630 652 655 636 608 591 589 583 566 559 583 619 621 588 567 586 616 617 591 560 532 510 511 540 564 555 543 582
1655 582 664 714 693 639 608 598 588 585 609 641 644 624 628 676 719 689 590 499 479 511 526 505 489 501 503 460 414 425 483 519 512 501 507 500 467 451 479 507
1651 507 495 476 507 575 612 601 583 595 628 665 710 751 755 713 659 631 638 663 687 691 663 619 596 608 627 624 608 612 643 676 679 652 615 588 575 565 551 541
1646 541 541 551 565 580 585 559 503 463 486 560 619 614 566 520 499 500 514 529 528 509 500 526 570 588 570 538 508 474 449 468 535 593 582 525 501 540 585 574
1642 574 518 478 477 488 488 495 531 586 630 639 606 535 455 407 407 442 487 533 567 567 526 475 454 468 497 529 561 578 562 517 464 424 414 443 507 569 595 587
1637 587 575 574 573 568 571 589 613 633 641 624 583 553 573 626 640 575 478 431 461 527 572 573 539 499 485 521 596 670 697 671 633 635 676 708 701 682 681 669 611
1632 611 535 506 531 553 545 547 584 614 593 549 537 562 588 598 593 566 521 500 531 580 595 578 569 578 580 569 560 553 533 516 535 579 591 557 528 549 594 607 571
1627 571 516 479 478 499 510 495 476 478 484 469 452 473 510 506 467 473 547 607 584 528 517 548 565 562 572 575 531 466 451 486 497 456 429 460 505 507 494 527 592
1623E92L2k4m3k2kOONkj0j2pNJ8J9jk0qK4L2Oj3NL5M0K3J4Pj6m1l2NK2j2n7o5k7J2K5J9Pl
1617E42oPK9M0K3j1l4l6k9k2j5jK3M8N5L1j8n6m9j2J7Rp%K3K5pl1j1L3M6Rl5k5L0O2K3m8p6
1613E46l4L0N9M4J5oj7k5l4l7k5MK6K0qk0j0MMJ3L8M3jn7o1j2K7J9qj5jPKj1k8l7j7K6N5M4
1608E62K4K5L4J3k6m6k8qj7m5n5l4NL3L2J1kMJ9J4J%J5J8LlK2M8L9nl8l4qPKpj2j1j2mLjk1
1603E17l0qL2M4J6j8k7j9j0OL6N6K9k8n0j8J9J4j4rM0Q5P2Rn3o5k9Mnl4m0j3J2J7J3Oj7m3
1598D97k3M1Q3M4k9n3k3jq%L8O0K9j4j6Nmm5o6l6J2L2J3j5k0%K3J5j4k8lL2L5J7J2K9K8lk5
1593F19rK5K4j5m7m1k0j7l1l1j0J6L4M1L4%l8m5j2K3K4Krrk1l6k9J0M3M3K1MLRJ3%k2l6j6
1588D94K1M4L5J3lnRK7J9k4o3m6J4M5Rl7k5L2O9N4Nl7m7j7K9M1Mm0m3j5lk0l5k5nJ2K8L4J8
$$ plain form
1623 592 624 600 557 535 533 539 545 550 548 538 526 519 524 542 561 560 540 532 556 588 594 581 586 621 661 684 698 705 689 648 616 621 643 631 574 509 482 494 519 538 545 542
1617 542 536 543 572 612 635 624 590 554 525 503 488 487 510 558 613 644 626 570 521 509 526 535 528 528 551 576 569 538 527 560 606 615 580 555 585 647 670 622 546
1613 546 512 542 601 645 660 654 637 612 578 541 516 520 546 566 558 538 528 532 536 549 587 630 629 572 511 499 526 545 537 522 521 528 530 519 491 454 437 463 518 562
1608 562 586 611 645 658 632 586 558 550 533 488 433 399 404 437 469 480 478 482 501 515 516 516 531 549 552 549 571 619 658 653 615 581 573 580 582 575 563 552 540 536 539 538 517
1603 517 487 479 511 555 571 553 526 507 497 503 539 595 624 596 546 528 547 561 547 538 578 663 735 744 691 626 597 601 596 562 522 509 521 538 551 557 540 497
1598 497 474 515 598 642 613 560 537 536 528 528 566 626 655 641 625 630 626 581 515 479 491 523 536 521 501 501 524 539 525 497 494 526 561 578 590 619 647 644 619
1593 619 610 635 659 644 597 556 536 519 488 457 447 463 497 538 572 572 534 489 477 500 524 526 517 508 487 451 422 432 475 518 539 543 546 555 568 568 546 510 494
1588 494 515 559 594 607 604 599 608 635 654 630 567 521 535 580 589 552 527 559 628 682 687 650 603 586 615 656 660 620 577 562 559 539 504 479 474 486 514 548 566
1584E66j0j2J9M6L7Mj3kOj0l4k8J3N0M0nm2m8m5l7JO3Q7L7l4n6k8%J7M0N6L5oj4NKl1m4j4
1579F11J0LkK5M8K6j5l0j7pj2qJ2L2L4Pl3m7j8K0J0l2m5mL2K5MMJ1LmOLk8l7ON6N5K3J2J0
1574G49j7m9l6kj0n1n5JO1P8O0K8j4m4l3PK1%k3l0l0k6JL5L8J7J7L2K1qjL8L7k8q0n9qQjk
1569F42mj7j2K9O2M3Nrj7n5q5n2K2N5K8oj1lJJ5L8M3K4ok5l0j3J4K1lk4j0J2J0MK7M3Qn5o8
1564F41k8Kqj1J7M7M6L4K8J0k2l4j0Qrk3nK1J4j1j6m%kMJ4Oj3k3j8rJJ6K6K2J7J9J0k4m4j7
1559F72L8O4M0lk6l0j5RK8K4Mpkkk3n1o1m4jL8M9K6OOKk9n8l7J5L0j2m4j5L2L0j6m0j2K8L6
1554F49J2j5k4rJ8L1J5j2k1j1qk4l1j2J8M2N3M8K8jj1JLj7k6PM5K8k8n4k9MMmMJ1MjJ0J1j3
1549F95k7LL7L0MJ5M3K8k9n3j6K4J9LNRj4l7k3L%j5rJ3J8RJ2K1J3rmK8M7K6qk0j3jORRPJ1
$$ plain form
1584 566 556 544 563 609 646 650 637 635 641 631 597 569 582 632 672 667 625 577 532 495 496 559 646 683 649 593 565 565 582 622 678 713 707 693 698 700 669 625 611
1579 611 621 624 622 647 695 721 706 676 659 652 640 632 644 676 710 717 684 637 619 639 649 617 572 568 600 625 629 633 644 647 643 649 652 624 587 593 649 704 727 739 749
1574 749 732 683 647 645 635 584 529 530 591 669 729 757 743 699 666 673 694 694 671 641 611 585 586 621 659 676 693 725 746 738 737 775 812 784 704 645 637 645 644 642
1569 642 638 621 609 638 700 743 748 739 722 667 582 530 552 607 635 629 618 615 616 631 669 712 736 730 705 675 662 676 697 694 670 660 672 682 686 713 756 764 709 641
1564 641 613 615 607 596 613 660 706 740 768 778 756 722 712 720 711 688 683 704 718 707 691 687 687 685 689 703 709 696 673 655 646 647 663 689 711 728 747 757 733 689 672
1559 672 710 774 814 811 785 755 740 749 777 801 805 798 796 794 771 720 659 615 614 652 701 727 733 739 741 712 654 617 632 662 650 606 591 623 653 637 597 585 613 649
1554 649 661 646 622 613 631 662 677 665 644 633 625 601 570 558 576 618 671 719 747 746 735 736 739 722 696 703 748 776 748 694 665 669 673 669 673 684 688 687 697 708 695
1549 695 668 671 708 738 742 757 800 828 799 746 730 754 773 776 781 790 776 739 716 719 719 704 695 708 726 735 747 768 781 772 768 796 843 869 861 841 828 827 833 842 851 858 869
1544H69J2Mo%J8K2QnLK4L5M1M8O1P6R3J02R0N7K4J8L1M9N3M3K5Qmj2j5j8j9k2l7o5q7q9p0
1539A365m5l4m1n3n8m9l3j3J0J9pm9o9m1jJ2MJ3L0K4qj9J2M2K7j5l8k5lRK2K9K1kj5j3j0j1
1535I87KK5K6j3n9n9j0M0N9M9L0jl1l3LL2J8j2mL2L7j0n0l0J1J6rj7RL7M0K6OpkJ4J1k7n7
1530A079l0K7M1jl0LN5O2L1J0J2J8J6J0Lj4k5j2J6L7L2km6n7j2N2O9K4j2NL2Pm2m1J3M8K3
1525A401j1jK7L2J0rj3j7k0j3LK4M3M8K3j0j6PJ8rl4j3L1M4J6nJ1L7M1L0K2J0nlK6M4J7l0
1521A756l4RL9K0q%K8K9LmJ2K3J4J5M1N9M8K0Lpj2MM8Q3P6M4L1L3K1KML0M6K9J4K2M4M9L7
1516B671K0J9L4N5N7L1J2K6N9O4M5M0O1O8N2N2Q1R8P4M8O8J08J17R5P7O7N0M9R2J42J47J14
1512D793J09J41J57J44J45J70J63J11Q9J49K23K19J54J29J70K13J99J48J10J06J38J89K18
$$ plain form
1544 869 881 885 879 879 897 919 927 922 925 949 984 1025 1073 1134 1210 1303 1405 1495 1552 1576 1594 1625 1674 1727 1770 1795 1803 1799 1787 1772 1754 1735 1713 1676 1611 1524 1435 1365
1539 1365 1320 1286 1245 1192 1134 1085 1052 1039 1049 1068 1061 1012 943 902 901 913 917 930 960 984 976 957 969 1011 1038 1023 985 960 957 966 988 1017 1038 1036 1021 1008 998 987
1535 987 989 1014 1040 1027 968 909 899 939 998 1047 1077 1076 1045 1012 1015 1047 1065 1053 1049 1081 1118 1108 1058 1028 1039 1055 1046 1029 1038 1075 1115 1141 1147 1140 1138 1152 1163 1136 1079
1530 1079 1049 1076 1117 1116 1086 1089 1144 1206 1237 1247 1259 1277 1293 1303 1306 1292 1267 1255 1271 1308 1340 1338 1292 1235 1223 1275 1344 1368 1356 1361 1393 1400 1358 1317 1330 1378 1401
1525 1401 1390 1389 1416 1448 1458 1449 1436 1419 1399 1386 1389 1413 1456 1504 1527 1517 1501 1508 1526 1517 1483 1470 1501 1545 1561 1556 1567 1604 1645 1675 1697 1707 1702 1699 1725 1769 1786 1756
1521 1756 1722 1731 1770 1790 1782 1782 1810 1839 1842 1838 1850 1873 1887 1902 1943 2002 2050 2070 2073 2066 2054 2058 2106 2189 2265 2309 2340 2373 2394 2396 2400 2430 2476 2505 2519 2541 2585 2634 2671
1516 2671 2691 2710 2744 2799 2856 2887 2899 2925 2984 3048 3093 3133 3194 3262 3314 3366 3447 3545 3619 3667 3735 3843 3960 4055 4132 4199 4249 4298 4390 4532 4679 4793
1512 4793 4902 5043 5200 5344 5489 5659 5822 5933 6022 6171 6394 6613 6767 6896 7066 7279 7478 7626 7736 7842 7980 8169 8387
1509H387J91J36J15J29J34J19J25J53J49Q0J1QM2N1L2K7L1J6kK8R1J09O2K3M4R0R6O9O7J10
1505A0723J58J84J93K06K21K20J96J72J84K48L18L43L26L22L52L69L51L42L83M35M40M01L69
1503A7456L56L34K99K83K94K96K66K17J61R2K6KJ0Mm3q8r2q1j06j65k18k39k37k29k23k25
1499A8150k30k18j81j44j27j22j15j06j05j00q0n5m3l2lL2N5Q0J33K01K34K25K06K04K03K00
1496A8262K17K61K90K66K16J91J93J87J62J53J72J72J13K8k6l5m5r2j45j69j70j89k32k80
1493A9500l16l45l57l35k91k80l20l67l62l16k83k88k97k76k42k23k32k54k57k23j63j21j23
1491A3229j44j42j10q3p9q0p2p7j06j33j20o9j4Ppl7o0o5n5n2n8o7o4n3n2o5r3j27j45j35
1487A0872j13j12j38j51j33j18j48j95k04j67j46j69j97j80j39j29j56j73j52j21j11j26j39
$$ plain form
1509 8387 8578 8714 8829 8958 9092 9211 9336 9489 9638 9718 9729 9737 9779 9830 9862 9889 9920 9936 9934 9962 10053 10162 10224 10247 10291 10381 10477 10546 10613 10723
1505 10723 10881 11065 11258 11464 11685 11905 12101 12273 12457 12705 13023 13366 13692 14014 14366 14735 15086 15428 15811 16246 16686 17087 17456
1503 17456 17812 18146 18445 18728 19022 19318 19584 19801 19962 20054 20080 20082 20092 20096 20053 19965 19873 19792 19686 19521 19303 19064 18827 18598 18375 18150
1499 18150 17920 17702 17521 17377 17250 17128 17013 16907 16802 16702 16622 16567 16524 16492 16489 16521 16576 16656 16789 16990 17224 17449 17655 17859 18062 18262
1496 18262 18479 18740 19030 19296 19512 19703 19896 20083 20245 20398 20570 20742 20855 20883 20857 20822 20777 20685 20540 20371 20201 20012 19780 19500
1493 19500 19184 18839 18482 18147 17856 17576 17256 16889 16527 16211 15928 15640 15343 15067 14825 14602 14370 14116 13859 13636 13473 13352 13229
1491 13229 13085 12943 12833 12750 12671 12591 12519 12442 12336 12203 12083 12014 12000 12007 12000 11963 11903 11838 11783 11731 11673 11606 11542 11489 11437 11372 11279 11152 11007 10872
1487 10872 10759 10647 10509 10358 10225 10107 9959 9764 9560 9393 9247 9078 8881 8701 8562 8433 8277 8104 7952 7831 7720 7594 7455
1484G455j29r6n0k6m5q7j03q2n6n9p4o9m7l6l4j8PJ1jML2L5%k5KL7J6l8m9J0O0M2k2o1m9j1
1480F444J6J7jj1J0N4P4N3L0M2P1Q0O2N4O9Q3P3M8L8N3Q5J24J39J16O9M4O0R0J00Q8Q3R4J10
1476H561J29J54J71J56J26J26J77K30K47K47K78L36L79M08M61N39N93O12O59P78R20J025J111
1473A8423J239J424J643J909K266K736L311M026M972O219P772R601J1665J3824J5743J6910
1471A23683J6849J5456J3212J0972R363Q339P385O135M656L138J478o63l480o810j0251j3368
1469A86094j5782j7235j7638j7059j5669j3743j1637r673p999o598n434m519l835l289k806
1467C3178k389k081j860j668j471j281j131j030r64q98q15p35o83o42n67m71m17m27m52m32
1465A2764l85l58l63l70l60l45l31l19l08k99k82k51k19k01j91j74j50j32j27j27j21j08r6
$$ plain form
1484 7455 7326 7230 7180 7154 7109 7022 6919 6837 6781 6722 6648 6579 6532 6496 6462 6444 6451 6462 6461 6465 6497 6532 6532 6507 6509 6546 6562 6524 6475 6485 6545 6587 6565 6504 6455 6444
1480 6444 6460 6477 6476 6465 6475 6529 6603 6656 6686 6728 6799 6879 6941 6995 7064 7147 7220 7268 7306 7359 7444 7568 7707 7823 7892 7936 7996 8086 8186 8274 8357 8451 8561
1476 8561 8690 8844 9015 9171 9297 9423 9600 9830 10077 10324 10602 10938 11317 11725 12186 12725 13318 13930 14589 15367 16287 17312 18423
1473 18423 19662 21086 22729 24638 26904 29640 32951 36977 41949 48168 55940 65541 77206 91030 106773 123683
1471 123683 140532 155988 169200 180172 189535 197874 205259 211394 216050 219188 220666 220003 216523 209713 199462 186094
1469 186094 170312 153077 135439 118380 102711 88968 77331 67658 59659 53061 47627 43108 39273 35984 33178
1467 33178 30789 28708 26848 25180 23709 22428 21297 20267 19303 18405 17590 16855 16172 15530 14963 14492 14075 13648 13196 12764
1465 12764 12379 12021 11658 11288 10928 10583 10252 9933 9625 9326 9044 8793 8574 8373 8182 8008 7858 7726 7599 7472 7351 7243 7147
1462G147r3j06j17j11r0q2j00j23j27j08q9p4o1m9m2m1m9o9r7j10r4n3j8pk0l9m6m5o0r4j12
1458D821q0l4l5q1j00n3jpm7n7l3k5m4o1n1l4l1l1l3m0n0m0j0J6J9%k5n0o5n8m1l3l1k2pp
1454C539k8n3o1m6j4K2L0Lk3j3J3Ll7n3k5PPorj5l7m7j9J7K7J7J1nm8q3n7J6N9M1LmNjk8m9
1449C059n1l8k6k0l2m5l2QL9K9nl1m2m7m2j7J3K0NpKJ8K9L9M2K6j0k8jM1M3km1l1%J2jJK3
1444B900L8K2rk8k7j8j8l4o0o7k9K9N1J7k1nM1M2j2n9m5JJ6qk6j6LKj3j9rMJ4K3K6J0k5n1
1439B640m6k0j2l4m8k0K9N3K5j5l1j9nMJ3K7L8M1L8K4lk8k8%L4N0N0L9J7j0k9k4j0rk6l9k9
1435B637NM1N7M4J2qKJ6Jl4n1k4K5N1L9J1%K3N6N3Lm3l1K5N6L2kkK0K6K4M1O4O4M5M0N7O6
1430C441O0O7Q9Q9N8K5K4L1K1MQK5K8J3lj2k3k5j8rj0j5j4j6l1m4l6k6m1p2p1l8j8l7n7k7
$$ plain form
1462 7147 7054 6948 6831 6720 6630 6548 6448 6325 6198 6090 6001 5927 5866 5817 5775 5734 5685 5616 5519 5409 5315 5262 5244 5237 5217 5178 5132 5087 5027 4933 4821
1458 4821 4741 4707 4672 4591 4491 4438 4437 4430 4383 4326 4293 4268 4224 4163 4112 4078 4047 4016 3983 3943 3893 3853 3843 3859 3878 3878 3853 3803 3738 3680 3639 3606 3575 3553 3546 3539
1454 3539 3511 3458 3397 3351 3337 3359 3389 3392 3369 3356 3369 3372 3335 3282 3257 3264 3271 3265 3256 3241 3204 3157 3138 3155 3182 3199 3210 3205 3157 3074 3017 3033 3092 3133 3136 3132 3137 3136 3108 3059
1449 3059 3008 2970 2944 2924 2892 2847 2815 2823 2862 2891 2886 2855 2813 2766 2724 2707 2720 2740 2745 2738 2740 2758 2787 2826 2868 2894 2884 2856 2855 2896 2939 2937 2896 2865 2865 2877 2876 2877 2900
1444 2900 2938 2960 2951 2923 2896 2878 2860 2826 2766 2699 2670 2699 2750 2767 2746 2741 2782 2824 2812 2753 2708 2709 2725 2717 2691 2675 2678 2680 2667 2648 2639 2643 2657 2680 2706 2716 2691 2640
1439 2640 2594 2574 2562 2528 2480 2460 2489 2542 2567 2552 2521 2502 2497 2501 2514 2541 2579 2620 2658 2682 2679 2651 2623 2623 2657 2707 2757 2796 2813 2803 2774 2750 2740 2731 2705 2666 2637
1435 2637 2642 2683 2740 2784 2796 2788 2790 2806 2807 2773 2722 2698 2723 2774 2813 2824 2824 2847 2903 2956 2959 2916 2885 2910 2966 2998 2996 2994 3014 3040 3064 3105 3169 3233 3278 3318 3375 3441
1430 3441 3501 3568 3657 3746 3804 3829 3853 3884 3905 3909 3917 3942 3970 3983 3980 3968 3945 3920 3902 3893 3883 3868 3854 3838 3807 3763 3727 3701 3660 3588 3517 3479 3461 3424 3367 3340
1426C340K3L0k5q3q1l1Nkk0k0j6l3o1o9m6k0qonjJ0L0M9L4j8o9q1n5k3LK0K4J3K%ql2n2m5
1421B673k5pQL0L7J0k2k1J%k5k5J5M9M4J7%pk0l2l3k7k1qJ1J5mj8j2nk0l9l8k0qkOJ1NKJ8
1416B513K7J1j8k3j3j8m4n1k1J8L1K1QNN%j8l6l2pjl3o5n1pRnjL4N1J8k9l9k4j6j2QK0Jj8
1411B198JL3J9l3n1nL7J4l8m9j0J7Jk6k7LL1M4L2%l7n6m8l4k7j0K7N6L7k1o0n3k2okRJ8Oj4
1406A954j4OJ3rk6j6nk1m4l5KK4Oj5oJ8K0ol3m4m8m1j5L1N8M4J2KJ8L0J9Jmrk8m3k8MJ8PM
1401A801K0K6km7o5m2jL2M2L0J5RJ4QmKL2O4O9O2O5O7N5L7L1K8J4J0M3Q5Q8O0M9O2L8l1p7
1397B689n1JMk8m6n0p2r9q8m6k8m4o1n4m9n5n6l9k3j4MJ7lm2m5pJ4j2l9j8J6K1J9M3N5Pn6
1392A765m6K6N7Nn6n2j3M%MRrl9l5kK2J7PJ3K9L0J6kplKj1l3l8j6J3K7K6K8L3K4Jj4mK0L1
$$ plain form
1426 3340 3363 3393 3368 3285 3204 3173 3178 3176 3156 3136 3120 3087 3026 2957 2911 2891 2883 2877 2872 2871 2881 2911 2960 2994 2976 2907 2826 2771 2748 2751 2771 2795 2808 2810 2810 2802 2770 2718 2673
1421 2673 2648 2641 2649 2679 2716 2726 2704 2683 2684 2684 2659 2634 2649 2698 2742 2759 2759 2752 2732 2700 2667 2640 2619 2611 2622 2637 2633 2615 2603 2598 2578 2539 2501 2481 2473 2471 2477 2488 2493 2495 2513
1416 2513 2540 2551 2533 2510 2497 2479 2435 2384 2363 2381 2412 2433 2441 2446 2451 2451 2433 2397 2365 2358 2357 2324 2259 2208 2201 2210 2205 2204 2238 2289 2307 2278 2239 2215 2199 2187 2195 2215 2216 2198
1411 2198 2199 2232 2251 2218 2167 2162 2199 2213 2175 2126 2116 2133 2134 2108 2081 2084 2115 2159 2191 2191 2154 2098 2050 2016 1989 1979 2006 2062 2099 2078 2018 1965 1943 1937 1935 1944 1962 1968 1954
1406 1954 1940 1946 1959 1950 1924 1908 1903 1882 1838 1803 1805 1829 1835 1820 1814 1832 1852 1846 1813 1769 1721 1680 1665 1696 1754 1798 1810 1812 1830 1860 1879 1880 1876 1867 1839 1796 1768 1772 1790 1797 1801
1401 1801 1821 1847 1845 1798 1733 1691 1690 1722 1764 1794 1809 1818 1832 1840 1836 1838 1870 1934 2003 2065 2130 2197 2252 2289 2320 2348 2362 2372 2415 2500 2588 2648 2697 2759 2797 2766 2689
1397 2689 2638 2639 2643 2615 2569 2519 2447 2348 2260 2214 2186 2142 2081 2027 1978 1923 1867 1828 1805 1791 1795 1812 1809 1767 1722 1715 1729 1717 1678 1660 1676 1697 1716 1759 1814 1821 1765
1392 1765 1719 1745 1802 1807 1751 1699 1686 1690 1690 1694 1703 1694 1655 1620 1618 1640 1657 1664 1677 1706 1736 1752 1750 1743 1740 1742 1731 1698 1660 1644 1657 1684 1710 1738 1771 1795 1796 1782 1778 1798 1829
1387A829K7K2K1J7kk3k7j4mkLJ2J5J4L5O9O7Rn1m4QM0L9N1P8O9K1mK3M0%m8l0K5L8ol3pK7
1382B304K1j9n8o3l3J1K5%l0k2NPj9l1k2j5j4oJj5m1l9k5m0p5n9J1M9J2k7kM1J9l9m3OK3k1
1378A777o0m7j7q%K4L6Ql0l6l2n5q0m4L8Q4M5k0l9j2Mpj5jQpj9%L0L3Prmkk1l3k3rj7l4k8
1373A385jJ0nj5PL6L1j5m9l5J8O0O5M2Rk0l7l1j0%j7l8l8k3j3mK2N1N1K6RJ4Qk3n0l5LK2N
1368A415k7n0m9k1K0M3L4J4jrk0l4m2m4l5j2J0Pj7k8j7j9l4k5K8P5O0J6JJ5J4%PK4J4j9k9
1364A265j0j0l6m8j9J5K1J0mk1k3ML6K5j7k6RK1j4l2RM4J5k8j9J0j8p8p3OO6N5J9Kj0k4j0
1359A112L5N3J3l2k1K1K4j4l6j1K6L3J1j2j0J0K7J8j3m1m7l4j4RJ8%l1m0rL0L4J0qkJ0J0J
1354A130kMJ5J9J2ok9m7n8n9l8MM5N4K8lj1%QNkKJ7K4Lm4p7n2K4R0R6M8Lj1j1j6j9k2l7o6
$$ plain form
1387 1829 1856 1878 1899 1916 1914 1891 1864 1850 1846 1844 1847 1859 1874 1888 1923 1992 2059 2068 2017 1973 1981 2021 2060 2111 2189 2258 2279 2275 2298 2338 2338 2290 2260 2285 2323 2317 2284 2277 2304
1382 2304 2325 2306 2248 2185 2152 2163 2188 2188 2158 2136 2141 2148 2129 2098 2076 2061 2047 2041 2042 2027 1986 1947 1922 1882 1807 1748 1759 1808 1820 1793 1791 1832 1851 1812 1769 1775 1798 1777
1378 1777 1717 1670 1653 1645 1645 1669 1705 1713 1683 1647 1615 1560 1480 1436 1474 1558 1603 1583 1544 1532 1536 1529 1514 1513 1521 1514 1495 1495 1525 1558 1565 1556 1552 1550 1529 1496 1473 1464 1447 1413 1385
1373 1385 1384 1394 1389 1374 1381 1417 1448 1433 1384 1349 1367 1427 1492 1534 1543 1523 1486 1455 1445 1445 1428 1390 1352 1329 1316 1312 1334 1385 1436 1462 1471 1485 1493 1470 1420 1385 1388 1410 1415
1368 1415 1388 1338 1289 1268 1288 1331 1365 1379 1378 1369 1349 1315 1273 1229 1194 1182 1192 1199 1182 1154 1137 1118 1084 1059 1087 1162 1222 1238 1239 1254 1268 1268 1275 1299 1313 1294 1265
1364 1265 1255 1245 1209 1161 1142 1157 1178 1188 1184 1163 1140 1144 1180 1205 1188 1162 1171 1192 1178 1146 1155 1199 1214 1186 1167 1177 1159 1081 1008 1014 1080 1135 1154 1156 1146 1122 1112
1359 1112 1147 1200 1213 1181 1160 1181 1205 1191 1155 1144 1170 1203 1214 1202 1192 1202 1229 1247 1234 1193 1146 1112 1098 1107 1125 1125 1094 1054 1045 1075 1109 1119 1111 1109 1119 1129 1130
1354 1130 1128 1132 1147 1166 1178 1172 1143 1096 1038 979 941 945 990 1044 1072 1069 1058 1058 1066 1071 1069 1071 1088 1112 1115 1071 994 942 966 1056 1152 1200 1203 1192 1181 1165 1146 1124 1087 1021
1350A021o9k4K7L5Kj2J3L3J9kRL4L3Oj3j7j9k8l4k9j5RL7N0L0MRL0J9k5m9k3J3Pl7p0n9j9
1345H96K6N1N5M9M6L5Kl6l4RL4op2r3n1LJ9J0jmkJ3L5N0M4K0j4m0m3oM8P7N2%l2k7ojk0l9
1340A047l5mL6M8K1k2m3l5j9j4j2jJ7K7K8K5J0k8p2p8l0K8N0L6J8Mj3j8OM0L3j1l4nJ9j5o5
1336I39o2j1K1J0KJ4J3j9l1MM4L2j5l4kL6M1K1%j5k3k1rRL0M0K7mk6j8ok1m7l5J7N5K6m2p6
1331H64l9M0R0P0%n6n3mL3L2Lk1l0j7J1K9J3l0m9k1J9K9J4J3K9K8Mj6j4j2l0m7k6K0M5K7j0
1326I38k0KJ5j2n8p3m2RM4N7N0J9k4m2k2kj0j8J5N4L6l5p2l7J6L8M9P3O4j0q7q0nM4L3J8L1
1322I56L1j2o3o5j8L5O2O1M0Nk7m9o0n7l7k3k8l0kL8M8K4QJ6J3j6l1j2Nmj0J9N0L6lj4ljj0
1317H72LK7K2j2l5k8j7oK5O5O2Qm0l3%J3RJ1J4Jj7k0j8l5n4l5K4P5O3%n8o0mN4N2qo3o5k9
$$ plain form
1350 1021 952 928 955 990 992 980 993 1026 1045 1043 1052 1086 1119 1125 1112 1095 1076 1048 1014 985 970 979 1016 1066 1096 1100 1109 1139 1158 1133 1084 1061 1074 1081 1044 974 915 896
1345 896 922 973 1028 1077 1123 1158 1160 1124 1090 1099 1133 1127 1055 962 911 914 933 943 942 938 936 949 984 1034 1078 1098 1084 1044 1001 995 1043 1120 1172 1172 1140 1113 1107 1106 1086 1047
1340 1047 1012 1008 1044 1092 1113 1091 1048 1013 994 980 968 967 984 1011 1039 1064 1074 1046 974 896 866 894 944 980 998 1002 989 971 977 1017 1050 1039 1005 1000 1019 1004 939
1336 939 877 866 887 897 899 913 926 907 876 880 924 956 941 907 905 941 982 1003 1003 988 965 944 935 944 974 1014 1041 1037 1011 993 987 966 919 884 901 956 982 940 864
1331 864 825 865 955 1025 1025 969 916 912 945 977 980 959 929 912 923 952 965 935 886 865 884 913 927 940 969 997 1001 985 971 959 929 882 856 876 921 948 938
1326 938 918 920 935 923 865 792 750 759 803 860 910 929 905 863 841 839 829 811 826 880 916 881 809 772 788 826 875 948 1012 1002 915 835 830 874 907 925 956
1322 956 987 975 912 847 829 864 926 987 1027 1032 1005 956 896 839 802 779 751 721 719 757 805 829 837 853 866 850 819 807 812 808 798 817 867 903 900 886 883 882 872
1317 872 875 902 924 912 877 849 832 826 851 916 978 986 946 913 913 926 935 946 960 961 944 924 906 871 817 782 806 881 944 944 886 826 822 876 928 920 857 792 763
1312G63jRJ8J6mj9KM6N0km8l6NJ0k2l1J5O0N0pm6l6j1rk1oM0Q1P7L6j2l8m1k2PJ9ll9m4pK6
1307H25Nm3n0kM7N0K9K3J7k2q6j13p6qM4P0P2M5NrJ6M4L0j4l7k5mKoqKJ6J6j2m3l5J0L1Mk2
1302G88ON2M9Oj7pqk4j4K7L3pk7J2N4L4j1j7MJl6o2n5l0jK9L3pn3n3%N2O0K9j5m2l1LJ5pk5
1297G38pJ1ok7%M7L7j8l7J0M8K3l0m4j8RJ7J4PNJ6K3Mk6k7JQj9k9PL8K1j6j6J4L2K1Lj1j4
1292H09lJ4Pk5l3jK7Ok2j3Nj9n7l5L5P1M8K2K4J7j9m1k2jj4l3k4j0j4k2LM1N6M8L6K0kj6j1
1288H52j7n5q6n9PM2J5j9j8LOrmK0K6jk5JN3O5J4m4m1LK4pm0l5rQJ4K2J6j2k6J0O4O8Rn3o4
1283G18k6J7L4J9rk3rJ5K1QkLJ3J6J1Lqj7j9j6j5j1qj6l6m2k2lj4k7OO7Q7L8k1l1qJj4k5j6
1278F39JJ4J6ll5m4j4K5K7joK3M5K2j4j1L1O2M4mk8j5O%j8j8PK0Oj4j5j4l7n6k7M4Q4N1k0
$$ plain form
1312 763 762 771 789 805 801 782 784 830 880 878 830 794 799 809 787 756 771 831 881 874 828 792 781 772 751 745 785 866 943 979 967 929 888 866 873 892 889 850 806 799 825
1307 825 830 787 737 735 782 832 861 884 901 879 793 680 604 596 640 710 782 827 832 823 839 883 913 899 862 837 833 835 829 821 823 839 855 843 800 765 775 806 810 788
1302 788 794 846 895 901 884 877 869 845 831 858 891 884 857 869 923 957 946 929 933 934 898 836 781 751 750 779 812 805 752 699 699 751 811 840 825 783 752 755 770 763 738
1297 738 731 742 736 709 709 756 793 775 738 748 796 819 789 745 727 736 753 767 774 779 795 818 822 796 769 770 778 759 730 737 775 796 780 764 778 810 831 834 823 809
1292 809 806 820 827 802 769 768 795 801 779 766 771 752 695 660 695 766 814 836 860 877 858 817 795 794 780 747 723 713 699 677 680 721 777 825 861 881 879 863 852
1288 852 835 780 694 635 642 684 699 680 662 665 671 662 658 678 704 703 678 679 732 797 811 767 726 729 753 746 706 671 662 670 684 706 722 710 684 694 758 826 835 782 718
1283 718 692 709 743 762 753 730 721 736 757 765 763 766 779 795 806 809 801 784 765 749 734 723 715 699 663 621 599 596 582 555 561 628 715 753 732 701 693 694 680 655 639
1278 639 640 654 670 667 632 588 574 599 626 625 619 642 687 709 695 684 715 777 821 817 789 774 780 780 762 744 751 771 777 763 748 734 697 641 614 658 742 793 773
1273G73m6j1L2L5J2kmj8l6k3K0L7Jm4l7jNj8j5L0N4J4m0m0KK5J2qrMJ9L0J9qj7QK7Mk8rL9
1268G88N7L7K9L3lq0j08m8K0J2l2k2L7O4K3l7o0m5j3K6N7N3J1l4m4k4j%j3j7kJ2ml0k8RL2
1263F55J6j4j7%J6L1M8M4jn0m8ML9J7l2n2j4N2Q6N3j2l4QL9Qm0l5RK2rl6l8m4m6pM9N1rn0
1259F59k5J1PrJ3M1K2j6j2K7M0J4lRJ4j2l3k4lnk9l7j1K6L7J6rj2mj8m3l3J6M9L2pk0j9j8
1254F31pK8M5J6k0mL5K6l5o6l4PJ0JK2M7K9k4n6l7J4M7L4rl0LN1N1Jl8k8pqj5PL7L3%k3j5
1249G19%NNOJ0J3J0ok6k7pRJpJ1L9M1J6mpjQK3K7mn0o1k2J3J0j3j4Ljk4l0rQlj7j1Lmk2j4
1243E96K5N2M5J9Joj6j6KK1J6mrjj3m7o2l3MQj0rJ2K0jj8j0J2K6L5M5L8%k9rL3K1n4r4l0P1
1238F31R3K6k1lJ8j2m6k7J8L0K0J7qp5j17n1O3R5J8m8l0J3J8J2K8L3Mj1K4M3ro7l6M4N4k2
$$ plain form
1273 773 727 716 748 783 795 793 789 771 735 712 732 769 770 726 689 688 693 675 660 690 744 758 718 678 680 705 717 709 700 704 723 753 772 764 747 755 782 786 758 749 788
1268 788 845 882 911 944 941 861 753 705 725 737 705 683 720 784 807 770 710 665 652 678 735 788 799 765 721 697 696 696 683 666 664 676 672 642 614 623 655
1263 655 671 657 640 640 656 687 735 779 778 728 680 684 723 740 708 656 642 694 780 833 821 787 795 834 842 802 767 776 798 789 753 715 671 625 618 667 718 709 659
1259 659 634 645 652 643 656 697 719 703 691 718 758 772 769 778 792 780 747 723 720 715 686 649 638 664 701 717 708 696 692 674 631 598 614 663 695 688 668 649 631
1254 631 624 652 697 713 693 689 724 750 715 649 615 622 632 633 655 702 731 707 651 614 628 675 709 700 670 673 724 775 776 738 710 703 695 680 687 724 757 757 734 719
1249 719 719 724 729 735 745 758 768 762 736 709 702 711 712 705 716 755 796 812 808 801 800 808 831 858 854 804 743 721 734 744 731 717 720 719 695 665 656 664 661 644 633 636 632 610 596
1243 596 621 673 718 737 738 732 716 700 702 723 739 735 726 725 712 665 603 570 574 582 572 563 575 595 594 576 566 578 604 639 684 722 722 693 684 717 738 684 590 560 631
1238 631 724 750 729 726 744 732 686 659 677 707 727 744 736 661 544 493 556 651 669 621 591 604 622 634 662 695 699 688 712 755 746 679 643 687 741 719
1234G19p3l1M2N8J4l3l4PN1M9Kl0oK8Mm9n2lJ7j3k5K0N3J8l5l1J2K0j8m4l0kJ3J9K3J7MkK
1229F81KnlJ4L0K5jl3n3m3j3J6L1L7M2K9qm8o0l9qJ8K8K3QjQK4L1K2jl0m2j9K0L4J2rnJk6
1224F89o5o6l2%POJ4J8J8L0N0M5Ml7m0j7j1k3j3L0O7N8Pm0n8m9k0J0K1J1PL3N5L2k2m3oL9
1219G09M7L1K2Ol0n4l8j6l6o5l5L6O2K3pQK1jj2K1N1K8k0l9l4l7l2NM2L9J0LJ5Pk2m2m9o3
1215E54n9j2M8O5M7M0M1Qm2m2MJ6l3o2k3K8K4qqK3L4K0Nkj6k3qRMj0rJ%JJ6K8Jm4n4k2J2K2
1210E74K2K7K5J8J3J6J3lk0l3m2l6nK9K6j2l4mN3Q1N7J2k6m2l7k4j3j1j4j3KK3L5K5kj7j3
1205F50j0j9k9j5J7K7%k8j4K7M4J5l3n4l8j4KJ3L0M6N0M4L4J3k0l3rJ9Pk6j9K7M6ln1l4J9
1201F81K9JnK0K2j2k3RK4j2n0k7K5L5Kj4KJ2nj4n%k5n2m5j2J3J6J3K6M3M1Ol0l2jK0J1%J7
$$ plain form
1234 719 646 615 657 715 729 696 662 669 720 769 771 741 735 763 767 718 666 663 680 667 642 662 715 733 698 667 679 699 681 637 607 605 618 637 660 677 681 679 681
1229 681 683 678 675 689 719 744 743 710 657 614 601 617 648 685 727 756 748 700 640 601 593 611 639 662 670 669 677 701 732 754 753 723 681 662 682 716 728 719 714 715 689
1224 689 624 558 526 526 533 539 553 571 589 619 669 714 718 681 641 624 613 590 577 607 674 732 739 699 641 592 572 582 603 614 621 654 709 741 719 676 670 709
1219 709 756 787 809 815 785 731 693 677 641 576 541 577 639 662 655 663 684 683 671 692 743 771 751 712 678 641 609 614 656 695 705 708 723 730 708 666 617 554
1215 554 495 483 531 596 643 683 724 732 690 648 652 668 635 573 550 578 602 594 586 609 643 663 668 666 650 627 619 628 632 622 613 614 614 615 631 659 660 616 562 540 552 574
1210 574 596 623 648 666 679 695 708 705 685 652 610 574 569 598 624 612 578 574 627 708 765 777 751 709 672 648 635 624 610 597 599 622 657 682 680 663 650
1205 650 640 621 592 577 594 621 621 593 579 606 650 665 632 578 540 526 528 541 571 617 667 711 745 758 738 705 696 715 722 696 677 704 750 747 696 662 681
1201 681 710 711 706 726 748 736 713 722 746 734 684 657 682 717 719 705 707 719 714 700 695 695 670 618 573 561 574 590 603 629 672 713 719 689 657 656 676 687 687 704
1196G04L0Jn1o4k9NMo%J2J3J2J7Ml0m8k3J5K2OLJ0jj7oK6L2lk6oK7K6nk8k0RL7L8Ml5l6kK4
1191F45J2j4k6k2rJ7M5L9jk2OL1J0j7ON0L8l0o9l4K0K6j0m7n6m1j0J9K4J4J2K8L6K8J5J3Q
1186G34kj4k8m4m3j6J1Nj2ML5K9mjM4N9J7j5%J2k7o1l9mj9n3l5K0M4L6L3K6k3o6l1M4N5ol2
1181F33J7N1J0m1l3mj4k9%M1L0j7l2j3kqLL5M5K7Kj3l0l3qK6K2j8m3k4jnj5QM5N1J0l5m0o
1176E92L2L4jm2n1j7L0N0K8qj2K0M0J5l9o9n3qL5M7J7k8k6L8Q7M6m7p9k1L3Om9m3K1O5N2J2
1172G07j6k3j4lj3l8m5j7J3QnRM2M4J0l3o0o4l0L6P8M4k2m4qK2J8J6K8K5LJK5K1k3n2k4J2
1167F28%l0j5L2M3Km4n4l1JK2K4J0OL0N1L3j4m3l7k5j7jK7M1L3J6%k0l7j7L4N7Ro8q9l6K0
1163E41J9j9k3K1O6O4K6nj4j2oPJ7J1j3k9k2%J9K5K1J9J8J5jk9m3l3j0lj1pJ3K4Oj9j8NK2
$$ plain form
1196 704 734 735 684 620 591 596 600 594 594 606 619 631 648 652 622 574 551 566 588 594 597 607 606 589 583 609 641 638 612 606 633 659 654 626 606 615 652 690 694 659 623 621 645
1191 645 657 643 617 595 586 603 648 687 686 664 670 701 711 694 700 750 788 758 689 655 675 701 691 644 588 547 537 556 580 594 606 634 670 698 713 726 734
1186 734 732 718 690 646 603 587 598 603 591 595 630 659 655 654 698 757 774 759 759 771 744 683 644 640 621 568 533 553 597 633 666 692 669 603 572 616 671 665 633
1181 633 650 701 711 670 637 633 619 590 590 631 661 644 612 599 597 589 592 627 672 699 701 688 658 625 617 643 665 647 604 580 579 574 559 567 612 663 673 638 598 592
1176 592 624 658 657 615 564 547 577 627 655 647 635 655 695 710 671 602 549 541 576 623 640 612 586 624 711 757 710 631 610 643 649 600 557 578 643 695 707
1172 707 691 668 654 651 638 600 555 538 551 559 554 563 605 649 659 626 566 502 472 508 586 630 608 564 556 578 596 612 640 665 668 669 694 715 692 640 616 628
1167 628 628 598 583 615 658 660 616 562 531 532 554 578 588 594 624 675 708 694 651 614 589 572 571 598 639 672 688 688 668 631 614 648 705 714 646 557 521 541
1163 541 560 541 518 539 605 669 695 690 676 664 658 665 682 693 680 651 629 629 648 673 694 713 731 746 745 716 673 640 630 627 616 609 622 646 652 633 615 620 642
1158F42J3mj1pnj5l0l1jM5N8J3n7q1m0J9L5RmJ7L4J4k2k0K1N0M3K7J9lm8p1m5pj%L5O8K7n9
1153F27q4k4K6Jl9j7M0N1J0k0j3rk4k7OM8N8K8j6l1oK3J6j0qK7L4pl5kL8J7l4l8JJ7nk0pl
1148E89j6j3NKj5oL3M4Ol2k8rlNL2M8L5J8J3ll4l8pJm1o1qN9N2j3m6l0j6j9%M2M9Nk6j0K3
1143E87L2K6K3Rk5m6k7LJ4RPOj4k8%N2O9K6l8o1k7K2M2J6l2o2m9mL4L5Pj2nRLoNJ9kl6k1M0
1138F00O5Mp5p4PP8Q6N6J6k2l9k1Lpl1j1L2K0n2q3j3P2P0nn6m9k6rK0O1P0K4l2m9j8J8K0j4
1133F36m7l9lJ8J0NJ4Nk5l4%K2om4k9J5J3k3j9L6O2K3k5l1j5j2rJ3L0J2j0jJ7J1qnJ0J0nJ
1128E73K7M0K5lk0j9qoj8l4j7K5M5J7k0j8J1J2k5n5m4j2K4N3O7M2j0n4o1m0j1J3K0PqoQMj7
1124E07k6oJ9L1L4K7Ml0l6oK9L0OrlJ3J6ml9o2m4J2O1O7L7Mj4j7mJ4J9RmpnlJ0K4J4k5n6m2
$$ plain form
1158 642 655 651 640 633 628 613 583 552 551 596 654 667 610 529 489 508 543 552 548 565 599 613 591 571 592 642 685 712 731 728 680 609 564 557 556 556 591 659 686 627
1153 627 543 519 545 546 507 490 530 581 591 571 558 549 525 498 504 552 610 638 622 591 585 608 624 614 606 633 667 660 625 623 661 678 644 606 607 624 619 599 592 589
1148 589 573 560 565 567 552 546 579 623 629 597 569 560 557 562 594 642 677 695 708 705 671 633 626 627 586 525 517 576 628 615 569 539 523 504 504 546 595 600 574 564 587
1143 587 619 645 668 677 652 606 579 582 596 605 612 618 604 576 576 628 697 723 685 624 597 619 661 677 645 583 534 530 564 599 606 594 589 598 601 595 600 619 617 581 560 600
1138 600 665 669 594 520 527 605 691 747 763 741 702 681 684 677 646 635 667 687 635 552 539 611 681 676 620 571 545 536 556 617 687 711 679 630 612 630 650 636
1133 636 589 550 547 565 575 580 594 599 574 540 540 562 556 512 483 498 511 488 469 505 567 590 565 534 519 507 498 511 541 553 543 542 559 570 562 557 567 577 572 573
1128 573 600 640 665 662 642 623 615 609 591 557 540 565 610 627 607 589 600 612 587 532 488 476 500 553 620 662 652 598 537 497 486 499 519 526 518 512 520 524 507
1124 507 481 475 494 525 559 586 590 560 524 518 547 577 583 574 571 584 600 596 557 495 451 463 524 591 628 632 618 601 597 611 630 639 635 628 623 620 630 654 668 643 587 545
1118E45KL0J8j0k3rJ6L0J2k3l4j1J2Pj0nJ1on1p0l8J3L4J8OK4N5O0K3k4l6j4Lnk2j6PK8L7
1114E84L5J1k6m9l5mJ6K3L3L1Mk8k4QL1K1ql3m5k8J4L9J3k8k4K2N3M4L2K6km8n7oM4M0Mj3
1109F70rj0j5j4j4k0j1J5K4ol7k8JNj0qJ2K1OqjK4N5O0K0m6p2l9MKk2k5qNJ9M5N2J0l4l1n
1104E77j5m2k5K9L9ql3%L1J1k2j5J5K2J1Jpj2OM7N9J6m1n1k5pkJ2L3L2J2j0k8m0l7k1j2j2
1099D88nK1L5K5J6K9K9j5o8p1k6J4K3J7J5Qqj7j0J2L4L7Om6o8k9K6M1J2j7k4j8%L2O1N8K3
1095F40k2n0m5mM1L9j4m9j3L5K0l7l9L0P9N3lk4k2l0l7j5K6M7L3kl3m2k1J2K2J0k%lj5j9n
1090E41RJ0%j7m0m0jM7M8J4lJ4J3j9k1L2P4L8l5n7j9K0K2jk7l9k0K1L9Om0m9k5pJ0L7N2K0
1085F07k2j5L1M5J0k0j2Joj6nPJ%K1M5L8nn3o6k9L1N6K1k1k0PLk0kN2O4Ko7o9k8pj0mJ2J4
$$ plain form
1118 545 547 577 595 585 562 553 569 599 611 588 554 543 555 562 552 547 558 552 501 431 393 406 440 458 464 488 543 603 626 602 566 552 555 550 528 512 519 547 584
1114 584 619 630 604 555 520 516 532 555 588 619 623 595 571 579 610 631 623 590 545 517 531 570 583 555 531 553 606 650 682 708 706 658 601 595 639 679 683 670
1109 670 661 651 636 622 608 588 577 592 616 610 573 545 546 551 541 533 545 566 572 564 563 587 642 702 722 676 604 565 569 571 549 524 516 521 540 585 637 647 613 582 577
1104 577 562 520 495 524 563 555 522 522 553 564 542 527 542 564 575 576 569 557 563 610 669 685 644 593 568 561 559 571 604 636 648 638 610 570 533 512 500 488
1099 488 483 504 539 564 580 609 638 623 555 484 458 472 495 512 527 535 527 510 500 512 546 583 589 543 475 446 472 513 525 508 484 466 466 498 559 617 640
1095 640 618 568 523 519 560 599 585 536 523 558 578 541 502 532 611 664 661 637 615 585 548 533 559 606 639 637 604 562 541 553 575 585 583 583 580 565 546 541
1090 541 550 560 560 543 503 463 462 509 557 571 568 582 595 576 555 587 661 699 664 607 588 608 630 629 602 563 543 564 603 609 569 520 495 488 498 535 587 607
1085 607 585 570 601 646 656 636 624 625 619 603 598 605 606 606 627 672 710 705 652 586 557 588 644 665 644 624 631 634 614 612 664 728 730 663 594 566 559 549 545 557 571
1080E71NQJ7J5OMJ0RJ2K4K1j5n9n9j2K4J1j9k0J9N6N5K1j5k4j2oqnJ1K2K1J1%j9l2j8K1M1
1076F92K9J4J8Rk8n4l1QJl9m4LM4L2jj4oJ2L5N6M7Nl2l4k5l7n3k9K6O0M4J0kJ3K4K3J9J9Q
1071H22k1n0m6j7Jj3l0j8J7M3M6L6K2MoMJ8J3JNJ2nm2m7oL8M0J1j6k5j5NJ3ol1j0N6J06R0
1066I99M1J9K4J7j0k5j7kJ0K1J3j7l7j3M0O4M5J6J3K0J3j0l1l2kM0N3J6j3J9P8O7j9p6l2M9
1062A341P1L5J5K3J7j3k1MJ1k3m9j7L7N1K4J5L9N6L2oj8pj2l8m3MO8Q5M8PJJ4J4PK2N2N4K6
1057A926J3L8O6N1OrK2N4M7K1J3K6L2K5J6J5Lk1k9qK0L0K3K1J7j5o7r6p7l5j1j5j5PL5M2K3
1053B194Jnpk6n4n5k1J3J4lJK2K1mj6QK5Ok1j1K3L3J5J2L5M4K2jNK6K6J2QJ9K2J8J8K1J1j3
1048B438k1%K0Mm1p2o4l0pj5m0o4o2l3j%l6o2m8j8j7l7l3NK6kl6k9nj1l5k9KMl0m0%K9oo8
$$ plain form
1080 571 576 584 601 616 622 626 636 645 657 681 702 687 628 569 557 581 592 573 553 572 628 683 704 689 665 653 647 639 634 645 667 688 699 699 680 648 630 651 692
1076 692 721 735 753 762 734 680 649 657 658 619 575 578 622 654 653 639 633 645 680 736 783 788 756 722 697 660 607 578 604 664 708 718 716 729 753 776 795 814 822
1071 822 801 751 705 688 689 676 646 628 645 688 734 770 792 796 790 794 812 825 826 831 843 838 796 749 743 781 821 832 816 791 776 781 794 788 757 747 803 909 999
1066 999 1040 1059 1083 1100 1090 1065 1048 1046 1056 1077 1090 1073 1036 1023 1063 1127 1172 1188 1201 1221 1234 1224 1193 1161 1159 1199 1252 1268 1255 1274 1352 1419 1400 1324 1292 1341
1062 1341 1412 1447 1462 1485 1502 1489 1468 1472 1483 1460 1411 1394 1431 1482 1506 1521 1560 1616 1648 1642 1624 1617 1605 1567 1524 1528 1596 1681 1729 1736 1737 1751 1765 1772 1794 1846 1900 1926
1057 1926 1939 1977 2043 2094 2100 2091 2113 2167 2214 2235 2248 2274 2306 2331 2347 2362 2365 2344 2315 2307 2327 2357 2380 2401 2418 2403 2336 2240 2163 2128 2117 2102 2087 2094 2129 2171 2194
1053 2194 2195 2190 2183 2157 2103 2048 2027 2040 2054 2051 2052 2074 2095 2091 2075 2083 2108 2114 2093 2082 2105 2138 2153 2165 2200 2244 2266 2265 2270 2296 2322 2334 2342 2361 2383 2401 2419 2440 2451 2438
1048 2438 2417 2417 2437 2441 2400 2328 2264 2234 2227 2212 2172 2108 2046 2013 2012 2012 1976 1914 1866 1848 1831 1794 1761 1766 1792 1790 1754 1725 1720 1709 1674 1645 1647 1651 1621 1581 1581 1610 1604 1536
1043A536p4j7M1M7J8j2k0mJ5J7nk0j3jj1j9%K7K3j4l9l6l2n1o1l4OJ7NMJ8J0l3p2o6k3Kk2
1038A107o0n8j3K6K6J5K9N1L3k0n4m6l1m0n4l5J4M8M3Rk7m2k1J5L2J4j2j9j2j0j2rrj7k4j2
1034H25J2L2L8L6J8j0l8m9n2n4l7ML3J2m0o0k6J9L8L8L0Qk3l6k3j1k0l1j9LJ4J3Qjj6j6PK5
1029F51J4nnMok2j9nj0k0JM8O8L0k2m2l5k1kJ7K2RNK9M4J1m1m7kL2J3l1m7k8pj1k0j7JJ7K9
1024E80L8L8J6j7l7l2j3MK6N4O4M0Kj3krm2o1l1K1L9J6j4k2oJ4K4J3k1m9m8k4%K4M8N5K3k8
1019F70m9k1Lj7n8o5k1M4Q5Q0L8k0m9l3LK1RJJ5L0J3k5l9j3K0K2LnJkj8j8RL4K8Pkpk3m4m5
1014E62k3jK2M6N7L2qk4nJ1lk8m3m4l2oJ6J6JOK4J8j5k2QK6kk8j1J6kk8nM0K3m3o4mN1L6j6
1009E54l8k4nJ1K8L6K9L5N4M5Kk5oQk2n5l1J7Rm3n4lL6J5j8j8jnj1J2M5M4J2j9l0l6l9k5K
$$ plain form
1043 1536 1462 1445 1486 1533 1551 1539 1519 1515 1530 1547 1542 1522 1509 1508 1497 1478 1478 1505 1528 1514 1475 1439 1407 1356 1295 1261 1267 1284 1289 1293 1311 1321 1288 1216 1150 1127 1129 1107
1038 1107 1047 989 976 1002 1028 1043 1072 1123 1156 1136 1082 1036 1005 965 911 876 890 938 981 990 963 921 900 915 947 961 949 930 918 908 896 887 878 861 837 825
1034 825 837 869 907 943 961 951 913 864 812 758 721 725 758 770 730 670 644 663 701 739 769 777 754 718 695 684 664 633 614 617 631 644 652 651 635 619 626 651
1029 651 665 660 655 659 653 631 612 607 597 577 578 626 694 724 702 660 625 604 602 619 641 650 655 684 728 739 698 651 649 681 694 663 616 588 581 570 550 533 534 551 580
1024 580 618 656 672 655 618 586 573 577 603 657 721 761 763 750 748 739 697 636 605 626 665 681 667 645 639 653 677 690 669 620 572 548 548 572 620 675 698 670
1019 670 621 600 603 586 528 463 442 486 571 651 689 669 620 587 590 611 620 621 636 666 679 654 615 602 622 644 647 642 643 641 623 605 614 648 676 683 681 674 651 607 562
1014 562 539 538 560 606 663 695 687 663 658 669 666 638 595 551 519 513 529 545 546 552 576 594 579 557 565 591 589 561 550 566 564 536 531 571 594 551 487 483 534 570 554
1009 554 516 492 487 498 526 562 591 626 680 725 727 702 696 704 682 627 596 613 622 579 525 522 558 573 555 537 536 531 520 532 577 621 633 614 584 548 509 484 486
1005D86K4K3Oj2j4J2N2O8L7j4l6j5J3Qk4m1j6L1N4L3mk0j9l1n0l8NL1Qk2j4J4Nl1l1K0N9L1
1000E88k2k8J7N8M7Ll4m0k0OJ1ok5k4qKMRK2L2K9K1J3Mj1j9j2pj4k5qL3O1M2JpK1L8J1l4m8
995F81l9m5o6n9j6J8J6J5N1Q9O4ol8oL5L1KjJ8K5Ml3o8q5o0%M3L2j2k8j1MLJ4M2N3K1k5m3
990F20l4k6l1l7l0JM2P3O4K7pj5j1j1j0LJ7J8Mj2j8rJ1K5Rk0k4RL2Pl5m3k1moKK2K4Jj2RL7
985F41K8qk4qLj4l5k2J8M0K1j6k5lK4L0Qk2m4m0rK1K3Jj2JJ1Lj0nOKj6k3j1J2M1N4L0j9m5
980F07k4Lpl0j4K5L5km0m5k5%K3K2nk2J1O6P2L0MJ8J6l2o9n2j6omK4M8K6j7k8j0jjJ8M5M1
975F84Rj7k3k3j0J5K0j7m9j5M6M9qm1j0K5J3nJ6M9M4Ml0m5m2k8oKj0j6qjqj2kKqqNMj2mL0
970E59L9kl2KO5P6K9k1n0o3n0lL8J8l6m3RM9L1pj6mJJPLj2rL1O7N5Rk7m1m7m1j4J8K1kqJ2
$$ plain form
1005 486 510 533 539 527 513 525 577 645 682 668 632 617 630 638 614 573 557 588 642 675 671 651 632 601 551 513 518 549 557 535 521 535 540 509 478 498 557 588
1000 588 566 538 555 613 660 663 629 589 569 575 586 580 555 531 523 525 529 538 560 592 621 642 655 659 648 629 617 610 596 571 563 596 657 699 700 693 714 752 763 729 681
995 681 642 597 531 472 456 474 490 505 556 645 709 703 665 659 694 725 727 726 744 769 773 740 672 587 527 527 570 602 590 562 551 555 558 572 614 667 688 663 620
990 620 586 560 529 492 462 463 505 578 642 669 662 647 636 625 615 618 635 653 657 645 627 618 629 654 663 643 619 628 660 667 632 589 568 564 558 560 582 606 607 595 604 641
985 641 669 661 637 629 632 618 583 561 579 619 640 624 599 596 620 650 658 636 592 552 543 564 587 588 576 577 588 591 581 576 582 584 568 545 534 546 587 641 671 652 607
980 607 583 586 579 549 535 560 595 593 553 508 483 483 506 528 523 501 512 578 650 680 684 702 718 686 617 565 549 543 539 563 611 637 620 592 582 581 580 598 643 684
975 684 693 676 653 630 620 635 655 638 589 574 620 669 661 620 610 635 648 643 659 708 752 756 726 681 639 611 605 607 597 581 573 572 564 552 550 552 544 536 541 545 533 529 559
970 559 598 596 564 566 631 707 736 715 665 602 552 549 587 605 569 526 535 584 615 608 592 588 589 590 597 600 588 579 610 677 732 741 714 673 626 585 571 589 610 608 600 612
965F12K5Ml0l9j1K3M3M0J2l1o0l9J8N3L0j6k8lJ5ROK5K8j1n8o0k1MJKK9N0L6QjRJ3mk3k9j7
960F14KJ3Mj3j6OL1L4Rj6k5j4NJ8J7Pmpro%KmpOK5J6j8m2k3J4L2L0K9J8k6p7p6rN2M5%j3J2
954F36J8j6l2KK8nn3k8O2J05M0m6n9j5ml0k6K6M7pp7p6qN5P7P2M9Lm7n8k1K4M3L5J1l0p3p6
950E46k8L1M4J9kKJ6K4K9L9L5J0j5k2j8j9k0nJ7Ol7o5l2L2O1L4nj4rj5k2rJ5Pl0m0LN9O2N
945F89m5m2mJ8Pj3j6pJkj1k3k5mL4N6L3rk1PL0Qk8k8J4M7M0Qj2j2nkLJ3J6Pj0k4k1lJ2Nk4
940F57m1k6OJ8jk4j9OK6L3L7L5J6j6l3k1MOj4l3k6RM2M4Mm8o4l2PK1J6K3M1M2J7mlJj5l5l4
935F22j1J1J2lj6j2OK1J1j4k7j4KOJ6L7M8L1PMJ1nl8m4j1K4K9J3%mj0pLPrk5j8QJ6ml0l7k3
929E83lJ4K3J9%k1k7j3LLmKK3L1J9J5L4M8K1k2k9oj0n1o4j2M8M4RJ7O2P6L1j5k4k3m2n1j7
$$ plain form
965 612 637 641 611 572 561 584 627 667 679 648 588 549 567 620 650 634 606 603 618 627 633 658 686 675 617 557 536 540 541 543 572 622 658 666 665 674 687 683 660 631 614
960 614 616 629 633 620 604 610 641 675 684 668 643 629 634 652 669 676 672 665 656 650 650 652 648 641 647 672 688 670 628 605 619 651 681 710 728 702 625 549 540 592 637 637 624 636
954 636 654 638 606 608 636 631 578 550 612 717 757 711 652 637 633 603 577 603 650 643 566 490 482 537 614 686 735 738 691 633 612 636 679 714 725 695 622 546
950 546 518 549 593 612 610 612 628 652 681 720 755 765 750 728 710 691 671 666 683 689 652 587 555 587 648 682 677 663 654 639 617 608 623 630 600 560 563 622 684 689
945 689 644 602 598 616 623 610 594 587 588 586 575 552 527 523 557 613 646 637 616 623 653 661 633 605 619 666 706 714 702 690 685 683 686 699 715 722 712 688 667 664 676 681 657
940 657 616 590 596 614 613 589 570 576 602 635 672 707 723 707 674 653 657 663 649 616 590 599 641 685 689 641 577 545 552 573 589 612 653 695 712 708 705 706 691 656 622
935 622 611 622 634 631 615 603 609 630 641 627 600 586 588 594 610 647 695 726 733 737 748 743 705 661 650 674 703 716 716 712 702 695 698 705 696 671 653 661 677 673 643 606 583
929 583 580 594 617 636 636 615 588 575 578 581 577 579 602 633 652 667 701 749 770 748 719 713 703 652 588 576 624 668 677 694 756 832 863 848 824 801 759 708 691
925F91K5K8KJL1L8km2l4LRk8n8l8J2L5J8mLK2K4RMNkk1k5nJ1JqJ2M1M1Ok2j5NNj2k0nJ4Rj8
919G46m1l6j0OJj5j7jK5M6N3L0j2l8j9J4J0l4o3m4JK7K7J2qk7k3J4M9M5J6kOJ5J1Ljqj2MJ9
914G69%m1n3j2K9J7k5l5lK4K0J1K5L6J1l5m6mL8K7k9o2m6qJ8L6N9O6L1k0k8OK9Nl0l4j7j4
909G15k3k3j6j3jL2N5K8k9n7k9RJ9J7K7K5j4o4o8k0K9L3RjORql1l1j4LOJ2L0M9M6J8n%J6J2
904G58oj5kQjj9j6JRKNK8M0J3k5k9KK5J6jjLjLK4L1Mk3oK6J5l7n9j9K6J7k4l5mK7L0Nk4l5
899G36j7J4K1j0k9%M6M3j6n7l5RJ3k0k6J1M5K7j3k5lJ0LMK0J9j3l1NN2L9k8p0m4J3M0L5J9
894G87Jj4oJ5J1j9l1MM1K8j2j5K1M4K4j3l9n0m1kL6L5kk3j2NJrj6k3l5j9L0P5P5M1Qrj7k2
890H53k6l3m1l3mL1M5L9K8J7nl2m5l3qNpk2pL5O4N0K0J3J1k3o9o4KN6M6Qlol2o2m9nJ6mj7
$$ plain form
925 691 716 744 746 747 778 816 814 772 738 741 750 722 664 626 638 673 691 687 690 712 736 745 749 754 752 731 706 701 712 713 705 717 758 799 805 783 768 773 778 766 746 741 755 764 746
919 746 705 669 659 665 666 651 634 633 658 704 757 787 775 737 718 732 742 708 645 601 602 629 656 668 660 633 610 624 673 718 734 732 738 753 764 767 766 758 746 750 769
914 769 769 728 675 663 692 709 684 649 646 670 690 701 726 762 773 738 692 688 726 753 724 662 616 608 626 662 721 787 818 798 770 776 805 810 780 746 729 715
909 715 692 669 653 640 639 671 726 754 725 668 639 648 667 684 711 736 722 658 590 570 599 632 641 640 646 655 647 616 585 571 574 580 592 622 671 717 735 730 730 746 758
904 758 752 737 735 743 742 723 707 708 717 719 724 752 792 805 780 751 753 778 794 793 792 795 794 797 821 852 856 833 827 853 868 831 772 753 779 796 772 737 733 760 790 795 771 736
899 736 719 733 754 744 715 715 761 804 788 731 696 705 718 698 672 683 728 755 742 717 714 724 727 731 751 770 757 726 731 783 822 794 724 680 693 733 768 787
894 787 788 774 768 783 794 775 744 748 789 817 805 790 811 855 879 866 827 777 736 734 770 805 803 780 768 773 774 765 749 726 691 672 702 777 852 893 901 892 875 853
890 853 827 794 753 720 716 747 792 831 859 876 871 839 794 761 753 758 751 729 722 757 821 871 891 904 915 892 823 759 761 817 863 871 868 862 830 768 719 714 730 726 709
884G09lJ9K7K9J8j7n4l9K6O3K6l5m1JL3L0J9K2J7lj1PJ6ql6l0LJ9RQL8O5N3K2NRNnjJ7K4J3
879A069L%j2l0k3J3K8ro2o5k5mj9l4j3J1Oj6j5KLj3j4J6M2L2ok5qJ9K0rl0j8J7M4M7K7%j6
874I33j0J6M1M2J4k1l7k3%jl1n1k8J7K8j2m5k0L5N9L9J8K0J3j9n6o2m3k2pNJ6J6Nj5k0ON4
870H54P2K7m3n8mM3K9lLK5Ql6m0%J0l3o1j6M3L0l5o1j3L9M0J6RK0K0J1J3J3ol0l3j9j2j1O
865H17L1L2PqMJ7J0OK6M2K4j3l1j7PK2K5Nl1n3l1J2L0J9Mnk2m3l3J8O4O5K1k3m0k4J1L8K4
860A007k1n7n2j7RJ2QJ2K6M1M4K8R%%j2l7m9k7J5M8M9J7k6m2oM4M9Nk3mJ3k1p0o4mL5J7j4
856I42j7jJj4k7j8J4N2O2K1l4m1J0N5M0kj9njk0m0l3j0J4L0L1J7mj7j8k6l8k7K3Q0Q8L8k4
851A082m3pM2N8K8k7o3n8k7kOJ6L6M3J2k6k5J6L9Rl7m3j3Kj4j8PK7Ll0j1N4R2N7qk4JRk2l2
$$ plain form
884 709 706 725 752 781 799 782 728 689 715 778 804 769 728 729 762 792 811 833 850 847 836 843 859 851 815 785 788 807 816 824 862 927 980 1002 1007 1016 1021 1016 1015 1032 1056 1069
879 1069 1072 1072 1060 1030 1007 1020 1048 1039 977 912 887 883 864 830 817 828 834 818 803 805 808 795 781 797 839 871 865 840 832 851 871 862 832 814 831 875 922 949 949 933
874 933 923 939 980 1022 1036 1015 978 955 955 954 923 872 844 861 889 877 832 812 847 906 945 963 983 996 977 921 859 816 794 787 792 808 824 829 814 794 800 854
870 854 926 953 910 852 848 891 920 917 920 945 953 917 877 877 887 854 793 777 820 850 815 754 741 780 820 836 845 865 885 896 909 922 916 886 853 834 822 811 817
865 817 848 880 887 879 883 900 910 916 942 984 1008 995 964 947 954 976 1001 1006 975 922 891 903 933 952 956 951 929 886 853 871 935 1000 1021 998 958 934 945 983 1007
860 1007 986 929 877 860 869 881 889 901 927 968 1012 1040 1049 1049 1049 1037 1000 951 924 939 987 1036 1053 1027 985 979 1023 1072 1077 1054 1050 1063 1042 972 908 904 939 956 942
856 942 925 924 925 911 884 866 880 932 994 1015 981 940 950 1005 1045 1043 1024 1019 1018 998 958 925 915 929 959 990 1007 1003 986 968 942 904 877 900 980 1068 1106 1082
851 1082 1039 1032 1074 1132 1160 1133 1070 1012 985 983 989 1005 1041 1084 1096 1070 1045 1061 1100 1109 1072 1029 1016 1018 1004 986 993 1020 1023 993 982 1036 1128 1185 1177 1153 1154 1163 1141 1109
846A109J3O1N2QnJ5Rl8o6l5Rjm2n5k2K4O0Q5P4J6m8n8k2jj8k6rJj3j0L5O7L1l5n0nL3K3QJ8
841A192K6mm8n2j5J2kk4j7KJj7j0K6M2Ql5k3L1N7K6j5j2J5K2%j8j9j6j9j4JJ3OnkK0M4M7K0
836A244j7l6k5JJ7K3K8K7Pj7j3K3M8K9j7l9k2OQoj9k3k5k2KL4M3J9plK0K5jk7k7kK3K8J9P
831A333pj5j3LK4M1L6J9QJ4K1Rj6k9k2mJ5L3M1K0k2m6k8KJ3QJ3K8L4K5J2PNkj2k3l0k5j0l
826A457j6l3k7mJ4J6J5J6RmoPJ2KnKMj7l8k5QJ9jk4j8J1M0N5N3K8j3m8n2k7QL3L9K9J3PQL
821A550k3n2m9qM2N8K4k9m9j4L5L6j4m9k0K7K9JLM0M0j5n2k5Rj4m5oP2Q6J8m0l4j2j4j2K4
817A518M4J0l7k8J6L2J5NJ5J3LOJ9J3nqKql4k7J2L4K0PJ9J4k9n7k1L6L8nj8K0M2Om1l2K5O0
812A694L9ol1k8j6mLJj4k5qL0N6N2L6K5J0k0n5o8n3j9RJ6%j6jL1L5Lj1L1P7N5ql4%K8Nk9k5
$$ plain form
846 1109 1122 1183 1235 1243 1238 1253 1262 1224 1158 1123 1132 1131 1089 1034 1012 1036 1096 1181 1255 1271 1223 1165 1143 1142 1124 1098 1089 1090 1077 1067 1102 1169 1200 1165 1115 1110 1143 1166 1174 1192
841 1192 1218 1214 1166 1114 1099 1111 1109 1085 1068 1070 1071 1054 1044 1070 1112 1120 1085 1062 1093 1150 1176 1161 1149 1164 1186 1186 1168 1149 1133 1114 1100 1101 1114 1120 1115 1113 1133 1177 1224 1244
836 1244 1227 1191 1166 1167 1184 1207 1235 1262 1269 1252 1239 1262 1310 1339 1322 1283 1261 1267 1275 1269 1250 1227 1202 1180 1182 1216 1259 1278 1271 1268 1288 1313 1312 1285 1258 1256 1279 1307 1326 1333
831 1333 1326 1311 1298 1301 1325 1366 1402 1421 1429 1443 1464 1473 1457 1428 1406 1402 1417 1450 1491 1511 1489 1443 1415 1417 1430 1438 1451 1479 1513 1538 1550 1557 1562 1560 1548 1525 1495 1470 1460 1457
826 1457 1441 1408 1381 1377 1391 1407 1422 1438 1447 1443 1437 1444 1456 1458 1453 1455 1459 1442 1404 1379 1387 1406 1405 1381 1363 1374 1414 1469 1522 1550 1537 1489 1437 1410 1418 1451 1490 1519 1532 1539 1547 1550
821 1550 1527 1475 1426 1418 1460 1518 1542 1513 1464 1450 1485 1521 1507 1458 1438 1465 1494 1495 1498 1538 1578 1563 1511 1486 1495 1481 1436 1430 1502 1588 1606 1566 1532 1520 1506 1494 1518
817 1518 1562 1572 1535 1507 1523 1555 1570 1575 1590 1603 1606 1612 1631 1644 1639 1631 1633 1625 1591 1564 1576 1610 1630 1637 1656 1670 1641 1584 1563 1599 1637 1632 1614 1634 1676 1682 1641 1609 1634 1694
812 1694 1733 1727 1696 1668 1652 1648 1651 1652 1638 1613 1605 1635 1691 1743 1779 1804 1814 1794 1739 1671 1618 1599 1608 1624 1624 1608 1607 1638 1673 1676 1665 1696 1773 1828 1820 1786 1786 1814 1819 1790 1765
807A765NK1K2J6%k4k1K0N0K8j8k3J2L5K0k%J5K9K9J3j4k5mK2J5j7k3J0L4J4k4l8k5j1%K0M4
802A970M4K1%jmk5m4k3K5M4Ql5k6K5M8J2l4l4lQj2k0PL5L2NpLJ8J1qj1J2L5L0MnJ2K3Jk9k7
797B085jQpmL0M9J1n4p0j5M8O1L1QMrl5l9mK5Lm2m4mK4J3KK0M7N5N7N6L9NqRJ2l6q9q1k0L8
792B178O0N6K2l1n1KP3O5rn6l4j2k5j9M2Q8M7k6l1L1O7L2pLK8Ql8m6MN4M7om2k4J4K3jj9q
787B459J6K7K7K2Qj2k1j3nJJ8M3M2%l8l2nRJ3L1M4K1k6l6lK3Nk9k7QL4K6jj8pK2L4J5j7l3
782B625k6j7j5jL6P0P7M7Ok2k5rLok5k3J0L8K8j1l7k1J9M5M1J9%njNOj0l6m5j7L0N2L3lk1
777B814j7mQK2L0K3Mj4k0j2J7M3M1Ok2j4RRqoJ2Mm0o9l8K2M6J4l0m8m1k6lL2O1N8K3j3k2n
772B846J6K4J9Qkj1k0k7j2L0N7K5l8m5L3J02O1m6q2oP1M8l2o3l1MNlnqqJ0L3L5J7OOjj6j9
$$ plain form
807 1765 1770 1791 1813 1829 1829 1805 1784 1804 1854 1882 1864 1841 1853 1888 1908 1906 1906 1921 1950 1979 1992 1978 1953 1949 1971 1986 1969 1946 1956 1990 2004 1980 1942 1917 1906 1906 1926 1970
802 1970 2014 2035 2035 2034 2030 2005 1961 1938 1963 2007 2015 1980 1954 1979 2027 2039 2005 1971 1968 1976 1964 1944 1951 1986 2018 2023 2016 2019 2037 2048 2040 2029 2041 2076 2106 2110 2105 2117 2140 2141 2112 2085
797 2085 2084 2092 2085 2081 2111 2160 2171 2117 2047 2032 2080 2141 2172 2180 2184 2175 2140 2101 2097 2122 2125 2083 2039 2035 2059 2072 2074 2094 2141 2196 2253 2309 2348 2353 2345 2354 2366 2330 2241 2160 2140 2178
792 2178 2238 2294 2316 2285 2234 2236 2309 2374 2365 2309 2275 2263 2238 2219 2261 2349 2396 2370 2339 2370 2437 2469 2462 2465 2493 2501 2463 2417 2421 2475 2522 2516 2474 2450 2464 2487 2486 2467 2459
787 2459 2475 2502 2529 2551 2559 2547 2526 2513 2508 2509 2527 2570 2612 2612 2574 2542 2537 2546 2559 2590 2634 2655 2629 2593 2590 2613 2618 2589 2562 2570 2604 2630 2629 2611 2604 2626 2660 2675 2658 2625
782 2625 2599 2582 2567 2566 2602 2672 2749 2796 2802 2780 2755 2746 2749 2743 2718 2695 2705 2743 2771 2760 2723 2702 2721 2766 2807 2826 2826 2821 2820 2825 2831 2821 2785 2740 2723 2753 2805 2838 2835 2814
777 2814 2797 2793 2801 2823 2853 2876 2880 2866 2846 2834 2851 2894 2935 2941 2919 2905 2914 2923 2915 2909 2921 2925 2885 2816 2778 2800 2846 2860 2830 2782 2741 2715 2712 2744 2805 2863 2886 2873 2851 2846
772 2846 2862 2886 2905 2913 2911 2900 2880 2853 2841 2871 2928 2953 2915 2870 2903 3005 3066 3020 2938 2932 3003 3051 3019 2956 2925 2929 2934 2931 2926 2918 2910 2920 2953 2988 3005 3011 3017 3016 3000 2981
768B981j2mRL2L5lm3k9J5J9k8n8k8J9K7Kk3k5lM1P1M8pl2j4j0l3l3J2M1Ql0j1L3L1poL6M9
763C070Pl3k8jLj3k5j1K2N1M1Jk2NL5K2j0jL3K5k5m9j5J2j1m7m4j8mPL0M4J5l0l7%L2K2j5
758C038l7j3M1P3M5j5l6%K5pm9l0L0M7Nl6k1J8K6qm5m5mM7O4K6k8m5j8PLj2mK0K6Nj6k0j2
753C045j2k3k4JM0N5K7j3k3okk4l8k0J1K7K7K6K1Mj0lOj5n1n8k2Qpk9j1L2M5J7rqkk2m0k3
748B897PQmJ7O8P3Kp4o7KM5K2j5k1j3k3l7l1lK7M6M4Kn7q1m2J5L5L1L7L3j5p3o5OM6J3l2j9
744B804J9K0j5l5k2lJ5L4L3qn0l4K0L7Jk5%L4K4j8l8j9J0J9pm9o2k0L4L4j7m0LM9K6l2m6n
739B671K0Jj9kJ9Jl7l6J2N5M8J0j5j5j5j7kK2J2m4q1m7K0L7%j5J9L8Jl4j3K9K2k6m7k7pnk
734B531RJ1%nLRQPMj3k8j4J6K6Qrj7j8j3NJ4j1m1k9J2K4LlK2K8rl7qL9L3k1o0m2OL2Pm8p4
$$ plain form
768 2981 2969 2965 2974 3006 3041 3038 2995 2966 2981 3000 2972 2914 2886 2905 2932 2934 2911 2886 2883 2924 2995 3043 3036 3004 2990 2980 2947 2914 2926 2967 2975 2945 2934 2967 2998 2991 2985 3021 3070
763 3070 3077 3044 3016 3015 3018 3005 2980 2969 2991 3042 3083 3084 3062 3067 3102 3124 3114 3113 3146 3171 3146 3097 3082 3094 3083 3036 2992 2974 2970 2977 3007 3051 3066 3036 2999 2999 3031 3053 3038
758 3038 3001 2988 3029 3102 3147 3132 3096 3096 3121 3114 3065 3035 3065 3112 3117 3081 3060 3078 3104 3096 3051 3006 3002 3049 3113 3139 3111 3066 3048 3055 3058 3046 3042 3062 3088 3093 3077 3057 3045
753 3045 3033 3010 2986 2987 3027 3082 3109 3096 3073 3067 3065 3041 3003 2983 2994 3021 3048 3074 3095 3099 3089 3086 3092 3077 3026 2968 2946 2954 2947 2918 2907 2939 2984 3001 2992 2984 2982 2960 2920 2897
748 2897 2904 2912 2908 2925 2993 3066 3068 2994 2927 2929 2974 2996 2981 2960 2947 2924 2887 2856 2853 2880 2926 2970 2972 2915 2834 2792 2807 2842 2873 2910 2943 2928 2855 2790 2796 2842 2855 2823 2804
744 2804 2823 2843 2828 2793 2771 2768 2783 2817 2850 2842 2792 2758 2778 2815 2816 2791 2791 2825 2849 2831 2793 2774 2784 2803 2796 2747 2685 2665 2699 2733 2716 2676 2679 2728 2754 2722 2676 2671
739 2671 2691 2692 2673 2671 2690 2691 2654 2618 2630 2685 2733 2743 2728 2713 2698 2681 2679 2701 2713 2669 2588 2541 2561 2598 2598 2583 2602 2640 2641 2607 2594 2623 2645 2619 2572 2545 2538 2533 2531
734 2531 2540 2551 2551 2546 2549 2558 2566 2573 2577 2564 2536 2522 2538 2564 2572 2563 2546 2528 2515 2520 2534 2523 2482 2453 2465 2489 2492 2489 2511 2539 2530 2493 2485 2524 2557 2536 2476 2434 2440 2472 2479 2431 2357
729B357m1J1J5j9j9L2O5K7l3m1j3jj4j1J0Rj0j1J4K2j1m8m6j7J0K9N2O6M5j2n6n5k9k1l6l8
725B182oL4M8L8K2ll0l4kK3nn0m7LL3K3J6K4Pm5o3k3J4Lj3J2M3K7j1k5k4l9l3K2P0L9l6o4
720B130l5j6j9JL9L3j9m9k3RJ8K1L2J6k2l1JJ8j0l8l1j7k8l7k0JQK1M7M4Kk2%K3Kk0RM9K6
715B113l7o1k3J7J9J3K2L0J6j4m1n5m0KL9L5pm7n8l8j3jnj2kJ8J8pk0KL2L0%l1m4m1k6lJ3
710A793J9L2M3K1l5o5k9K2K5oj2QJ0j4k4j5j4k9k3QK0%j4ML2L7K5Rj7m7n1k2QQmOK4K3Lj2
705A747j2q%J8K8Nm8q6o4LO2P5N1K0ql9o0m8lL4L5K1J7K3J4j2m1n3m2lM4N4Mn8p0k0L6M9K5
701A690nk0k2j8j9j5JK2K0j1l7k5MJ6J1J4J7Mk2l4k0J1N1Q5P2jp7p8rM4L1j6m3m6m1m1l1n
696A457K8M5K3j2j0L8N5op7o6jJ9j8l3%K4J0J3N2N7jn1l4jj3l8j7K3K7Jj0JJ1K3L7J1o0r4
$$ plain form
729 2357 2316 2327 2342 2323 2304 2336 2401 2428 2395 2354 2341 2340 2326 2315 2325 2334 2324 2313 2327 2349 2338 2290 2244 2227 2237 2266 2318 2384 2429 2417 2361 2306 2277 2256 2220 2182
725 2182 2176 2210 2258 2296 2318 2315 2285 2251 2249 2272 2267 2217 2170 2173 2206 2229 2245 2269 2276 2231 2168 2145 2159 2162 2149 2161 2204 2231 2220 2195 2171 2132 2099 2121 2191 2230 2194 2130
720 2130 2095 2079 2060 2061 2100 2133 2114 2065 2042 2051 2069 2090 2122 2138 2116 2085 2086 2104 2094 2056 2025 2008 1980 1943 1923 1924 1932 1953 2000 2044 2046 2024 2024 2047 2049 2029 2038 2087 2113
715 2113 2076 2015 1992 2009 2028 2041 2063 2093 2109 2095 2054 1999 1959 1961 2000 2035 2028 1981 1923 1885 1872 1871 1866 1854 1852 1870 1888 1881 1861 1863 1895 1925 1925 1894 1850 1809 1783 1780 1793
710 1793 1812 1844 1887 1908 1873 1808 1779 1801 1826 1820 1808 1816 1826 1812 1788 1773 1759 1730 1707 1715 1735 1735 1721 1725 1757 1794 1819 1828 1811 1764 1713 1691 1699 1707 1703 1709 1733 1756 1759 1747
705 1747 1735 1727 1727 1745 1773 1778 1730 1644 1580 1583 1645 1720 1771 1791 1783 1744 1684 1636 1633 1667 1702 1723 1740 1763 1777 1765 1724 1671 1629 1626 1670 1724 1728 1670 1600 1580 1616 1665 1690
701 1690 1685 1665 1643 1625 1606 1591 1592 1614 1634 1623 1586 1561 1565 1581 1592 1606 1623 1627 1605 1571 1551 1562 1613 1698 1770 1769 1692 1614 1605 1649 1680 1664 1621 1575 1534 1493 1462 1457
696 1457 1485 1530 1553 1541 1531 1569 1624 1618 1541 1475 1474 1493 1475 1442 1442 1466 1476 1489 1541 1598 1597 1546 1512 1511 1498 1460 1443 1466 1493 1494 1484 1485 1496 1519 1556 1567 1507 1413
691A413l7M1L8k5m7mK9J5nmmrMK3Lm0l9J3N3M3K1J1pl7m6j7QJrKJ2LNL2N2L5Mp%rm0o5o3l0
686A317K2M8K1k8l7OM3L9K6K6J8j1k9j9rk2k7KK5Jl0j5J8Ql2l2J0K9ml4j4K0J7nLL4L8ro2
681A352o8k1K9L0j1m3k3K3M0J8KJ7L9K5j1l5l3l3m1l4LL9L7OrPJ8kl7m9k8mQKj0j4JJ7J1j2
676A206rK6M1mn6m6QK2rj1M4Q0L0n4p1j7L7M2J5j3k6j6QQk9o5m8RM9M0J4JJOJ6K1Nk7m6l8
672A144rJ7K8J2j8k8PN2M5j0m6k7Ojl1l1OL6L1J3J0K1K7K6K7J9j7o1p6m6nJ5K3L4L6J5j1p
667A226J2Lm0n9k6K2L6K2Pkj1rJ5L5K0j4l3k5nL0O7O2nq2q7k3K9K0j3j5J0K3Pj7j9J0M0L6
662A247ml3j7J2Qk3k5NJ5j3m0k3J3L0K3Lk3m3l2J8O8P1L3j6n1n5k1L8P0M5ol3l4l5m2k8RL6
658A147J8k2l8j2K1J4k1l5%M3M0Lj6MK7K0LRK8L2J3j7m2n1l0QM3N5M8K1k1o0o8m9l4l1j0L2
$$ plain form
691 1413 1376 1417 1455 1430 1383 1379 1408 1423 1418 1414 1410 1401 1405 1428 1431 1391 1352 1365 1418 1461 1482 1493 1486 1449 1403 1386 1394 1395 1386 1388 1400 1403 1408 1440 1492 1527 1531 1524 1524 1515 1475 1410 1347 1317
686 1317 1339 1387 1408 1380 1343 1349 1392 1431 1457 1483 1501 1490 1461 1442 1433 1411 1384 1386 1411 1412 1382 1367 1385 1393 1361 1329 1339 1368 1364 1330 1316 1336 1353 1348 1351 1385 1423 1414 1352
681 1352 1284 1263 1292 1322 1311 1268 1245 1268 1308 1326 1328 1345 1384 1409 1398 1363 1330 1297 1256 1222 1225 1264 1301 1307 1298 1305 1323 1321 1284 1235 1207 1203 1211 1213 1203 1189 1190 1207 1218 1206
676 1206 1197 1223 1264 1260 1204 1158 1166 1188 1179 1168 1212 1292 1322 1268 1197 1180 1217 1259 1274 1261 1235 1219 1227 1235 1206 1141 1093 1102 1151 1191 1205 1206 1207 1213 1229 1250 1255 1228 1182 1144
672 1144 1135 1152 1180 1192 1174 1146 1153 1205 1250 1240 1194 1167 1173 1172 1141 1110 1116 1152 1183 1196 1206 1227 1254 1280 1307 1326 1309 1248 1172 1126 1121 1136 1159 1193 1229 1244 1233 1226
667 1226 1238 1241 1201 1142 1116 1138 1174 1196 1203 1201 1190 1181 1196 1231 1251 1237 1204 1179 1174 1204 1271 1333 1328 1246 1159 1136 1165 1185 1172 1157 1167 1190 1197 1180 1161 1171 1211 1247
662 1247 1243 1210 1193 1205 1213 1190 1165 1170 1185 1172 1132 1109 1122 1152 1175 1178 1155 1112 1080 1098 1166 1237 1270 1254 1203 1148 1127 1165 1235 1280 1274 1241 1207 1172 1130 1102 1111 1147
658 1147 1165 1143 1105 1093 1114 1128 1107 1072 1072 1115 1155 1158 1142 1146 1173 1193 1196 1205 1233 1265 1278 1261 1219 1168 1138 1146 1189 1244 1292 1313 1292 1232 1164 1115 1081 1050 1040 1072
653A072N8M8L2L4M0K0nj6k0l6m6k9njnJ7M5L9Lk3j5pj7l3l1mL3M8J3n3q2k5P4J18P0j0n1l4
648A216OK7Rk8l9rK6K0j0k0roqMK1Rj7j4J9L0Kk9k7j2OL7N8K7m3o5kO2M9nk0jj1n0m5J8P0
643A246N2Qj2j1k4m0k6%ll9m6%M3K3l9n1J2P6O4RrJ2Pl7n3JP0P7K7j9m1n8p5o4j6M0P1O4K4
638A263k0k7PL8J1m6o7l6%J2K0M2M5%n2n1qJ6j0l5j0M0N2J2k2j9pj8l6j6L2N1J9k2k7lJ4J4
634A156J2J5J5Lk0m1m0rK6L1Mk2k8k3k0nJ5J3rqK6M7J3m0n5l4j1JK2M8N2L3J6%k6m8l6lPq
629A069j0PJ0j2k0pjk0l7l0j1MK0L2J2k8l2J8O5N7J7oj1k7l6j0K3J1l7m7lL9L3MmJrl4m4l4
624I12k1j5lK1M1L7J6MMlj8j7J7M7K9k6n5l4lOLJ4K8K0%j6k6l0j0L5O2L2k3l5nRk2n0k8K8
619I25N8L5k0o1n5k0kj2pM3Q5N4k6n0J1O5K9n1p1j4M4M8J3j9l5l8k2NK5K6J8QklNJ5Oj8k9
$$ plain form
653 1072 1130 1178 1210 1244 1284 1304 1299 1283 1263 1227 1181 1152 1147 1146 1141 1158 1203 1242 1245 1222 1207 1200 1183 1150 1119 1115 1148 1196 1209 1156 1074 1049 1123 1241 1311 1301 1250 1216
648 1216 1222 1249 1258 1230 1191 1182 1208 1228 1218 1198 1189 1183 1175 1179 1200 1209 1192 1178 1197 1227 1229 1200 1173 1161 1167 1204 1262 1289 1246 1181 1179 1241 1290 1285 1265 1264 1253 1203 1158 1176 1246
643 1246 1298 1306 1294 1283 1259 1219 1193 1193 1190 1151 1105 1105 1148 1171 1132 1081 1093 1169 1233 1242 1233 1245 1252 1215 1162 1163 1233 1310 1337 1318 1277 1219 1144 1080 1064 1104 1175 1239 1263
638 1263 1243 1216 1223 1261 1272 1226 1159 1123 1123 1135 1155 1197 1242 1242 1190 1139 1131 1147 1137 1102 1092 1132 1184 1196 1174 1155 1148 1130 1094 1078 1110 1161 1180 1158 1131 1128 1142 1156
634 1156 1168 1183 1198 1201 1181 1140 1100 1091 1117 1148 1152 1130 1102 1079 1059 1054 1069 1082 1073 1065 1091 1138 1151 1111 1056 1022 1011 1012 1034 1082 1134 1167 1183 1183 1157 1109 1073 1070 1077 1069
629 1069 1059 1066 1076 1064 1044 1037 1036 1016 979 949 938 942 962 994 1006 978 946 964 1029 1086 1103 1097 1086 1059 1023 1013 1036 1047 1010 963 960 999 1032 1036 1032 1033 1024 990 946 912
624 912 891 876 873 894 935 972 988 992 996 993 975 958 975 1022 1051 1025 970 936 933 939 942 956 984 1004 1004 988 962 932 922 957 1019 1051 1028 993 988 997 975 925 897 925
619 925 983 1018 998 937 882 862 860 848 841 884 969 1023 997 947 958 1023 1052 1001 930 916 960 1008 1021 1002 967 929 907 912 937 963 981 989 987 984 989 1004 1010 992 963
614I63j9nnj0j0oj1j7j0J7L9L3mm1n1l3pRJ5J6RjlJ3K5J6mjK3K9jk9j6K0L1J4NJ2J1j6m3l6
609I21jK7L3K0kk3l0k1j4k2l7l7k0OM1P5O9Rn8o7j1L6K6j3l4l4l4l0mK6K8kk6k4j5nK1O8R9
605I41P3Nn4n8k1J7K7J6J0J6K2J7jk1m0m0j2K4L1J1JK2L2Pj4LK1on0m1J2L4Pj6orm0l9J7O2
600I60L5j7k2mk5o4n4KL2J6kOOmJ7O6P4Qn7m5J5L0j3m7k2K4L4pn0m9j0K7L4K5L1L7J4l1m5
595I25oK9J2l6m8j8J1J0NJ7L0J7pj5nKj6m6m7nN4P2L5k1m1j4K5L8K3nj9j6ljj1j5KK6K9J1
590I78j0k2l1k4OM2L8pl7rL5L5nk5rLj9l7j6K5M2K8Pj2k6k5mQj2l7j4L1K9k3l9J5O2L2l0l1
585I12PJ4rQO5P1Ml8%M2Nn9n2J3M4J0k5j7kprORj3k6mK6L2K7L8N7N9N1N6P0O0K7lpPJ5J1Q
580A483K3N0N6J7m1o6l7RK5%l2m9m8l5k4k2k8l4k5nJ7K8J9j8n7n7j3K8K7%j1pj2k3j5J6L3
$$ plain form
614 963 944 939 934 924 914 908 897 880 870 887 926 959 955 914 863 830 823 832 847 863 872 871 868 881 906 922 918 917 940 969 968 939 923 943 974 988 993 1005 1016 1000 957 921
609 921 920 947 980 1000 998 975 945 924 910 888 851 814 794 800 841 916 985 994 936 869 858 894 920 907 873 839 805 775 771 797 825 823 797 773 758 753 774 842 941
605 941 1014 1019 965 907 886 903 930 946 956 972 994 1011 1010 989 949 909 897 921 952 963 964 986 1018 1025 1011 1014 1035 1029 979 938 950 984 991 975 969 960 920 881 898 960
600 960 995 978 956 952 927 863 809 811 843 859 857 863 869 865 882 948 1022 1030 973 928 943 973 960 913 891 915 949 942 892 843 833 860 894 919 950 987 1001 970 925
595 925 919 948 960 924 876 858 869 879 884 901 931 948 941 926 921 923 907 861 814 809 863 935 970 949 908 894 919 957 980 975 956 940 937 936 925 910 912 938 967 978
590 978 968 946 915 891 897 939 977 970 933 924 959 994 989 964 955 958 939 902 886 911 953 981 988 976 950 925 921 929 917 880 866 897 926 903 864 879 941 973 943 912
585 912 919 933 924 932 997 1068 1072 1034 1034 1076 1081 1022 970 983 1027 1037 1012 995 993 986 977 983 992 979 953 949 975 1007 1034 1072 1129 1188 1239 1295 1365 1425 1452 1449 1442 1449 1464 1475 1483
580 1483 1506 1556 1612 1629 1588 1522 1485 1494 1519 1519 1487 1438 1390 1355 1331 1309 1281 1247 1222 1217 1234 1262 1281 1263 1206 1149 1136 1164 1191 1191 1180 1173 1161 1138 1123 1139 1172
575A172K2QK2M5M4J5j7l4k8KL5M2J3k2k6oLpqJ4L6L2Ok1l3k7j3jkm%Okj4j1J4K2rn5o3k3L6
570A163P0O5K1l4n8k9J4J9qj1K4N6L9Mj2j1k1j9K1P6Q3M1NJ0K1Nk0k3oJ0K2K9J6pj2J4K8K
565A587k9k0RPk6l9j6MKkRRj4k6%L2L1Mj6j8k1k4mL4N0K9JoNPj1k9k6MM0N8M3J7J5M7P9P5
560A871L5nj9pJ6L7M2K3rk5j5kjOL2M0mo9p6j8K9J4j5LL7K0l6n1j3J1j5m1k7lmrJ1K8Ok2o
555A769L4M1Mj8JK4J9Lj%mPM0O2L7j6l7mL7L8Kj8nQj3m0k0L8O4K8j3kL5K9j2k7nQkLM2N8J7
550B211l6l9oJ6J7K6M1M0K1Pnk5l7j1L8N9L7J4J9K2om0l7LL9M1J9J0L3O3O5L1qk0qKQK9N6
545B689N2Rl2k7J6N7P4O2K3l4o3l3L5Q1P1L7K2K9L6K9K5K7J5k2n2l5K3O8N7J3j1NL4M0K8J8
541C366J9K1J7Nj2k3qL3O9O0J4k0rK8M4L0J8K8M1L1Oj0pOJ8L4N2N1L3J8K1L2L6L6L6K3%%L9
$$ plain form
575 1172 1194 1202 1224 1269 1313 1328 1311 1277 1249 1251 1286 1328 1341 1319 1293 1287 1290 1283 1275 1289 1325 1357 1363 1342 1309 1282 1269 1268 1266 1262 1262 1268 1266 1252 1241 1255 1277 1268 1213 1150 1127 1163
570 1163 1233 1298 1319 1285 1227 1198 1212 1231 1223 1212 1236 1292 1331 1335 1323 1312 1291 1272 1293 1369 1452 1493 1498 1508 1529 1534 1514 1491 1485 1495 1517 1546 1562 1555 1543 1557 1585 1587
565 1587 1558 1538 1547 1554 1528 1489 1473 1477 1479 1477 1486 1495 1481 1455 1455 1487 1518 1522 1506 1488 1467 1443 1439 1473 1523 1552 1553 1547 1552 1559 1548 1519 1493 1497 1537 1595 1638 1655 1670 1717 1796 1871
560 1871 1906 1901 1882 1875 1891 1928 1970 1993 1984 1959 1944 1942 1941 1947 1979 2019 2015 1946 1870 1852 1881 1895 1880 1883 1920 1940 1904 1853 1840 1851 1836 1795 1768 1765 1761 1752 1763 1791 1797 1775 1769
555 1769 1803 1844 1848 1830 1831 1855 1874 1877 1876 1876 1872 1879 1919 1981 2018 2002 1965 1961 1998 2036 2038 2020 2015 2023 2010 1970 1950 1988 2052 2080 2067 2065 2100 2129 2117 2090 2085 2093 2091 2094 2136 2194 2211
550 2211 2175 2136 2130 2146 2163 2189 2230 2270 2291 2298 2293 2268 2231 2220 2258 2317 2354 2368 2387 2409 2403 2363 2326 2329 2368 2409 2428 2438 2471 2534 2599 2630 2622 2602 2594 2596 2604 2633 2689
545 2689 2741 2750 2718 2691 2707 2764 2838 2900 2923 2889 2826 2793 2828 2909 2980 3017 3039 3068 3104 3133 3158 3185 3200 3178 3126 3091 3114 3182 3239 3252 3241 3246 3280 3320 3348 3366
541 3366 3385 3406 3423 3428 3416 3393 3385 3418 3487 3547 3561 3541 3532 3560 3604 3634 3652 3680 3721 3752 3758 3748 3741 3747 3765 3799 3851 3902 3935 3953 3974 4006 4042 4078 4114 4137 4137 4137 4176
536D176O8L1m4o1LO8N2oj6K8N5L5J4L2N8M9K1PRRJ1K5L1Rj3ML7K2l7n5J3Q8P6ll9KN3N3K2
531D887J0J1NMK1L0Ok3rL2M2J2j1MK0J2MK6N4N2K6J5K1J9Kj5rJ2L0K8QqnJj1k4JN3O2J0l2
526E373J0R5J16N6npK3L3K1J5K4M0O3P9O9L5J6K0J2k6o0m9j4pl3m3qL8M7J4k6m3l8k7k0j3
522E780jkk2l5j4L3N9N2M1M6M2Ml7l6JL3M2M3M8M6L1K1J7mk9k1L3Q3Q0L9K5N6Q2N7Nj5J6N5
517F654P4P7Q7R4P1M2N2J06J48J32Q3P9J41K17K43K18J88J94K29K66K91L08L21L34L54M02
514A1405M69N28N66O03O63P27P71Q18R08J028J121J169J209J260J284J258J222J205J174J090
512C0478R83Q94P92O16L89J89M4j01k74m39n66o85q11r03r25r20r36r56r22q26p23o56o21
509B3121n83n27m50l67k95k33j64q1NP5J32J88K44L13M06N16O23P26Q43R72J090J204J363
$$ plain form
536 4176 4244 4275 4231 4170 4173 4241 4293 4287 4271 4299 4354 4389 4403 4435 4493 4542 4563 4570 4579 4588 4599 4624 4655 4664 4651 4655 4692 4714 4677 4622 4635 4723 4799 4796 4757 4759 4812 4865 4887
531 4887 4897 4908 4913 4917 4938 4968 4974 4951 4942 4974 5016 5028 5017 5021 5041 5053 5057 5083 5137 5189 5215 5230 5251 5270 5272 5257 5248 5260 5290 5318 5326 5318 5313 5314 5303 5279 5280 5333 5395 5405 5373
526 5373 5383 5478 5594 5650 5645 5638 5661 5694 5715 5730 5754 5794 5857 5936 6005 6040 6056 6076 6088 6062 6002 5953 5939 5932 5899 5856 5848 5886 5933 5947 5921 5878 5840 5813 5793 5780
522 5780 5779 5777 5755 5720 5706 5739 5798 5850 5891 5937 5979 5983 5946 5910 5911 5944 5986 6029 6077 6123 6154 6175 6192 6188 6159 6138 6171 6254 6334 6373 6398 6454 6536 6593 6598 6583 6599 6654
517 6654 6728 6805 6892 6986 7057 7099 7151 7257 7405 7537 7620 7699 7840 8057 8300 8518 8706 8900 9129 9395 9686 9994 10315 10649 11003 11405
514 11405 11874 12402 12968 13571 14234 14961 15732 16550 17458 18486 19607 20776 21985 23245 24529 25787 27009 28214 29388 30478
512 30478 31461 32355 33147 33763 34152 34341 34385 34284 34010 33571 33005 32320 31509 30606 29681 28761 27825 26869 25947 25121 24398 23742 23121
509 23121 22538 22011 21561 21194 20899 20666 20502 20421 20426 20501 20633 20821 21065 21378 21784 22300 22923 23649 24492 25464 26554 27758 29121
506B9121J573J765J877J948K058K191K261K226K142K056J939J737J466J184R12O32L22j6l71
504E7023p28j058j330j548j746j932k077k148k149k109k039j927j771j618j506j418j300j147
502B7472j013r36q82p96o75n62m81m13l41k62j85j10m5KM7J07J80K60L51M57N56O11O37O78
499B4657P47Q01P97P63P46P53P37O57N15L47J86M5q4k21l69n19o65q01r24j017j064j075j084
496B3928j112j141j130j058r61q93q62q27p69p16o96o68n91m92m39m43m42l99l37k88k59k49
493I156k70k98k87k24j66j63j97k18k09j74j18o5n5j07j75k01j83j52j19q7p2q2r0p5o7r8
490E204j35j17o3m9r3j14o2J4L2j7p0q0n3j8jj4m8p0o5m7m2n1n6m3j9%pl8p0p2m7k6l0m5n6
486C532o1n8l1J6M5K0m6r1q4m6j1%lj3k9m3m4k6ojj7l2l7l5l0j4J4K1j2n3n7l0k2n0o9m3O
$$ plain form
506 29121 30694 32459 34336 36284 38342 40533 42794 45020 47162 49218 51157 52894 54360 55544 56456 57088 57410 57394 57023
504 57023 56295 55237 53907 52359 50613 48681 46604 44456 42307 40198 38159 36232 34461 32843 31337 29919 28619 27472
502 27472 26459 25523 24641 23845 23170 22608 22127 21714 21373 21111 20926 20816 20771 20773 20820 20927 21107 21367 21718 22175 22731 23342 23979 24657
499 24657 25404 26205 27002 27765 28511 29264 30001 30658 31173 31520 31706 31751 31667 31446 31077 30558 29893 29092 28168 27151 26087 25012 23928
496 23928 22816 21675 20545 19487 18526 17633 16771 15944 15175 14459 13763 13095 12504 12012 11573 11130 10688 10289 9952 9664 9405 9156
493 9156 8886 8588 8301 8077 7911 7748 7551 7333 7124 6950 6832 6767 6712 6605 6430 6229 6046 5894 5775 5688 5616 5534 5444 5369 5302 5204
490 5204 5069 4952 4889 4840 4747 4633 4571 4585 4617 4600 4530 4450 4397 4379 4378 4364 4316 4246 4181 4134 4092 4041 3985 3942 3923 3923 3916 3878 3808 3736 3689 3663 3633 3588 3532
486 3532 3471 3413 3382 3398 3443 3463 3417 3326 3242 3196 3185 3185 3182 3169 3140 3097 3053 3027 3021 3020 3003 2971 2934 2899 2869 2855 2869 2890 2878 2825 2768 2738 2716 2666 2597 2554 2560
481B560L1K1Nnj2j4pkj9m4m7j6J6J8mk2j3PJ5Nj1j8j5j0rj2k5m8o1n4l3k0j7mK3M5M2J9j1
476B254m1o2n6k6QK6K6J3j4m2m2j8lj6k7nK9L9K5Kl2o6p1k7J6J6NL9Q5N3n1j07n0L6L5l6p1
472A844k8K7K6j4m4m0j3J6L5L3J8NJjqj8k1qK0L7J6l1n6l8j0pj1KJ9Nj5J0O2O7jp0p3l6k0
467A680j7RM8M2j4n4m4j1OQJ3J3LKK0L0Ok6k2J0K2Kj6jK1J2k6n2m7l1k8k7j1J0Rj5k6jL0K4
462A551lkL0L2j5n3j4N7P0Pn2n2l2l1k6J5N9N4J5lPKl0m5j1L8N5K9j3l8k8RL9K5j7m2l2j8
458A537j6pJ8K8Oj6oJ4Kk4k2NJ1j0j9PK7J4r%K7L4K1J6K6K4Lj8k4k6k3nK2L0J6PK3L4Jo0q7
453A581n6JL8M0K1KlNJ4Prj5nOJ4L3O0O7L3j0j6J7M4L4PKL0O8Q6P0M3K7K1QnJ2O1R8R1O2O5
448B649J01J32J39J51J78J90J64J23R8R7J03R9P9M6K0J7K1Jm4p2o4n0n7p6q2p8q5r9j08j13
$$ plain form
481 2560 2591 2612 2617 2612 2600 2586 2579 2577 2558 2514 2467 2451 2467 2485 2481 2459 2446 2453 2468 2473 2462 2444 2429 2419 2410 2398 2373 2325 2264 2210 2177 2157 2140 2136 2159 2204 2246 2265 2254
476 2254 2213 2151 2095 2069 2077 2103 2129 2142 2128 2086 2044 2026 2023 2007 1980 1975 2004 2043 2068 2070 2038 1972 1901 1874 1890 1906 1911 1950 2035 2088 2037 1930 1880 1916 1951 1915 1844
472 1844 1816 1843 1869 1855 1811 1771 1758 1774 1809 1842 1860 1865 1866 1865 1857 1839 1818 1810 1830 1867 1883 1852 1796 1758 1748 1741 1730 1732 1751 1756 1741 1751 1813 1880 1879 1809 1736 1700 1680
467 1680 1663 1672 1720 1762 1748 1694 1650 1639 1645 1653 1666 1679 1682 1684 1704 1734 1740 1714 1692 1702 1724 1726 1710 1709 1730 1742 1716 1664 1617 1586 1558 1531 1520 1530 1539 1524 1498 1497 1527 1551
462 1551 1548 1546 1576 1608 1593 1540 1526 1583 1653 1660 1608 1556 1524 1493 1467 1482 1541 1595 1610 1607 1614 1616 1586 1541 1530 1568 1623 1652 1639 1601 1573 1582 1621 1646 1629 1587 1555 1537
458 1537 1521 1514 1532 1560 1566 1550 1544 1558 1560 1536 1514 1519 1530 1520 1501 1508 1535 1549 1540 1540 1567 1601 1622 1638 1664 1688 1691 1673 1649 1623 1600 1595 1617 1647 1663 1670 1693 1727 1728 1668 1581
453 1581 1525 1526 1564 1604 1625 1627 1624 1629 1643 1650 1641 1626 1621 1627 1641 1674 1734 1801 1834 1824 1808 1825 1869 1903 1910 1912 1942 2010 2096 2166 2209 2236 2257 2265 2260 2272 2333 2431 2522 2584 2649
448 2649 2750 2882 3021 3172 3350 3540 3704 3827 3925 4022 4125 4224 4303 4349 4369 4386 4407 4408 4364 4292 4228 4178 4121 4045 3963 3885 3800 3701 3593 3480
444C480j08q3m4l3n6o3k0K2Pm2m2J3M7J7k9k9PL4M1N8R4J24J29J14J01R8J00R6Q9J07J66K40
440D635K78K66K42K33K32K19K12K22K25J95J36Q0K5l4q6r9q4q0j12j57j86j99k14k39k65k75
437E170k54k05j52j28j30j34j17j01j09j33j32j01p1p1q5p3m1k7l7l0J8P2Q2M6Mk0k4qL1O5
433C305O1K8J9N6J05J26J25J24J24J10Q0N0K5J1RNk6o9q0n1l1o1j16j41j28j08j02j06j28
430C216j54j57j17o9n0n5n0m6p0r7p9l5k6n8o7l5j9m4n8k6%k5m4J0P6N4m3r3m8Mj1n1m3rr
425A672m0n3k7j0k5m5k8J6M8L9Nj7mK5L0Jl1l2j2lj2j9j0koj1pnj8l6l2JL2L2J6J0J7Qj2j4
420A441J5K5j5o2n5lJ7j1k3K6P9O6Ll7l2k0j6mKk6p3p0pN1N0K3Ron1q3n3J4L9J2j1mPMRL0
415A260L2Lk6k8j9j4jK1K4j0m0k6K0M7L5J2jKJ2J6Lj3qJ2J4qj9LJ9pm7m5rJ2kj4j0oj5j7j
$$ plain form
444 3480 3372 3289 3245 3212 3156 3093 3073 3095 3102 3060 3018 3031 3078 3095 3066 3037 3044 3078 3119 3177 3271 3395 3524 3638 3739 3837 3937 4033 4122 4229 4395 4635
440 4635 4913 5179 5421 5654 5886 6105 6317 6539 6764 6959 7095 7175 7200 7166 7080 6981 6897 6817 6705 6548 6362 6163 5949 5710 5445 5170
437 5170 4916 4711 4559 4431 4301 4167 4050 3949 3840 3707 3575 3474 3403 3332 3247 3174 3133 3106 3069 3039 3057 3129 3211 3257 3261 3241 3217 3209 3240 3305
433 3305 3366 3394 3413 3469 3574 3700 3825 3949 4073 4183 4263 4313 4338 4349 4358 4363 4337 4268 4188 4137 4106 4045 3929 3788 3660 3552 3450 3344 3216
430 3216 3062 2905 2788 2719 2669 2614 2564 2518 2448 2351 2272 2237 2211 2153 2086 2051 2032 1988 1930 1904 1904 1879 1835 1845 1921 1975 1932 1839 1791 1795 1784 1733 1690 1681 1672
425 1672 1632 1579 1552 1542 1517 1472 1444 1460 1508 1547 1552 1535 1531 1556 1586 1587 1556 1524 1512 1509 1497 1478 1468 1466 1460 1449 1442 1437 1419 1383 1351 1352 1384 1416 1432 1442 1459 1467 1455 1441
420 1441 1456 1481 1466 1404 1349 1346 1363 1352 1329 1355 1434 1500 1503 1466 1434 1414 1398 1394 1396 1370 1297 1227 1220 1271 1321 1344 1353 1347 1296 1213 1160 1174 1213 1225 1214 1210 1217 1221 1230 1260
415 1260 1292 1295 1269 1241 1222 1208 1207 1228 1252 1242 1202 1176 1196 1243 1278 1290 1289 1291 1303 1319 1322 1309 1301 1313 1327 1319 1300 1303 1322 1315 1268 1223 1214 1226 1224 1210 1200 1194 1179 1162 1161
410A161J5J2%qrj5k3k2mK8M4J9k6l0J5L9qo7m7L6Q0N3J0lj9m4m2ML6J6j2lJ0ql5l5k2j2J7
406A101P9J04L6n9p3j5J4k2n3l1JjoJ7M0J7l5o5n2j5J7L3K7J9J8K0PrnJ4J1j4l0j8KRJ3J5
401A111jl1l3ML4K1jQK4no1p5k2L9N3K3j1k2j7pQK2L1K2nl1l4j2J1K1J6Mj0j6nJ3Pj9l4j5
396A005J3K5L0L3J5k6m4qL9L8pl1j3Lj2k7j7KOMJ9L2J1l6o3m4OM2M5K9J4RJj9l5l4j5KJ1K1
391A024L3L0Qk6n2n2k0J7K3qk8lM1M2ml8k3RJ8Lj5l3l6LP3J09O6j3n8n4m1k7KL3K4j7l3lL5
387A009L9K5J9J5j0m5o5n6k7J0L7L4J0%K5M7L2nj9JK3K4J7J0lk3l5k8j3kPQlj5rPKk1k8mJ5
381A005J0jLkk9m0kM1K6l5n3mM0K2k2k7LK3J7J0J5J4jj1j0onkOJ5K3K6J1j9m3l5jL4N5N4L1
376A136rl7k4J0K0lk0oJ7K4K2K3K1kl0l4j1J0J0Jpqj2k0j8nRJj8j7K3O5N7Jl9k2K5M4K1j3
$$ plain form
410 1161 1176 1188 1188 1180 1171 1156 1133 1111 1107 1135 1179 1198 1172 1142 1157 1196 1188 1121 1074 1110 1190 1243 1253 1250 1231 1187 1145 1149 1185 1201 1189 1186 1196 1188 1153 1118 1096 1084 1101
406 1101 1180 1284 1320 1261 1188 1173 1187 1165 1112 1081 1082 1081 1075 1092 1132 1149 1114 1049 997 982 999 1032 1059 1078 1096 1116 1123 1114 1109 1123 1134 1120 1090 1072 1074 1083 1096 1111
401 1111 1110 1079 1046 1050 1084 1105 1104 1112 1136 1131 1070 995 973 1012 1065 1088 1077 1055 1038 1031 1039 1061 1092 1114 1109 1078 1044 1032 1043 1064 1080 1084 1074 1058 1053 1066 1073 1054 1020 1005
396 1005 1018 1043 1073 1106 1121 1095 1051 1043 1082 1120 1113 1082 1069 1072 1060 1033 1016 1018 1024 1028 1047 1079 1090 1054 991 947 953 995 1040 1069 1083 1092 1093 1074 1039 1005 990 992 1003 1024
391 1024 1057 1087 1095 1069 1017 965 945 962 985 977 949 946 987 1029 1025 987 964 973 991 994 979 946 910 913 986 1095 1161 1148 1090 1036 995 968 970 1003 1027 1010 977 974 1009
387 1009 1048 1073 1092 1107 1097 1052 987 931 904 914 951 985 995 995 1020 1067 1099 1094 1075 1076 1099 1123 1140 1150 1147 1124 1089 1061 1048 1046 1053 1061 1058 1043 1034 1041 1043 1022 994 990 1005
381 1005 1015 1014 1017 1015 986 946 944 985 1011 976 923 919 959 981 959 932 935 958 975 985 1000 1014 1013 1002 992 986 981 979 985 1000 1023 1049 1060 1041 998 963 962 996 1051 1105 1136
376 1136 1127 1090 1066 1076 1096 1093 1073 1067 1084 1108 1130 1153 1174 1172 1142 1108 1097 1107 1117 1118 1111 1103 1091 1071 1053 1048 1057 1058 1040 1023 1046 1111 1168 1169 1130 1108 1133 1177 1198 1185
372A185l8m9l7J1P7J02N6k2o6o1m0l2k1J1M9N8L6J0Kjj5k3rNjqK1O5O1jn4l5K2L9%l8l8k0
367A201j2j0MK0J8J0RJ5Rrj5jOj9n2m2J5O7O2K4OJ7Rm1q2n8K4R4R6M1k0l2J0N5M6KrL7P4L6
362A605l8o5k2K0J3j8k4oJ6K9L3K1ql0l6l8m6l6KM0M3J9j1l3m8m5j6J8L0J5mj8k9k9j2J2J7
358A321PLK0L8L2Qj5k3k4k3j9kK2L3J8jRM5O0K3l3m5jM6M1%k1NM6N5K0j9k0PK3J8J2J6J0j7
353A675l2j4J0Lj7pL6O1M6J8J2J8J8J0KmmNJ3ml3l8j3jk3m3j8L3N4L8K1J9J1j6m0k9J4O1Q3
348A925P0L1j1k7j2Mkk6l4%N6P9L9k9n7k2L0M9M0K8J3j5m2l3MK8J9N%ok4l1j0J4J5nj8rJ6
343B052M3M7J3m2p3n0ON0N9M1J4rj9j5mQJ7J8jk5k4LJ6pl8l1LK6J4j0k8l8l9l0j9j7j9j0Q
338A890J8J5OjkPQj8o4p1j1N7N3jj4L5O1Mo8o8mM2M3K2jl1l8PP0Q5L6j8l2k9l2l0j2kj4k2
$$ plain form
372 1185 1147 1098 1061 1072 1149 1251 1307 1285 1219 1158 1118 1086 1065 1076 1125 1183 1219 1229 1231 1230 1215 1192 1183 1188 1187 1179 1200 1265 1326 1325 1271 1236 1258 1297 1297 1259 1221 1201
367 1201 1189 1179 1183 1203 1221 1231 1240 1255 1264 1255 1240 1239 1245 1226 1174 1132 1147 1214 1276 1300 1306 1323 1332 1291 1209 1151 1175 1269 1365 1406 1386 1354 1364 1419 1465 1467 1458 1495 1569 1605
362 1605 1567 1502 1480 1500 1513 1495 1471 1465 1481 1510 1543 1564 1556 1526 1490 1452 1406 1370 1372 1412 1455 1474 1463 1430 1382 1337 1321 1339 1369 1384 1380 1362 1333 1304 1292 1304 1321
358 1321 1328 1331 1351 1389 1421 1429 1414 1391 1367 1344 1325 1323 1345 1378 1396 1395 1404 1449 1509 1532 1499 1454 1453 1499 1540 1540 1519 1524 1570 1625 1645 1626 1606 1613 1636 1654 1666 1682 1692 1675
353 1675 1643 1629 1639 1642 1625 1618 1654 1715 1761 1779 1791 1809 1827 1837 1839 1835 1831 1836 1849 1845 1812 1774 1761 1760 1737 1694 1676 1709 1763 1801 1822 1841 1852 1836 1796 1767 1781 1842 1925
348 1925 1995 2026 2015 1988 1976 1980 1978 1952 1918 1918 1974 2053 2092 2063 2006 1984 2014 2063 2103 2131 2144 2129 2087 2054 2058 2086 2105 2110 2110 2104 2080 2049 2039 2053 2068 2063 2045 2036 2052
343 2052 2095 2142 2155 2113 2040 1990 1996 2046 2105 2146 2160 2151 2132 2117 2113 2121 2138 2156 2155 2130 2106 2109 2125 2118 2080 2049 2052 2078 2092 2082 2054 2016 1977 1947 1928 1911 1892 1882 1890
338 1890 1908 1923 1929 1928 1926 1933 1941 1923 1859 1788 1777 1834 1887 1886 1872 1907 1968 1972 1904 1836 1832 1874 1917 1939 1938 1907 1869 1876 1946 2031 2067 2049 2017 1988 1956 1926 1914 1912 1898 1876
333A876oJ7J9Knkpk7m5m6k9nNj0l0k8nLj7l3j6J0Ml1m7k2J0Ok6l8rL1L4om5m7k5j1nK0M9M1
328A504j0m6k1K7L5RkJ1Ll1m7k3Kqk7j7NLk3l4k3j9l6m3k2J4K7J0k1m4m9l0JJ9J5oj9k3k1
324A040k0j8j7j0LK0K1Kk0k4k3l3m2j9L4O7N3K2J0Mk7n5l8RJ9j9l8oK7Nl7l6jOj7k4LK1J3
319H55PJ6J5j2k6oJ2ql1j2L0L2j6n2l3K0N3N1L0J1jj1j9k4j9qRK7L6K1k3o2n7j1K1Rj5j3J
314G97j2l7k6K9O2L3k4m5j5K5L7J7j3j6J4N4N2Mn0n8k3J3K2Mj6k7k7k8l3k6OM8O4M6K4J8N
309H98l0n7l5MKl9n1j0K7J8pOL3K5rj7J1K6J0n%%k1k5OL3J6k0k4lnk6j8K8M8Qm6m8mK0Nj1
304G13PM5O2M1%l3m4l9l2k6j1J8M3M4J8j6l9m8m0j7J4L4K9J0jNJ5J8Nj3k5k4j1ONj6l4k6J1
300F48M7N0K7Kj5k4k2ML6L6ll9l0MJ2j3k6%K9J7j5k0J5L7Mn3o8k0L6M2Jk7rK9M2J0l8n1j1
$$ plain form
333 1876 1870 1887 1906 1908 1903 1901 1894 1867 1822 1776 1747 1742 1747 1737 1707 1679 1674 1677 1660 1627 1611 1621 1625 1594 1547 1525 1535 1541 1515 1477 1468 1499 1533 1527 1482 1435 1410 1399 1394 1414 1463 1504
328 1504 1494 1448 1427 1454 1489 1498 1496 1507 1510 1479 1432 1409 1411 1403 1376 1359 1364 1367 1344 1310 1287 1268 1232 1189 1167 1181 1208 1218 1197 1153 1104 1074 1075 1094 1109 1103 1084 1061 1040
324 1040 1020 1002 985 975 978 998 1019 1021 1001 977 954 921 879 860 894 961 1014 1036 1046 1050 1023 968 930 939 958 939 901 895 922 927 890 854 853 859 842 818 821 842 855
319 855 862 878 893 881 855 849 861 853 822 810 840 872 856 804 771 791 844 895 925 936 935 924 905 881 862 854 863 890 926 947 924 862 805 794 815 824 809 796 797
314 797 785 748 722 751 813 846 822 777 762 787 824 841 828 812 826 880 932 936 886 828 805 818 840 844 828 801 774 746 713 687 693 741 805 851 875 893 898
309 898 868 811 776 780 782 743 692 682 709 727 720 726 759 784 775 758 769 795 805 800 800 800 779 754 760 793 809 789 765 762 757 731 713 741 789 797 751 703 699 719 724 713
304 713 720 765 827 868 868 835 791 752 720 694 683 701 744 788 806 790 751 703 663 646 660 694 723 733 732 737 752 770 775 762 737 713 702 708 713 697 663 637 648
300 648 695 745 772 774 759 735 713 717 753 789 786 747 717 721 733 720 694 694 723 740 725 705 720 757 761 708 640 620 656 698 699 672 663 692 734 744 706 655 644
295F44M6N2kn1k8L4M8lm7l4mqk8j5J7J9qj6J2L2K5J2J6K0J0MR%k7k8J6O2N1Kk6j6pj7j8MJ3
290G65j0l8k7J2L9L5J8%k2l7k9%K1J5%kkj5k6j0J8J9qj4QJ5j5k9OL9Rm4k9M6P7K5k7j0L3J9
285H25l2n0j8%j8m1l4j1PJ5J2jrJ2M4M7J3j9j9j0j9m2l8JL8L3j4m7k6K9N7L6NJPnk6k5j4k0
280F44k7LN1M9j6o8m2J8L8J3j2pMNPJ1Ppj5oMOjpj5k1j2QK4K6K4K7K1jk3j6K0M5K5k9o5n2
275F38j1J0RPK0K3kk9k3KPj7k6MM4M5J1j4rlj9l9k6J6M3L8K2J4lm2p4o1j2K5K7K1K1J1k0m4
270E84k7J9M9L9Pk2l7l9k3OL3M5L8K3J7K3K4Qrj0ok2n5n9j0M4M0j8n7k9L1N5K8j0j8NL0L1
265G28Rj5l5m1l3j0J1J4%mJkk7m3k3J4K9Nk9l6j4J4K3J0%J0K0Mj9mN0P5L1k2j7K0J2m3o5k8
260E70K0L3L4L8J3m5o4oN2K4n1n9J0O0L4oJL3L2%j9j5j1j7k2j1LJk3n1n3j4L3L5Lj1J8L8J2
$$ plain form
295 644 690 742 740 689 661 695 743 740 693 659 655 647 619 604 621 640 632 616 628 660 685 697 713 733 743 747 756 756 729 701 717 779 830 832 806 790 783 766 748 752 765
290 765 755 717 690 702 741 776 794 794 772 735 706 706 727 742 742 740 738 723 697 687 705 724 716 702 710 725 710 681 687 726 735 691 662 708 785 810 783 773 806 825
285 825 793 743 725 725 707 666 632 621 628 643 655 654 645 657 701 748 761 742 723 713 694 652 614 615 653 686 672 625 599 628 685 721 726 727 734 729 703 678 664 644
280 644 617 620 671 720 704 636 594 612 650 663 651 644 648 653 660 671 678 671 656 650 654 660 659 652 637 616 604 612 636 662 686 713 734 733 710 694 714 759 784 755 690 638
275 638 627 637 646 653 673 696 694 665 642 644 651 634 608 612 656 701 712 698 689 686 667 628 602 618 661 699 721 735 732 690 616 555 543 568 595 616 637 648 628 584
270 584 557 576 625 664 671 649 612 573 550 556 589 634 672 695 712 735 759 767 758 748 742 720 665 606 596 640 680 662 605 576 607 662 690 680 662 667 697 728
265 728 737 722 687 646 613 603 614 628 628 624 625 623 596 553 530 544 573 578 549 513 499 513 536 546 546 556 576 580 561 557 607 682 713 691 674 694 706 663 598 570
260 570 590 623 657 695 708 663 599 593 645 669 618 559 569 629 663 657 658 691 723 723 704 689 678 661 639 628 631 632 609 558 505 491 524 559 562 551 569 607 619
256F19j8lL4K6k7n1j2L8M6K7J2rm1m7KN3L8j9l3PK4rl3KL6Pm9m3J0K1k9n9j8L3K7j3k0J6M7
251E92N0M3K4j1m1l8j3rj6ON1O2K0k0j3Nj8n3m1J4M0J2k6k5RL5L7K1Jj4j9k4l8m4k0K1L7J6
246F13pJK0K1O%jrj2MJ3j5n2l7K0M3jm4j6M6N2qn5l5J9M3K9J6J7K1J4PJ3K0Pk4l8j1K9M1J0
241G60l0m2l5l3l4j6J9L6J9noPOk0m3l0J6N2L9j3m9l0K0M4K3kOK6J7k3m4j9J8J6j7l0LL9L9
236F84J2OJ4km4n5rL5K2k0k7LJ7Kj0%J1PJ1J9Kl2k8J9M5jo9p7l6mJJ3L4L5J9K4M3K7l0p0m7
231E44kJ3J1J9K8Ql1l8jM1M9K1j3l3k6JL0L8K5%j6j1J2K4Pl0m9l1LK4K9K8J5j4l4k4KLj7k1
227E84JJ0j8n1m5rJ8J1mqjJ1K1K9K8J9J0Lj1j8mJ5J0k5m4k0J7K6J1NJ7J5pk2qJ3K1K0K4K8
222F72J4j1l4m1l2j0Omk9l4jM0N2K9ml0l9k0K0N3M9J6j6k7j1J6K9Ol3m3oK9K2lqmk2l6mM0
$$ plain form
256 619 601 598 632 658 631 580 568 606 652 679 691 682 641 594 596 649 687 668 635 642 666 657 624 626 662 669 620 577 587 608 579 520 502 535 562 549 529 545 592
251 592 642 685 709 698 657 619 606 597 581 587 638 700 720 700 687 692 674 621 580 594 634 646 620 595 604 639 676 697 698 684 665 641 603 559 539 560 597 613
246 613 606 607 627 648 654 654 653 644 632 636 649 634 582 545 565 608 607 563 547 593 645 637 582 547 566 609 638 654 671 692 706 713 726 746 753 729 691 680 709 750 760
241 760 730 688 653 620 586 570 589 625 644 639 633 640 646 626 583 553 569 621 660 647 598 568 588 632 655 653 659 685 702 679 635 616 634 650 633 603 606 645 684
236 684 696 702 716 714 670 615 606 641 663 643 616 619 636 638 628 628 639 646 657 676 678 646 618 637 682 681 612 535 499 495 496 509 543 578 597 621 664 691 661 591 544
231 544 542 555 566 585 613 621 590 552 551 592 641 662 649 616 590 591 621 659 684 684 668 657 669 693 700 670 621 590 593 617 646 674 689 675 641 617 619 622 605 584
227 584 585 595 577 526 481 472 490 501 497 489 488 499 520 549 577 596 606 609 598 580 576 591 601 576 532 512 529 555 566 571 588 603 596 574 566 579 600 620 644 672
222 672 686 675 641 600 568 558 564 560 531 497 496 536 588 617 613 583 544 524 544 597 646 662 646 619 608 624 653 659 626 583 577 606 628 625 617 613 591 555 551 591
217E91K9l1m4J4N4J3m4k5M8P7L3j2j6qk6m8l4J2M3L0ok4j3mk1m0j1N1P8L3l0m1qJ2%j8k3k6
212E65k4lK4K4lj1J6M0K6j0k5j0J3K3J7KojJ4K1J7J6J0j0m0m4k3kLJ2L1K3k8o7m2NKm2m9k
207D62K9Kk7lL6K0k9l1J5L5jk6OM1K0l0m3j7ok0j7J6L9L4K3J8jl2l6KL8L5J5J0Rj8n3n2rL4
202D88N1M2K0mj9k1k0k2j9mPPJ3K2Pl8n8k5J9J8lOK4%l3jP7R1J4n3k4M4N5J3j1oj0l2m8m3
197E24k7OM8P1N1Pk0k9l7m2k6kMmJJ0Prj4qJK0M9N6Rn3o4j5K8L1K2L5N0L8Kk7l4k4%K1K2j5
192F63o5q8o5j1L6M2J0k0j7J2L1K5Prj2mJ2K2J1j3l2l6k1J0M6N5K8nnJ0Qj4k0mNj0j5jJ0n
187E71j9%L0L0jk3j6oj2k1j2J1K3J4KQJ6jl7n3k6J0J6NJ0L6M3J5k3m5o1o8m0K5P5O0Lk0K1
183E40O7N6ll5oM2M3mm0k9oj5l6l0%J6ROJ2J1MJ9M9M5j8q1p3mN4M3j4n2l2K0M9K8rk5j9pK
$$ plain form
217 591 620 589 545 559 613 626 582 557 605 682 715 703 687 679 653 605 571 583 626 656 650 626 613 609 588 548 537 588 666 699 669 628 620 632 632 614 591 565
212 565 541 538 562 586 583 572 588 628 654 644 619 609 622 645 662 664 658 657 671 692 709 725 735 725 685 641 618 616 619 631 662 685 657 590 548 553 555 513 464 462
207 462 491 493 466 463 499 519 490 459 474 509 508 482 488 529 549 519 476 459 453 433 416 432 471 505 528 546 545 513 477 479 517 552 567 577 586 568 515 463 454 488
202 488 539 581 601 597 578 557 537 515 496 492 499 506 519 541 548 510 452 427 446 464 461 467 491 491 458 457 534 625 639 586 562 606 661 674 663 657 647 615 567 524
197 524 497 503 551 622 673 680 660 631 594 552 526 524 528 524 525 535 542 533 519 511 512 532 581 637 646 593 529 514 542 573 595 630 680 718 720 693 659 635 635 656 678 663
192 663 598 510 445 434 470 512 522 502 485 497 528 553 560 551 539 535 547 569 580 567 535 499 478 488 534 589 617 612 607 617 625 611 591 587 592 582 567 566 576 571
187 571 552 552 582 612 611 588 572 566 554 533 521 532 555 569 571 579 595 594 557 504 478 488 504 509 519 555 598 613 590 545 484 416 376 401 476 536 539 519 540
183 540 607 663 660 625 619 661 704 700 660 631 625 610 574 544 544 560 569 575 587 598 602 621 670 715 697 616 543 539 593 636 622 570 538 558 607 635 626 601 582 575 577
178E77J3J2mrJ6K8j2o0m0L0M5k3p2k7M3M5mk4qlj0PL2J1m3o7l8rlOK6K5qk1QL4J6k0l5k3j0
173D01QL4N2M3K5K0K0Jm0o6n0MN9P3L8kKL4L7pn6o4l8j4mnpQL8N5J6n8r3m8L0O8M9J0k1l6
168E16k3J2L0J5pjJ3Jk0rK4K6j1k6J3N2L0l1o6n6l4k0KL2N1L8J3jmj3j5kJ7J6j1m1n5m9k4
163C82OK0ll6k9K8P9O7J8KK4K5j9n7l4K5N1K3j6l2k1KK7L9K3j0k9j9MJ4J7K4L3K2pl7m4k5
158E37%J6J9Mj7k8j6J0K5J3lmJ3K2Pk3m0l0mJ0PNK1L9L1Kj8j5pmJ3L9L5j0m1j8K0J4j8j9J5
153F02K7Jj7onl1m7k3PJ7K7N2N5J3l6l8j0NjMK0K2%k4l3j5K9P3P1K1k5l1k8n5p4l7L6P0M7
149F63Ll0n5n9k4K6L3jk2nJ3%k4k9j0J1K5K6J1nmLj1l6l3JK8K1NJ%omJ9L6K7J1QJ7J3j3m7
143E83o5m4KK6mm2k8K9N3K2j0qKj2j9QL6K2k3n0m1j3J9L6J8k1l8pM1N8M3J1k8n2k7L0N1Kn4
$$ plain form
178 577 590 602 598 589 605 633 621 561 521 551 596 573 501 474 517 562 558 534 526 523 513 520 552 563 520 453 415 406 403 409 435 460 452 431 439 473 489 469 434 411 401
173 401 409 443 495 538 563 583 603 604 564 498 448 452 511 584 622 620 622 656 693 686 630 566 528 514 510 505 498 506 544 599 615 557 464 416 446 514 563 573 552 516
168 516 493 505 535 550 543 542 555 556 536 527 551 577 566 540 553 605 635 604 538 482 448 428 430 462 513 551 564 563 559 546 531 529 546 562 551 510 455 406 382
163 382 388 408 405 369 340 368 447 514 532 534 558 583 564 507 473 498 549 572 556 524 503 505 532 571 594 584 555 536 540 554 571 595 628 650 643 606 562 537
158 537 537 553 572 576 559 531 515 525 550 563 560 556 569 591 598 575 535 505 501 511 518 523 544 583 614 616 598 583 576 572 585 624 659 649 608 590 610 624 606 587 602
153 602 629 630 613 607 602 571 524 501 508 525 552 604 659 672 636 598 588 593 592 596 616 638 638 614 581 566 595 668 739 760 735 704 676 621 547 510 546 616 663
149 663 666 636 581 522 498 524 557 556 534 529 542 542 518 489 479 490 515 541 552 547 543 546 535 499 466 467 495 516 521 522 522 516 512 531 567 594 605 613 630 643 630 583
143 583 518 474 476 502 498 456 428 457 510 532 522 514 516 504 485 493 529 551 528 478 437 424 443 479 497 476 438 431 472 530 573 584 556 504 477 507 558 560 506
139E06m4J1L5J5LK0L0J2j6l0k6j0J5K9K0Lllj3j7%J2rl7k6J0J3j6j6K4M7J5k8k9%J5J0Jrk5
134D89k2OK8Qk5k0J3K3lj4K9P7O4Kl3qJ2k8q9p6J1P9O1Jk1OK8K0%oPK8L1mn4o1j6K2Pk4pK7
129E68J4l8n9k8JPK0L9J8m3p7m5J9O1P2M8j9q4o9J5N8Oo3n2J0M3L7L4K8rm5l1J5K7LpJ8L0
124E22Ol0m5l0J3O0N7j0p5n7J4N1K2rnJ0Mj0pQL0M5L0k5o5k4N5P0Nm9l0Mmk7j7Jj9l8pM4L5
119E03k5n3k0J1j1m6l6J4N4N7L5Mk3l8k3J7N3M9Qk8k4kMmOL9N7M9L2K4Mk9m0k3j9m0m0NL6
114E37ko4n5QL1j2l9LN4N2J6NNk5o5n7JM1L5J9K2K1lk4j0J7J5k2n9n9l1LK7L8L2J6RJ8L6M7
109E81L3nm3n3k8krl7l7jK8J8JJ5M0L0j0k1J1L8K6%PL5L5ll8m0k4j8k1pK8M7J6l9n5qM5L3
104E68k4m9j0L7L5%j9qKOJ2K1K3K7L5L3Kl6m3k1jpk4l7l7k2OK1Mj6%M2N5J5l5m7k8j1%J8M4
$$ plain form
139 506 462 473 508 523 526 546 576 588 572 542 516 506 521 550 570 573 570 567 554 537 537 549 540 503 477 487 500 484 468 492 539 554 526 497 497 512 522 523 514 489
134 489 467 473 501 509 484 464 477 500 497 483 512 589 653 655 622 614 626 598 509 433 444 523 584 585 564 570 598 618 618 612 619 647 678 674 620 559 543 565 572 548 541 568
129 568 582 544 485 457 458 465 485 524 542 499 422 377 396 457 529 577 558 474 405 420 478 484 421 369 379 422 459 493 521 512 467 436 451 478 481 474 492 522
124 522 528 498 453 423 436 496 553 543 468 411 425 476 498 489 484 494 498 488 481 489 519 564 594 569 504 480 535 605 610 561 531 535 531 504 487 488 469 431 424 468 503
119 503 478 425 405 416 405 359 323 337 391 448 483 487 464 426 403 420 473 522 530 502 478 476 480 476 482 521 578 627 659 683 687 658 618 595 576 536 496 501 537
114 537 535 471 416 424 455 443 404 407 461 513 529 534 539 514 449 392 393 434 469 488 510 531 528 504 494 511 526 504 445 386 355 358 385 423 455 471 480 498 534 581
109 581 614 609 566 513 485 483 474 437 400 399 427 445 446 461 501 531 521 500 511 549 575 575 582 617 652 649 611 571 547 529 508 501 529 576 592 553 498 490 535 568
104 568 544 495 485 522 557 557 538 530 532 538 550 571 594 621 656 689 691 655 612 591 590 583 559 522 485 463 469 490 494 478 478 520 575 590 555 508 480 469 469 487 531
99E31N2K5j4l2j3Rmm5o2k0L8N7L1Kj7l7m6j9K3K8mj8J7M3J5l0k0K8M8J5k9l6qK1K3j0n4o6
95D22l1J6L4K1R%k1m6m2qJ6J1LJ2L1L7K8J1%JPkl6n4k2L6N9K8j2k2j9k2j9OL0K4ONJ6J3kk1
90E03l9m8k6K8N8K6l1m4j1J3JjK6M7K9nj2nj4k7pM2O3L2j9m3l7k3j8j6j3lOJ0NMK1M3L7j2
85E40n8n3MN1M2Jj7MK6J2j9k2QL0J5j2rK4M1J7k7m4k8j1k0m1l8oK3J8j2k4%L3M1K5J2J4J1
80E51lj3mJ4J5j3m3m7j5K7M5K0k3l9j7J3J9Lj6k3j9jK3K9J6J0L4N7L9j8o5p8p3n6j8K9M3R
75D12l2l4j5pqPL8N0L4Rrj5rJ3K6J8MPPk1n3m2J3N1M0J0lqj8k2nJ8K1J3J0QNOJ6J6lj8j4%
70E16NJ0J4Nk2k9lK5J8lJK3K4lk2k4k3j7PK7Mm0l9J0M1J3k6k5JJ2RJ3J0k0m5k9J2K9J9J5J8
65E11Pj1oJ8K2nk5j0K3K8kl8m7k3RJ6JNM3P1M1j8l9lK9J4j7k9k6k9k3J0L4J0l7m3KL8K6ln
$$ plain form
99 531 583 608 594 562 549 558 554 509 447 427 465 522 553 555 538 501 455 436 459 487 483 465 482 525 540 510 490 518 566 581 552 516 508 529 552 542 488 422
95 422 391 407 441 462 471 471 450 404 362 354 370 381 384 396 427 464 492 503 503 504 511 509 473 419 397 433 492 520 508 486 467 445 426 432 462 486 492 497 513 526 524 503
90 503 464 416 390 418 476 502 471 427 416 429 430 429 455 502 531 526 514 509 495 468 461 503 566 598 579 536 499 476 458 442 429 426 432 442 447 451 472 515 552 540
85 540 482 429 433 484 526 527 510 514 540 552 533 511 519 549 564 552 543 567 608 625 598 554 526 515 495 454 416 410 433 451 439 415 415 448 489 514 526 540 551
80 551 548 535 531 545 560 547 504 457 442 469 514 534 511 472 455 468 487 490 474 451 432 431 454 483 499 509 543 600 639 621 556 478 405 349 331 360 403 412
75 412 380 346 331 324 316 323 361 411 445 454 445 430 421 434 460 478 482 489 496 475 422 380 393 444 484 494 491 483 465 443 438 456 477 490 500 508 513 519 535 551 548 530 516 516
70 516 521 531 545 550 528 499 496 521 539 536 537 560 584 581 559 535 512 495 502 529 533 493 454 464 505 518 492 467 468 480 489 502 512 492 447 418 430 459 478 493 511
65 511 518 507 501 519 541 536 511 501 524 552 550 512 465 442 451 467 468 473 516 587 628 610 571 568 597 611 594 565 539 510 487 497 531 541 504 461 463 501 527 524 519
60E19J3Nk5m3j9J6K9J9J0RNrk0j7oMPNkj2j1KRNNK3M1K8j7n9o0k9jnk7k7J6O4O5K5ooj1l8
55D74m6mM0L2LK0O5N8j2n9l3J1J2r%J7j0o5q5m6J6N3N4K4j0j7KJ6KnJ4K0k3o9m7L0P1M4mk2
50E12j6lK2L6J1m1n9k4RNJL3O2L5j5k2J4K8j3n7n1lL7M3L6L4L5J9j6l3qK4J4k8l6J6O6N6O
45G29k0j1nk1l2j7J%j1nK3N0M5J3j5nK1L0J0MK9N0K5k6n7m5j6J5L2K1j3k2K4Q6R8O3M8Q8J31
$$ plain form
60 519 532 537 512 469 450 466 495 514 524 533 538 529 509 492 486 490 497 502 500 488 477 479 488 493 498 521 562 590 573 514 454 425 424 419 392 365 381 445 510 535 529 523 512 474
55 474 428 424 464 496 499 519 584 642 630 571 538 549 561 552 552 569 559 494 409 363 379 432 486 510 500 483 485 501 503 498 512 532 509 440 393 423 494 538 534 512
50 512 496 493 515 551 562 521 462 438 447 452 453 486 548 583 568 546 560 588 575 518 467 464 501 544 580 614 649 668 652 619 611 635 649 621 585 601 667 723 729
45 729 709 698 693 672 640 623 624 624 613 608 631 681 726 739 724 719 740 770 780 784 813 863 888 862 805 760 744 759 791 812 799 777 801 887 985 1048 1096 1184 1315
$$ [...]
-1605B90
##END=	
##END=	
