##TITLE=	TlCp561aRpqvFRHAtEEq8A.74.ser
TM-VI-171 CDCl3 Sc+ Bz-pyr. hmbc

##JCAMP-DX=	6.0	$$ MestReNova 14.3.0-30573
##DATA TYPE=	LINK
##BLOCK_ID=	1
##BLOCKS=	2    
##ORIGIN=	Mestrelab Research S.L.
##OWNER=	hrzepa
##$MNOVA/LINK_BLOCK_TYPE=	ITEM	$$ NMR Spectrum
##$MNOVA/ITEM/POLYGON=	(XY..XY)
5321,5835
8722,5835
8722,8208
5321,8208
5321,5835
##$MNOVA/ITEM/Z=	0
##$MNOVA/ITEM/ANGLE=	0
##TITLE=	TlCp561aRpqvFRHAtEEq8A.74.ser
##JCAMP-DX=	6.0	$$ MestReNova 14.3.0-30573
##BLOCK_ID=	2
##DATA TYPE=	MNOVA NMR VIEW DATA
##DATA CLASS=	MNOVA VIEW DATA
##$MNOVA/2D/THRESHOLD=	3.3912937641143798828
##$MNOVA/ITEM/ZOOM/X=	-0.47893103590269503478,	14.508270000071124883
##$MNOVA/ITEM/ZOOM/Y=	-9.5608721214139968936,	250.07129999451962021
##END=	
##TITLE=	TlCp561aRpqvFRHAtEEq8A.74.ser
##JCAMP-DX=	6.0	$$ MestReNova 14.3.0-30573
##BLOCK_ID=	3
##DATA TYPE=	nD NMR SPECTRUM
##DATA CLASS=	NTUPLES
##NUMDIM=	2
##ORIGIN=	Bruker BioSpin GmbH
##OWNER=	nmr
##.OBSERVE FREQUENCY=	400.20280139999999847
##.OBSERVE NUCLEUS=	^1H
##.SOLVENT NAME=	CDCl3
##.PULSE SEQUENCE=	hmbcgplpndqf
##LONGDATE=	2021/11/19 00:26:25.000
##.ACQUISITIONMODE=	SIMULTANEOUS (DQD)
##$ORIGINAL FORMAT=	Bruker XWIN-NMR
##$MNOVA/SCALES_VERSION=	9
##$PARAMETER FILE=	(acqu2s, ASCII, /private/var/folders/f6/rjf_tdyn2v98c5c0wvkgn4s80000gn/T/TlCp561aRpqvFRHAtEEq8A/74/acqu2s, 0)
$$ ##TITLE= Parameter file, TOPSPIN		Version 3.2
$$ ##JCAMPDX= 5.0
$$ ##DATATYPE= Parameter Values
$$ ##NPOINTS= 129	$$ modification sequence number
$$ ##ORIGIN= Bruker BioSpin GmbH
$$ ##OWNER= nmr
$$ $$ 2021-11-19 00:46:02.254 +0000  nmr@CZC2439F63
$$ $$ /opt/topspin/data/agmb/nmr/Nov18-2021/74/acqu2s
$$ $$ process /opt/topspin3.2/prog/mod/go
$$ ##$ACQT0= 0
$$ ##$BF1= 100.63037
$$ ##$FnMODE= 1
$$ ##$NUC1= <13C>
$$ ##$NusJSP= 0
$$ ##$NusT2= 1
$$ ##$NusTD= 128
$$ ##$O1= 12075.7644147886
$$ ##$SFO1= 100.642445764415
$$ ##$SW= 260.109045168497
$$ ##$SW_h= 26178.0104712042
$$ ##$TD= 128
$$ ##END=
$$ 
##$PARAMETER FILE=	(acqus, ASCII, /private/var/folders/f6/rjf_tdyn2v98c5c0wvkgn4s80000gn/T/TlCp561aRpqvFRHAtEEq8A/74/acqus, 0)
$$ ##TITLE= Parameter file, TOPSPIN		Version 3.2
$$ ##JCAMPDX= 5.0
$$ ##DATATYPE= Parameter Values
$$ ##NPOINTS= 12	$$ modification sequence number
$$ ##ORIGIN= Bruker BioSpin GmbH
$$ ##OWNER= nmr
$$ $$ 2021-11-19 00:46:05.717 +0000  nmr@CZC2439F63
$$ $$ /opt/topspin/data/agmb/nmr/Nov18-2021/74/acqus
$$ $$ process /opt/topspin3.2/prog/mod/shimcntl
$$ ##$ACQT0= 1000000
$$ ##$AMP= (0..31)
$$ 100 100 100 100 100 100 100 100 100 100 100 100 100 100 100 100 100 100
$$ 100 100 100 100 100 100 100 100 100 100 100 100 100 100
$$ ##$AMPCOIL= (0..19)
$$ 0 0 0 0 0 0 0 0 0 0 0 0 0 0 0 0 0 0 0 0
$$ ##$ANAVPT= -1
$$ ##$AQSEQ= 0
$$ ##$AQ_mod= 3
$$ ##$AUNM= <au_zg>
$$ ##$AUTOPOS= <49 >
$$ ##$BF1= 400.2
$$ ##$BF2= 100.63037
$$ ##$BF3= 400.2
$$ ##$BF4= 400.2
$$ ##$BF5= 400.2
$$ ##$BF6= 400.2
$$ ##$BF7= 400.2
$$ ##$BF8= 400.2
$$ ##$BYTORDA= 0
$$ ##$CAGPARS= (0..11)
$$ 0 0 0 0 0 0 0 0 0 0 0 0
$$ ##$CFDGTYP= 0
$$ ##$CFRGTYP= 9
$$ ##$CHEMSTR= <none>
$$ [...]
$$ 0 0 0 0
$$ ##$ShimPowMaxUC= (0..63)
$$ 130000 130000 130000 130000 130000 130000 130000 130000 130000 130000 130000
$$ 130000 130000 130000 130000 130000 130000 130000 130000 130000 0 0 0 0
$$ 0 0 0 0 0 0 0 0 0 0 0 0 0 0 0 0 0 0 0 0 0 0 0 0 0 0 0 0 0 0 0 0 0 0 0 0
$$ 0 0 0 0
$$ ##$ShimPowMaxUG= (0..63)
$$ 524287 524287 524287 524287 524287 524287 524287 524287 524287 524287 524287
$$ 524287 524287 524287 524287 524287 524287 524287 524287 524287 0 0 0 0
$$ 0 0 0 0 0 0 0 0 0 0 0 0 0 0 0 0 0 0 0 0 0 0 0 0 0 0 0 0 0 0 0 0 0 0 0 0
$$ 0 0 0 0
$$ ##$ShimPowRcbType= 3
$$ ##$ShimPowRes= (0..63)
$$ 1e-20 1e-20 1e-20 1e-20 1e-20 1e-20 1e-20 1e-20 1e-20 1e-20 1e-20 1e-20
$$ 1e-20 1e-20 1e-20 1e-20 1e-20 1e-20 1e-20 1e-20 0 0 0 0 0 0 0 0 0 0 0 0
$$ 0 0 0 0 0 0 0 0 0 0 0 0 0 0 0 0 0 0 0 0 0 0 0 0 0 0 0 0 0 0 0 0
$$ ##$ShimPowRng0= (0..63)
$$ 1 1 1 1 1 1 1 1 1 1 1 1 1 1 1 1 1 1 1 1 0 0 0 0 0 0 0 0 0 0 0 0 0 0 0 0
$$ 0 0 0 0 0 0 0 0 0 0 0 0 0 0 0 0 0 0 0 0 0 0 0 0 0 0 0 0
$$ ##$ShimPowRng1= (0..63)
$$ 1 1 1 1 1 1 1 1 1 1 1 1 1 1 1 1 1 1 1 1 0 0 0 0 0 0 0 0 0 0 0 0 0 0 0 0
$$ 0 0 0 0 0 0 0 0 0 0 0 0 0 0 0 0 0 0 0 0 0 0 0 0 0 0 0 0
$$ ##$ShimPowRng2= (0..63)
$$ 1 1 1 1 1 1 1 1 1 1 1 1 1 1 1 1 1 1 1 1 0 0 0 0 0 0 0 0 0 0 0 0 0 0 0 0
$$ 0 0 0 0 0 0 0 0 0 0 0 0 0 0 0 0 0 0 0 0 0 0 0 0 0 0 0 0
$$ ##$ShimPowRng3= (0..63)
$$ 1 1 1 1 1 1 1 1 1 1 1 1 1 1 1 1 1 1 1 1 0 0 0 0 0 0 0 0 0 0 0 0 0 0 0 0
$$ 0 0 0 0 0 0 0 0 0 0 0 0 0 0 0 0 0 0 0 0 0 0 0 0 0 0 0 0
$$ ##$ShimSysFunc= (0..63)
$$ 1 2 3 4 5 7 9 11 15 16 8 10 12 14 6 17 13 18 19 20 0 0 0 0 0 0 0 0 0 0
$$ 0 0 0 0 0 0 0 0 0 0 0 0 0 0 0 0 0 0 0 0 0 0 0 0 0 0 0 0 0 0 0 0 0 0
$$ ##$ShimSysMatrix= 0
$$ ##$ShimSysType= 1
$$ ##$TFXNUM= 0
$$ ##$TRIPLO2= 0
$$ ##$VTU= 2
$$ ##$VTUETH= <149.236.99.20>
$$ ##$VTUTY= <no>
$$ ##$WBREFAM= (0..15)
$$ 135.5 97.7 100 100 100 100 100 100 100 100 100 100 100 100 100 100
$$ ##$WBREFLM= (0..15)
$$ 0 0 0 0 0 0 0 0 0 0 0 0 0 0 0 0
$$ ##$WBREFPH= (0..15)
$$ 72.26 -67.22 0 0 0 0 0 0 0 0 0 0 0 0 0 0
$$ ##$WBSGU= (0..15)
$$ 0 0 0 0 0 0 0 0 0 0 0 0 0 0 0 0
$$ ##$XFAC= 2
$$ ##END=
$$ 
##$DECIM=	3328
##$DSPFVS=	20
##.ACQUISITIONSCHEME=	NOT PHASESENSITIVE
##NTUPLES=	nD NMR SPECTRUM
##VAR_NAME=	FREQUENCY1,	FREQUENCY2,	SPECTRUM
##SYMBOL=	F1,	F2,	Y
##.NUCLEUS=	13C,	1H
##.OBSERVE FREQUENCY=	100.64244576441500101,	400.20280139999999847
##VAR_TYPE=	INDEPENDENT,	INDEPENDENT,	DEPENDENT
##VAR_FORM=	AFFN,	AFFN,	ASDF
##VAR_DIM=	512,	512,	262144
##UNITS=	HZ,	HZ,	ARBITRARY UNITS
##FIRST=	25164.767445380970457,	5806.2096540000038658,	0.23887321352958679199
##LAST=	-962.11409912165936476,	-191.66820056731904742,	0.56717836856842041016
##MIN=	-962.11409912165936476,	-191.66820056731904742,	0.0011014350457116961479
##MAX=	25164.767445380970457,	5806.2096540000038658,	21.799041748046875
##FACTOR=	1,	1,	0.0032808781209559519446
##PAGE=	F1=25164.8
##FIRST=	25164.767445380970457,	5806.2096540000038658,	0.23887321352958679199
##DATA TABLE=	(F2++(Y..Y)), PROFILE
$$ [...]
##PAGE=	F1=9314.8
##FIRST=	25164.767445380970457,	5806.2096540000038658,	0.28185668587684631348
##DATA TABLE=	(F2++(Y..Y)), PROFILE
454A62n0N5o5l1L9K2Q1r0p4J2L4L8q9N5K7j03j4K5R2R3p2J22m1m5J0r1o2P9qM5K5j09qO2r7
43B9M5L3M9lj03O0J13j00j13M2KN4j6K3L9K3N9l9j08l9
$$ y = [162, 112, 167, 102, 71, 110, 132, 213, 123, 49, 61, 95, 133, 44, 99, 126, 23, 9, 34, 126, 219, 147, 269, 228, 183, 193, 102, 40, 119, 111, 156, 181, 72, 64, 126, 29, 74, 107, 156, 153, 50, 110, 223, 123, 10, 52, 54, 108, 92, 115, 154, 177, 236, 197, 89, 50]
-192E0
##PAGE=	F1=9212.54
##FIRST=	25164.767445380970457,	5806.2096540000038658,	0.1560058295726776123
##DATA TABLE=	(F2++(Y..Y)), PROFILE
5806A13n1J3k5J21M8k3j03l6Q2NJ0Q0n8j24N5k2P0Q5K0j31o4M1ll5K3O8j44Q5j5k7J95j15
5431A38Rp9K3J06o3L9O5M8j23q6J1J04L2J46j46p1p1n6NJ25p9j4J80O6j04l1j43k1J93J47
5078C50k28R5q2J2O6k3j76KJ53O0j21L5k0mP8n8k9L5M0j37j5L7Q5m7n5O0Rl1p5N0J75q1p5
4691H5Q0j45P0J0k7Pk1OPQ9j17J71q1k7Q0M2j81K75k02J28q4j20K5oJ21O0q9N0r5N7N7k6j01
4304I8Q4R8j08o2Jr2N3J13j1Nj01L8j0J8P5nq3r5R6l2M1J5J0L9j53K08j22rQR6P3j9r6j15
3905E6J54Pq5j0r2J9N2L2j3M5o3R5j9j10K23j43j20M3R1M0j37M1M1N9P9j83M2k1o5R7R9oj4
3517B34j23j04K12P2k54J12q0K7q6K14m0j34N3Q7o7o3P1p1J16J6q6nL5k1L8j8p0J06j02M0
3165A09l4mJ40j6j54Q3Oo9J36k9p6N9R2j42J31j75J21Ll7o7O2m3Q6m7O9J09qk38O3NJ0nk9
$$ y = [113, 62, 75, 50, 171, 219, 196, 93, 57, 139, 144, 154, 234, 176, 52, 107, 85, 155, 240, 260, 129, 65, 106, 103, 68, 91, 159, 15, 100, 85, 58, 253, 138, 147, 68, 91, 197, 134, 173, 238, 286, 163, 77, 88, 192, 224, 370, 224, 153, 82, 26, 31, 156, 77, 63, 243, 309, 205, 174, 31, 10, 203, 350, 122, 217, 135, 147, 213, 190, 14, 16, 169, 229, 108, 143, 123, 119, 197, 139, 110, 145, 185, 48, 33, 70, 155, 108, 53, 113, 122, 91, 16, 66, 241, 160, 85, 165, 20, 90, 100, 73, 80, 59, 65, 72, 161, 44, 215, 134, 107, 187, 229, 48, 323, 121, 249, 165, 45, 70, 64, 185, 245, 156, 206, 111, 168, 225, 199, 98, 182, 280, 172, 110, 111, 19, 72, 185, 174, 179, 78, 116, 106, 124, 199, 194, 111, 16, 112, 80, 121, 136, 146, 185, 32, 240, 118, 109, 117, 213, 286, 267, 171, 56, 210, 217, 132, 122, 30, 49, 101, 133, 120, 165, 102, 197, 178, 68, 291, 148, 28, 71, 162, 202, 65, 106, 147, 206, 285, 102, 144, 123, 58, 155, 254, 248, 234, 111, 7, 219, 291, 37, 149, 69, 96, 10, 224, 184, 50, 103, 190, 123, 60, 131, 60, 176, 192, 106, 101, 136, 115, 153, 135, 65, 171, 69, 109, 75, 71, 211, 195, 41, 124, 130, 61, 197, 168, 92, 151, 243, 101, 232, 57, 178, 181, 144, 77, 139, 96, 182, 135, 204, 313, 305, 67, 130, 135, 145, 140, 111]
2778A11L9o6P0Q6j03j2j0%N4p6Q6n6L8j14J23q4M5j0j5k9RJ67p3m8Jj02J68lj02MK2%J20O0
2379C00j24r9P1j07L3J24n4R2p7j1n1K29j07k1J29k7o4j83J0N6J4p4k3J36o6j4M6N5r2jN7
2015A57n2N1RoK3j01L7m5M8kM4Q8j78L5rk8J09j46nPL8K2J03n6j5L1j30M8K3K1Pr8J9J19n5
1604A13LM0k0j09K2J5L2k2Q9q1J39m5r1Pl0oJ24O0j50m9J19R9Q1q5P7K4p7j45J4o7nJ35j07
1217A04K6j0R3J2o6P8o3Nr4Q9l7o0M5l9P4jo0J05J48k61l7R1k3p5j8P9l1jO9p9J93l6n3pr9
806F1J1J88n2j06M1P0J6j7Oj24P0L3o9k6J99l9p3j0q9J76p3o9J06J47l03J97k09J25m8L3q6
442H6J4j6K9l2M6R3p1j14qP6k7j2K2Po7L0j5O4J07m5J43o6n1l9m0l3P0k1j4L6o4jM7n2m1L7
20G8Q0no8J3J00n9q4L8lK2l4kN9P7M9n5j15l3
$$ y = [111, 150, 84, 154, 240, 137, 125, 115, 115, 169, 93, 179, 123, 161, 47, 170, 86, 131, 121, 106, 77, 86, 253, 180, 132, 133, 31, 199, 196, 94, 98, 120, 120, 240, 300, 176, 77, 148, 41, 74, 198, 144, 236, 159, 148, 97, 326, 219, 198, 327, 300, 236, 53, 63, 119, 133, 59, 36, 172, 106, 92, 138, 193, 101, 100, 157, 105, 156, 165, 159, 182, 81, 118, 73, 121, 119, 163, 251, 73, 108, 99, 71, 180, 34, 29, 36, 74, 96, 199, 143, 128, 159, 29, 77, 100, 121, 128, 30, 49, 168, 113, 116, 156, 136, 27, 49, 64, 96, 74, 163, 82, 221, 176, 85, 92, 62, 56, 180, 240, 90, 41, 160, 259, 340, 255, 332, 356, 279, 134, 148, 81, 76, 211, 104, 130, 120, 213, 225, 159, 237, 174, 179, 85, 174, 137, 77, 122, 83, 157, 156, 96, 201, 349, 88, 51, 142, 119, 44, 26, 105, 74, 73, 142, 63, 256, 220, 167, 160, 61, 72, 260, 208, 102, 143, 213, 229, 212, 218, 94, 164, 197, 128, 102, 301, 262, 189, 179, 90, 266, 193, 124, 230, 377, 74, 271, 62, 187, 139, 172, 86, 100, 84, 113, 81, 127, 220, 149, 35, 27, 103, 76, 64, 86, 93, 26, 56, 41, 105, 212, 167, 310, 244, 193, 154, 114, 81, 151, 130, 116, 152, 88, 87, 134, 82, 41, 78, 158, 153, 85, 98, 198, 139, 55, 93, 90, 112, 78, 76, 135, 212, 261, 206, 91, 58]
-192E8
##PAGE=	F1=9110.28
##FIRST=	25164.767445380970457,	5806.2096540000038658,	0.37188059091567993164
##DATA TABLE=	(F2++(Y..Y)), PROFILE
5806A07k7L1r6J18J08mj24r6J66m6K0P0k4j23mL0J3J32j9j42Olj7M0l1N9j28J42q1QK32j59
5431A58jj09L9J14j9KK8P7j02j07K8M9N4J61j57r2m4p0P3J02o8p1K14O7j01n0j25l7K11J55
5078C79j96j5l7k0N2Rj15k4J50Q3j34Pj1j8K8M2r1J9M8q9n3MJ03n9L5K3l1J3q3J6J67j09n0
4691D3J02j20O3L2k8l6K0rj6J23j19J87q2k6O2J4j39K35k30J89q7p6l2MJ21K2r4L1j3M0Lr
4316A75n4QJ31o4p1m8l6J37N5o5J0j10NJ2O3Q8M0j34q7M5o1Q2J7J1P1j84K09r3o6M0N3R7J0
3928B86j33r9J41L5p3k7q5K2L5J3m5P7n9J09n2n1J95j85o4K9O8N1j42M7N6M3J29j74l2k4q8
3564CR4J39j5Jr6r9J67J27k76J11q5j8nJ77nr3LQ7q1q0O8k7O4L4q6KO1r3O5Po6R9j20J8j7
3154F5J2J66m3j34J04Oj21J46jp8R5L5j45J22j33J32m4n2p8Q5q3J04Jj8J73J8k77J07n%oj4
$$ y = [107, 80, 111, 15, 133, 241, 237, 113, 17, 183, 137, 157, 227, 203, 80, 76, 106, 119, 251, 232, 90, 96, 93, 76, 116, 85, 144, 16, 158, 77, 85, 317, 158, 157, 48, 87, 201, 182, 184, 212, 289, 187, 80, 108, 157, 211, 372, 215, 123, 79, 9, 82, 184, 116, 45, 259, 326, 225, 175, 50, 13, 224, 379, 183, 168, 131, 111, 163, 172, 57, 33, 183, 266, 132, 139, 128, 110, 138, 180, 89, 108, 156, 67, 14, 18, 121, 62, 97, 120, 89, 102, 19, 35, 202, 93, 43, 145, 25, 88, 120, 92, 56, 76, 67, 51, 174, 55, 242, 160, 134, 196, 210, 71, 306, 76, 265, 178, 102, 70, 74, 195, 217, 123, 154, 141, 181, 184, 175, 121, 129, 260, 196, 125, 77, 41, 178, 233, 168, 178, 68, 73, 85, 148, 236, 276, 142, 55, 100, 39, 121, 138, 149, 220, 36, 245, 152, 86, 126, 179, 276, 286, 153, 54, 195, 230, 157, 130, 45, 67, 102, 115, 70, 147, 88, 197, 145, 94, 289, 104, 40, 69, 137, 188, 46, 93, 149, 192, 321, 147, 115, 91, 3, 97, 236, 221, 222, 126, 27, 194, 321, 45, 156, 71, 53, 48, 225, 220, 127, 130, 217, 136, 56, 124, 97, 161, 195, 109, 111, 172, 79, 144, 151, 85, 184, 64, 82, 65, 77, 243, 200, 66, 170, 176, 55, 201, 200, 122, 217, 252, 107, 229, 96, 228, 184, 132, 54, 139, 56, 160, 161, 143, 316, 334, 57, 164, 159, 159, 153, 139]
2778A39K1r4N4J04o2m6o0R2N9j52P9J4O1r8O8j37J05J1p4J9m8K22k9q5m3r3K05k6j11N0j2
2414A33LJ48mj34j16P4m0MJ57o7N5n3M1j26K49q6p2J37Qq8j73K9K5M6o5l6J27r1K4P1L5l6
2038A79n6Lk7Q4Ll8L7q8L5k8Q%P9L2j84R8n0j9J25j84N5Kj3OJ00k2k3%j05P9L8ol3j5K6N5
1616A53k9k0L9J4j21N0j4Q5p1Q0j24J98q7o0Jn6j2J48M4j11q5J06J06Q2n4M7Pr9j19N2r8L4
1240H6J17j11L4l1O9L2r1J20m8j8j29J63m9r5J10n3J01j3r4N5J12k02KJ02n2r6M0Qk3P6P6
876A98j30J88l8j6j3j43K3K14n3j23K8N8M4j1l0p5J7J3LmJ84p5q4J7j00J96j00p2P9J63k52
513A06J84k39J14j4M1j13m7J02K2r3O2R7k9j04p4Q8n9M0Rj4k8O5l3J0J11jJ25q1o4n6j4L0
137A43J4l0j2L4m8K4P2m9p9j3Q2mlpM5k6l0L0k0j4m1l9O8J17L3n5j00l2
$$ y = [139, 160, 66, 120, 224, 162, 116, 56, 148, 207, 55, 134, 148, 209, 111, 179, 42, 147, 158, 84, 103, 55, 277, 248, 163, 120, 27, 232, 206, 95, 145, 133, 136, 284, 280, 146, 30, 104, 64, 68, 225, 158, 213, 160, 201, 75, 324, 238, 166, 303, 311, 223, 50, 79, 104, 150, 85, 49, 176, 85, 109, 180, 215, 179, 123, 126, 99, 183, 186, 148, 185, 97, 132, 104, 112, 112, 191, 223, 39, 137, 87, 68, 193, 9, 64, 66, 53, 59, 159, 137, 114, 114, 9, 88, 126, 120, 87, 72, 98, 153, 124, 104, 143, 157, 36, 86, 72, 157, 86, 166, 42, 240, 153, 93, 94, 38, 26, 174, 218, 107, 22, 128, 234, 316, 262, 309, 316, 217, 98, 150, 52, 86, 203, 92, 126, 95, 164, 196, 105, 225, 177, 159, 30, 193, 144, 49, 159, 106, 207, 194, 100, 155, 267, 65, 67, 169, 117, 21, 61, 69, 46, 122, 198, 68, 256, 218, 202, 189, 46, 69, 283, 230, 107, 135, 193, 237, 226, 196, 121, 138, 151, 154, 150, 334, 259, 175, 192, 92, 288, 188, 116, 195, 358, 106, 290, 51, 165, 151, 192, 79, 32, 134, 156, 63, 125, 222, 193, 89, 15, 103, 44, 84, 93, 79, 51, 116, 83, 93, 204, 203, 328, 247, 183, 127, 113, 143, 157, 127, 115, 149, 101, 125, 197, 148, 69, 56, 138, 134, 131, 124, 169, 143, 113, 143, 123, 109, 68, 29, 97, 214, 247, 192, 92, 60]
-192F0
##PAGE=	F1=9008.03
##FIRST=	25164.767445380970457,	5806.2096540000038658,	0.51281660795211791992
##DATA TABLE=	(F2++(Y..Y)), PROFILE
5806I5j2P1j15O6J46kj25j02K04r1K7N2Jj12k3R2r5J89m8j40M5l6l1R8p4M7r5J58q2oK56j80
5431A78k3j06L9J09Rk3%R4q2j21N7KN4J46j29j10Qn3R0Q3n4o5J77O0j15n9n2r6K04J43j52
5067B13r3K8m0kK2m9k3J19J04j39rKj6k1R4j12lM2l8p3Q0j0l8J15k7n6P1j19JJ68o5n1L0l7
4668F8K7O4m7o9O3l0l5J42j23J82o5j0M2j4j27J81k21K36o7l8q0kJ22Oj17OP1L1n1pQm0J28
4280B34l1m8j23N8J87Pj32J0j00n0M1Q7J03Q4j76n5Mk7M0K3PR9j64J72q8r4N6QJ15L2j48n5
3905G6R7O4q5m8j0LNJ1p7Q9n2J03q2J6J35k01N3m7P7M4j29N3N8LJ71j31j30jk4J0J62k1J1
3517B03o2r7J13J69k71P9m7o4P2J37J2n4l6O9p5p6M9J5qM6q6K4R1j22N3Qn9J01j38L1%%J72
3130B49p4o7P8K4j46J29L0l6Q8n2j35J18o1J16p3n5j04J17r9R9J5j07K44M2l08J63jm2J5r
$$ y = [95, 83, 154, 39, 105, 251, 249, 124, 22, 226, 135, 162, 214, 215, 103, 80, 172, 77, 266, 218, 78, 123, 87, 56, 154, 80, 127, 32, 190, 108, 102, 358, 178, 155, 49, 88, 197, 206, 183, 183, 277, 195, 74, 131, 133, 187, 333, 204, 94, 102, 49, 139, 222, 168, 103, 280, 340, 225, 166, 114, 18, 222, 365, 213, 120, 148, 108, 106, 128, 79, 56, 175, 279, 140, 131, 133, 117, 96, 190, 78, 75, 117, 79, 6, 86, 76, 38, 153, 126, 70, 141, 22, 23, 191, 126, 75, 105, 68, 95, 159, 112, 43, 106, 76, 41, 183, 60, 242, 177, 167, 209, 195, 68, 249, 28, 264, 197, 159, 79, 77, 199, 205, 88, 94, 165, 196, 145, 138, 146, 106, 234, 203, 155, 32, 90, 277, 284, 152, 162, 62, 12, 53, 140, 243, 327, 151, 96, 100, 73, 113, 136, 143, 242, 78, 250, 162, 68, 124, 132, 247, 279, 131, 76, 173, 237, 152, 104, 94, 97, 102, 113, 36, 125, 73, 176, 94, 110, 245, 44, 97, 50, 127, 171, 42, 95, 153, 156, 327, 196, 66, 65, 41, 51, 213, 192, 203, 141, 44, 157, 326, 55, 134, 87, 23, 95, 232, 244, 190, 154, 223, 148, 72, 121, 136, 128, 174, 88, 112, 203, 81, 134, 142, 83, 184, 46, 77, 77, 77, 249, 175, 108, 186, 210, 64, 193, 223, 187, 275, 223, 88, 206, 145, 261, 188, 133, 29, 146, 47, 146, 161, 54, 298, 340, 32, 195, 194, 152, 167, 158]
2778A58j1p3K7J12n1o5q8J59P2j51L0N1O4p6Lj41J39Lj02O8r9K59kj01q1p5K15l8j11P6l0
2414A41K4J50p8j27n9L9pl2J88p5Kk0R2j57K24n4j21J27M9j00j61O6k0O7m2%M1q8M8R2QK5
2038B42j06n0PJ03k0l5M7q3L2ol5RR2k4p6P0p8n0J30j39O0jq3N0N7J3l8k3n6P0O1J2p8M8L6
1628A58l2Kk4MO1p5K9m5J05q4N1j35K41r9o1L0m6p5J56Rn2n6L0J15O2k4J7j1j14p2Q0j08N7
1240I4Q9j10P4o1K0K3o2J37m1k8o0J31m9j18J52n6J00j8j28J9P9j25K9R9o9q3N7n4lJ49O4
876B51j79J76n4L5j5j66J3K19m4j25J5L9P3k2o6j7k4j5Q4K9J46j12j02N9j04J92j03o7L4J75
524C25j82J55k21M5N6L0j02l0J21j3j29O1J05J9r7j25P4o9O8K1k8pQ8n5k2J05K4J04q6p8m2
160A15j3R4o4l5N5Pn2O5J10r2p6o4M9lQ5j1k7lK2J3k6m8m1k9J4J44Pl9o4k9
$$ y = [158, 147, 74, 101, 213, 162, 97, 9, 168, 240, 89, 119, 170, 234, 158, 161, 20, 159, 162, 60, 128, 29, 288, 286, 185, 104, 29, 244, 206, 95, 171, 141, 165, 315, 237, 110, 51, 90, 83, 51, 239, 164, 166, 146, 238, 81, 305, 251, 130, 257, 306, 206, 45, 111, 91, 158, 116, 116, 157, 69, 117, 209, 217, 242, 136, 86, 93, 196, 176, 141, 188, 105, 137, 131, 96, 105, 197, 173, 97, 167, 89, 39, 169, 30, 90, 89, 6, 56, 113, 126, 88, 65, 9, 79, 140, 152, 74, 122, 158, 126, 128, 104, 108, 169, 94, 123, 78, 183, 99, 150, 15, 256, 157, 96, 126, 80, 5, 161, 170, 118, 62, 92, 207, 269, 245, 262, 251, 137, 65, 145, 37, 94, 183, 73, 147, 86, 106, 129, 67, 204, 163, 135, 75, 206, 157, 39, 191, 135, 235, 217, 89, 108, 187, 62, 91, 190, 121, 38, 95, 41, 38, 187, 251, 72, 248, 194, 229, 214, 48, 61, 280, 236, 111, 126, 165, 238, 216, 150, 133, 109, 94, 178, 207, 353, 241, 139, 198, 94, 286, 183, 116, 150, 325, 143, 298, 77, 122, 178, 208, 106, 76, 197, 184, 55, 116, 221, 240, 143, 18, 92, 23, 91, 112, 84, 77, 165, 110, 88, 193, 217, 321, 235, 157, 115, 102, 196, 132, 97, 152, 159, 107, 172, 282, 190, 114, 50, 99, 96, 181, 170, 143, 140, 162, 175, 149, 101, 60, 31, 45, 189, 196, 157, 93, 64]
-192F4
##PAGE=	F1=8905.77
##FIRST=	25164.767445380970457,	5806.2096540000038658,	0.39852529764175415039
##DATA TABLE=	(F2++(Y..Y)), PROFILE
5806H0oJ14j08J7J50k1j06o5K05j24J8L9J6r6QJ22k00K43o8r1K4p8oJ09r9L8q3J57l6m3K61
5442C71j76n5p7K3R2K0l6OQ2o1j23O9qL4R0p0j12O3k8R0P1n5m1J29M5j35n7Qj47J80J20j05
5067B07j24R0l1q5J8Nk8P6J36j30j0M%m1R0r6k8L4qp5J35q5N1J07q3o9J34j72K9J59j5p6o5
4679E4N5MP8o8n0O4m6m9J44j23J60l7PL1l2j39J13j49K36l2k4r7k8J25Mj19m5J46K4q5k6O3
4304A59n5R5prj38R2K16k6j93Oo1j3k1O0J14J20j95rm9M3l4K8QJ17j47J54j10q8N3k8J17M7
3928B46j32jL3Q8j10o5R6qm8K5p3N0m0P7r3O6N4j16J01r9R0K2j08N7M6n4J95o5k13O1j1n8
3553A3J72k2J5k1j06O3J91k37K3J7j06J43J05%l0n4M8n4o0J2N8r0N0p8N1J12j06J4j4m8J10
3189A71j40P5j6k0J66j10J4K0O1j38R0N7K9O1j57j06J09K5Q5j03l4r4J38o4J8J6j15K31N1
$$ y = [80, 74, 188, 80, 97, 247, 226, 120, 55, 260, 136, 154, 193, 209, 113, 121, 243, 43, 286, 218, 127, 151, 73, 67, 176, 77, 115, 32, 189, 153, 110, 371, 195, 140, 63, 86, 178, 198, 162, 168, 250, 189, 66, 135, 127, 161, 251, 181, 69, 132, 104, 194, 265, 210, 169, 298, 343, 208, 151, 159, 12, 192, 312, 207, 83, 173, 142, 57, 75, 80, 52, 128, 264, 134, 124, 128, 128, 87, 177, 81, 53, 87, 79, 4, 139, 54, 105, 212, 129, 60, 194, 22, 51, 210, 195, 119, 54, 109, 113, 191, 123, 73, 137, 91, 42, 186, 63, 223, 186, 193, 224, 192, 53, 166, 17, 253, 221, 197, 100, 72, 197, 201, 82, 37, 183, 207, 122, 96, 159, 104, 199, 192, 183, 45, 137, 353, 327, 134, 140, 79, 66, 45, 105, 219, 339, 144, 135, 86, 129, 95, 123, 131, 248, 101, 255, 145, 57, 110, 82, 199, 246, 114, 113, 146, 234, 124, 59, 155, 147, 99, 124, 51, 101, 61, 138, 45, 111, 165, 49, 150, 51, 141, 163, 55, 112, 158, 104, 299, 234, 21, 82, 71, 13, 185, 163, 178, 157, 51, 114, 305, 68, 91, 108, 2, 145, 250, 250, 220, 166, 214, 160, 100, 112, 170, 80, 130, 52, 103, 215, 109, 123, 109, 61, 171, 31, 106, 90, 70, 236, 126, 140, 160, 221, 83, 173, 230, 259, 320, 163, 57, 166, 191, 276, 173, 139, 45, 183, 119, 137, 153, 38, 269, 320]
2848C20l17K15%r8N6j0o0j7QJ00o8n9n1J44J02j15k9O7M8n0o5o0R8k2q7J02j17K39Pq8j04
2484H9n3J98l9j11R1k9N6J24j42j05RJ6j1n7K00p2o2J9J25j29J53j7j55J00Q9r8j32P4m7P3
2132A57k3L4m0n3O1Q1j8Q0j40p5J3J21n5kN1r2K3J6o3K3Q0o9N5K1p8j02J15q9P3Nm8J5kN1
1733A26p6K9n0K6Q4N6r7N4N5j13L2J7q6J18l5po0R3o7J8o9K05p2q8P2n3q6J17l9K0Jo4J36
1346A97J6rnj4q3k0N0p5L2Q1j16J22n4o6k3K1J18k7k7J9Q2n3j27J74n6Q4j3j49qO0n3K9R5
959B02p2n7N3r6L2J63O4k24J73q1Q3oj71k0K07k8j06MJ3R4l2r7L4m1l2J35O4R5j41j19J08
595B01j08J67q1n5j5J75j06J16j78m1J37qo3j7J07m1j33M1J17O1j01j64O1n7P4M5l7jJ00p3
243A23k7Q1K1R5q3q9j5j1J37j49k7J32k5n3J02J34j47m7q9j7J4J73j4r3RO3j8j3p1l9J6n8
$$ y = [320, 3, 218, 218, 120, 176, 166, 106, 89, 97, 197, 129, 70, 19, 163, 265, 150, 121, 188, 236, 186, 121, 61, 159, 137, 50, 152, 35, 274, 281, 193, 89, 36, 234, 195, 84, 175, 146, 202, 326, 184, 79, 88, 104, 93, 36, 236, 164, 102, 121, 246, 117, 270, 253, 98, 198, 287, 189, 57, 131, 84, 157, 134, 168, 128, 75, 136, 217, 199, 279, 139, 64, 77, 198, 143, 141, 192, 100, 123, 139, 76, 99, 179, 110, 165, 186, 108, 6, 121, 32, 105, 110, 62, 77, 75, 126, 50, 79, 29, 55, 139, 195, 98, 152, 207, 94, 126, 143, 57, 175, 140, 133, 73, 166, 99, 117, 48, 253, 181, 93, 165, 112, 26, 143, 104, 124, 125, 61, 197, 213, 204, 199, 185, 102, 82, 132, 57, 89, 170, 54, 176, 122, 56, 33, 54, 172, 145, 118, 137, 219, 166, 39, 213, 157, 241, 228, 79, 71, 131, 78, 107, 202, 130, 73, 126, 30, 62, 225, 289, 65, 238, 157, 240, 234, 63, 43, 250, 222, 116, 120, 133, 227, 195, 98, 132, 91, 59, 194, 258, 353, 212, 93, 201, 93, 260, 179, 124, 109, 284, 178, 294, 116, 75, 212, 204, 141, 124, 231, 190, 57, 98, 215, 276, 175, 11, 72, 15, 89, 134, 97, 96, 196, 123, 96, 177, 198, 293, 210, 121, 106, 95, 232, 83, 56, 188, 163, 110, 212, 346, 199, 152, 63, 46, 60, 233, 219, 126, 135, 198, 180, 167, 96, 57, 73, 15]
-133A5J44l5j6j2k2
$$ y = [15, 159, 124, 108, 96, 74]
-192G4
##PAGE=	F1=8803.51
##FIRST=	25164.767445380970457,	5806.2096540000038658,	0.21065251529216766357
##DATA TABLE=	(F2++(Y..Y)), PROFILE
5806F8pJ48r2j4J27n9p1k1J98j37rL1K3q2O0J35k61K69q6k7nj41M8Q4j11M7o4J13L2p2K32
5442C56j57p9m1QO4Ql5N7L2m0j12N4RJ9j0K2r5Q8J0P8O3o4j5Q8K1j45n3M8j49J08J07p2j11
5055F2J30j9j41J6K1l8K8J63j01Mj0J7l3N3n7n3L3rm1J43o4R2P4j39p9J90j90J7J59J6r6j44
4679DJ33nP2q2j1N3o1n1J31j12J24LJ1K9l5j35Lj8J90Ll9q2n8J21jo9p6J59J0r1o4R8n5O4
4280A63MK8j09Q6K25m7k28Ok1J8m4k8J17J46j85L2j02J13j11L9K0J16j28J46j48n7L2l1Q7
3940A39N3q8M7k6R7j32k5J48Jj18M8n8j0k5M1n5N6k7O1O3r5P6Jr3N9K8j08J84J1j91M9k0o9
3553B2J25j3J8J9j25K5J94j80m5Q1q9J59Q1l9k2n0L9l1m7l6J05j61M5n1O2J16p3k3m4l6J24
3189A50r6R0m9l4J53j36P0n5J13j01M4O9R7L3k60m3P0J10M5j38J2n8J59m8o6J9l9J24M6k53
$$ y = [68, 61, 209, 117, 103, 230, 171, 100, 79, 277, 140, 131, 162, 185, 103, 163, 298, 37, 306, 220, 193, 188, 47, 95, 179, 68, 115, 51, 164, 196, 124, 356, 199, 120, 79, 87, 151, 159, 124, 181, 213, 173, 61, 115, 124, 143, 133, 155, 60, 148, 158, 236, 299, 235, 220, 308, 329, 184, 131, 179, 30, 138, 245, 173, 62, 192, 173, 32, 48, 69, 31, 59, 222, 121, 125, 115, 132, 99, 152, 95, 42, 75, 66, 25, 168, 104, 196, 270, 131, 52, 242, 52, 69, 228, 244, 148, 4, 137, 132, 204, 122, 111, 164, 103, 52, 183, 71, 195, 198, 209, 238, 203, 68, 71, 53, 243, 246, 207, 125, 67, 188, 187, 118, 42, 201, 211, 120, 56, 154, 99, 163, 167, 195, 86, 172, 397, 350, 122, 128, 107, 125, 81, 53, 170, 316, 131, 163, 61, 174, 63, 102, 122, 238, 110, 256, 108, 51, 83, 52, 139, 192, 104, 151, 125, 222, 90, 65, 213, 214, 96, 144, 86, 76, 51, 92, 37, 93, 66, 127, 190, 95, 171, 172, 79, 138, 166, 58, 242, 253, 62, 111, 91, 22, 147, 134, 152, 171, 46, 71, 265, 85, 40, 121, 32, 191, 272, 233, 211, 161, 200, 169, 122, 86, 191, 30, 75, 24, 86, 202, 129, 106, 62, 26, 150, 54, 144, 95, 61, 214, 78, 148, 93, 206, 105, 149, 218, 315, 348, 88, 45, 115, 225, 270, 132, 144, 86, 245, 197, 131, 150, 111, 235, 281, 28]
2837B8J97qj48J09j1j25N6RO6j07j8l5J24J45p2j01R5J5k0j27L1M3n5j8R9j07J66Jm7j10j7
2473E8J46l0j16R7LQ2P4j77p4N3Nk9n2J80n8j29N9J26p1P6J4j61O0J24q1q3L6m7N9j1N9r2
2097A00j7Q8L4m0J23j55m5m5J46q5M1M9j09QK9o9L7N6p5J47l4m2r5M4p1R3K1jm1l5Q1j32J26
1710A32q1k7J02J07j08L1P9j72O0P8j84J62j5n2n9O0k0jk1J45k4j06J03p6p3Q4q8R9N2j45
1358D2J72m0k6qJ4K0m7k4j9k2J08j27J56k2j23J9%N7%k0P2M9o4j24J82n2N7Mj46l4N5j4J6
970A11R2n5m1M8j35O6J38Q5k67J85j07J13J5j67o5J88j4o6kj8R9l2p1K7k9MR9R3L6j54j00
606G6J26j16J31m4m2m1J50l9P5j33p7J74o8nl0Q3m7j06QJ29Q7j16j56K7LL7O5m4jR8p6j6M2
219A54kJ01p2r8J1QJ54k16K7J37m8m8J21J35j87Lq8p9Q0J90j9j40J2Q2o2K0p6m3M9m8R6r4
$$ y = [28, 225, 217, 69, 178, 167, 42, 98, 107, 173, 66, 48, 13, 137, 282, 210, 109, 204, 219, 199, 72, 103, 146, 91, 73, 172, 65, 231, 232, 185, 75, 58, 204, 174, 58, 155, 158, 240, 314, 137, 63, 116, 121, 92, 40, 220, 162, 33, 92, 218, 147, 223, 237, 76, 136, 260, 179, 96, 132, 85, 144, 133, 192, 100, 83, 171, 205, 165, 288, 133, 88, 43, 189, 104, 145, 194, 85, 93, 122, 53, 90, 146, 71, 218, 184, 142, 47, 91, 20, 113, 134, 133, 92, 57, 138, 6, 132, 51, 24, 126, 233, 125, 156, 235, 63, 123, 201, 17, 179, 164, 112, 53, 113, 93, 92, 71, 216, 192, 86, 189, 113, 40, 124, 36, 135, 187, 42, 214, 174, 148, 140, 154, 174, 127, 103, 84, 62, 170, 43, 199, 177, 54, 73, 73, 130, 130, 110, 182, 231, 167, 43, 225, 173, 230, 234, 88, 54, 109, 95, 111, 203, 148, 107, 155, 20, 86, 224, 309, 42, 227, 120, 233, 248, 81, 16, 204, 190, 124, 122, 104, 203, 171, 100, 127, 98, 102, 201, 294, 330, 176, 76, 202, 86, 217, 173, 131, 90, 240, 201, 276, 143, 66, 240, 172, 167, 137, 220, 173, 67, 75, 204, 291, 175, 19, 46, 49, 86, 151, 107, 106, 204, 128, 112, 154, 152, 253, 181, 83, 94, 102, 256, 40, 67, 204, 156, 108, 229, 364, 177, 180, 92, 13, 93, 283, 264, 124, 136, 218, 156, 176, 100, 57, 106, 58, 154, 60]
-156F0LM0j9
$$ y = [60, 63, 103, 84]
-192H4
##PAGE=	F1=8701.25
##FIRST=	25164.767445380970457,	5806.2096540000038658,	0.27331089973449707031
##DATA TABLE=	(F2++(Y..Y)), PROFILE
5806F0j1J71p4l6R3j07k3K1J81j28n4L1K4p2J12J36k77K62j01L7j3k24J09M3j09Q0k1L1Q8
5466B29p6J63j33p5%RK2l8k6J35l9j3j02K5L1K0j15J35o4M9O0O3N8p5PN3nj35o0P3j04J6J18
5078B06p3q1J47j4j45K6mk3O2N7n7L6l5K2j2J6j6p4L4k8J0J20mJ15L6j90q9K28j75k5J50L9
4703B59j02j03R5pN1q7L0M7p4l8J01r0Q7M9jL0l0j06r4O3J61L4q0n1p4J06k2Rp6J36j4p9r8
4316C2J01n0N6nM8p1Q1K14n8k25J6j1K6l6r7Q5J62j49M7j17J50j71O6L4Q7r2J27j87j3JK1
3952G2LN6l8R1n5P2j24M7J33K4j85P9n1p2j3J0J1kK0J23J4o6N1j0q5N9J1j04J13O7j40Rj7
3564A03m6L7J2L1M7j49qJ89j11r4J08n2J56O4r3k5k9N1j9l9r0J53j57pQK2J03l7n3n8J9Q7
3189A23l4Q3q2l3J40j14M6j08J53m5JO0J48K0l18K7mJ75Oj70P0j7J82n1j29J9LN0L0j79J59
$$ y = [60, 49, 220, 146, 110, 203, 96, 73, 94, 275, 147, 93, 124, 148, 76, 188, 324, 47, 309, 208, 245, 232, 8, 117, 160, 51, 131, 110, 141, 229, 153, 316, 183, 108, 108, 117, 139, 101, 75, 210, 171, 158, 56, 81, 112, 132, 17, 152, 88, 137, 197, 260, 318, 243, 250, 303, 298, 163, 103, 176, 72, 88, 206, 133, 52, 199, 185, 40, 66, 62, 39, 101, 158, 101, 137, 102, 124, 112, 128, 112, 38, 72, 44, 54, 174, 170, 285, 321, 131, 42, 270, 95, 70, 220, 259, 157, 54, 149, 142, 193, 106, 136, 183, 109, 71, 172, 82, 169, 218, 217, 247, 217, 111, 17, 80, 241, 275, 195, 144, 70, 176, 154, 163, 87, 223, 209, 130, 32, 133, 83, 139, 134, 182, 111, 192, 406, 348, 123, 139, 128, 154, 118, 21, 106, 268, 119, 166, 49, 199, 28, 94, 128, 215, 123, 250, 63, 50, 51, 72, 75, 131, 93, 184, 129, 201, 77, 124, 257, 281, 96, 175, 124, 52, 39, 49, 60, 58, 78, 201, 215, 149, 200, 190, 105, 164, 175, 71, 184, 251, 111, 120, 103, 57, 94, 106, 137, 184, 35, 27, 216, 105, 11, 119, 67, 223, 287, 194, 169, 140, 191, 172, 133, 43, 196, 39, 32, 40, 62, 165, 128, 75, 17, 36, 123, 89, 172, 90, 57, 197, 83, 129, 21, 174, 129, 130, 190, 338, 358, 40, 67, 63, 238, 244, 74, 144, 127, 309, 258, 129, 148, 151, 201, 231, 52, 211]
2825B11k2j55J39j0j26O8J7L0j31L6l5R3J77l3j87J48l3J3j70R9mq7O9P6q4O2j3J8j08L3P4
2461A65k0j22R6O3Q6J3j76n2P7mm4l2J42l5j14K3R5j4K8K4j38J4J57n7l1k7j2J6lO4r8%J23
2074B07k9n0J45j52%j16J64q2O1M3j24j0K4n2M9L9JJ29r0K5j11N6j16J09M1L0j03j7P7r9J21
1710A70r5o5J05J46j27MJ04j99Q6J25k00J29k1r4m9K8N7Qm0Q1J9r0J07j03m2O3m8R8P9j98
1358C8K08p0q4L1N2Q9j03j07M7p9J45j30J74J3j38Q5n6l1L7k2J05L2p7j07J79m4K0L9j37m9
1006F0N6j2PQ3j9m0N8j86Q9R2J27l02J97j14J12M5j55p0J33j3j3nm7Q6k1Rk6nL5L8J11k6j46
618A38l2R6j28R5ml2l7J03OL7r4n1J52j35O3m9L7k5o3j5J27R3j36r7l0O3nQ5n3jQ1o1nlk2
207I8J16n3j12K7L6J59j83L4P0n3l6J15J11j98O4o7n6R4J56k1j60KP8j11O3o3n2P0m2R3j12
$$ y = [211, 189, 34, 173, 163, 37, 105, 122, 152, 21, 57, 22, 115, 292, 259, 72, 220, 187, 200, 30, 129, 125, 38, 107, 183, 99, 161, 148, 166, 58, 91, 165, 145, 23, 119, 182, 268, 281, 105, 53, 130, 126, 82, 50, 192, 157, 43, 66, 161, 147, 175, 199, 61, 75, 232, 175, 144, 117, 105, 121, 118, 182, 84, 84, 207, 178, 128, 273, 121, 121, 5, 169, 87, 148, 191, 67, 57, 81, 29, 78, 117, 118, 247, 157, 182, 71, 127, 11, 120, 161, 191, 88, 71, 148, 49, 170, 75, 10, 115, 261, 134, 138, 242, 43, 129, 254, 54, 183, 162, 68, 19, 47, 104, 112, 72, 153, 172, 82, 189, 86, 44, 107, 59, 157, 236, 38, 246, 176, 92, 123, 175, 264, 161, 54, 101, 22, 167, 37, 211, 224, 86, 171, 115, 84, 121, 99, 204, 236, 159, 52, 231, 187, 207, 246, 109, 60, 116, 104, 111, 194, 175, 135, 193, 7, 96, 188, 315, 13, 210, 96, 208, 253, 98, 28, 161, 148, 135, 130, 83, 169, 148, 157, 131, 126, 161, 199, 310, 284, 138, 106, 202, 74, 169, 165, 133, 96, 199, 205, 242, 148, 97, 249, 114, 177, 128, 165, 140, 77, 62, 189, 282, 146, 49, 19, 82, 77, 162, 109, 108, 189, 128, 123, 120, 98, 214, 161, 49, 76, 112, 271, 88, 122, 192, 139, 103, 218, 329, 131, 195, 128, 72, 166, 322, 301, 141, 143, 221, 110, 173, 110, 58, 128, 86, 179, 67]
-156F7k4P2k2
$$ y = [67, 43, 115, 93]
-192I3
##PAGE=	F1=8599
##FIRST=	25164.767445380970457,	5806.2096540000038658,	0.29158475995063781738
##DATA TABLE=	(F2++(Y..Y)), PROFILE
5806E5j1J81o5m9P0j50K0N1J53j01j01L7J8o7J55J23k65K32j15R9Lk34Q4kp1J08K5k7R4o0
5454A90O7j09l8M4J6nj23j4K01r9K3j07K9J4L0MO2m9m0J14N1N7p7J2K8k8j01q2Q4l4j5J22
5078B27j09p1J46j6j16J9j1LJ31j13j8R1o6J3QlJ4r5L3m2N9Q2N5J34Lk29r2K33j41o6J22N7
4703B42r2m9N2j5K1q3O9M7p8j2N3o9O5Q9k1L0k6p3o0J7J40N7j30j6p4P9n8R3p4J16l7o5q8
4316E0N6l8P8l6L9k8P8J90o0j92K9k8RLq1l0J75j02L3q1J40j35M9L0L4l2Q4j97K5l4Q3o6L5
3928H0rJ33n1J8q3Q2J05N4k24J08n0j27j6J9L5n2J55P9k8l1K2j5p7N2Mo3N1N8q2m4Kj4o1M8
3529G8O9M5j61j2J59m9p0M2oJ41M5j42k8jP8j8l0j03J48j12l2K2k6Q0j5p0pN3J6J7P1r9k0
3142F3J29o9l1oO0Qk9K9J66K6k77J8m9J87k5j85J19K4J95o1j62OK6J1J4j11J03l9o1Q5qm8
$$ y = [55, 44, 225, 160, 111, 181, 31, 51, 102, 255, 154, 53, 90, 108, 41, 196, 319, 54, 286, 171, 270, 273, 39, 123, 121, 50, 158, 183, 156, 250, 190, 257, 148, 110, 154, 170, 165, 42, 28, 229, 130, 153, 46, 75, 89, 119, 123, 185, 136, 96, 210, 261, 318, 241, 253, 281, 253, 152, 70, 154, 120, 105, 227, 118, 47, 193, 177, 61, 80, 69, 72, 203, 90, 72, 163, 97, 110, 118, 115, 129, 34, 67, 25, 84, 166, 221, 355, 358, 129, 37, 270, 129, 63, 185, 242, 150, 101, 153, 138, 159, 76, 145, 192, 114, 102, 155, 86, 151, 240, 219, 249, 223, 150, 90, 107, 247, 304, 174, 158, 84, 163, 105, 198, 124, 240, 203, 138, 50, 106, 68, 146, 110, 149, 121, 199, 389, 329, 137, 166, 138, 147, 150, 69, 39, 214, 112, 145, 64, 204, 69, 118, 148, 182, 150, 234, 37, 62, 28, 111, 45, 80, 71, 204, 153, 171, 88, 170, 275, 329, 105, 213, 163, 36, 20, 39, 74, 22, 177, 256, 228, 197, 219, 204, 127, 179, 183, 120, 171, 229, 147, 103, 105, 91, 30, 78, 147, 192, 31, 19, 178, 129, 59, 101, 95, 236, 281, 139, 111, 110, 188, 170, 140, 37, 185, 73, 41, 63, 37, 117, 102, 32, 25, 78, 94, 111, 182, 83, 63, 192, 123, 92, 86, 146, 154, 125, 154, 320, 346, 69, 87, 38, 225, 200, 15, 134, 158, 353, 292, 130, 136, 162, 173, 187, 76, 179, 140, 79, 164, 156, 108]
2766A08QRL5o4Jk4M9J74pk68K21r6M8j82J22k9q8J20M6n3m4l8R9j08Q2Qk0o8L3J31P4m2j54
2379H3m4R0j3m8j4J07j3n6m8O5jK8J0r6qJ67l6J0r0N2m6%M6o7J3J38q7m0J39j32J7j03J14
1992A37m1M2M3j33rj2J6K2N3O5O7j44J15j52J18j71J17M9M0j56M4L8m7P8p9n6Q5J54j60j6
1639A07J21j87J01J46k06J04l6j25jM5O5K3j04P5Om6P6j22lN5K2P3P7k18K23o7j51R5O9J10
1287C27j53j54Q5m3Q2j14J78M3j33J26q2j16O6l1J19K9r0p5J69l2k2Q8j42m3N7l6J1O5K2m6
935A55Q3j90M2M2J78k72J45j01Q7P9j37m2O9l3L9j0n7N2rR6o7LN0j1J19q5j25L8O1j41O5L1
560A54k6j2N1J6Ro1oJ10j95J28k9n7K2k9j0J05P9j46k0p2Q7m2J13o7QM7k6j0m6kJ12k4j33
172B8K8N5J66j25J8j5l6k4Q5O9j78J24l2m1J10J09j5j47k4N4j48R3l8n7Q2n0J18j09n3Q3k8
$$ y = [108, 116, 125, 160, 96, 97, 73, 122, 296, 289, 21, 242, 146, 194, 12, 134, 105, 17, 137, 183, 130, 86, 48, 147, 39, 121, 129, 109, 41, 74, 205, 279, 237, 83, 39, 129, 116, 68, 54, 161, 148, 92, 44, 109, 108, 136, 146, 50, 42, 209, 173, 183, 93, 145, 99, 99, 145, 78, 91, 229, 142, 102, 241, 109, 126, 23, 137, 96, 138, 181, 48, 39, 27, 43, 65, 118, 183, 250, 106, 221, 69, 187, 16, 133, 182, 222, 66, 110, 148, 101, 179, 100, 44, 129, 283, 123, 107, 228, 41, 142, 288, 82, 186, 150, 25, 24, 69, 134, 157, 53, 128, 134, 88, 164, 42, 39, 94, 116, 189, 266, 48, 271, 204, 53, 148, 217, 327, 174, 20, 105, 62, 144, 30, 208, 251, 118, 244, 162, 46, 112, 81, 200, 229, 139, 64, 233, 201, 179, 267, 125, 82, 139, 103, 114, 179, 201, 155, 238, 48, 90, 132, 310, 38, 183, 82, 169, 248, 111, 69, 138, 105, 144, 134, 77, 129, 120, 216, 149, 152, 202, 191, 310, 225, 100, 138, 199, 58, 123, 154, 128, 116, 167, 183, 192, 131, 125, 235, 40, 168, 139, 82, 104, 75, 65, 170, 249, 103, 83, 11, 98, 56, 169, 102, 110, 157, 131, 121, 75, 73, 185, 161, 28, 56, 111, 277, 152, 170, 155, 119, 95, 180, 249, 71, 195, 163, 122, 232, 341, 326, 179, 155, 209, 61, 154, 116, 59, 141, 91, 209, 100, 47, 130, 102]
-192A02
##PAGE=	F1=8496.74
##FIRST=	25164.767445380970457,	5806.2096540000038658,	0.25635093450546264648
##DATA TABLE=	(F2++(Y..Y)), PROFILE
5806E6j0J82p2m6O5j06l3O7J19o3j05K5po1J82R5k29J76j27J56L8k19K9m4J0J07O1m7N7l6
5454B20l4p1kQ6J7j1j73k4K16j35P2j25P6m2K5J17J3m4j51J67M4O0o5nJ0m3n8j03Q4M1kJ11
5078B71j33r2J28j4p6JMMJ91k15l8J64r5MJ6nL3j17K7j8O5M8R1J48j8k44q9K01j00p9P6O1
4703B00o3%K0l5j2p4J06M8o2J6j1n5O9J02l5K6k5m4k7oJ18P0j65Ro8N8j03J60o4R2n3n3o0
4316G9OlJ05o4pQP4J61n2j46L1n1l3Q4p5r6J55p2J0l2J10n6K3Rk2M3J6j51L4n1J09o1k8k0
3916C7J70l4l9l2Q6P8P7k24J31m8j59m0O4J1k3K00K8m9lrj3p0L4J3k3M2j3k2j03L4J7o8%J27
3517A77J7j48J5J02mo0k7L7J19K0j70j9K2J12l0ro7P5p6l4K8n0N6k6j4oP0m5M3O3q6jJ09l7
3118A56r8O7K3L0m4j1J44M3k19kk8J29l7j20Q2O2J88o6j67k0M7pJ3o3L3n4M9K3nJ3k8k4Q7
$$ y = [56, 46, 228, 156, 110, 175, 69, 36, 103, 222, 159, 54, 79, 72, 11, 193, 288, 59, 235, 108, 264, 302, 83, 112, 68, 78, 185, 246, 199, 256, 220, 186, 115, 113, 199, 216, 205, 32, 8, 224, 89, 161, 36, 112, 70, 95, 212, 225, 181, 30, 197, 241, 301, 236, 231, 241, 198, 140, 37, 121, 162, 160, 271, 138, 46, 174, 160, 84, 85, 89, 93, 284, 69, 31, 195, 100, 104, 120, 115, 148, 31, 58, 40, 105, 153, 244, 392, 374, 130, 41, 242, 142, 63, 139, 200, 137, 137, 157, 122, 110, 36, 142, 190, 128, 144, 133, 78, 147, 249, 214, 240, 215, 171, 144, 138, 256, 326, 161, 170, 102, 160, 57, 217, 153, 245, 192, 139, 79, 85, 82, 187, 123, 116, 124, 198, 359, 307, 161, 192, 141, 108, 192, 117, 21, 176, 104, 114, 82, 192, 136, 159, 168, 146, 189, 205, 54, 88, 37, 146, 85, 57, 37, 207, 173, 134, 102, 188, 266, 343, 119, 250, 202, 43, 3, 67, 78, 55, 255, 283, 234, 231, 222, 209, 139, 173, 186, 163, 205, 192, 170, 67, 101, 118, 50, 50, 177, 194, 46, 61, 163, 159, 99, 72, 109, 228, 248, 78, 59, 81, 193, 163, 154, 87, 162, 86, 52, 80, 30, 86, 60, 46, 40, 110, 65, 108, 171, 85, 84, 193, 156, 58, 125, 148, 178, 134, 123, 267, 310, 91, 89, 61, 190, 153, 33, 115, 177, 365, 299, 132, 112, 159, 152, 165, 102, 135, 81, 130, 153, 148, 161, 133, 109, 196]
2731A96l3k2j5J9J44Kk25K07j71Q4j64R4j7n0J05J6j5p2j6P7j27J21k9m2K3m9J64O9p6j39
2379E9m1R4j9k9kP0jj3q9R9r5Q1k4m5M4J03k7L8j34J26q1k4Nk1L6J17j22mJ02j04j8n4P4L
1980A04MN7j46L3k2N2k7Q5Q8Jj91K14k07J92k20J37L2L0j83J25k0J0J3l8m3R8J27k05k7J25
1628A98j39R6J41k08R5k6r9J3O5K6L2j54J36o7rK5j02PN5O9O9N1k09K12m6j84J21Q4R6j83
1276A65o1j0L3k8o7J57O3j05J35q0j58O0m0J10K9r8k7J55k2o1J38j60j7N6p5L1L8N9n5J16
923B81j84k6NK20k19P0p8N0J16j12k2L2o0P4k1m2MmJ72p8j5N3l9J25j38r7Q2L7j44M3N9k4
548A20L5qppl5M3O0j68J13L9j50M3k3K1P1N2j14K7q0N6o5J55q7K3JK8l2q6N9Q3Mj41J2M9J78
137B69p1lq3rj5M4K1j33J61Nk8J14N9Oj06o4K0j23N1pm3P9o6J47j12o5R8l2
$$ y = [196, 163, 141, 126, 145, 289, 291, 66, 273, 102, 186, 22, 116, 99, 49, 154, 170, 155, 83, 67, 144, 17, 138, 109, 67, 90, 41, 205, 274, 198, 59, 18, 112, 93, 64, 62, 132, 131, 118, 29, 128, 33, 114, 90, 45, 89, 192, 165, 203, 69, 195, 114, 90, 95, 74, 110, 227, 105, 101, 203, 99, 81, 27, 101, 104, 108, 165, 19, 52, 30, 82, 55, 140, 228, 229, 38, 252, 45, 237, 17, 154, 186, 216, 33, 158, 138, 148, 161, 123, 80, 178, 305, 100, 73, 198, 59, 155, 296, 88, 183, 157, 58, 71, 136, 162, 194, 40, 176, 109, 100, 125, 23, 30, 85, 154, 223, 274, 65, 277, 231, 47, 168, 252, 348, 165, 104, 94, 127, 99, 32, 189, 252, 147, 282, 202, 44, 104, 64, 174, 203, 105, 78, 233, 211, 150, 288, 128, 111, 167, 92, 123, 161, 220, 165, 281, 97, 71, 76, 296, 77, 147, 69, 119, 235, 123, 101, 133, 73, 147, 126, 84, 88, 84, 256, 178, 163, 216, 177, 302, 164, 67, 149, 186, 42, 85, 144, 120, 155, 147, 140, 133, 98, 141, 201, 33, 146, 185, 35, 78, 55, 76, 147, 199, 85, 112, 32, 88, 23, 178, 91, 114, 115, 143, 111, 25, 84, 167, 171, 30, 42, 91, 269, 198, 195, 112, 103, 88, 132, 153, 20, 181, 186, 158, 272, 331, 337, 231, 167, 187, 64, 115, 108, 65, 144, 78, 225, 113, 48, 146, 114]
-192A14
##PAGE=	F1=8394.48
##FIRST=	25164.767445380970457,	5806.2096540000038658,	0.24371872842311859131
##DATA TABLE=	(F2++(Y..Y)), PROFILE
5806F7rJ68r4j2O7p4r2P9Q6k7o6Mn0j3J54N5j76R7j38K04Q0j91l0o4Q3R1Q2m7J4j3j24J9k6
5419A04J19RKj81k4J62j46J30j35J10o7k4J96j1l9j58J20L6O9l9m5Jn3k0r3O1J04J1R7j32
5067A64j08Q7Jm0QPk9K30k02j00K00j12OPLM4j29J5J7M5K8R2J50k2k26r1J46o2n4K7M6j8K9
4679A59Kn8m8m0J30L3k3L6q0m4R5P6m3K6l0k0Rj0Q8P4j68K1o9N1j04J54l7N5n9m6k7k4M7J19
4280B45q0m9J8O1J37l7j04J5n9q5J96j02r2J00p3J0j7Q6K3kj6o0J15o1r4M6o5J11m3p3k6J64
3905A89k0p4J5O9N5Q5j84J39l4j78l1O6j7K4J91j9m5J3l2ko9ML3QN1q8L7j57Q2K3j6r1J80
3517B07k1j16K7P3K2o1q1O0R1j1j68J2L0J40m5J1m4Qn8l2N1m9M4o8Q1o8R0q9M3O4l0OP2k0
3118A71r6P3M3Pm7m9Q9O0j69rJ2N4j5o8L3Q9J62n8j53n3R0l6L7l8l4p2J40k1lM6l6p4J60k6
$$ y = [67, 58, 226, 132, 120, 187, 113, 21, 100, 186, 159, 93, 97, 47, 34, 188, 243, 67, 164, 26, 230, 310, 119, 89, 25, 108, 199, 281, 234, 248, 235, 111, 130, 104, 223, 232, 234, 53, 29, 191, 45, 175, 40, 150, 83, 59, 255, 244, 205, 47, 167, 203, 272, 233, 188, 189, 136, 116, 23, 84, 188, 199, 296, 164, 56, 143, 144, 104, 112, 119, 90, 320, 118, 18, 218, 106, 112, 119, 122, 166, 37, 52, 69, 114, 142, 234, 384, 362, 136, 45, 191, 129, 75, 102, 148, 130, 159, 161, 103, 55, 15, 145, 178, 155, 191, 111, 67, 162, 238, 195, 221, 191, 171, 180, 170, 258, 332, 164, 185, 116, 167, 63, 217, 180, 235, 176, 130, 103, 79, 126, 245, 165, 116, 134, 195, 332, 295, 191, 206, 147, 62, 258, 156, 64, 164, 91, 101, 84, 170, 193, 191, 175, 115, 230, 169, 75, 121, 56, 167, 124, 51, 25, 189, 169, 95, 110, 179, 234, 319, 135, 274, 240, 62, 31, 97, 80, 104, 295, 276, 231, 244, 212, 210, 141, 145, 178, 186, 237, 149, 186, 29, 111, 134, 118, 27, 207, 186, 70, 97, 170, 192, 131, 50, 110, 201, 190, 22, 34, 64, 204, 159, 170, 126, 134, 76, 44, 95, 46, 90, 22, 103, 35, 125, 36, 79, 143, 113, 119, 191, 171, 75, 148, 191, 198, 151, 102, 191, 251, 82, 73, 85, 139, 124, 56, 89, 178, 340, 282, 129, 76, 166, 130, 167, 129, 95, 23, 163, 142, 139, 185, 149, 75, 235, 209]
2719B09l5qj2J12nj27J73k46J18j38L8K3m2R3pK1k2RJ1j59J28k7q3J07p3J15P8p6j39kN3k3
2344F4J4QK1JJ0r9J75j21M0n5mR7K4l1N3j50J96p3p5m9J7O3P3j19M8M1p5o0J26j7m4l9R2j25
1945B7M1lN1o4J01Q8n3j52K36k31K27k44J54mLj32J57p7N7n3Rk3J31Q3k53l1J15p4P8J16k08
1581G2J02K7j02J8O6j4M6j47J47j11Jj7l8k4N6Q3Q2J3j77J80j8j70Q1J15N3j79M3j19J08j38
1229C9J5J02P3n6J13n5j67L7l9O9K9j01L2J38j9r0J75j76K0M8j10N5QQ3o1J43j67q6rK29j66
865A06Ln3J0J51q3k0J7o3P4l8ol9k1K34o2n9N2m3J32j70p8R1K1j29L4P2j9J04p8n2j4j3Q7
477A48Oo2K3J19j34l3m8O7L5J9k2J5q4L%J40j05L2m3Q9o2q1O9O5K0j39NJ7J82k7j9j02LnL
67I4Nm0R6L4j3J01J4M0m6j10j2m5n8K3nN8p5J62j15o9J21l1
$$ y = [209, 174, 166, 154, 266, 261, 134, 307, 61, 179, 41, 79, 102, 60, 153, 146, 167, 145, 154, 165, 6, 134, 107, 24, 131, 58, 173, 251, 175, 36, 34, 87, 64, 78, 86, 107, 108, 118, 19, 194, 73, 113, 58, 54, 151, 175, 144, 197, 47, 243, 170, 95, 46, 63, 126, 199, 80, 128, 169, 94, 34, 160, 143, 99, 60, 152, 27, 68, 65, 116, 52, 153, 241, 188, 36, 272, 41, 268, 24, 178, 174, 177, 45, 202, 125, 182, 129, 138, 115, 246, 329, 76, 45, 160, 86, 164, 280, 72, 174, 201, 99, 117, 183, 169, 215, 68, 215, 104, 105, 88, 50, 26, 82, 165, 247, 260, 83, 263, 245, 75, 156, 271, 324, 145, 188, 69, 177, 39, 54, 156, 229, 173, 286, 231, 64, 101, 62, 131, 160, 59, 91, 229, 210, 120, 295, 119, 139, 187, 77, 132, 140, 223, 162, 305, 138, 52, 43, 272, 106, 109, 56, 66, 217, 134, 114, 131, 68, 142, 104, 98, 59, 38, 272, 210, 151, 203, 160, 292, 122, 44, 135, 156, 27, 61, 133, 114, 218, 140, 88, 74, 61, 148, 154, 92, 115, 234, 100, 67, 19, 86, 121, 140, 118, 133, 49, 52, 52, 192, 87, 119, 76, 165, 103, 22, 91, 156, 176, 37, 42, 59, 241, 214, 195, 93, 96, 91, 94, 99, 59, 155, 189, 176, 277, 291, 331, 285, 175, 163, 118, 60, 83, 78, 136, 61, 223, 108, 39, 160, 129]
-192A29
##PAGE=	F1=8292.22
##FIRST=	25164.767445380970457,	5806.2096540000038658,	0.22434897720813751221
##DATA TABLE=	(F2++(Y..Y)), PROFILE
5806H8mJ31j21N0N8p2j19Q3O0kk4lr6L7J22Oj21J6l0J28J09j52q6kO6O9Q3l1j7Mj92J52j02
5419H8J28mK5j86%Q7j35J86j29J09l8p4J96k1l0q4K4J3Q5lj06Jn9%l8K0J37J5P9j07r8K4L2
5032A37k3N2j2q5K37j40r6J55j15J5j0J4N3j28kM7J2K0O4J35j0j71j03Q4l6olJ5L9K8j4n8
4656I5r1N7J04pK7M2j31k6J19K1m7L2l9lM9j0N4O9j38K4q0N7o9R3PPo3l9Nl1Q7J31r8o4J2
4245A56L5J22j8p4j9l7r5K70j59q7O5q4L6m3P0Q9k5m0n1J57j34m8O9q3J00l4j01L6Q1j9p2
3881F3N0M9K9P0j13J31j0j88k0O5l4M7J54n8k3K7n0K3p3l7N4K6N6j30R1j80J38j5K9j44J96
3517B23n3p0K4N9L3o3q2M4M7m6q0nM5J41n5J5l7k5n5l3P8m5L9m1R1j23J00r0J0O3N3kJ7Jk7
3107A51J37rp0l9q0L2M9j25kN4pL7p1OR8J24l6j33q8J68j04Q3k4p0n8J49m3jM9k4j22K28k2
$$ y = [88, 84, 215, 94, 144, 202, 130, 11, 94, 154, 152, 128, 125, 29, 66, 188, 194, 73, 89, 59, 187, 296, 144, 58, 56, 122, 191, 274, 243, 226, 230, 38, 190, 88, 216, 212, 237, 51, 51, 138, 3, 189, 60, 169, 131, 57, 253, 232, 202, 118, 142, 155, 240, 237, 131, 132, 73, 73, 35, 55, 192, 207, 286, 179, 81, 105, 137, 114, 166, 154, 69, 306, 166, 70, 225, 110, 125, 115, 129, 182, 54, 52, 99, 111, 131, 195, 330, 320, 149, 46, 130, 94, 88, 85, 100, 139, 167, 153, 95, 4, 61, 165, 158, 185, 227, 96, 70, 189, 210, 163, 195, 156, 153, 202, 192, 246, 315, 177, 201, 121, 178, 109, 202, 209, 216, 153, 114, 119, 88, 175, 306, 208, 144, 156, 191, 313, 295, 221, 202, 165, 70, 340, 181, 94, 159, 75, 111, 68, 138, 227, 202, 162, 111, 268, 134, 86, 155, 72, 172, 138, 37, 73, 154, 135, 63, 113, 162, 191, 261, 148, 279, 269, 81, 61, 126, 92, 139, 293, 235, 212, 239, 189, 212, 139, 102, 156, 182, 238, 108, 199, 19, 157, 142, 171, 27, 223, 170, 100, 124, 183, 216, 153, 71, 115, 162, 116, 36, 31, 76, 217, 162, 177, 140, 115, 60, 27, 105, 60, 99, 58, 149, 26, 126, 36, 46, 109, 162, 160, 177, 178, 151, 288, 279, 209, 170, 90, 122, 171, 46, 44, 98, 91, 128, 57, 63, 161, 285, 249, 116, 28, 196, 92, 175, 151, 81, 23, 172, 129, 128, 177, 153, 31, 259, 237]
2719B37n0km7Q9k8j0J45l03J40r9k4N3n2Q7k2M7L0K6j6j72P9Lr1J34o0J8J03m8j14K4km2O6
2332I9K3l6qJ7q4K35o9m6o9J7J23n4m0O0j44K53m7j18r3K2P9L3o9R4k8n1R3K13r5k17p1J28
1956A50o6oqO7q1Q9P5q3l0J73j98J98k37J58n2l4k1J36j18Q5r1L7MJ68L2k83m0J03j0N3P7
1592B47j98J11R9j35L3M7n5P7j19R1j03Jj7j6k3M5P0R9k4j37J44J1j14k3J63pj33J22k25J67
1240A98j75N6L4P7NP2j9j72K9l4QK6r4R1J17k5j06J89j74N5L4j27P1j5R0o4J50j39j05j6J98
876B35j16l6k3l4J74n6m0J7l5M2n6M4n9m1K54l1j23N3k7J40j69q2P2Nr4M3O2%J76j48r1rj4
489C3J19m2J5m4J76j08q9k1O2qj0Q2k1q4n0J03R8j16K7o2J23q2m1J9O7K4j34J4k5J68Ok8o3
102A08oQl0N4k9K0M6MP1k0Q1J9j53k8K7j28jN0K1n2J43j03p5J42k2
$$ y = [237, 187, 185, 138, 227, 199, 189, 334, 31, 171, 72, 48, 101, 49, 136, 114, 161, 191, 217, 201, 29, 108, 111, 20, 154, 94, 112, 215, 167, 53, 77, 75, 33, 99, 122, 86, 78, 95, 11, 246, 177, 131, 62, 79, 202, 148, 108, 168, 24, 277, 230, 112, 19, 41, 120, 153, 84, 178, 150, 99, 192, 405, 310, 93, 22, 150, 84, 78, 70, 137, 56, 145, 220, 137, 107, 280, 82, 280, 43, 201, 149, 115, 94, 230, 112, 197, 106, 143, 147, 315, 347, 64, 24, 127, 117, 170, 247, 49, 160, 259, 124, 157, 204, 149, 226, 107, 198, 95, 96, 79, 63, 40, 85, 155, 254, 230, 93, 237, 248, 134, 111, 274, 267, 134, 256, 31, 198, 23, 79, 113, 190, 195, 267, 248, 76, 105, 71, 79, 105, 11, 102, 219, 194, 88, 277, 103, 158, 192, 65, 136, 121, 211, 147, 297, 158, 53, 37, 235, 119, 83, 60, 26, 200, 144, 104, 121, 86, 128, 72, 116, 57, 16, 270, 239, 116, 169, 142, 282, 113, 31, 103, 108, 14, 57, 119, 119, 295, 147, 56, 47, 33, 152, 110, 125, 81, 257, 149, 60, 39, 101, 93, 83, 165, 144, 60, 10, 113, 211, 95, 122, 60, 183, 101, 60, 79, 146, 170, 36, 50, 25, 193, 199, 171, 108, 102, 110, 80, 134, 105, 125, 171, 175, 246, 226, 307, 326, 173, 145, 172, 44, 43, 93, 114, 62, 205, 102, 27, 169, 147]
-192A47
##PAGE=	F1=8189.96
##FIRST=	25164.767445380970457,	5806.2096540000038658,	0.16780987381935119629
##DATA TABLE=	(F2++(Y..Y)), PROFILE
5806A14J1O9j41J14L6p9r0N2M2QJ2Kj16O6R6m5p9m6J07K4J06j01j38O4K8M2O9Kl5J9j85K25
5431B53j53P7j2N3j93O4j3l7J56j13Q7K1p3J02k4k7kk0m4J12L1j79J7o5mK9J2J22J0N9o6n7
5055A23o0P3k7J11l5j24J87n6p6R5j06K7l0K4O6j16j5O3k0J5J8J02J2q7j16K5j3L5k1lQ6R
4679A66l9k4o9O9R8o7P4L0j41j2J32m3n3M3m6RQ6j6J7O4q5K0r7O3k9K8N8l8o9l5L6k6J08J42
4280C54j16p1J7nJ16Mn8n7J0q3L02k22p2K4p9N2q3O4J32l8n9J1J55j84k5R3r5P3l9r9R9om2
3893G3k6O5M8nL0l1J16J6j89pO8m0L5R9q8OM9o1O3p9q6O3L2N6j21J26j83J95p5M5j50J76o9
3506A51k0J0M8L0n6m4K1k3o8L3k7O4J12n9pl8pm5m6P8l9K4J5O2j17O7m9LJ3J32k1m4L5Q0K93
3095E61j51k00k8r4J6k4p7K4P1k0O3r6jQ3Q6j1j05p3K19k04J32qo3m4J07m6qL3%j28K46qp7
$$ y = [114, 125, 194, 53, 167, 203, 124, 34, 86, 128, 136, 148, 150, 34, 100, 196, 151, 72, 26, 133, 157, 263, 162, 24, 88, 116, 158, 227, 229, 194, 213, 28, 253, 100, 177, 165, 218, 25, 89, 76, 39, 195, 82, 169, 190, 117, 219, 195, 168, 166, 146, 102, 214, 245, 66, 83, 18, 14, 43, 55, 177, 187, 246, 180, 123, 63, 136, 109, 220, 185, 61, 248, 192, 116, 211, 105, 132, 102, 126, 192, 76, 61, 124, 104, 119, 137, 239, 251, 164, 48, 73, 60, 95, 74, 71, 157, 166, 127, 103, 34, 103, 201, 134, 208, 238, 97, 85, 217, 174, 121, 164, 118, 127, 213, 197, 214, 278, 193, 213, 116, 179, 150, 178, 236, 198, 129, 94, 130, 104, 212, 354, 238, 167, 184, 179, 295, 299, 241, 184, 194, 111, 413, 191, 119, 143, 64, 116, 33, 97, 229, 191, 132, 143, 298, 114, 89, 182, 87, 160, 121, 22, 121, 115, 73, 47, 112, 160, 155, 185, 154, 270, 286, 97, 90, 158, 118, 153, 252, 164, 170, 219, 158, 221, 142, 56, 119, 151, 207, 86, 212, 29, 224, 149, 194, 44, 220, 151, 131, 141, 189, 219, 163, 119, 140, 117, 49, 82, 55, 119, 231, 172, 165, 127, 120, 75, 29, 107, 68, 92, 107, 169, 52, 119, 70, 73, 86, 218, 197, 153, 188, 268, 561, 410, 210, 182, 88, 104, 80, 3, 27, 98, 78, 141, 45, 44, 127, 213, 202, 97, 24, 243, 39, 171, 163, 100, 56, 163, 117, 109, 142, 142, 14, 260, 252, 175]
2708A75Pp1O6o3J12J23l32J46n4m2J9p0R3k5N1O3N5j5j88J4M4n9J06k9o0J00np0L1j7r0R8
2332A13M7q8k7J4n6K60Kj08r2M5J16j22m8P2j19K78j9j33q5m2Q1J1kJ36q5k8K70L45j84m38
1980A14m2Q5j3n6m6J04q2N3N7q4P7J13j60J49k10J55r3o6Q5R4j32Q6p8L0L1J96j6k87o1J17
1628A20K9K9K7j65J07J54j70N7J3r6J39j05nm2j8K1l0OK2M2J04m8j02J19L4k8j36J86o7n6
1276A41J56k68J54j11K7k9P8O0L4J5j84L2k6m2J1qO8R4l7j12J79j46Q0J6j14O8k6P7o8J35
923B54j01p6l7J48p2l1Ln7J58l8p5L3lKo0Q7o2j4K02Kj99O3lJ44j39j13M8j6l9O3K6M5K26
536C69k06r3Jm6J35p8M7p9J99p6j19L4L7n0l6J61n1q4oJ09N9j22J4m2J09q6j3j6O6J5j26K9
160E5m6J25K3k8mj0K4n2Q9l6l9L1K5L2m0J17P6j83k9Q3r7j11R5k0%R4n9r1J51j0
$$ y = [175, 182, 111, 177, 114, 226, 349, 17, 163, 109, 67, 86, 16, 109, 84, 135, 198, 253, 238, 50, 64, 108, 49, 155, 126, 66, 166, 161, 91, 122, 105, 15, 113, 160, 72, 45, 59, 3, 263, 265, 157, 65, 110, 226, 104, 56, 128, 9, 287, 268, 135, 50, 8, 89, 100, 98, 234, 149, 121, 391, 736, 552, 114, 72, 157, 144, 88, 42, 146, 64, 117, 174, 90, 167, 280, 120, 269, 59, 214, 121, 55, 140, 234, 102, 188, 110, 140, 171, 367, 351, 64, 3, 120, 149, 178, 205, 40, 147, 301, 131, 188, 201, 105, 244, 139, 134, 92, 74, 95, 65, 71, 93, 135, 239, 191, 89, 208, 242, 214, 78, 264, 197, 141, 297, 29, 183, 72, 99, 70, 148, 208, 242, 257, 73, 105, 79, 37, 48, 40, 108, 202, 165, 53, 232, 86, 166, 182, 68, 136, 110, 187, 119, 254, 153, 77, 40, 188, 116, 85, 88, 31, 189, 151, 76, 109, 106, 108, 48, 135, 73, 59, 261, 263, 64, 127, 124, 268, 129, 16, 64, 48, 9, 72, 98, 143, 369, 163, 70, 71, 25, 160, 82, 129, 50, 249, 173, 54, 88, 125, 75, 39, 200, 149, 65, 59, 168, 227, 105, 119, 77, 186, 100, 87, 71, 137, 152, 26, 55, 9, 134, 157, 129, 125, 115, 139, 87, 176, 140, 101, 132, 157, 189, 149, 266, 342, 159, 130, 213, 116, 5, 100, 80, 80, 174, 115, 24, 175, 165]
-192A65
##PAGE=	F1=8087.71
##FIRST=	25164.767445380970457,	5806.2096540000038658,	0.057017698884010314941
##DATA TABLE=	(F2++(Y..Y)), PROFILE
5806A41L5j1j41J51Op6n0K7K8PL9J3j04O7P6q9n7m4J63k5O1m2j61Q2LJ3M3N5n5L9j13K15j40
5419A56l9%P1j74J24j17M6J22q8N9Q2n6nl2l8O9rj19J50N2k45N5j7MqM1P3lL7j6lj31R9n2
5020H8J63m6r9O1K4m2L7r9M7n5K8Q9r2k5O8m1jl0N3L4J0j13j1J6L3m1QJ08pp7L1o1P4J08j31
4609A09J04Lr7k7J49j02o1N2m2J7J09l2j4N8k2J2j13N9J5k3R9p3p3k8O0k3J10J51j29p6L6
4245B08n4J16K6n3q7O8q8L21k76l2l2m4K6p7L2J45l4p4J02J26k03k5J08r0K4n0m3J17n4r7
3893FL4O2P8l3l8M8R6L3j79RP2l5j2L9j08L3R2p6J12p5j33M5K9O0o2J26j97K62j25K1j29J41
3517A96n8K2mK8Pl2PRj02l0Q2k1O7O6n6m2l9M3k4q5O2j9LO8Ro1J1qL0l9J75m5q7P1K06M80
3095H90l32l56j8p6K9r0lLL9J5M3r6%L9N8%p0j3K19j99O5J4l5n2O9l8k6J3J9o7J96K0j17J8
$$ y = [141, 176, 165, 24, 175, 181, 105, 55, 82, 110, 117, 156, 169, 65, 132, 208, 119, 62, 18, 181, 156, 217, 175, 14, 96, 99, 112, 155, 210, 155, 194, 81, 296, 156, 117, 117, 188, 14, 138, 21, 67, 189, 101, 160, 242, 186, 181, 149, 111, 180, 171, 52, 202, 254, 9, 64, 47, 51, 43, 84, 157, 154, 191, 175, 172, 41, 140, 88, 251, 205, 106, 167, 191, 149, 186, 87, 134, 79, 107, 196, 104, 79, 147, 106, 105, 75, 128, 162, 172, 59, 48, 64, 97, 56, 64, 172, 165, 88, 119, 58, 132, 240, 109, 213, 216, 119, 92, 241, 139, 78, 130, 88, 105, 214, 182, 168, 226, 204, 216, 103, 162, 177, 154, 253, 180, 107, 79, 139, 116, 226, 377, 248, 172, 208, 154, 270, 296, 243, 156, 224, 136, 457, 181, 149, 117, 73, 99, 22, 54, 199, 165, 91, 193, 319, 116, 91, 199, 109, 133, 83, 40, 157, 103, 6, 40, 102, 180, 147, 109, 157, 253, 286, 107, 116, 188, 153, 141, 180, 72, 105, 197, 121, 233, 158, 25, 70, 99, 159, 97, 223, 26, 288, 163, 184, 55, 196, 138, 160, 156, 184, 191, 159, 166, 175, 73, 43, 125, 104, 171, 237, 181, 139, 100, 143, 119, 34, 96, 77, 80, 148, 157, 96, 107, 99, 129, 90, 265, 220, 133, 204, 410, 890, 558, 202, 184, 108, 137, 47, 44, 47, 86, 101, 144, 48, 48, 87, 145, 145, 75, 62, 281, 82, 147, 161, 126, 74, 143, 105, 79, 92, 111, 44, 240, 260, 143, 161]
2696A61o3K9j07K21J06l29J36j3l2n5k3N4k2L1P5R5Mk02n0P1k1O9J6l8qM3k2L6pj02O0P9j19
2308G3m9Pk2K37P1j32j34Q4Q4j78l5J01o2K21Kj13o4o2J1L0K4J79j18JM34N10k75o60m2M3
1956A66K8r3r2J43q1RL8n5J46O5j34R3j67J45j15n1J26M3j13N4k6QM5K11o1k63m7J21L2J2
1604A87k3j16Q6J74j88Q6k3j28K17j10r3M4o8P1l9L6j6K1Q6n4p7J09M7O2j50J02j07K1J51
1264C08k33O3l9J1o7Q2Q4J7L7j99K9kl4m1O7K0P1n1j01J45r6R3jp9M9k7N1p3R9o0k2m9Q8l8
865A02kK6p8J41l7j05N3J3k5l7J06o7OJ61J9k65P8K0J39r3j36J2j7QP3k6J12K40k42q8Nm7
489D9J22r2K8p6J92l6j28O7L5o9o9J98o9q7M3R3L6j31KlO2p0RmL0kj22M4k4O8Nk3M5LM5o3
67A08Q0k6o8rM1qm4J36J15j93k0J26m5j43M8m6M5L3J2j16J58o
$$ y = [161, 98, 127, 20, 241, 347, 18, 154, 141, 109, 54, 31, 85, 63, 94, 169, 264, 268, 66, 16, 87, 66, 135, 151, 113, 105, 148, 126, 162, 155, 53, 113, 192, 73, 24, 31, 9, 246, 317, 185, 51, 135, 219, 41, 6, 107, 45, 266, 268, 155, 91, 29, 40, 70, 94, 273, 155, 156, 590, 1100, 825, 165, 123, 166, 194, 101, 9, 152, 71, 80, 118, 63, 209, 274, 140, 233, 66, 211, 96, 45, 171, 214, 101, 155, 129, 137, 182, 393, 332, 69, 22, 143, 175, 187, 164, 48, 134, 308, 120, 206, 183, 55, 272, 162, 69, 113, 45, 116, 77, 113, 97, 118, 204, 150, 73, 182, 229, 291, 141, 243, 136, 157, 308, 75, 138, 99, 110, 43, 125, 209, 226, 263, 64, 93, 91, 57, 16, 83, 103, 174, 123, 22, 167, 71, 164, 163, 84, 133, 106, 157, 84, 183, 123, 101, 52, 140, 102, 100, 126, 48, 189, 152, 47, 100, 113, 88, 51, 157, 90, 96, 257, 276, 11, 89, 109, 248, 155, 19, 31, 14, 22, 95, 69, 181, 421, 179, 91, 96, 49, 171, 79, 107, 31, 223, 187, 59, 126, 161, 92, 23, 221, 152, 65, 108, 201, 237, 106, 108, 105, 167, 97, 106, 102, 132, 130, 8, 52, 28, 96, 101, 78, 123, 126, 171, 108, 188, 162, 94, 85, 126, 118, 74, 210, 325, 132, 112, 238, 193, 50, 98, 52, 97, 130, 142, 26, 184, 178]
-192A78
##PAGE=	F1=7985.45
##FIRST=	25164.767445380970457,	5806.2096540000038658,	0.090350180864334106445
##DATA TABLE=	(F2++(Y..Y)), PROFILE
5806A64O4r5j06J34k3n2k5K3J4K0N5Pq1N6O0j15n3j6J68k8mK1j32K6J6j3J2J14r9P5o6J91
5431C12q5j77N0O3j14J32j51M6R0m9M7J09k8p9n8o5J14L3j64J76N6k10K6J4K1o7Q0K9k2J1
5078A40K3N5j53Q4r5J94l6m2q3P7MLj21Q9r4L1J19n9l5O5m5k6p6QL9J02q9j4K7Mo3K8J13q
4679A66j07P5o8P9J27j83J06l4np7J79j50o5O1l4K9J10n4l4N5L6nj17M0O1n5J17r5o6j0O7
4316A49l9J03J55j28p8N7j02J18M3n6r5J19j08L25l12L8r0Kl1Lj3Q6j3q1J90Q9k04l6J14p0
3963A35l8l4LJ08l9m9n6N5J20l8j11J03P8K9j55K6P2k3q0j3n8mJ51r8J60m9j72K1L0M9kJ08
3588B29j97L00j49l5r3J05k3M0lMm6RN8kj58K9R0jN7J7m8o7l2Q8qj42N2K5qQ7o0K6n3J9O3
3177A73o1J77o6r3R1L29O47n10n01ql1K6n1n2JpN9J5o2J3j9L2j6k2LK21j09p4M5mo3M1k6n9
$$ y = [164, 228, 133, 27, 161, 138, 86, 61, 84, 98, 118, 173, 180, 99, 155, 215, 100, 47, 31, 199, 171, 167, 188, 56, 82, 98, 85, 97, 211, 112, 187, 121, 312, 227, 50, 100, 163, 49, 181, 30, 76, 166, 117, 164, 273, 245, 166, 108, 43, 157, 190, 26, 202, 258, 48, 74, 88, 109, 42, 122, 151, 129, 140, 163, 218, 65, 149, 54, 248, 212, 170, 87, 164, 168, 171, 50, 139, 45, 76, 195, 136, 101, 166, 121, 95, 19, 27, 66, 168, 79, 65, 92, 96, 33, 61, 174, 166, 59, 134, 66, 145, 272, 89, 195, 161, 156, 79, 258, 108, 43, 104, 70, 99, 209, 155, 121, 176, 212, 207, 90, 130, 191, 136, 253, 158, 92, 82, 149, 110, 213, 368, 240, 162, 219, 117, 235, 278, 222, 127, 246, 138, 463, 151, 189, 99, 101, 70, 73, 60, 146, 133, 52, 242, 331, 127, 91, 205, 135, 97, 63, 66, 174, 135, 86, 30, 85, 205, 167, 56, 159, 237, 266, 111, 137, 209, 186, 106, 93, 35, 31, 182, 84, 244, 195, 23, 44, 74, 123, 121, 229, 32, 332, 183, 148, 55, 160, 137, 177, 174, 178, 132, 141, 199, 197, 39, 68, 158, 157, 214, 231, 183, 116, 84, 172, 164, 22, 74, 99, 91, 178, 118, 144, 91, 110, 173, 112, 289, 223, 130, 221, 550, 1197, 687, 186, 178, 147, 173, 122, 70, 71, 64, 123, 138, 76, 89, 70, 102, 86, 64, 67, 288, 179, 105, 150, 146, 83, 124, 98, 39]
2778C9OJ9nJ48N6j58K6k5nl8J66R9k98J15J7k0j25O7rj9NN4J45K3k08j0j3K2L1O5Pj42J02
2391A37J1M2J2r6nJ12j27m1%j7J77J22j20j72J10L8j38K4N8m4J27K0o4l9o7k6N9l4K16j25
2038A50M2N57O75l48q48o9J1N5j11n0R9q8k0J9j4J72L3j26L3r8J14j14nJ12no6qM7JK8K07
1675C85r4k14k7J25J4No4q2O9J55j80J20m3j18K49j24j23N7r5J17k8N3o7K1M9m8o0J08M9J37
1322C46j14j8j23P8J23j78m2K9J5p9J00O3K3M2j99jM8j3l5N8m1N6o2m0N8l7R6j4l9K7k8L3
947A32p7M7k4L8m6M2j6QN9j08J43n7j00N4Mj6k1J17p6K0J42Rk27K1L0J23l8j20m0M5k8Q0q4
560C6J82K23k54q6Lj4R0r2j9l9J67J0j29O6N9o5r7J87p2r7Q1O7L1j43rN2qk6J8K8j8k2r5K7
160D2J3O0p2j3P2K7O8n7L0Np1m3K8l3m0J32J28j77j6J66Oj72Nj9L6l3J01j47J75j6
$$ y = [39, 45, 64, 59, 207, 263, 105, 131, 106, 101, 63, 229, 328, 30, 145, 162, 142, 17, 84, 75, 56, 61, 115, 260, 283, 75, 65, 52, 74, 105, 170, 177, 35, 137, 148, 190, 202, 106, 101, 213, 86, 45, 45, 28, 205, 327, 207, 35, 145, 183, 45, 69, 127, 83, 210, 230, 166, 127, 60, 34, 93, 59, 275, 150, 192, 749, 1424, 1076, 228, 159, 170, 225, 114, 64, 163, 75, 55, 74, 60, 232, 265, 139, 172, 74, 188, 74, 69, 181, 176, 110, 102, 149, 150, 178, 385, 291, 77, 50, 175, 189, 194, 130, 48, 117, 272, 92, 212, 169, 51, 300, 176, 53, 110, 15, 132, 104, 157, 90, 111, 160, 112, 52, 160, 209, 346, 232, 214, 91, 169, 292, 114, 72, 101, 116, 37, 137, 200, 223, 265, 66, 65, 113, 100, 65, 123, 82, 138, 76, 36, 94, 57, 153, 139, 100, 127, 99, 132, 55, 102, 78, 116, 70, 112, 96, 104, 163, 55, 198, 141, 41, 95, 99, 83, 62, 179, 103, 123, 265, 274, 47, 68, 98, 221, 183, 63, 23, 68, 40, 120, 36, 218, 441, 187, 101, 104, 90, 180, 88, 69, 30, 197, 207, 78, 144, 203, 138, 41, 228, 156, 59, 140, 207, 238, 95, 86, 138, 130, 104, 122, 150, 132, 110, 15, 42, 55, 115, 43, 30, 102, 129, 197, 140, 170, 175, 104, 61, 89, 56, 16, 148, 276, 99, 83, 249, 255, 83, 88, 69, 105, 72, 173, 26, 201, 185]
-192A85
##PAGE=	F1=7883.19
##FIRST=	25164.767445380970457,	5806.2096540000038658,	0.13702659308910369873
##DATA TABLE=	(F2++(Y..Y)), PROFILE
5806A80Q7j67o3R2m6pk8M2KO5O3l9n4L6M7j16n4oJ56j0n7P9r9m3O8k2LJ26j63J27n0J49rk65
5407B4Q3M9q6J35j37jO4lO1Q4Qj07r6m9P3Q5j39J55M8j71MK8L6j04J16Rm5j6L1J07j49O5j38
5020B4J86MJ5j84P6N0J5j75J44j26L5J30k3m8O1m7m3o8M3m3J27n3j2K8k7o9K7J13Lr1P4q5
4644F1Q0J51k17P9o4J05j32K02j85n6P9m3M5R2p1k6M4P7k6r9lJ04p0J12j08n4K8M9p0R2J53
4280C29j07p2O6j38J16M7o0p5J48j23K99l23J26j22K6n8M1Jl4J8p0K44N1j97m7J15m1r2L8
3940A06k4Q8J0k6j28M7J47k5j42J10N7J0j24M2O2oj51m3J09n2J14j30J95Jk24O6M0oJ7Q6j66
3576F0K87j44q4p5P9K3K9K3lj32M7R8j5j61M1J00K2L9k3l6n5k0R6Jj73K7P9qO8j19J21j16
3200G6K1R7o3J52p8o3Q6M25P54o48n96J1J3Qj0j17J4n0J01Qk3L4n5rn2M1KJ86Mk00O9K1o9
$$ y = [180, 267, 100, 37, 129, 83, 76, 48, 90, 92, 157, 220, 181, 127, 163, 210, 94, 40, 34, 190, 180, 123, 202, 103, 60, 128, 106, 109, 235, 72, 199, 149, 298, 289, 24, 107, 156, 70, 205, 68, 67, 131, 128, 189, 273, 281, 174, 78, 29, 102, 187, 48, 203, 251, 80, 84, 112, 148, 44, 160, 169, 124, 108, 139, 246, 97, 162, 24, 210, 214, 229, 45, 121, 171, 186, 11, 155, 29, 64, 194, 171, 123, 184, 137, 94, 26, 69, 26, 153, 100, 88, 116, 89, 20, 47, 160, 163, 72, 146, 61, 141, 292, 75, 154, 90, 195, 63, 265, 80, 24, 103, 60, 105, 197, 126, 100, 144, 221, 195, 96, 93, 197, 127, 239, 131, 77, 105, 154, 84, 176, 329, 222, 150, 216, 78, 194, 241, 181, 106, 254, 131, 430, 107, 233, 111, 137, 79, 120, 121, 87, 105, 35, 279, 330, 133, 86, 201, 160, 68, 106, 82, 170, 180, 154, 26, 73, 220, 195, 53, 163, 220, 230, 106, 148, 210, 204, 53, 10, 119, 67, 181, 51, 246, 247, 23, 89, 129, 123, 140, 226, 60, 347, 203, 119, 44, 123, 146, 175, 198, 195, 63, 110, 208, 193, 32, 73, 173, 195, 234, 211, 175, 120, 100, 196, 197, 24, 51, 130, 122, 190, 71, 192, 76, 97, 194, 131, 283, 205, 142, 228, 653, 1407, 759, 163, 174, 187, 195, 185, 68, 82, 32, 133, 141, 118, 152, 97, 88, 36, 77, 79, 265, 269, 69, 138, 159, 90]
2813I0K0j0q5PjM2J06Q9j73J1J3jJ3O3J07k39Q9K8j1j08Q7o0k2K7k1J88L4k09N5o9J8PJ03
2426A88K8j82J07J5M4L4p3p7J36j21k2nj5R8J41p9j64Q7mj4NL4n1J3N6j6j2p6%N1j19K23j06
2038A24R5O17P98l85r66j01j3O6j16j3O8r8j9KkJ80J4j31k7RM0q6J7R5m1mq5J25J8k2J87j05
1663B41j55j4J22pRr1p2O8R9j50J54k8q5K27j34q1m2l4J14j2O8j29L5J4m1m3J10M0J79o0j21
1299A81j28J24Q6j27j34Q1M0r3J45J8L1L4j73n9J16rj8N3j22N6n4K0l9RR2j8qRk9L3n3Nl7
912C2Q3l7L9Ll5J11j35J51r6p0M6k3L6m2J36q6L1J41l5j67k1L1R5K4r4q0O7m6Q2j31K28J88
536D26k45o9k0M2M1p9o9J0J41N3j23L3R5m8j16J56o3j17J03L2N1j53k4J17q4L5RN3n0m2n8
172C7mN7O9j30J6K9M8Q9l7l7M3n9k1m3Rk7N1J13j30j7J93M2j95j2K7j2q6J87j75J94l5
$$ y = [90, 110, 100, 15, 22, 21, 63, 169, 258, 85, 96, 109, 108, 121, 184, 291, 52, 141, 169, 158, 50, 137, 77, 55, 82, 61, 249, 283, 74, 129, 60, 78, 85, 188, 216, 34, 141, 156, 200, 234, 161, 84, 220, 99, 77, 72, 57, 155, 296, 217, 53, 140, 136, 122, 127, 161, 110, 123, 179, 163, 151, 75, 75, 126, 7, 230, 124, 219, 836, 1634, 1249, 283, 182, 169, 235, 119, 106, 174, 76, 57, 59, 57, 237, 251, 120, 93, 102, 142, 56, 73, 168, 127, 123, 38, 163, 181, 159, 346, 241, 86, 72, 194, 187, 196, 105, 33, 101, 200, 50, 204, 176, 91, 318, 184, 103, 61, 27, 141, 129, 197, 68, 103, 117, 76, 33, 143, 183, 362, 302, 181, 53, 177, 263, 136, 2, 83, 123, 30, 175, 193, 224, 258, 85, 26, 142, 133, 115, 168, 46, 102, 48, 68, 29, 38, 130, 112, 104, 113, 84, 117, 64, 69, 32, 115, 78, 117, 120, 85, 196, 61, 212, 116, 46, 92, 69, 105, 63, 199, 113, 144, 285, 250, 83, 62, 93, 188, 212, 118, 38, 105, 59, 141, 10, 238, 426, 181, 112, 92, 134, 175, 96, 27, 37, 178, 231, 108, 141, 236, 188, 72, 228, 165, 48, 151, 183, 234, 81, 57, 174, 90, 125, 134, 187, 137, 95, 37, 33, 90, 159, 29, 45, 74, 122, 211, 174, 137, 180, 121, 100, 57, 66, 39, 90, 203, 73, 56, 249, 291, 96, 84, 111, 99, 13, 200, 25, 219, 184]
-192A84
##PAGE=	F1=7780.93
##FIRST=	25164.767445380970457,	5806.2096540000038658,	0.12959012389183044434
##DATA TABLE=	(F2++(Y..Y)), PROFILE
5806A83J01k15l1O5o7L8n4P7qJ28P4j17k8ML9j00l9NJ12Op6J18o6q4J04l2NJ22k28J86n6R6
5431B62O6k56M8N3j04J32r1o0M6L8R1J6N0j06j36M0n9J25q3J20M1j49oL8M2j14J49Op2k4n
5067I8J49j29N6j25J07O5N2j90oQ5N3j56J17j10L0J01Lo2O6n6l8m9N4k5M1j4j5K6n3n3JJ12
4691A35Rm1N1j04P4J74k28K5l7J67j28J62j99l8J08q0O1O9q0J7K4R9m2p3n3J26p4R5j09n9
4339E1Q7J1j00P6J43o6n5N2j43R9L7o6k8J49j16K41l06K04j26K8m2K4L4j31L0l9K47J9j85
3999A29n5J15j0j06Q6p3O7N9j4j58M2J38pj25Q3K6j2r3N6M0J1j92P0J02n1N8j55K09O2k73
3647B9J18N3o4RO4j16K40j19p1j06O1O2mO5K8j62j4J18l6j06K3R4M4J5m2k2j1k6Q7Oj39l9
3271C9J18j2L7j13J66j50j8J22n4J11p6j6O8M66P79p16o20N4L6j7J3j73M0p6J29K8PM7r0n2
$$ y = [183, 284, 69, 38, 103, 36, 74, 20, 97, 89, 217, 291, 174, 146, 150, 189, 89, 50, 55, 167, 173, 97, 215, 149, 65, 169, 137, 142, 264, 36, 222, 166, 262, 328, 72, 120, 173, 69, 201, 110, 50, 96, 134, 225, 241, 291, 185, 49, 89, 30, 155, 72, 192, 233, 84, 78, 116, 158, 44, 193, 199, 127, 103, 98, 247, 118, 174, 49, 156, 221, 273, 83, 77, 162, 215, 59, 176, 66, 96, 197, 200, 138, 204, 148, 110, 61, 115, 90, 131, 117, 102, 128, 75, 22, 23, 135, 144, 103, 154, 50, 124, 298, 70, 95, 58, 225, 97, 259, 60, 22, 130, 50, 111, 180, 100, 117, 141, 240, 198, 125, 72, 198, 124, 219, 110, 51, 138, 149, 49, 125, 268, 202, 147, 199, 56, 155, 192, 126, 98, 247, 131, 372, 66, 270, 144, 172, 130, 154, 188, 57, 87, 48, 295, 314, 129, 74, 189, 179, 73, 159, 86, 153, 212, 198, 40, 82, 220, 213, 88, 171, 197, 185, 92, 148, 188, 199, 7, 77, 179, 128, 186, 31, 240, 302, 29, 147, 200, 136, 145, 209, 93, 333, 214, 143, 37, 98, 160, 156, 221, 249, 87, 73, 191, 155, 49, 72, 166, 210, 225, 183, 161, 150, 124, 211, 217, 78, 39, 157, 145, 182, 69, 235, 85, 67, 189, 135, 246, 170, 154, 222, 688, 1467, 751, 131, 185, 221, 204, 217, 44, 84, 8, 137, 165, 172, 219, 129, 77]
2919G7m0P4O4Q2P0k42N1L0o4lRn3k7M9mO1J09j54l3L9L0K0l8J34j65P3J3pn3Q3j05l3Q3p6
2520E4J83L2k06J24n8m8J4J11J9j32P0j2L7N8m1j29J36j06kj0kJ9J23k4j28M0j6P8j5J4o2
2156A21r3J40k1J1q9L0M1n4N6o4J49O07Q47l80r84j23k6O0j16PN9j00rok2J84Pj38q6J42p1
1792G9l5J3Q3o2N2j03J46M7r1J55q1j11j4J14k4K5j06o5P6J3q8J61J9p7J94j35M9j04n9P4
1440A45qQ5j79L8On3j4J11K5J78lj78j16J47M8r6o8j6Q4j18K01k0K1J7j38q6J54j5RO3j66
1076E8L3j8J7p3%P3j2J4Jj6M0j6J7r2P6l4P0K8j21J80j56J54j40l1N4l5P0q5J57r6M6J43j00
689B06j07m3L5O2Q7o7j15O6n0Q1j29K08J47k12l2p3R9j6n3p3L0J03R3r7k0J18k7j14J21m7
337A81j48J13oQ6j45k4J50j35P7j2O1n2o7k6j8R0P0j32K2k9N0J02j4r1P8m0J9j21Q1n4k2Q2
$$ y = [77, 37, 111, 175, 257, 327, 85, 136, 166, 102, 99, 108, 55, 28, 77, 73, 134, 243, 89, 56, 95, 125, 145, 107, 241, 76, 149, 162, 155, 102, 185, 80, 47, 130, 54, 237, 269, 63, 187, 129, 81, 95, 206, 225, 93, 163, 151, 188, 246, 205, 76, 212, 106, 104, 94, 92, 111, 234, 210, 82, 122, 106, 184, 169, 183, 121, 28, 168, 147, 158, 69, 99, 140, 86, 142, 78, 227, 834, 1681, 1301, 317, 194, 168, 228, 112, 119, 178, 78, 69, 63, 41, 225, 232, 94, 8, 150, 79, 44, 57, 140, 78, 130, 27, 173, 220, 129, 284, 203, 92, 78, 192, 168, 193, 87, 22, 98, 111, 23, 184, 203, 126, 320, 185, 234, 130, 71, 145, 137, 222, 43, 81, 87, 34, 20, 131, 156, 334, 331, 153, 37, 184, 232, 136, 68, 52, 136, 18, 219, 199, 220, 237, 99, 13, 167, 152, 161, 224, 58, 91, 73, 90, 17, 17, 90, 78, 92, 93, 77, 117, 101, 118, 26, 102, 68, 138, 166, 45, 225, 69, 223, 83, 52, 106, 71, 141, 56, 213, 117, 163, 306, 206, 99, 56, 91, 153, 240, 173, 58, 124, 74, 155, 26, 234, 381, 169, 137, 64, 163, 147, 94, 21, 51, 154, 247, 150, 130, 248, 221, 107, 228, 181, 33, 146, 140, 226, 81, 57, 207, 72, 149, 137, 198, 146, 79, 53, 35, 125, 195, 63, 85, 56, 106, 208, 194, 103, 181, 141, 160, 39, 120, 66, 44, 126]
-39A26n6%J73N6k09J0M7o6j1J48j92K01n2
$$ y = [126, 70, 70, 243, 299, 90, 100, 147, 81, 70, 218, 26, 227, 175]
-192A75
##PAGE=	F1=7678.67
##FIRST=	25164.767445380970457,	5806.2096540000038658,	0.13962504267692565918
##DATA TABLE=	(F2++(Y..Y)), PROFILE
5806A68J04k32pP4o3M2o3P8j3J83R0k02kl8L6q0rK2N8Nn4J27m0r0J08n8LJ30k67K30o8M0J24
5419C36k21L1O4j65J26j2j13M1M4J23p3R4q9j67J14q9N3j2P9M0j49jM5L7r3J71J3r9pp2J65
5055B14q9N5r0L2J13O0j58p7Q9Q4j28Q6q5L4O6Np0R1p8k0m2L0Lj2J5k0K3p9j8j0Q3jK7K0j06
4644D7O0J84k19m0P5J35p4O6j71k8J29j25P2M9q6P1J0J14m4o3q5J22p5Q0r5j00J63m3o9J6
4292G6J25j4l5K1j10O8L0r2K9J29q6J64k49K34j13K1j6j0P4j62kj9K26rj60o5J17J6q6R0j05
3928H7M8Q9j0j57M5J08Kp7M6j2k8o9O7MK8j03O8O3l9K5j66K06J18k93J47N5j17kM5n6J74q3
3553B13j5j36K8Q1m3J09Q2j55j32J27p0j9K3M9O0j4l4oL4m3P9Qq8j09J43k5Mm4J60j35p8J06
3177A60m0O7o0K9M5M43P18p01n70J21L3m7J7j72M8l3R3M7L3M2j31q7QQ2J36QM8k09J8K1m7
$$ y = [168, 272, 40, 33, 107, 44, 86, 23, 101, 88, 271, 361, 159, 157, 119, 155, 75, 66, 88, 146, 151, 97, 224, 184, 94, 202, 144, 147, 277, 10, 240, 172, 212, 336, 115, 146, 210, 45, 171, 159, 46, 87, 131, 254, 181, 275, 186, 19, 133, 44, 97, 85, 164, 204, 55, 54, 99, 136, 43, 214, 227, 128, 121, 49, 214, 125, 180, 90, 122, 235, 295, 137, 60, 149, 233, 105, 191, 106, 140, 206, 211, 141, 232, 154, 134, 92, 122, 125, 113, 128, 108, 131, 52, 34, 24, 107, 106, 133, 153, 47, 107, 291, 72, 32, 107, 242, 168, 234, 63, 35, 164, 39, 111, 160, 74, 145, 155, 269, 225, 162, 77, 199, 124, 204, 109, 9, 172, 129, 60, 76, 201, 187, 152, 173, 63, 131, 161, 69, 98, 227, 141, 305, 56, 290, 177, 198, 182, 172, 246, 84, 82, 63, 289, 280, 120, 55, 172, 188, 102, 192, 87, 135, 224, 214, 57, 102, 210, 212, 135, 181, 169, 141, 72, 139, 143, 171, 68, 136, 199, 160, 185, 19, 225, 343, 50, 197, 252, 135, 133, 178, 122, 296, 213, 198, 62, 90, 171, 128, 237, 319, 164, 32, 159, 89, 70, 93, 142, 202, 188, 154, 148, 182, 139, 218, 226, 138, 29, 172, 147, 151, 107, 267, 132, 54, 160, 120, 187, 127, 156, 201, 644, 1362, 661, 91, 212, 245, 198, 215, 43, 91, 58, 151, 198, 231, 273, 142, 55, 63, 145, 281, 289, 337, 128, 146, 167, 120]
2813A20l2K6k7m5J05m7OJ12j22q2P5M4Lj01J49q9O9k1rJ5P2j40n5J47r0J45J9k06J90k9j27
2449G5M5J02nq6N9n1J4Q9j5j44J04q2J4rK0n1Q1K3q5L%J14k6no7qJ07r2K9j09N6K7L7j34O
2038C6J77N34Q03l34q99j20k7M3j15PO8q9oj7m3J81Pj34oJ33j93L6J1N6p6R2m3R8P3j61J23
1675B15k0r8l6J06k9M7j12k7O3n6J5Q5Q0p9J51j28J90j11j46L9k3J01j60l2L5m8j6J18PJ35
1322B66M5j67o2J10J6q5Lj03J36j15K11l6j5rj07m7J37j6L8Q4j47j2j2j6n9j3J1NK1J5L0J9
947A26J7K1j17M3l0R2O3j78K13j76J51j66K5O5k0M7j27J65j02O8J39j72n3n5N3K7J43m4j34
606H4M7m7P5j20J64J11j53Rj36J32o9j2j7J0L0J42m9o9J00qq6R3k5j67R2l8J25j16KJ24j36
243I2P4l6N0k7r6Kj4J02O6j22J9n9L6R6Pj07R7k0N6j79J35r6n7P3nL1J20M2k03N2L7j16Q3
$$ y = [120, 88, 114, 87, 42, 147, 100, 106, 218, 96, 14, 89, 133, 136, 35, 184, 95, 164, 143, 134, 149, 221, 81, 26, 173, 83, 228, 247, 41, 231, 202, 75, 120, 222, 217, 131, 190, 139, 153, 242, 227, 83, 187, 105, 119, 110, 130, 79, 160, 183, 98, 101, 101, 215, 189, 184, 117, 109, 216, 124, 153, 44, 100, 127, 164, 30, 36, 213, 747, 1550, 1216, 317, 197, 170, 213, 98, 105, 173, 84, 78, 61, 18, 199, 206, 72, 66, 199, 6, 42, 53, 109, 33, 125, 82, 180, 253, 92, 215, 195, 97, 61, 167, 138, 185, 73, 46, 109, 53, 68, 153, 233, 154, 305, 177, 367, 256, 110, 149, 126, 227, 67, 35, 70, 22, 6, 124, 131, 266, 311, 144, 82, 192, 208, 123, 126, 23, 159, 44, 255, 219, 204, 195, 88, 41, 178, 162, 200, 284, 137, 125, 113, 97, 38, 25, 36, 41, 62, 77, 107, 126, 143, 164, 47, 90, 60, 152, 215, 37, 250, 74, 225, 59, 84, 149, 129, 176, 49, 214, 112, 180, 319, 147, 94, 39, 92, 119, 262, 218, 84, 131, 84, 159, 39, 203, 314, 161, 170, 34, 166, 97, 85, 68, 78, 108, 250, 201, 132, 232, 224, 138, 231, 206, 39, 131, 93, 218, 102, 104, 228, 92, 166, 130, 180, 153, 57, 59, 45, 147, 213, 91, 110, 51, 87, 183, 190, 83, 180, 160, 216, 37, 172, 76, 19, 92, 87, 118, 238, 280, 77, 129, 166, 50, 133]
-145A33Q8j94J86n5
$$ y = [133, 221, 27, 213, 158]
-192A58
##PAGE=	F1=7576.42
##FIRST=	25164.767445380970457,	5806.2096540000038658,	0.20757506787776947021
##DATA TABLE=	(F2++(Y..Y)), PROFILE
5806A36R8k15J0J05o5M0n2M6j7K16J10k73K4r1M7p0K6M0K6k0oJ12k5q1R7j00LJ45k45K21p7
5442A65pJ56j65M2N9k35J09Q5j49M9QJ45j54J29n9j46J27n6p9O6L5M3j61QM5K9l3J60K7j16
5090A27K0o7P6k7N3n8J3J08M8j04j17O6Q7r5O3o0M1M6k0p0J41j11ll4k5K9k1K7k7K4j01L2
4715F1lL0l8J21l1p9M5J63j93k7J07Q7nm4j15k5J38j60P7L7r3J16jJ24l3p1r9J10p6Q0p5q2
4339D6J56j09J0n1R1L2j7j0p7O1M7j56P9R7m9R6j80K19q0MJ1m1J10j72l1rJ85l2j17q0J18
3975A51L3n7P4j09M0Q1j2j36N4P8oqPm7l1m8O2m0M3j0N1Qj7J1j66J98J57k88J63M3j68mL4
3588A41OR9m4L9j38j3Q7o8J31J39j58j97J19j37Q7M0k3P0n1KRO5o5P9J3m3j75J65n4k2L0J47
3212B80r1j07L2k6L1k4N2K3L59N90o06m67J96J8p8Kq8K3pO6M2O4J5j71q3L5P0J48j7J3j38
$$ y = [136, 234, 19, 29, 134, 69, 109, 57, 103, 86, 302, 412, 139, 163, 72, 119, 49, 75, 115, 141, 121, 115, 227, 202, 121, 218, 118, 121, 266, 21, 242, 165, 158, 314, 149, 191, 250, 15, 124, 209, 60, 109, 117, 262, 108, 237, 178, 32, 159, 103, 24, 90, 125, 168, 7, 15, 60, 89, 56, 216, 243, 127, 147, 80, 156, 129, 182, 124, 137, 245, 293, 189, 72, 138, 225, 130, 193, 133, 174, 220, 200, 130, 271, 160, 157, 123, 98, 127, 106, 133, 106, 130, 29, 61, 58, 88, 50, 171, 140, 61, 106, 269, 76, 49, 156, 243, 238, 194, 79, 54, 192, 32, 109, 146, 53, 169, 168, 292, 259, 188, 89, 199, 123, 203, 128, 46, 202, 93, 103, 52, 143, 175, 158, 148, 71, 132, 179, 23, 102, 199, 150, 246, 66, 285, 205, 209, 220, 179, 289, 117, 86, 77, 262, 230, 113, 33, 151, 184, 127, 201, 92, 132, 213, 201, 65, 119, 197, 191, 183, 190, 143, 112, 64, 126, 86, 129, 119, 170, 178, 161, 172, 6, 204, 361, 73, 236, 279, 111, 107, 141, 147, 246, 202, 241, 103, 90, 177, 109, 240, 379, 221, 24, 143, 6, 93, 133, 110, 180, 129, 131, 140, 205, 140, 219, 232, 189, 14, 179, 125, 103, 133, 280, 189, 82, 114, 88, 119, 95, 147, 170, 529, 1119, 513, 46, 242, 260, 182, 184, 96, 119, 112, 178, 220, 284, 299, 128, 45, 80, 150, 298, 281, 294, 156]
2848A56PLk6o1L3j0k8J33p3m8J02r7o3R6Kj8j8M4l4P5o2qP8N8j59p1J90r8J18Kj95K28nj98
2449E3Q6R3k4o6O7p7l2J31j0j24N1m9K0JM1j06M8L3l9j1J2J06k4j8n0R8N9j67M7j36P1J0J26
2062B20j33pJ00M16O75k60p31r5j1K3j08KP4o9j1l5l3J46Rj12N7J15j67j9L9Qq2R4J0O6Q8
1698B69k15J04N0j03q1R8k0O9j12J2M9k3J7QJ32p5Q8j01K07j00j52M2o1J08q8q6K7K0m4Q1
1346A20j7P3P3q8k9N9kp7O0j40J59j09J94l8o1m5q7NJ24%N0J10j04n6l3m7o2K2j4mj8N9P6
959A53j5M2Lj27M5j2O1J04j47J63j92J37j41O5O9j4Pj57J53j01R5J24k24j7o3Q6qJ85k8j26
606A20J8n4O8j16J17Q7q1L3j46R3o6J2L8qp6K07Mr7L4Mm1Q3Mj59M0m9J35p9L1O8r2M0n6K6
207A42J3j25K6oJ00O0j01Po9K5O5K2p9R8KQ1k25J77j39n7J04j7O4O7Pj64Q0Rj56J69K6j79
$$ y = [156, 163, 166, 140, 79, 112, 102, 74, 207, 134, 86, 188, 91, 28, 124, 126, 108, 90, 134, 100, 175, 113, 105, 183, 241, 82, 11, 201, 103, 221, 223, 28, 256, 251, 53, 139, 232, 208, 142, 209, 132, 100, 231, 221, 97, 148, 99, 119, 120, 161, 55, 103, 136, 97, 86, 98, 204, 180, 162, 112, 210, 269, 102, 149, 13, 84, 94, 220, 87, 80, 180, 596, 1271, 1011, 280, 185, 174, 197, 89, 91, 165, 96, 85, 50, 17, 163, 172, 60, 117, 232, 65, 46, 85, 93, 11, 105, 115, 181, 269, 54, 158, 208, 105, 24, 122, 102, 171, 59, 71, 120, 97, 114, 122, 254, 179, 267, 166, 373, 273, 121, 163, 102, 210, 122, 36, 63, 83, 39, 120, 103, 176, 249, 161, 132, 191, 189, 112, 172, 32, 191, 82, 276, 238, 177, 132, 45, 50, 174, 174, 224, 334, 230, 174, 141, 94, 32, 54, 40, 36, 18, 77, 153, 138, 180, 183, 56, 101, 89, 150, 254, 107, 270, 78, 215, 74, 139, 208, 194, 201, 44, 197, 96, 191, 315, 91, 74, 11, 97, 89, 274, 246, 120, 138, 84, 152, 36, 153, 240, 159, 192, 46, 139, 73, 85, 123, 115, 39, 246, 250, 153, 187, 191, 150, 233, 237, 78, 118, 69, 204, 125, 156, 224, 132, 172, 116, 142, 155, 30, 56, 50, 150, 210, 109, 116, 47, 72, 137, 159, 80, 178, 180, 261, 36, 213, 74, 17, 121, 104, 168, 235, 242, 78, 158, 167, 11, 180, 206, 27]
-168B7J49l9
$$ y = [27, 176, 137]
-192A37
##PAGE=	F1=7474.16
##FIRST=	25164.767445380970457,	5806.2096540000038658,	0.32595577836036682129
##DATA TABLE=	(F2++(Y..Y)), PROFILE
5806I1Q9j63J2J28p3M6n0K2j7K18J25l09M6j49P7p5N6N4K0n8N0Q0k1o4P8j48L1J36j89J79
5454B22p6l8J59r3O2M1k37M3J67j79O2l7J48k08J49k1r7R8k7o8K5rM5l9o1kL9K0J09M5j11
5090A31M0np1M5M7m0K1P4K6l7j52O0N2o5N1l9N4M3p0m3J95j45jk1q2M2kK5l0K6j04P1qoo1
4679B1K04j12l1M0J11j55K8P5N1N7j35o5j9J35j72P8M1r2J23j5J29j7q9r4J03p8R4o5m2J15
4327B24j80Q8p2M3N7%l2o3Q6P4k07Q6O2j5M9j32J86k6k5L7n4J26j76m5kJ32n4n1j06J20L5
3963A65l1N9q0L7L6k0r8N9O2l7O8k4o2l2j5K8n6L7O0K0n4K3Mj28J59J70k62J77J9k15LM8N1
3576A71K5j2O8j06n6Q2o0J18J77j63j77J06r3L9N4q8O7r4N5K5P5p9Q3K3j9j70J38j02l9Q3
3224A31J39l5j22n4kKL3M0JK40M26m53l23K38Oj06k5J5J3%M1J7R1j9k02j1J8lL7J1O0n1K4
$$ y = [91, 180, 17, 29, 157, 84, 130, 80, 102, 85, 303, 428, 119, 165, 16, 93, 18, 74, 128, 148, 90, 140, 220, 199, 135, 213, 65, 96, 232, 43, 222, 146, 108, 267, 174, 236, 277, 40, 83, 250, 71, 133, 96, 244, 36, 185, 164, 67, 165, 138, 70, 95, 86, 131, 92, 31, 29, 68, 88, 197, 242, 131, 171, 166, 95, 140, 187, 147, 168, 242, 268, 231, 79, 139, 191, 126, 177, 138, 192, 235, 165, 122, 317, 172, 171, 150, 68, 110, 108, 133, 103, 129, 25, 96, 88, 82, 21, 225, 113, 82, 122, 233, 78, 106, 181, 232, 289, 154, 89, 70, 205, 33, 111, 152, 60, 183, 168, 297, 280, 191, 97, 200, 122, 216, 151, 109, 224, 44, 132, 60, 103, 160, 160, 128, 65, 151, 225, 18, 104, 166, 151, 200, 68, 254, 228, 203, 240, 186, 312, 136, 91, 89, 221, 167, 116, 10, 130, 165, 134, 193, 113, 150, 186, 166, 68, 127, 189, 152, 220, 196, 134, 102, 87, 115, 59, 96, 156, 176, 122, 145, 149, 21, 180, 350, 88, 265, 284, 69, 72, 120, 171, 196, 184, 252, 146, 90, 172, 112, 230, 407, 244, 67, 173, 80, 119, 173, 85, 152, 58, 113, 138, 213, 134, 217, 240, 221, 51, 189, 87, 48, 131, 270, 235, 113, 59, 57, 59, 92, 132, 133, 373, 799, 346, 23, 261, 267, 161, 136, 151, 164, 164, 205, 222, 313, 294, 92, 81, 99, 96, 133, 144, 204, 153, 177]
2837A77j5np1J5%J8J27q0q8Q1q7pJ13p2k3O0l6j8Q3j02J6J16L9j59k6J57r9J00j1j50K04L
2461B60k38J29Q3k8p8Q4p2p7J61l4q1j1j0J4J5N7j40P1k8PkKO8j2j6oJ62J3j96N9j21K6NJ72
2062B38o6l1mK78M89j76n15n4J8Pq5J9M7n1j6m9j9R0J5p3P8J03j23o6P5l1m9K4M7N4R4k47
1686B1J08R0r5r9M3MP8j07M3K5L4jm1J61o4qpo6l5KJ06j16J04rm4o0P8n2K2m7J3Q0L0l0J3
1276A74km8Q0j44J65j13J67l6j02q3k8J0J26K5L7J36m8j00o6n1r1P3J8k8l8N3R9l4O2m2j07
912F4O7NpJ46r3R7j84J00q7Q6O6k1k8j73J22q0J10J00k23k0k2Q0l9K04j7r1oq4O3j10P4P3
536A72j9L7j02%N0l1P0k4j12K06L7j05n4JJ1R2L5j34j4m1J07m4N3Jj3qo1j1M6j26K7lQ9N6
137A88o8j4o4K6J0K6j6Q7K9Q4k59K10j74m2J26m1J02K4m1r4P5k3j16J67l0j49R9o
$$ y = [177, 162, 157, 86, 101, 101, 119, 246, 166, 78, 159, 72, 65, 178, 106, 83, 143, 107, 89, 172, 70, 86, 202, 241, 82, 56, 213, 114, 214, 203, 53, 257, 260, 22, 151, 234, 206, 128, 212, 140, 63, 224, 190, 109, 98, 88, 102, 117, 174, 34, 105, 77, 84, 82, 84, 152, 140, 124, 118, 280, 293, 97, 156, 35, 61, 66, 238, 172, 141, 137, 415, 904, 728, 213, 159, 177, 184, 99, 118, 165, 114, 98, 49, 30, 120, 135, 62, 140, 243, 120, 54, 129, 98, 49, 73, 120, 174, 268, 21, 129, 219, 124, 25, 68, 72, 150, 43, 86, 111, 145, 144, 103, 264, 200, 192, 185, 119, 84, 86, 192, 76, 180, 171, 127, 67, 145, 93, 115, 68, 81, 161, 191, 161, 174, 172, 124, 204, 60, 225, 112, 279, 243, 141, 58, 30, 40, 166, 191, 228, 364, 316, 216, 150, 99, 8, 81, 99, 71, 33, 86, 185, 151, 213, 171, 64, 131, 136, 129, 275, 182, 279, 95, 195, 108, 194, 260, 239, 211, 38, 160, 80, 190, 290, 67, 47, 25, 105, 66, 270, 253, 162, 156, 72, 135, 25, 99, 172, 153, 190, 88, 88, 138, 107, 177, 153, 41, 247, 284, 179, 125, 126, 137, 229, 264, 130, 116, 75, 182, 138, 191, 192, 179, 171, 110, 99, 145, 19, 46, 43, 132, 188, 120, 106, 42, 68, 78, 104, 88, 175, 204, 288, 29, 239, 65, 23, 149, 108, 210, 234, 193, 99, 174, 151, 35, 202, 172, 23, 122, 116]
-192A16
##PAGE=	F1=7371.9
##FIRST=	25164.767445380970457,	5806.2096540000038658,	0.46963644027709960938
##DATA TABLE=	(F2++(Y..Y)), PROFILE
5806D1Q0r2RJ31p3L9n3K0j6J88J32l06O2j16L3o9M8O9K9r1J01M1k5m8N4j83J21N4j15J15o2
5442A18m8J36k2P5J7k05J0J92k00P8p8J30j74R8K1m8N4j0Nm1m5M1Q6j10RM8j1L4O1p0K9O6
5067B46j55O7L7l9K7L7PL2j90Q5j3m3M9l0Q5M4j27J6K24j73j3nj01L0K1Rj9K2q7Q5k4j7rK06
4668B84k09K8M2M3j13P4L7K8R6j70n5j0J27j61P3O1q0R5m0J27mj08n0Q2p8J17o8JO6k05J06
4304A36o6OO1K1m1o7J19R1k23O8K3J9J8r0J29L9o2O6m6J15j74n2PP8p7L4j17R8K2k0O8k7K7
3916A83l0l3m1M7N7p8J31m0n4m1K2j3poP9j6j08Q9k1p1J03J65k21J88nk55J5R3O3l6OO4m9
3529A80r4O8l1Q5J87j59j25J13p1nN3j26M7q8N7M7O8p5Q6L4j9j20R7j62j0O4J36J7j32j21
3177AQ3n3Q2Mk1J19K60k72j36J94kj14n8J00K1lJ5j6J02m4k11P9jq6K46j3j62KO6k5Qn7k8
$$ y = [41, 121, 29, 38, 169, 96, 135, 82, 102, 86, 274, 406, 100, 162, 46, 79, 10, 58, 127, 156, 65, 166, 207, 182, 134, 188, 5, 126, 180, 65, 180, 118, 70, 206, 184, 259, 276, 71, 81, 273, 73, 151, 73, 203, 29, 127, 148, 100, 154, 144, 149, 108, 63, 104, 190, 80, 89, 137, 126, 160, 221, 151, 180, 246, 91, 158, 195, 156, 183, 220, 227, 259, 69, 154, 141, 98, 147, 117, 202, 246, 119, 135, 359, 186, 173, 168, 67, 97, 118, 127, 108, 130, 43, 128, 104, 87, 78, 284, 75, 103, 145, 188, 75, 149, 186, 214, 310, 140, 85, 75, 202, 41, 114, 175, 95, 190, 150, 277, 273, 165, 115, 197, 119, 236, 168, 169, 235, 30, 136, 70, 76, 137, 158, 117, 50, 169, 260, 37, 105, 128, 147, 165, 75, 204, 243, 181, 247, 201, 316, 142, 90, 97, 175, 98, 132, 15, 113, 135, 115, 183, 156, 183, 153, 120, 79, 126, 183, 105, 236, 196, 142, 101, 123, 110, 103, 97, 176, 160, 52, 141, 120, 49, 152, 317, 96, 284, 279, 24, 39, 132, 195, 159, 165, 229, 180, 86, 154, 123, 208, 395, 236, 111, 224, 153, 148, 201, 75, 122, 34, 91, 138, 206, 131, 217, 251, 232, 112, 209, 47, 37, 101, 237, 254, 122, 1, 84, 31, 113, 117, 96, 215, 475, 203, 67, 261, 259, 145, 87, 187, 208, 205, 220, 204, 306, 262, 51, 130, 129, 43, 289, 276, 114, 116, 182, 157, 165, 108, 80]
2790H0J3P0R8p4j06O0r3M3J29j45PQ6m6n4Q4j32Q0J04J8j30J6J01q4Q2k0r8J41qj67J04O9
2426B28k4j03R9m5n3J23p9k7p1L0qL0O3j37J20j22M5J9nj4NNM9J81k9j60N7j13k2L7J38ok7
2038A84q4J46K77r4k97pN3pn0M5Qm0j0m4n4N1K4k6N9R7q3q4J04n4k9n3O4O3R3k23R7Q6o3p4
1639G5m9L5O6j01O7%P3j3n4J73o4j37K21K12rm14J58j70R4L5L2j43J07m0m8p1rM2J48n7k2
1276A37J6KO6j35J66j30J41l6j27n5O9p6J27M2jJ60J1j42r7j1j04P5M2m0j7MJ00k3P6j06m2
912I2O3J8q0J82l0K7j36L7l9R5O4m2m7j67O5j4Q2P5j69n0L3N8n6J90j3l1j4j43O9p8RP1QK9
513A58l1j00J89p6P6l7o1J40L1r5j19l3N7J10O8r3n3n2O6j0O2o0Q2n1m9m0M0q0Ok3Q0N1l1
125A22l3l9L3k2k7O3P4N7O8k74K26j90k3J14n3J43j0q1k8N4n1m3J18p6j07N4L1
$$ y = [80, 93, 163, 261, 187, 81, 141, 48, 91, 220, 75, 82, 168, 122, 68, 152, 20, 100, 204, 222, 92, 108, 209, 125, 207, 187, 89, 230, 222, 55, 159, 228, 204, 101, 200, 155, 102, 225, 146, 119, 48, 78, 70, 100, 163, 26, 146, 24, 69, 88, 83, 69, 74, 79, 128, 309, 280, 120, 177, 64, 42, 79, 217, 211, 184, 100, 246, 523, 429, 132, 125, 178, 171, 121, 166, 174, 134, 124, 80, 26, 77, 101, 75, 134, 231, 148, 64, 168, 114, 85, 32, 96, 159, 252, 29, 126, 212, 149, 75, 26, 61, 127, 26, 93, 93, 166, 153, 99, 272, 208, 71, 292, 504, 495, 81, 239, 69, 163, 198, 230, 87, 194, 154, 106, 35, 26, 68, 216, 159, 137, 153, 155, 221, 86, 252, 122, 263, 227, 100, 45, 114, 38, 165, 207, 206, 366, 377, 235, 138, 127, 23, 98, 140, 100, 83, 87, 187, 164, 240, 134, 92, 155, 173, 93, 275, 245, 272, 136, 173, 134, 229, 293, 251, 204, 37, 102, 88, 170, 245, 76, 26, 59, 117, 61, 251, 238, 207, 193, 50, 119, 41, 50, 121, 129, 158, 127, 27, 216, 140, 216, 179, 118, 258, 289, 194, 75, 42, 99, 209, 277, 184, 131, 79, 145, 135, 197, 137, 219, 168, 119, 79, 119, 39, 45, 22, 102, 153, 122, 89, 50, 83, 61, 34, 97, 171, 228, 296, 22, 248, 58, 35, 149, 96, 239, 229, 148, 120, 174, 123, 80, 198, 122, 15, 69, 100]
-192A00
##PAGE=	F1=7269.64
##FIRST=	25164.767445380970457,	5806.2096540000038658,	0.58382928371429443359
##DATA TABLE=	(F2++(Y..Y)), PROFILE
5806FO4k3J1J14o0On4L8rJ31J30k69P0m3m4m0LQ6L8j04J36Pl5l8K5p5J12o8l1M6l4n2J03L2
5407A79O9lj60K0J68j95R0j12J00q8JO1KoJQ2q4o5L9J81j58M3O0o9l6P4pj6J31j61L0K5n0
5020A46L1OlR5k15J20q3m0M7l4J44L9j69Q4K14j86l2J0r3K6K7j8QPp2R2n0KJ9K07k97Q5N2
4632A69j5q9J11NJ1J08j48q2nJ16j30O0Q4o9O1p1J26nj27L7M3p9J40p7M2J9j50L7n0j6M7M7
4257A50l8n8J16R2k06M9j8N2ml3M6J02r8R5k5P8j63n5J6L4r7J21j15O6J0m2J02M0Pj00m4K1
3881A01K0N4j16J71l8l4o0N6m7N0m1O6n4q4J23p3k1M5J55j65J84j5k56J1J29N3o5kL6J7j21
3517G9M2LN2J69j38o0J14o3k3M0j30ROm2P8N0n1Q6M2l7n0N2j85L4k2J33N0j31m5Q6j04R4l6
3130A02l3K8J19j00%J25j0r3q6J44M0j1j3m1Q8m5j68J25oR7O88j08o60j26J20k7J3k9p9L6
$$ y = [6, 70, 47, 58, 172, 112, 118, 64, 102, 93, 224, 354, 85, 155, 112, 68, 28, 31, 117, 155, 51, 187, 194, 159, 121, 146, 71, 183, 115, 84, 130, 96, 44, 147, 179, 248, 245, 85, 105, 273, 78, 168, 56, 156, 68, 69, 130, 132, 126, 127, 209, 125, 60, 99, 280, 122, 165, 225, 156, 120, 194, 187, 171, 302, 141, 171, 196, 146, 177, 183, 180, 275, 60, 180, 97, 57, 104, 70, 214, 253, 84, 168, 382, 196, 164, 174, 81, 107, 134, 116, 124, 131, 59, 151, 101, 103, 122, 329, 32, 117, 169, 154, 65, 176, 181, 192, 300, 152, 70, 65, 181, 51, 111, 195, 126, 187, 116, 242, 237, 110, 147, 190, 111, 251, 174, 216, 235, 85, 122, 72, 56, 103, 150, 112, 54, 170, 262, 56, 105, 87, 139, 135, 102, 148, 250, 152, 247, 222, 300, 137, 82, 98, 132, 35, 156, 41, 107, 117, 75, 177, 217, 224, 124, 80, 101, 121, 175, 59, 230, 192, 158, 98, 154, 107, 157, 116, 182, 128, 44, 167, 94, 73, 118, 273, 108, 292, 277, 21, 32, 161, 214, 149, 147, 183, 200, 79, 121, 124, 176, 345, 207, 147, 261, 198, 175, 215, 85, 94, 100, 58, 136, 186, 135, 221, 263, 226, 176, 228, 43, 77, 55, 188, 238, 107, 62, 148, 44, 138, 102, 69, 97, 216, 116, 116, 241, 231, 138, 52, 196, 236, 225, 212, 171, 259, 214, 46, 171, 165, 262, 950, 842, 182, 56, 176, 149, 162, 133, 54, 90]
2778I0J09N7n9j02M4j11P4J32j95P9J22n4j38P0o8Q6O0Jp3L5L5n2O0l0n6O3l3l2N3N0k8j13
2402G6J03j7MO4j23K4n9J6n7M1N4q1J42j33NL7J8q6j9L5Q1J71n3q9N1j25l1N5O3L5nj22P1
2015A46N2k6r9K6P4j7j0N6j7l1Ok9j23L8K9J8J6R3n9p4J29o4k0j00L8Q7Q9j71P0O2j7n9p4
1628C9L6L5p2O4K5L7k0n4J96r1r6L87R83j27j101N7j99R4kJ39k11J00rj14l9K1o2K08r6l1
1276I7L6N2M1j17J54j50J20m3j30M4Q9j18J00M1n8J81O1j75j20N9j15N6M7m1J5n3Q3K2Q1j81
923G8O3J9K5j39K12K5m0n7k9j7R4O4o7n0j21k8Q5J4N2j05m2M8M4m6J37j5M5Jk27J02m8o5P8
536I0nJ7N1j29K39j02O8m3j3R7j0p0j13k3rJ24J02m0p4q9K6K1N3p6J49p9l1k8k2k6J6n3N2
149G0N1rk6j3M6J4r2O1O3P9M0k62K13j75j7P9n4J83l8q5KK9o7K7N4j07m2J0N6
$$ y = [90, 199, 256, 197, 95, 139, 28, 102, 234, 39, 118, 240, 186, 48, 118, 50, 136, 196, 197, 124, 159, 194, 142, 202, 172, 116, 179, 146, 114, 167, 217, 189, 76, 179, 162, 166, 230, 107, 131, 72, 88, 31, 72, 126, 45, 187, 54, 59, 96, 114, 28, 9, 44, 125, 296, 243, 154, 205, 80, 49, 104, 167, 202, 197, 75, 146, 198, 172, 73, 99, 173, 156, 146, 202, 185, 154, 160, 131, 8, 46, 75, 93, 109, 202, 143, 69, 198, 134, 114, 14, 52, 139, 228, 57, 127, 189, 172, 113, 39, 75, 110, 38, 102, 127, 164, 144, 90, 286, 195, 99, 486, 1469, 1342, 241, 298, 99, 193, 191, 330, 119, 219, 210, 96, 57, 78, 16, 224, 128, 97, 133, 185, 226, 109, 263, 113, 233, 190, 60, 104, 193, 75, 175, 216, 158, 339, 400, 225, 105, 164, 49, 105, 152, 111, 126, 73, 156, 178, 259, 78, 141, 160, 185, 46, 258, 283, 243, 186, 157, 140, 234, 298, 231, 181, 60, 32, 117, 131, 183, 78, 36, 84, 128, 82, 219, 204, 249, 250, 23, 125, 77, 12, 90, 85, 102, 153, 24, 263, 161, 229, 186, 173, 270, 260, 190, 77, 54, 45, 169, 271, 231, 157, 68, 94, 115, 168, 92, 241, 162, 131, 103, 81, 55, 71, 18, 70, 121, 112, 86, 73, 119, 133, 41, 102, 165, 244, 284, 22, 235, 60, 43, 122, 68, 251, 213, 128, 130, 159, 92, 119, 173, 66, 24, 34, 90]
-192I0
##PAGE=	F1=7167.39
##FIRST=	25164.767445380970457,	5806.2096540000038658,	0.61280381679534912109
##DATA TABLE=	(F2++(Y..Y)), PROFILE
5806D0jL8OQ9l3m6o0P4kO3J19k16Q1K4j22j8oP6L6q4J41qm4m6j0L4J00j83N8Opp8Q2N8M5j6
5384A90j11M3J31j56R2j46Q8l9p4R2N7q1J4J38j01p6N1K31j93Q1O5j25o5Q0M4q0J73j42j7
5043A64J2o1M0j5lJ46k02J30j24o6L4m5K25K2j68J07J79j79m3J3r0M6K8n3M4j6n5R7q5M7J6
4679A45J96l20J04P1l5j11J40j8kR3r9r1k6R9q2K8J04n7L4r9J32k3j41J40rp6J57r0Q0j9r2
4316A33k1m3j7PQ0l1k8O6Q2j52L0n8P9k5L1k7J41j25J24nK6j37n6J6Oo4J50j14M7K9q0J04
3940A68J13j7j60l1N3rM3j35J89l0nr3Q5o7Q6o6N3q6MJ07j29J5qJ51r8J52lk37JJ36M2o4k8
3553A32mP5j35J0L0L0J32r6j0J01n7j4K1j06k4P4j49J21K5j1Q6M1o2J9Kj54K7o7R2O1j06L8
3177A22Q4j47R9p0k5j4J8J0Q0N0k3n3q8J40N7k2l5n3N1j6r5J27kL48J235k23j217k70R3k1
$$ y = [40, 39, 77, 83, 172, 139, 93, 33, 107, 105, 168, 287, 71, 152, 176, 54, 36, 30, 106, 142, 58, 199, 191, 147, 101, 91, 125, 225, 42, 100, 106, 99, 21, 103, 161, 206, 190, 79, 122, 253, 97, 189, 43, 131, 92, 18, 110, 167, 86, 100, 238, 137, 61, 112, 343, 150, 231, 296, 171, 106, 186, 230, 150, 323, 181, 164, 176, 115, 155, 140, 137, 283, 81, 211, 87, 21, 55, 10, 235, 257, 89, 196, 375, 196, 153, 166, 76, 122, 150, 97, 141, 125, 70, 167, 82, 129, 145, 341, 21, 125, 196, 161, 50, 190, 172, 170, 263, 164, 73, 47, 146, 64, 92, 196, 139, 173, 74, 206, 183, 42, 182, 173, 97, 254, 164, 244, 225, 133, 112, 69, 52, 59, 139, 108, 80, 146, 228, 76, 106, 48, 127, 102, 133, 106, 247, 122, 246, 241, 267, 130, 74, 90, 96, 32, 182, 68, 115, 144, 64, 168, 281, 264, 104, 73, 126, 117, 160, 25, 214, 184, 179, 86, 171, 104, 190, 124, 177, 91, 95, 202, 73, 88, 80, 231, 133, 285, 282, 45, 46, 182, 224, 160, 132, 128, 203, 68, 78, 108, 138, 270, 174, 164, 265, 208, 194, 215, 109, 85, 159, 10, 131, 156, 145, 231, 272, 210, 229, 231, 77, 104, 37, 129, 190, 84, 122, 206, 59, 158, 88, 63, 49, 67, 77, 157, 207, 184, 131, 43, 183, 240, 218, 183, 130, 181, 165, 70, 197, 195, 543, 1778, 1555, 338, 68, 161, 140]
2825A40R%j23O8J27K0m3q6M0j34Q0J18j99J70K22j24k39L7L4N2J5Jj1K7l0qL5m6k3j8m3R8
2449A66LL2m2r8R6qP3J1j44O1Ml1j02L1J9%J45j20m1M0N4l0l3n0O2J54n2k3N9j48JK1KM4J9
2038A75j21J13r8n1O9J0O1k4L3M5j7k3K9j4j47NJ3N1l8R6n7m4J55o3l0p3l3R9Q4j23L7L7L1
1651A87n7p1M4%j5L2J04q0j9o0K44j51J32M38J940k70j939r8k07J04j07K63k61N9L6j61J9
1334A06K5o2J39j30QK7R0J8r2J23j64J05n9j04J11J03j22O8K8j26K00Q5j92j26J36j35M1L6
1006A37l5N4j09N9Q3Q1k53J82n8K9j45K03O4r7L0p2k8Q7O5r0m2m6m4Q9o3L8n6kL4L3rO5k8
618A56J24L8k89J28m8q4M2l9RJ26j11K09j04N5m2K8P7p0m1n9K3q3O8J32J9q0j36j6O1J3OJ26
243B38r2j1Rr7J3N1m1k4O4k2J8j0P6M3j07j1O0R0Rk29J75j36k2M5n8K08n2m1j9Qn9O9j0j04
$$ y = [140, 149, 149, 26, 94, 221, 241, 198, 112, 152, 18, 98, 216, 17, 187, 409, 285, 46, 83, 117, 169, 184, 185, 174, 201, 171, 163, 198, 152, 129, 111, 68, 166, 169, 201, 159, 61, 157, 149, 222, 233, 89, 150, 154, 123, 21, 52, 71, 71, 216, 96, 55, 95, 149, 119, 86, 36, 98, 252, 200, 177, 236, 88, 89, 110, 112, 156, 175, 54, 167, 69, 18, 87, 97, 158, 134, 167, 212, 195, 172, 201, 187, 40, 45, 58, 109, 71, 167, 110, 66, 221, 158, 128, 55, 22, 121, 205, 82, 119, 156, 187, 130, 59, 103, 103, 88, 120, 224, 144, 125, 65, 309, 158, 290, 728, 2668, 2398, 459, 361, 154, 258, 151, 414, 153, 212, 248, 87, 106, 131, 69, 208, 78, 86, 113, 203, 221, 129, 252, 88, 193, 134, 30, 141, 244, 122, 190, 218, 92, 292, 377, 185, 59, 195, 60, 101, 137, 102, 156, 47, 106, 189, 270, 17, 199, 141, 170, 25, 228, 292, 195, 225, 153, 125, 212, 277, 187, 145, 99, 55, 144, 81, 119, 63, 61, 95, 128, 119, 184, 156, 280, 318, 29, 157, 109, 25, 67, 28, 37, 163, 52, 261, 157, 212, 170, 198, 275, 205, 164, 105, 128, 45, 113, 245, 264, 184, 48, 32, 93, 106, 112, 238, 146, 135, 144, 47, 60, 111, 70, 46, 110, 88, 106, 96, 172, 215, 108, 97, 157, 247, 256, 27, 202, 66, 44, 89, 31, 239, 187, 146, 127, 135, 76, 145, 135, 31]
-156C1K1k3N3
$$ y = [31, 52, 29, 82]
-192H2
##PAGE=	F1=7065.13
##FIRST=	25164.767445380970457,	5806.2096540000038658,	0.52791827917098999023
##DATA TABLE=	(F2++(Y..Y)), PROFILE
5806F6k7P4pO9%o8p2Q3L%J03j66J02P5j94kM0K0J8k9J13om6p0m1J20P9j97P0K3rj16P8N4M
5395A44j3p2O2R6r7Q9j83J18l3q2O2J09j58L7J52r5p7O8K40k05J12N9j65l4Q2N1j39J77j12
5055A93n6qo5N9k8J1J82j74J26j30q9J4M2J84jj45Q9J32j54l8Lj05Q1L4q5P7l9l5J04j28J02
4691A53qJ70k54O5J00k3j71J65l5j7O7n7m1o3N3k2k5J19n1K5j13J45n3p4J51o1o5J59j03J15
4339B51m4m7l3n9Lm9J03k5KlO9p2J3q0P9l9P4m9J41j34J49Ml6r6n0MrMJ31j10L2P3o5J3J86
3928C31l7k01KM5j9J9j15J75k4K4j34J04o9R3q2N3j06O4J01j68L5n4J74m0R5K6k30j0J32L8
3576B22m7n1m2J09j36j0L6J5R1m7J7P3m7J6Kp0k6R4j52P8kL3R0K8q6P6n3r3qk2j7M8k1Q1O1
3165B40j72J02r9Nm1JK6J23j6m4j2n0J02N2l6l4o2RL3m5J25%O31J785l48j789l38qrnK4j39
$$ y = [66, 39, 113, 106, 175, 175, 107, 35, 118, 121, 121, 224, 58, 160, 235, 41, 39, 79, 99, 117, 88, 201, 195, 149, 79, 38, 158, 237, 40, 110, 133, 124, 8, 86, 140, 144, 131, 59, 121, 217, 120, 209, 26, 144, 111, 29, 91, 200, 42, 79, 231, 136, 59, 127, 367, 162, 274, 333, 168, 134, 216, 267, 128, 305, 193, 137, 129, 64, 123, 95, 106, 288, 114, 240, 110, 21, 35, 77, 261, 260, 115, 204, 336, 182, 144, 147, 42, 123, 157, 72, 149, 110, 75, 179, 51, 153, 145, 315, 61, 126, 226, 203, 32, 197, 162, 145, 212, 155, 114, 51, 104, 82, 57, 176, 125, 150, 37, 182, 129, 55, 206, 145, 80, 239, 136, 251, 207, 160, 127, 68, 71, 22, 125, 100, 102, 99, 168, 96, 109, 29, 108, 69, 143, 94, 235, 101, 250, 254, 218, 122, 72, 76, 67, 71, 202, 92, 124, 197, 132, 145, 331, 294, 93, 95, 140, 121, 140, 25, 200, 176, 200, 66, 170, 101, 194, 112, 165, 59, 123, 224, 56, 91, 37, 211, 171, 266, 292, 62, 52, 184, 222, 175, 124, 82, 191, 55, 45, 81, 96, 187, 140, 157, 230, 183, 199, 201, 131, 105, 199, 47, 125, 123, 156, 246, 274, 188, 264, 211, 118, 110, 88, 71, 119, 98, 179, 240, 68, 170, 71, 76, 35, 36, 62, 185, 169, 125, 113, 63, 165, 217, 181, 147, 85, 94, 127, 82, 207, 207, 838, 2623, 2275, 486, 148, 140, 131, 126, 150, 11]
2790A1Q8J31nl1o6M0j53O6R1j29K31L51k28l39K4R8Pj5J9L0Rq4L6Qn8pq4N1J03l6K2n6p6R1
2391A40k3J44l1j47R4O9p9j13Om7P9J42j12p1K6Q5K2l5j11K0J40k4kQ7j64M6n0JJ2J8r1J96
2015B27n5q9L2j1L0l2Q4J1Pj9N4mj52k1j7P3q7J01o2rJ79n4o4l4k9M7P8q1LK1O8o1p1O8k9
1604A02N2j2J98k24mn5K71k15L62M90K914m11k791k61k01J09k25L68k81j1Q4j74O5L9q6O6
1299A69j38P4nJ01J1o8P1j55Q9p4l7J05J12r8M4K2k04K19P6j91j06J93j58L7J7k3Q9j40M6
959G8J17P4k30K15j45K8o8J23P9j34J01q4o5Q6O3j01l0K9mK1r4J2j8L0J3J8M7ln7J93Q9l21
583F2J30o7n9k6mJ9J06j09J54q1M8l7N5P7j20l0KN7p3n7J56P3p2j52j7O3o8J31M8r2PO1j26
196E9nR9k1r2P7n6P6k1J17M7j21p8O9Q9j8j90J19p5l2N0n4J63m4K7o8j0j8O8o3k4J6m3L1
$$ y = [11, 99, 230, 225, 194, 128, 168, 15, 81, 172, 43, 274, 625, 397, 58, 82, 180, 187, 172, 191, 221, 230, 146, 182, 190, 132, 125, 41, 92, 195, 159, 181, 125, 49, 140, 117, 261, 230, 83, 177, 246, 167, 54, 60, 13, 92, 234, 122, 51, 77, 162, 184, 149, 38, 58, 198, 174, 172, 259, 95, 141, 91, 92, 104, 122, 31, 227, 172, 83, 115, 104, 134, 102, 186, 197, 204, 185, 239, 235, 83, 62, 45, 118, 31, 132, 70, 61, 240, 186, 122, 88, 59, 106, 184, 103, 106, 127, 195, 134, 63, 131, 102, 154, 142, 340, 116, 112, 57, 328, 113, 475, 965, 3879, 3468, 677, 416, 215, 324, 99, 467, 186, 175, 259, 85, 150, 189, 103, 169, 31, 105, 100, 201, 212, 144, 215, 60, 149, 75, 38, 143, 255, 157, 201, 223, 19, 238, 314, 123, 17, 210, 52, 89, 106, 83, 172, 32, 78, 195, 269, 39, 254, 109, 137, 69, 192, 271, 137, 238, 154, 89, 175, 238, 137, 107, 136, 132, 153, 59, 71, 53, 83, 96, 114, 161, 158, 101, 294, 383, 62, 192, 125, 66, 40, 36, 55, 161, 52, 206, 125, 173, 136, 191, 268, 148, 118, 120, 177, 104, 47, 203, 276, 204, 52, 35, 98, 30, 161, 209, 117, 124, 185, 59, 54, 153, 132, 40, 117, 61, 137, 116, 233, 280, 159, 81, 150, 239, 221, 31, 150, 75, 43, 93, 39, 202, 158, 185, 117, 107, 89, 157, 94, 70, 86, 43, 74]
-192G4
##PAGE=	F1=6962.87
##FIRST=	25164.767445380970457,	5806.2096540000038658,	0.34760862588882446289
##DATA TABLE=	(F2++(Y..Y)), PROFILE
5806H6l3R4k2N8L3m9q4N0Pn1R1j33J31J02k42J0Q7l0k1M7O2%l4j00oJ13N5j17RO1k9j08N4
5419I1L7m6On4P0P0m0Q1j77J40m0p6J2J52k06N8J11p5m9O8K13j87J29M4j79J9R0K2j65J35
5067B54p8p1l3n9O7k7L4J91j44J29j17j21N7P2J28k0j32N8Q4j19j8j6r8Q8M1j06R8n4rJ13
4715A92j74J44l8J31j58K6J26pk24J79n0k9M2l7M8q7j3L1r0J31n6L5r4J41p7K4R2j04l5J36
4362B05j13J46n1k9lq1J9l4N0j6J0m7M2J1Pp6M1j3N1k1J19j23J66lr9m7m1lj9N1J16j11J5
3975A19J21k5j09K45m8k16L0K3Jj7q3J55k8M6j74J15o1P1p9O5j03P4J01j82M8p9K10mL0N3
3623B99k17l7J21M0l1n2p1J19j32K5j0kO4j1K2M0k8M6j4l6lQ3j10J3k0O5J00Jj05J18r9k4
3247A54n3M3j25K7J06Q0Qj69J03j24M5p1J4N6J02n5o8KK2P0J0n9J8r5L0M1l7J30j0Q92K219
$$ y = [86, 53, 147, 125, 183, 216, 167, 83, 133, 140, 89, 180, 47, 178, 280, 38, 48, 135, 105, 84, 131, 193, 193, 159, 59, 53, 166, 221, 104, 113, 174, 145, 37, 91, 128, 82, 88, 34, 104, 174, 134, 215, 38, 178, 138, 62, 74, 226, 20, 78, 189, 114, 65, 133, 346, 159, 288, 332, 153, 172, 262, 284, 119, 254, 176, 105, 72, 13, 80, 53, 87, 278, 134, 263, 146, 25, 82, 154, 282, 262, 130, 188, 272, 153, 135, 119, 21, 109, 150, 44, 142, 88, 79, 192, 18, 162, 124, 255, 97, 123, 249, 242, 18, 197, 147, 118, 160, 123, 171, 84, 71, 102, 12, 143, 87, 122, 28, 169, 92, 116, 208, 104, 69, 205, 92, 238, 187, 158, 155, 74, 93, 59, 109, 93, 103, 56, 98, 109, 116, 40, 81, 68, 119, 98, 217, 94, 260, 257, 158, 111, 70, 67, 48, 99, 215, 104, 119, 240, 215, 106, 351, 303, 87, 117, 140, 141, 124, 41, 196, 168, 214, 40, 155, 94, 165, 86, 151, 48, 122, 223, 41, 89, 10, 220, 216, 246, 299, 82, 45, 166, 206, 175, 123, 52, 171, 39, 64, 54, 52, 116, 105, 127, 167, 139, 185, 171, 135, 132, 215, 105, 118, 98, 163, 263, 264, 159, 277, 178, 154, 101, 144, 19, 46, 152, 232, 240, 71, 174, 50, 95, 24, 38, 94, 196, 141, 73, 75, 97, 167, 177, 118, 136, 41, 71, 112, 75, 205, 195, 1087, 3306]
2884C306m59k251l82r4Lk7L4q7N7J28k7j4m7M0j61M0N8m3K82M64l25m19N9R8n0k6L8N3mj20
2531A24O2j7m8j3p8J20M3n7K4n6p5R6n0K06o1j48J31J30j28j25pk9N8J40j03p5k3J05O7l1
2179A82j53K4R8K2m0J29j57Q4j35O3k5l2LK06p4j18M0j3Jm0J38l0M1k2P5mj47l7n1R0r5Q0
1804A03k5QJ69m6j10Rk3MP2m0l0K3Q2n2q7R4n6J32o6K78l53L1nK18k34N22N25L699n23l469
1452H50m03j80J05k69L77k65r9J24j49R5P2j29j7o9O9j6Q3K3m6jj09O2l7mM7J10n3L2L0j79
1099E4J38L2j66j1J67j79M1J6j7J01j25N6Q2O6j77K17k09J7J0M2P7j48J33o1j11J00M3q5j6
759H7P5L3n7l7m0RK0KjJ08m8j04K41J41l38J15r1oq7O6K6M0j13O9m3O2l3O6Q4j14p7O5P7m5
360A52j25J28J10n3j29RM8n5J06k3q9K2J17j24n4J48Pj42P7n8R1l0J56K8j29j35R0Q0l5j55
$$ y = [3306, 2847, 596, 214, 120, 123, 96, 130, 43, 100, 228, 201, 187, 140, 180, 19, 59, 117, 74, 356, 820, 495, 76, 135, 233, 183, 157, 195, 248, 244, 124, 186, 169, 121, 108, 30, 150, 193, 136, 160, 104, 29, 125, 75, 281, 220, 72, 203, 333, 205, 80, 73, 44, 102, 242, 139, 64, 41, 146, 213, 182, 29, 53, 151, 173, 133, 262, 105, 189, 54, 117, 92, 60, 63, 269, 195, 77, 117, 104, 105, 65, 203, 173, 214, 192, 267, 263, 116, 79, 28, 118, 23, 103, 78, 86, 255, 209, 99, 108, 85, 89, 161, 121, 91, 114, 196, 144, 57, 151, 95, 227, 161, 439, 86, 117, 112, 330, 96, 618, 1143, 4842, 4319, 850, 447, 267, 372, 103, 480, 215, 116, 240, 91, 186, 258, 129, 112, 43, 112, 96, 179, 202, 156, 155, 46, 108, 71, 67, 114, 224, 171, 203, 233, 54, 192, 224, 58, 47, 214, 35, 76, 92, 75, 176, 51, 107, 189, 255, 78, 295, 86, 103, 113, 155, 232, 84, 217, 156, 45, 145, 188, 103, 87, 162, 195, 138, 101, 61, 70, 90, 92, 91, 199, 151, 47, 288, 429, 91, 206, 115, 109, 22, 88, 114, 154, 41, 110, 67, 129, 96, 162, 246, 132, 55, 120, 197, 152, 27, 155, 265, 212, 83, 92, 140, 85, 191, 168, 79, 101, 218, 94, 40, 188, 195, 53, 130, 72, 163, 133, 289, 317, 188, 53, 143, 223, 188, 33]
8C3N6Kk9O9m4N5%P7j15k3L2L9q5N8lm2j7
$$ y = [33, 89, 91, 62, 131, 87, 142, 142, 219, 104, 81, 113, 152, 67, 125, 122, 80, 63]
-192F3
##PAGE=	F1=6860.61
##FIRST=	25164.767445380970457,	5806.2096540000038658,	0.15201623737812042236
##DATA TABLE=	(F2++(Y..Y)), PROFILE
5806A07m3J07l4O0N7k7r5K0Pr1Q6j10J57J03k55J4J21n8p4J24J%pj21N5N0L3l8m1R2n1q2L5
5419A02K1q3K7n0N8N8lO8j15J31m3r0j8J72j87L7L9n3J4M4J58j40J29K3j68O5R9k4j47O2m6
5055A40m5j6mm7mN7J63j12J41q8j67J16Q1P5l0j33K7N0r0Pl4rK7K4j06R7m8J1J22j78J20n8
4679H9J00o2j1J37jk37J72o6k7L6n4J45j03m6M8q7P6p4O2o2J20q3P8L5j26J5Q8j25J69l8l2
4316A36L7q8J7Lj5J5k4Ml5O3J7q4OO4m5K5R6r2J70k3j54jk8J5l5P4R8j17rJ59L2k21K71m5
3916B86k02M0JM7m8p0J41l6N3j95J17n8L1n1Q0p1L2J02j68N8m0K03Ok2O4j90p6J01M0j9k7
3553A29r9J19j24P5o2nM7j9K1K7PL7l0j1L1O3n2m5j3O9J10l4j16J41j06J7q4J01j68K2J60
3189B08O9o7j35R5j42P8l3K6M3M9o4p1l3J14N2m7j00J20j57J21jo3J36m1J078K436n30k490
$$ y = [107, 64, 171, 137, 197, 254, 227, 132, 152, 159, 68, 154, 44, 201, 304, 49, 63, 184, 126, 52, 176, 177, 177, 170, 49, 104, 154, 187, 149, 108, 200, 149, 67, 102, 123, 40, 67, 17, 75, 133, 130, 198, 83, 214, 171, 81, 63, 235, 48, 85, 124, 71, 85, 129, 287, 147, 276, 299, 131, 196, 295, 271, 124, 186, 140, 95, 79, 75, 28, 24, 81, 244, 132, 273, 185, 18, 134, 215, 290, 260, 127, 154, 204, 114, 121, 87, 78, 105, 129, 23, 120, 72, 83, 205, 27, 147, 89, 189, 127, 116, 253, 252, 15, 187, 121, 94, 130, 76, 221, 118, 72, 120, 33, 109, 35, 97, 35, 155, 72, 150, 185, 59, 74, 162, 37, 206, 168, 136, 173, 85, 102, 105, 90, 105, 81, 85, 50, 113, 130, 46, 52, 116, 71, 96, 192, 100, 270, 247, 93, 92, 64, 79, 44, 118, 216, 99, 90, 249, 281, 60, 331, 286, 84, 124, 125, 172, 124, 54, 195, 159, 212, 17, 134, 76, 107, 56, 136, 65, 97, 199, 31, 89, 49, 252, 258, 236, 300, 110, 34, 135, 175, 156, 129, 30, 149, 25, 100, 38, 33, 80, 61, 82, 109, 116, 153, 123, 112, 143, 206, 154, 109, 96, 165, 275, 241, 125, 266, 160, 177, 93, 194, 26, 48, 208, 277, 210, 75, 170, 28, 106, 73, 99, 142, 191, 127, 56, 23, 137, 189, 142, 42, 162, 5, 126, 125, 62, 198, 157, 1235, 3671, 3141, 651]
2860F51m06j37J3o1K8pK0J16n6J3k4L4j52ML5K8L11N28l85m45J02O0j11k6M2O7jj32N8l8%
2496A29l8k2R9qn4L9m6p5Q2o4K42q0j42J58J79j67j38k2QK1J42q6n2o3P0R1j9j62P3L1P0j27
2121F9J68j25J08k02J30k5l4M1J57j30j27O4%j4n4J91n5N8l0R1j9j36l2q7J04n3K1M2K1J23
1768B65m4j47L9k8j7O5No1M2P3k2j12J01q3K16j20L27m14N3L9J29j79N61N26M116n78l814
1452I38m94j50R7k17K75k11j82J41r0J11J08j69j04J7J8J3L9N0k7q1l4K8N1l2k3R2lL2M6j30
1099A09N4l3o0J5J39j75J8N5k8P4r6O8K7O1j37K24k23pN8j7O5j42J17j3j12J00nm2QO9O4j30
724A05M7q5K4j7J6mJ41p2j33K38J83l33P7j12O9j01Q2K8jq5n8RP7k6N3Q8n0j37R0P7j5r9M7
337A23J07k7r4K3O0j8J2m9r1K7J60j13r6J85L7j65P3k7N0l0J80rj26j71J16P1m4j23OO7j8
$$ y = [651, 245, 108, 121, 60, 88, 81, 101, 217, 161, 174, 150, 184, 32, 36, 71, 99, 410, 938, 553, 108, 210, 270, 159, 133, 175, 242, 241, 109, 167, 129, 129, 91, 69, 168, 160, 106, 145, 99, 24, 106, 42, 284, 204, 62, 220, 399, 232, 94, 72, 80, 101, 243, 157, 105, 42, 112, 203, 184, 22, 95, 126, 196, 69, 237, 112, 220, 18, 148, 123, 89, 130, 287, 157, 30, 94, 94, 80, 26, 217, 162, 220, 190, 281, 262, 126, 94, 7, 111, 58, 79, 121, 142, 265, 221, 74, 113, 85, 68, 133, 138, 77, 119, 192, 170, 58, 159, 76, 292, 172, 499, 85, 138, 177, 306, 127, 688, 1214, 5330, 4752, 938, 444, 294, 391, 174, 449, 238, 56, 197, 107, 218, 326, 157, 53, 70, 88, 101, 140, 190, 163, 82, 48, 76, 127, 95, 72, 164, 161, 193, 239, 109, 163, 130, 70, 85, 224, 49, 67, 122, 94, 168, 72, 140, 167, 228, 91, 315, 92, 85, 143, 126, 191, 49, 166, 153, 41, 141, 136, 94, 102, 171, 235, 105, 152, 67, 91, 74, 90, 86, 227, 155, 22, 260, 443, 110, 187, 75, 144, 43, 125, 153, 152, 67, 9, 18, 95, 69, 122, 210, 160, 23, 113, 190, 175, 76, 123, 230, 203, 109, 132, 192, 174, 186, 137, 46, 73, 233, 120, 24, 209, 246, 81, 154, 127, 177, 147, 327, 318, 192, 21, 137, 208, 164, 41, 47, 114, 96]
-27I6O8l9n2O9R2j47k6O9Pp1J19k9l0p1
$$ y = [96, 164, 125, 73, 142, 234, 87, 61, 130, 137, 66, 185, 156, 126, 55]
-192E5
##PAGE=	F1=6758.35
##FIRST=	25164.767445380970457,	5806.2096540000038658,	0.13624711334705352783
##DATA TABLE=	(F2++(Y..Y)), PROFILE
5806A28n4J06l6O9O6j9q9JLj21P7q4J70Q5k31J0J37o5r4J54n2j4L1j21Q7j4J6J9p0J11p4m3
5431H9K4Ko3J7m9K4N8RN1l1J12m5j14k7J66j52J3k3m6R6OR0p2J11Kj41R1J02o5r7j2k6J1K4
5032A35Lj04J6M7Q2p1J59m9j90J46P6L3l3j41J5L9r0K4l8O6Mk0q8O9k1K1J25j60N4n8J25k5
4656A51m5J22mk00J34p9J8L8r9K14j12m7L6n9J5m3L8m7J06q3R7j0q2K5L7r5J32pl1N5p5j0
4280I0M7o6P4j03J01p3L6M5j18mJ47j00J0P1m5J60n0j71J5qN2o2Q1P5j28l8J79R7k74K30k8
3916B42j56K9j5J00n9p9J23m2M8j63R0p7j0J1Q1k5m0R7j12N5j8K09%m7M8j58r6O4K7lJ4j09
3541B9J05j18J06p8L6Ko6K9P1L1l8l9LN4N1Nr0K1M9J17p1j20J48o6Op3J28j65L2J47O5j44
3165A67p8P2j49R2K1L8NMm8n3l7J40L8p8j02J63j57J29rq4J13r1J155K381n43k444m11j28
$$ y = [128, 74, 180, 144, 213, 279, 260, 171, 172, 175, 54, 131, 47, 217, 302, 71, 81, 218, 153, 59, 213, 161, 147, 178, 57, 144, 130, 146, 165, 95, 206, 132, 89, 113, 115, 52, 69, 20, 44, 102, 111, 162, 131, 243, 198, 84, 57, 223, 71, 84, 61, 15, 111, 117, 207, 135, 246, 248, 107, 198, 300, 235, 138, 126, 100, 111, 135, 138, 34, 50, 97, 179, 108, 267, 218, 28, 174, 250, 283, 250, 109, 124, 163, 73, 97, 59, 125, 129, 109, 21, 90, 69, 90, 215, 55, 109, 51, 176, 151, 106, 228, 224, 24, 158, 79, 97, 135, 36, 250, 138, 91, 127, 68, 83, 40, 78, 31, 137, 54, 151, 141, 59, 84, 121, 26, 158, 151, 120, 175, 100, 90, 137, 71, 145, 42, 143, 70, 106, 151, 33, 29, 176, 76, 86, 157, 112, 272, 222, 51, 66, 58, 110, 48, 129, 204, 76, 38, 217, 314, 40, 270, 242, 86, 115, 100, 200, 141, 62, 185, 143, 191, 28, 118, 41, 31, 42, 123, 98, 58, 155, 43, 98, 80, 289, 289, 242, 290, 132, 36, 100, 127, 124, 138, 29, 134, 16, 122, 44, 80, 82, 16, 45, 116, 147, 109, 70, 73, 127, 178, 183, 93, 114, 163, 280, 209, 89, 237, 171, 177, 104, 232, 67, 99, 246, 311, 167, 89, 161, 12, 104, 125, 163, 168, 172, 124, 71, 34, 174, 212, 134, 32, 195, 38, 167, 158, 74, 187, 96, 1251, 3632, 3089, 645, 234, 106]
2837A06K1j09J2Q8j6J00q7M0PK0j30l4M0N8L06N26l95l98J29Nj70j7K4P6K3j23K3n0P4n0p
2473I2M6l5j5N9n2l8K5m4K33q4j01J32K12j79j50n1M8oJ47o0k2m8k7P6Lj09P5mJ08k00J55
2109A86p3J10k10J63j4J2K0Q9j90j0k7L0j7n2K08m9L8l0R3m5j27Nq5P9j5k4Q7N2O0m8j37K5
1733A04m4LM6M4r2P2M5J7j18P9j08K90j63L34l78L3N3M1r0N02M85M067n62l736n20j18R7j41
1405B42J34j22j92Q0j2J18J27j90j43L9m2P1j9Q4rj60N3OJ10n8o2M7L0L8N9q6jq0P5k5J44
1041B56j64k7J12m5J9p1O6j8O2j14K33j99k9P6m6N3j31O1M9n8P0o9NM0L3P9j68J10j24L3o3
677C1N3L3J23q6r0J53K01l02J9j24J54j00P7K4om1qk5mpJ7P1K1r3J9N3Po5L5L8Ko0L0Q2J0
266B42r4k2q2LJ79r5j18K00O3j58R0j8j5k1J82n2j13j38R8O5m8r4J8O4rM8l2j05J08Q0j61
$$ y = [106, 127, 18, 30, 118, 102, 202, 115, 155, 162, 182, 52, 18, 58, 116, 422, 948, 553, 155, 284, 289, 119, 102, 126, 202, 225, 102, 125, 75, 149, 99, 92, 138, 103, 88, 147, 95, 57, 82, 38, 271, 187, 86, 218, 430, 251, 101, 50, 98, 92, 239, 179, 157, 109, 82, 158, 161, 52, 127, 123, 231, 31, 186, 113, 223, 13, 176, 162, 174, 194, 283, 93, 83, 56, 86, 69, 17, 225, 176, 214, 184, 277, 232, 105, 110, 25, 104, 89, 65, 152, 204, 264, 216, 79, 104, 60, 63, 109, 153, 61, 133, 178, 195, 77, 156, 48, 338, 175, 509, 131, 164, 217, 258, 168, 670, 1155, 5222, 4660, 924, 404, 286, 383, 242, 376, 254, 62, 142, 130, 248, 375, 185, 42, 81, 39, 110, 91, 175, 166, 6, 59, 65, 175, 117, 55, 102, 132, 170, 229, 143, 142, 62, 137, 112, 256, 92, 65, 177, 132, 151, 80, 146, 128, 190, 76, 309, 110, 81, 157, 111, 164, 33, 94, 143, 85, 155, 86, 91, 131, 164, 243, 75, 185, 61, 94, 31, 84, 117, 240, 154, 64, 217, 418, 116, 135, 11, 165, 65, 142, 166, 160, 119, 111, 86, 82, 75, 92, 163, 184, 91, 110, 163, 170, 105, 140, 178, 180, 120, 150, 232, 242, 148, 126, 44, 47, 226, 131, 13, 213, 276, 118, 208, 190, 175, 154, 336, 284, 171, 33, 131, 196, 148, 54, 72, 136, 127, 175, 143, 38, 146, 226, 65]
-98F5j4P9rl3J63o2k4j10
$$ y = [65, 51, 130, 121, 88, 251, 189, 165, 55]
-192E5
##PAGE=	F1=6656.1
##FIRST=	25164.767445380970457,	5806.2096540000038658,	0.24973937869071960449
##DATA TABLE=	(F2++(Y..Y)), PROFILE
5806A47o1Q7k7Q1N1k3o1lnj35M9n5J73N7j82JJ36n5p5J35q6l3O7j06Q8o5MM6p3J20r9jK1k6
5407I2JJ1p8J0M8J0K6M4Q7m7j37j2J37j12r%k1Q3l0K4jQ8j4j17R6J01q8l9m2l3M4M7J5r0q
4996H6M9m1k1J74j4j85J46N9Pl2j45M0M6j12J2j6R1J5n6q6N5%L2J19j51mj9J82o3p5Q3j5j24
4609C7P0p1J08J5j25K17j13m1K1l1k7L3l3l8R8q2Q4l3K3k5J5j9J8L1J5J9m7n8Q8p5J23j94
4233CJ81q2j1Q8j52kK03p5p6M1%J38p6r4l5J8P7r3P8M8j37mJ12J57k30J02jq7jj9J39m7r4
3846F9Q9m1L4j00O2r9L7KN9K5j12P4k9L7rK20j7n3J7j29q3J4mM5L7q1O1j07J04m9P2n4n9J2
3447D4J16L4j26pK5LM7N1j18O7K8J12r5j22J32Jl9k4J26j47K2J26P7j81l7L2j23O0P5L5l5
3083A59j5k3m1KJ21J6p4n8J19j36J06J9q3O1j50J116K065m97k122l99q0L5j08K3R2m3P9p1
$$ y = [147, 86, 173, 146, 227, 278, 255, 194, 191, 186, 51, 100, 45, 218, 275, 93, 94, 230, 175, 100, 235, 149, 116, 183, 77, 165, 100, 104, 150, 77, 197, 98, 97, 118, 92, 93, 104, 26, 36, 84, 94, 120, 164, 251, 204, 67, 55, 192, 80, 71, 71, 50, 133, 103, 127, 126, 214, 200, 83, 179, 280, 192, 153, 111, 78, 122, 169, 184, 94, 86, 135, 94, 73, 247, 233, 48, 194, 253, 260, 228, 83, 123, 169, 57, 69, 53, 144, 159, 103, 17, 72, 72, 104, 223, 72, 68, 49, 231, 168, 93, 176, 161, 37, 107, 36, 144, 159, 34, 251, 138, 97, 118, 87, 60, 93, 60, 22, 120, 38, 122, 89, 112, 87, 102, 83, 101, 132, 147, 166, 119, 61, 149, 74, 197, 3, 184, 102, 91, 179, 27, 25, 228, 153, 77, 118, 118, 256, 180, 86, 51, 69, 146, 53, 131, 179, 42, 38, 150, 307, 77, 179, 178, 91, 90, 71, 210, 163, 69, 158, 117, 151, 51, 113, 14, 51, 53, 112, 137, 25, 99, 70, 107, 98, 318, 301, 248, 265, 136, 53, 67, 63, 108, 145, 64, 125, 18, 122, 73, 145, 91, 32, 44, 160, 194, 68, 61, 86, 89, 136, 187, 69, 136, 164, 276, 181, 59, 191, 192, 153, 129, 255, 108, 130, 256, 333, 152, 115, 147, 24, 84, 159, 194, 159, 144, 121, 80, 82, 203, 219, 145, 87, 206, 70, 176, 195, 112, 173, 23, 1139, 3204, 2707, 585, 186, 106, 141, 33, 56, 148, 105, 184, 113]
2754A13J9M7nr9o2O0N0K68M58l52k96J39m8k19Pk4Q3N9j00k2n9J48l1k3l3m4N9P7r2J3k7k4
2379D0K06p1m4O5K24j57j56r2Q6j8J50l4Mk5r1RL7m2M0KJ26j70L0pQ3j74J81kM8qK2k32J25
1992A55j31O5j2k9J81k1k0pQ0q5j20P0p3M8Pm1R1R5kn9p5l0n7O8J5N2j22J02QM6r2L9j09L18
1592C55j82K99k75j3L3k4LL74M05L566m74l249m84r1J13p5pj3j51j3N7J18J16j87j21kl1O9
1264A16n4R6J0j03J3kJ16o5n4PJ2M4O3m3l8o8J43o5J75j67o9J71o3m5n5M5m5P3j10K44j62
900A20m7Q5m3L9j25LR2%M7j28L4P5lP1j38J12j43K5l8K9R3P7r9l3O2J90k45m1mJ02r5P0J1
513A55J9oJ6l5n8Rj8K6P6l6k7MJ3l5R1o7K0l5L4J02L0j86K6n3l1J61o7j04J76Q0j23J29m1
125B45r0oJ63q9r1o0N7N2n2o3M2L3JK1l0o4O7O1j55RO2KMK04j04l5j20
$$ y = [113, 132, 179, 174, 75, 13, 73, 123, 391, 849, 497, 201, 340, 292, 73, 80, 56, 139, 198, 98, 76, 17, 165, 134, 111, 78, 34, 93, 170, 78, 91, 64, 40, 246, 175, 131, 196, 420, 263, 107, 15, 101, 83, 233, 199, 203, 178, 87, 96, 133, 91, 131, 133, 259, 89, 119, 112, 195, 21, 202, 200, 248, 240, 262, 30, 155, 24, 89, 77, 48, 229, 208, 188, 181, 261, 176, 56, 126, 53, 101, 108, 67, 158, 253, 251, 192, 117, 87, 30, 98, 113, 165, 43, 145, 153, 199, 107, 146, 37, 355, 173, 472, 197, 184, 217, 193, 196, 570, 975, 4541, 4067, 818, 334, 243, 356, 281, 274, 261, 110, 97, 154, 272, 388, 201, 80, 78, 47, 116, 62, 158, 168, 65, 78, 76, 192, 127, 73, 80, 92, 136, 199, 156, 118, 50, 193, 128, 303, 136, 67, 238, 175, 130, 75, 120, 75, 148, 38, 282, 120, 73, 158, 115, 154, 29, 32, 124, 124, 171, 43, 77, 152, 149, 220, 82, 194, 51, 76, 38, 67, 160, 237, 138, 105, 167, 357, 112, 71, 67, 169, 74, 144, 155, 174, 168, 184, 149, 91, 100, 82, 108, 184, 148, 121, 125, 138, 103, 194, 127, 147, 112, 146, 248, 278, 92, 118, 65, 34, 195, 128, 24, 200, 280, 157, 286, 245, 155, 149, 312, 223, 132, 72, 129, 181, 129, 66, 108, 141, 142, 163, 133, 69, 136, 197, 42, 51, 113, 115, 119, 323, 219, 184, 64]
-192F4
##PAGE=	F1=6553.84
##FIRST=	25164.767445380970457,	5806.2096540000038658,	0.31552088260650634766
##DATA TABLE=	(F2++(Y..Y)), PROFILE
5806A59n1M6qQ8J3l4j5Oj3j32Ol6J72K5j23mJ20l6m2R6r5m1Q2q2O7j01pN2n8J27j20K9K3n7
5407E6Q3K0j28L4J3J8KP5N5n0j45J9R5p0k9O8j1L9n6k0M8P9k5j08Q5R9q0kl0n1L2M8M1o1l4
4996A09P4j54J0J75Qj64J34L2kk7j37Q8M7j07j4%N5M3o5j00Q6k1N4J06j56PJ6K01j22j00L1
4632A07k8k9j0M0J30k6j37J77j05m2J0Ln3R6q8j1P0o1L6l5J20r0L2L4o9L8Q6l9j5j22J21l1
4257A09J32k11J69q1m9J40j38k8K21l9j42J6J5J03r0J7o4J3Q5j15O1J8r9O8m0J95j42m3K6
3916A07qm5rJ49k0r6L6l2J9l1N0m8M6m5L2O8j41OO4PrK26l8n2j3j00m2l7k9J31Km3J3q6P0
3506A02K0R5j29l0pJ33M1j67N4M2r4K9P9j21J01K4R4r7j26R4O0q6L9J08j05j5J03R9j53m8
3154A39nr3QJ22J0o5kkl7M0J10j6o7l1P4r0O2O5o6mj01Q81J566m02j612l63k2N9o9M7K6n8
$$ y = [159, 108, 154, 146, 234, 247, 213, 198, 204, 191, 59, 65, 29, 201, 226, 103, 99, 219, 183, 141, 237, 142, 101, 183, 101, 168, 67, 60, 112, 54, 181, 61, 90, 113, 56, 139, 159, 31, 65, 78, 96, 98, 173, 228, 178, 33, 52, 147, 77, 48, 116, 105, 144, 88, 68, 116, 195, 170, 62, 147, 246, 166, 164, 134, 83, 115, 163, 204, 143, 109, 183, 29, 39, 214, 222, 58, 192, 224, 222, 195, 58, 146, 193, 86, 72, 72, 127, 170, 105, 5, 91, 70, 124, 230, 74, 81, 97, 298, 176, 76, 107, 79, 50, 40, 80, 210, 184, 47, 224, 119, 77, 87, 90, 37, 133, 45, 34, 104, 43, 79, 44, 164, 74, 106, 140, 71, 109, 195, 156, 141, 19, 140, 109, 241, 30, 199, 118, 69, 209, 71, 43, 264, 225, 83, 99, 114, 217, 127, 144, 80, 93, 178, 63, 124, 142, 43, 111, 71, 266, 124, 81, 107, 99, 54, 45, 194, 174, 78, 114, 82, 101, 70, 120, 72, 118, 73, 105, 173, 32, 38, 102, 109, 100, 326, 288, 236, 223, 123, 81, 44, 15, 146, 148, 105, 118, 32, 102, 122, 217, 88, 58, 51, 184, 225, 58, 112, 154, 60, 89, 168, 47, 148, 172, 266, 169, 43, 137, 197, 111, 150, 258, 153, 138, 241, 340, 187, 139, 134, 41, 49, 171, 181, 116, 114, 112, 75, 115, 225, 209, 142, 111, 185, 95, 157, 222, 156, 152, 51, 932, 2498, 2096, 484, 121, 99, 158, 89, 136, 162, 104]
2778A04O3Mn9Q8l7o2p5O1L1K12L40k72j67J30p9k53N8o8N2R7p3k9l6J35Ql2o7l6O8R5j48O2
2402A15m2m4J85m5lj0K11r9j55p8O0j4J43j9K2jj07m9N6kj3L3J19j34o7N6K5q7J74J0N6l9
2027B57k6k07J80j80Q0Nk5J45J8j04N0M9j32q4J16o8L2J3l8O1J39n0p5Lr3j6R3NK2j39J20
1663A51l5N7k9qo4K69j73K36j44o9j7n0P9K08L01K739l35k465l98q1J47l5j21R5j12n8Q3J06
1334B77Q3j64q4m5L7J2l1N8K6n1j2j7Q3n2l6J6n0M3O0%o9l2J76r1K10j73j00K19p7j07m2N
959G2n9R7r7K30j27n1Q8k5J5p7LK9N2L6j43LJ16j7K7n2N7j13j3O7p6J50K7j12L3j4J42j65
583A03k6O9J6r2O4oN8J7Qk4p2Rm0k7J01K2l6n3jj9J81j48J2k6L6J13L8k25M5rm2J02l3o8J26
172A73Q6p0J74q1j66J3J25j04o9K4L2K2o0k7N5pJ5ml0j6K1N2j26K7K8M1K8K40j49o9j06
$$ y = [104, 167, 171, 112, 200, 163, 101, 26, 87, 118, 330, 670, 398, 231, 361, 282, 29, 87, 19, 71, 168, 95, 66, 30, 165, 173, 141, 74, 38, 106, 201, 53, 115, 73, 29, 214, 169, 166, 156, 367, 268, 113, 35, 95, 81, 224, 205, 227, 226, 119, 70, 126, 124, 111, 144, 263, 129, 62, 118, 143, 56, 230, 240, 296, 257, 231, 24, 204, 24, 104, 109, 84, 229, 247, 143, 193, 242, 110, 26, 142, 74, 106, 119, 81, 142, 281, 231, 156, 159, 66, 50, 143, 148, 170, 31, 151, 116, 173, 144, 136, 72, 341, 168, 404, 260, 191, 174, 124, 203, 411, 712, 3451, 3116, 651, 253, 172, 319, 284, 163, 258, 146, 88, 171, 277, 360, 196, 112, 67, 104, 116, 85, 143, 169, 118, 106, 89, 172, 120, 84, 100, 50, 93, 153, 153, 84, 52, 228, 137, 347, 174, 74, 293, 216, 109, 67, 72, 13, 110, 13, 243, 116, 65, 153, 128, 143, 66, 69, 98, 150, 186, 43, 46, 162, 145, 172, 120, 177, 64, 51, 118, 42, 192, 219, 107, 140, 126, 268, 103, 77, 146, 162, 70, 134, 128, 186, 203, 211, 187, 115, 124, 84, 57, 158, 180, 144, 91, 90, 71, 252, 104, 116, 90, 126, 239, 277, 52, 97, 88, 46, 148, 115, 47, 173, 259, 189, 363, 282, 116, 129, 254, 150, 81, 105, 137, 159, 99, 72, 127, 120, 135, 131, 101, 85, 106, 158, 32, 59, 87, 128, 156, 396, 247, 178, 72]
-192G2
##PAGE=	F1=6451.58
##FIRST=	25164.767445380970457,	5806.2096540000038658,	0.30635339021682739258
##DATA TABLE=	(F2++(Y..Y)), PROFILE
5806A63k6rJ5R0l8m7L7K1j5j27j1m3J56kp5NR8j6j1N3q5k8P0m9K8j22KL8l7J23j20L8K3p0
5407B9J50K8j69O3k0L0oN4Rn2q0OO2l7m0J15jNp4l1O0R3k8j16O0J00m6Jj0n8JK7P4k8n8J13
4985B26j40p3J64Pj33J18J%j6j14J28L8p8j3j8j8P4m9o2Q8p1Q8R3j75P2K0J80j64j16jn3O1
4609F4j4J10J15p4j45J21q4o2J2M1o2J28r4JK5k4lj0J53j52P2P8q3l6J54p9Rj37R2L5J11k20
4233D2J47p5p3J94j06o4K14j3j64J8k1N7p9J16o3j6Q1j16L2j2j5Q8j08J47m2r5l3O7r6L5J04
3870A51J5o9l8%mK7N1mL0o8RR9j46k8J07l2j2K20o0n3l0m1Jp7M7J19p1ol1m9QJ18J06k15j1
3459F3k4J34O1j60Q8N2j26m3R3q2R1L9O9q1j30M6Q8r9P7Q4l6p8Q6J21r4r0k6o8l4J45l6p3
3083E7L9Ml8P0J16n6q1qL3k1NJ11l7o4j4N71R97k81j038k92RR0k5O4n4o2O4P1j35J24o9k5
$$ y = [163, 137, 128, 143, 233, 195, 148, 185, 206, 191, 64, 53, 10, 166, 164, 89, 94, 192, 176, 165, 218, 133, 105, 175, 126, 154, 32, 34, 72, 35, 158, 38, 76, 99, 29, 179, 207, 38, 101, 81, 111, 105, 159, 168, 116, 36, 42, 104, 67, 27, 142, 141, 146, 72, 41, 101, 194, 166, 50, 110, 210, 164, 165, 155, 97, 98, 125, 199, 171, 113, 226, 86, 13, 177, 184, 51, 169, 170, 170, 154, 40, 168, 206, 128, 115, 97, 79, 153, 104, 42, 130, 59, 147, 240, 65, 137, 157, 337, 173, 57, 56, 3, 64, 50, 160, 275, 201, 56, 177, 93, 31, 43, 84, 22, 150, 56, 57, 82, 58, 55, 45, 198, 46, 118, 196, 113, 77, 231, 152, 161, 24, 116, 151, 262, 42, 189, 114, 41, 235, 129, 65, 279, 266, 102, 120, 99, 156, 77, 193, 130, 114, 195, 79, 111, 99, 84, 172, 64, 211, 169, 74, 41, 108, 12, 47, 151, 166, 97, 59, 59, 55, 82, 133, 129, 159, 91, 100, 199, 53, 25, 132, 100, 88, 308, 248, 195, 165, 124, 125, 48, 95, 214, 143, 137, 106, 57, 65, 183, 289, 74, 63, 39, 173, 234, 74, 162, 214, 88, 45, 138, 56, 147, 186, 255, 174, 44, 90, 178, 79, 156, 240, 204, 126, 212, 333, 239, 149, 123, 55, 21, 166, 130, 57, 96, 100, 62, 132, 248, 192, 111, 103, 136, 115, 120, 231, 194, 130, 116, 687, 1684, 1403, 365, 73, 82, 172, 147, 211, 157, 95, 159, 230, 95, 219, 150, 125]
2708A25q2N4OJ53K02j77m9J07p5k56R8l1m6J10m9Qm8R8N0k3k9n3K3J09j73O9k7o9J61k1J0
2344A75o9J77k6j43l5MJJ31k2K4K5q1l2J3%n9O0Q7r5o9P2n1L2J42K1K9o6m9j39J67k03J07
1968A28L2l7J11N5k04J33Pj67M0N7p8L9J9m0K4J70o7j06P5j45M1Q5J6k1j26J06o6N3N1n6j1
1604A18J82j35J68k8j26q0l7J31L6J93J781j74j564k81r7J93k6j69J61q5n0O4Q2L7j24l6p3
1287F1P5k7J7NL6j5j9m1L9l5j7L5r4L2N5L7r7oJ97r6K27j63j17K41q4j48j7l0MK6j9J49j05
900A06l4P6j1j5Knm6R2M0j26p6J67Jm2L1k0m7n4J56j34J41j4j24J01o1O3p5M2P4n7q5N4k3
513I7R4L1l2Kn5%n6k7O6O2j8q3j9l7K72j83j1l6L5J04L9j75j1N2m0K5%k4O9Q1j9K12j17k35
114F3L0P8r0m3Q7K5k5o5RN5n4L9k2l3J7rN5p6K9JP9M4K66j93j13q4
$$ y = [125, 43, 97, 103, 256, 458, 281, 232, 339, 264, 8, 106, 75, 29, 139, 90, 98, 50, 148, 198, 175, 146, 93, 116, 225, 52, 121, 94, 25, 186, 165, 175, 106, 283, 257, 114, 79, 83, 84, 215, 193, 217, 242, 161, 129, 142, 142, 83, 143, 230, 135, 66, 138, 87, 119, 261, 282, 311, 245, 196, 57, 224, 21, 128, 160, 123, 234, 289, 85, 218, 225, 58, 98, 155, 77, 116, 135, 95, 119, 289, 222, 116, 191, 46, 87, 172, 188, 167, 41, 147, 81, 134, 185, 129, 118, 300, 165, 333, 305, 179, 99, 62, 193, 229, 422, 2203, 2029, 465, 184, 87, 280, 254, 85, 246, 161, 111, 175, 257, 294, 170, 134, 61, 136, 109, 126, 131, 167, 152, 133, 92, 131, 96, 79, 114, 20, 52, 107, 144, 47, 41, 238, 142, 369, 206, 89, 330, 246, 98, 81, 51, 55, 81, 62, 211, 106, 72, 148, 137, 122, 124, 119, 73, 165, 205, 79, 3, 170, 171, 129, 160, 140, 93, 39, 195, 61, 202, 188, 64, 165, 104, 167, 92, 134, 208, 151, 66, 120, 97, 191, 222, 190, 192, 137, 137, 81, 54, 120, 182, 164, 81, 62, 25, 297, 114, 103, 67, 102, 206, 245, 70, 59, 111, 71, 96, 96, 72, 141, 222, 203, 415, 298, 63, 93, 171, 81, 38, 125, 150, 125, 60, 69, 124, 70, 109, 87, 54, 71, 62, 117, 41, 70, 71, 150, 194, 460, 267, 154, 70]
-192G0
##PAGE=	F1=6349.32
##FIRST=	25164.767445380970457,	5806.2096540000038658,	0.23296500742435455322
##DATA TABLE=	(F2++(Y..Y)), PROFILE
5806A62jo1L9Q7p9n8P5L3j0j27J6k2O7k5m6L1P7%RJ8o9%M2rj3j23N8qk2Q2q6L4Rk5J49K4j76
5372E2Q6n2L2NJ8n4m8O3q0O7l5j4R8J3j0q2k0M5J22k2j33L3R2j4j0On1j5PP7Jp6J47j20j22
4961FJ37j6j00J03k6Q%o5J28K4l3%m8q6P9j3qP8j21J22Q4j94J29K8J21j79j14L1j5K4L9J11
4586B34Q7j15j36N6m5k9J1J6n2J16m9k1k6K1jOJ33j96J19J22p8j33J94q6K6j11K5R1P6k08
4233D7J23p5p1K32p4r7J92qj46L4p9Pj6J56m4n8O9r8J0m2N7Q6q7N6L1o0j37J09p7L9J1N3j8
3846A25j12P0m9N3N6K5ln9rJ09j43J6P8p4j0J89p7m9k9O5J3j10R3J08j44K0o8Ko6K25J13k88
3470G0j2k1J02R2j51J11N1j10j18R7k3M4P2M7o5j24J4O3m9N3O9M5j54Q1J31l4j42k2n2JQ9
3107A55r3j5O3j7m5R1J41r9j21J1J3M6n4J41Nj03M7K94M82j54n42j70j3J15K6O3j33n3Q1R6
$$ y = [162, 161, 100, 139, 226, 147, 89, 164, 197, 187, 60, 76, 54, 121, 96, 50, 81, 158, 158, 167, 185, 116, 116, 158, 149, 136, 13, 71, 63, 41, 123, 37, 71, 80, 55, 204, 228, 52, 138, 86, 118, 123, 141, 87, 39, 102, 22, 89, 54, 40, 138, 151, 141, 59, 39, 84, 206, 184, 51, 84, 176, 162, 152, 158, 107, 92, 99, 176, 177, 101, 248, 128, 6, 143, 127, 27, 130, 104, 112, 112, 47, 175, 199, 166, 166, 118, 32, 111, 98, 90, 168, 47, 169, 253, 59, 188, 216, 337, 158, 44, 75, 60, 84, 123, 234, 321, 206, 70, 126, 81, 52, 63, 79, 27, 143, 94, 73, 47, 68, 67, 73, 206, 10, 129, 251, 173, 40, 234, 148, 174, 63, 88, 179, 255, 47, 170, 95, 24, 256, 182, 85, 277, 269, 123, 157, 78, 85, 69, 225, 181, 123, 192, 94, 104, 62, 119, 205, 118, 174, 205, 145, 8, 117, 40, 79, 90, 143, 125, 13, 83, 34, 87, 143, 168, 165, 106, 97, 206, 63, 79, 157, 83, 73, 262, 185, 136, 107, 172, 185, 75, 168, 276, 132, 152, 84, 86, 20, 245, 358, 70, 58, 37, 139, 231, 80, 191, 242, 132, 14, 111, 88, 132, 204, 251, 186, 62, 76, 139, 90, 143, 212, 257, 103, 184, 315, 281, 139, 117, 65, 66, 155, 62, 47, 110, 93, 48, 139, 280, 181, 60, 71, 84, 130, 76, 217, 222, 119, 166, 460, 942, 788, 246, 76, 63, 178, 204, 267, 134, 81, 162, 258]
2754B58j76J50q7%q6M5k3J10P2r0K9P4l5k05P9j6o3P9l2L2p8Q3Q1mOp3j1J14j48K6mn4J23
2367A76j9or5J27M2j23J4n4L1J09l7OM6j5jm2j9n8L7M2m6j4O1q4J12J02K8k2q5n2q5J39k11
1980DJ59N9o0Q4Q5l05K19l6j40R6%j08P6L2o5J1J81n6j51J26j83Q5O0L9n7r2P4o3N7R1r1K4
1604A55Q8p7J25L4j81j29J2J44j01J01Q91k5p35j56j27K25l6j04J25p1k2K2N2lp4K1q8O3k7
1264A02N3l5M4Lk0o3L2n5J4L7r4QN2O4q3nJ71p9K12j23j23K27p9j54J2j0J0n1K6J02r7qN6
876A46j4l7Q4k8q8J07O3j22m7J29K6o4M2j05K3p5K08j30O8l6j34J62q4k5J2Q7P4j06n5K3k8
513G6J11L7q9K8k4lo9K7j0P3Rn6rl1K51j98j2n3K5P7L6r8p9J15l6m1J6K2J8O7J3K32j32k64
114B9J3L4l4KQ3L4p9l8J7M7p8M3l2k9K6k0O2l0K8KR3N4K77k29j52p0
$$ y = [258, 82, 232, 145, 145, 59, 104, 81, 191, 263, 173, 202, 276, 241, 36, 115, 99, 36, 115, 83, 115, 37, 120, 201, 197, 203, 130, 119, 233, 85, 111, 107, 53, 176, 157, 151, 56, 183, 225, 102, 116, 62, 93, 202, 165, 171, 217, 202, 201, 159, 140, 82, 119, 161, 115, 101, 162, 78, 190, 292, 320, 298, 213, 161, 76, 215, 4, 163, 222, 162, 246, 331, 26, 245, 209, 69, 165, 165, 57, 133, 165, 100, 111, 292, 236, 85, 211, 28, 113, 173, 212, 155, 63, 137, 74, 131, 222, 131, 155, 243, 166, 291, 325, 144, 15, 27, 171, 70, 171, 1062, 1037, 302, 146, 19, 244, 208, 104, 229, 158, 136, 158, 210, 207, 133, 154, 66, 129, 102, 155, 120, 164, 167, 147, 84, 116, 61, 75, 112, 18, 26, 78, 142, 59, 54, 225, 146, 358, 235, 112, 339, 260, 106, 118, 108, 118, 67, 93, 195, 98, 90, 146, 132, 95, 179, 151, 63, 170, 233, 111, 64, 193, 219, 155, 197, 92, 115, 40, 248, 118, 186, 150, 16, 178, 94, 69, 81, 168, 242, 136, 81, 104, 76, 187, 224, 135, 163, 139, 136, 67, 94, 84, 157, 166, 110, 101, 70, 321, 123, 111, 58, 83, 160, 196, 98, 19, 134, 98, 57, 73, 95, 113, 180, 193, 425, 293, 29, 42, 76, 42, 44, 127, 161, 82, 44, 61, 108, 30, 73, 41, 12, 38, 18, 80, 50, 78, 80, 173, 227, 504, 275, 123, 53]
-192E3
##PAGE=	F1=6247.06
##FIRST=	25164.767445380970457,	5806.2096540000038658,	0.14008033275604248047
##DATA TABLE=	(F2++(Y..Y)), PROFILE
5806A56J7r7N7Q4p7o8P3L0Mj34N5Mk0n7mM7N7QJ0Oo2M0QL2m0q9P2k7j4J0l9L8j8K2J26Lj41
5372G2J00q0J5L2J4m5kO9j57R3o9K8M2K4jp6lK1J41rj54K4O5jj0Rk9qL0J0J9q2J60j12r9Q3
4949A14n2n0P9n2J8K7%Q2RJ9J2p0n7j8M5L0O0j58J53P5j88J40M6L4j70p0M5j6K4P1J05N1j41
4562A97j10JJ2L6ln3n5R4J6n7n6O1jJ2R3j55J06J59q0j86J71o6M0q2j8J06M1j44Q6r4k1K22
4186B72n0j25J67k4j06M8j22k7O4J40j3r7L8o4Qo6R1P0o0L1M7l3j54Q5l6L4q8R2L4r4O7q6
3811D3M4N9L6m6k5j8R9j32O1M9j04PJ22q7r%J43Oj44J17R0j94L1r6O2r4K76J22l11l0QL6J08
3423B29j65J29L7p3j36P3K3j1J13L5n9j06K%K9lQ1J08k27R0J18J9j97Om1M9K2j18P3N3m9n9
3048D5J00J75j39j29k0N4N4r2J36N4j07O4R7J23k7k45n9k6J15P9M5j99k8J05P6j75J60q2L
$$ y = [156, 173, 76, 133, 217, 140, 72, 145, 175, 179, 45, 100, 104, 84, 27, 23, 70, 127, 135, 145, 151, 89, 129, 137, 169, 129, 40, 112, 85, 71, 81, 42, 80, 62, 84, 210, 213, 72, 172, 92, 107, 139, 153, 108, 106, 175, 18, 111, 42, 70, 112, 136, 135, 59, 56, 77, 218, 209, 55, 79, 144, 143, 133, 142, 113, 105, 135, 145, 164, 82, 242, 130, 31, 114, 62, 12, 91, 39, 57, 84, 84, 166, 175, 194, 206, 136, 79, 61, 106, 136, 196, 38, 191, 266, 78, 218, 264, 298, 128, 58, 103, 87, 111, 182, 287, 338, 197, 87, 88, 100, 136, 133, 80, 25, 119, 135, 78, 22, 83, 82, 94, 187, 32, 138, 297, 217, 31, 202, 136, 176, 94, 76, 182, 223, 79, 165, 71, 50, 272, 222, 97, 264, 240, 134, 182, 60, 33, 97, 237, 224, 127, 165, 101, 109, 43, 134, 204, 144, 175, 222, 189, 35, 120, 84, 118, 30, 122, 156, 62, 129, 43, 87, 146, 182, 136, 111, 93, 192, 60, 121, 170, 66, 73, 195, 108, 99, 99, 242, 248, 104, 221, 311, 117, 148, 52, 114, 20, 296, 418, 107, 77, 85, 121, 229, 64, 193, 230, 157, 21, 94, 117, 106, 219, 254, 195, 89, 91, 91, 120, 117, 198, 306, 79, 169, 287, 306, 109, 115, 74, 123, 145, 27, 100, 153, 104, 45, 145, 320, 181, 52, 32, 86, 140, 48, 184, 238, 131, 195, 292, 415, 388, 143, 84, 58, 173, 252, 297, 98, 70, 175, 251, 76, 236, 154, 157]
2708A57q6L6m9Q9j7l0N0L1L2j55M6j9n2O1k0K8q7Q5Q0J7K5p7k6J01j03k6J6k3J03l6n1q6P3
2320H7Q4r5O6j11P8P6m9l3N2P9K0r0m4j2l8mL3K3N7o2J30P4K9q6q8m8m9J03j31J58P6q9O6
1933B62J01l29K24p4p9J02l4j61J44N0j10L2J78m3j92J49j98J04K0O9p4n7M2k8P9P0j01K9
1604A75J0j1J15K5k30j6k5R9o6qJ83O5j26n6o0J39n1j5O3p1J5l5K5k5j7P5r3NJ7N9n7N1J1
1217A70k8p0R1j21M8Rp8LL8R2m2j7R9m4J64n8j20J76n8j26L5J4oj09L2J00r5NL8l3k3J28m6
829A68j03J05R3j38NJ03L4l0qj86Q2q3K24r2k4m2p9J49r7o9N8R3Q0j33Pk9j9J03L8j32K8Q
454A14Qq0R1p2N4K5J7lj2J90k19J5n6OL3L9m3p7J19k9p7RN9j2M5J7K27j17j94l4K2j4J7M4
55A12M6j21N3l0L1J1n5qj0MKOJ3K5K0Q9O0K69k50j66o0
$$ y = [157, 71, 107, 58, 147, 130, 100, 150, 181, 213, 58, 104, 85, 33, 94, 74, 102, 15, 100, 180, 197, 222, 145, 119, 220, 117, 91, 107, 84, 187, 151, 100, 14, 87, 171, 76, 142, 31, 109, 185, 136, 103, 155, 234, 254, 164, 120, 108, 70, 66, 99, 122, 179, 117, 247, 321, 350, 264, 176, 128, 79, 182, 51, 209, 285, 196, 262, 363, 34, 258, 184, 105, 207, 173, 12, 156, 206, 96, 128, 306, 263, 71, 220, 22, 126, 146, 215, 141, 84, 126, 98, 177, 247, 146, 175, 185, 174, 289, 314, 84, 68, 43, 142, 76, 68, 251, 316, 190, 134, 74, 213, 162, 147, 210, 139, 154, 119, 144, 119, 102, 177, 84, 89, 106, 165, 108, 159, 170, 142, 72, 163, 42, 90, 99, 21, 24, 62, 154, 112, 95, 194, 150, 314, 256, 136, 312, 254, 128, 163, 177, 171, 62, 94, 194, 99, 104, 142, 109, 86, 214, 168, 65, 170, 263, 125, 130, 233, 267, 237, 229, 43, 125, 42, 266, 174, 150, 108, 29, 178, 81, 12, 70, 163, 243, 110, 117, 88, 69, 172, 210, 78, 106, 114, 122, 42, 133, 61, 115, 140, 157, 154, 142, 332, 113, 128, 72, 78, 111, 150, 107, 30, 149, 120, 43, 52, 111, 99, 144, 161, 388, 271, 77, 43, 65, 51, 68, 112, 158, 37, 90, 60, 91, 102, 47, 39, 29, 33, 35, 41, 54, 79, 99, 188, 248, 517, 267, 101, 41]
-192D1
##PAGE=	F1=6144.81
##FIRST=	25164.767445380970457,	5806.2096540000038658,	0.083252862095832824707
##DATA TABLE=	(F2++(Y..Y)), PROFILE
5806A45K1j05O4Q5m6q1M9J3K3j46Q7L4o4l7L7nL5mKK5p5Q8k4O1l5q4O9k4%m7j3M3m1M6J04
5395B00l3p5J04r9j9Q0L5K4KK2j88Q6j04O2j9K4L2o0R%J39Pj76L5L2nRqjJO9o9K2n5J21j15
4973H9k2K4p3K5L9o6K0N3M9PlO6K1o9k4j14J08L8M0j72J78O1j66J18P0o8j45PJ1k5O3Q3R1
4586C14Pj52p3l0O4Q7k5j09o8Q2O7q9KL8k8J7M3p9P4J80q9j70P8k7N1m9l1P6J4m7N6j13K1
4198I2J90m0j44J49n4o2N4j33QN7J14K1j16j9k4K3p4Q4M6l9N9K5k8j49P2PL0j01P1N9o7N3
3823A64j14L4N4L3r3K4j3O6j09J02K1j11L7K2q4J00J6J50Jj74J18O2k05K9j00J01q1K78J36
3482D64k92n0K4%Q4k00J41J4k7j30N1N1n3J46L6n6q9j0o0R5m7J28J24k75R1R5O4k49N0l5R2
3118A77m2n7O8O2p6p5R9K03j72q0r1J17J4p3O4J04q7M8j2kQ0k05kJ3Q4J24J3k30J1J09L0j31
$$ y = [145, 166, 61, 125, 210, 164, 83, 132, 145, 168, 22, 109, 143, 79, 42, 79, 74, 109, 105, 107, 132, 57, 145, 121, 182, 147, 63, 132, 108, 108, 61, 48, 91, 50, 96, 200, 167, 92, 196, 97, 78, 158, 193, 217, 219, 241, 53, 139, 35, 97, 78, 102, 134, 74, 83, 83, 222, 229, 53, 88, 120, 115, 124, 116, 115, 116, 185, 116, 138, 83, 204, 89, 67, 91, 18, 43, 82, 16, 36, 89, 138, 145, 142, 208, 229, 160, 136, 22, 130, 168, 208, 36, 214, 275, 109, 227, 297, 229, 84, 91, 102, 77, 140, 223, 314, 321, 169, 96, 66, 130, 217, 192, 83, 15, 97, 164, 75, 77, 115, 87, 104, 147, 68, 142, 322, 233, 63, 141, 114, 165, 116, 85, 161, 175, 128, 184, 71, 92, 282, 242, 98, 247, 193, 131, 185, 52, 60, 117, 231, 252, 136, 117, 93, 116, 42, 126, 172, 133, 192, 217, 189, 40, 112, 119, 149, 48, 119, 178, 111, 164, 50, 84, 138, 171, 78, 102, 89, 155, 46, 148, 169, 58, 95, 117, 33, 133, 149, 299, 300, 126, 244, 306, 101, 130, 30, 131, 50, 328, 464, 172, 122, 146, 146, 230, 30, 171, 185, 158, 28, 79, 130, 77, 223, 259, 203, 114, 104, 44, 139, 92, 220, 344, 69, 160, 255, 319, 70, 120, 85, 177, 135, 78, 146, 208, 132, 57, 156, 359, 187, 107, 16, 133, 147, 74, 138, 242, 155, 203, 191, 189, 269, 64, 62, 75, 159, 283, 296, 66, 77, 186, 216, 85]
2743H5J48o1j1q5K4m6P9m2j2K9l0J00j03Ml8j9N7j0mPL0L9L4K7o0k6P4n7o3L0NJ03m2j32p
2332B7j0Q7o1J14j52J25L2l5m1qJ66L5j23o4M1j29L2Q1KO0k9J23O9K8j48p6m4l4N7j7J46Q6
1956C40j20N1J04l03J76j09rQ7l6j20J24N8j55O6J76n0j99J39j78Q6k8J03p5k9K2OR6K7q2
1616A68Nk6M1J23l9k67J17n2M5K0rJ33j20Kj9KO9o6L6L0q4N4j02J3k2M8R7q8m7O5L0o2N8J2
1217A65m9m0J51j47L1l1n9J7NJ33j4l2K4jR3J5j08J01k4p6M6L5k7j49NJ35r2nK8n9L3J18l9
829A83j13R8J16j69P6Q4K2K3o4k33J04n4J69l0j11k9nR8j04NqO6Q9j50R9r0oQ6L2j09m2L8
454G1L7r3J48j16K3K4J10j3J3J34k52N7m7j2j7O0k8m7R8j7q3pP8k5K5kJ95p6j13pM6r2KJ8
55I2M6j14J23o1jR7j33M1n0K9Jn1M0RM5P9O4K40k49j49k2
$$ y = [85, 233, 172, 161, 76, 100, 54, 133, 91, 79, 108, 78, 178, 75, 79, 41, 22, 79, 69, 65, 72, 102, 141, 175, 202, 142, 116, 190, 133, 70, 100, 105, 208, 166, 34, 27, 17, 104, 43, 157, 5, 130, 162, 127, 86, 78, 244, 279, 156, 92, 133, 4, 36, 117, 119, 179, 150, 273, 342, 370, 222, 146, 102, 68, 125, 108, 254, 340, 220, 271, 375, 72, 248, 139, 130, 217, 181, 61, 185, 243, 88, 154, 330, 280, 81, 220, 42, 128, 100, 203, 128, 99, 121, 127, 223, 250, 168, 173, 147, 188, 311, 272, 5, 122, 70, 115, 135, 126, 259, 139, 141, 122, 124, 193, 127, 163, 193, 109, 163, 61, 74, 52, 100, 197, 109, 62, 127, 157, 95, 153, 165, 116, 76, 227, 80, 111, 80, 21, 38, 43, 176, 162, 130, 154, 153, 246, 261, 153, 254, 230, 154, 200, 235, 208, 59, 64, 199, 107, 102, 130, 71, 104, 222, 183, 70, 168, 284, 115, 191, 275, 297, 320, 256, 23, 127, 73, 242, 212, 101, 72, 67, 165, 61, 66, 58, 124, 213, 63, 162, 72, 66, 152, 184, 75, 33, 71, 108, 15, 163, 47, 70, 94, 204, 191, 204, 338, 86, 143, 96, 84, 67, 127, 99, 52, 150, 133, 50, 43, 121, 96, 121, 119, 314, 238, 125, 118, 164, 72, 74, 92, 138, 24, 147, 86, 85, 182, 49, 90, 40, 69, 70, 19, 59, 68, 113, 192, 256, 496, 247, 98, 76]
-192G6
##PAGE=	F1=6042.55
##FIRST=	25164.767445380970457,	5806.2096540000038658,	0.079760313034057617188
##DATA TABLE=	(F2++(Y..Y)), PROFILE
5806A26J0q2O0Q9k6r7M3j3M4j45R4N4n3jK3l8K2m4K1M6q3J10m6P6oj10N2OJ2m9l4L2m5M2J00
5395A90p1j2R5j05n2J38M8P8Mk3k03O5j12P2n5PP4m4J1j7J26J9j87N1J6pL1m9K5nR8j09RM
4996A10L1j25R3m0j4J3M6n3pO5P8p3j4R7K6m2k3j50J37K6K4j59J93L1j40Q6R6j65j19R8n2
4632G4l5J24Q8O7m6j51k1m9J03J28o1j38l4M8P4r3O2J5o6J6onM6J78r8j29j8J3O0j2l6K7L
4245A28M0M4r8K7J46m4j47J35q6l0N7j16L0K8R8M9j03r9J4M2p8O0K5k7R9nl8j21N9N2K5q1
3870H5M0N7l6L1j33L5L7L0j30O6KJ8q3J40pq8O0q2MJ38J7J19Oj86R4K6j69J8m4O9o8K69J55
3482D90k47p6L3j7L9j99J06kJ6j17K8P3o8J50N1m9q6k4q5J24n2J77J04k92P2P2R8k73Q2k8
3130A00J16r6JN6Q4r1r2R2K17j94m2j31J53k0l0l7J49o3K0n5MJ07k16j3P7N0J45k4j97L4Q2
$$ y = [126, 136, 54, 114, 203, 177, 80, 123, 110, 154, 9, 103, 157, 104, 103, 126, 88, 110, 66, 87, 133, 50, 160, 114, 190, 184, 74, 126, 132, 144, 95, 61, 93, 48, 90, 190, 119, 107, 202, 97, 45, 183, 231, 309, 313, 290, 87, 152, 40, 112, 57, 64, 138, 94, 105, 88, 214, 233, 46, 97, 113, 106, 137, 88, 113, 108, 206, 97, 106, 110, 141, 16, 109, 69, 55, 68, 114, 61, 54, 119, 197, 124, 110, 207, 233, 191, 168, 18, 155, 181, 205, 46, 239, 270, 130, 216, 312, 147, 28, 126, 74, 39, 163, 251, 318, 272, 121, 100, 51, 154, 282, 221, 83, 49, 97, 171, 78, 140, 155, 89, 105, 99, 94, 140, 318, 220, 91, 73, 86, 146, 134, 98, 125, 128, 168, 212, 114, 141, 287, 243, 96, 231, 145, 115, 172, 56, 86, 114, 212, 261, 158, 59, 73, 115, 37, 97, 122, 95, 194, 189, 151, 30, 89, 141, 166, 85, 125, 182, 146, 177, 44, 79, 116, 146, 16, 82, 84, 102, 19, 159, 152, 64, 124, 42, 46, 184, 201, 320, 326, 140, 234, 260, 91, 109, 65, 134, 66, 335, 490, 243, 167, 200, 183, 222, 23, 129, 127, 143, 26, 54, 127, 59, 209, 260, 211, 125, 101, 16, 140, 88, 265, 369, 77, 149, 221, 319, 46, 128, 100, 216, 120, 121, 177, 261, 170, 78, 170, 387, 193, 151, 20, 173, 153, 123, 86, 235, 172, 192, 137, 141, 248, 32, 19, 96, 146, 291, 267, 70, 104, 186]
2766A86j5o5J17m0k5q5Oj1P4m4rL3o6Q1m8m0rJ9K7lm9R7j3k1M2J4k7k0M1j8o5L3K0J08k2j69
2344C4K0j8%KJ25j22J04j5J3J6p9J48M6j32o6O7p7O0K3n4O4NJ00Q5K8j98n6l2m5QJ09J23R1
1956C77j45K7J00k67J26j41O4N7j1m4P0N4j79Q8J70p2j67J01j34M9o1J28p1j4K1J9R2pm1l4
1604A55j1N8J31j26j22O0m7JM1j6J99j14o6m4N1L6q6M9K9j04R2j41p%J01R1p6k8M6j7m7N9
1229A47Ro8J6J67j39j2o5j3K4m8J80nm9l1L2K1P2q3K5J7k2M8N2n0j72m5K01q8l6K5q4R8Q1
841B05lj24Q7J19k03J57O8oP3r9k30R2jM7M2j68%L7N1p9K8m7K4R8j43J84j50kP1K2m2n8J4
454F4M7q3J55j47mL6J73m4M8J01k91R8k9l1o1R4m3k4P5%o4j2O8l1J9k1J28k1m9M7O3j62m2
67E7L2J6m9J41o7m0J56j77P5j13O2J2m1%k0P5O9O4J91k25j10K1
$$ y = [186, 171, 106, 223, 183, 158, 73, 79, 68, 142, 98, 89, 122, 56, 137, 89, 49, 40, 59, 86, 83, 34, 131, 118, 97, 139, 153, 126, 106, 147, 129, 64, 97, 117, 225, 203, 34, 54, 36, 36, 38, 163, 41, 145, 130, 143, 159, 80, 228, 274, 142, 76, 143, 66, 126, 149, 95, 159, 164, 264, 349, 377, 179, 123, 91, 46, 54, 163, 286, 377, 232, 259, 359, 92, 218, 77, 141, 198, 187, 143, 213, 267, 88, 176, 346, 274, 107, 208, 74, 123, 62, 190, 119, 105, 126, 145, 237, 230, 189, 155, 144, 202, 333, 207, 85, 145, 98, 99, 140, 124, 323, 209, 143, 99, 150, 186, 100, 149, 178, 74, 166, 25, 18, 18, 119, 210, 134, 106, 152, 135, 88, 147, 156, 88, 104, 271, 132, 120, 55, 42, 66, 18, 198, 193, 144, 113, 145, 166, 238, 155, 180, 197, 175, 223, 275, 225, 53, 8, 209, 121, 85, 110, 26, 124, 205, 202, 78, 165, 284, 81, 238, 306, 300, 373, 274, 44, 136, 135, 182, 224, 56, 56, 93, 144, 65, 93, 46, 70, 168, 25, 209, 59, 57, 128, 150, 108, 50, 64, 111, 28, 183, 36, 32, 68, 241, 197, 245, 346, 55, 153, 124, 93, 32, 126, 83, 59, 134, 134, 70, 58, 126, 95, 114, 93, 221, 200, 151, 198, 261, 99, 57, 89, 105, 56, 197, 130, 90, 246, 69, 144, 31, 93, 105, 64, 64, 44, 119, 188, 252, 443, 218, 108, 129]
-192A29
##PAGE=	F1=5940.29
##FIRST=	25164.767445380970457,	5806.2096540000038658,	0.18069906532764434814
##DATA TABLE=	(F2++(Y..Y)), PROFILE
5806A01j0l6M4R7l2r1M5m2O5j06O3M0lJ6rm4K7j10J00K4o3R4n6P8L3j55L5O3Rl9o0Rl1L0J04
5395A90p5lO8r1l9J63L2J09J7n6k10L6q9N7n0k0J02l0jl0J12K6j77N6K2RK9r1L7k0J06r3k1
5008G5O7n9j0P4j03M0lP4n6l0Q2R8j31l3J09L3ln3j52J50OJ2j18J94j4j20O4J17k29m6J20
4644A55r1m1J48R9L4j07j40O8n5R9J52j11j28J8J3L8n0R3qr4Rl6M4K4J48r5q4m4KO9K3n2L
4257A03JP8M8n7J8R5n7j33J25j10j9O3q5J5QR3O1o3j44J0N2q2M1QoJ06j8n9p7L7R8J7o9K0
3858A18M3Lmj28L8J1M5m0j2Qm3j5J32l6m5P2j12N5J19J9P1K3j72M5j5q8OJ6Om3K41J74j89
3470C03j06M1l8j0j27J5kN3r7j1R9m2R6P7l1j03l1n8J02j9J91P5k84L7N9J15k46P5j8J18j40
3107I3N9M6J07r1j15Q9K10k07k2j60J87l7J1j25J73m2j1n6k7J26j46J3L7L1J30n5j15L3L5
$$ y = [101, 91, 55, 99, 196, 164, 73, 118, 76, 141, 35, 98, 138, 135, 151, 142, 98, 125, 15, 115, 139, 76, 170, 114, 192, 225, 70, 105, 168, 177, 138, 78, 87, 56, 86, 190, 115, 112, 180, 89, 50, 213, 245, 354, 371, 315, 105, 141, 52, 109, 59, 39, 141, 111, 110, 80, 192, 218, 41, 97, 119, 128, 157, 66, 103, 83, 189, 96, 75, 142, 83, 73, 147, 44, 84, 81, 155, 99, 69, 151, 249, 118, 85, 194, 227, 224, 171, 19, 169, 175, 187, 69, 263, 249, 129, 193, 310, 81, 35, 155, 64, 23, 171, 270, 304, 197, 57, 125, 70, 169, 321, 210, 82, 100, 113, 151, 101, 194, 186, 92, 101, 65, 109, 133, 281, 186, 102, 58, 60, 129, 152, 100, 103, 104, 182, 230, 173, 191, 286, 229, 96, 221, 111, 92, 155, 70, 85, 93, 186, 247, 184, 40, 50, 102, 20, 61, 69, 63, 169, 151, 92, 15, 52, 150, 167, 98, 118, 161, 164, 160, 32, 70, 81, 126, 86, 74, 82, 39, 24, 156, 120, 75, 147, 35, 90, 209, 228, 299, 322, 150, 195, 180, 92, 98, 114, 120, 77, 318, 492, 303, 197, 238, 200, 190, 63, 78, 76, 129, 32, 21, 120, 78, 174, 251, 220, 117, 86, 28, 130, 111, 302, 377, 93, 130, 189, 304, 58, 133, 115, 233, 93, 152, 198, 305, 214, 99, 188, 398, 191, 169, 9, 196, 159, 170, 45, 218, 176, 165, 109, 82, 208, 62, 75, 112, 143, 273, 218, 103, 136, 171]
2766A71m2nQ0k5k5r0k0M0P6n9JP3m3m1J6q3P7QRLo1J09m3o6M0pRj5J2Rl5L4J7J06Pj56ok2
2320E3k7M2R1r0P6n6P3O8p4M2M4j13l6M2j1O6k1j14O7M2O0J10L4k24m3ko9K8J44R2R9j56j4
1933B23R1k17Q3j55J15K0K8L6J5L4j74Q6J52r3j07M2p3Nm4J24q2mL7J1O2j6Lo1K4M5J32k10
1557A32M1l4j1k6Lk9P3n0O8j02Q9L4j14M6M4j13J16p8o3oJ16P7o4MJ7o4j6M8Ol8L6J43j05
1170A80o4p3L3K7n7J70j9o2n4M0l2R4m1k9M8K7M3N9p1j74J5J67q6p9K0m6R1N6M0j25O3R7k22
783C6K27N1m1J08j02k22R7N0j02J11j68J8M2K0k0po6K6P2l5J55k01nO3J1Oj1mJ8p1J35j60
407C1j4R4J49q6Q8R1l19J25on1q6J15n9j4N3J2k2j2L9m3L5k3M3K5j5J20O8k03j13R2m7J5J47
20B29n4p3J84j92R3j72Q3N1l5n6m6J09O8N2J27j81o9N4
$$ y = [171, 129, 124, 204, 179, 154, 64, 44, 84, 160, 101, 102, 175, 132, 91, 107, 24, 101, 109, 118, 121, 60, 169, 126, 60, 100, 93, 102, 87, 99, 108, 73, 107, 124, 230, 237, 81, 75, 53, 26, 68, 159, 69, 145, 89, 162, 230, 156, 198, 242, 129, 93, 135, 124, 190, 169, 55, 122, 164, 224, 334, 368, 144, 101, 99, 30, 58, 202, 294, 393, 237, 223, 314, 97, 180, 25, 140, 160, 188, 224, 239, 273, 99, 185, 337, 244, 137, 179, 106, 111, 67, 191, 109, 105, 142, 153, 215, 199, 202, 141, 165, 210, 342, 132, 173, 139, 128, 102, 105, 76, 149, 99, 167, 65, 154, 188, 74, 120, 164, 51, 167, 89, 26, 20, 136, 213, 149, 153, 170, 106, 90, 138, 144, 106, 142, 285, 180, 116, 43, 76, 103, 46, 216, 197, 135, 81, 121, 89, 183, 142, 113, 161, 188, 231, 290, 219, 45, 60, 227, 141, 62, 82, 36, 127, 183, 223, 98, 161, 258, 36, 263, 314, 273, 381, 279, 57, 154, 204, 102, 213, 45, 63, 105, 125, 105, 98, 32, 58, 130, 95, 250, 49, 44, 107, 118, 124, 113, 109, 127, 56, 191, 31, 17, 111, 260, 174, 262, 353, 34, 159, 153, 102, 16, 131, 72, 58, 111, 123, 101, 89, 128, 85, 120, 97, 140, 165, 150, 270, 338, 135, 22, 114, 67, 82, 229, 175, 102, 286, 94, 187, 15, 98, 149, 114, 58, 12, 121, 189, 241, 368, 187, 118, 172]
-192A72
##PAGE=	F1=5838.03
##FIRST=	25164.767445380970457,	5806.2096540000038658,	0.31111621856689453125
##DATA TABLE=	(F2++(Y..Y)), PROFILE
5806H4m3K0J8J08o0k2J7o8P7o4N6l3P2J6n7k1M6j02J17k3l8O9n5P4P1k03N0J04ol6p1j3j4
5419G0M2Q1m4l8J8o1K0J51j0J11M2o7k15Qm5K5k5k2R5j4k6l6J01K7j47M2L8L2J4j16L3l4Q9
5032A39k7n0J00o1O2J0j51P2j1J01n0o0R7J17j53o2R7M8L2j00j07J24oKo3J76o6j04N9J27
4679B92j99OP2n5l6Q2J19kj70n5J29o0N5J54j64q3N7k6j1K9R9l4j09Mk6M7J2R0p0n1Nn6P9
4292A24M9q6K7mN4O3%RM1p0j07J17j18k9P4n8k5KR0N7rj18m1M2o3L8k8N8L4Jm8o1J6J17Qo8
3870H8jK9N0n1p6J5j6Q4M5n3k7o2M8P0o7NP9q4L8Q0K8J9N1j33j5n2PNM8n9PJ81J84j25j33
3459B07M7o5n9l7m7kP9o8l5J02jJJ08pj29k1l3P7L0J66N9k60JM8J06j92N3%R5j74J25L8J23
3071C35q0j38Q6J83k06j2j57J92l7L9j55J42k7l8l7K7Q5j07O3k8K5P7p3k4K7j5n3L7M3j6p
$$ y = [84, 41, 61, 79, 187, 127, 105, 122, 54, 131, 67, 123, 90, 162, 178, 121, 100, 146, 44, 161, 138, 100, 169, 114, 188, 259, 56, 106, 210, 204, 168, 97, 84, 70, 112, 193, 149, 111, 129, 68, 88, 239, 229, 340, 382, 315, 100, 108, 63, 88, 63, 41, 136, 122, 96, 60, 161, 188, 41, 83, 121, 153, 167, 51, 84, 50, 139, 112, 62, 162, 101, 163, 173, 22, 94, 83, 184, 134, 74, 171, 288, 135, 73, 170, 218, 250, 150, 43, 167, 161, 163, 100, 276, 210, 106, 165, 292, 93, 99, 171, 116, 80, 162, 281, 279, 109, 54, 183, 123, 178, 332, 168, 85, 142, 116, 105, 134, 233, 199, 90, 94, 68, 115, 127, 217, 147, 96, 101, 45, 124, 173, 87, 114, 110, 164, 227, 227, 236, 277, 207, 100, 217, 99, 70, 144, 86, 61, 63, 153, 210, 201, 83, 42, 84, 21, 59, 31, 89, 123, 124, 76, 15, 31, 148, 156, 88, 87, 116, 166, 115, 39, 54, 38, 122, 167, 114, 87, 25, 73, 143, 76, 81, 160, 76, 114, 194, 222, 241, 292, 159, 144, 92, 99, 104, 152, 93, 100, 281, 465, 340, 207, 254, 189, 130, 93, 46, 44, 123, 55, 20, 122, 121, 122, 230, 223, 94, 73, 40, 117, 147, 313, 372, 112, 113, 161, 267, 75, 128, 128, 223, 49, 174, 212, 335, 255, 117, 203, 386, 180, 168, 11, 203, 166, 205, 50, 192, 165, 127, 90, 117, 202, 95, 158, 130, 155, 232, 159, 135, 162, 147, 94, 131, 174, 158, 151]
2708A51r7m5Q1Q4o7QJ12l3j51R5j28J40%QJ1p8Q4n5q0K2k1L3j1rK6J2L2RR0K8j49j1l8OL3
2297I2N5n7L7q5J22J02n1l0J0p5Pj8M9O3m6j44M5Q8RJ26M2k22m1L7p7R6Q2O0J10j46o8P7j55
1909I4O5q0N7j4N7J07k6Jj45O1J19r7m9k0Lm0%J10j10NO9j4J3J0K9n4L7J4J30k49J62j31M1
1522A55l8o4J1N6m0J04j45J00M9j41M2O1q7J05j7j14J6Q6O8o1K1Lr3K3K5MM2MR5n5j01l6L1
1135A09K3m0J36n4o1m1J0n5P3J8k4K9O9L7N2r1j53Q9J20q4j10NK2K6Q0N4j14K8N2j66K25L3
759B97p3J16p4k07J14Q8k26J54j22QK4K2K8o1p1P9L1N2R4k29j2O8%J4L7nqn9J09j48qJ30R4
372B56j29J27R6l19J31K0o7p8R1n9pL9MK7rKn8O3j9OK5j3J92P0k18j41J11j03N4J46l2q3J77
-16C02j78Q8j88O7J09m9j16MQ7P9J9O1j26m4P8
$$ y = [151, 54, 9, 90, 174, 107, 115, 227, 194, 43, 138, 10, 150, 150, 158, 169, 91, 175, 120, 40, 62, 41, 74, 63, 54, 80, 92, 124, 133, 223, 251, 102, 91, 53, 59, 92, 147, 90, 127, 42, 164, 266, 215, 185, 195, 120, 127, 109, 158, 221, 175, 31, 76, 164, 173, 299, 341, 119, 78, 115, 38, 134, 216, 276, 386, 240, 172, 249, 94, 159, 79, 136, 122, 179, 286, 260, 261, 116, 177, 296, 199, 150, 130, 133, 93, 93, 203, 93, 98, 167, 153, 166, 176, 205, 151, 188, 202, 332, 83, 245, 114, 155, 117, 53, 64, 120, 80, 184, 39, 139, 188, 47, 89, 150, 63, 168, 151, 37, 53, 139, 207, 146, 167, 170, 77, 100, 125, 129, 171, 175, 270, 215, 114, 78, 109, 132, 92, 228, 174, 113, 72, 82, 27, 100, 118, 94, 123, 192, 229, 281, 190, 37, 126, 246, 162, 52, 57, 79, 105, 185, 239, 125, 153, 205, 39, 264, 297, 224, 340, 266, 59, 173, 261, 35, 189, 67, 75, 99, 121, 149, 88, 17, 96, 127, 179, 273, 44, 32, 100, 100, 114, 151, 146, 138, 79, 188, 40, 32, 162, 256, 127, 254, 350, 31, 162, 182, 115, 37, 128, 69, 62, 101, 105, 132, 123, 125, 67, 130, 111, 117, 142, 129, 321, 391, 173, 32, 143, 40, 94, 240, 208, 125, 302, 124, 212, 24, 91, 200, 151, 35, 39, 126, 205, 224, 285, 159, 115, 193]
-192A93
##PAGE=	F1=5735.78
##FIRST=	25164.767445380970457,	5806.2096540000038658,	0.34412845969200134277
##DATA TABLE=	(F2++(Y..Y)), PROFILE
5806I0n0K8j3J21q9Q0k8p9P1k8P2j51J59nj00K1N8n8R5o8k2N5m7O6J01k39J05R8k1l8o2l0
5431I2oP4K2qo0m9l0Q8J32o0P7P7n3k26pKj4J6jN2On5j8P6K8j15J2N7M9%j10Qk6M7N5n3Q3
4996A62kP8n7j49N2kJ12l3q8R9J32j41q4O4P2M5j41k9O0Oj4j1J40j14q1O0J23j13J0J5Rn0
4621A30RJ38l6k19J13J14p5J0J36j90l8O9o8m9J20R2o2j11LOK3K4Lj5m4M5q3Q7O1j26P1ro
4233A23P9O4jrp3p7J16j09n8Q4m2p2J6O8M7M3q8n9K6j3L8q3J11o2M7J5j05M8O6Np7k9J7R9
3834A55j01J8l5j4J04J13o2p6j8M2lr2M5R0o7K8J4M7k2Q6q9l2n6L3MN6j08P4R3J82o3j47M6
3447B45r1j01N4m5m5J02m0l2R2K5j04J37J7j40Ml7P0P4J09O1k21k9L2P2j32L2K7M9j63J70
3095A92K8J22n6j53P4J43j93Oj39J69k4N1j38Q1j1o5k7J13M8j00J16p5J2Lp4M9K2m9o1O0O
$$ y = [90, 40, 68, 55, 176, 87, 167, 139, 60, 131, 103, 175, 24, 183, 178, 78, 99, 157, 99, 194, 126, 104, 159, 112, 178, 279, 40, 145, 243, 222, 184, 122, 92, 86, 160, 182, 174, 114, 65, 35, 123, 255, 195, 272, 349, 296, 70, 63, 65, 51, 67, 66, 118, 124, 69, 51, 127, 155, 40, 52, 109, 158, 158, 48, 56, 30, 77, 132, 79, 162, 160, 238, 181, 32, 84, 82, 194, 161, 73, 172, 304, 163, 79, 143, 215, 260, 119, 90, 150, 156, 142, 131, 271, 157, 76, 136, 259, 146, 156, 171, 180, 130, 139, 277, 241, 22, 135, 249, 174, 184, 320, 130, 92, 161, 93, 44, 164, 256, 194, 83, 86, 92, 115, 139, 142, 127, 83, 128, 45, 132, 193, 67, 138, 129, 123, 202, 266, 265, 256, 183, 106, 222, 113, 55, 139, 97, 25, 41, 109, 156, 199, 111, 52, 78, 65, 103, 20, 131, 69, 116, 131, 26, 74, 140, 145, 68, 39, 56, 155, 54, 72, 37, 23, 127, 240, 178, 102, 84, 126, 123, 31, 76, 166, 99, 127, 141, 188, 166, 252, 163, 131, 75, 108, 112, 168, 60, 134, 227, 409, 346, 199, 245, 154, 53, 107, 62, 17, 119, 79, 47, 139, 164, 60, 197, 214, 74, 78, 41, 111, 185, 294, 355, 134, 105, 137, 209, 77, 109, 136, 185, 22, 192, 220, 342, 286, 133, 207, 350, 157, 163, 24, 193, 169, 220, 82, 163, 152, 87, 60, 173, 221, 121, 237, 162, 174, 177, 103, 152, 174, 125, 64, 124, 130]
2731A30LJ7j00lL6R3n5RJ35l3k21J69j75J72lJ9K0j06M1m7o8nj4K8jk2M4N4K1J2O0K5j37j
2332I7n3K5L0K7j9oo7J06J18k2l2n9k7L6r2R7O1m4r9m5J42l7J14M7j95l9O6p8J44NL6J20j12
1945B45j22N4q8P5l2Kl2O0J55l8m6j02K1P5p3k2n8P7p6L2J05j43J7J11m5l9O3K5j8J5k6J27
1569B99j96J87k11R9m8j14R5K38j24m9j21N3O5j46M0P0m8P8K9j68P2K9O7p1J5Rr0N1kJ2J23
1205B43m3L3%j02%%RrJ07j08l4j1j8n5J3P5K5m4J09L5K6j09j12J44P8p5j16JN7n4J56K4r7
818A48j1qm8J63J4r5R5k4j72J20J11k23R5p3j3kN3M9j05n1J01K9J01J9k36j2R2j5j8P6nk3
442A32m0P9j16nJ36M6j53J50J09k80J12M1p4p2N0m7%M6l0O7Ll8p5R8k5L3ok7K32O9k10j26
67G9P7j24O2J32no2J41j47O1j80M8J65p8j53O8N2R4l1J5q0m0R1
$$ y = [130, 133, 150, 50, 47, 83, 176, 121, 130, 265, 232, 11, 180, 5, 177, 174, 193, 213, 107, 148, 101, 33, 28, 14, 42, 41, 19, 63, 117, 138, 150, 210, 235, 98, 97, 44, 69, 99, 126, 107, 101, 34, 140, 258, 236, 204, 145, 118, 154, 62, 159, 220, 176, 77, 32, 174, 137, 251, 298, 103, 64, 130, 52, 196, 201, 237, 357, 245, 123, 177, 89, 164, 132, 134, 102, 162, 317, 279, 233, 131, 152, 227, 154, 132, 74, 151, 75, 107, 212, 69, 86, 197, 152, 113, 176, 201, 183, 198, 172, 299, 103, 290, 79, 178, 130, 16, 111, 349, 225, 176, 55, 108, 173, 27, 67, 137, 89, 167, 196, 28, 100, 129, 196, 125, 140, 149, 59, 110, 108, 120, 243, 200, 233, 233, 131, 131, 131, 140, 131, 238, 130, 96, 85, 67, 12, 25, 100, 125, 81, 190, 225, 251, 142, 30, 174, 252, 177, 61, 62, 119, 65, 221, 245, 148, 137, 129, 81, 244, 258, 163, 258, 234, 62, 182, 293, 70, 165, 92, 79, 77, 130, 179, 74, 23, 124, 153, 254, 273, 37, 25, 117, 102, 84, 160, 155, 132, 92, 171, 55, 50, 186, 232, 79, 229, 338, 58, 170, 211, 137, 65, 115, 68, 68, 114, 84, 151, 154, 116, 41, 139, 114, 147, 141, 114, 346, 415, 205, 79, 156, 32, 94, 226, 221, 159, 300, 153, 214, 34, 82, 247, 169, 16, 84, 136, 230, 199, 214, 134, 94, 185]
-192A85
##PAGE=	F1=5633.52
##FIRST=	25164.767445380970457,	5806.2096540000038658,	0.23361548781394958496
##DATA TABLE=	(F2++(Y..Y)), PROFILE
5806A09l1ql7J34q6J48p2p4N7JR2j81J41m4p4K6M7pO2r1l0O4l6N4J15k46J59O2k6l7l8n1k
5419A00J06o0K2m5m7l9J09J07p6LJ04j8k44M0nm3P7J8k3K7p1L7K0L6j04k5P9N5qp5k8J5j1
5032C3J12m4M1O1Q5j22j06OK1J00j4j06Q2J47j07r1J7J06L4j64M6j7M9l6K5R3j55j7L0J04
4679B13k6J3m8P3o6n1J42o2j31J61P9r8rJ04j52m2M9j00j0J40Q9q7r8oL4MN0q4N5n3M2o6Q1
4292A40O8j47Q9mn4P0J19qm6o5n1J28r5j00Q4l1q6K7J0N6O8o5m2K8K6L5j27J31j08O4P1j51
3916C4R0RJ1q5k0RQ9q3N6o3K4N6J68n7j14MM4p5p2L9J07o4L6p6P9m1J12n9K4n2j4qN0j24J29
3506A63%J65j1j34L0j07n7N7k3n7Q0j5l0R6L7j56J17L7j17K5o8Q3J07L2P7j70n9J5K2p5J6
3142H0N9j0m0J15J1J09k5j50L8J07j69M0j36J30MN0j05K7J6r4m6J52M2p0J67r4j8o1p0Q9K0
$$ y = [109, 78, 70, 33, 167, 81, 229, 157, 83, 140, 141, 233, 52, 193, 149, 75, 101, 148, 141, 203, 112, 82, 146, 110, 164, 279, 33, 192, 254, 228, 191, 153, 102, 100, 206, 146, 168, 123, 76, 37, 146, 253, 177, 180, 284, 266, 22, 62, 57, 14, 91, 109, 86, 113, 42, 79, 99, 135, 31, 6, 85, 140, 132, 57, 29, 44, 33, 145, 101, 142, 203, 288, 166, 60, 66, 87, 187, 173, 67, 149, 296, 189, 98, 115, 221, 255, 91, 137, 120, 169, 133, 158, 251, 96, 79, 109, 213, 187, 200, 152, 225, 159, 108, 250, 188, 57, 218, 297, 199, 190, 294, 142, 100, 149, 49, 39, 179, 268, 181, 83, 77, 111, 115, 165, 81, 136, 83, 125, 59, 140, 208, 61, 150, 146, 92, 162, 281, 273, 227, 162, 111, 239, 144, 44, 128, 97, 11, 38, 48, 104, 172, 107, 65, 93, 119, 154, 27, 158, 50, 114, 185, 34, 124, 133, 144, 59, 39, 48, 137, 54, 110, 47, 71, 127, 295, 238, 124, 128, 172, 97, 25, 64, 171, 107, 143, 67, 146, 105, 217, 158, 182, 130, 116, 108, 158, 34, 163, 163, 328, 317, 183, 213, 106, 49, 106, 83, 26, 106, 91, 61, 157, 194, 38, 155, 192, 75, 100, 32, 115, 222, 254, 331, 161, 102, 117, 139, 64, 80, 139, 129, 89, 204, 215, 324, 299, 149, 187, 294, 125, 165, 29, 159, 163, 213, 108, 135, 151, 57, 11, 163, 205, 135, 302, 208, 190, 129, 59, 148, 168]
2778A68n2n8N2k8M2K7j01L5j8R9l2J1J42l6k16J85k12J77oL6K5j28j3j6m8J0k6mK0j3N0P5
2402A47jK9K2lj17J4o3M0K2RK7m0mJ3J18MJ8j31K0M0j53J22O2j6n1j21J77n6P2M8j53k8P2
2015A39p9J69p0L0J23o4j52J9l4R4j5k1l0L7J66j7j05n3k0K8j7m9LP7q8L4J04j68L4J50p3
1651A52p0J02J4J6k4o8J26j07J57k57J55o0j06J12L23j80j47m8j9P2j24L9O8j9N2N7k09J33
1322A40l1P4p4k4K8n3N6l0L8J76q6k7M4o9J7m3j6L9R0j66J9%J4q8O5J1O4j27J42L9j6j21n6
935B9J71L5n4j02K9N6j22K25k9q4m4o5O4J00nj01N0L1j06R8J22j84L5l0m3l5R9M6j16k3Q1
571A28N9J24o2k28NJ23l6o4R4kk9j6M5o8j3J17K1j36J32J31k15P8M6p0p5Lk3%O2o7Q5K8p3
184A04q1J27m1O5j3k5K07P0j83j13K7j20N9J10J8j3R2j15J6j53M1K00j13r7N3K0J03p9Po1
$$ y = [168, 116, 58, 110, 82, 124, 151, 50, 85, 67, 166, 134, 145, 287, 251, 35, 220, 8, 185, 179, 215, 240, 112, 99, 83, 35, 45, 19, 15, 35, 22, 72, 147, 146, 175, 197, 194, 77, 91, 28, 68, 90, 99, 126, 86, 82, 95, 213, 217, 235, 104, 124, 164, 11, 133, 195, 179, 128, 7, 184, 128, 200, 248, 95, 67, 139, 60, 229, 159, 189, 312, 248, 96, 115, 81, 175, 160, 139, 109, 146, 312, 295, 190, 137, 117, 145, 128, 79, 82, 159, 71, 105, 209, 41, 75, 225, 152, 82, 184, 198, 214, 190, 122, 248, 141, 298, 41, 196, 136, 30, 142, 465, 285, 138, 90, 71, 143, 19, 58, 126, 107, 159, 216, 7, 140, 109, 183, 109, 85, 113, 60, 116, 86, 124, 300, 214, 187, 231, 162, 179, 136, 120, 159, 249, 83, 102, 102, 116, 28, 93, 104, 168, 41, 183, 222, 206, 85, 29, 200, 235, 181, 79, 108, 164, 42, 267, 238, 154, 110, 45, 109, 209, 204, 103, 153, 184, 78, 176, 298, 114, 149, 119, 76, 41, 140, 186, 70, 47, 128, 187, 311, 249, 21, 26, 149, 113, 49, 143, 141, 112, 96, 141, 73, 60, 177, 198, 62, 194, 325, 110, 188, 234, 164, 89, 92, 69, 69, 131, 64, 149, 177, 104, 23, 150, 109, 174, 161, 136, 343, 413, 230, 117, 144, 24, 83, 193, 211, 198, 290, 175, 191, 38, 79, 279, 166, 69, 122, 142, 245, 166, 173, 112]
-168A12n5R7
$$ y = [112, 57, 154]
-192A54
##PAGE=	F1=5531.26
##FIRST=	25164.767445380970457,	5806.2096540000038658,	0.12757697701454162598
##DATA TABLE=	(F2++(Y..Y)), PROFILE
5806A18j4m3l4J38n9J67j09o2M7K5J05j70P9r0L3k5RM7K8q8o6R7k1L8J09k14J80J0j6l0rq0
5431A00J1J26j54M5jJ9n3O4P1k6o3O9K7j91P6p8J0Q8K2j15M0m8P8l4M9j02K0OM6ok7l9L6k2
5032D4J00l4jJ06R5j78m1j5L0O2oj13N3J59n4q8k8J45Mj65R3q7J19o0L7N4j97Q1k6O7M8K3
4656B27j13J26p6q5J17o5j4J65K7j24J0O8q2p5%n6M1Q3J00j05o9l2M8MO9j28R5m7j5qM8P9
4280B13j35O2J8n1J1J52j0o4n3k5J48q6j46O9j9m0J9j2M0K5n1J0M0N8K5j56J19p4J2J17j74
3916D2J20l0J8q2J8K6LNK0n3L1OK01m9j29OM7j29j6LJ28p9N5j35J01k2Q7m9J07r1l2m2L9r3
3517C2J43q0J37K9r6mj05N4j3j1j1K6j4k1R4M4j16J8N4p9M5j06J06J26m1R1j11r6J2l5l1O
3142D7R2n7P5M7j1Q6J2j25k4Q3j37Q7j06K8M5M0o0pN2j17KM2M5kK09r1n9q7p8R5K0k9l1J5
$$ y = [118, 104, 61, 27, 165, 106, 273, 164, 102, 149, 174, 279, 109, 188, 98, 131, 106, 115, 162, 190, 102, 36, 133, 112, 150, 259, 45, 225, 235, 219, 189, 180, 100, 111, 237, 83, 128, 127, 146, 93, 157, 228, 202, 139, 208, 235, 44, 120, 42, 52, 140, 162, 47, 87, 39, 117, 83, 132, 30, 50, 56, 102, 96, 69, 30, 66, 44, 144, 110, 109, 215, 310, 132, 91, 76, 106, 168, 162, 49, 102, 261, 207, 119, 91, 236, 240, 75, 168, 81, 200, 140, 177, 231, 34, 115, 89, 156, 204, 227, 114, 240, 164, 79, 196, 131, 117, 282, 309, 185, 195, 263, 181, 106, 106, 50, 91, 174, 274, 169, 100, 68, 116, 120, 189, 61, 156, 109, 94, 86, 134, 213, 78, 140, 158, 107, 118, 270, 260, 196, 143, 118, 266, 180, 34, 103, 84, 44, 63, 51, 91, 116, 65, 75, 115, 173, 198, 42, 161, 87, 99, 216, 42, 162, 132, 150, 68, 86, 112, 115, 120, 140, 87, 118, 124, 325, 276, 147, 153, 200, 71, 55, 58, 186, 107, 162, 27, 128, 106, 193, 144, 251, 160, 128, 86, 125, 32, 175, 95, 232, 261, 165, 161, 56, 110, 97, 86, 75, 101, 87, 66, 160, 204, 88, 106, 160, 81, 126, 20, 126, 252, 211, 302, 191, 95, 107, 72, 41, 47, 139, 82, 157, 204, 193, 279, 291, 166, 142, 225, 88, 175, 69, 97, 142, 182, 122, 115, 167, 50, 52, 94, 139, 137, 346, 255, 196, 109, 31, 126, 146, 117, 86, 101]
2743A01m4Q3Rj01O3o5J03j3J7J38m2j95J90k39J81j6M8K7j34o2L5m0N0n8pK0lM8Q1k5N2j7
2367A85m2q3J5n1O3j3JP1n1K9q8J14J7Q2j70N8J6p4J5O4K0j3j46J63n5K7M6j03j6N7p5J67
1992B30j29N0J03j2j64Kj0J03j3j5j1J0J31L1j67j0l7k6O4q7J12Op5PR7j73O4J66r2p9J04
1628A80K6K5o8j07J30l1J15k58K00p6j00J06L15j94j84M2o7N6q8M6N1rK9P1j93J41p3Q6l9
1287A32r0L9j1M8n7Q3J85j11o7N8k0J9q4n1R7Q6j99O5rO8j54J27l5R2j51J14M6o7j05j2J67
923B03qk2p6P5N3j44K22q0q0o3m6Q3N3k7q6K0M5j8N4J20j47J1J2q3m2J04L7r0j0M5J04J29
548C48j35k07L0J43n6q5P0Pl0NPml4Q3K7r7Q5J65j50M0L5n9q1m7J3j3P1q5Q2N9r5o1J34n5
149A10O2J7nJ31P7j46j07l1r0N1Q0L5M4M7q7l4r4K1K09j43k2J8qR7j04N0q6n8P5
$$ y = [101, 57, 140, 149, 48, 111, 46, 149, 136, 153, 291, 249, 54, 244, 5, 186, 170, 218, 245, 111, 49, 84, 44, 94, 36, 29, 49, 46, 94, 175, 150, 202, 185, 143, 60, 75, 24, 87, 74, 75, 146, 95, 124, 36, 150, 167, 249, 79, 137, 153, 79, 94, 158, 178, 165, 19, 182, 127, 154, 200, 97, 81, 138, 63, 230, 101, 151, 254, 242, 78, 80, 70, 173, 160, 145, 134, 144, 275, 306, 139, 129, 92, 66, 130, 43, 155, 161, 86, 93, 190, 17, 81, 247, 155, 76, 180, 206, 231, 163, 56, 186, 155, 270, 12, 212, 136, 36, 142, 457, 263, 79, 121, 54, 110, 22, 68, 119, 110, 139, 210, 17, 158, 85, 171, 132, 42, 81, 70, 118, 61, 144, 329, 218, 151, 209, 189, 208, 124, 73, 170, 256, 57, 122, 113, 181, 27, 154, 119, 211, 60, 174, 220, 153, 48, 36, 203, 195, 173, 97, 172, 225, 81, 303, 223, 143, 80, 34, 117, 170, 143, 57, 77, 122, 104, 158, 278, 131, 142, 154, 71, 29, 133, 170, 80, 70, 115, 219, 348, 213, 6, 36, 179, 123, 38, 108, 115, 85, 90, 97, 93, 59, 142, 169, 72, 157, 322, 172, 212, 247, 188, 107, 60, 73, 60, 131, 46, 128, 187, 92, 31, 165, 110, 172, 189, 184, 315, 392, 246, 139, 108, 18, 69, 149, 184, 228, 275, 188, 154, 60, 81, 290, 147, 125, 143, 135, 232, 128, 178, 92, 34, 109]
-192A09
##PAGE=	F1=5429
##FIRST=	25164.767445380970457,	5806.2096540000038658,	0.28838315606117248535
##DATA TABLE=	(F2++(Y..Y)), PROFILE
5806A08Mp0kJ32m3J64j43l9L3N2J05j61K7j10J28p8m2J06Jp2p3R3kK5P7j51J69m9Qk9J8r9
5431H7L2J30k31M6N5P9m3JK6O4m4m7N6j06P3j41N7J02J3j72J3NR2o2N2q4N4p8K5J0J2l1L7
5043H2k8P4k9k5J21J10k09K7jJ3J4k1j09L3J49J2p9n9J81l1j58J07j40K07q6L0M5k05J23o7
4691H1J3R9M1j70J59p7q6O1k3O0J62l9j45O3L4l5q7o7O9J1L0J22j13m4o0M2L1O1j33J09k8
4327A41r5P6pR2j07J3N8l7n1J53kn8n0jJ69q6j83M3kRL7L5k5o9l5P0M8Q4Nj60P9j9n4J53j74
3916E0J31m5J7p7M1N6q3Q5k0k4K4l0K01m4j17qM4j54K4OJ36j02N7p8N9OJ5k9J61j56lr4L1
3529H0m1J26j30J11N1m8n2o0J04n2j5M6Pn5PO1N2n7q3P1n4Q1j16J04J31q3Q5n2j34K9q1qk
3142B3J14n3J21j9l0O0M5p8j07Q1j00J30m7j17Q2K9j2j8Q6j32N3n5pQ0K38q0r7q0q5O6K2K
$$ y = [108, 112, 42, 40, 172, 129, 293, 150, 111, 144, 196, 301, 140, 167, 57, 185, 107, 65, 171, 172, 100, 27, 120, 118, 143, 220, 69, 238, 189, 197, 168, 186, 87, 119, 249, 18, 64, 119, 198, 155, 156, 182, 246, 202, 155, 211, 105, 178, 37, 94, 196, 209, 37, 50, 55, 147, 85, 137, 53, 107, 29, 54, 64, 76, 45, 82, 54, 128, 99, 74, 195, 305, 96, 123, 122, 135, 149, 128, 19, 52, 201, 213, 134, 75, 256, 225, 67, 174, 34, 241, 155, 185, 230, 25, 148, 81, 94, 193, 234, 64, 223, 146, 60, 121, 98, 158, 320, 281, 136, 199, 233, 198, 111, 44, 113, 124, 154, 276, 163, 119, 59, 101, 132, 193, 60, 169, 141, 46, 122, 115, 207, 100, 113, 171, 134, 83, 236, 234, 176, 126, 125, 294, 208, 25, 68, 66, 75, 112, 147, 122, 53, 18, 88, 136, 220, 225, 65, 144, 125, 71, 224, 50, 181, 136, 153, 76, 117, 173, 90, 175, 155, 131, 155, 125, 326, 282, 165, 157, 201, 47, 71, 77, 213, 111, 168, 90, 149, 155, 170, 141, 302, 146, 143, 49, 80, 39, 165, 35, 146, 197, 149, 97, 37, 141, 89, 74, 120, 127, 72, 79, 140, 192, 135, 52, 123, 69, 150, 34, 138, 269, 186, 271, 219, 85, 114, 33, 25, 23, 137, 84, 205, 186, 156, 216, 261, 183, 76, 157, 57, 187, 140, 23, 105, 134, 122, 104, 190, 58, 111, 56, 49, 129, 367, 287, 190, 110, 25, 91, 113, 115]
2766A15Mj8k2Q6k3j01P9r6J11j2K6J29n2j65J82k31J79l6M8K2j21o7P1n9R2p7qPRM1P9m3P4
2379B23n2o9m4KQP1o8nR4m9L7j24P4MJ37j59P8l3L2q7N0M7J5j66J49n0LM4m9j6K8o1J41j63
1980D2R8N3K8j74M8l0Q6j4MK0j0O4R4k07Mqp3J20j6R9o3n6l3Q3j38R3J45j00q6Q5O6Mj05j09
1581A4J11J3P3j58J79r6r8R0K39j62j78J16o0J9o3N9J4j2PP5j38J03q7J06J7j08K0j6M1p0
1229E0J24J50j08p5K8L2J3j00j02J52Q8j84P0k3J17k11J51n0J29j38N3N2j16k2k7J42n0J1
900A56m1J22O0j77J98j14q4o3L6J4K5m9n1Q8o0O9JJ13j20J6N4j19mL3M0m4j0OJ54J17j84j41
524D1J2J41o6o7OK3k8J3l1O8o8O1N3q6N6J98j01JJ4m1q5q2M4l3O4q0P2Q5j00m5J45o2J7P4
125B13J5L9Q7r8j11q9oJ8M4L8Q8J7o3p9pk2J98j62M7k6l2P9r0J17j42o%
$$ y = [115, 119, 101, 79, 165, 142, 41, 120, 24, 135, 123, 149, 278, 226, 61, 243, 12, 191, 155, 203, 225, 104, 37, 108, 49, 141, 64, 56, 63, 72, 113, 192, 149, 223, 171, 102, 58, 60, 68, 139, 71, 66, 160, 111, 148, 24, 98, 102, 239, 80, 158, 125, 157, 70, 120, 167, 182, 16, 165, 115, 118, 162, 113, 97, 125, 64, 205, 42, 140, 193, 221, 47, 95, 65, 151, 137, 141, 161, 151, 215, 309, 102, 106, 98, 25, 145, 129, 228, 165, 109, 76, 159, 21, 114, 259, 159, 73, 158, 224, 228, 123, 14, 125, 138, 211, 53, 232, 136, 38, 128, 367, 205, 27, 143, 83, 102, 39, 98, 112, 100, 107, 182, 44, 147, 60, 166, 183, 75, 95, 79, 120, 50, 174, 324, 216, 141, 169, 201, 214, 114, 12, 164, 252, 68, 138, 115, 232, 21, 172, 122, 251, 113, 166, 218, 102, 80, 53, 195, 145, 156, 115, 237, 297, 120, 318, 204, 120, 57, 93, 107, 132, 83, 32, 120, 60, 129, 130, 243, 123, 139, 193, 74, 70, 103, 143, 99, 89, 95, 249, 366, 182, 41, 53, 194, 128, 61, 67, 90, 62, 75, 44, 112, 44, 105, 158, 72, 128, 326, 225, 226, 240, 199, 114, 32, 76, 43, 107, 27, 99, 184, 84, 39, 184, 122, 139, 213, 228, 267, 354, 256, 145, 56, 50, 68, 112, 150, 238, 255, 192, 113, 106, 84, 282, 120, 167, 141, 109, 188, 98, 215, 73, 67, 67]
-192F7
##PAGE=	F1=5326.74
##FIRST=	25164.767445380970457,	5806.2096540000038658,	0.36896586418151855469
##DATA TABLE=	(F2++(Y..Y)), PROFILE
5806G6K8r0M2J29m6J51j73pQQ2R3j54pl5J21j21p9J72j6o7j2OK7J6K4o4J31j05L5m2M1q5M8
5419A27J18j53n3O6J10po5k1J54Kj28N2m7O2j66P3J15nj62n8N6R1n7L5n4P1j50JO1Mk3M0m2
5032D7N7k8k4J00J28j87O6J1jl0o0m1M4M1Q3p0o2K03o5j52R5j39K66j12J0O7j75R1p9m1J14
4668A57O7j90J48o2o6j8P3P1J44j06j41J23Ol1n8r9J51m0RJ33j06m2p2J7Q0J8j26J30pj52
4316A1J47o1R8q1l3J06m4p6J21J9l3o5K0J85r8j96J3K9M5O6P5r3n7NRM2J00k4j40K6L1j07
3940D0J77j56J24m1kp0N1R6j54J38n3J3J3m7J67m4p7l4L0j41L9M3J31j10J2j3N1L4p8L0J48
3576C17k26O7j51K8JJ01r8P8M2k4p8J7N6m5j5P7K6j05L7rO6Oj50P4n8J36j00P0J27q6O2nj56
3189H2M9r9Qk1J14j6J04p2k5L0O2j8j58P1p4J58J8j37j9K1L6j5J11j40Q0l4q1Q5K40o7j21
$$ y = [76, 104, 14, 56, 185, 139, 290, 117, 110, 118, 200, 293, 139, 132, 97, 218, 97, 18, 190, 174, 107, 95, 101, 128, 144, 168, 104, 235, 130, 165, 123, 164, 79, 127, 245, 92, 39, 105, 215, 208, 143, 122, 276, 278, 150, 202, 155, 217, 51, 124, 239, 234, 72, 14, 70, 161, 104, 139, 85, 156, 6, 7, 68, 72, 49, 89, 47, 104, 76, 52, 152, 280, 93, 159, 170, 169, 139, 79, 38, 82, 123, 206, 136, 74, 277, 212, 60, 155, 16, 282, 170, 180, 247, 72, 163, 84, 43, 157, 224, 34, 182, 120, 54, 36, 109, 180, 324, 218, 77, 200, 206, 175, 117, 18, 169, 129, 138, 271, 165, 123, 51, 68, 148, 166, 40, 170, 163, 11, 158, 97, 195, 114, 81, 187, 143, 67, 188, 207, 174, 109, 129, 314, 216, 20, 33, 62, 107, 173, 248, 155, 98, 103, 112, 154, 254, 230, 90, 116, 147, 40, 217, 61, 185, 144, 142, 72, 123, 219, 65, 203, 150, 163, 176, 129, 296, 252, 175, 141, 171, 30, 69, 112, 243, 133, 145, 132, 183, 217, 139, 169, 317, 91, 158, 7, 35, 36, 137, 39, 117, 159, 135, 57, 74, 130, 85, 70, 147, 173, 68, 105, 96, 162, 168, 18, 92, 34, 170, 70, 140, 267, 181, 243, 238, 82, 131, 32, 40, 19, 133, 117, 221, 149, 124, 154, 216, 198, 40, 111, 37, 195, 213, 76, 57, 78, 114, 99, 210, 70, 150, 116, 35, 120, 360, 293, 172]
2825A72o3p1J4K6K6L9m0kQ1m7q9O8j07J32m4L4J21p1j15J53j71J58o3K8J5r6l1Q0r8J33q0
2461I2j2j1L3K0P4n4Q3p3o8k5KO6P7j10j6Q4m3K7p0J1l9J72j16Q0q9J30j42QN2L4j69J34n1
2074I1kM3J0k9j1l8J02j35J16oM1j56J20o1L2j8J8N8k5kJ53j86m1M3n8R2P0N7j05m5o9O4q5
1686C8J25R6r6r3O5J10l7j24nmK1L8k9J52j16r5Q2J34r7r4Q3l4J0o5O9l2j4k2P4o6L2o9J32
1299A69O0j19L4n7M1m2J20Q2q0n6l8Q7jo2q2Q4R2j49O2l7J49k34J24m4J77j21MN5j50O1n2
935G7J12q1K7kJ57P6k33J74j20r0n4P6l3J4n3j2J46j55J22n0J02j03L8Q7j37K3n3P0nj5k1
571H4J91R0j99q5j0J16n5m4o2L8j2kk0R6r4O2O6r9N6K07o9l8qj7q3o4L2n5M9n3N9R5r5n2J77
160B02o4n7J47K4n0J01m5j19j28Q2qJ1K5J04jl6j07Q0p3J71j67R5o7n5O0m0J76k01M2o3
$$ y = [172, 109, 38, 52, 78, 104, 143, 103, 101, 182, 135, 46, 114, 7, 139, 95, 129, 250, 179, 64, 217, 46, 204, 141, 169, 184, 88, 57, 137, 39, 172, 92, 80, 69, 102, 122, 196, 142, 225, 152, 84, 59, 61, 127, 204, 94, 78, 162, 119, 146, 76, 87, 48, 220, 104, 184, 95, 225, 83, 91, 143, 177, 8, 142, 91, 89, 132, 142, 113, 102, 64, 166, 31, 147, 141, 182, 26, 146, 85, 117, 99, 117, 175, 150, 148, 301, 115, 74, 117, 59, 151, 221, 278, 173, 128, 59, 123, 38, 163, 259, 163, 70, 135, 245, 208, 84, 79, 75, 96, 134, 105, 257, 141, 46, 128, 262, 165, 71, 154, 120, 130, 65, 134, 102, 88, 66, 140, 74, 106, 37, 169, 229, 110, 144, 87, 128, 86, 206, 288, 208, 152, 114, 201, 200, 138, 56, 140, 232, 83, 145, 108, 257, 23, 147, 103, 280, 159, 163, 218, 68, 129, 77, 189, 108, 135, 133, 290, 366, 133, 307, 187, 97, 43, 119, 86, 100, 47, 35, 181, 26, 148, 98, 200, 97, 135, 222, 85, 108, 55, 125, 120, 105, 84, 275, 365, 166, 81, 71, 187, 132, 88, 26, 64, 52, 50, 30, 126, 32, 94, 160, 61, 117, 324, 255, 217, 209, 192, 109, 45, 77, 22, 71, 18, 77, 172, 77, 25, 202, 138, 81, 228, 252, 202, 303, 258, 139, 11, 93, 85, 96, 121, 225, 224, 188, 81, 161, 88, 259, 92, 187, 120, 65, 125, 85, 261, 60, 102, 39]
-192C9
##PAGE=	F1=5224.49
##FIRST=	25164.767445380970457,	5806.2096540000038658,	0.28343611955642700195
##DATA TABLE=	(F2++(Y..Y)), PROFILE
5806B8N7n6M3J23n9J32j92L3l6J12P0j45k0P6O4j55k0J76k8q2L1p5O0J1l7L8P4j46N5o1M4
5442A15k7M6R8o1n8oQ8M9j26n5K10M5j41L8k5M0j61O6J21k8j25o2L7Q2k7Kk1P7j71J6P3m2
5067F7k5L7m7M5k1J0K9J44j16P6lKn6r8M8O2j19J50o2m0K04r1j40O9o6K57j35j8R3j52N5p1
4691H8l9N2R9j22N3k2n4rQ1N6J12j55n7J15j5o4Nn8J38r1L6J05p5p1n8k1J28m7q9J40Oj13
4316E4J33q7Q6o9n4J37o7p2P6N6nr7L3J92j18j80nP2N5Q9J04j61K3%m9K6R5n8r6j3N3j22J76
3928B07j33J10l2l7n9N7J32j97J53p2M3Rn2J15n4j5o2Lq6K5Q9J23r1q8N6O4P5j71J03P7k79
3564A3J55j31k1J3Q0l1P6J8m6k8J9l2pJ9N3O0j20M3j00R2O6j17Nl4J39o6OJ19o7M3K7j57N4
3177A43j14L7m5J03J6N8j00K0lN0M3j12Pp6J64O7j17j34L3O6rJ22j31P4j7n5L3K00n3j21n5
$$ y = [28, 85, 29, 72, 195, 136, 268, 76, 109, 73, 185, 255, 110, 90, 166, 230, 75, 55, 231, 203, 121, 152, 77, 137, 148, 111, 149, 223, 77, 132, 71, 115, 88, 134, 232, 171, 113, 107, 195, 244, 118, 63, 273, 318, 177, 215, 190, 230, 69, 135, 256, 228, 103, 41, 78, 160, 133, 135, 114, 191, 20, 36, 109, 67, 42, 79, 32, 77, 56, 66, 95, 239, 123, 199, 196, 198, 142, 44, 92, 154, 35, 185, 123, 83, 287, 196, 56, 125, 59, 316, 181, 163, 256, 104, 159, 88, 49, 101, 200, 78, 131, 109, 55, 46, 127, 183, 295, 140, 83, 198, 183, 119, 124, 66, 204, 113, 149, 254, 179, 108, 50, 29, 157, 110, 21, 161, 167, 54, 187, 100, 186, 117, 63, 200, 133, 61, 137, 193, 188, 91, 124, 316, 198, 18, 13, 85, 140, 229, 333, 172, 195, 195, 146, 172, 267, 209, 113, 100, 153, 31, 207, 74, 184, 152, 115, 56, 113, 245, 48, 201, 129, 172, 181, 129, 244, 190, 175, 113, 116, 30, 55, 144, 267, 176, 88, 144, 208, 283, 112, 215, 292, 13, 168, 37, 16, 29, 109, 78, 154, 172, 126, 98, 117, 85, 78, 97, 150, 210, 90, 133, 33, 125, 191, 74, 79, 45, 184, 118, 124, 243, 176, 219, 246, 89, 143, 29, 66, 21, 124, 140, 198, 98, 118, 115, 165, 208, 96, 103, 27, 191, 258, 141, 7, 40, 106, 97, 219, 88, 162, 145, 90, 123, 323, 270, 149, 94]
2813I4l3l1J9L9P4n9lQ3m8n5J6p1J34r8L7J13r7m2J01q0J26q9j1J1o6MQ9j42J67p3mm2P1j6
2414A18O9o3P9p1m9k7K4J04Q0j37k7N2l9Poj1o3J75p5P1j10J73j72l2M9L5j17R6o6oM2P1m8
2027A26n4j0O5o9R6l8J3m3J15q1l3l1J3R8l8m2J97j28j13P9l8N2J46J7j16m2r8M3k5J50L2
1663B43p9p8N2J20q1j00N3q7jK2R1J33j36r9R8N0l4m4L3j2K0p6P1o9No5O5J3o1j9J56O5j30
1276A19P7r7M6NQ1ml1l1j13J41j8K3r1rR7j08N3m8J61k23O3k8K27j06j9N9j58J00o3R0q9J0
900A16L7J67R3l00J61r6q2p0Q3n7K6mk0J51j56J09r4R0r4P1R7j32L1r7R9Rj8l1K05N1j90l2
524A23l3O9k2k7j00K5L6m5O7L9p5M9O1q8M6J79n1p5k4J1p3j6lo7O9l3L1Q2q7n2J98o0j46K23
125B31K2j29J16Rj21p3P4k2j0RQ4j1kj08J41j14J34j55J14q9n8M5qK21k40N7p5
$$ y = [94, 61, 30, 49, 88, 162, 103, 100, 183, 135, 80, 96, 25, 159, 61, 98, 211, 114, 72, 173, 93, 219, 130, 119, 130, 64, 68, 157, 15, 182, 109, 105, 63, 134, 118, 187, 124, 203, 132, 83, 56, 80, 184, 264, 127, 100, 152, 113, 120, 114, 103, 40, 215, 140, 211, 101, 274, 102, 70, 119, 154, 37, 133, 67, 61, 103, 174, 126, 72, 62, 127, 58, 154, 116, 129, 86, 201, 120, 87, 56, 69, 167, 129, 87, 284, 156, 43, 122, 84, 136, 282, 299, 183, 141, 43, 86, 61, 211, 243, 164, 86, 138, 258, 177, 77, 130, 43, 42, 64, 155, 288, 152, 53, 151, 201, 167, 123, 156, 144, 164, 88, 159, 90, 95, 30, 95, 108, 47, 28, 184, 249, 119, 196, 99, 145, 150, 231, 227, 196, 165, 52, 193, 175, 198, 107, 98, 195, 87, 140, 92, 253, 30, 93, 65, 292, 186, 167, 226, 68, 168, 105, 195, 106, 116, 153, 320, 413, 113, 274, 178, 96, 26, 109, 52, 78, 74, 54, 205, 49, 158, 64, 154, 60, 131, 228, 96, 127, 30, 129, 138, 120, 89, 294, 345, 155, 123, 90, 159, 137, 110, 10, 35, 71, 26, 93, 132, 57, 106, 167, 79, 125, 304, 253, 178, 154, 165, 92, 76, 73, 6, 75, 42, 73, 155, 68, 16, 214, 154, 8, 231, 253, 124, 240, 249, 128, 55, 129, 107, 97, 106, 190, 179, 177, 69, 210, 96, 230, 75, 189, 100, 42, 87, 79, 300, 60, 117, 42]
-192D2
##PAGE=	F1=5122.23
##FIRST=	25164.767445380970457,	5806.2096540000038658,	0.14208908379077911377
##DATA TABLE=	(F2++(Y..Y)), PROFILE
5806B6L7OK2J06p0J08j86O7r8J39L7j21j5J68Qj85M4J90m2j09N4j37Q6Rp2J25J3j56N9k2k8
5442F3L8L8Q1J0n0m9J8J10j72n6K06P6j06M1m1J2j39N0J11n2p0m4LO5J9l1NP4j59J2R6p7m2
5055D0Qk8L5QM2o6J49l2Q0m8K5o3q7Q3P4j68R8n5pJ87j07j13N6k3K42j42n3J00j19K5n2kl3
4668E4J13l9m4M4o9N6RM3P0j64O5N0k5r7O7m6J32j16P9M1k2j11l5qJ02j02K4P4Pp1J23q8O9
4280A85p2l9J29q2p1M7J03Pj30L5J84j45j03l8J10M8R5J20k19J12mq7MO6r0l0k1L1q9J46j15
3916H7J07l9q2l1O1J52k01J21p7N4K0n3O4o9N4q7k4qKJ10J12m7k02J08Q7J18k12J28k2j63
3564F8R9r9k8KN8JR3J5q3L7j2r3RO7KQ7j04L5j00L5J18p3m8K4P8j3q5J10m3M4L7j43M3q1L3
3154I0n9P6L5Pj06Q7k9J8R5o7k7q7J34R0q9j28K2M0pJ18j00L6k6qK8J17m0r1o2K1m4j0L6J17
$$ y = [26, 63, 69, 91, 197, 127, 235, 49, 116, 18, 157, 194, 73, 58, 226, 234, 49, 93, 283, 241, 132, 186, 49, 135, 144, 72, 197, 210, 54, 113, 91, 63, 101, 139, 220, 230, 180, 131, 149, 259, 87, 31, 237, 313, 207, 248, 207, 219, 80, 130, 241, 189, 119, 75, 78, 143, 162, 131, 136, 210, 51, 63, 159, 82, 40, 48, 20, 55, 63, 105, 39, 188, 156, 236, 188, 213, 150, 63, 146, 220, 52, 150, 95, 88, 275, 168, 55, 111, 88, 330, 188, 135, 235, 116, 141, 89, 87, 54, 167, 128, 84, 128, 59, 115, 124, 167, 237, 73, 138, 188, 163, 66, 133, 87, 219, 103, 182, 223, 201, 90, 55, 47, 149, 47, 71, 145, 152, 81, 204, 116, 185, 113, 74, 203, 121, 50, 97, 200, 207, 77, 112, 296, 151, 48, 10, 120, 168, 263, 383, 164, 276, 272, 185, 189, 255, 165, 135, 114, 145, 56, 202, 87, 194, 155, 73, 42, 103, 255, 54, 175, 98, 152, 172, 119, 183, 114, 168, 81, 57, 49, 51, 161, 273, 226, 24, 132, 219, 337, 125, 253, 231, 68, 167, 68, 40, 42, 100, 101, 194, 209, 126, 163, 151, 58, 67, 134, 136, 223, 119, 154, 54, 89, 207, 134, 86, 110, 188, 175, 90, 200, 157, 201, 238, 95, 138, 57, 90, 31, 107, 142, 149, 43, 130, 101, 119, 214, 147, 120, 33, 167, 257, 168, 40, 62, 102, 95, 213, 113, 149, 123, 115, 143, 260, 220, 129, 67, 88, 44, 34, 70, 187]
2754A87p6l5R2j5k4n9j7J29j46L0J05j29M6L5J7R3j15o0J5l0K6R2j26J36o5K5o6R9o3O8p6
2391I3O1l6j7l9L8J27Q1j47m1J3l6k1O4k3o6J82n8N8q8J52j92n4O3Nm7P1r3j9L9J30o5r4J1
2003E2N1l4Q0k8m8P7R2r0p7o4J4J05m0m2K11p6j42O2mmK04qj02l9j20K3L9J54l4m6m8M2R5
1616B55j07m0N1j27k4N4J33J27j55j21J31J1Pl9lpM1q7O4p5L5q1J6Q3j15QJ73L4j32J23j15
1252A18M8N3K4r1K7j5j52J75k9J11j37q6R8o3M7o0J58j97M2l8K48q9j4O4j51R6n8Q0q8j6P1
888A76J47J02l44J45m8n1j19N8o1N8N6m4J09j20R6j25P5q9J06P6j00J5m0O4J0j4l1J93Qj60
536A48J9n2%K6j1q8KP5p1J05k4l5K2N6m0J6J20m7j10k3L5n7L0k7k9Q8n7OO2q7L0J41n7j04
137F2J62Qj96J35N9j10k8N7k6k9J3L9k6L3o6J63j46R8j18J05q0k5L1n6K59k45L7l6
$$ y = [187, 111, 76, 168, 153, 129, 70, 53, 182, 36, 66, 171, 42, 88, 123, 140, 233, 118, 58, 73, 43, 69, 161, 35, 171, 106, 131, 65, 164, 101, 169, 93, 154, 118, 101, 62, 100, 227, 308, 161, 120, 133, 97, 76, 140, 117, 51, 233, 175, 233, 145, 297, 105, 51, 114, 119, 72, 143, 50, 31, 70, 200, 135, 41, 52, 103, 69, 149, 121, 73, 150, 242, 152, 75, 11, 25, 130, 90, 48, 259, 183, 41, 103, 99, 95, 299, 291, 189, 150, 30, 53, 92, 246, 212, 166, 118, 160, 255, 148, 108, 159, 32, 8, 62, 195, 322, 167, 46, 177, 188, 195, 156, 153, 146, 187, 100, 164, 89, 124, 43, 59, 142, 27, 35, 208, 242, 110, 233, 118, 166, 219, 243, 152, 179, 164, 12, 187, 158, 269, 132, 46, 144, 81, 128, 68, 226, 29, 71, 33, 281, 192, 178, 242, 91, 187, 129, 209, 121, 105, 176, 323, 425, 81, 226, 178, 127, 8, 66, 5, 63, 119, 75, 184, 64, 160, 35, 110, 21, 127, 203, 103, 118, 78, 142, 152, 138, 107, 300, 308, 148, 167, 115, 115, 141, 130, 42, 44, 119, 48, 153, 129, 94, 116, 172, 132, 148, 268, 221, 111, 88, 123, 66, 96, 69, 40, 128, 71, 77, 139, 52, 82, 223, 166, 62, 224, 232, 36, 171, 230, 120, 92, 149, 123, 94, 107, 146, 120, 153, 87, 250, 104, 202, 84, 189, 109, 84, 115, 59, 318, 73, 110, 74]
-192G4
##PAGE=	F1=5019.97
##FIRST=	25164.767445380970457,	5806.2096540000038658,	0.13882175087928771973
##DATA TABLE=	(F2++(Y..Y)), PROFILE
5806G5k4N8KP6p3Q3j32O1p6P9qm6j8K06k1j91O1K13o1j29N5j64R1Pm4J62m5j43O2M9q4K2M1
5419A44O6N2l9p3n6J59j83l8J47R0l8N5p6k2j07L1Q8p7kj7l7M7O2m1J6O4j33qJ33q5o1m1n
5032A5K4M7O4j13R4M5Q7j21O3m5p2J00P6j41k2m7K6J53j09p4P8k9K21j29r0P5p2J0l0L2l1
4668H5M6L4j14J08q6R1n7K4K9r9J22j1k9o2O3o5J48j10R2l3M4j30k5K0L9m8M6MJm2J21q6O2
4280A82p5pQ9o4r0M8J39mj47K6J60j75K6q3J27L3P6J27k55J88kj00k0K2j11M6j2j3l5J05j03
3916I8J23p4j21K1O8J37j80O5o2K5N4m8K4o2R1j02RJ2qQ6R7J0j54OJ01J49j93R6j18j5K0p1
3541H4j9PM0mJ08K3j01Q3n2m8o4J02l5Q8p7L4l8o9J56l3q8P2J0N6j78Q7k3O9K7j27K7J1j4
3154A14o2K6M9j5j08J28m4lJ31m2l2p8O5P7n4q1K0Rj0R7m9j6n6N4M6K5l4l2q6P9m9l6J9J72
$$ y = [75, 51, 109, 111, 187, 114, 197, 65, 126, 50, 129, 121, 75, 57, 263, 242, 51, 112, 325, 264, 135, 190, 26, 117, 124, 80, 242, 197, 54, 116, 165, 81, 103, 144, 210, 262, 223, 150, 94, 253, 70, 32, 179, 269, 231, 286, 210, 188, 81, 112, 200, 123, 121, 104, 67, 114, 176, 135, 151, 215, 82, 74, 207, 122, 61, 20, 15, 39, 86, 150, 37, 131, 176, 263, 142, 205, 160, 88, 188, 264, 123, 101, 54, 80, 233, 124, 50, 128, 99, 320, 191, 101, 176, 104, 114, 84, 116, 85, 131, 165, 51, 159, 73, 164, 107, 131, 160, 61, 183, 172, 143, 81, 144, 79, 227, 117, 209, 176, 220, 90, 65, 85, 124, 76, 122, 126, 127, 85, 206, 120, 182, 107, 100, 189, 125, 35, 83, 222, 218, 71, 97, 257, 82, 108, 25, 152, 185, 261, 388, 133, 321, 319, 219, 199, 221, 110, 156, 144, 131, 96, 201, 98, 221, 147, 26, 47, 115, 252, 72, 137, 75, 100, 154, 106, 130, 68, 159, 57, 66, 78, 70, 156, 253, 263, 109, 115, 216, 365, 172, 268, 150, 135, 155, 84, 65, 72, 112, 108, 216, 239, 138, 221, 169, 121, 57, 159, 124, 212, 135, 169, 131, 62, 218, 185, 97, 169, 179, 235, 57, 144, 121, 190, 217, 90, 117, 128, 114, 52, 78, 127, 112, 4, 132, 88, 85, 216, 174, 142, 64, 129, 206, 152, 71, 91, 100, 90, 187, 138, 122, 66, 120, 166, 191, 157, 125, 39, 118, 69, 33, 52, 224]
2754B24q3q6Q4M6rj37M7J09j56NR9j02O2k1R4O8j44p7J3LK7P9o8O9o4P4m9P9j09P0p5J9K1
2367A12L0m7J6J37Q0j36n8k5l5m2J25k8p6K02n6M6n2J00k03n6R8m1J2N2j12l3K5J77p6j20
2015A6J2P0l1O8jj00J61O1r0r0m2N6j9j2oJ77n1j19LM8o4K23j1p0l1j34KJ01J31q7Kk6K6N6
1616B29r1OK0j16oN5J20J37j64j66J63mM4n9j8k2O7r9N2l9M8p5l4J20p5n0J90j6j18J50j11
1252A38M1R9m4j63Q6j0p9J17k3J67k00q7M5j1L9p9J45j62J03o1J87o8RP0j43O5l8P5r1k3J00
888B04R5R8k96P8Onj32m3N2%R6o1L1n1Q3j38N9m2Q8K7m3k7L7L0J6nl2J67l2r8N0o6p8P5Np9
466F9J9Q7q0J03p7Lj2O1J8nM2n9j39M7nl1N7k7J6R1q5j7M5r0J33O7o4n1R2j1j47O8Q6q4mL1
43A47k0m9M3j0o1O4J0J56j73P3o7R2o5j3K9j21K75k21KK3
$$ y = [224, 141, 55, 139, 185, 176, 39, 86, 195, 39, 44, 143, 41, 103, 82, 176, 244, 100, 23, 36, 39, 66, 145, 77, 146, 82, 156, 107, 186, 77, 147, 72, 91, 112, 142, 95, 111, 248, 328, 192, 134, 109, 74, 32, 157, 129, 53, 255, 199, 245, 193, 293, 90, 34, 132, 91, 103, 155, 43, 10, 35, 212, 136, 16, 28, 98, 67, 135, 134, 34, 195, 256, 166, 76, 34, 90, 71, 59, 53, 230, 179, 60, 63, 111, 47, 270, 259, 189, 158, 24, 26, 127, 258, 171, 173, 147, 173, 229, 138, 144, 164, 48, 42, 97, 217, 354, 190, 24, 187, 183, 227, 168, 150, 128, 195, 96, 148, 109, 157, 82, 48, 168, 93, 43, 233, 217, 99, 249, 138, 179, 278, 234, 71, 157, 147, 68, 185, 162, 329, 129, 42, 87, 76, 115, 36, 181, 19, 122, 61, 248, 180, 189, 259, 116, 181, 143, 218, 127, 104, 204, 299, 397, 101, 179, 185, 180, 48, 5, 57, 57, 153, 92, 123, 72, 155, 17, 76, 34, 122, 149, 106, 79, 116, 146, 162, 157, 125, 292, 260, 162, 212, 146, 68, 143, 148, 69, 88, 175, 95, 198, 121, 124, 112, 173, 191, 186, 228, 169, 30, 77, 72, 41, 98, 71, 87, 178, 93, 76, 121, 31, 164, 231, 167, 116, 208, 197, 50, 118, 204, 120, 116, 147, 127, 78, 121, 111, 50, 114, 124, 280, 107, 180, 113, 205, 140, 127, 156, 35, 310, 89, 91, 114]
-192A14
##PAGE=	F1=4917.71
##FIRST=	25164.767445380970457,	5806.2096540000038658,	0.28190734982490539551
##DATA TABLE=	(F2++(Y..Y)), PROFILE
5806A10n5Q4j1L9o6O0o8L7l3J7o5P3l7J88j4j70K5K27p6j43M5j50O1J2K5J56q8j37Q2J01r3
5442A36m6O0N0O8l0r4r4J83j40o6R0Q8M1O4j06n6p5J0O7q9O3Np6K2R4k3J5N4j05l6J72p4q0
5055I2k3m9PQ2Q0j15JJ10Q6k05J06Nq7J23P0j13j30k4M4J01r0l3J20o8J95r3j26K0j6QnO2
4679A35J1m9R1j56J52q1Q2q4k3MKJ32n7m0nM5j08J90j05P8r6J01j16k5L3j9M9J1m9%l7J31
4304A97r8O3n8K4L3k6q4N3J40k5j53J7J25k01J76j18J09J3L4J25k64K37J0q7m6k4j00R8jn0
3952A19K7N6r8J50j31r5L5Q3R7j57K3k5o0J12l1qJ6M4j15P7j2j1L5P4P1p2q6P7J60j33L9j86
3576G5J02m6m2lJ3L0k5J21K8r1J06r9K6j28R3l5O3n5M8J5j53J80lj21J06n2J34k14J3j0J12
3212A88mj12K7J14p6o6l2O8L8j18Q5m9%J49l7j5o0NJ4j0k6K4j3j4O2J6n8q2J00O2l1m7L9j17
$$ y = [110, 55, 139, 128, 167, 101, 161, 93, 130, 97, 114, 49, 122, 85, 273, 259, 89, 114, 341, 265, 122, 167, 17, 78, 90, 115, 271, 183, 46, 128, 229, 136, 90, 150, 200, 268, 238, 144, 50, 233, 93, 27, 117, 205, 246, 310, 204, 148, 73, 83, 150, 61, 124, 129, 53, 75, 169, 146, 161, 215, 110, 74, 246, 172, 92, 69, 20, 27, 109, 189, 74, 75, 185, 271, 66, 172, 177, 90, 213, 283, 170, 40, 16, 60, 161, 71, 38, 158, 90, 285, 192, 66, 86, 70, 78, 73, 135, 146, 97, 188, 32, 184, 103, 185, 101, 78, 82, 84, 216, 159, 119, 114, 159, 51, 241, 136, 214, 118, 219, 103, 78, 111, 92, 141, 152, 103, 103, 66, 197, 99, 162, 104, 128, 161, 135, 51, 104, 244, 219, 66, 83, 208, 7, 183, 65, 174, 187, 221, 346, 82, 319, 329, 242, 196, 172, 72, 170, 169, 119, 146, 202, 104, 254, 123, 28, 63, 146, 243, 86, 109, 84, 24, 136, 105, 97, 113, 157, 42, 119, 107, 96, 131, 205, 276, 204, 118, 195, 355, 222, 261, 75, 177, 131, 89, 86, 99, 129, 104, 225, 253, 162, 268, 169, 195, 67, 160, 125, 188, 133, 181, 196, 43, 223, 220, 99, 205, 153, 287, 73, 86, 76, 188, 184, 72, 99, 213, 137, 71, 39, 107, 145, 27, 112, 63, 63, 212, 175, 160, 100, 105, 119, 109, 83, 107, 94, 80, 142, 158, 100, 18, 118, 180, 149, 102, 141, 24]
2813B4J25n6n7nK35q0j00J6J14rk03J19P0j40qQ8m2J7m9J35N6j73Kj9k3K2N3kJ3p9J30JK3
2426A98j49P4j4n0N1Q3n2l1J35P9j05q3m3m5kJ24k9q2K01n2L7j8L7k00k7J17o2L5K6j12J2
2062E3l3J87p8j23J3P9l1N4J5q9J69K3q4o9j5R4j49O7mJ23o3o2l9Q6n4J39Lk7k0j39qJ41Q5
1675B44j14N5k6JK2k7J6k5p0k2N6J05J62j53k06J54mP4q2mn3R2j18M6J4L8n0o1J17k7j11K06
1299B49o1r5J47r1K3J39j09j93J20j0oO8jJ84k59j0o5O0K1j04J22j16J55o7R7m0M2P0j36J2
947A46nO7r1mJ19K8P6j67k2M9M3j47l8O6o1J11p2o2O6M6j42O5J0L3l2K6r3J14KL9Ll5J33o1
548B10nM8p6j43J04K6p6L4R9q4Q2j09K8l9O6Q0j2l3r2o2R1j05pN7LN5O4j03l4L4p3K19j1q5
149A51pM1k6l2j4O6n1%mro5R0l9p8M9R3J38k02P2l0R1p2k2L5j03K07j79j9O7
$$ y = [24, 149, 93, 36, 31, 266, 186, 86, 102, 216, 207, 4, 123, 193, 53, 45, 133, 91, 108, 59, 194, 250, 77, 79, 60, 37, 59, 112, 110, 123, 44, 174, 175, 198, 49, 123, 109, 59, 110, 193, 141, 110, 245, 324, 219, 136, 93, 48, 46, 170, 141, 59, 260, 208, 245, 227, 264, 64, 37, 154, 92, 127, 153, 41, 53, 20, 207, 129, 6, 19, 98, 67, 121, 136, 47, 216, 239, 155, 86, 71, 165, 16, 83, 79, 202, 139, 77, 38, 124, 70, 209, 212, 185, 165, 26, 18, 159, 244, 130, 185, 159, 160, 182, 155, 171, 146, 76, 54, 110, 215, 377, 224, 18, 172, 168, 242, 160, 156, 103, 195, 77, 123, 137, 175, 125, 64, 181, 154, 43, 249, 188, 93, 240, 149, 172, 311, 202, 9, 129, 119, 113, 181, 180, 364, 105, 95, 30, 90, 111, 7, 129, 13, 168, 101, 198, 158, 200, 270, 134, 146, 141, 208, 117, 113, 232, 260, 336, 169, 147, 196, 239, 92, 54, 120, 59, 170, 98, 36, 102, 148, 6, 71, 81, 114, 82, 108, 15, 129, 131, 170, 173, 138, 271, 210, 205, 253, 177, 34, 138, 164, 88, 122, 221, 137, 219, 110, 138, 99, 165, 245, 233, 200, 108, 46, 137, 32, 25, 82, 85, 140, 204, 101, 67, 101, 28, 247, 236, 151, 144, 185, 159, 127, 113, 179, 128, 128, 124, 115, 50, 140, 101, 23, 72, 165, 303, 101, 173, 143, 234, 162, 140, 175, 72, 279, 100, 81, 148]
-192A48
##PAGE=	F1=4815.45
##FIRST=	25164.767445380970457,	5806.2096540000038658,	0.49117499589920043945
##DATA TABLE=	(F2++(Y..Y)), PROFILE
5806A26o0Q8j7Mn4M6j7MOj4r7J57m9J35K5j51k6K21q4j53L7j11RK8R0J31j13j22R4J29q9r6
5431G7P9K7O9j7j29p6J75p3q9K9O9J07O1j15q3m9j2P2j9M3J3j07j6J00J6J1M8q2n1J95n4r6
5055A23jq4j9J05Q8j16o3J57O8k32R0Q8j34J49O0r2j56L1j3K1n3K9J38j18J66m2j54rmK6L
4691E2R3M9j23J30j80J78n5L3n6j07N9K5J46p9o7J4O7j41K22j24N2j30J37r1j1L6m7J02l3
4351A51o8Ro0J48j14N5k0N1k7Ql5M6J06m5j45J3R0r1J85j41O8j1k1J15k51K56L1n7p0m7m0
3987H9Q1On8Q2Mr9J76k00j3PJ10N4j45J3J0n0O1lm7R4%j41J24k4j9k2M5J22J5j28J1J53n2
3600B56j6j75J30r5j2RJ9K4m5J36K4o3J11j47Q8j46L8j1M2n1P5N0k13J92J4j47J22r1K04k03
3247A19p8lJ60n0j01O8J81j36q3o6Q7J12j78M8m1J2J47l8J2m5j5q9P7k5L9l5rJ9P9p1k7M0
$$ y = [126, 66, 154, 137, 141, 87, 133, 116, 120, 126, 112, 15, 172, 123, 258, 283, 132, 106, 327, 243, 90, 127, 16, 25, 53, 143, 274, 161, 39, 133, 262, 173, 77, 156, 183, 252, 235, 106, 30, 205, 132, 43, 72, 141, 248, 309, 194, 111, 62, 50, 122, 103, 146, 159, 52, 36, 136, 152, 163, 211, 129, 78, 273, 219, 123, 122, 38, 19, 124, 212, 96, 33, 190, 258, 26, 116, 204, 70, 219, 279, 187, 31, 62, 49, 70, 17, 46, 184, 66, 232, 190, 36, 27, 23, 49, 52, 145, 194, 71, 201, 21, 199, 144, 177, 121, 14, 73, 98, 244, 165, 98, 112, 179, 38, 260, 136, 188, 58, 195, 104, 93, 129, 82, 184, 151, 83, 92, 32, 180, 66, 121, 101, 152, 125, 133, 98, 144, 250, 205, 60, 73, 163, 72, 257, 116, 184, 173, 152, 267, 16, 272, 303, 246, 176, 129, 89, 170, 176, 118, 200, 204, 105, 281, 81, 68, 75, 185, 239, 94, 107, 117, 67, 128, 125, 78, 172, 172, 31, 155, 131, 112, 90, 135, 257, 272, 144, 155, 308, 256, 240, 65, 195, 100, 88, 97, 116, 140, 95, 231, 255, 192, 303, 156, 244, 98, 136, 125, 167, 116, 191, 241, 28, 220, 234, 87, 209, 118, 322, 119, 41, 38, 198, 148, 47, 115, 296, 160, 77, 11, 98, 210, 32, 80, 39, 51, 198, 160, 172, 127, 112, 23, 100, 75, 114, 79, 70, 89, 168, 97, 70, 110]
2872A10O7j8o9P7j44J54o2p9RK55p1q8q1J76k1j82J27J5j13RO9k3j5m2J31O0k00P8l3o9J6
2508D3K6N4mq7J45O7m8j72P7P5p3OJ29n5q5J20Q1n7j14l5m6L8R8l7o5J60m1L6Mk4j73K0J00
2121A63n2L2j0p7N0o1J38o7j01N0K6j2M2Nn4J45k2p2j5j1J23j50N1j8Q1j08J8j1N4pMK6J8
1733A78rj42J1J40L1r9R0n0k6NN7jp6mn4M2R4J95j22k15Q6J4Q3q9L6p9R8j38N8M0J3Mp5Q8
1334A84K2j65K06q2q1J23o3qJ73j59p1J8lM7K8K6J70k90O4j06Q8Mq5M6m9J44n0Pj1Q3O2j33
959A39n6L8N5q1L4J24l8M3k9r6P1Q7j66l0P6j01R3p0k8R8oj38P0L8k4n7O6m8N3oP1Qm6R5p3
548A66Q6K9q6j59R1M6p8L2J16p9M7j13L6n0O6J43j2r5j34M6R0j46k1L6N3Q0Pj03m3K9j8K53
172C15q4j11K6Pk8N7l8J6k0nm5jo7J31n3j4j8J25J21k30R9k5R9r7m2N3l5R9j33j4P6
$$ y = [110, 177, 159, 90, 167, 23, 177, 115, 36, 45, 300, 229, 141, 60, 236, 215, 33, 160, 175, 62, 71, 140, 117, 102, 60, 191, 251, 51, 129, 96, 27, 43, 69, 123, 119, 32, 177, 244, 196, 24, 101, 176, 103, 109, 238, 183, 98, 218, 299, 242, 128, 93, 47, 85, 183, 146, 81, 241, 200, 236, 240, 216, 43, 63, 163, 111, 143, 133, 56, 106, 45, 183, 116, 15, 65, 91, 79, 121, 126, 72, 217, 195, 123, 108, 97, 220, 70, 121, 103, 184, 76, 94, 83, 137, 130, 134, 160, 178, 169, 27, 38, 178, 209, 110, 200, 150, 124, 129, 186, 185, 109, 105, 51, 93, 187, 382, 260, 45, 131, 145, 228, 139, 175, 96, 194, 56, 114, 154, 167, 171, 96, 184, 206, 41, 247, 165, 84, 207, 144, 136, 309, 150, 79, 97, 94, 141, 169, 195, 365, 75, 139, 33, 121, 125, 40, 86, 37, 181, 131, 138, 127, 210, 272, 139, 83, 121, 176, 95, 129, 253, 215, 258, 229, 133, 204, 291, 125, 95, 171, 70, 163, 93, 65, 163, 157, 19, 89, 127, 103, 46, 112, 64, 117, 111, 182, 190, 144, 239, 166, 252, 281, 195, 36, 127, 173, 95, 127, 243, 164, 211, 98, 134, 84, 150, 293, 281, 186, 52, 98, 188, 42, 21, 57, 110, 190, 197, 94, 51, 80, 62, 315, 231, 120, 146, 153, 125, 182, 144, 160, 140, 135, 90, 89, 22, 153, 100, 86, 68, 193, 314, 84, 183, 158, 257, 160, 118, 171, 136, 235, 102, 88, 164]
-192A64
##PAGE=	F1=4713.2
##FIRST=	25164.767445380970457,	5806.2096540000038658,	0.60508006811141967773
##DATA TABLE=	(F2++(Y..Y)), PROFILE
5806A25n4P6rk2m3M4J9l8L5k3m8J48m6N7Q5j41p2J94p3j74M2p7N2J5Q1R3j22o7O9J35q0r3
5431H8O9%O8Jj77rJ43k0p5l5M6J37M5r4r8l6l5J21M9LJj21k5L8N6J3N0o8l1J88l1j07Jj00
5032E5m2J19Q2j14o2J51L7j15o6J88j72J48M8q3p0K0n2m3lO2J17j67J35J3j66J00q2N5o8J22
4679A47P3j67J53j95J93k3m0%q1P4l6J71q1q3l8J37j40K04j62L3q6J10q3L0M3n2R7p4l6Nq4
4316IJ50q2oK8O5o8J7L7L8M2n0j12oO9kJ82j46J3l6o1R5j21J35O1k2r0j4%K5J3l8J19l8j02
3916A04J84k57O6j7J48J8j45J8L4Ok3J6r1J49j1j83J48j7l4n6KJ50Q8j21q2J47L0n0j18R5
3564A98j33K6MK4K3n6J51J1k7J00j83J22j24m6J9N1o7J06O2k46J94J9j66J21p8K26j77j29
3236B5J8J72q7j04J30K05j78j15j3N8J46k23K8j5LJ21l3L6m0j3o6J00j06Q0o5K0j9J02o3R
$$ y = [125, 71, 147, 138, 116, 73, 117, 136, 98, 133, 110, 62, 210, 164, 221, 306, 165, 93, 287, 214, 40, 82, 5, 57, 72, 153, 246, 124, 57, 126, 261, 181, 88, 157, 157, 225, 226, 49, 40, 183, 163, 88, 53, 99, 236, 281, 187, 89, 53, 18, 139, 188, 191, 192, 71, 46, 84, 140, 153, 203, 135, 104, 292, 261, 154, 155, 55, 13, 132, 214, 100, 38, 189, 226, 111, 45, 233, 61, 209, 257, 174, 104, 124, 72, 29, 26, 88, 205, 38, 173, 186, 20, 120, 38, 93, 25, 147, 220, 53, 206, 11, 204, 181, 141, 141, 60, 134, 98, 269, 188, 105, 67, 204, 64, 268, 106, 139, 53, 163, 80, 110, 153, 101, 198, 124, 88, 93, 9, 159, 77, 71, 99, 164, 96, 113, 150, 188, 230, 180, 68, 62, 131, 129, 311, 165, 178, 142, 81, 176, 55, 190, 251, 229, 139, 125, 125, 150, 163, 125, 244, 206, 104, 288, 31, 97, 80, 228, 246, 101, 119, 153, 159, 136, 152, 61, 210, 199, 16, 164, 147, 113, 57, 59, 209, 297, 176, 94, 241, 271, 221, 103, 198, 65, 91, 95, 119, 142, 86, 237, 248, 221, 321, 138, 260, 136, 90, 109, 160, 93, 199, 261, 15, 209, 228, 62, 183, 105, 331, 154, 25, 43, 215, 128, 24, 154, 359, 181, 66, 53, 111, 257, 34, 62, 47, 50, 171, 138, 174, 134, 121, 55, 155, 49, 129, 64, 84, 65, 167, 104, 113]
2884A13j3N8K9p3P6j70J79p1q5O3K08n7o9j72K22m0j31J22m9p4N0L7l8k7rR2P0k10J33m2q3
2520C9k5K6P1K5o1R0J31j14j77Q7J41q9l7J59n3j34R6Q4Kj44j0k1L1P5o0k5R3k1M2J1p3j18
2144D1M9O2l2L0m9j6P3q5P0m4p0Q2l8J4M7k5j7J21p4n5N6l2J36j24J9k6P3j36O7K0J2K6j10
1757F5M4O0Nj48L6J21j9m6R4q9m6L6J03k6j23O1p2OP7K22p5k25PN9O5p6Q4q1O9j33Q5Qj9Q6
1358B15q0N0O0j93J75p4r1R5l6n0K00j77M2p4K5O1jM6J38k68J02q3P4mq4J1j2R2j0o8QJ32
982B21M8j38j15P4L4n3P8J13q9J1P2j36Q9J14j82l2Q5j06M7n4P7P7m7j28M2O6q1JK8L0n8L2
606A20Q0J5o7N4p3J45J5r8j40O0O1q5J5J31o5Mp9J7l8O5K00k0j42j65J05Q8j41j8jR7Q4o3
231A61q3m4L5L6K51j48j16M0k1j6J14l9k4Kqq6Lk1J15o1M4k4Q7J09k49J51o0J11j14p8Q7L5
$$ y = [113, 100, 158, 187, 114, 190, 20, 199, 128, 43, 106, 314, 257, 188, 16, 238, 198, 67, 189, 140, 66, 116, 153, 115, 88, 79, 171, 241, 31, 164, 122, 39, 14, 40, 111, 136, 75, 165, 296, 182, 5, 92, 233, 144, 107, 266, 213, 79, 175, 259, 261, 117, 107, 86, 117, 192, 132, 107, 200, 179, 221, 232, 159, 41, 90, 152, 120, 150, 101, 85, 158, 73, 143, 99, 29, 111, 73, 87, 134, 109, 92, 213, 139, 84, 140, 108, 244, 120, 139, 113, 186, 50, 117, 137, 149, 175, 65, 109, 169, 174, 26, 62, 183, 164, 118, 212, 123, 77, 113, 216, 190, 67, 128, 56, 62, 139, 361, 286, 61, 68, 127, 192, 116, 200, 119, 188, 55, 140, 148, 129, 215, 135, 185, 245, 52, 227, 153, 62, 157, 121, 71, 271, 94, 136, 62, 87, 148, 147, 193, 331, 63, 165, 82, 156, 152, 68, 79, 67, 159, 149, 81, 89, 221, 269, 131, 16, 90, 124, 71, 149, 262, 173, 184, 256, 120, 209, 323, 141, 109, 194, 88, 135, 81, 158, 235, 188, 60, 102, 168, 87, 88, 116, 146, 88, 120, 200, 215, 148, 202, 129, 274, 289, 191, 51, 111, 172, 87, 102, 233, 168, 172, 93, 110, 72, 137, 337, 317, 175, 10, 115, 203, 62, 44, 43, 140, 224, 161, 78, 34, 69, 105, 356, 208, 92, 132, 111, 95, 209, 170, 146, 148, 140, 54, 57, 36, 151, 90, 134, 110, 197, 306, 57, 208, 148, 259, 145, 67, 154, 189]
-145A89Mr9JO1
$$ y = [189, 193, 94, 95, 156]
-192A56
##PAGE=	F1=4610.94
##FIRST=	25164.767445380970457,	5806.2096540000038658,	0.49463239312171936035
##DATA TABLE=	(F2++(Y..Y)), PROFILE
5806A10m6N8Rl8l2N2M5q1M6k2nJ35k7l2J50j44j05J58k7j77J9k4J06MJ0M3j08OK6J22o8m7
5431A16K6j7P1K6j66K1J01km8p7L5J24K1m2j05k8m0J61Q7j5k3j32no1P7K6N3n5J8J60qj09
5055A90l0r8n6J28O4j13l1J26Oj1j46K26j57R2L6q9L6J1p6Qo0Q4Q6j90Q2O1j59J70j04Q4j25
4691D5R5Q7j88J60j87J86Mj19N8j5O3r7J86o4o8j03J85j36J60j93J7M4M1j29R3O6p1P4j07
4351H7L5k6m9Q9jp4M1O0q5RJ08L0l9l8l6o0O6M1J74j31m3n2k7M3Ml0Q7Nr8O5mm0K5mJ36n8
3928B10j04J66j95L8l2J87kj54J2N8N8q7J9j25J70Nk18J43Mn2k5k6R2J30o5j91J79P3n7q5
$$ y = [110, 64, 122, 131, 93, 61, 113, 158, 77, 123, 101, 96, 231, 204, 172, 322, 178, 73, 231, 204, 27, 46, 22, 128, 132, 142, 185, 77, 83, 109, 231, 163, 116, 142, 125, 196, 222, 56, 77, 178, 176, 128, 51, 86, 210, 231, 189, 84, 56, 16, 177, 264, 249, 226, 94, 89, 28, 105, 131, 184, 129, 147, 307, 299, 190, 160, 62, 6, 134, 198, 85, 54, 180, 186, 175, 29, 255, 98, 190, 226, 137, 173, 184, 108, 116, 56, 140, 226, 36, 118, 179, 20, 190, 86, 170, 45, 140, 227, 39, 199, 12, 198, 202, 83, 141, 126, 189, 92, 278, 214, 146, 43, 228, 92, 252, 59, 76, 120, 161, 32, 125, 191, 120, 194, 87, 122, 96, 47, 136, 135, 61, 102, 162, 77, 86, 194, 224, 185, 147, 111, 51, 117, 158, 332, 201, 158, 106, 79, 122, 126, 96, 183, 188, 90, 155, 151, 111, 136, 132, 268, 210, 106, 272, 77, 115, 83, 270, 268, 114, 126, 184, 242, 155, 174, 49, 219, 224, 6, 149, 153, 101, 76, 50, 142, 272, 207, 16, 195, 268, 211, 126]
$$ [...]
-192A72
##END NTUPLES=	nD NMR SPECTRUM
##END=	
##END=	
