##TITLE=	Nov18-2021.72.ser
TM-VI-171 CDCl3 Sc+ Bz-pyr. hsqc

##JCAMP-DX=	6.0	$$ MestReNova 14.3.0-30573
##DATA TYPE=	LINK
##BLOCK_ID=	1
##BLOCKS=	2    
##ORIGIN=	Mestrelab Research S.L.
##OWNER=	hrzepa
##$MNOVA/LINK_BLOCK_TYPE=	ITEM	$$ NMR Spectrum
##$MNOVA/ITEM/POLYGON=	(XY..XY)
5321,5835
8722,5835
8722,8208
5321,8208
5321,5835
##$MNOVA/ITEM/Z=	0
##$MNOVA/ITEM/ANGLE=	0
##TITLE=	Nov18-2021.72.ser
##JCAMP-DX=	6.0	$$ MestReNova 14.3.0-30573
##BLOCK_ID=	2
##DATA TYPE=	MNOVA NMR VIEW DATA
##DATA CLASS=	MNOVA VIEW DATA
##$MNOVA/2D/THRESHOLD=	3.2122404575347900391
##$MNOVA/ITEM/ZOOM/X=	-0.57569381887933257502,	10.597560000003785063
##$MNOVA/ITEM/ZOOM/Y=	-9.5463849045685140737,	230.0176000018207958
##END=	
##TITLE=	Nov18-2021.72.ser
##JCAMP-DX=	6.0	$$ MestReNova 14.3.0-30573
##BLOCK_ID=	3
##DATA TYPE=	nD NMR SPECTRUM
##DATA CLASS=	NTUPLES
##NUMDIM=	2
##ORIGIN=	Bruker BioSpin GmbH
##OWNER=	nmr
##.OBSERVE FREQUENCY=	400.20200099999999566
##.OBSERVE NUCLEUS=	^1H
##.SOLVENT NAME=	CDCl3
##.PULSE SEQUENCE=	hsqcetgpsi2.ph
##LONGDATE=	2021/11/18 14:51:00.000
##.ACQUISITIONMODE=	SIMULTANEOUS (DQD)
##$ORIGINAL FORMAT=	Bruker XWIN-NMR
##$MNOVA/SCALES_VERSION=	9
##$PARAMETER FILE=	(acqu2s, ASCII, /private/var/folders/f6/rjf_tdyn2v98c5c0wvkgn4s80000gn/T/Kte3Ug5LQYyzFVwqGWj55A/72/acqu2s, 0)
$$ ##TITLE= Parameter file, TOPSPIN		Version 3.2
$$ ##JCAMPDX= 5.0
$$ ##DATATYPE= Parameter Values
$$ ##NPOINTS= 241	$$ modification sequence number
$$ ##ORIGIN= Bruker BioSpin GmbH
$$ ##OWNER= nmr
$$ $$ 2021-11-18 15:00:54.649 +0000  nmr@CZC2439F63
$$ $$ /opt/topspin/data/agmb/nmr/Nov18-2021/72/acqu2s
$$ $$ process /opt/topspin3.2/prog/mod/go
$$ ##$ACQT0= 0
$$ ##$BF1= 100.63037
$$ ##$FnMODE= 6
$$ ##$NUC1= <13C>
$$ ##$NusJSP= 0
$$ ##$NusT2= 1
$$ ##$NusTD= 240
$$ ##$O1= 11069.4607123918
$$ ##$SFO1= 100.641439460712
$$ ##$SW= 240.006397974962
$$ ##$SW_h= 24154.5893719807
$$ ##$TD= 240
$$ ##END=
$$ 
##$PARAMETER FILE=	(acqus, ASCII, /private/var/folders/f6/rjf_tdyn2v98c5c0wvkgn4s80000gn/T/Kte3Ug5LQYyzFVwqGWj55A/72/acqus, 0)
$$ ##TITLE= Parameter file, TOPSPIN		Version 3.2
$$ ##JCAMPDX= 5.0
$$ ##DATATYPE= Parameter Values
$$ ##NPOINTS= 12	$$ modification sequence number
$$ ##ORIGIN= Bruker BioSpin GmbH
$$ ##OWNER= nmr
$$ $$ 2021-11-18 15:00:58.136 +0000  nmr@CZC2439F63
$$ $$ /opt/topspin/data/agmb/nmr/Nov18-2021/72/acqus
$$ $$ process /opt/topspin3.2/prog/mod/shimcntl
$$ ##$ACQT0= 1000000
$$ ##$AMP= (0..31)
$$ 100 100 100 100 100 100 100 100 100 100 100 100 100 100 100 100 100 100
$$ 100 100 100 100 100 100 100 100 100 100 100 100 100 100
$$ ##$AMPCOIL= (0..19)
$$ 0 0 0 0 0 0 0 0 0 0 0 0 0 0 0 0 0 0 0 0
$$ ##$ANAVPT= -1
$$ ##$AQSEQ= 0
$$ ##$AQ_mod= 3
$$ ##$AUNM= <au_zg>
$$ ##$AUTOPOS= <49 >
$$ ##$BF1= 400.2
$$ ##$BF2= 100.63037
$$ ##$BF3= 400.2
$$ ##$BF4= 400.2
$$ ##$BF5= 400.2
$$ ##$BF6= 400.2
$$ ##$BF7= 400.2
$$ ##$BF8= 400.2
$$ ##$BYTORDA= 0
$$ ##$CAGPARS= (0..11)
$$ 0 0 0 0 0 0 0 0 0 0 0 0
$$ ##$CFDGTYP= 0
$$ ##$CFRGTYP= 9
$$ ##$CHEMSTR= <none>
$$ ##$CNST= (0..63)
$$ [...]
$$ 0 0 0 0
$$ ##$ShimPowMaxUC= (0..63)
$$ 130000 130000 130000 130000 130000 130000 130000 130000 130000 130000 130000
$$ 130000 130000 130000 130000 130000 130000 130000 130000 130000 0 0 0 0
$$ 0 0 0 0 0 0 0 0 0 0 0 0 0 0 0 0 0 0 0 0 0 0 0 0 0 0 0 0 0 0 0 0 0 0 0 0
$$ 0 0 0 0
$$ ##$ShimPowMaxUG= (0..63)
$$ 524287 524287 524287 524287 524287 524287 524287 524287 524287 524287 524287
$$ 524287 524287 524287 524287 524287 524287 524287 524287 524287 0 0 0 0
$$ 0 0 0 0 0 0 0 0 0 0 0 0 0 0 0 0 0 0 0 0 0 0 0 0 0 0 0 0 0 0 0 0 0 0 0 0
$$ 0 0 0 0
$$ ##$ShimPowRcbType= 3
$$ ##$ShimPowRes= (0..63)
$$ 1e-20 1e-20 1e-20 1e-20 1e-20 1e-20 1e-20 1e-20 1e-20 1e-20 1e-20 1e-20
$$ 1e-20 1e-20 1e-20 1e-20 1e-20 1e-20 1e-20 1e-20 0 0 0 0 0 0 0 0 0 0 0 0
$$ 0 0 0 0 0 0 0 0 0 0 0 0 0 0 0 0 0 0 0 0 0 0 0 0 0 0 0 0 0 0 0 0
$$ ##$ShimPowRng0= (0..63)
$$ 1 1 1 1 1 1 1 1 1 1 1 1 1 1 1 1 1 1 1 1 0 0 0 0 0 0 0 0 0 0 0 0 0 0 0 0
$$ 0 0 0 0 0 0 0 0 0 0 0 0 0 0 0 0 0 0 0 0 0 0 0 0 0 0 0 0
$$ ##$ShimPowRng1= (0..63)
$$ 1 1 1 1 1 1 1 1 1 1 1 1 1 1 1 1 1 1 1 1 0 0 0 0 0 0 0 0 0 0 0 0 0 0 0 0
$$ 0 0 0 0 0 0 0 0 0 0 0 0 0 0 0 0 0 0 0 0 0 0 0 0 0 0 0 0
$$ ##$ShimPowRng2= (0..63)
$$ 1 1 1 1 1 1 1 1 1 1 1 1 1 1 1 1 1 1 1 1 0 0 0 0 0 0 0 0 0 0 0 0 0 0 0 0
$$ 0 0 0 0 0 0 0 0 0 0 0 0 0 0 0 0 0 0 0 0 0 0 0 0 0 0 0 0
$$ ##$ShimPowRng3= (0..63)
$$ 1 1 1 1 1 1 1 1 1 1 1 1 1 1 1 1 1 1 1 1 0 0 0 0 0 0 0 0 0 0 0 0 0 0 0 0
$$ 0 0 0 0 0 0 0 0 0 0 0 0 0 0 0 0 0 0 0 0 0 0 0 0 0 0 0 0
$$ ##$ShimSysFunc= (0..63)
$$ 1 2 3 4 5 7 9 11 15 16 8 10 12 14 6 17 13 18 19 20 0 0 0 0 0 0 0 0 0 0
$$ 0 0 0 0 0 0 0 0 0 0 0 0 0 0 0 0 0 0 0 0 0 0 0 0 0 0 0 0 0 0 0 0 0 0
$$ ##$ShimSysMatrix= 0
$$ ##$ShimSysType= 1
$$ ##$TFXNUM= 0
$$ ##$TRIPLO2= 0
$$ ##$VTU= 2
$$ ##$VTUETH= <149.236.99.20>
$$ ##$VTUTY= <no>
$$ ##$WBREFAM= (0..15)
$$ 135.5 97.7 100 100 100 100 100 100 100 100 100 100 100 100 100 100
$$ ##$WBREFLM= (0..15)
$$ 0 0 0 0 0 0 0 0 0 0 0 0 0 0 0 0
$$ ##$WBREFPH= (0..15)
$$ 72.26 -67.22 0 0 0 0 0 0 0 0 0 0 0 0 0 0
$$ ##$WBSGU= (0..15)
$$ 0 0 0 0 0 0 0 0 0 0 0 0 0 0 0 0
$$ ##$XFAC= 2
$$ ##END=
$$ 
##$DECIM=	4464
##$DSPFVS=	20
##.ACQUISITIONSCHEME=	ECHO-ANTIECHO
##NTUPLES=	nD NMR SPECTRUM
##VAR_NAME=	FREQUENCY1,	FREQUENCY2,	SPECTRUM
##SYMBOL=	F1,	F2,	Y
##.NUCLEUS=	13C,	1H
##.OBSERVE FREQUENCY=	100.64143946071199309,	400.20200099999999566
##VAR_TYPE=	INDEPENDENT,	INDEPENDENT,	DEPENDENT
##VAR_FORM=	AFFN,	AFFN,	ASDF
##VAR_DIM=	512,	512,	262144
##UNITS=	HZ,	HZ,	ARBITRARY UNITS
##FIRST=	23146.756194512010552,	4241.1435120000014649,	-0.31971669197082519531
##LAST=	-960.65624510154020754,	-230.39266631542668051,	-0.45273473858833312988
##MIN=	-960.65624510154020754,	-230.39266631542668051,	-1.9913218021392822266
##MAX=	23146.756194512010552,	4241.1435120000014649,	23.80936431884765625
##FACTOR=	1,	1,	0.0047612948460246332788
##PAGE=	F1=23146.8
##FIRST=	23146.756194512010552,	4241.1435120000014649,	-0.31971669197082519531
##DATA TABLE=	(F2++(Y..Y)), PROFILE
$$ [...]
##PAGE=	F1=-17331.1
##FIRST=	23146.756194512010552,	4241.1435120000014649,	0
##DATA TABLE=	(F2++(Y..Y)), PROFILE
3410E2M2r0o5M4M4K1oL7n1Q6q9nO7j09Nr7K3J46o4J14j68k6N6n7J7L0jnJ3J3l0K2j0J01n1
$$ 52 94 4 -61 -17 27 48 42 79 28 114 25 20 87 -22 -17 -114 -91 55 -9 105 -63 -89 -33 -90 -73 -43 -44 -49 -36 -23 -53 -31 -41 60 9
3104IoLm6k5J34Q6j49n3J6R6j01J42o7J0n7O7n1l9M2m5N0m0R7m9lLpJ8q7m2O0j14J45N1r6
$$ 9 3 6 -40 -65 69 155 6 -47 -31 65 -36 106 39 49 -8 59 8 -31 11 -34 16 -24 73 24 21 24 17 35 -52 -94 -34 -148 -3 48 -48
2797d8J40j99K37j30m9R0L2k9j4n1J39Lj06p4P4J1p8l5K22j45J05n2J40j76n5M9r2K9O8J8
$$ -48 92 -107 130 0 -49 41 73 44 30 -21 118 121 15 -59 15 26 -52 -87 135 -10 95 43 183 7 -48 1 -91 -62 6 24
2535B4pj04O8J08j7m8n8l3MO6Q3k3q5J48o2l8J8j33P4pK8q8L5J63n7j15Q0R5j15j4j7J0J16
$$ 24 17 -87 -19 89 72 24 -34 -67 -63 3 86 63 -22 126 64 26 44 -89 -15 -22 6 -82 -47 116 59 -56 24 119 4 -10 -27 -17 99
2246I9o0M5m3k9j78J57P4o5M4r9J47J7j29R7j38M1J65j02p3K3j1nJ19Q6k90O6O4qq2Q0o8P1
$$ 99 39 84 41 12 -166 -9 65 0 44 -55 92 109 -20 77 -61 -20 145 43 -30 -7 -18 -23 96 182 -108 -42 22 14 -68 12 -56 15
1966A5l1n8J10k3kL9l1p6K7j3k4Q3l4K8Kj9K4jl1m9ol7J96o9j6j69J06J08n3K3K3q4P7j2R8
$$ 15 -16 -74 36 13 11 50 19 -57 -30 -43 -67 16 -18 10 12 -7 17 16 -15 -64 -70 -107 89 20 4 -165 -59 49 -4 19 42 -42 35 23 121
1660A21Kk32P2J0J80j17O3p5Jj40oK23j78pQ9J00j96J57l7r3J69j05o7O1K5j03N2J04j38L1
$$ 121 123 -109 -37 -27 153 36 99 24 25 -115 -121 102 -76 -83 6 106 -90 67 30 -63 106 1 -66 -5 20 -83 -31 73 -65 -34
1397c4Mm2O4m0R7j22J39m4m7j28K09j17r6J65J05j27N2o6j02l8L04l4j84L7J13j14o8J84p1
$$ -34 -30 -72 -8 -48 49 -73 66 22 -25 -153 56 -61 -157 8 113 -14 38 -28 -130 -168 136 102 -82 -45 68 -46 -114 70 -1
1143aJ0qLj1j1J08q8j0K8j02J47qj46Q5K4k6j73N0J11m5MO6K1N0j85O4J27j59n2R3o8P3K7
$$ -1 9 1 4 -7 -18 90 2 -8 20 -82 65 57 -89 -4 20 -6 -179 -129 -18 -63 -59 7 28 78 -107 -43 84 -75 -127 -34 -102 -29 -2
855bJ3p8O4O0qn8L4p8R6L2o2K5Kj41P5m9pM1N9j66L4J94j77J82o4j11JP9j36J73K1o9R1m4
$$ -2 11 -67 -3 57 49 -9 25 -53 43 75 13 38 40 -101 -26 -75 -82 -41 18 -148 -114 80 -97 85 21 -90 -89 -10 -146 27 48 -21 70 26
557B6O8%L1j53O5%OKor8J11N5j45o3J05K0l8Nl6R7j0JK4J9M1j66q6Q2N6m4N8J7J9P8k1k01
$$ 26 94 94 125 -28 37 37 43 45 39 -59 52 107 -38 -101 4 24 -14 -9 -45 52 42 43 67 86 127 -39 -125 -43 13 -31 27 44 63 141 120 -81
242h1K8J16q0K6J32j46k7R7j6J18o0o0j14J7J0Q3n0J3j06M6K3J11j44j1L4J01M0PNn2q6N3
$$ -81 -53 63 -17 9 141 -5 -32 65 49 167 107 47 -67 -50 -40 43 -7 6 -100 -54 -31 80 -64 -75 -41 60 100 107 112 60 -26 27
-38B7kn0P5q8k1K0N9N3n0M6NN8r2jN5j35K4Q8j44M3qL
$$ 27 25 -25 50 -38 -59 -39 20 73 23 69 74 132 40 39 94 -41 -17 71 -73 -30 -38 -35
-230c5
##PAGE=	F1=-17425.4
##FIRST=	23146.756194512010552,	4241.1435120000014649,	0
##DATA TABLE=	(F2++(Y..Y)), PROFILE
4241c4l2Q6N4j11J81r7j01N4j25Q4K1j8J31m2k44m0J93m5J61n6r5L2m0Q7j75J37J37nJ9j02
$$ -34 -66 20 74 -37 144 47 -54 0 -125 -41 -20 -38 93 51 -193 -233 -40 -85 76 20 -75 -43 -83 4 -171 -34 103 98 117 15
3979A5l0KL0J6Q1k13O4P0N4j11pL7M7j01N6J4l8P4m6n6L8L6j11J62k06O4O8L9qn6P9k18P2
$$ 15 -15 -13 17 33 114 -99 -35 35 89 -22 -29 8 55 -46 10 24 -14 60 14 -42 -4 32 -79 83 -123 -59 9 48 40 -16 63 -155 -83
3690h3J43JNJ6L7k16N0M4R4j19O9L7r0k0q9J66j84J75J9J12q3j07m1R6Q3m5k5m2r7J00N9j8
$$ -83 60 61 66 82 119 -97 -47 -3 91 -28 41 78 -12 -32 -121 45 -139 36 55 167 84 -23 -64 32 115 70 45 3 -94 6 65 47
3410D7R3q5q3QJ4K0L3M0r3J08q2LN0q7kj02M6J46n6P0j32j9L9j30O9L1Q9q8L6J1ql3kJ12l2
$$ 47 140 55 -28 -20 -6 14 47 87 -6 102 20 23 73 -14 -16 -118 -72 74 18 88 -44 -63 -24 -154 -85 -54 35 -53 -17 -6 -14 -47 -49 63 31
3104C1K8l2n7m9J45J15j48n5L2R4j33J31j9l5n0N8qk6k0k6O3l6M9pj2j4j4M9j50JN3r0J32
$$ 31 59 27 -30 -79 66 181 33 -22 10 104 -29 102 83 48 -2 56 48 22 2 -24 39 3 52 45 33 19 5 54 -96 -95 -42 -132 0
2815@P8j03J14k33K41r8l4P5J0J0om5R2j5q1j14J32j2r6m8K87j61P5l0J34j82n3P4q0j1P7
$$ 0 78 -25 89 -144 97 -1 -35 40 50 60 54 9 101 86 5 -109 23 11 -85 -133 154 -7 68 38 172 -10 -63 11 -69 -80 -3
2544cllr6R8J20k3n9m7n1l6P7O4J6m7R1m5k9J1j66J26j9J6n7j0K22m6j78J28P6j10p5O4J7
$$ -3 -6 -9 -105 -7 113 90 31 -16 -67 -103 -26 38 54 7 98 53 24 35 -131 -5 -24 -8 -65 -75 147 101 -77 51 127 17 -58 6 23
2255B3P3n0Mj7rk07J47J42j28J44j18P9J8j22J03j49N0J39q8o7O7n0j6P8L4j82M7J34j07n2
$$ 23 96 46 50 33 24 -183 -36 106 -22 122 4 83 101 -21 82 -67 -17 122 34 -33 34 -16 -32 46 80 -102 -55 79 -28 -80
1992h0O7j8P5p9p0J23JL0J2K1j47O0k9k2M9k1M0L7op2J6Lo4K8m6J80q7J0j80J20J39q5K9K6
$$ -80 -13 -31 44 -35 -105 18 19 49 61 82 -65 -5 -34 -56 -7 -28 12 49 43 -29 -13 -10 -74 -46 -92 88 1 11 -169 -49 90 5 34 60
1695F0q0Q3k7N1P2k78R4L0J31j02N5o3k7j04j2J83j77J15oP8j49J39n8p1J16p9k7M0L8j54
$$ 60 -20 63 36 87 159 -119 -25 5 136 34 89 26 -1 -105 -117 66 -111 4 -2 76 -73 66 8 -63 53 -26 -53 -13 25 -129
1432a29J13O6j00L5lk7J12p9P4j58J57o7k3j00J18q5jJ26R8k02J30o4j21l2K65m2q4j0R2j29
$$ -129 -16 50 -50 -15 -18 -45 67 -12 62 -96 61 -6 -29 -129 -11 -96 -97 29 127 -75 55 -9 -130 -162 103 61 -23 -33 59 -70
1170g0k5J75r1M9k0k5k2N0L9q8rM9j23J29L1j90J55J4l2k03O9J04mqJ13n9N2j98J26R0j18
$$ -70 -95 80 -11 38 18 -7 -29 21 60 -28 -37 12 -111 18 49 -141 14 28 -4 -207 -138 -34 -38 -46 67 8 60 -138 -12 78 -40
898d0m3R3m1k5N6J3r7P3R5l2k3K2j37J39L3l9j3K4j30L2m5j7Q8j3j63Q0K02j86J76p6q7P0
$$ -40 -83 10 -31 -56 0 13 -84 -11 84 52 29 51 -86 53 86 47 34 58 -72 -40 -85 -102 -14 -27 -190 -110 92 -94 82 6 -81 -11
618a1M7j35J11K5n7Q4m1O4J3J9j57K0QM0K2M3j70J20Q9j63k1M3K5qk4j3Q4MJ0j4L4rj26j7
$$ -11 36 -99 12 37 -20 64 23 87 100 119 -38 -18 -10 30 52 95 -75 45 134 -29 -50 -7 18 10 -14 -27 57 61 71 57 91 82 -44 -61
321f1J03p2l0J01k0O8L9K6k29P8Q5r0J1J70k00j0O1M7O6r0m0q5M1m1J41n0qr0O8K4P8j21j9
$$ -61 42 -30 -60 41 21 89 128 154 -75 3 88 -2 9 179 -21 -31 30 77 143 53 13 -72 -31 -72 69 19 11 -79 -11 13 91 -30 -49
32d9kJ17M4k3mo1m6Lj5K0K1m3L3J6K3O4q5O0j7Q1j14J1N0j27OQ3r3Lj5K4
$$ -49 -51 66 110 87 83 22 -24 -21 -36 -16 5 -38 -5 11 34 98 13 73 56 137 23 34 84 -43 -37 46 -47 -44 -59 -35
-230c5
##PAGE=	F1=-17519.8
##FIRST=	23146.756194512010552,	4241.1435120000014649,	0
##DATA TABLE=	(F2++(Y..Y)), PROFILE
4241a2j8K3N5n3J85j24p1K8r6N9J8k1J04qk94j9J78l1K02m4j02m7N6k0j41J82L7O8j5o6j3
$$ -12 -30 -7 48 -5 180 56 -15 13 -83 -24 -6 -27 77 69 -225 -244 -66 -97 105 61 -41 -88 -32 -52 -193 -11 26 94 79 13 0
3970@N5k7M1L1k46J05P8N2j05qN7l1j6K5L4o4M5j4n0K8J5j16K07k38O1Q5L8lm0R1k08P7J30
$$ 0 55 28 69 100 -146 -41 37 89 -16 -24 33 2 -14 11 45 -19 26 12 -38 -10 5 -111 96 -142 -81 4 42 39 -1 90 -118 -41 89
3681H9o9M0MN9j78j4N6Q6j02J7N4n1m1r9J83j30J29kJ56r7j24k0J18N5p8J9p4n9P3J02o3J10
$$ 89 20 60 64 123 -55 -69 -13 73 -29 -12 42 -9 -50 -149 34 -96 33 31 187 90 -34 -54 64 119 41 60 -14 -73 0 102 39 149
3401A49o4q5m3PK9L1M4j26J22o4K1J2j1m9j03R4R0k5K5o4k2mj37R7K2J82j40L1j5J5q4JJ29
$$ 149 85 0 -43 -36 -7 24 68 -58 64 0 21 33 22 -27 -130 -36 54 29 54 -10 -32 -36 -173 -76 -54 128 -12 19 4 19 -65 -64 65
3112F5j5M1o8j5r8J39J25j09m6L2O7j24P4M5p7k8L6N9k6o7k0O1l6jL2nm3pP8j52QN2p1J17
$$ 65 50 91 23 8 -90 49 174 65 19 51 118 -6 68 113 36 8 44 103 77 10 -10 51 15 14 46 41 -2 -9 69 -83 -75 -23 -94 23
2815B3N5p4R3k72K41m5l4O7j0J8pm7P7k6q4j17J81k4j37m2L07j54M2J1R5j35n7P0q1j6P9m2
$$ 23 78 4 97 -175 66 21 -13 54 44 62 55 8 85 59 -25 -142 39 15 -122 -164 143 -11 31 42 137 2 -55 15 -66 -82 -3 -45
2535d5Pp4J17Q6kq9nk4r0Q7K8L8J1%qk0Rj44J07j7qL2n8K03m0k21J85M3j01r5J32K2J4l3m2
$$ -45 -38 -112 5 91 89 0 -5 -29 -119 -32 -4 34 45 45 37 17 26 -118 -11 -28 -36 -4 -62 141 101 -120 65 108 7 -88 44 66 80 47 5
2229EnM4k27J23J66j57K34j45L1K4j29J18j28K6J17o9o4R7r5j1L2jm5rJ73k00pO7L8M4r3r2
$$ 5 0 44 -183 -60 106 -51 183 38 69 93 -36 82 -46 -20 97 28 -36 61 -34 -45 -13 -14 -59 -68 105 -95 -102 -35 3 47 -46 -138
1948a38J28L6M2pM9j73R1n7k2J7j9M8P3K8j60L3M3o2M2m7J30r8M6j78J21J53j12M4K9r1O9
$$ -138 -10 26 68 61 110 -63 28 -29 -51 -34 -53 -5 68 96 -64 -31 12 -50 -8 -55 75 -23 23 -155 -34 119 7 51 80 -11 58
1677E8%j8R9k62R4M5Q7q5N5k5p2o4j7J27j31J82q2P5r3R1q1n2P6n0RMM3j84J78Mk7K2k9PJ29
$$ 58 58 40 139 -123 -29 16 103 18 73 48 -24 -88 -105 22 -109 73 -9 66 -27 64 -17 -69 7 -43 -34 -30 13 -171 7 11 -16 6 -23 -16 113
1371A13r8M6j55J24p6M8o2Rk6P2L3R1k29J46m2q3n3J69j5L7o8N4j06J3J39j12Q8j5n1k3R0
$$ 113 15 61 -94 30 -46 2 -60 -51 -77 -5 28 119 -110 36 -6 -89 -142 27 12 49 -19 35 -71 -58 81 -31 57 42 -9 -32 58
1100E8k5q7%L7j07Q8P9j95J73J5j7k05O1Q9J5j8J46j13K7j54J64M2n9k7Q5l9r5O9Kj09O3J19
$$ 58 33 -54 -54 -17 -124 -36 43 -152 21 36 19 -186 -125 -36 -21 -39 107 -6 21 -133 31 73 14 -13 72 33 -62 7 9 -100 -37 82
820H2l2J2qj71J82Qpk8K2j07j9l0%R7o9j31J07J76j83J73p7o9J37K6j71N9L1m7J04j9L0M1
$$ 82 50 62 54 -117 65 73 66 38 60 -47 -66 -96 -96 1 -68 -199 -92 84 -99 74 -3 -72 65 91 -80 -21 10 -37 67 48 78 119
540A19j9j32k5J1O9L0O2j91J06Q9j27K9k6J1Kk8J2P5mJ8n7N9n4o8N4J04j64j0J12o8R4K3P0
$$ 119 100 -32 -57 -46 23 53 115 -76 30 119 -8 21 -5 6 8 -20 -8 67 63 81 24 83 29 -39 15 119 -45 -55 57 -11 83 106 176
251A76k22J16Op3JJ98k51M0JJ03J1j15k7j9L7o4J86p9j6n0O4M0mo2Ml7J06L3o0po4J7m7j9
$$ 176 -46 70 76 3 4 202 -49 -9 -8 95 106 -9 -36 -55 -18 -82 104 25 9 -41 23 63 59 -3 1 -36 70 103 43 36 -28 -11 -58 -77
-47g7N7k6j3J05PJ7L1j15O4j4Q9j06QN4j22lM4Km1l1L8
$$ -77 -20 -46 -59 46 53 70 101 -14 50 36 125 19 27 81 -41 -44 0 2 -39 -70 -32
-230c2
##PAGE=	F1=-17614.1
##FIRST=	23146.756194512010552,	4241.1435120000014649,	0
##DATA TABLE=	(F2++(Y..Y)), PROFILE
4241DLm5O2KJ44j38lrm6J9K3l2P0K2k79%J12lK17m4p6r4J15j13r2K04n3J33m1o7oJ22o5M9
$$ 4 7 -38 24 26 170 32 29 20 -26 -7 16 -16 54 76 -203 -203 -91 -94 123 79 3 -91 24 -89 -181 23 -30 103 62 -5 -11 111 46 95
3944I5k3k33J04P0N0q4LN3r5P2kO1r3K1JmJ1l4q8K04k23M7J20KMl4P2j47O1J52j68Q4j6O3
$$ 95 72 -161 -57 13 63 -21 -18 35 -60 12 10 71 -22 -1 0 -4 7 -27 -115 89 -134 -87 33 35 39 5 77 -70 -9 143 -25 59 43 106
3646A06j03r2P7M8n5k9M8k9j6o6J10n2P1j4K07j26j05k9J39K9j20O5q2m0M5J48j14R4k9r5
$$ 106 3 -89 -12 36 -19 -48 0 -29 -45 -111 -1 -53 18 4 211 85 -20 -49 90 119 -1 64 -18 -58 -13 135 21 115 86 -9
3384io6L3K4J0M1j39J33n2M7m1R7j09j05J34J4K2lrm0m0r1J00QK43j50Pn7L5j14LJ40j0L5
$$ -9 -75 -42 -18 -8 33 -106 27 -25 22 -19 78 -31 -136 -2 12 34 31 22 -18 -58 -149 -49 -41 202 52 59 2 37 -77 -74 66 56 91
3095I1q7L8j41J21J05k5k7kL0q1mR4q2j0J0J15k6p8l8M0m3k8P2%o1j0J02r0m8Q6o1R4j1kP9
$$ 91 4 42 -99 22 127 102 75 73 103 22 18 112 30 20 30 145 119 41 3 43 0 -28 44 44 -17 -27 75 -15 -63 23 -38 56 45 43 122
2789A22l15K39K0m3N4k4qon7R0k2j09r5K06k1j81nK62j32K3O0L2n5o1M5j06J8Q0p8Kl8J18
$$ 122 -193 46 66 23 77 53 45 39 -18 72 50 -59 -154 52 31 -150 -155 107 -25 -2 58 90 35 -26 19 -87 -69 11 -67 -65 -103 15
2509A5L1K6j29M3L7j32Q4pM9N9r0L5j9J6p8K6rl5J41p7J11l5k36K35K4j01p2J57K1l4j3q9
$$ 15 46 72 -57 -14 23 -109 -25 -32 17 76 -14 21 2 18 -60 -34 -43 -78 63 -14 97 62 -174 61 85 -16 -88 69 90 56 43 -46
2229d6J7R5k30J04J34j58K87j52J4L5j43J20q0j2R1m6p8J13j13roqO4p7J80k48J7Q3P4Lp6
$$ -46 -29 66 -164 -60 74 -84 203 51 65 100 -43 77 -3 -15 76 30 -48 65 -48 -57 -63 -71 -7 -84 96 -152 -135 -52 22 25 -51
1957e1r7J22N0L6j4M3j43J11q0l2Mk7M2R4N9j96N7P9n7M5m9M8q9Q8j64J01J38j12O5K3j01
$$ -51 -148 -26 24 60 46 89 -54 57 -23 -55 -51 -78 -36 58 117 -79 -22 57 0 45 -4 44 -45 43 -121 -20 118 6 71 94 -7
1686gL8M7p3O9k03Q6L8P0q1P1L4j30l6jN7o3J86j08Q8n7M1q8o1P3j9Lj9K5j74K37o7L3K5q5
$$ -7 31 78 5 74 -129 -43 -5 65 -16 55 89 -41 -77 -78 -21 -84 102 -6 82 25 66 -22 -83 -10 -29 -26 -45 -20 -194 43 -24 9 34 -51
1388e1L9J12o9Pj13O9o9J25l1n3J6R9p3Q0k08J08%nr4M4L4J28j02J4o3L4J00j28J14qo2lQ5
$$ -51 -12 100 31 38 -75 -6 -75 50 19 -34 -18 81 8 88 -120 -12 -12 -17 -111 -67 -33 95 -7 7 -56 -22 78 -50 64 56 -6 -9 76
1100G6o2q0L2k2q2O8J23j59J23K8nj71K1P2K1rJ40j18k1n6J56lJj2M9n6j07P1qj10L7J24n
$$ 76 14 -66 -34 -56 -138 -70 53 -106 17 45 40 -131 -110 -38 -17 -26 114 -4 -25 -81 75 72 73 61 110 54 -53 18 10 -100 -63 61 56
811E6K2k8j80K15n4M7l1Mr9m2nL6O2r5r1J20J22j52J69p2q1J92J3k14K8L6m8J37K8j2O3o6
$$ 56 78 50 -130 85 31 78 47 51 -48 -90 -95 -59 3 -92 -183 -63 59 -93 76 4 -77 115 128 -86 -58 -22 -70 67 95 83 146 80
531H0j02m2J1P1M4L5j73R8N1o0O1o3k0j2j6M6P6l6J0o8P8p4l5J10Q0j73MJ01j15Q7K3Q7j62
$$ 80 -22 -64 -53 18 62 97 -76 22 73 13 74 11 -9 -21 -37 9 85 49 59 -9 69 -5 -40 70 150 -23 -19 82 -33 54 77 164 2
242BJ15p8l1pJ95k69R5p0J40j5j31j6N8j0o7K14j31M%M8N8j02oN4n0P9Oq6lp1P1o2j1M0l8
$$ 2 117 39 8 1 196 -73 22 -48 92 77 -54 -70 -12 -22 -89 125 -6 -2 -2 46 104 2 -4 50 0 79 85 -1 -4 -75 -4 -66 -77 -37 -75
-64g5k8J78oL6k1j42O2J6P6o1j4N2j06rKR6p8n0M0
$$ -75 -103 75 69 105 84 -58 4 20 96 35 21 73 -33 -42 -40 56 -22 -72 -32
-230c2
##PAGE=	F1=-17708.5
##FIRST=	23146.756194512010552,	4241.1435120000014649,	0
##DATA TABLE=	(F2++(Y..Y)), PROFILE
4241EJ3p5O5L3P5j24N9m6J5k0M8n4L0L9k03RL0K3K10o3k7r7J25j68m5J84q3J56m8j05LJ70
$$ 5 18 -57 8 41 116 -8 51 5 20 0 48 -6 24 63 -140 -131 -101 -78 132 69 42 -55 70 -98 -143 41 -42 114 66 -39 -36 134
3961A34o7K9m8j91O2P1L8o2K8K1j06J11k2Q8j06J1jL9lp5m2J55j68L2J46m3J4n4L2p0M9J85
$$ 134 67 96 48 -143 -81 -10 28 -34 -6 15 -91 20 -2 86 -20 -9 -10 29 26 -49 -91 64 -104 -72 74 31 45 -9 23 -47 2 187
3681A87k48J28l9M2k0j59J06j%m4J7l3M5pj4OL5j1K37j45p5n7J35K8j58R7p3k1J5J82j51N2
$$ 187 -61 67 28 70 50 -109 -3 -4 -4 -48 -31 -64 -19 -26 -40 -34 1 -10 227 82 7 -50 85 113 -45 52 -21 -42 -27 155 4 56
3401E6Oj08m8P2Mj4K9j27J44m8O8j02J93j51r7J36l1O2j8J0o0n0l3R7nK54j35k4r1N5j18L
$$ 56 62 -46 -94 -22 -18 -32 -3 -130 14 -34 34 -68 125 -26 -123 13 -18 44 26 36 -24 -74 -107 -10 -15 239 104 80 -11 44 -74 -71
3121g1J33j9K5q4N8j49J08N0Q5oo7Pk5p0J03m3oj3J29nm4p8jn3k7J25j6n4l7J09J1j45J48
$$ -71 62 43 68 -16 42 -107 1 51 136 130 63 70 45 -25 78 35 29 16 145 140 96 18 17 -36 -63 62 46 -8 -45 64 75 -70 78
2832G8n8O1r0R5P1l55K33P6l7K9k8o3Op2J13oj30o4J95j6k00O0J65j04J9J08l7J9n7J2j42
$$ 78 20 81 -9 86 157 -198 35 111 74 103 75 12 18 -54 59 53 -77 -141 54 38 -162 -102 63 -41 -22 86 49 68 11 23 -119
2561a19P1Q3r9j2LQ9k0N2j52O7J00j37N6k8O1P3j48O3j3J8ko9Po2K18o2ok0k26K61L5j15k8
$$ -119 -48 35 -64 -76 -73 16 -4 48 -104 -37 63 -74 -18 -46 15 88 -60 3 -10 8 6 -63 -56 -118 100 38 32 12 -214 47 82 -33 -61
2272f1J26J0n2J5j28O0J01k09J07P9j51K82j22J2N1j47R7k4l9N2j4j09J19r9k2k9J3J06j24
$$ -61 65 75 23 38 -90 -30 71 -138 -31 48 -103 179 57 69 120 -27 70 46 7 59 45 -64 55 -44 -66 -95 -82 24 -100
2019a00J64k35LJ01Q3j8n2o8J06K8J9qJ2q0J18r5m3Pk0J4Q8O6j76R2R7n5M9o0l6n1J18j38
$$ -100 64 -171 -168 -67 16 -2 -54 -122 -16 12 31 23 35 -45 73 -22 -65 -58 -78 -64 24 90 -86 6 103 48 97 37 1 -50 68 -70
1738g0O1R6q1Q3J0j05OR2r4Nj36Q2PQ4r7R1R5j83j7L2j3oJ56q8R3m2Ro6j04J00Nm7qj8j16
$$ -70 -9 87 6 89 99 -6 0 92 -2 3 -133 -51 -44 40 -57 34 129 -54 -71 -39 -52 -58 98 10 103 61 70 4 -100 0 5 -42 -50 -68 -184
1432a84K77j33N2O0j46M0P9rl2n7K7m9J63j5m7K4P3j38O6j60M5M0P3j27p4P8J61q6j1l2M6
$$ -184 93 -40 12 72 -74 -34 45 36 4 -53 -26 -75 88 73 26 50 123 -15 51 -109 -64 -24 49 -78 -152 -74 87 1 -10 -42 4
1161DP2j32J26j1o1L8M2q4o1Q3r8o3P8J33r3K8O1l2j04l0N5K6J8J07r0p1N7J07l3M4Jj3p6
$$ 4 76 -56 70 59 -2 36 78 -6 -67 16 -82 -145 -67 66 -27 1 62 30 -74 -104 -49 -23 -5 102 12 -59 -2 105 72 116 117 104 28
872B8o9O1kj00J0J08M2j0j9j63K28j35J13l5j5j11k2K3O4nq9n7J20O8r2J49o2j26K22Pk25
$$ 28 -41 20 18 -82 -72 36 78 68 49 -114 114 -21 92 57 42 -69 -91 -68 -4 -9 -98 -155 -35 33 -59 90 28 -98 124 131 -94
601i4J7L4o1J58Q5l2N6r6q7k3RM2P5j9j46J11j7J9N5n2o1l3nR3Q2q7j2l7P2n8m1J38M2j12
$$ -94 -77 -43 -104 54 139 107 163 67 -20 -43 -34 8 83 64 -82 29 12 31 86 34 -27 -60 -65 28 110 23 11 -26 46 -12 -53 85 127 15
303A5J2Q4j48N6J9P8o5P9j26J3j6J57k39J22j35J64jj33qJ16p9p0K23j84N6L3L7O2j73K4J08
$$ 15 27 111 -37 19 38 116 51 130 4 17 1 158 -81 41 -94 70 69 -64 -72 44 -35 -105 118 -66 -10 23 60 122 -51 -27 81
32H1m1M8k0r5jp1R0l6lnj4q7K34k5N3m8j68N7O1N9qm8L6p3k0j3J46q9o8K8
$$ 81 40 88 68 -27 -28 -99 -9 -45 -48 -53 -67 -154 80 55 108 60 -108 -51 10 69 61 13 49 -24 -44 -57 89 0 -68 -40
-230d0
##PAGE=	F1=-17802.8
##FIRST=	23146.756194512010552,	4241.1435120000014649,	0
##DATA TABLE=	(F2++(Y..Y)), PROFILE
4241@mn3N9L5Nq3Q2p1P8m9Q7q5j0M3r9%k1L3J90q9J8o2Q7j77j3J37m9J18l5j49K0J73l0j5
$$ 0 -4 -57 2 37 42 -41 41 -30 48 -1 86 1 -9 34 -65 -65 -86 -53 137 48 66 4 91 -86 -99 38 -11 107 72 -77 -57 116 86 71
3944G1l3j50NR8J6n4N9k8o1P7l5J09r1J9nM9k4p7qQ6r4K2J55p6K5j05Rk6N9J86k61J61n9Q
$$ 71 38 -112 -107 -9 7 -47 12 -16 -77 0 -35 74 -17 2 -3 46 22 -55 -63 23 -71 -49 106 30 55 -50 -41 -67 -8 178 -83 78 19 27
3646B7L9j90J31l4L3k2k6o4J15N0j12PL5MK27j27n4r5J01N1j74J12o8K2k5K10j68%K0r8j3
$$ 27 66 -124 7 -27 6 -16 -42 -106 9 59 -53 -46 -11 -7 220 93 39 -56 45 96 -78 34 -34 -12 -37 173 5 5 25 -73 -86
3375h6Q9nl2%r0J49m2P4j51K34j55p4J02k2O6k8ko4k7qJ08j1K11j28l8r3P2j02lJ02l1K4o9
$$ -86 3 -2 -34 -34 -124 25 -17 57 -94 140 -15 -89 13 -9 57 29 27 -37 -64 -72 36 25 236 108 70 -23 49 -53 -56 46 15 39 -30
3086c0L4j15J11k4J79J0j29%J1r8P4J8j0l1R6L8K5j24m9n7qJ85n8k7p4Q8J14k35K05o1L8j65
$$ -30 4 -111 0 -24 155 165 36 36 47 -51 23 41 31 0 96 134 159 35 -14 -71 -79 106 48 21 -53 35 149 -86 119 58 96 -69
2806f9J88O9l70K14R9oqj5j23L0r3J25J7j28m1J56k6j74J28N5q0K5J48r4N5m3j9j64J10Q1
$$ -69 119 188 -182 32 131 125 117 102 -21 9 -84 41 58 -70 -111 45 19 -155 -27 28 -52 -27 121 27 82 39 20 -144 -34 47
2544D7r8j2L6L3o1Q4j41N7J35j01Ll2P8N7j67O1J3lN5j29L3r1K35j9j01Oj97K46P9j35LM8
$$ 47 -51 -63 -27 6 -55 29 -112 -55 80 -21 -18 -50 28 85 -82 -21 -8 -11 44 -85 -52 -143 92 73 -28 -22 -219 27 106 -29 -26 22
2264B2jl5N5j51J03N6j61J24M2j44K17o7OP2j31N6J7m3J1K9j51J20o9m5m0N1R1j36J29j77
$$ 22 21 -14 41 -110 -7 49 -112 12 54 -90 127 60 66 138 7 63 80 37 48 77 -74 46 -23 -68 -108 -57 34 -102 27 -150
2001a50l0R9Q1j2m6j0P9mrJ0k3k0J14j12l8LK3k9N9M7j34J35Q6n3N4o8q5%J25j06J4M0l1R0
$$ -150 -180 -81 0 -12 -58 -68 11 7 -2 8 -15 -35 79 -33 -71 -68 -45 -74 -15 32 -102 33 119 66 120 52 -33 -33 92 -14 0 40 9 99
1703I9%j11oJ18r1m5r1Q1k7J10j26J01J31k10RN5o2J9J33n1O8m1Kj6j54J25J0j13L5o5k6K82
$$ 99 99 -12 -18 100 9 -36 -127 -46 -73 37 -89 12 143 -67 -58 -3 -65 -46 87 36 104 63 65 49 -105 20 30 -83 -48 -113 -139 143
1423A43j71K1J15j70MM5M7n4j8K0k4J47j8LPPj37O2j11pM7J19j32j54J02J39k7j9l6P3N6j21
$$ 143 -28 -7 108 -62 -58 -13 34 -20 -38 -18 -42 105 87 90 97 104 -33 29 -82 -89 -42 77 -55 -209 -107 32 5 -14 -50 23 79 -42
1143d2J30j8p4R3j4j14k6J30j46n1R6R1k2n5J13j00k6o8L8L8L9Q0n9r6J19N8m7O4%o4q2k3
$$ -42 88 70 -4 89 75 -39 -65 65 -81 -132 -36 55 33 -22 91 -9 -35 -103 -65 -27 12 92 33 -63 56 114 67 131 131 67 -15 -38
863c8M1J6p4%P3Q8o8Oj23K25k01J62m9j8j24K2M6O0p8n6k6R7M1k6J08n2j70K18J2j98J7L4
$$ -38 3 19 -55 -55 18 106 38 44 -79 146 -55 107 58 40 -84 -62 -16 44 -34 -90 -116 -19 22 -4 104 52 -118 100 112 -86 -69 -35
583c5q5J48J33k3J4r7q5J2RJ1J05o8j32J40q4P9K0j0r8l5qJ36Q4j40k5J3K7qo4J26J0l3K4
$$ -35 -120 28 161 138 152 55 -30 -18 -9 2 107 39 -93 47 -37 42 62 52 -46 -81 -89 47 131 -9 -34 -21 6 -2 -66 60 70 37 61
295F1P0j68L5rP1J8L7j19K8k4J00j77J09j79J91L5j15j7J46j29r2K17k06J18L4L4M9k00L9
$$ 61 131 -37 -2 -11 60 78 115 -4 24 0 100 -77 32 -147 44 79 -36 -53 93 -36 -128 89 -117 1 35 69 118 -82 -43
41d3J40m1L4l4q6j3m5O6J2ml4J3j56K61m6M6k5j89M6J02N7J4o4lk4l7LJ32o0q3N
$$ -43 97 56 90 56 -30 -43 -88 -22 -10 -14 -48 -35 -191 70 24 70 45 -144 -98 4 61 75 11 8 -16 -53 -50 82 22 -61 -56
-230e6
##PAGE=	F1=-17897.2
##FIRST=	23146.756194512010552,	4241.1435120000014649,	0
##DATA TABLE=	(F2++(Y..Y)), PROFILE
4241Am6MM8J6n1k5O2p4J22o0J21j10n0M8nk5l2K7J67j03M1j0J9j47kR6NM1j2j73N2J21K6o4
$$ 1 -45 -41 7 23 -28 -53 9 -65 57 -3 118 8 -42 6 1 -24 -56 -29 138 35 76 66 85 -62 -64 32 37 78 66 -107 -55 66 92 28
3944B8J6j32m0J47j7n0P5p7J5rl6J16n2M1mK2n1m9oL5j9RJ53r0L4j63K9m0P8J39j97J83q1
$$ 28 44 -88 -128 19 2 -48 27 -50 -35 -44 -80 36 -16 25 21 43 -8 -57 -63 -28 -47 -38 115 25 59 -104 -75 -115 -37 102 -95 88 7
3655Gj2N8j77J38l9L0J9n9j12J67Q7j41l9M6L9J75p4m4j29N6P4j64J17p5Q1p5K41j71l8J1
$$ 7 -5 53 -124 14 -25 5 24 -35 -147 20 107 -34 -73 -27 12 187 113 69 -60 -4 70 -94 23 -52 29 -46 195 24 -14 -3
3392cn3JP0J4l7n5l6J37k3O0j64K17j25n1O6J5K8l6k3m2J6l0J32KJ27j44l3m7P9q4rN0l4L5
$$ -3 -56 -55 15 29 -8 -63 -99 38 15 75 -89 128 3 -48 18 33 61 25 2 -40 -24 -54 78 80 207 63 30 -17 62 -22 -31 19 -15 20
3095B0n3j3n8J26r2K13L1j54k%p6L4N6km4M1Q7R6j58r0n2J2K34j03Lr9M0J79k65K16o7M8k28
$$ 20 -33 -46 -104 22 -70 143 174 20 18 18 -58 -24 32 30 -14 27 114 210 52 -38 -90 -78 156 53 56 -43 -3 176 -89 127 60 108 -120
2806a20K50O7l38J86P5L5m8J2j63O7j19J10M5r9m4J12n0j11J68k7o3L5J70j24M2l4l4j50J11
$$ -120 130 197 -141 45 120 155 107 119 -44 23 -96 14 59 -40 -84 28 -22 -133 35 8 -55 -20 150 26 68 34 0 -150 -39
2552c9O6p1J4M9l0r1J23j04L1J33n5n2j8Q9K9j62L3O5n6Q8j31O6j24K02L4j48K8j58J92J35
$$ -39 27 -44 -30 19 -11 -102 21 -83 -52 81 26 -26 -44 45 74 -88 -55 10 -46 42 -89 -23 -147 55 89 -59 -31 -189 3 138
2290A38j44Lm2m%J06j51J04nq8J33L5j28J14j4j2R7r7NL4l1rP8j89J17n4n9m3R1N1j16P8j07
$$ 138 -6 -3 -45 -49 -49 57 -94 10 5 -83 50 85 -43 71 57 45 142 45 50 84 53 44 122 -67 50 -4 -63 -106 -15 36 -80 -2 -109
2001a09m7P1Q2Qo7N1M7j2m6L9n4J0J06j34kl5J02p5K6K6j17J77N2n9O4o6p8L7J07o8l2nJ1
$$ -109 -156 -85 -3 5 -62 -11 36 24 -22 17 -37 -27 79 -55 -57 -92 10 -65 -39 -13 -130 47 99 40 104 38 -40 -3 104 36 4 -1 10
1712A0Q4Lj25J0J23q6n5o9O1l3J27j45R4J25j97M3M0p7K1J29k1J8m7J4M3j75J16j0j52Q0r5
$$ 10 94 97 -28 -18 105 19 -36 -105 -44 -77 50 -95 -1 124 -73 -30 10 -67 -46 83 62 80 33 47 90 -85 31 21 -131 -51 -146
1441a46P8K36j70l8J61j35m2QO9m3rL1QR8l3M2kp0q7O7o9l3J8J15j07j80J00J00L7j8p5J28
$$ -146 -68 168 -2 -40 121 -14 -56 -48 21 -22 -31 0 8 106 73 115 113 43 -44 23 -46 -79 -61 54 -53 -233 -133 -33 4 -14 -89 39
1161C9M2r2J27pj25J37n1j49J1J52j46l1R8PK6p8J58j71L9p3J6N2L0Q0m3q4R5M5m9O3j8p0
$$ 39 81 -11 116 109 -16 121 70 -79 -68 84 -62 -93 5 12 38 -40 118 -53 -14 -87 -71 -19 11 91 48 -36 59 104 55 118 100 30
881C0p3pJ4L6l9J7K8J11j07J4o6K16k17J52o5%j19O5M7K8j24pJN3M7J5N1m0j74J80K8j51J4
$$ 30 -43 -50 -36 0 -39 -22 6 117 10 24 -42 174 -43 109 44 44 -75 -10 37 65 -59 -66 -65 -12 35 50 101 61 -113 67 95 -56 -42
592d2M3j09J07J53jm5p2p9L2J3J6J07q8j31J63j18R2k3M1j19j1k0J53P3j81j1N5m3M9o7P4
$$ -42 1 -108 -1 152 151 106 34 -45 -13 0 16 123 35 -96 67 -51 41 18 59 -60 -71 -91 62 135 -46 -57 -2 -45 4 -63 11
321A1KJ0L8P1j82M1n8J03L6J9q2J2k6N2j09O1j92K21O0o8n8J51j34j27K11j90J63%L6L6j95
$$ 11 13 23 61 132 -50 -9 -67 36 72 91 9 21 -5 47 -62 -1 -193 28 88 20 -38 113 -21 -148 63 -127 36 36 72 108 -87
50h7N2J44o9L8l2o8m0J1J6N0j0j9J0j98K52n1J4K7j92L3J19O9ql8n4K9o6K8Q1%r2k6
$$ -87 -35 109 40 78 46 -22 -62 -51 -35 15 5 -14 -4 -202 50 -1 13 40 -152 -119 0 69 61 23 -31 -2 -68 -40 41 41 -51 -77
-230g7
##PAGE=	F1=-17991.5
##FIRST=	23146.756194512010552,	4241.1435120000014649,	0
##DATA TABLE=	(F2++(Y..Y)), PROFILE
4241A2r0N8L4%r2K5K9n0J28n4J37j17r1P3N2n9k3J2J42r1M1L6n1r6lP6L8k9Mj68Q8L4P5r3
$$ 12 -78 -20 14 14 -78 -53 -24 -74 54 0 137 20 -71 2 54 -5 -28 -16 126 35 76 112 61 -35 -38 38 76 47 51 -117 -29 5 80 -13
3944a3O4j31n7J91n3k4N3j06Q4j02j8J04pO2Pk2q2j3l6K2N2j7J40q5L5j95Q9r2P3P3r5J92
$$ -13 51 -80 -137 54 1 -23 30 -76 8 -94 -112 -8 -15 47 54 32 -50 -63 -99 -77 -25 -42 98 13 48 -147 -58 -150 -77 -4 -99 93
3664I3j05lM0j25J13k3PO2p5j51J77R5j04r6M4R0R7ql4j45K2O8j35J23r0J32j25K65j69m4
$$ 93 -12 -15 25 -100 13 -10 -3 59 -16 -167 10 105 1 -95 -51 39 136 128 94 -51 -29 39 -96 27 -63 69 -56 209 40 -4
3401dkLj6K6N7l0j28K2R9J3L0j28J77q6m6N3M0l1m0l3oO5q3J47L6K8j65j3L1O9p6j2pk8M9
$$ -4 -6 -3 -19 7 64 34 -94 -72 27 40 70 -58 119 33 -13 40 80 49 9 -24 -30 35 -48 99 135 163 -2 -15 16 85 9 -3 -10 -38 11
3095A1l5n6pJ41j31J78O4j31j6m6k2QM5K6m8pJ23J33j65j08m7K0K51j17J3r0j9J89k17J60
$$ 11 -24 -80 -87 54 -77 101 165 34 18 -28 -50 -42 3 29 -19 -26 97 230 65 -43 -90 -70 181 64 77 -13 -32 157 -60 100
2832A00p0Q8k69K70N9k58J57J7N8q3M4j72J16j48P4P6n9q0Q1o7l6J65o3n4M7J62j17mm1k6
$$ 100 30 118 -151 119 178 -80 77 94 152 69 113 -59 57 -91 -17 59 0 -80 1 -66 -102 63 0 -54 -7 155 38 34 -7 -33
2570c3j06Q2M3l4N5L7p0j11J54o5J2J16m0q3J4Q1Lj51OJ27j24J09r5Q9j51J49Q1j41K5j25
$$ -33 -139 -57 -14 -48 7 44 -26 -137 17 -48 -36 80 40 -43 -29 52 55 -96 -90 37 -87 22 -73 16 -135 14 95 -46 -21 -146
2307a46J24J71j30j6j14PL8J45j36N3l2lJ06M1r2RJ8l1J20o0m6L1j7QJ14k09J08o1n0m3J13
$$ -146 -22 149 19 3 -111 -104 -66 79 -57 -4 -36 -39 67 108 16 25 43 12 132 72 26 57 40 48 162 -47 61 0 -50 -93 20
2036B0K4q7J9n2l0M4P3K8j08R3J7J7p6O4p6NR7j45O0j06J84j17QL0j34K01Mp3Q0n3k6L1Q1
$$ 20 44 -43 -24 -76 -106 -62 11 39 -69 24 41 58 -18 46 -30 -25 72 -73 -13 -119 65 -52 -44 -14 -148 53 57 -16 64 11 -15 16 97
1747I7k3p2k3J9Q0J7j42M0J11r0k4o0OMJ19j35P8R0j59P1oo7K3J23Ol5o1K9R8j47O1m9j40
$$ 97 74 2 -21 -2 78 95 -47 -7 104 14 -10 -70 -64 -60 59 -76 2 92 -67 4 -2 -69 -46 77 83 48 -13 16 114 -33 28 -21 -161
1458a61R7j00J65J44j31q8J75o7o0l6N8%k7L9M5N0n3L5J8j23k8O6l3l2k0P1p3j58P6Q6O5k1
$$ -161 -64 -164 1 145 14 -74 101 34 -26 -62 -4 -4 -31 8 53 103 50 85 103 -20 -48 18 -15 -47 -67 4 -69 -227 -151 -65 0 -21
1178b1j31K03K7n5J19L0k04J46n7j59L0J35j11KR0q6L3k8J63j95O6m4j2N7j4J04l4n1QP3m7
$$ -21 -152 51 78 23 142 172 -32 114 57 -102 -72 63 -48 -46 44 -42 -9 -37 126 -69 -3 -47 -59 -2 -16 88 54 3 11 84 37
907C7M7l8l1n5l0j4M2NN0k5J11r8j3mJ98j74P8p0L4r3Q2K6pj23M2K0mO8J5nk0j26J20M9j10
$$ 37 84 46 15 -40 -70 -84 -42 -37 13 -12 99 1 -12 -16 182 8 86 16 50 -43 39 65 58 -65 -23 -3 -7 61 76 71 51 -75 45 94 -16
601a6NN6j18M9J44J1r1l4o2K6K5N8P0p8j22J57r9M1m8P8j18L4l5J33M8j93K3P2j05Q9m2NJ6
$$ -16 -11 45 -73 -24 120 131 40 6 -56 -30 -5 53 123 45 -77 80 -19 22 -26 52 -66 -32 -67 66 114 -79 -56 16 -89 0 -42 -37 -21
312b1LM2Q9j93Q0j20J80j7L0m5k0k2K5m5lj69K33N8Mj27J34j01j51K11j47J71m8L2M1j82P2
$$ -21 -18 24 113 -80 0 -120 60 43 73 28 8 -14 11 -34 -37 -206 27 85 89 -38 96 -5 -156 55 -92 79 31 63 104 -78 -6
41fJ28j16N5k5n1o9P8l9O2mJ5k0k00K18l0k5O8j67J7J11P5n0L4j13P9j08M0L5N6q3o1
$$ -6 122 6 61 36 -15 -84 -6 -45 17 13 28 8 -192 26 -4 -29 39 -128 -111 0 75 25 59 -54 25 -83 -43 -8 48 -35 -96
-230i6
##PAGE=	F1=-18085.9
##FIRST=	23146.756194512010552,	4241.1435120000014649,	0
##DATA TABLE=	(F2++(Y..Y)), PROFILE
4241B5j12Q6J8Rj28N2MrJ06m2J31r6j34J26O5r3k7J0J05n3K4N6r5l7JO6L3n0kj41J07m6R1
$$ 25 -87 -1 17 26 -102 -50 -46 -55 51 9 140 44 -90 36 101 8 -19 -9 96 43 67 123 28 -9 -8 58 91 41 39 -102 5 -41 50
3952E0q6Q4j32m3J95p7L5jj00J16j67K0P3K9O4J9o0r4Kp4M0J14n1J08o1J3j73J52j36K4L1
$$ 50 -36 48 -84 -127 68 -9 26 25 -75 41 -126 -106 -33 -4 60 79 19 -75 -73 -147 -107 7 -44 64 3 16 -157 -5 -141 -117 -86
3681h6j0J91j27K4%n1N9lnR0p5j57J47Q0m7j26J9J37J3M2pj36J0K9j01J38j10J44j53K61j60
$$ -86 -96 95 -32 -8 -8 -59 0 -3 -8 82 7 -150 -3 77 30 -96 -77 60 73 115 108 -28 -18 11 -90 48 -62 82 -71 190 30
3410C0j7jL7m9oQ9j1j96P1M1N3lm8J48o8n7O1J9o8l9k9K8J10j40J36P7n5j63J1J10M0p4j8
$$ 30 13 12 49 0 -6 83 72 -124 -53 -12 41 38 -10 138 70 13 74 93 25 -14 -43 -15 95 -45 91 168 113 -50 -39 71 111 37 19
3121A9n5pM9j3p1J8J31j26R7J02p5l8r5L8n%O0l8l3J34J21j47j02m6J8K30q0j4m9o0J50j21
$$ 19 -36 -43 6 -7 -78 -60 71 -55 42 144 69 31 -64 -26 -31 -31 29 -9 -42 92 213 66 -36 -82 -64 166 86 72 23 -37 113 -8
2841hN6o3J28k67K54L4j56J40m6N0j11P5j63J68j70L2J07l2j30O0n0J8J34o6n2O2J23p4n3
$$ -8 48 -15 113 -154 100 134 -22 118 72 122 11 86 -77 91 -79 -47 60 28 -102 -42 -92 -74 60 -6 -58 4 127 53 0
2587@o5mn2N3K2%Q1%o3j20J50l7J4R8p0p4M8O0k0j33mJ75j73J25n5Q6j59J06J05r5lj03P2
$$ 0 -65 -69 -121 -68 -46 -46 35 35 -28 -148 2 -35 -21 77 7 -67 -19 41 21 -112 -116 59 -114 11 -44 42 -117 -11 94 -1 -4 -107 -35
2299c5J59q9l5j46K8O5J44j16k7KP3L5M0l5o5L1m6J28l1r1K4j3N4J23k08R0o6k7l9J12J0o4
$$ -35 124 35 0 -146 -118 -53 91 -25 -52 -50 23 58 98 63 -2 29 -17 111 80 -11 13 0 54 177 -31 59 -7 -34 -73 39 49 -15
2019a5k6k1PN0K8M6j50J11j0O7q8P6r0k1Q7j22J22j82K25j49J8O1j57J95m6q9R8l8L5oN8K2
$$ -15 -41 -62 -55 -5 23 69 -81 30 20 87 -1 75 -15 -36 51 -71 51 -131 94 -55 -37 24 -133 62 16 -73 25 -13 22 16 74 96
1738I6j04%k4R0L5j42N2Q3q5J6m8p1P6P4r5O8N7j26P7o0m2M2P5M8o1q6M3J36q4j5r5r6R1r7
$$ 96 -8 -8 -32 58 93 -49 3 86 1 17 -31 -102 -26 48 -47 21 78 -48 29 -31 -73 -31 44 92 31 -55 -12 124 40 25 -70 -166 -75 -172
1441a72K16L6o7j08J52ql9p6K2O6n5K7P7L0p5j0O7j44K0M8pj5l5J3m4j12L0J21L8k9j77K69
$$ -172 44 80 13 -95 57 49 10 -66 -44 22 -33 -6 71 101 26 16 83 -61 -41 7 0 -15 -50 -37 -81 -193 -163 -42 -4 -33 -210 59
1161E9J0k1J02P6k67J12m5j13K2Q4o9L8Q8j56RN8J21j56N2Km3N3p3J22j4k7o6J06n1L2m2K0
$$ 59 69 48 150 226 -41 71 26 -87 -65 19 -50 -12 76 -80 -71 -13 108 -48 4 6 -37 16 -57 65 51 24 -42 64 13 45 3 23
881B3m2o5l3K9N2P3q6J09n2o0N3J66j01j8o1O8o4P3pj7q0P9J3n6Q3j8m1Qm6N2O8p8j5O3j03
$$ 23 -19 -84 -117 -88 -36 37 -49 60 8 -52 1 167 66 48 -13 55 -9 64 57 40 -40 39 52 -4 79 61 20 28 -18 34 102 24 9 72 -31
575c1mJ13Lr5Mm4J1L6R8J4n1r1J18m3m7n0R8j02Q3m6Q0J3j70N0P9j31R4j2m1L8k8K0J20j88
$$ -31 -35 78 81 -14 -10 -54 -43 -7 91 105 54 -37 81 38 -9 -59 39 -63 20 -26 54 67 -103 -53 26 -105 -11 -23 -64 -26 -54 -34 86 -102
277a02J21j73K64j02M7k4l2j7QK1o6j14K04L3P9j90J01o5j37K12j04J42r1K1P2j65Q2J04j43
$$ -102 19 -154 110 8 55 31 -1 -18 -10 11 -55 -169 35 68 147 -43 58 -7 -144 68 -36 106 15 36 108 -57 25 129 -14
23a4O6k2m0q8J28p8N0K0K7m4j75J70J5n5P3j21LR2N8o8J15j66J24j65L8J5P8n5q5
$$ -14 52 30 -10 -98 30 -48 2 22 49 5 -170 0 15 -40 33 -88 -85 7 65 -3 112 -54 70 -95 -57 -42 36 -19 -104
-230a04
##PAGE=	F1=-18180.2
##FIRST=	23146.756194512010552,	4241.1435120000014649,	0
##DATA TABLE=	(F2++(Y..Y)), PROFILE
4241B9j01Q5jN2j55M7j0K8Q1l7J10n0j71J94M6j27n2L3N6omM7r7J5J6M7J2k5k2j03Q8q5P4
$$ 29 -72 13 12 64 -91 -44 -54 -26 55 18 128 78 -93 101 147 20 -32 1 57 51 47 94 -3 12 28 75 87 62 40 -63 25 -60 14
3952A4m7O6j24oJ56r1J15n8o1R9j86O5L3N1L1L1p9p4j5q4N4J57p2M7j7k7j11J80j33n4L5J0
$$ 14 -33 33 -91 -97 59 -32 83 25 -36 63 -123 -58 -25 26 57 88 9 -65 -80 -164 -110 47 -25 22 5 -22 -133 47 -86 -140 -105 -95
3672i5J83j24L8m0K0rJ0J8Q9o5j22R4O0j4j22j1J55o2O5L5j02Oj5p5J61j31J12j47K12j39
$$ -95 88 -36 2 -38 -18 -27 -17 1 90 25 -97 -3 57 43 -79 -90 65 3 68 103 1 7 -8 -83 78 -53 59 -88 124 -15
3410a5K9K2L4p7oQ9Mk20R8j6Q0k1M4J34q4n0M7l8n4l6k2N0J45j75R6J10j07j13K0J61%p7k5
$$ -15 14 36 70 -7 -13 76 80 -140 -42 -58 22 1 45 179 95 45 92 54 0 -36 -58 -8 137 -38 58 168 61 -52 -32 129 129 52 27
3121B7p6J9K9J3n6J3R3q6J2J27k0n6j00P6k5m2P5j4l8J16Q5j16q1m8J3J85mp9J1o9Q5l0n1
$$ 27 -49 -30 -1 12 -44 -31 62 -24 -12 115 95 39 -61 15 -10 -52 23 9 -29 87 172 56 -25 -73 -60 125 121 42 53 -16 69 39 -12
2832a2m3J34k09K13jq0J42q7K2j26R9j56K09j78OJ25k0j66L0J1L6J00o2o4R0N6j0p1r1J5j5
$$ -12 -55 79 -130 83 82 2 144 57 79 -47 52 -104 105 -73 -67 58 38 -128 -98 -87 -51 49 -13 -77 13 69 59 -12 -103 -88 -103
2561a03N1K2RO7m3j8j19J01rL0P5j16l8O4M9m7j07J2J90j74J26l3M8j36P9R8l1m0q4O2R4l9
$$ -103 -52 -30 -21 46 3 -15 -134 -33 -42 -12 63 -53 -91 -27 22 -25 -132 -120 70 -104 22 -11 37 -99 -20 78 47 7 -77 -15 79 40
2281D0m5j37N0Q1R2r6q7P1J21o5L0K7q7L4o0J16j9j20K1j4J04J02j91O3m1j0m3J00ln0l2q
$$ 40 -5 -142 -92 -11 81 -15 -102 -31 90 25 55 82 -5 29 -31 85 66 -54 -33 -47 57 159 -32 31 -10 -20 -63 37 34 -16 -48 -56
2001e6L1R7o4P4j71J06k9R8p7O9q9m4P5o8J59k26K02j67N3R9j58J63q6r1J06m7Q6l6M2N2j27
$$ -56 -25 72 8 82 -89 17 -12 86 9 78 -11 -55 20 -48 111 -115 87 -80 -27 72 -86 77 -9 -100 6 -41 45 9 51 103 -24
1730b4N4j01J17M6j11K2M7n7M5l3j30J48qm6O7N6j17N3q2j8P4k8J05m3j10N3J50k4p0j30n5
$$ -24 30 -71 46 92 -19 3 50 -7 38 5 -125 23 15 -31 36 92 -25 28 -54 -72 2 -26 79 36 -74 -21 129 105 35 -95 -150
1458a50P9r9K21m5mr9J13J0Jr6j8J30p5MQ5M1r7n4J20j49O0K3K%j8l5k2n8m2J90k2k9j98K94
$$ -150 -71 -170 51 6 2 -97 16 26 27 -69 -87 43 -32 -28 57 98 1 -53 67 -82 -22 1 3 3 -15 -50 -72 -130 -172 18 -4 -33 -231 63
1161F3lmP3J10k73N3l1k2qJ7l5O1R5j87j0J20N5q3J8M2p4N0j12J12Mk8o5J18o8K7j6L2l7p6
$$ 63 60 56 129 239 -34 19 -12 -34 -42 -25 -60 1 96 -91 -101 19 74 -9 9 51 -23 27 -85 27 31 3 -62 56 -12 15 -1 31 -6 -82
863h2l4OR5N6j39J20rr1R7J15m1p2n2Q9m6M5l8J1k5J05k5q8P1n5n2L9K9nP7m3m7O1p2l9P5
$$ -82 -116 -110 -15 41 -98 22 13 -78 19 134 93 21 -31 58 12 57 19 30 5 110 85 -3 68 13 -39 0 29 24 101 58 11 72 0 -39 36
557C6j3n2L0m3J6M0Q5k7k1m3N9K4j27k9R4q8J26n0J5k0j29N4R0j19P9j2l1M8m9l2J53j54J33
$$ 36 23 -29 1 -42 -26 14 99 72 51 8 67 91 -36 -65 29 -59 67 17 32 12 -117 -63 27 -92 -13 -25 -56 -8 -57 -89 64 -90 43
268D3k03L02j61M0mj7j3j9J06j23m7J39OJ24k08N4m4q7K01p6R6j20QJ07j22O6P1j21O7k6m3
$$ 43 -160 142 -19 21 17 0 -13 -32 74 -49 -96 43 49 173 -35 19 -25 -112 89 13 109 -11 -3 104 -18 48 119 -2 65 39 -4
-3dq8J49r8K8M9nl2j42J26N2o8N1p0mQ1J4m1J63k03J61k21M3OO1k2p4
$$ -4 -92 57 -41 -13 36 31 -1 -143 -17 35 -33 18 -52 -56 25 39 -2 161 -42 119 -102 -59 -53 8 -14 -88
-230h8
##PAGE=	F1=-18274.6
##FIRST=	23146.756194512010552,	4241.1435120000014649,	0
##DATA TABLE=	(F2++(Y..Y)), PROFILE
4241B0o4P5k5J14j67K8l1L8Q2n3Q4Qj86K41K0j59q0P6PK5l6K1o7M9L7J9LJ3l9o4K8o9L9%L0
$$ 20 -44 31 6 120 -47 -19 -50 -12 70 17 101 109 -77 164 184 25 -55 21 28 53 17 38 -29 20 57 76 79 92 53 -11 17 -52 -13 -13 17
3935A7j15M7R4r8J73q1j0N1j64J04qN9l3M7p6l2n3n5L7J72n4m4L8o2m5J69q6j18O2m5J75q1
$$ 17 -98 -51 43 -55 118 37 27 78 -86 18 10 69 36 83 7 -25 -78 -133 -96 76 22 -22 16 -46 -91 78 -8 -126 -64 -109 66 -15
3655a5K4o3N9o4PP3N5m8n9M0M6j5j01j9J35j18N9Q3n6ql5n0J76j53O2j14J25j11P3N5J1q2
$$ -15 9 -54 5 -59 -52 21 76 28 -31 9 55 40 -61 -80 55 -63 -4 79 23 15 -20 -70 106 -47 15 -99 26 -85 -12 43 54 -28
3375b8J7N9Kj86J03m5Q1j7J09J13j18mj9q9Jl4j8N4J72j75M2J23j26l0KJ79m2p8l3n4L7qM1
$$ -28 -11 48 50 -136 -33 -78 3 -14 95 208 90 86 67 -22 -21 -55 -73 -19 153 -22 20 143 17 -13 -11 168 126 48 15 -39 -2 -10 31
3086C1l2pM3l1n1J26J1o0m7R1p0n7N7K2l5P0N9q3o0l9J2J29P7j56O7n6K9J7j20j3R5j12J58
$$ 31 -1 -8 35 4 -47 79 90 30 -17 74 4 -53 4 26 -9 61 120 37 -23 -62 -50 79 156 0 67 11 40 57 -63 -76 19 -93 65
2797F5k8n3J46r3%j23J14j67K33j70KJ22j8j63j2R3K8P7o9r4J25j6N3m9r9J9j2P7M6mJ2p1
$$ 65 37 -16 130 37 37 -86 28 -139 94 -76 -74 48 30 -133 -145 -52 -24 53 -16 -110 15 -1 52 3 -96 -77 -89 -12 34 30 42 -29
2517b9L2j00J6L9M5L4j40kN6N2p3p0L7J83j35J01k9lj00P3N3M0p0n9R0Kjn9r3O5Q5J6p2j02
$$ -29 3 -97 -81 -42 3 37 -103 -105 -49 3 -70 -140 -103 80 -55 46 17 14 -86 -13 40 80 10 -49 41 43 42 -17 -110 -45 40 56 -16 -118
2220a18J23J26j55K6P8n9K9p7Q7l2j16J6j8J50N8j68L5J5j9n4R4k8l2JnK9J51j71J14j58Q1
$$ -118 5 131 -24 2 80 21 50 -27 60 28 -88 -72 -90 60 118 -50 -15 0 -19 -73 21 -7 -39 -38 -43 -14 137 -34 80 -78 3
1948Cm2R1m9M6p1m9N9oJ57k24J33j61J02J08j31J18j10o2R1r1J25j7K5N6j30J07j73J36N0
$$ 3 -39 52 3 49 -22 -71 -12 -18 139 -85 48 -113 -11 97 -34 84 -26 -88 3 -88 37 20 45 101 -29 78 -95 41 91
1695I1n3m6J5j1N8j8j39J87j01k0O1Q7j23J4n7oJ10j60J44J4j09O2J31Lp7j41m0P3j11J93
$$ 91 38 -8 7 -4 54 36 -103 84 -17 -37 24 111 -12 2 -55 -61 49 -111 33 47 -62 0 131 134 57 -84 -124 -51 -162 31
1432C1o7L8q5Q3mK3q9m7J69p7qN1O7j09o7J50j59J02J2pMJ1o0%pj28K53q3lj96K69j8%L5J15
$$ 31 -36 2 -83 0 -4 19 -70 -117 52 -25 -33 18 85 -24 -91 59 -100 2 14 7 11 22 -38 -38 -45 -173 80 -3 -6 -202 67 49 49 84 199
1126A99k17Mk1O6m3m3qO6R1j85NJ29%k5mN4r4N6j12P6jm5RJ10j02L7K9j2m0m7j3j0J22j0j56
$$ 199 -18 -14 -35 31 -12 -55 -63 3 94 -91 -86 43 43 18 14 68 -26 30 -82 -6 -7 -52 -43 67 -35 2 31 19 -21 -68 -81 -91 31 21 -135
820a35J41j0p9J24N9k0n9m8Q7l7Oo0O0J7J18p6r5L2p3m5O4Q1m0P1Kr1N7l4o5M6k0K2L8o7N1
$$ -135 6 -4 -83 41 100 80 21 -27 60 23 29 -31 29 46 164 88 -7 25 -48 -93 -29 52 12 83 85 -6 51 17 -48 -2 -22 0 38 -29 22
513B2L3J0l2OjkQ4j59ON9r6J61l2m2m4r5L9J03q2N9n4L8M0m3r2J66r0R8j94K63j68ML3Rpn9
$$ 22 55 65 33 39 38 36 120 -39 -33 26 -70 91 59 17 -27 -122 -83 20 -62 -3 -57 -19 21 -22 -114 52 -38 60 -134 129 -39 -35 -2 7 0 -59
198e9J95j59MO5j2J20j61Nl3k5J65n8M3j31nJ29m0J8K7n0O1k9p0o5J42j01OO2n8J1j06R2N3
$$ -59 136 -23 -19 46 34 154 -7 -2 -35 -60 105 47 90 -41 -46 83 43 61 88 38 99 70 0 -65 77 -24 -18 44 -14 -3 -109 -17 36
-90C6o8K5k5%P7l2J6J52k12J84k54P2j5K8pk4
$$ 36 -32 -7 -32 -32 45 13 29 181 -31 153 -101 -29 -44 -16 -23 -47
-230d7
##PAGE=	F1=-18368.9
##FIRST=	23146.756194512010552,	4241.1435120000014649,	0
##DATA TABLE=	(F2++(Y..Y)), PROFILE
4241Aj3O6m5J65j55Po1K0J02q4N4N8j68K47Kj81q2J09k7L4o0j1k3N6M8MJ4L6m8l4m4j4LK4
$$ 1 -12 54 9 174 19 26 -35 -15 87 3 57 115 -53 194 196 15 -67 42 15 49 -11 -22 -45 11 59 63 77 113 65 31 -13 -27 -24 0
3944@Qj05R7L7r8J76o5K3Qj08J22l9N1j07O8m7jr1mqJ64Kj50R1n9k2J42k3j32O7j37J71nj3
$$ 0 8 -97 0 37 -61 115 50 73 81 -27 95 56 107 0 68 21 20 -71 -75 -83 81 83 -67 24 -35 -57 85 62 -70 -3 -140 31 26 13
3646A3o1O4r4j2J26Ql4MLM7l4r1QR1j42K6J30k0m6j0k0J63j64K7p9L5r2R6Q9no5L2K6j9j18
$$ 13 -48 16 -78 -90 36 44 10 14 17 64 30 -61 -53 38 -104 -78 52 32 -14 -24 -44 119 -45 -18 -97 -62 -154 -58 31 26 -39 -7 19 0 -118
3340a18R5l6N7KJ24O6j33O9j27r9N8l0j9M2J96j46oJ14j21M8m2J84p7p8l2PL2m5O2k1k2J2
$$ -118 -23 -59 -2 0 124 190 57 126 -1 -100 -42 -72 -91 -49 147 1 -5 109 -12 36 -6 178 101 23 -9 -2 30 -15 47 26 4 16
3060A6J4r1J01J5n0L7R1j20n2J8N8l7RN9n2n2j0J6P3J28k06J03m8%K0j29J8L0k0R7k4p3J42
$$ 16 30 -61 40 55 5 42 133 13 -39 -21 37 0 9 68 16 -36 -46 -30 43 171 -35 68 20 20 40 -89 -71 -41 -61 36 12 -61 81
2771H1p9Kj02J17j87K38j46lJ01pj22n0J59J8O0r0j30J50p2R7Or9K2m4J08Q2j9o3o7N7o4o9
$$ 81 2 4 -98 19 -168 70 -76 -79 22 15 -107 -157 2 20 80 -10 -140 10 -62 35 41 -58 -36 -80 28 110 91 28 -39 18 -46 -115
2491a15J01M7k3j28J4L7N8q4l8N9J69q7N3k2l5q1Q1j1J03r0k5J33q3Qq4l4P1Q6m3m1q3J20
$$ -115 -14 33 10 -118 -104 -67 -9 -93 -131 -72 97 10 63 41 6 -75 6 -5 98 8 -17 116 33 41 -43 -77 -6 80 37 -4 -87 33
2211C3Q9j99M3J13oQr1N5p0p7Kk4J92Rj43J2P3n4o8J04o4LN5j8K3J57k36J50j16N1n4N3k2
$$ 33 122 -77 -34 79 73 81 -10 45 -25 -102 -100 -124 68 77 -66 -54 19 -35 -103 1 -63 -60 -5 -23 0 157 -79 71 -45 6 -48 5 -17
1922a7J8l2m0L3L8J25j89O2j33J49Q2j00P4j07j0N6j64J58N7%L7j06J19j95J21M5J5j25J2
$$ -17 1 -31 -71 -38 0 125 -64 -2 -135 14 96 -4 70 -37 -47 9 -155 3 60 60 97 -9 110 -85 36 81 96 -29 -17
1668a7K0O8j1j00J78j65k8L9J21j15k2Oj8J38k62J33P9p3P6P8mm7j18m2N5j25J64m2N2q4P6
$$ -17 3 71 60 -40 138 -27 -55 -16 105 -10 -32 -26 -44 94 -168 -35 44 -29 47 125 121 74 -44 -86 -31 -156 8 -34 18 -66 10
1397A0k4J8o6o0J68n7Jj8R3j10l8J38j75J36L2k9qL9p6K3M6j98K68j21N1j82K11m2RmR1j34
$$ 10 -14 4 -62 -122 46 -11 -10 -28 65 -45 -83 55 -120 16 48 19 11 50 -26 -3 43 -155 113 -8 43 -139 72 30 39 35 126 -8
1117hj3jR2o6o7J4N5N7j61N5R5k9mKM4r8O8q6L3l8n8J00J08j37M9O9r4m1QK4j2J28j08j09
$$ -8 -21 -22 70 4 -63 -49 6 63 -98 -43 52 23 19 21 65 -33 35 -51 -18 -56 -114 -14 94 -43 6 75 -19 -60 -52 -28 -40 88 -20 -129
820a29J45n9l2J35J7k7j4m3O2k4k8q4J15L4J09j09p4k3o9k9P5J01m9N9M5j44O2Jq9L3j4R3
$$ -129 16 -43 -75 60 77 50 36 -7 55 31 3 -81 34 68 177 68 -6 -29 -98 -127 -52 49 0 59 104 -40 22 23 -66 -33 -47 46
540D6K6r7R6J1p6kL0On0J39j48M5Lj34J91J2p1n7r2K6J06l7L9j18J30K4k0j28J46j8K6j40
$$ 46 72 -25 71 82 6 4 34 40 -10 129 -19 26 29 -105 86 98 27 -30 -122 -96 10 -27 12 -106 24 48 28 -100 46 28 54 -86
260h6J68j36m4P7L5Mr9K57j67K4Pj9P5p1l5pJ5J14l7j3j26j4J27O5l8k7L6N0k8j10k5J15q8
$$ -86 82 -54 -98 -21 14 18 -81 176 9 33 40 21 96 25 -10 -17 -2 112 75 62 -64 -78 49 114 76 49 85 135 107 -3 -28 87 -1
-29aqM7r6N8o8O8J9o6OJ4K3N4n0O0J03j85J77k39J05m6Qk2M5
$$ -1 -9 38 -58 0 -68 0 19 -47 -41 -27 -4 50 0 60 163 -22 155 -84 21 -25 -17 -39 6
-230F
##PAGE=	F1=-18463.3
##FIRST=	23146.756194512010552,	4241.1435120000014649,	0
##DATA TABLE=	(F2++(Y..Y)), PROFILE
4241a9L5N8n3J81j23jr0oJ19j19J7Q8j24K15pj75n5J12m2K8o3m5J7M3L3J6L5M4n6j8q7M4k5
$$ -19 16 74 21 202 79 78 -12 -18 101 -18 -1 87 -37 178 171 -4 -59 53 11 39 -24 -69 -52 -9 24 40 75 119 63 45 -42 2 -23
3952b3J0K2r2J26oq5J25k9J2Mk8J04m9L4j67R4Lj2j02K7n4J52O9k37J19j1n3J25L1r3K1k07
$$ -23 -13 9 -83 43 37 -48 77 48 60 64 36 140 91 125 -42 52 55 43 -59 -32 -86 66 135 -102 17 6 -47 78 109 16 37 -170
3672a70J62Q0n0l9M7j00m0J41k5k4M7k2O1n1r7N6N2j25k7J64rr7M8J1J11j40J6o6k0r2R5J15
$$ -170 -8 72 22 -17 30 -70 -110 31 6 -18 29 7 68 17 -80 -24 28 -97 -124 40 31 -66 -18 -7 104 -36 -20 -86 -106 -198 -103 12
3392A2kl2J3J0m0n9Q8rJ4K7R4Mj01J21k25n5Q0k2k1J1K18r7m1Q5r9Q8r2J90r7q0j6Q4Np0P5
$$ 12 10 -22 -9 1 -39 -98 -10 -19 -5 22 116 120 19 140 -85 -140 -60 -82 -103 -92 126 29 -12 73 -26 62 -30 160 63 -17 -33 51 56 -14 61
3086F1l4j9J1L2j16O9J1l9J10Q2j44m8j8R0m8n3O9k1n6L1K5K1J30k02J11n7JPr4M8l0J7M7
$$ 61 27 8 19 51 -65 4 15 -24 86 168 24 -24 -42 48 0 -53 16 -5 -61 -30 -5 16 146 -56 55 -2 -1 6 -88 -40 -70 -53 -6
2797fJ2j02J19n8J9o6R7j89K22j01m0P4J9o4n8J83K4L7j20j52J50r9J17P0j12L9r3J21J05
$$ -6 6 -96 23 -35 -16 -82 15 -174 48 -53 -93 -19 0 -64 -122 61 85 122 2 -150 0 -99 18 88 -24 15 -78 43 148
2544A48j3j24l2M5j2j22J38M3q2r6J0L3M1o5j8O9J55n8jKk2j04J04p4J49j14RJ63j26j2j19
$$ 148 135 11 -21 24 12 -110 28 71 -11 -107 -97 -64 -23 -88 -106 -37 118 60 59 61 39 -65 39 -35 114 0 9 172 46 34 -85
2272h5K4O8Q2m9j5n6P1K2j79P9J30L8k9r2M0j22k5j3l9K31k7j17LR7r6p8J20q9M8R8n4M4R4
$$ -85 -61 7 89 40 25 -31 40 62 -117 -38 92 130 101 9 49 -73 -98 -111 -150 81 54 -63 -60 37 -59 -137 -17 -106 -58 40 -14 30 124
1983A24k23J56o6L9p1J3rkJ3l1JN8Q2j54L3r8J84L5q2L7q1M7J4k41J82J52k7J1n7P1j51O5
$$ 124 -99 57 -9 30 -41 -28 -37 -39 -26 -57 -56 2 84 -70 -37 -135 49 84 2 39 -42 5 19 -222 -40 112 85 96 39 110 -41 24
1703B4K8O6j71M0J8P9qn4J37j67n5kJ33p5m4P2n4J56k89P0J15j2Q9J1k0j5o5l8Lj28J57j0
$$ 24 52 118 -53 -13 5 84 76 22 159 -8 -63 -65 68 -7 -51 21 -33 123 -166 -96 19 7 96 107 87 72 7 -31 -28 -156 1 -9
1423iM8r8R2l5Lm5n5J26k5K3q9J08r0MR1j79J44P4n6l2O1r3M3R7k15K26j41J09j59J40o9L2
$$ -9 39 -59 33 -2 1 -44 -99 27 2 25 -64 44 -46 -42 49 -130 14 88 32 0 61 -32 11 108 -107 119 -22 87 -72 68 -1 31
1143C1k7N3p1%L0M3o0m8K2M3mj19J00N7m4pL1K8p4O2o4J1r1n2J42J25j47N1P6j67l3O1O4n
$$ 31 4 57 -14 -14 16 59 -1 -49 -27 16 12 -107 -7 50 6 -1 30 58 -16 46 -18 -7 -98 -150 -8 117 -30 21 97 -70 -103 -42 22 17
846A7J08j98PJ11j27K2J23Jl2Qk8K6Om5j19J58L6P5j13l1p5n2j2Q1Q4l3M5O4j83P3K4j09L4
$$ 17 125 -73 -66 45 -82 -60 63 64 32 40 12 38 44 -1 -120 38 74 149 36 5 -70 -122 -134 -53 31 -2 43 107 -76 -3 21 -88 -54
557e4mJ34jj07J17j5j14M1N1k5q1J91j32P6n1j79K10P2o4o1j17K9Q0J7Nj73K08J4lj18R4L0
$$ -54 -58 76 75 -32 85 70 -44 -3 48 23 -58 133 1 77 26 -153 57 129 65 4 -113 -84 -4 13 18 -155 53 67 64 -54 40 70
277G0m5n4O9r8q3J00N0K8j17K66j46J7l0j8J2K3n9L6K4O2lp4r7j8J10J45p0p8Q7M0k8j40K7
$$ 70 25 -29 40 -58 -141 -41 9 37 -80 186 40 57 27 9 21 44 -15 21 45 107 104 30 -67 -85 25 170 100 22 109 149 121 -19 8
-12HO8o5oK0j00P6l0N2j8p2qM5P0j0k4N9N7j31J35j80J17o1Pn5R8
$$ 8 76 11 5 25 -75 1 -29 23 5 -67 -75 -30 40 30 6 65 122 -9 126 -54 63 2 9 -46 52
-230E2
##PAGE=	F1=-18557.7
##FIRST=	23146.756194512010552,	4241.1435120000014649,	0
##DATA TABLE=	(F2++(Y..Y)), PROFILE
4241c5P9L1m1J56q6Qj02rJ13j51k5J02p3J64j9j38qQ2m6K5m2p6L6L1rM8M9N2p7j0p7P5n1l4
$$ -35 44 75 34 190 104 112 10 1 114 -37 -62 40 -33 131 112 -26 -34 48 2 27 -15 -91 -55 -24 -33 15 64 116 39 29 -48 27 -24 -58
3944e8P3o5J22m9n3M9Qm2M7N2N4l9K2j92J11N8p0o9J3p1J48J17k77J12N1j13J19O9k4n7k17
$$ -58 15 -50 72 23 -30 19 27 -15 32 84 138 99 121 -71 40 98 28 -41 -28 -99 49 166 -111 1 52 -61 58 127 103 46 -171
3672a71J34J39p3j0L8r4o3J04k1j7N9m2Q3o5j01R9L1p4q3J80k2j37J06K5L8p4J4q3j6j09P6
$$ -171 -37 102 29 19 57 -37 -100 4 -17 -34 25 -17 66 1 -100 -1 30 -44 -127 53 31 -106 0 25 63 -11 3 -80 -96 -205 -129
3401a29J26J5Nl5J8m2m1Q8Ll5N3M3m3k4J14k57J7N8j0j9l9K28m4o3M9o7P9j16J96j04q4J7
$$ -129 -3 12 17 -18 0 -42 -83 5 8 -27 26 69 26 2 116 -141 -124 -66 -76 -95 -134 94 50 -13 36 -31 48 -68 128 24 -60 -43
3121d3J36l1p8R0o7%L0J6j20M5J7l7J42N9j17n5l2J11o6j01O4Qo1O6L6j9Q3j37Q4p2K3Pn0
$$ -43 93 62 -16 74 7 7 37 53 -67 -22 -5 -42 100 159 42 -13 -45 66 0 -101 -37 -29 -90 -24 12 -7 76 -61 23 -49 -26 -19 -69
2832f9Q0o2j3J4N9j02Q3m0K8k3M7j52J86m1j14M8O0k1k4J61M9Nj41j51J16r3J22J14j47P4
$$ -69 11 -51 -64 -50 9 -93 -10 -50 -22 -45 2 -150 36 -5 -119 -71 -11 -32 -56 105 154 159 18 -133 -17 -110 12 126 -21 53
2570E3j43J12J02K2j53J6J0N1j34J16M0j20p1RN2j2j5oO7J33n3m3M2L3j63J37j15J69j43K9
$$ 53 -90 22 124 146 -7 9 19 70 -64 52 92 -28 -99 -90 -38 -50 -65 -71 -4 129 76 33 75 108 -55 82 -33 136 -7 22
2307B2J61j16n1j42O0N8P5rnm3J8n2j06J24J16N0o0p3M1j53mj3o1K47l7q5LP9j17p6J17q5
$$ 22 183 67 16 -126 -66 -8 67 58 53 10 28 -24 -130 -6 110 160 100 27 68 -85 -89 -102 -163 84 47 -38 -35 44 -73 -149 -32 -117
2027a17Q1J15j08R4rj35J13l4O0r0rj0qM7k8k7N1N6j36N6p4J91oo7Lm1Q8k1k84J66K24l9m
$$ -117 -36 79 -29 65 56 -79 34 0 60 -30 -39 -49 -57 -10 -38 -65 -14 42 -94 -38 -112 79 73 6 9 -32 56 35 -249 -83 141 102 98
1738I8Jk1o8qNQ6j70R3j9Q7%l6Q8j10o9m8J20k1m9J11j06J64k37nR7N2Q1l5j9q%k1p5j15J71
$$ 98 99 78 10 2 7 93 -77 16 -3 84 84 48 136 26 -43 -91 29 8 -41 70 -36 128 -109 -114 -17 35 116 81 62 54 54 33 -42 -157 14
1432A4qM1j10J14m1Pl2l7M9J0L7j20J05m9K1M0j50J12J08q7n7Q5j07O3J21j60J48j58J33j17
$$ 14 6 47 -63 51 10 17 -15 -52 -3 7 44 -76 29 -20 1 41 -109 3 111 24 -33 52 -55 8 129 -31 117 -41 92 -25
1170b5P3q7O1j9J7n1K5N5m6k3jRM5o3o9J01L9n8j1N7K9k1K1o3J9j30l3J21J38j10L9M2j94
$$ -25 48 -39 22 3 20 -31 -6 49 3 -20 -21 -12 33 -30 -99 2 41 -17 -28 29 58 37 58 -5 14 -116 -149 -28 110 0 39 81 -113
881a13j5R2Q6%P1k38J54M0j70M8R0Pqk8NqM6m4j54J80M5J6j00K3j07l7J1Q4K8mL9N1j87P6
$$ -113 -128 -36 50 50 121 -117 37 77 -93 -45 45 52 44 16 21 13 59 15 -139 41 86 102 2 25 -82 -119 -108 -24 4 0 39 90 -97 -21
583b1L6j15L5LJ36k9q6J00l3r3P6O8p2r4K24j39Q9o9k03K11J16k7n6j49M4K0R0n7j93K51K1
$$ -21 15 -100 -65 -62 74 45 -41 59 26 -67 9 77 5 -89 135 -4 85 16 -187 24 140 113 57 -92 -48 -28 62 5 -188 63 84
312H4j5o8L1L1p5L4J5p9j04P8O1N7r4K16j12On5j4l8Q1o8Q3RK3M0j30m4j7Q8J64n6j15Q0L2
$$ 84 69 1 32 63 -12 22 37 -42 -146 -68 -7 50 -44 172 60 66 11 -3 -41 40 -28 55 64 87 127 -3 -47 -64 24 188 132 17 97 129
15A29m0j23O7Ol8J8Oq3O0lL5j5r0k2N6J40j10L4J4M2p2O9j02Q9k7Qp6J01
$$ 129 89 -34 33 39 1 19 25 -58 2 -1 34 19 -71 -93 -37 103 -7 27 41 83 11 80 -22 67 40 48 -28 73
-230G3
##PAGE=	F1=-18652
##FIRST=	23146.756194512010552,	4241.1435120000014649,	0
##DATA TABLE=	(F2++(Y..Y)), PROFILE
4241d0J04j1j3J05o4L0q9K3Q9j75p0J15l7J10l9q5L8M4n4M0j1r8K9L5o1P4N1P2j12Kl5P8q2
$$ -40 64 53 40 145 81 111 22 45 134 -41 -111 4 -33 77 38 -47 -9 35 -19 21 10 -88 -59 -24 -85 -11 40 112 0 2 -33 45 -37
3952c7q0J36k7R6j08nj4N0j15J05R5nj2K6j75J04R3j41jm0n4J54J28k56P6Q0j57J00J02L9
$$ -37 -117 19 -8 88 -20 -25 -39 11 -104 1 96 91 79 105 -70 34 127 -14 -15 -55 -109 45 173 -83 -7 73 -84 16 118 157
3690A57j18j66Q1J53q6J9N1q9p2L8J8pM6n9J00q1q5J14K2j2j15J71l8j49J30J3k0J0Mj23M1
$$ 157 39 -127 -46 107 21 40 91 2 -70 -32 -14 -21 25 -34 66 -15 -100 14 36 24 -91 80 42 -107 23 36 16 26 30 -93 -52
3419e2j26M6J13M4L2q8L6j9n5R1j6q4P4Rn8O4N3k04P7J1lJj04K09Op8K1l4L9j01J94j04q5
$$ -52 -178 -132 -19 25 57 -31 5 -14 -69 22 6 -78 -4 5 -53 11 64 -140 -63 -52 -55 -54 -158 51 57 -21 0 -34 5 -96 98 -6 -91
3130i1M9J34m3p7J12j03K3M4k9q8L5L4m3J32J1m2o6k3J15p7j26L4K8n5P8N4m5Kl5L6o9M8J9
$$ -91 -42 92 49 -28 84 -19 4 48 19 -69 -34 0 -43 89 100 58 -8 -31 84 7 -119 -85 -57 -112 -34 20 -25 -23 -58 -22 -91 -43 -24
2841b4k0J15p1p3jQ5o5M1j6J3K1k7q0J26K5j95K7R7kL1J10Q5k9j44j29O1o1J24J16j87J04
$$ -24 -44 71 0 -73 -74 11 -54 -13 -29 -16 5 -22 -102 24 49 -146 -119 -22 -24 7 117 202 173 29 -100 -39 -100 24 140 -47 57
2570E7j74J01P4O8j53N4k2J02j09L8M8j31o4K8P8q1M6RN0J03n5o7Q1Q7k13J63j27J60j61L3
$$ 57 -117 -16 58 126 -27 27 5 107 -2 36 84 -47 -111 -83 -5 -86 -40 -31 19 122 67 0 81 168 -45 118 -9 151 -10 23
2307B3J24n9j00j34O8L3P6M1k1m2Lj10j7J58O7L5o1n1N6j36m4J5p9K18k3m7PL7r5o3Q5o4Q4
$$ 23 147 88 -12 -146 -78 -45 31 72 51 9 12 -98 -115 43 110 145 84 33 89 -47 -91 -76 -155 63 40 -7 0 37 -58 -121 -36 -100 -16
2019a6J07j52J37q8j5K8k5J03j01j3k2MN3j9m1K0N7j31J08o7J68l7l1l3jJ03l5k74R4K40k5
$$ -16 91 -61 76 -12 -27 1 -24 79 -22 -35 -57 -53 0 -19 -60 -40 17 -114 -6 -73 95 58 27 -6 -7 96 61 -213 -119 121 96
1747I6LM7j19Nn4j2P0j29J49p6Q3K3n3M7k7n1q2J02J5m3J06j52J67j50m9M0J01M1m2Mj7L9
$$ 96 99 146 27 32 -22 -34 36 -93 56 -20 63 86 33 80 53 2 -80 22 37 -6 100 -52 115 -35 -84 -44 57 98 56 60 43 82
1467H2J1j45r2J80l6L7j05J21n0L6j9j4m5L9K7r1Q8Lj1K1q9N1J04j19p4J14r9Q6J02n7O7j72
$$ 82 93 -52 -144 36 0 37 -68 53 3 39 20 6 -39 0 27 -64 24 27 16 37 -52 -1 103 -16 -90 24 -75 11 113 56 123 -49
1187d9J04n5J6q1P5J2ko2L8N1j06K4M3k1O8r7j8N2L0o5kN3M8N7n5p5N3j43j2O3J20l1K1j6
$$ -49 55 0 16 -65 10 22 20 -42 -4 47 -59 -35 8 -13 55 -42 -60 -8 22 -43 -45 8 56 113 58 -17 36 -107 -119 -56 64 33 54 38
890C8j78J3R7P1OK7k11K79n0j60L3M6K7M3j03M1l1Q3l6j67J78O5m9q6O1j08k8M2Q9o0L0L5
$$ 38 -140 -127 -30 41 47 74 -137 142 92 -68 -35 11 38 81 -22 19 -12 71 35 -132 46 111 62 -24 37 -71 -99 -57 32 -28 2 37
610C7K1j49N9L9j05K2K1J01l7n1O3m8m0R7P4j09q3K13j67Q5l7j81J81J15K4m7j56N7n6J69
$$ 37 58 -91 -32 7 -98 -76 -55 46 9 -42 21 -27 -67 30 104 -5 -88 125 -42 43 6 -175 6 121 145 98 -58 -1 -57 112
347A12j40j68K60L9n1qk0j0m8R1J3p3j17K1P1P7l7J32p9J1p8j2n7R0o7J10j1LP4j64K7j4O6
$$ 112 -28 -196 64 103 52 44 24 14 -34 57 70 -3 -120 -99 -28 49 12 144 65 76 -2 -14 -71 19 -48 62 51 54 128 -36 -9 -23 43
58D3J22oj33L3K7o9m5O7n4j6O1J5o6K5PJ2L6j07l5L4K12k10R8m0N3l3jl5M3M5j0o3N9
$$ 43 165 159 26 59 86 17 -28 39 -15 -31 30 45 -21 4 11 23 59 -48 -83 -49 163 -47 51 11 64 31 30 -5 38 83 73 10 69
-230F9
##PAGE=	F1=-18746.4
##FIRST=	23146.756194512010552,	4241.1435120000014649,	0
##DATA TABLE=	(F2++(Y..Y)), PROFILE
4241b7R6n1J9N5o9O1o7P2P5j94j09J38j9N6o6l8O9K4p0O8J9j07LN1r4O9N0R2j42K1pQ1j17
$$ -27 69 18 37 92 23 84 17 89 164 -30 -139 -1 -20 36 -30 -68 1 25 -45 23 42 -65 -62 -11 -105 -36 14 106 -36 -15 -22 59 -58
3952e8j07J80J4O6j84N1m6J14j68J23Q4m4J9M8j27O9Q7j74O4r1k4J59J02j81K3N9j56N6J31
$$ -58 -165 15 29 95 -89 -38 -84 30 -138 -15 69 25 44 92 -35 34 121 -53 11 -80 -104 55 157 -24 -1 58 -98 -42 89
3699H9P0j16r8K4J27j04M1Q5r2o8k0O9MK5n7R1r8m8R5J8L1j05J30l4j29J14k4l2P1j9j69J24
$$ 89 159 43 -55 -31 96 -8 33 118 26 -42 -62 7 11 36 -21 70 -28 -76 19 37 68 -37 93 59 -70 44 20 -12 59 40 -129 -5
3419ej30J7P4Q2L4j15M8J9p5Q7n2j19P9J3n2J25j4r9Q8l0nM3j61J47N5q7J0j1Ko6J76j07p4
$$ -5 -135 -118 -44 38 72 -43 5 24 -51 36 -16 -135 -56 -43 -95 30 16 -83 5 -25 -30 13 -148 -1 54 -33 -23 -34 -32 -98 78 -29 -103
3130a03N3R1pq2J33j21L6L5q1k8N1M3n7J07n8M9o5pR5o5j35J1J7k9N7Q3o2q7P5j5l3O4K5j3
$$ -103 -50 41 34 -48 85 -36 0 35 -46 -74 -23 20 -37 70 12 61 -4 -11 84 19 -116 -105 -88 -117 -60 23 -39 -126 -51 -66 -99 -35 -10 -23
2832b3J41o5j11nO9j1LJ0j6O6j04KM8P9k39PJ16jP6M6J25o2j18j01Oj8J34O3j98J10j74R8
$$ -23 118 53 -58 -63 6 -5 -2 8 -8 58 -46 -44 4 83 -156 -149 -33 -34 42 88 213 151 33 -68 -62 -80 54 117 -81 29 -145 -47
2552d7M2R2j38O6k9J21o8l8N9j25o9O1R0j30R4K4K9P1m8q2J07Q6k02J66j21J33j46K7O3K0
$$ -47 -5 87 -51 15 -14 107 39 1 60 -65 -134 -73 17 -113 -19 5 34 105 57 -25 82 168 -34 132 11 144 -2 25 88 108
2290A08j48r4O0j0Q6O7m8n2L3j29M8J63j0K2l0l9O9p5j28N7o8J39Lj6J2jl8l6L4n4N9Q9j54
$$ 108 -40 -134 -74 -84 2 69 21 -31 2 -127 -79 84 74 96 66 27 96 21 -107 -50 -118 21 24 8 20 19 -19 -55 -21 -75 -16 73 -81
2001h1J28r7Q7o8k5J32r0j4m2K8L1J1l1l7P0j21J55o4J24o5L0p2L7R4l3k05k2J94J3K4P2j87
$$ -81 47 -50 37 -31 -56 76 -14 -28 -70 -42 -11 0 -31 -68 2 -119 36 -28 96 31 61 -11 26 120 87 -118 -140 54 67 91 163 -24
1721b4L1m8rL1p2J84j33P0M9p3J4L7lr3R2Mk8P2j76J63o7n8j2J25k3j8L4j6L2M3j67p2J64
$$ -24 7 -41 -50 -19 -91 93 -40 30 79 6 20 57 54 -39 53 57 29 101 -75 88 21 -37 -49 76 53 35 69 53 85 128 -39 -111 53
1432E3n9K6q3J00n5O9MPj28N9j7j8O5N1q2M7j5k1O2j43p5J38n9J16M6L9Qj70L5K0k7o0O9L4
$$ 53 -6 20 -63 37 -18 51 55 62 -66 -7 -24 -42 23 74 -8 39 24 3 65 -78 -153 -15 -74 42 88 127 135 -35 0 20 -7 -67 2 36
1135C6Mp7L6J3r9M7O5n1J08j01J6k1J2m1OJ7O7J33j32p1Q7j38J0MP2N2Rp0j46M2R1J7K1j4
$$ 36 40 -37 -1 12 -87 -40 25 -26 82 -19 -3 -24 -12 -53 -47 -30 37 170 38 -33 54 -84 -74 -70 2 54 63 -7 -153 -111 -20 -3 18 4
837Dj29L33j28j04rJ0N8R3j79O4m7J11l9j37J51Q6r3p9O5q3k7Q5Q7j53O1J5J1q9K9L0q3mN8
$$ 4 -125 208 80 -24 -33 -23 35 128 -51 13 -34 77 38 -99 52 138 45 -34 31 -52 -79 6 93 -60 1 16 27 -62 -33 -3 -86 -90 -32
548c2M4j7l3L7q1RJ25N7j28l6J48j77O3L5j21J19O2O8l4j23O0j26K27k18j02K47M7q5K8m7
$$ -32 12 -5 -38 -1 -82 -73 52 109 -19 -55 93 -84 -21 14 -107 12 74 142 108 -15 45 -81 146 -72 -174 73 120 35 63 16
286A6n9K1R4L2n8j28m5Q6P1L6M2n6L6r6j1n2O2n7J09k3kQ1j64R5pM0N8M2j36j2K8j09O8K3
$$ 16 -43 -22 72 104 46 -82 -127 -41 30 66 108 52 88 -8 -19 -71 -9 -66 43 20 18 99 -65 30 23 63 121 163 27 15 43 -66 2 25
-12B5q9rJ04M2n3j2Pj9J04j09l8k0K56k58J29o2O2k6m4KJ2J14n0j9J
$$ 25 -64 -73 31 73 20 8 15 -4 100 -9 -47 -67 189 -69 60 -2 60 34 -10 -8 4 118 68 49 50
-230E0
##PAGE=	F1=-18840.7
##FIRST=	23146.756194512010552,	4241.1435120000014649,	0
##DATA TABLE=	(F2++(Y..Y)), PROFILE
4241@N2o2L8K6r3Q9m5J00Q1k04j29J68j3Rr6pQ8J6r0J00L7r3l1O3r0L7N2R3j45K9j7J12j52
$$ 0 52 -10 28 54 -39 50 5 105 186 -18 -147 21 8 17 -79 -86 2 18 -72 28 65 -28 -59 4 -86 -49 3 96 -49 -20 -37 75 -77
3952g7j04J80N3M4k50J06n3J97j86P2L3m2M5O9o5J7M0j40Q8j12lJ59N0p9l5J3j07j1J46O4
$$ -77 -181 -1 52 96 -154 -48 -101 96 -90 -18 15 -27 18 87 22 39 79 -61 27 -85 -88 71 121 42 7 20 -87 -98 48 112
3690A12m6n3qQ5j41O3J19j03o1m3J04J1Pk6N2r9j0M2K2L4n4O4Jr4P0n8LP8l6k09J97j20mK9
$$ 112 66 13 5 90 -51 12 131 28 -33 -76 28 39 46 20 72 -27 -37 5 27 61 7 71 72 -22 48 -10 -7 71 35 -174 23 -97 -101 -72
3392g2J22Jj02M8N7q3P2p4j34O3M4m3J42m6jN7n3j4J01j88M2J15q6J9j1j4m1J46j13n5K3M5
$$ -72 50 51 -51 -3 54 -29 43 -31 -165 -102 -58 -101 41 -5 -6 51 -2 -16 85 -103 -61 54 -32 -13 -24 -38 -79 67 -46 -101 -78 -33
3112c3O8j01J37j07L4Rj21K8R7K8q1R4j19J13m6KN8l4j35L5m1J3J1J16p5j51J64m8K1O5Qj7
$$ -33 35 -66 71 -36 -2 7 -114 -86 11 39 -42 52 -67 46 0 2 60 26 -109 -74 -115 -102 -91 25 -50 -201 -37 -85 -64 1 9 -8
2832hJ47n7r4j5K1L4l3L3m4J17j51N8l3J06k22j5J13jQ3j4J64r1p1p9k0K1J41l2j57Q8j46
$$ -8 139 82 -12 -27 -6 28 -5 28 -16 101 -50 8 -25 81 -141 -156 -43 -44 39 25 189 98 27 -52 -72 -51 90 58 -99 -11 -157
2561a57J03K0Q0j26N7rR8k8m8N5j13p6P9R1j34J05L8JN2k3r1J14Mj14J39j02R9r9K9lQ4j82
$$ -157 -54 -34 46 -80 -23 -32 66 38 -10 45 -68 -144 -65 26 -108 -3 35 36 88 65 -26 88 92 -22 117 15 114 15 44 41 125 -57
2281e7m3O1o3R7O2p0o8Q1j00O6J26q1K9Ml5P5kk04P9j6M1J8%J0j6K7Pj5p1L0O3j05O6m6J37
$$ -57 -100 -39 -102 -5 57 -13 -81 0 -100 -34 92 11 40 44 9 84 82 -122 -43 -59 -18 0 0 10 -6 21 28 13 -58 -28 35 -70 -4 -50 87
1975H7j37mJ11n7k4o5M5RN5lj08P4r3J71n1Q2r6R0j04P4O5k5r5j34J03N1N4P8k15J1NJ6k1
$$ 87 -50 -54 57 0 -24 -89 -44 -35 20 17 -91 -17 -110 61 10 92 -4 86 -18 56 121 96 1 -133 -30 21 75 153 -62 -51 -46 -30 -51
1686e1j3J92j83N7O2o8k0N6N9q6Q2m2%K9j74J59ro1k4J24q2QN5QrO0j30o6J25m7on2N3m3Q0
$$ -51 -64 128 -55 2 64 -4 -24 32 91 5 87 45 45 74 -100 59 50 -11 -35 89 7 15 70 78 69 129 -1 -67 58 11 5 -47 6 -37 43
1380D3L1K4j68O7q3O0N0P2j52R6M8p9Jj41o4J48LJ37j3P7k2j43k5Q9o1m1M8K9L0p7K6l7l6
$$ 43 74 98 -70 -3 -86 -26 24 96 -56 40 88 9 10 -131 -195 -47 -44 93 80 157 135 -8 -33 56 -5 -46 2 31 61 -16 10 -27 -63
1091f3J9P0o5J43q7K9p9j9K0%l9P0J74j74l1R8j26L3l3K7Q7J1j09j19O1R2n7N2m0l3L02j69
$$ -63 -44 26 -39 104 17 46 -33 -52 -32 -32 -71 -1 173 -1 -32 66 -60 -27 -60 -33 54 65 -44 -163 -102 -10 -67 -15 -55 -88 214 45
811D5l1n1nJ00J14k23N9o1J32o1p1J14Q2r9o5L7n3k9J30P3k15P9l1L9l6jJ1o0k4J01j3K1m7
$$ 45 14 -37 -42 58 172 -51 8 -53 79 18 -53 61 143 44 -21 16 -37 -66 64 137 -78 1 -30 9 -27 -28 -17 -77 -101 0 -13 8 -39
522c9L1j37M3J72J7j31M2M6j37K2J13l9L1k3R4j6o7O3j67K25k47j6K15K2q2K4n1q3Q7N7L4
$$ -39 -8 -145 -102 70 87 -44 -2 44 -93 -71 42 3 34 11 105 89 22 85 -82 143 -104 -120 95 117 35 59 8 -75 12 69 103
251A03j3j44q8J04L8R2k5m2P1j04om1J9k8Q4k9ON4j37J38RLJ6N9j27l0M0j51J63l4q5j5J19
$$ 103 90 -54 -142 -38 0 92 67 25 96 -8 -14 -55 -36 -64 20 -9 -3 51 -86 52 61 64 80 139 12 -18 22 -129 34 0 -85 -100 19
-38A9O3k8m5J1n3J43r0k1q5K52k29J09m6N9m5n1J8J5J33r4K4k6
$$ 19 82 54 9 20 -33 110 20 -1 -86 166 -63 46 0 59 14 -37 -19 -4 129 35 59 33
-230C3
##PAGE=	F1=-18935.1
##FIRST=	23146.756194512010552,	4241.1435120000014649,	0
##DATA TABLE=	(F2++(Y..Y)), PROFILE
4241B9rm1L6K0j15J02k5R1Q7j93j22J91j3k3j17J2J00jj08J25M6o2n2N7n2pO0O9j25J6n8J79
$$ 29 20 -21 15 35 -80 22 -3 88 175 -18 -140 51 38 15 -102 -90 10 9 -99 26 72 10 -42 15 -37 -44 16 85 -40 -24 -82 97
3961I7j77q5J39Q5L2k77J55n6K68j79k3j8j5P3O2ll0k9m4M9r7JJ55qJ8r0k6k8p5J39K8N4m4
$$ 97 -80 -165 -26 59 91 -186 -31 -87 181 2 -21 -39 -54 19 81 78 48 19 -25 24 -73 -72 83 75 93 3 -23 -51 -126 13 41 95 51
3672E1KM8j81Q3J26j14o2l2J14LPK9j1p5J2l1M5pJ7mM7o7L1o3N5L7k9k34K33j04j4kJ50n8
$$ 51 53 101 -80 3 129 15 -47 -79 35 38 45 74 63 -12 0 -31 14 7 24 20 67 0 31 -32 23 60 31 -203 30 -74 -88 -90 60 2
3375Bn4L6Q8p7N0n7j35K5P3m1J23l6N1J3n4k1J46j71q5J91p6L8l0j0l5J04j14l3k1K5J46j38
$$ 2 -52 -16 72 -5 45 -12 -147 -122 -49 -90 33 -3 48 61 7 -14 132 -39 -124 67 -9 29 -1 -11 -46 58 -56 -89 -110 -85 61 -77
3095g7J19o6K4j1j36L9J68k2j02J05j46J31k2MJ4%j26J12j42N7m3J44q6j65K14n6O6N6k6k5
$$ -77 42 -24 0 -11 -147 -108 60 38 -64 41 -105 26 4 8 22 22 -104 8 -134 -77 -120 24 -62 -227 -13 -69 -3 53 27 2
2832BJ36n4l9l6l3O8p2L4n7J68j45P3r5J02j61m2R5J2N2n5J94j18j9n7j1M5J31j35q2O1j01
$$ 2 138 84 45 9 -24 44 -28 6 -51 117 -28 45 -50 52 -109 -151 -56 -44 8 -47 147 29 10 -47 -58 -13 118 -17 -99 -38 -139
2561a39J04J2L8j24M5K2M7mJ7L4r6q5O2R8j01P0N0k9N3J3q8J02j28K2Q7q0P5m3M5n1R7j80
$$ -139 -35 -23 15 -109 -64 -42 5 1 18 52 -44 -129 -67 31 -70 0 50 21 74 87 -1 101 -27 -5 82 2 77 34 79 28 125 -55
2281e5mP8j00Q1N2p7q3J13m3M3N9j13N1Mj5O6M3k20N6O4l2QMkrO9O0m3j03K1K0l0pK0J22j48
$$ -55 -59 19 -81 0 52 -25 -108 5 -38 5 64 -49 2 6 -9 57 100 -120 -64 0 -32 -24 -20 -22 -31 38 98 55 -48 -27 -7 -37 -44 -24 98 -50
1966e0M7L5j0m0q5L7J4Q4L5j70M9m8J56k2N5j14J11j13J03K5j9K7j96j0P3Q2P7k11l1P6L9
$$ -50 -3 32 22 -18 -103 -66 -52 32 67 -103 -54 -102 54 32 87 -27 84 -29 74 99 80 107 -89 -99 -26 56 133 -78 -109 -33 6
1695Fo1L5J76k13N1M4l7m6L2J12o9N3q1L5mj54J58K5q6MR9r9J7O0M1m8O0o8p6Q2Ln5k8k%O2
$$ 6 -55 -20 156 -57 -6 38 1 -45 -13 99 30 83 2 37 33 -121 37 62 -24 -20 79 -20 -3 57 98 50 110 42 -34 48 51 -4 -32 -34 -34 28
1380B8M0L5j52O7j49J07N5N1j74J23Q4j11m7j04n0J46N4J25l4M5k3j02m4J39q3m4K4LO6p0
$$ 28 68 103 -49 18 -131 -24 31 82 -92 31 115 4 -43 -147 -197 -51 3 128 94 139 116 14 -30 109 26 -18 6 9 75 5
1117EK8q2M7n1P2o1J49o3L3j07m5Q9k3q8N9J59j70M1P6j12N5m1J4N2K3j32r6N6J09j16Q6m1
$$ 5 33 -49 -2 -53 19 -42 107 44 77 -30 -75 14 -9 -97 -38 121 -49 -8 68 -44 11 -30 -16 36 59 -73 -169 -113 -4 -120 -34 -75
837g5L6K07j64K9p2NJ41R2k20K1p4J53q6jQ5L9p2l5%l9l1J63N1k24P7r9J00j5j4j2l7j9J15
$$ -75 -39 168 4 33 -39 -34 107 199 -21 0 -74 79 -7 -8 77 116 44 9 9 -30 -61 102 153 -71 6 -93 7 -8 -22 -34 -71 -90 25
548B5n1O0p7M2j93O1K22l6j29J23m9n2l6J59M9o1j03J00Pj8P6j72J57k08N8J70m6l5Jm2o9
$$ 25 -26 34 -43 -1 -194 -133 89 53 -76 47 -2 -54 -90 69 118 57 -46 54 61 43 119 -53 104 -104 -46 124 78 43 44 2 -67
277f7J09J4JN8j60r9J29rJ05n6l2J01r7Mm7oJ8M5l7K6J0j04J43L2l5RM3j04k9O5j82J83n4
$$ -67 42 56 57 115 -45 -144 -15 -24 81 25 -7 94 -3 1 -46 -52 -34 11 -26 0 10 -94 49 81 46 55 98 -6 -35 30 -152 31 -23
-12b3m9k7R9O1J1p3K9p5J26o3J7j32K03j40M9jM6p3l1K1L9R9j23L9k
$$ -23 -72 -99 0 61 72 -1 28 -47 79 16 33 -99 104 -36 13 12 58 -15 -46 -25 14 113 -10 29 27
-230B7
##PAGE=	F1=-19029.4
##FIRST=	23146.756194512010552,	4241.1435120000014649,	0
##DATA TABLE=	(F2++(Y..Y)), PROFILE
4241D0n1pJ9K3j11R3j1O0O6j51q4J81j6k5j31L0J14m0j26J36N6k9n4M8qm2O4L4j07j0r0K46
$$ 40 -11 -18 1 24 -87 6 -5 55 121 -30 -114 67 51 26 -105 -75 39 -1 -127 9 65 36 -18 30 22 -20 44 78 -29 -39 -129 117
3961A17j84o0Q2J00K6k50J89p1K88j64j07m2J7J04J9M5m5r5P0l2p2JJ52n4Q2j34m2N7j18J16
$$ 117 -67 -127 -45 55 81 -169 20 -51 237 73 -34 -76 -59 45 64 109 64 -31 39 7 -65 -64 88 34 116 -18 -60 -3 -121 -5
3699ej6J30n4M2K4j99J05Q6j13p4pJ07j2K0Q6p3l6K0j09R0p2P2m2P1o0K0l4R2j8Nk43K23q9
$$ -5 -21 109 55 97 121 -78 27 113 0 -74 -81 26 14 34 120 47 11 31 -78 12 -60 12 -30 41 -19 1 -33 59 41 46 -197 26 -63
3410f3k4%J45j06NJ6J08o9L4j0j32j7P1l7R1j0N4pm0j7J44j22j91K66o6O2o0%k9M8r7j3m8
$$ -63 -87 -87 58 -48 -43 -27 81 12 46 36 -96 -113 -42 -79 12 2 56 49 9 -8 136 14 -177 89 23 85 25 25 -4 44 -53 -66 -114
3121a14K9J83j81Q8j8K0qj31LK25q9r7J29j32J11j0%j7K0j04K08k57Q4q0J60r1j40K25n3Q6
$$ -114 -85 98 -83 5 -13 7 -1 -132 -129 96 7 -90 39 -93 18 8 8 -9 11 -93 115 -142 -58 -138 22 -69 -209 16 -37 49
2859D9M7n8l1J20n5J4o1o9R6j07Kn1K03r0N0j18P9r3p4Q2K5J3p6K07j35J5k8L0M2J00k05m
$$ 49 96 38 7 127 72 86 25 -44 52 -55 -53 -104 99 9 59 -59 20 -73 -147 -65 -40 -27 -103 104 -31 -16 -44 -14 28 128 -77 -81
2579h1M7o3R2J3oj29M7M0qjJ19%p2r5J0J27o4QO6o2O7N2p3Q7k54J45L3n8O1pO9o3M5j35K0
$$ -81 -34 -97 -5 8 2 -127 -80 -40 -48 -49 70 70 -2 -97 -87 40 -24 -16 50 -12 55 107 34 121 -133 12 45 -13 48 41 110 47 92 -43 -23
2272b3J02j00K1O2p1q6J06QRj4r4O9m0L3M7M3j71lJ34n2k1Nk5J0P1J11m8j15L3n1M2m1N6N3
$$ -23 79 -21 0 62 -9 -95 11 19 28 14 -80 -11 -51 -18 29 72 -99 -102 32 -20 -41 -36 -61 -51 20 131 83 -32 1 -50 -8 -49 7 60
1975F0r9J05n9L3m6r9MN6P1O6j96NJJ20RM4r7Q0q9J04j1k3J27j86j10O6J03P4j87o1J32L3
$$ 60 -39 66 7 40 -6 -105 -101 -45 26 92 -104 -99 -98 22 31 75 -22 58 -31 73 62 39 166 -20 -130 -64 39 113 -74 -135 -3 30
1695C0p5O0J52k12M5Ppm8j8J47n5Np3O5k5j23J55L9j28M0N5o0J2N7N3n6N1k7r3N3N5r1k2m7
$$ 30 -45 15 167 -45 0 7 0 -48 -66 81 26 31 -42 23 -2 -125 30 69 -59 -19 36 -24 -12 45 98 42 93 66 -27 26 81 -10 -32 -79
1397g9O8L3J8L5r3O9j95J11Q3j2j31J03Q9j13o1m8l8J33P9O4rj6mp2j7J66r7o4%j7R7p3N6
$$ -79 -11 22 40 75 -18 51 -144 -33 50 38 -93 10 99 -14 -75 -123 -161 -28 51 115 106 90 86 14 -3 163 66 2 2 -15 82 9 65
1108F5j14J07j15P0m5J11l1N0j11n0J24n0j15N5R4j32J10L4j03P7k4L0k9M1j52n9K2J40j32
$$ 65 -49 58 -57 13 -32 79 48 98 -13 -63 61 11 -104 -49 45 -87 23 57 -46 31 7 37 8 49 -103 -162 -140 0 -132
855a32J01j3N5Q6j17N4o4L0J59M1j77m0p9J71r4M1Q0l4l2Jj4n4k3J66M1k01O7j62J54k4ml4
$$ -132 -31 -44 11 97 -20 34 -30 0 159 200 23 -17 -96 75 -19 22 102 68 36 37 23 -31 -54 112 153 -48 19 -143 11 -13 -17 -51
575e1oJ0Q0o0Q1q5P8j88L2K20q4j19J61r9M2r9J58J28j36j45R2L1LJ04j50M7j08R1J22j42
$$ -51 -57 -47 33 -27 54 -31 47 -141 -109 111 27 -92 69 -30 12 -87 71 199 63 -82 10 41 44 148 -2 45 -63 28 150 8
312HK7rk2l5P2km6J35j82q4J62m7O9n0l7J30q0K0q3OO7km7M7k0q6J20M8n7J9J8o6k9R6j95
$$ 8 35 26 4 -31 41 39 -7 128 -54 -138 24 -23 46 -4 -41 89 9 29 -54 -48 19 17 -30 17 -3 -89 31 79 22 41 59 -7 -36 60 -135
6a35J16j6kl7O2L6M4r1N7p5O2m7P3j41J28l8j4M6L5j01LJ7N7L7j26K3N6
$$ -135 -19 -35 -37 -74 -12 24 68 -23 34 -41 21 -26 47 -94 34 -4 -18 28 63 -38 -35 -18 39 76 -50 -27 29
-230B9
##PAGE=	F1=-19123.8
##FIRST=	23146.756194512010552,	4241.1435120000014649,	0
##DATA TABLE=	(F2++(Y..Y)), PROFILE
4241B1m4J5mJ9q0O9lL5J2q1k6J28j9%j34M6J29q3j48J28O9lm6N6J6o2N7Nj11j9r1K74j70l6
$$ 21 -23 -8 -12 7 -73 -4 -7 28 40 -41 -67 61 42 42 -92 -46 83 0 -148 -20 49 46 0 56 72 10 67 72 -39 -58 -149 125 -45 -81
3944h1M2Q0K8j81J95j04K48j52j29l6L0J34m1O9j4j41J53j09o3J4J43p2R9j56l9J16j31R6
$$ -81 -39 41 69 -112 83 -21 227 75 -54 -90 -60 74 33 102 88 -53 100 -9 -72 -58 85 13 112 -44 -83 33 -98 -2
3699bn0J49o0Q1J0j75J23Jr0r3K4R4k1L4J24j14LJ6j63J35j35J01l7N1p2L9J4R5m5M2k31J78
$$ -2 -52 97 37 118 128 -47 76 77 -13 -106 -82 12 -9 25 149 35 38 54 -109 26 -109 -8 -45 6 -66 -27 -13 82 37 79 -152 26
3419B6p7m6K3J09j13N3rJ10n7L2L5j34m0K8j4O1QL4Pk1JQ6o6k38L10o9Q4q8J1kj8n9Nm2L1
$$ 26 -51 -97 -74 35 -78 -25 -34 76 19 51 86 -48 -88 -60 -74 -13 -5 29 36 15 16 102 36 -202 108 39 123 35 46 44 26 -33 -28 -70 -39
3112c9J61k16P2J1L0J5j19m5K27j43n7J51r5P5j9nk4K0o0K56l32Q5q2J59q5j11K11n7R2L4
$$ -39 122 -94 -22 -11 19 34 -85 -130 97 -46 -103 48 -47 28 9 4 -20 0 -60 196 -136 -51 -133 26 -59 -170 41 -16 76 110
2850A10p2k9J10o2L4p9q0J32j25n8k7J93rJ1r6M7l7j08Q4K3lp9J93j36K2J0P7K0M8k09M6M3
$$ 110 38 9 119 57 91 12 -68 64 -61 -119 -146 47 38 49 -47 0 -37 -145 -61 -38 -41 -120 73 -63 -41 -31 46 66 114 -95 -49 -6
2570fm0O2K1l1j31O2L3m0j6J91l2m1r6m9J68o1m9R3r3Q3Q0n0Q2l25K06ol9N4LQ1m0n2n8M1
$$ -6 -46 16 37 6 -125 -63 -30 -70 -86 105 73 32 -64 -113 55 -6 -55 38 -55 28 108 58 140 -185 21 15 -24 30 33 114 74 22 -36 5
2272EJ05n8p1R4n6p4O5L0j1n5m9P0j08J04J9J6r9o1J57k7n1K4n7K6M3J37l7q3N6j42Q8k3N5
$$ 5 110 52 -19 75 19 -55 10 40 29 -26 -75 -5 -113 -9 10 26 -73 -134 23 -4 -55 -31 -88 -62 -19 118 81 -2 54 -88 0 -23 32
1983C2m3j9J37j32O8l3j04l4J10J9Q6j85l3M1P8K8L6m3J7l9O7k6l4J71j22j63L5J16O5j56
$$ 32 -11 -30 107 -25 43 10 -94 -128 -18 1 87 -98 -131 -90 -12 16 52 9 26 -13 54 28 -6 165 43 -120 -85 31 96 -60
1721f0o6J56j2m8M7J28j69K8j9j0j9o0J60n3l7j7P6m6p8J36L2j56N0J5J4QM9K9l3M8l5r5L6
$$ -60 -126 30 18 -30 17 145 -24 4 -15 -25 -44 -104 56 3 -34 -51 25 -21 -99 37 69 -87 -37 -22 -8 0 49 78 45 93 58 -37 -1
1432aP5p9m8o7J38K0k7J6k6Q2k05P8J23r3n2N3P2r8l2pl3J08Q5k2L1n1J9o1K1J71j10p2k5
$$ -1 74 -5 -53 -120 18 38 11 27 1 83 -122 -44 79 -14 -66 -13 59 -39 -71 -78 -111 -3 82 60 91 40 59 -2 19 190 80 8 -17
1143a7j4J10r5J07j34J34j30N0k6M1NR2j07l7J03o6j14O8J6q7J40mj07R3J5M6j01O0j74%l7
$$ -17 -31 79 -16 91 -43 91 -39 11 -15 26 31 123 16 -21 82 16 -98 -30 -14 -101 39 35 -72 21 36 82 -19 41 -133 -133 -170
872a70J77j04Q5L1L4k4m7M1l2N1J42j3j06j10o7J77p3M3Q9j01jK2Lq5pJ38N8j82O2j81J63
$$ -170 7 -97 -12 19 53 29 -18 23 -9 42 184 171 65 -45 -112 65 -8 35 124 23 22 44 47 -38 -45 93 151 -31 31 -150 13
601A3m8K6m1K9L5J2m0P7m4J64o9q7J07j10r9J30r3J01j41J20J77j74j35P6L9OJ34j22n1J4
$$ 13 -35 -9 -50 -21 14 26 -14 63 19 183 114 27 134 24 -75 55 -38 63 -78 42 219 45 -90 -14 25 31 165 43 -8 6
338FP6Q1k25O0QRpmJ8p4J89k12n2J96o7Lk5n7J63n6L3j40N6J00n4n7O2k1p8Q7M7n2RJ5k5m1
$$ 6 82 163 -62 -2 6 15 8 4 22 -52 137 -75 -127 69 2 5 -20 -77 86 30 63 -77 -21 79 25 -32 30 9 -69 18 65 13 22 37 12 -29
23b9J24j85qO2L4l6L6jM5q2P2n7qn3J31j10M8K6m1Q1L0j29M2MM8pj08lJ05
$$ -29 95 -90 -98 -36 -2 -38 -2 -3 42 -40 32 -25 -33 -86 45 -65 -17 9 -32 49 79 -50 -8 -4 44 37 -71 -74 31
-230C1
##PAGE=	F1=-19218.1
##FIRST=	23146.756194512010552,	4241.1435120000014649,	0
##DATA TABLE=	(F2++(Y..Y)), PROFILE
4241b4J3J1j6Mm1M3oK8m2mK9L9j4L3j21M6J38r2j71R5Q0K0m8R1J3p2M2j6j27Mn8K34j35nK9
$$ -24 -11 0 -16 -12 -53 -10 -16 12 -30 -34 -5 34 20 53 -68 -22 116 24 -147 -52 28 48 0 91 104 32 74 58 -69 -65 -123 111 -24 -29 0
3935@J9L4r5J67j40J69j36q8j8K4J43p9O5N1j58J68j45o7M2J20n9P4j43l5J32j27R9o4J16
$$ 0 19 53 -42 125 -15 154 18 -70 -88 -64 79 0 65 116 -42 126 -19 -86 -44 76 17 91 -52 -87 45 -82 17 -47 69
3681F9o1R6Jj10J31j01m8j15N9P9j6M0J40j27K4Mj69J50j68J10kmr3O3O7P2l5O2k00J18o3
$$ 69 8 104 105 -5 126 25 -23 -138 -79 0 -16 24 164 37 61 65 -104 46 -122 -12 -14 -18 -111 -48 19 91 56 118 -82 36 -27
3410b7q9M3O7o7O5l6R5m0M6M9j32m0l9L5L4QK6L9j0K7%k8k10K99r2R9j07L0M2p4j8K3j3J0
$$ -27 -116 -73 -6 -73 -8 -44 51 11 57 106 -26 -66 -105 -70 -36 -28 -2 37 27 54 54 26 -184 115 23 122 15 45 87 13 -5 18 5 15
3112A5R7k17P0J8M9L8j05o1J56j60QJ54n8M4m2qrRKK14l32P0m6J40p4j04J85o8R6J0o5j4J02
$$ 15 112 -105 -35 -17 32 70 -35 -96 60 -100 -92 62 4 48 6 -2 -11 -2 0 214 -118 -48 -94 46 -28 -132 53 -15 81 91 26 12 114
2824A14p7K2p3p8J68j13j19NJ28N9k1m0J8J1j40J03oK3p8J53j14NM0J08j2oj51O6K8k6K4K5
$$ 114 37 59 -14 -92 76 -37 -156 -151 -23 36 15 -25 -7 4 -136 -33 -39 -16 -94 59 -55 -50 -10 98 86 80 -71 -5 23 -3 21 46
2544D6k8j20P3Qm3l0K02o0qq5q0K01j07o9J18j06R5P6l2R4l22J89k7j0M2LO5jj55K5P3O9N
$$ 46 18 -102 -29 -21 -64 -94 108 48 40 -45 -125 76 -31 -100 18 -88 7 83 51 145 -177 12 -15 -25 17 20 85 84 -71 -46 27 96 101
2255A01j53J28l0n6MK1Jn6j1O1j58J63jj4o2q1J30J2o8P0r6K5J2J30k8j1P6k21J08J4L7j27
$$ 101 -52 76 46 -10 -6 15 16 -40 -51 10 -148 15 14 0 -62 -143 -13 -1 -69 1 -95 -70 -58 72 44 33 109 -112 -4 10 47 -80
1975h0M6J27j64J02oj02n2J36l6R7j59m2O4L7L8J8J9l8J3Nj0n1J49m2j48qJ20M9j32m3J46
$$ -80 -34 93 -71 31 25 -77 -129 7 -29 68 -91 -133 -69 -32 6 24 43 5 18 23 13 -38 111 69 -79 -87 33 82 -50 -93 53
1703E3p9RJJ12j04Qj8n1K9p2J58o2n8N9P0p7l0J00Qj51K8JQ8PM0k0qO8q3o9J7O3k4r7o8J93
$$ 53 -26 -17 -16 96 -8 0 -18 -69 -40 -112 46 -16 -74 -15 55 -22 -52 48 56 -95 -67 -66 22 29 69 49 41 109 26 -43 -26 37 13 -84 -152 41
1388D1K9o8k4K3J04j82K9J54j63J8J6M5q4K4Kl2O5R2q6M3l0K7o2L7J53j18n4m0JJ00j31J69
$$ 41 70 2 -22 1 105 -77 -48 106 -57 -39 -23 22 -62 -38 -36 -68 -3 89 3 46 16 43 -19 18 171 53 -1 -41 -40 60 -71 98
1108I8j34J32r1jmk6K8J50j02k5M7o8r7R2l6m8J17j7j31J03M9M8j25Q3j89O3j04K10n6M8O4
$$ 98 -36 96 5 4 0 -26 2 152 50 25 72 4 -93 -1 -37 -85 32 15 -116 -13 36 84 -41 42 -147 -84 -188 22 -34 14 78
837G8Lr6K2LRN7Q9m5l0j59n2J70l8K4R4j32J0J9L2j09J1R6J00j88O6j33J11p1O7k5N1L4n2
$$ 78 81 -15 7 10 19 76 165 120 90 -69 -121 49 11 35 129 -3 7 26 58 -51 -40 56 156 -32 34 -99 12 -59 8 -17 34 68 16
548A6oO0L7L09J56k98j23j05p3M2m9J01j38P4J78j73q6N8K0J4J48r8j07J20K8N3k58M4L9M2
$$ 16 10 70 107 416 572 274 151 46 -27 15 -34 67 -71 3 181 8 -78 -20 0 14 162 64 -43 77 105 158 -100 -56 -17 25
286B5Lp6M8n7J99k41j0K12o8o4%q2K00l0L0j87J12J04r6o5P1Kp0O3K5k0l3L0Qn3J40j56j26
$$ 25 28 -48 0 -57 142 -99 -109 103 35 -29 -29 -111 89 59 89 -98 14 118 22 -43 28 30 -40 23 48 28 -5 25 33 -20 120 -36 -162
-3a62J26N0j4L4m5J8l8N6m0m6o1J63n5k5L8k9J04K2j56Q2j4J5j5p9qJ05
$$ -162 -36 14 0 34 -11 7 -31 25 -15 -61 -122 41 -14 -39 -1 -30 74 96 -60 22 8 23 8 -71 -79 26
-230B6
##PAGE=	F1=-19312.5
##FIRST=	23146.756194512010552,	4241.1435120000014649,	0
##DATA TABLE=	(F2++(Y..Y)), PROFILE
4241g4Q9nj3k1j4K4j3K7n8N4N3n7QN5r5K4J24l9j85L9P9M9o6J34Kr2L4l2j23M0pJ38r1L8K9
$$ -74 15 10 -3 -24 -38 -14 -27 0 -58 -4 49 -8 0 55 -40 -16 108 69 -116 -77 2 51 -15 119 121 29 63 31 -92 -52 -59 79 -12 26 55
3935E5o2L3j7J17j56Q8j04l4NJ6J10p4M1J18j47J14j21p6P7Q4l0K9r8l5R7j17J28n9N9o4Q1
$$ 55 -7 26 9 126 -30 58 -46 -80 -75 -59 51 -23 18 136 -11 103 -18 -94 -17 67 37 66 -32 -67 30 -87 41 -18 41 -23 58
3664E8Nm0J24j75lj40R6O7oM1J36j13K3k4j12J16j49J14K8p4j03O8J17L5JN6j61O5m1j42M0
$$ 58 63 23 147 -28 -31 -171 -75 -8 -14 27 163 50 73 49 -63 53 -96 18 46 -28 -131 -63 54 89 90 146 -15 50 9 -133 -93
3392i3M7LM3o1P1j6O5K7j17l0r9R8J1nM4N6j4N2o6pj32K34j21R0j11O6P0r0JM4Oj9K6j77O4
$$ -93 -46 -43 0 -61 10 -6 59 86 -31 -61 -160 -62 -51 -56 -12 44 30 82 16 9 -123 111 -10 80 -31 35 105 15 16 60 66 47 73 -104 -40
3086d0J8P4K9q6l4M6j32O2J30k2J8o3j2J5KO1J02k61N9RJ06p2j15J64p6J04l7m3J6Q0r6Jl7
$$ -40 -22 52 81 -5 -39 7 -125 -63 67 45 63 0 -12 3 5 66 168 -93 -34 -25 81 9 -106 58 -18 86 49 6 22 102 6 7 -30
2797c0q2J81p1j50L7J9R4k8K4oO2j60J21m0O4p8J00p2k2M9J07l4m7o8O7mqj1K3j3r1O7k3k4
$$ -30 -112 69 -2 -152 -115 -96 -2 -30 -6 -12 50 -110 11 -29 35 -43 57 -15 -37 12 119 85 38 -30 37 33 25 14 37 24 -67 0 -23 -47
2500d7l2J72q8J8o9o3K09j76n0J22q7J00K8k4J15k62J22m3M4K4OK0L1k27Q3J15JN5j79J36
$$ -47 -79 93 5 23 -46 -109 100 -76 -126 -4 -91 9 37 13 128 -134 -12 -55 -11 13 19 39 70 -157 -74 41 42 97 -82 54
2237E4Qm0o2ML6k4mN8j67J81jl4p9n2P5M2p6J35j35%KR1k5P1Q9k57J13K9J8j63O4R3j67J43
$$ 54 62 22 -40 -36 0 -24 -28 30 -137 44 43 9 -70 -122 -47 -5 -81 54 -81 -81 -79 12 -13 58 147 -110 3 32 50 -113 -49 44 -123 20
1940B0J2r3l7J13o6J05j32l2O7J3M1KM5n8M8n5K7o2P4J9p5n1J18L0j20%J02j36P9n6R8m6q
$$ 20 32 -61 -98 15 -51 54 -78 -110 -43 -30 11 13 58 0 48 -7 20 -42 32 51 -24 -75 43 73 -47 -47 55 -81 -2 -58 40 -6 -14
1651a4J4j09O5m1J44p7n7J16N8j17NO3j8j19oK4J24LK5o1qJ07j38j2mL8K8j44o0K16O0q7p4
$$ -14 0 -109 -44 -85 59 -18 -75 41 99 -18 -13 50 32 -87 -93 -69 55 58 83 22 14 121 -17 -29 -33 5 33 -111 -171 45 105 18 -56
1362e6M9J17j38j3J57j94M5J7K2q3P7ql9J2J08q4PK4J7n3J6J09j11j9k9RO6j60K10r9J16l8
$$ -56 -7 110 -28 -41 116 -78 -33 -16 6 -77 0 -8 -47 -35 73 -11 -4 20 37 -16 0 109 -2 -21 -50 -41 25 -135 75 -24 92 54
1082E4o3K3o9K4J98r3k2lo4p7J08m4j7N5oj67J08N6M6r8J01j78R1j57K37j5J3N4j0j22Q2m5
$$ 54 -9 14 -55 -31 167 74 52 49 -15 -92 16 -28 -45 10 4 -163 -55 1 47 -51 50 -128 -37 -194 43 28 41 95 85 -37 45 0
802@M8L8L1n2K6j68n4J63j2J2Q4j27RkM5j00J0O2J53k09O8l1K1q9J06RN1mp9K5M2J21M72L94
$$ 0 48 86 117 65 91 -77 -131 32 20 32 116 -11 -2 -4 41 -59 -49 13 166 -43 25 -6 15 -74 32 41 92 88 9 34 76 197 669 1063
505A063n19l90p4n9n1oN7q6M7J28j46k3M4k4L7J36p8j11J81k2L0k35J0N2N6Kj05N9JJ53k50
$$ 1063 544 154 80 21 -30 -36 21 -65 -18 110 -36 -59 -15 -39 -2 134 56 -55 126 104 134 -101 -91 -39 17 19 -86 -27 -26 127 -123
233a23M4J89n7j09J5r6K33lKk00J41Q2j12o6P4K2m2M3jL2j04M4K0m0J37j14j87J35M9K5M6
$$ -123 -79 110 53 -56 -41 -137 96 93 95 -105 36 118 6 -60 14 36 -6 37 36 68 -36 8 28 -12 125 11 -176 -41 8 33 79
-38G9q6mK0J2m4k9n1J49jq0MOJ16Qj81J30k9k7%m6J4N8
$$ 79 -7 -11 9 21 -23 -52 -103 46 45 -35 -31 -25 91 99 -82 48 19 -8 -8 -54 -40 18
-230A8
##PAGE=	F1=-19406.8
##FIRST=	23146.756194512010552,	4241.1435120000014649,	0
##DATA TABLE=	(F2++(Y..Y)), PROFILE
4241a04J43k2Kl7rJ1j4J7k1P0L7j30M8N4n7j4Q1N2j70k9O5Q4q6J52J2j39M6m3q3N8M3K6n4
$$ -104 39 17 19 -18 -27 -16 -30 -13 -34 36 73 -57 -9 45 -12 -26 55 107 -63 -92 -27 57 -29 123 135 -4 42 -1 -84 -26 17 43 -11
3952a1Q8K1j25PM3P1j29K0o2j5M2J5L8l1OJ59j19L2n9q1J05M6lqm6l4K8j04J65m3Lp4N2L0
$$ -11 77 98 -27 -20 23 94 -35 -15 -77 -92 -50 -35 3 -28 -22 137 18 50 -9 -90 15 61 58 50 4 -30 -2 -106 59 16 19 -55 -3 27
3655B7MR5j89K7j63J25N4qN0J22p5Lp0j1M5q0J23K1j38q2L5J68oL7L1j21L3oj87J4O9M3Op6
$$ 27 31 126 -63 -36 -199 -74 -20 -28 22 144 69 72 2 -9 36 -44 79 100 -38 -120 -85 83 77 114 145 24 57 51 -136 -122 -53 -10 -4 -80
3357h0N2J0P1j2q8k5j38J57kk1P4M4l3O2p2J1n5J44j29M4r7J17N0m9j6O4pk8k2j04K5L3J10
$$ -80 -28 -18 53 41 -47 -72 -210 -53 -55 -76 -2 42 9 71 -1 10 -45 99 -30 14 -83 34 84 35 19 83 76 48 26 -78 -53 -20 90
3069I0k3o7Qm2o9P5Q1K0ro7j8L6LQ7j2j66O4O0O4q1j16J50o8R9r8pM6M4j11j1J4r8J53j7j37
$$ 90 67 0 8 -34 -103 -28 53 73 64 -3 -21 15 18 105 93 -73 -9 51 115 34 -82 68 0 99 1 -6 40 84 -27 -38 -24 -122 31 14 -123
2762a23O2r1R3j2P1j8J03j57J21m7P7p7N3j6n0M0P8m2o5nO1m3K1k1J6j5m4M9n4j0j1J38j15
$$ -123 -61 -152 -59 -71 0 -18 85 -72 49 2 79 2 55 39 -11 29 107 65 0 -5 56 13 34 13 29 14 -30 19 -35 -45 -56 82 -33
2474c3L3o4jJ90k28oQ7m1J01n6k0J18j65M9o6J26P%k7M3k51R6J55p4P0j42J13M7j3j23pP5
$$ -33 0 -64 -65 125 -103 -109 -22 -63 38 -18 -38 80 -85 -36 -102 24 31 31 4 47 -204 -108 47 -27 43 -99 14 61 48 -75 -82 -7
2194gJ2k5O8j38J49L2m2j25mK9N8r3J90j58m2J5M0k5J27J03k43J12P%j40L1O9j61J86kp0q
$$ -7 5 -20 48 -90 59 91 49 -76 -80 -51 7 -86 104 -54 -96 -81 -41 -66 61 164 -79 33 40 40 -100 -69 0 -161 25 23 -47 -55
1913e5N7o3J09j01k8N7J3M0OJ0m5O2r1O8o3j7N0J0p5J15J3j24N3M2j63J43q9P3k2j1N0j47
$$ -55 2 -61 48 -53 -81 -24 -11 29 35 45 0 62 -29 39 -24 -41 9 19 -56 59 72 -52 1 43 -120 23 -66 7 -15 -26 24 -123
1633a23O5K0J20q3n2J32N3j55J0M9k9q5k3O5J12j7Oo6l3J41j67O0j9K2K9j50n3K01J00q5j14
$$ -123 -58 -38 82 -1 -53 79 132 -23 -13 36 7 -78 -101 -36 76 59 65 -1 -34 107 -60 0 -19 3 32 -118 -171 30 130 45 -69
1362f9O1R9q5k7J22j78L2M1J5r1J02j2n9k9J21j8n3O2Ml0k8M5p9J7MJK4j73K11l0R8k5r3M9
$$ -69 -8 91 6 -21 101 -77 -45 -4 11 -80 22 10 -49 -78 43 25 -28 34 38 8 -20 25 -54 -37 -33 -32 -8 -181 30 0 98 73 -20 29
1065B9q0j3K11p2k2k0n6o9J17l5J0rJ2j93J10K3O5n4J03j33O5j81K56J0rJnj06J30q5P1j%
$$ 29 -51 -64 147 75 53 33 -23 -92 25 -10 0 -9 3 -190 -80 -57 8 -46 57 -76 -11 -192 64 74 65 66 61 -45 85 0 71 70 70
776G0m5L9j28q3J67rK6N9j02%k3L2n1k4N6J90k12M7Q0o1j10J31M6L6n9p1M3K8J70N67N25o23
$$ 70 25 64 -64 -147 20 11 37 96 -6 -6 -29 3 -48 -72 -16 174 -38 9 89 28 -82 49 95 131 72 1 44 72 242 809 1334 711
496G11n74l1o6j02RLj2M9N2j10K9L7q1O5J06n5p5J91n1%j81LL8K9Oq0L2P5O1k20J05J23l9
$$ 711 137 106 40 -62 -53 -50 -62 -13 39 -71 -42 -5 -86 -21 85 30 -45 146 95 95 -86 -83 -45 -16 -10 -90 -58 17 78 -142 -37 86 47
207D7j24K2q8K51J3m5j75J23N3r4n7P4J5MK4j7Q9j65L1RJJ16o6j73Q2L8P0M3j09J0O0l7p0
$$ 47 -77 -55 -143 108 121 76 -99 24 77 -17 -74 0 15 19 43 26 115 -50 -19 -10 -9 107 41 -132 -50 -12 58 101 -8 2 62 25 -45
-82d5L1j7R5K6j04m6L0J16nj98J77k9o1Qj3N0k
$$ -45 -14 -31 64 90 -14 -60 -30 86 81 -117 60 31 -30 -22 -35 15 13
-230A3
##PAGE=	F1=-19501.2
##FIRST=	23146.756194512010552,	4241.1435120000014649,	0
##DATA TABLE=	(F2++(Y..Y)), PROFILE
4241a01J47l2K1l4k3LljL9N2rj56R8K8j9n1K7J24j19r2M9J07q1J26N5k10P0m6k3M5Q8n9l5
$$ -101 46 14 35 1 -22 -19 -22 -23 16 68 59 -97 1 29 10 -41 -14 110 -9 -101 -52 55 -26 100 155 -55 15 -31 -54 -9 79 20 -15
3952a5J28mj38n4Q6N3o6l6k3m6J02K0m9J8l0J72q9l0Pr2J29J8Qk0j7k3m3q3J76j8l7q7K1Q0
$$ -15 113 109 -29 -83 3 56 -10 -46 -69 -115 -13 7 -42 -24 -54 118 29 -1 6 -86 43 61 69 49 32 9 -34 -117 59 41 4 -83 -62 18
3655A8OM4j36K8j77J42M1m0Q2R9j5l4j14Q3k2J2J24k2j83k5k5K11n1O3kp8K1L1j98k0J27J0
$$ 18 24 68 -68 -40 -217 -75 -34 -74 8 107 92 58 -56 27 5 17 141 119 -64 -89 -114 97 46 109 107 29 50 81 -117 -137 -10 0
3375@j8p1M4L3N4m5n8k6j57J92Pl7Q4K1n2M5k0M2k4P3r8l1p1J60j3L1o4Q4m8ml6k4n2O1J60
$$ 0 -18 -89 -45 -12 42 -3 -61 -87 -244 -52 -45 -82 2 23 -29 16 -4 38 14 87 -11 -42 -113 47 34 65 1 85 37 33 -3 -27 -79 -18 142
3069A42r0o1L0p2J1M0K4O3k8n5k9M7LO7o1r4P2J00K3r2r0J37m3O6j47L4N9Rj09j5N4j17R6
$$ 142 52 -9 21 -51 -40 0 24 87 59 4 -25 22 25 92 31 -63 9 109 132 40 -50 87 44 110 -37 -3 56 65 -44 -59 -5 -122 -26
2780b6K0r2P8j55P6J3Q6j8J06j33J02oL4o6J9M9p1J9M0m0n6J2M6o4M4J0J2m4OL3q2j7K3J21
$$ -26 -6 -98 -20 -175 -99 -86 0 -18 88 -45 57 51 85 19 38 87 16 35 75 35 -21 -9 37 -27 17 27 39 -5 1 34 -48 -65 -42 79
2482G9j30M0p9Q8J46k36M2K4MR5j42j1Q2m6Lr1K13pl3m4M0k29O0J84j38N9q5P9P5L7j64j1
$$ 79 -51 -11 -90 -2 144 -92 -50 -26 -22 73 -69 -80 2 -44 -41 -132 81 74 41 -3 37 -192 -132 52 -86 -27 -112 -33 42 79 -85 -96
2202i6Q5L9n3P9q7Q0Q7m0j57L1J1O8j28K02j48q1L5mj0J33J20j97R9k5k5q1k1P8j60K12m6
$$ -96 -11 28 -25 54 -33 47 134 94 -63 -32 -21 47 -81 121 -27 -108 -73 -77 -87 46 166 -31 68 43 18 -63 -84 -6 -166 46 0
1931@l2MQm4J04n0n1L9L5K7M6o9j8O4j00R4o5q1O9N7p5J12jj33J02oj67J95q6K5k7lO0j44
$$ 0 -32 -28 -20 -64 40 -10 -61 -22 13 40 86 17 -1 63 -37 57 -8 -89 -20 37 -38 74 73 -60 42 36 -131 64 -22 3 -24 -27 33 -111
1633a11L0Q9Q7p3o1J21M5j68j3O8k2o7rR0O6n3ll9o2J48j59J19k1J8j8j04m6J55J36q0j26
$$ -111 -81 8 95 22 -39 82 127 -41 -54 14 -8 -75 -84 6 72 19 16 -23 -85 63 -96 23 2 20 2 -102 -148 7 143 63 -63
1362f3O2M9k6j8O4j34RN5K4q9Q4J1r5l8J20P7j08N4J6qp3k4k7M6L0rj0j69J73M3Q3n9o3O5
$$ -63 -1 48 22 4 68 -66 -57 -2 22 -67 17 28 -67 -105 15 92 -16 38 54 46 -27 -51 -78 -32 -2 -11 -21 -190 -17 26 109 50 -13 52
1065E2p9n9J80l6j7ql8q6J36m5L1n4K5j85J05l2J04k2Q4o6nj70K57K7k0n8lo3J62j05O8l9
$$ 52 -27 -86 94 58 41 33 -5 -91 45 0 31 -23 2 -183 -78 -110 -6 -28 56 -10 -15 -185 72 99 79 21 18 -45 117 12 80 41
785D1Qm1On2j22J77k3O0K6p9nm3J4J7q0P2K01j80jJ49j02j38J37O4L4j06m6M8J7J70N21M88
$$ 41 49 8 14 -38 -160 17 -6 54 80 1 -4 -47 -33 -16 -96 -24 177 -3 -4 145 43 -95 42 106 140 34 -12 36 53 223 744 1232
505A232n39n91Oq9j00%l8N3O6j1p2N2L2j18P3O7k1k1J68n3m1j35M1J4l6K5k7j8J31n0j54J63
$$ 1232 693 102 108 19 -81 -81 -119 -66 0 -11 -83 -31 1 -117 -44 23 2 -19 149 96 55 -80 -39 -25 -61 -36 -63 -81 50 0 -154 9
225IL4k1j13L2o5K52Rr6j27O8L4n4l5N8j1N6Nk1J34j83j2j4M9Q4j7j08nK3J02J6r8O1N1n9
$$ 9 43 22 -91 -59 -124 128 137 41 -86 -18 16 -38 -73 -15 -26 30 35 14 148 -35 -47 -61 -12 72 55 -53 -58 -35 67 83 -15 46 97 38
-73C8j07J03K2L5J5r7q4L4R7ok00K04j0p5j2J5Q3l7
$$ 38 -69 34 56 91 106 9 -75 -41 56 50 -150 54 44 -31 -43 -28 55 18
-230A8
##PAGE=	F1=-19595.5
##FIRST=	23146.756194512010552,	4241.1435120000014649,	0
##DATA TABLE=	(F2++(Y..Y)), PROFILE
4241f9J06l9L6j5m1JJ3j4P7K0n6j34J47j4J0p7rJ26l9j34M4R9m6O6J17k70P7l4J5K1J24r2
$$ -69 37 -2 34 19 -22 -21 -8 -22 55 75 19 -115 32 18 28 -49 -58 68 29 -105 -61 38 -8 58 175 -95 -18 -52 -37 -16 108 16
3961A6k7J36l5j10j20J13O1Nq1kj03J68L0j25N3n9J72q1l8M8j14J50kRj2k1Qq8n7J43J2n5
$$ 16 -11 125 90 -20 -140 -27 34 39 -42 -44 -147 21 51 -74 -21 -80 92 11 -27 21 -93 57 55 64 52 31 39 -49 -106 37 49 -6
3681fq7rJ34j5k6m6Nj73J58J8q8J27P4N2q4j29J31n4Q7J02p2k06N7q9K28q9P1l2l1K7N2j68
$$ -6 -93 -102 32 17 -9 -55 -50 -223 -65 -47 -135 -8 66 118 34 -95 36 -18 69 171 99 -107 -50 -139 89 0 71 39 8 35 87 -81
3401h1m2J90r2j6l9M2N1J5n8m0k0j66J89M2n0N6J2n6LN5P8m0M1l3j03m4J68q1J08j16J01q7
$$ -81 -123 67 -25 -41 -80 -38 13 28 -30 -70 -90 -256 -67 -25 -75 -19 -7 -63 -60 -5 73 33 74 41 -62 -106 62 -19 89 -27 74 -13
3121a3L3k1K8j30P8K15j25q7K1n2R0j8k1Q3k2l7m7N4j0J2k9n5N5J26Jr5m9J24j9J0j55P2L7
$$ -13 20 -1 27 -103 -25 190 65 -22 -1 -53 37 19 -2 81 59 22 -25 29 19 31 2 -53 2 128 129 34 -15 109 90 100 -55 17 54
2832E4Jq3k0N1j19M0J9l6Q8j58O9K9O8pO5j09Q0O4m7m6kJ12p1qNl9k9oK2o2M1Q6J9r2M7K7
$$ 54 55 -28 -48 3 -116 -76 -57 -93 -5 -163 -94 -65 3 -4 61 -48 32 96 49 3 1 113 42 34 39 0 -29 -35 -13 -75 -34 52 71 -21 26 53
2517E3j10l8N5J10j13L4r6J70Q1j98Q2m7K7P9j85qK2O3j1r0K56j7q6k4L7j74j3K06j84M6o2
$$ 53 -57 -95 -40 70 -43 -9 -105 65 146 -52 30 -17 10 89 -96 -104 -82 -19 -30 -120 136 119 33 9 46 -128 -141 65 -119 -73 -135
2246a35O2Q1J09j74j7N5M8o7Q7m6NJ39l2j45L0J6Q1j66J64j06r4M5k8K8Q3J37j49O8l1n8k5
$$ -135 -73 8 117 -57 -74 -19 29 -38 49 3 8 147 115 -30 0 16 97 -69 95 -11 -105 -60 -88 -60 23 160 11 79 48 -10 -35
1975c5m9J05j55J94r0J3k2lk6Q8K2r3K0O0lJ13j49%P3r3R3q3r1R5M4n0J08k6j32J34j2j63
$$ -35 -84 21 -134 60 -30 -17 -39 -42 -68 20 42 -51 -31 29 26 139 -10 -10 63 -30 63 -20 -111 -16 28 -22 86 60 -72 62 50 -113
1695a13K19n7l6l7KL8r8k9J49N2n5p9J09J5j42m0R7j3n8K9P9J1r4J6mp7J25j30J42j1J9o9
$$ -113 106 49 13 -24 -22 16 -82 -111 38 90 35 -44 65 80 -62 -102 -5 -18 -76 -47 32 43 -51 -35 -39 -116 9 -121 21 10 29 -40
1415d0k7l8R8J53q4j06M8pK6OJr0KM1M5o6L7M2j32j4J08J48j36J3N6kr8q6L0P3K4j2j9j56
$$ -40 -67 -105 -7 146 62 -44 4 -3 23 29 30 -60 -58 -17 28 -38 -1 41 -91 -105 3 151 15 28 84 82 -16 -102 -72 1 25 13 -6 -162
1117a62J17P9P2j06RP1p9q9J21JJMnj21J73q5L3p0L3j46R4p5J32qN2j0p8j26K25N1l1p7k7
$$ -162 -45 34 106 0 9 80 1 -88 33 34 35 39 34 -87 86 1 34 -36 -3 -149 -55 -130 2 -6 46 36 -42 -168 57 108 77 0 -27
828b7j0J71r8L5n4L6m7m7L1j39J71l5R3j4o1mo8J6P1j27R3J84j26n8J53r2j62J21N8O5j32
$$ -27 -37 134 36 71 17 53 6 -41 -10 -149 22 -13 80 66 5 1 -67 -51 20 -107 -14 170 44 -14 139 47 -115 6 64 129 -3
557ck2M5RJ32L43L22l15m49K1j11p4ln9R0P3m0k7M8K1j22N1L2K2K5J38m2p9j10R1Qj01N1J4
$$ -3 -25 20 29 161 504 826 511 62 83 -28 -102 -105 -164 -74 -1 -41 -68 -20 1 -121 -70 -38 -16 9 147 105 26 -84 7 15 -86 -35 -21
268b1o6J46j40p4K03m1rr1N1m1K45l1j24q1LL7j8oJ7l4R7Jk3J47j42o1m1P2O0K9l8q9J3J09
$$ -21 -87 59 -81 -155 48 7 -2 -93 -42 -83 162 131 7 -74 -71 -34 -52 -58 -41 -75 22 23 0 147 5 -56 -97 -25 35 64 26 -63 -50 59
-29E9k7n1J14On0j35J60L8Mk5o8j02L5N8Mj85J96K0o7n5L1J02k7
$$ 59 32 -19 95 101 51 -84 76 114 118 93 25 -77 -42 16 20 -165 31 51 -16 -71 -40 62 35
-230C5
##PAGE=	F1=-19689.9
##FIRST=	23146.756194512010552,	4241.1435120000014649,	0
##DATA TABLE=	(F2++(Y..Y)), PROFILE
4241b6M4m4M2Pn2J0K3j9O9kp4q8J86o1K8r1lN8M5j60N8N9mQJ66k71M1j3RJ0J44o9k0J07n7
$$ -26 18 -26 16 23 -29 -19 4 -15 54 52 -22 -110 76 15 43 -48 -51 7 52 -108 -50 9 5 13 179 -92 -51 -64 -55 -45 99 30 10 117 60
3935F0p5j49J19Q0M6j09Jj41K08L5j67O7p2J71j04kO2j42J68k4J0nl6N0q8l1O5M7n8o3l9J62
$$ 60 -15 -164 -45 35 81 -28 -27 -168 40 75 -92 -25 -97 74 -30 -32 30 -112 56 32 42 37 1 51 -37 -68 -3 44 -14 -77 -116 46
3655D6k4j03M0k1j53J78j4j25J58N6R5j27r6J14m2J13N8j01j96J37j36K06j05O1n6J8M9L3
$$ 46 22 -81 -41 -62 -215 -37 -51 -176 -18 38 133 6 -90 24 -18 95 153 52 -144 -7 -143 63 -42 19 -37 -19 30 63
3410F3j04m8K30k18JJ9L9O1k9n1l9Mj67J45R1n0j5L2l9m8J16R8p3M0M1j30l3J33j16J44j50
$$ 63 -41 -89 141 -77 -76 -57 -18 43 14 -37 -76 -72 -239 -94 -3 -53 -68 -36 -75 -123 -7 91 18 58 99 -31 -64 69 -47 97 -53
3139e3J12r9N7J2L9j69O0K43q8j41nk4J50o8m0N7K6k9o8O6l4n0M5k8lJ44Pq6k8J14j4m3j11
$$ -53 59 -40 17 29 68 -101 -41 202 114 -27 -32 -56 94 26 -14 43 69 40 -28 38 4 -46 -1 -29 -32 112 119 33 5 119 105 62 -49
2850d9R1j4K3m2l1J3j01K2j8KJ02j19P9K1L9OPj08P4J17j14k8j6J55m2l5j9n3J0l7%n3J0J82
$$ -49 42 28 51 9 -22 -9 -110 -88 -106 -104 -2 -121 -42 -21 18 24 31 -77 -3 114 0 -28 -44 111 69 34 15 -38 -28 -65 -65 -118 -108 74
2552G4L0j25O4K8j32n3P3Q5n8J4r4K18Kj37J11j07L5M9j66k1l1J25km2K17k4j23J2M0j04r8
$$ 74 104 -21 43 71 -61 -114 -41 44 -14 0 -94 124 126 -11 100 -7 28 77 -89 -110 -141 -16 -18 -60 157 133 10 22 62 -42 -140
2281a40K28k08M7r1P6N9J72j48l4PM1n8Q8k9n7J63j7j00LK8R6j78R4n1o9L3k7P7pJ58j24K0
$$ -140 88 -120 -73 -164 -88 -29 143 -5 -39 -32 9 -49 39 10 -47 116 99 -1 2 30 126 -52 42 -9 -78 -45 -72 5 -2 156 32 52
2001E2Lq5nk9J22j38J28j01N0q0K4rO2R4j27KO4m2J83j97JR2p7O8j21n3J39j0k3J06o3j12
$$ 52 55 -30 -35 -64 58 -80 48 -53 -3 -83 -59 -68 -6 88 -39 -37 27 -15 168 -29 -28 64 -13 55 -66 -119 20 10 -13 93 30 -82
1721h2J33K8j62K09k6q1l5nJk9r0J84K9m3r1J22n7p4m6J01j4m4P0L8l5j24O5J0p1R1j02J23
$$ -82 51 79 -83 126 100 19 -16 -21 -20 -49 -139 45 74 31 -60 62 5 -69 -115 -14 -28 -72 -2 36 1 -123 -58 -48 -119 -28 -130 -7
1441gLK8q5L8l1N4J39q8p2K1l7N6K1m3o4J5J3O7l2j3N4j45K3J01J60j37k3R5or2j31O6J06
$$ -7 -4 24 -61 -23 -54 0 139 51 -21 0 -37 19 40 -3 -67 -52 -39 28 -4 -17 37 -108 -85 16 176 39 16 111 105 13 -118 -52 54
1152E4j6j6lj36P7N4O4j28Q1P1p0j03O9J4L7j0L2j49K14j33Oo3M0q9P6q4J19LK4Rj23n5J51
$$ 54 38 22 19 -117 -40 14 78 -50 31 102 32 -71 -2 12 49 39 71 -78 136 3 9 -54 -14 -103 -27 -111 8 11 35 44 -79 -134 17
863A7Q5m4l6p7M0J48p2j8l9N8n8r0J00j20J38k5R6o0m4Qj06N5Q3j36R7J47p7r2J03m6j65R1
$$ 17 102 58 22 -55 -15 133 61 43 4 62 4 -86 14 -106 32 7 103 43 -1 7 -99 -44 39 -97 0 147 70 -22 81 35 -130 -39
583c9L8J13j39LL2OP7J23J39q4k34Nj10o2J7o3J05N1l6K2L0Or6R%N9N1J16l0r0r8J12K7j30
$$ -39 -1 112 -27 -24 8 14 91 214 353 269 35 40 -70 -132 -115 -178 -73 -22 -58 -36 -6 0 -96 -87 -87 -28 23 139 109 19 -79 33 60 -70
286g0O7K1r3J18j80nK10p0j4o3O8k4K38j04j14m3n6O2rJ7l6l4J12J7k6J17n5q9o2N2N4P5%
$$ -70 -3 18 -75 43 -137 -142 68 -2 -16 -79 -11 -35 203 99 -15 -58 -114 -52 -61 -44 -80 -114 -2 15 -11 106 51 -38 -100 -48 6 81 81
-3H1j50J4R8o5J5J30l6k9j48J86K6J3p1m8r5O0LJ2j52J56M2m2r7L9J04O
$$ 81 -69 -55 43 -22 -7 123 87 58 -90 96 122 135 64 16 -79 -19 -16 -4 -156 0 42 0 -97 -58 46 52
-230E2
##PAGE=	F1=-19784.3
##FIRST=	23146.756194512010552,	4241.1435120000014649,	0
##DATA TABLE=	(F2++(Y..Y)), PROFILE
4241Enl9L9J8n0K5J9k7K5%o0m4K05r3L9j01L3k4J01j81Q2J7J5k2J82j96k9%l0J9J44j4qN4
$$ 5 0 -39 0 18 -32 -7 12 -15 10 10 -50 -94 111 18 57 -44 -11 -35 66 -115 -33 -16 -1 -23 159 -37 -66 -66 -96 -77 67 53 45 99
3944I9o2o6j12J01Q9L9j10Kj38J93L4j75P4o2J65j53L9P5j63J70m9J5j2k8Q6n4j7l1Q4n4j6
$$ 99 37 -29 -141 -40 49 88 -22 -20 -158 35 69 -106 -32 -94 71 -82 -43 32 -131 39 -10 5 -7 -35 51 -3 -20 -51 33 -21 -37
3672c7o8J49pj62Q7k9j23J95n2j20J52M1R3j41k7O0j4R5J2j02j50J78j51J51q5L5p5N4Q6k6
$$ -37 -105 44 37 -125 -38 -67 -190 5 -47 -167 -15 26 119 -22 -49 11 -3 92 104 2 -148 30 -121 30 -55 -20 -95 -41 45 19
3410A9l1m3K35l16J1R2L7M6n1l8l6L7j55P0J31k5j05P1j8p7J45Q5r4M2J03r8m2O9j06J29j49
$$ 19 -12 -55 180 -136 -125 -33 4 50 -1 -39 -75 -38 -193 -123 8 -17 -122 -51 -69 -146 -1 84 -10 32 135 37 -5 64 -42 87 -62
3139f2J05p5M5O3Pj43J2K14J1j97k1k3J74q7l2j3J02m0p6P9n1r7J09Rq4J49L3p1l9J05k9o6
$$ -62 43 -32 13 76 83 -60 -48 166 177 -20 -41 -64 110 23 -9 -22 80 40 -36 43 -8 -105 4 13 -71 78 111 40 1 106 77 11
2859A1l8Q0p0O4rm3k7p7N2o0J1J11o8Q8mK3J1k5j36Q1J19j26j7k9J63J4n9k2r2N0o5jo2j7
$$ 11 -27 53 -17 47 38 -5 -32 -109 -57 -117 -106 5 -63 25 21 44 55 30 -106 -25 94 -32 -49 -78 85 99 40 18 -74 -24 -89 -90 -152 -169
2561a69K55K4j22O2K4j36m7Q2L0K0j1o9K21p5p8J22j41N4Oj06m7m5J08J6M1J06k8j01K4N4
$$ -169 86 110 -12 50 74 -62 -109 -27 3 23 12 -57 164 89 11 133 -8 46 52 -54 -101 -146 -38 -22 19 125 97 -4 20 74
2299G4m8j60K46k06N7j39J06J1J93r9n5j1J8m0R3m8r3J58kn5k0L3J05j44K5j6j4Nj1J11j03
$$ 74 26 -134 112 -94 -37 -176 -70 -59 134 35 -20 -31 -13 -53 40 -8 -101 57 55 0 -20 13 118 -26 -1 -17 -31 -26 -37 74 -29
2027b9J94j37l3O3q9k5K9J05j10M2o4O3j43O9jL8J43j30j5L8p3K28k00j4J05n2L2j58KJ89
$$ -29 165 28 -5 58 -31 -56 -27 78 -32 10 -54 9 -134 -65 -66 -28 115 -15 -30 8 -65 163 -37 -51 54 2 34 -124 -122 67
1765F7o4j8J14j04p9J05Q1j62J64qp9k2k2l3M6j36J90K1m8q4J59j52J4k7N8j8k1R4ro4j30
$$ 67 3 -15 99 -5 -84 21 102 -60 104 96 17 -5 -27 -60 -14 -150 40 61 13 -71 88 -64 -50 -77 -19 -37 -58 36 27 -37 -167
1493a67J26po0O8p9O8K1N1o5O3l4M7Q4p5m3rk0M6J6o2n1L7qQ1ol7K3j16M9J05J24j35j5R4
$$ -167 -41 -48 -108 -40 -119 -51 -30 21 -44 19 -15 32 116 41 -2 -11 -31 15 31 -31 -82 -45 -53 28 22 -15 8 -108 -59 46 170 35 20 114
1196A14mn0j58O3J33o1l1K2j12P6j0N6j18J13P5m6j09M5nR0n1M5j40K26j51l8m4M5l6N8o7
$$ 114 110 60 -98 -35 98 37 6 28 -84 -8 -18 38 -80 33 108 62 -47 -2 -7 83 32 77 -63 163 12 -26 -70 -25 -61 -3 -70
925g0P0K6Qj6j27K8N1J12n2L8j23P1J00m0p4JN2n6j08J46q2Q4J6N9j05l0L0j44J13N5j04P2
$$ -70 0 26 34 18 -109 -81 -30 82 30 68 -55 16 116 76 2 3 55 -1 -109 37 -45 39 55 114 9 -21 9 -135 -22 33 -71 1
645AR6m9p9M1Mj34M8J8J46j27L3POK1l2L0M7n0l1p9p6M5m9J08Jj3O7Qon9l1k0P5M8J00j8o5
$$ 1 97 48 -31 10 14 -120 -72 -54 92 -35 -2 5 11 32 0 30 77 27 -4 -83 -159 -114 -163 -55 -54 -67 0 8 2 -57 -88 -108 -33 15 115 97 32
321C2q3Q4N8j13O3Oj05P2j64L9J76n3k8l8O9j1K32j88p9Kj08J00l5L0p8j2R7L9j3M8M1q7p0
$$ 32 -51 33 91 -22 41 47 -58 14 -150 -111 65 12 -16 -54 15 4 236 48 -31 -29 -137 -37 -72 -42 -120 -132 -35 4 -9 39 80 -7 -77
32g7NO6J13pj76K4Q4q7P4J00l6l0j46J83mM5j04n0p1J16n4kr9J10L9pj12M1Q9K4
$$ -77 -72 -6 107 100 -76 -52 32 -55 19 119 83 53 -93 90 86 131 27 -23 -94 22 -32 -34 -133 -23 16 9 -103 -62 27 51
-230E1
##PAGE=	F1=-19878.6
##FIRST=	23146.756194512010552,	4241.1435120000014649,	0
##DATA TABLE=	(F2++(Y..Y)), PROFILE
4241A5l0j5K6J6k9L2Lm5k2K1l9j4J97r8M9j13O5n9J17k08J04qOj5J62o8r6pp0L4J24L8KMn2
$$ 15 -15 -30 -4 12 -17 15 18 -27 -49 -28 -67 -81 116 18 67 -46 19 -40 77 -131 -27 -35 -29 -44 118 50 -46 -53 -123 -89 35 73 75 79 27
3935B7q6k4O1Q4Lr5J5r9J22L4j64Q9l4J38j99M8J10j66J43o7K7l1J9R2j2j9j01J15n7L5r0
$$ 27 -59 -83 -22 62 65 -30 -15 -114 8 42 -122 -33 -67 71 -128 -80 30 -136 7 -60 -33 -64 -45 47 35 16 -85 30 -27 8 -82
3664h2J11J9j82R3j1r1J89q7o7J16J0N1j15M4J1mO8j5r2q2J68j39Q7l2Jq2N9J29j04K9l5K17
$$ -82 29 48 -134 -41 -52 -143 46 -41 -108 8 18 69 -46 -2 9 5 73 58 -34 -116 52 -87 0 -32 -31 -113 -54 75 -29 0 -35 182
3384A82l59NJ59M1j1l1l9j1O4j32j2J49J5j77J03mo8J45N0j07L5J37k2o5Mo8R1j21P6l4RJ19
$$ 182 -177 -172 -13 28 17 -14 -53 -64 0 -132 -144 5 20 -157 -54 -58 -126 19 69 -38 -3 134 112 47 51 -17 74 -47 29 -5 4 123
3104A23m9o8l6J24J19k17j6m1J52p3j1j01J70o0o2R1n3j16J34M7j44J28O1n8p1J01n3m7K2
$$ 123 74 6 -30 94 213 -4 -20 -61 91 18 7 -94 76 16 -46 45 -8 -124 10 57 -87 41 102 44 -27 74 21 -26 -4
2850dM4j08J04kn1l0n7R6p2lJ08l2Q0l1L5qoj75Q6O9p6j1l6J29P3p0jj45P7r0K9r7kK76k0
$$ -4 40 -68 36 34 -17 -47 -104 -8 -80 -83 25 -7 73 42 77 69 63 -112 -26 43 -33 -44 -80 49 122 52 51 -94 -17 -107 -78 -175 -177 99 79
2544G9q2N0J4j21k0Q5m7R8k7m1J95j30l6J01j42R8m6m1o8k1K4L9J18k8j7k4kP2k3j77K44j76
$$ 79 -3 47 61 -60 -80 5 -42 56 29 -12 183 53 17 118 -24 74 28 -13 -81 -102 -78 -39 79 51 34 10 8 80 57 -120 124 -52
2264e2N2j49J22m6J57m9o9L5j8k9J05r1j04J36Rl3k4L2R8p1k7j0M6k6KJ13j61K40j80p2J20
$$ -52 0 -149 -27 -73 84 35 -34 1 -17 -46 59 -32 -136 0 9 -24 -48 -16 82 11 -16 -26 20 -6 -4 109 -52 188 8 -64 56
1992E6p0o5R5N1q3j4lN5j90J10nK6J65j12k9kq5K40j75l6R4j7kj60L4K17q0m9J38j30l9O8
$$ 56 -14 -79 16 67 -16 -30 -33 22 -168 -58 -63 -37 128 16 -13 -15 -100 140 -35 -71 23 6 4 -156 -122 95 15 -34 104 -26 -65 3
1712CR4j56J01Ll1mm5m6R9j45J58K6o7o0J96k26R1nj5rNR9m9q6j02J65m5m5N2m8JM5Q3l9N7
$$ 3 97 -59 42 45 14 10 -35 -81 18 -127 31 57 -10 -70 126 -100 -9 -14 -29 -38 -33 66 17 -69 -171 -6 -51 -96 -44 -92 -91 -46 37 -2 55
1406E5n5P1Nm1k7k7L4mmo2l0N3j3Q1Ol7m4m8N6J01P7j36L4L3J6K4j69K5J38q7n4L4q7J14p1
$$ 55 0 71 76 35 8 -19 15 11 7 -55 -85 -32 -45 36 42 5 -39 -87 -31 70 147 11 45 78 94 118 -51 -26 112 25 -29 5 -82 32 -39
1100c9N4j00J00Q0j0j19N0m4J51r7K1q0J80j20p6k6L9OM1l6J0N2J0o2j01R9m0J11m2Q7j30
$$ -39 15 -85 15 95 85 -34 16 -28 123 26 47 -33 147 27 -49 -75 -36 -30 11 -25 -15 37 47 -15 -116 -17 -57 54 12 99 -31
828c1Q0M1j5j10M3J7l1j06J67n6L8P3lj33k0N4j55J47K0o3K1M7m3j6lL7p6%jJ39q8O0k5%k6
$$ -31 49 90 75 -35 8 25 -6 -112 55 -1 37 110 107 -26 -46 8 -147 0 20 -43 -22 25 -18 -34 -37 0 -76 -76 -77 62 -26 34 9 9 -17
522a7q3K4O1M2o5k5r9N2j8J05n9K1Q7j8Pl5n5j4O1K0P5Jj1o5K8P9p7M9lj15L9j18O1J10j1
$$ -17 -100 -76 -15 27 -38 -63 -162 -110 -128 -23 -82 -61 26 8 15 -20 -75 -89 -28 -8 67 68 57 -8 20 99 22 71 68 -47 -8 -126 -65 45 34
216C4m1j7M3J0K13k45m5N8j55J40q2L7q6J0O7L4K9l1J05o3n4m5P5J39l3j79L8P3q7J04N1J
$$ 34 -7 -24 19 29 242 -3 -48 10 -145 -5 -87 -50 -136 -126 -59 -25 4 -27 78 15 -39 -84 -9 130 97 -82 -44 29 -58 46 97 98
-64I8o0j32J61l7O7j17o4l2J80r5l7l4P7MK9q8M4N4J
$$ 98 38 -94 67 30 97 -20 -84 -116 64 -31 -68 -102 -25 -21 8 -80 -36 18 19
-230A9
##PAGE=	F1=-19973
##FIRST=	23146.756194512010552,	4241.1435120000014649,	0
##DATA TABLE=	(F2++(Y..Y)), PROFILE
4241Il3J8PPJ4K1k7n8n2M9l3PJ58q4O2j22O5k2R6k38J18j6jRJ18N6j28k1r5M3R4O6rj8l1j17
$$ 9 -24 -6 1 8 22 43 16 -42 -94 -45 -78 -71 87 3 65 -57 8 -14 82 -156 -38 -54 -55 -46 72 128 0 -21 -116 -73 21 87 78 60 29 -88
3926h8P2OO9k0q4L8n0K8M1j48J07KQ6k11J4J68j56R5o5L8m4Q8N9J4l6j08J28p7P5j02Q0K2
$$ -88 -16 -10 59 39 -45 -7 -57 -29 12 -136 -29 -27 59 -152 -138 30 -126 -31 -96 -58 -102 -14 45 59 23 -85 43 -34 41 -61 19 41
3646D1j55P3J7n7J57j16J5P6n3No0P5j0j6O6j2r2k1J20j17M3K6k1p7L3J55j61O4k6J98l51
$$ 41 -114 -41 -24 -81 76 -40 -25 51 -2 3 -57 18 8 -8 58 46 -46 -67 53 -64 -21 5 -16 -93 -60 95 -66 -2 -28 170 -181
3375a81oJ89N3j03K7p2M6P1j00p5J45M7k04J13kl3J34J3j24J5J48N8q5m0l1O8q2L3kk3J63
$$ -181 -187 2 55 -48 -21 -93 -47 24 -76 -151 -6 41 -163 -50 -52 -85 49 62 -62 -47 101 159 74 34 3 71 -11 22 20 -3 160
3104A60j13K4o4J2J74j84Om9R4m4J6j75J93o9l0R6l7j14J24N9j45P6P2n2r7J01p2LM1Jj14
$$ 160 47 71 7 19 193 9 15 -34 60 16 32 -143 50 -19 -49 47 10 -104 20 79 -66 10 82 30 -67 34 -38 -35 6 7 -107
2832a07J30k3n3Qm1J14m3k6Q2pN1m8O9n0M7j95P1J%Nl1O6J06o9M7j94R2j22P8j44O2K49r3
$$ -107 23 0 -53 -45 -86 28 -15 -41 41 34 85 37 106 56 103 -92 -21 -20 -20 -15 -46 20 126 57 104 -90 2 -120 -42 -186 -124 125 32
2544C2l2M1Jr2J1Q5j33J57k4k8J70j60rM5j08J46r9Po3J1p4P0J40j27J8P0n2Q3l2j42K10j28
$$ 32 0 41 42 -50 -39 46 -87 70 46 18 188 28 19 64 -44 102 3 10 -53 -42 -116 -46 94 -33 -15 55 3 86 54 -88 122 -6
2264fJ5r5R9q7Q8k1o8J38n8l4J14j27r8J08J3l6lK6P1J6o8j9R5n6kR4j57K76k32q0J49m9r6
$$ -6 9 -86 13 -74 14 -7 -75 63 5 -29 85 -42 -140 -32 -19 -55 -58 -32 39 55 -13 -32 63 7 5 99 -58 218 -14 -94 55 6 -90
1975i0J40j7p4j4N2L3k04J40l3L4J67r3l8l2p7K26j47n3N5K2k5j08K2K02n2j01J69j26jM0
$$ -90 50 33 -41 -55 -3 30 -174 -34 -67 -33 134 41 3 -29 -106 120 -27 -80 -25 -3 -28 -136 -114 88 36 -65 104 -22 -23 17
1712A7M7j45N4J2K7K7o7m1J14j12R5K8q9k1K00k37J25lq5K7K7R2q7r3n2J52p4k2K7Ko1P7J01
$$ 17 64 -81 -27 -15 12 39 -28 -69 45 -67 28 56 -33 -54 146 -91 34 31 -54 -27 0 92 5 -88 -140 12 -62 -84 -57 -55 -116 -39 62
1423F2l0M9q7J04p0%j2l4R9q0j7n3RN6j2O5J3k7j20L0N0P0N8j34R6o6M8J04j64k5J09r2o6
$$ 62 32 81 -6 98 28 28 16 -18 81 1 -16 -69 -60 -4 -16 49 62 35 -85 -55 -5 65 123 -11 85 19 67 171 7 -18 91 -1 -67
1135f7K3p0J70r0O2r4N7Q1J7j31O8o8J92j20l0RQ6n5q4j9K2K6K9ml1O3K4r7o3J33p6P0j6O9
$$ -67 -44 -114 56 -34 28 -66 -9 72 89 -42 26 -42 150 30 0 9 95 40 -44 -63 -41 -15 14 10 -21 42 66 -31 -94 39 -37 33 17 86
837H6q7P2pqj09O9l4J2j02J70o0K5J23o2j41j4P5j22J27Rn1l7K3n8Q0k8M9j4m4l1J05j7P2
$$ 86 -1 71 64 56 -53 16 -18 -6 -108 62 2 27 150 88 -53 -67 8 -114 13 22 -29 -66 -43 -101 -21 -49 0 -14 -58 -89 16 -1 71
548G1n1j7p3n3P6J8N1p8K8j02K2K6R0j05O0P6n4M6l1n9K7J8j2L3K9M6n9k1Q8n0L8Qj36M2o9
$$ 71 20 3 -70 -123 -47 -29 22 -56 -28 -130 -108 -82 8 -97 -37 39 -15 31 0 -59 -32 -14 -26 7 36 82 23 2 90 40 78 86 -50 -8 -77
242g7O6L2K1l8mLL5J76k47l8J15j85J65j23M7o3J5L8j3R1q9J19l0j8o9N9J48m7j69M9N1o1
$$ -77 -11 21 42 4 0 3 38 214 -33 -71 44 -141 24 -99 -52 -115 -100 -62 -75 16 -73 46 16 -2 -71 -12 136 89 -80 -31 20 -41
-38d1R6K0L9r2j08J34p6O3j16n6QK12r7q1L3N8n4N6l1M6Mn6
$$ -41 55 75 114 22 -86 48 -28 35 -81 -137 -129 83 -14 -95 -62 -4 -58 -2 -33 13 17 -39
-230c9
##PAGE=	F1=-20067.3
##FIRST=	23146.756194512010552,	4241.1435120000014649,	0
##DATA TABLE=	(F2++(Y..Y)), PROFILE
4241@k4M2j4nP0jo5n2n9P3m9L2R7p4Q0j18K8N4N8k54J28k9K6K8O2J27j25k3r5M4O6O7m0j3
$$ 0 -24 18 4 -1 69 68 3 -49 -108 -35 -84 -52 45 -29 51 -67 -39 15 73 -181 -53 -82 -56 -28 34 161 36 13 -82 -38 28 95 55 42
3944D2Jj39J31m5N2or6N7j7n2P0j47J23K5L1j74m2K14j41M7l7M8n0J48NNm9m9J16j11Q7j00
$$ 42 43 -96 35 -10 42 36 -60 -3 -20 -72 -2 -149 -26 -1 30 -144 -186 28 -113 -66 -103 -55 -105 43 48 53 4 -45 71 -40 47 -53
3664e3P6rr6N2K4k0J27j45Q9N7j38roN5j1l5R7Pr5OO9j06L3O6l1n5j6J51j67O3oJ91l10lJ65
$$ -53 23 14 -82 -30 -6 -26 101 -44 45 102 -36 -45 -51 4 -7 -42 55 62 -33 -27 42 -64 -31 35 4 -51 -67 84 -83 -20 -26 165 -145 -148 17
3357A7N7j94R5j28J21O5q1r5J26M7j76R9m%J22lj54KJ35J16r8n4qP9n3pJ2l0J73j70J01p0
$$ 17 74 -120 -25 -153 -32 33 -48 -143 -17 30 -146 -47 -51 -51 71 68 -86 -84 51 167 69 15 7 86 33 26 38 8 181 11 112 42
3077D2p7J55j11L6l0K2j5M2k14J62n9J3R0k1r7R7L6q9RN6n3j02J01q0O5K4l3r9J45n4n6N8
$$ 42 -35 120 9 45 15 37 22 64 -150 12 -47 -34 56 35 -62 35 71 -18 -9 47 -6 -108 -7 -87 -22 2 -31 -130 15 -39 -95 -37
2797c7j3Q8lm5M3K1J9n5J06j01R4j79M0n2O2L5j3lR7n5J01k12R6j56J21j80J45J96j53LL0
$$ -37 -50 38 35 -10 33 54 73 18 124 23 117 -62 -22 -74 -12 23 10 7 104 49 150 -62 34 -122 -1 -181 -36 160 7 10 40
2526D0qn9L2O5j99J84pk3J70j81J4l5m8J61j35L5l2K3j25R8R9j63P3J25q2O1m3p5J47q1m6
$$ 40 32 -27 5 70 -129 55 48 25 195 14 28 -7 -55 106 -29 6 -26 -3 -128 -30 69 -94 -21 104 22 83 40 -35 112 31 -15
2255a5kM1q8K3k8m8K38q1m2J00j27q2P3J2m3K7J6K6Q9j10j2J19p7k7P8r9K75k56n7J39m5j06
$$ -15 -17 24 -64 -41 -69 -117 121 40 -2 98 -29 -111 -38 -26 -69 -42 -26 0 89 -21 -33 86 9 -18 60 -39 236 -20 -77 62 17 -89
1975h9J54o7q8K8Q0Qj82J56p9N7J55q7l4m3n4J99j29n6KN5l7k1k4J46%j46J91r8K8L4l3j34
$$ -89 65 -2 -90 -62 18 26 -156 0 -79 -22 133 46 12 -31 -85 114 -15 -71 -69 -14 -51 -72 -96 50 50 -96 95 -3 25 59 26 -108
1695a08M1J5N5P9p6l0Q7m7J5K3j04K5J52j81J18l3j24Q2M6Q3j29p7mR3p8K2k8O9j15J06R2
$$ -108 -67 -52 3 82 6 -24 63 16 31 54 -50 -25 127 -54 64 31 -93 -11 35 118 -11 -88 -92 1 -77 -55 -83 -14 -129 -23 69
1423F9k7N5j24J25j08K6J4m7J57j53j3m3O0M2j0L9K8l2j67Q1M0J4Q1j22J41j60Q3J53j41o9
$$ 69 42 97 -27 98 -10 16 30 -17 140 -13 -26 -69 -9 33 23 62 90 58 -109 -28 12 26 107 -15 126 -34 49 202 61 -8
1161hO2j01m5oo3K10o2Q3r6kP8K2j34P7n0J84j05p7Q2j7Rn3l4J0J6K5L5n1M6M1j00k3J20n0
$$ -8 54 -47 -92 -98 -161 49 -13 70 -26 -28 50 72 -62 15 -35 149 44 -33 49 32 41 -12 -46 -36 -20 5 40 -11 35 76 -24 -47 73 23
863B3JJ7oj8O4m0j8o8O6q0N5j03J59p8L9J49r2j42pR7n4N0K8p5p7L7r3J74m3L7L4o7p9Q0O1
$$ 23 24 41 35 17 81 41 23 -45 21 -59 -4 -107 52 -26 13 162 70 -72 -79 18 -36 14 42 -33 -110 -73 -166 8 -35 2 36 -31 -110 -30 31
557C1O8n6l7j22pJ27j2J7o7N4p3k4O8O3j26R6L6r7R9m0m7Q7l7k1k0N4Q2o5n0R1l9M0K7j63
$$ 31 99 43 6 -116 -123 4 -8 9 -58 -4 -77 -101 -33 30 -96 0 36 -61 38 -2 -49 38 1 -20 -40 14 96 31 -19 72 33 73 100 -63
260f3P9l8N9l6K7j4Ll2M8J27j92o3J49j81J66j35O5l2kK8q6J38j01Q8pL0n7J0J39l3j50M8
$$ -63 16 -22 37 1 28 14 17 -15 33 160 -32 -95 54 -127 39 -96 -31 -63 -65 -37 -123 15 -86 2 -5 25 -32 -22 117 84 -66 -18
-20a8J0j4N4K5M7r5o7J06j23L9j12j0M1J86n4j09Q1M3j07O1L7M4n0j15
$$ -18 -8 -22 32 57 104 9 -58 48 -75 -36 -148 -158 -117 69 15 -94 -13 30 -77 -16 21 65 15 -100
-230a00
##PAGE=	F1=-20161.7
##FIRST=	23146.756194512010552,	4241.1435120000014649,	0
##DATA TABLE=	(F2++(Y..Y)), PROFILE
4241Bj4M5l7k3J22j4j04k7m7Q5o3O3L0q7R9q9l1J22J9k41J35n9Q8K8PJ31j05pp9M6N0N7p6
$$ 2 -12 33 -4 -27 95 81 -23 -50 -97 -12 -75 -12 18 -69 30 -59 -90 32 51 -190 -55 -114 -26 2 9 140 35 28 -51 -5 45 102 26
3952B6LL4j45J42p4L9L4j21N2j4r3J23j70J28L0kr8q9K09j23K6JN6o6J77k9l6l7M2P5j38O7
$$ 26 29 63 -82 60 -14 25 59 -62 -10 -24 -117 6 -164 -36 -6 -8 -106 -195 14 -109 -83 -82 -26 -92 85 56 20 -17 25 100 -38 29
3672B9q6R3n5l3M5pJ2J35j79J26N7k06J5K2Jj7l0J35K4q1%L4j16N6P3l5j8p0J15j20L7K1J85
$$ 29 -57 36 -19 -52 -7 -14 -2 133 -46 80 137 -69 -54 -32 -31 -48 -78 57 81 0 0 34 -82 -26 47 12 -6 -76 39 -81 -44 -23 162
3384A62k47K0R1M5k38J32j72J79N9q3o6J00Qj07P1lJ3J03Qj79LJ03J40j03m1MJ12m2l3J3%
$$ 162 -85 -65 26 71 -167 -35 -207 -28 31 -52 -118 -18 -10 -117 -46 -49 -36 67 75 -104 -101 2 142 39 -2 2 114 72 39 52 52
3112E2J27j97J41p2j17R5l4N9J2l8NO5k15J04m4N5P0k0o6O5%j2m9K0o8q6R8o9J16on2p7J53
$$ 52 179 -18 123 51 -66 29 -5 54 66 28 33 98 -117 -13 -57 -2 68 48 -18 47 47 35 -14 6 -62 -148 -50 -119 -3 -9 -61 -138 15
2824A5p7o4Q9K8L9J6n4ON9jn4J21j33J09j34Op0Q2P6J3o6N8l3J30j86R2j73J34j86J97J42
$$ 15 -62 -126 -37 -9 30 46 -8 -2 57 56 2 123 -10 99 -35 -29 -99 -17 59 72 6 64 31 161 -25 67 -106 28 -158 39 181
2552A81j64J6J4j3k5M0J1k22J78Pj2J94k04L9j14J4J33j43M9J2Nj01J08L2j51J23J22o7pj7
$$ 181 17 33 47 34 9 49 60 -162 16 23 11 205 1 40 -74 -60 73 -70 -21 -9 -4 -105 3 35 -116 7 129 62 55 38
2290C8k2Q3m2j12Q4k9m1k4n3j5K72p6l4N1q1o0K4J3l6M8Jk6J34j44J9J15q7o9R0k4K28k25
$$ 38 16 99 57 -55 29 0 -41 -65 -118 -133 139 63 29 80 -1 -61 -37 -24 -60 -12 -11 -37 97 -47 -28 87 0 -69 21 -3 225 0
2010@k0R1o0r6J46p9j19P1R1j9j24J45j17Q1J24q7j5m3j7J63j20m7l1P6m3M9o8O9N2j67J96
$$ 0 -20 71 11 -85 61 -18 -137 -66 25 6 -118 27 -90 -9 115 28 13 -30 -47 116 -4 -51 -82 -6 -49 0 -68 1 53 -114 82
1738H2o9M1M4r6j20N6NL5J42n0l5L7J8n0J0j08P1O7j02R8p7j36J30O5Q5j76l2K4J5o0Q4j00
$$ 82 13 54 98 2 -118 -62 -57 -22 120 70 35 72 90 40 50 -58 13 80 -22 76 -1 -137 -7 58 143 -33 -65 -41 -26 -86 -2 -102
1458a02J25j64J24O2j1P1j59J25r9L5N1p9J97k05J7l7R1J6%PN4n1j73Q7K9l7J27j04J58k16
$$ -102 23 -141 -17 45 34 105 -54 71 -28 7 58 -21 176 -29 -12 -49 42 58 58 65 119 68 -105 -18 11 -26 101 -3 155 -61
1196f1J23J41j07r5K3j25kl1o0K09j1J05q3p2P9J5j25P0NJ18n2j08J05p7M1Qp4J9k0K5Q5o6
$$ -61 62 203 96 1 24 -101 -103 -134 -194 15 4 109 26 -46 33 48 -77 -7 -2 116 64 -44 61 -16 25 33 -41 -22 -42 -17 68 2
916BJ1N3p4J9O4J8o9M2r0M0P4o6l9%L0j07Q4r7J37q6N8J46q3j56QJ22J3m5M6j07q0Q7j46K34
$$ 2 13 66 -8 11 75 93 24 66 -24 16 90 24 -15 -15 15 -92 -8 -105 32 -54 4 150 67 -89 -81 41 54 9 55 -52 -132 -45 -191 43
618D3n8J4N9n4j39Q2J13O1m1m0j74J4J40pj1n1M3j9n4R2L3j21J04rj25J34n2j7J28q2Lp1O5
$$ 43 -15 -1 58 4 -135 -53 60 121 80 40 -134 -120 20 13 2 -49 -6 -25 -79 13 46 -75 29 20 -105 29 -23 -40 88 6 9 -62 3
330CQ8p4o3J02l0M8L2j85J32k6M5q2J4J9J1m7L0Q3j10r4J39j36J38j12Q8j9l1M1j43J38p1
$$ 3 91 17 -46 56 26 74 106 -79 53 27 72 -10 4 23 34 -13 17 100 -10 -104 35 -101 37 -75 13 -6 -37 4 -139 -1 -72
58g2L8mP7j9n4J18mj15K2m1M1j0N4L4o3j5Q1j66J1j09N9N5J10K0j11R8K5j22L6R1L0q7j36
$$ -72 -34 -38 39 20 -34 84 80 -35 -13 -54 -13 -23 31 65 2 -13 68 -98 -87 -196 -137 -82 28 48 -63 35 60 -62 -26 65 95 8 -128
-230a28
##PAGE=	F1=-20256
##FIRST=	23146.756194512010552,	4241.1435120000014649,	0
##DATA TABLE=	(F2++(Y..Y)), PROFILE
4241A9j1L3o1m4J49jj33ml0Q2m3Q4j8j20J14m3q0J44rk05J39r2J48J3m0R1q9J9n1M8M5N0r1
$$ 19 8 41 -20 -64 85 84 -49 -53 -83 -1 -44 40 22 -98 16 -27 -107 37 28 -177 -38 -130 18 31 -9 82 -7 12 -39 9 54 104 13
3952A3J1N0j34J16o1L0O2j29J6l8r4J87k12J19K7qpj10J49r8L1L1O1j08J71j5q2JJ22Rj34
$$ 13 24 74 -60 56 -5 25 87 -42 -26 -64 -158 29 -183 -64 -37 -45 -52 -162 -13 -111 -80 -49 12 -96 75 60 -22 -21 101 110 -24
3681b4K4p0J16r1J6N6o2K1J81k07J18N9k25N7J8n7k6JJ44K8l7j6J6j38R2O0n4K5j11O5m3K
$$ -24 0 -70 46 -45 -29 27 -35 -14 167 -40 78 137 -88 -31 -13 -70 -96 -95 49 77 40 24 40 -98 -6 54 0 25 -86 -21 -64 -62
3401f2M1J57j66N1lK2k08J11j64J81O5j02mP1n3k0L7lJ6P4L4j79J2O3J33j04j0J5J35n0l6
$$ -62 -21 136 -30 21 18 40 -168 -57 -221 -40 25 -77 -81 -10 -63 -83 -46 -49 -33 41 75 -104 -92 -29 104 0 -10 5 140 90 54
3130E4J3M9L8j79J36p6j19N0RO6N2o9K2P3j79N1m8R2L5l7k7L7j3N1q1k8r5o0Q9m1J41k4n4
$$ 54 67 116 154 -25 111 35 -84 -34 -25 41 93 24 46 119 -60 -9 -57 35 70 33 6 43 30 81 0 -28 -123 -183 -94 -135 6 -18 -72
2841g2o4J53q8p3R7N8J1km9k6J09j2m9J05j27R8p7k1o3O2J13L7j13J3nJ12j26Q2j50J05j58
$$ -72 -136 17 -71 -144 -47 11 22 20 -29 -55 54 42 -7 98 -29 69 -8 -29 -92 -30 83 120 7 20 15 127 1 83 -67 38 -120
2570a20J98Q9j24K3nk8J8L7p3j87J44OPK21k20O5j70N3Q5j21M7N3l0l1R7j4j17J33Q2j7j02
$$ -120 78 167 43 66 61 33 51 88 15 -172 -28 -22 -15 206 -14 51 -119 -66 19 -102 -55 -2 -32 -63 34 20 -97 36 118 101 -1
2299aN1j2M8j0j55J27q4K5m9p5K7K12m6Nk9j5l1l7K0lM4k0o1J43j41N6P6p9j12J22L2J52j40
$$ -1 50 38 86 76 -79 48 -36 -11 -60 -135 -108 104 58 63 34 19 -12 -49 -29 -32 12 -8 -69 74 -67 -11 65 -14 -126 -4 28 180 40
2010D0PK3q1o9J25m8j54Q6R2m2m7J03j25R0P3p2Om6L6J18j13l1k6Q3n2P0q0jQ9j67J87n8L1
$$ 40 47 70 -11 -80 45 -3 -157 -71 21 -21 -68 35 -90 0 73 1 7 -39 -3 115 2 -29 -55 28 -24 46 -34 -35 54 -113 74 16 47
1721D7O0j13r8Q3k1j4J83J6o1lM7p2pr9J06k4m2Q7j05j36J44Q8R2k11K6K7m3l6J41j54J37
$$ 47 107 -6 -104 -21 -42 -56 127 143 82 79 126 54 47 -52 54 30 -12 75 -30 -166 -22 66 158 -53 -27 0 -43 -79 62 -92 45
1450D5k01J28M0J1Q2j85J11n0L5Q2j21K14k27N5l8Q2j3K8k6P7o5j48O3J0n0J63r4J50k18J68
$$ 45 -156 -28 12 23 105 -80 31 -19 16 98 -23 191 -36 19 -19 63 50 78 52 129 64 -84 -21 -11 -61 102 8 158 -60 108
1187A08P4p6j02Rj53L1k8n6J71L1J08n0j36Q7K1j13N2N7L1J8j31P8p5M2P2j24M5o3K2J40q5
$$ 108 182 106 4 13 -140 -109 -137 -193 -22 9 117 67 -69 18 39 -74 -22 35 66 84 -47 31 -44 -2 70 -54 -9 -72 -50 90 5
916Ek5N8m0O3j2Q1j12N7j38O8J04r0o5O0k4j06R7p3J09p5O7J17l8j87K5J48M1j08K6j10m3
$$ 5 -20 38 -2 61 49 130 18 75 -63 5 109 19 -46 14 -10 -116 -19 -92 17 -58 9 126 88 -99 -74 74 115 7 33 -77 -120
645a20J42j96K33o1j5P5%j95J02J06P0j8k0k11PJ06K3qn5NM1n7R8J2j05P1l2j22J33n5K2J16
$$ -120 22 -174 59 -2 -17 58 58 -137 -35 71 141 123 103 -108 -101 5 28 20 -35 -30 11 -46 52 64 -41 30 -2 -124 9 -46 -24 92
365I2j02N6j08O2O7o8p1J16j0N1J6j87J64j7K5r8%M6K2m2k2N2l2j02R3p3R9p6J14l2o0O9j61
$$ 92 -10 46 -62 0 67 -1 -72 44 34 85 101 -86 78 61 86 -12 -12 34 56 14 -8 44 12 -90 3 -70 29 -47 67 35 -25 44 -117
76a17R3k0nj7J09K2j04R3J6n9l6o5P3q3Q0L8k0L5O2j83jj19J16N4J8Q8q9Q7J0q8j4J09J1r3
$$ -117 -24 -44 -49 -66 43 65 -39 54 70 11 -25 -90 -17 -100 -20 18 -2 33 95 -88 -89 -208 -92 -38 -20 68 -21 66 76 -12 -26 83 94 1
-222Aj02
$$ 1 -101
-230a01
##PAGE=	F1=-20350.4
##FIRST=	23146.756194512010552,	4241.1435120000014649,	0
##DATA TABLE=	(F2++(Y..Y)), PROFILE
4241D2j1K0q0o7J46L2j41pj4O5J6Q7m2j48J13Lr6J20k0j64J34j00J60jp7M1p6M2j4M3M1M4
$$ 42 31 51 -29 -96 50 82 -59 -66 -80 -15 1 88 46 -102 11 14 -82 38 18 -146 -12 -112 48 47 -30 11 -65 -23 -37 6 47 91
3961I1p2OL6j10P9pK2N4r9m3o1p9K34k52J01L1KO7j09O6o5M5L9O4j70J39M3j10N4J60o7r2
$$ 91 19 25 61 -49 30 23 45 99 0 -43 -104 -183 51 -201 -100 -69 -67 0 -109 -43 -108 -63 -24 40 -130 9 52 -58 -4 156 89 -3
3681ck7n8J38j06M6P9j07lK25k11Q1N0j96R2pr2k4L8J08L0J8j6jj54J14N5r1O2j33K0M2k9
$$ -3 -30 -88 50 -56 -10 69 -38 -41 184 -27 54 104 -92 0 -7 -99 -123 -85 23 53 71 55 54 -100 14 69 -22 40 -93 -73 -31 -60
3401f0L8R7p7P4p8Mj24M0j00J24Q1j21N7M2j07O3krL9L1O0j54J5L0J07r9K6L0J25p0j7J6Q3
$$ -60 -22 75 -2 72 -6 -2 -126 -86 -186 -62 19 -102 -45 -3 -110 -47 -49 -58 -19 12 72 -82 -67 -37 70 -29 -3 27 152 82 65 81 164
3112A64n6j09Q1o6j05M3J5M9O9p5M8N8j19L0q9J23j4n0PJ8PQ5q4p9j17l5O7kJ38j8m8o2J37
$$ 164 108 -1 80 14 -91 -48 -33 16 85 10 58 116 -3 27 -62 61 47 -3 4 22 29 114 30 -49 -166 -201 -134 -136 2 -16 -64 -126 11
2824A1r7o9R1N7K6l5k9o0J63l7l9P2q2P9k7m5m3K2J34N2j39k1K4N6n9O9q8M2j04J59L5p2M3
$$ 11 -86 -155 -64 -7 19 -16 -45 -105 58 21 -18 54 -28 51 24 -21 -64 -42 92 144 5 -16 8 64 5 74 -14 28 -76 83 118 46 89
2535H9j6n4P0K7j60j14J02qJ7K22k08R4j93N8N2q4L0Q1o3K9P5j8p8Q0M6M1j81J30n6O4K6j68
$$ 89 73 19 89 116 -44 -158 -56 -64 -47 175 -33 61 -132 -74 -22 -106 -76 5 -58 -29 46 28 -50 30 76 117 -64 66 10 74 100 -68
2255f8J24j15P2o3o4O6R1j1O4j10L1jq9K8N2J7m9n7J10p9P1J1n1j48J45N5Q3m3J0l8r2k0R3
$$ -68 56 -59 13 -50 -114 -48 43 32 96 -14 17 16 -73 -45 7 24 -25 -82 28 -51 20 31 -20 -168 -23 32 115 72 82 44 -48 -68 25
1966B5Kj72P9P8n3K5M0r2O8K4m1J3n4R6O8j07j1QQ3p2M5n3m7J07j60J79o8jP2j02n6J05m9
$$ 25 27 -145 -66 12 -41 -16 24 -68 0 24 -17 -4 -58 38 106 -1 -12 -4 79 7 52 -1 -48 59 -101 78 10 9 81 -21 -77 28 -21
1677b1n5J66J10j12kK5m4k7p4J13p9k2R7r8j43J19J09R8k23O5K5o4k5J67j60R4k06J29M0J4
$$ -21 -76 90 200 88 86 111 67 40 -34 79 0 -22 75 -23 -166 -47 62 160 -63 2 27 -37 -62 105 -55 39 -167 -38 2 16
1415A6P2j88R7J1L5Q9j42K02k23R1n7L9k5O1n7Q8n7j17M0k2j4J64r9J21j76K12qn9r7K3j57
$$ 16 88 -100 -3 8 43 132 -10 192 -31 60 3 42 17 78 21 109 52 -65 -25 -47 -61 103 4 125 -51 161 153 94 -3 20 -137
1143a37K3Qm9J18M7P9j5j69R9M2j02L0P9k9O9j59L5k6K7J12j58O1p9RJ81r8n2N8j5J05q5J08
$$ -137 -114 -106 -155 -37 10 89 74 -95 4 46 -56 -26 53 24 93 -66 -31 -57 -30 82 -76 -15 -94 -85 96 -2 -54 4 -11 94 9 117
863A17j15O0j33O7J36j01r1Q6q2p8J07l3P8n9P0P1K6k18L0J74J3j13m2o9J3J71k14J70m1l8
$$ 117 2 62 -71 -4 132 31 -60 26 -56 -134 -27 -60 18 -41 29 100 126 -92 -62 112 125 12 -30 -99 -86 85 -129 41 0 -38
601c8R5P8k31J17L2J07oNk09oM0N3K4q2l4R0n4R7Nq9Kj8q4R9n0O1M4r1J11j25O1L2n3o7J17
$$ -38 57 135 -96 21 53 160 154 159 -50 -56 -16 37 61 -21 -55 35 -19 78 83 -6 -4 -22 -106 -7 -57 4 48 -43 68 -57 4 36 -17 -84 33
295C3J2N1nj69J58lLq3pN7L0k3r7L6L5q1K9k1O7m7J30m8q2Q7j43M7J1j5l8J22M3j18P1J4J0
$$ 33 45 96 91 -78 80 77 80 -3 -10 47 77 54 -43 -7 28 -53 -24 -45 22 -25 105 57 -25 62 -81 -34 -23 -38 -76 46 89 -29 42 56 66
-12F6j22l5O5j55Q9Q1LP9M3j67J2j45J40M2n2J14n2O3Pk3o5Q4Lp6l2
$$ 66 -56 -91 -26 -181 -92 -11 -8 71 114 -53 -41 -186 -46 -4 -56 58 6 69 76 53 -12 72 75 -1 -33
-230c3
##PAGE=	F1=-20444.7
##FIRST=	23146.756194512010552,	4241.1435120000014649,	0
##DATA TABLE=	(F2++(Y..Y)), PROFILE
4241E7pJ3q9p6J20O5j27l8oL7R0P5m6j52Q9L2p1O9pj37J19p4J07or3%n0N6K0K2L0L5l2lKp1
$$ 57 50 63 -26 -102 18 83 -44 -82 -88 -51 39 114 68 -84 5 37 -34 35 28 -109 10 -64 43 37 -56 -56 -106 -50 -30 -8 22 57 25 22 24 -47
3926d7M5O2MJ9l8j01n2p1K35k61Q6L9J1J05j00Pl4M8K3O7k20R5J08j03Q9J56j29k6o9n8J63
$$ -47 -2 60 64 83 45 -56 -108 -179 56 -205 -119 -80 -69 36 -64 -57 -91 -43 -20 47 -173 -78 30 -73 16 172 43 17 -52 -110 53
3655E3j16P1J00j08n0K21j85M8L3j50J04l2r9lO1L7L9N7Pk5j48J00P9j27O9j22j7J14m4J4
$$ 53 -63 8 108 0 -50 171 -14 34 67 -83 21 -11 -110 -113 -52 -15 24 81 88 63 -85 15 94 -33 36 -86 -103 11 -33 -19
3392a9J9lQ2j13kk8l7k6M3R4j18Q5K1j44J31m7j5R2j5P7j29RK2O9q0M2N1Q8r6J7J5P5j03j2
$$ -19 0 -3 79 -34 -36 -64 -101 -127 -84 10 -108 -23 -2 -146 -15 -62 -77 15 0 77 -52 -43 -21 48 -32 10 61 149 53 70 85 160 57 45
3095D5j4k4q7N6J1KO5p2Q7K1n7M2j51J40o4m1K0J9L5R7p0j16j13j7K9L3J20jl4p6J10j12m2
$$ 45 31 7 -80 -24 -13 -11 54 -18 69 90 33 75 -76 64 0 -41 -21 -2 33 130 60 -56 -169 -186 -157 -124 -4 -5 -39 -115 -5 -117 -159
2806a59P5K4P1n2J2j04K10r3k4M3j5N3J8p3j9j5J31N8j40m3M5loN6j5k8m0J09j8n0P9pq8J20
$$ -159 -84 -60 11 -41 -29 -133 77 -16 -40 3 -12 41 59 -14 -33 -48 83 141 1 -42 3 0 -6 50 35 7 -33 76 58 8 87 80 -8 112
2509A12J3k22l1P4k3kJ86j52J12j78L6M8m8NJ00r3L7O7Jl8j8L0Q8j96J64j22J16O8j56R0j23
$$ 112 125 -97 -128 -54 -77 -79 107 -45 67 -111 -75 -27 -75 -70 30 -63 -26 41 42 4 -14 16 104 -92 72 -50 66 134 -22 68 -55
2237e5P5p0j3Q9l3J2J16j60L1K3j12M1J07k0q0j6M2K0O2n8j0j71J35N2M5J4qo3q4M3N1M5j58
$$ -55 20 -50 -63 26 -7 5 121 -39 -8 15 -97 -56 51 31 -49 -65 -23 -3 59 1 -9 -180 -45 7 52 66 58 -5 -89 -46 5 50 -108
1948a08O5M4m5O7j2l7K5Jj5oo0J47K9j12J6L9P9r3J0j4o7J14j52J72q2m0P2j00J0J19o7o3
$$ -108 -43 1 -44 23 11 -26 -1 0 -15 -21 -81 66 95 -17 -1 38 117 24 34 20 -47 67 -85 87 5 -35 37 -63 -53 66 -1 -64
1668f4R1J94j69L5l1J7m7m1Q8q3j8J11o3j54O8J26R5k10O1L2m8l8J49j09J1j57J32N1k4M1
$$ -64 27 221 52 87 56 73 26 -15 73 -10 -28 83 20 -134 -66 60 155 -55 6 38 -10 -48 101 -8 3 -154 -22 29 5 46
1406D6j49Q5N7K9P4j24J64j99J07q3rrO6p4Q5k9r5M3o6M7J31j09P1j09K30o0n7q8O2j23l1
$$ 46 -103 -18 39 68 142 18 182 -17 90 7 -2 -11 55 -19 66 37 -58 -15 -81 -34 97 -12 59 -50 180 120 63 -25 37 -86 -117
1135a17O9n3Q4M0J8Mj52J05N3q8PO9l0P1j78MK8K8J06j54M5n6j4J91r6n9N7nJ38j36R1q1M7
$$ -117 -48 -101 -17 23 41 45 -107 -2 51 -37 -30 39 9 80 -98 -94 -66 -38 68 -86 -41 -97 -111 80 -16 -75 -18 -23 115 -21 70 -11 36
846C6r4M9J48q0j20P6j23l4J24%M9n6P6K1R0k29K3J89n4p0j26j0N7J58j73O8Nm7J09J49k40
$$ 36 -58 -9 139 59 -61 15 -108 -142 -18 -18 31 -25 51 72 162 -67 -44 145 91 21 -105 -115 -58 100 -73 -5 0 -47 62 211 -29
575b9J17q3J60qJ1j61nl2O9O5j14n0J09o3R9Pq0p2K9l4N3l9Q8n7n4J39j19P8j1m2n1R5J9N9
$$ -29 88 5 165 157 168 7 2 -30 39 104 -10 -60 49 -14 85 92 12 -60 -31 -65 -12 -51 37 -20 -74 65 -54 24 13 -29 -80 15 34 93
277I3oj45J22J1j2m5qM2K8Kj59K4R4m5m2J0N8l9J26m7q6P8j20M4mK1n8J14M0r8N2jP1k10L6
$$ 93 87 -58 64 75 63 18 10 52 80 82 -77 -53 41 -4 -46 -36 22 -17 109 62 -24 54 -66 -22 -26 -5 -63 51 91 -7 45 44 115 -95 -59
-29e9K8k11P9J50OJ06K4j38M5j75J28K5p6Q3nM4J0L5r0L1J5n9M2
$$ -59 -31 -242 -163 -13 -7 99 123 -15 30 -145 -17 8 -68 15 10 54 64 99 9 40 55 -4 38
-230C8
##PAGE=	F1=-20539.1
##FIRST=	23146.756194512010552,	4241.1435120000014649,	0
##DATA TABLE=	(F2++(Y..Y)), PROFILE
4241E6OPq8o6R2Q0j01p0j4PJ39P4n3j24M1L6j2OL2j23J05m1J9pq4k4rO8L7j6J4K1Kkk2k7J3
$$ 56 62 69 -19 -85 7 87 -14 -84 -98 -91 48 122 69 -55 -14 22 10 16 48 -75 30 -11 8 1 -83 -107 -116 -48 -11 -27 -13 8 10 8 -14 -41 -28
3917b8J13l2oK3j39Rq2J87k27Q8L3QJ09r8j0qL3nO9k22M3J52p8R2J25j55M0r8o5J90j40J03
$$ -28 85 53 47 70 -69 -60 -142 45 -182 -94 -61 -53 56 -42 -52 -60 -27 -32 37 -185 -142 10 -68 24 149 -6 34 -64 -129 61 -79 24
3637B4J06n8r9J65j52N0J9j16R6m7q5J9O9m7N7O8M1m7j25M3J38j37L7p5n1J57m3j2m1L2P4
$$ 24 130 72 -27 138 -14 36 55 -61 35 -12 -97 -78 -9 -56 1 69 110 63 -62 -19 119 -18 19 -56 -107 50 7 -5 -46 -14 60
3366F0j09j1N2q1Jj0R4q5O6J5j62J80r7j1J61o2R2j27LL5L8n1K1Q4M4j20N8pK6q3P8j23M2
$$ 60 -49 -60 -8 -89 -88 -98 -4 -89 -23 -8 -170 10 -87 -98 63 1 93 -34 -31 4 42 -9 12 96 140 20 78 71 97 14 92 -31 11
3077A1o2N1L7o8M6o5J25j4k3O5j89J36r9pKM3M2R8n2j31p2j2qL7J07J2j6j04Q3j24J4K6oJ09
$$ 11 -51 0 37 -31 15 -50 75 61 38 103 -86 50 -49 -56 -54 -11 31 129 77 -54 -126 -138 -146 -109 -2 10 -6 -110 -27 -151 -137 -111 -117 -8
2780hm4O8j42K32j72nL6M6OO0r2Ql5R7N8j13n8M6l4K6M8L8p4PP0n3o8J17J2j12J51mk37K2
$$ -8 -52 16 -126 106 -66 -71 -35 11 17 77 -15 -7 -42 55 113 0 -58 -12 -46 -20 28 66 -8 -1 69 16 -52 65 77 -35 116 112 -125 -103
2482a03P3k6n0J32p1J09j25NN6k0k2J13j20jP9J1Jj19K8J30j50J35j66J67J04j24L3j19N4
$$ -103 -30 -56 -106 26 -45 64 -61 -56 0 -20 -42 71 -49 -50 29 40 41 -78 -50 80 -70 65 -101 66 170 46 79 -40 14
2229A4p3O2Q9j16K4J37j72lL1r9O1J25l5j07L3l3J00M9r2J7j68R2L6L4J5l5m4o2J04PN9j13
$$ 14 -59 3 92 -24 0 137 -35 -38 -7 -106 -45 80 45 -62 -29 -62 38 87 -5 12 -156 -64 -28 6 21 -14 -58 -120 -16 -9 50 -63
1948f3N6ok7Q3k6Rk2K0j9m3o4J67K6j30M7M5O5j01Oop2J23j30J46q0o6O0j22Q3J23p5l6KK31
$$ -63 -7 -13 -40 43 17 26 4 24 5 -38 -102 65 91 -39 8 53 118 17 23 17 -55 68 -62 84 4 -62 -2 -124 -41 82 7 -29 -27 204
1651B04k06Q2r2P4n3k1N0m6rJ15k4j60K0J34Q1j80K1M6j4o2R7l2o6o8J34N3r3%o9P4O8RN0
$$ 204 -2 80 -12 62 9 -12 38 -8 -17 98 74 -86 -66 68 149 -31 -10 36 22 -40 57 25 -41 -109 25 78 -15 -15 -84 -10 58 67 117
1362A17o4J06j65J00r6l6L2J9o9P8lp6O4j09R0R2j02Pm5K04p0o2p0J11n9j02J26p7Q3K4m9
$$ 117 53 159 -6 94 -2 -38 -6 13 -56 22 19 -57 7 -102 -12 80 -22 -15 -60 144 74 12 -58 53 -6 -108 18 -59 24 48 -1
1091aQj01R8K8o5j2N1J7J8j56j2M7O1N4j03jj2m4J67p4m5N8lJ59j60M7k9J8n4K4J31k0j55
$$ -1 7 -94 4 32 -33 -45 6 23 41 -115 -127 -80 -19 35 -68 -69 -81 -125 42 -32 -77 -19 -22 137 -23 24 -5 13 -41 -17 114 94 -61
802f1N7j37OJ45NK6o5Q5k4J34k11J7J82j18j3j74J9P1J18q3l1N1l4R5J82k15J04j85J97j2
$$ -61 -4 -141 -135 10 15 41 -24 61 37 171 -40 -23 159 41 28 -146 -127 -56 62 -21 -52 -1 -35 60 242 27 131 -54 143 131
540A31j1q6J8q4O1R0j21l6Q4p8J04Qo7j22Q1LJ6k6R9j45lJ28r1J13n4n4k7N4RQ1J1j19P4J8
$$ 131 120 34 52 -32 29 119 -2 -38 46 -32 72 80 13 -109 -28 -25 -9 -35 64 -81 -84 44 -47 66 12 -42 -69 -15 -6 75 86 -33 41 59
242E9j5jnlJ5L5j78J1J46k4j10K7O8m0R2k0p1L9j04Q5o4R3o5Q0K9o5L6j6J07k69J07%k43O2
$$ 59 44 43 38 35 50 85 -93 -82 64 40 -70 -43 25 -15 77 57 -14 25 -79 6 -58 35 -30 50 79 14 50 34 141 -128 -21 -21 -264 -202
-55b02J99PJ22Kj21P8j89J00No1J8M0L9PN7p8k2M2n4Q6
$$ -202 -3 4 126 128 7 85 -104 -4 1 -60 -42 -2 37 44 101 23 1 43 -11 75
-230G5
##PAGE=	F1=-20633.4
##FIRST=	23146.756194512010552,	4241.1435120000014649,	0
##DATA TABLE=	(F2++(Y..Y)), PROFILE
4241D0K7qp9m1P5O3o9p6k8k0J35J04p5p3l0L1N6n2Q1j04R9l5n3j1n1l4K5P7L6o0LJ7OPj3J2
$$ 40 67 59 -20 -61 14 77 8 -68 -96 -116 19 123 48 -25 -55 -24 32 -20 61 -43 56 21 -32 -43 -94 -128 -103 -26 10 -50 -47 -30 -24 -17 -30 -18
3926a8j7J18q1PN4j47J02r5J06j65J19rnR8j07nJ8Qk3O6j74j0J65n3O1Q6j37Q6j08p3K06j80
$$ -18 -35 83 2 9 63 -84 18 -77 29 -136 -17 -26 -31 67 -40 -45 -27 -19 -42 24 -150 -160 5 -48 13 99 -38 48 -60 -133 73 -107
3646a07J44R0J8j27R3j44R4J3j00P2m7n5J0P5j17O8O2P7n8r9m1K20j18k1nr3J60k3k0n7J9
$$ -107 37 127 145 18 111 -33 61 74 -26 46 -1 -56 -46 29 -88 -20 42 119 61 -38 -79 141 23 2 -3 -96 64 41 21 -36 -17
3375a7N3q2m3J11p2m6mP5l3K7J8j66K12j46PK05r5J01j45J1N4K8l2k9J29J3j37R0m7m0qJ24
$$ -17 36 -46 -89 22 -50 -96 -100 -25 -58 -31 -13 -179 33 -113 -106 99 4 105 -40 -29 25 53 21 -8 121 134 -3 87 40 0 -8 116
3095A16k10J02k9J3J09j32J8n7J44k4l4P4j71J18j10L2l0P2J6R3l5j22rk2j8KJ08RJj44Q1
$$ 116 -94 8 -21 -8 101 -31 -13 -70 74 50 16 90 -81 37 -73 -41 -71 1 17 110 75 -47 -56 -78 -96 -94 14 23 24 -120 -39
2824c9j20Q4o1rJ14k6J23j45K09k37QM8Q5p0R7q2L4l2K8N6o5o3K1k4M1M1N4p8K4M3o0r4J33
$$ -39 -159 -75 -136 -145 -31 -57 66 -79 130 -107 -99 -51 34 -36 61 -21 13 -19 9 65 0 -63 -42 -66 -25 16 70 -8 16 59 -1 -95 38
2535C8K8j14J47j6k11L7Q7j3j02Q8lP6m4j9N7Mn0J22j44m6R7JK5j75J8J83r6P7j57J77J12
$$ 38 66 -48 99 83 -128 -91 -4 -17 -119 -31 -34 42 -2 -21 36 40 -10 112 -32 -78 19 20 45 -130 -112 71 -25 52 -105 72 184
2264A84o9l7j08M6q1J25P0j49L7J21j56l4J4o7R7Q3j2j22N5p5J19M8p7K0j31L2J9K8j2n4j
$$ 184 115 78 -30 16 -65 60 130 -19 18 139 -17 -51 -37 -104 -7 76 64 -58 -3 -78 41 89 12 32 -99 -67 -48 -20 -32 -86 -87
1992h7l8J34k9N5n8M2m7j8R5JJ7m6O4n2q4p1J52O3j45P1K2M3r1M0m3p4J40q5Q7n5p0M3j48
$$ -87 -125 9 -20 35 -23 19 -28 -46 49 50 67 21 85 33 -51 -122 30 93 -52 19 41 84 -7 33 -10 -84 56 -29 58 3 -67 -24 -172
1703a72J37J15q4Om8K09k09J15j34R5l2l1L3lJ2R9pj51OJ27O0j36l4N4K7q3L9L3j09J3J35
$$ -172 -35 80 -4 2 -46 163 -46 69 -65 30 -2 -33 0 -3 9 108 101 -50 -44 83 143 7 -27 27 54 -29 10 43 -66 -53 82
1432H2M1j68k9K7N6M2j8K8J3M8j34P9q0k8P6p0m7Q0Kn1Q0j39R2P3o0o2qJ43n7n8m6J55Qj54
$$ 82 123 -45 -74 -47 9 51 33 61 74 122 -12 67 -13 -41 35 -35 -82 -2 0 -51 29 -110 -18 55 -5 -67 -75 68 11 -47 -93 62 70 -84
1135h4J53j19J08J1q9J3n8Q4k6l7k3M3P6o4p8k8K0J15k1j7m8J6p5J22m4rN5jJ66j51rK6k6
$$ -84 69 -50 58 69 -20 -7 -65 19 -7 -44 -67 -24 52 -12 -90 -118 -98 17 -4 -21 -69 -53 -128 -6 -50 -59 -4 -5 161 10 1 27 1
846Ak4j7R9N8j84N2j23K7J56j5J4p6Q4n0J42j77L3J41j43L3j55qN0Q2J8q8P3lL5J66j57Q6
$$ 1 -23 -40 59 117 -67 -15 -138 -111 45 30 44 -32 52 2 144 -33 0 141 -2 31 -124 -132 -82 0 18 -70 3 0 35 201 44 130
566A30k26J86mm0k0N1r8K5Q7q7qK2o8R8Jl6j37J06K2j2j9J10j95M7Q7m6J38q4q6lMjJ02L1
$$ 130 -96 90 86 46 26 77 -21 4 91 4 -4 18 -50 48 49 13 -124 -18 4 -8 -27 83 -112 -65 22 -24 114 30 -56 -59 -55 -56 46 77
268G7r0L2J2oL1jo5KP6j45QJ66k3j75M8Q1l8L5J9m8nr2J38j45J81o3K2K6l0J6k9J22k74J33
$$ 77 -13 19 31 25 56 55 -10 -8 68 -77 -69 97 74 -101 -53 28 -10 25 44 -4 -9 -101 37 -108 73 10 32 58 28 44 15 137 -137 -4
-29dJ2k48M8J86K5J36k3j18Q4j66O8j4l1m5P0N0j2M2l7n1O8o2Q3
$$ -4 8 -240 -192 -6 19 155 132 14 98 -68 0 -14 -45 -90 -20 30 18 60 23 -28 40 -22 61
-230F1
##PAGE=	F1=-20727.8
##FIRST=	23146.756194512010552,	4241.1435120000014649,	0
##DATA TABLE=	(F2++(Y..Y)), PROFILE
4241A8N1l1o6k1O8K0k8n3l2m5Q7J54j03j9j06L7R3q0J11o7J01o5p3k5Jl4K7P4K7j04J5L2k5
$$ 18 69 38 -28 -49 19 39 11 -42 -74 -119 -32 122 19 0 -106 -69 24 -56 55 -12 89 24 -49 -74 -73 -107 -80 -6 21 -83 -68 -36 -61
3952f1J7K9L2m2Q4j27N2N5j30J81r5K4j03J69q5j9R3j21j0N7j4k0N0r9n9J62m5K3L5p8J08
$$ -61 -44 -15 17 -25 59 -68 -16 39 -91 90 -5 19 -84 85 0 -19 74 -47 -57 0 -14 -34 16 -83 -142 20 -25 -2 33 -45 63
3681F3j04o9J89k10J80N2Q7j26M0j71J65Pq9L6l5j0m0R0j55N5O0J07n7q4j17K94q2q1O7j39
$$ 63 -41 -110 79 -131 49 101 188 62 102 -69 96 103 14 50 15 5 -35 55 -100 -45 15 122 65 -19 -136 158 76 -5 62 -77
3419g7J17ONl3l2K7n7q6J58l0j32M1N2OPJ7j52K27j84K9J98j06R9j60K7O3M2l6p8J79mj43
$$ -77 40 46 51 18 -14 13 -44 -130 28 -2 -134 -93 -41 -35 -28 -11 -163 64 -120 -91 107 1 100 -60 -33 30 72 36 -42 137 133 -10
3139a0J02q7r4P3J23k48J30%l8K00j57j8m2J29np4O0j05J00r8N2n9Q5k5Q7k4r2M4m3J5n8J16
$$ -10 92 5 -89 -16 107 -141 -11 -11 -49 151 -6 -24 -66 63 58 -16 44 -61 39 -59 -7 -66 19 -6 81 57 -35 9 -34 -19 -77 39
2859C9j1J2j83J13r5J41j53OR3k7J60r6J38k56QO6Q8j43J15l2M4j3o0N6k1n2nJM2L4L9m2R
$$ 39 28 40 -143 -30 -125 16 -137 -131 -38 -65 95 -1 137 -119 -111 -45 43 -100 15 -17 27 14 -46 10 -11 -63 -68 -67 -25 9 48 6 15
2570A5K2m1r0J11L6r5J09j5j65K6R2J2j30O5K6K0L5k6M8L3q4J25j56n3R3j5K1j69kK41r1M9
$$ 15 37 -4 -94 17 53 -42 67 52 -113 -87 5 17 -113 -48 -22 -2 33 7 55 88 4 129 -27 -80 13 -2 19 -150 -152 89 -2 47
2290D7j08J38P8Pj01r2P5r9J40M6j49P1P2j38l0j8m4J43nM2j23L4n2P8M8k2ln6l0J3lj6m4
$$ 47 -61 77 155 162 61 -31 44 -55 85 131 -18 53 125 -13 -43 -61 -105 38 33 75 -48 -14 -66 12 60 38 35 -21 -51 -38 -41 -57 -101
2001a01K6k4J19m9N2k1K1n7l0J24L2j8l0J05r4j13p8J12J12j31O8mJ6o8R1j06p9J58j7lj3
$$ -101 -75 -99 20 -29 23 2 23 -34 -64 60 92 74 44 149 55 -58 -136 -24 88 -43 25 21 37 -31 60 -46 -125 33 16 13 0
1730@o3L0j44J53R0j04M9l6J40j80J26j40O5Ro5O1J4K8O7j5j27L6J01L8q2p8M2O4q3%N2j03
$$ 0 -63 -33 -177 -24 66 -38 11 -25 115 -65 61 -79 -14 -5 -70 -9 5 33 100 85 -42 -6 95 133 51 -27 15 79 -4 -4 48 -55
1450e5L4J34M2k27k9R8K9j4l1J4P6Mj13O1l5jJ07j67k6R4j0j9P3j45N5P7J1j18lQ2n0m3j4
$$ -55 -21 113 155 -72 -101 -3 26 12 -19 -5 71 75 -38 23 -12 -13 94 -73 -99 -5 -15 -34 39 -106 -51 26 37 -81 -84 -2 -52 -95 -109
1161a09J71N1j62J32j54J36Lq0K4n4P2p5j9j7L7J20j32L0n4l3J63r1P6o6Jr4P4j3L6M0kJ68
$$ -109 62 113 -49 83 -71 65 68 -12 12 -42 30 -45 -64 -81 -44 76 -56 -26 -80 -113 50 -41 35 -31 -30 -124 -50 -63 -27 13 11 179
881A79j11o8P2p3Jp5P2J18j85O2r3K2J49m2K0p9O1n2J12j40P0P2j24O8q6p5J1O2R4q8O5L1
$$ 179 68 0 72 -1 0 -75 -3 115 -70 -8 -101 -79 70 28 48 -31 30 -22 90 -50 20 92 -32 36 -50 -125 -114 -52 42 -46 19 50
601E0n8J12p9O3j86J24J3n0J5P4q0k9O5k3J2m7k4P9j9J4j20Q3M1m5k0J39k14Q4L4NJ31q8j22
$$ 50 -8 104 25 88 -98 26 39 -11 4 78 -2 -31 34 11 23 -24 -48 31 12 26 -94 -11 30 -15 -35 104 -110 -26 8 13 144 56 -66
312f6J3m0QR6L6m7lMOM1Nj27NJ20p4J6J34l3k21Q2P7l2k2M8l6l1n6J53k08K54n9m7L3Pj3m1
$$ -66 -53 -93 -85 11 47 0 -3 1 7 48 53 -74 -69 51 -23 -7 127 94 -127 -45 32 0 -22 26 -10 -41 -97 56 -152 102 43 -4 29 36 23 -18
-3a8J30k30J13O1k27L0J08N1J55m5j06M7j02L7l4jq0P5O5l2J2Mm9Q3p6M1
$$ -18 112 -118 -5 56 -171 -141 -33 18 173 128 22 69 -33 4 -30 -31 -111 -36 29 -3 9 13 -36 47 -29 12
-230A2
##PAGE=	F1=-20822.1
##FIRST=	23146.756194512010552,	4241.1435120000014649,	0
##DATA TABLE=	(F2++(Y..Y)), PROFILE
4241BP1n7m4k2O0l4K4k2j1o9K7J79j09K6j68O6P4n6R5k3J05j13l8l6N3k6j1N3J6j34N4O2p4
$$ 2 73 16 -28 -50 10 -24 0 -22 -33 -102 -75 104 -5 21 -147 -81 -7 -63 32 9 114 1 -37 -73 -20 -46 -57 -4 12 -122 -68 -6 -80
3952h0K1P3L4o3N2j59R8M7r7J95p4l4n9K09j63k4J03j31l2J03k6jK5l3r6J51m8ok6%J18r3
$$ -80 -59 14 48 -15 37 -122 -24 23 -74 121 47 13 -46 163 0 -24 79 -52 -84 19 -7 -8 17 -16 -112 39 -9 -15 -41 -41 77 -16
3672a6m7J36k05K01kJ20j11K5k08K28j1o7nj5N1j08J01j48J8O5J23n2p8j50L22n1j16J14j67
$$ -16 -63 73 -132 69 67 187 76 101 -107 121 110 43 38 23 74 -34 67 -81 -63 2 125 73 -5 -155 167 116 0 114 -53
3419e3M1L3N2Nr6Qn4j05J87K2j96O5N2QK1Pj16K20j99L9J46q5P4j48L2N5O9n9r2K11j4j40
$$ -53 -12 21 73 78 -18 -10 -64 -169 18 40 -156 -91 -39 -31 -10 -3 -119 101 -98 -59 87 2 76 -72 -40 15 84 25 -67 144 130 -10
3139a0R3r7j20J15Q8k34J29Qo5K57j26n3k9R2K4j10L1l7R5o9M4p0O2n2Q9k0n2O3o5Q2j11J04
$$ -10 83 -14 -134 -19 69 -165 -36 -28 -93 164 38 -15 -44 48 72 -38 -7 -44 51 -18 26 -44 18 -34 55 35 -17 46 -19 63 -48 56
2859E6l5J4j94J59o3J69k00PO7n2J67j2M2k23nP8N3j67J05M0K4J5j42O6ok8pJ8J9L5J5J1k5
$$ 56 21 35 -159 0 -63 106 -94 -87 -20 -72 95 83 125 -98 -103 -25 28 -139 -34 6 30 45 -97 -31 -37 -65 -72 -54 -35 0 15 26 1
2570AKnm9N5M0o7N3Jj26J6P8M0j26N1K4m6P6j0L7O9j18J14j42j1N9k3kj26k7K88j42P3n8P8
$$ 1 3 -2 -51 4 44 -23 30 31 -95 -79 -1 39 -87 -36 -12 -58 18 8 45 114 -4 110 -32 -43 16 -7 -9 -135 -162 126 -16 57 -1 77
2272G7NQ6j29p6J28j23R9K9j37J21J4j29Qm5m9J89r1Q5j10j9L2K3K7L3l3L9q0K2o2K4kJ5l2
$$ 77 82 168 39 -37 91 -32 67 96 -41 80 94 -35 -27 -72 -121 68 -23 62 -48 -67 -35 -12 15 48 15 54 -26 -4 -66 -42 -44 -29 -61
1983f1P4n4O0qll0n8J62L9p4J2J23j11j31p8O5J36p5L6j1pm7J26j46r1J58N6r1K2n7K2r6J38
$$ -61 13 -41 19 11 8 -22 -80 82 121 47 59 182 71 -60 -138 -73 63 -12 24 13 6 -41 85 -61 -152 6 62 -29 -7 -64 -42 -138 0
1695@M6j24Q0J5N4j40J20j01kM4r5J24%J9K7k6r6R2O4J7l3j07K3R1o6j1L0o5j6J39P6k64K
$$ 0 46 -78 2 17 71 -69 51 -50 -52 -8 -103 21 21 40 67 41 -55 37 101 118 85 -22 1 92 26 15 45 -20 -36 103 179 -85 -83
1406h3J18Jq0k5J3J08k6j02O3J2K7J17k27l1J12j4kN8j33J0Q6Q6j52k0N8o4k0K4J46N3j24
$$ -83 35 36 -44 -69 -56 52 26 -76 -13 -1 26 143 -84 -115 -3 -17 -19 39 -94 -84 2 88 -64 -84 -26 -90 -110 -86 60 113 -11
1135a1O6j56J52j1k2L1r2O5p8k6MK1J37j50J13p8q4J82j30J44n2n2r1M1K3N4J8j0J64n0j20
$$ -11 55 -101 51 40 18 49 -43 22 -56 -82 -78 -57 80 -70 43 -35 -119 63 -67 77 25 -27 -118 -77 -54 0 18 8 172 122 2
863BR4r9L8j38N7J34j39N8n9kJ25n3N3q3J8l4O2r7R7lq4J02j0j36l1N0J24m3M3N7j49M9pL9
$$ 2 96 -3 35 -103 -46 88 -51 7 -52 -54 71 18 71 -12 6 -28 34 -63 34 31 -53 49 39 -97 -128 -78 46 3 46 103 -46 3 -4 35
566C5r0L5J9k8K4O8n7p5M6L5K3r3L8N4n1P0q9K5P6r1k5J85k15R1j0N2Q8o9j37J6o5L1N8K6
$$ 35 -55 -20 -1 -29 -5 63 6 -69 -23 12 35 -58 -20 34 -17 53 -36 -11 65 -26 -51 134 -81 10 0 52 140 71 -66 -50 -115 -84 -26 0
268@Ql4J0QL6Nj56K6J40J1K3O2l5k28J15M9l4n0N3m5l0J2J10k32K98o7j01M4M9n3n8J50j60
$$ 0 8 -26 -16 -8 28 33 -123 -97 43 54 77 139 104 -124 -9 40 6 -44 9 -36 -66 -54 56 -176 122 55 -46 -2 47 -6 -64 86 -74
-20g4P3J09j80Lj1O7J73n8o3k7j6J3n0J7q0N0P6l4pK6k7Q3q3k4
$$ -74 -1 108 -72 -69 -80 -13 160 102 39 12 -4 9 -41 -24 -104 -54 22 -12 -19 7 -20 63 -20 -44
-230d4
##PAGE=	F1=-20916.5
##FIRST=	23146.756194512010552,	4241.1435120000014649,	0
##DATA TABLE=	(F2++(Y..Y)), PROFILE
4241cQ0p2j0m4L8p2P0lL3q3j8J39p5N4j97J15%J7L7PJ03j46J8l5R1k0o5K7Mj48J07R2j18K3
$$ -3 77 5 -5 -49 -11 -83 -13 -16 17 -66 -84 55 -20 34 -163 -48 -48 -31 6 13 116 -30 -12 -47 44 24 -41 -14 -10 -158 -51 41 -77 -54
3944e4R3K0q0N9j69J09N3o0J29m3n4l4K07k08j4J28j29n6J34k4RNLj11J28n0k0q8P5J27r2
$$ -54 39 59 -21 38 -131 -22 31 -29 100 57 3 -31 176 -32 -46 82 -47 -103 31 7 16 21 24 -87 41 -9 -29 -117 -42 85 -7
3672glP0j59J97o0J14j03M2k21K51l8l7m3RJ15j47R2j02k3O7J11n2o9j29K81k9j12J14j59
$$ -7 -10 60 -99 98 38 152 49 91 -130 121 83 46 3 12 127 -20 72 -30 -53 14 125 73 4 -125 156 127 15 129 -30
3419c0l8N0J02K6j48Mp7o3J79O5j99K7Q9k4M7kp0J92j85L1Q2l4K7j09QL6R1p8o6K05j8j30
$$ -30 -68 -18 84 110 -38 -34 -111 -174 5 70 -129 -102 -13 -37 10 8 -62 130 -55 -24 58 24 51 -58 -50 -14 77 -1 -67 138 120 -10
3139a0P1o6j23J06L9j84J25qn3K41n5p7k4N7L7j15JnR3l1L2o9Pm8J00k4j0M6p8J49j34O4n4
$$ -10 61 -5 -128 -22 17 -167 -42 -50 -103 138 83 6 -18 39 76 -39 -38 -43 50 19 51 -18 -11 -59 41 17 7 53 -25 124 -10 54 0
2850@K1j64J85m7J64j76j9M3p9J51O2m2j60j9P7pj20O5J10k5M1j85Q0k2pK8J0l0N2mN6n1k1
$$ 0 21 -143 42 -5 159 -17 -36 7 -72 79 141 99 -61 -80 -3 -10 -130 -65 45 20 61 -124 -44 -66 -73 -45 -35 -65 -13 -17 39 -12 -33
2561c3L6koM6l9kK5j11K6M9O1j00K6K2r8N0K4M1J00j42R2r6N1J0j9l3q1m4L07j97J11l6L8
$$ -33 3 1 -5 41 2 0 25 -86 -60 -11 50 -50 -24 -2 -100 -50 -26 15 115 -27 65 -31 20 30 11 -22 -103 -147 160 -37 74 38 76
2272G6p8J33j08p0J71j26J8K8j29J71l6j20N0m9q0K17j29Q0q8o8J32Lk2O2n1J10j01M0j30
$$ 76 -2 131 23 -47 124 -2 16 44 -85 86 50 -70 -20 -69 -149 68 -61 19 -69 -137 -5 -2 -24 38 -13 97 -4 36 -94
2019i4Q9O1k8o7L2n2P6rj6Rp3J78J7j15M8J22q9j46o3K6J13JjJj1m2J27j33j13J34J12j44
$$ -94 -5 56 28 -39 -7 -59 17 8 -8 1 -72 106 123 8 56 178 89 -57 -120 -94 19 20 19 20 9 -33 94 -39 -152 -18 94 -50
1738e0L9o1J0k3J25k4j16R1O3k3j07J03k8o5M5r0J88l2j6rj5o8J38K8Kj3j24J8R7m5Oj0k5
$$ -50 -11 -72 -62 -85 40 16 -100 -9 54 31 -76 27 -1 -66 -21 -111 77 45 29 20 5 -63 75 103 105 92 -32 -14 83 38 44 34 9
1450Ir6J58J28k83N2R5j5j43j2L4J07n2q7Q3L0N3J05k38n7J18Kj2O1j12j5Q0J32j64l7P7q9
$$ 9 -87 71 199 -84 -32 63 48 -95 -107 -73 34 -18 -105 -22 8 61 166 -72 -129 -11 -9 -21 40 -72 -87 -7 125 -39 -76 1 -88
1178h8NN9Q2K5o7j9j20J59l6N9J3j36O0l8n0K3jJ29j15J34q1j10J67j28J58j6j21n6K4P0J7
$$ -88 -83 -24 58 83 16 -3 -123 36 0 59 72 -64 -4 -42 -92 -69 -70 59 -56 78 -3 -113 54 -74 84 68 -53 -109 -85 -15 2
907Blj7J52J2j48P9q0Q3j81M6R9n0K0k8l3J00m5J09j02k5qJ8m8Q5m8n2J27M3j58o3K9J12K2
$$ 2 -1 -18 134 146 -2 77 -3 80 -101 -55 44 -6 14 -14 -47 53 8 117 15 -10 -18 0 -48 37 -11 -63 64 107 -51 -114 -85 27 49
618D9K3P2j99LK5K7Rm0%J7K0L5m6r0L5O0M0r9P6M0q8J03n1l8J23j39k1K19k08P1m1R3K6l6
$$ 49 72 144 -55 -52 -27 0 9 -31 -31 -14 6 41 -5 -95 -60 0 40 -59 17 57 -31 72 21 -17 106 -33 -54 165 -43 28 -13 80 106 70
321G0j21ko5N3PRO4o2L5pL3oj38N5J13Q8J6j1k8j81J23Mm4m5M5p1k2J02K2k13L07r4j16N5
$$ 70 -51 -53 -118 -65 -58 -49 15 -47 -12 -19 14 8 -130 -75 38 126 142 131 103 -78 45 49 5 -40 5 -66 -88 14 36 -177 130 36 -80 -25
23b5R5j07o3J73r5M4J26j16l3j23O2J72n7jj06O5on1K1n6J3P2qj1K3%P8q4r0
$$ -25 70 -37 -100 73 -22 22 148 32 -1 -124 -62 110 53 52 -54 11 5 -46 -25 -81 -68 4 -4 -15 8 8 86 2 -88
-230h8
##PAGE=	F1=-21010.9
##FIRST=	23146.756194512010552,	4241.1435120000014649,	0
##DATA TABLE=	(F2++(Y..Y)), PROFILE
4241aP9p4L4p0jo7Q8kP8p6l7K9j1O3j86J62q4R6k5NR4j52N6j8J07k2r9J5j4j43J40J18j41
$$ -1 78 4 38 -32 -33 -100 -12 -14 64 -12 -49 -20 -31 32 -154 8 -76 20 -5 0 94 -58 -2 -20 87 65 -34 -19 -33 -176 -36 82 -59
3952e9K9P2Qr8J10j55O8P7k4J1j3m4pJ46k01QJ51j06o5J28oj4PJ1j00Q5m5k8j24J20J37j03
$$ -59 -30 42 50 -48 62 -93 -25 52 28 39 26 -18 -25 121 -80 -72 79 -27 -92 36 30 16 23 34 -66 19 -26 -54 -178 -58 79 -24
3672b4M6K9r3J69j03Q0j10P4j95K22o4mp1L5J63j37N7l6m7N7O5n7l9q0J81j2p1O7j18r0N6
$$ -24 22 51 -42 127 24 104 -6 68 -127 95 31 27 -44 -9 154 17 74 38 -9 48 113 56 17 -63 118 106 35 102 -16 -106 -50
3401e0J41J5j72J6j12L2J30Q9j50o2J53o4M9Ml6J42j36J3L7K6k2o5l8PR7o8j8J52oj16N1j1
$$ -50 91 106 -66 -50 -162 -130 0 89 -61 -123 30 -34 15 19 -17 125 -11 2 39 65 43 -22 -60 -53 44 -24 -42 110 104 -12 39 28
3121B8j17N9lj24J38k8k0J58J3p5l0M0L4r5j7j6P6J5L0o2n7j8J10l4L0J1p8J78j23Ro1M4j04
$$ 28 -89 -30 -33 -157 -19 -47 -67 91 104 29 -1 39 73 -22 -39 -55 21 36 66 4 -53 -71 39 5 35 46 -32 146 23 32 -29 15 -89
2832h9J64m8J38j09n0J1q2J30R0q5j03k1P2p6k7J5J54q3O1j77R1m2k1Q7k4p9Q1j8Q0n3n0P7
$$ -89 75 27 165 56 6 17 -65 65 155 70 -33 -54 18 -58 -85 -70 84 1 62 -115 -24 -66 -87 0 -24 -103 -22 -40 40 -13 -63 14
2552A4J1l8N6j6m2M2j20O1K2O4o5k1L9j16l0O1O7J12j48O4k9R4l0qo2n7n0K99j98J08l7K9
$$ 14 25 -13 43 27 -15 27 -93 -32 -10 54 -11 -32 7 -109 -139 -78 -11 101 -47 17 -12 82 52 44 -18 -75 -125 174 -24 84 47 76
2272G6j34J25n3p9J84r7o7M3j24J97o7r9O9k6j15K10j08K5o4q5J95K8q3P3n8J22p4N5j77J33
$$ 76 -58 67 14 -65 119 22 -45 -2 -126 71 4 -95 -26 -52 -167 43 -65 -40 -104 -189 6 34 -49 24 -34 88 14 69 -108 25
2010B5J19p4j23K4n0Q2pj1L1n2J44j0j08N1J10l8j59m1NN8N4j6J7Qn2J04q0j38R0J43j51L7
$$ 25 144 70 -53 -29 -79 3 -4 -15 16 -36 108 98 -10 41 151 113 -46 -87 -82 -24 30 14 31 39 -13 91 11 -127 -37 106 -45 -8
1730ho3j9L8J43j18o7Q2P8p2q1P6M3q4J0m7K11n7n2l6K7m9J40Rkl8j27L6Q1l8L3l5Oj53J80
$$ -8 -71 -90 -52 91 -27 -94 -12 66 -6 -87 -11 32 -52 -42 -89 122 65 13 -23 4 -45 95 104 102 64 -63 -27 54 16 49 14 20 -133 47
1432D7J60k77R2N7qj92j4Q1Q4q7n1J06J4P3P6k16p8R9L0m0R4r0j8N8J39j60m2J16j18L2Q4
$$ 47 207 -70 22 79 71 -121 -135 -54 30 -57 -108 -2 12 85 161 -55 -133 -34 -4 -44 50 -40 -58 0 139 -21 -63 53 -65 -33 51
1161E1Oqk3r8o1J69o9J24k7j53M9J4o8L1k3J06n1R6n8j12J37r8J24K0j69lJ7J20o9j5j3J33
$$ 51 57 49 26 -72 -133 36 -33 91 64 -89 -40 -26 -94 -63 -86 20 -31 65 7 -105 32 -66 58 78 -91 -94 -77 43 -26 -41 -54 79
881G9M7j37L4j2J09j81K7L1N1m4ln2P6j8J58j29n4J8mML0m7m1J26O6j41p8nP4Q4J3P8j93j7
$$ 79 126 -11 23 11 120 -61 -34 -3 48 4 1 -51 25 7 165 36 -18 0 -4 0 30 -17 -58 68 134 -7 -85 -90 -16 68 81 159 -34 -51
583e1RL8P1p5m1O2K1j8n2o3K8M2Q0q5P3M9j15Q9j2p7J61j60lK03j83K7n8J31l4np2m5m2N7
$$ -51 -42 -4 67 -8 -49 13 34 16 -36 -99 -71 -29 51 -34 39 88 -27 62 50 -27 134 -26 -29 174 -9 18 -40 91 57 52 -20 -65 -107 -50
286e0k3pJ04q4O9k7L5k2q7P7L3J42lm5k4r1R3m2m2k9M0r7k8J83o9j71K87j30r8P7J30j61n3
$$ -50 -73 -80 24 -60 9 -18 17 -5 -92 -15 18 160 157 112 88 -3 90 48 6 -23 17 -80 -108 75 6 -165 122 -8 -106 -29 101 -60 -113
-3a13J89n7L7J01m1p2j85N0J25l2M1j60J33l5k6J3k1j6N5K6pMK2P7p9j41
$$ -113 76 19 56 157 116 44 -141 -91 34 2 43 -117 16 -19 -45 -32 -53 -69 -14 12 5 9 31 108 29 -112
-230a12
##PAGE=	F1=-21105.2
##FIRST=	23146.756194512010552,	4241.1435120000014649,	0
##DATA TABLE=	(F2++(Y..Y)), PROFILE
4241GO0n8O9q2m6j1O1%R7m6l3j14N6N4j45J87j37J35n1j9Q1j42N8MJ03l7q6K5l2j26J30J42
$$ 7 67 9 78 -4 -50 -61 0 0 97 51 18 -96 -40 14 -131 56 -81 54 3 -16 65 -77 -19 -15 88 51 -35 -10 -42 -168 -38 104
3961A04j44L9K3J0j14J71j19rJ02J1j07Qj6L4M4j53K8J53o4n1Q2K0o6L3Oo8K8l4l7j17J28
$$ 104 -40 -1 22 32 -82 89 -30 -39 63 74 -33 -25 -41 -7 37 -116 -88 65 1 -50 32 52 -14 19 25 -43 -15 -49 -86 -203 -75
3690g5J31j19R0K4l7J25j18M3j26J08j47J52p3K7r3O0J80q7QK4m7M4qo1J2l6N6J2j3ro8r8
$$ -75 56 -63 27 51 14 139 21 64 -62 46 -101 51 -22 5 -88 -28 152 65 73 97 50 94 86 25 37 1 57 69 56 47 -21 -119
3410a19O9J50j5j62K0j26J30N9Q9r5j35K15r3J0K7k4Q2o3KJ5O5m2m3p7l3Q8k2K1P3K4r5L4
$$ -119 -50 100 85 -77 -57 -183 -53 6 95 0 -135 80 -13 -3 24 0 82 19 21 36 101 59 16 -61 -94 -6 -28 -7 66 90 -5 29
3130B9L6j13Ok9o9J53j9KN3M1m9l5M3L2q2k6l6L6O3M2n9r8J2J06m1O0j7p2J58r0l6o1R1m8
$$ 29 65 -48 -42 -71 -140 13 -6 -4 49 90 41 6 49 81 -1 -27 -63 -27 36 78 19 -79 -67 39 -2 58 41 -31 127 37 1 -60 31 -17
2832a7J04m9J03n1n4l7n5J15O9q4p4nP3j27N3k1J64j17O8j33Q6l1p5J42p9r0J00k7P7k6q4
$$ -17 87 38 141 90 36 -1 -56 59 128 44 -30 -35 38 -89 -36 -57 107 -10 58 -75 11 -20 -95 47 -32 -122 -22 -49 28 2 -82
2561h2J08k4k0O1Ln5L6j40J05J1M3k8p1O6r7j09P7J00J05j48M6L2R5m7Rr2m9m7K71j29M7l5
$$ -82 26 2 -18 43 46 -9 27 -113 -8 3 46 18 -53 13 -84 -193 -116 -16 89 -59 -13 19 114 67 76 -16 -65 -112 159 30 77 42
2281D2K7j31O6nr1J73m2j26O3j16J89p5o9O1J1j39J70n7m3m4o1J96O9j22P9o1P0PM3j74J29
$$ 42 69 -62 4 -1 -92 81 39 -87 -24 -140 49 -26 -95 -34 -23 -162 8 -49 -92 -136 -197 -1 68 -54 25 -36 34 41 84 -90 39
2010C9J40j04j71N3m9P2lJ4J8%O3j8n3K4R4J2j53l1NJ1M8nL0L9o2P7l2j51M9J52j33K5m4o8
$$ 39 179 75 -96 -43 -92 -20 -23 -9 9 9 72 54 1 25 119 131 -22 -53 -48 -37 11 6 36 75 13 90 58 -93 -44 108 -25 0 -44 -112
1712a12O0J89k18PO6O1r3n1M4P4n0l2KJ81n8o6m7P6l8R5J0Nr2j06O4N0n0N3l0K1j55J83J45
$$ -112 -52 137 -81 -74 -8 53 -40 -91 -47 27 -23 -55 -53 128 70 4 -43 33 -5 90 100 105 13 -93 -29 21 -29 24 -6 15 -140 43 188
1423A88k33J03K5J5k15l5J35O1j34J2J04j0Q6L4j89o9N6M9n0J30p0j3L7J12j36m3J40j45O4
$$ 188 -45 58 83 98 -117 -152 -17 44 -90 -78 26 16 102 136 -53 -122 -66 -17 -67 63 -7 -20 17 129 -7 -50 90 -55 9
1170IR4n5k0j3j40j8J85r1J44o4j37L4M0n5K5l7P5RM1k6j05J06n0O4M3j70M6OJ54j73nRJ08
$$ 9 103 48 28 15 -125 -143 42 -49 95 31 -106 -72 -32 -87 -62 -99 -24 -15 26 0 -105 1 -49 15 58 -112 -66 -60 94 -79 -84 -75 33
881C3M2r3j4Q5R2j45kl9J20r6J9n5N0K3J63j41o1L5nM2l8om2Q0O9j08o9l7J9J38NP7j41j9
$$ 33 75 -18 -32 53 145 0 -2 -41 79 -17 2 -53 -3 20 183 42 -19 16 11 53 15 9 -33 47 116 8 -61 -98 -79 59 64 141 0 -19
583a9m0O8Q8p5p4Q8K0o3n2j8J3nJ40q1M2Q1j16K0K7q2J71j35K1J24j35j5o7J59q0J6jj02l
$$ -19 -59 9 97 22 -52 36 56 -7 -59 -77 -64 -69 71 -10 32 113 -3 17 44 -38 133 -2 19 143 8 -7 -74 85 5 21 20 -82 -85
295h5M0j8k3J19r5R2l5L4l3k7P8p1J66j1m7l0J4L0p5ol5N7j06n8K26j27j25K48j65o3J14J44
$$ -85 -45 -63 -86 33 -62 30 -5 29 -4 -31 47 -24 142 131 84 54 68 98 23 17 -18 39 -67 -125 101 -26 -151 97 -68 -131 -17 127
15A27j96l8J86l7K6N6L3r6j79M6L3J3L3j64J79q6K5%J3k4K7N2j2k0L6Q4o9j60
$$ 127 -69 -107 79 42 68 124 157 61 -118 -72 -39 -26 7 -157 22 -64 -39 -39 -26 -50 -23 29 17 -3 33 117 48 -112
-230a12
##PAGE=	F1=-21199.6
##FIRST=	23146.756194512010552,	4241.1435120000014649,	0
##DATA TABLE=	(F2++(Y..Y)), PROFILE
4241B1K0k9P7p4p5O7LK9P6j3j2k33J01L1r9J75j38J21k2m6O8j37M1J4R1o3k7L9l5j08P9J66
$$ 21 41 12 89 15 -60 7 10 39 115 102 90 -143 -42 -11 -110 65 -73 48 26 -20 48 -89 -48 -34 57 -6 -33 6 -29 -137 -58 108
3961A08j38N1l7K8j10J95p0q5J07M1j75K4J3Q0o3r0L0J28pk9K1M1j24O8Ll1k1j9m4p6J05R8
$$ 108 -30 21 -16 12 -98 97 27 -58 49 90 -85 -61 -48 32 -31 -121 -91 37 30 1 22 63 -61 7 10 -21 -42 -61 -105 -181 -76 22
3681B2j19J05M9j0Q1j00J6j29J24j02O3n9O0j19Q3J66l5l5N6k2L7q1n5P1k3n5M6M2q1l8q0
$$ 22 -97 8 57 47 128 28 44 -85 39 -63 0 -59 1 -118 -35 131 96 61 117 95 132 51 -4 67 44 -11 35 77 -4 -42 -122
3410a22J13J22m7j25rr1J84nO4o7j38K45j11m6N3k8K7K2nMO5j4n5q6p9P2M2M2lN5o4J8M8j13
$$ -122 -9 113 66 -59 -68 -159 25 20 84 17 -121 124 13 -33 20 -8 19 41 36 40 105 91 36 -50 -129 -57 -15 27 24 79 15 33 81 -32
3112c2k5k9l3J46K2jj9K2j0k8M5N2r8l1l0j8J09M9p4q7J7Q6l8P1k6p0J09n0n4n9J47k0M0l6
$$ -32 -57 -86 -119 27 49 48 29 51 41 13 58 110 12 -19 -49 -67 42 91 17 -70 -53 33 -5 66 40 -30 79 29 -25 -84 63 43 83 47
2815D7O6k6l2r2j2J07K6n5p9K6P8j43Q2l0J39j09O3q2O4K3j48J66j44m4R3l1N5J4j12J19q7
$$ 47 113 87 55 -37 -49 58 84 29 -50 -24 54 -89 -7 -37 102 -7 56 -26 38 61 -87 79 -65 -109 -16 -47 8 22 -90 29 -58
2544e8L7N9J5l6Kj54J36J9%Or7P1l9j33N8J17R3j62M2O6O3m4L6j25m1m3K33l3k6k6Np0j2J4
$$ -58 -21 38 53 17 19 -135 1 20 20 26 -71 0 -39 -172 -114 3 96 -66 -24 42 105 61 97 -28 -69 -112 121 88 62 36 41 -29 -41 -27
2246b7q3J59jj42P7r8J52p2l6M1M2j44J09j2p7l1j1J41R1j23Q5o7qJ08Lj16Q5J09j14j81R6
$$ -27 -110 49 48 -94 -17 -115 37 -35 -71 -30 12 -132 -23 -35 -112 -143 -154 -13 78 -45 40 -27 -35 73 76 -40 45 154 40 -141 -45
1975d5m3M8j2N6j8N5l5jK2j1P7L7j21m2K3Pj8J5L9N7n0N1j5j40K7J48j18J6lj20M3K29k82
$$ -45 -88 -40 -52 4 -14 41 6 5 27 16 93 130 9 -33 -10 -3 -21 -6 33 90 40 91 76 -64 -37 111 -7 9 6 -114 -71 158 -124
1686a24O5N0L7r0j3K4M0J1n1K6J20m1m3m8J04l7L4K0K0j39o0P8K2o9N5pK6j14J48R7j51P8
$$ -124 -59 -9 28 -62 -75 -51 -11 0 -51 -25 95 54 11 -37 67 30 64 84 104 -35 -95 -17 5 -64 -9 -16 10 -104 44 141 -10 68
1406F8RL0k04m8J56N6j81Q1P1j1Q9j0j73l3MM8j5J30n3k2M2O8r0n3J28j62R7Q1p7nk8j32k5
$$ 68 77 107 -97 -145 11 67 -114 -33 38 27 116 106 -67 -100 -96 -48 -63 67 14 -8 34 102 12 -41 87 -75 22 103 26 21 -7 -139 -164
1117a64J99q5J16p1j09K1L0qJ9n5N1M7Rj6r9P8NJ2M8j18O1nJ43k37K2M3Q0Lm4k8J66L8r7l1
$$ -164 35 -50 66 -5 -114 -93 -63 -71 -52 -107 -56 -9 0 -16 -115 -37 -32 -20 28 -90 -29 -34 109 -128 -106 -63 17 20 -24 -52 114 152 55 24
820B4q7J34j09L8l5JP6J07j10n5M6LM8q2M5m1JN5p1l9m9m0J77pO3o4j7r9J03Q0o0p6Q5J6r0
$$ 24 -63 71 -38 0 -35 -34 42 149 39 -16 30 33 81 -1 44 3 4 59 -12 -51 -100 -140 37 30 93 29 12 -87 16 96 36 -40 45 61 -29
513b9k1K1k2n1J86r4J4J24q8q3N7n9J49p2L2J3o6m0o9J58j09K5Q1j46L6J3Pm0J19j00Q8k1
$$ -29 -50 -29 -51 -102 84 -10 4 128 40 -43 14 -45 104 32 64 77 11 -29 -98 60 -49 -24 57 -89 -53 -40 -33 -73 46 -54 34 13
233A3J9k5J4O0j59J65J2n2m3R8l8r0N9p1R7j00r4K24j45p9J98j83l8J56J31j90l6J58k0KJ5
$$ 13 32 7 21 81 -78 87 99 47 4 102 64 -26 33 -38 59 -41 -135 89 -56 -135 63 -120 -158 -2 129 -61 -97 61 41 43 58
-38E8Q8r4j18N6q0O3j0j17J98j55Q5j1L7j9KN7k9m4N1R2n4j43
$$ 58 146 52 -66 -10 -90 -27 -37 -154 44 -111 -26 -37 0 -19 -17 40 11 -33 18 110 56 -87
-230h7
##PAGE=	F1=-21293.9
##FIRST=	23146.756194512010552,	4241.1435120000014649,	0
##DATA TABLE=	(F2++(Y..Y)), PROFILE
4241D0l5NN4m7q0J28n7Q8K4lJ6k79J21jp1J23r8Q3L9n3N1j48L2PR0r6M7M0j9j01K2J79j32
$$ 40 5 10 64 17 -63 65 8 96 120 117 133 -146 -25 -26 -97 26 -72 11 50 -3 48 -100 -68 -61 29 -67 -20 20 1 -100 -78 101 -31
3952c1O0r6O0o9J52k0j28Q8O1j72L6K9J12j43l4J0Q2N1ok9M6j53Q9Lol7Jm9k8O7M3r4Q5Q2
$$ -31 29 -67 -7 -76 76 56 -72 16 77 -95 -59 -30 82 -61 -95 -85 -3 48 42 13 59 -94 -5 -2 -8 -45 -44 -93 -121 -54 -11 -105 -20 62
3655F2j1M7n7Jj04J12p2k7k7R5j51J00J28on7N9J5L9j33l5J26m4j35Q8Q2j21m4n9J95N5o4
$$ 62 51 98 41 42 -62 50 -22 -49 -76 19 -132 -32 96 90 33 92 107 146 13 -22 104 60 -75 13 95 -26 -70 -129 66 121 57
3384E7p6p1j5J86m4J7o9o9K36j25q4O1l0nR4j3j3K9N6r3o2j19O4Q8N8n5O1j9lK0j16j9pj7
$$ 57 -19 -90 -105 81 37 54 -15 -84 152 27 -57 4 -26 -31 63 50 37 66 122 29 -33 -152 -88 0 58 3 64 45 42 62 -54 -73 -80 -97
3086i7J00Q2k2l1k3K6j0L2R1j37l4Ro0J48K7j06k9j6P3k0N6k3p8O9j5n7m8J91j9jj5K7j2j4
$$ -97 3 85 63 32 9 35 25 57 148 11 -23 -14 -74 74 101 -5 -34 -50 23 3 59 36 -42 27 12 -45 -93 98 79 78 63 90 78 64
2789F4j22J8R4j1j5j03O7O9j22O1j3Q6p0M7m5L4R6k00J55k00L7O2k6K7L8j19J07j41R8O0J1
$$ 64 -58 -40 54 43 28 -75 -8 61 -61 0 -13 73 3 50 5 39 135 -65 90 -110 -73 -11 -37 -10 28 -91 16 -125 -27 33 44
2517D4J1m9j55J39L5m1K0p7L8L8q6J9R9R6k06N3N8K8k6P1j55k9m2J87L4m6l1l7J4p5J8m5J54
$$ 44 55 6 -149 -10 25 -16 4 -73 -35 3 -83 -64 35 131 -75 -22 36 64 38 109 -46 -75 -117 70 104 58 27 -10 4 -71 -53 -98 56
2229E6oj13P5p4J00o3j2K4N8j33M2K0o5k8M7O9P0r4P8p2o6J76m7k2L2M1j10j47J22k8K6m1
$$ 56 50 -63 12 -62 38 -25 -37 -13 45 -88 -46 -26 -91 -119 -72 -3 67 -27 51 -21 -87 89 42 20 52 93 -17 -164 -42 -70 -44 -85
1948h5J07n7Q3j12K9P2k2O0L1o9o5M7M2r9J7M8M7j6K6k1j05K0J40j22J8M5j54OK29k66O9M0
$$ -85 22 -35 48 -64 -35 37 15 75 106 37 -28 19 61 -38 -21 27 74 58 84 63 -42 -22 118 -4 14 59 -95 -89 140 -126 -57 -17
1668a7L0p4K1K3l6N9m5J6P4k7Nm4R2l8pK4M2j54j1O7J3p5L7K3J4o3Q3N1n8K5J1K2j62k6J20
$$ -17 13 -61 -40 -17 -53 6 -39 -23 51 24 29 -15 77 39 32 56 98 -56 -67 0 13 -62 -25 -2 12 -51 32 83 25 50 61 83 -79 -105 15
1362A5P0k12J30J7K5P7m1j61Ll5L5N1P9l7m8P7J6j9q2Q9j55J07N1n2J1l5q2q4J97m9O4n0q9
$$ 15 85 -127 3 20 45 122 81 -80 -77 -112 -77 -26 53 16 -32 45 61 42 -40 49 -106 1 52 0 11 -24 -106 -190 7 -42 22 -28 -117
1073a17J2QM9K6q5M7N9J2l2j01M3O1j5L5l5L8lQ4k35N3P3N2l5k8J1J90k3n8n3r9J01q5M8L
$$ -117 -105 -97 -48 -22 -107 -60 -1 11 -21 -122 -79 -18 -33 2 -33 5 2 86 -149 -96 -23 29 -6 -34 -23 167 144 86 33 -66 35 -50 -2 1
776Ap2J27J5l1n4N2J4J9q8Q1k2q3J9l4J0m2q9J96k8L9K0k1j49J23P5n4m2N5J2r5M1L7p0p2
$$ 1 -71 56 71 40 -14 38 52 71 -17 64 42 -41 -22 -56 -46 -88 -177 19 -9 30 50 29 -120 3 78 24 -18 37 49 -46 -5 32 -38 -110
478a10J80j00QJ57m0j89P3k4J13mJ5p1ll0o9J06j18K5J49j42N5oK4n8J20j01O5Jj4J3K6K4
$$ -110 70 -30 -22 135 95 -94 -21 -45 68 64 79 8 5 -25 -94 12 -106 -81 68 -74 -19 -25 -1 -59 61 -40 25 26 12 25 51 75
198G5j95J48O0r0m8J39p9r6J25j17J47q8j12J83j27l6J50j85k6J76R2j41n3J13J0k4j1J08
$$ 75 -120 28 88 -2 -50 89 10 -86 39 -78 69 -19 -131 52 -75 -111 39 -146 -172 4 96 -45 -98 15 25 1 -10 98
-47I8o7m0O5j65R6n1l4J74k09J21qM2j4j6N4n1o3P0R3l4j04
$$ 98 31 -9 56 -109 -13 -64 -98 76 -133 -12 -20 22 8 -8 46 -5 -68 2 95 61 -43
-230d3
##PAGE=	F1=-21388.3
##FIRST=	23146.756194512010552,	4241.1435120000014649,	0
##DATA TABLE=	(F2++(Y..Y)), PROFILE
4241F0q3K4K0j3o2J38q0J44l9k4M0k41J26k8p3M8m5O2Q5l3K8j66M8j4J11j22R2K4Mj02nJ60
$$ 60 -23 1 21 8 -54 84 4 148 109 85 125 -116 10 -18 -91 -43 -88 -26 59 26 54 -112 -64 -78 33 -89 3 27 31 -71 -76 84
3961H4j15N7j46R0J0N8Oj21N4O9j12M1L1J09j70kj9L4R9Mm9L3j38Q1Mjj4K3n0JL3k1m8L4J16
$$ 84 -31 26 -120 -30 -20 38 44 -77 -23 46 -66 -25 6 115 -55 -57 -76 -42 57 61 12 45 -93 -12 -8 -9 -23 0 -50 -49 -16 -37 -85 -51 65
3655F5l2L1rj2n4Q0n4j05J0J31j83J06P2J3o2M1N3M1j56JJ59q0j77J25R8j17p3n3K93l5o1
$$ 65 33 64 55 43 -11 69 15 -90 -80 51 -132 -26 46 59 -3 38 91 132 -24 -23 136 56 -121 4 102 -15 -88 -141 152 117 56
3384E6l5j32N8J57o0l1p5K3J97j38q3M8k7j1J43l3l8j0J27j30k3j42P1R1Q0p5L1K9k8k1j24
$$ 56 21 -111 -53 104 44 13 -62 -39 158 20 -63 -15 -42 -53 90 57 19 9 136 6 -17 -159 -88 3 83 8 39 68 40 19 -105
3112a05K5J6j0L0J29m1Oo7M2PJ0J30j71l0N5p9J79k6j39M4p5R0RJ7j8r8O4Mn7l0K09j9j4j3
$$ -105 -80 -64 -74 -44 85 44 50 -17 25 32 42 172 1 -29 26 -53 126 100 -39 5 -70 20 29 46 28 -70 -6 -2 -59 -89 120 101 87 74
2815G4oK4k6j11K4O4l0K8j30J09K6o9K3J9J4k6J9j9RJ39j92J14k22J08K5j1J0K9j02P8j50
$$ 74 68 92 66 -45 -21 43 13 41 -89 20 46 -23 0 19 33 7 26 7 16 155 -37 77 -145 -37 -12 -23 -13 16 -86 -8 -158
2544a58J22P4k2O5q3j50J15N2o3Jj2k3J13jj5M5J23k64O2J6J6%J04j64k9m1J39M3J3p6o6P3
$$ -158 -36 38 16 81 -2 -152 -37 15 -48 -47 -59 -82 31 30 15 60 183 -81 -19 -3 13 13 117 -47 -76 -117 22 65 78 2 -64 9
2264Ij05M0J0J46n0o2O2n7M8n3J2ON6j06j7N1k9l4R6RK1n9M9o1r2J80p8P6j7k3r4r2J13lJ2
$$ 9 -96 -56 -46 100 50 -12 50 -7 41 -12 0 6 62 -44 -61 -10 -39 -73 23 32 53 -6 43 -18 -110 70 -8 68 51 28 -66 -158 -45 -48 -36
1957c6p4J48p3P5j53O5P0%M1J0k1q1N9Q9j40j3N0K2K6j0j9o5J9J28j34L0P6j59k2J83j65K1
$$ -36 -110 38 -35 40 -113 -48 22 22 63 73 52 -29 30 119 -21 -34 16 38 64 54 35 -30 -11 117 -17 13 89 -70 -92 91 -74 -53
1677e3L1L9n3L7K7r9O5l3j0P4k9N0m5N9l8j3J4P4j42QM8J9n8J4M7j2k8J4L6J0m9L8lj04K6
$$ -53 -22 17 -36 1 28 -71 -6 -39 -49 25 -4 46 1 60 22 9 23 97 -45 -37 11 30 -28 -14 33 21 -7 7 43 53 4 42 39 -65 -39
1371c9K9R8k15J37l3Q3N2l9j42J2n5L1J01Ok6o5J18l8N6j21M3j03O9J5J6mnk2j64J77NJ5k7
$$ -39 -10 88 -127 10 -23 60 112 73 -69 -57 -112 -81 20 26 0 -65 53 15 71 -50 -7 -110 -41 -26 -10 -14 -19 -41 -205 -28 -23 -8 -35
1082c5p4MjQ3M4j18O7M4M1n6j08JJ07k3J2K9PK5oj75O8Q2K2l2n7P9J49n5l2o9q1N5n0M2N3
$$ -35 -109 -105 -106 -23 21 -97 -30 14 55 -1 -109 -108 -1 -24 -12 17 24 49 43 -132 -64 18 40 8 -49 30 179 124 92 23 -58 -3 -53 -11 42
776D2j51J57o2O3o5M9L5l0o9R3J4j42l8J3O1l1j14J85n5J9R0k5j85J27P5o1RLK1q4J07L7j10
$$ 42 -109 48 -14 49 -16 33 68 38 -31 62 76 -66 -104 -91 -30 -61 -175 10 -45 -26 64 39 -146 -19 56 -5 4 7 28 -56 51 88 -22
487b2o2J13p5J9J66Ok64O7J9P5L8k1q5K2J4o8J6j12J7J82q7M9qK0p3J29r8M8Jm6P5J1k6j73
$$ -22 -84 29 -46 -27 139 145 -119 -52 -33 42 80 59 -26 -4 10 -58 -42 -154 -137 45 -42 7 -1 19 -54 75 -23 25 26 -20 55 66 40 -133
190a33J30R9j53l5J32p6r6J52j35J86q1r5J16q7NJ06j72k0J62L2p4p3O5M9k9k3R1l3J7O7j99
$$ -133 -3 96 -57 -92 40 -36 -132 20 -115 71 -10 -105 11 -76 -71 35 -137 -157 5 37 -37 -110 -45 4 -25 -48 43 10 27 94 -105
-82a05R7n7N5J07k09J14LK2Jm2O5p2o6Q8Q1j5o5
$$ -105 -8 -65 -10 97 -112 2 5 27 28 -14 51 -21 -87 1 82 67 2
-230B
##PAGE=	F1=-21482.6
##FIRST=	23146.756194512010552,	4241.1435120000014649,	0
##DATA TABLE=	(F2++(Y..Y)), PROFILE
4241G3j07K1%J8l2R9n4J50q9n4M2j45J25l7r2l4QP3P9Pjj73Q1l9J50j33Q7MJ5j02J7J03p1
$$ 73 -34 -13 -13 5 -27 72 18 168 79 25 67 -78 47 10 -82 -116 -108 -35 44 51 50 -123 -42 -81 69 -64 23 27 42 -60 -43 60 -11
3952a1L3j80J02J03m7kp6K2O9l7L6L4O8j45J0m4JJ34nm7J2q9N4Lk0L3M5n6PJ5p8Jk3J44n9
$$ -11 22 -158 -56 47 0 -2 -78 -56 13 -24 12 46 114 -31 -21 -65 -64 70 65 18 30 -59 -5 -2 -22 11 56 0 7 22 -56 -55 -78 66 7
3646GK4L0l1LM7l2j58K9J61j93R2OM3n5QQ1L3j56N0J57j06j80J42Q7q1r6o2L63j10m7j0j51
$$ 7 31 61 30 33 80 48 -110 -81 80 -113 -21 -15 28 -27 -19 62 95 -61 -11 146 40 -140 2 89 8 -88 -150 213 103 56 46 -105
3366a05P8J27o2o1o0P7J47j35n9K4k3%J62n8o2k1J59j43Qj39Q5N3R8o3j8O2m9n0j28Q4J9K
$$ -105 -27 100 38 -23 -83 -6 141 6 -53 -29 -52 -52 110 52 -10 -31 128 -15 -7 -146 -61 -8 90 27 9 71 22 -28 -156 -72 -53 -51
3086e1k8J41m3N7j02L1K1qJ45j68k4Q0q1J99q9j40Q8j34J42L0k5j5j29R1Ln6j8K08Jj4m8k8
$$ -51 -79 62 19 76 -26 5 26 18 163 -5 -29 51 -30 169 80 -60 28 -106 36 66 41 26 -103 -12 -9 -65 -83 125 126 112 64 36
2806C6R0o1p1J7K0l6O0j43J41m9%jN2n7Kj6JKJ22j21N5j94J33kOK2qp9M8j12J00J01q3R9p2
$$ 36 126 65 -6 11 31 -5 55 -88 53 4 4 3 55 -2 0 -16 -15 -13 109 -12 43 -151 -18 -20 -14 8 0 -79 -31 -143 -43 58 -25 74 2
2500Bj50R0N6o0m7P4p2J51P3k1l2J61l03N6l9L2K8J24j42n6l6J00J2J05j45n2Q0j04R0M9J24
$$ 2 -148 -58 -2 -62 -109 -35 -107 44 117 96 64 225 -78 -22 -61 -29 -1 123 -19 -75 -111 -11 1 106 -39 -91 -11 -115 -25 24 148
2229A48r7j9M3n2J1m2M0j6L7n9n3P2Mm3J34l3l0l2J0l2j02J36q4J50o3m8n9n5P6K6Mq6J55
$$ 148 51 32 75 23 34 -8 32 16 53 -6 -59 13 17 -26 108 75 45 13 23 -9 -111 25 -59 91 28 -20 -79 -134 -58 -32 -28 -114 41
1940D1n9N7j63J00K0M3K0qkq1N0J14j09p0M4LN9n6J2m9J8J14j37M9P2j36k8J19k4m2J7M4k6
$$ 41 -18 39 -124 -24 -4 39 59 51 49 -32 18 132 23 -47 -3 0 59 3 15 -34 -16 98 -39 10 82 -54 -82 37 13 -29 -12 32 6
1651FL0Rj02L1k6m0J25m6O3m5K8l0jj0J14j25j7M7K2k3lO8m1j8k6N1K2j28R3k3n2O9p6J29
$$ 6 36 45 -57 -26 -52 -92 33 -13 50 5 33 3 2 -8 106 -19 -36 11 33 10 7 75 34 16 -10 41 63 -65 28 5 -47 22 -54 75
1353G5j90J01o4J45J4kj11ko4M7R1m0k0m8J35r2J08j45Kj2j6j3J09o0N7J7k15J48N1j2k4n2
$$ 75 -115 -14 -78 67 81 79 -32 -34 -98 -51 40 0 -20 -68 67 -25 83 -62 -60 -72 -88 -101 8 -52 5 22 -193 -45 6 -6 -30 -82
1073h2j0J5P6N8j27Q7J3O9n4j15l6J28k9qL4JP6r2q9N6O6j5L6j12J23P5n1j2q6n0K8k1K1R6
$$ -82 -92 -77 -1 57 -70 17 30 99 45 -70 -106 22 -7 -15 19 20 96 4 -85 -29 37 22 58 -54 69 144 93 81 -5 -55 -27 -48 -27 69
776F9k06J55q7J31q9L6P1p6m4Q7N5j61r4N5J01l3j09J39p7J7J28j9k03J26P1q2N7n8M8o7J45
$$ 69 -137 18 -69 62 -27 9 80 4 -40 47 102 -59 -153 -98 3 -30 -139 0 -77 -60 68 49 -154 -28 43 -39 18 -40 8 -59 86
505H6L3j23l0J5k0L8J44K3k78M1O1M3M0m5l5pP5o4o7j01jJ75j4K8NJq4J40r0N7l4o3J48j8
$$ 86 119 -4 -34 -19 -39 -1 143 166 -112 -71 -10 33 73 28 -7 -14 61 -3 -70 -171 -172 3 -11 17 22 23 -61 79 -11 46 12 -51 97 79
207G9q3j14J13J07k01j4R5m0q6J27j07J99q6m9L6k8L6O2j49j7J27l4j8p4K6Q1nk5N7j3L4N3
$$ 79 -4 -118 -5 102 -99 -113 -18 -58 -144 -17 -124 75 -11 -60 -24 -52 -16 46 -103 -120 7 -27 -45 -119 -93 -12 -17 -42 15 2 36 89
-73H9j80P1k9J16J8j38P1J1k8M2q4R6q5n2R8N6jm5
$$ 89 -91 -20 -49 67 85 -53 18 29 1 43 -41 55 -30 -82 16 72 71 26
-230B6
##PAGE=	F1=-21577
##FIRST=	23146.756194512010552,	4241.1435120000014649,	0
##DATA TABLE=	(F2++(Y..Y)), PROFILE
4241G0r7nLM6pM1PQ6j11n6J6m4J09rj13j00N6R7J7M9k2j58J09n7J83j27L2kJ5r1P2L2kj6j92
$$ 70 -27 -32 -29 17 10 51 58 144 33 -23 -7 -51 58 49 -64 -164 -108 -11 6 55 33 -125 -16 -73 110 -17 15 13 28 -63 9 41 39 23 -169
3935a69R7J69j23l1j8%O2J3K7N3Mq5J0o0j4J59l2k7j5l1K4Nn2P1N7o1NJ4j27L9o2J66q3J5
$$ -169 -72 97 -26 -57 -75 -75 -13 0 27 80 84 -1 9 -51 -65 94 62 35 20 -11 13 18 -34 37 94 33 38 52 -75 -36 -98 68 -15 0
3637@M6m9N3K7qj67J4J76j67N2m6R2m4l8R7Qj32Q7J23j08j45J29N7l4r7p0L70j39l5Pj14K5
$$ 0 46 -3 50 77 69 -98 -84 92 -75 -23 -69 23 -21 -59 38 46 -86 1 124 16 -129 0 57 23 -74 -144 226 87 52 59 -55 -30
3357c0J08n7o2k0O9J00j07l2kk6J4J54p7o7kJ38j22K2j17R3rR8l0m9O8n9n6j15J24%K8m9J16
$$ -30 78 21 -41 -61 8 108 1 -31 -33 -59 -45 109 32 -35 -37 101 -21 1 -116 -23 -32 66 36 -13 55 -4 -60 -175 -51 -51 -23 -72 44
3069D4k6Q1j24rL9nJ24j20k4O7p3J99j33r2Q2j67K04L0m8rj60J19j0m6l0J99M2j4j08l3J53
$$ 44 18 99 -25 -34 5 0 124 4 -20 47 -26 173 40 -52 30 -137 67 97 49 40 -120 -1 -11 -57 -87 112 154 140 32 -1 152
2797A52q7l8K6l0l5P0j34J40j22P1JP1j04Pm7J1J5O2k3lj29J19k7J3P0m8p5K7m6M8J37j67
$$ 152 65 27 53 23 -12 58 -76 64 -58 13 14 85 -19 -12 -59 -48 -33 29 6 3 -126 -7 -34 -21 49 1 -74 -47 -93 -45 92 -75
2517g5J06nj67Q9L7n0q8J52q6J34J07kj07J83k93L3q4O3M1J35r7j06j6P4k9J58j82mM6q3J40
$$ -75 31 26 -141 -52 -15 -65 -153 -1 -87 47 154 152 45 228 -65 -32 -116 -53 -12 123 26 -80 -96 -22 -51 107 -75 -79 -33 -116 24
2246B4O0Q1j09j1K3m8nl2P2m4RJn3N7L1n5J61o8n5j0k5J3j24R3p3J76j12j9mn4K7N1no5J13
$$ 24 84 165 56 45 68 20 15 -17 55 11 20 21 -32 25 56 1 162 94 39 29 4 17 -107 -14 -87 89 -23 -42 -46 -100 -73 -22 -27 -92 21
1940B1k0N8j57J20n0R2kk1pp6K8J05k2j37L3RP3r8N9o6K1J00j26P1M2r8k2P4Q8q0LK0J6Ml9
$$ 21 1 59 -98 22 -28 64 62 41 34 -42 -14 91 69 -68 -35 -26 47 -51 8 -58 -37 63 -63 8 50 -48 -70 4 92 12 15 35 51 55 16
1633A6l6k3j9o8J87n4L0l4K1j7Om6J49j17o0O9QJ8j1Q4n6j9l5Q5k7j86J65k7k1O8j52J55j44
$$ 16 -20 -43 -62 -130 57 3 33 -1 20 3 9 -37 112 -5 -65 4 12 30 19 103 47 28 -7 78 51 -135 30 3 -18 50 -102 53 -91
1345i1L7o8J94l2N2p6k4o8P2J9l0j7PJ11j38J24j40k2Q3j17k6J96j30J17K0k07J18P4j9l8
$$ -91 -54 -122 72 40 92 16 -8 -76 -4 15 -15 -32 -25 86 -52 72 -68 -90 -7 -124 -150 46 -84 33 53 -154 -36 38 19 -19
1082a9j9l2M6M2M4q7Q1k9Q3qj21n5J17m0ok6L3J22j41j4K4K6m7J45j54J02K0k8Qj08k4L2n
$$ -19 -38 -70 -24 18 62 -25 56 27 110 102 -19 -74 43 3 -3 -29 4 126 -15 -29 -5 21 -26 119 -35 67 87 59 67 -41 -65 -33 -38
793c8mJ15k14J31o6J48j10RJ14j00j9O7Q6j49j14O4J22m4r1P0p7L3J24%j96J25N7j19R8j16
$$ -38 -42 73 -141 -10 -76 72 -38 -29 85 -15 -34 33 119 -30 -144 -80 42 -2 -93 -23 -100 -67 57 57 -139 -14 43 -76 22 -94
531i4R2n8J41L1j03Ro9L8N4J00Pk33J0R5J5J6l2L7p4J18m8r6r7k2J37L0RK8k8q3J37p8R0r0
$$ -94 -2 -60 81 112 9 18 -51 -13 41 141 148 -85 -75 20 35 51 19 56 -18 100 52 -44 -141 -163 -26 4 13 41 13 -70 67 -11 79 -11
233a1n7K12m8j38m6R1Q7k04KM4J6o5O3m0J82r9Jm3M5M7J4j16k4R8q1Nm9J4Q1K8k1M3k4K2K0
$$ -11 -68 144 96 -42 -88 3 90 -114 -112 -68 -52 -117 -54 -94 88 -11 -10 -53 -8 39 53 -63 -87 11 -70 -65 -114 -100 -19 9 -12 31 7 29 49
-73D9j23L5LJ31n4k9K7kr4J21j44J35r0j9Q9K6Rn2
$$ 49 -74 -39 -36 95 41 12 39 37 -57 64 -80 55 -35 -54 35 61 70 18
-230A8
##PAGE=	F1=-21671.3
##FIRST=	23146.756194512010552,	4241.1435120000014649,	0
##DATA TABLE=	(F2++(Y..Y)), PROFILE
4241D9o4l4J6P3MlO8k1j00k4j8J3P1N2j20j39R5J10o5P0k0j33J21o1J83j06m8J1J3n7J21j5
$$ 49 -15 -49 -33 40 44 41 109 88 -12 -36 -54 -41 30 82 -38 -177 -82 28 -37 33 13 -120 1 -60 123 17 -31 -20 -7 -64 57 42
3961D2O8q8j72Q2J85j55m9K4j1M1L1K0Q8n4l1J9p5k7J82p0J3m9J2NK0q8P8N6n6PK3j72O8p2
$$ 42 110 22 -150 -68 117 -38 -87 -63 -74 -33 -2 18 106 52 21 40 -35 -62 120 50 63 14 26 31 51 -37 41 97 41 48 71 -101 -33 -105
3664a05J73r4mM2n7Q3K0J3j25l3J67j07qn4J36l2q6R7l1r0R4P4q2q9R2K7kp4o5L08j14l1K6
$$ -105 68 -26 -30 12 -45 38 58 71 -54 -87 80 -27 -35 -89 47 15 -71 26 -5 -95 -1 73 -9 -98 -6 21 19 -55 -120 188 74 43 69
3375F9n1o4R7m7l9J8K9O0o2j3l3k7K5J23q1m4J6Q7o9J6q6Q4o7P3J0m4M8n8m1p3J15k4O3k8
$$ 69 18 -46 51 4 -35 -17 12 72 10 -3 -36 -63 -38 85 4 -40 -24 63 -6 10 -76 8 -59 14 24 -20 28 -30 -71 -144 -29 -53 10 -18
3077a8O4NN5j31o3P0J8P8l4n2K9o2J69j37j6M0j63K44Om0Nj80J20j9k5o5J83Q4j1j54l0J78
$$ -18 46 51 106 -25 -88 -18 0 78 44 -8 21 -41 128 -9 -25 15 -148 96 102 62 67 -113 7 -12 -37 -102 81 165 154 0 -30 148
2797A48q6l2N7o1k8M3j00R5j58J28K5O8j18%n8LL1QN9m5o2R6n7lJ29n4r9J3J8qJ71k45R7Q8
$$ 148 62 30 87 26 -2 41 -59 36 -122 6 31 99 -19 -19 -77 -74 -43 -35 24 -21 -83 13 -44 -47 82 28 -71 -58 -40 -48 123 -122 -25 63
2500F3j93J19on8q4J98o4P0J06K2j61J67k26%j00R3K8J43n2j50J6N7o5J38j42L4J6n4J46N3
$$ 63 -130 -11 -17 -75 -159 39 -25 45 151 173 12 179 -47 -47 -147 -54 -26 117 65 -85 -69 -12 -77 61 -81 -47 -31 -85 61 114
2237A14L1q4m1jk8Ol5R2n8j7O0k2j5P2p1J75r9m9J1m8O6j57P8o6J53j52M7M4o3j5O2k0k6L7
$$ 114 145 61 20 19 -9 -3 -38 54 -4 -21 39 17 2 74 3 178 79 30 41 -7 59 -98 -20 -86 67 -85 -38 6 -57 -72 -10 -30 -56 -19
1940a9L4Q1j49J16j05J32k3m0k0o6J1O7O4j90L7J7Q0j13R5j00K6R5j11Q7On1k4O6J23q0Jl6
$$ -19 15 96 -53 63 -42 90 67 27 7 -59 -48 19 83 -107 -70 -53 27 -86 9 -91 -65 30 -81 6 12 -39 -63 3 126 46 47 11
1660A1P0k6r3O5q2J0j03K13k5m1oL7qjq4J52j03q4R4j4M5j6R1m2k3l5J29j09j97K26k6j2K0
$$ 11 81 55 -38 27 -55 -45 -148 65 40 -1 -7 30 22 21 -63 89 -14 -98 -4 -18 27 11 102 60 37 2 131 22 -175 51 25 13 33
1371C3j70J63q3l0n2K25q2R5m3m6o7Q9p7K8j1O8N6j61J10j06k8J38j89k4K43j70J41nj49Q7
$$ 33 -137 26 -57 -87 -139 86 4 99 56 10 -57 32 -45 -17 -28 40 96 -65 45 -61 -89 49 -140 -164 79 -91 50 45 -104 -17
1108a7O7on0J0n5P3J6rOK4n8P7O6j23n0P9n0K4j12Q4J34j47K4Kk7o1K37j54K3K4j4J7j20j9
$$ -17 50 44 -6 4 -51 22 38 29 35 59 1 78 144 21 -29 50 0 24 -88 -4 130 -17 7 9 -18 -79 158 4 27 51 37 54 -66 -85
811h5N5Oj9J04j79R8l0J24j15k8J48r9J3L3J00j31p8K8J21m9q0Pm8N2Q2K6j60J18M1j70J35
$$ -85 -30 -24 -43 61 -118 -20 -50 74 -41 -69 79 -20 -7 26 126 -5 -83 -55 66 17 -63 -56 -104 -52 30 56 -104 14 55 -115 20
540B0j58J36n6J05K5n8M2j13O9O3N2k8j49rJ10qj5J6R1j47J15ro5j01l5Q8K8lN3n9o9J03n5
$$ 20 -138 -2 -58 47 72 14 56 -57 12 75 127 99 -50 -59 51 43 28 44 135 -12 103 94 29 -72 -107 -19 9 6 59 0 -69 34 -21
251b1J22j32m0K46o3j74LO3N5j56loQ4m1lL6J31j11L2j00J17L7l5p9m3Q9q5Mj7K7M4M4k3P9
$$ -21 101 -31 -71 175 112 -62 -59 4 59 -97 -100 -106 -22 -63 -66 -30 101 -10 22 -78 39 76 41 -38 -81 8 -77 -73 -90 -63 -19 25 2 81
-47H1o3Pl2m6JJ6J04p6O7Ml4j58K13j93J55q3K3O0JJ6p6
$$ 81 18 25 -7 -53 -52 -36 68 -8 59 63 29 -129 84 -109 46 -37 -14 46 47 63 -13
-230a3
##PAGE=	F1=-21765.7
##FIRST=	23146.756194512010552,	4241.1435120000014649,	0
##DATA TABLE=	(F2++(Y..Y)), PROFILE
4241A7k9m8K7R8oj7J03j14p1K5l4NK1J25j15j48J14J03j25O5Rj22J26n2J41p4j28L6K0MJ22
$$ 17 -12 -60 -33 65 59 42 145 31 -40 -15 -49 -44 -23 102 -13 -161 -47 56 -69 -4 5 -117 9 -43 98 24 -104 -68 -48 -44 78
3970G8j4J06j61j24P0J58j51l9L9j4ML0K7J18q9j0L8q4n5J94r2O9q9L0mM5j07M7N1l2QL1k11
$$ 78 64 170 9 -115 -45 113 -38 -77 -38 -52 -48 -18 9 127 38 28 66 -18 -73 121 29 98 9 39 35 80 -27 20 71 39 47 78 -133
3681a33J00o5J60q1k5J5m8R1J3K2m3r4J35m2n8pJ38k0j14Q2q0m1O7L8l6m4N4J1Qm4m5K05n9
$$ -133 -33 -98 62 -19 -44 -29 -77 14 27 49 6 -88 47 5 -53 -60 78 58 -56 26 -54 -95 -28 10 -26 -70 -16 -5 3 -41 -86 119 60
3392F0k7M7nj30R5m1j1K7oL6k7Op1j3L4P4p0JkM5Lj3n3O9j05L8L0qK1m9k1mN1k8R3OKM4j3
$$ 60 33 80 75 -55 40 -1 -12 15 9 45 18 24 -47 -60 -26 48 -22 -21 -23 22 25 12 -41 28 -77 -39 -9 -17 4 -45 -66 -70 -19 -47 46 52 54 98 85
$$ [...]
-230i5
##END NTUPLES=	nD NMR SPECTRUM
##END=	
##END=	
