##TITLE=	Mar02-2022.21.fid
TM-VI-273, Y+Ph-pyr, acetone-d6, 13C

##JCAMP-DX=	6.0	$$ MestReNova 14.3.0-30573
##DATA TYPE=	LINK
##BLOCK_ID=	1
##BLOCKS=	2    
##ORIGIN=	Mestrelab Research S.L.
##OWNER=	hrzepa
##$MNOVA/LINK_BLOCK_TYPE=	ITEM	$$ NMR Spectrum
##$MNOVA/ITEM/POLYGON=	(XY..XY)
5321,5835
8722,5835
8722,8208
5321,8208
5321,5835
##$MNOVA/ITEM/Z=	0
##$MNOVA/ITEM/ANGLE=	0
##TITLE=	Mar02-2022.21.fid
##JCAMP-DX=	6.0	$$ MestReNova 14.3.0-30573
##BLOCK_ID=	2
##DATA TYPE=	MNOVA NMR VIEW DATA
##DATA CLASS=	MNOVA VIEW DATA
##$MNOVA/ITEM/ZOOM/X=	-31.150195598113686657,	251.15679998888273872
##$MNOVA/ITEM/ZOOM/Y=	-1179.7681808471679688,	12592.6463623046875
##END=	
##TITLE=	Mar02-2022.21.fid
##JCAMP-DX=	6.0	$$ MestReNova 14.3.0-30573
##BLOCK_ID=	3
##DATA TYPE=	NMR SPECTRUM
##DATA CLASS=	XYDATA
##NUMDIM=	1
##ORIGIN=	Bruker BioSpin GmbH
##OWNER=	nmr
##.OBSERVE FREQUENCY=	100.64143946071199309
##.OBSERVE NUCLEUS=	^13C
##.SOLVENT NAME=	Acetone
##.PULSE SEQUENCE=	zgpg30
##LONGDATE=	2022/03/03 23:30:00.000
##.ACQUISITIONMODE=	SIMULTANEOUS (DQD)
##$ORIGINAL FORMAT=	Bruker XWIN-NMR
##$MNOVA/SCALES_VERSION=	9
##$PARAMETER FILE=	(acqus, ASCII, /private/var/folders/f6/rjf_tdyn2v98c5c0wvkgn4s80000gn/T/32G3ul9eSmKSSrI6ts$0ww/21/acqus, 0)
$$ ##TITLE= Parameter file, TOPSPIN		Version 3.2
$$ ##JCAMPDX= 5.0
$$ ##DATATYPE= Parameter Values
$$ ##NPOINTS= 11	$$ modification sequence number
$$ ##ORIGIN= Bruker BioSpin GmbH
$$ ##OWNER= nmr
$$ $$ 2022-03-03 23:30:59.019 +0000  nmr@CZC2439F63
$$ $$ /opt/topspin/data/agmb/nmr/Mar02-2022/21/acqus
$$ $$ process /opt/topspin3.2/prog/mod/shimcntl
$$ ##$ACQT0= -1.90126054427203
$$ ##$AMP= (0..31)
$$ 100 100 100 100 100 100 100 100 100 100 100 100 100 100 100 100 100 100
$$ 100 100 100 100 100 100 100 100 100 100 100 100 100 100
$$ ##$AMPCOIL= (0..19)
$$ 0 0 0 0 0 0 0 0 0 0 0 0 0 0 0 0 0 0 0 0
$$ ##$ANAVPT= -1
$$ ##$AQSEQ= 0
$$ ##$AQ_mod= 3
$$ ##$AUNM= <au_zg>
$$ ##$AUTOPOS= <6 >
$$ ##$BF1= 100.63037
$$ ##$BF2= 400.2
$$ ##$BF3= 100.63037
$$ ##$BF4= 100.63037
$$ ##$BF5= 100.63037
$$ ##$BF6= 100.63037
$$ ##$BF7= 100.63037
$$ ##$BF8= 100.63037
$$ ##$BYTORDA= 0
$$ ##$CAGPARS= (0..11)
$$ 0 0 0 0 0 0 0 0 0 0 0 0
$$ ##$CFDGTYP= 0
$$ ##$CFRGTYP= 9
$$ ##$CHEMSTR= <none>
$$ ##$CNST= (0..63)
$$ 1 1 145 1 1 1 1 1 1 1 1 1 1 1 1 1 1 1 1 1 1 1 1 1 1 1 1 1 1 1 1 1 1 1 1
$$ 1 1 1 1 1 1 1 1 1 1 1 1 1 1 1 1 1 1 1 1 1 1 1 1 1 1 1 1 1
$$ ##$CPDPRG= (0..8)
$$ <waltz16> <> <waltz16> <> <mlev> <mlev> <mlev> <mlev> <mlev>
$$ ##$D= (0..63)
$$ 0 1 0.00345 0 0 0 0 0 0 0.06 0 0.03 2e-05 3e-06 0 0 0.0002 0 0 0 0 0 0
$$ 0 0 0 0 0 0 0 0 0 0 0 0 0 0 0 0 0 0 0 0 0 0 0 0 0 0 0 0 0 0 0 0 0 0 0 0
$$ 0 0 0 0 0
$$ ##$DATE= 1646350258
$$ ##$DE= 6.5
$$ ##$DECBNUC= <off>
$$ ##$DECIM= 704
$$ ##$DECNUC= <off>
$$ ##$DECSTAT= 4
$$ ##$DIGMOD= 1
$$ ##$DIGTYP= 12
$$ ##$DQDMODE= 0
$$ ##$DR= 21
$$ ##$DS= 4
$$ ##$DSPFIRM= 0
$$ ##$DSPFVS= 20
$$ ##$DTYPA= 0
$$ ##$EXP= <c13>
$$ ##$F1LIST= <111111111111111>
$$ ##$F2LIST= <222222222222222>
$$ ##$F3LIST= <333333333333333>
$$ [...]
$$ ##$Sgu3PowerLevels= (0..7)
$$ 0 0 0 0 0 0 0 0
$$ ##$Sgu4PowerLevels= (0..7)
$$ 0 0 0 0 0 0 0 0
$$ ##$Sgu5PowerLevels= (0..7)
$$ 0 0 0 0 0 0 0 0
$$ ##$Sgu6PowerLevels= (0..7)
$$ 0 0 0 0 0 0 0 0
$$ ##$Sgu7PowerLevels= (0..7)
$$ 0 0 0 0 0 0 0 0
$$ ##$Sgu8PowerLevels= (0..7)
$$ 0 0 0 0 0 0 0 0
$$ ##$SguType= 3
$$ ##$ShimPowMaxUA= (0..63)
$$ 130000 130000 130000 130000 130000 130000 130000 130000 130000 130000 130000
$$ 130000 130000 130000 130000 130000 130000 130000 130000 130000 0 0 0 0
$$ 0 0 0 0 0 0 0 0 0 0 0 0 0 0 0 0 0 0 0 0 0 0 0 0 0 0 0 0 0 0 0 0 0 0 0 0
$$ 0 0 0 0
$$ ##$ShimPowMaxUC= (0..63)
$$ 130000 130000 130000 130000 130000 130000 130000 130000 130000 130000 130000
$$ 130000 130000 130000 130000 130000 130000 130000 130000 130000 0 0 0 0
$$ 0 0 0 0 0 0 0 0 0 0 0 0 0 0 0 0 0 0 0 0 0 0 0 0 0 0 0 0 0 0 0 0 0 0 0 0
$$ 0 0 0 0
$$ ##$ShimPowMaxUG= (0..63)
$$ 524287 524287 524287 524287 524287 524287 524287 524287 524287 524287 524287
$$ 524287 524287 524287 524287 524287 524287 524287 524287 524287 0 0 0 0
$$ 0 0 0 0 0 0 0 0 0 0 0 0 0 0 0 0 0 0 0 0 0 0 0 0 0 0 0 0 0 0 0 0 0 0 0 0
$$ 0 0 0 0
$$ ##$ShimPowRcbType= 3
$$ ##$ShimPowRes= (0..63)
$$ 1e-20 1e-20 1e-20 1e-20 1e-20 1e-20 1e-20 1e-20 1e-20 1e-20 1e-20 1e-20
$$ 1e-20 1e-20 1e-20 1e-20 1e-20 1e-20 1e-20 1e-20 0 0 0 0 0 0 0 0 0 0 0 0
$$ 0 0 0 0 0 0 0 0 0 0 0 0 0 0 0 0 0 0 0 0 0 0 0 0 0 0 0 0 0 0 0 0
$$ ##$ShimPowRng0= (0..63)
$$ 1 1 1 1 1 1 1 1 1 1 1 1 1 1 1 1 1 1 1 1 0 0 0 0 0 0 0 0 0 0 0 0 0 0 0 0
$$ 0 0 0 0 0 0 0 0 0 0 0 0 0 0 0 0 0 0 0 0 0 0 0 0 0 0 0 0
$$ ##$ShimPowRng1= (0..63)
$$ 1 1 1 1 1 1 1 1 1 1 1 1 1 1 1 1 1 1 1 1 0 0 0 0 0 0 0 0 0 0 0 0 0 0 0 0
$$ 0 0 0 0 0 0 0 0 0 0 0 0 0 0 0 0 0 0 0 0 0 0 0 0 0 0 0 0
$$ ##$ShimPowRng2= (0..63)
$$ 1 1 1 1 1 1 1 1 1 1 1 1 1 1 1 1 1 1 1 1 0 0 0 0 0 0 0 0 0 0 0 0 0 0 0 0
$$ 0 0 0 0 0 0 0 0 0 0 0 0 0 0 0 0 0 0 0 0 0 0 0 0 0 0 0 0
$$ ##$ShimPowRng3= (0..63)
$$ 1 1 1 1 1 1 1 1 1 1 1 1 1 1 1 1 1 1 1 1 0 0 0 0 0 0 0 0 0 0 0 0 0 0 0 0
$$ 0 0 0 0 0 0 0 0 0 0 0 0 0 0 0 0 0 0 0 0 0 0 0 0 0 0 0 0
$$ ##$ShimSysFunc= (0..63)
$$ 1 2 3 4 5 7 9 11 15 16 8 10 12 14 6 17 13 18 19 20 0 0 0 0 0 0 0 0 0 0
$$ 0 0 0 0 0 0 0 0 0 0 0 0 0 0 0 0 0 0 0 0 0 0 0 0 0 0 0 0 0 0 0 0 0 0
$$ ##$ShimSysMatrix= 0
$$ ##$ShimSysType= 1
$$ ##$TFXNUM= 0
$$ ##$TRIPLO2= 0
$$ ##$VTU= 2
$$ ##$VTUETH= <149.236.99.20>
$$ ##$VTUTY= <no>
$$ ##$WBREFAM= (0..15)
$$ 135.5 97.7 100 100 100 100 100 100 100 100 100 100 100 100 100 100
$$ ##$WBREFLM= (0..15)
$$ 0 0 0 0 0 0 0 0 0 0 0 0 0 0 0 0
$$ ##$WBREFPH= (0..15)
$$ 72.26 -67.22 0 0 0 0 0 0 0 0 0 0 0 0 0 0
$$ ##$WBSGU= (0..15)
$$ 0 0 0 0 0 0 0 0 0 0 0 0 0 0 0 0
$$ ##$XFAC= 2
$$ ##END=
$$ 
##$DECIM=	704
##$DSPFVS=	20
##XUNITS=	HZ
##YUNITS=	ARBITRARY UNITS
##FIRSTX=	25274.001712016048259
##LASTX=	-3134.6557087493106337
##DELTAX=	-0.43348832563920586258
##XFACTOR=	1
##YFACTOR=	0.084991217406872515694
##FIRSTY=	-7.4989719390869140625
##MINY=	-34.98217010498046875
##MAXY=	11447.8603515625
##NPOINTS=	65536
##XYDATA=	(X++(Y..Y))
$$ [...]
$$ plain form
8463 212 203 190 178 166 155 142 128 112 96 79 64 59 68 89 111 126 130 128 124 126 138 154 167 177 196 218 221 194 151 116 93 73 57 55 63 66 64 71 93 116 124 125
8445 125 136 160 179 176 158 145 154 177 197 207 217 235 253 252 228 192 157 127 103 89 84 81 80 83 86 75 46 14 4 26 71 118 151 164 165 168 179 186 178 157 134
8427 134 121 119 126 130 124 112 107 118 134 140 135 127 125 134 154 178 191 179 153 135 134 142 153 171 197 218 224 222 228 237 226 185 132 96 87 88 81 66 55 56 66 80 92 102 106
8407 106 96 71 46 36 43 53 48 37 37 54 73 77 71 74 99 137 167 178 169 143 106 68 35 11 0 0 5 11 19 37 63 84 82 63 44 44 62 83 95 98 98 101 103
8389 103 102 102 113 132 146 146 137 132 133 128 108 84 67 61 56 39 11 -18 -35 -33 -19 -1 10 15 16 13 10 13 28 53 73 76 70 74 97 122 123 100 71 56 64 88 114 126 120
8369 120 113 121 141 151 142 128 124 125 120 101 74 50 43 61 93 115 125 145 191 240 251 218 175 148 135 122 108 102 108 120 134 145 154 163 179 202 221 228 225 217 204 185
8351 185 164 144 127 120 129 153 174 182 180 176 166 142 107 74 51 40 42 50 54 44 29 23 31 50 72 95 117 136 157 187 220 239 239 226 211 190 155 113 82 69
8334 69 70 78 90 102 109 107 98 92 93 103 117 129 135 139 150 174 202 216 204 171 135 107 87 70 62 80 131 198 249 262 239 200 161 133 125 145 184 220 229 205 163
$$ packed form
8463B12rj3j2j2j1j3j4j6j6j7j5nRK1K2J5MkmKJ2J6J3J0J9K2Lk7m3l5k3k0j6kQLkPK2K3QJ
8445A25J1K4J9lj8j3RK3K0J0J0J8J8jk4l6l5l0k4j4nljLLj1k9l2j0K2M5M7L3J3JLJ1Pqk1k3
8427A34j3kPMoj2nJ1J6OnqkRK0K4J3j2k6j8jQJ1J8K6K1OkORj1m1n3l6rJpj5j1JJ0J4J2J0M
8407A06j0k5k5j0PJ0nj1%J7J9MoLK5L8L0J1rk6l7l8l3k4j1%NOQJ8K6K1kj9j9%J8K1J2L%LK
8389A03j%J1J9J4%rnJnk0k4j7onj7k8k9j7KJ4J8J1NJllLJ5K5K0LoMK3K5Jk3k9j5QK4K6J2o
8369A20pQK0J0rj4mJnj9k7k4pJ8L2K2J0K0M6M9J1l3m3k7j3j3j4oOJ2J4J1RRJ6K3J9Plqj3j9
8351A85k1k0j7pRK4K1Qkmj0k4l5l3k3j1KQMj0j5oQJ9K2K3K2J9K1L0L3J9%j3j5k1l5m2l1j3
8334F9JQJ2J2PkroJJ0J4J2OMJ1K4K8J4j2l3l6k8k0j7qJ8N1O7N1J3k3l9l9k8qK0L9L6Rk4m2
$$ plain form
8316 163 123 100 95 99 103 106 111 119 121 118 125 149 172 168 127 71 27 6 5 18 44 74 94 90 60 12 -33 -54 -40 -2 35 54 50 34 27 45 85 132 165 171 145 93
8298 93 36 0 -2 17 47 73 84 77 59 54 69 90 92 67 32 6 2 18 44 61 54 30 4 -9 -7 4 25 49 65 67 57 44 33 24 14 5 1 4 16 33 50
8280 50 66 79 80 68 47 28 19 25 48 86 125 146 146 135 133 148 181 227 267 282 262 222 186 170 178 204 230 234 208 164 129 120 130 151 180 210 230 228 209 188
8263 188 174 160 141 118 98 84 76 76 88 110 133 143 138 120 101 93 103 129 165 201 229 239 225 193 161 145 151 177 209 232 240 234 219 193 155 117 95 89 81
8246 81 68 69 100 139 148 122 87 68 61 56 54 60 65 64 67 80 86 69 37 25 46 78 97 101 105 117 132 141 142 144 150 158 159 154 148 145 143 137 126 119 125 145 170 184 175 148 126 121 124
8224 124 116 98 88 94 104 109 111 116 122 119 110 101 93 86 80 75 68 56 42 33 40 62 87 101 102 106 122 142 141 118 95 93 109 126 136 138 134 123 117 129 156 177 173 150 127 115 114
8204 114 114 107 97 94 95 85 53 16 2 14 25 16 3 15 59 110 146 164 179 199 218 227 226 224 231 248 264 263 239 201 175 181 213 246 254 238 217 204 198 185 159
8186 159 131 116 123 144 168 185 199 211 220 228 239 256 272 281 285 291 291 273 239 212 209 227 247 255 247 227 209 204 210 216 219 228 245 261 269 278 299 321 330 326 319 307 279 235 187
$$ packed form
8316A63m0k3nMMLNQKlPK4K3mm1n6m4k1jJ3K6L0K0ml0m8m5k1J4L8L7J9mj6pJ8M0M7L3Ok6n2
8298I3n7l6kJ9L0K6J1pj8nJ5K1Kk5l5k6mJ6K6J7pk4k6j3KJ1K1K4J6Kj0j3j1rj0rmLJ2J7J7
8280E0J6J3Jj2k1j9rOK3L8L9K1%j1kJ5L3M6M0J5k0m0l6j6QK6K6Mk6m4l5rJ0K1K9L0K0kj9k1
8263A88j4j4j9k3k0j4q%J2K2K3J0nj8j9qJ0K6L6L6K8J0j4l2l2j6OK6L2K3Qoj5k6l8l8k2oq
8246H1j3JL1L9Rk6l5j9pnkONjLJ3Oj7l2j2K1L2J9MMJ2J5RJKOQJnolkoj1pOK0K5J4rk7k2nL
8224A24qj8j0OJ0NKNOlrrqponpj2j4rPK2K5J4JMJ6K0jk3k3kJ6J7J0Kmj1oJ2K7K1mk3k3j2j
8204A14%pj0lJj0l2l7j4J2J1rj3J2M4N1L6J8J5K0J9RjkPJ7J6jk4l8k6OL2L3Qj6k1j3oj3k6
8186A59k8j5PK1K4J7J4J2RQJ1J7J6RMO%j8l4k7lJ8K0Qqk0j8nOOLRJ7J6QRK1K2Rmpj2k8m4m8
$$ plain form
8167 187 147 113 89 80 83 85 86 90 99 96 77 57 51 59 71 91 133 196 260 304 317 303 272 234 198 177 182 209 238 251 246 234 222 203 172 136 104 76 55 54 79
8149 79 115 137 137 123 107 96 97 116 146 172 178 162 137 122 131 160 186 189 170 144 120 97 78 73 81 91 95 102 123 158 190 207 205 197 191 183 163 126 87 59 41 25
8131 25 6 -6 -8 -2 16 55 105 140 138 111 92 98 122 148 164 171 167 149 121 92 74 77 98 125 148 164 174 174 155 122 90 74 75 78 79 80 88 104 125 152 182 201
8113 201 196 170 139 119 109 103 100 107 125 148 169 176 161 127 94 75 70 69 70 79 98 118 133 148 169 196 218 226 211 170 107 44 2 -4 15 46 71 84 88 86 80 73
8094 73 78 102 137 159 159 145 127 107 84 68 71 87 96 87 63 44 44 67 103 136 155 154 132 96 68 67 92 116 123 114 102 91 85 95 123 158 180 184 175 155 127 97
8076 97 76 65 64 76 104 129 134 125 123 133 138 131 131 151 181 193 184 173 181 203 222 222 204 185 178 179 179 183 201 225 237 233 234 247 254 229 180 131 93 55 12 -19 -26 -16
8057 -16 -2 9 25 43 54 51 33 5 -24 -49 -59 -52 -30 1 38 73 101 117 121 117 108 98 86 81 92 120 151 163 156 149 165 201 230 229 191 139 105 109 142 176
8040 176 190 188 182 174 156 125 93 72 62 47 16 -24 -59 -74 -61 -21 35 91 129 137 126 121 141 184 222 233 217 194 176 161 149 148 160 175 179 174 177 198 228
$$ packed form
8167A87m0l4k4rLKJMRlj9k0oQJ2K0M2O3O4M4J3j4l1l8l6k1NK7K9J3nj2j2j9l1l6l2k8k1jK5
8149G9L6K2%j4j6j1JJ9L0K6Oj6k5j5RK9K6Lj9k6k4k3j9nQJ0MPK1L5L2J7kqoqk0l7l9k8j8j6
8131B5j9j2kOJ8L9N0L5kk7j9OK4K6J6Pmj8k8k9j8LK1K7K3J6J0%j9l3l2j6JLJJQJ6K1K7L0J9
8113B01nk6l1k0j0olPJ8K3K1Pj5l4l3j9njJRJ9K0J5J5K1K7K2Qj5m1o3o3m2oJ9L1K5J3Mkop
8094G3NK4L5K2%j4j8k0k3j6LJ6Rrk4j9%K3L6L3J9jk2l6k8jK5K4Prj2j1oJ0K8L5K2Mrk0k8l0
8076I7k1j1jJ2K8K5NrkJ0Np%K0L0J2rj1QK2J9%j8j9pJ%MJ8K4J2mJJ3Pk5m9m9l8l8m3l1pJ0
8057a6J4J1J6J8J1lj8k8k9k5j0PK2L1L7L5K8J6Mmrj0j2nJ1K8L1J2ppJ6L6K9jl8n2l4ML3L4
8040A76J4koqj8l1l2k1j0j5l1m0l5j5J3M0N6N6L8Qj1nK0M3L8J1j6k3j8j5j2jJ2J5MnLK1L0
$$ plain form
8023 228 251 259 255 245 228 198 161 134 127 138 150 158 169 188 205 209 204 204 216 232 238 226 199 170 153 152 155 150 137 128 126 121 109 97 99 118 141 151 138 107 72 51
8005 51 49 68 101 134 154 159 155 148 128 86 38 13 22 50 83 126 180 227 245 229 191 144 97 59 42 46 64 88 115 142 164 181 199 222 243 253 245 219 184
7988 184 151 127 110 99 103 126 166 211 246 269 281 288 292 286 264 233 209 199 196 191 189 198 209 203 169 114 56 12 0 25 67 95 96 79 60 44 29 20 28 56 99
7970 99 144 177 193 195 190 177 154 126 110 110 120 135 155 178 191 179 144 108 96 118 155 182 183 165 143 125 110 92 72 56 57 81 115 134 126 101 81 68
7954 68 55 45 48 57 52 30 8 -2 -14 -31 -34 -12 16 23 10 6 26 61 96 127 155 178 199 223 240 239 219 190 164 139 114 95 89 89 80 54 18 -4 9 65
7936 65 136 191 209 196 165 134 115 114 123 129 126 116 99 76 57 53 66 90 117 139 152 151 145 148 162 174 174 163 156 157 166 173 167 137 93 59 55 79 110 132 138 131 119 112
7917 112 116 129 151 175 184 161 111 70 64 85 102 100 92 94 105 112 105 93 89 102 131 164 194 224 255 276 271 235 188 157 159 186 218 238 253 272 294 299 277 242 213
7899 213 190 159 120 89 73 67 64 69 77 80 82 98 123 134 118 102 110 128 121 85 49 27 4 -20 -29 -9 26 57 89 132 180 215 231 237 236 220 188 149 114 87
$$ packed form
8023B28K3Qmj0j7l0l7k7pJ1J2QJ1J9J7Mn%J2J6Oj2k7k9j7jLnj3rknj2j2KJ9K3J0j3l1l5k1
8005E1kJ9L3L3K0Nmpk0m2m8k5RK8L3M3N4M7J8j6l8m7m7l8j7MJ8K4K7K7K2J7J8K3K1J0qk6l5
7988A84l3k4j7j1MK3M0M5L5K3J2PMok2l1k4j0lnkRJ1ol4n5n8m4j2K5M2K8Jj7j9j6j5rQK8M3
7970I9M5L3J6Knj3k3k8j6%J0J5K0K3J3j2l5l6j2K2L7K7Jj8k2j8j5j8k0j6JK4L4J9qk5k0j3
7954F8j3j0LRnk2k2j0j2j7lK2K8Pj3mK0L5L5L1K8K3K1K4J7jk0k9k6k5k5j9o%rk6l6k2J3N6
7936F5P1N5J8j3l1l1j9jROlj0j7k3j9mJ3K4K7K2J3joLJ4J2%j1pJRPol0m4l4mK4L1K2Opj2p
7917A12MJ3K2K4Rk3n0m1oK1J7kqKJ1Ppj2mJ3K9L3L0L0L1K1nl6m7l1KK7L2K0J5J9K2Nk2l5k9
7899B13k3l1l9l1j6olNQLKJ6K5J1j6j6QJ8pl6l6k2k3k4rK0L5L1L2M3M8L5J6Ojj6l2l9l5k7
$$ plain form
7882 87 65 42 15 -2 8 52 100 121 115 109 118 128 122 103 84 75 79 100 131 148 130 87 47 33 37 37 27 26 52 96 132 141 129 107 84 66 58 60 58 47 39 56
7864 56 89 111 113 110 117 123 113 93 82 95 129 173 213 236 240 228 203 159 94 28 -17 -34 -25 6 54 99 119 115 104 100 102 102 100 94 79 62 56 65 74 71 63 57 48 29 6
7844 6 1 32 91 152 190 194 174 147 123 104 89 80 78 80 84 89 95 105 122 143 151 129 84 41 19 11 3 -11 -24 -29 -20 1 31 59 81 96 106 113 123 144 169 184 178
7826 178 158 136 118 107 112 131 149 153 145 140 144 148 145 143 148 161 172 180 185 190 189 178 157 138 128 129 138 152 166 171 164 152 147 147 142 128 112 99 81 61 54 65 74 71 69 86 110
7805 110 108 73 30 5 1 11 32 50 51 37 30 39 47 45 47 72 113 140 145 136 127 115 108 115 138 155 150 131 120 133 167 209 241 250 228 181 127 90 83 101 120 117 88
7787 88 52 26 12 5 8 30 71 113 140 154 168 188 200 187 150 110 93 108 134 147 139 126 128 150 179 197 202 203 207 216 226 234 239 241 244 247 241 222 197 174 152 118
7768 118 68 16 -15 -19 -5 11 27 45 67 85 93 82 56 29 20 32 48 46 26 13 24 53 82 106 133 164 190 205 215 224 226 212 185 161 151 150 150 149 150 154
7751 154 152 134 104 77 65 65 71 83 102 122 129 122 114 109 101 90 89 107 128 121 85 47 37 62 106 147 169 170 161 151 141 131 129 144 171 191 190 175 155 133 114 106
$$ packed form
7882H7k2k3k7j7J0M4M8K1ooRJ0oj9j9rMK1L1J7j8m3m0j4M%j0jK6M4L6Rj2k2k3j8qKkj1qJ7
7864E6L3K2KlPOj0k0j1J3L4M4M0K3Mj2k5m4o5o6m5j7RL1M8M5K0mj1mK%koj5j7oRRlqorj9k3
7844FnL1N9O1L8Mk0k7k4j9j5rkKMNOJ0J7K1Qk2m5m3k2qqj4j3nRK1L0K8K2J5J0PJ0K1K5J5o
7826A78k0k2j8j1NJ9J8MqnMMlkNJ3J1QNNjj1k1j9j0JRJ4J4Npj2n%nj4j6j3j8k0pJ1RlkJ7K4
7805A10kl5m3k5mJ0K1J8Jj4pRQkKK5M1K7Nrrj2pPK3J7nj9j1J3L4M2L2Rk2m7n4l7pJ8J9lk9
7787H8l6k6j4pLK2M1M2K7J4J4K0J2j3l7m0j7J5K6J3qj3KK2K9J8NJMRJ0QNKLLoj9k5k3k2l4
7768A18n0n2l1mJ4J6J6J8K2J8Qj1k6k7rJ2J6kk0j3J1K9K9K4K7L1K6J5J0RKj4k7k4j0j%jJM
7751A54kj8l0k7j2%OJ2J9K0Ppqnqj1jJ8K1pl6l8j0K5M4M1K2Jrj0j0j0kJ5K7K0jj5k0k2j9q
$$ plain form
7733 106 108 106 91 70 59 62 67 68 70 81 97 107 109 111 120 132 135 125 110 103 103 106 114 129 142 139 114 79 47 30 32 53 75 80 67 58 63 71 68 62 72 99 123 130 119 102
7713 102 88 86 98 114 120 114 105 97 88 82 87 108 136 158 162 145 114 83 71 84 116 154 185 200 197 186 184 189 188 170 143 123 123 136 151 155 144 121 95 70 46 25
7695 25 9 2 8 31 69 111 136 134 119 111 126 153 171 167 153 148 161 176 182 183 196 221 241 244 237 229 214 190 164 152 149 142 125 104 82 54 26 22 57 116 164 182
7677 182 177 162 144 131 126 125 121 109 98 99 111 120 116 96 72 56 58 71 80 74 60 45 28 5 -10 4 58 123 166 177 168 154 139 119 92 63 51 66 106 150
7659 150 185 210 226 230 219 207 208 226 248 264 264 244 209 184 190 220 248 261 266 269 258 224 177 140 128 136 149 151 135 112 94 85 78 73 80 103 136 171 205 230 230
7641 230 199 162 141 133 116 84 58 50 52 57 68 90 113 124 125 126 128 125 111 92 80 80 94 118 143 165 178 180 175 175 194 225 249 250 237 226 215 190 153 124 116 123
7623 123 126 115 87 48 13 0 15 47 81 116 153 181 187 171 147 123 99 77 60 40 14 -6 2 46 95 122 130 138 153 166 163 143 110 75 55 57 65 59 40
7606 40 25 25 33 42 52 60 53 36 37 70 114 138 135 125 120 117 107 98 99 110 121 125 123 117 111 105 100 101 111 127 143 156 164 164 147 115 86 72 67 55 35 28 47 83 119 154
$$ packed form
7733A06Kkj5k1j1LNJKJ1J6J0KKRJ2Lj0j5p%LQJ5J3lk5l5l2j7KK1K2Nj3rNQloJ0K7K4Pj1j7
7713A02j4kJ2J6OorqroNK1K8K2Mj7l1l1j2J3L2L8L1J5lj1kNjj8k7k0%J3J5Mj1k3k6k5k4k1
7695B5j6pOK3L8M2K5kj5qJ5K7J8mj4nJ3J5OJJ3K5K0Lpqj5k4k6j2lpj7k1k2k8k8mL5N9M8J8
7677A82nj5j8j3njmj2j1JJ2Rmk0k4j6KJ3Roj4j5j7k3j5J4N4O5M3J1rj4j5k0k7k9j2J5M0M4
7659A50L5K5J6Mj1j2JJ8K2J6%k0l5k5OL0K8J3NLj1l4m7l7j2QJ3Kj6k3j8rpnPK3L3L5L4K5%
7641B30l1l7k1qj7l2k6qKNJ1K2K3J1JJKlj4j9j2%J4K4K5K2J3Kn%J9L1K4Jj3j1j1k5l7k9qP
7623A23Lj1k8l9l5j3J5L2L4L5L7K8Oj6k4k4k4k2j7k0k6k0QM4M9K7QQJ5J3lk0l3l5k0KQoj9
7606D0j5%QRJ0Qpj7JL3M4K4lj0nlj0rJJ1J1MkooonJJ0J6J6J3Q%j7l2k9j4nj2k0pJ9L6L6L5
$$ plain form
7586 154 192 228 242 233 218 216 223 217 188 145 102 66 40 32 50 90 137 176 199 199 184 170 165 160 142 115 100 107 127 152 178 204 220 224 226 233 239 230 207 184 172 173
7568 173 181 182 168 143 120 108 94 69 47 53 97 156 194 193 165 134 118 112 103 94 100 128 157 164 156 160 188 219 225 196 150 108 88 91 111 133 144 135 109 80 65 68
7550 68 77 84 94 109 115 106 94 94 100 90 67 47 34 18 7 21 60 92 95 84 86 102 114 110 95 75 55 46 50 56 50 36 34 52 74 87 96 110 133 151 147 115 66
7531 66 28 19 38 68 101 133 163 183 195 205 216 217 197 159 112 72 49 47 60 78 96 116 138 160 174 175 160 134 110 105 125 160 188 191 171 142 130 148
7515 148 189 226 235 205 150 93 58 53 68 88 102 109 122 147 178 195 195 192 201 220 234 237 235 227 203 165 132 113 99 77 54 43 46 57 76 99 109 93 61 41
7498 41 46 61 73 90 126 174 210 223 226 235 251 268 281 298 315 314 283 236 205 203 214 216 201 178 150 120 100 96 101 97 85 78 80 83 81 82 94 113 134 158 183 200
7479 200 201 189 177 168 161 156 162 181 206 226 230 223 217 219 226 231 228 219 209 202 205 221 234 218 163 96 55 50 62 62 44 20 13 36 87 146 186 192 173 157 162 179 192 193 197 213
7459 213 241 267 279 267 228 174 135 126 136 140 133 130 137 140 129 112 100 89 71 52 52 72 101 122 137 151 168 181 182 166 139 112 98 96 96 85 65 47 41 50 66
$$ packed form
7586A54L8L6J4rj5kPok9m3m3l6k6qJ8M0M7L9K3%j5j4nnj8k7j5PK0K5K6K6J6MKPOrk3k3j2J
7568A73QJj4k5k3j2j4k5k2OM4N9L8jk8l1j6orrOK8K9PqMK8L1Ok9m6m2k0LK0K2J1rk6k9j5L
7550F8RPJ0J5Orj2%Oj0k3k0j3j6j1J4L9L2Lj1KJ6J2mj5k0k0rMOoj4kJ8K2J3RJ4K3J8ml2m9
7531F6l8rJ9L0L3L2L0K0J2J0J1Jk0l8m7m0k3kJ3J8J8K0K2K2J4Jj5k6k4nK0L5K8Lk0k9j2J8
7515A48M1L7Rl0n5n7l5nJ5K0J4PJ3K5L1J7%lRJ9J4Lkqk4l8l3j9j4k2k3j1LJ1J9K3J0j6l2k0
7498D1NJ5J2J7L6M8L6J3LRJ6J7J3J7J7jl1m7l1kJ1Kj5k3k8l0k0mNmj2pKLkJJ2J9K1K4K5J7
7479B00Jj2j2rpnOJ9K5K0MpoKPNlrj0pLJ6J3j6n5o7m1nJ2%j8k4pK3N1N9M0Oj9j6NJ7J3JMJ6
7459B13K8K6J2j2l9n4l9rJ0MplPLj1j7j2j1j8j9%K0K9K1J5J4J7J3Jj6k7k7j4k%j1k0j8oRJ6
$$ plain form
7442 66 77 76 65 58 67 88 102 98 80 67 70 89 122 162 192 197 180 169 186 222 253 268 276 284 283 266 241 220 206 192 176 166 163 159 147 124 104 96 93 80 52 25
7423 25 15 17 13 3 1 19 47 76 105 140 175 195 189 164 138 132 153 180 185 162 135 126 129 123 101 79 66 64 68 78 95 114 131 140 132 107 79 65 70 86 103 116
7405 116 128 139 144 141 129 126 146 186 221 228 210 183 153 119 84 59 51 60 83 112 131 126 108 102 117 134 130 106 83 76 87 107 128 146 158 167 177 187 196 205 211 209
7387 209 188 144 88 46 36 48 54 39 22 29 68 115 149 164 167 164 161 158 159 167 190 227 270 301 313 308 289 259 230 215 218 225 222 211 202 194 181 162 148 143 142 135 116
7368 116 93 73 59 42 17 -4 -8 12 42 68 88 114 147 175 186 181 170 154 133 108 87 76 70 65 72 97 130 144 126 89 65 72 101 129 135 120 100 94 108
7351 108 132 159 185 204 204 183 156 139 134 133 131 128 122 108 91 77 65 55 55 69 88 96 93 92 97 99 104 128 174 220 254 276 284 268 235 205 188 168 135 112 115 124 110
7333 110 82 75 99 131 151 163 168 161 146 140 151 163 171 189 224 262 280 278 267 245 203 146 94 60 45 47 63 85 102 120 148 188 229 260 277 273 239 181 124
7316 124 93 90 103 119 139 163 186 196 189 169 151 152 179 220 245 233 195 160 150 158 162 151 135 133 148 163 158 125 81 48 37 40 37 19 -6 -20 -5 31 65
$$ packed form
7442F6J1jj1pRK1J4mj8j3LJ9L3M0L0Nj7j1J7L6L1J5QQjj7k5k1j4j4j6j0lmj2k3k0qlj3k8k7
7423B5j0Kmj0kJ8K8K9K9L5L5K0ok5k6oK1K7Nk3k7rLok2k2j3kMJ0J7J9J7Rqk5k8j4NJ6J7J3
7405A16J2J1Nlj2lK0M0L5Pj8k7l0l4l5k5qRK3K9J9nj8oJ5J7mk4k3pJ1K0K1J8J2RJ0J0RROk
7387B09k1m4n6m2j0J2Oj5j7PL9M7L4J5LlllJQK3L7M3L1J2nj9l0k9j5LPlj1rqj3j9j4njpj9
7368A16k3k0j4j7k5k1mK0L0K6K0K6L3K8J1nj1j6k1k5k1j1onPK5L3J4j8l7k4PK9K8Oj5k0oJ4
7351A08K4K7K6J9%k1k7j7njkloj4j7j4j2j0%J4J9QljNKNK4M6M6L4K2Qj6l3l0j7k0l3k3LRj4
7333A10k8pK4L2K0J2Npj5oJ1J2QJ8L5L8J8kj1k2m2n7n2l4j5KJ6K2J7J8K8M0M1L1J7ml4n8n7
7316A24l1lJ3J6K0K4K3J0pk0j8JK7M1K5j2l8l5j0QMj1j6kJ5J5nl3m4l3j1Llj8k5j4J5L6L4
$$ plain form
7299 65 71 52 30 15 -2 -26 -37 -11 45 100 131 145 152 148 132 121 132 153 158 146 138 146 155 144 119 97 82 72 73 91 116 126 116 105 101 96 85 83 107 142 160
7281 160 153 139 138 147 151 145 134 119 102 87 76 70 67 67 67 66 68 76 86 94 93 83 68 54 50 55 56 42 22 10 9 8 6 19 51 83 96 85 61 34 12 0 -2 3 24 66
7261 66 117 147 148 147 170 202 209 187 163 157 158 153 141 131 124 121 125 128 120 100 77 61 50 39 26 15 11 20 52 96 133 151 154 148 135 120 120 138 159 166 157 139 115 91
7242 91 84 106 140 157 147 126 108 88 60 36 37 65 102 127 140 145 134 97 44 6 11 51 89 100 86 66 55 61 80 101 109 98 87 95 126 159 176 174 167 165
7225 165 171 187 211 236 249 241 221 202 195 199 213 234 257 269 265 256 255 258 255 242 229 225 227 232 236 232 214 185 161 148 139 126 116 115 122 128 128 123 115 106 105 113 127 145 171 194 191
7204 191 154 106 84 102 144 186 217 233 235 224 205 183 163 151 147 147 147 147 142 124 96 78 81 93 98 102 120 154 185 203 218 237 253 255 237 196 137 74 30 16
7187 16 21 30 31 18 -8 -32 -33 -4 42 92 143 193 234 254 257 255 258 263 261 249 229 213 202 189 164 136 127 145 175 195 204 208 207 194 168 142 126 125 141 168 190 192 170
7168 170 138 115 106 103 99 98 103 115 126 133 137 142 147 151 154 156 157 161 170 183 188 174 144 109 76 45 23 19 36 61 88 119 154 183 195 191 181 175 172 168 156 143 141 159 183 186
$$ packed form
7299F5Oj9k2j5j7k4j1K6N6N5L1J4Pmj6j1J1K1Nj2qQRj1k5k2j5j0JJ8K5J0j0j1mnj1kK4L5J8
7281A60pj4jRMoj1j5j7j5j1ol%%jKQJ0Qjj0j5j4mNJj4k0j2jjkJ3L2L2J3j1k4k7k2j2kNK1M2
7261F6N1L0JjK3L2Pk2k4oJnj2j0plMLqk0k3j6j1j1j3j1mRL2M4L7J8Loj3j5%J8K1Prj8k4k4
7242I1pK2L4J7j0k1j8k0k8k4JK8L7K5J3Nj1l7n3l8NM0L8J1j4k0j1OJ9K1Qj1j1QL1L3J7kpk
7225A65OJ6K4K5J3qk0j9pMJ4K1K3J2mrjLlj3j3mKNMmj8k9k4j3rj3j0jPO%nqrjQJ4J8K6K3l
7204A91l7m8k2J8M2M2L1J6Kj1j9k2k0j2m%%%nj8k8j8LJ2NMJ8L4L1J8J5J9J6Kj8m1n9o3m4j4
7187A6NRJj3k6k4jK9M6N0N1N0M1K0LkLNkj2k0j6j1j3k5k8rJ8L0K0RMjj3k6k6j6jJ6K7K2Kk2
7168A70l2k3rlmjNJ2J1PMNNMLKJMRJ3Nj4l0l5l3l1k2mJ7K5K7L1L5K9J2mj0olmj2j3kJ8K4L
$$ plain form
7149 186 165 140 129 133 136 132 121 103 79 61 59 67 77 80 74 53 23 2 2 17 40 76 128 182 212 216 212 210 205 185 154 120 92 76 76 85 91 86 72 51 30 23 41
7130 41 70 86 80 75 93 119 120 89 50 35 59 114 181 240 283 310 321 310 281 250 238 241 240 214 162 93 30 -1 3 24 29 9 -16 -32 -36 -26 1 40 65
7113 65 64 53 52 58 51 38 38 55 67 60 49 61 98 147 196 238 261 265 265 273 282 279 258 230 209 202 215 246 273 279 267 257 255 246 218 177 145 135 143 155 154 142 137 155
7094 155 186 207 210 208 207 199 178 151 129 108 89 79 83 89 89 95 120 152 162 147 132 136 150 149 119 70 26 12 35 84 137 178 200 202 187 161 132 103 84 85 102
7076 102 115 109 98 99 106 102 88 83 91 100 114 148 196 220 191 125 63 30 23 30 39 34 15 -2 -1 12 24 28 31 28 12 -12 -19 6 51 80 77 59 51 66 92 114 121 118 112
7057 112 111 118 133 145 147 137 119 94 69 60 75 100 112 105 99 106 112 99 76 69 90 122 143 144 125 97 77 72 75 67 43 20 16 32 49 54 53 62 86 117 144 165 182
7038 182 188 178 159 147 148 149 139 126 125 140 159 175 191 216 249 274 269 228 175 136 116 99 76 58 56 65 83 114 160 202 216 198 168 145 136 139 149 159 158 143
7021 143 116 89 77 91 120 142 150 161 183 196 178 137 104 94 94 100 118 143 155 139 112 99 105 119 130 133 129 124 128 141 147 135 121 124 140 145 130 117 127 157
$$ packed form
7149A86k1k5j1MLmj1j8k4j8kQJ0Lok1l0k1%J5K3L6N2N4L0Mmknk0l1l4k8j6%ROnj4k1k1pJ8
7130D1K9J6onJ8K6Jl1l9j5K4N5O7N9M3K7J1j1k9l1j2Ljk6n2o9o3l1MK1Nk0k5j6mJ0K7L9K5
7113F5jj1jOpj3%J7J2pj1J2L7M9M9M2K3M%QRlk1k8k1pJ3L1K7Oj2j0krk8m1l2j0QJ2jj2nJ8
7094A55L1K1Lkjqk1k7k2k1j9j0MO%OK5L2J0j5j5MJ4jl0m9m4j4K3M9N3M1K2Kj5k6k9k9j9JJ7
7076A02J3oj1JPmj4nQRJ4L4M8K4k9o6o2l3pPRnj9j7JJ3J2MLlj6k4pK5M5K9lj8qJ5K6K2Plo
7057A12jPJ5J2Kj0j8k5k5rJ5K5J2poPOj3k3pK1L2K1Jj9k8k0nLqk4k3mJ6J7NjRK4L1K7K1J7
7038A82Oj0j9j2JJj0j3jJ5J9J6J6K5L3K5nm1n3l9k0j7k3j8kRJ8L1M6M2J4j8l0k3rLJ0J0jj5
7021A43k7k7j2J4K9K2QJ1K2J3j8m1l3j0%OJ8K5J2j6k7j3OJ4J1LmnMJ3Oj2j4LJ6Nj5j3J0L0
$$ plain form
7003 157 185 194 182 159 133 119 129 162 200 226 234 236 238 235 220 193 162 137 126 133 157 185 204 208 202 191 181 172 165 162 169 191 226 255 262 251 237 228 216 196 172 149
6985 149 130 113 101 94 94 105 131 165 188 197 204 219 232 232 223 214 205 188 169 166 183 207 213 191 152 120 119 143 168 180 188 207 226 226 205 176 150 130 122 135 160 178
6967 178 182 185 200 226 254 278 289 281 255 222 193 166 143 132 140 157 173 185 185 163 117 70 50 54 60 59 64 89 126 154 166 171 175 180 183 182 180 180 182 179 161 127 89 63
6948 63 58 68 80 83 75 64 59 66 88 121 158 185 198 201 209 226 246 259 258 245 224 203 191 187 183 179 181 192 199 189 167 146 136 136 147 167 186 192 188 189 198 199 183 164 159
6928 159 160 149 125 110 122 154 188 215 232 240 243 246 249 245 230 209 191 181 181 190 200 200 190 183 193 218 241 244 216 161 100 58 46 53 59 60 63 64 57 43 38 44 46 31 10
6909 10 0 9 31 57 86 115 141 157 158 137 103 74 68 77 80 75 77 103 139 156 146 131 130 142 152 156 163 182 210 240 261 260 224 158 89 46 38 50 63 72 81 100
6891 100 131 167 193 197 184 164 147 127 97 58 23 4 6 20 41 64 86 100 104 100 99 101 104 103 98 89 77 60 39 16 -2 -3 21 56 68 46 18 12 27 35 28 20
6872 20 24 33 35 37 51 78 102 112 108 103 114 142 168 172 157 145 145 142 128 113 105 90 51 7 -7 21 76 130 170 189 183 157 131 114 100 76 45 16 -2 -7 9
$$ packed form
7003A57K8Rj2k3k6j4J0L3L8K6QKKlj5k7l1k5j1PK4K8J9Moj1j0rplPK2L5K9Pj1j4rj2k0k4k3
6985A49j9j7j2p%J1K6L4K3RPJ5J3%rrrj7j9lJ7K4Ok2l9l2jK4K5J2QJ9J9%k1k9k6k0qJ3K5J8
6967A78MLJ5K6K8K4J1qk6l3k9k7k3j1QJ7J6J2%k2m6m7k0MOjNK5L7K8J2NMNLjk%Klj8l4l8k6
6948F3nJ0J2Lqj1nPK2L3L7K7J3LQJ7K0J3jj3k1k1j2mmmKJ1Pj0k2k1j0%J1K0J9OmJRJj6j9n
6928A59Jj1k4j5J2L2L4K7J7QLLLmj5k1j8j0%RJ0%j0pJ0K5K3Lk8n5o1m2j2POJLJpj4nOKj5k1
6909A0j0RK2K6K9K9K6J6Jk1l4k9oRLnKK6L6J7j0j5jJ2J0MPJ9K8L0K1jl6o6o9m3qJ2J3RRJ9
6891A00L1L6K6Mj3k0j7k0l0l9l5j9KJ4K1K3K2J4MmjKLjnrj2j7k1k3j8jK4L5J2k2k8oJ5Qpq
6872B0MRKKJ4K7K4J0mnJ1K8K6Mj5j2%lj4j5qj5l9m4j4K8N5N4M0J9ok6k6j7j4k4l1k9j8nJ6
$$ plain form
6855 9 48 96 134 152 148 122 75 22 -10 -15 -6 -6 -20 -33 -30 -6 33 82 134 177 200 205 200 191 176 157 143 144 163 187 205 216 220 219 213 203 190 179 175 174 171 165 164 169 169
6835 169 153 131 119 122 133 151 179 205 211 189 157 137 131 135 149 169 183 180 172 180 199 201 170 129 118 150 198 223 213 181 153 137 131 131 132 131 124 117 120 137 154 157 148
6817 148 140 143 156 172 182 178 164 158 168 183 187 182 188 214 239 243 230 218 209 186 134 66 6 -29 -45 -52 -47 -21 24 68 80 59 29 17 23 34 38 39 44 54 73 104
6798 104 138 164 180 193 207 209 194 172 165 184 219 251 265 262 249 233 214 193 177 179 199 222 233 227 216 208 203 191 176 164 157 149 142 147 170 196 199 176 150 142 141 129
6780 129 106 95 109 140 169 181 171 147 128 128 149 179 213 244 257 237 196 164 153 142 117 93 89 99 103 102 109 128 141 144 144 139 120 93 82 94 106 96 68
6763 68 38 10 -18 -41 -45 -29 -10 -1 -2 -9 -17 -16 0 30 60 80 94 108 123 139 149 149 141 134 136 143 147 147 149 150 138 110 79 65 71 80 80 71 65 69 81 94 103 108 112 116 123 137
6742 137 164 200 230 234 204 158 119 97 78 49 16 -2 2 21 40 60 86 117 143 160 172 188 209 223 223 207 184 160 140 125 120 128 148 174 206 243 276
6726 276 296 300 297 298 300 302 301 290 261 220 194 199 222 234 229 221 221 217 201 186 189 211 233 247 263 295 335 362 355 315 258 206 171 153 146 149 166 197 223 223 194 163 162
$$ packed form
6855IL9M8L8J8mk6m7n3l2nR%j4j3LK4L9M9N2M3K3Nnrj5j9j4JJ9K4J8J1Mjoj0j3j1mjlojN%
6835A69j6k2j2LJ1J8K8K6Ok2l2k0oMJ4K0J4lqQJ9Kl1m1j1L2M8K5j0l2k8j6o%JjppLJ7J7Lr
6817A48qLJ3J6J0mj4oJ0J5MnOK6K5Mj3j2rk3n2o8o0l5j6pNK6M5M4J2k1l0j2OJ1MJNJ0J9L1
6798A04L4K6J6J3J4Kj5k2pJ9L5L2J4lj3j6j9k1j6KK0K3J1oj1qnj2j5j2pqpNK3K6Lk3k6qjj2
6780A29k3j1J4L1K9J2j0k4j9%K1L0L4L1J3k0m1l2j1j1k5k4mJ0MjPJ9J3L%nj9k7j1J2J2j0k8
6763F8l0k8k8k3mJ6J9RjpqJJ6L0L0K0J4J4J5J6J0%qpKPM%KJj2k8l1j4OR%roMJ2J3RNMMPJ4
6742A37K7L6L0Ml0m6l9k2j9k9l3j8MJ9J9K0K6L1K6J7J2J6K1J4%j6k3k4k0j5nQK0K6L2L7L3
6726B76K0MlJKKjj1k9m1k6NK3J2nq%mj6j5LK2K2J4J6L2M0K7pm0n7n2l5j8pLJ7L1K6%k9l1j
$$ plain form
6708 162 194 234 254 248 227 208 205 218 234 233 216 201 195 181 146 105 90 103 128 155 187 214 213 182 153 150 165 172 164 150 135 119 114 138 185 231 256 261 252 234
6690 234 216 213 228 249 261 258 239 201 148 97 60 38 25 25 44 80 116 138 143 139 135 141 157 169 162 137 112 102 107 115 120 122 122 118 113 114 124 143 169 192 198 186 180 202
6671 202 235 236 186 120 83 77 76 72 83 119 159 176 166 144 119 97 80 77 87 106 128 149 166 179 187 185 171 153 144 141 133 122 130 172 224 254 257 253 256 260 258 249 236
6653 236 208 160 105 65 49 47 49 59 82 114 137 145 157 191 239 268 252 207 166 149 149 153 158 167 178 184 175 151 121 96 84 80 73 59 46 38 35 31 27 26 35 50 65
6634 65 75 82 88 93 90 78 66 68 92 129 165 187 190 181 172 169 172 175 178 183 185 178 164 156 160 174 190 204 213 213 207 196 188 188 200 216 228 235 244 256 266 268 266 265 259 239 207 177 153
6613 153 135 131 149 179 193 177 145 120 106 95 79 55 21 -17 -46 -50 -34 -13 5 30 62 93 116 134 156 179 192 191 177 154 128 113 116 134 148 150 150 160
6596 160 178 193 199 205 217 227 231 239 261 288 298 282 253 226 207 197 197 201 196 175 151 144 157 170 162 129 86 52 32 21 13 3 -5 -7 2 22 45 62 74 83 93 102
6578 102 111 120 126 119 94 62 36 19 8 1 3 10 15 22 43 82 121 137 132 127 138 157 170 166 148 131 132 165 235 338 466 594 683 700 637 526 410 315 242
$$ packed form
6708A62L2M0K0ok1j9lJ3J6jj7j5oj4l5m1j5J3K5K7L2K7jl1k9lJ5Pqj4j5j6nK4M7M6K5Nrj8
6690B34j8lJ5K1J2lj9l8n3n1l7k2j3%J9L6L6K2NmmOJ6J2pk5k5j0NQNK%mnJJ0J9K6K3Oj2oK2
6671B02L3Jn0o6l7ojmJ1L6M0J7j0k2k5k2j7lJ0J9K2K1J7J3Qkj4j8rlqj1QM2N2L0LmLMkrj3
6653B36k8m8n5m0j6kKJ0K3L2K3QJ2L4M8K9j6m5m1j7%MNRJ1Ork4l0k5j2mpj4j3qlmmjRJ5J5
6634F5J0PONlj2j2KK4L7L6K2LrrlLLLNKpj4qMJ4J6J4R%oj1q%J2J6J2PRJ2J0Kkjok0l2l0k4
6613A53j8mJ8L0J4j6l2k5j4j1j6k4l4l8k9mJ6K1J8K5L2L1K3J8K2K3J3jj4k3k6j5LJ8J4K%J0
6596A60J8J5OOJ2J0MQK2K7J0j6k9k7j9j0%Mnk1k4pJ3J3ql3m3l4k0j1qj0qkRK0K3J7J2RJ0R
6578A02RROpk5l2k6j7j1pKPNPK1L9L9J6nnJ1J9J3mj8j7JL3P0J03J28J28Q9J7o3j11j16r5p3
$$ plain form
6561 242 186 158 170 209 245 251 230 206 199 210 227 244 257 269 276 272 249 211 171 140 112 80 52 43 54 72 90 109 124 127 119 115 123 128 116 97 93 111 138 159
6544 159 168 168 162 157 151 144 144 159 183 199 203 207 211 195 148 92 59 48 35 18 20 50 89 113 124 136 149 153 138 105 62 24 6 7 15 35 77 136 183 196 190 198 228
6525 228 257 269 263 255 250 252 256 256 243 217 188 165 150 141 139 145 158 172 185 197 208 208 192 167 150 155 175 197 217 234 244 242 233 231 247 273 291 291 275 256 243 234 217
6507 217 188 161 152 155 149 124 98 91 100 112 122 137 158 180 196 204 205 201 188 165 141 133 153 187 210 214 215 229 242 240 226 219 225 226 208 176 144 126 123 128 129 120 102 82
6487 82 66 59 66 88 116 139 153 157 150 135 118 109 104 93 80 78 96 122 140 144 135 119 100 80 61 49 55 82 112 122 111 96 91 93 97 105 119 129 120 96 72 58 56
6469 56 65 80 90 86 70 63 79 113 145 152 136 116 111 129 158 191 227 257 264 237 186 131 89 64 58 67 73 65 49 47 69 103 135 162 184 196 195 190 191 192 181 158 137
6450 137 129 132 137 140 141 135 125 119 126 144 161 171 175 178 183 186 179 156 125 94 68 45 35 54 105 160 186 172 143 127 124 114 85 51 37 53 81 97 102 112 141 172
6432 172 180 151 101 56 40 48 59 49 28 23 51 86 91 64 35 26 32 41 51 64 73 68 52 44 50 67 81 80 62 41 37 49 60 55 43 42 58 83 110 138 166 186
$$ packed form
6561B42n6k8J2L9L6Ok1k4pJ1J7J7J3J2Pmk3l8m0l1k8l2k8rJ1J8J8J9J5LqmQNj2j9mJ8K7K1
6544A59R%onop%J5K4J6MMMj6m7n6l3j1j3j7KL0L9K4J1J2J3Mj5l3m3l8j8JQK0M2N9M7J3oQL0
6525B28K9J2oqnKM%j3k6k9k3j5rkOJ3J4J3J2J1%j6k5j7NK0K2K0J7J0krkJ6K6J8%j6j9j3rj7
6507B17k9k7rLok5k6pRJ2J0J5K1K2J6QJmj3k3k4qK0L4K3MJJ4J3kj4pOJj8l2l2j8lNJrj8k0
6487H2j6pPK2K8K3J4Mpj5j7rnj1j3kJ8K6J8Mrj6j9k0j9j2OK7L0J0j1j5nKMQJ4J0rk4k4j4k
6469E6RJ5J0mj6pJ6L4L2Pj6k0nJ8K9L3L6L0Pk7n1n5m2k5oROqj6kK2L4L2K7K2J2jnJJj1k3k1
6450A37qLNLJoj0oPJ8J7J0MLNLpk3l1l1k6k3j0J9N1N5K6j4k9j6lj0k9l4j4J6K8J6NJ0K9L1
6432A72Qk9n0m5j6QJ1j0k1nK8L5Nk7k9rORJ0J3Rnj6qOJ7J4jj8k1mJ2J1nj2jJ6K5K7K8K8K0
$$ plain form
6414 186 198 201 193 174 152 135 122 108 96 95 103 110 111 118 141 183 235 280 299 282 242 207 192 200 222 245 251 227 185 152 140 138 132 122 113 105 98 99 114 139 160 168 156
6395 156 131 113 130 178 217 213 176 147 147 161 166 155 137 116 93 68 50 44 47 47 36 20 16 33 59 73 65 42 19 13 28 52 67 70 78 104 143 174 182 168 145
6377 145 123 112 111 114 115 117 121 127 128 125 121 115 102 80 60 60 85 124 152 158 149 141 140 141 135 121 106 99 107 123 130 124 115 115 117 113 116 138 173 190 180 163 160 160 149 132 123 120 112 98
6356 98 81 57 28 7 12 33 50 61 79 103 111 92 66 60 78 107 135 153 152 137 125 137 163 180 171 144 114 83 51 26 27 56 90 102 90 78 83 95 94
6339 94 81 67 54 33 7 -12 -23 -40 -68 -95 -103 -83 -37 21 78 118 134 130 115 104 106 122 136 135 128 136 160 176 175 172 180 188 174 141 104 73 53 48 55 58 48 39
6321 39 47 66 73 61 43 33 31 38 62 103 145 169 172 168 171 189 212 224 222 219 231 258 281 287 278 265 253 243 238 243 257 272 274 252 209 173 164 176 186 179 169 168 164 143
6302 143 107 80 73 79 84 87 96 104 97 75 53 49 61 75 80 78 73 62 46 34 37 59 94 133 166 191 210 223 226 208 173 139 126 133 148 166 187 203 201 178 144 110
6283 110 82 71 89 137 187 214 215 209 210 224 248 269 264 225 169 127 107 96 85 77 75 70 52 28 16 27 53 85 113 136 155 176 198 214 209 176 129 97 97
$$ packed form
6414A86J2Lqj9k2j7j3j4j2jQPJPK3M2N2M5J9j7m0l5j5QK2K3Ok4m2l3j2koj0rqpJJ5K5K1Qj2
6395A56k5j8J7M8L9ml7k9%J4Nj1j8k1k3k5j8oL%j1j6mJ7K6J4qk3k3oJ5K4J5LQK6L9L1Qj4k3
6377A45k2j1jLJKMOJlmoj3k2k0%K5L9K8OrqjJoj4j5pQJ6Por%KmLK2L5J7j0j7l%j1j7rlqj4
6356I8j7k4k9k1NK1J7J1J8K4Qj9k6oJ8K9K8J8jj5j2J2K6J7rk7l0l1l2k5JK9L4J2j2j2NJ2j
6339I4j3j4j3k1k6j9j1j7k8k7qK0M6N8N7M0J6mj5j1KJ6J4jpQK4J6jlQQj4l3l7l1k0nPLj0r
6321C9QJ9Pj2j8j0kPK4M1M2K4LmLJ8K3J2klJ2K7K3Orj3j2j0nNJ4J5Kk2m3l6rJ2J0pj0jmk1
6302A43l6k7pONLRQpk2k2mJ2J4Nknj1j6j2LK2L5L9L3K5J9J3Lj8l5l4j3PJ5J8K1J6kk3l4l4
6283A10k8j1J8M8N0K7JoJJ4K4K1nl9n6m2k0j1j1qknj8k4j2J1K6L2K8K3J9K1K2J6nl3m7l2%
$$ plain form
6266 97 128 167 191 191 174 158 164 197 240 266 263 246 233 225 206 175 151 144 144 137 131 143 174 198 195 173 155 158 179 200 200 178 148 130 130 144 163 181 194 201 210 233
6248 233 262 275 268 258 264 270 253 220 202 214 237 240 217 183 151 126 112 107 106 99 81 55 26 3 -3 8 37 76 116 150 178 200 220 238 251 257 263 268 271 275 284 293
6230 293 291 274 251 231 216 202 194 193 192 181 158 131 109 101 113 143 181 211 225 222 208 184 153 119 93 89 106 128 134 133 149 194 242 258 229 170 107 69 68 92
6213 92 113 118 122 137 145 124 88 69 79 101 120 137 157 167 164 157 156 162 173 193 217 227 218 207 210 222 220 201 175 159 159 175 197 207 192 163 139 131 135 139 125 91
6194 91 54 48 80 118 127 106 86 94 125 158 176 169 138 93 53 28 20 17 7 -10 -18 4 60 121 164 193 222 248 254 244 240 252 264 260 249 240 231 211 189 183 202 231
6176 231 251 254 243 230 228 243 262 270 263 251 241 234 224 208 183 149 118 104 111 129 150 168 184 195 201 210 227 248 265 276 288 298 303 303 307 314 311 287 248 214 189
6158 189 167 140 110 85 67 57 52 52 58 67 77 84 85 80 70 54 37 25 31 54 81 96 97 97 107 124 132 132 133 140 139 118 90 88 120 162 185 184 173 159 140 123 121 137
6139 137 159 182 211 238 245 222 184 151 121 89 69 74 100 124 132 132 131 125 112 102 104 122 148 178 202 212 202 181 160 145 135 127 120 118 124 144 177 212 235 240 232
$$ packed form
6266I7L1L9K4%j7j6OL3M3K6lj7j3qj9l1k4p%poJ2L1K4lk2j8LK1K1%k2l0j8%J4J9J8J3PRK3
6248B33K9J3pj0OOj7l3j8J2K3Lk3l4l2k5j4njpj8k6k9k3oJ1K9L9M0L4K8K2K0J8J3OONLMRR
6230B93kj7k3k0j5j4qjjj1k3k7k2qJ2L0L8L0J4lj4k4l1l4k6mJ7K2OjJ6M5M8J6k9n9o3l8jK4
6213I2K1NMJ5Qk1l6j9J0K2J9J7K0J0lpjOJ1K0K4J0rj1LJ2kj9k6j6%J6K2J0j5k9k4qMMj4l4
6194I1l7oL2L8Rk1k0QL1L3J8pl1m5m0k5qlj0j7qK2N6O1M3K9K9K6Oj0mJ2J2mj1rrk0k2oJ9K9
6176B31K0Lj1j3kJ5J9Qpj2j0pj0j6k5l4l1j4PJ8K1J8J6J1ORJ7K1J7J1J2J0N%MPlk4l9l4k5
6158A89k2k7l0k5j8j0n%ORJ0PJnj0j6j7j2OK3K7J5J%J0J7Q%JPjk1k8kL2M2K3jj1j4j9j7kJ6
6139A37K2K3K9K7Pk3l8l3l0l2k0NK6K4Q%joj3j0KJ8K6L0K4J0j0k1k1j5j0qpkOK0L3L5K3Nq
$$ plain form
6122 232 224 223 224 221 209 195 188 196 220 252 276 273 238 184 135 113 125 157 189 210 221 226 222 203 177 164 173 193 201 192 179 169 164 159 159 169 191 220 247 258 247 222
6103 222 199 186 183 182 181 179 174 168 169 185 212 239 261 283 308 332 342 330 297 254 222 213 220 224 211 188 170 161 158 163 181 204 215 206 193 193 198 196 191 197 216 237 260 288
6084 288 312 317 307 303 318 339 351 357 361 354 326 287 256 242 241 247 253 259 272 303 348 387 410 422 429 424 407 393 398 423 466 530 607 677 747 854 1015 1213 1447
6067 1447 1771 2241 2877 3713 4834 6220 7556 8308 8119 7102 5729 4447 3446 2711 2169 1769 1469 1236 1049 901 791
6058 791 715 658 599 525 453 403 376 359 346 342 342 331 303 263 223 189 168 166 175 181 178 170 165 177 213 268 319 350 369 389 404 398 371 335 295 244 193 165 174 212
6041 212 261 308 340 357 370 390 407 397 355 302 266 256 271 298 315 292 228 154 104 84 76 67 61 65 79 96 107 114 128 155 179 181 164 155 172 201 213 194
6025 194 154 107 67 42 36 41 48 55 67 81 88 89 97 119 143 155 150 142 144 152 152 139 125 128 154 194 238 274 289 276 248 227 221 218 210 199 190 180 175 185 214 240 241 224
6005 224 216 233 259 265 237 180 109 49 22 36 72 105 116 114 116 130 151 166 174 176 173 171 176 188 201 207 216 235 259 275 283 290 297 296 290 295 320 352 373 382 388 391 385 370 354
$$ packed form
6122B32qjJlj2j4pQK4L2K4ll5n4m9k2J2L2L2K1J1Nmj9k6j3RK0Qrj3j0nn%J0K2K9K7J1j1k5
6103B22k3j3ljjknoJJ6K7K7K2K2K5K4J0j2l3m3l2rPMj3k3j8rlNJ8K3J1rj3%NknOJ9K1K3K8
6084B88K4Nj0mJ5K1J2OMpk8l9l1j4jOOOJ3L1M5L9K3J2Pnj7j4NK5M3O4P7P0P0J07J61J98K34
6067A447L24M70O36Q36J121J386J336P52j89j017j373j282j001p35n42m00l00k33j87j48j10
6058G91p6n7n9p4p2n0k7j7j3m%j1k8m0m0l4k1kROlqnJ2L6N5N1L1J9K0J5ok7l6m0n1n1k8RL8
6041B12M9M7L2J7J3K0J7j0m2n3l6j0J5K7J7k3o4p4n0k0qroMJ4J7J1PJ4K7K4Kj7rJ7K9J2j9
6025A94m0m7m0k5oNPPJ2J4PJQK2K4J2nqKQ%j3j4LK6M0M4L6J5j3k8k1olqj1rj0nJ0K9K6Jj7
6005B24qJ7K6Ok8n7p1o0k7J4L6L3J1kKJ4K1J5QKlkNJ2J3ORJ9K4J6QPPjoNK5L2K1ROLoj5j6
$$ plain form
5986 354 341 330 314 292 264 235 212 198 192 187 178 163 145 135 142 161 178 182 178 175 173 165 156 153 157 165 170 174 175 169 157 151 157 174 192 201 206 214 225 234 237 242 253 264 267 267 276 285 272
5965 272 239 214 216 228 232 231 237 241 228 210 212 239 270 290 304 313 309 287 253 217 179 144 119 105 93 77 68 74 96 130 169 199 206 199 198 207 205 181 156 155 170 175 164
5946 164 156 166 183 194 200 204 198 167 113 58 21 6 0 -5 -6 5 36 80 126 163 186 199 206 215 226 232 226 210 192 185 191 204 212 212 200 179 153 123 90 58 42 60
5928 60 113 171 203 204 201 215 234 236 221 205 195 179 152 128 122 127 124 106 84 73 79 97 116 129 138 145 154 162 169 172 165 143 119 112 125 143 150 147 141 134 120 99 79 67 70
5908 70 87 111 128 134 138 157 187 212 216 202 182 162 142 127 122 128 141 155 168 179 187 194 209 234 264 287 298 297 288 277 269 268 265 247 211 178 163 166 167 157 144 137 142
5890 142 158 175 187 191 194 201 203 188 164 148 145 148 146 141 133 115 87 61 49 47 49 53 64 78 82 76 76 96 132 168 197 221 241 247 227 182 135 109 109 121 135 151 168
5871 168 179 181 177 177 180 183 183 184 195 223 263 303 330 350 376 408 428 420 383 329 278 247 253 288 321 323 293 254 222 199 177 156 145 155 185 216 231 232 235 242 240 224
5853 224 211 215 228 241 258 292 329 346 335 308 274 236 201 188 202 230 255 266 265 251 224 188 150 124 121 146 185 220 246 264 272 266 249 236 243 267 291 304
$$ packed form
5986C54j3j1j6k2k8k9k3j4onrj5j8j0PJ9J7MmlkqrlMQNMJoj2oOJ7J8RNQJ1RLNJ1J1L%RRj3
5965B72l3k5KJ2MjOMj3j8KK7L1K0J4Rmk2l4l6l8l5k5j4j2j6rOK2L4L9L0PpjRkk4k5jJ5Nj1
5946A64qJ0J7J1OMol1n4n5l7j5onjJ1L1M4M6L7K3J3PRJ1Ooj6j8pOJ3Q%j2k1k6l0l3l2j6J8
5928F0N3N8L2JlJ4J9Kj5j6j0j6k7k4oNlj8k2j1OJ8J9J3RPRQPLpk2k4pJ3J8Plopj4k1k0j2L
5908G0J7K4J7OMJ9L0K5Mj4k0k0k0j5nOJ3J4J3J1QPJ5K5L0K3J1jrj1qjlj8l6l3j5LJj0j3pN
5890A42J6J7J2MLPKj5k4j6lLknqj8k8k6j2kKMJ1J4Mo%K0L6L6K9K4K0Ok0m5m7k6%J2J4J6J7
5871A68J1Km%LL%JJ1K8M0M0K7K0K6L2K0ql7n4n1l1OL5L3Kl0l9l2k3k2k1j1J0L0L1J5JLPkj6
5853B24j3MJ3J3J7L4L7J7j1k7l4l8l5j3J4K8K5J1jj4k7l6l8k6lK5L9L5K6J8Qoj7j3PK4K4J3
$$ plain form
5836 304 306 311 329 352 362 351 336 328 314 280 238 219 228 237 218 177 140 126 134 155 181 213 245 267 266 244 218 211 222 237 252 268 282 278 250 206 148 77 14
5819 14 -11 0 12 3 -7 16 73 130 160 167 161 156 166 194 228 243 233 213 199 192 189 187 182 175 172 177 183 178 160 137 116 97 86 89 104 121 130 133 134 136 144 164 191 214 227
5800 227 241 260 275 273 260 249 243 233 220 213 211 202 177 146 129 130 141 151 159 167 177 190 210 229 232 211 179 159 159 170 177 180 184 193 198 191 171 143 119 100 86 77 85 119
5781 119 166 200 201 177 146 124 114 116 121 118 103 83 70 60 52 51 66 89 109 129 161 199 217 200 163 135 132 150 174 189 185 167 150 147 155 167 180 191 188 168
5764 168 143 135 147 162 164 152 137 129 128 134 146 163 182 196 201 200 202 219 247 274 279 257 216 175 145 129 125 130 138 140 129 112 99 98 107 120 138 163 192 216 226 226 228
5745 228 237 248 247 225 194 171 164 165 167 173 190 220 257 298 347 412 489 558 589 566 496 407 325 261 226 227 264 314 354 371 375 379 389 406 423 434 433 426 421 419 409
5727 409 386 357 331 302 256 200 160 154 168 167 140 108 101 125 163 202 245 293 334 346 325 285 251 227 209 191 181 182 186 184 176 173 177 181 179 183 207 251 302 340 349
5709 349 327 284 239 206 181 158 141 140 150 151 132 109 101 113 134 157 186 219 243 252 256 268 285 293 290 293 311 328 326 315 313 319 315 298 285 286 283 260 231 218 220 219 213
$$ packed form
5836C04KNJ8K3J0j1j5qj4l4m2j9RRj9m1l7j4QK1K6L2L2K2jk2k6pJ1J5J5J6J4mk8m4n8p1o3
5819A4k5J1J2rj0K3N7N7L0PonJ0K8L4J5j0k0j4plknplNOnj8k3k1j9j1LJ5J7RLJKQK0K7K3J3
5800B27J4J9J5kj3j1oj0j3pkrk5l1j7JJ1J0QQJ0J3K0J9Lk1l2k0%J1PLMRNpk0k8k4j9j4rQL4
5781A19M7L4Jk4l1k2j0KNlj5k0j3j0qjJ5K3K0K0L2L8J8j7l7k8lJ8K4J5mj8j7lQJ2J3J1lk0
5764A68k5qJ2J5Kj2j5qjOJ2J7J9J4NjKJ7K8K7Nk2m1m1l0j6mNQKj1j7j3jRJ3J8K5K9K4J0%K
5745B28RJ1jk2l1k3pJKOJ7L0L7M1M9O5P7O9L1k3p0q9q2o4l5JL7N0M0J7MMJ0J7J7J1jpnkj0
5727D09k3k9k6k9m6n6m0oJ4jk7l2pK4L8L9M3M8M1J2k1m0l4k4j8j8j0JMkqlMMkMK4M4N1L8R
5709C49k2m3m5l3k5k3j7jJ0Jj9k3qJ2K1K3K9L3K4RMJ2J7QlLJ8J7kj1kOmj7j3Jlk3k9j3Kjo
$$ plain form
5691 213 210 214 214 210 219 250 285 300 287 256 219 178 137 106 93 102 121 137 145 154 169 186 201 218 242 266 275 274 279 294 303 300 295 294 283 254 219 201 200 201 202 215 244 276
5672 276 301 318 328 326 312 295 278 256 226 197 178 171 170 167 163 164 176 195 209 210 210 226 251 257 228 180 143 126 115 94 66 49 57 90 131 159 166 157 142 123 100
5654 100 85 89 116 153 182 196 195 190 191 197 203 203 199 199 198 183 159 148 164 193 206 198 190 197 207 201 177 154 147 158 182 207 225 234 239 247 253 248 235 224 217 209 199 196 206 219
5634 219 218 194 154 119 113 148 212 273 306 308 292 269 248 236 233 232 230 230 235 236 222 195 164 139 123 119 128 139 133 108 73 46 38 47 68 89 102 106 98 80 64 68 91
5615 91 112 111 93 78 71 68 69 76 81 70 50 50 84 131 165 183 199 217 229 223 195 149 93 43 16 14 33 62 90 111 127 139 140 130 123 134 160 173 163 146 142
5598 142 146 142 130 121 121 122 121 124 133 145 162 190 225 258 285 304 310 286 230 168 129 125 139 151 159 172 195 216 211 171 120 93 103 134 161 181 202 223 230 213 183
5580 183 161 158 164 165 156 148 146 148 152 165 188 214 234 254 278 300 305 288 257 222 187 169 181 219 252 263 262 272 293 299 279 246 224 220 222 215 196 169 138 105 74 56
5562 56 59 82 113 150 191 230 248 240 220 202 188 167 146 137 144 156 162 163 159 147 131 124 136 160 177 182 178 172 169 175 190 209 220 218 207 189 164 130 89 44 9 0 16
$$ packed form
5691B13lM%mRL1L5J5j3l1l7m1m1l1j3RJ9J6QRJ5J7J5J7K4K4RjNJ5Rlnjj1k9l5j8jJJJ3K9L2
5672B76K5J7J0kj4j7j7k2l0k9j9pjlmJJ2J9J4J%J6K5Ok9m8l7j7j1k1k8j7QL3M1K8Prj5j9k3
5654A00j5MK7L7K9J4jnJOO%m%jj5k4j1J6K9J3qqPJ0ok4k3pJ1K4K5J8RNQOnj3j1pqj0lJ0J3
5634B19jk4m0l5oL5O4O1L3Kj6k3k1j2ljk%NJj4k7l1k5j6mRJ1ok5l5k7qRK1K1J3Mqj8j6MK3
5615I1K1jj8j5plJPNj1k0%L4M7L4J8J6J8J2ok8m6n6n0k7kJ9K9K8K1J6J2Jj0pJ1K6J3j0j7m
5598A42Mmj2r%JjLRJ2J7K8L5L3K7J9Ok4n6o2l9mJ4J2QJ3K3K1nm0n1k7J0L1K7K0K1K1Pj7l0
5580A83k2lOJrqkKMJ3K3K6K0K0K4K2Nj7l1l5l5j8J2L8L3J1jJ0K1Ok0l3k2mKpj9k7l1l3l1j8
5562E6LK3L1L7M1L9J8qk0j8j4k1k1rPJ2OJmj2j6pJ2K4J7NmolOJ5J9J1kj1j8k5l4m1m5l5rJ6
$$ plain form
5543 16 35 37 24 17 20 21 15 18 40 67 79 74 75 93 112 108 79 53 62 108 167 209 229 236 238 227 204 178 158 143 128 121 130 146 162 179 199 211 201 182 173 176 172 154
5524 154 138 133 131 120 102 89 83 87 106 134 154 155 142 126 110 90 71 54 35 19 21 42 63 63 48 35 31 32 41 64 90 104 114 140 179 197 172 117 66 44
5507 44 57 96 137 156 147 131 136 164 195 209 210 210 215 220 216 198 173 153 147 154 165 163 136 90 57 59 93 138 179 216 247 261 257 248 243 241 238 237 234 213 170 129 120 144 177
5487 177 200 216 230 245 259 276 294 303 291 259 222 202 210 237 258 253 231 218 229 248 249 221 174 129 100 90 93 101 110 121 130 133 132 136 156 195 238 272 288 287 272
5469 272 251 233 222 218 218 224 239 265 294 312 315 308 297 287 280 278 274 256 217 164 122 109 127 159 184 188 174 165 180 211 233 235 233 241 249 241 227 232 255 270 260 239 226
5451 226 220 216 224 247 262 240 195 172 192 229 252 258 261 262 249 221 192 178 182 197 211 212 201 188 174 155 133 129 155 195 224 237 252 277 303 317 321 321 313 292 259
5433 259 226 202 199 215 238 257 277 301 321 316 289 264 257 253 236 204 168 131 92 64 64 93 125 139 136 131 140 161 187 207 219 220 205 170 124 90 79 84 91 92 90
5415 90 93 105 125 137 121 76 26 -4 -13 -14 -16 -12 7 43 80 98 91 76 83 121 166 188 185 176 183 202 211 188 134 81 64 93 140 176 192 192 175 140 103 88 95 108
$$ packed form
5543A6J9Kj3pLJoLK2K7J2nJJ8J9mk9k6RM6N9M2K0PKj1k3k6k0j5j5pRJ6J6J7K0J2j0j9rLmj8
5524A54j6nkj1j8j3oMJ9K8K0Jj3j6j6k0j9j7j9j6KK1K1%j5j3mJRK3K6J4J0K6L9J8k5n5n1k2
5507D4J3L9M1J9rj6NK8L1J4J%NNmj8k5k0oPJ1kk7m6l3KL4M5M1L7L1J4mrnkljlk1m3m1rK4L3
5487A77K3J6J4J5J4J7J8Rj2l2l7k0QK7K1nk2j3J1J9Jk8m7m5k9j0LQRJ1RLjMK0L9M3L4J6jj5
5469B72k1j8j1m%OJ5K6K9J8Lpj1j0pkmj8l9n3m2j3J8L2K5Mj4rJ5L1K2KkQQqj4NK3J5j0k1j3
5451B26omQK3J5k2m5k3K0L7K3OLJj3k8k9j4MJ5J4Jj1j3j4j9k2mK6M0K9J3J5K5K6J4M%qk1l3
5433B59l3k4lJ6K3J9K0K4K0nk7k5pmj7l2l6l7l9k8%K9L2J4lnRK1K6K0J2Jj5l5m6l4j1NPJk
5415I0LJ2K0J2j6m5n0l0rjkMJ9L6L7J8pj5PL8M5K2lrPJ9Rk3n4n3j7K9M7L6J6%j7l5l7j5PJ3
$$ plain form
5397 108 119 132 146 146 130 119 132 163 187 190 180 174 183 208 239 264 278 283 284 281 269 246 216 183 149 111 77 65 80 105 117 115 121 143 161 156 138 137 161 193
5379 193 211 208 184 145 101 74 75 102 141 172 180 164 139 123 118 117 117 121 125 120 105 93 97 118 144 164 173 173 174 178 181 180 186 212 248 272 275 271 269 263 251 242 234 218 192 174
5360 174 177 194 211 229 252 271 275 269 264 254 223 173 124 89 70 65 72 85 98 115 138 158 164 158 159 173 189 190 179 168 172 193 217 228 220 203 184 161 139 134 156
5342 156 187 199 193 195 213 219 198 167 148 137 120 99 88 86 89 105 146 199 235 239 224 211 204 194 185 181 175 163 152 155 171 181 174 160 164 190 218 228 220 210 210 222
5324 222 243 268 290 300 299 295 292 283 265 252 262 293 319 316 281 234 197 180 178 187 210 248 280 277 229 166 133 143 177 204 217 224 223 210 189 179 194 227 261 284
5306 284 293 288 273 263 268 285 298 294 273 240 204 178 178 205 238 255 248 226 195 158 126 119 153 216 278 314 318 306 296 296 301 302 292 275 256 241 225 203 175 152
5289 152 147 156 169 177 181 182 178 170 163 163 171 189 216 243 259 261 260 265 270 271 273 281 283 267 238 209 186 169 167 193 238 276 284 265 234 204 180 159 144 142 164 209 250 256 226 191
5269 191 175 173 171 169 173 182 185 182 181 183 182 176 172 176 187 197 199 196 194 194 191 180 164 148 133 120 120 140 172 200 213 211 196 178 174 194 223 240 243 246 241 209 151 110 115 154 188
$$ packed form
5397A08J1J3J4%j6j1J3L1K4Lj0oRK5L1K5J4NJlj2k3l0l3l4l8l4j2J5K5J2kOK2J8nj8jK4L2
5379A93J8lk4l9m4k7JK7L9L1Qj6k5j6nj%MMnj5j2MK1K6K0R%JMLjOK6L6K4Lmkoj2rqj6k6j8
5360A74LJ7J7J8K3J9Monj0l1n0m9l5j9nPJ3J3J7K3K0OoJJ4J6Jj1j1MK1K4J1qj7j9k3k2nK2
5342A56L1J2oKJ8Ok1l1j9j1j7k1j1kLJ6M1N3L6Mj5j3pj0rmoj2j1LJ6J0pj4MK6K8J0qj0%J2
5324B22K1K5K2J0jmlrj8j3J0L1K6ll5m7l7j7kRK3L8L2lm8o3l3J0L4K7J3Pjj3k1j0J5L3L4K3
5306B84Rnj5j0NJ7J3mk1l3l6k6%K7L3J7pk2l1l7l2pL4O3O2L6Mj2j0%NJj0j7j9j5j6k2k8k3
5289A52nRJ3QMJmqp%QJ8K7K7J6KjNNJKQKj6k9k9k3j7kK6M5L8Qj9l1l0k4k1j5kK2M5M1Ol0l5
5269A91j6kkkMRLljKjomMJ1J0Klk%lj1j6j6j5j3%K0L2K8J3kj5j8mK0K9J7LLnl2n8m1NL9L4
$$ plain form
5249 188 205 215 217 205 183 170 169 174 182 200 218 217 202 197 208 211 187 157 153 179 206 213 203 194 206 237 270 278 255 226 217 229 241 233 211 189 173 158 138 110 77
5231 77 48 40 64 110 153 174 166 146 135 140 153 159 155 153 159 163 155 146 158 194 229 236 214 190 181 185 191 194 194 189 180 176 179 188 197 203 198 175 135 97 80 81 92 114 153 205 252 276
5210 276 278 269 248 213 169 133 115 114 116 121 137 168 192 186 148 107 89 94 110 128 143 150 147 143 147 153 147 128 115 123 144 161 166 160 149 146 161 190 221 244 261 272 275 264
5191 264 245 225 214 211 214 217 212 203 203 216 234 241 232 218 207 199 192 198 226 271 310 320 304 280 264 254 241 220 203 197 202 200 179 139 96 70 64 72 91 120 152 174 177
5172 177 171 176 201 237 263 261 229 184 151 136 127 120 126 150 169 158 122 97 100 121 145 168 187 199 210 231 258 269 258 247 252 265 265 248 229 218 206 185 159
5155 159 137 128 130 139 148 163 191 229 257 261 247 227 208 188 175 181 204 228 239 234 217 196 174 156 145 139 136 130 117 97 77 65 66 86 122 165 201 223 232 233 232 231
5137 231 233 237 238 240 251 269 281 279 265 244 217 191 184 203 227 227 202 177 172 182 185 171 151 142 154 177 191 182 154 130 123 134 149 152 137 116 98 89 79 66 52 41
5119 41 30 16 6 5 10 12 11 17 28 35 32 31 57 112 173 214 228 236 255 275 278 261 239 218 194 167 148 140 129 109 93 88 86 79 82 117 172 216 231 230 225 211 185 159
$$ packed form
5249A88J7J0Kj2k2j3jNQJ8J8jj5nJ1Lk4l0mK6K7Pj0rJ2L1L3Qk3k9rJ2J2qk2k2j6j5k0k8l3
5231G7k9qK4M6M3K1qk0j1NJ3OmkOMqrJ2L6L5Pk2k4rMOL%nrmLRROnk3m0l8j7JJ1K2L9N2M7K4
5210B76Krk1l5m4l6j8jKNJ6L1K4ol8m1j8NJ6J8J5PlmMOoj9j3QK1J7Noj1lJ5K9L1K3J7J1Lj1
5191B64j9k0j1lLLnr%J3J8Prj4j1qpOK8M5L9J0j6k4j6j0j3k1j7oNkk1m0m3k6oQJ9K9L2K2L
5172A77oNK5L6K6kl2m5l3j5rpOK4J9j1l6k5LK1K4K3J9J2J1K1K7J1j1j1NJ3%j7j9j1j2k1k6
5155A59k2rKRRJ5K8L8K8Mj4k0j9k0j3OK3K4J1nj7k1k2j8j1oloj3k0k0j2JK0L6M3L6K2RJjj
5137B31KMJKJ1J8J2kj4k1k7k6pJ9K4%k5k5nJ0Lj4k0rJ2K3J4rk8k4pJ1J5Lj5k1j8rj0j3j4j1
5119D1j1j4j0jNKjOJ1PljK6N5O1M1J4QJ9K0Lj7k2k1k4k7j9qj1k0j6nkpLL5N5M4J5jnj4k6k6
$$ plain form
5100 159 149 149 145 129 111 99 94 91 89 95 116 145 161 154 138 140 161 185 197 204 212 215 207 189 166 140 117 102 94 85 77 84 109 132 139 136 140 157 174 179 171 155 138 126 127 135
5080 135 142 147 155 175 208 239 252 246 240 253 279 292 281 267 270 282 278 243 186 122 60 13 -3 15 54 86 95 91 88 90 85 68 55 65 96 129 152 174 193 195 167
5062 167 122 90 89 115 153 187 207 216 220 220 207 186 171 166 161 150 146 159 174 161 120 85 84 113 146 160 151 127 100 86 93 120 159 198 229 251 267 275 275 268 257
5044 257 237 205 174 169 194 223 227 206 179 159 147 148 163 183 195 204 223 244 249 236 227 235 243 230 202 181 175 165 134 92 67 74 106 147 188 220 229 202 154 121
5027 121 121 134 125 95 73 71 81 98 126 158 176 178 176 175 163 141 129 141 151 135 110 112 153 205 235 238 235 249 287 328 345 330 302 286 284 285 286 289 286 270 253 254
5009 254 273 290 290 278 266 256 248 241 229 202 166 140 140 161 194 227 247 240 209 183 180 189 182 149 108 82 79 99 135 176 213 245 275 299 308 298 274 249 225 199
4992 199 173 152 137 130 127 131 139 152 162 163 153 138 130 144 177 216 239 238 220 202 192 193 198 196 177 138 96 73 76 90 100 103 103 96 82 73 87 129 186 246 302 349
4973 349 378 387 381 364 338 307 282 265 247 224 209 215 234 247 249 249 252 252 254 261 263 241 195 155 136 117 74 26 13 45 86 107 111 112 110 101 95 100 105 92 67 58 84 134
$$ packed form
5100A59j0%mj6j8j2nlkOK1K9J6pj6KK1K4J2PQLqj8k3k6k3j5qrqPK5K3PlMJ7J7Nqj6j7j2JQ
5080A35PNQK0L3L1J3ooJ3K6J3j1j4LJ2ml5n7o4o2m7j6J8L9L2RmlKnj7j3J0L1L3K3K2J9Kk8
5062A67m5l2jK6L8L4K0RM%j3k1j5nnj1mJ3J5j3m1l5jK9L3J4rk4k7j4PK7L9L9L1K2J6Q%pj1
5044B57k0l2l1nK5K9Mk1k7k0j2JJ5K0J2RJ9K1Nj3rQQj3k8k1oj0l1m2k5PL2M1M1L2Rk7m8l3
5027A21%J3rl0k2kJ0J7K8L2J8Kkjj2k2j2J2J0j6k5KM1N2L0LlJ4L8M1J7j5k8j6kJJLlj6j7J
5009B54J9J7%j2j2j0qpj2k7l6k6%K1L3L3K0pl1k6lRpl3m1k6lK0L6M1L7L2L0K4Rj0k4k5k4k6
4992A99k6k1j5plMQJ3J0Jj0j5qJ4L3L9K3jj8j8j0JNkj9l9m2k3LJ4J0L%pj4rJ4M2N7O0N6M7
4973C49K9Roj7k6l1k5j7j8k3j5OJ9J3K%L%KPKk2m6m0j9j9m3m8j3L2M1K1MJkroNNj3k5rK6N0
$$ plain form
4954 134 184 219 233 226 200 163 127 107 105 116 132 153 182 210 217 197 167 154 158 164 166 178 206 237 257 271 289 302 287 246 208 199 220 251 277 295 303 303 306 318
4937 318 339 361 380 390 387 373 360 359 357 334 291 255 251 273 294 290 267 244 237 248 266 280 281 270 251 221 179 127 82 57 52 48 27 -7 -31 -22 13 53 84 111
4920 111 144 180 202 201 185 170 171 191 222 252 270 268 248 215 176 138 111 105 124 159 196 225 244 253 252 242 232 226 215 184 137 98 85 95 105 106 107 113 124 133
4902 133 141 156 181 209 227 231 224 216 205 187 162 143 142 160 185 213 243 276 302 314 311 302 298 300 298 275 234 194 175 176 183 184 183 186 194 201 200 189 169 145 123 104 93 96
4883 96 112 129 137 138 138 136 124 112 116 135 145 133 108 86 69 54 41 39 48 62 79 90 83 56 23 1 0 13 38 63 82 102 133 168 181 166 157 178 215 235
4866 235 233 234 248 258 249 230 216 209 201 194 188 174 147 116 93 83 81 85 90 93 95 103 119 138 149 147 129 107 95 106 130 146 147 141 135 125 106 92 101 144 207 269 307 311
4847 311 288 263 255 267 282 287 273 243 209 182 165 144 110 67 41 45 71 104 135 165 193 212 217 207 193 184 187 195 200 192 172 150 137 141 156 171 183 196 211 223
4829 223 224 209 186 167 158 158 157 149 133 116 101 94 96 105 115 116 108 95 86 90 106 120 122 116 111 115 129 149 173 193 203 202 203 213 225 233 243 259 276 286 288 288 284 271 254 243
$$ packed form
4954A34N0L5J4pk6l7l6k0kJ1J6K1K9K8Pk0l0j3MOKJ2K8L1K0J4J8J3j5m1l8rK1L1K6J8Q%LJ2
4937C18K1K2J9J0lj4j3jkk3m3l6mK2K1mk3k3pJ1J8J4Jj1j9l0m2n2m5k5nmk1l4k4RL5M0L1K7
4920A11L3L6K2jj6j5JK0L1L0J8kk0l3l9l8k7oJ9L5L7K9J9Rjj0j0oj1l1m7l9j3J0J0JJOJ1R
4902A33QJ5K5K8J8Mpqj1j8k5j9jJ8K5K8L0L3K6J2lrmKkk3m1m0j9JPJjLQPjj1k0k4k2j9j1L
4883I6J6J7QJ%kj2j2MJ9J0j2k5k2j7j5j3kRJ4J7J1pk7l3k2jJ3K5K5J9K0L1L5J3j5rK1L7K0
4866B35kJJ4J0rj9j4pqpoj4k7l1k3j0kMNLKQJ6J9J1kj8k2j2J1K4J6Jooj0j9j4RM3O3O2L8M
4847C11k3k5qJ2J5Nj4l0l4k7j7k1l4m3k6MK6L3L1L0K8J9Nj0j4rLQNqk0k2j3MJ5J5J2J3J5J2
4829B23Jj5k3j9r%jqj6j7j5pKRJ0Jqj3rMJ6J4KonMJ4K0K4K0J0jJJ0J2QJ0J6J7J0K%mj3j7j1
$$ plain form
4809 243 239 228 206 180 163 158 162 171 181 192 205 224 243 249 237 210 178 151 139 142 147 140 130 135 156 168 156 139 135 139 128 97 70 60 62 65 71 93 131 169 190 181
4791 181 149 115 98 99 108 119 138 168 199 214 209 196 193 200 202 191 172 155 136 110 92 103 134 155 146 125 117 128 150 173 186 176 143 113 109 123 137 155 191
4774 191 240 272 273 259 244 226 196 164 139 126 118 114 112 109 110 121 144 169 184 184 178 167 154 141 127 108 82 52 25 5 -2 11 45 94 149 207 262 299 304 276
4757 276 230 189 171 174 186 192 196 204 215 218 204 175 143 117 110 128 159 179 180 185 217 268 301 296 276 274 290 292 265 229 215 223 227 211 183 154 122 89 67 73 96 116
4739 116 125 137 157 171 168 154 144 149 171 206 239 258 264 267 265 242 194 144 120 125 140 151 161 174 186 194 199 204 211 218 221 219 213 206 197 187 187 207 240 262 252 218 181 155
4720 155 145 153 172 186 177 152 126 107 94 96 123 169 208 224 215 186 138 88 63 87 147 207 238 238 224 212 206 202 201 206 212 206 186 165 155 154 151 146 147 152 147 132 128 146
4701 146 168 164 138 128 155 202 235 237 231 245 282 316 328 324 324 328 323 305 290 286 279 256 237 251 289 310 293 259 238 231 222 213 217 238 265 291 318 343 350 337 312 281
4682 281 242 199 173 182 213 238 242 236 231 230 226 218 201 180 166 178 213 248 267 271 271 264 245 221 214 228 241 223 173 119 89 86 96 108 128 157 186 200 198 195 200 209 221
$$ packed form
4809B43mj1k2k6j7nMRJ0J1J3J9J9Oj2k7l2k7j2LNpj0NK1J2j2j7mMj1l1k7j0KLOK2L8L8K1r
4791A81l2l4j7JRJ1J9L0L1J5nj3lPKj1j9j7j9k6j8J1L1K1rk1qJ1K2K3J3j0l3l0mJ4J4J8L6
4774A91M9L2Jj4j5j8l0l2k5j3qmklJJ1K3K5J5%oj1j3j3j4j9k6l0k7k0pJ3L4M9N5N8N5L7Nk8
4757B76m6m1j8LJ2OMQJ1Lj4k9l2k6pJ8L1K0JNL2N1L3nk0kJ6Kk7l6j4QMj6k8k9l2l3k2OK3K0
4739A16RJ2K0J4lj4j0NK2L5L3J9OLkk3m8n0k4NJ5J1J0J3J2QNNPPLkoprj0%K0L3K2j0l4l7k6
4720A55j0QJ9J4rk5k6j9j3KK7M6L9J6rk9m8n0k5K4O0O0L1%j4j2omjNOok0k1j0jlnJNnj5mJ8
4701A46K2mk6j0K7M7L3KoJ4L7L4J2m%Mnj8j5mpk3j9J4L8K1j7l4k1prrMK1K7K6K7K5Pj3k5l1
4682B81l9m3k6RL1K5Monjmqj7k1j4J2L5L5J9M%pj9k4pJ4J3j8n0n4l0lJ0J2K0K9K9J4klNRJ2
$$ plain form
4664 221 248 300 367 419 430 398 347 310 304 321 334 318 270 216 183 177 175 156 120 88 74 75 82 99 135 177 201 199 188 194 218 245 258 250 224 194 177 183 208
4647 208 239 270 295 312 321 326 331 334 331 319 296 267 237 214 201 191 182 175 171 166 151 131 116 113 120 126 125 112 90 71 66 80 115 165 211 229 220 212 229 257 261 227 178
4628 178 138 116 110 120 143 167 183 197 218 245 266 273 264 243 223 214 218 225 224 216 206 205 213 230 253 277 301 328 352 363 353 326 291 256 223 195 177 169 165 155 141
4610 141 136 152 184 209 211 193 172 159 156 165 186 213 236 255 271 278 264 235 209 203 211 216 209 189 165 152 160 187 219 243 257 259 252 241 237 243 249 242 224 204 187 178 176 186
4591 186 206 240 289 340 372 365 325 277 241 216 193 165 143 143 171 203 211 186 149 124 113 104 94 93 107 131 152 168 183 198 210 212 199 171 131 86 47 25
4575 25 25 44 69 91 110 138 177 214 225 203 168 147 148 157 162 164 165 161 149 145 167 207 234 234 221 212 210 204 186 157 125 102 95 96 93 82 74 78 90 103 116 127 128 114
4556 114 92 70 55 51 59 66 57 34 25 47 80 95 85 70 67 79 98 118 131 133 127 117 104 91 81 70 54 42 47 70 92 105 122 155 191 202 188 168 156
4539 156 151 151 154 142 102 57 42 65 98 116 127 143 159 163 156 149 145 134 109 73 38 16 13 25 39 48 57 74 104 147 192 223 229 214 188 156 118 85 71 78 100
$$ packed form
4664B21K7N2O7N2J1l2n1l7oJ7J3j6m8n4l3okj9l6l2j4JPJ7L6M2K4kj1OK4K7J3qk6l0j7OK5
4647B08L1L1K5J7RNNLlj2k3k9l0k3j3j0rpmnj5k0j5lPOjj3k2j9nJ4L5N0M6J8rqJ7K8Ml4m9
4628A78m0k2oJ0K3K4J6J4K1K7K1Prk1k0rMPjqj0jQJ7K3K4K4K7K4J1j0k7l5l5l3k8j8qmj0j4
4610A41nJ6L2K5Kj8k1j3lRK1K7K3J9J6Pj4k9k6oQNpk0k4j3QK7L2K4J4Kpj1mOOpj8k0j7rkJ0
4591A86K0L4M9N1L2pm0m8l6k5k3k8k2%K8L2Qk5l7k5j1rj0jJ4K4K1J6J5J5J2Kj3k8m0m5l9k2
4575B5%J9K5K2J9K8L9L7J1k2l5k1JRNKJmj2mK2M0K7%j3rkoj8k9l2k3pJlj1qMJ2J3J3J1Jj4
4556A14k2k2j5mQPrk3rK2L3J5j0j5lJ2J9K0J3Koj0j3j3j0j1j6j2NK3K2J3J7L3L6J1j4k0j2
4539A56n%Lj2m0m5j5K3L3J8J1J6J6Mppmj1k5l6l5k2lJ2J4RRJ7L0M3M5L1Oj5k6l2l8l3j4PK2
$$ plain form
4521 100 131 174 214 234 237 243 261 273 263 244 238 247 255 249 237 230 233 235 228 208 181 157 142 143 164 202 241 265 274 281 285 273 236 188 156 165 217 288 338 339 305 269 248
4503 248 235 223 220 237 267 294 310 312 298 270 236 211 196 190 191 195 196 191 186 184 187 198 222 247 254 235 205 184 181 186 185 163 123 82 56 47 41 37 42 58 78 99 129 163
4483 163 185 187 181 178 174 172 181 201 220 231 242 255 253 232 215 220 235 237 225 213 207 205 211 230 249 254 249 242 235 226 232 266 306 313 288 268 281 309 325 320 299 267 232 209 201
4464 201 199 196 192 186 172 155 147 151 160 162 158 148 129 108 101 115 136 148 149 142 132 127 133 151 172 192 211 221 208 176 143 123 116 120 139 162 168 157 155 177 203 204 182 163
4445 163 161 172 191 215 230 214 175 145 149 169 170 146 125 135 167 197 217 246 294 346 373 366 336 302 277 267 268 262 238 206 191 199 216 231 243 255 258 246 227
4428 227 217 224 238 243 231 211 198 198 198 182 152 120 85 45 5 -15 -12 2 20 48 85 118 134 142 154 166 166 156 140 117 91 71 59 45 23 11 26 60
4412 60 90 106 116 133 158 187 214 236 252 267 287 307 319 320 311 289 254 217 195 193 195 187 174 176 199 223 218 188 168 183 215 227 209 185 173 165 152 144 151 164
4394 164 172 176 186 207 232 253 262 252 235 232 252 277 286 280 270 260 248 241 246 250 237 213 203 213 230 239 241 239 234 222 205 190 181 185 200 208 197 173 160 175 219 276 328
$$ packed form
4521A00L1M3M0K0LOJ8J2j0j9oRQoj2pLKpk0k7k4j5JK1L8L9K4RPMj2l7m8l2RN2P1N0Jl4l6k1
4503B48j3j2lJ7L0K7J6Kj4k8l4k5j5oJMJnnkLJ1K4K5Pj9l0k1lNjk2m0m1k6romNJ6K0K1L0L4
4483A63K2KolmkRK0J9J1J1J3kk1j7NJ5Kj2j2okOJ9J9NnpprOL4M0Pk5k0J3K8J6nk1l2l5k3q
4464B01klmoj4j7qMRKmj0j9k1pJ4K1J2Jpj0nOJ8K1K0J9J0j3l2l3k0pMJ9K3Oj1kK2K6Jk2j9
4445A63kJ1J9K4J5j6l9l0MK0Jk4k1J0L2L0K0K9M8N2K7pl0l4k5j0Jok4l2j5QJ7J5J2J2Lj2j9
4428B27j0PJ4Nj2k0j3%%j6l0l2l5m0m0k0LJ4J8K8L7L3J6QJ2J2%j0j6k3k6k0j2j4k2j2J5L4
4412F0L0J6J0J7K5K9K7K2J6J5K0K0J2Jrk2l5l7k2kKqj3KK3K4nl0k0J5L2J2j8k4j2qj3qPJ3
4394A64QMJ0K1K5K1Rj0j7lK0K5Roj0j0j2pNMj3k4j0J0J7RKknj2j7j5rMJ5Qj1k4j3J5M4N7N2
$$ plain form
4376 328 357 361 349 335 318 293 267 249 238 219 189 156 132 121 119 121 119 110 103 102 95 74 53 48 51 39 9 -12 -7 14 38 58 72 78 76 77 80 77 65 64 94 149 205
4357 205 245 262 261 256 268 300 333 343 333 319 306 286 261 248 262 297 328 334 311 275 241 219 205 197 194 194 192 188 185 188 197 212 232 250 261 268 278 289 287 264 231
4339 231 209 207 219 234 246 250 249 252 265 285 303 312 310 298 282 273 275 278 278 275 273 267 250 228 213 219 244 277 300 298 269 231 204 195 195 194 182 158 134 128 149 185 210 210 189
4320 189 164 148 142 138 130 123 126 135 141 139 142 162 194 219 224 211 190 170 153 138 127 121 122 127 130 129 131 136 142 141 133 119 104 95 97 104 108 110 113 121 130 142 166 202 228 223 193 168 167 184
4298 184 198 199 199 208 225 237 236 221 197 177 168 173 185 193 194 193 199 212 234 262 289 301 293 280 279 290 297 291 278 260 237 208 185 177 183 195 209 219 223 227 237 248 250 242 234
4278 234 227 224 232 258 291 305 294 276 265 257 247 240 230 201 150 106 89 93 101 117 148 185 209 220 228 231 222 214 227 259 283 280 252 211 172 154 165 190 204 198 184
4261 184 173 167 169 185 208 226 234 237 234 227 224 236 257 270 270 262 249 229 216 230 268 301 309 296 273 241 201 168 157 172 203 234 240 206 150 106 90 85 71 55 54
4243 54 70 92 115 144 179 213 239 252 255 257 264 271 261 235 209 199 203 209 212 215 214 209 203 192 168 131 103 110 151 201 232 236 223 209 202 201 195 180 162 147 131 117 119 145
$$ packed form
4376C28K9Mj2j4j7k5k6j8j1j9l0l3k4j1kKkrpjpk1k1nLj2l0k1NK1K4K0J4OkJLlj2jL0N5N6
4357B05M0J7jnJ2L2L3J0j0j4j3k0k5j3J4L5L1Ok3l6l4k2j4ql%kmlLRJ5K0J8J1PJ0J1kk3l3
4339B31k2kJ2J5J2MjLJ3K0J8Rkj2j6rKL%lkoj7k2j5OK5L3K3kk9l8k7r%jj2k4k4oK1L6K5%k1
4320A89k5j6omqpLROkLK0L2K5Nj3k1k0j7j5j1oJNLjKNOjqj4j5rKPMKLQRJ2K4L6K6nl0k5jJ7
4298A84J4J%RJ7J2jj5k4k0rNJ2QJjOJ3K2K8K7J2qj3jJ1Poj3j8k3k9k3qOJ2J4J0MMJ0J1Kqq
4278B34plQK6L3J4j1j8j1qj0pj0k9n1m4j7MQJ6L1L7K4J1QLrqJ3L2K4lk8m1l9j8J1K5J4oj4
4261A84j1oKJ6K3J8QLlplJ2K1J3%qj3k0j3J4L8L3Qj3k3l2m0l3j1J5L1L1Ol4n6m4j6nj4j6j
4243E4J6K2K3K9L5L4K6J3LKPPj0k6k6j0MOLLjnoj1k4l7k8PM1N0L1Mj3j4pjoj5j8j5j6j4KK6
$$ plain form
4224 145 182 205 204 190 176 167 161 159 155 143 130 132 154 178 186 173 156 147 149 154 161 176 196 209 202 182 171 180 203 226 238 244 253 268 277 265 233 206 201 206 195 164 134 124
4205 124 129 138 145 148 136 111 88 83 96 120 148 180 213 241 263 282 303 322 327 303 253 206 194 216 238 235 218 201 184 159 133 119 116 110 91 63 33 16 28
4188 28 71 126 173 208 233 237 204 145 95 77 91 122 159 196 231 261 283 291 284 270 260 255 251 248 248 255 269 280 275 255 239 250 280 296 276 243 230 240 250 254
4170 254 260 267 257 229 207 209 228 241 235 212 183 164 167 187 207 212 204 187 170 162 172 194 210 214 220 243 280 312 326 325 317 309 305 301 293 277 255 228 200 181 181 197 214
4152 214 218 212 208 213 224 230 230 236 251 263 253 217 176 152 148 160 190 230 259 255 225 193 176 176 189 208 220 218 208 206 214 220 217 211 200 178 149 133 139 156 165 165 159 152 151 165
4132 165 194 219 223 212 203 200 195 189 196 221 252 272 273 259 236 213 203 213 234 247 243 229 220 221 218 198 170 158 174 211 248 270 276 270 257 237 208 171 134 110 107 125
4114 125 147 158 152 146 158 181 194 187 169 150 124 92 74 83 104 114 116 128 144 142 118 100 107 134 166 200 233 252 255 261 283 308 316 300 271 239 213 207 225 254
4096 254 280 300 319 330 317 278 228 190 178 189 211 226 228 219 195 154 110 90 106 139 162 166 161 159 163 174 185 190 184 174 167 166 177 209 259 302 325 343 376 417
$$ packed form
4224A45L7K3jj4j4rokmj2j3KK2K4Qj3j7rKNPJ5K0J3pk0j1RK3K3J2ORJ5Rj2l2k7nNj1l1l0j0
4205A24NRPLj2k5k3nJ3K4K8L2L3K8K2J9K1J9Nk4n0m7j2K2K2lj7j7j7k5k6j4loj9k8l0j7J2
4188B8M3N5M7L5K5Ml3n9n0j8J4L1L7L7L5L0K2Qpj4j0nml%PJ4J1nk0j6J1L0J6k0l3j3J0J0M
4170B54OPj0k8k2KJ9J3ok3k9j9LK0K0Nqj7j7qJ0K2J6MOK3L7L2J4jqqmmqj6k2k7k8j9%J6J7
4152B14MomNJ1O%OJ5J2j0l6m1k4mJ2L0M0K9ml0l2j7%J3J9J2kj0kQOloj1k2k9j6OJ7R%opjJ4
4132A65K9K5Mj1rlnoPK5L1K0Jj4k3k3j0J0K1J3mj4rJlk0k8j2J6L7L7K2Ooj3k0k9l7l7k4lJ8
4114A25K2J1ooJ2K3J3pj8j9k6l2j8RK1J0KJ2J6kk4j8PK7L2L4L3J9LOK2K5Qj6k9l2k6oJ8K9
4096B54K6K0J9J1j3l9n0l8j2J1K2J5Krk4m1m4k0J6L3K3MnkMJ1J1Noj0pjJ1L2N0M3K3J8L3M1
$$ plain form
4079 417 439 432 417 409 404 384 346 301 264 241 227 217 214 218 224 224 223 233 246 238 198 152 138 165 207 240 257 258 246 231 227 235 239 225 192 153 120 102 97 102 118 140
4061 140 152 137 106 88 101 130 156 181 210 233 241 243 257 270 256 214 175 166 180 200 221 249 285 319 341 344 325 293 265 250 243 236 225 216 215 225 237 240 233 230
4043 230 247 277 298 299 283 262 244 234 239 257 280 292 284 257 222 194 183 185 193 203 204 185 154 139 159 195 218 226 239 263 279 274 256 235 217 207 211 227 242
4027 242 256 281 311 323 306 276 255 240 222 199 177 159 140 121 110 113 126 142 147 135 121 128 163 208 242 252 235 204 181 185 210 229 222 197 172 160 167 187
4010 187 205 206 193 182 187 211 248 286 299 271 223 200 214 234 232 214 199 179 148 125 136 175 212 229 234 232 222 212 213 224 232 235 234 227 211 195 193 206 224 242
3993 242 266 295 316 318 303 280 261 249 243 229 200 169 154 153 145 116 74 42 31 42 60 74 83 96 113 123 118 106 100 99 94 87 88 94 87 62 33 15 11 18 35 62
3975 62 87 100 101 92 77 64 68 97 140 177 199 217 242 271 290 292 287 279 262 227 186 165 174 196 203 187 165 158 174 204 230 236 221 200 190 198 219 248 279 308 327
3957 327 330 310 278 257 265 290 304 295 278 270 267 257 244 236 233 227 219 211 203 199 213 246 274 272 239 202 179 173 179 188 186 170 155 153 160 164 168 179 196 210 226 246 259 251 235 239
$$ packed form
4079D17K2pj5qnk0l8m5l7k3j4j0lMO%jJ0J3qm0m6j4K7M2L3J7Jj2j5mQMj4l3l9l3j8nNJ6K2
4061A40J2j5l1j8J3K9K6K5K9K3QKJ4J3j4m2l9rJ4K0K1K8L6L4K2Lj9l2k8j5ppj1rjJ0J2Lpl
4043B30J7L0K1Jj6k1j8j0NJ8K3J2qk7l5k8j1KQJ0Jj9l1j5K0L6K3QJ3K4J6nj8k1j8j0MJ6J5
4027B42J4K5L0J2j7l0k1j5j8k3k2j8j9j9j1LJ3J6Nj2j4PL5M5L4J0j7l1k3MK5J9pk5k5j2PK0
4010A87J8Jj3j1NK4L7L8J3k8m8k3J4K0kj8j5k0l1k3J1L9L7J7Nkj0j0JJ1QLjpj6j6kJ3J8J8
3993B42K4K9K1Kj5k3j9j2oj4k9l1j5jqk9m2l2j1J1J8J4RJ3J7J0nj2ojnpJOpk5k9j8mPJ7K7
3975F2K5J3Jrj5j3MK9M3L7K2J8K5K9J9Knqj7l5m1k1RK2Pj6k2pJ6L0K6Oj5k1j0QK1K9L1K9J9
3957C27Lk0l2k1QK5J4rj7qlj0j3qloqqqmJ4L3K8kl3l7k3oORkj6j5kPMMJ1J7J4J6K0J3qj6M
$$ plain form
3937 239 267 295 300 289 275 265 256 243 223 197 184 197 224 238 234 238 259 275 261 220 171 128 97 87 95 107 118 138 169 192 193 184 186 203 226 250 273 280 256
3920 256 211 172 160 168 178 176 157 128 102 94 105 134 171 199 207 203 207 226 248 261 267 267 253 228 214 227 249 256 251 255 265 260 233 208 207 214 201 162 121 99 97 99 93
3901 93 78 64 58 64 80 102 117 113 94 80 93 132 178 207 209 197 193 207 229 234 215 186 162 147 144 158 192 232 254 247 219 188 167 163 177 206 238 257 250 221
3884 221 193 186 198 208 207 209 237 289 341 365 350 309 264 226 196 176 179 204 228 228 210 201 209 216 209 203 204 201 182 160 155 162 162 155 150 148 144 145 159 177 180 169 171 198 232 251
3864 251 254 247 233 214 195 177 155 122 87 60 44 37 39 50 65 76 81 87 99 116 131 137 134 124 113 108 107 109 110 111 111 112 111 114 129 159 198 232 249 245 225 201 188 193
3845 193 204 215 234 267 301 309 285 249 219 196 184 194 223 243 237 218 207 206 208 220 249 280 291 282 274 272 264 239 200 153 106 71 60 72 99 134 168 187 186
3828 186 182 191 205 199 175 153 149 152 150 143 136 132 140 167 202 228 242 257 271 272 261 258 265 263 234 196 175 179 197 215 233 257 290 329 362 384 394 395 377 335 283 243 222
3809 222 207 190 171 149 126 119 145 196 240 265 285 310 319 302 277 269 277 282 280 290 318 352 372 374 367 362 360 354 337 307 267 215 157 116 119 167 228 270 280 273 267 272
$$ packed form
3937B39K8K8Nj1j4j0rj3k0k6j3J3K7J4mMK1J6j4m1m9m3l1j0QJ2J1K0L1K3JrKJ7K3K4K3Pk4
3920B56m5l9j2QJ0kj9k9k6qJ1K9L7K8QmMJ9K2J3O%j4k5j4J3K2PnMJ0nk7k5jPj3l9m1k2kKo
3901I3j5j4oOJ6K2J5mj9j4J3L9M6K9Kj2mJ4K2Nj9k9k4j5lJ4L4M0K2pk8l1k1mJ4K9L2J9pk9
3884B21k8pJ2J0jKK8N2N2K4j5m1m5l8l0k0LK5K4%j8rQPpoJlj9k2nP%pnkmJJ4J8Lj1KK7L4J9
3864B51Lpj4j9j9j8k2l3l5k7j6pKJ1J5J1NOJ2J7J5Olj0j1njKJJ%JjLJ5L0L9L4J7mk0k4j3N
3845A93J1J1J9L3L4Qk4l6l0k3j2J0K9K0oj9j1jKJ2K9L1J1rqkqk5l9m7m7l5j1J2K7L5L4J9j
3828A86mRJ4ok4k2mLkppmQK7L5K6J4J5J4Jj1lPkk9l8k1MJ8J8J8K4L3L9L3K2J0Jj8m2n2m0k1
3809B22j5j7j9k2k3pK6N1M4K5K0K5Rj7k5qQNkJ0K8L4K0Kpnkoj7l0m0n2n8m1LM8O1M2J0poN
$$ plain form
3791 272 286 290 272 241 224 236 265 289 297 288 260 224 204 221 274 341 393 410 395 372 361 357 335 293 255 242 250 261 271 278 275 259 239 228 220 210 197 191 191 196
3774 196 207 223 233 230 217 206 199 202 225 263 289 280 249 222 213 214 217 220 216 200 178 159 146 140 144 162 185 200 206 212 224 239 251 254 248 238 233 231 217 189 166 164 172 171 164
3754 164 164 170 168 160 165 193 231 259 268 254 219 175 140 124 123 128 132 138 158 205 265 301 291 250 211 186 166 157 173 205 224 225 228 247 270 276 268 258 256 266 286 304 300
3736 300 275 252 253 275 302 330 360 389 408 414 410 403 393 382 367 350 331 315 302 293 291 297 296 282 266 273 298 314 304 281 271 277 284 284 283 292 309 322 318 294 260 231
3717 231 213 203 194 181 162 146 145 160 175 176 174 191 231 271 287 273 238 195 161 145 148 160 173 179 174 157 141 139 145 148 149 159 177 194 204 216 229 230 215 197 189
3700 189 189 193 199 208 219 231 240 241 236 233 233 223 202 190 206 237 255 254 249 243 218 172 134 129 157 199 240 269 278 279 292 309 306 276 247 240 242 233 220 215 212 199 179 167 163 160
3680 160 164 183 205 204 172 130 107 112 131 142 134 122 132 164 194 203 198 199 209 220 230 242 249 246 234 219 202 183 169 164 157 138 117 112 134 173 211 226 208 165 120
3662 120 86 59 37 33 55 85 98 90 74 59 50 52 66 84 99 117 141 165 177 179 181 184 192 210 236 254 252 235 213 187 153 126 121 131 137 134 135 147 171 204 235
$$ packed form
3791B72J4Mj8l1j7J2K9K4Qrk8l6k0J7N3O7N2J7j5k3j1mk2m2l8j3QJ1J0Plj6k0j1qj0j3o%N
3774A96J1J6J0lj3j1pLK3L8K6rl1k7rJLLmj6k2j9j3oMJ8K3J5OOJ2J5J2Loj0nkj4k8k3kQjp
3754A64%OkqNK8L8K8Rj4l5m4l5j6jNMOK0M7O0L6j0m1l9k5k0rJ6L2J9JLJ9K3Oqj0kJ0K0J8m
3736C00k5k3JK2K7K8L0K9J9Ompj0j1j5j7j9j6j3rkOjj4j6PK5J6j0k3j0OP%jRJ7J3mk4l4k9
3717B31j8j0rj3j9j6jJ5J5JkJ7M0M0J6j4l5m3l4j6LJ2J3Onj7j6kOLJJ0J8J7J0J2J3Jj5j8q
3700A89%MORJ1J2RJnl%j0k1j2J6L1J8jnok5m6l8nK8M2M1K9RJJ3J7ll0k9pKrj3nlj3k0j2ml
3680A60MJ9K2jl2m2k3NJ9J1qj2J0L2L0RnJJ0J1J0J2Plj2j5j7j9j4npj9k1nK2L9L8J5j8m3m5
3662A20l4k7k2mK2L0J3qj6j5rKJ4J8J5J8K4K4J2KKLQJ8K6J8kj7k2k6l4k7nJ0OlJJ2K4L3L1
$$ plain form
3644 235 241 213 170 141 130 128 138 163 191 199 189 187 203 217 208 182 159 151 152 146 131 116 118 137 153 149 128 101 66 24 -6 -3 21 44 53 60 68 72 79 105 153 201 233
3626 233 254 268 273 268 260 255 244 228 218 224 232 229 215 204 205 213 219 214 196 176 173 195 232 260 260 228 188 174 200 244 275 283 284 285 281 271 258 243 223 209 224 266 307
3607 307 320 300 262 223 197 188 183 170 158 163 185 210 230 242 243 231 220 233 267 294 294 271 234 184 130 88 71 75 93 120 144 158 172 202 229 219 170 119
3590 119 98 96 98 104 117 121 110 106 127 160 185 200 214 222 213 194 180 174 169 174 193 215 219 205 183 166 157 163 186 209 216 211 202 189 173 167 187 221 247 259 263 254 221 173
3571 173 139 128 126 117 101 82 64 53 59 79 96 98 94 99 115 131 137 133 131 148 189 235 264 264 241 211 188 177 177 185 199 216 230 243 262 287 298 282 254 247 266
3554 266 286 288 286 298 319 328 320 304 289 284 295 312 311 288 266 262 256 221 163 116 100 115 148 190 226 250 272 301 329 338 327 309 285 253 221 200 188 178 172 184
3536 184 209 228 234 236 240 246 261 292 330 355 358 348 338 336 347 370 391 394 382 370 363 359 359 357 338 294 247 227 236 255 272 292 309 311 300 291 284 265 233 212 217 235 252
3518 252 263 271 275 271 263 254 246 244 252 258 242 201 154 122 107 110 131 162 187 202 221 247 265 259 234 210 194 186 177 166 157 160 179 203 219 226 233 241 249 259 270 268 244 212 192
$$ packed form
3644B35Ok8m3k9j1kJ0K5K8Qj0kJ6J4rk6k3qJoj5j5KJ9J6mk1k7l5m2l0LK4K3RPQMPK6M8M8L2
3626B33K1J4Nnqnj1j6j0OQlj4j1JQOnj8k0lK2L7K8%l2m0j4K6M4L1QJJmj0j3j5k0j4J5M2M1
3607C07J3k0l8l9k6rnj3j2NK2K5K0J2Jj2j1J3L4K7%k3l7n0n4m2j7MJ8K7K4J4J4L0K7j0m9n1
3590A19k1kKOJ3Mj1mK1L3K5J5J4Qrj9j4onNJ9K2Mj4k2j7rOK3K3Pnrj3j6oK0L4K6J2Mrl3m8
3571A73l4j1krj6j9j8j1OK0J7KmNJ6J6OmkJ7M1M6K9%k3l0k3j1%QJ4J7J4J3J9K5J1j6k8pJ9
3554B66K0KkJ2K1Rqj6j5nJ1J7jk3k2mol5n8m7j6J5L3M2L6K4K2K9K8Rj1j8k4l2l2k1j2j0oJ2
3536A84K5J9OKMOJ5L1L8K5Lj0j0kJ1K3K1Lj2j2pm%kj9m4m7k0RJ9J7K0J7Kj1rpj9l2k1NJ8J7
3518B52J1QMmqrqkQOj6m1m7l2j5LK1L1K5J5J9K6J8ok5k4j6qrj1rLJ9K4J6PPQQJ0J1kk4l2k0
$$ plain form
3498 192 187 181 176 184 200 204 195 194 208 224 234 246 265 272 253 217 177 140 111 108 137 184 227 256 268 264 257 260 266 258 241 240 259 272 259 235 226 235 254 283 313 325 303
3480 303 265 241 237 231 210 180 158 155 161 157 140 128 144 180 204 204 198 197 194 181 175 187 212 242 286 348 406 437 434 404 354 298 264 265 276 269 245 228 226 230 231 233 240 256
3460 256 277 292 278 233 187 176 206 245 262 243 200 161 150 170 203 231 248 256 252 236 223 221 224 223 219 210 189 164 157 174 201 222 244 265 266 240 214 218 245 266
3443 266 269 256 223 167 109 81 91 124 163 201 230 246 261 282 297 290 271 260 257 249 234 225 217 198 178 180 208 237 242 230 221 221 225 224 221 227 252 280 283 252 215 199
3425 199 196 190 184 195 221 245 257 255 239 215 205 221 241 237 213 194 189 185 179 180 185 182 177 192 225 253 270 293 329 352 335 280 211 154 123 117 123 127 126 128 136 149 171 194
3406 194 200 187 186 221 269 282 252 211 179 152 129 125 139 154 164 184 213 231 229 222 221 218 210 206 210 210 197 183 181 193 215 239 248 227 194 183 199 213 209 201 206 221 254
3387 254 315 381 403 364 307 273 258 233 199 175 167 166 167 172 180 192 214 243 263 273 285 307 320 319 326 355 386 390 370 350 332 306 267 227 192 160 134 118 113
3370 113 121 147 186 220 229 214 187 164 157 171 189 196 193 197 198 178 140 123 139 162 166 161 170 185 186 178 173 171 160 141 119 94 71 65 88 127 163 197 233 264 281 291
$$ packed form
3498A92nonQJ6MrjJ4J6J0J2J9Pj9l6m0l7k9lK9M7M3K9J2mpLOqj7jJ9J3j3k4rRJ9K9L0J2k2
3480C03l8k4mok1l0k2lOmj7j2J6L6K4%ojlj3oJ2K5L0M4O2N8L1ll0n0n6l4JJ1pk4j7kMJKPJ6
3460B56K1J5j4m5m6j1L0L9J7j9m3l9j1K0L3K8J7Qmj6j3kLjmrk1k5pJ7K7K1K2K1Jk6k6MK7K1
3443B66Lj3l3n6n8k8J0L3L9L8K9J6J5K1J5pj9j1lqj5rqj9k0KK8K9Nj2r%MjlOK5K8Ll1l7j6
3425A99looJ1K6K4J2kj6k4j0J6K0mk4j9nmoJNlnJ5L3K8J7K3L6K3j7n5o9n7l1oOMjKQJ3K2K3
3406A94Oj3jL5M8J3l0m1l2k7k3mJ4J5J0K0K9J8kpjlqmM%j3j4kJ2K2K4Rk1l3j1J6J4mqNJ5L3
3387B54O1O6K2l9n7l4j5k5l4k4qjJNQJ2K2K9K0J0J2K2J3jPK9L1Mk0k0j8k6l9m0l5l2k6j6n
3370A13QK6L9L4Rj5k7k3pJ4J8PlMJk0l8j7J6K3MnRJ5Jqnkj1j9k2k5k3oK3L9L6L4L6L1J7J0
$$ plain form
3352 291 299 298 287 275 264 240 199 159 134 115 97 95 116 138 142 142 153 164 161 156 163 168 152 124 106 99 96 107 136 159 158 145 145 151 148 147 169 204 228 248 282 313 307
3333 307 267 228 205 179 150 138 150 166 174 183 195 196 182 168 164 162 158 161 175 192 205 215 216 197 171 161 169 179 184 186 184 172 161 165 180 189 191 201 221 236 245 262 287
3315 287 301 295 286 282 271 253 242 243 242 233 232 247 266 269 251 218 179 148 138 150 169 189 212 235 247 246 236 216 180 141 120 125 143 162 172 167 150 140 155 181
3297 181 190 177 162 153 146 145 154 165 162 155 160 165 144 104 81 88 104 119 143 167 166 139 122 134 156 167 174 180 169 136 108 108 130 156 185 215 233 233 229 225 211 188 177
3279 177 184 190 186 189 213 237 242 240 247 255 253 252 272 308 342 365 371 355 327 306 302 303 302 308 322 326 318 317 330 335 320 303 302 302 284 259 247 245 242 238 229 203 163 135 137 153 165 178
3258 178 197 213 221 236 264 278 260 234 233 255 275 280 271 247 220 217 246 275 274 254 239 230 221 233 279 333 357 354 344 320 270 217 201 217 232 234 237 245 246 239 241 252
3240 252 259 259 263 273 284 305 342 380 394 381 352 311 263 231 229 237 232 224 232 243 229 198 185 196 203 195 180 166 144 127 138 172 204 220 229 233 223 207 205 218 223 213
3222 213 202 193 180 168 166 173 180 195 230 271 293 295 297 303 299 288 297 331 364 376 375 366 346 322 319 343 368 369 342 295 238 190 176 198 232 264 292 314 325 333 348 364
$$ packed form
3352B91Qjj1j2j1k4m1m0k5j9j8kK1K2M%J1J1lnPNj6k8j8plJ1K9K3jj3%OljK2L5K4K0L4L1o
3333C07m0l9k3k6k9j2J2J6QRJ2Jj4j4mkmLJ4J7J3J0Jj9k6j0QJ0NKkj2j1MJ5RKJ0K0J5RJ7K5
3315B87J4ormj1j8j1JjrjJ5J9Lj8l3l9l1j0J2J9K0K3K3J2jj0k0l6l9k1NJ8J9J0nj7j0J5K6
3297A81Rj3j5rpjRJ1lpNNk1m0k3PJ6J5K4K4jk7j7J2K2J1POj1l3k8%K2K6K9L0J8%mmj4k3j1
3279A77POmLK4K4NkPQkjK0L6L4K3Oj6k8k1mJjOJ4MqjJ3Nj5j7j%j8k5j2klmrk6m0k8KJ6J2J3
3258A78J9J6QJ5K8J4j8k6jK2K0Nrk4k7lK9K9jk0j5rrJ2M6N4K4lj0k4n0n3j6J6J5KLQJpKJ1
3240B52P%MJ0J1K1L7L8J4j3k9m1m8l2kQnqQJ1j4l1j3J1Pqj5j4k2j7J1L4L2J6RMj0j6kJ3Nj0
3222B13j1rj3j2kPPJ5L5M1K2KKOmj1RL4L3J2jrk0k4lK4K5Jk7m7n7m8j4K2L4L2K8K2J1QJ5J6
$$ plain form
3203 364 366 352 344 349 357 353 332 289 230 186 179 198 215 229 260 300 326 333 340 347 329 286 249 239 246 259 277 289 277 244 226 240 272 299 313 311 283 233 180 132
3186 132 94 80 108 164 210 227 227 223 212 201 209 239 274 302 320 318 282 228 193 187 192 186 172 155 137 139 179 241 286 306 318 325 310 277 253 240 212 170 149
3169 149 164 189 203 209 205 173 119 84 88 110 131 163 212 252 272 289 316 334 336 337 344 335 305 285 292 302 294 288 303 319 307 270 220 162 115 110 151 199 223 237
3152 237 253 253 226 203 214 246 276 309 353 391 414 434 451 435 377 313 279 265 251 245 251 246 224 218 243 258 227 178 146 111 52 7 27 97 163 211 255
3136 255 283 268 225 199 199 199 195 211 242 258 249 233 220 205 198 213 238 248 242 235 224 202 187 202 234 252 253 255 261 258 245 233 219 192 169 166 174 175 176 185 188 169 148
3117 148 148 152 130 98 91 106 114 111 125 158 193 227 269 300 296 262 229 209 198 207 245 291 313 313 315 320 312 290 266 236 198 172 178 197 202 199 207 214 202 188 196 211 211 213
3098 213 244 279 276 246 226 215 184 147 146 176 196 198 207 227 231 223 230 257 279 292 303 296 255 212 213 239 237 206 191 195 182 149 137 157 184 215 271 335 359 338
3081 338 317 309 293 272 279 308 316 299 297 318 316 274 231 215 207 199 211 239 251 246 261 295 307 292 293 318 322 288 254 241 225 193 179 197 221 235 258 293 310 306
$$ packed form
3203C64Kj4qNQmk1m3n9m4pJ9J7J4L1M0K6PPPj8m3l7j0PJ3J8J2j2l3j8J4L2K7J4kk8n0n3m8
3186A32l8j4K8N6M6J7%mj1j1QL0L5K8J8kl6n4l5oNoj4j7j8KM0O2M5K0J2Pj5l3k4j3k8m2k1
3169A49J5K5J4Oml2n4l5MK2K1L2M9M0K0J7K7J8KJPrl0k0PJ0qoJ5J6j2l7n0n8m7nM1M8K4J4
3152B37J6%k7k3J1L2L0L3M4L8K3K0J7j6n8o4l4j4j4oOnk2oK5J5l1m9l2l5n9m5K0P0O6M8M4
3136B55K8j5m3k6%%mJ6L1J6rj6j3j5pJ5K5J0opj1k2j5J5L2J8JKOlj3j2j4k7k3lQJJRLj9k1
3117A48%Mk2l2pJ5QlJ4L3L5L4M2L1ml4l3k0j1RL8M6K2%KNqk2k4l0l8k6OJ9NlQPj2j4QJ5%K
3098B13L1L5ll0k0j1l1l7jL0K0KRK0MqPK7K2J3J1pm1m3JK6kl1j5Mj3l3j2K0K7L1N6O4K4k1
3081C38k1qj6k1PK9Qj7kK1km2m3j6qqJ2K8J2nJ5L4J2j5JK5Ml4l4j3j6l2j4J8K4J4K3L5J7m
$$ plain form
3063 306 308 316 301 279 296 342 349 298 242 211 177 126 90 76 44 -5 -16 29 72 77 80 115 155 180 219 277 306 286 270 299 335 344 351 375 383 356 335 348 357
3046 357 331 303 301 290 250 222 234 247 230 219 243 267 260 257 286 311 298 274 269 255 219 205 237 268 263 261 292 313 285 255 275 311 313 297 291 274 231 210 247
3030 247 293 298 291 315 338 325 310 322 314 253 203 231 289 300 283 304 348 357 342 347 364 356 340 354 372 356 332 344 363 344 311 301 283 218 144 115 109 82
3013 82 67 115 188 215 204 214 244 257 265 298 325 305 260 232 204 158 144 198 264 281 284 328 373 361 328 337 359 339 313 335 361 331 290 313 361 348 297
2997 297 287 301 271 215 207 235 240 235 265 295 272 243 279 340 343 310 312 336 323 305 341 391 391 381 430 492 485 450 473 525 530 517 558 621 635 636 690 753 764
2980 764 781 881 1014 1110 1210 1347 1429 1413 1437 1612 1864 2163 2695 3621 4936 6772 9361 12274 14089 13556 10994 7978 5714
2970 5714 4262 3246 2565 2204 1966 1718 1552 1497 1410 1262 1211 1281 1304 1243 1247 1321 1309 1226 1258 1394 1444 1428 1559 1834 2065 2275 2623
2958 2623 2989 3146 3257 3687 4402 5195 6341 8364 11371 15530 21761 30321 38506 41609 37380 28545 19931 14037 10338
$$ packed form
3063C06KQj5k2J7M6Pn1n6l1l4n1l6j4l2m9j1M5M3NLL5M0K5L9N8K9k0j6K9L6RPK4Qk7k1J3R
3046C57k6k8kj1m0k8J2J3j7j1K4K4plK9K5j3k4nj4l6j4L2L1nkL1K1k8l0K0L6Kj6oj7m3k1L7
3030B47M6NpK4K3j3j5J2qo1n0K8N8J1j7K1M4Rj5NJ7qj6J4J8j6k4J2J9j9l3j0j8o5p4k9ok7
3013H2j5M8P3K7j1J0L0J3QL3K7k0m5k8k8m6j4N4O6J7LM4M5j2l3RK2k0k6K2K6l0m1K3M8j3n1
2997B97j0J4l0n6qK8NnL0L0k3k9L6O1Ll3KK4j3j8L6N0%j0M9O2pl5K3N2Nj3M1O3J4JN4O3J1
2980G64J7J00J33R6J00J37Q2j6K4J75K52K99N32R26J315J836K589K913J815n33k562l016k264
2970E714j452j016o81l61k38k48j66n5q7j48n1P0K3o1MP4j2q3L2J36N0j6J31K75K31K10L48
2958B623L66J57J11M30P15P93J146K023L007M159O231Q560Q185L103m229q835q614n894l699
$$ plain form
2950 10338 7747 5997 4961 4205 3534 3118 2933 2726 2498 2443 2476 2368 2207 2212 2284 2231 2197 2380 2605 2661 2737 3046 3413 3697 4153
2939 4153 4880 5468 5762 6308 7474 8921 10637 13543 18334 25007 34520 48819 66603 80390 81515 68863 50254
2932 50254 34532 24490 18099 13514 10515 8776 7443 6254 5513 5116 4640 4132 3902 3826 3607 3366 3333 3353 3232 3163 3312
2923 3312 3448 3431 3535 3898 4250 4512 4999 5727 6298 6760 7684 9178 10890 13227 17302 23561 32212 45057 63699 84123
2914 84123 96049 91432 72980 51518 35501 25669 19078 14296 11333 9544 7978 6639 5909 5485 4899 4325 4065
2907 4065 3895 3563 3293 3278 3275 3125 3073 3236 3360 3367 3523 3864 4123 4318 4747 5349 5814 6303 7247 8594 10179 12608 16733 22733
2896 22733 31127 43757 60865 76900 82666 73907 56082 38832 27206 20047 14916 11270 9136 7720 6372 5326
2890 5326 4773 4297 3672 3239 3139 3013 2705 2505 2516 2466 2286 2230 2330 2340 2256 2322 2516 2599 2612 2802 3128 3380 3666 4219 4973 5860
$$ packed form
2950A0338k591j750j036p56o71m16j85k07k28n5L3j08j61NP2n3l4J83K25N6P6L09L67K84M56
2939D153P27N88K94N46J166J447J716K906M791O673R513J4299J7784J3787J125j2652j8609
2932E0254j5722j0042o391m585k999j739j333j189p41l97m76n08k30p6k19k41l3K0j21o9J49
2923C312J36j7J04L63L52K62M87P28N71M62R24J494J712K337M075O259Q651J2845J8642K0424
2914H4123J1926m617j8452k1462j6017r832o591m782k963j789j566j339p30m24n86n74k60
2907D065j70l32k70j5lj50n2J63J24PJ56L41K59J95M29O02M65M89R44J347J585K429M125O000
2896B2733Q394J2630J7108J6035N766q759j7825j7250j1626p159n131l646k134j416j348j046
2890E326n53m76o25m33j00j26l08k00J1n0j80n6J00J0q4O6J94Q3J3J90L26K52K86N53P54Q87
$$ plain form
2878 5860 7264 9615 12997 17814 24933 33725 40508 40942 34489 25171 17447 12576 9405 7053 5510 4596 3823 3109
2870 3109 2699 2521 2271 1958 1790 1713 1540 1351 1328 1381 1323 1231 1265 1345 1324 1280 1343 1423 1395 1353 1406 1456 1430 1474 1699 1991 2304 2842 3762
2858 3762 5052 6887 9524 12447 14134 13395 10717 7740 5583 4212 3229 2530 2105 1795 1494 1277 1177 1092 991 958 984
2849 984 952 849 785 770 702 573 486 459 412 351 360 422 439 411 426 478 481 441 440 467 441 384 386 437 440 397 398 444 456 442 483 565 594 567 568 607 611 575
2832 575 569 599 596 559 550 562 529 464 446 477 482 448 439 454 428 365 339 354 338 282 257 283 302 294 301 323 313 273 263 294 316 312 315 318 282 232 231 269 275 243 231
2815 231 257 276 283 311 343 329 286 284 324 337 308 289 288 263 216 201 220 217 192 202 252 287 293 314 351 349 305 283 308 332 333 340 352 328 269 225 204 166 119
2798 119 121 174 207 193 182 196 200 187 202 250 273 247 216 209 194 161 144 150 144 132 164 239 284 270 251 269 292 292 293 313 323 312 307 315 298 251 220 223 219 191
2780 191 175 189 201 207 246 316 359 347 325 319 295 245 223 256 295 295 276 265 249 226 233 276 301 280 257 267 278 259 240 250 263 258 255 270 269 238 226 271
$$ packed form
2878E860J404K351L382M817P119Q792O783M34o453r318p724m871l171k352j543r14p73p14
2870C109m10j78k50l13j68p7j73j89k3N3n8r2L4Q0k1m4O3Q0k8m2N3N0k6M4K25K92L13N38R20
2858C762J290J835K637K923J687p39k678k977k157j371r83o99m25l10l01k17j00q5j01l3K6
2849I84l2j03o4j5o8j29q7k7m7o1RO2J7k8J5N2Lm0jK7k6n7KN1Lm3JM6J2j4M1Q2K9k7JL9Ml6
2832E75oL0ll7rJ2l3o5j8L1Nl4rJ5k6o3k6J5j6n6k5K6J9qPK2j0m0j0L1K2mLLl6n0jL8Ol2j2
2815B31K6J9PK8L2j4m3kM0J3k9j9jk5m7j5J9lk5J0N0L5OK1L7km4k2K5K4JPJ2k4n9m4k1l8m7
2798A19KN3L3j4j1J4Mj3J5M8K3k6l1pj5l3j7Ooj2L2P5M5j4j9J8K3%JK0J0j1nQj7m7l1Lmk8
2780A91j6J4J2OL9P0M3j2k2ok4n0k2L3L9%j9j1j6k3PM3K5k1k3J0J1j9j9J0J3nlJ5jl1j2M5
$$ plain form
2764 271 334 362 359 343 311 258 218 206 193 161 141 153 167 164 181 241 307 342 365 401 427 422 413 423 427 409 405 439 461 421 353 322 330 334 324 314 297 266 244
2747 244 254 275 276 269 272 271 249 232 251 287 315 340 366 363 323 296 319 351 342 316 320 342 336 310 307 323 315 281 254 246 231 201 168 136 111 119 167 213 214 193 195 222
2729 222 239 245 259 275 269 252 255 271 265 237 221 223 225 225 237 255 259 252 259 283 305 312 306 289 272 274 291 292 263 236 240 251 238 212 202 198 181 175 208 267 317 359 409
2710 409 444 428 376 339 330 323 314 318 327 321 311 322 337 323 291 279 289 285 261 241 234 228 230 254 280 278 256 250 257 248 237 262 317 356 360 356 355 342 326 330 342 322 272 242
2691 242 253 273 273 270 283 298 305 313 324 327 324 333 347 337 309 304 338 382 408 416 412 392 369 369 386 382 342 292 256 228 200 187 196 213 229 251 276 296 316 348 375
2673 375 363 316 273 249 228 206 203 223 249 276 316 357 369 346 322 313 304 291 285 274 233 176 150 166 181 172 169 195 223 229 229 240 244 231 232 273 338 391 424 437
2656 437 420 377 335 310 287 250 215 203 206 215 230 241 228 196 183 204 230 240 244 254 253 234 217 215 216 216 233 266 280 254 213 183 159 142 158 213 267 294
2639 294 316 352 372 350 315 307 313 301 276 267 273 277 278 284 279 252 224 215 211 199 201 243 295 313 299 286 281 265 241 231 237 239 229 214 194 175 177 206 229 214 178 158
$$ packed form
2764B71O3K8lj6l2n3m0j2j3l2k0J2J4lJ7O0O6L5K3L6K6nrJ0Mj8mL4K2m0o8l1QMj0j0j7l1k2
2747B44J0K1JpLjk2j7J9L6K8K5K6lm0k7K3L2rk6MK2ok6lJ6ql4k7qj5l0l3l2k5QM8M6Jk1KK7
2729B22J7OJ4J6oj7LJ6ok8j6KK%J2J8MpPK4K2Poj7j7KJ7Jk9k7MJ1j3k6j0mj7oL3N9N0M2N0
2710D09L5j6n2l7rprMRoj0J1J5j4l2j2J0mk4k0poKK4K6kk2oPrj1K5N5L9Mmjj3j6MJ2k0n0l0
2691B42J1K0%lJ3J5PQJ1LlRJ4j0k8nL4M4K6Qmk0k3%J7mm0n0l6k8k8j3RJ7J6K2K5K0K0L2K7
2673C75j2m7m3k4k1k2lK0K6K7M0M1J2k3k4rrj3oj1m1n7k6J6J5rlK6K8O%J1Mj3JM1O5N3L3J3
2656D37j7m3m2k5k3l7l5j2LRJ5J1j3l2j3K1K6J0MJ0jj9j7kJ%J7L3J4k6m1l0k4j7J6N5N4K7
2639B94K2L6K0k2l5qOj2k5rOMJOnk7k8rmj2KM2N2J8j4j3nj6k4j0OKj0j5k0j9KK9K3j5l6k0
$$ plain form
2621 158 156 156 160 179 197 199 204 243 299 328 317 290 265 245 238 247 248 225 198 201 225 237 237 249 271 276 256 234 223 216 218 237 263 272 264 261 264 260 253 257 261 242 207 188 197 214
2601 214 225 235 241 235 225 223 226 222 222 246 285 309 312 316 327 333 332 335 335 314 281 260 251 233 211 212 233 242 231 222 226 224 204 185 184 191 202 225 259 284 295 302 306 297 286 300
2581 300 338 364 357 334 308 272 230 207 212 224 226 227 235 242 237 229 220 200 176 178 223 284 328 346 349 336 304 259 218 195 196 216 233 232 226 244 280 298 275 230 190 170
2563 170 169 181 184 159 114 82 79 94 115 135 144 128 107 123 181 240 267 264 246 216 181 159 151 137 115 115 153 203 238 260 273 265 228 187 164 151 133 128 156
2546 156 212 267 305 328 338 344 356 367 361 342 333 333 313 263 219 209 223 236 251 279 309 321 320 317 313 315 343 396 429 407 354 320 314 309 293 279 272 264 251 239 222
2528 222 193 173 189 238 285 308 312 310 304 293 282 272 266 270 284 299 304 296 271 226 170 130 117 120 127 143 176 219 266 320 376 408 403 379 358 340 316 293 277 267
2511 267 267 294 345 378 371 348 343 348 332 302 289 294 297 293 291 284 258 224 206 202 193 182 189 216 244 263 282 297 300 294 289 280 255 233 234 250 254 251 266 295 302 272 230 206 201
2492 201 214 244 280 300 299 290 278 256 232 226 238 250 256 271 298 318 324 325 326 320 304 284 258 216 172 157 177 202 210 209 213 226 242 260 268 253 227 214 216 207 182 163
$$ packed form
2621A58k%MJ9J8KNL9N6K9j1k7k5k0pRJk3k7LK4J2%J2K2Nk0k2j1pKJ9K6RqlLmpMMj9l5j9RJ7
2601B14J1J0Ooj0kLm%K4L9K4LMJ1OjL%k1l3k1rj8k2JK1Rj1rMkk0j9jPJ1K3L4K5J1PMrj1J4
2581C00L8K6pk3k6l6m2k3NJ2KJQPnqrk0k4KM5O1M4J8Lj3l2m5m1k3JK0J7joJ8L6J8k3m5m0k0
2563A70jJ2Lk5m5l2lJ5K1K0Rj6k1J6N8N9K7lj8l0l5k2qj4k2%L8N0L5K2J3ql7m1k3j3j8nK8
2546A56N6N5L8K3J0OJ2J1oj9r%k0n0m4j0J4J3J5K8L0J2jlmKK8N3L3k2n3l4onj6j4pqj3j2j7
2528B22k9k0J6M9M7K3Mkoj1j1j0oMJ4J5Nqk5m5n6m0j3LPJ6L3M3M7N4N6L2nk4k1j8k4k3j6j0
2511B67%K7N1L3pk3nNj6l0j3NLmkpk6l4j8mrj1PK7K8J9J9J5Lonrk5k2JJ6MlJ5K9Pl0m2k4n
2492B01J3L0L6K0jrj2k2k4oJ2J2OJ5K7K0OJJoj6k0k6m2m4j5K0K5QjMJ3J6J8Qj5k6j3Krk5j9
$$ plain form
2473 163 158 147 120 101 104 113 105 93 97 118 146 181 223 252 252 228 201 184 180 186 196 204 216 247 295 334 347 343 336 326 311 296 287 284 294 329 375 402 391 358 326
2456 326 305 292 287 283 267 241 217 206 202 210 237 269 272 239 204 201 221 240 257 282 310 326 330 334 337 326 301 280 274 284 299 309 310 313 328 343 336 310 291 291 295 296 306
2437 306 328 338 320 298 301 322 334 332 324 311 285 257 242 239 236 240 257 268 246 197 156 148 166 188 201 202 201 207 225 244 253 251 243 228 207 190 187 197 214 238 264 268
2419 268 239 197 171 159 139 104 70 51 51 74 115 154 174 177 185 202 215 219 220 229 253 291 327 336 312 280 269 285 304 310 300 284 274 284 305 314 299 276 261
2402 261 245 220 208 228 267 291 298 312 341 365 367 351 324 281 230 184 146 112 88 90 121 162 199 230 259 283 310 344 374 379 363 352 356 361 349 323 295 271
2385 271 252 240 231 217 199 183 179 182 188 186 174 160 161 185 222 258 286 302 298 279 269 284 305 310 305 311 323 318 295 284 299 325 349 366 371 354 318 284 257 228 200
2368 200 188 191 188 171 158 160 162 155 149 155 167 178 202 239 267 264 241 222 219 226 240 260 285 310 333 350 358 351 332 300 253 204 171 157 153 156 172 192 197 189 192 211 222
2349 222 210 186 169 155 136 123 134 162 187 205 221 232 235 242 265 299 324 333 334 329 312 282 252 231 217 199 169 127 91 86 112 148 172 185 201 222 243 265
$$ packed form
2473A63nj1k7j9LRqj2MK1K8L5M2K9%k4k7j7mOJ0QJ2L1M8L9J3mpj0j5j5rlJ0L5M6K7j1l3l2
2456C26k1j3nmj6k6k4j1mQK7L2Ll3l5lK0J9J7K5K8J6MMLj1k5k1oJ0J5J0JLJ5J5pk6j9%MJJ0
2437C06K2J0j8k2LK1J2kqj3k6k8j5llMJ7J1k2m9m1qJ8K2J3JjOJ8J9Rkqj5k1j7lJ0J7K4K6M
2419B68k9m2k6j2k0l5l4j9%K3M1L9K0LQJ7J3MJRK4L8L6Rk4l2j1J6J9Oj0j6j0J0K1Rj5k3j5
2402B61j6k5j2K0L9K4PJ4K9K4Kj6k7m3n1m6l8l4k4KL1M1L7L1K9K4K7L4L0Nj6j1MNj2k6k8k4
2385B71j9j2rj4j8j6mLOkj2j4JK4L7L6K8J6mj9j0J5K1NnOJ2nk3j1J5K6K4J7Nj7l6l4k7k9k8
2368B00j2Llj7j3KKpoOJ2J1K4L7K8lk3j9lPJ4K0K5K5K3J7Qpj9l2m7m9l3j4mLJ6K0NqLJ9J1
2349B22j2k4j7j4j9j3J1K8K5J8J6J1LPK3L4K5RJnj7l0l0k1j4j8l0m2l6nK6L6K4J3J6K1K1K2
$$ plain form
2332 265 289 303 296 264 219 181 167 174 179 156 112 80 77 88 104 141 213 297 353 365 347 321 303 301 310 312 300 286 280 271 249 228 222 224 218 208 215 241 265 272 268 262 255
2314 255 246 234 222 212 212 222 230 224 211 210 225 246 269 294 313 311 288 260 248 256 276 295 302 293 273 249 224 206 202 214 226 233 242 263 288 304 312 318 321 310 284 249
2296 249 216 192 182 180 170 156 163 203 251 272 260 235 210 186 171 173 187 194 187 177 171 167 167 183 222 267 297 303 286 260 246 255 279 301 315 326 338 343 332 305
2278 305 268 235 220 231 261 298 335 366 381 379 376 376 362 323 274 238 213 187 167 169 189 205 213 228 251 261 253 250 267 298 320 325 322 329 358 404 441 449 435 418
2261 418 407 397 393 397 398 380 354 343 353 368 379 396 415 414 386 350 332 337 354 372 379 371 362 369 385 386 374 372 392 413 411 394 376 362 351 346 342 332 320 320 329 331 322 322
2242 322 334 341 329 315 312 315 318 334 363 378 358 320 298 302 317 332 343 340 315 278 254 251 258 265 269 282 314 366 417 437 421 391 367 352 348 362 389 401 385 363
2225 363 353 343 317 287 280 294 309 318 328 336 329 317 318 335 350 353 343 317 273 232 219 229 238 237 241 258 281 306 329 346 346 335 324 315 306 302 313 328 324 301 281 272
2206 272 267 272 306 365 407 409 390 381 382 368 332 286 236 191 163 160 167 159 142 142 170 206 217 193 149 110 93 101 125 154 182 205 221 234 247 261 273 275 269 254 231
$$ packed form
2332B65K4J4pl2m5l8j4PNk3m4l2lJ1J6L7P2Q4N6J2j8k6j8kRKj2j4ork2k1oKoj0PK6K4Pmop
2314B55rj2j2j0%J0Qoj3jJ5K1K3K5J9kk3k8j2QK0J9Prk0k4k5j8mJ2J2PRK1K5J6QOLj1k6l5
2296B49l3k4j0kj0j4PM0M8K1j2k5k5k4j5KJ4Ppj0om%J6L9M5L0Oj7k6j4RK4K2J4J1J2Nj1k7
2278C05l7l3j5J1L0L7L7L1J5kl%j4l9m9l6k5k6k0KK0J6QJ5K3J0qlJ7L1K2NlPK9M6L7Qj4j7
2261D18j1j0mMJj8k6j1J0J5J1J7J9jk8l6j8NJ7J8PqrPJ6Jj2kK0K1kj7j8j4j1nmj0j2%RKr%
2242C22J2Pj2j4lLLJ6K9J5k0l8k2MJ5J5J1lk5l7k4lPPMJ3L2N2N1K0j6l0k4j5mJ4K7J2j6k2
2225C63j0j0k6l0pJ4J5RJ0Qpj2JJ7J5Lj0k6m4m1j3J0RjMJ7K3K5K3J7%j1j1rrmJ1J5mk3k0r
2206B72nNL4N9M2Kj9rJj4l6m6n0m5k8lPqj7%K8L6J1k4m4l9j7QK4K9K8K3J6J3J3J4J2Koj5k3
$$ plain form
2189 231 203 181 181 200 218 209 171 124 95 86 82 69 55 59 82 113 145 186 239 298 351 393 423 436 435 425 406 378 343 313 298 294 291 280 266 259 262 274 284 282
2171 282 263 232 196 165 153 165 188 196 177 149 142 165 199 214 202 178 160 157 173 209 255 291 299 286 274 273 272 263 253 254 261 265 267 276 287 281 249 206 178 172 173 166 150
2153 150 136 130 123 109 101 115 146 170 176 174 179 189 199 211 224 225 208 191 196 224 254 271 274 268 261 265 282 292 280 255 247 263 280 278 263 257 272 299 315 308 287 269 259
2134 259 241 208 174 152 136 117 107 119 149 180 214 252 279 276 256 255 282 309 312 300 287 274 256 243 240 238 234 237 251 258 251 242 250 266 268 246 215 204 227 281 339
2116 339 381 409 435 456 457 436 411 396 379 351 319 295 274 253 242 249 270 293 308 311 298 281 275 278 266 231 196 188 201 215 226 242 259 263 250 233 220 216 219
2099 219 220 211 193 177 168 158 141 127 124 131 143 163 189 205 203 196 200 220 249 287 329 353 345 318 296 280 258 231 212 198 179 156 145 153 168 178 179 175 175 187 206
2082 206 217 221 236 270 304 314 304 298 298 292 283 281 284 278 268 271 287 299 298 294 282 246 183 126 104 120 158 203 239 249 231 205 190 192 203 218 232 239 243 253 271 287
2063 287 295 302 306 304 299 304 315 315 295 273 273 298 328 349 359 363 363 356 335 307 294 314 350 364 340 299 273 269 270 272 283 302 317 312 288 254 216 177 141 125 138 170
$$ packed form
2189B31k8k2%J9J8rl8m7k9rmj3j4MK3L1L2M1N3N9N3M2L0J3jj0j9k8l5l0j5mlj1j4pLJ2J0k
2171B82j9l1l6l1j2J2K3Qj9k8pK3L4J5j2k4j8lJ6L6M6L6Qj3j2jjrj0JPMKRJ1ol2m3k8oJpj6
2153A50j4opj4qJ4L1K4OkNJ0J0J2J3Jj7j7NK8L0J7LopMJ7J0j2k5qJ6J7kj5oJ5K7J6pk1j8j0
2134B59j8l3l4k2j6j9j0J2L0L1L4L8K7lk0jK7K7Lj2j3j3j8j3lkmLJ4PprQJ6Kk2l1j1K3N4N8
2116C39M2K8K6K1Jk1k5j5j7k8l2k4k1k1j1PK1K3J5Lj3j7oLj2l5l5qJ3J4J1J6J7Mj3j7j3mL
2099B19Jrj8j6rj0j7j4lPJ2K0K6J6kpMK0K9L8M2K4qk7k2j6k2k7j9j4j9k3j1QJ5J0Jm%J2J9
2082B06J1MJ5L4L4J0j0o%orkLoj0LJ6J2jmj2l6o3n7k2J6L8M5L6J0j8k6j5KJ1J5J4PMJ0J8J6
2063B87QPMknNJ1%k0k2%K5L0K1J0M%pk1k8j3K0L6J4k4m1k6mJKJ1J9J5nk4l4l8l9l6j6J3L2
$$ plain form
2045 170 197 207 213 227 241 243 238 236 228 199 160 141 157 188 212 227 240 244 231 199 161 131 127 158 206 241 250 253 265 282 295 307 324 331 315 286 263 253 252 260 285
2027 285 318 338 332 307 282 271 270 269 259 247 248 263 276 274 261 252 246 237 222 209 202 202 211 231 260 291 316 329 328 322 316 307 289 274 280 308 334 346 357 381 404 404 384
2009 384 371 375 384 385 384 387 389 376 345 310 283 265 245 222 205 204 216 226 235 250 265 264 248 237 242 249 239 216 192 171 146 123 117 131 152 168 176 169 148 124 120 149
1990 149 203 262 306 324 324 328 345 368 381 385 383 368 335 301 286 282 271 254 252 270 288 289 281 281 288 294 298 305 310 301 275 242 219 214 226 243 251 245 225 202 192 207 235 253
1971 253 244 216 190 177 182 207 242 266 263 246 234 227 213 194 189 205 226 238 247 262 283 296 295 290 291 296 290 263 228 205 207 224 243 260 271 260 226 193 187 203 214
1954 214 212 211 221 229 225 215 211 216 230 253 271 272 257 242 231 215 188 164 155 162 180 207 233 241 231 225 238 263 276 267 242 217 212 241 296 348 375 378 370 354 328 295
1935 295 255 205 157 134 146 172 182 169 146 129 125 137 166 199 218 220 208 189 164 139 126 136 167 207 236 242 239 251 283 317 332 334 335 334 318 294 277 271 267
1919 267 261 263 282 306 322 323 317 317 330 351 366 366 361 368 390 409 402 366 319 285 271 269 264 254 244 240 243 255 284 323 353 361 356 358 372 380 369 339 301 262 224 194 182
$$ packed form
2045A70K7J0OJ4J4Knkqk9l9j9J6L1K4J5J3Mj3l2l8l0mL1M8L5RLJ2J7J3J2J7Pj6k9k3j0jQK5
2027B85L3K0ok5k5j1jjj0j2JJ5J3kj3rorj5j3p%RK0K9L1K5J3joorj8j5OK8K6J2J1K4K3%k0
2009C84j3MRJjLKj3l1l5k7j8k0k3j7jJ2J0RJ5J5jj6j1NPj0k3k4k1k5k3oJ4K1J6Qpk1k4mK9
1990A49N4N9M4J8%MJ7K3J3Mkj5l3l4j5mj1j7kJ8J8Jq%POMPNrk6l3k3nJ2J7Qok0k3j0J5K8J8
1971B53rk8k6j3NK5L5K4lj7j2pj4j9nJ6K1J2RJ5K1J3jnJNok7l5k3KJ7J9J7J1j1l4l3oJ6J1
1954B14kjJ0Qmj0mNJ4K3J8Jj5j5j1j6k7k4rPJ8K7K6Qj0oJ3K5J3rk5k5nK9N5N2K7Lqj6k6l3
1935B95m0n0m8k3J2K6J0j3k3j7mJ2K9L3J9Kj2j9k5k5j3J0L1M0K9OlJ2L2L4J5KJjj6k4j7om
1919B67oKJ9K4J6Jo%J3K1J5%nPK2J9pl6m7l4j4knj0j0mLJ2K9L9L0QnKJ4Qj1l0l8l9l8l0j2
$$ plain form
1900 182 193 212 218 208 198 204 220 231 234 240 253 263 263 262 269 278 281 272 257 237 214 194 185 189 197 206 213 218 225 242 268 294 314 334 360 389 410 416 404 381 358 346 343 337 331
1880 331 333 338 333 316 308 322 342 342 323 303 282 251 219 208 222 239 241 231 219 209 201 198 202 210 220 233 245 252 251 245 236 235 251 288 330 351 343 318 293 269 245 223 207
1862 207 206 220 242 254 249 240 238 236 223 208 213 241 270 285 294 303 307 299 292 300 311 308 285 256 231 214 204 197 193 192 204 230 261 283 295 300 293 274 254 247 256 272 291 312 331
1842 331 338 335 334 339 342 333 309 274 237 207 196 205 221 233 235 229 221 215 221 238 258 269 268 262 264 279 303 323 322 303 282 280 294 303 296 288 291 297 289 265 243 233 223 203 183 177 188
1822 188 202 212 220 233 252 275 290 284 259 240 245 261 260 237 217 220 241 258 253 229 208 207 229 253 266 279 308 350 383 396 408 443 513 608 707 773 775 713 621
1805 621 542 494 467 447 426 402 380 368 360 341 306 268 239 213 182 159 162 195 241 283 319 345 352 336 309 290 286 285 274 251 233 233 241 238 222 205 195 189 183 178
1788 178 178 174 157 136 128 143 169 189 190 170 140 117 111 124 152 189 216 219 200 177 160 147 138 143 164 183 182 165 149 144 149 166 193 219 229 222 212 207 205 202 198 196 200 211
1769 211 223 231 238 258 289 312 314 299 282 264 242 215 191 170 157 163 179 182 165 154 178 219 238 227 216 222 234 237 244 262 273 260 234 221 225 225 211 191 177 171
$$ packed form
1900A82J1J9Oj0j0OJ6J1LOJ3J0%jPRLrj5k0k3k0rMQRPNPJ7K6K6K0K0K6K9K1Oj2k3k3j2loo
1880C31KNnj7qJ4K0%j9k0k1l1l2j1J4J7Kj0j2j0qlMQJ0J3J2PjorjJ6L7M2K1qk5k5k4k4k2j6
1862B07jJ4K2J2nrkkj3j5NK8K9J5RRMqpQJ1lk3k9k5j7j0pmjJ2K6L1K2J2Npj9k0pRJ6J9K1J9
1842C31PljNLrk4l5l7l0j1RJ6J2KoqoOJ7K0J1joKJ5K4K0jj9k1kJ4RpqLOqk4k2j0j0k0k0oJ1
1822A88J4J0QJ3J9K3J5ok5j9NJ6jk3k0LK1J7nk4k1jK2K4J3J3K9M2L3J3J2L5P0R5R9O6Ko2r2
1805F21p9m8k7k0k1k4k2j2qj9l5l8k9k6l1k3LL3M6M2L6K6Pj6k7j9mjj1k3j8%Qlj6j7j0oon
1788A78%mj7k1qJ5K6K0Jk0l0k3oJ3K8L7K7Lj9k3j7j3rNK1J9jj7j6nNJ7K7K6J0pj0nklmkMJ1
1769B11J2QPK0L1K3Kj5j7j8k2k7k4k1j3OJ6Lj7j1K4M1J9j1j1OJ2LPJ8J1j3k6j3M%j4k0j4o
$$ plain form
1751 171 174 193 225 258 277 283 289 305 324 334 331 323 318 318 323 329 335 336 328 311 284 250 220 214 241 284 313 314 298 285 284 289 288 272 251 238 241 252 260 264 268 271 268 275 305 348 375
1731 375 373 360 363 384 409 427 435 428 404 376 358 348 329 296 264 250 248 240 228 231 262 303 329 338 342 345 340 326 320 326 331 319 299 279 254 220 189 175 174 168 157 153 157 155
1712 155 143 130 122 123 144 191 241 259 240 207 181 161 148 152 174 201 228 264 305 324 313 298 307 332 345 338 316 284 248 235 260 303 327 320 298 276 256 240
1695 240 235 236 231 217 201 184 160 133 118 119 118 110 105 117 139 159 172 186 203 223 244 261 266 251 220 188 171 177 204 236 252 244 220 197 188 191 197 198 193 190 193 199 207 222
1676 222 253 291 316 315 291 261 237 224 219 216 216 222 240 262 277 276 257 230 202 175 145 113 87 74 71 71 80 105 145 186 224 268 322 363 371 348 318 298 289 286 291
1658 291 302 307 297 276 250 223 202 189 188 199 226 264 304 331 344 347 340 320 286 249 223 216 224 240 257 275 300 330 356 365 355 329 290 248 220 219 242 274 305
1642 305 331 348 359 371 378 367 334 299 280 266 233 185 151 143 139 117 85 61 52 51 56 74 103 133 154 156 134 95 59 45 59 86 107 113 110 115 132 151 160 163 162
1624 162 155 133 105 86 79 79 88 115 153 184 201 213 226 227 217 218 246 280 290 273 257 267 297 328 344 343 335 332 338 341 333 313 289 270 261 264 275 282 281 278 274 258 226 191
$$ packed form
1751A71LJ9L2L3J9OOJ6J9J0lqn%NOOJqj7k7l4l0oK7M3K9Jj6j3jNjj6k1j3LJ1QMMLlPL0M3K7
1731C75kj3LK1K5J8Qpk4k8j8j0j9l3l2j4kqj2LL1M1K6RMLnj4oONj2k0k0k5l4l1j4joj1mMk
1712A55j2j3qJK1M7N0J8j9l3k6k0j3MK2K7K7L6M1J9j1j5RK5J3pk2l2l6j3K5M3K4pk2k2k0j6
1695B40nJnj4j6j7k4k7j5JjqnJ2K2K0J3J4J7K0K1J7Nj5l1l2j7OK7L2J6qk4k3rLOJnlLOQJ5
1676B22L1L8K5jk4l0k4j3nl%OJ8K2J5jj9k7k8k7l0l2k6j3l%RK5M0M1L8M4N4M1Qk3l0k0rlN
1658B91J1Nj0k1k6k7k1j3jJ1K7L8M0K7J3Lpk0l4l7k6pQJ6J7J8K5L0K6Rj0k6l9m2k8jK3L2L1
1642C05K6J7J1J2Pj1l3l5j9j4l3m8l4qmk2l2k4rjNJ8K9L0K1Kk2l9l6j4J4K7K1OlNJ7J9RLj
1624A62pk2k8j9p%RK7L8L1J7J2J3Jj0JK8L4J0j7j6J0L0L1J6jqlOLqk0k4j9rLJ1Pjlmj6l2l5
$$ plain form
1605 191 174 178 193 210 233 256 266 261 248 241 239 238 232 223 211 201 193 183 173 175 197 232 265 285 291 285 271 262 273 306 343 366 373 375 384 407 442 478 501 499 465 404 333
1586 333 277 250 247 255 274 304 334 340 319 292 286 300 311 297 252 183 112 70 76 122 172 203 222 253 295 328 332 318 308 307 304 293 285 289 298 307 313 316 309 288 267 255
1568 255 240 209 170 147 148 153 145 133 136 155 180 206 239 273 296 301 298 302 317 330 336 339 344 345 336 320 310 315 324 322 307 295 296 305 310 309 305 299 291 281 273 263 246 222 204 205 221
1547 221 238 241 233 229 238 253 265 268 262 255 256 271 288 290 273 251 243 251 266 282 301 322 336 341 340 333 320 306 302 307 307 291 271 268 285 305 307 291 267 239 204 162 128 117
1528 117 131 162 202 247 290 322 339 343 340 334 330 325 315 291 261 239 228 213 189 171 180 213 245 259 261 260 260 259 259 260 260 259 260 261 256 246 245 262 287 299 293 281 281 292 303
1509 303 315 339 372 391 375 336 311 319 343 359 358 350 346 348 360 383 403 406 390 368 352 337 320 299 274 243 210 181 158 141 138 157 187 211 217 219 226 232 224 218 234
1491 234 274 306 302 265 226 216 239 281 322 352 371 379 373 362 359 369 383 390 406 466 569 666 686 604 468 349 284 260 252 252 262 278 294 310 335 362 376
1475 376 369 354 342 335 329 328 330 325 298 258 226 217 226 235 232 224 221 230 239 231 204 175 163 164 163 155 153 169 198 225 238 242 247 258 267 269 270 287 324 363 385 388 385 384 382 370 344 301 248
$$ packed form
1605A91j7MJ5J7K3K3J0nj3pkjorj2j0qj0j0KK2L5L3K0Ooj4rJ1L3L7K3PKRK3L5L6K3kl4o1p1
1586C33n6k7lQJ9L0L0Ok1k7oJ4J1j4m5o9p1m2OM6N0L1J9L1M2L3Mj4j0jlj1qMRROLpk1k1j2
1568B55j5l1l9k3JNqj2LJ9K5K6L3L4K3NlMJ5J3OLNJrj6j0NRkj5j2JRNjmoqj0qj0j7k4j8JJ6
1547B21J7LqmRJ5J2LopJJ5J7Kj7k2qQJ5J6J9K1J4Njpj3j4mN%j6k0lJ7K0Kj6k4k8l5m2l4j1
1528A17J4L1M0M5M3L2J7Mlomnj0k4l0k2j1j5k4j8RL3L2J4Kj%j%J%jJJnj0jJ7K5J2oj2%J1J1
1509C03J2K4L3J9j6l9k5QK4J6jqmKJ2K3K0Lj6k2j6j5j7k1k5l1l3k9k3j7lJ9L0K4OKPOqoJ6
1491B34M0L2ml7l9j0K3M2M1L0J9Qoj1lJ0J4PJ6O0J03R7K0q2j36j19o5k4q%J0J6J6J6K5K7J4
1475C76pj5j2pojKnk7m0l2rRRlqlRRqk7k9j2JjqkJ6K9K7J3MNJ1RKJJ7L7L9K2Lljkj2k6m3n3
$$ plain form
1454 248 200 165 137 108 86 89 119 156 190 224 260 279 263 227 198 194 211 239 271 301 322 335 341 340 329 313 304 304 308 308 310 320 333 340 337 331 327 322 316 304 285 260
1436 260 239 239 268 317 363 389 399 408 414 410 400 411 460 525 571 587 584 571 544 517 516 550 587 590 562 528 508 504 514 532 547 547 530 496 446 388 351 355 384 402
1418 402 397 390 400 426 453 466 466 471 499 542 564 557 560 605 674 746 843 991 1169 1371 1663 2125 2765 3629 4919 6756 8717 9866 9500 7836
1405 7836 5799 4171 3101 2370 1830 1470 1254 1093 955 858 797 744 703 691 687 656 611 589 583 554 500 449 410 365 321 301 308 318 328 358
1392 358 408 448 464 466 465 454 438 434 439 431 398 357 330 318 322 340 368 400 433 463 475 461 438 422 399 347 285 260 282 317 339 362 399 427 416 375 338 319
1376 319 304 281 260 258 282 315 334 333 332 348 374 397 416 437 449 436 414 409 413 388 322 247 202 193 208 237 271 296 307 313 314 305 291 291 308 324 330 342 368 388
1358 388 385 368 353 339 321 311 323 341 347 340 335 336 339 346 358 365 364 367 381 387 367 332 310 309 312 313 317 323 315 290 264 252 255 271 293 309 306 293 284 287 291 291 288 285 283 283 284 281 272 264
1337 264 268 284 302 316 328 335 326 304 285 285 304 329 350 365 382 400 408 390 347 296 254 225 213 224 249 260 237 197 174 184 214 242 258 267 279 298 311 302
$$ packed form
1454B48m8l5k8k9k2LL0L7L4L4L6J9j6l6k9mJ7K8L2L0K1J3Ojj1j6r%M%KJ0J3Plomnoj2j9k5
1436B60k1%K9M9M6K6J0ROmj0J1M9O5M6J6lj3k7k7jL4L7Lk8l4k0mJ0J8J5%j7l4n0n8l7MK9J8
1418D02npJ0K6K7J3%NK8M3K2pLM5O9P2R7J48J78K02K92M62O40Q64J290J837J961J149l66j664
1405G836k037j628j070p31n40l60k16j61j38r7o1n3m1j2ml1m5k2ok9n4n1l9m5m4k0PJ0J0L0
1392C58N0M0J6Kjj1j6mNql3m1k7j2MJ8K8L2L3L0J2j4k3j6k3n2o2k5K2L5K2K3L7K8j1m1l7j9
1376C19j5k3k1kK4L3J9jjJ6K6K3J9K1J2j3k2nMk5o6p5m5rJ5K9L4K5J1OJrj4%J7J6OJ2K6K0
1358C88lj7j5j4j8j0J2J8OpnJLPJ2PjLJ4Ok0l5k2jLJMOqk5k6j2LJ6K2J6lj3rLM%llk%Jlrq
1337B64MJ6J8J4J2Prk2j9%J9K5K1J5J7J8Qj8m3n1m2k9j2J1K5J1k3m0k3J0L0K8J6RJ2J9J3r
$$ plain form
1320 302 270 237 218 208 203 212 242 275 290 294 305 321 324 311 297 285 269 247 235 234 235 231 226 220 212 209 218 227 228 234 271 329 371 374 360 357 367 377 383 381 364 328 285 249
1301 249 224 214 225 252 278 285 276 262 251 247 249 250 242 230 230 247 266 273 277 287 300 308 310 312 312 309 308 311 304 283 258 240 222 196 176 183 218 260 291 311 320 311 284 257 253
1282 253 276 315 346 354 337 305 271 244 226 216 211 213 227 248 263 262 254 257 272 278 264 243 234 246 270 292 302 299 294 299 307 301 275 244 225 220 217 210 203 197 200 219 250 280
1263 280 297 304 306 304 294 278 262 253 256 272 295 309 307 296 293 308 339 377 402 398 369 335 308 289 274 269 275 284 292 309 341 381 411 425 415 379 332 300 294 293 279 261
1244 261 260 270 270 249 225 211 217 244 291 341 375 388 381 349 300 262 259 280 291 280 267 267 269 264 264 279 303 325 347 377 405 409 390 367 358 363 372 381 389 391 384 367 348
1226 348 332 309 269 222 194 197 223 251 269 270 254 232 222 227 231 225 221 230 238 232 222 227 242 246 239 239 251 259 253 244 244 249 260 281 307 316 301 279 274 287 305 324 346 366 377
1206 377 373 353 321 292 284 298 316 325 330 330 312 270 232 224 241 252 245 235 235 241 244 246 254 267 270 256 232 213 210 214 213 204 198 207 231 262 288 301 299 288 273 254 233 218 216
1187 216 215 203 187 190 214 236 237 225 221 229 237 237 229 212 191 184 202 240 272 284 281 279 283 288 290 291 296 309 325 340 350 355 348 331 319 326 343 347 331 313 309 313 322 344 381 416
$$ packed form
1320C02l2l3j9j0nRL0L3J5MJ1J6Lj3j4j2j6k2j2jJmnoqlRRJOL7N8M2Lj4lJ0J0Okj7l6m3l6
1301B49k5j0J1K7K6Prj4j1mKJqj2%J7J9PMJ0J3QKK%ljLpk1k5j8j8k6k0PL5M2L1K0Rrk7k7m
1282B53K3L9L1Qj7l2l4k7j8j0nKJ4K1J5jqLJ5Oj4k1rJ2K4K2J0lnNQok6l1j9nlppoLJ9L1L0
1263B80J7PKkj0j6j6rLJ6K3J4kj1lJ5L1L8K5mk9l4k7j9j5nORQJ7L2M0L0J4j0l6m7l2ojj4j8
1244B61jJ0%k1k4j4OK7M7N0L4J3pl2m9l8lK1J1j1j3%Kn%J5K4K2K2L0K8Mj9k3rNRRQKpj7j9
1226C48j6k3m0m7k8LK6K8J8Jj6k2j0NMomRQoj0NJ5Mp%J2Qor%NJ1K1K6Rj5k2nJ3J8J9K2K0J1
1206C77mk0l2k9qJ4J8RN%j8m2l8qJ7J1pj0%OLKQJ3Lj4k4j9lMjroRK4L1K6J3kj1j5j9k1j5k
1187B16jj2j6LK4K2Jj2mQQ%qj7k1pJ8L8L2J2lkMNKJNJ3J6J5J0Npj7j2PJ7Mj6j8mMRK2L7L5
$$ plain form
1167 416 429 424 410 381 325 256 205 188 186 179 167 162 166 167 154 127 96 78 85 118 166 217 264 306 341 366 378 378 370 358 343 324 306 295 295 303 315 329 338 330 300
1149 300 261 236 240 267 295 299 274 243 234 251 278 300 314 318 308 291 287 297 303 293 286 306 344 373 381 380 375 358 332 312 305 302 294 289 291 291 280 264 264 288 319 328 301 256
1130 256 221 213 220 231 249 281 317 337 342 341 340 331 314 299 291 284 273 264 263 266 272 283 299 315 323 326 325 317 301 287 279 275 272 273 278 282 282 282 283 284 288 305 333 354 353 336 321 317 323 341
1108 341 374 413 440 438 406 354 300 263 247 241 229 206 178 154 137 130 132 137 137 129 122 126 146 178 213 249 283 312 323 312 291 279 283 292 294 293 292 290 278 259 240 230
1090 230 224 210 185 159 141 129 117 110 123 154 183 195 199 209 219 218 213 230 272 312 320 301 283 281 294 306 308 298 280 258 229 202 193 207 228 232 218 203 198 200 207
1072 207 218 232 246 268 310 362 401 418 426 429 416 377 327 280 243 217 213 234 257 258 236 210 184 156 127 108 106 114 133 162 194 213 215 209 202 202 214 240 272 292
1055 292 293 278 252 225 201 184 169 160 170 205 248 279 294 299 298 287 272 260 244 222 204 213 250 285 293 274 245 221 216 235 266 285 288 297 335 386 410 388 332
1038 332 273 231 210 209 228 263 299 320 317 301 295 314 354 403 444 459 445 407 360 310 260 219 200 211 237 259 267 268 274 292 314 330 336 334 324 301 267 234 216
$$ packed form
1167D16J3nj4k9n6o9n1j7kpj2nMJj3k7l1j8PL3M8N1M7M2L5K5J2%qj2j5j9j8j1%QJ2J4Rql0
1149C00l9k5MK7K8Mk5l1rJ7K7K2J4Mj0j7mJ0Oj0pK0L8K9Qjnj7k6k0plqnK%j1j6%K4L1Rk7m5
1130B56l5qPJ1J8L2L6K0Njjrj7j5qpj1rjLOJ1J6J6QLjqj6j4qmlJNM%%JJMJ7K8K1jj7j5mOJ8
1108C41L3L9K7kl2n2n4l7j6oj2k3k8k4j7pKN%qpMK0L2L5L6L4K9J1j1k1j2MRKjjkj2j9j9j0
1090B30oj4k5k6j8j2j2pJ3L1K9J2MJ0J0jnJ7M2M0Qj9j8kJ3J2Kj0j8k2k9k7rJ4K1Mj4j5nKP
1072B07J1J4J4K2M2N2L9J7QLj3l9n0m7l7k6mK1K3Jk2k6k6k8k9j9kQJ9K9L2J9Kop%J2K6L2K0
1055B92Jj5k6k7k4j7j5rJ0L5M3L1J5Njj1j5j2j6k2j8RL7L5Qj9k9k4nJ9L1J9LRL8N1K4k2n6
1038C32n9m2k1jJ9L5L6K1lj6oJ9M0M9M1J5j4l8m7n0n0m1j9J1K6K2QJOJ8K2J6Okj0k3l4l3j8
$$ plain form
1021 216 208 197 186 188 208 234 254 271 291 311 315 297 266 240 234 247 266 276 270 254 238 228 227 231 239 258 294 335 354 340 309 288 286 297 322 365 408 420 386
1004 386 328 274 235 209 203 218 243 254 245 223 199 180 174 192 231 274 306 329 349 368 376 370 355 338 313 272 222 181 160 157 157 156 155 155 152 147 150 167 193 215 229
987 229 243 263 287 300 290 261 235 231 244 258 264 272 291 316 334 337 335 342 362 382 382 359 329 303 281 254 230 226 247 271 270 235 187 162 177 216 243 236 211 194
969 194 195 204 211 211 199 176 159 168 205 255 301 334 347 332 299 266 245 230 220 218 224 226 218 212 220 235 248 257 265 267 265 265 273 279 270 247 223 205 193 185 179 177 179 186 200 222 256
949 256 301 339 347 326 299 287 287 279 261 238 218 201 188 180 180 191 219 254 271 263 240 220 203 181 165 167 187 208 218 220 222 234 263 310 363 405 433 447 443 424
931 424 404 398 399 391 375 368 376 384 378 364 357 360 362 350 321 291 283 299 319 328 332 348 372 386 383 371 358 341 323 308 295 280 269 272 285 291 289 291 305 316 312 298 286 271 251
912 251 233 230 238 237 215 183 166 178 206 222 218 214 238 291 348 383 392 386 377 376 388 405 411 402 392 390 390 383 369 355 342 329 324 332 344 341 326 318 333 367 398 405 384 342 294
892 294 252 229 226 236 246 249 250 256 266 273 273 263 246 229 225 237 252 254 247 252 277 306 318 308 290 281 285 293 294 290 294 319 354 378 380 372 367 364 357 341 322 302 287 280 281 290 300
$$ packed form
1021B16qj1j1KK0K6K0J7K0K0Mj8l1k6oJ3J9J0oj6j6j0jMQJ9L6M1J9j4l1k1kJ1K5M3M3J2l4
1004C86n8n4l9k6oJ5K5J1rk2k4j9oJ8L9M3L2K3K0J9Qoj5j7k5m1n0m1k1l%jj%lnLJ7K6K2J4
987B29J4K0K4J3j0k9k6mJ3J4OQJ9K5J8LkPK0K0%k3l0k6k2k7k4mK1K4jl5m8k5J5L9K7pk5j7
969A94JRP%j2k3j7RL7N0M6L3J3j5l3l3k1j5j0kOKqoQJ5J3RQKk%QOrk3k4j8j2qokKPJ4K2L4
949B56M5L8Qk1k7j2%qj8k3k0j7j3q%J1K8L5J7qk3k0j7k2j6KK0K1J0KKJ2K9M7N3M2K8J4mj9
931D24k0oJqj6pQQoj4pLKj2k9l0qJ6K0RMJ6K4J4lj2j3j7j8j5j3j5j1LJ3OkKJ4J1mj4j2j5k0
912B51j8lQjk2l2j7J2K8J6mmK4N3N7L5RorjJ2J7Orj0k%pj4j4j3j3nQJ2lj5qJ5L4L1Pk1m2m8
892B94m2k3lJ0J0LJOJ0P%j0j7j7mJ2J5KpNK5K9J2j0j8rMQJmMK5L5K4Kqnlpj6j9k0j5pJRJ0
$$ plain form
872 300 309 305 286 262 247 239 229 218 221 245 273 284 277 265 255 246 234 219 198 172 149 139 143 160 192 235 268 271 251 235 247 278 304 307 290 270 258 257 265 281 304
854 304 326 336 330 314 297 282 273 268 266 266 272 292 326 356 359 330 285 245 214 184 147 111 92 99 121 151 188 229 254 242 201 159 130 111 100 113 153 198 224
837 224 230 230 230 227 225 231 246 267 294 322 336 321 284 246 223 223 252 304 356 384 384 371 361 361 371 380 370 329 275 233 217 221 234 248 253 247 243 251 265 270 271 287 328 376
818 376 413 428 424 407 390 380 369 348 331 343 380 410 405 376 349 337 331 322 302 270 235 212 202 193 176 157 145 137 130 126 133 147 162 175 188 197 196 187 178 174 180 199 228
800 228 253 261 254 244 234 225 217 217 221 221 213 203 200 207 224 246 265 270 257 234 216 208 208 216 233 255 268 261 241 227 228 236 246 258 267 261 235 206 191 188 183 179 185 196 194 176 161
779 161 165 187 212 234 253 267 283 315 364 410 430 419 390 355 324 308 308 314 313 305 297 292 291 295 313 343 374 396 401 387 351 301 256 235 238 244 232 205 186 198 234
762 234 273 303 328 348 362 368 373 375 360 325 286 259 242 228 222 225 228 220 206 203 218 246 276 298 301 282 249 220 201 186 175 184 226 291 346 363 347 327 323 323 310
744 310 282 256 245 247 260 288 329 361 367 352 331 313 297 281 265 254 254 281 336 394 421 411 390 384 394 400 380 332 276 238 232 249 276 307 339 362 367 356 338
$$ packed form
872C00Rmj9k4j5qj0j1LK4K8J1pj2j0rj2j5k1k6k3j0MJ7L2M3L3Lk0j6J2L1K6Lj7k0j2jQJ6K3
854C04K2J0oj6j7j5rnk%OK0L4L0Lk9m5m0l1l0l7l6j9PK2L0L7M1K5j2m1m2k9j9j1J3M0M5K6
837B24O%%lkOJ5K1K7K8J4j5l7l8k3%K9N2N2K8%j3j0%J0Rj0m1n4m2j6MJ3J4NomQJ4NJJ6M1M8
818C76L7J5mj7j7j0j1k1j7J2L7L0nk9k7j2ork0l2l5k3j0rj7j9j2qpmPJ4J5J3J3RjrrmOJ9K9
800B28K5Qpj0j0rq%M%qj0lPJ7K2J9Nj3k3j8q%QJ7K2J3pk0j4JQJ0J2Rok6k9j5lnmOJ1kj8j5
779A61MK2K5K2J9J4J6L2M9M6K0j1k9l5l1j6%OjqqnjMJ8L0L1K2Nj4l6n0m5k1LOj2k7j9J2L6
762B34L9L0K5K0J4ONKj5l5l9k7j7j4oLLqj4lJ5K8L0K2Lj9l3k9j9j5j1RM2O5N5J7j6k0m%j3
744C10k8k6j1KJ3K8M1L2Oj5k1j8j6j6j6j1%K7N5N8K7j0k1oJ0Ok0m8n6l8oJ7K7L1L2K3Nj1j8
$$ plain form
727 338 320 305 295 289 288 296 326 380 437 465 456 429 404 389 378 373 372 371 364 354 348 344 336 324 314 310 304 284 247 211 201 223 253 263 251 234 228 236 251 264 264 250 228
708 228 209 190 169 149 139 140 147 158 169 167 144 117 112 134 168 198 226 254 277 286 280 263 238 220 216 219 208 182 169 190 232 263 270 261 241 210 174 149 148 167 192
690 192 215 233 248 259 266 269 270 269 267 266 265 261 248 230 227 255 306 353 372 363 344 327 317 314 313 312 304 289 272 269 288 326 365 388 388 362 316 265 237 241 265 290 307 316
671 316 314 305 303 314 322 315 305 312 329 331 313 302 314 340 367 396 425 436 423 400 381 361 332 305 296 304 320 333 338 323 288 250 228 226 240 271 327 396 447 457 429
654 429 385 347 322 305 287 267 252 244 234 214 186 158 136 127 140 168 188 191 187 192 208 227 245 262 274 286 307 333 342 326 308 316 345 370 390 424 471 498 477
637 477 428 392 386 396 399 396 400 414 424 413 386 362 357 362 365 362 361 364 364 358 348 333 314 300 300 309 319 321 316 304 291 289 299 310 310 305 309 318 319 310 294 275 254 240 236 235 232 241 272
615 272 309 333 350 374 388 361 298 243 219 206 182 161 161 170 166 153 150 163 181 193 195 186 171 166 176 191 196 193 190 186 174 159 150 148 148 151 164 179 189 196 205 209 200 181 165
596 165 162 171 185 196 199 200 209 221 219 194 167 165 190 215 226 227 228 238 261 301 349 383 390 378 356 327 292 258 235 219 205 199 211 233 250 251 244 242 243 237 225 224 244 279
$$ packed form
727C38j8j5j0ojQL0N4N7K8rk7k5j5j1njjpj0omqj2j0mok0l7l6j0K2L0J0j2j7oQJ5J3%j4k2
708B28j9j9k1k0j0JPJ1J1kk3k7nK2L4L0K8K8K3Roj7k5j8mLj1k6j3K1M2L1Prk0l1l6k5jJ9K5
690A92K3J8J5J1PLJjkjjmj3j8lK8N1M7J9rj9j7j0ljjqj5j7lJ9L8L9K3%k6m6n1k8MK4K5J7R
671C16krkJ1Qpj0PJ7Kj8j1J2K6K7K9K9J1j3k3j9k0k9k7rQJ6J3Nj5l5l8k2kJ4L1N6O9N1J0k8
654D29m4l8k5j7j8k0j5qj0k0k8k8k2rJ3K8K0LmNJ6J9J8J7J2J2K1K6Rj6j8QK9K5K0L4M7K7k1
637D77m9l6oJ0LlMJ4J0j1k7k4nNLljL%oj0j5j9j4%RJ0Knj2j3kJ0J1%nMRJrj6j9k1j4mjlRL1
615B72L7K4J7K4J4k7o3n5k4j3k4k1%Rmj3lJ3J8J2Krj5nJ0J5Nllmj2j5rk%LJ3J5J0PRMrj9j6
596A65lRJ4J1LJRJ2kk5k7kK5K5J1JJJ0K3M0M8L4Pj2k2k9l5l4k3j6j4oJ2K2J7JpkJoj2jK0L5
$$ plain form
577 279 307 323 345 382 417 426 408 390 391 407 419 416 396 363 328 308 308 314 304 279 258 258 275 287 289 291 298 299 288 281 303 350 384 377 334 290 266 260 261 268 279 289 295
558 295 294 292 288 280 265 246 230 224 226 225 219 213 215 220 212 183 148 129 136 153 158 155 167 205 249 272 276 283 300 309 299 283 277 275 270 272 299 349 395 418 420 416 411 405 396 383 368 357 356
537 356 360 361 354 347 347 355 363 360 339 302 257 211 172 146 142 158 190 226 257 273 266 247 232 223 207 180 159 162 181 196 203 216 246 287 325 347 348 333 317 311 313 318 333 356
518 356 366 343 304 287 304 329 338 331 313 284 249 225 222 226 224 221 229 246 258 259 253 246 249 269 300 317 308 286 277 290 313 333 342 330 295 248 211 194 193 203 225 255 284
499 284 307 323 322 300 274 276 312 351 354 318 275 254 254 255 252 256 271 284 278 249 212 177 146 123 115 124 139 148 150 155 173 202 234 261 273 271 264 267 287 316 341 348 333 305
480 305 274 254 255 271 289 293 280 266 267 283 303 318 331 342 341 322 288 256 248 278 333 384 405 397 379 361 336 297 255 226 209 201 200 207 215 219 223 233 246 252 247 238 236
462 236 245 258 267 263 247 229 222 229 248 271 287 280 246 202 173 172 191 216 235 247 253 253 245 230 218 219 229 234 230 225 224 222 220 232 267 304 316 301 277 256 236 221 225 250
442 250 286 321 352 371 367 342 311 285 261 242 241 258 272 265 247 235 230 226 237 276 328 357 351 336 334 340 338 334 343 359 358 333 301 281 274 270 266 261 253 239 225 217 212 207 205 203
$$ packed form
577B79K8J6K2L7L5Rj8j8JJ6J2lk0l3l5k0%Oj0k5k1%J7J2KKPJj1pK2M7L4pm3m4k4oJPJ1J0O
558B95jkmqj5j9j6oKjooKNqk9l5j9PJ7NlJ2L8M4K3MPJ7Rj0j6oknKK7N0M6K3Kmnorj3j5j1j
537C56MJpp%QQlk1l7m5m6l9k6mJ6L2L6L1J6pj9j5rj6k7k1LJ9J5PJ3L0M1L8K2Jj5j6oKNJ5K3
518C56J0k3l9j7J7K5Rpj8k9l5k4lMklQJ7J2JopLK0L1J7rk2rJ3K3K0Rj2l5m7l7j7jJ0K2L0K9
499B84K3J6jk2k6KL6L9Ll6m3k1%JlMJ5J3ok9l7l5l1k3qRJ5RKNJ8K9L2K7J2kpLK0K9K5Pj5k8
480C05l1k0JJ6J8Mj3j4JJ6K0J5J3J1jj9l4l2qL0N5N1K1qj8j8k5l9m2k9j7qjPQMMJ0J3Onrk
462B36RJ3Rmj6j8pPJ9K3J6pl4m4k9jJ9K5J9J2O%qj5j2JJ0NmnjkkJ2L5L7J2j5k4k1k0j5MK5
442B50L6L5L1J9mk5l1k6k4j9jJ7J4pj8j2nmJ1L9N2K9oj5kOkmRJ6jk5l2k0pmmnqj4j4qnnkk
$$ plain form
423 203 189 151 108 97 135 201 259 296 322 345 364 372 367 360 362 377 398 414 420 425 433 432 411 383 368 366 360 348 345 358 366 347 305 266 243 232 228 231 239 247 254 255 245 222
403 222 203 211 254 313 361 388 396 394 388 385 380 365 339 313 296 286 272 252 234 226 227 237 255 274 281 280 287 312 337 337 315 301 318 351 372 364 336 298 261 235 228 236 242
385 242 239 234 229 223 220 230 258 287 301 298 295 301 314 329 347 363 368 357 338 324 321 324 318 293 248 198 160 146 154 179 218 266 317 366 404 419 406 375 354 361 384 392 373
366 373 342 322 316 315 319 330 347 355 347 330 309 278 237 208 218 266 315 333 322 304 290 281 283 306 343 365 353 323 309 319 327 315 294 289 302 310 299 284 286 308 331
348 331 338 324 305 302 329 374 409 415 398 373 347 321 301 294 295 289 270 244 225 220 223 224 216 203 202 221 250 272 280 278 270 259 257 269 285 285 264 242 232 235 245 265 298 334
329 334 362 374 371 360 350 347 343 323 291 264 257 261 267 276 293 313 332 357 382 382 345 297 271 266 260 248 246 251 240 213 208 247 310 357 373 371 356 331 299 269 245 229
311 229 231 250 269 275 276 286 302 307 302 301 309 313 306 293 281 267 255 255 268 274 260 240 241 267 295 311 315 308 280 236 202 199 221 244 259 273 287 292 281 262 246 236 232 236
292 236 248 260 262 252 242 239 249 275 311 342 348 324 282 246 236 255 291 318 322 312 306 311 315 312 307 313 329 342 342 331 319 305 287 268 257 260 268 272 281 311 355 379 360
$$ packed form
423B03j4l8m3j1L8O6N8L7K6K3J9QnpKJ5K1J6ONQjk1k8j5koj2lJ3Qj9m2l9k3j1mLQQPJj0k3
403B22j9QM3N9M8K7Qkolnj5k6k6j7j0j4k0j8qJJ0J8J9PjPK5K5%k2j4J7L3K1qk8l8l7k6pQO
385B42lnnolJ0K8K9J4llOJ3J5J8J6Nj1j9j4lLok5m5n0l8j4QK5L9M8N1M9L8J5j3l1k1PK3Qj9
366C73l1k0ojMJ1J7Qqj7k1l1m1k9J0M8M9J8j1j8j4rKK3L7K2j2l0j4J0Qj2k1nJ3Qj1j5KK2K3
348C31Pj4j9lK7M5L5Oj7k5k6k6k0pJoj9k6j9nLJqj3jJ9K9K2Qkqj1kJ2J6%k1k2j0LJ0K0L3L6
329C34K8J2lj1j0lmk0l2k7pMORJ7K0J9K5K5%l7m8k6noj2kNj1k7nL9O3M7J6kj5k5l2l0k4j6
311B29KJ9J9OJJ0J6NnjQMpj3j2j4j2%J3Oj4k0JK6K8J6Mpk8m4l4lK2K3J5J4J4Nj1j9j6j0mM
292B36J2J2Kj0j0lJ0K6L6L1Ok4m2l6j0J9L6K7Mj0oNMlnOJ6J3%j1j2j4j8j9j1LQMRL0M4K4j9
$$ plain form
273 360 315 283 276 272 251 223 209 211 220 229 244 264 282 295 309 335 365 382 374 351 334 331 325 300 264 241 246 270 294 306 301 281 253 223 197 177 166 171 190 214 235
256 235 252 264 259 233 193 159 141 138 142 153 174 198 212 198 158 115 96 109 139 169 196 226 255 271 260 224 183 164 176 209 239 256 269 284 295 291 271
240 271 253 252 263 270 264 252 250 260 266 254 229 213 214 228 247 267 286 299 304 308 317 323 315 291 264 247 242 239 226 202 181 179 199 227 249 265 272 272 271 281 300 308 294 272
221 272 265 278 293 292 278 269 277 298 312 305 282 265 263 267 269 281 312 352 371 362 348 349 365 378 380 376 376 383 395 404 401 389 378 371 363 345 327 325 337 337 303 242 194 186 200 201
201 201 178 158 170 210 252 284 306 321 323 315 310 319 341 368 393 414 427 429 420 396 362 335 327 332 333 324 317 322 333 343 354 374 401 423 430 421 405 386 370 356 344 328
182 328 306 275 246 232 243 274 313 347 372 386 391 391 389 379 361 338 317 298 281 268 255 240 227 228 247 263 254 227 207 210 229 250 259 243 195 137 108 124 158
165 158 170 157 141 143 164 191 215 234 254 280 302 305 288 271 271 278 267 235 204 195 206 222 229 224 211 198 193 199 211 223 231 234 236 234 223 203 181 175 185 199 205 206 217
147 217 244 279 309 325 326 320 316 317 316 304 283 257 232 215 206 205 208 217 234 254 269 280 295 314 317 294 261 241 240 245 247 249 250 246 240 242 252 257 257 259 267 265 240 202 175 167 172 181
$$ packed form
273C60m5l2pmk1k8j4KRRJ5K0J8J3J4K6L0J7qk3j7lok5l6k3NK4K4J2nk0k8l0k6k0j1NJ9K4K1
256B35J7J2nk6m0l4j8lMJ1K1K4J4j4m0m3j9J3L0L0K7L0K9J6j1l6m1j9J2L3L0J7J3J5J1mk0
240B71j8jJ1Poj2kJ0Oj2k5j6JJ4J9K0J9J3NMROqk4k7j7nlj3k4k1kK0K8K2J6P%jJ0J9Qj4k2
221B72pJ3J5jj4rQK1J4pk3j7kMKJ2L1M0J9rj4JJ6J3Km%PJ2Rlj2j1pqj8j8kJ2%l4o1m8qJ4J
201B01k3k0J2M0M2L2K2J5KqnRK2K7K5K1J3Krk4l4k7qNJrpNJ1J0J1K0K7K2Prj6j9j6j4j2j6
182C28k2l1k9j4J1L1L9L4K5J4N%kj0j8k3k1j9j7j3j3j5j3JJ9J6rk7k0LJ9K1Rj6m8n8k9J6L4
165A58J2j3j6KK1K7K4J9K0K6K2Lj7j7%Pj1l2l1rJ1J6Pnj3j3nOJ2J2QLKkj1k0k2oJ0J4OJJ1
147B17K7L5L0J6JomJjj2k1k6k5j7rjLRJ7K0J5J1J5J9Lk3l3k0jNKKJmoKJ0N%KQkk5l8k7qNR
$$ plain form
126 181 189 193 194 204 230 263 284 282 274 279 295 308 315 327 355 393 419 417 390 358 343 350 363 366 362 366 384 404 409 389 353 311 273 249 247 264 282 292 296 305 318 326 320 309
107 309 309 322 331 319 292 269 266 278 287 284 276 271 269 267 257 240 223 217 227 239 241 237 243 266 292 310 323 333 335 325 312 311 321 328 329 329 330 325 315 308 308 308 297 282 276 283 295 301
86 301 297 293 296 304 306 300 297 310 340 377 403 412 410 408 413 420 422 422 427 436 440 431 412 387 358 332 323 332 343 340 326 317 315 313 309 304 296 282 273 280 300 318 330 351 387 417 421 398 370 359 367
64 367 384 390 374 350 340 348 353 341 322 311 306 291 262 228 201 185 184 197 213 219 214 208 214 234 266 300 325 332 327 320 312 293 257 215 180 162 160 169 184 201 218 227 223 213
45 213 215 240 275 291 273 233 201 191 202 226 259 297 331 344 330 301 282 284 298 305 294 275 265 270 282 285 275 260 246 233 223 223 234 247 247 237 234 247 271 293
28 293 313 333 346 344 325 297 266 232 204 198 224 268 310 334 336 323 300 280 270 265 256 244 239 248 257 253 242 242 256 271 280 291 313 336 340 322 296 278 272 274 278 282 289 300
9 300 307 292 256 227 227 250 272 288 312 343 357 344 323 320 331 332 313 286 265 258 268 290 310 316 310 310 321 333 336 329 321 320 328 342 346 324 278 227 190 170 166 179 208 240
-11 240 254 242 217 202 209 230 247 252 248 243 244 254 276 303 321 325 324 331 345 347 329 298 269 242 216 197 200 227 264 296 323 349 370 369 344 319 312 314 297 259 230 232
$$ packed form
126A81QMJJ0K6L3K1kqNJ6J3PJ2K8L8K6kk7l2j5PJ3LmMJ8K0Nk0l6m2l8k4kJ7J8J0MRJ3Qoj1
107C09%J3Rj2k7k3lJ2Rlqnkkj0j7j7oJ0J2KmOK3K6J8J3J0Kj0j3jJ0PJ%Jnj0p%%j1j5oPJ2O
86C01mmLQKolJ3L0L7K6RkkNPK%NRMrj9k5k9k6rRJ1lj4rkkmnqj4rPK0J8J2K1L6L0Mk3k8j1Q
64C67J7Oj6k4j0QNj2j9j1nj5k9l4k7j6jJ3J6OnoOK0L2L4K5Pnpqj9l6m2l5j8kRJ5J7J7Rmj0
45B13KK5L5J6j8m0l2j0J1K4L3L8L4J3j4k9j9KJ4Pj1j9j0NJ2Lj0j5j4j3j0%J1J3%j0lJ3K4K2
28B93K0K0J3kj9k8l1l4k8oK6M4M2K4Kj3k3k0j0nrj2nRRmj1%J4J5RJ1K2K3Mj8k6j8oKMMPJ1
9C00Pj5l6k9%K3K2J6K4L1J4j3k1lJ1Jj9k7k1pJ0K2K0Oo%J1J2LpqjQJ4Mk2m6n1l7k0mJ3K9L2
-11B40J4j2k5j5PK1J7NmnJJ0K2K7J8MjPJ4Kj8l1k9k7k6j9LK7L7L2K7K6K1jk5k5pKj7l8k9K
$$ plain form
-29 232 258 282 299 316 336 346 340 324 303 281 266 263 272 284 292 294 292 289 285 283 278 268 262 271 298 333 363 376 367 340 307 282 273 277 290 304 310 296 267 242 233 237 249 266
-48 266 286 301 300 287 276 275 286 300 309 316 324 333 336 326 303 275 252 246 256 269 266 245 224 219 225 227 228 235 241 235 226 241 281 315 324 319 316 305 275 244 243 266 279 265 244 240
-68 240 254 265 261 254 258 276 297 308 299 274 235 193 163 162 198 254 298 312 297 271 254 258 280 302 306 294 282 282 294 310 329 351 370 373 349 301 243 196 175 182
-85 182 203 218 219 219 236 266 287 277 244 213 202 210 224 229 226 228 253 303 360 401 420 426 426 424 425 436 449 454 453 458 466 455 418 376 352 344 337 332 337 346 342 318 294 293 318 344
-105 344 346 323 295 276 260 230 194 172 174 188 207 242 293 331 331 301 275 269 274 279 289 304 314 316 319 332 348 350 326 281 233 206 208 222 221 199 169 148 140 141 148 160
-123 160 177 202 230 252 268 285 307 321 311 283 258 248 245 243 247 260 273 280 283 289 296 303 312 321 322 310 293 282 281 284 281 266 245 234 244 269 291 294 277 241 197 167
-141 167 165 183 199 209 231 273 319 346 352 348 338 325 316 317 324 331 337 340 340 337 332 324 306 281 262 253 245 234 233 252 283 309 323 331 330 319 305 302 313 326 336 347 368 392
-160 392 400 381 334 277 232 218 232 258 277 275 261 256 273 304 322 312 291 281 293 315 330 328 307 269 224 184 158 153 171 201 230 255 282 311 326 315 283
$$ packed form
-29B32K6K4J7J7K0J0oj6k1k2j5lRJ2QKklmknj0oRK7L5L0J3rk7l3k5rMJ3J4Oj4k9k5rMJ2J7
-48B66K0J5jj3j1jJ1J4RPQRLj0k3k8k3oJ0J3lk1k1nOKJPOorJ5M0L4Rnlj1l0l1jK3J3j4k1m
-68B40J4J1mpMJ8K1J1rk5l9m2l0jL6N6M4J4j5k6j7MK2K2Mj2j2%J2J6J9K2J9Lk4m8n8m7k1P
-85A82K1J5J%J7L0K1j0l3l1j1QJ4NlKK5N0N7M1J9O%kJJ1J3NjNQj1l7m2k4qpnNRmk4k4jK5K6
-105C44Kk3k8j9j6l0l6k2KJ4J9L5N1L8%l0k6oNNJ0J5J0KLJ3J6Kk4m5m8k7KJ4jk2l0k1qJPJ2
-123A60J7K5K8K2J6J7K2J4j0k8k5j0lkMJ3J3PLOPPRRJj2j7j1jLlj5k1j1J0K5K2Lj7l6m4l0
-141A67kJ8J6J0K2M2M6K7Omj0j3rJPPOL%lnqj8k5j9rqj1jJ9L1K6J4Qjj1j4lJ1J3J0J1K1K4
-160C92Qj9m7n7m5j4J4K6J9kj4nJ7L1J8j0k1j0J2K2J5kk1l8m5m0k6nJ8L0K9K5K7K9J5j1l2
$$ plain form
-177 283 244 209 184 177 187 201 208 210 220 244 273 298 319 336 347 348 338 320 307 312 335 358 363 351 332 314 301 302 322 349 365 370 376 395 427 468 505 519 501
-193 501 467 442 423 389 338 295 283 300 329 359 387 405 405 389 366 349 348 358 364 354 331 304 270 222 171 140 141 159 182 210 242 266 276 290 324 370 411
-209 411 442 467 482 471 436 395 358 324 294 279 279 281 277 268 260 250 231 203 168 134 106 90 83 79 76 81 100 132 168 204 244 286 308 294 252 212 190 180 165
-226 165 144 126 117 116 126 147 173 187 184 183 202 245 289 316 320 314 311 315 316 308 292 285 291 299 294 275 254 237 221 202 186 183 185 182 172 172 193 229 259 275 289 311 328 320
-245 320 285 246 229 237 257 276 288 296 303 315 325 318 290 260 256 278 296 284 255 251 292 356 401 409 394 378 365 353 341 333 329 324 314 296 268 237 219 228 265 321
-263 321 383 433 453 440 413 390 367 334 302 297 328 371 405 428 444 441 414 375 347 339 343 345 341 331 322 314 303 290 286 306 341 367 373 371 371 363 334 293 268 270 288 303
-281 303 302 288 275 276 283 280 264 255 267 285 288 278 275 294 332 380 421 431 402 353 315 301 301 305 307 298 275 252 248 261 274 280 289 303 315 321 331 344 347 335 319 307 294
-300 294 278 268 265 256 236 224 229 239 230 206 189 188 189 181 167 158 163 186 213 221 198 168 165 199 246 273 269 249 234 238 262 293 314 314 294 264 240 230 228 225 222 230 246 263
$$ packed form
-177B83l9l5k5pJ0J4PKJ0K4K9K5K1J7J1Jj0j8j3NK3K3Nj2j9j8j3JK0K7J6NOJ9L2M1L7J4j8
-193E01l4k5j9l4n1m3j2J7K9L0K8J8%j6k3j7jJ0Oj0k3k7l4m8n1l1JJ8K3K8L2K4J0J4L4M6M1
-209D11L1K5J5j1l5m1l7l4l0j5%Kmrqj0j9k8l5l4k8j6pmlNJ9L2L6L6M0M2K2j4m2m0k2j0j5
-226A65k1j8rjJ0K1K6J4ljJ9M3M4K7MolMJqj6pOQnj9k1j7j6j9j6lKlj0%K1L6L0J6J4K2J7q
-245C20l5l9j7QK0J9J2QPJ2J0pk8l0mK2J8j2k9mM1O4M5Qj5j6j3j2j2qmnj0j8k8l1j8RL7N6
-263C21O2N0K0j3k7k3k3l3l2nL1M3L4K3J6lk7l9k8qMKmj0rqj1j3mK0L5K6Ok%qk9m1k5KJ8J5
-281C03jj4j3JPlj6rJ2J8Lj0lJ9L8M8M1J0k9m9l8j4%MKrk3k3mJ3J3ORJ4J2OJ0J3Lj2j6j2j3
-300B94j6j0lrk0j2NJ0rk4j7jJqj4rNK3K7Qk3l0lL4M7K7mk0j5MK4L1K1%k0l0k4j0kllQJ6J7
$$ plain form
-319 263 278 300 325 332 305 267 250 260 276 283 290 306 321 317 285 238 201 195 216 244 259 267 275 280 274 267 279 308 330 334 335 342 338 308 271 256 258 244 208 182 189 215 234
-337 234 241 253 273 286 286 277 271 277 301 345 395 423 416 384 347 316 293 288 312 352 376 360 320 288 283 295 308 319 339 375 417 447 454 443 428 420 420 425 428 424 413 403
-356 403 403 409 414 413 409 402 392 376 357 342 331 322 310 294 275 255 239 230 229 228 217 196 180 189 229 282 316 317 292 260 237 226 226 230 229 223 218 217 219 219 217 212 208 209 220 236 252
-376 252 267 291 323 347 352 344 336 331 328 332 344 357 359 353 354 363 365 350 328 320 329 340 341 330 318 309 301 289 271 248 225 203 187 186 199 218 234 251 275 304 325 335 337 333
-395 333 316 287 256 237 227 221 223 240 269 294 302 296 279 256 231 219 234 271 305 320 318 312 309 300 284 267 255 245 237 238 250 263 268 271 289 319 342 342 330 325 330 329 312
-414 312 288 281 301 335 358 353 328 304 291 286 287 292 299 306 317 336 358 364 338 286 231 196 188 204 230 252 262 271 289 318 340 335 306 275 266 283 310 337 365 395 417
-431 417 409 370 323 297 293 297 301 316 352 398 426 425 410 399 391 375 352 334 330 334 339 346 354 358 358 358 359 355 347 351 374 402 416 414 408 402 393 387 396 419 436 427 395 352 312 286 281 291
-452 291 303 305 299 293 288 283 275 265 254 248 244 236 223 223 247 277 287 274 269 286 311 327 336 342 331 292 247 227 236 246 239 222 208 199 187 168 142 117 109 126 158 188 210
$$ packed form
-319B63J5K2K5Pk7l8j7J0J6PPJ6J5ml2m7l7oK1K8J5QQNopJ2K9K2MJPml0l7j5Kj4l6k6PK6J9
-337B34PJ2K0J3%roOK4M4N0K8pl2l7l1k3nK4M0K4j6m0l2nJ2J3J1K0L6M2L0Pj1j5q%NLmj1j0
-356D03%ONjmpj0j6j9j5j1rj2j6j9k0j6rjjj1k1j6RM0N3L4Jk5l2k3j1%MjonjK%knmJJ1J6J6
-376B52J5K4L2K4NqqnlMJ2J3KoJRKj5k2qRJ1Jj1j2rqj2j8k3k3k2j6jJ3J9J6J7K4K9K1J0Km
-395C33j7k9l1j9j0oKJ7K9K5Qoj7k3k5j2J5L7L4J5kolrj6j7j2j0qJJ2J3NLJ8L0K3%j2nNjj7
-414C12k4pK0L4K3nk5k4j3nJNPPJ1J9K2Ok6n2n5l5qJ6K6K2J0RJ8K9K2nk9l1rJ7K7K7K8L0K2
-431D17ql9m7k6mMMJ5L6M6K8jj5j1qj6k3j8mMNPQM%%JmqMK3K8J4kooroRK3J7rl2m3m0k6nJ0
-452B91J2Koonnqj0j1omqj3%K4L0J0j3nJ7K5J6ROj1l9m5k0RJ0pj7j4rj2j9k6k5qJ7L2L0K2
$$ plain form
-471 210 227 241 241 231 225 232 242 243 236 231 230 235 243 253 267 286 305 311 299 282 276 282 283 276 265 250 220 180 151 149 161 171 182 206 233 245 239 238 257 288 312 319 313 304 297
-490 297 291 286 280 279 282 284 281 283 299 325 343 340 322 306 298 287 264 234 219 237 278 313 315 288 252 224 207 208 233 282 336 375 397 414 436 451 447 426 403 385 362
-508 362 324 279 248 243 255 265 267 267 275 295 322 345 354 350 342 339 338 340 351 373 391 384 355 331 332 349 356 342 312 281 262 267 296 330 344 332 311 292 274 254 242 250
-526 250 267 268 244 212 194 196 205 208 199 188 189 203 221 234 244 255 265 266 262 268 287 310 326 332 332 324 312 309 320 340 354 356 341 310 268 227 191 162 149 168 213 248
-545 248 243 210 187 189 203 216 228 242 253 261 273 285 284 273 276 306 342 358 354 348 345 337 326 318 310 291 266 250 251 264 277 283 280 268 258 258 266 273 282 304 337 371 395 408
-564 408 406 387 360 344 343 344 338 328 328 339 350 354 352 347 339 325 305 284 269 259 247 236 237 254 268 263 244 235 247 265 271 268 268 274 282 287 287 284 284 289 294 285 258 227 203 177 141
-584 141 117 133 190 248 274 273 270 272 262 228 180 142 127 131 137 138 141 160 194 228 246 250 248 246 246 250 265 290 316 333 342 347 350 345 328 303 281 277 297 324 335 325 307
-603 307 297 292 286 289 316 364 397 393 362 337 328 319 299 271 246 226 219 233 268 303 323 333 339 330 297 254 229 234 256 281 314 351 373 359 322 296 292 294 287 280 286 301
$$ packed form
-471B10J7J4%j0oPJ0JpnjNQJ0J4J9J9Oj2j7oOJpj1j5l0m0k9kJ2J0J1K4K7J2ojJ9L1K4Porp
-490B97onojLKlKJ6K6J8lj8j6qj1k3l0j5J8M1L5Kk7l6k8j7JK5M9N4L9K2J7K2J5mk1k3j8k3
-508C62l8m5l1nJ2J0K%QK0K7K3RmqljKJ1K2J8pk9k4JJ7Pj4l0l1j9NK9L4J4j2k1j9j8k0j2Q
-526B50J7Jk4l2j8KRLrj1JJ4J8J3J0J1J0JmOJ9K3J6O%qj2lJ1K0J4Kj5l1m2m1l6k9j3J9M5L5
-545B48nl3k3KJ4J3J2J4J1QJ2J2jj1LL0L6J6molqj1qqj9k5j6JJ3J3Olj2j0%QPRK2L3L4K4J3
-564D08kj9k7j6jJoj0%J1J1Mknqj4k0k1j5j0j2j1JJ7J4nj9rJ2J8Ol%OQN%l%NNrk7l1k4k6l6
-584A41k4J6N7N8K6jlKj0l4m8l8j5MOJLJ9L4L4J8Mkk%MJ5K5K6J7RNLnj7k5k2mK0K7J1j0j8
-603C07j0noLK7M8L3ml1k5rrk0k8k5k0pJ4L5L5K0J0Orl3m3k5NK2K5L3L7K2j4l7k6mKppOJ5
$$ plain form
-621 301 307 292 270 257 257 259 250 226 194 168 153 143 129 110 97 105 133 168 202 227 239 237 229 232 247 258 250 225 198 182 180 193 212 219 204 179 170 186 210 226 240
-639 240 264 298 323 326 308 273 228 186 160 153 150 144 144 159 188 218 244 272 297 301 263 191 123 97 125 177 210 208 182 160 155 170 202 245 283 304 307 302 294 275
-656 275 245 221 218 238 267 292 310 312 298 286 294 326 362 382 386 383 379 376 381 398 424 442 436 402 353 317 310 317 312 288 269 276 300 314 318 331 358 382 389 380 361 327 281
-675 281 247 241 249 248 235 229 237 247 253 264 283 308 340 385 431 450 432 401 385 379 370 358 351 341 312 266 227 211 213 229 253 274 276 261 248 249 255 256 257 268 283 289 287
-693 287 283 286 293 298 286 247 198 176 199 245 281 295 297 292 283 282 304 341 369 378 375 364 333 281 235 222 242 274 302 319 328 329 329 334 344 356 367 377 383 391 405 421 431
-712 431 426 412 391 358 312 270 251 256 268 269 262 254 253 262 282 306 324 334 343 354 360 351 329 305 287 272 258 256 274 307 337 351 348 341 339 345 355 361 359 351 353 367 381 377 357
-731 357 343 343 344 334 316 302 298 301 301 297 292 291 293 291 283 282 301 333 358 371 382 392 385 352 313 282 253 210 163 134 128 131 140 170 224 283 334 377 409 412 375 316 265
-750 265 237 225 218 212 209 207 203 195 186 188 212 257 303 330 329 302 260 220 194 180 172 171 187 211 219 205 192 205 239 268 276 272 273 288 315 346 363 359 345 337 328 295 237 183
$$ packed form
-621C01Oj5k2j3%Krk4l2k6j5j0j4j9j3QK8L5L4K5J2kqLJ5J1qk5k7j6kJ3J9Pj5k5rJ6K4J6J4
-639B40K4L4K5Lj8l5m5m2k6plo%J5K9L0K6K8K5Ml8p2o8k6K8N2L3kk6k2nJ5L2M3L8K1Lnqj9
-656B75l0k4lK0K9K5J8Kj4j2QL2L6K0MlmlNJ7K6J8ol4m9l6pPnk4j9PK4J4MJ3K7K4Prj9l4m6
-675B81l4oQjj3oQJ0OJ1J9K5L2M5M6J9j8l1j6orj2pj0k9m6l9j6KJ6K4K1Kj5j3JOJJJ1J5Ok
-693B87mLPNj2l9m9k2K3M6L6J4KnrjK2L7K8Rlj1l1n2m6j3K0L2K8J7RJ%NJ0J2J1J0OQJ4J6J0
-712D31nj4k1l3m6m2j9NJ2JpqjRK0K4J8J0RJ1Ork2k4j8j5j4kJ8L3L0J4lpkOJ0OkqKJ4J4mk0
-731C57j4%Jj0j8j4mL%mnjKkqjJ9L2K5J3J1J0pl3l9l1k9m3m7k9oLRL0N4N9N1M3L2Ll7n9n1
-750B65k8j2polkmqrKK4M5M6K7jk7m2m0k6j4qjJ6K4Qj4j3J3L4K9QmJJ5K7L1J7mj4qrl3n8n4
$$ plain form
-769 183 163 183 216 235 234 227 236 271 318 351 356 345 335 332 335 342 350 347 323 287 264 264 276 283 287 303 334 361 370 369 370 377 376 362 346 341 350 364 378 390 401 409 413 409 394 371
-789 371 352 350 363 372 361 337 319 317 316 304 292 299 324 342 330 299 275 266 256 238 225 230 247 267 287 307 321 320 311 307 315 325 329 333 353 390 431 450 439 413 394
-807 394 390 384 358 316 282 273 291 323 350 353 328 291 265 262 275 288 290 277 251 224 215 235 277 319 342 343 328 314 317 336 359 369 360 345 341 354 371 379 374 363 353
-825 353 340 325 314 315 327 340 352 362 367 368 370 374 367 339 301 274 265 259 252 257 284 316 326 314 305 315 334 340 330 315 308 319 346 378 397 391 365 332 301 282 285 312
-843 312 350 379 396 412 433 443 424 380 334 306 304 325 359 384 377 340 299 279 280 286 294 314 341 359 355 337 322 316 313 309 301 292 287 294 312 331 340 340 339 339 339 339 344 352 355 346
-863 346 331 315 301 282 252 213 176 160 174 212 252 277 283 281 278 274 265 254 245 236 219 200 196 220 260 292 305 308 313 322 341 371 403 410 381 333 301 299 312 320 322 327 338
-881 338 348 350 343 336 340 351 356 346 330 323 323 311 287 270 277 297 307 308 321 362 415 451 450 416 368 329 316 322 321 286 218 151 122 133 154 158 152 154 166 172 175 196 246
-900 246 300 324 319 314 328 358 388 414 432 438 431 414 395 380 376 379 373 342 299 273 284 313 337 349 355 350 321 270 214 168 138 127 136 153 174 206 254 296 302 274
$$ packed form
-769A83k0K0L3J9jpRL5M7L3Nj1j0lLPQlk4l6k3%J2PMJ6L1K7RjJPjj4j6nRJ4J4J2J1QMmj5k3
-789C71j9kJ3Rj1k4j8kjj2j2PK5J8j2l1k4rj0j8j3NJ7K0K0K0J4jrmQJ0MMK0L7M1J9j1k6j9
-807C94mok6m2l4rJ8L2K7Lk5l7k6lJ3J3Kj3k6k7rK0M2M2K3Jj5j4LJ9K3J0rj5mJ3J7Qnj1j0
-825C53j3j5j1JJ2J3J2J0NJKMpk8l8k7ropNK7L2J0j2rJ0J9Oj0j5pJ1K7L2J9ok6l3l1j9LK7
-843C12L8K9J7J6K1J0j9m4m6k8kK1L4K5pl7m1k0JOQK0K7J8mj8j5olmqrnPJ8J9R%j%%%NQLr
-863C46j5j6j4j9l0l9l7j6J4L8M0K5Oklmrj1rrj7j9mK4M0L2J3LNRJ9L0L2Pk9m8l2kJ3QKNJ1
-881C38J0KppMJ1Nj0j6p%j2k4j7PK0J0JJ3M1N3L6jl4m8l9j3Ojl5o8o7k9J1K1MoKJ2OLK1N0
-900B46N4K4nnJ4L0L0K6J8Opj7j9j5mLol1m3k6J1K9K4J2Onk9n1n6m6l0j1RJ7K1L2M8M2Ok8
$$ plain form
-917 274 248 248 260 266 270 292 326 352 360 360 357 348 335 334 348 367 373 362 344 329 325 333 335 321 300 294 301 296 265 232 227 245 257 252 244 247 257 271 289 302 296 264 223 199 202
-937 202 229 266 296 303 286 261 243 235 228 222 229 253 283 306 317 319 313 294 254 203 170 178 222 265 283 288 302 321 321 295 268 263 277 293 312 338 360 359 343 333 337
-955 337 333 308 276 257 246 225 198 191 221 267 296 298 291 288 283 272 259 257 270 294 319 336 333 310 289 295 326 354 354 333 312 307 312 324 336 340 324 290 253 230 232 260
-973 260 303 337 340 315 287 270 258 246 246 261 276 271 244 212 192 186 194 212 235 257 283 311 331 331 317 303 293 282 271 265 258 244 235 247 280 305 304 285 267 254
-990 254 249 262 293 326 333 311 274 237 205 186 185 200 224 252 282 306 310 294 271 256 252 251 251 249 245 237 220 198 177 169 176 191 209 234 269 305 327 330 326 325 329 338 350
-1009 350 359 356 345 339 348 371 397 416 418 395 352 308 279 270 267 265 268 284 312 340 359 371 382 390 391 384 376 366 350 332 324 333 353 367 370 363 355 357 374 393 388 353 311 290
-1028 290 287 279 257 238 240 260 288 313 320 301 267 241 236 239 237 232 236 253 281 313 338 348 349 356 372 381 366 345 348 381 416 427 417 402 388 374 360 348 331 303 277
-1046 277 267 274 278 267 244 220 198 179 170 172 174 169 165 173 187 192 184 177 182 199 225 256 285 296 280 251 229 222 226 239 255 267 269 267 269 278 292 303 298 265 215 179 175 184 189
$$ packed form
-917B74k6%J2OMK2L4K6Q%lrj3jJ4J9Oj1j8j5mQKj4k1oPnl1l3nJ8J2nqLJ0J4J8J3ol2m1k4L
-937B02K7L7L0Pj7k5j8qpoPK4L0K3J1Koj9m0n1l3QM4M3J8NJ4J9%k6k7nJ4J6J9K6K2jj6j0M
-955C37mk5l2j9j1k1k7pL0M6K9Kplnj1j3kJ3K4K5J7lk3k1OL1K8%k1k1nNJ2J2Mj6l4l7k3KK8
-973B60M3L4Lk5k8j7j2j2%J5J5nk7l2k0oQJ8K3K2K6K8K0%j4j4j0j1j1opj4rJ2L3K5jj9j8j3
-990B54nJ3L1L3Pk2l7l7l2j9jJ5K4K8L0K4Mj6k3j5mj%kmqj7k2k1qPJ5J8K5L5L6K2LmjMRJ2
-1009C50Rlj1oRK3K6J9Kk3m3m4k9rlkLJ6K8K8J9J2J1QJpqj0j6j8qRK0J4LpqKJ7J9nl5m2k1
-1028B90lqk2j9KK0K8K5Pj9l4k6nLknMJ7K8L2K5J0JPJ6Rj5k1LL3L5J1j0j5j4j4j4j2j7k8k6
-1046B77j0PMj1k3k4k2j9rKKnmQJ4NqpNJ7K6L1K9J1j6k9k2pMJ3J6J2KkKRJ4J1nl3n0l6mRN
$$ plain form
-1065 189 197 223 254 258 237 225 246 285 321 348 365 361 336 309 294 286 275 268 277 298 320 340 351 343 321 305 306 309 291 253 212 176 147 137 153 179 195 203 224
-1082 224 263 305 338 362 384 404 419 429 431 424 413 401 384 367 356 351 335 305 286 303 346 382 394 393 390 378 357 335 315 287 249 222 222 241 260 274 282 282
-1099 282 272 260 258 265 275 282 283 272 250 225 204 191 187 193 212 239 264 282 292 302 325 361 390 392 367 335 312 299 300 314 330 334 329 329 333 331 324 330 347 347 310 255
-1117 255 207 164 119 91 111 171 233 268 281 282 272 253 236 230 237 245 248 250 257 282 325 369 390 386 375 373 379 383 375 353 327 309 308 320 332 331 309 270 233 226 256 292
-1135 292 302 285 271 269 264 242 214 202 201 193 173 163 182 228 283 324 341 333 307 275 250 235 224 210 198 199 214 229 239 248 265 284 297 307 319 328 326 320 323 332
-1152 332 337 332 324 314 296 268 236 208 181 160 159 185 226 265 292 309 319 327 337 346 347 344 350 366 374 356 324 300 298 310 326 343 358 368 368 360 342 314 281 258 258
-1170 258 279 312 345 367 372 354 319 283 263 264 272 272 264 261 272 289 298 296 289 284 278 265 243 220 200 184 176 183 207 238 259 268 278 290 289 265 239 238 265 300 334 373
-1188 373 417 443 438 414 396 391 392 396 400 399 391 386 387 381 356 322 298 282 259 227 204 206 227 247 255 255 254 259 270 279 277 267 257 245 223 194 173 173 193 222 250 276 295
$$ packed form
-1065A89QK6L1Mk1j2K1L9L6K7J7mk5k7j5qj1pRK1K2K0J1qk2j6JLj8l8m1l6k9j0J6K6J6QK1
-1082B24L9M2L3K4K2K0J5J0Kpj1j2j7j7j1nj6l0j9J7M3L6J2jlj2k1k2k0k8l8k7%J9J9J4Q%
-1099B82j0j2kPJ0PJj1k2k5k1j3mOJ9K7K5J8J0J0K3L6K9Kk5l2k3j3JJ4J6Mn%MkpOJ7%l7n5
-1117B55m8m3m5k8K0O0O2L5J3Jj0j9j7oPQLKPK5M3M4K1mj1kOMqk2k6j8jJ2J2jk2l9l7pL0L6
-1135B92J0j7j4knk2k8j2jqk0j0J9M6N5M1J7qk6l2k5j5j1j4j2JJ5J5J0RJ7J9J3J0J2RkoLR
-1152C32Nnqj0j8k8l2k8k7k1jK6M1L9K7J7J0QJ0RJlOJ6Qj8l2k4kJ2J6J7J5J0%qj8k8l3k3%
-1170B58K1L3L3K2Nj8l5l6k0JQ%qlJ1J7Rkpnoj3k2k3k0j6qPK4L1K1RJ0J2jk4k6jK7L5L4L9
-1188C73M4K6nk4j8nJMMjqnJok5l4k4j6k3l2k3KK1K0Q%jNJ1Rkj0j0j2k2k9k1%K0K9K8K6J9
$$ plain form
-1207 295 306 305 294 275 252 232 215 199 176 150 135 149 195 250 279 267 235 208 194 187 187 198 216 219 194 158 137 145 173 207 235 255 275 300 321 324 307
-1223 307 293 298 316 329 330 326 321 313 309 317 333 343 341 341 348 350 336 322 331 365 402 421 418 400 370 346 348 380 414 422 404 382 367 348 321 295 287 299 325 353 371 371 356
-1242 356 340 329 321 311 308 324 352 376 383 373 352 329 313 304 294 284 288 320 370 415 438 447 453 455 445 424 398 370 338 310 293 292 308 337 367 382 371 342 314
-1259 314 298 297 306 318 328 331 334 344 360 372 374 374 385 407 428 432 413 376 338 317 316 315 302 285 277 275 264 248 252 289 335 355 348 340 350 366 371 363 346 318 279 241
-1277 241 223 227 242 257 270 282 287 280 258 226 195 179 189 216 244 258 260 266 277 281 270 255 259 283 303 300 277 257 251 256 268 297 337 365 365 351 348 363 380 382 371
-1294 371 352 337 332 332 327 314 313 340 380 400 391 372 367 369 363 345 328 319 324 343 365 371 352 321 294 274 259 255 267 283 290 291 298 307 299 276 265 279 296 290 263 236 214
-1313 214 188 159 139 137 147 167 200 242 279 300 307 310 324 355 397 426 424 395 364 356 371 397 423 440 441 424 404 396 405 425 450 473 479 465 444 430 415 376 316
-1330 316 263 241 241 242 242 257 288 318 330 329 329 333 332 320 302 289 289 298 305 297 272 235 195 165 157 172 198 223 247 271 294 312 324 332 338 343 342 326 283 222 174 167 195
$$ packed form
-1207B95J1jj1j9k3k0j7j6k3k6j5J4M6N5K9j2l2k7j4p%J1J8Lk5l6k1QK8L4K8K0K0K5K1Lj7
-1223C07j4NJ8J3JmnqmQJ6J0k%PKj4j4RL4L7J9lj8l0k4KL2L4Qj8k2j5j9k7k6qJ2K6K8J8%j5
-1242C56j6j1qj0lJ6K8K4Pj0k1k3j6rj0j0ML2N0M5K3ROKj0k1k6k8l2k8j7jJ6K9L0J5j1k9k8
-1259C14j6jRJ2J0LLJ0J6J2K%J1K2K1Mj9l7l8k1jjj3j7qkj1j6ML7M6K0pqJ0J6Nqj7k8l9l8
-1277B41j8MJ5J5J3J2Npk2l2l1j6J0K7K8J4KOJ1Mj1j5MK4K0lk3k0oNJ2K9M0K8%j4lJ5J7Kj1
-1294C71j9j5n%nj3jK7M0K0rj9nKoj8j7rNJ9K2Oj9l1k7k0j5mJ2J6PJPRqk3j1J4J7ok7k7k2
-1313B14k6k9k0kJ0K0L3M2L7K1PLJ4L1M2K9kk9l1qJ5K6K6J7Jj7k0qRK0K5K3Oj4k1j4j5l9o0
-1330C16n3k2%J%J5L1L0J2j%Mjj2j8j3%RPqk5l7m0l0qJ5K6K5K4K4K3J8J2QONjj6m3o1m8pK8
$$ plain form
-1349 195 225 229 212 202 216 242 257 245 215 187 180 195 222 247 260 258 243 226 223 243 279 318 343 347 338 328 321 314 307 304 303 294 275 260 263 278 288 289 287 293 305 318
-1367 318 326 327 319 307 293 279 268 264 265 259 243 231 230 224 198 171 178 221 268 294 306 317 320 310 299 295 285 260 236 232 245 261 272 282 284 275 270 278 285 267 237 232 270
-1386 270 323 354 355 343 335 339 350 359 360 353 345 337 322 300 273 256 262 301 360 409 423 403 367 324 283 259 266 288 291 263 232 225 248 284 319 345 359 354 330 292 252
-1403 252 233 251 294 333 349 350 357 376 392 391 370 340 321 319 320 300 259 225 221 241 264 283 307 338 361 360 337 312 306 315 320 308 288 274 268 271 289 330 376 396
-1421 396 386 368 357 341 308 277 270 278 275 256 245 254 267 262 247 243 259 286 305 302 278 248 229 228 234 242 252 271 294 312 325 340 362 379 372 340 301 278 270 265 258
-1438 258 262 280 301 306 296 279 260 241 225 219 219 225 237 256 276 293 305 315 320 311 285 250 213 188 186 209 239 254 247 231 226 240 262 272 259 232 215 218 231 234
-1456 234 229 231 246 262 270 274 284 305 332 359 379 388 381 356 315 270 240 233 238 242 248 269 304 329 327 303 275 253 238 223 206 190 183 191 206 216 217 217 227 248 275 306
-1474 306 337 359 366 361 354 346 330 306 286 282 289 293 288 285 291 295 286 271 267 276 287 297 318 349 367 350 312 286 291 318 350 374 381 367 340 314 301 306 330 363 390 399 402 420
$$ packed form
-1349A95L0Mj7j0J4K6J5j2l0k8pJ5K7K5J3kj5j7lK0L6L9K5Mrj0pppljrj9j5LJ5J0JkOJ2J3
-1367C18QJqj2j4j4j1mJoj6j2jok6k7PM3M7K6J2J1Lj0j1mj0k5k4mJ3J6J1J0KrnQPj8l0nL8
-1386B70N3L1Jj2qMJ1RJpqqj5k2k7j7OL9N9M9J4k0l6m3m1k4PK2Lk8l1pK3L6L5K6J4nk4l8m0
-1403B52j9J8M3L9J6JPJ9J6jk1l0j9kJk0m1l4mK0K3J9K4L1K3jk3k5oRNj2k0j4oLJ8M1M6K0
-1421C96j0j8j1j6l3l1pQlj9j1RJ3nj5mJ6K7J9lk4l0j9jOQJ0J9K3J8J3J5K2J7pl2l9k3qnp
-1438B58MJ8K1Nj0j7j9j9j6o%OJ2J9K0J7J2J0Nrk6l5l7k5kK3L0J5pj6nJ4K2J0j3k7j7LJ3L
-1456B34nKJ5J6QMJ0K1K7K7K0Rpk5m1m5l0pNMOK1L5K5kk4k8k2j5j5j7j6pQJ5J0J%J0K1K7L1
-1474C06L1K2Pnpqj6k4k0mPMnlOMrj5mRJ1J0K1L1J8j7l8k6NK7L2K4Pj4k7k6j3NK4L3K7RLJ8
$$ plain form
-1493 420 456 495 520 529 518 478 418 364 329 303 273 245 239 251 264 267 265 263 261 254 249 254 272 297 319 332 340 353 374 399 417 420 409 387 365 349 338 326 314 313
-1510 313 328 348 361 368 382 407 430 435 418 392 375 376 389 403 411 414 409 397 383 377 379 381 377 376 387 409 434 457 472 476 467 445 416 387 366 360 367 379 391 403 415 421
-1529 421 412 387 350 312 284 274 280 291 305 326 348 355 342 324 326 349 374 384 376 352 314 266 222 199 211 251 294 314 311 309 318 324 306 271 246 244 253 262 269 278 287 295
-1547 295 302 311 321 330 340 345 340 330 325 327 326 314 298 295 309 324 324 304 282 276 288 308 327 348 367 368 343 310 296 297 283 237 176 126 91 64 54 73 112 143 149
-1565 149 147 151 158 157 156 174 217 262 285 283 269 252 239 237 253 277 291 287 274 264 259 262 275 294 307 313 321 334 344 342 338 339 336 317 290 271 260 251 245 258 287 307 298 267
-1584 267 235 217 218 238 269 297 309 309 308 314 330 348 354 338 308 285 281 289 290 278 263 254 251 242 219 190 174 178 191 202 221 258 307 345 362 367 367 355 330 306 300 314
-1602 314 337 362 380 380 361 335 315 301 290 281 273 260 241 229 240 271 303 326 344 362 376 374 354 329 314 313 317 317 309 295 273 243 220 217 231 247 268 305 351
-1619 351 372 342 280 223 193 190 205 231 259 286 316 339 337 311 294 315 356 380 372 349 323 288 248 220 204 184 158 147 167 204 234 249 259 277 302 326
$$ packed form
-1493D20L6L9K5Rj1m0o0n4l5k6l0k8oJ2J3LkkkpnNJ8K5K2J3QJ3K1K5J8Lj1k2k2j6j1j2j2j
-1510C13J5K0J3PJ4K5K3Nj7k6j7JJ3J4QLnj2j4oKKmjJ1K2K5K3J5Mrk2k9k9k1oPJ2J2J2J2O
-1529D21rk5l7l8k8j0OJ1J4K1K2Pj3j8KK3K5J0qk4l8m8m4k3J2M0M3K0lkROj8l5k5kRRPRRQ
-1547B95PRJ0RJ0Nnj0nKjj2j6lJ4J5%k0k2oJ2K0J9K1J9Jk5l3j4Jj4m6o1n0l5k7j0J9L9L1O
-1565A49kMPjjJ8M3M5K3kj4j7j3kJ6K4J4mj3j0nLJ3J9J3OQJ3J0kmJlj9k7j9j1roJ3K9K0rl1
-1584B67l2j8JK0L1K8J2%jOJ6J8Oj6l0k3mQJj2j5rlrk3k9j6MJ3J1J9L7M9L8J7N%j2k5k4oJ4
-1602C14K3K5J8%j9k6k0j4j1rqj3j9j2J1L1L2K3J8J8J4kk0k5j5jM%qj4k2l0k3lJ4J6K1L7M6
-1619C51K1l0o2n7l0lJ5K6K8K7L0K3kk6j7K1M1K4qk3k6l5m0k8j6k0k6j1K0L7L0J5J0J8K5K4
$$ plain form
-1634 326 335 321 295 277 276 280 279 275 274 270 266 272 290 310 316 311 303 297 295 298 305 309 303 290 274 260 257 276 315 353 372 378 385 395 401 403 408 420 434 445 452 451 438 416 398 388 377
-1655 377 358 340 333 335 333 321 309 309 323 344 360 365 362 352 345 350 372 400 420 421 413 408 412 420 419 400 369 349 359 393 421 425 415 403 391 372 353 345 346 347 350 364 378 372
-1674 372 341 312 309 328 338 324 291 258 241 248 272 299 314 322 331 344 355 360 366 375 383 382 369 351 330 310 293 283 279 279 281 286 292 296 296 297 309 328 345 349 341 326 308 288
-1693 288 272 267 270 272 276 291 320 345 346 330 319 325 337 342 339 336 329 308 281 265 276 306 336 349 345 332 324 323 319 301 272 250 246 254 268 290 323 349 351 328 299 278 269
-1712 269 275 302 344 375 377 359 350 362 380 384 367 339 310 284 261 247 250 267 287 295 294 291 288 280 275 284 310 342 365 376 378 370 355 342 342 353 369 384 398 405 403 397 383
-1730 383 358 322 295 290 301 315 328 345 355 343 310 274 246 225 215 221 242 266 290 327 377 420 434 428 424 421 404 370 345 352 377 387 367 331 304 296 302 312
-1747 312 326 347 371 387 393 395 395 388 373 364 372 390 394 373 346 329 322 310 293 285 297 325 362 400 432 445 434 409 386 372 362 350 338 330 326 328 330 322 297 261 230
-1764 230 209 195 188 197 214 221 212 209 230 266 295 312 321 324 314 301 299 300 289 265 243 233 229 236 268 316 343 329 304 306 334 353 354 362 393 431 446 434 408 383 361
$$ packed form
-1634C26Rj4k6j8jMjmjmmOJ8K0OnqokLPMoj3j6j4lJ9L9L8J9OPJ0OKNJ2J4J1Pjj3k2j8j0j1
-1655C77j9j8pKkj2j2%J4K1J6Nlj0pNK2K8K0JqnMQjj9l1k0J0L4K8Mj0j2j2j9j9qJJLJ4J4o
-1674C72l1k9lJ9J0j4l3l3j7PK4K7J5QRJ3J1NORQjj3j8k1k0j7j0m%KNOM%JJ2J9J7Mqj5j8k0
-1693B88j6nLKMJ5K9K5Jj6j1OJ2Nllpk1k7j6J1L0L0J3mj3qjmj8k9k2mQJ4K2L3K6Kk3k9k1r
-1712B69OK7M2L1Kj8rJ2J8Mj7k8k9k6k3j4LJ7K0QjllqnRK6L2K3J1Kqj5j3%J1J6J5J4Pkoj4
-1730C83k5l6k7nJ1J4J3J7J0j2l3l6k8k1j0OK1K4K4L7N0M3J4omlj7l4k5PK5J0k0l6k7qOJ0
-1747C12J4K1K4J6OK%pj5rQJ8Mk1k7j7pj2j7qJ2K8L7L8L2J3j1k5k3j4j0j2j2qmKKqk5l6l1
-1764B30k1j4pRJ7PrlK1L6K9J7RLj0j3kJj1k4k2j0mPL2M8K7j4k5KK8J9JQL1L8J5j2k6k5k2
$$ plain form
-1782 361 343 331 319 302 279 262 264 291 330 361 369 357 336 313 294 282 276 264 236 204 189 200 225 248 265 279 288 297 309 319 306 270 234 226 242 257 259 255
-1799 255 248 227 184 139 115 118 134 157 189 223 247 253 251 252 254 243 218 195 196 220 244 247 233 222 230 252 279 301 321 340 355 362 356 342 330 334 354 373 370 347 323
-1816 323 315 323 333 329 307 285 289 325 371 388 365 327 309 320 341 351 343 325 310 314 331 342 325 284 241 219 226 258 299 325 324 309 306 329 368 408 443 467 475
-1833 475 462 438 419 413 415 421 424 421 410 399 395 397 396 387 370 353 343 347 360 372 378 379 382 387 391 393 398 406 413 415 410 398 388 385 385 375 353 331 323 328 332 327 320 319 325 333 333 318 280 225
-1855 225 181 178 223 287 334 350 346 340 339 344 356 371 382 382 380 384 397 409 416 415 405 383 353 323 301 293 306 341 381 395 370 328 299 289 284 270 250 230 212 199
-1872 199 201 222 255 284 299 296 289 296 323 355 370 362 345 330 314 287 250 214 189 180 186 208 238 270 295 314 325 328 320 301 278 261 253 247 234 218 206 207 221 244
-1890 244 269 288 292 280 260 243 241 259 289 317 330 330 327 329 339 349 356 363 373 384 386 372 350 332 318 293 257 227 224 241 253 250 246 258 281 302 316 325 331 334 332 326
-1908 326 320 323 340 369 397 407 394 365 336 323 330 341 336 315 301 311 346 390 424 437 426 399 370 347 331 326 324 315 292 270 273 300 327 330 319 307 299 292 291 295 286
$$ packed form
-1782C61j8j2j2j7k3j7KK7L9L1Qj2k1k3j9j2oj2k8l2j5J1K5K3J7J4RRJ2J0j3l6l6qJ6J5Km
-1799B55pk1m3m5k4LJ6K3L2L4K4OkJKj1k5k3JK4K4Lj4j1QK2K7K2K0J9J5Poj4j2MK0J9lk3k4
-1816C23qQJ0mk2k2ML6M6J7k3l8j8J1K1J0qj8j5MJ7J1j7m1m3k2PL2M1K6jj5lK3L9M0L5K4Q
-1833D75j3k4j9oKOLlj1j1mKjrj7j7j0MJ3J2OJLNMKNQPKnj2j0l%j0k2k2qNMnpjOQ%j5l8n5
-1855B25m4lM5O4M7J6mojNJ2J5J1%kMJ3J2Pjj0k2l0l0k2qJ3L5M0J4k5m2k9j0nj4k0k0j8j3
-1872A99KK1L3K9J5lpPK7L2J5qj7j5j6k7l7l6k5rOK2L0L2K5J9J1Lqj9k3j7qoj3j6j2JJ4K3
-1890B44K5J9Mj2k0j7kJ8L0K8J3%lKJ0J0PPJ0J1Kj4k2j8j4k5l6l0lJ7J2lmJ2K3K1J4ROLko
-1908C26oLJ7K9K8J0j3k9k9j3PJ1nk1j4J0L5M4L4J3j1k7k9k3j6nkrk3k2LK7K7Lj1j2qpjMr
$$ plain form
-1926 286 254 217 204 219 238 246 249 256 263 265 274 292 312 329 343 353 348 327 308 305 317 333 350 369 380 375 364 367 380 383 369 362 379 403 408 391 374 373 381 382 375 363 344
-1944 344 314 286 279 298 321 326 306 278 260 259 273 301 335 369 400 428 450 458 443 411 376 347 322 301 290 291 295 290 278 275 290 312 324 320 306 292 285 287 298 310
-1962 310 312 303 291 281 272 261 250 245 253 276 307 335 348 343 329 309 285 264 258 267 280 290 307 337 364 370 358 351 360 372 371 358 345 339 341 349 366 392 414 414 386 347
-1980 347 320 310 296 266 228 201 187 180 185 207 238 256 255 249 243 225 200 193 221 262 278 258 225 206 209 230 260 291 321 351 379 402 415 418 417 409 391 369 353
-1997 353 346 345 351 366 380 378 358 338 336 350 359 350 329 310 297 286 273 263 265 279 296 311 324 336 341 332 312 291 280 284 302 328 348 355 354 355 362 373 388 409 432 445
-2015 445 440 419 390 355 317 284 268 273 292 317 340 356 359 352 343 338 339 343 355 375 395 394 366 325 295 286 289 290 292 302 318 326 323 317 319 329 333 318 284 251 236 240 248 248 248
-2034 248 260 280 292 292 291 294 293 283 274 275 279 266 233 201 195 215 237 246 248 261 290 315 322 315 314 327 341 346 354 377 407 428 431 426 424 419 408 394 382 370 348 321 307 315
-2054 315 332 338 325 306 300 310 327 340 349 360 375 384 379 371 376 395 413 418 417 422 432 441 448 460 473 474 461 445 431 415 398 387 390 391 376 348 323 309 308 320 349 382
$$ packed form
-1926B86l2l7j3J5J9QLPPKRJ8K0J7J4J0nk1j9lJ2J6J7J9J1nj1LJ3Lj4pJ7K4Nj7j7jQJpj2j9
-1944C44l0k8pJ9K3Nk0k8j8jJ4K8L4L4L1K8K2Qj5l2l5k9k5k1j1JMnj2lJ5K2J2mj4j4pKJ1J2
-1962C10Krj2j0rj1j1nQK3L1K8J3nj4k0k4k1oRJ3J0J7L0K7Oj2pRJ2jj3j3oKQJ7K6K2%k8l9
-1980C47k7j0j4l0l8k7j4pNK2L1J8jooj8k5pK8M1J6k0l3j9LK1L0L1L0L0K8K3J3Ljqj8k2j6
-1997C53pjOJ5J4kk0k0kJ4Rrk1j9j3j1j3j0KJ4J7J5J3J2Nrk0k1j1MJ8K6K0PjJPJ1J5K1K3J3
-2015D45nk1k9l5l8l3j6NJ9K5K3J6LprnJMJ2K0K0jk8m1l0rLJKJ0J6QloKJ0Mj5l4l3j5MQ%%
-2034B48J2K0J2%jLjj0rJMj3l3l2oK0K2RKJ3K9K5PpjJ3J4NQK3L0K1Lnknj1j4j2j2k2k7j4Q
-2054C15J7Oj3j9oJ0J7J3RJ1J5RnqNJ9J8NjNJ0RPJ2J3Jj3j6j4j6j7j1LJj5k8k5j4jJ2K9L3
$$ plain form
-2072 382 410 436 473 517 545 538 505 470 442 418 391 352 304 264 255 279 308 318 306 287 269 250 237 238 244 233 200 165 155 169 190 206 225 251 281 309
-2087 309 331 345 347 337 326 325 327 315 289 266 257 252 239 224 219 227 244 274 325 385 423 429 416 393 354 298 253 244 262 267 243 213 209 240 292 339 362 351 319 292
-2105 292 288 307 329 334 314 286 281 315 368 416 453 488 516 511 469 418 385 367 343 312 290 289 304 325 348 367 376 372 359 340 314 287 267 261 264 273 293 330 382
-2122 382 432 461 460 437 406 378 356 347 354 372 383 379 367 362 363 363 358 351 344 329 305 276 250 228 212 208 217 232 240 232 213 202 217 258 302 323 315 292 271 254 237 224
-2140 224 225 244 266 273 261 243 237 249 277 312 345 365 364 343 317 298 290 284 271 255 236 217 203 203 220 245 267 284 299 308 311 309 314 330 349 359 350 333 320 317 318
-2158 318 314 313 330 363 390 392 371 343 324 320 335 360 379 382 378 376 374 362 343 336 347 366 377 377 362 328 276 231 214 226 249 265 273 277 283 292 299 305 315 339 374 394
-2176 394 379 341 315 319 340 355 362 366 365 349 321 302 305 326 348 360 364 360 348 334 333 349 372 383 379 367 355 345 334 321 312 310 316 329 346 359 364 364 364 363 357 341 317
-2194 317 300 303 326 349 359 360 366 375 372 358 356 379 406 412 397 376 360 348 345 360 387 401 395 381 380 391 406 417 421 416 398 373 348 329 317 315 323 330 324 302 276 261
$$ packed form
-2072C82K8K6L7M4K8pl3l5k8k4k7l9m8m0rK4K9J0j2j9j8j9j3JOj1l3l5j0J4K1J6J9K6L0K8
-2087C09K2J4Kj0j1jKj2k6k3rnj3j5nQJ7L0N1O0L8Oj3k3l9n6m5rJ8Nk4l0mL1N2M7K3j1l2k7
-2105B92mJ9K2Nk0k8nL4N3M8L7L5K8nm2n1l3j8k4l1k2jJ5K1K3J9Rmj3j9k6k7k0oLRK0L7N2
-2122C82N0K9jk3l1k8k2rPJ8J1mj2nJ%nppj5k4k9k6k2j6mRJ5Qqj9j1J5M1M4K1qk3k1j7j7j3
-2140B24JJ9K2Pj2j8oJ2K8L5L3K0jk1k6j9qoj3j6j9j9j4%J7K5K2J7J5RLkNJ6J9J0rj7j3lJ
-2158C18mjJ7L3K7Kk1k8j9mJ5K5J9Lmkkj2j9pJ1J9J1%j5l4n2m5j7J2K3J6QMORPOJ0K4L5K0
-2176C94j5l8k6MK1J5PMjj6k8j9LK1K2J2Mmj2j4jJ6K3J1mj2j2j0j1j3rkOJ3J7J3N%%joj6k4
-2194C17j7LK3K3J0JORlj4kK3K7Oj5k1j6j2lJ5K7J4oj4jJ1J5J1Mnj8k5k5j9j2kQPok2k6j5
$$ plain form
-2213 261 263 275 282 276 264 257 263 275 287 294 288 266 235 211 202 205 211 222 239 259 275 290 309 323 320 297 266 251 262 295 330 347 344 337 338 340 326 291 245 205 186 197
-2231 197 230 261 264 234 188 145 112 92 90 119 178 253 318 355 359 347 338 343 366 395 413 406 376 336 297 263 239 229 233 241 252 273 314 362 399 418 422 413 391
-2248 391 363 340 327 324 328 330 312 270 229 220 236 249 245 244 258 274 274 264 265 276 276 256 229 214 220 241 272 299 315 317 308 291 269 246 230 222 219 217 218 223 235 252 270
-2266 270 280 277 267 258 253 252 253 258 265 274 282 285 275 250 222 210 219 234 241 238 234 240 252 264 270 270 277 301 338 374 388 376 351 327 303 269 228 201 203 230 259 273 265 237
-2285 237 198 164 146 149 167 196 228 260 291 321 342 342 325 316 330 347 331 284 241 229 247 279 318 358 379 372 346 314 284 262 257 266 264 242 221 230 261 286
-2302 286 294 299 312 331 351 362 355 325 289 267 256 237 212 202 213 226 229 226 231 249 279 319 358 374 357 329 313 318 333 355 380 402 412 410 404 404 410 416 415 407 398 396
-2320 396 400 401 394 380 359 328 296 277 274 274 264 251 246 250 253 251 249 244 224 187 148 125 122 126 123 113 107 115 137 168 206 239 253 248 236 225 206 173 149 157 187 201 181
-2339 181 151 133 122 103 80 68 66 63 56 52 57 73 106 151 192 210 210 204 196 183 181 214 282 349 382 381 366 352 347 351 361 365 353 331 313 307 313 331 362 402 431 431
$$ packed form
-2213B61KJ2Poj2pOJ2J2Pok2l1k4rLOJ1J7K0J6J5J9J4lk3l1j5J1L3L5J7lpJKj4l5m6m0j9J1
-2231A97L3L1Ll0m6m3l3k0kK9N9P5O5L7Mj2rNK3K9J8pl0m0l9l4k4j0MQJ1K1M1M8L7J9Mrk2
-2248C91k8k3j3lMKj8m2m1rJ6J3mjJ4J6%j0JJ1%k0k7j5OK1L1K7J6Krj7k2k3j6qlkJNJ2J7J8
-2266B70J0lj0rnjJNPRQLj0k5k8j2RJ5PlmOJ2J2O%PK4L7L6J4j2k5k4k4l4m1k7KK7K9J4qk8
-2285B37l9l4j8LJ8K9L2L2L1L0K1%j7rJ4J7j6m7m3j2J8L2L9M0K1pk6l2l0k2nRkk2k1RL1K5
-2302B86QNJ3J9K0J1pl0l6k2j1j9k5j0J1J3LlNJ8L0M0L9J6j7k8j6NJ5K2K5K2J0ko%OOjqrk
-2320C96MJpj4k1l1l2j9l%j0j3nMLkknk0l7l9k3lMlj0oQK2L1L8L3J4nj2j1j9l3k4QL0J4k0
-2339A81l0j8j1j9k3j2klpmNJ6L3M5M1J8%oqj3kL3O8O7L3jj5j4nMJ0Mj2k2j8oOJ8L1M0K9%
$$ plain form
-2357 431 398 352 319 310 318 330 341 350 356 361 366 366 344 307 284 302 350 390 395 377 357 345 340 341 347 355 361 366 369 362 342 319 308 311 320 327 334 346 364 382 388 374 345 318 305
-2376 305 306 307 298 273 245 233 248 276 292 293 297 313 331 336 336 341 349 347 337 340 368 404 420 407 375 340 313 298 298 318 351 384 395 377 339 301 274 261 262 270 274 266
-2395 266 247 232 235 255 284 311 328 332 323 305 285 271 269 279 298 324 351 371 380 380 383 397 417 435 447 452 448 428 398 373 362 361 354 336 314 299 289 277 264 256
-2412 256 259 275 303 331 345 336 311 293 296 311 318 318 325 344 355 340 306 277 265 266 273 286 303 318 325 322 305 273 238 218 220 240 263 280 286 275 254 242 248 263 270
-2430 270 270 282 312 351 384 405 415 414 410 412 425 439 444 450 466 482 482 469 467 481 489 464 417 379 369 375 376 370 368 377 394 413 428 434 430 421 410 397 378 352 325 307 307
-2448 307 320 327 314 292 281 292 308 310 292 265 238 206 169 140 136 160 200 241 276 303 314 306 290 285 292 292 277 266 287 332 363 358 327 298 290 304 327 343 338
-2465 338 315 296 299 322 345 355 352 345 345 354 364 363 348 331 325 332 340 341 330 309 282 251 224 212 226 264 303 318 307 293 294 309 332 361 381 377 349 321 314 318 318 322
-2484 322 344 373 373 332 275 239 232 238 242 238 227 219 219 230 247 269 296 318 317 290 261 248 250 253 255 264 279 286 281 270 267 271 273 273 280 297 311 309 291 265 234 195 159 147
$$ packed form
-2357D31l3m6l3rQJ2J1RONN%k2l7k3J8M8M0Nj8k0j2nJOQONLpk0k3j1LRPPJ2J8J8Oj4k9k7j3
-2376C05JJrk5k8j2J5K8J6JMJ6J8N%NQkj0LK8L6J6j3l2l5k7j5%K0L3L3J1j8l8l8k7j3JQMq
-2395B66j9j5LK0K9K7J7Mrj8k0j4kJ0J9K6K7K0R%LJ4K0J8J2Nmk0l0k5j1jpj8k2j5j0j2j3q
-2412B56LJ6K8K8J4rk5j8LJ5P%PJ9J1j5l4k9j2JPJ3J7J5Plj7l2l5k0KK0K3J7Oj1k1j2OJ5P
-2430B70%J2L0L9L3K1J0jmKJ3J4NOJ6J6%j3kJ4Qk5m7l8j0OJokRJ7J9J5Omrj1j3j9k6k7j8%
-2448C07J3Pj3k2j1J1J6Kj8k7k7l2l7k9mK4M0M1L5K7J1qj6nP%j5j1K1M5L1nl1k9qJ4K3J6n
-2465C38k3j9LK3K3J0lp%RJ0jj5j7oPQJj1k1k7l1k7j2J4L8L9J5j1j4JJ5K3K9K0mk8k8pM%M
-2484C22K2K9%m1n7l6pOMmj1q%J1J7K2K7K2jk7k9j3KLKRJ5Pnj1lMK%PJ7J4kj8k6l1l9l6j2
$$ plain form
-2503 147 163 187 198 205 230 271 308 327 333 327 303 268 240 220 193 153 123 120 137 160 190 235 281 308 318 331 351 366 368 367 373 379 377 373 375 379 374 359 343 335 333 328
-2521 328 319 310 308 310 307 292 266 236 208 192 195 212 230 232 220 214 222 240 258 274 296 331 374 417 451 469 469 453 431 417 421 436 442 431 413 398 378 340 292 261
-2538 261 255 257 252 248 260 287 311 327 339 353 367 377 381 372 338 286 241 221 221 224 217 205 204 227 270 314 341 357 381 415 436 423 389 368 366 355 315 267 242 247
-2556 247 259 267 282 316 352 367 362 362 378 400 412 413 398 364 313 270 256 266 273 256 226 210 217 237 254 265 278 298 328 364 403 434 444 429 392 351 324
-2572 324 316 318 307 277 239 211 203 211 229 251 265 267 265 277 310 346 362 351 324 301 290 287 279 258 238 239 260 285 304 321 342 353 341 314 295 294 299 301 300 298 290 281
-2590 281 283 307 348 392 426 438 426 409 408 424 436 431 420 417 416 400 369 344 345 368 387 390 386 390 405 414 411 405 414 433 444 435 417 411 422 440 452 450 435 410 383 356
-2608 356 328 301 278 260 249 250 270 300 320 322 320 329 343 343 327 309 303 304 300 290 282 282 286 285 283 296 329 368 391 397 399 403 394 363 319 280 253 242 249 264 260 228 200 217
-2627 217 278 341 376 388 394 397 391 374 355 345 349 366 378 370 348 334 335 338 327 307 294 294 310 338 366 374 357 331 316 313 312 314 320 324 315 301 298 306 312 311 315 327 333 325 307
$$ packed form
-2503A47J6K4J1PK5M1L7J9Ook4l5k8k0k7m0l0lJ7K3L0M5M6K7J0J3K0J5KjOOkmKMnj5j6qkn
-2521C28rrkKlj5k6l0k8j6LJ7J8Kj2oQJ8J8J6K2L5M3M3L4J8%j6k2j4MJ5Oj1j8j5k0l8m8l1
-2538B61oKnmJ2K7K4J6J2J4J4J0Mrl4n2m5k0%Lpj2jK3M3M4K7J6K4L4K1j3l4k1kj1m0m8k5N
-2556B47J2QJ5L4L6J5n%J6K2J2Jj5l4n1m3j4J0Pj7l0j6PK0J7J1J3K0L0L6L9L1J0j5l7m1k7
-2572C24qKj1l0l8k8qQJ8K2J4KkJ2L3L6J6j1k7k3j1lqk1k0JK1K5J9J7K1J1j2k7j9jNKjkqr
-2590B81KK4M1M4L4J2j2j7jJ6J2nj1ljj6l1k5JK3J9LmMJ5RloRJ9J1rj8oJ1J8J2kj5k5k7k7
-2608C56k8k7k3j8j1JK0L0K0KkRJ4%j6j8oJmj0q%MjkJ3L3L9K3OKMrl1m4l9k7j1PJ5ml2k8J7
-2627B17O1O3L5J2OLoj7j9j0MJ7J2qk2j4JLj1k0j3%J6K8K8Qj7k6j5ljKOMrj4lQOjMJ2Oqj8
$$ plain form
-2647 307 284 254 214 178 161 167 191 228 269 302 323 339 357 366 353 318 276 238 213 208 226 253 268 264 250 236 231 238 263 300 336 362 377 380 371 359 362 385 410
-2663 410 417 410 405 412 424 429 423 408 392 384 394 424 460 486 488 464 428 398 386 380 368 346 324 312 308 310 325 356 398 434 447 432 399 363 340 336 344 349 338 305 261
$$ packed form
-2647C07k3l0m0l6j7OK4L7M1L3K1J6J8Rj3l5m2l8k5nJ8K7J5mj4j4nPK5L7L6K6J5Lrj2LK3K5
-2663D10PpnPJ2Noj5j6qJ0L0L6K6Kk4l6l0j2oj2k2k2j2mKJ5L1M2L6J3j5l3l6k3mQNj1l3m4
$$ [...]
-3135D81
##END=	
##END=	
