##TITLE=	Mar02-2022.20.fid
TM-VI-273, Y+Ph-pyr, acetone-d6

##JCAMP-DX=	6.0	$$ MestReNova 14.3.0-30573
##DATA TYPE=	LINK
##BLOCK_ID=	1
##BLOCKS=	2    
##ORIGIN=	Mestrelab Research S.L.
##OWNER=	hrzepa
##$MNOVA/LINK_BLOCK_TYPE=	ITEM	$$ NMR Spectrum
##$MNOVA/ITEM/POLYGON=	(XY..XY)
5321,5835
8722,5835
8722,8208
5321,8208
5321,5835
##$MNOVA/ITEM/Z=	0
##$MNOVA/ITEM/ANGLE=	0
##TITLE=	Mar02-2022.20.fid
##JCAMP-DX=	6.0	$$ MestReNova 14.3.0-30573
##BLOCK_ID=	2
##DATA TYPE=	MNOVA NMR VIEW DATA
##DATA CLASS=	MNOVA VIEW DATA
##$MNOVA/ITEM/ZOOM/X=	-4.0107147498308073352,	16.011019999997905927
##$MNOVA/ITEM/ZOOM/Y=	-1249.068394660949707,	13704.9483642578125
##END=	
##TITLE=	Mar02-2022.20.fid
##JCAMP-DX=	6.0	$$ MestReNova 14.3.0-30573
##BLOCK_ID=	3
##DATA TYPE=	NMR SPECTRUM
##DATA CLASS=	XYDATA
##NUMDIM=	1
##ORIGIN=	Bruker BioSpin GmbH
##OWNER=	nmr
##.OBSERVE FREQUENCY=	400.20240119999999706
##.OBSERVE NUCLEUS=	^1H
##.SOLVENT NAME=	Acetone
##.PULSE SEQUENCE=	zg30
##LONGDATE=	2022/03/02 17:34:00.000
##.ACQUISITIONMODE=	SIMULTANEOUS (DQD)
##$ORIGINAL FORMAT=	Bruker XWIN-NMR
##$MNOVA/SCALES_VERSION=	9
##$PARAMETER FILE=	(acqus, ASCII, /private/var/folders/f6/rjf_tdyn2v98c5c0wvkgn4s80000gn/T/sDYQTvYfShyPeS6aiJyCwQ/20/acqus, 0)
$$ ##TITLE= Parameter file, TOPSPIN		Version 3.2
$$ ##JCAMPDX= 5.0
$$ ##DATATYPE= Parameter Values
$$ ##NPOINTS= 11	$$ modification sequence number
$$ ##ORIGIN= Bruker BioSpin GmbH
$$ ##OWNER= nmr
$$ $$ 2022-03-02 17:34:37.394 +0000  nmr@CZC2439F63
$$ $$ /opt/topspin/data/agmb/nmr/Mar02-2022/20/acqus
$$ $$ process /opt/topspin3.2/prog/mod/shimcntl
$$ ##$ACQT0= -2.36344537815126
$$ ##$AMP= (0..31)
$$ 100 100 100 100 100 100 100 100 100 100 100 100 100 100 100 100 100 100
$$ 100 100 100 100 100 100 100 100 100 100 100 100 100 100
$$ ##$AMPCOIL= (0..19)
$$ 0 0 0 0 0 0 0 0 0 0 0 0 0 0 0 0 0 0 0 0
$$ ##$ANAVPT= -1
$$ ##$AQSEQ= 0
$$ ##$AQ_mod= 3
$$ ##$AUNM= <au_zg>
$$ ##$AUTOPOS= <6 >
$$ ##$BF1= 400.2
$$ ##$BF2= 400.2
$$ ##$BF3= 400.2
$$ ##$BF4= 400.2
$$ ##$BF5= 400.2
$$ ##$BF6= 400.2
$$ ##$BF7= 400.2
$$ ##$BF8= 400.2
$$ ##$BYTORDA= 0
$$ ##$CAGPARS= (0..11)
$$ 0 0 0 0 0 0 0 0 0 0 0 0
$$ ##$CFDGTYP= 0
$$ ##$CFRGTYP= 9
$$ ##$CHEMSTR= <none>
$$ ##$CNST= (0..63)
$$ 1 1 145 1 1 1 1 1 1 1 1 1 1 1 1 1 1 1 1 1 1 1 1 1 1 1 1 1 1 1 1 1 1 1 1
$$ 1 1 1 1 1 1 1 1 1 1 1 1 1 1 1 1 1 1 1 1 1 1 1 1 1 1 1 1 1
$$ ##$CPDPRG= (0..8)
$$ <> <> <> <> <mlev> <mlev> <mlev> <mlev> <mlev>
$$ ##$D= (0..63)
$$ 0 1 0 0 0 0 0 0 0 0.06 0 0 0 0 0 0 0.0002 0 0 0 0 0 0 0 0 0 0 0 0 0 0 0
$$ 0 0 0 0 0 0 0 0 0 0 0 0 0 0 0 0 0 0 0 0 0 0 0 0 0 0 0 0 0 0 0 0
$$ ##$DATE= 1646242476
$$ ##$DE= 6.5
$$ ##$DECBNUC= <off>
$$ ##$DECIM= 2496
$$ ##$DECNUC= <off>
$$ ##$DECSTAT= 4
$$ ##$DIGMOD= 1
$$ ##$DIGTYP= 12
$$ ##$DQDMODE= 0
$$ ##$DR= 22
$$ ##$DS= 2
$$ ##$DSPFIRM= 0
$$ ##$DSPFVS= 20
$$ ##$DTYPA= 0
$$ ##$EXP= <proton>
$$ ##$F1LIST= <111111111111111>
$$ ##$F2LIST= <222222222222222>
$$ ##$F3LIST= <333333333333333>
$$ ##$FCUCHAN= (0..9)
$$ 0 2 0 0 0 0 0 0 0 0
$$ ##$FL1= 90
$$ ##$FL2= 90
$$ [...]
$$ ##$Sgu3PowerLevels= (0..7)
$$ 0 0 0 0 0 0 0 0
$$ ##$Sgu4PowerLevels= (0..7)
$$ 0 0 0 0 0 0 0 0
$$ ##$Sgu5PowerLevels= (0..7)
$$ 0 0 0 0 0 0 0 0
$$ ##$Sgu6PowerLevels= (0..7)
$$ 0 0 0 0 0 0 0 0
$$ ##$Sgu7PowerLevels= (0..7)
$$ 0 0 0 0 0 0 0 0
$$ ##$Sgu8PowerLevels= (0..7)
$$ 0 0 0 0 0 0 0 0
$$ ##$SguType= 3
$$ ##$ShimPowMaxUA= (0..63)
$$ 130000 130000 130000 130000 130000 130000 130000 130000 130000 130000 130000
$$ 130000 130000 130000 130000 130000 130000 130000 130000 130000 0 0 0 0
$$ 0 0 0 0 0 0 0 0 0 0 0 0 0 0 0 0 0 0 0 0 0 0 0 0 0 0 0 0 0 0 0 0 0 0 0 0
$$ 0 0 0 0
$$ ##$ShimPowMaxUC= (0..63)
$$ 130000 130000 130000 130000 130000 130000 130000 130000 130000 130000 130000
$$ 130000 130000 130000 130000 130000 130000 130000 130000 130000 0 0 0 0
$$ 0 0 0 0 0 0 0 0 0 0 0 0 0 0 0 0 0 0 0 0 0 0 0 0 0 0 0 0 0 0 0 0 0 0 0 0
$$ 0 0 0 0
$$ ##$ShimPowMaxUG= (0..63)
$$ 524287 524287 524287 524287 524287 524287 524287 524287 524287 524287 524287
$$ 524287 524287 524287 524287 524287 524287 524287 524287 524287 0 0 0 0
$$ 0 0 0 0 0 0 0 0 0 0 0 0 0 0 0 0 0 0 0 0 0 0 0 0 0 0 0 0 0 0 0 0 0 0 0 0
$$ 0 0 0 0
$$ ##$ShimPowRcbType= 3
$$ ##$ShimPowRes= (0..63)
$$ 1e-20 1e-20 1e-20 1e-20 1e-20 1e-20 1e-20 1e-20 1e-20 1e-20 1e-20 1e-20
$$ 1e-20 1e-20 1e-20 1e-20 1e-20 1e-20 1e-20 1e-20 0 0 0 0 0 0 0 0 0 0 0 0
$$ 0 0 0 0 0 0 0 0 0 0 0 0 0 0 0 0 0 0 0 0 0 0 0 0 0 0 0 0 0 0 0 0
$$ ##$ShimPowRng0= (0..63)
$$ 1 1 1 1 1 1 1 1 1 1 1 1 1 1 1 1 1 1 1 1 0 0 0 0 0 0 0 0 0 0 0 0 0 0 0 0
$$ 0 0 0 0 0 0 0 0 0 0 0 0 0 0 0 0 0 0 0 0 0 0 0 0 0 0 0 0
$$ ##$ShimPowRng1= (0..63)
$$ 1 1 1 1 1 1 1 1 1 1 1 1 1 1 1 1 1 1 1 1 0 0 0 0 0 0 0 0 0 0 0 0 0 0 0 0
$$ 0 0 0 0 0 0 0 0 0 0 0 0 0 0 0 0 0 0 0 0 0 0 0 0 0 0 0 0
$$ ##$ShimPowRng2= (0..63)
$$ 1 1 1 1 1 1 1 1 1 1 1 1 1 1 1 1 1 1 1 1 0 0 0 0 0 0 0 0 0 0 0 0 0 0 0 0
$$ 0 0 0 0 0 0 0 0 0 0 0 0 0 0 0 0 0 0 0 0 0 0 0 0 0 0 0 0
$$ ##$ShimPowRng3= (0..63)
$$ 1 1 1 1 1 1 1 1 1 1 1 1 1 1 1 1 1 1 1 1 0 0 0 0 0 0 0 0 0 0 0 0 0 0 0 0
$$ 0 0 0 0 0 0 0 0 0 0 0 0 0 0 0 0 0 0 0 0 0 0 0 0 0 0 0 0
$$ ##$ShimSysFunc= (0..63)
$$ 1 2 3 4 5 7 9 11 15 16 8 10 12 14 6 17 13 18 19 20 0 0 0 0 0 0 0 0 0 0
$$ 0 0 0 0 0 0 0 0 0 0 0 0 0 0 0 0 0 0 0 0 0 0 0 0 0 0 0 0 0 0 0 0 0 0
$$ ##$ShimSysMatrix= 0
$$ ##$ShimSysType= 1
$$ ##$TFXNUM= 0
$$ ##$TRIPLO2= 0
$$ ##$VTU= 2
$$ ##$VTUETH= <149.236.99.20>
$$ ##$VTUTY= <no>
$$ ##$WBREFAM= (0..15)
$$ 135.5 97.7 100 100 100 100 100 100 100 100 100 100 100 100 100 100
$$ ##$WBREFLM= (0..15)
$$ 0 0 0 0 0 0 0 0 0 0 0 0 0 0 0 0
$$ ##$WBREFPH= (0..15)
$$ 72.26 -67.22 0 0 0 0 0 0 0 0 0 0 0 0 0 0
$$ ##$WBSGU= (0..15)
$$ 0 0 0 0 0 0 0 0 0 0 0 0 0 0 0 0
$$ ##$XFAC= 2
$$ ##END=
$$ 
##$DECIM=	2496
##$DSPFVS=	20
##XUNITS=	HZ
##YUNITS=	ARBITRARY UNITS
##FIRSTX=	6407.6102040000005218
##LASTX=	-1605.0880428824991668
##DELTAX=	-0.12226593800080109986
##XFACTOR=	1
##YFACTOR=	0.014431867989901659907
##FIRSTY=	10.252752304077148438
##MINY=	-3.1639757156372070313
##MAXY=	12459.0439453125
##NPOINTS=	65536
##XYDATA=	(X++(Y..Y))
$$ [...]
1819C69kj9LK7J6j9k5JJ9QpLJ4jl4m5k6mLRK3L2K8J7J4J4Lj2k0j8j0LK6L5J0l4m8j4K6J9k2
$$ 369 367 348 351 378 394 375 350 351 370 378 371 374 388 387 353 308 282 278 281 290 313 345 373 390 404 418 421 409 389 371 361 364 390 425 435 401 353 339 365 384 362
1814C62m4k7jjj6j3J2L2K7Rqj9k9k4RN2O3L3%NK3jo0r2n1J6L7J5kRK1J8J9K5J3j6l0qJ6Rk1
$$ 362 318 291 290 289 273 260 272 304 331 340 332 313 284 260 269 321 384 417 417 422 445 444 384 292 241 257 294 309 307 316 337 355 374 399 412 396 366 358 374 383 362
1809C62l9m0l1j4J6L7K0j8l6j2K7M8M0K0J0J5J4rm1m1pJ9Ok6k5QL7M0L0K0Lj5k3k4k7k2mJ1
$$ 362 323 283 252 238 254 291 311 293 257 245 272 320 360 380 390 405 419 410 369 328 321 340 346 320 295 303 340 380 410 430 433 418 395 371 344 322 318 329
1804C29%j4PM4L9lk0QJ6l0p3m8J1L7K3J4J8QqKK2J4j7k3MK1Rlmpj7j0J3J3k0m1j1L4M1Pk9
$$ 329 329 315 322 366 405 402 382 390 406 376 303 255 266 303 326 340 358 366 358 360 382 396 379 356 360 381 390 387 383 376 359 349 362 375 355 314 303 337 378 385 356
1799C56l9k3QL9L9Ll3l0NK9K7Qj1j5KK5J6k8n8l5ORj6j1L3N8K8j6k3mkk1k3LK9L3K3J8J7L
$$ 356 317 294 302 341 380 383 350 320 325 354 381 389 378 363 365 390 406 378 320 285 291 300 284 273 306 364 392 376 353 349 347 326 303 306 335 368 391 409 426 429
1794D29j7k6j1J2J1k3m8l2J2L0Rj3nJ1Lj4j1QJ4LjQJ3%j4j4qqnJ3L2L6J3k2m2k0L2P2O0K7
$$ 429 412 386 375 387 398 375 327 295 307 337 346 333 328 339 342 328 317 325 339 342 341 349 362 362 348 334 326 318 313 326 358 394 407 385 343 323 355 427 487 514
1789E14K7O5P6K7l8n1j6J0LnJ6N2Q4R5Q9O6M2L1K7Ol0n1m0j5j4m1p2p6m1KJ6j1m2m1j7mj4
$$ 514 541 606 682 709 671 620 604 614 617 612 628 680 764 859 948 1014 1056 1087 1114 1120 1090 1039 999 984 970 929 857 781 740 742 758 747 705 664 647 643 629
1785F29l1l9l5j6NKl6o5l5K0L3LoL0M7Rk2J0O9P5L4PJ6K6K7M8Q6J00Q3O1N9P2R2J28J68J83
$$ 629 598 559 524 508 513 515 479 414 379 399 432 435 429 459 506 515 493 503 572 647 681 688 704 730 757 805 891 991 1074 1135 1194 1266 1358 1486 1654 1837
1780A837J76J66J53J17N7J0j9n2j00j37j55j69j88j85j54j23j11r3n8k3j1j4k4l8m9l8j4j5
$$ 1837 2013 2179 2332 2449 2506 2516 2497 2445 2345 2208 2053 1884 1696 1511 1357 1234 1123 1030 972 949 938 924 900 862 813 775 761 746
1777G46m2m6pK7Ql9n3l0mJ3L0M3L8J7mj3kL4P0O6J9nL8J02J21R8R3J27J67J90J98J87J51J00
$$ 746 704 658 651 678 686 647 594 564 560 573 603 646 684 701 697 684 682 716 786 852 871 866 904 1006 1127 1225 1318 1445 1612 1802 2000 2187 2338 2438
1773B438O1K3k8p4q7q2j06j56j76j46j04r3j09j24j25j04o6l8n0p8o8k4Jj0k1j4k5n8o2jO6
$$ 2438 2499 2522 2494 2420 2333 2251 2145 1989 1813 1667 1563 1470 1361 1237 1112 1008 942 904 854 776 708 684 685 675 654 640 615 557 495 494 560
1769E60O1jm5l9mK5L4J6j0oL6O7L5l0m9lN7P8N4J8J1M1Q0P7L0nJ7N4L8k8p7p5m7j8Ljm5r5
$$ 560 621 620 575 536 532 557 591 607 597 591 627 694 729 699 650 647 704 782 836 854 865 906 986 1063 1093 1088 1105 1159 1197 1169 1092 1017 970 952 955 954 909 814
1764H14q5j9J6j7n8m0OK0jj6k1k6j5L3P7O1lm1l0j5k6l1j2PLMK4L5Nk6k1jj2m7m9j6jk7m6
$$ 814 729 710 726 709 651 611 617 637 636 620 599 573 558 591 668 729 726 685 655 640 614 583 571 578 581 585 609 644 649 623 602 601 589 542 493 477 476 449 403
1760D03k0K6M2K1JMK2M1M5K0k1n1m9l4k4j3OJ9J0mjJ8L0K1Lj6l2l6j3K6N2N7M1Nm1o7n1j3
$$ 403 383 409 451 472 473 477 499 540 585 605 584 533 484 450 426 413 419 438 448 444 443 461 491 512 515 499 467 431 418 444 496 553 594 599 558 491 440 427
1755D27KqoJ8L0Qj1LL4M1J5j4k3j0J5K9J3k4m0oM3N7L0JlMlk0k1jJ5Pj6k4kK1J5rk3j0NJ5
$$ 427 429 421 415 433 463 471 460 463 497 538 553 539 516 506 521 550 563 539 499 493 536 593 623 624 621 625 622 602 581 580 595 602 586 562 560 581 596 587 564 554 559 574
1750E74K7M0K8j4m9m5k5j6j2J2L6K3j6k6OL2J9j0j3QK6K9K5J6OJ2L1L9On1p4l8J7L7J8jLJ1
$$ 574 601 641 669 655 606 561 536 520 508 520 556 579 563 537 543 575 594 584 571 579 605 634 659 675 681 693 724 763 769 718 644 606 623 660 678 677 680 691
1745F91j1m7n6k3K2M9M8K8MrJJ6J3rk1qRJ2J6L1L4Nk6l4k4k4k7j0Q%k3j7J7L7L2K2K4J1k1
$$ 691 680 633 577 554 576 625 673 701 705 696 697 713 726 717 696 688 697 709 725 756 790 795 769 735 711 687 660 650 658 658 635 618 635 672 704 726 750 761 740
1740G40m3m0l1k7j2K1N0N6N1M3K3j5l6k9j9k2j4K8O9N8Pk6j9ljKJ2J0j9n3o0l5lJ7K4K6K4
$$ 740 697 657 626 599 587 608 658 714 765 808 831 816 780 751 732 710 696 724 793 851 858 832 813 810 809 811 823 833 814 761 701 666 663 680 704 730 754
1736G54J4pk3j5J4L4K6QNJ5K1J4NKPJ6K9M1L9J3k9o1n4j2K7L2J8J4K1J3%MJ6%l0k3L2O4K4
$$ 754 768 761 738 723 737 771 797 805 810 825 846 860 865 867 874 890 919 960 999 1012 983 922 868 856 883 915 933 947 968 981 981 985 1001 1001 971 948 980 1044 1068
1731A068l6m5pJ8J9K3L0J4rMM1M9Ql7m5k4ML3M3K3kJ2N5P2M1Pmqk4k4J4N6O1K7j1l5k9J1N5
$$ 1068 1032 987 980 998 1017 1040 1070 1084 1075 1079 1120 1169 1177 1140 1095 1071 1075 1108 1151 1174 1172 1184 1239 1311 1352 1359 1355 1347 1323 1299 1313 1369 1430 1457 1446 1411 1382 1393 1448
1726A448O0K1qOK8K9L7P6R8N5j3k6K3N9M2J1J2M0O0N5L3J2J9M2M3Kl5j4M0N8K8J0L2N6N0M4
$$ 1448 1508 1529 1521 1527 1555 1584 1621 1697 1795 1850 1837 1811 1834 1893 1935 1946 1958 1998 2058 2113 2146 2158 2177 2219 2262 2264 2229 2215 2255 2313 2341 2351 2383 2439 2489 2533
1722B533P4J12J14Q4O1N8N7N7P1R7J08R2N8K8K2M6Q6J10J14J24J54J79J77J67J80K08K14K05
$$ 2533 2607 2719 2833 2917 2978 3036 3093 3150 3221 3318 3426 3518 3576 3604 3626 3672 3758 3868 3982 4106 4260 4439 4616 4783 4963 5171 5385 5590
1719E590K13K55K98L15L17L27L55L97M58N34O10O73P40Q40R85J153J315J479J686J981K357
$$ 5590 5803 6058 6356 6671 6988 7315 7670 8067 8525 9059 9669 10342 11082 11922 12907 14060 15375 16854 18540 20521 22878
1716B2878K781L249L804M474N214N961O704P497Q367R281J0163J0878J1149J0566Q773N749
$$ 22878 25659 28908 32712 37186 42400 48361 55065 62562 70929 80210 90373 101251 112400 122966 131739 137488
1714A37488J922k003n359p766r184r782r798r435q841q104p277o408n553m763m060l428k852
$$ 137488 139410 137407 132048 124282 115098 105316 95518 86083 77242 69138 61861 55453 49900 45137 41077 37649 34797
1712C4797k342j908j540j219r25o50l91j54M4K07L64N40P40R64J223J507J789K068K394K828
$$ 34797 32455 30547 29007 27788 26863 26213 25822 25668 25712 25919 26283 26823 27563 28527 29750 31257 33046 35114 37508 40336
1710D0336L382M032M765N611O624P864R389J1221J3305J5530J7825K0217K2781K5539K8454
$$ 40336 43718 47750 52515 58126 64750 72614 82003 93224 106529 122059 139884 160101 182882 208421 236875
1708B36875L1418L4110L5666L4618K9470J9781O843o742j8362k6520l1068l2706l2373l0895
$$ 236875 268293 302403 338069 372687 402157 421938 428781 422039 403677 377157 346089 313383 281010 250115
1706B50115k8811k6366k3660k0838j8111j5607j3339j1303r540q060o790n654m657l840l175
$$ 250115 221304 194938 171278 150440 132329 116722 103383 92080 82540 74480 67690 62036 57379 53539 50364
1704E0364k594k071j633j274r36n80k19J13M24P49J102J483J895K358K893L518M259N164O272
$$ 50364 47770 45699 44066 42792 41856 41276 41057 41170 41594 42343 43445 44928 46823 49181 52074 55592 59851 65015 71287
1702G1287P584R087J0810J2812J5082J7495J9946K2477K5207K8155L1168L3905L5610L4901
$$ 71287 78871 87958 98768 111580 126662 144157 164103 186580 211787 239942 271110 305015 340625 375526
1700C75526L0197K0825P915n938j8010k6663l1623l3518l3298l1830k9696k7193k4474k1669
$$ 375526 405723 426548 434463 428525 410515 383852 352229 318711 285413 253583 223887 196694 172220 150551
1698A50551j8905j6284j3904j1838j0083q565p235o116n211m452l761l138k629k242j941j683
$$ 150551 131646 115362 101458 89620 79537 70972 63737 57621 52410 47958 44197 41059 38430 36188 34247 32564
1696C2564j435j170q99o68m90l26j28R1L04N24P83J083J414J793K242K744L283L897M630N447
$$ 32564 31129 29959 29060 28392 27902 27576 27448 27539 27843 28367 29150 30233 31647 33440 35682 38426 41709 45606 50236 55683
1694E5683O269P076P922Q834R748J0527J0944J0640R193O408K565j640n421q250r983j0755
$$ 55683 61952 69028 76950 85784 95532 106059 117003 127643 136836 143244 145809 144169 138748 130498 120515 109760
1692A09760j0831j0456r823r050q215p356o500n664m866m136l515l027k635k276j923j622
$$ 109760 98929 88473 78650 69600 61385 54029 47529 41865 36999 32863 29348 26321 23686 21410 19487 17865
1690A7865j408j258j108r47q07p10o39n78n23m81m45m01l47k92k57k61k86k81k23j52j28j51
$$ 17865 16457 15199 14091 13144 12337 11627 10988 10410 9887 9406 8961 8560 8213 7921 7664 7403 7117 6836 6613 6461 6333 6182
1687F182j74j62j34j21j23j23j11q5o2n5o9q1p2n8o6r7j18j17j14j20j21j04q3p7q2r1r2p6
$$ 6182 6008 5846 5712 5591 5468 5345 5234 5149 5087 5032 4963 4882 4810 4752 4686 4589 4471 4354 4240 4120 3999 3895 3812 3735 3653 3562 3470 3394
1684C394m6l2n1q8r7o8k9mJ0Pk2n8o4l6j5k0k1mj0n2p7l1M8P1K2l4m9l0j1PK6L6K6RNJ4K4
$$ 3394 3348 3316 3265 3177 3080 3012 2983 2979 2989 2996 2974 2916 2852 2816 2801 2781 2760 2756 2746 2694 2617 2586 2634 2705 2727 2693 2644 2614 2603 2610 2636 2672 2698 2707 2712 2726 2750
1679B750L0L7N1N8M0ll6l0KPl8q4q2l7jnk7m6o4p5o5k9Jj0m7p3o3l4j9k7m4m9l6j5lj0k6l8
$$ 2750 2780 2817 2868 2926 2966 2963 2927 2897 2899 2906 2868 2784 2702 2665 2664 2659 2632 2586 2522 2447 2382 2353 2354 2344 2297 2224 2161 2127 2108 2081 2037 1988 1952 1937 1934 1924 1898 1860
1675A860l0j2Kmk2l5l0nL2N8M7Pj3J8P8J01O1qn3n0rM9Q5P5L1JOK7K9Rk0m1m2j5J3mo3r6p1
$$ 1860 1830 1818 1820 1816 1794 1759 1729 1724 1756 1814 1861 1868 1855 1873 1951 2052 2113 2105 2052 2002 1993 2042 2127 2202 2233 2234 2240 2267 2296 2305 2285 2244 2202 2187 2200 2196 2133 2037 1966
1670A966l1k8n0n3m7o0p2l7K4L6k1p5o9k9j0j3pMKj6k5j9j3j5j2LK1L0K2ol2l5qJ6J2j1k4
$$ 1966 1935 1907 1857 1804 1757 1697 1625 1588 1612 1648 1627 1552 1483 1454 1444 1431 1424 1428 1430 1414 1389 1370 1357 1342 1330 1333 1354 1384 1406 1400 1368 1333 1325 1341 1353 1342 1318
1666A318j5pj1k1k0%K6L7L2K6L0L5K1j4m0k7J0L2J8j6l9l8l2m0m9l4KK8J8mrLll2n4m5j2J4
$$ 1318 1303 1296 1285 1264 1244 1244 1270 1307 1339 1365 1395 1430 1451 1437 1397 1370 1380 1412 1430 1414 1375 1337 1305 1265 1216 1182 1184 1212 1230 1226 1217 1220 1217 1185 1131 1086 1074 1088
1661A088K2J7J4J7J5Nqj9k6l2l3k1%J5J3%j1k1k8k6j1jknNK1K4J8J1OlkRJ4Jj5j9k1l6m8k8
$$ 1088 1110 1127 1141 1158 1173 1178 1170 1151 1125 1093 1060 1039 1039 1054 1067 1067 1056 1035 1007 981 970 969 967 962 967 988 1012 1030 1041 1047 1044 1042 1051 1065 1066 1051 1032 1011 975 927 899
1656H99LJ5J2K4L6J6k8m0kK6Kl4k9NJ5j1l5j7K6N5M2Oj0PK2%l6m1j6nj7j7PJ7ql1k1PK1K4
$$ 899 902 917 929 953 989 1005 977 937 935 961 963 929 900 905 920 909 874 857 883 938 980 986 976 983 1005 1005 969 928 912 907 890 873 880 897 889 858 837 844 865 889
1651H89K5K1J2J1J6Kk3k0K2M3J2k6j3J5Ll8m1mK0RjLlk4k7jJ9J1mnjj2l3m2k5J0M1L9Kk5j0
$$ 889 914 935 947 958 974 976 953 933 955 998 1010 984 971 986 989 951 910 906 926 935 934 937 934 910 883 882 901 912 908 903 902 890 857 815 790 800 841 880 882 857 847
1646H47K4K8Kk0k2k0j9mJ6J8ONJ2Lj4j1jj3l6k5K3M4J6j7j8nlJ6N9P5K9l0l2J5M3K9Pok6n1
$$ 847 871 899 901 881 859 839 820 816 832 850 856 861 873 876 862 851 850 837 801 776 799 843 859 842 824 819 816 832 891 966 995 965 933 948 991 1020 1027 1021 995 944
1641I44n0qM1O0M6L8N8R1R6N9J1%K0L5K7J7J3ll1m0k4j9n0p5n6k1k0m3m6k6j6j9j7pqqJ9N2
$$ 944 894 886 927 987 1033 1071 1129 1220 1316 1375 1386 1386 1406 1441 1468 1485 1498 1495 1464 1424 1400 1381 1331 1256 1200 1179 1159 1116 1070 1044 1028 1009 992 985 977 969 988 1040
1636A040L9k0o3m5oRmj0kKKJ4M1O5O1L3LJK7N0N0L5L1M0O1Q8J15J21J03R5J32J94K28K11J69
$$ 1040 1079 1059 996 951 945 954 950 940 938 940 942 956 997 1062 1123 1156 1159 1160 1187 1237 1287 1322 1353 1393 1454 1542 1657 1778 1881 1976 2108 2302 2530 2741 2910
1632B910J23O4pp2j19j52j63j47j30j41j65j53j08q4j04j19q8m5m6o9o0j7J7K0J2%k5m6l0
$$ 2910 3033 3097 3090 3018 2899 2747 2584 2437 2307 2166 2001 1848 1740 1656 1552 1433 1345 1300 1254 1185 1125 1108 1125 1145 1157 1157 1132 1086 1056
1629A056J5M4L6J1rk3k9oL8O0L9J2J8M3M7K8K8N5P4N9M1O3J34K13K47K22J64J16R1P9N9K8
$$ 1056 1071 1115 1151 1162 1153 1130 1101 1095 1133 1193 1232 1244 1262 1305 1352 1380 1408 1463 1537 1596 1637 1700 1834 2047 2294 2516 2680 2796 2887 2966 3025 3053
1625C053j8q3j58k07k02j66j45j45j32r0n3m9o3n6k9j8m0o9o9l3J1K4pm3l2K1N9L6j8m0k0
$$ 3053 3035 2952 2794 2587 2385 2219 2074 1929 1797 1707 1654 1605 1542 1486 1457 1439 1399 1330 1261 1228 1239 1263 1256 1213 1181 1202 1261 1297 1279 1239 1219
1621A219KKlloj6j2J1K6J4j3k8k6j6KK8N3O2N4M3M0M3M3K9J2J0K4K0k5q3r9o7l7m0n6n5l4
$$ 1219 1221 1223 1220 1217 1211 1195 1183 1194 1220 1234 1221 1193 1167 1151 1153 1181 1234 1296 1350 1393 1433 1476 1519 1548 1560 1570 1594 1614 1589 1506 1407 1340 1303 1263 1207 1152 1118
1616A118j2NOk4o2o3j9J9J7kj1k2m4m2JM0L2NJ1L7L4NlJ2RroJ1Jl4m4j5Lj7l9l2j5qMK5K2
$$ 1118 1106 1111 1117 1093 1031 968 949 968 985 983 972 950 906 864 865 905 937 942 953 990 1024 1029 1026 1038 1047 1038 1032 1043 1044 1010 966 951 954 937 898 866 851 843 847 872 894
1611H94j4m4l9k2j1RM5O0K4k7l7qK2L1J9Jj1JK3J7j8m0k5jLJ5M4M4ro4n2jJ5j3k8pK5M5N4
$$ 894 880 836 797 775 764 773 818 878 902 875 838 830 852 883 902 903 892 893 916 933 915 875 850 849 852 867 911 955 946 882 830 829 844 831 803 796 821 866 920
1607I20M3%m9n2j4J1OJJ4J9J0NJ1Jl0m3k4mkmPJ5J2J5K5J0l8p0m0K4N5M1K0J4Nj9k6kL3L4
$$ 920 963 963 914 862 848 859 865 866 880 899 909 914 925 926 896 853 829 825 823 819 826 841 853 868 893 903 865 795 755 779 834 875 895 909 914 895 869 867 900 934
1602I34nm7m9nM7N8K3k5m4k3RJ6pl2k1K2N4M3on1o4m1MM4N1K3pj5o%KQKj9l0lL0K5%J6O2O4
$$ 934 929 882 833 828 875 933 956 931 887 864 873 889 882 850 829 851 905 948 942 891 827 786 790 834 885 908 901 886 880 880 882 890 892 873 843 840 870 895 895 911 973 1037
1597A037mo9n5QL7J5qnPMj2k3k2oJ2Pk1m3k6J8N3N7M0Rk1k3PL1J3k0j5K1K5j6m7j9L1L3j0
$$ 1037 1033 964 909 917 954 969 961 956 963 967 955 932 910 904 916 923 902 859 833 851 904 961 1001 1010 989 966 973 1004 1017 997 982 1003 1028 1012 965 946 977 1010 1000
1592A000l8j9QJ2KPK1K0LnNRj1k9j8J6K9Ll7m5j1L2L6rn0l3K6N3J3l3k3J5J7j4j7K3M5J9n
$$ 1000 962 943 951 963 965 972 993 1013 1016 1011 1016 1025 1014 985 967 983 1012 1015 978 933 922 954 990 981 931 898 924 977 990 957 934 949 966 952 935 958 1003 1022 1017
1587A017J7M6K3l7o2l0J8L2J3j6k4kK6K1j1k4J0N1N0K1NRJ0Knj5l9m9j9L0M9L0Pnj8l3k8m
$$ 1017 1034 1080 1103 1066 1004 974 992 1024 1037 1021 997 995 1021 1042 1031 1007 1017 1068 1118 1139 1144 1153 1163 1165 1160 1145 1106 1057 1038 1068 1117 1147 1154 1149 1131 1098 1070 1066
1582A066J1J3K3L2J4j6rL7O4L8ok4j7j3oMMj4j8RL9L6J3KLqk0j1J4K3J6J2J4Kj9k2mPqk2o
$$ 1066 1077 1090 1113 1145 1159 1143 1134 1171 1235 1273 1267 1243 1226 1213 1207 1211 1215 1201 1183 1192 1231 1267 1280 1282 1285 1277 1257 1246 1260 1283 1299 1311 1325 1327 1308 1286 1282 1289 1281 1259 1253
1577A253K5L7J6pqJ0J8J0%LJ2J1ONMnj2RM9N9K3k2k6LK9L6L6L6K3Jj7k0j4pJQJ1Pok1k2lK0
$$ 1253 1278 1315 1331 1324 1316 1326 1344 1354 1354 1357 1369 1380 1386 1391 1395 1390 1378 1387 1436 1495 1518 1496 1470 1473 1502 1538 1574 1610 1633 1634 1617 1597 1583 1576 1577 1585 1596 1603 1597 1576 1554 1551 1571
1572A571K4J0KJ1K1J9J1NKKJ3L0L1J2jPJ9RprLJ0J3J1ql9m1J0O9P6L4mlJ7K6K1Mj4j1K0M5
$$ 1571 1595 1605 1607 1618 1639 1658 1669 1674 1676 1678 1691 1721 1752 1764 1763 1770 1789 1798 1791 1782 1785 1795 1808 1819 1811 1772 1731 1741 1810 1886 1920 1916 1913 1930 1956 1977 1981 1967 1956 1976 2021
1567B021K3j8k5NK1J2J4M5N9K3k5l3kL0M5M8L1mj5K2P1P1K3j9j0K6M1K7NmJJ2J2jj2kL2O1
$$ 2021 2044 2026 2001 2006 2027 2039 2053 2098 2157 2180 2155 2122 2120 2150 2195 2243 2274 2270 2255 2277 2348 2419 2442 2423 2413 2439 2480 2507 2512 2508 2509 2521 2533 2532 2520 2518 2550 2611
1562B611N7L0J5L1N5M8J2k0j5J6M2M4L5K6K5L5M8M9K5mnK0M2M3L2K5K7L8M9M0Rj2J3N8O9M0
$$ 2611 2668 2698 2713 2744 2799 2847 2859 2839 2824 2840 2882 2926 2961 2987 3012 3047 3095 3144 3169 3165 3160 3180 3222 3265 3297 3322 3349 3387 3436 3476 3485 3473 3486 3544 3613 3653
1558C653K6N2P9O5L1K5L5K8QJ8O4J00Q9N1L6O0Q9Q9N9L7M9P5P2M8M6P8J02Q5O3O7P5N6L4N4
$$ 3653 3679 3731 3810 3875 3906 3931 3966 3994 4002 4020 4084 4184 4273 4324 4360 4420 4509 4598 4657 4694 4743 4818 4890 4938 4984 5062 5164 5249 5312 5379 5454 5510 5544 5598
1554E598J00J14R0Q0R6R5O5N9J04J56J55J20J03J13J17J03R5J08J24J29J36J53J68J64J49
$$ 5598 5698 5812 5902 5982 6078 6173 6238 6297 6401 6557 6712 6832 6935 7048 7165 7268 7363 7471 7595 7724 7860 8013 8181 8345 8494
1551H494J47J67J84J86J84J99K23K30K16K10K26K37K20J96K11K61L02L02K85K84L05L33L49
$$ 8494 8641 8808 8992 9178 9362 9561 9784 10014 10230 10440 10666 10903 11123 11319 11530 11791 12093 12395 12680 12964 13269 13602 13951
1548A3951L40L21L35L94M56M61M24M05M31M65M76M85N22N66N92O12O44O80O98P09P41P95Q51
$$ 13951 14291 14612 14947 15341 15797 16258 16682 17087 17518 17983 18459 18944 19466 20032 20624 21236 21880 22560 23258 23967 24708 25503 26354
1545B6354Q94R25R50R86J042J112J164J188J219J289J392J496J592J681J752J803J865J977
$$ 26354 27248 28173 29123 30109 31151 32263 33427 34615 35834 37123 38515 40011 41603 43284 45036 46839 48704 50681
1543E0681K118K247K360K490K635K762K864K978L137L325L514L696L880M067M254M438M615
$$ 50681 52799 55046 57406 59896 62531 65293 68157 71135 74272 77597 81111 84807 88687 92754 97008 101446 106061
1541A06061M761M876M987N119N261N379N449N477N471N440N378N269N095M856M568M253L910
$$ 106061 110822 115698 120685 125804 131065 136444 141893 147370 152841 158281 163659 168928 174023 178879 183447 187700 191610
1539A91610L533L116K656K150J614J073N38Kn51j095j589k018k418k825l225l555l786l956
$$ 191610 195143 198259 200915 203065 204679 205752 206290 206292 205741 204646 203057 201039 198621 195796 192571 189016 185230 181274
1537A81274m120m287m420m496m528m527m490m434m380m330m258m149m031l911l764l592l448
$$ 181274 177154 172867 168447 163951 159423 154896 150406 145972 141592 137262 133004 128855 124824 120913 117149 113557 110109
1535A10109l357l272l133k970k851k780k694k568k437k335k252k184k149k122k044j907j784
$$ 110109 106752 103480 100347 97377 94526 91746 89052 86484 84047 81712 79460 77276 75127 73005 70961 69054 67270
1533F7270j741j739j710j638j572j527j484j425j363j319j297j283j256j204j141j101j084
$$ 67270 65529 63790 62080 60442 58870 57343 55859 54434 53071 51752 50455 49172 47916 46712 45571 44470 43386
1530D3386j069j041j021j016r97r55r17r07r00q69q39q35q31p90p44p40p57p28o59o21o31
$$ 43386 42317 41276 40255 39239 38242 37287 36370 35463 34563 33694 32855 32020 31189 30399 29655 28915 28158 27430 26771 26150 25519
1528B5519o37o02n78n95o03n50m78m62m88m85m42m22m57m93m76m28l93l71l39l09l20l72m05
$$ 25519 24882 24280 23702 23107 22504 21954 21476 21014 20526 20041 19599 19177 18720 18227 17751 17323 16930 16559 16220 15911 15591 15219 14814
1525A4814l79l22k86k87k97k90k60k19j93k03k41k64k46k16k10k19k02j67j71k26k62k27j56
$$ 14814 14435 14113 13827 13540 13243 12953 12693 12474 12281 12078 11837 11573 11327 11111 10901 10682 10480 10313 10142 9916 9654 9427 9271
1522I271j30j46j43j09j06j59k13j99j32q8r4j12j01q0r0j33j60j43j01q1q5q5o6n0o4r4j10
$$ 9271 9141 8995 8852 8743 8637 8478 8265 8066 7934 7846 7752 7640 7539 7459 7369 7236 7076 6933 6832 6751 6666 6581 6515 6465 6401 6307 6197
1519F197j09j00r0p4o2p2r9j11r2n4k7l2o1q6p4k9Mrn1p7o3m1l9n4o4n9m8m1m6n6o2n8n0m0
$$ 6197 6088 5988 5898 5824 5762 5690 5591 5480 5388 5334 5307 5275 5214 5128 5054 5025 5029 5020 4969 4892 4829 4788 4749 4695 4631 4572 4524 4483 4437 4381 4319 4261 4211 4171
1515D171l0k2j9k6l6m0m6n5n5m0k3k1l0l9m1k8nmm8j06j07l2L1J6l8m9j4Jj8k6rj2m9o8m1
$$ 4171 4141 4119 4100 4074 4038 3998 3952 3897 3842 3802 3779 3758 3728 3689 3648 3620 3615 3611 3563 3457 3350 3318 3349 3365 3327 3278 3264 3265 3247 3221 3212 3200 3151 3083 3042
1510C042rj1k4j2J5K6J0k3o4p9m5J1K2j3k6J8N0J3n3p5n3l3k3KK2Qk3l2k0k4l8l2qmk2l2k5
$$ 3042 3033 3022 2998 2986 3001 3027 3037 3014 2950 2871 2826 2837 2859 2846 2820 2838 2888 2901 2848 2773 2720 2687 2664 2666 2688 2696 2673 2641 2621 2597 2559 2527 2519 2515 2493 2461 2436
1506B436k4k2KL0K8mk5k3k7n0p1o6l9NM5L3l7r3o1K0L5l0q0m2L0N2K0k1m9o2m6mK4J9QK1L0
$$ 2436 2412 2390 2392 2422 2450 2446 2421 2398 2371 2321 2250 2184 2145 2150 2195 2228 2191 2098 2037 2057 2092 2062 1982 1940 1970 2022 2042 2021 1972 1910 1864 1860 1884 1903 1911 1932 1962
1501A962Km1n3k7kLoj0pJ0K1Nk2j9J8L6Km3m2j0kk7m0j4K1L2J0k3l8j9J3J7j2k9mK5J0k7l3
$$ 1962 1964 1923 1870 1843 1841 1844 1838 1828 1821 1831 1852 1857 1835 1816 1834 1870 1872 1829 1787 1777 1775 1748 1708 1694 1715 1747 1757 1734 1696 1677 1690 1707 1695 1666 1662 1687 1697 1670 1637
1497A637%J5j4n3o1l5JK5K9J2jPK5K4Kj8k4k8l0j9OK5J2k6n7n0lM4L9j3m8k1L3M0pm6l9j1
$$ 1637 1637 1652 1638 1585 1524 1489 1490 1515 1544 1556 1555 1562 1587 1611 1613 1595 1571 1543 1513 1494 1500 1525 1537 1511 1454 1404 1401 1445 1484 1471 1423 1402 1435 1475 1468 1422 1383 1372
1492A372LJ1K8L2jn4p1l8J0K5J4J8M5N0J4k3rK8K0l7o4k0L4L5NKJ3rn1n2pK2PrJJ2JoRK3J2
$$ 1372 1375 1386 1414 1446 1445 1391 1320 1282 1292 1317 1331 1349 1394 1444 1458 1435 1426 1454 1474 1437 1373 1353 1387 1422 1427 1429 1442 1433 1382 1330 1323 1345 1352 1343 1344 1356 1357 1351 1360 1383 1395
1487A395nj1j9l5l5jM2N0K2pj5%J8K4Jl0l3pJ2jj7j2%oj4kJ7J5ok2k6k1jL9O3M8J4RK4J5k7
$$ 1395 1390 1379 1360 1325 1290 1289 1331 1381 1403 1396 1381 1381 1399 1423 1424 1394 1361 1354 1366 1365 1348 1336 1336 1330 1316 1314 1331 1346 1340 1318 1292 1271 1270 1309 1372 1420 1434 1443 1467 1482 1455
1482A455m8rN4O8K7j3pK2J6l4p4n4OM3K0k3l4j2Omk2j5J8M2J5n4j02p6rK4%k0QN3O4L0j3l8
$$ 1455 1407 1398 1452 1520 1547 1534 1527 1549 1565 1531 1457 1403 1409 1452 1472 1449 1415 1403 1409 1405 1383 1368 1386 1428 1443 1389 1287 1211 1202 1226 1226 1206 1214 1267 1331 1361 1348 1310
1477A310l8j3K7M5J6l0m5k9j4j6j0J3L4L5J6pk2j6J0K5Rk6l7j5J5K6K2J7J7K2J8nl8m8j9K5
$$ 1310 1272 1259 1286 1331 1347 1317 1272 1243 1229 1213 1203 1216 1250 1285 1301 1294 1272 1256 1266 1291 1300 1274 1237 1222 1237 1263 1285 1302 1319 1341 1359 1354 1316 1268 1249 1274
1473A274M4L9L4K9Qk4l1j2OJ0N%j6l7k8J2M1K7qj8KK3J7j1l8l7oK3K7K0K3K6Lk5j8K8N2K9
$$ 1274 1318 1357 1391 1420 1428 1404 1373 1361 1367 1377 1382 1382 1366 1329 1301 1313 1354 1381 1373 1355 1357 1380 1397 1386 1348 1311 1305 1328 1355 1375 1398 1424 1427 1402 1384 1412 1464 1493
1468A493rk0j7k2k0JJ3jj1J4M8M1NlK2L1Mj9nJ8J2rnL5P6Q2M3j2l3qL5N3K9%pJ2L5L9K7J7
$$ 1493 1484 1464 1447 1425 1405 1406 1419 1418 1407 1421 1469 1510 1515 1512 1534 1565 1569 1550 1545 1563 1575 1566 1561 1596 1672 1754 1797 1785 1752 1744 1779 1832 1861 1861 1854 1866 1901 1940 1967 1984
1463A984K4M0M4K5J6L6N9N3K4K0N2Q1P4M7K8L1M9P6R0O8K8K2O3J02R3O0O0R6J20J02P3P5J10
$$ 1984 2008 2048 2092 2117 2133 2169 2228 2281 2305 2325 2377 2458 2532 2579 2607 2638 2687 2763 2853 2921 2949 2971 3034 3136 3229 3289 3349 3445 3565 3667 3740 3815 3925
1459C925J47J58J49J36J35J43J46J42J52J87K31K59K59K41K22K27K69L31L58L29K92L13L81
$$ 3925 4072 4230 4379 4515 4650 4793 4939 5081 5233 5420 5651 5910 6169 6410 6632 6859 7128 7459 7817 8146 8438 8751 9132
1457I132M20L99L64L67L97M23M30M21L84L16K51K15K01J85J67J54J34R8P4Q7R6N1k0l9J1N0
$$ 9132 9552 9951 10315 10682 11079 11502 11932 12353 12737 13053 13304 13519 13720 13905 14072 14226 14360 14458 14532 14619 14715 14766 14746 14707 14718 14768
1453A4768K9mK7J03J49J42J40J86K68L44M06M65N36O16P04P98R06J026J153J274J392J507
$$ 14768 14797 14793 14820 14923 15072 15214 15354 15540 15808 16152 16558 17023 17559 18175 18879 19677 20583 21609 22762 24036 25428 26935
1451B6935J605J660J676J690J707J677J540J304J024P24L92L2l17o25q86j096j235j307j335
$$ 26935 28540 30200 31876 33566 35273 36950 38490 39794 40818 41542 41934 41966 41649 41024 40138 39042 37807 36500 35165
1448C5165j329j286j214j135j055r53q30p24o51n98n30m54l81l17k55j95j34p4k7j9k8j3L6
$$ 35165 33836 32550 31336 30201 29146 28193 27363 26639 25988 25390 24860 24406 24025 23708 23453 23258 23124 23050 23023 23004 22976 22963 22999
1446B2999P0O7P3J28J86J89J52J46J73J66J01L8K1J2m1j18j66j83k16k81l46l75l84l99m27
$$ 22999 23069 23136 23209 23337 23523 23712 23864 24010 24183 24349 24450 24488 24509 24521 24480 24362 24196 24013 23797 23516 23170 22795 22411 22012 21585
1443B1585m39m23l99l92m02l86l23k53k33k61k72k28j72j55j68j68j54j58j71j60j32j32j78
$$ 21585 21146 20723 20324 19932 19530 19144 18821 18568 18335 18074 17802 17574 17402 17247 17079 16911 16757 16599 16428 16268 16136 16004 15826
1440A5826k16j96j47j18j23j37j51j77j99j96j88k16k90l54l60l21k84k90l31l68l63l17k83
$$ 15826 15610 15414 15267 15149 15026 14889 14738 14561 14362 14166 13978 13762 13472 13118 12758 12437 12153 11863 11532 11164 10801 10484 10201
1437A0201k98l33l19k59k25k50k77k45j82j61j93k12j86j43j04o1j7j3n3q1m9J2M4M0M4O7
$$ 10201 9903 9570 9251 8992 8767 8517 8240 7995 7813 7652 7459 7247 7061 6918 6814 6753 6736 6723 6670 6589 6540 6552 6596 6636 6680 6747
1434F747P4M8J7P%l1p3q9o7m5o6j16j53j49j40j64k13k48k47k40k48k51k29j98j90k12k21
$$ 6747 6821 6869 6886 6893 6893 6862 6789 6700 6633 6588 6522 6406 6253 6104 5964 5800 5587 5339 5092 4852 4604 4353 4124 3926 3736 3524 3303
1430C303j86j25q5r1j20j34j24j14j15j04p1m5m6m9k1Rj5p7j04p0l4m0n6l5LJ3%nj4l8n1l2
$$ 3303 3117 2992 2907 2816 2696 2562 2438 2324 2209 2105 2034 1989 1943 1894 1873 1882 1867 1790 1686 1616 1582 1542 1486 1451 1454 1467 1467 1462 1448 1410 1359 1327
1426A327j3l4o1l7K1L6Jj9mJl2n3l6j4j8j9J2L7J4k5k8jJ1%j1j8l5m6k1K3M1J8poQJ3J0J1
$$ 1327 1314 1280 1219 1182 1203 1239 1240 1221 1217 1218 1186 1133 1097 1083 1065 1046 1058 1095 1109 1084 1056 1055 1066 1066 1055 1037 1002 956 935 958 999 1017 1010 1004 1012 1025 1035 1046
1422A046J3J1NKNJ4K1J6jj9k8l0l2l9m4m4l1lK0K4J0jpk4l7k1J6K6rm1k4K0L9K5Ppk9m0rM7
$$ 1046 1059 1070 1075 1077 1082 1096 1117 1133 1132 1113 1085 1055 1023 984 940 896 865 862 882 906 916 915 908 884 847 826 842 868 859 818 794 814 853 878 885 878 849 809 800 847
1417H47O4J7m7p3n4j5K9O6P5M3j0n1o3n0j5K6M2J9j9l2rJ9K1MJK3M3K7j3l7k3NK1K0J2om0
$$ 847 911 928 881 808 754 739 768 834 909 952 942 891 828 778 763 789 831 850 831 799 790 809 830 834 835 858 901 928 915 878 855 860 881 901 913 907 867
1412H67p1p4m1RM7N0J7k6m6l0jJ9K7L0J8%KK4K4j7n0l7pj3k8JN0M0k9n9j2K8mn5m0K0L8J3
$$ 867 796 722 681 690 737 787 804 778 732 702 701 720 747 777 795 795 797 821 845 828 778 741 734 721 693 694 744 784 755 696 684 712 708 653 613 633 671 684
1408F84J0M2M3j7o7l8L6O9L5k0l7k0kok0k3j5qqKL7P7P3K0l7m7k1qk4k9NM7M2ll0qL2M4K1
$$ 684 694 736 779 762 695 657 693 762 797 777 740 720 718 712 692 669 654 646 638 640 677 754 827 847 810 763 742 734 710 681 686 733 775 772 742 734 766 810 831
1403H31qj8rORql2l3mJ5mm1n1k4%nj8j2OJ7RlqkRK0L3M7N0L2Jk2k7l0l6k8jJ8Nj4mK8L3jl3
$$ 831 823 805 796 802 811 803 771 738 734 749 745 704 653 629 629 624 606 594 600 617 626 623 615 613 622 642 675 722 772 804 805 783 756 726 690 662 661 679 684 670 666 694 727 726 693
1398F93l6j7J2M0N1K2k8m4j8RKk1l1k5qJ9M7M3J1j5j6j8k6j7J5K7nl9k7J1J9jj8j8j8j0J7
$$ 693 657 640 652 692 743 765 737 693 675 684 686 665 634 609 601 620 667 710 721 706 690 672 646 629 644 671 666 627 600 611 630 629 611 593 575 565 582
1393E82M3L1jj7p%JPJ5R%J3L3K4j3l7l0k2l3l6oL6N9M6Om1n2oN7O6J0m1l0J9L8J3j8j7QK2
$$ 582 625 656 655 638 631 631 632 639 654 663 663 676 709 733 720 683 653 631 598 562 556 592 651 697 703 662 610 604 661 727 737 696 666 685 723 736 718 701 709 731
1388G31Qj4k1j0lj3k8k4jJ9K4J8Mj0j3kRKlJ1L3L0J4J7L3J7l3n8k3L2M3Ql0m4l7k0JJ5J0j0
$$ 731 739 725 704 694 691 678 650 626 625 644 668 686 690 680 667 665 674 676 673 684 717 747 761 778 811 828 795 737 714 746 789 797 767 723 686 666 667 682 692 682
1383F82k6k3LM4O8N0Pj3MK4K0K0N2R2Q6M8K5L8N1N0O4J22J85K08K21K85M06N13N60N94O72
$$ 682 656 633 636 680 748 798 805 792 796 820 840 860 912 1004 1090 1138 1163 1201 1252 1302 1366 1488 1673 1881 2102 2387 2793 3306 3866 4460 5132
1379E132Q06R93J274J632J855J641R07p0q84j329j458j395j233j047r08q18p24o01m92m13
$$ 5132 5938 6931 8205 9837 11692 13333 14240 14170 13286 11957 10499 9104 7871 6824 5916 5098 4374 3773 3281 2868
1377B868l34k42j81j80j88j37m6Pj1m7l9J0M2K6lJ0M6M8J3PO6J27J32J19J56K20K53K72L52
$$ 2868 2534 2292 2111 1931 1743 1606 1560 1567 1556 1509 1470 1480 1522 1548 1545 1555 1601 1649 1662 1669 1735 1862 1994 2113 2269 2489 2742 3014 3366
1373C366N07O95R14J172J401J545J704K020K464K944L593M575N499N386L599O59k141l865
$$ 3366 3873 4568 5482 6654 8055 9600 11304 13324 15788 18732 22325 26900 32399 37785 41384 42043 39902 36037
1371C6037m473m384l956l418k953k619k306j940j588j325j102q60o42n13m35l36k28j69j56
$$ 36037 31564 27180 23224 19806 16853 14234 11928 9988 8400 7075 5973 5113 4471 3958 3523 3187 2959 2790 2634
1369B634j48j30j13j01q7p3n4j4L0L9K8M6R6J19J00R4J35J94K60L68N21O82Q59J091J347J549
$$ 2634 2486 2356 2243 2142 2055 1982 1928 1914 1944 1983 2011 2057 2153 2272 2372 2466 2601 2795 3055 3423 3944 4626 5485 6576 7923 9472
1366I472J726J986K345K753L347M335N433N683M263J441j547l594m460m516m151l611l103
$$ 9472 11198 13184 15529 18282 21629 25964 31397 37080 41343 42784 41237 37643 33183 28667 24516 20905 17802
1364A7802k738k446k105j733j428j193r53p14n45m57l84k95k31k06j82j40j05r8q8n7l3n1
$$ 17802 15064 12618 10513 8780 7352 6159 5206 4492 3947 3490 3106 2811 2580 2374 2192 2052 1947 1849 1761 1704 1671 1620
1361A620q2p8l3PJ0MK6O5P1M4M9J16J86J95J86K63M22N58O14O52P44Q83J070J367J737J912
$$ 1620 1538 1460 1427 1434 1444 1448 1474 1539 1610 1654 1703 1819 2005 2200 2386 2649 3071 3629 4243 4895 5639 6522 7592 8959 10696 12608
1358A2608J577P19k98j058j415j488j433j323j169r96q36p11o22n37m30l16k36k07j91j53
$$ 12608 14185 14904 14606 13548 12133 10645 9212 7889 6720 5724 4888 4177 3555 3018 2588 2272 2036 1829 1638 1485
1355A485j02p6p4p0n2m5n8o5m9j9kpk8m7m9k9mJj6k4j3jlmJ2K6K0RRJm1p9o2mK4jk6qK6L8
$$ 1485 1383 1307 1233 1163 1111 1066 1008 943 894 875 873 866 838 791 742 713 709 710 694 670 657 656 653 649 661 687 707 716 725 726 685 606 544 540 564 563 537 529 555 593
1350E93L7M4L6Jl2l1j6k5m1k5J1K7K5L4M9K8j8m3k3OJ1Jpr%K5L8Nn2o5k3J8J9PJ3J9Kj1LJ8
$$ 593 630 674 710 711 679 648 632 607 566 541 552 579 604 638 687 715 697 654 631 637 648 649 642 633 633 658 696 701 649 584 561 579 598 605 618 637 639 628 631 649
1346F49jk6j5J9K8J0NL1N0L5Kj7j3KMj4l7l3ML8L6RoJQjj6k4j2MJl3o1l5L3O9L3k4l4LL5L8
$$ 649 648 622 607 626 654 664 669 700 750 785 787 770 757 759 763 749 712 679 683 721 757 766 760 761 769 768 752 728 716 720 721 688 627 592 625 694 727 703 669 672 707 745
1340G45L1K0mk2rK3L0J4PJ5lm7o0j5L0J5m1o1k3L1N1L3ll7m9k5J3K9Rk4l4k0nJNJ1Jk4l0J1
$$ 745 776 796 792 770 761 784 814 828 835 850 847 800 740 725 755 770 729 668 645 676 727 760 757 720 671 646 659 688 697 673 639 619 614 615 620 631 632 608 578 589
1336E89O3N5rm7qN4N1rn6n3k3NJ8Nl8o7m2J3K2k1m4qL4L0NJ0L4L4J4jpk1l0pL5N7M3J8j1m3
$$ 589 652 707 698 651 643 697 748 739 683 630 607 612 630 635 597 530 488 501 523 502 458 450 484 514 519 529 563 597 611 610 603 582 552 545 580 637 680 698 687 644
1331F44n9m0oKr%L2L8%l4k0J6K2j3l6j9J2J6nj5lKj8l2pL3L3lj5K4N4K3l7n0j6Kj8k8lK2J1
$$ 644 585 545 539 541 532 532 564 602 602 568 548 564 586 573 537 518 530 546 541 526 523 525 507 475 468 501 534 531 516 540 594 617 580 530 514 516 498 470 467 489 500
1326E00j4j2J1K2J2Loj4j7oLrk6j2K8M8K1k0k8kK7L2K0Mj2k0j2QJ4nk8l0j5pj4j0K0M8M1M
$$ 500 486 474 485 507 519 522 516 502 485 479 482 473 447 435 463 511 532 512 484 482 509 541 561 565 553 533 521 529 543 538 510 480 465 458 444 434 454 502 543 547
1321E47l4m2k3LJ3%j7oL4O0L5k2o1o3l5KL4M0J9OK5M1Rm6n0RN5L3l1p1o2k4K3N8N3J6j0J0
$$ 547 513 471 448 451 464 464 447 441 475 535 570 548 487 424 389 391 425 465 484 490 515 556 565 519 469 478 533 566 535 464 402 378 401 459 512 528 518 528
1316E28M3M2J7jql1o2o3k8PJ4NJJ1J9J2j4m4m9j2M3P0N8L3J6M%PJ1j6o3q8n7ON3N4K5knRP
$$ 528 571 613 630 629 621 590 528 465 437 444 458 463 464 475 494 506 492 448 399 387 430 500 558 591 607 611 611 618 629 613 550 462 405 411 464 518 543 541 536 545 552
1311E52j9l5j5J7J4k1l8k0kj0j6NK4K2K1M7O3K5m1o2k5Mj4l2lM2M3jl1k3mLRJ4nm0m1J8P2
$$ 552 533 498 483 500 514 493 455 435 433 423 407 412 436 458 479 526 589 614 573 511 486 490 476 444 441 483 526 525 494 471 467 470 479 493 488 448 407 425 497
1306D97N0k2m2OL8%m6k2L8N2Rk4k3k1k7j2J8J4k3l6PM2K3j4j8kkrQJ7ol0%N8O6J7k4j1K8O0
$$ 497 547 525 483 489 527 527 481 459 497 549 558 534 511 490 463 451 469 483 460 424 431 473 496 482 464 462 460 451 459 476 470 440 440 498 564 581 557 546 574 634
1301F34P5O9L2rj6%j3o0q0m8oRJ4K8J4l4o9n1j4j1j9OM8M7Nj9%K4J2j9l5l1j7KJ4Mj4j0J2
$$ 634 709 778 810 801 785 785 772 712 632 584 578 587 601 629 643 609 540 489 475 464 445 451 499 546 551 532 532 556 568 549 514 483 466 468 482 486 472 462 474
1297D74Ql6o8l2N4J07P8Pm3m9l9k7oK8M9M0J8QJ7L9O2P7N6mm9l6QJ2l4o4l9mlj4JK5Ln3q0
$$ 474 482 446 378 346 400 507 585 592 549 500 461 434 428 456 505 545 563 571 588 627 689 766 822 818 769 733 741 753 719 655 616 612 609 595 596 621 624 571 491
1292D91m3K4O8O2J2m4n7j9K5K5mj5oj4l5l3jK0J6J3K3K0qj8PL0J2j6pK3K1j4l0qRql1j2L7
$$ 491 448 472 540 602 614 570 513 494 519 544 540 525 519 505 470 437 436 456 472 485 508 528 520 502 509 539 551 535 528 551 572 558 528 520 529 521 490 478 515
1287E15O2L2k1m3k6kJroOQpj9j7oQJ6J1j2l4l0jK0J7OMJ0J3Oqk5k7jL5L4j1n7o0k1K8N6M8
$$ 515 577 609 588 545 519 517 518 509 503 509 517 510 491 474 468 476 492 503 491 457 427 426 446 463 469 473 483 496 502 494 469 442 441 476 510 499 442 382 361 389 445 493
1282D93Jm5m8j1J8J7J6L4M0Nl4l5j1mrKK3L0J9Qj4n4o5j0N9O0Oj5J3K1j7l7KL5Kn3n1j1Nn
$$ 493 494 449 401 390 408 425 441 475 515 520 486 451 440 436 427 429 452 482 501 509 495 441 376 366 425 485 491 476 489 510 493 456 458 493 495 442 391 380 385 380
1277C80JK4J7k2m2k5OK3K9K3%j5OM0M5K1Lkk8o6o1JN3M9L1M8O8K7n5j00p1j4J8J4rk7l0j0
$$ 380 381 405 422 400 358 333 339 362 391 414 414 399 405 445 490 511 514 512 484 418 357 358 411 460 491 539 607 634 579 479 408 394 412 426 417 390 360 350
1272C50J0RnjJ4J3mkK0K9Qj1%K2K0mk4l3k9j3MLj1NN7Q5M3l4o9n0k0%K9N5M2OKL3M1km2l3
$$ 350 360 369 364 363 377 390 386 384 404 433 441 430 430 452 472 468 444 411 382 369 373 376 365 370 427 512 555 521 452 402 382 382 411 466 508 514 516 549 590 588 546 513
1267E13jQQK7M2J6l7p2p0n0k4MJ3kj0J3L7K6mnJ0Nj1JL1L1Jj1jj3m6l9K0N8L2j7l4l4m3m1
$$ 513 512 520 528 555 597 613 576 504 434 384 360 364 377 375 365 378 415 441 437 432 442 447 436 437 468 499 500 489 488 475 429 390 410 468 500 483 449 415 372 331
1262C31JN0N6K4pk1k5j3J4K6Lk8l9l2k0J0N1N6Ql7k5J3Nk9k0K6M0%k9KN5P0L9Lk0k7k4k1k7
$$ 331 332 382 438 462 455 434 409 396 410 436 439 411 372 340 320 330 381 437 445 408 383 396 401 372 352 378 418 418 389 391 446 516 555 558 538 511 487 466 439
1258D39k6j0Jj4l0kM9N9J9j0LJ2j7m7l1J3L3J9Ljmqrj2j6pJ4K3J0RK8L5Ml3l3q%j2j5qj2j8
$$ 439 413 403 404 390 360 358 407 466 485 475 478 490 473 426 395 408 441 460 463 462 458 450 441 429 413 406 420 443 453 462 490 525 529 496 463 455 455 443 428 420 408 390
1253C90%L2L8J5JPml6m7pM3N4L1J3J0PLQJ3qm7o7m5rJ2J5K4M1M0Mm5p2o2l2OL9M8K1j1j0K5
$$ 390 390 422 460 475 476 483 479 443 396 389 432 486 517 530 540 547 550 558 571 563 516 449 404 395 407 422 446 487 527 531 486 414 352 320 326 365 413 434 423 413 438
1247D38M5K6%MJ0rl1qM2M9Ml4j8J5J1k5m1j9J0J9QlQL0L8J4k1k7lK0J3lnJrl2m2k5J1M5N3
$$ 438 483 509 509 513 523 514 483 475 517 566 570 536 518 533 544 519 478 459 469 488 496 493 501 531 569 583 562 535 532 552 565 562 557 558 549 517 475 450 461 506 559
1242E59K3k3m2j6K1L5K0Lmpj6l5n7o5m1KK4J3m%J0PLJ6K5Jl2k4J5K7lk0J0M1K9j3l4j7OJ6
$$ 559 582 559 517 501 522 557 577 580 576 569 553 518 461 396 355 357 381 394 390 390 400 407 410 426 451 452 420 396 411 438 435 415 425 466 495 482 448 431 437 453
1238D53Mk4m4l1QK4ql8k0K3K5j3l6j1K2K7RmjQK2L4L3J9J1J9K6J2j3k7k8k1j5j5j0LK0K2n
$$ 453 457 433 389 358 366 390 382 344 324 347 372 359 323 312 334 361 370 366 365 373 395 429 462 481 492 511 537 549 536 509 481 460 445 430 420 423 443 465 460
1233D60l8m2j2J1PpKK6L4J3j3k4j6oj4l0k0L0P5O1Ll2j4J2J0LJ8L0Rj6KL6K6k3n0k7PJ8J6
$$ 460 422 380 368 379 386 379 381 407 441 454 441 417 401 395 381 351 331 361 436 497 500 468 454 466 476 479 497 527 536 520 522 558 584 561 511 484 491 509 525
1228E25Pj4l2j9J2J4j5k7j0%j7j9J9M8J9k6k5J4L1Ll6n1m0qL0M3K3nj1NK3L0K9J0j8l0j1R
$$ 525 532 518 486 467 479 493 478 451 441 441 424 405 424 472 491 465 440 454 485 488 452 401 361 353 383 426 449 444 433 438 461 491 520 530 512 482 471 480
1223D80RLJ6K9J9LMjk7m6j6K1Lm6n0%K3j0l5%N1N4J0l6n5l8PM3K5l0n0j6J6J5J8M6M7rn9l8
$$ 480 489 492 508 537 556 559 563 562 535 489 473 494 497 451 401 401 424 414 379 379 430 484 494 458 403 365 372 415 440 410 360 344 360 375 393 439 486 477 418 380
1219C80K0L8J6OJ0ok8j4K1L3J7J2J2j4n1m1J2L7J0j6j4j2k8k2K4N3K4k0j8QLk8l3%K6J6pm
$$ 380 400 438 454 460 470 464 436 422 443 476 493 505 517 503 452 411 423 460 470 454 440 428 400 378 402 455 479 459 441 449 452 424 391 391 417 433 426 422
1214D22K1M0K3j8n0l6RL6K0j2j7NK7K8J1j2k2j2Pml5l8ML8J2m4n3mL7K5j1j6J3L3K5JrlLr
$$ 422 443 483 506 488 438 402 411 447 467 455 438 443 470 498 509 497 475 463 470 466 431 393 397 435 447 403 350 346 383 408 397 381 394 427 452 453 444 441 444 435
1209D35k4k4q%j2k1JL2M3L0K4K1kl6m3j4Kj7l0PN8N6Pj9J1N1M9J6qj8l0l9k4KNj7k3OL2J1
$$ 435 411 387 379 379 367 346 347 379 422 452 476 497 495 459 416 402 404 387 357 364 422 478 485 466 477 528 577 593 585 567 537 498 474 476 481 464 441 447 479 490
1204D90l0l6kK4Rk3k3QL6M1L1J8rm8p1m7J1N1M1NrJ0K7J5j1k1j4j1j0ojj1k5k2JK6M1M2K1
$$ 490 460 424 422 446 455 432 409 417 453 494 525 543 534 486 415 368 379 430 471 476 467 477 504 519 508 487 473 462 452 446 445 434 409 387 388 414 455 497 518
1199E18k2n2k9K5M6Pm1l9NM0L9J4j4k8j9oj6m6n0mN2O8M2J5ll2n6m5mK4K0J3J8J7ql5m9m7
$$ 518 496 444 415 440 486 493 452 413 418 458 497 511 497 469 450 444 428 382 332 328 380 448 490 505 502 470 414 369 365 389 409 422 440 457 449 414 365 318
1195C18l5j1J4K1J1J5L3K7rk6RN7N0j0o3o8l3J3M0L1j0m1j8L4M6Kl7j5M2O0K7j3j0J8L7L3
$$ 318 283 272 286 307 318 333 366 393 384 358 367 424 474 464 401 333 300 313 353 384 374 333 315 349 395 397 360 345 387 447 474 461 451 469 506 539
1190E39K3Qj1k2j0J1Ml0m8k2J8J7k6o2n4qL9N7L4j7m6k3K0K3j3k8LL4K2poJ6J6j3k8rJ8K2
$$ 539 562 570 559 537 527 538 542 512 464 442 460 477 451 389 335 327 366 423 457 440 394 371 391 414 401 373 376 410 432 425 419 435 451 438 410 401 419 441
1186D41J5Qkk2m4n0l3NM7O6M4ol9l0NK4J3pqRJ8J0KJ4K9J4l1n8l5J9N5M5Nl2l8rJ9J1k6l5
$$ 441 456 464 462 440 396 346 313 318 365 431 475 469 430 400 405 429 442 435 427 436 454 464 466 480 509 523 492 434 399 418 473 518 523 491 453 444 463 474 448 413
1181D13OM6L0k3m1j3J6J2%KNj0k7j8NJ7QkOK1J9nl1k8JK5K0%j7k2j5MK6J6j8k9PL0pn9l9L5
$$ 413 419 465 495 472 431 418 434 446 446 448 453 443 416 398 403 420 428 426 432 453 472 467 436 408 409 434 454 454 437 415 400 404 430 446 428 399 406 436 429 370 331 366
1176C66N8%m8j8L1K6rqJ1lm0l7LK6PmK2N7O3M6J9j0l1k4kom4o6k5N5R5O0ll5k5j8m3o8n5r
$$ 366 424 424 376 358 389 415 406 398 409 406 366 329 332 358 365 361 383 440 503 549 568 558 527 503 501 495 451 385 360 415 510 570 567 532 507 489 446 378 323 314
1171C14L1M6M6L3%l4k3L2O5L1l0o1n6m2k5jPqj2K1M4On0l7L3O0Pm2k6J7K8K0K9M6M0J7pl1
$$ 314 345 391 437 470 470 436 413 445 510 541 511 450 394 352 327 326 333 325 313 334 378 384 334 297 330 390 397 355 329 346 374 394 423 469 509 526 519 488
1166D88n1l7J5M8K0k7l0JJ3rk7j7KK0L4L7J9moMqm4o1l8J0M5N1L2MjK0L5Rl4m4j7RKk2l1j6
$$ 488 437 400 415 463 483 456 426 427 440 431 404 387 389 409 443 480 499 495 489 493 485 441 380 342 352 397 448 480 484 483 503 538 547 513 469 452 461 463 441 410 394
1161C94J2K6J4j7l5k4onqPK7K0noK1M0K5nk7l8m1l3j3RK7L7K7pk9j5J8K0%ML3M1J2rOJ5j2
$$ 394 406 432 446 429 394 370 364 359 351 358 385 405 400 394 415 455 480 475 448 410 369 336 323 332 359 396 423 416 387 372 390 410 410 414 447 488 500 491 497 512 500
1156E00m1k7NJ5PRJ0j6m4l2J6M5L4Mj6k1qJ8L2J3j9l3k3j2pKJ1MrkJ1ll9n3k0L4O2N4J7k2
$$ 500 459 432 437 452 459 468 478 462 418 386 402 447 481 485 469 448 440 458 490 503 484 451 428 416 409 411 422 426 417 415 426 423 384 331 311 345 407 461 478 456
1151D56l5pL1K7j4m1k9lNOJ5Qk4n0k5K7N0K5jJJ4Rj1j4J1L6K5j6m6l8KL2L0Nk5l6j0M1O7L5
$$ 456 421 414 445 472 458 417 388 385 390 396 411 419 395 345 320 347 397 422 421 422 436 445 434 420 431 467 492 476 430 392 394 426 456 461 436 400 390 431 498 533
1146E33j8k7J2L2Ll0j5K2L4K2J5Ol5q3p0LN8M3ok1qj0k8j8K6N1J4m6n3KN6M6ol8j6K1K4Jj0
$$ 533 515 488 500 532 535 505 490 512 546 568 583 589 554 471 401 404 462 505 499 478 470 460 432 414 440 491 505 459 406 408 464 510 504 466 450 471 495 496 486
1141D86J0L1K2qk9k6j4j8k8j9J8M7K9j4k4J6N5L6j4k6J0L6J6j0MM1M6J6mQJ1l2r4j10o4%K4
$$ 486 496 527 549 541 512 486 472 454 426 407 425 472 501 487 463 479 534 570 556 530 540 576 592 582 586 627 673 689 685 693 704 672 578 468 404 404 428
1137D28J6OQ%j5k1qMJNK6L6K0%J3M4M0qn6o6m4j6OJ3Lj0JK3K1qk7j9nkJ0M2N0Mn0m7J0N3M9
$$ 428 444 450 458 458 443 422 414 418 419 424 450 486 506 506 519 563 603 595 539 473 429 413 419 432 435 425 426 449 470 462 435 416 411 409 419 461 511 515 465 418 428 481 530
1132E30K7J7Rj0k1qJ3J5pl1m1k7jJ2PMJ8J9j2n1m9j3J1J3K8N2L3l0o4k6K2J0l0k8OJ3JK8Q3
$$ 530 557 574 583 573 552 544 557 572 565 534 493 466 465 477 484 488 506 525 513 462 413 400 411 424 452 504 537 507 443 417 439 449 419 391 397 410 411 439 522
1127E22P3k3r9o7J6L5k0o0l8LJ0jPL5N4M7K1pk3j6JJ1QNJ0J1pl3l8j6J0J4nj9j0J5K9J4j4
$$ 522 595 572 473 406 422 457 437 377 339 342 352 351 358 393 447 494 515 508 485 469 470 481 489 494 504 515 508 475 437 421 431 445 440 421 411 426 455 469 455
1122D55k9j9kRJ7L0L6J4l6o8n0j1Lj9l3rK9M6L2J2KjjKLPJ3J6Lk5m3l1rMRK3L3K0JLK4K6k
$$ 455 426 407 405 414 431 461 497 511 475 407 357 346 349 330 297 288 317 363 395 407 409 408 407 409 412 419 432 448 451 426 383 352 343 347 356 379 412 432 433 436 460 486 484
1117D84l0l7k8j3J0K6Rk3j2M0O0No3o5pL4L4K4K8K4kk7l4k9j9%J7J6%rmLJ6M1N7L8ol6l7l1
$$ 484 454 417 389 376 386 412 421 398 386 426 486 491 428 363 356 390 424 448 476 500 498 471 437 408 389 389 406 422 422 413 409 412 428 469 526 564 558 522 485 454
1112D54k5jL5M3J9QJ9Lo1j07p3LL9K9K4L5K1j5k8j2lj0MM3N0Ol0j3J8Rk3k1J0K2Lj1prk6l0
$$ 454 429 428 463 506 525 533 552 555 494 387 314 317 356 385 409 444 465 450 422 410 407 397 401 444 494 500 470 457 475 484 461 440 450 472 475 464 457 448 422 392
1107C92rJ7K4K5K7K2Oqj4k3l4k8oNKJ2M7N9J0o2q6m6J0M1N6O5N1Nm2n4l8k2j1OJ8Qj7k4NM4
$$ 392 383 400 424 449 476 498 504 496 482 459 425 397 391 396 398 410 457 516 526 464 378 332 342 383 439 504 555 560 518 464 426 404 393 399 417 425 408 384 389 433
1102D33N9L1j5m1k7PK6J3j2j6LK0J3j1l1k4%Oj9l2lM3L4k6o6m1moj6J7N8M3j0j4L8N7Rl6k1
$$ 433 492 523 508 467 440 447 473 486 474 458 461 481 494 483 452 428 428 434 415 383 380 423 457 431 365 324 320 314 298 315 373 416 406 392 430 487 496 460 439
1097D39Ook3kK1lm2k7K1K7m%M5M4k7p3l1L7M1rl3j1%j5k1KJ3j1k8jM5N0Pk5oL8M9J2k7k3J5
$$ 439 445 439 416 414 435 432 390 363 384 411 407 407 452 496 469 396 365 402 443 434 401 390 390 375 354 356 369 358 330 329 374 424 431 406 400 438 487 499 472 449 464
1092D64M4L4Oj2j5k1l5m7l3mJ2Plkjqj1J0L6K4j9m1j8J0Nj0RM1L5rl4j3J5J6MNJ2Kk2m0l6
$$ 464 508 542 548 536 521 500 465 418 385 381 393 400 397 395 394 386 375 385 421 445 426 385 367 377 382 372 381 422 457 448 414 401 416 432 436 441 453 455 433 393 357
1087C57j5J5L9M3K8J3Onk8m8n4m3k1OK5J7oj3J0L2L3K6K8K8J0j1j6j1j2j6nJ0J1Kl%pk7m6
$$ 357 342 357 396 439 467 480 486 481 453 405 351 308 287 293 318 335 329 316 326 358 391 417 445 473 483 472 456 445 433 417 412 422 433 435 432 432 425 398 352
1083C52n0m6l2jL9O1M1RML2M7J9k3k9mOj5k3KJ5j3l2J4P9O9j9q4o4pK4L7O0N5ko2o0rJ4lp
$$ 352 302 256 224 223 262 323 364 373 377 409 456 475 452 423 419 425 410 387 389 404 391 359 373 452 521 502 418 354 347 371 408 468 523 521 459 399 390 404 401 394
1078C94K5N1L6ol9m5k3J2L2K0qk2j7rm%lk6n0m2JM7P2O5L4rl2k6j5j7j2J3K9Qk2j2J8J7jJ2
$$ 394 419 470 506 500 461 416 393 405 437 457 449 427 410 401 397 397 394 368 318 276 277 324 396 461 495 486 454 428 413 396 384 397 426 434 412 400 418 435 434 446
1073D46N3N6Ol8l8k5k6k1MJ4qk7rJ0Mj5j8k2l5k9RL6J1l2l3NL4M6O1P0M7om8n3l2KL3L6jm1
$$ 446 499 555 561 523 485 460 434 413 417 431 423 396 387 397 401 386 368 346 311 282 291 327 338 306 273 278 312 358 419 489 536 530 482 429 397 399 432 468 467 426
1068D26m1JL3L2J7J7K4J6j6m9n4k0K5L6Ok5l5k9j9kK4L8K9J0MKRK9N3M3Jk3nJ3rm3l7qMkn
$$ 426 385 386 419 451 468 485 509 525 509 460 406 386 411 447 453 428 393 364 345 343 367 405 434 444 448 450 459 488 541 584 585 562 557 570 561 518 481 473 477 475 470
1063D70rk6l1kK7Rk2j0L1L1j4m0k2qk2k7jK9L6L6M1L4J7J5K5Pl8n5k7lj8l7k3lj1k6j0K6N0
$$ 470 461 435 404 402 429 438 416 406 437 468 454 414 392 384 362 335 334 363 399 435 476 510 527 542 567 574 536 481 454 451 433 396 373 370 359 333 323 349 399
1058C99N2M2J7j5k6kJ4j2m5k4K8M1on4n1rK4K7J5J3J4%k2j9J6L8J2k8j2M2M9lm1j3K7J9j5
$$ 399 451 493 510 495 469 467 481 469 424 400 428 469 463 409 358 349 373 400 415 428 442 442 420 401 417 455 467 439 427 469 518 515 474 461 488 507 492
1054D92k8l2n3o2k7K3L7K6L0L3Kl5j9K7L0rk2J3K8pm5l8j0KMJ7K7K1J1J4J9J3%j3j8qJ8K2
$$ 492 464 432 379 317 290 313 350 376 406 439 441 406 387 414 444 435 413 426 454 447 402 364 354 356 360 377 404 425 436 450 469 482 482 469 451 443 461 483
1049D83k4p5n9J8P0N0J3QJ0j6l7pL7L5Kj0Jj4n1n9j4K8K0j3j8PK7J8rk7k8j7jJ6L0L4J6j5
$$ 483 459 384 325 343 413 463 476 484 494 478 441 434 471 506 508 498 499 485 434 375 361 389 409 396 378 385 412 430 421 394 366 349 348 364 394 428 444 429
1044D29k3%J9Lk6k1K0M3K3j1qJ7K7Mk0k4j4j0j3j1QM2O9O3J8l7n5l3ojKJ9K8%m0l6J2L4po1
$$ 429 406 406 425 428 402 381 401 444 467 456 448 465 492 496 476 452 438 428 415 404 412 454 523 586 604 567 512 479 473 472 474 493 521 521 481 445 457 491 484 423
1040D23n4KM2L1pl5m4l0QM0L5RjJ6K2%j9j5kNJ9L8M0J2j3oJ4J1j1k5k2j6nJ6L0J6j3j3K3M9
$$ 423 369 371 413 444 437 402 358 328 336 376 411 420 419 435 457 457 438 423 421 426 445 483 523 535 522 516 530 541 530 505 483 467 462 478 508 524 511 498 521 570
1035E70L0j9n0m1pK1K3Mk1l6l9k3J2N3O3L6RK3N4M2k6q5p3pL1Rl0k7RJ7k3o1m5kJ1j2j5J8
$$ 570 600 581 531 490 483 504 527 531 510 474 435 412 424 477 540 576 585 608 662 704 678 593 520 513 544 553 523 496 505 522 499 438 393 391 402 390 375 393
1030C93M2K4kNK7J3k6m2j4J6K0J0PKj1j9j5qpmQK0L1M1M2K0j7l6k5j4k4k2K3Q3Q4K2m1n0k2
$$ 393 435 459 457 462 489 502 476 434 420 436 456 466 473 475 464 445 430 422 415 411 419 439 470 511 553 573 556 520 495 481 457 435 458 541 625 647 606 556 534
1025E34pppnj7k7j3J4J7j1l6l1j5j0j4j0OK3L9M1J5k1l3j7j5m3m8NO5N5lk0K2N3K9jMJ2j2
$$ 534 527 520 513 508 491 464 451 465 482 471 435 404 389 379 365 355 361 384 423 464 479 458 425 408 393 350 302 307 372 427 424 404 426 479 508 507 511 523 511
1020E11l4j7Qjj9mK2Ol1k1L4N5Rl3pN1N4j4p6o5KM8K4l4o3l5J5M9O0N3J9l6q3q9o1j7L0O1
$$ 511 477 460 468 467 448 444 466 472 441 420 454 509 518 485 478 529 583 569 493 428 430 478 502 468 405 370 385 434 494 547 566 530 447 358 297 280 310 371
1016C71M6Kj2K8O3L2l1n1k7rj0QL6K9j2l1j4j1l8m4lL1J5j4qJ1Mj0RL8L5OrponQJ3nj8LL5
$$ 371 417 419 407 435 498 530 499 448 421 412 402 410 446 475 463 432 418 407 369 325 322 353 368 354 346 357 361 351 360 398 433 439 430 423 417 412 420 433 428 410 413 448
1011D48K8qk5j5nlJ1K9K1nj2PJ6lk1j5LJ7K5K5Kk8l8j6OJ0Jnj0j4oRPj3k5mL9O6N9K9pl5m6
$$ 448 476 468 443 428 423 420 431 460 481 476 464 471 487 484 463 448 451 468 493 518 520 492 454 438 444 454 455 450 440 426 420 429 436 423 398 394 433 499 558 587 580 545 499
1005D99l8j4J2L0K1j2m0l6pJ5J2qk3k4j2RK7K9J4jkJ4K5J1k5m5j6L1L5j5n0j8M2N9J9k6m4
$$ 499 461 447 459 489 510 498 458 422 415 430 442 434 411 387 375 384 411 440 454 453 451 465 490 501 476 431 415 446 481 466 416 398 440 499 518 492 448
1001D48l6oL5N8L2j4l5k3j6k1j6kqk7k6jOkJ6O1O9Pn7n1JL0K6K3K1jk8k2QJ9Mrrj2j9j8j0
$$ 448 412 406 441 499 531 517 482 459 443 422 406 404 396 369 343 342 348 346 362 423 492 499 442 391 392 422 448 471 492 491 463 441 449 468 472 463 454 442 423 405 395
996C95j2j2J3N0N2J0l7o1n9m0KM2M5J1j3MK4Qk9l6nL0L8K3Kj5k2j1LJ1J0PJj6l2l1j3K%mK
$$ 395 383 371 384 434 486 496 459 398 339 299 301 343 388 399 386 390 414 422 393 357 352 382 420 443 445 430 408 397 400 411 421 428 429 413 381 350 337 339 339 335 337
991C37J2J8J6J9K8L3K9J1j9m8m4LM8L6k4n8k6K6L2Nrjql0l5j7rj9mL2M1Rj1K2N4L4mJL4L2
$$ 337 349 367 383 402 430 463 492 503 484 436 392 395 443 479 455 397 371 397 429 434 425 424 416 386 351 334 325 306 302 334 375 384 373 395 449 483 479 480 514 546
986E46j0l8l5l4m5l9oJ6J2J6M2N4K7j1k1j1j2k2k4j3%J0J9K4K0Qoj3lK2L9K7LkLj4m5m5mK8
$$ 546 536 498 463 429 384 345 339 355 367 383 425 479 506 495 474 463 451 429 405 392 392 402 421 445 465 473 467 454 451 473 512 539 542 540 543 529 484 439 435 463
981D63K0j0k4l1l8k7J4N4N4K2jmJPOj2l2k0K4M9K3k2l7k8l1l4nL6L9lk5NM8M9Ol8m4j5K1K9
$$ 463 483 473 449 418 380 353 367 421 475 497 496 492 493 500 506 494 462 442 466 515 538 516 479 451 420 386 381 417 456 453 428 433 481 530 536 498 454 439 460 489
976D89Oj2kRnl3l9k7k4j7J3N1M6Nj5NJ5j9n5m0J4N8O3L8kk7j9%kk5k2J5L8J6j4j5j2k7l3P
$$ 489 495 483 481 490 485 452 413 386 362 345 358 409 455 460 445 450 465 446 391 351 365 423 486 524 522 495 476 476 474 449 427 442 480 496 482 467 455 428 395 402
971D02N7N5jm4m7k4ML0L7J3j4jL2L2rl3rK4K3mj6j2j3j8j2J0K4J0k5m3k0K5L7nn3m5JL3K3
$$ 402 459 514 513 469 422 398 402 432 469 482 468 467 499 531 522 489 480 504 527 523 507 495 482 464 452 462 486 496 471 428 408 433 470 465 412 367 368 401 424
967D24J3K3K9J1j2j8j0npj0j7j4QK9J6k6m3k1JkkK5N0M1J1rj8l0k3MJ7j5n1l9LJ3ojK8K7m
$$ 424 437 460 489 500 488 470 460 455 448 438 421 407 415 444 460 434 391 370 371 369 367 392 442 483 494 485 467 437 414 418 435 420 369 330 333 346 340 339 367 394 390
962C90j0K7M4Ql0j4K4J4m3p4m9NL5L3K2J5Nk3n3m3J7P6P0J5j9qml3m8pM7N0J8RK0Ok9k9J6
$$ 390 380 407 451 459 429 415 439 453 410 336 287 292 327 360 382 397 402 379 326 283 300 376 446 461 442 434 430 397 349 342 389 439 457 466 486 492 463 434 450
957D50M6J6l1l9j8rj7j1K2M5K9j1l4j5J3K2QQK6L2Jl5l8j5kpmJ7K8J0j2j8j2j1j8j6kK3M8
$$ 450 496 512 481 442 424 415 398 387 409 454 483 472 438 423 436 458 466 474 500 532 533 498 460 445 443 436 432 449 477 487 475 457 445 434 416 400 398 421 469
952D69N1J7l0l9PN3M0k4p0n8oL9N0L1om0n6n0k5QL5M7L9K1J2Nnj6j0J2K8J3k6n3m9k4JJ7K3
$$ 469 520 537 507 468 475 528 568 544 474 416 410 449 499 530 524 484 428 378 353 361 396 443 482 503 515 520 515 499 489 501 529 542 516 463 414 390 391 408 431
947D31J5kj2OL6L4qm6k5K6M3Jm2l1J9N0L0j0l6l7k8j0J0K6L0K0J4Oj3m3m9mN9O8Ko8o3QO0
$$ 431 446 444 432 438 474 508 500 454 429 455 498 499 457 426 445 495 525 515 479 442 414 404 414 440 470 490 504 510 497 454 405 401 460 528 530 462 399 407 467
942D67M2lj6LLk7m5j2L9N0J0k4j1J5Lm1n6j9J7J1mJ6N2N6K6NMN%%Jj9l6j3L1L3j0l4rJ3mk0
$$ 467 509 506 490 493 496 469 424 412 451 501 511 487 476 491 494 453 397 378 395 406 402 418 470 526 552 557 561 566 566 566 567 548 512 499 530 563 553 519 510 523 519 499
937D99KK9J6roOj4m7m4lL0L3K5J1moK3M1Rm8o6l9j4j3qJ3K9L2L8L9Om3m8KM3K6j4j6J8L7J9
$$ 499 501 530 546 537 531 537 523 476 432 429 459 492 517 528 524 518 541 582 591 543 477 438 424 411 403 416 445 477 515 554 560 517 469 471 514 540 526 510 528 565 584
932E84k0m8n3l9k1kL5Q2R5N0j4l2r%j5j0K0K3j6m7k5J4K4J2Jj9m4l5PK6j4n2l0K0K8LRL9L9
$$ 584 564 516 463 424 403 401 436 518 613 663 649 617 608 608 593 583 603 626 610 563 538 552 576 588 589 570 526 491 498 524 510 458 428 448 476 479 488 527 566
928E66jj8PL4K5Kk1m5o3m8jL4L0Jj5rJ2L7L7Ll3k0K3M1Rk8l1j1KPJ8K8K1Nrj9k7k6k1j6j7
$$ 566 565 547 554 588 613 615 594 549 486 438 437 471 501 502 487 478 490 527 564 567 534 514 537 578 587 559 528 517 519 526 544 572 593 598 589 570 543 517 496 480 463
923D63j9j2nLOKmMK0K1KjL9Q1O9J7k1k7l0k3J7O2N3ml0KL2Rk9l3j5rpOJ1j2l3l1l3n8o3j3
$$ 463 444 432 427 430 436 438 434 438 458 479 481 480 519 600 669 686 665 638 608 585 602 664 717 713 683 685 717 726 697 664 649 640 633 639 650 638 605 574 541 483 420 407
917D07M4M3jj7NK0J0MKrj7J3N1M0j4l4QN4M8Qk3l9m7l9pJ8J2j1k1j3KROmkK0L6J2k6k3K6M5
$$ 407 451 494 493 476 481 501 511 515 517 508 491 504 555 595 581 547 555 609 657 665 642 603 556 517 510 528 540 529 508 495 497 506 512 508 506 526 562 574 548 525 551 596
912E96%n5n0mJ8Nqlok1k4jK4K4Kk1k5rPRJJPPLJ0K6K3lj1J3K8lm1k7K0L7J3kJ0J7ol1l8m2
$$ 596 596 541 491 487 505 510 502 499 493 472 448 447 471 495 497 476 451 442 449 458 459 460 467 474 477 487 513 536 533 522 535 563 560 519 492 512 549 562 560 570 587 581 550 512 470
907D70m7j4N6J00O5j6n9m8l0k8k3lPj%L3O6N1nl9j6K6K7k3o1m6lJ5OJ5M3M8J2j3LJ5l1q7o7
$$ 470 423 409 465 565 630 614 555 507 477 449 426 423 430 429 429 462 528 579 574 535 519 545 572 549 488 442 439 454 460 475 518 566 578 565 568 583 552 465 398
902C98K0O6J5m9m3J4M1K5J1J8J5mj2MK1J5Lmlnmmj5k4pL1N4L9Pj4j4rlKKNJ9L3K7PJPj0n2
$$ 398 418 484 499 450 407 421 462 487 498 516 531 527 515 519 540 555 558 554 551 546 542 538 523 499 492 523 577 616 623 609 595 586 583 585 587 592 611 644 671 678 679 686 676 624
897F24o0qN2N0jl1j8NK1M4O8N8K2QL3N5L6QJ1L2L1Lk2k4j6oOK1L1L1K6K7M3P2R1P4K8j1k4
$$ 624 564 556 608 658 657 626 608 613 634 678 746 804 826 834 867 922 958 966 977 1009 1040 1043 1021 997 981 975 981 1002 1033 1064 1090 1117 1160 1232 1323 1397 1425 1414 1390
892A390k2k3k7l4m4n2l7QN2O7O3P0J00J39J55J15K0p5j14j06j02j20j23q8n3m2k9J2M0K6J6
$$ 1390 1368 1345 1318 1284 1240 1188 1151 1159 1211 1278 1341 1411 1511 1650 1805 1920 1940 1865 1751 1645 1543 1423 1300 1212 1159 1117 1088 1100 1140 1166 1182
888A182O2J25J22M7l3q1j20j47j21m8Nkl4m2k8j0J5M0M7L1K0J6j4o4p8l7lk4n8m6j0ql5l7
$$ 1182 1244 1369 1491 1538 1505 1424 1304 1157 1036 988 993 991 957 915 887 877 892 932 979 1010 1030 1046 1032 968 890 853 850 826 768 722 712 704 669 632
884F32j6qk3k3ljj7j9JQmJK7K4k3o3m2J0K6Kj5KL2L4Kl9n3k7J0J5j5l6j1L9N9L5kj0PJ3j9
$$ 632 616 608 585 562 559 558 541 522 523 531 527 528 555 579 556 493 451 461 487 489 474 476 508 542 544 505 452 425 435 450 435 399 388 427 486 521 519 509 516 529 510
879E10n9m8J7P0M8rj8K4M4Ol2j9Qpm1m2j8j7k3J2O9O9ko1m7QL4J5j3l0k7OM7N8K2k4l7j8K
$$ 510 451 403 420 490 538 529 511 535 579 585 553 534 542 535 494 452 434 417 394 406 475 544 542 481 434 442 476 491 478 448 421 427 474 532 554 530 493 475 477
874D77PPjj2j4MK8L3J7jpLK7M2J8k4l8rK2J7lmlj9k1J2L6Kn1l9L5P2K7l1l5j0j0k9k0J6N0
$$ 477 484 491 490 478 464 468 496 529 546 545 538 541 568 610 628 604 566 557 579 596 593 589 586 567 546 558 594 596 545 506 541 613 640 609 574 564 554 525 505 521 571
869E71N5L6%l1l5j1%k5n1l7KK5J7JpmLO%pOL5L7km1l7rJMK9N8M4rm9m5j7J5L9M5J8k0l2j5
$$ 571 626 662 662 631 596 585 585 560 509 472 474 499 516 517 510 506 509 515 515 508 514 549 586 584 543 506 497 498 502 531 589 633 624 575 530 513 528 567 612 630 610 578 563
864E63JlponPL2M7J8l1m2rJ8J7J6J3j9o3m8K9P8L4l3m0jLl2m7k3QL0M6M5Ol5k4K4M4Ql6m6
$$ 563 564 561 554 548 543 550 582 629 647 616 574 565 583 600 616 629 610 547 499 528 606 640 607 567 566 569 537 490 467 475 505 551 596 602 567 543 567 611 619 583 537
859E37l5k5j2PJ7OlkKNJ7L3K6nk1pJ5K4K8L6K4rk8j4Jj7m4l2J0L5L0K2J5nl0k5J3L9K6MNJ3
$$ 537 502 477 465 472 489 495 492 490 492 497 514 547 573 568 547 540 555 579 607 643 667 658 630 616 617 600 556 524 534 569 599 621 636 631 601 576 589 628 654 658 663 676
854F76jj7NM5M4j1n7m0QK1%oJ1J3rj5RK1Jj0K2N2K8k0k2J4K0j8l4KM1L3pk2lK9M3K4j9m8l0
$$ 676 675 658 663 708 752 741 684 644 652 673 673 667 678 691 682 667 676 697 698 688 710 762 790 770 748 762 782 764 730 732 773 806 799 777 774 803 846 870 851 803 773
849G73J1K3kj2J0K6Mk1j6KMKLj2m6m5J9Q1P0Pk1jJ7MqJLj9l2qL4N6M5J2j6k4pJ0J7K6M1M4
$$ 773 784 807 805 793 803 829 833 812 796 798 802 804 807 795 749 704 723 804 874 881 860 859 876 880 872 873 876 857 825 817 851 907 952 964 948 924 917 927 944 970 1011 1055
844A055K2%RL1L8M1N3N9L5K1N8J05Q7Qm6l6j1j6l2l1k5k4j1RJm0n7j8L8N4L5J6jj4kL6O4M9
$$ 1055 1077 1077 1086 1117 1155 1196 1249 1308 1343 1364 1422 1527 1614 1622 1576 1540 1529 1513 1481 1450 1425 1401 1390 1399 1400 1360 1303 1285 1323 1377 1412 1428 1427 1413 1411 1447 1511 1560
839A560K5K4L3J5pJ3P3J33J68J77J65J53J73K36K91L23L76M74N39M73L03J23k7j68k68k54
$$ 1560 1585 1609 1642 1657 1650 1663 1736 1869 2037 2214 2379 2532 2705 2941 3232 3555 3931 4405 4944 5417 5720 5843 5816 5648 5380 5126
836E126j35j3M9J00J90K82L36L94N12O59P43P10N99M90M54N47P98J214J750K319K843L348
$$ 5126 4991 4978 5027 5127 5317 5599 5935 6329 6841 7500 8243 8953 9552 10042 10496 11043 11841 13055 14805 17124 19967 23315
833B3315L927M627N429O441P928R820J1175J0548P253K248k490n436o301n610m011k070k49
$$ 23315 27242 31869 37298 43739 51667 61487 72662 83210 90463 92711 90221 84785 78484 72874 68863 66793 66544
831F6544J311K870M715O880R464J2847J6867J9751J8740J2541L005o066j1766j3565j2477
$$ 66544 67855 70725 75440 82320 91784 104631 121498 141249 159989 172530 175535 169469 157703 144138 131661
829A31661r739o417l370q41J679M718Q248J2254J7254K3109K7324K5882J6835K801j0750j9580
$$ 131661 121922 115505 112135 111294 112973 117691 125939 138193 155447 178556 205880 231762 248597 251398 240648 221068
827B21068k2844k2024j9015j5334j2020r313o686l637k48L343P474J2109J5560J5084R407
$$ 221068 198224 176200 157185 141851 129831 120518 113832 110195 109947 113290 120764 132873 148433 163517 172924
825A72924L56q398j4072j6124j5527j3538j1186r144p533n990m198k221j68K113M599O445
$$ 172924 173280 164882 150810 134686 119159 105621 94435 85291 77758 71768 67570 65349 65181 67294 71893 78338
823G8338O324L685n48m660p412q550q469p721o806o035n445m883m249l592k971k387j856j444
$$ 78338 84662 88347 87799 83139 75727 67177 58708 50987 44181 38146 32701 27818 23569 19977 17006 14619 12763 11319
821A1319j171r69p75o13n08m28l32k48k20k35k37k19k08k07j94j69j58j58j41j14j09j30j38
$$ 11319 10148 9179 8404 7791 7283 6855 6523 6275 6055 5820 5583 5364 5156 4949 4755 4586 4428 4270 4129 4015 3906 3776 3638
818C638j07o4m4n2o9r1j16j15p1j1Pl5p6o6k4j2l9n5m0k3l2m1k5j6m9r0o6J8Q7P7Pn8o8j9
$$ 3638 3531 3467 3423 3371 3302 3211 3095 2980 2909 2898 2905 2870 2794 2728 2704 2692 2653 2598 2558 2535 2503 2462 2437 2421 2372 2282 2216 2234 2321 2398 2405 2347 2279 2260
814B260L4K5n5j12p0K0M4j6n8l0Kk3o0m7lJ9J5K1J9k2o9o3j6Prk1rj0l6m9k3J3J6qk9l0j8
$$ 2260 2294 2319 2264 2152 2082 2102 2146 2130 2072 2042 2044 2021 1961 1914 1911 1930 1945 1966 1985 1963 1894 1831 1815 1822 1813 1792 1783 1773 1737 1688 1665 1678 1694 1686 1657 1627 1609
810A609LK7L7K3j0l6l4oK4K5ml8n0m1l1j4J2L5M0K8J5LlJ0L6L6om5l3J4L1J1olok7l4j1J7
$$ 1609 1612 1639 1676 1699 1689 1653 1619 1613 1637 1662 1658 1620 1570 1529 1498 1484 1496 1531 1571 1599 1614 1617 1614 1624 1660 1696 1690 1645 1612 1626 1657 1668 1662 1659 1653 1626 1592 1581 1598
805A598K7K6J9qm2l8ML1J2k0k0nj6l5k4J9M9M1J2oj2j1pMJ8J8nl6l2RM5L0j7l7j8qk6l6rK5
$$ 1598 1625 1651 1670 1662 1620 1582 1586 1617 1629 1609 1589 1584 1568 1533 1509 1528 1577 1618 1630 1624 1612 1601 1594 1598 1616 1634 1629 1593 1561 1570 1615 1645 1628 1591 1573 1565 1539 1503 1494 1519
800A519K4mk6k6j4OK0J4JOK9K5npL7O7L7jJ2N0L6k3n8m9l4l5k3%Qm%J3Jl7m6j5Nj5k9mL3L2
$$ 1519 1543 1539 1513 1487 1473 1479 1499 1513 1514 1520 1549 1574 1569 1562 1599 1666 1703 1702 1714 1764 1800 1777 1719 1670 1636 1601 1578 1578 1586 1582 1582 1595 1596 1559 1513 1498 1503 1488 1459 1455 1488 1520
795A520Pn%NJ1J6J0j5l0k0jJ0J5K1J3oj2%kj7j0K4K4k8o5k8L3L0k4l4J9M5mn7m0K4N8L9Pj3
$$ 1520 1527 1522 1522 1527 1538 1554 1564 1549 1519 1499 1498 1508 1523 1544 1557 1551 1539 1539 1537 1520 1510 1534 1558 1530 1465 1437 1470 1500 1476 1442 1461 1506 1502 1445 1405 1429 1487 1526 1533 1520
790A520k1j9lJ0j0n4p1l1L0N4K6qj8k0l8n4l8OL3K8K0K8L2J2j3j6LJ0nk5l2k7j6rnLJ2J2K
$$ 1520 1499 1480 1477 1487 1477 1423 1352 1321 1351 1405 1431 1423 1405 1385 1347 1293 1255 1261 1294 1322 1342 1370 1402 1414 1401 1385 1388 1398 1393 1368 1336 1309 1293 1284 1279 1282 1294 1306 1308
785A308LK5L9J8j1QN2M2l9q9l4O1P8Rm6l3MK0K2K2Lk7m0k8k0k2qL2M6J4j9mL5M2Nl8n4m4j6
$$ 1308 1311 1336 1375 1393 1382 1390 1442 1484 1445 1356 1322 1383 1461 1470 1424 1391 1395 1415 1437 1459 1462 1435 1395 1367 1347 1325 1317 1349 1395 1409 1390 1386 1421 1463 1468 1430 1376 1332 1316
780A316K0M1L1Jk0k2j8j8j7qPJ0j0m0l7JL6K9LkPnl5l5nJ3NRK9J9l1m9MO5N5OjL1L3j2m9m3
$$ 1316 1336 1377 1408 1409 1389 1367 1349 1331 1314 1306 1313 1323 1313 1273 1236 1237 1273 1302 1305 1303 1310 1305 1270 1235 1230 1243 1248 1257 1286 1305 1274 1225 1229 1294 1349 1355 1354 1385 1418 1406 1357 1314
775A314j9JK5M3L0nj2J5L3K0Lkrj3MK6J1l5m5PM5Pn5n8mK7RpK6P4P8K5m5q0o3j8J5J6PJpj4
$$ 1314 1295 1296 1321 1364 1394 1389 1377 1392 1425 1445 1448 1446 1437 1424 1428 1454 1465 1430 1385 1392 1437 1444 1389 1331 1327 1354 1363 1356 1382 1456 1534 1559 1514 1434 1371 1353 1368 1384 1391 1392 1385 1371
770A371nK4M1L0J0J8M4N0L2J6K0L4M5N7N9M5J6pk4l4m0l2j6mRL2N1M3K9M7J06J59J57J02L1
$$ 1371 1366 1390 1431 1461 1471 1489 1533 1583 1615 1631 1651 1685 1730 1787 1846 1891 1907 1900 1876 1842 1802 1770 1754 1750 1759 1791 1842 1885 1914 1961 2067 2226 2383 2485 2516
766B516l5r0j16j02n7k3j8k1%M3P2P0O5R4J48J69J23L2o0j33j78j70j13m9l2n0n9l7qJ4M4
$$ 2516 2481 2391 2275 2173 2116 2093 2075 2054 2054 2097 2169 2239 2304 2398 2546 2715 2838 2870 2810 2677 2499 2329 2216 2167 2135 2085 2026 1989 1981 1995 2039
762B039Q8J16J08P0J9l7q3r2p1n4o2p2n3k0KJ1K0L2L3K2Jk4m0l5k0k2m6o0m4k5l8n9m7oJ7
$$ 2039 2127 2243 2351 2421 2440 2403 2320 2228 2157 2103 2041 1969 1916 1896 1898 1909 1929 1961 1994 2016 2017 1993 1953 1918 1898 1876 1830 1770 1726 1701 1663 1604 1557 1551 1568
758A568Nk1l1k5nJ4J0j6l1JM9N6J6k0k0j4k6l1lL6M6J8j6l6l6k1KK5L7L8K1j0k7nL5L9j1n4
$$ 1568 1573 1552 1521 1496 1491 1505 1515 1499 1468 1469 1518 1574 1590 1570 1550 1536 1510 1479 1476 1512 1558 1576 1560 1524 1488 1467 1469 1494 1531 1569 1590 1580 1553 1548 1583 1622 1611 1557
753A557l4K9O1M2J1LKj1k1j0J3K1Nk3m3m9l8j0J9K8J0rkK0K3j0m5l8RM6M6K9K7K9J0k7m4l1
$$ 1557 1523 1552 1613 1655 1666 1669 1671 1660 1639 1629 1642 1663 1668 1645 1602 1553 1515 1505 1524 1552 1562 1553 1551 1571 1594 1584 1539 1501 1510 1556 1602 1631 1658 1687 1697 1670 1626 1595
749A595j3j5k6j9J0L2K5%j1%Oj4k9kM9N8Rl8l7j2kNL4N7L4rj7NQk2l6j5nk2l0LM3N0L4K5J8
$$ 1595 1582 1567 1541 1522 1532 1564 1589 1589 1578 1578 1584 1570 1541 1539 1588 1646 1655 1617 1580 1568 1566 1571 1605 1662 1696 1687 1670 1675 1683 1661 1625 1610 1605 1583 1553 1556 1599 1649 1683 1708 1726
744A726kj6JK3J3k3m2l0qOJ6K6K4J5Opk3k8rJ6J8Lj1j3pJ2L3L0qm4k5K8N2K6rj1LJ2J2QL%
$$ 1726 1724 1708 1709 1732 1745 1722 1680 1650 1642 1648 1664 1690 1714 1729 1735 1728 1705 1677 1668 1684 1702 1705 1694 1681 1674 1686 1719 1749 1741 1697 1672 1700 1752 1778 1769 1758 1761 1773 1785 1793 1796 1796
738A796RK2J2pnJ7J5k5n1k5K2L7K2J1Oj3k9j0K9L9Mk8k0J3L1K7J2pk7l1j0J5J5koJ4K7J2q
$$ 1796 1805 1827 1839 1832 1827 1844 1859 1834 1783 1758 1780 1817 1839 1850 1856 1843 1814 1804 1833 1872 1876 1848 1828 1841 1872 1899 1911 1904 1877 1846 1836 1851 1866 1864 1858 1872 1899 1911 1903
734A903JK2J2l2n7l8okpK1N7M9kk2J8N7L9j1l2k0j6k4j5J3K7J2qj1OK8M1L1ll2k3J3L6L1J6
$$ 1903 1904 1926 1938 1906 1849 1811 1805 1803 1796 1817 1874 1923 1921 1899 1917 1974 2013 2002 1970 1950 1934 1910 1895 1908 1935 1947 1939 1928 1934 1962 2003 2034 2031 1999 1976 1989 2025 2056 2072
729B072RLppkoj5rJ1J8kj1J4M4L9Nk6m1n1m6j6K1K8J3RK2K2jj8qOMMK2L6J0l0l5jK1RqkQK
$$ 2072 2081 2084 2077 2070 2068 2062 2047 2038 2049 2067 2065 2054 2068 2112 2151 2156 2130 2089 2038 1992 1976 1997 2025 2038 2047 2069 2091 2090 2072 2064 2070 2074 2078 2100 2136 2146 2116 2081 2080 2101 2110 2102 2100 2108 2110
723B110%K7N1L1k3n3m0j5kNJ3J1J4M3P2M6l3p5k6M8N3Kk5jJ4pl3k5KJ6J5NomJ8L9K4rk0pJ
$$ 2110 2110 2137 2188 2219 2196 2143 2103 2088 2086 2091 2104 2115 2129 2172 2244 2290 2257 2182 2156 2204 2257 2259 2234 2233 2247 2240 2207 2182 2184 2200 2215 2220 2214 2210 2228 2267 2291 2282 2262 2255 2256
718B256LK7N2K3m3n8J2O9L8k7k4L4O0J5m4o2l8J4O9P7J6l8oP0P2j6p4l1L5L4JJ4N2L0m0n9
$$ 2256 2259 2286 2338 2361 2318 2260 2272 2341 2379 2352 2328 2362 2422 2437 2393 2331 2293 2307 2376 2453 2469 2431 2425 2495 2567 2551 2477 2446 2481 2515 2516 2530 2582 2612 2572 2513
714B513KN5L1j5oL9N1J5j9k7l2l7k1J5K7nl3j8J4Rj3NN5P3L2qoNrj9J6O2N7J0j7j3j0j9kL1
$$ 2513 2515 2570 2601 2586 2580 2619 2670 2685 2666 2639 2607 2570 2549 2564 2591 2586 2553 2535 2549 2558 2545 2550 2605 2678 2710 2702 2696 2701 2692 2673 2689 2751 2808 2818 2801 2788 2778 2759 2757 2788
709B788K8k9q0p0k7NJ7L2M5M4L5L5K7NqNK1J2j0j1OJ5OKPPmj1nLkp%J7L5L6J3k0l1j3QJ2J5
$$ 2788 2816 2787 2707 2637 2610 2615 2632 2664 2709 2753 2788 2823 2850 2855 2847 2852 2873 2885 2875 2864 2870 2885 2891 2893 2900 2907 2903 2892 2887 2890 2888 2881 2881 2898 2933 2969 2982 2962 2931 2918 2926 2938 2953
704B953M0P0O5K2j5j9LJ3Mj4j6QL2K6j1l9k0K2M2K3kpKJ6K5K1j0m2l8KL2K0rj8mJ5K0J2ok6
$$ 2953 2993 3063 3128 3150 3135 3116 3119 3132 3136 3122 3106 3114 3146 3172 3161 3122 3102 3124 3166 3189 3187 3180 3182 3198 3223 3244 3234 3192 3154 3156 3188 3208 3199 3181 3177 3192 3212 3224 3218 3192
699C192l1j5OK4L1K4%j7rK3M4L9J7j3m9o2k3L4M1j5n5k5K2K0j4j6Pkk9qN2O6Mm5j5L9K7l3
$$ 3192 3161 3146 3152 3176 3207 3231 3231 3214 3205 3228 3272 3311 3328 3315 3266 3204 3181 3215 3256 3241 3186 3161 3183 3203 3189 3173 3180 3178 3149 3141 3193 3259 3263 3218 3203 3242 3269 3236
694C236n8k2K1L1K4J4rl3k5J2K8Nj9j3Klj0NJ6lk9j9J8L4K5L5P2P4J2n8o3j5J5%j5JK4J7j
$$ 3236 3178 3156 3177 3208 3232 3246 3237 3204 3179 3191 3219 3224 3205 3192 3194 3191 3181 3186 3202 3199 3170 3151 3169 3203 3228 3263 3335 3409 3421 3363 3300 3285 3300 3300 3285 3286 3310 3327 3326
689C326NL6M5J4k4k9jJ9J6KNJ7J9Pok0l4l4nL9N4K4j5j7J3L8L8K2Mj4k6l0k9k8j8%J6K3K9
$$ 3326 3331 3367 3412 3426 3402 3373 3372 3391 3407 3409 3414 3431 3450 3457 3451 3431 3397 3363 3358 3397 3451 3475 3460 3443 3456 3494 3532 3554 3558 3544 3518 3488 3459 3431 3413 3413 3429 3452 3481
685C481L6K1k2m9l1NOpJ9P0P2Jo5o0j5J1QQOprJ6L3Qk4j4J1pn5n7jL5J1k3j7nk7n3l5J3K8
$$ 3481 3517 3538 3516 3467 3436 3441 3447 3440 3459 3529 3601 3602 3537 3477 3462 3473 3481 3489 3495 3488 3479 3495 3528 3536 3512 3498 3509 3502 3447 3390 3389 3424 3435 3412 3395 3390 3363 3310 3275 3288 3316
680C316RJK3M2K9qm6p1o9l1K7O1M6J2lPJ4O%J3K1Jm3o6m4mJ3PJ0K8L3Rj7k2k3k5j0L6P0M6
$$ 3316 3325 3326 3349 3391 3420 3412 3366 3295 3226 3195 3222 3283 3329 3341 3338 3345 3359 3365 3365 3378 3399 3400 3357 3291 3247 3243 3256 3263 3273 3301 3334 3343 3326 3304 3281 3256 3246 3282 3352 3398
675C398j4m2j6J0Kj7j3OJ7J8K0J1k5o4n4NN7N4J5rmJlNK2J6k8n9k3N4Q7M0k3k4K9N9L4qk1
$$ 3398 3384 3342 3326 3336 3338 3321 3308 3314 3331 3349 3369 3380 3355 3291 3237 3242 3299 3353 3368 3359 3355 3356 3353 3358 3380 3396 3368 3309 3286 3340 3427 3467 3444 3420 3449 3508 3542 3534 3513
670C513j5j2j4oLkj1oJ5K3J4ok0j8ML1K8rl8j9K2J9k4l8KL1po7p9m9l4l7j2M3O2K1k0j1K3
$$ 3513 3498 3486 3472 3466 3469 3467 3456 3450 3465 3488 3502 3496 3476 3458 3462 3493 3521 3512 3474 3455 3477 3496 3472 3434 3436 3467 3460 3393 3314 3265 3231 3194 3182 3225 3287 3308 3288 3277 3300
665C300L0RnoqrKRnk3j3K0M4M0J8rk7k7rKj0j9LL8M3J6qj4k6m4m6k7oQK6M1K7lj2RK2RmKO
$$ 3300 3330 3339 3334 3328 3320 3311 3313 3322 3317 3294 3281 3301 3345 3385 3403 3394 3367 3340 3331 3333 3323 3304 3307 3345 3388 3404 3396 3382 3356 3312 3266 3239 3233 3241 3267 3308 3335 3332 3320 3329 3351 3360 3356 3358 3364
660C364j0rK2M7K7j0j0J8K8Mk2k5j2LJ4J5OQK1K1nk7k2pj6l2j8J4J4j8l3j1J2J9K8N3N4J0
$$ 3364 3354 3345 3367 3414 3441 3431 3421 3439 3467 3471 3449 3424 3412 3415 3429 3444 3450 3458 3479 3500 3495 3468 3446 3439 3423 3391 3373 3387 3401 3383 3350 3339 3351 3370 3398 3451 3505 3515
655C515l8l7NM1M7L5K0j0m5n4j5M0N5K3mJ8N5M2j3l8mK5nn0m0J4L7J4qqj8l8l5NL5L5K9L1
$$ 3515 3477 3440 3445 3486 3533 3568 3588 3578 3533 3479 3464 3504 3559 3582 3578 3596 3651 3693 3680 3642 3638 3663 3658 3608 3568 3582 3619 3633 3625 3617 3599 3561 3526 3531 3566 3601 3630 3661
650C661J8j7l2lL1L1J5Q%j7j5K1N0L5%j8k5l8l2J4O6P4M7L0J7k2p1p1k4J3Oj4j8qjLLnrNK4
$$ 3661 3679 3662 3630 3627 3658 3689 3704 3712 3712 3695 3680 3701 3751 3786 3786 3768 3743 3705 3673 3687 3753 3827 3874 3904 3921 3899 3828 3757 3733 3746 3752 3738 3720 3712 3711 3714 3717 3712 3703 3708 3732
645C732K3J0ONj4l4k0J7L5K7K7M1L5RJ0M5O1K0l5m3qK8M3L6J2j0lL2M9K2k3l6j4J2J6ol7m4
$$ 3732 3755 3765 3771 3776 3762 3728 3708 3725 3760 3787 3814 3855 3890 3899 3909 3954 4015 4035 4000 3957 3949 3977 4020 4056 4068 4058 4055 4087 4136 4158 4135 4099 4085 4097 4113 4107 4070 4026
641D026lN3N3qn1k3L2L0k8o7m4lQrk6k8k3k8m0l7qL1N1N1N5O3M2j7n8m1JJ2LRK9K5Mlkk5n1
$$ 4026 4023 4076 4129 4121 4070 4047 4079 4109 4081 4014 3970 3967 3975 3966 3940 3912 3889 3861 3821 3784 3776 3807 3858 3909 3964 4027 4069 4052 3994 3953 3954 3966 3969 3978 4007 4032 4036 4033 4031 4006 3955
636C955l0L6P5N3J9J4K3Pk2m3n3o3n2pM4O0L8Kk2k6mK9L7J5rplk4n0m4j9pj6rK3M9M0Rj6j9
$$ 3955 3925 3961 4036 4089 4108 4122 4145 4152 4130 4087 4034 3971 3919 3912 3956 4016 4054 4056 4034 4008 4004 4033 4070 4085 4076 4069 4066 4042 3992 3948 3929 3922 3906 3897 3920 3969 4009 4018 4002 3983
631C983%K5L2%m2m4MN8O9M2J4ONOJ4K3Kn6j07r4k7K0Nl1k5J6L8K9K7M8M4j3p1p0k0K0L0M7
$$ 3983 3983 4008 4040 4040 3998 3954 3958 4016 4085 4127 4141 4147 4152 4158 4172 4195 4197 4141 4034 3940 3913 3933 3938 3907 3882 3898 3936 3965 3992 4040 4084 4071 4000 3930 3910 3930 3960 4007
626D007P8Q2L5k8o2n8l3%L5N1L5Kj6oJ7L8N6O5M8Kl9l6ML4K3mj8j6k1l4l3j6j0k5l6k9j9p
$$ 4007 4085 4167 4202 4174 4112 4054 4021 4021 4056 4107 4142 4144 4128 4122 4139 4177 4233 4298 4346 4348 4309 4273 4277 4311 4334 4330 4312 4296 4275 4241 4208 4192 4182 4157 4121 4092 4073 4066
622D066J5L8K6k6o9o3k5KJ7L3L2qn0m1MK2PJ2N4Q0N2Lj7j2qpkpk2k6lK2L0L5N0M2nm3k5J3
$$ 4066 4081 4119 4145 4119 4050 3987 3962 3964 3981 4014 4046 4038 3988 3947 3951 3973 3980 3992 4046 4126 4178 4181 4164 4152 4144 4137 4135 4128 4106 4080 4077 4099 4129 4164 4214 4256 4251 4208 4183 4196
617D196Rk9m2k1j2l3l8kK4Ll2k2K9O2M0j5m4k7J2K2pl4j8J7K4KnJ8L6K0j2l0k8j2J4K9Qk0
$$ 4196 4205 4176 4134 4113 4101 4068 4030 4028 4052 4055 4023 4001 4030 4092 4132 4117 4073 4046 4058 4080 4073 4039 4021 4038 4062 4064 4059 4077 4113 4133 4121 4091 4063 4051 4065 4094 4102 4082
612D082j1L0M4Rj4J5M7K3k5k8MJ3j2k2nJj5j7MJ6OKJ1%k8k8J1K4l0q9o7J7O5M4NmLkj2qnp
$$ 4082 4071 4101 4145 4154 4140 4155 4202 4225 4200 4172 4176 4189 4177 4155 4150 4151 4136 4119 4123 4139 4145 4147 4158 4158 4130 4102 4113 4137 4107 4018 3951 3968 4033 4077 4082 4078 4081 4079 4067 4059 4054 4047
607D047qkjj0qJ5L8K8lk0j6j7m1o5n1kM2N1L8K7K0Kk5k9nJ3pm9o5m0%K2K6K4J7%j9j2K1N1
$$ 4047 4039 4037 4036 4026 4018 4033 4071 4099 4096 4076 4060 4043 4002 3937 3886 3884 3926 3977 4015 4042 4062 4064 4039 4010 4005 4018 4011 3962 3897 3857 3857 3879 3905 3929 3946 3946 3927 3915 3936 3987
602C987M2Lk4j2Pkk1oL9N3Kn3m3J9M7Nn0n0JM7N2J8k6n2m0%K7K2QJ0J6Pj1j2MJ4OnkRJ6Qj1
$$ 3987 4029 4032 4008 3996 4003 4001 3980 3974 4013 4066 4068 4015 3972 3991 4038 4043 3993 3943 3944 3991 4043 4061 4035 3983 3943 3943 3970 3992 4000 4010 4026 4033 4022 4010 4014 4028 4034 4029 4027 4036 4052 4060 4049
597D049k3nK6K5j9n4k6L6M8Pj7K4Q0P9K9qj2j7l3m1k9j3kQJ4RMJ2K2Qk3l8k1LK0K9K6pm9m7
$$ 4049 4026 4021 4047 4072 4053 3999 3973 4009 4057 4064 4047 4071 4151 4230 4259 4251 4239 4222 4189 4148 4119 4106 4104 4112 4126 4135 4139 4151 4173 4181 4158 4120 4099 4102 4122 4151 4177 4170 4121 4074
592D074J1O0M5jj5PK0J0J3L6L6ll6k8jll3m4j1L8O2N1K2KNJ2Lj4j5J0L4L7K4J7J5Mrj1mok1
$$ 4074 4085 4145 4190 4189 4174 4181 4201 4211 4224 4260 4296 4293 4257 4229 4228 4225 4192 4148 4137 4175 4237 4288 4310 4312 4317 4329 4332 4318 4303 4313 4347 4384 4408 4425 4440 4444 4435 4424 4420 4414 4393
587D393k9j3J4J8KNN3J03Q2j2q8p2JL1ll5j4J7J2j5j9LK2L1L0J0k0k5J7N7L8j8m3k5pkK4P2
$$ 4393 4364 4351 4365 4383 4385 4390 4443 4546 4628 4616 4528 4456 4457 4488 4485 4450 4436 4453 4465 4450 4431 4434 4456 4487 4517 4527 4507 4482 4499 4556 4594 4576 4533 4508 4501 4499 4523 4595
582D595R0N1LoOROJ1Ll3o4l9K5O3N2J5j6l1j6J9M4K1k4k5L6R7R2L3j5j6J3L0K5J7L4P5J10
$$ 4595 4685 4736 4739 4733 4739 4748 4754 4765 4768 4735 4671 4632 4657 4720 4772 4787 4771 4740 4724 4743 4787 4808 4784 4759 4795 4892 4984 5017 5002 4986 4999 5029 5054 5071 5105 5180 5290
578E290J14J10J29J71J93J79J65J95K65L40L98M37M29L32J46o3k11k73k83k70k43k06j70j46
$$ 5290 5404 5514 5643 5814 6007 6186 6351 6546 6811 7151 7549 7986 8415 8747 8893 8830 8619 8346 8063 7793 7550 7344 7174 7028
575G028j12n5PN1Q1J10J28J18Q8O6M3qp7j22j32j49j83j91j44q8p6r1q1n0l8m4l1nj6p3j16
$$ 7028 6916 6861 6868 6919 7000 7110 7238 7356 7444 7510 7553 7545 7468 7346 7214 7065 6882 6691 6547 6459 6383 6292 6211 6161 6123 6079 6048 6043 6027 5954 5838
571E838j05p4n5l7kJ7qm2l3RL0J0j7rK1M9O6P6Q5Q2P2O6Q3J22J61J88K05K27K55K79L03L37
$$ 5838 5733 5659 5604 5567 5565 5582 5574 5532 5499 5508 5538 5548 5531 5522 5543 5592 5658 5734 5819 5901 5973 6039 6122 6244 6405 6593 6798 7025 7280 7559 7862 8199
567H199L70L80L62L17K22N7j31k55k83k88l22l55l28k65k35k39k21j83j71j87j66r2m2o7j07
$$ 8199 8569 8949 9311 9628 9850 9907 9776 9521 9238 8950 8628 8273 7945 7680 7445 7206 6985 6802 6631 6444 6278 6186 6144 6077 5970
564E970q3j9Pj8k4J1L3Pl0l2j4j3k0mK4L3K4L2N9O3L3J2L4P9R8Q4P6Q7J07J29J63J97J97J54
$$ 5970 5887 5868 5875 5857 5833 5844 5877 5884 5854 5822 5808 5795 5775 5771 5795 5828 5852 5884 5943 6006 6039 6051 6085 6164 6262 6346 6422 6509 6616 6745 6908 7105 7302 7456
560G456J02R0J14J22P9jp1j15j51j88k09j92j52j25j23j19r3o1m2k9j2j8m9o7l0L3N0Rk4j1
$$ 7456 7558 7648 7762 7884 7963 7962 7891 7776 7625 7437 7228 7036 6884 6759 6636 6517 6424 6363 6321 6292 6280 6262 6213 6146 6116 6149 6199 6208 6184 6173
556F173J7J4npJ1J7Kj9k7j8QK6J2k2l0KL2K7J8M6Q5P8K7k0l8l7k1J8N4N0J9QK2K4JpK0M3L1
$$ 6173 6190 6204 6199 6192 6203 6220 6222 6203 6176 6158 6166 6192 6204 6182 6152 6154 6186 6213 6231 6277 6362 6440 6467 6447 6409 6372 6351 6369 6423 6473 6492 6500 6522 6546 6547 6540 6560 6603 6634
551F634J4K9P0R8J01J00J17J48J78J63R0on8n4m6o9r8j02q6o8m7k4j5k2pM4P7M8j2l1qNor
$$ 6634 6648 6677 6747 6845 6946 7046 7163 7311 7489 7652 7742 7736 7678 7624 7578 7509 7411 7309 7223 7155 7108 7084 7069 7047 7040 7084 7161 7209 7197 7166 7158 7163 7157 7148
547G148J0K6K3K3K7J8KJ7O3R1O4K1J0K0J5j0j8LK7L5M0N5P3P4N5L8M9P6R2P8M5K2J3P%PL6
$$ 7148 7158 7184 7207 7230 7257 7275 7277 7294 7357 7448 7512 7533 7543 7563 7578 7568 7550 7553 7580 7615 7655 7710 7783 7857 7912 7950 7999 8075 8167 8245 8290 8312 8325 8332 8332 8339 8375
543H375O7P5N8L0J3J4K6K9K4K6M7O7P6Q6J10J22R2L4J1M4Q2P4M3L4N2O4O2N9N5K7jJ6Q1J23
$$ 8375 8442 8517 8575 8605 8618 8632 8658 8687 8711 8737 8784 8851 8927 9013 9123 9245 9337 9371 9382 9426 9508 9582 9625 9659 9711 9775 9837 9896 9951 9978 9977 9993 10074 10197
539A0197R7M8L8O3O9M5L7N9P2N4L4M2N3M1K5M0P2Q1P1P5Q5P3M4M3N9N3K2K1N8P8O3O6J10J36
$$ 10197 10294 10342 10380 10443 10512 10557 10594 10653 10725 10779 10813 10855 10908 10949 10974 11014 11086 11167 11238 11313 11398 11471 11515 11558 11617 11670 11692 11713 11771 11849 11912 11978 12088 12224
534A2224J00N7P2J05R0M7M4O9O9N9J00J63J54Q0N5J17J65J29Q3J05J45J27Q2R1J42J59J34
$$ 12224 12324 12381 12453 12558 12648 12695 12739 12808 12877 12936 13036 13199 13353 13433 13488 13605 13770 13899 13982 14087 14232 14359 14441 14532 14674 14833 14967
531A4967J25J42J37J07R7J23J40J33J32J56J87K09K25K19J75J33J58K33K81K58K20K27K59
$$ 14967 15092 15234 15371 15478 15575 15698 15838 15971 16103 16259 16446 16655 16880 17099 17274 17407 17565 17798 18079 18337 18557 18784 19043
528A9043K82K93L16L37L39L31L31L33L23L17L42L91M35M60M70M74M81N09N53N97O28O56O96
$$ 19043 19325 19618 19934 20271 20610 20941 21272 21605 21928 22245 22587 22978 23413 23873 24343 24817 25298 25807 26360 26957 27585 28241 28937
526B8937P46P99Q31Q05P12O13N88O36O81O77O71P04P33P08O58O42O40N74M33K76J47L4q5k06
$$ 28937 29683 30482 31313 32118 32830 33443 34031 34667 35348 36025 36696 37400 38133 38841 39499 40141 40781 41355 41788 42064 42211 42245 42160 41954
523D1954l37m76n93o47o64p14q15r03r30r12q90q66q34q14q03p69p03o50o40o30n76n08m85
$$ 41954 41617 41141 40548 39901 39237 38523 37708 36805 35875 34963 34073 33207 32373 31559 30756 29987 29284 28634 27994 27364 26788 26280 25795
520B5795m95m82m39m10m05l80l09k36k06k08k05j85j60j36j12r0p2m8j9lj3l2l3lL9P0P2N1
$$ 25795 25300 24818 24379 23969 23564 23184 22875 22639 22433 22225 22020 21835 21675 21539 21427 21337 21265 21217 21198 21195 21182 21150 21117 21114 21153 21223 21295 21346
516B1346L6N7J11J66K06K39K88L52M09M51M89N46O34P46Q63R83J114J271J448J631J834K091
$$ 21346 21382 21439 21550 21716 21922 22161 22449 22801 23210 23661 24150 24696 25330 26076 26939 27922 29036 30307 31755 33386 35220 37311
514C7311K427K839L322L884M544N334O303P505Q975J0722J2737J4988J7411J9963K2659K5550
$$ 37311 39738 42577 45899 49783 54327 59661 65964 73469 82444 93166 105903 120891 138302 158265 180924 206474
512B06474K8663L1885L4781L6338L4997K9337J9161O061p236j8276k5847k9998l1453l1084
$$ 206474 235137 267022 301803 338141 373138 402475 421636 427697 420461 402185 376338 346340 314887 283803
510B83803k9643k7622k5242k2608j9868j7199j4707j2409j0318q494o965n692m603l673k906
$$ 283803 254160 226538 201296 178688 158820 141621 126914 114505 104187 95693 88728 83036 78433 74760 71854
508G1854k285j756j264p91l56L4M14Q23J268J732K221K770L384M057M817N736O859Q192R773
$$ 71854 69569 67813 66549 65758 65402 65436 65850 66673 67941 69673 71894 74664 78048 82105 86922 92658 99517 107709 117482
506A17482J1693J4054J6952K0492K4695K9370L4224L9180M4464N0301N6718O3616P0496P5433
$$ 117482 129175 143229 160181 180673 205368 234738 268962 308142 352606 402907 459625 523241 593737 669170
504F69170P4590O3893M2268J3379j6109m0262n6349o4684o7112o5748o2326n7893n2836m7293
$$ 669170 743760 807653 849921 863300 847191 806929 750580 685896 618784 553036 490710 432817 379981 332688
502C32688m1538l5925l0680k5869k1571j7890j4834j2318j0248q573p229o124n192m402l716
$$ 332688 291150 255225 224545 198676 177105 159215 144381 132063 121815 113242 106013 99889 94697 90295 86579
501H6579l092k522k026j588j154o84k00K66P13J185J720K326K974L664M470N479O715Q156
$$ 86579 83487 80965 78939 77351 76197 75513 75313 75579 76292 77477 79197 81523 84497 88161 92631 98110 104825 112981
498A12981R823J1778J3976J6268J8567K0967K3594K6423K9309L1976L3695L3018K8310J8997
$$ 112981 122804 134582 148558 164826 183393 204360 227954 254377 283686 315662 349357 382375 410685 429682
497D29682O369o934j8329k6385l0952l2668l2421l1011k8969k6571k3949k1214j8493j5903
$$ 429682 436051 429117 410788 384403 353451 320783 288362 257351 228382 201811 177862 156648 138155 122252
495A22252j3524j1408r576q034o772n759m934m244l679l227k859k533k245k008j799j575j345
$$ 122252 108728 97320 87744 79710 72938 67179 62245 58001 54322 51095 48236 45703 43458 41450 39651 38076 36731
493C6731j165j063r92q88p54o40n75n38m87l99k93k17k15k68k99k55j79j67k42l33l71l76
$$ 36731 35566 34503 33511 32623 31869 31229 30654 30116 29629 29230 28937 28720 28505 28237 27938 27683 27504 27337 27095 26762 26391 26015
490B6015m07m82n59o08o33o53o68o81o88o83o49n96n56n37n07m55m03l83l78l53l15k91k78
$$ 26015 25608 25126 24567 23959 23326 22673 22005 21324 20636 19953 19304 18708 18152 17615 17108 16653 16250 15867 15489 15136 14821 14530 14252
487A4252k46j98j71j81j96j90j85k05k25k13j79j68j82j88j59j19r0q3q2q6r1r2q3o5n0m4
$$ 14252 14006 13808 13637 13456 13260 13070 12885 12680 12455 12242 12063 11895 11713 11525 11366 11247 11157 11074 10992 10906 10815 10723 10640 10575 10525 10481
484A0481m9n1l8oK4L1Rl3p0p9n8l3l4n9p2o0n4p5r7r1o6n7o0m7j7lj6k9j9%Kj4k5j7mpl4o4
$$ 10481 10432 10381 10343 10337 10361 10392 10401 10368 10298 10219 10161 10128 10094 10035 9963 9903 9849 9774 9677 9586 9520 9463 9403 9356 9339 9336 9320 9291 9272 9272 9274 9260 9235 9218 9214 9207 9173 9109
480I109o7m7l6o0r3q6m1JOj3l3m4n2m7l2j4j2k7m6m4j9Krl4l2pkl0m5j3J8jm2m1mJ2nk0k6
$$ 9109 9042 8995 8959 8899 8806 8720 8679 8680 8686 8673 8640 8596 8544 8497 8465 8451 8439 8412 8366 8322 8303 8305 8296 8262 8230 8223 8221 8191 8146 8133 8151 8150 8108 8067 8063 8075 8070 8050 8024
475H024m2m8kN9N0k7p0l1J3nl4j4K5J3l9p3p9p4n8j6J0j1l7j4L3L1j0k3QK5Qq%J1Pmk1n1o6
$$ 8024 7982 7934 7932 7991 8041 8014 7944 7913 7926 7921 7887 7873 7898 7911 7872 7799 7720 7646 7588 7572 7582 7571 7534 7520 7553 7584 7574 7551 7559 7584 7592 7584 7584 7595 7602 7598 7577 7526 7460
470G460k9L5O7M5J6KmrRL8M3K0PK2L3K6J8K2K8K6L4N3N7M4L5L4K5J0J6L9N3N7P6J07J12Q7
$$ 7460 7431 7466 7533 7578 7594 7596 7592 7583 7592 7630 7673 7693 7700 7722 7755 7781 7799 7821 7849 7875 7909 7962 8019 8063 8098 8132 8157 8167 8183 8222 8275 8332 8408 8515 8627 8714
466H714P3J01J52J94K23K44K64K93L42L95M44N08N89O53O93P93J022J298J492J609J777K033
$$ 8714 8787 8888 9040 9234 9457 9701 9965 10258 10600 10995 11439 11947 12536 13189 13882 14675 15697 16995 18487 20096 21873 23906
463B3906K272K439K594K761K818K632K193J578Q43O7o29j156j528j785j919j942j904j823
$$ 23906 26178 28617 31211 33972 36790 39422 41615 43193 44036 44103 43474 42318 40790 39005 37086 35144 33240 31417
461C1417j665j439j236j086r27p21n23l69j95L9K90N32Q18J147J442J711K061K528L075L824
$$ 31417 29752 28313 27077 25991 25064 24343 23820 23451 23256 23295 23585 24117 24935 26082 27524 29235 31296 33824 36899 40723
458D0723M960O108O224M517J450j563l437m071l905l305k516j759j104m25L60J157J877K587
$$ 40723 45683 51791 58015 62532 63982 62419 58982 54911 51006 47701 45185 43426 42322 41897 42257 43414 45291 47878
456D7878L375M271N300O375P007O442M340J250j786l991n178n547n422n092m717m307l860
$$ 47878 51253 55524 60824 67199 74206 80648 84988 86238 84452 80461 75283 69736 64314 59222 54505 50198 46338
454D6338l426l026k605k149j724j366j031p04m34k14L3L19O34J067J706K390K873L241L812
$$ 46338 42912 39886 37281 35132 33408 32042 31011 30307 29873 29659 29692 30011 30645 31712 33418 35808 38681 41922 45734
452D5734M615N469O676Q869J1579J2633R947L927k660p190r043r061q176o965n863n086m430
$$ 45734 50349 55818 62494 71363 82942 95575 105522 109449 106789 99599 90556 81495 73319 66354 60491 55405 50975
450E0975l621k718j962j379q36l61r5l8o4j48l66o84r78j201j398j572j659j648j591j521
$$ 50975 47354 44636 42674 41295 40459 40098 40003 39965 39901 39753 39387 38703 37725 36524 35126 33554 31895 30247 28656 27135
447B7135j442j364j293j208j103j017r50q43o77n28m38l59k46r5J26M77Q82J164J305J511
$$ 27135 25693 24329 23036 21828 20725 19708 18758 17915 17238 16710 16272 15913 15667 15572 15698 16175 17057 18221 19526 21037
445B1037J895K364K940L889N154N885N025K467p09l213m510m817m539l994l432l006k681k340
$$ 21037 22932 25296 28236 32125 37279 43164 48189 50656 49947 46734 42224 37407 32868 28874 25442 22436 19755 17415
442A7415j956j600j307j056q25o26m71l49k50j60p7k0KJ8O6J31J66J86K37L04L16K46J56P9
$$ 17415 15459 13859 12552 11496 10671 10045 9574 9225 8975 8815 8738 8718 8720 8738 8804 8935 9101 9287 9524 9828 10144 10390 10546 10625
440A0625j7j64l19m17m42m11l62l35l36l26k56j73j59k12k38j83j04o9q1j08j32j34q7j5K4
$$ 10625 10608 10444 10125 9708 9266 8855 8493 8158 7822 7496 7240 7067 6908 6696 6458 6275 6171 6102 6021 5913 5781 5647 5560 5545 5569
437E569J7PJ3jl9m7j1Ok5m6j0L6L7J9K9L5ll4NQ7J20Q7N9P1R1R5J06J41J85K12K08J68R6J0
$$ 5569 5586 5593 5606 5605 5566 5519 5508 5514 5489 5443 5433 5469 5506 5525 5554 5589 5586 5552 5557 5644 5764 5851 5910 5981 6072 6167 6273 6414 6599 6811 7019 7187 7283 7293
432G293o5j29j79j94j72j45j45j50j33j20j43j61j19l8j1o3j22j23p9m4k5r%j7n3p7p4n0k1
$$ 7293 7228 7099 6920 6726 6554 6409 6264 6114 5981 5861 5718 5557 5438 5400 5389 5326 5204 5081 5002 4958 4933 4924 4924 4907 4854 4777 4703 4653 4632
429D632LJ3J0jj2k1j8qkqj0jP%j5k1j6j1qrj9k6j0J9K8Jk5j0J8J3k2m0k1MJ2J2J6J5jj1qj
$$ 4632 4635 4648 4658 4657 4645 4624 4606 4598 4596 4588 4578 4577 4584 4584 4569 4548 4532 4521 4513 4504 4485 4459 4449 4468 4496 4497 4472 4462 4480 4493 4471 4431 4410 4414 4426 4438 4454 4469 4468 4457 4449 4448
424D448LNQNJKLj1l7m7k8NL1M5M5L1Pj4k3j8kJ5J9jk4k9j2RK1J8kl0m2k3MOj3k2j0lqj3qo
$$ 4448 4451 4456 4464 4469 4470 4472 4475 4464 4427 4380 4352 4357 4388 4433 4478 4509 4516 4502 4479 4461 4459 4474 4493 4492 4468 4439 4427 4436 4457 4475 4473 4443 4401 4378 4382 4388 4375 4353 4343 4340 4332 4319 4311 4305
418D305rmJ4K2J1JPJ6J4RJ6L2L3J8nk0k4j6j2k0l1k0K0N5M9kn3n5kN3N9K3kJ1K5Nk5k2PJ7
$$ 4305 4296 4292 4306 4328 4339 4340 4347 4363 4377 4386 4402 4434 4467 4485 4480 4460 4436 4420 4408 4388 4357 4337 4357 4412 4461 4459 4406 4351 4349 4402 4461 4484 4482 4493 4518 4523 4498 4476 4483 4500
413D500kpK0M8N4M1K4nk9j3K9M8K5J4N8J12J03M0kQL1K8Onj6m0o9o7l1OPk2m1k9qj2l7m7k9
$$ 4500 4498 4491 4511 4559 4613 4654 4678 4673 4644 4631 4660 4708 4733 4747 4805 4917 5020 5060 5058 5066 5097 5125 5131 5126 5110 5070 5001 4934 4903 4909 4916 4894 4853 4824 4816 4804 4767 4720 4691
409D691lJ1Nj6n0p6o1j5J7Pj1KL1L3PqRK5J9J1L1N7N0J0j7%L6N2M8N3N5K3m0o5j6N5P1L8J2
$$ 4691 4688 4699 4704 4688 4638 4562 4501 4486 4503 4510 4499 4501 4532 4565 4572 4564 4573 4598 4617 4628 4659 4716 4766 4776 4759 4759 4795 4847 4895 4948 5003 5026 4986 4921 4905 4960 5031 5069 5081
404E081Qj6o2p9m4j2k4m1j3L6M7K3J3K0J3j1rK3M1K6MPK0K2K4M1N4L9J0JK5N9P9P9P5O8N7
$$ 5081 5089 5073 5011 4932 4888 4876 4852 4811 4798 4834 4881 4904 4917 4937 4950 4939 4930 4953 4994 5020 5024 5031 5051 5073 5097 5138 5192 5231 5241 5242 5267 5326 5405 5484 5559 5627 5684
399E684L4J4J1K9M6M8L8L1L6N2P1P4M1j2m2k1K9O4O3M2J3rj4ppj6j5QK1QqQL8M1J3qrjNK1
$$ 5684 5718 5732 5743 5772 5818 5866 5904 5935 5971 6023 6094 6168 6209 6197 6155 6134 6163 6227 6290 6332 6345 6336 6322 6315 6308 6292 6277 6285 6306 6314 6306 6314 6352 6393 6406 6398 6389 6388 6393 6414
394F414L2K1OK1N1L9j5m2j2K1Kl6k0M5R5R4P4O1N2L9L3L3K8J1JJ0K1K7K8L1K7K0K2L7L9J0
$$ 6414 6446 6467 6473 6494 6545 6584 6569 6527 6515 6536 6538 6502 6482 6527 6622 6716 6790 6851 6903 6942 6975 7008 7036 7047 7048 7058 7079 7106 7134 7165 7192 7212 7234 7271 7310 7320
390G320l0l9j0L2M7K4j5m6o0n3k9lQJpKJ8K8L6M2M0J8j3k8l5n9r9j17r6o3n2n7m6j0K2L3K9
$$ 7320 7290 7251 7241 7273 7320 7344 7329 7283 7223 7170 7141 7138 7146 7147 7140 7142 7160 7188 7224 7266 7306 7324 7311 7283 7248 7189 7090 6973 6877 6814 6762 6705 6659 6649 6671 6704 6733
386F733K1J6Oqk0k1j4qj0j2j1j8l8m2j3K9L8J0j2OM2N6M6L5K8J5rl9o7q3o8j6L7M9K2kPK9
$$ 6733 6754 6770 6776 6768 6748 6727 6713 6705 6695 6683 6672 6654 6616 6574 6561 6590 6628 6638 6626 6632 6674 6730 6776 6811 6839 6854 6845 6806 6739 6656 6588 6572 6609 6658 6680 6678 6685 6714
381F714L1J1j3k5k3j0NJ0kl0n0n2m1l1k2JL4L9Kl4j9K9M3Qk2lL9N4M5L7K8RQM6R4Q8K7k4j3
$$ 6714 6745 6756 6743 6718 6695 6685 6690 6700 6698 6668 6618 6566 6525 6494 6472 6473 6507 6546 6548 6514 6495 6524 6567 6575 6553 6550 6589 6643 6688 6725 6753 6762 6770 6816 6910 6998 7025 7001 6988
376F988L5P4Q7Q4O8M2L1M9Q3Q5L8k2m3qM3O0M4K6K1J1JJ9O2Q6O5M7O2Q3O5L7N0R1J07R9J08
$$ 6988 7023 7097 7184 7268 7336 7378 7409 7458 7541 7626 7664 7642 7599 7591 7634 7694 7738 7764 7785 7796 7797 7816 7878 7964 8029 8076 8138 8221 8286 8323 8373 8464 8571 8670 8778
372H778J29J13P6P8J26J46J17R4J13J24R1O2Q3J15J11R6J14J34J15R1J10J41J28R9J23J76
$$ 8778 8907 9020 9096 9174 9300 9446 9563 9657 9770 9894 9985 10047 10130 10245 10356 10452 10566 10700 10815 10906 11016 11157 11285 11384 11507 11683
369A1683J75J22J09J64K19K19J99J93J80J48J39J72K09K16K16K24K10J77J74K22K55K28J91
$$ 11683 11858 11980 12089 12253 12472 12691 12890 13083 13263 13411 13550 13722 13931 14147 14363 14587 14797 14974 15148 15370 15625 15853 16044
366A6044K10K46K27J68J45J63J64J34J21J37J35R1N1N3Q1R6Q5O6N7P3J10J42J43J34J45J67
$$ 16044 16254 16500 16727 16895 17040 17203 17367 17501 17622 17759 17894 17985 18036 18089 18170 18266 18351 18417 18474 18547 18657 18799 18942 19076 19221 19388
363A9388J73J78K21K79K94K72K81L52M30M71M98N25N24M93M93N58O09N69M69M04L95L77L26
$$ 19388 19561 19739 19960 20239 20533 20805 21086 21438 21868 22339 22837 23362 23886 24379 24872 25430 26039 26608 27077 27481 27876 28253 28579
360B8579K71K31J84J27Q4N4Np0j38j93k57l32l92m24m46m62m38l85l47l57l79l78l62l46l24
$$ 28579 28850 29081 29265 29392 29476 29530 29535 29465 29327 29134 28877 28545 28153 27729 27283 26821 26383 25998 25651 25294 24915 24537 24175 23829 23505
357B3505k89k61k42k14j56r8o4l9LO4J28J79K02J82J50J59K22K98L42L64L75L69L51L50L57
$$ 23505 23216 22955 22713 22499 22343 22245 22181 22142 22145 22209 22337 22516 22718 22900 23050 23209 23431 23729 24071 24435 24810 25179 25530 25880 26237
354B6237L06J85P6M9N8J0q2j35j42j60j99j95j48j39k06k85l06l00l28l72l86l68l66m03m60
$$ 26237 26543 26728 26804 26853 26911 26921 26839 26704 26562 26402 26203 26008 25860 25721 25515 25230 24924 24624 24296 23924 23538 23170 22804 22401 21941
351B1941n12n43n52n43n25m87m13l21k76k93l14k82k17j78j68j52j21j05j06j09j04j08j18
$$ 21941 21429 20886 20334 19791 19266 18779 18366 18045 17769 17476 17162 16880 16663 16485 16317 16165 16044 15939 15833 15724 15620 15512 15394
348A5394j13q8p0p7j01j26j38j33j18j05j00r6r0r5j13j17r7q1r1j06r5p7r9j51j78j56j25
$$ 15394 15281 15193 15123 15046 14945 14819 14681 14548 14430 14325 14225 14129 14039 13944 13831 13714 13617 13536 13445 13339 13244 13167 13068 12917 12739 12583 12458
345A2458j22j40j55j60j58j46j36j45j66j67j37j08j04j17j30j50j73j74j42j07j00j10j14
$$ 12458 12336 12196 12041 11881 11723 11577 11441 11296 11130 10963 10826 10718 10614 10497 10367 10217 10044 9870 9728 9621 9521 9411 9297
342I297j11j04q1m5l2o3r8q7m1j5k9m6n2n6n6l2lpl5k1M4Q3M0l9o6l7j4j7j2PLl1n3l1OJ1
$$ 9297 9186 9082 9001 8956 8924 8861 8763 8676 8635 8620 8591 8545 8493 8437 8381 8349 8346 8339 8304 8283 8327 8410 8450 8411 8345 8308 8294 8277 8265 8272 8275 8244 8191 8160 8166 8177
337H177j7m7n9m5j7PJ0LJ5M3M7J3k9n1o5q7r3o1j7ok6m4m7m6m0k0j0l7q6r9o9m1l7m0l6m1
$$ 8177 8160 8113 8054 8009 7992 7999 8009 8012 8027 8070 8117 8130 8101 8050 7985 7898 7805 7744 7727 7721 7695 7651 7604 7558 7518 7498 7488 7451 7365 7266 7197 7156 7119 7079 7043 7002
333G002n3l7LOn9j22j02j7L4J0l1l1qj7o2r8q5l0K0K5j4o0q2p9o6n4m4m0m8n2l9j1PJk0l8
$$ 7002 6949 6912 6915 6921 6862 6740 6638 6621 6655 6665 6634 6603 6595 6578 6516 6418 6333 6303 6323 6348 6334 6274 6192 6113 6047 5993 5949 5909 5861 5809 5770 5759 5766 5767 5747 5709
329E709m4l9l7m8o3n8l3j7k6m1l6j8j1j6j3OJ5nm9q9j08r9p7n8n2m8l7j7KJ4Qj0k2k5l2n6
$$ 5709 5665 5626 5589 5541 5478 5420 5387 5370 5344 5303 5267 5249 5238 5222 5209 5215 5230 5225 5176 5087 4979 4880 4803 4745 4693 4645 4608 4591 4593 4607 4615 4605 4583 4558 4526 4470
324D470p4m9JK4jk9l2l4n5n9k7qm3q5o5kK2%j1QKm3o7l7MQqr%j0l4m8m3k6pkk0l8k9j2j5j9
$$ 4470 4396 4347 4348 4372 4371 4342 4310 4276 4221 4162 4135 4127 4084 3999 3934 3932 3954 3954 3943 3951 3953 3910 3843 3806 3810 3818 3810 3801 3801 3791 3757 3709 3666 3640 3633 3631 3611 3573 3544 3532 3517 3498
319C498RM5K3l3m1J3L9om8j6L3K2l1n0l7l4l9j9Ljj0K0M7J0o1p7l3qk6l8j7lj3qJ8K0j5l6
$$ 3498 3507 3552 3575 3542 3501 3514 3553 3547 3499 3483 3516 3538 3507 3457 3420 3386 3347 3328 3331 3330 3320 3340 3387 3397 3336 3259 3226 3218 3192 3154 3137 3134 3121 3113 3131 3151 3136 3100
314C100j9jqj5jQNJ5L9K0m3p5l5Pj7n9m0J0Rl6m4%K9Jl5l6rJ0K0K2J3rk2k0j1pKQmk6l4j9
$$ 3100 3081 3080 3072 3057 3056 3064 3069 3084 3123 3143 3100 3025 2990 2997 2980 2921 2881 2891 2900 2864 2820 2820 2849 2850 2815 2779 2770 2780 2800 2822 2835 2826 2804 2784 2773 2766 2768 2776 2772 2746 2712 2693
309B693qj8k4qQnk9k1K1M3J2l6m7k9k2l0j8J4J9k4n2rO1O7mo6o1k2nj3j6pPK4K7Qj7j0K5K6
$$ 2693 2685 2667 2643 2635 2643 2638 2609 2588 2609 2652 2664 2628 2581 2552 2530 2500 2482 2496 2515 2491 2439 2430 2491 2558 2554 2488 2427 2405 2400 2387 2371 2364 2371 2395 2422 2430 2413 2403 2428 2454
304B454k7p3n3MK7Pj2qmmLJ3Mj4j6loj9j1K1L2%l8l9pK2K7J2j3k7j4J2K2Mj8k9k7k3j5okp
$$ 2454 2427 2354 2301 2305 2332 2339 2327 2319 2315 2311 2314 2327 2331 2317 2301 2298 2292 2273 2262 2283 2315 2315 2277 2238 2231 2253 2280 2292 2279 2252 2238 2250 2272 2276 2258 2229 2202 2179 2164 2158 2156 2149
299B149j3j2%J2J9Qj4k4j0OKj0%K0K1L%K4M8N5N1M6L4J5PJ2J0nj2rj6l7m5k2lrk3k3k7o1j03
$$ 2149 2136 2124 2124 2136 2155 2163 2149 2125 2115 2121 2123 2113 2113 2133 2154 2157 2157 2181 2229 2284 2335 2381 2415 2430 2437 2449 2459 2454 2442 2433 2417 2380 2335 2313 2310 2301 2278 2255 2228 2167 2064
294B064j01m5J7M4L4Rj9m2n7n0k8kJj5k6nL6N1L0OJ0K1Qk9m8k7J2K3j5o6o8j0M8M1j7n5m1
$$ 2064 1963 1918 1935 1979 2013 2022 2003 1961 1904 1854 1826 1824 1825 1810 1784 1779 1815 1866 1896 1902 1912 1933 1941 1912 1864 1837 1849 1872 1857 1791 1723 1713 1761 1802 1785 1730 1689
290A689mJ9L3L7J5k2k2K1M1km5k4K2J2m4o0j7J3kj5mj1n0n2K2J01Q9Ko0n0j1J1J1Npk0j6l
$$ 1689 1685 1704 1737 1774 1789 1767 1745 1766 1807 1805 1760 1736 1758 1770 1726 1666 1649 1662 1660 1645 1641 1630 1580 1528 1550 1651 1740 1742 1682 1632 1621 1632 1643 1648 1641 1621 1605 1602
285A602kj5k0j0j0k3k7JL8M8K9Qqk5k8JN3P9M5j0k9mJ8Lk7l2j9k0l6l5lK9K3j1l3l2j9j0p
$$ 1602 1600 1585 1565 1555 1545 1522 1495 1496 1534 1582 1611 1619 1611 1586 1558 1559 1612 1691 1736 1726 1697 1693 1711 1714 1687 1655 1636 1616 1580 1545 1542 1571 1594 1583 1550 1518 1499 1489 1482
280A482lkJOJ6J3lj6j4MK3K4Ll7o9o7k9J6K5lk2mK3J7k1l8qK8K5j2l5k5KJ9J4j0l2l0jJ3j2
$$ 1482 1479 1477 1478 1484 1500 1513 1510 1494 1480 1484 1507 1531 1534 1497 1428 1361 1332 1348 1373 1370 1348 1344 1367 1384 1363 1325 1317 1345 1370 1358 1323 1298 1300 1319 1333 1323 1291 1261 1260 1273 1261
275A261m6l0K3M4Rk3nL5L7MrJ3K1j3n2m0J9N8L8j5l9rL0L8K0J0J1Jl0n4n2m6m4l1RM8N2L4
$$ 1261 1215 1185 1208 1252 1261 1238 1233 1268 1305 1309 1300 1313 1334 1321 1269 1229 1248 1306 1344 1329 1290 1281 1311 1349 1369 1379 1390 1391 1361 1307 1255 1209 1165 1134 1143 1191 1243 1277
271A277K6K8J8j1l3l6l0j8OK1J1j3j8ork9k7J0L9K6JjJ2J8K1L9N0K3j9l3j1Knj3qj2l0k5J4
$$ 1277 1303 1331 1349 1338 1305 1269 1239 1221 1227 1248 1259 1246 1228 1222 1213 1184 1157 1167 1206 1232 1233 1232 1244 1262 1283 1322 1372 1395 1376 1343 1332 1334 1329 1316 1308 1296 1266 1241 1255
266A255M9L2j8n1m5k5j5mJ7L7L2Kk6k9rJ1J1oj8j7j4j5j6j2n%J3L5M7L2jk6k8j6mQJ5Rpk4
$$ 1255 1304 1336 1318 1267 1222 1197 1182 1178 1195 1232 1264 1266 1240 1211 1202 1213 1224 1218 1200 1183 1169 1154 1138 1126 1121 1121 1134 1169 1216 1248 1247 1221 1193 1177 1173 1181 1196 1205 1198 1174
261A174k7j5JMj8m4m7j4K5M3L6K1nm5p4n4LL7J9mRL8L6jk6j6OMk6n3m2J6P5P1np4o4RN7M6
$$ 1174 1147 1132 1133 1137 1119 1075 1028 1014 1039 1082 1118 1139 1134 1089 1015 961 964 1001 1020 1016 1025 1063 1099 1098 1072 1056 1062 1066 1040 987 945 961 1036 1107 1102 1028 964 973 1030 1076
256A076J5ok2l8k5K0N2L4kj1QJ3mk6l8m1k3RK3nl6k1K0K3k3m7%O4P2K3j4rMj5m5m4pK2J2j8
$$ 1076 1091 1085 1063 1025 1000 1020 1072 1106 1104 1093 1101 1114 1110 1084 1046 1005 982 991 1014 1009 973 952 972 995 972 925 925 989 1061 1084 1070 1061 1065 1050 1005 961 954 976 988 970
251I70k5LL5M2K6J2Nj%PRj2m0m3k1%LLMlk5l8k2QK1K0K1K4J5mj6j7j7j7lK0K7Pk2l0j7oj7
$$ 970 945 948 983 1025 1051 1063 1068 1067 1067 1074 1083 1071 1031 988 967 967 970 973 977 974 949 911 889 897 918 938 959 983 998 994 978 961 944 927 924 944 971 978 956 926 909 903 886
246H86l7l5LM5M4Ll0j9J1J4qk0rLL%JKQK1K8Km6o6k6L6O3M3J3KJoj2pJ3L0K8Rj7l2k7j0LN
$$ 886 849 814 817 862 906 909 879 860 871 885 877 857 848 851 854 854 855 857 865 886 914 916 870 804 778 814 877 920 933 935 936 930 918 911 924 954 982 991 974 942 915 905 908 913
241I13MPRLrk2k4j6jRJ4J8J9Ok6n4n2j7J7J8j0k6oL2M7L1PKLqk1j1K2L6Nl9m6oL2K8jj9j3
$$ 913 917 924 933 936 927 905 881 865 864 873 887 905 924 930 904 850 798 781 798 816 806 780 774 806 853 884 891 893 896 888 867 856 878 914 919 880 834 828 860 888 887 868 855
235H55ooPL5M2Kn3o4j6L4K9j3m1k8LK4L0K6J1oqJ4L6L5J7kj7l9n8n1j2L5N2L2pl3l2j0J6K1
$$ 855 849 843 850 885 927 929 876 812 796 830 859 846 805 777 780 804 834 860 871 865 857 871 907 942 959 957 940 901 843 792 780 815 867 899 892 859 827 817 833 854
230H54Kk3l2j7KQMLNKpo%j1m6o6m1J1L4J3j0lJ8J7qk4rK3M0K6lj9qPjj2QM7M5j0n8m4jPj5
$$ 854 856 833 801 784 786 794 798 801 806 808 801 795 795 784 738 672 631 642 676 689 679 676 694 711 703 679 670 693 733 759 756 737 729 736 735 723 731 778 823 813 755 711 710 717 702
225G02j8J1K9J7QJ1Kk4l0MM5N8M7L2J8%j3j4k2l5k6MJ9mk4jL3K5j5l4j9nkQK1J0k1l4k1pj
$$ 702 684 695 724 741 749 760 762 738 708 712 757 815 862 894 912 912 899 885 863 828 802 806 825 821 797 796 829 854 839 805 786 781 779 787 808 818 797 763 742 735 734
220G34J6M1M0Rj1NJ7nl2j9J4K3%k2k5k6k9j3J5K6Pj9k6k1k0k4j3J6M2M4K5OkKOLmqlQJ3kk8
$$ 734 750 791 831 840 829 834 851 846 814 795 809 832 832 810 785 759 730 717 732 758 765 746 720 699 679 655 642 658 700 744 769 775 773 775 781 784 780 772 769 777 790 788 760
215G60l4j1J8K2J2Okk5m2k2K6M7K0j6k1mRJ9L3L4Lm1o2n2k4QL5M2K7Rlj2k2qK9M9J7l3m2r
$$ 760 726 715 733 755 767 773 771 746 704 682 708 755 775 759 738 734 743 762 795 829 832 791 729 677 653 661 696 738 765 774 771 759 737 729 758 807 824 791 749 740
210G40Pj3k7lL3M0K1jj3j3mRRNNMj9m5m5j5QOMJ6K4J5J0K6L2Ll5l8rJ1QKNMoj2j3k5m8n1j3
$$ 740 747 734 707 704 737 777 798 797 784 771 767 776 785 790 795 799 780 735 690 675 683 689 693 709 733 748 758 784 816 819 784 746 737 748 756 758 763 767 761 749 736 711 663 612 599
204E99L4M6K2KJ2K6Pl3n2l7k3k6k3PL7L1J2J5K6Ll9l4J8M7Pl9k7K0L7K2J5K2J5nj0nk5n8n7
$$ 599 633 679 701 703 715 741 748 715 663 626 603 577 554 561 598 629 641 656 682 685 646 612 630 677 684 645 618 638 675 697 712 734 749 744 734 729 704 646 589
199E89rL2L0QJJ0J6J5J0OLOJ0JqoMrl8m7k6nKJ3M1N1K1j7j4J9L6K1Jqj7l8n0l7qQ%j4%L6N5
$$ 589 580 612 642 650 651 661 677 692 702 708 711 717 727 728 720 714 718 709 671 624 598 593 595 608 649 700 721 704 690 709 745 766 767 759 742 704 654 617 609 617 617 603 603 639 694
194F94L0qrK8M4Rm0m4rK2J8j3n4p9n4J3O2L8k2l9LL1Ok6j1L1M0J5k%j2l6l1QK6om6k6L2N0
$$ 694 724 716 707 735 779 788 748 704 695 717 735 722 668 589 535 548 610 648 626 587 590 621 627 601 590 621 661 676 674 674 662 626 595 603 629 623 577 551 583 633
189F33Ol5j9K0K5rl4k8j3pNK4L3J2k2l7k2J0L9M4J2m0o5l7K0M9L8J2KJ2K3J6j1m2n4m4k5j4
$$ 633 639 604 585 605 630 621 587 559 546 539 544 568 601 613 591 554 532 542 581 625 637 597 532 495 515 564 602 614 616 628 651 667 656 614 560 516 491 477
184D77mRJ9J2KRL3M9K9j8n2m6j5J4K2K5L7M6L7Nk6l5k9j4oj1k7l1pK6L2Kk3j9MJ8J7Rmj8l
$$ 477 473 482 501 513 515 524 557 606 635 617 565 519 504 518 540 565 602 648 685 690 664 629 600 586 580 569 542 511 504 530 562 564 541 522 526 544 561 570 566 548 545
179E45L6O2M0mk5k4k7l6k8pLMK6O2N8Mm8m8j2J8L0K8Ql0m9k0K8L9Qj6lK4K4pl7l9k0JJ0On
$$ 545 581 643 683 679 654 630 603 567 539 532 535 539 565 627 685 689 641 593 581 599 629 657 665 635 586 566 594 633 641 625 622 646 670 663 626 587 567 568 578 584 579
174E79j6k5k2LL2M5L1Mj9l1l1j4OJ2KoMJ1jj6pJ4J5nj9qJ1J6P%loj0oLMpj7j5pkkj0j6j6k
$$ 579 563 538 516 519 551 596 627 631 612 581 550 536 542 554 556 550 554 565 564 548 541 555 570 565 546 538 549 565 572 572 569 563 553 547 550 554 547 530 515 508 506 504 494 478 462 460
169D60J7L0K8J9J5J6J0pk5l5l1j4QJ4rl4k3J9N3M9K7Qmj9k3rkj6k2LL1J9j5k6j2j4k8j3K1
$$ 460 477 507 535 554 569 585 595 588 563 528 497 483 491 505 496 462 439 458 511 560 587 595 591 572 549 540 538 522 500 503 534 553 538 512 500 486 458 445 466
164D66K1k6m8rL9M0J9J8J8j4m3k2K4L3Jk5k7l5m6k2K9M7J1k1%M3N2K0rj5j4k1k6j5J1K3Ok2
$$ 466 487 461 413 404 443 483 502 520 538 524 481 459 483 516 517 492 465 430 384 362 391 438 449 428 428 471 523 543 534 519 505 484 458 443 454 477 483 461
159D61j8J9M0J4k1j1K6K5k2n7l9jJ4J1J8L4M3L9K2kk2j3J6K5%j8j1pk9m4j3K6J5l7n4j5K2
$$ 461 443 462 502 516 495 484 510 535 513 456 417 416 430 441 459 493 536 575 597 595 573 560 576 601 601 583 572 565 536 492 479 505 520 483 429 414 436
155D36Qk3k1LJ1koJj1l7l4J8P2O6Lm4l2J9M6K9mj7jK2K5jl6l2J5N7M7Lk0j2j1k8k3J3L3Lm3
$$ 436 444 421 400 403 414 412 406 407 396 359 325 343 415 481 484 440 408 427 473 502 498 481 480 502 527 526 490 458 473 530 577 580 560 548 537 509 486 499 532 535 492
150D92m6j4J0RNMj3l9m1pK8K8J1J2L9N4K5k8n3k4K5L5%k6j0J9K1Jj7k9l7l0LK7J2k3k7%J7
$$ 492 446 432 442 451 456 460 447 408 367 360 388 416 427 439 478 532 557 529 476 452 477 512 512 486 476 495 516 517 500 471 434 404 407 434 446 423 396 396 413
145D13PJJ1J0qj1J5K6om5l0K9N7K4l0l9JL4J9k4m9l2JK4L8M6L1j3m2k3J4J1k7l5KK8Kk5qK7
$$ 413 420 421 432 442 434 423 438 464 458 413 383 412 469 493 463 424 425 459 478 454 405 373 374 398 436 482 513 500 458 435 449 460 433 398 400 428 430 405 397 424
140D24L4J8J4J3j0l6k5Mjl1k8J5M8L6K4M3N5J9l0m4k9l0n0m8j0K2J6oj2KK3L5K6pm0m2qK5
$$ 424 458 476 490 503 493 457 432 436 435 404 376 391 439 475 499 542 597 616 586 542 513 483 433 385 375 397 413 407 395 397 420 455 481 474 434 392 384 409
135D09K5QOJ3Kj9j8QK0%j7JK8K1k4n5l7J5N4M6jl7k0L2M9Nm0j8L4L9j1m1j9Lj2j7K3N5K1m5
$$ 409 434 442 448 461 463 444 426 434 454 454 437 438 466 487 463 408 371 386 440 486 485 448 428 460 509 514 474 456 490 529 518 477 458 461 449 432 455 510 531 486
131D86o0j0L6L5Nj9l4l8j6J9L4J5prKQO%j1j4j0j6m3n7k2L4L7j0l4J6P7P4J9k0j2QK0L3M2
$$ 486 426 416 452 487 492 473 439 401 385 404 438 453 446 437 439 447 453 453 442 428 418 402 359 302 280 314 351 341 307 323 400 474 493 473 461 469 489 522 564
126E64K8j2m9n2l3j1L%j0j5kJ5J7Kj1k0k0mK7M5K8j1k4mJ2LpNK1J1j4j8MJ8Mj4qJ0Pk0l4p
$$ 564 592 580 531 479 446 435 438 438 428 413 411 426 443 445 434 414 394 390 417 462 490 479 455 451 463 466 459 464 485 496 482 464 468 486 490 476 468 478 485 465 431 424
121D24L9O1L5j2n1o0m7k3PK9L3K1Lj3k4k5j2J3L7K9pl5k6mrl6k7L0O6J9o1o5J4P4M2l1o3m6
$$ 424 463 524 559 547 496 436 389 366 373 402 435 456 459 446 422 397 385 398 435 464 457 422 396 392 383 347 320 350 416 435 374 309 323 397 439 408 345 299
116B99j6J6N4O0Rn2n2rRpJM5O5K7j4rJ0pl6k9nmk5j9K1N6M5Nk7k9nJ7J0k3m5l1mJ2J6J8Pk0
$$ 299 283 299 353 413 422 370 318 309 318 311 312 357 422 449 435 426 436 429 393 364 359 355 330 311 332 388 433 438 411 382 377 394 404 381 336 305 301 313 329 347 354 334
111C34k7J0N2M6NpJ6J6j9l2KK7on0l0L4N6K5KK7M5Lo5q6m1J7M3L7K0Kj2j1MJ0rm0m8k8%J3
$$ 334 307 317 369 415 420 413 429 445 426 394 396 423 417 367 337 371 427 452 454 481 526 529 464 378 337 354 397 434 454 456 444 433 437 447 438 398 350 322 322 335
106C35J5K2K6K5J3ok2k6j0J1Nk2l0lJ7%l1l1j1rj8nK6L4RlJ7K7Lk1mK3K2OJ8M9N0J3k1k6k1
$$ 335 350 372 398 423 436 430 408 382 372 383 388 366 336 333 350 350 319 288 277 268 250 245 271 305 314 311 328 355 358 337 333 356 378 384 402 451 501 514 493 467 446
101D46j9pJ8L2J5j6l6k9pNkj8j8MK2J3pj0MJ2OLPMlLJ8K7K7L4M4K8j3m3l3pMj1l3m8m8l0r
$$ 446 427 420 438 470 485 469 433 404 397 402 400 382 364 368 390 403 396 386 390 402 408 411 418 422 419 422 440 467 494 528 572 600 587 544 511 504 508 497 464 416 368 338 329
96C29JnmMlk5k7RN1N2K1MJ1J3rl8m4k1J1K1Mj8j8NL0L7K4Kk0k5oJ2Mj4qJ8K4JoK4M4J1l8m4
$$ 329 330 325 321 325 322 297 270 279 330 382 403 407 418 431 422 384 340 319 330 351 355 337 319 324 354 391 415 417 397 372 366 378 382 368 360 378 402 403 397 421 465 476 438 394
90C94j7oj5k2k0k3j6L0P8O1j9q1p2k7JJ4L1M8M6K9Pj0j2QL2K2j8l7mM2M7J3k6m0l2qJ9L5L6
$$ 394 377 371 356 334 314 291 275 305 383 444 425 344 272 245 246 260 291 339 385 414 421 411 399 407 439 461 443 406 402 444 491 504 478 438 406 398 417 452 488
86D88K5km9q3o2MM8L9K3L6M5Om8o3l3qmMJ9K7K1K0K2J1j2k3j7j7k5k8j9nPK0K5Ll0m2k0J0
$$ 488 513 511 462 379 317 321 369 408 431 467 512 518 470 407 374 366 362 366 385 412 433 453 475 486 474 451 434 417 392 364 345 340 347 367 392 395 365 323 303 313
81C13K4J4rk1rK0L2J4j1k1j8j6LM0N3Rm9n1nK5J3jjrk8j9K6N9N0K2O%qj0rk5n0m3kJ5k5o5
$$ 313 337 351 342 321 312 332 364 378 367 346 328 312 315 355 408 417 368 317 312 337 350 349 348 339 311 292 318 377 427 449 455 455 447 437 428 403 353 310 308 323 298 233
76B33m5K3O8O7L9Oj8qL2N0J2m8o4k6J1K1J6J6J1KQL2M9L7%l7m4rL7M2om9l5J3L7J5k7o5p1
$$ 233 188 211 279 346 385 391 373 365 397 447 459 411 347 321 332 353 369 385 396 398 406 438 487 524 524 487 443 434 471 513 507 458 423 436 473 488 461 396 325
71C25k6M4O9K2k3NN6M0l2o2k3J1kj5jkl9n4jO6O6J2k8k9qJ1K1Mk8l2J0M0J1m9p3n2j4L0P3
$$ 325 299 343 412 434 411 416 472 512 480 418 395 406 404 389 388 386 347 293 292 358 424 436 408 379 371 382 403 407 379 347 357 397 408 359 286 234 220 250 323
66C23R0M9j1l7k3j0qJJ0ol3k6J2L4J1k1l1k4oK6N3M5Nk0rJ3K3K7K6Lk9l0NL1K2J3L2N4L9N
$$ 323 413 462 451 414 391 381 373 374 384 378 345 319 331 365 376 355 324 300 294 320 373 418 423 403 394 407 430 457 483 486 457 427 432 463 485 498 530 584 623 628
61F28rknk1k0kJ6K0J2%j4j4kjj9l1j8OPj2k2k0j7j5pqk8l4OO1N7qo1m3OK4PKJ8K5Mj8j1J0
$$ 628 619 617 612 591 571 569 585 605 617 617 603 589 587 586 567 536 518 524 531 519 497 477 460 445 438 430 402 368 374 435 492 484 423 380 386 410 417 419 437 462 466 448 437 447
56D47J9Mj2j1%Kpj1KQj0l9l9oJ6Mk1k3jJ4J5J2J0mk2j9OK4J3j2rJ6K0j6m9k9K4M9K1j0PL8
$$ 447 466 470 458 447 447 449 442 431 433 441 431 392 353 347 363 367 346 323 322 336 351 363 373 369 347 328 334 358 371 359 350 366 386 370 321 292 316 365 386 376 383 421
51D21L2rk7kK1Pj3lK3L4L3L9L4j3q0j01n1J7L5PqJ2L7K6ql0k1JJ3J5Rok2j8PK6J1j7k4k2l9
$$ 421 453 444 417 415 436 443 430 427 450 484 517 556 590 577 497 396 345 362 397 404 396 408 445 471 463 433 412 413 426 441 450 444 422 404 411 437 448 431 407 385 346
46C46n8k5M8P1J1m9k7K9K2l8m7J6N6J6l9l9oKKK8N9M5QjJ8J2k6n2m2k3oK5N9N3Nk7j0J2pm1
$$ 346 288 263 311 382 393 344 317 346 368 330 283 299 355 371 332 293 287 289 291 319 378 423 431 430 448 460 434 382 340 317 311 336 395 448 453 426 416 428 421 380
41C80l3J4M8L9Lk6l2qK9M1Ln3o4k6J2Rj7k3RM5M5Ql5m9k7QL0L4K8J3lj2j8l1n4n6j5M6P1M2
$$ 380 347 361 409 448 451 425 393 385 414 455 458 405 341 315 327 336 319 296 305 350 395 403 368 319 292 300 330 364 392 405 402 390 372 341 287 231 216 262 333 375
36C75kj7jJ8K4K5K4J6KmMJ3Rmj1qqj9k9k1%J6J7J4Pql2m5l0nMkoKNjonqk1l2j8J3L0J6rj2
$$ 375 373 356 355 373 397 422 446 462 464 460 464 477 486 482 471 463 455 436 407 386 386 402 419 433 440 432 400 355 325 320 324 322 316 318 323 322 316 311 303 282 250 232 245 275 291 282 270
30B70K0N2N1J6j1j0jj3l2j8K6N4L8J0Jnl5o5n3oK3J3MK0L1J0j9k2j2j8l2j4L0N4L1KJOj1l5
$$ 270 290 342 393 409 398 388 387 374 342 324 350 404 442 452 453 448 413 348 295 289 312 325 329 349 380 390 371 349 337 319 287 273 303 357 388 390 391 397 386 351
25C51k7RK5Pj4mJ3Lk1j7K5N6M4QrKLj6k9mL2K8j0k6OM0K2l2n8l9j0JLLpk5l1j4RJ7J8J7J0
$$ 351 324 333 358 365 351 347 360 363 342 325 350 406 450 458 449 451 454 438 409 405 437 465 455 429 435 475 497 465 407 368 358 359 362 365 358 333 302 288 297 314 332 349 359
20C59k%K3L5Rl4n9n0k3J1M6O6N7L2J1ok1l0k4j4j8k1nJ2Kk5k3RK7J6QK9M0Rm6p3n6k2RL0L3
$$ 359 357 357 380 415 424 390 331 281 258 269 315 381 438 470 481 475 454 424 400 386 368 347 342 354 356 331 308 317 344 360 368 397 437 446 400 327 271 249 258 288 321
15C21K3J4J5Pj6l6l0j1nKK8N7M6nm0k6J1K5J1rk0k2rJ4L1K4ll1m0l2j6jQJ1J7K9L8K9jk8l0
$$ 321 344 358 373 380 364 328 298 287 282 284 312 369 415 410 370 344 355 380 391 382 362 340 331 345 376 400 397 366 326 294 278 277 285 296 313 342 380 409 408 380 350
10C50nJ8J6mj6mJ5J9%j8j6MJ0j1k9j5J9K6kk5j2J7K8K3J7Mk8m2j1L4K3k8m5mK6Lj7J6N9M6
$$ 350 345 363 379 375 359 355 370 389 389 371 355 359 369 358 329 314 333 359 357 332 320 337 365 388 405 409 381 339 328 362 385 357 312 308 334 337 320 336 395 441
5D41%j4JJj3kJ9on5n1K0O6K8m1o4m1j8rmjLK4N0N0J7nOJ3j3l9l2j4j8j3L0P5N4j5n0k1J7J4
$$ 441 441 427 428 429 416 414 433 427 372 321 341 407 435 394 330 289 271 262 258 257 260 284 334 384 401 396 402 415 402 363 331 317 299 286 316 391 445 430 380 359 376 390
0C90pk0k1k3j5kMjLJ2Nj6j6J3L5K7QNlk8m2j2K9L1nk0J2N0N4K7pl8o0n8j7L1M2J2j6k0j8l2
$$ 390 383 363 342 319 304 302 306 305 308 320 325 309 293 306 341 368 376 381 378 350 308 296 325 356 351 331 343 393 447 474 467 429 369 311 294 325 367 379 363 343 325 293
-5B93l7j5J3J4OK5N3L9j5m1rK2Rj2RL4Qm4m6qJ0onK1K0j8l2RM5L1NJ3K3pm4l8njk2k3NJ9Q
$$ 293 256 241 254 268 274 299 352 391 376 335 326 348 357 345 354 388 396 352 306 298 308 302 297 318 338 320 288 297 342 373 378 391 414 407 363 325 320 319 297 274 279 298 306
-10C06%KjnJ0L2L3J8J8K2Ml0k9RL2J9Jjk0o1p2k1M4N7J5k5l6k3LM3P6P4M2jl9n7l5J6L6j5
$$ 306 306 308 307 302 312 344 377 395 413 435 439 409 380 389 421 440 441 440 420 359 287 266 310 367 382 357 321 298 301 344 420 494 536 535 496 439 404 420 456 441
-15D41r0r5k0M9M7Kk1j4j1k0j7PL2M0L1K0Mrj5j4k0l2k4J4N2N2Rl1l4j1OLl%J1K1K2J1rj4
$$ 441 351 256 236 285 332 334 313 299 288 268 251 258 290 330 361 381 385 376 361 347 327 295 271 285 337 389 398 367 333 322 328 331 328 328 339 360 382 393 384 370
-20C70lPjqJ1M6M7Rk5k0L%k3l1k0j6j8KM5O6L1k8n7l2QK1jk7l2k7k8l4j5L2O4M5kj7RK6om9
$$ 370 367 374 373 365 376 422 469 478 453 433 436 436 413 382 362 346 328 330 375 441 472 444 387 355 363 384 383 356 324 297 269 235 220 252 316 361 359 342 351 377 371 322
-25C22m5J3N8L8k3m9rM9N4Jm2k4K5M4K2qk0k5k7j1K1L4J7JJ3K6Nk6k0J7K9j1n4n7k3J3K7K1
$$ 322 277 290 348 386 363 314 305 354 408 409 367 343 368 412 434 426 406 381 354 343 364 398 415 416 429 455 460 434 414 431 460 449 395 338 315 328 355 376
-30C76ml0l5j6jkNM0O5L2l8o9l7QJ4PK2L6Jo1o6kN4M3LML2K4k8o3m2%J2lj3kJ6K6K3Rj0k6
$$ 376 372 342 307 291 290 288 293 333 398 430 392 323 286 294 308 315 337 373 374 313 247 245 299 342 345 349 381 405 377 314 272 272 284 281 268 266 282 308 331 340 330 304
-35C04l0k6j5J4M6N8L4jj4KK7K8%l3m4k3NQmJK6L3Ll0l0oJ1J4J7J1j2k5%L4K4k6n1k7RJ8J6
$$ 304 274 248 233 247 293 351 385 384 370 372 399 427 427 394 350 327 332 340 336 337 363 396 399 369 339 333 344 358 375 386 374 349 349 383 407 381 330 303 312 330 346
-40C46K5K7ll5k8JNk0l1kL1L6J9ONLrj5%K6L9K0j8m3l6j1OLmNL5O2N7Pm8m9ON3L2l2o1k9K1
$$ 346 371 398 395 360 332 333 338 318 287 285 316 352 371 377 382 385 376 361 361 387 426 446 428 385 349 338 344 347 343 348 383 445 502 509 461 412 418 471 503 471 410 381 402
-45D02L6J6%J%j2k4k8k9l0k5nK1K9J6MJ1J9Ok2k7kJ1j3l4j1L9N4K2j5j5%kj5j4OJ5Jj7j6N
$$ 402 438 454 454 455 455 443 419 391 362 332 307 302 323 352 368 372 383 402 408 386 359 357 368 355 321 310 349 403 425 410 395 395 393 378 364 370 385 386 369 353 358
-50C58K3K1Mj5k4k4j6MK6L6K6J2OPkj6j8qmpmJmj6j3NJ0rk3kL5L9%l9m3j4J7L2K8J3j3l9n1
$$ 358 381 402 406 391 367 343 327 331 357 393 419 431 437 444 442 426 408 400 396 389 385 386 382 366 353 358 368 359 336 334 369 408 408 369 326 312 329 361 389 402 389 350 299
-56B99l6JK8L4K7K2J1j4k5LN1N6Jn5n1mK6J4pkK2L5K4kj6j3ok1n3p6o5k7J9N4O7N5L6L3L1
$$ 299 263 264 292 326 353 375 386 372 347 350 401 457 458 403 352 348 374 388 381 379 401 436 460 458 442 429 423 402 349 273 208 181 200 254 321 376 412 445 476
-61D76Jm8o4l1QJ1jJ1L7L4Lk4l4l7k6J5N4L9j7m9j9L1M5K6RJmokKMJ2J0j6m9m3jK4%l2k3P
$$ 476 477 429 365 334 342 353 352 363 400 434 437 413 379 342 316 331 385 424 407 358 339 370 415 441 450 451 447 441 439 441 445 457 467 451 402 359 358 382 382 350 327 334
-66C34J2prJ7L4K4Nrk5m1l9oL5N2M1J9N%pk0k9j9J0K5Rk3l5j6J6L6K9Kk7l5k7k0j9pJ5K6R
$$ 334 346 339 330 347 381 405 410 401 376 335 296 290 325 377 418 437 442 442 435 415 386 367 377 402 411 388 353 337 353 389 418 420 393 358 331 311 292 285 300 326 335
-71C35j5j7LJ8J4kj7k0jK3J8k4n9m0J9N9N8L8J8ql6l8j0K2L1K4J9Qk1n2n0j4K9M3K4kj5qL
$$ 335 320 303 306 324 338 336 319 299 298 321 339 315 256 216 235 294 352 390 408 400 364 326 316 338 369 393 412 420 399 347 297 283 312 355 379 377 362 354 357
-75C57J8L0L3Pl2n4l4ML1L1J1j9l9k7J9N4M2Mj0J0L3M1L9K1j9n5n1j0J7Jk5l0k1j2MK3K5k
$$ 357 375 405 438 445 413 359 325 329 360 391 402 383 344 317 336 390 432 436 426 436 469 510 549 570 551 496 445 435 452 453 428 398 377 365 369 392 417 415
-80D15k6k8k3l0k8KL7L8J3pj7l0l4mL8M7J4j2nJ8K5J3jj4j6kK5M4M0J9kqj2j9l6m9m1k0j0
$$ 415 389 361 338 308 280 282 319 357 370 363 346 316 282 278 316 363 377 365 360 378 403 416 415 401 385 383 408 452 492 511 509 501 489 470 434 385 344 324 314
-85C14j8k0NL1K5ok1lK2L0K3Nk7m9k6L4P5N9J0k1k2mK4M9L8k3q5q3k3K2J7mJJ1mj6J2N4M9
$$ 314 296 276 281 312 337 331 310 307 329 359 382 387 360 311 285 319 394 453 463 442 420 416 440 489 527 504 419 336 313 335 352 348 349 360 356 340 352 406 455
-90D55Kk6nJ0k0n1l6NJ4lKK9K5j0j2L2N4Lo3o9l0j1k1lN0P9M6j5m1k3OJ9J8J1QNlj4j2PK8
$$ 455 457 431 426 436 416 365 329 334 348 345 347 376 401 391 379 411 465 468 405 336 306 295 274 271 321 400 446 431 390 367 373 392 410 421 429 434 431 417 405 412 440
-95D40L4K9K6J0k5m9l0ONl3m5j7nl6n8j9L9N4K7J0J9J4j4l5k9nJ4K2Pj5j6K2N6L8j5m0k0M
$$ 440 474 503 529 539 514 465 435 441 446 413 368 351 346 310 252 233 272 326 353 363 382 396 382 347 318 313 327 349 356 341 325 347 403 441 426 386 366 370
-99C70%j5j4oJJ2K3J6qj4PJ5j5m7l3QK9J4rj6j7j5nNNMJ3J9Nj6j3J4L7M4M2L1Mj9j4Lpl3k5
$$ 370 370 355 341 335 336 348 371 387 379 365 372 387 372 325 292 300 329 343 334 318 301 286 281 286 291 295 308 327 332 316 303 317 354 398 440 471 475 456 442 445 438 405 380
-105C80J6K5k0n7l8oj4l2mN1N7J1j9oRkj1klj8k0%QqqK0L4Qj3OK1kk8mK8J2k3k1Opl9j7N2
$$ 380 396 421 401 344 306 300 286 254 250 301 358 369 350 344 353 351 340 338 335 317 297 297 305 297 289 309 343 351 338 344 365 363 335 331 359 371 348 327 333 326 287 270 322
-110C22P5K4j9lJ3j6m8k5J3J0j1ML9K7k6n1j5L4N2L0j4n0n0oL7L2mj9rj2l0l2oRlj6kJ3J2
$$ 322 397 421 402 399 412 396 348 323 336 346 335 339 378 405 379 328 313 347 399 429 415 365 315 309 346 378 374 355 346 334 304 272 266 275 272 256 254 267 279
-115B79PK5N1N6L3Mj4j0J5L6K1l3q1p6j1N8Q0M2j7m9m0j4QJ9J9Kl3n2l7r%jJ2L1K3loJ7L1
$$ 279 286 311 362 418 451 455 441 431 446 482 503 470 389 313 302 360 440 482 465 416 376 362 370 389 408 410 377 325 288 279 279 278 290 321 344 341 335 352 383
-119C83K3K1L0J0m8p6l0K9K7k3l5LL1K0J5L6M1pn8n6j7kj1kL2L9Qj6%K5J2j5oL5M4lm9l6K0
$$ 383 406 427 457 467 419 343 313 342 369 346 311 314 345 365 380 416 457 450 392 336 319 317 306 304 336 375 383 367 367 392 404 389 383 418 462 459 410 374 394
-124C94N8M0qm2n1l7j9mPJ9K5J5j4l5l1j4mMJ7K3Qj8k1ML0L9L1J4mj0MJ2j7n9o0j4K5J3j4
$$ 394 452 492 484 442 391 354 335 331 338 357 382 397 383 348 317 303 299 303 320 343 351 333 312 316 346 385 416 430 426 416 420 432 415 356 296 282 307 320 306
-129C06rK0L0J8J6K7K4Lj9k8l1k5jL2M6K9lk8l5j8J7L6J6j3lL5L9ll7k3J0J3nqLlj7j2J2J5
$$ 306 297 317 347 365 381 408 432 435 416 388 357 332 331 363 409 438 435 407 372 354 371 407 423 410 407 442 481 478 441 418 428 441 436 428 431 428 411 399 411 426
-134D26pj9lMk0l7j6J9J6j5j9J5M5L6J1lj8m3n1j9J9J5l0n8l6J4M7N1K6j0l1j1L0M4J3k0j6
$$ 426 419 400 397 401 381 344 328 347 363 348 329 344 389 425 436 433 415 372 321 302 321 336 306 248 212 226 273 324 350 340 309 298 328 372 385 365 349
-138C49J9M4L8Qk8m0j2L3M4Km2m3j9pj2qRJ2NMJ1J2OPKk9o1m3K1O2L4k6m8k0J9L8L4J6pk2
$$ 349 368 412 450 458 430 390 378 411 455 457 415 372 353 346 334 326 335 347 352 356 367 379 385 392 394 365 304 261 282 344 378 352 304 284 303 341 375 391 384 362
-143C62k0rMJ4J7Kk4l1%M6O6M0j1n1n2k1J4K6J8Kj3l2m2k9kJ3PjMRLnj1j9k5j5J8M4M1J8K
$$ 362 342 333 337 351 368 370 346 315 315 361 427 467 456 405 353 332 346 372 390 392 379 347 305 276 274 287 294 293 297 306 309 304 293 274 249 234 252 296 337 355 357
-148C57%oj5j8oJ2K2J9RKK%qj0MJ8RroK1L4J2j8k6j6j4j9j5%J2J7J5Jk1l1j5OJj5j1J9L5J7
$$ 357 357 351 336 318 312 324 346 365 374 376 378 378 370 360 364 382 391 382 376 397 431 443 425 399 383 369 350 335 335 347 364 379 380 359 328 313 319 320 305 294 313 348 365
-153C65j7k4LL6L8Nk8k6kPpj5lQQJ5L0K1k3n7m5rKKJ9M2L2MMK7K0k7n9l9jQmrJ2L8M6K0k6
$$ 365 348 324 327 363 401 406 378 352 350 357 350 335 332 340 348 363 393 414 391 334 289 280 282 284 303 345 377 381 385 412 432 405 346 307 306 314 310 301 313 351 397 417 391
-159C91n1k9RJ5olK6L8K1J0K2J2l6p0m6MK2J5K1L7L1OmKj0m0m4j2K0K2OnpolKLNJ5K5K4Pr
$$ 391 340 311 320 335 329 326 352 390 411 421 443 455 419 349 303 307 329 344 365 402 433 439 435 437 427 387 343 331 351 373 379 374 367 361 358 360 363 368 383 408 432 439 430
-164D30j4j3j1j6l3n3m9mM8O0K1k4l7j8NJ9K8L4K8Pj8l1k4j0nj5k4j3J6M3M6J8j7l3j2J6J4
$$ 430 416 403 392 376 343 290 241 237 285 345 366 342 305 287 292 311 339 373 401 408 390 359 335 325 320 305 281 268 284 327 373 391 374 341 329 345 359
-168C59j7l7j5J7J9l%K9M2Nm3m2J1O3N7Kn6p1l4K0M6K7j0k4mJ8K0NlkkpoMRmj7j0J9L5K2m
$$ 359 342 305 290 307 326 323 323 352 394 399 356 314 325 388 445 447 391 320 286 306 352 379 369 345 341 359 379 384 381 379 377 370 364 368 377 373 356 346 365 400 422 418
-174D18j3KK0K2P%QJ7Nj9l0j8oqj1oj0l4l8MN1M4KrK1L1nk6LL6J4l3m2j6%l%NKkJ0J9jk3q
$$ 418 405 407 427 449 456 456 464 481 486 467 437 419 413 405 394 388 378 344 306 310 361 405 407 398 419 450 445 419 422 458 472 439 397 381 381 378 378 383 385 383 393 412 411 388 380
-179C80L0L9J4j0j6k7m5m4k3j0lK2N8O2L0%prj4lJ0qm4m2%K2Jj0J8M3K3j1j3nk3m0j9K1L2
$$ 380 410 449 463 453 437 410 365 321 298 288 285 307 365 427 457 457 450 441 427 424 434 426 382 340 340 362 363 353 371 414 437 426 413 408 385 345 326 347 379
-184C79J6Lok4l1nK2Rk1j0K6L2nk3kJ6jk5j6J9L7K6jk5l0j4JjkJ5L2K0kQL5K9j5m5l4j9k9
$$ 379 395 398 392 368 337 332 354 363 342 332 358 390 385 362 360 376 375 350 334 353 390 416 415 390 360 346 347 346 344 359 391 411 409 417 452 481 466 421 387 368 339
-189C39l3rJ8J9PRPj1j4J6M1Pm8m5K1O9M2j6l5j0J5K1K0J9Nj1pK4L9Lo3r9o7%L8K3qj1J5L5
$$ 339 306 297 315 334 341 350 357 346 332 348 389 396 348 303 324 393 435 419 384 374 389 410 430 449 454 443 436 460 499 502 439 340 273 273 311 334 326 315 330 365
-194C65K5KjJ4K1OoLJ4kl4l9jK8Om3n5k1J1J2PJ6K7J3pj2qj4k3rK2M0L2J5kj9m3n4l8jK5K2
$$ 365 390 392 391 405 426 432 426 429 443 441 407 368 367 395 401 358 303 282 293 305 312 328 355 368 361 349 341 327 304 295 317 357 389 404 402 383 340 286 248 247 272 294
-199B94NKJ5K4J5lmJ3K7K1ll5n7n5k0K9N1L0rk1KK9K4j5l9j4M0O4L8RJ9M4L1j5l7j5Mj0l0
$$ 294 299 301 316 340 355 352 348 361 388 409 406 371 314 259 239 268 319 349 340 319 321 350 374 359 320 306 346 410 448 457 476 520 551 536 499 484 488 478 448
-204D48j6J8K8J0j0j8l0n3o6m1J5O3N4lm7k7K3L6Jk1ML5K5qk1k1l0m5m3l3k6qL9P1L9k6m4
$$ 448 432 450 478 488 478 460 430 377 311 270 285 348 402 399 352 325 348 384 385 364 368 403 428 420 399 378 348 303 260 227 201 193 232 303 342 316 272
-208B72%L7K7NPRj8m9m3pJ8J1kJ3N1P3M9nk8LL6J2m8o6j9K5J1k9l9j4J6L4L1Km0m8lM3L4j0
$$ 272 272 309 336 341 348 357 339 290 247 240 258 269 267 280 331 404 453 448 420 423 459 471 423 357 338 363 374 345 306 292 308 342 373 375 335 287 284 327 361 351
-213C51l0j6mrkJ8J8j4l8k4MJ4J2K0M0N1N0L1pn5q4o5j2L3M2K0j4l8l0J5O6Q1M4j1m1l3j0
$$ 351 321 305 301 292 290 308 326 312 274 250 254 268 280 300 340 391 441 472 465 410 326 261 249 282 324 344 330 292 262 277 343 424 468 457 416 383 373
-218C73MNJlj1j8j8rknoKJ3RMK0M8L9k1p6o5kM1L2J2K0K7%l9m2j3Moj4JJ2Lpkkj7k7j2ROq
$$ 373 377 382 383 380 369 351 333 324 322 317 311 313 326 335 339 359 407 446 425 349 284 282 323 355 367 387 414 414 375 333 320 324 318 304 305 317 320 313 311 309 292 265 253 262 268 260
-223B60KK9M0K0oj6j1PK1J5j2l3k2Jok9j7L7P4N2qm5l6kK6K4kj7RM9M5j6o5n7j9oj2oJ7K4
$$ 260 262 291 331 351 345 329 318 325 346 361 349 316 294 295 289 260 243 280 354 406 398 353 317 315 341 365 363 346 355 404 449 433 368 311 292 286 274 268 285 309
-228C09RnpqoRK6K5Nj5l3m4l3OM1L7Lj5nOjj6k3j5RM5N8K6j8j5K7M3J1k2j3QNj3j4j0k9n9
$$ 309 318 313 306 298 292 301 327 352 357 342 309 265 232 238 279 316 319 304 299 305 304 288 265 250 259 304 362 388 370 355 382 425 436 414 401 409 414 401 387 377 348 289
-233B89n6j0M3O3M0kk5qK7K9ql7k6MJ4J3K4L2J2k1k5nNoj6j1j5k5j6J5K6pm1k7K2M8K3j6k8
$$ 289 233 223 266 329 369 367 342 334 361 390 382 345 319 323 337 350 374 406 418 397 372 367 372 366 350 339 324 299 283 298 324 317 276 249 271 319 342 326 298
-238B98j0Lj0l3l5pK1J9j0k8j1K8M9L7RjJ9M4L2j5n3l1L5Q1N8j4p5q7n5j9mmPL0L3Qj3NL5
$$ 298 288 291 281 248 213 206 227 246 236 208 197 225 274 311 320 319 338 382 414 399 346 315 350 431 489 475 400 313 258 239 235 231 238 268 301 309 296 301 336
-243C36L1knL1M3j1p7q1l1OLOL6N1K0k0k3NK0J5J0Rok6j6J9L2Pk0j1Pql5l3j0j2m1m4jM5M7
$$ 336 367 365 360 391 434 423 346 265 234 240 243 249 285 336 356 336 313 318 338 353 363 372 366 340 324 343 375 382 362 351 358 350 315 282 272 260 219 175 174 219 266
-248B66K6K0K7K1Mljj0k1j4kj1l1k1K1M6K5j5k5q%k1m5m1%M9O7L8ql4k6lJ5K3J0j3k1kJ2j8
$$ 266 292 312 339 360 364 361 360 350 329 315 313 302 271 250 271 317 342 327 302 294 294 273 228 187 187 236 303 341 333 299 273 270 285 308 318 305 284 282 294 276
-253B76o9p3j7L8M2J7jj1k7l3qK1J8LJ8N2N7K4KRJ6nl1l2j2OJ6K6K7J8J1J0Kj6k3oJ4Pj8k8
$$ 276 207 134 117 155 197 214 213 202 175 142 134 155 173 176 194 246 303 327 329 338 354 349 318 286 274 280 296 322 349 367 378 388 390 374 351 345 359 366 348 320
-258C20j1OOKJ4K9J9k2n8m3NL1Jm0k7K8N7K1k3k6lml2l5MM7M9K0nj0mkoj0j4j9l2m1k9ML0
$$ 320 309 315 321 323 337 366 385 363 305 262 267 298 299 259 232 260 317 338 315 289 286 282 250 215 219 266 315 335 330 320 316 314 308 298 284 265 233 192 163 167 197
-263A97K6J2J5L1K5j2m1l5rLLPK5M2M9L6Ml5n0l0oJlPJ0j6n2n2j3K1K1Pnj7l3k3J9N4M9K4
$$ 197 223 235 250 281 306 294 253 218 209 212 215 222 247 289 338 374 378 343 293 263 257 258 255 262 272 256 204 152 139 160 181 188 183 166 133 110 129 183 232 256
-267B56J3J2lj9oJ8J3j3j1K0L3Pj2J4M1Rn6q1m1QJ8%nJ5K3Nj7j0J9K8Jk8k0Ljl0k8J7M8K4
$$ 256 269 281 278 259 253 271 284 271 260 280 313 320 308 322 363 372 316 235 194 202 220 220 215 230 253 258 241 231 250 278 279 251 231 234 233 203 175 192 240 264
-272B64j0JM0M3Nk2oK1L1L6L3jn2n8PO5M4k0l6OK8j2n2l4J7L1Mj6j2rk5l0rPJqNK4J2k4m0
$$ 264 254 255 295 338 343 321 315 336 367 403 436 435 383 325 332 397 441 421 385 391 419 407 355 321 338 369 373 357 345 336 311 281 272 279 280 272 277 301 313 289 249
-277B49j8J0J6J4K0K1jl5m2pL9M8J0m0n1j6K2K6kj8pRJ3J1QLrj2kJpJK4L5J2rLK0QrOL9K8
$$ 249 231 241 257 271 291 312 311 276 234 227 266 314 324 284 233 217 239 265 263 245 238 247 260 271 279 282 273 261 259 260 253 254 278 313 325 316 319 339 347 338 344 383 411
-283D11k3m7k3MKQL6M4kn1l8J3K8j1m4l2MJ6jk4l1k4j0KK0M7O2L2l1o7m1J2L3K0J6K9L3Qj9
$$ 411 388 341 318 322 324 332 368 412 410 359 321 334 362 351 307 275 279 295 294 270 239 215 205 207 227 274 336 368 337 270 229 241 274 294 310 339 372 380 361
-287C61k1JK5K8jm1n0k0Omk0jK2ro9o9QP0M8pj4K5M2K1KOOpj4llk5m9m4j1J7K6K2K8M4L9m
$$ 361 340 341 366 394 393 352 302 282 288 284 264 263 285 276 207 138 146 216 264 257 243 268 310 331 333 339 345 338 324 321 318 293 244 200 189 206 232 254 282 326 365 361
-293C61n9p0k3K6K6qk7k4k6k6PO2O6Mn0l4J4J9j3j4L0N5K7rnQj3n0m4NL6K4NJ1K5Rk4l0KK9
$$ 361 302 232 209 235 261 253 226 202 176 150 157 219 285 289 239 205 219 238 225 211 241 296 323 314 309 317 304 254 210 215 251 275 280 291 316 325 301 271 273 302
-297C02J2l7o9m9QM9M0lk3%L3L6J7PJ3J0j7n2o9m8PO7Q1K8m2n2kL6J7k7m0j9PK7M3M5J8k2
$$ 302 314 277 208 159 167 216 256 253 230 230 263 299 316 323 336 346 329 277 208 160 167 234 315 343 301 249 247 283 300 273 233 214 221 248 291 336 354 332
-302C32m0l6k5j1J3L6L7K2J8J6nl4k6K2N1K2k4l6k0j2j2LK2J7nj1Jnl3m0rK0J0j5j8rj4k8
$$ 332 292 256 231 220 233 269 306 328 346 362 357 323 297 319 370 392 368 332 312 300 288 291 313 330 325 314 315 310 277 237 228 248 258 243 225 216 202 174
-307A74j3L1O6N9K3k2n2n3j6K5K9%j8jJ4Jj5qPKj6j4%NJ1L9N7J4p1j06m1N1P1J4l1j1M0N2
$$ 174 161 192 258 317 340 318 266 213 197 222 251 251 233 232 246 247 232 224 231 233 217 203 203 208 219 258 315 329 258 152 111 162 233 247 216 205 245 297
-311B97J6k0j0L1N0J9l2n0k4J0K5K4J2k1o5p7l6K0L4Lk6j8J1L3L2J3j0j5QL4L1rm8m9j5K0
$$ 297 313 293 283 314 364 383 351 301 277 287 312 336 348 327 262 185 149 169 203 206 180 162 173 206 238 251 241 226 234 268 299 290 242 193 178 198
-316A98K4P%K3N1M6Nk8j9OMk2l5k3j1oNK5K5OjJ3J8ok5qJ6%l8m1jL5L9K7J8kl5m7k0J5J9Q
$$ 198 222 229 229 252 303 349 354 326 307 313 317 295 260 237 226 220 225 250 275 281 280 293 311 305 280 272 288 288 250 209 208 243 282 309 327 325 290 243 223 238 257 265
-321B65J5L1K1rj9rj5m0l7OL6J1k1JN2N5Ml5k4%LLJ5J3j4k8qQpk2LL3J9j3%M1M2KpL3M5j2
$$ 265 280 311 332 323 304 295 280 240 203 209 245 256 235 236 288 343 347 312 288 288 291 294 309 322 308 280 272 280 273 251 254 287 306 293 293 334 376 378 371 404 449 437
-326D37o6m7J3L0jk3qJ2J1Jrj9j7QK7Qm3p1m3J1M8M9K9Jk8m9m5j8J4K7J0j2qK4M7L4%j5j1
$$ 437 371 324 337 367 366 343 335 347 358 359 350 331 314 322 349 357 314 243 200 211 259 308 337 338 310 261 216 198 212 239 249 237 229 253 300 334 334 319 308
-331C08j5l3m5k7PK3J4lnOJ3J3J2J1Kj7k7qK5L6J6j0j5lPJ2Lk0l7j7K0L0lk3OM3K5l1n3k5
$$ 308 293 260 215 188 195 218 232 229 224 230 243 256 268 279 281 264 237 229 254 290 306 296 281 278 285 297 300 280 243 226 246 276 273 250 256 299 324 293 240 215
-336B15%j2k9j0K2K9Lj4nJ4J7ORL1L8%n7p1k6K4K8NJK1K1KkK1L1Ll3l5mK6K7jl6m9l3oPJ2
$$ 215 215 203 174 164 186 215 218 204 199 213 230 236 245 276 314 314 257 186 160 184 212 217 218 239 260 262 260 281 312 315 282 247 243 269 296 295 259 210 177 171 178 190
-341A90K1L0K2RJ5J9pm4m3kL0L1L8N8M3k3o6l3J9J0m0m5LK8ol7j5K4K8JrJPkj4j9k2j6RL5
$$ 190 211 241 263 272 287 306 299 255 212 210 240 271 309 367 410 387 321 288 307 317 277 232 235 263 257 220 205 229 257 258 249 250 257 255 241 222 200 184 193 228
-346B28K2l1o5k9M8Q3M1k3l9j0J8K5K6K5Ok5k8jK0Rj0j3oJJ6L1J8k4m3pL4K1k5m2j9lpoJ3
$$ 228 250 219 154 125 173 256 297 274 235 225 243 268 294 319 325 300 272 271 291 300 290 277 271 272 288 319 337 313 270 263 297 318 293 251 232 229 222 216 229
-351B29K1J0kpk2l7k3K0M4K6nj2pj1j9qJ4K4J6Jj8k9j9J2L6K9LrLJ8J6%j8k3j9j1rqmNJ2J8
$$ 229 250 260 258 251 229 192 169 189 233 259 254 242 235 224 205 197 211 235 251 252 234 205 186 198 234 263 266 257 260 278 294 294 276 253 234 223 214 206 202 207 219 237
-356B37K5K3%k8l7k3j2k0k4kL9N6L2j2l2qL0L3j4n7l7L1P8N6kl3k2lnk2j8J4M5L4j2m4l2n
$$ 237 262 285 285 257 220 197 185 165 141 139 178 234 266 254 222 214 244 277 263 206 169 200 278 334 332 299 277 274 269 247 229 243 288 322 310 266 234 229
-360B29jj2jK6K9Jj3OK6J6NJ6K0j3n5m7mJ5mj2J4K8rn5m4OK7Jj4J9M8K3k5k9J2L2RlK3M2J0
$$ 229 228 216 215 241 270 271 258 264 290 306 311 327 347 334 279 232 228 243 239 227 241 269 260 205 161 167 194 195 181 200 248 271 246 217 229 261 270 267 290 332 342
-365C42k9k4QJ1pKK9J9k2k9J1L2Kl8m1k9k6k1njk0k6nQrnM0O6K0m7m6J2L8Pk7k8j2KK1L3K6
$$ 342 313 289 297 308 301 303 332 351 329 300 311 343 345 307 266 237 211 190 185 184 164 138 133 141 132 127 167 233 253 206 160 172 210 217 190 162 150 152 173 206 232
-370B32K0L5M3Ln0n1kJ5k0m5j3K6J9nKK7K6kj9j3nj8l8l9nL7L6j8n7k1O1R5M8j5l6l2l3l8
$$ 232 252 287 330 333 283 232 230 245 225 180 167 193 212 207 209 236 262 260 241 228 223 205 167 128 123 160 196 178 121 100 161 256 304 289 253 221 188 150
-375A50k5nNRJ2OnMK1Pl7n2pM3L6%pJ9L4K5J2OMJ1K9K8ml6k7%NokJ0Lj8j1K0L6K8J8Qk2n6
$$ 150 125 120 125 134 146 152 147 151 172 179 142 90 83 126 162 162 155 174 208 233 245 251 255 266 295 323 319 283 256 256 261 255 253 263 266 248 237 257 293 321 339 347 325 269
-380B69n2qK1Pj4oJ0kl0l5lL9N9L1k6o2l8K0M7K3rqJ1J5Krj4k1k2j3PL1M2K9j2m6l4K0N7M2
$$ 269 217 209 230 237 223 217 227 225 195 160 157 196 255 286 260 198 160 180 227 250 241 233 244 259 261 252 238 217 195 182 189 220 262 291 279 233 199 219 276 318
-385C18NnJ1Rj8l6j5J7J9j4l6j6J4J0l1n8m0LK6J8LprjJ6K2J3J1K7L7J9j1j9k1l7m6j3L3L3
$$ 318 323 318 329 338 320 284 269 286 305 291 255 239 253 263 232 174 134 137 163 181 184 177 168 167 183 205 218 229 256 293 312 301 282 261 224 178 165 198 231
-390B31oj2K6M5Rk5j3J4Oj3%K8K8Oqj9m1n7l5RK9K1J3PlnJ0Rk5m9j1M6M7j2m1j3K1Ok4k5o
$$ 231 225 213 239 284 293 268 255 269 275 262 262 290 318 324 316 297 256 199 164 173 202 223 236 243 240 235 245 254 229 180 169 215 262 250 209 196 217 223 199 174 168
-395A68JlMJ5K0K4K8J5j1j9oMj0j9kJ4Lk2k7j2KJ5K9K5qm3m0oK2L0L6L5Nm8p4m5PL3J9jjJ4
$$ 168 169 166 170 185 205 229 257 272 261 242 236 240 230 211 209 223 226 204 177 165 167 182 211 236 228 185 145 139 161 191 227 262 267 219 145 100 107 140 159 158 157 171
-400A71K5K6K3K6L5L2J2j1j6LK0J5j4l5k2J1K6Ll1m1k7qQK9M2K1k1l6mK4Qk3j6K0K9j0m0k3
$$ 171 196 222 245 271 306 338 350 339 323 326 346 361 347 312 290 301 327 330 299 258 231 223 231 260 302 323 302 266 262 286 294 271 255 275 304 294 254 231
-405B31J9L9K5MjNJ1J5J5Oj0k7l2j8MK0J4KKRNj6l6l7j8%J4K6L2J9pk6j4J6K6ll7l4mNk0l4
$$ 231 250 289 314 318 317 322 333 348 363 369 359 332 300 282 286 306 320 322 324 333 338 322 286 249 231 231 245 271 303 322 315 289 275 291 317 314 277 243 239 244 224 190
-410A90oL0K9QJ2K7Rl7m3PN2L9Lrlrj8pLj5m2l3%J2pqK5N5M9K5J2Mj3l1l3l2l4k7rRJ2K0K9
$$ 190 184 214 243 251 263 290 299 262 219 226 278 317 320 311 308 299 281 274 277 262 220 187 187 199 192 184 209 264 313 338 350 354 341 310 277 245 211 184 175 184 196 216 245
-415B45J3m0p4m2J7K2k2l4K2P3M7j7l1J9O0M0pk5oJ4K6L7M0Pn5r9p9j9J9J4mqjMK3N0N2Nm6
$$ 245 258 218 144 102 119 141 119 85 107 180 227 210 179 198 258 298 291 266 260 274 300 337 377 384 329 230 151 132 151 165 161 153 152 156 179 229 281 286 240
-420B40l5K5O2L6ljK7K8j6o0o8l6QL1K3NRK9K4j4m3k3J4Rl0m2oK9K1j1k6j4J0L6N0L5rm9m6
$$ 240 205 230 292 328 325 324 351 379 363 303 235 199 207 238 261 266 275 304 328 314 271 248 262 271 241 199 193 222 243 232 206 192 202 238 288 323 314 265 219
-425B19j1K5L1J5jmPJ4Oj1k2k7l3l3qK2K8J3J9M9N0mn8n0jJ8j2l5j0K8L2nm4m8j7J6J7j5m1
$$ 219 208 233 264 279 278 274 281 295 301 290 268 241 208 175 167 189 217 230 249 298 348 344 286 236 235 253 241 206 196 224 256 251 207 159 142 158 175 160 119
-430A19k2K7O0N8L6J2rk0j4LJ4J5J6J2ql9n1m3k6kL3N6L7JlK3K2k3n1k6J0Ok2k1NJ5NMRlk2
$$ 119 97 124 184 242 278 290 281 261 247 250 264 279 295 307 299 260 209 166 140 138 171 227 264 265 262 285 307 284 233 207 217 223 201 180 185 200 205 209 218 215 193
-435A93j8nj5l8k3L4P3N8J6lKQNJj2k5k7j5jNJ1J8J3mj4j2j4j6NL6K9j7l8J2P6P2J4k7k3j7
$$ 193 175 170 155 117 94 128 201 259 275 272 274 282 287 288 276 251 224 209 208 213 224 242 255 251 237 225 211 195 200 236 265 248 210 222 298 370 384 357 334 317
-439C17l1l7j9jj%J7J6j5l7pM6N4lo2o2mN9P5M0rl4k8j1%RJ9J3j3l5k7MJ4j9n7n2JM9M4Lj8
$$ 317 286 249 230 229 228 228 245 261 246 209 202 248 302 299 237 175 171 230 305 345 336 302 274 263 263 272 291 304 291 256 229 233 247 228 171 119 120 169 213 216 198
-444A98KK6K0%LK6K5mk7k0qj5k2JM0N2L1Lqj4k4k8k0j7k0j5QK8K3J0RJ4jk9k9J3N3L9j6m3
$$ 198 200 226 246 246 249 275 300 296 269 249 241 226 204 205 245 297 328 331 323 309 285 257 237 220 200 185 193 221 244 254 263 277 276 247 218 231 284 323 307 264
-449B64oM2K8m4r1n8RL6J2j3j4m%PK0K1J1J3K6K8Rj8l7n5n8j7N2P8K5m1m2QK9Lj5QL4L0J6
$$ 264 258 300 328 284 193 135 144 180 192 179 165 161 161 168 188 209 220 233 259 287 296 278 241 186 128 111 163 241 266 225 183 191 220 223 208 216 250 280 296
-454B96J0%k8l8jM9N8K2j6l6n2o0m0J0M5M0Qj5j0RK4K2Rknoj8k7j3J9L3Ol8n9l9kK1J9Omo
$$ 296 306 306 278 240 239 288 346 368 352 316 264 204 164 174 219 259 267 252 242 251 275 297 306 304 299 293 275 248 235 254 287 293 255 196 157 155 176 195 201 197 191
-459A91LJ4J4lj9nM3Q3P4J8l7n9n7m0j1K5L4Ok6k0J3K0j4m7m1qJ9K4K0K5L3K8Nk3l2j3J4K4
$$ 191 194 208 222 219 200 195 238 321 395 413 376 317 260 220 209 234 268 274 248 228 241 261 247 200 159 151 170 194 214 239 272 300 305 282 250 237 251 275
-464B75J5Knj0j1jJ5J3oj5oONnpqrj0rj1rRL5L4rn5n3qL9N1L1%k6l1pJ6J6%OL2L8po7q7n6
$$ 275 290 292 287 277 266 265 280 293 287 272 266 272 277 272 265 257 248 238 229 218 209 218 253 287 278 223 170 162 201 252 283 283 257 226 219 235 251 251 257 289 327 320 253 166 110
-469A10mL2M6M9M7L8J1k5m3k2K2L9J3l4n5m3qK5L7J2k7l1J4N9M6j1m0j5J1pm0m1j4lpJK6K2
$$ 110 106 138 184 233 280 318 329 304 261 239 261 300 313 279 224 181 173 198 235 247 220 189 203 262 308 297 257 242 253 246 206 165 151 148 141 142 168 190
-474A90j1k7KL4K5JNJ9km1m1QL8J4j3%J7kl4k1K2L4RkJ3J5pj8KK2J6oj6qRL5M3On2p4l6Nj
$$ 190 179 152 154 188 213 214 219 238 236 195 154 162 200 214 201 201 218 216 182 161 183 217 226 224 237 252 245 227 229 251 267 261 245 237 246 281 324 330 278 204 168 173 172
-479A72l5l8lL8O1O4M1ll1k1rl0n2k5K7M1Mk2nJ5OpLJ3lk7l3j9LL3O1N5Ol6k8MRj3j8KJ8J1
$$ 172 137 99 96 134 195 259 300 297 266 245 236 206 154 129 156 197 201 179 174 189 195 188 191 204 201 174 141 122 125 158 219 274 280 244 216 220 229 216 198 200 218 229
-484B29PK6M2K5k1n7o0l4pjnLK4L6K4KqlRJ6J0j6m3l6OL8K5oj2PPj9l3j5J5K9L0K3Pj3j5L
$$ 229 236 262 304 329 308 251 191 157 150 149 144 147 171 207 231 233 225 222 231 247 257 241 198 162 168 206 231 225 213 220 227 208 175 160 175 204 234 257 264 251 236 239
-489B39J0mj9j1PJ1mj8k4j8qJ%plMpk8k3J9N4L3k0m1j4K0K3J5K5L2J0k6l0NK8jm6l7K4O4L0
$$ 239 249 245 226 215 222 233 229 211 187 169 161 162 162 155 152 156 149 121 98 117 171 204 184 143 129 149 172 187 212 244 254 228 198 203 231 230 184 147 171 235 265
-494B65l0m3rPj2k7j0QLKL1N0J7l9n1j4J9J7MJ0K3K5QppJ0K5Rk0k2K2N5K4l9n1mK9lm6m5p
$$ 265 235 192 183 190 178 151 141 149 152 154 185 235 252 213 162 148 167 184 188 198 221 246 254 247 240 250 275 284 264 242 264 319 343 304 253 249 278 275 229 184 177
-499A77K2K9L0K1j3n4n9k0L3O0M7Nl3l0PK7Nk6j5K4L1rm1k5J0J4j0j9kJ5RJJ0K6K2JpNJ2r
$$ 177 199 228 258 279 266 212 153 133 166 226 273 278 245 215 222 249 254 228 213 237 268 259 218 193 203 217 207 188 186 201 210 211 221 247 269 270 263 268 280 271
-504B71l3l1mJ6J1lj3k3k8j4K3N1M4J3j0j2o%KMJ3L2M2K5rk7j9rj6k8l0k9l0j1K2K9qm2k5
$$ 271 238 207 203 219 230 227 214 191 163 149 172 223 267 280 270 258 252 252 254 258 271 303 345 370 361 334 315 306 290 262 232 203 173 162 184 213 205 163 138
-509A38J6K3jrLJk1k3OL3L6K6Pk2l1MM9L5k4m0J5N5J8m4l9J5L5Lk6j6OJ5J3NnlJ5K3Jk3j9
$$ 138 154 177 176 167 170 171 150 127 133 166 202 228 235 213 182 186 235 270 246 206 221 276 294 250 211 226 261 264 238 222 228 243 256 261 256 253 268 291 292 269 250
-514B50j0k5l5QP2P4J4k4oLm6r5p1KM4L9K9L2L1J4kpj1qNJ1jk0k2k0l2m8k8J8M3K8L%Nkj3
$$ 250 240 215 180 188 260 334 348 324 318 321 275 180 109 111 155 194 223 255 286 300 298 291 280 272 277 288 287 267 245 225 193 145 117 135 178 206 209 209 214 212 199
-519A99r%rj9kL9N6K3l3n5k9J3K6Mk5l6l0j8KL0N5M8Rk9l5j2J2J6Npj5j4mLkj1NM1O0L0j6
$$ 199 190 190 181 162 160 199 255 278 245 190 161 174 200 204 179 143 113 95 97 127 182 230 239 210 175 163 175 191 196 189 174 160 156 159 157 146 151 192 252 282 266
-524B66k9rjj4qK7M0Jl6rM5M1k6o9m1MMk4k3PK4J1k%MllJ2L2L0Ok0l1k6j4kJ2K5K5Lk2k3n
$$ 266 237 228 227 213 205 232 272 273 237 228 273 314 288 219 178 182 186 162 139 146 170 181 179 179 183 180 177 189 221 251 257 237 206 180 166 164 176 201 226 229 207 184 179
-529A79Lj2k7j9lPK1M4M9J9rPM2L6j4m5k0J1jk8j6K8M3Nl7m1k1j6k5j5J9M6M1K3J9K1Nk5l0
$$ 179 182 170 143 124 121 128 149 193 242 261 252 259 301 337 323 278 258 269 268 240 224 252 295 300 263 222 201 185 160 145 164 210 251 274 293 314 319 294 264
-534B64r%j9l2j3J3J2qj7j1nOL3M6K2rmK7K4j1k6%K6J8nk1l9m9k7J6K2k9o4k5M4O9M8K7J3
$$ 264 255 255 236 204 191 204 216 208 191 180 175 181 214 260 282 273 269 296 320 309 283 283 309 327 322 301 262 213 186 202 224 195 131 106 150 219 267 294 307
-539C07j7m4l6qj0k9j5K7L7PnK6M1Ol9m1k0k0k8j2J8J9oj0K3M7K7k3m7k3K9N7L1k4n3l8j4
$$ 307 290 246 210 202 192 163 148 175 212 219 214 240 281 287 248 207 187 167 139 127 145 164 158 148 171 218 245 222 175 152 181 238 269 245 192 154 140
-543A40k0m0k8J7M4L6J9K3K9Ol1l4NL6K3lLK8J3m4o9k2M7O0K2lLkl1l5J4N8M0k2n4l2MJ1l
$$ 140 120 80 52 69 113 149 168 191 220 226 195 161 166 202 225 222 225 253 266 222 153 131 178 238 260 257 260 258 227 192 206 264 304 282 228 196 200 211 208
-548B08mRK4K2Omjnk2l8k3J5M0L3J1looKNj3m4m8j6J7J8Jpj7l4l0J2N0L5rk0J4L6K1KJ2K9
$$ 208 204 213 237 259 265 261 260 255 233 195 172 187 227 260 271 268 262 256 258 263 250 206 158 142 159 177 178 171 154 120 90 102 152 187 178 158 172 208 229 231 243 272
-553B72J7qj1RJ8jl0m0j6J8K6%l1l2j3pj2nJ8L1K4K1K4J3j9m0k8okrqQK1J7kk5k8jL1K8mk0
$$ 272 289 281 270 279 297 296 266 226 210 228 254 254 223 191 178 171 159 154 172 203 227 248 272 285 266 226 198 192 190 181 173 181 202 219 217 192 164 163 194 222 218 198
-558A98oLj4k4nJ4ol5k8QK1LrJ0L3L3J7Nnk0l4l1j2J0J7Mj3j2J2L7M1L7L3K0nj8kOl0o8m3
$$ 198 192 195 181 157 152 166 160 125 97 105 126 129 120 130 163 196 213 218 213 193 159 128 116 126 143 147 134 122 134 171 212 249 282 302 297 279 277 283 253 185 142
-564A42L5P5L0l1l7nOmPL6K8k8p3n4KL1J3k1l2j5J6M0M0Rl5n1j8M0O9M5ml0k5rj1k6l2j1K3
$$ 142 177 252 282 251 214 209 215 211 218 254 282 254 181 127 129 160 173 152 120 105 121 161 201 210 175 124 106 146 215 260 256 226 201 192 181 155 123 112 135
-568A35L8J5k1k9ML6L1%k7m0m4l2KK9K1%J0L9L2k1o2m7j1MNK2M8N0K3NNPrl2n0n6m1%M6O3
$$ 135 173 188 167 138 142 178 209 209 182 142 98 66 68 97 118 118 128 167 199 178 116 69 58 62 67 89 137 187 210 215 220 227 218 186 136 80 39 39 85 148
-573A48L9kk7j9J6M5M3J3rnMMJ7M6N4J0n3p2m5j7j4mK1L6K3PONj0k2j3KMnj8k9l5k3KJ4QP
$$ 148 187 185 158 139 155 200 243 256 247 242 246 250 267 313 367 377 324 252 207 190 176 172 193 229 252 259 265 270 260 238 225 227 231 226 208 179 144 121 123 137 145 152
-578A52K2L1J2qkJ3RkQK3J4j7k8j3%KJ0K1Nm3p1n1pK1K9L1K8J5OLj5m7n3lN6O0J2l0k5KK2
$$ 152 174 205 217 209 207 220 229 227 235 258 272 255 227 214 214 216 226 247 252 209 138 87 80 101 130 161 189 204 210 213 198 151 98 95 151 211 223 193 168 170 192
-583A92M0O4O7K3l9o8l9RK7ln2o9l0L3O0L1j0j6LNk4m6k9J2M1M5L3K0K0K6K3Jk4l0j7j4k0
$$ 192 232 296 363 386 347 279 240 249 276 273 221 152 122 155 215 246 236 220 223 228 204 158 129 141 182 227 260 280 300 326 349 350 326 296 279 265 245
-588B45j1K2M1J5l5n3k6J4K9K1Rj1l8n7m2JM1N0K7Jj0mNRJ7K0Nk3l8j8J0J3kJK5L5J1j2nR
$$ 245 234 256 297 312 277 224 198 212 241 262 271 260 222 165 123 124 165 215 242 243 233 229 234 243 260 280 285 262 224 206 216 229 227 228 253 288 299 287 282 291
-593B91rm7m8kL0Nm3m6LM2L0j0k8j1J6K6J9Kj5j7lNrl3j8M0Q1N5rm3l3k4l7l4KL1Rl4m3j9
$$ 291 282 235 187 185 215 220 177 131 134 176 206 196 168 157 173 199 218 220 205 188 185 190 181 148 130 170 251 306 297 254 221 197 160 126 128 159 168 134 91 72
-598G2nj3lL9P5N8Nl1j9K1M7K9j8n0l8jK3J9J8K9K8qm7l8J7O5O6L8J5J0Lj7l9n3n1k9JJ3j4
$$ 72 67 54 51 90 165 223 228 197 178 199 246 275 257 207 169 168 191 210 228 257 285 277 230 192 209 274 340 378 393 403 406 389 350 297 246 217 218 231 217
-602B17n4n3lM4L6LkK3K5j1l5j3K0J9pj7j3k1k1J1N5N4Ok7j0J4J1KQQj7l9k5jpk4lL9M6Ok3
$$ 217 163 110 107 151 187 190 188 211 236 225 190 177 197 216 209 192 179 158 137 148 203 257 263 236 226 240 251 253 261 269 252 213 188 187 180 156 153 192 238 244 221
-607B21kL3L5J4lj7m1n1k5J4J8j6m2k0L0N9L8pl6k5RL9L6Ll0k9NL6K4j0k7j5j2k8k4K0O0L3
$$ 221 219 252 287 301 298 281 240 189 164 178 196 180 138 118 148 207 245 238 202 177 186 225 261 264 234 205 210 246 270 260 233 218 206 178 154 174 234 267
-612B67l5o3l1MPJ5N0O9L0k1k0K2K8j7n2l7okrJK0J1j4k1KK2J2j4k0mRLmRL1K7j1m6m2j1J2
$$ 267 232 169 138 142 149 164 214 283 313 292 272 294 322 305 253 216 210 208 199 200 220 231 217 196 198 220 232 218 198 194 203 206 202 211 242 269 258 212 170 159 171
-617A71J4J3J7J3MNJ2%l1n0k8RK7J7%j5k4k2j6k4m2k9K3O8N3Nj1J4K3pl3k2k%LL0N2K7k7n5
$$ 171 185 198 215 228 232 237 249 249 218 168 140 149 176 193 193 178 154 132 116 92 50 21 44 112 165 170 159 173 196 189 156 134 132 132 135 165 217 244 217 162
-622A62m0j9j3j2mMJ7M1N6K9k2l6RN3L9pk0PJ8j2l7j8K0L2J0rlJ8K5J0j1k4j5J0L5L7J4j9
$$ 162 122 103 90 78 74 78 95 136 192 221 199 163 172 225 264 257 237 244 262 250 213 195 215 247 257 248 245 263 288 298 287 263 248 258 293 330 344 325
-627C25l9l3qJ1Qj9l9l0KK7K5Nj3k7k8j3K3M9K9k7o2m3kJ4LOK7L1Jk8j9J1K4J4nk0l2l0pJ8
$$ 325 286 253 245 256 264 245 206 176 178 205 230 235 222 195 167 154 177 226 255 228 166 123 121 135 138 144 171 202 203 175 156 167 191 205 200 180 148 118 111 129
-631A29J6nj3MK0J6OJOJ8L5M8L4ml6n0m8l3LM4N0J3j2QL4K2j5k1JRoj8j8k5k8lL1K0l4n5k0
$$ 129 145 140 127 131 151 167 173 174 180 198 233 281 315 311 275 225 177 144 147 191 241 254 242 250 284 306 291 270 271 280 274 256 238 213 185 182 213 233 199 144 124
-636A24Rj8m8j7M5N9J7j5j0NOJ2L2L9K5J0Mmj7j6kNKJOnk0j1J4Ql8o4l6J5M1M8N4M5Jl9l2
$$ 124 133 115 67 50 95 154 171 156 146 151 157 169 201 240 265 275 279 275 258 242 240 245 247 248 254 249 229 218 232 240 202 138 102 117 158 206 260 305 306 267 235
-642B35OK1kk9m0m0k4J5M3K6j7k6%J6KoKOolK2L1Qj1KK2J7jpj4l1l9j6J1J1RK8L8%n5n3NM8
$$ 235 241 262 260 231 191 151 127 142 185 211 194 168 168 184 186 180 182 188 182 179 201 232 240 229 231 253 270 269 262 248 217 178 162 173 184 193 221 259 259 204 151 156 204
-647B04K6j9l5k3j0nJJ4L8O0N4Nn1o2k8KPJ5L1K2j4k9QM3K4j9k3LNk1k4QL0J6lkO%rKJ3ll5
$$ 204 230 211 176 153 143 138 139 153 191 251 305 310 259 197 169 171 178 193 224 246 232 203 211 254 278 259 236 239 244 223 199 207 237 253 250 248 254 254 245 247 260 257 222
-652B22m2qL6M6J7k2k9lK0Pk8m6k5J6M6N4M2K0lj8l0l5k6LL1L3J4lj3k8m0l3rJolK3L8K3k
$$ 222 180 172 208 254 271 249 220 217 237 244 216 170 145 161 207 261 303 323 320 302 272 237 211 214 245 278 292 289 276 248 208 175 166 167 161 158 181 219 242 240
-657B40jJ1Ll0n8o9o7m3J1P4R9O4Jl6k8NK6J8mj5ojj5l3l5k4j5qJ1L6M9M2K7Pj4j6QL4K8m
$$ 240 239 250 253 223 165 96 29 -14 -3 71 170 234 235 199 171 176 202 220 216 201 195 194 179 146 111 87 72 64 75 111 160 202 229 236 222 206 214 248 276 272
-662B72k4j7lNJ0K0K1jk8m3l7j3QNj1j0J8L3%l7j9M3O4K1k9l6k4k1j0K1L0jk1J3N1L0k1k3
$$ 272 248 231 228 233 243 263 284 283 255 212 175 162 170 175 164 154 172 205 205 168 149 192 256 277 248 212 188 167 157 178 208 207 186 199 250 280 259 236
-666B36J9L1pl8k8qlKJ3km0m2J4O0M3j1l8l1j9qJ4L8K8nj9%K4K6Ll4o3n8j3L8M9K4KQK5J8
$$ 236 255 286 279 241 213 205 202 204 217 215 175 133 147 207 250 239 201 170 151 143 157 195 223 218 199 199 223 249 252 218 155 97 84 122 171 195 197 205 230 248
-671B48j1m1m7l0oJ7L4L9K6LqkKpqJ2L2J0l7n4k6OJ4J8L6M0Lm1m5j7LNONnj4kJ9K5J2%j1l1
$$ 248 237 196 149 119 113 130 164 203 229 232 224 222 224 217 209 221 253 263 226 172 146 152 166 184 220 260 263 222 177 160 163 168 174 179 174 160 158 177 202 214 214 203 172
-677A72l8rL1L6J2kOMrjL3N4L4%k5l8m3k7JJl0m6k1QKj6ON4P4M8J6jrk2k4jL0L3%m4n5j9K2
$$ 172 134 125 156 192 204 202 208 212 203 202 235 289 323 323 298 260 217 190 191 192 162 116 95 103 105 89 95 149 223 271 287 286 277 255 231 230 260 293 293 249 194 175 197
-682A97K6pk8j1J7K1Jj1j0KK0M3M6Rm3o6n2k4mOPNOQjk7m3k7NK1K4L5N0M3J4ponj4k0j1oj9
$$ 197 223 216 188 177 194 215 216 205 195 197 217 260 306 315 272 206 154 130 126 132 139 144 150 158 157 130 87 60 65 86 110 145 195 238 252 245 239 234 220 200 189 183 164
-687A64l5l3j7%J6L0L3K0Lmpj4j4KK4L0J6KJmk1m2l7MN4P1M0pk4nJ7Pk0k7%L0K9lm1o2o3l9
$$ 164 129 96 79 79 95 125 158 178 181 177 170 156 142 144 168 198 214 216 217 213 192 150 113 117 171 242 282 275 251 246 263 270 250 223 223 253 282 279 238 176 113 74
-692G4QO0Q2N1jl0l1k7l0k7j0%pj4j2j4k1kM5P8N3%k1J1M7M6Om2o2l2L2O6K9l6n9k2J7J6j0
$$ 74 82 142 224 275 274 244 213 186 156 129 119 119 112 98 86 72 51 49 94 172 225 225 204 215 262 308 314 272 210 178 210 276 305 269 210 188 205 221 211
-697B11k3j4RL1L5J2k3l5k0JJ8L5M4J6l7o4m0JJ5Kj3j7j1J1M5O6N3J0l4n8n3k3NPpj4rj6k5
$$ 211 188 174 183 214 249 261 238 203 183 184 202 237 281 297 260 196 156 157 172 174 161 144 133 144 189 255 308 318 284 226 173 150 155 162 155 141 132 116 91
-702I1pK5K2k6n4k2L2M6K6J2J2R%%K%NJ9K1PPK6K0l0o2k5L4K9j9k1K3L1j6l9KL7J4k2j3Pj3
$$ 91 84 109 131 105 51 29 61 107 133 145 157 166 166 166 168 168 173 192 213 220 227 253 273 243 181 156 190 219 200 179 202 233 217 178 180 217 231 209 196 203 190
-707A90m8l3K3N3L2%lJ6K3Qk4m6l0J5M0Qm6n4JO5Q1M1j2m2m1l0k6j9KK9L7K2Llmrj7k6l1k6
$$ 190 142 109 132 185 217 217 214 230 253 261 237 191 161 176 216 224 178 124 125 190 271 312 300 258 217 187 161 142 144 173 210 232 235 232 228 219 202 176 145 119
-712A19jL1L8J0k5l0nK4L4J9j1k0ML0J9j9k7n%l2l7K0O7K9n4p5j8L7L4J6K6M8L8Ropj6l2l2
$$ 119 118 149 187 197 172 142 137 161 195 214 203 183 187 217 236 217 190 185 185 153 116 136 203 232 178 103 85 122 156 172 198 246 284 293 287 280 264 232 200
-716B00j1J3K2J9Pnj7k6l2k4JK9L5Rk8m5k6J1L6K8jj9j3qj6j3K0O1N6Rk7k1Jml2m6l0LK6L1
$$ 200 189 202 224 243 250 245 228 202 170 146 147 176 211 220 192 147 121 132 168 196 195 176 163 155 139 126 146 207 263 272 245 224 225 221 189 143 113 116 142 173
-721A73J7KkNO%jOMj2j9jK4K6Qqk1l3l2qJ8J3j8k3J1L7J7k2k5OL0K8K3K9K0pk2j0J3K2K6K9
$$ 173 190 192 190 195 201 201 200 206 210 198 179 178 202 228 236 228 207 174 142 134 152 165 147 124 135 172 189 167 142 148 178 206 229 258 278 271 249 239 252 274 300 329
-726C29J0l5o6m3kMj4lK9K6j8l4KJ9j8m6MP8P0j9p8m9K3O0N1K2j2l9l9j2J1Mj3j8j1mopjJ3
$$ 329 339 304 238 195 193 197 183 180 209 235 217 183 185 204 186 140 144 222 292 273 195 146 169 229 280 302 290 251 212 200 211 215 202 184 173 169 163 156 155 168
-731A68K5K1J2J7K3Ml8m6J1O7L6n0q8l1M5O7M7L1J4j5m1m2l5m3l8KM8N5L2K0K4Rl2o1n3k2
$$ 168 193 214 226 243 266 270 232 186 197 264 300 250 162 131 176 243 290 321 335 320 279 237 202 159 121 123 171 226 258 278 302 311 279 218 165 143
-736A43MK4L9M2K3rk4j1J3J9Kj4mJ6J7qk4j9j6k8l5k2j1j9j4K1N4M5J0KK3K6j0n5o1k2L1N2
$$ 143 147 171 210 252 275 266 242 231 244 263 265 251 247 263 280 272 248 229 213 185 150 128 117 98 84 105 159 204 214 216 239 265 255 200 139 117 148 200
-740B00K5j7j6K4M0j0p4p3j3K8K3J4J9Nl2m8j2K9K9JoJ2J6pl0l0j0J7L9M1K3jj7j8pRK5L2
$$ 200 225 208 192 216 256 246 172 99 86 114 137 151 170 175 143 95 83 112 141 142 136 148 164 157 127 97 87 104 143 184 207 206 189 171 164 173 198 230
-745B30L3L5L2J2j0j8j5k7n4o6m3mK2L0K6J0j5k4j9j7j2J7O5P8K5m2n5j4J2jk2k2j4qJ1L9
$$ 230 263 298 330 342 332 314 299 272 218 152 109 105 127 157 183 193 178 154 135 118 106 123 188 266 291 249 194 180 192 191 169 147 133 125 136 175
-749A75M2Qk3qL1M2Rk6l2k6l0l1nL7N4K5qoK3K6pl9l4r%j3j7MK4J6j0k9k5oJ1J6Rqj7KL9N6
$$ 175 217 225 202 194 225 267 276 250 218 192 162 131 126 163 217 242 234 228 251 277 270 231 197 188 188 175 158 162 186 202 192 163 138 132 143 159 168 160 143 145 184 240
-755B40L0j0j6Kpn2p3l2K7L2pk5OM0L8J1j2k1j9kJ6J5ok1j8j9k5j2K1L1Jk9j4K5M2M0N0O0
$$ 240 270 260 244 246 239 187 114 82 109 141 134 109 115 155 193 204 192 171 152 150 166 181 175 154 136 117 92 80 101 132 133 104 90 115 157 197 247 307
-759C07L6rk6j7k5n9p0l3J7L9L5K7J1j5l1k5j7k0j5PK3Lk8k8KK1J5K1M8N5J0l9k5L9O5J9l0
$$ 307 343 334 308 291 266 207 137 104 121 160 195 222 233 218 187 162 145 125 110 117 140 143 115 87 89 110 125 146 194 249 259 220 195 234 299 318 288
-764B88j6J6j1o9o6ON1J7l0j6J8Nl5l8j0LLK5N1L0k3l4JRk5l2J7N0Mo1o7k6JRL3N5K6l5n4
$$ 288 272 288 277 208 142 148 199 216 186 170 188 193 158 120 110 113 116 141 192 222 199 165 166 175 150 118 135 185 189 128 61 35 36 45 78 133 159 124 70
-769G0j1L3K9KoJ7M1M2J7j6k9j4PRKJ0L1L8K2kk4m3m3j8J1J5Jpoj3l1k6QL9L1nk9k1OK3Qk3
$$ 70 59 92 121 123 117 134 175 217 234 218 189 175 182 191 193 203 234 272 294 292 268 225 182 164 175 190 191 184 178 165 134 108 116 155 186 181 152 131 137 160 168 145
-774A45m2l3j3KK0M2M9K7k%J5jn1p2k6M5O8L4nj0PJl5o8n4KM3L3NJ0M9O5L2j2k3j0lj3k3k4
$$ 145 103 70 57 59 79 121 170 197 195 195 210 209 158 86 60 105 173 207 202 192 199 200 165 97 43 45 88 121 126 136 185 250 282 270 247 237 234 221 198 174
-779A74j9jJ5J3mpK1L9J0l3l0K0M2pp1p0jN5M1j7m8k9J4M3N4M9K0l0o6n4j2Rkj2%J5Mk1k7
$$ 174 155 154 169 182 178 171 192 231 241 208 178 198 240 233 162 92 91 146 187 170 122 93 107 150 204 253 273 243 177 123 111 120 118 106 106 121 125 104 77
-783G7j7nOJ8J7nj9QN6O9L3j1k3j9l0m8l3J3M8M1J4OK6M6L8Mk7l6k5rLO%j4j6PL6K8j9n7m6
$$ 77 60 55 61 79 96 91 72 80 136 205 238 227 204 185 155 107 74 87 135 176 190 196 222 268 306 310 283 247 222 213 216 222 222 208 192 199 235 263 244 187 141
-788A41nJ4JrJ0L6L8J9Jj3k7k7jL1L3Nj4pKnj7j4j5l1l5qJ5jk3NO2O3on2k1K0oo0n0J7M9K2
$$ 141 136 150 151 142 152 188 226 245 246 233 206 179 178 209 242 247 233 226 228 223 206 192 177 146 111 103 118 117 94 99 161 224 218 166 145 165 159 99 49 66 115 137
-793A37omql9n1j2L1K8RJ8L9K3k3m8l6j2RM0P4P5M0kk1k7l1k1NK4K5J8K2K4J2j0k3k4k1k2
$$ 137 131 127 119 80 29 17 48 76 85 103 142 165 142 94 58 46 55 95 169 244 284 282 261 234 203 182 187 211 236 254 276 300 312 302 279 255 234 212
-798B12k0j8j2jK0L4L4J7j0l3l8j5J3J7j1l3k4NK6K9K8J8kj5LL5K8k2o4m5MJ6j5l2nL1L1N
$$ 212 192 174 162 161 181 215 249 266 256 223 185 170 183 200 189 156 132 137 163 192 220 238 236 221 224 259 287 265 201 156 160 176 161 129 124 155 186 191
-803A91j1j0j5k4j2J5K6Rp%Lj1j4J4M5K8k3n1l3oKLJ1J5MkRJ5Mj0lRNoLK5K7Jj7qJ1J1ok3
$$ 191 180 170 155 131 119 134 160 169 162 162 165 154 140 154 199 227 204 153 120 114 116 119 130 145 149 147 156 171 175 165 162 171 176 170 173 198 225 226 209 201 212 223 217 194
-808A94k0jJ9J8pl6m0j9RK7K3nm0m5jM5L8jj3J8K8j1m7k6K0L0RJ0L2K9ok9j2Pkj9k2j4j3j3
$$ 194 174 173 192 210 203 167 127 108 117 144 167 162 122 77 76 121 159 158 145 163 191 180 133 107 127 157 166 176 208 237 231 202 190 197 195 176 154 140 127 114
-813A14opk4l3j2K6N4O2N3K6pk2rjj8l7k4NJ5J0J2J8nm0m3oK6K7J7J7Ll2n0k9LJ3J5L3L9M
$$ 114 108 101 77 44 32 58 112 174 227 253 246 224 215 214 196 159 135 140 155 165 177 195 190 150 107 101 127 154 171 188 191 159 109 80 83 96 111 144 183 187
-818A87l9l2PK0PJ4M5M5nm9l8pNQK4L1%l5l0KJ4%j2j8l3l7kM4M4Mj3PJ4j9m1kN3N5Ml6k7M
$$ 187 148 116 123 143 150 164 209 254 249 200 162 155 160 168 192 223 223 188 158 160 174 174 162 144 111 74 72 116 160 164 151 158 172 153 112 110 163 218 222 186 159 163
-823A63J9Kl4n3k6L1O4M6Oj5k0l0l1kK9J3l4n1j7J8J1nPL8M4K4J8L5L8Jm9o0k0L0M5K0opJ0
$$ 163 182 184 150 97 71 102 166 212 218 203 183 153 122 120 149 162 128 77 60 78 89 84 91 129 173 197 215 250 288 289 240 180 160 190 235 255 249 242 252
-828B52J3ok1j9mJpj8k4k5k2j4KJ5J3JlQJ6lk5j5K6N4L6lk8l2k6lL0L8ln4n1KL9K5J%R%j6
$$ 252 265 259 238 219 215 216 209 191 167 142 120 106 108 123 136 137 134 142 158 155 130 115 141 195 231 228 200 168 142 139 169 207 204 150 99 101 140 165 166 166 175 175 159
-833A59j5jQK3M7N3J3m4o4l4LRmj3lJ2J9J5PMPJ0J3J4Jl0m9k1L7O0K2k4k7j3k4m0j3M9O8K2
$$ 159 144 143 151 174 221 274 287 243 179 145 148 157 153 140 137 149 168 183 190 194 201 211 224 238 239 209 160 139 176 236 258 234 207 194 170 130 117 166 234 256
-838B56k7k1RPk7m1j3J7Ql0n2k6K2N4N0L4K5J9nl8m9k9oJnoKPJ4J8J4rl3l4rK9N5N7K9k0n5
$$ 256 229 208 217 224 197 156 143 160 168 138 86 60 82 136 186 220 245 264 259 221 172 143 137 138 133 127 129 136 150 168 182 173 140 106 97 126 181 238 267 247 192
-843A92n0j3J6J3%J4L4J3m4o6pO5N4k7p1l3J6Pk3qL4M0J1jJ5Mm2p3m4J4N4O4M8J2j9j6QRk2
$$ 192 142 129 145 158 158 172 206 219 175 109 102 167 221 194 123 90 106 113 90 82 116 156 167 166 181 185 143 70 26 40 94 158 206 218 199 183 191 200 178
-848A78l9j6J7K6K4K6J0l0n1k3K2L5J8Knj0JL5M7Ko0o9j7L0M1K9Jm6p7m7K6O5L5qj7pqrLR
$$ 178 139 123 140 166 190 216 226 196 145 122 144 179 197 199 194 184 185 220 267 269 209 140 123 153 194 223 224 178 101 54 80 145 180 172 155 148 140 131 134 143
-853A43rk6j0K5M6N0N4M8J7j9l7m9o4o8l4J7L7K1LNPnj5lJ9L3K5mm0m9k1K1L7K2J0J2J4J0
$$ 143 134 108 98 123 169 219 273 321 338 319 282 233 169 101 67 84 121 142 145 150 157 152 137 134 153 186 211 207 167 118 97 118 155 177 187 199 213 223
-857B23J4K3Nl6n9l0K1M0K4QJ0Qpk4l5m3l7nL1L4Mj1J2L3Kn3o1oM9M8Pj5kJ7Qk2m5l8rJ9K6
$$ 223 237 260 265 229 170 140 161 201 225 233 243 251 244 220 185 142 105 100 131 165 169 158 170 203 205 152 91 85 134 182 189 174 172 189 197 175 130 92 83 102 128
-862A28J5lj8k4j5RL2L5J9Lnj2k5k1OL6L8J0j4rJ7L7K8ol3l1j3lj0rJ1L3L2J1mj1j9k4nL0
$$ 128 143 140 122 98 83 92 124 159 178 181 176 164 139 118 124 160 198 208 194 185 202 239 267 261 228 197 184 181 171 162 173 206 238 249 245 234 215 191 186 216
-867B16L6nn6n8nM0L2jJL4L6j7o0l1K9L4k3n0mM3K7j8j9J0J2j8k5jNk2l8j3K6L9L2K7L2L4
$$ 216 252 247 191 133 128 168 200 199 200 234 270 253 193 162 191 225 202 152 148 191 218 200 181 191 203 185 160 159 164 142 104 91 117 156 188 215 247 281
-872B81K3j5o7r2n6RM3L0J2Pj0l8l7lK0J1QK8K6k7o9l8K9N0K2QK5K4j8n6n0j6LOJ0L0N5O6
$$ 281 304 289 222 130 74 83 126 156 168 175 165 127 90 87 107 118 126 154 180 153 84 46 75 125 147 155 180 204 186 130 80 64 67 73 83 113 168 234
-877B34L7j7n5m9k2j0j4pJ1J8Oqj8k6k7nJ6J4KJ6M8N7K9mk1k7l0j9ljoQL1K4j4l0kK7J8on
$$ 234 271 254 199 150 128 118 104 97 108 126 132 124 106 80 53 48 64 78 80 96 144 201 230 226 205 178 148 129 126 125 119 127 158 182 168 138 136 163 181 175 170
-882A70J2J8Lj0j5j1MJ5Ll0m1j3J4J2pj3j1j8j7RL4K8mj8nRJ0Mj0k5j4K3M9L4MjQj1l9l2J0
$$ 170 182 200 203 193 178 167 171 186 189 159 118 105 119 131 124 111 100 82 65 74 108 136 132 114 109 118 128 132 122 97 83 106 155 189 193 192 200 189 150 118 128
-887A28K8OoJ3K4jk1rQnj5OK8Lm5m7MM3L0Lnrl4n1k0L7N1Mm9m9kL9M1K3Prl0l7j1K5L0nl6
$$ 128 156 162 156 169 193 192 171 162 170 165 150 156 184 187 142 95 99 142 172 175 170 161 127 76 56 93 144 148 99 50 48 87 128 151 158 149 119 82 71 96 126 121 85
-892H5k7jJ0OJ6L5K6k0n9n2rK5L4L0K0Mj3pK2M0J7k3l5mL1L1Kk7l2j1J9M0K1l0p1n7lL8L3
$$ 85 58 57 67 73 89 124 150 130 71 19 10 35 69 99 119 123 110 103 125 165 182 159 124 120 151 182 184 157 125 114 133 173 194 164 93 36 33 71 104
-897A04OqjJ8M1N1K8k1n0k9J8L1Lj8pQrm2m6j0L2M1J9lmJ0J2jrJJ0pl3k4K1M8J8l5n1j8J5
$$ 104 110 102 101 119 160 211 239 218 168 139 157 188 191 173 166 174 165 123 77 67 99 140 159 156 152 162 174 173 164 165 175 168 135 111 132 180 198 163 112 94 109
-902A09K1J7J8J0j3k6j7mqj5kK4L6K7QnrjJ1J1nj8j0kj1j8%K7K6Kj5j5j5j6J0M9N6J9j7j3
$$ 109 130 147 165 175 162 136 119 115 107 92 90 114 150 177 185 180 171 170 181 192 187 169 159 157 146 128 128 155 181 183 168 153 138 122 132 181 237 256 239 226
-906B26PJ1ok5l9l5kM1M5Pk0j4j7n3p1k8K4J7k2j1M8O3J1l2j0K6J0m3o6m0QL9L7J1q%J6km6
$$ 226 233 244 238 213 174 139 137 178 223 230 210 196 179 126 55 27 51 68 46 35 83 146 157 125 115 141 151 108 42 2 10 49 86 97 89 89 105 103 57
-911E7n2jN3N6K7J1Lj8l4j3K4J9j7k4K3O7O0J4k3l2l4l7k9mK5K7Kk4k1KJ6RkjNKmoqj3nK5
$$ 57 5 4 57 113 140 151 154 136 102 89 113 132 115 91 114 181 241 255 232 200 166 129 100 96 121 148 150 126 105 107 123 132 130 129 134 136 132 126 118 105 100 125
-916A25M6K7j2k5pJ1MnRL2L4Ok7m0k6olj8k1ML5L7Nk5k0J7M3K6k5o0l7J7M8L3Kj4j9j4OK6
$$ 125 171 198 186 161 154 165 169 164 173 205 239 245 218 178 152 146 143 125 104 108 143 180 185 160 140 157 200 226 201 141 104 121 169 202 204 190 171 157 163 189
-921A89Pm6o8k7K9L0jkL0M1K2J0J1j2n0m3J0L1rm7j9L2L5J0J3L8K4k3m0j3J2Lj1qjnkJ3J3
$$ 189 196 150 82 55 84 114 113 111 141 182 204 214 225 213 163 120 130 161 152 105 86 118 153 163 176 214 238 215 175 162 174 177 166 158 157 152 150 163 176
-926A76j3k6lJ9Kl1k2K2M1J1k3j5J3K0%j2KJ9J2rk4k3k4k6j2K3N0L7j0m5l7mJ8Rj3k0rNLj0
$$ 176 163 137 134 153 155 124 102 124 165 176 153 138 151 171 171 159 161 180 192 183 159 136 112 86 74 97 147 184 174 129 92 88 106 115 102 82 73 78 81 71
-931G1j3NL2L8J6ljJ2Oj4j5J3K9Qk6l2j2j2k6qM2O1J2n1m9KK5QNL3L9qn3m4q%lJ9M7K4l4n3
$$ 71 58 63 95 133 149 146 145 157 163 149 134 147 176 184 158 126 114 102 76 68 110 171 183 132 83 85 110 118 123 156 195 187 134 90 82 82 79 98 145 169 135 82
-936H2pL6K0k5l8j1J8L3L6K9J2NJ6J4k4o1m1K2N9L7%plk8o1m8RN1N1L5L3K6j7o7p3k3L6N6
$$ 82 75 111 131 106 68 57 75 108 144 173 185 190 206 220 196 135 94 116 175 212 212 205 202 174 113 65 74 125 176 211 244 270 253 186 113 90 126 182
-941A82L6%l0m1k8KL2M1L3J2j6l6l6j3J0J9K6L6K9pm3m1j2mk8l6RO0N9Ol1k7nOJ6L1L5J6m
$$ 182 218 218 188 147 119 121 153 194 227 239 223 187 151 138 148 167 193 229 258 251 208 167 155 151 123 87 96 156 215 221 190 163 158 164 180 211 246 262 258
-945B58omk2m1k9MJ5rk9k0%QJ0K6M4M1K0%j5k6l2k3pKJ0K0J6j7n2m4PM4L4ok9k1mJ2K6L0K2
$$ 258 252 248 226 185 156 160 175 166 137 117 117 125 135 161 205 246 266 266 251 225 193 170 163 165 175 195 211 194 142 98 105 149 183 177 148 127 123 135 161 191 213
-950B13J0kj2k6k8j6jpk4k7MM8O0K1l6n4j0M7N3J3k2k3j8k3oM1O9L0k7k9K1M6J0l3k9mkj7
$$ 213 223 221 209 183 155 139 138 131 107 80 84 132 192 213 177 123 113 160 213 226 204 181 163 140 134 175 244 274 247 218 239 285 295 262 233 229 227 210
-955B10j5kj4m4m8%N0N1Rj8KL7M2Rk6l7l5l9l7j1K1K8Lj7jM2O4M8J1j1j6k8m8m6jM3K1m7p5
$$ 210 195 193 179 135 87 87 137 188 197 179 181 218 260 269 243 206 171 132 95 84 105 133 136 119 118 160 224 272 283 272 256 228 180 134 133 176 197 150 75
$$ [...]
-1605D99
##END=	
##END=	
