##TITLE=	4e8L5tKBS6yy8aElK1m3vA.42.ser
TM-VI-273, CD3OD, Y+Ph-pyr. hmbc

##JCAMP-DX=	6.0	$$ MestReNova 14.3.0-30573
##DATA TYPE=	LINK
##BLOCK_ID=	1
##BLOCKS=	2    
##ORIGIN=	Mestrelab Research S.L.
##OWNER=	hrzepa
##$MNOVA/LINK_BLOCK_TYPE=	ITEM	$$ NMR Spectrum
##$MNOVA/ITEM/POLYGON=	(XY..XY)
5321,5835
8722,5835
8722,8208
5321,8208
5321,5835
##$MNOVA/ITEM/Z=	0
##$MNOVA/ITEM/ANGLE=	0
##TITLE=	4e8L5tKBS6yy8aElK1m3vA.42.ser
##JCAMP-DX=	6.0	$$ MestReNova 14.3.0-30573
##BLOCK_ID=	2
##DATA TYPE=	MNOVA NMR VIEW DATA
##DATA CLASS=	MNOVA VIEW DATA
##$MNOVA/2D/THRESHOLD=	0.89373493194580078125
##$MNOVA/ITEM/ZOOM/X=	-0.47501081208716700033,	14.504330000039219684
##$MNOVA/ITEM/ZOOM/Y=	-9.5107036222489718114,	249.98529999918474687
##END=	
##TITLE=	4e8L5tKBS6yy8aElK1m3vA.42.ser
##JCAMP-DX=	6.0	$$ MestReNova 14.3.0-30573
##BLOCK_ID=	3
##DATA TYPE=	nD NMR SPECTRUM
##DATA CLASS=	NTUPLES
##NUMDIM=	2
##ORIGIN=	Bruker BioSpin GmbH
##OWNER=	nmr
##.OBSERVE FREQUENCY=	400.41280287000000726
##.OBSERVE NUCLEUS=	^1H
##.SOLVENT NAME=	MeOD
##.PULSE SEQUENCE=	hmbcgplpndqf
##LONGDATE=	2022/02/22 20:52:12.000
##.ACQUISITIONMODE=	SIMULTANEOUS (DQD)
##$ORIGINAL FORMAT=	Bruker XWIN-NMR
##$MNOVA/SCALES_VERSION=	9
##$PARAMETER FILE=	(acqu2s, ASCII, /private/var/folders/f6/rjf_tdyn2v98c5c0wvkgn4s80000gn/T/4e8L5tKBS6yy8aElK1m3vA/42/acqu2s, 0)
$$ ##TITLE= Parameter file, TOPSPIN		Version 3.2
$$ ##JCAMPDX= 5.0
$$ ##DATATYPE= Parameter Values
$$ ##NPOINTS= 129	$$ modification sequence number
$$ ##ORIGIN= Bruker BioSpin GmbH
$$ ##OWNER= nmr
$$ $$ 2022-02-22 21:11:48.483 +0000  nmr@CZC10666PP
$$ $$ /opt/topspin/data/agmb/nmr/Feb21-2022/42/acqu2s
$$ $$ process /opt/topspin3.2/prog/mod/go
$$ ##$ACQT0= 0
$$ ##$BF1= 100.683175
$$ ##$FnMODE= 1
$$ ##$NUC1= <13C>
$$ ##$NusJSP= 0
$$ ##$NusT2= 1
$$ ##$NusTD= 128
$$ ##$O1= 12080.308799824
$$ ##$SFO1= 100.6952553088
$$ ##$SW= 259.972631192251
$$ ##$SW_h= 26178.0104712042
$$ ##$TD= 128
$$ ##END=
$$ 
##$PARAMETER FILE=	(acqus, ASCII, /private/var/folders/f6/rjf_tdyn2v98c5c0wvkgn4s80000gn/T/4e8L5tKBS6yy8aElK1m3vA/42/acqus, 0)
$$ ##TITLE= Parameter file, TOPSPIN		Version 3.2
$$ ##JCAMPDX= 5.0
$$ ##DATATYPE= Parameter Values
$$ ##NPOINTS= 12	$$ modification sequence number
$$ ##ORIGIN= Bruker BioSpin GmbH
$$ ##OWNER= nmr
$$ $$ 2022-02-22 21:11:52.386 +0000  nmr@CZC10666PP
$$ $$ /opt/topspin/data/agmb/nmr/Feb21-2022/42/acqus
$$ $$ process /opt/topspin3.2/prog/mod/shimcntl
$$ ##$ACQT0= 1000000
$$ ##$AMP= (0..31)
$$ 100 100 100 100 100 100 100 100 100 100 100 100 100 100 100 100 100 100
$$ 100 100 100 100 100 100 100 100 100 100 100 100 100 100
$$ ##$AMPCOIL= (0..19)
$$ 0 0 0 0 0 0 0 0 0 0 0 0 0 0 0 0 0 0 0 0
$$ ##$ANAVPT= -1
$$ ##$AQSEQ= 0
$$ ##$AQ_mod= 3
$$ ##$AUNM= <au_zg>
$$ ##$AUTOPOS= <12 >
$$ ##$BF1= 400.41
$$ ##$BF2= 100.683175
$$ ##$BF3= 400.41
$$ ##$BF4= 400.41
$$ ##$BF5= 400.41
$$ ##$BF6= 400.41
$$ ##$BF7= 400.41
$$ ##$BF8= 400.41
$$ ##$BYTORDA= 0
$$ ##$CAGPARS= (0..11)
$$ 0 0 0 0 0 0 0 0 0 0 0 0
$$ ##$CFDGTYP= 0
$$ ##$CFRGTYP= 9
$$ [...]
$$ 0 0 0 0
$$ ##$ShimPowMaxUC= (0..63)
$$ 130000 130000 130000 130000 130000 130000 130000 130000 130000 130000 130000
$$ 130000 130000 130000 130000 130000 130000 130000 130000 130000 0 0 0 0
$$ 0 0 0 0 0 0 0 0 0 0 0 0 0 0 0 0 0 0 0 0 0 0 0 0 0 0 0 0 0 0 0 0 0 0 0 0
$$ 0 0 0 0
$$ ##$ShimPowMaxUG= (0..63)
$$ 524287 524287 524287 524287 524287 524287 524287 524287 524287 524287 524287
$$ 524287 524287 524287 524287 524287 524287 524287 524287 524287 0 0 0 0
$$ 0 0 0 0 0 0 0 0 0 0 0 0 0 0 0 0 0 0 0 0 0 0 0 0 0 0 0 0 0 0 0 0 0 0 0 0
$$ 0 0 0 0
$$ ##$ShimPowRcbType= 3
$$ ##$ShimPowRes= (0..63)
$$ 1e-20 1e-20 1e-20 1e-20 1e-20 1e-20 1e-20 1e-20 1e-20 1e-20 1e-20 1e-20
$$ 1e-20 1e-20 1e-20 1e-20 1e-20 1e-20 1e-20 1e-20 0 0 0 0 0 0 0 0 0 0 0 0
$$ 0 0 0 0 0 0 0 0 0 0 0 0 0 0 0 0 0 0 0 0 0 0 0 0 0 0 0 0 0 0 0 0
$$ ##$ShimPowRng0= (0..63)
$$ 1 1 1 1 1 1 1 1 1 1 1 1 1 1 1 1 1 1 1 1 0 0 0 0 0 0 0 0 0 0 0 0 0 0 0 0
$$ 0 0 0 0 0 0 0 0 0 0 0 0 0 0 0 0 0 0 0 0 0 0 0 0 0 0 0 0
$$ ##$ShimPowRng1= (0..63)
$$ 1 1 1 1 1 1 1 1 1 1 1 1 1 1 1 1 1 1 1 1 0 0 0 0 0 0 0 0 0 0 0 0 0 0 0 0
$$ 0 0 0 0 0 0 0 0 0 0 0 0 0 0 0 0 0 0 0 0 0 0 0 0 0 0 0 0
$$ ##$ShimPowRng2= (0..63)
$$ 1 1 1 1 1 1 1 1 1 1 1 1 1 1 1 1 1 1 1 1 0 0 0 0 0 0 0 0 0 0 0 0 0 0 0 0
$$ 0 0 0 0 0 0 0 0 0 0 0 0 0 0 0 0 0 0 0 0 0 0 0 0 0 0 0 0
$$ ##$ShimPowRng3= (0..63)
$$ 1 1 1 1 1 1 1 1 1 1 1 1 1 1 1 1 1 1 1 1 0 0 0 0 0 0 0 0 0 0 0 0 0 0 0 0
$$ 0 0 0 0 0 0 0 0 0 0 0 0 0 0 0 0 0 0 0 0 0 0 0 0 0 0 0 0
$$ ##$ShimSysFunc= (0..63)
$$ 1 2 3 4 5 7 9 11 15 16 8 10 12 14 6 17 13 18 19 20 0 0 0 0 0 0 0 0 0 0
$$ 0 0 0 0 0 0 0 0 0 0 0 0 0 0 0 0 0 0 0 0 0 0 0 0 0 0 0 0 0 0 0 0 0 0
$$ ##$ShimSysMatrix= 0
$$ ##$ShimSysType= 1
$$ ##$TFXNUM= 0
$$ ##$TRIPLO2= 0
$$ ##$VTU= 2
$$ ##$VTUETH= <149.236.99.20>
$$ ##$VTUTY= <no>
$$ ##$WBREFAM= (0..15)
$$ 135 116 100 100 100 100 100 100 100 100 100 100 100 100 100 100
$$ ##$WBREFLM= (0..15)
$$ 0 0 0 0 0 0 0 0 0 0 0 0 0 0 0 0
$$ ##$WBREFPH= (0..15)
$$ 71.66 -68.25 0 0 0 0 0 0 0 0 0 0 0 0 0 0
$$ ##$WBSGU= (0..15)
$$ 0 0 0 0 0 0 0 0 0 0 0 0 0 0 0 0
$$ ##$XFAC= 2
$$ ##END=
$$ 
##$DECIM=	3328
##$DSPFVS=	20
##.ACQUISITIONSCHEME=	NOT PHASESENSITIVE
##NTUPLES=	nD NMR SPECTRUM
##VAR_NAME=	FREQUENCY1,	FREQUENCY2,	SPECTRUM
##SYMBOL=	F1,	F2,	Y
##.NUCLEUS=	13C,	1H
##.OBSERVE FREQUENCY=	100.69525530880000019,	400.41280287000000726
##VAR_TYPE=	INDEPENDENT,	INDEPENDENT,	DEPENDENT
##VAR_FORM=	AFFN,	AFFN,	ASDF
##VAR_DIM=	512,	512,	262144
##UNITS=	HZ,	HZ,	ARBITRARY UNITS
##FIRST=	25169.313707327481097,	5807.6787752999953227,	0.17111030220985412598
##LAST=	-957.56783717514929322,	-190.19907926730809322,	0.39134803414344787598
##MIN=	-957.56783717514929322,	-190.19907926730809322,	0.00092415715334936976433
##MAX=	25169.313707327481097,	5807.6787752999953227,	2.8562891483306884766
##FACTOR=	1,	1,	0.0029245489486968319348
##PAGE=	F1=25169.3
##FIRST=	25169.313707327481097,	5807.6787752999953227,	0.17111030220985412598
##DATA TABLE=	(F2++(Y..Y)), PROFILE
$$ [...]
##PAGE=	F1=-11030
##FIRST=	25169.313707327481097,	5807.6787752999953227,	0
##DATA TABLE=	(F2++(Y..Y)), PROFILE
1958F3K9J13m7q0R1L8j33J19LN6o6j17J19rj14L5oM4M8r6l9Q3m1J51mj04k6o4R3L6o6J72L8
1570C19j73n8N9q9J17k4qM5m9L6Np8K7M8j20K43r5j12R3K08j01j03p5K6j13K20j37Q8O4j92
1218G1J15j50pN4mLQNJ3J4k5mN4j23J98j28N4J01qo4n4j9R6O9q8QkJ5p6PM4j02J46n6n6o7
796D2j0R2M5P2m7j48J36nm0n9M0p2J19m3r2M1Q1k0p5J17n8R3O1p2j54J65n0n0k6K03l9k07
420D0M9K9Q0N3j17J54K1j01Ro7N5j48QR2K99j4l52N7p7oM3m8J36k0j52L7mJ14o1J2p2M4j6
33G7J2K06q1j79L0O0p0j8O8m8K5N6Q6j99J21Op1R3p4
$$ plain form
1958 63 92 205 158 78 169 207 74 193 196 252 186 69 188 179 65 100 94 138 186 90 51 134 93 244 240 136 110 46 139 175 109 281 319
1570 319 146 88 147 58 175 151 143 188 139 175 180 102 129 177 57 300 205 93 186 394 293 190 115 141 28 248 111 199 263 71
1218 71 186 36 29 83 79 82 90 95 108 122 97 93 147 24 222 94 148 249 241 177 123 104 200 269 181 189 187 202 126 133 177 75 221 165 109 42
796 42 32 124 169 241 194 46 182 177 137 78 118 46 165 122 30 71 152 132 57 174 116 209 270 198 44 209 159 109 83 286 247 40
420 40 89 118 198 251 134 288 309 208 217 150 205 57 65 157 456 442 90 147 70 64 107 59 195 175 23 60 56 170 109 121 49 93 77
33 77 89 295 214 35 65 125 55 37 105 57 82 138 224 25 146 152 81 174 100
-190A00
##PAGE=	F1=-11132.2
##FIRST=	25169.313707327481097,	5807.6787752999953227,	0
##DATA TABLE=	(F2++(Y..Y)), PROFILE
5808B8K9R7QM1j5r5n2M7M2k2M6mm3lQ3p1j3j0L7l0n1O9k2pM5k9R1q1m5k6J2P3rm3L9m1N2O8
5362A95M3q0o9k1O6mm0J64j14r4L7m2L3P4J25k01P3q6K23j30r1J05J11O0j47j09QJ05mR0j58
4998A22j6Q6J7j13J2J38j68m3O2Rm4k5K3M9o2O3NpQ8J2j14q1R7rl1R6p5K6l6J47Rq0R3j52
4599I8nL9p9Lk7J39J8j68M1M8Q6j48Q9p5L4RlP2M8j43N9m1P2M2j30O8O8j65N9jp6J58q8P1
4200A72j08%j1J47m9j36J78n9N9m6p2J07J0j06J11L1p8l1k5M5P1J0n2J20j86l0k8R3j5j15
3848GM0Q7J6l3k6P2p8K0N1j7k4l4qm0J39j01J33m1L3p7Jl0L4M8Q0j68K8o1k4N6J6j8K1n2j4
3437C6J49O7j04N9o4J11n4p5q5K27o6p4l6O1J09l0k20Q7K2n0QJ30p5r2O9l7P2q7Q1pP1k8O
3049A81q5q5J11MJ33k23J46j18J2oJ11j12Q0j18J11k7J6k1O7m0j0j06L1N2M6p6NO4J8j31J4
$$ plain form
5808 28 57 154 162 203 188 93 41 88 130 108 154 150 107 104 187 116 103 93 130 100 49 118 96 89 134 105 196 115 70 44 56 129 120 77 116 75 127 195
5362 195 238 158 89 68 134 130 90 254 140 46 83 41 74 148 273 72 145 59 282 152 61 166 277 337 190 81 89 194 190 280 122
4998 122 106 192 209 96 108 246 78 35 97 106 62 37 60 109 47 110 115 108 196 208 94 13 110 101 70 166 91 117 81 228 237 157 250 98
4599 98 93 132 53 56 29 168 186 18 59 107 193 45 134 59 93 102 99 171 219 76 135 94 166 208 78 146 214 49 108 107 31 189 101 172
4200 172 64 64 53 200 151 15 193 134 193 147 75 182 192 86 197 228 150 119 94 139 210 220 168 288 102 72 44 137 122 7
3848 7 47 134 150 117 91 163 85 105 156 139 115 81 73 33 172 71 204 163 196 119 120 90 124 172 252 84 112 51 27 83 99 81 102 50 36
3437 36 185 252 148 207 143 254 200 125 40 267 201 127 91 152 261 231 11 98 120 70 78 208 133 41 110 73 145 58 139 132 203 175 181
3049 181 96 11 122 126 259 36 182 64 76 70 181 69 149 31 142 115 131 110 177 137 127 21 52 104 150 74 79 143 161 30 44
2685D4R0N3j55Q9k4j0j4M6O1L2q1l9J2r0J19n2R1j41%J12J47P7k23n5l3M8K1L9o5m5qJ52p1
2298A27j3J3j6Q4K0k2J12j13p9k9m7R1l4R1j10K9no0J51rn1j11J45m4k3J7m6Lk9jJ24kj07
1911E6R8N1j09Q8l4O9m3j14J75j9j52K5J6OQ7j29J2O7p9J39Oj02K1r1P4P4j7Q3J0j56p7R3
1535A28p5Q3K3L2l0o5M0N1j3Mmj45K37r2j02J18J98j14j02r7Q0q6J39o6Q8N7k22R6j24K9N3
1171A19p0j8J20n8K8M0l9l2N3r3J61j81J32Q4l9n9k3K1J9M4n6K6Lj8J3M6L7k30J41j6o3k9
796F3K0P0%J27k6j98J21m6Qj15M5nQ9m0q1O7Q0nr1J37j25Q3R6m7j54L1oN0r1K05j6k16P7k2
397H5J19P0j06J26n4o4N0l4k1j19J3J42K18J4l83R0j02K3M0j0J14o3r8%k3J32n3K7p3Q8k2
33A26j9K18j27j36j5P6m6N0olNj7P1j20Q3J7n9O7o9
$$ plain form
2685 44 134 187 32 121 97 87 73 119 180 212 131 92 104 14 133 81 172 31 31 143 290 367 144 89 56 104 125 164 99 54 46 198 127
2298 127 114 127 111 195 215 193 305 192 113 84 37 128 94 185 75 104 99 39 190 181 130 19 164 120 97 114 68 71 42 41 165 163 56
1911 56 154 205 96 184 150 219 176 62 237 218 66 91 107 113 200 71 83 150 71 210 216 114 135 44 118 192 175 258 268 112 35 128
1535 128 53 136 159 191 161 96 136 187 174 178 174 29 266 174 72 190 388 274 172 75 155 69 208 142 230 287 65 161 37 66 119
1171 119 49 31 151 93 121 161 122 90 143 50 211 30 162 246 207 148 125 146 165 209 153 179 182 164 177 223 260 30 171 155 92 63
796 63 83 153 153 280 254 56 177 131 139 24 69 64 153 113 32 99 179 174 83 220 95 178 274 227 73 104 98 148 57 262 246 30 107 85
397 85 204 274 168 294 240 176 226 192 171 52 65 207 425 439 56 146 44 67 107 97 211 148 50 50 27 159 106 133 60 148 126
33 126 107 325 198 62 47 123 77 127 121 118 123 106 177 57 140 157 98 165 96
-190I6
##PAGE=	F1=-11234.5
##FIRST=	25169.313707327481097,	5807.6787752999953227,	0
##DATA TABLE=	(F2++(Y..Y)), PROFILE
5808A5P1R2n0M6K7o6j19J05J5m1M5Rl7J3Qo6N3o5O9m2m8R7l9k2J4l9J46q3Lq5P0Jj0K0K1n3
5385G5L5Q1J10j11j32O5O6l7p9J76q0o9J6o1kM3J81j70M4j10K02j30k7Q0Q7L1j17o6p1J16
5033A46mJ27j21m1J06Kj49L1J14j35n7R0rl8k7K6N1p1K7P4nR1J8j71k2J03k0l3O7q0N2l8J05
4646B09Jr7Q1j29j8R5p6j7OJ15Pj41N6K5L3j30R0p7K7jL7M9O8n4j1o8N1Qp8N7P0j19K1Op1
4235B5J93m8J1j16L7n7J15m1p5J66r2J30q3r6J30l1o6Q4mp7RM0L0N0k3p3J23j75J1l1P3j6
3859A23o8L5R6m6o4K8Q8j27RL7j7L3n5J9o3J63j62J17J4L3m9j9j2L1lJ06j48pl6kj0L9J8N
3460A06o2JJ52P8j04L8m6M2J9j36m9J56M2j36kK8J17qj82R3lo2k3R6l1n5J1n4Q8o6O8N5O8
3073B39n1Nq3m7J06L4M0k07J68j78R7o9J43r7K8o5N8J1k2l2Q7NM2r8o6K5J6n1N9RK4p1k6J13
$$ plain form
5808 15 86 178 128 174 201 135 16 121 136 95 140 149 112 125 133 67 120 55 124 82 34 131 92 70 84 45 191 108 111 26 96 97 87 107 128 75
5385 75 110 191 301 190 58 123 189 152 73 249 169 100 116 55 53 96 277 107 151 41 243 113 86 166 253 284 167 101 30 146
5033 146 142 269 148 107 213 215 66 97 211 76 19 109 100 62 35 61 112 41 68 142 137 228 246 75 53 156 136 103 170 90 142 104 209
4646 209 210 113 194 65 47 142 66 49 55 170 177 36 92 117 150 20 110 33 60 59 96 145 213 159 148 80 131 139 61 118 188 69 90 96 25
4235 25 218 170 181 65 102 45 160 119 44 210 118 248 165 69 199 168 102 186 182 105 114 154 184 234 211 138 261 86 97 66 139 123
3859 123 55 90 186 140 76 104 192 65 74 111 94 127 72 91 28 191 29 146 160 193 144 125 113 144 141 247 99 92 56 54 44 83 101 106
3460 106 44 45 197 275 171 209 163 205 224 88 39 195 237 101 99 127 244 236 54 147 144 82 59 155 124 69 80 26 114 48 116 171 239
3073 239 188 193 110 63 169 203 243 36 204 26 123 54 197 100 128 63 121 132 110 78 165 170 212 114 48 73 89 38 97 106 130 59 33 146
2674A46L4j07N4M2j20M1P6j1M3n0Jj0p0M7n2J10j32k6J10J80Q1k42k4o0M3j0J3L4o6PP0o2
2298I0L7L4j7L8K2n4J37r6r8J4lK8l5N9r4P6j0r1J75j8k0j59J60l5rl7l1J9m8nP2N5j14Q0
1899A22O9q7N2m7O7k4r3J79rj56L5Lj9J05j48N6M7j10J08K5p2P3j32Q1J19l4j4J4j22p0J11
1535A29q4P1J14k2r8n3M1P8M0j9m5j50K05p3r6J45J68j21o3j02R3n6O9j3Q1N4k24N8p2M5M5
1171A45j32P1J07j05K9Q1j8q7K8j1R5j70J31M6o7m4N2L7o5K3l9M6ml7Q6O9L9k33P2l0m4J7
796H8N1L0l5J81%k22P5q4O9j16KO8M3l4n5N5Q4Ro9J06j64N6J26k1j55q7P8Q7j25J82j0j72
420D1O2k3J08R4o7P7j32JN5pr1q7O1J53J20K1l45Q9o5OM8J1Q9p6l9m6qR5m0L4q1J34l0l1J89
9C20j60n7o3R2L6L0n2M0kj18N7l8K7L2l8L4o0
$$ plain form
2674 146 180 73 127 169 49 90 166 155 198 148 149 139 69 116 64 174 42 16 126 306 387 145 121 61 104 94 107 141 75 82 152 90
2298 90 127 161 144 182 204 150 287 191 93 107 104 132 97 156 62 138 128 37 212 194 174 15 175 140 131 94 63 82 34 29 101 156 42 122
1899 122 191 104 156 109 176 152 59 238 229 73 108 111 92 197 49 105 152 42 150 175 103 176 44 125 244 210 196 210 88 18 129
1535 129 45 116 230 208 110 57 98 176 216 197 152 2 207 134 38 183 351 230 167 65 158 102 171 158 239 293 69 127 55 100 145
1171 145 13 84 191 86 115 196 178 91 119 108 203 33 164 210 143 99 151 188 123 146 107 153 149 112 198 267 306 73 145 115 71 88
796 88 139 169 134 315 315 93 168 84 153 37 39 107 150 116 61 116 200 209 140 246 82 138 264 243 88 1 79 166 41 223 213 41
420 41 103 80 188 282 215 292 160 161 216 209 118 31 92 245 365 386 41 130 65 71 119 130 219 143 104 58 50 145 105 139 58 192 162 131 320
9 320 160 103 40 132 168 198 146 186 184 66 123 85 112 144 106 140 80
-190H0
##PAGE=	F1=-11336.7
##FIRST=	25169.313707327481097,	5807.6787752999953227,	0
##DATA TABLE=	(F2++(Y..Y)), PROFILE
5808IJ03Q9j21O2N9k9j37J09j4l7L8Ml5L6n5n3J18j16J06o3n8J18n4Pk0J6J16p9L9j11J10
5444A57k8o4P7k3m7J2Q0J76j14k03J43O7r5p3J65m3p3K0o5m7N7J79j29J1q1J42j00j2N1Q0
5092B20Lp3k6q6M8j0J59o7o2J15j4j69M1Q1p8n0Q8Jn7j1J7N4q3J1J02j3J14Jj86QR7l0k7L8
4693A56p8J11k1J7j3j05P3j04kJ12p8kL4N7mj02Q1k7j0n3N2q5K4%Q1rJ02L1r0p1J6l5k9O3
4294I2P3q2qmk8K18l1l1j15M6q3P5j8m0J40j03J89j02j03J09o2l2O0qq5O0P0jK5k7p2R9j35
3906H6J3k9N0k1lM9P3q5r8J18O9j61j2L7m7J10o7J1oR6j64Q3P1kNn4rM1j9J09j14l5j3rl6
3495C7L1N5J2o0kJ21Q9q2J4l9pO9j66k3Q7J10j70K2oJ30J3j51Q2po4m3M1Lqk9m9J20n5RJ18
3085B02O7r1qo0JJ00K3qj94J73j93J56j16J59o3n7j0K0L6l5p6R9N5R5p0j36m0M3o5R4l2K5
$$ plain form
5808 9 112 201 80 142 201 172 35 144 130 93 131 135 100 136 81 28 146 30 136 73 15 133 79 86 66 82 198 119 158 47 157
5444 157 129 65 142 119 72 84 164 340 226 23 166 233 138 65 230 187 114 134 69 22 79 258 129 140 59 201 101 89 140 220
5092 220 223 150 124 38 86 76 235 168 106 221 207 38 79 160 82 32 120 121 64 53 70 124 41 52 154 141 255 256 70 78 175 145 118 156
4693 156 78 189 168 185 172 67 140 36 34 146 68 66 100 157 153 51 132 105 95 42 94 9 33 33 114 105 207 238 148 77 93 58 29 92
4294 92 165 83 75 71 43 261 230 199 84 130 47 122 104 64 204 101 290 188 85 194 132 100 160 152 67 127 197 196 221 194 122 221 86
3906 86 99 70 120 99 96 145 218 133 35 153 222 61 49 86 39 149 82 93 87 183 19 102 173 171 176 122 113 154 135 244 130 95 82 73 37
3495 37 68 123 135 75 73 194 283 201 215 176 169 238 72 49 136 246 76 98 92 222 235 84 166 159 95 52 93 96 88 59 10 130 75 84 202
3085 202 269 178 170 110 111 211 234 226 32 205 12 168 52 211 148 91 81 101 137 102 26 125 180 275 205 69 29 72 7 101 69 94
2709I4k5o6J35J8l3%J12k28R2J13q9M8k2L9m0m5K0p4J12j02k1O8J96P2k20Ln8K4n5j4J00o0
2333I4K1j4o1Q6O8k1k0J3n5J35p5r7P2JKj2oq4J23k3j09J72kJ1j87J59k8k1m0m4J1LL9p0R9
1923A40p0RQ7o7J7k8M4jo8J37J2j24L9k4j1Q7j38N8L9j18O1M8k1J06j66R8J44q0j08M7n7k9
1547F3P3o4M9J68j01j40J8L0O6N9m4o4r1J11k5q7J45J26j18Kj04Q0m8M7KP4O2j65m0lM2L4
1171A57j31J23N3j29K5J26K3j46j4O7M6j19O8jq7k2J55K9j30K3n6O2k3m3J28P3M9j80J3r0
819D9KO3N5%n5K21K2k31K5j11J25r4m0J21j3k2l1M0P9J8m1O5j64J8J42pj46j5K5P0j15J24
444A79l0j05L6L7M0J16j2J6j87O9K6J6j44m6J21J23K6Mk33O3j1l9P3J2O8p5%m8JL4k3K9r9
56C7J66k0m0J37j69L3q1Q6J11qp1N9qj81K8K5l2N8k1Kn6
$$ plain form
2709 94 69 3 138 156 123 123 235 7 99 212 123 171 149 188 148 103 123 49 161 59 38 106 302 374 154 157 99 123 68 54 154 94
2333 94 115 101 40 126 194 173 153 166 111 246 171 74 146 147 149 137 131 47 170 147 38 210 208 219 32 191 163 142 102 58 69 72 111 41 140
1923 140 70 79 166 99 116 88 132 131 63 200 212 88 127 103 92 179 41 99 138 20 81 129 108 214 48 146 290 210 102 149 92 63
1547 63 136 72 121 289 188 48 66 96 162 221 177 113 22 133 108 21 166 292 174 176 72 152 104 151 153 227 289 124 84 81 123 157
1171 157 26 149 202 73 98 224 247 101 87 154 200 81 149 148 61 39 194 223 93 116 60 122 99 56 184 257 306 126 139 49
819 49 51 114 169 169 114 335 357 126 151 40 165 71 31 152 139 117 86 126 205 223 182 247 83 101 243 236 90 75 100 170 55 179
444 179 149 44 80 117 157 273 261 277 90 159 185 201 57 11 132 255 281 285 52 115 104 65 138 150 218 143 143 95 96 130 107 136 37
56 37 203 183 143 280 111 144 63 149 260 252 181 240 232 51 79 104 72 130 109 111 55
-190E5
##PAGE=	F1=-11439
##FIRST=	25169.313707327481097,	5807.6787752999953227,	0
##DATA TABLE=	(F2++(Y..Y)), PROFILE
5808A1J16R5j77O5P8J5j17O4l9rK5j2k6M3q7QJ20j45J33p7q1J17n7P1rL0O4p4M8j10J22j6
5432A89j23J18q1l6mN9K28j01k36J74P3j54n7J46k8q6N4o7l8Q5J02p8k2k3Q3n8m2K1Q4j5k1
5068A46Lp2l8M2J22k1o9Q8k0j49L0N4k5j2N6K3q0j0MP0j04K8Q5k7J44k9j58QP8l7j9K0p2J75
4669B34j2o5k9r2N9q2N9P2q1K9L6Pj1o9J12r8K9l2K7q4K2N8N3q0J38Q4j45n5j4m6JM7P9p0
4270H1j3jj0K30k1n2r7L0j03O0jk9J02r0K26r8j01N9p7j6L8L0j03R1Q2m1jln4N7q8rj1Pk4
3859E0Q1O0L5r6j15J86M6j75l8P6r4J50n9k5N4J5j00J7J17n3P6r4k3O7QO1q7k1lk7l6KQ2K9
3460A66m8qP2R3m8pm0l1R3j70%K8J27j75L2l3J46L3j24N8%n5n7j2J7L4l8k3J27n4o2J73P6
3073B90j38l8j3M5Q5j5oj98J76j42J51j22J45k0j47L1ML4rm4kJ08J36l5j87p2J07q8N8l8O
$$ plain form
5808 11 127 222 45 110 188 203 86 150 111 102 127 115 89 132 45 53 173 28 161 84 3 120 63 134 125 155 219 145 193 83 205 189
5432 189 66 184 103 67 63 122 350 249 13 187 260 106 49 195 167 81 135 68 30 115 217 139 117 94 177 119 77 98 182 167 146
5068 146 149 77 39 81 203 182 113 201 181 32 62 116 91 79 135 158 78 68 72 142 38 66 151 124 268 239 81 89 167 130 111 131 59 234
4669 234 222 157 128 36 95 13 72 144 63 92 128 135 124 55 167 69 98 66 93 9 31 89 142 62 200 284 139 84 70 24 25 72 151 81
4270 81 68 67 57 287 266 214 117 147 44 104 103 74 176 86 312 214 113 172 95 79 117 147 44 135 217 176 175 172 118 175 87 78 67 74 50
3859 50 131 191 226 130 15 201 247 72 34 110 16 166 107 82 136 151 51 68 185 132 208 114 91 158 166 227 140 119 116 89 53 55 137 166
3460 166 118 110 182 275 227 220 180 149 242 72 72 100 227 52 84 51 197 230 106 164 164 109 52 40 57 91 53 30 157 103 41 214 290
3073 290 152 114 101 146 231 216 210 12 188 46 197 75 220 200 53 84 88 122 113 69 67 175 311 276 89 17 124 36 94 56 62
2709F2Jk3P2J3M0m7J59k29N3J46j41L7j4P1n3l5Rn2O9n4oJ7J82M9j62K6l7kj05KR2l6L5n4
2310H5m7P8J08l1p8lk7J02n0p3J15k0K2po5p2J60l9j05J34L6M2j98J38k0n4k1p2K1P1O1j18
1934G3N3j1p5Q9m5qOJ6L6m1M4L6o5K2m3K2M6j03K3M0o3NM3J3J21j72J06J46j34j69P7J8j0
1547I6N2k2KJ75j64j16O9K8L6L6o8o0k1J5M7m4P7Q5j04O3j16P3o5Q3k4P1P9q2j64O9L9J0j03
1160E2J38oj30K9J57P3j80o6J10K4r0Qm1l9MJ99Oj55L9p9M4l6l9J26N0O4r0l2j00L4O7K8j5
772A54n7K32L6k22j6j22J57q6l7J47p8Nj6M0N1K5j3K2j39rJ39mj25K7j6Q4r6O1p1k7kJ23l3
385A34J13M4m6j77Q6j7M1j64M5J17N9n4l1q0M5J3p2J05pN1p6L8k7qj2lK1j13J50J2m5P4j31
-2H5R5q2O9J65m0p4M4j8j70KM3p8R0k1k0o4
$$ plain form
2709 62 63 40 112 125 165 118 277 48 101 247 106 143 129 200 147 112 121 69 138 84 78 95 277 326 164 190 153 151 46 48 140 104 139 85
2310 85 38 116 224 193 115 112 85 187 137 64 179 159 181 174 109 37 197 158 53 187 223 265 67 205 185 131 110 38 59 130 191 73
1934 73 126 115 40 129 84 76 82 98 134 93 137 173 108 130 87 109 155 52 75 115 52 57 100 113 234 62 168 314 180 11 88 106 96
1547 96 148 126 128 303 139 23 92 120 156 192 124 64 43 58 105 61 138 223 119 182 66 139 74 157 133 204 283 201 37 106 145 155 52
1160 52 190 184 54 83 240 313 133 67 177 201 111 119 78 39 43 242 248 93 132 53 97 61 22 148 198 262 172 140 40 74 141 169 154
772 154 97 329 365 143 127 5 162 76 39 186 108 113 97 137 188 213 200 222 83 74 213 209 84 111 95 179 83 144 73 46 44 167 134
385 134 247 291 245 68 154 137 178 14 59 176 235 181 150 70 115 128 56 161 154 205 129 167 140 132 120 117 138 25 175 187 142 216 85
-2 85 180 98 167 332 292 218 262 244 74 76 119 41 131 110 90 26
-190B6
##PAGE=	F1=-11541.3
##FIRST=	25169.313707327481097,	5807.6787752999953227,	0
##DATA TABLE=	(F2++(Y..Y)), PROFILE
5808B1J03J10j69J2Q7O2q7%n9M1Ol0MJ1p4N4J01j52J45q0r6Q0k7J16J5K3K0o9L5r0J16Mj47
5420H6J42j24l3j5J3K60p7k19J53Q4j77o4J24m6r9J11p2J5J06pj6n3L5N7l8p0j9R3k7K9J9
5056A71o9m6J04L7qn6J5mr7OM7mL6K5L6r7k2j7J05j15L5N8l7J60o5r0nM6n2j1J9o3K21j1j17
4646A35n1l0Ml3Q8K4p1M8K8k7j7n2J42j55J45r7Pp6N3R5Kj42J65J01j62l4k0K3k7oQ2p8ML7
4247A05l1K04nn7o5Kj23P5mk4N6n8K35p4r1Kp2j5K6P7j21Q1R4q4k9M4k6J7o6l2N2q8J4J48
3848A67N8qq7q2J79L6j71n7J17q8J06l1p3R4n6j7m7J46j05J52j32l9J03L9j6o1L2j0m4k5l3
3484D7R1M2k5qJ5R3j3k2m7l4R9j62K2k4J12j52J7k4J42N5r5K8kl6p2k3%N6k9j3J26m7j03J90
3085B04R5j80p8M8P9N5o7M0j65J32q7J38r0J03J7j94L0OKM5K1j19J28J57nk13m6J13j17L7
$$ plain form
5808 21 124 234 65 77 164 226 139 139 80 121 127 97 101 112 38 92 193 41 186 106 10 90 63 179 194 217 237 168 203 113 229 233 86
5420 86 228 104 71 56 69 329 252 33 186 270 93 29 153 107 8 119 47 62 168 161 145 92 127 184 146 76 57 150 123 152 171
5056 171 102 56 160 197 189 133 148 144 47 53 100 96 132 157 193 96 74 57 162 47 82 140 103 263 198 108 103 149 97 86 105 42 263 252 135
4646 135 84 54 58 25 113 137 66 114 142 115 98 46 188 33 178 81 88 12 65 160 162 20 185 286 124 90 70 93 66 60 142 64 68 105
4247 105 74 278 273 216 151 153 30 105 101 77 133 75 310 236 145 147 75 60 86 163 42 123 217 133 104 148 122 139 73 41 93 5 19 167
3848 167 225 217 130 48 227 263 92 35 152 64 170 139 66 160 104 87 40 186 81 233 101 62 165 204 188 127 159 149 105 80 47
3484 47 138 180 155 147 162 255 242 220 173 139 238 76 98 74 186 34 51 27 169 224 129 157 155 119 47 24 24 80 51 38 164 117 14 204
3085 204 299 119 41 89 168 223 156 196 31 163 76 214 124 227 244 50 80 86 88 133 154 35 163 320 315 102 56 169 52 89
2732H9om7J8K8j0L8Q2p4J68j96RJ66j43Pl7J01m1n2JRkMJ8k5J29J2p3L9j0l1j43O2K4j0M8
2322A52k5l5J2J42m6j31J2nN4k9l4J28n5Q1k8j02m6J70n4p9P1P9P4j93R8j7q7mr7P8R7P3j28
1934A26nK8j15M9%o%NP2j8o4N2Mj2m6N2J0o9j0L8J0MkmJ26j47J08J30j80j8p6O0J2N0J4n3
1512A25J43j82k8M0L5K1qr3j7K7l5P9j3ON5q5J03j33Q3j01J56o6P1Q8lk27Q0N3l4p5J31n1
1136A45j02L6J60J21j75j10R6L0p9l6l3O9l0J95k6j51M1o6jj1j6N7nQ1J9o8k6J9L4k8j3m1
761H6K08L9j93l7o9J17r3lJ49j40M9k2N8KL1J3j5j08k7J29J7j15N2q1J64r3J0l7j5o0J98o9
385A45O3Q4r3j02M2n3O6j01N8J12k7j16m1N0M0Jo9J23l6K8p7P9Jk6l2K2K2q2L4N7m2K1m2R5
-14B04p7M9J92n5o8kl1j16J6K5p8R1l8l0p9
$$ plain form
2732 89 83 36 54 82 72 110 192 118 286 90 99 265 122 129 92 193 152 100 101 110 108 112 130 105 234 246 173 212 202 171 28 90 114 104 152
2322 152 127 92 104 246 200 69 81 76 130 101 67 195 140 221 193 91 45 215 161 82 153 232 306 113 211 194 107 103 6 84 181 254 126
1934 126 121 149 34 83 83 77 77 82 154 136 72 124 128 116 70 122 132 63 53 91 101 105 103 99 225 78 186 316 136 118 42 102 114 164 178 125
1512 125 268 86 58 98 133 154 146 53 36 63 28 107 94 100 155 70 173 40 123 22 178 112 183 271 268 41 121 174 140 65 196 145
1136 145 43 79 239 360 185 75 171 201 122 86 53 122 92 287 261 110 151 85 84 73 57 114 109 190 209 141 115 134 168 140 127 86
761 86 294 333 140 103 34 151 58 55 204 64 113 91 149 151 182 195 180 72 45 174 191 76 128 47 211 118 128 91 76 16 214 145
385 145 208 292 199 97 139 86 152 51 109 221 194 78 37 87 127 128 59 182 146 174 97 176 177 151 119 141 163 81 115 172 130 151 109 204
-14 204 127 176 368 313 245 243 212 96 112 137 59 150 112 82 3
-190C
##PAGE=	F1=-11643.5
##FIRST=	25169.313707327481097,	5807.6787752999953227,	0
##DATA TABLE=	(F2++(Y..Y)), PROFILE
5808C5O7J30j32n7R5J02n5o6p4R7j5m0M6m7m5P8Q3j48J45p6j04K6L1J26M2J6k1o3Rn4R6K2
5432B49j29J41j29l1l1n3K61m3j91J26R5j48j01J18p7L2Mn9M6J35j13N2p4P2N6m0o1p7J02
5092A32m2P2K1o8l2J48k3k2k8q1N6p2j1N3j0Q7%L2j06l8m3J55r8PM0k7J40r7nj1J9q8pM7n7
4681D3K29j3j33q2M5o3L0R1j2m6M3K2n4j5n6J61j25J96j67l0n8R9J21n8j53J40R2j40j8j4
4329G5O9l8m9P2o9J6P4n1J35K0n1k9k1j26Q1k1j0Pj8K22m2p3m0l9j0L8O2j32M1J08j16o2R9
3941A22NJ2r9j4J15o4K1J07M0m2p3n0J48L7j47n9J19q2O7Pj18J00r9P1j01J50j42K10j63j8
3589F0J16N2r6k2R4k8n7mp1Q3M0Rkm4J01J8l6o1k2R9j43L4p4R0j06k3P1O3P8p2J2k9j5q3J
3178C3mL0nKR3l1m1R9J20k06m8L7R5J7j19J10j16P4l4J31n3M6M0j98NJ6n0J05P7j48Q0J51
$$ plain form
5808 35 102 232 100 43 138 240 185 119 45 142 127 87 133 86 41 119 202 54 199 123 19 45 76 202 244 260 239 176 185 131 227 249
5432 249 120 261 132 101 70 17 278 235 44 170 265 117 16 134 57 89 93 34 80 215 102 154 80 152 208 168 107 30 132
5092 132 90 162 183 115 83 231 208 186 158 77 133 61 50 103 93 180 180 212 106 68 25 180 82 89 129 102 242 145 140 129 148 60 53 100 43
4681 43 272 259 126 44 89 26 56 147 135 89 132 154 100 85 29 190 65 261 94 64 6 105 226 168 15 155 247 107 89 75
4329 75 144 106 57 129 60 76 150 99 234 254 203 174 153 27 108 87 77 84 66 288 246 173 133 94 84 122 184 52 93 201 85 23 122
3941 122 127 139 40 26 141 77 98 205 245 203 130 80 228 265 118 59 178 96 163 170 52 152 53 124 23 173 31 241 78 60
3589 60 176 228 132 110 204 176 119 115 44 127 167 176 174 130 231 249 213 152 130 229 86 120 46 136 30 7 78 141 219 147 159 130 115 32 33
3178 33 29 59 54 56 149 118 77 176 296 90 42 79 174 191 72 182 66 140 106 237 184 230 270 72 77 93 43 148 225 77 157 308
2803C08Qk16j9J05j40N7K2j10M6N7o8P0Q0q2J42j42k1J69j12k1q0J28j6q8KO9p3O2M5n2N0
2439A80l1L6L5J3n9j51R9j9qN9K6m1l7J56o7j76J07l4L1l9MJ05r1J59o8r9k6J53o1l7%J07
2063B26J08j80N4k6r4qk9P0Q7P8j27m1M0j10qP7On6J7Q1Mj48N4O6n2k4N6kn7pK0P9j0k3n7
1653F4J21r8J07J10j99J00j44RM4N3M6j01Q2j12j3QM3K8l4n0J2Oj4K5J5n6N8p1J04j27R5o5
1277D6J51q9O1P4O1k21L4Q6q3n1J02p1l2K0J33J57j32j51M5N7q0n1K3J04o8J97n7j46L3l5
925A17l6K1nJ0q9J10J03q9K9L0rr8Jj0J48L3j45l9j1Q5j04K4J26j48O9n5R6o4M2L2l8q8l9
538IJ19R4j53J20j03J81j06l1N5n7p2J91o2k6J00j16j7kn5O1n1P0J10j13j33J32m4L1k6l0
185G6J22o4pp2J18K3m3k4M8L2n7j10R9k5jK9O3o9L3J89n0o1o4l6m6N1Oo7Q0n7m1n7
$$ plain form
2803 308 316 100 81 186 46 103 125 15 61 118 50 120 200 118 260 118 97 266 154 133 53 181 165 77 79 148 75 137 182 130 180
2439 180 149 185 220 233 174 23 122 103 95 154 180 139 102 258 191 15 122 88 119 80 84 189 98 257 189 90 64 217 156 119 119 226
2063 226 334 154 208 182 88 80 51 121 208 286 159 118 158 48 40 117 123 67 84 165 169 21 75 141 89 65 121 119 62 55 75 154 144 121 64
1653 64 185 87 194 304 105 205 61 70 114 167 213 112 194 82 69 77 120 148 114 64 76 82 68 93 108 52 110 39 143 16 111 46
1277 46 197 108 169 243 304 83 117 203 120 69 171 100 68 88 221 378 246 95 140 197 117 66 89 193 125 322 265 119 152 117
925 117 81 102 97 107 18 128 231 142 171 201 192 94 95 85 233 266 121 82 71 156 52 76 202 54 123 68 164 100 142 174 136 48 9
538 9 128 222 69 189 86 267 161 130 185 128 56 247 185 159 259 143 126 124 69 130 79 149 259 146 13 145 101 132 106 76
185 76 198 134 127 55 173 196 153 129 177 209 152 42 141 116 115 144 207 138 171 360 310 249 185 149 103 154 160 93 173 116 75 18
-190A8
##PAGE=	F1=-11745.8
##FIRST=	25169.313707327481097,	5807.6787752999953227,	0
##DATA TABLE=	(F2++(Y..Y)), PROFILE
5808E2J7J49r5j15J08J23k1j15q7J42l1m4P8j03k0R0O8j32J31o6p5m4O8J19O7K2o5n2k7j2
5456A30P5L5q3J19j11j9m8k6J36nj56J00J07j06j30J51l2M8j21J6kJ67j90J14q3P7O2m3l3
5115A49j12R7o6J13Jn8k9J79o0m1Mj14J08r3l6N7j6J30j9J6j12m5k6J63n7m6L8LQ0j21P7n
4740A59Pj33J4P3n6K02k1j15j20J07j10P6R2j9k8K2K2q2ko5J55o6K05j99q6NJ00J41j19j15
4387D4O7O6q7%j8J03m0q2N7j2qQ8n7M3N6l5j2k7p7L3m0J4m3K2J96j3m9n7jlN7J6j43oJ22j12
3965F2lM1K7M7j61N8J13k4J5O4J3n6o9k5J07M2j00m9P2o6M4M1j51P2r4J34j36J31j14J93j81
3601D7L8J03M5j59L7J33m5o9J6r8O0K1M4J2r7J21M6n9p9JR8j03K2j11P6o4J7R2k3R2o7J6p1
3214I2Mp4MJ4lL9J8K2JK5kJ39k01K3l0R4j6j21J33p3L8J5J32l1qL6j89mK7j02J50J15j58N4
$$ plain form
5808 52 69 218 123 8 116 239 218 103 16 158 127 83 161 58 38 128 196 64 195 129 54 10 78 197 264 286 221 169 142 130
5456 130 205 240 157 276 165 146 98 72 208 203 47 147 254 148 18 169 137 185 64 80 78 245 55 169 86 163 225 182 149
5115 149 37 134 68 181 182 124 95 274 214 173 177 63 171 78 42 99 83 213 194 210 98 53 27 190 133 87 125 128 208 87 164 159
4740 159 166 33 47 120 64 266 245 130 10 117 7 83 175 156 128 150 172 90 88 23 178 112 317 118 32 37 137 278 159 44
4387 44 111 177 90 90 72 175 135 53 110 98 90 178 121 164 220 185 173 146 69 102 62 76 33 55 251 238 189 132 131 128 185 201 58 52 174 62
3965 62 59 100 127 174 13 71 184 160 175 239 252 196 127 102 209 251 151 102 174 108 152 193 42 114 20 154 18 149 35 228 47
3601 47 85 188 233 74 111 244 199 130 146 48 108 129 173 185 88 209 255 196 117 118 216 113 135 24 100 36 53 145 122 214 147 163 92
3214 92 96 22 26 40 37 76 94 116 117 142 140 279 78 101 71 165 149 28 161 88 126 141 273 242 234 270 81 77 104 2 152 267 109 163
2815A63J17%k00RQ7j48R9M2j51N7P0n7M9N4p8R0p3l2J54p6k7r5J24lj16J5R6j26J07O8o7k9
2439A23l5J16J0K4p6j28R6pm3O4P2m4n9J46r6j03J24o5M8p7K4N5j22K34j15n5l1J20n9J2o1
2075I2J10J42j70K4n4o1l3M8M8N8P7j12o5L3r0j3J29Pj07K5O2L0j63J5J11q4J7K7J3o6K1J
1700G2J32n0j7j01Q8m1J03R7j69J41j53p2P5L8P8j18%Qn4k1N4M4j6K7j8k2j4k7L9r4J04m6
1324F7L1l7M5J0R0q6L7L6J05j86k0J25j13l3N0n5M5kP9J73o1j88k2R3q0k3L1J30r8K04q0j52
948A15K4Om1K5Pj9m3N4J07r7N9O1m8j63K1K4O6K2q1k9M7P3j02PQ9q3L9j04J41j29N6L6l3p8
549B9K5K3K14k25K34q7J18j25p0J35q9p9J54l2j22R5j11N2qk6J3k5P7J12j77k4J63j31Nn3
197F5L0J14q5n6j7J03L4m2jO8M1l8j60M3J0PM2K5n5K2J63l4m8j22j0pR4lo6O9o5o5k7
$$ plain form
2815 163 280 280 80 89 176 28 127 169 18 75 145 88 137 191 113 203 130 98 252 176 149 54 178 175 59 74 170 44 151 219 152 123
2439 123 88 204 214 238 162 34 130 123 80 144 216 172 113 259 163 60 184 119 167 90 114 169 47 281 166 111 80 200 141 153 92
2075 92 202 344 174 198 144 83 50 98 146 204 281 169 104 137 47 34 163 170 63 88 150 180 17 32 143 59 76 103 116 50 71 72
1700 72 204 154 137 36 124 83 186 283 114 255 102 30 105 143 221 103 103 111 57 36 90 134 118 145 127 105 91 64 103 9 113 67
1324 67 98 61 106 116 206 120 157 193 298 112 92 217 104 71 121 66 111 109 188 361 300 112 90 183 103 80 111 241 143 347 267 115
948 115 139 145 104 129 136 117 74 128 235 138 197 258 210 47 68 92 158 180 99 70 117 190 88 95 184 101 140 36 177 48 104 140 107 29
549 29 54 77 291 66 300 213 331 206 136 271 182 103 257 225 103 198 87 139 131 105 118 93 170 282 105 81 244 113 118 65
197 65 95 209 124 68 51 154 188 146 145 213 254 216 56 99 109 116 158 183 128 150 313 279 231 109 99 92 186 183 117 186 121 56 29
-190B9
##PAGE=	F1=-11848
##FIRST=	25169.313707327481097,	5807.6787752999953227,	0
##DATA TABLE=	(F2++(Y..Y)), PROFILE
5808G0j9J50p0j07P8J19J2j29r8J57l7m8R4j40J8O4O1j02J07n3j2n3nJ14Q0M4j09m0n9K6N8
5444A71M4k9Q5q5kn5J8j7L7j22R1J10p7j36J94J1K2k22J03q6K00k25J55q1N4O8m0mj04P5q2
5080G1J42m4l8l5J91q4n5L8n3R6j23q2N8oJ51l1rj12k5K7J13mj04M9K4J2j36J39OLj56N6O7
4693A46o2J63k9q1j22J20j11P3R4Lk4JJ8j08K5o9J21k1J94j74q2PP4J53j72p2K2J6l1M0n0
4329F2J26l9j04M4O1m1P1m9m2R0Om2oj4l6n4M0n2L3J54Mk3o0L0kP2k2j53l7J24o8N7l7K9R1
3918B13j46M9R0K0J3K1j1m9p5j3O8M3l6l3j2m4M7O1j69K6j7J27j56J08n4J20j71Q2R0L0j93
3554B9R4J42m5q4L0j06K9j9P1M0j22J26P6r2r5L6Q7m7mr5M9o0O2J03q2Q7q6L1j10J9k7l2K8
3167C3j2R0L0o4M9P2q2J34j69M8o5Q2j5l4L1l9L5N3J43l2m8Pj77J8K7q2J10J30j65P0O4k7
$$ plain form
5808 70 51 201 131 24 102 221 233 104 6 163 126 78 172 32 50 114 175 73 180 127 115 62 57 171 251 295 186 146 87 113 171
5444 171 215 186 271 186 184 129 147 130 167 45 136 246 169 33 227 238 260 38 141 55 255 30 185 104 158 226 186 182 78 153 71
5080 71 213 169 131 96 287 203 148 186 133 229 106 24 82 76 227 196 187 75 50 77 190 186 82 131 155 167 31 170 176 179 23 79 146
4693 146 84 247 218 137 15 135 24 97 191 194 170 171 189 81 106 37 158 137 331 157 75 82 156 309 137 65 87 103 72 112 62
4329 62 188 149 45 89 150 109 180 131 89 179 185 143 137 123 87 33 73 21 54 208 212 189 129 159 157 229 207 54 17 141 73 130 93 122 213
3918 213 67 116 206 226 239 260 249 200 125 112 180 223 187 154 142 98 145 206 37 63 46 173 17 125 71 191 20 102 192 222 29
3554 29 123 265 220 136 166 60 89 70 141 181 59 185 261 169 74 110 197 150 146 51 100 40 102 205 123 210 124 155 45 64 37 5 33
3167 33 21 111 141 77 126 198 116 250 81 129 64 146 131 97 128 89 124 177 320 288 240 247 70 88 115 33 143 273 108 178 242 215
2791B15j75M5O4r8R3O1j64M4P9k2JK8p0K5Mk7J26m7j5p6J03j8j28L2R1j47J30Q1p6q1N9Q9
2416B26l2K6p2r9O2L9q7O1J03m0n4J12j20J2R6o9O2j11L1kj17K60j50mn0Q0m8N5j04R9J67
2052C32j69K6j04jn9J00K6K1O9p6r1J5o2K5J45Mj27J0K6N5j25l6J29r8O1k4M6q8N6oJ68j16
1676A32K1q2j5J4Q5R4j14J28j40o0N1k7J13r9q2J04p8k6N1M8K0P4m5l4m4n2O4l6Q5k9p4O1
1300A08JP3K4p3Oj9J35j40o0J52j08k4j3lR1pJ1J61J5k11q6J20n9K2j5J59j05K12r7j70K9
937A29M2j6J0J0n9J2M0M7r2O5J06p4j97L3M3j3J7j0k4J01O0j01k4N2j4Qj10J44j56M5K4Mn8
549D4O9o5L02k84L49q0M7j39j05J89j09p7R5Qj85P1q0Q6K1ll4k1P2J06j98L9J76j74l7o4Q7
185A06J10r4q5N5K8L2j4K2P4M2j6j44o4N9J0K1rl3K1J18j1k7j17M7o5J36po6N5n8r7R
$$ plain form
2791 215 40 85 149 51 144 205 41 85 164 142 143 171 101 126 130 103 229 182 167 91 194 176 48 80 171 24 154 235 159 78 137 226
2416 226 194 220 148 49 111 150 63 124 227 187 133 245 125 137 233 164 226 115 146 144 27 287 137 133 83 163 115 170 66 165 332
2052 332 163 189 85 84 25 125 151 172 241 165 74 89 27 52 197 201 74 84 110 165 40 4 133 35 96 72 118 30 86 80 248 132
1676 132 153 71 56 70 155 249 135 263 123 63 114 87 200 101 19 123 45 19 70 118 138 212 167 133 89 37 101 65 150 121 47 108
1300 108 109 182 206 133 139 120 255 115 55 207 99 75 62 59 150 143 154 315 330 119 33 153 94 116 101 260 155 367 270 100 129
937 129 171 155 165 175 116 128 168 215 123 188 294 220 23 56 99 86 103 93 69 170 230 129 105 157 143 151 41 185 29 74 98 102 44
549 44 113 48 350 66 415 335 382 243 138 327 218 141 236 244 59 130 50 136 157 154 120 99 171 277 79 118 294 120 83 19 106
185 106 216 122 37 92 120 152 138 160 234 276 260 116 52 111 121 142 133 100 121 239 228 201 84 131 66 202 195 129 184 126 29 38
-190C8
##PAGE=	F1=-11950.3
##FIRST=	25169.313707327481097,	5807.6787752999953227,	0
##DATA TABLE=	(F2++(Y..Y)), PROFILE
5808H2j5J24o6p5M3R3M5j12j07J41k9n2R4j45O9j0O3o2Q9n4P6q2q1J14O6P7j49k6p1M9M5M6
5432A80J4N3o0J3n4O3j36O1r6J11J01o3j26K10M0qk76J64j64K16k22J77p2J4P2k8J4n9M4p9
5080A04J51j08j5l1J73q9p0O7J1Q0j26j45N6J9J44l4l5r9K3M4O3M9j53O1K6l9j04J27K1kj37
4716C2Q2N0p2J25l4n0r9J08j11O0J00L7k3j2Kj22O0q5Q7jJ66j02n3j6L3J55k11k7M7l2m1R8
4340A51r3J28m3r6K9J16o4K5l1p1R2P3j35M7M5j03n6N0J6OQ3Njo2N4rP6l4j57k4Q8k1J01o7
3941A18lJ21j15L1M7O5J8j9k5k9p3k4M4K7L7j6j03l0P3O4j71L0MJ05j53Q8j7M1j07P0Q6J9
3566B03k01J22J35k2j04L3q9mm3N5P9p7O7J03j21q1O4N6Rk7p1L7q7R4J16j04O7j19M0j11Q
3202B7K5j7k3OJ22M2j41J00R4j13Q6j21L6o2Q4J7j7n7j5O1P3J57n0o2m4j63O7J0q1Q6J25j78
$$ plain form
5808 82 67 191 125 50 93 186 231 119 12 153 124 72 166 21 90 80 143 81 170 116 192 110 29 143 209 286 137 111 40 89 134 180
5432 180 194 247 187 200 146 209 73 134 38 149 250 187 61 271 311 303 27 191 27 243 21 198 126 140 212 184 198 139 183 104
5080 104 255 147 132 101 274 185 115 182 193 273 147 2 58 77 221 187 152 53 76 120 183 232 79 140 166 127 23 150 171 169 32
4716 32 114 164 92 217 183 133 34 142 31 91 191 228 205 193 195 73 133 48 135 134 300 198 145 129 162 317 106 79 126 94 53 151
4340 151 58 186 143 47 76 192 128 153 122 51 143 216 81 128 173 70 14 64 80 86 169 174 173 111 165 156 232 198 41 17 105 84 185 118
3941 118 115 236 121 152 199 264 282 263 238 209 136 112 156 183 220 204 101 71 144 208 37 67 71 176 23 111 94 135 28 98 184 203
3566 203 2 124 259 237 133 166 77 73 30 85 164 87 154 257 136 55 119 175 184 157 86 123 36 130 246 142 209 90 130 19 27
3202 27 52 35 12 18 140 182 41 141 235 122 208 87 123 61 145 162 145 88 73 134 207 364 314 252 208 45 112 122 41 127 252 74
2826G4J18J2o6j02M9L6k4M6Q4j57J6R1J1n4J6n7n1P9rR4l6Qn4J02n6j33L9P3j17J17Q0q1r5
2439E3J51M0p8J9m1p8MR8j14M2J19l2k9N9j13J07N1n0N8j30L5m9n6K11j55J7o8M0l0Q1j27
2075C5Q9J79j81O3j69O7m9Q8RpN6k9r5qk6L2J52Lj12k5j7P4o4l6Q7r3R6q2Q4j05Q1jJ85j92
1676H9P9n8r2M5L8R5n9R8j21%M1j29J30n9n3N9k9j1K7J8L8J03n8k4j03j1Q1qO3j1j37J03k5
1289A19J21l8o0k5p4J64j14m3J23p1k0m4L2J03Pm9J17P9k07j01Q6lN2q7J79q0K12j02j94N1
937A33O0K2l%j15N5M1k0p3N0J51q4j84K6M5m6K2K6k8J42L2r9m7K6L0j4o9J03j21j5RN3m2R6
538A62p4K78k98M18p2j2j43j24K10j20o3K1N3j67K6l8O1O3J6o2k9M5R2j78N9J69j70q4j0P9
185A08J09r2m3M3n0K0L4L8O3L6Qj22j35J01lj7l0kL1O2J3J0m1M5j27J40oo3L8l5j03K4
$$ plain form
2826 74 192 204 138 36 85 121 97 143 227 70 86 177 188 134 150 93 42 121 112 206 170 178 124 226 170 37 76 149 32 149 229 148 53
2439 53 204 244 166 185 144 66 70 168 54 96 215 183 154 213 100 207 258 208 266 136 171 122 66 277 122 139 71 111 81 162 35
2075 35 124 303 122 185 16 83 34 122 131 124 180 151 56 48 22 54 206 209 97 72 55 129 65 29 116 23 119 37 121 16 97 96 281 89
1676 89 168 110 18 63 101 196 137 235 114 114 155 26 156 97 44 103 74 63 90 108 146 249 191 167 64 53 134 126 189 178 41 144 119
1289 119 240 202 142 117 43 207 93 50 173 102 82 38 70 173 180 131 248 327 120 19 105 102 154 67 246 166 378 276 82 133
937 133 193 215 212 212 97 152 193 173 100 150 301 217 33 59 104 58 80 106 78 220 252 153 106 132 162 148 79 182 61 46 55 108 66 162
538 162 88 366 68 486 414 402 259 135 345 225 162 183 236 69 95 57 118 181 197 135 106 151 243 65 124 293 123 39 29 108
185 108 217 125 82 125 75 95 129 167 230 266 274 152 17 118 115 98 68 66 97 159 172 182 141 186 59 199 193 130 168 133 30 54
-190E4
##PAGE=	F1=-12052.5
##FIRST=	25169.313707327481097,	5807.6787752999953227,	0
##DATA TABLE=	(F2++(Y..Y)), PROFILE
5808H7lJ06p6m7J8N3P6p4r7Q8j0m4P1j11J04j09P6k1R7q4J73j29o2O5MJ06j80om1L9K9L8M0
5420A76L5l9J8m8J00j62K8q5J46Q9n2j13J93N7l5k74J83j73J71j99J93n9l1P3j0J8%J2o4J46
5068B94j70jj1J31o6j01R3N7O8j00j64J8L2J19k6n8n7N5L6K8Q3j78O1J0o0k3M2K8nq0Q4L0
4693A69q3R1l6l2o1R6j01K3J09O2j2j5k2j23R6j10N9MJ18ok3l9jJ37k20J7R0l9j16J61j17
4329G6R4n4l9PJ31p1m1rk5M7J46k51J21P6j47m6L0R1LJkPp0O7k1P1j8j26k4N0PJ42n5n5J24
3918B37p6J6qR8L0m8k8j0m5n1K9lJ00lj35n1R3N9j63P7l8Q0j22P1nk9l1K9R0J7j59P6J29J7
3519B43j23K8n4l0M3p9J09j0j5J22j33j2N4J2N0l4o1L5j15R8J30r6N0j23Ml6k9L8J5m2j1J25
3143A53N2j88J29R9r9J3o8nj6J15K9n1j06jR6O6J75p8m8r8j28J05k4r2Q0J18j92J61k2j08
$$ plain form
5808 87 84 190 114 67 85 138 214 140 43 131 121 77 148 37 141 32 108 87 184 100 273 144 82 147 151 257 77 71 30 69 98 136 176
5420 176 211 172 190 142 242 80 108 23 169 258 206 93 286 343 308 34 217 44 215 16 209 150 119 192 182 200 200 212 148 294
5068 294 124 123 112 243 177 76 169 226 294 194 30 48 80 199 173 115 58 113 149 177 260 82 143 153 93 70 112 140 135 55 139 169
4693 169 86 177 141 109 48 144 43 66 175 237 225 210 188 65 161 51 110 114 232 226 203 164 163 300 80 97 187 148 32 193 76
4329 76 170 116 77 84 215 144 103 94 69 116 262 11 132 208 61 15 45 136 139 140 138 145 75 142 121 192 174 48 24 74 81 223 168 113 237
3918 237 161 177 169 267 297 249 221 211 166 115 144 141 241 238 103 52 145 204 41 118 80 160 38 109 104 75 44 73 163 180 21 97 226 243
3519 243 120 148 94 64 107 28 137 127 112 234 101 89 143 155 205 171 110 145 30 128 258 162 212 89 93 57 28 66 81 39 28 153
3143 153 205 17 146 245 146 159 91 86 70 185 214 163 57 56 152 218 393 315 267 169 41 146 122 30 110 228 36 197 175 67
2791F7L3MlL0pJ01j19k3J02L4j04K0l3o1O7K0O2m2L0l6J21j03j44M6M7n8Q6P5r0p9J96J0j17
2404A32J3Jo0o5J48j10PJ20k4Rmm7J34kj6M0j28L2p9LJ58j30np6Qj3Q0j01O6J74j91J11j30
2016E5L2l1L4kj4M1J8k8j8k1k2J44Pp2o2m4P4Lm5N3p5J15j18R7q8P0OJ87k56J37n4p9K9l8
1617C5R2pP4j19O7O8j11%j9Jk0N6k6K6j2L0J13n3Pj80O1J09j3L8J0j39P5k8J52q3n7m6j6J23
1218B08j53L8L4k4j3j4J0R1K7q2N5J12j72o0j0Q0N4j38J61l5K04r1k16P2O6N7mj6j62P7L3
854A89p3m0J9J82p9j61L5L5k3K6J5l2J61nr3n2J1L6k0j9N4p8p4L3O5m0J16m4J85k62M19o1
479D25m5j32j13J89j27l9n0R7j05Nk5J1J01L8p9l6MP4j38N2J48j29q3K2M1J05q2%J0q5j9Q1
103A16M9L3K6L1r8j16Q6k2o5NMM0JL9O3lK6j04O1Ln5K5mp9J3
$$ plain form
2791 67 100 104 101 131 124 225 106 83 185 219 115 135 102 41 108 128 190 148 178 142 263 160 16 62 109 51 137 212 122 43 239 249 132
2404 132 145 146 86 21 169 59 66 186 162 171 167 120 254 252 236 276 148 180 101 104 262 132 127 51 59 46 126 25 91 265 74 185 55
2016 55 87 56 90 88 74 115 133 105 87 66 44 188 195 123 61 17 91 94 49 102 27 142 24 121 33 103 109 296 40 177 123 44 73 35
1617 35 127 120 194 75 142 210 99 99 80 81 61 117 91 117 105 135 248 195 202 22 83 192 179 217 227 88 163 135 287 204 147 101 85 208
1218 208 55 93 127 103 90 76 86 177 204 122 177 289 117 57 47 127 181 43 204 169 373 282 66 138 204 261 257 241 79 156 189
854 189 116 76 95 277 198 37 72 107 84 110 125 93 254 249 156 104 115 151 131 112 166 88 14 47 112 72 188 144 329 67 486 425
479 425 380 248 135 324 197 158 108 205 100 105 80 91 192 230 151 115 119 193 55 107 255 126 43 65 106 211 129 129 139 54 35 116
103 116 165 198 224 255 157 41 127 105 40 45 49 89 90 129 192 189 215 111 172 175 120 145 141 62 75
-190G5
##PAGE=	F1=-12154.8
##FIRST=	25169.313707327481097,	5807.6787752999953227,	0
##DATA TABLE=	(F2++(Y..Y)), PROFILE
5808H4%J06q5l0jJ0J02k3p6J4J6j7K9o9J29j65N5J6J23j39K62j78nK7r2J13j67K6l5K8%K0
5432G8N6L5j8J8n4J24j30k0q7J72P7k8j00J50N9n0k36J64j28R4j39J85m4p2P6%QN1j4l7J26
5068C16k17MJ6Q3j5j43J07Q2O4n7j86QJ5R4j0p5pO5J6J9Q7j75M1j5m7M4k5KmpP3J0q6M9l8
4657H8k4pR4o7m5J05P0J3j1m0j22J25j28L6L3K4Q8Ln8rR3j66M0J01m3j82K19j18K8o8N3j5
4282A10J12o5j03LK1K7J94k01N7O7j56n5LJ66J3o5j2mp2N1l2N7K4n1o5L2J1J79j5j05R4l9
3906A81J0n8J03M9o1k4jLo8Rl6J43nr4p7P1N6j61J16p9N0p8O0ml1k9pR5K3r7j6J33N7j37K0
3495A16j1m1J36j23K4M6q2J24j21N7M4k0O0k3o8M4j10M1J48o8M9q6q0L2k5L0L9m3m2R5O1j73
3120C0J07R0o0o1j1o5O6J54Pj02j02OJ11L4J92j09j1j32p1J05o3o3M3J36j53J11k5j18J15
$$ plain form
5808 84 84 190 105 75 74 84 186 163 87 101 117 100 129 60 189 24 79 95 218 79 341 163 158 185 93 206 39 65 30 58 58 78
5432 78 134 169 151 169 115 239 109 89 2 174 251 223 123 273 332 282 46 210 82 176 37 222 178 106 182 182 190 241 227 190 316
5068 316 99 103 119 202 187 44 151 233 297 240 54 62 77 171 161 86 79 144 160 179 266 91 132 117 70 114 89 91 87 80 153 163 77 126 88
4657 88 64 57 151 84 39 144 214 227 216 176 54 179 51 87 120 144 232 235 177 168 261 95 135 236 193 11 230 112 140 72 125 110
4282 110 222 157 54 57 78 105 299 98 155 222 66 11 14 180 193 128 116 112 40 91 59 116 140 89 24 56 67 246 231 126 220 181
3906 181 191 133 236 285 224 200 199 202 134 143 107 250 245 151 74 145 201 40 156 77 127 49 109 105 74 45 38 133 156 59 43 176 233 96 116
3495 116 105 64 200 77 101 147 65 189 68 125 169 149 209 186 118 162 52 93 241 173 222 136 56 88 63 93 132 89 47 142 203 30
3120 30 137 227 167 106 95 30 96 250 257 155 53 59 170 204 396 287 276 144 73 178 115 52 95 231 78 189 164 46 161
2779A61k4n3N4m3J02n5n8J06M5j43L9mk3j0N8L0n9L9j6J48j45j38M1J4jN3P8r6p1K06Mj43
2404I6J4L6l7q5J29p9k2R9k3M9m7L4J00n1K1K0j04J8r4O2J15r4n2o1J2k9M4mPJ54j39R7q1
2016A05nk1l6j1PK9M5O5l6l3o1J01J7j9p7k0L5M3o1L1m9J17j22P3n9M6J0J76k55J36o7n5M2
1629I1m1K3M4N9j52J14J15p1j36MN4o0J05n1K8j3lR8k8N6j88N0J50k9RL7j31L1j0J66j01o7
1254A53n8P6J00k25Q6l9JJJ5kN3M3r3JJ10j05m0k6J05K6j08P5MJ91n9k24O7O8Q3Nk9j55O3
866A63nr1j0k1J90o4j31O1J8oK8Lk9J54l3q5l5JJ2j8K6J2l9p7N6L5n7J26MO0j91L50m2n3j02
455B10p2J34j34j1n5J04o8%ok7J13O3q8m5l3Q0j21L9J18p2l8MJ6Q1o2L0k3m4l6L9N9j2J7N1
56B11p8n9O2l2o8O0l9L3n0O5J11j7Ok6n6K0m1J9L1o7J1
$$ plain form
2779 161 137 84 138 95 197 142 84 190 235 92 131 127 104 94 152 182 123 162 146 294 149 11 52 66 65 118 196 100 29 235 239 96
2404 96 110 146 109 24 153 74 52 151 128 177 130 164 264 213 234 254 150 168 74 136 251 157 105 44 56 27 71 67 74 228 89 186 105
2016 105 100 79 43 32 39 68 113 178 142 109 48 149 166 147 70 50 85 128 67 98 49 166 44 117 58 104 114 290 35 171 104 49 91
1629 91 50 73 117 176 24 138 253 182 46 50 104 44 149 98 126 113 110 208 180 236 48 98 248 219 228 265 134 165 155 321 220 153
1254 153 95 171 271 46 132 93 94 95 110 108 161 204 111 112 222 117 77 51 156 182 74 149 153 344 285 61 128 196 279 284 255 100 163
866 163 158 67 57 36 226 162 31 92 110 104 132 135 106 260 227 142 107 108 120 102 128 140 101 24 80 115 58 184 188 248 57 407 365 312 210
455 210 138 272 138 127 72 176 108 108 102 75 188 251 163 118 85 165 44 83 201 129 91 95 111 192 130 160 137 93 57 96 155 143 160 211
56 211 133 74 136 104 36 96 57 90 40 105 216 199 205 179 123 143 102 121 152 85 96
-190I6
##PAGE=	F1=-12257.1
##FIRST=	25169.313707327481097,	5807.6787752999953227,	0
##DATA TABLE=	(F2++(Y..Y)), PROFILE
5808G6j3J19p9k7j6k8J29K1n4o0M5K4j9l5J43j57pM7J44j90L22k23O0Lj67Q3l7J2j03M2l6
5444A9oO2N1J0K5q9J30q3m6n1J27O4J5q5J02M2n2j76J14o0J8o3J66k8r9P7kj4P9k6mR4k40
5056G1OL9M0N0j53P8R3P3k2k07J7j0Q1jq6J9P3lL1O0j45Jm2MQ4k4q5KN5N6mo3j6m4k5N8R9
4622A60j9q2M5O4M5om0j28J44j34L4R0j05J45K5p6J6K8o3N0O6n4j99K54j06n4l7J17l4Q0n7
4258A69r0k4NM7K05j34J2K4j33o6RJ75L4j02j7l7ql2rnQ6K7r5J6lK04L5j44M6j8J9p8O1O6
3859B45m9k3mN7n8k1n1J53l2k3q5L6N6j61J26r6J5l3N1KL5j05rP3K8j7p0R5P1j41J3K5k9K15
3460B89j48q4Q0j06J01q7R0N0k1L3Kq7O7q1o1J68l4O3m4j57O7lM5M1m2p1L9O3j10P0N6j5j09
3073F4M7q1R8J82l6j49o8K0J03j7K11j40M0j42l0R5r8J1k5J76j23L0lq8J24l4j09N3m4Q1K2
$$ plain form
5808 76 63 182 103 76 60 32 161 182 128 68 113 137 118 83 226 69 62 109 253 63 385 162 222 225 58 141 104 116 13 55 19
5444 19 13 75 126 136 161 72 202 119 73 22 149 213 228 143 245 287 235 59 173 113 131 68 234 206 107 184 182 168 247 221 217 311 71
5056 71 77 116 156 206 53 131 224 297 275 68 85 75 156 155 69 88 161 158 189 249 104 105 63 67 151 127 42 44 99 155 151 88 72 28 3 61 160
4622 160 141 59 104 168 213 207 167 39 183 49 83 173 68 213 238 162 178 206 143 193 259 205 6 260 154 100 63 180 146 226 169
4258 169 79 55 60 107 312 178 190 214 81 15 24 199 233 131 114 77 69 37 28 23 109 136 41 57 54 258 293 149 195 177 196 118 179 245
3859 245 196 173 169 226 168 147 96 249 217 194 109 145 201 40 166 70 85 52 103 105 140 35 26 99 127 110 40 135 206 65 78 103 74 289
3460 289 141 57 137 31 132 45 135 185 164 197 199 112 179 98 37 205 171 234 190 33 100 97 142 183 141 70 109 172 62 132 188 173 64
3073 64 111 30 128 310 274 125 57 77 180 163 374 234 274 132 102 197 99 110 85 261 138 168 165 77 201 167 58 111 67 148 170
2709A70p7J01M4j65O2K1j0o4J02%q0K3J3J68j71j00K6qJ5J7J00q8q4J84J9j56K5N9j1q7P7
2345A25l2k6N2l0P7l1O7L3q5M7Ro5kj03J27Q3o3r1k9K4n1RO7l2J16m8M2o1j7rm3ok5K4M5J44
1923B42o4l9o6L1K5M1p3k5M4N2q0K1k8J09j29M4k8K2LJ57j95P8o9l1N8J4jN1L0j24M1J59k8
1535B42j90k8J07l7O8p7K4K6l9M2J1J16j50k0J87m3j7P3j23j7K0J68r7q6o2J44J03k53N5o2
1183H5qJ4L6L%M6q9k0P2j9l7K8O6k6m2%PJ72j0k11L2O8R3K4l3j03M1p5n3k1k3J43n0q4Q5%
761A11j0L3%k3J23l5p7jj4j9oM5j6j0l5M8J5j01J20O3n4j21K29j3m8n2j4O4j40J2P0M0r9j0
361G5M8l3Q0R0r2n7n0J29j55L1R0j9lj2OL4l6M9m5J2l5l5P1o1QO4o5J8L5l1k3M6p6L2p8P3
-61H5J45o3oP1j73M1j9K2O3p8K3
$$ plain form
2709 170 93 194 238 73 135 156 146 82 184 184 104 127 140 308 137 37 63 55 70 87 187 99 15 199 218 62 87 146 135 48 125
2345 125 93 67 119 89 166 135 202 235 150 197 206 141 139 36 163 246 183 92 63 87 36 45 112 80 196 148 190 129 112 103 60 54 29 53 98 242
1923 242 178 139 73 104 129 170 97 72 116 168 88 109 81 190 61 105 77 99 102 259 64 142 73 42 100 114 113 164 194 70 111 270 242
1535 242 52 24 131 94 162 85 109 135 96 138 149 265 115 95 282 239 222 295 172 155 175 343 246 160 98 242 345 92 147 85
1183 85 77 91 127 130 130 176 87 67 139 120 83 111 177 151 109 109 116 288 278 67 99 167 260 284 251 148 189 114 61 40 17 160 110 26 111 111
761 111 101 134 134 111 234 199 122 121 107 88 82 127 111 101 66 114 129 28 148 211 157 36 265 252 204 152 138 202 62 74 144 184 85 75
361 75 123 90 170 260 168 111 61 190 35 66 156 137 134 122 128 162 126 175 130 142 107 72 143 82 90 154 89 107 142 111 88 134 58 90 12 85
-61 85 230 167 161 232 59 100 81 103 166 88 111
-190A11
##PAGE=	F1=-12359.3
##FIRST=	25169.313707327481097,	5807.6787752999953227,	0
##DATA TABLE=	(F2++(Y..Y)), PROFILE
5808F7l9J37o0l1k7l9J41M2m1j10P1O7o2j4J45j50l9P7J38k08L31k56J19j7j90K9J06j2j56
5467A9M5j8K1m5O6M6L8j45J16m0n1lM3M6P4n9O9Rn5j04M2J5m6RJ47rj17P8j2m3P9k4K9N6k29
5056D7RN2NJ08j31J8J07R0rk27M0j2P3rr6J4Q6j3M2K2j02m9o0P8R5Rj37l1R0M1j2j7p4QJ4
4646F9j2J06L1r2l2P4M7rj2j44J49j29O1J31j62J06L0q7O3m5M4O5Np2j67K66r1j30O5J07m7
4282A88N1n8m0m3o2P9J82o8ll8q8n8J9J28O1j01k2q5Q3m3J3k6K3P7j00Mj8K05Q3j71jj9M4
3894A96o1k3P4j5k8j9J01k4n3m2J42r1N4q0J5N8j40Q4p8k1%M3J9J02j76J3J4K4P9m3J2L0j29
3507C7OM1J4K67j83j55P6n8O1m3N0P5Nj7L1j12J02m4j14J29rQ5j3k03O5L2P5K2l7r4l3N8j4
3120A02O0j5J6j00P8o0P5J86q1j76l7M5Q3p3K29j71R4j34rQ3j18R3q9K10j14l7L2n9R4k5j52
$$ plain form
5808 67 28 165 105 74 47 8 149 191 150 40 111 178 116 102 247 97 58 135 273 65 396 140 259 242 52 81 187 175 19
5467 19 64 46 67 22 88 134 172 27 143 103 52 49 92 138 212 153 222 231 176 72 114 129 83 92 239 230 113 191 179 136 215 191 220 276 47
5056 47 56 108 113 221 90 108 215 305 296 69 109 97 170 161 65 79 165 152 194 216 114 65 5 83 178 187 50 19 109 150 138 121 47 55 69
4646 69 57 163 194 102 70 144 191 182 170 26 175 46 107 238 76 182 212 125 188 143 187 252 257 185 18 284 193 63 128 235 188
4282 188 239 181 141 98 36 115 297 229 226 188 100 42 61 189 250 149 127 42 125 82 95 69 92 169 69 73 55 260 343 172 171 152 196
3894 196 135 112 186 171 143 124 225 201 148 106 248 157 211 131 146 204 64 148 70 49 49 92 111 213 37 50 64 88 167 124 136 166 37
3507 37 43 84 98 365 182 27 103 45 106 63 113 188 193 176 207 95 197 153 39 168 159 244 231 28 93 125 200 222 185 91 58 116 102
3120 102 162 147 163 63 141 81 156 342 261 85 48 93 176 103 332 161 255 121 112 195 77 170 81 291 177 140 172 113 207 182 30
2756C0L1j2M8Q6o9Q4L8j74P7L9j3q2J35k6r6k4O2J61j73o9K5J0j9j7J32p3p5J11M4j57M3Q4
2380A61jj12M1K6k2Jm0Q2L5M9m4q4L8J4k6j5r6J76O1m0j10j0J9n9N3N1m7O5K7Mo9j8J9j2P
1970A24r3K4L8J87r3l9n7k1K4R7o5n4P4O7r6J4j3R5j41J3%J1k5J33j22J2jl0L2O6K5M2j0q3
1570A35l9J58J5j76m8J15j2Pq3OQ7m6n1M3J75j08j01K10m9l2J13j19o3N5J61p7j11n5J80J06
1218C96k59mm5l2J9N6J6n3L5q1jJ2O7l6O8K8q6K3j5m3J47M6j81j8O5Q4N6l4l8L4j53Po4M0
819E6L4l7k8R7k0k6N2%j7P0kp9M1l7j2J5Nk5NJ3L4J6j24N4J25q4j19Q9K9m3JM4Jp5l1K07j
385B28j94k4J37l0L0J12r1p5l7J81k08L8O2K1J5j7Lk5mN7m7M5m0r1R0q4k4P7m6Q2%l4K1J5
-14A43j08N1l3JJ68j20nJ53k07J0PL5Q6j08M4
$$ plain form
2756 30 61 49 97 183 114 198 236 62 139 178 165 83 218 192 96 72 134 295 122 53 78 88 69 52 184 111 36 147 191 34 77 161
2380 161 160 48 89 115 93 94 54 136 171 220 176 92 130 144 118 103 7 183 244 204 94 84 103 44 97 148 101 166 193 197 128 110 129 117 124
1970 124 31 55 93 280 187 148 91 70 94 191 126 72 146 213 117 131 118 213 72 85 85 96 71 204 82 94 93 63 95 161 186 228 218 135
1570 135 96 254 269 93 45 160 148 155 72 78 165 119 68 111 286 178 77 287 238 206 319 200 137 192 353 276 165 110 290 396
1218 396 137 133 88 56 75 131 147 94 129 48 47 59 126 90 158 186 100 123 108 65 212 258 77 59 124 208 264 230 192 226 73 80 16 56
819 56 90 53 25 122 102 76 128 128 111 181 179 100 141 104 92 107 112 87 92 105 139 155 31 85 210 126 7 96 125 82 83 127 128 53 22 229 228
385 228 34 10 147 117 147 259 168 93 56 237 29 67 129 150 165 148 151 126 122 179 132 177 137 46 136 52 28 105 59 141 141 107 128 143
-14 143 35 86 53 54 222 102 97 250 43 53 60 95 181 73 117
-190A17
##PAGE=	F1=-12461.6
##FIRST=	25169.313707327481097,	5807.6787752999953227,	0
##DATA TABLE=	(F2++(Y..Y)), PROFILE
5808E5m0J25l3l7l3rJ27L4m6j22R0J09j01oJ36j51k4R6J02j83K84k72J58l5j68K3J84m6j64
5467E3L7ML7p4JQ4M3j65O4j5m9N2n2J7J38k2N9k3p4k9k8P5r1N9J32J0j26P4k0p4N6j0N4K3
5068B20j64mN1j5J39j01m7J39J04k0k43O9J5O6l2j01j8R9qL4po0r5K8N4Q6M2j46o9R2L3j6
4693A25K9p2M6Qr4J07P8r1n9J05j2k7L9j49J34j24Q9J51j61L2J4p1R5r8J09R1o1r3j13K72
4340B99p5j65J49P5n5L2o6mm9p9O2J33j8J0r8l2m8J6O6Q7o3k6j41J63k3mko4R5q0J4l2J72
3953B49J18j82l6l7Q1l3r8N4L7m4l8J24K5q0k0J30j66J12o2J5N8r8Ml8k5nL9M3J45k06jl0
3578C5J6J73j8m1m3q2k3L1Q9K81k25j25mLQ4l2n7J14M3o5N3j34J41j2j08M9JJ00J1k29N1P0
3202A47J02pk7j05r6L5R7P3q7Qm7Q3o0N7J65j19j67j5P1M5r8K26j98J41j24jP2j10J51j22
$$ plain form
5808 55 15 140 107 70 37 28 155 189 143 21 111 220 119 113 249 98 74 170 272 89 373 101 259 224 56 79 263 217 53
5467 53 90 94 131 57 58 142 185 20 84 69 20 72 20 37 175 153 212 189 115 86 58 133 42 101 233 243 117 191 171 97 153 143 197 220
5068 220 56 52 103 88 227 126 79 218 322 302 59 128 143 209 177 76 58 157 149 183 176 116 21 49 103 189 231 85 16 108 141 125
4693 125 154 82 128 136 42 149 227 136 77 182 170 143 182 33 167 43 132 283 122 154 168 97 192 94 203 294 233 140 27 299
4340 299 224 59 208 283 228 260 194 190 141 62 124 257 239 249 151 119 71 87 153 240 177 151 10 173 150 146 144 80 175 95 109 77 249
3953 249 367 185 149 112 193 160 62 116 153 109 71 195 220 140 120 250 84 196 134 149 207 109 113 75 50 45 84 127 272 66 65 35
3578 35 51 224 206 165 122 40 17 48 137 418 193 68 64 67 151 119 62 176 219 154 207 73 214 202 94 143 144 244 255 26 77 147
3202 147 249 242 215 110 14 49 146 219 132 140 93 176 116 173 338 219 52 37 108 153 55 281 83 224 100 99 171 61 212 90
2850I0K10j19p0P1k9K3kj06pk1L3J04l3N4L6j69P0M8j9o8J53m3j05r8J36J15j53m7K8L5m3
2486G4OJ02o8n2L6P0j38N2J14j1j56L1Q2l1l9l2N1J11J4j09J0m9J9j3%k4J47M7k5j23Opn6
2099C9J07K8m9QP3kq7l2P1JK8j48J7L5J98j14l4n1k2RJ32o1q7R7R7j03PqQ3j49k4K0K0p5J06
1688A30m4n1J23n2k8J07N3K9n4k8o3Q8N4j41n5J13Qn6m6j9J23k5p8j4K24p2j74K09m3l1J50
1324C37j19j04Q7J52n0j34m4J89R7k48o8pm3OQ1K3q4K0p6L4oR1k6P5Jq5K1lq4J01R1j44n9
937B2O6M4J03l6J8L8j88K3m6L7m2%j7R9m4k5Q4j2pOM3q3P3o3L3L3o9j2ON3J7L1r9p4J80k2
514A70j47N1Kkn6Q4l6O1n3K21k3k42N4Q6l8nJ22q8r0j0K03k34O0K3N6J7j9Lp0K3N7l3M7m9
115A45j21J11n0o8O7QQ4m3m9O6k7j03O4K1r6J91j73J8J78j22p6K4M8R6j41O4
$$ plain form
2850 90 300 181 111 182 153 176 174 68 61 40 73 177 144 198 234 65 135 183 164 96 249 206 101 3 139 254 101 54 82 117 74
2486 74 80 182 114 62 98 168 30 82 196 185 29 60 142 111 72 40 91 202 216 107 117 68 87 74 74 50 197 244 219 96 102 95 39
2099 39 146 174 125 133 206 204 117 85 156 157 185 37 54 89 287 173 139 88 66 75 207 146 59 156 253 150 157 149 232 83 59 79 99 24 130
1688 130 86 35 158 106 78 185 238 267 213 185 122 210 264 123 68 181 189 133 87 68 191 166 88 74 298 226 52 261 218 187 337
1324 337 218 114 201 353 303 169 125 314 411 163 95 88 45 51 132 155 71 91 15 49 43 134 108 183 184 99 120 117 33 134 225 81 22
937 22 88 132 235 199 217 255 67 90 44 81 39 39 22 121 77 52 136 124 117 123 166 83 156 93 126 159 90 78 84 137 154 185 86 12 192 170
514 170 23 74 76 74 18 102 66 127 74 295 272 30 84 170 132 127 249 161 71 61 264 30 90 113 169 186 167 170 100 123 180 147 194 145
115 145 24 135 85 17 84 92 176 133 84 150 123 20 84 105 9 200 27 45 223 101 25 49 97 193 52 116
-190A16
##PAGE=	F1=-12563.8
##FIRST=	25169.313707327481097,	5807.6787752999953227,	0
##DATA TABLE=	(F2++(Y..Y)), PROFILE
5808C8J8N6qm1l4mJ39J4o9q9R6J44j39oJ18j59L7R6M3j34K10k61J61n2j02N4J96r1j56M5J3
5444A33L8p5n5J16L3j47Jnj3O2j0K7K2K3N6k3j23L7l3O5q1M8J21K2j28O7j6q9J3MO0J4p5k1
5045F8M5k4J35p1j05J84J08m8k50R3N4O2n3j02o3J14lOj6k3q3N9L0O8O1j42n6N2L4k1O1n1
4669A23P1qj66R2J22p9l0J18q8n7R9j45J21j15P7J59j46nl1J3O5r7R1J23j11j13m1K60o1j59
4317H2J91M4n6J7p4Qm5o1K2P7KM3j36K4m7OOJ09kk9j61J86j2k7L3j38Q6l7N5m5J00J37j78
3930A80o0n3J23rj21j0R3o7n2J15P2r1LJ31j84R1m2K9N5m9p2rok0M3N5J63k11l1m3M1K09k
3542B71q4j05j7o0K7J55K53k60o2o7L0J39l7j65J35Q4r6N5j48J72J2j04KLR9L0k42N2Q9J10
3190B71l2j0r7o7jJ23Q7j27l6J0P9o6M0J23j40q7j4P2j5k5J49k01J48j13nO8o6J58j16J69
$$ plain form
5808 38 56 112 104 63 29 25 164 178 109 20 116 260 121 115 233 74 111 207 250 116 326 65 226 174 72 126 322 231 75 120 133
5444 133 171 96 41 157 190 43 44 39 26 88 78 105 127 150 206 183 60 97 64 129 48 96 217 239 111 178 162 73 86 90 150 164 89 68
5045 68 113 89 224 153 48 232 340 292 42 135 189 251 198 96 33 147 144 150 134 111 28 87 117 185 246 104 48 100 134 113 174 123
4669 123 194 186 20 112 234 155 125 243 155 98 197 52 173 58 135 294 148 143 112 125 190 93 184 307 196 83 42 302 241 82
4317 82 273 317 261 278 204 212 167 106 128 205 207 250 114 138 91 97 103 212 210 181 20 206 194 167 200 62 148 111 166 121 221 358 180
3930 180 120 67 190 181 60 50 143 76 24 139 211 120 123 254 70 161 119 148 203 154 82 73 67 47 90 145 308 97 66 23 64 273 271
3542 271 187 82 65 5 32 187 440 180 118 51 81 220 183 18 153 237 141 196 48 220 232 128 130 133 232 262 20 72 161 271
3190 271 239 229 132 65 64 187 274 147 111 121 200 134 174 297 157 70 56 128 113 88 237 36 184 71 66 134 68 226 110 279
2838B79j29o2J02Np8K4r%r0M2P1K0J4M3j54M4M2j7l7J60n1j01l5P7L5j19l2L1N3l6O2K8q3
2451I9j7j0Q1j02M0J49l1j83K9J16n5n3j1rJ66j2j45J36q5n0l4M6K1J18M4j8j38L0m4n6J49
2087A71K0m9m8R1J7q0q5J40pN6j77KK8J87j21k5n8K7rJ37o4r1Q0J31r1mrP6j48n2J3N0p4J3
1688D7L5n6J93p5r1J33O9Or2M5n4j3Q7r8o1J06L0j07K2l0J06J3n8j13K53m6k17J83l0j3J69
1324C43j21j33J08J48k2j53l5J78P9k28j11M9m9k4J06J8o6J8n9J5K7N7j9N8j2Nn1k1m8K7R8
960A82j08o3P8m2J60m2N2M9j69KLj0m9L9m9P2o8N0Q6m2Ll9N1p3Q4q9Q6N2j36J8LO7LM6o2p4
538G1R6M7j71J35m8L6j23L0j8J33n5K00m2k00Q4J5o1oJ08r3q4OJ92k02Q4k3P6Pk0Lp7M1M3
150A84j5K8o0j15J15j5q4N2N3O8r2p1J08o8MlO3j10J40j13K1O8j7q2j1N8R5j48O0
$$ plain form
2838 279 150 88 190 195 117 141 132 132 42 84 155 175 189 232 78 122 164 147 110 270 219 118 83 160 195 76 44 75 128 92 154 182 99
2451 99 82 72 153 51 91 240 209 26 55 171 116 63 52 43 209 197 52 188 103 53 19 65 86 204 248 230 92 122 78 22 171
2087 171 191 142 94 185 202 122 37 177 170 226 49 51 79 266 145 120 62 89 80 217 153 62 142 273 182 178 169 245 97 45 58 108 34 47
1688 47 82 26 219 144 53 186 255 261 169 214 160 147 234 136 75 181 211 104 126 96 202 215 157 44 297 251 34 217 187 174 343
1324 343 222 89 197 345 323 170 135 313 392 164 53 102 53 29 135 153 87 105 46 61 88 145 126 184 172 177 126 105 57 84 182
960 182 74 11 89 47 207 165 217 266 97 99 102 92 43 82 33 105 37 87 173 131 134 95 146 73 157 68 154 206 70 88 91 158 161 207 145 71
538 71 167 214 43 178 130 166 43 73 55 188 133 333 291 91 175 190 129 123 231 138 54 60 252 50 134 111 187 194 174 177 100 141 184
150 184 169 197 137 22 137 122 38 90 143 211 119 48 156 88 92 89 152 42 182 69 90 158 141 59 48 106 201 53 113
-190A13
##PAGE=	F1=-12666.1
##FIRST=	25169.313707327481097,	5807.6787752999953227,	0
##DATA TABLE=	(F2++(Y..Y)), PROFILE
5808A1Q5j1J4m6l6j3J61Kq4m0P8J74j77oQ5j63J20P9k0p9J44j94R3o8%O3J92j47j41O6J4K0
5432A76o4p8J43J5j41k1K2K6K1N5O8j40O6M3Pj79Q4kK1l2lJ10J9j26O2Nn8k5k8M0N5k4k4N2
5033A45m1J16n3j20J96J06p9k47J03R2O1o5j02r4J23j0l2rJ6m6M4J8M3O8j34Nj8M8l3P5k6
4669A50R3k8j81K2J61n7K4J02j44q1J42j37J31j00J1J60j19qq9J31Ln4jJ56j32j19L0K23m1
4329B48j50K12K4n5Mq0%l0k9k0L6j3P7j38O4n3ql0J23O0l2j74J85j9l8P8j81L1K4J22n6j1
3953A71J42j57q1l9J55Mj18n5J16q4j7L0J07q7K1J43j22nk8M7M8rj12qQj9N7M6J58j96n8j9
3578C9P9J94%j27j31M0q8P7J54J93k75kr5L1J87m1j67N8J16j01L2j42J80K5j02j1KQ4M3k38
3225A4P6P7R3m7J7p0m8K7Q1Q7j41q5N3P1o8K1P6j46K7k4O0r1Q5O1j33P3j06j1P3rJ20p8R6
$$ plain form
5808 11 96 85 99 53 17 4 165 167 83 43 121 295 118 112 197 34 154 233 213 134 278 84 177 109 109 172 364 217 76 142 156 176
5432 176 112 34 177 192 51 30 52 78 99 154 222 82 148 191 198 19 103 101 122 90 87 197 216 90 152 157 99 74 46 86 141 117 93 145
5033 145 104 220 167 47 243 349 270 23 126 218 279 214 112 18 141 131 99 90 106 60 104 122 165 233 99 104 86 134 101 176 150
4669 150 243 215 34 56 217 160 184 286 142 61 203 66 197 97 108 268 149 141 52 183 186 132 131 287 155 36 66 289 248
4329 248 98 310 334 279 283 203 203 173 144 124 160 147 224 86 150 97 89 59 182 242 210 36 221 202 164 242 61 92 116 238 182 171
3953 171 313 156 75 36 191 195 77 22 138 54 37 67 174 87 108 251 129 124 96 143 191 182 70 62 70 51 108 154 312 116 58 39
3578 39 118 312 312 185 54 94 6 83 237 430 155 153 58 89 276 235 68 126 242 141 173 31 211 236 134 123 125 209 252 14
3225 14 90 167 260 213 230 160 112 139 220 307 166 81 134 205 137 158 234 88 115 91 151 60 145 206 73 146 40 29 102 93 213 135 231
2838B31j36k2J16L9j70L5J02Kj44L5N0O1k9O1j31jK0JoJ60m8q5K4K3m4q3k2L2M7JJ08m0j17
2451G0K5k6Q0p2J5J83m5j76J0J31q5k8j4l2J54j6j32K00p0j21L4j2L8R6M6j4j54O7o3p1J53
2087A71L0n4r6Q7M8l5j22J59l1Q7j83j0J6J60j18Mp9Q4k6J24o8m8J9J49o2k2rP4j35m7m4R4
1711A17k8n1L9KJ78q9j39J47O0l3j07J34m8j01J09n5p3R6N8j41Q8l8P2N5m3j81K56l7k12J35
1359A70j4RJ62j18j45J15J54nj63l3J61N7k09p8P5o7l1J02Mk0K6p1nM4L3k6L9j3J08j02r4
995F5J3J2M6p5n1J07q7J51m5N5O5j26mL3o6l9N9n2J6l8J21O6p9Om6Mm3O9j09J31O7j69N8%
596A15M9j0N7j4o3J3Q3j82J71n9O0j38j5K6J32n1J71p1j42J17m5r0K8O4j11m0rJ53j09R8n6
232A32O2pk6J1n5N5K4%no7p8R3Qj00N2Q1N9j36o7J13p9J09p5P8r1R7n2K7p2N6m8m9O6Q5j27
$$ plain form
2838 231 95 73 189 228 58 93 195 197 53 88 138 199 170 231 100 99 119 120 114 274 226 141 165 188 144 61 39 71 118 119 227 187 70
2451 70 95 69 149 77 92 275 230 54 64 195 110 82 68 36 190 174 42 242 172 51 85 73 111 207 253 239 85 152 89 18 171
2087 171 201 147 51 138 186 151 29 188 157 244 61 51 67 227 109 113 34 118 92 216 148 100 119 268 206 184 175 249 114 67 23 117
1711 117 89 38 77 79 257 168 29 176 236 203 96 230 182 81 190 135 62 158 216 75 163 125 197 252 209 28 284 247 35 170
1359 170 156 165 327 209 64 179 333 328 165 132 293 350 141 63 138 71 40 142 146 126 152 81 76 120 153 127 166 153 261 159 65
995 65 78 90 136 61 10 117 30 181 136 191 256 130 126 159 93 54 113 61 77 39 160 226 147 153 107 111 68 137 28 159 226 57 115 115
596 115 164 154 211 197 134 147 230 48 219 160 220 82 67 93 225 174 345 274 132 249 204 114 142 206 95 55 46 199 90 188 132
232 132 194 187 161 172 117 172 196 196 191 124 46 139 147 47 99 180 239 103 36 149 70 179 104 182 91 188 136 163 91 147 99 50 116 201 74
-178G4L5
$$ plain form
-178 74 109
-190A09
##PAGE=	F1=-12768.3
##FIRST=	25169.313707327481097,	5807.6787752999953227,	0
##DATA TABLE=	(F2++(Y..Y)), PROFILE
5808B6J04o7L0n1l6L7J16Jk8m6L5J98k11J9K1j37J74N4p0l0J15j12mn5P1M7J87k04j27R4J4
5444A65k0m2o9J65Kj53j2L9N5k6J00J05k58R8J6N0j93P8K2rJ9n0R2Jj19O3M2j2k7p5qJ27l9
5056A27oQ1p8R5n1p6J45J10j12k19Q6J18O4o4j04r6J23l6n6j0P4l7K3K0J2P6j32R0r9P3m9
4693I2P2mJ11m9j47o6J80l3Q0N8j67p2J35j20J56q4q9J71q8nj23K26n2j0j13J84j22o8L9J74
4340B66j9j41K06J6m7rq6k1JNo0K7m4P7r7P6o1j9k8J20J01l6j93J90m7k4J23j74q1R1J96o1
3965B47j40J32j14j04L1J48Oj21l2Q1q3J4n7J04o9L4J57o2o8k4N5L7J1j16opjP2J9J37j65
3601A16o7J4J08J67j5j62j11P6j10J24J38J13k51K5j15M6K07l9j59oJ40r4mr1J36L0r2kpO4
3249A79M5k13R7N9M6l9M9l3m7N8L9P1j43j14P5N6n5JM4j32J12l3N1j66J78kp8J0j00K3N4K7
$$ plain form
5808 26 130 63 93 42 6 43 159 160 132 86 121 319 108 127 148 11 185 239 169 139 254 142 138 83 154 201 388 184 57 151 165
5444 165 145 103 34 199 201 48 36 75 130 104 204 309 51 149 165 215 22 100 122 113 132 82 174 175 56 119 161 149 122 47 39 166 127
5056 127 121 202 124 219 168 92 237 347 235 16 102 220 284 220 116 20 143 107 51 41 115 78 101 121 133 209 77 167 68 141 92
4693 92 164 160 271 222 75 9 189 156 236 294 127 55 190 70 226 142 53 224 136 131 8 234 182 172 59 243 121 53 92 266
4340 266 247 106 312 328 281 272 186 165 166 171 111 138 94 171 74 150 89 70 42 162 263 227 34 224 177 153 276 102 21 112 308 247
3965 247 107 239 125 21 52 200 206 85 53 134 51 65 8 112 43 77 234 172 104 80 135 172 183 67 61 54 53 125 144 281 116
3601 116 49 63 171 338 323 161 50 126 16 140 278 391 140 165 50 96 303 264 105 99 239 145 141 50 186 216 124 122 115 179
3249 179 224 11 108 167 213 174 223 190 143 201 240 311 168 54 129 185 130 131 175 43 155 122 173 7 185 183 105 115 15 38 92 119
2873A19O6l1J7j41L5J04O8j58qJ74j2j75RQ3N9o6Q2r6n5j7L3J4J52l3n9P0k3p6n7l1L1J4M8
2486A40J36q7j51O8l1P6m8k3K09m2j68j2J38r8Pl3j8R2Lj05K08m5j63J18q2M2P0M8pj64J06
2122A84n6r0J13N5o3j23O8O9K8r7R5n9J15j70j3J4J12j14O3o8P6m7J11o8J5l3J21j8m5kP2
1758B45j10k8q6J00Rk8k9M5J49r2j66J60K1q4l6J70o2j48J09rr4Q0R0j47J26n0M6R0l9k01
1406C1K27l9j74R9qJ9J27j06j35J09J70pj62l9J45L9j97J0O9r0j8Q4j4K7K9q6j7M4J5m7L1
1042A36j1J90j10j93O6L1j9k6m1J18n6O5l7L2Q4p6PM4j13n1Q0k9n0O2J34M0j15mm0n6jL4o6
655B9J07P6j58R6nOk5O7M4o6l0Q4j85J59m5P1j26qM2J03m6J47j14q2J50q2j09O9Nj38M2o2
279A6R5K9R2o6J8k3l3L1k6O9J1J6m7o9l9O4K6j11M5R7O1j73j2O6m3J70j34O0o3Q4l1M5r4j7
$$ plain form
2873 119 185 154 171 30 65 169 237 79 71 245 233 58 67 150 209 143 225 129 74 57 90 104 256 223 164 234 211 135 78 47 78 92 140
2486 140 276 189 38 106 75 151 103 80 289 247 79 67 205 107 114 81 63 155 158 53 261 216 53 171 89 131 201 249 242 78 184
2122 184 128 38 151 206 143 20 88 157 185 88 183 124 239 69 56 70 182 68 131 63 139 92 203 135 150 117 238 220 175 173 245
1758 245 135 107 21 121 130 102 73 118 267 175 9 169 190 106 70 240 178 30 139 130 36 116 206 59 185 135 181 271 232 31
1406 31 258 219 45 144 136 155 282 176 41 150 320 313 151 112 257 296 99 109 178 88 70 154 140 167 196 110 93 137 152 105 136
1042 136 125 315 205 12 78 109 90 64 23 141 85 150 113 145 229 153 160 204 91 40 120 91 41 103 237 277 162 158 118 62 61 95 29
655 29 136 212 54 150 145 151 126 193 237 171 141 225 40 199 154 225 99 91 133 236 190 337 223 141 291 209 100 169 174 36 78 16
279 16 111 140 232 166 184 161 128 159 133 202 213 229 182 113 74 138 164 53 98 195 256 83 71 137 94 264 130 190 127 211 180 225 131 114
-120A14J8q1O9P3j01Q
$$ plain form
-120 114 132 51 120 193 92 100
-190A00
##PAGE=	F1=-12870.6
##FIRST=	25169.313707327481097,	5807.6787752999953227,	0
##DATA TABLE=	(F2++(Y..Y)), PROFILE
5808F9Q9j14M9n2j6P0O5j3O9p0l8K16k33P6n9o4J48K9r4MJ34o4o8rO4K4J84k47j20J20J9p9
5432H9j9k2J70j1j61L5jR4o7J11J33l21J24k5R5j85N1L0j7O1q0O7k6q5N3P8K4k9p8nJ22q8
5056A17L1J26j23P1o0j5N6J29j44j59M0J24O8n2j01p3J19p8ln8J23n3%L4k6J07j50J73j64
4716E9R1o3N7RJ25o4r7n2R9j0J17lj56l7Q1r0J79o6j52J70p3j9l7J93q2J6j69J64q8j4K4J32
4340B44%j22J61J6k9k1r6m8N7K9r9M0l4Mk0N4n8k5j8J13J17l9j99J93q4K0J42j43j03N4K55
3977C61n9k41R2m1n3K0J39kj25j6N4p1K1rk4k0L3J40k1p2k2M3K4Jj01L4o0L0P5j7J06j24m6
3589D9L7J23J38l8j88l8Q2j31J50J14L3j86Lj25Q1J92k5j53m3J52q4l0k9O4L9o0Rl9N2L3j66
3225A6R6N9k9mP6Lo3Q3RM2j37j16P0L9l1jM0r2J18l6M8j49J57l9m9k0q6O1K9M3K4Jm6r1L8
$$ plain form
5808 69 158 44 93 41 25 95 160 147 216 146 108 324 91 167 108 44 192 221 127 131 265 201 133 124 188 212 396 149 29 149 168 89
5432 89 70 48 218 207 46 81 80 174 107 218 351 30 154 129 224 39 90 120 103 164 84 151 125 40 93 171 195 166 88 83 205 117
5056 117 148 274 151 222 162 147 203 332 188 29 69 193 261 209 108 35 154 76 73 15 138 85 85 119 93 200 50 223 59
4716 59 150 87 144 153 278 214 117 65 164 154 271 268 112 75 156 66 245 179 27 197 124 105 68 261 179 195 26 190 102 88 112 244
4340 244 244 122 283 299 270 249 153 105 162 191 92 132 98 102 82 136 78 53 35 148 265 226 27 220 136 156 298 155 52 106 361
3977 361 302 61 153 112 59 79 218 216 91 75 129 58 79 70 46 26 59 199 178 106 84 127 151 152 51 85 25 55 130 113 219 95 49
3589 49 86 209 347 309 121 83 165 34 184 298 331 145 148 23 104 296 271 118 75 227 143 113 84 148 187 127 136 97 149 182 16
3225 16 112 171 142 138 214 217 154 237 246 288 151 35 105 144 113 112 152 60 178 142 190 41 198 159 110 90 4 65 94 137 161 162 116 25 63
2815F3O5Q8q3j4J61m7j86k2J65J3q9R5m7j07l8M7K0J32rk3R5n9o7m4n8L6k7Q7J40j06j55R0
2439A16l4P0k6o2K14k2j60l4J32p0J3m8j7M6L5q6J80k4j82K01j37M4L4L8J6j71J36l8j09P2
2087A27P7o2r1K2M9Q5p5K9q1J34j47nK5N4j15J38n4L5o8J01n6O9n2N7L0p0J2O7p4j5q4N8K7
1700A47np8P8J12q4j47J53m2j11J23R5q8j38Q0L6j00L4J23j19J18o1L8J00m0j81J76l9j18
1371F2P9j2QP2q4r0Q2J87k3j55m4J31K7j89R7N6j01pQ6m0N6K9r2k4L1ko5L0j9K38q6j75mN1
972A10o3M3l0R0m1Mj7qJ08l9K2M7j28q7R2Rj07J65J34Pj44k6l3q7K5oM9PO8j03J22j4m7m8
573G4Q2J03q5k5O4j73J11k5O3r4K2M9N7l6J29j65l2J75q8j11R4n1q8O5q4k5J81O3n9l4m0l5
197H2P1j7Q1J5L1r4o1j1L5M6j19K3J11O5j99L9L5jK04j74J6l3Q1l0O9l7j80J08j03O2O3p4
$$ plain form
2815 63 128 216 133 119 280 233 47 25 190 203 114 209 162 55 17 64 84 216 207 184 279 220 153 109 51 87 60 147 287 181 26 116
2439 116 82 152 126 64 278 256 96 62 194 124 137 89 72 118 153 67 247 223 41 242 105 149 183 221 237 66 202 164 55 127
2087 127 204 142 51 73 122 207 132 161 80 214 67 62 87 141 26 164 110 145 77 178 122 191 139 196 226 156 168 235 161 146 62 120 147
1700 147 142 64 142 254 170 23 176 134 23 146 241 153 15 95 131 31 65 188 69 187 126 164 264 224 43 219 180 62
1371 62 141 129 137 209 125 35 117 304 281 126 82 213 240 51 148 204 103 96 182 142 198 227 135 111 142 140 75 105 86 324 238 63 59 110
972 110 47 90 60 150 109 113 96 88 196 157 179 226 98 11 103 112 5 170 304 311 167 141 108 21 46 40 89 96 164 61 183 169 122 74
573 74 156 259 174 149 213 40 151 126 189 95 117 166 223 187 316 151 119 294 206 95 189 138 50 115 31 6 187 250 191 157 117 82
197 82 153 136 217 232 263 169 108 97 132 178 59 82 193 258 59 98 133 132 336 162 178 145 226 196 265 228 48 156 53 115 178 104
-178A04j9
$$ plain form
-178 104 85
-190H5
##PAGE=	F1=-12972.9
##FIRST=	25169.313707327481097,	5807.6787752999953227,	0
##DATA TABLE=	(F2++(Y..Y)), PROFILE
5808A09O4j49P5m8pJ03L9o6J70p7j33K24k27J40r9o0J12Rq6K2J76m4j01J7L8PJ80k61j09J21
5456A39L0j25j8M7J55l5j19P3q7J42r4Q8J46l29J43o4J36j77K5K8j5R2r8N3o2J0NR2M7l2n6
5092A40jR2j38P6J76j62M4p3M4n3J57j70q8kJ02O9k9q9l5J05j09O9n7R9q1j9N0o7J65j63K09
4728B61j94Q2o1L7J0J28o7m8m4M6OJ22o2j15lMm4J84m8j00J22q9o2N9J38q7K3j17O2n3K2J1
4352A23J10Mp6P4J6Ll5j05q1J36L4j35N8Mp2M8Jk4l1k6R7J21l9j48J63r7M9J28j08q8JK79
3977C84n2k31qM8j4l3J47j9j14j9L3n5J4L2n2J8K7M7ml2j0PK0l9p0Q7j04M8O4n9P8o9j0M2
3578A02J23J15o0k00N4O9j45J46Q9l1j03n1p5P4J49J5j49o8J53q0j4JpO3j4Or1N6J0j07P2
3214A02Q4j18N1Q6L2q7R4oJ0j19r1L1L3j4L6M3q3R6k8M8j31J12n4l9k3m8N5J2N9PNp2k8QJ2
$$ plain form
5808 109 173 24 99 51 44 147 186 120 290 213 80 304 77 217 118 58 170 179 93 115 291 247 146 163 201 208 388 127 18 139
5456 139 169 44 26 73 228 193 74 147 60 202 108 196 342 13 156 92 228 51 76 104 89 181 83 136 74 84 89 181 228 196 140
5092 140 139 231 93 169 345 183 227 154 198 145 302 132 44 42 144 213 184 95 60 165 56 125 68 167 86 67 117 50 215 52 261
4728 261 67 149 88 125 135 263 196 148 104 150 156 278 216 101 98 102 58 242 194 94 216 127 65 124 262 175 198 81 143 90 112 123
4352 123 233 237 161 235 251 254 219 114 33 169 203 68 126 130 58 106 107 83 52 26 123 244 205 57 220 123 172 300 192 104 105 384
3977 384 332 101 93 141 127 94 241 222 108 89 122 67 81 113 61 79 106 153 149 117 107 114 134 95 25 112 8 56 120 61 139 70 60 102
3578 102 225 340 280 80 134 203 58 204 293 262 159 108 33 107 256 271 122 54 207 127 113 114 107 170 156 162 71 127 137 30 102
3214 102 186 68 119 205 237 150 244 238 248 129 38 69 102 88 124 167 84 180 152 200 69 181 127 88 65 17 72 84 143 150 155 83 55 63 75
2803G5R3kJ5J18r9j83J3K03n2r0R2Qj40K3k6K7Q7J9J6R8q3n3l0q9M3m5J02J18r5j31Q8k6M9
2416A43jp0J69J2j46m4R9pj6m4m1L5O2n6J18j5j80K62j68N3j5J3N6j77J54j3j22N8P4l9o5
2052H9J3rJ14n8k7q4J37j22RL5K0p7J56n1pp9R2l7R7n5kP6q9K6N4l4j0q0K0K0J6j05J02P6
1653B26p1r9J39r9K4R5Rj11j02Q4M3o6n7J52p7Q0n5L3P8l6j34J16k3o1N5j7j5Rn5j1L4J93
1277B81m0j52l9J18K0j40J28L0q9oJ18o9N8K3q7k6J0k0k2nn3K49m2j33q1N9q1J13k2N1m9j9
901H3jm9J36k9L1N2j06n2J2M3p0J73J22k6j62n6k0m6j4J9J04q0L2j7J25k1r3q5J02J54j17
538A44K1M1j37M6l9N7n4N5N7Jj7J11k12kJ88o4j06J02q4J6L7o9J1J11J7l0p5o5j2J13l2P9
162B09L5M7j37m6LPO7j27oJ35N7k09O5N1J3K23j97l5rP2l4R3L4k78J39j11M0N7l6m5
$$ plain form
2803 75 168 166 181 299 200 17 30 233 181 91 183 191 51 74 48 75 162 181 197 295 212 159 129 40 83 38 140 258 163 32 120 94 143
2416 143 142 72 241 253 107 63 162 155 139 95 54 89 151 95 213 198 18 280 112 165 150 163 219 42 196 183 61 119 193 154 89
2052 89 102 93 207 149 122 38 175 53 62 97 117 40 196 145 138 59 151 114 211 156 154 230 141 167 221 187 177 97 117 137 153 48 150 226
1653 226 155 56 195 96 120 215 224 113 11 95 138 72 15 167 90 170 115 148 226 190 56 172 149 88 143 126 111 120 65 54 88 281
1277 281 241 89 50 168 188 48 176 206 117 111 229 160 218 241 154 128 138 118 96 91 38 287 245 112 31 90 9 122 100 151 102 83
901 83 82 33 169 140 171 223 117 65 77 120 50 223 345 319 157 101 81 35 21 40 144 64 96 79 204 183 90 5 107 261 144
538 144 165 206 69 115 76 133 79 134 191 192 175 286 74 72 260 196 90 192 108 124 161 92 103 214 231 201 126 61 49 162 130 209
162 209 244 291 154 108 111 118 185 58 52 187 244 35 100 151 164 387 190 155 146 218 184 277 311 33 172 61 101 158 122 77
-190G7
##PAGE=	F1=-13075.1
##FIRST=	25169.313707327481097,	5807.6787752999953227,	0
##DATA TABLE=	(F2++(Y..Y)), PROFILE
5808A39L5j55R1n0qJ39M2j54K54n8k18K03j84J77q7j14P2Mo4L3K07k9j25K4J8kJ74k40j01
5467B3R5M5q1k2M0J25o9k6Q8j95J88j01L5J49k67J22p3J56j68JK0j3J11j04O7j17J03k8Q0
5127A84O5l6k0j5N6j55J00K17j84J7q2R0j50J72j89j1k1N5N3Jo5jR0j05R6m9Q2j08l3N6r7
4763A3K21j57J95j87M4m6L3jJ16n5j2m7K3K1R3j05n5K4p7J8J56l2l9J12j09j09J36P0p9K0
4411A85o8pl5M7PJ05j0j0k6KM6m8q5o5J38K7j55N9L8m5L3o3M0n1mK0J25l2n8J17p2K5R5p4
4012B01p2j1K54m3j64m4O9lr5J67l9r0l0J5l4jN2j4K1L9p0mK9Nm5K5p9J2P5q9J7M2p4N1J3
3601H6j0L3J07J00o9j89J25M6j44J13O4o9k6j15K3K5R4Q6j39j05J37p6M6j3o0J06J7oj38O9
3249A18kp1M8J20j50N4P9N5j07P9nj3p5p0j9N1l4J06K3r6P0j4N4j27O4n2m4MkJ7lP8Qj1o1
$$ plain form
5808 139 174 19 110 60 52 191 233 79 333 275 57 260 76 253 166 52 124 128 64 97 304 275 150 174 192 190 364 124 23
5467 23 118 163 82 60 100 225 156 130 218 23 211 110 145 294 27 149 76 232 64 65 85 72 183 79 146 29 132 104 184
5127 184 249 213 193 178 234 79 179 396 212 229 147 237 87 259 70 59 38 93 146 147 82 81 171 66 162 113 195 87 54 110 13
4763 13 234 77 272 85 129 83 116 115 231 176 164 117 140 161 254 149 94 118 41 59 215 183 144 256 147 38 174 244 165 185
4411 185 117 110 75 122 129 234 224 214 188 190 236 188 103 38 176 203 48 107 145 100 133 70 110 59 55 75 200 168 110 227 155 180 275 201
4012 201 129 118 372 329 165 121 190 187 92 259 220 130 100 115 81 80 132 118 139 178 108 104 133 138 93 118 39 51 126 37 54 96 22 73 86
3601 86 76 109 216 316 247 58 183 229 85 198 262 193 167 52 75 100 194 280 141 36 173 97 143 130 70 176 193 187 49 118
3249 118 116 45 93 213 63 117 196 251 144 223 218 205 130 60 41 92 58 164 187 91 161 147 201 74 138 86 42 46 44 61 58 136 144 133 72
2838G2j9PkN6N6N4P8j52j11L2J85j07o8O6O0j49N1o5N2J9L5N2P9r2m6j0j18M6j4Q3O4n0j17
2451B7R0lKL2m6Q0N2j23l3L5P0o5j8p9M6P7j5N4k4j34K51j71O9o8k8J07j60J37K1j24P7L9
2075A75jn8J7n2J06m9o5l4Q9j03L0M0K8l5J31n4k6p7P6k0Q5n5k4J12r2K4M1npp8lj2L3j13
1676B4J24M7n6l9J18j24J00M9o3j14m3J25pk2r4J27m7L3k1J1K7j7o9N6J5k0J4j8l2l9j6N5
1300H4j6J80l2j68k2J06J6n4J10j6n5k2J71r6M0J3q0j9j9l2P2n5p6J81J0q7j26M7qJ02j9L2
925A62q0nkm0J17m6L1O4n8kn2K6j7J57R8n1j70q4Lrl4Q1R2j06l1O1J00j7j04lj8J81j56R2
526A80K9j04j7p4O9j4P0O9n9J9P9k42RJ82j8j07J04p1Q8J2m4L0K0l4K9q7p6L4J06n9N6O4O2
138C05j63l3J0k4Q2j25m3J77K4j85N1J05PK24k07p1%M9l6J12J02k50P0j07PN8J4n7
$$ plain form
2838 72 53 60 58 114 170 224 302 150 39 71 256 149 81 147 207 58 109 44 96 115 150 202 281 189 143 133 15 61 47 130 194 144 27
2451 27 117 114 116 148 102 182 234 111 78 113 183 118 100 21 67 144 129 183 159 25 276 105 174 106 78 185 25 162 183 59 136 175
2075 175 174 116 133 81 187 138 73 39 128 25 55 95 123 88 219 165 139 62 138 118 203 148 124 236 144 168 209 204 197 119 116 104 137 24
1676 24 148 195 139 100 218 94 194 243 180 66 23 148 141 119 25 152 105 138 117 128 155 138 69 125 140 120 134 116 84 45 29 84
1300 84 68 248 216 48 26 132 148 94 204 188 133 111 282 186 226 239 159 140 121 89 161 106 30 211 221 134 8 55 47 149 130 162
925 162 82 77 75 35 152 106 137 201 143 141 89 115 98 255 353 302 132 48 51 42 8 89 181 75 44 105 205 188 84 81 63 244 88 180
526 180 209 105 88 14 83 69 139 208 149 168 247 5 14 196 178 71 175 104 192 204 160 190 210 176 205 118 42 76 182 123 179 243 305
138 305 142 109 119 95 177 52 9 186 210 25 76 181 188 412 205 134 134 183 147 259 361 111 181 74 81 139 153 96
-190I6
##PAGE=	F1=-13177.4
##FIRST=	25169.313707327481097,	5807.6787752999953227,	0
##DATA TABLE=	(F2++(Y..Y)), PROFILE
5808A53J3j13P0o0j9J78O0k34K89j7k30J09j15J77n4j70L1K3n7M2K15rj48L4%j0J70j92j23
5467A3P0N6okmQ1q3P2Q3k30J52r0k6J41j72P5k2J31j59j8J2j4J15j02J11j52J29m0N2Q4m0
5103B17J6l6J6j11P1K37j87kp8J17j57J02j90N7j9J5KL9l9J7P6p4Q3l0P8j31m2M5n2J96j39
4740I7J57j48k3j7O6k3P5k9J3n9J8L4L9j19NM8j00M4Q7j6J4J16j02j05J40%o4J6l5l7l8O7
4364A21K2R2k8N3r8l6R1n7j8m3O9J3j38L6N8J8jj11R7p8M0q7J33k3L9P7n0k9O1m0n7K0J81
3977C27l4p6l3N0jj60J91n5o8l2Oj2j4M1K9L5M6j59LO2J9j05L4j7K4K1o5j3K2J0PN5m5J0Q3
3566A86R4n9j59J54J6j22N9M3p8L1j56R8k8N0J69j31j37R2o4J16m5q4J44K9j9j43O1J6q1M9
3214A01J41j26OO3P5j09L5Ok3nq1k1N9o8J59k0j10M3MN7j25J7l2k5M4K1k4j0P0J4l7m1l7L1
$$ plain form
5808 153 166 53 123 63 44 222 282 48 337 320 90 199 84 261 207 37 68 91 34 76 291 282 134 168 168 158 328 136 13
5467 13 83 139 133 131 127 208 125 197 280 50 202 112 86 227 55 130 108 239 80 62 74 60 175 73 184 32 161 121 173 257 217
5103 217 233 197 213 102 173 410 223 221 143 260 103 205 15 72 53 68 70 109 70 87 163 89 172 142 220 89 47 92 40 236 97
4740 97 254 106 83 66 132 109 184 155 168 109 127 161 200 81 86 134 34 78 165 149 163 279 177 72 212 212 148 164 129 92 54 121
4364 121 143 235 207 260 162 126 217 160 142 99 168 181 43 79 137 155 154 43 140 62 102 15 148 125 164 241 191 162 223 183 126 146 327
3977 327 293 217 184 234 233 73 264 209 141 109 115 103 89 130 159 194 240 81 84 146 165 60 94 77 101 122 57 44 66 76 83 138 93 103 186
3566 186 280 221 62 216 232 110 169 212 134 165 9 107 79 129 298 167 30 122 58 174 129 45 189 218 199 56 117 133 52 101
3214 101 242 116 122 185 260 151 186 192 169 164 83 62 121 53 212 192 82 125 129 186 61 78 46 21 65 86 62 52 122 136 99 58 21 52
2815E2N3k1O7Q7N3j83j2nJ56j38k4K8R0j30M0o6Q7j6NP9M1q7m1Rj05PN3N8k5K4j26R9L7p6
2416G0P4j5j5Q4r2jm8J36j16K5m5nP3K8K3l6p4J67j47Q6j16l3J13p4M2O6j18J14j6L8o0K6
2040A54o7O9m8q3N4mn4K7M0O9k4J01n3j6q3O7j3L6n8lJ32q4J0L9lkp6oo2M6r3J27L6l6J1Q6
1617B36j30J15Lj15r2N1J44q5L3j11R4l9jK6k9m3L9j2KN6Ql3k0k3%pM9n7J48J3j81k7R9J4
1218A25J2J02p1j9n4K26j13J6op1mn5k4J59q4n5L2N7n0j03NP5O5k1M5r4noj1O9p8K6P8lN5
807B20o9m1L1J23O1o0j67n6Mk9K3P8P1r2k2O0N3Kq2N1j00J53j90J61L5q5n0P5q5J4N0Q3j18
420A02P2K6j53%O5M4j16J04j5J18j1qJ3o9p2J22p8n4L5P3p0OR3P1j61l1K1n5P7r3j6J44l0
33A54j17qJ73LK08k09q2nJ3l6J24J53k04J3r3k3O1O3n4
$$ plain form
2815 52 105 84 151 238 291 108 96 91 247 109 85 113 203 73 113 47 134 118 123 202 243 156 115 124 19 26 79 137 112 136 10 109 146 70
2416 70 144 129 114 198 106 105 57 193 77 102 57 52 125 153 176 140 66 233 86 172 56 23 136 62 104 170 52 166 150 188 128 154
2040 154 87 156 108 25 79 75 21 48 88 157 133 234 181 165 82 149 136 172 114 111 243 159 169 208 205 203 127 121 59 105 12 139 175 139 150 236
1617 236 106 221 224 109 17 68 212 127 160 49 143 104 103 129 100 57 96 84 86 142 150 117 97 74 74 67 116 59 207 220 39 12 111 125
1218 125 137 239 168 149 95 321 208 224 218 147 143 88 64 223 139 84 116 173 123 20 25 100 165 144 189 95 90 84 73 142 64 90 168 165 220
807 220 151 110 141 264 325 265 98 42 46 17 40 118 189 97 75 135 188 190 108 159 59 212 22 183 218 133 83 158 73 87 137 220 102
420 102 174 200 47 47 112 156 40 144 129 247 236 228 241 172 100 222 144 90 125 198 128 134 227 298 137 106 127 72 149 56 40 184 154
33 154 37 29 202 205 413 204 122 117 130 94 218 371 167 180 87 64 125 188 134
-190A34
##PAGE=	F1=-13279.6
##FIRST=	25169.313707327481097,	5807.6787752999953227,	0
##DATA TABLE=	(F2++(Y..Y)), PROFILE
5808A49Ro1M0p6m1K16Q1k33K16L7j83j6m4J42j6j89mO4o9L0J97K0j67P6k6l8J70j23j32ON5
5444I0P2L9n0K3l4J20O6k12O6o9n3J14r4K1O5Q6j55l2PpJ01r6J57j58R5l3K0J07m9M6n6k5
5068A72k5NK28j68qo7J26r8j6j21N3oLo0O0k2J4P1l3M7%Q3j47n0K4J1J34j11J10p7j14K5J34
4681A77m6pJ1L6p8J2M9k6j05N5O3o7L5nmM8J22o4q8J14n7n4K5j9l7n4P5O0O1l1Q5j32q1J18
4282A91n4N5m7qnq7J0O8O4k7j03R9r5Q2o5L1k1J16M9n3q4M0pm1O9Q4k8J7j5K5Kk18K05o1n8
3871A30j6J1%j8OO6N7L8j97L6L6L2j63L9Q2jk9l7l7MQ8lO3q1j9N9R3l7j27J47j6p9NK1o1O4
3448A56r0N1p3O7J93j34j13%m0J69p3p8J53L4k7j10L2M8j21P9J37j07l0M9R0q7k8K1k4O6j13
3085I7JN3n5J57p5j12J8J9M6j08k4K0N4K0K9l4oQK3p2j3Qj7J13n7K3J04M1j62M7o5J25j37
$$ plain form
5808 149 158 97 137 61 20 236 317 84 300 337 154 138 94 236 220 31 27 91 22 52 249 269 102 178 152 114 284 161 29 35 90
5444 90 162 201 151 174 140 260 326 114 180 111 58 172 78 99 164 250 95 63 70 63 164 68 225 67 162 129 149 256 207 253 197 172
5068 172 147 152 380 212 204 137 263 165 149 28 81 75 78 18 78 56 70 141 108 155 155 238 91 41 65 76 210 99 209 132 18 43 177
4681 177 131 124 135 171 93 105 154 128 23 78 141 74 109 104 100 148 270 206 118 232 175 121 146 127 90 36 111 171 232 201 286 154 73 191
4282 191 137 192 145 137 132 45 55 123 187 160 57 156 61 143 78 109 88 204 253 200 116 156 149 108 177 261 233 250 235 260 262 44 249 188 130
3871 130 114 125 125 107 113 179 236 274 77 113 149 181 18 57 139 138 109 72 35 39 127 124 187 106 87 146 239 202 75 222 206 127 132 153 92 156
3448 156 66 117 44 111 304 170 57 57 17 186 113 35 188 222 195 85 117 165 44 123 260 153 123 172 262 175 147 168 144 210 97
3085 97 98 151 96 253 178 66 84 103 149 41 17 37 91 111 140 106 100 108 131 59 46 54 37 150 93 116 220 261 99 146 81 206 69
2697F9K8OP6q9nl3J13ln4R0oo8k8K0o6j0Q0M5j25R9j23Q8P7j58J10Mp0Q3n3L9j17J61j53P2
2298I9K1o6M0O3K7j8n7N4j00R7j46J01m3L1o7J18j10J48o8O1o2M1n5J8m5o9J03r3M8j9L8J07
1923A97k8P5m1%j07Q0j2l7o0M4J36p5LM5l2Op1Nj00M6l1Q7M4nK7N0j37R2l6j38NQ8J43j67
1523I6R2j35Q5n8%N1n6j1N6j6m3P2L5n6l2K1K6k2M4q6J08O4j56n9Q6J9M1J15j14mr4K60j18
1136B11Pl4n2Jr3K5J94q9l8j00Q3l0n1RJ08J8k5P9p8l9Rj0K2r1K2Q0M2J13o5j14N6Q2J3l8
737B27j57K9k4l6L6M2M7o7J5N8rL4o4R0j34Q4j23J20N6p3N7J47k40J2KR8j74J32l6o4J0p3
361B2J12r5O6N4J26l7L9l9j37n7K05p8m8L2L4n0o4J12P4j34l4L8o4L3k5jQ3r0k2k1J68J5J77
-26C94k04p4j4k8j5J06J76j54j5p6l4O0R1m5
$$ plain form
2697 69 97 103 179 90 85 52 165 162 108 198 192 124 96 116 50 40 120 165 40 139 16 104 181 23 133 137 67 150 97 136 19 180 27 99
2298 99 120 54 94 157 184 166 109 163 63 160 14 115 72 103 36 154 44 192 124 185 123 164 109 127 82 13 116 23 71 52 90 197
1923 197 169 244 203 203 96 176 164 127 67 111 247 172 175 220 188 194 123 128 28 74 43 130 174 169 196 246 109 201 165 27 32 120 263 96
1523 96 188 53 138 80 80 131 75 64 120 104 61 133 168 112 80 101 127 105 149 63 171 235 79 20 106 125 166 281 167 163 69 329 211
1136 211 218 184 132 133 40 65 259 170 132 32 115 85 34 43 151 169 144 223 145 106 115 105 127 36 58 138 180 293 228 114 170 252 265 227
737 227 70 99 75 39 75 117 164 97 112 170 161 195 131 221 87 171 48 168 224 151 208 355 115 127 129 227 53 185 149 85 95 22
361 22 134 39 105 159 285 248 287 248 111 54 259 181 133 165 199 149 85 197 271 137 103 141 77 110 85 84 167 77 55 34 202 217 394
-26 394 190 116 102 74 59 165 341 187 172 96 62 122 213 168
-190A68
##PAGE=	F1=-13381.9
##FIRST=	25169.313707327481097,	5807.6787752999953227,	0
##DATA TABLE=	(F2++(Y..Y)), PROFILE
5808A33K8k3J1p8m5K10R5j87Q6R1j10j09jQ6J0j63J2O4m4l7J59M8j63J45n8j00J75l8j21n3
5456B3LJ41R3q8m8N9J24M2j76k4m3k0O3n9k7J50M5j59l7PMP7r1J87j49M2j2oJ26o4O9p1n9
5068A22P3p4J92j35Ln7J24l6j11n3L8J7j7j7j1mj5P0RLL8Q8j52n4jO7N5q5O5K6j10nJ85o8
4669A70j08N3O9r8j3O9q6j2L6N2l4M5q8mN7J22lp6Q1r0n6N0j6j7o5N7J06L1j5P0j39r6J07
4282A59l7J05n3q1l6j9J3P4O7m1o6O2q7J05j4m4m4J61K9p7j27M2K4j5R8rk8J02KKQk51J89
3894B13n5n6K2J6kj4l2R1P8J2j98P6j9M8j60pJ69l3m6j6l7k1J25j2P4j03m7M6R5k1r7J09m1
3507A57k5k2nl4Q2m2pj01J49J28j49k8q5RJ45q5m9J31L9l2n9kP2j53J03J21r3m7L7R7m8p5
3132A29K6k9J23j51K7M1j6J32j26j06MM0%o4J5K3R1jM0l6km7K8j16N7N0j14J52o7k4R7M0j10
$$ plain form
5808 133 161 138 149 71 26 236 331 144 230 321 211 102 101 187 197 34 46 110 66 29 188 236 73 218 160 60 235 197 76 23
5456 23 26 167 260 172 124 183 307 349 173 149 106 86 149 90 63 213 258 99 62 69 73 150 59 246 97 139 127 121 247 183 252 181 122
5068 122 195 121 313 178 181 124 248 212 101 48 86 103 86 69 58 54 39 109 118 121 159 247 95 41 40 107 162 77 142 168 58 53 238 170
4669 170 62 115 184 86 73 142 56 44 80 132 98 143 55 51 108 230 227 151 232 142 86 136 120 103 38 95 201 232 217 287 148 52 159
4282 159 122 227 174 93 57 38 51 125 192 151 85 147 60 165 151 107 63 224 253 176 49 91 115 100 198 189 161 263 265 267 275 24 213
3894 213 158 102 124 140 138 124 92 183 261 273 75 151 132 180 20 13 182 149 103 87 50 29 154 142 216 113 66 112 207 186 89 198 157
3507 157 132 110 105 71 153 111 104 3 152 280 131 103 18 27 172 87 38 169 208 176 117 115 187 34 137 258 165 118 155 252 204 129
3132 129 155 126 249 98 125 166 150 282 156 50 54 94 94 30 45 68 159 158 198 162 160 113 141 25 82 132 18 170 103 79 176 216 106
2744A06P0j31R7j10P8J6K5m3p3K4J18K7r5Q4n4l9j1K8m8J6P8L2j40Q1r3N8J05j22M4km0J3
2369I9OO0j17R6j26P6Q2j10j2Q6N3K3o7o3l3R1j19J61j66J04r8J19j10J68j03O2n7O3k4k8
2016A16l4n0J08j15R3n2L8J21l0N7k3Kj34J03nj12n7Q7J27o9J7M5p5J3n6J6r5K6J5M7N8K8
1641B10J8J9j46M5o5q%R2J24k37J45j56R4q7L5K8j4Q4Qn8p8N0O4l8l5N7Ok9N5j05O8Q9j15
1254A20p5O0L1M3J39j35j4j19K50j12J8n8jl8p9P5J55p2k3r3Jl5J4J4J26k9k4J08n3p3L9l0
878A30k6n2PO4O5J62m9j75N4M7l9J7j38Q4l3m%k2J7l2M6Q8p7P2o6J18j44J8l6L6Q8n7K48J66
479E77l91j4n5J12k18J79r0J4J2o4N7m3kJ05J26o8R0j12j43L2J98r5n1L5j4kj33J14P1q9k7
115A11M5l9j8K4j5K6q5K5K4P9M6J38j90n8j4n5O6J2J53j07j0o1k2N3Q9l3
$$ plain form
2744 106 176 45 142 32 110 126 151 108 35 59 177 204 109 193 139 100 89 117 69 85 163 195 55 136 43 101 206 84 128 126 86 99
2369 99 105 165 48 144 18 94 176 66 54 140 193 216 149 86 53 144 25 186 20 124 26 145 35 203 100 162 105 168 144 116
2016 116 82 32 140 25 118 66 104 225 195 252 229 231 97 200 195 83 26 113 240 171 188 233 158 171 115 131 36 62 77 124 182 210
1641 210 228 247 101 146 81 73 73 165 289 52 197 41 135 48 83 111 97 181 189 131 53 103 167 129 94 151 157 128 183 78 146 235 120
1254 120 45 105 136 179 318 183 169 50 300 188 206 148 147 109 30 105 260 188 165 72 73 38 52 66 192 163 139 247 194 121 160 130
878 130 104 52 59 123 188 350 301 126 180 227 188 205 67 151 118 114 114 92 109 77 123 211 134 206 140 258 114 132 96 132 220 163 411 577
479 577 186 172 117 229 11 190 100 114 126 62 119 76 74 179 305 237 327 215 72 104 302 207 156 191 177 175 42 156 227 138 111
115 111 156 117 99 123 108 134 49 74 98 177 223 361 171 113 99 44 110 122 275 168 158 97 75 128 217 184
-190A84
##PAGE=	F1=-13484.2
##FIRST=	25169.313707327481097,	5807.6787752999953227,	0
##DATA TABLE=	(F2++(Y..Y)), PROFILE
5808A13N8noo1k5J49J03j25n4J30l0j41JK8Rj15M2M7jq0R0N7j17J92p3j59J56M9j09n0j1Q9
5432A51J45j09j22J48J19J7j33j02j7J4L6n6o2K08J7j64k7J0MN1p5J86j26kPNJ06q1R1q4p3
5068H2J54j44J43j00K6o2J24Lj59k2M8L8n8L3o3L9k8K8M0k4O2Q1j37m9j0Q3k2p1L7J37q3k9
4693I7K02q9j63M4J12j19n4J02q7M0QJ6mO6j11m5M5J22N3p0M5q9n8O4j1%n9K0J45K8JJ2j30
4305A33o7O2j7J25m5j13m1k0N1P8K7m2k6On1J01M4p6o9J62J5j08j02K9L8K4Q0o9l5J67J3j7
3930B57J6k29J14l6m3P2jk1Lm9R6Q7k2j73J03p8O7j18K7J32p5k4mk1m8J18k2R5j10o4N0R8
3554A97j9p5N0n0K1qk1k8R6k2o9l4J61K8j78J05o2l7Q0p2j5Q8N1l9Nm5Q5j29O9J03q1n3L2
3167A34R3jq7J9m7J61j81M5L2K9R8j59r2J4O4p2j9M7K4J13k3O0m5Ko5J3j34J27O2j87J38o8
$$ plain form
5808 113 171 166 160 99 74 223 326 201 147 277 247 106 107 135 144 29 71 118 117 37 127 184 67 259 186 27 183 232 123 73 62 151
5432 151 296 187 65 213 332 349 216 114 97 111 147 91 29 237 254 90 63 73 77 128 53 239 113 111 118 123 229 148 239 155 82
5068 82 236 92 235 135 161 99 223 226 67 45 93 131 73 106 43 82 54 82 122 98 160 241 104 55 45 128 106 35 72 209 126 97
4693 97 299 210 47 91 203 84 30 132 45 85 93 109 105 171 60 15 60 182 235 165 210 121 63 127 116 116 57 77 222 250 251 263 133
4305 133 66 128 111 236 191 78 37 17 68 146 173 131 105 111 60 161 205 129 60 222 237 129 27 56 94 118 198 129 94 261 274 257
3930 257 273 44 158 122 79 151 150 129 132 83 179 266 244 71 174 96 163 45 72 204 129 105 101 80 32 150 128 223 113 49 99 197
3554 197 178 103 153 103 124 116 95 67 163 141 72 38 199 227 49 154 92 55 135 63 48 136 187 148 153 108 193 64 133 236 155 102 134
3167 134 227 226 139 158 111 272 91 136 168 197 295 136 44 58 122 50 31 78 102 215 192 252 207 209 144 157 23 150 212 25 163 95
2791I5m5P0M0o0Q0j69O1n4J00M2j5j6j07M5R6O1j06O6r0mj3M5m6M4P7J2j25L5n4K5J17m2k6
2404A39l5K2o3P3M3j00J2m3N0J13j42n2R4Q3P3q7j57L7O7q5J80j37L3m3P0j21J71j11M1m3
2052H2Q8J9o5l4n6J16q7Q5p2L9J18k0M5j2j1j50J26Pj69m6R8J16o1M9K6j07J4k3J0q3K5M0
1676A07J5O0N4%Qj48j7p1J32m2R5R2k68J65j64J15m5J6l4Q6J27k7r8j02KQ8Pj7O6l2k6P2j16
1289A00L1P4n9p8L1M5L4J62j45l5j06J84r4M5o5Q0j24LP9P0m3ro0n0k4L6j3J43n8k1J17l1
913B19p9O5n3p2jpN7O1J92k7k19L6K6p5Q0j18R9k4K8l8q8j5K2M3J43j36J02q8J38j41k6J5
538A19l9J20k8M57J53n15n5j16J24j82J43j20P6Kpj8ql4J10J19r8J34j86l7M1J83j22n4L7
197A99o4N9j82J00N9l7nL7lj7J3n7PM1n2N8k3Q4J04j67m2%n2J26n3N0o3K2n3LM2O6k2
$$ plain form
2791 95 50 120 160 100 180 11 72 18 118 160 145 129 22 67 163 224 118 184 94 90 77 122 76 120 197 209 84 119 65 90 207 165 139
2404 139 104 126 63 136 179 79 91 48 98 211 69 17 111 194 267 180 23 60 127 42 222 85 118 75 145 24 195 84 125 82
2052 82 170 189 124 90 34 150 63 148 76 115 233 213 258 246 235 85 211 218 49 3 101 217 156 205 231 124 138 115 125 42 67 107
1676 107 122 182 236 236 244 96 79 8 140 98 193 285 17 182 18 133 88 104 70 156 283 256 158 56 58 146 153 136 202 170 144 216 100
1289 100 131 205 146 68 99 144 178 340 195 160 54 238 144 189 124 204 80 83 162 232 189 180 120 70 46 82 69 212 154 133 250 219
913 219 140 205 152 80 79 72 129 190 382 355 136 172 198 123 203 85 184 160 188 150 62 47 69 112 255 119 221 133 271 130 104 119
538 119 80 200 172 629 782 267 212 96 220 38 181 61 137 139 132 114 106 72 182 301 203 337 151 114 155 338 216 162 199
197 199 135 194 12 112 171 134 129 166 163 146 159 102 109 150 98 156 133 217 321 154 112 112 60 186 133 183 120 142 89 92 134 200 178
-190A78
##PAGE=	F1=-13586.4
##FIRST=	25169.313707327481097,	5807.6787752999953227,	0
##DATA TABLE=	(F2++(Y..Y)), PROFILE
5808A00P4%ql2j2Q1J05o6j60J33L8j33qqk8m7O1J3N7r2M4Lm0J95o0j25M5J23r8m5K1mJ76j12
5409A91j48J76J14pr0j56LL0L1o3p3K19Pj64JJ3k0K7j7J35r7%oN9L6r5J17r9m2J81j80J04
5033A87q2M8q7J40Rj60j4P4L5j04P2r4R8j3k7M2j2M5O1j00l7j2O9p2k6L3J68p0l4K07j07j43
4657I4l8J57j42l7R5m2K8pl0K9Q0j06p7K5J30P2p4J3n2l9L3KOl3l1J66O2ko5j06k7K6j4J26
4258B22k0q7J5r2N8P7l3l3Pn1kP7R2q1o3J20%j24Pk7J9O6K9q2m9J98J8k8K6j92K5j1J7R1m1
3848A48n3L3l1P2Q3m5j23R8j33Q7r1J05N9j25K5Kmp4Q6k9J22j02p0O7J04k1p1j6k6L0K5j1
3472A21n5J20k7j24L5J55o2r0J26m5q0Rk6LM2O5m7P8r5Q5o6rQ9p0n6L4P7M7p0J2q1J81j79
3085I7L4L7N4P1j65q1L3Q1p9m3M7L9J24l7Q4o6Mm8k2j22J78N8k20P6o1l4L5L3l3Q5j00k7K
$$ plain form
5808 100 174 174 166 134 122 203 308 242 82 215 253 120 112 104 76 29 90 103 160 68 112 115 75 270 210 85 130 253 155 110 131 127 303 191
5409 191 43 219 333 326 236 80 83 113 144 81 8 227 234 70 71 84 64 91 74 209 112 112 106 165 201 106 223 124 82 263 83 187
5033 187 105 153 66 206 215 55 41 115 150 46 118 24 122 109 82 124 112 157 218 118 81 69 138 66 40 73 241 171 137 344 237 94
4657 94 56 213 71 34 129 87 115 108 78 107 187 81 4 29 159 231 157 170 118 79 112 114 120 87 56 222 284 282 217 111 84 110 96 222
4258 222 202 115 130 38 96 173 140 107 114 63 61 138 230 149 86 206 206 82 89 62 81 147 176 94 45 243 261 233 259 67 92 81 98 189 148
3848 148 95 128 97 169 252 207 84 182 49 136 45 150 209 84 109 111 107 33 119 90 212 110 40 107 211 190 119 103 77 107 132 121
3472 121 66 186 159 35 70 225 163 73 199 154 74 83 57 60 102 167 120 198 103 188 122 113 202 132 76 110 187 234 164 176 95 276 97
3085 97 131 168 222 293 128 47 80 161 82 39 86 125 249 212 296 230 234 186 164 42 220 278 58 134 73 39 74 107 74 159 59 32 34
2697C4Q6O7j9j2q4LM7R4q6L8j08L1l7O6l4M9P9j7j15J0j4j1J14N9q1o7N9r3J11om7o4QN6J06
2286B22j72%L9J00J19j06j68L4M6o0J66o3o7J7M9j30J39q7PqR6O1r5n6m5J11o1O1p5M1J05
1923B20NL7k0k9j46J38K1k01lM3J08m0Q0rj08NK9j8p5L3O2pL6O8j1K4j35p4M5R6p3R8N5k15
1523C9J04j40J25M2m0r7J89J33n5j21j12l8Q2N3J3O4o6j2Q5j22j2M0%p3J3M6K5J79j54n7o3
1160G0Q7o2P0m2J47j94M7R6k9j5Nm6m9LL5p3J58o1k5J04j5n0P4o7r2K7j5O4M1J93nk45K4J3
761A73o5R4j01R4nN3o7j15MM3j0J97j71J15j20J46j32l7J6q0J34J2O28J20n87j04j71J34j23
420G5Q2j13J10j5M3o6Jk6P9R7j18J65k38R2J2J77j45n5L6j17J25j91O4L2K2K2J5L0J6k9j18
56F4P6J15j28P1j13J12Q0j32k9K8o1J65m9j13k0O5o0L4K6L5j3
$$ plain form
2697 34 120 187 168 156 72 75 122 216 130 168 60 91 54 120 86 135 214 197 82 92 78 67 181 240 159 92 151 58 169 163 116 52 60 116 222
2286 222 50 50 89 189 308 202 34 68 114 54 220 157 90 107 156 26 165 78 85 77 173 234 139 83 38 149 88 149 74 115 220
1923 220 225 262 242 213 67 205 226 25 22 65 173 133 213 204 96 101 130 112 37 70 132 125 161 229 218 242 107 33 78 174 101 199 254 39
1523 39 143 3 128 170 130 33 222 355 300 179 67 29 111 164 177 241 175 163 248 126 114 154 154 81 94 140 165 344 190 133 70
1160 70 157 95 165 123 270 76 123 219 190 175 180 134 85 88 123 50 208 147 122 226 211 161 235 168 76 103 88 152 193 386 381 136 160 173
761 173 108 202 101 195 190 243 176 61 65 108 98 295 124 239 119 265 133 96 112 32 166 178 806 926 339 235 64 198 75
420 75 157 44 154 139 182 116 117 91 170 267 149 314 76 168 180 357 212 157 193 76 201 10 74 106 128 150 165 195 211 182 64
56 64 140 255 127 198 85 197 277 145 116 144 83 248 199 86 66 131 71 105 131 166 153
-190A53
##PAGE=	F1=-13688.7
##FIRST=	25169.313707327481097,	5807.6787752999953227,	0
##DATA TABLE=	(F2++(Y..Y)), PROFILE
5808I5O2MNnJK0J02k3j87P6Q0j07j0k0o6K9M9l8J19q7N6j19L8J62j8p2o7J71q6l5N5p5J66
5420B75r5r4J29J00l4m9j81J5K7M2p1n7J75J9j47L3J2o4LQ1N4p3N2n6J22n4j02J49j18J5J64
5056B72j80J04q9M8j01J65j6j31kR2j0j02N8r3J39Kn6K4J5JL9m8k1k2M9o4L1L7J14p0k2K00
4681C63j23j08j19J88j63O0L6k4K6k0o2O3O9j05o0J0J41M1q3r%j1k1L2rJ3q3J61J14k0j45
4317A52o5NJ5l1J20J5o2N8j14M3O3r5j6K6m9lM4J20o7k8N8k5q6N2n5qJ01l4m6n9J80K2l3L5
3918B33j53m4LR9Q4r0q9O7J9K6P0l9o7N8j67R8p8J96k0j54N9%J2r1L5k7J56q8o3Q1J08j1r0
3531A33o0J3%N2J5q9J47m3j32N3J33q9O3L0l2j13n0M2L%P1m3J46j43P5jr0Q0o6n6M4M3R1m3
3132A84J8j25J86j32k0O1M7N8j49p3M4Q6n2p3J9N6J22l5J02r4jqo9r0K10M4k22Km8qK7Rm0
$$ plain form
5808 95 157 161 166 161 162 182 284 261 74 150 230 123 113 93 27 56 105 67 186 99 155 36 74 236 218 146 79 250 164 129 184 109 275
5420 275 180 86 215 315 281 232 51 66 93 135 64 7 182 201 54 87 99 35 38 119 173 100 152 96 218 164 62 211 93 108 272
5056 272 92 196 107 155 54 219 203 72 70 162 152 50 108 15 154 156 100 124 139 140 179 131 110 88 137 73 104 141 255 185 163 363
4681 363 240 132 13 201 38 98 134 110 136 116 54 117 186 81 21 31 172 213 130 121 121 110 89 121 112 125 42 203 317 297 152
4317 152 87 92 107 76 196 211 149 207 93 136 199 104 88 114 65 62 106 226 159 131 189 164 78 130 75 67 168 134 88 29 209 231 198 233
3918 233 80 36 39 138 222 132 43 110 129 155 225 186 119 177 10 108 30 226 206 52 111 111 123 32 67 40 196 108 45 126 234 223 133
3531 133 73 86 86 138 153 64 211 168 36 89 222 133 196 226 194 81 31 73 76 76 147 104 250 107 182 181 91 171 105 49 93 136 227 184
3132 184 202 77 263 131 111 172 219 277 128 55 99 185 133 60 79 135 257 222 324 230 229 221 152 62 272 316 94 96 48 40 67 76 36
2744C6Q6k5m7lP2P8Lmq9k6k1J25m3Nj13O2n4P0NJ3Q2n3j06L5nm6J16J44j28o6N4q7J14p5N9
2333A68q2l2Q8O6k01R5lQ2J52j16j66K1L2l1J14K7j57P1M4j22P0m3j4L2P7R4j15r7J3P4m1
1970A00K1n8M3Q5M0K7m6l7j24J36L1j93M2o2J05%R3n1q0oR8o3n0J4Q7k3j0O9pO5j21p5P4M6
1570A70r2J05K7j50K5o9J01J26r1p5K03J11p6j31j07j1J4P3M6O0p8J3Q3j19o4J6L4o4K1K3
1218A24K0J88j65p4rnrO2MJ82k10K8J26j01j0K0m8k8K3N1j43J54l2m4O9OlO3o8p2K4pO6J5
819A97J64J3k47L5qk2N1q0Q1PP2p9j09M2M0n5K21j74J10j54J45j20k1k9j1N5N7P17P8n92j48
455B36k09J34n8K1o5J04l2P7r1j0KL9N4j18J71k46J87j8J80j56n1K3j62J83j75M0k2Q9L6r
103A54N2N8p2j67J79J35j86O6j68J08O8q0j5N7q3J74lk09MN9p2N2LJ1q
$$ plain form
2744 36 122 97 50 47 119 197 200 196 107 81 60 185 142 147 34 96 42 112 117 130 212 159 53 88 83 37 153 297 169 103 157 70 184 109 168
2333 168 86 54 142 208 7 102 99 181 333 217 51 72 104 73 187 214 57 128 172 50 120 77 63 95 172 266 151 54 67 141 100
1970 100 121 63 106 191 231 258 212 175 51 187 218 25 67 5 110 110 203 152 72 66 164 101 51 65 152 129 119 188 181 246 125 50 124 170
1570 170 78 183 210 60 85 16 117 243 152 77 280 391 315 184 77 66 80 153 199 259 181 194 277 158 94 110 144 80 101 124
1218 124 144 332 167 93 84 79 70 132 136 318 108 136 262 161 151 171 123 95 118 169 26 180 148 104 173 179 176 239 171 99 123 116 182 197
819 197 361 374 127 162 154 132 183 103 184 191 263 184 75 117 157 102 323 149 259 105 250 130 109 80 69 124 181 898 976 384 236
455 236 27 161 103 124 59 163 131 208 117 107 109 148 202 84 255 9 196 178 358 202 151 174 12 195 20 60 38 127 163 154
103 154 206 264 192 25 204 339 153 219 51 159 227 147 132 189 106 280 277 68 72 131 59 111 114 125 117
-190A17
##PAGE=	F1=-13790.9
##FIRST=	25169.313707327481097,	5807.6787752999953227,	0
##DATA TABLE=	(F2++(Y..Y)), PROFILE
5808H6L2J4K8J2J4k0R2pj66J4Q7p2j1k8j9L1K4r7J77o5Q5j64OJ05M8j5j57J85o9j6Q2j03J00
5420B13n9l1R3O7o5j2j76J9RP3q8k1Q9N3q9L4Lj06K3J41j9o4J20j16J63j32r4J66j26O2J32
5056B62j65J26j00L3o9J77m6j04MJ05q6l6j3m3J22J1o5OL3m5K6jKl6K9k5O6L0M9q1RJ77j37
4669B15o7j04J18j37J36j9l3M4l7o6Q6L4j16lk7J68nr4pL1J6o5P0m4O9j12J17J65l8k25j2
4305E8K3K3n1J22M2o5J02j05L0M0j46J3J8J4n5J9J18m4K1Oo4qL8p0k0J14q8K1o1J14L1k9L9
3918B00j15k0n9J60O9j29o1L6Q6k4N1j2k8Rj33N2j7K22r2r8J9j7K6r2k4J5J60p1m5Q6R2J0
3542B56j17o9J7k1O8M4j16J66n5r7J9R8l3J46p7k3j26n3P3Ml7N7j1J84j70N5M5j42P4o8l9
3178E2M4j3J26j9L7j71J82n7j00J00NO3j21o6M6P6k0p4kM7J05oJ00j18k5M3j11m0K12K0j90
$$ plain form
5808 86 118 132 160 172 186 166 258 251 85 99 186 114 103 75 56 87 111 14 191 126 211 47 53 158 206 191 34 219 150 134 216 113 213
5420 213 154 123 216 283 218 206 30 49 58 131 43 22 111 164 75 109 112 6 29 170 151 87 207 91 254 122 28 194 68 130 262
5056 262 97 223 123 156 87 264 218 114 118 223 137 101 88 45 167 178 113 119 152 107 133 132 134 98 127 102 168 198 247 166 175 352 215
4669 215 148 44 162 25 161 142 109 153 116 50 136 170 54 51 24 192 187 93 86 117 133 68 138 94 163 51 168 333 295 70 58
4305 58 81 104 53 175 217 152 254 149 179 219 73 86 104 118 63 82 200 156 177 183 119 111 149 79 59 173 85 106 45 159 190 161 200
3918 200 85 65 6 166 235 106 45 81 167 143 194 182 154 163 30 82 65 287 195 97 116 99 125 33 9 24 184 113 68 154 246 256
3542 256 139 70 87 66 134 178 62 228 173 76 95 193 160 306 229 206 80 27 100 104 67 124 113 297 127 182 227 85 159 91 52
3178 52 96 83 209 190 227 56 238 181 81 181 186 249 128 62 108 184 164 90 88 135 240 234 334 216 191 234 123 83 295 315 125
2815A25o2l8J5M5j1n8O4L1n5jO0P1L2K3j12m3o7J21J7l5j03P8l5M3O0n1P9r0n8P9m5l7J31
2427A73J58j74l4K7p1R3j52K13r0j06J25J5j19R8k2L7J69j14j75K4K1QL1J14j97R3M1j07q
2087G1LNL7M8J11j21j24P6K3j7k8k7L6O4P5J1q0k6r1J15L5j41P2n0m0N8P8p6n2mJ70j07j5
1700H9l1J09l4o6N8J2J15j16p4P9or0J09J5r9m6rQ4J84j20k3J83O7r0j26r1K0k4M4P0N8n6
1324A95M4N9j04j06K7Qn5N1j8J7J95j75p0K9o3M3K4M7J82j84l3J69j20m0L8n3lK9P8j46P3
960A38K4o9RN3K8K9n7l0J0J0O5pJ09K2k16O6m3J0j1m9P0jQ3o7j02O3N0o2K06j45R4j92J47
573B35j08Pj01R4m0R0P05L7n26j78j79Q2%k8nQ6m7Q8r7l5L7J2j5o0J17j29J50l4J90j53n1
209A44Mr5J28j47L9m3J06K9k8N6J01j04r6J72J21k14M5j73O2O4rlQ1j06J38O8k03j4K1o8L6
$$ plain form
2815 125 63 25 40 85 74 16 80 111 56 55 115 186 218 241 129 86 19 140 157 122 19 97 62 105 165 114 193 103 45 124 79 42 173
2427 173 331 157 123 150 79 172 20 233 143 37 162 177 58 156 134 171 340 226 51 75 96 104 135 249 52 145 186 79 71
2087 71 74 79 116 164 275 154 30 106 129 112 84 57 93 157 232 243 163 137 46 161 196 55 127 77 37 95 173 97 45 41 211 104 89
1700 89 58 167 133 67 125 137 252 136 62 141 135 45 154 169 70 24 15 99 283 163 140 323 390 300 174 83 103 79 123 193 251 195
1324 195 239 298 194 88 115 123 68 119 101 118 313 138 68 97 34 77 101 148 330 146 113 282 162 122 160 107 104 133 211 65 138
960 138 162 93 102 155 183 212 155 125 135 145 210 203 312 334 118 184 141 151 140 91 161 160 243 176 74 137 187 125 331 186 280 88 235
573 235 127 134 33 127 87 177 882 919 393 215 36 118 118 90 85 171 124 212 115 80 117 129 114 54 171 42 192 158 348 195 144
209 144 148 53 181 34 73 30 136 165 137 193 294 190 94 266 387 173 218 45 107 171 162 159 240 134 272 340 137 123 144 76 112
-155A12k6Nj0
$$ plain form
-155 112 86 91 81
-190H1
##PAGE=	F1=-13893.2
##FIRST=	25169.313707327481097,	5807.6787752999953227,	0
##DATA TABLE=	(F2++(Y..Y)), PROFILE
5808F3%L1O0J2K4l0P4k4j45PO3l3k2k0J5L0jn2J26k7J08j40j01L5J26L3k05J58m4J2J02r7
5432A38j3qJ6Q9K6j05K3j46K0k3J24j01K3l2J03oJ0j8p5M3J27p1n8J75j69J70j82m0J27j12
5080E5Q4R6j49J39r4K2l0J98o0r1nJ17j73N2q7JQ1J5n8mL8p4K6J5L4m9J1K2Q9Nnr5O0J29j52
4669A63k0n5J7k2J26o4n3P8m7p1J07j6j11N5q2J89l8q8J6J5L8o8R1q8J19j10M5J94l2k53j0
4305B5K3M8n4J23N4j00J43p1J9J7j77N1j5P2r5J3R1k7P1k1j11O4J5q5j4J01j04Q5p5K9N6k2
3930A29L1o9K4p9J37N0j48L7n8J49o6K8Nkk5j06J8P7J89j47j9k9n1L8q2J1K4J09m8j9P8M7
3554B33L8j37o7rj2Q2O6j31J70n8o3k0N3N3J84j72k2j15k1P7J9p5K3M5J84j64K0O8j57P1o3
3190A00k0L5p9J55j3O2k03J74J6j80J38n8Q3q8n5L8N0J2n0J2MP5M4P5j27p6R5j33J3J83oj31
$$ plain form
5808 63 63 94 154 166 190 160 234 210 65 72 135 102 80 60 75 105 104 52 178 151 259 119 18 53 179 212 7 165 121 133 235 138
5432 138 125 117 133 222 248 143 166 20 40 17 141 40 63 31 134 128 138 120 45 88 215 144 86 261 92 262 80 40 167 55
5080 55 139 235 86 225 131 153 123 321 261 170 165 282 109 161 74 75 156 171 113 109 147 73 99 114 148 99 110 132 221 226 221 126 186 315 163
4669 163 143 88 105 83 209 145 92 170 123 52 159 143 32 87 5 194 156 68 84 99 137 69 160 72 191 81 126 320 288 35 25
4305 25 48 96 42 165 219 119 262 191 210 227 50 101 86 158 63 76 167 140 211 190 79 143 158 73 59 160 56 141 66 95 151 129
3930 129 160 91 115 36 173 223 75 112 54 203 137 165 170 168 143 37 55 132 321 174 155 126 75 113 31 42 66 175 127 108 186 233
3554 233 271 134 67 58 46 128 194 63 233 175 112 92 145 198 382 210 188 73 52 129 148 73 96 141 325 161 181 249 92 163 100
3190 100 80 115 36 191 178 240 37 211 227 47 185 127 210 122 67 105 155 167 117 129 133 208 252 327 200 124 219 86 99 282 276 145
2815A45q9k7J8N3k2m7J4N2o0K5M9M5O2O2j37n0j7J1R1q4n9N5j2K6J11j09N8j14M7P9j07J1
2439H0J62R9k22J2Qn5N7n1K05j09j68J48k5j1P6l1j3J66r7j81L5KN3n7J75j90Q7L5q8o5K6
2075F3M9J3K0J09j04q0P2l2L2m0l2J0N7R1j3j02nn6Q1L1q0J00k6j00L1M2l2n8qK29j40Lp3
1688E2J26m5r9M3K4J48j21p7Q6n1k2N5K8o4k3l7M8K00j15M0J53J2j02r5p7L7k5j4P8N6KO8
1312B89J6p6j21L4l7n4P9n4J6K03j67l2J5p4N1J6M7J51j29j15K14r5q3N7l2KJ7J04j23k5R3
948A87o5n8J26qj8m8K1mK5O9j9L8K5j50R2q4K5p6j0O8k8Q0k6q9M2P3m0J67q8P0k32J62r2K7
549A62j34J42r9R4O01Km02j85j09J8K6m9M3P6o1P5q8o3O7Qj04R5k6k9J00l0K00j39o1j5pN5
174A63j01L7oN7Pm4N1J32j13j2J45P7k12J6j51QN7P3KJ00j21N9J46j82k4Km8j0m7J6j5
$$ plain form
2815 145 56 29 47 100 78 31 45 97 37 62 111 156 218 280 143 93 76 87 178 94 35 90 78 104 215 106 164 50 97 176 69 80
2439 80 242 341 119 131 139 84 141 90 295 186 18 166 141 130 206 175 162 328 231 50 85 87 140 83 258 68 155 190 102 37 63
2075 63 112 125 145 254 150 70 142 110 142 102 70 80 137 228 215 113 108 52 133 164 84 184 158 58 89 131 99 41 33 262 122 125 52
1688 52 178 133 34 77 101 249 128 51 137 86 64 119 147 83 60 23 71 271 156 196 349 361 259 164 87 124 99 85 163 219 221 289
1312 289 305 229 108 142 105 51 130 76 92 295 128 96 111 37 88 104 151 302 173 58 272 177 94 151 119 121 138 242 119 94 187
948 187 122 64 190 182 164 116 137 133 158 227 208 246 271 121 213 129 154 78 68 136 108 188 162 73 115 188 148 315 227 297 65 227 135 162
549 162 28 170 71 165 766 768 366 181 72 90 116 67 110 186 125 200 112 49 116 124 20 115 89 60 160 130 330 191 130 115 108 163
174 163 62 99 93 150 157 113 164 296 183 171 316 393 181 197 46 54 111 184 186 286 165 224 370 188 164 166 118 108 61 77 62
-190F2
##PAGE=	F1=-13995.4
##FIRST=	25169.313707327481097,	5807.6787752999953227,	0
##DATA TABLE=	(F2++(Y..Y)), PROFILE
5808B9K0J0J03j4K8j1M9o9j35N9K6Ln3N9l3L6k4L5L5K1J20j21j35J9Q7O1j70O4rM7J12q0j42
5420B7N1M0R6Kj51N7j09K8k3J42q9N1p0O4P9k2n0m9N9J13j09m0K04k08J47j93J9O4p9Q2O2
5056A95j37J36p1K5j1K32o0q0k9J20k42J35j39J7L3J7m4RL5n6J8k7P0n2mP1R7l6l1r7J14N3
4681B61j67L3j4o9R4R8r9o4J17m0j08J37o5l7L9p3J39n7n2K9l3N8l5Q6j33J53q4k9J95Jj55
4317A26p1m5P7l7J10N7j58J71k4J0mj87J03o4J03j06K2N8k6J08k5j50J15J3j17nP7n4J05q8
3965I4n6Q3j6J5j2M1q9J00L5j50J29j14J70r2Qj3J9l1r5LJ67J24j83N7o5q9N0o9N4K7O1j2
3589A51NN2j9P1j44p0m2J9J06P1j35J57m9l6n4RJ28K00k38l6q2mR7M0j07k1R4J60j22k8O8
3225B41j50P7m6j9L1j13J64l7R0k07J63O1k26J49j24J12n3m1K0J6M0j9M7m2M1R6M0j23j41
$$ plain form
5808 29 49 59 162 148 176 165 214 145 10 69 95 98 45 104 71 107 83 118 153 174 294 173 38 57 144 205 35 99 90 137 249 169 27
5420 27 78 118 214 216 65 122 13 41 18 160 71 122 52 116 195 173 123 74 133 246 137 97 301 93 240 47 66 130 51 133 195
5056 195 58 194 123 148 137 369 309 229 200 320 78 213 74 91 124 141 97 106 141 85 103 76 146 94 90 161 258 222 191 94 208 261
4681 261 94 127 113 44 138 236 137 73 190 150 42 179 114 77 116 43 182 125 73 102 69 127 92 178 45 198 114 85 280 281 126
4317 126 55 10 87 50 160 217 59 230 206 216 212 25 128 64 167 61 83 141 115 223 198 48 163 176 59 54 131 77 182 94
3965 94 38 121 105 120 108 149 60 160 195 45 174 60 230 138 146 133 152 121 26 29 196 320 137 194 129 40 90 21 75 102 163 151
3589 151 156 208 189 260 116 46 4 23 129 200 65 222 173 137 83 92 220 420 182 146 64 60 157 197 90 69 163 323 201 173 241
3225 241 91 168 122 103 134 21 185 148 238 31 194 255 29 178 54 166 113 72 92 108 148 129 176 134 175 271 311 188 47
2885D7J30j22M6J35l0n5q0KPL6m4m4nL8m0N4L2JR2J05j51n1J6q9J76j35j4K0nL5J50j39J7
2498A35p4R5P1j63N1K01J2k68N8J3m5L0Q4J41j36j74J18l7Q5M6l4n2J39o8j58L8l3R7j25J95
2146B42j69P9K9o6o1j1J00k3kQ6o4j8M7p9J03k3p2j7N9Q1m4r3Rl9N2J8k4J23jr3m7NO4o7m7
1735C7K71j66%r2J33n2q9M3oJ49j29p3R6p2P1l1N1l5Nn2j6J61p5J10J17m3j09k5q6L4j5n0
1359F2O2M8Q4P7l9m1j17Qm7o0Q8o8J2K12j37oj9q6P6M4rR1m8j62K07m8j20Q7Qj7pJ16r2r8
960F1J56m0m6J38r1n1o8O6j2L5Q1k3l4K4n9R3j17L1j02MP3l0K0M6m4n9J08KJ17j9M3k59J84
573B28p3L5j16J14j20Q1M32k6k41j70n1OKm7P3Q5p6M3o6p5P4K1o0J19r7m6O7j2K04j28p5k9
197G6P1ll7K3J5K0k0o2N0J41r6N1J25Rj84j7j31K6jJ45MJ12j26m0K08j55k3J1k8o1k8J2j5
$$ plain form
2885 47 177 55 101 236 206 151 71 73 80 116 72 28 23 61 21 75 107 108 200 305 154 103 119 30 206 71 57 77 72 107 257 118 135
2498 135 61 156 227 64 115 316 328 60 118 131 86 116 200 341 205 31 149 112 197 243 209 157 296 228 70 108 75 172 47 242
2146 242 73 152 181 115 54 43 143 120 118 204 140 122 169 90 193 170 98 81 140 221 177 84 93 54 106 124 100 223 222 129 82 87 151 84 37
1735 37 308 142 142 50 183 131 42 85 79 228 99 26 122 50 121 90 141 106 111 59 43 204 129 239 356 313 204 179 93 127 112 62
1359 62 124 172 256 333 294 253 136 144 97 37 125 57 69 281 144 138 119 33 109 153 144 235 187 25 232 184 64 151 159 142 135 251 159 61
960 61 217 177 131 269 178 127 59 125 113 148 229 206 172 196 137 230 113 144 42 46 119 89 109 155 111 52 160 162 279 260 303 44 228
573 228 155 190 74 188 68 149 581 555 314 144 93 99 101 54 127 212 136 179 113 38 112 133 73 192 95 49 116 104 308 180 105 76
197 76 147 144 107 130 145 165 145 83 133 274 178 229 354 363 179 162 31 57 56 201 205 317 191 151 359 204 181 192 164 103 75 87 72
-190G2
##PAGE=	F1=-14097.7
##FIRST=	25169.313707327481097,	5807.6787752999953227,	0
##DATA TABLE=	(F2++(Y..Y)), PROFILE
5808E9N7q2J50n6J6L4K3j31oJ5J0J6q5J63j01J8l8J11n0O8J27j15j21O6l2O0j17k2L2Q5J14
5444B68p0j27k1M8Q2J0j80P3o9L0lJ37o7P4p8MJ56n3r0m0O7J04j35j1K04k25J12j65M3J3l9
5080E2O6L1j24J10l3M7k9K75m6o9o4J10k62J86j71PqK9l3N0L0k6Oj10R9l6j8J23R0r2j9n8
4704A13J21l1j78Q5Kq5J45O7j22n1J47j8j76J72j03M2jm6R1p9jK0q0P9RO5j70J62m0p9J60
4340B20N2o5q4m9J4k5Q6O2j66J24K0%k2j53J44j05Q7q1L8L5m0J23j8j68J44L3j54k1N8K1J08
3977B18q8m5J5k0NM7L1q9O2L6j45J90j18J44j05Mo8L3lp5KK05M7j96J15q9j08N2n4Q4M0K2
3601A49L3K0Jq6J10j33p0M3l7J03O3j26J26l4j7p5k1J73J99k52p5l9jJ25N7j25n6J08J27n4
3249B36p8M8j34R0j5l8L1r5J48q0J09j83J55O5k14J11j17R0k5k6Nj9N3MQ4o9J7J24J7j15r6
$$ plain form
5808 59 116 34 184 128 144 178 201 70 64 79 89 105 20 183 82 100 62 173 123 191 318 203 82 148 116 176 59 37 69 154 268
5444 268 198 71 50 98 180 190 10 83 14 44 41 178 111 185 107 111 267 214 124 84 151 255 120 109 313 88 200 35 78 91 52
5080 52 118 149 25 135 102 149 120 395 349 280 216 326 64 250 79 86 78 107 74 124 154 128 134 24 123 87 69 192 282 190 171 113
4704 113 234 203 25 110 112 27 172 239 117 66 213 195 19 191 88 130 129 83 174 95 94 114 34 113 122 187 17 179 139 60 220
4340 220 272 207 123 74 88 63 149 211 45 169 189 189 167 14 158 53 140 59 97 132 92 215 197 29 173 206 52 31 89 110 218
3977 218 130 85 100 80 85 132 163 74 136 172 27 217 99 243 138 142 74 107 104 29 31 236 283 87 202 113 5 57 3 87 127 149
3601 149 182 202 203 117 227 94 24 67 30 133 196 70 196 162 145 70 49 222 421 169 94 55 54 179 236 111 55 163 290 236
3249 236 158 206 72 162 147 109 140 45 193 113 222 39 194 259 45 156 39 129 104 78 83 64 117 121 205 136 153 277 294 179 83
2885H3L3p5M7P8m6K8o2M8kJ2q8j7k2J8K8L4Qn5J18J40j49m6K8j06K02j71Oj0j8O5J77j38l5
2498A13lR3O5j93O7K23o6k68N3M7m6M2J63P5j66j27M2k0J50J3l0o7Q7l2j11L6q2J39j61J70
2146B06j48P6K9m4l7o4J44n1j6L9oL3K5r2J54j5j07k4N8N5p9n6J4n2L8JJ6J39K0p6j09j4J37
1758A94n7r2K89j79k1q2J30m8q8N5l6J18j29l0Q1m4J11r9O1kRl5m4L7j2J78P9q5j10O8j17
1394A00K0j1l8K9K2J67O9r7mj04m9j1n8P4o1RK14j02pm8p3J16N9q9J4N5q9O2Nj43J32M0m4
1007A59l5J06n8j20J92k3pJ36j76j9j31O5oL8R4k4q8K2L8O5j39M5k7n8O1L0j08J22K3j39P3
643A11N8O1M5J7k32J73n6L3r7O4j17P0K53n5p7j39k4L7l6m5Q7J12q6Kl8o4M9M1j6J27r5j42
268B1N6J1J90j28p5l5J30m6L7MJ7pl4r2O6J19n5P5J33p2j47m8j16J09p6J61OJ24j25j14K24
$$ plain form
2885 83 116 41 88 166 120 148 86 134 132 144 56 39 17 35 63 97 105 50 168 308 159 113 141 35 237 66 72 62 44 109 286 148 113
2498 113 110 203 268 75 142 365 299 31 84 131 85 127 290 365 199 72 114 94 244 257 227 160 247 215 104 140 58 197 36 206
2146 206 58 134 163 119 82 18 162 111 95 134 128 161 186 94 248 233 126 102 160 215 136 80 94 42 80 81 97 236 256 180 71 57 194
1758 194 137 45 334 155 134 52 182 134 46 101 65 183 54 24 105 61 172 73 134 132 141 106 62 99 87 265 344 259 149 217 100
1394 100 120 109 71 100 122 289 358 261 257 153 104 93 35 109 48 57 271 169 162 114 41 157 216 127 141 196 107 169 174 31 163 203 159
1007 159 124 230 172 52 244 221 214 350 174 155 24 89 83 121 215 191 103 125 163 228 89 134 107 49 110 140 32 154 177 38 111
643 111 169 230 275 292 60 233 177 210 113 177 60 130 383 328 251 112 88 125 89 44 131 243 157 159 121 57 106 147 131 258 163 21
268 21 77 88 278 150 75 40 170 124 161 165 182 175 141 49 115 234 179 254 387 315 168 120 4 113 37 198 204 328 203 89 313
-96C13j26j1L7j0j05J8j3j0
$$ plain form
-96 313 187 176 213 203 98 116 103 93
-190I3
##PAGE=	F1=-14200
##FIRST=	25169.313707327481097,	5807.6787752999953227,	0
##DATA TABLE=	(F2++(Y..Y)), PROFILE
5808A29O0j63J82r2j7R4nj71J24m3J8Jo3K07j20l6m0J40j09J03J34j25r4Q7r4K6n5m2L4J14
5456A84J04p1p3j05O3K6M1j06nj3jNJ38l7R0j06oK05p4j34n2O4R7j38K3J69k13Q7j16K9%k4
5080E1N1Mq2M8QQ2q9L19j5o0j04Q3k13J80j84k2k8P6n3J07K7k7Mj11L3nk8J70P3j50K3qQ8
4693B48j00j04N3nl6J23M5j37j2J62Pk33J82j31J05m6qP6j11L4Lj06R7M4L8j30P7J5p1P7R2
4329B48J2p1m9m5k3N6P3r0pM0qm3l5J26j24K8k4N5K1n1J06j6j46J38O2j52o5K9Q7J06p1qp0
3941H9m5J4R2J1p9L0O5j39K00r6J00j15K1j11OO0m5pJ89k2j83J45j02j9m1LN7O6qP9K0p4j32
3554B9J58j05l0Q1o0N6M9j01Q3j7qo3k7J66J85k15j27ljJ43N9j29o3P0J07K1j12Qj14J03K0
3190A63o1K9o4J43j17J07j53J60L1j72N6j3J5k6j3J1k7J7QJ13p5RJ19K4j21Oj05j7K0J9m5
$$ plain form
5808 129 189 26 208 116 99 193 188 17 141 98 116 117 54 261 141 105 65 205 96 199 333 208 114 201 107 133 78 36 70 184
5456 184 288 217 144 39 102 128 169 63 58 45 44 49 187 150 240 134 128 333 259 125 73 137 234 96 119 288 75 162 46 75 75 51
5080 51 102 106 24 72 80 162 73 392 377 317 213 296 83 263 79 57 29 105 52 159 186 159 163 52 85 80 52 222 295 145 168 160 248
4693 248 148 44 97 92 56 179 224 87 75 237 244 11 193 62 167 121 113 189 78 112 115 9 106 150 188 58 135 150 79 156 248
4329 248 260 189 140 95 72 128 201 111 104 144 136 93 58 184 60 88 64 119 140 89 195 179 33 171 233 81 16 45 132 238 167 159 89
3941 89 44 58 150 161 82 112 177 38 238 142 242 127 148 37 43 103 58 51 240 218 35 180 78 59 18 21 78 144 136 215 235 161 29
3554 29 187 82 52 133 73 129 178 77 160 143 135 72 45 211 396 181 54 51 50 193 252 123 60 130 237 258 146 154 40 143 163
3190 163 102 131 67 210 93 200 47 207 238 66 122 109 124 98 85 96 69 86 94 207 132 141 260 284 163 169 64 47 67 86 41
2826D1J04n0J01rmj50O2o0L6M1J1j7o3Q3J63j37l5L5m2J54j85nk6j1O9J94j18p9M8Q1O1j94
2451I9O7K16j23j69n5J04o3Q7J82K3j91n7n3J5J82k2j8n2J3Pn6L6j32J74j81J26j27P5L8l1
2099A14j3r0J53m9k3l2N9O6J0n8J51k0j18j6M7L2j12k1L4j06M9nK5J46L4n2j48j0J63l2j25
1735E3K77j71n6m9J21k4r0K6l3P1q9J5L6jJ22j37M8L1KKk9n7nK11L7j05r5J40j53J9k1oOj4
1336H2K27M6j43K8q8j14M4l8O9o5J5K01q1k6n9j5J36M9j66n2J61k9q8N7j36J70M7o9n1O5k2
972A55q9J94k5L9J32k37N3j28n6L5K5R0k8j00K6J07J6j46P1M9j09L6Q5j26P8R2j04q1J18R
620A81R0rj61J32m3K9p5Jj09P4J29r0L9r9l4Q7k9p7Q7J45q6l6j0n7J4O7rJ51q8j78K3L2J40
232B31j32l4j2J22p2J12j7Qk9k1j17P6P0lO3J70j41j21p3l2J18j10J13RJ41j22r4J41j00J0
$$ plain form
2826 41 145 95 196 187 183 33 95 35 71 112 123 106 43 126 289 152 117 152 110 264 79 74 48 37 106 300 182 103 151 232 293 99
2451 99 166 382 259 90 35 139 76 163 345 368 177 120 67 82 264 242 224 172 185 192 136 172 40 214 33 159 32 107 145 114
2099 114 101 11 164 115 92 60 119 185 195 137 288 268 150 134 181 213 101 80 114 8 57 52 77 223 257 205 57 47 210 178 53
1735 53 330 159 103 54 175 151 61 87 54 125 36 51 87 86 208 71 119 150 152 154 125 68 63 274 311 206 111 251 98 117 96 90 96 82
1336 82 309 355 212 240 152 38 82 44 113 48 63 264 183 157 98 83 219 268 102 50 211 182 94 151 15 185 232 163 112 177 155
972 155 66 260 235 274 406 169 222 94 38 73 98 188 160 60 86 193 209 63 134 183 74 110 195 69 147 239 135 54 172 181
620 181 271 262 101 233 190 219 144 145 36 110 239 149 188 89 55 142 113 36 123 268 182 146 136 79 93 160 151 302 214 36 59 91 231
232 231 99 65 53 175 103 215 198 206 177 156 39 115 185 182 245 415 274 153 80 48 166 56 169 178 319 197 103 244 144 154
-120A54P0Mj35O2m0m
$$ plain form
-120 154 224 228 93 155 115 111
-190A11
##PAGE=	F1=-14302.2
##FIRST=	25169.313707327481097,	5807.6787752999953227,	0
##DATA TABLE=	(F2++(Y..Y)), PROFILE
5808A97N0k14J86j06o4J52l8j09J45q3L7k3l9K28j02r0m5J26j33J24J42j49o6Q3r9k1Pk5J8
5467H9J27Q7q2l4j36P9k4L8m6m8M0l9j3J42%R5j47L7K16p8j76q0N1Q4j02M6R8j53P7p3JK3
5092I9m8M5k0l4J0K1J07j61L41L8o2j46M7j15J28j78o3K8J05r8J53J6n0J7o2o4J9j9J94N1
4740B99j93O7K9L4j32l2J2pqR5L1j46M8J64K1k36J35j51J47q4L4R4j34L5j5q9Q6O8J1o2m7
4376G4O9k2j6J00P1l9m8q7k6K4Q6k2p8MJ0q8R8Q7j31l5M2P3J4n6O9k9q4R7P9j05n9l8J07R7
3977B38m1K1j15r9L5J14pn8PJ04j38J78o2N0j22M6p3m4Q8l9k4J47o1j39J29r3P0o8lK6Q4k4
3601A27J14Qj63k7R4o1oR1n8j0L7o1L6lomm3J36J54j52j47jJ0J33M0j16m4j2J17P9j13m2p3
3214C4Q1N2p1Rk2J46j32Q9j38J73k6j15KQ7j5n8nL6j6m7oJ28p4K7Q1N7j43J00j60qnm7NJ29
$$ plain form
5808 197 247 33 219 113 49 201 163 54 199 116 153 130 91 319 217 127 82 208 75 199 341 192 126 209 110 89 96 71 89
5467 89 216 303 221 187 51 130 106 144 98 50 90 51 38 180 180 275 128 165 381 303 127 47 98 182 80 126 224 71 148 75 76 99
5092 99 51 96 76 42 52 73 180 19 360 398 336 190 237 122 250 72 9 37 142 44 197 213 163 180 118 54 73 54 248 299
4740 299 106 173 202 236 104 72 84 77 69 164 195 49 97 261 282 46 181 30 177 93 127 221 87 122 107 18 104 172 183 121 74
4376 74 143 121 105 205 276 237 189 102 76 100 186 164 86 90 100 12 110 197 66 31 73 146 160 104 173 144 60 157 236 131 72 34 141 238
3977 238 197 218 103 4 39 153 146 88 95 199 61 239 177 227 105 151 78 34 122 83 59 206 145 6 135 42 112 44 41 67 151 127
3601 127 241 249 86 59 153 92 86 177 119 109 146 85 121 118 112 108 65 201 355 203 56 55 65 198 238 122 78 66 183 262 149 107 34
3214 34 115 167 96 105 83 229 97 186 48 221 195 80 82 169 154 96 91 127 111 64 58 186 112 139 220 277 134 234 74 66 61 14 19 148
2815A48n6J57j6j2k10J54r9M7M1ml4%k6J62j22k0N7K4Q7j91k4l5O3J0J98q8j02O9O4N7j79
2451A20O9J83j56p6j15J26q8J37J61lk05J2j24K5J85n3%rp1M7qL7j51J80j92Q1r1O6M8l0l
2087A02p3J20j6k5p2Q4P9mkJ07l1j07KK8K2j34%O2j02pL0j5J43L7k6j53kJ52Jj37K29j37r8
1700E7mJ13J8o8p2J5K8Jj8rM2J22j41K1N1ML5jj8p8J68oj00o8J68j78M6m7K0rl0K48J6j66
1300A60M4o8m1l6pR8r5L0J73p8n8l8M3J42K5k14J4J38jk03J00p5J58L1q8m0k1K6k2J65n2Q7
925B97J29k68J20j16j21N9%N5l9l6K7J16m6j22Q8R9j44L8Q2r2LJ51o3k07J64l2J09l3q0Q5
573B23l6K3m0n1q3N4J13q2J3m4q2J33K6j19N7J77p3o8J1n8k8J04l8J86q5j62j8N2O2j36O6
209I7JO8q2J70l3lm4J6j17M5J8M4K5K22j70j20r3N4J09j38M3K1J64j26k5K3q1L4J04Rj50R3
$$ plain form
2815 148 92 249 233 221 11 165 66 113 154 150 116 116 90 252 130 110 167 191 278 87 63 28 91 101 299 211 109 178 242 299 120
2451 120 189 372 216 140 25 151 63 200 361 358 153 165 41 66 251 198 198 189 118 165 157 194 43 223 31 112 21 87 135 105 102
2087 102 29 149 133 108 36 120 199 195 193 300 269 162 164 192 214 80 80 142 40 33 63 48 191 228 202 49 47 199 200 63 292 155 57
1700 57 53 166 184 116 44 59 87 88 70 61 103 225 84 105 156 160 195 194 176 98 266 260 160 92 260 82 128 81 101 92 62 310 326 160
1300 160 204 136 95 59 52 150 55 85 258 180 122 84 127 269 294 80 94 232 231 28 128 53 211 242 154 114 93 119 97 262 210 297
925 297 426 158 278 162 41 100 100 155 116 80 107 223 177 55 143 242 98 136 218 126 129 280 217 10 174 142 251 218 138 223
573 223 187 210 170 119 36 90 203 121 134 90 8 141 167 48 105 282 209 141 152 94 66 170 132 318 233 71 53 105 167 31 97
209 97 98 166 84 254 221 218 174 190 73 118 136 180 205 427 257 137 44 98 207 69 112 133 297 171 146 169 88 122 226 235 85 178
-167A78n8j
$$ plain form
-167 178 120 119
-190A19
##PAGE=	F1=-14404.5
##FIRST=	25169.313707327481097,	5807.6787752999953227,	0
##DATA TABLE=	(F2++(Y..Y)), PROFILE
5808B51L1k37J60r7q1J68p6m1J50j04O2m8k1K29o2j33o1R1j25J44J49j83n0O0o9m9N2j7K3
5467A16J21O4r4j2j08O8Km6Jn9Q5n9o7J45L9Q9j88J12J94o2k12r9M4L3k2M2Qk5M9m4j5M4q4
5080F0L8l5k0L8RJ03j15K29J08q1j85L3j4M2j50j3L5J05j38J76mq4M3qr2j8J7J86K8k03Q6
4716A76N1l0j23rQK0k6P5J4j47J22J55J3k15P1j45J48j05P7J22j33Pl3o7P2Q9j4J1j70J05
4364A19M1q0O7J10Kn0j04k6j1R7K4o5l4N3m9O8L4j37rL1Q7J9o9M0n9kL4P5l1m7o0O7Q0qM5
3953B52j11r0l1J12ok6j0J21j29J43l0Rj27O4l2j4N8n5n0R3m4p2O8l6R8n4n1K8O7l1J38j0
3578B42j99Q8kj7j1R1l4q4L5k5NLlP2q2J20J08r3j40j0L0J00%q7Lr6J36R7q4o1l7J5P6m5m3
3167F8K8J49j36Q2j42J74q4n5k9J58j6j00nO5pr8j5J25q3P2J3R8j70J72j54j5j7k5j9J23p8
$$ plain form
5808 251 282 45 205 108 27 195 119 78 228 124 186 138 117 346 284 151 90 181 56 200 349 166 116 176 107 58 110 93 116
5467 116 237 301 207 195 87 155 157 111 112 53 138 79 12 157 196 285 97 209 403 341 129 30 74 107 85 127 135 110 159 115 100 144 60
5080 60 98 63 43 81 90 193 78 307 415 334 149 182 168 210 60 47 82 187 49 225 221 137 180 172 80 62 79 265 293 90 176
4716 176 227 197 74 65 73 93 67 142 156 9 131 286 299 84 155 10 158 53 130 252 119 126 93 26 98 187 173 184 14 119
4364 119 160 80 147 257 259 209 105 79 68 165 189 124 90 143 94 162 196 59 50 81 168 187 118 158 99 97 131 206 175 128 68 135 215 207 252
3953 252 141 51 20 132 126 100 90 211 82 225 195 204 77 141 109 95 153 98 48 141 97 25 93 57 155 101 50 78 145 114 252 242
3578 242 43 131 129 112 101 192 158 74 109 84 89 92 89 161 79 199 307 214 74 64 94 194 194 107 110 14 150 247 163 102 65 80 156 111 68
3167 68 96 245 109 191 49 223 139 84 55 213 197 97 92 157 150 52 37 162 79 151 164 262 92 264 110 95 78 53 34 157 79
2803G9K03k2j7k24K03j21L7M7rm1N5q6R8r9j6J01P6J0k01l0m0J50n3J82n5j04P3L7M8j52Q2
2439B11J37j74rr0R1j02J61J20oj98N4j22k7J63p4J7N0j43Q3K4L8j30J49j81L7l6M1N6m2j5
2087H3m1Q2K6k5m8O1P7l1N5L8m1p2K3%K7j34J4O6o5q2P3n9J24L4j0j18pJ20L1j24J47p5j41
1700HL8J15N7l4j48M4K7L3o5m5Q4J15j21MM1K7M1K5J1j07R0m5p6m1J58j81R3q0K9k2qK23j1
1312B79j46L0m9Q3j58J1J38j26N1J40q9r6K1O5J32Jk04Q9P5Lj94P1l6J40Jj01Pj10O5M1J16
948B50j01J29J29k68J66r1j26L8j4J1n0N0K9R8j09o4P6J23j62Q4Om8n0J87k5k30J40n7J04
608B25n5j1M0k9J0J1n2n0k4J48m6p5L9o5N5J02j45PJ96m5r8K8o7p5J53r1K16q3j30n1P3k0
232I1n2J05rJ3q7K04l6qm8N7j18jj1P3k7K68j62j27j06J23R3j63l4N7J77j44L4n4p5O3J25
$$ plain form
2803 79 282 260 243 19 222 101 138 185 176 135 190 104 202 103 87 188 264 274 73 43 3 153 100 282 227 123 196 233 281 129 211
2439 211 348 174 165 75 166 64 225 345 339 141 195 73 46 209 135 152 202 59 142 166 204 74 223 42 79 43 84 140 98 83
2087 83 42 124 150 125 77 138 215 184 239 277 236 164 187 187 214 80 94 160 95 13 86 27 151 185 175 57 50 170 201 77 224 149 8
1700 8 46 161 218 184 36 80 107 140 75 30 114 229 108 112 153 180 221 246 257 150 240 195 119 78 236 55 148 68 97 75 67 290 279
1312 279 133 163 114 197 39 50 188 62 113 253 164 68 89 154 286 287 83 172 247 250 56 127 91 231 232 131 138 28 93 134 250
948 250 149 278 407 139 305 214 88 126 112 123 73 123 152 250 141 77 153 276 114 198 204 156 106 293 268 38 178 121 225
608 225 170 159 199 170 180 191 139 89 65 213 167 92 131 66 121 223 78 85 281 236 138 166 99 24 177 86 302 219 89 38 111 91
232 91 39 144 135 148 61 265 229 221 173 230 112 111 100 173 146 414 252 125 19 142 235 72 38 95 272 128 162 108 33 96 221
-132B21Lj49J03n9j
$$ plain form
-132 221 224 75 178 119 118
-190A18
##PAGE=	F1=-14506.7
##FIRST=	25169.313707327481097,	5807.6787752999953227,	0
##DATA TABLE=	(F2++(Y..Y)), PROFILE
5808B81Rk37J11p0j6R7j19L3J39j12Q9o7j3K16j7j59q4N0r3J80J43k20n0K5k6m3P5j9L8R5
5456B36L9j00jl5K8N7j51L8n0J15n1r0Q3P8P4k14J86J58l5k38o0N5p1O1Ol4R1Ok2k6N2r9O
5068I2l6k3O3K5P5m9J01J82j18k17Q3L0n4j13N6K5J02j67J82l3j15P1M3p5q4O7J54J2j82P4
4716A71O1r4p6j1J9M7n1P5l1p1J31J39j4j75oo0O2j03J19J37j09l4n6l7M8J12l8Q1j63J3R4
4352A80j03J4J23L9n5r1k3m5R9M7k7j4O9m4L5j9j33L9j0R7M0r2K7r5Q0m3M9N4k9p1J9N1K2
3965A90O8q0r4o4P2J2J7j8R3j05J16j1j8j19O0j3L0M9p7q1L7M4r4R0j9R0k0j07O4J4l7J55
3589B44k7q9M6o8K0l7Q8Rj55O5k8QoJ2J29j26J22N6n8j26qN5N5n1m3O8n9M4P5m5l5n0n1R7
3190A31Qr5O1J47j33R7j52J44j30Lj1J70pj32j3Q6%j32J3J12j20J32o9J20j63J90j26Lm1J
$$ plain form
5808 281 290 53 164 94 78 175 56 89 228 116 205 138 125 341 324 165 81 131 38 218 361 141 91 116 90 47 122 103 141 236
5456 236 275 175 174 139 167 224 73 111 61 176 125 35 118 196 270 56 242 400 365 127 67 122 51 112 118 84 175 181 159 133 185 86 92
5068 92 56 33 96 121 196 147 248 430 312 95 178 208 154 41 97 122 224 57 239 206 91 162 205 130 46 113 267 279 97 171
4716 171 232 138 62 51 70 117 66 141 110 39 170 309 295 120 114 54 116 13 132 269 160 126 70 33 81 193 155 236 73 86 180
4352 180 77 91 214 253 198 107 84 39 138 185 158 144 213 169 204 185 52 91 81 178 218 126 153 58 138 95 144 198 169 98 117 168 190
3965 190 258 178 84 20 92 104 121 103 196 91 207 196 178 59 119 106 136 185 108 27 64 108 14 104 85 175 155 48 112 126 89 244
3589 244 217 128 174 106 126 89 177 186 31 96 68 76 70 82 211 85 207 263 205 79 71 126 181 130 87 155 96 140 215 170 135 85 34 131
3190 131 139 44 105 252 119 216 64 208 78 81 70 240 233 101 88 174 174 42 55 167 47 179 110 230 67 257 131 134 93 94
2838I4q1J57j14K40l1k3k08K15j17J4O0qm4R3q2j9n1m7J52J13o2k11j5K1J63r6J36k5r2P7
2486B09KL0j16J06R4j85K3n0O7r1J48P4Lj71O0r3q1J17n6J1J04j66Q7M0M9r8R5j46Nj0K9P1
2110A61n4n4OM3N5k4l2O6P6q1J02l7m6k3M5l9M3j03J8L6j9q7L6n4P8L1j1n7j2P4M6q7M5%j10
1700C1LJ28P8lj50J2M4K8j04k9Q7J01q9MMO3J6M2J8r6J0p0m5j7J28j50J18r5J3nJ9J60k3q5
1300A46j0m4J86k22j7J60j35P7J04r7j35R8M2J08pj39J04K1jj41N2l0J17k8j11P3m9k1N8O7
948B26j55J54J32k44J83n3j30Rj6j0k7Q7L6P4j57pN3J23j54J52j08j0o8J93Jk18J17o1Q0p3
596A29L2Ok2j8P8qm5j13J60k3j08J18n8m0J76j57l8J98oj27M1q0p0J56j46K25q2r4p2Q5p5
232B2P5R1l9j9r6K10k3nl6P7j18m5pP9q2K87j34j21p9J30Q1j71j4N7J34j82P0p2l1N6J20j6
$$ plain form
2838 94 13 170 56 296 265 242 34 249 132 146 206 198 154 247 165 146 95 48 200 313 251 40 25 46 209 113 249 224 132 209
2486 209 211 241 125 231 325 140 163 113 180 89 237 311 314 143 203 110 29 146 90 101 205 39 126 166 215 117 212 66 71 61 90 161
2110 161 107 53 59 102 157 133 101 167 243 162 264 227 181 158 203 164 207 104 122 158 139 52 88 34 112 143 132 75 63 137 183 96 141 141 31
1700 31 34 162 240 237 87 99 143 171 67 38 125 226 137 141 145 208 224 266 284 188 198 128 83 66 194 44 162 67 80 75 94 254 231 146
1300 146 136 92 278 56 39 199 64 141 245 148 13 111 153 261 254 115 219 240 239 98 150 120 237 209 98 171 122 101 159 226
948 226 71 225 357 113 296 243 113 122 106 96 69 156 192 266 109 102 155 278 124 276 168 158 90 283 284 66 183 122 202 129
596 129 161 167 145 127 205 197 152 39 199 176 68 186 128 88 264 107 69 267 261 134 175 95 25 181 35 260 178 84 12 97 22
232 22 97 188 149 130 34 244 221 216 180 257 139 94 87 166 84 371 237 116 37 167 248 77 63 120 254 72 142 70 39 95 215 199
-143A99j37R1l8j
$$ plain form
-143 199 62 153 115 114
-190A14
##PAGE=	F1=-14609
##FIRST=	25169.313707327481097,	5807.6787752999953227,	0
##DATA TABLE=	(F2++(Y..Y)), PROFILE
5808B82ok21M8l5O9J0j12P1J06j18J16q2j2J90K4j64j06J3l9K24J22k55o2j2PpQ0k4N3N0J1
5444B21r2QN2k1J01k20N8l4J21k1q8j7J13N9k19K32J24rk54MP5r7N7m4M1Q8l7nm2N5q9n3k3
5056D4J1L4O9L2NJ0K34j65k31J75J8j19j04J12L0R3j85J75o6j27Q4Q4m1j46J19J09Lj42M4
4716A59O1j45%L7m2N6m8Q9q9KJ26J19n4j22q4K8l1m0J20J27o9p7q4ROJ38o3J40j32q0J16r5
4340G8k3J11O1o8m4k5o6R0M8PK1P0m8J7n8q9K9m3J00P7j13K9j17J27j20J4J27po9k5PN2R1
3953B41m9j02l5j6M4O9j9J9o9J10j5k4r6M2k7P7O1q3r1K1Q0j14J34p1P7L1j46J02m9m6J64
3589B20m0K5k1j02M3p1Q8O0j88J13r3M3j1K2J53j54J27J4m8j01qQ5Nr4J6J19m2k8M5j8Qq3
3214H4o1P2P1q8L2J33j13J27j65Q5j49M2L7J50jj48k4R1Pj55N2J21j50J66j24Q9p0J12r1M8
$$ plain form
5808 282 276 55 103 68 137 147 35 106 212 94 210 128 116 306 330 166 60 73 34 258 380 125 63 51 58 51 131 107 160 210 221
5444 221 129 137 189 168 269 49 107 73 194 173 85 68 181 240 21 253 377 368 114 118 193 96 153 109 150 238 201 196 154 209 120 67 44
5056 44 55 89 158 190 195 205 439 274 43 218 236 117 13 125 155 248 63 238 172 45 129 213 172 26 145 254 257 115 159
4716 159 220 75 75 112 70 126 78 167 78 80 206 325 271 149 65 93 62 22 142 269 200 123 39 48 54 192 129 269 137 57 173 78
4340 78 55 166 227 159 115 90 24 114 162 169 190 260 212 229 171 82 111 68 168 245 132 161 44 171 51 65 192 185 116 91 98 150 241
3953 241 192 90 55 39 83 152 133 152 83 193 178 154 58 100 73 150 211 128 37 58 138 24 158 87 164 195 49 151 102 56 220
3589 220 180 205 184 82 125 54 142 202 14 127 34 77 66 88 241 87 214 228 180 79 71 156 161 67 83 202 160 132 177 159 167 84
3214 84 23 95 166 78 110 243 130 257 92 177 28 70 107 257 256 108 84 175 182 27 79 200 50 216 92 181 111 223 132 180
2862A80q7K0p3J45j51K58m1l6j78J97q2JO5ln4J16m8j38K9j10J76J38j09j64j1N7J54j11O3
2521B03jp0R1m4Pp4J38O3j98K5qN6o6J15L5Pj26L7n9j04M8M9l5J07j29N0M9P8q4L0r2j1k0
2134F7K3J05n6p2K1RO1k9k8R4Q6j44J27r9m7L5O4r4O5m3KpK1n0n2mL0L2l9J6j1K5N0l7l8M8
1711A31p8l5J48P2J7j36j1N1J6j17K1O0Q1n6Ql5Q4k3M7J0n4n8o2l4L4Q9j05R3o6l8P3OP2j4
1312A91j7l5o2K41k28n4J39j13J04O5q4q9P0%P0J0n5P1k0Mq8O2m7R5m5j22J32J3r4M7K9j57
937C3J23J30j96J67qj44k1qjK8O8M2N2j76K6K8J04j15K14k05mm9J71J4j81J00m8M3q0L8j1
573A34j2o4J49N0n0j59J08%q5J58n8j22K28j52o5J85L9j60N1r3j2J08j38J60p9n7m2M1mP1
221A30R4q9j1n9J28MKmO7j16p7J8P5j20K59j01r2l6R5P8j62O5L7O0k26P6m2K9L7R2m8j10N3
$$ plain form
2862 180 93 113 40 185 34 292 251 215 37 234 152 153 218 215 161 277 229 91 120 10 186 324 215 51 40 97 251 140 203
2521 203 202 132 223 179 186 112 250 313 115 140 132 188 122 237 272 279 153 190 131 27 75 124 89 196 67 117 166 244 160 190 98 87 67
2134 67 90 195 139 67 88 97 158 129 101 195 281 137 264 165 118 153 217 123 188 145 147 140 161 111 59 55 85 117 78 94 83 108 158 121 83 131
1711 131 53 18 166 238 255 119 108 159 175 58 79 139 220 164 172 137 221 198 245 255 201 143 81 47 81 170 65 158 92 54 127 133 205 191
1312 191 174 139 77 318 90 36 175 62 166 231 147 58 128 128 198 208 153 224 204 208 120 182 135 230 185 63 195 208 114 161 190 33
937 33 156 286 90 257 249 105 84 76 75 103 171 213 265 89 115 143 247 132 346 141 137 88 259 273 92 192 144 187 107 145 134
573 134 122 58 207 257 207 48 156 156 71 229 171 49 277 125 60 245 284 124 175 82 70 178 40 200 121 64 22 63 59 130
221 130 224 135 124 65 193 197 199 195 262 146 69 87 162 42 301 200 108 72 167 245 83 148 185 245 19 95 53 82 119 211 163 53 106
-167A06%O
$$ plain form
-167 106 106 112
-190A12
##PAGE=	F1=-14711.2
##FIRST=	25169.313707327481097,	5807.6787752999953227,	0
##DATA TABLE=	(F2++(Y..Y)), PROFILE
5808B59j2j90j8mJ60o7k4K8O7j30J35r2k1J56N8j46j25j3M2K46R5k81p4l0lM7P6l0N9lk3n8
5432H4K2J17n1J10k21N1k5J01K6q4j00J29M8j90K25J01jk57Q6P8j04M9p3J08M3o0Mo8N9n5
5080A52j26JP8l9J29j4L5j7K37k15j77K07pr9j14R4N6P7j88J53r5q0L9J15pj69J43N5Qq7%
4716A45N0j53P1R3j45O2l0J07j12K8J14R6r5p2j46J06r6J5J22R3k2j14j05N6l9J60r0J84r5
4376A88j42R1o0k6Q3N8q7K3k7o8O6L6K4M7O4n6K0p2k6k8o6R7J20j25M3j23J30j74M7J00K0
4012A77n4m4o5R1J08l6j09K4p0L9J28j2q9l0J30m2j4o8M2p8J11Q8o4r9O4K8p7J38j60O6R0
3648B13j41J14r4m0J37m9J06p8r1L2q8Q2J07j64J32j60O3J2%J51j54J17j1m8n0l4J18m9q3
3308E0N4J32m2q0K8rM7j16K2l4J28m6k5J02o2J51j78J0q3OR0J22Mj51l3P7J0j57P5J41j56
$$ plain form
5808 259 247 57 39 35 195 128 104 132 199 69 204 112 91 247 305 159 34 21 63 309 404 123 49 19 16 63 139 109 168 165 142 84
5432 84 106 223 172 282 61 112 87 188 214 130 30 159 207 17 242 343 342 85 171 249 145 194 121 229 272 212 216 148 207 152
5080 152 26 27 105 66 195 181 216 199 436 221 44 251 244 145 31 125 181 258 70 223 128 48 87 202 195 26 169 224 232 145 145
4716 145 195 42 113 206 61 123 93 200 88 116 230 326 231 159 13 119 23 38 160 253 231 117 12 68 29 189 99 283 188
4376 188 46 137 77 51 134 192 105 128 101 33 99 135 159 206 270 214 234 162 136 108 42 139 259 134 177 54 184 10 57 157 177
4012 177 123 79 14 105 213 177 68 92 22 61 189 177 88 58 188 146 132 64 106 28 139 227 163 64 128 156 79 217 57 123 213
3648 213 72 186 92 52 189 140 246 168 77 109 21 103 210 46 178 18 81 93 93 244 90 207 196 148 98 64 182 133 50
3308 50 104 236 194 114 142 133 180 64 86 52 180 134 109 211 149 300 122 132 49 55 145 267 271 120 87 164 174 17 92 233 77
2944G7J68j24KN7Nn3R4j45L3qR9j58K30n1n7j42J50j9J9M6jp2J18Lk21J10r1P3J49j15o0m4
2568G2P5J28r8k4J7m4J13r6j6l0J75M3k16J2K0N4m0Q4Rno3nl0j03kJ61n9M9q8J3O5J18r2l8
2169A59k6j0n8K1J48m6o2lj1N3n3k5J23J05j98J27j27n4R3O8j55Q9L4m0k7L3J6j68P6kK9q9
1793B0R1rj3M7J4m8K0p1m7J60M4K1j14j0M4Kq8N2L9N9l1Pn9P7o5M5kkj05Jo0J02O8j07M8Q
1371A38j13J72k7k1J6K9l0p6K21j97n5O6n9J18K6m8n3K4m2K7N5PJ0m4K5m8Q9p7Q1m0j20J46
995B00N9j55K8J8p2L9R1j20J14L2j63n0J0L0P3L2M5L4j60K7J7O1n2K51k38m7oJ34K6j35P9
631B02k6Op2Pojo7J55J00n4j48K4J6l7J44n3j75K45j31p4J67P9j88N0j03M1O3r6O8o5j0rl8
244A4R0K8J18j55L4J6k3M0KM1L6j08q8L4P4r2J55p5m3PL7P9j37J33K7mj77j6mP4K9O0q7o7
$$ plain form
2944 77 245 121 123 180 185 132 226 81 114 106 205 47 277 226 169 27 177 158 177 223 222 150 268 271 50 160 69 142 291 176 116 72
2568 72 147 275 177 153 170 126 239 143 127 97 272 315 99 111 131 185 145 229 238 233 170 165 135 32 30 191 132 181 93 106 171 289 197 159
2169 159 133 123 65 86 234 188 126 123 112 165 112 87 210 315 117 244 117 63 156 224 69 158 192 152 125 158 174 6 82 80 109 20
1793 20 111 102 89 136 150 102 122 51 4 164 208 229 115 105 149 151 63 115 154 213 182 189 130 207 142 187 185 183 78 79 19 121 189 82 130 138
1371 138 25 197 170 149 165 194 164 88 309 112 57 123 64 182 208 160 107 131 89 116 171 178 188 144 169 121 210 133 214 174 54 200
995 200 259 104 132 150 78 117 208 88 202 234 71 21 31 61 134 166 211 245 85 112 129 190 138 389 151 104 98 232 258 123 202
631 202 176 182 110 117 111 110 43 198 298 244 96 120 136 99 243 190 15 260 129 55 222 301 113 163 60 101 164 68 136 71 61 52 14
244 14 104 132 250 95 129 145 122 162 164 205 241 133 45 79 153 61 216 141 98 105 142 221 84 217 244 240 63 47 43 117 146 206 119 52
-155E2KL3L1
$$ plain form
-155 52 54 87 118
-190A18
##PAGE=	F1=-14813.5
##FIRST=	25169.313707327481097,	5807.6787752999953227,	0
##DATA TABLE=	(F2++(Y..Y)), PROFILE
5808B20oj37l2k0K24j15L2j4M3j38J36r8l9J20Q2j06j39J5Q2K45P2k93r0mmM6O7m1O2n5n5
5444F0J1K7J31m9Q4j81M5k6N8P7p6j07Q8M5j65J97Q4j9k42J79N7j19O3o2J16j3n8J1j01O0
5092A75oj24j8J26j12J81m6L6NK00k58q0J70j7k6j27J7J10N1j77J18j17Mm1J39J6j49J30O
4751A86K5k5n3L1r3R5J25k58J00k8J13j01K6R5O3j23l8j04R2p4j8J46M4K0j41o5M6m8J50j14
4399G4K10o2j72K6jj6P5K7j12Q9j5p7N0K1J8N0N8o6M4p0L4r5p9Q9J48j22O5j33J12j18P8k5
4024A05N2l3j0k3J0Q5m4r0O7o0k2J88Kj87k0J71q1Km7O2r1P6J20k4j32J09k7k2J27k33M5J30
3648B05r9J06j03j9P5o1J46j03m3k2k0J1J42j47J58j53ON8m8J36j27P8k2l1J4p7J39r5k9N8
3296A33J13n0j07L0mN2j33J15j40J70J0q2N2J3J61j86o6Rn2J40R6J6j55m3N8Pj20N9J47j46
$$ plain form
5808 220 214 77 45 25 249 134 166 152 195 57 193 95 56 176 258 152 13 28 110 355 427 134 44 40 36 82 149 108 170 115 60
5444 60 71 98 229 180 264 83 128 102 160 237 161 54 142 187 22 219 303 284 42 221 278 159 222 160 276 263 205 216 115 175
5092 175 169 45 27 153 41 222 176 212 217 417 159 79 249 232 206 79 96 206 257 80 198 81 85 44 183 199 50 180 186
4751 186 211 186 133 164 71 166 291 33 133 105 218 117 143 238 301 178 140 36 128 54 36 182 226 246 105 40 86 38 188 74
4399 74 284 222 50 76 75 59 134 161 49 138 123 46 96 117 135 185 243 177 221 151 185 90 11 100 248 126 191 58 170 52 130 105
4024 105 157 124 114 91 101 186 142 52 119 59 37 225 227 40 20 191 110 112 65 127 36 112 232 208 76 185 158 136 263 30 75 205
3648 205 106 212 109 90 165 104 250 147 104 82 62 73 215 68 226 73 79 137 89 225 98 176 154 123 137 60 199 104 75 133
3296 133 246 196 89 119 115 167 34 149 9 179 189 107 159 172 333 147 81 90 38 178 274 290 135 92 150 157 37 96 243 97
2944I7J56r5q9J66p2j4J14j83K1P0N5j42J74n9q3r7P4N8O4Ljr8J01N8k38J59o6m2J29p4L4
2580A80p9Q7R3o7r8K6j5J26j36l4LK08L3k40LJ9N7j5O0Jl4J6n6rj00L8J80o4j3o4j8Q5J56
2193C29j08r1M1Mj00PJ88l6n4k8j1M1r5j7J34J29k28J06j04p6J34N4j96R9J11r8kJ0Q6j53
1840G6L9j6Ro1P7j2l0M5N4m1k5q2lJ18MJ5r1K2K7j5j9M7K3M7k2kn8M2j07M8mL7j16P0o0J22
1418A58O6j44LJ04j73K45o7j01N7M7jo1J26j47l4j3J5J09j5jl1j9p3kJ04K8n8m6N8k7J22j09
1042A20P8j2r3R3Q1j88%M1k1M8j3k6L8N7j43Kj3J1R2nL9K3j23J1L8j7K1K51k16j03N2Q5N3
655B61j03N1jj8n0n0RPK2N5J31n8j07k1KRQ5m2j52J89r7p2J56J07k07L2j04P7K5n9MOMk0l4
244C7R7k5J56k27R3J04j69N1qQ9Jr8p1L2P0l4L5n6OM2k5P5q7J71K2m4j17o2k2J03K0L2j20
$$ plain form
2944 97 253 158 69 235 163 149 263 80 101 171 226 84 258 199 116 19 93 151 215 218 217 119 220 278 40 199 133 91 220 146 180
2580 180 101 188 281 214 116 142 127 253 117 83 86 294 327 87 90 109 166 151 211 212 178 194 138 129 29 67 247 183 170 106 88 173 329
2193 329 221 130 171 175 75 82 270 234 180 152 141 182 87 70 204 333 105 211 107 31 165 219 23 122 233 135 133 143 229 76
1840 76 115 99 108 47 124 112 82 127 181 140 115 33 30 148 152 167 76 98 125 110 91 138 161 208 186 184 126 168 61 109 105 142 26 96 36 158
1418 158 224 80 83 187 14 259 192 91 148 195 194 133 259 112 78 65 80 189 174 173 142 123 50 48 152 180 122 76 134 107 229 120
1042 120 198 186 93 186 267 79 79 120 99 147 134 108 146 203 60 62 49 60 152 147 186 209 86 97 135 118 139 390 174 71 123 208 261
655 261 158 209 208 190 140 90 99 106 128 183 314 256 149 128 130 139 224 182 30 219 122 50 206 313 106 138 34 111 136 77 81 87 91 71 37
244 37 134 109 265 38 131 235 66 117 109 198 199 101 30 62 132 98 133 77 83 125 100 175 88 259 281 237 120 58 36 139 159 191 71
-143G1nrNP1
$$ plain form
-143 71 66 57 62 133
-190A33
##PAGE=	F1=-14915.8
##FIRST=	25169.313707327481097,	5807.6787752999953227,	0
##DATA TABLE=	(F2++(Y..Y)), PROFILE
5808A77Np0k5k8K37j36M7n7L8j32J23r8n3P9J00o0j46O1J02K18N8k86j19PL4K9N3m9N9r0n
5444G3J9J3J01k3M2j32N5k9kJ23p1p9O2L6j45J58N8n9j71K33J4j37Q8k6Q2p8l0K1j30N1M7
5080A64n8n6J33j53K03n5QN2J42k80kJ12nN1j32o2J68J4j51P6j26P4j01J50K1j07J02l7N6
4740B01L4j09Ok5J10J23l21J51o0J00q3L3O8J6j36j6k2N1m0n7J77j2N0j51k0L1l3J23j24K14
4387B79m1j85m1O1nR3j4j32J24K4j06M5J5rK7N9q1Q5p0Q4j37l9M6J29j08Q2j34P9k6Q0j27
4024E7Q6j8M9J5m9L0n0k5L3n4n7K34K2j89m7J56j04Kl3P9o8RJ51K5j92J57o8K8J16k04NQ2
3648A78m1R4r4rL0p6J43q8Jq6N0m1J57j39J84j38m9J05j00J11q5J4l0J8O7j03J30r9k2P4O9
3284B25n3j07M4L0qj07J74j63J33O6j24nQ6J52j80j32R0r3J75P2M4j65o6N5qp1L2J27j18J29
$$ plain form
5808 177 182 112 87 59 296 160 207 150 188 56 179 81 28 107 207 147 1 62 164 382 440 154 35 42 76 105 158 109 168 78 73
5444 73 92 105 206 183 225 93 148 119 117 240 169 90 152 188 43 201 259 200 29 262 276 139 227 201 283 205 175 196 66 117 164
5080 164 106 50 183 30 233 178 186 238 380 100 98 210 205 256 124 62 230 244 93 169 43 117 16 166 187 80 182 145 201
4740 201 235 126 132 107 217 340 19 170 110 210 127 160 228 244 108 92 70 121 81 24 201 189 239 88 68 99 66 189 65 279
4387 279 238 53 12 73 68 161 147 15 139 163 57 102 117 108 135 194 113 198 128 212 75 36 82 211 103 185 51 130 104 184 57
4024 57 143 125 174 189 140 170 120 95 128 74 17 251 273 84 37 193 89 91 58 137 69 78 229 254 62 219 151 179 295 91 96 178
3648 178 137 231 137 128 158 82 225 137 138 52 102 61 218 79 263 125 76 181 81 192 107 121 91 109 176 73 203 104 82 156 225
3284 225 172 65 109 139 131 24 198 35 168 234 110 105 191 343 163 31 121 28 203 275 319 154 88 143 135 64 96 223 105 234
2932B34n5j46K24r9K1R9j65l4J42K0j20J19o3r3l8PQ1J17m8rj09N3J10j97J80m2p7K1mR7j06
2568A20R5N6k8j34J6J3J23j46m3MK29L0k63J7j5N5J0M4Ro9R2r9Rr6P3J75o2m5o4m3J02J79
2193C44j18j02Q3K6j17l9K13k5n5m7J2K4j40jJ19J48k29P9n7q3J37K8j39M6J56j56M7j9J31
1852B66j07j0k2k0MK6k7k4M5P8n7m1q5M3M7l4J8p9P3K5m4N1K1ON5l4k0k7J0j06J3L3L8m0K8
1441A03m1J15O7j75k3J75j93K66j07j48R7M4L9k5%j06jl2N1Q1n4M0on0r1K4Q3K5r6j0N5k2
1066H5J51j34Q6K3o1J6P0j36q2J06m2J16j24N7k9O3n5J6k9k0Q2l1J7J8p6rQ4j14Q0K20j71
702A77j33J10L3R7r5J9J7j9j5j01JJ7J04m1J30n7m9l3l9N6jk7r6J10n5o5J54J18k06ro9O8
326A01nk0k3R6k8m8MQ3r3K01k47R6J96k24k3k9J30k0q8k6K9M2K7n6l6K2O8p4N8LJ54J8n1o9
$$ plain form
2932 234 179 33 257 158 179 278 113 79 221 241 121 240 177 84 46 53 134 251 203 194 85 138 248 51 231 189 112 133 129 226 120
2568 120 215 271 243 109 125 138 261 115 72 76 305 335 72 89 74 129 139 183 192 123 215 116 125 29 102 277 215 170 106 63 165 344
2193 344 226 124 207 233 116 77 290 265 210 163 175 199 59 58 177 325 96 175 118 35 172 200 61 107 263 107 154 135 266
1852 266 159 149 127 107 111 137 110 86 131 209 152 111 26 69 116 82 100 21 94 119 75 126 147 153 208 174 154 127 137 31 44 77 115 75 103
1441 103 62 177 244 69 46 221 28 294 187 39 136 180 219 194 194 88 87 55 106 187 133 173 167 117 26 50 133 158 62 52 107 85
1066 85 236 102 188 211 150 166 236 100 18 124 82 198 74 131 102 165 110 126 97 77 159 128 145 163 87 78 162 48 128 348 177
702 177 44 154 187 284 189 208 225 206 191 90 91 108 212 171 301 244 195 162 123 179 178 151 55 165 110 45 199 317 111 102 33 101
326 101 96 76 53 149 121 73 77 160 67 268 21 117 313 89 66 37 167 147 59 33 62 104 131 75 39 61 129 55 113 116 270 288 237 168
-73A68p4o3J16KJ0j26N6K0l7Q3
$$ plain form
-73 168 94 31 147 149 159 33 89 109 72 155
-190A55
##PAGE=	F1=-15018
##FIRST=	25169.313707327481097,	5807.6787752999953227,	0
##DATA TABLE=	(F2++(Y..Y)), PROFILE
5808A42J3pm4oK33j43L7j04M3j14J12r1k4J4J05k4j34R2J17J66N4k62j30JN6K6L3m5M6j00
5456F2Q3l8JN6QQr1P5k3p0J49o9l8P9J1j21J24Mj04k0K03l8j47J00K1L2j41NM4j24QQ8K0q6
5056G1J17j51J89m2l4J00P8k46J4N4K1J12j26p2J69l4j06L0j07J07j21J40Kn5P0p1R4Q1j55
4716A29j9K3J18R0k63J35r6N6p0O3L7m2j33MN3K1k2m6J73o6O5j44J6K5j4R2j17K03l2j88K9
4352H0Pj0J24m6j13R0Q7j47M0K3n3NN7j06J38p5J11j30j2M4L8q2Q3j10N5N4N0j44Q7k0J05
3988B30M3r7j7k6J7l2n5l4K29M4j70m5R9q2l4k4P7l2m3J69P7k73K03q4N8J13j53Pj6J1Q2q3
3613A59j2J8r3J15m6J6j31R2n0J50j34K01j25p7J29j41Q9m8n4l4P2J08j06R3m6q4J06J1m3
3272A35q7N9Q9j08m5J82j59Q6J10j41j4R0J27j52j62J33r7J71M8Q3j73j09P6k6k8QQ1p0Q3
$$ plain form
5808 142 155 148 104 98 331 188 225 121 164 50 162 71 47 61 166 142 8 100 217 383 437 175 45 46 102 128 161 116 162 62
5456 62 145 107 108 164 172 180 89 164 141 71 220 151 113 192 203 82 206 210 106 86 289 251 104 204 225 257 116 121 165 41 49 137 157 71
5056 71 188 37 226 184 150 250 328 82 96 150 171 283 157 85 254 220 114 144 37 144 23 163 165 110 180 109 203 284 129
4716 129 110 133 251 341 78 213 117 173 103 166 203 161 28 32 85 106 84 38 211 145 210 66 82 107 93 185 68 271 239 51 80
4352 80 87 77 201 155 42 132 219 72 112 135 82 87 144 38 176 101 212 82 70 114 152 70 153 43 98 152 202 58 145 125 230
3988 230 273 176 159 133 150 118 63 29 258 302 132 87 186 104 70 46 123 91 48 217 294 21 224 140 198 311 158 165 149 160 242 159
3613 159 147 165 72 187 141 157 26 118 68 218 84 285 160 83 212 71 160 112 58 24 96 204 98 191 145 61 167 178 135
3272 135 48 107 196 88 43 225 66 152 262 121 107 197 324 172 10 143 46 217 265 348 175 66 142 116 88 96 177 107 190
2932A90j1j54K14q4M6O8j08j00J88nr1P4o8p1qM3rJ57r2k4o2n7J53j26J95l0m0j02L4J29j21
2568A28R3K9Pj40j2M5J11j23n3k0K28L1k79P0o1K4M6K3K6r7J45j24L4p5N7J67o0m5q1n8J09
2204A45J77j11o5Q9M8j05j10K19j7o3n4N1kj57%R5J52k09N7k1p0J24Ko6K7J42j87O8k2J41
1852B78m2o1k3m5O3j1o6%M8Q8r6k4n8O8l8m7O6m4M0N4o9P7j7mP9o7m5K5L8m5o5N6M4k1l2l0
1430G4R6O6j54rJ56j97K64j42j23R4K9Q4J3r5j11N2j0M2N1q8O1L0n6j02L7L4K8l2rMk6J70
1054B31j40R0N8l0n6L2j6j14R9j18J99j92J02o5M7L3ll5k0O3l6k7J3k8l1J26j74R0J70j17
702A51j33J59j5J46j00j0K2jL0j19n1L7J65j11R1m7J0l8q4J06p2k8l8M6j0o6J56J16j89o3
350F0KJ7k9L7l4J60p7p7L9R5j75K39j86J1K83k23j29L3P1k1p6K5N2lO5r7lj6O9q1M6R6P5J8
$$ plain form
2932 190 179 25 239 155 201 269 161 61 249 244 153 227 159 88 80 123 114 271 179 155 93 36 189 63 258 228 188 86 120 249 128
2568 128 221 250 257 117 105 150 261 138 85 65 293 324 45 115 54 78 124 147 173 76 221 97 131 56 113 280 220 175 94 36 145
2204 145 322 211 146 235 283 178 68 287 270 207 153 204 202 45 45 140 292 83 140 119 49 173 175 109 136 278 91 159 137 278
1852 278 236 175 152 107 170 159 93 93 141 229 133 109 51 119 81 34 100 56 96 150 81 158 141 137 216 149 104 129 167 122 57 113 157 136 104 74
1430 74 170 236 82 73 229 32 296 154 31 125 154 238 251 156 45 97 87 129 180 92 153 183 127 25 62 96 124 92 83 87 61 231
1054 231 91 181 239 209 153 185 169 55 154 36 235 43 145 80 127 160 157 122 102 165 129 102 115 87 56 182 8 98 268 151
702 151 18 177 162 308 208 198 220 219 249 130 79 116 281 170 261 214 224 186 102 208 136 108 70 116 106 40 196 312 123 60
350 60 62 79 50 87 53 213 136 59 98 193 18 257 71 82 365 142 13 46 117 96 20 45 97 94 159 62 59 43 112 31 77 173 248 266
-49B66k6l7q9q3J08k4jo8O9L8k9N6
$$ plain form
-49 266 240 203 114 31 139 115 114 46 115 153 124 180
-190A80
##PAGE=	F1=-15120.3
##FIRST=	25169.313707327481097,	5807.6787752999953227,	0
##DATA TABLE=	(F2++(Y..Y)), PROFILE
5808A25J3L7q3M5K11j43J9j50N2q0R8p7Rk2Q6oj19J27J19R9N5k23j01mK5L6Pk4K0q3J32j03
5432I7jL7J6po7R9rj30J49p1J2J17k7r3J11p3j05Q6J59q5j32P5O7j2j34k1P7n9m0O8Q6j08
5056H2Q7j09J44j6p3J47Oj35n8K8M1J38j13k6J30q6m4qo7J02j43J49l4pM3r5J32J12j84l8
4704A05L9J11L8j56J05j09k3n8J12Oj08K4j6J4Nk6OJ39j12O6j18L9K9KN5r9J88l0j84J04j8
4340A30m3J57o9j10N7J60j91L3M5j07L8J7q7J34o3Q3p8j4P1q2k3L5m4R3N2j4q7N8l4J48O4
3977C29j40m6OL6p5q0K4J87O1j49k2L6l0q9j0M6K9q8J67J28k79J63p3N8J24j11K0q4M3O7q0
3613A68k4L0j06Q2oQj45R8j5J24j22J98j16p1J17j67Q3k2o3M3j9J38r3M4L7j79J44n3j8o1
3261C4P7J44j64k7J59j37N1J30j35K7L2Q9j00j40J18o9J29K3J22j67j56J02m3KJJ7pJ7L1j11
$$ plain form
5808 125 138 175 92 137 348 205 224 74 126 46 144 67 76 54 140 134 15 142 261 360 415 192 91 87 112 148 155 131 151 68 200 97
5432 97 96 133 149 142 75 174 165 35 184 113 125 242 215 122 233 160 55 141 300 215 83 158 225 213 79 58 135 76 36 104 190 82
5056 82 169 60 204 188 115 262 268 133 75 103 144 282 169 143 273 187 143 135 68 170 27 176 142 135 178 83 215 327 143 105
4704 105 144 255 293 137 242 133 110 52 164 170 62 86 70 84 89 63 69 208 96 162 44 83 112 114 169 70 258 228 44 148 130
4340 130 87 244 175 65 122 282 91 124 169 62 100 117 30 164 101 184 106 92 163 81 58 93 49 142 194 180 93 151 117 265 329
3977 329 189 143 149 185 110 30 54 241 302 153 131 167 137 48 38 84 113 25 192 320 41 204 131 189 313 202 222 138 181 248 168
3613 168 144 174 68 150 144 152 7 105 90 214 92 290 174 103 220 53 136 114 51 94 75 213 120 164 201 22 166 113 95 34
3261 34 111 255 91 64 223 86 137 267 132 159 191 280 180 40 158 89 218 241 363 196 40 142 99 101 102 119 112 129 160 49
2909D9J35m5N8M5l5j31J83k8n6M4p8m1LP6q0J71j21m5L7p5M9l4K01l7J2j32j0J36j27P4L1
2545B29K4j41m1Q4R7q5p1m3K02L1k71J47o7n1Q9k5M2j04J61j30O4m5PJ56n9k2j03m3Q7J46
2193B65q5pP6O5p3j77J99j7p4m8R1l3j22k9R7J14j81M8pl7J04j0k0M9R0j75L1lJ41K3j05k4
1817A66n3J04k4j27K7N4R2j47J8l7R9r2pP8l9j4R8q6P0n9K6Q6j17p4Q0J15m1j17O2J00n9o6
1441A16n0Q5N6r0lR7j91K45j70k8M4J7J23L6j18j60J22k3L3L2j06M9P7m1j14Oj1Q1L7n4l3
1077F4j9J71j27P7R4Lj08j7R9j40Q7j42K06j95R3o5J7Q3l7l2RN4k2o7j4K1o6J43j28RJ15o1
702A05r0J61m8J88j07l2QK7Q8j08j23O7J89j50K7k8O1m5j21J53p8q5J1K0K5p1J47J05j64j10
350B2O6k9m6J01n3K04j27j06O7J34k00J99j29o9L48k04j36Q4l8l1j1J0Q1j4O2j10Nk7K5l8
$$ plain form
2909 49 184 139 197 242 207 76 259 231 175 219 141 100 103 179 99 270 149 104 141 66 115 81 282 245 257 125 115 251 124 198 229
2545 229 253 112 71 155 252 167 96 53 255 286 15 162 95 44 133 108 150 46 207 77 141 96 103 259 200 178 75 32 119 265
2193 265 180 173 249 314 241 64 263 246 172 124 215 182 60 31 128 242 61 109 102 65 169 159 139 188 278 103 134 131 272 295 190 166
1817 166 113 217 193 66 93 147 239 92 110 73 172 80 73 151 112 98 196 110 180 121 147 233 116 42 122 237 196 79 141 241 182 116
1441 116 66 151 207 117 114 211 20 265 95 67 111 128 251 287 169 9 131 108 141 173 67 116 193 152 38 44 33 114 151 97 64
1077 64 45 216 89 166 260 263 155 138 237 97 184 42 248 53 146 81 98 181 144 112 121 175 153 86 72 93 27 170 42 51 166 105
702 105 15 176 128 316 209 177 185 212 300 192 69 136 325 175 202 174 235 190 69 222 144 59 70 90 115 44 191 296 132 22
350 22 88 59 13 114 61 265 138 32 99 233 33 232 103 34 382 178 42 126 88 57 46 56 137 123 185 75 80 53 78 40
-2D0Q3J13l7K2K8k2j11q4Q3n2QJ2N6L5NK1
$$ plain form
-2 40 123 236 199 221 249 227 116 32 115 63 71 83 139 174 179 200
-190B00
##PAGE=	F1=-15222.5
##FIRST=	25169.313707327481097,	5807.6787752999953227,	0
##DATA TABLE=	(F2++(Y..Y)), PROFILE
5808A24J3N0j27J16J69j38Jj42L7k8O2o3J7l2O4Lj03J53J13K9N8j76n1ol5N7k2Pj6m5J43j66
5432F6%P4j0ro2J17J0j71J22p6O9J54p6o2J24j53rP2J14j13r8J7J02l2j6j17P7pj7J7R5j19
5056H3N1l3P7Qr1J90q0lj56N8K6J29j00L3Q8j31K8k4m4R1j77J76p7K8K5j02J58J31j96m9K2
4693A39Q4ol9P0q1j17KJ02j9r9J47m7o0Jn1O8R7j41N5q1N1M3PJ2p4J72k3j79J61lr8J89r1
4305A91j09L8K16k29K9P1j57J01l8l5P4j3lrk8J01j75P0o8M3J58mr6lK3n2J71Q4j75n8J9N3
3930A90o3j11O1J26O4j23J7k5K7j39J4NR9j32J43J71k12N7m8L6J42r2M0r9N8M2q0m8N8j13
3578F5N8J6j8j13O5M7Q4j00J70j07l7P5j78J00j1j6Q0j23J49p9NJ14k13J22j05Qk9R3J79j52
3225A49o2J07j00K9J24j13P0l3N3l6j26J06k6O6nJ47j37j41O7o1J9J8m0M8n5O4l8J2KN4N5
$$ plain form
5808 124 137 187 60 176 345 207 208 66 103 75 137 74 91 59 123 126 23 176 289 318 376 200 149 143 108 165 143 150 134 89 232 66
5432 66 66 140 130 121 59 176 186 15 137 61 130 284 208 146 270 117 108 180 294 181 83 100 202 170 154 37 114 107 90 107 202 83
5056 83 134 101 178 186 95 285 205 202 46 104 130 259 159 192 280 149 177 153 109 200 23 199 122 150 175 73 231 362 166 117 139
4693 139 223 217 178 248 167 50 52 154 135 36 183 136 76 77 26 94 191 50 105 24 75 118 125 137 63 235 212 33 194 191 93 282 191
4305 191 82 120 336 107 136 207 50 151 113 78 152 139 136 127 99 200 25 95 27 70 228 224 128 125 148 96 267 351 176 118 137 190
3930 190 127 16 77 203 267 144 161 136 163 24 38 43 142 10 153 324 112 169 121 157 299 207 247 148 206 248 168 120 178 65
3578 65 123 139 121 8 73 120 204 104 274 167 130 205 27 127 116 100 180 57 206 127 132 246 33 155 50 58 29 122 301 149
3225 149 87 194 94 123 247 134 204 171 224 188 62 168 142 208 203 350 213 72 139 78 97 115 75 123 68 132 94 106 108 162 217
2862B17K2j15J34n1k2K8r6k0J2Q6r6J54j31o5J30l9j01O3J90o0N9j31n6J25j20K6P5J2j47
2521H3m1J11Q2m7r1n7J57K5j76J71o2p3Q7q1L5q5J36j21R5j3n6J44o3J4j21J1L6Q1m1M4O0
2157B44P5l1k07J45l1p8l1J17o6n5k4J02K7j49L9mJ2Q3j4j0Q7L5j46m1K9J53P4j43k8l8J24
1793B50j5j99M9O0Q9j91Q1m7J39r1j6P5l6n5J41j03N8j01J20M5j54o6O9J99n5j70P2J72j12
1453B08o5q6R0K3k5j1L9j67K04j85P4j3K9J44L2r7j39J29o7K3K8j01RJ23j8j17k1KJ04L8j06
1089H1n3J9J47j03M6J33L7j48n1J69j64Q5r4J38j72O8l8j3P8p2k7O2N5Mp3p5P3q1Q5n5n2N7
714F6nj3R8o2K16j10m3k5N5J54p6j85R5J75j62m6kR6m6j42J83k7j82M0M1M1p3J16Q9j33j20
350A3R3n4j3R9o7K31j71j29R0J74j82J10p9q7L39j76j08J11n9r4M7k3R4OM6j07j0rm4PJ41
$$ plain form
2862 217 239 124 258 207 185 213 117 97 109 195 99 253 122 57 187 148 47 110 300 240 299 168 112 237 117 143 218 230 83
2521 83 42 153 235 188 97 40 197 222 46 217 155 82 169 88 123 38 174 53 148 135 79 223 160 174 53 64 100 181 140 184 244
2157 244 319 288 81 226 195 117 86 203 137 82 58 160 187 38 77 73 85 168 154 144 231 266 120 79 108 261 335 192 164 126 250
1793 250 235 36 85 145 234 43 124 77 216 125 109 184 148 93 234 131 189 88 208 253 99 33 102 301 246 76 148 320 208
1453 208 143 57 147 170 145 134 173 6 210 25 99 86 115 259 291 194 55 184 117 140 168 67 76 199 181 64 43 45 149 187 81
1089 81 28 47 194 91 137 270 307 159 108 277 113 198 104 242 70 138 100 87 165 93 66 128 183 187 114 39 112 31 116 61 9 66
714 66 61 48 146 84 300 190 147 122 177 331 255 70 165 340 178 132 130 226 180 38 221 194 12 52 93 134 61 177 266 133 13
350 13 106 52 39 138 71 302 131 2 92 266 84 194 115 28 367 191 83 194 135 41 88 65 159 165 211 104 94 85 41 48 189
-14A89R6j48K6R4j2j37p1M3o4N6M1M5J5M3p
$$ plain form
-14 189 285 137 163 257 245 108 37 80 16 72 113 158 173 216 209
-190B09
##PAGE=	F1=-15324.8
##FIRST=	25169.313707327481097,	5807.6787752999953227,	0
##DATA TABLE=	(F2++(Y..Y)), PROFILE
5808A30K3L2j43J67J12j27pn2qmK4n2j0j9N3J4r4J51J04k6N6j26Kor2P4m4L1n1JJ30j91k4
5420B8J35l5j0p5J22L5j92P8p0J13J72j24l2J59k26Q1L9P8j15p9l7J23k5P1j37K5J2J3L8L8
5068B03j27K1N2RK0p9K20j76J22k45J05PR4r6Q7N5j61J01k6l5Q0k02J97j16L6J8r0J71J42
4728C87j98n7j0M3qL5M0k0j20L3J2k6LJ47q2j01nm1P0N9j27J8m3N9O2ml0m6J53qj55J70L5
4340B45j44K09j18j02M3K34k54L0R5j87J39p6j2K7N0j00N7m5J23j57Q6o7K1K10o8j68P7j5
4012A33p1J72J02j90m3j5Q3j2j11M3O0M8q7N6o6P0j68M2J8J06j46P8K01j27k9m0OJ59r8O2
3660B36q0P6J0p8p5Q5j06N0J7o3n0K9R4M6p0J17r4J0K2j32Q4j0J7J11j62J04p1kJ50j91O3
3296A37r6j0J4R0J89j12r4L2n5J6R5p8R1q2L8K0j13R2K3nl6J50q5q5j1p8K8N9o2N8p4O0L1
$$ plain form
5808 130 153 185 42 209 321 194 187 135 127 123 147 95 85 66 119 133 39 190 294 268 324 198 200 194 102 176 132 163 112 113 243 52 28
5420 28 163 128 118 43 165 200 8 86 16 129 301 177 145 304 78 159 198 276 161 82 45 168 143 214 77 102 114 127 165 203
5068 203 76 97 149 158 178 99 319 143 265 20 125 132 226 130 217 272 111 212 186 151 231 29 226 110 146 164 74 245 387
4728 387 189 132 122 165 157 192 232 212 92 125 137 111 114 261 179 78 73 32 102 161 34 52 9 68 130 126 96 50 203 195 40 210 245
4340 245 101 310 192 90 133 367 113 143 238 51 190 114 102 129 179 79 136 91 214 57 143 76 97 307 239 71 148 133
4012 133 62 234 336 146 103 88 171 159 48 91 151 199 112 168 102 172 4 46 64 170 24 102 303 176 147 107 113 272 174 236
3660 236 156 232 242 164 89 174 68 118 135 72 22 51 145 191 121 238 144 154 176 44 128 118 135 246 84 188 117 115 265 74 137
3296 137 41 31 45 135 324 212 118 150 95 111 206 128 219 137 175 195 82 174 197 192 156 306 221 136 125 47 75 134 72 130 56 116 147
2909A47j01K3M3J05L4o8P2p9OK4j21kJ2P9o0J17j24o4J68j5j72J19J68r4R1j28o5J01j01n7
2556E8J65k8j59N3O2O1k1j05n9J08J8o7J75n6p3P6j01j5m5Q5j01J15J6j05J29p2N2j37P4j0
2204I3oJ3P0M6Q0J1j95P8o4o6j0J20r5K2J1R7p0j02PJ4N4O4k4k8J24oj17j12P9J76R0j69l8
1817A47nJ22J0k51M7O1Q5k04J39q9J78o4n7O4k2q5J76j15M7j27K33k2j49k9rK56o4k08P6K33
1465C74j63m0p9Q9l4Ql1J0j03J16j05Q4p2P4J35ln8j18J49j11RL5q3nJ24Lj13QK3P1lj46k1
1077B4M0J03p5KJ73O5j79p0J99j77R1m2O9j44M4Ol2K0m2m6R4O0L6o4j29J10m7n6M3j6k0K3
702F3J1J9n4K22j06m6p1Q9K07l0k21J11J29j53j07K0J20l6j47J89L5k12oQ9M1o6O4O7r4q7
350D0R2p0MQ4n9K33k03q1N3J91j55J6l0m0K56j44p9J33l3j51O9n5Q4M1L9p4m2ko3JJ80O8k20
$$ plain form
2909 147 46 69 112 217 251 183 255 176 182 206 85 83 95 174 114 231 107 43 211 196 24 143 311 217 308 180 115 216 115 58
2556 58 223 195 36 89 151 212 191 86 27 135 153 86 261 205 132 208 107 92 47 132 31 146 162 57 186 114 166 29 103 93
2204 93 87 100 170 216 296 307 112 190 126 60 50 170 75 97 108 205 135 33 40 54 108 172 148 120 244 238 121 9 88 264 354 185 147
1817 147 142 264 274 23 70 131 216 12 151 62 240 176 119 183 161 76 252 137 184 57 290 268 119 90 81 337 273 65 141 374
1465 374 211 171 92 181 147 155 124 134 31 147 42 126 54 128 263 260 202 84 233 122 131 166 83 78 202 205 92 100 123 194 191 45 24
1077 24 64 167 92 94 267 332 153 83 282 105 196 154 223 79 123 129 97 117 75 29 123 183 219 155 26 136 89 33 76 60 40 63
702 63 74 93 39 261 155 109 38 127 334 304 83 194 323 170 63 83 203 167 20 209 244 32 26 115 156 90 154 221 127 40
350 40 132 62 66 150 91 324 121 40 93 284 129 145 115 75 331 187 108 241 208 57 126 71 155 196 235 161 119 117 54 55 235 303 83
-38H3J8J56Jj60n4JJ4M4K7M0j8P0k0
$$ plain form
-38 83 101 257 258 98 44 45 59 103 130 170 152 222 202
-190B02
##PAGE=	F1=-15427.1
##FIRST=	25169.313707327481097,	5807.6787752999953227,	0
##DATA TABLE=	(F2++(Y..Y)), PROFILE
5808A33M3mr6J52N4j14OM3m9kJl9o9L8M7J9r8J12R5n4M8p8M4lj22P5n0L2p7M1J12j42p4J45
5409A69m1Kj04J16O2j99L5K0N9J66j61lK08k91J45J3N6r3p6m5R5pR8j24j5J3M3R5l1j38MJ21
5033A92m0J7n5K37k67K27k88J06J6M9j08J30L5j71J58k6k7P0k11K03j44J7J9o0J70J49j95
4716B03o1m1MN5J5K8N6q9J8p4nN3J42j15r7j3qJ6L7p0k9RL9P5l1m4k7J23J3j00J13P6j51K04
4317C24j46r1O2K18k62M0J05j89J38r0nj6J04j62R8m4J18j12R2m0j9K32j17j67Q9m3r6J53
3988A74J18j78J5j12J21M2j19L5MJ0l5P1p5R4j35K5N6O9j25%K03l9n6q0nJ57j23R2n9J02k1
3624B26o5p9P6p4N8Mr8lJ7R4K4m3M8p0N2j7n3L8j6L3J29j38J8o7L3J21j50J2l4n5M1Q0J82
3237C24o9j05l9j6NN4k8P3j08N9M4r5P6O8o4p1J28k0k3r2q4L0J07o7L8l2L4O7j03l5M6J39
$$ plain form
5808 133 176 172 76 228 282 168 174 217 168 166 167 128 59 97 144 163 65 177 272 218 266 188 232 229 107 182 132 164 87 128 240 98 24 169
5409 169 128 130 26 142 204 5 40 60 119 285 124 121 329 38 183 196 252 159 83 38 133 126 224 100 85 98 141 236 205 67 71 192
5033 192 152 169 114 351 84 311 23 129 145 194 86 216 251 80 238 212 185 255 44 247 103 120 139 79 249 398 203
4716 203 142 101 105 160 175 203 259 170 188 114 109 162 304 189 92 79 71 87 124 54 25 34 73 148 117 73 46 169 182 82 195 271 120 324
4317 324 178 87 149 367 105 145 250 61 199 109 104 88 192 30 128 84 202 90 182 142 123 355 238 71 160 117 21 174
3988 174 292 114 129 17 138 180 61 96 100 110 75 146 71 165 30 55 111 180 55 55 258 219 163 83 78 235 112 204 145 247 226
3624 226 161 82 158 84 142 146 48 45 62 156 180 137 185 115 167 150 97 135 119 152 281 143 161 94 127 248 98 110 76 21 62 142 324
3237 324 255 150 111 95 100 154 126 199 91 150 194 99 175 243 179 108 236 216 193 101 17 47 154 87 125 93 127 194 91 56 102 241
2862B41MpJ9j11K2K8j47L6j1N9jQ6j05o1J51mj51J24J40j26J05j29m4P9p4p8J95p3j19J09
2509A57KK4qj12k5N3L1j4J68m5o5O9q8p9lL1o7J09L3j11J05q5P7j55J38m3n5K5O8L1Q5M4j58
2122A37K6j13j8j1J02j11R1N1Q0j43l2m8O4N3M9m9n8J51k6r3k9M3J66P5j83n7L9J02L9k63
1770C4K3N2P7j45J40j47K06k8j06M6Jj11K07j16L5r9K89q7j13k4l8K42n4k10N9K60j98rl1
1430A55P7p9J0p7K6n6M1pN3j14J28J08o1j2j03J66j30mM6o7K6P8J5j08M7K5L9n6j24M2KN2
1054A38m7m6K03Q5k00q8K11j62R2oK1j18K0N2l4o4J00l7jN2P2n2j58J22mo5QMj0Mj0m5kJ70
655B05r2n0kN4J93J9k32J12O5j23j38K7J31j2j40J79Q0k08j9J04J9m8J2K6m1m6J08j01lP2
303A51k9K08k26k8K8J77j15p8K5%J73j09o3J50Mj79O7q3N3Q0N1k1p7k1l8k8J78L9k12l0J95
$$ plain form
2862 241 245 238 257 146 168 196 49 85 74 133 132 218 113 52 203 199 48 172 312 186 291 162 118 197 123 45 240 167 48 157
2509 157 159 183 175 63 38 91 122 108 276 231 166 235 147 68 65 96 29 138 171 60 165 80 157 2 140 97 42 67 135 166 251 295 137
2122 137 163 50 32 21 123 12 103 154 234 91 59 11 75 128 177 128 70 221 195 102 73 116 282 357 174 117 156 258 297 34
1770 34 57 109 186 41 181 34 240 212 106 152 153 42 249 133 168 69 358 271 158 134 96 338 284 74 133 393 195 186 155
1430 155 232 153 163 86 112 56 97 90 143 29 157 265 204 192 89 255 125 121 167 100 126 204 219 111 158 183 222 166 42 84 86 138
1054 138 91 45 248 333 133 45 256 94 186 180 201 83 103 155 121 57 157 120 119 171 243 191 33 155 151 86 94 98 88 92 82 37 35 205
655 205 113 63 61 115 308 327 95 207 272 149 11 38 169 157 17 196 276 68 49 153 172 124 136 162 121 75 183 82 79 151
303 151 122 330 104 76 104 281 166 88 113 113 286 177 114 264 268 89 156 73 126 206 257 236 159 138 100 72 250 289 77 47 242
-61B42K6j80l8KM9K3J0M1n5P8j8
$$ plain form
-61 242 268 88 50 52 101 124 134 175 120 198 180
-190A80
##PAGE=	F1=-15529.3
##FIRST=	25169.313707327481097,	5807.6787752999953227,	0
##DATA TABLE=	(F2++(Y..Y)), PROFILE
5808A30O4l8m1J11J2r5L5J09r3lrj7j43J26M5J2j06M3Q0n0L9l7O2J2j27N9m1J4q8O3R8p5r7
5420E4Q9l6M0j18P7R1j73j7J11k0J39j69J9K51k98J42%M9o4o6k3K6LP4q5l5J4N6J64q4j50
5056F1oJ62o0Ll5K40l33L03k83N7N6J0j38J56L2j62J89l6j4O3k15K05j54j6J5j9J55J56j90
4716B02o0n3%J09o8M1J26o2j2j33L4N6J27j40o4j1ll9M1j5m0M5J8P1o9jk7O9L3l3J0R9r7J69
4317C23j66q9Q8J80k47N3R7j71J10p8ko3J36j14N4j5P4o7J03k6l8K23j45j09M5m7q3P5J27
3977B28j36Q8j12L5P0j20L8l2l7L3M1m4J01r6OQ1J6o8k7J32L5l0j53L2J12j31J22p2J30m2
3624B00m1m1J0j8O9pp5j7j2P9K7k8k1m0P7j9Mrk5N0J23q5p7n2P5N1r7j9J5o8L8O7J69l3r7
3214A73o5j0oJ4L2J7j20J15K7o9O2J05j03r9Q5L5L2j46k9QJ11q0J8J6K9P2p5n0O1J05l9N2
$$ plain form
5808 130 194 156 115 226 238 143 178 287 194 191 182 165 22 148 193 205 99 142 222 172 211 174 236 248 121 180 139 153 65 128 226 151 54
5420 54 143 107 147 29 106 197 24 7 118 98 237 68 87 338 40 182 182 231 167 101 78 104 107 181 96 61 75 131 295 211 61
5056 61 55 217 157 160 125 365 32 335 52 109 165 175 37 193 225 63 252 216 202 265 50 255 101 85 100 81 236 392 202
4716 202 142 89 89 198 130 171 297 235 223 90 124 180 307 167 103 92 89 50 91 76 36 81 99 170 101 100 73 142 175 142 152 251 154 323
4317 323 157 68 156 336 89 142 239 68 178 100 98 35 171 57 111 96 170 103 206 180 142 365 220 111 156 109 26 101 228
3977 228 92 180 68 103 173 53 91 59 22 55 96 52 153 57 63 144 160 92 65 197 232 202 49 81 193 62 184 112 242 200
3624 200 159 118 128 110 179 172 97 80 68 147 174 146 125 85 162 143 147 138 113 163 286 201 124 72 147 198 101 82 97 29 67 134 303 270 173
3214 173 108 98 92 106 138 155 35 150 177 108 170 275 172 73 158 193 225 79 50 58 169 89 107 123 152 224 149 99 160 265 226 278
2838B78j5j37K2L5j64R5m8L3M1P9p8r8J22pj00J32J09j42J01j28j9P3n1J1J13r0n3R6l4k8
2486A48nj09M7mO0l7J50k6m7O5n7j25K4pk2P3L4q1Q5r0P3j17J38o1Qp1M6RR0O2j09mj18L4
2087E6m6O6j1L9P7N2j82M8m2O0K7L4q6p1J45k3p4O7L2J31M5j83q2Q2O9O4k52J1K9O4p9J33
1711B00j96K13Qj45L1J9j20K20j08K4l1K73j34o4l3j2J59j9j90M0K45k15K0K8O1r3J5j61P4
1371A09l5LL5L5j05J44Q0j31M1j07J73j25jN0n1O5K4J4j05P9J9J0r8l9N9l6%k0o0J85R3j96
995A09p6J80j11P5Njr4j1R4j8j25K22k8q2PJ12m6j70J21L4j8o9Lj0J7m8l8K8P9o9m7J29J5
608A69R0N7k20J02op4q7J0Q8J5j07J50R8j88OR7k1k3j6m5K5kJ34j48k4O5OJ72k39K3NJ47o9
221A90j59Q0L3R8p2o5J61L5j78N0j00PJ17P7L5j09n5nm4J41Rj44p0J76O1j93k5L8L5lMM4q1
$$ plain form
2838 278 263 126 148 183 19 114 66 99 140 219 141 43 165 158 58 190 299 157 258 130 111 184 133 144 257 167 114 210 176 148
2486 148 143 34 81 77 137 100 250 224 177 242 185 60 84 77 55 128 162 81 166 76 149 32 170 109 117 46 92 101 191 253 144 140 22 56
2087 56 10 76 65 104 181 233 51 99 57 117 144 178 92 21 166 143 69 136 168 299 344 161 79 161 230 294 42 53 82 146 67 200
1711 200 4 217 225 80 111 130 10 230 122 146 115 388 254 190 157 145 304 285 95 135 380 165 185 213 274 181 196 35 109
1371 109 74 77 112 147 42 186 266 135 176 69 242 117 116 166 115 180 204 218 113 192 211 221 123 84 143 107 107 87 27 212 305 109
995 109 33 213 102 177 182 181 87 76 170 152 27 249 221 139 146 258 212 42 163 197 179 110 113 103 120 72 34 62 141 72 25 154 169
608 169 259 316 96 198 192 118 31 41 129 144 37 187 285 97 103 200 179 156 140 95 120 118 252 104 80 145 151 323 84 107 112 259 190
221 190 31 111 144 242 170 105 266 301 123 173 73 80 197 274 309 200 145 140 96 237 246 102 32 208 269 76 51 89 124 121 125 169 88
-167H8O4n
$$ plain form
-167 88 152 147
-190A47
##PAGE=	F1=-15631.6
##FIRST=	25169.313707327481097,	5807.6787752999953227,	0
##DATA TABLE=	(F2++(Y..Y)), PROFILE
5808A18Q2n7nO3mo3O1J43j47jpJ8j52J48M3%j10k0L8k1L4lN5L7j19L6k3j0q1O3Q9k1j17K0
5409H7k3R7r9NJ13j26k6J44r1Q6j06J7K54k30O6kN1m6m8nm0%L4l9j6L7RK25j16j56j4J76n6
5021A62j2l1K31l18L04k46j8J17j2j53J37M1j47J95n9LN9k12K05j46j7k3K3J19J63j80n4m0
4693I1K0J09j51P4J73m0n2j45O9L6R3j53k3Kk8n7N2K9n2Q9RM9j11O1k8J3M0L5j10Q8J3J12
4317C07j70j05J16J37k08N4P4j41P3m3Oo0Q2j9kK5kk0J09k9l6J89j51n7Qk7m4k2J16q2J49
3953B27r8o1O9q9L2n3L0ml0L1R3p0rQ4m3K3j7J9P6J8k19J02M3n6J07j33J41m5j3J5q8N4P1
3566B07rm4k5p8P0M8k5p1j1P7J4K5m3m2Q2R2k4j65KP2l2l0k3L6o1J4N3J57qq2l9l7j5pP5m7
3143A06p9J30j4m0N3J32j19j10M5N1O9j32KQP0r8QN4L5O3m8k9O8M4o4R2k7j52J0M5j31J05
$$ plain form
5808 118 200 143 138 201 197 134 195 338 191 190 183 201 49 197 240 240 130 110 148 127 161 158 213 250 131 167 144 134 53 116 205 184 67 87
5409 87 64 161 62 67 180 54 28 172 81 167 61 78 332 102 168 166 217 171 123 118 78 78 112 73 57 94 103 328 212 56 42 218 162
5021 162 150 119 350 32 336 90 72 189 177 24 161 202 55 250 191 194 253 41 246 100 83 60 83 202 365 185 131 91
4693 91 111 220 69 143 316 276 224 79 148 184 277 124 101 103 75 18 70 99 47 136 145 194 83 144 116 129 169 204 94 182 195 307
4317 307 137 32 148 285 77 131 205 64 137 94 100 40 122 103 101 126 124 104 213 184 148 337 186 129 137 110 66 44 160 78 227
3953 227 129 68 137 48 80 27 57 53 23 54 147 77 68 152 109 132 115 134 210 228 9 111 154 98 205 72 213 168 155 170 82 136 207
3566 207 198 154 129 51 121 169 144 73 62 139 153 178 135 93 175 267 243 78 80 152 120 90 67 103 42 56 109 266 258 176 137 100 85 78 153 106
3143 106 27 157 143 103 156 288 169 59 104 155 224 92 94 102 172 74 82 136 171 234 186 157 225 269 205 297 270 118 128 173 42 147
2768A47o9J2L8J00m4j78R9j9k6J34P8j35Q3j18j5Q8m1Q5M1o8j8O4m3q7qo9J02n5P0r0J25M
2392A87j9O2k3j43L6l0J7L5K4l9P0r1N0o9J21o2O1j52M2l4Q5O6o1k2k9jl6oQ3j1O9K5j87J25
1993A43l4N3nJ3j19L9J0kn4J31L2Q8K1j75r5J09K7P8k15J7nM6j4J13j78J55L6j64L2J2k3J36
1617B08j00K0L2K14j55j9m3L6M7L2j65L9J96k13M1P5N1q4M0k02N6k3nL6J9o9J40N9j85R0j32
1254C6J66j11K2M8l4R4k2Nj07R9Oqj19M7O7p0m4Jj1J01Q4j45j1P6m9M4kLp0l9J09J6j31K62
854C13oj23p1J49m5j71J08O0K3j18j1k4O0o6j4J6jl7J2J76Kl0O6j86Q2o6nn8N3lL6n1J14R2
455B76j62L9R3p3Oj0j16P4L7J52j96n0O4L0J38k16M4j6J11k7j71Q0P0K5l5p7J63M8j52K3j00
92G2l7J40J11P4j35q7K4m9R0j4p8n7J03J01k00j1P5Pl6J7M2q1L1J0
$$ plain form
2768 147 78 90 128 228 184 6 105 86 60 194 272 137 220 102 87 175 134 219 260 192 174 238 195 108 100 31 133 78 148 58 183 187
2392 187 168 230 207 64 100 70 87 122 146 107 177 86 136 67 188 126 187 35 77 43 128 194 133 111 82 81 45 39 122 111 180 205 18 143
1993 143 109 162 157 170 51 90 100 98 44 175 207 295 316 141 46 155 182 260 45 62 57 103 89 202 24 179 215 51 83 95 72 208
1617 208 108 128 160 374 219 200 157 193 240 272 107 146 342 129 170 245 296 212 252 50 106 83 78 114 133 64 204 263 78 168 36
1254 36 202 91 113 161 127 221 199 204 97 196 202 194 75 122 189 119 75 76 65 166 250 105 94 170 121 165 163 166 96 57 166 182 51 313
854 313 307 184 113 262 217 46 154 214 237 119 108 84 144 78 64 80 79 42 54 230 232 202 268 82 164 98 93 35 88 85 121 70 184 276
455 276 114 153 246 173 179 169 53 127 164 316 120 70 134 164 302 86 130 114 225 198 27 107 177 202 167 90 253 301 149 172 72
92 72 35 175 286 360 225 138 162 113 203 189 111 54 157 258 58 47 122 129 93 110 152 71 102 112
-190A12
##PAGE=	F1=-15733.8
##FIRST=	25169.313707327481097,	5807.6787752999953227,	0
##DATA TABLE=	(F2++(Y..Y)), PROFILE
5808A01R4n8JJ9Pj5O3J51j99KKO1j27J27L6j2j00l6n6J6M0J9L2P0j11J4%k8o1N2P8Pj35m2
5409A2O2Q8o7n6J18o4m4J66j14jkJ2K01j43j5JO2n5l3K5j04kL8l9N4M9q8K66j26j48rJ49l4
5021A59k7m1K18k39K46j88r8J84j5j31O1N5j33J81q8K4N0k04K07j23L3o7L2N5J64j60m0j8
4693I7K4R6j80Q8J87k0r5j12R5K0L7j67J4K0p6M8j4P4p7J29J3J4j48J12j8k8K6R4j87QJ59
4329B33M5j52j12J12J08j55L2M6j10M2OJ9j9l4P7k4M3p4K6R3m8k0J48j39l0ljrl7L5l2J82
3953B48r6j25N6Lj4o2R2n4J2J5P7o6j6O7j02J36j1p9Q1O2j87J04j8L5R6j95J06l0J3P3j87
$$ plain form
5808 101 195 137 138 157 164 149 212 363 164 166 168 229 102 229 265 253 153 117 61 77 117 136 168 238 127 141 141 113 52 104 182 189 54 12
5409 12 74 162 95 39 157 93 49 215 101 100 98 110 311 168 153 154 216 161 128 153 49 47 85 46 100 149 61 327 201 53 44 193 159
5021 159 132 91 309 70 316 128 30 214 199 68 129 184 51 232 144 168 218 14 221 98 131 64 96 151 315 155 115 97
4693 97 121 217 37 125 312 292 197 85 180 200 237 70 84 104 28 76 62 136 59 188 201 215 67 179 161 133 159 253 66 74 233
4329 233 278 126 14 126 234 79 111 157 47 89 95 114 95 61 138 114 157 83 109 202 154 134 282 143 113 110 109 100 63 98 66 248
3953 248 152 27 83 86 72 10 102 48 60 75 152 86 70 137 35 171 160 81 162 224 37 141 123 158 254 59 165 135 148 221 34
$$ [...]
-190A33
##END NTUPLES=	nD NMR SPECTRUM
##END=	
##END=	
