##TITLE=	Feb21-2022.43.ser
TM-VI-273, CD3OD, Y+Ph-pyr. hsqc

##JCAMP-DX=	6.0	$$ MestReNova 14.3.0-30573
##DATA TYPE=	LINK
##BLOCK_ID=	1
##BLOCKS=	2    
##ORIGIN=	Mestrelab Research S.L.
##OWNER=	hrzepa
##$MNOVA/LINK_BLOCK_TYPE=	ITEM	$$ NMR Spectrum
##$MNOVA/ITEM/POLYGON=	(XY..XY)
5321,5835
8722,5835
8722,8208
5321,8208
5321,5835
##$MNOVA/ITEM/Z=	0
##$MNOVA/ITEM/ANGLE=	0
##TITLE=	Feb21-2022.43.ser
##JCAMP-DX=	6.0	$$ MestReNova 14.3.0-30573
##BLOCK_ID=	2
##DATA TYPE=	MNOVA NMR VIEW DATA
##DATA CLASS=	MNOVA VIEW DATA
##$MNOVA/2D/THRESHOLD=	3.4635984897613525391
##$MNOVA/ITEM/ZOOM/X=	-0.97334353289575425983,	15.004620000063303209
##$MNOVA/ITEM/ZOOM/Y=	-9.4973415065619892772,	229.94100000033026276
##END=	
##TITLE=	Feb21-2022.43.ser
##JCAMP-DX=	6.0	$$ MestReNova 14.3.0-30573
##BLOCK_ID=	3
##DATA TYPE=	nD NMR SPECTRUM
##DATA CLASS=	NTUPLES
##NUMDIM=	2
##ORIGIN=	Bruker BioSpin GmbH
##OWNER=	nmr
##.OBSERVE FREQUENCY=	400.41280287000000726
##.OBSERVE NUCLEUS=	^1H
##.SOLVENT NAME=	MeOD
##.PULSE SEQUENCE=	hsqcedetgpsisp2.3
##LONGDATE=	2022/02/22 21:13:00.000
##.ACQUISITIONMODE=	SIMULTANEOUS (DQD)
##$ORIGINAL FORMAT=	Bruker XWIN-NMR
##$MNOVA/SCALES_VERSION=	9
##$PARAMETER FILE=	(acqu2s, ASCII, /private/var/folders/f6/rjf_tdyn2v98c5c0wvkgn4s80000gn/T/LhKiDl13TdK72lqe4lDEfA/43/acqu2s, 0)
$$ ##TITLE= Parameter file, TOPSPIN		Version 3.2
$$ ##JCAMPDX= 5.0
$$ ##DATATYPE= Parameter Values
$$ ##NPOINTS= 221	$$ modification sequence number
$$ ##ORIGIN= Bruker BioSpin GmbH
$$ ##OWNER= nmr
$$ $$ 2022-02-22 22:00:58.301 +0000  nmr@CZC10666PP
$$ $$ /opt/topspin/data/agmb/nmr/Feb21-2022/43/acqu2s
$$ $$ process /opt/topspin3.2/prog/mod/go
$$ ##$ACQT0= 0
$$ ##$BF1= 100.683175
$$ ##$FnMODE= 6
$$ ##$NUC1= <13C>
$$ ##$NusJSP= 0
$$ ##$NusT2= 1
$$ ##$NusTD= 220
$$ ##$O1= 11073.8951120055
$$ ##$SFO1= 100.694248895112
$$ ##$SW= 239.880525819715
$$ ##$SW_h= 24154.5893719807
$$ ##$TD= 220
$$ ##END=
$$ 
##$PARAMETER FILE=	(acqus, ASCII, /private/var/folders/f6/rjf_tdyn2v98c5c0wvkgn4s80000gn/T/LhKiDl13TdK72lqe4lDEfA/43/acqus, 0)
$$ ##TITLE= Parameter file, TOPSPIN		Version 3.2
$$ ##JCAMPDX= 5.0
$$ ##DATATYPE= Parameter Values
$$ ##NPOINTS= 12	$$ modification sequence number
$$ ##ORIGIN= Bruker BioSpin GmbH
$$ ##OWNER= nmr
$$ $$ 2022-02-22 22:01:02.116 +0000  nmr@CZC10666PP
$$ $$ /opt/topspin/data/agmb/nmr/Feb21-2022/43/acqus
$$ $$ process /opt/topspin3.2/prog/mod/shimcntl
$$ ##$ACQT0= 0
$$ ##$AMP= (0..31)
$$ 100 100 100 100 100 100 100 100 100 100 100 100 100 100 100 100 100 100
$$ 100 100 100 100 100 100 100 100 100 100 100 100 100 100
$$ ##$AMPCOIL= (0..19)
$$ 0 0 0 0 0 0 0 0 0 0 0 0 0 0 0 0 0 0 0 0
$$ ##$ANAVPT= -1
$$ ##$AQSEQ= 0
$$ ##$AQ_mod= 3
$$ ##$AUNM= <au_zg>
$$ ##$AUTOPOS= <12 >
$$ ##$BF1= 400.41
$$ ##$BF2= 100.683175
$$ ##$BF3= 400.41
$$ ##$BF4= 400.41
$$ ##$BF5= 400.41
$$ ##$BF6= 400.41
$$ ##$BF7= 400.41
$$ ##$BF8= 400.41
$$ ##$BYTORDA= 0
$$ ##$CAGPARS= (0..11)
$$ 0 0 0 0 0 0 0 0 0 0 0 0
$$ ##$CFDGTYP= 0
$$ ##$CFRGTYP= 9
$$ ##$CHEMSTR= <none>
$$ ##$CNST= (0..63)
$$ [...]
$$ 0 0 0 0
$$ ##$ShimPowMaxUC= (0..63)
$$ 130000 130000 130000 130000 130000 130000 130000 130000 130000 130000 130000
$$ 130000 130000 130000 130000 130000 130000 130000 130000 130000 0 0 0 0
$$ 0 0 0 0 0 0 0 0 0 0 0 0 0 0 0 0 0 0 0 0 0 0 0 0 0 0 0 0 0 0 0 0 0 0 0 0
$$ 0 0 0 0
$$ ##$ShimPowMaxUG= (0..63)
$$ 524287 524287 524287 524287 524287 524287 524287 524287 524287 524287 524287
$$ 524287 524287 524287 524287 524287 524287 524287 524287 524287 0 0 0 0
$$ 0 0 0 0 0 0 0 0 0 0 0 0 0 0 0 0 0 0 0 0 0 0 0 0 0 0 0 0 0 0 0 0 0 0 0 0
$$ 0 0 0 0
$$ ##$ShimPowRcbType= 3
$$ ##$ShimPowRes= (0..63)
$$ 1e-20 1e-20 1e-20 1e-20 1e-20 1e-20 1e-20 1e-20 1e-20 1e-20 1e-20 1e-20
$$ 1e-20 1e-20 1e-20 1e-20 1e-20 1e-20 1e-20 1e-20 0 0 0 0 0 0 0 0 0 0 0 0
$$ 0 0 0 0 0 0 0 0 0 0 0 0 0 0 0 0 0 0 0 0 0 0 0 0 0 0 0 0 0 0 0 0
$$ ##$ShimPowRng0= (0..63)
$$ 1 1 1 1 1 1 1 1 1 1 1 1 1 1 1 1 1 1 1 1 0 0 0 0 0 0 0 0 0 0 0 0 0 0 0 0
$$ 0 0 0 0 0 0 0 0 0 0 0 0 0 0 0 0 0 0 0 0 0 0 0 0 0 0 0 0
$$ ##$ShimPowRng1= (0..63)
$$ 1 1 1 1 1 1 1 1 1 1 1 1 1 1 1 1 1 1 1 1 0 0 0 0 0 0 0 0 0 0 0 0 0 0 0 0
$$ 0 0 0 0 0 0 0 0 0 0 0 0 0 0 0 0 0 0 0 0 0 0 0 0 0 0 0 0
$$ ##$ShimPowRng2= (0..63)
$$ 1 1 1 1 1 1 1 1 1 1 1 1 1 1 1 1 1 1 1 1 0 0 0 0 0 0 0 0 0 0 0 0 0 0 0 0
$$ 0 0 0 0 0 0 0 0 0 0 0 0 0 0 0 0 0 0 0 0 0 0 0 0 0 0 0 0
$$ ##$ShimPowRng3= (0..63)
$$ 1 1 1 1 1 1 1 1 1 1 1 1 1 1 1 1 1 1 1 1 0 0 0 0 0 0 0 0 0 0 0 0 0 0 0 0
$$ 0 0 0 0 0 0 0 0 0 0 0 0 0 0 0 0 0 0 0 0 0 0 0 0 0 0 0 0
$$ ##$ShimSysFunc= (0..63)
$$ 1 2 3 4 5 7 9 11 15 16 8 10 12 14 6 17 13 18 19 20 0 0 0 0 0 0 0 0 0 0
$$ 0 0 0 0 0 0 0 0 0 0 0 0 0 0 0 0 0 0 0 0 0 0 0 0 0 0 0 0 0 0 0 0 0 0
$$ ##$ShimSysMatrix= 0
$$ ##$ShimSysType= 1
$$ ##$TFXNUM= 0
$$ ##$TRIPLO2= 0
$$ ##$VTU= 2
$$ ##$VTUETH= <149.236.99.20>
$$ ##$VTUTY= <no>
$$ ##$WBREFAM= (0..15)
$$ 135 116 100 100 100 100 100 100 100 100 100 100 100 100 100 100
$$ ##$WBREFLM= (0..15)
$$ 0 0 0 0 0 0 0 0 0 0 0 0 0 0 0 0
$$ ##$WBREFPH= (0..15)
$$ 71.66 -68.25 0 0 0 0 0 0 0 0 0 0 0 0 0 0
$$ ##$WBSGU= (0..15)
$$ 0 0 0 0 0 0 0 0 0 0 0 0 0 0 0 0
$$ ##$XFAC= 2
$$ ##END=
$$ 
##$DECIM=	3120
##$DSPFVS=	20
##.ACQUISITIONSCHEME=	ECHO-ANTIECHO
##NTUPLES=	nD NMR SPECTRUM
##VAR_NAME=	FREQUENCY1,	FREQUENCY2,	SPECTRUM
##SYMBOL=	F1,	F2,	Y
##.NUCLEUS=	13C,	1H
##.OBSERVE FREQUENCY=	100.69424889511199694,	400.41280287000000726
##VAR_TYPE=	INDEPENDENT,	INDEPENDENT,	DEPENDENT
##VAR_FORM=	AFFN,	AFFN,	ASDF
##VAR_DIM=	512,	512,	262144
##UNITS=	HZ,	HZ,	ARBITRARY UNITS
##FIRST=	23151.189942674980557,	6007.9998942000029274,	0.0093658715486526489258
##LAST=	-956.22249693857020247,	-389.73648400514491641,	0.38256081938743591309
##MIN=	-956.22249693857020247,	-389.73648400514491641,	-8.3868284225463867188
##MAX=	23151.189942674980557,	6007.9998942000029274,	24.9085845947265625
##FACTOR=	1,	1,	0.0050351252859002571319
##PAGE=	F1=23151.2
##FIRST=	23151.189942674980557,	6007.9998942000029274,	0.0093658715486526489258
##DATA TABLE=	(F2++(Y..Y)), PROFILE
$$ [...]
##PAGE=	F1=3242.52
##FIRST=	23151.189942674980557,	6007.9998942000029274,	0.16449575126171112061
##DATA TABLE=	(F2++(Y..Y)), PROFILE
4806B0M5or6r4J75m5j20K17j74J60n8j1l1k7j06R7J39JN3k47J15n1K2m7J08qM9j19O3M8m0
4418C2j28J87qj63J92j85J37j4j60J36p2M6j15J84j29Rm5OJ32L4j51k5J18N6L8n4O6p6r6O4
4042A6N5q0n4Q9j44J34l7n6kQ5o6O1J9n5K6l4l5rM7RL3ok2J83j08o1j9K4q8J8J7J0O2l2Q4
3604F4N6r2j14J40L1n9j57JJ21q6J68j55M0J14j10L7k6j5Qj8m0O7J1Qm4L7O4M1J6J48k45L3
3204D4lj11O0r6N2M5j4k5J39j28mn9N1j59K61k1j6lk0M2m9l6N6L8r1j4j8J72j15O7Lj6q2L2
2778a8m6N3J3k6%J54j57P7K0m7k3m2O7L2j33P4m7P0j1K1l6r5pP0O7m4R7p3R1p6p6M7J51j75
2352b8jJ08j86K6J72N3k2r6J24j34o9P9J2q4M1j26R0J08m5m9L1K5Rj16q8J53m2j0P7M2p4J3
1952gn0k5R2M9j0m0J02k08J45j67J58Q2k05l4Q6j2q4Q9J91j23j6l7p4J44m1J06j90P0Mq1P0
$$ y = [20, 65, 59, -37, -131, 44, -1, -121, 96, -78, 82, 24, 13, -18, -45, -151, -54, 85, 86, 139, -108, 7, -44, -22, -69, 39, 31, 80, -39, 24, 72, 32, -96, 91, 83, -80, 112, -73, 64, 50, -110, 26, -46, 0, -115, 69, -60, -51, -96, -90, 42, 76, -75, -100, 18, 74, 112, 58, 124, 48, -48, 16, 71, -9, -63, 26, -118, 16, -21, -77, -79, 6, -60, 1, 20, -35, -9, -43, -78, -87, -40, -31, 2, -4, -26, 157, 49, -12, -31, -7, -95, -77, -60, -50, 12, -20, 64, 120, 28, -86, 54, 85, 26, -131, -130, -9, -95, 73, -82, -42, 72, -38, -1, -27, -42, -34, -52, -92, -25, -14, -6, -50, -13, 51, 92, 108, 256, 11, 44, 41, -70, -10, -106, -54, -9, -23, -48, 91, -37, -41, -100, -49, -208, 53, 32, 16, 13, -7, 35, -14, -50, 6, 44, -47, -61, -79, 93, -22, 45, 48, 32, -50, -18, -64, -11, 2, -24, -24, 130, -27, 50, 70, 23, 0, -42, 25, 57, -76, -2, -49, 21, 10, 31, -5, -100, -107, -37, 30, -14, 83, 10, 101, 25, -51, -4, 147, -28, -29, 79, -107, -81, 91, 144, 122, 26, 150, 16, -53, 26, 38, -46, -5, -131, -41, 67, 22, -27, 4, 29, 38, -78, -166, -13, -55, -65, 12, 54, -20, -7, -57, -82, 10, 59, 49, 9, 111, -97, 48, -119, 39, 121, -84, -118, -32, -44, -128, -39, 152, 29, 13, -24, -98, 46, 5, 111, -79, -9, -5, -86, -16]
1563a6J9O0p9P8q6M5L1j60l1K21k0j35J25r5PP8L9p6lK5Pl9RM6O7j31k3k9L4Q4j31M2J80j88
1138d5l1P9L8j34LJ50j76j8R3N0m7j7Q9j21J51j02LL0q2JJ18M0r9L1N3j85R2Q7l7J5J18q5
737F2j0j3n5J05j02M5L1Rn0k2P1n7M3p2l7L2K1J2j24J23k18J51O8J15l9j78j7J8JL8J41j24
336c2M5R4j05Pk5pM7j33Q5l8N5P1q4l7K6j27j02K06J58j13K9Pn1P2m8K9k2Qj64J78L6Q3l0
-77A18j03k0J7J5jQ8o2l9J20p8r3J79j6j85n9L2O2MK3J38m3m9lJ2J0
$$ y = [-16, 3, 63, -16, 62, -24, 21, 52, -108, -139, 82, 62, -73, 52, -43, -36, 42, 81, 5, 2, 27, 34, -5, 4, 50, 117, -14, -37, -66, -32, 52, -79, -37, 143, -45, -76, 3, 41, -93, -90, 60, -116, -134, -41, 9, -38, -55, 34, -87, 64, -38, -35, -5, -87, -86, 32, 72, -27, 4, 57, -128, -36, 51, 14, 29, 147, 62, 52, 39, -16, 89, -13, 32, 63, 72, 22, 0, 71, 14, 57, -15, -52, -20, 1, 13, -111, 12, -206, -55, 13, 128, 89, -89, -106, -88, -87, -49, 92, -32, 13, 107, 2, 9, -16, -23, 24, -109, -24, -62, -7, 64, -20, -57, -31, -158, -260, -54, 104, -9, 20, 27, -24, 48, 0, 29, 7, 15, -149, 29, 65, 148, 118, 15, -5, 12, 27, 26, 114, 52, 13, 133, 55, -38, 141, 125, -60, -119, -87, -25, -21, 2, 140, 97, 48, 45, 57, 67]
-390F7
##PAGE=	F1=3148.17
##FIRST=	23151.189942674980557,	6007.9998942000029274,	-0.042212851345539093018
##DATA TABLE=	(F2++(Y..Y)), PROFILE
6008f2L8M5j78J58j18J91r6k8J62n2j07nr5J30p6J35p1p4Q0j24J13j03J26j1rJ9M5m3J4l9
5632c5M9N2j22J23l8nl5M9j19N0J94k30M9J31o0m3M1p5L2p9QOQ3j10J06m8k5L8QJ56j83J57
5232A25j10n1M7o1J94k85R7l3%J16m1p4Q2O3o6lm9K6J4K8m6N5l0J7m5j4N2K7j80J17j5p4J47
4819C0rM4Mq4j05J71n7o7J95k47K09j2nl8q5p4R4J10K3L3k48J50o2Pl8J04k0N6j20M8J7jj49
4405a26J88J5j70J93j89J37L9k28J72n2J8q9J74j45N1o1kQ3L1j10L7R4K3N1j4k5k2j67P6Q8
4030G0n7k9K6j06J36q7l1J5J19j37O9L2l4L1n5n2J2L2PN9k4k2J56p8j0k7k1j27J1M1J0O8n7
3617f0P2P3l8j29J04O9o1j64J0J24r2J51j41P1P7r5K0l1M0Jn4r5J77k5j0j8K0L6P4L6J42k32
3216E2j8qr9P3p0P1n5N8mR7j24K2j20N4j34K25No6M1K4L7p9K2k9J3on1OJ65j62N2N4M7r4l9
$$ y = [-62, -24, 21, -157, 1, -117, 74, -22, -50, 112, 60, -47, -52, -147, -17, -93, 42, -29, -103, -23, -147, -34, -137, -11, -22, -31, -12, 33, -10, 4, -35, 14, 66, -56, 67, 29, 24, -11, 38, -81, -31, 163, -67, -18, 113, 53, 10, 51, -24, 8, -71, -63, -57, 26, -84, 22, -26, -51, -13, -5, 151, -32, 125, 15, -36, 11, -50, 144, -141, -44, -77, -77, 39, -2, -76, 6, 69, 3, 0, -49, -23, -9, 19, -27, 28, -2, 15, -30, -44, 8, 35, -145, -28, -43, -117, 30, 21, 65, 69, -15, -120, 51, -6, -73, 122, -125, 84, 72, 67, 29, -56, -130, -36, 74, 97, 130, -118, 32, -30, -23, -61, 43, 23, 79, -41, 7, 24, 23, -126, 62, 77, -93, 100, -89, 48, 87, -141, 31, -21, -3, -92, 82, -63, -12, -73, -75, 8, 39, -71, -34, 60, 83, 134, 120, 95, 73, -94, -18, 70, 13, -16, 10, -96, 40, -47, -78, -63, 56, -81, -12, 20, -14, 17, -38, -90, -78, -46, -39, 20, -4, -26, 130, 52, 42, 15, -6, -133, -122, -81, -71, -3, -60, 12, 85, 47, -82, 22, 91, 30, -134, -124, 0, -92, 59, -82, -11, 66, -29, -9, -40, 0, 1, -53, -148, 29, 4, -6, -24, -4, 32, 106, 142, 284, 52, 34, 26, -73, 0, -70, 1, -54, 4, 0, 97, -27, -5, -125, -71, -205, 20, 25, -41, 0, 24, 61, -18, 4, -25, -12, -18, -69, -63, 102, -60, -8, 46, 93, -1, -40]
2778d0j7L5Ol5k3K24k14R2P9j19j1k8P2K5j13P9o7L8M5l4j5n9m6J14M1nK0m3R8n9o8M9J22
2365A43j66m2R2r6QJ67k4po8J46j16o4O2J2j38J08j11R4P4o3rl8K7M2m6j02J35q1RR3K1p9
1964a7k4k4K6P5M1m2l5J45k15J52k22J64J33k31p8P8O1j49J25K11k09P1o3p2J52k9Q2j96R5
1601Enj07Q6j6R0r0J02p1J5k2j22M9J58j2j36J11p1MN6K4o7%N6K3Ko4J8P9j03q9O1M3M0j10
1175f3L9J38j49k4K9M5p7j2R6j69J2R1P3o5j5J14j34J69j03k2M6j23pJ66Jq2K3N0j67P5O5
787B0n7L6R8p9K0Ko7Q8j9k4J04m1r9lM4k5M6n7l8P5m9Ln9J05k54J50Q4J13l4j65o5L8K4L8
361d7R1j01Q4P6j48M0j0K8K9j17N3l4L9Q9p2m1L5j83m7J77J59j01L6j5m2L8k6N8l3Pj72J80
-39C0M2P2m3r8J0J8%O1Nn1p4J53p8q4J65m0j63K6l9P9j2mJ11M2j21KO6K4
$$ y = [-40, -57, -22, -16, -51, -74, 150, -64, 28, 107, -12, -23, -51, 21, 46, -67, 12, -55, -17, 28, -6, -21, -80, -126, -12, 29, 24, 44, 1, 99, 40, -28, 21, 143, -23, -65, 27, -69, -61, 106, 82, 75, 7, 153, 37, -27, 35, 47, -91, 17, -94, 0, 74, 11, 2, -36, -9, 33, -13, -115, 20, -61, -52, 41, 62, -17, -41, -65, -39, 36, 77, 35, 0, 145, -70, 82, -140, 24, 157, -74, -152, -74, -13, -162, -37, 174, -35, 36, -27, -99, 53, 24, 106, -90, 5, 0, -107, -21, -37, 53, -37, 65, -6, 9, -13, -135, -86, 72, 60, -76, 35, -36, -32, 24, 48, -19, -19, 37, 60, 62, -2, 16, 95, -8, -97, -36, 7, 47, -63, -24, 114, -35, -59, -30, 15, -62, -74, 22, -147, -135, -44, 29, -36, -51, 63, -71, 98, -5, -27, 19, -104, -111, 55, 56, -26, -3, 47, -120, -45, 20, -37, -1, 97, 18, 38, 40, -27, 61, 42, 18, 122, 81, -18, -21, 23, -2, 44, -13, -51, 24, -25, -22, -81, 24, -230, -80, 4, 117, 83, -82, -147, -109, -85, -47, 44, -57, 27, 103, -45, -5, -15, 13, 42, -75, -22, -56, -17, 72, 0, -41, -6, -189, -236, -59, 100, -1, 35, 20, -22, 16, -10, 48, 15, 22, -150, 30, 72, 144, 101, 3, 13, 31, 31, 92, 97, 46, -28, 125, 47, -37, 128, 88, -75, -49, -88, -9, -21, -25, 86, 128, 7, 9, 75, 99]
-390I9
##PAGE=	F1=3053.82
##FIRST=	23151.189942674980557,	6007.9998942000029274,	0.022060362622141838074
##DATA TABLE=	(F2++(Y..Y)), PROFILE
6008f6N7K4j43J18j20J75j20%J95k7j53pn6J25j10J11np6N6j26J10j25J75r0O6k3M5l2J1k1
5632c2P5N4j23P7l1jk4N4j75J07J41j71M7P7l5mJ1q2L5j03K2M2P4n6k9qkJ8M8J58j81J26l2
5219G7r1L4p2J61k24Q9j22N9J35k6j50J30N5q7qj9L6%L4mJ9o9P4q6j3Q3kr4O7n6p2J84k4K1
4794C9K8o3r7J52p8J0J51k97K38J4Jj7j21o0R2N8O3m0j80J58o2ok5R4l9P5j25L4k8K4j19J64
4393C8J6j29J54j60J10Q6k62J79m5Mk6J17j37P7q3J7KL7n0P7O5j3M6L0j09M3j95O2J20n7J8
4005C2j3r5J29j24j6M6J25j92P3N4j6L3o4o2K8J0RP6o5KJ09l9K1j2n3j47J9M4J2N3o3N3Q8
3592E5Pj40P0J04n1j72KJ45r6J26j38J03M1p6NoO2qn2j56K50o5j4MQqJ00M8J22j92q6Po7J01
3166C3m6O6j49J10M8K7r8L7j57N6r0J69J7j12R3L3L6r7Q1n7j3M0j05M0J22j75M3J00R5j08
$$ y = [-66, -9, 15, -128, -10, -130, 45, -75, -75, 120, 93, -60, -67, -123, 2, -108, 3, -2, -78, -22, -148, -38, -163, 12, -78, -12, -35, 10, -22, -11, -32, 43, 97, -26, 51, 20, 19, -5, 49, -126, -19, 122, -49, -2, 75, 40, 36, 47, -35, 0, -103, -81, -39, 35, -21, -50, -58, -60, -42, 6, 164, -17, 109, 77, -14, 20, -52, 109, -115, -26, -148, -89, 46, 20, -130, 0, 55, -32, -40, -59, -23, -23, 11, 7, 26, -43, 31, -55, -68, 15, 13, -81, -14, -70, -142, 42, 18, 39, 67, 4, -93, 59, -19, -9, 142, -155, 83, 97, 98, 81, -40, -100, -8, 50, 113, 73, -107, 51, -11, -17, -42, 52, 13, 88, -37, -3, -31, -7, -126, 38, 54, -75, 79, -81, 29, 115, -147, 32, -13, -9, -35, 82, -55, 22, -61, -44, -42, -5, -55, 22, 87, 74, 120, 150, 41, 84, -111, -49, 71, 14, 32, 19, -76, 53, -71, -87, -41, 84, -108, -35, 19, 3, 36, -28, -90, -62, -52, -43, 33, -32, -30, 79, 40, 61, 49, -4, -151, -132, -88, -76, -23, -86, -33, 55, 62, -78, -8, 96, 45, -127, -125, 20, -76, 50, -88, 15, 56, -20, -15, -21, 41, 33, -19, -175, 75, 10, -4, 0, 8, 0, 100, 148, 270, 78, -8, -1, -68, 33, -13, 53, -96, 14, 62, 89, -9, 28, -129, -73, -163, 6, 23, -89, 4, 37, 73, -24, 57, 0, -13, 27, -78, -38, 84, -91, -48, 52, 147, 39]
2790C9r4J8mjl4l1K61k54J21R9j68OnQ6k0o6Q9q9j6J09p0J0l4r0J27J5M0l1j7Q4l9n6O7N3
2365A05j03j18P7J8j0J53r2j3k5J43p8n2M9Mj83J71r7Q8L3p1L5j18L8R3k5p4Q5r2J3J19j1
1977F2p5n5nN9O3L4o3j6J48j81J32k38J28J70j98j09N3J06j86J31K13k56J52j16l7J26JO5
1626A08j65Q3j1j10O7l8R8q9J02l8k5o6n2J18P8j1j40P7J%M2j5o4K4Q4L0L0j20JO0p0j23J47
1213A3K1Pq1K0J04j06m0J0K8%o1M9j08K3R4P5r5OJ22j36J64q8k1K7j22l0K00k9o6pO0j45M6
800f6N7q1N8N9o4L7L8o4N6Q3q4J28r9j20kL9QN1l9m7J08j11J5nO3k37J28R4P6lj36r9O9J1
374g9M1L8o3R7N4j71O4OM7%o5Qj6K3Q5q4oQ1k45j6J55J29n7K5k5l2lrP9k7J5j74J56N3L2m3
-77G3j05O9J1k3J28o2m2j38K06r3m6J41p8j28J13p8N4k4j3O9R4j62J6R3L3
$$ y = [39, -55, -37, -41, -42, -76, -107, 154, -100, 21, 120, -48, -42, -47, 39, 19, -47, 42, -47, -63, 46, -24, -14, -48, -138, -11, 4, 44, 13, -4, 80, 41, -15, 52, 105, 2, -116, -39, -21, -31, 122, 30, 17, -8, 135, 57, 5, 54, 58, -125, 46, -51, 37, 70, -1, 34, -84, -46, 47, 22, -52, 33, -59, -46, 73, 62, -13, -68, -73, -14, 49, 83, 20, 4, 152, -29, 103, -135, -7, 163, -35, -144, -91, 15, -171, -40, 173, -83, 69, -47, -84, 42, 43, 108, -57, 26, 15, -95, -28, -66, 32, -57, 45, 7, -18, -84, -136, -18, 60, 49, -91, -14, -13, -13, 29, 14, -50, -26, 58, 88, 118, -2, -1, 59, -11, -134, 13, 34, 41, -40, -20, 84, -22, -62, -52, -24, -24, -85, -36, -144, -121, -27, 48, -47, -41, 81, -55, 109, 21, 0, 27, -95, -125, 75, 46, -20, -27, 33, -112, -66, -9, -90, -32, 27, -37, 0, 38, -26, 30, 113, 29, 157, 58, -62, -64, -25, -17, 34, -5, -52, 56, -55, -40, -45, 18, -219, -91, 3, 79, 76, -60, -159, -90, -79, -38, 0, -63, 34, 88, -83, -19, -13, 34, 34, -31, -23, -39, -16, 69, -15, -21, 60, -185, -201, -46, 83, 26, 51, 26, -6, -9, -18, 61, 34, 49, -125, 31, 84, 116, 73, -32, 37, 48, 25, 153, 91, 49, -89, 117, 24, -22, 119, 41, -87, 26, -52, 2, -22, -35, 34, 128, -34, -18, 75, 108]
-390A08
##PAGE=	F1=2959.46
##FIRST=	23151.189942674980557,	6007.9998942000029274,	0.30831331014633178711
##DATA TABLE=	(F2++(Y..Y)), PROFILE
6008e7P4J1j09P0j15J40j12QK00oj75Nk4R5q2L6N6n0J5q1Q0j24J84j60J33p6M8q%J3O6N9j04
5595A0Rj0Nk9O6k01J34J03j14M2J6rM3l2p9M6q4LM9N8%j16J3M2k6P6J42j73J09J8j22L6o0
5182c5J15j48P1j89J14J22j6j88J46K6o8j0NN5l1K5M4Lj04J18j36JR8j9JJ1r6o6K07m5j5N9
4781E5m6p3J21j01R1J03l03K45%NJ9j22p5J00PJ11j52o7J35m6j2k0Q7n4Q9j23K3p2L4m4J11
4393B6jo4R7j04N6J02k42J62n9J7L7M3j12Q4j03M7q1N4JR2M7m0K0O1j55R0j71K5J32o5O2j7
3992D1r9J11j39k8R0J04k22Q2P0QL0p2o2L8%OP8j10M1N0J1J1K1o5j40N0J8J2K6m6L7R0K5j34
3567f7M3J13k8j70j3J67r8R9j44J22K6o5%L1N4k1k6j90K57q2j1K2Pn8J07O0Q6j42j49M3k0
3178d7J27l4L7k00J27J03m3n6M3j66N3m1J03J7j29J34KL8q2J26L8n5oj76Q1O4j70N5J19J23
$$ y = [-57, 17, 28, -81, -11, -126, 14, -98, -90, 110, 104, -71, -66, -90, 5, -77, -41, 15, -35, -20, -101, -21, -145, 39, -121, 12, -64, -16, -24, -24, -11, 55, 114, 10, 19, 9, 14, -15, 51, -150, -16, 87, -27, 15, 31, 22, 65, 33, -46, 0, -84, -81, -32, 26, 26, -90, -77, -35, -61, 15, 157, -16, 93, 111, -11, 25, -35, 80, -68, 3, -186, -72, 50, 34, -154, -8, 18, -50, -60, -55, 0, -31, -6, 38, 41, -63, 55, -81, -80, 18, -1, 0, 11, -85, -151, 56, 11, -4, 55, 9, -64, 57, -44, 47, 150, -153, 92, 92, 97, 116, -6, -81, 19, 26, 137, -15, -82, 53, 7, -5, -25, 62, 8, 97, -26, -3, -75, -41, -85, 26, 25, -39, 58, -46, 10, 112, -130, 32, -27, -10, 27, 70, -42, 42, -61, -14, -95, -41, -40, 52, 99, 59, 79, 140, -15, 75, -96, -71, 61, -4, 58, 41, -58, 53, -86, -114, -24, 80, -142, -60, 10, 18, 48, -24, -86, -48, -48, -42, 36, -74, -33, 17, 28, 39, 60, -5, -145, -95, -77, -65, -39, -85, -48, 42, 67, -67, -24, 89, 61, -109, -122, 45, -53, 46, -98, 24, 50, -15, -15, 16, 70, 49, 23, -167, 90, 8, -3, 19, 26, -32, 75, 135, 221, 79, -70, -27, -47, 80, 46, 83, -117, 10, 113, 70, 14, 57, -109, -56, -97, 6, 23, -106, 28, 30, 68, -14, 112, 150, 95, 89, -87, -6, 58, -112, -57, 62, 185]
2803A85j19j21N1o3Kk9j5K53k69J54Q1j73J4J7Q8p3JR8j09p4J68q5K4j1j32R7J2P4n3J5N2
2415F0j8n5Q6k9pj98O2J09k0J36j17m3K6J03k6m2M2%k06K04q6Q6j1o7P7j81N3J39n3l1L3o9
2014d3KJ40n8n4o7LP5M9L4p7K3J03j18Q8k06N5J90j24j12K7J08j85J04K04k61J86j50KP6L4
1639D8N3r9N5lj05K4m7Q5q9Q5Mn8q6K0J41J9k0j36L3R9%J7n2p2N8J06L1M2j55PK3l7j28J98
1213F1j1j9m5k1R6p2o2J1qP2j22K0k1J7J02O0j26L8J14j14J29o8jj6q4l9J98n0l8n9Q1j27
812a04J5N6j05P4L3n0L9Q3n5K9J67j26R4j49q6k7M6M7M3j3o5J15j40L5J7K6j78R1J00J6M9
424G7j14j03Q6k6N7j5k2R0M6j76O7J0N4j8ok2PMO1j10M8J39k79j4J39P1J0Jk7pn0MQ7j5L6
-14I0j64J09M8j1k8j26J35Kn2J69p4m2k05K55j18J4R9j01p6J70r0J1l5qK9J05j65K0Q5L7
$$ y = [185, 66, -55, -4, -67, -65, -94, -109, 144, -125, 29, 110, -63, -49, -32, 56, -17, -16, 82, -27, -101, 67, -18, 6, -5, -137, -40, -28, 46, -7, 8, 60, 42, -13, 73, 44, 37, -161, -99, 10, -10, 126, 9, -34, -8, 95, 69, 27, 69, 69, -137, 67, -19, 67, 56, -11, 66, -115, -62, 77, 24, -7, 26, -43, -41, 99, 41, -13, -80, -77, -2, 47, 81, 4, 27, 130, 12, 100, -106, -51, 139, 15, -97, -70, 38, -147, -43, 161, -100, 86, -64, -62, 14, 48, 101, 2, 57, 54, -51, -27, -74, 11, -78, 7, 11, -47, -133, -113, 28, 47, 27, -109, -76, 23, 23, 40, -12, -84, -26, 80, 111, 153, -2, 5, 28, -9, -137, 61, 50, 31, -14, -35, 61, -11, -73, -62, -70, 2, -120, -100, -121, -104, -2, 58, -68, -30, 84, -30, 99, 31, 30, 14, -70, -109, 89, 39, 1, -58, 23, -104, -89, -33, -138, -64, -31, -81, -42, 41, -14, 15, 182, 56, 150, 1, -85, -112, -66, -19, 24, 11, -54, 61, -79, -44, -27, -1, -179, -88, 12, 28, 77, -37, -140, -54, -80, -23, -38, -60, 30, 76, -100, -33, -23, 31, 13, 7, -15, -8, -4, 57, -53, -5, 134, -145, -159, -20, 51, 61, 62, 35, 28, -22, -18, 69, 54, 90, -74, 35, 83, 72, 44, -82, 53, 55, 3, 172, 98, 56, -149, 106, -12, 2, 101, 0, -76, 94, 4, 15, -20, -28, 1, 106, -59, -39, 46, 83]
-390H3
##PAGE=	F1=2865.11
##FIRST=	23151.189942674980557,	6007.9998942000029274,	0.29999691247940063477
##DATA TABLE=	(F2++(Y..Y)), PROFILE
6008b9O7J5q4L1j11J01q1j1J89J0j55Qj6N8mn7R8j4l3NK0r1J40j99J81j16M8J6k7N4K4Q0p3
5595D4p6L6J7n6P1j81J23Q5o1K9n0J9Q1o8o2N1k3m6M7L1K0j12OP8p0Q7J23j76J06L0j32N5
5194B6m1P8p3M7k10J44P2rj64J07j7j5%K1P4p2jQ2K2j26J29j68J3J02l4Q2l1j16o2J95n5m9
4794d9Q8m6l2Q0j17J50P4k67K29m7KN2q2j23J25k2J43k57M2R6j9j6k2R0n8P8j09K6r9L9L8
4405a3M4k5j6N5m4pP7j71J40r3M9O9j7p1P0j16P6j37P5K3Q8M5n2k1P6j63J13j14k3J21o9Q0
4005D9Rr5Q2j31o8J35O8k21R5P0L8K7q6n5M5J3lO0j42Q3oO1k6M3o0j03R5l2J8qj4L5P2J1j09
3567e0K9Q1Nj46k5J74j00P4j51J18M1o4NO0L4l8Lj82K05o6j0M3Kj00J01P3L7r6j77P9K6J43
3166A28l7mj98J13J35q3j6M1j50M6j0M0K2j14J51m9N0m5J45K65j18j54k46J14K5j72Q8J05
$$ y = [-29, 38, 53, -31, 0, -111, -10, -91, -102, 87, 97, -58, -50, -66, -8, -12, -69, 29, 15, -18, -13, 7, -84, 56, -143, 38, -78, -30, -14, -41, 13, 37, 117, 44, -32, 4, 21, -35, 36, -145, -22, 63, 2, 31, -19, 0, 81, 13, -49, 2, -21, -67, -20, 11, 31, -81, -75, 3, -67, 20, 143, -33, 73, 103, -29, 26, -15, 63, -10, 37, -173, -29, 43, 34, -130, -23, -40, -55, -55, -34, 40, -32, -33, 49, 71, -55, 74, -94, -81, 21, -13, 69, 38, -78, -140, 55, 0, -49, 39, -7, -39, 41, -76, 74, 148, -119, 110, 63, 65, 117, 35, -88, 37, 15, 158, -99, -57, 39, 20, 4, -18, 72, 14, 92, -17, 9, -90, -51, -13, 31, 6, -10, 45, 1, -6, 71, -100, 40, -53, -4, 65, 48, -23, 47, -69, 7, -130, -55, -32, 56, 101, 49, 28, 104, -59, 54, -60, -83, 38, -31, 49, 58, -37, 45, -86, -154, -19, 49, -172, -77, -7, 31, 58, -28, -83, -38, -25, -28, 32, -110, -27, -33, 28, 2, 45, -15, -118, -23, -55, -37, -45, -59, -24, 48, 59, -50, -21, 60, 65, -81, -106, 68, -32, 42, -109, 9, 50, -14, -9, 51, 85, 47, 50, -132, 73, 7, -3, 40, 42, -58, 43, 116, 153, 57, -120, -41, -15, 128, 91, 87, -111, 2, 137, 54, 38, 79, -71, -25, -35, 5, 27, -87, 64, 15, 65, 20, 165, 430, 312, 158, -88, 26, 51, -121, -33, 72]
2815G2J35j27j22P3j23J8k5K4K01k64J75N3j34nL3P5j08O3J06j27j12J99p2K4Oj66M1L6R2
2452D1o4O9NJo4R0r2P8k36L3J47k1J22r5p9P8K1L6m6M7Rj99J88p2R2m9n6J10k03N2J64j03
2052DmMj9j8J43j14j6n3JQ4K1M8r4P2K8m7L2j34l3J92m0r1J6O5j37M5J88k26J50j31K3J6N7
1639C2M2j2L0J6r9k5m5O3r9O2L5n9q3N8J22ol2j16kJ89jm0o1q2Q8J16L0L6j61L2j3pj19J95
1213H4k3m7qo9J06m8p0J9n2J15j66J7M6OJ06L5j39O3J00p3P5n4J4n0k6j3J43o1Nj20J05j09
812h9j0M8j22Q3L9m8L5J19m7K2J99j44K3j76j2o9N6R0QK3p6Q4j27M0J1J2r9N6J01m4J01j08
412b1q3P3n2P7o1RP6N5j62M8qN9j7L7j9K3k3K3j23R1J73k63k5J22RO8j6l4L1r8J9P6KN6j31
-27iN0K0k9qj50J78kp9J60k6m9k45K66j20P0L5q6j1J83q8k7l6oLQ0j30NM6L6
$$ y = [72, 207, 80, -42, 31, -92, -74, -99, -75, 126, -138, 37, 90, -44, -49, -16, 59, -49, 14, 120, -7, -119, 80, 8, 32, 38, -128, -87, -51, 41, -23, 46, 51, 52, -12, 78, -14, 64, -172, -139, 8, -13, 109, 14, -65, 13, 34, 70, 24, 71, 80, -119, 69, -3, 89, 40, -16, 94, -109, -57, 107, 4, 0, 4, -15, -33, 110, -4, -20, -73, -72, 12, 33, 81, -13, 59, 87, 40, 72, -62, -95, 97, 57, -34, -18, 47, -90, -45, 143, -83, 67, -64, -41, -25, 32, 74, 62, 92, 108, 9, -16, -61, 2, -97, -35, 0, -59, -142, -84, 38, 32, 0, -116, -118, 71, 70, 30, -31, -113, -25, 91, 121, 157, -4, 28, 15, 8, -111, 84, 61, 14, 6, -63, 43, -5, -75, -56, -108, 7, -159, -142, -96, -90, 16, 51, -88, -25, 75, 2, 77, 23, 37, -13, -39, -52, 91, 30, 35, -85, 20, -89, -99, -51, -173, -90, -51, -99, -64, 55, 8, 30, 229, 85, 108, -68, -80, -149, -93, -3, 5, 28, -48, 36, -91, -51, -40, -28, -127, -71, 30, -14, 87, -21, -104, -31, -83, -6, -67, -58, 18, 73, -89, -41, -49, 10, -7, 30, 11, 34, 11, 34, -89, 2, 175, -88, -113, 9, 18, 86, 70, 36, 67, -31, -12, 64, 66, 122, -9, 41, 61, 32, 24, -126, 52, 50, -29, 131, 105, 56, -189, 77, -43, 27, 62, -24, -35, 148, 60, 33, -3, -9, -6, 74, -56, -51, -5, 31]
-390C1
##PAGE=	F1=2770.76
##FIRST=	23151.189942674980557,	6007.9998942000029274,	0.056839708238840103149
##DATA TABLE=	(F2++(Y..Y)), PROFILE
6008HL3L6p4J4j13P5n0m2J71K4r0k3l2K7R3j26J14J3p7J01m6l6N4j98K08j25L4K7o0Q7k9J09
5607A07m5j60J10L7j01N9j20Q6P7j1kj13N5R3p9l9M2N9j06N4Nj3k9k1Q8r0Q4J04j95J08J0
5219E4j13Q0k4N8j3K3j86J44Kjq8K0o5N1K4K6Q1j03k9J03O1j32J08j71J6J02n7J21m5r6o9
4831a18J57n0p4J09o2J8L6j20J71P5k10J86r2oO2oj89J53j6J38l04J02O3jj8k3J06n4L0q3
4456b0N1j07N2Q5j1m8j1M8Lo2L3p9J29j39P8O3m8j6L9j16R5j55Q8J4Q1N2n2o1P6j44J19o2
4055b5n9R8o2O2M9p2M8j10j17J65L1j87R6N1P5K6j09m6O0M0j6K8j44J06m5R8o1K8m2m4J24
3667D6q2L6l9K6L5M5l1o4K7J3M3j02k2J54j06N5j46Q9P0o7K1O7K9o1Rj28J27l6j5P2j7j26
3266g8J00P3no6j59Q8N4J48m6l8j54Q0J35q5OL9j22M0j1jL3p2J36r2Q0j5J38N35j80l40k94
$$ y = [8, 41, 77, 3, 17, -96, -21, -71, -113, 58, 82, -8, -31, -63, -36, 57, -69, 45, 58, -19, 82, 36, 0, 54, -144, 64, -61, -27, 0, -60, 27, -2, 107, 62, -98, 12, 49, -52, 7, -113, -27, 50, 39, 37, -76, -21, 72, -7, -46, -4, 55, -51, 3, 8, -5, -34, -55, 33, -57, 27, 131, -64, 44, 54, -59, 21, -3, 55, 42, 65, -121, 23, 25, 24, -64, -44, -109, -58, -34, -8, 73, -30, -59, 44, 105, -27, 81, -90, -74, 28, -29, 92, 47, -49, -118, 39, -11, -85, 24, -38, -20, 16, -104, 67, 142, -68, 118, 26, 20, 82, 76, -113, 40, 24, 162, -142, -40, 23, 22, 4, -19, 87, 33, 63, -20, 31, -76, -24, 61, 50, 2, -9, 39, 42, -20, 13, -66, 63, -76, 2, 65, 17, 1, 40, -76, 19, -136, -48, -34, 47, 99, 47, -14, 62, -82, 37, -25, -84, 14, -48, 14, 63, -9, 39, -71, -188, -23, 8, -179, -83, -32, 43, 69, -40, -86, -26, 14, -2, 26, -118, -12, -57, 41, -20, 8, -34, -78, 46, -36, 0, -39, -13, 22, 67, 36, -28, -1, 12, 55, -47, -69, 85, -21, 34, -112, -23, 47, -20, 1, 68, 97, 36, 45, -83, 44, 8, -7, 65, 48, -78, 22, 95, 90, 24, -135, -47, 7, 155, 109, 71, -83, -3, 132, 47, 53, 92, -30, 10, -1, -2, 31, -41, 95, 3, 83, 68, 206, 741, 561, 221, -73]
2878g3J24K1j92J30O6J45j41r8P6j65M4k3O6J32k48J68M7p6n0M0N4j13R9J11j43j15J88l2
2527D2J3J2j80k0Q1R2q4J36l5J6p8P0j16J22k07k6J35j5J15m9r4J29r8R6n5N5L1j66J33n5
2152@J13q3m6J19j72K5J64j37klM2m4J25j62L0k5oJ03l1Q0j19J17n0Rj8m7j06J79K3o5K2M
1751C9n4l0J67j69N8n8J5l5O7L0P3J8L2q7o2l8M1j17M3M6k9o2M6Q8pl1q2k3K39j0j19l7p5
1338a23R5J16K9J2j32N1k3J5j13J49nq2K6j03J16l8n1K3r3J24j68K7O5KJ06Qj33P3Q7k3J4
950E1m9Mm7K9M5M4n8M4j62J22q2k6J5j16Q7P3p1M7J29m1L4J63j34l9j89P3j11N8J38n4N8o0
549b5K3q4J4mK5k6L2J00q4J30j14n3K7l6Q6q8J1O6P3j29K2m4O4qN5K3K4o0j7j00R6J63k04
136d2k6R8k3P9j6m3O2j29L8L8K2O7p5kk8rRj64J75Rj03J03N2m8k43K21o9R1l8l4M5J69q6m8
$$ y = [-73, 51, 72, -120, 10, 76, 221, 80, -18, 58, -107, -63, -86, -20, 112, -136, 32, 79, 3, -47, -7, 47, -66, 33, 144, 1, -114, 74, 42, 55, 67, -113, -133, -52, 40, -44, 92, 57, 73, -5, 65, -51, 71, -136, -162, -27, -42, 73, 24, -70, 59, -39, 57, 2, 57, 88, -78, 55, 0, 113, 30, -16, 103, -69, -44, 120, -17, -19, -22, 20, -24, 101, -61, -31, -56, -62, 41, 10, 90, -29, 88, 38, 47, 29, -18, -124, 55, 78, 13, 35, 39, -15, -45, 122, -47, 11, -47, -32, -67, 0, 30, 103, 121, 153, 66, 4, -34, 7, -110, -67, -21, -50, -112, -66, 22, 15, -16, -98, -121, 118, 108, -11, -48, -123, -28, 88, 117, 129, -3, 48, 25, 40, -73, 76, 71, -11, 15, -88, 28, -10, -61, -38, -131, -7, -175, -148, -83, -81, 25, 33, -100, -27, 60, 37, 51, 2, 6, -41, -12, 33, 77, 19, 63, -99, 23, -59, -85, -70, -186, -99, -26, -97, -50, 79, 38, 72, 235, 101, 62, -127, -54, -165, -107, 31, -23, 35, -25, -2, -86, -72, -76, -51, -77, -45, 55, -29, 101, -13, -66, -39, -75, 11, -77, -66, 0, 73, -56, -34, -78, -14, -22, 33, 56, 80, 20, 3, -97, -1, 162, -42, -68, 30, 7, 86, 70, 27, 89, -40, -2, 36, 58, 125, 50, 48, 20, 11, 20, -144, 31, 40, -63, 40, 92, 44, -199, 22, -47, 44, 6, -28, 17, 186, 100, 52]
-290E2k0j7j3M0p4k6%L7
$$ y = [52, 32, 15, 2, 42, -32, -58, -58, -21]
-390b1
##PAGE=	F1=2676.4
##FIRST=	23151.189942674980557,	6007.9998942000029274,	-0.075601100921630859375
##DATA TABLE=	(F2++(Y..Y)), PROFILE
6008D0j4O1p6K2j22P0l8o3J49M0lr0n4J3J66j39R8K4j10J74q8K5n1j60K12j04%K3p2Q8o6J28
5607H3k6k18J98N9j54L5l9M1O4L3m7j60R6P3o0k5K3J36j51P4j7p8Q3m8O5p3P7P2k14R8j9o7
5207h6R3j2M6L3Lj38J30o6MJ3q4j07J02N4K4O9j04m5J05Q9j14P1j56J4J04r3J05k3l8r5J25
4819B3m1q9J22q4O3Kj12J54R9j60J22j06pL9Q6k50J66K0Q9k59R0N1pj8j6J25l8m9m8Q3j00
4430e0Q2P8l4o9m7O9L1r0LjJ28j83R1K9n4M1Nj04J02j39P8j2Q4N7m1r2P1j20J21m3o1P4m4
4017d0K1P8l5K0r1j57J71Mj21P2K6J06K1j31l4Q0O3k2rj10R4n5J05p0k5k1K4J18j17P4o2O1
3617C8L2J9q6rL5o5P6n8PJ02j13M4j20M0Q5o2M8N1N1r5om7O1k0k3J05n1j34J10O3k1p0r6N6
3191e3O2J41n0n1r5L4J20o1J0L8r5L7l6j6N0k6R8j07J27k0J10P20k07m70l02R7M3k15J75J6
$$ y = [40, 26, 87, 11, 33, -89, -19, -57, -120, 29, 69, 66, -24, -78, -65, 101, -38, 60, 84, -26, 148, 60, 85, 34, -126, 86, -18, -18, 5, -67, 21, -45, 83, 57, -161, 37, 96, -58, -23, -62, -21, 43, 76, 29, -131, -35, 38, -22, -47, -24, 112, -39, 35, 18, -60, 23, -25, 40, -33, 44, 116, -98, 0, -19, -86, 7, -5, 41, 74, 77, -61, 69, 3, 7, 20, -64, -171, -69, -15, 9, 78, -26, -71, 34, 123, 9, 80, -76, -62, 42, -51, 54, 31, -7, -102, 23, -18, -107, 15, -69, -6, -4, -116, 38, 137, -23, 99, -7, -14, 25, 111, -139, 27, 47, 136, -123, -33, 18, 11, -7, -23, 102, 64, 15, -33, 50, -50, 32, 110, 76, 7, -40, 29, 60, -30, -27, -28, 100, -83, 8, 37, -17, 24, 29, -75, 27, -112, -34, -46, 38, 95, 54, -38, 33, -87, 34, -9, -70, 4, -40, -19, 59, 24, 44, -47, -204, -33, -29, -150, -78, -52, 54, 75, -56, -90, -10, 53, 31, 22, -88, 6, -49, 56, -14, -39, -60, -36, 82, -35, 39, -23, 38, 70, 89, 3, -6, 29, -36, 40, -18, -11, 91, -22, 22, -98, -58, 27, -35, 13, 64, 115, 20, 14, -33, 28, 8, -15, 90, 39, -95, 15, 78, 57, -13, -109, -53, 9, 150, 100, 49, -46, -12, 108, 47, 57, 95, 0, 37, 1, -15, 35, 9, 107, 0, 127, 107, 217, 937, 730, 260, -42, 55, 98, -117, 58, 74]
2815G4J49j52o1N9j75O9j6Q2P7k27J35P0k2j07M0L5r6J02J07j50q5J33J9QLj61p1J27Q1j19
2440g2J95n0K0q5K7r5J17j21j09R9j1J15j4o7J72k30J44n5N9N7j28O9l6J41j12m4J00j01k2
2077c7J43j36j7JR7p1Q7j75O7Lj6J28q7J13j40J45j05M2n8K4j37J54N4n7L8m2L3r7J48j13
1701a1m8L5qo8O1K1J35J7L5o8o9l4K4j29L3L0J2k6j2P3nj2m2l4K43k8j97Om6P9J05K7j8q0
1275AN1kK2j10Q0L6j21N3j10J11l8j2K6j19J01j23L3M5PJ00j0j23P5P1K7m2m5l3pN6J13o9
875D4l7O2j66J21l5l9m0p9Q8J02j10Q1J10l3N1P8r5o6j95J34j34M9J87j28P1j0n2l1l3mN1
487e8J8K3R8r2J22j14l0l3K4P1r5j1O0P9p7Lq0N7LN7Q4Qj01m7m0O2J17j37%O6lL1qm9P2j29
36d9O1k8M8O0ml3q3L6K2j53J23L0j16K7J11k6k06J31L4O8j02L0P1J52q2o1J8m3k4lj5n7k8
$$ y = [74, 223, 71, 10, 69, -106, -37, -53, 29, 106, -121, 14, 84, 62, -45, -5, 30, -66, 36, 143, -7, -92, 41, 60, 68, 71, -90, -161, -34, 47, -72, 123, 73, 93, 8, 35, -60, 57, -64, -173, -74, -85, 30, 16, -51, 121, -109, 35, -20, 39, 96, -32, 37, 1, 142, 30, -14, 86, -15, -37, 106, -30, -47, -46, 51, -20, 67, -108, -41, -38, -54, 74, -13, 100, -40, 105, 0, 42, -16, 8, -129, 25, 79, 22, 60, 18, 51, -46, 102, -11, -59, -24, -32, -100, -39, -18, 117, 134, 169, 101, 32, -2, 22, -107, -74, -44, -32, -58, -70, 3, -2, -14, -56, -90, 153, 125, -72, -66, -112, -33, 72, 99, 81, 1, 52, 50, 72, -38, 42, 78, -43, 10, -100, 11, -27, -39, -13, -132, -31, -154, -121, -76, -69, 31, 21, -102, -27, 44, 71, 29, -16, -49, -56, 0, 113, 44, 7, 69, -97, 24, -11, -50, -90, -169, -81, 21, -89, -8, 102, 69, 120, 198, 103, 37, -158, -24, -158, -109, 78, -50, 21, 11, -41, -72, -105, -109, -58, -40, -17, 81, -11, 111, -3, -33, -66, -42, 29, -66, -77, -17, 62, -15, -12, -92, -35, -32, 25, 109, 117, 16, -31, -71, -9, 108, -29, -29, 37, 34, 65, 57, 8, 80, -49, 12, -16, 32, 92, 88, 55, -28, 8, 30, -123, 0, 30, -86, -59, 52, 26, -180, -49, -15, 53, -49, -19, 52, 204, 122, 61, 79, 36, 12, 9, -6, -63, -91]
-377i1M2
$$ y = [-91, -49]
-390d9
##PAGE=	F1=2582.05
##FIRST=	23151.189942674980557,	6007.9998942000029274,	-0.088374853134155273438
##DATA TABLE=	(F2++(Y..Y)), PROFILE
6008E3m6P1p8L9j29P9m4n9J21N6P4j69o0J0J89r4N5K5j34K03p9O8j50r4J90o6m4J1n3N5o7
5620f7J14j5k29K69P1j93OL5QM5N8r0j88J41L0l0k8J2J78j56Q7k5j34J62n7K3k8O7K2k06O2
5232e6m4NQ2lK6O8mr0J13j08kJ08j75j31J27P7J9L7p1m3R5Q4o6L1j44K3J01j35M5L1K9j33
4831a04J26l7j08J33q8P7oj01J19J22j33N3q9J1JJ59k82J47P4J3j41K1O3l7j6kJ38j6j34j3
4456e0J04r1J29K4j9q9q8R1M0r0J1L7J28k14Q9pn1P9j6q0J03j12M3l4J01N1k5j05O7j10J25
4067D1n5k5N7k5j7P6LRr0j74J57j0m1K9J0J21Mj40j5Q9O6lm7n1N2l9P8n3q7nQ1P5j28J21o5
3629aQ3K4%j36M3M6j25R7l4O1K6j12L7q1j2P1m2P6K9Q8j38k9M0K7l8k1J27q9j25J22N5nj12
3216d8j1kN3J20m0m0m2k3J11l5J3K8p3L4n3j9O5QN3r9J80o3P3P21j73m75k67L5O4k12K12l1
$$ y = [53, 7, 78, 0, 39, -90, -11, -55, -114, 7, 63, 137, -32, -92, -82, 107, 13, 68, 93, -41, 162, 83, 151, 1, -93, 97, 31, -13, -2, -55, 0, -67, 47, 32, -197, 72, 143, -50, -44, -9, -1, 44, 102, 12, -176, -35, -5, -35, -63, -51, 127, -29, 58, 33, -101, 61, 4, 27, -1, 66, 88, -118, -56, -100, -95, -13, -16, 10, 78, 74, -16, 97, -11, -13, 95, -80, -211, -84, -7, 12, 49, -22, -65, 30, 114, 48, 79, -65, -42, 59, -76, -31, 0, 29, -104, 22, -15, -123, 10, -78, -1, -7, -108, 11, 133, 0, 53, -36, -25, -24, 135, -147, 0, 74, 87, -54, -33, 30, -7, -23, -25, 113, 97, -37, -50, 54, -37, 92, 116, 97, 8, -80, 11, 51, -39, -28, 9, 137, -77, 12, 5, -46, 33, 17, -63, 40, -72, -29, -63, 38, 89, 64, -41, 26, -84, 41, -14, -39, 18, -7, -24, 52, 55, 64, -26, -200, -43, -53, -94, -65, -55, 66, 70, -70, -85, 4, 70, 67, 20, -31, 21, -18, 60, 7, -80, -85, -4, 71, -57, 64, -1, 82, 106, 106, -30, 13, 59, -66, 31, -3, 58, 84, -28, 9, -72, -84, -13, -55, 21, 50, 138, 0, -29, 11, 38, 0, -21, 106, 17, -108, 14, 69, 64, -48, -59, -61, -8, 112, 72, 32, -10, -33, 78, 43, 56, 84, 11, 45, -8, -27, 38, 46, 99, 0, 180, 117, 190, 911, 738, 263, -4, 31, 95, -117, 95, 64]
2815F4J41j47j8K0j46Q0JN9M8j94Q6J09%j38L5K2p4Q0Q8j47l1N4N6J6qj16j08J61O5j56K22
2427A24l1Qp9l0m1P5j4j85O5j7J21pkJ92l34J65l6N6P8j07K8k9J67j35m3N5k2n9J07j01l3
2039f4NJ18q3L6j38Q3J4k6J42j21J33j40J46j24N3q6O5j20J15O2q0N6n4R7j38J36p9j23J06
1676ik4q2M6J1J68J5K5m4m4l6J6j31L6jL2J7q1Q7j6K1j2m7K19m9k45M3lM9Q8K4m0k3K8M1J0
1238H9j05J5Q3j51O5r5R5n0K8L7j26O6n2K3J3J5Q8rj26Q4M3P4q9m0p1M5M0J63j52JM6j25R9
825B1K5n5r5j8Q6R3j40J23P0j7N9j5m1n0k07J57j27K6K30j86N4N2j20J9p5J6P1K6J7J00p2
437B7R0j01j0r4J03L0q3m4M9O9k2Lr9L1J5N5J35j9j39n9L4K3N6j01M7L7O2n5j2m1O0r5Q6j17
11g9P9L9O0m2j31Q0L7j16M5M4j07l5J24J8j54K6J47K3j39P2N8J49p1p1O2o9l4m0L2p9k1M9
$$ y = [64, 205, 58, 40, 60, -86, -6, -5, 54, 102, -92, -6, 103, 103, -35, 0, 22, -52, 28, 116, -31, -62, -8, 48, 64, 56, -60, -168, -7, 58, -98, 124, 93, 101, 22, -8, -49, 26, 12, -173, -108, -125, -4, -11, -13, 179, -155, 10, -26, 30, 108, 1, 29, 0, 167, 32, -11, 44, 22, -37, 70, -31, -64, -59, 59, -24, 12, -126, -43, -29, -55, 87, -34, 99, -41, 105, -19, 34, -52, 13, -107, 8, 70, -10, 46, -8, 89, -49, 87, 8, -115, -9, -33, -115, -69, -58, 110, 125, 150, 106, 62, 26, 42, -89, -53, -54, -22, -5, -86, 1, -15, 6, -6, -53, 166, 117, -128, -85, -88, -39, 49, 73, 33, 10, 38, 79, 89, -16, -1, 82, -69, -4, -99, -4, -54, -26, 11, -115, -49, -101, -78, -65, -50, 38, 29, -97, -13, 30, 104, 15, -25, -96, -51, -11, 152, 0, 1, 47, -78, 21, 46, -9, -104, -122, -36, 57, -83, 40, 110, 93, 152, 137, 96, 46, -161, -4, -131, -105, 125, -61, -7, 45, -75, -56, -131, -115, -44, -18, -1, 99, 27, 117, 16, 6, -88, 15, 45, -38, -82, -33, 36, 14, 17, -82, -51, -36, 19, 154, 135, -4, -63, -29, -6, 50, -51, -4, 33, 95, 40, 28, -13, 47, -48, 38, -79, 0, 39, 99, 57, -74, 6, 43, -73, -28, 16, -91, -126, -2, 16, -138, -112, 35, 58, -81, -9, 49, 198, 127, 56, 118, 49, 15, -25, 7, -72, -93, -44]
-390d4
##PAGE=	F1=2487.69
##FIRST=	23151.189942674980557,	6007.9998942000029274,	0.0025462207850068807602
##DATA TABLE=	(F2++(Y..Y)), PROFILE
6008D1m4N8p3N2j25Q9n0l9Q5O8J11k21l8J3J55j5mL0j57J97k9Q1k16k4J50l0q0Jj0Kl5N7K
5595Bj89K93O1k00j2P5rL5N0j11j95J84j8j6m5K2J71j16P7k5j41J69l2k5K5N6m4j52Ln8Q5
5207h0M6QnQ9Kn3J02j25k3J77k20j37J26Q4J8mk1l2P9M8KLj51M9Q4j63l0R2Q5j71J57l6j37
4794a37J47o9N0K0r9R3J24j32Ln7M5m0J92k72J03J24n6%p2Q7p7j2J2J40Kk02K4R4q6J79m7
4405H1J9j05q9Q4L3o9N4L8J13k22Q2l0m6Q0j3n4J00r3kl6J21L1lj07P2j18J27q1L6M5j2l0
4005FL4L2K3j16j65J36pK1j1J3J13l0j25J2P7M2M3q3J6qlK8l0j18kJ16J8j17J49m8R0J8j0
3592A14j67Q5M8j48R9m0J31n8r5K9m0n1K7JQ5J7J20j85l9J12J4q2PJ23j16j01J21O2L1j81
3216g7O9n5L2Q6j9j2j1p9J17k7L0Qm7J5m0k2P4J2L3q7K17j22M4N37r1l57k02l1N7j75K40p3
$$ y = [41, -3, 55, -18, 34, -91, -2, -52, -91, -6, 62, 173, -48, -86, -73, 82, 67, 63, 93, -64, 133, 104, 185, -31, -55, 95, 65, -15, -14, -24, -22, -57, 0, 2, -187, 106, 167, -33, -45, 30, 21, 56, 106, -5, -200, -16, -34, -50, -95, -73, 98, -18, 59, 34, -107, 62, 30, 5, 30, 86, 42, -110, -107, -165, -80, -34, -26, -31, 58, 60, 7, 109, -16, -39, 138, -82, -219, -93, -9, 9, 5, -16, -48, 31, 79, 81, 84, -67, -18, 66, -97, -127, -35, 50, -121, 36, 0, -137, 10, -59, -9, 11, -88, 5, 129, -3, 0, -57, -12, -52, 140, -132, -29, 95, 39, 39, -33, 54, -23, -35, -23, 117, 119, -83, -59, 35, -51, 128, 81, 100, -5, -94, -10, 23, -46, 8, 46, 159, -63, 19, -11, -57, 23, 10, -44, 56, -37, -39, -75, 46, 77, 74, -33, 39, -79, 48, -33, 3, 48, 36, 6, 40, 72, 95, -21, -186, -50, -57, -36, -47, -34, 79, 49, -76, -64, 13, 55, 98, 15, 31, 23, 20, 48, 18, -100, -102, 14, 32, -85, 64, 16, 106, 124, 114, -53, 32, 80, -68, 31, -9, 122, 64, -31, -2, -42, -93, -66, -65, 20, 37, 157, -28, -67, 45, 59, -23, -16, 107, -9, -110, 11, 73, 104, -77, -8, -63, -31, 55, 36, 24, 13, -66, 51, 24, 54, 62, 15, 30, -10, -32, 42, 54, 87, 0, 217, 95, 139, 676, 585, 228, 26, -5, 52, -123, 117, 44]
2815D4J16j15K2l4q1P0K6kM3j39L5J33j2j17K3J7o4N8N0j35K5j4N6L8ro0j29J75M5j74K05
2427I6J1j2o0r5K7J8P9k20M3l1J21j2O6J80l70J53nM4R1j12K4l9J82j54l4lL8o7P0n5l9PR2
2014C4p2j5o0Q3kl0J28j15J28j13J24j10N1j01P5p1P0N9j25O5l4J23j39J29p1j46J25j8q0
1651a08L4oJ71PJ0k3Nm5J6j26N6l4J2N9j31J19l6N0jo5J87o4k50O2L6K2O7K4m1J1jQ7k3q7
1225fl2J17j57N5p0Q2o9M8O1j17M0RmKJ3P4J4j44R9OJ17j25l3q6P6j4J82j72L5Mn6O8Q3p5
800B5j30M6P7M2j31J48K3PN5q1Nok22J42r0pK53k02J1R6j63O1r1M3P7JLJ10l5N8p9J4j42J64
374H2k9o4o2L1N4J8J0r5j0L9M5J54m6j64n3R0J5Kj10R1K7J37j31l6k0L5m0J03j98J03J9R1
-27H8l1j64R7N8o5k1L4p7n6R1P1j09n1K07j1j35O5J8J55n0p4R2q2m1o8O3r2J2N8
$$ y = [44, 160, 45, 67, 33, -48, 22, 48, 46, 89, -50, -15, 118, 106, -11, 12, 29, -35, 23, 73, -62, -37, -51, 5, 43, 34, -26, -155, 20, 65, -109, 96, 107, 95, 35, -60, -33, -15, 64, -156, -113, -144, -23, -35, 31, 211, -159, -6, -11, 33, 124, 12, 36, -3, 179, 25, -9, -12, 26, -41, 29, -26, -65, -58, 34, -38, -53, -113, -30, -32, -62, 66, -49, 79, -34, 90, -20, 31, -70, 5, -66, 4, 63, -62, 3, -31, 92, -47, 82, 11, -135, -10, -28, -108, -74, -80, 91, 98, 108, 85, 90, 45, 61, -65, -9, -43, -31, 28, -103, 16, -20, 30, 29, -36, 151, 87, -163, -101, -65, -43, 24, 48, 7, 18, 17, 104, 81, -6, -38, 79, -78, -23, -93, -11, -80, -32, 29, -88, -48, -39, -43, -41, -28, 46, 60, -84, 15, 21, 138, 13, -20, -106, -30, -44, 138, -34, 1, 5, -51, 17, 100, 25, -105, -59, 18, 60, -71, 77, 100, 107, 162, 81, 86, 80, -142, 0, -90, -97, 156, -46, -35, 61, -102, -41, -132, -89, -12, -11, -8, 102, 67, 125, 46, 60, -82, 82, 53, -11, -73, -42, 12, 30, 40, -55, -65, -26, 19, 173, 127, -37, -90, 0, 15, 17, -93, -2, 25, 162, 31, -5, -25, 10, -30, 73, -125, -22, -3, 88, 57, -107, -10, 48, -17, -38, -4, -81, -137, -46, 25, -84, -135, 72, 61, -74, -9, 9, 164, 114, 40, 132, 50, 9, -59, 4, -88, -76, -18]
-390a8
##PAGE=	F1=2393.34
##FIRST=	23151.189942674980557,	6007.9998942000029274,	0.21959531307220458984
##DATA TABLE=	(F2++(Y..Y)), PROFILE
6008A3j3L1n8M7r9Q4m0k1N1O7R6k14JJ9Q8N2n5M1j78J79K4O7k40L3J06j2r1OK6l7Ml2L8j10
5582a27K57K4j70pO5rM7Qj06j79K16n1m2n4M8J21m2L9k3r6J06K4o7P2M3j05o9n6n9J49jK2
5182b2m7R6J4k2R1j26n0K14k12j29J06Q0K2m5K6k7N8KP3j2j75Q5N0j59p9J25J16j88J84l0
4806A9j64J57l0j3P1j12R2J02j43j9k4P7o6J77k26N0J59r2J08j54J08j04rJ5J38Lk37N9O1
4443Cr1K13j09N9j05l3M1J1m1J12J1P9j97P7m0l0M3Nl6J02r6l6j0J26mK2j01Q9j39J24j03
4055e4R4L7oj4m0N0O0j56j40J18J4L7l1L9Q4p7q2M0M0%J07j15O7n9M4l2k5r6j2J28j7j02J38
3642C9k0Q3K3rj75J11L3j37Q5n9J87j29o0J6oo4k7O1N8J8J30k20k7J55kj18N8R5j29o7J03
3254FQ7O0k45J14p0QL9LJ7Kj20J28l8N5j5j1k5Nk8P8j6N7q9K19j69L8K63jj83j25o3K3j28
$$ y = [13, 0, 31, -27, 20, -79, 5, -35, -56, -5, 62, 158, -56, -55, -36, 52, 104, 49, 90, -88, 91, 115, 182, -58, -25, 81, 69, -22, -16, 10, -27, -23, -55, -17, -127, 130, 154, -16, -23, 42, 33, 80, 88, -18, -197, 19, -32, -74, -128, -80, 41, -1, 38, 15, -81, 25, 49, -18, 54, 97, -8, -77, -133, -192, -43, -44, -22, -69, 27, 41, 19, 110, -16, -66, 148, -64, -193, -87, -7, 15, -30, -4, -31, 27, 29, 102, 90, -85, 0, 50, -109, -188, -63, 53, -135, 49, 19, -145, 12, -18, -31, 40, -72, 20, 122, -21, -40, -64, 13, -53, 124, -102, -52, 107, 15, 123, -31, 77, -27, -36, -21, 117, 120, -117, -58, 3, -88, 125, 16, 75, -30, -63, -22, -11, -52, 60, 71, 150, -47, 30, -10, -40, 3, 8, -28, 74, -22, -58, -68, 58, 54, 76, -25, 64, -75, 49, -54, 40, 77, 71, 57, 17, 67, 127, -29, -169, -51, -37, 0, -31, 8, 92, 15, -67, -27, 13, 13, 120, 5, 72, 13, 57, 25, 0, -96, -108, 20, 3, -99, 39, 19, 102, 125, 116, -59, 52, 85, -52, 33, -26, 161, 32, -28, -12, -18, -82, -109, -48, 10, 28, 158, -62, -89, 66, 64, -54, 4, 99, -30, -97, 6, 93, 153, -92, 22, -48, -40, -1, 2, 19, 21, -99, 29, -9, 46, 31, 20, -5, 0, -28, 50, 34, 91, 2, 221, 52, 90, 353, 352, 169, 44, -19, 4, -124]
2840a24K51j15Q0o0N0r0QM8M4q0N2o5j0J24m6m5J4J2p1M8J1j18N5m3K2O1Pj9j31J73J8j58
2440i7J57M1j5m1j53Q7l5J34j99L1m8J09LR5J27l14J13J3L5R8j35M3o2J81j65j2n7O5m4M5
2064@k1m0J4K5l1n9L2P6l9k7R2q2J01o6R1p6L9r7O9k1L0N6j62N6rJ23j09J19p9j24R7Op0L5
1639e1l2J53mppN4n9K9j21Q6n5l6Q5j42J41n2N5Jq4J59o6k26O9N2J2M6K9j7Pj5J15o3o0n4
1213e8J25j30K4m7Q1r1M1R5j07M0L4l4J7lO0N1j58J04k1J46j43l6o6P7q8J72j29M5m6J9N0
825B4J17r3j36Q8O0k6p3J37j7K6M9r9J8M3k28J02l3m3K47j74l2R7j72R0p9O5O8m0k6J27MM4
424A35o1M9j70J85q7n3n4K0M8K5Po9n2P6K4J35o6j69l7J13N7l8j48J09M1J80j55p2J6OLJ05
23A03k35J07RQ0oj80Q4P5j2m8pl6l4L9J13p9p7J72kj02J5k8J58k9n5R1p9l3q7P3j00N3O6
$$ y = [-124, 127, 12, 92, 32, 82, -8, 0, 48, 92, 12, 64, -1, -11, 113, 67, 22, 36, 48, -23, 25, 36, -82, -27, -70, -48, 13, 20, 1, -130, 43, 61, -97, 60, 101, 86, 45, -108, -21, -56, 78, -121, -90, -138, -29, -26, 69, 196, -118, -5, 8, 43, 141, 6, 49, -13, 168, 3, -9, -66, -1, -45, 0, -21, -61, -47, -22, -53, -112, -80, -4, -43, -70, 22, -60, 41, -25, 66, -10, 29, -68, 1, -20, 10, 66, -96, -40, -49, 74, -35, 84, 5, -119, -22, -16, -86, -51, -83, 70, 66, 59, 52, 106, 47, 76, -45, 41, -14, -50, 35, -107, 34, -18, 37, 38, -46, 113, 47, -179, -110, -58, -46, 0, 29, 12, 19, 4, 119, 56, -4, -58, 67, -63, -39, -86, -5, -96, -55, 40, -67, -27, 7, -27, -10, -13, 47, 98, -60, 44, 23, 169, 26, -10, -76, 1, -87, 85, -44, 1, -45, -26, 24, 141, 48, -88, 0, 60, 34, -39, 98, 81, 107, 156, 57, 75, 118, -110, -8, -41, -84, 163, -11, -43, 54, -118, -28, -107, -42, 26, -14, -40, 87, 91, 135, 74, 123, -47, 138, 51, -2, -56, -36, 12, 37, 44, -25, -77, -1, 23, 158, 92, -77, -114, -1, 56, 18, -130, -21, 20, 200, 45, -27, -11, -5, -2, 103, -132, -25, -16, 64, 58, -122, -38, 37, 25, -23, -30, -66, -100, -61, 52, -27, -104, 68, 66, -36, -21, -49, 109, 80, 25, 116, 37, 4, -83, -10, -110, -57, 9]
-390I
##PAGE=	F1=2298.99
##FIRST=	23151.189942674980557,	6007.9998942000029274,	0.29870080947875976563
##DATA TABLE=	(F2++(Y..Y)), PROFILE
6008a3K2Ml6K8n6O5j9j4K8N4M2j52L9K3K1P9q0M9j86J63M7L5k14N6P9j8p9L0L7m1K5j35R5
5595b2j3J82l4j17K3LRP4n2p7j43K31o4j01l4O6M8L7rk3k3PQ8r6J10L3j45J0r2m9J74l7L4
5182bq2Q3J7J0Q0j28o4K22j65j09P4O9L4q1N7l7L4k9J22j7j96J09Nj22p4J03J32j70J63oj70
4794a38J54Mq1J17j32J21O9j52j5JR1p9J28j61J3J73q8J47j99J19j13rPJ39j8k34Q3L1j03
4430a25K15j48Q2p4N1j8k3j7J57k2L0j34P2m6%j4K6l4J10j19n1M4J11n5M8q7J06j55J15j15
4055g0J20L6kJ5j22O8J05j91j05R9M9Jk0P6M2j20k4O0j2m0J59j34Q2p3Q6q4m1l5k9J22j2r0
3654h4P9LP7L3Mj66J27kj11P1p3K07j70k2J0J2m7p2J23rL0J18k30LJ61l6j17J17N8j32l7P8
3254CJ20O6k71J14m6j5j3J4L9Nj31J26n4O9k4L3q6O0l0Q2o5J23j12J88j90O0K3N6l6n6k5j8
$$ y = [-13, 9, 13, -23, 5, -51, 14, -5, -19, 9, 63, 105, -47, -8, 15, 36, 115, 35, 84, -102, 61, 108, 143, -71, -15, 64, 46, -33, -3, 34, -7, 18, -117, -22, -35, 147, 113, -4, 19, 22, 31, 105, 53, -24, -167, 64, 0, -101, -135, -69, -21, 16, 7, -16, -39, -32, 56, -40, 70, 103, -42, -32, -124, -173, 1, -36, -2, -84, -1, 16, 26, 106, -22, -86, 136, -29, -138, -64, 5, 39, -42, 15, -22, 12, -17, 105, 88, -108, 1, 6, -116, -190, -87, 45, -125, 38, 32, -138, 16, 20, -61, 56, -76, 45, 114, -38, -53, -52, 39, -40, 88, -73, -60, 113, 25, 172, -27, 92, -21, -30, -23, 116, 98, -136, -53, -22, -125, 90, -58, 24, -50, 1, -17, -40, -57, 100, 78, 108, -26, 46, 0, 0, -14, 12, -22, 88, -31, -82, -38, 73, 18, 66, -21, 85, -70, 45, -70, 50, 86, 84, 99, -23, 45, 150, -41, -146, -47, 2, 3, -17, 59, 101, -19, -43, 17, 5, -35, 124, -10, 72, -1, 85, 1, -40, -75, -104, 18, 6, -84, -5, -2, 75, 108, 112, -54, 73, 71, -40, 31, -42, 165, -5, -27, -17, -5, -52, -124, -1, -10, 20, 138, -92, -89, 72, 36, -81, 36, 94, -38, -75, 3, 123, 189, -82, 32, -14, -29, -42, -28, 11, 16, -115, 11, -43, 26, 2, 35, -51, 9, -21, 61, -4, 119, 7, 195, 5, 65, 88, 144, 108, 52, 27, 9]
2853Ij13K31j58N4qO1j36J03K6M2j43O7J0n0R0p9M3J3Qq8M7rr9M5k8k4P5K5Jj16J63j8j10
2440f6R7L7J9l5j88J22p4J56j48K6o2Q1N9O9M2j81O6mL4J02j57O0p8J56j63K3r0N2nL7rl7
2039e9K5n6K5p9R8P3q6pM7m9O8k0N8l6J5o4N8%J3N3j62J9LJ14o2R4q5q3M8L4n4N0o5J21ml0
1588A5QP7o2N1j22J13o1p7P7j16J39o1L6Nq8J28n7j90Q1L4K0L2L0K4k8mJ19r4k9n4R6p0k0
1175d8k7Q4j06J7J28j14P4J8n6M3k9N0Q9j43P4j6J46j34n8k1O7j58J39m7K2q5P8O0J18r9j21
787e5R0L8p3J6R6m5K6N5p6qP5k11M4L2o6K08j18n2N6j45R5n4P2O2q1o8J48K8N0n0Q1j71J68
374A67j30n1k6K9N2Kj6l2p9J12oR0p5j49k2J05J30o4j85R7O9J74j20r8N9k9J4R2k08Q9RL4
-27C4K3j71N3P6L0l3p0jK1j1J37o8n0N4M5n8n2o2J56k1pN7p1kr8O3j02P7P2
$$ y = [9, -104, 127, -31, 23, 15, 76, -60, 43, 69, 111, -32, 35, 45, -5, 85, 6, 49, 62, 70, -18, 29, 20, -79, -34, -62, -86, -11, 14, 15, -101, 62, 44, -66, 31, 68, 87, 52, -136, -14, -88, 68, -80, -54, -116, -35, 24, 93, 135, -46, 20, 16, 50, 152, -5, 55, -23, 133, -30, -7, -97, -45, -50, -13, -22, -59, -34, -90, -65, -144, -46, 27, -59, -66, -19, -68, 0, -20, 38, 2, 17, -47, 11, 11, 24, 77, -85, -66, -63, 51, -11, 83, -2, -85, -37, -3, -57, -7, -72, 49, 45, 15, 23, 100, 38, 89, -33, 80, 19, -58, 19, -97, 42, -19, 17, 22, -66, 62, 5, -185, -104, -70, -50, -18, 12, 36, 8, 4, 123, 29, 0, -54, 42, -28, -48, -75, 9, -97, -80, 48, -66, 8, 26, -30, 13, -16, 34, 123, -20, 54, 38, 184, 50, -8, -29, 38, -120, 19, -28, -6, -91, -13, 47, 165, 66, -55, 35, 73, 0, 16, 112, 67, 93, 148, 72, 64, 139, -72, -28, 4, -62, 146, 28, -24, 32, -113, -18, -72, 0, 62, -19, -87, 61, 89, 139, 89, 170, -1, 167, 37, -14, -40, -11, 41, 43, 27, -5, -84, 28, 22, 112, 37, -112, -134, -29, 101, 37, -148, -51, 18, 192, 72, -26, 33, 4, 18, 110, -98, -9, 0, 34, 57, -114, -61, 15, 45, 12, -58, -59, -38, -49, 88, 20, -30, 24, 69, 11, -41, -103, 53, 32, 25, 82, 11, 9, -89, -26, -128, -51, 21]
-390B1
##PAGE=	F1=2204.63
##FIRST=	23151.189942674980557,	6007.9998942000029274,	-0.0087934406474232673645
##DATA TABLE=	(F2++(Y..Y)), PROFILE
6008c1M8j4j0jmL4%j4K1L1j8o9O0K8j8O0p2M1j66J49K5Lj53M2P8m0o2O4K6mJ8k29J54P3J14
5570A64r8o3O6q7M4Q8j00l7r3K13n4j62K2N2k4R8m3k7M1q8J34j08J33M0j48M1r0k9J52n6M3
5182B4r9N1J0L9P3j38n1K07j06p8L2O0M7r9O8n7Rl8J32j5j88R9l4o9j8K4J56j27Q3L7j50J27
4781A1K5j27J31j40J65M3j51nK8Q1q5O9r6jJ61n4J20j98J20j10qmJ37m8k07R3L4j23J79j60
4405a20Q7j5J15o7n3j2J77m6k4m1N8n2M0o9M0n1J23j42n8J13Q3j04O5o1J05j52J00j11J01
4042B9L6J3L3j89R2J42j98o5O8R2o5QJ05%j47L4O9o4o4J75j29N4m5J21j17o7L3m2J00K9q9
3654d8pPQ8L4K8j48J41n6q8P3p3J87j77NJ7J8j5r8J73r8M5R6k07L0J37p9p1J56K8j29k4N9
3254DJ51M5k43O9Kl6n6J0N6Nj11J01n7N3j1P4j49R2j4R0j17J96j42J42j85R0r1N9L8j1R3m3
$$ y = [-31, 17, 3, -7, -8, -12, 22, 22, 8, 29, 60, 42, -27, 33, 61, 43, 103, 31, 72, -94, 55, 80, 83, -70, -28, 50, 10, -52, 12, 38, 34, 52, -177, -23, 50, 164, 66, 3, 69, -18, 26, 114, 14, -23, -116, 97, 43, -119, -97, -45, -69, 29, -14, -41, 0, -88, 46, -62, 71, 111, -37, 4, -86, -115, 37, -19, 24, -75, -24, -14, 25, 98, -40, -91, 116, 10, -68, -36, 24, 71, -28, 40, -17, -8, -46, 86, 71, -117, -18, -52, -121, -139, -115, 41, -86, -3, 34, -116, 11, 36, -91, 40, -100, 65, 108, -43, -48, -20, 61, -24, 45, -51, -52, 109, 55, 175, -23, 97, -13, -21, -25, 112, 64, -143, -50, -16, -139, 40, -120, -33, -48, 67, 0, -53, -65, 112, 66, 42, 1, 59, 7, 47, -22, 18, -33, 90, -52, -110, 3, 86, -18, 47, -14, 91, -61, 39, -72, 29, 65, 78, 111, -78, 14, 156, -42, -107, -39, 53, -12, -4, 101, 101, -46, -12, 57, -7, -71, 104, -25, 29, -16, 105, -12, -79, -46, -88, 12, 41, -48, -55, -48, 40, 74, 102, -46, 95, 39, -49, 24, -49, 138, -39, -34, -17, 1, -14, -112, 61, -37, 8, 104, -103, -73, 64, -15, -86, 70, 98, -31, -55, 4, 155, 200, -43, 26, 28, -8, -64, -54, 2, 7, -104, -3, -60, -7, -18, 56, -93, -1, -15, 75, -42, 154, 12, 154, -31, 59, -32, 27, 65, 54, 147, 104]
2853A04j58J70j91N0J8N3j60J83QJ7j71R3O6r5N4q8J00L1Kj03M2Jp7lJ3m8P0L2Mq9J48n7m7
2440b8M2lR0m7j92J27q8J50j03L4p2M2J46Kn6j7L6o2N0R5j57N1o6J13j58P6r7RK5L8ol8L4
2027c0j13P4p1J19O9j27L1J3l5M2KM1%k1qM5j4K4M6j15m0rJ07j4N6q2m1LM9l0O9r4Q1J6o0
1588a7K4O2m1P3j20J15n1q6L5o9J12o6MK5p7Q4l4j57J04j1L7K5J8O4o9K6J01j00Jm0K8J6o9
1175e3kP4j02rJ51j45J31k0o7N8n2M6J13r5OL1J06r4r9K4P4k06R4L1j9j01J12R6R5r2j04O2
775D4J2q3J07N1o7KP3k8n9P7j60k4R2o3J42o0m7Mr4O6m0P8O3j01j15J67K9O2m6R6j47J34j46
361A9n3%O4N1l1m8Jp9J19l4M1p2j07j9Q2J98q0j94O7R4J25n8r2J02o5j1O4j26N6J3k7N1j34
-52h3K2N6N2Rj37J5Q0l8J46p0Pq7R4k4j06p6J56l2O0Lo8M8j00L5r0P2P1
$$ y = [104, -54, 116, -75, -25, -7, 46, -114, 69, 77, 94, -77, 16, 82, -13, 41, -47, 53, 84, 86, -17, 25, 26, -51, -54, -41, -89, -19, 13, 17, -72, 76, 19, -28, 14, 11, 101, 54, -138, -11, -99, 51, -52, -18, -90, -48, 98, 100, 44, 27, 63, 1, 51, 146, -11, 40, -26, 87, -71, 5, -92, -83, -58, -20, -26, -64, -30, -143, -69, -140, -21, 48, -79, -48, -35, -70, -28, -26, 15, 15, -6, -14, 31, 17, 41, 87, -28, -68, -77, 30, 16, 72, -10, -51, -48, 1, -29, 40, -54, 27, 43, -17, 7, 69, 28, 101, -19, 96, 45, -41, -6, -75, 37, -29, -25, 0, -77, 7, -27, -184, -80, -91, -54, -29, -11, 53, -16, 10, 111, 11, 12, -28, 0, 16, -53, -55, 19, -83, -92, 59, -86, 45, 25, -42, 16, -36, 10, 123, 28, 34, 65, 171, 77, -22, 2, 76, -130, -36, -5, -24, -125, -13, 83, 178, 86, -18, 44, 56, -27, 80, 131, 64, 66, 139, 111, 52, 129, -31, -55, 37, -26, 116, 56, 9, 13, -81, -15, -55, 23, 86, -15, -130, 37, 66, 128, 82, 178, 31, 165, 19, -34, -34, 30, 81, 50, 2, 3, -76, 43, 9, 50, -22, -129, -148, -66, 132, 52, -142, -75, 19, 144, 86, -6, 96, 31, 20, 84, -42, 14, 27, 0, 51, -83, -61, -5, 47, 56, -81, -66, 14, -24, 122, 52, 59, -28, 66, 42, -64, -140, 16, -16, 44, 47, -21, 27, -73, -38, -128, -56, 15]
-390A5
##PAGE=	F1=2110.28
##FIRST=	23151.189942674980557,	6007.9998942000029274,	-0.36585295200347900391
##DATA TABLE=	(F2++(Y..Y)), PROFILE
6008c7N5j8J2k7M2JMqK1Qn3rO4K8j9J6m1J8j20J29k9j4q3NR9o3o4R2J2O5k0k81J80J31Q5j44
5557C7k5J00j71Q7P0j15kl3J54k6j89R5Kp6J26m9k7O8j42J31r9J37O6j11J6o3JQ9o1M9r2J2
5157d1mN5P6j52j2J77o1l9j1M8N8r4O1o7j6k6R9j1j39M6n2j9O0q0J95q0l0Q7j16P9L3j39J10
4743ej25K02L1j41jN5O4r4K2m1jJ25j2N8j53J13j06lnJ13o1j73Q9P6j50J20j48P8O0J19q9
4355A7o2l1J68m5p6N9L2n8P6j03M4p8J28j42o9J74N5j26O9l1P4j24Q2r0N5K1N0K1k22J14J59
3967A41j67k8K2J26j20M1J07l2j49O7P5j06o2J44r6lJ1J46j26q4P6m0O2P8r4q2j0J18J6N5
3592H6j26J58j19p3R5p2J47j57OM2J5J3j00J96j77O1P5j53L2J03j09mJ51K0j25l5N2J77Rj79
3216IRN0o3p5oP3Pp7N6l5QJ5J03j95Q5K4J02j49K27j57J03j65J05p2K0M7MK58m3k48O7j91
$$ y = [-37, 18, 0, 12, -15, 27, 28, 32, 24, 45, 53, 0, -9, 55, 83, 64, 80, 39, 57, -63, 66, 37, 23, -60, -55, 44, -19, -83, 9, 21, 86, 66, -215, -35, 96, 181, 37, 12, 112, -59, 28, 98, -17, -19, -52, 102, 76, -113, -18, -16, -92, 34, -15, -42, 26, -116, 15, -84, 53, 119, 8, 24, -39, -38, 51, -10, 39, -53, -41, -45, 10, 86, -66, -78, 99, 38, -1, -12, 36, 94, 0, 61, -6, -22, -48, 51, 40, -99, -53, -105, -124, -64, -144, 51, -29, -59, 28, -88, -9, 24, -115, -5, -130, 72, 103, -38, -39, 16, 80, -14, 8, -33, -34, 91, 79, 137, -16, 97, -9, -12, -17, 96, 35, -138, -49, 27, -123, -3, -151, -73, -13, 106, 17, -45, -76, 92, 47, -29, 30, 62, 4, 80, -23, 21, -57, 71, -71, -140, 34, 89, -37, 32, 1, 75, -49, 33, -57, -2, 19, 69, 90, -132, -18, 141, -26, -54, -32, 94, -26, 15, 122, 90, -59, 8, 83, -23, -85, 59, -37, -40, -29, 117, -9, -93, -17, -57, 5, 83, -11, -93, -103, 15, 31, 86, -40, 118, -1, -74, 21, -51, 96, -61, -55, -13, 2, 15, -85, 111, -66, -5, 70, -83, -51, 52, -57, -61, 90, 110, -15, -50, 2, 179, 188, 9, 18, 68, 5, -70, -76, -3, 4, -73, -17, -52, -44, -29, 74, -121, -36, -12, 90, -59, 168, 11, 114, -51, 54, -18, 2, 49, 53, 311, 268, 20, 87, -104]
2815a04O0J2L2j54K23pj5j65J30Q9j42L6o3R9O5lj07K7K1m1o7N1l1N0J7Ko3J27q3Rnn5J71
2402A16o7j72J10p4J26q7N7q3LK30o6j38J22L0j38Q0P1j25Rk5O2j49J38q5m4L9K6Nm3L6j29
2014a65R6l5J00N3j47P6kl6K1nM6K7o6N6K9m8M8L1k7j05l9J01K5J7p5pk7N1MP2j03M2N2r1
1588c1M1RJ2P7r9P8l1n4l0j9P5p8k1N8n6K9mj30J32o3M7L2k2R4r8O3P0q0L5l1o4J16j17L8
1163b2L5p3l2J69j92J84n1p4N8o3M7J17l0p9J02L7m0j39M9J14k30M3O9m6r4J20J39O2p5r7
787HK7j0p1J69L1q9l7R6K4j10N0p8r5J33k4O4k2k8k9l2Lm8R0P5r1j59J74RO6l9Q4j04J03j29
361A1n5PJ14L0n4o8K5n9Q0m5J3o5n4k8N8K21q3j67M1J02N9j0o2J38r7m9L0l2L7Kp4O6o9mK5
-77a6N4M8j81OJ25m2J57q6O8j89J06pj32o7J61n1J21n0q1J03q9on4L9O1
$$ y = [-104, -44, -32, 0, -154, 69, 62, 47, -118, 12, 101, -41, -5, -68, 31, 96, 93, -14, 13, 34, -7, -74, -23, -54, -4, 13, 15, -48, 79, -4, 5, 0, -55, 116, 49, -123, -13, -87, 39, -48, 9, -74, -71, 159, 93, -45, 77, 107, -31, 49, 120, -5, 4, -21, 41, -108, 30, -55, -99, -60, -34, -29, -72, -36, -165, -69, -104, -4, 49, -98, -22, -24, -60, -39, -44, 2, 29, -37, 19, 48, 0, 48, 79, 52, -53, -92, 9, 34, 51, -24, -31, -58, -7, -3, 69, -34, 8, 60, -31, 10, 19, 31, 108, 9, 87, 56, 2, -28, -47, 28, -50, -71, -13, -69, -40, -44, -174, -42, -105, -58, -26, -48, 46, -52, 11, 81, 1, 36, 5, -59, 57, -60, -22, 13, -60, -92, 77, -115, 69, 18, -56, 2, -61, -14, 103, 73, -6, 96, 133, 93, -46, 3, 117, -113, -70, -1, -47, -141, -21, 118, 180, 105, 8, 35, 25, -46, 123, 154, 65, 28, 124, 148, 38, 88, 10, -85, 48, 24, 88, 66, 38, 9, -23, -20, -68, 22, 97, 6, -153, 21, 30, 96, 57, 141, 37, 140, 11, -44, -37, 77, 107, 53, -15, 10, -49, 31, -14, -1, -66, -120, -148, -90, 131, 48, -119, -78, 24, 83, 73, 11, 149, 52, 3, 33, 1, 38, 40, -34, 32, -37, -41, -16, 38, 86, -95, -89, 36, -6, 151, 65, 133, -56, 50, 43, -89, -156, 5, -46, 75, 25, -56, 47, -42, -48, -102, -63, -2]
-390b
##PAGE=	F1=2015.92
##FIRST=	23151.189942674980557,	6007.9998942000029274,	-0.20168597996234893799
##DATA TABLE=	(F2++(Y..Y)), PROFILE
6008c9N5j7L5n0P0k5nPJ4mm8NN6K2Pk8kqn9R2q6ql2l2J24p4q8R8J1J41p3k70J43J53R9j48
5557C6rJ05k08J18J8r8K3K6O1J0j61J52o3j04J26k8k1N0j35P5p2J12J02m1m2l6L1Qn9N0o4
5169c8j2j4M6Q9j58L4J38m4Mm5L4N9o7M3n7l1lL9j3n7l3m8J4J21j56K34n5j25J27r0RN0j24
4756a29P1q7K16K3j22lO9N3j04jJLO7K0jq4J03r8%ON9m0j43P5J45j88O0j17O6J26O9r4m1p0
4330i0J39j2j25J35No3R3j07L9r5J04r7q5J95L7r6N5mJ4p5N7n2J4k1J06k0k15J19J54j08L
3942Dl4J34j30O7P9m8j28O5Q0j33l5P8m3o5O5J64j05r5R1k6J7J03r8j09m1J55j8P0r8J75j84
3554d3n3J32r8J19j18k5P5NK8q2J87k11O6O9q1mP7r9L6J11L2j20o3M3K05l2j00m1P8r0p4j6
3153h7R1Pn3J3Ll8K8J13k04N2N9J21j46J83j39Q0j40R0K3l0L0rM07l0l27n4j50P0j4%j14K17
$$ y = [-39, 16, -1, 34, -16, 54, 29, 24, 31, 45, 41, -7, -2, 54, 76, 83, 55, 53, 45, -14, 78, -8, -16, -48, -80, 44, -30, -118, -20, -9, 132, 59, -211, -68, 85, 184, 36, 27, 132, -76, 42, 60, -38, -15, 11, 72, 82, -79, 73, 10, -94, 32, 4, -17, 33, -102, -27, -99, 13, 115, 74, 32, -4, 27, 35, -24, 26, -38, -50, -64, -18, 71, -87, -53, 85, 41, 45, 0, 34, 93, 26, 69, 12, -19, -22, 17, 4, -53, -86, -134, -120, 1, -155, 79, 24, -101, 26, -64, -55, -5, -129, -58, -145, 71, 94, -28, -31, 38, 91, -13, -14, -13, -10, 57, 77, 76, -8, 95, -3, -3, 3, 62, 22, -121, -46, 99, -89, -29, -146, -80, 46, 115, 21, -20, -90, 49, 37, -88, 47, 52, -11, 82, -25, 14, -81, 23, -74, -159, 36, 73, -23, 32, 28, 42, -33, 24, -28, -14, -35, 71, 51, -164, -45, 109, 1, 4, -30, 104, -26, 41, 120, 72, -56, 9, 89, -44, -79, -1, -44, -109, -44, 120, 15, -80, 11, -15, 2, 105, 7, -102, -143, 12, -6, 64, -34, 141, -43, -96, 36, -62, 57, -61, -86, -11, -6, 22, -60, 127, -84, -18, 51, -30, -34, 43, -56, -20, 91, 123, 3, -60, -17, 188, 156, 56, 15, 93, 3, -71, -87, 4, 11, -42, -29, -26, -64, -36, 77, -127, -75, -16, 105, -41, 142, 3, 83, -57, 33, 56, 26, 56, 47, 454, 424, 97, 43, -107, -37, -51, -51, -165, 52]
2753E2k8l5j37J64Q7j78K8kM4J03mj02J4J9Rj15O5J8J8kLm8R4q1M5m7r5K28q4j40Q8m2R3r7
2327f5R2r7k5K73j04j77J91M5k01J15L4p0m6J7K3j40J98o8q5M4j1L6o0L2j09R0J1P2J3j38
1952a10J10qk2ll8P3M2j09J06J4p6N9OP8j55o6Q8M8np8J9m8M4N2M6q2J2R1j07M7n9P8O0n6
1526E1J1rNr2J2N1j02k6R1l8k8K5j00J50j01L8N6q5J03j00Q9L6m5P0l0j60K12j59Q9j6k9n7
1125h8J85k27K04n5q4M8n7M3J11K0j51J73l7Nj53M1J83k39JM9l4p8J13J64K8n4r6Mk1n9J88
737A27M2j11o9J04O7j42RK3j60J52L8j2mj7k8K9p4p7J06R2n3j91J63j9N4k7N4n7Q8q5n6kJ52
324A16j4n8n7L5l2Ol6J9n3j2m7M1J87p3j09L7R0njk3J57j13p4%L2M4k9r1O3Ok7NM2O3j89k1
-127a21J39j8J76j16J14k19O3%j29m2J68o4J50p8j06J39o2n0mpM2
$$ y = [52, 24, -11, -148, 16, 103, -75, -47, -49, -5, 98, 94, -8, 6, 25, 34, -81, -16, 2, 20, 18, 21, -27, 67, -14, 31, -16, -111, 117, 33, -107, -19, -61, 32, -65, 27, -70, -95, 178, 74, -103, 88, 133, -68, 47, 81, 11, -35, -18, 5, -135, 63, -5, -90, -46, -57, -21, -81, -49, -158, -68, -57, 15, 28, -110, 0, -8, -30, -33, -71, 2, 44, -65, 41, 55, -21, 38, 44, 122, -33, -99, -11, 37, 32, -46, -27, -75, -31, 21, 67, -15, -3, 88, -19, 28, -31, 47, 107, 51, 62, 53, 58, -34, -22, 29, -73, -99, -8, -46, -74, -49, -149, 1, -100, -62, -6, -91, 12, -88, 1, 37, -8, 62, 32, -128, 84, -75, 14, -2, -31, -88, 97, -130, 74, 19, -65, -17, -74, -31, 80, 100, -51, 122, 85, 90, -63, -22, 161, -78, -77, -28, -62, -140, -27, 137, 165, 111, 15, 19, -2, -61, 127, 169, 58, -11, 93, 160, 18, 27, 50, -110, 42, 80, 68, 64, 47, 19, 48, -26, -103, 3, 95, 42, -149, 14, -5, 49, 22, 76, 19, 107, 22, -34, -36, 116, 102, 44, -13, 22, -10, -4, -40, -21, -74, -86, -133, -92, 95, 22, -87, -50, 40, 35, 34, 11, 168, 55, -19, -19, 13, 57, 28, -63, 0, 6, -21, -16, 26, 89, -100, -121, 18, 0, 176, 60, 174, -45, 18, 18, -111, -153, 15, -49, 101, 23, -83, 56, -6, -56, -60, -67, -25]
-390b5
##PAGE=	F1=1921.57
##FIRST=	23151.189942674980557,	6007.9998942000029274,	0.2319901585578918457
##DATA TABLE=	(F2++(Y..Y)), PROFILE
6008d1N2j1N7o8P2l6j5K9j0Jj2j9M2QL5n3L3j9pM1j29K4j9m6J41o4j27P3K7J98j18j93M2J40
5582B8J28j00j0P8j81J19m4o3L1P6m4M6r1J67j10j13J13Qj4kp5j5l4O3J24M5r1k9N6p0o0N0
5182a4k1j2j5J4J04j50O6R9n0M4o4J7M7k6K0l1l3K9k4k5L1j09l5L6J37j72K46m8j68J41q1
4794d7p1Q1r5M3m2J98Rr6ON0N0j04mL0J1mL4l5j5R3p3j6L3k8J4j18N4K08k24K7q3N7J66Pj04
4355A2jj11R7M7j63J65j7o5Q7q2K9q9M3j0r0J56K3j2L5Km6k6K5pQr1J69p5j74R6J39m4J9q3
3930c4J09q7P9L8n5q9K8Q3j44PRLj02R3J72n6j11R5qk0R0j00p8o9J75o1P1n9J76k31j9J68
3529G3j61J21p2p8J04j5L1m5J52j91N9P8j5o2O2n2K2O2N6j05j01K3K32p1l3n9Q3j11o0j4J10
3141B3Mn1j7M4n9J2J08j74K4O0J45j14P8r1O9j14N6J19o8K1m2M81k0l41j54q3O5m0k9m8J69
$$ y = [-41, 11, 0, 57, -11, 61, 25, 10, 39, 29, 30, 18, -1, 41, 49, 84, 31, 64, 45, 38, 79, -50, -26, -45, -91, 50, -14, -141, -68, -41, 157, 39, -154, -112, 28, 156, 56, 46, 124, -57, 62, 18, -45, -14, 62, 18, 64, -27, 140, 30, -83, 30, 38, 24, 22, -53, -68, -102, -39, 85, 130, 39, 10, 66, -4, -64, -14, -35, -47, -62, -48, 56, -94, -28, 71, 21, 65, 1, 18, 65, 39, 59, 28, -5, 24, 0, -25, 6, -103, -138, -102, 35, -137, 109, 61, -107, 34, -47, -118, -37, -132, -89, -131, 67, 76, -20, -14, 36, 86, -18, -22, 8, 19, 15, 49, 14, -1, 92, 19, 3, 36, 8, 22, -96, -42, 166, -58, -31, -114, -57, 109, 116, 12, 11, -100, -3, 44, -119, 46, 29, -36, 51, -31, -2, -91, -48, -58, -148, 8, 31, 19, 54, 56, 10, -16, 9, 2, 10, -81, 88, 13, -161, -65, 74, 30, 49, -34, 75, -12, 67, 105, 50, -39, -11, 72, -72, -65, -56, -53, -155, -62, 110, 54, -57, 38, 30, 10, 100, 0, -78, -147, 28, -33, 38, -21, 155, -76, -95, 73, -88, 33, -39, -117, -13, -28, 3, -42, 110, -81, -22, 56, 41, -21, 41, -11, 11, 73, 129, 24, -77, -54, 178, 107, 74, 15, 98, -13, -73, -87, 23, 27, -24, -41, 3, -56, -44, 64, -110, -86, -26, 119, 5, 83, -8, 61, -53, 3, 122, 54, 75, 33, 514, 494, 153, -1, -84, -19, -59, -88, -136, 33]
2753C3n6l2j02J67Q3j88J6O7k6J25Or2J6k4O9j31N5P2j8rJ0m7M9m7N7q6j07K40r0j13P7qN5
2340B1j07J20j07l4K58j08j54J74P2k35J44krr5L4Rj27K38o0r8N3o6Q1r0K9q1P2M4O5m1j02
1952a02J08j5K6l2q2J05M9j41J24Rp2L2k3J71j68p8O7N2nr6L5o7L7J05ll2qJ23r9L5j26J35
1551F4K9%n8J0O2j31J7N0j25j8J07k5p1M1o6J51j08%R7j46Q9p8R4J1k3J04m1k25K85j95J47
1163D8o0J3q7J99k31J83l4r7M0l8K3J13L0j84K15q9K6j25LK55k42k0j4J3o7J06J49jl3r3l
775bj3n9J69P4j26q9R2R6j49k3J17k09J48R8o4Kk8jQ5j37j18J19R8%k04J30l6L0j7K7j4Q3
374G9k3o1j2J53o3n2j8L4j2o8j3N2l8mo5L6J12n2l5N3O4n0k2%J54j09p2k0M3P7p4p5M3P4n6
-64b0J0K2N5j62n4J22K6K00j58J38j89rPj08j2J60n8J33p1j31J39j5q4M1m9K3
$$ y = [33, -23, -55, -157, 10, 93, -95, -79, -12, -38, 87, 93, 1, 17, -7, 62, -69, -14, 58, 40, 31, 41, -6, 43, -4, 53, -33, -140, 100, 10, -103, -26, -34, 21, -86, 34, -73, -107, 151, 43, -111, 63, 135, -100, 44, 42, 33, -62, -28, -19, -146, 92, 32, -66, -13, -79, 2, -88, -59, -140, -68, -24, 41, 0, -102, 6, -9, 17, -15, -97, 8, 57, -84, 40, 49, -23, 9, -14, 157, -11, -89, -22, 30, 25, -71, -36, -103, -66, 39, 36, 4, -4, 119, 20, 55, -71, 64, 93, 93, 35, 45, 107, -24, -7, 43, -82, -100, 7, -18, -89, -48, -114, 37, -71, -71, 26, -120, -31, -109, -15, -4, -27, 77, 36, -189, 96, -99, 48, -12, 1, -86, 113, -118, 65, 31, -66, -26, -64, -41, 72, 102, -82, 133, 44, 70, -55, -52, 203, -39, -59, -73, -60, -127, -21, 128, 127, 94, 1, -2, -15, -74, 95, 169, 43, -46, 46, 142, -7, -30, 87, -122, 26, 124, 60, 62, 34, 33, 118, -19, -137, -18, 80, 80, -124, 6, -30, 0, -17, 10, -4, 79, 56, -5, -17, 136, 73, 21, 3, 37, 25, -43, -56, -4, -42, -46, -111, -75, 37, -15, -50, 3, 67, 17, -5, -5, 149, 40, -32, -52, -9, 68, -6, -81, -38, 36, -20, -10, 12, 67, -95, -149, -27, -1, 199, 41, 179, -10, -19, -12, -120, -132, 28, -30, 103, 32, -99, 40, 25, -59, -18, -67, -44]
-390d4
##PAGE=	F1=1827.22
##FIRST=	23151.189942674980557,	6007.9998942000029274,	0.14199106395244598389
##DATA TABLE=	(F2++(Y..Y)), PROFILE
6008d2M8kP1q4N4k8j1M6m8K2L2n7K9j1M1n5N8rK4j3j51P2m1k9J45l9j56K5M7K12j39o8q3R8
5582d2J37j2j8L2j02Q0q5l2K2J15j32O9j5J40j18j11J02M3no7Qr9lPJ15J26j08m0O9j30n7
5194a11M6K6Rj0k2J11j33O8O9n9O8o5JK4PNnk2O4o2n5J07j59k6N9R7j25K12m3j53J22q0j43
4781a78J19o3L7pJ53j2o1L6j0M7q7NM6L2p6K9m0K6Q5j5o4O6j18P2r1L1K34k40K9n9M4J81k2
4368A29j33L7j29M4J15j83J47k8n8O0m5J8n3m2R5p0O4JR7K0j1p5Lj5L4L8j66K17j13j23N5
3980g0J21LJ8j10N6j2P5Pn9m1k5P0j37M9l6K1r6Q6J65Oj34J01Lk9N0j04qp8J58r9N4j0J61
3567A56k51K6J91k47J50k6j37J22m1L0lJ04j24L4R6K9j13M3J0m0L7Q2q1j41JK45j09J8m5P0
3191H6j18n1KJ19Po5l3Q1n5k8J00j21K6J0J68o8m1l6O0r1L5J63q5K5p8M59k6k71j99k0M5n5
$$ y = [-42, 6, 4, 75, -9, 45, 17, 6, 52, 4, 26, 58, 1, 30, 19, 60, 5, 63, 54, 78, 65, -86, -14, -55, -84, 61, 22, -134, -109, -62, 150, 11, -57, -140, -42, 95, 83, 65, 97, -5, 75, -10, -42, -20, 95, -37, 32, 17, 157, 39, -72, 30, 73, 68, 1, 9, -90, -93, -86, 29, 155, 47, 7, 76, -54, -111, -65, -39, -30, -40, -62, 49, -84, -16, 53, -6, 62, -3, -2, 22, 29, 34, 29, 7, 71, 9, -46, 61, -98, -124, -65, 32, -93, 119, 76, -77, 45, -35, -178, -59, -122, -85, -92, 61, 49, -12, 24, 14, 61, -26, -21, 25, 57, -19, 10, -30, -4, 81, 66, 2, 68, -50, 22, -69, -38, 196, -44, -15, -74, -30, 151, 129, -4, 33, -96, -52, 63, -120, 27, -1, -59, 1, -44, -26, -79, -121, -26, -96, -32, -31, 66, 86, 75, 0, 3, -12, 22, 60, -106, 111, -2, -125, -70, 51, 54, 72, -38, 18, 6, 81, 88, 29, -12, -37, 33, -104, -55, -91, -70, -166, -80, 85, 91, -43, 58, 61, 32, 82, -22, -30, -108, 50, -49, 5, -5, 156, -95, -69, 122, -125, 25, -1, -138, -16, -57, -27, -30, 74, -50, -16, 80, 109, -4, 39, 49, 9, 46, 128, 47, -94, -93, 152, 43, 61, 16, 86, -32, -83, -81, 38, 45, -20, -53, 28, -27, -55, 45, -76, -50, -40, 128, 60, 19, -17, 43, -48, -13, 150, 65, 90, 12, 471, 445, 174, -25, -45, 0, -55]
2790e5m6K9J02q3j2p6J27R4j67j4J12o8J20L2q4L9j02J26j19M1R8n6J0K0n5LRN0j15r6K10
2402G4r1r7Q5J0K2j00J23r9k5J93r3p3R2R6k45J61j6L7j14J3Qj03K45o3q2O2j02J19j28L3
2027e8p1O1M2R2r1m6P2l9J11o2j24J24N0j56J11K1l5l0n2K33j39p1N0L1Oj17L4q0K9J44m5
1639eL2k3J36o4Oj80J56QM6r2K0R8j41lO5j25j5R8rr5L8l4J41q1o4J46j80N5l9P5Kk3J21n4
1213A6k41L27k24J92p1L5j17K01j96J31mj04L7j4k1J34Mj74K12j06L0o5m9K98k37k1q4P4p4
850a11J09R6k4j6p9nJ3o5J32J02j23r5N9J09j37k9J82k34J27J30q3Pn4K5J35j57j59J11Q7
487E3M8j92Q5l0mj2K0J5Q1L3o6rJ16r7n2L6K2%j14QR6k1l8p3M9K9l1L7Q3K1o4n0%J30q8n0
36b9l4J4J10j10l6J4J17q6L6KL5j15p7P5Q4K15k02J42j35p0K0p9J2J26l6P6l1j41J04N3j01
$$ y = [-55, -101, -72, 30, -53, -65, -141, -14, 80, -87, -101, 11, -57, 63, 95, 11, 50, -52, 74, -45, -4, 94, 38, 48, 68, 13, 16, 25, 75, -40, -136, 74, -17, -114, -29, -19, 3, -97, 26, -73, -98, 95, 2, -71, 21, 117, -128, 33, 17, 54, -60, -47, -39, -142, 103, 40, -42, 20, -82, 37, -91, -58, -129, -68, -26, 66, -25, -71, 1, -38, 73, 11, -113, 11, 61, -95, 16, 37, 2, -28, -80, 153, 14, -57, -7, 24, 30, -87, -53, -133, -104, 40, -5, 27, 4, 140, 76, 82, -98, 58, 66, 112, 20, 40, 138, -3, -6, 59, -66, -81, 17, 8, -87, -49, -83, 58, -23, -87, 59, -121, -66, -105, -30, -28, -51, 70, 16, -225, 102, -122, 70, -1, 34, -83, 118, -78, 53, 49, -55, -18, -32, -53, 81, 85, -89, 123, 17, 47, -18, -67, 231, -6, -27, -111, -37, -111, -2, 94, 70, 54, -25, -30, -17, -82, 50, 152, 29, -66, -7, 102, -35, -64, 118, -116, 11, 141, 58, 65, 11, 36, 171, 14, -145, -34, 53, 101, -91, -6, -36, -40, -52, -32, -17, 64, 97, 31, 22, 138, 41, -11, 25, 47, 47, -67, -59, 37, 16, -22, -95, -46, -17, -48, -11, 72, 93, 29, -21, -21, 109, 21, -29, -63, -49, 61, -49, -85, -71, 46, -40, -4, -2, 33, -82, -159, -84, 0, 215, 13, 155, 20, -50, -30, -109, -97, 29, -7, 69, 38, -103, 1, 54, -47]
-352d7N2o9Q
$$ y = [-47, 5, -64, -56]
-390e6
##PAGE=	F1=1732.86
##FIRST=	23151.189942674980557,	6007.9998942000029274,	-0.33605140447616577148
##DATA TABLE=	(F2++(Y..Y)), PROFILE
6008d1M1LP8r8K8KNM9q6N6N3q3K5l1J8m1P3J1L4n4j61J19p8J8J35rj62l0O3J77j30O1j76L3
5582i8J23P9k4j5j1J9r5oJJ34j89Q5L2R1q9j00R7O6Jj20Q0j45Ok7P4J76r5n1O7j61m9M2O4
5169c8K9jm0J09j23L4O4o0P3n7j4RJ4MPpR5o1r8J55j66l2Q5J9n0J43k0j09Q0o9j89J42k8M1
4743e9J4R4k6k3Q1q8L0n5J6M3O9j31J7l1K8Q0O8j39R8j83J05n7OK19k21N4n9K3J82Oj78M9
4343C2j04pJ50j73J03l3l5K8k3J5jj13J73k8m9l4J82K3k4o2jn4N4Q3k09K32j18q1K1J06J8
3955G1jj04j3O8N7ko4Mo6L3j16Q0m6Jn3N9J41N9j52J10jkNj16O9o3J04j22K4L9J35k38P1J92
3529A63l18J80J3j81J27n9L2K4N7l7jJ08M4j30MN3j06M6J05n7j73mK27j40N1j5M7j02o1K2
3153h1J08K9p7m1J05m1o3R7p6O1o8J67k1j21JN1p9M4J55r1K8r8L64m6j42j80J4J9o2m4R7L5
$$ y = [-41, 0, 3, 81, -17, 11, 13, 18, 67, -19, 37, 90, 7, 32, 1, 19, -22, 51, 62, 96, 42, -119, 0, -78, -60, 75, 66, -96, -126, -63, 114, -16, 45, -131, -98, 25, 104, 80, 65, 54, 73, -22, -28, -27, 107, -82, 3, 35, 126, 37, -63, 34, 100, 101, -19, 61, -84, -78, -105, -31, 145, 50, -1, 66, -95, -144, -102, -38, -9, -10, -50, 59, -64, -30, 34, -26, 47, -10, -24, -15, -1, 3, 10, 3, 98, 37, -61, 94, -72, -104, -19, 0, -50, 93, 73, -36, 44, -25, -214, -72, -100, -59, -45, 49, 23, 0, 81, -7, 23, -32, -16, 27, 96, -35, -18, -49, -21, 59, 127, -12, 86, -97, 8, -49, -43, 176, -45, 9, -50, -27, 155, 161, -17, 32, -72, -79, 71, -102, 1, -32, -67, -39, -62, -47, -48, -161, 12, -16, -65, -99, 83, 106, 82, 20, 19, -35, 19, 102, -107, 125, 7, -74, -53, 53, 71, 70, -34, -47, 21, 78, 76, 12, 16, -50, -17, -133, -53, -99, -98, -151, -92, 49, 108, -44, 66, 65, 63, 68, -48, 21, -42, 62, -60, -36, 3, 138, -100, -29, 163, -155, 25, 38, -143, -16, -75, -43, -19, 38, 1, 0, 108, 152, 22, 26, 79, -27, 19, 124, 67, -106, -110, 117, -23, 28, 13, 60, -42, -103, -81, 27, 56, -21, -62, 43, 2, -61, 36, -40, 21, -47, 120, 99, -22, -21, 30, -49, -5, 150, 59, 87, -11, 353, 307, 165, -15, -1, 18, -44, -88, 9, 44]
2753D4r1Mo2N4J18j25n2J14o9R0P0p4P0j79J62r8M0Q7r1M5L5o3l2O5L3j23p5J58j01p8R8J1
2352a5Jq2R8o4nJ05p7L8j4J09k47J66nN9j00k6Pp3K23p5o0O8q7J26j58M3q6O5MJ33j08J1K3
1939cq1J99p1j51J14M0j45P6M6J2j00o2K47p3n9N1j4Mj14J2p5J4J52n5R1m3J32j9k4k20J42
1551B3RO9p8J5J07j27l2Q1r4l4P0K1r8J7j7J31l4j39J84j68RRM7Nm3J05m9k12L30k38K11m7
1150C3K8j32J82j37P1J8r1L0Lp6J72m4j33J68r2L7or0K89k18rj24J19r1J19K1l9jn6j9N3o5
750h0R7J15j05r7J9J09j08j3J98k32R7J26o9J7q0K6J74j24j88P6O2P6j60M3lm0qL1L3O4P0
361A26n8LN7j05o5P7QJ0j21J9J23kr4p0Q3l8j0Q1J14l5m3o5j3R1o4k3m9k6J20j18MrJ31j06
-64f7P0j7K0p0q2J5J43K01k32J36r0q7L1m9J6P9j0jK4j30N1J31j02K5o4k
$$ y = [44, -47, -43, -105, -51, 67, -58, -110, 4, -65, 25, 95, 21, 91, -88, 74, -24, 16, 103, 12, 57, 92, 29, -3, 62, 95, -28, -103, 55, -46, -124, -26, -15, -14, -96, 2, -62, -67, 38, -39, -1, -15, 94, -153, 13, 8, 67, -33, -59, -52, -125, 98, 23, -37, 31, -56, 70, -88, -45, -131, -66, -62, 71, -37, -26, -3, -84, 115, 44, -107, 7, 47, -98, -22, 24, 36, -64, -126, 121, 48, -11, 40, 26, 30, -84, -72, -147, -133, 19, -36, 55, 12, 144, 125, 101, -119, 23, 32, 101, 23, 38, 145, 18, -14, 67, -27, -61, 9, 30, -68, -51, -68, 63, 29, -110, 74, -94, -85, -76, -29, -24, -67, 38, -11, -223, 107, -131, 80, 33, 61, -71, 111, -26, 45, 63, -28, 2, 5, -71, 101, 57, -76, 92, 0, 37, 31, -59, 230, 12, 3, -121, -2, -93, 26, 47, 8, 7, -49, -68, -15, -80, 17, 132, 27, -70, -51, 58, -50, -63, 135, -97, 0, 126, 57, 74, -6, 20, 194, 70, -118, -42, 20, 96, -64, -21, -24, -64, -72, -41, -8, 56, 126, 68, 71, 128, 23, -42, 35, 43, 53, -68, -49, 74, 72, -22, -92, -9, -47, -57, 24, 138, 103, 60, -5, -18, 73, 9, -14, -63, -89, 31, -87, -83, -92, 39, -67, 3, -14, 6, -64, -146, -131, 12, 213, -19, 117, 27, -60, -29, -78, -62, 17, 7, 6, 30, -100, -49, 82, -20, 5, -59, -61]
-390f1
##PAGE=	F1=1638.51
##FIRST=	23151.189942674980557,	6007.9998942000029274,	-0.42289590835571289063
##DATA TABLE=	(F2++(Y..Y)), PROFILE
6008c7L1nP7j01QM4K5L5j07R0L9r0L5m0k3k1P6K1L0o8j63J45j05Q2J07J2j37p3O9J08j07J63
5607A20k04l9J08J27k4n1O3m0q2J7j7J26k20J03L2N5n0p9R1Q2Jj45J16j41j1k9J7J87p2n3
5232a2O2j62l3L6Q7K2J2k8J04j31k6R2n5O6n4k3OoJ7RLJ10l1j39J73j33m8J02o8J3P0K8p4
4819a1K9l8j93J33J1K9L5L0k0J4J11j48Rk0J5K6J13j53Ok5nP6J53k18J28k05R5j5j9J71j63
4430d9P9q1oJ80P1k18K5l6l7J22j27N3l1Qmk7K3M7j39J96Oj31p6K03M2j3k1l3q2N0J13j98
4030i1K12q3o9J8R0Ol3p0p7J27L4Op3M0p5k3q8R2l0m1OK9J04Q5j46J13k4N0k8j25J19l0L0
3617E5j24j4P5J13j98R9J71l36J90K9j94J27o3M7J1J8M7l4J07L1j03o0N9j25P4J17l9j97K8
3254h9J70j52O6J1K2p0q4L9P6O9p4m7J18l9p1R5n5J14j41J31J7j37RM3q0P9J24j03J7q7K42
$$ y = [-37, -6, -11, 66, -35, -27, 17, 42, 77, -30, 60, 99, 9, 44, 4, -19, -40, 36, 57, 87, 19, -144, 1, -104, -22, 85, 97, -40, -113, -44, 64, -43, 120, -84, -123, -15, 112, 88, 37, 100, 60, -22, -5, -22, 104, -116, -13, 19, 74, 24, -55, 36, 118, 119, -26, 90, -51, -62, -91, -74, 113, 41, -12, 50, -112, -145, -109, -22, 0, 12, -16, 88, -43, -69, 23, -32, 34, -20, -43, -37, -43, -26, -17, -14, 96, 65, -74, 99, -34, -82, 20, -48, -35, 35, 63, -11, 18, -20, -213, -80, -69, -40, -5, 25, 5, 19, 130, -18, -9, -29, -14, 12, 125, -28, -22, -47, -52, 24, 177, -41, 87, -118, -23, -38, -57, 114, -49, 30, -51, -57, 123, 194, -24, 1, -35, -72, 50, -77, -24, -55, -47, -51, -78, -55, -8, -147, 49, 55, -76, -152, 51, 93, 80, 59, 26, -56, -6, 107, -91, 121, 38, -31, -13, 77, 83, 50, -20, -97, 30, 64, 70, -3, 37, -38, -61, -149, -57, -87, -128, -122, -93, 11, 96, -50, 63, 39, 89, 61, -64, 55, 25, 55, -69, -83, -8, 105, -93, 6, 177, -159, 31, 60, -134, -7, -70, -23, -12, 6, 53, 19, 126, 157, 54, -6, 53, -72, 2, 119, 80, -117, -89, 81, -71, -5, 6, 28, -42, -126, -87, -11, 58, -16, -63, 55, 16, -55, 40, -15, 99, -42, 89, 106, -31, -22, 21, -59, 20, 144, 41, 58, -29, 213]
2865B13o4qj20J6ko5l0J42j5p3Ln8k3J41q2q0Q3n0N3J06n9R2k19J63q3O3M6j11O7N3o9m4J00
2452H6K0j11m7R7j13m3R1Pj6o3O4j1J5K4o5J37j08J13k49J61J7N7o2m6ln5J88q3o2O4j6J00
2052H8j63M5j03P4n6J59q3N0j1j24K52n5j49P5J6j06L3O6M0j36m5K15%m9P9p3k9p0k6m3j4
1664a43J22k3J30p9J22J7l6k47J07K8O9k5j4J04j00n2Q1m5p1M1N7q0j0k9J33J8k06J91j17
1300e7l8N7L0J1n9N2j9j63L00k26J92mnj20J44q2K8K4n5J7Oj18K02q9q1R7n5N9K2j03K26j75
900A8nj09J29j02J24n3m2J1k6n2Q8m7P0J16q1r7j7R8o1MJ65k08P1R3m0L8r7jJ95n7j96K9L3
487iP7j23K7K3o7LM7M2K3Q1k6QPr3p8Q7kK2j04K2J18J3j36n8J26p0LQ4J34r8Oo1k6M7m5mp0
23g0m2R3r6L4k2J29j03R0l3J8m6o2n0J93J55k37J27o5n9L0k5%M2J3p4O9j06PK00r6k2m1q
$$ y = [213, 149, 141, 21, 37, 35, -30, -60, 82, 67, -6, -3, -61, -84, 57, -25, -105, -22, -72, -19, 87, 28, 120, -99, 64, -19, 44, 90, -21, 46, 99, 30, -14, 86, 106, -5, -52, 45, -68, -111, -20, -13, -29, -92, -28, -39, -24, 0, -65, 72, -36, 77, -172, -11, 6, 63, 1, -45, -48, -103, 85, 2, -60, 4, -12, 88, -75, -30, -133, -59, -115, 44, -39, 11, 0, -124, 128, 73, -76, -1, 15, -91, -58, 8, 48, -88, -133, 82, 82, 33, 112, 39, 10, -60, -86, -129, -143, -21, -44, 86, 7, 129, 146, 110, -137, -30, -2, 67, 42, 28, 132, 32, -20, 61, 16, -55, -14, 43, -37, -47, -76, 57, 75, -131, 60, -57, -95, -38, -8, 3, -56, -4, -23, -186, 114, -112, 80, 76, 71, -49, 95, 13, 41, 65, 10, 27, 33, -85, 117, 28, -53, 44, -11, 48, 70, -33, 193, 18, 13, -96, 33, -69, 55, 2, -40, -29, -55, -107, -19, -66, 4, 120, 39, -58, -75, 23, -38, -34, 131, -77, -6, 87, 47, 85, -12, -13, 182, 125, -71, -42, -9, 68, -55, -28, -5, -72, -69, -22, 20, 43, 124, 98, 106, 113, 20, -58, 29, 27, 49, -55, -33, 85, 98, -38, -96, 30, -40, -37, 47, 181, 83, 89, 28, 2, 49, 4, 0, -70, -112, -19, -115, -81, -103, 26, -77, 13, -20, -2, -48, -110, -160, 33, 188, -49, 78, 13, -46, -16, -41, -41, 1, 14, -60, 9, -97, -90, 110, 14, -8, -49, -57]
-390e7
##PAGE=	F1=1544.15
##FIRST=	23151.189942674980557,	6007.9998942000029274,	-0.13270729780197143555
##DATA TABLE=	(F2++(Y..Y)), PROFILE
6008c5K6l3P3q5mQ9L6J0r9J05Kq5O1l8n8JO0J0K1m9j58J33j05J48N3K4q8r5O8L8r6K18j64
5595a6j07J19J12k1p0R8p6n8M0j7Q7k39J32qN1k0n1P5R7pj31J05r7m4ol6J63n3m4N9j35j8
5194a16L1Q9j3L3KJ06j54r8J45n5N6n9k8K5m6L4RLJ08Qj62J65p5o6R6j40M1L0Q5p0j4Nj51
4781a76R9M2rO6l2J0M1R8j61JJLOJ43j33%k8n4O7K10k63J48j89M9K3l5J12q9R0j06l9J76J41
4368B12k33l2N6l4L2n7Qj4O6k8o1L9P2j09J58Rj50j10J61O1K8K0p2r6L1J12j39J66k3q4N2
3980D1O7k2o5k1j20J57J6J2q6N9m3p3n9P7op7N3PO7P9j08J00n7R6m6j13J29Ml9j00m5P9J05
3567F8j45J07J29k87J73J3j74J20m8Q0m9j3J10n1R0Qn6j30L5p2R3J11l1k05R0Q8j39N9K6J
3191Al4j04P1K0R9n9m7J21n3n6R3o1J60j72N9M8j06oM1q7J10J03j30nm1J33o3Q2n5Kj3o7j5
$$ y = [-35, -9, -42, 31, -54, -58, 31, 67, 77, -22, 83, 85, 0, 61, 23, -35, -34, 26, 36, 57, 8, -150, -17, -122, 26, 79, 103, 15, -80, -12, 26, -70, 148, -16, -123, -4, 108, 87, 17, 115, 39, -19, 21, 4, 91, -148, -16, -24, 27, 7, -44, 31, 128, 121, -10, 95, -2, -46, -52, -88, 75, 22, -22, 37, -98, -116, -85, 4, -9, 24, 26, 132, -22, -120, 25, -30, 26, -33, -61, -36, -82, -48, -39, -36, 72, 80, -82, 83, 8, -58, 38, -102, -61, -31, 54, -16, -30, -25, -176, -77, -35, -44, 22, -10, 0, 41, 139, -22, -21, -20, -17, -11, 132, -1, -1, -29, -83, -16, 194, -69, 79, -110, -61, -38, -73, 39, -50, 40, -66, -105, 71, 212, -21, -53, 3, -31, 1, -56, -48, -62, 4, -24, -85, -46, 26, -83, 75, 84, -66, -176, -15, 46, 74, 94, 22, -74, -43, 69, -70, 96, 73, -11, 41, 108, 86, 21, 0, -120, 37, 53, 65, -21, 38, -5, -78, -137, -60, -66, -143, -90, -83, -16, 63, -45, 55, -2, 94, 48, -65, 64, 68, 29, -71, -116, -37, 68, -77, 30, 159, -128, 45, 58, -116, 4, -44, 36, -13, -26, 84, 33, 123, 131, 75, -55, -20, -92, 1, 112, 81, -124, -34, 54, -85, -26, 0, 1, -33, -137, -66, -46, 53, -6, -53, 68, 15, -41, 52, -9, 151, -21, 38, 86, -20, -26, 15, -72, 38, 141, 11, 6, -35, 98, 35, 117, 62, 64, 51, -16, -31]
2778c1J58m5l6j4n8p0J39n0q0M5m2K5J26l5R3k09J26p6J03lj10O0P1p2l5J03J9r3j2L9j13
2390g7K1M2J0l5n6M3M2L0l2m9J85j66J12k47J46L1M5k3k0j7o2J55p9j07O3P5N0j35L5r9O8
2002e1j07J52l1O4j8j49K48k6j11J8j3n1kO5L3j17oJ52N4m3J20j26q6J0o7Pn0O9L5J42j29
1613a4J10L8k3k58P3M4O1L8o5R7o5n1O3%j10K2Q1l9l3o9J45O3k43J59n5p5R6L9J0n3k7M0j25
1200a26K44j83J41K9m6q7J04m7NJ6ljoj17J97j17l3J8jQ4Rq0J25j11j4m8J11r2J01j01l5J8
800d6J0r6J01j7N0J16o8q2m6P8JNR8j70N8N2k7P7j00m4J88J5j81rJ1N5r7M4K8o8K3N4M1m4
374A0P8K8lj1q0p3O2JL2q6K4Q6J8j35m4J53o1NM8J42j53N7m2l4Pk8Mr8j8M1o3M8j8J21q0Q8
-77B6m3K4m6k1j14K31Q3k05J18n8j6J5j1k9L4L1j22Q6p9qK34q9n7j8r
$$ y = [-31, 127, 82, 46, 32, -26, -96, 43, -7, -87, -42, -84, -59, 67, 32, 125, -84, 42, -34, 69, 66, -44, 16, 87, 15, -20, 83, 102, 9, -3, 36, -77, -56, -14, -4, -39, -95, -52, -10, 20, -12, -61, 124, -42, 70, -177, -31, 0, 45, 22, 2, -15, -77, 78, -1, -108, -45, 30, 80, -55, -20, -119, -51, -158, -6, -37, 27, 9, -140, 108, 82, -29, -11, -24, -75, -77, -12, 21, -96, -102, 50, 104, 61, 181, 55, -31, -21, -88, -81, -131, -62, -27, 115, -14, 96, 134, 111, -147, -74, -30, 31, 69, 4, 101, 36, -15, 48, 48, -62, -40, 41, 2, -31, -100, 45, 108, -135, 24, -31, -106, -10, 29, 39, -14, -41, -1, -126, 118, -65, 76, 105, 59, -28, 76, 29, 34, 50, 47, 46, 40, -77, 120, 3, -30, -12, -13, 71, 80, 0, 125, 14, 0, -48, 63, -29, 72, -29, -64, -46, -36, -132, -31, -48, 2, 118, 50, -32, -78, 0, 1, 6, 104, -66, -8, 44, 17, 94, -6, -50, 138, 153, -28, -37, -26, 29, -68, -24, 4, -64, -41, 13, 54, 10, 88, 116, 113, 102, 22, -51, 11, 12, 44, -42, -18, 68, 86, -49, -93, 60, -1, 4, 52, 194, 41, 98, 56, 22, 29, 1, 5, -93, -111, -70, -133, -85, -103, 18, -62, 26, -17, 7, -39, -60, -174, 57, 140, -65, 53, -5, -21, -6, -17, -46, -12, 19, -103, -17, -96, -104, 130, 41, -16, -34, -43]
-390d3
##PAGE=	F1=1449.8
##FIRST=	23151.189942674980557,	6007.9998942000029274,	-0.02353557199239730835
##DATA TABLE=	(F2++(Y..Y)), PROFILE
6008c9L2p5P1n0qJ20L7k5n7Q6l3q0R6k9o4J9K3j3Okj43P8p6K02k5L2k7r6O1Lj21K31r1j52
5582a09J63M3k5p1J02q7l6O3RJ8k51J72o9P5jk7M9J14k0q9O2l8p2J5p2J23l6l7O2r2rK4P8
5169C1o1N9L0J14j69j62J99p3N1o6k8N9q8M9J3mR4L0j54J32nq0N9j76L2L0J34q9m1M8q8O7
4769e3M5n9J05r0N1N4M2j26K2mj4jJ44p9nl2j03N4K23k51J52j56qM6l5N9l2R4j17o5J57J90
4368B08k17j04J43op6J5k9J7J25m6j07N5P0n0Q7k1j11j24Q9P1P8L6r5r8J2Q6o0J12L3j09J07
3980I1L1m8p8K2j31J56J1Mj01N4J7q4m1L9J2q6O9JL9N4n6P2q9J10n2o9J10J7p7n4o1N2J02
3567C6r4J00P6j90J41k9j31J02l1J32j36l7J44m8O9j1k7j72JL5Q2Q7l1j87J47J2j05L7K7o
3191gj3r4J44m8O6m7l0J13o9m2Q9p3J73j58k4P4o5k5M4q1J05J04j67k3K8N4m0J15k2rj4o1
$$ y = [-39, -7, -82, -11, -61, -69, 51, 88, 63, 6, 92, 59, -21, 75, 46, -18, 1, 24, 11, 17, 15, -128, -50, -126, 76, 51, 83, 56, -40, 21, 24, -97, 134, 43, -109, 54, 97, 72, 1, 103, 16, -20, 43, 52, 70, -181, -9, -78, -3, -4, -31, 18, 132, 112, 23, 85, 47, -25, -10, -82, 41, 5, -32, 30, -62, -71, -47, 31, -30, 29, 59, 173, 4, -158, 41, -32, 19, -47, -75, -16, -104, -55, -42, -46, 48, 78, -76, 56, 51, -29, 30, -146, -114, -84, 50, -39, -80, -32, -120, -53, -8, -67, 38, -52, -1, 53, 95, -31, -9, -13, -27, -28, 116, 37, 32, 0, -103, -49, 174, -77, 75, -81, -89, -43, -78, -19, -51, 43, -74, -139, 18, 208, -9, -113, 30, 24, -52, -37, -66, -49, 76, 30, -77, -22, 48, -2, 85, 64, -47, -171, -82, -11, 67, 103, 8, -90, -78, 8, -52, 60, 93, -16, 91, 122, 74, -4, 18, -113, 43, 54, 58, -43, 11, 28, -56, -97, -58, -46, -132, -63, -62, -23, 31, -25, 47, -42, 68, 16, -53, 57, 74, -3, -57, -118, -66, 36, -58, 42, 118, -72, 69, 40, -91, 11, -20, 112, -24, -61, 83, 35, 104, 93, 66, -106, -105, -70, 12, 99, 68, -119, 28, 40, -65, -28, -1, -7, -20, -114, 30, -18, 48, 1, -29, 84, 15, -27, 62, -11, 162, 4, -20, 54, -11, -36, 8, -73, 32, 136, -31, -54, -26, 28, -12, 103, 81, 72, 58, -3]
2790cj1J49n6Jk8n5q6J10k8n4L5o8J0J24oP5j58N8p4J46m1q2K6P7o9j8Q2K5q3L1j1q1R8m8
2365a3K4o1n7N3O7M3o0k3J66j82J09k29J25K3L4lM9j8r6J27n8j79P3J40mq1J1o3L6j24J11
1977f0K5N2nj39J93pm6l1l6jj9M0Oo0L2R1P0m0J55j49j51R7r2N7q5K0Q3J34j85J07M7Rk47
1563a35M9L7N6Q8j27R0k4l6M2K6j37J8P3K2n2j19J61R5k38R8j3r2J18P3nk4j02J11j12J72
1188A13j21P5M0p5n5P8l1pOL8rk1p0J44j18Kn5P0Q4l0l0J8m2l3L5Q1o4M1j06k4J4O0j36Q0
762d8J5K7J21p4m1o4N1P1j3K1j34O5J4m5J37r7p8J48O3j51j6jK6r9Q8J3m1M1N4K5j20P1Q8
349A17k6Lp4m1J9J4K9p8K7M7J2q8l6J37j1kqJ38j83P8j9l1k7jjj16L6j0m3N0lJ15n1O0l9L2
-102B6o4K9j69K52Kj36J06o1J3qjo5N7M3j29O6n6J0K23q5n9j0o
$$ y = [-3, -14, 135, 79, 80, 52, -3, -89, 21, -7, -61, -26, -94, -84, 40, 34, 109, -49, 9, -65, 81, 40, -42, -16, 61, -8, -26, 56, 81, -2, 29, 18, -63, 35, -13, 11, -50, -107, -54, 13, 56, -4, -27, 139, -43, 66, -163, -38, -15, 19, 16, 65, 47, -49, 78, 20, -159, -86, 54, 50, -31, -20, -83, -47, -171, -60, -35, 17, 12, -127, 66, 59, 13, -18, -54, -55, -74, -34, -28, -88, -56, 35, 105, 65, 220, 71, -80, 17, -75, -18, -103, -83, 0, 134, -51, 56, 103, 112, -135, -86, -49, 7, 95, -32, 58, 34, -2, 40, 66, -71, -53, 20, 42, -10, -129, 32, 127, -111, -13, -26, -118, 0, 73, 68, 44, -58, 53, -59, 113, -8, 67, 107, 32, -23, 55, 24, 17, 23, 61, 52, 31, -39, 105, -13, -11, -66, 4, 88, 58, 28, 46, 4, -29, 6, 87, 23, 64, -42, -66, -52, 8, -128, -48, -33, -6, 115, 41, 0, -64, -13, 58, 45, 66, -68, -3, 11, -34, 103, 6, -72, 76, 139, -12, -28, -29, -3, -102, -14, -1, -42, -1, 53, 78, -42, 29, 117, 91, 94, 20, -21, -2, 12, 41, -37, -10, 37, 49, -39, -75, 62, 51, 49, 41, 179, -4, 74, 55, 24, -3, -4, -5, -121, -85, -95, -138, -88, -91, 24, -27, 33, -6, 26, -38, -9, -178, 74, 76, -60, 46, -15, -2, -10, -11, -76, -19, 24, -105, -39, -95, -85, 138, 53, -6, -16, -22]
-390b2
##PAGE=	F1=1355.45
##FIRST=	23151.189942674980557,	6007.9998942000029274,	-0.23045964539051055908
##DATA TABLE=	(F2++(Y..Y)), PROFILE
6008d8M3j13P5lj8J29L4o0QL2m1p6J20j9m4L4k5l5rN4j22Kl5K31j08M4K5p7N2Rj79K17k1j66
5582i0K14l6n0n0Q5q2j8P4N8o3k42K01j28R9K1j2J6J28l3l2QJ5p8J7r8R1j0m6O9n0j0K0N5
5169D3q5P8L4J21j53j95K16j05N3o5k4R5j18O4J0j2Q7L0j24Q2N6q8Nj72LN3J60j05n1Q1m1
4781f7O2J7r8J29j33Q2N5l1o9O5l3j7J2J11%j9l0j39L4K02j90J31j19m7M7k1K0j2J03r9q1
4393a35J14K06j77j65J98L0j50O4n7N7J63o0j42O1M9JK2n9m8j19L1O7J08K0q6r0oO0PN7O7
4005H8j27J58j1n8o6M5j13J34J3j2j17K9Q4m9m0j2K5o7N3RL2K3j8L5j04Q8n5NP3Lq1Om6JQ8
3567A6n9Q9K8r0J14p2q0O0k3J89k08n4J52m1N7j5l5j68k1J43M3N3l0j43J68l3p2K0J9Mj3m7
3166d9K83j24n7n3PR2o6n5Q7p0J52j23r2R5m8l1M9m6N9J10k00j9R5KoJ08l2j4nm8j6J33o2
$$ y = [-48, -5, -118, -43, -46, -64, 65, 99, 39, 47, 79, 38, -38, 82, 63, 19, 53, 28, -7, -16, 38, -84, -82, -117, 114, 6, 50, 75, -2, 50, 59, -120, 97, 76, -90, 124, 88, 38, -12, 73, -9, -27, 47, 105, 42, -200, 1, -127, -28, -7, -19, -3, 125, 92, 60, 68, 83, 5, 22, -76, 15, 5, -41, 28, -22, -32, -12, 43, -42, 36, 70, 191, 38, -157, 59, -46, 7, -58, -82, 13, -105, -41, -31, -43, 44, 74, -50, 32, 88, 0, 5, -167, -164, -111, 49, -56, -107, -26, -67, -5, 12, -86, 43, -90, -8, 47, 16, -53, 12, -21, -38, -26, 85, 85, 66, 36, -103, -69, 133, -57, 74, -45, -92, -45, -66, -46, -58, 45, -54, -135, -21, 185, 8, -157, 41, 71, -79, -15, -72, -15, 148, 88, -54, 7, 56, 57, 79, 20, -28, -147, -116, -49, 59, 79, -7, -97, -103, -43, -36, 21, 88, -39, 119, 108, 50, -16, 29, -84, 50, 63, 51, -66, -37, 47, -2, -42, -54, -29, -96, -43, -34, -2, 21, 3, 38, -66, 22, -33, -28, 45, 48, -33, -27, -73, -72, 16, -43, 46, 74, -16, 98, 26, -54, 6, -17, 172, -36, -90, 62, 21, 78, 63, 28, -140, -161, -18, 25, 78, 48, -95, 73, 40, -32, -12, 7, 11, -2, -49, 234, 110, 53, 0, 7, 99, 33, -22, 65, -5, 147, 24, -68, 27, -21, -52, -3, -49, 10, 120, -80, -99, -4, -2, -8, 100, 68, 54, 49, 1, -15, 118, 56]
2753E6K4k7m2q4O5oj8O0j15jJ06J5N0q3k6p3J79o7k7j9O8n8nM8K5q6P7m6j4J62j52L9q8o0
2327a23R4N0N4n8OR4j65J06j97J09LK4j0J32Lj40R7k3k39R4J43n0j5j2j1j8j02O1O0K8Jr4
1926i8J17j0K3n4l6J5j2Rj8lM4N9N3l6J64j34j97J54r2R1j14lJ02J12k25J09N1M5k08K9PN6
1526@J17j80P4J7k1L4L6j45K4K9Q6p0j54J75J10j92K9kr0J26J07l2J4j46J79j24R6o2J6L3
1150H4p9m5P4k4j2mM9Jk9KN6r1K5j08J46M0p0L2p1J7m7J13M9l9l8o9j7nJ24j56K6M2nJ27r8
712@L1p4K0J31l0m3j09Q9k1r2K06q9q5Q1P3j15J6j6Pj26J36nPL5N6mj77O5J35m9L3p7J4k3
286@L6Kp8L0K3jj3m5P3P2j9n5J28j89N4Pk3n7M6j7j09R4l6n1M7J7J09l3J6j9L5q4P3k05K49
-152G7o8m9R3o4J1k8J6r6Q5M7r7K1m0M5J73p8k8j9k
$$ y = [56, 80, 53, 11, -73, -8, -14, -32, 28, -87, -88, 18, 33, 83, 0, -26, -99, 80, 13, -14, -33, 35, -23, -28, 20, 45, -41, 36, -10, -24, 138, -14, 25, -63, -123, -29, 21, 75, 17, 23, 117, -48, 58, -139, -30, -27, -3, -13, 119, 122, -18, 79, 56, -183, -89, 54, 4, -11, -23, -34, -52, -154, -93, -33, -5, -4, -98, 19, 9, 32, -22, -58, -43, -55, -46, -64, -67, -23, 36, 89, 53, 217, 83, -114, 40, -52, 39, -75, -78, 24, 136, -89, 20, 71, 116, -92, -63, -56, 0, 117, -63, 11, 28, 7, 41, 77, -68, -44, -15, 71, 1, -153, 22, 132, -60, -31, -33, -123, 3, 110, 78, 92, -54, 125, 1, 97, 35, 51, 84, 5, -40, 34, 10, -2, -6, 43, 44, 15, 17, 73, -18, 7, -101, 45, 85, 15, 47, -24, -7, -54, 59, 108, 69, 31, -38, -55, -60, 64, -92, -66, -24, -29, 98, 0, 31, -43, -23, 108, 78, 35, -74, 15, -6, -98, 108, 19, -66, 15, 88, -27, -11, -27, -20, -146, -10, -15, -8, 27, 83, 79, -98, -33, 102, 53, 86, 9, 23, 0, 36, 38, -40, -10, 13, 12, -1, -46, 27, 99, 80, 25, 153, -36, 18, 25, 2, -55, -9, -26, -135, -41, -77, -128, -81, -64, 45, 12, 28, 9, 44, -40, 33, -172, 77, 9, -40, 53, -11, 0, -28, -12, -108, -23, 24, -73, -52, -92, -47, 126, 48, 20, 1, -1]
-390a
##PAGE=	F1=1261.09
##FIRST=	23151.189942674980557,	6007.9998942000029274,	-0.37434786558151245117
##DATA TABLE=	(F2++(Y..Y)), PROFILE
6008e6M7j30Q7L5l9J19L3r0Q0l6j4p2J13pj4M1o6m5j8J02j06o2qK31j67O4N4m6M1L8k48J95
5607E6J9j38K31p8j04j4O8p7oO7J21j36j92J96j73J01O0j3k2J40m2J6l1M2n0Mj26P9K5o7O9
5219B5k1j5J5K4n7Q1OJ14j00j82J73j34O0n0j8J20j30P9pj8R9J6q9L0R2q7m7j38k7O4J67r3
4819d8n1J04l6Q1k0j07J15j52Q8M6q2k1J08p5MM2N8P7m5j7j53QJ66j11Q6q1m8K9jj1k4J27
4418E6o1q4M2J97j25j92K13M3j55P5o4Q6J68p4j57O0K7K5j4p7qr7J0O0R7j6n4p0k6N0M4J2
4017iO9j26J87n4m2l1L1o8J00Qj4j31rJ34J8o3n1L7l6J9L1M1j0klr5M6n5P9L7k9o2O1Kn5N3
3567Hm5P5Nk5J02q8l6kl0K27k31n7J40m2N6lp1j29k3J98nK3j8q6J42m1n4K0J1L7l7K1M68j89
3141C21k48q1O1N2l4r6R1m9J15j02j25J04o2j9N3J6JR3k12J5J30k9K1Q6o5k7J5k9k8J28p1
$$ y = [-56, -9, -139, -52, -17, -56, 63, 96, 6, 86, 50, 36, -36, 77, 70, 56, 97, 31, -14, -32, 70, -36, -98, -106, 125, -42, 22, 76, 30, 71, 109, -139, 56, 75, -63, 168, 90, -14, -28, 40, -37, -43, 24, 145, 9, -183, 13, -160, -59, 1, -12, -34, 106, 64, 80, 49, 91, 41, 45, -81, -2, 23, -44, 25, 4, -11, 4, 28, -29, 52, 58, 172, 72, -110, 63, -71, -11, -61, -79, 41, -89, -10, -17, -35, 64, 80, -9, 21, 113, 26, -21, -159, -186, -122, 45, -48, -99, 5, -31, 50, 30, -77, 38, -114, -26, 20, -62, -83, 25, -50, -46, -4, 54, 131, 86, 69, -84, -76, 90, -21, 65, -16, -64, -35, -36, -47, -71, 56, -5, -89, -47, 150, 25, -167, 46, 89, -66, 9, -55, 31, 199, 125, -32, 28, 55, 80, 66, -11, -19, -116, -106, -46, 51, 35, -19, -89, -115, -65, -21, -9, 60, -66, 121, 67, 25, -6, 25, -43, 57, 65, 51, -80, -89, 45, 63, 0, -51, -14, -50, -31, 0, 41, 31, 29, 26, -69, -23, -78, 1, 38, 9, -53, 8, 10, -45, 8, -37, 38, 43, 18, 120, 32, -4, -6, -36, 191, -40, -97, 43, 1, 57, 54, -17, -146, -169, 29, 24, 47, 29, -57, 85, 44, -10, 10, 21, 58, 21, 42, 510, 321, 73, -8, 53, 105, 71, -25, 66, 17, 132, 30, -95, 9, -53, -72, -19, -3, -2, 91, -121, -106, 24, -5, 16, 102, 37, 10, 25, -4, -32, 96, 25]
2753B5K4j1j5q9K5L1LJ08j61j1Q5J4K9jj08p1J91q5L9n1N2l8KJ1Or3J08n0N7J86k29M2j04
2340g9n4J44LO3l4K4jj21R9j64J03oNl4J94L6j65N8J5k49J07R7q5M5k2K4o7n8K5O8Mj7k5M7
1914b0k6P1m8lk0J8qk5J7K6O6K1l4J45r4k06J61o6J02j36KQ9Q7k39J21M7P5j48Ml3N6J30j98
1501f6L9M6j7M4M6j42K9l1J33q6j61J85J05j20k7j6p0J22J15o2L9j47K30j40K8l0k0K1n6o3
1125g2R0j8j3j0K2K3k0O1k9m6M1j32K01l7r3Q5j29N5l6J63K0l8j04qj5l7J88j52l9N5l3J24
725F7j32J13p4mJ61k5p9r9J15n5j43K58p7o6J0N3q4P2m1J1j65J64kN3mO6l3j93N8J51o0N3
324F9q0P6m1N1m0q0K5K8j8O3p2j5J64m1p7J20j83KL4j5q6J06l8o8J20k6p7M0L3J01l4l2J3
-89B2K8q7R4k08K16j10K7P8o1j2l3M3j13R0M0m5k8l0P8J06n9J4l6p
$$ y = [25, 49, 38, 23, -66, -41, -10, -7, 101, -60, -71, 14, 28, 57, 56, -52, -123, 68, -17, 22, -29, 23, -15, -13, -2, 4, -89, 19, -31, 26, 212, -17, 25, -79, -133, 11, 14, 77, 43, 67, 66, -55, 44, -120, -17, -23, -18, -52, 142, 178, 13, 71, 86, -163, -56, 41, -44, 1, -21, 3, -64, -122, -97, -29, -25, -42, -67, -20, -46, 25, -23, -26, -46, -28, -36, -61, -44, -18, 48, 69, 35, 180, 86, -120, 41, -25, 77, -59, -57, 32, 119, -120, 1, 48, 123, -25, -21, -54, 2, 132, -66, -27, 19, 2, 46, 92, -50, -21, -52, 81, -5, -166, 19, 124, 4, -23, -39, -109, 13, 128, 66, 105, -42, 188, 48, 76, 46, 26, 47, -9, -72, 18, 0, -13, -23, -1, 22, 2, 63, 34, -12, 29, -103, 98, 61, -32, 53, -76, -21, -57, 106, 126, 88, -16, -24, -39, -76, 112, -40, -79, -24, -57, 67, -65, 48, -26, -30, 131, 106, 27, -72, 43, -12, -155, 103, 26, -40, -30, 23, -61, 11, -30, -19, -184, -20, -22, 31, 27, 93, 60, -133, -75, 76, 16, 69, -11, 65, 24, 75, 35, -45, -20, 8, -10, 53, -19, -34, 130, 89, 12, 132, -51, -49, -15, -30, -116, -10, -48, -116, 4, -22, -99, -59, -26, 75, 41, 9, 22, 50, -37, 57, -151, 65, -45, -18, 60, -1, -13, -46, -3, -116, -26, 14, -31, -59, -89, -11, 95, 36, 50, 14, 7]
-390G
##PAGE=	F1=1166.74
##FIRST=	23151.189942674980557,	6007.9998942000029274,	-0.079013310372829437256
##DATA TABLE=	(F2++(Y..Y)), PROFILE
6008e7L3j16J00N3p2J00L3j06J41r1L3p0P6J5JM1q8l9rJ20j02r0oK01j80Q7N6rL2N4k90J63
5607A4K8o8J93o4j78K9O1q1mN0J79j81j03J47j91P6J13k6o4J40l7L8l8L4Orj59Q3N9q4N4o
5207A1k2J1j5K0P1m4Q5k4j24P8j49P1k5j2J26j19Q7l9k8J35Qp3pJ00p6q0r1m4L7J63m6n1J22
4794E6p5J05l5q7O3j41O3L1q9QJ26j14L9P7KJ34p8Mj44k5J33n0L2m0j1NJ2l8m4J60k2p7m1
4380f1J65p2j75K01K1j03N3m2R0J40q4j58N8J1K9j5p1po1J7N6N4n8j2l6n3N9M9k4M8r9J87
3980A07r1lJ0j5j0O8j8J2j33m8J51Q4j07n9M9oj2N8N8m8kl2o7Pm8J23On7l7J00O5j06Rm4N2
3542A6J7j1J02o3j1p2l4K21j97l9J16n9N4K3j07q3j2J87m3JMl7R3k0n8M3JQ4p2Q1O33k29m21
3128A08j22J11kJ9j36R6k1Q3j13j30J00r1J1N1Q2l3M3j94O6J20m2L1O6r8n0M1j6l5J38q5M
$$ y = [-57, -24, -140, -40, 13, -59, 41, 74, -32, 109, 18, 51, -19, 57, 72, 73, 114, 26, -13, -22, 98, -4, -94, -100, 101, -79, 8, 64, 55, 87, 141, -149, 14, 42, -26, 167, 103, -75, -46, 15, -66, -70, -20, 159, -22, -125, 22, -169, -93, 20, -6, -70, 70, 33, 71, 33, 67, 73, 64, -95, -12, 47, -37, 17, 11, -11, 0, -15, 5, 76, 32, 117, 93, -31, 47, -102, -31, -56, -68, 58, -61, 26, -13, -41, 94, 102, 29, 22, 122, 46, -34, -125, -169, -132, 31, -15, -66, 56, -19, 86, 51, -36, 27, -114, -51, -20, -109, -101, 25, -89, -50, 27, 29, 163, 85, 89, -55, -80, 53, 3, 35, -5, -16, -11, 1, -37, -81, 79, 57, -20, -61, 104, 32, -143, 58, 79, -24, 29, -13, 77, 217, 133, -25, 33, 44, 73, 58, -13, -20, -81, -64, -8, 46, -12, -24, -60, -113, -54, -5, -29, 19, -80, 107, 16, 13, 23, 8, -2, 66, 48, 60, -73, -121, 30, 114, 7, -52, -3, -9, -21, 37, 95, 47, 45, 13, -54, -47, -95, 28, 34, -23, -60, 40, 105, -1, 8, -36, 16, 33, 22, 124, 61, 50, -22, -56, 165, -32, -71, 45, -14, 40, 63, -44, -127, -139, 48, 5, 6, 10, -27, 66, 46, -12, 31, 32, 116, 44, 125, 758, 529, 108, -14, 97, 95, 114, -22, 74, 53, 136, 23, -107, -7, -98, -87, -36, 46, 13, 56, -138, -72, 48, 6, 37, 103, 5, -45, -4, -20, -55, 83, -2, 2]
2740BQK0j06OP6KJ54j85j6P0j1J6P9j67p9J79j02J05p0N1k0J8k8l0r1J19k8R9J60k55L2j02
2340i4l8J77m7O5KK3q1o1Q5j49J09J0l1n5K14O0j51J8L9j98R2L9j11R1j5K1q6k0J5N1on1L6
1926d7Kl6Q3k1N0r1O1pk2pjR5jl7J07n0j83J23k1R9j50J0O6O9k26J36L3R5q4k8o4N5J31j67
1501b8j7N1k4O0O4j33K9p9J48r8j38J91Q0m6o1l4m3J13R0q9M1j11K58j49j7l0k9J1j8q9J15
1113A8k3Jj6l5M7JP8p2jN6j22K15j19r9J21j57P0JJ80kp4j26M8j1p3K28j30r0N6l9J00j59
712a28J71o2j4J55Pr0r3J22q4j72K66n4l6m7L1o0J21p0L1j92J59K6Q1o8Q0m5j66N1J29n4M6
324D1p9J25k8N4p9q2PN8l9J29j11r4K40o4p1J15j78m0N6j8j11J68n7oR5J1r6K8L7R1n2o3M0
-89B7J0o2Q2j69J58j27P1O8m8l8k2P2j07N7K3Ln9l1R3M5k1M1m7j8
$$ y = [2, 10, 30, -76, -70, 6, 8, 162, -23, -39, 31, 20, 36, 115, -52, -131, 48, -54, 51, -19, 32, 12, 30, 2, -28, -119, 0, -28, 71, 231, -24, 8, -94, -132, 45, -2, 63, 65, 88, 7, -54, 31, -118, -9, 1, -30, -85, 129, 189, 38, 56, 95, -103, -11, 28, -83, 8, -7, 14, -72, -92, -77, -26, -32, -83, -47, -45, -81, 2, -19, 31, -60, 1, -6, -28, -35, -36, 59, 58, 21, 128, 78, -105, 18, -3, 96, -54, -44, 22, 91, -135, 1, 34, 129, 45, 17, -47, 8, 139, -28, -45, 6, -18, 42, 106, -27, 2, -77, 71, -27, -165, 26, 106, 60, -1, -35, -78, 35, 125, 36, 77, -34, 224, 75, 58, 28, -1, 10, -8, -97, 18, -5, -4, -20, -55, -8, -7, 71, -1, -2, 54, -68, 147, 28, -71, 50, -107, -37, -36, 144, 142, 68, -58, -10, -21, -94, 134, 4, -86, -30, -69, 31, -128, 43, -19, -33, 122, 129, 39, -54, 68, -16, -188, 78, 24, -12, -59, -28, -88, 33, -37, -6, -198, -39, -13, 68, 0, 80, 35, -131, -80, 49, -5, 41, -38, 87, 59, 113, 34, -48, -41, 17, -22, 107, -4, -98, 142, 78, 7, 122, -56, -96, -40, -58, -169, -1, -58, -64, 31, 42, -54, -26, 11, 102, 50, -13, 27, 37, -25, 57, -112, 46, -81, -10, 58, 10, -28, -50, 22, -85, -28, -5, -2, -61, -92, 1, 46, 25, 66, 19, 1]
-390A
##PAGE=	F1=1072.39
##FIRST=	23151.189942674980557,	6007.9998942000029274,	0.38193717598915100098
##DATA TABLE=	(F2++(Y..Y)), PROFILE
6008e2J0q6J07N7j13Q6K6j03J80j16P5p4K8M5lL2q2k8J8J03j05p5k9J49j49J02M3K2L0L1k79
5620a50J25J3K8J15j2k46O3O9r8qL4K16j89nP1j74L4J63m3j10J24k0M1j5rP2pj91R0P7q1K3
5219@Pl1mm4J18N2r0L7M6m2l6j41Q2klJ11q4P4p2m9J80K2q1k6Q8n1q9n0m4k2J49K0o0J36j28
4781b7J10qn3rj03J9Nn2K3J13j34O5J06m7J58j02K5j11p1J08j9j1nN2j0J3n9n1J84lo3j09
4380f6J11j9j24J83k7m5J7QO7J01q9j56O3KL3Mn2l9j1L1M2J3r8K4J1q0P2L1m3J9n2J58j15
3967b6M3M0p4M3M9n8N8j15q2J39J19j59l3N7K0k5P4O3q3jm4l1j7l4J19j2o5j7J13J18j47k0
3567A2m6K1N0l6J06qmj25k0J65j33kQ7q2L9N5j18n9NJ30o0j8L1j6N4J3p1P0j0J29j01J04P03
3153H65k33m83j61J33n8Q1j46R4rP3j43j26Q1j09N1L9J26k0l1j55J17P1l7K3N1j05p7O1qm2
$$ y = [-52, -42, -128, -21, 36, -77, 9, 35, -68, 112, -4, 71, -3, 25, 70, 67, 99, 17, -11, 7, 110, 5, -70, -99, 50, -99, 3, 46, 68, 98, 129, -150, -25, -12, 16, 131, 119, -127, -64, 5, -93, -101, -67, 149, -40, -45, 26, -148, -114, 49, 6, -104, 20, 0, 41, 26, 17, 89, 82, -109, -19, 58, -23, 0, 7, -24, -28, -72, 46, 98, 8, 45, 91, 49, 13, -128, -46, -48, -51, 60, -24, 50, -22, -71, 109, 131, 50, 24, 112, 61, -28, -78, -122, -144, 5, 25, -35, 101, -27, 83, 75, 22, 13, -90, -71, -66, -118, -95, 18, -116, -51, 55, 8, 166, 64, 89, -22, -93, 15, -4, -15, -20, 32, 22, 35, -24, -75, 109, 106, 43, -66, 45, 26, -98, 85, 58, 13, 30, 38, 105, 206, 117, -39, 24, 26, 59, 63, 11, -28, -39, -8, 34, 47, -51, -27, -16, -96, -24, 7, -36, -17, -69, 89, -26, 17, 57, -17, 26, 75, 17, 75, -40, -122, 17, 136, -23, -56, 1, 21, -4, 70, 133, 50, 49, 5, -26, -43, -77, 42, 30, -35, -52, 61, 179, 32, 12, -34, -13, 37, 1, 107, 99, 95, -30, -50, 115, -18, -20, 67, -15, 24, 79, -39, -98, -93, 37, -23, -41, -10, -26, 28, 41, -30, 40, 30, 159, 58, 162, 865, 632, 149, -12, 121, 63, 144, -2, 92, 83, 156, 13, -113, -32, -141, -90, -51, 75, 55, 24, -131, -14, 57, 20, 43, 94, -11, -88, -27, -35, -77]
2778g7J59j02k3J5N2j25PJ19j1J77j87jN7n0J1J44j92r5J47j21J63q6P1oN4o6p5p0J12MR0
2390I5J02k37K2r0j2J72o9O0K7J1j17JO7j62J13N1p8n8J93N9j02oL6j06M6Oj27J16%j3o4r
1989g3K5K2np5O5j5k4O5OJ06j68R6Ol1n1rJ21jm9P2k3j45O9K7Q9j52mN6O5j97J43J2J07l4
1563I6n8q0N3J22r5p7K9l5O6Q3j17K6r5J30r2j00J89L7J1p5m2j9J05M8j13K8o3K66j49l2m3
1175Dk6LJ8r6J38m5K7k3r6N3K6M8n9L0P6q6J83j74r4J34j66P1N4J72j6j29j01P0Mr8K21j03
775B0j08M6j0O0j69J81m1oJ19N4q4q4R9j00j70K22j2j8p8K9m0J33q4N3j93J28N9Q0j20Q8l1
387B3j16M8P4l7J9p5J44LN1r6q8k1R8o0J75j46j28K69q3m8J08j71m0O7m4j25K09o0N1L1N4
-2H6r7J5K6Q8p6p2M9j5j0L7q9Q6j22P5O7k9n7RQ7p8n%L1n7n4R1kK8M5m1l2
$$ y = [-77, 82, -20, -43, -28, 24, -101, -94, 25, 14, 191, 4, 3, 60, 10, 21, 165, -27, -122, 25, -96, 67, -19, 52, 46, 100, 34, -41, -111, 1, 5, 95, 197, -40, -18, -108, -120, 52, -17, 43, 70, 81, -36, -35, 32, -130, -17, 34, -44, -102, 91, 150, 48, 42, 78, -28, 18, 24, -103, 13, 13, 0, -64, -73, -48, -26, -31, -106, -41, -56, -80, -15, -9, 97, -71, 25, 31, 0, -51, -60, 61, 60, 11, 83, 60, -85, -16, 11, 100, -52, -56, 0, 65, -132, 11, 23, 130, 96, 38, -42, 11, 133, 38, -39, -10, -45, 21, 104, -13, 13, -82, 48, -44, -144, 45, 82, 93, 18, -24, -43, 62, 110, -3, 25, -38, 228, 79, 47, 4, -22, -19, -1, -97, 41, -4, 23, 0, -96, -43, -17, 31, -28, 2, 78, -8, 175, 1, -93, 41, -125, -54, 0, 172, 156, 27, -74, -4, 0, -98, 123, 20, -88, -42, -52, 8, -161, 20, -21, -27, 92, 146, 62, -22, 77, -23, -193, 29, 17, -1, -79, -50, -90, 43, -41, 12, -181, -53, 6, 86, -34, 54, 23, -93, -45, 29, -8, 11, -64, 80, 83, 134, 38, -50, -71, 27, -33, 142, -4, -132, 137, 54, 6, 114, -57, -97, -30, -74, -199, 10, -50, 1, 32, 86, -11, 4, 30, 118, 42, -30, 19, 4, -6, 31, -58, 28, -94, -19, 48, 19, -38, -29, 58, -20, -25, -25, 6, -51, -105, -14, -16, 12, 57, 16, -16]
-390a6
##PAGE=	F1=978.032
##FIRST=	23151.189942674980557,	6007.9998942000029274,	0.50245815515518188477
##DATA TABLE=	(F2++(Y..Y)), PROFILE
6008d6qn4R7O3j49Q1Rp9J88j20R0q3JP4j2J2n4j5M9N3r7l7n9Q9r5J02L5K9L7k3k17Q4j7J25
5582E3L3L5k76P5R0j20j3L3K13j62O0lj19pJ93n1j64R5ML8K3o9J22J3k13R2P1n2j5K6m7k9
5182g1m6J96K5j09j7R2L6j28j19Q8RJ0Q9l6L3r3p8K13N4j02l3P4j1q8k2l1q6J22Q6q1J33j57
4781d8R5M7j5p6n7k5k5ML1Q3j27N8J28q4J48j09M6o1j30Q6j4k7J2J22pjo2m3J91j8l9j46M6
4368a7K9o5J73o9l0j3O7K7P4q2j52P0j1N3K9m0q1M8L1J4lj32N1N3r1P3Ml8j3J4R8j22Q0M7
3942G6j20Q3M3r3R4p1j11J12J17k05J8N6N2k3O0M7j02Rl3mk1j9P7j7n1qJ05J35j73j7l8j7
3542c9Q6o8R5N0j0j42J2Q3p4M8N8r9MQ4r4o6J8P1n8m3M3j6M0M8q0Q2j8J48j08Q6O41k03m00
3128A79j79J09r3J35j19P9k0P9j65j26N8j10R8J5J28L2r9j07J40J2k0J4L3r0q5O6Kn7J72j10
$$ y = [-46, -54, -108, -11, 52, -97, -16, -7, -86, 102, -18, 72, -11, -10, 64, 52, 64, 10, -5, 44, 97, 0, -37, -96, -7, -102, 0, 35, 64, 101, 78, -139, -55, -72, 53, 86, 121, -155, -80, 10, -110, -123, -90, 123, -39, 21, 18, -101, -108, 85, 34, -130, -35, -31, 7, 30, -39, 83, 96, -117, -25, 46, -6, -21, 5, -42, -71, -117, 79, 104, -5, -22, 70, 106, -22, -141, -53, -44, -34, 55, 19, 52, -41, -119, 94, 148, 46, 13, 87, 76, -12, -34, -65, -151, -29, 57, -24, 109, -48, 47, 94, 79, 3, -54, -79, -104, -100, -69, 14, -113, -55, 73, -11, 137, 28, 74, 13, -117, -31, -45, -72, -60, 62, 55, 54, -8, -51, 140, 122, 83, -63, -17, 12, -53, 120, 51, 21, 8, 75, 102, 176, 94, -58, 12, 1, 54, 83, 43, -38, 10, 41, 55, 52, -80, -29, 24, -67, 6, 10, -28, -41, -27, 71, -51, 29, 76, -44, 39, 82, -11, 83, 12, -99, 13, 130, -75, -57, -1, 51, 28, 88, 135, 33, 42, 9, 5, -16, -35, 42, 25, -26, -34, 71, 206, 33, 16, -22, -39, 47, -21, 74, 124, 114, -28, -16, 67, -7, 41, 99, 0, 4, 88, -6, -72, -54, 17, -41, -84, -41, -57, -17, 31, -49, 33, 15, 163, 55, 141, 782, 579, 179, 0, 109, 16, 151, 32, 111, 91, 170, 5, -121, -63, -173, -75, -60, 68, 100, 1, -106, 34, 46, 26, 40, 73, -17, -102, -36, -34, -91, 81, -29]
2753b9m9OP3j29J9J33j6J76j75L7M1p9OJ76j76j13J00j32K04j07J00mJ17j02j05m2J05K3L5
2390I3M4k01K1p9K1J26m7M7K2Pj00N2M1j83R8R1j14m5J50L5l8%Jj2qNj27J22Rn6j1k4M4j8
1964c4Np0N7j0kL4K1J50k15R8K8o6q6J6J25J8p0N6j5j14K7P0P4j40m8O5Q3j64J23%J06pp7
1551C8q3N8J02j2j17j5l5N3Q4q9K4p7R4o3o4J75rL6p0m4qJ01J5j37J7l0K62j45j7l9k6j3L4
1138@o9J50q0N8l3j45L8N2rqM2R7m1J31j97p5J15j62P2J02J49k1j73n5N3L1r8J63q2r4K7N1
737a1K0j59J41j7K0O3R7p3p2N8r8j49J47M8k8q2N4j9R2o3O3j71R1O8N6j29Q2Mo9N1Nj6pp4
311g7J23L5M9q4j01n4J34p1J92j59j06K41j03j7R4j48NO3r8j21K22m9Q5m3Q3q5J3%R7r4n6
-77c0L0l6M9k9J0K9j14N3P7j5o3M9P2k7o7k2M2k9j03P3l3P3L6j9l8
$$ y = [-29, -78, -72, 1, -128, -109, 24, 8, 184, 9, 46, 87, 8, 14, 190, 14, -99, 1, -131, 73, -34, 66, 62, 179, 77, -28, -70, 35, 58, 93, 137, -64, -43, -122, -101, 25, -22, 25, 47, 54, -46, 6, 47, -136, -38, 53, -61, -106, 44, 79, 41, 41, 42, 30, 22, 27, -100, 22, 31, -25, -36, -60, -16, -34, -29, -99, -42, -52, -54, -20, 1, 151, -64, 34, 62, -4, -90, -74, 51, 69, -1, 55, 40, -74, -47, 23, 97, -43, -91, -26, 57, -107, 16, 16, 122, 115, 38, -45, 13, 115, 103, -14, -29, -64, -11, 73, -16, 8, -69, 25, -38, -102, 73, 64, 100, 30, -14, -22, 79, 94, -43, -26, -56, 206, 61, 44, 5, -21, -34, 0, -69, 81, 1, 59, 26, -119, -81, -29, -38, -46, -4, 93, 52, 183, -14, -89, 26, -136, -64, 38, 187, 166, -7, -62, -9, 22, -76, 87, 5, -89, -62, -11, 9, -150, -9, -26, -6, 57, 154, 81, 9, 67, -31, -180, -33, 15, -13, -95, -41, -60, 32, -31, 32, -139, -48, 20, 76, -53, 29, 33, -36, 15, 20, 4, -3, -77, 46, 81, 130, 46, -55, -109, 25, -46, 146, -13, -119, 122, 19, 2, 96, -52, -47, 16, -82, -203, 19, -30, 55, 12, 95, 10, 23, 23, 120, 26, -30, 0, -36, 13, -16, -6, 23, -91, -38, 39, 24, -39, 10, 82, 55, -12, -34, 8, -21, -124, -51, -84, -11, 25, 6, -32]
-390c2
##PAGE=	F1=883.678
##FIRST=	23151.189942674980557,	6007.9998942000029274,	0.46563231945037841797
##DATA TABLE=	(F2++(Y..Y)), PROFILE
6008d2rl6O9Q8j65O9pl7J63j21O9q9J5Q4j1j6j2mO5j1p1Jp4L2m2Q2N3JN0p8j28M8n5J91j4
5570E8L9k53O9J12j41lM6J60j09P4n5m2l1J97m5k17N5L2M7N1j26J38M5k22Q8N2pm8M9o8o1
5182a16nK19rr7n9J16Q0j79q5Q0PK7P2J0k3j01j02K19Q7j16m5P9L3q8qj8j24P7J39j08J09
4794G1j41P7Q8K0j16j9n5m8N3L0N7r5J2J43j08J16r7O7oj85N5j5j6kJ79J4k3m0l1J78o1jj55
4380e4j6P4k7J70p4p6k0R7oP2o3j36P4l7Q0M7l6j15J10J4l2Qj56P2O8p0N6k3nm3Q3J4j12R9
3955C7L3j28R6M8j07R5qj39Q9R1k33P1M2J02j8J3Nq5K0jRj6qK7j1k7qQ1J09j76J4j7m5R9q3
3517b9O6Q2j5j19M1J5m8J00L4j00m5R8n0q7K3M1l9p4K4j7M0Q1p8P1j8J25q3M6M71j54k13j76
3116A3M7r3J72p9O3m8P7j50j27L6r9J45k0R6R1j32o6J25l0mJ8J0o7o5N5K3q2J59j03o3mP1
$$ y = [-42, -51, -87, -18, 70, -95, -26, -33, -70, 93, -28, 41, -48, -33, 51, 40, 24, 12, 8, 73, 62, -9, -8, -82, -50, -92, -10, 43, 44, 94, 16, -112, -64, -119, 72, 58, 97, -156, -87, 25, -116, -119, -73, 87, -22, 52, -3, -45, -76, 121, 76, -141, -86, -54, -7, 44, -82, 56, 101, -121, -33, 19, 12, -36, 13, -55, -116, -121, 98, 89, -8, -67, 49, 129, -50, -135, -55, -48, -21, 51, 61, 38, -63, -165, 54, 141, 25, -20, 59, 92, 4, -4, -22, -146, -69, 70, -38, 71, -70, 7, 95, 115, -1, -20, -75, -123, -70, -40, 17, -78, -66, 77, -31, 85, -12, 55, 49, -136, -81, -96, -112, -114, 65, 79, 56, 16, -15, 163, 102, 101, -54, -70, 4, -23, 147, 73, -3, -23, 74, 68, 140, 77, -59, 15, -22, 58, 105, 69, -46, 64, 78, 46, 54, -102, -30, 38, -32, 24, 1, -4, -47, 36, 50, -62, 37, 70, -58, 38, 86, -21, 74, 66, -73, 16, 107, -126, -55, -13, 89, 71, 84, 89, 4, 24, 23, 32, 16, 8, 35, 24, -3, -11, 70, 179, 3, 17, 0, -45, 54, -29, 37, 119, 104, -15, 26, 41, -7, 93, 127, 27, -18, 80, 30, -57, -34, 7, -32, -106, -82, -99, -59, 22, -56, 15, -3, 122, 39, 85, 556, 402, 189, 13, 60, -33, 139, 60, 123, 75, 152, 2, -125, -89, -188, -43, -63, 33, 124, -8, -74, 51, 21, 17, 35, 45, -22, -87, -32, -9, -91, 68, -35, -98, -102, -31]
2715c1j12K7J09%J60j61Q8J7p6nJ66j27j22M3j25K31j28J10j3J85j24j11j9J07J8l4J2j73
2365h8L3q2N5O1ML5k2K3m0Q0Oj82N7J04j16l0J07JJ5L2n2N1m0J8j08J11Oq1M5m2N7o5J4l5
1939f8K6QOJ2K0J71k15O0N2j15r2N8J13M2r2N8j6j04J8R4N4j14j06Q8J14j35P0RR4%q4p7O4
1526A3P5M7j22n8k5K4O2m6K4l8O0k0m0J50m6L3n3m9j5J03Oj54Nj8K50j41J7jm0l4K3j5J39
1113A16j01P3m5j73RQ5o7M0M3J14nQ7j94m3O7j46Q2J25J21k1j82j6PO5p7Q0o7o5jJ19jj30
712a01P4KN0RJ16n8o2J6q1j26O8J18o0p0R5KRnN1j36O4L9K1q5O8M0m3N7n4Pj8p3O9N1N6n7
261E3j20q1J54n6J67j37m3J66j27K3O0r6O6N2j71r7K03k7Q7q4Q1p4K7l1J24j09k3ln4R8j02
-127g4J00Rj16K3R5j6n7R0K5L2j02m3N6Nj64N2o2R1M4Pk6
$$ y = [-31, -143, -116, -7, -7, 153, -8, 80, 97, 21, 16, 182, 55, -67, -24, -149, 82, -46, 64, 51, 236, 112, 1, -18, 89, 107, 73, 85, -88, -55, -137, -82, -21, -17, 18, -4, 19, -21, 59, 65, -117, -60, 44, -72, -102, 5, 6, 21, 53, 1, 52, 12, 30, -78, 33, 39, -42, 3, -39, 18, -47, -33, -68, -42, -34, -28, -16, 4, 175, -40, 20, 72, -43, -135, -77, 36, 78, -14, 44, 28, -76, -58, 36, 90, -24, -130, -42, 72, -63, 7, 16, 110, 110, 26, -51, 13, 88, 135, 13, -45, -70, -46, 16, -30, -6, -44, 16, -4, -44, 106, 60, 93, 40, -9, -24, 79, 85, -69, -64, -82, 168, 27, 44, 43, 3, -31, -8, -23, 116, 15, 88, 43, -130, -121, -36, -103, -63, -20, 94, 89, 176, -18, -61, 6, -140, -58, 67, 188, 167, -15, -31, -24, 41, -36, 44, -23, -88, -89, 30, 29, -101, -27, -25, 25, 34, 150, 92, 30, 46, -35, -161, -93, 25, -35, -105, -10, -8, 1, -4, 47, -89, -25, 14, 35, -50, 18, 58, 15, 72, 18, 25, 7, -66, 3, 54, 110, 53, -67, -148, 6, -50, 117, -20, -63, 103, -24, -1, 59, -37, 29, 81, -90, -187, 16, -11, 76, -8, 73, -1, 26, -5, 119, 10, -13, -16, -70, 28, -74, 26, 35, -81, -58, 37, 21, -36, 54, 79, 111, 9, -34, 22, 27, -137, -85, -147, -56, -12, -5, -31]
-390c1
##PAGE=	F1=789.324
##FIRST=	23151.189942674980557,	6007.9998942000029274,	0.57750272750854492188
##DATA TABLE=	(F2++(Y..Y)), PROFILE
6008c9Ol7L3J28j50M3j2QJ13j30K1q1O4O0Ll8L2J1N3p4k8K1o0j4mM4R8n6O7j05n0K4q5K08
5582G4k0rj84N6J24j49K6N7O7m4M8q2L2l8J87k5k53J6N4P3M9j58J19P8k26Q7L5L9o6O0q0r4
5182a47P2J80n1o5p4J27Q2j90m6N2QL6O6L7n9j08j04J96R8j08o8J03O8r1qj1j22J9J74j27
4806f1O5q9Q0P7N1j24ko5n0P8J6N0n3n7J54j17P7p9R3L6k11J3qLl6K09M1m9Kk8J59j15M7j51
4380d4n6J09k1J56k6j59kP8j4R1m4r8P4p7R2N8l0j40J56qp5K9j65Q8M3j7K5l7M3o4J31p4q8
3967f6J01J2r9Q7N2r5N2O0j63P7O4k40J11K3J59k8m4n4l7K7L2J2nMj1mnj4N0N5j48N0Nn3Q5
3529E2o6J6Q0qo4M2j3n3J39K2r1r1R2mj07K2M3mr8l1KL1J08p0M6j4P2l0J3K62j03j7j52l2
3103fo2J84n7O2p6N4r3j22K2r2J78n0N3J23j26l2P3l9ML3j4n1k7L6N8j07J13q4n7JM2q2L1
$$ y = [-39, -33, -70, -37, 91, -59, -16, -28, -20, 93, -37, -16, -97, -33, 27, 30, -8, 24, 35, 88, 14, -14, 7, -53, -67, -71, -27, 71, 15, 82, -23, -73, -49, -134, 74, 54, 45, -139, -83, 41, -108, -82, -25, 42, -2, 46, -36, -4, -42, 145, 120, -133, -117, -63, 10, 59, -99, 20, 98, -128, -41, -6, 33, -33, 27, -53, -147, -75, 105, 54, -11, -85, 42, 124, -66, -112, -60, -52, -16, 50, 87, 28, -80, -184, 12, 110, 2, -66, 37, 105, 14, 6, -5, -127, -108, 66, -61, 4, -85, -5, 72, 123, -1, -3, -68, -118, -40, -24, 26, -27, -84, 70, -47, 30, -49, 44, 80, -131, -118, -126, -123, -159, 50, 91, 42, 44, 16, 175, 60, 107, -44, -100, 9, -12, 144, 118, -41, -43, 35, 21, 112, 68, -30, 44, -33, 59, 117, 87, -53, 103, 95, 20, 49, -116, -28, 15, -2, 23, -14, 29, -35, 96, 22, -66, 35, 47, -52, 35, 87, -8, 44, 104, -59, 18, 82, -158, -47, -24, 135, 107, 63, 9, -28, -1, 31, 43, 38, 42, 31, 27, 22, 8, 58, 113, -35, 15, 20, -33, 52, -14, 2, 82, 74, 10, 52, 39, -14, 125, 147, 56, -35, 57, 53, -54, -32, 11, 7, -91, -122, -120, -89, 19, -51, -5, -19, 53, 23, 36, 298, 195, 178, 26, -6, -68, 116, 59, 121, 45, 99, 6, -116, -94, -186, -8, -58, -5, 118, -8, -40, 33, -6, -2, 31, 17, -34, -61, -25, 33, -74, 39, -45, -102, -101, -59, -141, -110]
2690a10M9L2J41j45J29j0l6k7J23n8j15k4r3K40j31Q2k6K25j17r8j4J21lq8J3j58M4r5Q4M
2315f1N5K9r4N8L3Q9m3j34JP7p6k9P9k9M2P6j04O8l3K2p5R0qp6Q1m0O0j13J2J1qL3j7QRJ73
1864A66j77lP4j43q0Q8J02N6j05O5j3j13M4R0L5q6j56J14J40j05kL4P3lq6n9O0M8O9j03p6
1476e2j2qK9lK9KM0K1k8J23p2J2k3o3l9J10J8j59j6j8K32j27M8O4o9n5pM5R8q2O0n1j91j3
1050a57J28j04M9M7J17J1O9j77jKj20J04J16R4k7j48nm3R6n0J0n1m0l7J68Lq6QJ0P5l6J11
649A36m1o4lo0j12J2J80j01n2J33K2q8O7K4j02N5j6j4j2N9N5l4N4p9K8mp1JM3P0k7j43r3J52
224b5j0R9q3L0P3j55P0J3k4J08M1k39n5J56oO6p6N6p8N5n4J60j18J2l6o0J11j59J53L3j30
-164g2JJ12k8m3J15l6P8r6o4Q7K8k17L9r4O8Q2K3O
$$ y = [-110, -61, -29, 112, -33, 96, 86, 50, 23, 146, 88, -27, -51, -144, 96, -35, 47, 21, 246, 129, 31, 17, 138, 135, 47, 60, -98, -54, -149, -65, -61, -6, 23, -71, -13, 20, 109, 66, -68, -67, 10, -66, -95, -16, -45, -3, 73, -31, 37, 4, 26, -49, 41, 33, -43, 38, -2, 58, -55, -43, -32, -40, -7, -24, -16, -7, 166, -11, -14, 60, -83, -163, -75, 27, 83, -22, 43, 30, -83, -39, 51, 86, 0, -156, -42, 98, -7, -9, 25, 98, 95, 9, -50, 10, 58, 127, 24, -52, -64, -72, -43, -46, -17, -15, 25, 46, 18, 141, 69, 81, 58, -5, -44, 66, 84, -75, -91, -109, 123, -4, 44, 108, 39, -16, -23, 22, 120, 38, 98, 47, -144, -157, -29, -133, -84, -37, 80, 91, 160, -17, -18, -16, -136, -32, 84, 178, 151, 3, -2, -45, 51, 1, 11, -40, -80, -117, 51, 54, -32, -24, -14, 61, 25, 136, 95, 31, 28, -32, -144, -132, 48, -53, -105, 28, 50, -38, 29, 53, -49, 6, -10, -24, -36, 23, 78, 44, 98, 19, 47, 43, -28, -27, 16, 86, 59, -84, -177, -25, -35, 64, -19, 11, 84, -71, -1, 12, -12, 96, 137, -102, -157, -1, -7, 59, -17, 39, -39, 16, -38, 122, 4, 16, -20, -80, 31, -128, 25, 58, -72, -71, 41, 13, -30, 85, 49, 127, 31, -33, 54, 82, -135, -96, -190, -122, -40, -17, -11]
-390a1
##PAGE=	F1=694.97
##FIRST=	23151.189942674980557,	6007.9998942000029274,	0.50374776124954223633
##DATA TABLE=	(F2++(Y..Y)), PROFILE
6008c4K2m7LJ59r6kJM1N5j42l4n3J15J1J2l6O6K7K3j19J2K3k1m6J7lJ51j12Q0j02lPq8J84
5582G1oq3j00M8J21j42O7N2l3J2J4q8P2l3J77lk48j1O1J14Pj64Q6J03k28R3K5P1o7N2p2j19
5182a51J50J04q7l9n3J33M9j81qJ1K4K4O3M6m7j21p9J52P6p1j01J32Q3r3j4j2r4l6J90j24
4806g4J4k6J04J3P3j04%o6k7P7j0N9k0j17J55j04L8n9J18N2j88l6J1Ro6K13N1o6L8k6J41j58
4405A9R3j52o1J24l8J20N8k30L0J6NJ17l9m3P5j18P2O3j5j56J73k0r2M0j53R6k2N3nl7Q7o7
4005gJ35j36o2J04qn5P0N0p8rJ11j71P3M6k35J34J3K02o4p9j11J8L3M7J6kK7k8nJ4k7K0nq8
3579e7P0J1m3O2k6m1N4J3MLKp0J52L0q5j14N9K9j10J6O0M4j01j07M1OJ25o6J6oJ6L6jQ5o0
3141D7J09j14j05j4J68o7Q8r0Plj17K0j00J79n3K0J16r4kKk4MM9k9m5MK6R3j17M9o7k8K6r
$$ y = [-34, -12, -59, -56, 103, 7, 5, 6, 47, 102, -40, -74, -127, -12, -1, 11, -25, 41, 68, 91, -28, -16, 7, -14, -60, -43, -46, 105, -7, 73, -29, -32, -25, -113, 71, 65, -18, -118, -70, 51, -91, -24, 28, -5, 7, 21, -67, 5, -28, 149, 146, -102, -113, -52, 62, 69, -95, -9, 94, -134, -41, -16, 55, -12, 40, -32, -151, -1, 103, 16, -23, -76, 57, 106, -75, -83, -72, -48, -24, 39, 85, 38, -83, -162, -10, 66, -5, -106, 26, 109, 16, 2, -10, -104, -140, 50, -74, -60, -86, 18, 31, 104, 0, 0, -66, -93, -16, -26, 33, 13, -104, 51, -53, -15, -74, 44, 96, -92, -128, -117, -108, -174, 39, 90, 24, 62, 36, 177, 19, 112, -40, -101, 23, -15, 105, 163, -67, -37, -21, -16, 101, 62, 19, 94, -24, 48, 111, 96, -60, 113, 93, 1, 41, -112, -16, -38, 15, 10, -27, 60, -7, 128, -8, -70, 34, 26, -29, 41, 91, 13, 4, 115, -56, 17, 63, -172, -38, -25, 177, 113, 34, -77, -59, -26, 21, 37, 35, 62, 34, 29, 43, 16, 36, 31, -57, 13, 24, -19, 43, 17, -24, 30, 43, 47, 50, 52, -18, 134, 164, 79, -35, 24, 53, -57, -41, 19, 63, -38, -145, -104, -98, 27, -39, -23, -29, -13, 23, 22, 107, 47, 156, 42, -63, -77, 91, 24, 112, 22, 29, 26, -91, -71, -171, 8, -45, -25, 91, -3, -5, -3, -27, -23, 26, -3, -48, -44, -18, 75, -42, 7, -60, -88, -62, -71]
2715g1n5L7k4O7J17j17J36k6K3o2P2J1r0r4m2K23j01K7l6K09p8p8k4J31j7j16L4j38L8j05
2340a49R9k2P4L3j65R4Q5Q8j02m2m0J7j3m2P0n4M6J20j41M8KRm1O8j9n8R1j0N3j48nM6l1N7
1914A8o3K1oJ63j29o2Q9j22o6Q3J04N1r5N7kj27Q8O2L0o9j84J33J42p4o3N9N2or0k6L5L0O6
1501I9r1n6nl0JK9M1K5M0L8k1J00r4oJ4p9p4J21L4j50n3j4K11r7O1J25j06o3l0Q4K2j1K3m6
1075D2k04k1J76j13J6N5J05RP0j49L5n5r1J30Q5P0m6q4j5q5J14k9j9k7k7p4J73K6l6l3LQ1
674H2o0R1k1q0Lm0r9j8K16j33l3J53M4j78J29rp6O0p3m0N1O6L8k8L5o0M1J8n4n3J8P8lj61
249i6q8J28N7Kj2Q4nj76J07l1L7J18L6k71j4R6J0L8l1J7q5P9n8J89j20M1n2n6P3j81J60Q0
-152G6j45j1J19l5j8J06q7R6n7q2J29L0k35M0j33J7J40K2M5
$$ y = [-71, -126, -89, -113, -46, 71, -46, 90, 64, 87, 25, 97, 108, 18, -76, -118, 105, 4, 31, -5, 204, 126, 48, 24, 155, 138, 22, 56, -82, -44, -149, -50, -72, 2, 35, -130, -36, 49, 137, 35, -7, -47, -30, -43, -85, -15, -69, -23, 97, -44, 4, 6, 15, -26, 42, 23, -35, 56, 46, 99, -49, -54, -8, -39, 18, -45, -24, -30, 133, 4, -58, 31, -91, -157, -74, 30, 81, -14, 43, 41, -86, 2, 64, 94, 25, -159, -26, 116, 42, -21, 38, 90, 84, -6, -32, 3, 33, 99, 8, -48, -53, -83, -82, -53, -12, 13, 53, 91, 70, 170, 76, 70, 84, 5, -69, 52, 86, -64, -117, -131, 80, -17, 44, 169, 63, 0, -30, 54, 76, 65, 88, 42, -162, -183, -7, -120, -104, -49, 56, 65, 135, -14, 21, -34, -125, 5, 90, 160, 114, 30, 15, -70, 44, 15, -4, -31, -58, -132, 41, 67, 31, -2, 1, 82, 22, 113, 92, 12, 15, -25, -124, -142, 74, -59, -92, 61, 105, -73, 56, 47, -29, 31, -42, -82, -31, 35, 73, 45, 80, 20, 61, 79, 25, -28, -10, 68, 65, -96, -184, -56, 1, 3, -9, 75, 70, -106, 1, -30, 7, 125, 161, -110, -124, -28, -18, 20, -11, 6, -79, 0, -58, 131, 11, 52, 0, -56, 17, -164, -4, 76, -69, -80, 39, 4, -14, 92, 5, 101, 44, -38, 91, 121, -114, -74, -207, -190, -50, -28, 17]
-390A7
##PAGE=	F1=600.616
##FIRST=	23151.189942674980557,	6007.9998942000029274,	0.045559871941804885864
##DATA TABLE=	(F2++(Y..Y)), PROFILE
6008b5K5n9mJ55j0n6K7N3Lj39p2j5J32m7J0pQ6L6mj37L1J3L1p0L1m9J79j32Q9q9Prn7J54p
5570G4j49k6M9J03j20J00L3j06M9rp9P0l1J72J2j95j6M3J59n7j57N7J20k24J01K5P4n6K7l8
5194Ej32J90K8r7m0KJ26Lj66K1k9N8j4N0M9J6j38m0J06K6j9j21J38P5q8j6j2o4q1J94r7k8
4794i5L0J24p0P6o2po9J7N5l3P1j1j45J47p7%l1J37L2j17q4M1po9J98K8o5M2j2J29j77J21
4393A17j62l7J13n7O6J40k50N9n5L8J37n3J0Q2j44K3O2%j59J56j4p2M3j28R3j06J19k8k5J02
4017G0m4R3j45n1J21k1k4N7M7p8n5J27j51P2L5k28J45K1K07j15p4j46M9M9K9L1j6O9m1pL3
3629E9n5Nm8j3O4nl2N3K7r2K6L6O0n4L8p9J30O0q8j06RM2r7RP0R0q0j71Q2k4J30p0j4jj0R0
3178D1Mk9k0J40o8j53K5J27r7J37r1l9R6j29K7j22J46k0QP9o0L0o5lMN2l5l6RL2J10j06no6
$$ y = [-25, 0, -59, -63, 92, 82, 26, 53, 106, 109, -30, -102, -117, 15, -32, -22, -29, 57, 93, 89, -48, -17, -4, 27, -43, -12, -61, 118, -14, 75, -14, -7, -16, -73, 81, 74, -75, -101, -52, 51, -69, 31, 64, -42, 7, -2, -81, -11, -42, 130, 142, -53, -69, -26, 133, 76, -81, -24, 96, -128, -27, -2, 72, 16, 43, 5, -127, 63, 91, -6, -46, -44, 82, 85, -81, -60, -89, -31, -45, 5, 54, 70, -68, -108, -2, 24, 5, -116, 22, 97, 9, -7, -19, -83, -164, 30, -67, -95, -65, 59, -11, 65, 3, -4, -73, -56, -1, -34, 37, 26, -119, 28, -49, -49, -80, 57, 89, -28, -112, -71, -78, -147, 51, 79, 14, 56, 44, 173, -4, 117, -45, -82, 31, -26, 40, 180, -70, -11, -66, -28, 109, 56, 66, 148, 4, 27, 89, 89, -70, 86, 72, 0, 43, -85, 8, -98, 21, -7, -32, 70, 26, 119, -26, -77, 44, 23, -1, 56, 103, 25, -30, 97, -54, 18, 53, -175, -30, -9, 198, 83, 9, -137, -88, -39, -10, 21, 5, 74, 33, 26, 59, 4, 9, -39, -52, 12, 7, -25, 28, 55, -37, -11, 25, 85, 31, 69, -10, 120, 180, 92, -14, -5, 37, -60, -51, 19, 109, 29, -142, -60, -84, 46, -24, -38, -39, -49, 41, 45, 16, -4, 136, 68, -85, -60, 67, -30, 107, 16, -23, 73, -56, -29, -151, -5, -25, -17, 62, 2, 32, -33, -36, -32, 20, -15, -51, -42, -10, 100, -6, -11, -77]
2753g7K1O0o8m5N5q6R0Q9p9J05k1P2j02M2N6m7j58J5J74m1k7l9J37j2o6m0J29j8j20N8r9O
2352c6r2R6j8O0L7k05J14Q9Q5j50N6m1n5M9n9P1p5M2J54j60J2M4k0j1N0k1m7Q4M2L5j55l2
1952e7N0l8P5j03M1j9J47r4r3Q6n1o5M8J17K6o1K4J5j26J26K3M6o3k02J41J18m1q7O4L4nj01
1551b5K5nK0O4j07kj4m0lL9O0K9N1J8j0Q5j16j5N6q9j03J26M4j33j00MJ85m8M4J58j40n3k6
1138b1Q7p4Q7j8k3k10j6K10j02l2N6Q6%P2j10N0q5o9J53M5M9p6j4k0j21J15k2rOj2j06J38
737A4M7J2n0j0O3o1P1or6J6k3p4k9K18j49j2J49P4k45J60l8o2P3j05n4P5Q4oj3Oj0M0K9j4
311G4o8j7O6J9j66o8Q6J21r6N4J00m7j71J15n6O0J06L7k54PM5J9J8J5j8p3P4m0J92j06N6m8
-89C6m4mj61J31J17j44k1J12k0J7O0j15Q4rq6J56K0k07N1j67l9J87OP8
$$ y = [-77, -56, 4, -64, -109, -54, -140, -50, 39, -40, 65, 44, 116, 14, 56, 112, 65, -93, -78, 96, 55, 28, -11, 126, 114, 48, 8, 137, 119, -1, 57, -42, -36, -128, -32, -50, 10, 47, -158, -44, 45, 130, -20, 36, -5, -60, -11, -70, 1, -74, -32, 122, -38, -26, 18, -2, -13, 37, 16, -31, 53, 95, 130, -25, -57, -7, -45, 30, -73, -32, -51, 96, 2, -91, -5, -56, -121, -73, 44, 70, 9, 33, 48, -78, 48, 71, 117, 54, -148, -7, 111, 70, -17, 47, 81, 76, -25, 0, -5, 15, 79, -28, -30, -44, -84, -87, -48, 12, 41, 92, 110, 100, 185, 69, 54, 110, 21, -82, 44, 88, -45, -145, -141, 44, -4, 40, 198, 58, 5, -21, 66, -8, 79, 61, 38, -172, -188, 22, -80, -112, -56, 30, 30, 102, -8, 42, -43, -112, 41, 86, 135, 59, 45, 25, -96, 19, -3, -12, -6, -18, -124, 14, 61, 73, 23, 13, 76, 15, 86, 80, -16, 0, -23, -97, -126, 92, -57, -69, 80, 154, -91, 69, 31, -31, 42, -63, -117, -42, 42, 36, 23, 29, 19, 59, 88, 74, 6, -11, 55, 74, -92, -160, -74, 47, -49, 5, 105, 58, -113, 2, -54, 6, 112, 149, -105, -98, -53, -34, -16, -1, -19, -92, -18, -58, 134, 28, 84, 36, -8, -12, -173, -42, 75, -69, -90, 22, 2, 19, 79, -36, 48, 39, -47, 109, 129, -78, -27, -194, -233, -46, -40, 38]
-390C8
##PAGE=	F1=506.262
##FIRST=	23151.189942674980557,	6007.9998942000029274,	-0.27435788512229919434
##DATA TABLE=	(F2++(Y..Y)), PROFILE
6008a3J4o8J2J14P8r4M3M5k9j09p7J1J06r5lM0R2L1j0j26J7mQ7r4M5q1J60r3Q8q8ql0jJ47
5582A07m1j69J7M9P9r3J20Kj21N9k6n6M0m1J74Oj02j%J96j14j52M2J30k04R5L1M2l5JJ3j31
5182h3J69j9o8o9P3J01l7j51K8m4R2o5J8O4J05j50j5P3k7L7j21J04N5p3j3Nn2j10J82n4m5
4794i0O6J11j22N8j2j7p3N9J9l3P5l2j33J33m6l8NJ52k1k9j19P9l6m8J76k4m5J2K1J19j76
4405iJ21j70PP3o0J6J73k12P3q9N9J43p3L9R1j38m0N9lj41J14J1l6N2j00Q3j80J60m7pQ0P
4005E6K2r7o5J56k7k8N4M8j02o6J09j04P0K1k21J49M5J69j58l2j53M5P8j9N9n2J22o2%N6j00
3617b7J2o5N0M5l7l5P7P2j24J4L6R2r5O7p6Q0J04j00o9m1M0q2NO8J14m7j93J02m2J26p4m9
3216e2mRJ11J5q3J6J13k2j67L9P4j25J82p6o2J80j70L0j42Q4M5J4L9m1O0j08MJ2M1l8j4rM9
$$ y = [-13, 1, -67, -55, 59, 137, 43, 86, 131, 102, -7, -84, -73, 33, -62, -65, -25, 67, 98, 88, -38, -21, -25, 62, -32, 13, -68, 92, -1, 87, -1, -9, -39, -40, 107, 66, -103, -86, -37, 42, -51, 69, 71, -50, 9, -17, -73, -33, -74, 100, 106, 4, 3, 3, 199, 85, -67, -25, 105, -99, -4, 27, 69, 34, 35, 48, -83, 86, 67, -1, -70, 3, 104, 67, -84, -56, -100, -8, -73, -55, 9, 114, -36, -51, 22, -5, 32, -89, 15, 70, -3, -16, -11, -63, -173, 9, -45, -90, -24, 87, -35, 23, 11, -6, -79, -20, -1, -34, 41, 9, -124, 9, -37, -75, -70, 82, 61, 32, -87, -8, -44, -92, 84, 60, 15, 27, 48, 167, -9, 112, -58, -51, 22, -38, -22, 151, -61, 12, -77, -18, 125, 52, 91, 182, 44, 4, 63, 60, -81, 33, 44, 8, 60, -40, 43, -137, 23, -24, -31, 49, 56, 78, -19, -84, 72, 45, 17, 71, 119, 17, -49, 60, -44, 26, 47, -174, -25, 20, 189, 31, -1, -154, -109, -31, -50, 9, -43, 79, 17, 17, 73, -27, -15, -80, -30, 15, -22, -57, 20, 92, -32, -18, 18, 110, 15, 82, 6, 86, 190, 90, 21, -20, 20, -62, -57, 11, 125, 78, -115, -13, -55, 71, -3, -52, -56, -47, 64, 79, -4, 12, 125, 103, -64, -25, 49, -76, 106, 30, -32, 148, -22, 8, -134, -50, -5, 9, 48, 7, 67, -41, -37, -25, 16, -22, -36, -45, 4]
2803DR7q1k5q2P8Q3j16n6Q9j21R4N4l7N2PQ7j35M3O1Nj92N8R7K4m5l9L8O0o4n2J13rj16P3
2377D7l7m3n2P8kK8L5k05J14N2P4j67J21jj14R0p2P1r4M7J79j72j8P2n2J3M2j7n8P8R1J3j31
1964A0n4J8l4Q7j10N8l8J33q0q9N3M9p7QJ27j7j1k4L2r2J31pP6n7k28J38Q3j8o7M3K1kj13
1551e1P7l9J6Q0j49O2l8l8J5L0Q4J4O8l3PP0j33j4R6q9j10J17M8j17j42L2J62LKJ53j56l5
1150hJ0N4j58J68m2J9j99j4K12q6n0L2P5j1O3o5M1q0o0J61J4L0j03M4j0j56R9k0J2L4K5j18
750h7P8M9N0n1k6K6m3O6Jj08K3pl6l0J90j50J8J16J13k85J62n6n9Q6j03n4N6J00o0Rj6M3K6
336D1J8M1l5n5K6M4j49m0L3J63j71J00P6n3j24P4m9M2R9L1j92nJ9K4OL6m1k4K8kJ60p2N5l2
-89G2k8q9j05R1J05j16l1R3J8O2j6j22N9K3o8J42K1j46O2j85p0J92j9R5
$$ y = [4, 101, 20, -5, -87, -9, 74, -42, -98, -9, -130, -36, 18, -19, 33, 40, 127, -8, 35, 96, 101, -91, -33, 64, 88, 43, 4, 42, 102, 38, -14, 99, 90, -26, 47, 10, -33, -85, -7, -9, 19, 54, -151, -37, 15, 89, -78, 43, 42, -72, 18, -54, 17, -77, -30, 149, -23, -41, 31, -21, -8, 34, 17, -41, 37, 128, 141, 10, -44, -26, -60, 27, -83, -25, -63, 70, -10, -99, -46, 3, -74, -66, 61, 44, 33, 9, 41, -51, 80, 73, 149, 92, -136, 2, 85, 67, 0, 43, 64, 62, -51, 26, -13, 3, 83, -66, -4, -42, -80, -65, -35, 49, 63, 131, 98, 105, 175, 42, 28, 124, 35, -75, 42, 90, -27, -169, -137, 25, 28, 30, 183, 27, -8, 2, 56, -102, 66, 24, 43, -156, -170, 42, -44, -94, -62, 13, 2, 65, 0, 41, -39, -99, 62, 76, 106, 3, 47, 37, -119, -20, -40, -28, 6, 31, -87, -9, 40, 90, 39, 13, 39, -4, 62, 63, -45, -22, -29, -65, -95, 95, -55, -37, 79, 192, -93, 69, 13, -46, 40, -63, -117, -61, 39, -21, -12, -28, 15, 41, 59, 100, 65, 10, 36, 80, -69, -109, -76, 87, -84, 16, 92, 39, -85, -11, -60, -18, 81, 112, -80, -85, -66, -42, -36, 0, -41, -65, -37, -39, 121, 49, 104, 72, 44, -45, -150, -59, 46, -70, -101, -8, 10, 72, 56, -66, -7, 16, -52, 90, 111, -35, 27, -158, -228, -36, -55, 40]
-390D0
##PAGE=	F1=411.909
##FIRST=	23151.189942674980557,	6007.9998942000029274,	-0.10444908589124679565
##DATA TABLE=	(F2++(Y..Y)), PROFILE
6008ajp6M2N5J35j02L9K5l7o1m5NN2j18j3P5R5J4Kr2k0k4J35j14N8r4R6qP9j04l2n2N8J69
5582A40j04j25K6L9N1o8J25k7p8M6n2k3J0p2J82j8OK4n5K11j37j52L0J36j59N9M4j8j3pO1
5194H2j16R2k4qj09J39N5n8j30Ok8J06j04k7R7J80j52k1O1n9P8r8L8L6n4JL7n7j30J62j2l8
4794e5Q3N6j16K9K2k8o7P6j6mO4o5r6J22k1p3L8J64q7L7j32J25o4k5J51q1j3l5O7J08j76J00
4393H8j61O1J1m8rJ35j34O8o1M6J32p8M4Q7j01r6O1k6j06O8L9lO8p8P1k15J63o8J3L1O7l8
3992C1k1r7J98l0n5N0N3j38m0O6m5O9mk09J51P1J07j67J1j32J6J05o8R2j11J73r3L1O6j56
3617g6M5n5P7L2p0m9J22R6j34L1oR6j01P8o8K3J39j11j3p1L0p8LN9J06k6j63J01m4J25p3r4
3216f9j3O4R2K3j02M9P7J6j51K7K7j27J86m7m9K31k33J9j42J1J17L3J5m5Q3j18nK6K2m2J6
$$ y = [-1, -2, -78, -36, 19, 154, 52, 91, 116, 79, 18, -27, -22, 30, -88, -101, -26, 69, 83, 85, -7, -27, -51, 84, -30, 28, -66, 30, 22, 101, -3, -35, -87, -29, 140, 36, -89, -63, -24, 27, -41, 84, 57, -21, 25, -27, -50, -40, -112, 70, 52, 58, 82, 27, 238, 101, -51, -21, 115, -44, 15, 59, 41, 28, 21, 82, -34, 58, 34, 26, -83, 56, 111, 53, -77, -71, -99, 7, -97, -124, -27, 153, 1, -20, 41, -18, 60, -38, 0, 36, -18, -17, 20, -37, -167, -5, -17, -55, 28, 84, -32, -3, 19, -9, -76, 0, -16, -20, 44, -21, -117, 5, -16, -89, -51, 113, 26, 63, -69, 56, -8, -33, 118, 37, 24, -11, 56, 164, -12, 88, -73, -12, -1, -49, -58, 77, -57, 11, -50, -4, 128, 50, 94, 181, 80, -16, 45, 19, -87, -19, 20, 17, 85, 7, 78, -137, 26, -42, -29, 2, 69, 31, 10, -87, 111, 81, 26, 76, 129, -9, -49, 17, -28, 41, 37, -172, -21, 50, 157, -10, 1, -131, -115, -10, -78, 14, -97, 76, -17, 14, 80, -76, -31, -86, -9, 23, -47, -96, 26, 122, -12, 19, 13, 109, 8, 86, 18, 41, 180, 69, 56, -15, 15, -63, -60, -1, 105, 79, -84, 17, -27, 98, 25, -69, -82, -18, 74, 97, -5, 44, 121, 137, -14, 13, 40, -87, 99, 52, 3, 234, 1, 20, -122, -111, 6, 39, 54, 9, 92, -26, -31, -5, 17, -25, -9]
2828ik8O8N6n5oj11J26Q4j33q5J31j31Q7J4nNM7O1j49O9K0N9j85P6J2O3j7l5m7J12p0n6R9
2415F7mj09O7M0r3OM7MNK4j73J00LM0j34J26N9j42J07q1N4j02O4J98j83k9Q3p9K8N2k5q5Q4
2002A9J14pq4n2m4k1Q9p6O5p2J32q3o8KJ42r4j0J20o9L0o5N4k6R3j3R7l6k67J26N4rk2J2L
1576C4lj19J17m5QJ09j85J07p2k6M4J4J03j3Q7r7K8M7j32j1J32r3q5R0N2j08j61N6J52L2n4
1188HJ27j46k3O3nj93J95l6P0j66l2J77p5j9j6Q2k2M4k2J7n3o6J57oJ6j14Q5Nj85P3j1QM6
775a7R4j09J8K7P5n0l6j7j7Q4oj05RPJ1k6J41j37N3O2J50k93J46n9o9R6o6n4J8R8j08L2k1
361f9P4NqR5K9q4m0P0j07j2k4J80k09J12K8l0m1j0j6LJ12J4j09m7K8K4lK8n0N1m7M3J00k3
-64F7L5j7pj44l3O0L5o5l9O2O5J12r4j19L5L0k8Q1M8p5N8j77n9J45m6R4
$$ y = [-9, -37, 31, 87, 32, 26, -85, 41, 125, -8, -93, 38, -93, -6, 8, 3, 8, 55, 116, -33, 36, 56, 115, -70, 6, 18, 81, 64, 29, -18, 94, 24, -32, 67, 63, -46, 21, 61, -32, -26, 21, 25, 30, 54, -119, -19, -16, 24, -110, 16, 75, -67, 40, -41, 13, -89, -25, 173, -10, -39, 44, -35, -7, 45, 20, -65, 19, 133, 126, 42, -10, -54, -75, 14, -62, 3, -69, 63, -20, -88, -86, 56, -38, -48, 72, 3, 33, -32, 22, -4, 89, 76, 173, 137, -130, -4, 50, 41, 19, 31, 34, 31, -88, 29, -16, -8, 101, -84, 23, -49, -75, -31, -17, 86, 73, 160, 63, 91, 138, 6, -5, 127, 34, -51, 39, 91, -17, -178, -122, 30, 62, 8, 135, -11, -34, 29, 24, -169, 26, -10, 60, -106, -138, 39, -36, -55, -71, 11, -11, 33, 11, 28, -25, -91, 66, 60, 76, -38, 47, 52, -133, -60, -71, -63, -17, 77, -32, -14, 13, 88, 38, 2, -15, -32, 52, 46, -59, -50, -43, -32, -58, 83, -54, -1, 61, 211, -82, 64, 5, -64, 32, -34, -88, -70, 28, -80, -48, -69, 5, 10, 2, 97, 126, 42, 2, 72, -35, -47, -71, 109, -100, 12, 40, 10, -31, -41, -57, -54, 58, 72, -37, -84, -56, -32, -35, -7, -57, -6, -53, -10, 90, 67, 102, 85, 78, -66, -99, -39, -4, -69, -108, -46, 19, 131, 37, -82, -47, -17, -45, 36, 84, 9, 67, -110, -169, -24, -70, 24]
-390B4
##PAGE=	F1=317.555
##FIRST=	23151.189942674980557,	6007.9998942000029274,	0.15952380001544952393
##DATA TABLE=	(F2++(Y..Y)), PROFILE
6008A1j5q4P4J0J39q3J7Ol2j3J6m2Nj17pP4J05rK0n0n9m4J72j27O4r0K2P6O2j15n4o7R7J99
5582A61j71k7J1J5J7m5J28n3nK1q7OJj15J93n0R3M5j02K00j15j44JJ37r8PN4q1OLQ9q9oON4
5144F0j40J80jn0j07m1J0R5j08o3J24K18j42o3O1n2R5o3l9L3l8K2P7p5j41J37K1j5Q6k4o9
4756a2NK6m0l6N8m1L9M4r0n3J18kr6M4J73j37O0j23J76q6k0J25j10J0p4J12R6j96P5j25J09
4368B9n6k6mM2n2N3J1JJ07n9M0O3m6j38P5m6p4K9O2J2P7n4N0j99J31r2L3j4J10o3M4j26K28
3955A48l0q7L5N5j61MK1jP3m1j82J54P9N0j38L4j01j0J06q8J22j82K05j25Q3N2k03R1l0O7
3579@L5q7n8J59Q9j32P9q4Q1p7O9o2j2J43j12M0o4J7r4MN1O8j9j01J02m7J27o0j40k5J19N2
3178F1K7j04P2O0L4j09J0rr5J23%qK33k81k0j11m7J67N4J7o3Q8r9k0M3Mn6M1k4P4J0l9L4j43
$$ y = [11, -4, -88, -14, -4, 135, 52, 69, 75, 43, 30, 46, 4, 9, -108, -115, -41, 64, 55, 75, 25, -34, -78, 94, -33, 31, -59, -37, 39, 101, -14, -68, -135, -38, 161, -10, -37, -26, -11, 6, -39, 89, 36, 31, 52, -35, -29, -28, -143, 50, 0, 93, 138, 36, 236, 121, -23, -22, 115, 17, 24, 78, -3, 3, 6, 95, 6, 0, 6, 60, -80, 100, 99, 49, -58, -99, -89, 6, -102, -165, -41, 177, 35, -28, 33, -19, 76, 13, -26, 7, -31, -9, 68, -7, -148, -11, 10, -5, 81, 57, -12, -7, 19, -21, -57, 1, -40, -1, 43, -47, -100, 18, 16, -80, -36, 137, 0, 60, -63, 113, 27, 7, 132, 22, 32, -42, 70, 166, -30, 45, -80, 29, -27, -53, -57, -15, -67, -14, -3, -2, 105, 46, 86, 149, 103, -35, 40, -6, -80, -51, 11, 23, 100, 46, 96, -103, 28, -64, -31, -45, 65, 2, 46, -80, 148, 118, 31, 66, 121, -40, -36, -15, -16, 57, 16, -166, -12, 67, 117, -21, 13, -88, -98, 8, -80, 42, -140, 65, -60, 23, 75, -128, -37, -67, 0, 35, -52, -110, 49, 138, 6, 85, 1, 82, 5, 74, 12, 0, 143, 31, 71, 7, 24, -70, -66, -15, 53, 34, -67, 35, -12, 115, 55, -85, -110, 9, 61, 88, -16, 56, 116, 150, 41, 51, 42, -53, 70, 70, 62, 295, 14, -6, -117, -164, 3, 57, 74, 11, 99, 0, -20, 23, 27, -29, 12, -12, 62, 72, 33, 67, -76]
2753g6J55O7j13j15J63j31Q1l1J6j5Q1J2j39R0m5J06j45P5n7O1L7l2r1J33q1m6R1%j02L9J11
2365I9j23N4J6j1KJ0j28P9k2k1n4P4J07j32J06r2J7r3R0K02j81k3P8r4K9Q1n4j09R7J09k4
1977H9l7j3j13mQ4k4O3j26J46q2n8m1J93j02LR3j10L6q2Q5N5K8jR6ml02J02M9j2J6pk5qj13
1551a26J32j9j0J35j83J14j05pP1JJ04l9J00j48M8J5j03j8J61j07l8N1N7r9j54O9J54K2j06
1188b8J04j17k0J09o9j64J60pJ16j17p3J21p9N2o9J02l6K9J0mk9p3J47k3J0j04J09Nj96N0
812h4Mk8L1J82q2k6rR4o0l3n4OJ14j6r0k0J2N6k5R1j12P8%J68k64J26m4q8R8qo8qP2j34M7
374g4j0P3j3l0J27Q6r4j03Q0m8J1q0J88k13R0j6%N5j06K4k8J38j2l3r8O4J5j1jm4J18j18Q2
-39A9L2K0Oj4K1j47L4M0p1%m4K4R6J57j44j18K4J5J7MR3j4K8j40j5O9o6P4
$$ y = [-76, 79, 146, 33, -82, 81, -50, 31, 0, 16, 1, 82, 94, -45, 45, 0, 106, -39, 36, -21, 40, 77, 45, -46, 87, 6, -40, 51, 51, -51, -12, 99, -24, 30, 46, 35, 37, 47, -81, -2, -24, -45, -99, -25, 82, -50, 56, -36, -19, -112, -22, 180, -1, -24, 54, -40, -11, 70, 16, -93, 4, 113, 89, 52, 39, -74, -78, 6, -18, 45, -81, 65, -17, -75, -116, 77, -25, -22, 71, -39, -3, -85, 0, 55, 83, 82, 178, 174, -128, -26, 23, 11, 27, 20, -5, -13, -126, 6, -13, -23, 112, -71, 43, -62, -69, 2, 3, 107, 68, 168, 20, 68, 83, -20, -38, 123, 16, -22, 29, 86, -13, -167, -98, 56, 78, -28, 76, -41, -61, 48, -21, -185, -25, -32, 84, -33, -106, 15, -64, -12, -81, 21, -15, 14, 24, 20, -9, -82, 65, 42, 52, -52, 57, 62, -134, -84, -80, -108, -77, 105, 23, -3, -12, 82, 22, -11, -65, -59, 55, 39, -51, -71, -59, -3, -28, 63, -49, 29, 29, 197, -67, 59, 15, -73, 25, 17, -51, -59, 13, -121, -74, -84, -11, -24, -54, 73, 159, 65, -38, 42, -6, 5, -75, 113, -100, -10, -26, -26, 29, -77, -53, -81, 57, 45, 12, -86, -22, -7, -18, -19, -63, 55, -63, 19, 51, 71, 77, 63, 84, -63, -29, 11, -60, -60, -104, -80, 16, 173, 29, -89, -65, -50, -33, -29, 64, 50, 78, -62, -77, -8, -74, 0]
-390@
##PAGE=	F1=223.201
##FIRST=	23151.189942674980557,	6007.9998942000029274,	0.096345826983451843262
##DATA TABLE=	(F2++(Y..Y)), PROFILE
6008B3k2r4R5nJ01n9%j2k5J9R2j18rj02RL8J21k3K8j6q0n8J96j31N9p7k5J10M7r8o9p6J12
5595d9K08k22R6j7j4k2j8J32p0O1qj22K4J1j54K07p2J32N4j24J62n9j17n0J31l5m4N5j22K2
5219b4K2R1n4r5N2Q8j45J86m7j7q7r6M6P4q0o9J26K09j29j14O1j1Q6k5j01M6k9M0J09r9j34
4831a20J15L9PP7q8k4kkm8K1Pm5P1K6q7l2J22J8r8J1J66j42M6r8K20j02l2R4r1Lq6J43Q0k38
4405f9O4p5J49j06oJ4o6J2L7Q6n5P3k4M4K5Oj63R8l5o4MO9K1N3k1Rj37Q2j18O1l8J22n5O9
3980F6j27K34l0r8OM0j57M7pJ4P8p5j49J66N9J5q3K6p4j3P4o9J43k45K07j40J31J0k14J27
3604c8qM6N2q9m1J57M6j19J38j64O9n4N0o1qJ07r6P3k4Lj21JM5K3j7l9J22o3J26l8j73l2J41
3191A4J6L5j01Q0O1K7n5Ll5k9nN9M1J90k82q1n1p3J77O5L9q0P3n8l1N4j0p6M6PO5k0l3O8j68
$$ y = [23, 1, -93, 2, -3, 98, 39, 39, 27, 2, 21, 113, -5, -14, -116, -107, -69, 52, 29, 57, 41, -39, -97, 99, -32, 27, -50, -75, 35, 82, -16, -85, -161, -49, 159, -63, 33, 16, 2, -20, -38, 94, 24, 85, 77, -45, -21, -10, -164, 43, -29, 103, 157, 33, 195, 136, 19, -31, 100, 65, 21, 76, -46, -24, -2, 89, 35, -60, -8, 80, -65, 121, 74, 57, -30, -126, -80, -6, -86, -155, -29, 180, 51, -63, -2, -13, 73, 48, -53, -7, -36, 4, 113, 14, -120, -5, 34, 41, 118, 30, 6, 4, 2, -46, -25, -18, -63, 8, 34, -53, -85, 37, 55, -43, -32, 134, -8, 38, -60, 160, 58, 26, 120, 29, 32, -54, 89, 169, -69, -5, -80, 69, -37, -43, -29, -95, -83, -46, 40, -15, 58, 34, 78, 103, 109, -54, 44, 9, -55, -51, 18, 39, 92, 71, 80, -57, 25, -93, -32, -70, 52, -3, 66, -61, 173, 143, 45, 51, 91, -66, -19, -26, -12, 66, -9, -158, 8, 67, 82, -1, 25, -49, -62, 12, -57, 86, -159, 48, -92, 39, 49, -165, -38, -46, 0, 52, -37, -78, 79, 125, 6, 144, -20, 49, -5, 45, -16, -24, 83, -13, 60, 36, 39, -82, -81, -36, -13, -30, -69, 53, -10, 116, 78, -95, -127, 14, 30, 65, -36, 44, 105, 132, 77, 80, 45, 16, 11, 70, 111, 301, 19, -62, -113, -186, -9, 56, 95, 15, 88, 30, -1, 53, 43, -33, 13, 20, 85, 65, 32, 100, -68]
2753f8J63M6o5j26J64j31Q3q6L2%R2k9j14R2j08J37r9P0r5L1Q4k6r2J21r8k1Q8J2q9mJ55j23
2352dO9om1J0Kp5M8rq9M5jJ13q7Q7j03l1o7J13J86j52j6O9r2QJ21r7j14J09Q2l7qN6j61RP3
1914A0K0N2j88J67o2p5n3J93r7L3N5j19lo9J20J21k6RP4K5l03O8N6qK6lo6j1r6J24J7l3J40
1501I8j33Q2j20J5Q6mQ4n5J02j74O3j9n4k8J77j25KJ3N7p6j38P9J58j9j47J03q4k1J29j22
1125g1q0Q6L4J41p5j20O5q7J19j02J17m9K6L0j1k0p1J38m5J8q3J22k9j79M6J8p9JK51m5n4
737A2m6J18q4k2o7K0J26j4o8n1OR1l5N3p8P7m7J54j95J01pj10Q2O3j09kL1j31M7J0M6k8l3
324i0J33J05q1j34O7JL3j32K01j91M4l7K6J32j76M9l2J49l6K3j33J05Jj8l4k2J40j59J02k2
-52A4M0j6k5N5j06P8K3j66O8n2j7J03J77j44j21K2%M2n4J38J8k1q4L7Pp8M0
$$ y = [-68, 95, 141, 76, -50, 114, -17, 66, -20, 12, 12, 104, 75, -39, 53, -55, 82, -17, 53, -42, -11, 73, 47, -45, 76, -22, -43, 45, 57, -32, -36, 119, -4, 65, 59, 18, 28, 30, -45, 3, -6, -95, -50, -51, 62, -25, 62, -41, -72, -139, -26, 160, 8, -8, 61, -31, -23, 98, 1, -113, -4, 78, 41, 33, 89, -72, -63, 10, 30, 82, -106, 61, -1, -76, -129, 64, -33, 0, 55, -64, -67, -136, -16, 105, 79, 88, 162, 187, -116, -48, 8, 0, 26, 23, -43, -54, -150, -26, -9, -42, 98, -35, 47, -73, -58, 28, 24, 108, 53, 155, -19, 44, 25, -29, -57, 120, -5, -3, 10, 67, -9, -147, -68, 90, 71, -76, 27, -57, -78, 51, -71, -151, -65, -31, 110, 35, -85, -20, -107, 12, -90, 27, -22, 4, 34, 23, 3, -68, 70, 25, 43, -40, 82, 53, -126, -80, -62, -141, -140, 111, 66, 12, -34, 84, 0, -22, -89, -69, 57, 43, -25, -76, -70, 21, -14, 39, -39, 38, -9, 145, -50, 51, 44, -66, 16, 79, -30, -32, -1, -132, -85, -75, -29, -57, -90, 43, 148, 67, -67, 0, 1, 34, -98, 103, -88, -44, -81, -55, 77, -99, -50, -82, 67, 31, 54, -79, 26, 27, 9, -25, -47, 93, -66, 36, 14, 54, 38, 13, 68, -38, 40, 63, -103, -35, -87, -104, -1, 176, 32, -89, -67, -67, -25, -79, 59, 77, 56, -28, 9, 16, -62, -22]
-390b2
##PAGE=	F1=128.847
##FIRST=	23151.189942674980557,	6007.9998942000029274,	-0.17736057937145233154
##DATA TABLE=	(F2++(Y..Y)), PROFILE
6008B8j6j05J04LM8m9Ql6k3L8J56j95J3q2K2j1J32k3K3Kp4o2K05j27M1o5j9P2M3n0p6q3J11
5595d7J84k43K02m9l3o4J8J36p9R4l8j36L1K5j71K13p7J25N1j18J10Lp0j10J14J0o6M1j19
5232f3K4L7P7k2j57R6Q4j24J61o8K8p4j38O0N8l4l9R4J58j17j33M8L6N9Rj34O7k4M7J23j26
4844A3j04R8M7J8O1j08k0J0m6m6Q3n6k8P9J8n8m9J31M2p1n3J34r4J9p2K46j13m6O3l1m3p5
4443e1J58O3k87O8k5J74j26QK2j40M8L1J17r0M5oO2j2L9j70J17K3q6j2O8L2pK5n7o1M7j38
4042a21R6l3J04m6O0q9K07l1q1k4Oj33Q0oLP0r3j16J88J8kk9Lo1J4J3j8J52k84J87j29J41
3642D6m3j74J33j0N4O4q4MJ05j7r8J81k05P3n5L1n8L2M1o8P6K8j1j41pL3j1MkJ56q6J09j3
3229H7j75m2J18QN1r4P0O3LrJ8n9N9j60J09Q4J16k30j40K2o4J42O2O7q2M1rl2N4j8j01L3N2
$$ y = [28, 12, -93, 11, 14, 62, 13, 21, -15, -38, 0, 156, -39, -26, -108, -86, -97, 35, 12, 35, 37, -37, -99, 106, -21, 20, -45, -64, 8, 51, 1, -75, -158, -47, 137, -106, 96, 47, 14, -50, -32, 104, 25, 119, 81, -55, -24, 1, -170, 43, -34, 91, 142, 24, 134, 137, 67, -43, 71, 81, 15, 56, -63, -39, -2, 75, 53, -104, -8, 76, -48, 113, 45, 73, -1, -139, -79, -21, -55, -94, 0, 158, 41, -92, -44, -8, 51, 60, -74, -7, -31, 16, 139, 13, -91, 7, 54, 72, 133, 25, 5, 15, -31, -77, 6, -50, -78, 1, 19, -39, -88, 43, 85, 14, -39, 95, 1, 20, -52, 194, 81, 35, 98, 67, 24, -51, 107, 170, -117, -49, -74, 100, -26, -18, 4, -136, -88, -57, 60, -30, 15, 9, 71, 59, 98, -72, 45, 68, -18, -30, 38, 70, 63, 88, 31, -30, 17, -121, -25, -58, 46, 0, 60, -29, 178, 147, 66, 42, 48, -85, -5, -11, -8, 62, -31, -147, 41, 59, 57, 28, 31, -30, -16, -3, -21, 131, -153, 34, -95, 46, 3, -171, -38, -48, 6, 70, -14, -10, 95, 78, -20, 161, -44, 29, -26, 5, -53, -21, 20, -48, 28, 56, 45, -96, -103, -70, -81, -77, -79, 77, -9, 100, 87, -88, -130, -12, -4, 47, -47, 23, 86, 89, 80, 98, 39, 98, -62, 47, 131, 247, 17, -123, -101, -165, -23, 39, 106, 24, 65, 56, 24, 78, 60, -41, -8, 44]
2815D4M7k7k5O7j75J54L6j6j03J24j25Q7j46N5L8P6m4q8P3j36J44p7P6j00rJ06j0p5R0j21
2440f0J3P7M1o6m2J61j00M3j1o9J0Lj2PK2j26J22n7O9k3M6j00p3l4J24J52r4k0N7p4k9J55
2039A12j31r9J10N1n0%J28j66J2N6L9L3k26J68k1j06k8J50q4O1J6p5q2l8J52J36l7JN7K8k53
1651h6L1N5J7J2J4j11kp5J04L2n6J29n9K7j05L5P9JN0n2Q6j75P3m4ll1J74j34J2rM7l6j32
1238a32R8J46o6j68J18o2j6J25j48J7RP3J37n7j49K8q6J42j06J07m8L2M4nk0o0J30p1L8o5
862a5J24q4j43O5K4j07l2K69ro7p8J50j20nn2K8R5Lm0p4rJ16o2L5l9M0o0J14r8O9L9j19M4
449BJ25j64L5j2j00L3L1J2m4j6J16P9n0j14K8K5M6j68K18j50nl0M0J60j91N7k4J29m5N3j34
61e8J30pj8o5PJ06j59R6m8L1j2m7R0n2R7mk08J29p0n4Q8J60r5j20K6kL4o8J58K0p2k5P2pq9
$$ y = [44, 91, 64, 39, 106, -69, 85, 121, 105, 2, 126, 1, 88, -58, -3, 35, 111, 67, -21, 52, -84, 60, -17, 59, -41, -50, 56, 46, -29, 61, -60, -47, 30, 71, 5, -37, 124, 24, 67, 56, -13, -3, 0, -12, -5, 17, -109, 13, -44, 25, 2, 48, -52, -125, -159, -35, 117, 23, 3, 60, -14, -43, 112, -19, -118, -8, 43, -7, -7, 121, -45, -33, 23, 62, 95, -131, 37, 16, -90, -118, 32, -52, 9, 25, -50, -132, -170, -18, 118, 81, 82, 139, 167, -86, -55, 0, 17, 29, 43, -68, -70, -145, -41, -9, -65, 64, 5, 32, -73, -38, 41, 42, 92, 40, 126, -49, 24, -20, -23, -54, 120, -14, -2, -11, 36, 0, -132, -34, 112, 46, -122, -4, -66, -82, 43, -105, -88, -79, -6, 131, 74, -75, -47, -133, 9, -97, 10, -38, -6, 38, 33, 13, -47, 83, 12, 50, -15, 109, 25, -118, -53, -29, -136, -168, 101, 92, 25, -53, 97, -23, -28, -80, -52, 43, 46, 6, -68, -77, 39, -23, 12, -27, 13, -47, 67, -31, 38, 77, -42, 2, 127, -37, -2, -14, -114, -81, -50, -38, -82, -98, 18, 97, 47, -67, -39, -14, 32, -136, 82, -68, -73, -103, -63, 97, -94, -37, -61, 68, 23, 76, -58, 72, 65, 47, -18, -11, 95, -64, 32, -16, 15, 3, -44, 46, -6, 91, 87, -121, 8, -62, -116, -28, 132, 37, -83, -57, -59, -25, -93, 65, 85, 13, -12, 60, 53, -36]
-377c6M
-390c2
##PAGE=	F1=34.4931
##FIRST=	23151.189942674980557,	6007.9998942000029274,	-0.28748652338981628418
##DATA TABLE=	(F2++(Y..Y)), PROFILE
6008B1Jj06R5J7Rn7M9p4k7M6J93k36N1o8K4m7J24j3J2J3n2n2J96j17Pn3K5j1N3Qp6r0J04J37
5582A06k35K55p7l4r0N7J31p5Q4o4j18L9K6j58K00p1R4L7r2O2M3k1j53Q6L5n3J0p0J0M2N6
5194F2%j91J28N7r3J19o0O5o7j49M1O4JJ0M8P4j02r5K2N7L1L4j38Q4k6M6J17j52n0Q7L9J6
4794G9M7p9o2K5q1l0J28j08lO7J8j8r8J41O0j5j14O9qko0K55j17m6L7M0j17n2J63M5l09P2
4393g3LJ82j10J7J2j60N5M0Q5q5L8k5Q4m3N6j60J16J08j23k2O9M4q0P6j36mM8j50J31j2P4
4005E5n7L5k9J55l3m4l7l8j08J02J8j5M3p8j02K13k5k1Rj5n9O0n3L1J52k90J64j00R5q0r2
3617a44J04m5J08N5p4N4K4p7p3J92j87R2p8J8n0Q3k4m3N8O5k3j36j9J0k6N3NJ77r5O8J2j45
3216f1o0O3K6P9q6N1M6j3PM8q3J45k82J25J10M4j42j71Q1l3Q2M0Q5o4JL9k4L9k1j28J7R0L1
$$ y = [21, 22, -84, 11, 28, 37, -20, 29, -45, -72, -26, 167, -69, -18, -86, -62, -109, 15, 2, 14, 27, -25, -77, 119, 2, 9, -44, -19, -30, 23, 31, -45, -135, -31, 106, -129, 126, 49, 15, -75, -18, 113, 38, 122, 58, -60, -21, 5, -153, 47, -24, 70, 107, 15, 77, 120, 99, -54, 32, 67, 14, 24, -46, -36, 6, 62, 62, -129, -1, 56, -37, 82, 22, 87, 20, -129, -88, -24, -23, -13, 35, 109, 7, -88, -66, -9, 22, 56, -82, 2, -24, 22, 139, -13, -63, 24, 63, 79, 126, 47, -15, 10, -71, -101, 27, -81, -84, -17, 1, -17, -115, 26, 86, 71, -43, 26, 18, 16, -44, 211, 94, 48, 85, 125, 8, -44, 119, 164, -145, -73, -70, 112, 2, 19, 31, -129, -74, -34, 51, -34, 4, -21, 63, 20, 76, -84, 32, 140, 17, -5, 64, 108, 28, 104, -32, -36, 12, -138, -7, -19, 55, -2, 33, 4, 159, 126, 82, 45, 7, -101, 1, 19, 4, 47, -31, -133, 80, 55, 34, 43, 28, -31, 29, -24, 7, 159, -131, 33, -67, 28, -52, -144, -40, -85, 23, 78, 4, 58, 82, 5, -68, 124, -63, 29, -49, -31, -81, 2, -22, -65, -7, 58, 35, -101, -120, -110, -136, -83, -78, 99, 4, 72, 84, -61, -121, -58, -32, 47, -39, 12, 58, 45, 52, 100, 17, 162, -120, 5, 115, 159, 17, -154, -73, -106, -24, 16, 101, 37, 38, 77, 53, 92, 71, -57, -40, 50, 81]
2803H1j8j2K9j57J37L5Nm0M6r7Q3j97P9Q2M7l5p5N5j24J27q7R5q7l7J00J8o1N5j46M6N0P9
2402G6l5n0J29o9j4Lp8j6J7N0l7M8j07J48p3j0M4k0p0r4mJ21J06k7k9M4m8o5J65j42o8R7K6
1989A8o7LJ69j29LL7L7Qk14J32K7j24J3R1p3O7j3J5j69lJ65Q9Jk6O4kj62JL8N6j0L0j49K9
1563d8n9Q1J0p4J22Mk7o7M8N0J1J5k8N2j55P8o2L7j9J52j17j7k1L8Rj37J24J01q2j73J36n6
1163g4lJ08j40Q4m6J03J06o6j39J4o6J10r5O7k5L1O4Mj2m6J15q5N6n7J14j30j14J06K3r7n1
775a41K32J2o6j03J80j58J4j4L8J6K1kq4k5J22r9M6j0j5l8O6nL0Q0j06j3J60k00Q5l9o4J6
374f4N1j8o6PR7K7k4m7j9J3M9j78K30j01l4j2M5J31j52N3j9P9l8O6j05J27Jqr1L4L3j29O9
-39Gn0RK5p6J17j6R5m2j89J85j01p7O5J01j7j06L4J1km8J50lj01J7P5L0j03j6
$$ y = [81, 63, 51, 80, -77, 60, 95, 100, 60, 106, 9, 92, -105, -26, 56, 103, 68, -7, 48, -76, 51, -36, 59, -28, -65, 35, 53, -8, 47, -99, -53, -3, 76, 41, -9, 120, 51, 37, 40, -38, -54, -37, 13, -24, 24, -83, 65, -8, -18, 26, 6, -64, -158, -162, -41, 65, 38, 9, 53, 5, -60, 105, -37, -105, -8, 18, -49, -46, 123, -6, -3, 34, 71, 79, -135, -3, 24, -100, -87, 4, -69, -2, -15, 0, -169, -172, -7, 82, 83, 57, 121, 119, -43, -42, -4, 52, 42, 72, -77, -48, -107, -26, -16, -90, 32, 36, 9, -58, -10, 40, 51, 66, 38, 90, -65, 13, -49, -12, -31, 121, 4, -13, -34, 4, 13, -124, 0, 101, 19, -154, -18, -74, -77, 31, -109, -25, -71, 32, 138, 72, -67, -53, -119, -9, -104, -37, -62, -31, 33, 37, 25, -21, 94, 9, 65, 8, 122, -8, -122, -16, 7, -90, -141, 91, 103, 37, -66, 114, -44, -30, -44, -6, 10, 31, 29, -55, -80, 42, -57, -11, -21, -36, -74, -8, -13, 17, 97, -9, -22, 138, -62, 23, -16, -80, -64, -13, -31, -97, -90, 7, 34, 10, -37, -56, -43, 6, -172, 58, -43, -77, -89, -44, 87, -65, -12, -31, 48, 10, 76, -29, 98, 99, 91, 0, 34, 67, -62, 7, -43, -34, -9, -85, 32, 16, 111, 69, -120, 65, -36, -113, -48, 53, 36, -70, -36, -25, -27, -75, 75, 72, -29, -12, 63, 93, -10, -26]
-390b6
##PAGE=	F1=-59.8608
##FIRST=	23151.189942674980557,	6007.9998942000029274,	-0.14384095370769500732
##DATA TABLE=	(F2++(Y..Y)), PROFILE
6008@K4r2P2K6rp0J07j21l2M6J90k13P2o1K3o1R9nNK7k7l2J68j08l5l6O5q2P7M0o8q7Q5R2
5582G9k08K44j00j4q7Q6J17o2M4p8q1O2Qj21J60n9O7Qn7L6M9Nj66O3M2j6k5kj9N1L0J1k08
5169a41J37M4o9O7l0P9o1j23LQ2RN3J4k1q3lqL7J4M6j19Q6l6M2J01j74J5Q2J3PM5l2j20L6
4743hr2j2J42j31K0M6K1J3j54J47N7N5j38oO9ro8K55j08l3K2Q8j87l3J65L0k81N9jJ80o7J5
4343E6kj38L6O0J3m8N7p8J00p8O9j33Q9J75j45k7Q2M5j27J15k00J1Q6j51J47RN0r4K3K8Q6
3955A16l7mj9p1r6J13M0j4ll1j07K28n7n6L3k2n7J13j04N5J32k59J54o2kq2kN6r9J90K2n6
3554A2P8m2j16m8J64j22J15j03J0l4J13o5l1L7P2k9r8l6j8k6J13%J61p0NL6r7r4J0N2J11p1
3153a1K3J6qj0P5j01K03l24R2J22%n0j60J04JK5%Q7l2l4P6k0J4j1j58K2J02K2pKl2j09J19
$$ y = [0, 24, -68, 4, 30, 21, -49, 58, -63, -95, -49, 141, -72, 0, -61, -38, -99, 0, -5, 0, 27, 0, -32, 136, 28, -7, -43, 22, -60, 17, 57, -11, -98, -13, 79, -129, 115, 15, 1, -86, 0, 117, 55, 99, 21, -60, 2, 10, -111, 49, -10, 57, 65, 8, 44, 93, 98, -68, -5, 37, 21, -4, -6, -25, 26, 56, 67, -141, -4, 40, -29, 38, 8, 87, 26, -97, -94, -12, -3, 50, 64, 43, -40, -43, -51, -14, 0, 46, -73, 13, -23, 19, 120, -54, -39, 43, 56, 63, 108, 76, -44, -8, -100, -112, 30, -101, -81, -35, -14, -1, -155, -8, 49, 104, -34, -40, 29, 20, -48, 207, 99, 66, 88, 176, -11, -44, 121, 151, -130, -71, -72, 108, 41, 56, 54, -84, -48, 12, 25, -23, 34, -44, 56, -22, 47, -86, 3, 178, 33, 6, 88, 133, 6, 121, -79, -68, 18, -133, 14, 23, 73, -21, 2, 30, 116, 79, 75, 56, -15, -111, 2, 42, 28, 25, -6, -113, 115, 58, 2, 35, 13, -44, 69, -35, 20, 152, -107, 47, -15, -17, -99, -101, -45, -144, 46, 68, 12, 90, 48, -68, -116, 48, -74, 41, -62, -52, -86, 27, -38, -69, -32, 40, 11, -87, -123, -141, -167, -54, -54, 107, 37, 42, 78, -19, -113, -103, -51, 60, -11, 12, 28, 20, 10, 85, -16, 187, -137, -45, 77, 77, 27, -133, -29, -28, -3, -3, 84, 52, 18, 94, 74, 88, 77, -81, -59, 43, 65, 58, 60, 28, -81, 38]
2740C8K7j3M4m4l9O7k19R6J10K6k3q0O1q8R0j12J23p7m5Q2M4n4K9j66O4LJ12Jj9P0m1p1K3
2327A9o0o3L3R2o9N6l6J16n5r3R9j00pr5J4J12O0K0k6K6k4p7J45j32l8P5J0q0J4J59p2j2J8
1914B9L5k4j47N6O6j04L6M5o8M0k1J29k39K6J54nO4n5R4n1o2j2PR1k2L3j73Q0n3O0l5q6J30
1501A8L1n3k8M8J1J8qROj14P6p3N3QJ22p5p3l3M5L9j41J41K3n0j65J47n6OQ9j04J03p7J26
1088F9N9r1q6J9l0M0r4MK5J3R1QJ5m2R1p4O1n7Q9j40j08J51K7o4m8J63J2n0j25J90j79K9L5
674CN4q4K1M3q4l0J00j24P3Nn9lL1N8j0R9p5o8J53j82J25m6m6QO7l5r7K5Q4j3k3L7n2j9L0
236c4j52K22n2l9KM4O7q7M5k5K2j9O6o2R7K5J3j13M9m1r0L0l0j8Q3r4J19oQ0q1j38K34j33
-177a6q0M4K3N1p8N5K4m2k3J24k7j07L9M5Q9j18j3
$$ y = [38, 65, 52, 96, 52, 13, 80, -139, -43, 67, 93, 70, -10, 51, -37, 53, -59, 64, -13, -58, 24, 68, 14, 43, -123, -59, -56, 56, 57, 38, 108, 67, -4, 19, -41, -104, -71, 21, -48, 8, -28, 88, 33, -60, 39, -61, -68, -163, -149, -37, 23, 43, 17, 43, 19, -58, 87, -45, -83, -8, 2, -78, -64, 95, 23, 11, 29, 64, 40, -107, -51, 15, -89, -53, -8, -76, -36, -57, 72, -167, -141, 13, 8, 72, 17, 111, 60, -2, -14, -7, 84, 62, 95, -78, 2, -51, 9, -26, -112, 18, 49, -4, -32, 16, 27, 45, 37, 46, 52, -62, 14, -59, -6, 2, 124, 49, -24, -57, -12, 27, -114, 27, 50, 0, -165, -18, -74, -68, 21, -83, 20, -57, 69, 128, 37, -49, -30, -60, -20, -114, -110, -85, -72, 19, 27, 42, 0, 91, 17, 78, 21, 110, -30, -138, 13, 40, -24, -72, 91, 103, 53, -72, 118, -61, -32, 3, 57, -27, -6, 37, -47, -77, 23, -101, -28, -23, -82, -85, -54, 4, -6, 93, 18, -50, 103, -79, 46, 0, -46, -38, 29, -6, -103, -78, 6, -7, -30, 7, -45, -64, -34, -186, 36, -16, -55, -53, -9, 58, -29, 16, -9, 13, -6, 60, -2, 95, 120, 133, 20, 69, 28, -62, -32, -62, -80, 3, -91, 28, 22, 102, 21, -117, 117, -16, -96, -52, -29, 22, -56, -1, 23, -19, -42, 82, 55, -52, -13, 32, 121, 3, -10]
-390a0
##PAGE=	F1=-154.215
##FIRST=	23151.189942674980557,	6007.9998942000029274,	0.0040282392874360084534
##DATA TABLE=	(F2++(Y..Y)), PROFILE
6008b5M3o4M0L5k2o7J53j62l0L2J49j29O5o2L4o2O7qMN0rj1J23j00p0j6P0r3J02K6m7o6M9
5595aN7j62J82j17J6n8R9J01n2jp3m3R9k8p0R8m4O0l9k4L9K8%j60N5M4K2m6M9m9P2LJ5k14
5169a42J18O8o1J6MP1o1o4l2R0mP2kr0o5J07l7pJ1M8q7P0n3M2Q5j82O7Q1k8JN0Lj53L5p3j0
4718a12J31j19K7L2J2L0j78J29L1J17j14o1J01or2K59q6j6J1R2k21k1J63K5k04K0k8J68mr
4343G7Lj03lQ6n8oQ7j34J05j27R3r5M3J89j39j5R8K4j26J31k14k1J42j46J38K1L5j31K8N3
3967C5K2m6K9K5q1r0J04L8J1m8L7j21K25q3j00N5k4m8J56j18M1Q4j97J65k8j21m5N6K1j55
3592b01K61k4k8O3n7j27l4J15m4J26j14Qj5J05p2l9L5N7k3m8n0l9k6J56MJ12j8o5O0n8j34
3204a14j2O1J40m9oj7J9m4Q3j05K09k71J9J18JK3j18Q3J6Jm8P4%n4J00l2nOj87N8Q9J9pQq5
$$ y = [-25, 18, -46, -6, 29, 7, -60, 93, -69, -99, -67, 82, -47, 18, -44, -10, -72, -5, -13, -9, 41, 32, 21, 144, 44, -26, -42, 28, -65, 37, 63, 16, -50, -1, 56, -106, 76, -41, -25, -83, 16, 117, 65, 64, -9, -52, 47, 19, -51, 47, 3, 63, 24, 0, 39, 67, 67, -93, -38, 6, 28, -18, 31, -18, 54, 57, 72, -142, -24, 44, -17, -1, 3, 74, 13, -51, -83, 7, 3, 75, 73, -17, -82, 25, -12, -19, -8, 40, -47, 23, -30, 12, 97, -85, -18, 63, 35, 36, 86, 89, -64, -29, -102, -112, 19, -100, -73, -41, -29, 1, -177, -48, -17, 100, -14, -75, 26, 20, -72, 187, 101, 85, 96, 188, -33, -54, 109, 134, -70, -50, -78, 90, 86, 77, 80, -23, -26, 60, 2, -4, 83, -51, 54, -73, 20, -75, -32, 157, 18, 3, 101, 125, -1, 130, -84, -105, 37, -109, 29, 50, 85, -46, -18, 35, 57, 11, 40, 65, -16, -106, -2, 36, 47, -1, 36, -85, 140, 57, -43, 12, -12, -60, 96, -22, 19, 103, -94, 71, 43, -78, -123, -67, -46, -201, 60, 36, 8, 71, 14, -113, -147, -32, -76, 50, -64, -56, -71, 34, -38, -77, -42, 15, -8, -56, -106, -145, -171, -15, -11, 101, 83, 18, 78, 20, -114, -126, -65, 75, 26, 20, 3, 22, -22, 61, -44, 165, -106, -87, 31, 32, 55, -63, 20, 36, 37, -11, 63, 63, 9, 109, 77, 72, 78, -109, -51, 38, 57, 50, 58, -27]
2765b7l8R8%n8J20j16L6M5j96R0J06L3k8r9J02n7M5j23J44q0l2O1M9l6J3j73O3n4J27K9L8
2377H2Oj6j08L6j7j13M0Q7o6N6M8M4k7j48J37j70P0q6K2J01K3K9LNj7n2J07j21j4M6%q1M2
1964e2J00k1k7KM8n3n3l4Q2n3K7L0o8j3jK21k70M6J26j06J13o5J20q9J2oj6R3j9K4j79J35
1563E4n6M1o9r2J46J9m0nL3k3J7j8M5l8m8O2p6M1L8R9k4j31o1Q2M1j26J25o7K1j50J50m0n
1150e5O5n5Q8r6J45Qj09qL6Mk9j16o1Q6k3J19KN9n0O2l7M4o2N6j04j27J91L5l5l5J02j1j8
737G1j38J66j67L5Q4P2j64j1R0p8k7N1j16J02lo0J6J6P6m5J00m5r3J03j06J40l0o6J8P6l7
349C0j31L3P6j2n5J04o4m2j2r6J93j3l1LL9Jk8L6l6j2kO1k8N5N1L8j26M9q4o3pJ3m4J36r5
-89f3Q7qN7j07r5K68j43o1K3m1Q3n2R5K1n7k0R5l0r8M5jJ24j23R
$$ y = [-27, -65, 33, 33, -25, 95, -21, 15, 60, -136, -46, 60, 93, 65, -34, 68, 11, 56, -67, 77, -3, -35, 26, 75, 39, 52, -121, -58, -112, 15, 44, 82, 88, 72, -36, 0, -17, -130, -90, -3, -69, -13, 35, 79, 52, -96, 41, -129, -59, -145, -123, -22, 1, 30, 33, 38, 21, -31, 76, -45, -59, -13, -13, -94, -52, 48, 27, 0, 2, 50, -3, -56, -90, -8, -61, -34, -4, -72, -85, -86, 135, -135, -89, 37, -69, 44, -21, 99, 10, 22, 16, 0, 93, 74, 98, -81, 54, -2, 39, -30, -122, 24, 43, 3, -2, 31, 8, 25, 7, 52, 14, -34, 28, -48, -7, 31, 130, 106, -25, -86, -4, 37, -89, 36, -31, -10, -160, -10, -50, -55, 10, -45, 43, -53, 92, 100, -9, -17, 19, 23, -6, -122, -183, -97, -120, -1, 1, 60, 10, 72, 35, 79, 17, 73, -31, -158, 33, 68, 33, -2, 100, 89, 71, -67, 99, -68, -33, 51, 123, -41, -52, 38, -40, -67, -16, -132, -30, -33, -93, -77, -61, 15, -30, 70, 25, -68, 35, -71, 69, 39, -27, -9, 67, 30, -101, -68, 8, -4, -59, 45, -19, -61, -73, -169, 24, 11, -20, -17, 22, 23, -5, 31, -5, -17, -19, 42, 14, 69, 120, 158, 32, 81, -3, -66, -73, -60, -104, 32, -63, 24, 16, 73, -34, -129, 139, -4, -65, -42, -83, 0, -52, 43, 64, 7, -13, 82, 52, -46, -1, -2, 122, -1, 8]
-390H
##PAGE=	F1=-248.569
##FIRST=	23151.189942674980557,	6007.9998942000029274,	0.065865874290466308594
##DATA TABLE=	(F2++(Y..Y)), PROFILE
6008d1M7l4PO7n4m0J67j85j1kQ4j4L0o1O1o4M3k2J1P1nJ2O2r0q2KL3l5J16k4j3k8mL1j03R7
5557B9j24M3j8R4R7o2l4m7j6J32o7k1L1j9P3j08J1N2Rl0j59P0N2M1m2N3o6J10k1J8k13P3J29
5144G0o4l2K7N3p0J1m2P3k0N7rr9n4J87o4m6K2L8m4L9p0M3P3j68Q6Q1o5%N0J1j40K6l2l5J11
4706Dp8J4K4nL9j53P7j1J53o2o5P2jj14K69n8j0NM8j96k3J55L1j02l5o4J49O6n5L6q0m8J03
4293H5r2J6J06j59J00j77J22n6kJ48j17K1R7pr2J31j71p3J81j38J07K4K1j38L7L8j2o7N8P5
3917F6o6p4O4MN1p4J08j29K04j15j34Q9m2k6J80r0LKj16J88mk19PO3K4j93K90o6oK5j0j14
3517a10m8P6J0J18j00JLO1n3n9N4M0jqn9m7l1J60K6N9L6j28Q6m6j68NM6J58k1l3l8N1p2O8
3091C6q7J60j55o2R9L3P1p3L6OK0r1N4J6n2J09o1qK5k03J14N8J7j6Kj13M1P2m6j05J63j52
$$ y = [-41, 6, -28, -21, 46, -8, -48, 119, -66, -77, -79, 5, -9, 21, -40, 21, -43, 0, -22, -11, 60, 55, 67, 129, 39, -43, -41, -8, -43, 73, 49, 36, 8, 4, 35, -68, 29, -95, -52, -70, 24, 121, 59, 25, -22, -38, 94, 27, 6, 37, 18, 91, -17, -6, 46, 55, 25, -134, -64, -12, 29, -13, 40, -26, 84, 63, 81, -132, -59, 70, 6, -26, 1, 54, -16, -5, -47, 26, 6, 63, 54, -45, -99, 88, 24, -22, 0, 38, -6, 33, -37, 6, 79, -89, -3, 78, 13, 13, 63, 74, -66, -40, -72, -107, 4, -74, -60, -36, -41, -2, -155, -78, -89, 64, 2, -63, 9, 8, -106, 163, 105, 95, 100, 148, -48, -71, 84, 115, 13, -22, -86, 63, 129, 74, 110, 30, -18, 85, -7, 9, 115, -44, 56, -121, 1, -55, -57, 91, -26, -5, 92, 85, -7, 124, -47, -120, 61, -77, 30, 54, 75, -63, -26, 12, 0, -67, -9, 66, 0, -74, -10, -6, 45, -29, 79, -50, 154, 39, -95, -6, -48, -74, 106, 16, 19, 21, -95, 93, 89, -130, -123, -60, -36, -229, 61, -5, -11, 14, 4, -110, -158, -82, -72, 46, -54, -53, -50, 11, -42, -101, -47, -7, -8, -16, -75, -122, -153, 7, 33, 92, 128, 0, 86, 40, -128, -123, -77, 81, 60, 27, -11, 40, -32, 36, -51, 109, -46, -108, -9, 24, 95, 22, 58, 64, 84, -7, 47, 63, 11, 120, 59, 51, 76, -127, -13, 45, 62, 46, 48, -65, -24, 48, 2, -103, 60, -92]
2690i2J00L6j32N8P0O4n8j18J65m7Pj09J56r4pM1J8KJ1j67M9j12J33M2Q2l4Qj10K0L8j39L3
2290h6K4k4O2J16m3j5j54J58k03J31q0J9R3JRN1j8l2MP1j28JJ4no7Q2J2J4l5j2P7p5L1j06
1864a13P4KmN0o7p6M3K59k60N9Q9j71J23n3J19q9M1J1j5N2kNj65J65n9K5o7r4J54j3PrPl7
1438iRk2O6o5L5L4o6J0M7R6J9j70j05J43J8q8P2j42R7j27J49Jm2L1j2P1j12J66m3j09P6N5
1038H3J9p1j55j05J34o6J37qJ03o5L7J2J5o8K1m4j49K15M6k9l2P8n0K4j37J12j20L2J17Q3
662A69j86o4J24o9j9j2p1J11l0j3KJ9N6o5R0l7p0K7kJ29Kj18M2O8j5j59K8O7L5j05J27n9k9
249b7p1l1J54J3l1mL2l9%K2l9kMN2qJ1N9N6j27M6r0n3l3P7p0J54p4L2mK7j13q1K78j20k7l
-202c0o3P1m2J50j1k7m7P4kq9M6m8J07j06L5
$$ y = [-92, 8, 44, -88, -30, 40, 104, 46, -72, 93, 46, 53, -56, 100, 6, -1, 40, 58, 60, 71, -96, -47, -159, -26, 16, 98, 64, 72, -38, -18, 20, -119, -86, -62, -86, -24, 92, 49, 34, -120, 38, -165, -34, -114, -95, -2, -1, 8, 59, 41, 9, 13, 84, -44, -43, -29, -34, -101, -19, -7, 7, -28, -40, 37, -38, -7, -113, -39, -37, -41, 9, -58, -134, -91, 168, -92, -33, 56, -115, 8, -45, 74, -15, 26, 37, 22, 74, 72, 77, -88, 77, 18, 43, -24, -118, 36, 23, 30, 21, 28, -9, 0, -22, 44, -21, 14, 48, -18, -8, 39, 135, 154, -16, -121, 22, 40, -48, 24, -118, -21, -148, 1, 2, -40, -9, -21, 50, -62, 104, 61, -48, 28, 83, 102, 31, -124, -229, -95, -161, -24, -32, 71, 6, 43, 55, 70, 2, 23, -21, -170, 45, 91, 62, 30, 108, 58, 82, -55, 57, -63, -31, 86, 169, -17, -81, 43, -26, -45, -57, -128, -17, -47, -60, -58, -39, 17, -48, 42, 5, -65, -38, -40, 89, 91, -27, 15, 83, 68, -91, -63, 4, 39, -66, 61, 2, -27, -98, -129, 25, 38, 7, 3, 35, -4, -4, 18, -21, -23, -19, 33, 25, 36, 95, 151, 24, 70, -20, -73, -106, -29, -99, 55, -19, 13, 9, 36, -77, -158, 120, 0, -27, -30, -93, -22, -64, 86, 75, 48, 1, 75, 73, -16, 30, -18, 89, -17, 18]
-390A8
##PAGE=	F1=-342.922
##FIRST=	23151.189942674980557,	6007.9998942000029274,	0.05621822550892829895
##DATA TABLE=	(F2++(Y..Y)), PROFILE
6008c6L2j6j5J21j08NJ40j83L3m9J3P9qn1R6p3L1m1K3P5j0L2jp7o1Rk5N6J17q3L1Pn1Lm0J8
5557gj16N5J7P6J04r3m4j2%J42j01K2k0J5R0j87M4O1J3o4j80J03O2L9j4Oo0J55l1J8j98J1
5157i4J94o5o3K8M1r1P4j8K9k2K4k8l7n4K05r0n6L8K6MLp8L6O6j35O2Q4p6jL0Kr4J8J7p6R4
4706ck9j3J7k3N2q8mm8J50rk2J2Lj21K77l8k0Kk4j14m0J30M6j1q3r5J27J31j19Q4o2q8J06
4293H3r0K2R1j43R0j97J41l1k8Q4j06P9N8j7o2J29r5j11J78j26P1K6mj04L6kpj01Q8J09m2
3905A9l3%o1R7p6J59j18J75j57j40J28q4QJ77k4l5j03l2K01Qk63M6K8P0k10K77r3j5OO8q8
3517f5q6O4K7R4o7k5J6Pl3o8P6L8L4Qo1m4m0J30N9K5O7j70J06o0j77M0K1J56Mm4m7P3q0M4
3091B2n1P0l5j09O8P0R1m3j3j8O9j20L6Qk8J12j06J3L4j97J73K0J0k5j2j09J03L9r5j24J61
$$ y = [-36, -4, -20, -35, 86, -22, -17, 123, -60, -27, -76, -63, 16, 8, -43, 53, -20, 11, -30, -7, 68, 58, 90, 89, 12, -49, -40, -65, -9, 108, 25, 56, 63, 12, 15, -25, -7, -123, -68, -51, 25, 129, 36, -8, -20, -20, 122, 21, 43, 23, 38, 128, -59, -15, 46, 59, -5, -185, -82, -20, 19, 5, 11, -49, 106, 75, 93, -105, -94, 100, 35, -28, 0, 41, -50, 24, 6, 35, 13, 37, 9, -28, -82, 123, 33, -23, 15, 41, 45, 48, -30, 6, 72, -63, -1, 83, 7, 6, 36, 38, -56, -38, -21, -97, -3, -32, -45, -28, -51, 1, -87, -91, -139, 11, 2, -20, -8, -5, -126, 151, 113, 93, 95, 71, -43, -83, 47, 93, 82, -1, -96, 31, 162, 43, 127, 65, -23, 83, -7, 15, 106, -37, 53, -144, -3, -34, -62, 22, -84, -5, 53, 36, -26, 103, 8, -103, 75, -51, 20, 46, 42, -62, -26, -28, -35, -136, -48, 61, 19, -14, -14, -75, 22, -54, 105, -13, 162, 5, -135, -7, -91, -83, 94, 70, 35, -68, -100, 101, 109, -154, -108, -80, -10, -220, 57, -36, -51, -45, 23, -65, -151, -87, -60, 34, -33, -58, -42, -35, -68, -136, -60, -22, 12, 20, -41, -85, -125, 5, 64, 89, 156, -14, 92, 32, -145, -105, -84, 72, 76, 32, -15, 58, -22, 22, -29, 41, 6, -103, -35, 35, 126, 83, 70, 52, 121, 1, 37, 45, 17, 129, 23, 36, 70, -127, 46, 66, 76, 51, 39, -70, 33, 72, -23, -147, 14]
2703A4j50J23N3n4J2J5J02r9j26K20n7rq0J60j05K0J7l5M9J7j44L6j67J41M0Q1l0L4q7k5Q6
2315E2j32J6o6L4Q1J47j16k6j19J68j93J58p8JQ6pj3R4l8o2P2M1j47J0k0lm3J18p5M0m2k3
1914h5J09p9P6j42N5L0l1R3o4j28R8K33k18O2N5j82R5k8Q7n2L7J7K2j9J7j9j33J52n1J2l1
1526a2r1J42l9N7k1k7k7lk8O7o3J12pl8k8K1J18M3j86j46K05j1m2Mj84J41r7J49N7r0k0J7
1125b7P7j27J90r1q9J48N9J0q1j83j22J53j00J37j5J30p4K3M9op6rQj49K18N2m0n5Q9q0N8
737G7j14M2m8K1J20Q3j48j05J30o0j5n7rQ5o8O1l9L2K4o8P8n7ln1Q1J03L7j76P2L7K8j67J4
324f0N0J10j50J05m7J6j23J6J17K6m8kJ9m9kLl4N3mL6Mk4L2O6j13N4p2o3m3J53r9J30m3j4
-102@Oj2r7q6K54o4Nl0m0L5n9K00o6L9q3O3M6r6O1q3L7o3M4
$$ y = [14, -136, -13, 40, -14, -2, 13, 115, 16, -110, 110, 53, 44, -36, 124, 19, 39, 56, 21, 70, 87, -57, -21, -188, -47, -7, 74, 44, 78, -9, -34, 52, -80, -64, -130, -96, -15, 132, 16, -10, -129, 39, -154, 4, -74, -73, 13, 6, -7, 87, 49, -13, 59, 100, -47, -37, -57, -60, -103, 15, -60, -20, -62, -85, 24, -55, 21, -121, -66, -36, -67, 26, -38, -166, -68, 165, -53, 9, 64, -118, -23, -51, 36, -16, 21, 38, 60, 41, 58, 39, -94, 58, 7, 19, -12, -103, 39, 0, 57, 36, 9, -18, -21, -49, 18, -45, 67, 60, 22, -6, 15, 133, 176, -10, -156, 49, 38, -4, 0, -184, -43, -140, 9, 66, -24, -44, -27, 50, -77, 113, 22, -67, 81, 140, 150, 69, -114, -236, -83, -183, -46, -61, 69, -5, 18, 67, 61, -15, -24, -16, -165, 53, 105, 65, 10, 99, 19, 77, -37, 5, -43, -22, 98, 181, 33, -72, 58, -2, -17, -74, -83, 2, -66, -5, -44, -12, 12, -56, 22, -35, -38, -89, -8, 95, 132, -44, 28, 65, 93, -74, -60, -10, 100, -50, 55, 8, 24, -99, -83, 34, 60, 12, 10, 29, -20, -22, -19, -53, 0, -4, 32, 36, 12, 44, 110, -3, 51, -21, -84, -127, 26, -73, 57, 14, 0, 6, -6, -103, -189, 65, 1, 6, -24, -64, -29, -88, 112, 46, 85, 2, 65, 111, 15, 76, -7, 30, -33, 11]
-390A1
##PAGE=	F1=-437.276
##FIRST=	23151.189942674980557,	6007.9998942000029274,	-0.11972243338823318481
##DATA TABLE=	(F2++(Y..Y)), PROFILE
6008a5Nj3k4J79j58M3Q7j61R5q5n2J20l4l5J23p6J5m8L8N0j4M2m8o0j7Pp0J28J04j23P2J5
5607I0o7k5J3l8r2N2M1M9J09j30l6J8RJ22j19N3l5M4J00k49O8N1M3r0k13J44P2K0K0p0l2J88
5207A10k2J5j66m7K22n3p0J1L8j10J02L4l2pj0n9O3o0J65j10m1N8J8N0l5o5J5N7q8MQ8n3r
4794A3j1Jm7J2O3j07P9J1m0Kl2P6k3q5o5J11K1M2m0Qj06K72l1m6J3j01kp1Q8N8M7j08j10J07
4368aJ76j80J23m0j10R6p5K6M4j01P6j56J30l1k9L9j18J40j6J1o5J39l0j08J31j09N3K5m5
4005em0K0n0L7j37J19J13k4K4o2j36J33o2J76q6J47j97j14J50j37M7J47O3n4k10M0J82J3k39
3642a42N1j9J36k07K46j01p0K9J33o2j26P8J4O2k1p4K1l8k4n0P9N2P3Qo1m3m5R1Q5J0P2j86
3241b9J09p6j57O0J0J38Rl0n3Q6p3K2ok4M0j04L7Q1Q6l8l3l5J17j33K8k1J1J10j48M9K6j65
$$ y = [-15, -10, -23, -47, 132, -26, 17, 104, -57, 38, -47, -99, 21, -13, -48, 75, -1, 14, -34, 4, 54, 40, 82, 34, -26, -43, -36, -106, 22, 126, 3, 75, 90, 23, -2, 11, -27, -119, -67, -26, 23, 132, 2, -34, -16, -7, 115, -4, 49, 14, 58, 158, -91, -23, 28, 71, -19, -232, -88, -16, 4, 24, -46, -78, 110, 88, 103, -63, -110, 112, 59, -11, 0, 38, -72, 30, 64, 32, 25, 15, -44, 19, -41, 124, 14, -27, 31, 49, 99, 64, -1, 14, 71, -17, -13, 75, 22, 13, 2, 3, -44, -32, 31, -76, 3, 14, -26, -24, -56, 20, -3, -88, -153, -42, -21, 21, -19, -11, -117, 155, 124, 78, 91, -10, -12, -83, 5, 63, 110, 2, -108, -1, 175, -5, 118, 78, -32, 64, -11, 15, 59, -42, 34, -122, 8, -23, -52, -13, -131, 9, -7, 4, -61, 78, 48, -60, 71, -38, 15, 40, -5, -45, -25, -75, -38, -175, -56, 57, 33, 57, -5, -141, -8, -70, 106, 20, 167, -30, -144, 6, -131, -84, 63, 126, 72, -138, -98, 84, 97, -142, -91, -110, 26, -181, 65, -36, -106, -77, 56, -6, -132, -54, -40, 22, 1, -73, -52, -90, -114, -164, -85, -33, 40, 48, -13, -56, -101, -10, 75, 85, 157, -29, 80, 4, -153, -93, -83, 55, 64, 34, -19, 67, -6, 16, 10, -14, 26, -78, -41, 40, 126, 88, 55, 20, 137, 4, 32, 11, 22, 132, -16, 33, 59, -106]
2840a06K17k3kk2k1q8J33Jj29j05J25j21Q9R8Nk9l4J25j33j16K37o5ln3J56j01M5j5q2Q0K4
2452H7j04L2k08J49K9L5K3M9n6q5J06r5Kj38P5J02J49j56m5o7J63j55J53p1l7Q1Jj9J04m7
2077E7r9J31J2j53J4n2Mj7J37j37O6m6k9J25p0Q7j44L2J8l5J44o1j50J40J61j53N1K6j47M2
1701d6lM0RK7rQ4q6K4m0q7R4k5MPq3J15m1Q0k3n2pj1l9N6l3J45n2J0n8l4J51M9j84j57K31
1263E6k6ln1j87J36n6J37J04j25p7L3J03j34K17j32n6J90M1j5p5j74j10J34j16J23rJ26p3
912a9K5N8kq7l3K8j10J94N1m5j06J14q3P1p2j6J6J6Q0P5p5j09J03n1k0n8M0L1j07J21p3M3
512@Nn3O1r6Q3j06J04Q4N6k07R4qQ2j49oK7J75j70N7l7P3j46L3Q8K3o7J3Mm4k2j7k1J25k1
86A7J5J5m2l2P5q8P8m4q9l9K18j22P5k1k0J2o0o0q4J95PK1n3NRr8K25j23J09j02N5Q7j14R1
$$ y = [-106, 111, 88, 86, 64, 43, -45, 88, 89, -40, -145, -20, -141, -52, 46, 51, 22, -12, 113, -20, -136, 101, 36, 33, -20, 136, 35, 80, 65, -17, 63, 87, -17, 15, -193, -44, -15, 20, 43, 92, 36, -49, 57, -38, -36, -174, -99, 3, 152, -4, -49, -116, 47, -108, 45, -26, -63, 18, 19, 0, 104, 57, -42, 89, 101, -52, -38, -90, -86, -103, 34, -103, -37, -83, -112, 13, -57, 30, -114, -82, -64, -99, 45, -16, -166, -26, 135, -18, 33, 59, -88, -46, -49, -9, 0, 27, 18, 102, 16, 40, 0, -87, 7, -18, -14, -7, -90, 25, -16, 64, 41, -11, -18, -29, -68, -12, -45, 100, 48, 58, 0, -34, 117, 166, -18, -175, 56, 30, 27, -24, -211, -75, -131, 6, 110, -15, -92, -59, 44, -90, 127, -5, -61, 129, 170, 155, 80, -94, -204, -70, -186, -63, -72, 54, -19, 6, 64, 62, -25, -58, -30, -140, 54, 105, 60, -46, 68, -15, 56, -16, -32, -16, 0, 80, 155, 80, -29, 74, 23, 3, -55, -15, 16, -91, 30, -43, 0, 5, -48, 13, -83, 0, -106, -2, 82, 138, -69, 25, 17, 99, -50, -56, -29, 146, -24, 33, -4, 69, -77, -44, 44, 67, 0, 13, 17, -27, -49, -66, -87, 38, 17, 32, 47, 5, -27, 48, -40, 38, -6, -95, -134, 84, -38, 37, 16, -4, 8, -52, -112, -196, -1, 6, 27, -26, -21, -12, -110, 115, -8, 101, -1, 54, 141, 27, 118]
-340A18r5n5pK9
$$ y = [118, 23, -32, -39, -10]
-390a0
##PAGE=	F1=-531.63
##FIRST=	23151.189942674980557,	6007.9998942000029274,	-0.22572982311248779297
##DATA TABLE=	(F2++(Y..Y)), PROFILE
6008Fj5j6l4K14j74N9K4j27J63r6r4R5l5j8J29o3j2l9M9Mj0L4n9m6L0J1r0J51Q4j36R7j0m3
5595C3m4M3o4o2M4N5K0R3j49j8K8J9Q3j23P3j4N5R5k70P5K8P4j02k33J81P6%K9j33OJ95LN
5182A01j12q7J90k4n4j0L9j16Q3R6q3J2k9q6J47o7J02j12k7P7K4P9p3l0j2M2m0o6R1jk9n9
4781c4J5k2J2R4j03N8K9n1k3k9J05Kj27n7M8K9R1n3J4q0K47k6q8M0j55J00j02L5N2P0r8j17
4380a24R5J92k21J38nj14Q6p4M2j5n8N9n9R1o1j7K9j36J89j09P2r4J53oo2N8q3O3J4r1K2N
3980b1r0R9j59J38R2k0P7r6j93J46m5J54l9J24k11p4J46j83Q0J07J35n2k82Q8J21J9j64K2
3629h1m8J91j92K22r6j57R0J50l8j42R6j2L2L2j37J6n7l2kN3O5J02J2o0n2m0O5R0pO5j68Q0
3229D0o3j21M6K5J09pPo8R9o8J5L8r5N2n5K0N7N4m2j4l5J38j33K7n5N7J04j76Q7Lj15K36p3
$$ y = [6, -9, -25, -59, 155, -19, 40, 64, -63, 100, 4, -90, 5, -30, -48, 81, 18, 6, -33, 16, 20, 10, 44, -15, -61, -31, -20, -110, 41, 125, -11, 86, 76, 33, -11, 32, -32, -94, -50, 5, 25, 118, -31, -49, -21, -2, 81, -42, 31, 17, 72, 167, -103, -28, 0, 74, -28, -261, -80, -4, -4, 25, -108, -102, 93, 96, 101, -11, -98, 92, 68, 14, 4, 43, -73, 10, 106, 23, 35, 6, -80, 67, 0, 102, -10, -37, 40, 64, 143, 70, 40, 28, 70, 30, -36, 55, 54, 25, -34, -19, -41, -29, 65, -38, 20, 49, -2, -25, -54, 51, 53, -74, -131, -83, -54, 37, -16, -2, -82, 165, 139, 51, 91, -64, 36, -66, -31, 21, 91, -7, -124, -29, 163, -58, 80, 75, -39, 47, -27, 15, 0, -58, 1, -58, 33, -28, -45, -16, -152, 37, -72, 0, -94, 59, 53, -9, 49, -34, 29, 43, -48, -26, -21, -111, -12, -171, -33, 59, 39, 116, 20, -173, -27, -72, 82, 43, 167, -44, -118, 28, -155, -75, 32, 167, 115, -167, -79, 42, 61, -103, -81, -129, 62, -130, 92, -4, -161, -71, 79, 41, -101, -5, -17, 15, 47, -90, -74, -131, -163, -165, -112, -47, 55, 67, 7, -45, -85, -20, 70, 63, 128, -40, 40, -23, -144, -98, -73, 36, 29, 36, -32, 67, -1, 14, 52, -43, 9, -46, -26, 31, 85, 43, 29, -6, 132, -1, 26, -29, 28, 132, -44, 43, 46, -69, 167, 94]
2815I4j1lk2o6J32l4j41o3P2p5K0J49K9n5n7J23j49q2K04n5J2l3J42q5O0m4j02Q7K0n1M0k27
2415a71J39K0k5J07M0l3j40R7n1%j53P7J14J34j67m1k9J40j18J34m6r6Q3K1pP2l8j35J69k6
2039G1j25J4p9J3OJ34j58Q9m9j9J10n5Q2j23Pj9j6J85o5j31J48P4p4K1Nr8j0QNO9L1o7J48
1626A32j14Rn6l6J8OKK2p0Q7j3N7rn6J4k0n1M6J7J10r1O3n9j02J81M4j69j25J98k1K1o5j68
1213a98Q9jJ03J17j30j23M6J20j23K40j53k0J88Om0o9j22p6Q2j10R9K3R1o7K9M3K8r3n3J5
837e9m2J42M7k8j66J32n8O2k5m8M6L2LO3j0o9N0l5l7j4N9k7j35J40q1N5Ok7L6j34J58j30O5
424b9Q3M5j94J05m8J25j09k6J2J97j68J5l7J12j23J8O7No4L2lm4m7k2j2J76k8j7K5l5j23J04
23hn8J05j7j25k2K45j22J2k3K2Nj08ro4J19O8Ro0M1J5j40K10j53J48r6M8J02j36J31q0j33
$$ y = [94, 83, 80, 58, -8, 124, 90, -51, -114, -42, -117, -97, 52, 81, 26, -31, 92, -57, -139, 65, 10, 22, -11, 131, 46, 106, 62, -40, 47, 67, 16, 56, -171, -32, -12, -37, 70, 110, 77, -63, 34, -17, -17, -170, -93, 21, 155, -12, -53, -82, 58, -60, 74, 28, -68, 15, 36, 29, 101, 63, -72, 97, 71, -54, -40, -119, -106, -100, 34, -124, -35, -84, -103, 7, -48, 34, -89, -82, -101, -117, 68, 3, -128, 20, 94, 20, 41, 46, -52, -62, -54, -49, 20, 51, -16, 132, 18, 27, -29, -65, -47, -41, -39, -17, -87, 0, -13, 44, 35, -21, -7, -27, -78, -32, -15, 95, 4, 67, 8, -94, 87, 131, -38, -163, 35, 14, 35, -30, -198, -109, -110, -7, 110, -20, -143, -97, 23, -100, 140, -13, -33, 155, 161, 121, 52, -70, -146, -64, -174, -75, -52, 39, -28, 1, 44, 72, -21, -74, -59, -101, 41, 88, 60, -106, 26, -32, 30, 5, -43, 3, 35, 38, 101, 91, 22, 72, 37, 0, -14, 45, 18, -117, 23, -58, -3, 3, -24, 12, -122, 36, -94, -29, 54, 99, -95, 10, -38, 87, -22, -48, -36, 161, -7, 8, -29, 83, -40, -22, 45, 50, -14, 18, 15, -29, -76, -98, -110, 66, 38, 21, 46, 11, -112, -8, -66, 39, 22, -103, -125, 120, -2, 10, -13, 9, 14, -94, -103, -167, -48, 20, 29, -31, 10, 25, -115, 95, -58, 90, -6, 42, 144, 8, 139, 59, -74]
-365g4M2m
$$ y = [-74, -32, -36]
-390c6
##PAGE=	F1=-625.984
##FIRST=	23151.189942674980557,	6007.9998942000029274,	-0.031291373074054718018
##DATA TABLE=	(F2++(Y..Y)), PROFILE
6008A2j5j1o2K10j37M2k7r0K18p7j06K6j6j0J16k9m8j8M3m5ONl0l6O1L2r2J25O6j29R3m9L
5595C1m2M5n9m3M6O0nN4j44JK0L3M4j10P4K8M5P4k40O3lQ4r8k24K04P1j2Oj50M2J65K9pm2
5169D0j02J04K3l8j0L1j06L1J44j04K5l4q6J68o5N2q5l6R0M3Q6j11K0l8K3Kj25Q8N8n8r9M2
4769b7k6K5R8n6K0K6l3m7k6J26k5j09l2j8K7J03k9J7n9K11j6j31O7j69J64j17j9L2O8p0j11
4380a36R7J68k31J33L7j10Q4r0O4o0l0M5M6M7j13oM7j43K19j84J35j23J59k8Kj0m9R2j4j22
4005g4N5Qj18J52j52J29O6k5R9q3k16J36l9J02PJ06j79m6J23k03R6P6J60l9k94J06L2L2p4
3642e7k1m8K07j63K08q3k30J50J17k0j23R6l4J1P7j85Mn0n1O2J1N8J11L4n6p5j9N8O8m3O2
3254G6j20K0pq5jN7Q3l5N3r8J19p1J8O8j21J8QK0RRl4K5k1J20j25L3p8R9R4j79J12l1o3K34
$$ y = [12, -3, -14, -76, 134, -3, 39, 12, -78, 140, 63, -43, -17, -33, -43, 73, 44, -4, -22, 21, -24, -18, -13, -43, -79, -18, 14, -78, 47, 113, -16, 77, 28, 31, -11, 34, -25, -68, -22, 38, 33, 87, -57, -56, -36, -3, 41, -69, 5, 33, 78, 152, -88, -25, -28, 56, -42, -266, -62, 9, -3, 3, -147, -105, 60, 89, 82, 40, -62, 42, 65, 27, 17, 48, -58, -27, 117, 13, 38, 4, -82, 86, 21, 73, -12, -48, 42, 85, 171, 60, 80, 42, 65, 67, -58, 30, 88, 30, -69, -27, -53, -28, 70, 14, 34, 60, 27, -20, -46, 80, 55, -54, -86, -104, -77, 26, -3, 14, -45, 166, 150, 19, 86, -83, 81, -36, -55, -23, 45, -25, -136, -39, 129, -102, 31, 68, -42, 42, -48, 16, -44, -74, -29, 17, 64, -49, -55, -8, -151, 68, -116, 19, -104, 55, 27, 29, 19, -30, 62, 48, -74, -19, -11, -129, 23, -129, 0, 66, 41, 140, 57, -159, -23, -62, 40, 47, 153, -26, -72, 51, -152, -56, 20, 180, 141, -153, -47, -15, 17, -57, -78, -126, 81, -82, 126, 43, -187, -37, 80, 60, -63, 33, -1, 10, 87, -98, -94, -144, -195, -133, -122, -64, 47, 81, 25, -50, -69, -11, 57, 14, 76, -44, -24, -31, -116, -117, -60, 23, -12, 41, -57, 62, -9, 9, 77, -44, -26, -18, 2, 11, 20, -14, 11, -10, 110, -15, 18, -60, 39, 133, -46, 66, 35, -28, 206]
2828B06j30j5L4j9n5J13o1j31k2J9k0n3J87J7o7m3R8j49k8J31j8J1rJ14o6N9n5r5Q3mJ3M3
2427H8k16R7K0p1K02jk2j79Q2k3Rj08M8J14J04j56jk0R7j05J25%j65R3M1J0J7rj66J83p3o3
2027d8Qr1RK9J19j42R1m7J4P4m5P1r0k2n5QK09p5q1J22mJ6k5j1o6m4PrJ05N5j34J93r2l1o2
1588d4Pm4L2NMn7P1L5NMl2K8l7o2N3O3K3j19J07k5j56J91L5j45o2J15rL8l5j41K5N9M1R4j12
1150d5j35N7J04r0K44j35J2J35k8o0o4m1l4J1q3P2P7L5o1K7J3P2q3p7j2K9P4M3Qk05J30k3
750c3M4J2m8L2P9r5M8K2oj6qo3N3N4o6j45J20o1O0K5NLj59K04j26mR4Lj46J14p6J47o2l3J4
311a4J62j62Km3J07n6j3N3k9k2L9On5p1j4mJ74j0m9K3nk10J54l1J18J3j66NK24r5m2m7R3r
-114B6j43M3l6N2J04k7n0M9N2j69J62j39J36o7L5Q5j47J65n0j60O3l7
$$ y = [206, 76, 61, 95, 76, 21, 134, 73, -58, -80, -61, -81, -134, 53, 70, 3, -40, 58, -91, -119, 12, -6, 5, -4, 110, 44, 103, 48, -47, 36, 32, 45, 88, -128, -31, -11, -82, 120, 119, 97, -82, 0, -23, -14, -122, -74, 40, 144, -12, -13, -33, 64, -41, 84, 84, -81, 12, 53, 63, 80, 71, -95, 88, 15, -48, -40, -131, -122, -93, 26, -116, -25, -72, -58, 16, -29, 42, -48, -70, -125, -117, 92, 17, -64, 58, 54, 70, 45, 34, -32, -76, -69, -78, 27, 82, -52, 141, 49, 18, -44, -37, -81, -49, -44, -40, -97, -26, 9, 14, 18, -14, 14, -23, -85, -32, 31, 54, -65, 42, 17, -139, 52, 87, -58, -120, -5, -14, 24, -11, -152, -127, -68, -27, 67, -45, -180, -123, -19, -109, 135, 0, 12, 147, 119, 59, -5, -46, -80, -69, -152, -80, -3, 32, -29, -2, 11, 83, 0, -77, -89, -60, 14, 57, 65, -140, -10, -33, 11, 23, -25, 7, 86, -9, 39, 61, 55, 39, 31, -32, 21, 75, 9, -136, -16, -77, -17, 8, 13, 16, -143, 61, -65, -69, 25, 28, -118, -4, -80, 67, 5, -28, -14, 148, -14, -12, -55, 52, -4, -17, 36, 7, -15, 24, 30, -25, -96, -110, -114, 60, 50, 1, 24, 19, -191, -37, -68, 50, 63, -103, -98, 126, 31, -11, -58, 35, 26, -117, -74, -110, -58, 46, 19, -31, 18, 70, -99, 63, -76, 60, -7, 28, 113, -34, 131, 81, -79, -16, -53]
-390e3
##PAGE=	F1=-720.338
##FIRST=	23151.189942674980557,	6007.9998942000029274,	0.08998981863260269165
##DATA TABLE=	(F2++(Y..Y)), PROFILE
6008@%J3j13J82o9Kn0o3K47m6q6n1J3j2R8Np4KJ3p7K6l6K9l2P3P0r7P7N5j10N7p2M1k0K0j9
5557dm9O3M9j9J2j22J4%N5J7q4N9N9L6L5j72M4l5N7p3j96K02O8rm1j16P3J02L9j8L6j02PP6
5132F3n0K2J6r0k8J61q6K6l8m4J16n5L4k8p4R5O6P6j50P5o0PL5j55P4J02q6j17O4m8N2P7J6
4718F8l5J6J0o2l0J28r3l5lp1K6Q7MJ9o0J73Rj57O5j39J75j00n6JO0m0r5J11J10k11J22O9
4318F6j07Q6j04P5q1j2L7J08J8j60mO2j27K32k14J65j24J44o7N4n1j5J21n7j21N0L1j35J78
3955D8j16Q7N2k8Q6m2j95J04m3L6M4R1j06m4J04j97Q6O6J28k7k45R7o0N5on4l1J82j19J91
3579A44o1k54J76N8j2p6P5n2LR8j90ql0o9J17k8L5R9O8m6j02J0N8K8q6O5n8n6P5n7n8Q6O9
3166B1n7Q9j39J43p4J8P4r7l0N2L1l8l2kN1j0P9j06L6p8J30Q1j62J21o9k4K16j81j8P7j9n1
$$ y = [0, 0, 13, -100, 82, 13, 15, -35, -98, 149, 103, 17, -34, -21, -33, 65, 70, -4, -2, 11, -66, -40, -76, -47, -79, -6, 64, -33, 44, 99, -11, 46, -26, 15, -5, 15, -4, -53, 10, 59, 40, 52, -70, -56, -56, -1, 16, -68, -9, 50, 86, 121, -51, -7, -42, 15, -58, -254, -52, 16, 7, -34, -150, -77, 25, 64, 46, 82, -20, -13, 63, 13, 35, 51, -39, -67, 94, 8, 34, -4, -48, 68, 13, 47, 19, -55, 40, 106, 182, 32, 107, 47, 54, 89, -66, 8, 110, 24, -93, -29, -77, -25, 52, 68, 33, 49, 59, -3, -33, 95, 2, -33, -36, -107, -81, 6, 10, 29, -31, 142, 151, -6, 59, -80, 95, -5, -61, -60, 0, -40, -135, -24, 86, -125, -3, 66, -41, 45, -59, 16, -65, -77, -40, 68, 86, -74, -78, -16, -143, 89, -125, 40, -84, 60, -7, 47, -4, -19, 102, 45, -76, -26, 5, -130, 48, -68, 19, 71, 43, 129, 87, -108, -4, -47, -11, 33, 124, 18, -26, 78, -119, -33, 33, 161, 134, -111, -14, -74, -19, -25, -79, -110, 72, -47, 144, 83, -171, 5, 63, 51, -25, 50, -2, 1, 99, -91, -99, -129, -198, -81, -109, -74, 25, 93, 47, -55, -45, 13, 41, -45, 20, -38, -94, -19, -76, -134, -48, 21, -36, 53, -86, 57, -17, 1, 75, -22, -52, 0, 31, -7, -39, -41, 10, 0, 79, -27, 9, -69, 61, 142, -20, 101, 32, 8, 224, 43, 25, 102, 83, 32]
2765C2Q7p0j08qk2L8r8J95j1p3JO1j44L5N1L1k0K8Q1o2M5l6q6R0m1P4L2j77L0K8q8K77o4j5
2340I3j99Q8k7K0l1J2J16N0j33N8k9M4j23J36M8k17J10M7J9l0L2j84J66j07Opq0j4N4J07j07
1952h2N9l6O7L8n0N0m9n0o9K1K11q4k3P3n5J02p1k5n7n3plJ03R1j77K05l3q3o1L5p3M2J3l1
1526f2m7O8P6l5mJ0M1p3p0P8R2p3j41J39K8j80J77K5j13PJ2qN3K7j17k7J10l6M5q6j08O2N2
1113g8m4K15o3L7M4n1p0n6L9Jn6l9M1J40k6n7J1j4J09n7j02k8Q1NL9M4j97J09j0L9K5k7qJ45
687A41j82L2J7M8p6K8r6J15M1o8j39Q1k9N7M8L6l0j67K18j06o1J08n8r0J22q0J38j7k5L1Q3
299A20j66K5n6O2L4m9M6o1M5K3L2o5r6lQJ15L6o6lM0k67K22k3J10M1j95L3J74n7q1p0J46q
-114D6j52Q1k6J7J14p3k9K6R8j80J05q0Q3l1ON6j40J78j9j31N3n1
$$ y = [32, 119, 49, -59, -67, -89, -51, -149, 46, 35, -38, -37, 24, -120, -85, -34, -3, -23, 5, 86, 24, 69, 33, -53, 37, -4, 70, 102, -75, -45, -17, -105, 172, 108, 93, -106, -18, -45, -25, -56, -44, 72, 122, -11, 47, 18, 62, -61, 75, 123, -94, 16, 63, 82, 52, 84, -100, 66, -41, -35, -42, -122, -136, -82, 25, -82, -23, -59, 8, 46, -4, 46, -3, -53, -122, -101, 110, 26, 3, 76, 21, 123, 52, 27, -30, -83, -90, -93, 10, 101, -76, 129, 96, 13, -48, -13, -86, -44, -31, -62, -109, -41, 35, 0, -4, 6, 47, -26, -96, -18, 74, 1, -140, -1, 27, -153, 24, 49, -64, -57, -45, -53, 0, 27, -90, -117, -7, -43, 2, -84, -192, -130, -78, -122, 93, 30, 67, 111, 60, -10, -66, -27, -26, -82, -121, -80, 60, 34, -23, -12, -26, 83, 26, -76, -104, -23, -18, 21, 65, -132, -23, -33, 6, 31, 4, -4, 141, -41, -9, 8, 56, -20, 8, -88, 27, 68, 0, -139, -58, -87, -30, 18, 54, 24, -143, 75, -31, -92, 16, -42, -132, -10, -90, 48, 31, 6, 37, 120, -46, -21, -77, -15, 19, -30, 16, -45, 0, 23, 55, -10, -106, -109, -101, 14, 50, -16, -19, 21, -246, -24, -47, 63, 104, -91, -58, 116, 59, -22, -92, 54, 46, -106, -25, -51, -34, 80, 7, -22, 4, 102, -78, 27, -53, 30, -1, 5, 61, -79, 99, 80, -51, 2, -49]
-390d9
##PAGE=	F1=-814.692
##FIRST=	23151.189942674980557,	6007.9998942000029274,	-0.055227242410182952881
##DATA TABLE=	(F2++(Y..Y)), PROFILE
6008b0J8N1j73J54lm5m2n6K45j5m6j04L5k0Q7K2p6J2l2q7M0p0Q7k9P3J10j12K8N6q7jn9N4
5595ePj4L9p5Q9J9j8qj01J9k5Q3%m1L1N2N0j8r1L4p4J7l0j78J72P5J0q8n4J03K3K6k5J00r6
5157Hn8J25j04Q5jq5o8J44l5J8n4K9K4l9M0M2j20Q7Q0N7j78J26q1%N6j49M0J26j05j11O9p4
4756a06R3M2Q1r8J1O3o5l9J09j68N6K4j03L2O9J5J6q1J41M4j45J4q0J43n6o6j9M8j7p1J29
4368A6L5j75J11Q9j12Q6j00O4q5OL8J00J4j76pN2j06K37j92J53r6J12r9Q0o3J1J36j02q6K1
3992c8N9j43J75o6K5N7k6N5nj41O1m9k2P1P5j8p0J09j78N1P6N4j5j57O7j26P6K3o3j0J32o5
3592b6J51k8k17J59%j6k3M2o0OQ6j49qj0p8J41n0J4P7Q9k3j23L4N2j4j09O6kj22J41l6r4R3
3178c7O9o1J01j80J60o2QN1l9o0O8K8o0n7N4L8j2M0p5K9n3J41O4j36J22j04KJ84k09k9J14
$$ y = [-20, -2, 49, -124, 30, 27, -18, -60, -116, 129, 114, 68, -36, -1, -21, 66, 88, 12, 24, -8, -95, -55, -125, -38, -67, 6, 116, 4, 32, 88, 1, 0, -59, -5, 2, -12, 27, -48, 41, 60, 42, 34, -67, -48, -73, 10, 10, -31, 0, 52, 102, 84, -7, 27, -47, -30, -60, -238, -66, 9, 19, -69, -123, -20, 3, 29, 4, 104, 8, -50, 75, -29, 56, 55, -30, -98, 46, 11, 29, -25, 4, 28, -11, 29, 71, -49, 38, 118, 175, -3, 123, 42, 42, 98, -51, -11, 115, 10, -101, -32, -106, -13, 29, 110, 12, 23, 86, 21, -18, 91, -77, -21, 3, -100, -68, 1, 16, 32, -49, 92, 136, -9, 5, -75, 68, 12, -54, -73, -25, -42, -113, 16, 51, -124, -13, 76, -36, 50, -50, 14, -71, -65, -27, 73, 87, -89, -96, -44, -150, 87, -105, 48, -48, 64, -35, 45, -18, -7, 129, 27, -59, -38, 21, -122, 53, -13, 12, 69, 43, 98, 93, -48, 13, -36, -58, 13, 88, 70, 0, 109, -69, -18, 58, 112, 97, -60, 7, -119, -43, -20, -83, -93, 39, -26, 125, 97, -120, 39, 39, 23, 0, 42, -18, -12, 74, -75, -83, -93, -171, -30, -80, -66, 11, 100, 77, -46, -12, 40, 26, -83, -17, -19, -141, 0, -36, -130, -37, 32, -29, 72, -108, 52, -10, -2, 49, 10, -50, 18, 46, -14, -71, -17, 21, 9, 49, -26, 3, -50, 91, 155, 19, 141, 37, 39, 223, 14, -15, 99]
2790I9k9m2O1o1p8k5m6Q3r8J74l3q2N3J9j39R4j2P4p3P8N6q2K3J3r6J13p2J17Nj25k8L7r3
2377a15L11j22Lk08J28o2K4L9nJ26k6j02J03l9Lj64J64P2k20J18K9J5m3P6j86J13j02M6k6
2014e0m1n5P5J12p7jj7J25K1p3J4qo0o2J8J94q0K1J4o9J62r9m0n9m3l0J4P0J17j76J88L6j22
1601A9o7M4o9L6L0n6m9O8Q5k3m3N3N2j06q6J05R6j27j53J56P5j76J43K4q7N6o3k7N8J08j02
1213b6n4J28r5oo8n0M9j2jJ45N5N4m6o8p4l4Q7J6r8J8%J92p3n0j3l6J24j9j21k2R8m9M0O2
787E3j41P6l4N6J4Jm4J99k22RnP1j14O3j25J49L3m0j23M8nM8N9N7n1j58K13q5q1J11j13m7
387a28J22n8J01J5kN4j6j79P9p9JJ18q4N1q1J08qO1n7j21nK2L2R3n5n0Q0k74K83m5R5N8j98
-27f7N0J22k9j03p2J43K5j34R5m3J7J07j09oj5J22j71N9kK7jl5K8j12J58jo4K6m0
$$ y = [99, 70, 28, 89, 28, -50, -75, -121, -38, -136, 38, 5, -77, -24, -5, -144, -50, -62, 12, -61, 17, 73, -9, 14, 27, -69, 44, -28, 89, 94, -31, -59, -22, -115, 196, 74, 77, -131, -3, -65, -41, -2, -7, 119, 93, -9, 94, 55, 58, -106, 58, 130, -90, 28, 57, 72, 29, 105, -81, 32, -70, -24, -50, -91, -146, -71, 41, -36, -37, -54, 71, 92, 19, 33, 25, -35, -97, -79, 115, 35, 56, 70, 1, 163, 64, 24, -35, -78, -108, -94, -24, 93, -83, 105, 141, 19, -48, -4, -73, -37, -7, -63, -112, -44, 41, 18, -25, 28, 80, -26, -112, -7, 89, -38, -191, -35, 40, -136, 7, 31, -56, 0, -63, -90, -32, 76, -26, -80, 48, -47, -53, -121, -171, -122, -134, -135, 10, 65, 119, 73, 5, -69, -103, -16, 0, -98, -80, -80, 112, 39, -11, -24, -60, 64, 45, -76, -98, 0, -49, -9, 53, -88, -12, -46, 10, 24, 25, -19, 180, -42, -33, -38, 33, -81, -18, -143, 6, 39, -1, -124, -76, -81, -33, 26, 83, 32, -126, 87, 2, -79, 32, -81, -128, -6, -64, 37, 52, 50, 104, 88, -91, -12, -91, -90, 28, -56, -5, -86, 22, 14, 75, 18, -103, -108, -86, -54, 39, -16, -66, 14, -260, 23, -22, 73, 131, -67, -17, 105, 76, -27, -99, 44, 69, -65, 30, -13, 4, 111, 2, -4, -19, 103, -68, -9, -11, 16, 15, -20, 8, -104, 54, 53, -11, 15, -25]
-390b5
##PAGE=	F1=-909.046
##FIRST=	23151.189942674980557,	6007.9998942000029274,	-0.12290387600660324097
##DATA TABLE=	(F2++(Y..Y)), PROFILE
6008c0J4R5k14J44K7p5j0p9K16J0oj12L6k3Q2K2n4Rp8p8M5q8J18k1P1J31j28j4O5o1o3rL4
5595b4L3m6J01j06J06k2pPr3K2m5J07j8J4JkR5p7k1M9j28oK1j90J21R7L5j09jJ39n0ll0J33
5169A03q5p1J52j84J61j1r5p8R9L2Jq3J11o0l1N9R5j45O5Q1L3j82J71j10QO3j15j4J36j12
4794fq8N8r4J34J4J12j49J9R7n0n0Q0k29J27M9j16M0P1rJ3j08J12P7q8p6j9R3mn0k0L4lm6
4380g5J47m1j37J03J02j18O9p1L4q1K5L1M9K3j46jJ3r9K34j38J14n9P4j04Q4n1J5J35j36k7
4005c2j7P9j36J48k9k2O7k8L9lp3K5n2n1Q9N3N3j04J31j60QQ6k3ko3L0j53Q1K0n1PQ1k0R2
3579G0K0j55J22m6k3J8J5n6QN3q5QKp6J28n5J4O0P5J5j31M1L5m5q9N6K9j52J52j4r5P6P3m8
3153@R6k09J60k8j4J2K4o4O3Nn1o5J13j5k3K6l6Rj8J26N2j17J21j20J5J44j95n8J31m6j8K9
$$ y = [-30, -16, 79, -135, 9, 36, -39, -49, -128, 88, 98, 92, -20, 16, -7, 75, 97, 43, 52, -26, -104, -59, -147, -29, -50, 21, 152, 24, 10, 75, 14, -49, -58, -24, 9, -37, 64, -42, 64, 42, 35, 42, -51, -29, -74, 33, 15, 29, 30, 28, 123, 46, 25, 74, -54, -60, -39, -229, -108, -11, 24, -85, -86, 53, 3, 0, -30, 103, 18, -53, 99, -85, 76, 65, -30, -108, -9, 23, 24, -59, 52, -8, -39, 20, 115, -30, 35, 116, 149, -33, 138, 28, 36, 99, -16, -30, 106, -6, -94, -36, -130, 4, 18, 130, -19, 0, 97, 47, -3, 77, -152, -25, 24, -92, -52, 19, 10, 23, -85, 27, 104, 16, -60, -79, 14, 10, -40, -60, -26, -29, -75, 72, 31, -106, -3, 99, -19, 50, -21, 13, -68, -43, -12, 37, 60, -86, -87, -74, -173, 61, -77, 37, -22, 52, -52, 32, -19, -4, 131, -5, -32, -49, 30, -106, 42, 13, -9, 58, 30, 69, 66, -7, 18, -34, -85, 4, 57, 110, 6, 137, -23, -15, 71, 48, 46, -17, 13, -140, -59, -39, -90, -83, -2, -22, 70, 90, -65, 57, 11, -12, 6, 21, -35, -27, 26, -59, -51, -49, -125, 3, -52, -38, 22, 97, 112, -19, 22, 57, 12, -77, -21, 8, -144, 8, -6, -101, -25, 48, 0, 96, -113, 47, 19, 5, 17, 41, -23, 40, 45, -6, -71, 42, 27, 4, 30, -6, 3, -15, 111, 163, 46, 167, 47, 62, 206, 11, -47, 84, 38, 20, 49]
2753D9l0m7o0n0R0n3J34l5q9Q7k6j29J33m4R6j13J10N2j23NQ1j31J34o6J25k8q4m0M2j07K90
2365A73j47L7k08J87j09J9P0PJ40j05o4R9l4kk12J93N5j60J08j6Mk2J16j68L0n0L7m0J7j00
1989a45P9J39o8o4MJ62K9j06l0K4m2m3KJ66n8L3l7n0J77r7n9m4l4n4L0K2J25j36J57Q8j27
1601D3r3L9m3K0N5n4o8O2N2N1r7O8O6j08j23J16Q3j21j47J60R5j58J02L2p2P2q8n5L6J95r5
1213B5o2J08j04n2n2J6J2n0J6M6J90N5q6r3p4LQ7Pj03Q0m9K15j01l3k8n4J13Qj17kQ3p7M6
800b7N9o1M0q3Q8j4K1m6K09k03j0l0O2j18P8j37J53K7jj05L6nM7M8O4o0j35K00o4p2J01j37
399g5k2J02j4M5L4J8O8r6j86J35j05m5J69j11N9p0J33l6P4k3j38k4K2k8J34j3r5R2k36L17
23H5r1Q1N8j70M6Q9k7j04m5Q1P9j00R7p9L2R1j17Rn7J07j38L1O1KJ9q2J4p2J11jRkj0
$$ y = [49, 19, -28, -88, -138, -48, -101, 33, -2, -91, -4, -30, -159, -26, -70, 26, -87, 23, 75, -48, -43, 38, -93, 41, -25, 100, 72, -12, -52, -10, -117, 173, 26, 63, -145, 42, -67, -48, 22, 29, 169, 64, 0, 99, 65, 63, -149, 44, 99, -61, 47, 31, 35, 13, 129, -39, -9, -59, -22, -62, -45, -145, -66, 73, 5, -59, -55, 107, 136, 30, 0, 24, -18, -61, -59, 107, 49, 82, 45, -5, 172, 75, 16, -28, -62, -116, -86, -64, 61, -75, 82, 170, 43, -50, -11, -54, -34, 21, -33, -101, -39, 13, 64, -33, 35, 101, -7, -130, -14, 69, -52, -199, -39, 56, -102, 0, 32, -40, 32, -56, -111, -75, 120, 25, -37, 71, -33, -85, -137, -121, -109, -159, -143, -97, 93, 148, 62, -31, -105, -102, -15, -8, -111, -31, -80, 135, 34, 1, -27, -81, 32, 40, -77, -79, 4, -73, -27, 32, -29, 11, -72, 16, 2, 23, -23, 186, -17, -27, -57, 5, -113, -35, -172, -19, 8, 7, -98, -62, -67, -20, 28, 92, 32, -103, 97, 33, -39, 62, -75, -97, 5, -9, 36, 70, 88, 156, 60, -126, 9, -96, -141, 28, -83, -24, -94, 39, 3, 77, 54, -84, -108, -86, -114, 20, 7, -88, 4, -232, 85, -6, 75, 133, -37, 9, 98, 71, -33, -78, 3, 82, -18, 79, 0, 32, 123, 6, 15, -42, 65, -73, -42, 19, 21, 40, -42, -28, -100, 11, 10, 19, 17, 7]
-390G
##PAGE=	F1=-1003.4
##FIRST=	23151.189942674980557,	6007.9998942000029274,	0
##DATA TABLE=	(F2++(Y..Y)), PROFILE
6008b4j6J29k10J43J8p3L4j31J69L5J5p9J5k5P8K2k6Jj04o5M8r3J15pO8J25j29n0P3l9j11
5620i4N7MM9o2J40j18J02n8JM5r1L1n8J08l8O9j7q7J49j24L1P7j91J1O1k24O6J25N6r6J8J80
5219A22r6l7l2J24o4m1J41k45K23j8j06o6M4R0l0j04J74j06k9P4J08j30L4P1Lj53K06j41K7
4856D3N1p0p1J32j06n8M5j02J61jJ03j72L7R6k4n3N1k62J55O8j13M5R3n1J3j30Q7J00qj66
4481a07K4M0L7k2jJ7J0l6J61r7j11R9J12j13L5l7Qp6L5KNK9q0J9l8j12K15p8P3l6L9q0Q4l0
4055a0qJ25j50L2m5Q1j09J06j3l0O5m7O0l6j9Om9l9J00K3Q4j27J47j46k2P7o5J1Qmj42O2P
3642f7l5K3M6jL4P4j10R7q3k7N2ll5%J9l2K8Po2R1o1M4N7K7N8j24L0J5o2l3L5L9j41R9J0o3
3191e4M1P3l4Q8k19J44J9l2k7O4n7N8k7j9o9J56q5k8M2j0j6J0Q3M9j09J23j05J8R8j38r9J20
$$ y = [-24, -40, 89, -121, 22, 40, -33, 1, -130, 39, 74, 89, 10, 25, 0, 78, 100, 74, 75, -29, -94, -46, -139, -24, -31, 37, 162, 33, -17, 56, 17, -94, -37, -33, 16, -46, 94, -24, 78, 20, 21, 66, -25, 6, -52, 56, 18, 87, 70, -17, 132, 8, 39, 116, -75, -64, -3, -227, -161, -36, 20, -76, -58, 122, 26, -11, -43, 81, 17, -24, 117, -128, 95, 77, -29, -95, -51, 39, 9, -95, 79, -27, -56, 18, 126, -4, 30, 101, 104, -49, 157, 16, 43, 94, 24, -47, 85, -21, -79, -34, -136, 25, 24, 127, -45, -8, 88, 64, 11, 62, -200, -45, 23, -90, -45, 48, -3, 10, -120, -33, 67, 59, -107, -83, -43, -6, -28, -29, -12, -2, -38, 123, 26, -85, 14, 126, 13, 48, 11, 19, -57, -22, -20, -15, 14, -66, -47, -85, -197, 18, -60, 13, -23, 16, -64, 20, -10, -18, 107, -43, -11, -56, 25, -84, 22, 9, -21, 44, -3, 57, 21, 2, 8, -41, -80, 20, 43, 127, 0, 147, 1, -21, 56, -9, 2, 10, 6, -136, -74, -67, -102, -79, -33, -34, 0, 74, -36, 61, -22, -49, 3, 0, -35, -35, -16, -48, -20, -13, -75, 16, -45, -1, 56, 83, 141, 17, 47, 62, 0, -33, 2, 41, -100, -1, 9, -54, -13, 60, 26, 114, -105, 39, 58, 26, -1, 63, 6, 64, 37, 18, -51, 105, 20, -8, 34, 24, 8, 18, 101, 150, 41, 164, 59, 77, 175, 37, -62, 58]
2790E8o5K1oJ4k3q6m0M8K3Q4j4q4Q7o5j13J49o0Q9j00J01O4j67nJ53j71J22qR2n1o1mL8j28
2377a08K20j28Q0j98K27j44J2O0L5J42j60k3M5j2L1k47K08Nn6P8p5qJ4J52j36o9L4qm3P5j27
1989a24N6J77p8j03J9J60M9j42m9L0Jk1j6J38k8J4o9j4J46o9p7jm5o9M3j7J11q3J32J06r3
1601H4j41L0j1OQ8l6j01N0qJ52j36M8P4n5j81J04N9p0j17J48Q9j46O5M4o4N7o6p6j4K71r4
1213E3o3O0n4q8k7O4l9m7jn4L01L7n1j37o5M1M8j5p6J31r9K09j12nk4p5Q5Rp8J6L9p9O5N0
787A9LPj22J07l6K2j0J65j37j8n0L4p9N9j26J39J2L3r2M1l0O8J7N5o4j02J87m3n9Q3j26jO0
374A6M3k0M4J9O6j34j71J70j26n5J76j27O7l6J14m6O2K1j31n0j0k6J34M7j15O6j76L11j37
11dP3M3j17K2O6m4p5j1nJ24p0J04j06L6P2r3J4r0N9p7J6Q2J8K5j09Kl1N7qN6k0K8
$$ y = [58, -7, 14, 8, 22, -1, -87, -127, -79, -56, 28, 14, -70, 17, -48, -161, -12, -72, 17, -83, 18, 82, -85, -90, 63, -108, 14, 6, 98, 47, -14, -18, 20, -108, 112, -16, 64, -134, 93, -51, -39, 21, 56, 198, 38, 15, 60, 48, 79, -168, 40, 45, -11, 67, -8, -16, -2, 150, 14, -55, -21, -29, -72, 3, -124, -68, 109, 31, -72, -53, 107, 156, 14, -35, -5, -4, -25, -41, 97, 69, 83, 14, 0, 146, 77, 0, -1, -46, -115, -72, -89, 22, -61, 71, 177, 84, -57, -27, -38, -32, 56, 20, -81, -31, -39, 113, -23, 25, 99, 44, -137, -33, 26, -44, -161, -13, 76, -70, -5, 39, -25, 32, -34, -110, -124, 147, 53, -10, 50, -4, -92, -119, -55, -94, -141, -142, -196, 105, 142, 91, -46, -111, -70, -22, -37, -113, 18, -81, 128, 16, 11, -13, -88, -3, 6, -72, -56, -17, -96, -31, 19, 22, 29, -93, 14, -22, 0, -10, 155, 18, 0, -50, -16, -95, -36, -162, -23, -11, 22, -70, -29, -59, 9, 26, 81, 17, -85, 102, 59, 0, 83, -43, -44, 16, 59, 39, 83, 102, 168, 34, -137, 33, -93, -148, 28, -99, -32, -68, 46, 0, 62, 83, -48, -98, -108, -134, 0, 47, -68, -2, -178, 133, -4, 69, 112, -5, 17, 83, 39, -36, -47, -52, 72, 2, 106, 0, 36, 108, 15, 29, -61, -2, -79, -63, 19, 37, 62, -47, -45, -76, -19, -27, 29, 9, 37]
-390C7
##PAGE=	F1=-1097.75
##FIRST=	23151.189942674980557,	6007.9998942000029274,	0
##DATA TABLE=	(F2++(Y..Y)), PROFILE
6008go4J51j60J26om0P2j95J12O6J1k2k2k7O3M3p%j06n8N4r1Q9OO2J01j10p9O6k8j34J22k7
5595c9N9n4J39j00Q3p4mP1q0N4n9P1n3J04j7j66J79j40N8J07k48O3O7k43K7J46O4o7RK12j03
5207F6p0k7Q1k9nR7k50K46k9r8m1nJ21q1r8K05j09l3P7Q3q1NN4l7r3K22j57N2K2l3j14J18
4806E9q9l3M1r1J57pO7j55N2O1J0m9K9k68J45P5r5M1J17q2J7j40O4J12N5k08L9nN9OK3lL0
4393C4n3J67j21r8J04J14q9oj9jo1K4n6KK9rM4p3j28J70l4M6l3Pl1Q7qn5J15j44P0o0P8o8
3967e6O0k0J1M1r3J18p3%Km0PJ04j8P2j30J38j19l0M8o9K1M8k6j13K8Ll2M1L5j4mJ24j04J02
3542F2j20k1Q1k0Ok2Nj6M3Qm3M8p2R2O7m0R1r9ONp2L0J9L4r8KL7j8KO2l3Q9k05J20N6l5m4
3078GO5n5N9m3K4q1J65j36k2Q0j3l6K2J9N9j08J17n6J2N0n6j33Q5q2O8l4N8j4q7k4l0J05L3
$$ y = [-7, -71, 80, -80, 46, 40, 0, 72, -123, -11, 55, 66, 44, 22, -5, 58, 101, 94, 94, -12, -70, -16, -107, -18, -12, 50, 151, 41, -38, 28, 0, -134, -12, -39, 20, -34, 105, 5, 88, 14, 10, 81, 1, 55, -4, 67, 14, 118, 101, -65, 114, -26, 32, 139, -109, -46, 21, -222, -195, -49, 15, -52, -43, 169, 66, -4, -31, 50, 21, 16, 113, -137, 109, 80, -18, -59, -64, 57, -24, -122, 83, -26, -59, 18, 101, 20, 25, 79, 42, -51, 171, 14, 66, 88, 55, -59, 59, -30, -63, -22, -113, 44, 37, 104, -51, 1, 62, 72, 23, 52, -216, -71, 4, -91, -50, 67, -15, 2, -138, -74, 38, 93, -115, -76, -81, -22, -16, 7, 4, 34, -19, 148, 27, -71, 33, 147, 58, 52, 33, 32, -29, -5, -61, -59, -30, -39, 5, -68, -196, -26, -60, -14, -47, -40, -71, 16, 8, -47, 68, -76, -6, -66, 12, -56, 4, -16, -5, 36, -57, 61, -12, -12, -10, -50, -43, 61, 43, 115, -15, 123, 4, -26, 22, -47, -26, 22, -4, -117, -89, -86, -118, -77, -42, -56, -60, 64, -40, 62, -58, -79, 2, -18, -12, -34, -29, -45, -2, 6, -37, 11, -61, 31, 98, 58, 149, 50, 56, 61, -11, 19, 38, 72, -26, -24, 13, -5, -3, 59, 26, 115, -90, 30, 86, 51, 7, 72, 17, 76, 33, 57, -24, 141, 5, -17, 63, 50, 14, 36, 55, 114, 6, 123, 67, 79, 129, 73, -60, 25, -57, 11, -23, 35, 21, -66, -90, -120, -15, 18]
2665A8K5o7O0r0r1J46p8N8k4N1P5j98lK12j93O6Q8K6n1n0N3L0j50J25p0J08j68K12j46J0K2
2277FO2J18j72J3k9J9P8k50J94m8M5M7j26k2M0J84j02j52J15n4l0J06j25QK11r5j01J7J22
1914G9O1j70j6JN2kl3J25pj6p9K0Q2k5r4O2q1o2M8l2Q3m2J17R3l5j94K2J7KJ19j8j38L2o3
1488i2K28j36KP4M3k48Q0L0rp0J14P7j43M1N0n3J7k6p3p2L15r8o6J1L7j12QP5p8j7l6j27L54
$$ y = [18, 43, -24, 36, -54, -145, 1, -77, -19, -43, 8, 83, -115, -118, 94, -99, -33, 55, 81, 30, -20, 33, 63, -87, 38, -32, 76, -92, 120, -26, -16, 6, 68, 186, 14, 27, -2, 17, 95, -155, 39, -9, 36, 83, -43, -65, -25, 159, 57, -95, 20, -34, -64, 42, -83, -75, 136, 41, -60, -43, 79, 140, -30, -46, -45, 7, 5, -28, 97, 90, 74, -5, 15, 97, 72, -22, 40, -41, -103, -55, -87, -4, -46, 71, 164, 129, -65, -43, -26, -24, 95, 77, -61, -29, -92, 136, 0, 2, 76, 119, -129, -49, -19, -28, -98, 16, 93, -50, -9, 41, -12, 5, -21, -94, -166, 149, 51, -15, -4, 33, -79, -71, 4, -74, -91, -127, -254, 100]
$$ [...]
-390G5
##END NTUPLES=	nD NMR SPECTRUM
##END=	
##END=	
