##TITLE=	Oct27-2021.43.fid
TM-VI-138solid 13C

##JCAMP-DX=	6.0	$$ MestReNova 14.3.0-30573
##DATA TYPE=	LINK
##BLOCK_ID=	1
##BLOCKS=	2    
##ORIGIN=	Mestrelab Research S.L.
##OWNER=	hrzepa
##$MNOVA/LINK_BLOCK_TYPE=	ITEM	$$ NMR Spectrum
##$MNOVA/ITEM/POLYGON=	(XY..XY)
5321,5835
8722,5835
8722,8208
5321,8208
5321,5835
##$MNOVA/ITEM/Z=	0
##$MNOVA/ITEM/ANGLE=	0
##TITLE=	Oct27-2021.43.fid
##JCAMP-DX=	6.0	$$ MestReNova 14.3.0-30573
##BLOCK_ID=	2
##DATA TYPE=	MNOVA NMR VIEW DATA
##DATA CLASS=	MNOVA VIEW DATA
##$MNOVA/ITEM/ZOOM/X=	-31.107771267257835035,	251.11459999734066173
##$MNOVA/ITEM/ZOOM/Y=	-319.51181793212890625,	2714.6667938232421875
##END=	
##TITLE=	Oct27-2021.43.fid
##JCAMP-DX=	6.0	$$ MestReNova 14.3.0-30573
##BLOCK_ID=	3
##DATA TYPE=	NMR SPECTRUM
##DATA CLASS=	XYDATA
##NUMDIM=	1
##ORIGIN=	Bruker BioSpin GmbH
##OWNER=	nmr
##.OBSERVE FREQUENCY=	100.67161678785400625
##.OBSERVE NUCLEUS=	^13C
##.SOLVENT NAME=	CDCl3
##.PULSE SEQUENCE=	zgpg30
##LONGDATE=	2021/10/27 21:02:00.000
##.ACQUISITIONMODE=	SIMULTANEOUS (DQD)
##$ORIGINAL FORMAT=	Bruker XWIN-NMR
##$MNOVA/SCALES_VERSION=	9
##$PARAMETER FILE=	(acqus, ASCII, /private/var/folders/f6/rjf_tdyn2v98c5c0wvkgn4s80000gn/T/5GhgszlSTWigDSyPfTIE+Q/43/acqus, 0)
$$ ##TITLE= Parameter file, TOPSPIN		Version 3.2
$$ ##JCAMPDX= 5.0
$$ ##DATATYPE= Parameter Values
$$ ##NPOINTS= 11	$$ modification sequence number
$$ ##ORIGIN= Bruker BioSpin GmbH
$$ ##OWNER= nmr
$$ $$ 2021-10-27 21:02:54.342 +0100  nmr@CZC2524DW0
$$ $$ /opt/topspin/data/agmb/nmr/Oct27-2021/43/acqus
$$ $$ process /opt/topspin3.2/prog/mod/shimcntl
$$ ##$ACQT0= -2.05882356948211
$$ ##$AMP= (0..31)
$$ 100 100 100 100 100 100 100 100 100 100 100 100 100 100 100 100 100 100
$$ 100 100 100 100 100 100 100 100 100 100 100 100 100 100
$$ ##$AMPCOIL= (0..19)
$$ 0 0 0 0 0 0 0 0 0 0 0 0 0 0 0 0 0 0 0 0
$$ ##$ANAVPT= -1
$$ ##$AQSEQ= 0
$$ ##$AQ_mod= 3
$$ ##$AUNM= <au_zg>
$$ ##$AUTOPOS= <54 >
$$ ##$BF1= 100.660544
$$ ##$BF2= 400.32
$$ ##$BF3= 100.660544
$$ ##$BF4= 100.660544
$$ ##$BF5= 100.660544
$$ ##$BF6= 100.660544
$$ ##$BF7= 100.660544
$$ ##$BF8= 100.660544
$$ ##$BYTORDA= 0
$$ ##$CAGPARS= (0..11)
$$ 0 0 0 0 0 0 0 0 0 0 0 0
$$ ##$CFDGTYP= 0
$$ ##$CFRGTYP= 9
$$ ##$CHEMSTR= <none>
$$ ##$CNST= (0..63)
$$ 1 1 145 1 1 1 1 1 1 1 1 1 1 1 1 1 1 1 1 1 1 1 1 1 1 1 1 1 1 1 1 1 1 1 1
$$ 1 1 1 1 1 1 1 1 1 1 1 1 1 1 1 1 1 1 1 1 1 1 1 1 1 1 1 1 1
$$ ##$CPDPRG= (0..8)
$$ <waltz16> <> <waltz16> <> <mlev> <mlev> <mlev> <mlev> <mlev>
$$ ##$D= (0..63)
$$ 0 1 0.00345 0 0 0 0 0 0 0.06 0 0.03 2e-05 3e-06 0 0 0.0002 0 0 0 0 0 0
$$ 0 0 0 0 0 0 0 0 0 0 0 0 0 0 0 0 0 0 0 0 0 0 0 0 0 0 0 0 0 0 0 0 0 0 0 0
$$ 0 0 0 0 0
$$ ##$DATE= 1635364973
$$ ##$DE= 6.5
$$ ##$DECBNUC= <off>
$$ ##$DECIM= 704
$$ ##$DECNUC= <off>
$$ ##$DECSTAT= 4
$$ ##$DIGMOD= 1
$$ ##$DIGTYP= 12
$$ ##$DQDMODE= 0
$$ ##$DR= 21
$$ ##$DS= 4
$$ ##$DSPFIRM= 0
$$ ##$DSPFVS= 20
$$ ##$DTYPA= 0
$$ ##$EXP= <c13>
$$ ##$F1LIST= <111111111111111>
$$ ##$F2LIST= <222222222222222>
$$ ##$F3LIST= <333333333333333>
$$ ##$FCUCHAN= (0..9)
$$ [...]
$$ ##$Sgu3PowerLevels= (0..7)
$$ 0 0 0 0 0 0 0 0
$$ ##$Sgu4PowerLevels= (0..7)
$$ 0 0 0 0 0 0 0 0
$$ ##$Sgu5PowerLevels= (0..7)
$$ 0 0 0 0 0 0 0 0
$$ ##$Sgu6PowerLevels= (0..7)
$$ 0 0 0 0 0 0 0 0
$$ ##$Sgu7PowerLevels= (0..7)
$$ 0 0 0 0 0 0 0 0
$$ ##$Sgu8PowerLevels= (0..7)
$$ 0 0 0 0 0 0 0 0
$$ ##$SguType= 3
$$ ##$ShimPowMaxUA= (0..63)
$$ 130000 130000 130000 130000 130000 130000 130000 130000 130000 130000 130000
$$ 130000 130000 130000 130000 130000 130000 130000 130000 130000 0 0 0 0
$$ 0 0 0 0 0 0 0 0 0 0 0 0 0 0 0 0 0 0 0 0 0 0 0 0 0 0 0 0 0 0 0 0 0 0 0 0
$$ 0 0 0 0
$$ ##$ShimPowMaxUC= (0..63)
$$ 130000 130000 130000 130000 130000 130000 130000 130000 130000 130000 130000
$$ 130000 130000 130000 130000 130000 130000 130000 130000 130000 0 0 0 0
$$ 0 0 0 0 0 0 0 0 0 0 0 0 0 0 0 0 0 0 0 0 0 0 0 0 0 0 0 0 0 0 0 0 0 0 0 0
$$ 0 0 0 0
$$ ##$ShimPowMaxUG= (0..63)
$$ 524287 524287 524287 524287 524287 524287 524287 524287 524287 524287 524287
$$ 524287 524287 524287 524287 524287 524287 524287 524287 524287 0 0 0 0
$$ 0 0 0 0 0 0 0 0 0 0 0 0 0 0 0 0 0 0 0 0 0 0 0 0 0 0 0 0 0 0 0 0 0 0 0 0
$$ 0 0 0 0
$$ ##$ShimPowRcbType= 3
$$ ##$ShimPowRes= (0..63)
$$ 1e-20 1e-20 1e-20 1e-20 1e-20 1e-20 1e-20 1e-20 1e-20 1e-20 1e-20 1e-20
$$ 1e-20 1e-20 1e-20 1e-20 1e-20 1e-20 1e-20 1e-20 0 0 0 0 0 0 0 0 0 0 0 0
$$ 0 0 0 0 0 0 0 0 0 0 0 0 0 0 0 0 0 0 0 0 0 0 0 0 0 0 0 0 0 0 0 0
$$ ##$ShimPowRng0= (0..63)
$$ 1 1 1 1 1 1 1 1 1 1 1 1 1 1 1 1 1 1 1 1 0 0 0 0 0 0 0 0 0 0 0 0 0 0 0 0
$$ 0 0 0 0 0 0 0 0 0 0 0 0 0 0 0 0 0 0 0 0 0 0 0 0 0 0 0 0
$$ ##$ShimPowRng1= (0..63)
$$ 1 1 1 1 1 1 1 1 1 1 1 1 1 1 1 1 1 1 1 1 0 0 0 0 0 0 0 0 0 0 0 0 0 0 0 0
$$ 0 0 0 0 0 0 0 0 0 0 0 0 0 0 0 0 0 0 0 0 0 0 0 0 0 0 0 0
$$ ##$ShimPowRng2= (0..63)
$$ 1 1 1 1 1 1 1 1 1 1 1 1 1 1 1 1 1 1 1 1 0 0 0 0 0 0 0 0 0 0 0 0 0 0 0 0
$$ 0 0 0 0 0 0 0 0 0 0 0 0 0 0 0 0 0 0 0 0 0 0 0 0 0 0 0 0
$$ ##$ShimPowRng3= (0..63)
$$ 1 1 1 1 1 1 1 1 1 1 1 1 1 1 1 1 1 1 1 1 0 0 0 0 0 0 0 0 0 0 0 0 0 0 0 0
$$ 0 0 0 0 0 0 0 0 0 0 0 0 0 0 0 0 0 0 0 0 0 0 0 0 0 0 0 0
$$ ##$ShimSysFunc= (0..63)
$$ 1 2 3 4 5 7 9 11 15 16 8 10 12 14 6 17 13 18 19 20 0 0 0 0 0 0 0 0 0 0
$$ 0 0 0 0 0 0 0 0 0 0 0 0 0 0 0 0 0 0 0 0 0 0 0 0 0 0 0 0 0 0 0 0 0 0
$$ ##$ShimSysMatrix= 0
$$ ##$ShimSysType= 1
$$ ##$TFXNUM= 0
$$ ##$TRIPLO2= 0
$$ ##$VTU= 2
$$ ##$VTUETH= <149.236.99.20>
$$ ##$VTUTY= <no>
$$ ##$WBREFAM= (0..15)
$$ 132.2 106.2 100 100 100 100 100 100 100 100 100 100 100 100 100 100
$$ ##$WBREFLM= (0..15)
$$ 0 0 0 0 0 0 0 0 0 0 0 0 0 0 0 0
$$ ##$WBREFPH= (0..15)
$$ 77.55 -65.76 0 0 0 0 0 0 0 0 0 0 0 0 0 0
$$ ##$WBSGU= (0..15)
$$ 0 0 0 0 0 0 0 0 0 0 0 0 0 0 0 0
$$ ##$XFAC= 2
$$ ##END=
$$ 
##$DECIM=	704
##$DSPFVS=	20
##XUNITS=	HZ
##YUNITS=	ARBITRARY UNITS
##FIRSTX=	25277.332242342450627
##LASTX=	-3131.3251784229105397
##DELTAX=	-0.43348832563920591809
##XFACTOR=	1
##YFACTOR=	0.084912925608212702633
##FIRSTY=	-52.874691009521484375
##MINY=	-72.72393035888671875
##MAXY=	2467.87890625
##NPOINTS=	65536
##XYDATA=	(X++(Y..Y))
$$ [...]
12943a54lj0k0l6m2l4k1k0k9k8j3J1L2L9K8J2MJ1J5Jj8k2jK0K1Jk4l7k8nJ7K6K0NmKJ8L0K5
$$ -154 -157 -167 -187 -223 -265 -299 -320 -340 -369 -397 -410 -399 -367 -328 -300 -288 -284 -273 -258 -257 -275 -297 -298 -278 -257 -256 -280 -317 -345 -350 -333 -307 -287 -282 -286 -284 -266 -236 -211
12926b11Jk1j9KK0K3J3QJ2K0J8Noj0j5k9m5m0j6J2K6K9K4J2nj0kkk0m3m7l4k1j2lJ1K5K9J9
$$ -211 -210 -231 -250 -248 -228 -205 -192 -184 -172 -152 -134 -129 -135 -145 -160 -189 -234 -274 -290 -278 -252 -223 -199 -187 -192 -202 -204 -206 -226 -269 -316 -350 -371 -383 -386 -375 -350 -321 -302
12909c02%j9k6k2j6j3oRJ8Nj9k4qJ3K2J9J6J3J9L3M4L9J6qj9k0j3oJlj0j0lnj9k3JL7N4M1
$$ -302 -302 -321 -347 -369 -385 -398 -404 -395 -377 -372 -391 -415 -423 -410 -388 -369 -353 -340 -321 -288 -244 -205 -189 -197 -216 -236 -249 -255 -254 -257 -267 -277 -280 -285 -304 -327 -326 -289 -235 -194
12892a94J4mjJ5K5J7lj7pJ4K2J0mj3k1k8k6j2NJ2Q%j7l8n3m7k4lJ0K0K4J6jqPK5K8J7J1J1
$$ -194 -180 -184 -185 -170 -145 -128 -131 -148 -155 -141 -119 -109 -113 -126 -147 -175 -201 -213 -208 -196 -188 -188 -205 -243 -296 -343 -367 -370 -360 -340 -316 -300 -301 -309 -302 -277 -249 -232 -221 -210
12874b10Kj6k7k0kMLK%rk3l1k9j8MK8M3L0Jj9j9j1j2j9k1j5nJ1L2M7M0J2j4j7JK0L0K7J2r
$$ -210 -208 -224 -251 -271 -273 -269 -266 -264 -264 -273 -296 -327 -356 -374 -370 -342 -299 -269 -268 -287 -306 -317 -329 -348 -369 -384 -389 -378 -346 -299 -259 -247 -261 -278 -277 -257 -227 -200 -188 -197
12857a97k2k2oJ3K4K5K2J5J3J5K0J4rl5m3k2MJ3Lj2k4l8m3l4rJ2K0K0J7J2QRJ6J4NkOJ2Lj6
$$ -197 -219 -241 -247 -234 -210 -185 -163 -148 -135 -120 -100 -86 -95 -130 -173 -195 -191 -178 -175 -187 -211 -249 -292 -326 -335 -323 -303 -283 -266 -254 -246 -237 -221 -207 -202 -204 -198 -186 -183 -199
12840a99k6k2j7k2l0k4lK2L4L0Rj3j7nJ0J6J3PLOJ5K3J9Noj1k1m2n8n1k1LKj4k4j9j3j4j7
$$ -199 -225 -247 -264 -286 -316 -340 -343 -321 -287 -257 -248 -261 -278 -283 -273 -257 -244 -237 -234 -228 -213 -190 -171 -166 -172 -183 -204 -246 -304 -355 -376 -373 -371 -385 -409 -428 -441 -455 -472
12823d72j1RK9L4K9K8L5M1L2J5Knrj0oKPQJ1J4Qjoqk0l7l6nK8L1J0lNJ9K2J7Lj6l2l2j8pl
$$ -472 -483 -474 -445 -411 -382 -354 -319 -278 -246 -231 -229 -234 -243 -253 -259 -257 -250 -242 -231 -217 -209 -210 -216 -224 -244 -281 -317 -322 -294 -263 -253 -256 -251 -232 -210 -193 -190 -206 -238 -270 -288 -295 -298
12804b98%PJ0J0J8L1K8Jk6l2l0m1n4m1oJ5QnMK5L7L1J7Pkj4k8l7l3j1J8M0M8M0J8j1k5j3J4
$$ -298 -298 -291 -281 -271 -253 -222 -194 -193 -219 -251 -281 -322 -376 -417 -423 -408 -400 -405 -401 -376 -339 -308 -291 -284 -286 -300 -328 -365 -398 -409 -391 -351 -303 -263 -245 -256 -281 -294 -280
12787b80L0L0L0L8M1K8Jk7m3m1j5J8L2K2Jqrrj2j4k1l6m3l5k1j2nLJ4J7J8K3K1Rlqj1k6l8
$$ -280 -250 -220 -190 -152 -111 -83 -82 -109 -152 -193 -208 -190 -158 -136 -135 -143 -152 -161 -173 -187 -208 -244 -287 -322 -343 -355 -360 -357 -343 -326 -308 -285 -264 -255 -258 -266 -277 -303 -341
12770c41l0rKkKK1L5L3K6J9Nj4k7k2j0nlKOLKJ4K5K6J8J6J5OljJ2J7MonKkk1m1m7k4J3L4K5
$$ -341 -371 -380 -378 -380 -378 -357 -322 -289 -263 -244 -239 -253 -280 -302 -312 -317 -320 -318 -312 -309 -307 -293 -268 -242 -224 -208 -193 -187 -190 -191 -179 -162 -158 -164 -169 -167 -169 -190 -231 -278 -302 -289 -255 -230
12751b30pk9k2LK3K8K0J0J2K5L4K4Jj7j9j8k1k0j4plJPJ4J5J3Qpl3m9l4jJ9J1j0k0j3QK9L6
$$ -230 -237 -266 -288 -285 -262 -234 -214 -204 -192 -167 -133 -109 -108 -125 -144 -162 -183 -203 -217 -224 -227 -226 -219 -205 -190 -177 -169 -176 -209 -258 -292 -293 -274 -263 -273 -293 -306 -298 -269 -233
12734b33K2jj2rpj7k4j4PJ4QK%mrpKNpk1k3j7j2p%RJ4J4J0%j2j4lOOKJ1K3K5J6RROlj1j5k3
$$ -233 -211 -212 -224 -233 -240 -257 -281 -295 -288 -274 -266 -264 -264 -268 -277 -284 -282 -277 -284 -305 -328 -345 -357 -364 -364 -355 -341 -327 -317 -317 -329 -343 -346 -340 -334 -332 -321 -298 -273 -257 -248 -239 -233 -236 -247 -262 -285
12714b85l3l3j6JLpqLJ7J8Oj3k4j9jJ6K4K8L0K8K1Rmj7k7k2jJ5J5RJ3K5K5Rqj4j2p%RJ2Mq
$$ -285 -318 -351 -367 -366 -363 -370 -378 -375 -358 -340 -334 -347 -371 -390 -391 -375 -351 -323 -293 -265 -244 -235 -239 -256 -283 -305 -306 -291 -276 -267 -254 -229 -204 -195 -203 -217 -229 -236 -236 -227 -215 -211 -219
12695b19j2oJmj7k1nJ5K3J5Pkj5l4l9k1kKojJ1J4J1K1L2J2l4o1l6J0K7J4%JJoj1lNPKmj0j0
$$ -219 -231 -237 -236 -240 -257 -278 -283 -268 -245 -230 -223 -225 -240 -274 -313 -334 -336 -334 -340 -341 -330 -316 -305 -284 -252 -240 -274 -335 -371 -361 -334 -320 -320 -319 -318 -324 -335 -338 -333 -326 -324 -328 -338 -348
12676c48%J5K6K8K6J7Jj5j4mkj3j5%J7J4mj3qJjnnJ%j2k1j0J8L7K9J1J2L2M1J9j0j5jRJj6
$$ -348 -348 -333 -307 -279 -253 -236 -235 -250 -264 -268 -270 -283 -298 -298 -281 -267 -271 -284 -292 -291 -292 -297 -302 -301 -301 -313 -334 -344 -326 -289 -260 -249 -237 -205 -164 -145 -155 -170 -171 -162 -161 -177
12658a77k5k4j3JRNjjQJ5Qrk7l6l7k9j4JJ3J6OlOK9L8J2l2n0k7J1L0L0L1L6L3J6qk9m0l8k3
$$ -177 -202 -226 -239 -238 -229 -224 -225 -226 -218 -203 -195 -204 -231 -267 -304 -333 -347 -346 -333 -317 -311 -314 -308 -279 -241 -229 -261 -311 -338 -327 -297 -267 -236 -200 -167 -151 -159 -188 -228 -266 -289
12640b89j0j2k5k9j7lkrj2oJJLJ6K8K5Ql%J3J7Mj2j8rOJ1LlJJ3J5Jj4j0NJ1LlRK6L2K1Lj4
$$ -289 -299 -311 -336 -365 -382 -385 -387 -396 -408 -414 -413 -412 -409 -393 -365 -340 -332 -335 -335 -322 -305 -301 -313 -331 -340 -334 -323 -320 -323 -322 -309 -294 -293 -307 -317 -312 -301 -298 -301 -292 -266 -234 -213 -210 -224
12620b24k5k7k0rJQJ0jj9l2k2jJ2J3J5K0J7%j0jJ8K4J1j0k4l1k8j3PJ7Qrj5nQJ1N%%LNKrj8
$$ -224 -249 -276 -296 -305 -304 -296 -286 -287 -306 -338 -360 -361 -349 -336 -321 -301 -284 -284 -294 -295 -277 -253 -242 -252 -276 -307 -335 -348 -341 -324 -316 -325 -340 -345 -337 -326 -321 -321 -321 -318 -313 -311 -320 -338
12601c38j9j0m%RK8M9N0L0Nj4k7m0m3l4k2j7j8j2jJ3K7M5N9N2K2j3k6rK2M0L5J6lj6k9m2l8
$$ -338 -357 -367 -371 -371 -362 -334 -285 -235 -205 -200 -214 -241 -281 -324 -358 -380 -397 -415 -427 -428 -415 -388 -343 -284 -232 -210 -223 -249 -258 -236 -196 -161 -145 -148 -164 -193 -235 -273
12585b73j0J8K5Qoqqj5j9j1QJ8K0J6J4J5J5J0%plJ1J3nk8m1m1l3j9nLlj5j3PL2M8M8M2L6K5
$$ -273 -283 -265 -240 -232 -238 -246 -254 -269 -288 -299 -291 -273 -253 -237 -223 -208 -193 -183 -183 -190 -193 -182 -169 -174 -202 -243 -284 -317 -336 -341 -338 -341 -356 -369 -362 -330 -282 -234 -192 -156 -131
12567a31Nk3l9l3j3jmqrqj1nJ0K1J4kj5j8j7j2LJ7J6%j7j7mJ4K5K0Mj0j2pmNK3K3rm7n0k0
$$ -131 -126 -149 -188 -221 -234 -235 -239 -247 -256 -264 -275 -280 -270 -249 -235 -237 -252 -270 -287 -299 -296 -279 -263 -263 -280 -297 -301 -287 -262 -242 -238 -248 -260 -267 -271 -266 -243 -220 -229 -276 -326 -346
12549c46QJ5J9L1L1Ok9l9k4kJ1J4J0PQJ2Kj2j5MK3K1Kj3j7j3%J5J8MpKJ7K0J3J1J2nk5k3J
$$ -346 -338 -323 -304 -273 -242 -236 -265 -304 -328 -330 -319 -305 -295 -288 -280 -268 -266 -278 -293 -289 -266 -245 -243 -256 -273 -286 -286 -271 -253 -249 -256 -254 -237 -217 -204 -193 -181 -186 -211 -234 -233
12531b33J5nl2l6j6PK0K7L4K9J6kj0nQJ1Lj6k8k5j2MNqk5j9QL7M2K4Kj3k0k5k6k8k9k3lK0
$$ -233 -218 -223 -255 -291 -307 -300 -280 -253 -219 -190 -174 -176 -186 -191 -183 -172 -169 -185 -213 -238 -250 -246 -241 -249 -274 -293 -285 -248 -206 -182 -180 -193 -213 -238 -264 -292 -321 -344 -347 -327
12514c27K8K0J2Ook3k2OL8M8L2Prj4pMMpj5j4j4k2k5j5LNkmJ2L1L7K6Oqq%Jj2k9l2j9JJ4J2
$$ -327 -299 -279 -267 -261 -267 -290 -312 -306 -268 -220 -188 -181 -190 -204 -211 -207 -203 -210 -225 -239 -253 -275 -300 -315 -312 -307 -309 -313 -301 -270 -233 -207 -201 -209 -217 -217 -216 -228 -257 -289 -308 -307 -293 -281
12495b81Kqj0nJJmrj3rQK4K8J7J0J7K8J8rl2l9l7k7j4KQQJ3K6L2K1Jj1nJ0K3K2Rrk0k8l8m0
$$ -281 -279 -287 -297 -302 -301 -300 -304 -313 -326 -335 -327 -303 -275 -258 -248 -231 -203 -185 -194 -226 -265 -302 -329 -343 -341 -333 -325 -312 -286 -254 -233 -232 -243 -248 -238 -215 -193 -184 -193 -213 -241 -279 -319
12476c19k7JK1K0mk6k7qJ4K7K3J3jj0j5nQJ4Lrj1n%NJ1J1KqmJ0J8J3Lpj4j5mRPqj4JK0K8K7
$$ -319 -346 -345 -324 -304 -308 -334 -361 -369 -355 -328 -305 -292 -293 -303 -318 -323 -315 -301 -298 -307 -318 -323 -323 -318 -307 -296 -294 -302 -306 -296 -278 -265 -262 -269 -283 -298 -302 -293 -286 -294 -308 -307 -287 -259 -232
12456b32K2J7J0J2K2K6J2pj7k2k9l5k7oJ5L3M2L6Rj6j6LJ3Lj6k6k8k3j4opj2qK%j6k4oJ9K3
$$ -232 -210 -193 -183 -171 -149 -123 -111 -118 -135 -157 -186 -221 -248 -254 -239 -206 -164 -128 -119 -135 -151 -148 -135 -132 -148 -174 -202 -225 -239 -245 -252 -264 -272 -270 -270 -286 -310 -316 -297 -274
12439b74Lj5k0j6pLJ7K4K1J2%lPK6L8K9NrnOJj7k7j3J3K8J7mj1jRRMRK0J9Kk3l8m3l7k6j0
$$ -274 -271 -286 -306 -322 -329 -326 -309 -285 -264 -252 -252 -255 -248 -222 -184 -155 -150 -159 -164 -158 -157 -174 -201 -214 -201 -173 -156 -160 -171 -172 -163 -154 -150 -141 -121 -102 -100 -123 -161 -204 -241 -267 -277
12421b77%krj0LJ7J9J3LmrpJJ0Nrj8j2KJ0RPOMjlJMLqj8j8LL2M5L4J2LM%j5k7k6j4KK0L6L9
$$ -277 -277 -279 -288 -298 -295 -278 -259 -246 -243 -247 -256 -263 -262 -252 -247 -256 -274 -286 -284 -274 -265 -258 -252 -248 -249 -252 -251 -247 -244 -252 -270 -288 -285 -253 -208 -174 -162 -159 -155 -155 -170 -197 -223 -237 -235 -215 -179 -140
12400a40K4Nloj3j6oJ5K4Rj9m0m6m3l1j4%JopMJ3Mk4m4l5kK6K4Lj6j3J0L5M7M5L3J9Kj8l8
$$ -140 -116 -111 -114 -120 -133 -149 -155 -140 -116 -107 -126 -166 -212 -255 -286 -300 -300 -299 -305 -312 -308 -295 -291 -315 -359 -394 -396 -370 -346 -343 -359 -372 -362 -327 -280 -235 -202 -183 -181 -199 -237
12382b37m2k5kJ1Jk0l4l0rJ1J9J7J3Rjj3j9rMPKMJ7K6J8Jj0j3j4j8j8pJ1K6K9J9Kj3k3k4k2
$$ -237 -279 -304 -306 -295 -294 -314 -348 -378 -387 -376 -357 -340 -327 -318 -319 -332 -351 -360 -356 -349 -347 -343 -326 -300 -282 -281 -291 -304 -318 -336 -354 -361 -350 -324 -295 -276 -274 -287 -310 -334 -356
12364c56k0j8j3JK8N4N9M0Qj8k7k3j0J0K2J6kj2rkjqj5j5j0lMNLNJ2J4Pmrp%PJ0PJ1K6M2L5
$$ -356 -376 -394 -407 -406 -378 -324 -265 -225 -217 -235 -262 -285 -295 -285 -263 -247 -249 -261 -270 -272 -273 -281 -296 -311 -321 -324 -320 -315 -312 -307 -295 -281 -274 -278 -287 -294 -294 -287 -277 -270 -259 -233 -191 -156
12345a56Ll2m5k9mJ2J0qk5j7J4M2M6L3J9Lk0l5k2RK4J2lkJoj0JJ9K1Nj0j8k6l3l1k6k6k0J
$$ -156 -153 -185 -230 -259 -263 -251 -241 -249 -274 -291 -277 -235 -189 -156 -137 -134 -154 -189 -211 -202 -178 -166 -169 -171 -170 -176 -186 -185 -166 -145 -140 -150 -168 -194 -227 -258 -284 -310 -330 -329
12328c29K9L3Ml3m3k6%J9K8K6J2qj7j6j0ojRJ9K1J1lqLJ3QnrKJ2J0joKJ6K6K3Jk3l0j1RJ5
$$ -329 -300 -267 -263 -296 -339 -365 -365 -346 -318 -292 -280 -288 -305 -321 -331 -337 -338 -329 -310 -289 -278 -281 -289 -286 -273 -265 -270 -279 -277 -265 -255 -256 -262 -260 -244 -218 -195 -194 -217 -247 -258 -249 -234
12309b34J1J6K5J9rl2l1lK3K8J3nJK5M6L6Oj9k5k4k7l2k7j4nqj3j6j1mloj3j6j3oKK%JJ3K9
$$ -234 -223 -207 -182 -163 -172 -204 -235 -238 -215 -187 -174 -179 -178 -153 -107 -71 -65 -84 -109 -133 -160 -192 -219 -233 -238 -246 -259 -275 -286 -290 -293 -299 -312 -328 -341 -347 -345 -343 -343 -342 -329 -300
12291c00L4K5J6J5J2rl9n2l4rlj2j2KJ7J9J1J0J9K1Pj7l3k2MK6L2K8J4nj9k1j3rj2j4JK0L0
$$ -300 -266 -241 -225 -210 -198 -207 -246 -298 -332 -341 -344 -356 -368 -366 -349 -330 -319 -309 -290 -269 -262 -279 -312 -334 -330 -304 -272 -244 -230 -235 -254 -275 -288 -297 -309 -323 -322 -302 -272
12274b72K0Kj3j8qPJ7J2lj5j8j0MK0K3J0mkQJ6J2OjooPK4K9J5lj6k5l3l6k8j4oopoLJ6K7K4
$$ -272 -252 -250 -263 -281 -289 -282 -265 -253 -256 -271 -289 -299 -295 -275 -252 -242 -246 -248 -240 -224 -212 -206 -207 -213 -219 -212 -188 -159 -144 -147 -163 -188 -221 -257 -285 -299 -305 -311 -318 -324 -321 -305 -278 -254
12255b54Nj4j6lJ0J5J6J8K3K2Qj6l8l8j8NJ2Mj1k3k5k1j0%RK1L7M7M5L1J1oj9k3k2j3jQKj1
$$ -254 -249 -263 -279 -282 -272 -257 -241 -223 -200 -178 -170 -186 -224 -262 -280 -275 -263 -259 -270 -293 -318 -339 -349 -349 -340 -319 -282 -235 -190 -159 -148 -154 -173 -196 -218 -231 -232 -224 -222 -233
12238b33j3NK0Ml4o0n0k3mNJ7L3L7K5Orj1pJJrj7k1k1k2j2J1L1L0J8J1J7J6PJRK3K7K3J5J
$$ -233 -246 -241 -221 -217 -251 -311 -361 -384 -388 -383 -366 -333 -296 -271 -265 -274 -285 -292 -291 -290 -299 -316 -337 -358 -380 -392 -381 -350 -320 -302 -291 -274 -258 -251 -250 -241 -218 -191 -168 -153 -152
12220a52k0l8l9k0KLj2k4qL0N2L5nl1l1j9j1lJ1K3K6K2K4K8K3J4kk4m8n4l0OK3Nk4l7k1J2
$$ -152 -172 -210 -249 -269 -267 -264 -276 -300 -308 -278 -226 -191 -196 -227 -258 -277 -288 -291 -280 -257 -231 -209 -185 -157 -134 -120 -122 -146 -194 -248 -278 -272 -249 -244 -268 -305 -326 -314
12203c14L7L4J2nJK2L2J7qk5k7k3j6oOJ6J9J4O%lpj5j5KK7M0K6kk3l2l1k3j3%NNPJ1J0kj7
$$ -314 -277 -243 -231 -236 -235 -213 -181 -164 -172 -197 -224 -247 -263 -269 -263 -247 -228 -214 -208 -208 -211 -218 -233 -248 -246 -219 -179 -153 -155 -178 -210 -241 -264 -277 -277 -272 -267 -260 -249 -239 -241 -258
12185b58k0%K3K8RrrNJ4Q%lqj8k2j2NJ3Olonqj3pOJ9K1Roj9k5k2j1PK4L1K3PnrokJPJ5Pj9
$$ -258 -278 -278 -255 -227 -218 -227 -236 -231 -217 -209 -209 -212 -220 -238 -260 -272 -267 -254 -248 -251 -257 -262 -270 -283 -290 -284 -265 -244 -235 -241 -260 -285 -307 -318 -311 -287 -256 -233 -226 -231 -240 -246 -248 -247 -240 -225 -218 -237
12164b37m5m5j1K9M8M3L3L0K7J6nk5m0m5m1l1j8nOJ6K4L1L3L1K0Npj3j2poj5k9l1j4PJ1KK
$$ -237 -282 -327 -338 -309 -261 -218 -185 -155 -128 -112 -117 -142 -182 -227 -268 -299 -317 -322 -316 -300 -276 -245 -212 -181 -161 -156 -163 -176 -188 -195 -201 -216 -245 -276 -290 -283 -272 -270 -268
12147b68J7L0L3K9K5Ok4l9k2PJ0pj3LJ9J5NKM%pqpl%LLknpj6k8l0j6mkkRJ6Jk0k4mJ5K5L2
$$ -268 -251 -221 -188 -159 -134 -128 -152 -191 -213 -206 -196 -203 -216 -213 -194 -179 -174 -172 -168 -168 -175 -183 -190 -193 -193 -190 -187 -189 -194 -201 -217 -245 -275 -291 -295 -297 -299 -290 -274 -273 -293 -317 -321 -306 -281 -249
12127b49L9L4Nk6l5k1olrpKPN%JQJ1NjjKmj7k0rJ1K7L0K7K4J8Mj8l4k6jJ3jk3k8j2Jkj0j1
$$ -249 -210 -176 -171 -197 -232 -253 -259 -262 -271 -278 -276 -269 -264 -264 -263 -255 -244 -239 -240 -241 -239 -243 -260 -280 -289 -278 -251 -221 -194 -170 -152 -148 -166 -200 -226 -227 -214 -215 -238 -266 -278 -277 -279 -289 -300
12108c00qnMJ6J5kj1NL2M7M2K9J0j8m4n1m0l0l1k4nJ0J5J9L4M5K8mj8jK1K2Oj1j9k5k6j4J1
$$ -300 -308 -313 -309 -293 -278 -280 -291 -286 -254 -207 -165 -136 -126 -144 -188 -239 -279 -309 -340 -364 -369 -359 -344 -325 -291 -246 -218 -222 -240 -241 -220 -198 -192 -203 -222 -247 -273 -287 -276
12091b76K9K1Jj1j0j3j9j1J3K7J3j4k3j3jmj3j7j3mQJ4Kj9k6j1PK1L3M5M3J8j1j8oQJ6J6N
$$ -276 -247 -226 -225 -236 -246 -259 -278 -289 -276 -249 -236 -250 -273 -286 -287 -291 -304 -321 -334 -338 -330 -316 -314 -333 -359 -370 -363 -342 -309 -264 -221 -203 -214 -232 -238 -230 -214 -198 -193
12074a93j8l7l6j3QJ0kj2j2oKLKQJ8K1J4J4K9M0K7ql6m2l7l0j9oLLJKKLJ0K4L6L7L7L6L6K8
$$ -193 -211 -248 -284 -297 -289 -279 -281 -293 -305 -311 -309 -306 -304 -296 -278 -257 -243 -229 -200 -160 -133 -141 -177 -219 -256 -286 -305 -311 -308 -305 -304 -302 -300 -297 -287 -263 -227 -190 -153 -117 -81 -53
12056e3J0j9m6n1k6MJ2kj4j5j7k4k2pPO%kjll%jj3j3QK9K6J2J0J7J2nj1ook0l0k3pNJ3K1K3
$$ -53 -43 -62 -108 -159 -185 -181 -169 -171 -185 -200 -217 -241 -263 -270 -263 -257 -257 -259 -260 -263 -266 -266 -267 -280 -293 -285 -256 -230 -218 -208 -191 -179 -184 -195 -201 -207 -227 -257 -280 -287 -282 -269 -248 -225
12037b25J8J1RJj7l0k6qJ0J9K1J3nk8l3pL1N3L8Lj7pQOpj3j0j3k5l2l4l9l3%M7O6L3j5l3k2
$$ -225 -207 -196 -187 -186 -203 -233 -259 -267 -257 -238 -217 -204 -209 -237 -270 -277 -246 -193 -155 -152 -169 -176 -168 -162 -169 -182 -192 -205 -230 -262 -296 -335 -368 -368 -321 -255 -222 -237 -270 -292
12020b92j3j6j5KJ3Nj3k4k4j9j6qMJ5J5QJkmjNJ4J3LrqNK4L3K3%l0m2k5KJ7J3J0J7J7Mj0o
$$ -292 -305 -321 -336 -334 -321 -316 -329 -353 -377 -396 -412 -420 -416 -401 -386 -378 -377 -379 -383 -384 -379 -365 -352 -349 -358 -366 -361 -337 -304 -281 -281 -311 -353 -378 -376 -359 -346 -336 -319 -302 -298 -308 -314
12001c14J2K0J1nrLK0K5J1j2k1qJ0J4Km%QRLlkMQNPJ4J9Qj0j3kO%nLRMmJJ2J6Qok2l4k5NL7
$$ -314 -302 -282 -271 -276 -285 -282 -262 -237 -226 -238 -259 -267 -257 -243 -241 -245 -245 -237 -228 -225 -228 -230 -226 -218 -213 -206 -192 -173 -165 -175 -188 -190 -184 -184 -189 -186 -177 -173 -177 -176 -164 -148 -140 -146 -168 -202 -227 -222 -185
11980a85M5K8Nj8l5m0k3kO%mqk5m4m3j4QMrkK3M1L1Pj4j8j5k4m1m6j9J3K8K2J8K4K2J5J3J7
$$ -185 -140 -112 -107 -125 -160 -200 -223 -225 -219 -219 -223 -231 -256 -300 -343 -357 -349 -345 -354 -356 -333 -292 -261 -254 -268 -286 -301 -325 -366 -412 -431 -418 -390 -368 -350 -326 -304 -289 -276 -259
11962b59J6MMJ1J2oj5qJknNJ2%j5nJ8K1jj5j1qj9l3l2j9rpj3k2k3qJ2J7QlkL%rj5pJ1L1M0
$$ -259 -243 -239 -235 -224 -212 -218 -233 -241 -240 -242 -247 -242 -230 -230 -245 -250 -232 -211 -212 -227 -238 -246 -265 -298 -330 -349 -358 -365 -378 -400 -423 -431 -419 -402 -394 -397 -399 -396 -396 -405 -420 -427 -416 -385 -345
11943c45L5K6J9J3J1J3J3Orj7nJ6K5J8Noj8k5k2j3j5l1m0k4LK1K6K6L2L9L6J8ok6l5l5k4p
$$ -345 -310 -284 -265 -252 -241 -228 -215 -209 -218 -235 -240 -224 -199 -181 -176 -182 -200 -225 -247 -260 -275 -306 -346 -370 -367 -346 -320 -294 -262 -223 -187 -169 -175 -201 -236 -271 -295 -302
11926c02J4K9L4L1J7j1m3n5l6rMpk3l0k2mJ7K3J4PJ3K3J9Jj5k2k4k0mJ0Rj%J6K9K6K0J4Nl
$$ -302 -288 -259 -225 -194 -177 -188 -231 -286 -322 -331 -327 -334 -357 -387 -409 -413 -396 -373 -359 -352 -339 -316 -297 -296 -311 -333 -357 -377 -381 -371 -362 -363 -363 -347 -318 -292 -272 -258 -253 -256
11909b56JJ0Prj3QK7K3QQJ6J5Njmj6k9k7j1mqrolnmmpj3qJ0K1J7Nnj2j6j3mOJ1PJj2k1j7L
$$ -256 -255 -245 -238 -247 -260 -252 -225 -202 -194 -186 -170 -155 -150 -151 -155 -171 -200 -227 -238 -242 -250 -259 -265 -268 -273 -277 -281 -288 -301 -309 -299 -278 -261 -256 -261 -273 -289 -302 -306 -300 -289 -282 -281 -293 -314 -331 -328
11889c28K3K8J6lk0k2pJ5K5J3pj7j0JOLlj0j1kJ1J8J7J3J1J7K3K1Mj9l1k1MK9L8K7Kj8j6M
$$ -328 -305 -277 -261 -264 -284 -306 -313 -298 -273 -260 -267 -284 -294 -293 -287 -284 -287 -297 -308 -310 -299 -281 -264 -251 -240 -223 -200 -179 -175 -194 -225 -246 -242 -213 -175 -148 -146 -164 -180 -176
11871a76J7J2LJ3M0N6L9Kk8l3k1rj3k8m3m2k6lJ4J4nl4m8l1NL2L3K3J5Qqk8k7JK7L0J7QNo
$$ -176 -159 -147 -144 -131 -91 -35 4 6 -22 -55 -76 -85 -98 -126 -169 -211 -237 -240 -226 -212 -217 -251 -299 -330 -325 -293 -260 -237 -222 -214 -222 -250 -277 -276 -249 -219 -202 -194 -189 -195
11854a95l0m4l6j4OJ6J4%k0k9j5PK0K0K0K1J0qj7oPLj1k4k5k3j9qNJ8K4K2J0qk3k2j3oqj9
$$ -195 -225 -269 -305 -319 -313 -297 -283 -283 -303 -332 -347 -340 -320 -300 -280 -259 -249 -257 -274 -280 -273 -270 -281 -305 -330 -353 -372 -380 -375 -357 -333 -311 -301 -309 -332 -354 -367 -373 -381 -400
11837d00k4j8pJ0L0N2O3N0J6j5k9k7k3k1j7pOJ4J1LjRK4K9J7jmjK%QK2K7J7Jj6k9l6k4nLj3
$$ -400 -424 -442 -449 -439 -409 -357 -294 -244 -228 -243 -272 -299 -322 -343 -360 -367 -361 -347 -336 -333 -334 -325 -301 -272 -255 -256 -260 -261 -259 -259 -251 -229 -202 -185 -184 -200 -229 -265 -289 -294 -291 -304
11818c04l0k7rLMPJ5J3kj7j7mJ1K3L4M3M0K0j5n0o7n6k5J7N3O3M0Jk6k2lPLnqqnjPJ6K6L2
$$ -304 -334 -361 -370 -367 -363 -356 -341 -328 -330 -347 -364 -368 -357 -334 -300 -257 -217 -197 -212 -262 -329 -385 -410 -393 -340 -277 -237 -236 -262 -284 -287 -280 -277 -282 -290 -298 -303 -304 -297 -281 -255 -223
11800b23K7Ok2l2j5J5L1J6j2k4pJ6J4j8n1n5k7RL6M4L3Qj6k2j0jpk1k4j1OQqk6k1J0M2M6K7
$$ -223 -196 -190 -212 -244 -259 -244 -213 -197 -209 -233 -240 -224 -210 -228 -279 -334 -361 -352 -316 -272 -239 -231 -247 -269 -279 -280 -287 -308 -332 -343 -337 -329 -337 -363 -384 -374 -332 -286 -259
11783b59RQJ4J3MkjMNkj9l5l3j2J2J9J3J0J5K5K5J3qk1k0j0mmJJ1J1nj8j0J0Qj8m2m0j7RK7
$$ -259 -250 -242 -228 -215 -211 -213 -214 -210 -205 -207 -226 -261 -294 -306 -294 -275 -262 -252 -237 -212 -187 -174 -182 -203 -223 -233 -237 -241 -240 -229 -218 -223 -241 -251 -241 -233 -251 -293 -333 -350 -341 -314
11765c14K9J7JMK1K9Ok8l6j5J2K7L0K3Pj3j7%J7J8QJlj3k5l0k5j2KJ7K6J7kqPK8L7L5K7J2
$$ -314 -285 -268 -267 -263 -242 -213 -207 -235 -271 -286 -274 -247 -217 -194 -187 -200 -217 -217 -200 -182 -174 -173 -176 -189 -214 -244 -269 -281 -279 -262 -236 -219 -221 -229 -222 -194 -157 -122 -95 -83
11748h3qk0j7jJ1J1jj9m0n3m5j5J8K7Ok4l0qJ8K3Rll%lkPJ5J2NLLkrj1mjk%QJ2Lqj2pqj7k3
$$ -83 -91 -111 -128 -129 -118 -107 -108 -127 -167 -220 -265 -280 -262 -235 -229 -253 -283 -291 -273 -250 -241 -244 -247 -247 -250 -252 -245 -230 -218 -213 -210 -207 -209 -218 -229 -233 -234 -236 -236 -228 -216 -213 -221 -233 -240 -248 -265 -288
11727b88k3k3k3k2j1MJ7J5MlRL4M6L4RJRJ7Orj5rmqj5j8k1k2j9j9l1n0m8j2M0O7N5K9J9K5
$$ -288 -311 -334 -357 -379 -390 -386 -369 -354 -350 -353 -344 -310 -264 -230 -221 -220 -211 -194 -188 -197 -212 -221 -225 -233 -248 -266 -287 -309 -328 -347 -378 -428 -476 -488 -448 -381 -326 -297 -278 -253
11710b53K9J6jj3k0j8qJ1K5K4J0lj1j9k1j6JK1L6M1L7K1nl1m0l0j5ojPJ9J8Kk3l6l4k2oQJ1
$$ -253 -224 -208 -209 -222 -242 -260 -268 -257 -232 -208 -198 -201 -212 -231 -252 -268 -267 -246 -210 -169 -132 -111 -116 -147 -187 -217 -232 -238 -239 -232 -213 -195 -193 -216 -252 -286 -308 -314 -306 -295
11692b95jj6j7KJ7J6MkKPJ3K6L8L8J8qk5l1m2n3m8j8K5N4N5L8J6rl3m7m2k4lJ8L7M5L9K5K0
$$ -295 -296 -312 -329 -327 -310 -294 -290 -292 -290 -283 -270 -244 -206 -168 -150 -158 -183 -214 -256 -309 -357 -375 -350 -296 -241 -203 -187 -196 -229 -276 -318 -342 -345 -327 -290 -245 -206 -181 -161
11675a61K4K6K4J7J2Opk0l4m1l7k2okoj3j5j9k5k1JK2K4RonQK2L1L2K2Kj9l4l8l2j7LJ7J6
$$ -161 -137 -111 -87 -70 -58 -52 -59 -79 -113 -154 -191 -213 -219 -221 -227 -240 -255 -274 -299 -320 -319 -297 -273 -264 -270 -275 -267 -245 -214 -182 -160 -158 -177 -211 -249 -281 -298 -295 -278 -262
11658b62Lrj0mjnrkQJ5RMLKkl%%qj3j1l%mlLPM%OJ7K3J4nj2jJ9K4Mk0k6j6lJOJ3J5J4J2J5
$$ -262 -259 -268 -278 -282 -283 -288 -297 -299 -291 -276 -267 -263 -260 -258 -260 -263 -263 -263 -271 -284 -295 -298 -298 -302 -305 -302 -295 -291 -291 -285 -268 -245 -231 -236 -248 -249 -230 -206 -202 -222 -248 -264 -267 -266 -260 -247 -232 -218 -206 -191
11636a91J2jk1l0k5qOPKk%%l%RJ5Npj0l%nqpqj0kPN%RL0L2Jl2l6j6kkmNJ3Omj0rpolnj0j6
$$ -191 -179 -180 -201 -231 -256 -264 -258 -251 -249 -251 -251 -251 -254 -254 -245 -230 -225 -232 -242 -245 -245 -250 -258 -265 -273 -283 -285 -278 -273 -273 -264 -234 -202 -201 -233 -269 -285 -287 -289 -293 -288 -275 -269 -273 -283 -292 -299 -305 -308 -313 -323 -339
11614c39j2jPJ1J8L3M1K5pk9k1m%roJ8L5K3nj6%J9K2J1jrj4j7j5kJ1J5OrrLJ0Jj6k7k8k9k6
$$ -339 -351 -352 -345 -334 -316 -283 -242 -217 -224 -253 -274 -278 -278 -287 -293 -275 -240 -217 -222 -238 -238 -219 -197 -186 -187 -196 -210 -227 -242 -244 -233 -218 -212 -221 -230 -227 -217 -216 -232 -259 -287 -316 -342
11595c42nK5M4M1L1K6K1Qpj0kKjmKKnrJNj1l7m1j0K4K7Jj4nPkk6l8k5%J9K1J7J6J8J2jj3r
$$ -342 -347 -322 -278 -237 -206 -180 -159 -151 -158 -168 -170 -168 -169 -173 -171 -169 -174 -183 -182 -177 -188 -225 -266 -276 -252 -225 -224 -238 -243 -236 -238 -264 -302 -327 -327 -308 -287 -270 -254 -236 -224 -225 -238 -247
11576b47Jjj5k1%L1M2K0j4l7l8j8RK7K4RjKNmk8m3k8J1M3M1J5orqj2pJ7M5M1Qk6l5k2o%nj5
$$ -247 -246 -247 -262 -283 -283 -252 -210 -190 -204 -241 -279 -297 -288 -261 -237 -228 -229 -227 -222 -226 -254 -297 -325 -314 -271 -230 -215 -221 -230 -238 -250 -257 -240 -195 -154 -146 -172 -207 -229 -235 -235 -240 -255
11557b55j7mJ2Rrk4k0nPJ2J7J7Jk3m3m3j6J8L9M0L0K5J9Lk0l1k1pJ%KRK0L0L2K0nk5k5j5j0
$$ -255 -272 -276 -264 -255 -264 -288 -308 -313 -306 -294 -277 -260 -259 -282 -325 -368 -384 -366 -327 -287 -257 -232 -213 -210 -230 -261 -282 -289 -288 -288 -286 -277 -257 -227 -195 -175 -180 -205 -230 -245 -255
11540b55qLK0L0K0lj9j4%PJokO%k0l2k3oLLJJNJ5L1L5K6J1Kmj5k0j7j5k9m0k9%J8J8J5K1K4
$$ -255 -263 -260 -240 -210 -190 -193 -212 -226 -226 -219 -218 -224 -226 -220 -220 -240 -272 -295 -301 -298 -295 -294 -293 -288 -273 -242 -207 -181 -170 -168 -172 -187 -207 -224 -239 -268 -308 -337 -337 -319 -301 -286 -265 -241
11521b41J1j3k9l0j7LJ7J3joPK2K6K0J5Mj2j7jK2K7Qj4j8mJ3K5K6J2j3l3m1l6k2mJ5L2M0L7
$$ -241 -230 -243 -272 -302 -319 -316 -299 -286 -287 -293 -286 -264 -238 -218 -203 -199 -211 -228 -229 -207 -180 -172 -186 -204 -208 -195 -170 -144 -132 -145 -178 -219 -255 -277 -281 -266 -234 -194 -157
11504a57K0jj8k7l0l1k5pRJ2QJ0K5L3K0%j3j6j3nRJ9J3KOK4L4K8J9J2ql9n3l2mlj9k0%J2O
$$ -157 -137 -138 -156 -183 -213 -244 -269 -276 -267 -255 -247 -237 -212 -179 -159 -159 -172 -188 -201 -206 -197 -178 -165 -163 -157 -133 -99 -71 -52 -40 -48 -87 -140 -172 -176 -179 -198 -218 -218 -206 -200
11486b00kmqj9k6j4QK3K6J2k0m6l8pJ4J1J0K7M0L2J1%pk1l5k8rRJ5J9J9K0K8L6K4j1l1j6Q
$$ -200 -202 -206 -214 -233 -259 -273 -265 -242 -216 -204 -224 -270 -308 -315 -301 -290 -280 -253 -213 -181 -170 -170 -177 -198 -233 -261 -270 -261 -246 -227 -208 -188 -160 -124 -100 -111 -142 -158 -150
11469a50Qo%J9K2J2J1J8Oj8j9LK2K8K9K2kk4j8OQnJ0M6N5K7J8L2K9QK8R3J34J33J73K78L70
$$ -150 -142 -148 -148 -129 -107 -95 -84 -66 -60 -78 -97 -94 -72 -44 -15 7 5 -19 -37 -31 -23 -28 -18 28 83 110 128 160 189 197 225 318 452 585 758 1036 1406
11453A406M53O87J066J205P05k70j059j210q96n68m10l16k16j64j71j51p4j3j0k2oJ2Lj2j4
$$ 1406 1859 2546 3612 4817 5522 5252 4193 2983 2087 1519 1109 793 577 413 242 91 17 4 -6 -28 -34 -22 -19 -31 -45
11442d5k1m2n6l8pJ1J2Kj6l4k7JK4K5J7J0kj5rJ4L1J8j1l0k8j2J1K3J7KnKPK%Jok1k3oPmk3
$$ -45 -66 -108 -164 -202 -209 -198 -186 -184 -200 -234 -261 -260 -236 -211 -194 -184 -186 -201 -210 -196 -165 -147 -158 -188 -216 -228 -217 -194 -177 -175 -180 -178 -171 -169 -169 -168 -174 -195 -218 -224 -217 -221 -244
11423b44k7j1NJ7K7L1K2Nqj1qjQJ0kj9k5k4j8rRK2J8Mml%QK0K7J4j0k0j5j2j4j0PJ7J4QJ1
$$ -244 -271 -282 -277 -260 -233 -202 -180 -175 -183 -194 -202 -203 -195 -185 -187 -206 -231 -255 -273 -282 -273 -251 -233 -229 -233 -236 -236 -228 -208 -181 -167 -177 -197 -212 -224 -238 -248 -241 -224 -210 -202 -191
11405a91J4Oj1k6l5m0l8l0k3j4%K3M1L9J8lqNK3K8J3pj2j0j2k4l1k5j8k1j6LK5L2L2L9N0M6
$$ -191 -177 -171 -182 -208 -243 -283 -321 -351 -374 -388 -388 -365 -324 -285 -267 -270 -278 -273 -250 -222 -209 -216 -228 -238 -250 -274 -305 -330 -348 -369 -385 -382 -357 -325 -293 -254 -204 -158
11389a58K2jj2j6j9j6lJ0J4J7K1K3J9J3Qmk2l2k3j6j7j8oQOJJ6M0L6Jk5j7mj5l9l9j2J0Rp
$$ -158 -136 -137 -149 -165 -184 -200 -203 -193 -179 -162 -141 -118 -99 -86 -78 -82 -104 -136 -159 -175 -192 -210 -216 -208 -202 -201 -185 -145 -109 -108 -133 -150 -154 -169 -208 -247 -259 -249 -240 -247
11371b47k6m6n3l0J6N2N1K5Jj2j4qLMj0k5k3nOOQK6M5M3K0lj2pqj6j7%K4K8Mk6l6k7j1JOP
$$ -247 -273 -319 -372 -402 -386 -334 -283 -258 -257 -269 -283 -291 -288 -284 -294 -319 -342 -347 -341 -335 -327 -301 -256 -213 -193 -196 -208 -215 -223 -239 -256 -256 -232 -204 -200 -226 -262 -289 -300 -299 -293 -286
11353b86lj7k6j3J2L6M0K7RjjLKOJ5J8Pqr%jj3k1j5JJ0J6K5L3L2K1Rkqj1pmoqmlj6l4m0l6
$$ -286 -289 -306 -332 -345 -333 -297 -257 -230 -221 -222 -223 -220 -218 -212 -197 -179 -172 -180 -189 -189 -190 -203 -224 -239 -238 -228 -212 -187 -154 -122 -101 -92 -94 -102 -113 -120 -124 -130 -138 -142 -145 -161 -195 -235 -271
11334b71l5l9k5J1L8L1NJK2L0Jk9k3PK2J1QK7L8J9kjJ5J1j3k4j2lj6l2l1j5kKMjj6k6j9JP
$$ -271 -306 -345 -370 -359 -321 -290 -285 -284 -262 -232 -231 -260 -283 -276 -254 -243 -235 -208 -170 -151 -153 -154 -139 -128 -141 -165 -177 -180 -196 -228 -259 -274 -276 -274 -270 -271 -287 -313 -332 -331 -324
11316c24rk5j4J9M1M0K6K2K9L6L3K8K2Qj7l5l2j4mpkJ3J7ql9m5k2NJ7K0K6L3L0J1j4l1l5k7
$$ -324 -333 -358 -372 -353 -312 -272 -246 -224 -195 -159 -126 -98 -76 -68 -85 -120 -152 -166 -170 -177 -179 -166 -149 -157 -196 -241 -263 -258 -241 -221 -195 -162 -132 -121 -135 -166 -201 -228
11300b28j9j6qOK1K3J4KoqJJ1Rrk5j9%J3J1PQQJnrj0j0j0j9m0n7m8j0K5L8K5Qmr%K0L8L5J7
$$ -228 -247 -263 -271 -265 -244 -221 -207 -205 -211 -219 -218 -207 -198 -207 -232 -251 -251 -238 -227 -220 -212 -204 -203 -208 -217 -227 -237 -247 -266 -306 -363 -411 -421 -396 -358 -333 -325 -329 -338 -338 -318 -280 -245 -228
11280b28JlMNpk9l5j7RK1J8J2Nj4l8m1j7QJ1RK1L5L0J7J3J8J1klKj1l9m7k9qqlK1M4L4Jk3
$$ -228 -227 -230 -226 -221 -228 -257 -292 -309 -300 -279 -261 -249 -244 -258 -296 -337 -354 -346 -335 -326 -305 -270 -240 -223 -210 -192 -181 -183 -186 -184 -195 -234 -281 -310 -318 -326 -329 -308 -264 -230 -229 -252
11262b52k5j7oJ4L2L0Nj6k1k0k7k6kL4M8K8lj8j6rkQJ5J0koOK4L4K9J7LkKQLj1j5lOrl5m3
$$ -252 -277 -294 -300 -286 -254 -224 -219 -235 -256 -276 -303 -329 -331 -297 -249 -221 -224 -242 -258 -267 -269 -261 -246 -236 -238 -244 -238 -214 -180 -151 -134 -131 -133 -131 -123 -120 -131 -146 -149 -143 -152 -187 -230
11244b30k7mNM%%KJ0J6J2Lpj2j5rRK6K1lj9j5jOPN%o%J2J2oj5ML0K2j6m6m0j0J3J3nk6l4k3
$$ -230 -257 -261 -256 -252 -252 -252 -250 -240 -224 -212 -209 -216 -228 -243 -252 -243 -217 -196 -199 -218 -233 -234 -228 -221 -216 -216 -222 -222 -210 -198 -204 -219 -215 -185 -163 -179 -225 -265 -275 -262 -249 -254 -280 -314 -337
11224c37jJ7K3J5mk5l2j5MJ0%kMOLLRJ4J1J1J9J7jk8m2l8k3mRRJkPK1K8L3L6L5K2%j9l1k6
$$ -337 -338 -321 -298 -283 -287 -312 -344 -359 -355 -345 -345 -347 -343 -337 -334 -331 -322 -308 -297 -286 -267 -250 -251 -279 -321 -359 -382 -386 -377 -368 -367 -369 -362 -341 -313 -280 -244 -209 -187 -187 -206 -237 -263
11205b63lK5M0L2K1J9J6ok9l5j8m%KLnk2l3k4nJ0J3Onj3j6j2pjNKrk1j8%J9L1L3K4Kj8j7P
$$ -263 -266 -241 -201 -169 -148 -129 -113 -119 -148 -183 -201 -205 -205 -203 -200 -205 -227 -260 -284 -289 -279 -266 -260 -265 -278 -294 -306 -313 -314 -309 -307 -316 -337 -355 -355 -336 -305 -272 -248 -246 -264 -281 -274
11187b74K3J8MMJ2J2Mkrk7m4l5JL4L7J9Jj0j7j4nlj4k4j8nj1l3n3m3j4K0M3N7O1N3M1K8K0
$$ -274 -251 -233 -229 -225 -213 -201 -197 -199 -208 -235 -279 -314 -313 -279 -242 -223 -222 -232 -249 -263 -268 -271 -285 -309 -327 -332 -343 -376 -429 -472 -486 -466 -423 -366 -305 -252 -211 -183 -163
11170a63K1K1J4ql0m0l4k9k8j9LK2K3J6J9L0K8Qj5l0l8l8k3NL2M5M5L8J8pk6k7j7j0mKNNO
$$ -163 -142 -121 -107 -115 -145 -185 -219 -248 -276 -295 -292 -270 -247 -231 -212 -182 -154 -146 -161 -191 -229 -267 -290 -285 -253 -208 -163 -125 -107 -114 -140 -167 -184 -194 -198 -196 -191 -186 -180
11153a80J0J2kk3l4k1KJ5J0jKJ7K7J4qk3k4k0j0J2L9M8K7%oJ0J7Mj7l1m3n6n7l6%L2M6L8J3
$$ -180 -170 -158 -160 -183 -217 -238 -236 -221 -211 -212 -210 -193 -166 -152 -160 -183 -207 -227 -237 -225 -186 -138 -111 -111 -117 -107 -90 -86 -103 -134 -177 -233 -290 -326 -326 -294 -248 -210 -197
11136a97k1m8n2k9NK4K0PPJ6K2K3K5L2K6Lj8k0qmmKJ0Qmj3j6k3k9j5J7L6K7J5K1K3Jl0l7k1
$$ -197 -218 -266 -318 -347 -342 -318 -298 -291 -284 -268 -246 -223 -198 -166 -140 -137 -155 -175 -183 -187 -191 -189 -179 -171 -175 -188 -204 -227 -256 -271 -254 -218 -191 -176 -155 -132 -131 -161 -198 -219
11119b19j5k6k7%L2L7J9OMJj1j7j2oj5l3l9k2PK8L2K8K3Qj6l1j9J6M4M3K4Lj6k7k2KK4K4J0
$$ -219 -234 -260 -287 -287 -255 -218 -199 -193 -189 -188 -199 -216 -228 -234 -249 -282 -321 -343 -336 -308 -276 -248 -225 -217 -233 -264 -283 -267 -223 -180 -156 -153 -169 -196 -218 -216 -192 -168 -158
11102a58JPJ2Onk1m3o3n8k6J0K5K2K1L1L6L0K1K2K5K0Kj2j6j6k0k6k8k0j2rqnlJLQQMkLJ1
$$ -158 -157 -150 -138 -132 -137 -158 -201 -264 -322 -348 -338 -313 -291 -270 -239 -203 -173 -152 -130 -105 -85 -83 -95 -111 -127 -147 -173 -201 -221 -233 -242 -250 -255 -258 -257 -254 -246 -238 -234 -236 -233 -222
11084b22Pj0k6k4j2qroNJ2ROJ0J3RKLJ2J9K0J4PKmj6l3m1k7%J2MmKNmj7j0J0J3OJ0L0L7J6
$$ -222 -215 -225 -251 -275 -287 -295 -304 -310 -305 -293 -284 -278 -268 -255 -246 -244 -241 -229 -210 -190 -176 -169 -167 -171 -187 -220 -261 -288 -288 -276 -272 -276 -274 -269 -273 -290 -300 -290 -277 -271 -261 -231 -194 -178
11065a78j1j7qKJ1K2L0K1QMQlk3l4k9j9j4rmprlPNonJ6L3K2lj9k0j5j5j5j2oPK3L1K9K4K1
$$ -178 -189 -206 -214 -212 -201 -179 -149 -128 -120 -116 -108 -111 -134 -168 -197 -216 -230 -239 -243 -250 -259 -262 -255 -250 -256 -261 -245 -212 -190 -193 -212 -232 -247 -262 -277 -289 -295 -288 -265 -234 -205 -181 -160
11046a60J4mk1k2j1nj0j7j2%J6L1L0J4nmJ1J5Jj1nPJ1QRJ6J8J7J9J7%k9m5m1k7k4l0k9j8j
$$ -160 -146 -150 -171 -193 -204 -209 -219 -236 -248 -248 -232 -201 -171 -157 -162 -166 -155 -140 -139 -150 -155 -148 -137 -129 -120 -104 -86 -69 -50 -33 -33 -62 -107 -148 -175 -199 -229 -258 -276 -277
11029b77OLloJJ5K6K7J4ok1k3qQJ5J5K0K8K8J7PMJqk1k7j6kMqk3k6rRJ1QJ3K4J9nj8rO%k0
$$ -277 -271 -268 -271 -277 -276 -261 -235 -208 -194 -200 -221 -244 -252 -244 -229 -214 -194 -166 -138 -121 -114 -110 -109 -117 -138 -165 -181 -183 -179 -187 -210 -236 -245 -236 -225 -217 -204 -180 -161 -166 -184 -193 -187 -187 -207
11009b07k8j7mJjmqj0nMQJ1K2L7M5L4J2qk0k0j1qj9l2k9rOPKQJ5J5J7K6K9J9QJ0J8J2rk5k4
$$ -207 -235 -252 -256 -255 -256 -260 -268 -278 -283 -279 -271 -260 -238 -201 -156 -122 -110 -118 -138 -158 -169 -177 -196 -228 -257 -266 -260 -253 -251 -243 -228 -213 -196 -170 -141 -122 -114 -104 -86 -74 -83 -108 -132
10990a32j2k%qk0k7k0pjjJM%on%oj9j6MJ7Rmpkqj1lJ6K5J6jj8k6j9lMkkJ2K5J6pj6pjlPK9
$$ -132 -144 -146 -146 -154 -174 -201 -221 -228 -229 -230 -229 -225 -225 -231 -236 -236 -242 -261 -277 -273 -256 -247 -251 -258 -260 -268 -279 -282 -266 -241 -225 -226 -244 -270 -289 -292 -288 -290 -292 -280 -255 -239 -246 -262 -269 -270 -273 -266 -237
10969b37L8K9K4L8M3J5k3l9l1k6l4k8jJ8J0j2j6lMjrrj6l7n7n1k4NJ7J4J0QRQPJ0J8K5K9J9
$$ -237 -199 -170 -146 -108 -65 -50 -73 -112 -143 -169 -203 -231 -232 -214 -204 -216 -232 -235 -231 -232 -241 -250 -266 -303 -360 -411 -435 -430 -413 -399 -389 -381 -372 -364 -357 -347 -329 -304 -275 -256
10952b56nl0l8k3OL0M0L6J9ql2l9k1PK2J5nk0j9qOJ7K6M0M9M2J9JlJpk4k6jL2L5Nk4k8j3m
$$ -256 -261 -291 -329 -352 -346 -316 -276 -240 -221 -229 -261 -300 -321 -314 -292 -277 -282 -302 -321 -329 -323 -306 -280 -240 -191 -149 -130 -129 -132 -131 -138 -162 -188 -189 -157 -122 -117 -141 -169 -182 -186
10934a86nlJ0J8J1nrnqk2l1k3mJ2J5Qlj0j0%Q%j9k7j0J8K9J3j5l2k5mJ3K2J8Mj0j2%J7J9J2
$$ -186 -191 -194 -184 -166 -155 -160 -169 -174 -182 -204 -235 -258 -262 -250 -235 -227 -230 -240 -250 -250 -242 -242 -261 -288 -298 -280 -251 -238 -253 -285 -310 -314 -301 -279 -261 -257 -267 -279 -279 -262 -243 -231
10916b31L%oj3j4%J0QKOJ3Jk5l5j4RJ1KPK3K3NqKJ6J0j4k8j9jJ1J1PNPNrk6l4k8qJ3L2M1L5
$$ -231 -228 -228 -234 -247 -261 -261 -251 -243 -241 -235 -222 -221 -246 -281 -295 -286 -275 -273 -266 -243 -220 -215 -223 -221 -205 -195 -209 -237 -256 -257 -246 -235 -228 -223 -216 -211 -220 -246 -280 -308 -316 -303 -271 -230 -195
10896a95J7lj8k4j6PL3L9J8j0j5nlj2k0j0MNj2k9l2j7%J1J2J4K2K4J1qj7j5j4j3lJ1J1oj6
$$ -195 -178 -181 -199 -223 -239 -232 -199 -160 -142 -152 -167 -172 -175 -187 -207 -217 -213 -208 -220 -249 -281 -298 -298 -287 -275 -261 -239 -215 -204 -212 -229 -244 -258 -271 -274 -263 -252 -258 -274
10879b74kK3L2K2J7K5L2K7J7J2J4J2Loj3k2l6m7m6l3k0j7k2k2j2LJ6L2M3M3K4%j7k3k2j5n
$$ -274 -276 -253 -221 -199 -182 -157 -125 -98 -81 -69 -55 -43 -40 -46 -59 -81 -117 -164 -210 -243 -263 -280 -302 -324 -336 -333 -317 -285 -242 -199 -175 -175 -192 -215 -237 -252 -257
10863b57NPLKNPMJkqj7k1j2KJ0Mk%Jmj1qNJ3PKJ1K9L0Rj6k2j1nj1k4l1j7QL1L6K3PJ%mj0r
$$ -257 -252 -245 -242 -240 -235 -228 -224 -223 -225 -233 -250 -271 -283 -281 -271 -267 -269 -269 -268 -272 -283 -291 -286 -273 -266 -264 -253 -224 -194 -185 -201 -223 -234 -239 -250 -274 -305 -322 -314 -283 -247 -224 -217 -216 -216 -220 -230 -239
10843b39MJ6J4JpmPQlj1j0kMKnj5l0l7k2J5L9L6K1J5J8J3JLJ5J0j5k9j1J5J9PMJ0Roj0%Or
$$ -239 -235 -219 -205 -204 -211 -215 -208 -200 -203 -214 -224 -226 -222 -220 -225 -240 -270 -307 -329 -314 -275 -239 -218 -203 -185 -172 -171 -168 -153 -143 -158 -187 -198 -183 -164 -157 -153 -143 -134 -140 -150 -150 -144 -153
10824a53k3j6MQoj9j1LLj7l5l1%L2M0K5Lqo%PNql2m9m6k1J1L8N4M9J9j6k8rJ6K5K2K7L4L0
$$ -153 -176 -192 -188 -180 -186 -205 -216 -213 -210 -227 -262 -293 -293 -261 -221 -196 -193 -201 -207 -207 -200 -195 -203 -235 -284 -330 -351 -340 -302 -248 -199 -180 -196 -224 -233 -217 -192 -170 -143 -109 -79
10806g9Qj7l0l1k5j4kMPJ7L0L1J6MJnk6m2k8OK8K8J7J2Oj1l0m0m1l6k0OK4K1Kj5j8j1okKR
$$ -79 -71 -88 -118 -149 -174 -188 -190 -186 -179 -162 -132 -101 -85 -81 -80 -85 -111 -153 -181 -175 -147 -119 -102 -90 -84 -95 -125 -165 -206 -242 -262 -256 -232 -211 -209 -224 -242 -253 -259 -261 -259 -250
10788b50Qrl3m6l4j0OJ1J8K8K8J7J5K9L5J5k0l2j1K1M7N7N0K7%j5j2onnoj3k3j8NK3J0k3n0
$$ -250 -242 -251 -284 -330 -364 -374 -368 -357 -339 -311 -283 -266 -251 -222 -187 -172 -192 -224 -235 -214 -167 -110 -60 -33 -33 -48 -60 -66 -71 -76 -82 -95 -118 -136 -131 -108 -98 -121 -171
10771a71m4j5QOj2j8LK9L2Nk2k9k0rLK0K9K0MKJ5K2RmnQJ3Ooj3j2kPJ2Qpk8m1l3pJ6K3K2K2
$$ -171 -215 -230 -222 -216 -228 -246 -243 -214 -182 -177 -199 -228 -248 -257 -254 -234 -205 -185 -181 -179 -164 -142 -133 -137 -142 -134 -121 -115 -121 -134 -146 -148 -141 -129 -121 -128 -156 -197 -230 -237 -221 -198 -176 -154
10752a54K1Oj5k4j7rmJ0K5K5%k3k1kOoj8k5l2l6k8j0PJ3J8K5K8J7kj9k4j8nMQQJ0J0RONOk
$$ -154 -133 -127 -142 -166 -183 -192 -196 -186 -161 -136 -136 -159 -180 -182 -176 -182 -200 -225 -257 -293 -321 -331 -324 -311 -293 -268 -240 -223 -225 -244 -268 -286 -291 -287 -279 -271 -261 -251 -242 -236 -231 -225 -227
10733b27j5j2J0L4L4J6nj7k9m0l7qK8M3K3j2l3k6j0jlmJOJ1J3J4Mj3j9j1mj0k6l1j8jJ3J9
$$ -227 -242 -254 -244 -210 -176 -160 -165 -182 -211 -251 -288 -296 -268 -225 -202 -214 -247 -273 -283 -284 -287 -291 -290 -284 -273 -260 -246 -242 -255 -274 -285 -289 -299 -325 -356 -374 -375 -362 -343
10716c43J5OkmJMRJ5K1J8J7J8J8J2LJ0K8L9L1J3jj3k2k5j9j7k2k5j2NOj0k8k7nK9N0M2Nk7
$$ -343 -328 -322 -324 -328 -327 -323 -314 -299 -278 -260 -243 -225 -207 -195 -192 -182 -154 -115 -84 -71 -72 -85 -107 -132 -151 -168 -190 -215 -227 -222 -216 -226 -254 -281 -286 -257 -207 -165 -160 -187
10699a87k8nR%j6k0j1jPJ5J7Kk1l5k6lJ4J3ok2j7J2M5O4N7L3QplJ1J6Jk9m6l2pQlk1k8k3j5
$$ -187 -215 -220 -211 -211 -227 -247 -258 -259 -252 -237 -220 -218 -239 -274 -300 -303 -289 -276 -282 -304 -321 -309 -264 -200 -143 -110 -102 -109 -112 -101 -85 -84 -113 -159 -191 -198 -190 -193 -214 -242 -265 -280
10680b80oOJ2Nrj4mPJ0J3K9M3L8J3j0j6j1kQK5L9L7J6j2l1l7l0k2k2k5j7m%j5l0k7j5j3k5
$$ -280 -286 -280 -268 -263 -272 -286 -290 -283 -273 -260 -231 -188 -150 -137 -147 -163 -174 -176 -168 -143 -104 -67 -51 -63 -94 -131 -161 -183 -205 -230 -247 -251 -251 -266 -296 -323 -338 -351 -376
10664c76l3k6j1JJ0J8J8R%JLkmJ5L7M1J8kNK4L1K0Npj6k0j2kMORJ4J1MKQJ0Mj%%rk0j8lQR
$$ -376 -409 -435 -446 -445 -435 -417 -399 -390 -390 -389 -386 -388 -392 -377 -340 -299 -281 -283 -278 -254 -223 -203 -198 -205 -221 -241 -253 -255 -251 -245 -236 -222 -211 -207 -205 -197 -187 -183 -184 -184 -184 -193 -213 -231 -234 -226 -217
10643b17kj3j5mJ2K1K0J7J4Nj3k5j6MRJmKO%KJ8K6Pk5m1k7kJ3J8J7J2Lj0j9k8m0m7m2k5rl
$$ -217 -219 -232 -247 -251 -239 -218 -198 -181 -167 -162 -175 -200 -216 -212 -203 -202 -206 -204 -198 -198 -196 -178 -152 -145 -170 -211 -238 -240 -227 -209 -192 -180 -177 -187 -206 -234 -274 -321 -363 -388 -397 -400
10625d00KJ4K8K9J5MJlj4j4J0L8L9J7KJ5L7L6J8kj3k8m0l8k0m%l%QJ6K8L7L4J8jqopj3k0j3
$$ -400 -398 -384 -356 -327 -312 -308 -307 -310 -324 -338 -328 -290 -251 -234 -232 -217 -180 -144 -126 -128 -141 -169 -209 -247 -267 -271 -271 -274 -274 -266 -250 -222 -185 -151 -133 -134 -142 -148 -155 -168 -188 -201
10607b01JJ0J0PON%m%RPok3k6rJ9N0O4N0J2k7m3m3l8l5k2nRJ6K1K6K2J0pk2l6m6m1k0OJ8K0
$$ -201 -200 -190 -180 -173 -167 -162 -162 -166 -166 -157 -150 -156 -179 -205 -214 -195 -145 -81 -31 -19 -46 -89 -132 -170 -205 -227 -232 -223 -207 -186 -160 -138 -128 -135 -157 -193 -239 -280 -300 -294 -276 -256
10589b56K5L0K2ol4m0k1LJ4J0kj4k0j8mRRoj8j7oRK6M5N5M2J1k1l4k4pPJ0LlkQJ6K6L3L1R
$$ -256 -231 -201 -179 -185 -219 -259 -280 -277 -263 -253 -255 -269 -289 -307 -311 -302 -293 -299 -317 -334 -340 -331 -305 -260 -205 -163 -152 -173 -207 -231 -238 -231 -221 -218 -221 -223 -215 -199 -173 -140 -109 -100
10570a00k0k5jK7L2J5lj3k4l5l5j9MJ8J5Q%%MQJ3J5Rrl3m5m3l4k8j8KK0J7%rNK2J4qj3J1L9
$$ -100 -120 -145 -146 -119 -87 -72 -75 -88 -112 -147 -182 -201 -197 -179 -164 -156 -156 -156 -152 -144 -131 -116 -107 -116 -149 -194 -237 -271 -299 -317 -315 -295 -278 -278 -287 -282 -260 -246 -254 -267 -256 -217
10552b17M1J6lnJpk4k7rJ7L1K4Nj6k5k0lRJ0Njrj8k3k2j8j9k0rRK4K1Nj4k7k7j3RK2K4K2K4
$$ -217 -176 -160 -163 -168 -167 -174 -198 -225 -234 -217 -186 -162 -157 -173 -198 -218 -221 -212 -202 -197 -198 -207 -225 -248 -270 -288 -307 -327 -336 -327 -303 -282 -277 -291 -318 -345 -358 -349 -327 -303 -281 -257
10534b57K4J9J6J9K7L1L4L7L3Ql3o3n8l6j6qMK0L0K3Pnj0j1jJ3K3J0j5k9k1mkj5k6k2oOOl
$$ -257 -233 -214 -198 -179 -152 -121 -87 -50 -17 -9 -42 -105 -163 -199 -215 -223 -219 -199 -169 -146 -139 -144 -154 -165 -166 -153 -130 -120 -135 -164 -185 -189 -191 -206 -232 -254 -260 -254 -248 -251
10517b51j5k3k0mJ1J0qk4j3J3L5L1J2j0k6l3k4mJ6K6L0L1L0J8PKNONPJ0J3J1Pkk2m2n0m6l7
$$ -251 -266 -289 -309 -313 -302 -292 -300 -324 -337 -324 -289 -258 -246 -256 -282 -315 -339 -343 -327 -301 -271 -240 -210 -192 -185 -183 -178 -172 -167 -160 -150 -137 -126 -119 -121 -143 -185 -235 -281 -318
10499c18k1ML3M9M3J5k1m7m7k3kLNK7M8L6%j4QL2K6P%%rj8j2mj0j8pJ7K3J0JQJ1N%J%mMJ9
$$ -318 -339 -335 -302 -253 -210 -195 -216 -263 -310 -333 -335 -332 -327 -300 -252 -216 -216 -230 -222 -190 -164 -157 -157 -157 -166 -184 -196 -200 -210 -228 -235 -218 -195 -185 -184 -176 -165 -160 -160 -159 -159 -163 -159 -140
10480a40K5J2qk0k5k1j3lmj0kJ5J9PMK2M2M4K6Mk4n5o8n8l8k5j1J1K9J8pj4KK2L2L2K4Oj8
$$ -140 -115 -103 -111 -131 -156 -177 -190 -193 -197 -207 -209 -194 -175 -168 -164 -142 -100 -56 -30 -26 -50 -105 -173 -231 -269 -294 -305 -294 -265 -247 -254 -268 -266 -244 -212 -180 -156 -150 -168
10463a68k7j6JQPLpj9k2j1NJ7K6L2L4K9J9Opj7j8oJ4L2L4J3j9m5m8l6k8k8k5j1QK2K8K7J7
$$ -168 -195 -211 -210 -202 -195 -192 -199 -218 -240 -251 -246 -229 -203 -171 -137 -108 -89 -83 -90 -107 -125 -131 -117 -85 -51 -38 -57 -102 -150 -186 -214 -242 -267 -278 -270 -248 -220 -193 -176
10446a76lk2k6j1QPj7m9n8l6kK6M1M3L2J3jlmrrPL0L5K2J3J6K5K0Lk4n2o9o2l3lP%pmNJ1J1
$$ -176 -179 -201 -227 -238 -230 -223 -240 -289 -347 -383 -385 -359 -318 -275 -243 -230 -231 -234 -238 -247 -256 -249 -219 -184 -162 -149 -133 -108 -88 -85 -109 -161 -230 -292 -325 -328 -321 -321 -328 -332 -327 -316 -305
10428c05Npk5k9qL6P0O2K6JQK1J3pj8k0k4k9k2qj1k5k2QL8L9J6mj2j4qOK4L8M6M8L8J5j2l1
$$ -305 -300 -307 -332 -361 -369 -333 -263 -201 -175 -174 -166 -145 -132 -139 -157 -177 -201 -230 -252 -260 -271 -296 -318 -310 -272 -233 -217 -221 -233 -247 -255 -249 -225 -187 -141 -93 -55 -40 -52 -83
10410h3m5n1m0j9nrj7rJ4K5J6Knllqj2j2ompj8k1rLjk2l1j2K2M4M4L0K0K0K1J0j4k9k2MK6
$$ -83 -128 -179 -219 -238 -243 -252 -269 -278 -264 -239 -223 -221 -226 -229 -232 -240 -252 -264 -270 -274 -281 -299 -320 -329 -326 -327 -349 -380 -392 -370 -326 -282 -252 -232 -212 -191 -181 -195 -224 -246 -242 -216
10392b16L1K5K1J7J3Lqj5j4qlj1l3n3m8j7J9L3K0QJ4K9L4K2%k2l7l8k2n%qoORj0k5j8LNj3
$$ -216 -185 -160 -139 -122 -109 -106 -114 -129 -143 -151 -154 -165 -198 -251 -299 -316 -297 -264 -244 -236 -222 -193 -159 -137 -137 -159 -196 -234 -256 -261 -261 -269 -275 -269 -260 -270 -295 -313 -310 -305 -318
10374c18k6k0lJ6K8L1K0%j1nPJ7K4L3L5K1kk7m9n8m4j0K1L0K8L1L9L7J9%nLOmk3l6l5k0lQ
$$ -318 -344 -364 -367 -351 -323 -292 -272 -272 -283 -288 -281 -264 -240 -207 -172 -151 -153 -180 -229 -287 -331 -341 -320 -290 -262 -231 -192 -155 -136 -136 -141 -138 -132 -136 -159 -195 -230 -250 -253 -245
10357b45J3J3Nj4l3l6k1kRJ2J6K7L3K9J4j0l0l6k6j4olNK1L1K6J3OPNjkQJ7J3kj4j5j4j5k0
$$ -245 -232 -219 -214 -228 -261 -297 -318 -320 -311 -299 -283 -256 -223 -194 -180 -190 -220 -256 -282 -296 -302 -305 -300 -279 -248 -222 -209 -203 -196 -191 -192 -194 -186 -169 -156 -158 -172 -187 -201 -216 -236
10339b36k3j5jRQOJ0J0nl2m7l5j2OJ4J6Nj4j8J0N5P7O4M3L0K0RMQJk3m4m6l7l1l0j9j1j8l4
$$ -236 -259 -274 -275 -266 -258 -252 -242 -232 -237 -269 -316 -351 -363 -357 -343 -327 -322 -336 -354 -344 -289 -212 -148 -105 -75 -55 -46 -42 -34 -33 -56 -100 -146 -183 -214 -244 -263 -274 -292 -326
10322c26l3j4OJ3K2L4M5M8M4L4J4j5l3l2k7k9l4k5oJ2J6Qmj1rmknkJ3K8L4K1LrmPJ3NpqOJ8
$$ -326 -359 -373 -367 -354 -332 -298 -253 -205 -161 -127 -113 -128 -161 -193 -220 -249 -283 -308 -314 -302 -286 -278 -282 -293 -302 -306 -308 -313 -315 -302 -274 -240 -219 -216 -225 -229 -222 -209 -204 -211 -219 -213 -195
10303a95J3qk5k6rQJ3OkkRK0K6K8K9L0K2%l0n3m8j6J4J9mk6k8j9k1k8k5oJ2J2LkOJ7K0J3%
$$ -195 -182 -190 -215 -241 -250 -242 -229 -223 -225 -227 -218 -198 -172 -144 -115 -85 -63 -63 -93 -146 -194 -210 -196 -177 -181 -207 -235 -254 -275 -303 -328 -334 -322 -310 -307 -309 -303 -286 -266 -253 -253
10286b53j2j8j8j4j0pmJJ0K1K3J3%jJ2K1J3oj1LK1K8K3Qj0k1j9qJKjloj2j9k1j7pJ0K8L9L6
$$ -253 -265 -283 -301 -315 -325 -332 -336 -335 -325 -304 -281 -268 -268 -269 -257 -236 -223 -229 -240 -237 -216 -188 -165 -157 -167 -188 -207 -215 -214 -212 -213 -216 -222 -234 -253 -274 -291 -298 -288 -260 -221 -185
10267a85L1K5J3j0k4j8lok0k3lJ6J6RJ2K3K7J8jk3m3m8k8jJ0%j5k2k5k5j4RL5M7L5J1nmJ0
$$ -185 -154 -129 -116 -126 -150 -168 -171 -177 -197 -220 -223 -207 -191 -182 -170 -147 -120 -102 -103 -126 -169 -217 -245 -246 -236 -236 -251 -273 -298 -323 -337 -328 -293 -246 -211 -200 -205 -209 -199
10250a99J5Mrj4j4j9j9JK5K3jj4%K0J7Jqj1k1l2k8j5pj0qknk4l7k7JJ9K2K3L1L5K4OkQK4K9
$$ -199 -184 -180 -189 -203 -217 -236 -255 -254 -229 -206 -207 -221 -221 -201 -184 -183 -191 -202 -223 -255 -283 -298 -305 -315 -323 -325 -330 -354 -391 -418 -417 -398 -376 -353 -322 -287 -263 -257 -259 -251 -227 -198
10232a98K7K6J9%k2k7j3jrk6l4k4j3kOJ1QOJ3K2J2pj6pL%pqoqpPK1J9%j4j7j5j3%K3L8K7N
$$ -198 -171 -145 -126 -126 -148 -175 -188 -189 -198 -224 -258 -282 -295 -297 -291 -280 -272 -266 -253 -231 -219 -226 -242 -249 -246 -246 -253 -261 -267 -275 -282 -275 -254 -235 -235 -249 -266 -281 -294 -294 -271 -233 -206 -201
10213b01rj0mjNJ0Qok2k2mJ6J8Lj1oJ4K9K3RLJ2J7J3M%Klk0l9m3k5MK8L2J6qk9l2j6LJ0Jj2
$$ -201 -210 -220 -224 -225 -220 -210 -202 -208 -230 -252 -256 -240 -222 -219 -230 -236 -222 -193 -170 -161 -158 -146 -129 -116 -112 -112 -110 -113 -133 -172 -215 -240 -236 -208 -176 -160 -168 -197 -229 -245 -242 -232 -231 -243
10194b43j6rjOJ3J8J6PklKJ1J6J8J4PKkj1k6l1k2n%oqJR%j5k3j8qjNJ3J4J3J4K3K7J3rj6l
$$ -243 -259 -268 -269 -263 -250 -232 -216 -209 -211 -214 -212 -201 -185 -167 -153 -146 -144 -146 -157 -183 -214 -236 -241 -241 -247 -255 -254 -245 -245 -260 -283 -301 -309 -310 -305 -292 -278 -265 -251 -228 -201 -188 -197 -213 -216
10175b16J4K4K4K8L1K3Mj5k2j5KJ8K4J5jrj4k5m6n4m0j8qp%J6J6pl6m0j5K0M3M2K4LokMNk
$$ -216 -202 -178 -154 -126 -95 -72 -68 -83 -105 -120 -118 -100 -76 -61 -62 -71 -85 -110 -156 -210 -250 -268 -276 -283 -283 -267 -251 -258 -294 -334 -349 -329 -286 -244 -220 -217 -223 -225 -221 -216 -218
10157b18rj6j3kJ2J8K0K7M2M9L9J7lj6k5k1pkj6l8l5j2Lpk2k3j4j4j9j5KJ8K4L0L7L3J2j3
$$ -218 -227 -243 -256 -258 -246 -228 -208 -181 -139 -90 -51 -34 -37 -53 -78 -99 -106 -108 -124 -162 -197 -209 -206 -213 -235 -258 -272 -286 -305 -320 -318 -300 -276 -246 -209 -176 -164 -177
10140a77k3j1J2J8jk9m1j9J4K1nk5j5RJ0pj1RK9K0%lJ4K3J0oj1rmLJ3J5Mj2j8j5rmlpj4j3
$$ -177 -200 -211 -199 -181 -182 -211 -252 -271 -257 -236 -241 -266 -281 -272 -262 -269 -280 -271 -242 -222 -222 -225 -211 -188 -178 -184 -195 -204 -208 -205 -192 -177 -173 -185 -203 -218 -227 -231 -234 -241 -255 -268
10122b68jJ5K3K1J7J4J1J3J6J9J8J4Lj5l3l4j2J4K6K5K3J4j2m3m8k6oj2l1l8k3mM%o%J9M5
$$ -268 -269 -254 -231 -210 -193 -179 -168 -155 -139 -120 -102 -88 -85 -100 -133 -167 -179 -165 -139 -114 -91 -77 -89 -132 -180 -206 -212 -224 -255 -293 -316 -320 -316 -316 -322 -322 -303 -258
10106b58O1N4K5j2m6o3o0m5k1NK9M7N0L5Rj1j3%Qml4n2m3j5RK1L2L7K5jj8j3MJ0RJ2J2Jk1
$$ -258 -197 -143 -118 -130 -176 -239 -299 -344 -365 -360 -331 -284 -234 -199 -190 -201 -214 -214 -206 -210 -244 -296 -339 -354 -345 -324 -292 -255 -230 -231 -249 -262 -258 -248 -239 -227 -215 -214 -235
10089b35l2k3kJ8K7K6J7MmkOJ2J4J0MkjKKpj6rJ7L7L1Kk0k4j6j4rOJ8J2qj6rmj1j7j4j2j9
$$ -235 -267 -290 -292 -274 -247 -221 -204 -200 -204 -206 -200 -188 -174 -164 -160 -162 -163 -161 -159 -166 -182 -191 -174 -137 -106 -104 -124 -148 -164 -178 -187 -181 -163 -151 -159 -175 -184 -188 -199 -216 -230 -242 -261
10070b61k2rJ3K2K3L2M2L6Pk3l1k1j0rj5j8j3ppj1qLRmk1j6J3M0M8M2L2J8jj4j2JQkk4m0l6
$$ -261 -283 -292 -279 -257 -234 -202 -160 -124 -117 -140 -171 -192 -202 -211 -226 -244 -257 -264 -271 -282 -290 -287 -278 -282 -303 -319 -306 -266 -218 -176 -144 -126 -127 -141 -153 -152 -144 -146 -170 -210 -246
10052b46j3J2K3K1J4Q%plOJ0jj6k2j5oljQK3L7M2L8L0J7jk7m6m7l1j5j5j9j2RK7K6Oj4k0j8
$$ -246 -259 -247 -224 -203 -189 -181 -181 -188 -191 -185 -175 -176 -192 -214 -229 -235 -238 -239 -231 -208 -171 -129 -91 -61 -44 -45 -72 -118 -165 -196 -211 -226 -245 -257 -248 -221 -195 -189 -203 -223 -241
10035b41j3q%PRM%K%j0j9j8j4j7k6k9j8oLJ0K3L2K9K0J0Lj0k1k2pJ7L8M8M3K1%rnOJ6K3K3
$$ -241 -254 -262 -262 -255 -246 -242 -242 -240 -240 -250 -269 -287 -301 -318 -344 -373 -391 -397 -394 -384 -361 -329 -300 -280 -270 -267 -277 -298 -320 -327 -310 -272 -224 -181 -160 -160 -169 -174 -168 -152 -129 -106
10016a06J1j4l5l8k5kJ9K9K5J5J1J7K1J2mrKJ2Lj8l1k8j8j3j3j2pmmoj2j5j0JPlj7j9mJ2K0
$$ -106 -95 -109 -144 -182 -207 -209 -190 -161 -136 -121 -110 -93 -72 -60 -64 -73 -71 -59 -56 -74 -105 -133 -151 -164 -177 -189 -196 -200 -204 -210 -222 -237 -247 -246 -239 -242 -259 -278 -282 -270 -250
9999b50J9J6K0L1M3M0J5k3m8m3j8QK3K9K6J3kpnmj2k6m0m8m1k4nKOJ4K7K3J0NJ8L2K0rk6j6
$$ -250 -231 -215 -195 -164 -121 -81 -66 -89 -137 -180 -198 -190 -167 -138 -112 -99 -101 -108 -113 -117 -129 -155 -195 -243 -284 -308 -313 -311 -305 -291 -264 -241 -231 -226 -208 -176 -156 -165 -191 -207
9981b07NJ1lj5pJ1K2K1J7K2L2L4K2lk8m1l8k2ojnj3j7k2k2j1RK8L0K2J7K1K8K5J3pk8m6n1
$$ -207 -202 -191 -194 -209 -216 -205 -183 -162 -145 -123 -91 -57 -35 -38 -66 -107 -145 -167 -173 -174 -179 -192 -209 -231 -253 -264 -255 -227 -197 -175 -158 -137 -109 -84 -71 -78 -106 -152 -203
9964b03l6j1Jj7m6n4l6nK1L3L1J1j4j8PL4L5J7RJ9K4J0j6k6k0j0qj0q%J0J3RJ2K0K8K0Lj0
$$ -203 -239 -250 -249 -266 -312 -366 -402 -407 -386 -353 -322 -311 -325 -343 -336 -302 -267 -250 -241 -222 -198 -188 -204 -230 -250 -260 -268 -278 -286 -286 -276 -263 -254 -242 -222 -194 -174 -171 -181
9947a81j2j3j4j2JK0L5L9K4nl0k4LJ4rl8l6kK2J6jlRJ4P%pj5k7k7rJ5K1Oj3j3JJ8K8L3L0J5
$$ -181 -193 -206 -220 -232 -231 -211 -176 -137 -113 -118 -148 -172 -169 -155 -164 -202 -238 -240 -218 -202 -203 -206 -197 -183 -176 -176 -183 -198 -225 -252 -261 -246 -225 -219 -232 -245 -244 -226 -198 -165 -135 -120
9929a20j3k9j6J2K5J1qrMJ3J3J0R%j7l1l0k2j2pnopjJ8L1K6OqrookJ1K2K0Ooj0j1j0oRK3K8
$$ -120 -133 -162 -178 -166 -141 -130 -138 -147 -143 -130 -117 -107 -98 -98 -115 -146 -176 -198 -210 -217 -222 -228 -235 -236 -218 -187 -161 -155 -163 -172 -178 -184 -186 -175 -153 -133 -127 -133 -143 -154 -164 -170 -161 -138 -110
9910a10J5pk6l2k9j9nK0M1M1J8j0k5k8k1nK2L4J5k4n2m9k6MK2J9lj7mK4K9Oj6j5k%j2j8j1
$$ -110 -95 -102 -128 -160 -189 -208 -213 -193 -152 -111 -93 -103 -128 -156 -177 -182 -160 -126 -111 -135 -187 -236 -262 -258 -236 -217 -220 -237 -241 -217 -188 -182 -198 -213 -215 -215 -227 -245 -256
9893b56kJ%%J4M1O2N0J0k5l3k7k4j9mJ9K8J6rl7n0m4k5j3j5j1J2L4L5J7QK0L7L4J4j5l7l5
$$ -256 -258 -257 -257 -257 -243 -202 -140 -90 -80 -105 -138 -165 -189 -208 -212 -193 -165 -149 -158 -195 -245 -289 -314 -327 -342 -353 -341 -307 -272 -255 -247 -227 -190 -156 -142 -157 -194 -229
9876b29j5PRLOJ8J0j5l0j8kjj0j3j7k9l3j0K5L3J5kPK0J6lk0k6k2oJ7L4K6MpKJ2J4J1J3J2
$$ -229 -244 -237 -228 -225 -219 -201 -191 -206 -236 -254 -256 -257 -267 -280 -297 -326 -359 -369 -344 -311 -296 -298 -291 -271 -255 -258 -278 -304 -326 -332 -315 -281 -255 -251 -258 -256 -244 -230 -219 -206 -194
9859a94KqnJ1J9J8J5K1K7K2Qpk0k7k8k5j8oJ3K5K0Jj2rnj2k5k7k9l6l9k4PK9M1M6M2K4MjL
$$ -194 -192 -200 -205 -194 -175 -157 -142 -121 -94 -72 -64 -71 -91 -118 -146 -171 -189 -195 -182 -157 -137 -136 -148 -157 -162 -174 -199 -226 -255 -291 -330 -354 -347 -318 -277 -231 -189 -165 -161 -162 -159
9841a59nk5k7kJ8J6KmooOK8L5J0k7m6l9k2jJ7K0kk9l1j0RJ0J0J5J8J4QKqj9j5QK9L4L2L4L3
$$ -159 -164 -189 -216 -218 -200 -184 -182 -186 -192 -198 -192 -164 -129 -119 -146 -192 -231 -253 -254 -237 -217 -219 -248 -279 -289 -280 -270 -260 -245 -227 -213 -205 -203 -211 -230 -245 -237 -208 -174 -142 -108 -75
9823g5J7qk2j9nMMoj2qOJ0lj9j8jJ5J8J3PKqk0l1l2k0%K1L0K5Pj5k3j2KLrj7j0JKqj3pPJ4
$$ -75 -58 -66 -88 -107 -112 -108 -104 -110 -122 -130 -124 -114 -117 -136 -154 -155 -140 -122 -109 -102 -100 -108 -128 -159 -191 -211 -211 -190 -160 -135 -128 -143 -166 -178 -176 -173 -182 -199 -209 -208 -206 -214 -227 -234 -227 -213
9803b13J5RMPJ3J7J2Kpqmkrk1l1l2k1roonKJ6L1L9L7K5J4QKoj1nOJ1Olj5k9m0l4j3QQj1l1
$$ -213 -198 -189 -185 -178 -165 -148 -136 -134 -141 -149 -153 -155 -164 -185 -216 -248 -269 -278 -284 -290 -295 -293 -277 -246 -207 -170 -145 -131 -123 -121 -127 -138 -143 -137 -126 -120 -123 -138 -167 -207 -241 -254 -246 -238 -249 -280
9783b80l1j4J1K5K2NnRL7N3M1K3K0L0K7Qqj2j5k8l1j6JJj3j5j0j9l9l2J1N3O0L7J5Mrk4k1
$$ -280 -311 -325 -314 -289 -267 -262 -267 -258 -221 -168 -127 -104 -84 -54 -27 -19 -27 -39 -54 -82 -113 -129 -128 -127 -140 -155 -165 -184 -223 -255 -244 -191 -131 -94 -79 -75 -84 -108 -129
9766a29KK1K1Nj1j8k4k8k8j9pKPJ0J5J7J3%qqjLlj8l5m2k7JK3K5Pj2j8%K7M9N1M0K3Pj0k1
$$ -129 -127 -106 -85 -80 -91 -109 -133 -161 -189 -208 -215 -213 -206 -196 -181 -164 -151 -151 -159 -167 -168 -165 -168 -186 -221 -263 -290 -289 -266 -241 -234 -246 -264 -264 -237 -188 -137 -97 -74 -67 -77 -98
9748i8k3j6j6k3k5rJ2J8QnqkNOjj1qJ0K6K9K0J3Mj6l8m5k9rKkomQK4L3L1J7Kj3j9j4KJ9K1
$$ -98 -121 -137 -153 -176 -201 -210 -198 -180 -172 -177 -185 -187 -182 -176 -177 -188 -196 -186 -160 -131 -111 -98 -94 -110 -148 -193 -222 -231 -229 -231 -237 -241 -233 -209 -176 -145 -128 -126 -139 -158 -172 -170 -151 -130
9729a30Nj6l1k7qJ8K8J7pk5k3pPJ1PKNRJj2j6nLjj1pOJ2NmpmNK1L0K4Nj9l4l9k5jJ8K1J8J6
$$ -130 -125 -141 -172 -199 -207 -189 -161 -144 -151 -176 -199 -206 -199 -188 -181 -179 -174 -165 -164 -176 -192 -197 -194 -195 -206 -213 -207 -195 -190 -194 -201 -205 -200 -179 -149 -125 -120 -139 -173 -212 -237 -238 -220 -199 -181 -165
9709a65Ok6n3m2%L2L4K4J6Nj3j5LJ3KoJ1L0K3jrrj9l4k3J1L1J4j5k8k1qJ0K8L2J9OMQol1n3
$$ -165 -159 -185 -238 -280 -280 -248 -214 -190 -174 -169 -182 -197 -194 -181 -179 -185 -174 -144 -121 -122 -131 -140 -159 -193 -216 -205 -174 -160 -175 -203 -224 -232 -222 -194 -162 -143 -137 -133 -125 -131 -162 -215
9690b15n6m9l4j2J8M9O3M7Rk1k4rK%nmKJ0K0K2J7J0J4K8L8L0J1j1l1m0k6jJ3Jj7k0lJ7L1L2
$$ -215 -271 -320 -354 -366 -348 -299 -236 -189 -180 -201 -225 -234 -232 -232 -237 -241 -239 -229 -209 -187 -170 -160 -146 -118 -80 -50 -39 -50 -81 -121 -147 -148 -135 -134 -151 -171 -174 -157 -126 -94
9673i4J5j0k4j5JKrj5oLPJ2K1K4J2pk7l9m5m2k9j1LJ3K8M6N6M9L2J3mk3l4k5jJ5Nk0l4k7k0
$$ -94 -79 -89 -113 -128 -127 -125 -134 -149 -155 -152 -145 -133 -112 -88 -76 -83 -110 -149 -194 -236 -265 -276 -273 -260 -232 -186 -130 -81 -49 -36 -40 -63 -97 -122 -123 -108 -103 -123 -157 -184 -204
9655b04k3k7j7%RPNJ2J7J9K3L1L8L4J2j8m0m1k9k0j9j7%J8J9KnQK4J6j3l3k8pRJ2J0RMpk0
$$ -204 -227 -254 -271 -271 -262 -255 -250 -238 -221 -202 -179 -148 -110 -76 -64 -82 -122 -163 -192 -212 -231 -248 -248 -230 -211 -209 -214 -206 -182 -166 -179 -212 -240 -247 -238 -226 -216 -207 -203 -210 -230
9638b30k6j9JK5M5M5K1j4l9l4nK2L2K4J4J0Lqj3mJ0J4Olmoj1j8j6nnj4k1j4RL1M1L7J4j8m4
$$ -230 -256 -275 -274 -249 -204 -159 -138 -152 -191 -225 -230 -208 -176 -152 -138 -128 -125 -133 -146 -150 -140 -126 -120 -123 -127 -133 -144 -162 -178 -183 -188 -202 -223 -237 -228 -197 -156 -119 -105 -123 -167
9620a67m5k1NJ6RJLOLKJ2K4J8ok3j8rj1k6l2k4j3mNK0L3L4K4J5J3J6J9J4Lml%mj5j8pLlj8
$$ -167 -212 -233 -228 -212 -203 -202 -199 -193 -190 -188 -176 -152 -134 -140 -163 -181 -190 -201 -227 -259 -283 -296 -300 -295 -275 -242 -208 -184 -169 -156 -140 -121 -107 -104 -108 -111 -111 -115 -130 -148 -155 -152 -155 -173
9601a73k9k7j2RK4K3J1Jmj0j7j1PK0J7MkkopjNNJJ%pj4j3olkLRRJ1K0K3Rj0qJ0J2pj9rlj9
$$ -173 -202 -229 -241 -232 -208 -185 -174 -173 -177 -187 -204 -215 -208 -188 -171 -167 -169 -171 -177 -184 -185 -180 -175 -174 -173 -173 -180 -194 -207 -213 -216 -218 -215 -206 -197 -186 -166 -143 -134 -144 -152 -142 -130 -137 -156 -165 -168 -187
9580a87m6m6j3L0N6N7L7Rj0k0k6l0k3j0rk2k8rK0L2K6K5L0K8J1mjJ3K1J8OjkKjpj0JJ2J2k
$$ -187 -233 -279 -292 -262 -206 -149 -112 -103 -113 -133 -159 -189 -212 -222 -231 -253 -281 -290 -270 -238 -212 -187 -157 -129 -118 -122 -123 -110 -89 -71 -65 -66 -68 -66 -67 -74 -84 -83 -71 -59 -61
9562f1j8k5j9%K7M2L3Qrk0l2m4l9j1J8K8K1J4Npk5l3l0k0rMJ8K6K2J7J7K2J8jk2k8k2k2k5
$$ -61 -79 -104 -123 -123 -96 -54 -21 -13 -22 -42 -74 -118 -157 -168 -150 -122 -101 -87 -82 -89 -114 -147 -177 -197 -206 -202 -184 -158 -136 -119 -102 -80 -62 -63 -85 -113 -135 -157 -182
9545a82j7PK8K6Oqqnj1j1KJ8K0Oj3k0j3mmj3j9j5jPRJ3K2K5J2noJ0K3J6kj0jJ1J0Kmrj9k8
$$ -182 -199 -192 -164 -138 -132 -140 -148 -153 -164 -175 -173 -155 -135 -129 -142 -162 -175 -179 -183 -196 -215 -230 -231 -224 -215 -202 -180 -155 -143 -148 -154 -144 -121 -105 -107 -117 -118 -107 -97 -95 -99 -108 -127 -155
9526a55k3q%lkJ1J2pl1l4k3j9k6k5j3ljMJ8L5M5N2M7K8%j7j7j4rkQJ3QRJ3Jk1k7lK5K4Jj5
$$ -155 -178 -186 -186 -189 -191 -180 -168 -175 -206 -240 -263 -282 -308 -333 -346 -349 -350 -346 -328 -293 -248 -196 -149 -121 -121 -138 -155 -169 -178 -180 -172 -159 -151 -142 -129 -128 -149 -176 -179 -154 -130 -129 -144
9507a44j2qqkJ4K2J4jqo%JkpnLJ4K3K0Oj2k0j0ORpj9j4MJ4Lk0m3m4j6J7K6RlOJ1ok8k2LJ4
$$ -144 -156 -164 -172 -174 -160 -138 -124 -125 -133 -139 -139 -138 -140 -147 -152 -149 -135 -112 -92 -86 -98 -118 -128 -122 -113 -120 -139 -153 -149 -135 -132 -152 -195 -239 -255 -238 -212 -203 -206 -200 -189 -195 -223 -245 -242 -228
9488b28JqKJ4J7J2Lrj4mJ3J6Kj1j4j5j5lJ6K8K3J1PRkk3m8n9n0k7pMK0M6O1M9L4L8N2M1J1
$$ -228 -227 -235 -233 -219 -202 -190 -187 -196 -210 -214 -201 -185 -183 -194 -208 -223 -238 -241 -225 -197 -174 -163 -156 -147 -149 -172 -220 -279 -329 -356 -363 -359 -339 -293 -232 -183 -149 -111 -59 -18 -7
9470gKJ3J2j4k7j0RPnpmJK5N4P1J01K11L63L80J48j93l79l22j74r3p4m5rpk6k6j3j9l6l1m
$$ -7 -5 8 20 6 -21 -31 -22 -15 -20 -27 -31 -30 -5 49 120 221 432 795 1175 1323 1130 751 429 255 162 88 43 34 27 1 -25 -38 -57 -93 -124 -128
9454a28Pqj5kJ5J3KnmjRJ6Rj6l7l8k6j3mKMKKMLpk1k0LL4M6K6ok1j4jJ0K2L0J6j6l5k3ljj1
$$ -128 -121 -129 -144 -146 -131 -118 -116 -121 -125 -126 -117 -101 -92 -108 -145 -183 -209 -222 -226 -224 -220 -218 -216 -212 -209 -216 -237 -257 -254 -220 -174 -148 -154 -175 -189 -190 -180 -158 -128 -112 -128 -163 -186 -189 -190 -201
9434b01rOJ1KjJ1K3J6lk1l1l1j9nMJ0J8K8K4Mj8l2l2j7J4N0O8N5K2j3l6m8m7l6k3j2nJK%L
$$ -201 -210 -204 -193 -191 -192 -181 -158 -142 -145 -166 -197 -228 -247 -252 -248 -238 -220 -192 -168 -164 -182 -214 -246 -263 -249 -199 -131 -76 -54 -67 -103 -151 -198 -234 -257 -269 -274 -273 -271 -271 -268
9416b68PMpj6j6j2rLK1L1J9lj0JJ6K7L8M2L0kl5n5o1n6l6oK2L2K3%j7j4J5M4M5J9l%K0J9q
$$ -268 -261 -257 -264 -280 -296 -308 -317 -314 -293 -262 -243 -246 -256 -255 -239 -212 -174 -132 -102 -104 -139 -194 -255 -311 -347 -353 -331 -299 -276 -276 -293 -307 -292 -248 -203 -184 -187 -187 -167 -148 -156
9399a56m0n5m8l0j2JJ2K1L0L7L7L4L5L1J8JmNJ1ll0m5m4k9j4kNN%klMK0M5N5L7kk9l2k2j7
$$ -156 -196 -251 -299 -329 -341 -340 -328 -307 -277 -240 -203 -169 -134 -103 -85 -84 -88 -83 -72 -75 -105 -150 -194 -223 -237 -239 -234 -229 -229 -231 -234 -230 -210 -165 -110 -73 -75 -104 -136 -158 -175
9381a75j2%J8L3L8L0Ok6m5l8j5QK4L5L1Rj3k3k2l0m1l6j0J8L1L5L6K6Mj5j7j8l0m6m3j3K1
$$ -175 -187 -187 -169 -136 -98 -68 -62 -88 -133 -171 -186 -178 -154 -119 -88 -79 -92 -115 -137 -167 -208 -244 -254 -236 -205 -170 -134 -108 -104 -119 -136 -154 -184 -230 -273 -286 -265
9365b65L7L4K3J2MmrlRJ5PKJ0K7K8ProJ0J4P%jlj1j5j7j8k1k0j2onj0j8k3j3OJ9J7J0QJ0Q
$$ -265 -228 -194 -171 -159 -155 -159 -168 -171 -162 -147 -140 -138 -128 -101 -73 -66 -75 -81 -71 -57 -50 -50 -51 -54 -65 -80 -97 -115 -136 -156 -168 -174 -179 -189 -207 -230 -243 -237 -218 -201 -191 -183 -173 -165
9346a65LMNpk6l2j9jJ2K1K2Mk3k6ML9N1M1K4OokJ7K6J2qnJ4J5mk1j2J1K5K4J6%k1l3l1k0j4
$$ -165 -162 -158 -153 -160 -186 -218 -237 -238 -226 -205 -183 -179 -202 -228 -224 -185 -134 -93 -69 -63 -69 -71 -54 -28 -16 -24 -29 -15 0 -4 -25 -37 -26 -1 23 39 39 18 -15 -46 -66 -80
9328h0j0KJ3J3%j3j6pLLj3m1o0n4l0j0lJJ1K3K4J2mk1k7j8KJ9K1J6J6J8J2kj6j4lQJ5J4Mj4
$$ -80 -90 -88 -75 -62 -62 -75 -91 -98 -95 -92 -105 -146 -206 -260 -290 -300 -303 -302 -291 -268 -244 -232 -236 -257 -284 -302 -300 -281 -260 -244 -228 -210 -198 -200 -216 -230 -233 -225 -210 -196 -192 -206
9309b06k3j2J1K2Nk5l8j7J9M3M5L2K6K9L1K3Mrj1rj0j2pmj4k9l4k2rlLQPmj5rNJ4Poj4j4n
$$ -206 -229 -241 -230 -208 -203 -228 -266 -283 -264 -221 -176 -144 -118 -89 -58 -35 -31 -40 -51 -60 -70 -82 -89 -93 -107 -136 -170 -192 -201 -204 -201 -193 -186 -190 -205 -214 -209 -195 -188 -194 -208 -222 -227
9291b27PK0K4J9Qjnkjlj0j4j1jMMJ%kjPJ3Lj3j8nJ1Rnj6j6rKJ7K9K7J2oj4lJ7L4L7K5J3RO
$$ -227 -220 -200 -176 -157 -149 -150 -155 -157 -158 -161 -171 -185 -196 -197 -193 -189 -188 -188 -190 -191 -184 -171 -168 -181 -199 -204 -193 -184 -189 -205 -221 -230 -228 -211 -182 -155 -143 -149 -163 -166 -149 -115 -78 -53 -40 -31 -25
9270b5j3l7m8l5j2J%pj5j7rOJ4J2PJ0J7J9J2Kj1k3k9k4rRK5L6L4K1%k0k9k2mJ6K8K3J3Mjj
$$ -25 -38 -75 -123 -158 -170 -169 -169 -176 -191 -208 -217 -211 -197 -185 -178 -168 -151 -132 -120 -118 -129 -152 -181 -205 -214 -205 -180 -144 -110 -89 -89 -109 -138 -160 -164 -148 -120 -97 -84 -80 -81 -82
9252h2jK%nj6k5l2l0j7k%k0m1l6kL2M4L6L1K5Qj9l1j6J3L5M0M1L8K6ll3m5l7k3k0k0j0QJ1
$$ -82 -83 -81 -81 -86 -102 -127 -159 -189 -206 -208 -208 -228 -269 -305 -307 -275 -231 -195 -164 -139 -131 -150 -181 -197 -184 -149 -109 -68 -30 -4 -7 -40 -85 -122 -145 -165 -185 -195 -187 -176
9235a76j0k8k7j5j7l5l9qM0O3N0K2NQJ6J3Jj3j6kJ9L3K5ll2m6m1k5mJ6L4M0K7J2J0K2K7Rj5
$$ -176 -186 -214 -241 -256 -273 -308 -347 -355 -315 -252 -202 -180 -175 -167 -151 -138 -137 -150 -166 -168 -149 -116 -91 -94 -126 -172 -213 -238 -242 -226 -192 -152 -125 -113 -103 -81 -54 -45 -60
9218f0k2oMrl1l4j1Okj8j5QK4J9MkjNJ1K4L2K7Pj1k1k7l6l9l0j2J%oqKJ4K3K5K2J2MMJ2J1
$$ -60 -82 -88 -84 -93 -124 -158 -169 -163 -165 -183 -198 -190 -166 -147 -143 -145 -146 -141 -130 -106 -74 -47 -40 -51 -72 -99 -135 -174 -204 -216 -215 -215 -221 -229 -227 -213 -190 -165 -143 -131 -127 -123 -111 -100
9199a00j2m6n8l1J5M4M7L7K5J1mj1j2j3k0j7lPKqj0orj2o%qk8l2rJ9K2J4J6L3M5L8K2J3Pl
$$ -100 -112 -158 -216 -247 -232 -188 -141 -104 -79 -68 -72 -83 -95 -108 -128 -145 -148 -141 -139 -147 -157 -163 -172 -184 -190 -190 -198 -226 -258 -267 -248 -226 -212 -196 -163 -118 -80 -58 -45 -38 -41
9181d1j4j5poj3j7j0llqqpj4j9oJ7K1lk7k5jJ5J1kj8l0k8oJ6J2j8l2j1J9K0lj8j3JOJ0J3Q
$$ -41 -55 -70 -77 -83 -96 -113 -123 -126 -129 -137 -145 -152 -166 -185 -191 -174 -153 -156 -183 -208 -209 -194 -183 -185 -203 -233 -261 -267 -251 -239 -257 -289 -300 -281 -261 -264 -282 -295 -294 -288 -278 -265 -257
9162b57lqPK8L8L4L1K7J6mk1k7k0j2qqj0j6k0k3j8kJ6K7K4Oj2j2J0L9M8K7ok2k1j8j3NL3M6
$$ -257 -260 -268 -261 -233 -195 -161 -130 -103 -87 -91 -112 -139 -159 -171 -179 -187 -197 -213 -233 -256 -274 -276 -260 -233 -209 -203 -215 -227 -217 -178 -130 -103 -109 -131 -152 -170 -183 -178 -145 -99
9145i9K8ok2j6pj1k0k3j6lJ4L3M4L4Nk4l5k1%J0MJJ3K7J9j0l6l6k1oJpk2l6l3j3LMLJ1J9J5
$$ -99 -71 -77 -99 -115 -122 -133 -153 -176 -192 -195 -181 -148 -104 -70 -65 -89 -124 -145 -145 -135 -131 -130 -117 -90 -71 -81 -117 -153 -174 -180 -179 -186 -208 -244 -277 -290 -287 -283 -280 -269 -250 -235
9127b35NNJ8L3L5K9J5ok6l2k0lRJ7K4K6J7kk2l2k6j2mloJJ1J5OJPK0J8pm2o2n0j9PJ2Njkm
$$ -235 -230 -225 -207 -174 -139 -110 -95 -101 -127 -159 -179 -182 -173 -156 -132 -106 -89 -91 -113 -145 -171 -183 -187 -190 -196 -195 -184 -169 -163 -162 -155 -135 -117 -124 -166 -228 -278 -297 -290 -278 -273 -274 -276 -280
9108b80mJQNLK0M5N3K5j4l5l3j8jJ0J1ORK4L5K1qk3j4JJ1J5J5NrpJ2K5J2rj2JNoj6j2JQLj3
$$ -280 -284 -283 -275 -270 -267 -247 -202 -149 -124 -138 -173 -206 -224 -225 -215 -204 -198 -189 -165 -130 -109 -117 -140 -154 -153 -142 -127 -112 -107 -116 -123 -111 -86 -74 -83 -95 -94 -89 -95 -111 -123 -122 -114 -111 -124
9088a24k2j5KJ3Mj1j5j3k0l3l0nK0K3J3QMpk0j6jKj1k4j8%J9L8N3M7J2l0m4k6%J4J9K2K2J6
$$ -124 -146 -161 -159 -146 -142 -153 -168 -181 -201 -234 -264 -269 -249 -226 -213 -205 -201 -208 -228 -244 -245 -243 -254 -278 -296 -296 -277 -239 -186 -139 -127 -157 -201 -227 -227 -213 -194 -172 -150 -134
9071a34Pmj4k1j8qmnp%RJ4J4Oj0k4k2oRJ4J8K5K3Oj2j2mMRK1K9K1OMRom0o0m7j9j2k0k1nJ6
$$ -134 -127 -131 -145 -166 -184 -192 -196 -201 -208 -208 -199 -185 -171 -165 -175 -199 -221 -227 -218 -204 -186 -161 -138 -132 -144 -156 -160 -156 -147 -126 -97 -76 -70 -66 -57 -63 -103 -163 -210 -229 -241 -261 -282 -287 -271
9051b71K7L2K8J4oj8j5JJ3J5RRJ5K0K1J6J3Oj1k5k3LK7K9J4kj2j9k3k1j2qmLJ4J2nk7l0j3
$$ -271 -244 -212 -184 -170 -176 -194 -209 -208 -195 -180 -171 -162 -147 -127 -106 -90 -77 -71 -82 -107 -130 -127 -100 -71 -57 -59 -71 -90 -113 -134 -146 -154 -158 -155 -141 -129 -134 -161 -191 -204
9034b04OJ2NLJ4K4J5mj2KJ3Jk4l4k4mJ3K3K4J0j1k2j8j1okOJ9K8K9J6rk9l3k6j8j4KK2K5Q
$$ -204 -198 -186 -181 -178 -164 -140 -125 -129 -141 -139 -126 -125 -149 -183 -207 -211 -198 -175 -151 -141 -152 -174 -192 -203 -209 -211 -205 -186 -158 -129 -113 -122 -151 -184 -210 -228 -242 -240 -218 -193 -185
9016a85KJ9L9K7j0l2k2JJ1Lrj7k3k7l1k8j0J8M2M6L1J1kqj2j8j9j2LJ1Nj5k8k0%J8K5K7K7
$$ -185 -183 -164 -125 -98 -108 -140 -162 -161 -150 -147 -156 -173 -196 -223 -254 -282 -292 -274 -232 -186 -155 -144 -146 -154 -166 -184 -203 -215 -212 -201 -196 -211 -239 -259 -259 -241 -216 -189 -162
8999a62K0Nj5l0m2m4k9nQLoMK3L1J9QJ3K4J9Kj1j0jRJ6K3K2J1jKJ5J9Oj3k3k1j0MJ7K1Oj7
$$ -162 -142 -137 -152 -182 -224 -268 -297 -302 -294 -291 -297 -293 -270 -239 -220 -212 -199 -175 -156 -154 -165 -175 -176 -167 -151 -128 -106 -95 -96 -94 -79 -60 -54 -67 -90 -111 -121 -117 -100 -79 -73 -90
8981i0k7j7%Lrk0j4RK9L5K1Noj4j7pJ3K5J4ppJ4K8J5j1k1j3lnj3k0l3m5m6k7rnj3j3J2M5O2
$$ -90 -117 -134 -134 -131 -140 -160 -174 -165 -136 -101 -80 -75 -81 -95 -112 -119 -106 -81 -67 -74 -81 -67 -39 -24 -35 -56 -69 -72 -77 -90 -110 -143 -188 -234 -261 -270 -275 -288 -301 -289 -244 -182
8963a82N0K1qk3k7j9mJ0Nj5k3jL4M4J4k1k4%J2lk5k5jK5K8J1mLK2L1J7j0k7k1rJMQOnk0k8
$$ -182 -132 -111 -119 -142 -169 -188 -192 -182 -177 -192 -215 -216 -182 -138 -124 -145 -169 -169 -157 -160 -185 -210 -211 -186 -158 -147 -151 -148 -126 -95 -78 -88 -115 -136 -145 -144 -140 -132 -126 -131 -151 -179
8945a79k4j6j0nkjjJ0K5K8J1j1j7rnqmJ1J7Lj7j7MK3L0K9K5J2lj1n%ok0k5j7rj0j8k5j9jK2
$$ -179 -203 -219 -229 -234 -236 -237 -238 -228 -203 -175 -164 -175 -192 -201 -206 -214 -218 -207 -190 -187 -204 -221 -217 -194 -164 -135 -110 -98 -101 -112 -117 -117 -123 -143 -168 -185 -194 -204 -222 -247 -266 -267 -245
8926b45L6L5K3J2LnqJJ8K9K4Qoj4k0k2j7%J5J8Nqr%J3J8K0J8PnnPJ7Nk2m4m7l2j0J5L1L1K1
$$ -245 -209 -174 -151 -139 -136 -141 -149 -148 -130 -101 -77 -69 -75 -89 -109 -131 -148 -148 -133 -115 -110 -118 -127 -127 -114 -96 -76 -58 -51 -56 -61 -54 -37 -32 -54 -98 -145 -177 -187 -172 -141 -110 -89
8908h9J1%j8l8m8l8j4PJ7J7J7J4J1Kj0j6j4j2j4j3MK4K7J0j3k9l8l9k7ML2L9K9K1K2K5K0J4
$$ -89 -78 -78 -96 -134 -182 -220 -234 -227 -210 -193 -176 -162 -151 -149 -159 -175 -189 -201 -215 -228 -224 -200 -173 -163 -176 -205 -243 -282 -309 -305 -273 -234 -205 -184 -162 -137 -117 -103
8891a03J4J9K0J6RLJJjj2k6l1k2lJ8K8K3J2jj1k1k6k1j4j6k1j6OK4K2Npj0j5k3j8MK1J4qk3
$$ -103 -89 -70 -50 -34 -25 -22 -21 -20 -21 -33 -59 -90 -112 -115 -97 -69 -46 -34 -35 -46 -67 -93 -114 -128 -144 -165 -181 -175 -151 -129 -124 -131 -141 -156 -179 -197 -193 -172 -158 -166 -189
8873a89j3J8M5N0K8lj9k6l7m7l9j0J3J0pj2lNN%%PJ6K7L6L0J7Jj2k5l9m0k4lORJ3J5Lk3m0
$$ -189 -202 -184 -139 -89 -61 -64 -83 -109 -146 -193 -232 -242 -229 -219 -226 -238 -241 -236 -231 -231 -231 -224 -208 -181 -145 -115 -98 -97 -109 -134 -173 -213 -237 -240 -234 -225 -212 -197 -194 -217 -257
8855b57l0jJ8J6PJ0J8J7J2J7K6K2Np%J0Oj1k5k7j5OK2K0jk0k1pNJ0J6J9J0nqKJ4J9K0K2J4
$$ -257 -287 -288 -270 -254 -247 -237 -219 -202 -190 -173 -147 -125 -120 -127 -127 -117 -111 -122 -147 -174 -189 -183 -161 -141 -142 -162 -183 -190 -185 -175 -159 -140 -130 -135 -143 -141 -127 -108 -88 -66 -52
8838e2mk4l5l7k8j4%Mj%J7K8J3j8l1j6MROJ5K7K4Pqpkoj2rloj5j1J0L1K9Nk6m6l6kL7N2L7
$$ -52 -56 -80 -115 -152 -180 -194 -194 -190 -191 -191 -174 -146 -133 -151 -182 -198 -194 -185 -179 -164 -137 -113 -106 -114 -121 -123 -129 -141 -150 -153 -159 -174 -185 -175 -144 -115 -110 -136 -182 -218 -220 -183 -131 -94
8819i4J8J0J1Kj7l5m2l9k6nJ3J7Kj5j7lJ6K4J7J1J6K5J2k3n0l9pMj0j9%K8M1L8L2K8J1j8m3
$$ -94 -76 -66 -55 -53 -70 -105 -147 -186 -212 -217 -204 -187 -185 -200 -217 -220 -204 -180 -163 -152 -136 -111 -99 -122 -172 -211 -218 -214 -224 -243 -243 -215 -174 -136 -104 -76 -65 -83 -126
8802a26n1m0k0JJ4J5%k1l4k1QK6K2PKPQmj2qNJ1J5K1K1J0mpMRlk5l2j3K0M0L3J0kj%j1k0j2
$$ -126 -177 -217 -237 -236 -222 -207 -207 -228 -262 -283 -275 -249 -227 -220 -218 -211 -203 -207 -219 -227 -222 -211 -196 -175 -154 -144 -148 -155 -151 -142 -145 -170 -202 -215 -195 -155 -122 -112 -114 -115 -115 -126 -146 -158
8783a58OJ7J9J9K0J3nk1k0JK3K9J8Njj6m7p4o4k5RJ3OJ1K0J1pj1nkokNJj5j8ML1L7K9J9J0
$$ -158 -152 -135 -116 -97 -77 -64 -69 -90 -110 -109 -86 -57 -39 -34 -35 -51 -98 -172 -236 -261 -252 -239 -233 -222 -202 -191 -198 -209 -214 -216 -222 -224 -219 -218 -233 -251 -247 -216 -179 -150 -131 -121
8764a21nk2l1l0k3j8j8j9j5nJ0J7J3Nj%OK0K8J2k1l9k1J5L3K9K1J4Lj1oK0M5M1J7mj0%J0J6
$$ -121 -126 -148 -179 -209 -232 -250 -268 -287 -302 -307 -297 -280 -267 -262 -263 -263 -257 -237 -209 -197 -218 -257 -278 -263 -230 -201 -180 -166 -163 -174 -180 -160 -115 -74 -57 -61 -71 -71 -61 -45
8747d5J5Mj1j8j3%%j9m5n1l5j4pj5j9lK7N4O0M3Rj9l0k5j4q%QJ7J9J1%qj2j9k9l3k1jJ1J1
$$ -45 -30 -26 -37 -55 -68 -68 -68 -87 -132 -183 -218 -232 -239 -254 -273 -276 -249 -195 -135 -92 -83 -102 -132 -157 -171 -179 -179 -171 -154 -135 -124 -124 -132 -144 -163 -192 -225 -246 -247 -236 -225
8729b25RJ1Oj4l4l3qK3M0M2L4K3Nrj1RL6N1M0J8Jj0k2k8j7KOpj3qmj3j5OL5L8J5mj0k0l5m1
$$ -225 -216 -205 -199 -213 -247 -280 -288 -265 -225 -183 -149 -126 -121 -130 -141 -132 -96 -45 -5 13 14 4 -18 -46 -63 -61 -55 -62 -75 -83 -87 -100 -115 -109 -74 -36 -21 -25 -35 -55 -90 -131
8711a31k6j3j3j4lQJj1mJ9K5Jk8l3k4j9k1j4MJ7J2ok2k0nJ7L5M0K8R%PJ5Qrj8j0NJ1RPRJ2
$$ -131 -157 -170 -183 -197 -200 -192 -191 -202 -206 -187 -162 -161 -189 -222 -246 -265 -286 -300 -296 -279 -267 -273 -295 -315 -320 -303 -268 -228 -200 -191 -191 -184 -169 -161 -170 -188 -198 -193 -182 -173 -166 -157 -145
8693a45J1J1J0LnmMJ4J5J1J1QLonKO%lJ0K9L1J4pk3l7n1n5m6k8j3nLPKqrJJ4J5RMMJ0J5Qm
$$ -145 -134 -123 -113 -110 -115 -119 -115 -101 -86 -75 -64 -56 -53 -59 -64 -62 -56 -56 -59 -49 -20 11 25 18 -5 -42 -93 -148 -194 -222 -235 -240 -237 -230 -228 -236 -245 -244 -230 -215 -206 -202 -198 -188 -173 -165 -169
8672a69j3r%POJ2K7M1L7J0k7m9m3k1kJKJ0J7J4Jrj2j0%J1J2ql9n5m7k6mJ1K4L4M7N9N9L6P
$$ -169 -182 -191 -191 -184 -178 -166 -139 -98 -61 -51 -78 -127 -170 -191 -193 -192 -190 -180 -163 -149 -148 -157 -169 -179 -179 -168 -156 -164 -203 -258 -305 -331 -335 -324 -300 -266 -219 -160 -101 -65 -58
8654e8JK0K9J3ormj5l2m0l4l2k9j6MJ7J8J3Mj1k2j4PJ6QLRJ4Jj5k4k6k8k0kJ6K6K9L0K1Lr
$$ -58 -57 -37 -8 5 -1 -10 -14 -29 -61 -101 -135 -167 -196 -212 -208 -191 -173 -160 -156 -167 -189 -203 -196 -180 -172 -169 -160 -146 -145 -160 -184 -210 -238 -258 -260 -244 -218 -189 -159 -138 -135 -144
8636a44lQOlkKnk5l6k2KRmk2j8MK6K7J0lJJ1Q%JJ6K6K1Lj2rPK7L1J4j3l1k7pJ0J2Mmj1k2l6
$$ -144 -147 -139 -133 -136 -138 -136 -141 -166 -202 -224 -222 -213 -217 -239 -257 -253 -227 -200 -190 -193 -192 -181 -173 -173 -172 -156 -130 -109 -106 -118 -127 -120 -93 -62 -48 -61 -92 -119 -126 -116 -104 -100 -104 -115 -137 -173
8616a73l7j6K1M5M2K7J2Lj0k3k0kJ1Mj3j8rOJ3Mj1k1k0nJ4K5K0jk2k7j7mnj5j4KK0L3L6L7
$$ -173 -210 -226 -205 -160 -118 -91 -79 -76 -86 -109 -129 -131 -120 -116 -129 -147 -156 -150 -137 -133 -144 -165 -185 -190 -176 -151 -131 -132 -154 -181 -198 -202 -207 -222 -236 -234 -214 -181 -145 -108
8599a08L3J8Kj1j7j3LK5L7K7%k8n0o3o9n5k7LK3L1L6L6K5J4J0J1OllJ6L4K3j3l7k9j0rk5l4
$$ -108 -75 -57 -55 -66 -83 -96 -93 -68 -31 -4 -4 -32 -82 -145 -214 -269 -296 -293 -270 -239 -203 -167 -142 -128 -118 -107 -101 -104 -107 -91 -57 -34 -47 -84 -113 -123 -132 -157 -191
8582a91k4kJ8L6M7L8J0j1mK0L2J4k0m1m0k3roqkJ3K8L2K3J1nj6k1j8j5k0k1rJ0J4%k0k9l3
$$ -191 -215 -217 -199 -163 -116 -78 -68 -79 -83 -63 -31 -17 -37 -78 -118 -141 -150 -156 -164 -166 -153 -125 -93 -70 -59 -64 -80 -101 -119 -134 -154 -175 -184 -174 -160 -160 -180 -209 -242
8565b42l1j8RL7L9J9nj3j0okOJ8K4K0J0QJ3J4Lk3m2l8j1J4J8Lj1oJ4K9K4QKORnk3k5rJ4K6
$$ -242 -273 -291 -282 -245 -206 -187 -192 -205 -215 -221 -223 -217 -199 -175 -155 -145 -137 -124 -110 -107 -130 -172 -210 -221 -207 -189 -186 -197 -203 -189 -160 -136 -128 -126 -120 -111 -116 -139 -164 -173 -159 -133
8547a33K0Lj8l1k7j7j6k5l1j3J7L6L0QppJRJ3J5J6J2Kqj5j1jJ5K8K6Pj5k2j7j3j7j1J3L0K1
$$ -133 -113 -110 -128 -159 -186 -203 -219 -244 -275 -288 -271 -235 -205 -197 -204 -211 -210 -201 -188 -173 -157 -145 -143 -151 -166 -177 -178 -163 -135 -109 -102 -117 -139 -156 -169 -186 -197 -184 -154 -133
8530a33rk5j8o%QK7M0K5ok8l2k9k7j9%J5J5OMRPpk1j8kNj0k7k4kJ0lj3ML5M3J9rj4qpj3j2
$$ -133 -142 -167 -185 -191 -191 -183 -156 -116 -91 -97 -125 -157 -186 -213 -232 -232 -217 -202 -196 -192 -183 -176 -183 -204 -222 -224 -219 -229 -256 -280 -282 -272 -275 -288 -284 -249 -206 -187 -196 -210 -218 -225 -238 -250
8510b50jJ1J5J1NJKJ1J9J1qk5k1kJ9K7J6MQK8L4Pl0m0j1K4K8Kk5m0m3l9k5lJ6K3J9J5J1PR
$$ -250 -251 -240 -225 -214 -209 -208 -206 -195 -176 -165 -173 -198 -219 -221 -202 -175 -159 -155 -147 -119 -85 -78 -108 -148 -159 -135 -107 -105 -130 -170 -213 -252 -277 -280 -264 -241 -222 -207 -196 -189 -180
8493a80J8K7K7J7Olqj1oMRKrj4j6k5l7l3lK6K3jj5rpk2l0oL0L7Oj8KL9M5J2k4l0j7lLOPMj
$$ -180 -162 -135 -108 -91 -85 -88 -96 -107 -113 -109 -100 -98 -107 -121 -137 -162 -199 -232 -235 -209 -186 -187 -202 -211 -218 -240 -270 -276 -246 -209 -203 -221 -219 -180 -135 -123 -147 -177 -194 -197 -194 -188 -181 -177 -178
8473a78oj7l2l6k4jJ3K1L0L8L4J8Nkqj1JK7M0K2qk3j6j3k0k3j2knj3j6j2j3j7j5kJ1J1Kpm
$$ -178 -184 -201 -233 -269 -293 -294 -281 -260 -230 -192 -158 -140 -135 -137 -145 -156 -155 -128 -88 -66 -74 -97 -113 -126 -146 -169 -181 -183 -188 -201 -217 -229 -242 -259 -274 -276 -265 -254 -252 -259 -263
8455b63NJ1J3K1L7M5L1Lj3nJrk3j7RK2J0j1j5ojj1j7rJ1K6K2jk4k3ML8N8N8M4J9k0n2o4n5
$$ -263 -258 -247 -234 -213 -176 -131 -100 -97 -110 -115 -114 -123 -146 -163 -154 -132 -122 -133 -148 -154 -155 -166 -183 -192 -181 -155 -133 -134 -158 -181 -177 -139 -81 -23 21 40 20 -32 -96 -151
8438a51l9k4oJ2J5PJ1L1M2K3mjK3L0Lk8k8jJ9J8OlolNJ4J8Rpk9m6m8l6k1j0NK4M1L6J6nj2
$$ -151 -190 -214 -220 -208 -193 -186 -175 -144 -102 -79 -83 -84 -61 -31 -28 -56 -84 -85 -66 -48 -42 -45 -51 -54 -49 -35 -17 -8 -15 -44 -90 -138 -174 -195 -205 -200 -176 -135 -99 -83 -88 -100
8420a00pJQPjp%QKj5k1nOnj8nK4K7ll0k6kLj1k1rJ7L5L7L1K7K7K5J5Lpj2k4m3n2m3k4j0m%
$$ -100 -107 -106 -98 -91 -92 -99 -99 -91 -89 -104 -125 -130 -124 -129 -147 -152 -128 -101 -104 -134 -160 -162 -159 -170 -191 -200 -183 -148 -111 -80 -53 -26 -1 14 17 10 -2 -26 -69 -121 -164 -188 -198 -202 -202
8400b02OOJjjkkRL0L8K7J3J1J1nl5n5m9k5KJ6J2nj7j2kRJ5K7M0L8K3Lj3k6l2k7j7j4j8j6J
$$ -202 -196 -190 -189 -190 -191 -193 -195 -186 -156 -118 -91 -78 -67 -56 -61 -96 -151 -200 -225 -223 -207 -195 -200 -217 -229 -231 -222 -207 -180 -140 -102 -79 -76 -89 -115 -147 -174 -191 -205 -223 -239 -238
8382b38K2K9K3J6J3J2Qnj8j7LK6K7J1JJ0Rk2n9o2k8RK4K3K1J7RMNJ1J4Qnk3l7l8k8j8j0LK2
$$ -238 -216 -187 -164 -148 -135 -123 -115 -120 -138 -155 -152 -126 -99 -88 -87 -77 -68 -90 -149 -211 -239 -230 -206 -183 -162 -145 -136 -132 -127 -116 -102 -94 -99 -122 -159 -197 -225 -243 -253 -250 -228
8364b28L1K2R%oj1j2qj0k5l6k2MK4K6K7L2K8J0j4k5j9lJ5K4K0QlqqpmNJ6K5L0K7J3mqPK3K1
$$ -228 -197 -175 -166 -166 -172 -183 -195 -203 -213 -238 -274 -296 -292 -268 -242 -215 -183 -155 -145 -159 -184 -203 -206 -191 -167 -147 -139 -142 -150 -158 -165 -169 -164 -148 -123 -93 -66 -53 -57 -65 -58 -35 -14
8346a4%k1k7j8q%LMJjnj1k2k4qJ7K7J2rj8j5j2j5j5j1qj0qkOQONJkMJ8L1L1K2Oj6l7l9j2K3
$$ -14 -14 -35 -62 -80 -88 -88 -85 -81 -80 -81 -86 -97 -119 -143 -151 -134 -107 -95 -104 -122 -137 -149 -164 -179 -190 -198 -208 -216 -218 -212 -204 -198 -193 -192 -194 -190 -172 -141 -110 -88 -82 -98 -135 -174 -186 -163
8326a63L6K3J2J7K5J8kj9k4j6lRJ0KjNLj8m0m0rK8M4K9Jj9j8KJ4Oj5k1pPQ%%QJ0OLQJ9K4K0
$$ -163 -127 -104 -92 -75 -50 -32 -34 -53 -77 -93 -96 -87 -77 -75 -76 -71 -68 -86 -126 -166 -175 -147 -103 -74 -73 -92 -110 -108 -94 -88 -103 -124 -131 -124 -116 -116 -116 -108 -98 -92 -89 -81 -62 -38 -18
8306a8Rrk3k5j3jmj7j9rrk7l6j6K3L7J4j6k3j7k0l4l2nK5L9L5K6J7PMJ2K1J4j0l1l4k3qJQ
$$ -18 -9 -18 -41 -66 -79 -80 -84 -101 -120 -129 -138 -165 -201 -217 -194 -157 -143 -159 -182 -199 -219 -253 -285 -290 -265 -226 -191 -165 -148 -141 -137 -125 -104 -90 -100 -131 -165 -188 -196 -195 -187
8288a87J0J0J2J5J5R%jLLmrkJ1J1%j6k3k3j8oRJ4Mpj2j2k0l1k8j0J5K7K1J0MLKoj2rmmo%J9
$$ -187 -177 -167 -155 -140 -125 -116 -116 -117 -114 -111 -115 -124 -126 -115 -104 -104 -120 -143 -166 -184 -190 -181 -167 -163 -170 -182 -194 -214 -245 -273 -283 -268 -241 -220 -210 -206 -203 -201 -207 -219 -228 -232 -236 -242 -242 -223
8269b23L2K9J1pj9k1j3NJ8J3kpKJ2OnrkQJ2J0Krk0l0l2j9MK0J3JOK9L8J7prMOlJK1L6K6lk8
$$ -223 -191 -162 -151 -158 -177 -198 -211 -206 -188 -175 -177 -184 -182 -170 -164 -169 -178 -180 -172 -160 -150 -148 -157 -177 -207 -239 -258 -254 -234 -221 -220 -214 -185 -147 -130 -137 -146 -142 -136 -139 -138 -117 -81 -55 -58 -86
8249h6l2j4J6L6L3J1pj4j3j1kJ1J6Qk%RRkj5j6oOOmj2pNKj2j1J8M8M3J6jNNj5l4k6opk8l6
$$ -86 -118 -132 -116 -80 -47 -36 -43 -57 -70 -81 -83 -72 -56 -48 -50 -50 -41 -32 -34 -49 -65 -71 -65 -59 -63 -75 -82 -77 -75 -87 -98 -80 -32 11 27 26 31 36 21 -13 -39 -45 -52 -80 -116
8229a16k3okKJ0Nk1m1k5OJ8%j8j5qlLJ6J9jk6k4%J5PmPL2M0K2kj1pmj3j9j1J4M1N4M7K9Qq
$$ -116 -139 -145 -147 -145 -135 -130 -151 -192 -217 -211 -193 -193 -211 -226 -234 -237 -234 -218 -199 -200 -226 -250 -250 -235 -228 -232 -225 -193 -153 -131 -133 -144 -151 -155 -168 -187 -198 -184 -143 -89 -42 -13 -5 -13
8210a3j6j7j6j5rKJ3J4OKQJ3Lk0l2k5qKNJ2K5K9J4qj7j0nrj4rLJ0Okoj2k0k6k8k4j5mOJ1Q
$$ -13 -29 -46 -62 -77 -86 -84 -71 -57 -51 -49 -41 -28 -25 -45 -77 -102 -110 -108 -103 -91 -66 -37 -23 -31 -48 -58 -63 -72 -86 -95 -92 -82 -76 -78 -84 -96 -116 -142 -170 -194 -209 -213 -207 -196 -188
8191a88PJ1K0K1Qj3k4k1nJ1J5MqqPK1J5mj1KJ9J9OmmkmnJNOMJrk2k8j7LJ6J5Qlj1j6j2%PJ0
$$ -188 -181 -170 -150 -129 -121 -134 -158 -179 -184 -173 -158 -154 -162 -170 -163 -142 -127 -131 -142 -140 -121 -102 -96 -100 -104 -106 -110 -115 -114 -109 -103 -99 -98 -107 -129 -157 -174 -171 -155 -140 -132 -135 -146 -162 -174 -174 -167 -157
8170a57R%j4k5k0p%nqKK2L7M3M0K8J0pj0lQJ5J8J0j0m2p1p1l8PL7L5J3%k%lo%QJ4J0jj1j4
$$ -157 -148 -148 -162 -187 -207 -214 -214 -219 -227 -225 -203 -166 -123 -83 -55 -45 -52 -62 -65 -57 -42 -24 -14 -24 -66 -137 -208 -246 -239 -202 -167 -154 -154 -156 -156 -159 -165 -165 -157 -143 -133 -134 -145 -159
8151a59nQRmj8k3k6k7k5j2KPJ0K1L5L5K3J4J0jj9k5lK5L1J4kJJ1Rmj1kJ5K4J5ql0l8k7mJ0
$$ -159 -164 -156 -147 -151 -169 -192 -218 -245 -270 -282 -280 -273 -263 -242 -207 -172 -149 -135 -125 -126 -145 -170 -173 -148 -117 -103 -105 -104 -93 -84 -88 -99 -101 -86 -62 -47 -55 -85 -123 -150 -154 -144
8132a44PooJ0L1L9L6L0J9Mj3k1k8l9n2m9l2j3jJOJ3J8J5jj8k0KK5K7J0KJ2J7%k5l1j8jJ0J9
$$ -144 -137 -143 -149 -139 -108 -69 -33 -3 16 20 7 -14 -42 -81 -133 -182 -214 -227 -228 -227 -221 -208 -190 -175 -176 -194 -214 -212 -187 -160 -150 -148 -136 -119 -119 -144 -175 -193 -194 -184 -165
8115a65K6K4J9J5Qkro%jlMJ3J2JKJ6J8rl9m7l3k3k2k0rKJjKMJpq%J1J8K1J7RjqqlJ2L3M6L9
$$ -165 -139 -115 -96 -81 -73 -75 -84 -90 -90 -91 -94 -90 -77 -65 -64 -62 -46 -28 -37 -76 -123 -156 -179 -201 -221 -230 -228 -227 -228 -226 -222 -221 -228 -236 -236 -225 -207 -186 -169 -160 -161 -169 -177 -180 -168 -135 -89 -50
8094e0J7%mrk5l9l1r%nnJ1K1Pj9k9j3J6M1N2M8K9J3OLj1l2l6k1moj4j5kO%k4n4o8m6JL8M5
$$ -50 -33 -33 -37 -46 -71 -110 -141 -150 -150 -155 -160 -149 -128 -121 -140 -169 -182 -166 -125 -73 -25 4 17 23 26 15 -17 -53 -74 -78 -84 -98 -113 -115 -109 -109 -133 -187 -255 -301 -300 -262 -217
8075b17L2K2K5K8K6K1J6J0MMMLnqj1j5k5l3l2k1pknqLK2L4L0J7RQPKqj8k5j4QJ9Pj6k1j1j0
$$ -217 -185 -163 -138 -110 -84 -63 -47 -37 -33 -29 -25 -22 -27 -35 -46 -61 -86 -119 -151 -172 -179 -181 -186 -194 -191 -169 -135 -105 -88 -79 -71 -64 -62 -70 -88 -113 -127 -119 -100 -93 -109 -130 -141 -151
8056a51k5l3j3J9M0M2K9J3QJ8L1K2j1m3m4k5kJ6K9L0Qk0l1j9j4k2k3LL6L6%l5l5rJ2RkNK3
$$ -151 -176 -209 -222 -203 -163 -121 -92 -79 -71 -53 -22 0 -11 -54 -98 -123 -125 -109 -80 -50 -42 -62 -93 -112 -126 -148 -171 -168 -132 -96 -96 -131 -166 -175 -163 -154 -156 -151 -128
8039a28L0Rk3l9l0j1KKqj5j3mMQJ3L1N2N2K1k0l8k2J1L8M4K8Mj2j1mok0l3l4j6J2L5L9K5J
$$ -128 -98 -89 -112 -151 -181 -192 -190 -188 -196 -211 -224 -228 -224 -216 -203 -172 -120 -68 -47 -67 -105 -127 -116 -78 -34 -6 -2 -14 -25 -29 -35 -55 -88 -122 -138 -126 -91 -52 -27 -26
8022b6j9l2l3k4q%%KJ3K6K7J4Jlmpm%jj3k3j9nMOMkj6l5m1l1j3j1k5l7k9mK3L3L0J9J0L%M
$$ -26 -45 -77 -110 -134 -142 -142 -142 -140 -127 -101 -74 -60 -59 -62 -66 -73 -77 -77 -78 -91 -114 -133 -138 -134 -128 -124 -126 -142 -177 -218 -249 -262 -273 -298 -335 -364 -368 -345 -312 -282 -263 -253 -250 -250 -246
8002b46J2J8J8J6J1QRJ3J0mj4%L6O3N1J3k2l7l9l4k1MJ9Rk0l8l3k0j3j2j2qNL2O1O5L1k2n7
$$ -246 -234 -216 -198 -182 -171 -163 -154 -141 -131 -135 -149 -149 -113 -50 1 14 -8 -45 -84 -118 -139 -135 -116 -107 -127 -165 -198 -218 -231 -243 -255 -263 -258 -226 -165 -100 -69 -91 -148
7985a48n6l5rJ0K3K9K9K3J5O%mpj1j5j3nKjnmKKmjJ5L3L8K3LrqKJ3J9K3K5K0J0rk9m4m9m7
$$ -148 -204 -239 -248 -238 -215 -186 -157 -134 -119 -113 -113 -117 -124 -135 -150 -163 -168 -166 -167 -172 -176 -174 -172 -176 -177 -162 -129 -91 -68 -65 -74 -82 -80 -67 -48 -25 0 20 30 21 -8 -52 -101 -148
7966a48l8k2kJ8K8L3K8K2J8J5J1KllJlj4l0m0m2l2j0J3K3K3K5L2K7J3RJ7K5Qj7k8j5%Ljj%
$$ -148 -186 -208 -210 -192 -164 -131 -103 -81 -63 -48 -37 -35 -38 -41 -40 -43 -57 -87 -127 -169 -201 -211 -198 -175 -152 -127 -95 -68 -55 -46 -29 -4 4 -13 -41 -56 -56 -53 -54 -55 -55
7949e5j0l1n2n5l9j2J2K7L2L0K0J4K2L2K6%k7l4k5k0j3QL2L2Qj5j1PK1K4K0lm2p2n9j2L0L7
$$ -55 -65 -96 -148 -203 -242 -254 -242 -215 -183 -153 -133 -119 -97 -65 -39 -39 -66 -100 -125 -145 -158 -150 -118 -86 -78 -93 -104 -97 -76 -52 -32 -35 -77 -149 -208 -220 -190 -153
7932a53K0JlNJ7K1Rj5l0l0j7nQK0K9L2K2Oqj1jJ4K5K5J6Lkmjoj7l0l6k5nJ0J1LJJ1K3J7lj8
$$ -153 -133 -132 -135 -130 -113 -92 -83 -98 -128 -158 -175 -180 -172 -152 -123 -91 -69 -63 -71 -82 -83 -69 -44 -19 -3 0 -2 -6 -7 -13 -30 -60 -96 -121 -126 -116 -105 -102 -101 -90 -67 -50 -53 -71
7913g1j2kmqmjj4l2l3j9mjMJ7J9J1MJ3K4J8Jj4j7j7qPK2K3J8J7K3K2J5ONPJ1J2Kj9l8l9j8
$$ -71 -83 -85 -89 -97 -101 -102 -116 -148 -181 -200 -204 -205 -201 -184 -165 -154 -150 -137 -113 -95 -94 -108 -125 -142 -150 -143 -121 -98 -80 -63 -40 -18 -3 3 8 15 26 38 40 21 -17 -56 -74
7894g4JP%j0j7k2k0j7j4nJ1K7K6Rj1j7j4j4k2k5j7JJ7J9J4J2J9K4K0Omqooj0j4j5mK1L8L5
$$ -74 -73 -66 -66 -76 -93 -115 -135 -152 -166 -171 -160 -133 -107 -98 -109 -126 -140 -154 -176 -201 -218 -217 -200 -181 -167 -155 -136 -112 -92 -86 -90 -98 -104 -110 -120 -134 -149 -153 -132 -94 -59
7877e9J4kmlrj4rmpj2nPJ0%jJ0K1J9J1J3J8J0qk4j9MK9L6K0j1l1k8lJ6J7J2J0J2Lk0m2o0o2
$$ -59 -45 -47 -51 -54 -63 -77 -86 -90 -97 -109 -114 -107 -97 -97 -98 -88 -67 -48 -37 -24 -6 4 -4 -28 -47 -43 -14 22 42 31 0 -28 -31 -15 2 14 24 36 39 19 -23 -83 -145
7858a45m6j3K1L9L7K7K1J2%j0j3j3j3j4oMJ1J6J9J3j0l7m8l6j9oNJ5K0J7J2J4J6Rnj4j6j7
$$ -145 -191 -204 -183 -144 -107 -80 -59 -47 -47 -57 -70 -83 -96 -110 -116 -112 -101 -85 -66 -53 -63 -100 -148 -184 -203 -209 -204 -189 -169 -152 -140 -126 -110 -101 -106 -120 -136 -153
7842a53j9j4NK4K8J2llMRQJ5K7L1K3J2RP%rj3k0k8l1k2oNJ1J2Oqk3k5j7nQL0N0N2L4J3kj2
$$ -153 -172 -186 -181 -157 -129 -117 -120 -123 -119 -110 -102 -87 -60 -29 -6 6 15 22 22 13 0 -20 -48 -79 -101 -107 -102 -91 -79 -73 -81 -104 -129 -146 -151 -143 -113 -63 -11 23 36 34 22
7823B2j6pNJ7J8J5J1OJKMlk0l4l1j5RL1L9K3j0k5rK3L5K2PMOjj2j4%J4K4K8L2K6%k8l5j8k
$$ 22 6 -1 4 21 39 54 65 71 72 74 78 75 55 21 -10 -25 -16 15 54 77 67 42 33 56 91 113 120 124 130 129 117 103 103 117 141 169 201 227 227 199 164 146 144
7804A44%LJ8K9K3J2K0M0N1M8N1N4M8L8M1N5O2O3P5J00J22J33J39J46J54J79K27K80L26L99
$$ 144 144 147 165 194 217 229 249 289 340 388 439 493 541 579 620 675 737 800 875 975 1097 1230 1369 1515 1669 1848 2075 2355 2681 3080
7791C080N29O90Q63J098J457J928K510L297M195M582L603J090j955m099m680m125l232k431
$$ 3080 3609 4299 5162 6260 7717 9645 12155 15452 19647 24229 27832 28922 26967 22868 18188 14063 10831 8400
7783H400j780j273r35p13n33l92l22k84k24j62j44j49j29q2m1kM9Q6O4Kn2q5j09j11q4n8o3
$$ 8400 6620 5347 4412 3699 3166 2774 2452 2168 1944 1782 1638 1489 1360 1278 1237 1235 1284 1370 1434 1436 1384 1299 1190 1079 995 937 874
7772H74p4n7k8k2k0J3N7O2L3J3J7K4K4K7K6J4K0O3J10J26J25J42J59J55J67K29L09L59M23
$$ 874 800 743 715 693 673 686 743 805 838 851 868 892 916 943 969 983 1003 1066 1176 1302 1427 1569 1728 1883 2050 2279 2588 2947 3370
7759C370N54P27R03J154J564K115K789L643M485M563L063J33k898m614m701l896k990k244
$$ 3370 3924 4651 5554 6708 8272 10387 13176 16819 21304 25867 28930 29063 26165 21551 16850 12954 9964 7720
7751G720j619j137q42o63n13m00l43l03k38j81j61j47j07p2o8o5l9j6k1k7pJ8K5K2J3j5n8
$$ 7720 6101 4964 4122 3459 2946 2546 2203 1900 1662 1481 1320 1173 1066 994 926 861 822 806 785 758 751 769 794 816 829 814 756
7740G56p4m4qmj6j4olNK3L3L3M0O2P5P0P3Q8R5R1J08J52J90K06K33K86L37L89M91O42P97R73
$$ 756 682 638 630 626 610 596 590 587 592 615 648 681 721 783 858 928 1001 1089 1184 1275 1383 1535 1725 1931 2164 2450 2787 3176 3667 4309 5106 6079
7726F079J260J699K253K959L841M524M156K181q46l494m669m433l576k722k019j446j044q17
$$ 6079 7339 9038 11291 14250 18091 22615 26771 28952 28106 24612 19943 15510 11934 9212 7193 5747 4703 3886
7718C886o63n13l96l36k95k33j82j69j63j31q2m8k8j7j8l8n6n6m3l2k7k9m0m9l7j4qk7l6j4
$$ 3886 3223 2710 2314 1978 1683 1450 1268 1099 936 805 723 675 647 630 612 574 518 462 419 387 360 331 291 242 205 191 183 156 120 106
7705A06J9K3Jj5j0knk0l6l7k2%J9K7K1Pqj3n%j0k8l2k6j8j3%J5J1lmJ8L1Rk3l4j8LJ3J2kk8
$$ 106 125 148 149 134 124 122 117 97 61 24 2 2 21 48 69 76 68 55 50 50 40 12 -20 -46 -64 -77 -77 -62 -51 -54 -58 -40 -9 0 -23 -57 -75 -72 -59 -47 -49 -77
7687g7m7l8rOLKJ7K9K5J6J3J0j0l0k6mJ1P%OJ9K3K1K2K0QqqRJ5lk7k5lRqk7k5j1nj3j2JQJ
$$ -77 -124 -162 -171 -165 -162 -160 -143 -114 -89 -73 -60 -50 -60 -90 -116 -120 -109 -102 -102 -96 -77 -54 -33 -11 9 17 9 1 10 25 22 -5 -30 -33 -24 -32 -59 -84 -95 -100 -113 -125 -124 -116 -115
7667a15qpnj0j3%J6J6KoJJ2J8K0K9L7K7Pk3n6p7p1l3J0K9J8OQJ5J3MjKQJ6K3J9Jj3rJ4K7J8
$$ -115 -123 -130 -135 -145 -158 -158 -142 -126 -124 -130 -129 -117 -99 -79 -50 -13 14 21 -2 -58 -135 -206 -239 -229 -200 -182 -176 -168 -153 -140 -136 -137 -135 -127 -111 -88 -69 -68 -81 -90 -76 -49 -31
7649c1JomJJ1K6K9J3k1m2l6qJ1Qj1k6k7j7mJ4L8O2O1L2qk9k1lNj5m6p0o3l0PK7L1L1K3Pj2
$$ -31 -30 -36 -40 -39 -28 -2 27 40 19 -23 -59 -67 -56 -48 -59 -85 -112 -129 -133 -119 -81 -19 42 74 66 37 16 13 18 3 -43 -113 -176 -206 -199 -172 -141 -110 -87 -80 -92
7631i2j6ojj1k2j3ONj7l0rL2N5M2J6NLok4k5kJ5Pj3j4KQkpOK3J7mk0k1j5j2j4j9k0j7j1j3
$$ -92 -108 -114 -115 -126 -148 -161 -155 -150 -167 -197 -206 -174 -119 -77 -61 -56 -53 -59 -83 -108 -110 -95 -88 -101 -115 -113 -105 -107 -114 -108 -85 -68 -72 -92 -113 -128 -140 -154 -173 -193 -210 -221 -234
7612b34k0j5OL0L9L1K3K5K3J3jmLJj6l5l4j9rj7k6j4K0M4M4K9J8J3RJ5L9N9N1J2k9n1n3n2
$$ -234 -254 -269 -263 -233 -194 -163 -140 -115 -92 -79 -80 -84 -81 -80 -96 -131 -165 -184 -193 -210 -236 -250 -230 -186 -142 -113 -95 -82 -73 -58 -19 40 91 103 74 23 -30 -82
7596h2m5k6MK8L1Qj9k6nK1L0K1J0M%pmQJ0ok5k8j8rnmqj9k9k9k0j4j3rkPJ6K5K8J8KkPJ2J
$$ -82 -127 -153 -149 -121 -90 -82 -101 -127 -132 -111 -81 -60 -50 -46 -46 -53 -57 -49 -39 -45 -70 -98 -116 -125 -130 -134 -142 -161 -190 -219 -239 -253 -266 -275 -277 -270 -254 -229 -201 -183 -181 -183 -176 -164 -163
7576a63j6j4PK9L3K5K2K9L1J7j2l4l6k3qMJ3J4Mj3k6k7k1j7j2kJ1J8J6J1kj7k3qJ6L0J9NR
$$ -163 -179 -193 -186 -157 -124 -99 -77 -48 -17 0 -12 -46 -82 -105 -113 -109 -96 -82 -78 -91 -117 -144 -165 -182 -194 -196 -185 -167 -151 -140 -142 -159 -182 -190 -174 -144 -125 -120 -111
7559a11J9K0Lj4k2k5k5j2J1K4Rj7l1k2rjRJ9K3J8J2J0Npj1MK3L0K0Pjj2j8j8j3j4k1j3J0L1
$$ -111 -92 -72 -69 -83 -105 -130 -155 -167 -156 -132 -123 -140 -171 -193 -202 -203 -194 -175 -152 -134 -122 -112 -107 -114 -125 -121 -98 -68 -48 -41 -42 -54 -72 -90 -103 -117 -138 -151 -141 -110
7542a10L3K5J4Lj5l4m0k8rMNNQK0K7K2jk4l4k9j7pmmomLJ7K9L1K1Jj3k0k4k5j2J3L3K5pl1
$$ -110 -77 -52 -38 -35 -50 -84 -124 -152 -161 -157 -152 -147 -139 -119 -92 -70 -71 -95 -129 -158 -175 -182 -186 -190 -196 -200 -197 -180 -151 -120 -99 -98 -111 -131 -155 -180 -192 -179 -146 -121 -128 -159
7524a59k1PK3J5nj3kJ7L1L2K1J4J3J3Lj2k1j7j4k0l5l8j8J6L3K3J2J9L4K2j1k2KK6J4j1j3
$$ -159 -180 -173 -150 -135 -140 -153 -155 -138 -107 -75 -54 -40 -27 -14 -11 -23 -44 -61 -75 -95 -130 -168 -186 -170 -137 -114 -102 -83 -49 -27 -38 -60 -58 -32 -18 -29 -42
7508d2RJ6lj8pJ8L2L3K7Pk4n5o8o5n5m1k1nOK4N1P0N4J5j4j6okoj1j9k4j9kJ0J0OJ4K2J2j0
$$ -42 -33 -17 -20 -38 -45 -27 5 38 65 72 48 -7 -75 -140 -195 -236 -257 -262 -256 -232 -181 -111 -57 -42 -56 -72 -78 -80 -86 -97 -116 -140 -159 -161 -151 -141 -135 -121 -99 -87 -97
7490i7k8l5l9m5m0k0PK5L3L5K6Q%QK1J7kj0OK3J9%j2pKNJm%J2J8Qj7l4k9j5qrOL7N6M1Pj6
$$ -97 -125 -160 -199 -244 -284 -304 -297 -272 -239 -204 -178 -170 -170 -162 -141 -124 -126 -136 -130 -107 -88 -88 -100 -107 -105 -100 -99 -103 -103 -91 -73 -65 -82 -116 -145 -160 -168 -177 -171 -134 -78 -37 -30 -46
7471d6j9j0%J1J3%j7k4j7j1j1j2rlLJ8L6M4L0Lk1l2l0k2rLNJkJQPjomMNnj8j9oPMj2j6OM1
$$ -46 -65 -75 -75 -64 -51 -51 -68 -92 -109 -120 -131 -143 -152 -155 -152 -134 -98 -54 -24 -21 -42 -74 -104 -126 -135 -132 -127 -126 -128 -127 -119 -112 -113 -119 -123 -119 -114 -119 -137 -156 -162 -155 -151 -163 -179 -173 -132
7451a32N8M8K1kj4j8k0j4mOJ2J4K0K5J9Lj8k2j4ljnLJ6K1Nj1j1LPpk0j0J6L4L6K3Pnrooj6
$$ -132 -74 -26 -5 -7 -21 -39 -59 -73 -77 -71 -59 -45 -25 0 19 22 4 -18 -32 -35 -36 -41 -38 -22 -1 4 -7 -18 -15 -8 -15 -35 -45 -29 5 41 64 71 66 57 51 45 29
7432B9k5j9qmj0j6k0l2n0n4k9MJ4LjJ2K5K6J6RN%qj2j5pJ5M1N3L5Lj3j0mpj4j5j2j3j2kJ8
$$ 29 4 -15 -23 -27 -37 -53 -73 -105 -155 -209 -238 -234 -220 -217 -218 -206 -181 -155 -139 -130 -125 -125 -133 -145 -160 -167 -152 -111 -58 -23 -20 -33 -43 -47 -54 -68 -83 -95 -108 -120 -122 -104
7414a04K9K2PmproNJ7J6jj8j7kJ1Nj3k8k8j3MRpl2m5l8j9mOJ5K6K9J9Njj%loj3j8k0j5j6k5
$$ -104 -75 -53 -46 -50 -57 -66 -72 -67 -50 -34 -35 -53 -70 -72 -61 -56 -69 -97 -125 -138 -134 -125 -132 -164 -209 -247 -266 -270 -264 -249 -223 -194 -175 -170 -171 -172 -172 -175 -181 -194 -212 -232 -247 -263 -288
7394b88l1j3K7N6N0J6j0j7oPK1L9M8M4K1mj2jJ7K4Nk2m1l9k9j9j3jJ3J8Lk8m5l7j5kjLJ6K6
$$ -288 -319 -332 -305 -249 -199 -183 -193 -210 -216 -209 -188 -149 -101 -57 -36 -40 -52 -53 -36 -12 -7 -29 -70 -109 -138 -157 -170 -171 -158 -140 -137 -165 -210 -247 -262 -264 -265 -262 -246 -220
7377b20K1J6K6M7N5M2K3J7K0J9Pj1k4k5j2JKnj5k0k3j9oJ3J7Nprorj7j8j6j6j7j1LJ8L0L3
$$ -220 -199 -183 -157 -110 -55 -13 10 27 47 66 73 62 38 13 1 2 4 -1 -16 -36 -59 -78 -84 -71 -54 -49 -56 -65 -71 -80 -97 -115 -131 -147 -164 -175 -172 -154 -124 -91
7360i1K4Mj0qkKPK1L2K1nk7l7m3m2k7pKLJ5L7L9J3j2j1mj7l2k2RK0kk3j9LJ3OmpmKRJ3QMM
$$ -91 -67 -63 -73 -81 -83 -81 -74 -53 -21 0 -5 -32 -69 -112 -154 -181 -188 -186 -183 -168 -131 -92 -79 -91 -102 -106 -123 -155 -177 -168 -148 -150 -173 -192 -189 -176 -170 -174 -181 -185 -183 -174 -161 -153 -149 -145
7340a45RJ0QOJ2K2K4J5lj8k6l2l6l5k3mPOkpmRK2J9kj5nK2L3J9mj0mKJnj3j5nJ0K0J0%LJ5
$$ -145 -136 -126 -118 -112 -100 -78 -54 -39 -42 -60 -86 -118 -154 -189 -212 -216 -209 -203 -205 -212 -216 -207 -185 -166 -168 -183 -188 -166 -133 -114 -118 -128 -132 -130 -129 -134 -147 -162 -167 -157 -137 -127 -127 -124 -109
7320a09J3mj7j9j4j1j0lNJ3K4L1K3Lj8k4k5k1j1J2K8K5J0NJ2J3Nl%NJl%jj4l3l7k5j1LJ6K4
$$ -109 -96 -100 -117 -136 -150 -161 -171 -174 -169 -156 -132 -101 -78 -75 -93 -117 -142 -163 -174 -162 -134 -109 -99 -94 -82 -69 -64 -67 -67 -62 -61 -64 -64 -65 -79 -112 -149 -174 -185 -182 -166 -142
7302a42J5mj0RK6K2Jromj1j7oJ5K6J7JrmPJ3K1L2L7K7Kj4pRRmnJ3K7J6rk5k3j0JLj0l4n5n7
$$ -142 -127 -131 -141 -132 -106 -84 -83 -92 -98 -102 -113 -130 -136 -121 -95 -78 -77 -86 -90 -83 -70 -49 -17 20 47 49 35 28 37 46 42 37 50 77 93 84 59 36 26 27 30 20 -14 -69 -126
7282a26m4l2k8k3lK4M1L1J0OK3M2L5Lk3l2l3l6l2j2QJ6J0OPQJ0J4J3LrlK1L8L0Mk8m7m3j8
$$ -126 -170 -202 -230 -253 -256 -232 -191 -160 -150 -144 -121 -79 -44 -41 -64 -96 -129 -165 -197 -209 -201 -185 -175 -169 -162 -154 -144 -130 -117 -114 -123 -126 -105 -67 -37 -33 -61 -108 -151 -169
7265a69J1K4J9K1K9L0J6NJ1K3K1Lj0j4j0j0j3k0k3j0J2K4J1qj4kQJ1K0K7J9ok0j6j3l6o2o0
$$ -169 -158 -134 -115 -94 -65 -35 -19 -14 -3 20 41 44 34 20 10 0 -13 -33 -56 -66 -54 -30 -19 -27 -41 -43 -35 -24 -4 23 42 36 16 0 -13 -49 -111 -171
7249a71k4J5L6L1J6jj1qjJk%Llj7k8l0l1l7l2nL2N2M7L3K4J4ol0l5j8RK2J9QjpolMQJpmRJ8
$$ -171 -195 -180 -144 -113 -97 -98 -109 -117 -118 -117 -119 -119 -116 -119 -136 -164 -194 -225 -262 -294 -299 -267 -215 -168 -135 -111 -97 -103 -133 -168 -186 -177 -155 -136 -128 -129 -136 -142 -145 -141 -133 -132 -139 -143 -134 -116
7229a16J2lj2j5j7k3k1rPJ4J6K0K6K6J7QPPlj9k6j4PJ3mk5l0j4NJ3J4J1MnplMQJ4K2K5J9Q
$$ -116 -104 -107 -119 -134 -151 -174 -195 -204 -197 -183 -167 -147 -121 -95 -78 -70 -63 -56 -59 -78 -104 -118 -111 -98 -102 -127 -157 -171 -166 -153 -139 -128 -124 -129 -136 -139 -135 -127 -113 -91 -66 -47 -39
7210c9OOKj2k1k3j8j0nkpj2oJ1L1M5N2N1L7Pj7k1j0nj5k5k0jJ5J3NLJ1J2pl1l5j9klj3j8j5
$$ -39 -33 -27 -25 -37 -58 -81 -99 -109 -114 -116 -123 -135 -141 -130 -99 -54 -2 49 86 93 76 55 45 40 25 0 -20 -21 -6 7 12 15 26 38 31 0 -35 -54 -56 -59 -72 -90 -105
7191a05j1pNK1L0L5L1K1NqnJ6L2K2qk9k3MJ7OnOK8K4nk0mJ4Nk2l1j8pqo%j3l8m8l0lQJ0J6
$$ -105 -116 -123 -118 -97 -67 -32 -1 20 25 17 12 28 60 82 74 45 22 26 43 49 44 50 78 102 97 77 73 87 92 70 39 21 14 6 0 0 -13 -51 -99 -129 -132 -124 -114 -98
7172i8K7K7J3j0k8k8mK4K9Nk7l3j9%J2J8J4KnjLlnJ1L3L6K3J6J5jl2n2n0l4j9pRK5L3L8M0
$$ -98 -71 -44 -31 -41 -69 -97 -101 -77 -48 -43 -70 -103 -122 -122 -110 -92 -78 -76 -81 -82 -79 -82 -87 -76 -43 -7 16 32 47 46 14 -38 -88 -122 -141 -148 -139 -114 -81 -43 -3
7154cL2J4ok1l2l1oK4K8kl3k9njj7l0k7k1j5jJ9K3ml7m9l9k2qJ0L1M0L0J2LNJ7L3M3M1J9q
$$ -3 29 43 37 16 -16 -47 -53 -29 -1 -3 -36 -65 -70 -71 -88 -118 -145 -166 -181 -182 -163 -140 -144 -181 -230 -269 -291 -299 -289 -258 -218 -188 -176 -173 -168 -151 -118 -75 -34 -15 -23
7137b3k7l1k6j3JJ1Oj0j7qQJ1Mkoj7l1k6J0N0N8L6Qj0j9l1l9l1j3orj1JJ2Rqk3k7k3j5nJ2
$$ -23 -50 -81 -107 -120 -119 -108 -102 -112 -129 -137 -129 -118 -114 -116 -122 -139 -170 -196 -186 -136 -78 -42 -34 -44 -63 -94 -133 -164 -177 -183 -192 -203 -202 -190 -181 -189 -212 -239 -262 -277 -282 -270
7119b70K7L7L5K6J7J2J0J2J3QKKJ2K3J6j1m1n5m7k6lJ2J0jj1kJ4J7Jj2kK3L5K5Qkmj1j4%K7
$$ -270 -243 -206 -171 -145 -128 -116 -106 -94 -81 -73 -71 -69 -57 -34 -18 -29 -70 -125 -172 -198 -201 -189 -179 -180 -191 -193 -179 -162 -161 -173 -175 -152 -117 -92 -84 -86 -90 -101 -115 -115 -88
7101h8M4L7J3mqpmKPOnj3j0kjoronj4k3j7kMj0k5k9j8qmmJQJ1QLOJ2J5J2RJ5K3K0Poj2j2p
$$ -88 -44 -7 6 2 -6 -13 -17 -15 -8 -2 -7 -20 -30 -32 -33 -39 -48 -54 -59 -73 -96 -113 -115 -111 -121 -146 -175 -193 -201 -205 -209 -208 -200 -189 -181 -178 -172 -160 -145 -133 -124 -109 -86 -66 -59 -65 -77 -89 -96
7079i6J1L6M9L5Mk5m2n1m0j1K0K6Lk3k5rJ2K7L0J8jj2oQJ0JpnJ0K2K2Roj3j4k0k5j8npl1n4
$$ -96 -85 -49 0 35 39 14 -28 -79 -119 -130 -110 -84 -81 -104 -129 -138 -126 -99 -69 -51 -52 -64 -70 -62 -52 -51 -58 -63 -53 -31 -9 0 -6 -19 -33 -53 -78 -96 -101 -108 -139 -193
7061a93m5j5J1J5Nmo%J4K8L3L6M1M3L0Nj1j6k3l8n3n3m3l0j0K1N0N5L3QMK0L0J7j3l7m1k9
$$ -193 -238 -253 -242 -227 -222 -226 -232 -232 -218 -190 -157 -121 -80 -37 -7 -2 -13 -29 -52 -90 -143 -196 -239 -269 -279 -258 -208 -153 -120 -112 -108 -88 -58 -41 -54 -91 -132 -161
7045a61j4kMNPK3M5N0K2j9l8k7j4j5j9pJ3K4K3K1K2J9J3J1J4Rpk4k9j6JJ3Pj2l0k9rRJ6J3
$$ -161 -175 -177 -173 -168 -161 -138 -93 -43 -21 -40 -78 -105 -119 -134 -153 -160 -147 -123 -100 -79 -57 -38 -25 -14 0 9 2 -22 -51 -67 -66 -53 -46 -58 -88 -117 -126 -117 -101 -88
7027h8J2J2Mrj1LK1K2PpqmmrrKJ5K0J4Ll%RJ1QKJkj2k3k6j4jkqj1mMMoj4pJ4L3L4K5J4Nj3
$$ -88 -76 -64 -60 -69 -80 -77 -56 -34 -27 -34 -42 -46 -50 -59 -68 -66 -51 -31 -17 -14 -17 -17 -8 3 11 13 14 12 0 -23 -49 -63 -64 -66 -74 -85 -89 -85 -81 -87 -101 -108 -94 -61 -27 -2 12 17 4
7006Dl0l6l2l1l4k8pN%nJ2L8M6L1K1K6K9J9ok2k1jK3L3Rk9m5k8lJnPL4M0J4j7k3j0%qj8j8
$$ 4 -26 -62 -94 -125 -159 -187 -194 -189 -189 -194 -182 -144 -98 -67 -46 -20 9 28 22 0 -21 -22 1 34 43 14 -31 -59 -62 -61 -66 -59 -25 15 29 12 -11 -21 -21 -29 -47 -65
6988f5j0prj1oLJ7K7J9j3m0l3LK8J4j9m1l6k2mJ3K0J5PJ1K2K0OKJ2J9J2MJ0J3%k1k6j5jlj3
$$ -65 -75 -82 -91 -102 -108 -105 -88 -61 -42 -55 -95 -128 -125 -97 -83 -102 -143 -179 -201 -205 -192 -172 -157 -150 -139 -117 -97 -91 -89 -77 -58 -46 -42 -32 -19 -19 -40 -66 -81 -82 -85 -98
6970i8k7k7nK7M3K7nk6l3l6l5k2JJ5J2QPJ4K4L9M6K5j4l7k8lOkp%QJ0J1J5J3RPJ6K5K2Oj8
$$ -98 -125 -152 -157 -130 -87 -60 -65 -91 -124 -160 -195 -217 -216 -201 -189 -181 -174 -160 -136 -97 -51 -26 -40 -77 -105 -108 -102 -104 -111 -111 -103 -93 -82 -67 -54 -45 -38 -22 3 25 31 13
6952A3k8k7j8j5j6qRJ6Lj7j8j1j9m4n4k4K7N9N0K5J2J8K6K4Qj2k4l0k9k5j6nOJ4K5L6L5K3
$$ 13 -15 -42 -60 -75 -91 -99 -90 -74 -71 -88 -106 -117 -136 -180 -234 -258 -231 -172 -122 -97 -85 -67 -41 -17 -9 -21 -45 -75 -104 -129 -145 -150 -144 -130 -105 -69 -34 -11
6935a1RLLlj0j3rj0j3pLkk4m4m5k8oJ3K5K2Nj2j2KPmj7k1k2k0j7mJ4L8N9O6M4Pj8j9j3j3k0
$$ -11 -2 1 4 1 -9 -22 -31 -41 -54 -61 -58 -60 -84 -128 -173 -201 -207 -194 -169 -147 -142 -154 -166 -164 -157 -161 -178 -199 -221 -241 -258 -262 -248 -210 -151 -85 -41 -34 -52 -71 -84 -97 -117
6917a17j9nJ3L0L2J5qk0j3nqj2rrj8j6J2M5M6K3J0K1K1nl1k6%Qqj7nRKj5k2j3NJ9K4K2K1K3
$$ -117 -136 -141 -128 -98 -66 -51 -59 -79 -92 -97 -105 -117 -126 -135 -153 -169 -157 -112 -66 -43 -33 -12 9 4 -27 -53 -53 -45 -53 -70 -75 -66 -64 -79 -101 -114 -109 -90 -66 -44 -23 0
6898@K3J1j0j8nJ5J7mk9l9l4k3j8j6j1kOQJ2J7J8Qoj7j9j7j8j5rl%j%NJ3K0K2J3nk1k6k3j5
$$ 0 23 34 24 6 1 16 33 29 0 -39 -73 -96 -114 -130 -141 -143 -137 -129 -117 -100 -82 -74 -80 -97 -116 -133 -151 -166 -175 -178 -178 -179 -179 -174 -161 -141 -119 -106 -111 -132 -158 -181 -196
6880a96JJ8K3Pj7j8OL3L8K3LnJJ8K8K1Jj0kPkk4l9l7k9k0mJ5K6K2K0K9L7L1J7Ppl1n8o1m0
$$ -196 -195 -177 -154 -147 -164 -182 -176 -143 -105 -82 -79 -84 -83 -65 -37 -16 -15 -25 -27 -20 -22 -46 -85 -122 -151 -171 -175 -160 -134 -112 -92 -63 -26 5 22 29 22 -9 -67 -128 -168
6862a68j6nJJ0J6J1JmmlOK7M0K8kk2k2j9k5l4k8j5mPK7M9N5M2K1jk4m4n0l6j2OJ3J1nk7l0
$$ -168 -184 -189 -188 -178 -162 -151 -150 -154 -158 -161 -155 -128 -88 -60 -62 -84 -106 -125 -150 -184 -212 -227 -231 -224 -197 -148 -93 -51 -30 -31 -55 -99 -149 -185 -197 -191 -178 -167 -172 -199 -229
6844b29j2J4K4J8J0Moj5j3JJ6L0L4K1rk9j3K1M0L1K1K1J4j2l4k8qKmoj%%QJ8J9J0J0J2Poj0
$$ -229 -241 -227 -203 -185 -175 -171 -177 -192 -205 -204 -188 -158 -124 -103 -112 -141 -154 -133 -93 -62 -41 -20 -6 -18 -52 -80 -88 -86 -90 -96 -97 -97 -97 -89 -71 -52 -42 -32 -20 -13 -19 -29
6826b9%Onj7j8j0JJ4K2J3qk0j5qpp%Mmj1oLMjkkj2k5k1mOLoq%J5L4M2L1J0%LNpk2k8k7k2j0
$$ -29 -29 -23 -28 -45 -63 -73 -72 -58 -36 -23 -31 -51 -66 -74 -81 -88 -88 -84 -88 -99 -105 -102 -98 -99 -101 -103 -115 -140 -161 -165 -159 -156 -162 -170 -170 -155 -121 -79 -48 -38 -38 -35 -30 -37 -59 -87 -114 -136 -146
6805a46QJ4Lj4j9pRJ4J1Lj0k9m3l7j0K0L1K4K0K2J7ol0k4NL1K8Nj2j2%PJ0J4K5L9L5J1j7l2
$$ -146 -138 -124 -121 -135 -154 -161 -152 -138 -127 -124 -134 -163 -206 -243 -253 -233 -202 -178 -158 -136 -119 -125 -155 -179 -174 -143 -115 -110 -122 -134 -134 -127 -117 -103 -78 -39 -4 7 -10 -42
6787d2k7j6o%%kJJ2K2K0Mrj8k4k8k3j0LJ1J8K5K5J4Jnj1j7j5LK1K3Nj6k5j7kJ2J6J9K4K9K4
$$ -42 -69 -85 -91 -91 -91 -93 -92 -80 -58 -38 -34 -43 -61 -85 -113 -136 -146 -143 -132 -114 -89 -64 -50 -49 -54 -65 -82 -97 -94 -73 -50 -45 -61 -86 -103 -105 -93 -77 -58 -34 -5 19
6769A9RjKJ3Pj1k3j9rjqk3l3k6mJ6J4mj8j6j1ojPROllRK2K3J0oj0JQJj6k7k9k5j7pLQJ3K4
$$ 19 28 27 29 42 49 38 15 -4 -13 -14 -22 -45 -78 -104 -108 -92 -78 -82 -100 -116 -127 -133 -134 -127 -118 -112 -115 -118 -109 -87 -64 -54 -60 -70 -69 -61 -60 -76 -103 -132 -157 -174 -181 -178 -170 -157 -133
6749a33L6L7K6J4Nnk0l3l2j9%J0NppMOj0l1l4j3J0K5L4L2J7lj3ropmNPknRJ8J4J0K5M0L3Q
$$ -133 -97 -60 -34 -20 -15 -20 -40 -73 -105 -124 -124 -114 -109 -116 -123 -119 -113 -123 -154 -188 -201 -191 -166 -132 -100 -83 -86 -99 -108 -114 -121 -125 -120 -113 -115 -120 -111 -93 -79 -69 -44 -4 29 37
6730C7qpj1k1k7j4JPQJ4K0J4Npj6k6k5k1j9j8oJ3K4J4MPJ0jj8j7qpj7rJ6L2K3QNLj1k5j5J3
$$ 37 29 22 11 -10 -37 -51 -50 -43 -35 -21 -1 13 18 11 -5 -31 -56 -77 -96 -114 -120 -107 -83 -69 -65 -58 -48 -49 -67 -84 -92 -99 -116 -125 -109 -77 -54 -46 -41 -38 -49 -74 -89 -76
6711g6K3Nj6k2j5j0j2j7k2k0lK8M7M0J3qrlKlj1j8j7nNMonJ1K4J9%j3j0lJLNJj0j6pQJ6Pk
$$ -76 -53 -48 -64 -86 -101 -111 -123 -140 -162 -182 -185 -157 -110 -70 -57 -65 -74 -77 -75 -78 -89 -107 -124 -129 -124 -120 -126 -131 -120 -96 -77 -77 -90 -100 -103 -102 -99 -94 -93 -103 -119 -126 -118 -102 -95 -97
6691i7pj2k4l5l4l2l4l0qK7M8M1K0PJljJ1K8K8Rj4j8oRJ3J2J1J5J6J2J4K6L2K3jj6j8j7k8
$$ -97 -104 -116 -140 -175 -209 -241 -275 -305 -313 -286 -238 -197 -177 -170 -169 -172 -173 -162 -134 -106 -97 -111 -129 -135 -126 -113 -101 -90 -75 -59 -47 -33 -7 25 48 47 31 13 -4 -32
6673c2l9l9k7j4jQJ2J0J0K0K4Rj3j6MK5L0J7jj3j2LJ6J0nqNPj0k7k1qqj6j0J6K8J4m%K1L2
$$ -32 -71 -110 -137 -151 -152 -144 -132 -122 -112 -92 -68 -59 -72 -88 -84 -59 -29 -12 -13 -26 -38 -35 -19 -9 -14 -22 -17 -10 -20 -47 -68 -76 -84 -100 -110 -94 -66 -52 -56 -56 -35 -3
6655cJ7qk0j4lmj2j2KK0K5K1J3kk3m0l7k1oJORNqj9j4jJ1J6J4J4K0K9K9J7Jm%kj4j8nJ8L1
$$ -3 14 6 -14 -28 -31 -35 -47 -59 -57 -37 -12 9 22 20 -3 -43 -80 -101 -107 -106 -100 -91 -86 -94 -113 -127 -128 -117 -101 -87 -73 -53 -24 5 22 23 19 19 17 3 -15 -20 -2 29
6636B9L5L2K2Jj9k5k2j9j8j1JKoj0j4k2m0m4k4NJ9J3NPJ7K9L5K9Pk1l3j9MJ3Kj4k2j9pLLk
$$ 29 64 96 118 119 100 75 53 34 16 5 6 8 2 -8 -22 -44 -84 -128 -152 -147 -128 -115 -110 -103 -86 -57 -22 7 14 -7 -40 -59 -55 -42 -40 -54 -76 -95 -102 -99 -96 -98
6618i8o%J0J2QJ%PJ8K7K5J8Pnj2j4mQJ1pk2k2pOJ3J8J2%j4j7j5k3l0j7MOj5k5j0LmrJ1L6K8
$$ -98 -104 -104 -94 -82 -74 -73 -73 -66 -48 -21 4 22 29 24 12 -2 -6 2 13 6 -16 -38 -45 -39 -26 -8 4 4 -10 -27 -42 -65 -95 -112 -108 -102 -117 -142 -152 -149 -153 -162 -151 -115 -87
6598h7ok4j5lkLJ7K1Nj3oJ8L4L0Qk0l7l3j6n%J0K8K9Qj3pJ1K2K1J3kk3l9l1j3kJPJ6J3Knj
$$ -87 -93 -117 -132 -135 -137 -134 -117 -96 -91 -104 -110 -92 -58 -28 -20 -40 -77 -110 -126 -131 -131 -121 -93 -64 -56 -69 -76 -65 -43 -22 -9 -11 -34 -73 -104 -117 -119 -118 -111 -95 -82 -80 -85 -86
6579h6knkJ1J0qk6j8OJ7Pj0j7j4j3k2l5l8k0OK1J3krjJ0K0L6N0N4M0K2Nj0k3k5qJ0Qrj4lj
$$ -86 -88 -93 -95 -84 -74 -82 -108 -126 -120 -103 -96 -106 -123 -137 -150 -172 -207 -245 -265 -259 -238 -225 -227 -236 -237 -227 -207 -171 -121 -67 -27 -5 0 -10 -33 -58 -66 -56 -48 -57 -71 -74 -75
6561g5j6k4qJ8J9LLK5L6J8qj4j2j8k2pK4L9K8J3LjppMQkj8k3j3PK2K6K5K7L8L9J6j6l3l4m0
$$ -75 -91 -115 -123 -105 -86 -83 -80 -55 -19 -1 -9 -23 -35 -53 -75 -82 -58 -19 9 22 25 24 17 10 14 22 20 2 -21 -34 -27 -5 21 46 73 111 150 166 150 117 83 43
6542D3n9o9l6K3O4N8K3j0j8j3rj8j8%K8L6J9mrKJ0Ppj9k4j5%J1nl8n6m2oK4L4L0K7J7%j5j3
$$ 43 -16 -85 -121 -98 -34 24 47 37 19 6 -3 -21 -39 -39 -11 25 44 40 31 33 43 50 43 24 0 -15 -15 -4 -9 -47 -103 -145 -151 -127 -93 -63 -36 -19 -19 -34 -47
6525d7PJ9J2mrlkoKK0K4Rqrlj3l2k9KL0L2J6PMKlj2k5m4n1l5jK2J7nj9rOJ4J8L5M8L4nl4k7
$$ -47 -40 -21 -9 -13 -22 -25 -27 -33 -31 -11 13 22 14 5 2 -11 -43 -72 -70 -40 -8 8 15 19 21 18 6 -19 -63 -114 -149 -150 -128 -111 -116 -135 -144 -138 -124 -106 -71 -23 11 6 -28 -55
6505e5kMpj1nlj2j6pPJ7K9L9L1Nk2l6l5l0k0jJ9K7K5K2K0J6J0J3J8J3pk7l3k4j1l%lnj1k2
$$ -55 -57 -53 -60 -71 -76 -79 -91 -107 -114 -107 -90 -61 -22 9 14 -8 -44 -79 -109 -129 -130 -111 -84 -59 -37 -17 -1 9 22 40 53 46 19 -14 -38 -49 -52 -52 -55 -60 -71 -93
6486i3l1l1j4NJ4J2Mmj0pOK2K8K4J5RJ0J3Ork1j7LJ6J0qj7j4j2j5j5JK2L1J7j2l0k7pQMqj6
$$ -93 -124 -155 -169 -164 -150 -138 -134 -138 -148 -155 -149 -127 -99 -75 -60 -51 -41 -28 -22 -31 -52 -69 -66 -50 -40 -48 -65 -79 -91 -106 -121 -120 -98 -67 -50 -62 -92 -119 -126 -118 -114 -122 -138
6468a38j8k2k8k5nK4M7N3M5L1K3J8J5OmjPRlj7j7pNNJmppkOJ1Pmr%K1L1J7oj3nPQNOQRJ1J2
$$ -138 -156 -178 -206 -231 -236 -212 -165 -112 -67 -36 -13 5 20 26 22 21 28 37 34 17 0 -7 -2 3 4 0 -7 -14 -16 -10 1 8 4 -5 -5 16 47 64 58 45 40 47 55 60 66 74 83 94 106
6447A06J1kk0k9k7k1j7j4pKJ2J5K1K9K9J7kj6j4jNmk2l6m0m0l7k8j3OJ7J7RNNLnj0n%koKK1
$$ 106 117 115 95 66 39 18 1 -13 -20 -18 -6 9 30 59 88 105 103 87 73 72 77 73 51 15 -25 -65 -102 -130 -143 -137 -120 -103 -94 -89 -84 -81 -86 -96 -101 -101 -103 -109 -107 -86
6428h6K7Rj3j9qMOkj2j7j0RK6L2J9ql9n9n6k8J3M2M6L2J7J3J5Nk1l9k9KK6K3J4J3J5RKMJ0
$$ -86 -59 -50 -63 -82 -90 -86 -80 -82 -94 -111 -121 -112 -86 -54 -35 -43 -82 -141 -197 -225 -212 -170 -124 -92 -75 -62 -47 -42 -63 -102 -131 -129 -103 -80 -66 -53 -38 -29 -27 -23 -13
6410a3QjnNJ9K6J0k6n8n9k6MLj0qNNolJ6K4Pj2j3mKQJ8K0PmKJ6J3qk7l3k1jK0K5J5J3K7L3
$$ -13 -5 -6 -11 -6 13 39 49 23 -35 -94 -120 -116 -113 -123 -131 -126 -121 -127 -130 -114 -90 -83 -95 -108 -112 -110 -102 -84 -64 -57 -61 -59 -43 -30 -38 -65 -98 -119 -120 -100 -75 -60 -47 -20 13
6390A3J6j4k3j4j0k3l5k9j9j2NL7O7O8M4Pk4m4m5l0r%j0k6l2k6j6j1j5j3KK6M5N0M2L0K1J8
$$ 13 29 15 -8 -22 -32 -55 -90 -119 -138 -150 -145 -108 -41 27 71 78 54 10 -35 -65 -74 -74 -84 -110 -142 -168 -184 -195 -210 -223 -221 -195 -150 -100 -58 -28 -7 11
6374A1K6L2K6Nj2k2k7l8m8n0m1k4nNLpj1mMRJ6K6K6J1oq%KPK1L6L0Jk3k2j3rj2j2j4k6l6l0
$$ 11 37 69 95 100 88 66 39 1 -47 -97 -138 -162 -167 -162 -159 -166 -177 -181 -177 -168 -152 -126 -100 -89 -95 -103 -103 -101 -94 -73 -37 -7 -6 -29 -51 -64 -73 -85 -97 -111 -137 -173 -203
6355b03nK7M7N2M0J3j2k0j5j3k4k9j9%J0J4K2L0K4PjJ0K6K9K5K3K1Pj8l8m0l4k2j2l%kj%l
$$ -203 -208 -181 -134 -82 -42 -29 -41 -61 -76 -89 -113 -142 -161 -161 -151 -137 -115 -85 -61 -54 -55 -45 -19 10 35 58 79 86 68 30 -10 -44 -66 -78 -81 -81 -83 -84 -84 -87
6338h7j0rNJ5Qj3l1l6k7pJ6K2Pj8k3%K9M4L3Qqj5j6j6oK4N7O7M7K0Plk2m1m2k9j9j6rKMko
$$ -87 -97 -106 -101 -86 -78 -91 -122 -158 -185 -192 -176 -154 -147 -165 -188 -188 -159 -115 -82 -74 -82 -97 -113 -129 -135 -111 -54 13 60 80 87 84 62 21 -21 -50 -69 -85 -94 -92 -88 -90 -96
6319i6lnj9k7j8lNQK1L4L7K6J5OJlk%qj7j8j0rj3j0RK8K9Rj7l3k7mK3L3J4k1m4l9j7jJ%RJ9
$$ -96 -99 -104 -123 -150 -168 -171 -166 -158 -137 -103 -66 -40 -25 -19 -18 -21 -23 -23 -31 -48 -66 -76 -85 -98 -108 -99 -71 -42 -33 -50 -83 -110 -114 -91 -58 -44 -65 -109 -148 -165 -166 -165 -165 -156 -137
6300a37K4K7L5L2Km5o8n4k5mPJ7K4J7MlkkpppmKJ7K9K7J3MMNMLMok4l1j8mkj1qJ5M0M1J5j9
$$ -137 -113 -86 -51 -19 -17 -62 -130 -184 -209 -213 -206 -189 -165 -148 -144 -147 -149 -151 -158 -165 -172 -176 -174 -157 -128 -101 -88 -84 -80 -75 -71 -68 -64 -70 -94 -125 -143 -147 -149 -160 -168 -153 -113 -72 -57 -76
6280g6l5k8j6j4j4nJ3K5K2J4J5J9J9J2%j4k0oJ8K4Mk5l0j2J0J7J0pk3k2lJ6J1j1k6k3j6j3
$$ -76 -111 -139 -155 -169 -183 -188 -175 -150 -128 -114 -99 -80 -61 -49 -49 -63 -83 -89 -71 -47 -43 -68 -98 -110 -100 -83 -73 -80 -103 -125 -128 -112 -101 -112 -138 -161 -177 -190
6263a90rJJ0Q%KJ3K5L1K6J8J5J8J6kk5k6kK5K9J1rj9k2k0j6j8k3k5j5mj0k5k9j2NP%nKJ5L0
$$ -190 -199 -198 -188 -180 -180 -178 -165 -140 -109 -83 -65 -50 -32 -16 -18 -43 -69 -71 -46 -17 -6 -15 -34 -56 -76 -92 -110 -133 -158 -173 -177 -187 -212 -241 -253 -248 -241 -241 -246 -244 -229 -199
6245a99M2L9K4J3J5J9J6N%lj3k7l0j5KRJrj4pQK3L3L6L4K8Pj6k4j8nOJ1Rlj4j0LLj3k4j1J0
$$ -199 -157 -118 -94 -81 -66 -47 -31 -26 -26 -29 -42 -69 -99 -114 -112 -103 -102 -111 -125 -132 -124 -101 -68 -32 2 30 37 21 -3 -21 -26 -20 -9 0 -3 -17 -27 -24 -21 -34 -58 -69 -59
6226e9J2krLJ8K3J3lj4j6j4j2j1qjQQMmj3j8j4mLNPJ1J1Kqj2j7k6k8j6mjKK4N4O5M7K1mj9
$$ -59 -47 -49 -58 -55 -37 -14 -1 -4 -18 -34 -48 -60 -71 -79 -80 -72 -64 -60 -64 -77 -95 -109 -113 -110 -105 -98 -87 -76 -74 -82 -94 -111 -137 -165 -181 -185 -186 -184 -160 -106 -41 6 27 23 4
6207Dj4QK7K5Nqj1j4j3ML4N2N7O5P4O8O2R1J60K36L11M08M80M02J16k42m60m73l83l03k32
$$ 4 -10 -2 25 50 55 47 36 22 9 13 47 99 156 221 295 363 425 516 676 912 1223 1631 2111 2513 2629 2387 1927 1454 1071 768 536
6193E36j45o5l7m9o0n1l9k5qRJ0NjlqnJ1K7K1Jj6j9j8j7j1lKmj2k2k3j8pmqj1PL3M2K4j2l8
$$ 536 391 326 289 240 180 129 90 65 57 66 76 81 80 77 69 64 75 102 123 124 108 89 71 54 43 40 42 38 26 4 -19 -37 -44 -48 -56 -67 -60 -27 15 39 27 -11
6175a1m0k1LJ6J5Qmk1m4n7n1k4RL4L8J7noK0M2L6J3jJPOmj6k7k9j6llqlJ0J5J4K1L0J9ok0
$$ -11 -51 -72 -69 -53 -38 -30 -34 -55 -99 -156 -207 -231 -222 -188 -150 -133 -138 -144 -124 -82 -46 -33 -34 -33 -26 -20 -24 -40 -67 -96 -112 -115 -118 -126 -129 -119 -104 -90 -69 -39 -20 -26 -46
6157d6j0Llj2j1npj2j2j4l0m2k4J4L4K6J6K9M0L1RLJ1J1oj8j5oj0k2l4l5k8qJ3K4J4jjJ0J7
$$ -46 -56 -53 -56 -68 -79 -84 -91 -103 -115 -129 -159 -201 -225 -211 -177 -151 -135 -106 -66 -35 -26 -23 -12 -1 -7 -25 -40 -46 -56 -78 -112 -147 -175 -183 -170 -146 -132 -133 -134 -124 -107
6139a07J3ONLpj8j2PK5J8qk7j9MK2K5K5L3L4K0JmJok9m6m1j3J1J8J5QJjknj3j1QL0L1J0pk
$$ -107 -94 -88 -83 -80 -87 -105 -117 -110 -85 -67 -75 -102 -121 -117 -95 -70 -45 -12 22 42 43 39 40 34 5 -41 -82 -95 -84 -66 -51 -43 -42 -43 -45 -50 -63 -74 -66 -36 -5 5 -2 -4
6120dJ1J2j1l0l1pJ4J5ok5k7j6j0j1j0KJ8K6K7K4J3j0l3l5j1J2J0j3k8j6J1L0K9J8PMJkqp
$$ -4 7 19 8 -22 -53 -60 -46 -31 -37 -62 -89 -105 -115 -126 -136 -134 -116 -90 -63 -39 -26 -36 -69 -104 -115 -103 -93 -106 -134 -150 -139 -109 -80 -62 -55 -51 -50 -52 -60 -67
6102f7LJ5J6NnlNNlmNJ7J3lk0k1oNLnj2rjPJ4K4K9L1K6J6Pnj0oPJ3%k6m5m0k0LOlj0lJj7m4
$$ -67 -64 -49 -33 -28 -33 -36 -31 -26 -29 -33 -28 -11 2 -1 -21 -42 -48 -43 -40 -45 -57 -66 -67 -60 -46 -22 7 38 64 80 87 82 72 66 73 86 86 60 15 -25 -45 -42 -36 -39 -49 -52 -51 -68 -112
6081a12n3k9RM1N5N6M4J9pk0k0j8j4nNJj3j9oJ7K5J1npMJ1NjKNnj9j8JJ0ok6k6j2oj7j9mJ5
$$ -112 -165 -194 -185 -144 -89 -33 11 30 23 3 -17 -35 -49 -54 -49 -48 -61 -80 -86 -69 -44 -33 -38 -45 -41 -30 -25 -26 -24 -19 -24 -43 -61 -60 -50 -56 -82 -108 -120 -126 -143 -162 -166 -151
6062a51J6MppjPJ3J7K0K7L3K4Lj7j9lJ8K7K3NqmRJ0mj1jJ7J7kk4l0j4J3L0K0j1k8j6LKj7k8
$$ -151 -135 -131 -138 -145 -146 -139 -126 -109 -89 -62 -29 -5 -2 -19 -38 -41 -23 4 27 32 24 20 29 39 35 24 23 40 57 55 31 1 -13 0 30 50 39 11 -5 -2 0 -17 -45
6043d5k0okjJlj8l0k0QL2L1J1j0j8j1NJ9K0J1MMQLnqnpk3l7l3j6j0j6j7kJ5J9J8K8M2L9J8
$$ -45 -65 -71 -73 -74 -73 -76 -94 -124 -144 -136 -104 -73 -62 -72 -90 -101 -96 -77 -57 -46 -42 -38 -30 -27 -32 -40 -45 -52 -75 -112 -145 -161 -171 -187 -204 -206 -191 -172 -154 -126 -84 -45 -27
6025b7Kqj9l4l6j9jKMK4M5L8%l6l4kK6K5OpjJ7K7K0MkRJ9Rj7l2k5j8k7m1l5j2jqnJ6K8Rj7
$$ -27 -25 -33 -52 -86 -122 -141 -142 -140 -136 -112 -67 -29 -29 -65 -99 -101 -75 -50 -44 -51 -52 -35 -8 12 16 14 23 42 51 34 2 -23 -41 -68 -109 -144 -156 -157 -165 -170 -154 -126 -117 -134
6006a34j5QJ5KnOJ6Mj3j2JOmk0k6k2oJ2K3K5K4K4K6K6K3J7Roj9k2j4ljj0j9j9rPK0K7K3Rj0
$$ -134 -149 -141 -126 -124 -129 -123 -107 -103 -116 -128 -127 -121 -125 -145 -171 -193 -199 -187 -164 -139 -115 -91 -65 -39 -16 1 10 4 -15 -37 -51 -54 -55 -65 -84 -103 -112 -105 -85 -58 -35 -26 -36
5987c6j8j9k3l2l4j7RJ6RLJ0J6J0%KJ2K4L1K9J2j2k7k3rPK7M7M7J6k9m6k9kJ0QLOOMmj0j3
$$ -36 -54 -73 -96 -128 -162 -179 -170 -154 -145 -142 -132 -116 -106 -106 -104 -92 -68 -37 -8 4 -8 -35 -58 -67 -60 -33 14 61 77 48 2 -27 -29 -19 -11 -8 -2 4 8 4 -6 -19
5969a9j8k4k7j3J0K2J1j1k5k5k0j4nLLj%QJ7K0K3K0J4KopkJ0K3K2Mj5j6l%j6k9j9OK1J0j7
$$ -19 -37 -61 -88 -101 -91 -69 -58 -69 -94 -119 -139 -153 -158 -155 -152 -153 -153 -145 -128 -108 -85 -65 -51 -49 -55 -62 -64 -54 -31 -9 -5 -20 -36 -39 -39 -55 -84 -103 -97 -76 -66 -83
5951h3l8m1k3LK1K5K3J8J0jj9l3k3J3N8O9L8nl0l9m1k9RN0N1J0k5k1kmk2k8j1RJ5J5J1Lqj6
$$ -83 -121 -162 -185 -182 -161 -136 -113 -95 -85 -86 -105 -138 -161 -148 -90 -21 17 12 -18 -57 -98 -127 -118 -68 -17 -7 -32 -53 -55 -59 -81 -109 -120 -111 -96 -81 -70 -67 -75 -91
5933i1j7j1KJ7K7L0K4J5Mrj9j8rmnmljlmmlLJ0Rjj0qmpmJ1L7N0M3K1lj9k1j1j%lKRMj3k3k0
$$ -91 -108 -119 -117 -100 -73 -43 -19 -4 0 -9 -28 -46 -55 -59 -64 -68 -71 -72 -75 -79 -83 -86 -83 -73 -64 -65 -75 -83 -87 -94 -98 -87 -50 0 43 64 61 42 21 10 9 9 6 8 17 21 8 -15 -35
5912c5j2nJM%okOLj5k0KK7K3kk1k2j7k1k5j7JJ5J5OjJPOnnJ2L1L4K4J7J9J1%lMJj7l1k4pk
$$ -35 -47 -52 -51 -47 -47 -53 -55 -49 -46 -61 -81 -79 -52 -29 -31 -52 -74 -91 -112 -137 -154 -153 -138 -123 -117 -118 -117 -110 -104 -109 -114 -102 -71 -37 -13 4 23 34 34 31 35 36 19 -12 -36 -43 -45
5892d5mRL8N4M0Rrj1j0j7k5k2j5j7k3k3j1jJmMK3L2J8j0k6j2QJ1knJ6L8L0Jj5lJ4J0j1k4k4
$$ -45 -49 -40 -2 52 92 101 92 81 71 54 29 7 -8 -25 -48 -71 -82 -83 -82 -86 -82 -59 -27 -9 -19 -45 -57 -49 -38 -40 -45 -29 9 39 40 25 22 36 46 35 11 -13
5874a3k0j5rmmmOJ9J4j4l5k0J3K5Lk2j8PJ9Pj0j3porkJ5K3J7J2K3L7K5qk5qJ2J5%oLJ2Lj2
$$ -13 -33 -48 -57 -61 -65 -69 -63 -44 -30 -44 -79 -99 -86 -61 -58 -80 -98 -91 -72 -65 -75 -88 -95 -101 -110 -112 -97 -74 -57 -45 -22 15 40 32 7 -1 11 26 26 20 23 35 38 26
5854B6k6l0j9%J2Mj5k2qQJ3J4J6Nk4n4n7l3JJ7J5%j1qOJ6J3NMPMno%M%kK%j0k0j5JJ9L2L4
$$ 26 0 -30 -49 -49 -37 -33 -48 -70 -78 -70 -57 -43 -27 -22 -46 -100 -157 -190 -189 -172 -157 -157 -168 -176 -170 -154 -141 -136 -132 -125 -121 -126 -132 -132 -128 -128 -130 -128 -128 -138 -158 -173 -172 -153 -121 -87
5835h7J9qk3j5KJj4j6mLorNK4K9K3K8L6K6Mj5j3j3j9j8jJ4J2MQK0J7NkKkj9l8m1k4ML3M4K4
$$ -87 -68 -76 -99 -114 -112 -111 -125 -141 -145 -142 -148 -157 -152 -128 -99 -76 -48 -12 14 18 3 -10 -23 -42 -60 -61 -47 -35 -31 -23 -3 14 19 17 19 17 -2 -40 -81 -105 -101 -68 -24 0
5815@rl1k7j8k3l5l0j1OQJoj0nJ0K1J7J1K4M6N3L0Jj9l0m1m0k0OK0J8J1Q%j2k1k1j1jOJ1K0
$$ 0 -9 -40 -67 -85 -108 -143 -173 -184 -178 -170 -169 -175 -185 -190 -180 -159 -142 -131 -107 -61 -8 22 23 4 -26 -67 -107 -127 -121 -101 -83 -72 -64 -64 -76 -97 -118 -129 -130 -124 -113 -93
5797i3K8K2Jj7j9nO%j3k1j7oRK4L1L3L2K6J7Jj0j1lkj2k2k3qJ1J6lk4k1PL1K4ql3l1j0Krk6
$$ -93 -65 -43 -42 -59 -78 -83 -77 -77 -90 -111 -128 -134 -125 -101 -70 -37 -5 21 38 39 29 18 15 13 1 -21 -44 -52 -41 -25 -28 -52 -73 -66 -35 -11 -19 -52 -83 -93 -91 -100 -126
5779a26l2j6OJ3PNJ6K6J9JqJJ5K2K4K1J3QQJ3J7J2Knj4k0k4j9j3qlJ0K9L5K3ok8k9j9j3j5
$$ -126 -158 -174 -168 -155 -148 -143 -127 -101 -82 -81 -89 -88 -73 -51 -27 -6 7 15 23 36 53 65 67 62 48 28 4 -15 -28 -36 -39 -29 0 35 58 52 24 -5 -24 -37 -52
5761e2j0NJ2Mj1j5qOK2M2M8K7j2l9m0l0k2j6rkMJ2J5Nj1j4qj2l4n0l9j1QJ3J5J3NkMJ5J8Q
$$ -52 -62 -57 -45 -41 -52 -67 -75 -69 -47 -5 43 70 58 19 -21 -51 -73 -89 -98 -100 -96 -84 -69 -64 -75 -89 -97 -109 -143 -193 -232 -243 -235 -222 -207 -194 -189 -191 -187 -172 -154 -146
5743a46KPJ0LjRK6K9J2rj9j0NJ1RPJ4K0Pj8l6l6k2j1mKPJ4K1K4J6nj6JL1M5K4lj4o%qj8j6
$$ -146 -144 -137 -127 -124 -125 -116 -90 -61 -49 -58 -77 -87 -82 -71 -62 -55 -41 -21 -14 -32 -68 -104 -126 -137 -141 -139 -132 -118 -97 -73 -57 -62 -78 -77 -46 -1 23 20 6 0 0 -8 -26 -42
5724d2oOJ6K6K0ll3m8l2oQJj1qJ3L7M5K8Kj6k3j8j2qj0j6k0j8qMOjj2k6l3k9j6KK1L7M3L7
$$ -42 -48 -42 -26 0 20 17 -16 -64 -96 -102 -94 -93 -104 -112 -99 -62 -17 11 13 -3 -26 -44 -56 -64 -74 -90 -110 -128 -136 -132 -126 -127 -139 -165 -198 -227 -243 -241 -220 -183 -140 -103
5705a03K3J4Rkj9k7j4OJ8J9J4J4J4J6J0kj5j6lJ1J2ONRJ0QJlnKJ5K2Rj9l7l0nJ4J3MjNRLk
$$ -103 -80 -66 -57 -59 -78 -105 -119 -113 -95 -76 -62 -48 -34 -18 -8 -10 -25 -41 -44 -33 -21 -15 -10 -1 9 17 18 15 10 12 27 49 58 39 2 -28 -33 -19 -6 -2 -3 2 11 14 12
5686A2LJj8m8m8j8J0J1MJ6M2M8K9PKRJ1Mj5l7m2k3OK1J3Kjjrj3oJ3K8L9L0Ml2n0m0j6QJ8J5
$$ 12 15 16 -2 -50 -98 -116 -106 -95 -91 -75 -33 15 44 51 53 62 73 77 62 25 -17 -40 -34 -13 0 2 1 0 -9 -22 -28 -15 13 52 82 86 54 4 -36 -52 -44 -26 -11
5667a1Mnm%MJ2K6K4nl9l9j3jj9l7k7jJ2J4J6J0j4l8l3rNOMKpj5KK9L2Nj8qJ5K1J3J1K2L3L2
$$ -11 -7 -12 -16 -16 -12 0 26 50 45 6 -33 -46 -47 -66 -103 -130 -131 -119 -105 -89 -79 -93 -131 -164 -173 -168 -162 -158 -156 -163 -178 -176 -147 -115 -110 -128 -136 -121 -100 -87 -76 -54 -21 11
5648A1K8J5jj4j7j2rprj1k3l8m0k6rjMJ7K8K6Rn%RMj4k8j8LJ6J2KLJ7L1L1J8J0J5K5K5Qro
$$ 11 39 54 53 39 22 10 1 -6 -15 -26 -49 -87 -127 -153 -162 -163 -159 -142 -114 -88 -79 -84 -84 -75 -71 -85 -113 -131 -128 -112 -100 -98 -95 -78 -47 -16 2 12 27 52 77 85 76 70
5629G0J5K9K1pl5n0n1m7k8LL6M4K6LNK3K6Lj8k0j3j5j7nJ1Qj6k6rJ9K6J4JLJ4J6PkmjjnjQ
$$ 70 85 114 135 128 93 43 -8 -55 -83 -80 -44 0 26 29 34 57 83 86 68 48 35 20 3 -2 9 17 1 -25 -34 -15 11 25 26 29 43 59 66 64 60 59 58 53 52 60
5610F0J4Nj3l2m6m6k4J6M3M2K7J1Jj2k2j7qj2k6k9j3OPpk1k5k4k1k0j6oJ3L0K7Pj5j9j0jJ
$$ 60 74 79 66 34 -12 -58 -82 -66 -23 19 46 57 58 46 24 7 -1 -13 -39 -68 -81 -75 -68 -75 -96 -121 -145 -166 -186 -202 -208 -195 -165 -138 -131 -146 -165 -175 -176 -175
5593a75JKOJ0J0J1J7K6K9J9OjorpQK1J8Njoj7k8k5j2jMJ5K3J4mnJ1J7lj4JK5K5RKJ4K7K5J1
$$ -175 -174 -172 -166 -156 -146 -135 -118 -92 -63 -44 -38 -39 -45 -54 -61 -53 -32 -14 -9 -10 -16 -33 -61 -86 -98 -99 -95 -80 -57 -43 -47 -52 -41 -24 -27 -41 -40 -15 10 19 21 35 62 87 98
5573I8nj4j6k0l0l4k2kNlrjPRPLj2k3j2J9L8L6L9N1M5J5olnj8j7J2L9N5R6J58J94K23L63O09
$$ 98 93 79 63 43 13 -21 -43 -45 -40 -43 -52 -53 -46 -37 -30 -27 -39 -62 -74 -55 -17 19 58 109 154 169 163 160 155 137 120 132 171 226 322 480 674 897 1260 1869
5556A869P01L87k00o26o39m13k51k13j78r9n4o7o8k6Qjk0j7j0j4j3PK1J4OJ0J0ok2j8pmj2
$$ 1869 2570 2957 2757 2131 1492 1079 828 615 437 338 284 217 149 123 131 130 110 93 83 69 56 63 84 98 104 114 124 118 96 78 71 67 55
5541E5j9k0j3JJ6J6RLM%j0j4j7k9m5l9mK4K9J5QKmlJ2K1J3QK1L8L1kl2l7l1k9l2k8j1J1K6
$$ 55 36 16 3 4 20 36 45 48 52 52 42 28 11 -18 -63 -102 -106 -82 -53 -38 -30 -28 -32 -35 -23 -2 11 19 40 78 109 107 75 38 7 -22 -54 -82 -93 -82 -56
5524e6K8J2j0k1j5mok1l3k4jJ4J4RJ1J5J0K%Kmj7j8KK0J6qk6k4oJ2J9J4jj2j7k0k7k4j0LM
$$ -56 -28 -16 -26 -47 -62 -66 -72 -93 -126 -150 -151 -137 -123 -114 -103 -88 -78 -76 -76 -74 -78 -95 -113 -111 -91 -75 -83 -109 -133 -139 -127 -108 -94 -95 -107 -124 -144 -171 -195 -205 -202 -198
5505a98%J3L3M5M8N2N2L0ok1JK9K6%j7j9j8k0j0ORnj6pJrk7k3KK4K6J4JlLJ6J9Kk4l4k3n%
$$ -198 -198 -185 -152 -107 -59 -7 45 75 69 48 49 78 104 104 87 68 50 30 20 26 35 30 14 7 8 -1 -28 -51 -49 -25 1 15 16 13 16 32 51 53 29 -5 -28 -33 -33
5487c3nj4k0j5MK8L1J3nojnj2mJ5K7K8K7J7ml0l4j3Llj4j2LNqk4k4j0RK4K7J9P%KMnk1l5l2
$$ -33 -38 -52 -72 -87 -83 -55 -24 -11 -16 -22 -23 -28 -40 -44 -29 -2 26 53 70 66 36 2 -11 -8 -11 -25 -37 -34 -29 -37 -61 -85 -95 -86 -62 -35 -16 -9 -9 -7 -3 -8 -29 -64 -96
5467i6j7mlj0j7k1k0j3n%ljJ0K2J9NopokPJ4J0mqJJ2RjkNJ5K1K7L1K9K3J1j2l3m2k8mJ5K3
$$ -96 -113 -117 -120 -130 -147 -168 -188 -201 -206 -206 -209 -210 -200 -178 -159 -154 -160 -167 -173 -175 -168 -154 -144 -148 -156 -155 -143 -134 -135 -137 -132 -117 -96 -69 -38 -9 14 25 13 -20 -62 -90 -94 -79 -56
5448e6K1Rrk1j9oKMLLLKmj5k4j5J2K9K1ql3m4m2l4j1J8L7M3L8K9J8Okk%J%nj5k3j7OK4K1M
$$ -56 -35 -26 -35 -56 -75 -81 -79 -75 -72 -69 -66 -64 -68 -83 -107 -122 -110 -81 -60 -68 -101 -145 -187 -221 -232 -214 -177 -134 -96 -67 -49 -43 -45 -47 -47 -46 -46 -51 -66 -89 -106 -100 -76 -55 -51
5428e1qj1rj0rkQJ1Okpnoj4k0j8jJ9L1K6J0lLK0K9J5ok2l1m0m2k4J1L8M0L1K4J8Mpj1qrj1
$$ -51 -59 -70 -79 -89 -98 -100 -92 -81 -75 -77 -84 -89 -95 -109 -129 -147 -148 -129 -98 -72 -62 -65 -62 -42 -13 2 -4 -26 -57 -97 -139 -163 -152 -114 -74 -43 -19 -1 3 -4 -15 -23 -32 -43
5409d3lOJ0RJ5K5L0J9Kj1j7k1k1k6m1n7n2k4LQPJ8L4L1PqLK9M3L6J6ok1k5k1k0k2j4J3M0M3
$$ -43 -46 -40 -30 -21 -6 19 49 68 70 59 42 21 0 -26 -67 -124 -176 -200 -197 -189 -182 -164 -130 -99 -92 -100 -97 -68 -25 11 27 21 0 -25 -46 -66 -88 -102 -89 -49 -6
5391fK3Krj0j1o%Jpj2n%%LJ6K5J4j4l5l4j6lNJ3L0M0L4Pk3l2k3nMMOJ3J8K1K2J8J3O%oj2j6
$$ -6 17 19 10 0 -11 -17 -17 -16 -23 -35 -40 -40 -40 -37 -21 4 18 4 -31 -65 -81 -84 -79 -66 -36 4 38 45 22 -10 -33 -38 -34 -30 -24 -11 7 28 50 68 81 87 87 81 69 53
5372E3j3j4k1k2pJ8K9K1Okpj7k5j9%J6K1K1J6PjnnnlMJ3J4RNRRmk0k0lOjj7j7lOqk5k4JK4
$$ 53 40 26 5 -17 -24 -6 23 44 50 48 41 24 -1 -20 -20 -4 17 38 54 61 60 55 50 45 42 46 59 73 82 87 96 105 101 81 61 58 64 63 46 29 26 32 24 -1 -25 -24 0
5351@L3K4Rql0m6n0l6j4KPOPJ3K2K5J7%k1l0k0MK0J0j7l1j9OK4L0L4L5L3J8jj2j4onj8l4l7
$$ 0 33 57 66 58 28 -18 -68 -104 -118 -116 -109 -103 -96 -83 -61 -36 -19 -19 -40 -70 -90 -86 -66 -56 -73 -104 -123 -117 -93 -63 -29 6 39 57 56 44 30 24 19 1 -33 -70
5333g0k5j5j7j6LL5M9L7J7QJ6J7Mj7k7k2j1pj1pNJ6Pj3k1j0RK1K6L1L3K2kk5k7rJ1J7Lj0n
$$ -70 -95 -110 -127 -143 -140 -105 -56 -19 -2 6 22 39 43 26 -1 -23 -34 -41 -52 -59 -54 -38 -31 -44 -65 -75 -66 -45 -19 12 45 67 65 40 13 4 15 32 35 25 20
5315B0J6L4L4J4j2l5m1l3k9l1k9nK9L8J4j1qJ0J2pj9j3KJ1J9K6K8J0k0l3l0j3%RJ7K6L1K8
$$ 20 36 70 104 118 106 71 30 -3 -32 -63 -92 -97 -68 -30 -16 -27 -35 -25 -13 -20 -39 -52 -50 -39 -20 6 34 44 24 -9 -39 -52 -52 -43 -26 0 31 59
5299E9J0j5l4l4j7RK8L7L5K9J9Rnj4j7j4j4j9k0j0%kj5j9j0MRJ0K0K8J4j9m7n5m4k3LK5L4
$$ 59 69 54 20 -14 -31 -22 6 43 78 107 126 135 130 116 99 85 71 52 32 22 22 20 5 -14 -24 -20 -11 -1 19 47 61 42 -5 -60 -104 -127 -124 -99 -65
5282f5K9K3J5Nqj5j1j1k0k5j5mj0k4k5j3JRJ8K1J0oj1lKjjJ0J5NkMJ6K1K3K3J5lj8j4knk0
$$ -65 -36 -13 2 7 -1 -16 -27 -38 -58 -83 -98 -102 -112 -136 -161 -174 -173 -164 -146 -125 -115 -121 -132 -135 -133 -134 -135 -125 -110 -105 -107 -103 -87 -66 -43 -20 -5 -8 -26 -40 -42 -47 -67
5263f7k8k0j1j0r%J6K8L4L3K8J4nk9m4l9j8pj3k1j3NJ7J8K6L9M0J5j7l1j8MJ8J2lk0k5k1j4
$$ -67 -95 -115 -126 -136 -145 -145 -129 -101 -67 -34 -6 8 3 -26 -70 -109 -127 -134 -147 -168 -181 -176 -159 -141 -115 -76 -36 -21 -38 -69 -87 -83 -65 -53 -56 -76 -101 -122 -136
5246a36p%jj8m2m2qL5M8L1J1L%orjRJ2J2J8K3J5j2l6m6l9l3l2k7j0J6L1K5OoJ1M5N9L5pk4
$$ -136 -143 -143 -144 -162 -204 -246 -254 -219 -171 -140 -129 -126 -126 -132 -141 -142 -133 -121 -109 -91 -68 -53 -65 -101 -147 -186 -219 -251 -278 -288 -272 -241 -216 -210 -216 -205 -160 -101 -66 -73 -97
5228i7oK2K8J4NOJ0J1J5K9L4K2LrlQJ4J0rl4m9l7pJ6J1j1k7j4J8M3M6K6Mpqj1k1l1k9j8pl
$$ -97 -103 -81 -53 -39 -34 -28 -18 -7 8 37 71 93 96 87 84 92 106 116 107 73 24 -13 -20 -4 7 -4 -31 -45 -27 16 62 88 92 85 77 66 45 14 -15 -33 -40 -43
5210d3kLJ4K1J7%k2l6k4PL0L1J1pj3j8k2k6k1j3lQJ3J1JkJ0K4K8K3J6Lj4k7k8j3jlj1rJKj0
$$ -43 -45 -42 -28 -7 10 10 -12 -48 -72 -65 -35 -4 7 0 -13 -31 -53 -79 -100 -113 -116 -108 -95 -84 -83 -85 -75 -51 -23 0 16 19 5 -22 -50 -63 -64 -67 -78 -87 -86 -84 -94
5192i4k6k8j3OJ1Kj2j8j7k0k3j3RL2M0L0J6PMMMJoj0j0lQK3L1K9J1j9m5n3l9j2PJ2J0RJ2J6
$$ -94 -120 -148 -161 -155 -144 -142 -154 -172 -189 -209 -232 -245 -236 -204 -164 -134 -118 -111 -107 -103 -99 -98 -104 -114 -124 -127 -119 -96 -65 -36 -25 -44 -89 -142 -181 -193 -186 -174 -164 -155 -143 -127
5173a27K3L1K5nm1m9k0K0L5K3J0J0K1L0L4L0J2j9m1m2l0j7j4j2q%OJ2J6J5Pj0k2k2j1J1L3
$$ -127 -104 -73 -48 -53 -94 -143 -163 -143 -108 -85 -75 -65 -44 -14 20 50 62 43 2 -40 -70 -87 -101 -113 -121 -121 -115 -103 -87 -72 -65 -75 -97 -119 -130 -119 -86
5157h6M3L1NrkJ7K9L3K9J6ql5m2k7j6j8j9mJ5K1J1MKjrj4nJ0J9J0qj9j2LJ1Ojjkj3k6k1nO
$$ -86 -43 -12 -7 -16 -18 -1 28 61 90 106 98 63 21 -6 -22 -40 -59 -63 -48 -27 -16 -12 -10 -11 -20 -34 -39 -29 -10 0 -8 -27 -39 -36 -25 -19 -20 -21 -23 -36 -62 -83 -88 -82
5138h2PORJ2Npj2j4j1mOJ0PLNJ8L3M1L6J2k1m1m1l8l5l4k2kJ6L0L7L8K9J0pj9k2qJ4L0K8J6
$$ -82 -75 -69 -60 -48 -43 -50 -62 -76 -87 -91 -85 -75 -68 -65 -60 -42 -9 32 68 80 59 18 -23 -61 -96 -130 -152 -154 -138 -108 -71 -33 -4 6 -1 -20 -42 -50 -36 -6 22 38
5120C8Joj1j1oKKkjMO%lLMnj5qKJj0j3%J0MmKJ6K4J4kj3j9j7j5j2j8k1j8rrj2kJ8K7J7MNJ4
$$ 38 39 33 22 11 5 7 9 7 6 10 16 16 13 16 20 15 0 -8 -6 -5 -15 -28 -28 -18 -14 -18 -16 0 24 38 36 23 4 -13 -28 -40 -58 -79 -97 -106 -115 -127 -129 -111 -84 -67 -63 -58 -44
5099d4J4RQJ2J2PJ%llLJ0Jj4j5jJ1Mj4k1oQQ%lMRJj6k3qJ6L0K4J6J3J1Jj6k7j9KJ8J6mk2k2
$$ -44 -30 -21 -13 -1 11 18 19 19 16 13 16 26 27 13 -2 -3 8 12 -2 -23 -29 -21 -13 -13 -16 -12 -3 -2 -18 -41 -49 -33 -3 21 37 50 61 62 46 19 0 2 20 36 32 10 -12
5079a2qKJmJJ1J4Pj0l0m3l2lK4L0K2J9K4K6J3ok3l4l2j0K3M0L6J5jj1k3l3l2j4NQrk3j9lN
$$ -12 -20 -18 -17 -21 -20 -9 5 12 2 -28 -71 -103 -106 -82 -52 -30 -11 13 39 52 46 23 -11 -43 -53 -30 10 46 61 60 49 26 -7 -39 -53 -48 -40 -49 -72 -91 -94 -89
5060h9qk3k0KK8L9L4J6qk6k4KL0L6J2j6l2k6j5j1j7k1j0RK5K8K2Poj5j1KJ7K7K8J9Rjqj8l7
$$ -89 -97 -120 -140 -138 -110 -71 -37 -21 -29 -55 -79 -77 -47 -11 1 -15 -47 -73 -88 -99 -116 -137 -147 -138 -113 -85 -63 -56 -62 -77 -88 -86 -69 -42 -14 5 14 13 5 -13 -50
5043e0m5k5J3L5K7OJRRmj5j3l%MPOrk7l4k3oMJ0J3J1pl1m1k7lJ2J3J7K4K3Kj8j3QJ9Oj3j0
$$ -50 -95 -120 -107 -72 -45 -39 -38 -29 -20 -24 -39 -52 -55 -55 -51 -44 -38 -47 -74 -108 -131 -137 -133 -123 -110 -99 -106 -137 -178 -205 -208 -196 -183 -166 -142 -119 -117 -135 -148 -140 -121 -115 -128 -138
5023a38QJ8Rmppj0j2oK%olJ0J5MlLJ2J3QJ0J4PKPJ8J7%j4j8j2p%N%j5k7k2j0JLlrpPK0J8P
$$ -138 -130 -112 -103 -107 -114 -121 -131 -143 -149 -147 -147 -153 -156 -146 -131 -127 -130 -127 -115 -102 -94 -84 -70 -63 -61 -54 -36 -19 -19 -33 -51 -63 -70 -70 -65 -65 -80 -107 -129 -139 -138 -135 -138 -147 -154 -147 -127 -109 -102
5002a02RK4K5ol9m1j3J1J4J1J7J8Jk6m1l4j2PJ3J6K5M2M0Pk7l2j2MMOJ8K8K2J7K2K8J2j3j8
$$ -102 -93 -69 -44 -50 -89 -130 -143 -132 -118 -107 -90 -72 -71 -97 -138 -172 -184 -177 -164 -148 -123 -81 -41 -34 -61 -93 -105 -101 -97 -91 -73 -45 -23 -6 16 44 56 43 25
4985B5lKj1k1pJ6K1ll1m4l5k1pOJ8K3J7QKJQJ9K5J5pk1j7jQROOok4l2k0rj1j9k0j2qj1j0M
$$ 25 22 24 13 -8 -15 1 22 19 -12 -56 -91 -112 -119 -113 -95 -72 -55 -47 -45 -44 -36 -17 8 23 16 -5 -22 -23 -15 -6 0 6 0 -24 -56 -76 -85 -96 -115 -135 -147 -155 -166 -176 -172
4966a72K6M6N0L4J0j3k3k7k0nJ6K7J6rl0m1l8j4K6O1O1K8oj7qKNOJ5K3J7Kj1j2pnj4l0m1m3
$$ -172 -146 -100 -50 -16 -6 -19 -42 -69 -89 -94 -78 -51 -35 -44 -74 -115 -153 -167 -141 -80 -19 9 3 -14 -22 -20 -15 -9 6 29 46 48 37 25 18 13 -1 -31 -72 -115
4948a15k3J3M5M8K2nj6j3oMJ8K7K1RLKJjkqj7k1mK4M4L7J6jnJ1L2M2L9L2M4O7Q1Q1Q8J14J65
$$ -115 -138 -125 -80 -32 -10 -15 -31 -44 -50 -46 -28 -1 20 29 32 34 35 34 32 24 7 -14 -18 6 50 87 103 102 97 108 140 182 221 253 297 364 445 526 614 728 893
4931H93K29K83K79J80Nj62k50k53k18j83j52j22r5p2m9k7k0l2m9n4m3k9k1j2OK5L1J5j1l2
$$ 893 1122 1405 1684 1864 1869 1707 1457 1204 986 803 651 529 434 362 313 286 266 234 185 131 88 59 38 26 32 57 88 103 92 60
4918F0m1l7k5%K6L6K8J3Kpj7j6KK4L3K6J1lrn%mj2j5okj1k4k7j8j4j3rjJ%LJrk2j7J5M5M8
$$ 60 19 -18 -43 -43 -17 19 47 60 62 55 38 22 24 48 81 107 118 115 106 101 101 97 85 70 64 62 51 27 0 -18 -32 -45 -54 -55 -54 -54 -51 -50 -59 -81 -98 -83 -38 10
4899A0K7jj4j2ppj0JK3L7J9j8l9l0pJ0J5J8K3K3J2ok9l9l4j3MJ1J6J9K0J4J1J0%j9l4l2k6
$$ 10 37 36 22 10 3 -4 -14 -13 10 47 66 48 9 -21 -28 -18 -3 15 38 61 73 67 38 -1 -35 -48 -44 -33 -17 2 22 36 47 57 57 38 4 -28 -54
4882e4k6k2nJ6K4J8RQJ2J5J5J1KprkQJ7K2J1oj3JJ3Mj8k3rPQK%%kkrj6j7LK9L6J8jmmj8l2
$$ -54 -80 -102 -107 -91 -67 -49 -40 -32 -20 -5 10 21 23 16 7 5 13 30 52 63 57 44 45 58 62 44 21 12 19 27 29 29 29 27 25 16 0 -17 -14 15 51 69 68 64 60 42 10
4861A0k7j6j1j0kJ4K0J5QOknJK1K2Kk2k8k0rJJ3K0K2J2jj0mJ5K9J8j6m1l0MK4J9lj6j3ooj7
$$ 10 -17 -33 -44 -54 -56 -42 -22 -7 1 7 5 0 1 22 44 46 24 -4 -24 -33 -32 -19 1 23 35 34 24 20 35 64 82 66 25 -5 -1 23 42 39 23 10 4 -2 -19
4843a9l2l1j0J8L4L3K5J9Pj1j8pRPnj2qrk1l5l1j6KJ3K3K9L0K0Qoj5k3k7k4j4NK1K1Oj3j8
$$ -19 -51 -82 -92 -74 -40 -7 18 37 44 33 15 8 17 24 19 7 -1 -10 -31 -66 -97 -113 -111 -98 -75 -46 -16 4 12 6 -9 -32 -59 -83 -97 -92 -71 -50 -44 -57 -75
4825g5j4rnOK4L5L8L8L6K8J3KLOjj2qJ2K6J8ql4m2l0j1JKMJ2J9J8Plj1j5j4nLkj7k4pJ8L0
$$ -75 -89 -98 -103 -97 -73 -38 0 38 74 102 115 117 120 126 125 113 105 117 143 161 153 119 77 47 36 37 39 43 55 74 92 99 96 85 70 56 51 54 52 35 11 4 22 52
4806E2K2Kj0j0nj1k8m2l2LL0K5kj8lK2K6Jl2m4k4QK5J9Mj0k0k3j4J3M3N0L3R%K%rj7j7j1p
$$ 52 74 76 66 56 51 40 12 -30 -62 -59 -29 -4 -6 -24 -27 -5 21 22 -10 -54 -78 -70 -45 -26 -22 -32 -52 -75 -89 -76 -33 17 50 59 59 61 61 52 35 18 7 0
4788@rrkOMnj5j4nOJ5K4K7K1Kj6k5j9qRJ8J6jk0l1k5oJ3K4J7ok4k4pPQPJ1J1qm1o3n1j6K0
$$ 0 -9 -18 -20 -14 -10 -15 -30 -44 -49 -43 -28 -4 23 44 46 30 5 -14 -22 -13 5 21 20 0 -31 -56 -62 -49 -25 -8 -14 -38 -62 -69 -62 -54 -47 -36 -25 -33 -74 -137 -188 -204 -184
4768a84N0P3Q1O7L4PNJ9K3Pk0l8l8k5j0oj1j6j5j0j4k3k0OL4L8J2k1k8pK1L3K5Pj3k7k9k7
$$ -184 -134 -61 20 87 121 128 133 152 175 182 162 124 86 61 51 45 34 18 3 -7 -21 -44 -64 -58 -24 14 26 5 -23 -30 -9 24 49 56 43 16 -13 -40
4752d0j8j0mNJ1J2J3J1Kj4k7k0LK2K4J6Lj9m4n4l7qJ0J5J9K7K9K3J9J9J5J3J3J7J2rk5k8k3
$$ -40 -58 -68 -72 -67 -56 -44 -31 -20 -18 -32 -59 -79 -76 -54 -30 -14 -11 -30 -74 -128 -165 -173 -163 -148 -129 -102 -73 -50 -31 -12 3 16 29 46 58 49 24 -4 -27
4735b7k3k3j6oOJ4J8J3mk2k7k2j8j0J0L1L5J2k1m0m0k7rLOJPK6M7N2L3Oj1j0jJpj4j0%kj4
$$ -27 -50 -73 -89 -95 -89 -75 -57 -44 -48 -70 -97 -119 -137 -147 -137 -106 -71 -59 -80 -120 -160 -187 -196 -193 -187 -186 -179 -153 -106 -54 -21 -15 -26 -36 -37 -36 -43 -57 -67 -67 -69 -83
4717h3j2RK7K6J3J0K1L1K2Ooj4j8j1PJ7J0qj4kQPlnmqj4j1JQKj2j8k0j8j2PL0L9L5K5K0Qj6
$$ -83 -95 -86 -59 -33 -20 -10 11 42 64 70 64 50 32 21 28 45 55 47 33 31 39 46 43 38 34 26 12 1 2 10 12 0 -18 -38 -56 -68 -61 -31 8 43 68 88 96 80
4697H0l7m1k2KJ9L0K7J4Lmj0k3l3k5%J6J1LJ3L9N4L5ll0k9j2mj2l1m0l4j5PJ4Kj8k2lK7L9
$$ 80 43 2 -20 -18 1 31 58 72 75 71 61 38 5 -20 -20 -4 7 10 23 62 116 151 148 118 89 77 73 61 30 -10 -44 -59 -52 -38 -36 -54 -76 -79 -52 -13
4680a3K9J1qk0j9lJ2J1%MJ1Lj7j8LJ4ql9l4%K3K2J1%j6l4l0nJ8K6L3M5M7K3j0l0l3k7j6NK0
$$ -13 16 27 19 -1 -20 -23 -11 0 0 4 15 18 1 -17 -14 0 -8 -47 -81 -81 -58 -36 -25 -25 -41 -75 -105 -110 -92 -66 -33 12 59 82 72 42 9 -18 -34 -29 -9
4662iJ2nj5j1n%QJ3Lj1j0NRloJ3L9L9Pk9m1l0j4rj3j7lK2M2M0J9j5m4n6l9MM9O6N4K4nj8k0
$$ -9 3 -2 -17 -28 -33 -33 -25 -12 -9 -20 -30 -25 -16 -19 -25 -12 27 66 73 44 3 -27 -41 -50 -63 -80 -83 -61 -19 21 40 25 -19 -75 -114 -110 -61 5 59 83 78 60 40
4644D0j4pj%oj2j3rlMRJ2J6J6J4Q%j2j9k3k6k6j7jJ1J5J5K0J5rm6o3m2pJ8K9L4L3K4J0Jpj6
$$ 40 26 19 18 18 12 0 -13 -22 -25 -21 -12 0 16 32 46 54 54 42 23 0 -26 -52 -69 -70 -59 -44 -29 -9 6 -3 -49 -112 -154 -161 -143 -114 -80 -47 -23 -13 -12 -19 -35
4625c5j7lK1L2K5J7J5J1j0l5m5k8KK2J6%rkKnj6j5nkjJ3M1N6M1Rj1qjrk6m0l8k7j1lj1k6k6
$$ -35 -52 -55 -34 -2 23 40 55 66 56 21 -24 -52 -50 -28 -12 -12 -21 -23 -21 -26 -42 -57 -62 -64 -65 -52 -11 45 86 95 84 76 75 66 40 0 -38 -65 -76 -79 -90 -116 -142
4606a42oK4M0L5K0QMNNKnpm%jrj3j0nnmMJ7K5L0L7L8K4Jj4j5j4j8k4k5k4k1qJ5L2K5Oj0j3
$$ -142 -148 -124 -84 -49 -29 -21 -17 -12 -7 -5 -10 -17 -21 -21 -22 -31 -44 -54 -59 -64 -68 -64 -47 -22 8 45 83 107 108 94 79 65 47 23 -2 -26 -47 -55 -40 -8 17 23 13 0
4587@j4j0LJ2Kk2l0j0J3J5PQJ8J7Lj3k4k3j5jJ6K0J0nr%Moj7j2QK1J4rk3k0j5j6j9j4lJ3L1
$$ 0 -14 -24 -21 -9 -7 -29 -59 -69 -56 -41 -34 -26 -8 9 12 -1 -25 -48 -63 -64 -48 -28 -18 -23 -32 -32 -28 -34 -51 -63 -55 -34 -20 -29 -52 -72 -87 -103 -122 -136 -139 -126 -95
4569i5M9N4M2J8%ljJ%kJJmj3j3mKj3l6m4k6%Qnj6j0J4M2N7N5L4Ok0l8m1l1j4rj3oK0M4M2K1
$$ -95 -46 8 50 68 68 65 64 65 65 63 64 65 61 48 35 31 33 20 -16 -60 -86 -86 -78 -83 -99 -109 -95 -53 4 59 93 99 79 41 0 -31 -45 -54 -67 -73 -53 -9 33 54
4550E4jrj0onj4k9l4j0K0K3kk7k6rQJ7J4Jj4j1LMj3k2qMmj8nK2L0J0j4j7mMLlpnMK0L2L4K0
$$ 54 53 44 34 28 23 9 -20 -54 -64 -44 -21 -23 -50 -76 -85 -77 -60 -46 -45 -59 -70 -67 -63 -76 -98 -106 -102 -106 -124 -129 -107 -77 -67 -81 -98 -102 -98 -95 -98 -105 -110 -106 -86 -54 -20 0
4530@kk4k9j1J1K2K0J3NklJ4L4K9om0m9l5k1j9k3j7%J8K1RpmJ4K8K2Lj0r%RJ0Jj2j9j9j9j7
$$ 0 -2 -26 -55 -66 -55 -33 -13 0 5 3 0 14 48 77 71 31 -18 -53 -74 -93 -116 -133 -133 -115 -94 -85 -92 -96 -82 -54 -32 -29 -39 -48 -48 -39 -29 -28 -40 -59 -78 -97 -114
4511a14qRK0J5LLJ0J1Lrj5j7j1OL0M2K9J0KM%j2j5oORJ4K0J7MnNK1J7ql3l6k4j0QK2K3J0J
$$ -114 -122 -113 -93 -78 -75 -72 -62 -51 -48 -57 -72 -89 -100 -94 -64 -22 7 17 19 23 23 11 -4 -10 -4 5 19 39 56 60 55 60 81 98 90 57 21 -3 -13 -5 17 40 50 51
4492E1J0K4K2Mrj3j7l4n2n4l3jJ5Oj5k0kK4L8L4K0kk1k5pJ5K3J5MMJ2K6L9L2lm4n3k6LJ2J1
$$ 51 61 85 107 111 102 89 72 38 -14 -68 -101 -102 -87 -81 -96 -116 -118 -94 -56 -22 -2 -4 -25 -50 -57 -42 -19 -4 0 4 16 42 81 113 110 66 13 -13 -10 2 13
4474A3J0Opj5mPmk0j7PK7K5Rj0k3j9lJ5J9Lj6k4j3J0K9K7Lj5j3rk4m6m9k7kJ4K3L0K2Jj3k
$$ 13 23 29 22 7 3 10 6 -14 -31 -24 3 28 37 27 4 -15 -18 -3 16 19 3 -21 -34 -24 5 32 35 20 7 -2 -26 -72 -121 -148 -150 -136 -113 -83 -61 -60 -73 -75
4456g5J7K4J7Lrj8j3NJ6RljJ0J3Knjjj1k1j4NK4K7J9J2OORJ4J4Kj8l5l6k6pJ5L7N3M6K2jj8
$$ -75 -58 -34 -17 -14 -23 -41 -54 -49 -33 -24 -27 -28 -18 -5 -3 -8 -9 -10 -21 -42 -56 -51 -27 0 19 31 37 43 52 66 80 82 64 29 -7 -33 -40 -25 12 65 111 133 132 114
4437A14l1m2l6qJ6J8ql5m6l7j8KJ2Prk0j2LPkj5k1j8j1LK0L1K3%j7j1J0K4J9OLJ3K4K7J5m
$$ 114 83 41 5 -3 13 31 23 -12 -58 -95 -113 -111 -99 -92 -101 -121 -133 -130 -123 -125 -140 -161 -179 -190 -187 -167 -136 -113 -113 -130 -141 -131 -107 -88 -82 -79 -66 -42 -15 0 -4
4419dk9m3l4rJ0J4RJ1J6J4ONJ6K4J2j4k4j3jpj9j5%%j9k6%L7M6K6Konrj2oPJ4J0OORJ5J6J4
$$ -4 -33 -76 -110 -119 -109 -95 -86 -75 -59 -45 -39 -34 -18 6 18 4 -20 -33 -34 -41 -60 -75 -75 -75 -94 -120 -120 -83 -37 -11 -9 -15 -20 -29 -41 -47 -40 -26 -16 -10 -4 5 20 36 50
4400E0Opk2l2l5k6j6mOJ4J6J4J0J0P%mJRJj9k9j1J5K4RoojjmLJ6K5K5J9PloOJ9K0J0J0K0K0
$$ 50 56 49 27 -5 -40 -66 -82 -86 -80 -66 -50 -36 -26 -16 -9 -9 -13 -12 -3 -2 -21 -50 -61 -46 -22 -13 -19 -25 -26 -27 -31 -28 -12 13 38 57 64 61 55 61 80 100 110 120 140 160
4380A60%k2k2j3j9l8m0j6PJ2J0J6J9Lk0k8j9j6j8qJ3K5J1qqRK0K3K6L3L0J0k2m2l6j4pk6m8
$$ 160 160 138 116 103 84 46 6 -10 -3 9 19 35 54 57 37 9 -10 -26 -44 -52 -39 -14 -3 -11 -19 -10 10 33 59 92 122 132 110 68 32 18 11 -15 -63
4363f3l9kL0L0J4J1K1L0K3J0OLok0k6rJ6K5J4JKPkj8j9JJ4Lj0jJ7J1j8l9l1j7j7k2j3J4L2
$$ -63 -102 -104 -74 -44 -30 -19 2 32 55 65 71 74 68 48 22 13 29 54 68 69 71 78 76 58 39 40 54 57 47 46 63 74 56 17 -14 -31 -48 -70 -83 -69 -37
4345c7K5OqmKJqj6j3MK2K8J4j4l0k4JJ9J8OllMJ9L4L0Pj9l1k9k4k0j1JMNJ5L4M7M4K6Prk0
$$ -37 -12 -6 -14 -18 -16 -15 -23 -39 -52 -48 -26 2 16 2 -28 -52 -51 -32 -14 -8 -11 -14 -10 9 43 73 80 61 30 1 -23 -43 -54 -53 -49 -44 -29 5 52 96 122 129 120 100
4326A00j7qkrk0k6j9qMQmk2k2JK7K8RqnQJ5Mj2k1j2%%j7l2k7lJ3OrrNJ8J6PQK2K8J7j0k4j6
$$ 100 83 75 73 64 44 18 -1 -9 -5 3 -1 -23 -45 -44 -17 11 20 12 7 15 30 34 22 1 -11 -11 -11 -28 -60 -87 -90 -77 -71 -80 -89 -84 -66 -50 -43 -35 -13 15 32 22 -2 -18
4306a8OJ5Qqj8k0j6j9k5k5j1J0J8J0j%QPjmKNJjJ4L1K8Mk1k6rQJ1MLJ1J8J4Lqj0j0ojPJ7K7
$$ -18 -12 3 11 3 -15 -35 -51 -70 -95 -120 -131 -121 -103 -93 -94 -94 -86 -79 -80 -84 -82 -77 -76 -77 -63 -32 -4 0 -21 -47 -56 -48 -37 -33 -30 -19 -1 13 16 8 -2 -12 -18 -19 -12 5 32
4286C2K7J5Kpj4k9m7m7k0PJ4J0K1L8M2J9j1k3k2j5j3j0j2j5kK1L4K5J2J2K1J6kj6j7j3k1l0
$$ 32 59 74 76 69 55 26 -21 -68 -88 -81 -67 -57 -36 2 44 63 52 29 7 -8 -21 -31 -43 -58 -60 -39 -5 20 32 44 65 81 79 63 46 33 12 -18
4269a8l3k4j4j2j1JK8N0L8Mj7pJ4Qj6k7j2PPnj5j9j6QM8P2N2%l9m1k2j1j1j2lJ2J9J8J3J4
$$ -18 -51 -75 -89 -101 -112 -111 -83 -33 5 9 -8 -15 -1 7 -9 -36 -48 -41 -34 -39 -54 -73 -89 -81 -33 39 91 91 52 11 -11 -22 -33 -45 -48 -36 -17 1 14 28
4252B8J6Qj0k7l4l6k9j7MJ9K0J6J7K7L8L5J5j1k6j9%Kk0l9k5J6M2L1kk7l2k9k0mJ2J9J6J8
$$ 28 44 52 42 15 -19 -55 -84 -101 -97 -78 -58 -42 -25 2 40 75 90 79 53 34 34 36 16 -23 -48 -32 10 41 39 12 -20 -49 -69 -73 -61 -42 -26 -8
4235hK7L1J7KMK2L1K2PLKoj8j9rkkKJ5K0Jk3k4mJ0Jj6k2j8j4j8k2k3j8pQJ9J7Jj1qJ2K5K0
$$ -8 19 50 67 69 73 95 126 148 155 158 160 154 136 117 108 106 104 106 121 141 142 119 95 91 101 102 86 64 46 32 14 -8 -31 -49 -56 -48 -29 -12 -11 -22 -30 -18 7 27
4216B7lk3k3rOJ2J2J2J4J0jj6k2j8jJ6J8Qj0k2k6k1nJ2J9J1LjLRK6M7N4L5Mj5k1k2k3j6mL
$$ 27 24 1 -22 -31 -25 -13 -1 11 25 35 34 18 -4 -22 -23 -7 11 19 9 -13 -39 -60 -65 -53 -34 -23 -20 -21 -18 -9 17 64 118 153 157 142 121 99 76 60 56 59
4198E9kj0j4j2p%OO%%OJ0P%nj5k4k4j7j0j5j7lJ8K1QkMJ8J7Mqj0jMlj6j8rNJ3J2PL%pj9l5
$$ 59 57 47 33 21 14 14 20 26 26 26 32 42 49 49 44 29 5 -19 -36 -46 -61 -78 -81 -63 -42 -34 -36 -32 -14 3 7 -1 -11 -12 -8 -11 -27 -45 -54 -49 -36 -24 -17 -14 -14 -21 -40 -75
4177g5l9k4NK0J3kLK0K9K4J0nk3k6%L8N1K9kj2omj3k3k3qK1M9N6L3Kj2j5j4oJ1K5J6j2l6m1
$$ -75 -114 -138 -133 -113 -100 -102 -99 -79 -50 -26 -16 -21 -44 -70 -70 -32 19 48 46 34 28 24 11 -12 -35 -43 -22 27 83 116 118 106 91 77 71 82 107 123 111 75 34
4160C4l6k5pQJ2Mklpj8j9mJ5J9Rkj2j7j6pJ0K7L6K8Qj6k6j2J5L2L7L0J7%j2j4rkjrk3l5l3
$$ 34 -2 -27 -34 -26 -14 -10 -12 -15 -22 -40 -59 -63 -48 -29 -20 -22 -34 -51 -67 -74 -64 -37 -1 27 35 19 -7 -19 -4 28 65 95 112 112 100 86 77 75 74 65 42 7 -26
4141b6j8KJ5J9J9K0J6J0Nmj5k5k3k0k0j7jK2L4K7J4MMPRjj9k7rK5M3K9Jj8j8pMLj1k8k7j2
$$ -26 -44 -42 -27 -8 11 31 47 57 62 58 43 18 -5 -25 -45 -62 -63 -41 -7 20 34 38 42 49 58 57 38 11 2 27 70 99 100 82 64 57 61 64 53 25 -2 -14
4123a4LRJ0J7K0J3MQJ9J1j3l1k3lPLJMLj4l8n2m3k5j0JJ1K0J9J6K3L8M4L1Qm%QOjqqmjJnj1
$$ -14 -11 -2 8 25 45 58 62 70 89 100 87 56 33 30 37 40 41 45 48 34 -4 -56 -99 -124 -134 -133 -122 -102 -83 -67 -44 -6 38 69 77 73 73 81 87 86 78 70 66 65 66 61 50
4102E0rKJ1Prk6k5kK6L4J0j8k5j4pmRL4M5J9j8k9j6jmj1j0JJ1J5J3Noj5j7j4j0qommpnOK1
$$ 50 41 43 54 61 52 26 1 -1 25 59 69 51 26 12 5 1 10 44 89 108 90 61 45 44 40 29 19 20 31 46 59 64 58 43 26 12 2 -6 -12 -16 -20 -27 -32 -26 -5
4083eK2Pj3j1PK8L3K9K7K2Lk7m2l0kJ0ol4m6l6j9k0k9k5jJ9J9J6L0M5L1ll0k2OL1M2M3L2J3
$$ -5 17 24 11 0 7 35 68 97 124 146 149 122 80 50 48 58 52 18 -28 -64 -83 -103 -132 -157 -158 -139 -120 -104 -74 -29 2 -1 -31 -53 -47 -16 26 69 101 114
4065A14lmKOMNKmpkQJ0jj8k5j7qj2l2m4l9j7LJ5K4K8K1RLNLmKJ7K2Oqnjj2l1l2k3k4l1k3M
$$ 114 111 107 109 115 119 124 126 122 115 113 121 131 130 112 87 70 62 50 18 -26 -65 -82 -79 -64 -40 -12 9 18 21 26 29 25 27 44 66 72 64 59 58 46 15 -17 -40 -64 -95 -118 -114
4045a14L0L2K0Lrj7j3mkqqLJ1QNJ4K1J7OKKoj8k0pMLrk1k2j5jJ1J9K6L7M3L8K2Qmj6k7k7j1
$$ -114 -84 -52 -32 -29 -38 -55 -68 -72 -74 -82 -90 -87 -76 -68 -63 -49 -28 -11 -5 -3 -1 -7 -25 -45 -52 -48 -45 -54 -75 -97 -112 -113 -102 -83 -57 -20 23 61 83 91 87 71 44 17 6
4026FJ1J9J2NJ0K1J7pl2m4l7k4j1LJ5J1ok4k6j3OJ6J9J8J8J4Lrj6pPRLNJ2Rj7m2l6j0J0J2
$$ 6 17 36 48 53 63 84 101 94 62 18 -19 -43 -54 -51 -36 -25 -31 -55 -81 -94 -88 -72 -53 -35 -17 -3 0 -9 -25 -32 -25 -16 -13 -8 4 13 -4 -46 -82 -92 -82 -70
4007g0J0J4J8J2RJ1J3MlMJ9K3J3JJJ0J3Nqj9k1j3pnokNJ2J6J9K3K2J1pk2l3m1m1k3J0L0K0
$$ -70 -60 -46 -28 -16 -7 4 17 21 18 22 41 64 77 78 79 89 102 107 99 80 59 46 39 34 28 26 31 43 59 78 101 123 134 127 105 72 31 -10 -33 -23 7 27
3989B7nj7mJ3J8J1Jrj6j1jKj1k8l6l6l1j0K1M2L0NqJJ5K6L9M3K6nj8j0%nj2j3rqmOJ0%j2j2
$$ 27 22 5 1 14 32 43 44 35 19 8 7 9 -2 -30 -66 -102 -133 -143 -122 -80 -50 -45 -53 -52 -37 -11 28 71 97 92 74 64 64 59 47 34 25 17 13 19 29 29 17 5
3970En%QJ9K0Mj7j9mJ5K7L1K2Jj6j3%RJ1J3J4Qkj0j4k1k6j7pj3k7l7l3k6j9KK7L2Ok1l0k5
$$ 5 0 0 8 27 47 51 34 15 11 26 53 84 106 107 91 78 78 87 98 111 125 133 131 121 107 86 60 43 36 23 -4 -41 -74 -100 -119 -117 -90 -58 -52 -73 -103 -128
3952a28k3j8%K3K7J9K2L8M8L7Rj5l1l7l1pK4M3M2K1ok3k5j2LJ7J7J5J2Oj1l3m0k1J0K0Lk0
$$ -128 -151 -169 -169 -146 -119 -100 -78 -40 8 45 54 39 8 -29 -60 -67 -43 0 42 63 57 34 9 -3 0 17 34 49 61 67 56 23 -17 -38 -28 -8 -5 -25
3935b5k3pQQ%j0j3mJ5L0K6Qj0j8k0j3OK5K8K3J3Pmk3l1k5r%KRJ9J8J3J0J4J5QJNJ7K3J5mk2
$$ -25 -48 -55 -47 -39 -39 -49 -62 -66 -51 -21 5 13 3 -15 -35 -48 -42 -17 11 34 47 54 50 27 -4 -29 -38 -38 -36 -27 -8 10 23 33 47 62 70 71 76 93 116 131 127 105
3916A05k7j0J2J8lk8l1oJ9K6J3koJJ1J9J5ol5n9o5m7j1K4L5K5J2QQRJ1J3Nj5k8k0lJj7l1k3
$$ 105 78 68 80 98 95 67 36 30 49 75 88 86 80 81 92 111 126 120 85 26 -39 -86 -97 -73 -38 -13 -1 7 15 24 35 48 53 38 10 -10 -13 -12 -29 -60 -83
3899h3jJ8K5K9L2L5K9J7Kj0j4j4j2qLK1L3L2K3Nj5l1l1j1J1J5%k0k9k5j1PJ9J6Okqj0lJ3K9
$$ -83 -84 -66 -41 -12 20 55 84 101 103 93 79 65 53 45 48 69 102 134 157 162 147 116 85 74 85 100 100 80 51 26 15 22 41 57 63 61 53 43 40 53 82
3881H2L1K0Olj3k1j8oJnj4j0MJ2RQJ4J8Oj1k2k1j7rQL0M0L2J1j0k6l6l6k1okj2j4mNJlKJ5
$$ 82 113 133 139 136 123 102 84 78 79 74 60 50 54 66 75 83 97 115 121 110 88 67 50 41 49 79 119 151 162 152 126 90 54 33 27 25 13 -1 -5 0 1 -2 0 15
3862A5J6Jj2j1nj2l0l9k6ML1L7K4PjNJ5J6%k5m4m9m5m3l7j7J5L4K2MRL9O4O8N8M4K0j2l5l7
$$ 15 31 32 20 9 4 -8 -38 -77 -103 -99 -68 -31 -7 0 -1 4 19 35 35 10 -34 -83 -128 -171 -208 -225 -210 -176 -154 -150 -141 -102 -38 30 88 132 152 140 105 68
3844F8k3j0jMLrk9l8k6LK7L6K7Rmj4j9j9j0QJ6Lj6j9KK7K7Mj4pJ3J7jj6j0PJ0kqmkj1j8j3
$$ 68 45 35 34 38 41 32 3 -35 -61 -58 -31 5 32 41 37 23 4 -15 -25 -17 -1 2 -14 -33 -31 -4 23 27 13 6 19 36 35 19 9 16 26 24 16 12 10 -1 -19 -32
3825c2kJmkMNJKPJ4J2PLNJ2K1K6K4J8Jk6n5o3m3j3KKLPP%jJ2K9K9Rj7k3JL8N6L7jk6k7j4L
$$ -32 -34 -33 -37 -39 -35 -30 -29 -27 -20 -6 6 13 16 21 33 54 80 104 122 123 97 42 -21 -64 -77 -75 -73 -70 -63 -56 -56 -57 -45 -16 13 22 5 -18 -17 21 77 114 113 87 60 46 49
3805D9K8N6O5M0Jk7l4l6m0l7k3nQJ7K7L4K9J3lj5k3l1l0k1nmj6k0rJ2K0J3RJ6K2J6MLNnk3
$$ 49 77 133 198 238 239 212 178 142 102 65 42 37 45 62 89 123 152 165 162 147 124 93 63 42 37 33 17 -3 -12 0 20 33 42 58 80 96 100 103 108 103 80
3787H0l2k5j3lJNNjoqokJ0K4L0K4J4J0J1Nqj7j5n%JPJ2J0jnOJ4Nj8k5j4mj3k4j4J0K1Kk0j7
$$ 80 48 23 10 7 8 13 18 17 11 3 -3 -5 5 29 59 83 97 107 118 123 115 98 83 78 78 79 86 98 108 107 102 108 122 127 109 84 70 66 53 29 15 25 46 48 28 11
3767A1J1L7L6J5j1k4j9%J6J8MrqKOKnqk0m1n4m1qJ5J1mj3j0lJMLkkOJ6J9J1Kmmmprj1pJJ6
$$ 11 22 59 95 110 99 75 56 56 72 90 94 85 77 79 85 87 82 74 54 13 -41 -82 -90 -75 -64 -68 -81 -91 -94 -93 -89 -86 -88 -90 -84 -68 -49 -38 -36 -40 -44 -48 -55 -64 -75 -82 -81 -65
3746f5K9L4K2jj9j3J5L9L2jk8k5rNLmrqmNJ3J9J4Kqj3oKjj2k2k8k2j1MK3L9M9O0O6N4K1k0
$$ -65 -36 -2 20 19 0 -13 2 41 73 72 44 19 10 15 18 14 5 -3 -7 -2 11 30 44 46 38 25 19 21 20 8 -14 -42 -64 -75 -71 -48 -9 40 100 166 220 241 221
3728B21m8n0l3rJ2K2K1J3Lj2k2j8LJ6Oj4j3J3L0J8j2k5j9j5k1k3j0QJ1%j5k2j8qOJ3J6J2L
$$ 221 173 123 90 81 93 115 136 149 152 140 118 100 103 119 125 111 98 111 141 159 147 122 103 88 67 44 34 42 53 53 38 16 -2 -10 -4 9 25 37 40
3711D0j2k0j5jJ1J1Kj%oj6k3k0j7j5j1NK8L9L1J6PRJ0Jj0j2lKJMJ5K3J2moPJ3M%OJ3RJKKj4
$$ 40 28 8 -7 -8 3 14 16 15 15 9 -7 -30 -50 -67 -82 -93 -88 -60 -21 10 26 33 42 52 53 43 31 28 30 31 35 50 73 85 81 75 82 95 99 99 105 118 127 128 130 132 118
3690A18l4l0%K4J8Jpoj1j7j1OJ3Lj1j2mKNRJ2Nrj3njj3l1l2j5JOOLj%J4L0K6ol3k4J1L4K6
$$ 118 84 54 54 78 96 97 90 84 73 56 45 51 64 67 56 44 40 42 47 56 68 73 64 51 46 45 32 1 -31 -46 -45 -39 -33 -30 -31 -31 -17 13 39 33 0 -24 -13 21 47
3671D7Mponrj3j1%J4K2J4mj6j6rkNQ%qKK9M8M0J7Loj7k8k3kJ9K5J9J2Lkpj1j7k2k0j8j7j3
$$ 47 51 44 38 33 24 11 0 0 14 36 50 46 30 14 5 3 8 16 16 8 10 39 87 127 144 147 141 124 96 73 71 90 115 134 146 149 147 140 129 112 90 70 52 35 22
3651B2JJ2Qj0k0rJ0K0J9J5Q%qj2pRK2K2Pj4k3k1j9j7lK1L8L6J8lj9k6k1mJ4K2K2J9Nj8l8l9
$$ 22 23 35 43 33 13 4 14 34 53 68 76 76 68 56 49 58 80 102 109 95 72 51 32 15 12 33 71 107 125 122 103 77 56 52 66 88 110 129 134 116 78 39
3633C9k6j4qjM%rpNOmj4nJ1J8J7J9K2J4jj2j5j9k9l7k5mPJj2j7j0NK0L1L1J8nj7qK1M9N3K2
$$ 39 13 -1 -9 -10 -6 -6 -15 -22 -17 -11 -15 -29 -34 -23 -5 12 31 53 67 66 54 39 20 -9 -46 -71 -75 -68 -67 -79 -96 -106 -101 -81 -50 -19 -1 -6 -23 -31 -10 39 92 114
3614A14k3n4m9k2J0K7K7Rj4k7j7QK0J0mkJ8L2K2%j5j9k3k4j5KJ3J0NRJ8J3nj3mJ2J5J4J9K7
$$ 114 91 37 -12 -34 -24 3 30 39 25 -2 -19 -11 9 19 15 13 31 63 85 85 70 51 28 4 -11 -9 4 14 19 28 46 59 54 41 37 49 64 78 97 124
3597A24J6k1n7o2m3j2OJ3J7J5Onj6j2J1L6M5L1Pj2k1k7k8j6JJ5J7J3PMnj3j5nJ2K4J9LlRK7
$$ 124 140 119 62 0 -43 -55 -49 -36 -19 -4 2 -3 -19 -31 -20 16 61 92 99 87 66 39 11 -5 -4 11 28 41 48 52 47 34 19 14 26 50 69 72 69 78 105
3579A05K6Mj7j2RK2K1J5J1%j9k6j8ppj3pPPj0k8k8j1MJ2K0K9L2K4Kj7k5j5koj9k1JK3K3PJ
$$ 105 131 135 118 106 115 137 158 173 184 184 165 139 121 114 107 94 87 94 101 91 63 35 24 28 40 60 89 121 145 147 130 105 90 88 82 63 42 43 66 89 96 97
3561I7J4K2Rj2k8l3l6l1j5OJ7J3kk2l3k4OL3L8K5NmlOJ6J7Lj6k3j7qkLJ1J5J9K3K0jk5k6L
$$ 97 111 133 142 130 102 69 33 2 -13 -7 10 23 21 -1 -34 -58 -52 -19 19 44 49 45 42 48 64 81 84 68 45 28 20 18 21 32 47 66 89 109 108 83 57 60
3543F0L0L0Pj3j9k2k1j2kJjJJj3k7k3MK4K0J0J2J9J6OJkj4k8k6j0%qj9k1j4qnkKRK5M5N1K9
$$ 60 90 120 127 114 95 73 52 40 38 39 38 39 40 27 0 -23 -19 5 25 35 47 66 82 88 89 87 73 45 19 9 9 1 -18 -39 -53 -61 -66 -68 -66 -57 -32 13 64 93
3524I3mk7l6m0l5j3J3K0jk5k7pJ1J5Omj0kK1M7N5M1Qk2l4k6j1MROlrqNJ7J1ok0j6%J3J3O%
$$ 93 89 62 26 -14 -49 -62 -49 -29 -30 -55 -82 -89 -78 -63 -57 -61 -71 -73 -52 -5 50 91 99 77 43 17 6 10 19 25 22 13 5 10 27 38 32 12 -4 -4 9 22 28 28
3505B8NJ4K2K4K0J0lj2rNJ9J7Jj5k3k7l2l0j1J8L9M3L4J4j4m3n3l3KK3K6J9J0%okRJ3Jj4j9
$$ 28 33 47 69 93 113 123 120 108 99 104 123 140 141 126 103 76 44 14 3 21 60 103 137 151 137 94 41 8 10 33 59 78 88 88 82 80 89 102 103 89 70
3487G0j6j1j1j0pqp%J7K8K1%k4m2m7l5lK9L9K4Kj5k3j8KK9M4L9K2Qlrj1ojnmRK8K8Oj9k3o
$$ 70 54 43 32 22 15 7 0 0 17 45 66 66 42 0 -47 -82 -85 -56 -17 7 9 -6 -29 -47 -45 -16 28 67 89 97 94 85 74 68 67 62 58 67 95 123 129 110 87 81
3468H1J3J8Nqrmpk1k5jL1L7Pk9m5m1l3l3k3lJ9K7J8NKJ1L0M4M0K1ok6l0j8kOPJ1J9J6nl4n0
$$ 81 94 112 117 109 100 96 89 68 43 42 73 110 117 88 43 2 -31 -64 -87 -90 -71 -44 -26 -21 -19 -8 22 66 106 127 121 95 65 47 45 51 58 69 88 104 99 65 15
3449A5m6l7k5qQJ6RKMJ2K3K0Mk1l9m2k9j1J0L0M6M5L3K2J7J0%j0rnnnnklj1j3mJ7L6L6J5j0
$$ 15 -31 -68 -93 -101 -93 -77 -68 -66 -62 -50 -27 -7 -3 -24 -63 -105 -134 -145 -135 -105 -59 -14 19 41 58 68 68 58 49 44 39 34 29 27 24 13 0 -4 13 49 85 100 90
3430I0k2k1j4oKRRkrkJ6K6K1Jj5j6jJ4J5%j9l0k6j2JJolJ2K2Nj5nL5N9L9lk3j6oj1j4qlpj5
$$ 90 68 47 33 27 29 38 47 45 36 34 50 76 97 98 83 67 66 80 95 95 76 46 20 8 9 10 4 1 13 35 40 25 20 55 114 153 150 127 111 105 94 80 72 69 62 47
3410D7j9k2k0j3KQkj3rMJ3J7K1K4J2j4k4lL2M3J8k1l6k0kmk0k8j5LJ1J1Kj0k3k3nJ3J9Pll
$$ 47 28 6 -14 -27 -25 -17 -19 -32 -41 -37 -24 -7 14 38 50 36 12 9 41 84 102 81 45 25 23 19 -1 -29 -44 -41 -30 -19 -17 -27 -50 -73 -78 -65 -46 -39 -42 -45
3392d5PJ3J1lk3l6l2j3PK5M1N3N9N1L2J4kj5k7l8m1l7k9k0j1%J4L0M3M8M4L1Qrj3mnk6m6l6
$$ -45 -38 -25 -14 -17 -40 -76 -108 -121 -114 -89 -48 5 64 115 147 161 159 144 117 79 38 1 -28 -48 -59 -59 -45 -15 28 76 120 151 159 150 137 133 128 102 56 20
3375B0lK1J7mj5j6j6j0RL5L8J6npnj5k4pK5L8K3%rj0j6j4%J4Ll0n3m9k2J2M1N5M9K7J0PQN
$$ 20 17 38 55 51 36 20 4 -6 3 38 76 92 87 80 75 60 36 29 54 92 115 115 106 96 80 66 66 80 83 53 0 -49 -71 -59 -18 37 86 113 123 130 138 143
3357A43lj0j6k4j6RL4L0Lj7j5llj7k1lK4L0J1k1l7l4k3j6j1JJ4J3JoPK3K4J2KJMNMMnj7k9
$$ 143 140 130 114 90 74 83 117 147 150 133 118 115 112 95 74 71 95 125 136 115 78 44 21 5 -6 -5 9 22 23 17 24 47 71 83 85 86 90 95 99 103 98 81 52
3338E2l3l2l5l2k1qLRJ8K7K2Oqq%Kqj6j7j1jJ8M0N1M0J4pj6j8k4k8k8k2j4lORMjjNOM%MJ0
$$ 52 19 -13 -48 -80 -101 -109 -106 -97 -79 -52 -30 -24 -32 -40 -40 -38 -46 -62 -79 -90 -91 -73 -33 18 58 72 65 49 31 7 -21 -49 -71 -85 -88 -82 -73 -69 -70 -71 -66 -60 -56 -56 -52 -42
3318d2J2J0Llprj1j3pJ0L1M4M7L6K0KnJJ0Mj9l9m0k4j1roJJ2J3Prk0j9ML5N2L8Qj4j7j7k4
$$ -42 -30 -20 -17 -20 -27 -36 -47 -60 -67 -57 -26 18 65 101 121 123 118 119 129 133 114 75 35 11 0 -9 -15 -14 -2 11 18 9 -11 -30 -26 9 61 99 107 93 76 59 35
3299C5k7j0J2K5J4mj7k1j7lJ5K9K3J4J2J8J8J2QLoj1nNlk8m7m1j9KJ5K2J9OljRJ6J8J8J5J0
$$ 35 8 -2 10 35 49 45 28 7 -10 -13 2 31 54 68 80 98 116 128 136 139 133 122 117 122 119 91 44 3 -16 -14 1 23 42 48 45 44 53 69 87 105 120 130
3281A30PP%j5k8k9k3l0m3m2j6J4L0L3L4L3K4jl0n1m9k5J0K7K0MLJ6K7K1NolRK2K0Kk3l5m0
$$ 130 137 144 144 129 101 72 49 19 -24 -66 -82 -68 -38 -5 29 62 86 85 55 4 -45 -70 -60 -33 -13 -9 -6 10 37 58 63 57 54 63 85 105 107 84 49 9
3264Im3m5k6J7N9O6L7Nolj5m1n2l3LK7K6J5Jpj8j9j5j6k0k1rQK1K7L1K7J0j1j6jJ6J7Rkln
$$ 9 -34 -79 -105 -88 -29 37 74 79 73 70 55 14 -38 -71 -68 -41 -15 0 1 -6 -24 -43 -58 -74 -94 -115 -124 -116 -95 -68 -37 -10 0 -11 -27 -28 -12 5 14 12 9 4
3246DolOPj1l2l0pRKqjJ2J3JlJ0K7L3L7L8L2J4j0l4n9p6o6k3K1L7K9K0J6NplK6N3M9J9j2k7
$$ 4 -2 -5 1 8 -3 -35 -65 -72 -63 -61 -69 -70 -58 -45 -44 -47 -37 -10 23 60 98 130 144 134 100 41 -35 -101 -124 -103 -66 -37 -17 -1 4 -3 -6 20 73 122 141 129 102
3227A02k1jJ6J6lj6j0RRj4l4k4MK1J4lrOK6L9L3J3rj4JJ8K1Qrk2l1l1k2j1qj4qOJ0mj9j2R
$$ 102 81 80 96 112 109 93 83 92 101 87 53 29 33 54 68 65 56 62 88 127 160 173 164 150 151 169 190 198 189 167 136 105 83 72 64 50 42 48 58 54 35 23 32
3208C2K1J9J2Npj0PL2L0Mj5j0kk0m5m8k1QK4K7K6J7MnpmJOJj7l1k4kJ3Rrk3l2k6pJ9L5L2K4
$$ 32 53 72 84 89 82 72 79 111 141 145 130 120 118 98 53 5 -16 -8 16 43 69 86 90 85 78 74 75 81 82 65 34 10 8 21 30 21 -2 -34 -60 -67 -48 -13 19 43
3189D3J7J5J1QRRMj1k3j9jJ9K2Pj0j3JJ5J9J4Opk3l1k4j0k%KQPrk9l5k3JK0K4J7Okmljmj2
$$ 43 60 75 86 94 103 112 116 105 82 63 62 81 103 110 100 87 88 103 122 136 142 135 112 81 57 47 45 45 47 55 62 53 24 -11 -34 -33 -13 11 28 34 32 28 25 24 20 8
3169Hj9k4j9oMJ0J5K3L1L6K9J3knljmqo%%mmJ1K9L3J5j6l7l9k3JJ2Kj2j0J5L8L0ml0k9j1J
$$ 8 -11 -35 -54 -60 -56 -46 -31 -8 23 59 88 101 99 94 91 90 86 78 72 72 72 68 64 75 104 137 152 136 99 60 37 38 50 52 40 30 45 83 113 109 79 50 39 40
3150D0jj2k7m1m2j7J7L6L3K4J8Qj0k1k2k1k1j5MK1K4J4NKjpj8k0qJ8M5N2L1JpJ0K6J7ok6l1
$$ 40 39 27 0 -41 -83 -100 -83 -47 -14 10 28 36 26 5 -17 -38 -59 -74 -70 -49 -25 -11 -6 -4 -5 -12 -30 -50 -58 -40 5 57 88 89 82 92 118 135 129 103 72
3133G2k9k7k5k2j4lOJ0J1J5K2L5M6M7L7K0Moqj7k9l4k4qlj0k3l0k5qJ4K7K3Onqqj0j1JK6M4
$$ 72 43 16 -9 -31 -45 -48 -42 -32 -21 -6 16 51 97 144 181 201 205 199 191 174 145 111 87 79 76 66 43 13 -12 -20 -6 21 44 50 45 37 29 19 8 9 35 79
3114G9M3K4%j2mJ3K7K5J1j2k6k1%J7J1j6m7o2n5m2l0k3j4KJ5J1%lJ8M1M7K7nl4n1n2k6J3M7
$$ 79 122 146 146 134 130 143 170 195 206 194 168 147 147 164 175 159 112 50 -5 -47 -77 -100 -114 -112 -97 -86 -86 -89 -71 -30 17 44 39 5 -46 -98 -124 -111 -64
3097f4N8M5K0rl0l6l1k4j6mJ1J2nk6k6pJ6K6K7K6K2J9J8J7J7K0K5K3J0lnjkj5k6k8k1j4pl
$$ -64 -6 39 59 50 20 -16 -47 -71 -87 -91 -80 -68 -73 -99 -125 -132 -116 -90 -63 -37 -15 4 22 39 56 76 101 124 134 131 126 125 123 108 82 54 33 19 12 9
3080IkonjNKoj2nJ3K6K1Jj3qNNmpMJ4Rjj0j2nJ3L4M3L1J3Ljoj4j8k0k4k7j7LJ5J4J0J0J5J9
$$ 9 7 1 -4 -5 0 2 -4 -16 -21 -8 18 39 40 27 19 24 29 25 18 22 36 45 44 34 22 17 30 64 107 138 151 154 153 147 133 115 95 71 44 27 30 45 59 69 79 94 113
3060A13J9J6Lj8l0k1OK7K3Jk1k9l2l9m2l4j6j0j3lL1O3O1L2Lnmmqj0qlJ0K4K2Pj5l0l3k4o
$$ 113 132 148 151 133 103 82 88 115 138 139 118 89 57 18 -24 -58 -74 -84 -97 -100 -69 -6 55 87 90 85 81 77 69 59 51 48 58 82 104 111 96 66 33 9 3
3042CJ2J6J1J0J7K2J5Llmkkj2k8l4j5J3J9KoQK3J4mqkJQK8M5L1lk3k0j4j7rJ6L6K3j3l5l4
$$ 3 15 31 42 52 69 91 106 109 106 102 100 98 86 58 24 9 22 41 43 37 45 68 82 78 70 68 69 77 105 150 181 178 155 135 121 104 95 111 147 170 157 122 88
3023H8j8nkqj8k4j9pQJ8K0J4RJ1J8J5jj4j7k0k9l8l4j3J2K9K9J5lj1%J4J8J3PJ0J7K1J5Kq
$$ 88 70 65 63 55 37 13 -6 -13 -5 13 33 47 56 67 85 100 99 85 68 48 19 -19 -53 -66 -54 -25 4 19 16 5 5 19 37 50 57 67 84 105 120 122 114
3006A14jJ4J4j0l6m0k4j4j7k2j0J7L8L8J2j4j8kJ3RLRK3K4J6J0J2J2J2J9K8K2Mj0qnj8m1n2
$$ 114 113 127 141 131 95 55 31 17 0 -22 -32 -15 23 61 73 59 41 39 52 61 64 73 96 120 136 146 158 170 182 201 229 251 255 245 237 232 214 173 121
2989A21m2j9QK5K1Lj0lK0L6K9%l0l1lK9L7J9Jloj7k0oOj0l9n2l6j2OK1L5L4J6mpKJ2K1K8K5
$$ 121 79 60 68 93 114 117 107 104 124 160 189 189 159 128 125 154 191 210 211 208 202 185 165 159 165 155 116 64 28 16 22 43 78 112 128 124 117 119 131 152 180 205
2970B05kl6n5m6k4kK2M3M4J7j6k6j5rk3l5k5MK1J6JqomolLMklJ2L2L1Pj3rQQpj7pNjk3l9k9
$$ 205 203 167 112 66 42 40 62 105 149 166 150 124 109 100 77 42 17 21 42 58 59 51 45 41 35 32 35 39 37 34 46 78 109 116 103 94 102 110 103 86 79 84 83 60 21 -8
2951hoJ1Poj6nJ9L6L6K0Jj4j8j2LJ4J2ol3n4n3l2oMJKJ5K4K2K1L0M3L6J4pj6j6j5j1qj3j8
$$ -8 -14 -3 4 -2 -18 -23 -4 32 68 88 89 75 57 45 48 62 74 68 35 -19 -72 -104 -110 -106 -105 -103 -88 -64 -42 -21 9 52 88 102 95 79 63 48 37 29 16 -2
2932bpJ7L5K8J2J1K1K1R%Kjj8l0j9PJ8ml2l0QM5M2J5MK3L4J1k4l5k5k0l2l6k0kLj%RJ6K3L1
$$ -2 -9 8 43 71 83 94 115 136 145 145 147 146 128 98 79 86 104 100 68 38 46 91 133 148 152 175 209 220 196 161 136 116 84 48 28 26 29 28 28 37 53 76 107
2914A07L4K4Kj9k8j4J3L7L9J9lqnmj0j3j1j0pLK4M4M7K8nk9l4k1j1j3k0k3k3k1j6%J8K2J2
$$ 107 141 165 167 148 120 106 119 156 195 214 211 203 198 194 184 171 160 150 143 146 170 214 261 289 284 255 221 200 189 176 156 133 110 89 73 73 91 113 125
2897A25kj3j6j1LJ6J6Plj2k7m4m1j8NROJ1J6QkNK1K5J6J3J6Rj3k7j9mpk1k0jK0K9K3J1kj3
$$ 125 123 110 94 83 86 102 118 125 122 110 83 39 -2 -20 -15 -6 0 11 27 35 33 38 59 84 100 113 129 138 125 98 79 75 68 47 27 26 46 75 98 109 107 94
2879I4k4k7k3j1%M%%PJ3QJJJ5K4J6mj9k3j8j1lQJ9K2J4O%oj8k3j5Jjk5m1l2%K8L4K3J0kmk
$$ 94 70 43 20 9 9 13 13 13 20 33 41 42 43 58 82 98 94 75 52 34 23 20 28 47 69 83 89 89 83 65 42 27 28 27 2 -39 -71 -71 -43 -9 14 24 22 18 16
2859A6pk0l1k5j1LJ2K5K6Kk9k9OL9L2Nj7k7l1k7oK0L2L3M0N9O3L6jj7mJ6J9jk9m4l7j7pj5
$$ 16 9 -11 -42 -67 -78 -75 -63 -38 -12 -10 -39 -68 -62 -23 9 14 -3 -30 -61 -88 -94 -74 -42 -9 31 90 153 189 188 171 167 183 202 201 172 128 91 74 67 52
2842E2k6k5oJ2K8L0J9lk4k9k2j0j0j2oJ0K1J3mj6j0PK3L5L6K3OnlKnj7k0rLPPN%nkMjk3m0
$$ 52 26 1 -5 7 35 65 84 81 57 28 6 -4 -14 -26 -32 -22 -1 12 8 -8 -18 -11 12 47 83 106 112 107 104 106 101 84 64 55 58 65 72 77 77 72 70 74 73 50 10
2822A0k8%J6J0KQK3K2Lk0k6j7l%JNJ6L2L9L1J2oj6j8j6p%kj4k5j9mMoj3nJ1K5K8L2M3M6K9
$$ 10 -18 -18 -2 8 10 18 41 63 66 46 20 3 0 0 1 6 22 54 93 124 136 130 114 96 80 73 73 71 57 32 13 9 13 7 -6 -11 0 25 53 85 128 174 203
2804B03Jk2l6m6n2m8k9KL6N8N4K7rk9l0j9j0qj2j3oQK2K2Qqj2jJ2J7J3Lj2k4k5j1J1K5J9m
$$ 203 204 182 146 100 48 0 -29 -27 9 67 121 148 139 110 80 61 51 43 31 18 12 20 42 64 72 64 52 51 63 80 93 96 84 60 35 24 35 60 79 75
2786G5l0l5j0K6M9L8Qj2j1jN%kmj1k4l8l7k4JK3L3L1J8%j5k3k8l0k8oK9N3N2L0J4QKqj7k2
$$ 75 45 10 0 26 75 113 121 109 98 97 102 102 100 96 85 61 23 -14 -38 -37 -14 19 50 68 68 53 30 2 -28 -56 -62 -33 20 72 102 116 124 126 118 101 79
2768G9k7l2k7j3j0k0k3lK0K1J4J9L0K1pk2j5rk2k4MM4N6M1J9Qjrj2rrj3j8k2k2j8j2j0j4j0
$$ 79 52 20 -7 -20 -30 -50 -73 -76 -56 -35 -21 -2 28 49 42 20 5 -4 -26 -50 -46 -2 54 95 114 122 121 112 100 91 82 69 51 29 7 -11 -23 -33 -47 -57
2751e7PK6K6K0K3L8N0M8L6K0%j8j9rpj4k1j4j1k0l5m0l2j6MJ5J7Pj%LkoJJ7L0L0K4J4jj4k0
$$ -57 -50 -24 2 22 45 83 133 181 217 237 237 219 200 191 184 170 149 135 124 104 69 29 -3 -19 -15 0 17 24 23 23 26 24 18 19 36 66 96 120 134 133 119 99
2733I9j8j2lQJ4J2NKJJkrj8k5k4j3lnj3rJ3L5L6J9kj4j8j4j1j6k7l4k5j0mj1oJ9M6M8K7J0
$$ 99 81 69 66 74 88 100 105 107 108 109 107 98 80 55 31 18 15 10 -3 -12 1 36 72 91 89 75 57 43 32 16 -11 -45 -70 -80 -84 -95 -101 -82 -36 12 39 49
2715D9J0Pj7m2l8oK9M0M1M1L9L3K3J6Rmj9l0l8m5m9m2k2lJ3K5L4K9J3pj9k0j4kJ2J5Pmrj3
$$ 49 59 66 49 7 -31 -37 -8 32 73 114 153 186 209 225 234 230 211 181 143 98 49 7 -15 -18 -5 20 54 83 96 89 70 50 36 34 46 61 68 64 55 42
2697D2k0k1qJ0K2K0J1RNqk8m1l3qJ6K7K2J9K0K3J4jj1ppk3m7n7l3KJ9J3LNJ2Qnj1JK3L6L4
$$ 42 22 1 -7 3 25 45 56 65 70 62 34 -7 -40 -48 -32 -5 17 36 56 79 93 92 81 74 67 44 -3 -60 -93 -91 -72 -59 -56 -51 -39 -31 -36 -47 -46 -23 13 47
2679D7J7JJJ5K9K4RoqJJ3J1qk7k1J0L5K9Nj1j3j2j4rJ%j2j6mJ0Lj5k5j7lRK2L3L4K9K2K0K0
$$ 47 64 65 66 81 110 134 143 137 129 130 143 154 146 119 98 108 143 172 177 166 153 141 127 118 119 119 107 91 87 97 100 85 60 43 40 49 71 104 138 167 189 209 229
2661B29J5Lj6l1l7l3k3j2mOJ4J4Pnj1j1j1lJ7M3N8M4J0rrok1l9l9k5j8k3j9lJ1J2NKLRK3M1
$$ 229 244 247 231 200 163 130 107 95 91 97 111 125 132 127 116 105 94 91 108 151 209 253 263 254 245 239 218 179 140 115 97 74 55 52 63 75 80 82 85 94 117 158
2642A58M7K8Lqnqk1l8m7m5k9nQml1m3l1rjlMK4M0L7K2Pmj2k3k3j1J0J9Rrj2jQJ0LKKMPJ1J1
$$ 158 205 233 236 228 223 215 194 156 109 64 35 30 38 34 3 -40 -71 -80 -81 -84 -80 -56 -16 21 43 50 46 34 11 -12 -23 -13 6 15 6 -6 -7 1 11 14 16 18 22 29 40 51
2622E1NNJ3K1J9RMMM%qj9k6k6j4kK%KRJ8K4K6K2Roj5j6j7j6oRJ4Jj7k4j6j1j1oRK1J2j6l9
$$ 51 56 61 74 95 114 123 127 131 135 135 127 108 82 56 42 40 42 42 44 53 71 95 121 143 152 146 131 115 98 82 76 85 99 100 83 59 43 32 21 15 24 45 57 41 2
2603Bl8j7J1K3J6JpkNNNJ0J4Oj4k2j5%LjKJ5L0K7J1kmNQKrj2nkoj3q%MjjKQJ2K1K7J7j0l4
$$ 2 -36 -53 -42 -19 -3 -2 -9 -11 -6 -1 4 14 28 34 20 -2 -17 -17 -14 -15 -13 2 32 59 70 68 64 69 77 79 70 58 53 51 45 32 24 24 28 27 26 28 36 48 69 96 113 103 69
2582F9l9k6j7j3nJ1K6K6J3nj4j1JNrl3n0l9j4PJ4J7K3K5J8Lj0j4%K5N0N8L6%k1j5LJ2Loqo
$$ 69 30 4 -13 -26 -31 -20 6 32 45 40 26 15 16 21 12 -21 -71 -110 -124 -117 -103 -86 -63 -38 -20 -17 -27 -41 -41 -16 34 92 128 128 107 92 95 107 110 104 96 90
2563I0j2k6l3k4j0JkonMJ2J4J2Okj1k2l1l0j4J1L1L9L5K9K2J2MJ%mj5k6l1k4rJ4L1L3K1PK
$$ 90 78 52 19 -5 -15 -14 -16 -22 -27 -23 -11 3 15 21 19 8 -14 -45 -75 -89 -78 -47 -8 27 56 78 90 94 95 95 91 76 50 19 -5 -14 0 31 64 85 92 94
2545I4mj7l1l6k8j6lKLJMJ4K1J9J2J0J4J0mj3j2j1j6k4k2qJ7L9N8N4L1jk5l6l7k6j1kjJJ2
$$ 94 90 73 42 6 -22 -38 -41 -39 -36 -35 -31 -17 4 23 35 45 59 69 65 52 40 29 13 -11 -33 -41 -24 15 73 127 158 157 132 96 59 33 22 20 19 20 32
$$ [...]
-3131A74
##END=	
##END=	
