##TITLE=	Oct27-2021.40.fid
TM-VI-138solid

##JCAMP-DX=	6.0	$$ MestReNova 14.3.0-30573
##DATA TYPE=	LINK
##BLOCK_ID=	1
##BLOCKS=	2    
##ORIGIN=	Mestrelab Research S.L.
##OWNER=	hrzepa
##$MNOVA/LINK_BLOCK_TYPE=	ITEM	$$ NMR Spectrum
##$MNOVA/ITEM/POLYGON=	(XY..XY)
5321,5835
8722,5835
8722,8208
5321,8208
5321,5835
##$MNOVA/ITEM/Z=	0
##$MNOVA/ITEM/ANGLE=	0
##TITLE=	Oct27-2021.40.fid
##JCAMP-DX=	6.0	$$ MestReNova 14.3.0-30573
##BLOCK_ID=	2
##DATA TYPE=	MNOVA NMR VIEW DATA
##DATA CLASS=	MNOVA VIEW DATA
##$MNOVA/ITEM/ZOOM/X=	-4.0077130307847514956,	16.00802000001239378
##$MNOVA/ITEM/ZOOM/Y=	-1396.7224359512329102,	15389.12890625
##END=	
##TITLE=	Oct27-2021.40.fid
##JCAMP-DX=	6.0	$$ MestReNova 14.3.0-30573
##BLOCK_ID=	3
##DATA TYPE=	NMR SPECTRUM
##DATA CLASS=	XYDATA
##NUMDIM=	1
##ORIGIN=	Bruker BioSpin GmbH
##OWNER=	nmr
##.OBSERVE FREQUENCY=	400.32240192000000434
##.OBSERVE NUCLEUS=	^1H
##.SOLVENT NAME=	CDCl3
##.PULSE SEQUENCE=	zg30
##LONGDATE=	2021/10/27 12:36:00.000
##.ACQUISITIONMODE=	SIMULTANEOUS (DQD)
##$ORIGINAL FORMAT=	Bruker XWIN-NMR
##$MNOVA/SCALES_VERSION=	9
##$PARAMETER FILE=	(acqus, ASCII, /private/var/folders/f6/rjf_tdyn2v98c5c0wvkgn4s80000gn/T/amDz6EhqSj+lsI02k3ozbQ/40/acqus, 0)
$$ ##TITLE= Parameter file, TOPSPIN		Version 3.2
$$ ##JCAMPDX= 5.0
$$ ##DATATYPE= Parameter Values
$$ ##NPOINTS= 11	$$ modification sequence number
$$ ##ORIGIN= Bruker BioSpin GmbH
$$ ##OWNER= nmr
$$ $$ 2021-10-27 12:36:23.322 +0100  nmr@CZC2524DW0
$$ $$ /opt/topspin/data/agmb/nmr/Oct27-2021/40/acqus
$$ $$ process /opt/topspin3.2/prog/mod/shimcntl
$$ ##$ACQT0= -2.3109243697479
$$ ##$AMP= (0..31)
$$ 100 100 100 100 100 100 100 100 100 100 100 100 100 100 100 100 100 100
$$ 100 100 100 100 100 100 100 100 100 100 100 100 100 100
$$ ##$AMPCOIL= (0..19)
$$ 0 0 0 0 0 0 0 0 0 0 0 0 0 0 0 0 0 0 0 0
$$ ##$ANAVPT= -1
$$ ##$AQSEQ= 0
$$ ##$AQ_mod= 3
$$ ##$AUNM= <au_zg>
$$ ##$AUTOPOS= <54 >
$$ ##$BF1= 400.32
$$ ##$BF2= 400.32
$$ ##$BF3= 400.32
$$ ##$BF4= 400.32
$$ ##$BF5= 400.32
$$ ##$BF6= 400.32
$$ ##$BF7= 400.32
$$ ##$BF8= 400.32
$$ ##$BYTORDA= 0
$$ ##$CAGPARS= (0..11)
$$ 0 0 0 0 0 0 0 0 0 0 0 0
$$ ##$CFDGTYP= 0
$$ ##$CFRGTYP= 9
$$ ##$CHEMSTR= <none>
$$ ##$CNST= (0..63)
$$ 1 1 145 1 1 1 1 1 1 1 1 1 1 1 1 1 1 1 1 1 1 1 1 1 1 1 1 1 1 1 1 1 1 1 1
$$ 1 1 1 1 1 1 1 1 1 1 1 1 1 1 1 1 1 1 1 1 1 1 1 1 1 1 1 1 1
$$ ##$CPDPRG= (0..8)
$$ <> <> <> <> <mlev> <mlev> <mlev> <mlev> <mlev>
$$ ##$D= (0..63)
$$ 0 1 0 0 0 0 0 0 0 0.06 0 0 0 0 0 0 0.0002 0 0 0 0 0 0 0 0 0 0 0 0 0 0 0
$$ 0 0 0 0 0 0 0 0 0 0 0 0 0 0 0 0 0 0 0 0 0 0 0 0 0 0 0 0 0 0 0 0
$$ ##$DATE= 1635334582
$$ ##$DE= 6.5
$$ ##$DECBNUC= <off>
$$ ##$DECIM= 2496
$$ ##$DECNUC= <off>
$$ ##$DECSTAT= 4
$$ ##$DIGMOD= 1
$$ ##$DIGTYP= 12
$$ ##$DQDMODE= 0
$$ ##$DR= 22
$$ ##$DS= 2
$$ ##$DSPFIRM= 0
$$ ##$DSPFVS= 20
$$ ##$DTYPA= 0
$$ ##$EXP= <proton>
$$ ##$F1LIST= <111111111111111>
$$ ##$F2LIST= <222222222222222>
$$ ##$F3LIST= <333333333333333>
$$ ##$FCUCHAN= (0..9)
$$ 0 2 0 0 0 0 0 0 0 0
$$ ##$FL1= 90
$$ ##$FL2= 90
$$ ##$FL3= 90
$$ ##$FL4= 90
$$ [...]
$$ 90 74 58 42 26 10 0 0
$$ ##$Sgu3PowerLevels= (0..7)
$$ 0 0 0 0 0 0 0 0
$$ ##$Sgu4PowerLevels= (0..7)
$$ 0 0 0 0 0 0 0 0
$$ ##$Sgu5PowerLevels= (0..7)
$$ 0 0 0 0 0 0 0 0
$$ ##$Sgu6PowerLevels= (0..7)
$$ 0 0 0 0 0 0 0 0
$$ ##$Sgu7PowerLevels= (0..7)
$$ 0 0 0 0 0 0 0 0
$$ ##$Sgu8PowerLevels= (0..7)
$$ 0 0 0 0 0 0 0 0
$$ ##$SguType= 3
$$ ##$ShimPowMaxUA= (0..63)
$$ 130000 130000 130000 130000 130000 130000 130000 130000 130000 130000 130000
$$ 130000 130000 130000 130000 130000 130000 130000 130000 130000 0 0 0 0
$$ 0 0 0 0 0 0 0 0 0 0 0 0 0 0 0 0 0 0 0 0 0 0 0 0 0 0 0 0 0 0 0 0 0 0 0 0
$$ 0 0 0 0
$$ ##$ShimPowMaxUC= (0..63)
$$ 130000 130000 130000 130000 130000 130000 130000 130000 130000 130000 130000
$$ 130000 130000 130000 130000 130000 130000 130000 130000 130000 0 0 0 0
$$ 0 0 0 0 0 0 0 0 0 0 0 0 0 0 0 0 0 0 0 0 0 0 0 0 0 0 0 0 0 0 0 0 0 0 0 0
$$ 0 0 0 0
$$ ##$ShimPowMaxUG= (0..63)
$$ 524287 524287 524287 524287 524287 524287 524287 524287 524287 524287 524287
$$ 524287 524287 524287 524287 524287 524287 524287 524287 524287 0 0 0 0
$$ 0 0 0 0 0 0 0 0 0 0 0 0 0 0 0 0 0 0 0 0 0 0 0 0 0 0 0 0 0 0 0 0 0 0 0 0
$$ 0 0 0 0
$$ ##$ShimPowRcbType= 3
$$ ##$ShimPowRes= (0..63)
$$ 1e-20 1e-20 1e-20 1e-20 1e-20 1e-20 1e-20 1e-20 1e-20 1e-20 1e-20 1e-20
$$ 1e-20 1e-20 1e-20 1e-20 1e-20 1e-20 1e-20 1e-20 0 0 0 0 0 0 0 0 0 0 0 0
$$ 0 0 0 0 0 0 0 0 0 0 0 0 0 0 0 0 0 0 0 0 0 0 0 0 0 0 0 0 0 0 0 0
$$ ##$ShimPowRng0= (0..63)
$$ 1 1 1 1 1 1 1 1 1 1 1 1 1 1 1 1 1 1 1 1 0 0 0 0 0 0 0 0 0 0 0 0 0 0 0 0
$$ 0 0 0 0 0 0 0 0 0 0 0 0 0 0 0 0 0 0 0 0 0 0 0 0 0 0 0 0
$$ ##$ShimPowRng1= (0..63)
$$ 1 1 1 1 1 1 1 1 1 1 1 1 1 1 1 1 1 1 1 1 0 0 0 0 0 0 0 0 0 0 0 0 0 0 0 0
$$ 0 0 0 0 0 0 0 0 0 0 0 0 0 0 0 0 0 0 0 0 0 0 0 0 0 0 0 0
$$ ##$ShimPowRng2= (0..63)
$$ 1 1 1 1 1 1 1 1 1 1 1 1 1 1 1 1 1 1 1 1 0 0 0 0 0 0 0 0 0 0 0 0 0 0 0 0
$$ 0 0 0 0 0 0 0 0 0 0 0 0 0 0 0 0 0 0 0 0 0 0 0 0 0 0 0 0
$$ ##$ShimPowRng3= (0..63)
$$ 1 1 1 1 1 1 1 1 1 1 1 1 1 1 1 1 1 1 1 1 0 0 0 0 0 0 0 0 0 0 0 0 0 0 0 0
$$ 0 0 0 0 0 0 0 0 0 0 0 0 0 0 0 0 0 0 0 0 0 0 0 0 0 0 0 0
$$ ##$ShimSysFunc= (0..63)
$$ 1 2 3 4 5 7 9 11 15 16 8 10 12 14 6 17 13 18 19 20 0 0 0 0 0 0 0 0 0 0
$$ 0 0 0 0 0 0 0 0 0 0 0 0 0 0 0 0 0 0 0 0 0 0 0 0 0 0 0 0 0 0 0 0 0 0
$$ ##$ShimSysMatrix= 0
$$ ##$ShimSysType= 1
$$ ##$TFXNUM= 0
$$ ##$TRIPLO2= 0
$$ ##$VTU= 2
$$ ##$VTUETH= <149.236.99.20>
$$ ##$VTUTY= <no>
$$ ##$WBREFAM= (0..15)
$$ 132.2 106.2 100 100 100 100 100 100 100 100 100 100 100 100 100 100
$$ ##$WBREFLM= (0..15)
$$ 0 0 0 0 0 0 0 0 0 0 0 0 0 0 0 0
$$ ##$WBREFPH= (0..15)
$$ 77.55 -65.76 0 0 0 0 0 0 0 0 0 0 0 0 0 0
$$ ##$WBSGU= (0..15)
$$ 0 0 0 0 0 0 0 0 0 0 0 0 0 0 0 0
$$ ##$XFAC= 2
$$ ##END=
$$ 
##$DECIM=	2496
##$DSPFVS=	20
##XUNITS=	HZ
##YUNITS=	ARBITRARY UNITS
##FIRSTX=	6408.3305663999999524
##LASTX=	-1604.3676804825092859
##DELTAX=	-0.12226593800080123864
##XFACTOR=	1
##YFACTOR=	0.020981441002693203279
##FIRSTY=	10.298431396484375
##MINY=	2.2892827987670898438
##MAXY=	13990.1171875
##NPOINTS=	65536
##XYDATA=	(X++(Y..Y))
$$ [...]
3549 457 468 458 462 471 464 458 480 509 501 461 441 457 475 472 466 478 497 509 524 543 544 518 496 508 537 540 505 460 436 439 460 485 497 486 468 468 486 498 498 504 527
3544 527 544 531 499 481 497 531 555 548 514 483 479 494 493 468 460 502 563 582 551 518 505 478 416 351 328 334 336 337 364 410 440 449 466 499 512 476 411 359 343
3539 343 364 407 444 449 426 414 435 470 490 491 484 478 480 496 508 482 423 384 402 442 445 416 405 427 443 422 389 380 383 370 342 330 353 396 428 443 456 482 515
3535 515 531 524 515 519 529 530 517 495 468 452 472 524 561 543 501 492 518 526 501 481 483 473 431 399 412 436 419 377 369 406 443 448 436 436 453 487 527 538 499 445
3530 445 440 486 522 514 499 519 553 561 543 523 502 474 462 489 526 520 477 451 462 477 465 444 436 431 429 459 525 576 569 528 502 485 443 388 375 409 431 407 377
3525 377 384 415 428 424 426 440 448 447 452 462 457 439 431 447 475 493 490 468 447 448 472 489 473 440 423 430 444 457 477 494 490 472 470 485 481 445 415 424 449 456 460 490 526
3520 526 524 495 496 545 584 566 512 465 425 370 317 315 374 446 478 464 441 445 482 529 560 563 544 523 519 535 550 536 493 460 470 498 495 452 413 408 410 388 364
3515 364 383 444 493 498 471 435 398 372 369 382 389 385 386 394 390 374 380 423 460 452 416 401 413 413 391 375 380 379 355 330 324 326 316 306 314 335 344 339 343 367 400 431 461 489
3510 489 503 491 459 430 428 453 478 476 460 462 488 506 493 475 485 510 514 485 448 420 402 398 418 447 451 423 394 393 414 435 453 467 467 454 445 456 478 499 523
3505 523 554 572 555 508 462 436 430 439 458 479 498 513 520 512 498 497 510 508 474 437 425 430 423 411 421 449 460 441 418 412 412 409 420 453 487 485 445 408 418 483 560
3500 560 583 531 452 411 417 427 424 432 460 481 477 466 469 469 454 439 442 448 439 431 450 488 519 530 528 518 508 514 534 535 508 497 537 588 591 555 531 525 494 438 413 445
3495 445 495 528 557 583 558 468 386 398 484 553 560 537 512 479 447 459 526 593 604 568 538 537 541 524 498 492 519 568 612 630 616 577 532 497 481 484 499
3490 499 513 514 502 499 519 546 540 489 428 403 413 426 431 442 461 466 452 441 445 447 433 416 415 421 421 418 418 410 391 379 384 390 385 386 402 410 400 410 463 509 480 404 372 404
3485 404 430 408 395 440 494 490 449 446 497 538 524 479 447 436 424 389 336 299 319 387 437 428 400 423 493 540 533 520 547 588 595 564 528 506 500 514 545 568
3480 568 561 528 496 478 475 481 481 454 404 377 405 460 488 485 487 502 501 478 468 484 490 463 444 470 509 500 448 413 423 443 444 445 463 483 485 486 514 561 594 597 586 578
3475 578 576 575 561 518 454 415 432 477 493 472 453 462 468 439 391 362 362 368 370 381 404 426 431 428 436 458 478 477 461 453 464 475 465 440 433 452 468 452 413 381 372 377
3470 377 388 400 410 408 392 366 342 343 382 442 471 438 373 336 349 381 397 394 387 385 390 405 428 447 459 472 483 483 473 477 508 547 566 556 526 488 455 455 501
3465 501 555 564 525 484 472 465 433 392 385 413 438 431 407 390 383 386 410 450 465 423 354 326 367 428 444 406 356 330 337 364 401 432 450 458 461 454 430 404 403 434
3460 434 473 489 476 455 450 472 506 521 498 456 433 441 458 463 461 465 464 447 427 427 441 450 457 480 512 511 459 399 392 441 494 506 484 456 436 414 381 342 312 310 338
3455 338 369 372 349 350 413 512 584 597 578 561 549 531 511 504 508 515 518 503 460 416 422 491 563 574 541 525 536 528 489 469 506 571 610 609 585 547 510 503 522 518
3450 518 461 398 393 435 455 432 406 402 397 373 361 383 416 427 425 431 444 459 486 527 545 510 447 403 388 373 349 335 337 337 342 374 425 442 409 382 410 462 475
3445 475 446 432 450 452 404 345 329 352 374 388 407 424 407 365 346 371 407 421 427 456 502 533 540 540 539 529 512 496 475 441 405 394 410 434 455 471 477 460
3441 460 438 439 455 442 389 353 386 463 511 512 504 515 524 509 498 530 595 630 599 529 475 461 460 441 415 413 441 469 475 478 512 578 630 626 566 492 439 411 389
3436 389 364 347 354 383 426 477 531 568 566 526 482 459 457 464 485 518 543 536 511 502 519 534 524 498 477 470 475 484 490 485 476 473 471 452 417 398 417 459 502 540 575 587
3431 587 556 498 456 451 469 487 496 488 452 396 356 353 369 380 382 385 387 381 369 363 369 392 432 475 484 448 412 427 480 507 484 454 456 471 471 466 483 504 498 475 478 515 550
3426 550 556 542 523 500 476 467 477 490 503 536 590 631 619 557 477 405 355 348 398 480 541 553 533 515 515 528 545 549 521 458 391 361 385 434 465 463 450 451
3421 451 464 468 456 442 434 429 423 428 455 496 521 505 446 373 327 327 363 410 460 503 519 500 474 474 490 485 455 439 453 473 480 484 495 490 460 431 421 408 376 359
3416 359 393 454 486 479 471 484 504 517 511 476 419 387 414 463 478 465 478 521 535 502 471 474 471 422 362 350 384 412 407 391 389 403 424 447 468 482 479 447 402
3411 402 380 404 448 466 457 455 467 466 445 432 433 421 400 417 473 500 450 375 354 385 419 441 469 494 487 457 444 455 462 465 482 502 492 456 437 454 490 527
3407 527 555 549 498 449 461 514 531 499 480 501 509 465 414 405 421 421 417 440 475 485 474 461 441 408 399 448 519 539 497 457 464 496 516 526 535 527 488 443 433
3402 433 461 492 496 478 465 474 494 501 487 470 461 452 431 407 402 428 471 509 529 530 519 513 524 551 578 583 556 508 473 477 507 527 522 512 512 508 480 442 425 439 468
3397 468 496 516 518 496 462 440 435 436 432 427 435 461 505 552 584 596 598 594 576 547 527 528 536 526 501 483 479 484 492 501 495 467 440 447 483 514 522 518 510 492 471 471 495 512 502
3391 502 486 497 526 533 497 437 391 381 406 446 477 479 455 425 411 424 448 464 464 462 463 463 468 502 573 642 658 617 566 540 536 534 525 508 486 475 497 540 557 527
3387 527 486 475 484 466 408 349 331 352 385 411 431 450 466 473 466 452 449 472 506 519 503 480 476 480 464 426 400 412 443 451 430 412 420 446 477 520 579 624 625
3382 625 594 575 573 555 515 489 499 514 500 475 479 509 528 521 501 485 476 477 496 516 507 465 423 411 424 440 443 435 425 427 453 485 490 458 412 385 384 399 431 477
3377 477 515 515 481 447 429 405 359 324 343 405 453 456 443 448 454 433 398 394 428 460 461 454 467 488 489 471 452 440 432 432 445 452 438 422 425 433 414 375 364 393 419
3372 419 412 404 437 496 532 537 548 575 587 567 542 540 546 529 496 484 506 535 540 523 499 472 445 432 453 496 525 519 498 493 500 491 449 391 354 362 412 475 522 535
3367 535 519 487 450 422 423 463 519 543 515 466 447 477 526 553 553 556 585 617 608 541 464 439 471 504 492 451 435 460 491 490 466 459 490 528 525 473 418 411 445
3362 445 461 425 383 400 471 524 508 450 416 424 444 450 451 460 468 464 449 437 437 453 483 515 526 509 488 492 525 572 613 626 602 561 551 597 654 643 552 450
3358 450 411 424 427 400 390 435 509 551 535 495 481 501 519 507 475 455 458 462 450 432 422 421 421 426 448 484 519 540 543 533 526 529 536 538 547 578 611 599 530 456 424
3353 424 409 375 344 366 430 466 452 442 472 501 483 442 432 444 436 408 406 438 452 412 351 327 348 377 391 403 435 482 515 513 481 443 412 387 372 375 400
3348 400 425 434 432 438 454 468 476 480 472 441 401 387 409 436 437 425 436 480 519 511 463 424 431 461 468 444 430 451 473 450 397 366 374 390 400 426 474 505 494 476
3343 476 489 512 496 451 439 483 537 557 548 540 542 539 523 497 462 425 398 384 373 366 377 404 427 438 453 469 463 423 378 358 356 357 382 448 511 514 465 431 435 430
3338 430 394 368 381 397 375 346 360 407 437 443 457 474 461 427 427 478 527 520 475 444 446 463 473 469 461 464 487 511 515 504 503 510 496 459 440 454 464 435 393 391
3333 391 434 488 533 567 575 542 484 445 440 451 465 475 471 451 452 507 581 598 544 485 468 465 439 419 448 497 502 462 434 440 438 402 375 404 463 484 455 425 436
3329 436 466 465 422 370 347 357 388 425 450 452 434 421 426 432 424 413 413 408 374 326 313 352 408 447 467 475 457 425 425 487 559 573 531 500 515 542 547 542 544 532 489
3324 489 449 453 485 495 478 475 500 515 490 455 450 470 488 503 535 567 556 505 471 493 536 542 512 487 483 473 448 432 439 442 416 388 400 454 503 517 511 521 552
3319 552 574 561 523 493 491 504 504 493 494 510 519 507 497 507 524 515 483 465 483 512 516 484 445 428 441 464 476 479 488 502 495 459 429 443 484 499 475 460 501
3314 501 572 620 630 634 641 622 560 493 470 490 503 491 482 500 524 522 505 510 542 569 563 527 470 401 348 350 399 430 397 339 326 374 429 445 433 415 399 387
3309 387 401 443 474 451 385 329 316 337 369 418 494 580 636 642 623 611 604 571 510 459 458 506 569 612 619 606 600 607 598 545 477 456 490 517 497 478 509 551
3305 551 527 447 393 398 418 425 444 485 506 489 482 515 539 505 454 454 487 480 422 385 420 487 523 508 461 414 391 396 412 422 442 486 526 522 487 476 495 495 449
3300 449 399 392 411 418 412 426 461 486 479 454 435 438 460 486 500 498 489 471 438 410 419 460 489 481 464 463 465 451 454 510 587 610 557 480 431 413 414 437 474 492 472
3295 472 433 408 406 420 443 468 485 491 499 507 494 457 427 431 451 456 454 481 530 550 513 463 462 506 534 515 475 455 454 440 410 391 396 407 409 416 443 477 493 490 491 504
3290 504 517 527 552 595 624 600 525 448 422 447 481 487 472 467 475 466 423 381 374 389 394 397 433 485 490 428 362 355 394 429 457 501 542 532 473 422 413 416 400 387
3285 387 408 451 476 474 471 479 484 476 462 449 439 444 475 518 535 518 509 543 598 604 536 447 410 432 464 466 456 462 476 478 479 504 551 580 572 549 531 503 452 410 420
3280 420 465 481 443 392 387 428 471 486 476 454 424 396 386 401 432 471 515 560 593 599 583 561 544 535 531 526 508 475 454 470 511 535 526 511 507 496 463 438
3275 438 460 507 524 499 470 453 424 382 367 395 424 417 402 416 443 450 452 487 537 562 575 615 660 636 547 481 483 493 452 406 428 498 537 522 492 470 446
3271 446 432 461 524 562 542 497 460 432 411 412 437 452 441 430 447 474 477 456 440 440 455 480 506 510 488 470 486 528 565 593 625 650 642 608 582 569 542
3266 542 498 473 481 483 448 416 450 542 618 630 601 577 570 567 567 581 605 618 608 581 554 540 542 554 565 572 578 587 591 586 576 565 550 524 494 479 483 488 479 465 468 495
3261 495 522 521 492 469 484 535 579 573 519 456 418 406 404 406 419 438 446 433 410 408 442 500 544 543 497 443 420 442 484 512 504 463 409 367 351 359 378 395 407
3256 407 414 415 406 397 402 432 473 496 487 465 462 486 514 524 523 534 562 593 612 616 600 554 486 423 388 381 388 393 390 377 360 359 388 433 462 460 446 448 473 509 537 549 538
3251 538 505 458 408 367 345 343 353 362 372 399 444 480 479 450 431 437 444 434 426 452 507 554 560 523 458 395 373 412 486 539 545 526 511 509 521 549 575 561 509
3246 509 484 533 615 644 606 571 583 603 570 498 452 460 492 511 512 511 521 547 580 597 581 549 541 574 617 625 589 537 504 498 509 522 530 532 526 514 503 509 536 570
3241 570 581 553 500 457 452 475 497 499 487 477 464 448 445 462 476 451 406 394 435 475 464 424 415 447 480 483 472 469 476 483 486 481 467 450 443 438 425 412 424 462 498
3236 498 519 542 571 576 538 482 445 435 447 491 565 626 631 596 573 577 575 552 541 569 610 619 592 558 545 557 578 588 582 579 595 616 605 569 548 553 537 474 414
3232 414 418 460 464 424 415 483 571 605 584 567 579 595 590 569 551 543 546 560 577 588 589 582 570 559 550 536 510 486 493 534 576 598 615 644 664 646 604 582 587 582 545
3227 545 497 462 443 444 481 551 604 596 548 518 529 548 534 500 498 546 604 613 569 519 500 497 480 456 454 476 494 501 510 519 514 508 529 569 577 540 508 513 519 487 454 474
3221 474 522 526 473 425 422 436 432 426 446 484 516 531 534 522 497 481 488 506 516 511 502 492 473 444 415 399 401 412 415 402 396 423 474 509 495 440 381 358 380 426
3217 426 456 460 463 484 508 514 512 523 535 520 488 481 505 527 531 540 562 562 527 496 510 551 574 574 579 602 628 639 628 594 556 538 542 533 494 454 451 476 485 460 417 387
3211 387 397 449 513 537 512 487 496 513 496 470 476 503 500 467 459 496 541 564 577 586 570 530 515 549 588 582 546 519 507 490 475 490 531 559 555 544 547 553 536
3207 536 500 478 492 522 536 524 508 508 513 512 521 560 605 612 580 551 544 534 501 467 464 484 498 502 507 510 497 473 455 458 478 509 545 582 611 625 613 573 531 522 545
3202 545 561 547 526 525 536 527 496 468 455 454 460 471 485 502 533 571 583 550 498 476 496 528 534 505 462 439 460 508 532 507 467 466 511 563 590 587 555 496
3197 496 432 396 392 397 401 424 470 503 487 438 402 403 420 426 426 444 486 524 533 527 538 571 598 606 603 590 542 459 402 427 506 557 546 519 532 575 607 613 610 616 623 606
3192 606 551 478 430 429 443 435 411 402 412 413 406 428 491 549 567 564 576 591 567 502 444 436 471 513 535 542 554 578 598 600 595 597 589 545 474 421 409 416 423 441 478 516
3187 516 535 545 560 565 535 481 439 434 463 504 530 526 510 521 555 557 500 434 420 450 478 495 525 546 506 422 382 430 506 522 469 408 389 418 474 526 539
3182 539 508 467 454 469 486 495 499 500 494 490 498 509 512 512 522 537 535 513 492 483 476 461 446 435 418 387 360 361 385 406 419 445 500 567 618 645 647 619 561 504 484
3177 484 501 521 524 524 537 553 557 550 540 519 487 463 466 483 490 486 481 473 453 435 438 455 471 487 510 524 510 485 483 500 499 477 466 476 471 433 398 399 422 437 443 452 459
3172 459 462 480 526 573 591 586 584 585 571 547 525 503 475 457 465 483 490 500 527 546 524 485 483 520 539 513 480 470 460 434 425 467 528 546 513 471 448 436 425
3167 425 424 443 480 521 552 557 536 510 509 530 544 519 456 385 353 386 458 504 490 438 399 386 386 394 421 458 483 490 493 494 479 454 447 461 462 427 387 388 423 446
3162 446 445 449 476 500 498 489 505 545 576 579 556 520 493 500 545 586 574 517 478 486 504 495 480 493 513 502 476 488 534 545 486 417 402 432 453 448 442 443 443 452 490
3157 490 537 554 545 555 601 651 673 674 669 646 599 554 542 554 559 551 549 554 553 539 528 538 567 606 639 654 644 621 602 591 577 555 529 507 486 464 447 446 470
3153 470 512 555 576 567 546 538 547 563 576 589 604 613 599 567 540 526 507 463 414 408 451 495 490 450 419 411 404 401 430 483 506 468 409 390 413 442 463 493 531
3148 531 542 512 467 451 473 515 549 557 535 499 469 453 452 464 485 494 477 448 444 476 520 547 550 536 518 511 519 529 521 502 500 513 508 477 464 505 574 606 577 532
3143 532 514 525 535 516 469 419 402 432 486 529 563 602 635 628 594 592 645 690 664 600 583 625 655 638 619 640 666 648 615 623 655 642 576 523 522 535 519
3138 519 498 514 557 594 616 628 621 594 584 616 652 636 578 534 526 519 488 453 437 440 456 484 507 503 485 482 485 452 388 355 396 470 519 538 548 546 516 472 447
3134 447 443 448 456 463 448 399 358 376 448 514 530 520 534 584 628 624 579 545 551 568 548 507 506 552 581 559 531 550 585 582 547 532 547 560 563 575 589 584 572 579
3129 579 592 575 544 552 598 615 569 506 480 488 499 503 498 480 467 487 527 539 508 476 477 488 488 495 513 505 458 432 480 562 599 582 568 573 554 489 423 411 458
3124 458 517 540 516 473 451 459 476 485 494 510 523 528 536 549 543 516 508 538 572 568 544 541 554 548 532 544 581 591 557 529 552 607 651 665 653 621 580 565 598 662
3119 662 711 714 682 660 690 758 804 783 729 713 751 800 826 852 913 1000 1079 1129 1152 1166 1194 1236 1253 1214 1143 1096 1083 1053 979 903 873 870 834 753 680 657
3115 657 671 680 669 658 668 685 679 645 615 617 634 641 648 678 711 699 636 577 565 582 586 569 544 517 493 495 523 544 530 501 490 494 492 495 537 611 663 659 624 603
3110 603 611 631 638 622 590 571 595 651 686 655 578 522 524 556 568 559 571 617 649 628 580 562 578 577 541 515 533 569 576 558 547 546 534 514 513 534 550 551 561
3105 561 594 623 619 590 570 570 571 557 539 540 553 563 577 617 672 682 615 519 479 522 597 647 666 665 648 616 584 561 546 551 595 662 700 689 669 682 710 713
3100 713 693 675 661 641 631 651 677 672 645 647 684 704 670 611 579 576 573 552 534 546 587 626 632 607 577 554 527 505 522 599 691 734 713 664 627 609 604 610
3096 610 620 634 657 680 678 644 612 603 594 559 521 517 538 544 540 561 598 606 584 588 637 683 685 664 653 646 634 628 632 622 597 600 647 688 675 633 620 638 647 630 606 600
3091 600 630 706 798 839 797 723 692 707 716 693 667 662 664 657 647 650 676 726 783 808 779 711 633 560 507 506 567 641 672 668 676 699 699 671 654 658 647 607 580 599
3086 599 638 649 637 642 677 713 724 713 704 711 736 762 770 756 735 725 731 749 769 779 772 760 758 761 755 734 711 689 670 663 677 696 693 670 661 676 690 683 675 687 707 703
3080 703 681 683 727 786 814 800 768 748 751 768 791 815 836 848 854 866 891 920 942 956 975 1007 1055 1122 1204 1294 1392 1496 1581 1607 1571 1520 1489 1462 1408 1342
3076 1342 1294 1249 1163 1047 962 934 921 886 841 804 767 723 702 718 735 710 661 635 648 682 725 764 773 743 714 731 765 747 676 629 659 722 736 696
3072 696 664 684 731 744 696 627 597 631 687 711 703 701 721 724 686 639 630 653 670 668 671 679 663 618 583 592 623 638 632 621 610 601 616 673 740 760 727 691 687 695 687
3067 687 673 675 686 689 694 710 722 710 685 676 682 683 676 684 712 741 756 758 751 734 719 726 758 792 804 792 768 754 756 757 728 677 658 698 755 767 736 707 703 707 712 732 751
3062 751 735 688 661 682 721 744 742 719 677 642 652 702 733 713 676 659 655 646 649 676 705 716 732 776 818 822 792 760 734 708 691 693 693 683 693 742 794 805
3057 805 793 801 824 827 815 820 831 809 765 754 795 845 864 849 803 722 641 614 645 684 706 728 757 762 727 691 689 714 742 767 785 784 787 831 905 934 874 789
3052 789 773 829 881 874 828 794 791 799 801 803 839 923 1016 1057 1040 1018 1038 1080 1108 1122 1135 1142 1127 1101 1099 1140 1225 1346 1488 1631 1778 1965 2217 2511 2802
3048 2802 3070 3314 3503 3585 3543 3411 3233 3032 2810 2565 2309 2064 1863 1718 1609 1507 1404 1319 1266 1242 1237 1244 1247 1230 1187 1131 1083 1051
3045 1051 1033 1029 1040 1060 1073 1061 1028 999 994 1000 996 985 984 993 992 976 966 979 1008 1034 1038 1012 981 988 1036 1063 1018 941 919 961 991 968 946 979 1042 1078 1083 1089 1100 1094
3040 1094 1076 1068 1077 1098 1128 1158 1165 1147 1132 1135 1136 1128 1136 1168 1186 1170 1166 1213 1270 1273 1234 1207 1198 1184 1177 1214 1277 1314 1324 1345 1375 1377 1350 1329 1316 1288 1264 1289 1351 1384
3035 1384 1376 1383 1429 1471 1480 1487 1504 1499 1462 1448 1490 1556 1606 1646 1689 1713 1711 1720 1761 1794 1779 1735 1704 1694 1694 1707 1732 1758 1796 1873 1975 2047 2069 2082 2118 2162 2211 2302
3030 2302 2430 2519 2530 2532 2607 2739 2862 2966 3089 3238 3392 3553 3729 3893 4017 4118 4214 4295 4359 4444 4576 4720 4845 4968 5100 5195
3027 5195 5231 5260 5330 5438 5595 5870 6275 6693 7036 7378 7826 8345 8846 9370 10027 10826 11695 12620 13621 14673 15804 17195 19017
3024 19017 21273 23990 27470 32131 38306 46548 58025 74132 95660 122498 153566 185831 213167 227763 224510
3022 224510 204618 174633 141991 111603 85722 65206 50021 39219 31466 25788 21661 18634 16277 14387 12942
3021 12942 11841 10900 10045 9313 8691 8108 7567 7107 6680 6204 5719 5339 5079 4847 4607 4416 4306 4237 4177 4134 4100 4041 3954 3837
3018 3837 3636 3291 2842 2411 2074 1831 1669 1586 1550 1514 1495 1543 1636 1698 1705 1706 1710 1661 1542 1428 1366 1315 1229 1148 1139 1182 1202 1173 1132 1111 1112 1125
3014 1125 1135 1115 1053 985 964 995 1027 1018 971 917 881 863 848 817 778 757 773 811 841 848 839 823 796 763 747 770 818 852 844 810 785 782 790 802 817 823 808 791
3009 791 806 846 869 870 896 959 997 958 896 897 957 995 981 967 983 993 966 932 940 978 1001 976 913 850 837 885 940 934 878 849 880 925 939 937 948 953 936 931
3004 931 972 1024 1029 995 981 1014 1055 1065 1044 1021 1015 1019 1014 1002 1008 1043 1066 1035 980 977 1030 1063 1035 1007 1029 1052 1018 976 1008 1083 1101 1062 1063 1139 1204 1192 1150 1145 1155
3000 1155 1126 1071 1037 1034 1032 1024 1033 1063 1099 1127 1149 1160 1162 1166 1174 1166 1137 1114 1130 1181 1232 1255 1232 1166 1090 1060 1100 1174 1221 1221 1193 1156 1124 1120 1156 1215 1261 1279 1278 1261
2995 1261 1213 1138 1070 1041 1051 1071 1077 1066 1051 1040 1031 1031 1050 1083 1097 1067 1008 967 961 968 967 963 960 946 919 903 920 959 1001 1041 1076 1077 1023 950 916 929 943 932 927
2990 927 955 992 988 946 913 917 928 908 863 831 827 831 827 824 834 847 852 864 899 934 926 868 805 782 797 812 811 803 804 809 804 786 767 766 788 823 859 881 872 828 781 783 836
2985 836 876 856 811 808 848 864 828 788 784 804 818 835 872 918 956 981 990 974 947 952 998 1035 1026 998 987 981 961 952 986 1032 1035 999 988 1028 1081 1110 1108 1078 1034
2980 1034 1012 1047 1108 1132 1107 1080 1076 1061 1013 965 951 960 965 961 950 933 918 927 948 937 875 813 804 835 857 859 865 882 886 862 824 792 785 808 840 836 784 739 756 812
2975 812 827 783 753 792 862 883 852 830 851 881 889 900 943 995 1009 991 988 1008 1007 965 934 965 1038 1090 1098 1080 1046 998 959 964 998 1009 982 960 980 1018 1029
2971 1029 1008 983 968 955 942 930 921 913 914 928 936 917 871 824 803 808 814 790 739 702 703 722 724 714 725 752 759 738 735 773 809 795 748 726 747 774 768 726 677 657
2966 657 687 750 800 804 776 757 760 761 734 689 660 671 711 740 737 722 722 729 717 694 690 703 693 649 623 657 725 769 769 750 731 710 689 672 655 636 633 662 709
2961 709 747 770 790 806 807 789 762 735 712 698 694 692 694 713 743 756 746 752 796 834 806 721 658 661 703 732 738 736 725 695 656 636 651 680 691 687 709 777 841
2956 841 832 759 710 741 808 822 762 678 628 634 686 752 792 797 794 809 818 799 770 763 771 761 731 715 734 773 807 826 834 848 873 887 866 828 825 857 863 818 784 821
2951 821 892 923 912 909 916 899 863 848 852 837 811 812 834 834 808 803 826 840 838 852 883 889 874 883 916 913 854 804 805 824 828 842 887 918 898 859 841 831 793 746 742
2946 742 791 862 923 954 950 926 909 894 862 832 837 865 861 826 824 876 916 900 875 889 910 892 861 858 872 874 885 926 953 924 874 862 877 870 847 845 859 852 838
2941 838 860 913 953 962 961 946 907 867 864 884 885 869 879 921 948 942 936 952 964 936 878 842 869 944 1003 990 933 908 935 963 968 990 1049 1080 1040 983 979 1008 1016
2937 1016 1021 1061 1096 1063 998 987 1030 1050 1032 1037 1079 1101 1079 1063 1079 1091 1078 1075 1105 1139 1151 1144 1120 1077 1048 1080 1160 1229 1251 1233 1188 1139 1137 1203 1262 1240 1192
2932 1192 1226 1326 1374 1339 1313 1332 1322 1252 1206 1244 1301 1304 1288 1315 1362 1382 1387 1413 1451 1473 1480 1479 1457 1429 1448 1517 1567 1570 1578 1631 1683 1693 1696 1737 1785 1804 1830
2928 1830 1912 2029 2119 2165 2193 2218 2244 2273 2276 2216 2111 2031 2001 1973 1921 1884 1872 1829 1739 1669 1667 1692 1698 1707 1742 1768 1776 1821 1918 1987 1976 1943 1963 2014 2056 2108
2923 2108 2193 2276 2332 2399 2492 2561 2592 2655 2769 2852 2861 2875 2948 3015 3022 3025 3060 3052 2963 2894 2920 2969 2985 3051 3226 3418 3571 3784 4109 4411 4596 4789
2919 4789 5086 5358 5506 5696 6068 6475 6777 7151 7780 8495 9115 9872 11058 12540 14114 16073 18854 22471 27091 33928
2917 33928 44680 60235 80728 106174 134889 160776 174589 170324 150275 122769 95469 71791 52528 38134
2915 38134 28539 22431 18171 15024 12890 11437 10177 9033 8177 7532 6889 6296 5918 5665 5334 4966 4739 4617 4433 4201
2913 4201 4061 4012 3947 3889 3935 4041 4074 4035 4014 4002 3914 3776 3691 3659 3588 3474 3400 3398 3431 3495 3620 3775 3895 3987 4090 4194 4279 4386 4554
2909 4554 4739 4892 5064 5323 5623 5878 6108 6384 6668 6863 6969 7084 7244 7391 7493 7578 7654 7705 7760 7878 8062 8273 8536 8922
2906 8922 9449 10077 10800 11658 12655 13746 14896 16064 17133 17963 18515 18857 19050 19120 19153 19295 19653 20254 21144 22441 24267 26699
2904 26699 29822 33798 38837 45148 52894 62126 72687 84166 95874 106808 115727 121471 123389 121537 116513 109154
2902 109154 100345 90927 81638 73062 65622 59572 54976 51731 49634 48399 47662 47033 46186 44895 43017 40520 37527 34275
2899 34275 31004 27904 25117 22729 20742 19114 17832 16886 16204 15683 15286 15048 14968 14987 15066 15236 15528 15939 16476 17194 18151
2897 18151 19384 20953 22929 25319 28060 31099 34404 37839 41127 43988 46284 48000 49182 49972 50678 51711 53458 56236
2895 56236 60306 65846 72888 81317 90854 101000 111007 119980 126979 131051 131319 127319 119337 108389 95806 82810
2893 82810 70358 59140 49555 41681 35368 30388 26526 23581 21371 19761 18652 17956 17574 17414 17401 17450 17442 17246 16782 16052
2890 16052 15101 13975 12730 11459 10279 9264 8416 7693 7061 6511 6041 5638 5274 4917 4549 4176 3821 3500 3222 2987 2776
2888 2776 2563 2356 2210 2159 2151 2108 2021 1951 1919 1881 1810 1738 1695 1662 1620 1588 1575 1546 1483 1433 1433 1442 1401 1330 1302 1328 1351 1344 1334 1333 1316 1261 1194 1155 1163 1217
2883 1217 1293 1332 1285 1180 1102 1099 1133 1144 1121 1099 1102 1122 1136 1131 1114 1107 1112 1102 1059 1011 1004 1046 1094 1114 1121 1139 1167 1181 1171 1149 1139 1164 1218 1268 1280 1259 1241
2879 1241 1242 1251 1264 1288 1324 1356 1377 1395 1413 1416 1405 1400 1421 1461 1508 1550 1583 1607 1633 1680 1743 1787 1784 1744 1709 1716 1761 1795 1768 1695 1653 1693 1774 1817 1809 1796 1801 1789
2874 1789 1747 1711 1709 1712 1688 1661 1663 1674 1645 1580 1528 1521 1539 1549 1541 1523 1500 1476 1452 1421 1378 1334 1307 1308 1332 1362 1379 1375 1367 1379 1410 1432 1434 1442 1471 1502 1513 1523 1560
2869 1560 1604 1605 1559 1525 1553 1618 1654 1636 1604 1607 1650 1699 1727 1733 1725 1712 1710 1736 1778 1781 1715 1626 1588 1598 1589 1531 1483 1491 1519 1506 1471 1471 1508 1517 1468 1396 1339 1292 1247
2865 1247 1224 1240 1276 1294 1270 1214 1162 1155 1195 1230 1211 1155 1116 1108 1093 1046 989 951 922 897 890 904 911 892 865 848 827 796 785 816 857 859 822 783 759 743 738
2860 738 760 796 812 802 794 807 827 840 845 837 807 766 738 729 719 703 700 714 725 716 699 691 688 684 683 685 675 653 647 681 730 754 746 733 732 729 712 684 656 642 654 690
2855 690 721 714 675 641 637 649 645 606 540 478 466 522 608 659 652 624 618 635 651 659 662 653 635 626 633 630 592 536 507 520 561 622 692 736 717 653 606 607 625 631 646
2850 646 685 718 711 689 692 711 699 654 626 640 669 675 654 621 593 588 616 651 656 634 630 665 700 698 682 695 726 726 677 618 585 577 573 561 541 519 506 507 519 538
2845 538 559 576 577 574 588 616 612 549 465 428 456 511 562 600 612 588 550 542 570 595 593 585 587 581 556 540 554 577 583 588 615 642 637 617 628 665 681 661 640 636 625
2840 625 594 576 601 655 696 708 702 686 654 612 589 616 692 761 761 688 614 596 603 569 503 478 523 574 576 557 566 586 573 542 548 593 620 603 575 573 590 597 592
2835 592 579 561 548 560 599 636 645 632 623 623 626 624 614 593 567 552 560 585 612 638 664 685 697 702 701 689 668 655 659 668 661 639 620 611 604 589 574 574 594 622 642 649
2830 649 654 662 661 635 599 576 569 553 522 505 528 568 581 569 573 609 636 606 540 506 547 625 662 627 563 527 534 555 566 569 573 579 591 615 638 643 637 652 694 726
2825 726 714 681 676 706 733 733 721 717 719 720 731 764 811 851 868 870 883 929 991 1019 993 946 927 937 939 924 917 928 936 935 949 972 962 902 845 844 875 878 844 823 832
2820 832 841 831 824 837 850 844 831 826 815 780 737 718 735 769 792 785 740 677 638 640 654 649 644 681 750 788 763 714 697 715 740 764 804 856 886 879 855 838 823
2815 823 803 803 854 943 1008 999 934 878 870 896 921 927 914 887 855 839 853 888 917 925 925 927 928 924 920 916 899 873 863 881 900 889 864 875 944 1052 1170 1291 1403
2811 1403 1479 1503 1474 1395 1264 1104 959 853 784 751 761 793 792 740 687 678 684 657 613 604 628 637 617 615 649 675 658 621 602 595 579 559 549 547 552 578 624
2806 624 653 639 603 578 569 567 579 605 618 602 591 618 662 672 646 629 635 637 613 579 555 548 567 620 688 735 751 759 772 770 741 693 644 606 598 623 643 616 557
2801 557 537 580 629 628 599 600 635 665 667 654 636 612 586 565 550 538 543 576 620 646 645 628 598 560 533 532 545 555 567 596 629 641 634 631 631 608 554 496 458
2797 458 451 477 534 594 618 608 598 608 621 627 639 653 635 578 530 534 561 557 527 519 546 570 567 564 590 632 653 643 617 595 581 571 559 539 522 522 531 528 507 498
2792 498 516 544 552 549 567 613 652 655 622 573 533 521 547 584 588 553 522 531 563 585 606 651 698 692 626 566 563 594 610 606 603 597 566 527 521 556 597 614 617 621 625 621
2787 621 607 588 582 608 658 677 618 522 481 523 585 608 609 626 644 625 581 553 551 545 526 519 542 579 606 610 593 574 583 619 644 627 595 602 650 690 692 676 670 672
2782 672 670 667 665 657 640 625 618 612 612 624 638 635 625 638 670 678 642 599 589 610 640 673 695 670 588 504 483 519 550 545 539 568 621 654 642 604 581 594 625 643
2777 643 646 649 643 605 550 530 555 569 546 538 588 649 653 628 641 671 643 569 553 623 680 640 558 533 574 627 667 687 659 578 512 522 569 571 534 535 587 619
2772 619 593 563 576 598 581 546 546 585 622 639 651 658 644 615 613 659 714 719 665 607 599 633 652 623 575 551 561 583 605 620 620 604 595 614 649 675 694 721
2767 721 741 720 665 631 655 715 769 802 806 771 708 662 656 661 640 616 633 680 699 668 632 637 670 696 709 723 734 726 704 696 711 725 721 721 754 805 829 809 788
2763 788 813 886 972 1050 1109 1137 1130 1114 1113 1120 1112 1098 1111 1148 1175 1189 1236 1338 1453 1543 1633 1768 1950 2147 2349 2561 2756 2888 2943 2937 2871 2731
2759 2731 2538 2351 2208 2099 2002 1916 1845 1776 1704 1647 1619 1610 1593 1564 1531 1499 1469 1452 1455 1460 1443 1412 1392 1386 1362 1300 1232 1215 1247 1275 1263 1247 1269 1301
2755 1301 1289 1240 1226 1276 1332 1348 1359 1417 1506 1578 1640 1728 1828 1895 1927 1967 2008 1991 1903 1808 1763 1755 1768 1833 1959 2091 2187 2283 2426 2576 2659 2679
2751 2679 2710 2764 2769 2671 2509 2350 2219 2102 1986 1850 1670 1468 1314 1249 1238 1214 1177 1177 1226 1273 1277 1252 1238 1236 1214 1158 1093 1047 1029 1031 1047 1069
2747 1069 1080 1072 1058 1048 1039 1024 1012 1019 1038 1045 1027 1001 987 995 1022 1057 1079 1071 1037 1000 972 951 938 946 969 974 935 861 787 742 739 767 792 783 760 765 795 789 727 678
2742 678 705 764 766 704 666 697 741 737 704 696 716 723 695 657 634 630 635 642 650 666 691 704 682 634 598 586 573 543 526 549 588 599 589 601 648 692 700 687 685 704
2737 704 726 736 733 717 696 687 707 747 770 749 701 675 692 719 708 661 624 625 643 648 650 675 717 743 736 712 692 683 682 683 676 653 621 596 585 587 598 622 663 704
2732 704 714 677 613 568 581 640 699 725 724 724 738 756 774 791 802 791 758 717 688 674 669 670 683 706 721 706 667 634 631 649 663 673 701 744 763 729 672
2728 672 646 663 689 686 655 622 609 618 647 684 712 708 672 637 650 717 791 814 781 738 727 745 765 766 738 689 649 649 679 694 678 659 658 657 637 627 659 703
2723 703 713 699 709 744 758 735 715 722 729 715 705 723 747 743 721 711 715 713 701 694 694 694 704 730 750 736 702 691 714 732 712 673 648 641 633 621 622 643 661 660 659
2718 659 686 739 777 766 726 695 683 665 630 608 636 699 748 751 731 734 772 813 812 762 697 658 657 686 729 767 777 751 718 713 731 738 724 713 712 694 650 629
2713 629 674 753 790 764 734 752 803 839 842 828 810 790 773 773 784 782 752 717 708 725 735 724 718 748 807 855 866 847 816 783 763 766 794 827 843 835 804 763
2709 763 742 771 835 883 886 866 862 885 913 925 907 857 798 769 787 826 853 861 858 835 793 757 751 762 768 767 768 762 745 741 771 810 827 842 884 928 918 852 792 773
2704 773 773 775 804 858 900 912 928 961 964 900 810 756 739 736 754 806 857 866 860 896 961 988 965 951 985 1029 1034 1005 975 964 968 988 1016 1033 1031 1019 1001 974 953
2699 953 964 1007 1042 1042 1033 1054 1100 1126 1109 1079 1079 1112 1139 1132 1113 1124 1158 1163 1124 1096 1131 1196 1219 1194 1179 1189 1175 1113 1053 1041 1059 1071 1090 1134 1179 1189 1181 1192
2694 1192 1215 1213 1190 1193 1232 1272 1285 1280 1268 1250 1247 1283 1342 1362 1322 1266 1240 1238 1237 1251 1301 1358 1366 1319 1273 1277 1327 1379 1401 1394 1384 1392 1414 1425 1418 1414 1441 1486 1514 1507 1489
2689 1489 1491 1516 1549 1580 1606 1618 1616 1611 1623 1653 1679 1685 1682 1695 1726 1750 1757 1763 1785 1809 1815 1813 1828 1864 1896 1913 1930 1952 1969 1977 1991 2018 2041 2052 2071 2111 2156 2188 2224
2685 2224 2285 2351 2390 2411 2446 2499 2531 2527 2522 2562 2644 2730 2787 2818 2858 2937 3040 3116 3152 3207 3335 3507 3648 3739 3834 3958 4072 4151 4239 4375 4539
2681 4539 4689 4843 5040 5267 5481 5682 5927 6261 6682 7185 7781 8477 9271 10184 11260 12520 13932 15425 16905 18245 19291
2678 19291 19926 20132 20000 19691 19369 19167 19192 19548 20320 21554 23264 25504 28413 32190 37072 43370 51497 61849 74600
2676 74600 89499 105700 121629 135108 143955 146828 143719 135755 124560 111734 98632 86325 75553 66709 59890
2674 59890 54997 51842 50170 49628 49732 49912 49639 48527 46383 43257 39455 35412 31488 27866 24645 21936 19807 18194
2672 18194 16947 15966 15222 14675 14243 13883 13621 13497 13513 13644 13874 14199 14628 15193 15946 16930 18202 19852 21974 24616 27760
2669 27760 31352 35258 39186 42730 45518 47353 48243 48396 48220 48253 49009 50866 54098 58942 65574 74020 84109 95456
2667 95456 107413 118973 128730 135019 136332 131891 122101 108490 93124 77896 64107 52432 43036 35732 30151
2665 30151 25916 22727 20344 18566 17240 16272 15615 15256 15195 15389 15712 15973 16011 15742 15143 14229 13066 11780 10508 9341
2663 9341 8306 7403 6633 5996 5471 5017 4596 4193 3816 3478 3184 2928 2704 2511 2356 2254 2203 2172 2121 2049 1986 1953 1940 1925 1907 1888
2660 1888 1860 1824 1795 1782 1775 1766 1761 1766 1771 1764 1758 1766 1777 1779 1776 1784 1801 1822 1852 1884 1877 1806 1706 1644 1627 1603 1531 1437 1364 1323 1292 1251 1192 1127 1087 1093 1123 1125 1085 1054 1087
2655 1087 1171 1229 1207 1143 1126 1193 1275 1273 1181 1094 1090 1142 1175 1168 1157 1148 1120 1078 1063 1087 1115 1125 1134 1155 1172 1177 1192 1217 1222 1196 1177 1192 1213 1205 1182 1178 1187 1186 1183 1202
2650 1202 1227 1225 1199 1196 1236 1290 1323 1333 1337 1350 1379 1420 1455 1466 1458 1452 1458 1473 1485 1479 1456 1444 1475 1536 1570 1554 1535 1569 1638 1675 1657 1623 1617 1640 1672 1694 1686 1640 1583
2645 1583 1561 1582 1611 1607 1561 1493 1448 1474 1569 1654 1646 1566 1516 1553 1615 1624 1581 1544 1537 1537 1533 1541 1562 1575 1567 1553 1548 1542 1518 1472 1425 1402 1411 1440 1469 1489 1499 1501 1498 1501 1509 1503
2640 1503 1465 1420 1421 1477 1536 1536 1480 1429 1435 1488 1532 1520 1463 1418 1431 1476 1488 1451 1418 1436 1483 1507 1497 1482 1481 1484 1480 1478 1483 1485 1464 1421 1370 1337 1332 1341 1334 1301 1257 1211
2635 1211 1158 1108 1096 1134 1177 1171 1127 1095 1090 1079 1049 1038 1065 1098 1100 1079 1071 1079 1081 1074 1070 1068 1046 1006 970 955 951 942 928 914 899 880 858 842 838 840 842 834 818 808 814 827
2630 827 828 814 806 822 859 894 900 871 828 809 830 859 839 763 692 686 730 755 732 703 713 753 775 762 734 723 741 781 811 797 740 694 708 764 804 811 817 843
2625 843 856 827 774 735 716 704 701 724 767 804 822 824 816 798 782 783 797 803 793 774 753 728 706 696 698 701 703 714 732 742 733 713 695 696 725 775 811 800 758 728
2620 728 731 747 761 787 829 851 808 714 632 612 647 696 724 722 710 709 718 715 690 661 654 660 650 623 616 651 701 726 724 735 777 817 808 752 693 672 680 692 696 703 710 706
2615 706 699 715 751 764 723 663 643 663 662 612 562 580 656 711 684 598 530 525 566 599 595 566 543 535 539 552 581 624 665 695 714 717 695 660 655 698 747 745 690
2610 690 640 631 644 651 656 677 704 713 701 688 681 676 676 682 673 631 580 572 620 672 672 620 570 568 613 660 659 605 548 534 559 581 585 591 598 577 529 507 545 604 627 621 634
2605 634 664 671 652 652 684 704 681 648 645 653 632 596 593 632 665 657 629 621 640 654 643 622 620 641 666 680 696 722 746 751 744 753 771 767 734 700 692 699 704 716 735 738 712
2600 712 690 710 754 770 746 725 737 768 797 822 848 865 861 848 845 855 872 894 914 916 893 865 858 881 928 984 1033 1054 1040 1013 993 976 953 937 947 975 995
2595 995 994 989 986 975 963 970 990 980 925 873 878 927 959 952 934 927 919 906 907 925 934 921 904 891 855 788 736 742 777 781 750 731 740 744 728 718 733 752 756 754 753 745 732 744
2590 744 784 818 825 827 843 854 843 833 846 863 863 874 922 971 970 939 952 1019 1067 1042 980 945 956 992 1026 1030 982 901 838 820 814 789 766 780 824 864 892 932
2585 932 985 1022 1022 1003 992 992 988 967 935 907 882 844 785 725 690 670 621 532 455 449 509 574 605 620 650 694 712 679 607 544 526 546 561 548 525 528 559
2581 559 591 604 603 597 589 584 585 584 557 499 443 433 479 535 546 510 480 504 563 591 565 530 531 560 575 566 559 568 581 586 586 584 579 580 597 619 623 618 635 672 684 645 591
2576 591 573 596 624 637 640 631 598 552 523 530 556 579 586 580 569 564 568 568 556 539 532 526 512 512 556 631 677 669 644 635 618 566 502 473 481 493 504 526 544 531 509 528
2570 528 589 635 633 610 590 559 521 534 620 706 701 619 551 556 607 651 655 611 536 485 498 544 564 553 553 570 560 509 466 471 504 527 533 526 501 465 452 475 499
2566 499 495 482 489 510 529 553 593 625 629 620 618 597 533 455 423 447 490 526 551 555 523 470 434 432 452 488 525 534 508 499 561 656 687 632 579 598 654 668 625
2561 625 570 541 542 566 592 598 581 570 585 602 591 561 539 528 513 497 493 493 472 439 427 454 499 535 557 561 546 523 518 537 555 549 535 541 559 555 522 491 490 504
2556 504 501 481 468 463 445 416 413 450 496 513 503 482 452 420 422 474 526 522 494 519 591 623 572 510 514 560 575 551 539 556 564 533 486 462 478 519 554 561 553
2551 553 568 619 662 653 599 548 531 546 585 634 665 660 637 623 612 585 549 526 514 492 474 496 562 623 641 627 603 576 552 550 572 591 585 568 553 528 484
2547 484 456 487 568 635 636 583 532 519 528 518 478 443 438 444 439 440 477 535 567 560 550 562 575 574 576 599 616 601 563 528 496 460 430 424 428 424 428 460 500 508 487 480
2542 480 495 495 466 447 470 508 513 480 445 433 440 461 489 510 505 476 452 458 494 540 572 570 536 501 499 538 590 623 621 587 530 478 463 500 562 606 606 570 522
2537 522 489 489 514 536 533 513 505 519 537 540 526 510 504 518 543 556 543 521 518 535 552 562 582 620 655 660 643 626 623 630 635 623 592 561 557 573 574 549 523 515 505
2532 505 483 477 513 565 589 591 593 584 530 449 401 416 463 499 512 500 464 431 435 463 477 467 469 497 517 501 465 430 401 390 423 485 524 519 521 564 605 584 514
2527 514 454 429 426 438 465 477 444 392 376 407 450 482 507 526 528 522 520 513 490 476 498 536 541 516 501 497 470 419 403 448 504 516 487 457 441 433 437 453 469
2522 469 471 465 449 411 367 368 428 488 483 427 389 399 427 441 447 468 508 556 585 575 533 498 492 497 482 451 428 425 425 425 435 457 482 504 524 539 543 546 558 566 554
2517 554 527 517 536 566 592 612 616 586 531 489 477 468 443 429 460 511 522 483 450 468 517 549 549 534 513 483 468 501 572 621 610 574 572 602 612 575 526
2513 526 503 507 520 532 545 552 551 550 557 562 556 548 547 539 514 489 486 490 466 412 370 382 436 489 500 460 398 365 391 446 467 433 395 415 484 534 524 482 453 448 455 474
2508 474 516 564 579 555 528 532 554 565 556 544 536 527 524 536 551 548 535 539 561 573 556 526 505 488 473 483 523 554 539 500 498 542 573 552 516 525 578 627 639
2503 639 626 608 581 539 501 491 506 512 487 448 424 420 414 399 396 415 435 430 413 428 486 547 554 502 445 444 505 577 604 581 547 535 531 512 483 473 495 526 542
2498 542 540 534 523 499 465 448 470 513 543 551 559 581 587 551 495 472 488 501 484 468 486 520 522 482 432 401 396 419 469 528 568 574 556 525 495 482 488 499 497 489
2493 489 483 468 436 408 416 449 469 461 449 449 451 445 439 441 439 427 418 416 412 398 389 396 417 445 483 524 548 546 532 520 510 504 508 516 510 498 509 538 545 508 471 482 522 533 490
2488 490 423 364 325 316 347 403 454 486 506 507 476 422 384 392 432 471 487 482 463 447 445 453 460 470 499 546 575 559 519 503 520 527 496 460 462 493 499 465 440 463
2483 463 499 500 483 507 570 610 603 595 613 614 564 509 511 550 556 519 493 505 528 539 551 565 552 509 480 505 563 597 576 512 452 436 464 488 468 433 447 510
2478 510 555 544 524 545 584 591 571 568 598 630 645 641 614 557 492 460 472 496 502 504 534 598 666 702 701 676 636 575 500 452 474 543 585 558 496 456 441 416
2473 416 369 333 333 362 396 420 425 416 418 450 495 522 531 550 588 615 611 593 585 582 564 525 489 481 505 537 544 517 487 492 524 545 538 526 529 530 514 496 501 523 530 514 499
2468 499 498 490 449 395 380 430 504 534 502 455 440 446 443 438 457 485 473 420 392 434 502 526 497 471 479 506 524 531 536 545 554 560 546 502 446 416 429 463 495 523
2463 523 557 595 623 627 601 554 511 495 502 514 523 542 570 575 537 485 472 517 580 612 596 558 540 565 613 642 625 578 542 535 544 548 543 532 520 526 567 625 651
2459 651 618 562 537 544 533 480 425 414 433 437 421 416 441 471 483 487 492 481 448 425 445 488 501 471 433 418 413 398 381 383 401 412 407 406 436 496 553 566 529
2454 529 475 449 458 473 470 453 437 424 418 433 479 543 589 596 568 534 524 539 546 516 469 464 520 578 577 526 490 499 519 508 472 448 456 489 521 530 513 494 491 501
2449 501 508 521 549 569 549 505 500 559 622 614 538 461 431 443 471 503 535 553 544 510 479 475 495 501 471 434 436 477 506 495 474 479 495 490 466 452 458 474 496 523
2444 523 528 486 425 400 420 441 442 451 487 521 526 519 518 509 475 443 457 512 562 580 574 557 533 509 500 499 487 466 461 482 507 507 487 468 461 463 469 471 458 433 419 440 481
2439 481 505 497 483 486 499 503 499 503 513 517 515 521 532 533 527 540 570 577 539 492 483 503 515 514 525 535 501 424 371 378 408 411 392 385 387 384 392 436 500 534 532 529 541 541 519 513
2433 513 546 582 565 491 411 368 361 378 413 462 507 532 538 533 517 496 490 517 556 561 518 466 451 464 467 452 448 463 461 425 392 403 444 468 463 460 484 524 564 590
2428 590 585 542 487 473 516 570 579 538 485 451 437 436 448 467 483 487 489 500 515 510 476 442 442 473 489 460 409 378 384 406 424 434 444 458 479 502 511 499 483
2423 483 481 484 473 458 465 493 515 520 535 572 603 592 548 516 521 545 561 562 562 566 567 555 540 532 528 514 487 472 491 534 574 599 613 621 616 603 601 620 646 653 627 572
2418 572 523 517 559 599 585 525 482 491 524 531 502 464 446 454 484 522 547 547 523 491 471 475 492 495 476 462 479 514 529 527 544 589 625 624 597 564 527 500 514
2414 514 558 573 528 477 482 523 534 498 466 466 484 501 518 526 507 471 453 467 488 505 534 577 606 602 578 555 529 492 460 450 461 483 505 513 484 429 392
2409 392 404 450 486 495 493 503 533 567 582 565 532 502 469 415 356 348 419 516 557 519 460 444 478 525 547 542 521 499 478 467 474 499 527 538 531 515 496 480
2404 480 484 515 548 553 531 518 526 531 518 511 527 546 544 541 574 620 619 552 476 452 475 501 504 497 493 487 474 468 481 504 513 503 485 463 425 369 331 350 418 492 537 561
2399 561 577 580 560 528 506 502 518 550 593 622 622 601 582 571 553 521 498 503 525 531 507 482 490 525 540 511 466 449 459 471 479 497 518 512 487 488 531 577 584 569
2394 569 572 588 586 558 530 516 510 507 515 526 524 512 515 543 587 630 649 626 566 514 510 532 527 489 470 498 527 501 442 416 448 492 506 505 518 537 523 476 445 460
2389 460 490 490 474 491 542 562 517 454 437 458 466 451 449 473 491 487 480 488 496 494 497 519 543 551 557 580 608 610 576 530 501 492 490 480 471 494 555 618 635 608 582 576 566
2384 566 533 503 499 501 485 468 481 509 508 480 479 525 572 568 525 497 506 519 511 504 524 556 555 506 457 462 509 538 523 497 502 525 524 491 457 446 444 435 433 455 495 527
2379 527 539 541 542 536 525 524 546 568 563 539 533 549 548 505 455 440 453 454 443 448 465 455 415 390 403 415 401 390 411 439 434 415 427 467 493 490 480 469 448 430
2374 430 446 487 499 467 435 450 489 502 475 435 409 408 447 525 606 636 600 537 495 484 474 453 447 483 541 571 550 513 497 501 507 518 544 571 584 592 604
2370 604 591 535 480 498 571 603 556 503 515 552 536 473 436 454 485 495 503 519 523 505 485 474 454 423 419 461 509 520 505 508 526 518 474 439 450 487 513
2365 513 522 526 522 495 457 447 477 510 508 485 482 505 505 450 378 349 375 408 413 409 429 465 484 475 463 465 467 452 428 416 414 405 387 383 407 445 468 463 444 432 435 442 439 426
2360 426 422 438 469 496 511 514 504 489 483 502 531 539 520 501 508 523 513 479 461 487 538 575 573 532 472 425 409 412 411 410 441 509 566 560 506 469 487 529 539 507
2355 507 474 480 513 529 497 436 389 378 392 415 447 498 557 594 592 566 541 531 529 521 501 482 479 501 536 561 561 538 510 491 486 486 493 518 564 608 613 575 528 503
2350 503 494 483 473 485 518 549 561 561 548 516 482 489 550 610 612 562 520 521 540 545 541 545 561 583 608 628 622 585 552 550 555 531 494 496 543 577 562 537 554 598 616
2345 616 599 584 589 588 569 557 564 566 543 526 545 577 579 558 562 603 635 620 586 574 580 572 547 535 539 526 484 452 474 532 575 580 561 539 530 554 614 665 646 563
2340 563 488 476 504 517 508 502 504 500 496 507 517 499 465 454 475 496 505 530 574 592 554 497 478 495 510 499 473 447 435 446 469 478 469 473 507 540 537 521 534 565
2335 565 558 504 461 468 496 499 479 466 471 478 478 480 498 542 603 652 656 613 562 538 546 568 584 584 568 552 555 574 576 543 489 446 425 418 424 444 474 504 529 546 546 529
2330 529 510 504 509 511 503 490 480 483 510 562 615 638 623 588 563 552 539 515 497 514 566 618 629 601 565 543 532 530 538 545 526 481 438 420 418 419 432 459 480 481
2325 481 483 501 512 483 440 437 482 524 521 491 468 460 459 464 473 477 466 447 429 409 392 399 441 498 544 581 621 654 659 629 584 544 516 508 525 556 576 576 563 544 514
2320 514 475 452 465 502 535 550 550 532 486 426 391 408 455 482 468 434 413 418 446 490 535 560 554 538 537 559 582 588 575 555 540 534 532 528 525 533 545 540 512 485
2315 485 481 496 510 523 548 575 580 564 557 558 531 465 405 403 447 486 506 536 591 633 631 596 561 543 536 537 543 546 538 526 521 518 497 452 413 414 456 496 497 472 471 516 569
2310 569 576 536 502 513 541 537 501 473 479 499 505 500 505 522 535 532 516 499 488 491 508 529 548 569 595 615 610 589 580 594 606 600 582 563 531 478 432 430 462 476 455
2305 455 440 469 522 543 515 472 456 473 506 533 544 539 529 523 528 541 555 560 552 544 566 618 652 615 527 466 478 527 549 533 514 517 530 539 540 533 511 488 490 513
2300 513 521 496 474 490 524 517 460 413 425 477 508 499 484 497 528 543 527 495 470 461 468 490 521 549 558 551 537 515 480 450 455 492 513 481 433 429 476 512 497
2295 497 452 415 383 338 297 299 349 406 435 442 453 472 486 490 494 508 532 551 548 524 490 459 430 410 408 414 408 383 374 410 475 522 533 530 537 550 554 543 527 519 525 535
2290 535 525 495 483 521 578 594 561 535 546 569 573 577 601 623 610 584 589 614 601 533 464 450 488 536 569 585 582 557 520 496 499 523 541 533 505 482 483 505
2286 505 534 563 589 608 626 657 691 689 632 558 518 511 500 475 469 496 530 548 556 562 550 513 485 508 568 619 639 634 616 587 559 550 556 549 517 490 502 546 577
2281 577 560 509 469 467 492 514 526 547 578 587 552 503 494 537 583 586 565 559 568 555 510 477 489 521 522 489 466 476 491 477 439 406 390 387 399 431 469 491 493
2276 493 490 493 495 488 472 452 444 471 526 565 549 499 476 498 525 521 497 480 467 452 453 483 524 545 548 554 567 567 546 515 486 460 443 444 463 491 523 552 559 539 512
2271 512 508 528 548 555 559 563 558 540 524 521 528 527 505 473 462 497 556 584 552 501 484 497 496 472 457 465 471 464 473 514 546 530 489 476 502 530 530 520 527 547 553 529 487
2266 487 462 471 507 544 569 570 534 470 422 429 469 485 467 469 512 547 528 488 483 513 536 535 519 483 432 414 466 541 548 483 426 424 437 430 435 481 526 523 496 495 512
2261 512 505 475 462 471 463 430 414 453 528 592 615 598 564 542 548 561 551 518 488 477 467 445 428 436 467 502 526 540 543 534 517 495 473 463 478 514 545 540 496
2256 496 445 420 431 460 484 498 506 508 501 493 501 528 549 537 496 450 420 406 410 434 473 512 537 547 543 537 544 569 593 597 588 592 603 580 506 423 385 394 414 420 424 439
2251 439 461 483 502 513 506 483 462 466 497 539 564 551 504 455 439 464 501 508 469 414 401 453 527 552 512 457 445 478 512 523 519 517 520 522 522 518 510 508 512 507 478
2246 478 446 444 473 490 469 438 443 486 529 547 557 578 594 575 527 502 540 618 666 646 584 537 528 546 572 591 578 522 453 419 434 467 495 527 568 591
2241 591 574 534 511 526 568 615 640 623 572 523 499 490 475 461 465 480 489 495 508 512 494 477 497 544 569 556 541 550 558 541 521 530 562 582 578 565 555 546 538 541 558
2236 558 575 575 549 500 454 437 453 481 506 535 569 588 576 552 547 562 568 553 532 519 507 487 471 476 501 523 519 493 468 465 484 506 523 536 545 539 523 526 562
2232 562 596 589 543 506 509 538 559 551 519 493 498 537 577 587 577 572 573 562 538 527 531 519 482 450 453 477 487 479 478 497 524 545 554 550 541 536 537 534 522 512 517 530 535 515
2226 515 471 419 390 411 463 502 508 511 539 570 566 530 506 516 547 575 585 575 560 560 578 585 560 524 508 508 508 517 554 588 573 522 508 549 578 542 484 473 510
2221 510 543 552 564 589 609 619 634 644 612 535 465 449 475 499 507 510 510 497 474 460 458 450 433 435 477 533 552 515 461 437 456 498 541 566 557 515 468 448 448
2217 448 446 448 474 512 515 474 442 465 525 572 597 612 607 564 506 479 485 491 488 502 532 536 500 471 489 526 528 501 500 541 581 583 559 550 569 594 601 580 535 481 436
2212 436 413 413 427 447 470 490 503 506 504 497 478 443 406 403 458 549 623 640 605 556 531 537 556 572 588 614 630 606 545 495 497 528 532 499 466 461 470 474 473 472 469 468
2207 468 481 503 518 524 533 541 532 519 534 569 567 505 440 437 484 529 561 604 654 671 644 607 586 571 552 530 509 483 463 473 509 539 547 551 576 617 653 671 668
2202 668 642 600 560 532 516 514 529 547 540 497 442 417 439 489 533 547 540 541 566 596 610 608 610 622 638 656 672 670 648 630 634 641 623 602 617 651 646 598 568 586
2197 586 598 563 518 511 525 520 517 559 618 625 565 500 477 486 499 504 493 467 454 483 528 536 506 491 504 499 456 433 482 567 621 631 629 617 570 504 468 471 474 456
2192 456 447 468 493 493 492 530 599 644 631 582 537 519 529 563 608 644 653 640 630 642 664 665 623 557 512 508 530 550 574 610 636 613 550 507 521 552 547 516
2187 516 510 533 531 486 449 467 513 529 515 512 534 548 535 518 521 540 559 577 596 594 549 483 444 459 504 538 557 584 628 662 665 650 639 625 585 531 500 503
2183 503 511 508 514 536 534 483 430 446 531 607 615 571 529 512 513 516 513 507 516 550 587 589 556 535 555 589 588 544 496 478 492 511 517 511 506 508 509 504 504 522 544 542 520 506 506
2177 506 500 481 475 493 501 467 412 390 417 458 480 493 523 573 620 646 657 666 667 642 588 530 497 491 498 503 495 465 427 419 456 501 511 500 508 533 539 528 542 580 579
2172 579 513 449 454 499 510 478 456 468 488 495 507 539 569 563 519 474 472 520 563 542 466 411 433 498 549 583 625 665 669 636 600 574 553 543 556 571 554
2168 554 525 526 558 581 576 568 562 537 501 496 522 532 502 479 503 551 579 580 567 537 503 504 555 605 608 590 604 646 651 588 500 447 450 488 530 562 590 621 636 609
2163 609 553 520 536 572 597 614 630 621 578 539 543 564 553 513 488 496 516 541 579 613 611 576 542 526 523 541 585 619 598 544 529 571 610 604 590 609 635 628
2158 628 603 596 597 578 546 529 523 506 498 535 603 649 645 617 590 562 536 531 553 574 572 561 552 537 514 505 523 537 514 471 457 484 517 529 533 553 577 573 540 511
2153 511 521 568 618 638 617 578 553 563 593 611 607 608 645 710 756 743 685 627 612 644 698 737 737 695 640 598 569 541 518 517 540 569 590 606 610 585 541
2149 541 524 556 594 585 547 540 577 606 603 607 642 661 621 561 544 560 549 516 527 599 661 655 620 620 648 655 624 584 558 541 527 521 522 528 548 584 611 608 591 596 617
2144 617 617 584 553 555 575 580 565 550 555 570 571 550 529 540 580 606 594 569 564 566 537 475 425 422 454 489 517 539 550 544 532 530 550 584 610 608 578 549 548 570 586
2139 586 582 573 584 620 670 711 721 695 651 615 597 590 593 607 622 623 608 584 548 502 462 450 471 514 566 620 661 684 698 703 677 617 563 553 562 547 526 553
2134 553 625 664 625 547 494 482 495 525 560 573 556 530 511 490 469 478 521 556 549 525 524 543 561 581 606 616 599 582 594 614 611 589 564 528 478 456 492
2130 492 549 571 564 575 603 614 613 635 657 624 549 516 560 616 615 574 543 534 534 547 572 584 570 557 574 607 618 600 572 545 525 520 522 512 496 504 542 569 557
2125 557 539 555 585 583 546 513 499 485 467 462 472 477 476 497 555 622 662 666 651 632 611 590 577 578 594 611 614 600 580 568 567 569 567 558 551 555 570 581 583 592 617 639
2120 639 638 632 650 677 666 619 597 633 684 694 671 660 662 644 601 572 583 620 648 648 629 616 634 680 715 701 641 573 526 515 542 587 619 620 606 603 610 606 587
2115 587 564 548 539 537 541 542 548 575 613 622 585 540 526 534 531 527 540 545 502 436 417 457 499 517 548 614 658 621 531 468 467 505 551 592 615 618 611 606 594 568 549 561
2110 561 581 566 514 476 487 528 552 546 531 529 538 548 555 561 561 552 539 531 535 545 545 523 477 432 425 469 516 507 447 409 444 514 557 570 586 597 569 512 484 508 539
2105 539 542 532 528 519 497 489 504 512 495 495 554 641 690 679 642 607 585 584 605 626 627 623 639 661 657 629 608 608 619 631 631 603 548 512 526 553 533 481 465 503 538
2100 538 534 523 547 587 603 596 586 583 587 612 662 710 732 731 725 710 677 641 621 609 589 564 547 544 553 577 605 608 577 541 528 533 532 529 541 563 574 571 566 562 554 546 542 526
2094 526 486 450 461 519 571 577 544 505 487 500 543 594 616 602 577 565 564 557 542 533 536 550 558 544 506 476 494 558 623 642 618 586 572 574 582 586 579 566 556 556
2089 556 556 547 528 508 500 511 537 570 594 600 585 560 543 556 601 641 637 590 543 531 547 569 594 633 672 682 662 646 656 671 661 632 618 634 657 660 644 623
2085 623 605 590 589 606 628 634 640 669 708 708 645 565 528 550 606 670 731 771 775 753 728 708 683 664 665 683 695 701 717 732 715 665 622 613 614 603 591 595 603 603 605
2080 605 614 611 583 558 558 563 548 544 593 667 698 676 660 677 680 628 554 514 513 520 520 517 508 487 472 487 518 534 533 543 581 626 644 625 589 564 564 577 573 539 501 497
2075 497 538 599 648 669 672 667 657 637 609 580 561 557 569 596 629 651 653 656 681 714 715 680 650 658 679 664 606 537 483 456 461 495 536 556 553 545 539 532 531 552 591
2070 591 621 625 620 631 656 669 652 608 560 534 540 566 601 641 685 723 739 728 690 639 594 579 597 619 627 629 641 654 655 654 662 656 622 595 621 674 690 660 648
2065 648 681 704 678 643 651 676 661 612 588 604 635 672 727 777 771 704 634 603 597 592 603 646 701 729 718 687 660 660 693 734 743 717 692 681 654 592 537 547
2060 547 614 678 708 730 762 779 754 707 680 683 688 676 660 655 646 616 581 578 609 638 635 624 637 663 663 636 627 654 681 671 641 636 668 715 756 781 773 723 657 614
2055 614 602 601 604 622 660 698 729 752 755 721 670 656 692 726 713 680 685 734 783 806 809 796 757 708 685 701 723 725 717 720 730 733 743 779 833 870 871 850 830 827
2050 827 844 871 891 900 915 949 981 980 940 898 888 925 997 1079 1141 1170 1182 1207 1246 1277 1294 1322 1381 1467 1564 1672 1798 1937 2090 2277 2504 2741
2046 2741 2958 3177 3458 3816 4197 4536 4824 5082 5302 5438 5462 5393 5272 5101 4852 4512 4123 3748 3417 3111 2820 2562 2355 2179
2044 2179 2006 1854 1762 1730 1698 1619 1513 1439 1416 1410 1373 1295 1211 1169 1181 1212 1212 1184 1176 1222 1295 1350 1380 1406 1435 1448 1433 1403 1377 1366 1388 1447 1514 1547
2039 1547 1542 1540 1573 1616 1626 1601 1565 1526 1472 1403 1343 1301 1272 1249 1234 1215 1173 1117 1081 1078 1074 1041 993 958 926 872 814 802 851 912 926 890 843 825 837 864
2035 864 888 905 918 920 891 828 769 755 785 811 801 778 782 812 831 817 785 761 763 791 825 835 808 775 771 793 799 775 756 787 850 876 821 718 651 665 732
2030 732 792 819 828 832 820 787 754 740 737 728 720 728 749 770 785 797 795 771 742 736 747 748 738 736 746 742 720 705 717 743 763 774 785 799 816 836 838 805 755 731 743
2025 743 758 756 764 801 835 823 765 695 639 610 627 688 757 794 800 800 797 779 755 752 770 786 783 768 751 739 740 751 754 739 730 750 779 781 767 771 794 798 775 763 781
2020 781 788 749 698 690 728 770 793 812 840 865 869 854 830 808 797 808 834 851 840 815 809 832 863 878 886 905 923 917 892 881 890 888 862 842 843 836 816 827 891 944
2016 944 912 830 790 803 796 748 736 795 852 839 797 799 834 842 828 846 889 894 846 805 812 840 851 846 837 816 784 776 806 837 832 819 849 914 948 910 829 752 690
2011 690 642 635 692 779 836 852 871 913 933 899 853 847 867 869 859 875 899 872 801 768 802 834 803 749 741 768 776 774 807 868 897 883 875 907 939 925 873 832
2006 832 833 867 904 928 950 990 1030 1018 941 863 850 887 910 901 902 929 953 951 939 932 929 929 942 949 928 899 916 984 1039 1040 1007 968 912 849 833 898 989 1026 1002
2001 1002 965 933 890 851 854 901 938 926 885 861 871 906 958 1015 1062 1092 1109 1121 1128 1124 1107 1079 1052 1046 1076 1129 1180 1210 1218 1212 1206 1213 1234 1256 1263 1254 1231 1205 1190
1997 1190 1202 1234 1258 1250 1223 1208 1227 1281 1349 1391 1366 1281 1199 1166 1166 1157 1143 1163 1222 1281 1318 1353 1403 1441 1434 1395 1367 1366 1366 1342 1304 1289 1314 1359 1387 1385 1373 1373
1992 1373 1382 1384 1374 1373 1397 1448 1506 1552 1573 1570 1554 1547 1566 1618 1680 1709 1683 1627 1594 1607 1638 1653 1651 1649 1657 1681 1726 1767 1760 1688 1604 1576 1615 1683 1755 1833 1900 1924 1907
1987 1907 1896 1913 1934 1932 1925 1936 1952 1949 1944 1974 2050 2144 2224 2274 2288 2280 2286 2325 2369 2379 2370 2395 2464 2521 2521 2502 2531 2601 2648 2644 2645 2709 2810 2879 2892 2889 2911 2954 2998
1982 2998 3040 3089 3147 3208 3271 3335 3395 3450 3504 3548 3573 3598 3658 3753 3842 3892 3925 3975 4039 4095 4155 4244 4349 4436 4508 4609 4750 4882 4969 5051 5181 5350
1979 5350 5501 5611 5721 5877 6068 6244 6379 6502 6660 6860 7064 7246 7431 7656 7914 8158 8370 8595 8884 9227 9564 9861 10141
1976 10141 10451 10806 11189 11585 12004 12467 12978 13531 14134 14815 15592 16467 17433 18489 19636 20876 22235 23748 25425 27239
1973 27239 29189 31340 33757 36442 39371 42584 46176 50226 54788 59962 65907 72756 80573 89407 99329 110372 122453
1971 122453 135368 148818 162363 175414 187304 197385 205051 209759 211141 209105 203824 195652 185085 172766 159401
1969 159401 145642 132023 118975 106823 95751 85819 77022 69320 62609 56744 51598 47090 43134 39619 36463 33634
1967 33634 31111 28847 26796 24947 23291 21786 20388 19103 17961 16957 16042 15178 14361 13593 12860 12153 11492 10904 10385
1965 10385 9892 9393 8890 8417 7994 7622 7292 7002 6744 6504 6281 6089 5930 5780 5608 5420 5243 5094 4971 4866 4771 4668 4550
1962 4550 4430 4321 4214 4100 4004 3957 3936 3878 3764 3639 3542 3460 3369 3286 3233 3191 3123 3027 2934 2860 2803 2766 2748 2724 2670 2607 2588 2616 2633 2598 2538
1958 2538 2503 2489 2455 2386 2313 2256 2202 2145 2105 2096 2095 2082 2077 2111 2159 2159 2092 2009 1962 1945 1934 1930 1943 1945 1900 1820 1760 1744 1748 1748 1747 1747 1731 1689 1642 1610 1583 1549 1521
1954 1521 1517 1531 1544 1550 1553 1554 1548 1544 1547 1542 1512 1468 1433 1409 1382 1353 1350 1382 1422 1430 1405 1383 1390 1410 1407 1374 1338 1326 1330 1320 1288 1244 1197 1145 1104 1104 1147 1191 1195 1163 1133 1134
1949 1134 1167 1208 1232 1222 1194 1188 1219 1253 1239 1173 1103 1077 1098 1126 1128 1106 1095 1118 1152 1153 1112 1075 1080 1115 1136 1128 1111 1104 1107 1117 1140 1172 1193 1185 1151 1107 1073 1063
1944 1063 1074 1093 1114 1133 1142 1124 1086 1067 1090 1131 1147 1135 1123 1118 1104 1075 1054 1053 1062 1073 1095 1137 1179 1196 1178 1129 1064 1003 967 961 976 1003 1040 1075 1095 1104 1113 1113
1939 1113 1091 1064 1067 1098 1107 1076 1045 1056 1092 1111 1108 1105 1096 1059 1002 961 947 936 912 895 897 908 921 949 997 1036 1045 1040 1043 1040 1005 954 936 969 1013 1017 976 923 885 862
1934 862 849 844 850 872 906 937 944 919 888 887 919 951 949 914 876 870 899 930 924 886 875 930 1007 1024 972 918 913 925 911 898 933 997 1023 998 972 975 977 956 940 959
1929 959 988 985 953 930 932 938 935 929 931 942 960 978 973 935 893 894 947 1003 1012 981 959 979 1022 1051 1059 1067 1082 1079 1048 1015 1005 1000 967 913 883 893 913 911 892 868 835 800
1924 800 789 819 865 890 883 862 848 853 874 889 874 839 825 847 880 903 925 945 925 846 759 734 773 821 845 849 841 820 806 824 866 903 927 946 957 942 907
1920 907 877 860 846 841 857 872 854 813 792 799 806 813 851 918 963 961 941 931 919 901 903 929 935 893 842 834 859 877 878 876 861 828 797 787 772 731 698 714 764 796
1915 796 807 833 872 883 848 809 798 813 834 858 876 871 844 812 777 726 676 672 723 784 801 777 751 752 777 807 819 808 798 812 844 860 847 827 816 807 790
1910 790 779 789 811 827 825 798 750 709 710 743 758 732 701 694 684 647 619 652 735 797 801 774 755 750 756 781 814 826 806 787 805 848 871 862 849 859 879 875 843
1906 843 809 799 807 813 807 802 809 823 838 862 899 935 948 930 892 851 830 844 888 925 934 928 943 987 1036 1069 1081 1071 1043 1018 1028 1070 1109 1121 1137 1195 1285 1360
1901 1360 1397 1411 1424 1437 1464 1526 1614 1668 1641 1566 1526 1552 1583 1556 1479 1404 1353 1294 1214 1151 1141 1172 1197 1190 1159 1118 1071 1020 976 945 922 897 876 876 907
1897 907 951 974 959 930 915 913 899 870 850 851 859 851 830 806 778 750 751 797 856 876 846 806 793 807 826 844 857 859 843 821 809 814 830 835 810 763 732 748 792
1892 792 820 813 795 786 787 794 804 807 789 776 811 886 926 880 791 738 736 743 743 759 789 800 780 766 790 829 849 850 849 838 797 734 684 674 700 742 789 836 873 886
1887 886 868 835 822 841 864 859 837 828 831 810 760 726 740 767 763 738 739 765 774 750 735 758 791 791 758 731 738 770 799 810 800 779 761 751 748 747 749 753 760 771 785
1882 785 788 767 733 725 760 811 832 809 770 742 730 730 742 767 796 818 828 824 806 773 733 707 713 747 788 813 810 781 737 701 700 738 783 794 765 726 703 704 724
1877 724 756 776 752 694 657 675 716 730 716 703 691 652 599 582 612 639 626 608 626 661 665 642 635 648 639 595 568 605 681 731 724 687 671 697 743 772 776
1873 776 782 817 861 862 811 756 742 759 766 750 733 733 739 732 708 684 685 713 743 748 735 738 762 776 756 732 736 744 710 645 613 633 650 614 556 545 596 663 707 726
1868 726 731 720 700 688 689 680 649 617 612 637 666 678 678 680 700 736 767 758 702 629 588 592 622 666 733 813 852 805 703 637 660 735 795 819 832 840 819 763 707
1863 707 679 657 611 554 537 573 624 653 662 672 679 663 626 605 620 653 669 662 655 663 666 640 592 559 564 595 622 634 647 674 707 723 712 688 673 683 710 730
1858 730 720 688 664 674 710 737 725 680 634 613 611 613 615 629 661 697 720 724 719 715 707 683 648 620 617 636 664 694 731 771 792 774 728 690 683 694 697 689 688 701 710
1853 710 696 663 636 632 640 637 617 599 604 621 625 615 628 692 786 852 856 806 736 675 640 638 662 691 710 714 701 670 628 593 573 570 590 649 733 797 796 740 679 653
1849 653 663 677 661 609 558 562 628 703 731 722 721 738 740 716 690 680 670 648 635 642 653 657 680 739 797 809 783 766 765 750 712 679 667 657 634 615 614 621 631
1844 631 649 669 666 635 608 607 607 590 585 628 690 705 659 609 604 635 665 679 680 673 662 668 702 733 720 663 614 615 652 676 669 657 668 687 683 659 640 635 627 611 606 621
1839 621 639 654 673 686 671 639 639 689 729 709 659 635 628 604 587 636 729 772 731 671 644 625 589 570 597 624 599 549 528 540 552 570 613 658 666 650
1834 650 642 632 593 555 569 616 626 586 558 570 577 546 520 534 559 553 529 523 533 543 561 599 634 646 652 680 711 702 649 586 542 529 560 635 710 731 687 624
1830 624 582 568 565 556 531 496 481 514 578 624 630 625 643 675 686 669 658 676 701 699 674 663 683 705 711 721 748 754 699 612 565 573 583 564 551 572 590 568 541
1825 541 569 647 711 719 685 645 624 627 638 626 587 555 551 548 517 487 505 565 614 631 636 636 621 598 589 594 595 599 620 644 647 651 683 701 638 516 448 487 553 557 522
1820 522 525 574 607 605 607 641 681 689 658 613 586 595 623 638 638 649 678 691 671 653 665 675 636 568 532 549 585 619 659 697 707 694 688 695 677 627 598 631 692
1815 692 707 656 593 569 576 577 557 534 525 525 525 531 555 584 595 581 562 553 554 570 608 655 682 676 651 621 585 555 567 624 674 669 632 615 628 637 627 617 608 578 532
1810 532 504 511 526 527 528 555 598 629 635 627 619 617 619 618 618 627 635 614 550 474 429 425 444 485 557 638 684 685 674 671 660 636 625 641 649 611 546 512 540 604 651 646 597
1805 597 551 548 576 593 583 577 599 624 620 594 583 600 626 642 639 619 595 587 602 625 648 679 717 728 694 642 615 612 611 609 631 675 710 723 731 746 753 733 692 649
1800 649 613 586 564 541 513 495 515 576 646 686 690 680 675 672 663 653 658 674 681 668 653 661 682 682 651 616 605 609 615 622 634 636 621 607 613 626 621 611 627 668 693 681
1795 681 653 637 628 614 607 618 628 611 571 549 569 608 619 584 535 523 559 611 640 642 636 635 634 632 628 619 601 582 575 578 577 574 582 604 618 609 595 598 614 619 607 593 586 576
1789 576 555 543 565 615 654 655 634 624 627 617 584 549 537 542 552 562 577 589 580 551 519 509 525 555 579 586 586 594 607 605 577 546 537 552 578 605 627 626 598 569
1784 569 575 618 662 673 653 628 622 641 669 685 684 675 669 662 655 652 651 635 605 585 584 587 579 577 597 609 583 536 514 527 552 581 630 684 698 661 624 628 645 624 564 513
1779 513 513 551 586 585 553 523 525 558 598 620 612 577 539 540 588 635 637 617 623 650 655 636 633 646 631 594 603 673 716 663 572 542 571 584 566 576 630 665 639 589
1774 589 565 563 553 546 572 634 692 703 656 571 493 459 477 523 567 593 604 617 638 641 595 519 474 498 556 590 595 602 620 629 631 644 650 605 521 467 486 535 551
1770 551 530 513 521 548 588 640 681 678 627 564 525 519 539 581 639 698 723 681 583 487 453 475 501 495 482 499 541 570 569 548 524 516 541 603 664 670 617 562
1765 562 553 578 590 581 579 596 609 604 598 612 628 622 605 610 641 657 633 598 592 607 601 556 502 479 491 513 523 524 526 529 524 519 528 549 553 530 517 545 587 589 551 530 555
1760 555 591 597 583 577 581 587 610 658 706 720 716 736 776 789 741 654 574 527 511 503 481 451 444 469 492 496 508 556 612 630 607 576 541 494 463 477 513 519 500
1755 500 509 555 590 598 613 645 653 627 616 649 683 682 672 687 701 675 620 576 551 544 566 605 602 529 446 430 479 537 573 585 565 520 505 558 627 635 587 555
1750 555 558 559 548 551 566 558 538 552 591 588 533 506 548 604 615 610 640 672 642 557 489 472 481 489 499 515 536 565 602 631 642 662 716 779 812 826 871 952 1016
1746 1016 1045 1098 1231 1396 1493 1486 1433 1391 1347 1268 1165 1078 1011 928 826 754 749 780 785 743 692 670 677 695 712 730 749 762 763 761 785 847 913 922 856 768
1741 768 718 710 718 748 815 883 892 848 818 833 860 872 901 971 1044 1082 1116 1203 1338 1471 1600 1767 1981 2200 2392 2576 2756 2887 2917 2848 2711
1737 2711 2518 2274 2013 1786 1606 1441 1280 1156 1095 1071 1034 986 965 971 955 899 857 876 921 925 893 889 922 927 869 802 786 809 818 803 796 803 808 811 832
1733 832 862 875 873 897 965 1045 1099 1134 1189 1288 1420 1565 1710 1858 2022 2206 2403 2599 2777 2906 2938 2844 2649 2416 2189 1976 1778 1617
1730 1617 1508 1433 1359 1276 1210 1180 1164 1117 1024 926 879 896 934 950 941 928 917 907 912 938 955 919 834 759 740 756 757 734 717 726 737 732 724 732 745 744 742 768
1725 768 826 878 904 924 970 1036 1094 1145 1220 1325 1424 1471 1461 1411 1340 1258 1176 1106 1054 1019 991 958 925 906 905 888 821 723 654 640 645 632 603 575 550
1721 550 535 558 622 672 665 630 622 641 640 604 562 536 519 518 550 601 630 629 632 651 652 620 590 589 591 566 531 527 557 592 617 627 617 596 596 628 651 618 547 500
1716 500 502 527 552 578 604 618 625 639 646 615 549 499 495 515 529 543 574 610 625 615 595 571 542 525 539 577 606 613 605 589 572 570 596 630 636 613 601 627 666
1711 666 683 672 646 606 549 509 526 588 630 609 551 513 512 515 497 470 458 468 489 516 555 604 649 668 656 623 586 566 575 606 625 606 566 550 571 591
1707 591 574 539 530 555 582 587 582 585 599 621 644 657 641 604 575 571 584 603 625 636 618 588 585 610 616 590 583 630 680 665 604 573 587 590 565 562 605 629 575 483
1702 483 445 485 545 579 593 612 627 623 608 605 617 633 646 663 682 693 689 682 683 679 654 627 632 666 679 644 598 591 630 675 699 700 677 635 604 617 663 693 674
1697 674 614 546 499 496 536 571 558 515 507 558 626 661 658 645 637 636 643 646 631 616 632 676 701 686 667 683 718 730 715 691 662 621 586 581 593 583 545 513 523
1692 523 570 620 640 621 587 573 586 593 565 507 457 454 506 581 629 623 591 573 562 529 486 477 504 518 505 519 590 670 704 705 709 707 681 650 639 623 576 537
1688 537 551 585 576 539 541 584 607 596 610 666 706 693 666 665 671 651 612 575 545 530 550 597 629 625 612 606 585 546 529 550 572 572 576 602 608 563 510 503 520 504
1683 504 461 446 477 516 535 546 562 580 593 595 567 508 459 474 547 622 664 680 674 636 582 553 566 594 609 605 584 542 498 492 536 588 601 588 587 601 597 570
1678 570 558 579 593 560 505 492 535 578 579 552 533 524 523 549 609 650 618 538 498 526 569 579 573 576 572 540 504 503 544 601 646 652 610 552 535 568 595 578 549
1673 549 553 580 594 593 596 605 616 646 696 717 681 634 637 672 671 633 620 660 709 728 732 742 752 755 766 797 829 841 827 778 698 629 622 669 710 709 696 701 711 708 707
1668 707 727 754 753 711 642 569 528 542 586 611 602 594 606 612 588 551 522 495 470 472 503 514 472 427 448 526 586 588 563 552 565 590 627 674 719 752 769 769
1664 769 761 765 791 826 843 844 854 883 909 892 814 697 592 546 557 581 587 586 600 626 637 629 618 606 584 557 550 577 618 641 636 610 577 543 520 524 564 626
1659 626 665 653 610 590 619 664 684 669 635 604 593 611 638 641 620 617 662 726 763 768 776 806 857 924 991 1025 1006 963 942 937 906 832 748 685 645 630 649
1655 649 690 706 670 618 603 639 694 730 729 689 627 578 569 593 621 634 634 629 617 588 544 508 513 565 624 649 646 651 667 654 599 551 563 618 651 636 610 608 617
1650 617 605 571 545 542 545 538 535 560 609 645 643 631 651 699 722 691 646 647 693 721 691 632 597 598 608 599 572 544 533 550 591 628 628 587 530 491 484 504 537 563
1645 563 565 551 546 560 580 602 635 677 695 669 626 599 586 567 552 565 596 608 598 598 617 628 621 626 654 670 643 599 586 607 643 684 719 713 643 557 525 558
1640 558 602 611 601 604 628 659 677 662 611 556 545 589 650 688 696 696 704 714 711 690 660 635 615 588 561 554 569 577 566 565 593 616 589 540 533 581 634 650 636 603
1635 603 560 533 558 619 654 635 600 595 604 595 568 544 527 510 496 481 452 412 397 420 453 468 479 507 537 544 544 567 609 635 625 598 576 569 573 577 570 559 573
1631 573 617 655 651 623 610 619 624 614 603 596 581 559 546 549 556 554 550 553 561 568 565 553 543 552 574 581 557 520 499 501 516 547 595 640 656 639 602 554 508 483 491 516 551
1625 551 605 668 696 663 610 595 617 631 631 649 689 706 678 629 589 558 530 522 539 550 529 485 455 462 500 549 582 587 576 566 554 531 505 494 496 496 497 516
1621 516 545 557 547 529 506 478 471 514 587 632 624 586 535 477 447 487 574 627 614 598 632 679 685 665 671 699 704 663 597 538 520 564 641 676 639 595 615
1616 615 676 697 662 625 616 607 577 543 522 517 532 569 600 596 569 557 559 546 519 511 521 519 513 538 587 594 535 469 456 481 499 503 508 515 523 550 596 619 590 549 561
1611 561 620 668 673 651 624 588 552 542 567 594 593 571 560 576 610 637 644 638 641 659 666 637 584 548 551 573 582 571 556 553 564 580 595 616 644 667 668 645 617 613
1606 613 644 690 716 697 649 614 609 607 575 532 523 553 576 562 532 525 544 578 623 665 669 621 559 537 555 574 578 589 621 658 684 701 711 705 685 666 653 638
1602 638 622 619 638 657 658 643 634 646 672 694 690 658 618 585 560 540 538 560 584 589 593 622 650 626 556 516 552 616 637 612 592 594 590 572 567 591 622 633 623 607
1597 607 595 588 584 573 539 493 471 503 570 623 633 619 620 643 650 611 549 515 520 522 496 478 510 574 607 592 574 586 611 620 625 647 673 670 641 623 634 654 656 641
1592 641 626 619 623 640 667 684 673 643 614 599 590 577 560 542 522 503 492 491 489 474 461 470 503 534 538 525 528 559 595 601 572 540 533 547 554 549 552 577 599 594 580 589
1587 589 599 552 451 381 412 498 539 510 482 513 575 614 617 605 581 550 538 567 614 634 618 594 580 568 559 572 607 627 607 568 549 557 573 584 596 606
1582 606 600 576 550 541 546 554 561 572 590 613 630 627 599 558 528 517 514 503 488 484 497 524 562 603 624 603 553 525 551 599 617 594 559 537 522 515 529 555 558 524
1577 524 485 484 516 544 553 564 594 634 659 661 650 644 653 671 675 650 606 565 540 532 541 560 571 566 555 551 545 528 521 545 579 575 526 490 511 567 606 616 621 629 619 587
1572 587 558 549 552 551 550 557 566 561 550 559 598 640 655 648 647 668 685 671 635 616 627 635 603 544 508 521 565 598 597 569 533 510 511 536 570 584 568 545 547 570 577 545
1567 545 505 500 533 571 604 647 698 727 717 684 648 607 562 539 551 567 550 505 466 448 445 467 521 575 585 555 541 570 607 615 615 646 695 717 699 678 677
1563 677 676 654 624 612 614 605 578 558 565 579 567 529 503 518 570 625 660 668 648 611 576 565 572 574 568 581 633 698 725 698 656 645 667 679 649 592 552 551 573
1558 573 594 607 622 638 646 653 688 754 806 792 726 683 719 799 842 822 796 834 939 1056 1147 1220 1305 1428 1616 1891 2255 2674 3095 3466 3738
1554 3738 3853 3768 3498 3110 2690 2295 1951 1661 1423 1235 1093 996 933 884 832 772 723 712 741 781 797 788 780 783 780 756 728 723 743 757 744 725
1550 725 735 783 831 829 769 709 709 769 836 866 865 857 850 840 827 817 803 782 766 759 750 724 691 662 636 612 603 609 603 571 539 541 572 603 626 648 670 687 708 732
1545 732 730 680 619 601 624 646 659 690 735 756 751 754 770 771 766 802 874 911 885 864 905 963 980 982 1025 1083 1100 1089 1113 1168 1188 1154 1118 1105 1080 1022 961 926
1541 926 903 884 887 909 907 864 829 847 885 878 821 775 783 828 864 864 828 782 752 747 750 741 726 728 760 812 859 879 871 855 859 888 922 935 920 901 905 938 978 998 1003
1536 1003 1022 1073 1137 1188 1232 1288 1345 1366 1333 1272 1219 1183 1148 1105 1059 1023 999 974 938 907 915 975 1046 1079 1062 1017 967 923 901 905 916 912 907 923 947 944 919
1531 919 916 950 987 989 957 912 865 829 826 843 841 805 785 830 913 968 977 980 1003 1020 998 956 948 998 1074 1121 1121 1112 1131 1181 1230 1272 1333 1426 1521 1574 1566 1519 1466 1441
1526 1441 1455 1498 1547 1598 1655 1713 1757 1801 1889 2036 2209 2368 2522 2713 2965 3292 3725 4310 5062 5957 6957 8009 9021 9850 10361
1523 10361 10481 10219 9633 8800 7811 6780 5826 5018 4354 3799 3334 2958 2652 2394 2187 2047 1953 1852 1735 1649 1617 1590 1517 1421
1520 1421 1361 1348 1347 1338 1331 1328 1315 1293 1278 1273 1262 1241 1225 1220 1222 1230 1241 1242 1226 1209 1205 1196 1161 1112 1085 1086 1086 1072 1057 1048 1031 1010 1013 1049 1085 1088 1073 1076 1097 1094 1042 975 951
1515 951 985 1040 1075 1097 1128 1151 1125 1068 1049 1095 1137 1105 1027 994 1027 1069 1078 1084 1120 1168 1183 1164 1149 1170 1225 1276 1281 1238 1191 1178 1184 1163 1111 1080 1104 1161 1211
1510 1211 1242 1263 1279 1284 1278 1261 1248 1259 1294 1318 1298 1258 1244 1265 1280 1279 1296 1341 1365 1334 1294 1308 1356 1365 1316 1273 1286 1329 1349 1340 1339 1361 1377 1372 1370 1400 1438 1443 1427
1506 1427 1449 1537 1641 1693 1685 1649 1601 1550 1523 1548 1596 1611 1585 1560 1562 1572 1584 1628 1705 1768 1775 1741 1702 1664 1625 1599 1604 1626 1652 1688 1739 1778 1774 1739 1710 1705 1717
1501 1717 1738 1766 1798 1833 1876 1920 1951 1960 1969 1998 2041 2073 2082 2067 2035 2009 2017 2067 2131 2173 2190 2198 2209 2219 2229 2242 2262 2287 2305 2313 2322 2350 2394 2422 2416 2405 2428 2487
1496 2487 2559 2637 2722 2778 2777 2756 2791 2895 3008 3084 3133 3169 3184 3187 3215 3269 3303 3305 3327 3406 3506 3571 3594 3605 3633 3703 3821 3944 4007 4010 4016 4052 4074 4066 4090
1492 4090 4184 4295 4372 4444 4552 4681 4800 4931 5085 5219 5318 5448 5654 5871 6022 6145 6324 6543 6738 6916 7139 7410 7684 7974
1489 7974 8322 8695 9017 9288 9566 9844 10036 10103 10094 10062 10030 10034 10119 10299 10583 11014 11629 12399 13284 14300 15458 16688 17915 19163
1486 19163 20506 21974 23597 25471 27663 30145 32903 36027 39563 43410 47553 52285 58011 65023 73708 84860 99585
1484 99585 119186 145601 181777 230966 295275 374380 464060 554059 627699 666785 660637 612157 535407 447382
1482 447382 361353 285320 223129 175338 139947 113929 94712 80474 69757 61416 54798 49514 45111 41170 37565
1481 37565 34360 31530 28994 26781 24946 23406 22039 20875 20004 19392 18945 18662 18573 18596 18607 18593 18590 18531 18308 17924 17456 16925
1478 16925 16335 15788 15426 15297 15376 15672 16203 16922 17787 18864 20242 21903 23777 25872 28196 30600 32839 34753 36247 37152
1476 37152 37262 36539 35150 33293 31113 28791 26544 24498 22652 20994 19552 18324 17255 16322 15553 14933 14382 13864 13433
1473 13433 13127 12902 12704 12545 12458 12448 12507 12632 12808 13012 13271 13637 14107 14615 15132 15709 16396 17193 18098 19144 20347 21693 23212
1470 23212 25000 27130 29610 32458 35782 39726 44378 49785 56007 63081 70920 79240 87527 95051 100963 104506 105213
1468 105213 103004 98194 91442 83585 75408 67489 60201 53764 48246 43569 39593 36208 33336 30892 28794 26986 25426
1466 25426 24060 22851 21808 20948 20241 19631 19104 18689 18403 18219 18100 18040 18056 18163 18356 18618 18940 19335 19834 20459 21233 22186
1464 22186 23340 24687 26228 28023 30175 32764 35835 39443 43693 48694 54527 61226 68737 76821 85004 92626 98922
1461 98922 103108 104540 102943 98551 92007 84121 75678 67328 59533 52543 46448 41239 36839 33130 29996 27352 25117
1459 25117 23184 21463 19928 18578 17396 16348 15432 14661 14021 13479 13017 12628 12288 11973 11704 11514 11398 11319 11262 11237 11244 11279 11366
1457 11366 11544 11813 12139 12522 13011 13635 14379 15241 16265 17503 18969 20649 22543 24645 26900 29189 31336 33129 34357
1454 34357 34862 34574 33511 31779 29575 27134 24658 22269 20030 17979 16146 14546 13179 12022 11025 10140 9354 8675 8091
1452 8091 7570 7104 6714 6395 6104 5809 5534 5306 5106 4900 4697 4533 4416 4307 4179 4045 3930 3843 3772 3698 3605 3502 3421 3381 3360
1449 3360 3312 3231 3149 3094 3056 3022 2996 2985 2970 2924 2848 2781 2758 2770 2765 2698 2582 2480 2442 2453 2461 2447 2437 2451 2469 2465 2446 2434 2424 2399 2367 2355 2362 2361 2336 2298
1444 2298 2248 2179 2105 2065 2064 2053 2000 1954 1984 2067 2108 2053 1959 1906 1909 1925 1922 1892 1842 1793 1778 1806 1834 1819 1776 1753 1757 1755 1736 1737 1777 1829 1852 1844 1826 1807 1786 1769
1440 1769 1765 1767 1770 1779 1806 1838 1859 1864 1861 1849 1821 1788 1765 1748 1725 1697 1686 1694 1690 1655 1607 1581 1586 1595 1591 1585 1590 1595 1581 1548 1520 1515 1530 1546 1545 1526 1503 1504 1534 1559 1541 1490 1461
1435 1461 1482 1525 1553 1571 1606 1647 1648 1597 1539 1512 1504 1489 1469 1468 1488 1506 1515 1526 1549 1576 1590 1586 1564 1529 1489 1445 1401 1364 1349 1362 1389 1395 1358 1290 1243 1267 1362
1430 1362 1464 1508 1488 1455 1454 1474 1480 1466 1448 1436 1428 1425 1431 1433 1416 1385 1359 1343 1326 1312 1319 1342 1345 1309 1259 1228 1216 1211 1216 1237 1254 1243 1214 1202 1218 1240 1258 1280 1293
1425 1293 1263 1188 1132 1148 1205 1231 1211 1195 1212 1230 1209 1168 1156 1190 1239 1272 1277 1262 1240 1231 1241 1260 1269 1263 1251 1239 1234 1244 1257 1247 1201 1144 1116 1126 1152 1173 1177
1421 1177 1159 1126 1105 1122 1165 1190 1176 1150 1140 1141 1122 1074 1028 1026 1077 1142 1166 1138 1102 1100 1119 1117 1087 1062 1060 1064 1066 1076 1097 1113 1121 1143 1186 1220 1223 1215 1217 1207 1161 1106
1416 1106 1088 1104 1107 1080 1061 1081 1119 1129 1099 1064 1063 1101 1145 1163 1159 1164 1191 1213 1206 1188 1184 1200 1223 1249 1267 1248 1194 1160 1202 1296 1370 1399 1426 1491 1573 1632 1666
1411 1666 1708 1802 1991 2288 2666 3076 3489 3883 4186 4301 4202 3955 3638 3277 2883 2508 2201 1959 1759 1616 1553 1539 1515 1464 1413 1377
1408 1377 1347 1326 1329 1341 1325 1278 1239 1235 1246 1246 1243 1262 1303 1344 1375 1401 1425 1448 1469 1500 1555 1627 1682 1686 1649 1604 1563 1496 1402 1338 1345 1381 1366 1289 1217 1196 1196 1182
1403 1182 1164 1165 1171 1159 1140 1147 1186 1220 1212 1149 1054 985 988 1046 1090 1069 1012 983 1006 1046 1062 1045 1014 990 982 990 1015 1071 1156 1228 1233 1168 1087 1035 1008 998 1021 1081
1399 1081 1136 1146 1136 1158 1197 1189 1119 1053 1040 1057 1052 1020 984 955 936 939 971 1007 1018 1005 992 989 985 974 964 963 971 991 1021 1055 1082 1098 1094 1062 1022 1017 1067 1132 1157
1394 1157 1142 1140 1186 1262 1337 1401 1459 1501 1525 1544 1563 1566 1531 1466 1403 1354 1307 1255 1217 1201 1188 1156 1118 1104 1115 1110 1058 985 938 936 957 982 1012 1046 1054 1021 975
1390 975 959 973 976 951 923 922 941 964 998 1054 1099 1076 984 894 882 943 1004 1015 1001 1015 1064 1115 1143 1171 1231 1314 1375 1383 1355 1341 1363 1397 1398 1345 1261 1193 1169
1385 1169 1172 1160 1118 1071 1053 1064 1065 1030 973 934 934 958 973 960 928 904 900 901 888 867 865 887 909 909 898 891 881 863 854 877 922 956 972 993 1014 999 935 870 858
1380 858 896 944 981 1014 1037 1037 1023 1017 1012 978 924 896 921 973 1018 1046 1056 1026 955 894 894 940 969 949 906 879 878 894 919 941 943 921 888 863 861 880 897 877
1376 877 811 743 724 748 759 733 713 748 819 863 843 779 715 684 693 727 755 764 771 797 833 842 812 774 769 802 842 856 836 798 765 761 788 825 841 824 797 785
1371 785 786 773 740 717 727 765 803 828 842 841 825 815 836 878 911 923 937 957 959 935 915 920 926 910 885 874 864 827 780 768 789 797 770 735 715 696 671 665
1366 665 698 739 748 726 709 707 705 696 699 723 749 751 731 712 714 725 719 686 658 675 729 776 785 771 754 720 656 595 588 633 676 685 682 694 711 706 687 679 685 685 671 657 655
1361 655 659 666 687 727 769 788 780 763 743 717 690 686 723 774 798 782 745 704 660 622 615 644 674 677 673 695 730 728 674 618 605 633 666 685 693 698 705 722 742 747 730
1356 730 707 695 698 720 770 830 850 814 775 793 842 843 780 721 717 735 727 708 724 767 784 758 729 732 751 760 754 743 728 709 701 717 742 751 734 708 690 681 675 673 686
1351 686 713 735 723 680 646 662 716 756 748 723 730 772 797 762 688 639 652 702 733 721 689 678 699 726 733 721 709 701 683 647 608 594 619 664 690 688 686 712
1346 712 749 754 712 661 647 679 730 770 780 765 749 752 765 760 732 710 717 741 760 778 805 828 827 812 808 810 796 768 757 768 775 760 743 744 760 782 805 815 794
1342 794 754 736 761 795 796 769 747 743 740 727 711 686 636 574 535 548 601 659 700 721 732 738 724 681 624 595 618 674 726 760 782 794 790 780 774 768 746 702
1337 702 651 605 580 589 629 665 676 686 728 775 773 723 689 697 705 684 678 732 802 812 770 748 769 780 752 731 759 804 806 765 735 742 755 745 720 696 679 673 691
1332 691 723 733 706 674 670 676 651 600 574 603 658 695 705 702 693 689 718 783 835 820 755 703 702 721 727 718 706 693 683 691 718 731 717 696 683 658 608 574 600
1327 600 666 705 694 669 664 668 658 639 623 612 609 626 661 684 668 627 598 599 613 611 591 576 591 629 662 679 698 728 743 720 683 672 685 690 682 695 732 757
1323 757 761 778 822 845 813 765 758 776 770 744 743 767 768 737 718 733 749 744 741 761 775 750 709 692 704 723 745 774 800 813 820 825 809 760 707 687 693 700 707 723 723
1318 723 671 591 548 568 611 639 666 704 725 700 652 621 610 596 578 581 613 648 663 662 662 665 660 635 601 583 599 634 655 651 637 628 625 631 655 680 667 608 551
1313 551 539 550 541 527 565 660 747 767 724 657 592 547 549 604 673 706 694 666 649 644 647 657 672 684 685 677 675 691 715 728 724 725 749 774 765 719 668 634 621 632
1308 632 670 709 697 627 557 545 582 617 628 632 639 642 645 661 686 702 711 727 748 753 742 738 749 755 740 721 723 749 781 803 801 762 697 652 667 722 754 738 716 733
1303 733 766 750 681 629 640 673 660 602 555 540 529 507 507 542 573 560 520 502 520 552 581 601 604 600 613 647 666 653 639 661 695 690 651 628 633 631 608 598
1299 598 626 672 705 719 708 658 582 524 504 501 497 509 548 578 573 563 590 637 651 622 591 587 601 617 638 670 699 704 673 614 553 518 518 531 538 544 565 595 618
1294 618 625 626 628 631 639 651 655 648 636 621 594 555 532 544 565 555 516 497 528 591 642 655 636 612 618 660 705 703 648 584 565 601 650 660 616 557 537 568 609
1289 609 618 608 608 614 600 571 557 567 576 578 602 664 733 765 753 724 702 702 727 764 778 746 690 646 628 627 628 619 587 531 488 502 569 639 669 667 661 659 663 683 727
1284 727 764 752 691 629 597 581 566 571 619 677 691 665 651 671 685 659 614 588 579 570 575 607 641 641 612 587 575 563 558 573 594 588 564 557 574 586 595 630 686
1279 686 713 696 684 710 735 718 689 690 705 682 620 565 543 545 564 593 607 586 570 614 696 731 684 610 569 549 518 492 511 575 642 691 727 742 719 673
1275 673 652 682 734 759 745 715 692 683 679 670 642 604 583 603 649 683 679 652 623 598 574 565 583 619 652 667 673 671 651 619 605 641 718 798 845 848 815 760 701
1270 701 656 635 634 639 635 623 616 617 610 587 569 578 605 617 603 582 567 555 559 598 657 685 662 634 650 689 696 667 641 626 600 568 579 647 715 724 681 633 607 600
1265 600 611 639 661 657 640 636 645 643 624 607 606 612 613 613 626 653 682 700 697 676 656 657 674 674 638 585 553 555 567 567 559 563 586 609 612 593 574 576 600 627 637 637 644 658
1260 658 659 636 605 594 607 613 588 543 519 542 597 643 653 633 611 606 613 618 614 603 589 579 584 603 610 589 568 600 685 760 760 702 652 643 647 627 587 558 561 599 661
1255 661 726 763 755 729 724 741 737 678 594 545 557 597 626 639 649 656 655 653 663 671 659 637 635 650 647 614 583 581 592 588 572 572 592 614 635 666 717 775 819 832 805
1250 805 743 672 612 574 560 567 588 609 626 645 668 678 670 656 644 627 605 593 596 591 564 536 529 535 540 551 577 592 574 545 548 588 633 666 682 672 637 612 629
1245 629 664 671 652 646 659 667 674 702 720 677 597 565 596 605 540 463 445 476 511 559 641 722 751 728 686 640 601 603 647 673 630 560 537 559 571 561 564 577
1240 577 559 512 484 495 521 558 624 695 715 680 650 659 678 681 690 720 740 726 701 693 688 663 633 625 631 613 560 506 491 524 566 573 549 551 618 696 707 654 626
1236 626 665 715 708 651 595 566 564 587 617 617 585 575 619 667 652 587 551 581 650 720 773 798 780 727 672 638 630 648 682 699 673 623 595 601 611 601 584
1231 584 589 619 654 663 630 577 555 589 641 654 627 617 653 687 666 603 560 575 620 649 645 623 604 602 615 625 610 569 529 524 553 585 597 604 636 689 723 719
1226 719 697 691 702 702 669 601 524 474 481 536 591 606 582 555 559 591 629 646 642 640 660 687 696 681 668 669 668 655 640 629 602 558 530 552 601 626 610 590 597 625
1222 625 638 613 558 515 520 568 609 613 604 617 643 643 614 588 583 589 598 615 632 637 637 654 685 699 690 684 695 696 667 625 599 595 601 617 639 653 648 635 626 615 600 602 632
1216 632 662 648 600 567 578 607 625 637 668 711 733 720 693 677 675 672 673 692 721 731 705 664 637 635 647 665 685 689 670 647 648 668 673 652 632 638 661 677 682
1212 682 678 662 629 599 595 616 640 648 640 629 625 630 632 623 614 629 676 726 744 719 672 630 613 627 660 681 669 627 580 544 526 529 552 580 590 581 576 589 598 578 534
1207 534 507 518 546 562 565 580 612 642 665 690 710 689 618 549 544 597 648 659 656 664 670 649 611 590 596 613 624 629 622 595 557 539 563 611 643 637 605 573 557
1202 557 566 600 636 638 593 549 559 612 644 632 618 634 644 620 605 645 701 702 655 633 652 653 602 542 516 512 522 568 642 688 681 662 660 638 571 520 553 630
1197 630 665 650 644 665 683 692 714 729 688 608 564 585 616 611 590 586 584 570 562 575 587 579 565 568 583 591 592 592 596 615 653 678 643 566 532 594 698 757 750 717 679
1192 679 632 581 550 547 561 579 596 606 614 623 629 618 599 601 629 647 635 620 633 651 640 616 610 608 574 522 507 536 554 527 496 508 546 559 538 523 539 567
1187 567 575 567 578 618 652 634 582 557 588 632 633 594 558 545 537 533 552 586 603 599 601 617 615 581 552 563 596 615 619 622 613 580 555 580 634 646 591 526 517 554 585
1182 585 578 550 526 520 533 562 606 665 730 768 746 666 582 547 555 563 549 528 530 561 615 669 693 671 639 651 705 741 717 664 639 646 653 652 668 695 698 671 654
1178 654 677 708 700 654 617 618 639 649 645 648 661 664 638 607 614 659 689 659 596 566 582 596 576 554 569 606 627 625 619 610 588 577 617 698 757 747 694 658 660 668
1173 668 653 631 631 648 647 618 588 583 592 598 605 620 626 606 584 601 638 643 611 593 611 618 585 553 562 582 570 551 570 607 611 585 580 597 593 565 561 593 614 600 587 602
1168 602 616 600 573 566 581 607 639 661 643 589 546 543 561 576 592 614 621 610 616 654 681 664 637 645 665 657 636 653 695 703 665 638 658 686 671 619 576 578 624
1163 624 679 696 665 632 640 672 678 654 645 663 661 615 563 554 577 588 579 575 591 604 592 561 537 542 563 570 544 508 504 542 587 604 596 596 621 662 691 686 654 631 646
1158 646 680 690 667 637 625 625 628 640 658 657 626 587 564 552 537 528 537 554 570 589 613 618 595 578 606 665 706 719 729 736 706 636 576 574 621 676 717 738 730
1153 730 698 670 672 695 704 689 664 645 631 617 603 594 592 597 609 617 614 602 596 600 616 643 678 710 725 721 703 673 636 619 641 674 665 608 566 586 626 611 539 491
1148 491 511 552 549 522 537 602 656 660 647 659 685 687 668 666 700 739 749 726 687 641 594 568 581 616 632 611 579 570 586 609 626 637 631 601 564 551 565 574
1144 574 561 544 542 537 514 498 522 565 585 575 573 597 618 611 589 573 558 536 520 522 534 539 540 546 549 543 543 568 608 642 656 650 619 572 539 555 612 658 654 611 575
1139 575 581 620 656 663 646 626 610 596 599 634 679 684 637 581 557 557 559 580 628 658 624 553 520 539 561 556 548 550 536 499 479 494 517 523 534 566 590 581 568 586
1134 586 621 631 619 606 583 530 486 516 607 673 658 608 599 636 671 668 641 617 617 643 678 695 683 653 624 594 564 549 569 613 647 649 636 637 653 657 636 607
1129 607 594 588 564 527 518 556 611 649 673 695 698 664 617 606 626 632 607 589 601 617 612 611 631 643 615 576 574 601 609 594 601 647 700 728 743 752 740 700 663 653
1124 653 651 628 595 572 550 511 481 500 566 631 668 684 683 650 593 561 576 607 622 633 662 690 689 672 676 700 712 693 660 630 611 622 675 730 726 656 580
1120 580 542 527 513 519 562 612 624 604 590 594 599 597 593 590 583 584 602 624 630 621 605 576 537 521 547 579 569 537 547 612 679 710 712 691 629 545 504 534 585 606
1115 606 612 632 643 615 575 574 610 632 619 592 576 572 585 609 607 550 471 438 463 497 505 507 529 557 567 564 560 559 555 550 540 520 507 523 556 565 544 541 588 645 645 583
1110 583 515 486 488 496 506 521 541 560 580 598 604 596 592 617 666 701 683 620 560 539 549 564 582 607 628 631 634 670 731 758 719 649 606 605 616 610 587 558 531
1105 531 510 487 457 437 451 490 513 500 484 497 517 505 479 488 537 571 561 540 545 555 538 507 506 544 585 599 586 561 536 525 536 562 574 562 549 566
1100 566 602 622 604 565 533 526 547 598 661 700 694 661 637 631 623 606 594 589 573 541 523 542 576 589 580 586 625 676 704 686 637 600 607 642 661 646 632 646 668
1096 668 667 654 657 663 638 590 567 581 594 581 562 558 557 545 542 567 592 577 524 475 456 462 483 522 569 600 593 556 512 485 483 505 544 594 636 647 619 578 558
1091 558 561 555 521 481 463 465 467 455 431 410 417 471 550 603 603 584 591 616 618 590 563 556 552 535 516 511 523 542 568 598 623 635 638 645 655 652 626 591 577 596 624 630
1086 630 624 631 649 640 595 557 561 578 567 546 567 626 659 635 592 570 554 522 490 490 511 515 498 485 484 480 477 501 553 589 577 535 505 496 481 456 455 507 580 614
1081 614 589 543 519 520 525 532 550 576 599 626 664 693 680 628 579 565 574 583 590 606 629 655 688 719 718 666 598 569 595 635 649 635 614 591 559 524 513 540
1076 540 583 596 559 503 470 467 467 459 458 477 504 535 580 630 647 615 573 568 588 593 584 590 604 583 535 523 573 621 601 533 490 492 505 509 517 531 528 507 498 519 540
1071 540 527 492 476 489 508 510 499 494 500 512 521 527 538 558 578 582 566 542 525 520 518 510 489 462 454 486 541 586 613 642 679 692 656 598 561 547 526 496 499 545
1066 545 582 559 499 473 502 542 552 537 527 535 554 578 598 593 559 527 535 586 637 655 650 653 664 654 605 540 491 471 467 473 498 539 576 596 607 630 665 699
1062 699 725 746 759 761 755 751 741 701 627 555 530 554 589 603 595 590 598 604 589 571 583 630 669 658 613 590 608 633 625 590 553 526 517 544 599 634 617 589 604
1057 604 648 655 616 578 567 551 519 514 561 615 629 627 642 638 570 481 456 497 515 476 441 461 497 497 480 493 531 558 569 583 596 596 604 643 687 689 654 634 647
1052 647 659 648 629 613 588 561 565 600 615 580 532 516 517 496 467 483 550 618 642 632 623 629 633 614 572 539 547 591 623 611 584 583 604 611 589 565 566 587 613
1047 613 629 619 579 532 509 517 538 558 573 576 566 561 583 615 618 599 601 636 655 626 589 589 595 549 473 459 540 645 682 644 591 564 558 554 545 525 489 453 448 487
1042 487 544 579 585 581 586 595 598 601 606 605 580 539 508 506 526 550 568 582 597 611 608 570 507 462 472 519 545 524 489 486 512 526 501 455 420 419 453 505 545 552 529
1037 529 500 491 513 554 588 595 572 533 496 474 476 498 520 531 540 558 569 551 512 483 473 467 466 481 502 501 493 536 635 714 704 639 598 596 586 554 534 546 574
1033 574 602 631 644 613 549 506 519 566 601 601 569 531 525 571 634 655 628 601 602 603 570 517 475 459 468 500 536 556 564 585 607 595 549 531 577 641 658 625
1028 625 587 567 552 536 520 505 499 525 589 645 647 611 592 607 627 631 632 645 668 687 690 665 620 587 590 617 642 658 674 684 681 682 697 704 686 674 704 751 759 728
1023 728 708 710 688 632 590 588 584 551 532 568 616 617 586 581 599 590 552 543 583 618 604 572 575 612 644 656 666 680 675 639 595 577 596 627 636 607 564 543 558 583
1018 583 590 590 611 657 697 701 681 665 648 603 523 445 409 418 450 482 507 523 530 532 539 556 583 607 608 571 515 474 466 475 484 501 539 584 601 584 565 581 623 654
1013 654 644 607 595 639 712 753 734 690 657 625 577 543 563 619 646 618 574 549 529 503 499 537 583 584 541 507 517 542 532 485 447 460 508 545 556 578
1009 578 635 687 685 645 621 629 633 617 611 631 648 646 647 666 677 664 646 636 613 571 553 588 630 629 604 604 621 612 592 612 661 671 624 587 598 605 555 482 457 489
1004 489 522 525 516 524 545 553 535 511 513 556 608 629 614 604 628 670 690 669 616 564 545 567 599 599 573 562 575 563 497 423 407 450 494 515 540 585 618 605
999 605 562 535 546 576 593 590 582 592 624 651 643 592 522 471 456 464 475 477 472 474 483 488 484 483 504 546 590 616 624 626 630 632 626 610 586 564 551 548 550 554 560 560 550 533 521 525
994 525 547 585 630 660 650 605 568 580 631 681 705 714 716 700 667 649 666 689 666 595 530 513 533 548 537 507 479 475 504 546 569 566 552 537 510 475 470 511
989 511 558 562 530 517 554 612 642 633 603 573 539 494 454 450 499 565 599 597 601 635 665 655 619 593 572 536 505 519 572 614 621 614 612 601 572 543 529 524 517 505
984 505 484 462 474 549 651 705 680 625 593 579 557 536 536 550 560 568 586 604 596 564 535 530 552 589 622 632 622 615 615 603 577 564 579 597 592 579 587 606 598
979 598 552 498 463 454 465 485 499 498 498 519 563 621 693 771 816 796 725 659 637 652 663 640 593 564 575 594 577 543 560 635 684 654 601 602 636 633 606 629
975 629 687 675 558 441 435 517 585 589 557 530 527 556 610 653 654 622 591 585 609 659 716 743 724 678 628 576 527 508 533 568 568 534 508 513 527 527 516 520 553
970 553 599 623 601 558 541 564 583 561 529 534 569 579 541 497 490 510 526 533 556 590 603 574 536 534 569 598 596 591 616 648 640 587 539 526 525 508 490 500 535
965 535 565 577 585 602 628 654 674 674 650 610 570 539 531 561 615 652 648 629 630 643 639 617 605 602 584 554 551 590 628 622 588 574 595 623 635 636 635 624 600 577 575
960 575 596 626 654 680 704 707 667 586 502 464 487 543 588 601 591 578 573 580 593 603 609 616 634 661 683 694 699 700 685 648 607 588 598 618 625 616 596 575 569 590
955 590 608 576 500 456 501 593 639 613 574 575 601 611 596 572 554 551 567 584 578 555 543 553 562 566 591 645 688 697 697 711 713 675 625 605 603 577 538 530 557 583
951 583 592 613 652 683 689 694 709 713 686 647 628 631 638 639 638 644 660 670 652 607 568 559 564 557 547 567 606 619 597 576 583 599 596 578 557 539 533 557 613 664 675 646 600
945 600 557 530 522 515 490 458 453 482 522 554 586 615 622 612 612 619 604 575 581 636 682 677 653 650 644 595 523 486 498 534 579 619 620 576 545 579 630 615 543 503 530
940 530 561 551 533 549 585 607 616 612 578 525 505 534 558 536 512 547 612 628 577 525 524 563 605 629 625 589 536 502 506 536 569 590 597 597 612 637 630 562 482
935 482 475 558 650 677 644 607 596 597 597 594 591 592 605 621 621 597 575 577 590 593 586 586 590 589 602 646 688 684 642 625 651 674 662 647 670 705 708 690 690 707 710 699 713 751
930 751 764 723 663 630 622 614 600 593 600 611 618 615 598 581 590 623 644 624 581 553 550 552 548 556 588 629 651 645 629 634 670 716 737 722 681 635 598 584 602 637 662 678
925 678 707 760 805 815 806 814 848 881 882 850 812 803 830 857 839 780 734 735 760 767 756 756 767 757 703 617 535 497 519 571 605 606 605 628 646 631 608 612 628 613
920 613 580 582 625 657 651 638 640 639 620 613 644 685 691 657 610 579 575 604 644 657 635 614 624 645 644 624 611 610 613 618 634 655 676 702 732 740 710 675 682 732 772 760
915 760 710 662 635 625 613 585 541 506 503 528 555 562 554 546 543 545 557 582 611 618 583 516 455 429 433 443 446 454 483 531 577 595 565 505 470 490 528 517 459 428
910 428 469 545 593 605 603 595 577 559 557 559 556 566 610 664 683 659 621 598 610 663 729 740 664 556 504 520 546 547 540 537 528 521 550 613 653 635 592 571 581 605
905 605 638 677 699 689 662 642 632 623 612 597 570 537 522 526 525 511 502 506 503 485 490 531 562 538 494 500 566 632 655 649 638 621 592 564 552 551 552 559 571 578 575 571 578
900 578 594 622 661 697 699 661 615 603 628 663 678 673 665 665 669 667 658 647 635 612 572 532 514 525 547 565 578 593 611 622 613 587 563 557 564 563 552 551 564 566 533 484
895 484 464 490 541 593 644 691 711 684 630 590 580 577 554 522 514 540 571 578 561 540 530 534 560 605 648 665 671 695 724 701 610 517 507 581 669 705 688 654
890 654 631 632 652 672 674 662 662 684 708 702 657 597 566 584 627 648 634 618 624 630 608 582 595 639 666 667 675 702 708 671 627 615 609 567 510 493 518 530 506 494
885 494 530 579 587 570 593 671 739 724 636 551 527 555 588 599 598 609 643 689 717 711 685 674 691 706 692 669 683 741 796 805 774 740 718 700 682 676 693 728
881 728 765 794 815 844 895 966 1056 1179 1350 1537 1667 1682 1594 1453 1300 1145 1002 894 828 791 764 742 726 715 707 703 700 698 705 727 760 793 810
877 810 800 752 673 594 552 556 589 625 649 657 658 665 676 667 623 567 542 558 587 599 596 589 575 551 528 519 530 555 594 634 659 665 671 686 693 680 662 660 668 666 656 655 663
871 663 662 658 679 731 777 786 769 759 759 749 720 687 661 639 621 620 644 677 692 679 653 640 640 638 618 590 577 589 614 631 630 622 624 642 666 681 679 664 643 624 619
866 619 635 662 673 662 659 686 716 703 657 633 649 655 618 581 596 637 639 611 634 727 804 790 727 700 714 714 687 676 692 682 623 568 578 639 688 698 697 712
862 712 739 749 730 692 657 639 627 602 574 574 609 645 653 646 652 662 647 619 626 684 752 778 764 747 748 755 751 742 744 756 756 723 666 621 609 614 607 591 591 610 626 628 631
856 631 643 651 652 670 716 750 725 663 637 682 749 764 718 670 669 705 727 706 670 665 688 697 667 626 611 612 601 579 574 587 590 580 586 621 651 647 629 629 648 667 683
851 683 701 711 697 668 647 636 626 622 642 680 708 708 683 643 606 600 631 666 669 649 642 650 641 619 628 673 702 685 663 686 730 734 695 666 677 704 717 720 720 712 699
846 699 699 724 758 789 826 861 856 786 689 628 624 638 634 622 627 641 636 612 608 656 729 771 755 711 683 687 715 750 772 768 746 732 739 747 731 699 675 670 679 702 744 782
841 782 786 761 738 728 714 695 709 769 827 824 770 718 694 678 657 645 657 678 689 690 686 675 663 667 695 735 762 771 769 766 766 769 774 775 772 766 761 761 765 767 759 744 737 741 739 721
836 721 712 740 790 817 812 811 827 822 771 724 744 808 834 801 781 825 886 893 861 862 915 961 950 902 863 845 831 806 775 754 761 792 815 802 770 775 831 896 922
831 922 914 903 897 897 918 962 994 983 955 957 977 969 937 946 1018 1103 1158 1207 1284 1352 1346 1267 1173 1095 1019 938 884 880 902 910 901 905 935 970 973 938 895 876 877 875 868 877 898
826 898 891 840 787 788 836 870 859 838 856 903 929 903 846 805 803 825 841 840 834 841 862 890 911 908 883 865 883 920 931 912 902 924 942 922 888 878 883 871 849
821 849 841 839 823 811 836 881 890 855 820 806 792 784 819 888 924 906 898 942 979 942 873 863 912 943 925 909 937 970 958 909 872 875 898 911 903 896 916 963 995
816 995 975 917 868 859 884 926 959 954 906 855 841 855 854 833 828 858 898 916 917 915 916 926 947 962 944 899 866 862 859 832 805 813 852 893 922 942 943 921 895 894 910
811 910 914 898 879 866 847 827 833 872 915 932 926 915 911 915 923 923 896 849 818 835 881 904 875 823 792 797 824 855 889 924 961 995 1024 1034 1016 984 962 957 941 898
806 898 853 846 878 905 899 880 877 889 900 914 944 975 974 943 924 946 976 965 915 872 860 855 842 843 884 944 977 973 960 959 961 967 991 1025 1028 983 937 939 971 980 952 929
801 929 932 932 908 883 888 915 934 931 918 918 948 1008 1061 1064 1015 971 979 1014 1017 977 939 932 941 941 941 953 964 953 936 944 983 1016 1013 985 963 948 922 892 892 931 968 968 962 1006
796 1006 1087 1120 1068 995 987 1031 1050 1020 992 1001 1011 979 928 908 926 947 957 973 999 1020 1030 1047 1082 1120 1135 1121 1082 1022 963 946 993 1062 1091 1063 1020 1015
791 1015 1050 1097 1126 1127 1111 1090 1069 1043 1018 1019 1067 1133 1155 1113 1051 1018 1007 986 961 963 984 987 963 944 955 981 1005 1029 1056 1065 1041 1000 970 960 962 969 985 1016
787 1016 1071 1134 1165 1134 1073 1051 1085 1120 1117 1103 1110 1112 1077 1036 1038 1060 1035 971 946 993 1052 1059 1031 1019 1030 1042 1063 1101 1131 1120 1089 1085 1110 1118 1081 1025 986 973
782 973 986 1032 1100 1151 1154 1119 1075 1031 988 964 983 1032 1067 1067 1056 1059 1057 1018 962 952 1016 1107 1157 1162 1171 1205 1226 1197 1142 1117 1133 1142 1109 1064 1068 1135 1208 1225 1183
777 1183 1135 1118 1126 1130 1125 1118 1113 1106 1098 1094 1094 1105 1137 1176 1177 1116 1044 1037 1100 1151 1133 1082 1071 1104 1125 1108 1090 1119 1182 1231 1241 1230 1222 1220 1212 1191 1162 1132 1102 1077 1073 1093
772 1093 1114 1108 1079 1061 1074 1098 1110 1116 1143 1197 1246 1260 1241 1218 1216 1224 1213 1173 1133 1130 1156 1167 1147 1131 1155 1200 1219 1202 1179 1171 1172 1167 1160 1153 1140 1121 1111 1122 1153 1189
767 1189 1217 1221 1198 1174 1182 1224 1268 1284 1277 1263 1249 1236 1236 1254 1270 1263 1250 1263 1294 1304 1277 1244 1231 1224 1202 1188 1214 1269 1303 1291 1255 1217 1178 1139 1136 1192 1278 1330
762 1330 1335 1335 1364 1398 1391 1336 1264 1204 1163 1141 1146 1179 1222 1248 1243 1211 1178 1173 1208 1264 1314 1349 1379 1405 1417 1411 1401 1396 1381 1338 1276 1227 1210 1228 1270 1318 1347 1339 1306
758 1306 1279 1277 1291 1312 1339 1364 1364 1328 1277 1243 1237 1253 1284 1320 1331 1304 1278 1307 1383 1433 1412 1362 1347 1364 1364 1335 1315 1323 1330 1315 1302 1321 1361 1383 1375 1349 1315 1279
753 1279 1263 1288 1347 1409 1453 1480 1488 1460 1395 1330 1307 1321 1325 1297 1269 1282 1326 1353 1341 1328 1352 1401 1436 1441 1425 1400 1368 1348 1357 1380 1383 1366 1365 1390 1410 1394 1358 1327
748 1327 1298 1266 1256 1289 1343 1380 1395 1414 1432 1424 1397 1388 1402 1409 1392 1376 1385 1402 1409 1413 1428 1443 1450 1463 1491 1512 1511 1514 1546 1586 1589 1553 1514 1489 1465 1447 1473 1550 1631 1658
744 1658 1630 1590 1563 1542 1520 1512 1534 1570 1587 1560 1496 1424 1377 1372 1412 1479 1536 1553 1532 1506 1504 1515 1516 1504 1497 1504 1508 1502 1494 1498 1499 1481 1451 1441 1469 1516 1548 1549 1534 1535 1568
738 1568 1614 1641 1642 1640 1648 1644 1604 1549 1525 1550 1587 1601 1598 1604 1616 1611 1594 1594 1623 1649 1644 1616 1596 1596 1601 1600 1601 1619 1650 1670 1658 1624 1605 1621 1640 1622 1573 1549 1572 1604 1608 1604
733 1604 1633 1685 1713 1708 1701 1702 1682 1633 1601 1624 1678 1707 1693 1668 1660 1675 1700 1724 1731 1716 1701 1713 1749 1771 1763 1749 1760 1784 1779 1735 1692 1693 1725 1747 1740 1731 1745 1775 1802 1821
728 1821 1839 1854 1861 1867 1873 1876 1878 1890 1910 1910 1878 1841 1831 1830 1810 1796 1832 1907 1953 1942 1919 1929 1954 1966 1980 2011 2029 2004 1966 1969 2006 2021 1986 1936 1914 1928 1969 2021 2067
724 2067 2091 2096 2096 2098 2099 2102 2104 2083 2031 1984 1986 2028 2060 2059 2053 2072 2101 2109 2095 2079 2075 2087 2110 2130 2133 2123 2117 2124 2134 2147 2175 2221 2267 2296 2311 2325 2338 2349 2357 2362 2356 2341 2327
718 2327 2320 2316 2313 2305 2279 2234 2204 2229 2296 2344 2339 2313 2309 2325 2338 2346 2362 2369 2345 2305 2295 2339 2404 2442 2434 2401 2375 2373 2391 2414 2435 2463 2491 2489 2443 2387 2375 2411 2443 2430
714 2430 2398 2396 2430 2471 2499 2531 2578 2610 2591 2537 2501 2513 2551 2583 2606 2625 2627 2606 2586 2597 2627 2638 2626 2618 2629 2637 2627 2616 2629 2662 2705 2750 2782 2777 2733 2689 2680 2703
709 2703 2728 2753 2795 2854 2896 2899 2873 2850 2854 2883 2918 2945 2966 2988 3005 3002 2982 2960 2946 2939 2944 2966 2989 2987 2969 2972 3013 3060 3079 3073 3061 3054 3053 3072 3113 3151 3167 3167 3165 3158 3155 3188
704 3188 3261 3326 3342 3327 3318 3315 3300 3295 3333 3393 3427 3428 3433 3457 3479 3494 3519 3544 3534 3490 3464 3484 3525 3551 3564 3583 3611 3638 3656 3656 3641 3636 3660 3692 3703 3709 3750 3811 3837
699 3837 3821 3828 3887 3945 3948 3927 3940 3982 4007 4002 4002 4024 4047 4056 4054 4059 4087 4144 4211 4244 4230 4201 4194 4207 4225 4249 4276 4287 4277 4280 4323 4383 4421 4430 4423 4400 4369 4364 4405 4464 4505
694 4505 4541 4597 4649 4664 4664 4699 4756 4774 4742 4720 4746 4794 4834 4877 4934 4986 5019 5046 5069 5074 5066 5079 5117 5134 5112 5106 5170 5277 5348 5355 5341 5352 5391 5428 5454 5489 5559
689 5559 5649 5704 5685 5627 5612 5668 5741 5779 5796 5835 5890 5920 5915 5909 5928 5963 5998 6032 6077 6131 6184 6219 6233 6250 6295 6372 6452 6510 6546 6569 6584 6604 6642 6691 6725 6743
685 6743 6783 6860 6930 6958 6972 7023 7104 7168 7209 7266 7356 7434 7462 7449 7424 7408 7415 7466 7562 7667 7749 7809 7864 7921 7982 8056 8137 8203 8245 8288 8358 8446 8522 8577 8633
681 8633 8698 8760 8813 8872 8953 9043 9110 9148 9191 9283 9424 9565 9659 9717 9783 9879 9984 10077 10161 10253 10346 10427 10499 10572 10644 10713 10795 10908 11036 11143 11225 11322
677 11322 11459 11602 11702 11768 11859 12005 12168 12289 12367 12447 12566 12717 12884 13058 13224 13363 13482 13622 13804 13993 14134 14229 14337 14495 14676
674 14676 14838 14981 15129 15283 15417 15538 15681 15855 16021 16147 16259 16413 16611 16796 16934 17064 17241 17463 17678 17863 18046 18255 18482
671 18482 18696 18883 19041 19179 19325 19516 19757 20009 20241 20462 20685 20895 21066 21221 21404 21620 21840 22056 22291 22547 22786 22983 23155
668 23155 23322 23482 23646 23860 24143 24439 24672 24835 24982 25141 25291 25419 25559 25742 25950 26142 26309 26466 26621 26772 26929 27101 27266
665 27266 27394 27489 27589 27716 27845 27947 28026 28103 28174 28217 28230 28242 28266 28290 28310 28342 28388 28418 28410 28386 28383 28401 28418 28418 28400 28348 28257 28156 28079 28010 27900 27745
661 27745 27596 27486 27389 27268 27123 26972 26811 26640 26473 26315 26140 25942 25761 25626 25494 25298 25037 24779 24575 24411 24253 24081 23890
659 23890 23673 23432 23173 22908 22651 22421 22221 22026 21808 21575 21352 21145 20942 20743 20559 20384 20205 20024 19847 19654 19433 19212 19026
656 19026 18855 18644 18397 18170 17979 17784 17566 17371 17220 17067 16872 16666 16488 16309 16090 15863 15693 15576 15450 15283 15099 14920 14741
653 14741 14570 14426 14300 14157 13993 13840 13713 13589 13456 13327 13199 13047 12872 12711 12589 12488 12376 12243 12090 11926 11782 11693 11650 11598
650 11598 11506 11401 11313 11223 11097 10946 10811 10717 10652 10596 10531 10447 10345 10238 10130 10014 9905 9838 9814 9783 9697 9566 9428 9307 9211 9150 9126 9107
647 9107 9066 9014 8963 8891 8779 8666 8609 8597 8568 8502 8445 8420 8390 8319 8233 8174 8137 8081 7990 7887 7805 7756 7732 7714 7682 7639 7598 7560 7517 7477 7464 7474 7462
643 7462 7399 7309 7231 7167 7102 7039 6994 6961 6924 6891 6881 6879 6846 6775 6714 6694 6693 6668 6618 6577 6555 6531 6489 6444 6412 6374 6305 6220 6174 6193 6243 6266 6242 6198 6157 6116
638 6116 6072 6033 6001 5964 5920 5890 5885 5878 5844 5795 5760 5739 5710 5675 5652 5644 5634 5620 5615 5612 5582 5524 5487 5496 5512 5479 5405 5355 5362 5379 5350 5284 5242 5252 5278 5269 5231 5211 5229
633 5229 5241 5202 5127 5079 5086 5109 5097 5048 5005 4994 5000 4997 4979 4962 4961 4974 4983 4975 4948 4902 4834 4749 4678 4655 4671 4681 4659 4635 4651 4694 4712 4682 4637 4616 4619 4625 4623 4615 4597 4565
629 4565 4526 4501 4493 4488 4475 4466 4476 4492 4477 4407 4314 4267 4294 4351 4369 4334 4295 4297 4329 4353 4364 4383 4410 4413 4374 4321 4296 4308 4335 4359 4378 4387 4367 4311 4248 4214 4208 4195
624 4195 4159 4128 4132 4146 4127 4079 4050 4066 4090 4082 4060 4067 4099 4119 4109 4081 4040 3983 3930 3913 3928 3933 3915 3904 3918 3930 3920 3912 3927 3935 3903 3861 3859 3885 3886 3857 3855 3910 3982
619 3982 4025 4041 4043 4028 4002 3994 4021 4051 4050 4024 4003 3990 3964 3916 3861 3818 3806 3829 3858 3849 3798 3752 3745 3749 3729 3703 3719 3771 3819 3847 3861 3852 3799 3732 3713 3755 3804 3817
615 3817 3808 3804 3798 3783 3771 3769 3759 3741 3754 3813 3865 3856 3811 3791 3810 3818 3788 3744 3724 3734 3757 3772 3770 3751 3732 3727 3730 3723 3705 3677 3631 3567 3514 3501 3517 3530 3540 3569 3610 3623
610 3623 3601 3596 3637 3687 3696 3673 3657 3656 3651 3646 3666 3703 3717 3705 3708 3747 3780 3758 3690 3629 3603 3601 3605 3610 3608 3593 3577 3582 3609 3623 3592 3525 3467 3450 3475 3518 3556 3575 3572 3556 3538
605 3538 3527 3529 3545 3565 3579 3578 3564 3544 3530 3530 3542 3547 3533 3516 3522 3545 3543 3490 3408 3348 3335 3357 3399 3445 3477 3479 3470 3485 3527 3561 3554 3511 3464 3428 3410 3415 3438 3455 3444 3411
600 3411 3390 3403 3440 3468 3466 3442 3421 3418 3418 3408 3400 3409 3422 3407 3364 3327 3316 3314 3312 3324 3346 3338 3286 3250 3287 3364 3396 3357 3311 3309 3337 3355 3357 3352 3339 3318 3306 3305 3292 3254 3222
595 3222 3229 3257 3266 3247 3225 3212 3197 3185 3209 3275 3333 3335 3292 3261 3262 3262 3232 3198 3198 3213 3185 3106 3049 3078 3168 3247 3280 3285 3274 3240 3189 3153 3149 3161 3172 3190 3220 3248 3265
590 3265 3273 3267 3232 3175 3139 3152 3191 3213 3206 3191 3177 3159 3133 3111 3107 3123 3148 3156 3137 3114 3131 3190 3249 3269 3257 3240 3229 3220 3217 3222 3217 3202 3207 3250 3300 3306 3264 3211 3171 3145
585 3145 3142 3163 3182 3167 3136 3140 3186 3230 3242 3248 3273 3290 3268 3227 3215 3249 3288 3291 3259 3231 3238 3267 3280 3274 3291 3359 3446 3491 3484 3467 3477 3519 3586 3673 3757 3810 3842 3895
580 3895 3973 4036 4058 4060 4058 4032 3972 3920 3921 3960 3998 4033 4095 4181 4259 4312 4339 4332 4280 4195 4101 3994 3870 3759 3701 3677 3627 3537 3462 3445 3461 3467 3461 3467 3475 3455 3399
576 3399 3333 3284 3260 3256 3259 3250 3225 3199 3184 3172 3162 3176 3227 3284 3301 3285 3296 3366 3455 3496 3473 3422 3385 3366 3353 3341 3339 3348 3361 3370 3365 3342 3306 3273 3252 3242 3231 3218
571 3218 3205 3188 3171 3175 3220 3296 3351 3349 3301 3252 3238 3259 3298 3334 3356 3364 3373 3387 3395 3390 3381 3377 3374 3361 3345 3347 3365 3379 3376 3374 3401 3457 3502 3493 3433 3375 3364 3383 3391 3388 3417 3482
566 3482 3526 3507 3468 3464 3480 3472 3456 3487 3555 3586 3555 3525 3538 3556 3533 3499 3502 3530 3541 3535 3545 3569 3584 3600 3642 3681 3665 3603 3560 3569 3596 3613 3633 3665 3680 3668 3669 3703
561 3703 3730 3718 3699 3719 3761 3781 3793 3834 3879 3856 3766 3704 3731 3793 3811 3802 3837 3917 3971 3962 3946 3982 4061 4138 4206 4295 4408 4514 4586 4624 4624 4579 4508 4454 4433
557 4433 4424 4408 4407 4445 4506 4564 4633 4749 4918 5112 5313 5529 5758 5974 6150 6263 6290 6220 6079 5919 5752 5550 5310 5083 4910 4774 4634
554 4634 4497 4400 4347 4304 4256 4228 4234 4255 4262 4242 4203 4167 4162 4203 4263 4296 4291 4282 4297 4325 4346 4368 4408 4453 4469 4453 4439 4463 4520 4583 4638 4695 4763 4843 4933 5051
549 5051 5214 5412 5613 5813 6052 6378 6793 7263 7758 8243 8647 8875 8878 8683 8353 7942 7495 7066 6691 6368 6077 5819 5601 5411
547 5411 5232 5075 4962 4890 4828 4758 4696 4654 4636 4646 4690 4749 4776 4744 4682 4649 4670 4719 4755 4763 4768 4803 4865 4913 4914 4889 4897 4970 5087 5212 5327 5422 5481 5498
542 5498 5502 5531 5596 5688 5803 5955 6156 6387 6602 6762 6861 6927 6975 6974 6873 6676 6443 6236 6059 5897 5758 5665 5609 5551 5475 5398 5334 5286 5257
539 5257 5259 5279 5287 5273 5262 5273 5289 5281 5260 5264 5309 5372 5417 5434 5436 5433 5419 5387 5346 5319 5324 5348 5359 5343 5319 5327 5386 5472 5539 5558 5541 5523 5521 5517 5491 5457 5453 5486 5519 5517 5487
534 5487 5475 5513 5585 5652 5694 5720 5752 5791 5827 5859 5895 5936 5965 5981 6002 6037 6066 6079 6099 6151 6217 6254 6266 6301 6386 6488 6567 6622 6664 6682 6670 6649 6647 6657 6657
530 6657 6662 6700 6758 6784 6760 6727 6727 6757 6793 6827 6858 6870 6853 6831 6845 6895 6942 6959 6969 7006 7070 7131 7175 7222 7283 7341 7375 7394 7426 7485 7555 7620 7673 7698 7680 7636
525 7636 7621 7676 7785 7907 8030 8171 8330 8490 8645 8811 8997 9188 9366 9516 9627 9685 9694 9660 9584 9471 9355 9280 9247 9215 9169 9146 9172 9214
522 9214 9220 9186 9151 9142 9154 9183 9236 9306 9367 9397 9388 9353 9329 9356 9431 9496 9509 9505 9553 9658 9752 9799 9843 9941 10081 10212 10323 10442 10580 10705 10792 10851 10906
518 10906 10974 11061 11167 11284 11405 11536 11697 11891 12091 12268 12425 12597 12817 13085 13371 13641 13891 14144 14427 14754 15124 15525 15927 16300
515 16300 16652 17033 17481 17983 18503 19034 19599 20201 20814 21424 22049 22694 23331 23922 24479 25045 25651 26288 26925 27543 28148 28765 29397
512 29397 30007 30536 30966 31328 31665 31967 32176 32226 32074 31708 31161 30487 29709 28807 27762 26611 25423 24252 23128 22078 21120
509 21120 20228 19369 18562 17858 17266 16738 16242 15795 15401 15017 14605 14198 13855 13582 13332 13070 12800 12538 12306 12124 11992 11878 11749
507 11749 11604 11447 11262 11038 10811 10624 10469 10301 10118 9956 9829 9705 9572 9458 9373 9292 9210 9166 9175 9184 9142 9068 9008 8961 8879 8746 8599
503 8599 8478 8399 8361 8351 8330 8265 8174 8099 8054 8014 7956 7889 7824 7763 7711 7676 7651 7617 7574 7544 7533 7519 7493 7475 7474 7461 7408 7328 7251 7177 7083 6975 6887 6838
499 6838 6817 6805 6797 6790 6772 6735 6692 6662 6654 6655 6644 6606 6548 6494 6466 6458 6443 6413 6388 6391 6412 6413 6372 6309 6259 6228 6197 6159 6132 6139 6173 6202 6202 6175 6142 6121 6110 6096 6072
494 6072 6053 6058 6084 6107 6112 6107 6110 6122 6132 6132 6116 6079 6019 5941 5851 5749 5648 5576 5544 5530 5509 5488 5481 5475 5457 5450 5478 5512 5489 5403 5323 5301 5316 5330 5343 5363 5366 5325
490 5325 5262 5220 5203 5187 5170 5165 5164 5139 5096 5069 5072 5081 5080 5071 5051 5012 4965 4940 4947 4962 4974 4997 5035 5058 5048 5032 5050 5095 5120 5107 5081 5071 5056 4997 4893 4803 4784 4822
485 4822 4841 4796 4731 4716 4749 4765 4736 4708 4723 4753 4749 4712 4678 4659 4637 4611 4606 4628 4647 4640 4622 4618 4627 4633 4627 4620 4617 4603 4562 4502 4459 4470 4525 4575 4579 4550 4528 4533 4550 4553 4536
480 4536 4506 4476 4456 4448 4445 4444 4446 4450 4448 4443 4455 4493 4531 4535 4514 4502 4516 4534 4535 4523 4514 4520 4555 4618 4677 4693 4677 4679 4716 4740 4702 4621 4560 4549 4565 4584 4603 4619 4620 4605 4598 4620
475 4620 4658 4690 4708 4725 4749 4775 4794 4808 4829 4864 4910 4956 4991 5013 5022 5027 5039 5073 5137 5230 5336 5419 5443 5399 5321 5247 5181 5108 5025 4950 4895 4855 4838 4854 4874
471 4874 4844 4749 4654 4630 4675 4736 4779 4804 4813 4803 4784 4776 4774 4758 4729 4706 4685 4649 4617 4627 4681 4727 4734 4722 4717 4714 4706 4717 4760 4804 4823 4839 4885 4942 4968 4971 4995 5052 5119
466 5119 5197 5322 5499 5688 5846 5969 6053 6066 5990 5857 5718 5596 5474 5343 5211 5086 4971 4871 4793 4734 4691 4665 4650 4627 4588 4545 4518 4516
462 4516 4528 4542 4541 4512 4459 4409 4391 4410 4446 4468 4458 4419 4374 4347 4342 4344 4345 4353 4367 4374 4369 4367 4387 4428 4476 4524 4562 4566 4531 4489 4485 4537 4617 4691 4742 4774 4802 4833 4846 4801
458 4801 4687 4553 4464 4433 4420 4388 4339 4287 4241 4201 4166 4135 4106 4085 4067 4030 3972 3939 3977 4061 4112 4092 4048 4033 4028 3989 3923 3884 3890 3909 3911 3892 3863 3841 3850 3898
453 3898 3951 3965 3947 3940 3966 3988 3966 3904 3836 3796 3796 3827 3856 3849 3814 3792 3803 3813 3793 3757 3740 3745 3756 3775 3808 3831 3807 3748 3716 3753 3832 3887 3886 3847 3812 3812 3842 3870
448 3870 3867 3838 3816 3820 3835 3841 3839 3840 3835 3802 3751 3720 3735 3769 3787 3792 3810 3840 3847 3819 3794 3810 3849 3866 3859 3868 3907 3942 3952 3951 3949 3918 3846 3777 3758 3769 3752 3709 3700 3753 3815
443 3815 3834 3824 3833 3863 3881 3869 3850 3846 3852 3851 3838 3827 3832 3852 3876 3895 3908 3911 3894 3860 3840 3864 3910 3923 3882 3830 3818 3838 3853 3860 3882 3917 3928 3901 3870 3868 3885 3895 3900
439 3900 3919 3946 3952 3928 3908 3919 3939 3916 3842 3771 3760 3798 3822 3805 3788 3814 3865 3888 3871 3853 3859 3873 3866 3841 3826 3833 3847 3841 3799 3737 3703 3730 3799 3850 3848 3820 3810 3824
434 3824 3833 3828 3830 3854 3885 3901 3890 3855 3808 3773 3776 3804 3810 3773 3733 3746 3791 3795 3730 3658 3647 3684 3704 3690 3678 3681 3672 3637 3613 3626 3645 3639 3633 3673 3740 3769 3734 3673 3627 3593
429 3593 3556 3533 3549 3597 3639 3648 3627 3602 3594 3605 3616 3622 3630 3635 3618 3574 3548 3585 3667 3722 3717 3681 3655 3642 3644 3675 3726 3745 3703 3642 3619 3630 3629 3614 3630 3681 3716 3697 3650
424 3650 3617 3602 3591 3594 3633 3692 3727 3711 3668 3635 3627 3635 3649 3665 3682 3705 3740 3784 3819 3828 3818 3813 3815 3798 3759 3730 3737 3756 3742 3697 3668 3682 3714 3739 3767 3815 3866 3891
420 3891 3888 3880 3892 3939 4012 4075 4101 4106 4132 4175 4184 4146 4123 4170 4257 4320 4358 4407 4459 4476 4465 4473 4505 4518 4512 4543 4641 4762 4855 4919 4977 5029 5073 5134 5225 5319 5379
415 5379 5406 5424 5450 5501 5594 5719 5825 5884 5927 6003 6107 6200 6278 6380 6539 6749 6993 7270 7581 7913 8251 8598 8975 9399 9867 10366 10901
412 10901 11516 12256 13119 14063 15081 16232 17594 19204 21087 23321 26059 29481 33761 39110 45837 54341 64965 77776
410 77776 92364 107695 122062 133256 139133 138465 131556 120079 106263 92049 78740 67064 57312 49437 43176
408 43176 38212 34259 31079 28485 26346 24568 23066 21786 20714 19845 19152 18600 18183 17894 17710 17622 17664 17852 18142 18488 18898
405 18898 19407 20018 20717 21516 22433 23461 24621 25997 27657 29585 31766 34304 37379 41136 45730 51450 58713 68000 79964
403 79964 95553 115787 141243 171634 205487 239608 268806 286989 289769 276786 251740 220212 187263 156371
401 156371 129501 107418 89934 76296 65656 57323 50759 45515 41251 37737 34805 32329 30215 28398 26819 25430
399 25430 24209 23151 22249 21505 20919 20465 20102 19816 19637 19593 19659 19789 19968 20214 20532 20915 21361 21888 22532 23350 24421 25818
397 25818 27593 29814 32610 36162 40678 46396 53619 62660 73694 86572 100662 114696 126773 134719 136834 132636
395 132636 123068 110039 95639 81555 68857 58050 49215 42175 36633 32263 28765 25916 23584 21691 20140 18822
393 18822 17673 16678 15818 15033 14288 13612 13046 12572 12140 11731 11362 11040 10755 10512 10310 10117 9892 9645 9427 9248 9062 8849 8644
390 8644 8481 8334 8160 7964 7783 7634 7520 7453 7439 7439 7397 7312 7240 7217 7214 7184 7134 7106 7114 7121 7089 7023 6951 6886 6831 6802 6810 6835 6843 6833 6839 6873 6903 6900 6879
386 6879 6863 6842 6803 6774 6782 6802 6780 6720 6677 6680 6694 6691 6691 6713 6733 6717 6682 6670 6689 6720 6756 6801 6844 6856 6827 6772 6718 6676 6651 6639 6635 6634 6641 6658 6673 6679 6683 6689 6691 6676
381 6676 6651 6626 6602 6578 6565 6567 6572 6568 6568 6594 6640 6667 6648 6597 6554 6547 6567 6580 6566 6535 6508 6488 6459 6423 6395 6379 6365 6363 6401 6467 6496 6445 6364 6341 6383 6412 6386 6356
376 6356 6385 6450 6482 6458 6417 6395 6387 6376 6368 6372 6376 6365 6348 6347 6372 6408 6435 6441 6434 6431 6444 6468 6476 6449 6412 6418 6483 6564 6611 6640 6700 6798 6889 6941 6971 7008 7041 7055 7068 7113
371 7113 7192 7277 7350 7421 7493 7563 7630 7700 7775 7855 7951 8064 8171 8250 8321 8422 8548 8655 8727 8811 8949 9119 9265 9376 9477 9573 9635 9654 9667 9712
368 9712 9774 9799 9770 9722 9698 9700 9701 9692 9695 9725 9768 9801 9825 9858 9914 9985 10041 10046 10008 9986 10035 10140 10230 10268 10302 10389 10517 10633 10734 10865 11034 11193 11307
364 11307 11411 11557 11755 11981 12222 12478 12738 12977 13192 13413 13672 13979 14315 14659 15003 15346 15679 15972 16189 16306 16303 16173 15932 15631
361 15631 15338 15100 14938 14857 14852 14900 14984 15113 15303 15542 15791 16016 16212 16376 16500 16583 16624 16599 16475 16264 16030 15833 15679 15549 15440 15363
357 15363 15317 15294 15296 15326 15368 15397 15396 15363 15296 15206 15119 15052 15004 14966 14942 14944 14966 14996 15036 15092 15163 15241 15323 15406 15477 15526 15545 15528 15470 15384 15308 15268 15266 15294 15368 15511
353 15511 15718 15965 16232 16507 16757 16942 17043 17076 17071 17052 17031 16996 16927 16820 16709 16631 16587 16552 16524 16531 16585 16658 16710 16707 16633 16481 16271 16038 15803
349 15803 15559 15305 15055 14820 14596 14380 14187 14029 13897 13772 13657 13562 13483 13399 13302 13218 13170 13154 13136 13097 13053 13032 13027 13009 12972 12936 12910 12866 12786
346 12786 12697 12640 12614 12585 12544 12521 12539 12589 12649 12708 12760 12801 12843 12911 13003 13095 13173 13249 13328 13379 13379 13341 13298 13261 13211 13129 13017 12876 12713 12540 12371 12209
342 12209 12041 11867 11699 11559 11454 11376 11295 11185 11055 10947 10896 10887 10871 10823 10760 10710 10673 10624 10546 10440 10313 10177 10048 9945 9867 9798 9724 9661
339 9661 9633 9652 9712 9807 9923 10024 10071 10057 9999 9895 9721 9480 9226 9010 8824 8642 8475 8347 8238 8105 7950 7825 7762 7725 7672 7605 7549
335 7549 7512 7487 7469 7458 7452 7462 7501 7550 7563 7529 7493 7500 7535 7559 7576 7616 7670 7693 7668 7628 7608 7605 7594 7562 7519 7482 7464 7468 7478 7482 7476 7469 7465 7465 7477 7507 7542 7555 7523
330 7523 7446 7342 7232 7120 6998 6868 6756 6691 6662 6621 6545 6460 6403 6377 6362 6348 6338 6332 6327 6332 6346 6338 6287 6215 6170 6162 6167 6160 6132 6081 6011 5951 5925 5924 5923 5919 5911
326 5911 5863 5739 5574 5461 5431 5421 5361 5259 5167 5108 5068 5031 4987 4918 4822 4729 4670 4637 4608 4583 4572 4557 4510 4433 4365 4326 4304 4281 4260 4249 4248 4249 4247 4242 4235
322 4235 4227 4209 4175 4143 4148 4198 4258 4292 4306 4330 4373 4412 4435 4452 4465 4455 4403 4332 4285 4291 4325 4332 4280 4201 4159 4170 4179 4132 4044 3974 3950 3949 3944 3923 3885 3824 3752 3691
317 3691 3651 3624 3606 3600 3598 3586 3569 3568 3585 3600 3608 3621 3632 3616 3578 3564 3592 3610 3566 3489 3452 3469 3483 3455 3400 3351 3315 3289 3276 3272 3253 3212 3179 3182 3216 3253 3276 3282
312 3282 3273 3262 3267 3291 3302 3271 3215 3180 3188 3214 3219 3190 3147 3121 3123 3138 3146 3142 3148 3171 3189 3178 3142 3108 3084 3062 3038 3016 2990 2952 2925 2945 3001 3034 3005 2946 2910 2902 2894 2876
308 2876 2867 2873 2873 2855 2832 2816 2803 2782 2760 2741 2721 2699 2685 2687 2696 2705 2717 2731 2738 2726 2698 2665 2632 2599 2574 2561 2565 2591 2643 2707 2747 2737 2689 2642 2622 2617 2603 2575 2551
303 2551 2554 2583 2615 2619 2590 2546 2510 2488 2476 2471 2471 2475 2485 2505 2535 2554 2543 2505 2464 2440 2432 2433 2440 2448 2449 2441 2434 2437 2441 2427 2394 2363 2344 2327 2300 2272 2260 2264 2268 2264 2258 2260 2258 2243 2216
297 2216 2196 2202 2240 2294 2327 2312 2266 2238 2252 2278 2277 2251 2228 2211 2187 2166 2177 2214 2229 2208 2192 2215 2252 2257 2222 2181 2152 2131 2124 2138 2164 2171 2150 2125 2114 2114 2110 2102 2095
292 2095 2093 2090 2084 2080 2089 2115 2146 2149 2115 2071 2049 2040 2017 1977 1951 1956 1972 1974 1968 1971 1985 2001 2003 1975 1904 1810 1747 1753 1803 1839 1832 1810 1815 1861 1930 1995 2037 2056 2053 2035 2005 1977 1966
287 1966 1972 1981 1985 1988 1984 1958 1904 1845 1813 1808 1810 1811 1822 1850 1875 1872 1843 1810 1792 1794 1810 1831 1834 1799 1736 1692 1698 1734 1749 1727 1703 1710 1744 1778 1802 1818 1824 1820 1815 1814 1800 1764 1738
282 1738 1759 1810 1834 1804 1761 1754 1790 1844 1892 1921 1910 1860 1802 1768 1760 1761 1773 1808 1850 1865 1834 1778 1728 1694 1674 1666 1668 1673 1663 1631 1593 1579 1597 1616 1601 1567 1565 1609
277 1609 1649 1629 1561 1512 1525 1586 1649 1678 1665 1628 1603 1612 1645 1666 1649 1595 1531 1498 1515 1552 1547 1483 1420 1420 1467 1496 1487 1490 1545 1620 1660 1639 1570 1487 1443 1478 1568
273 1568 1638 1646 1629 1631 1632 1586 1509 1475 1516 1579 1596 1551 1480 1422 1400 1420 1464 1498 1496 1459 1416 1399 1432 1510 1591 1624 1599 1549 1513 1490 1465 1446 1459 1500 1539 1554 1552
268 1552 1546 1527 1488 1450 1444 1470 1492 1492 1494 1527 1573 1586 1557 1531 1547 1577 1564 1509 1473 1494 1534 1539 1516 1511 1532 1538 1511 1480 1469 1455 1415 1381 1397 1446 1475 1471 1468 1473 1451 1394
263 1394 1353 1364 1401 1429 1460 1507 1523 1459 1362 1338 1405 1460 1419 1326 1289 1338 1407 1432 1412 1388 1385 1401 1417 1416 1398 1384 1392 1405 1400 1383 1380 1400 1410 1390 1366 1384 1444
259 1444 1490 1468 1392 1339 1362 1437 1495 1505 1493 1487 1473 1429 1371 1335 1337 1355 1373 1393 1416 1429 1424 1412 1404 1399 1387 1368 1346 1329 1316 1306 1302 1306 1312 1313 1310 1324 1372 1437 1473 1453
254 1453 1404 1370 1365 1366 1355 1339 1338 1357 1385 1407 1406 1384 1357 1341 1330 1309 1278 1258 1268 1303 1342 1360 1344 1309 1285 1280 1271 1240 1210 1216 1250 1268 1254 1234 1231 1235 1233 1237 1252 1261 1251
249 1251 1237 1235 1231 1211 1191 1200 1228 1248 1256 1271 1297 1316 1322 1315 1287 1236 1195 1207 1267 1316 1319 1289 1245 1185 1122 1099 1132 1170 1170 1156 1184 1248 1287 1272 1246 1251 1279 1301 1309 1309
244 1309 1299 1282 1268 1258 1241 1221 1229 1276 1324 1318 1250 1162 1092 1042 1003 976 971 993 1043 1112 1165 1171 1145 1133 1158 1199 1232 1258 1280 1271 1217 1153 1130 1141 1141 1120 1111 1124
239 1124 1126 1101 1088 1119 1168 1190 1190 1200 1203 1156 1071 1023 1056 1124 1153 1142 1141 1179 1223 1230 1203 1185 1204 1242 1252 1217 1177 1174 1203 1222 1212 1190 1176 1168 1171 1197 1230 1223 1166
235 1166 1117 1127 1161 1152 1106 1091 1137 1189 1198 1175 1150 1127 1101 1085 1090 1093 1076 1051 1046 1058 1065 1063 1075 1115 1177 1236 1257 1220 1149 1097 1090 1098 1091 1081 1095 1120 1131 1138 1171 1216
230 1216 1229 1204 1179 1169 1141 1084 1042 1059 1113 1152 1158 1158 1175 1207 1239 1254 1237 1188 1133 1094 1074 1067 1079 1112 1147 1158 1149 1141 1136 1114 1077 1054 1060 1077 1081 1071 1067 1075 1081 1074 1064
225 1064 1068 1090 1113 1117 1108 1106 1121 1140 1150 1154 1166 1182 1183 1160 1128 1099 1075 1053 1038 1045 1074 1112 1137 1137 1110 1070 1044 1059 1112 1162 1165 1131 1109 1125 1139 1101 1027 983 999
220 999 1039 1056 1048 1038 1026 1008 997 1003 1011 1002 994 1017 1064 1091 1080 1064 1076 1106 1123 1115 1102 1105 1120 1119 1082 1027 1001 1030 1094 1149 1177 1183 1169 1138 1110 1101 1101 1088 1070 1075 1106
215 1106 1122 1100 1065 1056 1070 1077 1054 1016 996 1013 1052 1082 1089 1096 1121 1143 1129 1093 1082 1109 1137 1140 1140 1164 1201 1211 1181 1124 1068 1039 1044 1062 1057 1027 1001 989 972 949 953
210 953 994 1032 1030 1012 1020 1055 1092 1128 1171 1202 1198 1171 1145 1112 1052 989 976 1019 1071 1091 1087 1079 1081 1105 1155 1205 1216 1185 1144 1109 1074 1046 1041 1052 1044 1019 1013 1037 1060 1059
205 1059 1059 1085 1125 1148 1144 1115 1063 1014 1002 1027 1044 1029 1004 995 991 984 989 1007 1003 959 919 930 970 989 980 971 968 965 978 1023 1073 1084 1061 1044 1040 1028 1018 1037 1061 1038 972
200 972 931 952 995 1024 1056 1102 1114 1064 1009 1018 1065 1070 1020 977 977 985 973 971 1014 1071 1084 1045 995 969 962 964 977 1004 1026 1020 990 965 972 1000 1024 1033 1033 1017 971 898 842
195 842 845 896 939 945 939 956 988 1005 999 998 1014 1016 978 918 883 887 908 932 974 1039 1095 1107 1089 1084 1108 1129 1113 1063 1001 943 888 844 830 855 906 953 969 955 942
190 942 955 980 982 953 925 925 944 960 968 974 963 922 875 860 870 856 802 757 772 833 883 905 930 968 981 940 883 875 934 1001 1012 966 915 905 931 944 910 842
186 842 790 785 819 858 887 911 934 948 945 927 903 877 846 811 782 776 806 861 905 918 925 955 992 988 936 888 885 902 892 855 820 798 784 792 841 904 932 916 889
181 889 867 829 776 759 808 884 925 921 906 898 884 865 857 866 882 899 922 945 941 897 826 764 743 768 816 843 830 808 818 861 900 909 895 877 857 830 803 787
176 787 788 807 842 874 872 822 751 706 708 734 740 713 685 696 750 804 826 816 796 779 774 792 829 853 838 808 804 819 810 769 751 796 868 896 856 786 736 724 743
172 743 769 777 753 718 710 745 792 808 782 752 766 833 906 926 887 839 819 805 753 674 629 654 717 766 792 824 873 910 906 870 836 816 797 772 763 793 851
167 851 896 901 874 845 830 825 817 802 793 811 855 892 887 850 815 799 782 755 739 742 741 716 691 695 714 714 703 720 767 800 793 774 780 809 840 863 873 854 808 770 766
162 766 779 781 776 786 801 801 796 807 815 786 732 714 756 802 795 756 743 766 780 752 701 654 618 594 597 632 671 677 649 621 621 646 679 713 747 776 790 797 821 874
157 874 927 945 914 852 780 721 698 728 785 812 789 751 748 783 818 824 801 759 717 708 745 794 806 778 749 746 751 744 733 727 715 696 691 705 714 703 706 748 800 816
152 816 808 821 858 874 854 832 833 824 776 712 682 691 707 711 714 728 740 745 757 790 830 846 829 801 776 740 680 631 643 710 758 738 688 674 696 715 724 750 771
148 771 730 637 585 631 724 783 802 816 822 794 743 717 726 751 783 816 814 755 679 654 673 676 652 667 740 800 781 718 687 696 705 705 725 764 784 769 742 720 696
143 696 661 629 618 632 664 698 717 724 738 763 774 746 696 665 666 677 684 692 708 720 716 704 700 717 751 780 768 702 619 573 575 587 579 563 568 591 611 624 647 685
138 685 713 700 650 606 606 633 637 608 596 639 697 701 657 638 675 714 702 663 656 682 698 687 682 705 736 740 706 656 618 612 634 667 696 719 731 715 671 629 620
133 620 636 650 660 681 708 709 676 636 611 598 590 590 594 583 560 561 608 672 710 720 725 726 710 689 692 719 728 704 681 686 697 679 637 607 606 620 634 638 629 610 603 618
128 618 633 626 623 660 714 710 636 571 585 644 669 652 647 678 705 705 700 710 717 706 702 719 722 682 628 616 650 682 675 640 603 581 585 621 667 677 633 577 566 609 659
123 659 668 629 578 551 564 609 665 708 723 713 705 715 724 705 664 635 627 620 603 607 652 696 683 623 579 582 609 628 642 654 655 647 659 698 726 706 654 612 602 613
118 613 633 650 653 655 682 729 744 697 632 619 654 680 674 676 709 737 719 676 654 660 660 635 614 626 662 682 664 636 642 682 708 686 646 645 682 711 706 692 691 689 677
113 677 673 682 672 628 590 606 652 666 640 624 646 676 677 657 641 635 635 640 649 652 650 653 660 651 624 614 640 672 674 656 652 665 662 624 569 526 517 558 636 697 688 630 611 674
108 674 752 756 685 615 602 628 649 663 686 708 698 648 591 571 592 620 623 602 583 586 605 625 641 650 644 629 627 642 643 592 504 443 454 517 573 594 594 605 640
103 640 690 725 724 697 668 658 669 700 744 776 767 721 676 657 643 615 585 581 596 606 607 612 616 598 569 574 623 676 688 662 633 619 621 639 667 693 701 692 674 654
98 654 643 647 658 654 632 614 613 614 603 599 623 653 652 620 591 584 590 603 625 643 638 615 604 605 583 538 527 584 656 664 608 563 574 603 595 560 544 563 587 594 591 593 591 571
93 571 547 549 591 645 674 668 647 638 649 669 682 677 657 632 603 565 521 499 529 603 673 706 708 705 703 694 687 701 728 739 716 675 640 616 597 583 580 585 597 621 657
88 657 690 701 686 657 623 595 592 629 683 707 671 599 538 507 493 490 511 555 591 591 567 556 566 575 573 580 605 616 582 524 493 508 544 572 593 608 598 556 511
83 511 496 510 536 572 617 644 617 547 497 508 556 590 598 608 633 656 653 623 586 558 544 541 547 558 568 567 557 555 577 606 606 567 536 555 616 665 680 681 694 708
78 708 706 693 680 653 597 539 531 582 633 628 580 551 569 597 598 577 563 560 548 527 523 547 578 591 585 581 586 598 619 645 654 633 602 598 625 647 644 635 648 683 711 715 692
73 692 652 617 610 641 683 697 680 662 672 702 719 702 663 629 620 630 640 637 623 607 600 613 649 688 700 674 634 607 601 610 624 634 633 622 614 610 602 593 601 630 649 629
68 629 580 541 530 535 538 535 525 510 502 515 533 534 520 521 551 589 612 615 599 567 540 549 605 675 718 721 698 667 650 657 668 652 609 576 570 569 555 546 552 546 509 473 474 500
62 500 515 526 560 597 590 546 527 557 594 601 603 626 643 615 565 543 553 556 539 539 583 639 657 622 561 515 511 557 633 705 741 735 706 676 653 631 603 570 541
57 541 526 536 572 611 622 596 564 562 586 603 598 592 595 595 586 583 596 609 614 627 663 698 697 661 624 608 607 603 588 560 525 501 494 491 475 459 472 520 578 624 654 666
52 666 657 638 633 645 649 636 626 629 622 587 552 552 578 587 579 593 642 683 677 648 643 663 666 631 585 563 567 582 600 621 646 668 677 667 638 613 610 617 601 556 522 531 564 573
47 573 551 530 526 526 523 527 542 554 560 573 590 585 551 526 541 584 616 624 619 611 605 617 657 691 673 600 522 487 500 533 559 563 549 536 539 555 570 581 592 604 606 596
42 596 578 551 518 494 496 518 544 571 609 645 653 632 614 620 635 640 639 641 638 615 578 545 528 527 537 550 560 576 604 631 634 614 596 592 603 635 693 746 755 736 750
37 750 811 847 806 728 684 672 631 549 470 426 410 420 467 539 606 662 724 774 769 706 644 629 644 657 668 683 689 679 676 694 703 673 621 583 566 557 559 584 616
32 616 623 606 596 616 657 696 709 687 646 617 608 596 567 543 550 571 573 560 561 576 574 550 541 570 606 606 576 568 611 673 690 642 585 586 633 646 590 526 518 544 546 533
27 533 567 651 704 680 622 590 581 570 562 574 592 599 604 623 639 631 608 597 598 595 588 591 601 604 599 586 558 522 505 519 541 541 529 526 526 511 496 506 528 528 509 506 523 537
22 537 542 557 576 570 545 545 578 593 558 510 502 530 554 552 537 524 525 548 579 588 570 556 568 588 598 618 666 706 686 614 559 560 598 628 626 593 543 506 505 533 560
17 560 568 568 563 546 516 497 515 572 643 684 663 593 533 535 584 610 580 529 509 523 537 528 506 492 498 522 554 577 571 536 497 486 507 534 542 540 549 561 548 513 498
11 498 528 569 574 557 564 600 625 620 610 615 621 614 609 620 627 608 575 561 572 581 575 558 542 531 524 523 534 563 608 647 654 625 580 551 548 564 581 584 574 564 561 557 540 526
6 526 543 585 618 613 580 541 509 492 497 516 526 521 522 543 578 614 646 660 638 599 592 625 645 609 547 518 521 512 490 488 508 502 449 386 352 345 351 386 464 554 605 607
1 607 593 594 613 638 659 671 667 640 594 546 528 557 611 643 631 600 581 573 553 520 502 517 550 562 541 505 480 470 462 456 463 492 528 553 563 568 576 587 595 588 562
-4 562 539 548 588 615 601 566 548 551 555 546 530 506 484 488 530 577 593 584 591 616 620 596 583 601 622 607 566 530 513 513 529 561 593 612 620 614 582 529 479 440 408
-9 408 393 419 476 508 487 457 478 548 615 642 628 595 575 596 645 675 663 637 621 594 538 492 492 511 499 465 464 500 524 521 529 566 598 592 564 542 528 514
-14 514 500 482 462 463 508 569 589 565 550 574 596 581 554 559 587 605 616 638 653 636 597 571 567 572 587 613 619 577 514 493 522 542 521 504 538 599 623 595
-18 595 558 545 542 521 490 480 510 566 616 646 661 677 700 719 713 678 637 617 622 630 631 631 627 598 540 493 504 561 601 590 545 493 443 412 429 492 547 552 524
-23 524 497 469 429 405 435 499 541 548 568 625 682 692 656 609 574 558 565 584 594 588 586 600 612 605 590 589 596 595 590 603 633 654 655 657 671 673 639 588 573 612 666
-28 666 688 670 637 599 548 499 485 511 535 522 499 515 570 609 597 550 500 451 408 393 420 469 503 512 509 512 534 577 623 637 601 543 505 496 499 511 539 568
-33 568 567 535 512 517 527 519 516 542 573 566 531 515 534 548 535 522 533 547 537 525 548 597 620 599 563 539 527 527 555 604 634 613 557 513 506 527 552 563 553
-38 553 539 542 556 540 484 436 452 522 576 574 546 542 571 600 606 593 579 575 574 563 539 519 517 525 528 526 531 553 590 630 638 586 489 420 436 507 548 518 456 414 403
-43 403 421 476 557 622 638 621 604 586 552 513 493 491 488 489 514 559 593 601 595 589 582 581 599 638 671 673 640 586 527 480 460 468 492 523 556 576 561 515 475 479 529
-48 529 586 607 582 538 512 517 536 548 550 549 538 508 481 490 538 576 564 522 510 555 614 624 568 498 466 474 482 470 462 481 510 524 531 549 565 545 502 483 502
-52 502 514 493 473 500 554 585 578 568 564 535 471 419 425 475 511 508 491 494 520 551 573 580 567 539 509 491 484 475 470 486 522 548 540 521 532 574 604 590 551 530
-57 530 540 558 561 548 530 521 525 536 544 544 547 563 575 561 528 509 523 553 571 575 580 585 572 540 523 537 554 534 484 456 479 525 557 573 591 604 599 593 616 658 678
-62 678 667 658 665 653 604 553 534 523 491 461 479 530 551 522 488 487 511 539 565 581 567 536 527 544 542 499 457 461 494 514 519 536 561 568 558 558 570 575 573 583 605
-67 605 624 642 671 697 691 659 638 636 621 587 566 569 562 525 497 517 561 581 575 575 587 589 578 571 569 551 518 492 492 511 539 565 570 549 533 553 590 589 533 471 458
-72 458 489 521 525 513 508 523 552 571 566 548 538 534 516 486 475 492 514 519 523 543 564 566 552 547 555 570 582 578 537 473 439 477 551 588 565 521 491 476 480 521 585
-77 585 617 585 529 509 526 529 488 429 394 398 429 475 526 567 573 533 470 430 443 487 515 505 478 464 460 447 435 450 495 531 529 499 476 474 480 480 481 491 502 503
-82 503 495 483 473 471 493 539 579 573 529 500 529 592 635 638 621 605 588 569 566 589 626 653 654 623 573 537 543 579 604 597 578 577 589 593 577 547 511 483 481 511 550
-87 550 570 565 549 536 534 547 570 581 572 558 560 575 593 622 666 687 646 564 512 516 525 492 438 417 441 475 490 493 496 508 536 576 605 605 588 586 596 586 544 504
-92 504 498 523 545 542 514 478 452 456 488 524 544 546 542 545 560 586 617 639 649 658 675 681 655 611 583 575 560 523 484 475 490 507 519 537 563 583 585 566 525 465 421
-97 421 424 461 476 445 411 424 476 518 532 544 563 563 534 511 531 576 591 557 504 470 459 460 464 472 485 505 529 546 545 534 524 510 477 428 394 395 410 409 389
-102 389 384 414 465 506 518 508 492 482 475 465 459 476 518 554 551 522 519 566 630 669 683 696 704 676 623 595 611 624 591 553 571 632 651 605 563 586 627 601
-106 601 513 448 454 494 518 526 533 529 502 477 486 517 536 529 510 495 493 514 557 593 598 579 559 536 500 472 482 513 519 502 508 551 579 560 529 525 524 490 448 452 495
-112 495 515 488 450 435 439 457 496 544 569 563 555 556 542 502 483 521 589 624 600 544 492 475 500 538 534 479 426 422 440 428 392 381 400 414 417 448 512 562
-116 562 566 550 544 535 516 515 549 582 579 564 578 603 585 526 481 479 485 465 437 435 456 478 501 533 570 594 603 602 599 605 630 671 696 676 617 557 526 523 536 553 565
-121 565 563 543 514 497 511 552 587 580 544 529 560 598 591 548 523 541 567 573 566 561 542 507 493 534 603 639 618 572 529 476 408 358 358 393 419 418 415 440 491
-126 491 539 558 546 526 510 489 453 429 456 524 565 527 444 402 441 523 589 622 637 648 646 617 562 503 473 491 545 598 619 596 543 483 442 438 471 518
-130 518 553 566 577 602 625 609 551 511 547 634 684 654 592 561 553 525 482 464 476 480 458 440 449 466 462 446 443 458 476 480 466 447 451 495 561 610 627 625 611
-135 611 582 553 552 571 564 507 444 431 464 499 511 506 493 477 468 458 432 399 404 464 528 533 490 461 476 505 527 548 565 556 531 530 571 616 632 623 606 575 533
-140 533 510 528 562 572 562 558 561 545 500 452 425 426 442 455 452 435 427 440 456 454 452 477 518 531 506 489 524 590 630 614 566 522 498 487 481 471 462 469 507 559
-145 559 587 572 536 512 506 507 524 580 652 676 623 548 527 563 598 600 596 604 594 532 454 429 482 558 597 592 582 586 588 570 538 513 506 508 505 485 448 414 416 457 493
-150 493 476 431 424 478 542 568 571 579 573 538 510 531 569 554 491 455 472 494 492 494 515 514 481 476 526 554 484 372 340 402 460 456 440 463 504 521 522 525 519 498
-155 498 491 526 572 577 542 508 500 505 510 522 549 578 590 582 561 541 528 518 501 483 479 488 494 495 517 568 610 595 532 485 492 523 532 509 479 457 439 431 443 472 492
-160 492 489 477 473 471 466 472 505 541 538 488 427 390 384 410 471 554 617 629 599 559 522 487 459 447 458 491 535 565 549 501 471 486 515 522 522 549 587 591 554 507
-165 507 466 426 402 420 458 463 431 418 452 490 490 470 471 492 510 524 533 517 482 475 525 591 611 584 553 532 506 477 469 488 512 532 540 520 472 441 469 526
-169 526 545 520 504 512 504 469 456 484 500 460 413 424 472 486 453 426 430 435 427 433 461 475 442 391 369 379 394 409 442 489 520 521 515 520 530 528 526 539 556 545
-174 545 496 443 432 470 529 578 606 612 592 549 502 483 502 537 555 549 543 554 572 575 561 551 555 568 575 571 545 501 465 470 511 542 539 522 517 513 493 479 509 568
-179 568 599 583 560 561 565 542 501 470 458 459 465 467 450 423 419 447 471 454 419 418 460 498 499 477 455 432 401 377 374 386 400 416 443 471 478 462 438 421 414 416 428
-184 428 445 451 444 438 448 467 479 480 480 480 464 433 410 419 461 517 568 596 574 496 403 358 381 436 480 502 502 480 446 435 465 503 505 484 485 519 541 522 492 497
-189 497 541 590 614 604 571 533 518 533 554 556 543 532 527 520 516 520 518 488 441 411 408 405 385 371 387 412 412 385 368 391 446 502 528 508 460 424 437 486 523
-194 523 513 470 436 441 478 513 516 493 481 502 534 535 496 452 437 452 488 535 578 592 568 533 529 563 611 640 641 627 608 584 549 518 521 566 607 585 502 426
-198 426 419 474 536 561 546 514 492 495 518 542 552 554 556 548 526 503 494 501 522 557 589 593 573 565 586 602 587 566 574 593 582 552 547 566 569 548 539 546 536 511 520 573
-203 573 601 549 465 434 469 515 536 543 551 559 569 586 602 593 556 500 436 390 398 463 527 532 493 472 489 503 483 459 468 497 509 496 478 469 459 445 440 461 497
-208 497 512 482 430 403 423 462 479 468 448 431 420 415 418 419 415 419 441 462 462 458 477 508 518 502 495 515 537 540 536 544 559 572 586 597 585 537 479 446 447 465 486
-213 486 503 511 509 509 524 553 584 607 614 595 556 521 509 513 519 519 518 510 488 457 433 428 442 470 505 536 548 540 528 529 541 546 527 495 475 478 491 506 534 577 603 581
-218 581 528 499 521 564 583 571 546 523 498 470 453 463 501 546 568 559 546 550 556 543 526 532 549 544 526 536 576 591 553 501 481 483 481 479 490 492 472 467 510 559
-223 559 544 476 435 463 521 551 548 535 528 536 565 593 583 536 508 540 597 609 552 477 438 440 449 450 460 492 523 524 500 491 511 532 530 515 509 506 494 485 492 497 485 474
-228 474 486 501 489 464 458 462 446 430 461 518 524 456 386 377 402 412 416 449 493 504 480 458 453 450 453 482 532 575 595 601 603 601 589 565 528 496 502 544 573 553 514
-233 514 508 528 528 499 481 494 501 474 436 433 471 516 540 549 565 596 615 590 528 477 471 491 504 508 516 521 512 514 550 586 568 513 492 524 547 516 473 466 482 480 467
-238 467 478 508 525 526 529 535 534 542 575 598 572 516 499 534 549 484 378 322 358 444 507 513 484 465 474 482 455 406 380 398 431 442 437 443 474 512 527 502 453
-243 453 423 441 484 502 489 494 543 588 578 536 527 562 586 574 566 595 624 602 545 512 521 529 494 436 405 430 488 526 512 462 425 426 448 463 474 494 508 483
-248 483 427 388 391 407 405 408 460 553 632 650 611 542 473 431 433 470 502 502 477 455 451 457 461 459 461 485 527 554 530 463 411 416 453 465 439 422 447 483 479 431 382
-253 382 364 368 379 404 443 469 460 436 438 467 485 469 439 423 425 438 460 484 492 477 456 443 433 422 431 474 521 528 488 442 422 429 454 492 532 547 525 479 437
-258 437 410 398 396 401 410 418 416 399 381 385 413 439 451 470 509 541 530 498 494 512 507 474 464 496 517 485 435 420 425 409 377 373 408 448 471 480 479 465 448 439 433 422
-263 422 418 435 451 440 421 424 438 424 394 401 455 499 487 444 417 417 436 468 495 489 449 416 418 431 427 416 412 400 373 364 404 456 465 440 439 477 511 507 480 463 462
-268 462 472 489 497 485 465 467 492 517 540 577 617 612 558 515 533 570 549 463 389 385 429 466 472 454 418 367 328 336 390 444 459 443 436 449 458 445 430 437 461
-273 461 481 500 534 569 559 486 396 350 364 399 422 439 479 538 587 598 577 551 537 536 544 556 551 515 463 442 480 550 594 585 546 514 506 518 530 522 493 465
-277 465 460 467 465 461 471 477 437 352 281 270 295 303 287 275 284 317 376 450 502 505 479 465 460 434 393 383 417 446 428 387 375 403 432 435 420 412 422 440 452 458 461
-282 461 462 455 451 470 513 535 499 434 410 450 502 518 512 519 537 532 505 482 464 428 374 341 360 406 435 432 423 435 462 481 487 505 555 615 637 603 552 525 520 509
-287 509 486 462 439 405 367 350 362 379 385 389 395 389 366 355 386 446 492 506 508 513 511 495 488 507 526 497 422 360 364 415 453 449 435 445 481 519 545 553 541 510
-292 510 480 472 476 468 442 421 417 423 433 456 488 502 488 473 487 518 521 484 445 441 467 501 538 585 628 636 595 530 478 452 447 449 446 432 413 403 407 416 426 445 472
-297 472 482 459 434 459 527 575 560 519 500 493 453 388 359 386 415 395 348 330 364 422 472 497 491 459 417 373 334 317 350 420 471 469 456 489 549 567
-301 567 522 470 453 455 450 443 448 450 438 437 472 516 522 485 449 446 471 500 517 517 511 523 559 585 569 521 479 452 422 402 430 498 535 498 431 396 390 374 354 373
-306 373 424 445 410 373 383 415 415 387 377 394 403 386 376 403 446 467 457 444 455 483 504 505 495 490 493 500 507 521 538 539 510 466 434 414 391 374 402 489 587
-311 587 639 634 600 552 487 424 400 419 434 413 380 382 416 437 427 418 436 457 446 417 416 454 490 488 463 443 431 420 429 476 535 557 536 525 548 561 515 428
-316 428 368 366 399 443 492 533 543 525 516 527 526 488 443 437 453 438 379 325 325 367 413 441 450 444 436 447 472 477 446 412 415 442 450 440 453 487 486 435 401 440 509
-321 509 528 495 479 507 531 517 490 481 469 434 402 405 429 446 465 507 550 556 530 517 533 561 582 596 588 545 489 466 475 469 428 392 397 425 454 491 540 570
-325 570 550 503 479 488 504 505 491 469 449 457 496 526 503 439 397 410 462 517 553 557 530 493 477 478 472 460 471 510 538 532 514 510 513 503 493 495 490 451 399 373
-330 373 380 385 377 382 415 453 471 477 494 522 548 568 588 610 623 619 603 577 538 479 412 370 390 454 493 452 366 325 363 424 448 445 455 467 442 387 356 369
-335 369 398 429 476 530 538 481 415 407 448 476 476 479 495 485 438 395 398 429 446 440 439 457 474 472 465 486 540 596 611 583 546 535 541 538 517 487 449 408 381 388 408
-340 408 406 389 396 433 452 427 402 426 478 504 501 509 536 541 515 508 554 617 636 613 593 599 601 566 510 467 452 447 439 430 432 439 442 440 438 429 408 395 412 452 477 473 476 514
-345 514 561 575 556 545 558 566 549 520 504 500 496 488 480 478 486 497 496 471 435 422 445 480 488 447 373 311 312 381 461 493 481 479 513 553 565 552 530 496 457 440
-350 440 461 494 498 473 451 446 443 428 410 409 431 458 464 436 393 369 372 374 357 342 356 397 437 462 477 491 499 494 475 455 456 491 537 552 527 496 482 472 455 457
-355 457 502 564 597 605 617 626 594 528 481 475 472 435 383 357 368 396 427 455 470 464 450 443 443 438 427 417 416 429 450 457 436 402 393 427 482 527 549 551 535 504 468
-360 468 439 430 448 483 506 500 487 494 506 483 432 411 439 467 457 447 481 534 538 488 438 425 436 449 463 484 507 535 560 560 518 467 463 507 538 514 454 401
-365 401 378 392 440 493 506 472 440 448 471 469 447 436 442 451 458 463 450 413 384 399 439 456 448 447 456 441 401 385 414 446 448 448 487 544 567 544 509 484 468 466 475
-370 475 463 403 327 301 336 387 421 458 507 532 509 472 469 497 524 544 562 564 528 470 428 412 400 374 347 336 345 368 386 378 349 342 380 425 427 411 446 533
-374 533 590 566 506 472 458 430 395 390 410 424 428 446 479 499 505 518 536 528 493 469 479 497 489 467 460 466 464 447 434 439 452 460 466 483 508 519 490 434 404 439
-379 439 513 562 567 565 571 549 468 374 335 360 398 421 449 484 488 446 410 431 483 487 416 333 310 351 404 427 428 438 469 494 483 440 410 425 458 456 412 375
-384 375 382 412 421 412 419 452 480 479 461 445 429 412 408 419 427 418 410 425 452 468 470 478 498 509 502 492 494 497 478 441 416 416 417 385 329 307 366 477 560 571 543 532
-389 532 542 543 525 509 505 504 502 506 514 508 488 473 466 460 456 473 504 514 497 492 523 552 528 462 416 420 449 465 465 461 467 487 519 535 510 459 430 447 481 488 456 412 387
-394 387 398 433 455 441 417 428 472 497 484 469 474 466 423 398 447 530 557 516 485 506 534 526 503 495 473 406 335 327 382 442 477 500 521 521 503 490 491 492 493
-399 493 510 538 537 493 432 390 374 382 411 444 443 401 360 363 400 440 473 505 527 518 480 436 401 378 366 371 390 416 441 454 444 424 422 440 447 425 400 402 412
-404 412 396 361 344 362 399 441 492 535 547 531 518 522 524 509 482 458 445 448 458 458 444 433 434 429 407 392 404 413 387 355 375 434 464 452 460 520 572 566 530
-409 530 519 524 512 496 505 517 493 446 429 455 487 499 501 503 503 502 501 493 474 468 495 537 564 574 586 589 559 514 492 505 530 557 581 569 489 384 346 403 483
-413 483 503 468 439 444 456 450 425 403 402 415 421 409 405 435 487 518 518 511 503 476 442 442 478 495 463 434 466 532 565 548 516 480 420 345 306 333 391 427 425 411
-418 411 415 438 456 452 439 444 462 463 440 431 456 475 445 389 367 380 388 385 409 463 487 454 414 418 445 443 417 407 414 411 405 428 464 458 399 344 342 370 389 407 449 492
-423 492 491 449 417 426 452 463 460 457 458 462 471 483 490 485 468 433 381 340 351 416 489 525 520 496 463 425 398 396 413 428 432 428 419 411 412 414 405 400 440 528 598 595 552 550 595
-429 595 613 565 495 454 434 404 371 363 378 398 425 472 525 545 520 475 447 455 488 520 526 507 485 469 448 416 394 391 388 369 350 350 364 381 408 449 482 485
-434 485 476 484 504 505 483 460 449 440 431 430 438 452 484 543 602 616 579 526 486 454 425 412 421 433 429 412 393 379 374 377 381 382 401 451 495 487 451 466 554 631 618 547
-439 547 501 499 492 463 448 460 464 441 423 438 463 461 447 452 467 458 435 443 496 552 573 564 547 522 488 469 481 496 474 421 384 383 390 382 369 367 373 382 407 443 461 447
-444 447 424 411 398 381 387 426 455 428 376 360 381 392 387 418 494 549 533 483 456 452 443 429 426 431 429 428 448 477 495 502 510 511 491 462 451 464 481 487 485 481 470 448
-449 448 411 356 306 300 348 404 422 417 431 455 440 391 367 402 448 454 434 428 434 416 381 376 411 437 415 376 375 409 429 423 429 469 500 482 443 444 481 489 435 367
-454 367 346 366 385 396 418 444 446 422 404 417 445 455 433 393 373 405 474 517 495 435 398 402 424 461 527 602 630 585 510 456 436 439 465 506 519 478
-458 478 417 390 410 441 447 424 388 363 373 415 452 457 450 466 495 496 467 446 450 453 437 424 436 455 447 412 377 359 359 383 434 483 492 458 422 414 430 457 490 519
-463 519 523 503 499 529 561 553 518 499 492 455 390 358 396 459 484 470 458 451 428 397 397 431 462 460 441 432 432 431 432 444 465 486 496 484 455 434 443 459 440 384 341
-468 341 339 340 305 261 260 303 336 341 354 402 450 452 415 381 374 384 398 421 441 435 394 350 338 355 368 365 366 391 420 422 390 346 316 311 337 391 447 477 479 484 521
-473 521 568 579 533 462 415 411 423 420 403 393 398 403 399 396 402 411 419 429 437 436 431 439 459 463 443 431 455 487 485 461 455 471 465 426 393 389 396 404 433 488 525 507 462 443 464
-479 464 500 534 561 562 517 437 361 324 331 374 424 449 440 429 446 474 470 437 426 468 531 561 546 524 525 531 506 456 427 442 464 451 423 429 461 462 424 411 454
-483 454 497 481 436 422 439 442 427 420 418 392 362 381 439 464 417 355 350 411 484 523 517 499 511 558 584 536 443 391 416 472 506 509 497 481 475 490 508 506 499
-488 499 519 553 550 513 495 509 494 427 381 411 467 470 434 427 448 444 409 398 429 452 428 382 355 365 406 456 473 438 399 420 490 530 503 454 436 441 437 430
-493 430 445 475 491 486 474 462 453 459 483 506 502 474 451 450 462 476 490 503 511 514 518 528 530 510 476 459 475 504 515 506 494 485 464 435 427 447 458 431 387 357 336
-498 336 310 302 343 415 461 464 463 475 475 451 438 466 503 498 449 401 387 405 440 474 494 499 497 493 474 440 416 433 485 535 556 545 516 477 441 416 409 410 405 390
-503 390 383 401 437 456 437 403 391 406 421 422 417 411 397 382 383 397 397 384 388 421 452 458 456 470 485 475 456 455 466 470 476 499 514 482 416 376 387 406 396 370 363
-508 363 377 388 387 384 392 419 454 474 461 433 429 462 506 536 547 540 502 440 394 396 431 450 441 430 443 468 481 478 477 492 510 512 495 486 508 551 582 581 553 512 464
-513 464 415 379 363 359 353 344 335 328 335 373 435 481 471 415 361 335 323 313 323 369 422 438 418 407 427 442 413 361 342 377 425 452 467 495 530 554 566 576
-517 576 572 539 495 474 478 474 449 434 454 482 483 470 487 541 588 587 545 496 466 467 503 558 597 593 562 541 548 557 537 493 463 468 492 501 481 448 424 417 421 420 409 402
-523 402 425 476 521 521 480 438 422 428 435 435 431 423 419 435 470 502 508 486 443 382 325 315 370 448 492 494 492 500 490 449 410 406 420 419 404 399 410 424 443 478 512 505
-528 505 454 400 385 400 414 421 441 480 519 545 559 564 542 475 388 336 353 421 488 524 530 518 492 456 425 408 407 424 460 502 517 494 455 426 400 364 341
-532 341 365 413 420 363 302 290 308 306 293 314 370 409 409 410 447 486 466 393 331 330 375 420 449 470 492 511 516 502 470 434 424 458 514 540 506 451 433 460
-537 460 475 440 394 391 427 445 425 404 421 455 471 468 478 514 551 556 524 478 445 423 395 364 362 401 443 437 399 394 445 501 511 486 461 438 407 384 389 408
-542 408 421 440 475 492 462 419 420 443 419 349 318 365 429 438 412 409 440 474 496 506 493 455 418 406 399 383 380 411 440 421 376 357 357 326 262 229 259 316
-546 316 362 394 411 389 340 324 371 430 442 422 419 439 448 435 423 419 410 399 408 437 466 485 506 526 521 484 442 424 424 424 416 407 409 430 469 509 523 496 443 398
-551 398 388 422 480 520 508 451 389 351 340 345 362 386 410 424 424 418 413 420 437 444 429 408 401 400 385 368 382 419 424 379 336 355 415 446 434 428 453 461 410 335
-556 335 300 319 347 360 374 405 435 446 453 480 518 531 498 439 387 361 360 377 402 427 445 450 442 430 434 465 507 525 506 477 466 468 462 447 441 448 444 430 434 475
-561 475 522 537 520 497 470 425 378 366 395 424 427 424 432 431 401 372 383 418 419 375 342 375 454 518 536 521 499 480 467 460 453 437 412 394 398 431 479 513 514
-566 514 495 484 489 488 472 460 471 489 488 469 457 462 466 454 434 419 419 441 481 510 502 467 449 461 472 465 471 516 566 568 529 501 498 487 456 440 456 459 414 361 365
-571 365 420 456 439 403 387 383 371 360 373 410 459 506 536 528 491 465 482 518 532 521 510 507 493 464 442 434 416 370 320 302 323 357 380 379 361 347 363
-575 363 412 460 473 454 443 467 513 539 517 465 435 461 518 548 529 499 493 491 458 409 387 397 396 367 346 368 413 435 427 417 413 399 363 318 279 252 244 269
-580 269 320 369 394 401 417 451 488 513 526 528 507 462 418 413 452 504 538 553 553 530 483 439 424 433 444 459 492 517 490 424 386 405 432 414 375 370 403 434
-584 434 451 476 511 529 526 532 550 538 475 406 382 397 414 423 436 443 419 365 323 322 349 376 394 407 415 414 414 428 444 435 394 352 347 376 402 393 363 342 336 327 318 329
-590 329 363 388 390 394 421 447 423 352 297 313 383 443 454 426 399 399 422 444 443 415 374 340 331 353 392 423 423 402 386 391 404 407 407 426 460 476 450 408 397
$$ [...]
-1604C79
##END=	
##END=	
