##TITLE=	xHPh3YuzRpKEGuK0V3hrLw.41.ser
TM-VI-138solid cosy

##JCAMP-DX=	6.0	$$ MestReNova 14.3.0-30573
##DATA TYPE=	LINK
##BLOCK_ID=	1
##BLOCKS=	2    
##ORIGIN=	Mestrelab Research S.L.
##OWNER=	hrzepa
##$MNOVA/LINK_BLOCK_TYPE=	ITEM	$$ NMR Spectrum
##$MNOVA/ITEM/POLYGON=	(XY..XY)
5321,5835
8722,5835
8722,8208
5321,8208
5321,5835
##$MNOVA/ITEM/Z=	0
##$MNOVA/ITEM/ANGLE=	0
##TITLE=	xHPh3YuzRpKEGuK0V3hrLw.41.ser
##JCAMP-DX=	6.0	$$ MestReNova 14.3.0-30573
##BLOCK_ID=	2
##DATA TYPE=	MNOVA NMR VIEW DATA
##DATA CLASS=	MNOVA VIEW DATA
##$MNOVA/2D/THRESHOLD=	78.384002685546875
##$MNOVA/ITEM/ZOOM/X=	-0.98135677571250334861,	11.004809999983093505
##$MNOVA/ITEM/ZOOM/Y=	-0.98135677571250334861,	11.004809999983093505
##END=	
##TITLE=	xHPh3YuzRpKEGuK0V3hrLw.41.ser
##JCAMP-DX=	6.0	$$ MestReNova 14.3.0-30573
##BLOCK_ID=	3
##DATA TYPE=	nD NMR SPECTRUM
##DATA CLASS=	NTUPLES
##NUMDIM=	2
##ORIGIN=	Bruker BioSpin GmbH
##OWNER=	nmr
##.OBSERVE FREQUENCY=	400.32200160000002143
##.OBSERVE NUCLEUS=	^1H
##.SOLVENT NAME=	CDCl3
##.PULSE SEQUENCE=	cosygpqf
##LONGDATE=	2021/10/27 13:28:53.000
##.ACQUISITIONMODE=	SIMULTANEOUS (DQD)
##$ORIGINAL FORMAT=	Bruker XWIN-NMR
##$MNOVA/SCALES_VERSION=	9
##$PARAMETER FILE=	(acqu2s, ASCII, /private/var/folders/f6/rjf_tdyn2v98c5c0wvkgn4s80000gn/T/xHPh3YuzRpKEGuK0V3hrLw/41/acqu2s, 0)
$$ ##TITLE= Parameter file, TOPSPIN		Version 3.2
$$ ##JCAMPDX= 5.0
$$ ##DATATYPE= Parameter Values
$$ ##NPOINTS= 129	$$ modification sequence number
$$ ##ORIGIN= Bruker BioSpin GmbH
$$ ##OWNER= nmr
$$ $$ 2021-10-27 13:38:24.801 +0100  nmr@CZC2524DW0
$$ $$ /opt/topspin/data/agmb/nmr/Oct27-2021/41/acqu2s
$$ $$ process /opt/topspin3.2/prog/mod/go
$$ ##$ACQT0= 0
$$ ##$BF1= 400.32
$$ ##$FnMODE= 1
$$ ##$NUC1= <1H>
$$ ##$NusJSP= 0
$$ ##$NusT2= 1
$$ ##$NusTD= 128
$$ ##$O1= 2001.60000002825
$$ ##$SFO1= 400.3220016
$$ ##$SW= 12.009563022959
$$ ##$SW_h= 4807.69230769231
$$ ##$TD= 128
$$ ##END=
$$ 
##$PARAMETER FILE=	(acqus, ASCII, /private/var/folders/f6/rjf_tdyn2v98c5c0wvkgn4s80000gn/T/xHPh3YuzRpKEGuK0V3hrLw/41/acqus, 0)
$$ ##TITLE= Parameter file, TOPSPIN		Version 3.2
$$ ##JCAMPDX= 5.0
$$ ##DATATYPE= Parameter Values
$$ ##NPOINTS= 12	$$ modification sequence number
$$ ##ORIGIN= Bruker BioSpin GmbH
$$ ##OWNER= nmr
$$ $$ 2021-10-27 13:38:27.892 +0100  nmr@CZC2524DW0
$$ $$ /opt/topspin/data/agmb/nmr/Oct27-2021/41/acqus
$$ $$ process /opt/topspin3.2/prog/mod/shimcntl
$$ ##$ACQT0= 1000000
$$ ##$AMP= (0..31)
$$ 100 100 100 100 100 100 100 100 100 100 100 100 100 100 100 100 100 100
$$ 100 100 100 100 100 100 100 100 100 100 100 100 100 100
$$ ##$AMPCOIL= (0..19)
$$ 0 0 0 0 0 0 0 0 0 0 0 0 0 0 0 0 0 0 0 0
$$ ##$ANAVPT= -1
$$ ##$AQSEQ= 0
$$ ##$AQ_mod= 3
$$ ##$AUNM= <au_zg>
$$ ##$AUTOPOS= <54 >
$$ ##$BF1= 400.32
$$ ##$BF2= 400.32
$$ ##$BF3= 400.32
$$ ##$BF4= 400.32
$$ ##$BF5= 400.32
$$ ##$BF6= 400.32
$$ ##$BF7= 400.32
$$ ##$BF8= 400.32
$$ ##$BYTORDA= 0
$$ ##$CAGPARS= (0..11)
$$ 0 0 0 0 0 0 0 0 0 0 0 0
$$ ##$CFDGTYP= 0
$$ ##$CFRGTYP= 9
$$ ##$CHEMSTR= <none>
$$ ##$CNST= (0..63)
$$ [...]
$$ 0 0 0 0
$$ ##$ShimPowMaxUC= (0..63)
$$ 130000 130000 130000 130000 130000 130000 130000 130000 130000 130000 130000
$$ 130000 130000 130000 130000 130000 130000 130000 130000 130000 0 0 0 0
$$ 0 0 0 0 0 0 0 0 0 0 0 0 0 0 0 0 0 0 0 0 0 0 0 0 0 0 0 0 0 0 0 0 0 0 0 0
$$ 0 0 0 0
$$ ##$ShimPowMaxUG= (0..63)
$$ 524287 524287 524287 524287 524287 524287 524287 524287 524287 524287 524287
$$ 524287 524287 524287 524287 524287 524287 524287 524287 524287 0 0 0 0
$$ 0 0 0 0 0 0 0 0 0 0 0 0 0 0 0 0 0 0 0 0 0 0 0 0 0 0 0 0 0 0 0 0 0 0 0 0
$$ 0 0 0 0
$$ ##$ShimPowRcbType= 3
$$ ##$ShimPowRes= (0..63)
$$ 1e-20 1e-20 1e-20 1e-20 1e-20 1e-20 1e-20 1e-20 1e-20 1e-20 1e-20 1e-20
$$ 1e-20 1e-20 1e-20 1e-20 1e-20 1e-20 1e-20 1e-20 0 0 0 0 0 0 0 0 0 0 0 0
$$ 0 0 0 0 0 0 0 0 0 0 0 0 0 0 0 0 0 0 0 0 0 0 0 0 0 0 0 0 0 0 0 0
$$ ##$ShimPowRng0= (0..63)
$$ 1 1 1 1 1 1 1 1 1 1 1 1 1 1 1 1 1 1 1 1 0 0 0 0 0 0 0 0 0 0 0 0 0 0 0 0
$$ 0 0 0 0 0 0 0 0 0 0 0 0 0 0 0 0 0 0 0 0 0 0 0 0 0 0 0 0
$$ ##$ShimPowRng1= (0..63)
$$ 1 1 1 1 1 1 1 1 1 1 1 1 1 1 1 1 1 1 1 1 0 0 0 0 0 0 0 0 0 0 0 0 0 0 0 0
$$ 0 0 0 0 0 0 0 0 0 0 0 0 0 0 0 0 0 0 0 0 0 0 0 0 0 0 0 0
$$ ##$ShimPowRng2= (0..63)
$$ 1 1 1 1 1 1 1 1 1 1 1 1 1 1 1 1 1 1 1 1 0 0 0 0 0 0 0 0 0 0 0 0 0 0 0 0
$$ 0 0 0 0 0 0 0 0 0 0 0 0 0 0 0 0 0 0 0 0 0 0 0 0 0 0 0 0
$$ ##$ShimPowRng3= (0..63)
$$ 1 1 1 1 1 1 1 1 1 1 1 1 1 1 1 1 1 1 1 1 0 0 0 0 0 0 0 0 0 0 0 0 0 0 0 0
$$ 0 0 0 0 0 0 0 0 0 0 0 0 0 0 0 0 0 0 0 0 0 0 0 0 0 0 0 0
$$ ##$ShimSysFunc= (0..63)
$$ 1 2 3 4 5 7 9 11 15 16 8 10 12 14 6 17 13 18 19 20 0 0 0 0 0 0 0 0 0 0
$$ 0 0 0 0 0 0 0 0 0 0 0 0 0 0 0 0 0 0 0 0 0 0 0 0 0 0 0 0 0 0 0 0 0 0
$$ ##$ShimSysMatrix= 0
$$ ##$ShimSysType= 1
$$ ##$TFXNUM= 0
$$ ##$TRIPLO2= 0
$$ ##$VTU= 2
$$ ##$VTUETH= <149.236.99.20>
$$ ##$VTUTY= <no>
$$ ##$WBREFAM= (0..15)
$$ 132.2 106.2 100 100 100 100 100 100 100 100 100 100 100 100 100 100
$$ ##$WBREFLM= (0..15)
$$ 0 0 0 0 0 0 0 0 0 0 0 0 0 0 0 0
$$ ##$WBREFPH= (0..15)
$$ 77.55 -65.76 0 0 0 0 0 0 0 0 0 0 0 0 0 0
$$ ##$WBSGU= (0..15)
$$ 0 0 0 0 0 0 0 0 0 0 0 0 0 0 0 0
$$ ##$XFAC= 2
$$ ##END=
$$ 
##$DECIM=	4160
##$DSPFVS=	20
##.ACQUISITIONSCHEME=	NOT PHASESENSITIVE
##NTUPLES=	nD NMR SPECTRUM
##VAR_NAME=	FREQUENCY1,	FREQUENCY2,	SPECTRUM
##SYMBOL=	F1,	F2,	Y
##.NUCLEUS=	1H,	1H
##.OBSERVE FREQUENCY=	400.32200160000002143,	400.32200160000002143
##VAR_TYPE=	INDEPENDENT,	INDEPENDENT,	DEPENDENT
##VAR_FORM=	AFFN,	AFFN,	ASDF
##VAR_DIM=	512,	512,	262144
##UNITS=	HZ,	HZ,	ARBITRARY UNITS
##FIRST=	4405.4455391999963467,	4405.4455391999963467,	0.25985664129257202148
##LAST=	-392.85674445383250486,	-392.85674445383250486,	0.53032803535461425781
##MIN=	-392.85674445383250486,	-392.85674445383250486,	0.00024045386817306280136
##MAX=	4405.4455391999963467,	4405.4455391999963467,	8629.69921875
##FACTOR=	1,	1,	0.0051601129866584403982
##PAGE=	F1=4405.45
##FIRST=	4405.4455391999963467,	4405.4455391999963467,	0.25985664129257202148
##DATA TABLE=	(F2++(Y..Y)), PROFILE
$$ [...]
##PAGE=	F1=-7.86576
##FIRST=	4405.4455391999963467,	4405.4455391999963467,	0.82741051912307739258
##DATA TABLE=	(F2++(Y..Y)), PROFILE
4077F1Ll6K3M8Nm0nJ09j13j0%J14n5J8M3NM4j23m5P3K1R9Or3k3L7j7K0o6O9n6q6J0K1M4J12
$$ 61 64 28 51 99 104 64 59 168 55 45 45 159 104 122 165 170 214 91 46 119 140 239 245 152 129 166 149 169 103 172 116 30 40 61 105 217
3739B17o1j19Q0l0j9m9J2O3OKl1P8q6Ml3L1O1M8lm8m6LL9pL7o8J0L3q2K6J8N2rl4o3nN3o1
$$ 217 156 37 117 87 68 19 31 94 100 102 71 149 63 67 34 65 126 174 171 123 77 80 119 112 149 81 91 124 42 68 86 138 129 95 32 27 80 19
3382A9J18K3q4j9nl6L1j1J06j9o6k3P7j9m6Q5J3Q1n4m8p4ON9q9J33p5n4M8N0KJ9k3l3M6N3
$$ 19 137 160 76 57 52 16 47 36 142 123 57 34 111 92 46 131 144 225 171 123 49 55 114 25 158 83 29 77 127 129 148 125 92 138 191
3053A91m1n8N6nJ06j64O3n9k6mRm3L7J55N3j22J39p6j45J09j20L5L3K4j0l6p2NJ08l1p1J34
$$ 191 150 92 148 143 249 85 148 89 63 59 68 25 62 217 270 148 287 211 66 175 55 90 123 147 137 101 29 34 142 111 40 174
2753A74jr0m8J61j08R0R8Q09k05n40k45J49j24j0K6l6J9L3J3j21kL2nM8Q6p1n6m8N4k6kj9
$$ 174 173 83 35 196 88 178 276 1085 880 340 95 244 120 110 136 100 119 152 165 44 42 74 69 117 203 132 76 28 82 56 54 35
2452C5L3j7Q1j28K6M0L9R7p7j16K4k5P9K0rj1RK1j9J17Qj26P2r2n4K23j54O0N2m0j24P8P4
$$ 35 68 51 132 4 30 70 109 206 129 13 37 12 91 111 102 91 100 121 102 219 227 101 173 81 27 250 96 156 208 168 44 122 196
2142A96p9N7q9K2kK3K9k5J9K64k21j48L67r3L64m9P24Q098l103n520n92P3j55J48L2j29n2
$$ 196 117 174 85 107 105 128 157 132 151 415 194 46 413 320 684 635 1359 9457 6354 834 242 315 160 308 340 211 159
1889A59j08J16M2o9Q2p2o1m8R0m7Q2q6K0j6l6Q0p1O2m5N0o0J7k2k1NmM9l4l1M1P7J7p4l4N5
$$ 159 51 167 209 140 222 150 89 41 131 84 166 80 100 84 48 128 57 119 74 124 64 81 59 38 43 39 88 54 23 64 141 158 84 50 105
1560A05Q3j11mM9P2J46j75J285l96m75n36J29j22J55N1r8r4N7o3J1M0L1o9l0Q4j9R1r4o8P2
$$ 105 188 77 73 122 194 340 165 1450 1054 579 43 172 50 205 256 158 64 121 58 69 109 140 71 41 125 106 197 103 35 107
1279A07K3J4k7N3N5o6q4%pO3n0l6L5m8JJ35M3j08n9J73k2p9l4ok5O3Q8Qj23L0j4j4qP2j40
$$ 107 130 144 117 170 225 159 75 75 68 131 81 45 80 32 33 168 211 103 44 217 195 116 82 76 51 114 202 210 87 117 103 89 81 153 13
950A3J45j20R0%o8RR5L5j35PoQ3p2PoKqK0O3Kj40J73pp2Qr9J04m4rN2m7k2M7pj5k2j7R0o4
$$ 13 158 38 128 128 60 69 164 199 64 71 65 148 76 83 77 79 71 91 154 156 16 189 182 110 118 19 123 79 70 122 75 53 100 93 78 56 39 129 65
584F5m9O8mP6q9J83o0j82R3m2O4m6L5J69j4k32M1N3Lk8o1k0K00J69j44j24q2Kk3N2P1r1%K7
$$ 65 16 84 80 156 67 250 190 8 101 59 123 77 112 281 267 35 76 129 132 104 43 23 223 392 248 124 42 44 21 73 144 53 53 80
264H0m8pJ15L6j14j7K3P6j6j3nl5n6N7K5o9K1k1M7pk4j2Q5j3mM6RL6l9l4N%J01m0j73R6LN4
$$ 80 32 25 140 176 62 45 68 144 128 115 110 75 19 76 101 32 53 32 79 72 48 36 121 108 104 150 159 195 156 122 127 127 228 188 15 111 114 168
-92A68j07J48j74Q9m5L9pq0Q2K8k7K9n5N3j10K0P6K3j0j22P7j4nn7J04m5M7L6j19N0O5k7
$$ 168 61 209 35 124 79 118 111 31 113 141 114 143 88 141 31 51 127 150 140 18 95 81 76 19 123 78 125 161 42 92 157 130
-393A30
##PAGE=	F1=-26.6458
##FIRST=	4405.4455391999963467,	4405.4455391999963467,	0.75750046968460083008
##DATA TABLE=	(F2++(Y..Y)), PROFILE
4405A49m8lj5m1M9K3q2MJ51N1j36o4O6Ml6J17p4j1j4J4l5Q7LJ6M9n7q1J5on5N5J56m6j51K4
$$ 149 101 98 83 42 91 114 32 36 187 238 102 38 104 108 72 189 115 104 90 104 69 156 159 175 224 167 86 101 95 40 95 251 205 54 78
4077G8lm6M0MQj9k2J65j31l6J4P8n6J5N4K9K9j17n3P8K1R5J4j11k5O4j1J3n6O0o5p5%M6L2
$$ 78 75 29 69 73 81 62 40 205 74 38 52 130 74 89 143 172 201 84 31 109 130 225 239 128 103 167 156 169 113 173 108 33 33 79 111
3748A11J08j27jN0k1j7o6L6M3p9L5j4P0r4L5j8j8R8O6j4o3n7j4Q5k6L8l0J5J7r8K4JN6j0l5
$$ 111 219 92 91 141 120 103 37 73 116 37 72 58 128 34 69 51 33 131 197 183 120 63 49 134 108 146 116 131 148 50 74 75 131 121 86
3419H6m6OP1o9Q6O3p3p9N3m4J8qO6m0on9R2m7j5Q9kR5o8n2r4J3P0o6P4n2m0M1R3j6k4k0J4
$$ 86 40 46 117 48 134 197 124 45 98 54 72 64 130 90 84 25 117 70 55 144 142 237 169 117 23 36 106 40 114 62 22 63 156 140 116 96 110
3072A10LO0l8k9J28q0R4j76N1m8Lm3JJ9j7K15Q2J77K0l74r2O9n3j5P6kj3k8o1l0J03k5l1J26
$$ 110 113 173 135 106 234 154 248 72 123 75 78 35 36 55 38 253 335 512 532 158 66 135 82 67 143 141 128 100 39 9 112 87 56 182
2753A82Lj21lJ42j58Q8M3Q76o7l64n33J70j48J3L4m7K6P6m5j05m8P9j0J2J11q4m2k5M2m5J6
$$ 182 185 64 61 203 45 133 176 1052 985 621 88 258 110 123 157 110 136 212 167 62 14 93 83 95 206 122 80 55 97 52 68
2462F8l4L9KP2j20kL9K6J00p0j01OK1L6K8j1Ll4L9pJ23K2j64N8n6pK07j65P7o1O1j28O9Q3
$$ 68 34 73 75 147 27 25 64 90 190 120 19 25 46 82 110 99 102 68 107 100 223 245 81 139 83 76 283 118 195 134 195 67 136 219
2142B19p7Pm9J2oL1Lj8L9L12k48q7L19j45L31o4O20P777k840n318o25J10j10Q7O6j49q5j3
$$ 219 142 149 100 112 106 137 140 122 161 473 225 138 457 312 643 579 1199 8976 6136 818 193 303 193 280 346 197 112 99
1880I9Q4P3r4N5q6m7o1J25r8J28p9L1j5m5Q0r4Q3nL3j36K4J2l6M7m8Rk7N1m5Q6P0j02J4N3
$$ 99 183 256 162 217 131 84 23 148 50 178 99 130 115 70 150 56 139 134 167 31 55 67 31 78 30 39 12 63 18 104 174 72 86 139
1560A39O4j24K2j2J29J48j44J107m82m13l37k4k1J52pm0r0Ml4L4Q0j3j21j3J24jL9j09l5J05
$$ 139 203 79 101 89 218 366 222 1329 847 434 97 73 52 204 197 157 67 71 37 71 151 138 17 4 128 127 166 57 22 127
1279A27j9K7k6M6J8j6p3K4l5R4r7k1J5m1K0J24K3r9m1J58k8p7j0n0rR7N1Rj20J1K5j2K6M6
$$ 127 108 135 109 155 173 157 84 108 73 167 70 49 64 23 43 167 190 91 50 208 180 103 93 43 34 131 182 191 71 82 107 95 121 167
959A67j57J41j08P4no3L7O4K3j22RJ2O9m6n7N2l1L3J7K9N9j41Q0K9r7L0q1R7m5JL5o8L5jN0
$$ 167 10 151 43 117 112 49 86 150 173 51 60 72 141 95 38 90 59 92 109 138 197 56 136 165 68 98 17 114 69 70 105 37 72 71 121
631A21n9l0J9O6r2K7M0k9O8j7J38k3j78Q5p2Q0j08J06J35Nk43j3J83j5p2j01PK04J32j43j38
$$ 121 62 32 51 117 25 52 92 63 131 114 252 229 51 136 64 144 36 142 277 282 39 26 209 194 122 21 28 232 364 221 83
340H3k7K6m7P3Kp5K6L7l5k6J29J2j08n0O6N4n8oM1l3n5N0Op2K7K7j4J1j5NL4K4jL1j8P3j5
$$ 83 56 82 35 108 110 35 61 98 63 37 166 178 70 20 86 140 82 76 117 84 29 79 85 13 40 67 53 64 49 54 88 112 111 142 124 197 182
-8A82j5l8K9J01r1j46O3N2K7j28J68j67Q4m7N9k5j03J32L7r8O3mj9r1O5N8M1l0j58R0j2j3
$$ 182 167 129 158 259 168 22 85 137 164 36 204 37 121 74 133 108 5 137 174 76 139 135 116 25 90 148 189 159 1 91 79 66
-308F6o4J04l5N1M4j46P0P1j7
$$ 66 2 106 71 122 166 20 90 161 144
-393A44
##PAGE=	F1=-45.4259
##FIRST=	4405.4455391999963467,	4405.4455391999963467,	0.72378110885620117188
##DATA TABLE=	(F2++(Y..Y)), PROFILE
4405A36n9L5m9J0lK1m9J1J12M3j37k7N5%l9J41n5Kj7Jr1J18k5K7L8m9m8l7M4q7Q1J27k9j50
$$ 136 77 112 63 73 70 91 42 53 165 208 71 44 99 99 60 201 146 148 131 132 41 159 134 161 199 150 102 65 109 22 103 230 201 51
4086E1L5lj9L1m7N%j3J89j42l6jM5n3K2M7M6Qr1n7Q4K9P2K9j22l3R0k5K4k3L5q0n2rM7J2J02
$$ 51 86 83 64 95 48 53 53 40 229 87 51 50 95 42 64 111 157 165 74 17 101 130 202 231 109 76 166 141 165 142 177 97 45 36 83 95 197
3739A97j36Q4JJl2m7O8J7j33K6K9L4j05O8J5n0R5P1j9r1k2lQ1n2M2MK3jr6%pM5Qm8k5K2P4
$$ 197 61 145 146 147 115 68 136 153 20 46 75 109 4 72 87 37 132 203 184 93 71 68 149 97 139 143 166 165 69 69 62 107 115 67 42 64 138
3391A38o2L8J26o5j22O9l0K7j4Qp5P5n7N4o0J8P4JR4q6n3pj9K8l3Rk5m4N7J22m9n5MO1p1O7
$$ 138 76 114 240 175 53 122 92 119 105 113 38 113 56 110 50 68 142 143 237 151 98 91 72 100 67 76 51 7 64 186 137 82 86 147 76 143
3053A43m2L0K33l3j06j77M7j7K8q7J8L6m4L00J35K26K5n96m1JM1l7Q3m3k3Qn5l0M7p%J11M
$$ 143 101 131 364 331 225 48 95 78 106 19 37 73 29 329 464 690 715 119 78 79 120 83 166 123 100 108 53 23 70 63 63 174 178
2743A78j08KJ24j72M6J74O26n7j33n75J61j80L7L9m9J4J16p6n1p4Q6n2j2J15o4k5rJ7m0J6
$$ 178 70 72 196 24 70 244 870 813 680 105 266 86 123 162 113 127 243 167 116 42 128 76 64 179 115 90 81 98 58 74
2462G4k4K1J6N2r0m4N2L7O4n1q5mP9j5Kj3K7n0N7K5O1L7j78P1n1N7J54j58R9j62J34l4J9M4
$$ 74 50 71 87 139 49 5 57 94 158 107 22 18 97 82 84 71 98 48 105 130 191 228 50 121 70 127 281 123 222 60 194 160 179 223
2142B23p2m7L2o8kO7n4l4M8J43j31J83Q4k04J86j83Q1K405r82j192l23Pm0j0J16o5j11J16
$$ 223 151 104 136 68 66 133 79 45 93 236 105 288 372 168 354 171 252 2657 1675 483 160 167 127 117 233 168 57 173
1880A73lO7o6j3k2q8k7J09j06J31m7P2n8QK4r2P8Q0j5j79j3L5J7M6o5k7M4J7n1L2J01j01N7
$$ 173 170 237 171 158 136 48 21 130 24 155 108 180 122 130 154 62 140 220 205 26 13 48 65 111 46 19 63 80 29 61 162 61 118
1570A18L6M0r6K9n4J72R3k04M85k71j76l7p5J7J01p6N3m8q1O4K5O8n5q5LO7M4k8j02j9J24
$$ 118 154 194 98 127 73 245 338 134 619 348 172 135 60 77 178 102 155 107 26 90 115 183 128 43 46 113 157 129 27 8 132
1279A32n0N4l5K7mK0n5M7o4J06j15k2K4m9N6J16m3q7J9J19n1o0J6l5j3P5K7rr6J8L0j2N7K7
$$ 132 82 136 101 128 124 144 89 136 72 178 63 41 65 16 72 188 145 58 77 196 145 85 101 66 53 128 155 146 50 68 98 86 143 170
959A70j48J20r7M6J4m4K2M8Lj01mN7M8k1l3L5n2O1KjR1j03m1O7j02M1n3O5j1l2J06j34N1N
$$ 170 22 142 45 91 105 61 83 131 134 33 29 86 134 113 80 115 63 124 126 125 216 113 72 139 37 78 25 90 79 47 153 19 70 75
640G5O3p2n9N1L2m3L6J7n3M5O4P2lj46P5r4Q2j21J43Q7L3k29j9J88j1Oj52PJ29J05j09j64
$$ 75 138 66 7 58 90 47 83 100 47 92 156 228 225 79 154 60 142 21 164 251 284 55 36 224 213 219 67 74 203 308 199 35
340C5O2J9p4R0o0o8R5Rk1k7R6J0q6n1P1K5p3j4O0kn9N3k3n7K4O1l5%j1K6j6O3jPl9R9J7k3
$$ 35 97 116 42 132 72 4 99 108 87 60 156 166 80 29 100 125 52 38 98 96 37 90 67 10 34 95 60 60 49 75 59 122 121 128 89 188 205 182
-17A82p2O7Q7j41q4M6O3pj13J54j48P3k6O5m9p1J34N4j25M9J7n2l6N8L5N6o0j37N2kk6k0N1
$$ 182 110 177 264 123 39 85 148 141 28 182 34 107 81 146 97 26 160 214 89 138 155 103 67 125 160 216 156 19 71 69 43 23 74
-327G4LK1N3j16N5N5O
$$ 74 77 98 151 35 90 145 151
-393A51
##PAGE=	F1=-64.2059
##FIRST=	4405.4455391999963467,	4405.4455391999963467,	0.77029258012771606445
##DATA TABLE=	(F2++(Y..Y)), PROFILE
4405A08o3R0q5O8m3j2pJ9N7J6j09J7M4nn6J55l4J8k9Jj47J54m4M5On0or4J12q3P8O4j8j33
$$ 108 45 135 50 118 75 63 56 75 132 148 39 56 100 95 39 194 160 178 149 150 3 157 113 158 164 114 108 14 126 43 121 185 167 34
4086C4N1MK2Nr3J1J0J9J74j42l1k8K6k3K6PN4jn8k2O9K6L5M1j13n7J15n0N0K0%r6l1k0M2j3
$$ 34 85 89 111 116 23 34 44 63 237 95 64 36 62 39 65 72 126 125 67 45 114 140 175 216 103 46 161 111 161 181 181 85 54 34 76 63
3748F3R3n9Q2n2L5n7k6J04%j20l1O3Lp3M2M4n3O5P7k1j20N2qN3p7N0K4L5k1p9l5qK1M4o8J2
$$ 63 156 97 179 127 162 105 79 183 183 63 32 95 98 25 67 111 58 123 200 179 59 111 103 156 79 129 153 188 167 88 53 45 66 110 42 54
3410E4K7O4m5jJ82o1j44M8jN2l6m3n5R8n0Oj5j5O3J9Q0j05n1Q5k9k5j1l8plN7J15q2q0N8P4
$$ 54 81 145 100 99 281 220 76 124 123 175 139 96 41 139 89 95 80 65 128 147 227 122 71 156 127 102 91 53 46 43 100 215 133 53 111 185
3072A85j46O9m7Q3L64k2l02j33K8J1M6r6N3l0l2M05N7J31R6o11k0l5J02m4P1q5k7N2m7l3j5
$$ 185 39 108 61 144 508 486 184 51 79 90 136 40 93 63 31 436 493 624 720 109 89 54 156 112 183 98 71 123 76 43 28
2781B8J5K2R2km5l7J01j47lL00K56j41J01m55J79k11N1M5m7nJ45q0Oj10R6j03k2J03j8k3P
$$ 28 43 65 157 155 110 73 174 27 24 324 580 439 540 85 264 53 104 149 102 97 242 162 168 58 154 51 29 132 114 91 98
2490I8pj6KJ7l5M6J0m9k1PM9K5l4q6J0J18n8k8j5N0m9J14K3l9M5j50J11q1J14Q0j25J04j35
$$ 98 91 75 77 94 59 105 115 66 45 52 101 126 92 6 16 134 76 48 33 83 34 148 171 132 177 27 138 57 171 251 126 230 95
2180I5P6P4J3n5o8l8R3j84L0J37j11P9j16K46j9J94j81m4k1K28P69N683j563n137M8j56M2
$$ 95 171 245 258 203 135 97 190 6 36 173 62 141 25 271 252 446 265 221 200 428 1197 6880 5317 180 228 72 114
1926A14Ql4J43j02J24j01J3K9j21R4j04J4K1n8O9lJ24j25Q5m5n8L3J89q1j74j4k2O9N6o0p1
$$ 114 122 88 231 129 253 152 165 194 73 167 63 77 98 40 109 106 230 105 190 145 87 120 309 228 54 40 18 87 143 83 12
1635A2J07m2l4j7R9p6R9JJ5m2K3l5J39L7j91L11j60j0j52R0p6N0j38J41j5n2M4K8M4q7k0j2
$$ 12 119 77 43 26 125 49 148 149 164 122 145 110 249 286 95 406 246 236 84 174 98 148 10 151 136 84 128 156 200 113 93 81
1335H1PR0p6q4K5Q5o0Q5o4J8k4M6m0N8q3R8p9m4L7n3P9J20j29p7P9Q2p6m0M5J4l2K1J6m5%
$$ 81 88 178 102 18 43 128 68 153 89 107 83 129 89 147 64 162 83 39 76 23 102 222 93 16 95 177 101 61 106 120 88 109 125 80 80
1006H0J3j0j2P1J5j24R7q7J7M4l6nN0k1m2k5P1L4kK5j3o1P8k8rQ8m7j37Q2q2L8rMM6r3J86
$$ 80 93 83 71 142 157 33 130 43 60 104 68 63 113 92 50 25 96 130 128 153 140 79 157 129 120 208 161 24 106 24 62 53 57 103 10 196
668A96j48%L9M9n1m6J3OK6K3lp1L3J25%rj07P7j04P3n1R9L8O5k10J9J10Q0j7j76M0L4R2n5
$$ 196 48 48 87 136 85 39 52 58 84 107 104 33 66 191 191 182 75 152 48 121 70 169 207 272 62 81 191 271 254 78 118 152 244 189
349A89j60R5J6r5R9j07kR9k7lj4K8K7n7o2Q3j1m2j9K4N6p7N8m6j2mP8k9k5k3N7m8Q4rj6n0
$$ 189 29 124 140 45 144 37 35 134 107 104 90 118 145 88 26 109 98 56 37 61 117 40 98 52 40 36 114 85 60 37 94 46 130 121 105 55
11E5J21L3m4q9J04O6j77oL4M8l3n2Q3j17N9J9N1p6m5J44P8j10j1J2m1nM9J0O6r5q6MK2n4M3
$$ 55 176 209 165 76 180 246 69 63 97 145 112 60 143 26 85 104 155 79 34 178 256 146 135 147 106 101 150 160 226 131 45 49 71 17 60
-318F0j1L8k5N9n8K4L1L1
$$ 60 49 87 62 121 63 87 118 149
-393A49
##PAGE=	F1=-82.986
##FIRST=	4405.4455391999963467,	4405.4455391999963467,	0.89746052026748657227
##DATA TABLE=	(F2++(Y..Y)), PROFILE
4405G7m4J17r8J12n9m1JL4J2l5o1M7M4pq8J56j1K8m6J2r9J11o4N8l8m6L3o6J00r0Q3lj8q5
$$ 77 33 150 52 164 105 64 65 99 111 76 15 62 106 99 11 167 156 184 138 150 51 162 98 156 118 72 105 39 139 49 132 129 111 26
4086B6N1J3N8k1j17M7j4L9J44j30k8l5J9K6J0m9M8K8m5PO4NNM0r2p0J22o8P6N5m0j05j5m2
$$ 26 77 90 148 127 10 57 43 82 226 96 68 33 52 78 88 39 87 115 70 77 141 146 151 191 99 29 151 83 159 214 174 69 54 12
3767A2N4l7P8L0M9r5O5p4j2J28nj01o4Q1rn3PN9m5M2Q4k1j02Q2k9K4r8O2K9N0l9n6o2orQ0
$$ 12 66 29 107 137 186 91 156 82 70 198 193 92 28 109 100 47 54 113 68 110 194 173 71 153 124 148 50 112 141 191 152 96 34 28 19 99
3429I9p0N4L3K8l0%J93n6j51J1L0Q0o4q0L6M6m5l0M8q4O0M1N6j18l8J50k6o8nn1pM2O3Q8j02
$$ 99 29 83 116 144 114 114 307 251 100 111 141 221 157 77 113 159 114 84 132 48 108 149 205 87 49 199 173 105 100 49 42 84 147 235 133
3100A33r9J13P0j57J2k6J00M39m7m03n2j0L1N6r2Q5j22J4M69r6L7O4l82m9QQ2l3M1j14J0N4
$$ 133 34 147 217 60 72 46 146 585 538 135 83 73 104 160 68 153 31 45 514 418 455 519 137 88 96 178 145 186 72 82 136
2809A36k9l4o9K5M0P0j1K6q2O9j10K6L20n9j12J89l65K13k22N2M6l3k8J55o7N2j40J04j45
$$ 136 107 73 4 29 69 139 128 154 72 141 31 57 377 318 206 395 30 243 21 73 119 86 58 213 146 198 58 162 17
2537A7K0N4K2k9J1nm%N0r5R8m8j3Kk8N3Nj5o8rJ23p8j4k5M6n2J94j5j31L6m1R3j07J45K0p5
$$ 17 37 91 113 84 95 90 86 86 136 41 139 91 78 80 52 105 110 95 27 18 141 63 49 24 70 18 212 197 66 102 61 154 47 192 212 137
2199A37P9o3pJ47M2j64o4K8J07j73LJ61r8J29j33N58j62J5k44J15R7L66J454J1982l725r977
$$ 137 216 153 146 293 335 171 107 135 242 69 72 233 135 264 131 689 527 542 298 413 510 876 2330 14312 10587 610
1955F10k89q8KQ5j82K01j27Q6j60n8J40j54J18o5J0j7m1j4L4J67j76J51j03j7k5K82j36j49
$$ 610 321 233 235 320 138 339 212 298 138 80 220 66 184 119 129 112 71 57 91 258 82 233 130 113 88 370 234 85
1692H5Mn1O0P3o4j03J52r0j8nL5m6J40m1mJ2J3jO3L1P7P81m31j17m84J72j45L6l7M0jQMK5
$$ 85 89 38 98 171 107 4 156 66 48 43 78 32 172 131 127 139 152 151 214 245 322 1103 672 555 71 243 98 134 97 137 136 144 148 173
1372A73K5r8J4j7l0J09q1q6O4N5n8J04j10M6n9N9k7N7r2Q1j7m3J8l7P1J30j96k5O6N5q1l1
$$ 173 198 100 114 97 67 176 95 9 73 128 70 174 64 110 51 110 83 140 48 129 112 69 87 50 121 251 55 30 96 151 70 39
1072C9P5N2m5j8J3q8J07j0n7pO1%q6P8p3pP4m0l4O5l1K6l0K4L4J7O7n0o2Q7o8%O0J6j32J2
$$ 39 114 166 121 103 116 28 135 125 68 61 122 122 36 114 41 34 108 68 34 99 68 94 64 88 122 139 206 156 94 181 113 113 173 189 57 69
734F9m5K3L4n8J01p5J51j26l4M3L6j2k9m7LP1J5k0p4N7J34m7n6p9R9r3M7K4M0KR4j98N7O4
$$ 69 24 47 81 23 124 49 200 74 40 83 119 107 78 31 34 105 120 100 26 83 217 170 114 35 134 41 88 112 152 154 248 50 107 171
415A71K19j49j78R2n2Q4kj19O5K1j02R7j17L9Q4o0K2Pn0N1l5p3R6m9JJ8l8R9j04O5n5K9m2
$$ 171 390 241 63 155 103 187 185 66 131 152 50 147 30 69 153 93 115 122 72 123 88 15 111 62 63 81 43 142 38 103 48 77 35
105C5R3k5l9m6Q2m8P7k7l2m9J46J8o0q1J24M0j63M2J7K4l9M%o1K6P7K5q0l9J46J02r8o7j0
$$ 35 128 103 64 18 100 52 129 102 70 21 167 185 125 44 168 208 45 87 104 128 89 93 93 32 58 135 160 80 41 187 289 191 124 114
-214A14kQM5j7O8j22j8l4N3n1N8m0L2o4N8rmK2L8
$$ 114 112 120 165 148 216 94 76 42 95 44 102 62 94 30 88 79 75 97 135
-393A35
##PAGE=	F1=-101.766
##FIRST=	4405.4455391999963467,	4405.4455391999963467,	0.87531578540802001953
##DATA TABLE=	(F2++(Y..Y)), PROFILE
4405E5QR2r3J35n1m6l2N6Qq2k8L7M3J2q6R9J1L3o6K0l8R7r9O0p8l0O3k5O4q8P5l4m5jK1J9
$$ 55 63 155 62 197 146 100 68 124 132 50 22 59 102 114 28 127 138 171 105 125 87 184 85 145 67 37 100 75 139 51 126 92 47 46 67 86
4067H6P2l1q9N8m4L1J13j06k3mJ4M7qo0nQ6n6J7O6k5mK0p1l0P8n4P7P6q5j00kqK4l4L2R8J3
$$ 86 158 127 38 96 52 83 196 90 67 63 77 124 116 56 51 137 81 98 164 139 135 155 84 54 132 78 155 231 146 46 44 36 60 26 58 156 169
3720A69j11P1p6qJ31Mp1q9R1%n3k1N6l2L4Q9j2o7P2n3Lj17P5K3O7n7k9n4nJ9L3l3P0N2k9k7
$$ 169 58 129 53 45 176 180 109 20 111 111 58 37 93 61 95 184 172 105 177 124 127 10 85 108 175 118 89 35 30 49 82 49 119 171 142 115
3382A15L2J54m0j45k5N4R8q6r4J14nm5l4Q2j49O5N5J9j12rJ64qj00ql9qP1O7O0j12j07J44
$$ 115 147 301 261 116 91 145 243 157 63 177 172 127 93 175 26 91 146 165 53 44 208 200 100 92 53 45 116 183 243 131 24 168
3081A68P2j38o0K0P8M06q5l58Pn0N5N7q0J09j37K1M40k19Q0j90rj13N9M8lnj20P8J8rk9q9
$$ 168 240 102 42 62 140 546 461 103 110 60 115 172 92 201 64 85 525 306 386 196 187 74 133 181 178 173 53 131 149 140 111 22
2781B2JN2M9lO6j15M1q5M4L43j50Q8M3l61J63j95N3L2pn5J42n1P8j30Q5j33P6jQk9%L0k4L0
$$ 22 23 75 124 121 187 72 113 28 72 415 265 353 396 35 198 3 56 88 81 26 168 117 195 65 150 17 93 92 100 71 71 101 77 107
2462A07M9j28J46q7JPl5M4MJn0k9P8n7K1l1K9k4K12o9j56PO3L3j06J47J1n1L8pk8J45Q3k18
$$ 107 156 28 174 87 88 95 60 104 108 109 59 30 108 51 72 41 70 46 258 189 33 40 103 136 30 177 188 137 175 168 140 285 368 150
2142A50n7N3J21j77k6J80q7J33j32O13j75q5j91Q6J51L21J630J2190m116r779m69p2%J05k29
$$ 150 93 146 267 90 64 244 157 290 158 771 596 511 320 406 557 878 2508 14698 10582 803 334 262 262 367 138
1908A38K38j58N4j70p8J87j09M0nK1mo7o3M1J86j87J79j33J4o4L17j45j26J5n8M0Q9r1p8J42
$$ 138 376 218 272 102 24 211 102 142 137 158 154 87 24 65 251 64 243 110 124 60 377 232 106 121 63 103 192 101 23 165
1626A65j05rK1k5l8J71p2j1M6%K3k4O9K27Q48l26k24n56P5j86N5L1n0oP8k0%K2q1omk9Q6n1
$$ 165 60 51 72 47 9 180 108 97 143 143 166 142 211 438 1286 960 736 180 255 69 124 155 105 99 177 157 157 179 98 92 88 59 145 94
1307I4q0P6N2p1J11j53R0r6O7j9M8q3O6K8k7j0k1M8J38k07J0J9M3n2k1P6O6m4j1J5o4R0l3
$$ 94 14 90 142 71 182 29 119 23 90 71 119 36 102 130 103 93 72 120 258 51 61 80 123 71 50 126 192 148 137 152 88 178 145
997A45q6%K9j8m1O8n2j9R7n3m9O6j2O5n1l1M7L3Q7o6n2P8j03J7J6P6j05m6Qj6O7r3J20l3Q0
$$ 145 59 59 88 70 29 97 45 26 123 70 21 87 75 140 89 58 105 138 225 159 107 185 82 99 115 191 86 40 48 32 99 6 126 93 173
668A73p0j7l2M2K7j0r1PQ0J2l4m4P2J18m9j33j4P4o3PQ2j9mJ02j91Q5R3L03k64j64R7j02P9
$$ 173 103 86 54 96 123 113 22 29 109 121 87 43 115 233 184 51 37 111 48 55 137 118 114 216 25 110 203 506 242 78 175 73 152
358A52K8r5L5L4r2Q3q7L1O4q6N4L2r2M4k9m4P8q8L1Q1o5R0j16O3m9O0r8J12k8l6m8O7k4N8
$$ 152 180 85 120 154 62 145 58 89 153 67 121 153 61 105 76 32 110 22 53 134 69 159 43 106 57 117 19 131 103 67 19 86 62 120
39A20n7l6oJ45l3n1l2R2J6r1L4pQl3M2o7K2k0J19ln9m1J25J18j00j01l8M3RN3m7O3j26M7m7
$$ 120 63 27 21 166 133 82 50 142 158 67 101 94 102 69 111 44 66 46 165 162 103 62 187 305 205 104 66 109 118 171 124 187 61 108 61
-290F1N7m2O5n8J4p6M2J0j9M2J5
$$ 61 118 76 141 83 97 21 63 73 54 96 111
-393A11
##PAGE=	F1=-120.546
##FIRST=	4405.4455391999963467,	4405.4455391999963467,	0.55047881603240966797
##DATA TABLE=	(F2++(Y..Y)), PROFILE
4405D6M7N8p7J31j4n4o5P6K9p8n8J6K5N3p2K6K1M5q6J0K2J22j54N5j03KP6j3L5n1L6oq2N0
$$ 46 93 151 74 205 191 137 72 148 177 99 41 57 82 135 63 89 110 155 69 79 101 223 69 124 21 23 99 86 121 70 106 100 18 68
4086F8oK0N6k0m7N9p0LQ6p1jK3J4N1k3m8o7J34o4NO7n3J2j6n9K8K3j2N2Q6j34p6J0P4m5j5
$$ 68 62 82 138 118 71 130 60 63 149 78 77 100 114 165 142 94 27 161 97 102 169 116 128 112 53 81 104 92 144 230 96 20 30 104 59 44
3748D4k3J36pq4K0o1j1J09K5l2r7Q0K5p1l1L1j5M3Q5Qn6N5o5pn2K1qQ2p4Kj4mM1k9QP7P3q6
$$ 44 21 157 150 66 86 25 14 123 148 116 19 99 124 53 22 53 38 81 166 174 118 173 108 101 49 70 62 144 70 72 58 54 95 66 74 151 224 138
3391A38l5P2Q3j2j24m9O2R9r1p7J59m7n7lP9j79O8N4l3p0J5J32J9j19j4j8J4O6O6M0j22r2
$$ 138 103 175 258 246 122 73 135 234 143 66 225 178 121 118 197 18 86 140 107 37 52 184 203 84 70 52 66 132 198 238 116 24
3091B4J39R2j20j06M6M7K78j19j61%q7R1N1o6J17q7J3L26k65J22j85P5j72Q8K9L2n3j05J40
$$ 24 163 255 135 29 75 122 400 281 120 120 33 124 175 109 226 139 152 478 213 335 150 225 53 141 170 202 149 44 184
2819A84j4lj9j01k4N5L1L1O7j37L5q0K7L77j08OL7k78M5j23N8L1j0p4J07m1P8n7L2q8J13m5
$$ 184 170 167 148 47 23 78 109 140 207 70 105 25 52 429 321 327 364 86 131 8 66 97 87 13 120 79 157 100 132 44 157 112
2518A12l5k4pP4n5P4Rj03J47q2j4j4j2L0OOk4l7nKL4k3K0L0J57j25r6O7J9l7m5Q5N8p5j1K9
$$ 112 77 53 46 120 65 139 148 45 192 110 96 82 70 100 106 112 88 51 46 48 82 59 79 109 266 141 45 112 131 94 49 134 192 117 106 135
2180A35K9O1J12j79k3k8J54j98m5J70q6Q5j05K40j6L6j53n4J03J24J119M905k191l609l51
$$ 135 164 225 337 158 135 107 261 63 18 188 102 187 82 322 306 342 189 135 238 362 1481 6386 4195 586 235
1945B35j17N7M4j48K36j83M7j06j8J03o9n0O8P1Rq5nj8J51j67J60j20K8p5K79q6j29J6m9L2
$$ 235 118 175 219 71 307 124 171 65 47 150 81 31 99 170 179 94 89 71 222 55 215 95 123 48 327 241 112 128 79 111
1664A11R1j43k0J04q2pL5l5l7J49q3OM5k1M0r6J04K49P67M8n22m49k9k14R5O8j20j8J43j9
$$ 111 202 59 39 143 61 54 89 54 17 166 83 89 134 113 153 57 161 410 1177 1225 703 254 225 11 106 174 54 36 179 160
1382A60m8L5m0p5K8KL3j4m0O4N9j00J09j34O8j04P8j5K5l8M4L9j4k2j9J7J36j58Kk3N0k6J2
$$ 160 112 147 107 32 60 62 95 81 41 105 164 64 173 39 107 3 81 66 91 53 97 136 122 100 81 98 234 76 78 55 105 79 91
1072I1M9O0l4J7K3n8N0n0q2rlk8nO8k0l2J13o9k5K2J3Q8q9n6M7L9Q3n6k6M5r5Pl5J25p9m5
$$ 91 140 200 166 183 206 148 198 148 66 57 54 26 21 89 69 37 150 81 56 78 91 179 90 34 81 120 203 147 121 166 71 78 43 168 89 44
734D4M2o6Q7p9P8J7K2q%j27O4N5Ro0l3N1J7m4NO2J06k3j47M7k2m1j7J07o0L1O2j32M4J63L32
$$ 44 86 20 107 28 106 123 145 137 137 10 74 129 138 78 45 96 113 69 74 136 242 219 72 119 97 56 39 146 86 117 179 47 91 254 586
405E86k90j63L8j07P9K7r3J8N3p1O5n0lN2j03Q8N5q4nm1J5M6q5JJ57r4O9r6M4l7Q3j42J10
$$ 586 296 133 171 64 143 170 77 95 148 77 142 92 89 141 38 126 181 97 92 51 66 112 27 28 185 91 160 64 108 71 154 12 122
95A22l2k5l3K4J3M1p1k2N0R8j07J2PK9lk2K0l4Ol0O8p2P0m2J16j7m5l2Q9J19j11j04p1R3n
$$ 122 90 65 32 56 69 110 39 17 67 165 58 70 77 106 103 81 101 67 73 43 111 39 109 67 183 166 121 89 178 297 186 82 11 104 99
-233I9P2p7N1r4Q3l0K0l2P5q4J5p5L1nk0P8k1
$$ 99 171 94 145 51 134 104 124 92 167 83 98 23 54 49 29 107 86
-393H6
##PAGE=	F1=-139.326
##FIRST=	4405.4455391999963467,	4405.4455391999963467,	0.21815161406993865967
##DATA TABLE=	(F2++(Y..Y)), PROFILE
4405D7O1L5n3R7M5p0o6P2M8p3p9J1j9R6n9qmP0p2n8P4J73k13M3q5J3Q0l4J7Rk3N0o3K2j8J6
$$ 47 108 143 90 187 232 162 96 168 216 143 64 75 56 152 93 85 81 151 79 21 95 268 55 98 13 26 106 72 89 98 75 125 62 84 66 82
4067H2J0QlN3q9l4O2k3L9K4J7N0l3m0j00J52o1k2O0p0M5o0m0O8k1L4J4Q9j79j4J7J40j15o
$$ 82 92 100 97 150 61 27 89 66 105 129 146 196 163 123 23 175 114 92 152 82 127 67 27 95 74 108 122 211 32 18 35 175 60 54
3748E4k6J18Nn5m6l4jL7N7Qp5L3N5j00kj7NN0P0L3o7M2o3jK6Op9P9p1K1J8%M5n6K4P7Q6j26
$$ 54 28 146 151 96 50 16 15 52 109 117 42 75 130 30 28 11 16 66 136 169 102 144 81 80 106 112 33 112 41 62 80 80 125 69 93 170 256 130
3391A30m8J05lK6r3o2O2Q2p3l4J62q0p9M5N3j55N7M2q5%J3P3N2j27lj7M8L6O2L3j35n6R8J29
$$ 130 82 187 184 210 117 55 117 199 126 92 254 174 95 140 193 38 95 137 52 52 65 138 190 63 60 43 91 127 189 222 87 31 129 258
3072B58r9j21M0J6J07j30R8n7r4J16L8n6J10j4J9J85k83NJ80r1j83P9L2N6r0p9J80k5j8nq7
$$ 258 159 38 78 94 201 71 169 112 18 134 172 116 226 212 231 416 133 138 318 227 44 123 155 211 121 42 222 197 179 174 87
2781H7n7N5PP2N2j51N1o7l6L86l4k31J32j55n7l9O0O9n1q0O7k0L4N3k6o1J52r2o3l1M2P7m9
$$ 87 30 85 92 164 216 65 116 49 13 399 365 134 266 111 54 15 75 144 93 13 80 60 94 147 121 60 212 120 57 26 68 145 96
2471I6P8n3m7J17l9n1n1L0K7kmJ7m3j1oL4mMQ4O0j68j5J46n6l2MnJ07j21m2L3J18n6J11p8
$$ 96 174 121 74 191 152 101 50 80 107 105 101 118 75 64 58 92 88 92 176 236 68 53 199 143 111 115 110 217 96 54 87 205 149 260 182
2142A82L4j80K16j73P3pq4L4M7N24k91k37l7K22J4K19j33P067p44o671NJ40L7k00K72j42j50
$$ 182 216 36 252 79 152 145 61 95 142 666 375 138 101 323 337 556 423 7490 6746 75 80 220 257 57 329 187 37
1889C7M9N9k0n5m2R4q8J56oo7O7n4Q0j38Q9m3J5p9J85L3j68J3oJ5P3j85L3N3l3j2L9k6k6R3
$$ 37 86 145 125 70 28 122 34 190 184 117 184 130 210 72 161 118 133 54 239 272 104 117 111 126 199 14 47 100 67 55 94 68 42 135
1570A35q0N7jm2N3r1Q2J87J007R5r23j94j05j18L8O5j44M4R2Lj03N6On3k2L1j1kOO1M9j21
$$ 135 55 112 111 69 122 31 113 300 1307 1402 479 285 180 62 100 165 21 65 157 160 57 113 119 66 44 75 64 62 68 129 178 57
1269E7R2o5j1n7Q5j5k0J2K2M1k3nl0k0J21p8k4l1N5l4O2J4N3k6L5L6o6J5n9m9l7j7L8l4O6
$$ 57 149 84 73 16 101 86 66 78 100 141 118 113 83 63 184 106 82 51 106 72 134 148 201 175 210 246 180 195 136 87 50 33 71 37 103
941A03Nn0J23q7Mk6L2R8j33J0j3K0O3k3Mnk2m0k7Q8m9j1N4r3Q6o5K1P3MJ8Lj18J0O6K8op3
$$ 103 108 58 181 94 98 72 104 202 69 79 66 86 149 126 130 125 103 63 36 124 75 64 118 25 111 46 67 140 144 162 165 47 57 123 151 145 72
593G2KL2n3N4K8J07Rj26O8r9l3j6R9n3N9qm5l8K51L23k47j95m8p4R0Kj14J9O7m3N1j9n2O4
$$ 72 74 106 53 107 135 242 251 125 193 94 61 45 144 91 150 142 97 59 310 633 386 191 143 69 159 161 47 66 133 90 141 122 70 134
274A34p7P3P4p0n1n7P3K6o3k9J95j34N2n5J8k6R8j29O0l2k7j3oL6L7k2k8N7M1j32O8Ql3jR
$$ 134 57 130 204 134 83 26 99 125 62 33 228 94 146 91 109 83 181 52 112 80 53 40 34 70 107 85 57 114 155 23 91 99 66 65 74
-55G4J7m9J7l8P7k3P3n5R2j1n4j6O0J01j19p0l2P6m8R4r8L2m2R1Pm8k1Q3j12M3p9M0k2k2J00
$$ 74 91 42 59 21 98 75 148 93 185 174 120 104 164 265 146 76 44 120 72 166 68 100 58 149 156 108 87 170 58 101 22 62 40 18 118
-383A18m0
$$ 118 78
-393G8
##PAGE=	F1=-158.106
##FIRST=	4405.4455391999963467,	4405.4455391999963467,	0.48314195871353149414
##DATA TABLE=	(F2++(Y..Y)), PROFILE
4405E0N2K7k7M9J00p8m0N0M8o5p1J4n8J03l6%n1R3l2r6N6K16k49K0m2JQ5p4J0N7p3R4m3Kj7
$$ 50 102 129 102 151 251 173 133 183 231 166 95 109 51 154 118 118 67 160 128 32 88 304 55 75 33 34 119 45 55 112 39 133 90 92 75
4077G5J8n9M1K8N0j03j5j1L3P8J2J7N0l6m4j06J53n2n7M8o8P5q7K0L8m9O7k6R1j38j5L1J69
$$ 75 93 34 75 103 153 50 35 24 57 135 147 164 214 178 134 28 181 129 72 120 52 127 40 60 98 49 116 90 181 43 28 59 228
3767B28j58j7mQ5L2m5o1k1pj6P4K3m5k0P8j12L8Lj1MN3N0q1L3m6J4Q7K3j08J8pj2K0NL7m6
$$ 228 70 53 49 134 166 121 60 39 32 16 90 113 68 48 126 14 52 55 44 48 101 151 70 103 57 71 158 181 73 91 84 72 92 97 134 88
3429H8J3O8Q5j33n9J23q9O3n3p4P0N2l9J1J43j13j03R4K2j06M3M0r2K0J0NQ5j20K6m9P3%N7
$$ 88 101 169 254 121 62 185 96 159 106 32 102 154 115 126 269 156 53 147 169 63 106 146 54 74 84 89 174 54 80 31 104 104 161
3119A61L4j38j4L4J64o1j36L6k1k3J18N7j23m2R9J9n5R8O0L6P1k94Q7J54j32j33L7M9O0j01
$$ 161 195 57 43 77 241 180 44 80 59 36 154 211 88 46 145 164 109 207 267 303 374 80 167 321 189 56 93 142 202 101
2837A01n2J86k2m3J4n9p3N4l1J01M5j53O6m8l6K72P6j02P2k56r4OM2J17q9p0L6J5n2J57o7
$$ 101 49 235 213 170 184 125 52 106 75 176 221 68 134 86 50 322 398 296 368 112 18 24 66 183 94 24 60 75 23 180 113
2546A13m7J74j31n9l6Q5P3k4N2r6rP9K0r6p7O8L4rk2N5o1M6n7M3mqJ16m0j45K4J90j06L5n
$$ 113 66 240 109 50 14 99 172 148 200 104 95 174 194 98 21 89 123 114 92 147 86 132 75 118 114 106 222 182 37 61 251 145 180 175
2227A75l9J00j36Kk5J57j12O1OR4k38K12j12J32p9p4J45M6J338n52q51O9L81Q6M36P95J6978
$$ 175 136 236 100 102 77 234 122 183 189 283 45 257 145 277 198 124 269 315 1653 1101 250 319 700 786 1222 2017 18995
1973A8995l639j4889l21L38m3j37K60m02J2JN7k8j41J2J81j85J52l9l5J18q3L8j28J6N2nr0
$$ 18995 15356 467 146 484 441 304 564 162 174 175 232 204 63 75 256 71 223 184 149 267 184 222 94 110 162 157 67
1720F7Q9J46k14J4N6j4M4j21rjK4k5L8j4k7N1q2J26o9m7N7l0M7Q3J215j51j059J21j73j6o
$$ 67 156 302 88 102 158 144 188 67 58 57 81 56 94 80 53 104 22 148 79 32 89 59 106 189 1404 1253 194 315 142 126 120
1429A20K1p5P5j5K2j04N0K7L2r1K8j2k2L4O7J6j10O1oq4j4J09j2o6L1J5N3n6K9l3n5Q5Nm8
$$ 120 141 66 141 126 148 44 94 121 153 62 90 78 56 90 157 173 63 124 118 34 20 129 117 51 82 97 150 94 123 90 35 120 125 77
1110G7rM6n5J03j9O5k9K7M9p5%p2ko8MP6o2P3K1p4J29j05L5o5M7R0j62Q5n8k4L5J8K4n3O5
$$ 77 68 114 59 162 143 208 179 206 255 180 180 108 106 38 42 118 56 129 150 76 205 100 135 70 117 207 45 130 72 48 83 101 125 72 137
781A37o8K8k5JLN4r4P8n3l1J18KJ2mp4m0O4M5N2j02n7N7n6Q6j6J13L2j03Q1j50k0j6R2j8N3
$$ 137 69 97 72 73 76 130 36 114 61 30 148 150 162 158 84 44 108 153 205 103 46 103 47 133 117 230 262 159 240 90 70 54 146 128 181
452A81p0L0j08L44K77j74k36j36l1J17k4j52K5O3j1M7kj02R9k7K5Q3n8q4m5R1K2n6j3J79j71
$$ 181 111 141 33 377 654 480 244 108 77 194 170 18 43 106 95 142 140 38 137 110 135 218 160 76 31 122 144 88 75 254 83
161H3M0j4lj3R4r8L7l8o0K0J5LM7K5n0O5j8m3J4Mp1L8k8K8k2K0l5M4K1P2p2O8Rp7rN2O8j12
$$ 83 123 109 106 93 187 89 126 88 28 48 63 66 113 138 88 153 135 92 106 110 39 77 49 77 55 75 40 84 105 177 105 173 182 105 96 148 216 104
-196A04j3J2N4j05J02j01J6j7J01M4j21rP8j30R4q2M9ln8J07l8
$$ 104 91 103 157 52 154 53 69 52 153 197 76 67 145 15 109 27 76 73 15 122 84
-393H4
##PAGE=	F1=-176.886
##FIRST=	4405.4455391999963467,	4405.4455391999963467,	0.60605508089065551758
##DATA TABLE=	(F2++(Y..Y)), PROFILE
4405E1K8K1KNJ27n6j7L0K7m3l9Lp8P1NK0p8Q2J5j09M0K12k40j4k7QQ5j02jP4r4J09j8opK9
$$ 51 79 100 102 107 234 178 161 191 218 175 136 139 61 132 137 157 79 161 176 67 107 319 79 65 38 46 131 29 28 102 8 117 99 93 86 115
4067A15r8K9L6N6j10N1l5lJ11LMN4k8n6r3J45m3r2L5l0P0n5L6qo4Q5o2R3n2p0O4J60j60m0
$$ 115 17 46 82 138 28 79 44 41 152 155 159 213 185 129 36 181 138 46 81 51 121 66 102 94 30 115 53 146 94 24 88 248 88 48
3748D8J3O2M6l7m4l0k0K6L8Lj8n4Q0n7J9L1k5l5K7M5o4J4k0K0J31M4j21l8N0l7nPK6k4kM8
$$ 48 61 123 169 132 88 58 38 64 102 105 87 33 113 56 75 106 81 46 73 118 54 68 48 68 199 243 122 84 134 97 92 99 125 101 99 147
3410A47P2j04n7J14j59R4mr8R2L0j3L8J25j58j11J26%m5K3N8q5PJ8m6J02r5L3q0P1k7N4L5
$$ 147 219 115 58 172 13 107 103 5 97 127 114 152 277 119 8 134 134 89 112 170 85 92 110 64 166 71 104 24 95 68 122 157
3110A57r1ol8J74%j58N2o7J24J28n4j65LR5oo5R1J22N2nk32L02j38j40o4kO3M6q3l3J57k1
$$ 157 66 60 22 196 196 38 90 23 147 275 221 56 59 154 148 83 174 296 348 343 111 413 275 135 71 69 132 178 95 62 219 198
2809A98n8L9l9n1M5o3J01N0j36O2l2l3J32J51J43L9m57l4m1L0J44r3o0K2L1m9J39r5j8J59
$$ 198 140 179 140 89 134 71 172 222 86 148 116 83 215 366 509 548 91 57 16 46 190 97 37 59 90 41 180 85 67 226
2527B26j37n4J7N6Q8k0K4r1j3N3O2j19q3R2K6J9l6N0q8Q6o8N3l4J0J03q9n6pJ73r5O8k5l4
$$ 226 89 35 52 108 196 176 200 109 96 149 211 92 9 101 127 146 110 160 72 158 90 143 109 119 222 133 77 70 243 148 216 191 157
2218A57O2j25L9n5J37r4J5J9J38k23J79r3J68j21j12K62J9J627n62j077j0M08L7M34J191J7938
$$ 157 219 94 133 78 215 121 136 155 293 70 249 156 324 203 91 353 372 1999 1437 360 350 758 795 1229 2420 20358
1973B0358m190j5511m50L55j17q5K35m45N7J5J9j5j74L5K17k09J42m6m1J46r6J0j27jR7j4
$$ 20358 16168 657 207 562 445 360 595 150 207 222 241 226 52 87 304 95 237 191 150 296 200 210 83 82 179 165
1729A65r4M0J85k22K4R6m6K2p8mn2O0m3M7j0m7N0p6J59j33lN2j2N8n3R05k80n66K04k44N1
$$ 165 71 111 296 74 98 194 148 170 92 88 36 96 53 100 90 43 93 17 176 43 40 92 80 138 85 990 710 144 348 104 155
1438A55k7k9JR1q6J0n6L7LJ11j38K5j7k1M5O9l1p1L9K2r3k1J21Lq0qM5N5r6O0j3p4L0N8n7
$$ 155 128 99 100 191 105 115 59 96 99 210 72 97 80 59 104 173 142 71 110 132 39 18 139 142 62 54 99 154 58 118 105 31 61 119 62
1110F2J3L4m7J02m2R8l6j5N7o7Mr7L8p7L5P5q1R3L3j09J41j16N8q3O4N4j43J08p4l7J8J9J9
$$ 62 75 109 62 164 122 220 184 169 226 159 163 66 104 27 62 137 56 149 182 73 214 98 156 73 137 191 48 156 82 45 63 82 101
800A01p7J25o4M6r5N9j0L1q2P6l8k0J02j9kj8j7o4N7N8R6j18r4P0m8R2n9J16M1p7P5j64J2
$$ 101 24 149 85 131 36 95 85 116 34 110 72 52 154 135 133 115 98 34 91 149 245 127 33 103 55 147 88 204 245 168 243 79 91
490I1l5R9QL2r7O9j28M03J94r9k54j92j6J59k4j73RK0K4N8j0j09J11K4k1P9m9j01k0P6K9o0
$$ 91 56 155 163 195 98 167 39 442 636 537 283 91 75 234 210 37 46 66 90 148 138 29 140 164 143 222 173 72 52 128 157 97
189I7J5J46j88L1MmJO9o3N1n3q5L7L8l6O7M4o4O8o5K3k6Ln3N3r0M2K0K7m6K2L7P2r5N5K5r7
$$ 97 112 258 70 101 105 101 102 171 108 159 106 21 58 96 60 127 171 107 175 110 133 107 110 57 110 20 62 82 109 63 85 122 194 99 154 179 82
-158H2k2P6K1p6K8N4K4j44Q9p7J3l9J18O2j47k2M9n3Q6q8M4J8o9Q9k5
$$ 82 60 136 157 81 109 163 187 43 132 55 68 29 147 209 62 40 89 36 122 34 78 96 27 116 91
-393I1
##PAGE=	F1=-195.666
##FIRST=	4405.4455391999963467,	4405.4455391999963467,	0.47127512097358703613
##DATA TABLE=	(F2++(Y..Y)), PROFILE
4405E9j0LM4l4J14Rj4K2rrPl0j00M1N7M0q9L7O8j31O8J63j89m2m0J9Q4j06j9N7k3L7J3j1J5
$$ 59 49 52 96 62 176 185 171 193 184 175 182 152 52 93 150 190 101 138 206 75 143 306 117 75 35 54 138 32 13 70 47 84 97 86 101
4077A01N0j00j5kP3r1R7j8p9J40jk6N9oo5p2J25k2j26K4K5L2J3J7m1q1R3q5R5J1j02R8J07
$$ 101 151 51 36 34 107 16 113 95 16 156 155 129 188 182 117 45 170 148 22 46 71 103 116 133 92 11 104 19 114 125 23 121 228
3767B28j19o6K2N1L8k3k6l0m1N0L9l0kk8L8Jj5O1l7m2JJ1rk1LJ1J66N1j24p5Q6l8n1MK4j1
$$ 228 109 43 65 116 154 131 105 75 34 84 123 93 91 63 101 102 87 148 111 69 70 81 72 51 54 65 231 282 158 83 169 131 80 84 108 97
3429I7pJ8N0l5m8Q0j04K5M6o5M2K9j0M2J20k13j7N7pJ8j3R7j04RL6o5Q7o7J5r6M7k8M4L1j0
$$ 97 90 108 158 123 75 155 51 76 122 57 99 128 118 160 280 67 50 107 100 118 105 202 98 107 143 78 165 98 113 17 64 36 80 111 101
3100A01k1m2Q8P3j41M9r6K22O6j08j55K1R9l1q3R3J66N6n0j70L29j25k36k4j9O0K5m8l0J08
$$ 101 80 38 126 199 58 107 11 233 299 191 36 57 156 125 42 135 301 357 307 137 466 341 105 81 62 122 147 99 69 177
2819A77l2n1O5l6J0K1o9O7P0j03L8k3n2K9J10L17M5n33J0m1J4J31n9o5K1K2LN4j10M6R3r3
$$ 177 145 94 159 123 133 154 85 152 222 119 157 134 82 111 221 538 583 50 60 19 33 164 105 40 61 83 86 140 30 76 169 76
2518G6m9N9J9J13o2J4n0m5M3P0q9p5R8j8J00n9%j03Q3k5M9q9Q3K5l5n3LQ7lK6m8J2Kr9M1n8
$$ 76 27 86 105 218 156 170 120 75 118 188 99 24 122 104 204 145 145 42 125 100 149 60 143 168 133 80 83 170 167 193 145 157 159 60 101 43
2180D3R5n9K6K9J02j69J38j31J85j46NJ09j4P36j41n22j90K80j43J25P24O815j529o017j97
$$ 43 138 79 105 134 236 67 205 74 259 113 118 227 213 949 808 286 96 376 233 358 1082 7897 6368 351 154
1945A54K02j21j7J29k77K6N9j1J9j07k7K07j78J64Nj25J51o3n3j11O4O0j3q1M3J39j36MR6
$$ 154 356 235 218 347 70 96 155 144 163 56 29 236 58 222 227 102 253 190 137 26 90 150 137 56 99 238 102 106 202
1673B02p2L0q3O7r2N1o0Q3l5o0P1l8J22j55PJ05rN6nM97k31k66J42k49O3m4o0Q1Q5j04m3r
$$ 202 130 160 77 144 52 103 43 126 91 31 102 64 186 31 38 143 134 190 185 682 451 185 327 78 141 97 37 118 203 99 56 47
1372D7O8o2J66j61L0l9JO4N9q2k5N0J7q0j7Q8L7n6r2J09J8j12O2L8j00J5L9m4K6J7JN7m6J36
$$ 47 115 53 219 58 88 49 50 114 173 91 66 116 133 53 36 124 161 105 13 122 140 28 90 128 28 43 82 38 64 81 82 139 93 229
1053B29l1q8N4k0%j14M8m1M3M7r5J20M3j49J61j18O7p8Q8j1q5P6o5rL7l3j2l2J03m1L6p6O6
$$ 229 198 110 164 144 144 30 78 37 80 127 32 152 195 46 207 89 156 78 166 155 70 146 81 72 109 76 64 32 135 94 130 54 120
743A20j6j6p4P8j5J4O9o4rm2N1o7M7P2J10j22p6L7j6O3q6J07L5m9M4j21N0p6J15J8Rp9O5j10
$$ 120 104 88 14 92 77 91 160 96 87 45 96 29 76 148 258 136 60 97 81 144 58 165 200 151 195 74 124 48 163 181 190 111 176 66
424F6M13Q8m6k25j94l7J98Mk16K1m7N0Q1m2m9O3P9n3N7l6j01%M9L8p2M5J05j80L1j0K3PK6
$$ 66 479 567 521 296 102 65 263 267 51 72 25 75 156 114 65 128 207 154 211 175 74 74 123 161 89 134 239 59 90 80 103 110 136
114A36l8Q4o4m4rM8n1Q4L4o4O2q6N2l6oj3M5j01J4M8N4p9K7L2O9j03M7J8r9m1J10l1k5M2J07
$$ 136 98 182 118 74 65 113 62 146 180 116 178 92 144 108 102 89 134 33 47 95 149 70 97 129 198 95 142 160 61 20 130 99 74 116 223
-214B23k8j58O4l5J5l2P9O1r6p8JN9O6j09L3K9pJ3K
$$ 223 195 37 101 66 81 49 128 189 93 15 16 75 141 32 65 94 87 100 102
-393A02
##PAGE=	F1=-214.446
##FIRST=	4405.4455391999963467,	4405.4455391999963467,	0.18889954686164855957
##DATA TABLE=	(F2++(Y..Y)), PROFILE
4405I1m4l5R7q8P1J08l9L1m9K6N5q2j24N4Q8M9r0l1J26j49J08J01j15o2n9J4Q7r4j9L6L1l1
$$ 91 47 12 109 21 92 200 161 192 143 169 224 142 18 72 160 209 119 88 214 65 173 274 159 97 38 52 139 45 26 62 93 62
4105F2L2k2N0P3j29lj9K0j5Q3qq3J19j0p0O2K6n8n4Q7K0j36lO1j0R0j5n4o9O0q2Q4N4r1J01
$$ 62 94 72 122 195 66 63 44 64 49 132 124 41 160 150 80 142 168 110 56 143 163 27 24 85 75 165 150 96 27 87 5 89 143 52 153
3776A53K5n6q0K2N1K8k4j0j0p4O3N2o2ML8k2M4o1R9m8l7j3j5K5m7J1J2J90L3j14r2J01j5j12
$$ 153 178 122 42 64 115 143 119 109 99 25 88 140 78 82 120 98 142 81 180 132 95 82 67 92 45 56 68 258 291 177 85 186 171 59
3457E9NK7j2jlJ4N5m3L7m9nP0l7k3M1rK0J29k44N6Lj9P7o1J43j30K3M9o8O4m5k2r1M2J3j8
$$ 59 64 91 79 78 75 89 144 101 138 89 84 154 117 94 135 126 146 275 31 87 90 71 148 87 230 100 123 172 104 168 123 101 10 52 65 47
3119D7K0O0k8k5j9J28o8J0r8K13j1j04q1L3P6n4o0N9J86N0o0j04J30J08k76m7pM6jj8m3O4
$$ 47 67 127 99 74 55 183 115 125 27 240 229 125 44 77 153 99 39 98 284 334 274 170 300 408 132 85 78 124 123 105 62 126
2819A26n9k3Q6m4Q6j4n3J9J07o9mj6r4K2J5L20L9m16KN0l1P6nq8K6J2M7m2k0M8j7nJ0J6L0
$$ 126 67 44 130 86 172 158 105 124 231 162 158 142 48 70 85 405 444 28 30 80 49 125 120 32 58 70 117 75 55 103 86 81 91 107 137
2490A37R9j47L5Rq7M2M0jn0Q2j05K20r3q0l5k6P0L0j18J62j06J14j37N4n7J53p1q6J40o4k1
$$ 137 236 89 124 133 46 88 128 127 77 159 54 274 181 101 66 40 110 140 22 184 78 192 55 109 52 205 134 48 188 124 103
2199A03p1M6J7JN4Q8m5n2M8j05R6J04J80l46J20J782o77j307L55l3M46L23M71J2606l289j0428
$$ 103 32 78 95 96 150 238 193 141 189 84 180 284 464 118 238 2020 1343 36 391 358 804 1127 1598 14204 10915 487
1955D87k23j43L37lk82J61j78n9k8O0R3p0m1nJ10R2k51J20L8k00Q4M0j9l8k4Q0PL1m7O4p4
$$ 487 264 121 458 455 173 334 156 97 69 129 222 152 111 106 216 308 57 177 215 15 99 139 120 82 58 138 145 176 129 193 119
1664A19N5r0J31j16Om9J15q8oM5lO8j25n7K02qM2J68J098n07q64P7p3m2n9J0Q3N0q9o6nJ14
$$ 119 174 84 215 99 105 56 171 83 77 122 119 187 62 5 207 199 241 409 1507 1000 136 213 140 98 39 49 132 182 93 27 22 136
1363A36j10J55j27J3j2l1R5N2j29RQ8j1p8J3K9R3k4p1O5m7p1J0J18j36L6m2JM5l5O9pk9J59
$$ 136 26 181 54 67 55 24 119 171 42 51 139 128 50 63 92 185 161 90 155 108 37 47 165 29 65 23 24 69 34 103 96 67 226
1053B26pj70M7O3l6n1l7K7L1Jo6J07N3j47J40j08O3n1J17r2k7L0m7K8N7p4k4QN6k3Mk0N0J0
$$ 226 219 49 96 159 123 72 35 62 93 94 28 135 188 41 181 73 136 85 202 110 83 113 66 94 151 77 53 61 117 94 98 78 128 138
734A38n3o8M5J7M8M1j19K6m0P2o6K7Q3R4j17k8j8L3J5r2Q1J6l0nj2P2j29J31J4ol3L5p8L84
$$ 138 85 17 62 79 127 168 49 75 35 107 41 68 151 245 128 100 82 115 130 38 119 135 105 100 88 160 31 162 176 170 137 172 94 478
415D78mk7j71j53n0K00M3k75O8p0K3R6q5K6KJ32p0K4k1p9J7J9L3q9P2N9j50M0l9P1jj9m2J20
$$ 478 474 447 276 123 73 273 316 41 109 39 62 158 73 99 101 233 163 187 166 87 104 123 156 67 139 198 48 88 49 120 119 100 58 178
95A78o0J3o1M3k8Q2Nn9O0r0N5j0m0K1L1p5j5M9Q6j14L0L1O2p8L0j6p1K1M9p8J6M6J58r2j46
$$ 178 118 131 70 113 85 167 172 113 173 83 138 128 88 109 140 65 50 99 185 71 101 132 194 116 146 130 59 80 129 51 67 113 271 179 33
-233C3L2J6RK4j3O1l5j22P1J9O7j32L3J0R1q6M9
$$ 33 65 81 90 114 101 162 127 5 76 95 162 30 63 73 164 78 127
-393A27
##PAGE=	F1=-233.226
##FIRST=	4405.4455391999963467,	4405.4455391999963467,	0.24562025070190429688
##DATA TABLE=	(F2++(Y..Y)), PROFILE
4405A38n3j7P9j34K3J73p3N2p5M3R0j31q0N8P1M1q2r9J73j37J24N3m5p1o5j7R4o7j4M9M0n3
$$ 138 85 68 147 13 36 209 136 188 113 156 246 115 35 93 164 205 123 24 197 60 184 237 192 121 56 39 133 66 52 101 141 88
4105H8J2l7Q0Q9j58K3K2j04O8N5j6l8Q8k9j01L8O5l4n0M0P8j37k4O7l9J52l9n4m3Qn8O2Q6
$$ 88 100 63 143 232 74 97 119 15 83 138 122 84 172 143 42 80 145 111 61 101 179 42 18 85 46 198 159 105 62 70 12 74 160
3795A60q0R4n4Op6J2O1M2o7QK8j23R1N3r7RJ15q5P3j14J44n8l6j7j0J9n3jL6J97%j02q2R9
$$ 160 80 174 120 126 50 62 123 165 98 106 134 11 102 155 58 67 182 97 170 56 200 142 106 89 79 98 45 44 80 277 277 175 93 192
3476A92J6j71L1Rk1OJ5m4J35m4kj4kP3j1r6N7Pk0J38j89L5Kn3J21j02J72j30L1M4o4M7l0o1
$$ 192 208 37 68 77 56 62 77 33 168 124 122 108 106 179 168 72 129 136 116 254 65 100 102 49 170 68 240 110 141 185 121 168 138 77
3157G7m4N7K5p5QQ4j8j3l1P9K3l4j13J23n7l8KO6K7p4J4j8J79M4l1J7k07L07j72j23K7L3l3
$$ 77 33 90 115 40 48 132 114 101 70 149 172 138 25 148 91 53 55 121 148 74 88 70 249 293 262 279 72 379 207 84 111 144 111
2847A11oo5N0j9o2R0oR4m0l2j8J54m3o1pj32R5J50J0l6j52n8J34q7M3K7j19M0K3O0q0O6J0
$$ 111 105 40 90 71 9 99 93 187 147 115 97 251 208 147 140 8 103 253 263 227 75 17 151 64 107 134 15 55 78 138 58 124 134
2537A34j21Q0P3n1P8N0k32Q5O2j18L8j3Q3j5O2j83L15j19j65P3n2N8Qk8J18j95K33j89O4o6
$$ 134 13 93 166 115 193 243 11 96 158 40 78 65 148 133 195 12 327 208 43 116 64 122 130 102 220 25 258 69 133 67
2255F7J69j24m4J79m8%j05O2M2PM8J10j01k8K8j5N4K95K48k76K83O036j893m646M93J89O50
$$ 67 236 112 68 247 199 199 94 156 198 205 253 363 262 234 262 247 301 596 844 568 851 6887 4994 348 841 1030 1680
2002A680P48J616L0074p602k5360o56N0L46m8k41J2k52j36mL4J08p4j13L2K5J56k82P7Q1j67
$$ 1680 2428 4044 34118 26516 1156 500 550 896 848 607 619 367 231 227 261 369 295 182 214 239 395 113 190 271 104
1767A04R9j8j8j40O8J21j24J54r5L8m4N1l9J13j21m3j7J25j35M6J9J8L3j10pJ70rJ5L14J408
$$ 104 203 185 167 27 95 216 92 246 151 189 145 196 157 270 149 106 89 214 79 125 144 162 195 85 78 248 239 254 568 1976
1485A976q72p85k84K08j77mN9K1%p5L1m4Q7q3O1l5l0P0j01R0O7j44LJ25m6n2J0j4J56rm3J7
$$ 1976 1104 319 35 243 66 62 121 142 142 67 98 54 141 58 119 84 54 124 23 113 180 36 39 164 118 66 76 62 218 209 166 183
1185A83j10j8m3J96j49K8m4%P0q3R2o1oJ54K4j74L6Q9p4J3r6N2J8m1K4K2O5p2M1p9N0j6J44
$$ 183 73 55 12 208 59 87 43 43 113 30 122 61 55 209 233 59 95 184 110 123 27 79 97 56 80 102 167 95 136 57 107 91 235
875B35j65LK3n3O4O6r8J3pL7l0k4J9L6N9n9p0j2M8P8J7j50Q7j4L4p9J0Q6O5j10K3o7P5k1r0
$$ 235 70 73 96 43 107 173 75 88 81 118 88 64 83 119 178 119 49 37 85 163 180 30 117 103 137 58 68 154 219 109 132 65 140 119 29
546B9N3lk6l2R1P5j67J26MpJ5Om5L35k5k5j77q2m4J62O6l11J37q5mP9j09Q2m4J66p7j0j1l5
$$ 29 82 79 53 21 112 187 20 146 150 143 158 164 119 454 429 404 227 145 101 263 329 18 155 70 66 145 36 118 74 240 163 153 142 107
227A07K9%J7j15R3J4j14O3n0R4j2l4q3J41m0O7j07L3J3O7k5n9P4r8O7J4q5L7K3m0rK8R9j19
$$ 107 136 136 153 38 131 145 31 94 44 138 126 92 9 150 110 177 70 103 116 183 158 99 173 75 142 156 71 108 131 91 82 110 209 90
-92I0JM5N0l7J3n3k6O0j2j01K8N1J88j41j23JN8jQ8j05Q7k6j15J24n0Q3j32M7k6J59j61R0
$$ 90 91 136 186 149 162 109 83 143 131 30 58 109 297 156 33 34 92 91 179 74 161 135 20 144 94 177 45 92 66 225 64 154
-393A54
##PAGE=	F1=-252.006
##FIRST=	4405.4455391999963467,	4405.4455391999963467,	0.57421189546585083008
##DATA TABLE=	(F2++(Y..Y)), PROFILE
4405A78m6k5P1j39K4J29r3Q0q0L4J00j48PRN3J9o2n9J07q4R7L7qo1n6o9J04l5j1O1N5n7j0
$$ 178 132 107 178 39 63 192 99 179 99 133 233 85 92 101 154 173 111 52 159 75 172 209 201 140 84 15 119 84 73 134 189 132 122
4096A22n0Q2R8j66M2N5j40O4L1m6J7P1l9o8n8R7mn5JJ31j44j6M3m1J72l6m8k7k5n9O2J09r1
$$ 122 72 154 252 86 128 183 43 107 138 92 109 180 141 73 15 112 108 53 54 185 41 25 68 27 199 163 115 88 63 4 66 175 84
3786H4Q8j00M5m8rP2O7j22K4O5j27R8L5j33L9J52j53J05j67J92o5n2j2Qmj9m8P4J89k7r2o2
$$ 84 172 72 117 69 60 132 199 77 101 166 39 137 172 39 78 230 77 182 15 207 142 90 78 86 82 63 15 89 278 251 159 97
3485I7R4L7j95O0k8j8qN7q8J70l7l7RRN8J4j66Q3L5o7J32j21pL1q5J42j08J52r4K9K4o0N1
$$ 97 191 228 33 93 65 47 39 96 8 178 141 104 113 122 180 194 28 111 146 79 211 90 83 114 29 171 63 215 121 150 174 114 165
3175A65l1q0J2O0K4j09RO1J1Jj6jR8n3j15M1L2m4j6R9j2q2O9o7J40N9J1J27j64J13l4k31O7
$$ 165 134 54 66 126 150 41 50 111 122 123 107 106 204 151 36 77 109 65 49 148 136 54 123 56 196 255 266 393 229 342 308 77 144
2865A44K3p0mq6P6O3r8L7O3J4l7k1k3J86k4j27Kn5P4J89m2j61j6n4J54j48N0K8j24N8K3N0
$$ 144 167 97 93 7 83 146 48 85 148 162 125 104 81 267 243 116 118 63 137 326 284 123 107 53 207 59 109 137 13 71 94 144
2565A44l7M7kj15N2J28r1R4Lj42K9O8j22K0j9P3K8M6j73L00j11j88R6J0lk2K5P6j60K31j87
$$ 144 107 154 152 37 89 217 126 220 223 81 110 178 56 76 57 130 158 204 31 331 220 32 128 138 135 113 138 214 54 285 98
2274I8J8K2Q3r9J3J23Rj7j03K9Q9%L8R7p5p6O5J0J04L85K86j29N87J1487l162r016Q4K85N90
$$ 98 116 138 221 122 135 258 267 250 147 176 265 265 303 400 325 249 314 324 428 813 1099 970 1557 13044 9882 866 950 1235 1825
2002A825Q04J864L2765p946k8071o55J36K84r0j43p3k89j34J2N2M7o2o4k2j1J88k93J27J8
$$ 1825 2629 4493 37258 29312 1241 586 722 1006 916 773 700 411 277 289 341 388 326 262 240 229 417 124 251 269
1776B69j17R2p5N1j93R4J40j49J52j24M0j1J0L3O3j08o4nJ24j37M6K0J4L5j24P6Q8kl6L96
$$ 269 152 244 169 220 27 121 261 112 264 140 180 169 179 212 275 167 103 98 222 85 131 151 165 200 76 152 240 238 202 598
1495E98R65j050K6l69J48k47L1P0m7k6r1J33o7L9n5J3K8m3J16j23M1R5j46QJ26q2K1n5lJ93
$$ 598 1563 513 539 170 318 71 102 172 125 99 8 141 74 113 58 71 99 56 172 49 90 185 39 47 173 91 112 57 54 247
1213B47k0j7rj45Nl4K09j40J1k0l2J03p2N5q6j2J33M8j04L2L2o7L3j00K4J4n4Q6o0Q2ko9o
$$ 247 227 210 201 56 61 27 236 96 107 87 55 158 86 141 55 43 176 224 120 152 184 117 150 50 74 88 34 120 60 142 140 71 65
903F5K2JJ63k01j7Q7r3R3N2j10M9j6L4n3%KK5J04n9p9m2P7R4nj49J13j2Pq7J2O9N0j08N4r0
$$ 65 87 88 251 50 33 120 27 120 172 62 111 95 129 76 76 78 103 207 148 69 27 104 198 193 44 157 145 152 65 77 146 196 88 142 52
574E2R3k5j00M6J3L0K7nO2j54Q3rMM1Ll1L00M9k5l00J8n6J18O2k38J43j21KK5p1Q2n8J72q4
$$ 52 145 120 20 66 79 109 136 131 193 39 122 113 117 158 161 130 430 479 454 154 172 116 234 296 58 201 80 82 107 36 118 60 232 148
255A48l2j3K3K6mRj49J08j8r3R6n2Q9j5j0l7M7k6R9j36L4M5M6l7p0R6j18J02Rj07K5K8oRK2
$$ 148 116 103 126 152 148 157 8 116 98 5 101 49 138 123 113 76 123 97 196 60 94 139 185 148 78 174 56 158 167 60 85 113 107 116 138
-74A38P5r4m0O8K9j0Rn6j1O9m3r6J5N1J84j43j24NO9qJ33j60J16p4o4J37r5R7j17N8l9J60
$$ 138 213 119 79 147 176 166 175 119 108 177 134 38 53 104 288 145 21 26 95 87 220 60 176 102 38 175 80 177 60 118 79 239
-374B39j70Q9
$$ 239 69 158
-393A58
##PAGE=	F1=-270.786
##FIRST=	4405.4455391999963467,	4405.4455391999963467,	0.72805887460708618164
##DATA TABLE=	(F2++(Y..Y)), PROFILE
4405A94j8o2O3j01j8P5o2R0p4J0Q5r5N8p5N2nl5K3J2j6M4M4j1k8l6p7O7k1jN6R5o0j1o9O1
$$ 194 176 114 177 76 58 133 71 161 87 97 182 87 145 70 122 117 82 105 117 101 145 189 178 150 114 37 104 83 82 138 233 173 162 93 154
4077A54R8j53N4O8j26K2J4n5K5O1rl8p4L2K1n4k0J50j43J4%j3J32Om4k7k3m9M2J09j14Q8j18
$$ 154 252 99 153 221 95 117 131 76 101 162 153 115 41 73 94 40 20 170 27 41 41 28 160 166 122 95 72 23 65 174 60 148 30
3767C0O9Jl7P2P2j27K5P6q4P5J4j43Q6J15k13J40j37J67o9q1%K0k8M9n7N0J67k8o9o9R4M1
$$ 30 99 100 63 135 207 80 105 181 97 172 186 43 129 244 31 171 34 201 132 51 51 71 43 92 35 85 252 224 155 86 180 221
3466B21j65N3n4Nk7O6r1J55j8n7K6J9K1K7j21K7O5j07R8n9m4O0q8J34p2P6l5K3Mo1P5m3n4
$$ 221 56 109 55 60 33 99 8 163 145 88 114 133 154 181 60 87 152 45 143 84 40 100 12 146 74 150 115 138 142 81 156 113 59
3157E9L9M4J4j06mK3O1J8m7k1J15j9q9K03k7j57o5R3k1n2P5p7P3J02O4J26j82J67ml40R1K2
$$ 59 98 142 156 50 46 69 130 148 101 80 195 176 87 290 263 106 41 134 113 61 136 59 132 234 298 424 242 409 405 65 156 178
2856A78j11J1n3O3R9r2K3P0r7Ok8J6J73mj95K1L1O5L8J53j78p4n0J61j79M4L4o5N0pK9jlJ7
$$ 178 67 78 25 88 187 95 118 188 91 97 69 85 258 254 59 80 111 176 214 367 189 115 65 226 47 91 125 60 110 103 132 131 128 145
2537A45r7OJ71n3J6k0n5J9L3o9m7NPO7M4j48K46m1j44MN8L1j00K3M3r8J99j63m1Q4J4o4N1
$$ 145 48 54 225 172 188 168 113 132 165 96 49 54 61 128 172 24 270 229 85 89 147 178 78 101 144 46 245 82 41 125 139 75 126
2227A26M1Q6l4p8k3J04LJ0N9j3j43J12J7J35M14K85P6J041J7130m178j3569j102K72J26K82
$$ 126 167 253 219 141 118 222 225 235 294 281 138 250 267 402 816 1101 1177 2218 19348 15170 1601 499 771 897 1179
1992A179O00J2584k244j1681o1L3J64j30J9j4k66j1OP8l6m4J2m4L8J40k91K00q2o6J00j17
$$ 1179 1779 14363 12119 438 377 410 574 444 463 449 183 172 178 256 220 176 188 144 182 322 31 231 149 83 183 66
1748F6J35p2J2Q1j22R8j22P0ln3J07J0p1l2m8J18p9k4N7qN6j46J56qL3j10M46J60j36K9l10
$$ 66 201 129 141 222 100 198 76 146 143 90 197 207 136 104 56 174 95 71 128 120 176 30 186 178 211 101 547 707 571 600 290
1457B90L3k18j4J17j36J9qN6r0Ml1N7qj3J16j05J7P8j12K9P1j14J20j36O1J77n7LRj48j6%
$$ 290 323 105 91 208 72 91 83 139 49 53 22 79 71 58 174 69 86 164 52 81 152 38 158 22 83 260 203 206 215 67 51 51
1156E1J78j01Ml7m4J28m4L6j11j0Q1N6pJ6m6j4Or3j3K7k3R0p6P4K0j33R4k7qJ67j74k6J03
$$ 51 229 128 132 95 51 179 135 171 60 50 131 187 180 196 150 136 142 49 36 63 40 130 54 128 148 15 109 82 74 241 67 41 144
847A44j02R5J1j11O5J1J2p0N2j4LJ16o8o4l0Q3R1k4j28R8j0l5p3M4L0N7r9M2q1Q5Nj28N9L7
$$ 144 42 137 148 37 102 113 125 55 107 93 96 212 144 80 50 133 224 200 72 170 160 125 52 96 126 183 84 126 45 130 135 7 66 103
527A03J10%o4K2j09L1j1K0K6L9m5K72J63n1m41J35r9Q6M1r7J08j70K2m5lP4p3J77j05l2k5
$$ 103 213 213 149 171 62 93 82 102 128 167 122 394 557 506 65 200 101 187 228 131 239 69 91 46 43 117 44 221 116 84 59
236E9P6NkK6j33P0j3n4P1p5Q7j5L3Kqm7R8j41N8M6K6l0o1Q4j39J45k2q6j1M7K1J7L8L3o7l8
$$ 59 135 140 138 164 31 101 88 34 105 30 117 102 135 137 129 82 180 39 97 143 169 139 78 162 23 168 146 60 49 96 117 134 172 205 138 100
-102A00N9Lj4K9k4m0N9l4r2NM4J49r0j35J9N1j0J43j50R3j35L3R4r2Q9r7O0k5R9r1K6
$$ 100 159 162 148 177 153 113 172 138 46 51 95 244 154 19 38 89 79 222 72 165 30 63 157 65 154 57 117 92 191 100 126
-393A26
##PAGE=	F1=-289.566
##FIRST=	4405.4455391999963467,	4405.4455391999963467,	0.59616863727569580078
##DATA TABLE=	(F2++(Y..Y)), PROFILE
4405A83K7j17N4j8j04K4O5K3o8k0O3K4O0j55L0Ol4R1k7L0mM5n1K2j4l6Mm8K5M3J44o1Or9M6
$$ 183 210 93 147 129 25 49 114 137 69 49 112 136 196 41 71 77 43 134 107 137 133 178 127 149 135 99 103 55 80 123 267 206 212 113 159
4077A59Q9j39O4N7q9k9MJ9p4N2O8m4o0m4M5j0j5Q2q0Nl5J1M9R0n3m2J4l8J2Q3j09P5p8L7O5
$$ 159 248 109 173 230 141 112 116 135 61 113 181 137 77 33 78 68 53 135 55 60 25 36 85 175 122 80 94 56 68 151 42 117 39 76 141
3748A41o6N0N3o4K1L5oK5Mj20J23K6j86J02n8J02o5o5j2J0l4J04k7l0J41mqj33R7L0j03J7
$$ 141 75 125 178 114 135 170 164 189 193 73 196 222 36 138 80 182 117 52 40 50 16 120 93 63 204 200 192 59 156 186 83 100
3448A00m8L8j2J1o2R3J3m8M1K1l6L0Oq0Q6j34M0kj9J7k7P0j0k4K8J1J3m3O5n0OL3K7j5n2m2
$$ 100 52 90 78 89 27 120 133 85 126 147 111 141 147 67 153 19 59 57 38 55 28 98 88 64 92 103 116 73 138 88 94 127 154 139 87 45
3110D5KR8K9j24N6M3O0o0L05j11k33l5NJ7J7K7m2rJ48J55m9l22M48Jm19R1L5j26N2n1M6Q1
$$ 45 47 145 174 50 106 149 209 149 454 343 110 75 80 97 114 141 99 90 238 393 344 22 470 471 52 143 178 52 104 53 99 180
2809A80l2L1J5j60M2n2Q2J11K3k22P3N4P8j22L38j50j60p5J50j30k7P4JL5k5koo1N3j5q8J81
$$ 180 148 179 194 34 76 24 106 217 240 18 91 145 223 101 439 289 129 54 204 74 47 121 122 157 132 130 124 63 116 101 13 194
2509A94N5j46Rj4N8m6O2j33j8L0J4M9k9P6J06j12o8LJ81j67n8k5J32j0p8N6q8K6J0J9n0J12
$$ 194 249 103 112 98 156 110 172 39 21 51 65 114 85 161 267 155 87 90 271 104 46 21 153 143 65 121 33 59 69 88 38 150
2208A50kL9j8q4Q7p5PO1k8n7J45oL89K29L23J573K1708m710j7208k067N37K83N81K000K7468
$$ 150 148 187 169 85 172 97 104 165 137 80 225 219 608 837 1160 2733 24441 19731 2523 456 993 1276 1857 3857 31325
1973C1325q664k1200j341K62R8N9k21Kl5O5j69j46J73m2rN4R2j77N6p5kjj3P9m4J64p2r1k6
$$ 31325 22661 1461 120 382 480 539 318 320 285 350 181 35 208 166 157 211 303 126 182 107 105 104 91 170 126 290 218 127 101
1701A01k8QO2o9jL0j7K3L9j11L5N4p5O2Kjm0Q5m9R3j06M28Q43K57j165j70m5p3j29K09j70
$$ 101 73 81 143 74 73 103 86 109 148 37 72 126 51 113 115 114 74 159 110 203 97 525 1368 1625 460 290 245 172 43 252 82
1410H2O1M5r1p4L7M4K0j04M0Q0l6M5l0JJ2j6p9J47q2L9J22j20J5P7j30p8P9P8k3Kr5jJ04%
$$ 82 143 188 97 23 60 104 124 20 60 140 104 149 119 120 132 116 37 184 102 141 263 143 158 235 105 27 106 184 161 163 68 67 171 171
1091A71M2j37L0j4L7J03k6q1K7m9m0l3kM2L7JK7k0j7O9p8j4J31q9J8Ro2P3m5r4M9P6l2o8Q2
$$ 171 213 76 106 92 129 232 206 125 152 103 63 30 28 70 107 108 135 115 98 167 89 75 206 117 135 144 82 155 110 16 65 141 109 41 123
762A23J5l8R0q3oRN8O5k8q6L2Rj01l8R7rO2n7k4m1P1L6j47O5L1J92o5n7n0m6j0J9K1l8J13
$$ 123 138 100 190 107 101 110 168 233 205 119 151 160 59 21 118 109 171 114 90 49 120 156 9 74 105 297 232 175 125 79 69 88 109 71 184
433A84q5K07K66r9l62J14j66O3L8N3M6k05L6m5j3J04j22J99j31j9mP6l2OO3j10K8K1k9K8r5
$$ 184 99 306 572 473 111 225 59 122 160 213 259 54 90 45 32 136 14 213 82 63 59 135 103 109 172 62 90 111 82 110 15
142A5Q5l7Q4K3j3q4O0p2M9J9Pj0j1J4r4J27o6k9k5M6M5kO9Oo9J2J7k7m2P4K6j02L8Rr5RK9
$$ 15 100 63 147 170 157 73 133 61 110 129 136 126 115 129 35 162 96 67 42 88 133 131 200 206 137 149 166 139 97 171 197 95 133 142 47 56 85
-205H5J02j2j00k2K2rJ16p5J2m0J4Om4N6q1O4K5j2M1p3
$$ 85 187 175 75 53 75 66 182 107 119 79 93 99 55 111 30 94 119 107 148 75
-393G5
##PAGE=	F1=-308.347
##FIRST=	4405.4455391999963467,	4405.4455391999963467,	0.23132860660552978516
##DATA TABLE=	(F2++(Y..Y)), PROFILE
4405A54O7j56N5N5r3j7J22p2o6l2Q1R1N3j32q3P7p7J09pM8k4J8r5N5J0K7n1r8M9N7J56m9K8
$$ 154 221 65 120 175 82 65 187 115 49 17 98 189 242 110 27 104 27 136 129 177 153 171 76 131 141 168 117 19 68 125 281 232 260
4096B60j31M8P6j42O5M2m4p7kJ11j97N2J46o9m8q5O7M5k6LJ1l2k9Mj7J57p0o3O3l4j6N7m4
$$ 260 129 177 253 111 176 218 174 97 95 206 9 61 207 138 90 5 72 117 91 94 105 73 44 48 31 188 118 55 118 84 68 125 81
3786H1L2nm8J16q2MK6K8K0l0P6l8Pq9J53p2p8pJ4M2n1J2l9k7L6N7Rj08J23J2P4k00P8Ql5k9
$$ 81 113 108 60 176 94 98 124 152 172 142 218 180 187 98 251 179 101 94 108 150 99 111 72 45 81 138 147 39 162 174 248 48 126 134 99 70
3448G0k2P2Km0l1J0M6nN0J0q9M1J11j74J01j38J7J8L2n5J9PM5j7J2m0O7Qk0k9N7J6L3o5Ro6
$$ 70 48 120 122 82 51 61 107 102 152 162 73 114 225 51 152 14 31 49 81 26 45 52 97 80 92 52 119 127 107 78 135 151 184 119 128 62
3110F2K1Q2K6j66J20m2J25l1K48j39k25M4p2N9O6k0Pn3J47K91l44J17R6Q3m55O9N9q8P2q1
$$ 62 83 165 191 25 145 103 228 197 445 306 81 125 53 112 178 158 165 112 259 550 206 323 419 502 47 116 175 87 159 78
2828G8L9J9N3M5n9m9n2l1P5M4N3j20O4jJ04J16J22p3k64j23J17m5m8P7L1J4Nl6l7m2J0J00
$$ 78 117 136 189 234 175 126 74 43 118 162 215 95 159 158 262 378 500 427 163 40 157 112 64 141 172 186 191 155 118 76 86 186
2527A86j06P7J52k37O0m6R0j41K16j42k6P3n1j5Q7q4K31j01m3j57L44j72m1m9J99k69J01J28
$$ 186 80 157 309 72 132 86 176 35 251 109 83 156 105 90 177 93 324 223 180 23 367 195 154 105 304 35 136 264
2265B64j84R4L7m7P3k03J49J44K1j96J36p0K3k3J59k14K54k67K24Q1N75J993K4119m710j9076
$$ 264 80 174 211 164 237 34 183 327 348 152 288 218 241 218 377 163 417 150 374 455 1030 3023 27142 22432 3356
2030C356j867P34R88J638M721O8999j9537n5860k487N71K19Q1m38j85j65l8k46j90K71o2q9
$$ 3356 1489 2223 3211 4849 9570 78569 59032 3172 685 1256 1475 1556 1118 933 768 730 484 294 565 503 414
1833D14N4N2l96K71l21K79n6p5J61k34K97j23j34Lo1P0J8j18J45k08P9N7L7p1r3J29J0j9N9
$$ 414 468 520 124 395 74 353 297 222 383 149 446 323 189 192 131 201 219 101 246 38 117 174 211 140 47 176 186 167 226
1560B26j71J13q2O9Q7o5L66J544N8j919n1o3J24j83K38j20K8P0k18M8K4P9k7r7lM9K7P3j44
$$ 226 55 168 86 155 242 177 543 2087 2145 226 175 112 236 53 291 171 199 269 51 99 123 202 175 78 75 124 151 224 80
1288H0J12j8n5j9R1LkP8j93J7J59j02j45J71n6P0mj44P3L3L8O6j46N6q5kJ85p6j9j3r5O0j6
$$ 80 192 174 119 100 191 194 192 270 77 94 253 151 6 177 121 191 187 43 116 149 187 253 107 163 78 76 261 185 166 153 58 118 102
978A02o2P0l2P6rp7R4N1j20J8N9NM6r5KL3o9m9KJ19n7m9O4O2q1M1q6Q0M3K0K4j0n2n2M2j06
$$ 102 40 110 78 154 145 68 162 213 93 111 170 175 221 126 128 161 92 43 45 164 107 58 122 184 103 144 58 138 181 201 225 215 163 111 153 47
640D7l1J13j4L9Pj06RO8M4j49N7PK37j29Lj29J5k7N7J4j01J64j15P4L29j13j27kk07J7Q3J54
$$ 47 16 129 115 154 161 55 64 132 176 27 84 91 328 199 202 73 88 61 118 132 31 195 80 154 483 370 243 241 34 51 134 288
340B88l1j88J7L8r9J41j36J74j32j7M7L1o3L0P8r3JM3nj1m9N7r8J27J6Or8JM0Nj3qJ3M9p6
$$ 288 257 69 86 124 25 166 30 204 72 55 102 133 70 100 178 85 86 129 124 113 64 121 23 150 166 172 74 75 115 120 107 99 112 161 85
11H5rP5j12L4NJ0P3m2J00Mj00P1l4n1p6J33O7j66K2N7j02K4L1N4M1o4n9j3pO3L4q0J01o1p9
$$ 85 76 151 39 73 78 88 161 119 219 223 123 194 160 109 33 166 233 67 89 146 44 68 99 153 194 130 71 58 51 114 148 68 169 108 29
-318B9J4K0n0O8P5m2O8j02
$$ 29 43 63 13 81 156 114 182 80
-393H0
##PAGE=	F1=-327.127
##FIRST=	4405.4455391999963467,	4405.4455391999963467,	0.26233190298080444336
##DATA TABLE=	(F2++(Y..Y)), PROFILE
4405A29O9j41O6M3n1j4J20j18p1M6P1O6M7j02j01P7o9N3J4N9k6j2q6K2L4R8r6j03J5J05J19
$$ 129 198 57 123 166 115 101 221 103 32 78 149 215 262 160 59 136 67 120 134 193 167 155 69 91 125 223 127 24 39 144 263
4114B63j8M6j47M4O4j49M3N3j1j10LJ52j78K9J19p6m4p8N4Q3m0l5O8o6j1oM2Q8n4q5R1l9l3
$$ 263 245 291 144 188 252 103 146 199 188 78 81 233 55 84 203 127 83 5 59 142 102 67 135 69 58 52 94 182 128 43 134 95 62
3804F2O0oK3K2r4J20p7n8K1R1J5n5J05q0K0p5J74j21j4p3M5%k6P0n9n8Q6K5L8j06P6j6J43
$$ 62 122 116 139 161 67 187 110 52 73 164 179 124 229 149 169 94 268 147 133 60 105 105 79 149 90 32 118 143 181 75 151 135 278
3495B78k17M6k8J3o1kR7Kn8j8l7N7N8L9j1j20Q4J39k25J10j16N0k2L2k7k9JP0M6l7j02R7N3
$$ 278 61 107 79 92 31 29 126 128 70 52 15 72 130 169 158 38 122 261 36 146 30 80 58 90 63 34 35 105 151 114 12 109 162
3185A62r9%R6J3L8j01K4p3M5O1J7j01O4l0R0Qj7oj40R6n0K7Q9m1M7q1J31M59n28M03l27K37
$$ 162 63 63 159 172 210 109 133 60 105 166 183 82 146 116 206 214 197 191 51 147 97 124 213 172 219 138 269 728 200 603 276 513
2884E13m41K9P2p4Q4p4Pk9J01O2r2K0j20kL4K0Q4n9N9o3J44K84l3ql49j58J18k1mL8K4QN8
$$ 513 72 101 173 99 183 109 116 87 188 250 158 178 58 56 90 110 194 135 194 131 275 559 526 518 169 11 129 108 104 142 166 174 232
2574B32p3m8Ql2J38j19M4J44j69L0m9N3j46K57j30j4O6l2n8J18j15K28r5j6j72L33j57j6o4
$$ 232 159 111 119 87 225 106 150 294 125 155 106 159 13 270 140 126 192 160 102 220 105 333 238 222 50 383 226 210 146
2302A46K32l26J16J47j97J03M7o3J36k96J70J80L3j99J23o1N0p4K03k31K84l10J21r2O79K088
$$ 146 378 52 168 315 118 221 268 205 341 45 215 395 428 229 352 291 341 267 470 239 523 213 334 242 921 3009
2058C009K3806m347j8825j754O75J181K056N475Q2629k2370o8001k576O55K51P5n49j69l12
$$ 3009 26815 22468 3643 1889 2564 3745 5801 11276 93905 71535 3534 958 1613 1864 1939 1390 1221 909
1889I09k3k86j97L13r1j14M7K6l72K57l40L50j22n8J77k83K95j49n4o1k7M4Mr5J91k31Q5J0
$$ 909 886 600 403 716 625 511 558 584 212 469 129 479 357 299 476 193 488 339 285 224 197 241 245 150 341 110 195 205
1626B05Rl3p6R2O0m4Q9k49J62j59J56O6j10M50J585j92j808j74K5J80j80K20o2j4Q3k52J03
$$ 205 214 181 105 197 257 213 302 53 215 56 212 278 168 618 2203 2011 203 29 54 234 54 274 212 198 281 29 132
1372A32j3J21m4q8qM9J7P9j87J53m5j1l6O6N8n8P5k20J5J84p1j22J78j38J01nj06P4rK8Q8
$$ 132 119 240 196 108 100 149 166 245 58 211 166 155 119 185 243 185 260 40 55 239 168 46 224 86 187 182 76 150 141 169 257
1081B57j37N8j17j0J94j03P1p9p1J00j4p6N8n8P6k6p1J22M6j39O3K2M4M5j36L9k3j8l5j6Q5
$$ 257 120 178 61 51 245 142 213 134 63 163 149 73 131 73 149 123 52 174 220 81 144 166 210 255 119 158 135 117 82 66 151
790A51m6l5M4Q6j06j1m4J19O7jrJ1n2j06M7lq0Q2J7NN4j39J9O1M2j26K9J1J98j29M8j56L3
$$ 151 105 70 114 200 94 83 39 158 225 224 215 226 174 68 115 112 32 114 131 136 190 51 70 131 173 47 76 87 285 156 204 48 81
480H1j9Q1Np7J05j04k2L26k6J2j22j89RO1K07q9j48RP9j28J16j08J14r0k8P3Oo2N2N0q6jM0
$$ 81 62 143 148 71 176 72 50 376 350 362 240 51 60 121 328 239 91 100 179 51 167 59 173 83 55 128 134 72 124 174 88 87 127
171A27Pl3j5N3j25J35k9L3q9k7J05l6j9j9L3Q3j41M1N0r6M5L2l1J03o4R9%j07R3o9n6p2J49
$$ 127 134 101 86 139 14 149 120 153 64 37 142 106 87 68 101 184 43 84 134 38 83 115 84 187 123 222 222 115 208 139 83 11 160
-139A60P3j75K1O4r5K8N3OM6l2o2m3J3j1J22j05J37j16m5k0K0QK3Q9Qrn2
$$ 160 233 58 79 143 48 76 129 135 181 149 87 44 57 46 168 63 200 84 39 19 39 47 70 159 167 158 106
-393A06
##PAGE=	F1=-345.907
##FIRST=	4405.4455391999963467,	4405.4455391999963467,	0.45344430208206176758
##DATA TABLE=	(F2++(Y..Y)), PROFILE
4405A38pl3L0p1Rj1J12l8r8J16K2M5K8r9k8J2j9nj3O5lj8o8j7M0J50j01r5N3N0O7K4N3j28
$$ 138 131 98 128 57 66 55 167 129 31 147 169 214 242 143 115 127 108 103 90 155 152 134 66 49 89 239 138 43 96 146 213 237 290 162
4086A62QM4r3n7J26j2j26M0Q8o2K4%k7n7k5KQ2n8J9M1q0J0nO9J9O0j22O9o4JM3J4M6k4l9L6
$$ 162 170 214 121 64 190 178 52 92 180 118 142 142 115 58 33 35 117 59 78 119 39 49 44 113 132 192 70 139 75 76 119 133 179 155 116 152
3748A52m1o8J1Q1j1K6K1o7L3r5J80o1n6l3rk0J8P5o1l8O0M5M2l3j3m6J55j92Q7j02L7o9J6
$$ 152 111 43 54 135 124 150 171 104 137 42 222 161 105 72 63 43 61 136 75 37 97 142 184 151 138 92 247 55 142 40 77 8 24
3438B4O2k1n3M7j4j7J28j3l5p2P3J21j74Q9j01L0l6N3l8k7j8J24L7p0j1m6Q1q2k0J22N4pj03
$$ 24 86 65 12 59 45 28 156 143 108 36 109 230 56 145 44 74 38 91 53 26 8 132 169 99 88 42 123 41 21 143 197 190 87
3128H7k2l5M6N6Nn2qQ7l4O4R8j5k03L1j2oR2l6P7q6R9O46m74K73n45L92l74k9O0j37Q0N3j14
$$ 87 65 30 76 132 137 85 77 164 130 194 292 277 74 105 93 87 179 143 220 134 233 879 405 678 133 525 151 122 182 45 125 178 64
2819F4MN6P4k4m5r8k1J9J5J56r0L2p9J85K68K6k3m23JP7o2l4j1oQ7P0j20k2MR2k0j14J52l9
$$ 64 68 124 198 174 129 31 10 29 44 200 110 142 63 248 516 542 519 96 97 174 112 78 67 61 148 218 98 76 80 172 152 38 190 151
2499A51p2NL4j2n6J27j13kL1L7M5k9j33K27n4l4q5J85j47ok1J89j12j1K6j10L6J4L4N4o5K5
$$ 151 79 84 118 106 50 177 64 62 93 130 175 146 13 240 186 152 67 252 105 99 78 267 155 144 170 60 96 110 144 198 133 158
2199A58J03Qk12J02q6L3o8J88j39K43k16L84N0M27J711K0889l948j6615k058j49M94J117K025
$$ 158 261 269 57 159 73 106 38 226 87 330 114 498 548 975 2686 23575 19627 3012 954 805 1299 2416 4441
1983D441L6319q380l1304n65K28R7Q0m52J76l18J83k46j89L31j41o6O4L0k39J86j45K44k21
$$ 4441 40760 32380 1076 511 739 836 916 464 640 322 505 259 70 401 260 194 258 288 49 235 90 334 113
1767A13M5J45k14K10j57M9q5l3M0%lJ41j99O0k9qNn6J67j5OM8j76J32j48J51L6j63Q62J797
$$ 113 158 303 89 299 142 191 106 73 113 113 110 251 52 112 83 75 80 24 191 176 182 230 54 186 38 189 225 62 924 2721
1485B721p35j758M0j08Oj04J19m3m4J07j45Om4J50oj21J28no2O7q6N4o7P7n4J10kj28J17j77
$$ 2721 1986 228 268 160 166 62 181 138 94 201 56 62 18 168 162 41 169 164 102 169 83 137 70 147 93 203 201 73 190 13
1203A3P4P1l1J3P0q7rL2j2jM0m3P4j06J4j00kJ52l3O1l9j7L1k6n0J1l4lk7mQ7M6j11P8P0p
$$ 13 87 158 127 140 210 123 114 146 134 133 173 130 204 98 112 12 10 162 129 190 151 134 165 139 89 100 66 63 36 32 119 165 54 132 202 195
865A95Jl8j3q4P8Mo7pqjO1M2o3qn9R6P2M1j7jr7p2l7J07j01N4M7jM4o5m4J0M8m3n1O8P4ol
$$ 195 196 158 145 61 139 143 76 69 61 60 121 163 100 92 33 129 201 242 225 224 127 55 18 125 24 78 125 124 168 103 59 69 117 74 23 91 165 159 156
499A56q1mk3J09k6n3K2n9J36L44m0j9k47j39M9m9K27p6j40N9M1p6J3n7L4k6j3M9M5m9L0J2
$$ 156 75 71 48 157 131 78 100 41 177 521 481 462 215 76 125 76 303 227 87 146 187 111 124 67 101 75 62 111 156 107 137 149
199A49p8K0K4l1j0k6N2r1J40j13N9o6K5M9m7J6l0M0P7j47J8N9pL8K6p7J21j4M6o8j1L2o7j8
$$ 149 71 91 115 84 74 48 100 9 149 36 95 29 54 103 56 72 42 82 159 12 30 89 82 120 146 69 190 176 222 154 143 175 108 90
-121I0q7J49Rn6j4M1o6PQ2q2K6J1On5M3o2J09n3K7m7m6lL8J1nK5K3q6K6
$$ 90 3 152 161 105 91 132 66 73 155 73 99 110 116 61 104 42 151 98 125 78 32 29 67 78 73 98 121 35 61
-393F1
##PAGE=	F1=-364.687
##FIRST=	4405.4455391999963467,	4405.4455391999963467,	0.51133257150650024414
##DATA TABLE=	(F2++(Y..Y)), PROFILE
4405B19j85J86l6KJ9jj99K26j35J28p2J33pj14O2j12K6j8k0K5R6jj93J00p1J47%m3J08j03
$$ 219 34 220 184 186 205 204 5 231 96 224 152 285 278 164 226 114 140 122 102 127 223 222 29 129 58 205 205 162 270 167
4124A67QK0N8n4l6J1O9j51J22p0j29J31j16K13j7j94R2j09R4K4j3n4R7j20LnL3k0L7K36j65
$$ 167 175 195 253 199 163 174 243 92 214 144 15 146 30 243 226 32 124 15 109 133 120 66 163 43 46 41 74 54 91 327 162
3833A62oj35J14o2J33O9k08J51j58L6N0k9mk4J50k06M8Qj4K7J36j63Q0o6m7O2n0P4N7j36J37
$$ 162 156 21 135 73 206 275 67 218 60 96 146 117 113 89 239 33 81 89 75 102 238 75 155 89 42 104 54 128 185 49 186
3542A86j5P2j53O7j0n7J72j60K9p7O1j4k0L9N6o1p4J50j34k5J53j12O7kN6j03l5N3J24j92
$$ 186 171 243 90 157 147 90 262 102 131 54 115 101 81 120 176 115 41 191 57 32 185 73 140 138 194 91 56 109 233 41
3260D1J07o1J19o8r2J74p8q5O1J6o8J92j33lqL5j13O8J3r2O6J53j07L0P65l69l88j53P2M3
$$ 41 148 87 206 138 46 220 142 57 118 134 66 258 125 122 114 149 36 104 117 25 91 244 137 167 932 563 175 22 94 137
2978A37q7K7N8M8k9Q11j96j02m74L84k82q0N6j15j06K70k11K5Oo1K00k06J44p1O6j03J88j56
$$ 137 50 77 135 183 154 965 769 667 193 577 295 215 271 156 50 320 109 134 140 79 279 73 217 146 212 109 297 141
2715A41m6J20k9P5L88j02m31J88K7lk11L1K0J20n7qOm2J90k61M7J86j95lN4O9K6o2m1qj8L7
$$ 141 95 215 186 261 649 547 116 304 331 328 117 148 168 288 231 223 229 187 377 116 163 349 154 151 205 274 300 238 197 189 171 208
2415B08M3K04k77J03nR4n6M1j27J7QJ53k64L69o3k07K08m5n6J79k29L17m8j76j4J62PJ28o2
$$ 208 251 455 178 281 276 370 314 355 228 245 253 406 142 511 448 241 449 404 348 527 298 615 567 391 377 539 546 674 612
2142F12R6j89K36MK90M23J78J69P17J5747l842j2180J43J439J581J692P301R1958k7690p3401
$$ 612 708 519 755 759 1049 1472 1650 1819 2536 18283 14441 2261 2404 3843 5424 7116 14417 106375 78685 5284
1955E284m317R11L51j63P8p18j41n89O0J56j37M3L1j88j56J38k17K69k41R7m3k25J70k14J18
$$ 5284 967 1878 2229 2066 2144 1426 1285 696 756 912 775 818 849 661 505 643 426 695 454 551 508 283 453 239 357
1720C57j01J91o1l0Ojk38J94r9Q2j1l1J7J22k44J31k13K28Oj56J36j55K33J072K530j118k744
$$ 357 256 447 386 356 362 361 123 317 218 300 289 258 275 397 153 284 71 299 305 149 285 130 363 1435 3965 2847 103
1466A03M55k63O0k5n6j88N4N4M4q4J13j11L0k8J79j01j23LJ66j37mo1J23J14k58J18q6N1R0
$$ 103 558 295 355 330 274 86 140 194 238 154 267 156 186 158 337 236 113 116 282 145 141 80 203 317 59 177 91 142 232
1194B32k03R3J89j43R7j49P9N0j33J68o2l8or5Q6n9p7K09j70K45l2j05r1M3j07R2QK1o3M6
$$ 232 29 122 311 168 265 116 195 245 112 280 218 180 174 79 165 106 29 238 68 313 281 176 85 128 21 113 121 142 79 125
912A25n4N9o3K17j27q8K03j91LM5J24j09l7j2M4M3j19J29M5j52L1l7K18k3m9k14J11O3p9R
$$ 125 71 130 67 284 157 69 272 81 84 129 253 144 107 95 139 182 63 192 237 85 116 79 297 274 225 11 122 185 106 115
631A15J3l8M9o1J50j12k8n7R1l0rk7J87j57Q1k2r8J35j20k1QL2J20O44k61nm04J8J3n5M3O1
$$ 115 128 90 139 78 228 116 88 31 122 92 83 56 243 86 167 145 47 182 62 41 49 81 201 845 584 579 175 193 206 151 194 255
330B55j93J65p7Q6p8l2n7m3O2m8J94j2o6k0l8QL3r4J10p2m7N7P3r0j5N2M1r3M9Mj11L8L1M9
$$ 255 62 227 150 236 158 126 69 26 88 40 234 222 156 136 98 106 139 45 155 83 36 93 166 76 61 113 154 61 110 114 3 41 72 121
11A21j3j8Q9K2k4j10J16J18rk60J98j39oN9o4J29k03K27j01ll5K1R5q5m2M8O7q0O0p2P1P8
$$ 121 108 90 179 201 177 67 183 301 292 32 230 91 85 144 80 209 6 233 132 129 94 115 210 125 83 131 198 118 178 106 177 255
-290B55j70J80k07M2L6L4P8qj11Q9j06
$$ 255 85 265 58 100 136 170 248 240 129 218 112
-393A12
##PAGE=	F1=-383.467
##FIRST=	4405.4455391999963467,	4405.4455391999963467,	0.50669550895690917969
##DATA TABLE=	(F2++(Y..Y)), PROFILE
4405C76k27K69l2J69J8j5k61J12k05J08q3K86jj01Pj99n9L4R5K7J46nl13J25j83P3J93L8J26
$$ 376 149 418 386 555 573 558 297 409 204 312 229 515 514 413 420 221 162 196 291 318 464 459 146 271 88 161 354 392 518
4133E18k05n1j43P1Q3K2K4J38j63Lk00k4J73l8K51p3j92k1j23J76Q6ol7N6k14L4m3P3m4J29
$$ 518 313 262 119 190 273 295 319 457 294 297 97 73 246 208 459 386 194 173 50 226 312 306 269 325 111 145 102 175 131 260
3851B60K59j95r3j62J55j60L25O8l17K31k84J1J85j9j7N3Q8j97m5p5J69j43K94j41N9o7j00
$$ 260 519 324 231 69 224 64 389 457 140 371 87 98 283 264 247 300 388 191 146 71 240 97 391 250 309 242 142
3598A42P1j16K05J09j75Q0j12J44k28K07j71R1K11k16J8j23J12M1J8K3L9j23j13J24j27P1
$$ 142 213 97 302 411 236 316 204 348 120 327 156 247 458 242 260 137 249 290 308 331 370 247 134 258 131 202
3354B02K09j87m0Q4N0j20K2P5J91k61J07q5Q4j30J5K03l1j07m9R4k51L14j65Q3O8j7j61K9
$$ 202 411 224 184 268 318 198 220 295 486 225 332 247 331 201 216 419 388 281 232 326 75 389 224 307 375 358 197 226
3091B26L9q1J51P5n7j29J377p44n01j16O8P2j91K7j48L01j52P50L43l03m90K13k31j00Q3m3
$$ 226 265 184 335 410 353 224 1601 857 356 240 308 380 189 216 68 369 217 967 1310 1007 517 730 499 399 482 439
2847D39r7K01k03l1P9j75K93j21J31j30J12j54J70j16j0J49k46P1N26j48l38K16j0Q8l08Q3
$$ 439 342 543 340 309 388 213 506 385 516 386 498 344 514 398 388 537 291 362 888 740 402 618 608 696 388 471
2603D71M2Q3j27J23j5l8J62k07QJ56m9n9O4K9O0j21M0k5j3R2QK43l02J57m5J37k7J8r6M0M0
$$ 471 513 596 469 592 577 539 701 494 502 658 609 550 614 643 703 582 622 597 584 676 684 927 625 782 737 874 847 865 769 809 849
2311H49J72k41L39n2j46J97Qj0K01j75K88m2j60M3K48R9K37m5Q9j81K46J88M77O62L02Q4k1
$$ 849 1021 780 1119 1067 921 1118 1126 1116 1317 1142 1430 1388 1228 1271 1519 1618 1855 1810 1899 1718 1964 2152 2629 3291 3593 3677 3656
2058C656Q790m057l661K749L908M716O334K2387L02081q6428k45045j1913K779J006l04o02
$$ 3656 12446 8389 4728 7477 11385 16101 22435 44822 346903 260475 15430 3517 6296 7302 6998 6396
1908F396j666q51j244k21J45m7O6j04l64l11q1j97K02k51J70j82k45K2j75J04j69K09p8r0
$$ 6396 4730 3879 2635 2414 2559 2512 2578 2474 2110 1799 1718 1521 1723 1472 1642 1460 1215 1237 1062 1166 997 1206 1128 1038
1682A038J7j08j99J62j09J12o1m8rP8j89M9j38J55j0k01J69j65L62J074K727r65l270M22l30
$$ 1038 1055 947 748 910 801 913 852 804 795 873 684 733 595 750 740 539 708 543 905 1979 4706 3741 471 893 563
1448E63K38o3q5k00M2RL5k5J41j39o9M1J19j37m8J2J80j52j2k34K58P4k89K91k16L6J17k07
$$ 563 801 738 653 453 495 504 539 514 655 516 447 488 607 470 422 434 614 462 450 216 474 548 259 550 334 370 487 280
1185B80O6K10k47K12j25J8K7j61J93j3o1J7p5N4r6n6K00k62M10q0j72j39N5o9J17Q7J1j18
$$ 280 346 556 309 521 396 414 441 280 473 460 399 416 341 395 299 243 443 181 591 511 339 200 255 186 303 390 401 283
922B83N6j26R2j54K85j77M5J64l53J61j46K93r6M3n9J9k0k14K63Q8j95M3j44K76n5q2j24R7
$$ 283 339 213 305 151 436 259 304 468 115 276 130 423 327 370 311 330 310 96 359 447 252 295 151 427 372 290 166 263
659B63K02k19M4mj71R5j00L16j48M6r2l0N9j32J35J70k16J15k6j59J03j88J07R8Jr2R39n69
$$ 263 465 246 290 286 115 210 110 426 278 324 232 202 261 129 264 434 218 333 307 148 251 63 170 268 269 177 1116 547
396E47J80n34K10n5J4l19K83k19K33j76K70p1p1n5j63P1n2K91M8j44m5l2o2P4K5J05p1k1k0
$$ 547 727 193 403 348 362 43 326 107 340 164 434 363 292 237 74 145 93 384 432 288 243 211 149 223 248 353 282 261 241
124B41k3j6j4R9N4n4Jm7j75j3K2K25K6m6P7l7j02r4J10K64j8k11J10l26M2J33J1J53j23J76
$$ 241 218 202 188 287 341 287 288 241 66 53 75 300 326 280 357 320 218 124 234 498 480 269 379 53 95 228 239 392 269 445
-158D45j84q9m7J07J23M2k9j5nj54P2l9J44J81j36J41l25l5N3J07J96O2j13Q4k00
$$ 445 261 172 125 232 355 397 368 353 348 194 266 227 371 552 416 557 232 197 250 357 553 615 502 586 386
-393C86
##PAGE=	F1=-402.247
##FIRST=	4405.4455391999963467,	4405.4455391999963467,	0
##DATA TABLE=	(F2++(Y..Y)), PROFILE
4405E84k55L31L4L10M3l6l42l8k97P8L3L95M2j03j07k64k29J21K43P9J72k1m33Q6k81Q7L16
$$ 584 329 660 694 1004 1047 1011 669 631 334 412 445 840 882 779 672 408 179 300 543 622 794 773 340 426 145 232 548
4152E48J53J06k50j14m14J22K33J45P5J17j92r4l62J02K09J14K45j20j95j72j14K25J61N1
$$ 548 701 807 557 443 29 151 384 529 604 721 529 435 73 175 384 498 743 623 428 256 142 367 528 579
3927E79m5Mk42k4p6J18N2J51K23k05j75j81J46r2M06N7k95J51k79j13K74L2QJ14oj27j95r7
$$ 579 534 538 296 272 196 314 366 517 740 535 360 179 325 233 639 696 401 552 273 160 434 466 474 588 582 455 260 163
3664A63K72j09K82j04J6q7j79R8n9K37J56j76j0j79J35j59K40j44Q1K24k74mj63J52J33M0
$$ 163 435 326 608 504 520 433 254 352 293 530 686 510 500 321 456 297 537 393 474 698 424 420 257 409 542 582
3419E82J1J1j73j79J14j4Q5K47j96p3J4N5j31J08P3K54l09P9j06L6p9P5J88J0r2k27J92k88
$$ 582 593 604 431 252 366 352 437 684 488 415 429 484 353 461 534 788 479 558 452 488 409 484 672 682 590 363 555 267
3157B67L12q7Q1J25q6k03K2O4o4K04K5l1k54J781j054m98q0J03P7k01k6j52L05j60M44J037
$$ 267 579 492 573 698 612 409 431 495 431 635 660 629 375 2156 1102 604 524 627 704 503 477 325 630 470 914 1951
2912A951l32n79m7k56q6J19K5q0J08j87p1J47k03L16l2J00k03J49j84J52m3L4J48k87J90L68
$$ 1951 1619 1040 993 737 651 770 795 715 823 636 565 712 509 825 793 893 690 839 655 807 764 798 946 659 849 1217
2668A217k40k28K50k0J63l80J20M2N6j28K15l2l6J06j20m5J28Q9p9O2J2N3j64J42n7NJ37L
$$ 1217 977 749 999 979 1142 762 882 924 980 852 1067 1035 999 1105 985 940 1068 1157 1078 1140 1152 1205 1041 1183 1126 1131 1268 1271
2405A271K47k94K07o0J62J1j6m1M2Q9J77j69K70k8q2J80Q6M3K44j05K47m9q6R9L43K12L64
$$ 1271 1518 1224 1431 1371 1533 1544 1528 1487 1529 1618 1795 1626 1896 1868 1786 1966 2052 2095 2339 2234 2481 2432 2346 2445 2788 3000 3364
2152C364k0P9j77K74M60O92J012M69O0k69K373k650L542M806O865Q618J2246M1421N67700
$$ 3364 3344 3423 3246 3520 3980 4672 5684 6153 6213 5944 8317 5667 9209 14015 20880 29498 41744 83165 650865
1973F50865j59924m62801k1308N150J828n33j515k696j921k007o04J48P5P0k77n88n27l34
$$ 650865 490941 28140 6832 11982 13810 13277 11762 9066 7145 5138 4534 4682 4757 4827 4550 3962 3435 3101
1804C101j84J33k08J80l22k69j76j40Q2k00J82q6j81L3k18j45J22j33J30j36n4k9K2j14k0
$$ 3101 2917 3050 2842 3022 2700 2431 2255 2115 2197 1997 2179 2093 1912 1945 1727 1582 1704 1571 1701 1565 1511 1482 1504 1390 1370
1570A370p4N3ok29J92r9L83Q73J719k72k910K52k79L55j01j07k07J2%pN5J40j21j64P5L7j27
$$ 1370 1296 1349 1343 1114 1306 1207 1590 2463 4182 3910 1000 1252 973 1328 1227 1120 913 925 925 918 973 1113 992 828 903 940 813
1316H13J6L6J64j63m6l11L03M1k28L75k84m9J50k09N4J84k35K48j02m0j7j42J71L9k3qo5o
$$ 813 829 865 1029 866 820 509 812 853 625 1000 716 667 817 608 662 846 611 859 757 717 700 558 729 768 745 737 672 666
1053F66j14l0J78k16M48j33j84j69Ol3J63J23Rj45M5j47O2j55K77j49J69N0m17J97k59L90
$$ 666 552 522 700 484 932 799 615 446 452 419 582 705 714 569 614 467 529 374 651 502 671 721 304 501 242 632
809F32n5J16j03pj03j89K70J24j91P4j13J58j01p1n7P0L37k78Nl4k41R2kL37j72J15j18j79
$$ 632 577 693 590 583 480 291 561 685 494 568 455 613 512 441 384 454 791 513 518 484 243 335 333 670 498 613 495 316
546C16J42j81K15K28k64R5l6k17O4j29J67J34mj30Q27q75N07n41L42r6M6l32J41j98K51j58
$$ 316 458 277 492 720 456 551 515 298 362 233 400 534 530 400 1227 352 859 318 660 564 610 278 419 221 472 314
302C14L64m5j04q2k45K2L1L28J16j70q3q5j43J17J64J08p6K7j23j35K3K6J56Q9Jq8r1k55j
$$ 314 678 633 529 447 202 224 255 583 699 529 446 361 218 335 499 607 531 558 435 300 323 349 505 594 595 507 416 161 160
30A60J01K69O9n4M5j28j93n4J60L67Lj67ml66p9J99J23K04o0J21k55k02j04K32J95J63k0p6
$$ 160 261 530 599 545 590 462 269 215 375 742 745 578 574 208 129 328 451 655 595 716 461 259 155 387 582 745 725 649
-233F49j07k68Q0M8K67K71j13P4m36j52Q5K18L17J59r0K5k88
$$ 649 542 274 354 402 669 940 827 901 465 313 398 616 933 1092 1002 1027 739
-393G39
##PAGE=	F1=-421.027
##FIRST=	4405.4455391999963467,	4405.4455391999963467,	0
##DATA TABLE=	(F2++(Y..Y)), PROFILE
4405H00k93L86J42M14Q3n6m22j97l95N0J92M73R7j09k31l31m10K11L96J43J90l5n45J1l73
$$ 800 507 893 1035 1449 1532 1476 1054 857 462 512 704 1177 1274 1165 934 603 193 404 800 943 1133 1098 553 564 191
4171A91K03L43K97N1k60j89n25Q0L21K69J37O2k26j60m77J75K39K49K64j56k31l05j00K53
$$ 191 394 737 1034 1085 825 636 111 191 512 781 918 980 754 594 117 292 531 780 1044 888 657 352 252 505
3945E05K33J28n1n6k71q4j09J66J72J53J61j91k53k13J27J7M61L8k45M0k62k12L18J06M3J58
$$ 505 738 866 815 759 488 404 295 461 633 786 947 756 503 290 417 434 895 933 688 728 466 254 572 678 721 879
3701H79r6o4l38q8L31p0K93q1j3j32k62J31J0K54K09j57j14k18P6m6K37q0O1K14l23l7j86
$$ 879 783 719 381 293 624 554 847 766 753 621 359 490 500 754 963 806 692 474 550 504 741 661 722 936 613 576 390
3448C90J82K25N9Jk6k03k52J16R6R4K73j75j14p1N3j20J95N6K99l23L1j27j3QJ20J58L3o1
$$ 390 572 797 856 857 831 628 376 492 588 682 955 780 666 595 648 528 723 779 1078 755 786 659 646 654 774 932 965 904
3185I04m13K85l01L09QO9J61j60k34J8R3m0K36Ll8l47J929j209l98n0J40P2j92q8j32K70j32
$$ 904 491 776 475 784 792 861 1022 862 628 646 739 699 935 938 900 553 2482 1273 875 825 965 1037 845 757 625 895 763
2931G63J31J656m03m74l79l28m8J51Q7n7J0j70q9J82k12L53L8P2k79J72j92J22N0P8J37k24
$$ 763 894 2550 2147 1673 1294 966 918 1069 1156 1099 1109 939 850 1032 820 1173 1211 1283 1004 1176 984 1106 1156 1234 1371 1147
2687A147J11L31m77k8K96mK06m19J42K0M2j07K93l9m1M6m2q0R5K12p3N1J6J0j78K27p9L1J63
$$ 1147 1258 1589 1112 1084 1380 1376 1582 1163 1305 1325 1367 1260 1553 1514 1473 1519 1477 1397 1492 1704 1631 1682 1698 1708 1530 1757 1678 1709 1872
2415A872J7K25k62K57q2J80N5l8nN1J49J59p2J91jj7J53J82Q6K98l2K10q5K3J48M50L23M84
$$ 1872 1889 2114 1852 2109 2027 2207 2262 2224 2219 2270 2419 2578 2506 2697 2696 2679 2832 3014 3100 3398 3366 3576 3491 3514 3662 4112 4435 4919
2152D919J0P0j83L21P39R28J388O58O2l75m65J116M769O822R793J2543J8312O0893Q39540
$$ 4919 4929 4999 4816 5137 5876 6804 8192 8850 8912 8537 8072 9188 13957 20779 30572 43115 61427 122320 961860
1973I61860k34585o86193l0784P594K677q33k500l607l154k740j011J70J81P2m61q13p62n76
$$ 961860 727275 41082 10298 17892 20569 19736 17236 13629 10475 7735 6724 6894 7075 7147 6686 5873 5111 4535
1804D535j78P5j59J63m47k92l83j17P0k07J21p7k91N0l13q9Q8j64J31k17n5l1n5k5q2j2m9
$$ 4535 4357 4432 4273 4436 3989 3697 3314 3197 3267 3060 3181 3104 2813 2863 2550 2461 2549 2385 2516 2299 2244 2213 2158 2133 2051 2039 1990
1551A990j4k09J70J3L47N91J1L82j820J39j55L72j12j38j86k3j0m6J47J07q5k39R3n1j00Q1
$$ 1990 1976 1767 1937 1950 2297 2888 2899 3281 1461 1600 1445 1817 1705 1567 1381 1358 1348 1302 1449 1556 1471 1232 1325 1274 1174 1255
1307A255N1J46j88q5l45L12K7j67M44l30j46J85k12L9J43j82K70r2r5o1j13J40P8L3m4n8p8
$$ 1255 1306 1452 1264 1179 834 1146 1173 1006 1450 1120 974 1159 947 986 1129 947 1217 1125 1030 969 856 996 1074 1107 1063 1005 927
1053I27j07k6J72j69M74j80j82j95m2qK29J08L0j46qj51L5j39K62j07K69o3m63K00l00M25
$$ 927 820 794 966 797 1271 1091 909 714 672 664 893 1001 1031 885 877 726 761 622 884 777 1046 983 520 720 420 845
809H45j0J83j45k6j92j67K70J50j40Q5p1K4j37m4j7N0M45k94n3p8k83R1Q6L40j78J66j39l11
$$ 845 835 1018 873 847 655 488 758 908 768 853 782 806 669 625 608 658 1103 809 756 678 395 486 572 912 734 900 761 450
546D50J94j71K17L51l37P6n3k68K6o4K43J38J7p7M31j009P42m21M22q9K6k86m9j63K51q6M10
$$ 450 644 473 690 1041 704 780 727 459 485 421 664 802 819 742 1173 164 906 485 907 818 844 558 509 346 597 511 921
293I21k6j09j35l13l1J17L66J74j54j34j67k11J44L11J15r0R3k34k55M1P5K31J37M8j89j26
$$ 921 895 786 651 338 307 424 790 964 810 676 509 298 442 753 868 778 871 637 382 423 498 729 866 914 725 599
48E99l34J5J75L13J09n7J2k31k79j1K36M40L6j41j08m05k08K67K41K65pO9l16l24j76L61K96
$$ 599 265 280 455 768 877 820 832 601 322 311 547 987 1023 882 774 369 161 428 669 934 927 996 680 356 180 541 837
-205H37K61oj47k03l96Q2J68L96L48j01nn25k75J12L53M14K65n4o3l62
$$ 837 1098 1092 945 742 346 428 596 992 1340 1239 1234 709 434 546 899 1313 1578 1524 1461 1099
-393A099
$$ 1099
##PAGE=	F1=-439.807
##FIRST=	4405.4455391999963467,	4405.4455391999963467,	0
##DATA TABLE=	(F2++(Y..Y)), PROFILE
4405I75l23M09K71M64J24o9m82l31m78L1L40N15J46j10l40l82n54K72N33J96J93l6o32p6m46
$$ 975 652 1061 1332 1796 1920 1851 1369 1038 560 591 931 1446 1592 1482 1142 760 206 478 1011 1207 1400 1364 732 656 210
4171B10L40L27M40k3k45k59n77M9L62L63J91jk50j94n54K24K50L41L01j78k87l98p1K53K80
$$ 210 550 877 1317 1294 1049 790 213 262 624 987 1178 1177 927 733 179 403 653 994 1295 1117 830 432 361 614 894
3936H94K06m7j16k91j31j39K06K86J41Q6j58l16k43J04J31M84Rj70p6k33k81L22J81Q3J76
$$ 894 1100 1053 937 646 515 376 582 868 1009 1095 937 621 378 482 613 1097 1106 936 860 627 346 668 849 932 1108
3701A108j60j8m51n9L45l6L23p3k2j93l24J54Q3K44K66j29k13k30oP2K17j2M9J81l53o7j94
$$ 1108 948 930 479 420 765 729 1052 979 957 764 440 594 677 921 1187 1058 845 615 609 681 898 886 935 1116 763 696 502
3448E02K04K92P4rn9k15l13J25J87J00K75j33j62j36L3q0K64K4L19l02j7j58m6R4J57J24L3
$$ 502 706 998 1072 1063 1004 789 476 601 788 888 1163 1030 868 732 765 685 949 973 1292 990 973 815 769 863 1020 1144 1177
3194A177k6n58L48k84K98R3N5J73k22k47J1J22j1K46Jo3m08J814j164k50k4J58O6j57j59r3
$$ 1177 1151 593 941 657 955 1048 1103 1276 1054 807 818 940 929 1175 1176 1113 705 2519 1355 1105 1081 1239 1305 1148 989 896
2950H96K04q6k7J969n65j19p42l96%J73J33l5o6j56q8J82j97L87P9N7l42J74j75P1J59J15
$$ 896 1100 1014 987 2956 2391 2272 1530 1134 1134 1307 1440 1405 1339 1183 1095 1277 1080 1467 1546 1603 1261 1435 1260 1331 1490 1605
2706A605J18r4j56M44q06K25L45K9K09m17J45k0N0r2L59l6n4Kkp6N4L08n6L7L5n3j66K82q5
$$ 1605 1723 1629 1473 1917 1111 1336 1681 1710 1919 1502 1647 1627 1677 1585 1944 1908 1854 1856 1854 1778 1832 2140 2084 2121 2156 2103 1937 2219 2134
2434B134N6J71L6J86k14L01j10J84R9m2NO2K12J14L6J17K2M2J12K81J04L54K5J88j49J48J85
$$ 2134 2190 2361 2397 2583 2369 2670 2560 2744 2843 2801 2806 2868 3080 3194 3230 3347 3369 3411 3523 3804 3908 4262 4287 4475 4326 4474 4659
2180D659N40M10N67M4O1j97L77R57J139J694Q26P6m52q61L018M953Q479J2060J5633K3196
$$ 4659 5199 5609 6176 6220 6281 6084 6461 7418 8557 10251 11077 11153 10701 9840 12858 17811 26290 38350 53983 77179
1992G7179P6572J058371k94177q66484l8309R581L394j161l341m221m258l284j356K05K42
$$ 77179 153751 1212122 917945 51461 13152 22733 26127 24966 21625 17404 13146 9862 8506 8711 8953
1851H953P9o24r82r61p61j75L1j12J21n27l05n60r8O8k00M3n2l96O4l73m0O2j94J15k80o1
$$ 8953 9032 8408 7426 6465 5704 5529 5560 5448 5569 5042 4737 4177 4079 4147 3947 3990 3938 3542 3606 3233 3193 3255 3061 3176 2896 2835
1607B835qj44O1j25L8j29l6j53J12J39K69L85k73o49n77J61l3K87q6j68j43n6k4p6K33N4m5
$$ 2835 2827 2683 2744 2619 2657 2528 2492 2339 2451 2590 2859 3244 2971 2322 1745 1906 1873 2160 2074 1906 1763 1707 1683 1607 1840 1894 1849
1354A849k83R8j27p5J49N5J25k24j15l38K89L3j16M87l49k35K15k05J0J00j12K83r6j32j00
$$ 1849 1566 1664 1537 1462 1611 1666 1791 1567 1452 1114 1403 1436 1320 1807 1458 1223 1438 1233 1243 1343 1231 1514 1418 1286 1186
1119A186q6J14R9Q7q0m9j52p0m5J85j44M93k18j78k00p7NK95M7P8j30r2j35K1j17K38o7L39
$$ 1186 1100 1214 1313 1400 1320 1271 1119 1049 1004 1189 1045 1538 1320 1142 942 865 870 1165 1212 1290 1160 1068 933 954 837 1075 1008 1347
856A347j53m85J80k88M15K3K39j83k8k75j44K56J60m8O4j7j07j49k7J6K6N11k71j10j25l01
$$ 1347 1194 709 889 601 1016 1039 1278 1095 1067 792 648 904 1064 1016 1080 1063 956 807 780 796 822 1333 1062 952 827 526
612E26R6J50L24j60J85j53l88J96j11J61M84m03O1p2l05pML10J21N5o1L1o53M50j99M42l7
$$ 526 622 772 1096 936 1121 968 580 776 665 826 1310 907 968 896 591 584 588 898 1019 1074 1013 1044 391 841 642 1084 1047
358A047k8k19k24j27K35LM22j8q1k01l56q4J97L93K03r9j87k56k53J53M35J24j13J67l32l62
$$ 1047 1019 800 576 449 684 687 1109 1091 1010 809 453 369 566 959 1162 1063 876 620 367 520 955 1079 966 1133 801 439
114D39M7J14L16J82P4k73j53l89K6K32L45J39n7j5l16l45K3L02M88O7j34j81m28l21L24L35
$$ 439 486 600 916 1098 1172 899 746 357 383 615 960 1099 1042 1027 711 366 389 691 1179 1246 1112 931 503 182 506 841
-130H41L21L5K5l56m34k39M63M00L21J6k23k68n03P3K88N07L95r8q0n76l68J15M90M62L57
$$ 841 1162 1197 1222 866 432 193 656 1056 1377 1393 1170 902 399 472 760 1267 1662 1564 1484 908 540 655 1145 1607 1964
-365A964j3j50m19
$$ 1964 1951 1801 1382
-393A382
$$ 1382
##PAGE=	F1=-458.587
##FIRST=	4405.4455391999963467,	4405.4455391999963467,	0
##DATA TABLE=	(F2++(Y..Y)), PROFILE
4405A064l29L82L97M50J52o7n06m12n25J9M42N14J74r7m15m01o28K87O29K21J78j7o81j48
$$ 1064 735 1117 1514 1964 2116 2049 1543 1131 606 625 1067 1581 1755 1658 1243 842 214 501 1130 1351 1529 1512 831 683
4180F83m84M48K86N47r4k14l05n87K9L84M02K29o6k48j95n86K58K29L73L50j90l42m34k7K25
$$ 683 199 647 933 1480 1386 1172 867 280 309 693 1095 1324 1258 1010 815 229 487 716 1089 1439 1249 907 473 446 671
3945F71K86K65l0j65k94j47j61K24L67J22Qj11l53k59Q4K18M72l1p7j73j93l07K79K38J29
$$ 671 957 1222 1192 1027 733 586 425 649 1016 1138 1146 1035 682 423 507 725 1197 1166 1089 916 723 416 695 933 1062
3711A062J62j93J5n14j8L11j4L60p9rk53l53J61J50J98L22r7k91k13r1J67J89M4M5J31l58
$$ 1062 1224 1031 1046 532 514 825 811 1171 1092 1083 830 477 638 788 986 1308 1211 920 707 616 783 972 1016 1061 1192 834
3466H34p9j95K21L14Q9k3p8k13l44J36K44J03K53q8k01j65oj6L02j9L12k53n2j97n3J58J76
$$ 834 755 560 781 1095 1184 1161 1083 870 526 662 906 1009 1262 1174 973 808 802 786 1088 1069 1381 1128 1076 879 826 984 1160
3213A160R2J9Jo28L70k45K75J54M1J64k58k39%J47J1K37Rq9m31J477r25j03nJ45O6r9k29l8
$$ 1160 1252 1271 1272 644 1014 769 1044 1198 1239 1403 1145 906 906 1053 1064 1301 1310 1221 790 2267 1342 1239 1234 1379 1445 1346 1117 1079
2950A079J17l4j5J917p55L77j061m28M6J80J56k0j05j40q0J54j55L96Q6O2l78J54j38KK70
$$ 1079 1196 1162 1147 3064 2309 2686 1625 1197 1243 1423 1579 1559 1454 1314 1234 1388 1233 1629 1715 1777 1399 1553 1415 1417 1687
2715A687J39Q6N8m94N92j023M08L80O6J75l71J24o7Q1r6M01k3p1j5j3l1QL70m6L0N7j12j38
$$ 1687 1826 1912 1970 1476 2068 1045 1453 1833 1899 2074 1703 1827 1760 1841 1745 2146 2123 2052 2037 2024 1993 2001 2371 2325 2355 2412 2300 2162
2452B162L01p7O7J69M9J41j59L31j35J61J39k9oO5K70M6J29O5L9Q6N6L68Q5L98N7J81k28K65
$$ 2162 2463 2386 2453 2622 2671 2812 2653 2984 2849 3010 3149 3120 3114 3179 3449 3495 3624 3689 3728 3814 3870 4238 4323 4721 4778 4959 4731 4996
2189D996K06N85M56N87Q0N1k10M24J058J271J846R28R1m98q39L507N315R383J3133J7162K5734
$$ 4996 5202 5787 6243 6830 6910 6961 6751 7175 8233 9504 11350 12278 12369 11871 11032 14539 19854 29237 42370 59532 85266
1992H5266Q4763J172481l24660r61007m2133J0639L839j449l826m482m895l523j558K36K52
$$ 85266 170029 1342510 1017850 56843 14710 25349 29188 27739 23913 19431 14536 11013 9455 9691 9943
1851I943Q8p32j044j078q53j72Mp0O4n48k99o67q0P3j87l6qm73O8l88mM7k13Q5l05q2M4k35
$$ 9943 10031 9299 8255 7177 6324 6152 6156 6086 6150 5602 5303 4636 4556 4629 4442 4406 4398 3925 3993 3605 3601 3648 3435 3520 3215 3133 3177 2942
1588B942J32j41O6j67p2r1M6K37J67L29O21k396J71K87K2J28k4j89r0p9l9r9L00qrk92R3j83
$$ 2942 3074 2933 2999 2832 2760 2669 2715 2952 3119 3448 4069 1673 1844 2131 2153 2281 2257 2068 1978 1899 1860 1761 2061 2053 2044 1752 1845 1662
1326A662n7K12M7J07k68j25k99K49N0q3N00l43l00K35j83l5P0m6K82j05j44j30o7J02R8J25
$$ 1662 1605 1817 1864 1971 1703 1578 1279 1528 1578 1495 1995 1652 1352 1587 1404 1369 1439 1393 1675 1570 1426 1296 1229 1331 1429 1554
1081A554j09l4k14j1p9K15j52N04k44j80j75r2QL42m9J52j07j85j03K5r7K01l3L73k12m71
$$ 1554 1445 1411 1197 1186 1107 1322 1170 1674 1430 1250 1075 983 991 1333 1284 1436 1329 1144 1041 1066 969 1170 1137 1510 1298 827
837H27J44k34L67L1K78k10j3l35j16K28J45P1QM3k11j37k2M7qN24k15j56j60k91R9J82K88
$$ 827 971 737 1104 1135 1413 1203 1190 855 739 967 1112 1183 1191 1234 1023 886 864 911 903 1427 1212 1056 896 605 704 886 1174
584A174j18J67j56l96J55k2Q2N63m30N0q7l22k9O5L51Q9R8j39j51l41R6N0L96M5q6j55l45
$$ 1174 1056 1223 1067 671 826 804 886 1449 1019 1069 982 660 631 696 1047 1136 1234 1095 944 603 699 749 1145 1190 1104 949 604
330F04r7K04Q9L95k1k6k62l66j28K63L94J92j3k33l27k60J41N12J33j42K33l97m38N2J30L93
$$ 604 507 711 800 1195 1174 1148 886 520 392 655 1049 1241 1228 995 668 408 549 1061 1194 1052 1285 888 450 502 632 1025
86A025K09P3l13j77m01K9K59L54J58o4k2l64l75M2L30N04R5j48k13m15l97L54L80L58O3ol65
$$ 1025 1234 1307 994 817 416 445 704 1058 1216 1152 1130 766 391 433 763 1267 1362 1214 1001 586 189 543 923 1281 1344 1338 973
-167I73n10k75N16M80L30M6k89k88n57N3L69N79M00r7j37n78m08Q6O01M51M16K3k10m55
$$ 973 463 188 704 1184 1514 1560 1271 983 426 479 848 1427 1827 1730 1593 1015 607 693 1294 1745 2161 2184 1974 1519
-393A519
$$ 1519
##PAGE=	F1=-477.367
##FIRST=	4405.4455391999963467,	4405.4455391999963467,	0
##DATA TABLE=	(F2++(Y..Y)), PROFILE
4405A042l02L04M94L72J61m9m83m29n20J1M75M75J67o7m44l71o22K49O69K09J46K1o88j82
$$ 1042 740 1044 1538 1910 2071 2022 1539 1110 590 601 1076 1551 1718 1651 1207 836 214 463 1132 1341 1487 1508 820 638
4180F38m76M97K31N88j38j79l12n52J4L87L78K45j23k13j69n58K69J73L41L99j88l82m11K5
$$ 638 162 659 890 1478 1340 1161 849 297 311 698 1076 1321 1198 985 816 258 527 700 1041 1440 1252 870 459 484
3955D84J81K44K93mj95k69j31j72K14L95J08o5o2l53k55P3K56M30q3K2k31j47k80J89K67J71
$$ 484 665 909 1202 1198 1003 734 603 431 645 1040 1148 1083 1021 668 413 486 742 1172 1089 1111 880 733 453 642 909 1080
3711A080J19j91L6n21L2K35pL90r2J7k97l38J42K10J15L68p1l32j66j64K23J60P7M0P6l37
$$ 1080 1199 1008 1044 523 555 790 783 1173 1081 1098 801 463 605 815 930 1298 1227 895 729 565 788 948 1025 1065 1141 804
3466H04o6j92K34K83J05m4p3k07l35J45K65J00K07m9k18j57n6N9L03o7K83j90o5k38k9J89
$$ 804 738 546 780 1063 1168 1124 1051 844 509 654 919 1019 1226 1177 959 802 746 805 1108 1041 1324 1134 1069 831 802 991
3222I91J65O9MJ1o06L43j92K41J81K6J39k58k12j7J66K3K12J6j00m16J004n42qPJ01P7k9k89
$$ 991 1156 1225 1229 1240 634 977 785 1026 1207 1233 1372 1114 902 885 1051 1074 1286 1302 1202 786 1790 1248 1240 1247 1348 1425 1396 1107
2959A107K5K5J2Q5J595q59Q17j255m18Q1J70J52j5j02j19p7J10q6L66O3Q6l81J16q7q0L69
$$ 1107 1132 1157 1169 1254 2849 1990 2807 1552 1134 1215 1385 1537 1522 1420 1301 1224 1334 1248 1614 1677 1763 1382 1498 1411 1331 1700
2715A700J46L9J79p42O07r34M21L83Q8J21k87P6j04J28j27M16rp8np8N3l9L92n4L2P5j49j04
$$ 1700 1846 1885 2064 1322 1929 995 1416 1799 1887 2008 1721 1797 1693 1821 1694 2110 2101 2023 2018 1940 1993 1954 2346 2292 2324 2399 2250 2146
2452B146K87n9N6J62N0R8j08L45j51J09J73nl6N8L11l2J90M4M3J15j2M24L1M19N8J85l01L50
$$ 2146 2433 2374 2430 2592 2642 2740 2632 2977 2826 2935 3108 3103 3067 3125 3436 3404 3594 3638 3681 3796 3784 4208 4239 4658 4716 4901 4600 4950
2189D950K12N61M58N33J16L4k12M42J022J286J796R28R7m90p83L110N542R285J2748J6760
$$ 4950 5162 5723 6181 6714 6830 6864 6652 7094 8116 9402 11198 12126 12223 11733 10950 14060 19602 28887 41635 58395
2002E8395K5301Q3457J153840l18577r46501m1337J0505L933j631l802m479m789l412j572
$$ 58395 83696 167153 1320993 1002416 55915 14578 25083 29016 27385 23583 19104 14315 10903 9331
1870I331K49K19R2p60r78j085q28j69j1l0kn04k69o81o0P4j66j00M4m99N7l56J8L6k11M7k80
$$ 9331 9580 9799 9891 9131 8153 7068 6240 6071 6060 6030 6028 5524 5255 4574 4514 4588 4422 4322 4366 3867 3924 3568 3586 3622 3411 3458 3178
1617C178j24J18l09J76j29P1j64j11m8mK79N7M14O75k612L57L82Mn0N7j92m0r2n3j15L33o1
$$ 3178 3054 3172 2863 3039 2910 2981 2817 2706 2658 2654 2933 2990 3404 4079 1467 1824 2206 2210 2160 2217 2025 1985 1893 1840 1725 2058 1997
1363A997J8k71Q3k14m7K57L4R0l08j09k40K04O7p1M84l15l30K40j47r0N6QK59j09j31j46o1
$$ 1997 2015 1744 1827 1613 1566 1823 1857 1947 1639 1530 1290 1494 1561 1490 1974 1659 1329 1569 1422 1332 1388 1396 1655 1546 1415 1269 1208
1110A208J08P6J39j25j1k55N9j17K52j92N01k51j92j18q7QL50j57K44r2k60o2M8q9J52oL68
$$ 1208 1316 1392 1531 1406 1395 1140 1199 1082 1334 1142 1643 1392 1200 1082 995 1003 1353 1196 1440 1348 1088 1026 1074 985 1137 1131 1499
856A499k33m21J03j52K88J5K92k23J8l58q4J84J06J98p7J03k67j10k5O7m7M86j38j84j76k47
$$ 1499 1266 845 948 796 1084 1099 1391 1168 1186 828 744 928 1034 1232 1155 1258 991 881 856 923 876 1362 1224 1040 864 617
612F17Q8J83K34n6J12j44l38R3O7J0N48m03M7j00l11l4J07L49N5J30l05o7k60n9K20K92J31
$$ 617 705 888 1122 1066 1178 1034 696 789 856 866 1414 1011 1058 958 647 613 720 1069 1124 1254 949 882 622 563 783 1075 1206
358A206j21j13l87p4J60J53L31l0M2l00l43j58L07L61J42R1k64l65k29J11N29J37j71K75m13
$$ 1206 1085 972 585 511 671 824 1155 1125 1167 867 524 366 673 1034 1176 1267 1003 638 409 520 1049 1186 1015 1290 877
124H77m69N8J19M51K03M4k91k01l60K2K50L35J58p8jl65l62M6L06M83J17j79k04l53m24L46
$$ 877 408 466 585 1036 1239 1283 992 791 431 453 703 1038 1196 1118 1117 752 390 436 742 1225 1342 1163 959 606 182 528
-121E28L64L66P8k3l42n31k80N13N10K90Q5l36k63n32K0L90N95L59r3j67n28l79K2O62L84
$$ 528 892 1258 1336 1313 971 440 160 673 1183 1473 1558 1222 959 427 447 837 1432 1791 1698 1531 1003 624 646 1308 1692
-355A692M27M7k24m69
$$ 1692 2119 2166 1942 1473
-393A473
$$ 1473
##PAGE=	F1=-496.147
##FIRST=	4405.4455391999963467,	4405.4455391999963467,	0
##DATA TABLE=	(F2++(Y..Y)), PROFILE
4405I13k48J92N44K46J49j8m17l86m58%M42M04J26k3m27k92n43J69O44J64J00P4o53j70m20
$$ 913 665 857 1401 1647 1796 1778 1361 975 517 517 959 1363 1489 1466 1039 747 204 373 1017 1181 1281 1355 702 532 112
4171A12M73J73N50j42j49k75m82J0L68K95K39j66j47j26m68K51R1K55M38j75l97l36P3J36
$$ 112 585 758 1308 1166 1017 742 260 270 638 933 1172 1006 859 733 265 516 607 862 1300 1125 728 392 465 601
3945F01J57K85K4j99k15q7j69J73L67J05j29j7l16k31P4K41L64j38J10k41j03k03O5K63K02
$$ 601 758 1043 1067 868 653 566 397 570 937 1042 913 896 580 349 423 664 1028 890 1000 759 656 453 518 781 983
3711I83N9j61M9m78Q0J37j3M02j08M3l10k83J00K56RL94n5l32r2k13K32J31Q8K4K7k96k3j89
$$ 983 1042 881 930 452 532 669 656 1058 950 993 683 400 500 756 765 1159 1104 772 680 467 699 830 918 942 969 673 650 461
3448D61K39K07J24p3m2k01k90J49K53Q9J47k6k04j23j01J28K72j14K38j26n4k73K0J86J23
$$ 461 700 907 1031 958 916 715 425 574 827 916 1063 1037 833 710 609 737 1009 895 1133 1007 953 680 700 886 1009
3213A009N4JJn03K78j40J99J79PJ06k22j75l7J75K4J77J8r4l64N07q7pRM1R8L2l22Q6n8M2
$$ 1009 1063 1064 1065 562 840 700 899 1078 1085 1191 969 794 757 932 956 1133 1151 1057 693 1200 1113 1106 1115 1156 1254 1286 964 1050 992 1034
2931A034J92J133p71J005j252l86J04J40J26k3o2r1q6O5kK94J9J27l53O4k4j67M42J31j7K31
$$ 1034 1226 2359 1588 2593 1341 955 1059 1199 1325 1302 1240 1149 1063 1128 1126 1420 1439 1566 1213 1277 1253 1086 1528 1659 1642 1873
2687A873p82M00n23K70L45Q7O5j77Mj21J77j74M00Mp1K0j73J54p9L74p9M0Q1j50p5K48l7K0
$$ 1873 1091 1491 968 1238 1583 1670 1735 1558 1562 1441 1618 1444 1844 1848 1777 1797 1624 1778 1699 2073 1994 2034 2115 1965 1890 2138 2101 2121
2424B121J58L5O8p2L41j51L0K02K1p6L8L35j10K09N4L4J29q6M37m4M11L1J93l48L87K05M66
$$ 2121 2279 2314 2382 2310 2651 2500 2530 2732 2753 2677 2715 3050 2940 3149 3203 3237 3366 3280 3717 3673 4084 4115 4308 3960 4347 4552 5018
2171E018M17M18J45Qj94M20Q58J172J554Q15R2m15o41K222N250Q180J0995J4532K2006P2986
$$ 5018 5435 5853 5998 6006 5812 6232 7090 8262 9816 10631 10723 10308 9667 11889 17139 25319 36314 50846 72852 145838
1983A45838J007086k77439q26582l6116R205L672j646l231m418l809l000j404K34J65Q8p04
$$ 145838 1152924 875485 48903 12787 21992 25664 24018 20787 16369 12560 9560 8156 8390 8555 8643 7939
1833G939p92r84o96j65j8J0o3m10k16n99m0O3j35j40R6m67L1k87K9K2j84Qk07j84K04l56J90
$$ 7939 7147 6163 5467 5302 5284 5294 5231 4821 4605 4006 3966 4029 3894 3754 3850 3383 3414 3127 3156 3178 2994 3002 2795 2611 2815 2459 2649
1579B649r6N6j24j40m3k3K65l9N96m12j237L05K97l7j90J33j74Lj00o0j24L30r5L5k35P8k27
$$ 2649 2553 2609 2485 2345 2302 2279 2544 2505 3101 2689 1452 1757 2054 2017 1827 1960 1786 1789 1689 1629 1505 1835 1740 1775 1540 1618 1391
1326A391l3K70J9P7l33p1j78J69P1p0M37k70l22K33j08j41N7M4K10j00r8j46p1J36L7J25j23
$$ 1391 1358 1628 1647 1724 1391 1320 1142 1311 1382 1312 1749 1479 1157 1390 1282 1141 1198 1242 1452 1352 1254 1108 1037 1173 1210 1335 1212
1072A212J6k66J21j47K86k53M83k40k12l6o6QL12k51L36r1k98k1Q6r3R2J4L31k23l39O8o1
$$ 1212 1228 962 1083 936 1222 969 1452 1212 1000 964 898 906 1218 967 1303 1212 914 893 979 886 978 992 1323 1100 761 829 768
818G68J87j7K75k12N5l38n3J31M8L09j78J58k68p9k5O2p0M01n4j98j63j72N2J59J68J7L1j13
$$ 768 955 938 1213 1001 1056 718 665 796 844 1153 975 1133 865 786 761 823 753 1154 1100 902 739 567 619 778 946 963 994 881
556H81k40M3J25l3M41l32N2j07k74k3J20L04K8J40m82J47l64P0K37J56J97j19r8l51n4J09
$$ 881 641 684 809 776 1217 885 937 830 556 533 653 957 985 1125 643 790 426 496 733 889 1086 967 869 518 464 573
311E73J83K42m3J06l06k86j75L29K90P0J89k76l61j67O9M86J34j94K82l72m51N9R4M71J67
$$ 573 756 998 955 1061 755 469 294 623 913 983 1172 896 535 368 437 923 1057 863 1145 773 322 381 475 946 1113
77A113qk09k26k67NK04K93J39j00M8l22l12M2K32M24J35k19j65k40m00K94K93L40Q4k9k86
$$ 1113 1105 896 670 403 408 612 905 1044 944 992 670 358 400 632 1056 1191 972 807 567 167 461 754 1094 1178 1149 863
-167H63m97k57M64M78K11J27l54k05m28k3L53N46K84q3j71m30k92o5O60K80L87N6j89m62
$$ 863 366 109 573 1051 1262 1389 1035 830 402 379 732 1278 1562 1479 1308 878 586 521 1181 1461 1848 1904 1715 1253
-393A253
$$ 1253
##PAGE=	F1=-514.927
##FIRST=	4405.4455391999963467,	4405.4455391999963467,	0
##DATA TABLE=	(F2++(Y..Y)), PROFILE
4405G07j80P1N39J00J18K1l21l03l46k0L58L17O0K7l71j77m16P1N60R8M6J31n84j17l22L83
$$ 707 527 598 1137 1237 1355 1376 1055 752 406 386 744 1061 1121 1148 777 600 184 255 815 913 959 1090 506 389 67 450
4161D50J16M41j03j30k04l91K3L24J73K20j98o4p5l26K04lJ37M57j48l88k28J01J07M3K43
$$ 450 566 1007 904 774 570 179 202 526 699 919 721 657 582 256 460 457 594 1051 903 515 287 388 495 538 781
3927G81N0j77j38l1j54J10K96J14j78J4k47j95Q5J82K91j92J76k08o7q8o9K27K15j0j08N4
$$ 781 831 654 516 485 331 441 737 851 673 687 440 245 330 512 803 611 787 579 512 424 355 582 797 787 679 733
3682G33l99J18M2l0L90j24O0k88k00L9K90j00L91m9k94nk27J99J01Q3j0mk45L7j81K32J05
$$ 733 334 452 494 464 854 730 790 502 302 341 631 531 922 873 579 574 347 546 647 730 720 716 471 508 327 559 664
3429F64J41j02Qk01k18J48K18O7Q8k4j59q0j27J74K18j54J90p1k6k91Q3J54N3N0J8k9l47J90
$$ 664 805 703 711 510 292 440 658 725 813 789 630 550 423 597 815 661 851 780 754 463 546 700 753 803 821 792 445 635
3166F35j02J58J53j4P3j58j37n6J73J5J38J4p6k84R3L49j01mj4J21O8l20J38j23N0K63O51
$$ 635 533 691 844 830 903 745 608 552 725 740 878 892 816 532 625 974 873 869 855 976 1044 724 862 739 789 1052 1703
2912A703m67Q45j027l55J18R1Q7l7on5j11L3Q4J91l4J79l05OM0k44M78R8p3K06o00L7L4M4
$$ 1703 1236 2081 1054 699 817 908 995 958 952 897 786 819 903 1094 1060 1239 934 940 980 736 1214 1312 1239 1445 845 882 916 960
2650I60K72O2K2n3q3j14K08k18L53J2m3M6k70K51j10L23j14N0P4j15n6J93j4l3J56J0N3n8
$$ 960 1232 1294 1316 1263 1180 1066 1274 1056 1409 1421 1378 1424 1154 1405 1295 1618 1504 1554 1628 1513 1457 1650 1636 1603 1759 1769 1822 1764
2387A764L21j32o3K25L8j14RL38j73J84R5J1J29j57M05j16L68j1J97l52L65J92L14L50K69
$$ 1764 2085 1953 1890 2115 2153 2039 2048 2386 2213 2397 2492 2503 2632 2475 2880 2764 3132 3121 3318 2966 3331 3523 3837 4187 4456
2152D456J58k1j59L58O15R44J182O07P9k86m23J267M302O321Q292J1021J6658N5904P68029
$$ 4456 4614 4593 4434 4792 5407 6351 7533 8140 8219 7933 7510 8777 13079 19400 27692 38713 55371 111275 879304
1973H79304k11243o30558k7725P050L131j470k198m512k056k407j109J90J19P1n75n30q02
$$ 879304 668061 37503 9778 16828 19959 18489 16291 11779 9723 7316 6207 6397 6516 6587 6012 5482 4680
1814D680m87j63k3N6j11k91j44m48k1L6r0j55J38l82rj99L5Kj37k6r9k49K83l64J71n0L0p0
$$ 4680 4193 4030 4007 4063 3952 3661 3517 3069 3048 3084 2994 2839 2977 2595 2586 2387 2422 2424 2287 2261 2162 1913 2196 1832 2003 1953 1983 1913
1551A913j42p5j0K20j09Q01j411L96Q5k0l9k56J85j40M1j09o2j19K93j05M8j98Q3k32nK45
$$ 1913 1771 1696 1686 1906 1797 2598 1187 1583 1668 1648 1609 1353 1538 1398 1439 1330 1268 1149 1442 1337 1385 1187 1270 1038 1033 1278
1307A278NO9l40rj27J48N7p5L67k15k80K13p4j75O8O2J36p2n6j31r1J76j1R1j02L6k44J61
$$ 1278 1283 1352 1012 1003 876 1024 1081 1006 1373 1158 878 1091 1017 842 910 972 1108 1036 980 849 758 934 923 1014 912 948 704 865
1044H65j59L06l18M46k08k35N5l6J0K30l07M11j05k90J1J28j03K4L0K73j90k43M8K1Q0n4K29
$$ 865 706 1012 694 1140 932 697 752 716 726 956 649 1060 955 665 676 804 701 725 755 1028 838 595 643 664 744 690 919
790I19j76Q7k77k7P5j6L83k75J99k14o1j1K1n8K84K3k05j24p1j4J26R8Q5n7o4j34K9J32m1
$$ 919 743 830 553 526 601 585 968 693 892 678 617 606 627 569 853 876 671 547 476 462 588 686 771 714 650 516 545 677 636
518F36K78k48P2j13k07nJ00K27J0J27n08K88n63L78J35J9K33q5j10k50l3O4J70J42n4J52k84
$$ 636 914 666 738 625 418 413 513 740 750 877 369 657 94 472 607 626 859 774 664 414 381 445 615 757 703 855 571
264E71j99j81L29J91mK59k67l18q8K4M01J22k07K53k86l89N0P2M45J08o8q7k52j34k2J33K38
$$ 571 372 191 520 711 707 966 699 381 293 317 718 840 633 886 600 211 261 333 778 886 818 731 479 345 323 456 694
11F94J01j24J15k48k39L9J23L32J52k55j12r4l38K12J84K83Q5k5k10m18k17L90L89J10J69
$$ 694 795 671 786 538 299 338 461 793 945 690 578 484 146 358 542 825 910 885 675 257 40 430 819 929 1098
-224A098l44j33k63o8K74M33J98o7j59k96j68j52N87J68L05M7j11m39
$$ 1098 754 621 358 290 564 997 1195 1128 969 673 505 353 940 1108 1413 1460 1349 910
-393I10
##PAGE=	F1=-533.707
##FIRST=	4405.4455391999963467,	4405.4455391999963467,	0
##DATA TABLE=	(F2++(Y..Y)), PROFILE
4405D72j19k6M84l6P3N9k12k07k06m3K45K28j0O7k89n0k73j5M30K8qJ84m89m5j96K46O3K89
$$ 472 353 327 811 775 848 907 695 488 282 239 484 712 702 769 480 430 157 142 572 600 592 776 287 242 46 292 355 644
4143F44l3j27j09k96O6K46L5J97k17J8k9j60J41r1J3M55j10l66j02R7R9p6J81O8j28n7J8j28
$$ 644 611 484 375 79 145 391 426 623 406 424 395 235 376 285 298 753 643 277 175 272 371 295 476 544 416 359 377 249
3880B49M0K07J25k10K9j63j55J05J01K19k26K05j43n0M2j56J41K08p6m3M9l02J38l0m6L53
$$ 249 289 496 621 411 440 277 122 227 328 547 321 526 383 333 375 219 360 568 492 449 498 196 334 304 258 611
3635F11j36N9k36j08k5L06j88L56n2k26P7j97J31O4P9o7j3j94J02j66K09MJ52j22O1k02j38
$$ 611 475 534 298 190 165 471 283 639 587 361 438 241 372 436 515 448 435 241 343 177 386 390 542 420 481 279 141
3382A41J47J68L5M0l8r3m6j22J86J55j79J44l2Qk74J42R6l1N5N5o9j80R9q2J24J16l5M4q3
$$ 141 288 456 491 531 493 400 354 232 418 573 394 538 506 514 240 382 478 447 502 557 488 308 407 325 449 565 530 574 491
3110D91j07p0J63jJ05Ln6j85j68O59k38l4l8J34O9k81J74j67L9K85K34l5M04o27l34J31K9
$$ 491 384 314 477 476 581 584 528 343 175 834 596 562 524 658 727 446 620 453 492 777 1011 976 1380 753 419 550 579
2856E79M8n4M8j9j42J8J56P9q5K35k51m8R4k95M74M7j11J26l04j52L79j81J76K5LO5j70r0
$$ 579 627 573 621 602 460 478 634 713 628 863 612 564 658 363 837 884 773 899 595 443 822 641 817 842 845 910 740 650
2593F50K12k39K85J1LN7l39L24j27K44j41N2N7n6m3J32Pr2J54j7N3o6K87r4j53K42L6j41k0
$$ 650 862 623 908 919 922 979 640 964 837 1081 940 992 1049 993 950 1082 1089 997 1151 1134 1187 1121 1408 1314 1161 1403 1439 1298 1278
2321A278L22k10J26J52k3J23k13L31j63K96n5J94l12K95J74J39K71J25J48n2j08K66L56O47
$$ 1278 1600 1390 1516 1668 1645 1768 1555 1886 1723 2019 1964 2158 1846 2141 2315 2454 2725 2850 2998 2946 2838 3104 3460 4107
2095D107P72L39P2j32k24N70K869M133N254P034J0508L6173M92209j35278m04072j8073M539
$$ 4107 4879 5218 5290 5158 4934 5504 8373 12506 17760 24794 35302 71475 563684 428406 24334 6261 10800
1936A0800K434j120q83m785M6j791p74J30J05M0m05k50n84k48j66k8J07j40j74o5k70njl4
$$ 10800 13234 12114 11231 6446 6492 4701 3927 4057 4162 4202 3797 3547 2963 2715 2549 2521 2628 2488 2314 2249 1979 1974 1973 1939
1711A939j46J59k61n6j12M1k8p6n0J9l03L40l34J28oNk1j09j29K5J71j48Q90k54k01M4m66
$$ 1939 1793 1952 1691 1635 1523 1564 1536 1460 1410 1429 1126 1466 1132 1260 1254 1259 1238 1129 1000 1025 1196 1048 1938 1684 1483 1527 1061
1457A061J8k47J96r2P9j21o4r4K33r6O2j75J01k33M5J81j1O8l24O6r3J38K4p7K82j56k15J84
$$ 1061 1079 832 1028 936 1015 894 830 736 969 873 935 760 861 628 673 854 843 911 587 653 560 698 722 645 927 771 556 740
1194G40n5j80Q0O8M0k2k0j06j09K19o2M7o2M0j93J68j46L05l71L92j60k53J37jJ3J15l11M56
$$ 740 685 505 585 653 693 671 651 545 436 655 593 640 578 618 425 593 447 752 381 773 613 360 497 496 509 624 313 769
931G69j34k37K7J65j10m4M2K04j45j49M9P3j4q1J60j18J06j91j1K5o9M06l50K23j24o1J6n0
$$ 769 635 398 425 590 480 436 478 682 537 388 437 510 496 415 575 457 563 372 361 386 317 723 373 596 472 411 427 377
668C77nJ53Q3k12o2M1j03R6K9J39j36km0N3Q3k3J18j88J06j12j17NM9J39JR7j83J58k87J88
$$ 377 372 525 608 396 334 375 272 368 397 536 400 398 358 411 494 471 589 401 507 395 278 283 332 471 472 569 386 544 257 445
387D45j3r2K37l2j37j15j3M2J13M8n5J69k46q8j83L07Q1n5K83k37k52pj3K94J02k09J98j73
$$ 445 432 340 577 545 408 293 280 322 435 483 428 597 351 263 80 387 468 413 696 459 207 200 187 481 583 374 572 399
124C99l00K5Q8L58M6j28M7k69J5o2O0J77M8j44J84j60j62M1RK20J69k78o5O1k55J17P1J97
$$ 399 99 124 212 570 616 488 535 266 281 219 279 456 504 360 544 384 222 263 272 492 661 383 318 379 124 241 312 509
-139E09R0j7j31l14q6K32K59OK08l11o6p9j03J85K69J23m6j42j45m1k02M42P2J99K7j2m01
$$ 509 599 582 451 137 51 283 542 548 756 445 379 300 197 382 651 774 728 586 441 400 198 640 712 911 938 926 525
-393E25
##PAGE=	F1=-552.487
##FIRST=	4405.4455391999963467,	4405.4455391999963467,	0
##DATA TABLE=	(F2++(Y..Y)), PROFILE
4405B57p8o6L79j34K3Q8j10j21o0n2J11J47n7Q2j99O5j49n0K65k9n6K25l41j9p4J10J3J28
$$ 257 179 113 492 358 381 469 359 238 178 126 237 384 327 409 210 275 126 76 341 312 256 481 140 121 47 157 170 298
4143B98M8j41qj38Q3J22r3J86k29Q0JjP7j55q7M29o7l39K8N3J03j73J19O9m8%M6r7j3J30J23
$$ 298 346 205 197 59 142 264 171 357 128 208 209 208 285 130 43 472 405 66 94 147 250 77 196 265 217 217 263 166 153 283 406
3851D06k25K5p6j23J24K2J66j90J47o1o0J64j11l8J82j40L0L4k04J33o7l8K84j42L8j71j5
$$ 406 181 206 130 7 131 153 319 129 276 215 155 319 208 170 352 212 242 276 72 205 138 100 384 242 280 109 94
3598I4m9K62k17K76o0j32J32j35N0J6R7j48jj34J41j46J72p6J53j14R4j97p3J77Q7pJ5o1k3
$$ 94 45 307 90 366 306 174 306 171 221 237 334 186 185 51 192 46 218 142 295 181 275 78 5 182 269 262 277 216 193
3326A93l2o8J44R7j81J05j0L7j63J31J9j08O8R5j08l8K4q4J04Q8o1K3j7r1p1J48k4Q6j2m3
$$ 193 161 93 237 334 153 258 248 285 122 253 272 164 232 327 219 181 205 121 225 313 252 275 258 167 96 244 220 306 294 251
3044B51q4o4N59l21q3j3J33K5k01J83j91J6K73p7L55j08j79l01J42k7J3o5Q4Oj70K6K02j7
$$ 251 167 103 662 341 258 245 378 403 202 385 194 210 483 406 761 653 474 173 315 288 301 236 320 326 156 182 384 367
2781C67j31K91j98j02J30l07M31j2j19K8l8K41J15l59P9lJ0J56k37o5J84k19K03MN8M7l64
$$ 367 236 527 329 227 357 50 481 469 350 378 340 581 696 337 416 413 423 579 342 277 461 242 445 449 507 554 190
2527A90L64j30J45j46M0M2Pl3P5K4j40J47l9O7r6K45m5k20K54J0j47m5K91k14M6K14o2J13
$$ 190 554 424 569 423 463 505 512 479 554 578 438 585 546 613 517 762 717 497 751 761 614 569 860 646 692 906 844 957
2265I57k42K26j68K06q4J77k37J94J55k0J91K7J03p2n3J64J43L35M15O4Q7Lj33K54J325K085
$$ 957 715 941 773 979 895 1072 835 1029 1184 1164 1355 1382 1485 1413 1360 1524 1667 2002 2417 2481 2568 2571 2438 2692 4017 6102
2020F102K500L398M859J7931K37759o5412j95001r133K190J721o48N14l848O68j303n03O5
$$ 6102 8602 12000 16859 34790 272549 207137 12136 3003 5193 6914 6266 6780 2932 3600 2297 1794 1859
1861A859J38nk27j4l75l0j72l6J61j48p9Oj15J0l4J9j14J53j32j01m3M9o7qo5J25l32L65k73
$$ 1859 1997 1992 1765 1751 1376 1346 1174 1138 1299 1151 1072 1078 963 973 939 958 844 997 865 764 721 770 703 695 630 755 423 788 515
1588E15P1K1rOm1j84P1J30j62P07L97p51M95q02Q6j93J63k3J07j30p6n0J66p0P3j68J26k28
$$ 515 586 607 598 604 563 379 450 580 418 1125 1522 771 1266 464 550 357 520 497 604 474 398 348 514 444 517 349 475 247
1326B47J18P9k9P2k78J40o1J09j7p2J90r9j39J49n1j54R1O3o7M7jp5j13K46j02JoK0j21J38
$$ 247 365 444 415 487 209 349 288 397 380 308 498 399 260 409 358 204 295 358 291 338 337 262 149 395 293 294 288 308 187 325
1044C25j09K80l95L22j02k47J93L1Nj3k54M57j72j50K5J87j00j10N2J32r9p5P1Q8p2j00Q0
$$ 325 216 496 101 423 321 74 267 298 303 290 36 493 321 171 196 383 283 173 225 357 258 183 254 342 270 170 250
790B50m2J09j06lj1p5L52l79K18k4p9N4j00M4L2J15k20K2J34j82O5l5J67j82O1N1O9lQJ3j72
$$ 250 208 317 211 208 197 122 474 95 313 289 210 264 164 208 240 355 135 157 291 109 174 139 306 124 185 236 305 302 310 323 151
499A51J46r4j7j9j8O5jO3J83Lpn2j49j69K16K2j69K6MN3K3l3m0J59k09L4j43K26k0p3K57j90
$$ 151 297 203 186 167 149 214 213 276 459 462 455 403 254 85 301 323 154 180 184 237 260 227 187 346 137 171 28 254 234 161 418 228
199B28j77O2j1J61P6k02J35o0k00K6J36J89Qj77J51k33J17j09K7R6mj55K33p6r7M5p4R6J93
$$ 228 51 113 102 263 339 137 272 212 12 38 174 363 371 194 345 112 229 120 147 243 239 84 317 241 144 189 115 211 404
-74D04k65n0J90j79L8NO8J07j2o3k14J02N2J03q2K33k61k2Q1j05J03Q1P5k6j32J2N7j48J89
$$ 404 139 89 279 100 138 143 211 318 306 243 29 131 183 286 204 437 176 154 235 130 233 314 389 363 231 243 300 152 341
-346C41J8Q9%Q7l49
$$ 341 359 448 448 535 186
-393A86
##PAGE=	F1=-571.267
##FIRST=	4405.4455391999963467,	4405.4455391999963467,	0
##DATA TABLE=	(F2++(Y..Y)), PROFILE
4405I9m6N4J31j61l0R0j8m7N4Pq0P6j5J3r8J34p0oP7n4l5K01j00j24rM8l6k0J24j28N0O1L4
$$ 99 53 107 238 77 47 137 119 72 126 133 53 129 114 127 29 163 93 87 164 110 75 276 176 52 43 91 55 35 159 31 81 142 176
4096A76%j21J28r6Ml4J23K6j74J28J14m3j29k0%O7p0%k8Q1j8M6o3lP9P3j89k0K0K3k1l3J44
$$ 176 176 55 183 87 91 57 180 206 32 160 274 231 102 82 82 149 79 79 51 132 114 160 97 94 173 246 57 37 57 80 59 26 170
3786A70J9j05M0j09K51Qj67R6j81Q9kn2L9p2O9J28j26Mo5K7O9L9o6M8o9K7J06q6ql9J50j95
$$ 170 189 84 124 15 266 274 107 203 22 111 109 57 96 24 93 221 95 99 34 61 130 169 103 151 82 109 215 129 121 82 232 37
3485C7pJ05m4m2L4m7P1QK2o2J5Q4l4o1J4p8L3k9P3nN3n3Kj1M5O3Ln9l7QO7j10M0j6k8J5J02
$$ 37 30 135 91 49 83 36 107 115 137 75 90 174 140 79 93 15 48 19 92 87 140 87 89 78 123 186 189 130 93 101 168 58 98 82 54 69 171
3138A71j12K4Kp7O3L2o6P5l7k5J1J79K17k82j45P1J11p7l1J04j66J2K02j37M08m10J14j63
$$ 171 59 83 85 8 71 103 37 112 75 50 61 240 457 175 30 101 212 135 104 208 42 54 256 119 527 117 231 68
2875F8P6qn8k0N6Rm2m1J75p1q9K49j31j61J18K5P3q4q0o1J39N74j70m33j7K8M3J59k20q7J23
$$ 68 144 136 78 58 114 123 81 40 215 144 55 304 173 12 130 155 228 144 64 3 142 716 546 113 96 124 167 326 106 19 142
2584A42n7M1j4J02Rj04J48j13K4j07nO7J5LK0L9j65J36o7J04j61K17qk52K64m1j04kJ66j70
$$ 142 85 126 112 214 223 119 267 154 178 71 66 133 148 151 171 210 45 181 114 218 57 274 266 14 278 237 133 131 297 127
2302A27l8K53j04J03j63L4j28J21k5O9j15P1J24j13J02J0Pp3J3O0J9N4J79j71J69M6j65K55
$$ 127 89 342 238 341 178 212 84 205 180 249 134 205 329 216 318 328 335 262 275 335 354 408 587 416 585 631 466 721
2039G21M7N90M42P51O62M294M9009j3470m0059k309L24J109j08J853J218l359j022m27p7K16
$$ 721 768 1358 1800 2551 3213 7507 56516 43046 2987 678 1002 2111 2003 3856 5074 1715 693 266 189 405
1851D05n0q2J54k33J39j87k9K09j49L8MJ3j2mPnO2j9j37K7O0j18N9q1J85j56J99j97M2j9N
$$ 405 355 273 427 194 333 146 117 326 177 215 219 232 220 216 223 218 280 261 124 151 211 93 152 71 256 100 299 102 144 125 130
1560A30PL6j21M3N8k8J60j31M86K00o23p4j9k2J38L8j05j05j3J06J3L1j57J32n6O6o1n5Q3
$$ 130 137 173 52 95 153 125 285 154 640 840 217 143 124 102 240 278 173 68 55 161 174 205 48 180 124 190 129 74 157
1288A57j6K3L3k6n4o2J04n0n5J02k0p3P4J5j12O3j1j0L3Q8p4q3Q8m4mL4m2K13j53Qm1P4l4
$$ 157 141 164 197 171 117 55 159 109 54 156 136 63 137 152 40 103 92 82 115 203 129 46 134 90 86 120 78 291 138 146 105 179 145
978A45L9j7j47J31J29k10Kl6J87o0r0j7N0n7j5R6O4n7j05l0P6Q0o3Ok1N5J38j32l5N5j11R3
$$ 145 184 167 20 151 280 70 72 36 223 163 73 56 106 49 34 130 194 137 32 2 78 158 95 101 80 135 273 141 106 161 50 143
678A43P0q9o6J05p5J2J40j08m8m1Q2j8l1J42Oq2L2%q8O2nOp4m2NML6L12m6R6j06j87l7k9O5
$$ 143 213 124 58 163 88 100 240 132 84 43 125 107 76 218 224 142 174 174 86 148 143 149 75 33 38 42 78 390 344 440 334 147 110 81 146
349A46q8M0J4Q7o4j08K1J14j20P6j7M4r5m4J76j29K3rN1j6N0j09K1Ql3Q9O7MK0j21J00m1M1
$$ 146 58 98 112 199 135 27 48 162 42 118 101 145 50 6 182 53 76 67 118 102 152 43 64 72 39 128 195 199 219 98 198 157 198
39A98j55R7l8jK9J7j0m4L1n3m0J94r0k5R1j23j0Q5j31J21k9j8m4J47l4n0j6R8j07o4J45n1
$$ 198 43 140 102 101 130 147 137 93 124 71 31 225 135 110 201 78 68 153 22 143 114 96 52 199 165 115 99 197 90 26 171 120
-261A20K7m7QLl8Q3O9k9r5J8j3k0J61j41
$$ 120 147 100 108 111 73 156 225 196 101 119 106 86 247 106
-393A06
##PAGE=	F1=-590.047
##FIRST=	4405.4455391999963467,	4405.4455391999963467,	0
##DATA TABLE=	(F2++(Y..Y)), PROFILE
4405A8P6P1q7M1N1j12L4K3J9N2j23j1J03j09M4J3m5N2m2J4J01K7J6j72k7O2k0N0l4Q2q1J20
$$ 18 94 165 78 119 170 58 92 115 134 186 63 52 155 46 90 103 58 110 68 82 183 210 226 54 27 89 69 119 85 167 86 206
4105B06mo6K2k6M8l8j00J09Kj06K07n7p2O5j04M6n9Q5J7q0M5q2K3l3P9L0Oo5Kj0M2r9L2N6
$$ 206 202 136 158 132 180 142 42 151 153 47 254 197 125 190 86 132 73 158 175 95 140 58 81 48 127 157 163 98 100 90 132 33 65 121
3786A21J29k20Q2k2J30R1j52j9J1o7j5L8m6j5P7K5n1K2Ol5R3j13Q0j28M6Q2L3j02pl4J49m6
$$ 121 250 30 112 90 220 311 159 140 151 84 69 107 61 46 123 148 97 119 125 90 183 70 150 22 68 150 183 81 74 40 189 143
3485A43m9J15j35J7q7J24r8J35o4K7NO5j03n7k0Q6p8P6J9j03pJ60m3rj9J33o7o6J07n7o3O
$$ 143 94 209 74 91 4 128 30 165 101 128 133 198 95 38 18 104 26 102 121 18 11 171 128 119 100 233 166 100 207 150 87 93
3185I3o%N9r1J15j03M4n5N3M6l2%n3kN1k4K53k3j85J5n7R5j46J03k9%K8j7K01q5O3k57R5j01
$$ 93 87 87 146 55 170 67 111 56 109 155 123 123 70 68 119 95 348 325 140 155 98 193 47 150 121 121 149 132 333 248 311 54 149 48
2865D8J25j28Q3m3kJ24r5N1m9Q0K3n5l3j18K14p1j03P7N4L8L87k35k44nM9K5k7j3pm9P8l3
$$ 48 173 45 128 85 83 207 112 163 114 194 217 162 129 11 225 154 51 128 182 220 607 372 128 123 172 197 170 157 150 101 179 146
2565A46jl0n1J97r3k7j0M8%L3j48P9j2MO3k4n0J6O8n0j43K22j61L1R6J13k46J36R3k10K5m7
$$ 146 145 115 64 261 168 141 131 179 179 212 64 143 131 135 198 174 124 140 208 158 15 237 76 107 203 316 70 206 299 89 114 67
2265F7K57r8N4NJ18j82Q3mj19J93r7K9K7N8qk6K5J43n9L08q2k04K25k65N94M43N19P97J477
$$ 67 324 226 280 285 403 221 304 300 181 374 277 306 333 391 383 357 382 525 466 774 692 488 713 448 1042 1485 2004 2801 4278
1992D278L376N6876j5007m7272j337M29o05jJ978M681o121m57J7o1l26J34l4j26L5j78J45
$$ 4278 7654 64530 49523 2251 914 1343 738 737 2715 7396 1275 818 835 774 448 582 548 422 457 279 424
1795D24P9k29Q3O3j42O1j31J32j47J03j73l1J35K3k7P6p5L9k00K69j77j5P7o8jM1j68K35j17
$$ 424 503 274 357 420 278 339 208 340 193 296 123 92 227 250 223 299 224 263 63 332 155 140 217 149 148 189 21 256 139
1523A39j3K03L33J752n75j494K2k85K19j16J22k31P2N7q6o6J62j57J07j20K25j21n5M8o7K04
$$ 139 126 329 662 2414 1839 345 367 82 301 185 307 76 148 205 119 53 215 58 165 45 270 149 94 142 75 279
1279B79j56J18j93rN3j7MMo3J64m4K7p2J41j59j4P5P5j08P1o6L7l5J8l9KP3R2k21jK55j28
$$ 279 123 241 48 39 92 75 79 83 20 184 140 167 95 236 77 63 138 213 105 176 110 147 112 130 91 93 166 258 37 36 291 163
978A63Lj0K7L1o4o3K6n6Q6j7L4j00j5L4J7k6K8L6m0N1m7L0r6L3J1J04k7Q4j69K9m9L3K58k01
$$ 163 166 156 183 214 150 87 113 57 143 126 160 60 45 79 96 70 98 134 94 145 98 128 32 65 76 180 153 237 68 97 48 81 339 138
659A38p5pJ51p7Q8nj10K7q8J60r6J36r1j16M6L6P7j00Q8o8m9M7j4Rj0J41k2M2m1n7M8j51j0
$$ 138 63 56 207 130 218 213 103 130 42 202 106 242 151 35 81 117 194 94 182 114 65 112 98 107 97 238 216 258 217 160 208 57 47
349D7J37j21K1J00r7J7k8K9M8l8L3o9j7J7l9PR8o2O6j31L2R7l5o4PJ37J1q6N5J5o8J03m5j45
$$ 47 184 63 84 184 87 104 76 105 153 115 148 79 62 79 40 47 145 83 149 18 50 147 112 48 55 192 203 117 172 187 119 222 177 32
30C2J42j12R0P3j50QOj5K6L9PN3%m9q5k5J65o1j7o2oM3J42o2j02J45j64J09p2J6L1l6P9j42
$$ 32 174 62 152 225 75 83 89 74 100 139 146 199 199 150 65 40 205 144 127 65 59 102 244 182 80 225 61 170 98 114 145 109 188 46
-290D6M1J43n8RL1j38LL2L6l1R7
$$ 46 87 230 172 181 212 74 77 109 145 114 211
-393B11
##PAGE=	F1=-608.827
##FIRST=	4405.4455391999963467,	4405.4455391999963467,	0
##DATA TABLE=	(F2++(Y..Y)), PROFILE
4405D1R6K9j57J30Q2r1nK8ON0j23L5N6o2om2l8R6o6N8J18k1%j40o3P2mQ1q9J64j00J04l5q9
$$ 41 137 166 9 139 221 130 125 153 159 209 86 121 177 115 109 67 29 125 59 117 235 214 214 74 11 83 79 160 71 235 135 239 204 115
4086A15P9o2N3jr9L9kp1K14q0j20J53j48J10j58J42M2o3j2q7Ok2J27k1%k6L5l5M2r6L8RJ38
$$ 115 194 132 185 184 85 124 122 51 265 185 65 218 70 180 22 164 206 143 131 44 50 28 155 134 134 108 143 108 150 54 92 101 239
3776B39j81M9K7M8J17j11p6J03j30J2K5k7k2L2K7k2N5Qn7O2j63J22j03R1L8K1j54M9RN7L0
$$ 239 58 107 134 182 299 188 112 215 85 97 122 95 73 105 132 110 165 173 116 178 15 137 34 125 163 184 30 79 88 145 175
3485A75o8J04j36J8n4J08r4J05m7nK3N7r6Mn5Q8r8J19l4m7j2J36k5Ol4Q4q2k8J28p8q7L6p
$$ 175 107 211 75 93 39 147 53 158 111 106 129 186 90 94 39 127 29 148 114 67 55 191 166 172 138 222 140 112 240 162 75 111 104
3175A04j0Q1j07J10j07P6m9M4K8k7L8j06M2M7m1L60q8k55Q3j51J31q4L4m4L8L1j30L71l73
$$ 104 94 175 68 178 71 147 98 142 170 143 181 75 117 164 123 483 395 140 223 72 203 119 153 109 147 178 48 419 46
2903D6L12k04K9r7J13j41P3l4L5J10j44N6m8J06j9l9j8r0J42j3n9L9L9J37Oj46RK0pK1j31
$$ 46 358 154 183 86 199 58 131 97 132 242 98 154 106 212 193 154 136 46 188 175 116 155 194 331 337 191 200 220 213 234 103
2612A03P7J4pk0K5Op3l1J69j00NN0QK3L0j47O0nj0N8Np3j3J36m5j64J95j92J34L9J41k47J04
$$ 103 180 194 187 167 192 198 125 94 263 163 168 218 226 249 279 132 192 187 177 235 240 167 154 290 245 81 276 84 218 257 398 151 255
2302B55J47k84J04o5K35j4l8P9P6j34J5N1r5J83n9n5J52J7l2J1j5K67o7L72j49j74K91l38
$$ 255 402 118 222 157 392 378 340 419 495 361 376 427 332 515 456 401 553 570 538 549 534 801 734 1106 957 783 1074 736
2039G36P83O66Q04J158J987N592Q3844k2649o9105k610P40l43m39J306N655o792l21J25p1
$$ 736 1519 2185 2989 4147 6134 11726 95570 72921 3816 1206 1946 1603 1164 2470 8125 1333 1012 1137 1066
1861A066m46J91p5r2k5j83J30J07k73P3N6j27Q3j47J08j24K4j15o1J45K4m0J11j10L8k04K25
$$ 1066 620 811 736 644 619 436 566 673 400 473 529 402 485 338 446 322 346 231 170 315 339 299 410 300 338 134 359
1607C59j62l6J01k3m4Q6k44K39j53Q5J82O97K788j546j876p1k65K66q5P6l73J76J24j33o0
$$ 359 197 161 262 239 195 281 37 276 123 208 390 1087 3875 2329 453 382 117 383 298 374 1 177 301 168 108
1372A08J55j98J44j23K25k00M8P3q6J64j99J27k05M9O5J4j1m9n3K11j20N0q4K09k11J7O2L7
$$ 108 263 65 209 86 311 111 159 232 146 310 111 238 33 82 147 161 150 101 48 259 139 189 105 314 103 120 182 219
1110B19j51J44p2J7oj5mk5K9J58j89l0K37j33j5L0Q9j06p6N0l2m4N4k8P9j23M7K2J6j01L7
$$ 219 68 212 140 157 151 136 132 107 136 294 105 75 312 179 164 194 283 177 101 151 119 75 129 101 180 57 104 126 142 41 78
818G8N8l9R5j01M2j13M4J8Q2n6J29j51oKoL15k10j30j9K14j17P9L5j46L6m6J25q9J04j46o7
$$ 78 136 97 192 91 133 20 64 82 164 108 237 86 80 82 76 391 181 51 32 246 129 208 243 97 133 87 212 123 227 81 14
527A4K7K0J67j11Q0j44R6Rl5J3k8J09N4r8r9J03M2j09n6J83j56J4P5j04J06j09M1R5m5J6j15
$$ 14 41 61 228 117 197 53 149 158 123 136 108 217 271 173 74 177 219 110 54 237 81 95 170 66 172 63 104 199 154 170 55
236E5M2j0kj7J00o3M1j26L2J29m0n5j4J36k9n8K8N5j07J33p2q8J03j09J09N2j47nK7n5N3Q5
$$ 55 97 87 85 68 168 105 146 20 52 181 141 86 72 208 179 121 149 204 97 230 158 70 173 64 173 225 78 73 100 45 98 183
-64A83o7P2K6r7l9m5J71l0m6o1mO3J32p3j08J78k36J68q6k7Q7p2J63j79L0K00j18l1K4l4o2
$$ 183 116 188 214 117 78 33 204 174 128 67 63 126 258 185 77 255 19 187 101 74 161 89 252 73 103 303 185 154 178 144 82
-355H2Q6L1r6J15
$$ 82 168 199 103 218
-393B18
##PAGE=	F1=-627.607
##FIRST=	4405.4455391999963467,	4405.4455391999963467,	0
##DATA TABLE=	(F2++(Y..Y)), PROFILE
4405F6P0nj15P4Q6m0l6M2L6J7j38Q1L7n7k1o4kJ08m4L5R4k3n1n2n8K3pO9q1J97n8O1o1r8Q2
$$ 66 136 131 16 90 176 136 100 142 178 195 57 138 175 118 97 33 31 139 95 130 224 201 150 98 40 63 56 125 44 241 183 244 183 85 167
4077A67k5j0N1r6J6jo0J86o3q1J24j61J46j80J02O0m7j9n6J4l7J29p1K5k8N6m1M8p4J4l1J27
$$ 167 142 132 183 87 103 102 42 228 165 84 208 47 193 13 115 175 128 109 53 67 30 159 88 113 85 141 100 148 74 88 57 184
3776A84j50N3N0J5R7o5r6J36j28kJ5J3l9k6P3m4P1M2o6%j08O2n4Q7J8M7j21N5j6k2O3o8Q5
$$ 184 34 87 137 152 249 184 88 224 96 94 109 122 83 57 130 86 157 199 133 133 25 87 33 120 138 185 64 119 103 81 144 76 161
3466A61j07J7j1O7r2O5Rp1O0L8o4L9m7L2p1J27o2pkP6J2L0l6J2p0lJ10r5qKJm8Q6r0Q3j17
$$ 161 54 71 60 127 35 100 109 38 98 136 72 111 64 96 25 152 90 83 81 157 169 199 163 175 105 102 212 117 109 111 112 64 150 60 143 26
3128B6J37n3J0J9k5P7j46R1Pk9M85r2l96J09j88J49p0%J6pK4m5K98r5j19Q1r2j5K1r7J1k6
$$ 26 163 110 120 139 114 191 45 136 143 114 599 507 111 220 32 181 111 111 127 120 144 99 397 302 183 264 172 157 178 81 92 66
2828F6Q9O5j51N9q4J02K7n8m6l5P1P5q9K0QK19j74j06J53J7n8K7q0M5RJ8j16R3j0n0l4J17
$$ 66 155 220 69 128 44 146 173 115 69 34 105 180 91 111 119 338 164 58 211 228 170 197 117 162 171 189 73 166 156 106 72 189
2527A89n2J1N7k7K6L0j27N9j4qJ5M3j17kJ59j4j61J11j61J77k6J71k42O2J72k69J11o2J84
$$ 189 137 148 205 178 204 234 107 166 152 144 159 202 85 83 242 228 67 178 17 194 168 339 97 159 331 62 173 111 295
2255B95L4j28J39J9q2k2O8o7J32m0j41K63m2l8K1q5L11j25L43j78j33K83k84N58M84N33Q16
$$ 295 329 201 340 359 277 255 323 256 388 348 207 470 428 390 411 326 637 512 855 677 544 827 543 1101 1585 2118 2934
2002B934J320M169N9276j6236m8518k097N35j92n87J796N003o183m18J99j05n48K33o2Rq1
$$ 2934 4254 8423 67699 51463 2945 848 1383 1191 604 2400 7403 1220 802 1001 896 348 581 519 528 447
1814D47j20Q7J44k93O3N6p6J13j48P5q1m7p6m1J35L8m7J26j24K9j50J43q3q4J03L0r2J26k24
$$ 447 327 414 558 265 328 384 308 421 273 348 267 220 144 103 238 276 229 355 231 260 110 253 170 86 189 219 127 253 29
1541B9J63r8Q3J00P06K485j781r07m24k73K65q0O7l11J00J60j48p7J60j85J10m7J62k08R5
$$ 29 192 94 177 277 983 3468 1687 780 356 83 348 268 335 24 124 284 136 59 219 34 144 97 259 51 146
1307A46Q0r5J27j51O2j47L2J12rrq0l3K35j99Q5n2J92j81J5L9j5j17J55r8M5j1l0K7k7O8J00
$$ 146 226 131 258 107 169 22 54 166 157 148 68 35 270 71 156 104 296 115 130 169 154 37 192 94 139 128 98 125 98 166 266
1016B66j63j8J88j17pO6J03k30L6K3n5kL7o1P6r8N7K3K6j16N5Rm4J16j24P6q9J9ON3j4P2j14
$$ 266 103 85 273 156 149 215 318 88 124 147 92 90 127 66 142 44 101 124 150 34 89 98 54 170 46 122 33 52 58 111 97 169 55
706E5L8k1L5K58j53j67k0J94j12R1K2j66L0M0M3o3N9j19j3Mj2J70l4K0j37J94p5o6J9n5K29
$$ 55 93 72 107 365 212 45 25 219 107 198 220 54 84 124 167 104 163 44 31 35 23 193 159 179 42 236 161 95 114 59 288
415B88P7q0j68K9J6n5m9J75j06j6M3j25J70j69M6J11K6l6j24K0K1J2o9J25m3Jq0K2J01o2J
$$ 288 365 285 117 146 162 107 58 233 127 111 154 29 199 30 76 187 213 177 53 73 94 106 37 162 119 120 40 62 163 101 102
124A02J6O4m5%k4M6q2J18n3l4L9q6P5K3r0J8J0o0M3R0q9M2M9p8J0p2J25k5m5m3OQ1J13p5q8
$$ 102 118 182 137 137 113 159 77 195 142 108 147 61 136 159 69 87 97 37 80 170 81 123 172 94 104 32 157 132 87 44 50 131 244 169 81
-205H1J28j74J17j03J5Q8n5J38j92J5K49j29m9k0M4j11J01jn2O9
$$ 81 209 35 152 49 64 152 97 235 43 58 307 178 129 109 153 42 143 142 90 159
-393A59
##PAGE=	F1=-646.387
##FIRST=	4405.4455391999963467,	4405.4455391999963467,	0
##DATA TABLE=	(F2++(Y..Y)), PROFILE
4405H9J8j3m4L3K6L5r5O8O9l0j14Q6Q6j10J4p4KJ05nmM0k8q2N0m2k7j6L7l6J69J5Mq0j06O7
$$ 89 107 94 50 83 109 144 49 117 186 156 42 128 214 104 118 44 46 151 146 142 182 154 72 122 80 53 37 74 38 207 222 226 146 40 107
4077A07O0j05R5q0J4mk5J26n7J7L9j31J23j45NP2k8L5n2J6m2J09o6JrM4l4N7n8j1n2J20j15
$$ 107 167 62 157 77 91 87 62 188 131 148 187 56 179 34 39 111 83 118 66 82 40 149 83 84 75 119 85 142 84 73 21 141 26
3767B6M7M2J0N9k1n5R7o2p1J4N1n7p1J28p1M7J00o4p2j8j5KL6J4P6o1M4o0p9P2l5L5n5MN4
$$ 26 73 115 125 184 163 108 205 143 72 86 137 80 9 137 66 113 213 149 77 59 44 46 82 96 172 111 155 95 16 88 53 88 33 37 91
3438I1K0q7MO9k5mRl3O9Om6NN6o0J1NRP5M7l5n6n6jR4j13R6j4k5r6Q2j7OnJ22r2m6L2l8J20
$$ 91 111 24 28 97 72 68 77 44 113 119 73 78 134 74 85 90 99 174 221 186 130 74 73 167 54 150 136 111 15 97 80 86 81 203 111 65 97 59 179
3072A79j13R9p8mN51j08m59J09j08O6p0jQ9p4K7J29J04J37l49K18k02O3p0J6n6m3J15J4m3
$$ 179 66 165 87 83 634 526 67 176 68 134 64 63 152 78 105 234 338 475 126 344 142 205 135 151 95 52 167 181 138
2800A38l1o3PJ04o6o0K3L8Q0j08%K3J62P2k03N9J0n1j4M3J9n6J9q3Q9p9%n8J14k8L4jj6j0
$$ 138 107 44 51 155 89 29 52 90 170 62 62 85 247 319 116 175 185 134 120 163 182 126 145 62 151 72 72 14 128 100 134 133 117 107
2480A07K8o5M7k0j9lL8n5k5J08J1o9j8J5L0n7J70j96QJ51j17L0q2J32M5j60J42m7k1l5N5m0
$$ 107 135 70 117 97 78 75 113 58 33 141 152 83 65 80 110 53 223 27 35 186 69 99 17 149 194 34 176 129 108 73 128 88
2180H8P2l0k6J71j11l8K0p2K33j86K45j73q6K15j76K10J25P4K26K27J379J5614m635j2239
$$ 88 160 130 104 275 164 126 146 74 307 121 366 193 107 322 146 356 481 555 781 1008 2387 18001 13366 1127
1955A127q63J13q7M1K040L396m699n18J30j28l98K9j7J25j42l3L2J80k58K9M0J3R9j04L2j8
$$ 1127 264 377 290 331 2371 5767 1068 550 680 552 154 183 166 291 149 116 148 328 70 99 139 152 251 147 179 161
1711A61o9n6k1J00N4p1J39j27J7l6K2K5j03O3P8j26J29p4k4J29o6o9L34P89j005N87m22k11
$$ 161 92 36 15 115 169 98 237 110 127 91 113 138 35 98 176 50 179 105 81 210 144 75 409 1198 193 780 358 147
1448A47R4p8O8j51MJ14j12k9O2q4j0R5M4o9K0N4r4J12m0n7p1M5J37r8J2n5k3K06j89M1K3J07
$$ 147 241 163 231 80 84 198 86 57 119 35 25 120 164 95 115 169 75 187 147 90 19 64 201 103 115 60 37 243 54 95 118 225
1147B25n6j7k0p2l2J16j27J10m2l9M0K1J02jj40K9J11q9J9P6J08k43R8o8l4P4k7m8PL0l4L0
$$ 225 169 152 132 60 28 144 17 127 85 46 86 107 209 208 68 97 208 119 138 214 322 79 177 109 75 149 122 74 81 111 77 107
847A07L8q6K8l1j7Q6q0P9p1j6j8M9L5k3l1O7n8R1J43o9r3r4J22n3P0j1j40J8J09l9l7mQk8
$$ 107 145 59 87 56 39 125 45 124 53 37 19 68 103 80 49 116 58 149 292 223 130 36 158 105 175 164 24 42 151 112 75 71 79 51
527E1j4O4J9P8m9l1J78j54r1K3m5K60K9p6n2j12KK0n5J58l0n5K0p4J47j10l9P7J27r1j15l4
$$ 51 37 101 120 198 149 118 296 142 51 74 29 289 318 242 190 78 80 100 45 203 173 118 138 64 211 101 62 139 266 175 60 26
227B6J07m4o3J20j2j9l2k3N7q5P7O2l6k7L3l7j0n5J09k1K3j4o4kJl0O5l0m3N2N1r2J9M0k1
$$ 26 133 89 26 146 134 115 83 60 117 32 109 171 135 108 141 104 94 39 148 127 150 136 72 70 71 41 106 76 33 85 136 44 63 103 82
-102H2M0p9M7l3rJ6JN6Q7o3opo4K7p0M8M6OM4q4l5K28j04p3o6R8n6J7o1M8K6
$$ 82 122 43 90 57 48 64 65 121 208 145 139 132 68 95 25 73 119 125 169 85 50 278 174 101 35 133 77 94 33 81 107
-393A07
##PAGE=	F1=-665.167
##FIRST=	4405.4455391999963467,	4405.4455391999963467,	0
##DATA TABLE=	(F2++(Y..Y)), PROFILE
4405I8k4kQM8k0N6j56J02P1p1k9L5J45j61N8o8m0J05L2m1rn3l1Q4j0n1qJ5j4Q2Q6m6q7p8J8
$$ 98 74 72 80 128 108 164 8 110 181 110 81 116 261 100 158 90 50 155 187 146 137 84 53 137 127 76 68 83 69 151 237 191 104 26 44
4077D4J40j60J02l9Oj8J3Q6p4R8k7q9O9j01J5k6KJ03p5J4k8Q1j7o7L7Oj3N8o0j7RQ3r5K7M
$$ 44 184 24 126 87 93 75 88 174 100 198 171 82 151 50 65 39 41 144 69 83 55 136 119 52 89 95 82 140 80 63 72 155 60 87 91
3748I1RK4J6J1L3J9j31LP1q7l8J27o4k2J51n2j07M8n6K7l1J4Q9k0L8q5k2J1Jm6L0m6J19j6
$$ 91 100 124 140 151 184 203 72 75 146 59 21 148 84 62 213 161 54 102 46 73 42 56 145 125 163 78 56 67 68 22 52 6 125 109
3429A09l9l1N0O1r0J5m9Q1O2p2K8j4m5K0J0m7J48M6l4r5n2j9J02j10J35mo1p0J1N7o0J07J06
$$ 109 70 39 89 150 60 75 26 107 169 97 125 111 66 86 96 49 197 243 209 114 62 43 145 35 170 166 105 35 46 103 43 150 256
3119B56j40r6N2m2J34m3P8j58NN21j29l94Q0m3nk2j0J19r3M5K17l1K53j75J7k78R2j14J08
$$ 256 116 20 72 30 164 121 199 41 46 567 438 44 124 81 76 54 44 163 70 115 332 301 554 379 396 118 210 96 204
2847B04p4m9J02k7N7p2l5p9J06m2J6nL3K5n2k6J5L2K84k38n7QO3j20J25K9j33K0N4K4j76L7
$$ 204 130 81 183 156 213 141 106 27 133 91 107 102 135 160 108 82 97 129 413 175 118 126 189 69 194 223 90 110 164 188 12 49
2546D9L5N8o6O0p8M4p4J7M8lK6q1O7o2J24n5n8L3M4kJ4o3M9Noj0o3R3j6m2L4n0J15j17M4m4
$$ 49 84 142 76 136 58 102 28 45 93 90 116 35 102 40 164 109 51 84 128 126 140 77 126 131 125 115 52 145 129 87 121 71 186 69 113 69
2208F9jl2J9k8R3K07j72n2J1j5J83j16N2q8P7R0q2%R3J33K89K80O43R07K0597m867j7888r1
$$ 69 68 36 55 27 120 327 155 103 114 99 282 166 218 130 207 297 215 215 308 441 730 1010 1653 2560 23157 18290 402 311
1945C11J52J24M03J184J656k898l74j55p8J56k57r8K8k0p5N5J8O5j22Jj2M6k9J0K4P8l3n9
$$ 311 463 587 990 2174 3830 932 558 403 325 481 224 126 154 134 59 114 132 197 75 76 64 110 81 91 115 193 160 101
1682A01m3N9o3R0j06KQ1q8J14q2M0N3p9N4Rj32L02l7m0J08J446l16j050j20r7q3JRoK0m6k0
$$ 101 58 117 54 144 38 40 121 33 147 65 105 158 79 133 142 10 312 275 235 343 1789 1473 423 303 206 123 124 133 127 147 101 81
1382H1O5j35N8K7N3o1P1m9mo1J10L2p1q4R3J14j91M3kk0J43p3j06J03RR0l7r3o4NN5m9O9m8
$$ 81 146 11 69 96 149 88 159 110 106 45 155 187 116 32 125 239 48 91 89 69 212 139 33 136 145 235 198 105 41 46 101 52 121 73
1063G3o4L6Q5J06r0j03O2M2m6L7O5J18j67O3j43J7J23r1lq8J44j14K9N2o8k%QJ4j9O5o3k6
$$ 73 9 45 130 236 146 43 105 147 101 138 203 321 154 217 74 91 214 123 120 32 176 62 91 143 75 73 73 81 95 76 141 78 52
753E2k8M1N3r1P6L1n7J03K7Mj3j30K6L3Rl7l8J2R5q6K7p1P3l3j3R5j19J74q8M5J41j94j01
$$ 52 24 65 118 27 103 134 77 180 207 211 198 68 94 127 136 99 61 73 168 82 109 38 111 78 65 160 41 215 127 172 313 119 18
443A8K0L5K45j34r4P1j47N3O4p2J05M0r0QNR9n8n9k9K16j27r3k8J16j05MP4K0ok9p2J1l4Q5
$$ 18 38 73 318 184 90 161 14 67 131 59 164 204 114 122 127 226 168 109 80 296 169 76 48 164 59 63 137 157 151 122 50 61 27 112
124A12R4r9RK0no5k7P4JP5l7o7m5k8LR5o5j2P5J1j03P7n7M9L7o9j7k2O1K3KkO7l8P0j22J2
$$ 112 206 107 116 136 131 66 39 113 114 189 152 85 40 12 15 110 45 33 108 119 16 93 36 85 122 53 36 14 75 98 100 98 165 127 197 75 87
-224H7m1L9nj0P8n6M4l0J35n7j14k3P3J9p6J0J4K5
$$ 87 46 85 80 70 148 92 136 106 241 184 70 47 120 139 63 73 87 112
-393A12
##PAGE=	F1=-683.947
##FIRST=	4405.4455391999963467,	4405.4455391999963467,	0
##DATA TABLE=	(F2++(Y..Y)), PROFILE
4405H3j8pL0M8RJ8j48R8M9q9L3OJ56j79Q6m7q3J01N6p9j2q5O9M7L6n9j0J0l2nJ35p3o7J3m6
$$ 83 65 58 88 136 145 163 15 113 162 73 106 112 268 89 175 128 45 146 202 123 111 26 95 142 178 119 109 119 87 82 217 144 77 90 44
4077D4J27j12M7Qqm3L3P7r8J45o0o2K6n8Q3j11j4J27q8PQN0Lj08O8j8J8M9p9JN7P6j27N5m1
$$ 44 171 59 106 114 106 63 96 173 75 220 160 98 124 66 149 38 24 151 63 70 78 128 131 23 91 73 91 140 61 62 119 195 68 123 82
3748H2m%M1N3%P8j35l5P1j31K0J09l9p2J53k9r8Q2r4K6o2J2P6%L3p2L5pj4o0N7k1R1n3J2m7
$$ 82 78 78 119 172 172 250 115 80 151 20 40 149 110 38 191 162 64 146 52 78 16 28 104 104 137 65 100 93 79 19 76 55 146 93 105 58
3410E8L5J07j42N6p5M8J08p6K8n8l1K6J5p6K01K9l1j06m1m8J21r1J06Pp2l0l7O3l9J29J07
$$ 58 93 200 58 114 39 87 195 119 147 89 58 84 99 23 224 253 222 116 75 27 148 57 163 170 98 68 31 94 55 184 291
3119B91j56p2MlQ2OO2j57l4L91j32k30L5m4k7O9n1J08m9M3K21o0K56k3j22k93N5r3J37o6n3
$$ 291 135 63 67 64 146 152 214 57 23 414 282 52 87 43 16 85 34 142 93 136 357 297 553 530 408 115 170 77 214 148 95
2828I5J11o1J01m1p1p0L0rO9j2LJ2j0Kq2J15K04k15r6KJ78j38Q1L2j62N2J02Mj88J7R7J9j15
$$ 95 206 145 246 205 134 64 94 85 154 142 145 157 147 149 67 182 386 171 75 77 255 117 198 230 68 120 222 226 38 55 152 171 56
2518E6O5p2N1n6%P2j0N0j37R8o5J63q1j19O3N7M0m2j7O2o9O1j2j29J31km5N5j38K35j82J45
$$ 56 121 49 100 44 44 116 106 156 19 117 52 215 134 15 78 135 175 133 116 178 109 170 158 29 160 158 113 168 30 265 83 228
2218B28r7k2lPj9J21J85k56N7Rk8J71j04O9NK3J11o4RJ36K73M26M49J003J773L4583q541k9490
$$ 228 131 109 106 113 94 215 400 144 201 210 182 353 249 318 323 346 457 393 402 538 811 1237 1686 2689 4462 39045 30504 1014
1955A014n14L09P5K30N35M30j371j14l16L2L12k14k03k0Q1j36J02j73K24j66O5j50J30r1M9
$$ 1014 500 809 884 1114 1649 2079 708 594 278 310 622 408 205 185 266 130 232 59 283 117 182 32 162 71 120
1720A20j2J58n3q0q6O3J2oo5RP4q6J05r7P6J0n1L7On7K64O4n1N10K893j562k074K08j07j76
$$ 120 108 266 213 133 47 110 122 116 51 60 134 48 153 56 132 142 91 128 134 77 341 405 354 864 3757 2195 121 329 222 46
1438D6J35q8M2M9j28L8R4j14j3J11k7o8J00p6l7qJ00L6j0j56J33R0k08N2Jj4J19Lj90J19m0
$$ 46 181 93 135 184 56 94 188 74 61 172 145 77 177 101 64 56 156 192 182 26 159 249 41 93 94 80 199 202 12 131 91
1147I1J82l7j36nm1K4J3Qk2n3qJ25R3j38m7L7K8rK9O4J18j21K5j52M9J39j19J6j34J86j55
$$ 91 273 236 100 95 54 78 91 99 77 24 16 141 234 96 49 86 114 105 134 198 316 195 220 68 117 256 137 153 19 205 50
856E0K8O2p1j3M6Nj9j6P6m3om0ON7p2R7nm0Q3m9N0L1j09n0Q9o2j9K1J3P2r5J03p3Nj5J0P8
$$ 50 78 140 69 56 102 107 88 72 148 105 99 59 65 122 50 147 142 102 185 136 186 217 108 58 147 85 66 87 100 172 77 180 107 112 97 107 185
509A85j48J65q3P2R4j79r1%Q1L83j69P9l40J4M2P0n9lR8j10MO2Q4n3m4j18K61j36p2mP8j29
$$ 185 37 202 119 191 285 106 15 15 96 479 310 389 49 63 105 175 116 113 211 101 105 167 251 198 154 36 297 161 89 85 163 34
208C4L8P1M2Nn2j08k1M9N2R9q7J6j1K1n6J3j1J6J10m6q3j6l1k9P5p4L9O7%r3J21j11O3Po0
$$ 34 72 143 185 190 138 30 9 58 110 209 122 138 127 148 92 105 94 110 220 174 91 75 44 15 90 16 55 122 122 29 150 39 102 109 49
-121D9NOM6jJ5l8N4k2J02j33nn4Q7l1n4J31j04Q8pP2j0j61N7L8M3j39J07o1M6
$$ 49 54 60 106 105 120 82 136 114 216 83 78 24 111 80 26 157 53 141 134 206 196 35 92 130 173 34 141 80 126
-393A26
##PAGE=	F1=-702.728
##FIRST=	4405.4455391999963467,	4405.4455391999963467,	0
##DATA TABLE=	(F2++(Y..Y)), PROFILE
4405E5K1l0K7K0P2l3j18Q7L4p4L8J3J11j56Q9qr2P2N9j16N9l9K7K5Q6n9k6No4p4J59p5j2O9
$$ 55 76 46 73 93 165 132 14 101 135 61 99 112 223 67 156 148 56 128 187 71 130 91 118 143 229 170 144 149 85 11 170 95 83 152
4086A52p2M9j9JL6k4p7L8Q0j14J70p7m1Nk7J39j16q2J08p2rN7J8j6q2M5j7M9L4j02L2Q7P4
$$ 152 80 129 110 111 147 123 46 84 164 50 220 143 102 107 80 219 103 21 129 57 48 105 123 107 25 70 53 102 136 34 66 153 227
3776B27j85J29q2l0j2M7O2J5J05j03q3N9j01K6O0j1q0J04Kq9J22j35Pn2J3M2%K9k6P3j7m3
$$ 227 42 171 89 59 47 94 156 171 276 173 90 149 48 74 134 123 43 147 149 60 182 47 54 2 15 57 57 86 60 133 116 73
3476G3m1N6J7M1r0O5q5P0J11j72R2p1pJ33p4K4p8mJ5K7r8K38Pk8j10np4J20r1P4J0n3j3l5
$$ 73 32 88 105 146 56 121 36 106 217 45 137 66 59 192 118 142 64 60 75 102 4 242 249 221 111 106 32 152 61 135 145 92 79 44
3157D4JL0J07J12j30o3k1OL6L0M7j18m7J92r1p8J7qj6M2q2Q7J2K0J86j8J80P3j84k40l1k0
$$ 44 45 75 182 294 164 101 80 86 122 152 199 81 34 226 135 57 74 66 50 92 10 97 109 129 315 297 477 550 366 126 95 75
2856G5J06l0o8J49r3R1L4j26p9j3L0R1km6N2j8Q0j40K26m9j82Qm7K35r8lRj24Q0Q2Qj99O2
$$ 75 181 151 83 232 139 230 264 138 59 46 76 167 165 119 171 153 233 93 319 270 88 96 49 284 186 183 192 68 148 230 238 39 101
2546A01R8j5j26J9pOl4K3M2M7J5j51N5J2J20j01r8R2J0M8q3O7J3k3K5k2p6N6K8m7P0r0J79
$$ 101 199 184 58 77 70 76 42 65 107 154 169 18 73 85 205 104 6 98 108 156 73 140 153 130 155 133 57 113 141 94 164 74 253
2236B53j95J85j00p8J4J1m1J59J11j94N3jn0J24m1J7P7o2J51r5R8nK41L49L21Q29J277K6991
$$ 253 58 243 143 65 79 90 49 208 319 125 178 177 127 251 210 227 304 242 393 298 396 391 632 981 1302 2131 3408 30399
1973C0399o556k3108l36K60J7P3J29r3m14J04k44P3K42j19l22J45J9j49J10j61J94k19J35
$$ 30399 23843 735 399 659 676 749 878 785 371 475 231 304 546 427 105 250 269 120 230 69 263 44 179
1757A79j20J58j72Q4l5J64p5n2j02N2P0k9r3K9N8q2J01p2N6j9l2N2j9K9J64J21j57O27K566
$$ 179 59 217 45 129 94 258 183 131 29 81 151 122 29 58 116 34 135 63 119 100 68 120 101 130 294 415 258 885 3451
1485C451j979r03Ml44k22J84j15M4M0j06M5P3n6o1J34q5j7N9p5j1nR2K4M7j83J15O7j62O0
$$ 3451 1472 569 573 229 7 191 76 120 160 54 99 172 116 55 189 104 87 146 71 60 55 147 171 218 35 150 217 55 115
1213A15m9MJ29L3j97O2k2K00k6j44J2m3%K3l3mj5l9J31O3j38kk0Q4j7J0R1Q6j03rr0N4J19
$$ 115 66 70 199 232 35 97 75 275 249 105 117 74 74 97 64 60 45 6 137 200 62 60 40 124 107 117 208 294 191 182 92 146 265
903B65j08Pj38J70j66M5N3q4LN7Ok8n1J05oK5o6m2N7m7J16k4l7M9o3N6L0l0r6R9j11N7mLO6
$$ 265 157 164 26 196 30 75 128 44 47 104 110 82 31 136 130 155 89 47 104 57 173 149 112 161 98 154 184 154 58 157 46 103 99 102 168
574A68r0J42p0p8K9L7K9r0R2m4N2N0j22o1JP4N06j17J66n90J2J1J05k6j40J51j13LQ6J07r3
$$ 168 78 220 150 72 101 138 167 77 169 125 177 227 105 44 45 119 625 508 674 84 96 107 212 186 46 197 84 87 173 280 187
283A87j5j51K54j22n9PK7j04K2J17M9oq2j02K2K5K6Q7l7Jl2K3j2M3q5M1J15n4q1qn0k8M2m1
$$ 187 172 21 275 153 94 101 128 24 46 163 212 206 124 22 44 69 95 182 145 146 114 137 125 168 83 124 239 185 104 96 46 18 60 19
-36A9P4K7Rl7J05j15M4k2o8N7k1M0k3K9j4K5l0Q7p5n7k5P3k4k9J15r7L1L0N5J9j80R6L4K7
$$ 19 93 120 129 92 197 82 126 104 36 93 72 112 89 118 104 129 99 186 111 54 29 102 78 49 164 67 98 128 183 202 22 118 152 179
-355A79j35J18j11O8
$$ 179 44 162 51 119
-393A19
##PAGE=	F1=-721.508
##FIRST=	4405.4455391999963467,	4405.4455391999963467,	0
##DATA TABLE=	(F2++(Y..Y)), PROFILE
4405C9M3l3kk1J41p2q3N9L6l6lL9L5o7L4L8n6J8M5j32J53j8l8L3J19n3m4Pj06j5O6p3N2R0
$$ 39 82 49 47 26 167 95 12 71 107 71 68 107 142 75 109 147 91 109 154 22 175 157 119 152 271 218 174 181 75 60 126 53 105 195
4086A95r4j6Q5k4L9m5j17L5Q4j09J76r1j5jj8J82j04j43P0l3k4R8j2m8k2j1J4N7J8q9L7J00
$$ 195 101 85 170 146 185 140 23 58 142 33 209 118 103 102 84 266 162 19 89 56 32 130 118 70 48 37 51 108 126 37 74 174
3786A74P0k28K06j25m6k5L6N0O1J10n9j26M1l6J6j0J7p9M5L1q5J65j54Jk7j0L1k7K7J2J07
$$ 174 244 16 222 97 51 26 62 112 173 283 224 98 139 103 119 109 126 47 92 123 38 203 49 50 23 13 44 17 44 56 163
3495A63l5n7m7O4N7j0p8O8j09J01R2j90J19m3k9J07o4J0q3M1j9M8p8K23k1k0j19N1j00J04
$$ 163 128 71 24 88 145 135 57 125 16 117 209 19 138 95 66 173 109 119 36 77 58 106 28 251 230 210 91 142 42 146
3213A46r6N5mj7j2j5k1M7P9J04p8o6ok2%L9L1p3l4P0k0n7L4Q9o2m2k8K8M3k1J68J3L3J60j73
$$ 146 50 105 101 84 72 57 36 83 162 266 188 122 116 94 94 133 164 91 57 127 107 50 84 173 111 69 41 69 112 91 259 272 305 465 292
2884B92j57j15N5N0L3r5J94j23M0J27j58j11J8O1M6J4o4Q6n7J76j14K38l26k9O8j12K36l7
$$ 292 135 20 75 125 158 63 257 134 174 301 143 32 50 111 157 171 107 193 136 312 198 436 110 81 149 37 273 236
2621B36p7k6l8P3L4K6j72R9P4l6r3o9M0k4l4N7J0J29n1q2m9R2L8j11k5R0j2%l4Q2p2Q0l7m5
$$ 236 159 133 95 168 202 228 56 155 229 193 100 31 71 47 13 70 80 209 158 76 27 119 157 46 21 111 99 99 65 147 75 155 118 73
2302G3Ml5P0j4J9L1M4j50J43k2j39K5RN1K4J6j2m6k4m5M3J3N4J1j03J65j40J99j88Q5K11J0
$$ 73 77 42 112 98 117 148 192 42 185 163 24 49 58 109 133 149 137 91 67 22 65 78 132 143 40 205 65 264 76 161 372 382
2002C82L36J24P943j688o969K6Q1n0k1k9o5l4K12m0P6N5J7k57K41j47o2J3j2N4j02L1K7N2
$$ 382 718 842 8785 7097 128 154 235 185 164 135 70 36 248 208 284 339 356 99 340 193 131 144 132 186 84 115 142 194
1739A94j62Q9%P9r1K5k4o2R5j0j05K5L4p6R7Rl9m4L4L7l4J06J4R4k43L96N20n10K34P3n51
$$ 194 32 121 121 200 109 134 110 48 143 133 28 53 87 11 108 117 78 34 68 105 71 177 191 285 42 438 958 448 682 755 204
1448B04j44P7l6N3m3p5Q2J7j1RK7q0J5qrQk6O8L0O1j45L8M5j00Q4j11L3J37L7j94J5K2J73
$$ 204 60 137 101 154 111 36 118 135 124 133 160 80 95 87 78 86 60 128 158 219 74 112 157 57 141 30 63 200 237 43 58 80 253
1138B53j4j27JPm2Lk2l0M5m4J00K3j11K9m8J28n1lJ27K6r5l9J0N3O7p8j5j03J12j59Q4J8r3
$$ 253 239 112 113 120 78 81 59 29 74 30 130 153 42 71 23 151 100 97 224 250 155 116 126 179 246 168 153 50 162 3 87 105 12
828A2L4L7J6k4m2Q1K8O2q7q4L8qJ27k8n6Rj4J6nQ0j32J04j02R3n1j6P4q1J16k2j64Q5L9k7
$$ 12 46 83 99 75 33 114 142 204 117 33 71 63 190 162 106 115 101 117 112 192 60 164 62 155 104 88 162 81 197 175 11 96 135 108
509A08j1M4jkK1n2k9PP9M66n8K07o24m7k1J53Nj72J04j09LQ2J46j48J5j49K22r2n1J0l2l4
$$ 108 97 141 140 138 159 107 78 85 164 630 572 779 155 108 87 240 245 73 177 68 71 153 299 151 166 17 239 147 96 106 74 40
208D0j4J62M4m2r8m6L6Nk3P8Nj4l3QM2O1j25O6R2n6n5l8o5j7M8k4R3k0J9M1O5j16L0k4r5R1
$$ 40 26 188 232 190 92 46 82 87 64 142 147 133 100 108 150 211 86 152 244 188 133 95 30 13 61 37 130 110 129 170 235 119 149 125 30 121
-130A21o0M1j9J5N0k2n3M9Rp7j4L0K3j1R1r3m3O7P3K5j40P0M3Lo2L1j33R5
$$ 121 61 102 83 98 148 126 73 122 131 54 40 70 93 82 173 80 37 104 177 202 62 132 175 178 116 147 14 109
-393A09
##PAGE=	F1=-740.288
##FIRST=	4405.4455391999963467,	4405.4455391999963467,	0
##DATA TABLE=	(F2++(Y..Y)), PROFILE
4405D4L4j9l3L9J03p8q0K9M9ln0N7m0O5o6Q1kk3J2n0J41j4q9O1J28m6n0J3j42M5J2q6P7R1
$$ 44 78 59 26 65 168 90 10 39 88 85 35 92 52 117 51 132 130 107 119 69 210 196 107 168 296 250 200 213 71 116 128 42 119 210
4086B10j05k5J43l0L1p1j49K4Q9p2J47j01K0ol3K14q2j74J7Pj4J07l5m1jn6N2L8J3m9J5J01
$$ 210 105 80 223 193 224 153 4 28 117 45 192 91 111 105 72 286 204 30 47 54 40 147 112 71 70 14 66 104 117 68 83 184
3786A84O1j75J91j65l8m5J4L5J05J11k2j54K2J7J0o6M3q2nM9o1J80j40M0o5k6O6l8K1j9J42
$$ 184 245 70 261 96 58 13 27 62 167 278 256 102 124 141 151 85 128 46 41 90 29 209 69 109 44 18 84 46 67 48 190
3495A90n0n4p6P6Q0l1j4J2n2L1Q0j81J13mj0M7l8l4p8Q6n6O9m0J87n6mj32J06j16Q6j05N4
$$ 190 140 86 10 86 166 135 121 133 81 112 192 11 124 120 110 157 119 85 7 93 37 106 66 253 197 193 61 167 51 137 32 86
3194H6l2J9j2K0M3l6N4P4k2o3K8n7l8M6K0m1qJ28q1r3P1J64j00j32L7L3lo2K01k3j84K72o1
$$ 86 54 73 61 81 124 88 142 216 194 131 159 102 64 110 130 89 81 209 128 35 106 270 170 38 75 108 105 43 244 221 37 309 248
2884B48j13o0rRJ01j15K09j44l0K13j54j29O4P4k4K2k3O2p8K37p6K40m70K25p8j67K06J5j20
$$ 248 135 75 66 75 176 61 270 126 96 309 155 26 90 164 140 162 139 201 123 360 284 524 54 279 201 34 240 255 135
2612A35l8K6N2j3M5j11R6N5m6o1r3Rj7KL2rJ74r8pl3N9m3q8J7O4J8o9P3K4j37J51o4p5P7n7
$$ 135 97 123 175 162 207 96 192 247 201 140 47 56 39 41 73 64 238 140 133 100 159 116 28 45 109 127 58 131 155 18 169 105 30 107 50
2283E0O2K6o9J43q5j5pQ8j11M0l3J43j89L4J09j11k4J00j1p7J70j82J60j63K35j74K43n1J39
$$ 50 112 138 69 212 127 112 105 193 82 122 89 232 43 77 186 75 51 151 140 63 233 51 211 48 283 109 352 301 440
2011D40J41J20P68J0706k856q711l80l0R8L5R8o2j38j50J28R9j72J44QJ21l02R1j54J69r8
$$ 440 581 701 1469 12175 9319 608 228 198 296 331 429 367 229 79 207 306 134 278 286 407 105 196 42 211 113
1776A13P7j18J18p2p2N6P1l9m9N9M3j21M2K0n0kqm7P1O3j10oO2J8o1J55j34PL00QK371j93
$$ 113 190 72 190 118 46 102 173 134 85 144 187 66 108 128 78 76 68 21 92 155 45 39 101 119 58 213 79 86 386 394 2765 2572
1476B572k176K99n96O0o9Q1N5j13o3R7rk1R9j03J8k3o1Q9k8j6L1M7L1r9l0J8l2R2j03K3J21
$$ 2572 396 695 99 159 90 171 226 113 50 147 138 117 216 113 131 108 47 136 108 92 123 170 201 102 72 90 58 150 47 70 191
1185A91L5j88K7K5J30lj00k0O9q6k0K6l0M8n3Q0j0q0M0j2R1o5lJ39m5q0o5J10N6Ln0l3m4M3
$$ 191 226 38 65 90 220 217 117 97 166 80 60 86 56 104 51 131 121 41 81 69 160 95 92 231 186 106 41 151 207 210 160 127 83 126
865A26j08Q1j9o5L8J0K3j7K9KL6R7r0r8mM0J24k8q2l4O8m8n0J77j54J18p6J01r5k9P7o7N6
$$ 126 18 99 80 15 53 63 86 69 98 100 136 233 143 45 41 81 205 177 95 61 129 81 31 208 54 172 96 197 102 73 150 83 139
556A39P7r8k7lo5Q0L8J2o7J7MoK1Q9K71P0J75n68m9mJ60Oj13nr0qP7J61j76L2j11J60n7l9
$$ 139 216 118 91 88 23 103 141 153 86 103 107 101 122 211 482 552 727 159 110 106 266 272 159 154 64 56 133 294 118 150 39 199 142 103
236A03J0r7O3%J25L7r2p9kL7J0p9R1Mk9j2rQ0O0j23P6O4m8k5q3n2k0P8m0J13o2K5J20K0j14
$$ 103 113 16 79 79 204 241 149 70 68 105 115 36 127 131 102 90 81 161 221 98 174 238 190 165 82 30 10 88 48 161 99 124 244 264 150
-92A50J5j2j11R3q8M2J0k5J09p4p4J9Q6o5k6oQ5l2Q4r5k6K7R3K5r8L5M8mno1r6R0
$$ 150 165 153 42 135 47 89 99 74 183 109 35 54 140 75 49 43 128 96 180 85 59 86 179 204 106 141 189 185 180 119 23 113
-393A13
##PAGE=	F1=-759.068
##FIRST=	4405.4455391999963467,	4405.4455391999963467,	0
##DATA TABLE=	(F2++(Y..Y)), PROFILE
4405C9L2j3l1R1O0o9q4K3L1J6n0K8n2J27j16Q4M2l0l7K1J05j1j17R4J18m4m0J0j56Q4Pj06
$$ 39 71 58 27 118 178 109 25 48 79 95 45 73 21 148 32 116 158 128 91 112 217 206 89 183 301 257 217 227 71 155 162 56
4105E6O0P5r9OJ52j7K3r5j34k6R5l1R7q0M8j9o9K34n6j78k5K6J4R4n1oop0O1J1K3j8qR1N4
$$ 56 116 191 92 98 250 233 256 161 27 1 96 65 162 82 130 111 42 276 220 42 17 43 57 151 100 94 88 18 79 90 113 95 87 178 232
3776B32j15J57j89qo8K5J6R6J21lj64MM8Jq1O1q4l3M5j2J56j10Q0j19k0Q5n5L0m5J59n4n2
$$ 232 117 274 85 77 9 34 50 146 267 264 100 104 152 153 72 133 49 16 61 49 205 95 175 56 36 121 66 96 51 210 156 104
3476A04r0P5P9j4L0k5j7n2Q6j42P1K8J8J8j9r9l3P7p2P1KJ54j01J6j37J49j20P5j28O9n2L4
$$ 104 14 89 168 154 184 159 142 90 176 34 105 133 151 169 150 51 18 95 23 94 96 250 149 165 28 177 57 132 4 73 21 55
3175E5J0N2Q4r7K2L0J6l7N4p1p7N0K1k5J8J59j60p9J02K04j08j77M3O6o0p8K24m6J09j83J37
$$ 55 65 117 201 104 126 156 172 135 189 118 41 91 112 87 105 264 104 25 127 331 223 46 89 155 95 17 241 195 304 121 258
2884B58j36Np8J4J37j23J87j54r8K76j31j20P4Q8p3J8L0Nn3K38m7K65m40K99k00k12J75M0
$$ 258 122 127 49 63 200 77 264 110 12 288 157 37 111 199 126 144 174 179 126 364 317 582 142 441 241 29 204 244
2621B44j37oL0L9m3N1n4Q0N1n5m5r4k6J1K9%mJ54r6L9j6M8q9n1rL5N9p6R9J3q7O6m9q4J00
$$ 244 107 101 131 170 127 178 124 204 255 200 155 61 35 46 75 75 71 225 129 168 152 200 111 60 51 86 145 69 168 181 94 160 111 27 127
2293A27m1K7M1j06J82j51P5j00J27q9P8o0J94k71J56Pq4JJ13Qj03J45j30J53j95L40l99M93
$$ 127 86 113 154 48 230 79 154 54 181 92 170 110 304 33 189 196 112 113 226 234 131 276 146 299 104 444 45 538
2030E38m7J88K89L97R88J9056m585j6091l38J2J41j9M9j42j44j26J7J39j83P4J75Rl44J98
$$ 538 491 679 968 1365 2353 21409 16824 733 395 407 548 529 578 436 292 166 183 322 139 213 388 397 53 251
1804B51j92K03j81J46j29R9p0J2p1J37j19N6NQ1j41l0L6J7j0l5n3P6O8r7L3L2K8r6J58j55
$$ 251 59 262 81 227 98 197 127 139 68 205 86 142 147 228 87 57 93 110 100 65 12 88 156 59 92 124 152 56 214 59
1523E9N1M92J93M285j411l521K52j90L8j30Q9O8j36m5N6J8n4J41j78J05o4n6J16p0QJ6M3J5
$$ 59 110 602 795 5080 3669 148 400 210 248 118 207 275 139 94 150 168 114 255 77 182 118 62 178 108 116 132 175 190
1260A90q6m6k2L0O1o0J2R0L1j81P6JQ7Pp3l1J06j16k3M6MJ7o3P5oo4K0RM4l7J1J10j08n0l6
$$ 190 104 58 36 66 127 67 79 169 200 19 95 96 183 190 117 86 192 76 53 99 103 120 57 132 126 62 82 91 135 98 109 219 111 61 25
931B5J28O7n3l4m2J6op5O8l7k8L8LRj9Q4m3J1J20o7j13JL9J21k5r6o3J33q5l0J49j39J18n2
$$ 25 153 220 167 133 91 107 101 26 94 57 29 67 70 79 60 144 101 112 232 165 52 53 92 213 188 92 29 162 77 47 196 57 175 123
612A23R7j30j8N9l4Q4J01n9j32n5P0jN1jj20M1K7KN2P9P6L41N7m91j12N3J30k7m7r6l5m0Q6
$$ 123 220 90 72 131 97 181 282 223 91 36 106 105 156 155 35 76 103 105 157 236 312 653 710 219 107 160 290 263 216 120 85 45 131
302A31J26j48L4o3P9k3j9Qp2P7JP1L6j43klK0J6n4Q2m0n4K4j1P4M9r3P4M5k9rj15l0k3Q7m7
$$ 131 257 109 143 80 159 136 117 125 53 130 131 202 238 95 93 90 110 126 72 154 114 60 84 73 147 196 103 177 222 193 184 69 39 16 103 56
-36E6J25q8J8J82j5j08kpj11Q1p7L4K8o2J39j21o0M4Q0n0k9k2J32p5Q6q5Qj6Q9L9p3J0M0N
$$ 56 181 93 111 293 278 170 168 161 50 131 54 88 116 54 193 72 12 56 136 86 57 35 167 92 178 93 101 85 174 213 140 150 190 195
-355A95J6j14o1Q1
$$ 195 211 97 36 117
-393A17
##PAGE=	F1=-777.848
##FIRST=	4405.4455391999963467,	4405.4455391999963467,	0
##DATA TABLE=	(F2++(Y..Y)), PROFILE
4405A7N0k8J0Q9O0p6m8J0j2K6k4loQ2p8M0N8j4r0O6O5kj23J21R3m3k1pj49J09J6j19K7M9q0
$$ 17 67 39 49 138 198 122 74 84 72 98 74 71 65 147 69 109 167 153 63 129 194 192 69 190 283 240 219 212 63 172 188 69 96 145 65
4077F5L5J41J0J9j07j17j3N0pM1j2N4m7r6K25l2j61k5RL5P3n9J2Pp0M9j3N0nl0P4N0o2J15
$$ 65 100 241 251 270 163 46 33 83 76 117 105 159 112 16 241 209 48 23 32 67 140 81 93 100 30 79 66 116 111 81 155 205 143 258
3758B58j95L7q6N5%M4J39kj55j0N7k3n1P4r0k9K4J3J38o9R9j77J5P3o9K9k6J51n4n1j01Q3
$$ 258 63 100 14 69 69 113 252 250 95 85 142 119 68 142 52 23 47 60 198 129 228 51 66 139 70 99 73 224 170 119 18 101
3457A01N8J4N3l4lj26J02j16L7M4M5L3k3j49KM5n0L7L8J31j44K5r5J51j19P8r1J1m8K9M9P3
$$ 101 159 173 226 192 189 63 165 49 86 130 175 208 185 36 38 83 33 70 108 239 95 120 25 176 57 135 44 55 7 36 85 158
3157A58R5j18l3mL1J0N8o1r5L0M0j4K4J35j50o6R8K09q3j94J6R1q6o6J65O9L44m17O3j51N3
$$ 158 253 135 102 98 129 139 197 136 41 71 111 97 121 256 106 40 138 347 264 70 86 177 91 25 190 259 603 186 249 98 151
2865A51j06K8J50j33J49j52j3J70j02j10P8R4q6PN9n6J1J88l2L07m27L17k27k44J55L4j25
$$ 151 45 73 223 90 239 87 74 244 142 32 110 204 118 125 184 128 139 327 295 602 175 492 265 21 176 210 85
2612H5J6J1L9m7M1k0P2N8o8m5r6k9O2J2j1jR2m3M7j4Q0j08n8l3MQ6n8R1N6q5pj3j08J21l6
$$ 85 101 112 151 104 145 125 197 255 187 142 46 17 79 91 80 79 171 128 175 161 241 133 75 42 46 132 74 165 221 136 129 116 8 129 93
2283I3pM2q4J46j47J05r3N6n4J13n3J85k03J42q8n5J0J12Jj03Q4n8J04j28L15l85M59j35J57
$$ 93 86 128 44 190 43 148 55 111 57 170 117 302 99 241 153 98 108 220 221 118 202 144 248 120 435 50 509 374 531
2011E31K67L96M64J5870l273j3870M1o3J57j06qn4j56%q2J70p8m1K16p8k19K02j85J79j76
$$ 531 798 1194 1658 17528 14255 385 426 363 520 414 406 352 196 196 114 284 206 165 381 303 84 286 101 280 104
1776A04Q1o0P8J7M4j87J27j26J19m4P3j43k8k1R3j2m5n1P2L7m0K3K0L2j13J07p7P7L92J35
$$ 104 185 125 203 220 264 77 204 78 197 153 226 83 55 34 127 115 70 19 91 128 88 111 131 163 50 157 80 157 549 684
1495F84L991j668k395l81K57j93j65L8J06j47pnO0n3J11j74J34p5n1J13r2K9J4J8N2j22k3
$$ 684 4675 3007 612 231 488 295 130 168 274 127 120 115 175 122 233 59 193 118 67 180 88 117 131 149 201 79 56
1241E6m8P8j2j1K5N4J6j29Q6j8M3J9m7k0R8j15jJ5M5j7o6P2K4n3j9RnK7L3N1j37k5L7O3Q4
$$ 56 8 86 74 63 88 142 158 29 115 97 140 159 112 92 190 75 74 89 134 117 51 123 147 94 75 84 79 106 139 190 53 28 65 128 212
912B12r0k3l7N0j7p1M6k6j1N9nj2k0J06m8l2J21k5j34M1nJ27j6r1n3J43o9l6P9p5Q3k2P3j56
$$ 212 122 99 62 112 95 24 70 44 33 92 87 75 55 161 113 81 202 177 43 84 79 206 190 99 46 189 120 84 163 88 171 149 222 66
593F6K9K1J5J40M9n3j75L2Q7r8M9j7j18M9K1oR5M6J32M95n3m47k63J00J06p1j0j57N3p1R0
$$ 66 95 116 131 271 320 267 92 124 211 113 162 145 27 76 97 91 186 232 364 859 806 359 96 196 302 231 221 64 117 46 136
302A36N5p8M4l7PLjMk5P5k0K1M2j77Q2Jk3jK1O1p7q9O0J1J7K9n2O6M5ppj25j7j8O9k9J23r2
$$ 136 191 113 157 120 127 130 129 133 108 183 163 184 226 49 131 132 109 108 129 190 113 24 84 95 112 141 89 155 200 193 186 61 44 26 95 66 189 97
-55I7pK18k7j04k5j4r7P2l9L1K1q6J37j38K3K5L3l6j5m6J71j21R6o9PqN7P1o8%K0J6Pj12n9
$$ 97 90 308 281 177 152 138 41 113 74 105 126 40 177 39 62 87 120 84 69 23 194 73 169 100 107 99 156 227 159 159 179 195 202 90 31
-383C1P2
$$ 31 103
-393A03
##PAGE=	F1=-796.628
##FIRST=	4405.4455391999963467,	4405.4455391999963467,	0
##DATA TABLE=	(F2++(Y..Y)), PROFILE
4405C2L2n5P3M6R4r5Pj4n4K5Loj1L5k3K3M3Pj35R4L5J4j26J39O6m3ml1j25J21K8j21nK6o8
$$ 32 64 9 82 128 222 127 134 120 66 91 94 88 77 112 89 112 155 162 27 121 156 170 44 183 249 206 202 171 46 167 195 74 69 95 27
4077B7N9J13M0K1j03r9PJ3kpP4M6q3n0J35j0j31jnK4M6o3QM3m3J0l1Q1kn2N6M6k0P2j83Q1
$$ 27 86 199 239 260 157 58 65 78 76 69 143 189 106 56 191 181 50 49 44 68 114 51 59 102 59 69 38 119 117 65 121 167 147 219 36 117
3739A17r4P1j9%J60rj38j2N8p7J0P7r8k1K0JJ48k8R5k27O9L2n9%K4J35n7m3j16J01L0K6O5
$$ 117 23 94 75 75 235 226 88 76 134 57 67 144 46 25 45 46 194 166 261 34 103 135 76 76 100 235 178 135 19 120 150 176 241
3429B41k1jj52R5j05J0M4O8P1m5j55KJ5j7kN2J19j39j5j3J29j33R4m3o4k8K3P9Q5Q0j03j10
$$ 241 220 219 67 162 57 67 111 179 250 205 50 52 67 50 48 100 219 80 65 52 181 48 142 99 35 7 30 109 194 274 171 61
3128F1mL2N4M3l9q1j8O8MMJ21l8j36O8J84m0k05J4Q0p6o5O0K73M10l80k19j10Q5p9QJ59j43
$$ 61 57 89 143 186 147 66 48 116 120 124 245 207 71 139 323 283 78 92 172 96 31 91 364 774 394 175 65 150 71 79 238 95
2828I5J05j34P3M9p1j02Q3Q7p1nN8r6Q1J17l2L46k96J17j35k49J39J1q8jj4M9k6K6j3Q6N8
$$ 95 200 66 139 188 117 15 98 185 114 109 167 71 152 269 237 583 287 404 269 20 159 170 82 81 67 116 90 116 103 189 247
2537B47p7n7r6J0J06l9J1k2J2L3L1k6J47j18p9l6rO0m3Q5J20j17n4M7r3Q1m1l7L5l1O1m9M3
$$ 247 170 113 17 27 133 94 105 83 95 128 159 133 280 162 83 47 38 98 55 140 260 143 89 136 43 124 83 46 81 50 111 62 105
2227A05k9p1P4N9J0R7q5P5j29n9J1J00k5n4PoN9J7J58k35K47k61P1J80J71j74N231k14m991
$$ 105 76 5 79 138 148 245 160 235 106 47 58 158 133 79 86 80 139 156 314 79 326 65 136 316 487 313 5544 5330 339
1955C39J8k01J51j88l1J42j85J09j05J53J5l8J19j34j4J62k01J77j17o7K6P1K3J01k26Q0o5
$$ 339 357 156 307 119 88 230 45 154 49 202 217 179 298 164 150 312 111 288 171 104 130 201 224 325 99 179 114
1701A14J22o3J9j14M3n2P7k3m8j5L6OJ5k0K9Pj04J9jL7J50j53J467m03m00k87K34l91j81n4
$$ 114 236 173 192 78 121 69 146 123 75 60 96 102 117 97 126 133 29 48 47 84 234 81 1548 1145 745 458 692 301 120 66
1419F6J68j50L9o1R3k1K4r3J00m5p8J02p1K8Rj8J31j81Rk7Q7o9LO1J5j3k9M9l0%K9j9MN4p6
$$ 66 234 84 123 62 155 134 158 65 165 120 42 144 73 101 110 92 223 42 51 24 111 42 45 106 121 108 79 128 98 98 127 108 112 166 90
1091I0J1k7O7m6l4L9N8l5n6mm3R0O5j8p4o2N7NJ04j10J0k2L2Op2J2LrQ0k5k1jQ1k1p0R2K3
$$ 90 101 74 141 95 61 100 158 123 67 63 20 110 175 157 83 21 78 83 187 77 87 65 97 103 31 43 46 37 117 92 71 70 151 130 60 152 175
743A75j41P0n6J33Np3m3J33l7p7M0OK9J0K5j63R4jJ4J23j3p1r6J32N8j46K1k6n6J0J4k5J28
$$ 175 34 104 48 181 186 113 70 203 166 89 129 135 164 174 199 36 130 129 143 266 253 182 86 218 276 130 151 125 69 79 93 68 196
433A96RK76M93j40l78l75J15R5q8l2j56J27p8O5j8jP6l6l1J1LJ0PP8n9rN1j71J17L7p0n2J03
$$ 196 205 481 974 834 456 81 196 291 203 171 15 142 64 129 111 110 186 150 119 130 133 143 150 228 169 160 211 40 157 194 124 72 175
124A75L7r3q0M8M9o7lpN2O1J3pj23Pk1L3QJ04p9m2K25j4j08n1k9p6Q0ML8J2j17J12o1K8j7
$$ 175 212 119 39 87 136 69 66 59 111 172 185 178 55 62 41 74 82 186 107 65 290 276 168 117 88 12 92 96 134 146 29 141 80 108 91
-205I1Pk1J1p2J82j50J10o3j6M4PJ08p7LjK4k7o8p7O2
$$ 91 98 77 88 16 198 48 158 95 79 123 130 238 161 164 163 187 160 92 15 77
-393G7
##PAGE=	F1=-815.408
##FIRST=	4405.4455391999963467,	4405.4455391999963467,	0
##DATA TABLE=	(F2++(Y..Y)), PROFILE
4405F8rk7Q0j2J38j08N8l4r3J3K6%l6rL0L1PK2j24P9K1L5j39J49M3m2Kn2q9J19M0j13j8L0
$$ 68 59 32 112 100 238 130 188 154 61 74 100 100 64 55 85 116 123 145 21 100 121 156 17 166 209 167 169 117 28 147 187 74 56 86
4086H6n7N0N9O0K7q0q0K8j2j2k3J28L5j14NM3J3j03J9Kj0J5n9pP9Nm4l9J00jp2M9K9K0M4j48
$$ 86 29 79 138 198 225 145 65 93 81 69 46 174 209 95 100 143 156 53 72 74 64 79 20 13 92 97 53 14 114 113 41 90 119 139 183 35
3748C5Q7r3P3l6j5J61pj24J2N8j22L8O6j08JJ5k1J74OP5k62J24k5k2n7Q6J24o7j5j22J03L
$$ 35 122 29 102 66 51 212 205 81 93 151 29 67 133 25 26 41 20 194 200 275 13 137 112 90 33 119 243 176 161 39 142 145
3448A45J1O9NKj38P0j02lK2Q8J00o8j38qJOk0L8J13p3p0K4J18j60J14Jj17j0K0Q7R5M7p1j73
$$ 145 156 225 230 232 94 164 62 59 81 169 269 201 63 55 56 62 42 80 193 120 50 74 192 32 146 147 30 20 40 127 222 269 198 25
3128B5J4N4N0K7k2n8o1R6J5l0J95J2k16L7J37nk04N1L4m2m4O9L07L20k35m41n6J04l1k3J58
$$ 25 39 93 143 170 148 90 29 125 140 110 305 317 101 138 275 270 66 117 151 109 65 134 441 761 526 85 29 133 102 79 237
2837B37j43O8j13J27m0m1p1O6O4m1k1M1o2R3N3m9L69j3k64pk20J15j2m3m4l7N3J2K0l0J21
$$ 237 94 162 49 176 136 95 24 90 154 113 92 133 71 164 217 168 537 524 260 253 33 148 136 93 49 12 65 77 97 67 188
2546A88M5p5p3m0QJ26p9M6n7o4R6Rm3K16j17r0l4J8j2k9P1J67j45q0J27q4K6m2k9J5nkM2m4
$$ 188 233 158 85 45 53 179 100 146 89 25 121 130 87 303 186 96 62 80 68 39 110 277 132 52 179 95 121 79 50 65 60 58 100 56
2227E6M8nM6m0Q1j6K9Pq6r3oO7m5N8L0q3J11P0k5n3l3J40jN6j7J110N101k553l136n49k06
$$ 56 104 99 145 105 186 170 199 206 120 27 21 88 43 101 131 48 159 229 204 151 118 258 257 313 296 1406 6507 3954 818 269 63
1936F3K3R7L2m7k3m5kK4P4K6l1j50J61J25k19J93n8j27oK7o6J72k10J08K2J01p6m3m6Q5m0
$$ 63 86 183 215 168 145 100 98 122 196 222 191 41 202 327 108 301 243 116 110 137 71 243 33 141 163 264 188 145 99 184 144
1645A44L6m8n3J9O%L3n8L5l8o0N9k8R1P4N58K112n68j845K0K23m13j34q5J10j14M4l9O4qp5
$$ 144 180 132 79 98 104 104 137 79 114 76 16 75 47 138 212 770 2882 2314 469 489 712 299 165 80 190 76 120 81 145 137 62
1354F2L0L1Nj13Q0j2J3j7n3K06k16M6j5P9k7o5R0j1m1N7J4m1k4J8J4K1Mk4%l0M8o9L3k3P9
$$ 62 92 123 128 15 95 83 96 79 26 232 16 62 47 126 99 34 124 113 72 129 143 102 78 96 110 131 135 111 111 81 129 60 93 70 149
1025A49pp9kNL9J02p2Nr3K2k5J09j13O4k2j4M8o7MMj2Q9m8k4L1L2J5o9K7O5j13N8p1J12K8
$$ 149 142 63 61 66 105 207 135 140 47 69 44 153 40 104 82 68 116 49 53 57 45 134 86 62 93 125 140 71 98 163 50 108 37 149 177
$$ [...]
-393A02
##END NTUPLES=	nD NMR SPECTRUM
##END=	
##END=	
