##TITLE=	3Kcb7471RDKhvELZysKHMw.44.ser
TM-VI-138solid hmbc

##JCAMP-DX=	6.0	$$ MestReNova 14.3.0-30573
##DATA TYPE=	LINK
##BLOCK_ID=	1
##BLOCKS=	2    
##ORIGIN=	Mestrelab Research S.L.
##OWNER=	hrzepa
##$MNOVA/LINK_BLOCK_TYPE=	ITEM	$$ NMR Spectrum
##$MNOVA/ITEM/POLYGON=	(XY..XY)
5321,5835
8722,5835
8722,8208
5321,8208
5321,5835
##$MNOVA/ITEM/Z=	0
##$MNOVA/ITEM/ANGLE=	0
##TITLE=	3Kcb7471RDKhvELZysKHMw.44.ser
##JCAMP-DX=	6.0	$$ MestReNova 14.3.0-30573
##BLOCK_ID=	2
##DATA TYPE=	MNOVA NMR VIEW DATA
##DATA CLASS=	MNOVA VIEW DATA
##$MNOVA/2D/THRESHOLD=	4.9655060768127441406
##$MNOVA/ITEM/ZOOM/X=	-0.47669846964044454429,	14.506009999935889354
##$MNOVA/ITEM/ZOOM/Y=	-9.5219447936452610293,	250.03239999719292541
##END=	
##TITLE=	3Kcb7471RDKhvELZysKHMw.44.ser
##JCAMP-DX=	6.0	$$ MestReNova 14.3.0-30573
##BLOCK_ID=	3
##DATA TYPE=	nD NMR SPECTRUM
##DATA CLASS=	NTUPLES
##NUMDIM=	2
##ORIGIN=	Bruker BioSpin GmbH
##OWNER=	nmr
##.OBSERVE FREQUENCY=	400.32280223999998725
##.OBSERVE NUCLEUS=	^1H
##.SOLVENT NAME=	CDCl3
##.PULSE SEQUENCE=	hmbcgplpndqf
##LONGDATE=	2021/10/27 21:04:00.000
##.ACQUISITIONMODE=	SIMULTANEOUS (DQD)
##$ORIGINAL FORMAT=	Bruker XWIN-NMR
##$MNOVA/SCALES_VERSION=	9
##$PARAMETER FILE=	(acqu2s, ASCII, /private/var/folders/f6/rjf_tdyn2v98c5c0wvkgn4s80000gn/T/3Kcb7471RDKhvELZysKHMw/44/acqu2s, 0)
$$ ##TITLE= Parameter file, TOPSPIN		Version 3.2
$$ ##JCAMPDX= 5.0
$$ ##DATATYPE= Parameter Values
$$ ##NPOINTS= 129	$$ modification sequence number
$$ ##ORIGIN= Bruker BioSpin GmbH
$$ ##OWNER= nmr
$$ $$ 2021-10-27 21:23:36.931 +0100  nmr@CZC2524DW0
$$ $$ /opt/topspin/data/agmb/nmr/Oct27-2021/44/acqu2s
$$ $$ process /opt/topspin3.2/prog/mod/go
$$ ##$ACQT0= 0
$$ ##$BF1= 100.660544
$$ ##$FnMODE= 1
$$ ##$NUC1= <13C>
$$ ##$NusJSP= 0
$$ ##$NusT2= 1
$$ ##$NusTD= 128
$$ ##$O1= 12079.3932956644
$$ ##$SFO1= 100.672623393296
$$ ##$SW= 260.03107487261
$$ ##$SW_h= 26178.0104712042
$$ ##$TD= 128
$$ ##END=
$$ 
##$PARAMETER FILE=	(acqus, ASCII, /private/var/folders/f6/rjf_tdyn2v98c5c0wvkgn4s80000gn/T/3Kcb7471RDKhvELZysKHMw/44/acqus, 0)
$$ ##TITLE= Parameter file, TOPSPIN		Version 3.2
$$ ##JCAMPDX= 5.0
$$ ##DATATYPE= Parameter Values
$$ ##NPOINTS= 12	$$ modification sequence number
$$ ##ORIGIN= Bruker BioSpin GmbH
$$ ##OWNER= nmr
$$ $$ 2021-10-27 21:23:40.106 +0100  nmr@CZC2524DW0
$$ $$ /opt/topspin/data/agmb/nmr/Oct27-2021/44/acqus
$$ $$ process /opt/topspin3.2/prog/mod/shimcntl
$$ ##$ACQT0= 1000000
$$ ##$AMP= (0..31)
$$ 100 100 100 100 100 100 100 100 100 100 100 100 100 100 100 100 100 100
$$ 100 100 100 100 100 100 100 100 100 100 100 100 100 100
$$ ##$AMPCOIL= (0..19)
$$ 0 0 0 0 0 0 0 0 0 0 0 0 0 0 0 0 0 0 0 0
$$ ##$ANAVPT= -1
$$ ##$AQSEQ= 0
$$ ##$AQ_mod= 3
$$ ##$AUNM= <au_zgonly>
$$ ##$AUTOPOS= <54 >
$$ ##$BF1= 400.32
$$ ##$BF2= 100.660544
$$ ##$BF3= 400.32
$$ ##$BF4= 400.32
$$ ##$BF5= 400.32
$$ ##$BF6= 400.32
$$ ##$BF7= 400.32
$$ ##$BF8= 400.32
$$ ##$BYTORDA= 0
$$ ##$CAGPARS= (0..11)
$$ 0 0 0 0 0 0 0 0 0 0 0 0
$$ ##$CFDGTYP= 0
$$ ##$CFRGTYP= 9
$$ ##$CHEMSTR= <none>
$$ [...]
$$ 0 0 0 0
$$ ##$ShimPowMaxUC= (0..63)
$$ 130000 130000 130000 130000 130000 130000 130000 130000 130000 130000 130000
$$ 130000 130000 130000 130000 130000 130000 130000 130000 130000 0 0 0 0
$$ 0 0 0 0 0 0 0 0 0 0 0 0 0 0 0 0 0 0 0 0 0 0 0 0 0 0 0 0 0 0 0 0 0 0 0 0
$$ 0 0 0 0
$$ ##$ShimPowMaxUG= (0..63)
$$ 524287 524287 524287 524287 524287 524287 524287 524287 524287 524287 524287
$$ 524287 524287 524287 524287 524287 524287 524287 524287 524287 0 0 0 0
$$ 0 0 0 0 0 0 0 0 0 0 0 0 0 0 0 0 0 0 0 0 0 0 0 0 0 0 0 0 0 0 0 0 0 0 0 0
$$ 0 0 0 0
$$ ##$ShimPowRcbType= 3
$$ ##$ShimPowRes= (0..63)
$$ 1e-20 1e-20 1e-20 1e-20 1e-20 1e-20 1e-20 1e-20 1e-20 1e-20 1e-20 1e-20
$$ 1e-20 1e-20 1e-20 1e-20 1e-20 1e-20 1e-20 1e-20 0 0 0 0 0 0 0 0 0 0 0 0
$$ 0 0 0 0 0 0 0 0 0 0 0 0 0 0 0 0 0 0 0 0 0 0 0 0 0 0 0 0 0 0 0 0
$$ ##$ShimPowRng0= (0..63)
$$ 1 1 1 1 1 1 1 1 1 1 1 1 1 1 1 1 1 1 1 1 0 0 0 0 0 0 0 0 0 0 0 0 0 0 0 0
$$ 0 0 0 0 0 0 0 0 0 0 0 0 0 0 0 0 0 0 0 0 0 0 0 0 0 0 0 0
$$ ##$ShimPowRng1= (0..63)
$$ 1 1 1 1 1 1 1 1 1 1 1 1 1 1 1 1 1 1 1 1 0 0 0 0 0 0 0 0 0 0 0 0 0 0 0 0
$$ 0 0 0 0 0 0 0 0 0 0 0 0 0 0 0 0 0 0 0 0 0 0 0 0 0 0 0 0
$$ ##$ShimPowRng2= (0..63)
$$ 1 1 1 1 1 1 1 1 1 1 1 1 1 1 1 1 1 1 1 1 0 0 0 0 0 0 0 0 0 0 0 0 0 0 0 0
$$ 0 0 0 0 0 0 0 0 0 0 0 0 0 0 0 0 0 0 0 0 0 0 0 0 0 0 0 0
$$ ##$ShimPowRng3= (0..63)
$$ 1 1 1 1 1 1 1 1 1 1 1 1 1 1 1 1 1 1 1 1 0 0 0 0 0 0 0 0 0 0 0 0 0 0 0 0
$$ 0 0 0 0 0 0 0 0 0 0 0 0 0 0 0 0 0 0 0 0 0 0 0 0 0 0 0 0
$$ ##$ShimSysFunc= (0..63)
$$ 1 2 3 4 5 7 9 11 15 16 8 10 12 14 6 17 13 18 19 20 0 0 0 0 0 0 0 0 0 0
$$ 0 0 0 0 0 0 0 0 0 0 0 0 0 0 0 0 0 0 0 0 0 0 0 0 0 0 0 0 0 0 0 0 0 0
$$ ##$ShimSysMatrix= 0
$$ ##$ShimSysType= 1
$$ ##$TFXNUM= 0
$$ ##$TRIPLO2= 0
$$ ##$VTU= 2
$$ ##$VTUETH= <149.236.99.20>
$$ ##$VTUTY= <no>
$$ ##$WBREFAM= (0..15)
$$ 132.2 106.2 100 100 100 100 100 100 100 100 100 100 100 100 100 100
$$ ##$WBREFLM= (0..15)
$$ 0 0 0 0 0 0 0 0 0 0 0 0 0 0 0 0
$$ ##$WBREFPH= (0..15)
$$ 77.55 -65.76 0 0 0 0 0 0 0 0 0 0 0 0 0 0
$$ ##$WBSGU= (0..15)
$$ 0 0 0 0 0 0 0 0 0 0 0 0 0 0 0 0
$$ ##$XFAC= 2
$$ ##END=
$$ 
##$DECIM=	3328
##$DSPFVS=	20
##.ACQUISITIONSCHEME=	NOT PHASESENSITIVE
##NTUPLES=	nD NMR SPECTRUM
##VAR_NAME=	FREQUENCY1,	FREQUENCY2,	SPECTRUM
##SYMBOL=	F1,	F2,	Y
##.NUCLEUS=	13C,	1H
##.OBSERVE FREQUENCY=	100.67262339329600707,	400.32280223999998725
##VAR_TYPE=	INDEPENDENT,	INDEPENDENT,	DEPENDENT
##VAR_FORM=	AFFN,	AFFN,	ASDF
##VAR_DIM=	512,	512,	262144
##UNITS=	HZ,	HZ,	ARBITRARY UNITS
##FIRST=	25168.397401625570637,	5807.04592319999756,	0.19017356634140014648
##LAST=	-958.48414287705929837,	-190.8319313673060833,	0.4640839695930480957
##MIN=	-958.48414287705929837,	-190.8319313673060833,	0.00083598645869642496109
##MAX=	25168.397401625570637,	5807.04592319999756,	52.9976959228515625
##FACTOR=	1,	1,	0.003200931234768828685
##PAGE=	F1=25168.4
##FIRST=	25168.397401625570637,	5807.04592319999756,	0.19017356634140014648
##DATA TABLE=	(F2++(Y..Y)), PROFILE
$$ [...]
##PAGE=	F1=9113.91
##FIRST=	25168.397401625570637,	5807.04592319999756,	0.43029135465621948242
##DATA TABLE=	(F2++(Y..Y)), PROFILE
2791B71Nk18K5M8j14J46n9O4K9r0l4M3L6R5o6j03R8q9Ok9O0O4j8n9kR4M3k2Nj49R9o4Q7r6
2391A06N0p8J72j20l5NJ2k0P1l0l6m6j2J88l1j4L2k9p2L7O3j47J6J24j20j4M0p9J68j31N4
2028A24m2J25r1J41L7j79o1pJ11j7O7j13j9R6M1j05J00R6j88J8k0J20q0j43N3J9k5j1K14l9
1675B22R0l5Kj31l0m8j1M8j5N3j18P8J04j21P3J15j20o5J04P6j52M3k3l2L1r0k6K7j1J0pP5
1300A16m4O4Qj29L2j0J54J5j0q4J02p1m6J71L5j04n7J61j67J17p4j20pP8q3P2J3Q6j87J13
948A44p4k7L6Q4p7n4N6J0J20ML8l8m4j26Q3J6J2k0K8N2j61R0o2R9j43K7L3M1N0j72R3O9j21
560F6k6K6J12q0P2j4J73j85jJ32j4m2O9k49J18r6N7RQ5o1j5l7LJ09j26j4L0MM7km1L7q2M9
161A13J23j24o5J84Q2k20k8MK5O9j06P1o9L3L8j6J92k28K29j83p4K1KN0m4R6n4J06j16j9
$$ plain form
2791 271 276 58 83 131 17 163 104 168 197 107 73 116 152 247 181 78 176 87 93 64 124 188 170 111 109 203 246 224 229 80 179 115 202 106
2391 106 156 78 250 130 95 100 112 92 163 133 97 51 39 227 196 182 214 185 113 150 213 66 82 206 86 72 112 33 201 70 124
2028 124 82 207 116 257 294 115 54 47 158 141 208 95 76 172 213 108 208 304 116 134 114 234 154 11 64 83 58 47 261 222
1675 222 312 277 279 148 118 70 59 107 92 145 27 105 209 88 161 276 156 91 195 271 119 162 139 107 138 48 22 49 38 48 41 116
1300 116 72 136 144 15 47 37 191 206 196 112 214 143 97 268 303 199 142 303 136 253 179 59 52 130 47 119 132 218 31 144
948 144 70 43 79 163 86 32 88 98 218 222 260 222 178 52 135 151 163 143 171 223 62 152 90 189 46 73 106 147 197 25 118 187 66
560 66 40 66 178 98 170 156 329 144 143 275 261 219 288 39 157 61 118 127 212 151 136 99 102 211 85 71 101 105 152 150 109 146 64 113
161 113 236 112 47 231 313 93 65 69 94 163 57 128 59 92 130 114 306 78 307 124 50 71 73 123 79 175 121 227 111 92
-191I2
##PAGE=	F1=9011.66
##FIRST=	25168.397401625570637,	5807.04592319999756,	0.38031709194183349609
##DATA TABLE=	(F2++(Y..Y)), PROFILE
5807A73j22PK4N3L2l7O2j2M2L8j76K0o7J49J15j64r8O2l0o7J38j5J07j89J20n4q4J20m4n4
5455D9K1J12K5p8j1m2m4J61l5m6k1J29K0j61M4Q2j61Q0q7Q0m2O7o6K3J6lN9R2j66n3O0j9o1
5068B4J58o3K8M1q3O9m9M1j30N2R9J63j95lO5j21n4qJ73n5k9J28r7J48k01Q0m4p1J02K0m9
4704A39J18J8j69N6j06J0K2J24j20K74j21k26J52L7j7l6O6l4q1K9jn5m2J1M2rM6M9j51J12
4352A37R2p8J30j53R1m5n3k0R1J03J2M4k61Q2m7Mn0N3ok3o3R5q5N9P0j14K9J12j57N8k3J12
3976A96O1j29k6m1N7m8j0jJ13p2j2l5K5P7o3J09J47k14N1j44J5J14Q4q9K3N9j86O7o6P1p8
3612E5Q2N2M3j63QO1J1j4k2n3jJ06l7n5M5q2%M7l0K8n4J5P9J27j31n5Q1J56r3j46N2N7j2m6
3213A11QJ2o8M7M5m3J8j02K43j58J17q9p8Q4mn1L5p8K9J33q8j3l8M5n6J65r1k3K4mJ67k88
$$ plain form
5807 173 51 58 82 135 167 130 192 180 222 260 84 104 37 186 301 137 39 101 71 4 142 127 234 45 165 111 27 147 103 49
5455 49 70 182 207 129 118 76 32 193 158 112 91 220 240 79 123 205 44 124 37 117 75 142 76 99 115 112 171 263 97 44 104 85 24
5068 24 182 119 147 188 105 174 125 166 36 88 187 350 155 152 217 96 42 34 207 152 123 251 154 302 101 181 137 66 168 188 139
4704 139 257 275 106 162 56 66 88 212 92 366 245 19 171 208 191 155 221 187 106 135 134 79 37 48 90 81 127 176 25 137
4352 137 229 151 281 128 219 174 121 101 192 295 307 351 90 172 125 129 79 132 126 103 40 135 50 109 179 65 94 206 49 107 84 196
3976 196 257 128 102 61 118 70 60 59 172 100 88 53 78 155 92 201 348 134 185 41 56 170 254 165 188 247 61 128 62 133 55
3612 55 137 189 232 69 77 138 149 135 113 60 59 165 128 73 118 36 36 83 53 81 27 42 121 248 117 62 143 299 206 60 112 169 157 111
3213 111 119 131 63 110 155 112 130 28 271 113 230 141 63 147 143 92 127 49 78 211 123 110 72 117 61 226 135 112 136 132 299 11
2837A1N2J19qQ9J2k31J6P4j05J53q7P6K6r8m3Q2jR5n5j36J64j01J9o2R3L8j3r0Q9O0J8Lk4
2450B35j33J20q5N9o5m4QJ60p3n6p3L8k3R0m4l7MK3J61q6M5mj7j07J24K3j59j9J36j07J3J3
2075A20j07K17j07OqJ26j19J31N0j89l1m8J12J2N6j72k2J59J1r9N7J25j65L5m2J27j00j33
1746BO8L5j5m0J92RL8Mk4j06l1l4Ol9M2P0j56J03R6j17R7K13k01K20l6m3j62l8l6o3P8o0k5
1359D7N6p1L9j1L5l8Q9k4n5J6n5J33J8N8j45J04l4k4J21Q8j29q7J42j64J68j09r0o5O7j7R2
995A55n2J18j93J41n1j01P7P9r7l5P5k1R6J6O0k7n6j08K5K5O6l9K2O5r6K7l3J05j48j8P9L3
619A89O4j92O3M2j07N0j2M1j6N4m0J94j88kJ47k9m8O1k18L8pM4l3J50p0k6m6K9J22j60pL4
243A21J6P0Kl4Mj00L7J23j51k7J60J08k44j0Qm9J18r1J23j18LM9L2K07l00K91k05q8K0Rj0
$$ plain form
2837 11 63 182 174 263 275 44 60 134 29 182 95 171 197 99 56 138 137 232 177 41 205 104 123 61 154 192 179 89 178 238 256 259 235
2450 235 102 222 137 196 131 87 95 255 182 126 53 91 68 158 114 77 81 104 265 179 224 220 203 96 220 243 84 65 201 94 107 120
2075 120 13 230 123 129 121 247 128 259 309 120 89 41 153 165 221 49 27 186 197 98 155 280 115 150 108 235 135 2
1746 2 70 105 90 50 242 251 289 293 269 163 132 98 104 65 107 177 21 124 220 103 200 413 212 432 396 353 191 153 117 54 132 72 47
1359 47 103 32 71 60 95 57 146 122 67 83 28 161 179 237 92 196 162 138 259 347 218 131 273 109 277 168 78 13 80 63 155
995 155 103 221 28 169 118 17 94 173 76 41 116 95 191 207 267 240 184 76 101 126 192 153 175 240 144 171 138 243 95 77 156 189
619 189 253 61 124 166 59 109 97 138 122 176 136 330 142 140 287 258 210 271 53 91 84 128 95 245 175 149 103 132 254 94 87 121
243 121 137 207 209 175 179 79 116 239 88 61 221 329 85 75 83 34 152 61 184 66 69 118 150 357 57 348 143 55 75 84 74
-120G4k1Q4l4J05p5R
$$ plain form
-120 74 53 137 103 208 133 142
-191A42
##PAGE=	F1=8909.4
##FIRST=	25168.397401625570637,	5807.04592319999756,	0.28468573093414306641
##DATA TABLE=	(F2++(Y..Y)), PROFILE
5807A91j44k7M2P1L9n9M7nM2N1j46kp9J75J11j59o6J6p2j5J14n3J42j32R0o1n3M8m5L4PO2
5431A64K6l2J4r0l9J38J0l8o9J27N6j74M9N3j44N7q6O9j5P2r0P3j9j9Q7M7j44ql3J6j2J29
5056A75n6M8l4j9Q0o2Kj05Q8L7J44j24m9M1q7m5L8J74j08p5J29j4J50k55P1om8P1N6r3Q4M7
4680B55j46L6j26L8L5J03q8K36j48j42J14J4l1n8J28j1o2n9qLKj6L7m7L2P6j24J03Q6n4J26
4316C04j83J27p7l4LN0J03RJ7k34N8o9N5l7J8j5Oo2P1o8J0J11r4K1J37j85Q2p1J22Q0j30l2
3941I3jL5n2j4PJ40j28M2n4OJ39q0P7J45k41R9j57lJ21R6o2QP8k14O0j14J27j19R7N2O7j94
3565E6j3J52k3l4l0Jl4O8j9k6K6n2k5Q3q5L9n1J2O1R3j31O9kJ45n5j74P6M0Mk7j8j0o2O1M1
3154A56n8jp4K43j78J55q6r9Q6k2m6M7q5L8J61n6o3l9N0r3J62n8k1J7m5K29l10N4J39m8Q2
$$ plain form
5807 191 47 20 62 133 172 113 160 155 197 248 102 100 21 196 307 148 82 98 26 11 125 72 214 82 172 111 58 106 61 95 102 164
5431 164 190 158 172 82 43 181 191 153 84 211 267 93 142 195 51 108 22 91 76 148 58 131 112 93 180 227 83 75 42 58 46 175
5056 175 119 167 133 114 194 132 134 29 117 154 298 174 125 166 79 34 72 246 138 63 192 178 328 73 144 138 90 161 217 124 208 255
4680 255 109 145 19 57 92 195 107 343 195 53 167 181 150 92 220 209 147 88 80 83 85 69 106 59 91 167 43 146 232 178 304
4316 304 121 248 171 137 140 190 293 302 319 85 143 74 129 92 110 95 101 39 110 42 52 163 69 90 227 42 124 53 175 255 125 93
3941 93 92 127 75 61 68 208 80 122 68 74 213 133 210 355 114 213 56 53 174 270 208 216 294 80 140 26 153 34 131 183 250 56
3565 56 43 195 172 138 108 109 75 143 124 98 124 72 47 130 45 84 33 45 106 199 68 137 135 280 225 51 127 167 171 144 126 116 54 115 156
3154 156 98 97 23 266 88 243 157 58 144 122 76 123 38 76 237 181 118 79 129 36 198 140 119 136 91 320 10 64 203 155 237
2791B37K5k43K4J35j13J21j09P8K7j01m1J18k7M9m5j07J84j04L9l1O6kj8r3J75L8j9Ql9q3
2438A49J16j02Roj38Q5J33l3p3r9O6o0R1p5l0R7L6J00j29R9pJ7j15J38pj67n6J36r9O1j7p9
2063D1K04r5j1J2J26j22O5O1j57J8q5Q5K8N2k03K1J48l5q0J5J63j35N8q5J41j15j04O4N0k
1711A23j7R7N5j7N9o8p6rj0K2q9P1N4j40P2J47j64J28K91q5M23j60k84j63j25k1r3R4j1k3
1359H1N1l4Rl8Nk3J05m3Pj6n3O6J6J14j40O6j7PO4J38j53r5J21j51K05j23q5k1J9KR4r1J26
971B13j38J27n1j29P1N6j01PQ1l6O0J5P6Pp0p2j4K9O5o4L1R3m0m3j5J22j46m1J10%Q1j84L2
584A32J0o4Q7n7l1P8M7j15J99j51QJ33m6m9M3j64jL6N3o0J59n9n1l8P7J18j91j5P0%R7J4n1
197B18l4j05L1J02j73M5J25J20k44j8J4M1K4r4J77j41rL3Q2K16l30K79k19p3j7K5l8M9J1L8
$$ plain form
2791 237 262 19 43 178 65 186 77 155 182 81 40 158 131 180 135 28 212 108 147 116 182 180 162 69 244 282 263 271 232 149
2438 149 265 163 172 166 28 113 246 213 140 41 107 47 138 63 33 130 166 266 137 236 229 246 131 269 262 95 39 175 76 137 120 41
2063 41 245 150 139 151 277 155 220 281 124 142 57 142 170 222 19 40 188 153 73 88 251 116 174 89 230 115 11 75 125 123
1711 123 106 203 258 241 300 232 156 147 137 159 70 141 195 55 127 274 110 238 529 444 867 707 423 260 135 114 21 115 104 81
1359 81 132 98 107 69 74 51 156 113 120 104 51 117 133 247 107 173 156 163 227 365 212 117 238 87 292 169 84 63 82 84 178 87 213
971 213 75 202 151 22 93 149 48 55 136 100 160 175 251 258 188 116 102 131 196 132 163 256 216 173 158 280 134 93 203 203 284 100 132
584 132 142 78 165 108 77 155 202 87 286 135 143 276 230 181 224 60 59 95 148 88 247 188 137 99 176 294 103 88 158 158 255 269 218
197 218 184 79 110 212 39 84 209 329 85 67 81 122 146 52 229 88 79 112 194 410 80 359 140 67 50 75 37 86 97 135
-156A35L4rL3
$$ plain form
-156 135 169 160 193
-191A93
##PAGE=	F1=8807.14
##FIRST=	25168.397401625570637,	5807.04592319999756,	0.11766455322504043579
##DATA TABLE=	(F2++(Y..Y)), PROFILE
5807A89j42l5L2R8L5q5K4NO7O4j31j0p6J48J15j16n5l5o4j5R6p2J40p5O7m8n7j0kJ01JjOK5
5408A84M4j29p1J14P6k1j06J01R9j77N5kr4O3q1L6j2O6j10J35o3n0R9Np4Pn7kL7P1j2M6j08
5021F9M8R8q3k9m6R6l8J16m6o8Nl4m6N7J57j33p9P3N6J38k62N3N4l8K1Q5j20M2N1j04K8q0
4645D1MM4O8k7J49j69j5O1j2l6o6J68%l1j32l5R4J5j0j9k0rQ2p2P0P0j8J07j93J30r4j0L4
4258A69%P8J5Oj83M1n8N3j4%m5L0j9kk3jR9p0LJ60k07J42j46J27R6j14l4J9J8o4j9K7J39j71
3859E2J05q5QJ74r9N0J50k49R9j30j9J03Q7j9j0J03k26L9j07J36j26R0M5P0j91j6K05n8l9
3518A42m7O5j0l4J9k7J8j0n3J25j56M1K4k4K2P2p4J22p4J12j3j81P7K1K6j1m3m7m2P4K9n8
3143H5k6RJ91j60J33p9j03Q6l1l1K9q2P6J52j2j08l9K8r4J34l5k1L8r3K62l00N4J54p7O1M2
$$ plain form
5807 189 47 12 44 142 177 92 116 121 188 252 121 111 35 183 298 182 127 92 28 13 109 37 177 102 169 121 64 54 52 153 154 153 159 184
5408 184 228 99 28 142 218 197 91 192 291 114 169 167 73 136 55 91 79 145 35 170 107 57 156 161 87 94 37 35 72 143 131 177 69
5021 69 117 215 132 103 57 153 115 231 185 117 122 88 42 99 256 123 44 117 173 311 49 102 156 118 139 224 104 146 197 93 121 41
4645 41 45 89 157 130 279 110 95 156 144 108 42 210 210 179 47 12 106 121 111 92 72 63 145 73 143 213 195 302 109 239 145 135 169
4258 169 169 247 262 268 85 126 68 121 107 107 62 92 73 71 48 47 146 76 79 239 32 174 28 155 251 137 103 122 140 76 57 84 223 52
3859 52 157 72 80 254 155 205 355 106 205 75 56 159 246 227 217 320 94 133 26 162 36 126 171 241 50 34 239 181 142
3518 142 95 160 150 116 135 108 126 116 63 188 32 73 97 73 95 167 93 215 141 253 240 59 136 157 183 172 129 82 40 114 143 85
3143 85 59 68 259 99 232 153 50 136 105 74 103 21 97 249 237 129 90 118 24 158 123 102 140 47 309 9 63 217 140 201 243
2779B43k32K5J82j23P7j13O6L0r9l0J43l7k7l4k8J50r0N2QL5m8k8m9K22L0o6%m5k5J09j03
2415A95o4P1j64Q8R8oq4n7O7j12P3r3K6J38L6K8j56J25L8M2j15J22l5j75o3J19j00J14n0m1
2063F5J70q6lK1J17r4k7P0q6M5j20N8J6O5j59M0R6r3n8QJ87j08P0j11J30j14o8M4O9RMKR0
1675B49o4J15j26m7K7J7K8j04P3K8r9J0K44k38J59L05J44N91k72n77j42k17K7p8M4L0KlK7
1335A53j0p1j6j0J15m4N1n3l6j1K8J32r2J3k0L9QJ70j65q0J11j47K27j13j08L1J8l7R1r9J20
971A95r1J14o2q3J1J7m7K8O2l8L0kQ9M9q7m6oNL7r6O0J24mr9j4J36j21n5J34m6R3j55Nk0j2
560A05R2r4q4J65N9k15J84q0J2R3o4l4K1j05K5LJ02p9J18m8p3j8J28J12k10m5J30l3J17K8
208C12q1o2r9L3O3j41R2Q3J15k22m9J4J38o2q7K10j42qNJ20K20l25K16k30k0p6L4m2J13o6
$$ plain form
2779 243 11 36 218 95 172 59 125 155 56 26 169 132 105 71 43 193 103 155 163 198 150 122 73 295 325 259 259 214 189 298 195
2415 195 131 202 38 126 224 218 134 77 144 32 105 12 38 176 212 240 84 209 247 289 174 296 261 86 23 142 42 156 106 65
2063 65 235 149 146 167 284 190 163 233 147 192 72 130 146 211 52 92 188 95 37 45 232 124 194 83 213 99 31 75 144 153 157 159 249
1675 249 185 300 174 127 154 171 199 95 168 196 97 107 351 113 272 577 721 1312 1040 463 321 104 131 53 97 127 129 126 153
1335 153 143 72 56 46 161 117 168 115 79 68 96 228 136 149 129 168 176 346 181 101 212 65 292 179 71 102 120 83 174 75 195
971 195 104 218 156 73 84 101 54 82 144 106 136 134 223 272 185 139 133 138 175 79 139 263 259 160 146 282 161 106 240 194 287 132 137 117 105
560 105 197 103 19 184 243 28 212 132 144 237 173 139 160 55 80 83 185 106 224 176 103 85 213 325 115 70 200 167 284 312
208 312 231 169 70 103 166 25 117 200 315 93 44 58 196 134 47 257 115 107 112 232 452 127 343 113 93 17 51 9 122 56
-144E6J17n4P0M2
$$ plain form
-144 56 173 119 189 231
-191B31
##PAGE=	F1=8704.88
##FIRST=	25168.397401625570637,	5807.04592319999756,	0.064973048865795135498
##DATA TABLE=	(F2++(Y..Y)), PROFILE
5807A70j24rLJ05K3r9KJ8J04O5j28Oj03J17J20m9o2q1nm9J02l0N1m2N0l8o9l7P0J22J0m4n1
5420A18Q3O3j41o5K4J54lj35O9J34j76P2p0k4R2j14J5l1Q2j34J94j09o6P6k2K6j7ro6P8pO3
5044A54J5j60J14J10j08m2MR8j11R0J8m1l1K5p4M6J27j27k6l4R5J24k18L6R7m5l5J16j24j2
4692H1K3n2P2mp9L8M8L2L1j40Q4J7l6j3k4J09jLj54K4P5RLp2N0p2O6pK0M0K3Q1j82J04r0J4
4269A21O6m4K5K7J8j23J3j1J1K1J6j00L4L7p3K8K0N1m5l3J84k16K12j44M2J10r4m7M3Kq0p
3894F4K9J22j86J51j14K9J79j23M9J59k37M1q1l4P6O4K8k1J26k23J0k9P9j01O3L9N1j74K8
3553F4K03q6l4p2J17K1j18N5m5K0L6q9J64k19L3J00n7jO7j0J26j19O4K7j66M6J3M8J1n9j06
3190C4J7O6Ll0o4P3J48j04N7o9r2P9j8j4qp1J40J02K4j36l4j4o6R1j7l7Q5j25K48k55M9J58
$$ plain form
5807 170 46 37 40 145 168 69 71 89 193 258 130 136 33 150 270 221 159 78 73 24 126 96 147 105 155 117 48 11 81 203 213 169 118
5420 118 201 264 123 58 82 236 233 98 167 301 125 197 127 103 195 81 96 65 147 13 207 98 32 108 86 112 95 86 20 98 91 154
5044 154 169 9 123 233 125 83 87 185 74 164 182 141 110 135 61 107 234 107 81 47 142 266 48 84 181 136 101 217 93 81
4692 81 104 52 124 120 41 79 127 159 190 50 134 151 115 102 78 187 186 189 35 59 134 143 146 74 124 52 118 111 131 171 194 275 93 197 107 121
4269 121 187 143 168 195 213 90 103 92 103 124 140 40 74 111 38 66 86 137 92 59 243 27 239 95 137 247 153 106 149 151 71 64
3894 64 93 215 29 180 66 95 274 151 200 359 122 163 82 48 124 188 216 195 321 98 108 79 158 57 120 159 210 36 64
3553 64 267 181 147 75 192 213 95 150 105 125 161 72 236 17 50 150 93 92 159 149 275 156 220 247 81 127 140 188 199 140 34
3190 34 51 117 120 90 26 99 247 143 200 131 39 118 100 86 78 7 147 249 273 137 103 89 23 114 97 60 145 20 268 13 62 220
2814B20r8M2N4j73oJ94j12K8r5L7L6r3j3J49l3j15L0L0P5o0M6M3Qq9k9J7K29L1j18j3m1K9
2438B10J02q1j56J56j64O7N6Qq7nP4j41K5L0QJ10K8m3j34Q6J26L4j12J08o7j83j3P7p3J13
2086A59p7JJ21p6J3K5R9m6r4P8j2L9j50N0l2Q9r8L9O5j33n1O6J49r0O6r3P6q3l7OR5J5J0o5
1687A24J06q0J46j76l5O6M5J8j13P3Ql9p9L51k97J80K40M28O99l54q49r5l09J04p7%M9N6j04
1347H6J02j5r5l4LJ06k4Q0q5j5p1O8Q5k6m2k8N7l1J69j59m3J07j55K31p5j46O6L7r2Q0p4J01
971A68n6R7p4qm8l0N2J5K6l5K1k4R0Q0j00l6K6l8K2j26Q6J52Qj29k8J36o7p5J55q8Q9j12j6
584A33m0L4P4j07l9J44Q2j88M0kLL8p7JNo2N2m1J87j06O0n5p9QJ65J14k13r5K04p6J20M2j09
197B17o3q9L7J3k6O8L3J02j88p3QJ99j27n8K10j23jk4J39K14k99J35k37O2o8m1LJ17j04J54
$$ plain form
2814 220 122 164 218 45 39 233 121 149 54 91 127 34 21 170 137 22 52 82 157 97 143 186 194 105 76 93 322 353 235 222 181 210
2438 210 312 231 75 231 67 134 190 198 111 106 180 39 64 94 102 212 240 197 63 149 275 309 197 305 238 55 42 119 46 159
2086 159 82 83 204 128 141 166 265 219 125 203 191 230 80 130 98 187 89 128 193 60 9 75 224 134 200 107 183 100 63 69 164 179 189 124
1687 124 230 150 296 120 85 151 196 214 101 174 182 143 64 415 118 298 538 966 1665 1311 462 367 58 162 85 85 134 190 86
1347 86 188 173 78 44 47 153 129 209 124 109 38 106 191 165 123 95 152 121 290 131 88 195 40 271 196 50 116 153 61 141 67 168
971 168 112 209 135 127 79 49 101 116 142 107 128 104 194 274 174 138 164 126 148 22 108 260 268 139 111 247 180 105 260 172 261 149 133
584 133 93 127 201 94 55 199 281 93 133 131 134 172 95 96 101 39 91 50 237 131 191 136 57 65 230 344 131 36 240 164 284 326 217
197 217 154 65 102 115 89 157 190 292 104 31 39 238 111 53 263 140 139 115 254 468 169 304 67 129 61 20 23 140 36 190
-156A90j21J42L3
$$ plain form
-156 190 69 211 244
-191B44
##PAGE=	F1=8602.63
##FIRST=	25168.397401625570637,	5807.04592319999756,	0.22025853395462036133
##DATA TABLE=	(F2++(Y..Y)), PROFILE
5807A36r9J6MQ3Qr9KK0J18N4j18M2j46Q6J16K5p3j14N8p5J27j1j5n0M6l6q9M0N3J25L0n9j36
5420F9J37O2j23j1j17K27J0j52M0J44j63R4j36N8J24j60j6m1J13j45K16j43k7rOQ0n7L9q3
5079C6Q7o1J07k9j01R9J08j32k4K7R0j64O8N4Jm5P1j08J1Q9r4J4q9Q4J23j38K6R6p2p9J59
4715B14j14p5kkJ62J9j42OP1M9q6M8K0on9M0kJ1j0L5j22N9M0mK3q3R4j48O4N1k5oN0N5j51
4305G4O3o4L6Q9p5n0M4N0p0k5L8l3P1M4j61K3Q4q0L1K6K2k0q7K10k06K64j33m4J19q1o1P9
3929A77j6j03K1J1R6j62J61j26N8J60j55Q1J70k09o0k3m1L3L7P1j7J37k11k3N1K6p8M2M2J9
3577A69j38Q5J61j03k4q5J36M8j62O9o7L2Q0j37J94k37lJ61q6QO7K5J14j35J5N4j41pL3N4
3225A80M6o3j20N1L1l2J9j07J10J13m3l1n9o7O1L0nn8m2J91M2L0j37k0o9K0L4Jq1J25j10J68
$$ plain form
5807 136 37 53 57 140 148 49 51 71 189 243 125 167 21 107 223 248 175 61 119 44 171 160 145 95 141 105 16 56 109 234 264 205 69
5420 69 206 268 145 134 17 244 254 102 142 286 123 217 81 139 263 103 87 46 159 14 230 87 60 51 57 137 80 119 36
5079 36 123 62 169 140 39 138 246 114 90 117 207 43 111 165 166 121 192 84 95 184 90 104 15 99 222 84 110 206 134 55 214
4715 214 100 25 23 21 183 202 60 66 137 186 100 148 168 162 103 143 141 152 142 177 55 114 154 150 173 90 184 36 100 151 126 120 170 225 74
4305 74 137 73 109 198 123 73 117 167 97 72 110 77 148 192 31 54 138 58 89 115 137 117 30 240 34 298 165 121 240 159 98 177
3929 177 161 58 79 90 186 24 185 59 117 277 122 203 373 164 104 81 40 73 110 181 164 301 90 67 118 144 66 108 150 169
3577 169 31 116 277 174 150 65 201 249 87 156 89 121 201 64 258 21 18 179 93 101 168 193 307 172 187 241 100 93 126 180
3225 180 226 163 43 94 125 93 112 5 115 228 185 154 95 28 89 119 114 56 14 205 247 277 140 120 51 71 105 106 25 150 40 208
2849B08j84M4J40j13L8N8j08l0J65p2j0p0NM0p7JJ26k0q6M7K9j6j7J5P0j4j04JM1K10L7j68
2474A86j0l8P4R0l6k57K35j66O3OJ2o8K0R4j39m4J43j1P7K2j09m9k6K39rj06J08j02j92N8
2121F5M9k9N6p3K8O6n5J7L1O9Kj07O9M5K0j74P0j04J12m0K2O6j19n7P4J16p6M6n6J0l1j5l9
1734E8J25J7kr0R4m3J32j71n8P5P2Kj28P6JK8j84M41l22J90J15O86P30l91j038k1l79J84q6
1394A13l8M9J29k22J68nj01n2K1P2J1R5j07Pq4Q6NL7q8k4N1n0J35j38J4R7j70K19j7j56M7
1030A04O5j31M4oN8l2P1q0P7q9l0R7%k1k5L1k1N9Q6r9l4N7q9M9n2j2J76kj31l0R3Rj06J75
631B61j06N8o5k6m2O2M0q7jJ01J07j16r7L1j1k0n3M0Mn3M6l8K58j45J7p9n9J7J81J23j97j13
255C8K30j12R7N0j12l3q3L7m4O9N6k5R1j50m7J8J63j63k7J93q9J4n4J42J90k54O0k19J29n0
$$ plain form
2849 208 24 68 208 95 133 191 83 53 218 146 136 66 71 111 34 35 161 141 55 102 131 115 98 113 183 169 65 66 107 317 354 186
2474 186 176 138 212 302 266 9 244 78 141 147 159 91 111 205 66 22 165 154 231 253 144 95 69 308 299 193 301 199 7 65
2121 65 114 85 141 68 96 162 107 124 155 224 226 119 188 233 253 79 149 45 157 117 139 205 86 29 103 219 143 189 133 143 112 97 58
1734 58 183 200 198 108 202 159 291 120 62 137 209 211 83 159 160 188 4 445 123 313 428 1114 1844 1453 415 394 15 199 113
1394 113 75 124 253 31 199 194 93 41 62 134 145 240 133 140 56 142 147 184 96 72 123 73 208 70 84 181 11 230 213 57 104
1030 104 169 38 82 76 134 102 173 93 170 81 51 148 148 127 102 133 112 171 257 158 124 181 92 141 89 77 253 251 120 90 183 192 86 261
631 261 155 213 148 122 80 142 182 95 94 195 302 186 89 120 109 89 36 76 80 27 73 35 293 148 165 86 27 44 225 348 151 38
255 38 268 156 253 303 191 158 75 112 68 137 193 168 259 109 62 80 243 80 53 246 157 171 117 259 449 195 255 36 165 115
-97A15r3L5Q4n7R7j48J80J4
$$ plain form
-97 115 22 57 141 84 181 33 213 227
-191B27
##PAGE=	F1=8500.37
##FIRST=	25168.397401625570637,	5807.04592319999756,	0.37911170721054077148
##DATA TABLE=	(F2++(Y..Y)), PROFILE
5807I6p4L9K0N5j3q9L9KQ4L8q1P9j55M5P7R4q4j17J07r7J55j2m7p9N9k8r4P5L1J18N3n8k22
5420A6J88L2q2N6j69J98J3j48K2J20j36J13j80J32J51k03n9L4Q4j41J93j59J9p6P8N0q6O7
5091A27p0R2k7L6o0k6Q6R9j57J7K6O7j67L0O2L6m0J08j30m3N4m9L0o2L2J28o2OP9j09p3J86
4715B26j06r5J16l8J69nj79l2J09L5j70K25o4qp7R0%q5j8N8p8P4J3j8N0o7J10k26Q2R5m4m8
4340I4L5L2j04M2l0M5R5r8r4K3J02l9m0N2n9J21N9k02J9R6n6J2K6PQj20K03j81K84j21j06
3976A05J17p7n4J11l0j22L5qO3j13J40j03P4J29j87J34J80j76j58J9rl7MR7J0J21j91n6J12
3636A30ro0K6N3j2p4J21R7j08j2p2J19N8j64N1p8N0J15j95K15k12k0J59r4M2N6L7R0j21k4
3283A64N8j13p6J04K0R5n7r5L9j3n9P0j08R9O7J1j06m6l0L6R8Qj36oK30llj12%j16J16lno9
$$ plain form
5807 96 22 61 81 136 123 34 73 75 159 197 116 195 40 85 162 256 172 55 162 65 220 208 161 82 141 113 19 94 125 243 296 238 16
5420 16 204 236 154 210 41 239 252 104 126 246 110 223 43 175 326 123 64 98 182 41 234 75 94 18 96 146 60 127
5091 127 57 149 122 158 98 72 158 257 100 117 143 210 43 73 135 171 131 239 109 66 120 71 101 39 71 199 137 143 222 113 40 226
4715 226 120 25 141 103 272 267 88 56 165 200 30 255 191 183 106 196 196 111 93 151 73 147 160 142 192 125 235 9 91 186 142 94
4340 94 129 161 57 99 69 114 209 111 17 40 142 103 63 115 56 177 236 34 53 149 93 105 131 138 146 26 229 48 332 211 105
3976 105 222 145 91 202 172 50 85 77 140 27 167 64 138 267 80 214 394 218 60 79 70 33 37 134 144 265 74 18 130
3636 130 121 61 87 140 128 54 175 272 164 152 80 199 257 93 144 66 116 231 36 251 39 19 178 84 126 182 219 309 188 164
3283 164 222 109 33 137 157 252 195 100 139 126 67 137 29 128 195 206 100 54 24 60 158 166 30 24 254 251 248 136 136 20 136 133 128 59
2884E9R0r2Q7j12M8J02j29N5O6m6n2J00rj3o3j5M3p3PR0kk1J1M2r1L0k9P7l5l7K0oJ76M7k07
2474A18L6m6Q9P0K5k28J76j64P4m9J8j0j3J22j20p9J88k6N1K7j75L7q3K97p3r5J23j35j07
2133D8K9M6j2ok0K3J9k7LM2L0L0j02M2J16kj91J08j16O5J4j2Q7r3q4O6J09o6J3k2l6J2Qp7
1734D4J55J6l0o9M7K5J01j25p4L0R2oj55P6J4Q4j67L74l05J83j6Q28O86l73j103O4l18J55
1405B33r5p6M2J96k30J16J9r3o7L9K4N9R5j23K6q6Q3o0Q1j14RJ2l7O2j06Q1P2j34J46M6j24
1042I6k2R5j21j1O3Kk1L7p9J53j06J8Q1j0p3rN3OjO8o6k3N1j37J17Jj08J90k6j00Nj6R3j45
643E5J86q3ok5j2k9O4jm4PN9J24l2j55j5k0n1P3pJ3m8qM6K47j85Nq1k3j9J65J37j64p2J80
243B81j25M3M6p6Lq2M0j00J25N6q1R3j14j4M9P7j66j6J76m8K5p8J32J49j98Nj31J24l5j03
$$ plain form
2884 59 149 57 144 32 80 182 53 108 174 128 76 176 167 154 91 76 119 46 53 143 141 120 131 173 82 112 83 160 125 88 108 102 278 325 118
2474 118 154 108 197 267 292 64 240 76 150 101 119 109 96 218 98 19 207 181 232 259 84 121 38 335 262 167 290 155 48
2133 48 77 123 111 105 85 108 127 100 103 145 175 205 103 145 261 259 68 176 60 125 139 127 214 121 37 103 212 146 159 137 101 113 121 44
1734 44 199 215 185 116 163 188 289 164 90 120 212 206 51 127 141 225 58 432 127 310 294 1122 1808 1435 332 396 78 233
1405 233 138 62 104 300 70 186 205 112 45 84 108 167 262 139 165 79 162 102 183 69 78 90 53 115 9 90 162 28 174 220 96
1042 96 74 169 48 37 100 102 81 118 39 192 86 104 185 175 102 93 146 152 151 219 153 130 181 44 161 162 54 244 218 118 123 107 200 55
643 55 241 158 152 127 115 86 150 149 105 112 171 295 263 108 93 73 22 95 88 101 53 45 91 338 153 158 77 54 35 200 337 173 101 281
243 281 156 199 245 169 172 90 130 30 155 211 130 223 109 95 144 221 55 39 215 167 192 114 246 395 197 202 71 195 160 57
-109E7L7L5K6Oj25J56q
$$ plain form
-109 57 94 129 155 161 36 192 184
-191A84
##PAGE=	F1=8398.11
##FIRST=	25168.397401625570637,	5807.04592319999756,	0.4633165895938873291
##DATA TABLE=	(F2++(Y..Y)), PROFILE
5807E7m0M8L3M2m0q5R1j2PK4rR6j37L0rJ47r1p9J22j13J79k4o6r4Q6j7r6O1J7J02P3n1k10
5420D2J61j7l8J11j84J48Nj21J8O1q7J14j88J84J69k44q0J32K2j38J48j49M5n8P0Rp7N3m6
5079F5J08L0q8n4L1Q4Q9j77N5J6L3j42kN0N4k5J37j27j04N0l2M0l6L4J03lk7O1j44OJ64j06
4704A43j02K05m9J63n8j89n9J25K1j68L05j38J0r7J30rj65J1M9m8P7rk2Q0n7J19j90kJ33l9
4352A70n3k9K0o2Q2l8L7R6j18j6o8J13k7j4K4n0J32N6j98K1O6l4pL6qM4j15J48j41K65j16
3988B16j26R8q0j8J31l7j12kj4L3p0J08m8P1J01k08J84J84j45j93J2L0n3j1M5N1P8j64k9Q4
3636A16k2l2lO9k8k0J44K5r9Jm1Q6M6j36J3p9P5J37k16J82j65oJ01n0O6L1L3N8q6l7L0q8o2
3248D3J34n3J54m9q2K3o0o7J10q8Q8rN9j53l3K6RJ52K9k14J2K50k0p2n4J0j01J50m9m3k3O1
$$ plain form
5807 57 17 65 98 140 100 15 106 94 101 125 116 212 75 105 96 243 152 73 195 82 261 237 171 77 163 146 50 111 128 230 303 252 42
5420 42 203 186 148 259 75 223 228 107 125 186 99 213 25 209 378 134 54 186 208 70 218 69 114 56 126 135 58 111 65
5079 65 173 203 115 61 92 176 265 88 143 159 192 50 48 98 152 127 264 137 33 83 51 91 55 89 192 189 162 223 79 85 249 143
4704 143 41 246 197 360 302 113 54 179 200 32 337 199 209 112 242 233 68 79 128 80 157 148 126 206 149 268 78 76 209 170
4352 170 117 88 108 46 128 90 127 223 105 89 21 134 107 93 117 67 199 255 57 78 144 110 103 139 131 175 60 208 67 332 216
3988 216 90 188 108 90 221 184 72 70 56 89 19 127 79 150 251 43 227 411 266 73 85 115 62 51 96 147 225 61 32 116
3636 116 94 62 59 128 100 80 224 249 150 151 110 196 242 106 119 40 115 252 36 218 53 47 148 98 164 195 228 286 200 163 193 105 43
3248 43 177 124 278 229 147 170 110 43 153 65 153 144 203 50 17 43 52 204 233 19 31 281 261 189 135 145 44 194 145 102 79 140
2873A40q1L5o3O1N8j44Q0J02pp7J7O0J9p6l8O4r2QN2K0L4n3P9j42Q3n6M6n0P1Mp4J30O0k22
2474D8J33o9N5M7Q6j77R5j51R1r6M1N9p9J35q9p7J61l6M1M5k28Q2j6K48j30q1J39j54k6j8
2121G9O0k3o0O0Nj1jj0N0j9K9q2j0K04k3k01J48q7j5O0n6J22q0j14N2J24n6k9om2J7L8r2J77
1722B08J8p2j8k6R9Q3r3o6k1R2J0j76N0M9J11j37K70k50J51j07Q05N92l03j038J44k27J09
1405B57j06j10L9K31j73J5N5p9p4N2k5J20P2j38M2q9O2r2J01j09N0l9Qk3JN4M0q3N3J01q0
1042A33r3J06p4L0K4l6l1nl5J68r1N9N3j3j26J5P6L8p1L7jNJj32J47K4j62J85m9m9M1j26J58
654B06j44J44k6q0rL0j8M8l6l%K1J25M9j68q3LK8O7m8J7l1j9P6K11k09J4m0m5m1J27J43j19
267A90j9J08j07j3NjJ7q3N5j18J07O6j30J17q7NR3j5j38k5J61j3K4r4J12R3j36k0m3R8j7r8
$$ plain form
2873 140 59 94 31 92 150 6 86 188 181 104 121 181 200 124 86 150 58 66 118 138 172 119 198 56 139 83 129 79 150 154 80 210 270 48
2474 48 181 112 167 214 300 123 218 67 158 62 103 162 83 218 129 52 213 177 218 263 35 117 101 349 219 138 277 123 97 79
2121 79 139 116 56 116 121 110 109 99 149 130 159 77 67 271 248 47 195 108 93 153 97 219 139 25 77 201 145 116 110 68 85 123 31 208
1722 208 226 154 136 110 209 292 199 133 112 204 214 38 88 137 248 111 381 131 282 175 980 1572 1269 231 375 148 257
1405 257 151 41 80 311 138 153 208 129 55 107 82 202 274 136 178 89 151 59 160 51 101 62 70 47 48 102 142 59 112 213 133
1042 133 40 146 72 102 126 90 59 54 19 187 96 155 208 195 69 84 160 198 127 164 163 168 169 37 184 208 46 231 182 133 174 48 206
654 206 62 206 180 100 91 121 103 151 115 112 112 133 258 307 139 56 59 87 154 106 123 92 73 149 360 151 165 125 80 39 166 309 190
267 190 171 279 172 159 164 163 180 97 152 34 141 207 77 194 107 112 205 190 52 27 188 175 199 105 217 310 174 154 111 209 192 94
-109I4L1j4J14p1j01J06l0
$$ plain form
-109 94 125 111 225 154 53 159 129
-191A29
##PAGE=	F1=8295.85
##FIRST=	25168.397401625570637,	5807.04592319999756,	0.37022235989570617676
##DATA TABLE=	(F2++(Y..Y)), PROFILE
5807B7J5K8L0M9o5o7J17j4q0J4P8Q0j07K9r7J73r0j9J06j09J92m4p5q5J13k0j06L1J4Q5Q2
5443B85m6j39J07m4k6J30j88J19j1p7K3j2k0R1j67K10J79k85m8J89m1j35R5j15M3l2M6k5l4
5103G2Mk1J38Q1k16mN2Q0Q3j87P8%oj09K2lN2j0J59j00j16O8q3O9l0O0M5M8o0M1j70R7J33
4715B67j04j25K76l1J44j28j69p6J10L0j38L28j92M2j16J57k4k19Q1J3m7P4l0oR6o2J29j14
4387A66j20J68l1l0n7J8o8J37p1K6R7j29K8o8P2k8J1%j8R6M1j48J5J6k3j2N5k3Q0j15R6q9
4011I2K06j22j01O2q2L3J41l8q0o3j5Rk0N0J6N6Q6j96K01J80j22j96JN0m9j3pQ0L1j34K0J8
3636I4k8K0n3Q9k0mJ51l9q1J7nN1J9r2k1p5R5J45j64O9j10J1L3M1O0kK0K7m0l0j7p0K7R9j25
3225I2K07m5q5Nr8l5J18n4Q3j09J08j68jN7mJ69L9k35jK38j2j55M0qo4J53j06q2L4M2p3J8
$$ plain form
5807 27 42 70 100 149 84 17 134 120 40 54 132 212 105 134 37 210 120 101 207 98 290 246 171 86 199 179 73 104 118 203 285
5443 285 239 100 207 163 137 267 79 198 187 110 133 121 101 192 25 235 414 129 81 270 229 94 189 74 117 85 131 106 72
5103 72 76 55 193 274 58 54 106 186 269 82 160 160 154 45 67 64 116 106 265 165 49 117 34 103 73 133 178 226 166 207 37 134 267
4715 267 163 38 314 283 427 299 130 54 164 194 56 384 192 234 118 275 251 32 113 126 79 153 123 117 213 151 280 166
4387 166 46 214 183 153 96 114 46 183 112 138 235 106 134 66 138 110 121 121 103 199 240 92 107 123 100 88 143 120 200 85 181 92
4011 92 298 176 75 137 55 88 229 191 111 48 33 42 22 72 88 144 230 34 235 415 293 97 98 148 99 86 79 159 190 56 76 94
3636 94 66 86 33 122 102 98 249 210 129 146 141 192 211 119 98 23 118 263 99 168 58 69 102 143 203 201 221 248 208 178 161 91 118 217 92
3225 92 299 254 169 174 76 41 159 105 188 79 187 19 18 75 71 240 279 44 43 281 269 114 154 146 82 235 129 47 81 123 50 68
2849F8n0Q2K1n3qJ70Mj02o5J20O7q7q0J04j08rJ7M5Q0j47J32j69J42o5pk5J32k0j41P6P7j50
2474E1J75r0j9L4J30j25K8j24R9j23Q7R4j21J11n5p4J06l9M7P5j86KO1J99j49p2J43j48J1
2133A28n2Q6o0r4J33mk7J9qN5p5%k0l3K17m8j97J79o2o9Q7r5J62p5j32J8J56m8n9k3pj3O2
1746A01q2J89K2j15M0j06J60Q5r0l7m7O3N1j75rJ01J01j07J62j71R1j33O25M79j95q69K01
1429C35j28N8j25j27N2K11r1p7R4n7p6N8o2J82L2j54N2r4K9o4P1o6P1q2O8k4RJ9J0l9k8J32
1053A89l5j25O8pQ7l5l1n7m1N4Q9m5Q2K1j3j66M8R4N6j32OP0L0n6o6J07K4j58J52o3LN6j34
666G2J35r1N0M1j09m9Q6j7K9n6J9pj5J11J07j50j13N8M4L9p0J3mjO5J64k04L0mq5n0R8J32
279B68p2L6L6o5j4j17R6J0q9Q7j00K7P8j45J50q1KJ46q0j12j7J48nKr9Q3L5p6k0K1P2Pq0J1
$$ plain form
2849 68 18 100 121 68 60 230 234 132 67 187 254 167 87 191 83 74 91 136 216 69 201 32 174 109 102 77 209 189 48 124 201 51
2474 51 226 136 117 151 281 156 184 60 159 36 123 217 96 207 152 78 184 145 192 267 81 83 144 343 194 122 265 117 128
2133 128 76 162 102 8 141 137 110 129 121 176 101 101 81 48 265 217 20 199 137 68 155 60 222 147 15 33 189 141 82 59 52 39 101
1746 101 19 208 230 115 155 49 209 294 204 167 120 183 234 59 50 151 252 145 307 136 227 94 719 1198 1003 134 335
1429 335 207 265 140 13 65 276 185 108 202 145 69 127 65 247 279 125 177 83 112 48 119 53 124 42 110 86 95 114 124 85 57 189
1053 189 154 29 97 90 177 142 111 54 13 67 156 111 193 214 201 35 83 177 233 101 107 177 207 151 85 192 216 58 210 147 150 206 72
666 72 207 116 166 207 98 49 135 118 147 91 110 103 88 199 306 156 43 101 145 184 114 127 123 122 187 351 147 177 173 88 38 136 268
279 268 196 232 268 203 189 72 168 178 89 176 76 103 181 36 186 105 107 253 173 61 44 192 187 189 90 173 208 132 112 133 205 212 132 143
-120A43m9J82j13j00P0n2
$$ plain form
-120 143 94 276 163 63 133 81
-191H1
##PAGE=	F1=8193.59
##FIRST=	25168.397401625570637,	5807.04592319999756,	0.13273878395557403564
##DATA TABLE=	(F2++(Y..Y)), PROFILE
5807B3M7RNO7o9l0J01ro7lP7M3o9J2j33J64p8K7P6p5J93p2p6n9J29m2r5k1K4O8Q1m3n5O6j2
5396B04n8Q3j72J12k6k6K2o6L8O0j48K30J77l20KK16r3j24N1p4K0j0J7m0Pm0JJ61J21k45j4
5032F6N4O3Q1j75P6j7m5m7P2q0K6jJ72n2r6P4j49J13l5Q2l3Q8p4J3j62J58J01r4j54L08J0
4669C43J17j95j27q9P5O9j20L21k22Q7j30J65m5k36J34ro0O8n4M1P3o7J36k1k40J86l5Mk0
4328A49J0r8J65j02K5Q8j32M9o0O6m5P%J8K9K5p4Pl9k7L5M5k8J03j24O7l2J15j40l6J1o2O1
3941G6J46l6l9o2o8lM6k1M5L5Q5j58J84J68j10j84J0L6l7k5j4R2Mj14N5ro0P4q2R1kj4J37
3553B46q6n7L5K9J4j5l9k5o5Q8J40j00n1o1L3j1J16M3l8%QNj8o1n9J02O0j50K25m6j02oj06
3166D8K7Q2j7Q1j84J37j57J9P3oJ40J6k15J8J91J5k29J55n3k4J37j44L6m0ko7L2n8R0JK9j04
$$ plain form
5807 23 70 79 84 151 82 52 153 144 77 74 151 194 125 137 4 168 90 117 193 118 311 239 163 104 233 191 96 75 99 167 248 205 150 216 204
5396 204 146 229 57 169 143 117 139 73 111 171 23 253 430 110 112 328 235 111 162 88 108 98 115 75 82 42 43 204 325 80 66
5032 66 120 183 264 89 165 148 103 56 128 48 74 73 245 193 97 171 22 135 100 182 149 237 163 176 14 172 273 179 25 333 343
4669 343 460 265 138 49 124 193 73 394 172 259 129 294 249 13 147 138 78 146 92 133 206 139 275 254 14 200 165 169 149
4328 149 159 61 226 124 149 237 105 154 94 160 115 122 122 140 169 194 120 127 88 61 96 141 113 216 92 159 127 242 102 66 77 15 76
3941 76 222 186 147 85 17 14 60 39 84 119 204 46 230 398 288 104 114 150 113 88 74 166 170 56 111 102 42 116 34 125 123 109 246
3553 246 160 103 138 167 181 166 127 102 37 125 265 165 114 53 86 75 191 234 196 196 204 209 191 130 71 173 233 83 308 262 160 154 48
3166 48 75 157 140 221 37 174 17 36 109 103 243 259 44 62 253 268 39 194 141 117 254 110 146 106 104 37 69 11 101 102 131 27
2791B7K49mj19j09J48J12r1j35J50j11l9j2P2J14k24J60j59J77p5m4L6J26m1j89J8R9m4J60
2462B52r8j04M3J37p6pq9R0j29J34R9j29O4k3o9L6l4N8J10j15j24J32J61j23p9J38j25Nn6
2121G9J13j13l2J04Nl8M0nO9j30m0K9k3J70o1j56J79n0p5P3j00J97p6j17k0J52l9k6n8%L4
1758H5j7m7J78K4j41P9j25J54R7j09Pm7J3J01j70m6J40O1p9O7q1J4o6L20L69p8o38K23l9J1
1405B60j55p6M2J25%j32J21k2p8N7p8K32k0j64N6j04J1K0j5j0O4j06J30j2j4nj6ro6J16jj10
1030D1j2Q1J19q8Nq3J0L0RJ3Q5oj3j86Q8J01N7j67k1J16M1r0mN5Qj08R8o1M0M9q8P8k8k8Q4
619B25q5j10J09j5J7n8J6mn1R2J26j04p9Q2J3Qo0rK5J3N0J09j67M2J5j21n5J08Q5l4Q9j7k0
232B35K6k48J63Jj10J32q1m8P5p6J24q8k4J99j00j15mJ72k3m3r3M6j4k5nN8M8M0n4k3o8K17
$$ plain form
2791 27 276 272 153 44 192 304 213 78 228 117 78 66 138 252 28 188 29 206 131 87 123 249 208 19 37 136 92 252
2462 252 154 50 93 230 154 147 58 148 19 153 252 123 187 164 95 131 97 155 265 150 26 158 319 196 117 255 130 135 79
2121 79 192 79 47 151 156 118 158 153 222 92 52 81 58 228 167 11 190 140 65 138 38 235 159 42 22 174 135 109 51 51 85
1758 85 68 21 199 223 82 161 36 190 287 178 185 138 151 252 82 36 176 237 158 225 144 158 92 412 781 703 65 288 249 260
1405 260 105 29 71 196 196 64 185 163 85 142 64 296 276 112 168 64 75 95 80 70 134 28 158 146 132 127 111 102 36 152 151 41
1030 41 29 110 229 141 146 63 73 103 112 125 210 204 191 5 93 194 251 84 63 179 220 130 126 181 189 81 179 118 158 207 119 197 169 141 225
619 225 140 30 139 124 141 83 99 95 44 136 262 158 79 161 174 182 122 113 138 151 201 310 143 185 200 79 24 132 217 183 272 255 235
232 235 261 13 176 177 67 199 118 70 145 69 193 105 81 280 180 65 61 233 210 167 74 120 106 81 76 134 182 222 168 145 77 294
-144B94j26j03O8o8
$$ plain form
-144 294 168 65 133 65
-191F5
##PAGE=	F1=8091.34
##FIRST=	25168.397401625570637,	5807.04592319999756,	0.093253321945667266846
##DATA TABLE=	(F2++(Y..Y)), PROFILE
5807D0N2nl5Q8m6qP8lk2j6L4Mk4l3q5J05m6L4L8lJ76j03p0k9J29p4m7r9M5N4P1m1K4M0M8q9
5384A82k6j18J02l0K5Pr0O1M4j24K26J67l36L5K20j27r5L5n3j1Jmk0Pk1RJ41J47k02q5O9L0
5009A66Q1j35N3k7q5N3R0j34j7qJ77Jp6P4j98J43l3J00j09J04o5j9r0J49O8p1j64K78O0Q7
4657D53k40p6q6J9J23r9K78k24J36j36J48o1j95J17j1o2O2p7J01J0n7J33O4k70J18n5M7M5
4328B05j0j05J56j22M5O1j37O0m4Q9p5l3K2N6o0K2jMq8l2J32j2j9J09j46P6J6J0j64M6k8L2
3953F5j2J49l5Nj4j32J3O7k3jmR7r9J32J46j06j52L0j0j3m6QR8Lj09P9Oj12J02p9P5J2k7J04
3553B17j08l4N3N3k7m6K0lo2O7J24l9j49k2N6kJ25K2o8l0J2M0j1q5n2J42K0j12J98n6j20K
3178A25m4M0L1PP9j37O8j57L2R5ON5n1q4K3J15N1k21K01j02J3J12j53J34q9n8n9O0n6N7jQ8
$$ plain form
5807 40 92 87 52 140 94 86 164 161 139 123 157 161 137 104 19 124 78 112 150 147 323 220 150 121 250 176 129 30 75 129 200 159 183 223 271 182
5384 182 156 38 140 110 135 142 52 113 157 33 259 426 90 125 345 218 123 158 105 94 95 91 71 78 57 66 207 354 152 67 136 166
5009 166 247 112 165 138 53 106 196 62 45 37 214 215 139 213 15 158 125 225 116 220 155 136 46 195 263 192 28 306 366 453
4657 453 213 137 51 70 193 94 372 148 284 148 296 235 40 157 146 84 146 69 170 180 123 256 320 50 168 113 160 205
4328 205 195 90 246 124 169 230 93 153 109 198 123 90 112 168 108 130 129 133 45 13 145 133 114 223 77 153 169 179 15 61 33 65
3953 65 53 202 167 172 158 26 39 106 83 82 78 175 76 208 354 248 96 126 116 103 57 65 163 166 57 136 142 30 132 53 128 140 113 217
3553 217 109 75 128 181 154 108 128 125 63 130 254 215 66 44 100 98 223 245 177 147 159 199 188 103 51 193 213 101 299 243 123 125
3178 125 81 121 152 159 238 101 169 12 44 139 145 200 149 65 88 203 254 33 234 132 145 257 104 238 149 91 32 92 36 93 92 180
2802A80j56K80k4j21r5J33J42q5j82J77j12n7k8Q9J37j76O7j12J68r0m8Q1R9n2k04K5N9J0
2474A05J39r3j06K0Q0l3Ln2O4r8J45Q4j24K8Oo6l6j7O1J37m1j64J10J29p9r5J34r9k4k7J38
2110B29j74L1N8L2m5N8j5J03j65q1L7M0K9l5p6J54o2l5J4l1J95p8j13NP8k2M2o0n9J23r2m0
1734D5J36K2j31P4n6O5J09j33N4l5l7J41j48m2J36Nn3jLl8nM2K60K1l82J93K2k0j73j3M0j5
1359H6Q5j33J23J9q4N7p9K62p1j60N4j21N6N2o1OL6r9J74ql4j9l3jn6N9J7p4J7O8J08j20M9
971A75j08N7Jm6N1P2j9k2j41R4R6M0j65m0J17L4q5L7Oj4l8L7l0M7J9k0J6K6n4Q7n1j18O3o
572A18J9m6lOp9R3P9l8l1R8l9j6j6n0L5J9M9M5j04N1J6j45k9J33loJ30m3J2O4k44J01Rj46
173C9J74o6o1L2oQ6q9o3K35q6j33qK32m2r8q3Kk6mJ1P0L0P4k2o7p2K13j20r0Q6q1
$$ plain form
2802 180 24 304 280 159 64 197 339 254 72 249 137 80 52 141 278 102 169 57 225 135 87 168 267 215 11 36 95 105
2474 105 244 151 45 65 145 112 115 63 127 29 174 258 134 162 168 102 66 49 110 247 206 42 152 281 202 107 241 142 118 91 229
2110 229 55 86 144 176 131 189 174 277 112 31 68 108 137 102 26 180 118 83 97 66 261 183 70 75 153 131 173 113 54 177 85 45
1734 45 181 203 72 146 90 155 264 131 185 150 113 254 106 64 200 205 152 151 154 116 111 153 413 434 52 245 267 247 74 61 101 86
1359 86 171 38 161 180 96 153 74 336 265 105 159 38 94 146 85 91 127 28 202 194 160 141 108 107 51 110 127 53 70 138 246 126 175
971 175 67 124 125 79 130 202 183 161 20 114 210 250 85 45 162 196 111 148 154 140 102 139 109 156 175 155 171 197 143 230 179 61 124 118
572 118 137 91 88 94 15 108 187 149 118 216 177 161 145 95 130 149 198 243 139 190 206 61 32 165 162 156 286 243 255 319 75 176 185 39
173 39 213 147 86 118 112 198 109 46 281 195 62 54 286 244 146 63 65 39 35 46 116 146 220 198 131 59 272 152 62 148 67
-191F7
##PAGE=	F1=7989.08
##FIRST=	25168.397401625570637,	5807.04592319999756,	0.18771006166934967041
##DATA TABLE=	(F2++(Y..Y)), PROFILE
5807F7L5j4o0Q9j2NO0oJ2l2%k3L4j15rN5j0NKJ01J45j37o1jJ14j01L1j44K1M4N6l7P8K4J04
5396C20j00j54RL7j4P3k7j00N6M8q0J86J49l17K8K04j41m0M2n9l9Jj0K2k7L0PJ00J56j55j52
5032E3J02j1P3p0K2k1r3J14Q4j61k1l3J43M8o6P2k23J44j4J05j52Q8m2m5k1J27M0m2j56K05
4680B49J00O1k40m5n0n7J63o8K14j99J77j31J02n7j39N4Qm3N0q2J44p6k5J15J26k63L5p0P9
4340A32J11l9p5J13j31Q3K6j49O8k7J27j03j07N9J00j59L4M6J6p8K4J31q3lJ04j70J14N1q7
3999A28o9nMM9q4J51m0N2M0j89L8P1j5k7p2J22k7M8J12j07r3M5p9K4o2L6J03J7j03Q6K7j45
3624C6Q7n2N1J5l0P0r6k6O3O7o9o9P2K6n8M1J00Qj95JP0K4R7kq8p0L9O2j0p6n0J38j3m0J46
3213B69p3j18M1J1L5k2J4Q1o6j1j19nJ23L4p5J26j9j05K3Q5j44J70j32L7R7j82J45m5q6m4
$$ plain form
5807 67 102 88 28 117 105 110 170 164 176 144 144 121 155 40 31 86 76 81 83 184 329 192 131 130 244 143 174 30 51 95 151 114 192 216 320
5396 320 220 66 75 112 98 171 144 44 100 148 68 254 403 86 114 318 177 137 179 120 81 82 72 94 67 97 104 204 360 205 53
5032 53 155 144 217 147 169 148 55 169 253 92 71 38 181 229 163 235 12 156 142 247 95 183 141 96 75 202 242 200 44 249
4680 249 349 410 170 125 75 18 181 113 327 128 305 174 276 219 80 134 142 99 149 67 211 135 110 225 351 88 123 53 132
4340 132 243 204 129 242 111 194 220 71 139 112 239 136 29 88 188 29 63 109 125 47 71 202 119 116 220 50 164 215 128
3999 128 59 54 58 107 23 174 134 186 226 37 75 146 131 104 32 154 127 175 287 180 87 132 53 77 15 51 154 171 68 154 181 36
3624 36 123 71 122 137 107 177 81 55 118 185 116 47 119 145 87 128 228 236 41 42 112 136 233 231 143 73 112 174 164 88 38 176 163 123 269
3213 269 196 78 119 130 165 143 157 238 172 161 42 37 160 194 119 245 226 121 144 229 85 255 123 160 257 75 220 175 89 45
2861D5P7o0J8LJ21j24K25n5j06n9J11J54o4k02J63j27m3j8Q4J47j17k1p3J45r8k9R4P0m2j96
2509B3O0%JJ19p3j4m3l9ON3j4L0l9J10N3j16K0L2p3r2K2L8J50K2j34M2R4m5j06J33p9n9K6
2121A08J59k33P9J1P0m7O3l5J54j75j15K24J91l63j4n1J53j03K8o3P8J70q0j17L1JNR9o0j13
1769E5K04j09o9P6J2r3L5K9k9J11j49R6k2p0J61r7l9J14n1l0m0O7j1l6j1N5Q4j66J37N1l5
1405B30j29k6O8o8M0p1Q9N6q9N5o5K70j16j31M2j42J33L6n9rj1n8J83jm3k5m1k1l6J5J7k3
1030G0Q3J5N6j13P8j32J07k9m0K8M9pm7o7R1P6J7j39o3R5J1l5N3l4k8J7j3L3J9l0N7n2O7l2
631A61O0k6r7j0J6L5k8k8J9p2J06k0J9J6J07r1k3M1q8NK2P4l7k5N5Mj50L4J40j10K3J42m7
243B27K7Q0k26N1L4j81K00n7l0rJ9N0p3p0K12n3j48l0L06m5j45q2l4M3m6LO3J6J04J1j11o5
$$ plain form
2861 45 122 62 80 83 204 80 305 250 144 85 196 350 286 84 247 120 77 59 143 290 173 152 79 224 126 97 191 261 219 23
2509 23 83 83 84 203 130 116 73 34 40 93 79 109 70 180 233 117 137 169 96 4 26 64 214 236 102 144 238 193 87 220 141 82 108
2121 108 267 34 113 124 194 147 210 175 329 154 39 263 454 91 77 26 179 76 104 41 119 289 209 92 123 124 129 228 168 55
1769 55 259 150 81 157 169 76 111 140 111 222 73 169 147 77 238 141 102 216 165 135 95 162 151 115 104 159 243 77 214 265 230
1405 230 101 75 143 75 115 44 133 189 100 155 90 360 244 113 155 13 146 182 123 114 103 45 228 227 184 159 118 97 61 76 93 70
1030 70 153 168 224 111 189 57 164 135 95 123 172 165 118 51 142 218 235 96 33 128 139 104 157 123 95 112 99 132 151 121 178 126 193 161
631 161 221 195 98 88 104 139 111 83 102 30 136 116 135 151 258 167 144 185 97 102 124 198 161 136 191 195 45 79 219 109 132 274 227
243 227 254 334 108 159 193 12 212 155 125 116 135 185 112 42 254 201 53 23 329 284 139 57 23 66 20 23 86 102 206 217 106 41
-132D1J75j06n4J02j02
$$ plain form
-132 41 216 110 56 158 56
-191E6
##PAGE=	F1=7886.82
##FIRST=	25168.397401625570637,	5807.04592319999756,	0.24037171900272369385
##DATA TABLE=	(F2++(Y..Y)), PROFILE
5807A00Mk2l1L7J4J6N3k0L1m6j9k9R9j17krRk9qJ88J06j67n2K0Q6r9J08j38n1L8L7k9R4J6
5408A88J44r6k07R4l3K6J06p6r7K5N9j4J19J25k66j9J76j36L8M7p3n7nmM4m1O4lP3J45j26
5044B20j83J42l7L0J4qKq4J28N9j62J2o0Q0P6o6P2k28J16K6Q8j44N3j8o2L0R8K1j3j50J33
4680A85J15M2j89m8Lp9J16k5J47j51K04j18L3k4q5m3M2rL4p1J57j49J4Q3J57k33l3J8RJ54
4328B56p1j5M6j25J17Lj54N9j1J61j14j04K3J33j44m6M8M4kK9J05j35J3R8j87J49Q1j55no2
3976C5N9L9j19J28m6R6P3k27P1O0j3j3j13J17L4l3N8r9j6M4r6K9Kk6J00L0q3P6L8j56M1lJ8
3589A05Qk7N3n5l3N7O9r3l0M9N0m5J0P2L0j65MN9M9N9l2r4o6L5O5j2k8n3R1j8K3Q7r9l1M2
3178A36K2L9p2J3Q2Oq7m1q2J53P4r4M99j65l20p4J10p4J20j35M9J05j37nR1j13l0P5o2k2K2
$$ plain form
5807 100 104 82 51 88 102 118 171 151 182 136 117 88 187 70 68 59 68 39 31 219 325 158 106 126 212 113 221 83 32 70 107 78 172 188
5408 188 332 236 29 123 90 116 222 146 49 74 133 119 238 363 97 78 254 118 156 203 130 73 68 64 108 67 131 128 201 346 220
5044 220 37 179 142 172 186 178 180 96 224 283 121 133 73 153 229 163 235 7 123 149 237 93 146 128 66 96 194 215 202 52 185
4680 185 300 342 153 105 108 29 145 120 267 116 320 202 235 211 126 83 125 116 150 79 236 87 101 184 341 108 75 93 102 256
4328 256 185 170 216 91 208 211 57 116 105 266 152 48 71 204 60 14 62 106 104 133 238 103 116 214 27 176 257 102 97 35
3976 35 94 133 14 142 96 192 265 38 109 169 156 143 30 147 181 148 206 107 91 135 39 68 70 44 144 174 91 167 205 49 90 87 105
3589 105 113 86 139 84 51 108 177 84 54 103 153 108 118 190 220 55 59 118 167 226 194 100 34 69 134 122 94 41 132 114 137 224 125 94 136
3178 136 158 197 125 138 220 226 139 98 16 169 243 149 648 483 163 89 199 125 245 110 159 264 127 122 213 100 70 145 83 61 83
2814H3J16n5J38r6p8j3Q6J55l3j97J19j63J7J0N2J42o4p9n3J17q9lP2N6mj77M1k5l7J09m8
2450I9O8q3Oj3PJ1J3QN6J2j07L6O2r3l4j9PJ34O9r6MN3l5j00J26o6q7Q4J76k74J08l4J09m9
2051A58N4o1K12j61j22N21M08o66j83j40J64j63R5p1J35J24p8j16N4p5L5J30n6j47K59r7r4
1734A19J0kn2pJ14j16J06j55J23j2p8J59k3n3Q5q9j5m7R5O5P7l0k21J03n1Q1O2l4o0r2J29
1370A91nj46J5N5P1r0N8m6K59j49p7K6j41J69Mm2j6o4qJ63J8m2k6m1n3k1jQK8J19k8j5n5P0
971A88j56J61n0nk9K4L4q3J0P5M4nr8q5O7k8M7N2o8j6K5l9R7j7r0J33j16Q7J6K8k5m5r1M6
572H8N9j0m8K6o2J25o1PN2J03j20j3P9j01n5M2J05j36N6N3j4j42J01J39k12P6J07m1L0O4j86
208A11J1P1j85J79m5Rk5RJ4m3l0J30j9j31k6L18k9j69r5j5N4o4k4M6QJ18M0j39o1J22q9oJ08
$$ plain form
2814 83 199 144 282 186 108 95 181 336 303 106 225 62 79 89 141 283 219 140 87 204 115 112 184 240 236 59 100 75 38 147 99
2450 99 167 84 90 77 84 95 108 116 172 184 77 113 175 82 48 29 36 170 239 143 147 200 165 65 191 125 38 122 298 24 132 98 207 158
2051 158 212 151 363 202 80 601 1009 343 160 20 184 21 116 45 180 304 226 110 164 89 124 254 198 51 310 213 119
1734 119 129 127 75 68 182 66 172 17 140 128 50 209 186 133 218 129 114 67 162 227 304 274 53 156 105 186 248 214 154 62 191
1370 191 186 40 55 110 181 91 149 103 362 213 136 162 21 190 194 152 136 72 64 227 245 203 177 136 83 62 61 69 97 216 188 173 118 188
971 188 32 193 143 138 109 133 167 84 94 169 213 208 110 25 92 64 111 163 95 79 104 65 162 145 55 188 72 159 175 203 178 133 42 88
572 88 147 137 89 115 53 178 117 124 176 279 159 146 225 124 69 111 216 80 136 189 175 33 134 273 61 137 244 203 233 297 111
208 111 122 193 8 187 142 151 126 135 149 106 76 206 187 56 30 348 319 150 55 40 94 30 6 52 60 178 218 79 18 140 51 45 153
-179A53j24
$$ plain form
-179 153 29
-191B9
##PAGE=	F1=7784.56
##FIRST=	25168.397401625570637,	5807.04592319999756,	0.33766579627990722656
##DATA TABLE=	(F2++(Y..Y)), PROFILE
5807A35l1l1Nj0J3L0N8m4M2m9l1j4J56o0m9o3LQK4J48O7j85l9K6N0m9J49j30j07M0J3k6P7
5420A26J0J64q1j31O8p7Q6J06j30m7k1L8O7L5R9k07p6J42r8R9L7p7n5nkK8oN8k0P4J08j17
5044A95j33J41k3o2J03l2L1q8J25K3j36N8r3K1Q3p4P6k10O3Q1M1q5K9jq0N6O5RK1j55R5R1
4669B35L7j11q0N8p4K3K3Q9r5K15r6m7L7m4j57R2K5J3n4J46j49J4L5J59j88p1J34p5J52r5
4316A51N3l3j04J31mj27J8KJ80j01m2k0J21r1j13LN9P9J3O5j46K8R7j88J47J11j78k5p1R9
3964A14L4r5N7m8J25P5k36J05L5j2K2j05P1P8p4j9m4K7K6k9kK7p9Q5K9n2N8M2j54j5N5j8j1
3577G2k1O6k0m4M9N8p6K2k4O9k9k1M9K1r2OK8P9J8o7p7O5o4J8qM1o4K7L3K2L8j15R8j5J2N9
3154B13j18J6P7O4j50O0j42J46J11N0Q13l46n83j54J22k6N2j08M6J40J9J6J0k06k3N1n8n5
$$ plain form
5807 135 104 73 78 68 81 111 169 125 167 118 87 73 229 169 120 57 60 68 92 240 307 122 83 109 159 110 259 129 22 62 75 49 126
5420 126 136 300 219 88 156 79 165 271 141 94 73 111 178 213 312 105 29 171 73 172 209 132 77 72 70 98 92 150 130 204 312 195
5044 195 62 203 180 118 221 189 220 132 257 280 144 202 109 130 213 139 215 5 68 149 190 105 134 133 53 109 174 183 204 49 144 235
4669 235 272 161 81 139 65 88 111 200 105 320 224 177 214 170 13 105 130 143 89 235 86 100 135 294 106 35 169 94 246 151
4316 151 204 171 67 198 194 67 85 87 267 166 124 104 225 134 21 24 83 162 175 240 94 122 219 31 178 289 111 86 15 114
3964 114 148 53 110 62 187 262 26 131 166 154 176 71 142 220 146 127 83 110 136 107 105 132 53 138 167 115 173 215 61 46 101 83 72
3577 72 51 117 97 53 102 160 84 106 82 151 122 101 150 171 79 85 113 192 210 143 66 131 67 85 77 118 54 81 114 136 174 59 157 142 154 213
3154 213 95 111 188 252 102 162 20 166 277 327 1140 794 211 57 179 153 205 97 143 283 302 318 328 122 99 150 92 37
2826C7O8O4L3M3j40m2K7N9J49Oj80P7j27M0K1MJ18k2j05m6Q8n4RK0P3N1j59k1l6k8Q2k5R8
2438A82r5J21l0r2J6J5L6Ml0o6L5Q8j20K1n8L9O2Q7n6lK0n0o8J03o4q6J15J87k73J06o8J30
2063B08n0L3q4K58j22r2Q59O80j021m01k09J30j43O8qJ34N5o4r6O0j42O2J26m2j57K79o8j06
1734A47n0qk9J6J42j78R4r3O5po1J36N2p2N0r4j3k4P9J53L19j07m28N4j6K1P9l0oj57K00L8
1359B72k29J5M0N1q1O2k5K35j67kPj36J75l3k7rq3J5J21M3k9k6l5o3k8LPN6J16n7q0L9L5j57
959B5J83m9J8p7%R2r0M2M2Oj8m7p3K2o2J10N3j00Mmm0J36l9j13J63j08M1O1Km9L4j37M6Q6
560A60%n2K0n2J32l7m0O4P9j16%R1r5p0O4R6k09J10M1l6j32J65J27k84J44M0m5L1J8j18k7
197F9J17j66J19k8M7k6j5k2j3K2M8%o9OK45Lj66j05lM0p3j9J1J9R7O2j43n0O4o1K2J02j03
$$ plain form
2826 37 105 169 202 245 105 63 90 149 298 304 124 201 74 114 135 139 257 235 130 84 172 118 127 147 220 271 112 91 55 27 109 84 182
2438 182 87 208 178 86 102 117 153 157 127 61 96 184 64 85 27 66 128 215 159 156 176 126 58 161 97 11 126 313 40 146 78 208
2063 208 158 191 107 365 243 151 1010 1690 669 268 59 189 46 114 106 240 295 231 135 195 53 115 241 199 42 321 253 147
1734 147 97 89 60 76 218 40 134 41 106 99 38 174 226 154 204 110 97 73 152 305 624 517 89 143 127 148 227 197 191 34 234 272
1359 272 43 58 98 149 68 130 105 340 173 171 178 42 217 184 157 148 65 80 201 244 215 189 154 91 63 66 73 129 245 188 108 147 182 25
959 25 208 159 177 100 100 192 102 144 186 192 174 127 54 76 14 124 177 77 81 77 37 173 134 21 184 76 117 178 180 131 165 28 74 160
560 160 160 108 128 76 208 171 131 195 274 158 158 249 154 84 148 244 35 145 186 150 18 183 310 26 170 210 165 196 214 96 69
197 69 186 20 139 111 158 132 117 95 82 104 152 152 83 89 334 337 171 66 63 103 30 11 22 41 138 200 57 7 71 10 32 134 31
-191C1
##PAGE=	F1=7682.3
##FIRST=	25168.397401625570637,	5807.04592319999756,	0.36209881305694580078
##DATA TABLE=	(F2++(Y..Y)), PROFILE
5807A61m9m2J8k1k0N0P0p4N5k2n9NJ94j0q5r2OM7K4Q2L5j85j4QJ2L4J50j15j44M9rl6M1QJ59
5396B31o3n1M9q5J53O8j84L9l5k6J34m8P4j56n6N4%P8J3o0l9RMl3O4K0l7J00M9j28l0J13J8
5009B39j75J83n2N4r4J08k0q8J06j22l4P5q2Q2j57j7J34k7J0K1J6j00N0L5PN7j70R9L0N2m7
4645A73j12J06o6p4O1M4m7K18o8j19J03j8j42K8M7ll3J09p2j9l3J42j33p1J99j17J17r7J03
4305B26j11o7J15nq5l0K0J73o2Qk0Q9o8j56O3k8J44rJ7j23N5R4j86J12J41j49j33L6N5M3o0
3941I9j9l6J22M8k08J25Qj2O4q6J9J06o6r2N8LJJ9QJ6r4N4J8k4M0M3j44k8O8m8l7NR3j5n5
3530E3N4K9k8L2q0Q4j3n0M8k7pJ9j9J20k1r7l7J58j05q2K7Q3p2k3R5k2J4m4J22r4KR5j58L7
3131I3M8J08j83J50j57R5J29K39J096n20q37k07J28j6k4m9K9J82J49J17j00l20k5J0m7q0J27
$$ plain form
5807 161 112 70 88 67 47 97 167 93 148 126 67 72 266 256 171 79 85 132 156 238 273 88 74 82 94 128 278 163 19 68 59 23 64 72 231
5396 231 168 117 166 81 234 302 118 157 122 96 230 182 256 100 44 98 98 176 189 129 90 99 103 70 134 154 117 217 266 138 108 221 239
5009 239 64 247 195 249 155 263 243 155 261 139 105 180 98 180 23 6 140 113 123 144 160 60 110 145 152 209 39 138 168 220 173
4645 173 61 167 101 27 88 132 85 303 235 116 219 201 59 87 134 131 98 207 135 116 83 225 92 21 220 103 220 123 226
4305 226 115 48 163 158 73 43 63 236 174 182 162 251 183 27 90 62 206 197 214 91 146 240 54 166 307 158 25 61 116 159 99
3941 99 80 44 166 214 6 131 139 127 191 105 124 230 164 72 130 133 134 153 161 177 83 137 155 131 171 214 70 42 110 62 25 30 123 108 53
3530 53 107 136 108 140 60 144 131 81 129 102 95 114 95 215 194 97 60 218 113 31 58 141 69 46 141 119 133 89 211 117 119 214 56 93
3131 93 141 249 66 216 59 154 283 522 1618 1098 261 54 182 166 142 93 122 304 453 570 470 150 125 135 88 8 135
2814A35j1J18l1j61pL3L3J37M4j60O4l2JK3n0P8J5j09k9M4Rj0m8J34R3j45j03m0O0L7k1N8
2438A59p2K09l5j68kL3N3l5n6K4k3J03j40N6p0P4j5P8k4MJ5q1k9Q3p6j4O6J90k42R5q5J18
2063A93m5Qq9K63n6m1J168R60j368o26k44O7p8j4N2J38k6k8o9M7j74O5Q6j1j48K62l1j07r0
1722F4Rk9R6J02j84O4l3j0rk9J01J04p9J2p0j6mM1K19N42j71n69qj0m3J24l4K1j15J78M9j95
1347A18o1M2on9O5j0K04j65P7j1j33J70p7j9Pn3%O5P0j1k2k0l9o5J3KP4Q1o8j14J22Rj30J49
948B05j8J8j07j3J38p1L7%l3k4J3n1lk6O5O9j26J0m9j5J30l7l7R2j0m0N0j0q9J25j38OJ13
560A74Kl7jm3J26j1n4N3L3r1J1Q4p4k4N5O0j92R1K0o2j01J96J04k72J51j5o6L6m6j5n9J49
185A82j55M7KP0j7m2l9j4P6Oj8K2J8J53L8j38r1k3L0q0Pl0N5M4O0j16j0K4jl8Q4l1
$$ plain form
2814 135 124 242 211 50 43 76 109 246 290 130 194 162 163 186 136 214 229 120 91 135 144 134 86 220 313 168 65 25 85 122 101 159
2438 159 87 296 261 93 91 124 177 142 86 110 87 190 50 106 36 110 95 173 149 153 168 87 58 141 65 51 117 307 65 160 75 193
2063 193 148 156 67 330 274 233 1401 2361 993 367 123 190 112 98 150 288 262 234 165 212 38 103 189 178 30 292 261 154 64
1722 64 73 44 140 242 58 122 89 79 70 41 142 246 167 179 109 93 89 130 349 891 720 151 143 133 90 214 180 201 86 264 313 118
1347 118 57 99 93 34 99 89 293 128 205 194 61 231 154 135 142 89 89 154 224 213 191 171 132 67 80 82 156 237 169 55 177 186 56 205
948 205 187 205 98 85 223 152 189 189 156 132 145 94 91 65 130 199 73 83 34 19 149 112 75 167 157 117 167 157 68 193 55 61 174
560 174 176 139 138 95 221 210 156 209 242 151 162 246 172 148 203 263 71 162 182 120 19 215 319 47 198 183 117 153 107 92 33 182
185 182 27 74 76 146 129 87 48 34 110 116 98 120 138 291 329 191 100 77 107 27 34 4 59 103 163 47 37 61 60 22 106 75
-191G5
##PAGE=	F1=7580.05
##FIRST=	25168.397401625570637,	5807.04592319999756,	0.28256726264953613281
##DATA TABLE=	(F2++(Y..Y)), PROFILE
5807A72m6n1Qmo7Q1Q2j12Q3K7j05JK12K8r8j06L0M8J3J8J0j61J8l2rJ06J33r8j54M6j5m8q
5420BM3R5m6J9M2p1K18jk25J37k9p0J51j14M8j09Nj1O2J2j5k0j8K7K8q0J00l1l8J32k4j55
5044F4Q6P7O5k54K21o3O3r4P9o3l1J44j30r4O3o6O9r0LP5j01J17J0L9j11K2J1J3R6j88J19
4680A51m5Q6j5j16J35n7j00K5J0k3K17l6j60J44lr2m8M8mmM4K2l5j00J19q2m7K01j34R1p5
4316A17J14j75j5P6j5m9l6L6J23jL6LO1p6j66J24j08J78k2k7q8Q9Q6j70N6J55q2j52N6k7O7
3953A68k0r9lP8Nj06Q2mj6R6n0l5J13k9j15J12k1l8M3N5j6p1J3Pj3K4M3j25KK4o0k4N7R0m0
3542A27p1O9j7K6J5j03R1%p4O7q8O1L8o9J63o1r2k0K07j07j46N8P8p2m1J07n7K3M4Q0j59K
3166G9J24j90P9qJ37j51J79j61N0J17M26J295o52j020k47J46m3r0M0MJ96J40J40o5l49l0m1
$$ plain form
5807 172 126 75 83 79 12 93 175 63 146 173 68 69 281 309 211 105 135 183 196 214 224 63 81 49 40 146 279 181 27 73 58 10 2
5420 2 45 140 94 113 155 84 302 301 76 213 184 114 265 151 199 90 95 84 146 158 143 123 105 132 160 80 180 149 111 243 219 64
5044 64 150 227 292 38 259 196 259 165 244 181 150 294 164 70 133 67 136 46 49 124 23 140 150 189 78 100 111 124 220 32 151
4680 151 106 192 177 61 196 139 39 64 74 51 268 232 72 216 213 121 73 121 117 113 157 179 144 44 163 81 34 235 101 192 117
4316 117 231 56 41 117 102 53 17 53 176 175 211 214 275 199 33 157 49 227 205 178 90 179 265 95 151 306 224 72 128 101 168
3953 168 148 49 46 124 129 23 105 101 85 181 131 96 209 180 65 177 156 118 161 216 200 129 142 149 136 160 203 78 80 104 44 20 77 167 127
3542 127 56 125 108 134 149 46 137 137 63 130 42 103 141 72 235 174 82 62 269 162 16 74 152 80 39 146 89 112 156 236 77 79
3166 79 203 13 92 84 221 70 249 88 138 255 681 1976 1324 304 57 203 160 70 110 114 310 450 590 525 176 146 105
2849A05l5m2J27p4J74o7j09rJ2OJ01O7j31O4joM5r7K9N9j06Oj9Q5n1j23K39R4j30j77mJ00
2474A32J8j9k0k0K47l1k11l1O5O0n7n1Q1p7J01j47P3m3P8p4N0pJ4L7j13rR2r7M2J1J83j93
2098H4R0r2Q2l7ll5J72L9NJ372J188j623q04k47nj4j00R4J46r6K7n3K0j51M6OL6j18K07Mj04
1734A36j00M1rJ43L2j58L8Qo0j7oO7J26o5k9l4j3rMK15N67j95n01m6j1q8J70m5K8j7J03K8
1359C03j22j16M2q9JL7mJ71j37J39k3j18J54j27j8J7Jj9QQ9JqOpj14K5j5R7K9o6r0J48J2j29
959G8J05L6Kj25j8J69m9J5m0o2k2O8l6ok6L5R6j37J4o4lO0QK5J8J08q4j5j7n9J37j44j4J33
560A86nml7l4J12kl2L2l2o0K9O4m2M1K8J8j64Q5or3k7J68P0k06J14l3j06N2p8Q1m8J14j54
173C1J0K3N8jo8J8l8O2K3q5J20J5N6P1r2n9m1J7q2K6n1P4K0Ro2J1J9Nn6M3L6
$$ plain form
2849 105 70 28 155 81 255 188 79 70 82 88 189 256 125 189 188 182 227 130 159 218 112 118 99 184 133 10 249 343 213 36 32 132
2474 132 150 131 111 91 338 307 96 65 130 190 133 82 163 86 187 40 113 70 148 74 124 117 131 168 55 46 138 41 83 94 277 84
2098 84 174 82 164 127 124 89 261 300 305 1677 2865 1242 438 191 186 172 72 166 312 216 243 190 210 59 105 111 147 29 236 240 136
1734 136 36 77 68 211 243 85 123 131 71 54 48 115 241 176 147 113 100 91 95 310 877 682 181 135 124 36 206 161 189 172 275 303
1359 303 181 65 107 18 19 56 52 223 86 225 202 84 238 111 93 110 111 92 100 189 190 182 188 181 67 92 77 174 203 137 47 195 207 78
959 78 183 219 221 96 78 247 198 213 173 111 89 157 121 115 89 124 220 83 97 33 30 90 98 123 141 249 165 150 133 74 211 67 53 186
560 186 181 177 140 106 218 216 184 216 184 124 153 217 175 216 244 262 98 183 177 84 57 225 295 89 203 170 64 116 38 119 71 185 31
173 31 41 64 122 121 53 71 33 95 118 33 153 168 224 295 203 144 103 120 38 64 13 87 107 116 54 65 84 89 33 76 112
-191A12
##PAGE=	F1=7477.79
##FIRST=	25168.397401625570637,	5807.04592319999756,	0.17931564152240753174
##DATA TABLE=	(F2++(Y..Y)), PROFILE
5807A65k7o0qJ8p3R4Q6j54J24P5j49l2K03N6q3j13O1K1Kk6j4j12L6p3L5J03J08q0j34K0pk7
5431C5J1L5j3n1P2M5n6K71q7j94J78j1p6J13j46J9n8M3j5N7n3l7L8oM5O4p6P7r0qJ48q4j79
5044A1J64M2J05k60J96o5N2q0M4j07K9J61j13j57N7KJ3k7J7K2l8P3kO3j05j6mL2J29k00J28
4680A66j21J24jq6J46n8j05nk0l6K14nj49J34Pm4j05L2J5L4l4R7l3j00Q8o4m7J72j43J02n4
4316A21J00k01K7L6l2rL8oL1O6L7M0M2j09j29J51j54J73pn3q0J19P3j21kJ38mj00J4j26R9
3953A72K2j79M0Ol8J8K7K3n4J12jn1O9J6j04J22k1r7N4J22n3k2l2J1k9RL8r5K3k6n3K0Q5J01
3553B35p4r2Q4p2P1qj00Q5J5r2Q4q0O4M5j05J81r9l3n9K21p6j45L7O4o6m3P5o6N3R6K5j26
3178I9lR1j61P1n6J35p1J44j54L5O1N79J362p19j079k84J69q2j02J10j4J49m1o3K24j97m4
$$ plain form
5807 165 138 78 70 88 15 109 195 41 165 240 91 59 262 318 235 122 183 204 206 180 166 54 90 17 52 155 263 183 49 69 62 35
5431 35 46 81 68 17 89 134 78 349 262 68 246 235 159 272 126 145 87 130 115 172 119 82 120 114 159 223 147 224 134 126 274 190 11
5044 11 175 217 322 62 258 193 245 165 209 102 131 292 179 22 79 81 94 67 84 106 68 141 139 202 97 81 77 109 238 38 166
4680 166 45 169 168 82 228 170 65 60 40 4 218 213 64 198 205 161 56 88 103 137 103 200 167 67 155 91 44 216 73 175 121
4316 121 221 20 47 83 51 42 80 74 105 171 208 248 290 181 52 203 49 222 215 162 82 201 274 153 151 289 285 185 199 73 172
3953 172 194 15 55 61 23 41 68 91 37 149 148 97 166 182 78 200 179 82 136 258 205 183 151 162 133 142 180 85 108 82 29 49 134 235
3553 235 161 69 153 81 152 144 44 129 144 52 136 56 120 165 60 241 142 109 50 271 195 50 87 151 85 42 117 51 104 200 225 99
3178 99 96 187 26 97 41 176 105 249 95 130 191 770 2132 1413 334 50 219 137 35 145 131 280 239 176 400 203 159
2861A59r1k3K5Q3r7J78o1p1j1M4l0L1O3q6M0o8N4J06j32lJ10j11M4r3J72j10n7K23O0j13j98
2497C7K3J01Jqq0J8K33j9k16n2J13N1p0l9R8j10R4j51Q6nP2j13K0rJ5P6j37j2J35j20P4m8
2121E8J72j41R7j05M6k4J4L1K5J51K6J417J306j717q84k25o9L6j73J10J51j23P5n8j4r1M1
1805A32p3N7o8J28K7j08n0L7L5J54o0j10QN8q8k8kM8J15k7o5jj6m4J2Q5K10j52q8lMj3P8m7
1405A45J7Q2K1j4k2j41L1n4ll9J2J02q2J66k8p9J30j75k5RO1k6m0J01jJ9M5Mj63M3m4J29j4
1018A67o3m9J43L9j58N9J07j2j39k3J82k8j9o7o8NP8k3Lm4K3J16j27L2m3m1k1J01L1l9K12
654C34j19q0j9L0O7j53pJ38j2L8q5k5R7pNJ2j08l0O5L2jR8j6j5j39J04l6j24N9J10L0j16N2
267A79j1j53P5K1M7n6Q0j54P4j7PK0q3Q6pm4P0j00J36Nl0R7l8j8k7j9q2L6p3R1M0q1NJ1jR
$$ plain form
2861 159 68 45 70 153 56 234 173 102 91 135 105 136 199 113 153 85 139 245 113 110 220 109 153 60 232 122 65 288 348 235 37
2497 37 60 161 162 154 74 92 325 306 90 38 151 202 132 93 191 81 175 24 110 105 177 64 84 75 90 166 29 17 152 32 106 58
2121 58 230 89 186 81 127 103 117 148 173 324 350 1767 3073 1356 472 247 178 214 41 151 302 179 254 196 182 91 132
1805 132 59 116 48 176 203 95 45 82 117 271 211 101 109 167 79 51 49 97 212 185 120 119 103 59 71 156 366 214 126 123 127 114 192 145
1405 145 162 244 265 251 229 88 119 65 62 23 35 137 55 221 193 114 244 69 44 53 114 88 48 149 148 167 212 216 53 96 52 181 167
1018 167 104 55 198 237 79 138 245 233 94 71 253 225 206 139 71 76 154 131 134 90 113 229 102 134 91 50 29 130 161 122 334
654 334 215 135 116 146 213 60 53 191 179 217 132 107 204 197 202 214 106 76 141 173 172 270 254 239 100 204 168 44 103 213 243 127 179
267 179 168 15 90 111 158 102 182 28 102 85 92 112 29 115 108 64 134 34 170 175 145 242 204 186 159 140 58 94 21 112 152 71 76 87 86 95
-156I5m2kQ2
$$ plain form
-156 95 53 51 133
-191A33
##PAGE=	F1=7375.53
##FIRST=	25168.397401625570637,	5807.04592319999756,	0.14776043593883514404
##DATA TABLE=	(F2++(Y..Y)), PROFILE
5807A40Kp1j1L2o8J11Q1j84J62J13j77p6J54P8m4j18R0k3mk7n2l5K4p0O0P0Q2o8r1k4J2j4
5431E4J6K7Pm5ON9o4L03j73m7J07J5o3M8j43j1mN3pK8r9m6J02j0O0J02n9M1j44L1J54j09j12
5044G7R8J4J35k37J62o3K3n1Rj45P7J56p2j35j5P9m5J2J2J1L4j2pQ0q8m4j5O6J43k07J27j48
4669C1J00J3l8J47o9j23K2l4%J11K1j16J02J6nj49J6N4O5r6J25j7n7Q8r3o5J30j57J50n7Q6
4305B01j59J4J3OM7L1m2m6J00J5P8L1j52o9J57j59J26L6n7j04J28N7l8l7Q3N8k9l0k24J32
3953A67O6k10M5n5P0l7L0N0j18R6N4j3k4M8r0J19Oj79P4J81p6K7o9K3n8pK3n5K6o1k1L3J20
3565A85J23j08j12R6j19R2jj00O8L2j08Q5m9Q1J9j06J49j35O7j30J93j4j39J2O7o0l0K3m9
3225C2O2J16k7qk5K2j14L9j4M1K0P4j43P2m3O69J276p14r87l15J79q9l9J01k1L5M30K28n64
$$ plain form
5807 140 142 71 60 92 24 135 216 32 194 307 130 54 208 286 242 124 214 191 187 160 108 73 97 27 87 157 239 171 80 56 68 54
5431 54 70 97 104 59 65 124 60 363 190 143 250 265 202 250 107 96 92 145 138 166 67 21 123 113 173 275 216 257 113 144 298 189 77
5044 77 175 189 324 87 249 186 209 158 167 22 99 255 183 48 33 112 67 79 91 102 136 124 117 197 109 65 50 116 259 52 179 31
4669 31 131 144 106 253 184 61 83 49 49 160 181 65 167 183 178 29 45 99 164 68 193 176 119 207 114 49 179 22 172 115 201
4305 201 42 56 69 75 122 153 111 65 165 180 258 289 137 68 225 66 192 228 171 67 195 252 214 177 260 318 289 259 35 167
3953 167 233 23 68 13 83 46 76 126 8 104 158 145 121 169 79 198 204 25 99 280 204 231 162 185 127 120 143 88 114 53 32 65 185
3565 185 308 200 88 184 65 157 156 56 124 156 48 133 84 165 184 78 227 92 159 29 222 208 69 81 148 88 58 81 32
3225 32 94 210 183 175 150 172 58 97 83 124 144 218 75 147 104 773 2049 1335 348 33 212 123 84 185 164 199 629 857 293
2884B93n2p6j37J2P6J0p0J27k5p1KJ23p8m0K2j5KQ6o6J07j46L3J17j27P2j62K62j73K3J87
2532C16Oq9j57jR7k4J4p4j0J84jj93k7J49L2q6l9R0j14Q8j56R6K6O9j17jl8kJ16j26J2J38
2157A78j49Q9j01J67j09J22j36L5j3N1O6r5K37K1J283J283j625q38j86j14O3k18J04J42r0
1863A67Q9p9n0oN3n8k9j4O1L5j12K6rR4J41j65m4k9J23j00m7lO3O3K4q4K5l7o2J06J29N00
1488G71N9p11RO5L0o2k4mJ44m1n3P9j44J2J9m4l8M4n9JJ34j9j6R8j67m3jN8j9n5R4k6O0R6
1089B47k3k00O1n1J47k3o8l3J32P3j96J3J77j0j28m2J64j2o3p2m2N6K7qJ8m5J9J07j05N7k9
725A48q5L9R4pn6K68j58j12j6R0rj45RJ26qP5j36j3P8pL2mj79LJ07mM3J24o6l2j23J40o2j16
326C8J07L9qk1k1L9j40M0R3K0q6N8j43J47n0n0L9n8R6L7j27R1n1P1Kq6J05J7J6J5p4p7L9q8
$$ plain form
2884 293 241 165 28 40 116 126 56 183 158 87 89 212 134 94 116 101 103 189 123 230 84 117 234 107 179 17 279 106 129 316
2532 316 322 233 76 75 172 148 162 88 78 262 261 68 41 190 222 136 97 187 73 161 5 101 127 196 79 78 40 38 154 28 40 178
2157 178 29 118 17 184 75 197 61 96 83 134 200 105 342 363 1646 2929 1304 466 280 166 229 11 115 257 167
1863 167 256 177 127 121 174 116 87 73 134 169 57 83 74 168 309 144 100 71 194 94 47 44 107 170 194 110 135 98 36 142 271 771
1488 771 830 119 128 193 223 161 137 133 277 236 183 262 118 130 149 105 67 111 52 53 187 168 152 250 83 40 39 97 78 23 117 91 151 247
1089 247 224 24 85 34 181 158 90 57 189 262 66 79 256 246 118 76 240 228 165 93 51 107 134 126 144 99 118 225 120 177 148
725 148 63 102 196 189 133 401 243 131 115 205 196 51 60 186 178 253 117 104 182 175 207 203 24 27 134 130 173 297 231 199 76 216 154 38
326 38 145 184 176 155 134 173 33 73 166 186 100 158 15 162 112 62 101 43 139 176 49 140 89 160 162 76 181 198 214 229 155 78 117 29
-73B9J02P3j46M9j1l4K5j7k2Q7
$$ plain form
-73 29 131 204 58 107 96 62 87 70 48 135
-191A35
##PAGE=	F1=7273.27
##FIRST=	25168.397401625570637,	5807.04592319999756,	0.15753071010112762451
##DATA TABLE=	(F2++(Y..Y)), PROFILE
5807A07L1q5jM0p3J33O6j85J90J42j90j03O2R7Jj20J09p4lK4r6M1on6N4N2N7o3l9p1L6j4Q
5420G1PR7o8m7P6q6K92k37J29rM2m4j4j13m5L6N8lj2q7j8J01k3P1J30m5J4j81N1J59r6p8K5
5032A53nJ52k02J39o1j8pj6p1lJ27j2n1p7Q2o8J4jM0O0p7J5P3p5l9j7R1J31k05J12r0mJ9J2
4633A21J37q5j29P5m1K4lL9q9Q1K8K2j62N0N7O3j16R5MjJ04j37q3R2q9J18q2Q2j24J1mO4J02
4246B24kp6m4N6k0J12K5j95j3J60j32M9Q6n2j29J10L5O3m2J3Q6N2o7k81J40R9j92K0JQ0j27
3882C9R2L7j19J0J02L9j14N6p6J15N1j72K7J90p2N5r1L3q4k0Kk2K6n3PJ5J54J39j34j25J04
3518B11j43P5N2j14M7M9j23P4m2J46l8q5R0j71J90j65Q6O9j31k0J01o6pJ8l4OJ15o2J12m9
3166A91l3p5RM4o4J14k4j11J37j16O22J051o41p56l25J52j4l1R4k2j34J547P82j527n73j28
$$ plain form
5807 107 138 53 52 92 19 152 218 33 223 365 175 72 134 231 232 112 221 147 144 168 72 113 107 51 105 157 214 151 112 41 77 63 71
5420 71 78 175 107 60 136 50 342 105 234 225 267 223 209 96 51 87 145 142 130 43 25 126 103 174 304 259 273 92 143 302 206 128 153
5032 153 148 300 98 237 176 158 151 135 64 61 188 176 125 48 130 62 76 75 115 175 98 113 186 111 72 55 146 277 72 184 94 90 109 121
4633 121 258 173 44 119 78 102 99 138 49 130 158 180 18 68 125 188 72 167 171 170 274 137 54 146 57 175 93 175 51 62 58 122 224
4246 224 222 146 102 158 138 250 275 80 67 227 95 144 230 178 49 159 194 257 215 228 314 366 299 18 158 257 65 85 86 166 39
3882 39 131 168 49 59 161 200 86 142 66 181 232 60 87 277 205 260 169 202 118 98 100 78 104 51 58 73 227 366 232 107 211
3518 211 68 143 195 81 128 177 54 128 86 232 194 109 199 28 218 53 139 208 77 57 158 92 85 103 69 75 190 128 240 191
3166 191 158 83 92 136 72 186 162 51 188 72 694 1745 1104 348 23 175 161 130 224 202 68 1615 2397 870 297 169
2861A69j50M6R4p8qL7K7j00K9K22j36q6m9P8J15M03k63j68j25J23O6j45Q7j33K60k24P6J50
2532C17m6n6q6n9J01o2M4l6p3J22K0j51K4J71J5j02n4O6p7P2j03M7L4P8q9j9m3k2R3o0L4J08
2157B08j75R0j00J34j08J60j90O5j1Q1P8r4K08jJ000J122j368o73j43j36O7j95N8J06j4P0
1851B39j05q3J00O0k8j23L6K2L3o5M0o9J54J08k68K9o1J92r6q0LJ11k2P9p9M6n9M9J20M71
1499G54J722j25j942k24J27J4j96J0oJ24o2m7J31j33qQ0q1j2Q0j46K3M6J3M8O3j03p0M5n7
1159F8J3j5L6n6R3J48q3j81M0J3J03mo9k6R6R5k00j7J95J7r0o7R9%j09n7RR0l5J6K4LLO0p8
748A34P3rj34J22P5n1l9K75k03j00j3J00o4r7jJ00J4R9j75KM6K1K6j6j13lO7l0Q0J08j13l1
373A50j15J84q4n8R6k3l3N3q4R5j17rJ29J0j30M8r1J78p4r1M9j2O3Q9j46N1jlJ8q0O3O5K9
$$ plain form
2861 169 19 65 159 81 73 110 137 37 66 288 152 66 17 95 210 613 350 182 57 180 246 101 188 55 315 91 167 317
2532 317 271 215 129 70 171 109 153 117 44 166 186 35 59 230 245 143 89 155 78 150 47 94 128 206 117 98 55 33 126 66 100 208
2157 208 33 123 23 157 49 209 19 84 73 154 232 138 346 345 1345 2467 1099 426 283 147 214 19 77 183 169 239
1851 239 134 51 151 211 183 60 96 118 151 86 126 57 211 319 51 80 19 211 115 35 38 149 127 206 127 173 114 163 283 754
1499 754 2476 2351 409 185 312 326 130 140 134 258 196 149 280 147 139 219 138 126 206 60 83 129 142 190 253 150 80 125 68
1159 68 81 66 102 46 139 287 204 23 63 76 179 175 106 80 176 271 71 54 249 266 176 109 208 208 99 42 51 141 106 122 146 149 152 212 134
748 134 207 198 64 186 261 210 171 446 243 143 130 230 166 69 68 168 182 281 106 108 154 175 201 185 72 69 136 106 186 294 181 150
373 150 35 219 135 77 173 150 117 170 86 181 64 55 184 194 64 112 21 199 125 34 83 71 134 223 77 128 127 124 142 62 125 190 219
-15B19P1j30o7L2q7J06R5j54N1m5n4M4lj1N3
$$ plain form
-15 219 290 160 93 125 38 144 239 85 136 91 37 81 78 67 120
-191A20
##PAGE=	F1=7171.02
##FIRST=	25168.397401625570637,	5807.04592319999756,	0.10754524916410446167
##DATA TABLE=	(F2++(Y..Y)), PROFILE
5807G5N5r7MO3q1J30L6j50K12J57j94j06j3R9J5j14J14j20jJ04j10Q6m2o1M3N4L0o1J1j02
5455C6N7j9j0kJ70j02o2Q9q1K21k16K29j28O0l1m8o3q5M9Q8j7o0J0m0Q3l8P0J43l8Oj76K6
5079A21J62o3n5l8k6J59j66J33o5n3L7k2Rj10Q2O3L6j15L9o4mj5Q4N9r3N3M2q3omR4R3j87
4692I7Q0k9l5l3L7J21r8o5Q1m2L1j02M6o6P5L5M4j13Q1L5K6j14M1K4N3J24j77j00P4JM5j22
4316E5R3j12K7pR0J68l7j06k9Km2J30J9k18J2J77r2m1J17m3j16N3PJ64k3m5P2J29r3k66J10
3953A55J08j59kM1O7j65J42Oj06l8J05Q1j75M7o1J22R7j21l9J44l9M9r2L7j02k2j4j3L4mL
3589H6KJ74J35j47j27J07j38J6J31j20K0O6j25N7p6K39j09n5L9j33K30j79k4J35j20n1J49
3272A82p9MN4m3p1J03o0J83p1n9m2j7Q0j32J97j27j4J51p8L96P36n25m31k88O5J28q2R7k0
$$ plain form
5807 75 130 33 37 100 19 149 185 35 247 404 210 104 91 190 205 91 205 85 84 188 78 164 122 61 104 158 188 127 138 36
5455 36 93 74 64 62 232 130 68 157 76 297 81 310 182 242 211 163 100 15 64 152 135 75 85 45 128 90 160 303 265 271 95 121
5079 121 283 220 165 127 101 260 94 227 162 109 146 124 133 23 105 168 204 89 128 64 60 45 129 188 95 148 190 107 101 97 191 284 97
4692 97 177 148 113 80 117 238 140 75 156 114 145 43 89 23 98 133 177 64 145 180 206 92 133 157 210 334 157 57 131 132 177 55
4316 55 148 36 63 56 146 314 277 171 142 144 102 232 251 33 45 222 130 89 206 163 47 100 107 271 248 203 275 404 311 45 155
3953 155 263 104 102 143 210 45 187 193 87 49 154 235 60 107 46 168 265 144 105 249 210 259 167 204 102 80 66 53 87 83 86
3589 86 88 262 397 250 123 230 92 108 239 119 139 205 80 137 61 300 191 136 175 42 272 93 69 204 84 33 182
3272 182 103 107 161 118 47 150 90 273 202 143 101 84 164 32 229 102 88 239 161 557 1293 768 337 49 114 242 160 257 237
2931B37j24K700J447k545j348j88j00J4J01j60P1p6Q0o7pL10j92j06O5j1L19P13m52n66n1
2638F4J84nj55R1n5K09k52R2J16q2pj4j38J14j08P5Mj24O1L8r8N5J89J0j10p8L3JL9n7kJ5
2262A05J03n0m1k3poK6N8P0j82P2o7R7j23J94j83M8k0R6P5k0J09l0O40Q61j012m28r8j43N0
1910A71j29L3K6O0M0j20l2J29N3j3j77P4kL4pK3j25K04N8k48pjJ74q2j21L2J54j03J27n7N3
1546B21m7J58J19Q77L186l59l370m90J57m6k57kM3Ml7K8R9j16k3J18j07K7J15j73Np0P6Q4
1218B20K7l0j07R7j55O4Qk4l9P3J90j58r9j9Q2M9J2o4JL3R9j52JJ16O7m6r1MJ0j46J0K9Q5
830A47o4M3J9Q0k3ln7P2K1j80J88N9q1rK55k48m7l3P6p3l8l1O8N1J03j81RmQ2rl4k0j3J3l2
420A06R9N7j50j4p6J90r4mO6n5k4P2j04J21j06m4J35Pj73M2J1J47q7j12M5M1OJ38j30oM2q0
$$ plain form
2931 237 113 2813 4260 1715 367 179 79 93 194 34 105 29 109 42 35 345 153 47 112 101 420 1133 681 115 64
2638 64 248 243 88 179 124 333 81 173 289 207 200 186 48 162 54 129 133 9 70 108 10 65 254 264 154 76 109 110 149 92 90 105
2262 105 208 158 117 94 87 81 107 165 235 53 125 58 155 32 226 43 91 71 167 242 222 331 301 941 1802 790 362 264 121 171
1910 171 42 75 101 161 201 81 49 178 231 218 41 115 113 147 140 163 38 242 300 52 45 44 218 136 15 47 201 98 225 168 221
1546 221 174 332 451 1328 4514 4155 785 295 452 406 149 147 190 194 157 185 284 168 145 263 156 183 298 125 130 60 136 220
1218 220 247 217 110 207 52 116 124 100 61 134 324 166 67 48 130 179 191 127 128 161 260 108 109 225 292 246 155 159 169 23 33 62 147
830 147 83 126 145 225 202 199 142 214 235 55 243 302 221 212 467 219 172 139 215 142 104 73 141 192 295 114 123 119 201 192 158 138 125 138 106
420 106 205 262 112 98 22 212 118 114 180 125 101 173 69 190 84 40 175 182 9 51 62 209 122 10 55 96 102 240 110 104 146 66
44F6N9k7k0J07J2J27j65n9J3p1J03J04j31L7q0pJ8j1J2P
$$ plain form
44 66 125 98 78 185 197 324 159 100 113 42 145 249 118 155 75 68 86 75 87 94
-191I4
##PAGE=	F1=7068.76
##FIRST=	25168.397401625570637,	5807.04592319999756,	0.059958551079034805298
##DATA TABLE=	(F2++(Y..Y)), PROFILE
5807E5O7r3j5J09q3Q1pp7K20J58j90r2JO4l6r6J05j41nJ72r8J13o8r3L7P5Jo2N3j09O7j3k7
5420G3N4J43j41n1R0n0J26j00K09k16N6l0l9no7j3J42n4j14J14r1R1m0M8J43m6K5j36l1J51
5068B41k1l4o0n1J39j29J29o9n3N3qN1j81K8J40J00j49j6n3k0k1J17M9o1P7J3j09K9J5Q9M1
4704B76j49L1K1J6r4pJ09j09L6N7l7K4j57K3jM4K3O8n5J08J5k9j04j0M3R2J43k04j15P4O4
4340A96k0j66J11q9K8L2N0K31o7j25k5l8l0J23J2j89k2K07n7j01Q9k6n4k6j7K23K1q4L5J83
3988D05j08k35J00Q7j14k3N8L6j22J45k8p9l9N5J06k17M4l8J45J20p5j06Q3QJ8p2L4j11nj2
3636F0m0N7L7qJ0J73J06j41j16R7j11o3K02j01j7Q8j08L7j39L28j79j9K0o8K02j90j7R8j01
3295I7m9J60q9j1R9m2j47Q5j3J80q6o0pl8P9j24K32j89O9J38l0J38L98l89q1k35l0K77j57
$$ plain form
5807 55 122 29 14 123 40 121 114 37 257 415 225 133 134 198 162 66 171 30 25 197 99 212 144 51 88 163 164 102 155 46 113 100 73
5420 73 127 270 129 78 168 118 244 144 353 137 193 163 124 119 52 39 181 127 13 127 36 127 87 135 278 232 257 121 90 241
5068 241 220 186 126 75 214 85 214 145 92 145 137 188 7 35 175 275 126 110 57 37 16 133 182 121 198 211 102 131 146 235 276
4704 276 127 158 179 195 101 94 203 94 130 187 150 174 17 40 39 83 106 174 119 227 242 213 109 99 142 234 377 173 58 132 196
4340 196 176 10 121 32 60 92 142 373 306 181 156 118 88 211 223 34 12 219 162 61 150 124 70 44 27 250 271 187 222 405
3988 405 297 62 162 249 135 112 170 206 84 229 201 122 83 138 244 27 71 33 178 298 223 117 200 208 226 154 188 77 72 60
3636 60 20 77 114 106 116 289 395 254 138 235 124 61 263 162 145 233 125 162 23 351 172 153 173 105 307 117 100 198 97
3295 97 48 208 119 108 207 165 18 103 90 270 184 124 117 79 158 34 266 77 146 284 254 392 790 401 320 85 55 332 175
2955A75J10k3L4L686K107l520k132k34n6l2J00j74J07j02K8M3q8L42k32j06K00j11N13J011
2673A646o20r40RJ97p2j50Q6L6J37k51O8R5q9M6M2k20J30j33P7N0p9jOk7J7J94K0j06j02M
2321G0Q3Jk5m2k1J39k0o1PLr7J01Q6K6j66M3l8P3j04J92j35j0l8J03O4O6mn7K93N61o40j68
1945B85n0j43J9n0M6m6P1K2r3P5O4K3pj75Q9k4L5L6J4j64K34%j18j29P8J20n9j41N3J71j28
1582A08J46l4M3j0K56J02J260M625o03m737p28J51j27k29p0J22j63K2J12K6r5l0J27j18P3
1288B29J42j97Rj37J08Q2j1L3j37J46j98J02J2q1j1M5K13k21k7k7J00NNn1M7l7Q6q4K3K7J20
924C15j3j09q9J7p0L0J1K6n0O3J8J51n0n9m2N1N2k13K26M5q8J5K26k84L2q2L8k3qo0M1Q1R4
537B92j55Jo0J58n4n8N2j6k6j7J04qj71MK5J31q9K2K8n3QM4p2J06j03m6J12mq1o3J01Q4q3
$$ plain form
2955 175 285 262 296 3982 6089 2569 437 203 147 115 215 41 148 46 74 117 29 371 139 33 233 122 635 1646
2673 1646 1026 86 95 292 220 70 156 192 329 78 146 241 152 198 240 20 150 17 94 144 65 64 70 43 60 254 274 168 66 70
2321 70 153 154 129 87 66 205 185 124 131 134 37 138 224 250 84 127 89 162 58 250 115 105 67 170 234 300 296 239 532 1093 453 285
1945 285 235 92 111 61 107 61 132 154 61 136 200 223 216 41 130 106 141 177 191 27 261 261 143 14 92 212 153 12 65 236 108
1582 108 254 220 263 253 509 611 1871 6496 5893 1156 428 579 452 223 153 275 112 134 246 272 177 147 274 156 229
1288 229 371 174 183 46 154 236 225 258 121 267 69 171 183 102 91 136 349 128 101 74 174 179 184 133 180 143 229 145 168 195 315
924 315 302 193 104 121 51 81 92 118 68 131 149 300 250 191 149 200 252 39 265 310 222 237 463 179 211 129 167 144 136 76 117 198 292
537 292 137 138 78 236 182 124 176 160 134 117 221 213 42 46 71 202 113 135 163 110 118 162 90 196 93 47 159 155 74 11 112 196 113
150A13r4%R8n4J62r8m7P3j50J17Qq7J44l6J70j60o0j6m4R2J00q4J3j04O1k3l0L3l2
$$ plain form
150 113 19 19 117 63 225 127 80 153 3 120 128 41 185 149 319 159 99 83 39 131 231 147 160 56 117 94 64 97 65
-191F5
##PAGE=	F1=6966.5
##FIRST=	25168.397401625570637,	5807.04592319999756,	0.17403498291969299316
##DATA TABLE=	(F2++(Y..Y)), PROFILE
5807D8P2p8j3J31r8J3k1%J95J47j81o7L9M6j22o6Q3p4J2J19p6J40p5j52M5J05k6p1Q8j03P5
5443A35Jm3J23P5j79j3O2pM2LJ59k51K0m1LN3l9l6J56r8q4J11j46J23l1MJ43p1O0q9p5J18
5068A88J7j3l5n7P0r0J10o4pK7J5O3k02O6J12J27j68p5m3k5j0J21L9k4J00lj39N1L4P7rr5
4692A58k4M9R6j18r9J19j17J08L3l3J6j42l2N8K0k4R8NJ28nq7q6m7N6J10J56k13j26Q1R9o4
4328A73j28N1k2j8Q4k1K72q5j31l4o2J4J00Nj55nJ82l5q6k0mK3l8L5J11P7j11J7J88j17k00
3964F0J13M5o2m8N3oj9J26o0n0l0pJ16j95J0pJ71J12l7j67K5M9k7l7L1j05K4rk5L1N8j7L2
3577A48J61N0j10r4P0p0q2J81n5o5J20p4J2j76L53k32K2K9l5J62j97K7L5o8l6J45q9m4J39
3237B27k4j78L3M4J37r0m3K9n4M2o7K31j86Q2J29Pq9J06k55K17j79m1L25k27J31l6J84M409
$$ plain form
5807 48 120 42 29 160 62 75 54 54 249 396 215 148 187 233 111 45 128 54 66 185 109 249 174 22 67 172 146 75 163 60 135
5443 135 136 93 216 291 112 99 161 154 196 199 358 107 127 86 89 142 103 67 223 125 41 152 6 129 98 102 245 174 234 145 70 188
5068 188 205 192 157 100 170 80 190 126 119 146 161 224 22 88 200 327 159 84 41 16 6 127 166 142 242 239 100 151 185 262 253 158
4692 158 134 183 279 161 62 181 64 172 205 172 188 46 14 72 92 68 166 171 299 294 207 121 74 130 240 396 183 57 138 237 173
4328 173 45 96 74 56 140 119 391 306 175 141 79 93 193 198 43 38 220 185 99 79 75 98 60 95 206 283 172 189 377 260 60
3964 60 173 218 156 108 161 155 136 262 202 152 122 115 231 36 46 39 210 322 285 118 143 192 165 128 159 54 78 69 44 75 133 116 148
3577 148 309 359 249 155 225 155 73 254 199 134 254 180 192 16 369 137 159 188 153 315 118 145 180 112 76 221 132 88 227
3237 227 203 25 58 102 239 149 106 135 81 123 56 287 101 183 312 319 230 336 81 298 119 78 403 176 307 271 455 4864
2908D864K618m251k746k45k9p2P8j38J14q9o8J43j32L20k53q5L07j82O43J244p32j179j5J84
2626B99j18j26P0J22N7k22J3R9o6P5P7k53J09n7j8J12n6rk0k0oJ68M5r8j11pJ32k6j7o8n3
2262B7J70ro9M6%r1P6J16j8j32J6j3M7p2J87r5o1o9J13M5J46j10q8M5K93l16K2J1j45j3K0
1898G9N7l3oL0k4J02Mk3nj31Q8l4K0N9K0j75K38m9j0j56O9P5l3j20L6J60p2J18j4J1L7L40
1523F58P0J536N728q05n750q89J18k12j52j49K00k81O1J61n4o5k4R7j12J24J49k05K6j28O9
1229A71O7n6Q1j48J77k01J33Oj28kM2K16k46JNP9j9k9l3J06j04O5k4M4l3J57jj10j45NK4L1
854A31J2q8%P1L0J97p1r5l1J8P3k28K33L5p2K2K01l04J14j52PO7j5p9L5Q4P5j10j8r8K24r9
478A69q8J01j4m3J0R5o7j01m8R9Q1p1J0nl3L1J2k2P7j02j6Q6l8J9r8J19Qm9p9k4J20n5J01
$$ plain form
2908 4864 7482 3231 485 240 211 139 217 79 193 104 36 179 47 367 114 29 336 154 797 2041 1309 130 115 299
2626 299 181 55 125 247 304 82 95 194 128 203 280 27 136 79 61 173 117 108 88 68 62 230 275 177 66 59 191 165 148 80 27
2262 27 197 188 119 165 165 74 150 266 248 116 132 119 166 94 281 186 125 56 169 214 360 250 162 207 500 184 206 217 72 59 79
1898 79 136 103 97 127 103 205 209 186 181 50 138 104 124 183 203 28 266 217 207 51 120 195 162 42 78 238 166 284 270 281 318 658
1523 658 728 2264 7992 7187 1437 548 666 454 302 153 353 72 133 294 240 175 151 248 136 260 409 204 230 102 171
1229 171 238 182 263 115 292 91 224 230 102 100 142 358 112 113 118 197 178 149 116 222 118 183 159 203 170 327 326 216 71 76 100 131
854 131 143 55 55 126 156 353 282 187 156 174 247 19 252 287 215 237 438 134 248 96 103 170 155 76 111 195 270 160 142 44 268 169
478 169 81 182 168 125 135 230 163 62 14 113 194 123 133 128 95 126 138 116 193 91 75 161 123 142 44 163 171 122 43 19 139 84 185
91A85o0n4R1r2O1J0j01J51j06J92j11p9m8j1P0R3j9j8j07J11o3m3M0n0
$$ plain form
91 185 125 71 162 70 131 141 40 191 85 277 166 87 39 28 98 191 172 154 47 158 95 52 92 42
-191D2
##PAGE=	F1=6864.24
##FIRST=	25168.397401625570637,	5807.04592319999756,	0.18681067228317260742
##DATA TABLE=	(F2++(Y..Y)), PROFILE
5807E3P1p2J1J36j24l6J03n0J29J28j67l9O4M9j75m8N4ML7K6m7J60n4j90L5J26l7j04J18q7
5455G4Q3J3o9J87Pk05M2ML6j8O3J08k31m0j6QJ09km0J47j31m8P3j20R8k0m3J53j00Q5o3p1
5079G3O4L9MJ5n4rm5O3m0M3lL4N7k23J40P0J27j65j28k8k7oJ17K2PJ20oj60N8M7N6m5l0o8
4680A19M4J77j17j65J40j15J02K0l6K0j22k1M3K4q8J25O6J35l2j33o2o9O8J08J58k06j18Q3
4352A48J04q8p4j8M9o3J13p8K77r0j23n2p5P0P9Lj48L7J50k5m5p9kM9k3O5QJ17j44N5J33j17
3976B13j63J28nop9L2l9J07J02q1l0j7o6J14j20m0MJ94P6kj97k9P0p4kL4n9K5k0J7j7O8j5
3589A23N4J48k7n8o8L1k7l6P1Qj17J58k6k1j67L00k55O1M9k0J14j91N0rk5k7J17p4q1J69L
3225B27j75l5Q4R4q6j4N9o8nj5K20j60N5J38K7k53r1J62J08j32lL05k77J56o2K98M698K857
$$ plain form
5807 53 124 52 63 199 75 39 142 92 221 349 182 143 207 256 81 33 87 91 128 154 107 267 213 23 58 184 147 43 161 74
5455 74 157 170 101 288 295 90 132 136 172 154 217 325 94 54 38 46 155 153 113 260 129 81 154 34 132 112 69 222 122 207 144 73
5079 73 137 176 180 195 141 132 87 150 110 153 150 184 241 18 158 228 355 190 62 34 7 1 118 140 147 267 261 101 159 206 262 217 187 119
4680 119 163 340 223 58 198 83 185 205 169 189 67 46 89 113 25 150 216 351 319 186 124 55 123 231 389 183 65 148
4352 148 252 164 90 72 121 58 171 93 370 280 157 105 30 100 179 182 34 71 221 196 151 72 70 119 96 161 169 286 142 197 330 213
3976 213 50 178 173 167 88 120 81 188 290 209 179 162 96 210 90 50 54 248 324 322 125 96 166 92 90 124 65 90 70 87 70 138 123
3589 123 177 325 298 240 172 203 176 140 211 219 102 260 234 213 46 346 91 152 201 181 295 104 154 145 120 93 210 136 55 224 227
3225 227 52 17 101 195 109 95 154 86 81 66 286 126 181 319 346 93 2 164 272 140 137 442 165 321 259 557 5255 8112
2896H112m570l044k21j9q9L3r7J27r2j36K12j63K87k56l7L59k20O79J364p64j290o2J53j31
2614A35q3L9J86j1j67n6J24l3O2J03k46O7J6p9J65p2l7j4k0JJ11P2r3r4qJ51l7l7q0k6J49
2251A88k2n4Q3j7l9LJ39n5q2nJ2J5m5J90o9q9j10J23K6K03j90j26k4J34k7k1P6j41jK5M8J
1875A49m5M8jQ8l8q1Qq0R1k4j7O1L9j53K09o2M3j42L3M2Kr5PJ19M3N4Rl8P8L97L2J640O236
1488H652r16o172r44P5k83n8k08K52l00M4J73j29j5j2K7q7J72J34j82L6j12K0O2j11J12j35
1182I5J84j78J61pj55j2N9K01k31k0O1M0k5q5j0J68j58M2J7O2n2J63j2q9j29l3O4N6K0j64
830C3NP0M9K11p6j14j5j7P7k05J97K6m0J1J83l00J75k18PJ38l9q9N7N7M6n9l8n8K21j46j17
466C2J27qk8L5P4r9mp7R2M7n2l0j4k4L7jL0L7q9J9Q1q7R0j40J62n3Or7j9J20j7j5k7k5R8n3
$$ plain form
2896 8112 3542 498 277 258 169 202 105 232 140 4 216 53 340 84 47 406 186 865 2229 1465 175 113 266 135
2614 135 52 91 277 266 99 43 167 134 196 299 53 120 136 57 222 150 113 99 79 80 191 263 170 76 68 219 182 145 65 39 188
2251 188 166 112 195 178 139 142 281 226 144 139 151 166 121 311 242 153 43 166 192 395 205 79 55 189 162 141 217 76 75 100 148 149
1875 149 104 152 151 239 201 120 128 48 139 115 98 159 198 45 254 192 235 93 126 168 170 75 82 201 244 298 307 269 347 744 776 2416 8652
1488 8652 7736 1564 620 695 412 354 146 398 98 142 315 186 171 159 186 99 271 405 223 259 147 167 229 118 230 95
1182 95 279 101 262 255 100 88 147 348 117 97 158 198 173 88 78 246 88 130 147 209 157 320 308 219 90 57 121 177 197 33
830 33 38 108 157 368 292 178 163 146 223 18 215 241 201 212 395 95 270 52 59 197 158 69 126 183 229 170 132 74 295 149 32
466 32 159 151 123 158 232 133 129 52 144 191 139 109 95 71 108 107 137 174 85 104 185 98 188 48 210 157 163 66 47 167 150 135 108 83 181 128
44A28K6j5o6J26j60J75l9j06m2j4L8Q5N7n6r1J38r5m3K4l9
$$ plain form
44 128 154 139 73 199 39 214 175 69 27 13 51 136 193 137 46 184 89 46 70 31
-191C1
##PAGE=	F1=6761.98
##FIRST=	25168.397401625570637,	5807.04592319999756,	0.09978599846363067627
##DATA TABLE=	(F2++(Y..Y)), PROFILE
5807G1O0p2L2J37j51j1J84j11L8J03j44j7O5O5j46o9L0M4O6o3j1J64j3j86J0J18k9j46J30
5467A48o5R6J4j00K31m0k13R2o3O6n6Q8P0j80m8P5j02J40M5n7J35j38l6L3p0O6j1p0J66j03
5115A13O2o3k9J6L7J7O8n3p2jOjP3k1N0L9k18J84L3J17j38j62Ql0j0Q6mL6J29Kj67M9M8L0
4715B34n7K6r1J8K37j01j75J52j17M0K5n1M1j05lJ1N3r4Q7J17J29o5j57k9q6P9R7J39j84q4
4363H6P3Q2r5k4p3J03q4J04r6K47q6j05o9m7Q8O5J2j34M1J27k3lm9k4J1k0Q4j7J09j93J32
3999B22N4j14r9J12m9M8j20PK7J44Q1q9k0Jj09R4n4o9JK07K2L4j81q1Q1r8lM5J1nm2O0n7P5
3600A36JN8J43j14Lm1j1NJ9n1O4j62J96K6n4j54K22k25P2O7pO6j59L3l1J6k3Q4m8r3J70K6
3225B34j60l7N0O3p0J7P5p9j1k3K05j26LJ64L2l30J77R4l5j02M1K55k94J79q9L48M482K765
$$ plain form
5807 71 131 59 91 228 77 66 250 139 177 280 136 119 184 249 103 34 64 108 174 111 100 264 251 65 75 193 164 18 148
5467 148 83 179 193 93 324 284 71 163 100 166 110 198 268 88 40 115 13 153 198 141 276 138 102 135 65 131 120 50 216 113
5115 113 175 112 83 99 136 153 221 168 96 95 101 100 173 152 202 241 23 207 240 357 219 57 65 35 25 111 107 143 272 274 107 156 204 234
4715 234 177 203 112 130 367 266 91 243 126 166 191 140 181 76 73 84 137 43 130 247 376 311 154 125 39 118 215 354 170 86
4363 86 159 241 146 122 49 152 68 172 76 323 237 132 63 16 104 169 181 47 88 215 192 189 140 116 127 107 191 174 283 90 222
3999 222 276 162 63 175 126 174 54 61 88 232 313 224 204 205 96 190 136 67 68 275 297 331 150 69 150 52 49 94 105 100 58 118 61 136
3600 136 137 195 338 224 227 186 175 180 199 148 212 50 246 272 218 64 286 61 133 200 193 259 100 133 102 118 95 179 131 38 208 234
3225 234 74 37 87 150 80 97 172 93 82 59 264 138 141 305 337 7 184 278 243 141 182 437 143 322 233 581 5063 7828
2896G828m398k961j68k6p5k6n7J42j07j12J83j75K62k55K2L57k24O13J347p13j274r2J09j01
2614I9m1jK22o0r1n7Q5j1K3J22k17L6O8r0J93j21q7J3rK4M6Q6r1n1j4J61l4q0q3K8J13n7o
2227A18J00m6J8p3J47p8k1k0L3j1l5K00n6r0j46J27PK29k34j25L9J29L0j23J08j31K8%J9M2
1875A85l5N1k0N1n5j44O4o5J02Lo9M7O3j03J50l1L5j04j4K2N2p7l3N6J85l2L9r8J02M21oJ550
1499B292O032r16n901q90M3l29L5k36K65k91M9J53j94O6op0n1K08J01j20K1q5l8Q0j76J32
1194A74j03J59j35J87k8j62k8Q0J73j90o5J29nk3j48K0K17j81QM2P0l8J37m0m1q6n7N3R5K4
842B38j29o8M5N4K00o1j20Lm1O7j43J21K2pj3J73k69J96k21K1J39n9r2R1J9Mj1l9J6J79j96
478A19r8R8jJ5M8M4r6N5j03Q1L0l9q1L5l6jK1O5j9n4M3Q9j23J12j82K27p7M4j32k2J39J2j26
$$ plain form
2896 7828 3430 469 301 275 200 174 117 259 152 40 223 48 310 55 77 434 210 823 2170 1457 183 91 200 99
2614 99 58 57 279 219 128 71 156 145 168 290 73 109 177 87 280 159 72 85 76 100 146 232 141 90 76 237 203 123 40 68 181 124 118
2227 118 218 172 190 117 264 186 165 145 178 167 132 332 276 186 40 167 174 403 169 44 83 212 242 119 227 96 124 124 143 185
1875 185 150 201 181 232 177 33 97 32 134 137 68 115 178 75 225 194 229 125 111 133 185 108 75 131 316 284 323 225 327 748 742 2292
1499 2292 8324 7408 1507 617 660 331 366 130 395 104 153 306 112 178 172 102 51 259 360 240 261 176 138 218 42 174
1194 174 71 230 95 282 254 92 64 144 317 127 62 191 186 163 15 35 252 71 79 121 191 153 290 250 209 123 66 119 214 238
842 238 109 41 86 140 340 279 159 162 121 188 45 166 188 181 168 341 72 268 47 68 207 148 56 147 166 170 159 120 136 315 119
478 119 21 119 118 133 181 225 129 184 81 162 192 153 72 107 71 70 91 156 137 83 126 215 92 204 22 249 172 216 84 62 201 213 87
91H7kK2J00l7J0n4j6R8j23Q0J5j28K2n6K8L3J29r8p3J56j07m7%p
$$ plain form
91 87 85 107 207 170 180 126 110 208 85 165 180 52 74 18 46 79 208 110 37 193 86 39 39 32
-191C2
##PAGE=	F1=6659.73
##FIRST=	25168.397401625570637,	5807.04592319999756,	0.028364308178424835205
##DATA TABLE=	(F2++(Y..Y)), PROFILE
5807I9M0o7M0J26j73L0K29j43n3P9j14oL6Q7p2r4J9M0R3j28L7J38K7j76RR1j2j44Q6l4J09
5443A99Kj12K29n7k05J22j14P2o8Q2N3j23K5Q0j04N9R4r4J27j18m3nk7M1%n4J55p8jp5L0j0
5068H2PL1J07n9j10L5j5K2P6k8O7J4j63J65kJ07r7j72M4k5j6K8j7O4J13J6j55L1L2Km5N9r6
4680A02jK57q1j55J61j15m5N0o9O4r0J3l0R3o7L0J43J14j05j46J5j14Q8Q7R7j56k6N4M2r3
4328A17J7r9J26q5O7o4J90p7q1p7K0N6N6L0r8rJ12k6K5j0l2l6l3R0L2O7k64K26j8j06j8O6
3953A64p2R2j54L6J12Q6N9q6oJ9j34N5j2q3%K08m4P1j31j29J15o1n9L8N9m2o4R9q0P4K9M4
3577B03J43j92N0j5l3J4N7j43R5j55J89P0p9j29J29j10J2Q2QK6j04ok6K0j3N4j8o9J30L7j39
3213H8j0%M6n7L9P8r0K4p8J88q3n3J87K5k37J70N2p7r1Q4J86k70J81r2L15L812K364l771k527
$$ plain form
5807 99 139 72 112 238 65 95 324 181 128 207 93 87 123 210 138 44 63 103 196 68 105 243 270 94 103 194 182 38 124 90 199
5443 199 201 89 318 261 56 178 64 136 68 150 203 80 105 185 81 140 234 140 267 149 106 101 74 115 115 61 216 138 137 62 92 82
5068 82 89 120 227 168 58 93 78 100 176 148 215 229 66 231 229 336 239 67 111 86 70 98 81 145 258 274 119 150 182 184 139 198 102
4680 102 101 358 277 122 283 168 123 173 104 168 78 91 61 154 87 117 260 374 269 123 138 24 112 199 296 140 114 168 210 117
4328 117 134 35 161 76 143 79 269 192 111 34 54 110 166 196 98 89 201 175 200 190 158 122 89 179 211 278 14 240 222 116 98 164
3953 164 92 184 30 66 178 264 323 237 231 250 116 171 159 76 76 284 240 311 180 51 166 105 46 84 143 101 37 136 56 130 159 203
3577 203 346 154 204 189 156 170 227 84 179 24 213 283 204 75 204 94 106 188 196 222 118 112 86 106 93 147 129 60 190 227 88
3213 88 78 78 124 67 106 184 94 118 40 228 145 92 279 304 67 237 289 212 121 205 391 121 302 210 525 4337 6701 2930 403
2873D03j02m0m4p9j5J48j25p6J32j48K41k58O9L14k05M69J203n97j139q2N0l3k9j4K12q6k
2556A67l7NJ3k5J30j65K7Q7q3K14j88j29L5J6M3lO6q4J4k6J73k6j32q3P2R8r8N8R0p8O2j29
2180H4J32q5M7l7M9k2m3K09n0o9j65J19oK21k43l9l4J30O3j05P8j20N2j9k3R6k9N0n2nm2q2
1805F0O4j07J09L1j16L8P5m1O3K7ko0n9J4J11p0p4j5L12j24P9j54J02M08l7J289N172q07n005
1464A283p52M1l49J19k39K41k76R3J08k42J73j5j44k3K06O0l1j7m2r6J11j78Q6p1J11q5K13
1147B85n0j62k4Q3J41j43o8J54m0k7q9k5K08j54m8O8N6j6R2p5K3m7o1K8J30J6r0r2qL6J73
783B74k6j20K1n1O0q4M5K1J3l6J69k13J66j51nJ13o6q9J21pn7L3rP2J31k47qNMP7L8J0p0Q5
384B19j28P8K3k8j10J04k9p6O7N4q8J2M1J00j34Q6j52K36o7N3j65l4J73K2k08J5O7R9l4Mr3
$$ plain form
2873 403 301 261 217 138 123 271 146 70 202 54 295 37 106 420 215 684 1887 1290 151 69 119 86 57 43 255 169 167
2556 167 130 135 148 123 253 88 115 202 119 333 145 16 51 67 110 107 173 89 103 77 250 224 92 9 81 179 81 139 229 151 213 84
2180 84 216 131 178 141 190 168 125 334 284 215 50 169 163 384 141 102 68 198 261 156 234 114 166 147 124 220 191 241 189 184 142 60
1805 60 124 17 126 157 41 79 154 113 176 203 201 141 82 96 207 137 63 48 360 236 315 161 263 671 634 1923 7095 6288 1283
1464 1283 531 572 223 342 103 344 68 161 269 27 200 185 41 18 224 284 253 236 194 98 209 31 117 46 157 72 285
1147 285 235 73 49 132 273 130 62 216 176 149 60 35 243 89 41 109 165 149 241 166 189 142 81 109 239 255 165 73 65 101 274
783 274 248 128 149 98 158 74 119 140 153 117 286 73 239 88 83 196 130 41 162 155 98 131 122 194 325 78 70 75 79 156 194 204 134 219
384 219 91 169 192 164 54 158 129 53 120 174 86 98 139 239 105 191 39 275 208 261 96 62 235 257 49 64 131 230 196 200 107
20A07L4P2p4K7Pj32P7q3P0o7J77j43n0J64r5o9oK4
$$ plain form
20 107 141 213 139 166 173 41 118 35 105 38 215 72 22 186 91 22 16 40
-191D0
##PAGE=	F1=6557.47
##FIRST=	25168.397401625570637,	5807.04592319999756,	0.021214306354522705078
##DATA TABLE=	(F2++(Y..Y)), PROFILE
5807A25J6n1L8R8j83N2K53j39j16N6p2Ml9J10kq9LJ7J11j42P6Q4M8j55K7N1jj12K0PJ19j6
5431A98p6J56m7j84J18j18M1l0L2N6p3Q8O0p3k2J35j52J27p9n8l8oK2K5j2J22n2n6m2M2k4
5068H0m4O7J10p2j24O0L4nO4l5Q9j1r1J06k9J00n4j67Q1ok9n3K3N7Q0K5j24J3Pk5k2O1r0J3
4669H9K28o7j15J68j06j24Q6n7N0p7K8o7J22m0PJ33R3j50p7N0j46P1Q7L3j22M2K8kp5L3q0
4305D3J03p0K4KJ24o6n8o7L8M9N1M4o6o3R1l4L4K1j9p2n5Q1J11K7j97J75p2j02N0K0o2J13
3929A98j33P5J19K2L1p3J4L9j53J0Nq0JJ95j10J09p0j77J86m2p4MP1p4p1J25q4O8N6J6J42
3565C45k36N9Pj7LN7j64P9m4P9R4r5q5N4J4p1R9K2pn6j5rk6J0N2Np0Q9L7j13Qk2N4o5L9P1
3143A82r6N3j03J53k8o2J53J0j69J08L2n3r3J22J01j92J41m9J97K845J753k832j860m0n2j4
$$ plain form
5807 125 141 90 128 226 43 95 348 209 93 149 77 81 42 152 150 61 64 81 192 50 126 210 258 103 130 181 180 68 88 95 214 198
5431 198 122 278 231 47 165 47 88 58 90 146 73 161 221 148 126 261 109 236 157 99 61 55 77 102 90 212 160 104 62 104 80
5068 80 36 103 213 141 17 77 111 106 170 135 224 213 122 228 199 299 245 78 159 153 124 71 94 151 231 256 132 145 152 127 105 166 76 89
4669 89 317 250 135 303 197 73 159 102 152 75 103 36 158 118 125 258 351 201 124 174 28 99 186 219 97 139 167 165 90 123 43
4305 43 146 76 100 102 226 160 102 35 73 122 173 217 151 88 179 145 179 200 181 109 54 135 246 273 76 251 179 77 127 147 85 198
3929 198 65 140 259 281 312 239 253 292 139 149 154 74 75 270 160 269 199 22 208 166 92 96 167 93 22 147 63 131 187 203 345
3565 345 109 168 175 158 161 218 54 133 89 168 262 167 82 136 150 79 178 200 193 137 122 113 87 97 149 154 84 173 210 97 105 83 137 72 111 182
3143 182 86 139 36 189 161 99 252 262 93 201 233 180 87 209 310 118 259 210 407 3252 5005 2173 313 273 221 207
2837B07j06L3J32j37m0P4q5K16k58R4K43j76K89R68m48r21ll8M3m5K8J56j06R0l1q9N3o4J12
2497A91r1M2P4p5K36k59j9q9N0M7j6mn3P2l3J85j6j65n2N2J04j08R2N8j00Q0j46Q8q1J17o0
2133A21O1j8n9K07m0l9j71J09j2J81k28L3n3M9R5k7J9j08P1k9n9J55n4N2p7p1LL4K9j35Q1
1769A20M9j45O9N3Qm1Q3l1k8q9J7J61o9j02PL01j99J26j99P6L68n6R20L870o24l699n63P3
1441D56l44J85k29J93k39J42M4j55J72l0q6m9J10L1N4o4J8j18J12j16%o9N4l6K42o3j63%O1
1100A13J15j04JJ11n3n0j3n9J59r9r1R4K7j2M4r6P6k3n1K5J31jo2p2n8pJ42K0j17L9n3O7m6
713I7j2J9Rl8J62j47J02o6m7Q4n4o4J25j7j26P5M0R1Q5k87P7p0J9J28Pk7l8J00j52R6J7j6
337A72q3J21pj07P3J8j24O4J6J08j24K9n7J84l9L9j80m7K07J3k54K3R9R5k9lj15P6M2l9K8
$$ plain form
2837 207 101 134 266 129 89 163 78 294 36 130 373 197 486 1454 1006 85 82 44 87 42 70 226 120 210 179 90 143 79 191
2497 191 100 142 216 141 377 118 99 10 60 107 91 87 34 106 73 258 242 77 25 77 181 73 165 223 123 203 57 145 64 181 121
2133 121 182 164 105 312 272 233 62 171 159 340 112 145 92 141 236 209 228 120 191 162 103 258 204 256 179 108 111 145 174 39 120
1769 120 169 24 93 146 154 113 196 165 137 48 65 226 157 55 62 363 164 290 91 167 535 479 1399 5269 4645 946 383 456
1441 456 112 297 68 261 22 164 208 53 225 195 109 60 170 201 255 191 209 91 203 87 87 18 72 36 278 215 52 52 113
1100 113 228 124 125 236 183 133 120 61 220 121 30 124 151 139 183 87 163 140 89 114 245 244 182 110 52 45 187 207 90 129 76 143 97
713 97 85 104 113 75 237 90 192 126 79 163 109 45 170 153 27 102 142 233 318 31 108 38 57 185 192 165 127 227 75 171 188 172
337 172 89 210 203 96 169 187 63 127 143 251 127 156 99 283 244 283 103 56 263 276 22 45 144 239 210 207 92 168 210 171 199
-27A99m6j13J11j02J13j20J67j87K5J17o6q4QL0
$$ plain form
-27 199 153 40 151 49 162 42 209 22 47 164 98 14 22 52
-191E2
##PAGE=	F1=6455.21
##FIRST=	25168.397401625570637,	5807.04592319999756,	0.049045953899621963501
##DATA TABLE=	(F2++(Y..Y)), PROFILE
5807A38lk7L5N6j69L2K59j01j38M6l7K7p1M3M3n1k6pJ16r6Q4K1L6j06M7Jkn1n0N5J13l0j0
5420A77M1j5j52P3o4l2O4o0P7l2J21J9j6p2J51k21J31l5p1l6k4kP5L0Q0l5p9K2%k9m9Q5O3
5032A85r1o7K6J03m9N8n3J13k3k4K5m2Q9j8j49J14K4m7j47J02J3N5K1p9Oj2n2oL5q0O9J57
4657B56o9n5J64q8j46Q5j8Lo2M1q2J17j6J6J00P5k01M2N5j65K6R5m0o9Q8%l9k9J2l4N2n0J0
4269G4O4O5n0m5o5K9O9M5M6m3q9N5m8K0M3J3q9o7N6J75J8j06R3j09j06Q8j2k8J12r7R7R9k4
3882B83jn5L1O0j64l0No4JJ71j58J31kj84K32m3p4k3N5r6k7J12q6P6O3j8J32k29J8K8M0nK
3495A81j18M4M5l2R3j01k9N3O1j41J22L1m0l1JKp1L7Q3J4j10N9L8q5jrQ5r1K0N3r7O4o8R2
3096A54L1l6Q4oj37L8K7qq3J35J2o3N0K5L5J795J071j780j125Kn4%r6Q0R2j37j0J9j3J89k45
$$ plain form
5807 138 135 108 143 199 30 62 321 220 82 128 91 118 47 90 133 82 56 49 165 69 153 174 210 104 151 152 150 99 49 104 217 187 177
5420 177 218 203 51 124 60 28 92 32 109 77 198 217 201 129 280 59 190 155 84 48 24 22 97 127 207 172 93 115 115 86 37 122 185
5032 185 94 27 53 156 107 165 112 225 202 178 203 161 250 232 83 197 221 174 27 129 142 197 218 139 145 133 81 75 110 30 99 256
4657 256 187 132 296 208 62 147 129 132 70 111 29 146 130 146 246 321 120 162 217 52 78 173 133 64 152 152 113 84 96 62 114 64 74
4269 74 138 203 153 108 43 72 141 186 232 189 100 155 107 127 170 183 94 27 83 258 276 170 263 154 48 136 124 96 208 111 208 307 283
3882 283 282 227 258 318 154 124 129 65 66 237 79 210 208 24 256 213 139 116 171 75 48 160 74 150 213 195 327 98 116 144 184 179 181
3495 181 63 107 152 120 213 112 83 136 197 56 178 209 169 138 139 141 70 107 190 204 94 153 191 106 105 96 181 90 110 163 66 130 62 154
3096 154 185 149 233 227 90 128 155 147 64 199 211 148 198 223 258 2053 3124 1344 219 221 167 167 71 151 243 106 96 115 102 291 46
2732D6J03J60j49J18O98l07o59J06q7N7o9R6J13j44J67l3j87J09n9L1pP3M6p5K63l20R4j50
2403C4L1K8Mo0L2K8l1J91lj58l4lJ26p9Q0J3r3O1j16J5l5J48r3O8Jp1J85j8j5j63R5j1J24
2016B81k01O9mQN1M3l9r3Q2l6o1J86j02N7p9j35O8J11Kj46N3N2j45J07L6K9j32J07m0j7p1
1652D1NJ83o3j11O8J99k34J71k26K6L18o3N22K429m16k276l66J37k70J79j95J12r3Q4l0k2
1347A09J30m1j8q2MM5R4r7P7q9O2q0l4o1mkK48n3j44nL2J10r2Q4O2n2q4M1r3J21m3r8R4J4
948A55l3J2m5L8ol0M3R8k2n1j7q9j4P0N4j10O3n1P3l0m2K4l1j0J51q9L9Nq4M5k2k1J00j7q9
537F7L6O0Q1M7k77J16j08N1J41m1o4oJ06j65J29Lkm3J13K1j24O4j4q6N2j7J11j08k7L2J23
173B71nJ0j69m4K19rk58J2J13R7k5j4j08R8Qk0M8j03p3J20j10J44j46J32j56O3L6l6l0m4M7
$$ plain form
2732 46 149 309 160 278 976 669 10 116 29 86 17 113 226 82 249 216 29 138 79 110 103 176 222 147 410 90 184 34
2403 34 65 93 97 37 69 97 66 257 254 96 62 59 185 106 186 199 106 167 51 66 31 179 86 154 155 84 269 251 236 73 168 157 281
2016 281 80 149 145 153 204 247 208 115 197 161 100 286 184 241 162 27 95 206 208 62 115 167 22 129 165 194 62 169 129 112 41
1652 41 46 229 166 55 123 322 88 259 33 59 377 314 836 3265 2849 573 207 344 74 253 58 170 77 161 131 109
1347 109 239 198 180 98 102 147 241 144 221 132 194 114 80 19 15 13 261 208 64 59 91 201 109 193 255 203 119 160 67 188 145 47 141 155
948 155 122 134 89 127 121 91 134 232 210 159 142 53 39 109 163 53 116 65 138 108 66 90 59 49 200 111 150 155 71 116 94 73 173 156 67
537 67 103 163 244 291 14 130 22 73 214 173 109 103 209 44 173 176 174 131 244 265 141 205 191 105 157 140 251 143 116 148 271
173 271 266 276 107 63 282 273 15 27 140 237 212 198 90 188 196 176 224 121 48 168 58 202 56 188 32 95 131 95 65 21 68
-191F8
##PAGE=	F1=6352.95
##FIRST=	25168.397401625570637,	5807.04592319999756,	0.12612240016460418701
##DATA TABLE=	(F2++(Y..Y)), PROFILE
5807A34j6lL9J4j13m6K50l8j31M0k1O0n0p9N4J2n5l5J12l4Q1l1jj5M0n3j4L1r7Q3Q5l1N5o9
5408A58K4j17J0J3n5R5j22R4JJ13l6N5q5J43k63J13lo7J2k2%O6M3M4l6o8L9l3j8kO3or9J8
5009G2j3J26r1P4p6J17j1K7o2l4O8Lj19J38N5o3j83J21l5N1Ml3J2j1p0j6Kj3Q5O2q6K2J40
4622B63o1r5K8Ol2n0N8q3Q6J1L5O4P4k65J68L6j67k7J09j07M1N9k7o5M4l4Q%l3L7R2K8l5m3
4222A23p7RJ05L9L4l1p6Rn5k4O3N8q8m0L3J63M3l8K6j33j09Q5k3RJ03n9J07O5m9l1k8K3Q3
3835C19j59n6%m8rJ43j17P2O8j33K15n2p1m5K6r9L7Q5r8J09M8n6J09j86m6M2J23J0q5q5P3
3471A34O6j18O8r8K4J05M5j87J45M3q7j9J4Rp6M2J27K1j68L8M8n4n2M2J13j14rK6r1O2j3M0
3096A26P4j7M7k7j37lL3J9l9J04o7Q4n8Q5j11Q67M57q02m90J0m0j1l3R5L8j20Pk6M4J58k08
$$ plain form
5807 134 118 115 154 168 55 9 259 221 90 130 109 169 119 40 94 106 51 16 128 94 175 144 143 128 168 115 101 132 35 118 203 172 227 158
5408 158 182 65 75 88 33 128 6 100 101 214 178 233 148 291 28 141 138 71 83 61 61 127 170 214 178 110 149 116 98 96 159 153 54 72
5009 72 59 185 94 168 92 209 198 225 163 129 197 200 81 219 274 211 28 149 114 165 169 136 148 137 67 51 53 40 125 187 101 123 263
4622 263 202 107 135 141 109 59 117 34 120 131 166 230 304 39 207 243 76 49 158 51 92 151 124 59 103 69 77 77 44 81 173 201 166 123
4222 123 46 55 160 199 233 202 126 135 80 56 119 177 89 49 82 245 288 250 276 143 34 119 96 105 208 149 256 321 272 241 213 236 319
3835 319 160 104 104 56 47 190 73 145 213 80 295 243 172 127 153 54 91 176 78 187 235 179 288 102 56 98 221 231 146 61 134
3471 134 200 82 150 52 76 181 226 39 184 227 140 121 135 144 68 110 237 258 90 128 176 122 70 112 225 111 102 128 37 99 86 126
3096 126 200 183 230 203 66 63 96 115 76 180 113 197 139 224 113 980 1437 635 145 155 115 104 71 166 204 84 91 65 109 267 59
2732E9J03Q3j34qM47k00k76O6q0K0n3J29J15j98K06l4j69O3k3q5O3J07J8p9K90l55J67j77
2403F5J7qL3L0rn3j6J85J8j34l0o1J49m5N7l5m7J2p1k2P6P3j26N9K7o5J34J9oj40P1kO4j61
2004E8N9M7J6kP7q3p0Q1m5j6J71j54O1m7q4K2J40j5j45L7M6j30J29M0L7j36M8m6l0J3m3J75
1628B11m7j03R0R3j71J58k08K5J93o8J76J145k26j026j87K07j27R3j22qK7K1r7P6J08l6K5
1312B22j06q6J22N5r6J11m6Jo5l1j8K5j9J62k5j01l8NJ28j14J59K7n2j10O7j26R9Lq1O7K8
948A67o4QL4o3QjO6M5l2o6O5r3K9k2M1r9J02n7O3k3m8L9r6L6J35m5K0L3r2k7K7J7O8j8k2M
525A39L5N2K0j91Q0j03P3J34r3r2J2J03r9J11k4Qj0R6M5j30M8l0l0K4m3J06r3n5Q0O3L0k5
150B41j27l3K11l8k20lR7J00k5k7p7J01k8j4O7j42j8J06j03J47j57R3o7N6m1k3M9j12P2
$$ plain form
2732 59 162 245 111 103 550 350 74 140 60 80 27 156 271 73 279 245 76 139 116 31 94 201 219 140 430 75 242 65
2403 65 82 74 107 137 128 75 59 244 262 128 98 37 186 141 198 163 116 128 57 35 111 184 58 117 144 79 213 232 226 86 157 155 219 58
2004 58 117 164 180 178 255 172 102 183 138 122 293 139 200 153 69 91 231 216 71 108 154 24 153 193 230 94 142 96 66 79 36 211
1628 211 164 61 151 244 73 231 23 48 241 173 349 1494 1268 242 55 262 135 228 106 98 125 146 49 125 233 197 222
1312 222 116 30 152 207 111 222 176 177 112 81 63 88 69 231 206 105 67 72 200 86 245 272 220 110 177 51 150 153 72 139 167
948 167 103 111 145 82 90 89 155 200 168 102 167 74 103 81 122 23 125 68 131 108 60 99 3 39 174 129 149 182 90 63 90 107 175 157 135 139
525 139 174 226 246 55 135 32 105 239 146 54 66 169 70 181 157 165 155 251 296 166 214 184 154 178 135 241 148 93 173 236 266 241
150 241 114 81 292 254 34 31 128 228 203 176 99 200 172 158 225 83 65 171 68 215 58 151 84 140 99 76 125 13 85
-191H5
##PAGE=	F1=6250.69
##FIRST=	25168.397401625570637,	5807.04592319999756,	0.26737070083618164063
##DATA TABLE=	(F2++(Y..Y)), PROFILE
5807A16k6J9M2pn9k4J31L3j14J6rR6m6j45N2N6o5l7P4OP7o0j3O3Oj05NQ4j05P5L4j0R7j46
5408A11O0r3J0L7l6O0j28R9J8P1r3J28p3J21k27M4Lm2N2oK3M9L0J8n5m2Rm6J0L6L8n9o1M6
5009A12j4R5j29J07q0Q1K3O4j40mL3J3q3J41Q1p1j53O3n2N1JpJ4J1q0l3L5K7M9l0j14J07R2
4622B10k6k5l3ml6m1Q0r2N2M3N2L3R4k78K08jj41p4J18r2R9om9p4J10o1J4l4rN8J01J6k2m5
4222A45r4k2J42L8Pk9l8k0k6o2P1P1q6k1N3Q2R4%k7j47q6L8j7M1Q9k4J03L0n4m2Mk4J01j29
3823A61o4km8k5J18rm4J33q7J88o3p5n8qp3Q8N6j19J62J9r8P6j27p6K2K10M2j40j24J47M9
3460B31j67L5l5mJ54K1k06J56O0j37nPJ2l7J0J67L4k22K1P4k6j38J35J06j18l7np7N8L2QQ8
3084A95rN6n8j55ML7J5J0O3j25K09j17P0j63J94j2N2j49k8j1m3O6O3qr0J0n4P3J19j36R2K5
$$ plain form
5807 116 90 109 151 144 85 61 192 225 111 127 118 214 168 23 75 131 66 29 103 109 186 126 113 176 182 77 82 166 61 136 170 160 257 111
5408 111 171 78 88 125 89 149 21 120 138 209 116 244 171 292 65 109 112 70 122 116 139 188 218 236 181 139 148 102 112 148 186 127 66 112
5009 112 98 193 64 171 91 172 195 259 119 115 148 161 78 219 300 229 76 139 87 138 139 132 146 157 77 44 79 106 155 125 11 118 210
4622 210 184 159 126 122 86 45 125 33 85 128 180 213 307 29 237 236 95 21 139 47 146 140 91 17 127 66 80 46 37 95 196 212 190 145
4222 145 51 29 171 209 216 187 149 129 103 41 112 183 97 76 129 211 305 305 278 131 45 83 66 107 196 172 275 305 251 209 213 189 290 161
3823 161 97 95 47 22 140 131 87 220 133 321 258 183 125 117 44 132 188 69 231 250 152 228 101 25 47 257 299 159 35 182 231
3460 231 64 99 64 60 214 235 29 185 245 108 103 110 122 85 95 262 296 74 95 169 143 5 140 246 128 91 86 9 67 99 107 195
3084 195 186 242 184 29 33 70 85 95 158 33 242 125 195 32 226 214 266 117 89 78 35 101 164 156 66 76 22 95 214 78 170 195
2708A95j32n1K34j42K5J7n9rj9J31J49k43J98k9j09rNo3j3J28np0L01l52J81j72K4m6M2J17
2356B24n5j13nJ67M5j09k2j03J52k1M1p3J6k2o8L6J07Rj09nM0m8P4O1j3j12M9NK3r8j1P5J4
1969A51LP3j03l8O6n6O2J13j84N5J9l0m8J30j6j31L0L6j12J34N4N1r3j7p7n1J00r5J51k5q4
1605F8P3Ok9Q6j54Q1K9p6mJ87ok16M3J27l5M7n8j02P1k1p3N0J09j2M2j19p4J41k3o2J10rm1
1218A56n6LOL7j6N1J4n0o1k5J55j55K12J2o1j16P1j51Q6K9m5K4N7q6J7P9j55K5L0Q2j3j6j02
830C8J41p2N1o3mp7J33p0L6j3l6N7n9k1J16j7M8K2q4j14Q5M7L3k4L3ooJ5Kj05M1q0Q9J19j33
420A22m5n3R9K5M5o1RJ0Q1N6j24K7k5J7km8R7q9l8O4J4O5o1n8l1J96o2j84J2P4R1l7l8m1R2
9A99n5j9P9j52L6P3p7J18j51N3J9M4p3m8J38j36M9
$$ plain form
2708 195 63 12 246 104 129 146 87 78 59 190 339 96 294 265 156 147 152 89 76 204 199 129 430 78 259 87 111 65 107 224
2356 224 169 56 51 218 263 154 132 29 181 160 201 128 144 122 54 90 197 206 97 92 132 84 158 219 206 94 143 148 171 73 62 137 151
1969 151 154 227 124 86 152 96 158 271 87 142 161 131 83 213 197 66 96 132 20 154 208 259 166 149 72 21 121 26 177 152 68
1605 68 141 147 118 204 50 131 160 84 80 267 261 45 88 215 180 227 169 67 138 117 44 94 203 191 233 114 40 181 158 96 206 197 156
1218 156 100 103 109 146 130 181 195 145 84 59 214 59 271 283 222 106 177 26 112 141 96 120 177 91 108 187 32 57 87 169 156 140 38
830 38 179 107 158 95 91 14 147 77 113 100 64 121 62 41 157 140 188 210 126 12 97 144 177 153 186 180 174 189 191 86 127 47 136 255 122
420 122 77 24 123 148 193 132 141 151 232 288 164 191 166 183 181 133 230 141 103 167 181 246 185 127 96 292 230 46 58 132 223 186 148 107 199
9 199 144 125 204 52 88 161 84 202 51 104 123 167 94 46 184 48 97
-191I7
##PAGE=	F1=6148.44
##FIRST=	25168.397401625570637,	5807.04592319999756,	0.3354250788688659668
##DATA TABLE=	(F2++(Y..Y)), PROFILE
5807I0l6L6M4jl3J4L5Q5q6m1J1J29n1j52O7M6o0l7N0LP5o9L7O7k6j41P8O0j01O3l4L1J09j77
5408H5Q1q5P6J2l9K6j41J40K1J2j36J86m9R0j88L0k5j4O6PN3N2Rj0q3lo1l2M3N9Op3j9M5j
4997A40M5j50J31n8J6O0R7k03M1kK2n6J11R8o7j17j4KK2M0j1j3M6q6l9Q3K5J2r4qM5K8K1L6
4598B03p1l7k0k4Q7r1jQ1N7J1J26k44J63m6p9r4J01j5P9o4n7k6J02o1qm2K5L9J06K5j0m3j12
4211F0n8J66M8l2l3Pj3J5m8O4L7j02k2P9mJ50J3o9j50l9k7OO1O7LQ8Jm2k5M1j02R6p2n5j6
3800I3o0k6R4P3j25J74n1J62p2q9o6l6j9J09L0j43K22j3j41L7n9j3n3K55Q1j52j85J97K1j84
3448F1K4L5p3J70J2j84J28Q2j65J6pj1K1m6J94N0k51%J13nq6J07M6r8n6k2l4N3L0jO7qJ00
3060B62r8j53K1J9J2L1M2j10K43j10k5n6J80J89j23j94q4J6l2J04Nl3n6Pm7N9O5l0P1j2j36
$$ plain form
5807 90 54 90 134 133 100 114 149 234 148 107 118 247 196 44 111 157 97 60 110 113 188 119 156 223 197 56 134 194 93 156 122 153 262 85
5408 85 166 81 157 169 130 156 15 155 176 188 52 238 189 279 91 121 96 82 148 155 208 260 269 259 176 173 112 80 123 182 188 115 96 141 140
4997 140 185 35 166 108 124 184 281 78 119 117 139 83 194 292 225 108 94 96 118 158 147 134 180 94 55 138 163 175 81 73 118 146 167 203
4598 203 132 95 75 51 138 47 46 127 184 195 321 77 240 194 115 21 122 107 186 122 65 39 141 80 72 30 55 94 200 225 215 172 60
4211 60 2 168 216 184 151 158 145 160 112 176 213 111 89 168 164 314 327 258 108 69 42 48 109 176 179 267 268 226 201 242 140 236 164 109 93
3800 93 33 7 101 174 49 223 172 334 262 173 107 71 52 161 191 48 270 257 116 153 94 81 28 283 364 212 27 224 245 61
3448 61 85 120 47 217 229 45 173 255 90 106 99 88 109 63 257 307 56 56 169 164 78 185 231 133 77 55 21 74 104 103 170 162 262
3060 262 164 11 32 51 63 94 136 26 269 159 134 78 258 447 324 130 46 62 30 134 139 106 50 57 10 69 134 104 175 163 27
2697B7L6L3n4J08j4j0l3j5J32J87k74J72k1n7o0J4%j00J11k1l8K78l12J44j32M3o6J6J79q7
2344A86j15l7J52O7q6nj23J29rL6q9O6k5j10J00J35l7p1p1K5l7L4R3k6r4M5OJ1m4o1M4j9N7
1957A27M0r0lL6n1J38K9j73K7R7j0r8R0jj00K1L2j02J25O4P5m1l4j16j2Q4j32J17ko7L5n2
1582E3R7J7p8J00n8p2J41K49P2l86PM7nN6j4j69O2m2L5q5J26L2L5j24%J00q8k1Q4K0n2k4L6
1194A51%L6Mp8N1Mn9n7J70j92K42Rp5j02O3j35N6K7%rQ3r7J0J00j66mN3R0o7L1p6J12l6N6
795A95r7k7l1J19p8KLj4O6l3n2R1mQ8Op8j23P5P1Kl7P0pl5k0j3l7J0n2R7J00j51L5j19P5J31
373B28k5r8JJ4P0N3r7nkN4k4l3Q9q9qPk2R9r2K1m5J81p1j67N0Q5N5o5m2k0Q3o6l0Q0j20O2
-50A11L3l7O4j12nR0K5m5j00K07j37Q
$$ plain form
2697 27 63 96 42 150 136 126 93 78 210 397 123 295 274 217 157 171 171 71 182 161 123 401 89 233 101 144 78 94 273 186
2344 186 71 34 186 253 167 162 39 168 159 195 106 172 147 37 137 272 235 164 93 118 81 115 208 182 88 133 139 150 106 45 89 70 127
1957 127 167 77 74 110 59 197 226 53 80 177 167 69 159 158 58 79 111 9 134 198 273 232 198 82 70 154 22 139 137 70 105 53
1582 53 150 167 89 189 131 59 200 449 521 135 142 189 184 240 226 57 119 77 112 27 153 185 220 96 96 196 108 87 171 191 139 115 151
1194 151 151 187 191 113 164 168 109 52 222 30 272 281 206 104 167 32 88 115 115 106 189 92 102 202 36 32 85 175 108 139 63 175 139 195
795 195 98 71 40 159 81 83 86 72 138 105 53 144 140 228 234 156 33 108 179 181 144 214 207 172 152 139 102 112 60 157 257 106 141 22 97 228
373 228 203 105 106 120 190 243 146 141 139 193 169 136 225 136 128 135 113 212 120 141 96 277 206 39 89 174 229 164 122 102 185 119 89 169 49 111
-50 111 144 107 171 59 54 144 169 124 24 231 94 102
-191A02
##PAGE=	F1=6046.18
##FIRST=	25168.397401625570637,	5807.04592319999756,	0.33040723204612731934
##DATA TABLE=	(F2++(Y..Y)), PROFILE
5807F8m7M3L9K6l9N0rJ11m6j14K9J55n5j35Q0K6m9m7M5k7P6o9R9M0l7j56J39J3p8N1j13Q3
5431A52Q9j64R0r3J50j3n7nj22J62J5m7j16J82k4N2j57P3n9j2O0J0Q8P1rn2j05M6j51J5N7
5068A26O2k5m9lM7J6Nj10Q3k6k7O1J33k44Q5j4M0o5N1J07m9q5r7R9j7J01j1r0R6q1n4J13K0
4680A98k3j16O9j3l4P5P4p8k7l4jO7o9m6Q4N6j5J58k21J12p4Rj14Q1L4M7r7m1PP4n2k7l9N0
4281G4OJ03M6Rl5j35l7J21O8p9l8M7K4M3m8P9Qj31l4Q8o5J92J1j05j35J9o5J7P0L8J6O1rk3
3882B01J4Q1j57L2Jk5n9p8K7N5R6j50J75k3J43p7j11o5m2K3J10J5j68K78m4j78lJ6M8o9K27
3518B93J16j42j91J85j9j81K7P1j02J37K3j30O4R6j54L4Po1O2j13K05O2k43l1J58Mj8P8n6
3178A81n7o2rk3P6RlK7j2J59j40j12jj0L4J2M5o3K19p5j43M0K62K61k67j97j02J0OR0n8l1
$$ plain form
5807 68 21 64 103 129 90 140 131 242 196 82 111 266 211 76 156 182 133 86 131 104 180 111 210 250 213 57 196 209 131 182 69 152
5431 152 241 77 167 74 224 211 154 149 27 189 204 157 41 223 199 251 94 167 108 96 156 166 254 325 316 264 159 205 54 69 126
5068 126 188 163 114 111 158 174 179 69 152 126 99 160 293 49 134 120 160 95 146 253 204 119 22 121 104 205 194 104 200 119 65 178 198
4680 198 175 59 128 115 81 156 230 152 125 91 90 157 88 42 126 182 167 325 104 216 142 151 37 118 152 199 102 61 68 142 90 63 24 74
4281 74 80 183 229 238 203 68 31 152 220 141 103 150 174 217 169 248 256 125 91 179 114 306 317 212 77 96 31 48 118 156 172 233 224 201
3882 201 215 296 139 171 172 147 88 10 37 92 188 38 213 190 333 256 145 80 38 61 171 186 18 296 252 74 71 87 135 66 293
3518 293 409 267 76 261 242 61 88 159 57 194 217 87 151 247 93 127 134 73 135 22 227 289 46 15 173 177 159 237 181
3178 181 124 62 53 30 106 115 112 139 127 286 146 34 33 23 57 69 114 51 270 195 52 92 354 615 348 151 49 59 65 155 97 66
2802F6l0Pj5L8k5R3N1m0j35O2NJ2M9k0N4n2m4J39K12k87J40j4k0q3J1N7j38M4k6J5K16k39
2427A03O8o3O0o5k3J96r1p5q5J33P1o5K4j35R3nL5p9R0k3j45J51J58p5l1j18ol5K6J02l0r8
2051F3P1%J6j7m9j6m4Q2j5j6oPRJ45o0j12l3J61j0j15K0L8n0j1N0p9P4N9J05Rk0j31JM5j36
1640C5Q0Mn1Rn6J31m0L2P7j04n4J67L44L4m51j1K4j7J00J0k21M6n0J26p7PQ5J6j22O5N3j08
1265H3j1N6L6j9J2M6k5L1L5j90O1N4l8p9J64k06K44Qq2q0N2j00L9j0M7jQ5j04k6J11j11n1
889C1N2R2j02P8l3L4J0N1j33k0K2O5o9l7K4K0N8k2n5O5lJ19op2j04N4R2k6n0Q3kl9m2l4Kq
466I5k4R0Q4j48R4j43N9J84q6j25jpO4L7m0n5K3R4m7lQ4p5kn9m8J31j13Q7p2J62n4j79J12
79A19J16Rj01m4k1Q6n8m0O2o7O4MKRm8p5J32jJ3j18K13j20m0
$$ plain form
2802 66 36 43 28 66 41 134 185 145 10 72 77 89 138 118 172 120 76 215 427 140 280 266 246 163 174 231 93 137 111 126 342 103
2427 103 171 108 168 103 80 276 185 110 25 158 229 164 188 53 146 141 176 97 187 164 19 170 328 253 222 104 98 63 89 191 161 63
2051 63 134 134 150 133 84 68 24 106 91 75 69 76 85 230 170 58 25 186 176 61 81 119 69 58 108 29 103 162 267 276 256 125 126 171 35
1640 35 115 119 68 77 21 152 112 144 221 117 63 230 574 608 157 146 170 153 253 263 42 88 38 164 87 94 179 195 73 138 191 83
1265 83 72 128 164 145 157 203 178 209 244 54 115 169 131 52 216 10 254 262 180 100 152 52 91 81 128 127 212 108 82 193 82 31
889 31 83 175 73 151 118 152 162 213 80 60 82 147 78 41 65 85 143 121 66 131 128 247 241 169 65 119 211 185 135 218 216 177 135 101 103 95
466 95 71 161 245 97 191 48 107 291 205 80 79 72 136 173 133 78 101 195 148 145 229 154 152 93 45 176 63 150 78 240 186 7 119
79 119 235 244 143 99 78 164 106 66 128 61 125 129 131 140 92 17 149 148 161 43 256 136 96
-191I6
##PAGE=	F1=5943.92
##FIRST=	25168.397401625570637,	5807.04592319999756,	0.29661330580711364746
##DATA TABLE=	(F2++(Y..Y)), PROFILE
5807E3k2J6K1O0p3P9k6J30Kj62K0J76n0j09O6K3l0p1L8n4P6p1J51J6k7j65J68l0k5L6j94J26
5431A48N2j19R1j07K02k5q4k9p0J48Mq8m4J27lMj21J31q4k9M1KJ23J02j9j08j10R6k17P0L6
5068A20M5m7nmN2L4jp1J0JpMJ62k49J09oN9j00k1J10k4n3m6N4l0J54J2k04J56o0q9J27J4n3
4669A53j07J04m8p8J25Q8o9K4o8J6M2m3m9L1N4m4J78j97N9k8O2j62R1M2Nj00rJ7M1l4k8n2
4293A6O4k2R3O7L8j9j59j7O6R6j31l5O9P9N3n7R3lj55m8P1q9K07J0j39q2N5p3OP8J4J0K2M
3894A82rO2J23j73p2P5J6j10p1M2M6O6j40J51JJ32q0j32o1J6mR9K0j61K89p1j96l4Q5Q7p8
3530A00J83J40j18j80J77p2j70J6R4q8P5N0p1nQ2j15M7L3q8P1j44J65O7j94j5J32OL9O6j76
3178A07j0m5Rm1J15Kj4Lk8K11j75r3qk1N7m1O3l1J88l9j78L9J85K15j81j26j02KJ1Q0q3k9
$$ plain form
5807 53 31 47 68 128 55 134 108 238 240 78 98 274 224 115 181 204 174 103 141 87 163 92 243 259 232 67 235 205 180 216 22 148
5431 148 200 81 172 65 267 242 158 129 59 207 211 123 79 206 203 207 86 217 133 104 145 147 270 372 353 245 135 231 14 84 120
5068 120 165 118 113 109 161 195 194 123 133 134 127 131 293 44 153 147 206 106 85 195 171 118 72 126 96 250 262 58 214 154 65 192 206 153
4669 153 46 150 102 24 149 237 168 192 124 140 182 139 90 121 175 131 309 112 171 143 205 43 134 176 181 81 72 89 130 96 68 16
4293 16 80 58 151 218 256 237 78 61 127 223 92 57 126 205 258 201 294 291 136 88 159 70 277 287 148 66 121 48 54 132 146 156 178 182
3894 182 173 235 358 185 113 188 204 94 23 65 111 177 37 188 189 321 241 109 48 64 60 159 179 18 307 236 40 6 91 178 100
3530 100 283 423 305 125 302 230 60 76 170 82 157 207 136 131 213 98 145 178 90 161 17 182 249 55 40 172 178 217 283 107
3178 107 97 52 61 20 135 137 123 126 98 309 134 41 33 12 69 28 91 60 248 209 31 70 255 470 289 163 61 63 74 154 71 42
2802D2j1J5j0P2l5R1M4p3j16N6L4l4K7mJ13o3r6J53K16k80J10j5Np7%R6j36m2j2N6J31j44
2427A13k4K0O6n3m3J56o2k7p2P4M2m0O3j44M5lK6n3J00l3j01J39J69j13Rj48l5m1M7Q9j6j28
2051B2J22qK0j3m3j4RPp4R2m6NO1J16j35m7n8J62j5r4l3P9k4n5R7o4J3L0J26N5Rj29rLj18
1640D9N7ql6K6k6O6q0J53K8j13l4R5K15J9k95JL6n3J52J9k41M7m4J60kj54J43j0j10J02J3
1276A75p8m2M7K9M7K0M0m9K3P0j95l0R3mp5J25j41J71jp1o2M1p3N3o6R1L6P7j24p6J12m5p1
889D7L2R6r1O9kl8O2M0j64J6O7k9k7n4J3O8L1k8l7M6j1J32j2o2p8N0J02m8n9P2Nj9n2n3Jn
466H0LO7P1j34J27j55O6J95j27j34K1k6L0QN4j25M2J30o4K7Q1m1k4j10l0J25j16J11j10J36
114A78j0j22J01J44l1j35m9l5J02l2m4K3j9N7kK4k1Lj00J15k9O7j21J92q8q5
$$ plain form
2802 42 31 46 36 108 73 164 208 135 19 75 109 75 102 98 211 148 52 205 421 141 251 236 241 164 164 260 124 82 70 126 257 113
2427 113 89 109 175 122 79 235 173 146 74 148 190 150 213 69 114 111 137 84 184 151 50 189 358 245 254 106 71 30 77 166 150 22
2051 22 144 136 156 143 100 86 95 102 28 120 74 79 140 256 121 74 16 178 163 69 36 115 91 36 133 69 82 112 238 293 302 173 164 167 49
1640 49 106 98 62 88 62 128 48 201 229 116 82 177 392 411 116 117 153 100 252 271 30 77 33 193 191 37 180 170 60 162 175
1276 175 97 55 102 131 178 198 238 189 212 282 87 57 150 146 71 196 55 226 225 154 92 133 60 113 47 138 174 251 127 51 163 118 47
889 47 79 175 84 153 151 113 175 215 51 67 134 105 78 24 37 105 136 108 71 117 106 238 226 164 86 136 238 190 131 203 208 189 137 84 85 80
466 80 83 150 221 87 214 59 125 320 193 59 80 54 84 92 146 21 63 193 129 156 237 196 172 62 32 157 41 152 42 178
114 178 168 46 147 291 260 125 76 41 143 111 67 90 71 128 126 150 129 132 32 147 118 185 64 256 168 83
-191H3
##PAGE=	F1=5841.66
##FIRST=	25168.397401625570637,	5807.04592319999756,	0.20558199286460876465
##DATA TABLE=	(F2++(Y..Y)), PROFILE
5807D0J5Nk2R3j12Q9m5J52M7j62j6J89l2r1L1L7%j05J7n9O5p3J95J3j7j81J67n7N0K0k25J10
5431A38Qo1R6j16K12k5j07n1pJ13j0r7J2R0Pm9n9J57j05m2J9j7J48J39j9j71p8J16j75M5p
5068A04J9n5M0KM2N3J9o4m4J6L6n4J64k17J09QP1j33p1Q7KlL1n7j2J90N3l00J84k8j36J28
4692A84Op2q4J11o6o2J24Q3o0P7q7L2K2k7l8l2N1o4J79j66NQ6O1k22J17K2m1p6K2J6Pqj5n5
4293C0M0l4P3P9P9Nj72qPJ22j75j2N6J37M5o4R2Oj58o4L0o4J84J8j68ON0q4LQ7Jj4k4M3j2
3882A40J02J63j82j43J26N7j35p6L5M8K2j16J11K1J25q0j43n6Q0n1Q1N1j25K52r6j77L7L4
3553A05J02q3J27J52q2j63J92j39j51j0J14o3K0P8k3m9L0p1O5N2q7O4j39R9O1j28J8O7J0P0
3201B38P4k53oOJn0J46Nl6J9o5K48j97j03J5%N0n4K8JJ43j0j04n5N4J26J9p9j02J9rO4l9o4
$$ plain form
5807 40 55 60 38 131 19 108 63 215 262 100 84 273 241 150 181 218 218 113 130 71 136 63 258 271 254 73 240 183 233 253 28 138
5431 138 146 85 181 65 277 252 145 94 87 200 190 93 105 195 202 153 94 251 146 104 123 106 254 393 374 203 125 241 66 111 104
5068 104 123 68 108 110 152 205 224 160 116 132 168 114 278 61 170 178 249 116 45 132 134 131 162 105 93 283 336 36 220 192 56 184
4692 184 190 118 34 145 79 17 141 224 164 241 154 186 208 181 143 111 162 98 277 111 116 202 263 41 158 180 139 63 85 101 108 100 85 30
4293 30 70 36 109 188 267 272 100 92 99 221 46 34 90 227 272 208 300 306 148 84 114 50 234 252 84 90 140 56 59 146 147 133 109 152 140
3882 140 242 405 223 80 206 263 128 52 87 135 157 41 152 173 298 218 75 19 99 48 129 180 55 307 211 34 71 105
3553 105 207 124 251 403 321 158 350 211 60 50 164 101 121 199 176 127 157 86 151 203 116 180 41 140 201 73 91 158 168 238
3201 238 312 59 53 59 60 10 156 161 125 144 79 327 130 27 42 42 92 38 66 67 210 200 96 41 95 221 240 161 59 78 69 133 94 30
2802C0K4Rk2J23%K5N2j13q2M7P2o6l1J4J49o2j47J64J95k53Q4k2J8n0j3J07j11r9K6M1N3m6
2427A16p7O1N8l5m1R0j1Nk3J8j7j2J06j43k2OLk7J05n5j0R7J67j53M9j61m8l1O7N2J0j10J24
2039A58j5J4k6n4K0K6j3n9J15q1K1P8Q7j76om5J07j4n4J3M9m0r0J57n4k9oJ10Q7M6j18l1l3
1652A44q4L8k4j7N4m3K2l1J83k7p5j9k4L9J5r2K1N6p8J67K3k02L9k6J43P6k49J62m1r2J14
1288A72j3l9q1P9lJ06jK6o5J4J03j54j35J10M4o0O6n5Q5k2m0n7L3m9P2j11J21P7P2j54j13
924B8R3J2p3J4J01m5LK6r3J11K7j78P8Q2j36M0ql9Q9pm2oK3k2J28j7m2n1O6R4o3o4M9J1Ro0
502A38n0l7J8L2K9O9j25J32j55P8J82j43j22N0J1n3pJ30j26MJ22n7M6P3Nn4j28J0Q7j03Q9
138A45j40Q9N8l8N7J54n5j53o7j5R3%m5k0J6M1J5K3j5K3j18R8l7P7j14J59l7j22
$$ plain form
2802 30 54 63 41 164 164 189 241 128 46 93 165 99 68 82 231 169 22 186 381 128 212 190 208 158 145 252 141 42 68 109 162 116
2427 116 39 100 158 123 82 172 161 166 143 161 144 132 238 95 73 79 82 55 160 105 95 192 359 206 255 94 46 15 82 134 144 34 158
2039 158 143 157 131 77 97 123 110 51 166 85 106 184 271 95 89 44 151 137 83 96 145 105 15 172 118 89 83 193 280 326 208 177 144
1652 144 60 98 74 57 111 68 90 59 242 215 140 121 97 136 151 59 80 136 58 225 248 46 85 59 202 278 29 191 150 58 172
1288 172 159 120 39 118 115 221 220 246 181 195 298 144 9 119 163 103 169 114 199 177 137 80 113 64 136 25 146 223 295 141 28
924 28 121 133 60 74 175 130 133 159 66 177 204 26 104 186 50 90 82 43 132 125 83 77 100 78 206 189 147 96 162 256 193 129 178 189 198 138
502 138 88 51 69 101 130 199 74 206 51 129 311 168 46 96 107 54 47 177 51 55 177 120 166 239 244 190 62 72 159 56 145
138 145 5 94 152 114 171 325 270 117 50 35 128 128 83 63 79 120 135 158 143 166 48 146 109 186 72 231 194 72
-191G2
##PAGE=	F1=5739.41
##FIRST=	25168.397401625570637,	5807.04592319999756,	0.20435844361782073975
##DATA TABLE=	(F2++(Y..Y)), PROFILE
5807C6L0K2o5J15p6L2r1J69Q1j36m5J91kr4rO3L9j45j7k8K8m4K16L7l0k04J40o2J22Nk17O4
5431A25l3rJ08j14J74j1j21p0N0P0k3p6M7P5Nr7K3J35j25l2jm2J60J69j2k29kQ8j31L6n4j
5056H2m0N5L3LO9M8q4o3K3O0o3J22j59R5J7P7j48m1rK2O7P1j57J0K14R4k97J13J1j77J17q
4680A57n6m3P0p6pR1O2o0J12q0M7J2k5k0q6M6m7J43j34l7J91M5k58J35j2p7m1M8Nk7K3%l8
4293F3j7l0M7P9J29L2j63j6m9J39k03M2mJ84K5o3O9L2j33p8k6%J29M1j77O4L7r9J9Q1On6o5
3906C9J04m6J24J97j94j57J57Q3j37j03L5M9nr0O1L7J09p8j38k1R1p0M3J03j05K12j19j33
3577D8O7PR8p9O0J50l5j43K20k00j28LR4n4j2Q9J2n9m6l7R1N3o5N3j38O7M5p3N4j0K4O3R8
3190C17k02r8O9m0J1J15Mo1N4j03K73k07j16N0NM5l6l9L4R3J1m7p8N2o4J96r5r9N7k3J8L4
$$ plain form
5807 36 66 88 23 138 62 94 3 172 253 117 72 263 261 167 158 221 260 115 98 70 98 54 270 307 277 73 213 151 273 278 61 125
5431 125 92 83 191 77 251 240 119 49 99 169 146 70 117 192 197 100 123 258 133 101 100 58 218 387 375 146 144 232 101 137 83 82
5056 82 42 97 130 133 202 250 166 103 126 186 123 245 86 181 198 275 127 86 77 99 166 237 80 90 304 398 101 214 225 48 165 157
4680 157 101 58 128 52 45 136 198 138 250 170 217 229 204 184 98 144 97 240 106 69 260 305 47 182 170 93 52 100 105 78 101 101 63
4293 63 46 16 63 142 271 303 140 124 75 214 11 53 49 233 258 195 264 296 163 85 59 59 188 229 52 116 153 54 73 154 160 104 39
3906 39 143 97 221 418 224 67 224 307 170 67 102 151 146 56 117 154 263 185 47 26 117 47 90 193 88 300 181 48
3577 48 115 122 220 141 201 351 316 173 393 193 65 68 162 108 96 185 197 138 92 55 146 199 134 187 49 116 161 88 142 132 156 219 317
3190 317 115 17 86 46 57 172 176 115 169 66 339 132 16 66 71 116 80 41 75 168 179 132 54 106 42 238 143 44 101 78 96 130
2814A30r8O0rk4J53K1l1O7j48m1L1J01k8j08KJ52n3j24J13J50k11O1k5K2j7k4R0p4q6L2j4
2450G0J1K6j1j6M2j8l3N4K2J9M6k7q6J8J46j33j08M6l1k7J10q6J04L8J50j80Q1j49m4J5O0
2086A09mL2n7R0k3Pn1o9N5K3J2n8J30r7K6P8P1j84K1m6M4Jj7N4L3p5o6J71m4n7%L7R1Q7j01
1675B23n1o0l5Rl9QO3p4J4O2J32o6rj1j31O8R3j45jO8m9J02K7j32K7j2J19J33k74J43o5p3
1300F4J08k1k4j04J30k9J36m5J3o8KJ29j19j39N9J02n4jM0%m6%o5K7j2O8j14J12J12P1j82
936A50j06K8N2n9MJ04Mq8O4j28J46J5j63J37O9j61M3L3m9O8m3l6K0k5k5J04k0j4k9R8P1o8
560A96p3L0J5L0p4nr8N4M6kP7j32J09j32Q1J43j25q9O3N6j09L6J13j15j0N0k0N7N6M9o9j36
185G2K1P4j01O9q2m5J31M3OJ41o0j41r8N3L7L2m3n8M0J2M6OPK2j31R6k2L6r6J24L5j53
$$ plain form
2814 130 32 92 83 59 212 233 202 269 121 80 111 212 184 76 78 230 177 53 166 316 105 166 141 163 146 122 212 138 52 84 70
2450 70 81 107 96 80 122 104 71 125 147 166 212 185 99 117 263 130 22 68 37 10 120 34 138 176 326 146 227 78 34 49 109
2086 109 105 137 80 170 147 154 103 34 89 112 124 66 196 99 125 203 274 90 111 65 109 110 93 147 180 105 39 210 166 109 109 146 237 324 223
1675 223 172 112 77 86 47 55 118 44 58 120 252 186 177 166 35 103 196 51 50 118 69 171 198 66 93 81 200 333 59 202 137 64
1300 64 172 151 127 23 153 124 260 215 228 160 162 291 172 33 92 194 140 139 179 179 133 133 68 95 83 151 37 149 261 332 150
936 150 44 72 124 65 69 173 177 89 153 25 171 186 23 160 229 68 111 144 95 163 120 84 104 79 54 158 138 124 95 193 264 196
560 196 123 153 168 198 124 119 21 75 121 119 196 64 173 41 122 265 140 51 114 170 61 97 210 95 85 135 115 172 228 277 208 72
185 72 93 167 66 135 53 8 139 182 188 329 269 128 30 83 120 152 109 51 91 103 149 155 162 184 53 149 127 163 67 191 226 73
-191G3
##PAGE=	F1=5637.15
##FIRST=	25168.397401625570637,	5807.04592319999756,	0.26981779932975769043
##DATA TABLE=	(F2++(Y..Y)), PROFILE
5807E6QM8r3J25l9J0m8M8J02j07m8J82L1j11m3Q9Q0j77n8K9l0L2J99P3n8k32R4m6J67mj88
5443I1K7l6rJ24j06J03J5j25n8O8L6l7l7O7P5j0j14P6Q2j33Ok1o1J55J81lk64Q0L3q9L8q9
5068F5Pk4L6P7n3P3P2j16m3L2N2l4N2q6P4K2P3j40lr8L2J33Q2k06KK28J26k58J5N3j99R8k6
4680A18Opnq0L3P5K7p2J18m7O5Pl8Lj19L8%R0j11n4K41L1k52J35m7o7l7O7j6n6M7J6rp7j6
4269GJ3O4J85N6j35l4r4J37j68M9m9J88Jm4J4P2q8q0o9M9P9P3j60O1L9j10M4N6K4j09%Q5j10
3882D6J22K15k01j23J74R1j31j35N5M2rp5J8N1P9p4j26L4N9l6k7J65j02J80j41q8P4%P6o2
3530A51j1J39J2j18K42k38r9N0N0p3k7Q0L6m9q3m9J27L5l5L4j28P0J8l4Q6o9L6J9J25j13j13
3166G1M8r6Q6P1np2Q0j23K87j99r3L9NL4k8q2N4N6K5k1n3R8j34K05j42q3R6j9m9R9r7P4l4
$$ plain form
5807 56 64 112 19 144 105 115 67 115 217 110 62 244 275 164 121 210 290 113 55 84 54 86 285 358 300 68 162 116 283 279 91
5443 91 118 82 73 197 91 194 209 84 26 94 130 93 56 123 198 188 74 150 232 99 105 84 23 178 359 356 92 172 205 116 154 65
5068 65 72 48 84 161 108 181 253 137 94 126 178 144 196 110 184 206 279 139 136 38 70 203 285 79 81 309 435 177 192 245 46 144 118
4680 118 124 117 112 32 65 140 167 95 213 166 231 238 200 203 84 122 122 212 101 47 288 319 67 202 155 88 51 118 102 46 93 109 100 23 7
4269 7 20 84 269 325 190 156 62 199 31 80 31 219 220 176 190 262 174 94 25 74 153 226 66 127 166 56 100 156 180 71 71 156 46
3882 46 168 383 182 59 233 324 193 58 113 155 146 71 89 140 219 145 19 53 112 76 49 214 112 292 151 63 137 137 213 151
3530 151 140 279 291 173 415 177 78 128 178 105 78 158 194 145 62 13 140 175 140 174 46 116 134 100 186 117 153 172 297 184 71
3166 71 119 23 109 180 175 103 183 60 347 148 55 94 99 133 105 23 77 133 158 137 84 182 48 253 111 28 124 105 56 155 58 132 98
2779I8j3J60K6p4Q1j65kKJ15M1j61j2J19m9p1O1Q1j62M2%J1Jl1N3l5m6J9p6M2L5N8r5M1j2
2380H2m3R6oK0J17n7j43M3J74j17j19N1j7l3L6l0J17l2J23j79R8j14k9M8O4m9J6pO6l3Lp6
2004G0J9k1K3M7r5J65r4QP4O8j82N8o2j3K7LP9K9j12j1J60l4q8L1k7N1J29q7n1q4L4k1o5L1
1605E9M6j02N2J04O6p7N7jj83J29J46k22m6P6rOK8n6L7j3J01J51k74J27p0m2P7k3l3r2J63
1241A82m1J40r3No0qJ39j02j12L3J60p1o3J26p0n0K5p8K5L0L7r5P9J44P0j92q6n0O6l4J1R7
866A64M5j84J24j46J59%j33J86M2j21pO9n0M3o3j2L1r2j1O2j8J2j8J38L9n9q9K3J8L3q5P2
490A72j07L0L7JQ2j52O2o0N5P5o9o3P6Q9j43P2Q4j13qn4M2O2L1Q7o3j47J2P0r9O5l0pM1J06
91B36l8J06n3r5j03P9j3N8k9r5N5k5P4j4K5J3j22R2ll0n9R0J13j75
$$ plain form
2779 98 85 245 271 197 278 113 111 113 228 269 108 96 215 166 95 156 237 75 117 117 128 129 98 151 116 70 89 13 55 90 148 53 94 82
2380 82 39 135 129 149 266 209 66 109 283 166 47 98 81 48 84 54 171 139 262 83 181 67 38 86 150 101 117 110 176 143 146 70
2004 70 89 68 91 138 43 208 114 122 196 264 82 140 78 65 92 95 174 203 91 80 240 206 118 149 122 173 302 215 164 80 114 93 28 59
1605 59 105 3 55 159 225 148 205 204 21 150 296 74 28 104 95 101 129 73 110 97 198 349 75 202 132 90 167 144 111 19 182
1241 182 141 281 188 193 133 125 264 162 50 83 243 172 109 235 165 115 140 62 87 117 154 59 138 282 352 160 74 24 90 56 67 164
866 164 209 25 149 3 162 162 29 215 257 136 129 198 148 191 128 116 147 55 44 106 88 100 82 220 259 200 111 134 152 185 100 172
490 172 65 95 132 133 215 63 125 65 120 195 126 63 139 228 85 157 241 128 120 66 108 170 201 288 225 78 90 160 61 126 96 89 130 236
91 236 198 304 251 156 53 132 119 177 148 53 108 83 157 143 168 181 59 151 148 118 59 149 262 87
-191H7
##PAGE=	F1=5534.89
##FIRST=	25168.397401625570637,	5807.04592319999756,	0.26748135685920715332
##DATA TABLE=	(F2++(Y..Y)), PROFILE
5807H4k9O7j03J25k3K0k0n9J17r9k1J54O3j30o6J03J16j83j00P9p4J01J71J05q0k54M1j9J70
5467B56oj31%J7p3J33r8J5N5j14J4PL7l3l0Q5P8l5q7O8J7j06N4m0n2J19J69Mk65J25j7n0M2
5079A58r8K8m2K4J13j03O1Q0j46J8L8J8J0j7j6N4K2N8j14J9j45K9J72Q1k18k2K30J46j96r1
4727A51R9k02P5m5Q4K5q3p9N6O6mr5R4MQ2Mn8K4j30L3M2N1j00m6K33K2k15J31o8k2q2R1m7
4340I1o7N2L5K0q9j1mJ0K26P1r7n0j26J19j19M1l7J23j8np2J19m0n8o7L6N3J03j58M4N8j20
3964F3O5K9M7j69J18K8j75Q9K04j96m0J65Q4j28j56R9K1qo5pO5L5o7q8O3J3K8j02K19j12J61
3600B83j60l7M9J0M4l4p8J28M5q4K36k37o7Q7J4q9n6N9N6l2l7p1J12Pj7J2r6R0k4oJ10p5K7
3213A69m2J28k5j01K2j39J43J9j1o6Q0j14K88j73p8J6QJ3l3p7M0L4L4j3j8J02j78K57k16l7
$$ plain form
5807 84 55 122 19 144 121 141 121 62 179 80 59 213 276 146 80 183 299 116 16 95 21 122 293 398 318 64 105 86 256
5467 256 250 119 119 136 63 196 98 113 168 54 68 75 112 79 49 134 212 177 90 158 175 69 123 83 31 150 319 323 58 183 166 116 158
5079 158 60 88 46 70 183 80 141 221 75 93 131 149 159 142 126 180 202 260 146 165 20 49 221 302 84 62 292 438 242 151
4727 151 250 48 123 78 162 187 104 25 81 147 143 48 142 146 228 232 174 198 68 101 143 194 94 48 281 303 88 219 151 129 47 138 91
4340 91 24 76 111 131 42 31 27 37 263 334 237 187 61 180 61 102 65 188 170 165 93 212 172 114 47 83 136 239 81 125 183 63
3964 63 128 157 204 35 153 181 6 95 299 103 63 228 312 184 28 127 148 140 75 68 133 168 101 13 76 89 117 15 234 122 283
3600 283 123 86 135 145 189 155 77 205 250 166 402 165 98 185 199 110 54 113 169 137 100 29 141 148 131 143 47 137 113 107 217 142 169
3213 169 127 255 230 129 151 12 155 174 163 97 177 63 351 178 100 116 124 137 104 27 67 101 135 122 104 206 28 285 69 32
2861C2J11j4p3J16p7P0o1LJ48J9j02R0j60L0k9J08J15j99LO9o3j8M3%j17K4O3j3ol2J0oj2
2474G2J1k1J2NR3j42Q5l1o9J55o7K3J72p4j73N2J88r8p4L0j3k8j4M6N2j06Q6j32R8o9j2P2
2098A29O6o4n2L7N4m2J0q1J20j29M2O0j28J82p3l3O8P7j83J14r4k0K9MQ8K9j40N0J36k8j19
1734A09O3m8k2J70q4k0j11J06k7r0K0J3j4OR0Nn6J04J1j88J41J24k22n3P1J1n3jRQ2l3R0J29
1347C32k56J06m5KJ7k5n7k9J49m1J24j30Qm8oJ23j04o7L4K07j00j16J94j19l3L3q4K1O1oo1
983H4K5J74O8j71p1q5J1LL3P5P1j67J10j49J44k1j05K26J2p8n1R5n0K8o3pM4j51RJ8KJ3j9
596E7J77Pl6j10K6K2K0q5J52j11rK0L5P7j63mL6K0j2J7o6J04J04j65R2O9j23Jj28P3N9LJ16
208B75l7j51k2O3p7P5jL1l6J42o2N8m1l1r7Q2m8P7%j34N6n7R3l2L2jq1P7Or7lO3J67j87
$$ plain form
2861 32 143 129 56 172 95 165 104 107 255 274 172 262 102 132 103 211 326 127 130 199 136 118 161 161 44 68 131 118 112 80 90 84 72
2474 72 83 62 74 79 172 30 115 84 15 170 103 126 298 224 51 103 291 193 119 149 136 108 94 140 192 86 172 40 138 69 57 129
2098 129 195 131 79 116 170 128 138 57 177 48 90 150 22 204 131 98 166 243 60 174 80 60 89 93 181 210 70 120 256 228 109
1734 109 172 124 102 272 188 168 57 163 136 46 66 79 65 71 161 166 110 214 225 37 178 302 80 27 98 109 56 55 64 146 113 203 332
1347 332 76 182 137 139 156 131 74 45 194 153 277 147 155 107 101 224 120 53 87 294 194 78 272 153 120 153 69 90 151 145 84
983 84 109 283 351 180 109 24 35 38 71 146 217 50 160 11 155 134 29 255 267 189 138 233 183 211 148 141 185 34 43 61 63 76 57
596 57 234 241 205 95 121 143 163 78 230 119 110 130 165 242 79 75 111 131 119 136 70 174 278 113 205 274 151 152 24 97 156 159 275
208 275 238 87 65 128 51 126 125 156 120 262 200 258 217 186 89 171 123 200 200 66 122 65 158 126 158 157 76 153 159 62 59 122 289 102
-191A02
##PAGE=	F1=5432.63
##FIRST=	25168.397401625570637,	5807.04592319999756,	0.2749068140983581543
##DATA TABLE=	(F2++(Y..Y)), PROFILE
5807A03m7N8q2J03l0M5Jp8J08j20jJ13Q9j32o2P4J45j60r1N6n1R6J43J29q3k63LKJ26kn1k5
5431A16Q6j28J14r2p0J02p6N4m6P5j3o8J00P6o4n3L4n1MM5n1m7R4J35Qk23J07m3j9L8p3L0
5056A01p4K7J32j32K8P1j47R4L3j5M1n8K8L9K3L3q1K3j42J2J75Q2k30l2K20J53j16j92J48
4715B44j97N7o1J47O2j51p2O6N3j9j17M7N8R8np1L9j22L1N5K9r2k1J91J6j69J37p1J2j36J20
4352A58p8m6K8M9L8p3j2LMJ85P1n6n8j50R6o9K6j1L9k6N0j52J42rqq6K8M4J30j73M2P7j39
3964F4Q2J7O3k14K20k0j64K8J03j71Q0J20O8j36r1J01j8j9m7j2P4rn8qL8k9R3j33K22j29J60
3600B75j73J7nL3Mlj28J34M5l5J85j91l8J04j6p0j03K6P8k4K6q0R4j9k9Jn3J18p8J5J22m0
3225A92Qq0Q0M6p3Rj40J45l8On2N3q1K78j38p7j0J3j1n0m0PK0L0NJ3R0r1K28l09K1J04k0k6
$$ plain form
5807 103 56 114 32 135 105 150 151 73 181 61 60 173 262 130 68 142 287 127 36 92 41 137 280 409 326 63 66 68 194 192 141 116
5431 116 202 74 188 96 26 128 52 106 60 135 122 54 154 230 166 113 147 96 100 145 94 47 141 276 284 61 168 125 106 144 71 101
5056 101 27 54 186 54 82 153 6 100 133 118 159 101 129 168 191 224 143 166 24 36 211 293 63 31 251 404 288 96 244
4715 244 47 104 43 190 252 101 29 95 148 129 12 59 117 215 210 139 178 56 87 142 171 79 58 249 265 96 233 162 174 38 158
4352 158 80 34 62 111 149 76 64 67 71 256 327 271 213 63 159 90 116 105 144 118 168 16 158 149 141 55 83 127 257 84 126 203 64
3964 64 146 163 226 12 232 212 48 76 179 8 88 208 276 140 49 150 132 113 66 54 128 119 61 53 91 62 155 22 244 115 275
3600 275 102 119 114 147 151 148 20 154 199 164 349 158 120 224 208 138 35 61 139 115 141 61 155 136 107 108 55 173 95 110 232 192
3225 192 200 120 200 246 173 182 42 187 149 155 103 156 75 353 215 138 128 141 130 80 40 47 67 97 102 115 205 114 342 33 54 158 138 112
2826A12Q2o4N6q9K3J20Mj11R8j44N7m6P7J72k23M3J9r8K4O3n5r8LJ32l4k3k8j2pOK3M5m3L
2427H7Q2j27J29o3l1J10j14M1J92p8j73M2J83p7rJ2l7qj9P2j1j73M6l8P8l7J5Q7N4n7j51P0
2051I7N0m2K5n7J77j86L6N9p3J06m3q5N7R5j67J60j37L1okQ3K4j55J03J08l0j42Q4m2p4J94
1687B48r8L2j44J70j2j15pk5Q5m1L6m0j2J23K1j70K28nj99k3M5K1k9p8L6J35n5Q5P8k17O8
1323A41MM9n3l7p3M5J06k2Q5j34J8m1QQ3j12j1L2K43j26j56K32j44j0M1q7J6P8m8j5m1J91
959B62O7j17o2r7j2%M1L5Q1p7O0j70J38m9p6K44pm9p7J07n0L0m5m1O4j72J4j2M2k1l1K12k1
572B11lj28L6K5jp2K09j15n5QP8O1j38p4J14j3q4R8r3J48J07j73R2P4j54K9q3k2M8k1J35K
197B46j40q2N6k6Q2JN4q4J48n8Nl3L1q5Q3o6Q6M0j75M5p5R7m0K2j5j9O2Lj31L4M7J78j82
$$ plain form
2826 112 194 130 186 97 120 240 244 133 231 87 144 98 175 347 124 167 186 88 112 175 120 22 25 157 123 100 72 60 53 59 82 127 84 87
2427 87 169 42 171 108 77 187 73 114 306 228 55 97 280 203 194 206 169 161 142 214 203 30 76 38 116 79 94 181 235 178 27 97
2051 97 147 105 130 73 250 64 100 159 86 192 149 64 121 216 49 209 72 103 97 95 178 202 47 150 258 228 86 170 128 54 248
1687 248 150 182 38 208 196 81 74 49 134 93 129 89 77 200 221 51 279 274 75 52 97 118 89 11 47 182 127 212 290 73 141
1323 141 145 194 141 104 31 76 182 160 245 111 129 88 96 179 67 56 88 331 205 49 281 137 127 168 81 97 175 127 112 71 262
959 262 329 212 150 53 41 41 82 117 198 121 181 11 149 100 24 268 261 212 135 242 192 222 177 136 200 28 42 30 72 51 20 232 211
572 211 208 80 116 141 140 68 277 162 107 115 193 254 116 42 156 143 59 157 64 212 319 146 238 312 158 187 104 82 130 109 244 246
197 246 106 24 80 54 136 137 191 107 255 197 202 169 200 115 198 132 218 258 83 128 53 150 110 132 117 98 160 163 32 66 113 291 109
-191A09
##PAGE=	F1=5330.37
##FIRST=	25168.397401625570637,	5807.04592319999756,	0.37149900197982788086
##DATA TABLE=	(F2++(Y..Y)), PROFILE
5807A06l2J4l7O6n3P4J4k6J00j29l3O3J07r8k8j7J65j09q5J0qO0J18J42o6k58J3lM0NL7n1
5431A01J57j49O9q8k6L2j6M2n2J05pr5J10O4q6m0Lj01J36Jn0m8Q0R4Rj61M5l6%K0k3K2q0M
5032C6J32j35mL2K5K1Rk2M9n5K9L0K9%m4Rj04pJ41J03k23l3J70J52k8k73J95j91N1n8J68R3
4657B97j96o5O7L7j2j12jP8J09k8n8M7j11M0K9J8p8J7J27J6j31J47n9K6j69J43j03j8RM6M0
4293A52m5pJK9J20N7j9n6j74Q0k5RJ6l8k7J01o3%pO4j29L5M6J52j84N3P8j69J01K4O6j90K46
3906B97n7j65P9r9M9J6O1M7j49L5O3o4l3j9nN9l1m6N7%l2J20j30J82j38J67j76O3p1O0k9J9
3530A30j05J17LK4R6j07k0J01m4j9j15j5Q2k5O0q4J01m1o6L1m7J61j22J0J28Mlr6PR0m0J6
3154B12j35J20q8O2n4Rk7K54j06q4k9J6k7q2NpmMN9L0Q2k1K09l60M0R2l2M7M0p3M1j14M4Q0
$$ plain form
5807 106 74 88 51 117 64 138 152 126 226 97 64 127 234 136 108 91 256 147 62 72 64 124 242 384 318 60 73 70 110 115 152 101
5431 101 258 109 178 90 64 96 80 122 70 175 168 73 183 247 161 121 124 23 159 160 110 62 142 236 245 84 129 93 93 113 90 112 32 36
5032 36 168 33 29 61 86 107 116 94 143 88 117 147 176 176 132 141 37 30 171 274 51 18 188 340 312 39 234 43 94 36 204 297
4657 297 101 36 103 140 128 16 15 93 202 174 116 163 52 92 121 139 61 78 205 221 90 237 178 204 35 178 75 57 66 112 152
4293 152 107 100 101 130 250 307 288 232 58 138 113 122 138 100 73 174 111 111 104 168 39 74 120 272 88 141 219 50 151 175 241 51 297
3906 297 240 75 154 55 104 120 181 228 79 114 177 113 80 61 56 115 84 38 95 95 63 183 53 235 97 264 88 151 80 140 111 130
3530 130 25 142 145 169 265 158 138 239 195 176 61 46 128 103 163 79 180 139 73 104 57 218 96 106 234 238 235 139 146 236 196 212
3154 212 77 197 109 171 117 126 99 353 247 163 134 150 123 41 46 39 35 39 98 128 210 189 398 38 78 170 138 185 225 152 193 79 123 203
2755B03j4q5J01j39Q2k8J3J98k29R5k2j47M9J09m4j10k2J65n0k7k3ml4PM4Q3r0K0M1p1J55
2391B26j03J4L8j33P9J74p5j50K3J56n5O5%q7K6qQ0o2j56L3m1P1k2L9R7L1l7j82J8N0k7M4
2016A26m0K05j81j4P0j8L1j3j14J7J23j04J54j79Q3m0KO5Pj61J44Q3m0j43Q3l1m3J60j23R1
1664B00j67J98J6j28m0n6J81p0l8m3KJ14K3j39L13j03j90MK1M1j4o2qJ42o5Q1J9j53J7M5J00
1300B41j17o0qM0N0K0L0r4K3m9J3M3o5R%K65j37j78K37j47RN1q9J6P9p2L8p6J53O9m8n0j28
912F8M2l2J5j2P6J9K3j65J10p4l3K14rm1p6J02n2N2j9j13Q9j44MnM4n2%J84m5L5j32N3J6j5
513A27o6K38j15j01J4J09L7p4j19J37m2j04J29j12J79J11j63O9R5k02P5o0j03L7l5J45M0j14
185A32j10N5mP8j8O1j04J26k6m2k9O6o3R7p0Q1P9k10K7q0Q9l7jk3M4N4kr2j0M1J53j53
$$ plain form
2755 203 189 104 205 66 148 120 133 331 102 197 175 28 77 186 142 32 10 175 125 98 75 71 37 44 88 171 81 101 142 71 226
2391 226 123 137 175 42 121 295 220 70 93 249 194 259 259 172 198 190 270 208 52 85 44 115 93 132 229 260 223 41 59 109 82 126
2016 126 86 291 110 96 166 148 179 166 52 69 192 88 242 63 146 106 108 173 180 19 163 246 206 63 146 115 72 232 109 200
1664 200 33 231 247 119 79 23 204 134 96 53 55 169 192 53 366 263 73 77 98 139 125 63 55 197 132 213 232 79 96 141 241
1300 241 124 64 56 96 146 166 196 102 125 76 89 132 67 76 76 341 204 26 263 116 125 176 87 103 182 110 148 72 225 294 246 196 68
912 68 110 78 93 81 157 176 199 34 144 70 37 251 242 201 125 227 175 227 208 95 184 40 44 39 83 31 31 215 170 205 73 126 142 127
513 127 61 299 184 83 97 206 243 169 50 187 145 41 170 58 237 348 185 254 349 147 222 162 59 96 61 206 246 132
185 132 22 77 73 151 133 194 90 216 190 148 119 185 122 219 149 230 309 99 126 46 135 98 97 74 118 172 170 78 68 109 262 109
-191A09
##PAGE=	F1=5228.12
##FIRST=	25168.397401625570637,	5807.04592319999756,	0.45840415358543395996
##DATA TABLE=	(F2++(Y..Y)), PROFILE
5807I5Ln1K2K9p2R2QM5R8j23p6J1J16m1Pj22J74m8q8l8L1J2J01J44l9k46N4j4n4J4J00p2K22
5420B94j46K0q1M2n9L8Pj5J08j1q9J06M8r9n1mm2J45n2l8l8N8O0J4r6k5j4jj0M3K1o5l4R8
5021A32j09O3j0P6m9l1PL5k3JK5M7m0lk4m7k1Q1J51j35p2O5J41N3k66J76j81N0k2J46J00k10
4645A06o0N2L7Nj22M3K1J12o3j9N2j10O9j7Mm5L8O1K1j02J45m1L3j68J44j12mpM0K9j6QpN4
4246A81O7K9J1m9j98P2J0JL7q9k9J27J6j10l2J46j49J6N4J64j65N7N5j83J03M8N4j51K48q2
3894B59j74J44j34J01n1J9J3j11J06K9j03J3k8j3K0j4m1R8m5JJ11j14J24j31J63j57Q8j30
3565D3Q2l9J3m1R7n4P5lrj9Q8o7L9j06j5O0j7M0p6J20o8j02R5q7K08j36k4J34L4Jj22k9R3
3178B08j3M1j22O9j13J45p2m4L8K13q6r0l1Qk2j17L2J7j9lQ9K2Q8m0K30l66L7Q1m4J22kr7
$$ plain form
5807 95 98 47 69 98 26 118 126 171 269 146 70 81 197 156 163 41 215 167 79 41 72 84 185 329 290 44 98 84 30 44 144 72 294
5420 294 148 168 87 129 70 108 115 100 208 197 108 214 262 163 112 108 66 211 159 121 83 141 201 215 119 94 80 79 69 112 133 68 34 132
5021 132 23 86 76 152 103 72 79 114 91 92 117 164 124 121 97 50 29 110 261 126 54 119 260 313 47 223 42 92 70 216 316 106
4645 106 46 98 135 140 18 61 82 194 131 112 164 54 123 106 110 65 103 164 185 83 228 187 220 52 196 84 80 73 113 142 126 134 127 181
4246 181 248 277 288 239 41 113 123 124 161 72 43 170 186 76 44 190 41 57 111 275 110 167 222 39 142 190 244 93 341 259
3894 259 85 229 95 196 145 164 177 66 172 201 98 111 83 70 90 76 35 133 88 89 200 86 210 79 242 85 173 43
3565 43 125 86 99 58 155 101 176 173 164 145 233 166 205 99 84 144 127 167 91 211 143 41 136 49 257 121 97 231 265 266 144 115 208
3178 208 195 236 114 183 70 215 143 99 137 350 264 174 143 151 129 12 44 61 42 39 128 150 238 198 428 62 99 180 136 258 256 159
2802A59L0j36O8L0k7KP7j56R9J5o3J88k17J45n6j16k3J69Nj45j9J48o2j4k3Jk8pM5R4j09L1
2427A05qkJ73j51O6m0j28J28J29p1j18QJ13k9J28kj51O5LQ6r5j05P1j16O6k1N1R8Rpj56q1
2051A8N3pO5m7K08j35q1R6J8j9Qr8o0J59m2J30j91J00o8K5L1j9j21J37O3n2j08M2k5K2J11
1687B13j35J42j36J40N2j19p0n4K37p2p6j2o6Q2J8j08L39j18j75QL0N6m5l2JQ2o2P9l5p0j3
1323H1L7J52j50r0Q5j6j1Q6j7k7J0o5j7K3L5pn8K64j21j85K12j30L1M7q7K2P1o9Q4o5N6P5
948B56J3l1j69R9m6k0n8O1J01Lj41P1n6j0J37On3m6P8n4Q7Rk12J12q8J1J8Kl3L5J04o7P0j18
549G1P3Jj4q8K45j05j39M9J08NJ9j46J20o4p0J01q7J63J18j34K5J22k59J37o9j59N0m3J42
208A72O3p9q8Q0n2P4n6O1r6P5K6p5k0N5k9J27o1N8J04k32J1p6P7k4l5%P3M7Ln5o7L6J13r9
$$ plain form
2802 159 189 53 121 151 124 126 203 47 146 161 98 286 69 214 158 42 19 188 193 48 29 177 115 101 78 79 51 44 89 183 74 105
2427 105 97 95 268 117 183 143 15 143 272 201 83 91 204 175 303 301 150 215 218 304 209 104 175 59 125 104 155 253 262 255 99 18
2051 18 71 64 129 82 290 155 74 170 188 169 177 79 19 178 136 266 75 175 107 132 163 144 23 160 223 171 63 105 80 102 213
1687 213 78 220 84 224 276 157 87 33 270 198 122 110 44 126 144 36 375 257 82 90 120 176 131 99 100 182 120 199 164 94 81
1323 81 118 270 120 30 115 99 88 174 157 130 140 75 58 81 116 109 51 315 194 9 221 91 122 169 82 104 175 106 190 125 181 256
948 256 269 238 69 168 122 102 44 105 206 209 68 139 83 73 210 216 163 117 195 141 228 237 25 137 49 60 78 80 47 82 186 119 189 71
549 71 144 145 131 43 288 183 44 93 201 206 225 79 199 135 65 166 79 242 360 226 251 373 114 251 182 23 73 30 172
208 172 235 156 68 148 96 170 114 175 79 154 180 105 85 140 111 238 177 235 339 107 118 42 119 95 60 60 133 180 183 128 61 97 210 111
-191A11
##PAGE=	F1=5125.86
##FIRST=	25168.397401625570637,	5807.04592319999756,	0.3743070065975189209
##DATA TABLE=	(F2++(Y..Y)), PROFILE
5807H5L2j08P1Mk9M5j7J13Q5j06j00l4J18J0L9j52J17Qr0p3N2l2R1J31k0k27J01k0k9lN5p3
5431D4K58j26j9o3O9j18P9l6M4R9k5m9Q7L7j06q6K1JJ32j02k0j7K7L4K6k5n6j8j9l8R9K4n8
5044A00l2K7o2J29K3Nj11n7M9ROj7QQ0q0M3p3Rk0J0K12l7j37JJ01J10k02J17j66M7J4J33P2
4657C11k03n5K6P1Pj46O2J7R9j01K0O4j17J18l7k0j5J9OL1n9J08k4M2j48J33j06%l8M6K0k
4281A29K5j0P3L3jK8m4k15O5L1J6M1j00mR1P1j75j8J68j13n5O2J64j09M0K3j51N9Q0L0j05
3917A29K30r5j87J94r6Q4j03J5m4pQ6Pj22J00p2m0k5K8m5J24q9L6R9q8N5j02J33j13Q7j67
3565A2R5k1k4K0Q8q4R3o2N1k8P2q1Q0r1j0N5Orn2J31j01j09J40j21K29j32o1J52L1J5j61j6
3190A07O6mQ0r9lp0J91q3j05J04J60p9q6k5nmj01pM9j8M7P2pJ09j44K81l48L8P3n0J81m5j23
$$ plain form
5807 85 117 9 80 84 55 100 83 196 281 175 75 41 159 169 208 56 173 181 91 18 70 38 129 260 240 13 114 94 65 62 117 44
5431 44 302 176 157 94 163 45 124 88 132 231 206 157 244 281 175 89 110 111 243 141 121 104 131 165 191 166 110 92 73 35 134 158 100
5044 100 68 95 33 162 185 190 79 22 71 80 86 69 77 157 77 120 47 56 36 46 258 221 84 85 186 296 94 211 45 92 106 239 311
4657 311 108 53 79 150 157 11 73 90 189 88 108 172 55 173 136 116 101 120 126 157 98 206 182 224 76 209 103 103 65 111 131 129
4281 129 154 144 217 250 249 277 233 18 83 114 130 171 71 67 158 229 54 36 204 91 36 98 262 153 193 216 65 124 204 234 129
3917 129 359 264 77 271 175 259 156 171 127 120 206 213 91 191 119 79 54 82 37 161 72 108 207 119 174 72 205 92 179 12
3565 12 107 86 62 82 170 86 179 117 168 140 212 131 211 120 110 165 171 162 110 241 140 31 171 50 279 147 86 238 269 284 123 107
3190 107 173 169 249 150 147 77 268 185 80 184 344 265 179 154 149 145 44 37 86 68 115 187 180 289 145 426 78 116 189 139 320 275 152
2802A52K8j46Q6j5k2R7L5j53P9N6j26J50j85J80q2l1n3J27N4j76k2J31o7Jk2oJ6k7J3Q8r3
2438F7K1m9O8J84j86J02q8j15J70P5p6r3J0O9LJ56Rk16R7J5Q8j03o5J06j56M4k7L7R0lL0j21
2063A43q7K2k3Q1o3J77p1j38J27L0l5J5p0q2J45rJ07j64P8q5O3j8m0k6O9M7n2n8k9k1Q0O2
1687A75j07J72q4K7R0q0q3m3K61n7q3k6j25M6Oq2L09p4j44rQ3M4j08J1L2Ko7Q3p2Pjk4K00
1300B79j39p0R7q2m7J43j3Npp2p8J1J29rj28K38q0j58J47r4O2Rp5L3N6k9J03n1l4Q0M7pk03
912F3J38m6m9q3L2J51Lj10M3kk5M4K9p4MM3n8J26L0j99J5k9L5M1n0J5M3J7q9R6r0R2rMj35
502A6K31q4j48R2P6l2J19j60Q1o3k0L6k2J06J26r0l6J44l08K00j00j32M9m3J03P1m0o4J19
161B27j14P8j05O1o0kQ3q5nJJ7J58m0J6J07k37Rp1P4mp9N3O8L0J1k4j24K9Q4l3
$$ plain form
2802 152 180 34 120 105 83 180 215 62 141 197 71 221 36 216 134 103 50 177 231 55 33 164 97 98 76 70 86 59 72 160 67
2438 67 88 39 107 291 105 207 119 4 174 249 173 80 90 159 162 318 327 111 208 223 311 208 143 249 93 137 110 147 237 234 264 143
2063 143 56 78 55 136 73 250 179 41 168 198 163 178 108 26 171 162 269 105 183 98 161 143 103 77 146 193 141 83 54 33 113 175
1687 175 68 240 156 183 273 193 110 67 328 271 188 162 37 83 89 7 316 242 98 89 172 216 108 119 151 153 86 169 97 104 103 79 279
1300 279 140 70 167 85 38 181 168 173 166 94 16 27 156 147 19 257 177 19 166 72 134 143 68 101 157 128 231 180 146 226 273 266 63
912 63 201 155 106 23 55 206 209 99 142 140 115 159 188 114 118 161 103 229 259 60 75 46 81 122 72 87 130 147 58 154 64 156 147 151 16
502 16 247 163 15 107 183 151 270 110 191 128 108 144 122 228 354 264 228 372 64 264 164 32 81 38 141 212 172 108 227
161 227 113 191 86 147 87 85 168 83 78 79 96 254 214 230 337 100 109 38 112 108 29 82 150 180 191 167 43 72 156 123
-191A23
##PAGE=	F1=5023.6
##FIRST=	25168.397401625570637,	5807.04592319999756,	0.14110390841960906982
##DATA TABLE=	(F2++(Y..Y)), PROFILE
5807I2L5p9L6jjNn1J62N6p3j04o6J16L7O7j24K7N0p9p3L6mK4J03j9j35P7k5K6jl8k0K24r6
5408A84m5m1O1j36J01p5J07Q6m6J9N2M1j09j41O5KJ28j32j4J6j7K0M6M7n4n1l6k8J02K1n2
5044A21qk5k5J64N4q0j60N9rm1K0J2n0J25j04P2j11L9Kj0K07M5j99J9K3J26j41O6j47M0M7
4680A31J45K5k06m3qJ35j1j50L7O0O7j11K0Q0j07J65l6m3j0k1l6M7MM8j8N5j27J17p8rp1O3
4305A14K1k3M2%P9K1k3K9m7j92K6L9N8K4r0N0K8Q6k02O0J10o4j26N5J66l3Ljj05oJ10Mn9J94
3906C48r3j97K14o9Q1j29L7j15Q9L8Kj15J73j18p1o0P1m3J33j21N5R5o2lo6P9n0O4j39O6%
3542I4n9O8P7q0P4m0L2m4O4q5Q8p8kO2M3n9j5J21j36r4J57j12J97j15p7J76%K6j97J3L9j8
3166A20J23o3p2J8J85p7j62J52J05q0p0j5k0J8r3l4O8k5R3P7l8J31k74L34l12L9O8n5K17q4
$$ plain form
5807 92 127 48 84 83 82 87 36 198 254 181 77 11 127 164 231 107 134 184 105 32 68 64 88 191 172 37 114 89 115 114 76 56 280 184
5408 184 139 98 159 23 124 49 156 242 196 215 267 308 199 58 123 125 253 121 107 123 106 126 172 219 165 114 78 50 152 173 121
5044 121 113 88 63 227 281 201 41 100 91 50 70 82 32 157 53 125 14 53 55 45 252 297 98 117 140 266 125 191 44 84 131
4680 131 276 301 95 52 44 179 168 18 55 115 182 71 91 171 64 229 193 150 140 119 83 130 134 182 164 219 92 209 131 122 51 114
4305 114 135 112 154 154 233 254 231 260 213 21 47 86 144 168 78 128 156 242 40 100 210 146 20 75 241 208 211 210 105 99 209 213 154 348
3906 348 255 58 272 203 284 155 192 77 166 204 206 91 264 146 75 15 86 43 176 55 110 205 143 140 74 153 103 167 28 94 94
3542 94 35 103 180 100 174 134 166 122 186 101 189 111 109 171 214 155 140 261 125 31 188 76 273 158 81 257 257 283 86 99 138 120
3166 120 243 180 108 126 311 234 72 224 329 249 179 164 144 162 69 35 103 78 171 248 210 341 67 401 89 128 196 141 358 274
2814B74j37L2j26P6k1RJ17j0j14L1Q1j63J02j28J81r7M2l8M4Q7j93k0J09n7Lj5oO5m7m1P1
2450A11n4mj8P1J91j78Q7o7j22J95K1r2q2L1M7L4J32L1k65J11K7Q4r0l5J25j59J5l5j1P3M
2086A78O6q4m4Jo2R3n4R0j2j68J58K2k6J2m4o8J02qR3j12L8r3J07o7m2O5%K3k9l6r5M0O1R
1687A14k8J65k6j08J23j1q0n0K73l5r3n8j60K4Jj7K21k2j15m7J69Nj73N3O9m2j16R3o7L8K0
1323A20p9K32r3m6P3j46L5Q4L8nj9o8n9k3J30Rj47J39j7j09N5k6Q1n8m1L5L7L1R8m6q3Q0M2
936B54J8k08J43l7o6p4J9J33K4q7M2M1n5l0M5q2M7J8p5J57M1j25r2k2O7O3q2N2L8o9o9P4n1
549E2R8lL4j48J53n4q6Q0L3o9K03j53K8l7L4n5N8L9J31m5j08J57l17K29j24m0J3m9N2P0Km3
173A35J51j65R5j57O1pp9J20p0pj3L2J67j2l9Q6k23K7p1R3J5j31R3P0NQOj71K2Q5J8
$$ plain form
2814 274 137 169 43 119 98 107 224 214 100 131 212 49 151 23 204 107 149 111 155 242 49 29 138 81 84 69 63 128 81 40 111
2450 111 57 53 35 106 297 119 206 139 17 212 233 141 59 90 137 171 303 334 69 180 207 291 201 166 291 132 147 112 101 174 178
2086 178 244 160 116 117 55 148 94 184 172 4 162 184 158 170 126 58 160 152 245 133 171 78 185 118 76 141 141 164 135 99 4 44 105 114
1687 114 86 251 225 117 240 229 149 99 372 337 244 186 26 50 51 34 255 233 118 71 240 245 72 125 194 152 36 129 62 100 120
1323 120 41 273 180 134 207 61 96 180 218 213 194 126 67 44 174 183 36 175 158 49 104 78 159 101 60 95 132 163 261 215 132 212 254
936 254 272 64 207 170 104 30 49 182 206 119 161 202 147 117 162 80 127 145 70 227 268 143 51 29 96 159 77 129 167 98 29 103 52
549 52 150 147 181 33 186 132 46 126 159 90 293 140 168 131 165 110 168 207 338 293 185 342 25 254 130 90 103 54 106 176 178 135
173 135 286 121 216 59 120 113 34 154 84 77 64 96 263 251 212 298 75 102 31 124 139 8 101 171 176 184 190 19 41 126 144
-191A44
##PAGE=	F1=4921.34
##FIRST=	25168.397401625570637,	5807.04592319999756,	0.22288425266742706299
##DATA TABLE=	(F2++(Y..Y)), PROFILE
5807A07K0m3kJ2rj7l4J49J7l0r6m9Q4L2Q7p7n1P5n0p8K3M4m7P1l8oMl2P2J1q8L3J37o2n8k7
5384H4L5j03R1j00J58P9p5J03PO1j06k07J12k3J28j19l4N7r0K5P0J09m3q6m5j6R2Kl1J9l0
5021A24k1J70P4j56j47J51o0r3RP8j00J34r6N8r5J3L9QJ39J06k41O8l3R6r0K3j27L6P2J77
4669C16qk40l1l3K00m1j30j3J29J9p5j8Q9o8J79l2o7j2o5o7P3O1lk4O7j08R4l2k7n4M8K6p9
4281G4O4K4O4K7k6J4n9j45j1K6J09rp4J15qM9k01J22N6k6j52OJ95L2m2pq2o9J37j7k4J50p6
3894B36j96J96o1R4j23O3j83J55j4J6q9K09j49r5m1O4j3J08j32N1R6m3l3m3K0J4L3r0M4%m6
3530D8P6O3p0M3Mj2n5O4p6N9o9OP8Q5r6K2R3j64q1J64p6J32q2p6K05m5K0j93J5L1n9J62j5
3143B01r6P5J53o0j92J62N8q7m0qk8L5r2l8O8m4J23R9n9J35l62L64k64K8P0o6K30j10j32L7
$$ plain form
5807 107 127 84 82 94 85 68 34 183 200 170 74 25 109 141 228 151 100 175 125 47 70 114 67 138 100 94 98 66 138 149 61 94 231 169 111 84
5384 84 119 16 107 7 165 244 169 272 279 340 234 27 139 116 244 125 91 148 58 83 153 262 219 133 88 72 164 166 135 154 124
5021 124 103 273 347 191 44 195 135 42 51 129 29 163 67 125 30 43 82 90 229 335 94 162 129 225 135 158 31 67 139 316
4669 316 308 68 37 4 204 163 33 20 149 168 93 75 164 96 275 243 176 164 99 32 105 166 163 139 206 98 192 160 133 79 127 153 74
4281 74 138 162 226 253 227 241 182 37 26 52 161 152 78 193 185 234 33 155 211 185 33 39 234 266 224 217 135 66 203 186 162 312 236
3894 236 40 236 175 269 146 209 26 181 167 183 94 303 154 59 18 82 69 177 45 96 192 149 116 73 93 107 140 50 94 94 48
3530 48 124 187 117 160 164 152 97 161 85 144 75 81 159 244 148 170 263 99 18 182 106 238 156 80 285 240 260 67 82 113 54 216 201
3143 201 105 180 333 273 81 243 301 214 174 166 138 173 81 43 111 67 190 289 230 365 3 367 103 131 201 135 365 255 123 160
2791A60r6N4J9K1Q0n4n0j1P8j78O5n6J50r8R1k1k6R2j80KN9k4j9OJ6Q5n9p4K9j4l1Q1lJ92
2391B86j20J9%j62K25k1j20o9O4M4M4P3N8k88J08L8O4n9j0J28j43j2l0q8M8L5Q3m5K5k7q1
2028F7R8j8k5J6r3J19kj0%j8n9O4l3Q8m3qr3J46j01j4J19l8j9On1l7L7ql4O2J26K6k21J34
1628A83Q0p4p0K80j7j13q7j71L2J2PJ84j5q9j00K61m7j81M1J02k5j61P3k2ML2p2K06l2k5L4
1265B30j88J32qR6k4k5n7l4k2P1M3j37PN6o3l1N9P6j29K8OK4Q4P9n1q3O9QL8j71J09k9o5n5
866D3M2O0N8q2O9N6r0o0M5o4N8J9j07J72M1n6j08p5P9Q2q4O9K1j42N5o1J2P2K4O5j40N0k1
478A02l4P4nj00K48j20k2j0Q8j41J24j7J33j1j82J60k21J56j11K9k5n6MO6M0k1J67j94J17
138B38j86L8O0r9Q9m1l2N2rJ49J2r4M8j91O6p7J30K8j78R8R0ok5L7j83OJ02M1
$$ plain form
2791 160 64 118 137 158 238 184 134 123 201 23 88 32 182 84 175 154 128 220 40 42 101 77 58 64 80 165 106 32 61 47 16 97 94 286
2391 286 166 185 185 23 248 227 107 38 102 146 190 263 321 33 141 179 243 184 174 302 159 147 117 29 77 112 195 150 175 148 67
2028 67 165 147 122 138 45 164 162 152 152 134 75 139 106 194 151 143 50 196 95 81 200 162 143 149 98 61 98 90 56 118 244 270 49 183
1628 183 263 189 119 399 382 269 182 11 43 55 62 246 231 142 42 303 256 75 116 218 193 32 105 83 87 119 47 253 221 196 230
1265 230 42 174 166 262 238 213 156 122 100 171 214 77 84 140 77 46 105 181 52 80 86 110 194 273 222 139 208 216 254 83 192 163 98 43
866 43 85 145 203 121 190 246 156 96 141 77 135 154 47 219 260 204 96 21 100 182 98 167 188 46 101 40 52 124 148 213 73 123 102
478 102 68 142 137 37 285 165 143 133 221 80 204 187 320 309 127 287 66 222 111 140 115 59 63 129 169 148 315 121 238
138 238 52 90 150 51 140 99 67 119 110 259 271 177 225 34 100 23 153 181 3 101 191 185 160 197 14 20 122 163
-191A63
##PAGE=	F1=4819.08
##FIRST=	25168.397401625570637,	5807.04592319999756,	0.35471221804618835449
##DATA TABLE=	(F2++(Y..Y)), PROFILE
5807A11Rj1l2L6l5m0L6Q8j7J3q9k2O1KR3k4j09Q6pr9K2P3r6O0l7P6q1k5R9K6n0J1L6k9o0k7
5384D8J1l3N5n2J27P8j07J91l8Q7r4k68J47m5J13o2n8Q6j63L9O5J52k0j17l9k7R2k9J0K8j0
5021A67k1J50Q1k01q7J85r2j21pJ27j04R6p5K1q4PP0PO7J44k51J18n7L7n4rj03M2P7K11pk76
4645E8m8M0J64p1r7k8J61l4j8l3O9k3J57k9r2j5r1m4P3P9l0l0O9r2O9J6m4mJ0L2j56J01M8
4258A67K9M7j0j4p6j08J0NJ19m4n5J74j0j5j83J56J6j0j43j5K17N9q1Kr2j15J53k3nJ04n0
3894B09j73J42o6J10q9P6j79J32n8M3n5K04j50q8k2M3L1N2j11K4R0l0k8l8k2N2%l1L3j9j1
3530G1P5M3o7K0K2m1n2P3n2Ln6JR6J22j20N0N5j71o1J44l3N6k1p8K30q0j3j31JK9p4J30L7
3143B08n4P5J00m0j76J19K3r6mPl8N0r3l0O7o6J10J29n9J15l15L01k09KP6q2K21j21j06L9
$$ plain form
5807 111 120 109 77 113 78 38 74 162 145 158 69 47 108 110 203 179 70 156 149 50 72 145 49 109 72 148 67 42 141 167 117 128 164 135 75 48
5384 48 59 26 81 29 156 234 127 318 280 367 273 5 152 107 220 158 100 186 23 62 127 279 259 142 103 76 168 139 149 177 167
5021 167 146 296 377 176 89 274 182 61 54 181 77 173 98 119 35 42 112 119 186 330 79 197 140 177 123 114 11 53 130 341 334 58
4645 58 10 50 214 143 46 18 179 145 127 94 163 140 297 268 176 161 70 26 99 178 148 118 187 95 164 180 136 132 142 174 18 119 167
4258 167 196 243 233 219 143 35 45 50 169 125 70 244 234 219 36 192 208 198 55 40 257 316 235 237 145 30 183 160 155 259 209
3894 209 36 178 112 222 133 209 30 162 104 147 92 296 146 58 36 79 110 162 51 75 165 135 107 69 47 99 99 68 101 82 71
3530 71 146 189 122 142 164 123 71 144 92 95 39 40 136 258 138 188 243 72 11 155 122 178 157 79 309 229 216 85 86 115 41 171 208
3143 208 154 229 329 289 113 232 255 159 155 162 124 174 81 51 118 52 162 291 232 347 32 333 124 126 202 120 341 220 114 153
2791A53p1L9O2K1J5r4K2k6N3j54K3kJ11q4J08qo5P3j27L3k3L2o3M2M0P6n7o1oj2mJ02p1J83
2391B60m5o6P2j93K47m9j51qO1L5L6RQ3k82R4M4K5k1K0J16j20m1Qn1PJL0KJ01p0o2R4K0r0
1992A16j3j1R2k7j3j7Ro2L3o7Q6K9m4q9J69j12K0J43l7o2J9q2M2K3o3K6M5O1O3k00M3J73q1
1605B12r2K87rj36j05j41L8J9PJ72l9l8j51L25j00j25k3J22K0j52K1oj5K0m5J50L7oj1j85
1253E1J84r4J35l7k6m7k1JOQ4j22r7J10l2o8J10N1j43P2m0J8J13N5n7n6M8l2N3j07O3m0m2
877I3l0O2j7R1r6J12M5j25m5L4m1N8L4j33J57L1Jr6q5M9Q8o8P6nj45J24j42M9OP0Q3j26l6
490G3J2j6Q1l0q9K18o5n2j0J37j98J68n9J38Kk48J59j07O6n8M6o0n4j6L9O9%J63j94J37j78
126G4j9J35j12M9rn2R8m6J18K7j36Mj05P6q0J63L8k10O6J24Mq2O3j52%P5O0
$$ plain form
2791 153 82 121 183 204 219 125 147 121 174 20 43 41 152 68 176 168 103 176 49 82 59 91 28 70 110 186 129 68 62 50 46 148 77 260
2391 260 215 149 221 28 275 226 75 67 128 163 199 208 291 9 103 147 172 151 171 287 167 126 134 83 90 91 121 123 224 154 92 186 206 116
1992 116 103 92 184 157 144 127 136 74 107 40 126 155 111 22 191 79 99 242 205 143 162 80 122 145 82 108 153 214 277 77 120 293 212
1605 212 120 407 398 262 157 16 54 73 80 252 213 175 24 349 249 124 101 223 243 91 112 106 91 111 66 216 253 247 236 51
1253 51 235 141 276 239 213 166 145 146 152 236 114 17 127 95 27 137 188 45 117 77 95 208 263 206 150 198 166 219 112 175 135 93
877 93 63 125 108 199 103 215 260 135 90 124 83 141 175 42 199 230 231 135 50 99 187 119 195 190 45 169 27 76 82 152 235 109 73
490 73 85 69 150 120 31 249 184 132 122 259 61 229 170 308 310 62 221 114 180 122 168 108 54 38 77 146 146 309 115 252 74
126 74 55 190 78 127 118 66 164 118 236 263 127 131 26 102 22 185 223 13 79 203 207 125 188 36 36 111 171
-191A71
##PAGE=	F1=4716.83
##FIRST=	25168.397401625570637,	5807.04592319999756,	0.33804166316986083984
##DATA TABLE=	(F2++(Y..Y)), PROFILE
5807I3J8J0m7O2m3r2J07L6k9L3p9nN8l5Q0J9j38Q2M1j28K3Q2j19O8K2O9j62M5O4L7J8l9n9
5420I2jn3j7M6l5L9j3P0Q2j34K69p7J05o5k81J33l8O4Rn7R4j31Nj7J73J8j43j5n9J00n9N7
5044A61J5J9j3J14P5k01m8J99j07j34KJ43j02O1n6j3r5N1O8j4PJ61k23J49o6l0l1k8m1L4M9
4680A06K36J8k64p4P0J11r0n2k3J53p4L8j6L6OJ07k7j15j8o5J5L7M6l8j5N7p6N1M4n0L9k7
4305A46L8j36O9M6j7P8J1m2r1q0M3K0P6p1l1K08Ro7j61J62j3j2j12K5J98M8r9J5j29r8J17
3941A50omN7k0j34P4m4Q8m4P3j10L3o2N5k3J67j01n5n4M9O4k2n8j8O8j9Ll7j4J7k4L0K9m6
3542F2K2Q2K0p6J4Om7l2Q3j7m1jl5P4J43j32O2J3j31k0O7llO2j01K52r7o9n6M0Rl5MP9J6N1
3119B65L5k3j14L3kj06L3L7n8O3q7k5P8n7K1J54l5Q2k29K40j59l2Q3r8J95j20o4L6n1L3R0
$$ plain form
5807 93 111 121 74 136 93 1 108 144 115 148 69 64 122 87 167 186 48 130 171 43 66 148 29 97 119 188 26 71 135 172 190 151 92
5420 92 91 38 21 67 32 71 58 128 210 76 345 268 373 308 27 160 122 186 195 138 232 101 106 89 262 280 137 122 63 163 104 161
5044 161 176 195 182 296 371 170 122 321 214 80 82 225 123 184 128 115 20 71 139 125 132 293 70 219 153 123 92 64 23 57 106
4680 106 342 360 96 22 92 203 113 61 38 191 117 155 139 175 181 288 261 146 128 63 78 115 161 123 108 165 89 140 184 134 173 146
4305 146 184 48 117 163 146 224 235 193 102 22 65 85 161 90 59 267 276 209 48 210 197 185 73 98 296 344 245 260 131 33 150
3941 150 144 140 197 177 43 117 73 161 117 190 80 113 51 106 83 250 149 94 40 89 153 131 73 55 123 104 107 70 56 73 49 79 108 62
3542 62 84 166 186 110 124 130 83 51 134 117 76 75 40 114 257 125 187 200 69 49 116 113 110 172 71 323 226 157 101 141 150 115 119 198 214 265
3119 265 300 277 163 196 194 88 121 158 100 163 76 51 129 72 93 247 212 294 65 305 146 114 197 99 294 174 110 146 95 128 218
2755B18K3o3j19P6qL0r1n0L4O5o1R8Mp2N0o2O0q5O9q9N6N0N2m3m6pk6J7R8j19J62K4j37J21
2356B29j91K46o4j64N6M6J0J5l3R9k40Q0L1l1J4N5J01r8p9P7K0L3p1j07P6J46j22j1Q2M4r0
1992A59n2K4Q5m2l8l6L7p5J0j5J7P7n7q0J58j07M1J52oq7qj09J29%q4J01j2j3P8j04n8K32
1617C17j09j07K92oj54j11q7L5K3%J39o9N0j52L07j35o3p3J17N9j33qk8K0mn8R7J11Qn2j50
1253G6J90j53J41m4k4m1k1M8m7J21j07o3M9k8k2Q7J3q3O0q3J9J13L3o0k2K4n8N8l3L5q1jM
866A00O2p8J05j18J53J5j51nK3k6P1M3j38J08J4M0p1o6K7O7m6Q3l8q1J20j36L0p4J30P9j04
502A38r0L7k7R3m3n2J37Ln2n1J73k18J95r4J50kk95J63j7oj4L6p5m4L3k8N9J9J47j69J43j46
126A03o3J89j34J8K8l8P5p2Q7K9j52k0K6K7p0J75M8k24RJ61K5j40Q2j11mK4Q3
$$ plain form
2755 218 241 178 59 135 127 157 66 16 50 115 54 152 156 84 134 72 132 47 116 27 83 133 185 142 96 89 63 80 178 59 221 245 108 229
2356 229 38 284 220 56 112 158 168 183 150 249 9 89 120 89 103 158 259 161 82 159 179 212 141 34 110 256 134 123 205 249 159
1992 159 107 131 216 174 136 100 137 62 72 57 74 151 94 14 172 65 106 258 252 165 157 48 177 177 93 194 182 169 247 143 85 317
1617 317 208 101 393 387 233 122 35 70 93 93 232 163 213 61 368 233 170 97 214 273 140 132 104 124 120 62 159 270 278 226 76
1253 76 266 113 254 210 186 145 124 172 125 246 139 76 125 97 75 162 175 92 152 69 88 201 234 174 152 176 118 176 143 178 97 96 100
866 100 162 84 189 71 224 239 88 83 106 80 151 194 56 164 178 218 147 81 108 175 129 212 174 93 213 77 107 33 163 242 138
502 138 48 85 58 151 108 56 193 196 144 93 266 48 243 149 299 297 2 165 148 142 128 164 89 45 78 50 109 128 275 106 249 103
126 103 40 229 95 113 141 103 178 106 193 222 70 50 76 103 33 208 256 32 41 202 227 87 169 58 54 78 161
-191A61
##PAGE=	F1=4614.57
##FIRST=	25168.397401625570637,	5807.04592319999756,	0.24710963666439056396
##DATA TABLE=	(F2++(Y..Y)), PROFILE
5807E5N1J9m7Q2k8r4R4Ll1K8m8kO2o0M3M4j36O8Q5j55K5P3j02N0R5K9j60R3nL7Q8r4j08pm4
5396CQ1N6j01N3j3PQ8j43L17j05J05k2k80J12qJO3l4Q8q5oj24J56P6j66K3j06J09o3Q2j8N2
5021A98MP2O2j60m6J96j04j33K4J38r0L4m6k6r5R5L6n2k0J52j66J56o6r5k1k9K7K0J2K41M4
4657C62k24q4O4N4q3mm9J43q8Q7KRJ6M3j9j32k7K2K4J7j4m1L6L4o4N3L0l9N5n2M9o5J8J2o1
4246H4J14K8o4j00oK1L7K0q5J2K03L0q9j35J40l5k2p0O7J70K1q8J8j72k9M1L0r%Rr5K7N2J
3847A26k8O1k7q4L3j3jJ21mm4r3O4Q0j01J1n5L7kL1k8%m7j9O6K4o9N1Q9pq8K7l8k7oR2J1m2
3413A01K5m6K3J33j26N3k5l2j8pjj6J22j28K60q9j32%J17j7k1r9R4R0K0l1j1k0o6k7o6L1P0
3025A61r3Q0p5l3J01k8j10J61J0N4j16J70j20o2Q8j09J54j09j8L0l3K7J06L4j16p8K2L4M3
$$ plain form
5807 55 106 125 78 160 132 38 132 135 104 132 84 82 144 84 127 171 35 103 188 33 58 131 29 79 174 203 43 136 131 168 256 162 54 47 3
5396 3 84 140 39 92 79 86 174 31 348 243 348 326 46 158 150 151 214 180 268 183 177 53 209 285 119 142 36 145 82 164 146 198
5021 198 202 274 336 176 130 326 222 89 113 251 161 195 149 123 28 123 159 107 87 239 73 229 163 68 47 18 45 65 77 318 362
4657 362 138 54 118 172 89 85 36 179 91 178 180 189 205 248 229 97 70 92 116 133 119 78 114 148 84 137 167 128 183 131 180 115 133 145 84
4246 84 198 226 162 62 56 77 114 134 49 61 264 294 205 70 210 175 153 83 150 320 341 253 271 99 70 111 141 132 132 141 46 73 125 126
3847 126 98 159 132 48 81 68 67 188 184 140 47 111 191 90 101 46 83 81 112 84 84 37 18 84 108 39 90 179 172 84 111 73 46 40 132 143 101
3413 101 126 80 103 236 110 163 138 106 88 81 80 64 186 58 318 229 97 97 214 197 176 77 171 261 281 250 239 219 153 126 60 91 161
3025 161 68 148 73 40 141 113 3 164 174 228 112 282 162 100 188 79 233 124 106 136 103 130 236 270 154 76 98 132 175
2685A75n1r8L9Ql7P6J3n9O1l4Q4r2O2r8M4M7K1k0l7rk4K4Q7j36J28P7j75J30j50K19p3j40
2309F2Q0L6k9qm4J04j82Q6om4qR1R0p6j32J59P6N9j21j45Q6J29j65N3O0N3p4n3J7R5n0p1n3
1922G5O5p9j6P5l2N3l7q3J22r5N1J48L9r1n8j07J91l2p5J47o6o4O1mr0K33j54j10K89Jj51
1558B06j17m1M0L4j3Q4j00J54j31K41j34l2p5Q4P4j00l5o6R0j3j10M5J86J3q3j00J59j64J07
1218B03n1k0m0l5J19q2J46r2k9J2l9L3N3l6nL6j06K3Q6J4n1JJn7N2L2K7j35N0L9M7j21R2j21
819D6J68k3j52L3J5j1R8K9j32M5oO1m2k9L1K5k9R1p1j9R5j18K4j08J59N2p4j21N7l5Q8n0k2
431G5N6O9l6j08J87k06K11j31J67rk28R1L1m8j5K3m9k4O5m5j1L5J21j20J27j03m5J80j49j5
79I6P3qjq7N9J8j25O1L1k3m4J64N9k16n2J86L7j76R3p1om4J10
$$ plain form
2685 175 124 26 65 73 36 112 125 66 127 93 177 85 147 49 93 140 161 141 104 95 71 95 182 46 174 251 76 206 56 275 202 62
2309 62 142 178 149 141 97 201 19 105 99 55 47 138 228 152 20 179 255 314 193 48 134 263 98 151 211 264 190 137 154 249 199 128 75
1922 75 140 61 45 120 88 141 104 21 143 48 99 247 286 195 137 30 221 189 114 261 195 131 192 188 98 331 177 67 356 357 206
1558 206 89 48 88 122 109 193 93 247 116 357 223 191 116 200 274 174 139 73 163 150 40 85 271 284 201 101 260 96 203
1218 203 152 132 92 57 176 94 240 148 119 131 92 125 178 142 137 173 67 90 176 190 139 140 141 84 136 168 195 60 110 149 196 75 167 46
819 46 214 191 39 72 87 76 174 203 71 116 110 171 129 100 131 156 127 218 147 128 223 105 129 21 180 232 158 37 94 59 147 97 75
431 75 131 200 164 56 243 37 248 117 284 275 47 138 169 121 106 129 80 56 121 76 65 100 221 101 228 125 80 260 111 96
79 96 169 161 160 73 132 150 25 86 117 94 50 214 273 57 5 191 228 52 145 74 68 24 134
-191A34
##PAGE=	F1=4512.31
##FIRST=	25168.397401625570637,	5807.04592319999756,	0.25430515408515930176
##DATA TABLE=	(F2++(Y..Y)), PROFILE
5807A9R2J7k9Q2j2r8P6j4n1K7NlN6p3rN2j07N1J19j69K7N3o3KJ62j9r5J06p5K8J42j37q1o4
5408A7J6J12N2j45P2k8n5Q8p4K73j18Q5K3k59Q5K5l9P9jP3l4kj56M0J49j83O2j48J08l6P4
5044A55o3Q2K7L5M5r7p3J78q5j17N1J18o8J6m4k5o1J11j3r8mJ17j12J53o1j36k6RL9QJ0K06
4669B77N2j73q0M5Om5L1j01J31n7J14Jj0J2j5Jj21o0J14RKp1m4J12J1o2P4k4j0L4n8O5J2k6
4269A46l0r3J48K9p2r9Q7k4L3l2p8P0J63L6q4r8R5n8k8k8R3J32mn0J0j99L0j4O8rp3L5n9K1
3870F4J17l4p1M7O5j32P2r1J4J04Q2o6r5O2Q2j63P3p3L6OJ6j2no7L9RK4q4P7Q7l6r5N5r5N1
3460F3k8J07K2l5K5m5oR0j01L5m8Q2m1m2l4L8R6j25K38n5j79K1J97m5k2j46O8J55j4q5PP7
3084B70j38o9O8k4P1j23Q3n9n5J23lm0m0O2M4k1J08q7p6P9j09J05q8J4K2nQJ10O0j13l5r2
$$ plain form
5807 19 111 128 99 181 169 71 147 133 82 109 114 111 167 94 85 137 30 81 200 31 58 111 48 50 212 193 98 204 129 157 299 162 81 17
5408 17 33 145 197 52 124 96 41 129 55 328 210 295 318 59 144 169 130 209 208 281 247 245 89 129 278 95 157 9 117 81 155
5044 155 92 174 201 236 281 184 111 289 204 87 138 256 188 204 160 135 74 185 172 74 70 187 75 228 167 31 5 14 53 61 71 277
4669 277 329 156 76 121 127 82 113 12 143 86 200 201 191 203 188 189 68 8 122 131 133 62 18 130 141 79 153 129 119 153 95 160 172 146
4269 146 116 23 171 200 128 29 116 92 125 93 15 85 248 284 200 102 197 139 111 83 176 308 304 254 264 65 95 81 149 140 67 102 43 64
3870 64 181 147 76 123 188 56 128 37 51 155 237 171 76 138 220 57 130 57 93 99 115 103 98 31 70 79 103 19 96 183 147 52 107 12 63
3460 63 35 142 164 129 154 109 103 193 92 127 79 161 120 78 44 82 178 53 291 236 57 78 275 230 208 62 130 285 271 186 193 270
3084 270 132 63 131 107 178 55 138 79 24 147 144 104 64 126 170 149 257 170 94 173 64 169 81 95 117 112 120 230 290 177 142 50
2708E0P4R0k6j25K3m0k6N9Qm0J02m3J04p7M1j13L3L9j3Lk3k8KJ3Q0j31R0J09j67R0p9J75q0
2321A74r0O2L4p1l0k5R8j24J04n0L9j11J05Q5n0j02J35J11P5j49j08N8P3j74R9L1M9o2k8R
1969A67J08n9r6n6Q4m9o6J24k9%lj01Q9o4L5J28Q3p5j05n4J87o6m4J56j09o8K4O2q6K13j97
$$ plain form
2708 50 124 214 188 63 86 46 20 79 87 47 149 106 210 133 174 61 94 133 120 123 100 72 74 87 167 36 126 235 68 158 79 254 174
2321 174 84 146 180 109 79 54 152 28 132 82 121 10 115 200 150 48 183 294 369 220 112 170 243 69 168 199 248 186 158 167
1969 167 275 216 120 64 148 99 33 157 128 128 125 24 113 49 84 212 295 220 115 61 248 182 138 294 185 117 141 203 117 330 133
$$ [...]
-191A44
##END NTUPLES=	nD NMR SPECTRUM
##END=	
##END=	
