##TITLE=	t4SkfS6cQxqdiIx97Umz$A.42.ser
TM-VI-138solid hmqc

##JCAMP-DX=	6.0	$$ MestReNova 14.3.0-30573
##DATA TYPE=	LINK
##BLOCK_ID=	1
##BLOCKS=	2    
##ORIGIN=	Mestrelab Research S.L.
##OWNER=	hrzepa
##$MNOVA/LINK_BLOCK_TYPE=	ITEM	$$ NMR Spectrum
##$MNOVA/ITEM/POLYGON=	(XY..XY)
5321,5835
8722,5835
8722,8208
5321,8208
5321,5835
##$MNOVA/ITEM/Z=	0
##$MNOVA/ITEM/ANGLE=	0
##TITLE=	t4SkfS6cQxqdiIx97Umz$A.42.ser
##JCAMP-DX=	6.0	$$ MestReNova 14.3.0-30573
##BLOCK_ID=	2
##DATA TYPE=	MNOVA NMR VIEW DATA
##DATA CLASS=	MNOVA VIEW DATA
##$MNOVA/2D/THRESHOLD=	6.13565826416015625
##$MNOVA/ITEM/ZOOM/X=	-0.98135677571250334861,	11.004809999983093505
##$MNOVA/ITEM/ZOOM/Y=	-4.6325299116681737388,	174.98660000188448294
##END=	
##TITLE=	t4SkfS6cQxqdiIx97Umz$A.42.ser
##JCAMP-DX=	6.0	$$ MestReNova 14.3.0-30573
##BLOCK_ID=	3
##DATA TYPE=	nD NMR SPECTRUM
##DATA CLASS=	NTUPLES
##NUMDIM=	2
##ORIGIN=	Bruker BioSpin GmbH
##OWNER=	nmr
##.OBSERVE FREQUENCY=	400.32200160000002143
##.OBSERVE NUCLEUS=	^1H
##.SOLVENT NAME=	CDCl3
##.PULSE SEQUENCE=	hmqcgpqf
##LONGDATE=	2021/10/27 13:49:37.000
##.ACQUISITIONMODE=	SIMULTANEOUS (DQD)
##$ORIGINAL FORMAT=	Bruker XWIN-NMR
##$MNOVA/SCALES_VERSION=	9
##$PARAMETER FILE=	(acqu2s, ASCII, /private/var/folders/f6/rjf_tdyn2v98c5c0wvkgn4s80000gn/T/t4SkfS6cQxqdiIx97Umz$A/42/acqu2s, 0)
$$ ##TITLE= Parameter file, TOPSPIN		Version 3.2
$$ ##JCAMPDX= 5.0
$$ ##DATATYPE= Parameter Values
$$ ##NPOINTS= 129	$$ modification sequence number
$$ ##ORIGIN= Bruker BioSpin GmbH
$$ ##OWNER= nmr
$$ $$ 2021-10-27 14:01:40.279 +0100  nmr@CZC2524DW0
$$ $$ /opt/topspin/data/agmb/nmr/Oct27-2021/42/acqu2s
$$ $$ process /opt/topspin3.2/prog/mod/go
$$ ##$ACQT0= 0
$$ ##$BF1= 100.660544
$$ ##$FnMODE= 1
$$ ##$NUC1= <13C>
$$ ##$NusJSP= 0
$$ ##$NusT2= 1
$$ ##$NusTD= 128
$$ ##$O1= 8556.27425043792
$$ ##$SFO1= 100.66910027425
$$ ##$SW= 179.955338625584
$$ ##$SW_h= 18115.9420289855
$$ ##$TD= 128
$$ ##END=
$$ 
##$PARAMETER FILE=	(acqus, ASCII, /private/var/folders/f6/rjf_tdyn2v98c5c0wvkgn4s80000gn/T/t4SkfS6cQxqdiIx97Umz$A/42/acqus, 0)
$$ ##TITLE= Parameter file, TOPSPIN		Version 3.2
$$ ##JCAMPDX= 5.0
$$ ##DATATYPE= Parameter Values
$$ ##NPOINTS= 12	$$ modification sequence number
$$ ##ORIGIN= Bruker BioSpin GmbH
$$ ##OWNER= nmr
$$ $$ 2021-10-27 14:01:43.700 +0100  nmr@CZC2524DW0
$$ $$ /opt/topspin/data/agmb/nmr/Oct27-2021/42/acqus
$$ $$ process /opt/topspin3.2/prog/mod/shimcntl
$$ ##$ACQT0= 1000000
$$ ##$AMP= (0..31)
$$ 100 100 100 100 100 100 100 100 100 100 100 100 100 100 100 100 100 100
$$ 100 100 100 100 100 100 100 100 100 100 100 100 100 100
$$ ##$AMPCOIL= (0..19)
$$ 0 0 0 0 0 0 0 0 0 0 0 0 0 0 0 0 0 0 0 0
$$ ##$ANAVPT= -1
$$ ##$AQSEQ= 0
$$ ##$AQ_mod= 3
$$ ##$AUNM= <au_zgonly>
$$ ##$AUTOPOS= <54 >
$$ ##$BF1= 400.32
$$ ##$BF2= 100.660544
$$ ##$BF3= 400.32
$$ ##$BF4= 400.32
$$ ##$BF5= 400.32
$$ ##$BF6= 400.32
$$ ##$BF7= 400.32
$$ ##$BF8= 400.32
$$ ##$BYTORDA= 0
$$ ##$CAGPARS= (0..11)
$$ 0 0 0 0 0 0 0 0 0 0 0 0
$$ ##$CFDGTYP= 0
$$ ##$CFRGTYP= 9
$$ ##$CHEMSTR= <none>
$$ [...]
$$ 0 0 0 0
$$ ##$ShimPowMaxUC= (0..63)
$$ 130000 130000 130000 130000 130000 130000 130000 130000 130000 130000 130000
$$ 130000 130000 130000 130000 130000 130000 130000 130000 130000 0 0 0 0
$$ 0 0 0 0 0 0 0 0 0 0 0 0 0 0 0 0 0 0 0 0 0 0 0 0 0 0 0 0 0 0 0 0 0 0 0 0
$$ 0 0 0 0
$$ ##$ShimPowMaxUG= (0..63)
$$ 524287 524287 524287 524287 524287 524287 524287 524287 524287 524287 524287
$$ 524287 524287 524287 524287 524287 524287 524287 524287 524287 0 0 0 0
$$ 0 0 0 0 0 0 0 0 0 0 0 0 0 0 0 0 0 0 0 0 0 0 0 0 0 0 0 0 0 0 0 0 0 0 0 0
$$ 0 0 0 0
$$ ##$ShimPowRcbType= 3
$$ ##$ShimPowRes= (0..63)
$$ 1e-20 1e-20 1e-20 1e-20 1e-20 1e-20 1e-20 1e-20 1e-20 1e-20 1e-20 1e-20
$$ 1e-20 1e-20 1e-20 1e-20 1e-20 1e-20 1e-20 1e-20 0 0 0 0 0 0 0 0 0 0 0 0
$$ 0 0 0 0 0 0 0 0 0 0 0 0 0 0 0 0 0 0 0 0 0 0 0 0 0 0 0 0 0 0 0 0
$$ ##$ShimPowRng0= (0..63)
$$ 1 1 1 1 1 1 1 1 1 1 1 1 1 1 1 1 1 1 1 1 0 0 0 0 0 0 0 0 0 0 0 0 0 0 0 0
$$ 0 0 0 0 0 0 0 0 0 0 0 0 0 0 0 0 0 0 0 0 0 0 0 0 0 0 0 0
$$ ##$ShimPowRng1= (0..63)
$$ 1 1 1 1 1 1 1 1 1 1 1 1 1 1 1 1 1 1 1 1 0 0 0 0 0 0 0 0 0 0 0 0 0 0 0 0
$$ 0 0 0 0 0 0 0 0 0 0 0 0 0 0 0 0 0 0 0 0 0 0 0 0 0 0 0 0
$$ ##$ShimPowRng2= (0..63)
$$ 1 1 1 1 1 1 1 1 1 1 1 1 1 1 1 1 1 1 1 1 0 0 0 0 0 0 0 0 0 0 0 0 0 0 0 0
$$ 0 0 0 0 0 0 0 0 0 0 0 0 0 0 0 0 0 0 0 0 0 0 0 0 0 0 0 0
$$ ##$ShimPowRng3= (0..63)
$$ 1 1 1 1 1 1 1 1 1 1 1 1 1 1 1 1 1 1 1 1 0 0 0 0 0 0 0 0 0 0 0 0 0 0 0 0
$$ 0 0 0 0 0 0 0 0 0 0 0 0 0 0 0 0 0 0 0 0 0 0 0 0 0 0 0 0
$$ ##$ShimSysFunc= (0..63)
$$ 1 2 3 4 5 7 9 11 15 16 8 10 12 14 6 17 13 18 19 20 0 0 0 0 0 0 0 0 0 0
$$ 0 0 0 0 0 0 0 0 0 0 0 0 0 0 0 0 0 0 0 0 0 0 0 0 0 0 0 0 0 0 0 0 0 0
$$ ##$ShimSysMatrix= 0
$$ ##$ShimSysType= 1
$$ ##$TFXNUM= 0
$$ ##$TRIPLO2= 0
$$ ##$VTU= 2
$$ ##$VTUETH= <149.236.99.20>
$$ ##$VTUTY= <no>
$$ ##$WBREFAM= (0..15)
$$ 132.2 106.2 100 100 100 100 100 100 100 100 100 100 100 100 100 100
$$ ##$WBREFLM= (0..15)
$$ 0 0 0 0 0 0 0 0 0 0 0 0 0 0 0 0
$$ ##$WBREFPH= (0..15)
$$ 77.55 -65.76 0 0 0 0 0 0 0 0 0 0 0 0 0 0
$$ ##$WBSGU= (0..15)
$$ 0 0 0 0 0 0 0 0 0 0 0 0 0 0 0 0
$$ ##$XFAC= 2
$$ ##END=
$$ 
##$DECIM=	4160
##$DSPFVS=	20
##.ACQUISITIONSCHEME=	NOT PHASESENSITIVE
##NTUPLES=	nD NMR SPECTRUM
##VAR_NAME=	FREQUENCY1,	FREQUENCY2,	SPECTRUM
##SYMBOL=	F1,	F2,	Y
##.NUCLEUS=	13C,	1H
##.OBSERVE FREQUENCY=	100.66910027424999896,	400.32200160000002143
##VAR_TYPE=	INDEPENDENT,	INDEPENDENT,	DEPENDENT
##VAR_FORM=	AFFN,	AFFN,	ASDF
##VAR_DIM=	512,	512,	262144
##UNITS=	HZ,	HZ,	ARBITRARY UNITS
##FIRST=	17614.246348710370512,	4405.4455391999963467,	0.64508789777755737305
##LAST=	-466.31298099976766025,	-392.85674445383250486,	0.23351739346981048584
##MIN=	-466.31298099976766025,	-392.85674445383250486,	0.0014089457690715789795
##MAX=	17614.246348710370512,	4405.4455391999963467,	90.27480316162109375
##FACTOR=	1,	1,	0.0039196476478518338729
##PAGE=	F1=17614.2
##FIRST=	17614.246348710370512,	4405.4455391999963467,	0.64508789777755737305
##DATA TABLE=	(F2++(Y..Y)), PROFILE
$$ [...]
##PAGE=	F1=-6233.69
##FIRST=	17614.246348710370512,	4405.4455391999963467,	0
##DATA TABLE=	(F2++(Y..Y)), PROFILE
-346F6n4J00j4m7N9
$$ 66 12 112 98 51 110
-393A10
##PAGE=	F1=-6304.46
##FIRST=	17614.246348710370512,	4405.4455391999963467,	0
##DATA TABLE=	(F2++(Y..Y)), PROFILE
4405E5R7j0rn2NPJ7O9Q6m6k6K6j45R8j69J96k3j04Lj7R3j8r2M8K1J3M1j2k5j1N6M1K6O8r2
$$ 55 152 142 133 81 86 93 110 179 265 219 193 219 74 172 3 199 176 72 75 58 151 133 41 89 110 123 164 152 127 116 172 213 239 307 215
4077B15pJ13q9r2l0k3JO1P6k6l9j21PQ4r8J44p5J92r7lo4o1M3q1O5jJ53j93L2J36j35mmpL9
$$ 215 208 321 232 140 110 87 88 149 225 199 160 39 46 130 32 176 101 293 196 193 129 68 111 30 95 94 247 54 86 222 87 83 79 72 111
3748A11o1k1J17J75r4j03oR5j13K3k3k7N1J9j08O4J28j0j10j1J65rj48p4Q6k1N3N6k8Oj6N8
$$ 111 50 29 146 321 227 124 118 213 100 123 100 73 124 143 35 99 227 217 107 96 261 252 104 30 116 95 148 204 176 182 166 224
3448B24q9q9J46P3j42M3M2j31J75n1M0j26j3qK43Kj69q1M3r5K8nJ73r4r1P6Q0j28J36j66K2
$$ 224 135 46 192 265 123 166 208 77 252 201 241 115 102 94 337 339 170 89 132 37 65 60 233 139 48 124 204 76 212 46 68
3157F8l1M1O8P3j5N1j07q5Q4j22J51O9j47l6M6J14J55q0k67J33R0Q4r2M8k10J33K1j35PK2
$$ 68 37 78 146 219 204 255 148 63 147 25 176 245 98 62 108 222 377 297 30 163 253 337 245 293 83 216 237 102 109 131
2875A31mq3l4O4K0m1O0M0Kj00J46j76J34oq8L2L0J73k33jJ61Q0k49M0o7J73j12Q3J4P3j04
$$ 131 127 44 10 74 94 53 113 153 155 55 201 25 159 153 65 97 127 300 67 66 227 307 58 98 31 204 92 175 189 262 158
2584A58j23j6M7K0M9Q1pj00q1P9R7J0Jq8P2j21R0N1J7j16K06O0k16p6j1qj1J05m9J7m0lo8
$$ 158 35 19 66 86 135 216 209 109 28 107 204 214 215 127 199 78 168 219 236 120 326 386 170 94 83 75 64 169 120 137 97 94 26
2274B6J35j17K5J73K0j31o7L4l3J70mj70O0K2J2Jk1j15P3l2K3J03N5o1q5K16J08j40oj25J
$$ 26 161 44 69 242 262 131 64 98 65 235 231 61 121 143 155 156 135 20 93 61 84 187 242 181 96 312 420 280 274 149 150
1983A50J29j05j29P3P9j43J45J07j91m7K05k16L7K87J8k35j08O9n9N4J65j86p6K00%j26J38
$$ 150 279 174 45 118 197 54 199 306 115 68 273 57 94 381 399 164 56 125 66 120 285 99 23 223 223 97 235
1729B35p8P8r7l2J4O6j3P3p4rK2j03L5J09l2m7m1M7J52K92l58J69K47N11J261J1395m645q248
$$ 235 157 235 138 106 120 186 173 246 172 163 185 82 117 226 194 147 106 153 305 597 239 408 655 1166 2427 13822 9177 929
1466I29o35K7m2N8j37J15j64J13k5r5K17k25M4j6R2k8o1q3O0l7OQ6r7o2O5l3P1j3k7J27o2
$$ 929 294 321 279 337 200 315 151 264 239 144 361 136 180 164 256 228 167 84 144 107 113 199 102 40 105 72 143 130 103 230 168
1175A68k0m2J37k07L0k5k3J89j27O5O3j19j8J19M5j27N2L2n5nL6L4j09rM0m0pL3J45N1o8k26
$$ 168 148 106 243 36 66 41 18 207 80 145 208 89 71 190 235 108 160 192 137 132 168 202 93 84 124 84 77 110 255 306 238 12
875A2J45j04J24L1J7r3JJ00r8J0M5k2j38R1L4k4n5j0L9ML9k3m2M0M7l0R6q1l7j6J19j19k6
$$ 12 157 53 177 208 225 132 133 233 135 145 190 168 30 121 155 131 76 66 105 109 148 125 83 123 170 140 236 155 118 102 221 102 76
565G6l6M0L1R7p6o7l7J90q4P1r5J97J81j19o3j46n6k2P0j0l2J08j8P1j36N2q0Q8p4K05q5m1
$$ 76 40 80 111 208 132 65 28 218 134 205 110 307 488 369 306 160 104 82 152 142 110 218 200 271 135 187 107 195 121 326 241 200
264B00J34j38k2l5L5j45MJ04J81r2r5p1j9M4K8k5N0j05J76n4j34MK7K45p4j95J22MJ05j36
$$ 200 334 196 174 139 174 29 33 137 318 226 131 60 41 85 113 88 138 33 209 155 21 25 52 297 223 28 150 154 259 123
-17A23M3r1R8r5j3P5r6J12o3jJ19n2k7L1l7q8J10q0R5m5qR8q7K9K8p9M0N6j59Q3l5j6K0K3
$$ 123 166 75 173 78 65 140 44 156 93 92 211 159 132 163 126 38 148 68 163 118 110 208 121 150 178 99 139 195 36 119 84 68 88 111
-337A11m9j5Q9n5j9L0
$$ 111 62 47 136 81 62 92
-393I2
##PAGE=	F1=-6375.22
##FIRST=	17614.246348710370512,	4405.4455391999963467,	0
##DATA TABLE=	(F2++(Y..Y)), PROFILE
4405D4Q5kMk8j5LK6J20P9n3m1l8q2M6j36J46k2o4M3o8P5l5j8N7Rm3K6K1Mo1P8M0KQ4j37K0
$$ 44 129 127 131 103 88 91 117 237 316 263 222 184 102 148 12 158 136 72 115 47 122 87 69 126 135 92 118 139 143 82 160 200 202 286 149 169
4067A69J54r8o5j6m4k4Q7M7J4j08o7k9R0m0P4m8J97j11k9k3j07Q3p3O2l0J27j44P8Q0j40j1
$$ 169 323 225 160 144 100 76 163 210 224 116 49 20 110 70 144 96 293 182 153 130 23 106 33 95 65 192 48 126 206 66 55
3776E5j6K8K6o6K9N7K02q1p2o8P3j25Q3o7mP0K4j10O0J58J7k02Q8J41n5j71j2O4n3J04L8o9
$$ 55 39 67 93 27 56 113 315 234 162 94 167 42 125 58 54 124 148 38 98 256 273 71 159 300 245 74 62 126 73 177 215 146
3476A46P0n8O4j03k4P7J31j44K2O6j67J93o5J9j11rLK02J7j42j01P3r7kk1J69m8r0O1N1n4
$$ 146 216 158 222 119 95 172 303 159 181 247 80 273 208 227 116 107 110 312 329 187 86 159 62 60 39 208 160 70 131 182 128
3185A28Q6j68j0j8L1K6J43l4j3n2p6R2j19J78O1j30o8P6J04J34o2k51O5R5J29j05O6k14J29
$$ 128 214 46 36 18 49 75 218 184 171 119 43 135 16 194 255 125 57 133 237 371 309 58 123 218 347 242 308 94 223
2912B23k1q9MK9K4r3p1O5Km5P4O9M5k04J51j08J19J6j02P5j13J88j56j7J28N5k39K7M7J41
$$ 223 202 113 117 146 170 77 6 71 73 28 102 171 216 12 163 55 174 190 88 163 50 238 82 65 193 248 9 36 83 224
2631B24j53P1O8J5j10o0J8J4mO3J9qo2q9J18P1L6K8j51Q4j37Q3R4J5j40K76J5k29m3n6k0J
$$ 224 71 142 210 225 115 55 73 87 83 146 165 157 95 6 124 195 231 259 108 192 55 138 232 247 107 383 398 169 126 70 50 51
2330E1J06n0N9o8Q2j07Q6r0K8J19J5j05n6L3k3J41k6j51Q6J7k6m1N0r3P0p5O9J17Jp7j9J70
$$ 51 157 107 166 98 180 73 159 69 97 216 231 126 70 103 80 221 195 44 130 147 121 80 130 37 107 32 101 218 219 142 123 293
2030B93Q7j25Pj56MJ02m2j28Q2Q8j52J10R3r5j07K15k31P3K00N2k35n3O9l7L0J56j62j37K34
$$ 293 380 255 262 106 110 212 170 42 124 212 60 170 263 168 61 276 45 118 318 370 135 82 151 114 144 300 138 1 235
1757B35K4j23J56j74O6p1P9j01J01o6J20n2qRj62Q1J64l5k0r6R3P8L46k93J92L79O34J727
$$ 235 259 136 292 118 184 113 192 91 192 126 246 194 186 195 33 114 278 243 223 127 220 298 644 351 543 922 1556 3283
1495C283J5531o325j1204q33p2J3L6j56J18k10J59p9j07K09j89L4k4Q4j9j19l4J41q7p5J10
$$ 3283 18814 12489 1285 452 380 393 429 273 391 181 340 261 154 363 174 208 184 268 249 130 96 237 150 75 185
1260A85m7l6L5k8P0o3K0N9m4j0n2P2j07k0J1l0J90j29J1J16j26l7J55L5q4L5K1m6l0O8N0j40
$$ 185 138 102 137 109 179 116 136 195 151 141 89 161 54 34 45 15 205 76 87 203 77 40 195 230 146 181 202 156 126 194 244 104
959A04J8lM4l7j2J44J22j41k01J26r9N5L4L3m2k3Q3j19R7l5k9q5N3Q5m1r3K1J00j12P4KK9
$$ 104 122 119 163 126 114 258 380 239 38 164 65 120 154 187 145 122 205 86 183 148 119 34 87 172 131 38 59 159 47 121 123 152
659A52KL8j01P5o3qM1J00j31K3n4k4P8P8j09l0k5J50m4O7j73K39K05j62q2j24Po4J08m5k6
$$ 152 154 192 91 166 103 95 136 236 105 128 74 50 128 206 97 67 42 192 148 215 42 281 486 324 242 118 125 61 169 124 98
368I8J24m8P2m2Qq8Q0p4J47p7QJ14j39Kj2L9j81N0J8K17j09j09kp5P1N3l9O4j33J86j19n8
$$ 98 222 174 246 204 212 124 204 130 277 200 208 322 183 185 173 212 31 81 99 316 207 98 96 21 92 145 106 170 37 223 104 46
67D6J2O6K61j16j94M4N6O7q7L6j03R2j31oQ4m6Q0p7j5J38nj01N8l7n2J08j40J45o2kQ8r2O6
$$ 46 58 124 385 269 75 119 175 242 155 191 88 180 49 43 127 81 161 84 69 207 202 101 159 122 70 178 38 183 121 119 207 115 181
-243A81Oj10N1O9j75Q4ro1P4M9j04K2P4p6L8j8
$$ 181 187 77 128 197 22 106 97 36 110 159 55 77 151 75 113 95
-393I5
##PAGE=	F1=-6445.99
##FIRST=	17614.246348710370512,	4405.4455391999963467,	0
##DATA TABLE=	(F2++(Y..Y)), PROFILE
4405D5N9LJ7j2ppL1J61P4o3o0r8l9K3r0R7j8n3Q1j08M4KJ3N5ro9%N0L1j01P0L4j6R7j61L9
$$ 45 104 107 124 112 105 98 129 290 364 301 241 143 104 127 37 134 116 63 144 36 80 82 95 150 141 72 72 122 153 52 122 156 140 237 76 115
4067A15J85j05l1J2n5n4R5NO1j39k6n1P7J8KK9J32j03n5kr7J03o0M6o1P5p2J27J8j39oNJ9
$$ 115 300 195 164 176 121 67 162 167 228 89 63 12 89 107 109 138 270 167 112 110 13 116 56 102 41 116 44 171 189 50 44 49 68
3758F8Po4O8JK11o6m7j16M1p6J06q9LP2K7j14N0J83M5k42J34J08r3j21jN4j13J70j4q6J42
$$ 68 75 11 79 80 291 225 178 62 103 27 133 44 47 119 146 32 82 265 310 68 202 310 217 96 95 149 36 206 192 106 248
3466B48j12N3j02L4J6J82j37OR7j87J70o9Jp5j0J7J47L0j08r2N4r2k3j0J35Pj08M4M4jM5j12
$$ 248 136 189 87 121 137 319 182 188 285 98 268 199 200 125 115 132 279 309 201 109 163 71 48 38 173 180 72 116 160 159 204 92
3166I2q6J4kP0J36m1q0j4n0R5q5J41N7r6r3O8R7J30l9k40LJ00J50j13P4j88J07p0k7N7k1P0
$$ 92 6 20 18 88 224 183 103 89 39 134 49 190 247 151 58 126 223 353 314 74 77 177 327 214 288 100 207 137 110 167 146 216
2865B16r0j11L7%m1O9Q8Q8j94M0k3R6K8j13J22j34P5l0m5Q2Rj15k4J10Q4j60M1J31l3j40L1
$$ 216 126 15 52 52 11 80 168 256 62 102 79 175 203 90 212 78 153 123 78 160 169 54 30 140 224 64 105 236 203 63 94
2574I4L7k4j6O7m3rl9l2J28RO9L7k03R1j38R4J19Mj60L11k4k16k3q9L2m2R2o2J20p5J56j45
$$ 94 131 107 91 158 115 106 67 35 163 172 241 278 75 166 28 122 241 245 85 396 372 156 133 44 76 34 126 64 184 109 265 120
2274A20L0q1K9R6j3o4m7J6jJ07n0j31J41po2o9J20n9N7j15J12J28o5r5M6J04O3p4nj40L3n3
$$ 120 150 69 98 194 181 117 70 86 85 192 142 11 152 145 83 14 134 75 132 17 129 257 192 97 143 247 310 236 231 91 124 71
1973G1K9m9O8Q2j35P6O4lj21J73j94R1Q0Q2k11j6O3pLJ33j01j62K08N6j06J58k25Qm4J97j83
$$ 71 100 51 119 201 66 142 206 203 82 255 61 152 232 314 103 87 150 143 146 279 178 16 224 280 174 332 107 115 71 268 85
1682H5R2r6J54l2m3M9k05J05J95j0j1j42J34ML54j75J71M88O72K068J8303p473j3154r57j50
$$ 85 177 81 235 203 160 209 4 109 304 294 283 141 275 279 633 458 629 1117 1789 3857 22160 14687 1533 576 426
1448D26N9mj62J24k49J90j13p8J34j23J8l6O6mj26k7K01j03j32J11Nj9J1l5Q9j14N9K5n8j3
$$ 426 485 481 319 443 194 384 271 193 327 204 222 186 252 248 122 95 296 193 61 172 177 158 169 134 223 109 168 193 135 122
1166A22m9LM0r4N3j6J33j27j5J63j45n9J69L2k6J1Jk9l6O3P5j61N7m2J14o1p3J18J81j80j42
$$ 122 73 76 116 22 75 59 192 65 50 213 68 9 178 210 184 195 196 167 131 194 269 108 165 123 237 176 103 221 402 222 80
875H0R6j4q6K1M3Po1R4j47J55r7Jl2pJ22m4m7O1N2j51N4J3Q1qMj38N7l2oQ5Q3j23L8p0o7J24
$$ 80 176 162 76 97 140 147 86 180 33 188 91 92 60 53 175 131 84 145 197 46 100 113 194 186 190 52 109 77 71 156 239 116 154 84 17 141
537A41N7j36k4QR4J6O6j83K10K14k00j01q1O0j26J58l9qR6p3Q2M0p0o0M9l0N1n7K9R0j30L9
$$ 141 198 62 38 46 140 156 222 39 249 463 263 162 81 141 15 173 134 126 222 149 231 271 201 141 190 160 211 154 183 273 143 182
236A82J3M6j89O3m5K06j22p9M4o4O9M6m3O7j38J66j92O9j9R3K63j41j65n1J07J9m2N9j20Q3
$$ 182 195 241 52 115 70 276 154 75 119 55 124 170 127 194 56 222 30 99 80 173 436 295 130 79 186 205 163 222 102 185
-45A85j74pJ05mM4p7j8J35K8j49J06o7nJ15j95J85p5J8M0p1P3%r2RJ03k01Q0K1r8R7Q5j60
$$ 185 11 4 109 105 149 72 54 189 217 68 174 107 102 217 22 207 132 150 190 119 192 192 100 109 212 11 91 112 14 111 196 36
-346C6M4P2o8Q7o8
$$ 36 80 152 84 171 103
-393A03
##PAGE=	F1=-6516.75
##FIRST=	17614.246348710370512,	4405.4455391999963467,	0
##DATA TABLE=	(F2++(Y..Y)), PROFILE
4405F1K3kL6j5K6jJ1J89O9p1p8j48j9L1m0O1Mq7J11j44M3O9j0L8l3n7j5N5M5j19L2K9j4Q7
$$ 61 84 82 118 103 129 128 139 328 397 326 248 100 81 112 72 133 137 50 161 17 60 129 119 157 124 67 52 107 152 33 65 94 80 167
4086A67j25K5J96r5j2M0m7r4R6m5J04r9l5l4L2O2o1J16L1p2o6nm3R6n4L4m2l0nJ76l0j01j1
$$ 167 42 67 263 168 156 196 149 55 151 106 210 111 76 42 74 136 75 191 222 150 84 79 36 132 78 112 70 40 35 211 181 80 69
3776F9L9l3j2n1P7l6J99n4k3j11k0M1N9r0nO6K5j17L5K01N9k05R2O7r4l2j7N5j62K04q2n3
$$ 69 108 75 63 12 89 53 252 198 175 64 44 85 144 54 49 115 140 23 58 259 318 113 205 272 178 146 129 184 22 226 144 91
3476I1J85j73L7j02Q5k8K08j09kJ26j81J05o6j3k3pK4R2L3o7o5j3p5k4K2P6O2j38K5O0J6J7
$$ 91 276 103 140 38 123 95 303 194 192 318 137 242 176 163 140 133 157 249 282 215 150 137 62 38 60 136 198 60 85 145 161 178
3175A78k8j07K8j0J23N9n9j20Mj1P1n0Q7N2n7j02L3R5J45k3k28lN6J51j11O0j34P1j21M2J20
$$ 178 150 43 71 61 184 243 184 64 68 57 128 78 165 217 160 58 91 186 331 308 80 77 133 284 173 233 99 170 49 91 211
2884B11p4J17q0j38qJ2oJ8R4J20j44q4N5O6K9j22J65r1p9J03o5L5l2Qm5J13K5j26%J82o8j76
$$ 211 137 254 174 36 28 40 34 52 146 266 122 38 93 159 188 66 231 140 61 164 99 134 102 110 65 178 203 77 77 259 191 15
2584A5J18M1n3j5O7r8J0n9N3J23n5J01K1k31Q4j07J24R5pj71K98n1j79qq4R0j02Q5p7J67q0
$$ 15 133 174 121 106 173 75 85 26 79 202 147 248 269 38 122 15 139 234 227 56 354 303 124 116 32 122 20 105 28 195 115
2293A15K06j69k4q0K3J08o0nn1j2K4P8o8n7J59m5p2J6M9KL1j31J09J39j24r3P8M1M9j8k8o7
$$ 115 321 152 128 48 71 179 119 114 63 51 75 153 85 28 187 142 70 86 135 137 168 37 146 285 161 68 146 187 236 218 190 123
1992A23N1k3o5k0L4O1q9M8L8N5r5R5j20Q0l6J10j68lM7J1jR6j7j77J61P8n9J29k43n9j4K94
$$ 123 174 151 86 66 100 161 72 120 158 213 118 213 93 173 137 247 79 76 123 134 133 229 212 35 196 274 215 344 101 42 28 322
1692C22k02K3p2J50k1j07J36k07P2K10K0j4j47J38m6L06l3J16N41O25K199J9022p791j3639
$$ 322 120 143 71 221 200 93 229 22 94 304 324 310 163 301 255 561 528 644 1185 1810 4009 23031 15240 1601
1466A601r60k02R7n9j47J22k74K13j29k9L4m9Nm7K8K4r0n7K21q3j33P3M1kkn2J18j46O8J3
$$ 1601 641 439 536 477 330 452 178 391 262 233 267 218 223 176 204 228 138 81 302 219 86 159 200 198 196 144 262 116 184 197
1185A97r0nm2n3J54j00N7j4P1j27J7J65j84k7J16M3L9j4l4j1j1K8R4j59R8p2J50o8j35P3K16
$$ 197 107 102 60 7 161 61 118 104 175 48 65 230 46 19 135 178 217 203 169 158 147 175 269 110 208 136 286 218 83 156 372
894C72j86p4P7M8j81J0K3L8r1J32j52J37q6K6no2J41m0J7P7kj20nmJ12kl3j25N3j1l0J01O9
$$ 372 186 112 189 237 56 66 89 127 36 168 16 153 67 93 88 26 167 127 144 221 219 99 94 90 202 200 167 42 95 84 54 155 224
584B24r8L2p2p1J44M5j69j5N9NP6O0j54J59J91k22j14k4R0j03J24Qk1N3r5J10J00j61rNK7
$$ 224 126 158 86 15 159 204 35 20 79 84 160 220 66 225 416 194 80 56 146 43 167 175 154 207 112 222 322 161 152 157 184
293A84l7k9RP0j04O8L6O1j76N3q5J53r6k3L3n5J01K7m1N1j38J42j35Q8p2J04K54j43j33j07
$$ 184 147 118 127 197 93 161 197 258 82 135 50 203 107 84 117 62 163 190 149 200 62 204 69 157 85 189 443 300 167 60
11F0J17j7oR5j34P1j52J7L4K1J2n9oR8M5j31J23j02L6J21k33K21p8K1j7m5P1J9n4m6J34j77
$$ 60 177 160 154 249 115 186 34 51 85 106 118 59 53 151 196 65 188 86 122 243 10 231 153 174 157 112 183 202 148 102 236 59
-290E9J4M1j11R1J22j95L4Q3m4J23j17
$$ 59 73 114 3 94 216 21 55 138 94 217 100
-393A00
##PAGE=	F1=-6587.52
##FIRST=	17614.246348710370512,	4405.4455391999963467,	0
##DATA TABLE=	(F2++(Y..Y)), PROFILE
4405I2j9j8O7m7P1K2k7K02O1p4r0j78j8N8QL9L2j24J11j38O0R3m4J0o0j7ML1L4j15j9M5J7
$$ 92 73 55 122 75 146 168 141 343 404 330 240 62 44 102 110 149 181 57 168 30 90 183 139 149 89 72 76 107 141 26 7 52 69
4096F9K1j1l6J83o2k7N9j5j38R3r8J33k6o4k0J0Q4j10J88p5l0n5j3jQ7n3K5jn5l6K15n9m9
$$ 69 90 79 43 226 164 137 196 181 43 136 38 171 145 81 61 71 155 45 233 158 128 73 60 59 146 93 118 117 62 26 241 182 133
3786A33k6M6o2l0m0O1k9J47m0Nn4o5P8L0q0j6P6jq5MJ89N7j22J1jm4N2k9N2j45J57j48L0J87
$$ 133 107 153 91 61 21 82 53 200 160 165 111 46 124 154 74 58 134 133 48 52 241 298 176 187 186 142 194 165 217 72 229 81 111 298
3466B98k34M0q3Q3l1J81n7jJ42j50J7n9j9L7nK2N4J6j9l8j03n5MM6K0J13j68lJ05j7jP1j19
$$ 298 64 104 21 104 73 254 197 196 338 188 205 146 127 164 159 181 235 251 232 194 91 36 40 86 106 219 51 48 153 136 135 206 87
3157H7L7oJ51lp5j42QK8J7oL0M1j6r9j3J06J66k3k05M4l5J38q7Rn8L1q1K8J65j17J57p1j44
$$ 87 124 118 269 266 191 49 57 85 102 96 126 167 151 52 39 145 311 288 83 127 92 230 143 152 94 125 44 72 237 120 277 206 62
2847F2m9K2J6k8R1J31p5r1K3K9J9j32K03n3j36J65p1j2MM1q7J15k1q1oJ90r4r2P8K4o1LO3
$$ 62 13 35 51 23 114 245 170 79 102 131 150 18 221 168 32 197 126 114 118 159 72 187 166 85 79 269 175 83 161 185 124 127 190
2537A90j37N7n4O5J07r0J13j3k20N0l5J40L4pj63K26n9j25Rk9R5j29J09n9J21q8K20j68o7
$$ 190 53 110 56 121 228 138 251 238 18 68 33 173 207 200 37 263 204 79 88 59 154 25 134 75 196 108 328 160 93
2265I3o7nJ48j15P4p4l9L9O0p0K7J58q5n6N4j0P9nj49Q8J50j67l8L9ON6km5K4M6Q6j26r6j0
$$ 93 26 21 169 54 128 54 15 54 114 44 71 229 144 88 142 132 211 206 57 145 295 128 90 129 135 191 189 144 168 214 300 174 78 68
1945F8L2k3K8L3O7m8Kl3M9j05J28j29pK7jM0L5O7j74J12O9J6P6k51l8PL00j91n0qJ09j7j85
$$ 68 100 77 105 138 205 157 159 126 175 70 198 69 62 89 88 128 163 230 56 168 237 253 329 78 40 47 347 156 106 98 207 190 5
1635EK36k17M7K14L5k4j01J00o8K13J00M6N21N07K085J7501p189j2545q31k23J19j16j10J07
$$ 5 241 24 71 285 320 296 195 295 227 440 540 586 1107 1614 3699 21200 14011 1466 635 412 531 415 305 412
1410D12k76K26j31K2l9Nln7l0O7n1q8J92l2p8MN6J7jp4J36j46N0%j14K8m4j2J34p4N8j8K3
$$ 412 136 362 231 253 214 219 216 159 129 196 145 57 249 217 139 143 199 216 215 141 277 131 181 181 67 95 51 39 173 99 157 139 162
1100A62j24M3J56k07KM1O4J00l1q6MM8k3R6j34J30r4J52n4j74NK23j65mO6Q1k27N0m3L6m2
$$ 162 38 81 237 30 32 73 137 237 206 120 124 172 149 245 111 241 147 299 245 71 76 299 134 130 196 277 50 100 57 93 51
809E1J16j12L5J6j7K6j12J48l1P0Q0m4r0l3m1J20J5n4p5N9rn5P2O0o1K2m3p0J46M2j91L9N6
$$ 51 167 55 90 106 89 115 3 151 120 190 270 226 136 103 62 182 197 143 68 127 118 63 135 195 134 156 113 43 189 231 40 79 135
499A35n3Q5L3j30J44J36k25q7J2Q7l5N8O8o4Oj09J49J38k39M6l6O3o9J1p0O3k9L4N3R1j51
$$ 135 82 167 200 70 214 350 125 38 50 137 102 160 228 164 170 61 210 348 109 155 119 182 113 124 54 117 88 122 175 266 115
208A15K7q7N9K0k8j0l0J29J3m1J4j26J17j6N0j32R9K39j24j09j09P3j7J1J31j43N8j18N2n6
$$ 115 142 55 114 134 106 96 66 195 208 167 181 55 172 156 206 74 173 412 288 179 70 143 126 137 268 125 183 65 117 61
-74F1J9j0k2K1K4N1n1R5j25N8J19k25K35p3nn9l3Q8N1l2p9J52j40o7N2r7O1J49j53m9R8j8
$$ 61 80 70 48 69 93 144 93 188 63 121 240 15 250 177 172 113 80 168 219 187 108 260 120 53 105 8 69 218 65 16 114 96
-374I6J41j60
$$ 96 237 77
-393G7
##PAGE=	F1=-6658.29
##FIRST=	17614.246348710370512,	4405.4455391999963467,	0
##DATA TABLE=	(F2++(Y..Y)), PROFILE
4405A36o3m9J12r5J07N3o9J99N1p2r4j67k8P1M9K8M9j39Q9r7N4J00p3j9q7L4L7QLj04M9JJ8
$$ 136 73 24 136 41 148 201 132 331 382 310 216 49 21 92 141 169 218 79 168 71 125 225 152 133 46 80 117 125 128 24 73 74 92
4096I2p3Q1o0J59k5o2O6L8j80Q7r6R0M2q1j3J2Q3j28K23j50ml4mJ6P4n4J7L5l3r1K27p3Jm5
$$ 92 19 100 40 199 174 112 178 216 36 123 27 117 159 78 65 77 160 32 255 105 101 67 63 79 153 99 116 151 118 27 254 181 182 137
3776A37L2n2m9l8K9K0N8j9M4Oq5N4K5o7j4J03n2m3qJ34M4k1n2j18N9J04l1L9j23R3j86J10
$$ 137 169 117 68 30 59 79 137 118 162 168 83 137 162 95 81 184 132 89 81 215 259 238 186 68 127 231 200 239 116 209 23 133
3476A33J77k83P8k8mK9Q2PQJ37r8o6n1k2R3j4K0L6j9L3j7j80m4M3N5qJ42j78m9J71q6j7J69
$$ 133 310 27 105 77 73 102 184 191 199 336 238 172 121 99 192 178 198 234 215 248 231 51 7 50 105 97 239 61 12 183 97 80 249
3166B49j19L6lJ55m0o4j65OO4o0M3k2K6K4p5k3R9J65m4j63Q5j11J15k6q4K2RL0m3J65j54J86
$$ 249 130 166 163 318 278 214 49 55 119 59 102 80 106 130 55 32 131 296 252 89 174 63 178 152 68 90 99 129 86 251 97 283
2865B83o8j34n9NL4k9O1J07jm9l9j2J8o8J44l6o2J29o6o2Q9Qj43J20m2n7K7J61j14QK0j3l9
$$ 283 215 81 22 27 61 32 93 200 199 150 111 99 117 49 193 157 95 224 158 96 185 193 50 170 128 71 98 259 145 153 173 160 121
2556A21L2M8j51R6k7K9Q4q3R5m7j65j8L6J54m4J8j21J04o0o7M9LP4j22J45o2O5r6J91j40q9
$$ 121 153 201 50 146 119 148 232 149 244 197 32 14 50 204 160 178 57 161 101 34 83 86 160 38 183 121 186 90 281 141 52
2265E2j7LJ25j37J31j05j2pN3n1Q1J57j21m6O0l1J45m6j65N8J64j98M4m3K5P7n5m2J02K4R4
$$ 52 35 38 163 26 157 52 40 33 86 35 116 273 152 106 166 135 280 234 69 127 291 93 137 94 119 196 141 99 201 225 319
1973C19j36j04m7PM2PN2N8rp5M0Ko3R7j29KK9o9J25n2J28j52R0J2J08J1k36L4lK58j76r3N4
$$ 319 183 79 32 39 81 88 140 198 189 114 154 156 93 190 61 63 92 23 148 96 224 72 162 174 282 293 57 91 88 346 170 77 131
1664A31O4j7r8J43j94L8J91K1l2k3L7p3J09J92j3M23L54J750J4114n810j0148n96k14J24j62
$$ 131 195 178 80 223 29 67 258 279 247 224 261 188 297 489 476 899 1253 3003 17117 11307 1159 563 349 473 311
1429C11n8P8k54K28j22O2m5K1j5o6j03J26l2j04J20M1K1q0M2M3J3r8J32j18K5k9o9L6o2J3
$$ 311 253 331 77 305 183 245 200 221 206 140 37 163 131 27 147 188 209 129 171 214 227 129 261 143 168 139 70 106 44 57
1147E7R3k1N5k8%r4J5J47j67k5j1P3J42l7j43K1J29p3O8q6J39j01J17j9j67p7J93j23N9N1
$$ 57 150 129 184 156 156 62 77 224 57 32 21 94 236 199 56 77 206 133 201 115 254 153 270 251 84 7 200 77 136 187
865A87R3k38J11o7pK9N6q2k9R2q3P4j13J13j4R2P5o3q0k8q1J08M0l8m5O7kq5K3N8k4K3Nj04
$$ 187 280 42 153 86 79 108 164 82 53 145 62 136 23 136 122 214 289 226 146 118 37 145 185 147 102 169 167 82 105 163 139 162 167 63
546F3J57M0k08P9N8n9M9j6j03J56O0k10J9k4N3L1J2J16j12n3r9J76J60k66P0o2N8j7M5j50
$$ 63 220 260 52 131 189 130 179 163 60 216 276 66 85 61 114 145 157 273 161 108 9 185 345 79 149 87 145 128 173 23
264B3M8P1o4O0J27j21ln7k0J26o8m5K8J07J3m4m6q6Q3Q9J4j73P0K24q8j03r2K0J7J2J52j40
$$ 23 71 142 78 138 265 144 141 84 64 190 122 77 105 212 225 181 135 49 132 221 235 62 132 356 268 165 73 93 110 122 274 134
-36A34M7j02J00j23j8k4K4N2o8M9M5M9j23N8J05j53K09o3o2o1l8J39N7l4q9J67r2j51N5o9
$$ 134 181 79 179 56 38 14 38 90 22 71 116 165 42 100 205 52 261 198 136 75 37 176 233 199 110 277 185 34 89 20
-318B0K8J60q3q1M2%J38j88
$$ 20 48 208 125 44 86 86 224 36
-393C6
##PAGE=	F1=-6729.05
##FIRST=	17614.246348710370512,	4405.4455391999963467,	0
##DATA TABLE=	(F2++(Y..Y)), PROFILE
4405A87j07o3J33j13J02P5r5J76L5o5q8j20j8L8Q3J7N3j41P6n7L4J04r3k8j07O7P8om2q6J01
$$ 187 80 17 150 37 139 214 119 295 330 265 177 57 39 77 160 177 230 89 165 108 142 246 153 125 18 85 163 157 115 29 130
4114A30k9no3N1m1J43rr1P1R5k16Q0m7oQ4p1k3K8O8j00K05j53l1rML1N7n4%O2j2j19K18q3
$$ 130 101 96 33 84 43 186 177 86 157 252 36 116 69 63 147 76 53 81 149 49 254 101 70 61 65 96 153 99 99 161 149 30 248 165
3795A65M8o1MJp9m3qQ0l9J6Q7N1j12J9L6o0J6J24j05j3j0O4L4O7o5j54P3J14j7J2j03K9j06
$$ 165 213 152 156 157 78 35 27 107 68 84 171 222 110 129 165 105 121 245 140 127 117 181 215 282 217 63 136 250 233 245 142 171 65
3485F5P6J65k86J06qq2J16l6O3J7J10l2j15m5k9J37m3K3L6o3P8%j79l5J8O0j2J43j61p1K00
$$ 65 141 306 20 126 118 36 152 116 179 196 306 274 159 114 85 222 179 202 238 175 253 253 74 39 57 117 105 248 87 16 216
3194B16j40n1K46j05K2kJ44o6k1j78oR1r0M3o5PO6k8jP1J30p6j15J02j36P9O1j29K3J5Q2o3
$$ 216 76 25 271 166 188 186 330 264 243 65 59 150 60 103 38 45 111 83 82 153 283 207 92 194 58 137 198 69 92 107 189 126
2894A26J35j92K09p3j19m8j2N6qK4N2N8pq2m3N2j2N3m7J3J10n4j12J63l6j71J06l2p2P6J14
$$ 126 261 69 278 205 86 38 26 82 74 98 150 208 201 119 76 128 116 169 122 135 245 191 79 242 206 35 141 109 37 113 227
2603B27j24J01m0n9K6N0J9j36J10lk0O1m6N5n8j28nK8J57j13P6q2M9p4m2Q6j6L7r1J70p1K0
$$ 227 103 204 164 105 131 181 200 64 174 171 151 212 166 221 163 35 30 58 215 102 178 96 145 71 29 115 99 136 45 215 144 164
2302A64q0J07r3n2LM4O7r2J17j26Km5O5l7J19J48j47n3M7oJ76q8j64K2J79k13J14j28Q3Q7
$$ 164 84 191 98 46 49 93 160 68 185 59 61 16 81 44 163 311 164 111 158 152 328 240 76 98 277 64 178 50 133 220
2020B20j42k0J53pl5j00Jm4K4L5j7P9N9Lr9O8n4J4O8j60K9N5n5J06j35J51j19J02p1J82m4
$$ 220 78 58 211 204 169 69 70 26 50 85 68 147 206 209 110 178 124 138 206 46 75 130 75 181 46 197 78 180 109 291 247
1729B47j45K3j0K13j71j02J00K7j4l0K7j07M4J31k1l4O0k7p0L2K11l9K66K04J271R680l990
$$ 247 102 125 115 328 157 55 155 182 168 138 165 58 102 233 212 178 238 211 141 173 384 345 611 815 2086 11766 7776
1476G776p017l16j75J05j80lM4k19K15r9P9RJ0l1p6o2P9k7j02J5J22J33j53oP7L3j23J08o9
$$ 7776 759 443 268 373 193 190 234 15 230 131 210 219 229 198 122 60 139 112 10 25 147 280 127 121 198 231 108 216 147
1203A47Po8M9j2q4L3M1L7M4l6Jn0n5J40j01p1N1j0J45l1j47M2J73j10J4k4J12p8M9K5j20m2
$$ 147 154 86 135 123 39 72 113 150 194 158 159 109 54 194 93 22 73 63 208 177 30 72 245 135 149 125 237 159 208 233 113 71
903G1K8m3P3L2Q9k28J74n6k8L7Jn3J0N3j44J31r4P6PP7O8n2j03Lj07Q1P1Jm2O7J0j25j2P0
$$ 71 99 56 129 161 250 22 196 140 112 149 150 97 107 160 16 147 53 129 136 213 281 229 126 129 22 103 174 175 133 200 210 85 73 143
584A43qM3M5j51J64L1k23J13O5n7L2p2o7J70j6j84J01m6nQ4KJ35j36j30K0Q8J70k17M6p0P
$$ 143 135 178 223 72 236 267 44 157 222 165 197 125 58 228 212 28 129 83 78 162 164 299 163 33 53 141 311 94 140 70 77
293G7Q4P0j47jJ13j35M4J53q9l1k7qJ16r2m5Q3M4L0m7j24j2L4J60j1j76K0K03l8j16q0kN0
$$ 77 161 231 84 83 196 61 105 258 169 138 111 103 219 127 82 165 209 239 192 68 56 90 250 239 63 83 286 248 132 52 50 100
-8A00QJ60j29M1j05J48j41n8L5l2P9n7k9R7Lr4L8Q1m9J71n6j34NjJ34J9o0q2J87l6k13N1n0
$$ 100 108 268 139 180 75 223 82 24 59 27 106 49 20 117 120 26 64 145 96 267 211 77 82 81 215 234 174 92 279 243 30 81 31
-318C1K3J38j0j01k2PJ14j49
$$ 31 54 192 182 81 59 66 180 31
-393C1
##PAGE=	F1=-6799.82
##FIRST=	17614.246348710370512,	4405.4455391999963467,	0
##DATA TABLE=	(F2++(Y..Y)), PROFILE
4405B37j50l1R6r0P1O7r3J34J4n7o7o5j2jJ08MM4j34Q3k8OJ02r9mq7L8J24j9r4n7J24n7l4
$$ 237 87 56 152 62 133 200 107 241 255 198 131 66 54 53 161 165 209 75 158 130 136 238 139 135 48 86 210 191 97 40 164 107 73
4096G3j4k7K4J26j7j03R2J27k41P5k7l6O4k7n8M6N1n0J48j01p9K4j6O4L3n9k6P8Nj25K00r3
$$ 73 59 32 56 182 165 62 154 281 40 115 88 52 116 89 31 77 128 78 226 125 46 70 54 118 151 92 66 144 149 24 224 131
3795A31R2p0j3O4j18n1J1Q0j18O3J13Q0j41kM0o1O9J23j37%j1jL5J14l9q4k2J00Qj9r3oj7
$$ 131 223 153 140 204 86 35 46 126 8 71 184 264 123 121 161 100 169 292 155 155 144 143 178 292 253 169 147 247 255 236 143 137 120
3485A20J9J44k38R4Jj11J63r8P0J8O5M1j22m0m4J65q9L0N1j04J07J3j37m5j6O3kJ21j24q5
$$ 120 139 283 45 139 140 29 192 94 164 182 247 288 166 126 82 247 158 188 239 135 242 255 118 73 57 120 118 239 115 30
3204C0K05j39n9K30p8%oJ30r2M0j73k4J06m2j5q0%P5J3jO5Q4j05p9R6j10M0J45j19m1K7R3
$$ 30 235 96 37 267 189 189 183 313 221 261 88 64 170 128 113 33 33 108 121 120 185 269 164 85 181 71 111 256 137 96 123 216
2903B16m9J08k34K32q2j13k3jP1moNQ1J7r9n1R5Qmo8M9J09m2j53K07p7j08L3nq1Q1O4j20J66
$$ 216 167 275 41 273 191 78 55 54 125 121 115 120 201 218 119 68 163 171 167 99 148 257 215 62 269 192 84 117 112 31 112 176 56 222
2584B22q9o1J07K9k3r5J01J2p6M7N%k7j33M0LJ35j47J42n5Q6r2p4J01n9j2m5J70p1ok5l1l6
$$ 222 133 72 179 208 185 90 191 203 127 174 179 179 152 19 59 62 197 50 192 137 223 131 57 158 99 87 42 212 141 135 110 79 43
2274D3M6l6Q1K6o0R9j31j0m8R4l4J38J28j61p6L0M9J63j24j35j4J91k15J58j93J34R1k03p
$$ 43 89 53 134 160 100 199 68 58 10 104 70 208 336 175 99 129 178 341 217 82 68 259 44 202 9 143 234 31 24
2002B4J71l7j9K2j04J1K9om2J09O8j1p8N8j07P6N1j83N3Q2j2N7j77J21q4J32r5J68p4k9l3
$$ 24 195 158 139 161 57 68 97 91 49 158 226 215 137 195 88 164 215 32 85 167 155 212 35 156 72 204 109 277 203 174 141
1711A41j4J74j78r2J38pmkq2K0N3O9q2k0J16o8o8M6J16k4P8R1P50N203k143l840o4j14O7j67
$$ 141 127 301 123 31 169 162 158 156 74 94 147 216 134 114 230 162 94 140 256 232 310 401 1151 6354 4211 371 307 193 260 93
1429I3N1K8j36J12n6O9P5nl7q0L6j9j1o7N9J3K13j95q0J15M7j48P9qkq0J35o9r5O6lO6K5m1
$$ 93 144 172 36 148 92 161 236 231 194 114 150 131 120 53 112 125 338 143 63 178 225 77 156 148 146 66 201 132 37 103 100 166 191 150
1110A50J6rj33J34l5j16J17o2R6k5n8N0J61j37n1M2N0k4l7O4n2j8n4L4OJ1P8j87K07l1l5J0
$$ 150 166 157 24 158 123 7 124 62 158 133 75 125 286 149 98 140 190 166 129 193 141 123 69 103 109 120 198 11 218 187 152 162
809A62l3k9O2mj19J09o3M1K4L8O5j0j56M5j14M5J03L5m3N5J7j68j0Q6j7P0P0j89J52J6k24
$$ 162 129 100 162 158 39 148 85 126 150 188 253 243 87 132 18 63 166 201 158 213 230 62 52 138 121 191 261 72 224 240 16
518A6J36P2n7M6q9m6J64o5j52J27m4p2J16K7J24j25j18K6lJ68j31J4n5n9J60R3j49k3J25j39
$$ 16 152 224 167 213 124 78 242 177 25 152 108 36 152 179 303 178 60 86 83 251 120 134 79 20 180 273 124 101 226 87
236H7J0J46n7m7j8J8O8q1k5J19l5O3m8j82N7k1J85k2j43k1J62J7j42q2M6J9K4J52j13L3j02
$$ 87 97 243 186 139 121 139 207 126 101 220 185 248 200 18 75 54 239 217 74 53 215 232 90 8 54 73 97 249 136 169 67
-55F7J68j19n1N3r5R0ml0J4l4m0OM7O8J35o2j54O5L6J00m6r9o5K07K9k34L5m9M4R4M7j24o4
$$ 67 235 116 65 118 23 113 109 79 93 59 19 25 72 140 275 213 59 124 160 260 214 115 50 257 286 52 87 38 82 176 223 99 35
-365C5MP6l1
$$ 35 39 115 84
-393H4
##PAGE=	F1=-6870.58
##FIRST=	17614.246348710370512,	4405.4455391999963467,	0
##DATA TABLE=	(F2++(Y..Y)), PROFILE
4405B71j86J1L8o3O6K7p0Q6j3m8k2k8jl7J13j7L9j17J02j9j7Q5q8M4p8OJ69l4j46j9J15p2
$$ 271 85 96 134 71 137 164 94 180 167 119 97 69 68 31 144 127 166 49 151 132 115 200 112 156 78 84 253 219 73 54 169 97
4105I7o2K8k0L4J02m0r6J29J20k48P1l2jOK7r8M7L8QO6m6q1N5o5J10Op1o3Q3K1j04J65j06
$$ 97 35 63 43 77 179 139 43 172 292 44 115 83 82 88 115 17 64 102 110 176 130 49 104 39 149 155 84 21 104 125 21 186 80
3795H0J37o3PQ9j65n6O8L2n2MJ08J02j64MK1o8J25R5j34jj0n0M4J10Ol3r9Q4L9m6r2J8K0k2
$$ 80 217 154 161 250 85 29 97 129 77 81 189 291 127 131 152 84 209 304 170 169 159 109 153 263 269 236 137 221 260 214 122 140 160 138
3476A38J08j79P8jp3J39q6K9%J5J07r5l7n9J78j35L1Q0j29J04L0r2n3m5O2RQ6p0j07K00j11
$$ 138 246 67 145 144 71 210 124 153 153 168 275 180 143 84 262 127 158 238 109 213 243 151 98 53 115 124 210 140 33 233 122
3185A22m7J64m2k3j2J18j25R7j50l0J00K6o4p8K6L3L6j2P0M3j08p5O5m8J8K04j23r1L0Q5j0
$$ 122 75 239 197 174 162 280 155 252 102 72 172 198 134 56 82 115 151 139 209 252 144 69 134 86 104 308 185 94 124 209 199
2894A99R2k49K34r0j25QK4Q3j3m1KO6J0r8l5J14J9k1o1K0J17l5j71K14j11j2l5K2m5J5J8r4
$$ 199 291 42 276 186 61 69 93 176 163 122 124 190 200 102 67 181 200 179 118 138 255 220 49 263 152 140 105 127 82 97 115 21
2593B1J82j18L9J31k3o6m3P2J3j23M3N6n9L6j41M9RP0q9J43k6J14j13r7J12r2p5MJ44n3j4
$$ 21 203 85 124 255 232 166 123 195 208 85 128 184 125 161 20 69 78 148 59 202 176 290 177 80 192 100 25 29 173 120 106
2302A06M5j19k2J19p7J02Pm5P4j19l4NJ08l5J27R8j65r8K1R7J17j45p7m6J90k03J72j76J09
$$ 106 151 32 10 129 52 154 161 116 190 71 37 42 150 115 242 340 175 77 98 195 312 167 90 44 234 31 203 27 136
2030A36R4j66o0J52n4L01m0l10O4K2l8n2J26O3l3m6M5j36J11L5j69M3R8L7J4j95P6o3J66n2
$$ 136 230 64 4 156 102 403 363 53 117 139 101 49 175 238 205 159 204 68 179 214 45 88 186 223 237 42 118 55 221 169
1748A69P8p7O5q5k3J49j93n2J41m0J2mj09R0O1K6j43J4J25p9o1J18k5Mj00K9K93J566o42j146
$$ 169 247 170 235 150 127 276 83 31 172 132 144 140 31 121 182 208 65 79 204 125 64 182 157 161 61 90 383 1949 1307 161
1466A61L3m6L1j35R1M8j09mRL8J12j7j9p0J00q6J9n5J15p5K27k03j46J42M5j65O2N1j4l7J36
$$ 161 194 148 179 44 135 183 74 70 79 117 229 212 193 123 223 137 156 101 216 141 368 165 19 161 206 41 103 154 140 103 239
1175B39j15r0R8rN4Pm7L1K4j67J11J4j41J47o9Mk0L1P4J48j65j02R6l0N0j15P9J9Nk3K3q3
$$ 239 124 34 132 123 177 184 137 168 192 25 136 150 9 156 87 91 71 102 176 324 159 57 153 123 173 58 137 156 161 138 161 78
875G8nP0q7J62jm8j9l4k4J01l2q3O7l0OL1j1P1N6j99N3r0pJ35M3l3L3J3j89M4O8m1R4Q2k01
$$ 78 73 143 56 218 217 169 150 116 92 193 161 78 145 115 121 152 141 212 268 69 122 32 25 160 203 170 203 216 27 71 139 98 192 274 73
546G3J09jj28O5P6n9Q4n4n7J46q6j32J22l2r3R5O7R0r0o5m0o8J52m3Mk5j0P5J12j46l0J15
$$ 73 182 181 53 118 194 135 219 165 108 254 168 36 158 126 33 128 195 285 195 130 90 22 174 131 135 110 100 175 287 141 111 226
246B26j16lJ12k9m9l0L0K2l9rJ38j10J03m2j13J3o5J54j6r4j2Q3O7j68oK9n2O9J27r6J2o2
$$ 226 110 107 219 190 141 111 141 163 124 115 253 143 246 204 91 104 39 193 177 83 71 154 221 53 47 76 24 93 220 124 136 74
-55G4J36o7m8O8j19O8L7k7p2l8J4pqJ66J11q2q7M5N9O0j10j42j8J99R8k30J6n7P3M9P9j44
$$ 74 210 143 95 163 44 112 149 122 50 12 26 19 11 177 288 206 119 164 223 283 173 31 13 212 310 80 96 39 112 161 240 96
-355I6p9lL5P9
$$ 96 17 14 49 128
-393A28
##PAGE=	F1=-6941.35
##FIRST=	17614.246348710370512,	4405.4455391999963467,	0
##DATA TABLE=	(F2++(Y..Y)), PROFILE
4405B78k07O1l6m2R3l3m2N3m0m2O2l2K3n2P3m5O2o5Q1l3j4K9m9R2p7j7J99m3j88J9P6o2l0
$$ 278 71 132 96 54 147 114 72 125 85 43 105 73 96 44 117 72 134 69 150 117 103 132 83 175 98 81 280 237 49 68 144 82 52
4096E2KP3l1P5o4p6J57Q6k22O0m3K9k0N9j02J3L5N2k4pl5P6r8J34j7q0n0J9L4m6J01j21J82
$$ 52 54 127 96 171 107 31 188 274 52 112 69 98 78 137 35 48 83 135 111 104 69 145 47 181 164 84 34 53 87 41 142 21 203
3786B03l3M4P4k13n4J24k9K8m5Q0J18j72L3j7p5J59N0r7qoq2N2O7N9oj56P9O6o1r5R3%l8O8
$$ 203 170 214 288 75 21 145 116 144 99 179 297 125 158 141 66 225 275 178 170 164 82 134 201 260 254 98 177 243 182 87 180 180 142 210
3466B10j31P0j1j7Q1m8ll7k7J49n0l1p2J82j44mJ21j28N9N5m9o2n8M7J7M8rj26J79q2l0R0
$$ 210 79 149 138 121 202 154 151 114 87 236 186 155 83 265 121 117 238 110 169 224 175 113 55 102 119 167 158 32 211 129 99 189
3166A89Mm3j7J09j64J34j13j6P1R4q9q6O0j9N4k8Q1J0p7r0kL9J2K30j40j21K7O7M1Q4k20K05
$$ 189 193 150 133 242 78 212 99 83 154 248 159 73 133 114 168 140 221 231 154 64 62 101 113 343 203 82 109 176 217 301 81 286
2865B86r7j49L3N7R0k9q1K9L9k4q4oJ00L2j4l6l7J24l1j60J89j38Q4q1N8k1o0j5k7J21j17
$$ 286 189 40 73 130 220 191 110 139 178 154 70 64 164 196 182 146 109 233 202 42 231 93 177 96 154 133 73 58 31 152 35
2574C5J55J45q8q7jK9Kj40L4R9j13J03j04mN6l7J8R1J5J06j18r8J09r4p5j0Q6k2lJ02p4o4
$$ 35 190 335 247 160 159 188 190 50 84 183 70 173 69 65 121 84 102 193 208 314 196 98 207 113 38 28 114 92 89 191 117 53
2274E3R9r6R4J4m6M4j04m7P5J22m4R3O1j62j08M7J00M8j42oo5J73j85J67j39O5R6j12p5Q4
$$ 53 152 56 150 164 118 162 58 11 86 208 164 257 318 156 48 95 195 243 101 95 30 203 18 185 46 111 207 95 20 104
1992A04n4M41p6l56J05J7p2l9J22L8m6k7M4j26J26J6j46J4J03Q3j1k17N4o0J95pro0J13j09
$$ 104 50 491 415 59 164 181 109 70 192 230 184 157 201 75 201 217 71 85 188 271 260 43 97 37 232 225 216 156 269 160
1711A60l6J33k01J5R5p0K8j7J1J2P0Pj81L6J05n6l9J40n9j8pm8O6P13l38k81r5j0L9j32J04
$$ 160 124 257 56 71 166 96 124 107 118 130 200 207 26 62 167 111 72 212 153 135 128 80 146 859 521 240 145 135 174 42 146
1419A46P2j15q0P1J8Q4l2K8m8J31j20L7m6J32j10J95j85j36J02K8j45P0P6m4J6R0j38o6J08
$$ 146 218 103 23 94 112 196 164 192 144 275 155 192 146 278 168 363 178 42 144 172 27 97 173 129 145 235 97 31 139
1147A39jM2nn6L4M9j55Q7M1j54J50n2q4oP3J02J52j97j29J23j01J24j46M6P9L2K2Mj73QP1
$$ 139 138 180 175 119 153 202 47 134 175 21 171 119 35 29 102 204 356 159 30 153 52 176 30 76 155 187 209 213 40 48 119
856A19j1R3K4p3k4kn0J23j6r3N8ql4K8n6Q6J32j81k0l0l6J27K1j3Rmj07N5J7n5J07P9j71K0
$$ 119 108 201 225 152 128 126 76 199 183 90 148 140 106 134 78 164 296 115 95 65 29 156 177 164 173 169 62 117 134 79 186 265 94 114
537A14nKl3O4o3J29Kp2J17r3j13J11k7n7L9R1M5n0k5j10l0O6K2J3RK3k1J21j21k0P2r0%P5
$$ 114 109 111 78 142 79 208 210 138 255 162 49 160 133 76 115 206 251 201 176 66 36 102 124 137 146 169 148 269 148 128 200 110 110 185
217A85om6m1K8j3J4oJ42j63J34k8m3k1q9Q2Qm3NJ5R5j70O2k1m1O6Q1p6l7J5O3Lm4P6j05K9
$$ 185 179 133 92 120 107 121 115 257 94 228 200 157 136 47 129 137 94 99 114 209 39 101 80 39 105 186 110 73 88 151 154 110 186 81 110
-111A10N3k6j29O4k8JK5J34J01j13j9J6O8J2j51n2LQ0J68k10j1n0R0J0Q5j41q6J2K4J07
$$ 110 163 137 8 72 44 45 70 204 305 192 173 189 257 269 118 66 69 149 317 107 96 46 136 146 231 90 4 16 40 147
-393A47
##PAGE=	F1=-7012.11
##FIRST=	17614.246348710370512,	4405.4455391999963467,	0
##DATA TABLE=	(F2++(Y..Y)), PROFILE
4405B49j99J07j13l3J38q1l0M7m0J4Q4n8N2n9J8m1J06l9L7o8K4o9M3R3p3l9K15m5j98M5J0
$$ 249 50 157 44 11 149 68 38 85 45 59 143 85 137 78 96 55 161 122 159 91 115 46 89 182 109 70 285 240 42 87 97
4114I7l2L9n2J50r5N1q6m4J51M4j58L7l8K7j3O9q8k4M2P1r2QK1R7j11J31k7p7j7m7J0K1L4
$$ 97 65 104 52 202 107 158 72 28 179 223 65 102 64 91 78 147 59 35 77 148 56 64 85 182 71 202 175 98 81 34 44 65 99
3804I9o1J53J0O4M9k61l8J66q9J10q8M2J27j61O0n2p5J49Kk8j2%r8N3QJ11j4j93R6P6o3q8
$$ 99 38 191 201 265 314 53 15 181 92 202 114 156 283 122 182 130 55 204 206 178 166 166 68 121 129 240 226 33 129 205 142 54
3504E4J66l9l2M3j14P5k0L2Pkj5p8l3J29Oj9q6J82j02p8J66j09j0Q7j2q0m5J2K2RM8j26J34
$$ 54 220 181 149 192 78 153 133 165 172 170 155 77 44 173 179 160 74 256 154 76 242 133 123 210 198 118 73 85 107 116 164 38 172
3194A72o2JJ4O3o3j6R1j98J48p3K1K7J46r5q9R8q9Q8n7J00k1k9r2n6R2J6K20j68j32L1M2Q9
$$ 172 110 111 125 188 125 109 200 2 150 77 98 125 271 176 87 185 96 184 127 227 206 177 85 29 121 137 357 189 57 88 130 219
2894B19Q1j73J65j05j67M9R0Q7m5j13N0K4o2n0J1N3M6Lqq5J23k8j19J43j57J57j01J08k4j24
$$ 219 300 127 292 187 20 69 159 246 201 88 138 162 100 50 61 114 160 163 155 70 193 165 46 189 32 189 88 196 172 48
2612D8j1PL7n2J99J68j44p6J5k0j8r4JJ22j52J44n0o2J19r6N0L4N6P1j01q0Q8p5l9k5J5k3
$$ 48 37 44 81 29 228 396 252 176 191 171 153 59 60 182 30 174 124 62 181 85 135 169 225 296 195 115 203 128 89 64 79 56
2311E6L2J31n3q5P3q9O0M8o1J6r0l2J22J32o3M8K6j59r4R9N8k5j13N4o5J43j55J42j02K7R2
$$ 56 88 219 166 81 154 65 125 173 112 128 38 6 128 260 197 245 271 112 18 117 175 150 37 91 26 169 14 156 54 81 173
2020A73p4o4M2m0K36n1j64J40K6j16j2J02%m0k8M9r1J45kj42rJ01J17j5k38N8p4K12J4n3m2
$$ 173 99 35 77 37 273 222 58 198 224 108 96 198 198 158 130 179 88 233 231 89 80 181 298 283 45 103 29 241 255 202 160
1729A60J13r9n1J22j84N1M3r0L2j7Q8m9P5J3j82PJ01j0k1J05rn6O5q7K25J568o93r34j30k7
$$ 160 273 174 123 245 61 112 155 65 97 80 168 119 194 207 25 32 133 123 102 207 198 142 207 120 345 1913 1220 286 156 129
1448A29P9j80J18Q3r5o5N6J8Ro0R8l2J48j23K8l0J08j11J45j54j07N7J0o2O5O7q9O3J6j35
$$ 129 208 28 146 229 134 69 125 143 152 92 190 158 306 183 211 181 289 178 323 169 62 119 129 67 132 199 110 173 189 54
1166E4k2Q5LN2qo8J9O8j24Q2N6j65J42k6q1K6OJ04J74k31j32J19j22J66j28j2J02O4O1qk52
$$ 54 32 117 120 172 164 96 115 183 59 141 197 32 174 148 67 93 99 203 377 146 14 133 11 177 49 37 139 203 264 256 4
875DP2O5J6K0L5j05J4K7q4J24K6j46Q5Mp7K2p5Q9J99j35j26N1k9Q1k8Rml6K1M3l8m0J02N6
$$ 4 76 141 157 177 212 107 121 148 64 188 214 68 153 157 80 102 27 116 315 180 54 105 76 157 129 138 134 98 119 162 124 84 186 242
556B42j02j01K6R0q3J0n3J54N6p2P3r9p6J02l9j1J2P3Lj4Jj64M3LK9L6L9K9j04J25o9Klp0
$$ 242 140 39 65 155 72 82 29 183 239 167 240 141 65 167 128 117 129 202 205 191 192 28 71 74 103 139 178 207 103 228 159 161 158 88
236H8QM8Pm2rMm1M8pJ32j59J11oK0m0j06L0L6o%rQ3j50J00p4M1J8K7n0q0O9j7P3l4P4o4mL8
$$ 88 96 144 151 109 100 104 63 111 104 236 77 188 182 202 162 56 86 122 116 116 107 190 40 140 66 107 125 152 102 22 91 74 147 113 187 123 119 157
-121A57l1p1O4n2jN6R5J04j51K6jO3l8j59R6m0l6K31j84m7j2Q1k2P8j05r6K8M4O0
$$ 157 126 55 119 67 66 122 217 321 170 196 195 258 220 61 157 117 81 312 128 81 69 150 128 206 101 5 33 77 137
-393A37
##PAGE=	F1=-7082.88
##FIRST=	17614.246348710370512,	4405.4455391999963467,	0
##DATA TABLE=	(F2++(Y..Y)), PROFILE
4405A87j30J13j39J6R0q9oK0J3M3O4p2O9p1j5K1J10n8Oj09P3p8P5M5o7o5K16l5j78O5p2%J04
$$ 187 57 170 31 47 137 48 42 62 75 118 182 110 179 108 93 114 224 166 172 63 136 58 133 178 111 46 262 227 49 114 42 42 146
4096A46p6J82j41K7j01JJ03Kn9%j2MpP1n6n4N6N6q8J7J4J21j17J15j9o4nl4o5O0j1J8J01M4
$$ 146 70 252 111 138 37 38 141 143 84 84 72 76 69 140 84 30 86 142 54 71 85 206 89 204 185 121 116 82 17 77 66 84 185 229
3776B29O2L5l05OJ73j25J72j28J2J19j28P1p1o5R2l4O0mMj11N2rJ20o0j15N9M8o1m9J92p3
$$ 229 291 326 21 27 200 75 247 119 131 250 122 193 122 57 149 115 175 171 175 64 116 107 227 167 52 111 159 98 49 241 168
3485A68j8M7j32Q5j8O4o6M3j5j03J1K9O0Mj02J83m1j54K02r0o8J15J7j03j5k9K2l0R1j09P6
$$ 168 150 197 65 150 132 196 130 173 158 55 66 95 155 159 57 240 199 45 247 157 89 204 221 118 103 74 96 66 157 48 124
3194A24m6M5o2J35r3j0O2r1J8m5P2oJ61q6o7J29j81J60j12J30n7J5q6%L8K6J77j96j21M6N
$$ 124 78 123 61 196 103 93 155 64 82 37 109 103 264 178 111 240 59 219 107 237 180 195 109 109 147 173 350 154 33 79 84
2903H4J20Q2j20J15j13j45L4J16P4n3j18L8K0o0J0k2pM5K7J4q9R4j6p1R3j17J42q4J51m8j62
$$ 84 204 286 166 281 168 23 57 173 247 194 76 114 134 74 84 62 55 100 127 141 52 146 130 59 152 35 177 93 244 196 34
2612C4K5qk1K5J74J96j82m8J5o1m1k9k0J28j61J35J4r6J67q4j0qP9K9o9m9M9n0j4pj1r2R0
$$ 34 59 51 30 55 229 425 243 195 210 149 108 79 59 187 26 161 175 79 246 162 152 144 223 252 183 134 183 133 119 112 101 9 99
2302I9J33n3q0L7o4J3R8p9Nm9l2J24J39q9Mjj52k5J12%q5l1N0m4J07j07J00o6nQ8o8k0N7j4
$$ 99 232 179 99 136 72 85 183 104 109 60 28 152 291 202 206 205 53 28 140 140 55 24 74 30 137 30 130 64 59 147 79 59 116 102
1983A02J40j0j91J67N0j60J9P3m1j5m3M6m6J70k2j50j5R8J32lk43O6r1K23Jn4l0P7o5o3J15
$$ 102 242 232 41 208 258 98 117 190 149 134 91 137 91 261 239 89 74 172 304 301 58 124 33 256 257 203 173 250 185 122 237
1692B37j56N9Mr1J9%R8p9P8K8j71J3P3L8j4L8N4o1M4j23K45J329o15p95p7n6J11k19J13Q6
$$ 237 81 140 144 53 72 72 170 91 169 197 26 39 112 150 136 174 228 167 211 88 333 1662 1047 252 175 119 230 11 124 210
1410B10m6n2M9J6n3j13J72k6J62r9j1j2N6q8R2j21p3K6lK5O0M8j30R3o3j14L7L3jP8qn7l3
$$ 210 164 112 161 177 124 11 183 157 319 220 209 197 253 165 257 136 63 89 86 111 171 219 89 182 119 5 42 75 74 152 144 87 54
1100E4Q6q1Q7O7j69J31j0m9L7k3N4K00k61j10P9o0J49j12j2O0R3R5j7k55Q8N3J9l1K1j38Q5
$$ 54 140 59 146 213 44 175 165 116 153 130 184 384 123 13 92 32 181 69 57 117 210 305 288 33 121 174 193 162 183 45 130
809A30L3r4R9P5k14J19J7j17K4J6pK36q3k30J39j7L8q0PJ6p4J25L3p3nQ6K0j9j61L6R2p0o0
$$ 130 163 69 168 243 29 148 165 48 72 88 81 317 234 4 143 126 164 84 91 107 33 158 191 118 113 199 219 200 39 75 167 97 37
499C7K3Q8J00o3K3j05k7J00o1L3PK3k5J8J0j27K5J8j9O2N8J2j57J18PJ7q4n0OL6J3l6P1l1
$$ 37 60 148 248 185 208 103 76 176 115 148 155 178 153 171 181 54 79 97 78 140 198 210 53 171 178 195 111 61 67 103 116 80 151 120
180A20p4M7oJ15q6J6J2P4m7j03L6L2J0k3LL5j21J18j17J20j6j9k1K1m7p6J25j6N7qk4Kl8q
$$ 120 46 93 87 202 116 132 144 218 171 68 104 136 146 123 126 161 40 158 41 161 145 126 105 126 79 3 128 112 169 161 137 139 101 93
-139I3M9m9rP5N4J12j83M5kN3r4j06J89q3r9K57j60q8M8M9m9Q1n4j14L5M5Q
$$ 93 142 93 84 159 213 325 142 187 185 238 144 38 227 144 45 302 142 54 102 151 102 183 129 15 50 95 103
-393A03
##PAGE=	F1=-7153.64
##FIRST=	17614.246348710370512,	4405.4455391999963467,	0
##DATA TABLE=	(F2++(Y..Y)), PROFILE
4405A05mP4r2K3Rn4L9l7L7O0N0o4O6q3k5O7J06r1pj45J11%L6j7n7r3K05k0j49R4j36MJ55p1
$$ 105 101 175 83 106 115 61 100 63 100 160 210 146 212 129 104 171 277 186 179 34 145 145 181 164 107 14 219 199 50 144 8 12 167 96
4086I6J75j64Qj06N0K0j8M6m3J0J1k8O4oq3P8Pm6N6n4J46j22R2%m7rLr9L5k5O2P3N9M9L4l00
$$ 96 271 107 115 9 59 79 61 107 64 74 85 57 121 115 32 110 117 71 127 73 219 97 189 189 142 133 136 37 72 47 109 182 241 290 324 24
3748B4L3J46j14J87j63MQ6p6O0p0l1j3l2J39J1Jj29N7L0Q2j36L6J6j4o9lJ75q2rO4j67Q7m
$$ 24 57 203 89 276 113 117 203 127 187 117 86 73 41 180 191 192 63 120 150 232 96 132 148 134 65 62 237 155 146 210 43 130 126
3438A26P6j13Q5k1r6K5p0J06L9j21J83J1j88K04p7r0J18M2j23J7n2J5p1J13q1J7j1Q0j16J99
$$ 126 202 89 174 153 57 82 12 118 157 36 219 230 42 246 169 79 197 239 116 133 81 96 25 138 57 74 63 143 27 226
3157B26j36qL0%p4k2R1kJ29p1j7J45k65K49j87J65r7M2p9N7jM0J08k11o4L3k7J20Q8p2N4j20
$$ 226 90 82 112 112 38 16 107 105 234 163 146 291 26 275 88 253 156 198 119 176 175 215 323 112 48 81 54 174 262 190 244 124
2856A24o7j3J27N6n4q2k3L3rM1o8Jl6O2K3k1J7J8n2N5o2Q0l6J64p3j69M7j6Mj1J39K17j94
$$ 124 57 44 171 227 173 91 68 101 92 133 65 66 30 92 115 94 111 129 77 132 70 150 114 278 205 36 83 67 71 60 199 416 222
2546B22k4J3q0n9MnJ27j59R7P8j01J88o9q1j1O7kl7j1kl0LK9k9q0O0J16m8n8j2l5l0J46r0
$$ 222 198 211 131 72 76 71 198 39 136 214 113 301 232 151 140 207 205 168 157 155 125 128 157 128 48 108 224 176 118 106 71 41 187 97
2227I7J2Rl4O5J42j19k6j0n9pP9m3n2j1QqP4p0P6l8l2J09j15M0Q3PO50j12p05J81P9j77L4
$$ 97 109 118 84 149 291 172 146 136 77 70 149 106 54 43 51 43 117 47 123 85 53 162 47 87 170 177 827 715 10 191 270 93 127
1917A27M5p3J9l9PLJ81m9j47pR8J21J9k29P0j05K33m2k8j8K8k9p1J15j21M1j0q4QK7M2o9O9
$$ 127 172 99 118 79 86 89 270 221 74 67 165 286 305 76 146 41 274 232 204 186 214 185 114 229 108 149 139 55 63 90 132 63 132
1607A32M0j24O0LP0rm0J03m1k2o8J09N37l07k58lp3J18j88M6Q8J2m8M9J0o3o1J00l3J81n9
$$ 132 172 48 108 111 181 172 132 235 194 172 104 213 750 443 185 182 109 227 39 85 173 185 137 186 196 133 72 172 139 320 261
1316B61p0%rm7M6r5l7K9j9Q8N0K9j54J03j04k7QqQP5j5mo3L9l1R4P1j62J22j2k4M3Jk3K11
$$ 261 191 191 182 135 181 86 49 78 59 147 197 226 72 175 71 44 52 44 52 127 112 108 45 84 53 147 218 56 178 166 142 185 186 163 374
987C74k69q6K9j1J51r1j5J8J10J18k4k41J04K2J7m5j0j33J17K8p6O2J20j96N2L8j37M2R8r0
$$ 374 105 19 48 37 188 97 82 100 210 328 304 63 167 189 206 161 151 18 135 163 87 149 269 73 125 163 26 68 166 76
706G6K24l2k23J29Klq0o6Q8n5J07K6p4L0O6nM9j74mO1l2p5O4J3J29n7j4j11J7R9o9O4nl2l6
$$ 76 300 268 45 174 176 173 93 27 115 60 167 193 119 149 215 210 259 85 81 142 110 35 99 112 241 184 170 59 76 175 106 170 165 133 97
377I7M8Qm4n0N7n9Q4O8j9j82J04Q0K5j44pl2M4K4rJ25o9r2J4%J01qp6%J14m4o6N2J0J8m3K6
$$ 97 145 153 109 59 116 57 141 209 190 8 112 192 217 73 66 34 78 102 93 218 149 57 71 71 172 164 88 88 202 158 92 144 154 172 129 155
39A55l3q2J17j33J67l2m8MJ16j38l9N9KK1M7k7l7l9L2K6j8j6Q0OJ17k02N0J1M9j55PJ95j15
$$ 155 122 40 157 24 191 159 111 115 231 93 54 113 115 136 183 156 119 80 112 138 120 104 184 190 307 105 155 166 215 60 67 262 147
-271A47p6K22j45j21J04Ro7J09k4j27L7K4k2
$$ 147 71 293 148 27 131 140 73 182 158 31 68 92 70
-393G0
##PAGE=	F1=-7224.41
##FIRST=	17614.246348710370512,	4405.4455391999963467,	0
##DATA TABLE=	(F2++(Y..Y)), PROFILE
4405E6R2K8n4K8n7qP5p5K2P4M1l6M9r3l1R2R7j20pj43J00Q0Lo6m6n3J19j1j17J26j18qJ25
$$ 56 148 176 122 150 93 85 160 85 107 181 222 186 235 142 111 203 300 180 173 30 130 210 213 147 101 48 167 156 39 165 47 39 164
4096A64m4J40j62j1m4M7o3O2M0q7J7N9n2L6M8j11J04o5j2J15j17J59j22O1K6l7j8N7j31rn
$$ 164 120 260 98 87 43 90 27 89 129 42 59 118 66 102 150 39 143 78 66 181 64 223 101 162 188 151 133 190 59 50 45
3804D5O6O9N3L2M1k39K5J02o4J60j92K4L2k2L7n5J9p9K7J17J9nj49O7N9N3k02J54On9p5KJ45
$$ 45 111 180 233 265 306 67 92 194 130 290 98 122 154 132 169 114 133 54 81 198 217 212 63 130 189 242 40 194 200 141 66 68 213
3495B13n8j9Q0j84O3J6O6j20J22m1n5%j0LP7j35J76M5j66J62o9q5J00O1j28M3n4No4O5m2l5
$$ 213 155 136 216 32 95 111 177 57 179 138 83 83 73 76 153 18 194 239 73 235 166 81 181 242 114 157 103 108 44 109 67 32
3194C2N8P7j00K06j75l0J2O1r0K0J8L1O6n4M8J52k55K55k57J91j28N0p9J11k0N5K8j91j0j
$$ 32 90 167 67 273 98 68 80 141 51 71 89 120 186 132 180 332 77 332 75 266 138 188 109 220 200 255 283 92 82 81
2912H1l7R0J01m0j3j14L3o3J13M0m4l3r2P8RO1j06N3p2M8NN4m3N7p1K5l8M2MJ52p7j48N7k2
$$ 81 44 134 235 195 182 68 101 38 151 191 147 114 22 100 109 170 64 117 45 93 98 152 109 166 95 120 82 124 128 280 203 55 112 90
2593I0J9o7J16K21j84j8J5p0n1k5M5J22j47M3J27q4J85p0j33K2L9j8k6K9m5j4MO6o2k1%Q3
$$ 90 109 42 158 379 195 177 192 122 71 46 91 213 66 109 236 152 337 267 134 156 195 177 151 180 135 121 125 191 129 108 108 191
2293A91nm5o9pk9J41q7J6P0rm9J45j50l4J8O2m6K9m9Po4J5J7M5n8R3k6o5J51j84P9J05J5Q95
$$ 191 186 141 72 65 36 177 90 106 176 167 118 263 113 79 97 159 113 142 93 100 36 51 68 113 55 148 122 57 208 24 103 208 223 1118
1973A118j63r23J21R7j41J4L5p3K8Ln5L5J58q4j17QR9Q5M2j98P2j01K28r9NKj6j1p1J17p3
$$ 1118 955 32 153 250 109 123 158 85 113 116 61 96 254 170 53 61 160 245 287 89 161 60 288 189 194 196 180 169 98 215 142
1682A42%lr1K9N7l5m0L9L2m5R1n5Q7kr8J25k4q6M3n5Q0P8j43M6o7J01j43j3Q5N1m7N0Nl4k4
$$ 142 142 139 48 77 134 99 59 98 130 85 176 121 208 206 108 233 209 123 166 111 191 269 126 172 105 206 63 50 135 186 139 189 194 160 136
1354A36J8m4K01j3j36Jo6LJ2q1kP0m5J19L1J3j58R4m7k4l0LN0jl4O3pr6K7Q7O7j46J23l7r
$$ 136 154 110 311 298 162 163 97 100 112 31 29 99 54 173 204 217 59 153 106 82 52 55 105 104 70 133 126 30 57 144 211 65 188 151 142
1025A42M0N4p8J90k23j05N5nJ25o4m2J1J02J29l2k06J18l2J4k1m7n9O0K1m9M5J53j52n5N8
$$ 142 182 236 158 348 125 20 75 70 195 131 89 100 202 331 299 93 211 179 193 172 125 66 126 147 98 143 296 144 89 147
743A47j01L8J48j36J69J1j91J11K6m6l9r4J02m7M5K4m9O0M1lQ9k01m9L4J1n3O8l2J36o5mj06
$$ 147 46 84 232 96 265 276 85 196 222 176 137 43 145 98 143 167 118 178 219 216 305 104 55 89 100 47 115 83 219 154 150 44
443D4K1R1m8P8l6q1k6P3ML5j23P7o3R6P4m1j44L5J23L2j68M8r0O8M7K5J27j07p6l2kJ00L4
$$ 44 65 156 108 186 150 69 43 116 120 155 32 109 46 142 216 175 31 66 189 221 53 101 11 79 126 151 278 171 95 63 61 161 195
133A95q5q6J29k6JM4j4K7m2L9r8l9J02j02J45k4o4K3J91j53q8M1Nk8Q9j8n9k1L5j2L9k2P7
$$ 195 110 24 153 127 128 172 158 185 143 182 84 45 147 45 190 166 102 125 316 163 75 116 121 93 182 164 105 84 119 107 146 124 201
-177B01n2J12k01N7K9N8j80O6J65j24l5J90j35j15J09k7o2J49k2j31L2nl
$$ 201 149 261 60 117 146 204 24 90 255 131 96 286 151 36 145 118 56 205 183 52 84 79 76
-393G6
##PAGE=	F1=-7295.17
##FIRST=	17614.246348710370512,	4405.4455391999963467,	0
##DATA TABLE=	(F2++(Y..Y)), PROFILE
4405A00Q2ql8L3r0L3R2r5j1Q3M1jK6r8m2R4Q4j30Jq1J6J51k0r2l3lK7j4p8J35q8MN9MQ7j44
$$ 100 182 174 136 169 79 112 204 109 98 181 222 221 247 149 107 201 285 155 156 75 91 242 222 130 97 94 121 107 29 164 76 80 139 143 230 86
4067H6l0K7M2n2R3k4j20J0J14n1%R0j40J29j36OJ78j38J38j15K2N4l9j8J16j69n6L8L7Q9K6
$$ 86 56 83 125 73 166 142 22 32 146 95 95 185 45 174 38 44 222 84 222 107 129 183 144 126 242 73 17 55 92 181 207
3776B07J6N1j67J6N8pJ17k04M4qJ4Ql5O5o0PJ05Qoj63Q0M8M8j99J82J3q4o4k9J13km9Q8j56
$$ 207 223 274 107 123 181 174 291 87 131 123 137 145 110 175 115 122 227 235 229 66 146 194 242 43 225 238 154 90 61 174 172 123 211 55
3457E5KK5M3p3J37p4J1l8O1q2P6j22J44O2j05Q9o6o7Q1O7j15N7m4Jl7j0Pm8Q8N9p0K11k03
$$ 55 57 82 125 52 189 115 126 88 149 67 143 21 165 227 122 211 145 78 159 226 111 168 124 125 88 78 85 37 125 184 114 325 122
3147A22o7J2Q5q4O1p0P6km4J17J57k16K19l02K01j40M7q5J50j9O8n5j18nl1l1M7J17k6q0l6
$$ 122 55 67 152 68 129 59 135 133 89 206 363 147 366 64 265 125 172 87 237 218 286 231 113 108 77 46 93 210 184 104 68
2856F8P9j11Q3K9k7J0p7R0m3Q2j17P7l9K1k4R9o9P8r8ol2L6RJ27n4j03O9n5K0j12J21K03j62
$$ 68 147 36 119 148 121 131 54 144 101 183 66 143 104 125 101 200 131 209 111 105 73 109 118 245 191 88 157 102 122 10 131 334 172
2546A72l6J5l0k3r5J18J10j20j2J42n1J59r0j55O4M6m5l8O6o6OnP6j04N2n8L6R2o2j15PK1
$$ 172 136 151 121 98 3 121 231 111 99 241 190 349 259 104 168 214 169 131 197 131 137 132 208 104 156 98 134 226 164 49 56 77
2246G7Q3p4lJ31M5j84J47j83J1O4J14q0l0j8Pq9O4K3J5o7J47k6r8J69k09N1J38j5M83r7n31
$$ 77 160 86 83 214 259 75 222 39 50 114 228 148 118 100 107 18 82 105 120 53 200 174 76 245 36 87 225 210 693 596 65
1955F5M2Q9o3k7N2l6j1M8o5L1R2j20n1J3R5L3O1j57P8p6J94j52M0K6l8k1o2J12j5m8Pj07P3
$$ 65 107 196 133 106 158 122 111 159 94 125 217 97 46 59 154 187 248 91 169 93 287 135 175 201 163 142 80 192 177 129 136 29 102
1645A02Q9n7n7J0mL4J04q9R6Mj11J07k0j21J15j13O33j03n34N5l1O6j02k7N9O1m7M6ROjn0
$$ 102 191 134 77 87 83 117 221 132 228 232 121 228 208 87 202 89 722 619 85 140 109 175 73 46 105 166 119 165 174 180 179 129
1344A29n0K16K6j91j0p2K2Kl1KQ1o7J31L%j38P1K7m5o8K3R6o4n7J03N9j65M5N3O1j21J37p4
$$ 129 79 295 321 130 120 48 70 72 41 43 124 57 188 191 191 53 124 151 106 38 61 157 93 36 139 198 33 78 131 192 71 208 134
1034A34j3K6J17r6J43j24j73J26pO3l6p9K6Q3J20m2j39J23j06J3K2o7k1J6J4l1O4J64j20j26
$$ 134 121 147 264 168 311 187 14 140 133 196 160 81 107 190 310 268 129 252 146 159 181 114 93 109 123 92 156 320 200 74
753G4M6m3J8J82j59J00M2j52J01N1r3Lo0O1o4j3L7k1Q1J4K5R7k29o4K5J0j6N7l9J08q2P1r9
$$ 74 120 77 95 277 118 218 260 108 209 260 167 170 110 171 107 94 131 110 191 205 230 327 98 34 59 69 53 110 71 179 97 168 69
443F9j3O6jP8r1q9MN8MR6j19J6k9Q6Q3k7j29%J05L8j58Q7j08O1P2N2J11j42l9o2k3J06L8l5
$$ 69 56 122 121 199 108 19 23 81 85 181 62 78 49 135 218 191 62 62 167 205 47 134 26 87 159 211 322 180 141 79 56 162 200 165
124A65j06K1J6O3K5l9L6j9M2j28k7Q6n2P8Np6M3K35j14j93P1mq5J11%n3NK5o4J01l0P3j17
$$ 165 59 80 96 159 184 145 181 162 204 76 49 135 83 161 166 90 133 368 254 61 132 128 43 154 154 101 106 131 67 168 138 211 94
-186I4R2j65P5L6O8j21J4J14r3rJ70j24r6Q2m7j9J64k7j31J5k2L4
$$ 94 186 21 96 132 200 79 93 207 114 105 275 151 55 137 90 71 235 208 77 92 70 104
-393A04
##PAGE=	F1=-7365.94
##FIRST=	17614.246348710370512,	4405.4455391999963467,	0
##DATA TABLE=	(F2++(Y..Y)), PROFILE
4405A37N7l0m1L8q8O9Q1j01m0Q3M6L2Or7n6P2O9j08Mmr3K03l2r6j5K9l7j8k9R8l8PjO2K2j08
$$ 137 194 164 123 161 73 142 223 122 82 165 211 243 249 152 96 168 237 129 133 129 36 239 207 111 96 125 88 70 41 139 101 108 107 169 191 83
4067H3n3R1L5l7R7p4j16J0J16l5j7J17j72J46j77L0K03j27R5r5k1P4n2KJ61k04n5N1pJ19j6
$$ 83 30 121 156 119 216 142 26 36 152 117 100 217 45 191 14 44 247 120 215 120 99 173 121 123 284 80 25 76 69 188 172
3776A72kO2j00RL5L1P6j90L6KJ2j9k3R2l9k3J29k6Rj62Q6mO3j65J62K6j03l3o5Q1P1r2R1j17
$$ 172 170 232 132 141 176 207 283 93 129 131 143 124 101 193 154 131 260 234 243 81 167 163 226 61 223 249 146 113 48 129 200 108 199 82
3457H2k0j5L1NJ15j06Q2o5J03j01J5q0Q6O8k5jo1m5P1N4q5N5k8Nj0p9N9m3Q0L8k0K04k23j03
$$ 82 62 47 78 83 198 92 174 109 212 111 126 46 132 200 175 174 113 68 139 193 108 163 135 140 130 51 110 67 147 185 165 369 146 43
3138D3L3P2p6J11j44J05n8m5J81J70j76J45l09J84j23M4q9J61jP5j30k1l2l8l6J5J25k1j28
$$ 43 76 148 72 183 39 144 86 41 222 392 216 361 52 236 113 157 68 229 228 303 173 152 120 82 46 61 186 165 37
2865C7R6N0j50O1J9j3M0m6R7j25J04q3M7J5Mm2J16p0Q0j11m5k9N5j8Q8pm4Q6j20K9r6J03J80
$$ 37 133 183 33 94 113 100 140 94 191 66 170 87 134 149 153 111 227 157 237 126 81 52 107 89 177 170 126 212 92 121 25 128 308
2556C08j47p6J2K7%o7J00R2r0m4J17j3J16j24j43R5R7r4n9R1o6L0OM0j45J17r6k2K14r9j26
$$ 308 161 85 97 124 124 57 157 249 159 115 232 219 335 211 68 163 260 166 107 198 132 162 168 208 63 180 84 62 276 177 51
2265E1jO2M0o2n2J81J18k72J22j48M4O3J15r5q0K1l4k4O4L7k4p9K23l2j16J21j66l7K06o4
$$ 51 50 112 152 90 38 219 337 65 187 39 83 146 261 166 86 107 73 49 113 150 126 47 270 238 122 243 77 40 246 182
1983A82O14j46n67j1L6M6n5O7No7P7n2L2Rr1k8J0Q3k8P5j07R5m5J31j83P6M5l6n3m0Q5M8q0
$$ 182 796 650 83 72 108 154 99 166 171 104 181 129 161 170 79 51 61 144 116 191 84 179 134 265 82 158 203 167 114 74 159 207 127
1673A27lq4R3J07m1j09J0m3P2J01r4J00J1r1O4k0j28J31j50O93r5n89K4K9K8p0j7K0N7n4M0
$$ 127 124 40 133 240 199 90 100 57 129 230 136 236 247 156 220 200 72 203 53 746 651 62 86 115 143 73 56 76 133 79 119
1382A19K0M5J6j04l6K10N0k24k4J7l3J7J2J2L5p1J28k9pr3L9P0n2q6J9J31q3l4N3J23j70L8
$$ 119 139 184 200 96 60 270 320 96 72 89 56 73 85 97 132 61 189 160 153 60 99 169 117 31 50 181 98 64 117 240 70 108
1081A08kN4q9J61r7l3j0J74q7R1nk54J83kpj0j06L8O9Q8n2m0J14j82J0O3o8j2J1Jm1J03J60
$$ 108 106 160 71 232 135 102 92 266 179 270 265 11 194 192 185 175 69 107 176 264 212 172 286 104 114 177 109 97 108 109 68 171 331
772C31j02j22j5OnJ96j57L5N9j11J00O9j38L0j3J6r2m1P3k7R2j0O8P6k35NK5q5K7L8nL5r9
$$ 331 229 107 92 98 93 289 132 167 226 115 215 284 146 176 163 179 87 46 119 92 184 174 242 318 83 88 113 28 55 93 88 123 24
462B4J82j15l3K3O0O8j55L6k4k1J0J28p4p9L7N2R3J8j40%M0M6j32J09j07L9R0P1R6j68mp1
$$ 24 206 91 58 81 141 209 54 90 66 45 55 183 109 30 67 119 212 230 90 90 130 176 44 153 46 85 175 246 342 174 170 99
161I9m5J04K3K0q4p2M7P9Rn8M0J4L8j11o1Q3kqM9q8O5K40m5l10J13rj18R2J9j8K6L1p9J00
$$ 99 54 158 181 201 117 45 92 171 180 122 162 176 214 103 42 125 123 115 164 76 141 381 336 26 139 130 12 104 123 105 131 162 83 183
-158A83m1P2j63M6m1M6K8O1p8k9N0j7j7J57j13q5M9m9L9J58k1j31j6j7M7
$$ 183 142 214 51 97 56 102 130 191 113 84 134 117 100 257 144 59 108 59 98 256 235 104 88 71 118
-393A18
##PAGE=	F1=-7436.7
##FIRST=	17614.246348710370512,	4405.4455391999963467,	0
##DATA TABLE=	(F2++(Y..Y)), PROFILE
4405A32N1m1m8M1o9R8M8r3n1O9N7N5j1q6o5K9M8m2j6O6j45J81l1q6QL3o6J9j0L1J9nj1R7m9
$$ 132 183 142 94 135 66 164 212 119 68 137 194 249 238 152 87 116 164 122 106 172 27 208 177 91 99 132 66 85 75 106 125 120 109 206 157
4077A57o4n3J14K1l6Q7r8p0J2O0qj9J40j99J38j67N8J82j07N0o2n7Q1p1L9J80k28k0M1l0J30
$$ 157 93 40 154 175 139 226 128 58 70 130 122 103 243 44 182 15 73 255 148 198 136 79 160 89 128 308 80 60 101 71 201
3786B01o5k2P8n4JM8K9N5j53pN4j0m4k4R1k6l0J67p8M4j47P5p7Q8j30J33L5j18J5q2L5J44
$$ 201 136 114 192 138 139 187 216 271 118 111 165 155 111 87 178 152 122 289 211 255 108 183 106 194 64 197 232 114 129 47 82 226
3485B26j36R9r0Np3Q2J5P2j20J32p9J26r2o4k2K5N9N3q6n5k3Q1J4m7L9j2K5J4j30R9m3N8J8
$$ 226 90 189 99 104 31 113 128 200 80 212 133 259 167 103 81 106 165 218 132 77 54 135 149 102 141 129 154 168 38 137 94 152 170
3175A70M9J77k40j23O8L3o3J60j80R8r0m8K21J92j48M1k74J32p2M4p8J36K8P0j93P6o2j7o3
$$ 170 219 396 156 33 101 134 71 231 51 149 59 11 232 424 276 317 43 175 103 147 69 205 233 303 110 186 124 107 44
2903D4NJ14j2q5J24Qj68P6%k2O0k8R6j96J19rl4R0j8n6J21n3O8j05q3k2Q1k9RM4J7J04j98
$$ 44 49 163 151 66 190 198 30 106 106 84 144 116 212 16 135 126 92 182 164 108 229 176 244 139 56 34 115 86 95 139 156 260 62
2593F2N8o8P5J81j46j10j2R0Ql9R1P4o6n4P3J6O7j63j06J11J61j39p2Q6n3N1M5k8j53J34r9
$$ 62 120 52 127 308 162 52 40 130 138 99 190 264 198 144 217 233 300 137 31 142 303 164 92 178 125 176 221 193 40 174 75
2302G5k9K66j34j08j4P5L6o1q5J69J94k81O5p5J6N5Q6q6r2K9n7M7L9O5o7p3K89m1j14Mm5l4
$$ 75 46 312 178 70 56 131 167 106 21 190 384 103 168 93 109 164 250 164 72 101 44 91 130 195 128 55 344 303 189 193 148 114
2002A14J97L4K997n69k672l8m1J54l8L0M4j19Q2l1M5n7K3j07K1N7q3Q7o2J31k5N1j72R5N7
$$ 114 311 345 3342 2773 101 63 22 176 138 168 212 93 175 144 189 132 155 48 69 126 43 130 68 199 174 225 53 148 205
1729B05k0q8j4L7J04p5m7j5Q0R5j4j54K6n0N0Q0p0J01J7n7J8j5j25J14j11L44K0l61n1R7p
$$ 205 185 97 83 120 224 149 102 87 167 262 248 94 120 70 120 200 130 231 248 191 209 194 69 183 72 416 436 75 24 121 114
1438A14m7j5j0O1p5L2M1P1L0j47PJ72N8k29l3R5p1M0K2N1n0l9R9o1ql1J0P0l8o3J5J08o2n
$$ 114 67 52 42 103 28 60 101 172 202 55 62 234 292 63 30 125 54 94 116 167 117 78 177 116 108 77 87 157 119 56 71 179 117 112
1119A12l3J63j43L8o1M4n6J86r9l7q3K14o5N6J04l09J94jo3J3j05K4P0L6o3P9R5k33pQ7n9
$$ 112 79 242 99 137 76 120 64 250 151 114 31 245 180 236 340 31 225 224 161 174 69 93 163 199 136 215 310 77 70 157 98
828I8j1M2j3p5J22J55q9q0n7J1k7J88j27j6N9o8R7P8j59K8L5k5j18J5Q4p3Q2k4J14L2j92N8
$$ 98 87 129 116 41 163 318 229 149 92 103 76 264 137 121 180 112 209 287 128 156 191 166 48 63 147 74 156 132 246 278 86 144
527A44L0j54L3K5M8l5j3J62j40l8j6J19M6j50R6n0o5K6R5k5j07O1KR5P3j48Lk4M7j02J22r6
$$ 144 174 20 53 78 126 91 78 240 100 62 46 165 211 61 157 107 42 68 163 138 31 92 94 189 262 114 117 93 140 38 160 64
227F4NR3Q4R2j82Pn4o2R2QN4m9k3j9M5J2o9L9L8L6p8j11R6M1q9R2r0P6K12K9l51Q9Jp1rL0
$$ 64 69 162 246 338 156 163 109 47 139 147 201 152 129 110 155 167 98 137 175 211 133 22 118 159 70 162 72 148 360 389 38 127 128 57 48 78
-111G8L6L8N4n2L4n4P6j32j1L2K1K0L6m7m2QN1n8J37r8q2K4l7Q7J42Jj26o6ML2
$$ 78 114 152 206 154 188 134 210 78 67 99 120 140 176 129 87 95 146 88 225 127 45 69 32 119 261 262 136 70 74 106
-393A06
##PAGE=	F1=-7507.47
##FIRST=	17614.246348710370512,	4405.4455391999963467,	0
##DATA TABLE=	(F2++(Y..Y)), PROFILE
4405H8O8m9k7L1n5J15Np0m4M2O8O7k4o3n9l0J7N1o0J22j16Q3j7p6L7J2o0P4onK1k1M5R1j22
$$ 88 156 107 80 111 56 171 176 106 62 104 172 239 215 152 93 63 80 131 71 193 77 160 143 67 104 116 56 130 124 119 140 119 164 255 133
4077A33k8l2J03jm5O7r2j0jpK7j4J62k04Q7j25O9J55q8J2j9p7P5r3Q0J72k35J9L4k3J16j11
$$ 133 105 73 176 175 130 197 105 95 94 87 114 100 262 58 145 20 89 244 156 168 149 72 147 54 134 306 71 90 124 101 217 106
3776A06m4J01m4MR1j8O3j11o7J20k6p5l1O7j6J3J72j36J02j30M0j39J13r0J08K2j25O9p6k3
$$ 106 62 163 119 123 214 196 259 148 81 201 175 100 69 136 120 133 305 169 271 141 181 42 155 65 173 195 70 139 63 40
3495D0K04j77J19q1L7q7J30j5J8j00J41p6J33p4j31L9j9K8J11j43n2lJ03m2rRMO0L0j59J19
$$ 40 244 67 186 105 142 55 185 170 188 88 229 153 286 212 81 120 101 129 240 97 45 42 145 103 94 103 107 167 197 38 157
3204A57m5L2%J21J33k52j29J13j5m0J92k06R5r4j1J83K17j29p8j94M0J9K9n2Q7N9N3k34J58
$$ 157 112 144 144 265 398 146 17 130 115 75 267 61 156 62 51 234 451 322 244 50 90 109 138 86 173 232 285 51 209
2931B09p0Oj06K2Q7Lm4J08k7j59J19k1n6P3k2P9j59M5P8j35J73m7o7J18j9M0q1j06j3J03K
$$ 209 139 145 39 61 148 151 107 215 188 29 148 127 71 144 122 201 42 87 165 30 203 156 89 207 188 228 147 41 28 131 133
2640A33q9N3O7J23k29O5m5L4K04j50j04l8J16jk2R3O2n5n0L3K6K4j91n2J14J99j45p1L1k7
$$ 133 44 97 164 287 58 123 78 112 316 166 62 24 140 139 117 210 272 217 167 200 226 250 59 7 121 320 175 104 135 108
2358A08N9J04j01j08Q0o3L7K02j51p7j8O1O0o5m6N8K53k53J6l7j1N3M3o0m1j8K9PJ0R9j06
$$ 108 167 271 170 62 142 79 116 318 167 90 72 133 193 128 82 140 393 140 156 119 108 161 204 144 103 85 114 121 131 230 124
2067A24l7L14m6q9j64J41L1J51K41O022j125n410p5N5Q5mn2P4j44N1lN9p5J08k01M9K6q0O1
$$ 124 87 401 355 266 102 243 274 425 666 6688 5563 153 78 133 218 214 162 236 92 143 140 199 124 232 31 80 106 26 87
1795H7m1J77j9k3j15Q2O1jj11j1mJ40l7j08N5O6N3J8j72M1n2J9L3k6J00K2j6k1rj18R6J5o
$$ 87 46 223 204 181 66 148 209 208 97 86 82 222 185 77 132 198 251 269 97 138 86 105 138 112 212 234 218 197 188 70 166 181 175
1485A75mo5k4M5m0k7k1k9Q4n2l7O1Q3L8j65O2J03N1j92m4J31p7N7K0J04j45J2M7q2jK3j5M6
$$ 175 171 106 82 127 87 60 39 10 94 42 5 66 149 187 22 84 187 238 46 2 133 56 113 133 237 92 104 151 69 68 91 76 122
1175A22nl1M2L6j5mp2J37r5M3r6J6k2J97r2j0j24J85m0M9J76l40J73j5q8L5p6k2R2k6p8J97
$$ 122 117 86 128 164 149 145 73 210 115 158 62 78 56 253 161 151 27 212 172 221 397 57 230 215 127 162 86 64 156 130 52 249
875B49P1k37m5Q9n3%P7j5q2O8J56o9l2n0l9l5J48o6m2L4j8Q1Q1j41j4P8o2r9P2P9j13M6k9
$$ 249 320 83 38 127 74 74 151 136 54 122 278 209 177 127 88 53 201 135 93 127 109 190 271 130 116 194 132 33 105 184 71 117 88
565H8J54k7j07O6L9j60qL0R3k4J9R4j58m3l2J69Op7P9o6n9N0MRn5L0m8Q1J20j37Lo4L5p8J32
$$ 88 242 215 108 174 213 53 45 75 168 144 163 257 99 56 24 193 199 122 201 135 76 126 130 139 84 114 66 147 267 130 133 69 104 26 158
236A58q0k7P4Q8J03j85j4j0p5P6OM9kN2q9j6L9o4L1L6M3m3j40J14O2j33J11o8N8J60Q8l19
$$ 158 78 51 125 213 316 131 117 107 32 108 114 163 161 213 124 108 147 83 114 150 193 150 10 124 186 53 164 96 154 314 402 83
-64H3RL2l2m2j0Q5M4P6j5m6o9P9o5KpJ6J3Oj9k3L8L4j10J02q3p4K4k7J03J27K9j09j28K7j
$$ 83 92 124 92 50 40 125 169 245 230 184 115 194 129 131 124 140 153 159 140 117 155 189 79 181 98 24 48 21 124 251 280 171 43 70 69
-393F9
##PAGE=	F1=-7578.24
##FIRST=	17614.246348710370512,	4405.4455391999963467,	0
##DATA TABLE=	(F2++(Y..Y)), PROFILE
4405D9Q5p0M1Jo5J14l2k0l4KP4P2l4k6l8p6rJ04r2J41p8JNp4O8k0j0R2J3lm6k3J21P2j87j1
$$ 49 134 64 105 106 41 155 123 103 69 71 145 217 183 157 119 43 34 138 46 187 109 110 115 41 109 89 79 171 184 181 135 112 233 305 118 107
4067A07lQ1l0n4L9n1L8k9o0P8j5J70j81pk8K6J34p2k0K8q0O3j01J01J40k21O3K5pR3j47m4
$$ 107 104 185 155 101 140 89 127 98 38 116 101 271 90 83 55 81 215 143 123 151 71 134 33 134 274 53 116 141 134 227 80 36
3767C6J16p3L3J37j02J05p3j19J62k3j09m0M4KQ5J23j80J70j21k1j24R7m6R5k4r6R0n1o0K13
$$ 36 152 79 112 249 147 252 179 60 222 199 90 50 94 96 181 304 124 294 173 152 28 125 79 174 150 54 144 93 33 246
3485B46k06J52q8O1q5J55l9l4n6J15n4J23n1j67Q5l9j8J35j56m6oJ28q3J3l1J8J08L2j76J31
$$ 246 40 192 104 165 80 235 196 162 106 221 167 290 239 72 157 118 100 235 79 33 27 155 72 85 54 72 180 212 36 167
3204A67m8J2j4J75Q2k59j03J35n4nK02k40J16q9QJ37K32j04j88r3lP4j4k1L5Q1L1k09J77m6
$$ 167 119 131 117 292 374 115 12 147 93 88 290 50 166 77 85 222 454 350 162 69 66 140 126 105 140 221 252 43 220 174
2922A74J7j60O3O0Pm6Q1m2j15J51l3j00P9j4M5q0n2J58j44J65q0p3J11K1Km7r9j0J13K8j10
$$ 174 191 31 94 154 161 115 196 154 39 190 157 57 136 122 167 87 35 193 49 214 134 61 172 193 195 148 49 39 152 180 70
2631G0k9J03J36j67MKk3K15j47q4k5R8k7k1J07N7n4l9OJ5kj45j7Q3J84r4o6o3J2M9J64j60
$$ 70 41 144 280 113 117 119 96 311 164 80 55 153 126 105 212 269 215 176 182 197 195 50 33 116 300 206 140 77 89 138 302 142
2330A42n4J1j1Q7J16j46m2j5L9Q0n5j9l0K65k07j9k9k9O0Kl0L5q1J27o3nJ16j29J4K96m5m5
$$ 142 88 99 88 175 291 145 103 88 127 207 152 133 103 368 161 142 113 84 144 146 116 151 70 197 134 129 245 116 130 426 381 336
2030C36k70K78J11R7M71R199j710q272j32J44K6K0j45Q9j19l0M0N5m0J38k67O8Pj5No1K08
$$ 336 66 344 455 552 1023 10222 8512 240 108 252 278 298 153 242 123 93 133 188 148 286 19 87 94 79 84 23 231
1776B31j0o3p3P9N0J2j17l8j7J50J8j55R7N6j1N4j56M9o8L2o1K7R3L0K1m3j4j03R8J00J30
$$ 231 221 158 85 164 214 226 109 71 54 204 222 67 164 220 209 263 107 156 88 120 59 86 179 209 230 187 173 70 168 268 398
1485C98k55oK3k5p1j0j0j3P0jn6lQ0L7j02N8J5M1j05n4J08o0O7J1J57k15M5j2o0J3K1l1K2
$$ 398 143 137 160 135 64 54 44 31 101 100 44 41 121 158 56 114 129 170 65 11 119 59 126 137 294 79 124 112 52 65 86 55 77
1175G7L7j7Q1j6K8l6l5M6m9N1r6k4J9J70q6L6j19J10j6O3K04l48J34m9p2N2l5q1J27o6o5K38
$$ 77 114 97 178 162 190 154 119 165 116 167 71 47 66 236 150 186 67 177 161 224 428 80 214 165 93 145 110 29 156 90 25 263
875B63N0k09p5Q0n9J8R3po1l6J62l1Mk8j09rO4K1l4k4L5N3Q2r4p8J06q8j4N7P3j18J0m5J83
$$ 263 313 104 29 109 50 68 161 154 93 57 219 188 192 164 55 46 110 131 97 73 108 161 243 149 71 177 89 75 132 205 87 97 52 235
556B35r2j8M5N5j43l4L2J19K6OK6j56o7j5J96m4ML6o5m0Q4r0J5J2kq4N4J46j09Np4J5o7J35
$$ 235 143 125 170 225 82 48 80 199 225 231 257 101 34 19 215 171 175 211 146 106 190 100 115 127 125 41 95 241 132 137 63 78 11 146
236A46o1m0L8Q1J20j64q0O1q2P5MjN4J23j55q4R0m7K6%O3j6j22J17N4j37J09l4J4J03J20k52
$$ 146 85 45 83 164 284 120 40 101 19 94 98 97 151 274 119 35 125 78 104 104 167 151 29 146 200 63 172 138 152 255 375 123
-64A23q4Q6j5j7k8P1M7Q4K3j10r0P7lJ4n6L7Ok4J2KP8jj44M3p2k2K5k7Q1J13N3p7j91M7m3
$$ 123 39 125 110 93 65 136 183 267 290 180 90 167 164 178 122 159 165 141 153 155 233 232 88 131 59 37 62 35 116 229 282 205 14 61 18
-393A8
##PAGE=	F1=-7649
##FIRST=	17614.246348710370512,	4405.4455391999963467,	0
##DATA TABLE=	(F2++(Y..Y)), PROFILE
4405A06K7j08J16k5q9R2n7O4l7m5O9P6l4J4j3r9M3L1m9P6m2m4K8q5R7k4M1O9M2Lj35pJ88N4
$$ 106 133 25 141 116 27 119 62 126 89 44 113 189 155 169 156 57 100 131 82 158 116 72 100 15 112 88 129 198 240 243 108 101 289 343
4086C43k32j9L1N4n8n6RK5N0o5n2J16k3J41j39j10Q9m8J18n8n1P2o1M7p2P3R2j91J15J2PO4
$$ 343 111 92 123 177 119 63 72 97 147 82 30 146 123 264 125 15 104 56 174 116 65 137 76 123 51 124 216 25 140 152 159 223
3786B23j68QR0j24J02J53k07J70m3j38J54nj23n1O2K9J09M8j84K14j20r9l2M7j1R0q2l1O6
$$ 223 55 63 153 29 131 284 77 247 204 66 220 215 92 41 103 132 241 289 105 319 199 100 68 115 104 194 112 81 147
3513A47j1o7J63j91J62r6O2p8J56m5p1pP1j8R3k8j62J08m7n5J21j33l4l3J45q4Qp3K7J56K7
$$ 147 136 69 232 41 203 107 169 91 247 202 131 124 195 177 270 242 80 188 141 86 207 74 40 7 152 68 76 3 30 186 213
3222B13j87J39n1Mj7J90L4k58k5R9p1M5J85k84J65q9J7P9K25n6k58j0P4K0p5J7j3Q5J0j21
$$ 213 26 165 114 118 101 291 325 67 42 141 70 115 300 16 181 92 109 188 413 357 99 89 163 183 108 125 112 197 207 86
2941H6J33MJ8k22J23L6j3p6M6l1m4J60m2j39P9QRk6r7J90q5R7j09o6R7N9m3j6o7qJ05L0j09
$$ 86 219 223 241 19 142 178 165 89 135 104 60 220 178 39 118 126 135 109 12 202 117 214 105 39 136 195 152 136 69 61 166 196 87
2631H7o2P7J37o5q5Q5o6J77j32o6k1R7o1l3J27N6n7k1j5oqm5l9O2J23ko3j56O3J0K10j95j0
$$ 87 25 102 239 174 89 174 108 285 153 87 66 163 102 69 196 252 195 174 159 153 145 100 61 123 246 244 181 25 88 98 308 113 103
2321A03l6K8J15K5j18j1j2L3P2k6oo0K15j53l0n7l8P4%k1R4j29J99j34RJ02j33O5K37l5J1
$$ 103 67 95 210 235 117 106 94 127 199 173 167 107 322 169 139 82 44 118 118 97 191 62 261 127 136 238 105 170 407 372 383
2030C83k03K46J94K7O82J1853k197j0650j87K00j1K8k19R1o4j35R8K5K4J30k77M6J6J4j8o1
$$ 383 180 426 620 647 1329 13182 10985 335 148 348 337 365 146 237 173 38 136 161 185 315 38 84 100 114 96 35
1786C5J76J5o8p0J14J5J6j06q8lJ38P4j68R3N1p6R0j14M7q9Q4j34L0P2M7M3m4l7p4J16J16
$$ 35 211 226 158 88 202 217 233 127 39 36 174 248 80 173 224 148 238 124 171 82 166 32 62 134 181 224 180 143 69 185 301
1495C01J43k81LN3p6r1JJ3j6N4M5p7m5P2K3j6L8p7L9j2p2Q0l9O7KJ88k27L4n8J2K0m3l6QP9
$$ 301 444 163 166 219 143 52 53 66 50 104 149 72 27 99 122 106 144 67 106 94 22 102 63 130 132 320 93 127 69 81 101 58 22 30 109
1166A09l1J17j7N1r4K8j2n0O2q6l6O3J02r1Q6j08N6MQ7J90l32R1j05pM6J0r6J26o0k3J73L5
$$ 109 78 195 178 229 135 163 151 101 163 77 41 104 206 115 201 93 149 153 240 430 98 189 84 77 123 133 37 163 103 80 253 288
865B88j65q5Q3n3J0P9Ql9o8J01K3J4j1j72N9o0J17qj00Q1M1P9o2j27J16q5N2K4O4r7J5q4J90
$$ 288 123 38 121 68 78 157 165 126 58 159 182 196 185 13 72 12 129 121 21 102 143 222 160 33 149 64 116 140 204 107 122 38 228
556B28j48M9PQ4j14l0J4J15P9j2l1j25j15K6J95r3Q0k4n1j3J20j54qP5l3r4L2J31p4J5p0J0
$$ 228 80 129 136 220 106 76 90 205 284 272 241 116 1 27 222 129 209 185 134 121 241 87 79 154 121 27 59 190 116 131 61 71
255G1m9R6l8l1L9M4J24j18r1N1m3P1k5q1J16J71k10m8N1k1L0m0R0j9j06J35L3j32J18ql9N6
$$ 71 22 118 80 49 88 132 256 138 47 98 55 126 101 20 136 307 97 49 100 79 109 69 159 140 34 169 202 70 188 180 141 197
-45A97J25j57j37J03k0Rj5L9N0O9O1j39j20O4M8Pr2Q2kn2M7J5J00j5j45l9o1M6J0j9M2J00
$$ 197 322 165 28 131 111 120 105 144 194 263 324 185 65 129 177 184 92 174 172 120 167 182 282 267 122 83 22 68 78 59 101 201
-346B01O4l7k21M4j7
$$ 201 265 228 7 51 34
-393C4
##PAGE=	F1=-7719.77
##FIRST=	17614.246348710370512,	4405.4455391999963467,	0
##DATA TABLE=	(F2++(Y..Y)), PROFILE
4405A74k8j27J43l8q8L2n5J51n2p8M3Q3j8M4J1j36R9n3L4j4k7m4L9p2Q8J9N5K1P1Kk04NK37
$$ 174 146 19 162 124 36 68 13 164 112 34 77 160 142 186 197 61 160 107 141 127 100 56 95 23 111 130 185 206 277 279 75 80 317
4096C17L7k47l9O0K6p7m7oR3L3r0oJ35k3P2q6q1P8j13J01m8p3R7rJ0l1K2L4j24J48mJ8K4j71
$$ 317 354 107 68 128 154 77 30 24 117 150 60 54 189 166 238 152 71 149 36 137 89 16 113 104 114 83 105 139 15 163 159 177 201 30
3776C0P5N4j15J26J45l13K41k3j33J05K0q8o8R2M5R8l0j32K08j19j53K3K9PQ4j13J0N2L1q4
$$ 30 105 159 44 170 315 2 243 220 87 192 212 124 56 148 193 291 261 129 337 218 65 88 117 124 208 95 105 157 188 104
3495A04R4j14J28r0L2o7J32l1p5K4L0J2N4j0j25J14m8p1P7j08j5j9J03n0oj3m1J58J8j79J35
$$ 104 198 84 212 122 154 87 219 188 113 137 167 179 233 223 98 212 164 93 170 62 47 28 131 81 75 62 21 179 197 18 153
3204A53n6J2j4J64jk25M2L3o1J11J41k65J62r1J8J3J88K0k58J8J53l8j31N3n1O7jl1Q6N6K3
$$ 153 97 109 95 259 258 33 75 108 47 158 299 34 196 105 123 136 324 344 86 104 257 219 88 141 90 157 156 125 211 267 290
2912B90k82J85Mm8j10%K8K3J42n1j55P2L1Kk7o8J57k4K9j17m2O9Q7q7Kk0mP9Or7K2j6R9L8
$$ 290 8 193 197 149 39 39 67 90 232 181 26 98 129 131 104 36 193 169 198 81 39 108 195 108 110 90 86 165 171 74 96 80 179 217
2593B17j75J81p8J03j15n0l0J14r9k1J25N2n6Jl9k2%K4l7K9N3R2n6j56N3n0K29k08K8n1M1
$$ 217 42 223 145 248 133 83 53 167 68 47 172 224 168 169 130 108 108 132 95 124 177 269 213 57 110 60 289 81 109 58 99
2302I9J19n4p9J4j0N6K2J9mn4J42r6mj29l7R0L8m4J20j42K25j85N1N1j18J08J50k2O9j03J76
$$ 99 218 164 85 99 89 145 167 186 182 128 270 174 170 41 4 94 132 88 208 66 291 106 157 208 90 198 348 326 395 292 468
2011D68K68n8Q30J3362k470j1987k26K16l1K5k56R3j5k03J28j9R1J07k75J9M6J8m1qP8O3p0
$$ 468 736 678 1508 14870 12400 413 187 403 372 397 141 234 219 16 144 125 216 323 48 67 113 131 90 82 160 223 153
1757A53p9J77l4Op3r8l4J28J13j60N8N2j25J20o5L8r3J27j16l5K1P6L9k4o7m2J42P0K4k25
$$ 153 74 251 217 223 150 52 18 146 259 99 157 209 84 204 139 177 84 211 95 60 81 157 196 172 105 63 205 275 299 74
1476G4J18N6j07q6KJ8k3M4Q7j04n8P8j1O5J3j40M3M7p1N3l5O5pJ88j96lo6O7K7j17K4l0Q9
$$ 74 192 248 141 55 57 75 52 96 183 79 21 99 88 153 166 26 69 116 45 98 63 128 121 309 113 110 44 111 138 21 45 15 104
1166A04o9J36K6O1j55Q1kj03O9p8pR1K2j09J25q3K2K3J10J42l00O2j42O2ON1o6R6m9k1J15
$$ 104 35 171 197 258 103 184 182 79 148 70 63 154 176 67 192 109 131 154 264 406 106 168 26 88 94 145 79 175 126 105 220
875B20K7j12q4R5l7pM2K2k3j1j6O9Nqj44P1j5L8J9j18N3P2O4p5j31J09m4O1oM9o4M5j13J64
$$ 220 247 135 51 146 109 102 144 166 143 132 116 185 190 182 38 109 94 132 151 33 86 158 222 147 16 125 81 142 136 185 121 166 53 217
556B17j68P1l0J16q0j2j1P9J19k1o9o8j06MJ65j20J38r2k9J5J46j81l1J09o0p5M9N2m4L1o0
$$ 217 49 120 90 206 126 114 103 182 301 280 211 143 37 41 206 86 224 132 103 118 264 83 52 161 101 26 75 127 83 114 54
264E4K3k3J6oj4Q9MR9p3m6k5RP1p3n0P1J85k49P0n6KM4rQ9p5j13J59J8j25J41Qr2K1J15n1
$$ 54 77 54 70 64 50 139 143 242 169 123 98 107 178 105 55 126 311 62 132 76 78 122 113 202 127 14 173 191 66 207 215 123 144 259 208
-64B08j26N8m1K4NJ8N4L3R3j27j52M0Q6j5j05J30rq4Q9J0J05j2j13j20m1Q4rOjQ5O0Jk17K8
$$ 208 82 140 99 123 128 146 200 233 326 199 47 87 173 158 53 183 174 90 179 189 294 282 169 49 8 92 83 89 88 173 233 234 17 45
-383D5L2
$$ 45 77
-393G7
##PAGE=	F1=-7790.53
##FIRST=	17614.246348710370512,	4405.4455391999963467,	0
##DATA TABLE=	(F2++(Y..Y)), PROFILE
4405B12n9j22J33m2n1n1M5J38p2q9OR2LN6L3j86J50j23J17p3m8kK7l8M9Q2M4l7Q9Jk06l5K68
$$ 212 153 31 164 122 71 20 65 203 131 42 48 140 143 199 232 46 196 73 190 117 69 67 94 56 105 187 231 194 283 284 78 43 311
4096C11K1k29n9P2Nq2k9L3R0Mq8OJ67j3j6l0k9M1j32P5m6OL4M8n4Jk2k8j0J41k4K6l2j42J36
$$ 311 332 103 44 116 121 39 10 43 133 137 49 55 222 209 193 163 134 175 43 118 72 78 112 160 106 107 85 57 47 188 164 190 158 16 152
3767A52J7p9J17J30k61J60j6j19L8M9j2q8R8N6Q0r8o1J73j10j19k0K8J6P1r2J0N9N9j10K1
$$ 152 169 90 207 337 76 236 220 101 139 188 176 88 186 242 322 224 163 336 226 107 87 115 131 202 110 120 179 238 128 149
3485A49j2P7p0j8n1Q8jm5K7J2J5J9lo7J10l9q1L2j09J4K2K6%j0L5n5Q6J5j24R2o3L3j0J09
$$ 149 137 214 144 126 75 163 162 117 144 156 171 190 187 120 230 191 110 142 33 47 69 95 95 85 120 65 151 166 42 134 71 104 94 203
3166B03j0j13K7n0k8J81Q2k04J20r3J2m2J15J13k06KK10q3j68Q1p4L0MM3M5R8L2l03K07l7
$$ 203 193 80 107 57 29 210 292 88 208 115 127 85 200 313 107 109 319 236 68 149 75 105 109 152 197 295 327 24 231 194
2884A94q1o2K2RM3J05o5j23N4K2K0o3k8J24K6l5q4l6M9J06j31QL5pM6l1n9J03l3K5Q5k18K22
$$ 194 113 51 73 82 125 230 165 42 96 118 138 75 47 171 197 162 78 42 91 197 66 74 109 102 148 117 58 161 128 153 238 20 242
2574B42o8M0j09l1n2J40j30O0N9L4l8K5p3k1J0N4qk4J4J40l7j28M0j01K18k14O5n2M2J06j13
$$ 242 174 214 105 74 22 162 32 92 151 185 147 172 99 78 88 142 134 110 124 264 227 99 139 38 256 42 107 55 97 203 90
2283I0l8L5j1R7n3O9qm2R0n1M2j89J1M3O2p0J22j11K00k11R8j1r2J36N2qJ16MQ5L19j45Q89
$$ 90 52 87 76 173 120 189 181 139 229 178 220 31 42 85 147 77 199 88 288 77 175 164 72 208 260 252 368 372 457 776 631 1520
1983A520J3354k464j1955k38J93m2J5k45R8Qk02J01n2J38Q4k78J2P6J4q1Q7n5J28r5p1K45
$$ 1520 14874 12410 455 217 410 368 383 138 236 244 42 143 91 229 313 35 47 123 137 56 143 88 216 121 50 295
1739B95p9j7k6n4r9J11J23j45J1O0j44J31k2K3p1J38r7o1n4J20RPq5k8J62mm1k8P2M2j30n5
$$ 295 216 199 173 119 20 131 254 109 120 180 36 167 145 168 97 235 138 77 23 143 152 159 74 46 208 204 163 135 207 249 119 64
1438F4jkk0L8J22j33m7J03n1J18j9j11MN8n0K9m5O4j4J52j33l8l7P2L7r4L3n1N5m3N9Q2O8
$$ 64 63 61 41 79 201 68 21 124 73 191 172 61 65 123 73 102 57 121 107 259 126 88 51 123 160 66 99 48 103 60 119 201 269
1128B69j77Q5L9j47N9o4L8R3m0j13J21m5ML8J36O8k57N5o0Nm9Q8l1P0n4l1P0K4n2p6R0j9m
$$ 269 92 177 216 69 128 64 102 195 155 42 163 118 122 160 296 364 107 162 102 107 58 146 115 185 131 100 170 194 142 66 156 137 133
818A33pL5j9M2q3P7j0pq0N9K9l2L9r9j6J37M1j32p0P5j1N1k5L4l0O8j26J19j38N1l8J27n4
$$ 133 126 161 142 184 101 178 168 161 81 140 169 137 176 77 61 198 239 107 37 112 101 152 127 161 131 199 73 192 54 105 67 194 140
509A40Mk8J9J37j7q1nr4k3J16p3J30j55JK8J55j84j8R8q1k9O2k2m1N0m0K7J8o9J8PJ43k2O2
$$ 140 144 116 135 272 255 174 169 75 52 168 95 225 70 71 99 254 70 52 150 69 40 102 80 39 89 49 76 94 25 43 50 193 171 233
189B33n0j4p9O7O4j22PJ3J75k67J74j44J0P2M8R1j55q1J03K3j09J68J1j32nJ03M0j24K3o1
$$ 233 183 169 90 157 221 99 106 119 294 27 201 57 67 139 187 278 123 42 145 168 59 227 238 106 101 204 244 120 143 82
-92H2K6K2PN9j3J13r0j68J4J21l5o7J15j4j16J29rR5%n5j87j0Q7j6L1l7O9L5K9j99K5O0
$$ 82 108 130 137 196 183 296 206 38 52 173 138 71 186 172 56 185 176 271 271 216 29 19 106 90 121 84 153 188 217 18 43 103
-393A03
##PAGE=	F1=-7861.3
##FIRST=	17614.246348710370512,	4405.4455391999963467,	0
##DATA TABLE=	(F2++(Y..Y)), PROFILE
4405B12p1j05J14l6mp5Q0J21r8q1LQ0NO0N1k36J83j64J75q7p9M4nKMJ40K3q9Q7Qj49q3K47
$$ 212 141 36 150 114 110 35 115 236 138 57 60 140 145 205 256 20 203 39 214 127 48 92 87 89 93 233 256 167 254 262 113 30 277
4096B77jj88n5O0oo9oM6P9k0n8l0K04Pj01J9J7kj24P4n8Q0J4O8j27J5l7m7M5J39m8L2r8o6
$$ 277 276 88 33 93 87 18 12 58 137 117 59 29 233 240 139 158 175 173 49 123 65 145 159 227 100 115 78 31 76 215 167 199 101 35
3776C5J62j6o4J11J23k14Q5k3r6l8Q8P2j06Q2O7O3j51KJ25q5o0q9K7K1N5k1j6O6O9j38m7R7
$$ 35 197 181 117 228 351 137 222 199 103 65 153 225 119 201 268 331 180 182 307 222 162 73 100 121 176 155 139 205 274 136 89 186
3476A86K2m7o6l2L9L4oJ7K0j5J0k1KJ04k1r9Lj06J8O6n6N6qP3o6oK1m9M1p3O0mL9K5j7qj22
$$ 186 208 161 95 63 102 136 130 147 167 152 162 141 143 247 226 127 130 24 42 108 52 108 100 173 107 101 122 73 114 41 101 97 136 161 144 136 14
3128A4J5K28K1j45P8q7jm4j1K03j47k2K33j07j78R6q3j4L5Q7OJ24M1k93J93p7q4L9O1o2M1
$$ 14 29 257 278 133 211 124 123 79 68 271 124 102 335 228 50 146 63 49 84 171 177 301 342 49 242 165 81 120 181 119 160
2837A60N8q3o3M4l0M3p6J1Q2N1r1no8M8J16j53QO8j7K1m4J2J15j4J3L7j64J37l8J9j27Nl1
$$ 160 218 135 72 116 86 129 53 64 146 197 106 101 33 81 197 44 52 120 103 124 80 92 207 193 206 243 79 216 178 197 70 75 44
2527D4J02j11J15pm%M5j06j2J6N2L8q4K6J08mr7M4j29J89k03P8n5M6Q6j50JN1j7J30j18J07
$$ 44 146 35 150 143 139 139 184 78 66 82 134 172 88 114 222 218 121 165 36 225 22 100 45 91 177 27 28 79 62 192 74 181
2227A81qk5O8l8Q2k02K3K3L8q8J13l6J29k15J35o3n8J39l5jJ51J00k1L41k18Q49J1828k182
$$ 181 173 148 216 178 260 58 81 104 142 54 167 131 260 45 180 117 59 198 163 162 313 413 392 733 515 1364 13192 11010
1964A1010j0557k23J40m4kj85R8Lj91P4n7J51O8k58M0O9Rj43K10j57J53j36k4K71j04m7K4
$$ 11010 453 230 370 326 324 139 237 240 49 123 66 217 285 27 67 136 145 2 212 55 208 72 48 319 215 168 192
1711A92lj32P8J02j23l7O9j20J07QKl3J18p6n9n6J03m0L9p0n6J71p0J08L3n5K6j53okl8LL1
$$ 192 189 57 135 237 114 77 146 26 133 141 143 110 228 152 93 37 140 100 139 69 13 184 114 222 255 200 226 73 67 65 27 30 61
1401F1J42j59j7J32p7J33n4o4l6N8k2jn4O6j6Q8m1m4l5N1N1l6K0p1K9L2l8R0O9j36K8P6j48
$$ 61 203 44 27 159 82 215 161 97 61 119 97 96 42 108 92 180 139 95 60 111 162 126 146 75 104 136 98 188 257 121 149 225 77
1091G7L2k9P1O4p1p3N3nKM3J67j6k16P1om7r7J17LM6p2l4L6J8Rn7N3KK1o0N2k7P0r5N1k0J2
$$ 77 109 80 151 215 144 71 124 119 121 164 331 315 99 170 164 117 20 137 140 186 114 80 116 134 143 86 139 141 162 102 154 127 197 102 153 133 145
743A45l0M0N4p3N5p7p6J95J9k00J8M5j2M3k6K4mP2j26O6r4L6j3J02l9J1l0n2J33lo5M7p6n2
$$ 145 115 155 209 136 191 114 38 233 252 52 70 115 103 146 120 144 140 212 86 152 58 94 81 183 144 155 125 73 206 203 138 185 109 57
424E7N9M7N7j70K4pJ45j72J8O6q9K7N1l2p0N2j0OQ1l7o4K1J70m5L5n2J2j12J24N0j64N0j8
$$ 57 116 163 220 50 74 67 212 40 58 124 35 62 113 81 11 63 53 59 140 103 39 60 230 185 220 168 180 68 192 242 78 128 110
114A10J51k14J98j87j8J14R3J05k23j6k8M6p2J86Oj43l2Q0R8j21Np5K6L2mO6o2J20m7j58M
$$ 110 261 47 245 58 40 154 247 352 129 113 85 131 59 245 251 108 76 156 254 133 138 63 89 121 117 183 121 241 194 36 40
-177D0J53k1m3N6k2j29J52l2P1KK2k25J6P1mM2n5N3j2M3j45J0O9
$$ 40 193 172 129 185 163 34 186 154 225 227 249 24 40 111 107 149 94 147 135 178 33 43 112
-393A12
##PAGE=	F1=-7932.06
##FIRST=	17614.246348710370512,	4405.4455391999963467,	0
##DATA TABLE=	(F2++(Y..Y)), PROFILE
4405A75o5o7Q7k0L3q3Q8J09j29n0K8N0k1O7O3k46J65j51J77p5o9N2m5L8l3J78kj22O8K6q5
$$ 175 110 43 130 110 143 60 148 257 128 78 106 156 135 202 265 19 184 33 210 135 66 118 73 111 78 256 254 132 200 226 141
4114A41n0J40l5j37l3M6j6l4nL7P4l2k1l5J80L0j58M5N4m8j04J11p7J27K8N8j91Pj2JOJ47
$$ 141 91 231 196 59 26 72 56 22 17 54 128 96 75 40 220 250 92 137 191 143 39 150 73 200 228 286 95 102 90 91 97 244
3814B44q0L8j59J9J67m2o8J10J27j74J6m2o3o9J06J26j16N4Q1M8j94N0P2m6j5j33J5K5M0P9
$$ 244 164 202 43 62 229 187 119 229 356 182 198 156 93 24 130 256 140 194 275 323 129 179 251 205 190 57 72 97 137 216
3532B16m6M7O4j54j00J94k9k6q9j6J1N0J6J1L8n8K5o3P8R7jj27j6l5n1R8j04Q9nJ02p2j10
$$ 216 170 217 281 127 27 221 192 166 77 61 72 122 138 149 187 129 154 91 169 266 265 138 122 87 36 134 30 119 114 216 144 34
3232C4L1L0Jq0Q1J0k4R9K1m0j18nK47k6j03M4p3j9no2J86j01m2K22j12j60J02q4m0P1J04l5
$$ 34 65 95 96 16 97 107 83 182 203 163 45 40 287 261 158 202 129 110 105 43 229 128 86 308 196 36 138 54 14 85 189 154
2931A54J33M0k51J42r0j7O6Q7j21M9J3j07NL4j01N6kK0K2M3j35R3j00M5J14j21LM8k9J4J3
$$ 154 287 327 76 218 128 111 177 264 143 192 205 98 103 137 36 92 90 110 132 175 40 133 33 78 192 71 74 122 93 107 120
2640A20K6Q1J0M6m0j13J4RL4j60O9LJ9m0J17m9n9M9O2j23k2L9K8Q2j34N4K7L7o1N7j42J64
$$ 120 146 227 237 283 243 130 144 153 187 27 96 99 118 78 195 146 87 136 198 75 53 92 120 202 68 122 149 186 125 182 40 204
2340B04j31J9m8L5P4j19lN1k5J34j50J26nJ0N8n7J00k00N1J6j7r8R7O4L6j93J38q9j5J08r1
$$ 204 73 92 44 79 153 34 31 82 57 191 41 167 162 172 230 173 273 73 124 140 123 25 122 186 222 29 167 78 63 171 80
2049H0oJ79J66j30L29k55P19R158j697q130j85O4l6k5q1P3j7j70N3l6J26O1j51K6M9Jr5K13
$$ 80 74 253 419 289 618 363 1082 10240 8543 413 228 292 256 231 150 223 206 36 89 53 179 240 89 115 164 165 70 283
1786B83j70Q2j21LK42j02q1O4M4j44N3O2r6n0M9q7P5K4k3OQ1n1m6j2N7q1N3l8m4J01r4J94
$$ 283 113 195 74 77 319 217 136 200 244 100 153 215 119 69 118 31 106 130 107 113 194 143 97 85 142 61 114 76 32 133 39 233
1485B33N3j09J1j75N3mk1nJ7J41j68J2J54r7J28r2j3p5P3pl1m3N3lRO5j9p4J1O8K5Lq2J3R8
$$ 233 286 177 188 13 66 62 41 36 53 194 26 38 192 95 223 131 118 43 116 109 78 35 88 85 94 159 140 66 77 145 170 173 91 104 202
1156B02n7J7O5p0m8R3j16NJ7Q6J2o5m0j4K2J7L2K00r2j82R8J4q2q6J01K2J8p9j2j0KO8j8k0
$$ 202 145 162 227 157 109 202 86 91 108 194 206 141 101 87 109 126 158 358 266 84 182 196 114 28 129 151 169 90 78 68 70 138 120 100
837A00L0N0j09Q1m9P0p1K3qM3k3J6N6q6P1n4r0J94Lj92N0K7l7L4j3K3ON6j11J5n3L8KQ2l6
$$ 100 130 180 71 152 103 173 102 125 117 160 137 153 209 123 194 140 50 244 247 55 105 132 95 129 116 139 145 201 90 105 52 90 92 174 138
509A38Lj7j10J09J0j7P0m7q0RJ69k7j25J5p1J21j45N1L3o5O1J8Nn5J1Jl7J59J4j31KJ69o7
$$ 138 141 124 14 123 133 116 186 139 59 68 237 210 85 100 29 150 5 56 89 24 85 103 108 53 64 65 28 187 201 70 72 241 174
199A74K2p1M0j21J61L3j91P7j6J13j28J70j81o4J49J11J20k64N6j76Q0k1J84lj22m7K1J23
$$ 174 196 125 165 44 205 238 47 124 108 221 93 263 82 18 167 278 398 134 190 14 94 73 257 254 132 85 106 229
-64B29j06Or2N0L1k7O7j02J14j7j06nJ86Nn6J0m4j10J53n2L9k1J07k11L6K2J3M9n0L4p3M8
$$ 229 123 129 37 87 118 91 158 56 170 153 47 42 228 233 177 187 143 33 186 134 173 152 259 48 84 106 119 168 118 152 79 127
-365A27o3j6N6
$$ 127 64 48 104
-393A04
##PAGE=	F1=-8002.83
##FIRST=	17614.246348710370512,	4405.4455391999963467,	0
##DATA TABLE=	(F2++(Y..Y)), PROFILE
4405A17m8j4N4J0M5r9R2J01j58ON2J7n7P3O7k10R6q6J24n7k7M1p5N1n1J82k3j25M4M6l7LM6
$$ 117 69 55 109 119 164 65 157 258 100 106 158 175 118 191 258 48 144 58 182 125 98 139 64 115 64 246 223 98 142 188 151 154 200
4096B00r1r3RM3m3Pj7L1O6l2J6J3Q2M6j57K9P4q8o3J60q9J35N0L3k33j0L1K6k3J59j18M4j51
$$ 200 109 16 25 68 25 32 15 46 112 80 96 109 191 237 80 109 183 95 32 192 103 238 288 321 88 78 109 135 112 271 153 197 46
3786D6M2J46n3q3J15J40j41m9o9k1L5L1J21j13K1J02L3k27Q0K0JLj34mK4L5J73p1jN4j52p1
$$ 46 88 234 181 98 213 353 212 163 94 73 108 139 260 147 168 270 303 76 156 176 177 180 46 42 66 101 274 203 202 256 104 33
3485C3K02o7j4p3j7J3M7J3J6N1r2L8r8J45Q8J0j52l8N3j21J01q3P2kJ20p4j06n9R6j8o7P5
$$ 33 235 168 154 81 64 77 124 137 153 204 112 150 52 197 285 295 143 105 158 37 138 55 127 125 245 171 65 6 102 84 17 92
3185I2K7m0J45K7n8j34j4K46n3p5J6m7m4L3pQ7q1n0J79j03j20J08q9JM6J15p5J27K4j83O4
$$ 92 119 79 224 251 193 59 45 291 238 163 179 132 88 121 114 201 120 70 249 146 26 134 45 46 92 207 132 259 283 100 164
2894A64l2M2L4J00j61O6j0j38O4J4j14OJ11K8m0Qr0J09r2J7R3o0j3Pk5J7P0J1L2K9R2j00p4
$$ 164 132 174 208 308 147 213 203 65 129 143 29 35 146 174 134 142 52 161 69 86 179 119 106 113 88 105 175 186 218 247 339 239 165
2584A65j08N0O2j42J05J9p0M1J02p0j14R0O9j24m6Q3%J04j61N9n6P7k0P2j48J47n6l3k9nP9
$$ 165 57 107 169 27 132 151 81 122 224 154 40 130 199 75 29 112 112 216 55 114 58 135 115 187 39 186 130 97 68 63 142
2293A42p4j4M9l9J03j42J26kN2N1q5Q6j80R9Lp1p8O1J46m9j31R0q7K1N7r9l3K17J83k29K88
$$ 142 68 54 103 64 167 25 151 149 201 252 167 253 73 172 175 104 26 87 233 184 53 143 56 77 134 35 2 219 402 173 461
2002D61k30N08N973j124n239j33k3j8n3M2K5m3j35L5LP6O3k2lM3j6n3K05j73Pm5k1J89q0j12
$$ 461 231 739 6712 5588 349 216 193 175 122 164 189 146 11 46 49 125 188 166 163 206 190 137 342 169 176 131 110 299 219 107
1720A07Q6Q0j32L3K0o7j8jo7M3L4n2M0L7k2l5K9K7q7L1j1Nj2%Q3P7o8j8o6lj7M2m7OJ23j29
$$ 107 193 273 141 174 194 127 109 108 41 84 118 66 106 143 121 86 115 142 55 86 75 80 68 68 151 228 160 142 76 73 56 98 51 57 180 51
1382E1kJ64j21J22j23L5q3Q8j9m8qJ1K7k4J09J5j01o1Q5P0j1q1KJ40m6o0N7rj07Q4p1j4N2
$$ 51 49 213 92 214 91 126 43 131 112 64 56 67 94 70 179 194 93 32 117 187 176 95 97 237 191 131 188 179 72 156 85 71 123
1072A23R5n0j7l4m4J8M9nK30j39j58J19J2r7l6O8J9k2n0K0o5k1J11M1j14Q4N0j48J20p4M3
$$ 123 218 168 151 117 73 91 140 135 365 226 68 187 199 102 66 134 153 131 81 101 36 15 126 167 53 137 187 39 159 85 128
781A28l2L6J9M6m8j3M1p7Q2l2p2J46mj08J6K7m3mQK5jK9q7jl7M7j0Q1l7j7Lp7J2J2N0N9kr9
$$ 128 96 132 151 197 149 136 177 100 182 150 78 224 220 112 128 155 112 108 116 141 140 169 82 81 44 91 81 162 125 108 111 34 46 58 108 167 165 66
424F6rK34r6q4Nj00Q1m5jJ2k5O3k0M9m2Qk4m4K04N9j81l6J46p8K5r9P7q2J33J8j87P5K4N0
$$ 66 57 291 195 111 116 16 97 52 51 63 38 101 81 130 88 96 72 28 232 291 110 74 220 142 167 68 145 63 196 214 27 102 126 176
105A76m4J26j40n2J08J01J29k76J25j75J3J4J58j4q3m9p4J27n6J5j16J04K4o2M6j16R1j2k2
$$ 176 132 258 118 66 174 275 404 128 253 78 91 105 263 249 166 117 43 170 114 129 13 117 141 79 125 9 100 88 66
-167F6k9K19K1p7oq9p7J57o3J3q0J87j62N7m8K1O4k5J2j36N5J7m1L0
$$ 66 37 256 277 200 194 105 28 185 122 135 55 242 80 137 89 110 174 149 161 25 80 97 56 86
-393H6
##PAGE=	F1=-8073.59
##FIRST=	17614.246348710370512,	4405.4455391999963467,	0
##DATA TABLE=	(F2++(Y..Y)), PROFILE
4405E6k5L3K3N3L0j19Q6R8j80Q7O4k2p5O7O2j65K8j0N3m4K3K9p1J4l5J45l7r2K7N1jM7Jj61
$$ 56 31 64 87 140 170 51 137 235 55 142 206 184 109 176 238 73 101 91 144 100 123 152 81 95 60 205 168 76 103 154 153 200 201 40
4086D0qJ7L0o4L2m3L5N5k9O3N3j8M2j11pP4j14QJ78r2J14O7Kk47J4L3L7l5J63j52M7r8K9R4
$$ 40 32 49 79 15 47 4 39 94 65 128 181 163 205 94 87 161 47 55 233 141 255 322 324 77 91 124 161 126 289 137 184 86 115 209
3767B09m6j00J23J60j11j15r0K0J32j9P4r7j2J33J8k40Q3k0M9j5r3llN2K25r0o6M6j27KJ48
$$ 209 163 63 186 346 235 120 30 50 182 163 237 140 128 261 279 39 122 102 151 136 43 40 37 89 314 224 158 204 77 79 227
3476B27q7j0l7k6J1O5j0K5N7j08K5q9J77Q0Nj62o5J46j69N8k9M3RJ25p8l6o6J0j8m3N4M0j4
$$ 227 140 130 93 67 78 143 133 158 215 107 132 43 220 300 305 143 78 224 55 113 84 127 136 261 183 147 81 91 73 30 84 124 110
3166A10J42L3o0j83%K26n9n5pj0p6N4K5N4r0l5J20r8n6J05j03L0K0J34j04J10rj00j7P9M4
$$ 110 252 285 225 42 42 268 209 154 147 137 61 115 140 194 104 69 189 91 35 140 37 67 87 221 117 227 218 118 101 180 224
2875B24j5J00j76Q8jj70R9j6m4m3J43N0r1l9lO8o3j5O5%l7k8MRR5kj8M2J29j35l6q1m2P2n2
$$ 224 209 309 133 221 220 50 149 133 89 46 189 239 148 109 106 174 111 96 161 161 124 96 100 109 204 202 184 226 355 220 184 103 61 133 81
2546H1Q9K0j46J15Q3p6j00M8O8j18o2J31j1R1j76M9n4M4K3Q0j47J28K0n6k2n8R6n3%N9o2M0
$$ 81 170 190 44 159 242 166 66 114 182 64 2 133 122 213 37 86 32 76 99 179 32 160 180 124 102 44 140 87 87 146 84 124
2246A24j08J24qQ5M2q9L6j40J57k5j02n2M2J75j16n6L0p2L8J8o3J3J63J58k85K12j21K27K962
$$ 124 16 140 132 217 259 170 206 66 223 198 96 44 86 261 145 89 119 47 85 103 40 53 216 374 89 301 180 407 3369
1973C369n89k498q1j06Qq1J46k5p5m1k1M5K7P1Q7l9M7l6k1J91j81m8K3l8J34n5j35R2J01r7
$$ 3369 2780 282 201 95 103 22 168 143 68 27 6 51 78 149 236 197 244 208 187 378 197 149 172 134 268 213 78 170 271 174
1692A74K0j6m6K2l5m4lL5p4N9KPl4N5J7p2Kj0N7j00J00J1JM5p9N3m9n2J04q7kJ11q5k8J57
$$ 174 194 178 132 154 119 75 72 107 33 92 94 101 67 122 139 67 69 59 116 16 116 127 128 173 94 147 98 46 150 63 61 172 87 59 216
1363B16j48J24j25P0n1Q0n4l1Lk2N2J2O1N5r7j04M4R3k2o9kJ49l6r5N4K5j32N6l3k8P2J00
$$ 216 68 192 67 137 86 166 112 81 84 62 114 126 187 242 145 41 85 178 156 87 85 234 198 103 157 182 50 106 73 45 117 217
1063B17j07P1n6k9j4Q0o5K47j48j21J04Lr9K0M6Mp7K0K5p2lO2J09j84J52Pj51J38r1Pj0R7
$$ 217 110 181 125 96 82 162 97 344 196 75 179 182 83 103 149 153 76 96 121 49 46 108 217 33 185 192 41 179 88 95 85 182
762A82K1K5p7l9K0o0Q7j9m3P6%j7k7M1j1o9K8J9j3kn6L6o4N5m6J00m2m1K6k9l6j7R1L2N9j05
$$ 182 203 228 151 112 132 72 159 140 97 173 173 156 129 170 159 90 118 137 124 122 66 102 38 93 47 147 105 64 90 61 25 8 99 131 190 85
424H5lK29j37n4j1n6O1k0m5J7j9O2n6Q8k9J7o0jK00Q9k12p7R9o8M3j14J14l1N7J3j19J7P7
$$ 85 82 311 174 120 109 53 114 94 49 66 47 109 53 141 112 129 69 68 268 357 145 68 167 99 142 28 142 111 168 181 62 79 156
114A56k6K4Q5q2l4N1P2J20k56J75j44j1K0J10k4m2m5j12P3K9J1q4J03J0q1j0l1Mn1P4o3K41
$$ 156 130 154 239 157 123 174 246 366 110 285 141 130 150 260 236 194 149 37 110 139 150 66 169 179 98 88 57 61 10 84 21 262
-186B62K5q8Nj50l4J64p0J4p5J45r2P9j18QR4Rj7j22K3O1n8j
$$ 262 287 199 204 54 20 184 114 128 53 198 106 185 67 75 169 178 161 39 62 123 65 64
-393F4
##PAGE=	F1=-8144.36
##FIRST=	17614.246348710370512,	4405.4455391999963467,	0
##DATA TABLE=	(F2++(Y..Y)), PROFILE
4405A6OM2oJ07Nj40O4R6j86J78O5o3o0L4N3j17j0M3k0l5O4K0m2n7NP8l6l9J7N3K7O1qj84M4
$$ 16 22 64 58 165 170 30 94 190 4 182 247 184 124 158 211 94 84 127 107 72 136 156 114 57 62 140 104 65 82 135 162 223 215 31 75
4077G5J1lk3kk7qN6k8J13P6q8Rn5k0M6j06N0J77q5Q2P4l1k30Q8k2M2l1J55j68L9o0L7J6k1
$$ 75 86 83 60 58 31 23 79 51 164 240 152 161 106 86 132 26 76 253 168 250 324 293 63 151 129 171 140 295 127 166 106 143 159 138
3758A38q9J05J81q0j79j1k5J93n4J3o8m5J70Nk07M5qO1p8j2Rm7Q8K20j01j24L8q1N3Q8q6n
$$ 138 49 154 335 255 76 65 40 233 179 192 124 79 249 254 47 92 84 145 67 55 64 17 105 325 224 100 138 57 110 198 112 107
3457A07j1k4%J03m0L2N3j11j0m3J75P5j9j47q8K21j87j6M1J0L0J13q5L4o2q1j0j9L1M3K4J12
$$ 107 96 72 72 175 135 167 220 109 99 56 231 306 287 140 52 273 86 70 111 121 151 264 179 213 151 70 60 41 72 115 139 251
3157B51N1m4k24J3J77m6l2k3L4j03M1L9P0j20lQ3j18K3P8j18M0lJ64j19R0n8j7l5J34J8o2
$$ 251 302 258 34 47 224 178 146 123 157 54 95 134 204 84 81 164 46 69 147 29 69 66 230 111 201 143 126 91 225 243 181
2865A81R0j60J00M1j97J09n2K4k6R9Q1j20q2M3L8k8m6M8M2o4m6M7j2R1po1N7J39j53J2Mj42
$$ 181 271 111 211 252 55 164 112 136 110 209 290 170 88 131 169 141 95 143 185 121 75 122 110 201 194 133 190 329 176 188 192 50
2565E0M0M4O8J2j71J44P1p8m7m2N5j09k2J34RL8j87M3M5p3N8P6j35J12Q3n8k7j10J11m1L6
$$ 50 90 134 202 214 43 187 258 180 133 91 146 37 15 149 158 196 9 52 97 24 82 158 23 135 218 160 133 23 134 93 129
2274A29P6r4l9l4R9k8R8L5m9m4q4K06o3j11m9O3J48j60K7k1o1L5J6m8L3J39J28k59R9Km6O78
$$ 129 205 111 72 38 137 109 207 242 193 149 65 271 208 97 48 111 259 99 126 105 44 79 95 47 80 219 347 88 187 189 143 821
1973H21j89m00m5j58L3%Q9l9r7L6k0K6K0O8J36p2N2n2kJ74j82q2N9l2Q7l6j52R2J07m7J5m2
$$ 821 632 232 187 29 62 62 151 112 15 51 31 57 77 145 281 209 261 209 207 381 199 117 176 144 231 195 43 135 242 195 210 168
1673A68l7N4m5j9m6J9o0M2LJ9m6N5K2n3J2n7R5q2R6M8j40J56j41J31o2r4J48j13j8J20n7n3
$$ 168 131 185 140 121 75 94 34 76 79 98 52 107 129 76 88 31 126 44 140 188 48 204 63 194 132 38 186 73 55 175 118 65
1372F5J32j70J40p1P0k6O6r3lrk3N8M0kJ00p3j13k9R5l3n3KJ26m0p5O3K7j23K2j1m1P6J00
$$ 65 197 27 167 96 166 140 206 113 110 101 78 136 176 174 274 201 88 59 154 121 68 70 196 156 81 144 171 48 70 59 18 94 194
1063A94j41J65q0Jm8R6j16K23j17o0L8Kr5P4K5rj24Q5Rj7k0LJ71k05J92l9j36J36j02pk6J67
$$ 194 53 218 138 139 91 187 71 294 177 117 155 157 62 136 161 152 28 113 122 105 85 88 259 54 246 207 71 207 105 98 72 239
762B39qLq9n1J0m4P0k0j2NJ3N5o1N4M2j27M0Jj8l5j4P6r4O1r5J28m9m3L2Jk5J2L1JJ23r3q
$$ 239 231 234 145 94 104 60 130 110 98 103 116 171 110 164 206 79 119 120 102 67 53 129 35 96 1 129 80 37 69 70 45 57 88 89 212 119 111
415A11J79j38k7l9KQ6n1p9M8m5O1p8J14k2K6r7N0J87J00k20p9J5m2O8q2J05Kk4K2m3m4J14
$$ 111 290 152 125 86 88 174 123 44 92 47 108 30 144 122 148 51 101 288 388 168 89 104 62 130 48 153 155 131 153 110 66 180
114A80r6O8O4k1k4nL8R2k14J94j03jK4N0l0rl8n8J3O7j0m9R5pq4q4M8k0pJ9q1K29K4q2L0j68
$$ 180 84 152 216 195 171 166 204 296 82 276 173 172 196 246 216 207 169 111 124 191 181 132 227 220 136 52 100 80 73 92 11 240 264 182 212 44
-224D4QJ32p9M2Rj9k0R5j42k6J15L7m8o4rO3o6j3
$$ 44 52 184 105 147 156 137 117 212 70 44 159 196 148 84 75 138 72 59
-393E9
##PAGE=	F1=-8215.12
##FIRST=	17614.246348710370512,	4405.4455391999963467,	0
##DATA TABLE=	(F2++(Y..Y)), PROFILE
4405C7lL1l0J50j4j56L4Q5p8J64N5r7k8rM1p0qN6q1j6P4J6j3j06K5Pj5NJQ9L1M5oj80O7J6
$$ 37 34 65 35 185 171 15 49 134 56 220 275 178 150 141 182 112 104 160 79 63 137 153 140 34 59 66 51 56 57 146 177 222 216 36 103 119
4067A19m8L7n1K3o9N9k0J45P7j16m1qmLp5M3J63o4N4P0o1j81J60q9M6k0J32j58K0m9P4n0l
$$ 119 71 108 57 80 11 70 50 195 272 156 115 107 103 106 31 74 237 173 227 297 236 55 215 126 172 152 284 126 146 97 171 121 118
3758A18m2M4J99m5k22P5p1K01q0m0l4p4K01lj71K9M2L6j56Q1%q3J25J74j03j31J2k9P4L2o9
$$ 118 76 120 319 274 52 127 56 257 177 137 103 29 230 227 56 85 127 163 7 88 88 5 130 304 201 70 82 53 127 159 90
3466I0PrpJ0J22o8L1M1j07m8JJ64O8n4j05q9K51j75m6O5k7N2R4j00Q7m9j37k1RRL0O7O4Q3
$$ 90 97 88 81 91 213 145 176 217 110 62 63 227 295 241 136 47 298 123 77 142 115 167 261 161 248 199 62 41 50 59 89 156 220 303
3147C03j8j93j5R1j8Pj4N6j04k5M8J02j55K4Q3j52R8K9j23L2j7J93j27P7j14N6J5J00j0r2
$$ 303 285 92 77 168 150 157 143 199 95 70 118 220 65 89 172 20 118 147 24 56 39 232 105 182 68 124 139 239 229 137
2865A37P1j09Q6R6k13J09q4O7LM2J12j26j07L1L2jp1N1N9q6m0P8l4O9jr7R0J10j66P3O1j69
$$ 137 208 99 185 281 68 177 93 160 163 205 317 191 84 115 147 146 75 126 185 99 59 137 103 172 171 74 164 274 108 181 242 73
2565G3J3R2M0Oj48J28P6r0J1j31K7r1J0J51M5l7j38JQ7j15N2O6j05J22R7n5l2j52J12k9Q4
$$ 73 86 178 218 224 76 204 280 190 201 70 97 6 16 167 212 175 37 38 125 10 62 128 23 145 242 187 155 3 115 86 170
2274A70R4j28r8M0O6o2R5L0K5j24k7K29j03j02n9R1R1j85J18o1n1J1M6m8K4J30J16k20M2K8
$$ 170 264 136 38 78 144 82 177 207 232 108 81 310 207 105 46 137 228 43 161 100 49 60 106 58 82 212 328 108 150 178
1992A78j49O61n2m26m1j14LN3kJ4l3l2jKM0O1J32r3N0o0KJ57j66j04O4nN1k2j37O5R9RK1o0
$$ 178 29 690 638 212 171 57 60 113 111 125 92 60 59 61 101 162 294 201 251 191 193 350 184 80 144 139 190 168 31 96 195 204 225 165
1673A65m2P2m1Pp4j5rlM2Qn7L2K7k4M8j15Q7m5Q0L2j65K21j48J24m6j18J62j19l5J35m8o6
$$ 165 123 195 154 161 87 72 63 60 102 110 53 85 112 88 136 21 108 63 143 175 10 231 83 207 161 43 205 86 51 186 138 72
1372G2Q2j00J00oN9j8M9j23J4k5rN7N1o6J53m8j15q5R1m9l9J6P9o2j6Q9lr3Kj2l3N9R2j15
$$ 72 154 54 154 148 207 189 238 115 129 104 95 152 203 137 290 242 127 42 133 84 45 61 140 78 62 151 148 55 57 45 12 71 163 48
1053D8J95q3J9p7J10j02J16n9Qn6J9q9J15mj4p2M4j1P0o4l3K04k11K18n5j41J44j18j1m1K09
$$ 48 243 160 179 102 212 110 226 167 175 119 138 49 164 160 146 74 118 107 177 113 80 284 73 291 236 95 239 121 110 69 278
762B78n6j0q0l6K1m9L4l8J7l5J2R9o3L9R7j58M7l1Np7M0P8j05P2n0N9n9KROk8M6Nl5J69n6
$$ 278 222 212 132 96 117 68 102 64 81 46 58 157 94 133 230 72 119 88 93 16 56 134 29 101 51 110 51 53 62 68 40 86 91 56 225 169
424A69l3R7r8%o9N5J05q7j07Q7p3N8r0J30k7L6j27R2J72R2k06k5m6n1Q2p1R5K2r1M6J7r1J24
$$ 169 136 233 135 135 66 121 226 139 32 119 46 104 14 144 117 153 26 118 290 382 176 151 105 54 136 65 160 182 91 137 154 63 187
114A87j42Q2O9L1k6n2J2M9j56J70n7K9L5j1l1J3l4MJ9N2m0j3Q3k0p5j60J16k3K8n3o0J68K5
$$ 187 45 127 196 227 201 149 161 210 54 224 167 196 231 220 189 202 168 172 191 243 203 190 273 253 178 18 134 111 139 86 26 194 219
-196B19n5N1j06j4Q8q7P4O8j43J5R9j01k1O0M8p6Jl5N8o5Q
$$ 219 164 215 109 95 183 96 170 238 95 110 209 108 87 147 195 119 120 85 143 78 86
-393H6
##PAGE=	F1=-8285.89
##FIRST=	17614.246348710370512,	4405.4455391999963467,	0
##DATA TABLE=	(F2++(Y..Y)), PROFILE
4405E2lK8l2J48j5j58M8K6RJ45M1j15km3K8k8KN0j23RO4J2jp1k7j8J8J1m4J70LJ9j2j75R4
$$ 52 49 77 45 193 178 20 68 94 103 248 289 174 172 129 157 129 131 181 58 67 131 143 142 71 44 26 44 55 11 181 184 203 191 16 110
4077A10L2r8J06j11R6p4NPJ40O0j15q0K2K2l4n8J5J37k3L1O1q9r9J92j39N1j1J02j27no0J28
$$ 110 142 44 150 39 135 61 66 73 213 273 158 78 100 122 88 30 45 182 159 190 251 162 63 255 116 167 156 258 131 126 66 194
3776A94m5l8lk1K08nk09R3r4J76r5p7ln2J69lj55O4O0K4j14N9k9q8J35J04r8o1l9J2O2rl7
$$ 194 149 111 108 87 295 290 81 174 80 256 161 84 81 29 198 195 40 104 164 188 74 133 104 16 151 255 157 96 57 69 131 122 85
3466H5K1l6K1N0J11r2K0K6j01o4J5J55N7r5m2p3K37j36oK2n4N8P4j16J06k7j29p1M4j3MJ10
$$ 85 106 70 91 141 252 160 180 206 105 41 56 211 268 173 131 58 295 159 153 175 121 179 253 137 243 216 87 16 60 47 51 161
3166A61PJ21Pj39l5rK1N5J0N5j01j06N8J26j80L0R3j35J38l8j12PK1J75j37P8j67J08O6L9
$$ 161 168 289 296 157 122 113 134 189 199 254 153 47 105 231 51 81 174 39 177 139 27 34 55 230 93 171 4 112 178 217
2884B17k6r8N2l8M3J43k16J20j07O7L9j3J34j13j00m6O7pq2P7M8r5j0Q4m5L5K0j39J50M8j78
$$ 217 191 93 145 107 150 293 77 197 90 157 196 183 317 204 104 58 125 118 36 113 161 66 56 140 95 130 150 11 161 209 31
2593C1J31P8j33M0O1J2Mj20J08R8j24P1j98j6J0k7J72P6j10p8m1O6r8K6N9p0J66O2o3k7j38
$$ 31 162 240 107 147 208 220 224 104 212 310 186 257 59 43 53 26 198 274 164 86 45 111 13 39 98 28 194 256 193 166 28
2302B8N5j6J34J05j58r0O1L5q8P5L2J03j66%K30j38q0n1Q4K2j45J56r3l4j9P4l5j7J33J15
$$ 28 83 67 201 306 148 58 119 154 66 141 173 276 110 110 340 202 122 71 155 177 32 188 95 61 42 116 81 64 197 312
2020C12k17N7k7j8J026j10q09o7o3j5O8o9R6j3r9K4k1O1N7J00r7M3n6j8J44j26j21N0K6K7
$$ 312 95 152 125 107 1133 1023 214 147 84 69 137 68 164 151 52 76 55 116 173 273 176 219 163 145 289 163 42 92 118 145
1739A45%p4LO7O2L4p0n4P2l4L0p8o3N1m3Q4qo2K7kJ7Q4j24NpO5n0k4J89j16O0pj22J53j05
$$ 145 145 71 74 141 203 237 167 113 185 151 181 103 40 91 48 132 124 62 89 87 104 188 64 69 62 127 77 53 242 126 186 179 57 210 105
1410A05k4J20n7o2J1K9L6L3N6j9K3j41K3l3kO4N1j21J98l2j06j17R6p2k2K6L0o4J9J25n8n3
$$ 105 81 201 144 82 93 122 158 191 247 228 251 110 133 100 98 162 213 92 290 258 152 35 131 59 37 63 93 29 48 173 115 62
1110F2J4l3j4M9N9o4J68o3K3j04J36n3j8NO2j50N6p3J18l6j5kk1oJ47j14l2J85j99K21l8j64
$$ 62 76 43 29 78 137 73 241 178 201 97 233 180 162 167 229 79 135 62 180 144 129 127 106 100 247 133 101 286 87 308 270 106
809A06J59j39k3k5K12j09rn6%K9o9Mn0K1L6p8J13Km1J38j55N0o6N2p2M4L8r0Q7j8Kp3N2jp
$$ 106 265 126 103 78 290 181 172 116 116 145 76 80 30 51 87 9 122 124 83 221 66 116 50 102 30 74 112 22 109 91 93 20 72 71 64
480F4m7Q4J7p3J80%p1%k7J8p7Q3J03j11j10J02q5M5r0J38m8N1j00O9J56P5j75N5m7j06R2q3
$$ 64 17 101 118 45 225 225 154 154 127 145 68 151 254 143 33 135 50 95 5 143 95 146 46 115 271 346 171 226 179 73 165 82
180H2P2L6j37P8N8j33J21j38M8R6O8m1q5MNr9J06j6P1M8o2k4K2l3O0L9L1p4K4O8k3n3k09J46
$$ 82 154 190 53 131 189 56 177 39 87 183 251 210 125 129 134 35 141 125 196 244 182 158 180 147 207 246 277 203 227 295 272 219 10 156
-139A56k4M9j13l0R8L0j1N7m1m0M7r0R5J05j62l2Q0l0krM1r7O6o1O1n6M0
$$ 156 132 181 68 38 136 166 155 212 171 131 178 88 183 288 126 94 174 144 142 133 174 77 143 82 143 87 127
-393A27
##PAGE=	F1=-8356.65
##FIRST=	17614.246348710370512,	4405.4455391999963467,	0
##DATA TABLE=	(F2++(Y..Y)), PROFILE
4405E6K1K1l3J21Jj62Q7k0L9J26K8j12Nn7J7Q%L5j43K2O4Jqqr1N0rK5l3J66m9Pl5r5N5N1j33
$$ 56 77 98 65 186 187 25 112 92 131 257 285 173 178 121 138 146 146 181 38 60 124 125 117 109 18 68 59 84 51 217 168 175 140 45 100 151 18
4058A8J59j61J68o7n4M4J06L5j02q5K9M2n2l4m0J03M1lN3j20JJ80j57N5qO4p7l2o5J64J0r8
$$ 18 177 16 184 117 63 107 213 248 146 61 90 132 80 46 6 109 150 147 200 80 81 261 104 159 151 215 138 106 41 205 215 117
3758A17J0p0K07L4j67P1r9J37j01r9K3RQ2Oj36J12M0K6q1N9o4p1J15K7q9K9o5M1K3k2oL3p9
$$ 117 127 57 264 298 131 202 103 240 139 40 63 72 154 160 24 136 176 202 121 180 116 45 160 187 98 127 62 103 126 104 98 131 52
3448E2M3J03R0j15JJ5j00n5LJ55L8j36L4o4K02q0M7l0o6M4O0j19P8Qq4j07N1l1kJ18m1J53
$$ 52 95 198 288 173 174 189 89 34 37 192 230 94 128 64 266 186 233 203 137 181 241 122 200 208 124 17 68 37 35 153 112 265
3147B65K1p8m1r5O1R3L0M7r6j65N6J31j88J3R5m9J43j11r5j5Q1J23j50Q4j08L8R4j2k2p1L6
$$ 265 286 208 167 72 133 226 256 303 207 42 98 229 41 54 149 100 243 132 37 22 103 226 76 160 52 90 184 172 150 79 115
2856A15J3j4J61j93J46j19K4P6n3J39r3o2j12J00o4m3Q0K0q8L2O9m6JN0q5J14j5q7P0N9l7
$$ 115 128 114 275 82 228 109 133 209 156 295 202 140 28 128 64 21 101 121 33 65 134 88 89 139 54 168 153 66 136 195 158
2565A58O8mj2J0j00R3J29j79J33k35m6Q7l1J74Q5j57m4q8M1n5j0O8m7K07J9r1rj08Kj7J70
$$ 158 226 222 210 220 120 213 342 163 296 61 15 102 71 245 330 173 129 41 82 27 17 85 38 245 264 173 164 56 58 41 211
2274B11J07j74o3O7J4r2M6L4J66j73%K20j65n7k5M9l0k9R6j18j4k7P6j4p4J49J09k36R1r9
$$ 211 318 144 81 148 162 70 116 150 316 143 143 363 198 141 116 165 135 106 202 84 70 43 119 105 31 180 289 53 144 45
1992D5P5P46n9n92j01k2j8P3o2J14k0j33L6m6Q1M9O4q6L4l5p0J40p0j38N2K4J6L8k5j5KR3
$$ 45 120 866 807 215 114 92 74 147 85 199 179 46 82 36 117 166 230 144 178 143 73 213 143 5 57 81 97 135 110 95 97 190
1692A90N6p1o8N7l2M3n3j13R6n9J07j9o3N7p4O1J16j18n9NL8m0O6J12p7j3L7j18J44p8OP7
$$ 190 246 175 107 164 132 175 122 9 105 46 153 134 71 128 54 115 231 113 54 59 97 57 123 235 158 145 182 64 208 130 136 213
1391B13p8m1o7J56j6M5O1k1j3j47L3j7j7P4M6j33J97k6q3j31J13r1kK2%L3o3J54j24j0O0n9
$$ 213 135 94 27 183 167 212 273 252 239 92 125 108 91 165 211 78 275 249 166 35 148 57 55 77 77 110 47 201 77 67 127 68
1091F8l4P1J4m2J30l3J8j25J81jj15M6Q7k23J06n6Q8o0k0N8p8M3J73j42j0J20j64J97kj92
$$ 68 34 105 119 77 207 174 192 67 248 247 132 178 265 42 148 92 180 120 100 158 80 123 296 154 144 264 100 297 295 103
809A03J76j60l9NJ92j48Rl6L8K4r8Knk7J14j21O0R1j31J35j24N5p0O6n7L8k4n4J04ol0o6N8
$$ 103 279 119 80 85 277 129 138 102 140 164 66 68 63 36 150 29 89 180 49 184 60 115 45 111 54 92 68 14 118 112 82 16 74
499G4J2k2n5R9M0j06J65O7j14q9N0K6o2R4P2j12q5P9p8K0o7J35q2P6m2%J41N6j32J34m5j55
$$ 74 86 64 9 108 148 42 207 274 160 71 121 147 85 179 251 139 54 133 55 75 8 143 61 137 95 95 236 292 160 294 249 94
199I4J20r3J6M7j62J06Q5j75J13r2qJ28Q3o0r2jqo7J8J0J10O1r9rK3m0J03N8J8j10N6M9pj9
$$ 94 214 121 137 184 22 128 213 38 151 59 51 179 262 202 110 109 101 34 52 62 172 233 134 125 148 108 211 269 287 177 233 282 275 256
-121B56k24J34k6N5j45mL2M0L7M9Pn7J7r0R5J24j11j09L4M3J5n9K8j12J26q9P7m4O9
$$ 256 32 166 140 195 50 46 78 118 155 204 211 154 171 81 176 300 189 80 114 157 172 113 141 29 155 66 143 99 168
-393A68
##PAGE=	F1=-8427.42
##FIRST=	17614.246348710370512,	4405.4455391999963467,	0
##DATA TABLE=	(F2++(Y..Y)), PROFILE
4405E2O3km4R3K7j63J06l6L7J08K1r2mm8J1L7j6Pj40J4R0j9l0N3r9P9l9O7j8J23j12J9p0K6
$$ 52 115 113 69 162 189 26 132 96 133 241 262 170 166 118 129 166 150 157 17 31 121 102 72 125 26 105 66 133 115 238 126 145 75 101
4086A01j8O5j06J42j44J72m7j10Q6N7J4r4n3PO0n3Oj6L2P0o8M9j21O0J41j41N9nJ7j9n7k2
$$ 101 83 148 42 184 40 212 165 55 141 198 212 118 65 72 132 79 85 69 101 171 103 152 31 91 232 91 150 145 162 143 86 64
3786F4J36P1j42Jr6J97N9j08L2r1J05j05j06M1N4pK8n7R6j2L5n2P8r5m7P5m3p1J07p1P1l0
$$ 64 200 271 129 130 34 231 290 182 214 123 228 123 17 58 112 105 133 76 172 160 195 143 221 126 79 154 111 40 147 76 147 117
3485A17qJ1M5j22M1J59P4j39j9J1j13k2k7J71J6j63R6o6J57k2R2p7o0J7N6j02OP1m3j10K5
$$ 117 109 120 165 43 84 243 317 178 159 170 57 35 8 179 195 32 128 62 219 197 289 212 152 169 225 123 129 200 157 47 72
3194G2m6M9N9o6J66J5j4l4j42Q3J16L2M1q5j76L6J08j79j6R2P2J26j76q2nJ07O6j61R1n9l0
$$ 72 26 75 134 68 234 249 235 201 59 142 258 290 331 246 70 106 214 35 19 111 183 309 133 51 46 153 219 58 149 90 60
2903F0R8k9mk0K7J4n1J33j35J76j21m7J04o9J24p6j0o0M9j02J4J2j2o1O0N1m2k4P7j1M1m6
$$ 60 158 129 125 105 132 146 95 228 93 269 148 101 205 136 260 184 174 114 163 61 75 87 75 14 74 125 83 59 136 125 166 120
2603A20J2k4K5R2P8p8l1J9q7Q3J57k43J90k47j0Q8j7J63Q1j73m2j31Q5l3n0P1l3K05qj30J8
$$ 120 132 108 133 225 303 225 194 213 126 209 366 123 313 66 56 144 127 290 371 198 156 25 110 77 27 98 65 270 262 132 150
2311A50p2Nm3J59R9j74l9P1Np7K1L1K05j58pK01j77n1MJ0k3L7K0j30Jj3O2Kj06J48R0k27J03
$$ 150 78 83 40 199 298 124 85 156 161 84 105 136 341 183 176 377 200 149 153 163 140 177 197 67 68 55 117 119 13 161 251 24 127
2002A27r2O6K08M6j57j20Qj0P3mP5m7r6%o3J01L3L0o0L0Kj36J24j7q5L3l4K3P7jOo4Q8Q3o2
$$ 127 35 101 309 355 198 78 86 76 149 145 220 173 77 77 14 115 148 178 118 148 150 14 138 121 36 69 35 58 135 134 140 76 164 247 185
1673A85p6L7l2K9mj11O6m8J17k3n5Q4j54R6J45r6o6k2j4Q4L2L9m2o5O7j22J51m7L4L1j09p
$$ 185 109 146 114 143 139 28 94 46 163 140 85 169 15 111 256 160 94 72 58 142 174 213 171 106 173 51 202 155 189 220 111 104
1372A04n2J73n9M1P2k1n5j43N6J3m0P3L9q2J31l1m5j38J40j09QK6k8R2j11J70j53jJ22q3p5
$$ 104 52 225 166 207 279 258 203 60 116 129 89 162 201 119 250 219 174 36 176 67 75 101 73 165 54 224 71 70 192 109 34
1081C4R4l0m3R3j0Rj28K35M2j59N8P6k52J44m2M3o4l1R3j11J11J45j27J0K9j14J62L7k18J93
$$ 34 128 98 55 148 138 147 19 254 296 137 195 271 19 163 121 164 100 69 162 51 162 307 180 190 219 105 267 304 86 279
800B79j69l6MJ67j49L3l9P2Pj31L3K3l3J36j41L8J34j51N6p4N9l3K6n2M3p8j7J20j9k8l7K1
$$ 279 110 74 78 245 96 129 90 162 169 38 71 94 61 197 56 94 228 77 133 59 118 85 111 59 102 24 7 127 108 80 43 64
499F4M0l5l8P9N2j24J34J26j48j45J06K6l5J01J6r3n6M1n7mk5J20j21J05Pp1J26M5r0J93n3
$$ 64 104 69 31 110 162 38 172 298 150 5 111 137 102 203 219 126 70 111 54 50 25 145 24 129 136 65 191 236 146 339 286
208B86j80J61r2n4N0j51J04J02k11J02m6j9J28P7p4n8k1J6o4L6m0Q2O8j15J0J9n3J31O8J4
$$ 286 106 267 175 121 171 20 124 226 15 117 71 52 180 257 183 125 104 120 56 92 52 134 202 87 97 116 63 194 262 276
-74B76j46P9K5K3K2k32J14k4M6j37Rk4M6Q0L9K5n0jj02Q1J23l1j62k9Q9L0q3K6r2J40j14R9
$$ 276 130 209 234 257 279 47 161 137 183 46 55 31 77 157 196 221 171 170 68 149 272 241 79 50 139 169 86 112 20 160 46 145
-374A45l3R1
$$ 145 112 203
-393B03
##PAGE=	F1=-8498.19
##FIRST=	17614.246348710370512,	4405.4455391999963467,	0
##DATA TABLE=	(F2++(Y..Y)), PROFILE
4405D4J06l2o9P6N3j45Q4m1L5R2K0o3k3k0J2O4l6m3r7LJ09n3k4O7o0P3n7J11k3P9j79N1p8
$$ 44 150 118 49 125 178 33 117 76 111 203 223 160 137 117 129 193 157 114 17 20 129 76 52 119 59 132 75 186 163 242 63 114 36
4096C6J07p3O9o7R5r7J42j7j53J24QJ1j02Km3P9m7N1NL9L8j41M0qj1R1r6O5Rm5L8q2K5Q6J22
$$ 36 143 70 139 72 167 70 212 195 42 166 174 185 83 85 42 121 74 125 130 169 207 66 106 98 87 178 82 147 156 111 149 67 92 178 300
3767C00j59k0r4J75O0l7j1p3J00j16r4L8P6o6M7RO8p5M0k5J08j15k5J7q0J3J03o4Q8q3J6K0
$$ 300 141 121 27 202 262 225 214 141 241 125 31 69 145 79 126 135 203 128 168 143 251 136 111 128 48 61 164 100 188 105 121 141
3466A41O0j56J4K09O8j66l5J3j32O6n0J49kj07N9p5J12J5J26j14m1qN6p6p9J75m4j07ln7J08
$$ 141 201 45 59 268 336 170 135 148 16 82 32 181 179 72 131 56 168 183 309 195 154 146 202 126 47 222 178 71 68 11 119
3175A19j4n9J51qN1k4j43Q2J20J1M3o3j56L4M2j51lP3J64J01k27p8J2J16J5j64R3k8q4Q1R
$$ 119 105 46 197 189 240 216 73 155 275 286 329 266 110 144 186 35 32 105 269 370 143 65 77 193 208 44 137 109 25 106 115
2884A15KK7K7j7n5N8l6J91j14j11R8o3J00p0L5oK7o0k8n3l1j6N5M3m3l2Q8O2m0m4O4r1K3J85
$$ 115 117 144 171 154 99 157 121 312 198 87 185 122 222 152 187 181 208 148 120 67 36 20 75 118 75 43 131 193 153 109 173 82 105 290
2565B90P6j40m8K3p3O9J77k94K31k41J9Q4MJ39P2j62o4j29J54n5p4N8j0J51j2j57L8l4M6m9
$$ 290 366 226 178 201 128 197 374 80 311 70 89 173 177 316 388 226 162 33 187 132 58 116 106 257 245 88 126 92 138 89
2283H9Q4Q1j57l1P4Qn3jK8K24j24j6J74j76o6K7k3M3M9o1j25MJ0N4Pp4Q3O4j24M7k2j9J48
$$ 89 173 254 97 66 140 148 95 94 122 346 222 206 380 204 138 165 142 185 234 173 48 52 62 116 123 49 132 196 72 119 97 78 226
1973B26lo4r3MJ1O7N1L0r4mp0j2P4QMk3K3M5r0j2J5j8Qm0RP7J2M1j02M5J11m1q2L4j9l5N1
$$ 226 223 159 66 70 81 148 199 229 135 131 61 49 123 131 135 112 135 180 90 78 93 75 83 43 52 129 141 182 80 125 236 195 113 147 128 93 144
1626A44r9Qj9J32j7l4P7j67O5J69o2o0l5q7J26L4Rk2o3O0j40J74k5N1Jj43L8j8J42q6K1R0
$$ 144 45 53 34 166 149 115 192 25 90 259 197 137 102 15 141 175 184 162 99 159 19 193 168 219 220 77 115 97 239 153 174 264
1326B64j7r1j31Q5L4m2M7L1j1M8l7Lj40J68j31JM5o9J22j19J69j04n4J79j04j03R4o9j6K6
$$ 264 247 156 25 110 144 102 149 180 169 217 180 183 43 211 80 81 126 57 179 60 229 125 71 250 146 43 137 68 52 78
1044G8plj5J97P0j76O5L8k28J49l1lm3l8R1r5J46Q2o9K0o8o6J38O3k38K07j53Km8J38j09M0
$$ 78 71 68 53 250 320 144 209 247 19 168 137 134 91 53 144 49 195 277 208 228 160 94 232 295 57 264 111 113 65 203 94 134
743A34n4J00j5j57Q3J0j0J32j48N3J20j38j5l3O5lro6N4n0k6J08n1kj6nO2m6l4N9N1r6P6J52
$$ 134 80 180 165 8 91 101 91 223 75 128 248 110 95 62 127 124 115 49 103 53 27 135 84 82 66 61 123 77 43 102 153 57 133 285
424B85j62q0N2K4kJ04n4o7l3Rl3K4j6R9j17Q4L7j13J14L5o4K28p3j75J99q5j00L9j24Q4J11
$$ 285 123 43 95 119 117 221 167 100 67 76 43 67 51 150 33 117 154 41 155 190 126 354 281 106 305 220 120 159 35 119 230
133B30k05N3rPJ06N1p3Nn2M2o0Q7n3l6P0r6QJ8m5J23O5J7j82R6mN5O2k27R0j6L0j09J4m3L5
$$ 230 25 78 69 76 182 233 160 165 113 155 95 182 129 93 163 67 75 93 48 171 236 253 71 167 163 218 280 53 143 127 157 48 62 19 54
-196E4J03L1J4pk0j29O1J06N3j81k1L1M3p4M7n4J02j30J17k2J06
$$ 54 157 188 202 195 175 46 107 213 266 85 64 95 138 64 111 57 159 29 146 124 230
-393B30
##PAGE=	F1=-8568.95
##FIRST=	17614.246348710370512,	4405.4455391999963467,	0
##DATA TABLE=	(F2++(Y..Y)), PROFILE
4405C1J44n7j03P1O7j07K2l1M5P4J8l1n1K5K0Q5m1j19l0M9O8j00M9Rk2P2o1J36m6M9k25P3
$$ 31 175 118 15 86 153 46 68 37 82 156 174 143 92 117 137 222 181 62 32 81 149 49 98 107 85 157 96 232 186 235 10 83
4105H3J2O1r5O7l4L3m6J09J5j72J46l1L0j18O3r3P5m3Q7K7M8Jj77QJ12q9L4k8O5L4r2O4r9
$$ 83 95 156 61 128 94 127 81 190 205 33 179 148 178 60 123 30 105 62 149 176 224 225 48 56 168 79 113 85 150 184 92 156 57
3795E7M2M5J55j49l7p6J37M2L7m7m8J24j27r9K6Q4p3M1M2M6j23K8LJ37j20qn9jM1O8o0Q9j23
$$ 57 99 144 299 150 113 37 174 216 253 206 158 282 155 56 82 166 93 134 176 222 99 127 130 267 147 139 80 79 120 188 128 217 94
3485I4L5K4P7j76j7K30P2j92m1J8n8R3q3J24j4o2J3q2P3J8J44j40rk6O1n9q6K33q2r6k8l8
$$ 94 129 153 230 54 37 267 339 147 106 124 66 159 76 200 186 124 137 55 128 146 290 150 141 115 176 117 31 264 182 86 58 20
3185B0J33p3n0J29m1J11k0j10O8J08l2N5k5j26M9m4j08J7P1K01Q5k68p1K3J17k5j54Q6j8r7
$$ 20 153 80 30 159 118 229 209 99 167 275 243 298 273 147 196 152 44 61 132 333 418 150 79 102 219 194 40 126 108 11
2903A1L1Q2j3P0L4o6l6l5Q0J84r8j46N8n1Q8p8N7L7L4qr1j01l1J9L8L9m1k5P4J32j09l2P9
$$ 11 42 124 111 181 215 149 113 78 158 342 244 98 156 105 193 115 172 209 243 235 144 43 12 31 69 108 67 42 116 248 139 107 186
2593A86j21O4K04P6j73p7K4n3M8J78k81K17k19M0P5K4J01O5j32r5q7J94q7p6K5K5O4kj34K2
$$ 186 65 129 333 409 236 159 183 130 178 356 75 292 73 113 188 212 313 378 246 151 64 258 171 95 120 145 209 207 73 95
2311I5RQ7m1NN3j29n0P5K0k7j3K9K13p2k2J32j60r5L4m4J27M2j31j02rL7N4Qm9J9L9k1J6l
$$ 95 104 191 150 155 208 79 29 104 124 97 84 113 326 254 232 364 204 109 143 99 226 268 137 35 26 63 117 125 76 95 134 113 129 126
1992A26n6L76n5k88j6m5M6N7Q9nj53J04j40N2N0j4j1OOQ5o6j10L6L7l6K1j9L0L5P0j21j7J39
$$ 126 70 446 391 103 87 42 88 145 234 229 76 180 40 92 142 128 117 123 129 214 148 38 74 111 75 96 77 107 142 212 91 74 213
1682B13j6q3M8Nj35R4q1l1lJ58kj2L6j29jJ80k3n7k1j13L2O6L1j9k3L1j01J36k0N5qj67R0
$$ 213 197 114 162 167 32 126 45 14 11 169 167 155 191 62 61 241 218 161 140 27 59 125 156 137 114 145 44 180 160 215 207 40 130
1372A30j6J11q1k3J13qr3q4O1K8k3QK5N9k7m0N6j30J78j50k5O8r7J13r3J48j1j24K12j16j05
$$ 130 114 225 144 121 234 226 133 49 110 138 115 123 148 207 180 140 196 66 244 94 69 137 40 153 60 208 197 73 285 169 64
1081F4P1r9O6p4JJQ3J22Q0j83P7j2j68J30k4l7ql4N9l8J34OJ2K2j49l1J29P2k42K12j16L6
$$ 64 135 36 102 28 29 30 113 235 315 132 209 197 29 159 135 98 90 56 115 77 211 217 229 251 102 71 200 272 30 242 126 162
781A62p8P6o2K8n6J20l3j13P9m2L1J17j42O9Q0j21k3k8P5Rmj02N4%l4Q0q6K6JJN8o1l1L5M0
$$ 162 84 160 98 126 70 190 157 44 123 81 112 229 87 156 236 115 92 64 139 148 144 42 96 96 62 142 56 82 83 84 142 81 50 85 125
452A25l2K1J22j47k9K1K0L0R8j17m7k0Ok2R9m6P5r6L4M4q1R2J3o5K35r4j45K21p7j00J4j02
$$ 125 93 114 236 89 60 81 101 131 229 112 65 45 51 29 128 82 157 61 95 139 58 150 163 98 333 239 94 315 238 138 152 50
152E0O4J13j73mOL8Q3J5n4O8p9O1m4J08m6j33N5m2k9K2kQ2M3K5k09J19l9O5R2k06O4JK1r3
$$ 50 114 227 54 50 56 94 177 192 138 206 127 188 144 252 206 73 128 86 57 79 77 159 202 227 18 137 98 163 255 49 113 114 135 42
-167D2J8k3K5R2K4j3O0m8j53L5P7J27j76M2q1N0k3N8n0O8j30J22j5J17
$$ 42 60 37 62 154 178 165 225 177 24 59 136 263 87 129 48 98 75 133 83 151 21 143 128 245
-393B45
##PAGE=	F1=-8639.72
##FIRST=	17614.246348710370512,	4405.4455391999963467,	0
##DATA TABLE=	(F2++(Y..Y)), PROFILE
4405A6J70o3p4J8N3o0m7O4QM2lkq7Q5K7R8k6j82QR2L9j53J24k8j9P8n8J46q5M5j43j1Q9k6
$$ 16 186 123 49 67 120 60 13 77 85 127 124 122 35 120 147 245 219 37 45 137 176 23 147 119 100 178 120 266 181 226 83 72 161 135
4086A35q7P3j0l4nR3L4j56J35n4N7j16J09q9Om8J09N0L3k8j55m8K17j24m6M3O1O2r5L9r3K2
$$ 135 48 121 111 77 72 165 199 43 178 124 181 65 174 85 91 43 152 202 235 207 52 4 221 97 51 94 155 217 122 161 68 90
3786I0J8J66j19l1o6Q7K1R2o6k1J63j28j17kQ4o0K4N0L3j19j2K8J53j10Qj54J36J6M1o2Q7
$$ 90 108 274 155 124 58 145 166 258 192 171 334 206 89 87 171 111 135 185 218 99 87 115 268 158 166 12 148 164 205 143 230
3495B30j46M0L0R0j82nJ85P9k13l0J8L8J04j17J07k9m3j3p9M1pJ41j52L0l5P0o2KK03j25q2
$$ 230 84 124 154 244 62 57 242 321 108 78 96 134 238 121 228 199 156 143 64 105 98 239 87 117 82 152 90 92 295 170 88
3204H8m0MJ22q2o9J08n8J38k8n6N2Q2q6Q0K5j04O8j25n8J0P1K12R0k97n7K4J14n0j31P1k5
$$ 88 48 52 174 92 23 131 73 211 183 127 179 261 175 255 280 176 244 119 61 71 142 354 444 147 90 114 228 178 47 118 93
2912I3m5k7J10l6J14N2j28oj09J70J60p7j63J5l4Q9r1M4O2O6L9j56j01l0L9J0L2k2j7L8J87
$$ 93 48 21 131 95 209 261 133 127 18 188 348 271 108 123 89 178 87 131 193 259 298 142 41 11 50 60 92 70 53 91 278
2621B78j43k4O6j20J01J84Q1j67j18K5l3K7J52j94J46j86N8N6M5N4N4r5j19m2K13j18m5l2
$$ 278 135 111 177 57 158 342 423 256 138 163 130 157 309 115 261 75 133 189 234 288 342 247 128 86 299 181 136 104
2358A04O7k7Nn7l1N9J11k1m9K2j11n5M1L7jj3M2J61j3k0P5j36j18J5m3J96L3j74o1l0O4M1
$$ 104 171 144 149 92 61 120 231 210 161 183 72 17 58 95 94 81 123 284 271 251 326 190 72 87 44 240 273 99 38 8 72 113
2058A13K3n0j4J3M4K1k8m0L13j6l36P1j05Q7M9J03k2j96J77j89J06M5k7k0J7k2J24o5j66Q0
$$ 113 136 86 72 85 129 150 122 82 395 379 43 114 9 96 145 248 226 30 207 18 124 169 142 122 139 117 241 176 10 90
1776I0N2q9Q9l7l3P6P5j31p5J67Jp5O6K4j68N5m6N4m3J26PPk5p6n0J65J3n6J5j11J1k9Q5l1
$$ 90 142 53 142 105 72 148 223 92 17 184 185 110 176 200 32 87 41 95 52 178 185 192 167 91 41 206 219 163 178 67 78 49 134 103
1457A03K5Pl6O0l2M6Pj44J19n6Q5k5r8J34J0m3o0J6j0Nk6K2J16q2l9J10j11J64j59p0Q8p3
$$ 103 128 135 99 159 127 173 180 36 155 99 184 159 61 195 205 162 102 118 108 113 87 109 225 143 104 214 103 267 108 38 126 53
1156E3M7m6J10R9j80K05j18q6M3j05J35j13O8J8K9N2P4j84Q8n1r6R7k5l3J4l3K5K1R7m8P9
$$ 53 100 54 164 263 83 288 170 84 127 22 157 44 112 130 159 211 285 101 189 138 42 139 114 81 95 62 87 108 205 157 236
865B36J8j68k5J11P3j92J66p3M9o1j1j8j2k6J24l8p9Q3j09P6R3j25P2L2j04J6m9Q9QL5j28
$$ 236 254 86 61 172 245 53 219 146 195 134 123 105 93 67 191 153 74 157 48 124 217 92 164 196 92 108 59 148 156 191 63
574F3K4L6k1M6q1J4J5K5L3p9j6J0J9L4J0K9q6j2K1LM8R0j48m8j9N1k4J54q3N8r4nK2RQ5k9
$$ 63 87 123 102 148 67 81 96 121 154 75 59 69 88 122 132 161 75 63 84 87 135 225 77 29 10 61 37 191 108 166 72 67 89 98 183 154
236A54q9K15j02j04K19p1n8j4p0L4J03j36k0k2O7N3k0j9J09r8Q7k4J00k5j73ORo8J9L8N6J4
$$ 154 65 280 178 74 293 222 164 150 80 114 217 81 61 39 106 159 139 120 229 131 218 194 294 269 96 102 111 43 62 100 156 170
-64A70L6j80J14m5QJ01j68M4K9K5r8MJ4L5N5J8l6J18q3j15j6M8J63j59J03j27J4L7M4n8L9
$$ 170 206 26 140 95 103 204 36 80 109 134 36 40 54 89 144 162 126 244 161 46 30 78 241 82 185 58 72 109 153 95 134
-355A34j14J19j7J26
$$ 134 20 139 122 248
-393B48
##PAGE=	F1=-8710.48
##FIRST=	17614.246348710370512,	4405.4455391999963467,	0
##DATA TABLE=	(F2++(Y..Y)), PROFILE
4405IJ76n0l3k0J3k1K1O5m0Ql7J3p7R5L1R9Kj79j6J13L1j97J70k3m2P8n7J54j34O4o9l4J01
$$ 9 185 135 102 82 95 74 95 160 120 128 91 104 27 122 153 252 254 75 59 172 203 6 176 153 111 189 132 286 152 216 147 113 214
4096B14j29m9Q4J2m9k0R4L0j21R6n9P6r8J44q0o0m6R8P0rm5q9j1J98j04j28Q1N2Q7p6lo6k
$$ 214 85 36 120 132 83 63 157 187 66 162 103 179 81 225 145 85 39 137 207 198 153 64 53 251 147 19 100 152 239 163 160 94 92
3786I2j2J56q2Mo5K4L0R1o4%K01j13j33n0Q0n1RM1L0o7m8L4J47q5L1j31J40k3J3o3R4j51L1
$$ 92 80 236 154 158 93 117 147 238 174 174 375 262 129 79 159 108 117 158 188 121 73 107 254 169 200 69 209 186 199 136 230 79 110
3476A10L5R5j74K5J08Q4k22lQJ25J09j40R3n0l5k2o9K0qP9j49P4m2Q2p7P4J64j47o7l5L8J02
$$ 110 145 240 66 91 199 283 61 58 66 191 300 160 253 203 168 146 77 97 89 168 19 93 51 133 56 130 294 147 80 45 83 185
3175A85m7o9N8k4R0m5J0L4M8j29J17O5r8Q2j80j4k3N3K09J18l03m0J1J12n5j11N8l1JrN5n2
$$ 185 138 69 127 103 193 148 158 192 240 111 228 293 195 277 97 83 60 113 322 440 137 97 108 220 165 54 112 81 82 73 128 76
2875G6J44Q3j95K9p7J34J27n2j69rmR2q8PM4J12O8k08m3n4N6j5J2K1k2qK14j36j8L8j02J17
$$ 76 220 303 108 137 60 194 321 269 100 91 87 179 91 98 142 254 322 114 71 17 73 58 70 91 69 61 275 139 121 159 57 174
2574A74J42Q9j26j61K7j6J8R1q3O3j42P3K9P4J3K4o2j25rK07j45K5j09J04q2j2K8q3J18J06
$$ 174 316 405 279 118 145 129 147 238 155 218 76 149 178 252 265 289 227 102 93 300 155 180 71 175 93 81 109 26 144 250
2293B50Op3Nj21om6N9J8rO3Q0L9lOj06j19k2N0J48L1j79j8k5P1mO5q1jnM4N2p6QJ05N8k51
$$ 250 256 183 188 67 61 15 74 92 83 146 226 265 262 268 162 43 21 71 219 250 71 53 28 99 95 160 79 78 73 117 169 93 101 206 264 13
1955A3J26p4M1M8R0k5j48J29j77J13O6l3l7J4m7J55q4j52J10L7j28J33m1r6J26N2j33k1J06
$$ 13 139 65 106 154 244 219 71 200 23 136 202 169 132 146 99 254 170 18 128 165 37 170 129 33 159 211 78 57 163
1682A63qm6P8K4j16k6qJ11o1Q2JK0q6k0o4J16M1n3O1j04P1j44Q3m6O3oJ4j3m3K1L2o5J14j13
$$ 163 155 109 187 211 95 69 61 172 111 193 194 214 128 108 44 160 201 148 209 105 176 32 115 69 132 126 140 127 84 105 137 72 186 73
1363G3N2O6j62J25M0J6n2k3o5J9l7J9J50j13l7J64r0J29j52j17Q6j5l7J3O5J97k10J56j10
$$ 73 125 191 29 154 194 210 158 135 70 89 52 71 221 108 71 235 145 274 122 5 91 76 39 52 117 314 104 260 150
1091A50n3J6q6J65j32J21L1l0jN3j73Q6o3k9P3l2PPm0lO5N0m3Q8J1j20l7O7P4j26J06l4L1
$$ 150 97 113 27 192 60 181 212 182 181 234 61 147 84 55 128 96 103 110 70 67 132 182 139 227 238 118 81 148 222 96 202 168 199
781A99j8q8L6q6M2R3k6o4R5j41Q4O8j00N5j1q9P1p4J02NQ3j37j8N1PJ0m7j9K7N0mj03J7Lj8
$$ 199 181 93 129 43 85 178 152 88 183 42 126 194 94 149 138 49 120 46 148 153 236 99 81 132 139 149 102 83 110 160 156 53 70 73 55
452E5P1L4p6J1j7K8k6M5Q0j23p1J5M8rJ68j11N3j12J4o0J20R3p7r6J52p9p4J89p1J0l2k2m
$$ 55 126 160 84 95 78 106 80 125 205 82 11 26 74 65 233 122 175 63 77 17 137 230 153 57 209 130 56 245 174 184 152 130 126
142A26P5r6j0p1R2J2m6K2J23j10J29j1P4Mj73o0L9p8oO3N0mN0j54J13k5o0P0j21L7P4K9r5
$$ 126 201 105 95 24 116 128 82 104 227 117 246 235 309 313 140 80 119 41 35 98 148 144 194 40 153 128 68 138 17 54 128 157 62
-167F2m9O2L9QJ4l5J36j17l1k8M3J16j48J55j30l8P9K0o1J5q6J11l2J33
$$ 62 13 75 114 122 136 101 237 120 89 61 104 220 72 227 97 59 138 158 97 112 26 137 105 238
-393B38
##PAGE=	F1=-8781.25
##FIRST=	17614.246348710370512,	4405.4455391999963467,	0
##DATA TABLE=	(F2++(Y..Y)), PROFILE
4405IJ68l2Km0j1lQ3O2r1j6m8RpL4K8Q9L3j50l4Q9M3j87J51Mn9O4n8J61j78Q6mj2O1k06J0
$$ 9 177 145 147 107 96 93 176 238 147 131 83 92 85 119 147 236 269 119 85 174 217 30 181 185 126 190 132 293 115 201 197 185 246 40 50
4077E0P3L7oo5Q2Oq1M3n5P9p2J67o9r8k7M7Q4o8m8pJ7J66n0j40K8M1J06m7l8l0kn7J32n0N4
$$ 50 123 160 154 89 171 177 96 139 84 163 91 258 189 91 64 111 195 127 79 72 89 255 205 65 93 134 240 193 155 125 123 66 198 148 202
3748B02n9m5Q4J4m4PK23p6j37j10P7n2kK6K7Mn2J7J18m0O0r0J00o9k1n4J19j45J6L2Q9j52
$$ 202 143 98 182 196 152 159 382 306 169 59 136 84 82 108 135 139 87 104 222 182 242 152 252 183 162 108 227 82 98 130 219 67
3448F7M6L7Q8k11K3rJ82J05j45P8o8l3j9n0MN1n0o0M4m3Q7q3J06J17j41n9j5N7Q6nn7J6RK2
$$ 67 113 150 238 27 50 41 223 328 183 261 193 160 141 91 95 146 96 36 80 37 124 41 147 264 123 64 49 106 192 187 130 146 155 177
3128A77o0P5J3J3j13J29O9r8R4k08J4m5KJ80J60k77k7j3J14m5r9N2rJ5nJ2n1J40J16k45O1
$$ 177 117 192 205 218 105 234 303 205 299 91 105 60 62 242 402 125 98 85 199 154 55 107 98 113 108 120 69 209 325 80 141
2837A41m7P5R1k5j62j1M4Q6o5Km6J46P4k34L3o4N4k5j7P0l4m6K01j04nJ2q0J21Q8Q3o8j83
$$ 141 94 169 260 235 73 62 106 192 127 129 83 229 303 69 102 38 92 67 50 120 86 40 241 137 132 144 64 185 273 356 288 105
2537A05K6%L1qK4j0r7R0kJ21j1m1m1j03kJ85j66J19j81J21p7n6Q2q9J43Q1L5q4Rj42K9o1L7
$$ 105 131 131 162 154 178 168 71 161 159 280 269 228 187 84 82 267 101 220 39 160 83 27 109 20 163 244 279 195 204 62 91 30 67
2227F7K8j9Q4LP2K6o0q1r0N5P2J2L9j52J8l6R4p0J22j20K1MrR9j28O6N2K7j49J22l0j6M3O3
$$ 67 95 76 160 163 235 261 201 120 30 85 157 169 208 56 74 38 132 62 184 64 85 89 80 179 51 117 169 196 47 169 139 123 166 229
1908B29k3r2M1j03P7J09l9o3Mn9J71j13q8J08K1j39J36l5j23J46J3j32P4M1n3NQ7jn1k6k5
$$ 229 206 114 155 52 129 238 199 136 140 81 252 139 51 159 180 41 177 142 19 165 178 46 120 161 108 113 200 199 148 122 97
1617I7J30o2M6k8L2j24K5o7O4N4m2J05q8P0j45K4m7P8pL4o1om7N1K8J03j24l6J57j58O3P1
$$ 97 227 165 211 183 215 91 116 49 113 167 125 230 142 212 67 91 44 122 115 149 88 82 35 86 114 217 93 57 214 56 119 190
1316A90N4l3m9q6k5jkJ49j21l4K13p2Q1j24q9oL8p4N4M6K36k14Q0r7oj7o0J67j33J50M6p7
$$ 190 244 211 162 76 51 50 48 197 76 42 255 183 264 140 51 45 83 9 63 109 345 131 211 114 108 91 31 198 65 215 261 184
1016A84m0K5j40O1m3J9Q1k2J7j1m1l6R2JJ2M3Kn4n0K1R0q0O2Jk2K9j30R9j15O6L1ko0J07j32
$$ 184 144 169 29 90 47 66 147 125 142 131 90 54 146 147 159 202 204 150 100 121 211 131 193 194 172 201 71 170 55 121 152 150 90 197 65
687F5N4N0p7K3m2l9R3q5R1J6J14j29n2M4L8k3j6l2L5O2m6j10M7Qn1O9O6j05N4rK4n9K7O6p0
$$ 65 119 169 92 115 73 34 127 42 133 149 263 134 82 126 164 141 125 93 128 190 144 34 81 89 38 107 173 68 122 113 137 78 105 171 101
358A01q5M0J8K3J44j21O1j44J01n8Q6J06j22o7Q0k9p8J29p8Q6l8L2l8L3n3lj19J18k8o2N1
$$ 101 16 56 74 97 241 120 181 37 138 80 166 272 150 83 163 134 56 185 107 193 155 187 149 182 129 126 7 125 97 35 86
67H6J10j08J82j1M3L9j63j22M8m2n8O5N9lO7j47J00ln2j3o8M6J15K1q8n9N8K8m2J2j2J05j36
$$ 86 196 88 270 259 302 341 178 56 104 62 4 69 128 125 192 45 145 142 90 77 9 55 170 191 103 44 102 130 88 100 88 193 57
-243E7P4l1O5N0j55J96j31q7J09%n5J0o0R7n9J33
$$ 57 131 100 165 215 60 256 125 38 147 147 92 102 42 139 80 213
-393B13
##PAGE=	F1=-8852.01
##FIRST=	17614.246348710370512,	4405.4455391999963467,	0
##DATA TABLE=	(F2++(Y..Y)), PROFILE
4405GJ58k4L4m9j5RJ22N2j40m0j8pM2k6J8P3O2j03l0J8P0j66J23K4m5L7o0J63k01Q8N2L3p
$$ 7 165 141 175 126 111 120 242 294 154 114 96 89 131 105 123 196 258 155 125 143 213 47 170 194 149 186 126 289 88 176 228 261 254
4096B54j72kM6O2L7r4N3j0m8ln3O4m2J71o0j05ooQ6j17%J6K7J34J8j33m7L3J21j6o4PPj01
$$ 254 82 80 126 188 225 131 184 174 126 123 70 134 92 263 203 98 92 86 172 55 55 71 98 232 250 117 70 103 224 208 144 151 158 57
3776E7J17l0R3l7j05J42r0j5j1K23k1j20j69P8o2j0K6J0O5m0kP5K4Q9o7N0j08n9j7J43j29
$$ 57 174 144 237 200 95 237 147 132 121 344 323 203 34 112 50 40 66 76 141 101 99 174 198 287 220 270 162 103 86 229 100
3485A00J0RP1j18M3MR4j54pk6J98R1j30N6p0l5j0k2nJ13j66K1J1k4O9p5R8Q3j20o1QN7Q5K0
$$ 100 110 119 190 72 115 119 213 59 52 26 224 315 185 241 171 136 126 104 99 212 46 67 78 54 123 48 146 229 109 48 56 113 198 218
3166B18k8k4K9l5m9J19j6j1o0J12L8r2J15k16K6k4lM2J88k18j4m3J16k6r5N4L3Nj5j4l1R2
$$ 218 190 166 195 160 111 230 214 203 143 255 293 201 316 100 126 102 99 141 329 111 97 54 170 144 49 103 136 141 126 112 81 173
2865A73J45k68R1l7RO5%j28j2Q4R0m0J9j19J20N4k12Q5m8K6j9m4J10m2n4J37o5J4Jo4J24M2
$$ 173 318 50 141 104 113 178 178 50 38 122 212 172 191 72 192 246 34 119 71 97 78 34 144 102 48 185 120 134 135 71 195 237
2565B37M9j5j73K6J8N4j25J11n8o5J06l0J82j8j30k6n9k2J48j76K15k14J01m6n1N6m6J16N0
$$ 237 286 271 98 124 142 196 71 182 124 59 165 135 317 299 169 143 84 62 210 34 249 35 136 90 39 95 49 165 215
2293B15N7q6K8j44L0m6J8L4n1J01m6Q1N5r7p5n7J41Q2j26M9j00L8p0J28j36J73j35J2M6r3
$$ 215 272 186 214 70 100 54 72 106 55 156 110 191 246 149 74 17 158 240 114 163 63 101 31 159 23 196 61 73 119 26
2011B6J52j65J15J08o5j03J45Po6J6M0k7m7o1RK7J58n1r3j0m7J70j31k4Q9J6j42J19j7r2J05
$$ 26 178 13 128 236 171 68 213 220 154 170 210 183 136 75 84 111 269 218 125 115 68 238 107 83 172 188 46 165 148 56 161
1720A61l0j17J59Kj23O6R9m0LNn7J21m6K5p5M4j20M5q2L5N0k3J40o9Kj06rj7N2MK2o9Q1p9
$$ 161 131 14 173 175 52 118 217 177 180 185 128 249 203 228 153 197 77 122 40 75 125 102 242 173 175 69 60 43 95 99 121 52 133 54
1401E4j6J14Q8q9j27J85j33J9Q8O4J0o0p6q9L9k7J15j08j0K29n8L2q2p0l7J3l6N9M3K22j96
$$ 54 38 152 240 151 24 209 76 95 183 247 257 197 121 32 71 44 159 51 41 270 212 244 162 92 55 68 32 91 134 356 160
1110A60mq2N9p3oJ27j01J29O1j00o9Lp6J4k2N2J17J0k5k4l4o3R6m0O8j0p%o0j7J19n2M0L0
$$ 160 156 74 133 60 54 181 80 209 270 170 101 104 28 42 20 72 189 199 174 150 116 53 149 109 177 167 160 160 100 83 202 150 190 220
790B20r9O4j30J53q4L3m0K1n0J05j21L5M4o0j3o2O4N3o4L6M9J15j09p2J7O1m3Kk4M4O4q8n9
$$ 220 121 185 55 208 124 157 117 138 88 193 72 107 151 91 78 16 80 133 69 105 154 269 160 88 105 166 123 125 101 145 209 121 62
480F2K5Qn3O0O0m6K0J8J4r3J7L7nj18P5QL5Q9j11Q0j65J88m2K2J16j60k9Q4k8j00N9q8J51
$$ 62 87 95 42 102 162 116 136 154 168 75 92 129 124 6 81 89 124 213 102 182 17 205 163 185 301 141 112 196 168 68 127 39 190
171A90l8Q4n9j4pqj27J08l6p1M4P7q0K25k7K4P0j57j62L3K1m0qN7J6Q3j18K7J7%n3l6L4J56
$$ 190 152 236 177 163 156 148 21 129 93 22 66 143 63 288 261 285 355 198 36 69 90 50 42 99 115 198 80 107 124 124 71 35 69 225
-149B25jq9n3N1Nq6J4J0M0p3J18l0Q2J5j80K25j32j13J06lm5L0n0Q0r4J23
$$ 225 224 135 82 133 138 52 66 76 116 43 161 131 213 228 48 273 141 28 134 131 86 116 66 146 52 175
-393A75
##PAGE=	F1=-8922.78
##FIRST=	17614.246348710370512,	4405.4455391999963467,	0
##DATA TABLE=	(F2++(Y..Y)), PROFILE
4405B0J35l6O8n1j9M2J26L6j71o7L8k7O4q1LO0Q2l9j2q6J03j36J05J6lJ5o2J53j86O2Q7Q3
$$ 20 155 119 187 136 117 159 285 321 150 83 121 94 158 77 80 140 222 183 171 85 188 52 157 173 170 185 123 276 90 152 239 322
4105C22q7r5l7K0Q1O4j09K2kk8k1o6L2rJ48n4q2Ql7P6p1L2m5J4J08Q8j10j27L8J25J0p7L9
$$ 322 235 140 103 123 204 268 159 181 179 151 130 64 96 87 235 181 99 107 70 146 75 107 62 76 184 272 162 35 73 198 208 131 170
3795A70Mj30J27k2J05%j64J88j64Jn3J99M6q6k10Q2o2mN1j5O1k3j2K7J00J08o3lj23o6M5J21
$$ 170 174 44 171 149 254 254 90 278 114 115 62 261 307 221 11 93 31 27 78 63 124 101 89 116 216 324 261 258 135 69 114 235
3495B35j04J7l0M5p3J2K3J07j29m8k9J71P1j02K8n2m0PNpJ54k11J6J0J0M3q7Q8Q8j07p4L7
$$ 235 131 148 118 163 90 102 125 232 103 55 26 197 268 166 194 142 102 109 114 107 261 50 66 76 86 129 42 130 218 111 37 74
3194G4L0R9J9J2o6M9p4j2J31m5k2l0J00j3p1J45k08K3J4K9p8J23j35J0o7J02oq2M7P3ql7k7
$$ 74 104 203 222 234 168 217 143 131 262 217 195 165 265 252 181 326 118 141 155 184 106 229 94 104 37 139 133 51 98 171 163 126 99
2884I9JJ7J61k57J16m3n9Q1jm6m9J02J10k1L4j40N0J5j09N9j1k8jn6J30m0m6N5l5L2Nn4J26
$$ 99 100 117 278 21 137 94 35 116 115 69 20 122 232 211 245 105 155 170 61 120 109 81 80 24 154 114 68 123 88 120 125 71 197
2574A97L0rKj35L7L9O9k19J60n8o4J09n0K42k6k06Mj6n2R3j10K18k20Q4l1l9K6%O4K7P2q3
$$ 197 227 218 220 85 122 161 230 11 171 113 49 158 108 350 324 118 122 106 54 147 37 255 35 119 88 49 75 75 139 166 238 155
2274A55N8j20nj7NM7q3R3n3O8O4p7r8k5J92R9j99K6k9L2j17J55j35J52j12k2J12j20J20j31
$$ 155 213 93 88 71 76 123 40 133 80 148 212 135 37 12 204 303 104 130 101 133 16 171 36 188 76 54 166 46 166 35
1992C5J00N2m9m7J78K5j02l1K9m1j4j08Q9j8J88o8j18k6j7J57j01mN8K3j45R5J8n1M7p5j5
$$ 35 135 187 138 91 269 294 192 161 190 149 135 27 116 98 286 218 100 74 57 214 113 109 167 190 45 140 158 107 154 79 64
1701F4J44j9j48P2J16p6K7M0p7R3j7K2j19N5q3L4j10L6L0kJ66n6r9m0k7L5j5L4j9j0J32r5
$$ 64 208 189 41 113 229 153 180 220 143 236 219 241 122 177 94 128 18 54 84 82 248 192 93 53 26 61 46 80 61 51 183 88
1401H8p1J66O5m9j18R0r3LQ3N3P7n7p3j01K2l4O4q0L5K06m6j0l2p0j7o3j3J04K3J95j61p6
$$ 88 17 183 248 199 81 171 78 81 164 217 294 237 164 63 85 51 115 35 70 276 230 220 188 118 101 38 25 129 152 347 186 110
1100A10o5J29j50P1P2n9O3P4r6r1Nk8L3k9L5J56N4r4l0k3o9P4n9R3m6j3K7n2o3J57l7L7N1
$$ 110 45 174 24 95 167 108 171 245 149 58 63 35 68 39 74 230 284 190 160 137 68 142 83 176 130 117 144 92 29 186 149 186 237
790B37j68O7r0J86m6pr1J9j9Q3j15M4M1n1k4l0Q6J9k8m5J01R3q8q0k1O8m1Pj1N5O2j19J0j9
$$ 237 69 136 46 232 186 179 88 107 88 171 56 100 141 90 66 36 122 141 113 68 169 262 174 94 73 141 100 107 96 151 213 94 104 85
471H5lj7R3k9K7k1N1Oj23L7lN5j25P8L0%J7p9R3j31K14l1l1J19j83OJ35p6j14No1J52m1J34
$$ 85 82 65 158 129 156 135 186 192 69 106 103 158 33 111 141 141 158 79 172 41 255 224 193 312 129 135 270 194 80 85 24 176 135 269
152B69p1n2M2l0r9O7j1q4K4K1JK19n7K7R0j66j59JP9j3lj9L7R2o2r9L9O2l4m7J4K00k4j07
$$ 269 198 146 188 158 59 126 115 31 55 76 77 296 239 266 356 190 31 32 111 98 95 76 113 205 143 44 83 145 111 64 78 278 254 147
-167A47m2N9k4r1J9Jn0R1O2j4Q0Nj99K33j32p0K7K3m4N9m6O1j17R1
$$ 147 105 164 140 49 68 69 19 110 172 158 238 243 44 277 145 75 102 125 81 140 94 155 38 129
-393A29
##PAGE=	F1=-8993.54
##FIRST=	17614.246348710370512,	4405.4455391999963467,	0
##DATA TABLE=	(F2++(Y..Y)), PROFILE
4405D1J03o1J04m9l1R9R9J7j60p6O8m9O2j24j7O1Q5L0J1j91J24r8J02k6O1Jo5J33j43M1Q0
$$ 41 144 83 187 138 107 206 305 322 162 86 154 105 167 43 26 87 172 202 213 22 146 48 150 124 185 186 121 254 111 152 232
4114B32J20j63qp2MQ5P3j12KK7k6oq5j5K4J05n6m0J1m1O7LJ7r4j0P6J49p3j66N0J02J7q0O3
$$ 232 352 189 181 109 113 198 271 159 161 188 162 156 71 56 80 185 129 89 100 59 126 129 146 52 42 118 267 194 28 78 180 197 117 180
3795A80j9j38J62j9Q1M6k29K29j77j1r4J36J12m0j98N4l8J7N0lnrj1j4J66J15p7m7j00rN5
$$ 180 161 23 185 166 247 293 64 293 116 105 11 147 259 219 21 75 37 54 104 101 96 87 76 62 228 343 266 219 119 110 165
3504A65P0o2J5o1J5k7k6O0J28j36q4j6J17M0o4kj9m9M2J6nJ65k13l0K8N3J8j28R6J29j14q3
$$ 165 235 173 188 127 142 115 89 149 277 141 57 41 158 198 134 132 113 64 106 122 117 282 69 39 67 120 138 10 106 235 121 38
3204C8P0k4J16kN9j12P6r3K9J22o7j9l8R6p0l1J73j87J3M6N0p0n9m4N0o9O2Mn2K4J02j3o9
$$ 38 108 84 200 198 257 145 221 128 157 279 212 193 155 251 181 150 323 136 149 195 245 175 116 72 122 53 115 119 67 91 193 180 111
2894A11l5L9o1J61j99J13n6k2Q7o7L6p0O8J43j4M2j49J1l1j0PM0r4K7k0R0l0l5Jl0L6J6m1
$$ 111 76 115 54 215 16 129 73 51 138 71 107 37 105 248 234 276 127 138 107 97 104 144 50 77 57 147 117 82 83 53 89 105 64
2584F4J17N1n3m0p4N6N3P7k14J17j6p9Q0n8K81m1k44O0Mp0K7j4J50k14R4j8o8K9L5oK2P2o8
$$ 64 181 232 179 139 65 121 174 251 37 154 138 59 139 81 362 321 77 137 141 71 98 84 234 20 114 96 28 57 92 86 108 180 112
2274A12Q4p9n7K9j3O5p7L4k4N3L6k0j11K3J56J28j95l0M5Oj27J27r2Q7p2k1J52j11M2q7P3
$$ 112 196 117 60 89 76 141 64 98 74 127 163 143 32 55 211 339 144 114 159 165 38 165 73 160 88 67 219 108 150 63 136
1983A36p2J63r7J93K7j24q9L7o6OJ4J8m8J87q6j25n2K2J38l3k1K2L8j35N6Q2k4j4j20Q7J02
$$ 136 64 227 130 323 350 226 137 174 108 114 128 146 98 285 199 74 22 44 182 149 128 150 188 53 109 191 167 153 33 120 222
1692B22l2q7j0J30r5J8P1p5N4J9L6j26N2o1J8j09L4jQJ82n3j64J6l0O6o2N4l4L8J30j22o4
$$ 222 190 103 93 223 128 146 217 142 196 215 251 125 177 116 134 25 59 58 66 248 195 31 47 17 83 21 75 41 79 209 87 23
1391B3J78L7k1r0k1l8PN9K6J54l9q8r7Lk0%m5P5J70l6m0J7r1Oj21jJ66k8J77j20j16m0J74
$$ 23 201 238 217 127 106 68 75 134 160 314 275 187 90 93 73 73 28 103 273 237 197 214 123 129 8 7 173 145 322 202 86 46 220
1081B20j81R5M9n5j1P9p1r0M3m6Q3j9k2J82J03j69l2j0o1L8m1Q2o7j2K4Ko7J13k9M2O0j70
$$ 220 39 134 183 128 117 196 125 35 78 32 115 96 74 256 359 190 158 148 87 125 84 166 99 87 111 113 46 159 130 172 232 62
781F2Nk1J92rm9r1l5L2M9q0N4K5m3nj5P9%Qj19J50O4p8q3n7N3MMk4O7O5j34O5o2k5N1J39j44
$$ 62 67 46 238 229 180 89 54 86 135 55 109 134 91 86 71 150 150 158 39 189 253 175 92 35 88 92 96 72 139 204 70 135 73 48 99 238 94
433I4Q3m4P4%j34O7j8Q0j25P0N4n4n3l0Q4q1K08k1o0J13j83L2J71j33j06k4pR7n0J79p5p2
$$ 94 177 133 207 207 73 140 122 202 77 147 201 147 94 64 148 67 275 254 194 307 124 156 327 194 88 64 57 154 104 283 208 136
133A36Q6o3n8J6J5j02L7m5Q9J79r4N4R2j88j19J8O4K4K9j07N2R0Mj71JJ08Jn5j9K43l5j45
$$ 136 222 159 101 117 132 30 67 22 111 290 196 250 342 154 35 53 117 141 170 63 115 205 209 38 39 147 148 93 74 317 282 137
-167A37l0Q3m9o2J8Mj3P0MK5N5Nj88K10j36mn8O5n8P7l5M2j14L3
$$ 137 107 190 141 79 97 101 88 158 162 187 242 247 59 269 133 129 71 136 78 155 120 162 48 81
-393H1
##PAGE=	F1=-9064.31
##FIRST=	17614.246348710370512,	4405.4455391999963467,	0
##DATA TABLE=	(F2++(Y..Y)), PROFILE
4405E9P3q7J35m8m6J65N4Jj06o3N4p1M5j25J5J3N5R0K8j77L8m0Q7q7J30qp4J15r1N0L2J31
$$ 59 132 45 180 132 86 251 305 306 200 137 191 120 165 40 55 68 123 213 241 64 102 62 149 62 192 184 110 225 134 184 216 347
4105C47k22P8j06%P1O7j03%N9l9L0r1o9N1O9q3K4ol3P8M1Mj12K1k8J89k4j41M3O1Mp5P9n7
$$ 347 125 203 97 97 168 235 132 132 191 152 182 91 22 73 142 59 83 77 44 122 163 167 55 76 48 237 213 72 115 176 180 105 184 127
3786A27j22K04k7L4R5k95K67j50l2k1k4J31Pj54J2oK4L5K3n9pJ2k6J79J14j05p6m2L4N4J5
$$ 127 5 209 182 216 311 16 283 133 101 80 56 187 194 40 52 46 70 105 128 69 62 74 48 227 341 236 160 118 152 206 221
3495B21oJp5j3%l9P7J51j47j09MO5mk4l1J6n5R9%qJ52j99l6J5J00oj06M5J66j25p9R9q7J22
$$ 221 215 216 141 128 128 89 166 317 170 61 65 130 126 102 71 87 32 131 131 123 275 76 40 55 155 149 43 88 254 129 50 149 62 184
3175A84l1J01j55J10r1N1J03p3mp9J01j29L9J73j54PN7N2k8k05L1P7o7L1jj1qJ19j2j06l8
$$ 184 153 254 99 209 118 169 272 199 195 116 217 88 127 300 146 153 210 262 234 29 60 137 70 101 100 89 81 200 188 82 44
2884D4P9q6J07j00P9o9P7O2j32P3n7J5J63j9N1j57J7m5J2l4R1j16K9L9Mj8k6kl0LJ7qQ7Q4
$$ 44 123 37 144 44 123 54 131 193 61 134 77 92 255 236 287 130 147 102 114 80 171 55 84 123 127 109 83 81 51 54 71 63 150 234
2565B34n9j26J0N7N7Q1k07Q3L1p2K2n7K92n9k41J15J5p6k2L0Q0j40O9J9j11K2N0o7M4L5l5
$$ 234 175 49 59 116 173 254 47 130 161 89 111 54 346 287 46 161 176 100 78 108 188 48 117 136 25 47 97 30 74 109 74
2274G4Q8l2r3P7m5Q3n0m1J3N4k2L4r8O2P9J61j66o1R7k4j11O3m2K1l4J1J62j02k1n7M8j0K47
$$ 74 162 130 37 114 69 152 102 61 74 128 106 140 42 104 183 344 178 117 214 190 79 142 100 121 87 98 260 158 137 80 128 118 365
1964C65j88J89J2j33j42O2q5kJ31l9o8J66j00q5n2lJ18L2l1j6N3j12J3J60j8o5j60J60N4m1
$$ 365 177 366 378 245 103 165 80 78 209 170 102 268 168 83 31 28 146 178 147 131 184 72 85 245 227 162 2 162 216 175
1682A75j0r9J27r8rJ01n1RN0O4r3L5p6No5K5k8j4J89n3j14j6nN5j2J0J6j7J02j53l5J88Rj1
$$ 175 165 66 193 95 86 187 136 145 195 259 166 201 125 130 65 90 62 48 237 184 70 54 49 104 92 102 118 101 203 50 15 203 212 201
1363B01n1j25L6PL2j4K25j4j08r1J2ko9qJ02J27k8n4N2j25K2j16L7J70j00J70q4j26j3J90
$$ 201 150 25 61 68 100 86 311 297 189 98 110 108 39 31 133 260 232 178 230 105 127 11 48 218 118 288 204 78 65 255
1081B55j68O6O6r3o2P7m4m5O0r2J28Pp9J83J50k27l6Mn1LJN4q2KJ4P4m7J4k9M1N3j05n9J8
$$ 255 87 153 219 126 64 141 97 52 112 20 148 155 76 259 409 182 146 150 99 102 103 157 75 77 91 165 118 132 103 144 197 92 33 51
762E1J82J4r1m2q3N7J7KK1rk9J4j1P2j2M2j44J57L9q1q8m5rR1Qp5O4P5j29Q9r6l2J12J71k03
$$ 51 233 247 156 114 31 88 105 107 128 119 90 104 93 165 153 195 51 208 247 166 78 33 24 115 123 48 112 187 58 147 51 19 131 302 99
433I9P6l1P5qj12P9qP2j26O2O0r8j00J5N5k6J75qn9R7j60N3J64j75p5l7RO0o4K19p8p6J22
$$ 99 175 144 219 211 99 178 170 242 116 178 238 140 40 55 110 84 259 251 192 289 129 182 346 171 96 59 68 128 64 283 205 129 251
124B51r8k0k6J7r8O8k5O8J28j22R2P4k05p2O1J6O7N4j77P0P2O5j53n5Q1L8n0n9K71k7j86k1
$$ 251 153 133 107 124 26 94 69 137 265 143 235 309 104 32 93 109 176 230 53 123 195 260 107 52 133 171 121 62 333 306 120 99
-177I9J08o3m0J4M3K2j5l4R4Rlj46J64j55P6j05P8p2Q0j7K5j00k0
$$ 99 207 144 104 118 161 183 168 134 228 237 234 88 252 97 173 68 146 74 154 137 162 62 42
-393D2
##PAGE=	F1=-9135.07
##FIRST=	17614.246348710370512,	4405.4455391999963467,	0
##DATA TABLE=	(F2++(Y..Y)), PROFILE
4405F7M7r5J51n0m6K12Lrl7n4L2q5K9q4L3l1QJ25L1j35k4K2L8j01J51k0r2J09m0P1l0J14k57
$$ 67 114 19 170 120 74 286 289 280 243 189 221 136 165 81 114 83 91 216 247 112 88 110 148 47 198 178 86 195 155 226 196 310 53
4096E3J55j35OM0N0p6J0Q0o2P5q1q9M2O8j12Q3l6m6J13M5Nj10O8q9J36L2j09M0K5k4n7Q3q8
$$ 53 208 73 79 119 169 93 103 183 121 196 115 26 68 136 24 107 71 25 138 183 188 78 146 57 193 225 116 156 181 157 100 183 95
3786I5n7J96n1j6J38k45J93j11m3L1j5lM0r6j5K7JRN2p8j7N4j5J34J09j34q2K1L7O4l1N7k4
$$ 95 38 234 183 167 305 60 253 142 99 130 115 112 152 56 41 68 69 78 130 52 35 89 74 208 317 183 101 122 159 223 192 249 225
3476B25p0l9Jk1P2J65j46j17K0L4n4J1n1L5l8J46k7k6J24j68J9m7J43l2n5nJ53j26n4J15j38
$$ 225 155 116 117 96 168 333 187 70 90 124 70 81 30 65 27 173 146 120 244 76 95 48 191 159 104 99 252 126 72 187 49
3185D9J04m9J29j86J35o5L8Q8o2J7j37J16j70J23J26j17J6M3L7J5j45l1O0n9K3k4L2l4J26
$$ 49 153 104 233 47 182 117 155 243 181 198 61 177 7 130 256 139 155 198 235 250 105 74 134 75 98 74 106 72 198
2912A98j0j42l4J11m3Mj3N0o5J34L5j64Q5k1j9J44k8O4j59M2m0k1n5J31p2%R1r5k2j6K7j5
$$ 198 188 46 12 123 80 84 71 121 56 190 225 61 146 125 106 250 222 286 127 169 129 108 53 184 112 112 203 108 86 70 97 82
2612H2l1k3O0M0R6n2q6LJ9M6Q7k05O5N8l7m3m2K64p0j90J30K8p1m9L3J5k4J8O7j05l9M4%K3
$$ 82 51 28 88 128 224 172 86 89 108 154 241 36 101 159 122 79 37 301 231 41 171 199 128 79 112 127 103 121 188 83 44 88 88 111
2293A11p5K0N4K6r4J02q4Q5j1j06M0O5o9N3p6J08j4J89j40m6J08m8p6j9Qk9j1M1J59q7n9l8
$$ 111 36 56 110 136 42 144 60 145 134 28 68 133 64 117 41 149 135 324 184 138 246 198 122 103 111 82 71 112 271 184 125 87
1992H7K5P7K42k18J79k0j28j80R9p0n8K16o4q9J43r2k4n1n2Q2Q0j1n4N9q7j6K26k8j01j61
$$ 87 112 189 431 213 392 372 244 64 163 93 35 251 187 98 241 149 125 74 22 104 184 173 119 178 91 75 301 273 172 11
1711A1J72J3m2N9j53Q6r2j2J18j8l5O1R9n6K1j17nqL5n9m4J78m3q1k5K5M0K4oL4p0O2j59K9
$$ 11 183 196 154 213 60 146 54 42 160 142 107 168 267 211 232 115 110 102 137 78 34 212 169 88 63 88 128 152 146 180 110 172 13 42
1391D2J53k1j6j2r1J8j7J9o8K74Rj19q5N1Nj19K2J12Q1k3n0O2j62L8q6O9J72j67J61o4j15
$$ 42 195 174 158 146 55 73 56 75 7 281 290 171 86 137 142 23 45 157 238 215 165 227 65 103 17 86 258 91 252 188 73
1100G3RJ87j41J6J00j45q2P4k4jP2j30J52L8j18J61J86k54m1J8n3k0M7L1j02K7K8J07m3l8
$$ 73 82 269 128 144 244 99 17 91 67 66 138 8 160 198 80 241 427 173 132 150 97 77 124 155 53 80 108 215 172 134
818A34n1J8L5k5k6k9J64K1j27K2k4k%O2l0n4lK0kO4j7O6j37J43K5r6r9K8kP3J7r2KR0j10Q2
$$ 134 83 101 136 111 85 56 220 241 114 136 112 110 110 172 142 88 85 105 103 167 150 216 79 222 247 151 52 80 78 151 168 76 78 168 58 140
480A40j01K6Q5J78j82NJ8O6l1p1Q2KM6j28N3M7j14j08K4L0K8J18Ql6P3j25P1J17j78l7m8N
$$ 140 39 65 150 328 146 151 169 235 204 133 215 217 263 135 188 235 121 13 37 67 95 213 221 185 258 133 204 321 143 106 58 63
180F3M2q3K54q0p1J48j29Mm9oo3R3jK2P4j24J19M6j60o0P8k8J09N9k03Q2L9J09j27o6J8P3
$$ 63 105 22 276 196 125 273 144 148 99 93 30 123 122 144 218 94 213 259 99 39 117 89 198 257 54 136 175 284 157 91 109 182
-121A82l4r9K76kk08j6J12o4l3MJ08L0j19m0J77l9k7q4J16k07J72j18N3p9Q4lQq5k7
$$ 182 148 49 325 323 115 99 211 147 114 118 226 256 137 97 274 235 208 124 240 33 205 87 140 61 145 142 150 65 38
-393C8
##PAGE=	F1=-9205.84
##FIRST=	17614.246348710370512,	4405.4455391999963467,	0
##DATA TABLE=	(F2++(Y..Y)), PROFILE
4405F3K9p0J31n1k7K22l8j1J8m9J5q5K7m8K7o4nJ26K0j00j8N6k4m4J05l3j20J16KQ3p8Q0k33
$$ 63 92 22 153 102 75 297 259 248 266 217 232 147 174 126 153 89 84 210 230 130 112 168 144 100 205 172 52 168 170 253 175 255 22
4096B2J77j55J8JK8k8J8Q6q8J13n4q7J3R4p4P5m2j00J48M1J9j16J00q9K7Q8q6L6kn5k5P6q0
$$ 22 199 44 62 63 91 63 81 167 79 192 138 51 64 158 84 159 117 17 165 206 225 109 209 120 147 235 149 185 183 128 103 179 99
3786I9k3J79r3n1J67j47Q5q2l9N1L3j07K8l2KL9n3j4P8o7j6P4j8P9J01j43m6L8KR4o8J15n2
$$ 99 76 255 162 111 278 131 216 134 95 146 179 72 100 68 70 109 56 42 120 53 37 111 93 172 273 130 84 122 124 218 150 265 213
3476B13n0o4j6J5N8J63j30j05K2J8p8L3m2J1OJ60m5o1R1j16O4r7J78o2j4k3R5j11j7J15j64
$$ 213 163 99 83 98 156 319 189 84 106 124 46 79 37 48 54 214 169 108 199 83 147 50 228 166 152 129 224 113 96 211 47
3185D7O1k7J21j49Q9k0qR8m8L3j75J29o2O4M1q2M5J1K0L2m6p8Pl5L5o2P5m8J27j6j52JQ4n
$$ 47 108 81 202 53 142 122 114 212 164 197 22 151 89 153 194 112 157 168 188 220 174 96 103 68 103 41 116 68 195 179 27 28 112 107
2865A07n4L6L8m7J45mj61Q5K6l9J02l7Q7j54N5m9n5n0J57j6k4J30j56p5LO2kl5n2J05J0O9
$$ 107 53 89 127 80 225 221 60 145 171 132 234 197 284 130 185 136 81 31 188 172 148 278 122 47 50 112 110 75 23 128 138 207
2565B07o2K8m3l1K0R8j76L0N3K6r2j1J88o3r9R3L5n1o8J8k3P1k6J07r2r5K3R7J0j43K4jR5
$$ 207 145 173 130 99 119 217 41 71 124 150 58 47 235 172 73 166 201 150 82 100 77 148 122 229 137 42 65 162 172 29 53 52 147
2255A47q8J15j21O3L3j40N1P2n6J0n6J52q1J89j30RP4o2j9j07N4n1j3N3J51o8p4k2J0Q3K11
$$ 147 59 174 53 116 149 9 60 132 76 86 30 182 101 290 160 169 243 181 162 55 109 58 45 98 249 181 107 85 95 178 389
1964C89j62J75o2j14k01J45m1j07K25n3r8J16n7J4p2m8RJ08L9q8N2o8k2K58m4j16j63J66r
$$ 389 227 402 340 226 25 170 129 22 247 194 96 212 155 169 97 49 58 166 205 117 169 101 79 337 293 177 14 180 171
1692A71k7R7j58K3p6N3Q2ko5L7J37l4J4j68mM8N8r6m0J34k3q0pN9K5K5PK0j00J6m2K1Q1m7
$$ 171 144 241 83 106 30 83 165 163 98 135 272 238 252 84 80 128 186 90 50 184 161 81 74 133 158 183 190 210 110 126 84 105 186 139
1372A39k6N%j8o0L3oJ56K7j11p3R4Jj30L5J10L5k3l1M1j89P1m5P3J82k04J32o3r3L4J60j01
$$ 139 113 118 118 100 40 73 67 223 250 139 66 160 161 31 66 176 211 188 157 198 9 80 35 108 290 86 218 155 62 96 256 155
1072A55m7J30j84k4K2jJ1R0j41J43O0j28J25J99k42m9L0n6k9P2K1j10M1N1J02n0k2p9m0J8
$$ 155 108 238 54 30 52 51 62 152 11 154 214 86 211 410 168 119 149 93 64 136 157 47 88 139 241 191 169 90 50 68
790F8M4J1o8J49J1j51Q0M8l8rQ1q5r6K6K1J3N0j3P6j20J33K0j13j12J01L1K2K3p7o7R8r1N5
$$ 68 112 123 55 204 215 64 144 192 154 145 226 141 45 71 92 105 155 142 218 98 231 251 138 26 127 158 180 203 126 59 157 66 121
480A21n8N4L2J58j14p8P8P0p0l6Q9NLj28M3K0r7p4j3M9N0M5K7nM5q8Q3N1j23k4o0KL1p5K46
$$ 121 63 117 149 307 193 115 193 263 193 157 246 251 254 126 169 189 92 18 5 54 104 149 176 171 216 128 211 262 139 115 55 57 88 13 259
152B59p7o2J66j49Mm1l9k8J11K1k6J3q2J13K3m4q8M3n1J39L8j52N6KJ31j01o1l5J04j3j35
$$ 259 182 120 286 137 141 100 61 33 144 165 139 152 70 183 206 162 74 117 66 205 243 91 147 149 280 179 118 83 187 174 39
-139C9K59K9k03qQ6m9l8j7J81K3k23j1K43o6o6k0Q9j95J78j36J7p6J01opp1P
$$ 39 298 327 124 116 202 153 115 98 279 302 79 68 311 245 179 159 248 53 231 95 112 36 137 131 124 53 60
-393F0
##PAGE=	F1=-9276.61
##FIRST=	17614.246348710370512,	4405.4455391999963467,	0
##DATA TABLE=	(F2++(Y..Y)), PROFILE
4405D8K0l4R9n1j0K07o2qN1m2%o7L5k2Jr2K9R3kq0K5Q2q5J3O2l8j41J16L1P5j02N5j30J02
$$ 48 68 34 133 82 72 279 217 209 260 218 218 151 186 164 165 73 102 195 193 113 138 220 135 148 210 172 31 147 178 253 151 206 76 178
4086A78j48K0l5J1K2J6R2j05J19j8q3nJ08m6Q8l2j44J53M5K8j27J14q4n5J31p5K9k5p7J9N9
$$ 178 30 50 15 26 48 64 156 51 170 152 69 64 172 126 214 182 38 191 236 264 137 251 167 112 243 168 197 172 95 114 173
3795A73l9j6J49j45o1J74m9lp2k9M3P3j03m4K5L6M2j18J9P1n2%N1l0K6R1j00KJ2o2J34r4J54
$$ 173 134 118 267 122 61 235 186 183 111 82 125 198 95 51 76 112 154 36 55 126 74 74 125 95 121 212 112 114 126 64 198 104 258
3485B58p5k5q4j2K6N5J35j03p5PJn7N2j7n0N5J51n1j02O2m6P6j20K03r4Lj9K5q8K5J02j64
$$ 258 183 158 74 62 88 143 278 175 100 107 108 51 103 86 36 91 242 191 89 151 105 181 61 264 170 173 154 179 91 116 218 54
3185E4J4L1P1p8jM2q4J54m9L7j36Q9LK3m6o0R7k6K5kN2j05n7J3N0r6J06m8J25l7j10OL2K0
$$ 54 68 99 170 92 91 133 49 203 154 191 55 144 147 170 124 64 161 135 160 158 210 105 48 61 111 15 121 73 198 161 51 57 89 109
2865A09m5L4L8k6J24m7j11O5O9o7O2l5J20j43M2p8o7k6J70K7m3J57j51j64L2Q5mm9j8J06%
$$ 109 64 98 136 110 234 187 76 141 210 143 205 170 290 147 189 111 44 18 188 215 172 329 178 14 46 131 127 78 60 166 166
2574A66K1r6J45p9o3j5J10j13j0mJ05j08J0R3l1k2N0J9j1p7j2lQ6m9J37p7j35qJ82Qj42k6
$$ 166 187 91 236 157 94 79 189 76 66 62 167 59 69 162 131 109 159 178 167 90 78 75 161 112 249 172 37 29 211 219 77 51
2274E1OJ13r7J27j43J0P6j23L8P2k2k0n2J64q9J46j42Q4Ko2N8j43M0m6k7M0J43n1n7j0LO2
$$ 51 57 170 73 200 57 67 143 20 58 130 108 88 36 200 111 257 115 199 201 139 197 54 94 48 21 61 204 153 96 86 89 151
1973A51J14n0J86j03j00j90J73k3j04J49j0p8O9nK2j02mp6J18J00j18L8o0rK52n9j12j31J22
$$ 151 265 215 401 298 198 8 181 158 54 203 193 115 184 179 201 99 95 19 137 237 119 157 97 88 340 281 169 38 160
1701A60j1QR1j42on1P5O3jq0qJ73l2J6k18L6O3Q4j24JP8j5r2J3R2J6j1M7k2r5l0P2K6J1o3
$$ 160 149 157 248 106 100 49 124 187 186 106 98 271 239 255 37 73 136 220 96 97 175 160 68 81 173 189 178 225 203 108 78 150 176 187 124
1372A24j8l3Q0k7q2M2M3J8L7q1m8J05nj14M8J02j1k2rkq2K3j7L7K03k15R6p9o6N7J17n9j06
$$ 124 106 73 153 126 44 86 129 147 184 103 55 160 155 41 89 191 180 158 149 147 65 88 71 108 311 96 192 113 47 104 221 162 56
1063E6J39j92P5m9N2l6J08j32J14O2j05R0J81k00m9L6k9l9N8K6p5J3M9Q2o9M4r8j03N2M4L0
$$ 56 195 3 78 29 81 45 153 21 135 197 92 182 363 163 114 150 121 82 140 166 91 104 153 235 166 210 112 9 61 105 135
772A35q4J37rj48J04J18n4k3Q3j34j13L7L4J8L1jO8r9J36K4j25q6J14N8k5K2n9r5R1p7K1o
$$ 135 51 188 179 31 135 253 199 176 259 125 12 49 83 101 132 131 199 100 236 260 135 49 163 221 196 218 159 64 155 78 99 93
471I3O3k5J12k5j18J06R1j13k9J08On4j27L5on5rj1M5K3k8M1K1K1n4Q6ok5m4o8OJ6l8J90o1
$$ 93 156 131 243 218 100 206 297 184 155 263 269 215 88 123 117 62 53 42 87 110 82 123 144 165 111 197 191 166 122 54 60 76 38 228 167
142A67n3J77j54j8j0k4n9J26M6o4m8pP1K5N8j11k8n0J51mm5Mk6J30p7m8o7J30Qj77K38N4j89
$$ 167 114 291 137 119 109 85 26 152 198 134 86 79 150 175 233 122 94 44 195 191 146 150 124 254 177 129 62 192 200 23 261 315 126
-167A26RM7k2m0n3K45Pk58jK65o1j07L0Q6j34J19j78j6n7J29l1j8o0N3
$$ 126 135 182 160 120 67 312 319 61 60 325 264 157 187 273 139 258 80 64 7 136 105 87 27 80
-393H0
##PAGE=	F1=-9347.37
##FIRST=	17614.246348710370512,	4405.4455391999963467,	0
##DATA TABLE=	(F2++(Y..Y)), PROFILE
4405B8K0%O9m7j6J78o9KO2l1j5k8L8Mm5j08R3L7k8p9Q1J07j29N7K8l1j34Q9M2N0j00N4o5L2
$$ 28 48 48 117 70 54 232 163 165 227 196 181 153 191 195 150 42 135 172 144 65 146 253 124 181 209 178 44 133 175 225 125 179 114 146
4086A46r9kj9J7j7K0J10q8O9J3p5mR0j7J10j6j74J41N4K3j27J10p6r3J44o9K0m2q1O4K9Qp
$$ 146 47 45 26 43 26 46 156 68 137 150 75 71 161 144 254 238 64 205 259 282 155 265 189 96 240 171 191 149 68 132 161 169 162
3776A62J05j79n3J45L4n7p9j5J7R4m7r4M8O4M0j66P5O5m8NRl7k6P9j1J1Rq3J09j11J62q8J
$$ 162 267 88 35 180 214 157 78 63 80 174 127 33 81 145 185 19 94 159 111 116 125 88 62 141 130 141 150 67 176 65 227 139 140
3466A40r7O7l4O6P6p0l4k1k0jQ5Mj29R9J24n1j35L8L2N4j07K08j26j0Kk0o9N7Q0j33J9M0J0
$$ 140 43 110 76 142 218 148 114 93 73 72 157 161 32 131 255 204 69 107 139 193 86 294 168 158 160 140 71 128 208 75 94 134 144
3157A44l2p4J12j22J88o3K5r5N7L7lj04o3J59n4O1r0J29j23m3J4N7p9Q3l2J20p6o2J8k7K9
$$ 144 112 38 150 28 216 153 178 83 140 177 174 70 7 166 112 173 83 212 89 46 60 117 38 121 89 209 133 71 89 62 91
2865I1OJM3mQ8q4l3L2R3j03L2j7J60j22jj21j4k6J68M1n9J73r6j79NQ1j5r1M0J00rk0j19K31
$$ 91 97 98 141 137 225 141 108 140 233 130 162 145 305 183 182 61 47 21 189 230 171 344 248 69 74 155 140 49 89 189 180 160 41 272
2546B72j11o5m4J06m8j4p7J51r5QJ7J0K3L0l0M7o4p2N1L4l8J55o7j46j5K05J6j34n5O1Q3j07
$$ 272 161 96 52 158 110 96 19 170 75 83 100 110 133 163 133 180 116 44 95 129 91 246 179 33 18 223 239 105 50 111 194 87
2246H7J31j41j9N7q2L3P1j1Ko0J35o7J02j64J42q2n8J48r4n5l4j2MJ27m7J7k9oR4n9N2K10
$$ 87 218 77 58 115 33 66 137 126 128 68 203 136 238 74 216 134 76 224 130 75 41 29 33 160 113 130 101 95 189 130 182 392
1945C92j25j00j35J58k2r5O0N6m1J0M8J3j23N6j02O1J46j39K7o8J9K10o7r5o9O2oM9N8j21
$$ 392 267 167 32 190 168 73 133 189 148 158 206 219 96 152 50 111 257 118 145 77 96 306 239 144 75 137 131 180 238 117
1664A17nm6P2N8Kq4n5K00m4K8k27J00J0J02j23N1M2l4j04J1J30Qp0J09p9o2n8J49M3m5o3O
$$ 117 112 66 138 196 198 114 59 259 215 243 16 116 126 228 105 156 198 164 60 71 201 209 139 248 169 107 49 198 241 196 133 139
1363A39j03J18j5n4K1O7j06M8m0j4O8pq1O5R3m8j7jn3N6k0j3j6K30k15P1r6m4P4O6k5j41J15
$$ 139 36 154 139 85 106 173 67 115 75 61 129 122 41 106 199 151 134 133 80 136 116 103 87 317 102 173 77 33 107 173 148 7 122
1053A22p9P8p7R0q0Q6j08Q0M2n6O5J32j39l7M0L0o8J5N1k9j9jO5r8J32j10q9P0kK1p3J18k5
$$ 122 43 121 44 134 54 140 32 112 154 98 163 295 156 119 159 189 121 136 187 158 139 138 203 105 237 127 38 108 106 127 54 172 147
743A47j04P3J67n6m4Q6j66m9l5P8lK6lM7p7J49L8j27m9Q5P4n7J2n1r2R1o7j3K7O8p2N1O2q5
$$ 147 43 116 283 227 183 269 103 54 19 97 94 120 117 164 87 236 274 147 98 183 257 200 212 161 69 160 93 80 107 175 103 154 216 131
424A31P4J17j41n8J33J4j15j25L5Mk1N5j7L0mo3K0L5Pk0Q0k6N3p9o0J9j3rJ20l1m1J86j43
$$ 131 205 322 181 123 256 270 155 30 65 69 48 103 86 116 112 49 69 104 111 91 171 145 198 119 59 78 65 56 176 145 104 290 147
114A47m7J9J3j22J32P8q2n4J2K4O6R7j15j09l4J45n6P7n3k9J09n7m0o8J47K4k17K23N8j84
$$ 147 100 119 132 10 142 220 138 84 96 120 186 283 168 59 25 170 114 191 138 109 218 161 121 53 200 224 7 230 288 104
-167A04M4QJ5k8j02K83j5j81n9K40k8j31N4R3r0P4k33l8M2Q2o5k4l0Q2
$$ 104 148 156 171 143 41 324 309 128 69 309 281 150 204 297 207 281 48 10 52 134 69 45 15 97
-393I7
##PAGE=	F1=-9418.14
##FIRST=	17614.246348710370512,	4405.4455391999963467,	0
##DATA TABLE=	(F2++(Y..Y)), PROFILE
4405A5L2J5N3m5m0J33o4K0N6j3l0K8K1L4r4r2J39k9m6q5J22J31j48R2kk3j26P4L1J8o9O4l9
$$ 15 47 62 115 70 30 163 99 119 175 162 132 160 181 215 121 29 168 139 93 8 130 261 113 205 203 180 54 128 159 177 108 172 133
4096A33k6m1k4oL3m0pJ35o6J3K2o0J6M8J4J23Lj81J07N9J2j06R2o7r4J28n6Nn1n3R4j3M7J3
$$ 133 107 66 42 36 69 29 22 157 91 104 126 66 82 130 144 267 270 89 196 255 267 161 253 186 92 220 164 169 118 65 159 146 193 206
3776B06M4j41o8Q0R2p9q4%J8O0J5q7L1P4L1j76J01Q0m3Km3k7q4O5Q0%N0n1K0j21J31q9K3q1
$$ 206 250 109 41 121 213 134 50 50 68 128 143 56 87 161 192 16 117 197 154 156 113 86 2 67 147 147 197 146 166 45 176 87 110 29
3457B9J40r3Q4ol9Rn2n0Q4J23J1k01J23R0m6j46J4R7J8o6J90j54m8L3j6o4O4N9p1N2%m1j6
$$ 29 169 76 160 154 115 124 72 22 106 229 240 39 162 252 206 60 74 171 189 123 313 159 111 144 128 64 128 187 116 168 168 127 111
3147A11p0J30p4J29p1Po3L1N2j7r0j5J10o8R4j81J72j37O5n4N5n4M9LJ08j16l3N5o3%P0l6
$$ 111 41 171 97 226 155 162 99 130 182 165 75 60 170 102 196 15 187 50 115 61 116 62 111 114 222 106 73 128 65 65 135 99
2847I9L9K1M8j05L1OR8j30KJ1K03q3o7j33O0o3J52K6p4J77j2j84j3P1k1j20P6P5k6m8l4K10
$$ 99 138 159 207 102 133 139 237 107 109 120 323 240 173 40 100 37 189 215 141 318 306 122 109 180 159 39 115 190 164 116 82 292
2546B92j50m4m0O5Olm1P4o6rj1K4L8L8r8J15l3j38P9m3K9J43o7j16K4J26L3j15n2Q7N4j00
$$ 292 142 98 58 123 129 126 85 159 93 84 73 97 135 173 75 190 157 19 98 55 84 227 160 44 68 194 227 112 60 147 201 101
2246A01J23j13L0p2k7L7P1k9M9o3Q9m9Q8j61J42j37o9K33k1j44l8RJ8P6n0J04o7k8J26j42
$$ 101 224 111 141 69 42 79 150 121 170 107 196 147 235 74 216 79 10 243 222 78 40 49 67 143 93 197 130 102 228 86
1964H6N6K32j25j13r7J53l1q9j0J26j3m3R8nj04R3j22QJ58j50K5q8N9J36o3q0J8J2j7Q3K9
$$ 86 142 374 249 136 39 192 161 72 62 188 175 132 230 225 121 214 92 100 258 108 133 45 104 240 177 97 115 127 110 193 222
1673B22j02qm0N5N1J6p8r4K12o3M9j50J06o8R7p9Q6K2o6j13j2J65jj20J72j34k5k0J46N8p9
$$ 222 120 112 72 127 178 194 116 22 234 171 220 70 176 108 205 126 212 234 168 55 43 208 207 87 259 125 100 80 226 284 205
1382B05n4K0j04N6RMnO4j75O3j8L%Lm5Q7Q5p3oor7J74m9k6o2K54k11O5r6l5P4J9op9jM1O7
$$ 205 151 171 67 123 132 136 131 195 20 83 65 68 68 71 26 113 198 125 119 113 16 190 141 115 53 307 96 161 65 30 104 123 117 38 37 78 145
1034A45p1J13q0Mo8N4KMN2O3p2j0N3Q6j09l5Q3J3l7r5O1q4J72j21o0P8j6j5l7Q6k9p3L7J86
$$ 145 74 187 107 111 43 97 99 103 155 218 146 136 189 275 166 131 214 227 190 95 156 72 244 123 63 141 125 110 73 159 130 57 94 280
715B80n2o5R6j67kp1J04l7O1l6Ro1J75O4j22k5L7P4o6%o4o5R8n3m5K8P3q9k0J34k1K5J28j47
$$ 280 228 163 259 92 90 19 123 86 147 111 120 59 234 298 176 151 188 262 196 196 132 67 165 112 67 95 168 79 59 193 172 197 325 178
396A78j13J55L5j68m0PM6l8Q9l5Pj5k8o0L6K2%Q5qN9j11l5M6m1lL6Rk7J96j17n9J1M5j47R5
$$ 178 65 220 255 87 47 54 100 62 151 116 123 108 80 20 56 78 78 163 155 214 103 68 114 73 70 106 115 88 284 167 108 119 164 17 112
67A12J16q6kl4lJ14Q5j01j56l5J21r6J76j00nP4l8m6m0J53L4j93J67L4j91J04k7M8rj43K82
$$ 112 228 142 140 106 103 217 302 201 45 10 131 35 211 111 106 180 142 96 56 209 243 50 217 251 60 164 137 185 176 33 315
-224C15m1q5r9J78J8j34N4R6o2N1k37lN3J8q4k7M6N3
$$ 315 274 189 90 268 286 152 206 302 240 291 54 51 104 122 38 11 57 110
-393A10
##PAGE=	F1=-9488.9
##FIRST=	17614.246348710370512,	4405.4455391999963467,	0
##DATA TABLE=	(F2++(Y..Y)), PROFILE
4405B3M0NN7m9k2L0n3N6L1Nk9Q2k3O8j19m9J32q4n4L2J8J45j38J25l1k9j27R3lmj4N2l0o8
$$ 23 63 68 125 76 54 84 31 87 118 123 94 176 153 221 102 53 185 101 47 79 97 242 104 229 198 169 42 135 132 128 114 166 136 68
4086F8Rl8nL4K4p6J30n1qrl3M5LM3J19J7j56M4N4No5O4n7p3R9l5j7n0kJ11n3O3L7k4n5j11
$$ 68 77 39 34 68 92 16 146 95 87 78 45 90 93 136 255 272 116 160 214 219 154 218 161 88 187 152 135 85 83 194 141 204 241 217 162 51
3748E1RJ36q7n4J4N4k9N2o8J4O6J6j53R9J00k9jq7jl3k2R9mJ09l2m7j25O7p9M1l1J57j14J01
$$ 51 60 196 109 55 69 123 94 146 78 92 158 174 21 120 220 191 190 103 102 69 47 146 142 251 219 172 47 114 35 76 45 202 88 189
3429A89q3k5M4o9k5J14J53Mk51J22O4l1j37j8J37rj3J51j74r9P1K5p1N1M2QP4m8o6j3k6J02
$$ 189 106 81 125 56 31 145 298 302 51 173 237 206 69 51 188 179 166 317 143 44 115 140 69 120 162 170 244 196 130 117 91 193
3128A93m5O2n4qk5%M8j7m7ON6p6J07j63J12j38J57j10M8l5J9M8R4j21n6J16o2n0J05n8J7N0
$$ 193 148 210 156 148 123 123 171 154 107 113 169 93 200 37 149 11 168 58 106 71 90 138 232 111 55 171 109 59 164 106 123 173
2828A73J7j12O2rR3j13o2N6K29k7j37p7O2r1J22rq7J68P1j76j6N8pp2K7K7m9o2P4J76k00j4
$$ 173 190 78 140 131 224 111 49 105 334 307 170 93 155 64 186 177 90 258 329 153 137 195 188 116 143 170 121 59 133 309 109 95
2527I5j8OM7PnNl0l7K1jK3N9j30J61%j36Qk7P7P3p2n8M7J6N2q4k5Q0L0p3J01o2Q7j96NM6O8
$$ 95 77 83 130 137 132 137 107 70 91 90 113 172 42 203 203 67 75 48 125 198 126 68 115 131 183 99 74 154 184 111 212 150 237 41 46 92 160
2180A60o7J03n6M3m2J00j37R7j05l8J96O0j90o0ML8M2l0J44j07n1J08j17J3K33j11j31p2J60
$$ 160 93 196 140 183 141 241 104 201 96 58 254 314 124 64 68 106 148 118 262 155 104 212 95 108 341 230 99 27 187
1908A87m5q9l0J72j7o8J36k3m6R4j49k9J42j53M5r3Q3M0n2p1J15j9n1J08K1q6k0j5J9L5L1
$$ 187 142 53 23 195 178 110 246 223 177 271 122 93 235 82 127 34 117 157 105 34 149 130 79 187 208 122 102 87 106 141 172
1617A72n8j04J82p7P7p4J14j24N0JR7Kq1j30l3J85k3q5J68j71LM8R3O6r0m4K0p1m0K9Q0k3
$$ 172 114 10 192 115 192 118 232 108 158 159 256 258 177 47 14 199 176 91 259 88 91 139 232 298 208 164 184 113 73 102 182 159
1316A59L5j46M6j7j4k9K1m4R6P9q7MMp1J78n8n7o8K50j99P3q6k6N8j6kk7RL9L3m4J33n6j06
$$ 159 194 48 94 77 63 34 55 11 107 186 99 103 107 36 214 156 99 31 281 82 155 69 43 101 85 83 56 65 104 137 93 226 170 64
$$ [...]
-393E9
##END NTUPLES=	nD NMR SPECTRUM
##END=	
##END=	
