##TITLE=	Oct20-2021.111.fid
TM-VI-121 Zr+PMB-prraz. 13C

##JCAMP-DX=	6.0	$$ MestReNova 14.3.0-30573
##DATA TYPE=	LINK
##BLOCK_ID=	1
##BLOCKS=	2    
##ORIGIN=	Mestrelab Research S.L.
##OWNER=	hrzepa
##$MNOVA/LINK_BLOCK_TYPE=	ITEM	$$ NMR Spectrum
##$MNOVA/ITEM/POLYGON=	(XY..XY)
5321,5835
8722,5835
8722,8208
5321,8208
5321,5835
##$MNOVA/ITEM/Z=	0
##$MNOVA/ITEM/ANGLE=	0
##TITLE=	Oct20-2021.111.fid
##JCAMP-DX=	6.0	$$ MestReNova 14.3.0-30573
##BLOCK_ID=	2
##DATA TYPE=	MNOVA NMR VIEW DATA
##DATA CLASS=	MNOVA VIEW DATA
##$MNOVA/ITEM/ZOOM/X=	-20.698776542268014111,	240.66949999422217843
##$MNOVA/ITEM/ZOOM/Y=	-823.68288230895996094,	8792.03680419921875
##END=	
##TITLE=	Oct20-2021.111.fid
##JCAMP-DX=	6.0	$$ MestReNova 14.3.0-30573
##BLOCK_ID=	3
##DATA TYPE=	NMR SPECTRUM
##DATA CLASS=	XYDATA
##NUMDIM=	1
##ORIGIN=	Bruker BioSpin GmbH
##OWNER=	nmr
##.OBSERVE FREQUENCY=	100.69424847706599735
##.OBSERVE NUCLEUS=	^13C
##.SOLVENT NAME=	Acetone
##.PULSE SEQUENCE=	zgpg30
##LONGDATE=	2021/10/21 00:41:00.000
##.ACQUISITIONMODE=	SIMULTANEOUS (DQD)
##$ORIGINAL FORMAT=	Bruker XWIN-NMR
##$MNOVA/SCALES_VERSION=	9
##$PARAMETER FILE=	(acqus, ASCII, /private/var/folders/f6/rjf_tdyn2v98c5c0wvkgn4s80000gn/T/C0+NQxylSemWmdBCFe+RZw/111/acqus, 0)
$$ ##TITLE= Parameter file, TOPSPIN		Version 3.2
$$ ##JCAMPDX= 5.0
$$ ##DATATYPE= Parameter Values
$$ ##NPOINTS= 11	$$ modification sequence number
$$ ##ORIGIN= Bruker BioSpin GmbH
$$ ##OWNER= nmr
$$ $$ 2021-10-21 00:41:41.299 +0100  nmr@CZC10666PP
$$ $$ /opt/topspin/data/agmb/nmr/Oct20-2021/111/acqus
$$ $$ process /opt/topspin3.2/prog/mod/shimcntl
$$ ##$ACQT0= -2.01680680282977
$$ ##$AMP= (0..31)
$$ 100 100 100 100 100 100 100 100 100 100 100 100 100 100 100 100 100 100
$$ 100 100 100 100 100 100 100 100 100 100 100 100 100 100
$$ ##$AMPCOIL= (0..19)
$$ 0 0 0 0 0 0 0 0 0 0 0 0 0 0 0 0 0 0 0 0
$$ ##$ANAVPT= -1
$$ ##$AQSEQ= 0
$$ ##$AQ_mod= 3
$$ ##$AUNM= <au_zgonly>
$$ ##$AUTOPOS= <58 >
$$ ##$BF1= 100.683175
$$ ##$BF2= 400.41
$$ ##$BF3= 100.683175
$$ ##$BF4= 100.683175
$$ ##$BF5= 100.683175
$$ ##$BF6= 100.683175
$$ ##$BF7= 100.683175
$$ ##$BF8= 100.683175
$$ ##$BYTORDA= 0
$$ ##$CAGPARS= (0..11)
$$ 0 0 0 0 0 0 0 0 0 0 0 0
$$ ##$CFDGTYP= 0
$$ ##$CFRGTYP= 9
$$ ##$CHEMSTR= <none>
$$ ##$CNST= (0..63)
$$ 1 1 145 1 1 1 1 1 1 1 1 1 1 1 1 1 1 1 1 1 1 1 1 1 1 1 1 1 1 1 1 1 1 1 1
$$ 1 1 1 1 1 1 1 1 1 1 1 1 1 1 1 1 1 1 1 1 1 1 1 1 1 1 1 1 1
$$ ##$CPDPRG= (0..8)
$$ <waltz16> <> <waltz16> <> <mlev> <mlev> <mlev> <mlev> <mlev>
$$ ##$D= (0..63)
$$ 0 1 0.00345 0 0 0 0 0 0 0.06 0 0.03 2e-05 3e-06 0 0 0.0002 0 0 0 0 0 0
$$ 0 0 0 0 0 0 0 0 0 0 0 0 0 0 0 0 0 0 0 0 0 0 0 0 0 0 0 0 0 0 0 0 0 0 0 0
$$ 0 0 0 0 0
$$ ##$DATE= 1634773300
$$ ##$DE= 6.5
$$ ##$DECBNUC= <off>
$$ ##$DECIM= 760
$$ ##$DECNUC= <off>
$$ ##$DECSTAT= 4
$$ ##$DIGMOD= 1
$$ ##$DIGTYP= 12
$$ ##$DQDMODE= 0
$$ ##$DR= 21
$$ ##$DS= 4
$$ ##$DSPFIRM= 0
$$ ##$DSPFVS= 20
$$ ##$DTYPA= 0
$$ ##$EXP= <c13>
$$ ##$F1LIST= <111111111111111>
$$ ##$F2LIST= <222222222222222>
$$ ##$F3LIST= <333333333333333>
$$ [...]
$$ 90 74 58 42 26 10 0 0
$$ ##$Sgu3PowerLevels= (0..7)
$$ 0 0 0 0 0 0 0 0
$$ ##$Sgu4PowerLevels= (0..7)
$$ 0 0 0 0 0 0 0 0
$$ ##$Sgu5PowerLevels= (0..7)
$$ 0 0 0 0 0 0 0 0
$$ ##$Sgu6PowerLevels= (0..7)
$$ 0 0 0 0 0 0 0 0
$$ ##$Sgu7PowerLevels= (0..7)
$$ 0 0 0 0 0 0 0 0
$$ ##$Sgu8PowerLevels= (0..7)
$$ 0 0 0 0 0 0 0 0
$$ ##$SguType= 3
$$ ##$ShimPowMaxUA= (0..63)
$$ 130000 130000 130000 130000 130000 130000 130000 130000 130000 130000 130000
$$ 130000 130000 130000 130000 130000 130000 130000 130000 130000 0 0 0 0
$$ 0 0 0 0 0 0 0 0 0 0 0 0 0 0 0 0 0 0 0 0 0 0 0 0 0 0 0 0 0 0 0 0 0 0 0 0
$$ 0 0 0 0
$$ ##$ShimPowMaxUC= (0..63)
$$ 130000 130000 130000 130000 130000 130000 130000 130000 130000 130000 130000
$$ 130000 130000 130000 130000 130000 130000 130000 130000 130000 0 0 0 0
$$ 0 0 0 0 0 0 0 0 0 0 0 0 0 0 0 0 0 0 0 0 0 0 0 0 0 0 0 0 0 0 0 0 0 0 0 0
$$ 0 0 0 0
$$ ##$ShimPowMaxUG= (0..63)
$$ 524287 524287 524287 524287 524287 524287 524287 524287 524287 524287 524287
$$ 524287 524287 524287 524287 524287 524287 524287 524287 524287 0 0 0 0
$$ 0 0 0 0 0 0 0 0 0 0 0 0 0 0 0 0 0 0 0 0 0 0 0 0 0 0 0 0 0 0 0 0 0 0 0 0
$$ 0 0 0 0
$$ ##$ShimPowRcbType= 3
$$ ##$ShimPowRes= (0..63)
$$ 1e-20 1e-20 1e-20 1e-20 1e-20 1e-20 1e-20 1e-20 1e-20 1e-20 1e-20 1e-20
$$ 1e-20 1e-20 1e-20 1e-20 1e-20 1e-20 1e-20 1e-20 0 0 0 0 0 0 0 0 0 0 0 0
$$ 0 0 0 0 0 0 0 0 0 0 0 0 0 0 0 0 0 0 0 0 0 0 0 0 0 0 0 0 0 0 0 0
$$ ##$ShimPowRng0= (0..63)
$$ 1 1 1 1 1 1 1 1 1 1 1 1 1 1 1 1 1 1 1 1 0 0 0 0 0 0 0 0 0 0 0 0 0 0 0 0
$$ 0 0 0 0 0 0 0 0 0 0 0 0 0 0 0 0 0 0 0 0 0 0 0 0 0 0 0 0
$$ ##$ShimPowRng1= (0..63)
$$ 1 1 1 1 1 1 1 1 1 1 1 1 1 1 1 1 1 1 1 1 0 0 0 0 0 0 0 0 0 0 0 0 0 0 0 0
$$ 0 0 0 0 0 0 0 0 0 0 0 0 0 0 0 0 0 0 0 0 0 0 0 0 0 0 0 0
$$ ##$ShimPowRng2= (0..63)
$$ 1 1 1 1 1 1 1 1 1 1 1 1 1 1 1 1 1 1 1 1 0 0 0 0 0 0 0 0 0 0 0 0 0 0 0 0
$$ 0 0 0 0 0 0 0 0 0 0 0 0 0 0 0 0 0 0 0 0 0 0 0 0 0 0 0 0
$$ ##$ShimPowRng3= (0..63)
$$ 1 1 1 1 1 1 1 1 1 1 1 1 1 1 1 1 1 1 1 1 0 0 0 0 0 0 0 0 0 0 0 0 0 0 0 0
$$ 0 0 0 0 0 0 0 0 0 0 0 0 0 0 0 0 0 0 0 0 0 0 0 0 0 0 0 0
$$ ##$ShimSysFunc= (0..63)
$$ 1 2 3 4 5 7 9 11 15 16 8 10 12 14 6 17 13 18 19 20 0 0 0 0 0 0 0 0 0 0
$$ 0 0 0 0 0 0 0 0 0 0 0 0 0 0 0 0 0 0 0 0 0 0 0 0 0 0 0 0 0 0 0 0 0 0
$$ ##$ShimSysMatrix= 0
$$ ##$ShimSysType= 1
$$ ##$TFXNUM= 0
$$ ##$TRIPLO2= 0
$$ ##$VTU= 2
$$ ##$VTUETH= <149.236.99.20>
$$ ##$VTUTY= <no>
$$ ##$WBREFAM= (0..15)
$$ 135 116 100 100 100 100 100 100 100 100 100 100 100 100 100 100
$$ ##$WBREFLM= (0..15)
$$ 0 0 0 0 0 0 0 0 0 0 0 0 0 0 0 0
$$ ##$WBREFPH= (0..15)
$$ 71.66 -68.25 0 0 0 0 0 0 0 0 0 0 0 0 0 0
$$ ##$WBSGU= (0..15)
$$ 0 0 0 0 0 0 0 0 0 0 0 0 0 0 0 0
$$ ##$XFAC= 2
$$ ##END=
$$ 
##$DECIM=	760
##$DSPFVS=	20
##XUNITS=	HZ
##YUNITS=	ARBITRARY UNITS
##FIRSTX=	24231.369385662510467
##LASTX=	-2084.0185409410978536
##DELTAX=	-0.40154708059210514337
##XFACTOR=	1
##YFACTOR=	0.072622730424667714111
##FIRSTY=	19.451717376708984375
##MINY=	-24.406820297241210938
##MAXY=	7992.7607421875
##NPOINTS=	65536
##XYDATA=	(X++(Y..Y))
24231 267 274 282 286 289 297 310 320 320 309 292 275 265 262 264 265 268 275 288 305 323 335 338 329 313 300 295 296 297 292 282 271 260 246 230 215 206 205 208 210 211 210 207 202 196 195 197 196 186 174
24212 174 170 181 198 209 208 204 206 218 236 254 268 282 294 301 301 297 293 287 279 269 260 254 249 245 244 247 251 249 239 225 208 187 163 136 112 94 84 80 79 80 84 94 111 133 155
24194 155 174 186 191 189 184 182 185 190 190 185 179 176 177 179 186 198 214 229 241 251 254 254 256 264 275 278 271 258 250 252 256 257 252 243 234 226 218 208 199 196 201 214 228 241 253 265 276 284 290 298 308
24173 308 316 313 299 281 265 253 241 226 208 192 186 191 202 208 199 182 167 163 167 175 188 201 209 205 193 181 179 189 207 226 237 236 224 205 184 162 142 123 109 102 104 113
24156 113 123 130 129 125 122 126 135 144 149 151 156 168 185 204 219 232 242 251 261 272 278 276 266 257 255 259 264 264 256 241 223 205 194 189 188 189 195 207 217 219 209 199 196 200 202 197 185 175
24137 175 166 156 148 147 156 167 172 172 175 185 199 213 229 245 257 261 257 251 244 235 220 205 197 200 213 231 252 274 297 315 325 326 319 306 295 289 292 300 309 311 303 287 272 260 252 243
24119 243 231 222 219 221 225 228 227 226 229 240 259 280 298 309 311 303 287 271 263 262 259 252 243 235 224 209 195 191 198 208 217 229 246 268 287 295 291 283 283 297 321 343 356 359 354 344 329
24100 329 307 279 252 234 227 225 219 207 191 180 182 197 220 243 260 274 284 285 272 249 222 200 187 184 186 186 181 173 171 177 192 214 238 257 262 253 238 225 217 216 223 238 253
24082 253 260 258 252 250 253 255 252 245 241 243 250 257 261 261 259 253 243 230 216 201 185 171 159 150 141 133 127 125 126 130 138 152 169 179 172 151 127 110 103 105 116 130 136 132 124 120 120 116 107 98 95 95 95
24061 95 101 115 137 165 199 235 270 296 312 316 307 288 265 244 226 208 191 177 162 145 129 120 121 130 145 159 165 156 141 131 135 146 157 160 152 136 122 119 131 148 159
24045 159 165 169 174 182 191 198 201 204 210 221 232 246 264 285 301 305 304 303 301 297 293 294 295 291 280 268 258 249 237 225 212 201 191 184 184 191 201 215 234 255 270 274 269 260 252 247 242 238 240
24025 240 251 263 269 262 248 235 226 220 217 213 206 200 202 214 231 242 238 224 208 198 194 196 203 212 217 211 199 187 181 176 169 162 158 159 159 159 159 159 160 160 155 139 111 75 38 9 -11 -24 -30
24005 -30 -31 -25 -9 17 50 79 100 116 131 143 153 164 178 192 204 210 206 188 159 128 104 88 78 70 66 64 64 70 85 107 123 126 121 119 127 139 147 145 134 125 125 139 159
23988 159 177 187 191 189 179 162 142 129 131 141 149 144 126 105 92 89 93 101 110 121 132 141 148 154 158 166 183 210 239 257 258 243 219 194 173 159 154 155 162 174 193 219 243
23971 243 260 264 260 252 244 237 228 220 214 216 225 241 259 279 299 318 327 318 292 257 221 184 145 110 93 93 100 102 104 116 145 186 225 250 255 238 209 182 163 155 155 160 167 173 178 188
23952 188 200 209 208 195 175 157 149 156 171 186 196 199 197 192 191 198 208 213 210 204 202 200 190 177 165 157 149 138 128 120 113 106 99 97 105 127 162 203 236 249 242 219 191 169 157 152
23934 152 155 167 187 203 206 207 221 250 278 289 289 290 296 298 289 271 249 227 211 207 221 248 280 305 317 315 300 274 242 216 203 197 189 171 146 121 105 99 102 107 108 104 99
23917 99 96 98 104 116 135 151 157 148 132 116 104 95 92 94 99 104 107 109 114 126 144 160 160 140 108 84 79 93 115 135 150 153 144 123 97 75 64 65 77 96 115 125 120 106
23899 106 93 88 93 104 117 128 135 138 141 137 123 99 79 72 81 104 136 173 209 234 243 237 223 207 192 177 161 147 142 147 157 165 168 169 175 187 200 207 206 205 207 208 198 176 148
23881 148 126 111 105 106 115 129 144 157 165 171 184 211 246 272 281 280 279 279 277 275 276 281 286 291 297 301 291 264 231 205 192 187 183 179 175 173 169 163 154 149 156 176 199 209 195 161 122 93
23862 93 84 95 120 149 175 193 205 211 210 197 177 156 137 126 123 129 139 150 163 178 185 177 156 135 125 123 124 129 139 151 162 174 191 214 235 247 244 222 186 154
23845 154 138 133 130 124 118 116 116 116 117 115 100 76 61 72 106 142 161 159 139 113 95 91 98 110 128 152 174 190 196 198 198 196 191 185 173 152 126 108 103 108 119 133 152 169
23828 169 175 170 158 145 133 124 126 141 159 166 162 156 155 157 156 154 159 176 199 218 226 225 224 225 224 215 195 174 163 165 178 195 212 223 227 222 206 175 129 81 49 44 65 103 149
23810 149 197 233 249 246 235 222 209 198 195 200 204 197 185 180 185 191 190 184 186 202 230 261 285 295 286 264 237 213 191 162 121 75 36 15 12 22 33 35 23 5 0 21
23793 21 60 99 127 148 168 187 204 217 227 230 222 208 194 184 175 165 158 159 167 174 174 167 154 140 125 115 112 118 130 138 137 120 96 78 78 96 126 157 179 183 167 140
23776 140 119 113 117 121 124 130 138 143 143 136 119 89 58 41 45 60 72 81 94 113 135 150 158 161 158 150 138 127 125 134 148 161 173 187 203 209 201 185 173 172 181 202 231 257 264
23758 264 249 226 210 203 201 202 207 214 219 219 212 197 176 156 142 134 130 133 144 163 186 211 239 268 291 304 308 303 287 260 229 206 200 207 213 205 184 158 135 115 96 80 72
23741 72 72 78 88 103 118 127 124 113 93 67 42 33 48 80 112 136 150 157 156 149 142 139 137 131 119 101 86 81 90 110 128 140 148 156 164 173 183 191 194 187 175 165 159 156 157 163 174
23722 174 187 197 206 213 220 221 211 194 177 173 185 202 216 225 238 256 274 282 280 279 283 288 289 284 277 266 249 232 226 232 237 231 215 201 189 170 138 105 86 84 95 113 137 162
23704 162 182 193 200 205 209 213 219 227 231 226 211 190 171 165 179 208 247 286 319 344 358 362 358 347 332 312 292 275 263 260 265 274 284 288 284 271 252 233 220 219 227 238 243 234
23686 234 211 183 162 149 138 126 115 109 103 99 102 119 145 175 200 218 223 216 202 192 187 180 165 145 129 120 116 117 119 118 107 92 85 91 103 110 106 97 95 107 130 153 160 144
23669 144 111 78 62 71 102 145 187 220 238 242 235 220 201 185 177 173 162 139 107 83 80 97 120 134 135 127 116 101 83 71 74 96 132 174 208 225 223 206 185
23653 185 166 151 141 137 139 146 156 168 178 185 185 183 185 195 211 225 232 231 226 216 203 186 169 152 136 119 104 89 73 54 38 34 52 88 128 157 168 163 150 137
23637 137 126 119 115 115 116 118 123 140 168 202 230 246 252 255 254 244 217 176 132 97 76 65 56 48 48 60 80 96 101 97 94 101 117 136 155 174 195 219 246 272 291 302
23620 302 308 315 319 313 298 280 265 255 252 257 268 276 272 249 212 170 137 120 120 130 140 146 146 136 119 103 99 108 124 137 147 158 170 184 198 214 232 258 290 318 332
23604 332 325 305 278 246 209 173 149 143 152 172 194 210 216 215 214 217 222 227 230 232 231 225 213 193 165 133 109 104 115 137 167 206 253 297 331 353 367 372 363 333 286 236
23587 236 197 182 190 208 221 220 206 186 168 158 160 172 187 200 211 219 227 234 238 237 226 204 175 146 117 93 80 77 73 61 40 16 -8 -33 -50 -56 -52 -44 -29 -2 36
23570 36 77 112 142 167 185 192 190 183 174 169 169 172 175 178 189 205 211 201 182 174 185 207 230 243 246 238 221 198 176 161 152 144 132 119 113 117 124 123 118 121 136 157 174 183 186 187 187
23552 187 191 199 214 236 262 285 299 301 297 289 276 260 247 238 228 211 189 168 155 151 158 173 192 208 219 220 212 202 198 208 224 240 254 273 294 313 324 327 325 319 316 316
23535 316 316 315 310 299 278 247 212 184 168 160 159 164 174 186 196 204 211 215 218 225 235 243 244 235 220 198 170 142 119 99 84 77 79 81 77 71 74 87 103 110 108 99 90 86 90 99 107 110 115
23515 115 127 142 154 159 159 156 152 150 150 149 141 126 110 96 86 81 82 88 91 87 76 66 64 76 97 118 134 151 173 197 213 211 194 172 160 169 202 247 286 303 297 275 244
23498 244 211 183 167 162 162 159 153 147 140 133 125 118 112 108 109 113 118 116 107 97 93 99 115 137 158 174 188 206 229 245 244 229 215 211 214 214 206 192 178 169 169 177 188 193 191 181 168 154
23478 154 146 147 160 180 198 209 215 223 235 244 242 236 237 250 265 271 272 277 284 281 260 227 196 177 167 163 164 171 185 202 217 228 238 251 265 275 271 252 225 196 173 160 160
23461 160 168 178 183 180 172 162 149 132 111 92 78 71 72 82 102 123 137 137 127 108 77 41 14 11 31 58 78 86 92 107 132 154 159 149 140 143 151 154 150 148 154 167 182
23444 182 198 215 231 243 249 253 255 258 263 273 283 289 292 293 297 305 311 309 297 276 251 228 213 211 222 239 251 257 261 269 276 275 260 235 207 184 172 173 186 203 214 213 205 197 190 179
23425 179 163 150 152 170 190 202 204 201 194 180 158 129 103 91 96 108 116 119 123 132 139 136 132 134 140 138 123 102 84 76 80 98 124 148 158 153 144 139 137 130 120 116 127 141 141 127
23407 127 112 110 116 118 107 92 86 92 111 134 153 164 172 177 176 162 137 114 102 97 92 86 86 95 108 117 119 119 123 133 145 154 161 167 173 179 192 213 235 249 254 258 265 273 275 274 278 291 303
23387 303 304 289 266 242 221 206 202 210 232 261 291 316 329 325 306 276 246 224 216 222 236 249 255 255 250 245 241 246 261 280 293 293 284 276 273 274 275 270 262 249 231 210 189 181 187
23369 187 201 211 209 196 176 151 126 111 113 129 151 169 177 176 165 143 115 94 92 105 121 132 141 155 169 174 168 161 166 181 194 192 174 147 122 104 88 71 54 45
23353 45 44 48 47 45 43 43 44 49 63 83 100 106 105 102 103 106 106 102 94 84 78 83 99 122 144 158 158 146 128 114 108 109 112 113 111 109 108 111 121 138 161 180 192 199 205 210 210 207 205 204 200 188
23332 188 171 158 157 166 177 181 175 163 152 143 140 144 158 176 193 206 215 219 215 203 186 166 143 117 97 89 95 112 132 148 155 155 153 153 150 140 122 98 73 53 42 44 60
23315 60 90 128 163 184 191 189 188 186 178 167 157 153 155 165 187 216 241 252 245 223 193 159 122 93 80 88 106 118 113 96 83 85 102 125 149 174 203 228 238 225
23299 225 196 168 152 149 151 154 151 143 132 123 120 122 126 128 127 117 98 75 53 41 42 54 69 78 82 87 92 96 101 112 131 143 138 124 115 122 147 181 217 243 250 243 232 223 219 221 231
23280 231 245 255 256 252 246 239 229 213 189 163 143 135 135 135 134 140 156 171 173 163 147 127 104 81 60 46 43 53 78 111 149 188 221 238 234 219 209 212 222 234 247
23264 247 260 266 261 247 227 206 187 173 160 142 114 85 67 60 55 47 38 33 30 26 26 37 59 85 108 129 155 181 196 193 179 172 183 209 235 249 252 252 256 260 256 242 223
23246 223 208 194 176 157 143 142 155 178 202 215 210 193 182 182 191 200 203 197 183 166 158 167 188 210 224 228 222 207 185 162 140 116 89 60 35 18 13 19 35 55 74
23230 74 93 119 154 191 218 227 225 224 226 226 217 204 193 190 189 185 174 154 129 102 78 62 60 73 93 108 112 106 95 87 88 98 109 115 116 120 133 152 166 169 164 157 157 166 179 187
23211 187 187 182 177 173 172 178 191 203 205 199 193 194 203 216 228 236 244 255 267 270 259 238 219 203 186 168 158 165 184 206 227 241 242 230 212 197 183 168 154 155 172 196 215
23194 215 223 222 218 214 208 198 182 163 142 123 103 81 63 51 49 54 69 93 126 163 197 220 229 225 213 197 177 154 134 126 132 149 167 180 183 177 168 165 171 187 209 233
23177 233 256 273 279 277 270 259 243 224 211 213 228 244 251 248 238 223 206 190 174 158 145 144 158 176 181 167 143 120 105 100 113 147 191 231 259 275 280 276 261 243
23161 243 227 217 216 221 226 224 214 201 192 191 193 189 171 141 108 87 77 63 34 -3 -33 -48 -52 -46 -32 -11 10 29 49 79 115 148 173 183 179 161 138 118 105 95
23145 95 90 97 120 150 175 186 181 168 162 175 208 244 265 269 264 258 251 237 217 193 167 142 125 119 123 132 144 157 164 158 139 115 97 86 84 88 96 101 101 97 94 99 114 134 153
23127 153 161 156 141 121 100 77 52 30 15 11 24 54 92 124 139 139 132 123 110 92 70 54 50 62 86 117 142 151 142 120 97 81 77 84 98 110 118 126 133 135 122 99
23110 99 77 71 80 94 102 103 105 121 155 198 237 263 278 286 287 281 272 267 263 260 255 250 250 251 251 246 234 217 199 181 157 129 104 89 82 78 76 81 92 101 106 110 118 135 158 186 212 230
23091 230 247 270 299 327 347 359 359 346 319 289 258 226 197 182 185 196 199 187 165 144 129 123 128 140 152 163 179 202 224 233 224 206 190 178 167 150 130 109
23076 109 88 67 52 46 43 34 12 -15 -39 -52 -56 -52 -42 -24 1 38 80 111 120 111 99 91 85 78 67 53 43 43 58 83 109 129 144 152 149 133 114 104 108 127 153
23059 153 181 209 235 253 256 239 209 176 145 116 94 84 89 104 124 150 180 207 223 228 224 216 211 211 214 216 216 217 223 229 229 222 211 197 181 167 160 155 146 133 122 114 108 103 102
23041 102 110 124 139 152 167 188 212 235 249 251 246 236 220 199 177 164 161 161 162 163 165 166 168 175 191 213 233 247 250 240 221 196 170 143 114 87 68 61 59 56 48 41 41
23024 41 51 67 85 106 133 164 190 202 195 176 154 140 136 139 147 157 169 177 178 173 170 173 179 181 185 201 226 248 251 237 216 196 179 164 152 146 141 135 129 124 123 128 142 162 177
23006 177 180 174 166 162 164 174 193 210 211 193 168 154 153 156 161 169 182 195 201 201 198 191 184 182 186 189 184 171 157 151 159 182 214 242 255 250 232 209 186 164 145 131 124 126 138 156
22987 156 173 184 190 197 210 228 247 257 251 235 225 232 257 288 314 331 338 337 329 313 292 270 252 243 246 261 275 274 250 212 176 153 142 139 141 147 152 153 152 155 164 177 185 181
22970 181 167 146 128 114 104 95 87 83 84 87 91 96 103 112 117 116 111 111 121 138 152 149 128 100 84 90 114 141 156 156 145 132 120 110 103 105 124 158 189 205 205 203 205 207 201 188
22951 188 176 168 161 154 148 147 156 180 215 249 267 264 248 232 221 217 220 226 225 216 206 203 209 218 227 235 234 222 202 184 177 182 193 206 220 231 236 230 215 200 192 192 192 189 183 178 175 180 199
22932 199 232 269 295 303 296 282 267 257 254 252 244 228 205 178 148 121 102 93 90 91 99 113 128 142 153 155 144 126 117 125 144 166 186 206 223 229 219 200 178 159 140
22915 140 119 95 71 56 53 61 79 102 130 155 174 190 206 222 235 247 258 272 287 305 324 338 335 311 275 240 214 192 167 138 109 88 79 81 92 106 121
22900 121 133 143 156 174 193 205 208 213 225 234 231 214 195 187 190 193 192 184 170 149 127 109 102 103 106 112 123 137 150 160 168 177 184 185 182 177 174 175 183 197 209 212 208 203 205 214 225 232
22881 232 234 229 222 216 213 211 209 205 203 205 208 210 210 210 215 219 214 197 180 173 174 175 176 183 195 202 197 188 180 169 149 126 111 110 117 124 128 127 123 121 125 133 139 135 118 88 59 47 58 82 108 135 170
22860 170 206 227 227 216 207 199 191 185 189 205 223 238 249 260 267 263 243 213 180 154 139 135 143 162 185 205 216 219 218 216 218 229 241 247 244 235 226 215 204 194 189 187 185 183 182 181
22841 181 180 181 186 189 184 171 158 148 144 145 153 168 190 216 241 256 257 248 232 212 192 178 173 168 156 137 124 125 135 143 146 142 135 127 125 135 158 189 221 249 266 269 258 236
22824 236 208 177 147 117 89 65 47 38 35 33 28 12 -13 -42 -66 -76 -70 -46 -9 29 55 67 76 93 119 147 174 199 222 239 246 244 233 223 220 226 230 223 206 187
22807 187 175 173 183 201 218 221 206 182 157 140 132 135 149 170 195 215 219 201 169 143 136 149 170 192 210 217 211 192 170 149 133 118 104 87 69 57 59 77 99
22792 99 116 126 137 157 181 196 191 168 138 115 109 120 141 165 182 188 181 163 145 133 130 129 118 98 75 61 61 73 92 112 126 133 137 141 147 152 153 152 152 154 157 165 178 189
22774 189 193 186 171 153 138 128 127 135 149 164 180 195 205 206 199 194 201 217 232 235 224 209 196 185 173 159 149 154 176 213 256 293 318 330 334 331 323 309 292 278 268
22758 268 259 247 235 226 222 222 226 235 242 238 224 210 212 228 246 253 247 234 220 207 196 190 190 194 200 204 204 196 180 163 149 138 126 113 104 105 119 133 135 123 106 95 91 87 75 58
22739 58 41 27 21 22 30 42 61 90 128 169 199 208 198 181 170 171 180 186 179 156 130 112 108 114 123 129 135 143 154 165 174 178 169 146 113 78 55 49 57 71 86 100 113 126
22722 126 139 152 168 182 189 187 180 170 155 133 109 91 86 91 103 116 123 117 102 86 77 72 68 62 57 51 48 51 63 80 94 103 103 94 79 61 46 36 32 37 50 62 61 47 35
22703 35 34 44 63 86 108 116 105 84 67 63 72 92 121 147 155 136 99 63 41 35 41 51 59 60 55 46 38 33 33 35 39 44 48 48 40 30 28 44 77 112 136 143 140 137 135 125 104
22685 104 76 54 44 43 50 65 87 107 117 119 122 133 150 173 201 230 249 256 256 257 259 252 232 207 188 177 172 168 159 142 113 78 46 24 15 19 36 61 80 81 62 34
22668 34 8 -13 -32 -46 -53 -53 -52 -50 -46 -39 -27 -14 1 21 42 60 75 90 103 110 109 102 94 84 73 65 68 82 102 121 133 139 146 159 180 205 227 241 249 256 263 270 271 264 251
22650 251 233 212 182 139 87 43 22 31 61 99 136 162 177 184 188 188 176 152 120 92 70 55 43 32 21 10 3 2 9 15 10 -6 -25 -37 -36 -29 -21 -15 -14 -18 -25 -34 -40
22632 -40 -38 -25 -2 23 49 78 118 165 209 241 258 260 246 222 197 182 178 174 163 142 113 76 35 0 -21 -20 -4 14 22 19 13 18 36 63 92 124 153 171 174 165
22616 165 153 144 135 124 111 103 102 101 91 69 46 34 34 45 61 81 101 119 133 143 148 145 133 114 94 77 66 60 56 52 50 54 60 65 64 64 73 100 143 190 226 240 231 203
22599 203 163 124 97 94 107 122 128 128 130 139 159 187 215 228 220 200 187 190 205 218 220 212 202 194 186 176 165 158 152 141 121 102 91 88 82 70 60 56 57 58 59 66 88 123
22581 123 164 196 215 222 221 210 188 160 132 110 98 101 115 133 147 159 175 196 213 222 223 220 212 201 191 186 191 205 227 247 258 259 253 245 233 221 217 221 224 219 211 206 202 195
22563 195 179 161 147 140 137 132 121 110 109 123 145 158 155 142 127 117 113 113 115 119 120 118 114 116 124 132 128 111 89 75 69 64 59 64 89 129 169 196 210 217 219 219 214 206 197 187 175
22544 175 162 151 147 149 154 163 174 184 191 195 197 188 162 123 86 62 49 40 34 28 23 24 35 57 87 124 167 210 242 257 255 245 229 208 186 168 156 147 143 144 145 143 136 127 118
22526 118 106 96 99 119 148 170 178 176 172 168 160 142 116 89 69 61 64 81 112 152 188 213 227 235 237 232 217 196 179 172 172 172 164 152 146 157 184 221 256 285 309 331
22510 331 347 358 366 374 376 362 333 299 269 240 209 180 165 166 178 192 205 220 238 259 281 301 313 314 303 280 247 210 178 155 138 120 98 82 77 85 101 117
22494 117 128 130 127 125 132 146 161 174 182 185 185 187 200 225 256 280 296 309 324 336 340 335 325 316 312 318 332 344 341 323 299 282 274 274 276 274 262 242 220 204 197 197 201 207 210 205
22476 205 192 177 169 169 170 163 149 133 120 110 101 95 91 84 71 51 33 19 10 9 24 55 92 121 133 133 130 126 123 121 117 109 95 80 69 62 58 55 54 58 70 90 116 143 163
22458 163 172 169 163 160 162 165 167 170 173 176 172 164 155 145 130 105 67 25 -13 -39 -52 -51 -37 -10 29 76 118 143 148 143 140 145 150 152 151 155 165 183 206 231 253 267 281 300 322
22440 322 336 335 322 306 289 269 247 228 215 205 195 187 184 187 193 204 220 240 256 265 269 270 270 264 247 222 197 181 179 189 200 206 206 206 206 200 186 173 168 174 183 189 194 202 215
22422 215 232 245 247 235 212 192 187 197 212 220 219 214 212 214 215 207 190 168 150 143 147 154 152 136 108 75 37 -3 -41 -65 -71 -63 -45 -17 18 53 75 83 87 97 112 129 146
22404 146 164 182 199 210 208 193 171 149 127 104 83 72 76 89 100 107 114 124 139 151 152 137 109 78 54 45 50 64 82 96 108 119 129 134 126 106 81 63 63
22389 63 79 100 113 115 112 114 118 119 116 115 119 127 137 150 163 171 169 158 143 123 96 63 32 14 11 16 20 20 22 31 50 73 96 110 112 102 89 79 78 83 93 107 126 147 164
22371 164 172 173 172 172 173 173 175 187 207 223 220 195 161 129 101 77 57 46 45 50 54 56 56 59 69 84 102 117 126 128 125 122 121 127 142 166 197 226 243 242 228 210 192 171 146
22353 146 120 98 85 81 84 89 97 109 125 142 155 166 177 187 192 185 165 136 111 97 96 101 105 107 108 107 102 92 85 88 103 120 131 131 124 117 114 116 118 119 121 124 123 113 98 85 76
22334 76 68 62 61 67 79 97 119 141 155 159 156 145 118 78 39 16 12 15 22 32 40 31 2 -33 -61 -77 -85 -84 -74 -57 -36 -12 13 41 67 91 111 125 135 146 159
22317 159 168 166 153 135 122 120 129 150 175 193 202 202 201 202 207 217 229 241 254 270 283 284 270 245 219 196 174 157 150 155 164 170 170 166 159 145 120 89 65 55 57 60 55 46 43
22299 43 52 69 82 86 83 83 94 118 151 187 217 236 240 232 219 207 194 171 136 98 72 66 73 87 99 106 110 114 119 125 127 125 127 138 154 166 170 171 172 168 158 146 136 126 113
22281 113 98 82 69 63 70 92 122 146 162 174 188 203 213 218 218 216 215 218 222 227 231 230 219 194 164 141 132 131 128 119 107 95 86 85 98 120 138 146 148 145 136 121 102 84 69
22263 69 61 65 84 111 132 140 136 121 96 73 67 90 133 176 204 219 229 239 245 244 235 224 216 214 214 207 191 170 154 147 147 150 156 166 177 184 181 170 153 139 136 149 168 181
22245 181 181 171 161 159 167 181 194 198 191 179 172 173 179 183 182 178 173 171 167 160 149 143 148 166 190 208 215 211 204 198 195 195 199 211 231 260 294 327 349 355 350 343 338 328 305 269 228 190
22226 190 159 133 115 105 99 92 79 64 52 51 58 67 71 74 78 82 92 112 144 178 201 209 208 207 209 212 218 224 230 234 234 229 218 208 205 211 215 212 207 209 217 223 220 213 214 227 246 261 263 251
22206 251 230 201 166 130 99 76 57 40 27 27 42 64 76 75 69 73 90 111 123 123 116 111 115 131 153 172 180 182 193 217 248 276 299 317 330 335 337 340 342 340 332 320
22189 320 303 278 247 215 188 164 145 135 135 139 140 135 124 112 103 105 126 162 204 241 265 272 267 262 269 288 311 326 333 340 353 374 396 407 403 389 372 361 355 351 344 335 322
22172 322 303 282 265 258 262 270 275 275 274 274 269 253 228 203 192 194 201 201 194 191 196 211 232 258 288 316 332 333 328 324 325 323 315 303 295 295 302 311 317 312 293 259 219 189 177 179 178 165
22153 165 146 133 133 140 147 153 159 168 176 178 169 153 137 129 135 145 149 141 129 127 138 152 163 173 192 225 267 312 348 367 362 338 307 276 250 232 226 227 223 210 197 194 195 192 181
22134 181 169 159 151 146 149 157 163 160 153 152 157 162 161 157 156 162 168 163 143 122 115 128 152 171 178 178 176 178 183 189 193 199 212 231 246 247 232 206 180 158 137 114 94 90 111 147 178 188
22115 188 181 166 149 130 106 75 40 12 2 12 25 28 20 11 8 7 2 -4 0 17 44 67 79 83 89 103 119 133 142 149 152 154 159 172 186 188 173 150 136 130 121 99 73 59
22098 59 63 77 91 101 108 108 103 106 122 148 170 184 196 213 230 238 232 216 198 184 179 184 194 207 219 224 219 208 200 198 197 191 180 170 163 161 164 173 181 185 186 187 189 188 184 182 183 185 186 189
22077 189 194 201 206 206 202 202 212 229 238 227 202 182 178 185 192 199 210 221 224 212 187 158 139 139 158 183 203 213 214 212 212 219 235 250 254 244 224 202 185 175 172 172 174 175 173 168
22059 168 160 156 159 162 156 138 117 104 98 93 83 71 64 67 78 88 90 85 76 67 56 47 44 53 69 82 87 87 88 94 101 105 106 107 108 108 107 111 124 144 163 172 168 156 142 132 126 124 128 135 142 144
22038 144 141 136 135 139 147 159 176 190 194 192 195 207 220 223 213 196 180 165 148 130 114 106 108 119 136 158 179 190 186 172 164 172 196 224 241 239 217 189 173 180 204 228
22021 228 238 235 225 217 214 216 215 206 191 175 159 135 101 68 53 63 91 125 158 192 227 265 299 319 320 299 260 211 163 124 101 96 109 137 175 215 252 284
22006 284 304 306 290 268 249 235 223 215 217 228 240 245 246 248 253 259 268 280 289 290 285 276 260 232 195 160 135 122 120 129 147 163 171 169 165 166 177 200 234 269 297 311 309 290
21988 290 261 236 221 214 206 199 197 204 215 219 211 194 172 150 136 139 157 177 184 169 142 123 125 144 164 171 169 170 178 189 196 201 205 202 183 151 121 103 93 82 68 55 43
21971 43 36 39 55 76 89 94 103 123 148 167 178 181 171 147 115 90 76 73 81 103 131 151 159 160 163 165 162 157 159 173 194 216 233 240 228 196 153 112 86 79 86 98 109
21954 109 114 112 106 102 105 118 138 162 188 216 245 273 294 302 295 276 255 236 222 213 207 204 203 202 200 192 179 162 150 151 168 196 222 236 234 222 211 208 216 232 251 267 281
21937 281 295 306 307 296 282 272 267 254 225 189 161 153 166 196 232 263 282 289 284 267 236 197 163 144 141 144 147 149 153 164 176 188 201 214 222 218 205 191 185 187 189 187
21920 187 179 162 141 126 124 134 150 167 183 195 197 191 181 169 159 153 153 156 159 160 159 158 156 155 159 167 172 166 148 125 108 105 118 138 160 180 201 221 233 236 235 237 244 252 259 259 249
21901 249 234 220 212 207 205 204 209 219 232 246 256 257 255 254 256 255 241 216 191 179 184 204 229 246 246 231 212 202 202 205 198 175 142 115 108 123 147 168 186 202 217 228
21884 228 234 237 238 235 229 226 236 254 269 269 252 227 205 194 198 208 213 207 197 195 203 212 213 211 214 230 252 272 283 288 288 281 270 260 257 258 255 243 228 218 214 215 220 236 261 290 311
21865 311 323 325 321 317 318 318 309 281 238 190 146 115 104 110 123 131 133 142 167 201 231 245 250 256 269 286 300 308 314 322 326 320 301 278 261 255 258 266 269 265 254 239 220 200 179
21847 179 161 144 126 109 104 121 160 208 246 261 256 241 227 213 196 178 168 170 179 191 198 196 182 161 142 129 120 113 109 109 114 120 127 136 147 163 184 209 227 232 224 210
21830 210 203 205 210 214 214 207 191 165 138 120 112 107 103 102 106 110 104 92 79 70 63 64 81 109 136 151 152 145 135 131 136 151 169 186 201 214 223 231 243 261 277 287 292 297 299 294 283
21811 283 267 244 217 197 194 200 204 204 209 218 224 218 206 200 203 212 224 237 252 264 271 273 272 274 275 269 251 227 208 198 196 197 194 184 168 151 138 131 131 134 141 149 160 179 208 241 266
21792 266 276 268 248 223 199 181 166 155 145 140 140 142 144 147 153 166 182 198 207 208 200 185 167 152 147 149 151 147 141 141 146 147 140 133 137 154 170 177 174 172 178 193 214 238 266 298 325
21773 325 341 347 345 337 320 300 286 280 277 269 253 236 217 196 175 165 172 192 212 219 206 180 153 136 130 129 130 130 133 135 134 127 122 126 140 157 173 188 202 212 216 218 221 222 221 222
21755 222 227 231 226 217 215 221 230 238 249 265 277 273 254 229 212 210 225 247 260 254 240 231 235 246 258 270 283 295 306 311 305 281 248 223 214 215 212 201 189 180 173 164 150 132 118
21737 118 118 131 147 161 171 176 174 162 149 147 154 159 153 144 146 167 201 231 243 229 195 151 105 62 29 12 11 16 19 20 23 36 58 90 129 172 208 233 249 263 277
21720 277 286 287 278 259 232 201 170 142 117 94 79 79 92 111 130 143 144 131 113 104 113 137 162 181 195 205 209 202 180 149 115 86 68 64 76 99 126 152 175
21705 175 195 212 224 229 227 211 175 124 76 48 41 38 26 4 -15 -23 -11 19 58 90 104 103 100 101 108 117 129 141 151 152 146 138 135 139 148 156 160 157 147 136 126 115 100 85
21687 85 77 81 96 114 129 138 142 142 140 132 120 106 98 98 107 119 128 135 144 153 162 167 167 166 167 170 170 167 159 152 145 139 134 132 135 140 140 134 124 118 118 123 129 139 153 167 172 163 144 124 113 115 125 136
21665 136 144 153 164 181 197 206 201 183 156 130 115 116 135 166 197 220 230 233 232 227 218 210 210 217 230 245 260 265 253 226 194 167 147 130 115 102 96 97 108 123 136 146
21649 146 156 165 160 134 90 45 11 -11 -24 -27 -19 0 28 62 96 124 141 148 147 143 135 124 109 92 78 73 76 82 89 97 111 133 156 171 175 167 153 140 137 147 163 172 165
21631 165 147 131 124 130 148 175 202 220 231 239 252 265 271 266 250 225 197 171 154 143 129 111 97 100 119 146 169 176 162 130 91 61 55 75 113 157 192 207
21616 207 200 182 166 156 150 144 136 126 118 114 114 119 129 144 160 175 188 203 225 250 267 263 241 212 194 190 196 202 201 193 183 179 185 196 204 210 219 233 246 251 246 234 218 202 193
21598 193 195 205 216 223 228 233 236 236 231 223 213 203 197 194 195 197 203 213 223 228 227 223 215 201 178 148 114 77 37 1 -24 -37 -43 -46 -43 -26 5 44 78 97 101 102 109 119 122 108
21580 108 78 43 18 11 23 42 57 65 71 82 95 106 115 120 118 107 92 85 84 78 63 51 55 74 90 92 81 68 57 51 49 54 67 86 108 129 148 164 177 188 196 202
21563 202 211 228 251 272 283 281 266 246 229 218 209 200 192 186 187 192 199 204 205 202 194 181 166 153 145 140 133 124 118 124 140 157 173 188 206 221 225 218 204 195 198 216 244 269 274 257
21544 257 228 202 185 169 150 137 140 161 188 212 237 263 285 292 279 250 212 175 146 134 140 158 179 199 216 226 227 217 198 176 158 148 148 152 155 156 155 153 148 143
21528 143 142 149 156 154 137 111 87 73 69 72 81 94 111 130 148 162 171 170 160 149 145 154 167 172 166 153 141 132 129 138 159 185 201 201 189 175 166 164 171 188 208 220 222 222 231 250
21510 250 273 288 291 287 283 281 273 249 210 172 155 163 185 200 195 170 136 104 78 57 47 53 78 114 145 164 177 194 213 226 231 232 236 243 247 247 244 241 237 226 208 188 171
21492 171 160 151 141 130 119 108 102 103 114 132 152 168 174 162 137 112 102 107 117 123 122 113 99 88 96 123 154 169 169 173 192 216 233 245 261 279 283 258 211 161
21476 161 125 107 98 93 89 85 83 84 86 82 71 58 52 60 78 99 118 134 148 162 175 189 206 225 242 251 253 252 250 244 232 217 203 193 180 160 137 116 103 99 98 101 106 116
21459 116 125 132 137 141 145 147 145 140 139 147 165 190 215 236 250 258 258 245 218 186 163 155 160 167 170 165 154 148 154 176 206 229 236 224 200 175 159 159 168 177 181 179 175 166 148 124 102 85
21439 85 69 50 29 14 13 25 45 64 80 95 111 129 141 145 141 133 121 109 99 96 97 100 103 110 120 130 138 148 158 162 157 144 132 121 110 98 91 93 108 134 163 188
21423 188 205 218 231 240 235 219 207 210 220 226 222 216 209 200 186 169 154 141 132 127 133 149 170 185 193 196 203 212 214 206 191 177 163 145 123 103 92 93 104 121 143 167 188
21405 188 198 189 166 142 127 116 106 99 106 128 155 177 190 193 188 182 177 171 159 146 141 147 157 165 174 186 194 189 174 160 156 162 179 199 210 202 180 154 131 111 99 96 98 99
21388 99 95 92 90 90 89 94 110 131 149 158 161 163 169 177 184 186 182 183 197 226 260 286 298 298 287 268 240 211 193 191 200 209 209 200 183 166 154 149 141 122 90 52 21 0 -11 -17 -17
21369 -17 -11 3 29 67 109 147 168 169 158 150 156 169 177 173 161 147 134 117 97 79 66 57 50 43 37 40 59 89 117 133 138 136 134 135 139 146 150 149 144 140 140 142 143 141 134 124 114 111
21349 111 118 132 148 160 169 173 171 164 154 144 137 132 127 123 125 134 149 163 174 178 175 164 148 131 118 112 116 127 141 152 159 165 177 192 203 200 186 172 168 180 205 241 281 313
21332 313 325 312 284 248 210 174 149 136 133 131 128 127 124 118 108 93 74 56 42 36 33 28 25 35 61 97 128 144 148 146 150 161 174 183 186 187 191 199 211 223 233 239 242 241 234
21314 234 222 207 194 180 159 132 108 95 96 107 122 137 149 157 159 157 156 159 167 176 184 189 190 184 169 152 142 147 161 172 173 166 159 157 157 152 140 131 130 137 141 138 132 129 127 125 125 133 150
21294 150 169 183 188 186 179 170 162 159 164 175 184 190 193 195 193 185 176 169 166 164 158 152 150 154 163 179 199 216 219 204 176 146 124 116 118 124 131 144 161 177 181 168 146 125 110 97 83 69
21275 69 58 52 53 60 76 98 121 140 152 159 161 159 152 148 151 161 170 173 166 155 144 135 129 126 128 139 157 174 180 179 179 183 186 177 157 131 110 97 96 105 121 132 133 125 119 125 146 175 205
21255 205 231 250 256 249 237 234 249 278 303 312 302 281 263 252 251 254 257 256 248 238 235 244 259 266 263 254 248 243 233 220 210 205 197 181 157 130 106 92 89 93 95 88 75 67 69 80
21237 80 95 111 126 135 138 135 130 131 145 172 203 226 239 246 252 255 252 242 223 198 173 158 156 163 171 179 188 196 199 196 189 182 178 180 189 202 210 213 216 226 243 262 276 280 280 282 289 293 288 275
21217 275 265 261 257 248 231 208 180 150 124 108 103 107 115 123 130 142 166 200 230 246 252 256 261 260 247 227 205 188 179 181 191 199 206 215 230 238 231 207 180 160 145 128 106 81
21199 81 63 59 68 78 78 64 45 35 47 77 108 124 125 125 140 169 199 216 220 214 201 181 152 117 84 63 60 69 80 89 95 100 104 104 102 99 97 93 83 67 49 42 51 73 99
21181 99 120 138 153 167 180 191 200 204 201 193 182 164 133 96 61 35 15 -3 -16 -16 -3 12 22 29 41 60 81 95 98 96 96 107 123 133 126 108 94 94 105 117
21165 117 123 122 117 112 107 104 106 114 131 152 171 187 203 220 238 255 270 286 300 307 305 291 271 250 230 212 194 174 154 134 116 105 101 103 102 92 76 60 49 43 49 72
21148 72 112 160 201 230 250 268 286 304 315 313 295 268 241 226 226 235 247 261 275 288 299 305 303 297 290 283 281 286 298 309 306 288 266 254 254 255 246 225 197 173 164 169 180
21131 180 180 166 148 142 154 179 204 222 230 233 236 243 253 265 280 296 307 312 314 318 322 328 339 353 363 360 345 330 319 309 296 284 274 262 247 239 240 242 230 203 173 149
21114 149 131 114 97 83 78 88 107 127 140 144 147 150 154 160 171 179 180 176 176 182 186 182 175 170 166 159 150 142 133 124 118 118 122 128 137 147 152 147 133 120 112 109 112 124 146 171 193 213 235 260
21094 260 282 294 294 281 259 234 215 209 214 223 233 241 247 251 255 262 272 277 273 267 265 266 260 246 236 241 258 271 270 258 247 244 250 261 275 294 314 331 341 339 325 302 274 249
21076 249 232 225 224 227 230 229 223 216 210 204 197 189 181 173 165 158 159 169 181 187 185 182 183 187 191 194 190 178 163 151 149 154 161 168 184 211 245 266 265 254 248 254 256 238 204 175 169 181 192 191 176
21056 176 160 149 150 162 181 202 214 209 188 160 139 128 124 120 116 114 115 114 108 102 106 126 155 185 213 237 252 253 242 227 214 199 182 166 158 158 158 154 149 146 146 147 146 142 134 125
21037 125 120 125 138 149 146 128 105 90 83 79 79 90 111 133 147 158 171 184 192 192 184 171 155 143 142 151 162 171 178 184 181 168 151 142 142 145 148 156 172 194 214 227 232 235 238 242
21019 242 246 251 260 270 279 283 280 269 250 232 218 204 181 149 117 95 81 71 64 62 59 55 53 63 81 92 88 76 71 76 85 90 88 86 87 93 100 105 107 107 108 110 110 109 106 98 86 78 80 94
20999 94 110 120 125 132 141 146 145 141 135 126 117 110 106 97 81 64 59 67 77 79 70 55 34 7 -23 -50 -64 -60 -40 -11 22 58 94 125 143 146 138 123 102 81 66 57 49 35 19
20980 19 11 18 39 67 88 98 97 94 96 103 110 112 112 114 125 140 147 141 129 126 140 165 189 206 214 203 172 134 109 111 136 174 211 240 255 264 269 273 268 256 243 232 227 226 228 229
20962 229 230 234 246 263 273 267 254 246 249 257 260 255 246 238 228 215 200 191 191 196 196 189 182 183 189 194 196 197 199 197 193 188 186 190 197 204 207 203 198 197 197 193 183 174 176 192 221 255 284 296 287 261 232
20941 232 207 176 127 63 7 -17 -12 5 21 32 40 46 47 45 45 48 54 60 61 54 40 33 39 54 66 75 92 123 161 194 217 232 237 229 209 189 179 180 187 193 196 198 198 198 201 202 195
20922 195 177 148 115 84 60 44 36 34 34 38 47 62 79 93 103 107 109 110 114 124 135 142 145 152 168 192 217 238 249 248 234 211 185 160 138 118 100 89 87 95 113 138
20905 138 166 188 200 203 200 192 177 158 144 139 140 138 129 112 92 72 56 49 55 72 96 119 137 152 168 189 208 218 216 207 196 183 168 156 152 157 166 173 179 187 201 218 236
20888 236 252 262 270 279 288 291 285 268 247 228 209 191 174 168 181 211 243 264 269 267 263 256 236 206 175 154 144 144 147 149 144 134 124 124 134 147 161 176 192 205 212 213 213
20870 213 213 215 221 227 228 217 195 169 143 118 94 71 52 43 53 79 109 129 139 148 158 166 168 164 152 128 99 74 65 70 81 91 97 95 83 67 59 63 77 91 100 106 115 131
20853 131 146 152 147 135 124 116 112 115 126 144 171 206 244 273 286 290 297 307 316 322 327 327 316 290 259 235 219 204 188 177 178 190 199 194 179 167 170 185 202 213 218 221 226
20835 226 235 246 259 271 280 286 292 303 321 341 353 351 338 318 298 286 284 287 286 277 263 248 225 192 155 129 115 105 95 94 111 140 167 183 187 180 168 160 161 171 182
20819 182 186 185 188 201 223 247 265 271 268 262 259 260 266 275 285 288 283 269 254 250 260 274 271 242 193 140 96 66 55 66 94 127 156 179 194 196 183 157 130 112 111 126
20802 126 146 159 161 157 156 159 162 166 173 186 202 215 220 218 217 220 223 222 220 218 216 212 210 219 235 248 246 237 233 238 246 251 254 255 249 233 211 194 186 185 184 179 166 145 120 91 64 45 43 60 87
20782 87 115 136 144 138 119 95 73 58 52 56 69 84 102 121 146 173 197 217 231 238 234 220 207 196 184 164 140 121 111 109 111 112 112 112 115 121 125 120 107 93 83 75 69
20764 69 71 81 96 111 126 148 176 205 228 244 256 262 257 239 214 194 183 179 172 156 136 120 114 120 136 160 184 201 206 199 184 170 166 176 190 193 175 139 96 56
20748 56 24 8 12 31 59 84 102 110 108 98 88 83 88 104 128 151 169 181 187 190 188 177 156 125 97 80 77 82 84 80 72 62 51 41 41 53 73 91 106 123 141 152
20731 152 149 134 121 123 143 171 191 191 175 158 154 166 188 213 236 253 260 262 263 266 262 242 208 168 133 112 112 129 148 155 150 147 156 174 196 214 221 214 200 195 204 214 208 193
20714 193 189 209 242 272 291 298 297 294 297 307 316 318 313 305 289 265 238 223 226 238 246 243 236 234 245 267 300 344 397 450 485 492 477 456 435 412 383 352 330 327 344 372
20697 372 398 417 437 465 504 546 581 610 642 681 728 779 832 887 942 1001 1069 1152 1251 1365 1489 1616 1739 1853 1953 2031 2080 2094 2077 2042 2008
20685 2008 1980 1960 1945 1933 1923 1917 1919 1940 1990 2070 2168 2275 2390 2517 2658 2808 2969 3150 3368 3633 3957 4345 4808 5362 6031 6846 7849
20674 7849 9094 10661 12655 15203 18448 22534 27602 33760 41052 49420 58681 68515 78479 88023 96527 103362 107993
20667 107993 110058 109415 106138 100503 92972 84135 74628 65041 55859 47440 40004 33639 28322 23960 20420 17558 15230
20660 15230 13307 11697 10335 9181 8201 7364 6645 6030 5509 5065 4677 4329 4021 3756 3531 3335 3157 2993 2840 2702 2588
20652 2588 2508 2461 2436 2423 2421 2432 2455 2488 2530 2581 2629 2660 2661 2627 2561 2465 2342 2197 2033 1860 1693 1543 1418 1321 1252 1203 1166 1132 1099 1066 1028
20639 1028 982 933 891 857 820 777 739 717 711 709 702 688 669 646 624 608 597 586 571 555 543 534 529 529 531 530 524 514 504 497 494 494 494 487 472 456 447 442 435 429 434 452 473
20622 473 484 478 461 445 440 449 466 480 484 482 482 489 501 513 522 520 502 470 435 410 401 406 415 428 447 476 508 534 547 549 544 534 514 483 450 423 401 378 352 330 321 327
20605 327 340 356 378 406 435 453 456 457 467 488 511 524 525 520 515 514 514 505 479 441 401 370 348 332 321 318 319 319 318 318 318 313 296 274 259 261 276 296 314 329 340 341 330
20588 330 311 293 282 273 260 239 218 202 193 190 187 183 176 168 166 177 200 229 256 273 280 279 278 285 300 312 311 301 299 317 350 382 399 401 394 391 395 401 401 395 393 407 431 451 460 460
20569 460 458 453 444 434 426 420 416 415 414 404 381 347 313 287 272 266 266 268 272 276 285 296 309 326 346 360 359 340 313 288 269 257 248 240 229 212 189 167 154 157 174 198 223
20552 223 244 257 261 257 246 231 212 195 183 179 179 177 174 173 176 176 173 169 171 179 187 189 185 183 189 207 230 252 267 272 270 266 264 259 245 216 184 161 154 159 170 187 215 255 298 334 353
20533 353 358 357 356 350 326 284 237 199 176 165 162 166 172 172 165 157 153 148 143 142 157 187 223 255 275 281 278 270 264 260 256 253 254 263 269 260 235 210 198 201 207 210 214 227 248 269 283 285 285 295
20513 295 317 342 350 332 295 257 231 219 214 208 194 170 143 124 117 124 138 152 159 159 159 164 175 184 187 188 192 196 197 192 186 184 184 181 177 176 179 182 180 171 161 152 148 148 151 154 156 156 161 177 203
20493 203 232 252 253 236 208 183 167 161 163 170 177 181 180 181 191 210 222 217 197 182 183 200 225 253 282 304 309 295 271 254 252 264 287 315 341 359 370 375 375 370 359 348
20476 348 340 330 314 291 264 239 225 228 246 267 278 275 262 247 233 226 237 262 284 279 249 211 184 169 158 146 141 147 163 183 203 227 255 284 305 312 310 304 297 290
20460 290 283 280 282 285 283 274 263 255 253 252 247 232 206 180 160 150 145 144 146 150 153 154 160 176 201 227 240 234 210 178 151 136 137 152 181 216 247 268 279 284 283 275 262 251 245 245
20441 245 251 262 274 275 261 236 216 209 216 227 236 240 236 222 195 161 127 104 92 88 95 118 155 192 215 220 214 205 192 178 168 170 182 198 213 222 225 225 227 232 233 228 213 192
20423 192 169 155 156 172 191 205 215 225 232 233 227 219 209 197 187 189 206 229 247 254 251 246 244 249 263 278 288 285 270 246 224 210 208 215 223 228 232 234 235 232 223 210 199 197 206 223
20405 223 237 238 220 188 158 141 139 142 142 139 136 132 127 124 129 137 140 133 124 123 131 142 152 158 161 160 158 160 168 177 184 187 185 174 154 125 97 79 73 73 72 64 51 37 28 27 30 34 36 36 32 26 20 18
20383 18 20 27 42 61 78 86 89 101 129 170 217 258 282 284 270 255 254 274 303 329 338 328 305 280 264 258 252 241 228 219 219 225 230 229 221 209 198 186 170 156 153 159 162 154
20366 154 143 140 148 158 158 148 130 109 90 80 77 77 74 71 76 90 111 136 164 194 223 245 251 238 213 190 180 184 198 214 227 234 232 224 214 203 194 186 178 166 153 147 157
20348 157 181 211 238 256 262 252 230 213 219 253 306 356 388 399 397 393 390 383 370 355 345 338 330 314 286 249 214 189 180 187 204 223 232 226 210 195 186 178 161 142 130
20332 130 127 127 125 127 136 147 154 161 167 169 161 145 128 115 106 102 101 100 92 78 64 55 52 52 51 47 46 51 69 101 141 175 197 203 196 181 163 149 141 136 129 124 130 148 174 202 231 260 287
20312 287 305 316 321 322 315 297 268 230 184 135 95 73 72 83 97 105 103 96 88 83 81 76 63 46 31 32 54 90 127 155 177 194 205 207 201 186 164 139 119 107 98 85
20295 85 76 81 104 136 165 188 204 211 213 219 234 256 275 285 287 283 275 260 239 218 208 215 240 270 296 313 326 334 337 327 303 270 237 214 202 193 180 164 157 167 196
20279 196 234 273 303 320 324 325 328 333 335 329 320 313 311 311 311 304 290 271 258 261 278 300 317 326 327 322 309 292 276 265 264 271 282 284 267 235 198 169 151 141 136 137 150 175 208
20261 208 240 264 285 310 336 351 349 336 320 304 286 268 259 261 269 278 288 297 303 302 300 302 310 320 323 311 281 237 197 177 179 191 203 211 217 215 204 193 196 214 230 229 216
20244 216 205 204 210 215 218 218 211 198 187 185 188 187 182 180 189 204 214 215 205 186 167 158 167 189 206 204 190 182 197 232 266 283 277 259 239 221 206 198 201 216 239 257 261 247 221
20226 221 193 176 171 173 175 177 181 186 189 187 184 185 185 180 170 162 161 162 161 158 159 167 181 193 196 188 173 162 163 177 199 216 224 225 223 220 215 210 206 202 193 175 158 154 167 187 204 213 214 203 180
20205 180 151 128 119 121 130 144 159 171 176 175 173 173 174 178 185 191 189 174 151 130 119 125 144 168 184 188 185 184 189 197 204 210 218 230 243 251 245 224 191 152 116 90 81 86 97 104 101 92
20186 92 88 98 119 141 154 160 163 162 152 137 129 134 146 148 141 136 144 162 186 211 237 257 267 267 258 238 208 176 154 151 164 186 212 238 257 268 270 263 246 219 187 156
20169 156 132 119 118 125 139 163 198 240 274 288 284 267 242 212 180 154 135 126 127 136 150 166 179 185 180 165 150 145 148 150 151 159 179 205 228 246 260 268 263 249 238 241
20152 241 254 265 267 255 232 203 175 158 157 168 183 193 197 196 194 193 195 200 206 206 193 168 141 123 117 121 128 134 136 137 140 146 154 163 173 185 198 208 214 216 213 203 184 159 135 119
20134 119 110 105 103 106 110 105 92 83 93 124 163 198 223 236 237 226 209 191 179 175 180 188 193 188 177 159 134 105 81 72 72 68 53 33 22 22 28 36 50 76 110 145 177 204
20116 204 222 227 217 200 184 172 165 159 149 131 105 76 55 45 42 41 37 32 32 44 69 97 118 133 146 160 169 171 168 165 158 147 133 121 111 99 83 69 61 61 70 89
20099 89 117 146 163 163 152 144 145 153 162 166 167 168 170 179 195 216 234 246 250 248 236 218 202 196 199 206 208 198 176 149 128 117 112 104 93 89 100 124 151 173 185 187 182 176 173 172 169
20080 169 171 184 209 241 268 284 286 274 248 209 164 122 92 76 73 80 94 113 131 142 144 139 134 132 139 155 173 189 199 206 211 216 224 239 262 287 306 315 311 298 282 270
20063 270 267 269 271 271 271 271 272 273 275 277 274 261 240 217 201 198 207 220 230 234 229 214 189 164 150 153 163 170 173 177 186 195 199 200 205 215 226 234 236 231 222 216 217 223 226 215 190 161 140 132 132
20043 132 130 124 115 109 110 117 125 132 137 142 144 144 144 148 158 169 175 171 161 152 147 144 141 139 144 160 178 183 170 146 128 124 135 156 187 225 266 303 333 352 356 346 324 298 273 251 233
20024 233 222 217 210 196 177 162 160 170 184 196 207 217 225 228 223 214 205 198 191 180 166 151 138 131 128 133 146 166 188 204 209 204 194 190 198 215 231 237 239 251 279 312 336 338
20006 338 318 281 243 215 203 203 208 212 216 217 213 207 202 197 186 167 146 127 115 108 99 84 68 61 68 80 86 83 82 91 110 137 175 220 262 289 300 302 301 296 282 257 223 189
19989 189 168 164 172 182 188 195 206 220 238 257 275 285 284 277 271 269 269 268 262 250 231 210 191 177 174 181 192 198 196 194 199 211 222 227 226 223 218 216 221 231 244 252 250 238 223 214 214 213
19969 213 205 192 183 183 187 187 183 177 169 157 146 138 134 131 129 128 130 136 146 159 173 186 194 196 194 192 194 195 182 145 92 43 13 6 13 25 38 48 57 69 85 101 115 129 145 161
19951 161 173 181 189 195 196 189 177 161 142 126 114 106 96 84 76 75 73 64 50 40 40 44 50 56 64 74 87 105 132 162 192 220 245 261 263 251 234 221 213 207 197 186 174
19934 174 162 154 155 171 202 236 255 248 220 185 157 137 123 119 131 159 195 229 256 272 273 261 245 235 225 203 168 128 97 81 85 109 144 176 199 218 238
19919 238 252 250 233 213 200 197 202 212 222 228 227 219 202 176 148 129 122 125 131 143 161 180 196 212 232 257 279 294 305 318 328 330 320 307 299 299 303 309 312 305 279 237
19902 237 194 164 149 136 115 83 48 26 24 33 42 47 55 77 110 141 158 163 161 157 151 140 126 113 109 116 134 158 180 196 200 195 189 190 202 218 231 237 232 224 220 226 234 234 223
19884 223 206 184 154 115 76 46 26 12 1 1 13 32 54 80 108 130 136 121 101 94 103 116 113 89 53 17 -12 -38 -55 -55 -36 -6 23 51 81 119 163
19869 163 205 238 255 258 247 227 204 189 184 183 179 168 151 131 111 98 95 102 115 130 143 151 147 133 121 127 154 194 229 249 261 275 293 303 300 285 270 262 268 288
19853 288 317 341 345 330 306 282 260 238 218 200 182 163 149 142 141 144 153 170 189 202 202 196 189 185 180 171 160 154 161 181 206 229 243 246 237 218 194 177 173 185 207 230
19836 230 248 258 258 246 225 206 197 196 197 199 209 229 249 258 256 247 231 211 188 170 162 164 172 182 183 164 126 80 38 12 6 13 19 11 -4 -15 -9 5 17 21 21 19 16 13 16 24
19818 24 32 32 26 23 31 56 90 124 145 148 134 115 104 106 113 119 129 151 184 218 243 255 251 236 217 206 206 210 205 191 178 171 166 161 164 181 206 222 217 199 182 177 182 188 191 188
19799 188 184 179 172 162 149 137 127 120 116 116 118 120 120 122 123 123 123 130 151 185 218 235 227 204 178 158 145 133 118 103 93 91 91 92 94 104 125 151 175 195 212 230 249 263
19781 263 262 243 219 202 197 195 187 179 180 196 216 225 216 197 180 176 188 210 232 246 246 238 228 222 220 221 224 228 229 224 211 199 192 194 202 210 221 235 252 266 275 279 278 274 266 255 245 243
19762 243 256 283 315 339 348 342 324 293 252 207 170 145 135 140 160 188 215 236 252 265 274 277 275 274 279 290 300 302 295 284 274 268 261 258 262 273 284 292 294 288 269 241 221
19745 221 220 228 228 213 192 181 182 187 186 181 180 190 212 240 261 267 253 219 174 129 97 83 83 94 111 129 144 150 146 135 125 120 122 129 140 158 182 205 221 232 243 254
19728 254 261 262 260 258 259 267 281 294 299 292 278 262 246 233 228 231 236 231 211 186 169 166 174 184 189 188 184 182 183 187 194 203 214 227 241 249 246 232 219 211 204 192 179 175 179 189 208 238
19709 238 270 289 289 279 272 269 269 272 278 285 288 288 282 268 246 226 218 223 234 241 233 211 182 158 146 142 138 132 124 118 118 126 144 166 186 204 216 216 204 189 185 196 216 236 254 267
19690 267 274 276 274 269 258 244 231 221 210 196 183 179 180 179 174 167 166 172 184 200 218 236 256 272 273 252 213 169 136 123 130 153 180 201 214 222 228 227 215 194 164 128
19673 128 90 58 42 40 44 45 41 37 40 52 67 79 86 90 98 113 132 152 171 189 207 221 225 214 196 182 181 192 209 227 243 255 257 249 230 201 166 128 98 86 93
19657 93 114 139 158 162 153 145 156 194 244 283 297 293 287 288 289 281 266 253 247 244 236 223 211 207 216 238 263 279 281 273 264 256 251 250 250 251 249 245 238 227 212 201 199 201 196 181 164 150
19638 150 134 110 80 59 55 67 88 115 146 173 188 192 196 210 227 231 213 184 159 144 135 128 124 125 130 136 142 147 154 167 185 196 189 161 125 95 81 83 95 111 124 135
19621 135 146 159 172 186 205 232 261 287 307 322 331 331 322 310 299 294 296 301 304 299 291 285 284 287 289 286 278 270 270 276 278 277 279 289 301 310 319 336 359 378 385 380 363 335 304 281 268
19602 268 257 244 237 242 257 273 286 293 289 269 238 208 186 173 165 159 155 151 148 148 146 139 127 112 100 90 87 95 115 146 181 208 216 202 180 168 172 188 208 229 248 259
19585 259 257 247 238 238 245 257 272 289 308 326 336 334 324 310 296 280 257 226 191 163 152 160 179 199 215 224 226 220 210 197 187 180 179 184 197 215 232 242 237 219 200
19569 200 191 189 189 188 188 196 209 221 230 233 233 231 230 233 234 231 223 212 198 186 180 184 195 208 222 235 247 260 272 279 272 243 201 167 157 172 199 227 247 254 249 236 226 224 236
19551 236 255 273 279 275 267 262 261 259 251 236 223 220 233 255 273 280 276 268 257 247 241 241 247 256 265 274 280 279 273 270 272 278 278 267 246 223 206 201 204 207 209 211 218 225 227 225 225 233 250 271 284 279
19530 279 253 219 190 173 166 163 161 161 161 161 160 159 158 161 171 184 195 200 204 211 220 236 264 304 344 367 359 328 285 246 219 206 207 215 226 234 236 233 230 235 250 272 295 313 321 321
19511 321 315 308 297 278 248 215 188 169 156 148 152 171 192 199 188 173 174 193 218 238 251 264 275 275 263 246 233 232 241 254 265 270 272 276 284 293 298 297 290 277 253 218 181
19494 181 155 146 147 149 147 143 140 133 120 105 96 95 101 108 115 118 115 111 110 111 112 115 126 144 157 158 148 137 127 123 130 149 172 186 186 184 189 204 222 234 237 232 220 210 208 219 240 262
19475 262 281 297 310 317 311 292 268 247 235 231 233 238 239 234 226 218 211 203 192 176 153 127 105 90 81 73 69 75 92 114 131 145 158 175 193 209 218 223 231 246 263 273 270 261
19457 261 256 256 257 255 249 237 215 187 164 153 151 149 141 134 136 147 160 166 167 171 180 195 210 220 222 216 207 198 194 191 186 176 166 158 156 155 153 146 135 125 120 124 139 162 182 184 165 130 92
19437 92 63 51 59 84 111 128 130 121 104 87 79 85 98 106 105 103 107 116 127 139 151 158 158 154 148 142 131 118 105 92 77 59 43 33 30 34 45 62 80 94 105 117 137
19420 137 166 198 223 235 232 214 186 154 122 98 85 85 94 107 121 137 154 170 181 183 179 173 169 169 172 175 175 179 192 211 225 226 217 207 202 202 209 221 233 236 231 226 224 221 217 216
19402 216 221 230 235 237 236 230 219 207 196 182 160 134 118 118 128 139 148 159 177 200 224 245 260 265 260 250 236 220 204 194 195 202 209 207 195 183 176 175 177 179 179 177 176 181 199
19383 199 230 264 289 298 292 279 267 257 247 234 224 227 248 277 300 313 322 335 347 345 326 300 283 277 274 266 262 270 290 307 310 297 279 263 248 239 242 259 284 306 317
19367 317 315 304 287 267 247 232 223 218 219 222 224 220 204 181 161 155 160 167 168 165 167 179 200 224 241 247 244 242 248 256 258 254 250 248 247 250 260 273 278 268 249 225 201 177 163 167 185
19348 185 207 219 218 202 176 148 126 112 101 90 79 71 66 58 44 27 16 19 38 63 87 107 126 143 157 167 174 179 181 189 211 249 295 333 356 360 349 330 312
19332 312 302 305 323 355 390 417 431 436 433 425 413 395 367 330 292 265 249 232 210 192 195 215 235 241 235 228 233 253 279 297 293 270 236 205 180 166 163 166 169 170 174 186
19316 186 201 213 223 234 246 257 267 277 287 294 297 296 288 274 255 235 219 213 217 226 232 231 227 227 236 252 272 293 306 304 287 261 228 191 153 123 108 111 126 140 147 146
19299 146 145 150 163 179 194 207 217 224 230 233 232 221 202 184 171 164 168 186 218 252 274 285 293 305 317 321 315 295 265 230 201 181 171 170 178 191 205 219 243 280 322
19282 322 356 377 383 375 353 323 291 261 234 210 190 174 162 153 152 162 177 192 204 216 232 251 266 270 261 247 237 236 236 232 224 217 219 231 244 249 243 235 234 239 246 249 250 248 235
19264 235 212 188 172 161 150 140 139 143 145 139 133 140 158 179 193 194 187 173 155 135 120 113 117 129 143 154 158 161 170 187 208 219 214 196 173 151 133 119 111 106 102 102 107 120
19247 120 136 152 163 167 164 156 148 137 125 119 127 150 175 187 179 158 142 140 150 162 172 181 194 207 214 216 219 225 236 248 261 275 286 288 281 269 256 241 226 213 206 208 217
19229 217 226 231 229 224 214 199 179 158 140 127 118 113 117 136 170 209 239 253 254 251 251 257 270 284 292 287 270 246 218 187 159 145 150 170 193 206 204 187 160 135 120 115
19212 115 121 133 144 141 124 102 89 88 97 113 132 153 174 194 214 230 236 230 218 204 192 181 169 158 152 158 179 205 220 216 197 172 153 150 163 185 205 221 236
19197 236 251 258 249 223 190 160 142 134 132 134 142 157 176 191 197 193 181 166 152 140 129 116 99 85 81 87 99 113 128 143 159 174 186 195 199 198 192 185 186 198 218 239
19180 239 257 273 291 309 315 301 269 230 202 197 213 237 253 259 260 262 268 277 284 286 285 284 282 275 260 243 233 231 231 231 234 238 237 222 200 179 165 158 162 175 193 205 205 195 184
19162 184 179 179 178 167 148 136 144 167 187 190 182 172 170 177 190 204 210 202 185 176 180 189 191 179 159 141 135 148 178 216 253 281 298 303 299 289 278 269 261 252 239 220 198 176
19144 176 156 139 122 107 96 91 89 91 97 104 107 108 112 125 143 159 168 174 185 201 219 228 224 211 194 182 183 198 226 255 279 297 311 323 330 329 321 309 295 283 275 271 268 269
19127 269 276 290 303 308 302 287 269 253 244 239 232 218 200 185 174 162 147 130 117 105 91 75 60 52 53 60 66 66 60 52 49 52 62 77 99 125 151 174 193 209 222 227
19110 227 228 231 243 255 258 252 249 254 264 267 262 256 254 253 253 252 249 244 237 227 208 182 158 146 146 149 145 137 129 123 124 135 154 173 186 197 211 221 215 188 151 119 102 99 105 115 119 112
19090 112 97 82 77 86 108 133 154 170 179 182 183 184 185 185 181 170 154 134 114 97 83 77 84 106 135 155 157 145 133 130 138 153 172 189 200 204 202 196 187 177 174 183 205 231
19073 231 255 269 264 240 203 174 167 183 208 228 241 255 269 274 265 248 233 221 206 192 190 205 226 236 232 221 209 197 185 178 180 190 197 196 191 193 207 229 250 264
19057 264 269 271 277 292 311 321 311 285 254 227 203 179 161 156 161 170 183 200 218 226 222 211 204 206 216 226 230 226 218 214 216 216 208 195 181 168 155 146 142 147 160 180 205 229
19039 229 245 250 249 248 248 247 246 246 244 236 220 204 196 198 203 204 200 194 189 183 176 171 181 207 242 271 285 284 274 263 260 264 268 266 254 240 231 228 225 222 220 221 224 224 219 213 208 205 200 192 184 180 183 193 205
19017 205 216 224 227 227 227 226 219 207 195 189 190 193 195 193 188 176 159 138 118 106 108 124 143 149 137 121 115 122 139 161 179 186 175 152 127 107 92 86 92 106 115 111 103 108 129 159
18998 159 185 204 218 230 242 254 265 269 265 257 247 235 220 205 197 199 204 204 197 188 179 169 157 150 150 153 155 154 157 168 191 222 257 286 302 304 294 279 261 247 239 237 234 226 213
18980 213 198 183 167 151 136 126 120 122 135 155 175 186 187 182 178 180 189 204 218 225 225 218 203 180 153 131 122 123 127 130 130 127 121 119 130 157 193 221 234 231 218 203 192 191
18963 191 199 205 204 199 203 220 246 268 281 281 273 259 243 228 216 208 204 210 230 261 291 304 295 276 263 266 277 285 290 295 302 309 312 312 307 294 273 248 222 195 170 153 150 159 168 173
18944 173 176 181 184 180 175 175 184 195 203 204 203 208 221 238 246 239 218 193 175 162 152 143 138 140 152 168 181 190 200 213 225 226 215 198 183 172 165 159 153 147 137 125 114 105 101 102 107
18925 107 112 110 104 97 90 84 82 88 103 117 122 115 102 89 80 78 83 99 125 152 172 182 188 195 203 206 200 191 185 184 181 170 151 129 113 110 119 133 141 136 119 108 119 149 181 196 187 164
18906 164 142 131 135 151 170 178 170 146 115 88 67 51 42 44 60 82 96 98 95 93 94 98 109 127 145 154 151 143 134 122 111 104 105 112 123 138 155 167 174 180 184 177 154 127 111
18888 111 109 108 101 93 92 99 111 127 144 156 157 146 130 115 102 93 87 84 85 91 102 112 113 97 72 54 59 87 122 149 163 171 179 185 184 179 178 188 205 219 222 216 205 195 189 190
18870 190 196 203 204 199 196 200 207 209 205 196 183 168 155 148 144 142 144 156 175 193 208 222 235 243 244 240 232 221 206 187 168 152 143 145 159 178 197 213 227 235 231 217 200 192 192 199 204
18851 204 204 191 165 130 93 59 34 23 28 44 64 82 98 116 138 163 188 210 225 236 245 251 251 242 224 203 184 174 177 192 209 222 228 227 222 210 194 178 165
18835 165 157 157 165 179 194 204 208 210 211 213 215 216 214 208 199 188 180 183 198 221 234 224 194 159 127 99 73 54 47 54 64 69 65 59 60 69 82 92 100 112 130 147 162 178 201
18817 201 226 246 260 272 286 294 289 275 259 247 232 212 199 202 217 230 227 213 198 185 172 160 155 159 169 177 178 176 176 181 188 196 206 221 236 247 251 255 264 271 267 252 239
18800 239 236 233 219 196 176 169 167 163 158 158 166 176 177 173 172 182 199 214 221 216 204 191 180 175 172 169 168 174 191 212 227 231 228 224 221 226 241 264 283 288 276 249 210 169 136 118
18781 118 112 111 111 113 118 119 116 112 118 138 166 195 216 230 236 236 231 227 226 223 217 212 212 216 217 211 207 209 213 216 221 234 253 269 277 282 284 276 256 234 222 220 221 221 221 218 213 212 221 236 247 248 244 237 225
18759 225 206 190 184 187 190 186 180 173 167 161 156 153 157 170 192 217 234 239 235 230 222 209 188 166 154 155 163 170 174 177 182 184 177 164 156 157 167 181 198 220 245 263 270 269 261 245 220 192
18740 192 171 158 152 151 158 173 192 206 215 222 233 244 248 238 215 184 156 139 134 138 150 174 207 238 258 271 283 291 287 266 235 205 182 168 161 158 154 144 127 107 92
18723 92 90 98 114 135 159 183 196 192 174 154 140 133 130 126 120 116 120 138 162 181 187 183 176 168 162 161 172 194 225 255 279 293 293 280 260 241 232 232 236 234 228 224 220 207 177 136
18705 136 102 86 92 116 148 178 200 214 221 227 230 231 226 214 194 170 146 127 118 124 140 157 167 170 174 177 172 152 128 113 119 139 158 161 151 141 139 139 131 117 109 113 122 124 119
18687 119 115 116 122 129 139 149 156 156 149 136 123 115 117 129 145 161 178 190 192 185 172 158 139 118 104 108 132 167 205 240 271 296 310 312 301 281 257 231 196 151 105
18670 105 74 65 72 81 88 99 116 135 152 166 172 170 160 149 138 127 117 113 118 127 132 128 120 116 127 157 197 231 249 253 248 233 204 169 143 134 139 151 165 179 194 212 231
18653 231 249 260 263 257 245 227 206 186 169 155 145 147 158 169 173 168 164 164 163 157 149 141 135 125 112 99 97 109 129 150 167 183 196 209 223 241 258 267 265 258 256 259 264 269
18635 269 275 280 286 291 292 285 269 253 245 246 248 248 245 241 235 229 228 232 236 232 218 197 175 163 163 169 172 168 160 154 157 170 190 209 216 210 192 175 169 177 194 210 213 201 180 158 141 137 148 167
18615 167 188 205 222 237 242 232 215 198 185 173 166 167 176 186 187 178 160 143 133 132 133 129 116 102 97 105 122 138 144 141 132 119 102 81 62 48 41 46 65 93 113 118 113
18598 113 103 88 69 56 61 81 104 122 137 152 163 169 173 169 150 119 98 105 140 183 216 230 226 211 193 179 170 166 170 178 185 185 181 180 183 189 192 190 180 166 154 150 152 155 157
18580 157 158 158 160 170 190 215 238 256 273 289 303 313 320 322 321 318 318 320 317 303 280 254 228 208 197 197 202 206 207 204 198 192 190 194 202 215 231 250 266 271 266 257 248 241 236 235 240 248 253
18560 253 251 244 236 233 240 254 269 274 263 240 216 203 202 207 214 227 248 273 292 298 290 273 251 230 215 210 212 211 203 188 172 160 156 160 171 184 194 197 195 195 199 200 188 167 149
18542 149 146 155 165 167 158 143 130 130 148 181 216 241 251 246 231 214 205 209 218 222 218 209 203 195 180 159 142 136 142 151 152 143 127 106 81 55 34 24 29 43 57 67 74 81 90 103
18524 103 117 125 123 113 102 91 71 44 22 19 36 61 83 102 125 152 180 203 217 218 210 202 200 203 214 232 256 277 288 289 288 294 308 320 320 308 290 276 268 265 267 272
18507 272 271 260 244 238 246 258 264 267 276 291 306 315 312 294 263 235 227 238 248 242 218 189 163 151 163 196 233 256 257 240 210 171 133 107 93 81 67 59 65 82 98
18490 98 106 106 108 116 131 148 162 170 172 167 156 144 141 147 153 157 162 176 198 223 246 272 299 319 326 324 317 302 274 237 202 177 161 150 138 130 127 134 150 171 192 207 213 206 192
18472 192 177 167 160 146 124 106 98 96 91 85 86 97 110 121 131 144 155 164 172 182 190 190 184 176 166 152 138 135 147 170 196 219 233 232 219 204 198 202 207 206 203 198 193 188 185 189
18454 189 199 214 232 249 260 256 238 214 191 173 160 148 137 129 125 126 129 126 116 105 103 112 128 146 163 176 185 190 202 224 251 273 281 270 238 192 147 115 98 91
18438 91 90 95 104 110 101 78 52 37 40 57 79 90 89 85 90 103 116 128 140 158 182 206 226 241 251 257 262 267 265 253 237 232 241 257 263 248 216 183 168 175 188 188 174 158
18420 158 154 160 170 181 193 203 209 213 224 237 238 218 185 155 137 131 131 132 133 133 139 155 180 204 217 210 182 143 108 90 91 104 122 140 157 174 192 214 236 250 252
18404 252 246 241 244 255 271 287 297 297 290 279 269 264 260 256 251 245 235 217 191 163 143 134 129 120 109 103 108 128 156 182 206 232 262 291 304 298 281 262 242 225 215 211 206
18386 206 195 181 173 173 174 169 157 139 114 87 63 47 39 37 44 64 96 132 163 189 213 237 259 270 265 245 219 197 183 175 170 166 164 165 164 156 145 137 134 137 147 169 201
18369 201 231 245 238 215 188 167 159 163 168 168 168 178 197 216 227 228 221 207 189 172 160 151 151 168 198 230 252 266 274 275 270 264 264 270 279 286 292 298 307 319 329 329 313 289 267
18351 267 260 270 291 307 306 288 265 249 240 232 223 218 220 225 225 220 217 223 232 229 212 196 200 224 250 263 263 261 258 249 236 227 225 226 224 222 224 227 227 226 229 236 240 236 227 222 217 205 179 148 128 120
18330 120 115 105 90 79 79 89 107 125 134 131 124 126 142 161 175 182 187 193 199 206 212 214 210 203 199 195 187 175 166 163 165 167 166 170 183 202 220 228 230 239 262 295 325 343 345 336 323 313 308
18311 308 303 294 285 280 273 257 229 193 160 140 135 141 148 154 158 164 170 168 148 112 73 49 46 54 58 55 55 68 89 107 121 139 167 201 237 265 277 266 238 206 183 165 147
18293 147 129 116 113 120 130 135 130 117 102 92 90 94 102 114 129 141 147 145 139 140 154 179 202 215 218 213 197 171 148 144 154 162 159 156 167 189 208 213 207 194 178 161 147 138
18276 138 127 113 98 89 90 98 109 118 124 132 145 159 167 171 177 185 188 179 168 168 183 208 233 258 280 297 302 294 272 240 202 165 136 123 128 146 164 171 164 151 139 126 103
18258 103 72 43 29 35 53 71 83 93 105 124 145 164 177 182 179 172 165 159 156 159 169 184 198 207 211 210 205 194 179 164 156 157 167 181 191 194 187 174 161 149 137 122
18241 122 104 90 85 86 89 92 97 103 112 127 148 171 186 195 207 221 234 243 250 255 252 238 220 201 181 163 158 174 199 220 234 249 266 277 275 263 251 243 237 234 232 229 222 210
18224 210 200 194 196 203 210 211 206 198 192 190 192 195 192 181 170 163 162 166 179 200 222 231 227 219 214 210 205 197 185 167 146 128 116 107 101 99 102 104 98 82 60 37 22 24 44 71 95 114 129
18204 129 144 158 174 190 198 197 191 190 194 196 187 168 143 117 96 81 68 59 59 73 98 128 158 182 190 182 174 180 200 223 240 254 268 276 279 287 305 321 321 306 283 259 233
18187 233 209 194 184 175 166 162 163 163 155 146 146 156 169 176 175 174 179 190 202 210 217 227 243 262 281 298 314 326 333 334 333 333 329 314 283 250 233 243 271 304 331 347 345 326
18169 326 298 271 253 245 244 246 242 230 215 208 214 230 251 278 309 341 369 388 391 374 344 308 275 246 219 194 169 148 132 124 118 108 93 80 84 110 150 187 206
18154 206 204 187 167 152 148 154 167 176 175 166 158 161 178 205 232 252 261 259 250 242 243 250 257 257 253 255 264 272 269 262 265 287 318 346 362 368 370 369 364 351 325 290 257 239 236 237 234 227 217 204
18133 204 186 164 147 137 133 129 127 130 139 150 160 168 176 188 202 215 226 234 238 238 229 208 176 143 123 122 136 155 169 170 155 129 102 93 107 140 172 191 189 174 152 134
18117 134 123 119 120 122 127 135 148 162 175 187 194 191 178 163 156 160 175 199 230 256 264 254 237 227 223 220 222 234 250 256 243 219 197 182 170 153 132 116 111 117 122 117 103
18099 103 90 89 99 115 131 145 153 151 140 124 115 118 132 147 155 155 151 143 134 125 121 123 127 129 132 137 140 139 138 143 153 161 163 159 155 154 161 175 191 201 203 202 203 202 196 191 194 204 219 233 244
18079 244 246 237 228 235 262 300 335 357 365 360 351 340 327 307 285 269 262 256 241 219 195 172 155 145 145 147 145 141 143 151 154 147 138 138 147 154 157 161 170 182 195 207 216 217 206 189 177
18060 177 172 171 167 163 169 191 223 253 272 275 268 256 241 224 204 186 174 171 174 178 181 182 184 184 180 172 159 138 112 87 72 72 81 88 87 79 74 76 86 96 105 121 149 187 223 244
18042 244 248 241 233 230 228 221 208 190 175 167 166 169 176 186 200 214 227 236 240 236 228 215 199 181 168 169 188 217 242 253 250 232 204 174 148 127 103 74 49 41 51 64 70
18024 70 73 83 103 131 160 184 197 203 211 227 243 247 240 232 231 235 238 239 238 237 236 238 245 250 248 239 225 213 209 215 226 238 249 262 274 278 271 258 249 246 241 231 217 201 189 183 184 190 198
18005 198 208 217 223 223 220 217 214 207 198 194 201 213 216 202 175 152 145 157 174 183 181 179 184 197 216 241 271 299 317 328 337 351 367 378 379 367 345 316 285 255 225 197 168
17987 168 143 127 123 130 139 143 140 132 128 136 160 185 194 180 160 156 168 179 174 153 130 118 120 136 167 208 249 279 289 279 263 254 255 257 255 256 264 271 262 234 203 188 191 200 204 203
17969 203 202 204 203 197 189 184 184 185 181 170 152 130 108 97 101 115 132 150 174 203 226 234 225 212 207 213 224 231 230 226 221 213 198 179 165 163 171 181 189 194 199 208 224 247 271 286 290
17950 290 288 290 299 307 308 297 276 252 233 228 235 249 260 267 272 272 263 243 220 201 193 196 211 232 250 258 264 273 285 286 271 247 224 201 171 136 109 102 114 137 159 174 185
17933 185 194 201 206 209 211 216 226 242 262 280 289 290 290 290 289 285 283 285 289 292 293 294 296 302 310 318 318 305 283 261 246 242 249 268 288 300 300 295 294 302 318 335 344 340 324 298 269 245 241 260
17913 260 288 301 289 264 242 225 205 182 165 165 178 192 199 200 203 214 233 252 266 273 274 265 248 225 205 198 204 218 227 219 197 173 155 144 130 110 88 76 81 101
17897 101 126 146 160 172 183 187 179 159 137 120 114 120 134 146 151 153 158 171 193 221 252 280 301 309 298 270 237 213 205 206 207 210 218 226 232 240 258 283 300 301 294 287 276 254
17879 254 223 197 187 186 182 169 149 132 127 135 149 159 164 172 193 225 259 282 292 293 292 294 300 309 320 332 335 328 317 310 313 316 314 303 285 263 240 225 226 245 275 304 318
17862 318 311 287 258 236 228 235 251 273 287 287 275 263 264 277 292 298 295 289 292 309 336 360 372 365 339 298 250 210 185 175 174 176 185 202 222 235 241 243 247 247 236 210 177
17844 177 149 134 129 124 118 117 127 143 154 158 163 178 198 214 217 209 197 193 201 218 235 246 247 240 225 205 183 165 152 143 138 136 136 135 134 138 144 147 145 147 156 166 167 159 151 151 152 147 132
17825 132 116 106 109 122 140 154 160 160 159 161 169 185 206 227 239 246 254 264 270 264 247 229 220 223 235 251 262 262 252 236 220 208 200 197 198 206 219 233 235 216 178 135 100
17807 100 75 54 33 15 7 11 28 53 82 112 142 170 192 205 205 196 186 178 171 162 152 148 154 167 180 191 203 216 223 212 184 149 120 107 113 134 162 188 211 233
17791 233 251 258 244 218 194 188 201 218 226 226 227 243 273 306 329 334 324 306 283 253 217 186 168 166 174 185 197 212 227 235 234 227 219 213 203 191 181 178 179 176 161 142
17774 142 127 118 114 111 113 124 145 171 195 212 217 212 201 190 176 159 137 116 99 89 84 83 90 107 135 174 217 258 289 305 306 301 302 309 316 314 299 276 252 236 236 249
17758 249 261 260 250 244 248 257 260 254 239 222 207 198 193 186 180 182 197 218 234 240 239 233 225 221 222 225 228 232 240 251 260 261 260 264 276 291 297 290 272 256 245 239 228 211 190 172 163 165 171 169
17738 169 156 142 136 136 134 126 117 114 123 143 169 190 201 206 208 207 197 185 183 191 201 202 192 171 147 129 129 140 147 140 133 135 144 146 141 141 149 157 158 158 165 178 189 196 200 202 200 192 185 185 197
17717 197 214 228 230 225 223 229 239 249 257 262 267 277 294 317 338 351 354 353 349 343 332 317 299 278 256 243 247 269 299 322 332 333 332 332 335 341 351 361 366 363 352 334 311 284
17699 284 254 227 211 210 222 235 242 236 219 196 180 181 199 226 254 279 299 310 316 322 336 355 372 383 387 384 370 348 324 306 294 290 290 289 278 257 233 216 207 203 202
17683 202 200 192 177 158 142 134 138 155 173 176 152 115 85 74 78 90 109 130 144 150 150 154 158 157 150 140 127 110 86 56 22 -14 -48 -72 -80 -74 -60 -39 -13 17 50
17666 50 79 97 104 98 85 73 76 100 138 180 215 240 257 263 260 248 233 218 210 215 237 269 299 317 319 309 289 263 237 214 196 181 168 158 146 132 120 114 119 133
17650 133 148 162 172 182 195 213 229 238 241 244 251 264 276 284 283 275 261 242 218 188 156 130 116 114 117 121 123 123 124 127 137 150 160 166 166 164 165 171 180 182 175 164 159 164 173 183 190
17632 190 193 190 181 172 167 163 156 148 145 150 161 176 195 214 229 237 238 234 224 213 206 204 206 209 213 213 210 207 208 211 211 203 193 185 181 180 176 167 155 146 147 160 178 192 196 185 160 128 97 73 61
17611 61 66 90 123 153 173 188 198 204 205 209 219 232 240 242 240 238 236 236 243 255 265 266 259 252 251 255 260 260 252 238 220 202 187 176 171 168 171 186 217 260 297 310 295 264 237 227
17593 227 227 225 211 188 163 146 142 154 181 218 259 294 311 300 261 211 172 154 151 148 144 142 147 159 179 208 246 289 329 360 379 380 362 330 295 266 246 228 206
17577 206 178 153 143 150 164 168 159 150 151 155 147 125 102 90 90 100 120 144 157 153 143 144 159 175 182 183 185 186 180 173 170 175 188 205 223 237 243 239 227 209 190 176 172 168 158
17559 158 138 115 97 89 98 120 149 173 185 189 190 194 202 208 208 198 183 165 142 114 88 71 66 66 67 76 99 132 166 193 212 225 236 254 277 300 308 293 261 228 206
17542 206 198 193 180 163 154 160 177 198 224 257 287 300 291 267 235 198 162 139 137 150 168 180 182 175 158 139 126 124 129 138 147 158 173 190 203 212 216 220 225 229 227 223 222 232
17525 232 253 278 297 306 301 288 275 270 270 268 252 222 187 156 133 110 86 64 54 59 73 92 112 129 140 139 129 116 110 115 124 132 136 140 148 164 187 218 250 276 291
17508 291 298 305 308 298 273 239 207 180 163 157 165 179 193 204 216 226 229 226 222 223 223 217 210 206 207 204 188 157 120 87 69 69 81 96 106 113 119 127 137 152 172 198 221 237
17491 237 243 238 223 200 176 159 152 148 138 126 120 124 129 125 115 105 102 102 106 118 138 161 182 198 208 210 208 207 213 222 230 234 234 231 221 208 198 196 202 209 219 234 255 274 281 270
17472 270 247 223 203 191 186 189 198 206 212 217 223 227 228 228 230 234 235 229 222 219 215 203 175 136 98 73 65 77 105 142 180 209 223 227 223 216 204 187 173 170 178 184 178 160 137 118 105
17453 105 102 115 147 193 243 287 321 340 343 331 313 294 279 263 239 205 164 124 89 56 29 12 10 21 36 50 61 68 70 72 78 91 109 126 142 159 175 187
17438 187 191 191 193 202 220 242 264 279 290 301 316 334 350 361 366 369 368 360 340 313 285 259 231 198 166 139 122 115 110 104 95 93 106 137 174 198 200 180 151 124 107
17422 107 98 97 96 92 90 95 114 140 165 183 194 204 213 217 212 196 174 151 136 132 136 145 157 167 175 177 176 176 175 172 174 185 204 223 239 253 267 276 277 276 279 284 285 280 275 274 273 267 252
17402 252 230 212 208 218 234 252 271 290 302 302 297 294 294 294 297 308 326 343 353 360 363 360 350 338 324 303 273 239 212 193 181 173 171 176 182 185 184 181 181 183 181 168 146 126
17384 126 114 110 107 103 102 109 124 138 139 120 93 75 79 97 116 126 122 110 98 89 82 71 61 62 80 110 142 169 185 188 183 180 188 207 233 257 274 276 266 254 247 239 222
17367 222 202 195 202 215 225 239 263 295 318 318 295 261 237 233 244 257 267 273 273 264 248 237 235 235 229 218 211 208 205 198 190 182 180 182 185 187 191 201 216 226 227 226 228 227 216 196 179
17348 179 169 164 161 160 158 152 141 132 131 139 153 170 190 214 241 262 266 256 239 224 211 201 196 200 213 228 234 229 215 207 218 249 282 299 291 263 224 181 142 114 99 96
17331 96 101 114 133 150 161 165 165 164 169 184 205 220 218 204 186 173 167 170 174 173 164 154 152 156 158 157 156 158 159 159 159 161 163 161 157 158 166 177 183 183 185 194 210 229 250 269 278 276 270 272 284 294
17310 294 293 279 263 251 244 237 230 225 221 216 206 196 196 209 226 232 224 213 210 217 230 245 260 271 275 272 263 249 233 223 225 237 250 257 259 258 257 256 259 268 280 291 294 286 272 259 254
17291 254 254 256 258 259 261 266 271 275 273 263 247 232 219 204 188 175 173 182 192 195 190 188 196 212 226 228 215 192 167 145 124 108 102 112 134 152 155 144 129 121 124 134 147 160
17274 160 170 178 186 199 217 239 260 277 288 289 277 253 229 220 230 247 257 260 266 279 290 289 278 262 239 213 193 189 201 219 241 264 284 290 277 253 232 220 216
17258 216 216 219 224 233 247 264 276 280 273 257 237 213 188 164 147 144 157 174 180 173 164 167 185 213 242 265 277 280 276 263 240 207 171 142 123 115 116 126 141 150 144 125 105
17241 105 90 82 79 79 83 90 101 114 129 145 160 170 173 168 154 134 116 109 114 121 120 109 95 85 83 91 102 110 114 119 127 136 145 155 168 181 192 200 210 218 217 199 168 134 110
17223 110 101 108 120 129 130 125 115 98 82 75 79 89 101 110 121 135 152 170 187 204 221 237 246 243 227 205 184 166 150 137 131 131 136 147 159 167 165 154 143 139 149 169
17206 169 189 199 198 191 185 181 176 172 172 174 176 178 188 210 239 265 283 294 297 292 283 271 255 235 214 197 187 184 189 197 201 193 175 150 120 87 60 50 62 86 113 140 164
17189 164 185 200 211 220 230 245 264 278 285 288 297 312 320 317 311 316 330 340 342 338 335 331 326 316 302 283 260 240 228 223 218 210 200 196 200 207 208 200 191 189 193 192 176 145 109 78 61
17170 61 60 72 93 114 134 153 171 181 183 180 186 205 232 256 271 276 270 254 235 221 217 217 213 206 205 213 228 241 250 255 259 267 281 291 289 272 249 232 225 230 244 263 282 296
17152 296 310 324 338 350 363 374 374 357 325 289 261 250 257 273 286 286 274 252 222 186 147 112 87 73 74 84 94 94 91 98 125 167 208 234 241 240 240 244 245 237 225
17136 225 219 222 227 226 225 229 242 260 282 302 311 301 278 253 238 237 249 264 270 260 242 228 228 247 279 311 328 323 303 277 255 239 236 251 276 298 309 309 301 290 283 286
17119 286 299 317 334 352 369 380 378 364 341 314 284 257 233 212 197 195 211 241 274 302 320 330 335 339 342 340 325 296 263 242 244 262 281 292 291 280 255 220
17104 220 187 172 179 199 215 217 207 192 175 159 147 147 163 191 218 234 241 247 258 266 261 244 224 211 203 194 176 151 130 124 132 145 154 162 171 180 185 184 180 176 174 175 182 193 203
17085 203 206 207 215 233 255 275 294 317 344 367 374 365 348 335 330 332 341 348 343 317 273 232 210 210 220 224 214 195 178 171 177 190 206 224 239 240 223 196 178 183 208 240
17069 240 269 289 302 314 331 356 384 409 424 427 416 394 363 333 312 300 297 299 304 307 302 292 281 269 249 220 192 176 172 170 161 151 149 162 189 225 265 297 314
17053 314 314 301 279 252 224 195 163 128 99 87 98 128 163 187 193 185 173 164 158 150 140 132 130 140 162 191 216 227 220 199 175 154 145 149 159 167 170 171 171 167 159 147 138
17036 138 130 122 113 107 105 105 102 92 79 76 89 116 150 188 227 261 284 295 298 295 284 269 262 267 278 287 294 303 318 337 356 369 367 353 335 321 310 297 278 255 234 219
17019 219 215 221 226 221 207 191 180 173 165 160 158 161 169 176 177 174 177 195 223 244 247 233 211 189 175 174 179 180 177 180 198 225 253 272 282 284 284 281 270 246 218 199 196 198 198 197 200 202 192
16999 192 167 136 107 83 67 61 61 60 55 53 61 81 107 132 151 165 180 197 212 217 211 202 200 208 226 242 238 208 162 121 97 86 77 68 61 58 61 68 76 78 74 73 83 98 106 101
16981 101 89 83 90 108 124 133 133 134 138 141 141 143 150 159 159 148 136 132 143 167 198 227 240 234 217 197 178 159 145 141 150 166 178 183 183 184 186 183 174 161 152 148 148 148 139 121 103 97
16961 97 113 144 177 204 227 244 254 251 240 228 223 222 224 229 243 263 282 294 300 305 311 310 295 268 242 231 242 267 287 293 285 271 259 256 262 272 279 278 277 285 301 313 312 298
16944 298 276 244 204 164 136 124 123 129 133 131 122 117 125 146 168 183 192 198 203 201 190 170 147 132 133 147 157 151 125 95 77 82 99 112 108 95 87 89 97 103 105 107 113 123 133
16926 133 136 133 129 128 125 120 116 115 116 116 117 125 146 179 211 225 208 168 131 119 129 143 151 156 166 176 184 187 185 179 168 155 138 122 114 125 155 195 233 263 281 287 286 284 283 277
16907 277 261 236 210 191 183 185 186 181 171 168 173 178 179 183 196 216 240 264 283 285 269 250 248 265 292 321 346 369 393 421 453 483 514 557 616 689 779 899 1059
16891 1059 1268 1556 1958 2431 2818 2933 2722 2309 1878 1531 1265 1045 860 716 608 531 480 449 430 414 401 387 369 351 340 335 330
16881 330 316 294 270 250 236 230 227 222 217 212 209 206 205 210 219 226 222 203 169 128 91 68 60 57 52 43 32 21 15 21 42 68 84 85 81 79 79 79 83 92 103 109 109 108 115 131 146 154 159 169
16861 169 186 208 231 250 266 275 276 268 258 252 256 266 270 263 248 232 219 209 204 208 220 228 222 205 185 171 168 174 177 168 145 123 123 149 185 208 209 195 178 161 142 122 104
16843 104 93 87 82 80 83 89 94 95 91 79 62 52 61 90 126 151 159 154 146 139 134 131 124 113 102 97 101 111 120 125 129 137 149 156 150 134 122 127 150 181 208 224 226 215 209 220 249 282
16824 282 303 306 292 263 226 191 163 141 122 107 99 98 104 118 135 149 153 147 134 113 87 66 66 88 118 146 172 198 219 233 241 251 262 269 271 267 257 242 229 227
16808 227 235 245 250 255 265 278 287 286 276 261 252 253 259 259 253 248 248 243 221 193 175 175 185 195 203 208 209 210 217 232 247 251 243 226 208 193 187 187 188 182 170 156 145 142 147 159 165 155
16789 155 131 105 92 102 131 166 199 222 235 239 237 232 224 214 205 198 189 176 164 163 176 193 198 191 180 178 188 206 224 235 237 235 237 244 249 251 258 278 305 326 331 318 293 268
16771 268 254 254 256 251 235 216 197 177 157 143 138 138 135 127 121 125 144 177 214 242 256 259 256 246 226 198 176 174 191 216 230 231 228 229 233 237 242 251 261 270 275 280 282 275 262 253 252
16752 252 253 251 246 245 250 255 254 248 240 235 233 232 224 211 200 192 183 170 156 148 142 134 124 124 141 170 199 222 237 249 260 267 266 250 223 190 160 137 122 116 116 123 138 161 186 207
16734 207 219 229 236 241 245 250 253 249 232 207 181 154 131 115 114 127 148 175 206 239 271 301 328 347 350 332 300 267 241 226 220 217 213 207 202 199 197 194 186 177 173 178 193 217
16716 217 243 260 256 226 178 134 107 101 112 134 155 163 159 151 148 148 147 143 145 156 175 195 204 196 174 155 153 164 173 176 180 189 199 204 210 219 228 230 225 219 209 193 177 170 178 195 216
16697 216 240 261 266 252 229 212 207 210 216 221 221 213 202 194 195 204 213 214 206 191 172 152 135 126 123 122 120 118 121 132 152 179 209 239 266 292 321 352 374 384 384 380 377 373 370 364 351
16678 351 333 313 298 284 263 237 218 215 224 235 245 257 272 285 285 269 236 194 157 138 142 163 189 208 217 216 209 200 197 203 211 214 208 199 195 200 210 218 220 222 227 231 227 215 206 211
16660 211 228 246 255 258 267 287 311 325 327 322 317 311 304 296 291 293 298 300 293 274 250 234 233 247 267 284 292 291 288 287 290 294 291 279 261 240 211 171 128 96 84 95 122 159 194
16642 194 216 220 213 205 197 190 184 182 182 176 163 151 147 149 153 154 148 133 108 82 59 45 40 45 53 56 55 59 76 102 126 140 148 152 153 152 155 163 172 176 172 158 140 128 134 159 194 228 253
16622 253 265 263 247 224 204 194 191 194 202 213 228 245 261 268 264 257 253 250 237 217 199 195 205 218 227 236 251 274 295 302 289 263 240 231 234 239 231 211 186 165 155 152 151 152
16604 152 159 174 189 195 185 159 128 102 90 95 113 136 162 192 219 233 230 213 191 168 144 123 110 109 119 134 148 157 164 175 195 223 254 280 295 298 289 271 249
16589 249 227 211 206 215 231 243 244 235 220 205 194 191 196 205 209 206 195 179 164 154 147 135 117 99 92 100 120 143 163 177 180 177 178 188 203 214 219 227 242 261 275 278 276 280
16571 280 294 312 323 319 300 274 244 206 164 127 103 88 74 55 32 14 6 9 20 37 54 67 72 68 60 55 59 72 83 88 87 89 104 133 169 198 215 223 230 237 237 227
16554 227 210 199 200 214 239 269 298 325 347 356 351 332 309 285 262 237 211 184 152 116 87 79 98 132 165 183 186 179 163 141 114 92 86 100 125 146 158 167
16539 167 179 189 191 185 177 171 166 160 151 138 125 120 132 162 197 220 224 213 195 179 171 171 171 162 142 121 106 101 103 111 127 145 155 148 127 105 91 93 104 113 106 84 61 54 66
16521 66 85 95 93 82 73 74 92 124 162 191 202 197 184 174 166 154 139 126 121 120 122 126 132 136 136 136 141 147 148 145 147 162 181 195 200 199 197 192 185 178 172 167 159 151 146 154 175 203 223 229
16501 229 229 233 243 252 257 261 262 258 244 221 196 176 168 171 182 193 201 202 193 177 165 165 173 178 178 183 202 229 251 254 239 218 206 213 234 257 269 274 279 287 294 295 295 302 314 320 313 296
16482 296 279 265 245 217 190 180 189 206 217 219 215 210 207 210 219 232 247 265 288 315 338 348 342 323 297 271 248 231 223 224 226 220 202 179 161 145 128 112 104 108 125
16465 125 152 184 214 234 241 233 212 182 153 137 138 151 168 182 189 193 193 189 185 188 200 212 217 214 211 213 217 222 228 236 246 257 271 285 291 280 249 205 158 120 98 100 121 150
16447 150 172 180 173 156 139 131 134 144 156 168 179 189 195 196 189 179 173 179 200 234 269 293 299 290 280 277 278 274 268 270 286 305 316 318 315 308 298 288 279 270 258 247 241 235 226 212
16429 212 201 202 219 249 279 300 308 305 294 277 257 240 231 225 220 215 211 206 195 177 160 151 151 156 163 171 176 176 177 180 183 184 183 184 186 187 182 169 147 125 113 119 135 150 159 163 165 167 170 175
16409 175 177 173 160 145 135 136 151 180 216 250 279 306 328 336 327 304 276 243 207 176 158 156 166 185 210 232 239 230 216 210 213 224 244 269 295 310 311 301 285 267
16393 267 252 239 224 201 175 157 153 161 172 183 196 213 232 248 256 252 240 228 223 228 241 254 261 257 241 218 195 186 197 224 250 261 258 254 255 257 250 231 207 188 178
16376 178 176 178 178 175 166 150 130 116 115 128 153 182 208 219 207 179 148 128 121 127 139 153 162 166 166 168 174 186 205 226 237 234 220 205 190 179 174 180 191 203 212 220 231
16359 231 241 246 241 225 204 184 170 165 167 177 193 211 228 240 240 226 210 204 209 211 204 195 195 203 212 222 242 271 297 306 296 276 260 255 263 277 293 303 299 277 243 213 198
16342 198 201 217 244 275 301 323 351 397 462 555 688 862 1083 1372 1759 2198 2536 2603 2365 1953 1540 1211 961 769 634 549 489 435
16331 435 387 349 321 296 271 242 209 180 168 173 182 184 183 185 193 205 211 203 186 175 184 206 224 223 209 196 193 202 221 241 253 255 251 240 219 190 165 150 147 151 158 171 189
16313 189 206 211 197 167 137 121 116 115 117 132 161 188 199 192 177 163 150 139 128 114 101 98 109 127 138 137 128 120 115 117 123 129 130 128 130 139 152 165 174 178 174 167 164 168 174 174 170
16294 170 171 182 198 210 212 208 201 197 197 200 205 209 214 222 230 237 236 225 201 169 137 112 98 89 78 65 60 66 79 92 101 110 121 134 145 156 168 176 180 186 199 218 233 234 222 202
16276 202 181 158 137 118 102 87 73 65 71 89 112 134 151 163 170 172 170 168 168 171 175 180 183 185 182 176 173 182 200 221 234 237 238 243 250 256 259 255 246 235 226 218 207 193 182 181 185 182 170
16256 170 158 159 174 185 177 148 116 98 94 96 103 119 144 168 184 195 199 192 172 148 131 120 110 101 104 121 150 186 229 273 310 334 347 353 354 346 331 309 282 249
16240 249 212 179 163 169 188 202 200 189 182 182 186 189 191 190 185 179 174 171 168 169 180 202 222 232 229 220 207 191 181 183 196 213 226 239 255 272 287 294 293 291 291 298 305 305 290 266
16222 266 250 254 273 290 293 288 285 286 290 298 318 348 375 391 393 389 385 383 383 383 375 356 334 317 308 300 287 272 255 238 228 233 254 278 296 309 322 333 337 332 326 325 325 323 322 324 324
16203 324 319 310 306 307 306 295 276 256 245 244 254 270 285 295 303 315 332 348 355 352 341 325 308 293 285 284 287 287 276 255 232 216 207 200 194 199 219 244 258 256 244 234 230 231
16185 231 239 253 270 281 281 274 266 262 261 261 259 254 242 221 190 160 139 126 114 103 100 114 141 168 181 182 185 197 215 228 233 239 248 258 264 266 271 280 286 282 268 248 229 218 222
16167 222 240 262 282 298 310 323 334 340 334 313 284 261 250 253 266 284 305 321 325 313 287 251 215 187 169 157 143 121 96 78 79 105 142 170 175 158 134
16152 134 118 114 117 122 124 124 123 127 136 152 170 189 206 218 224 227 231 238 246 249 247 245 247 251 250 242 230 221 221 222 216 197 165 132 107 99 104 119 133 141 140 127 105 77 50 26 13 19 48
16133 48 90 126 144 148 154 169 192 215 235 255 277 295 302 294 276 259 248 241 228 207 186 175 174 177 172 154 128 102 89 95 113 127 126 111 91 76 72 78 93 115 140
16116 140 165 186 202 211 215 210 200 188 179 168 156 145 144 154 166 173 183 205 240 276 299 304 297 288 278 265 251 242 242 245 246 249 260 276 283 271 239 199 168 157 168 195
16099 195 224 247 265 279 289 291 283 269 256 245 240 239 237 228 213 197 191 201 230 273 320 361 391 408 414 410 398 381 357 326 293 262 241 230 229 232 232 225 216 209 203 195 183
16082 183 174 172 175 180 184 189 199 210 220 224 225 220 205 178 146 118 105 111 130 152 171 190 208 217 212 195 177 166 165 170 181 194 204 205 198 185 169 156 155 170 188 198 196
16065 196 190 185 179 174 177 193 214 230 240 250 259 265 268 270 276 285 295 303 302 288 260 232 216 214 214 206 186 161 138 127 133 159 194 224 238 241 241 237 228 213 197 184 172 163 163 173
16046 173 189 204 215 218 215 211 214 228 245 255 257 258 268 289 314 335 347 354 358 355 341 322 306 297 294 305 337 384 434 483 539 601 659 721 820 982 1212 1534
16031 1534 1986 2529 2984 3126 2883 2392 1868 1437 1106 857 683 571 489 420 373 354 351 347 343 345 352 357 362 371 377 371 352 322 291 269 268 292 330
16018 330 360 371 366 353 341 332 323 316 315 320 328 331 324 307 288 275 270 270 266 256 245 238 237 240 245 253 259 262 261 258 251 236 218 203 193 184 171 162 163 167 157 129 99 85 89 99 103 101 102
15998 102 111 128 148 167 182 191 194 189 181 170 165 170 184 197 201 196 186 172 155 139 133 137 146 158 173 189 200 198 183 161 139 126 126 140 167 201 232 245 235 210 189
15982 189 181 187 197 208 219 228 234 239 241 239 229 214 200 191 183 174 164 157 158 170 191 219 245 264 273 273 266 253 236 218 205 199 199 194 179 160 151 158 180 205 224 235 236 235 240 255
15963 255 275 290 290 278 264 255 252 248 242 238 240 247 256 260 258 250 236 219 208 208 215 223 224 220 212 197 172 147 135 141 156 169 179 193 210 225 234 238 239 237 226 205 173 135 100 86
15945 86 97 123 146 155 151 138 127 125 136 157 182 215 255 294 318 324 320 317 319 322 319 307 292 282 281 282 277 264 253 248 241 225 199 174 160 163 183 213 242 262 274 283 288
15927 288 286 276 255 225 188 157 144 153 174 197 213 222 225 225 224 224 227 228 221 204 183 170 170 174 169 151 128 112 110 122 145 167 175 165 147 132 127 125 127 136 153 169 178 183 194
15909 194 214 239 263 290 319 345 363 378 394 408 412 403 388 371 349 320 289 265 250 242 237 235 236 239 243 245 243 237 228 220 212 200 188 179 180 192 211 227 230 218 200 189 191
15892 191 201 211 213 207 202 206 222 237 238 224 204 193 193 200 206 204 197 190 193 202 205 189 155 115 79 56 50 62 85 106 116 118 123 141 169 201 228 248 258 258 249 238 233 236 244
15874 244 252 256 255 248 233 215 200 197 208 227 244 249 238 224 214 211 207 201 195 193 194 195 195 198 204 213 220 221 214 202 190 180 175 173 176 184 196 212 231 249 256 247 224 194 162 136 129 148
15855 148 179 202 206 201 196 195 193 190 190 194 203 215 231 246 256 257 246 223 195 175 171 177 184 183 176 173 181 199 214 216 207 200 206 219 228 230 228 226 221 214 205 197 187 174 160 150 146 145 143 141 145
15834 145 157 174 184 182 173 165 156 149 149 160 174 181 181 187 201 215 220 219 221 227 236 244 247 245 238 230 225 220 211 197 185 180 184 200 228 261 288 299 293 274 246 215 183 156 139 133 138 144
15815 144 142 129 109 92 83 83 89 99 113 134 157 177 189 192 186 168 145 127 124 132 140 142 138 129 114 99 92 93 96 93 89 90 98 112 131 156 183 203 211 206 197 187 176 164 153
15797 153 151 160 175 186 188 184 179 174 163 144 119 100 96 106 120 127 125 122 120 112 96 77 64 58 53 43 34 33 43 58 72 84 96 110 124 134 140 140 131 111 83 55 38 40
15779 40 54 70 78 80 83 89 98 108 116 118 112 103 104 118 146 179 213 239 251 252 253 260 268 270 269 270 269 259 234 203 183 181 198 221 235 224 190 150 121 113 125 151 180 197 200
15761 200 193 186 182 177 170 167 171 179 188 193 190 178 159 140 127 128 143 169 199 225 241 249 254 263 277 291 301 307 310 307 294 271 249 236 230 221 203 183 173 176 190 206 218 224 230 241
15743 241 255 262 253 229 201 182 175 176 183 194 213 241 275 310 339 354 353 337 313 287 261 238 219 208 201 194 184 178 177 181 185 187 188 189 189 189 193 205 221 236 246 253 258 261 261
15725 261 258 256 259 268 278 281 270 249 225 203 186 174 166 156 143 127 117 120 131 144 156 172 192 212 224 226 224 226 234 247 257 257 244 222 198 178 162 155 155 157 157 156 160
15707 160 172 187 196 195 183 164 142 123 109 102 107 124 145 161 166 164 159 153 146 141 143 151 163 183 214 249 274 278 265 245 226 208 191 178 173 181 196 212 224 230 235 241 248 257
15690 257 261 258 247 236 231 235 246 255 263 269 276 282 285 284 277 264 250 238 233 235 241 249 261 279 300 320 333 334 324 305 287 275 270 268 272 286 308 326 331 319 294 258 215 175 149
15672 149 143 153 170 185 198 212 231 251 262 257 241 226 218 213 207 203 204 206 206 203 205 215 232 249 264 275 282 287 291 291 283 268 252 242 238 238 240 244 239 220 191 168 161 163 159 144
15653 144 129 129 147 167 171 156 133 116 109 110 121 141 166 185 191 188 185 189 198 204 197 176 152 137 135 136 129 115 104 104 117 137 159 173 174 161 142 128 132 156 190 215 217
15636 217 199 174 153 137 126 120 120 125 134 146 158 167 172 179 188 193 192 189 185 178 167 161 172 199 229 251 263 267 261 249 240 240 243 236 214 185 164 161 170 181 184 182 179 181 189 204 227 249
15617 249 260 253 232 215 213 225 239 242 234 229 241 271 307 338 358 366 362 349 332 316 298 274 241 200 152 102 56 23 9 16 37 61 79 97 124 158 191 213
15601 213 223 226 224 219 216 213 209 202 197 200 206 211 212 214 220 228 236 238 232 218 203 191 182 176 179 194 214 225 222 212 203 196 186 178 184 204 228 246 257 263 264 254 236 216 203 201 207 216 221 218 211
15581 211 210 218 235 254 265 260 240 214 195 191 199 215 232 245 246 231 200 163 128 100 82 72 69 72 80 96 123 161 204 243 273 295 307 307 297 282 270 264 259 254 250
15564 250 249 244 232 222 227 247 269 280 280 278 278 276 269 256 240 226 218 220 229 237 238 231 224 225 236 250 254 242 218 189 166 154 156 172 197 221 234 230 212 193 188 198 216 229
15547 229 234 234 230 220 202 181 163 155 164 190 224 254 271 280 284 286 283 276 268 260 257 261 271 282 287 287 282 277 277 287 302 310 304 289 280 277 273 262 246 230 213 195 178 161 142 122
15528 122 112 122 152 197 245 284 306 309 300 287 277 276 280 277 256 218 182 163 166 183 208 236 259 270 270 266 265 264 262 262 265 264 253 234 217 206 197 188 179 172 167 163 161 163 169 182
15510 182 207 246 289 322 336 331 312 285 258 236 226 229 239 249 252 246 231 210 187 164 145 135 137 148 160 165 163 157 152 148 148 147 144 138 131 126 124 121 117 112 110 113 123 134 141 143
15491 143 143 148 160 177 198 222 246 262 264 254 241 232 228 232 240 243 229 197 158 127 107 93 85 90 110 141 173 198 212 217 215 208 198 184 169 157 144 125 99 73 53
15475 53 39 32 35 52 77 101 114 115 107 94 81 71 67 69 79 92 104 109 112 116 122 125 122 118 120 129 139 142 134 118 102 93 92 97 101 100 93 90 99 124 154 175 181 172 155 140 135 145 166
15455 166 188 202 206 203 194 177 148 113 84 70 76 98 128 164 199 225 234 227 212 194 177 165 163 172 188 202 206 196 178 160 150 147 144 134 120 102 80 54 31 19
15439 19 19 28 42 57 70 81 89 91 84 68 53 52 73 112 152 183 201 209 208 202 196 188 175 157 138 127 128 140 160 186 215 240 253 253 246 239 234 229 225 222 217 208 193 171 141
15421 141 108 80 65 64 71 84 106 134 158 170 175 181 192 207 219 229 239 248 253 249 233 210 186 162 139 118 105 106 123 151 180 204 221 231 240 251 264 275 279
15405 279 271 254 235 218 201 189 182 182 182 180 181 189 204 222 238 255 271 280 280 277 271 258 235 211 198 201 212 222 224 214 198 190 203 235 266 280 276 262 243 222 207 205
15388 205 216 231 244 253 255 251 245 246 258 272 278 275 270 267 266 264 263 262 254 230 191 150 121 114 123 137 152 167 183 192 186 168 151 149 163 186 207 216 213 203 198 205 222 241 255 262
15370 262 261 254 244 229 212 196 186 185 189 189 185 179 177 182 195 213 231 244 256 269 280 280 263 231 197 174 167 170 178 186 192 190 176 154 135 126 126 123 115 106 103 110 125 144 158 164
15352 164 159 152 147 144 140 134 127 124 127 134 139 138 129 116 103 92 84 82 89 109 137 164 183 188 186 184 187 188 180 161 143 138 153 183 218 243 248 235 210 185 169 164 174 192 210 221 224
15333 224 226 231 238 244 248 250 256 264 273 278 273 254 226 200 186 185 189 188 177 154 128 107 99 100 103 104 104 105 102 92 78 70 73 84 98 111 122 131 145 168 196 221 235 242 249 257 266 273 275
15313 275 267 248 220 192 168 149 129 104 80 64 63 76 94 106 108 106 103 99 85 60 35 22 29 55 90 123 145 155 159 164 176 191 207 224 236 238 228 210 191
15297 191 175 160 147 139 135 135 138 142 142 137 128 119 110 98 84 76 80 95 118 141 157 159 145 124 105 93 91 97 107 113 115 123 143 167 183 190 197 211 231 245 249 245 240 242 250 256 253 242
15278 242 233 230 231 233 240 251 259 261 261 266 273 277 275 266 250 226 201 187 189 199 203 194 170 145 131 137 155 168 167 153 141 141 151 162 168 171 177 186 197 207 219 236 249 252 248 246 250 253
15259 253 246 235 230 233 231 217 198 187 192 205 214 214 209 207 209 210 207 203 207 223 240 250 248 240 228 213 194 178 170 171 172 166 154 145 146 158 175 188 196 203 212 223 228 223 210 195 186 190 206
15239 206 229 247 256 253 238 213 183 157 141 137 139 142 143 140 136 134 136 138 137 131 125 124 131 146 168 192 213 230 246 259 264 259 250 246 253 268 284 296 301 297 287 275 266 259 252 244 241 249 269
15219 269 288 294 285 270 256 246 241 242 250 256 256 256 263 278 294 306 315 320 316 299 271 242 218 201 187 179 181 195 216 236 252 264 274 279 272 252 224 197 179 172 176 187 198
15202 198 203 200 197 201 216 229 225 203 176 159 152 146 139 134 131 126 121 118 116 106 87 74 79 103 132 153 162 160 152 144 141 146 159 175 189 195 193 194 204 220 229 223 207 187 171 162 158 158 155
15183 155 147 136 127 122 121 121 115 101 81 61 46 36 32 38 55 78 95 106 117 137 162 185 202 212 219 225 227 226 222 216 210 207 210 220 234 245 245 237 229 228 236 248 260 268 270 270 273
15164 273 283 294 300 296 285 275 269 261 246 230 228 247 274 289 281 261 241 225 212 201 195 193 193 194 195 190 176 154 130 109 90 78 76 86 98 103 101 98 98 96 93 89 86 85 80 70
15145 70 60 58 71 97 123 132 120 95 74 68 76 91 102 104 100 97 102 120 153 198 244 279 299 304 302 300 301 305 304 294 277 261 253 255 260 259 246 220 188 158 136 122 111 99
15127 99 85 72 65 66 71 76 77 72 63 55 49 47 50 55 64 79 99 118 130 133 129 124 124 127 132 139 152 174 198 214 217 213 208 203 190 170 148 129 116 110 115 133 156 175 185 185 180 175 172 168
15107 168 157 139 122 117 127 144 163 183 203 216 219 215 209 204 195 179 161 148 142 136 126 114 108 110 116 121 125 133 143 144 134 121 117 124 135 147 169 203 241 272 294 310 315
15090 315 304 278 253 245 251 263 276 289 300 300 286 265 245 232 226 223 216 198 174 155 149 149 151 154 160 164 164 164 173 193 216 237 254 264 260 241 219 204 198 196 191 183 169 150
15072 150 136 138 157 181 200 210 212 208 199 188 177 167 159 155 156 161 165 169 174 183 195 210 225 237 240 232 221 215 215 213 203 187 170 159 154 153 154 154 154 156 165 180 198 215 233 249
15054 249 261 265 265 267 271 274 272 268 260 246 226 204 191 188 194 207 229 256 274 271 253 237 238 248 253 245 228 208 191 178 168 158 146 131 117 107 101 99 104 114 126 136 143
15037 143 143 132 110 93 96 116 136 139 130 119 114 111 108 107 109 113 117 126 142 159 174 186 200 219 237 250 258 263 265 266 265 266 270 276 279 271 255 239 228 222 214 201 187 178 176 180 189 198 202
15017 202 203 206 219 238 253 256 247 238 235 235 230 216 197 182 179 186 196 200 198 190 179 165 152 144 143 144 143 145 162 189 210 211 192 169 150 137 131 134 145 159 172 180 183 180 177 181 192
14998 192 203 209 216 233 257 283 305 321 330 333 338 347 353 348 335 320 305 285 260 239 230 233 247 269 291 303 304 307 319 332 332 314 287 259 231 208 197 198 208 226 253
14982 253 280 295 290 275 261 254 244 224 196 168 148 142 148 158 163 159 154 151 148 140 130 126 135 153 172 187 192 186 167 138 105 75 58 55 65 84 108 132 147 150 145 145 152 163
14964 163 175 187 199 203 191 163 130 103 88 83 83 87 96 112 134 152 163 168 170 169 157 136 114 98 87 78 77 89 110 130 141 144 144 148 158 170 174 163 139 106 70
14948 70 34 7 1 18 54 97 139 173 190 191 184 178 177 183 198 220 240 254 261 262 258 248 234 221 209 199 189 172 146 118 101 105 122 140 153 165 175 176 163 146
14932 146 137 137 139 131 116 103 98 100 100 96 88 76 63 52 44 42 49 69 102 141 178 209 232 245 247 240 229 216 197 169 141 123 125 144 170 191 201 206 211 220 229 239 256 279
14914 279 296 298 280 249 213 177 153 152 173 206 234 249 249 240 228 221 221 223 223 219 213 208 206 210 225 249 278 301 313 317 322 332 340 337 318 292 270 257 251 248 245 242 241 243 244 241 231
14895 231 217 204 194 183 171 161 155 155 161 169 173 165 147 129 123 132 147 163 179 199 220 231 229 222 219 223 228 230 228 225 225 231 249 279 316 351 376 385 370 336 295 262 243 229
14877 229 214 197 181 169 161 161 174 199 232 268 300 320 324 312 292 270 254 242 234 226 216 207 209 223 235 234 218 199 182 163 140 117 104 99 95 90 88 92 97 102 112 131
14860 131 153 165 157 135 108 87 71 56 44 46 68 107 148 179 199 209 206 193 179 177 192 222 257 282 289 278 262 251 245 240 236 237 239 232 215 197 185 178 168 150
14844 150 130 114 105 104 103 96 83 75 78 91 110 132 160 190 211 215 205 194 188 186 181 165 129 79 32 7 13 34 50 49 37 25 18 18 27 47 74 103 129 157 183 204
14828 204 212 211 204 192 175 160 154 154 154 156 168 195 225 241 236 215 191 172 160 153 151 153 161 170 172 163 146 128 115 109 107 105 100 87 66 44 33 38 57 85 111 128 132 128 122 123
14809 123 130 139 145 142 131 113 96 89 91 102 119 140 159 172 177 179 180 180 177 176 180 192 208 225 240 250 250 233 202 172 159 160 159 144 123 112 117 132 151 172 193 204 201
14792 201 186 165 143 123 109 106 113 124 136 151 170 187 198 203 207 215 224 228 226 223 224 229 232 227 211 186 155 126 109 109 125 146 167 183 190 186 174 161 157 165 180 193 197 194
14774 194 195 209 233 258 273 273 253 216 177 154 153 167 184 200 215 230 244 257 270 280 281 273 254 225 190 161 143 136 131 124 115 105 95 87 82 80 83 89 95 95 86 78 77 85
14756 85 96 104 108 108 100 77 42 3 -29 -43 -32 0 43 91 138 178 205 220 227 229 224 214 203 199 201 203 201 197 194 195 200 208 212 207 195 182 173 170 171 172 174 176 181 189 193 192 184 176 169 162 151
14736 151 138 132 136 149 166 182 198 215 231 243 250 254 259 261 256 245 237 236 238 234 223 213 209 214 225 236 242 236 218 195 176 165 160 158 158 160 166 173 183 196 210 224 231 224 200 169
14718 169 148 147 164 189 213 230 236 230 214 195 175 152 130 113 106 109 115 120 122 124 129 138 148 158 173 197 225 250 265 274 279 282 280 273 264 251 232 209 188 172 159 144 131
14700 131 127 137 152 169 184 199 211 220 223 226 231 240 247 252 258 271 286 295 287 268 247 235 234 241 254 267 277 281 280 277 271 260 246 237 236 243 251 262 279 300 315 314 298 273 249
14682 249 229 219 215 217 220 228 240 250 254 247 233 214 191 165 143 128 119 110 98 86 76 68 59 45 29 17 19 41 75 102 117 125 136 146 152 152 153 161 172 181 189 196 202 207 213
14664 213 218 221 222 226 234 241 239 233 227 224 219 214 212 210 202 184 166 153 143 126 100 74 59 57 65 76 85 89 93 99 107 119 138 166 197 217 219 205 186 171 166 174 187 198 202 201 198 190 177
14644 177 161 145 127 104 84 75 82 96 108 117 124 132 143 156 168 178 189 204 221 232 232 222 206 189 177 179 194 210 214 205 197 197 198 188 171 161 166 181 193 194 190 188
14628 188 186 181 173 173 187 210 232 248 263 277 285 285 280 273 268 266 264 262 259 253 248 243 240 240 242 245 247 248 254 265 277 283 283 275 256 227 203 197 210 228 240 248 254 254 241 213 179 151 137
14608 137 135 136 131 119 103 88 77 75 89 117 151 179 195 202 212 230 254 276 288 287 278 263 241 212 185 168 166 179 202 229 246 249 241 234 230 225 217 207 196 190 189 192 190
14591 190 177 157 141 131 122 116 121 138 157 169 170 166 163 162 162 157 141 115 90 76 74 75 77 84 100 126 159 191 216 231 236 234 225 215 208 207 208 210 217 230 236 223 192 152 112
14573 112 74 46 37 52 81 110 131 144 153 163 171 166 144 118 109 125 149 157 143 119 97 81 70 63 55 43 29 19 15 19 27 33 34 31 35 55 82 104 118 133 150 163
14556 163 170 180 205 242 280 307 321 328 331 334 336 339 341 344 340 325 303 284 273 263 244 213 179 152 135 129 136 159 194 230 256 273 289 310 334 354 367 372 372 367 356
14539 356 340 324 313 309 311 316 318 316 313 311 303 283 249 207 164 129 109 105 111 114 105 89 76 75 84 94 96 94 99 117 141 159 168 177 189 199 202 200 203 214 229 242 247 240 219 192
14521 192 168 155 149 141 130 116 106 105 120 149 182 209 219 212 193 174 165 170 181 190 194 194 191 187 184 192 216 252 284 298 292 278 269 269 275 284 295 310 324 336 344 345 336 315 288
14503 288 267 258 256 252 239 222 205 193 190 197 213 231 244 248 239 219 197 179 169 163 156 145 130 116 105 101 108 130 168 211 244 254 242 223 206 196 191 187 183 177 168 159 155
14485 155 156 157 150 133 111 88 72 70 86 116 146 165 169 167 169 173 174 172 171 177 187 192 188 177 169 170 178 189 197 202 202 194 181 166 155 149 146 143 141 138 132 126 119 112 108 111 125 141 148 143 135 133
14465 133 135 134 123 104 79 55 38 34 41 46 42 28 18 21 39 65 88 104 115 124 136 159 191 226 253 268 274 272 259 236 210 187 176 179 192 202 197 182 171 177 193
14448 193 206 207 201 189 174 160 156 166 186 211 234 254 265 264 253 235 214 195 183 183 194 207 217 225 235 243 243 232 217 209 210 218 224 221 208 189 172 159 146 125 99
14432 99 77 64 61 67 82 102 116 116 109 107 120 149 185 215 229 226 217 214 219 226 230 233 238 247 257 269 280 288 293 293 288 276 258 238 223 214 204 190 171 149 124 98 77 69 74
14414 74 85 95 103 114 128 145 162 181 203 223 235 240 248 264 285 300 305 301 293 284 275 265 254 239 222 205 192 179 158 124 84 52 36 35 39 44 45 40 29 24 38 74
14397 74 117 149 162 166 171 174 169 155 143 143 155 173 194 220 252 277 282 265 237 207 176 146 122 109 106 107 104 100 101 112 128 141 144 139 140 152 172 187 190 183 172 165 167 181
14379 181 199 210 212 210 212 219 228 233 229 218 203 183 158 128 103 89 88 96 107 116 122 126 130 135 140 146 153 160 165 169 177 191 205 205 193 178 169 166 164 161 158 154 151 150 156 168 183 200 213 223
14359 223 231 242 255 263 267 272 286 307 323 326 314 295 275 257 238 213 179 146 121 107 101 105 122 151 182 206 216 213 200 181 166 162 171 184 193 193 185 176 174 184 201 217
14342 217 221 210 189 162 130 91 54 27 17 23 42 71 109 152 194 233 267 289 293 281 260 241 227 218 217 224 236 242 236 221 205 190 173 155 140 135 139 145 148 150 151
14326 151 152 150 145 137 126 113 103 102 113 129 148 167 180 176 155 124 92 65 44 33 33 39 44 50 65 87 109 123 128 127 125 123 124 129 134 138 145 156 169 178 185 197 217 236 241
14308 241 232 218 213 218 224 220 204 184 167 159 157 158 161 166 174 179 176 162 142 122 103 92 99 129 177 225 258 268 260 245 231 224 224 226 225 219 209 197 187 183 191 213 244 276 300
14289 300 308 300 284 271 264 254 233 201 167 136 113 101 105 123 145 162 173 182 193 207 221 228 226 218 206 191 177 169 173 185 196 201 206 214 223 229 231 233 228 214 199 195 209 226
14272 226 233 230 227 231 240 248 254 258 261 260 257 253 254 263 274 282 282 278 274 267 257 246 238 231 220 199 172 141 112 93 91 107 131 150 161 169 181 198 215 225 223 208 186 167 160 168 184
14253 184 203 222 241 261 279 292 303 312 317 314 306 300 294 285 271 263 270 287 292 270 228 185 159 152 161 180 204 231 255 272 276 266 245 218 190 165 142 120 95 70 53
14236 53 52 65 88 116 148 180 207 226 237 241 240 235 235 241 249 252 248 242 238 237 237 235 231 230 235 244 249 240 219 198 186 182 177 164 143 122 111 117 142 184 237 291 335 360 361 343 311
14218 311 274 244 230 235 252 267 277 282 287 290 286 273 254 241 239 249 264 275 280 280 281 284 286 283 273 254 229 209 201 210 226 236 234 226 214 197 173 147 122 95 68 49
14201 49 47 59 72 77 79 88 102 116 126 133 136 136 137 142 151 162 174 184 185 180 179 191 215 238 258 275 285 281 259 229 198 173 159 154 152 144 131 121 120 124 127 132 147 173 203
14183 203 227 242 247 246 241 237 232 229 228 226 224 223 223 220 208 188 174 174 180 183 178 169 160 157 163 179 197 205 201 194 193 200 206 203 188 172 173 199 236 263 268 258 245 235 224 212 195 175 160
14163 160 157 168 182 184 172 157 153 163 180 194 202 211 221 228 229 226 222 220 217 216 218 223 223 217 211 210 214 220 230 244 255 255 243 223 204 191 187 195 210 221 221 212 203 200 198 191 173 148 125
14143 125 111 110 120 135 150 163 177 195 217 236 244 237 220 197 175 158 147 140 133 120 112 121 155 200 235 245 234 212 191 181 184 198 218 238 255 264 258 238 213
14128 213 200 203 214 224 230 238 251 262 259 239 210 188 172 156 132 103 80 68 66 77 99 125 142 149 151 154 156 154 150 148 147 144 143 152 177 208 232 238 225 202 186 188 208
14110 208 235 253 255 239 213 187 168 158 154 152 154 161 174 188 194 189 177 167 161 158 160 170 188 202 203 191 175 158 139 118 103 106 127 155 174 178 168 151 131 104 70
14094 70 33 5 -4 6 37 80 121 147 152 144 137 138 149 164 179 191 196 194 191 195 208 227 240 238 224 209 202 206 211 208 196 183 180 186 195 204 211 214 208 195 187 193 207 223 234 244
14075 244 251 251 245 236 228 225 227 236 247 248 238 222 209 201 197 193 185 170 152 138 136 143 152 158 158 156 154 156 168 187 203 208 205 200 199 199 200 200 201 204 210 213 209 195 176 158 146 143 151 166 182 192
14055 192 195 192 183 164 137 111 98 98 104 113 128 150 170 184 194 210 232 250 254 245 229 209 190 178 182 195 206 206 199 193 190 190 196 211 227 233 222 204 194 198 203 200 192 191 201
14036 201 218 233 242 244 235 217 192 165 143 130 133 149 169 179 169 142 106 73 50 42 54 79 109 131 137 129 115 105 104 110 117 123 124 124 125 129 140 153 161 158 150 145 150 161
14019 161 174 190 208 225 228 217 197 172 148 133 137 163 198 223 230 219 200 177 158 148 151 161 174 185 191 186 168 141 117 103 94 78 51 24 12 15 27 41
14004 41 64 98 136 170 195 207 201 174 142 125 133 156 176 186 189 191 198 213 237 265 290 304 309 306 295 274 246 216 195 189 200 223 252 275 285 279 260 236 214
13988 214 194 176 165 167 184 206 221 226 227 231 234 230 219 210 211 218 221 216 206 196 188 182 177 172 166 163 164 169 175 180 187 196 205 214 227 243 253 249 233 214 199 193 195 205 216 221 216 208 204 207 215
13967 215 222 226 228 230 228 217 200 181 170 167 170 178 189 202 214 222 230 238 245 247 242 229 207 182 158 141 130 123 116 106 90 66 38 17 7 9 17 26 35 52 82 125 170 203
13950 203 218 218 212 205 200 196 193 192 191 186 170 140 105 81 73 76 79 79 77 72 66 63 68 78 81 71 58 58 75 100 118 123 119 114 113 118 128 140 149 150 143 128 109 88 72 69 83 110 144
13930 144 177 201 212 213 212 211 204 183 151 120 97 81 69 63 64 71 75 74 69 63 62 71 92 120 149 174 190 196 194 190 184 172 151 129 115 110 105 101 108 130 160 184 193 193 191 189 192
13911 192 200 215 231 240 241 237 232 223 210 196 187 189 196 193 175 150 137 150 184 222 250 264 263 245 216 194 193 211 229 231 220 203 181 151 114 78 52 35 29 34 49 70
13894 70 94 115 130 135 134 139 153 165 165 161 168 194 229 256 264 255 235 212 190 174 169 177 199 228 260 286 300 299 289 282 279 272 253 226 206 201 210 228 246 259 259 243 221
13877 221 205 200 200 195 182 160 134 107 81 63 54 57 68 84 102 120 139 158 177 191 199 202 204 209 216 219 217 215 214 209 196 178 165 163 167 167 155 136 123 123 132 142 150 161 180
13859 180 202 217 218 215 218 231 247 257 260 254 240 218 198 190 196 207 211 201 179 153 133 128 136 148 159 170 187 209 229 242 246 242 234 226 222 220 218 210 196 178 164 162 176 198
13841 198 211 208 195 177 156 132 109 92 80 68 60 68 93 129 159 176 179 177 177 184 194 201 203 199 192 187 189 200 210 207 189 167 153 150 150 145 133 117 105 101 100 97 92 91 96 100
13823 100 94 85 88 109 134 145 136 121 118 136 169 200 214 214 211 216 225 233 238 241 236 215 178 138 109 97 100 112 130 151 172 186 192 193 192 191 189 185 180 178 181 183 177 160 135 107 86
13804 86 79 87 105 125 141 151 153 141 119 100 96 108 125 136 141 148 154 153 142 127 118 115 119 125 128 123 116 116 127 143 156 164 172 181 191 201 213 225 229 224 212 199 184 167 150
13786 150 145 152 169 188 206 222 233 234 219 191 162 144 143 151 157 156 146 132 120 114 115 123 139 166 202 235 260 279 296 304 296 272 246 226 214 212 220 238 256 267 269 261
13769 261 242 217 196 189 196 206 209 206 204 212 235 270 306 333 351 365 382 400 410 405 381 344 308 283 274 276 285 298 313 326 337 351 366 378 375 356 332 314 305 301 299
13753 299 295 286 269 250 240 241 247 254 267 291 315 324 320 316 322 333 343 351 356 349 328 302 286 281 283 291 306 325 346 371 404 441 472 491 500 512 540 594 666 742 806 852
13736 852 884 918 983 1101 1274 1490 1750 2079 2502 3041 3725 4557 5432 6105 6318 5986 5266 4417 3627 2961 2417 1988 1662 1414
13726 1414 1223 1080 973 882 793 707 633 575 531 500 480 468 461 450 432 407 386 373 367 358 342 326 315 306 298 289 284 281 279 276 277 284 295 304 299 277 246 216 190
13710 190 165 139 117 106 110 130 160 190 205 199 175 144 117 102 104 118 133 141 139 133 132 141 157 170 170 159 145 131 112 89 66 51 42 37 41 63 99 140 172 189
13694 189 190 182 172 164 159 150 139 133 131 131 131 136 145 153 151 138 117 90 62 36 20 16 24 38 55 75 96 116 131 138 140 144 147 146 142 142 155 175 188 186 173 160 153 154 161 169 174 170 158
13675 158 142 127 115 113 128 159 192 213 218 213 204 193 180 165 146 125 115 126 147 161 153 132 110 90 73 62 65 79 97 114 131 146 158 165 167 168 166 163 157 148 139
13658 139 134 133 131 127 122 121 127 135 142 143 140 137 140 154 178 205 226 235 234 228 224 225 228 230 231 233 235 233 227 216 200 184 174 176 189 203 210 213 212 205 188 168 157 157 160 157 148 145 154 175 204 235
13637 235 261 271 262 241 222 213 214 220 228 234 233 221 200 179 163 155 151 147 141 139 144 154 163 166 169 178 189 197 209 230 258 277 281 278 278 277 265 236 197 164 148 152 167 177 176 168 162
13618 162 161 163 164 165 162 149 132 123 131 153 181 208 229 240 238 225 212 210 216 221 217 203 185 169 157 142 120 93 68 54 55 70 93 119 141 152 146 123 89 58 42
13602 42 48 72 105 136 159 171 175 178 183 193 208 224 233 232 223 214 206 194 182 180 194 216 232 236 230 219 203 183 164 152 151 160 175 192 205 209 206 200 196 191 181 165 151 151 168
13584 168 193 216 232 239 234 218 198 180 169 163 160 157 155 154 155 160 162 154 138 126 126 133 145 158 174 188 195 198 205 216 224 221 213 207 202 190 165 135 112 105 110 123 144 171 197 207
13565 207 193 165 135 111 89 66 45 35 36 47 59 64 57 40 23 14 17 30 49 73 102 131 151 153 139 120 105 94 83 74 70 74 86 111 150 195 233 256 269
13550 269 274 264 237 211 204 220 244 261 267 263 254 246 242 242 242 234 217 192 163 144 141 153 170 186 200 216 229 235 232 221 204 185 171 168 176 189 198 199 196 194 193 190 184 182 187 196 202
13531 202 203 200 192 175 149 124 112 115 125 139 156 176 194 204 205 197 187 180 180 183 181 173 159 145 133 126 129 139 151 159 163 164 162 153 137 118 100 91 98 122 152 174 181 178 171 158
13512 158 137 111 89 81 85 94 99 101 106 115 125 132 134 133 130 123 114 106 100 95 95 101 113 127 144 173 213 254 280 291 293 293 291 284 274 266 268 282 304 325 340 352 366 381 388 387 377
13494 377 352 307 246 191 154 131 109 80 47 18 1 0 12 32 52 70 89 107 120 125 126 129 139 159 185 209 226 234 232 220 197 170 148 134 128 125 126 131 142
13478 142 160 183 211 238 258 269 268 260 248 238 235 243 261 283 300 307 304 298 294 295 302 307 301 283 261 247 242 236 222 203 189 186 197 217 243 269 293 309 306 279 237 206
13461 206 207 236 270 288 284 270 257 247 239 229 217 203 188 173 167 169 174 172 157 131 102 78 67 73 94 121 146 163 170 167 155 145 144 158 180 200 210 211 211 217 229
13445 229 241 249 253 251 244 239 243 255 268 271 261 240 210 181 162 160 168 176 178 178 181 190 202 206 199 184 173 173 177 178 175 176 185 199 214 224 227 222 214 215 230 251 264 263 254 245 244 255 277
13425 277 298 304 294 275 261 255 252 248 245 244 248 249 242 225 208 201 209 225 239 247 251 257 262 265 264 262 261 263 268 273 274 271 265 256 246 236 229 226 225 223 219 215 205 188 170 162 172 196 221 236 239
13404 239 234 229 230 236 236 227 215 208 212 219 222 219 212 208 212 223 234 239 238 236 237 241 250 266 279 276 254 225 199 175 143 101 56 22 3 -4 -6 -8 -9 -6 3 19 39 57 71 82 91 97 101
13385 101 105 114 128 143 154 157 157 158 167 184 208 234 259 279 292 296 294 287 277 265 251 238 226 214 198 183 182 200 229 256 269 269 262 254 248 243 240 242 246 246 235 220 212 213 207
13367 207 184 147 113 97 100 113 127 132 126 116 110 109 104 88 70 65 79 104 126 139 143 141 143 155 180 206 221 222 217 214 214 215 219 229 236 229 206 181 168 165 159 142 118 99
13349 99 93 104 129 160 184 191 182 168 158 151 137 115 100 103 123 143 151 151 152 158 165 161 145 126 116 117 120 119 118 128 148 167 171 162 149 146 161 195 236 264 269 253 225 189
13331 189 147 106 80 77 84 83 66 45 35 43 62 85 105 124 142 161 179 191 193 185 172 161 155 153 150 141 123 100 81 72 72 77 82 87 93 99 106 116 131 153 181 212 238
13314 238 256 268 279 286 287 280 267 246 216 182 155 142 137 134 135 145 163 178 183 178 167 151 132 114 106 110 123 139 158 181 203 216 214 202 189 180 177 177 180 186 196 207
13297 207 219 236 259 285 308 319 316 306 292 279 268 261 254 241 218 191 172 168 177 195 211 218 213 202 197 197 194 179 158 138 124 113 106 106 109 109 100 82 62 47 47 61
13280 61 82 98 105 107 114 128 144 153 156 157 163 171 172 163 150 143 149 166 187 199 193 167 133 104 88 88 99 111 120 124 130 141 156 171 188 203 215 221 231 249 272 291 302 309
13263 309 314 312 302 287 271 257 248 244 240 232 223 222 227 232 234 242 259 277 282 268 238 202 173 159 158 163 167 170 172 170 159 143 127 119 123 142 171 197 209 205 189 166 140 120 110
13245 110 110 110 102 86 70 63 63 63 63 69 89 119 148 170 192 215 230 228 210 187 164 140 115 97 92 98 110 127 150 174 194 210 222 227 217 190 154 124 111 119 140
13228 140 165 187 202 209 209 209 212 214 210 198 176 150 128 122 134 154 162 147 110 66 30 9 2 4 10 21 39 66 94 115 123 117 110 111 121 130 131 127 125 128 132 140 161 196 230
13210 230 246 240 225 212 204 199 197 200 208 221 237 248 249 240 234 246 274 304 321 320 304 274 231 187 158 149 156 171 192 214 226 222 208 197 192 190 191 197 208 220 234 245 248
13193 248 238 219 205 200 199 200 203 206 205 197 191 192 198 203 204 200 187 168 153 148 148 144 134 116 90 62 43 45 66 88 101 106 114 130 153 177 192 194 190 192 207 229 242 243 238 238 240
13174 240 236 222 203 189 177 162 142 124 116 119 129 144 162 178 187 187 178 163 150 142 143 151 159 165 169 174 184 198 212 220 221 215 204 190 179 180 197 226 258 283 299 306 308 303
13156 303 293 281 267 251 230 206 185 171 160 144 119 90 64 49 45 47 48 48 47 45 43 43 55 82 112 133 139 135 128 118 109 103 101 103 105 108 107 96 75 51 34 26 27 35 47
13138 47 56 55 44 33 31 38 49 57 63 68 72 78 88 107 131 151 159 162 169 181 191 193 187 180 180 190 207 217 212 193 176 169 169 173 183 202 230 259 283 293 287 267 243 221 201
13120 201 183 169 162 161 162 160 152 139 128 127 134 142 147 153 167 183 188 176 154 131 113 105 108 121 137 146 141 126 112 107 107 110 117 129 143 151 155 163 175 180 178 176 182 192 201 206 210 214 217 217
13100 217 210 192 166 146 139 140 143 144 142 142 148 168 201 236 265 287 300 303 295 281 270 259 252 251 257 261 254 237 214 192 180 186 205 224 231 234 241 251 257 261 268 276 279 275 266 252 235
13081 235 222 216 215 220 236 260 283 299 314 334 353 362 360 341 304 260 231 227 230 222 207 195 184 175 180 205 236 263 297 347 399 432 447 458 464 458 451 460 483 508 540
13065 540 583 622 648 679 734 802 871 967 1110 1283 1462 1676 1968 2340 2787 3370 4176 5259 6688 8582 10861 12939 13920 13298
13055 13298 11428 9181 7223 5707 4536 3650 3023 2576 2226 1949 1745 1582 1434 1311 1226 1165 1114 1086 1081 1074 1053 1039 1053 1078 1098
13045 1098 1120 1157 1218 1320 1488 1739 2096 2614 3294 3948 4264 4062 3472 2791 2222 1790 1461 1217 1045 913 803 723 673 635 603
13035 603 583 568 540 500 468 448 423 384 344 311 288 280 291 309 307 283 257 246 246 253 274 307 336 353 362 363 347 318 290 270 247 215 185 171 174 186 204 225
13020 225 243 254 264 272 271 265 266 275 279 277 279 292 303 303 297 293 287 271 253 240 231 223 222 228 232 226 216 213 215 214 213 218 228 235 241 252 261 258 238 216 205 209 224 244 265 287 310 336
13000 336 359 376 388 397 401 397 389 380 374 369 362 353 340 328 321 318 316 310 306 307 312 317 317 312 297 275 249 221 191 158 132 120 120 125 134 148 164 176 179 176 168 154 139 128 130 146 172
12982 172 194 202 191 170 152 146 151 162 176 190 204 212 212 205 196 191 193 201 214 229 240 241 232 220 212 208 209 209 201 181 159 150 161 181 191 187 177 169 164 161 158 151 140 131 129 136 147 156
12962 156 164 173 183 192 196 193 190 195 207 219 228 236 237 225 203 186 181 181 183 192 217 248 268 272 268 257 236 209 191 189 201 220 249 284 314 328 325 316 309 308 306 299 286 269 249 226
12944 226 209 203 208 220 234 255 279 289 276 250 225 209 197 190 195 212 233 248 256 250 228 192 159 139 132 136 150 173 194 205 205 198 189 181 178 183 194 206 219 228 230 228 225
12927 225 220 209 188 162 138 122 111 103 96 89 86 92 104 112 109 100 92 96 111 134 153 164 169 180 199 219 231 239 249 263 276 281 274 253 225 200 186 184 190 198 199 186 164 149
12909 149 156 184 217 237 240 233 223 216 213 214 220 225 216 184 139 98 74 65 64 68 76 84 90 93 95 95 93 93 100 111 119 122 120 107 82 51 25 12 12 20 33 50 68 92 119 145 161
12890 161 162 152 141 139 150 166 178 181 174 158 137 117 109 119 141 164 179 184 183 183 189 202 214 225 234 244 253 261 268 275 279 277 270 259 244 223 200 181 170 171 182 195 200 192
12872 192 179 174 173 169 153 132 113 101 93 84 74 66 67 75 85 96 112 136 165 191 215 243 271 294 312 328 340 342 327 298 263 230 206 193 189 187 184 181 177 170 162 156 154
12855 154 155 151 143 131 119 112 113 125 140 152 155 150 141 132 128 129 133 136 142 152 169 191 212 229 237 237 230 222 218 219 221 223 225 224 216 197 172 150 141 138 134 125 114 102 90 78 72 72 80 90
12835 90 96 95 88 83 80 77 74 76 85 96 106 121 143 171 194 211 224 229 220 197 173 157 150 150 159 175 192 204 212 220 229 236 239 236 227 212 197 185 180 183 196 213 225 230 231 232 231 231 235
12815 235 238 232 212 184 159 141 131 125 122 119 119 129 153 185 215 235 243 235 215 191 175 170 173 180 189 197 204 209 215 221 229 237 244 246 242 232 218 199 182 173 173 175 169 155 137 123 119 132
12796 132 157 187 214 236 255 268 277 284 293 296 285 261 235 220 221 232 246 257 262 259 242 206 156 112 91 90 98 105 105 96 80 64 60 70 87 105 125 148 169 186 200
12780 200 211 214 208 194 181 171 168 173 185 201 213 220 219 212 203 192 177 156 134 116 104 89 67 44 31 35 58 94 131 158 170 169 158 142 121 102 92 92 103 123
12764 123 150 175 187 184 171 160 159 169 184 191 183 158 125 93 68 54 51 56 67 81 98 120 143 161 167 164 156 149 145 144 147 152 158 164 171 179 184 181 169 156 148 144 143 145 147 150 154 160
12744 160 168 178 193 213 230 236 230 225 227 234 242 251 259 263 259 252 247 244 234 219 206 198 193 195 211 236 256 258 246 234 228 227 227 230 239 249 253 248 233 210 186 166 155 155 164 180 199 216
12725 216 229 237 240 232 211 181 159 155 170 189 205 212 213 205 191 180 177 183 195 210 226 240 249 257 266 277 285 285 281 278 274 267 256 245 239 234 220 192 159 133 122 125 140 169 205
12707 205 232 235 211 175 144 124 111 100 91 87 90 96 104 113 123 132 141 152 168 186 199 206 209 210 207 196 181 166 153 141 135 134 139 146 158 174 189 195 193 189 188 190 190 187 182 178 179 185
12688 185 190 187 174 160 147 136 126 120 123 133 145 155 162 166 168 167 161 149 136 126 123 128 140 155 166 167 161 154 152 153 157 170 193 222 244 250 241 227 218 220 230 232 219 195 173
12670 173 162 160 159 152 138 119 107 109 124 145 163 175 183 187 189 191 197 205 210 210 213 224 244 263 274 271 258 239 222 209 197 181 160 144 138 147 171 207 247 282 301 302 289
12652 289 268 246 228 211 193 172 150 132 118 105 90 77 70 74 88 104 117 125 129 130 123 110 97 88 81 71 59 49 41 36 39 57 82 99 97 87 88 109 140 165 175
12636 175 171 161 149 134 119 109 111 127 152 175 194 208 215 213 198 177 162 161 169 175 175 172 168 161 149 137 133 139 152 171 199 232 259 269 264 255 250 251 257 264 271 276 275 265 245
12618 245 216 184 150 120 97 87 86 91 97 105 121 143 166 182 186 180 172 170 176 184 189 184 170 152 136 129 133 145 158 167 170 166 161 160 160 156 145 131 120 115 113 112 110 106 98 88 79 73 72
12598 72 74 77 79 81 83 87 90 89 86 82 86 101 118 125 118 102 94 102 124 153 180 198 206 206 210 227 255 285 309 321 319 303 276 241 206 178 163 164 179 201 218 222 214 203 197 199 210
12579 210 234 267 299 316 318 310 302 296 293 298 304 302 285 257 227 200 178 161 147 132 117 104 93 85 79 82 97 119 139 158 180 206 230 245 247 234 215 198 188 182 172
12563 172 160 158 173 199 225 239 239 230 224 226 232 232 222 207 199 206 231 260 276 269 247 227 217 213 210 206 205 204 198 188 176 166 164 168 174 178 180 189 208 233 252 255 244 224 201 172
12544 172 136 101 80 78 87 97 104 113 123 130 131 128 129 138 159 188 213 224 224 224 231 240 246 244 239 232 226 224 230 246 271 300 323 328 309 271 229 195 178 175 182 190 200 216 240 266
12526 266 289 306 319 329 337 342 343 340 340 345 350 339 304 254 210 185 176 172 162 147 130 117 109 101 91 82 74 70 72 80 85 84 80 83 99 117 131 142 156 168 170 162 154 152 156 163 170 176
12507 176 180 186 196 205 207 206 210 222 237 251 266 274 265 234 196 175 180 202 223 233 231 223 214 206 203 206 214 221 223 217 202 178 145 112 90 88 101 118 131 142 155 171 187 201
12489 201 211 219 224 225 227 233 246 265 286 305 319 332 345 354 352 336 311 289 277 277 282 289 290 274 239 200 176 175 187 196 194 184 170 157 145 132 116 98 83 76 81 92
12472 92 96 87 68 56 60 71 77 72 65 61 62 64 69 76 89 104 117 125 132 147 173 201 218 220 213 202 192 187 194 212 228 231 217 191 161 139 133 144 160 173 182 192 202 206 203 192
12454 192 175 152 131 118 115 120 129 140 150 155 155 155 155 152 152 162 184 208 221 219 205 190 179 179 189 205 215 210 191 173 166 169 173 173 170 164 152 132 118 117 127 138 146 160
12436 160 183 213 241 261 268 256 231 208 199 207 222 237 246 245 231 209 187 172 160 149 144 153 175 201 216 217 207 193 179 167 158 152 153 161 174 191 208 221 228 224 208
12419 208 183 157 135 116 99 81 66 60 67 90 125 163 200 236 266 281 272 239 195 154 122 102 93 90 88 88 93 105 120 132 140 143 139 132 129 141 168 197 215 219 215 212
12403 212 212 213 210 203 193 185 179 174 170 171 175 173 155 123 92 85 104 134 153 152 135 110 78 44 14 1 8 31 61 90 112 131 153 182 214 241 265 281 287 279 263 246
12386 246 229 208 184 164 155 151 142 123 100 86 91 111 135 153 169 192 220 238 237 224 215 216 223 229 233 240 253 271 290 300 294 279 269 269 275 275 268 259 256 264 284 310 332 345
12368 345 350 354 356 355 350 347 352 364 378 387 389 383 369 350 324 293 263 240 225 213 198 183 173 169 160 143 127 122 127 128 119 108 106 115 128 138 143 145 146 152 162 173 179 178 176 175 175 180
12349 180 199 229 261 281 284 278 269 261 249 232 209 186 170 167 177 194 213 230 247 264 279 289 293 288 281 278 283 295 311 325 331 323 306 294 293 293 277 242 199 166 151
12332 151 153 165 178 186 193 202 217 237 258 274 276 259 224 186 161 154 157 157 150 143 142 148 159 171 180 182 174 154 127 93 59 34 32 56 85 100 101 104 118 132 132 119 104 90
12315 90 74 55 34 12 -6 -19 -16 7 43 76 97 105 102 90 72 56 49 55 70 82 85 79 72 66 63 58 54 58 75 105 141 169 183 187 186 181 170 153 135 122 117 119 121 119 110
12297 110 101 107 134 177 217 242 254 265 276 283 282 279 281 287 290 287 281 272 261 247 235 229 222 205 174 139 112 96 86 80 78 82 87 88 84 80 75 68 58 55 68 96 125 142 143 136 127
12278 127 124 124 127 130 135 142 146 142 127 105 80 57 42 37 45 63 84 106 124 132 131 122 111 97 81 67 62 70 88 114 142 171 198 220 236 243 246 251 258 264 261 248 224 193 161
12260 161 138 134 149 174 197 213 221 227 236 248 261 266 259 237 203 167 142 137 142 141 129 114 102 92 83 78 80 90 103 119 137 153 163 167 161 144 117 89 73 72 83 100
12243 100 115 121 117 107 99 93 91 95 106 118 121 114 104 99 100 103 107 113 127 150 179 205 220 224 225 232 242 248 245 237 229 228 234 243 248 246 239 234 232 230 226 223 223 223 218 208 199 196 196 199 208 227 252 273
12221 273 293 316 339 347 332 303 277 262 256 254 253 253 251 247 238 225 210 194 180 173 175 183 187 181 163 138 115 97 90 93 104 117 128 138 148 152 145 129 111 99 88 80 78 84
12203 84 93 95 91 88 85 81 77 82 99 122 145 167 191 215 229 227 215 205 198 189 174 160 155 160 163 152 126 95 70 59 66 92 126 153 161 153 141 133 130 127 125 125 127 124 116 108 102 99 95
12184 95 94 100 117 142 169 189 199 198 191 184 182 191 213 243 267 279 280 278 275 267 249 228 210 202 200 200 200 202 209 222 239 256 266 268 260 242 217 191 171 160 149 135 118 105
12166 105 102 109 125 147 167 179 177 166 153 144 139 138 141 147 153 153 151 148 148 152 162 179 195 202 203 209 223 238 244 238 225 214 204 194 184 180 188 207 224 228 214 190 167 155 159 174
12148 174 191 206 217 228 241 253 261 265 268 271 272 265 248 225 206 196 196 201 208 224 248 272 281 268 243 223 213 206 193 173 151 137 141 163 199 229 239 227 210 204 211
12131 211 221 223 219 217 221 229 233 230 222 211 195 172 144 118 98 78 58 44 40 45 53 62 78 102 129 154 174 186 192 198 210 228 245 253 249 234 213 197 194 201 205 202 197 192 190 194
12113 194 206 221 227 218 198 176 155 135 121 119 127 140 154 164 168 163 155 148 142 135 124 108 83 47 9 -19 -33 -34 -24 -10 0 3 10 29 59 85 98 106 119 137 160
12096 160 186 218 249 270 273 264 247 223 190 150 115 94 84 68 34 -7 -39 -48 -33 0 44 92 132 159 172 172 166 161 159 153 136 120 121 144 171 186 183 169 148
12081 148 125 106 94 85 73 61 57 66 79 84 76 59 48 47 51 53 51 55 65 75 76 71 67 67 71 86 111 135 145 146 148 149 140 119 96 79 72 73 82 97 114 131 150 168 179
12062 179 181 179 180 180 174 166 161 161 160 156 150 141 128 118 119 127 133 126 113 108 114 120 114 94 73 69 85 118 163 215 269 313 335 330 306 273 241 212 184 156 129 105 85 68 59 62
12044 62 74 86 89 78 52 16 -22 -56 -76 -79 -69 -51 -26 5 40 75 107 130 146 158 170 180 180 170 157 149 152 164 181 199 215 226 230 228 225 226 232 242 251 258 262
12028 262 264 267 269 266 257 237 207 169 134 112 107 114 128 148 174 197 206 196 172 142 113 90 72 58 48 46 56 73 88 96 96 89 79 73 81 101 121 127 119 107 104 113 128
12010 128 137 139 135 134 139 147 154 160 162 158 149 145 148 150 145 133 123 123 133 146 155 153 139 118 101 94 98 104 104 93 78 72 84 112 147 180 204 213 208 196 189 191 200 207 206 197 188 189 198 207 207 201 198
11989 198 200 203 208 221 245 274 293 294 279 259 245 238 234 225 213 202 194 186 177 167 157 147 140 138 141 145 150 159 171 185 197 204 208 207 205 206 210 214 213 209 206 201 194 185 178 172 165 154 141 131
11969 131 126 129 132 127 112 97 96 109 121 119 106 96 95 97 102 113 132 150 156 151 148 151 153 147 139 136 137 136 132 128 122 111 97 93 103 117 124 124 127 142 170 212 265 316 344 343 318 285
11950 285 253 230 222 226 232 230 219 208 202 200 199 200 204 209 215 219 220 215 202 181 162 152 154 157 152 141 137 143 148 135 103 63 30 10 3 7 21 39 56 68 78 90 103 113 117 116
11931 116 113 110 103 91 83 88 110 136 160 181 205 227 234 220 194 172 160 155 154 153 154 156 157 154 145 131 118 115 125 141 152 154 150 145 143 140 131 119 113 113 114 110 104 101 105 108 106 99 95 94 93
11911 93 91 92 98 105 106 104 105 112 124 134 138 141 144 152 163 179 200 224 247 266 279 285 288 291 298 308 313 305 287 267 254 245 234 218 206 204 214 229 241 246 241 228 212 199 193 194 201
11892 201 208 211 209 204 198 193 188 180 168 152 137 128 124 118 106 89 72 57 45 36 35 42 58 82 112 142 163 172 174 176 179 183 186 189 193 193 188 179 169 159 149 144 150 165 180 187 187 186 187 187
11872 187 186 182 178 175 178 193 219 242 250 238 220 206 198 193 187 180 167 145 115 85 57 33 15 6 7 16 29 41 53 63 69 73 79 90 105 122 138 154 172 189 193 177 149
11854 149 124 114 118 126 132 133 130 125 123 124 122 111 95 88 97 116 131 130 116 95 75 60 52 49 52 63 85 115 141 156 162 164 162 150 135 132 148 169 180 176 170 169 169 166 161 159 158 159
11835 159 163 174 185 190 191 192 192 188 178 169 161 154 147 143 143 141 135 128 126 129 132 134 137 145 159 175 186 191 189 185 179 169 159 158 172 198 223 234 229 217 207 197 181 160 145 144 158 177
11816 177 191 196 191 181 169 162 159 158 161 172 189 204 211 212 213 219 230 239 238 221 195 177 175 179 177 164 145 123 101 83 73 69 60 44 29 25 35 53 73 99 132 162 172
11799 172 156 127 104 98 105 113 119 124 128 133 137 138 136 133 133 138 144 145 144 147 160 179 198 214 229 242 251 258 266 270 264 243 210 174 143 120 110 107 108 105 99 92 90 97 112 129 138 138 133 127 117
11778 117 106 102 113 141 176 205 220 222 212 195 182 178 181 185 186 185 182 173 159 143 135 132 127 116 99 84 74 70 72 79 89 99 107 115 124 135 142 137 116 88 70 71 85 98 102
11760 102 99 95 94 95 97 100 103 105 105 109 120 137 159 185 216 247 272 286 288 276 252 223 196 177 161 149 145 150 158 158 149 143 146 156 166 170 171 173 183 202 221 224 205 176 160
11742 160 166 187 207 217 219 211 194 173 154 142 138 140 149 164 182 196 204 208 215 224 226 220 208 195 187 183 179 174 169 170 181 193 198 193 189 194 205 216 226 235 238 229 211 191 171 139 94
11723 94 47 18 12 19 28 40 61 90 121 152 182 215 250 282 306 316 309 290 267 252 244 240 234 224 212 196 174 150 131 125 127 128 123 120 123 133 144 153 161 173 187 201
11706 201 214 227 239 250 256 259 260 258 253 241 220 187 145 98 58 33 28 40 62 88 112 129 139 145 148 147 143 144 158 179 195 197 188 177 171 169 172 181 197 217 234 241 233 215
11689 215 195 181 177 178 178 170 152 126 100 80 69 60 50 41 37 42 52 59 55 40 21 9 11 25 40 43 34 19 7 -2 -16 -30 -39 -38 -24 0 32 61 80 88 92 99 107 109 105
11671 105 98 94 97 109 127 149 169 184 189 182 172 170 185 209 230 239 238 229 216 201 187 174 161 147 136 128 122 117 112 105 93 83 85 99 113 114 106 98 94 90 84 80 81 85 86 85 87 97
11651 97 116 138 156 166 168 166 160 147 131 118 110 108 106 105 104 104 107 111 122 140 165 188 201 200 188 175 165 158 144 120 94 80 81 92 102 112 123 138 151 159 167 179 189
11634 189 183 161 137 126 128 129 120 97 70 44 22 9 6 9 9 2 -9 -11 1 26 50 65 74 88 108 129 144 157 177 202 222 231 236 241 240 230 214 198 181 156 130
11618 130 115 114 115 108 97 89 81 68 49 31 17 7 3 8 23 45 69 90 99 93 75 52 31 16 10 13 19 21 21 27 44 68 91 109 118 121 117 107 96 83 73 70 81 105
11600 105 134 153 156 149 144 138 121 90 59 43 43 50 61 78 102 131 162 193 217 228 225 219 218 226 238 251 260 262 256 251 251 252 244 222 188 153 130 123 129 139 149 158 162 155 141
11582 141 130 128 129 124 110 95 82 68 55 49 53 61 66 64 59 54 50 46 48 59 78 95 101 95 82 72 65 65 75 96 123 148 172 197 218 223 209 183 161 149 145 143 137 126 110
11564 110 89 64 43 31 32 44 64 90 122 155 177 185 189 204 229 254 267 268 262 252 243 235 228 214 188 153 121 99 87 81 76 70 60 49 44 48 60 75 89 104 119
11547 119 132 143 153 158 158 154 146 128 96 52 12 -12 -17 -10 0 8 17 27 36 37 32 29 36 48 57 61 63 62 58 56 63 80 102 128 159 185 201 208 217 230 235 228 213 200 191 185 188 200
11528 200 209 207 201 202 214 224 224 218 209 199 187 175 161 149 145 159 188 224 253 265 259 245 232 226 224 219 210 197 182 170 175 202 239 263 264 253 242 241 253 283 328 375
11511 375 408 419 409 381 347 316 294 284 287 302 326 348 360 361 356 349 343 332 312 282 257 251 265 286 303 317 332 346 349 335 307 275 252 240 236 233 235 242 254 261
11495 261 259 248 230 207 187 178 180 189 202 216 225 223 213 203 195 188 182 186 203 220 224 212 195 180 169 159 150 142 138 143 154 165 170 171 170 171 178 193 210 221 225 228 235 239 230 207 177
11476 177 153 139 136 136 137 139 151 173 199 223 244 261 267 260 246 236 229 225 222 226 236 247 257 263 270 277 288 300 311 320 333 350 372 404 445 488 516 519 506 491 480 473
11459 473 468 456 429 390 354 336 338 349 361 370 377 383 390 388 372 357 362 392 430 460 482 503 518 521 514 495 462 421 386 362 339 311 289 280 271 259 258 280 319 362 413
11443 413 472 522 557 593 643 695 733 773 836 913 987 1071 1181 1310 1452 1643 1921 2280 2722 3317 4148 5242 6654 8513 10782 12919
11432 12919 14024 13529 11724 9473 7482 5939 4739 3800 3101 2583 2168 1834 1589 1407 1249 1115 1023 963 911 868 846 831
11424 831 801 755 705 654 593 530 481 445 412 382 364 356 352 357 373 385 379 357 334 312 288 268 261 263 262 257 254 249 231 200 170 153 147 150 155 150 132 118 126 153 179 195
11407 195 201 200 186 163 145 140 146 158 178 205 233 260 284 302 310 310 308 306 302 301 313 337 359 368 363 348 324 300 285 282 282 278 269 256 235 204 167 136 119 119 129 143 157
11389 157 178 210 247 274 283 279 274 272 274 280 289 299 307 309 301 286 268 253 241 231 221 213 208 201 193 185 180 181 191 208 224 233 234 236 242 251 262 278 297 312 318 319 315 306 295 285 279 273
11370 273 265 259 254 247 235 220 209 202 201 203 203 196 183 168 154 142 137 145 159 163 154 140 130 125 117 105 91 74 59 54 64 85 111 139 162 172 167 160 161 167 173 186 214 249 272
11352 272 271 254 232 207 187 181 196 222 245 255 255 250 243 232 215 192 165 144 132 129 134 144 150 148 139 127 113 92 58 23 -1 -13 -14 -5 17 54 99 138 164 173 171
11336 171 168 173 190 214 232 235 224 208 191 175 162 156 155 151 136 120 124 159 210 257 285 292 284 264 232 188 137 87 49 24 12 8 11 22 42 69 96 113 120 122 126
11319 126 130 128 118 104 90 84 88 101 111 110 95 75 63 66 84 110 132 138 128 110 97 96 108 127 142 147 144 138 129 115 94 83 96 132 170 189 182 163 148 143 146 153
11302 153 156 153 147 146 156 176 190 190 179 172 177 193 214 234 251 259 256 246 232 214 189 163 142 129 124 123 126 131 131 127 120 118 126 145 172 197 211 212 202 189 180 176 173 163 144
11284 144 121 101 92 98 117 140 157 161 155 142 122 91 54 23 10 18 41 67 89 102 106 97 76 50 30 19 13 9 6 8 15 30 54 86 118 145 169 199 236 265
11268 265 275 266 249 235 226 223 232 250 274 294 303 297 278 257 242 239 244 250 251 244 229 208 177 139 101 74 69 86 114 138 151 152 146 138 129 122 118 120 128 138 145 150 153 157 166 181 199
11249 199 209 206 196 188 184 183 184 189 197 202 203 198 187 170 152 145 154 173 197 221 242 257 261 258 249 231 206 181 168 170 182 198 214 223 218 203 188 178 162 134 100 78 77 86
11232 86 90 85 75 67 61 50 35 21 12 7 9 22 49 90 138 185 220 236 234 228 230 244 264 280 288 288 282 271 259 248 235 223 215 209 202 187 168 153 149 152 157 157 154 152 161 182
11213 182 205 219 220 213 205 194 178 159 142 131 122 111 98 86 79 76 73 71 77 91 103 105 100 99 105 108 98 80 64 60 71 97 131 159 167 157 143 137 143 152 158 164 176 191 201
11195 201 199 185 171 163 163 169 176 176 160 127 89 57 41 41 55 75 95 116 139 162 177 172 149 121 103 105 127 154 170 166 146 121 95 71 54 53 66 81 86 82 74
11179 74 71 74 78 78 72 71 80 100 119 129 133 137 142 147 149 149 145 138 135 146 171 202 233 262 289 305 307 295 275 259 253 257 266 274 279 283 284 278 258 227 195 172 160 158 165 182 206 229
11159 229 243 247 245 242 235 225 215 209 200 181 151 121 104 100 101 93 78 64 63 76 97 121 143 163 184 207 228 241 239 222 201 183 173 170 174 182 186 178 157 133 115 106 102
11142 102 98 94 90 85 79 75 75 80 94 117 141 152 143 120 98 89 93 107 128 155 183 209 230 247 256 253 239 224 212 204 195 186 178 167 148 121 101 95 104 118 136 159 185 209
11124 209 224 231 227 212 195 187 194 208 215 210 199 187 171 149 123 101 90 95 116 144 167 178 181 177 165 146 126 117 120 124 120 108 97 92 92 96 99 99 93 86 85 93 105 112 112 111 115
11106 115 121 119 106 89 76 72 75 80 86 87 81 68 55 48 45 45 42 35 29 30 41 56 69 74 73 72 76 85 93 89 72 54 48 55 69 87 112 136 151 156 160 161 148 118 82 58 48 48
11086 48 56 68 80 83 75 59 41 25 19 22 29 40 65 112 169 214 237 243 242 239 234 227 214 194 176 165 156 141 122 110 113 123 136 151 162 159 138 113 98 90 80 69
11069 69 65 68 77 94 127 172 219 262 301 334 358 373 382 385 371 333 279 225 187 173 179 195 204 198 185 180 192 215 241 266 289 311 329 340 339 329 315 309 313 323 328
11053 328 325 314 305 302 304 304 298 288 280 273 267 260 250 238 220 197 170 144 127 127 141 161 175 180 173 156 129 99 76 67 76 98 125 149 168 185 205 226 243 248 243 229 209
11036 209 186 165 150 141 136 136 144 161 182 197 201 199 202 213 226 232 230 228 227 224 212 194 179 177 186 201 216 224 224 217 206 197 192 195 204 212 210 193 170 149 132 118 111 115 126 135 135 129
11016 129 118 105 90 77 72 79 95 117 144 175 207 232 240 234 226 226 234 244 256 271 287 297 298 292 279 264 254 255 268 284 295 300 295 281 258 232 209 189 171 160
11000 160 162 175 192 203 206 204 200 195 186 170 151 133 114 90 63 46 44 52 58 59 65 81 108 133 145 138 121 111 115 124 128 128 133 143 149 146 137 129 124 122 121 120 114 101 85 71 60
10982 60 53 53 63 81 103 121 137 153 168 175 167 148 128 113 101 95 99 118 145 169 189 213 240 262 269 258 235 206 181 163 152 144 139 140 146 150 152 153 155 159 168 182 201
10964 201 217 230 238 240 230 208 187 178 179 178 167 142 108 77 64 67 76 83 90 106 124 135 132 120 104 85 69 61 64 67 67 66 77 100 124 141 148 151 152 148 136 116 97 86
10947 86 84 89 98 109 118 119 107 84 61 55 76 114 151 174 182 180 177 177 182 189 195 203 221 247 270 281 287 299 314 315 295 257 214 174 141 119 104 94 92 96 104 107 100 87 68
10929 68 46 24 6 -5 -10 -7 5 22 38 53 76 111 147 174 188 193 192 188 187 197 221 247 265 272 273 269 259 241 220 203 192 187 189 203 225 242 239 216 184 153 126
10912 126 106 95 91 86 79 74 72 72 74 86 114 153 190 221 246 261 266 263 255 243 227 216 216 225 233 237 242 253 263 262 246 218 190 175 183 205 225 230 223 213 212 223 238 243 232
10894 232 206 177 147 120 102 102 118 142 168 194 219 236 243 243 240 234 222 204 187 176 173 176 177 170 156 140 126 116 108 104 107 118 133 148 155 152 150 165 202 247 277 286
10877 286 275 253 228 206 196 194 196 199 206 213 209 190 168 155 155 160 163 165 171 180 181 166 140 112 88 64 38 20 16 25 36 48 65 85 95 89 76 65 58 54 57 70 86 94
10859 94 94 94 102 115 132 153 181 213 238 242 222 188 157 138 133 134 136 142 152 165 174 175 166 150 135 130 132 134 125 107 93 96 118 152 179 182 162 131 108 104 116 133 146 146
10842 146 129 100 70 52 49 55 65 80 100 128 163 201 237 262 279 296 318 335 333 308 275 249 231 214 195 178 170 171 179 190 204 214 218 215 210 203 196 189 189 200 218
10825 218 234 240 239 235 233 228 217 202 191 190 196 200 197 183 161 142 138 152 172 183 178 165 154 155 168 192 218 234 236 227 217 212 216 228 242 251 249 234 213 194 183 177 174 171 166
10807 166 157 146 138 139 145 145 139 134 133 133 128 121 121 130 141 151 164 181 196 201 200 202 207 212 213 210 204 198 196 202 215 227 234 238 241 244 250 259 273 282 281 270 256 246 243 247 257 266 265 245 215 187
10786 187 170 156 136 111 92 86 90 91 83 67 53 49 62 89 119 142 154 158 162 168 173 172 165 156 147 132 104 70 43 34 42 59 73 81 87 97 115 139 161 176 184 186 177 159
10769 159 136 118 108 101 96 101 118 142 158 156 138 114 91 71 56 48 49 54 52 41 27 21 26 30 27 20 19 22 22 18 20 38 68 97 113 112 97 72 44 24 18 24 33 38 34 29 28
10750 28 31 34 33 30 25 16 0 -15 -22 -13 3 17 19 12 2 -2 0 8 24 43 57 60 48 26 6 0 17 53 94 123 137 142 149 158 162 158 149 144 148 157 167 174 177 177 176 169 156 135 114
10730 114 97 89 86 87 90 92 95 102 115 130 142 150 165 187 210 219 207 177 138 100 73 59 55 53 56 65 77 87 98 117 141 159 163 160 153 142 121 91 64 54 65 90
10713 90 112 115 101 87 88 105 135 172 213 243 250 235 213 193 173 153 141 151 180 209 224 222 214 208 205 205 207 210 206 192 171 154 149 157 172 189 203 214 220 222 220 213 201
10696 201 189 185 186 186 180 178 191 221 259 288 299 294 284 276 271 263 247 226 206 197 198 207 217 226 235 242 242 230 208 185 165 151 143 142 144 142 138 145 168 193 198 179 153 137 134 139 146
10677 146 156 163 162 150 128 100 69 44 29 22 19 15 13 16 28 57 104 157 197 216 221 226 230 228 221 213 205 192 166 130 94 69 63 77 101 126 148 166 175 166 147 133 134
10660 134 142 144 136 124 114 108 104 99 92 82 72 63 51 37 30 40 64 90 108 115 114 112 116 132 153 167 170 167 164 161 156 150 142 127 108 91 85 90 101 111 112 98 72 47 38 50
10641 50 74 99 115 117 109 103 109 123 133 130 117 104 98 104 124 154 191 227 255 266 259 240 216 195 178 168 170 183 197 202 199 194 189 178 154 122 93 81 83 86 83 77 78 87
10624 87 98 109 122 134 143 145 142 139 139 146 157 161 153 133 109 89 74 66 66 71 73 70 66 68 82 103 129 152 166 169 164 156 151 150 152 151 139 118 96 81 72 71 82 104 126 134 125 106
10604 106 87 72 63 57 53 49 49 59 76 94 108 116 123 131 139 146 151 152 149 141 132 125 125 134 149 163 174 176 168 151 130 113 106 113 129 153 179 204 223 230 227 217 204 186 163 141
10586 141 126 118 116 116 122 132 137 132 119 108 104 107 111 113 115 120 128 135 137 136 135 136 136 135 132 131 131 134 142 153 159 158 154 153 152 146 134 124 119 116 116 118 119 114 104 91 78 67 59 58 63 71 83 102 129
10564 129 158 188 216 241 258 263 256 243 226 208 194 184 173 159 145 134 126 116 102 90 85 92 107 122 129 128 120 106 89 79 85 104 124 138 148 156 160 156 145 130
10548 130 116 109 113 122 121 100 70 53 56 71 85 97 112 129 142 143 135 129 133 144 151 144 126 113 117 139 168 192 204 201 185 157 126 101 90 92 102 119 140 162 175
10531 175 179 179 182 185 187 187 186 180 169 157 152 156 166 179 187 185 176 172 173 172 156 129 105 93 91 93 94 95 93 87 80 75 76 84 95 103 101 91 82 81 87 97 110 126 144 162 178 187 185 173 156
10511 156 142 132 126 124 127 136 151 162 155 126 84 48 35 46 77 116 142 144 124 98 75 50 25 10 15 30 38 33 25 18 9 1 0 8 19 27 35 48 62 72 80 94 114
10494 114 134 146 154 166 183 204 226 246 261 266 258 239 218 203 198 195 189 181 177 178 182 187 189 185 172 150 125 108 102 104 103 93 77 61 50 39 24 7 -2 0 16 39 66
10476 66 94 116 130 140 157 187 221 245 254 258 263 266 260 243 216 185 154 130 117 114 120 130 141 148 146 142 140 138 132 118 98 78 62 58 70 94 121 144 154 148 131 114
10460 114 110 122 143 165 187 200 198 177 144 110 85 71 68 70 70 69 70 77 84 85 77 62 46 34 35 51 77 100 117 125 121 105 90 89 108 133 148 151 152 158 166 177 192 214
10442 214 238 254 259 251 235 217 199 184 173 167 169 172 168 154 140 133 134 137 139 143 149 149 141 128 120 123 133 143 149 154 160 168 171 168 162 161 169 179 180 168 148 130 122 126 136 139 131 119 116 124
10422 124 133 139 142 148 160 174 184 191 193 193 193 191 185 176 166 159 157 155 151 147 150 164 179 185 180 174 172 167 150 123 98 83 79 84 99 125 155 184 208 229 248 261 263 252 228 198 169
10403 169 145 127 115 105 95 89 93 114 150 191 224 239 239 230 217 205 196 196 209 231 247 246 233 222 216 208 188 165 148 137 128 118 114 120 135 154 175 189 190 177 157
10386 157 140 128 126 132 141 148 149 142 133 123 117 118 125 130 129 127 133 149 160 154 128 98 76 61 44 21 -2 -24 -42 -57 -64 -58 -43 -24 -8 7 25 45 65 81 87 79 64 49
10369 49 44 44 43 35 23 11 0 -12 -22 -29 -34 -36 -31 -11 21 60 96 124 142 148 143 131 118 109 102 101 113 139 170 192 200 195 184 176 176 186 197 198 184 160 141 139 157 188
10351 188 215 224 215 199 185 178 175 178 188 201 208 204 192 181 181 191 204 221 245 274 297 299 281 254 232 215 197 179 161 145 128 114 112 120 130 134 130 120 113 113 122 132
10334 132 135 132 126 119 108 97 91 92 96 96 93 88 84 79 75 70 66 65 71 82 90 86 72 54 36 21 14 23 49 86 121 145 160 174 191 207 210 201 193 195 200 200 197 197 197 188 172 163 169 179 184
10314 184 185 190 197 201 197 189 179 163 138 108 81 62 54 52 51 50 56 71 87 95 96 104 132 174 216 246 261 263 258 252 246 235 216 188 155 120 87 63 56 63 78 96 112 124
10296 124 129 130 128 120 109 101 101 103 93 65 30 0 -21 -36 -47 -50 -42 -24 -3 9 8 -2 -11 -14 -13 -12 -4 16 48 79 98 102 93 82 79 91 117 148 170 177 164 132 91 54
10278 54 32 27 34 47 60 66 67 66 71 84 102 126 151 173 187 191 188 180 169 157 150 152 159 162 156 144 130 120 113 109 109 113 118 118 112 98 79 59 45 42 47 56 63 70 82 94 97 84
10259 84 62 46 45 54 65 78 101 134 165 180 178 168 156 148 147 156 173 192 206 213 212 201 181 161 147 142 138 129 114 100 92 94 103 111 107 89 64 48 48 65 90 114 135
10242 135 155 177 199 218 232 240 237 218 185 150 124 108 99 94 97 106 113 118 129 150 174 186 185 173 152 126 106 105 121 140 151 156 165 175 182 184 183 176 163 149 142 143 145 146
10224 146 150 155 158 157 154 153 155 164 177 191 201 202 196 183 162 137 115 103 105 115 122 119 112 115 137 173 204 216 204 183 165 162 171 181 184 179 173 168 163 156 153 158 171 184 194 202 204 198
10205 198 185 169 154 140 129 125 130 139 144 142 137 137 140 140 136 131 131 133 134 134 141 156 173 188 203 219 233 237 230 222 219 223 229 232 227 211 188 164 148 145 152 157 150 131 113 103 98 89 74
10185 74 63 64 77 93 107 115 118 118 114 104 92 88 95 104 105 95 75 48 16 -10 -23 -21 -11 0 9 19 25 24 18 8 -4 -16 -14 6 40 72 92 105 120 144 174 203
10168 203 220 219 198 163 123 94 82 81 77 62 43 37 49 73 99 120 131 129 115 100 88 82 79 79 82 86 89 92 99 116 144 177 209 228 228 213 197 190 189 183 164 140 125
10151 125 125 132 137 136 134 137 149 167 185 196 195 185 170 157 149 143 132 117 107 111 124 134 139 139 138 129 114 99 88 77 65 59 68 92 121 147 164 172 171 164 157 148 135 120 108
10133 108 105 109 118 125 128 124 116 109 98 79 52 23 2 0 18 51 83 96 87 67 52 52 65 91 121 147 164 173 178 177 168 154 138 120 98 76 60 53 53 55 60 70 84 97
10115 97 107 115 124 138 160 188 218 245 264 273 269 253 231 209 192 182 178 180 186 196 208 217 220 215 207 201 195 191 189 192 199 203 197 184 170 159 149 140 134 136 145 153 154 143 123 103 91
10097 91 90 95 100 98 91 86 92 112 140 166 186 202 222 241 249 240 220 204 199 202 204 201 195 196 211 233 251 258 259 260 257 239 205 164 128 103 88 80 76 75 73 68 64 61 61 60 56 50 44 43 53
10076 53 77 111 139 151 147 137 132 127 113 90 69 58 56 60 68 79 89 95 96 99 103 101 93 84 82 92 114 140 163 173 169 162 163 168 166 153 142 146 164 181 188 187 184 183 180 178 181 189 197
10056 197 203 205 203 198 190 184 183 191 204 212 204 178 147 129 133 153 175 185 184 177 171 172 175 179 183 189 198 206 207 198 183 167 153 141 130 119 106 97 94 99 104 105 102 103 113 137 167 192 203
10037 203 202 200 208 222 228 215 187 155 128 107 95 93 102 113 118 116 113 115 125 139 155 169 176 174 167 163 165 164 156 144 139 141 146 149 155 169 190 212 230 242 249 250 243 227 204 179 158
10018 158 148 151 167 192 218 239 255 269 280 279 259 227 199 187 189 195 198 200 204 212 223 233 240 243 246 248 245 239 234 234 233 223 204 182 165 154 146 140 136 135 137 146 166 194 227 257
9999 257 279 286 277 260 245 235 227 217 203 190 185 187 188 173 140 100 69 53 47 45 54 79 117 152 170 167 150 132 125 133 150 168 179 185 186 185 183 184 190 199 211 225 239 245 238
9981 238 220 205 201 212 231 254 271 275 263 243 227 221 225 234 242 240 222 195 170 153 143 138 137 140 141 127 98 69 57 70 100 133 159 174 179 177 170 161 154 148 144 140 139 143 148 154
9963 154 158 158 154 142 125 108 101 106 124 147 167 178 180 177 172 162 147 129 114 103 91 75 57 43 35 32 31 33 39 50 65 77 83 83 78 72 71 77 88 96 97 96 102 118 142 170
9944 170 199 227 252 269 279 284 283 277 267 254 241 228 211 188 160 132 111 97 89 81 74 71 76 88 105 126 149 171 189 195 187 171 157 156 167 181 187 183 172 161 156 158
9927 158 163 166 164 155 142 128 118 109 96 76 54 33 12 -3 -10 -3 10 21 25 26 26 21 10 0 2 20 52 89 116 119 92 47 5 -20 -36 -50 -65 -79 -93 -107 -117
9911 -117 -113 -91 -56 -18 14 36 46 48 45 37 25 15 12 13 8 -4 -14 -9 5 17 21 26 42 64 82 92 95 97 103 117 138 157 167 168 165 158 146 130 118 114 118 129 148 173
9893 173 198 216 224 220 204 178 148 122 103 91 84 79 73 68 67 71 77 85 98 121 147 166 170 164 154 144 135 131 131 131 126 123 124 127 125 117 104 89 76 71 75 81 83 82 83 87 88 81 74 77 92
9873 92 112 130 146 158 164 163 159 156 157 159 161 161 166 178 201 229 255 266 255 224 188 163 160 173 188 192 181 160 143 138 150 173 195 208 211 210 212 220 231 239 240 232 221 210 200
9855 200 193 192 197 207 214 210 192 163 132 111 104 112 128 140 135 118 101 95 95 89 70 45 26 20 25 41 67 98 121 129 126 121 122 125 130 139 156 181 208 227 235 237 240 243 245 247 252 260 259
9835 259 248 229 212 201 194 191 195 205 214 217 213 204 197 194 195 197 195 188 176 163 157 165 185 212 234 248 256 260 258 247 228 206 182 161 144 132 128 132 145 160 170 172 170 168 167 162 149
9816 149 129 107 92 88 98 118 144 164 167 150 125 107 103 103 98 88 85 96 122 160 198 226 233 221 196 166 132 96 56 19 -8 -17 -8 14 46 84 124 154 164
9801 164 159 153 153 155 153 143 128 106 82 65 56 53 50 49 55 66 74 76 74 77 84 90 90 80 66 52 41 28 12 1 8 39 85 132 167 181 176 159 143 140 150 170 191 209 220
9783 220 224 217 200 179 163 162 177 199 216 224 225 226 224 218 209 205 211 217 218 213 210 211 211 203 186 162 143 141 161 191 218 233 239 240 234 222 206 189 170 155 148 149 146 130 105 82 64
9764 64 52 47 53 65 76 81 80 74 64 49 36 31 33 37 39 34 26 21 26 39 54 67 82 97 110 117 114 103 87 67 49 35 30 34 44 52 56 61 75 97 117 126 123 116 108 102 101 106 115
9744 115 123 126 122 114 103 92 85 86 97 114 133 150 166 180 191 199 206 215 225 235 252 278 307 323 323 315 309 305 292 268 239 220 220 238 264 281 280 262 234 204 174 150
9727 150 133 119 101 76 45 14 -6 -8 7 32 54 69 77 82 83 82 83 87 90 90 91 95 99 98 88 74 61 51 45 44 52 74 107 141 165 169 158 141 124 108 94 83 77 72
9709 72 69 67 71 84 105 129 153 173 190 208 229 253 275 294 309 322 330 334 335 338 346 355 356 343 316 281 244 212 191 180 177 176 178 184 194 204 216 230 247 257 250 225 189
9692 189 154 121 90 61 39 29 31 43 63 83 94 92 81 70 62 61 70 89 112 129 136 135 134 138 151 169 185 189 178 161 146 137 132 128 126 127 131 140 151 159 159 150 138 127 117
9674 117 104 88 77 80 98 125 147 154 141 116 89 75 80 102 131 159 182 198 209 212 200 171 131 94 68 51 40 42 58 86 113 134 151 166 179 193 211
9659 211 229 239 239 231 222 212 201 191 186 181 174 163 150 133 114 99 92 86 71 48 31 29 41 55 60 53 33 5 -22 -39 -38 -18 11 41 62 77 93 110 122 125 124 120
9642 120 114 104 93 83 77 73 71 73 88 116 149 176 188 183 165 140 118 107 109 119 130 144 162 177 180 165 139 109 82 66 63 69 74 75 81 98 122 141 147 139 125 113
9625 113 105 98 91 82 77 79 89 109 141 176 202 211 209 209 214 219 222 223 224 220 206 185 164 150 139 130 115 92 63 38 31 43 65 84 93 93 88 79 71 70 80 92 97 93 85 77 71 69 75 89
9605 89 110 130 145 155 158 155 150 145 142 141 141 143 145 145 143 142 142 145 150 152 148 137 121 104 90 80 74 70 62 45 20 -2 -17 -25 -32 -42 -54 -64 -64 -50 -21 16 57 95 124 142 149
9587 149 142 121 88 54 35 33 42 55 65 71 69 61 49 39 34 34 37 44 56 74 96 118 136 151 163 174 186 205 231 260 285 297 295 281 266 257 256 256 247 224 188 144
9570 144 99 63 42 34 31 27 27 39 65 105 149 187 206 206 196 189 191 200 210 218 217 203 180 159 149 148 145 134 114 91 72 59 54 59 75 101 130 153 167 174 173 163 145
9552 145 119 88 58 34 22 21 26 30 31 29 23 16 11 13 18 23 27 28 31 39 56 82 110 132 145 152 160 175 194 207 204 185 161 140 124 110 96 82 69 58 48 45 53 71 89
9534 89 100 102 99 96 97 101 108 115 121 126 135 146 156 159 153 140 123 104 88 80 84 94 103 109 115 127 145 167 189 207 221 232 236 231 216 196 180 170 158 137 108 81 63 54 58 76
9516 76 103 129 144 148 149 152 157 164 172 182 194 201 201 193 180 169 164 169 179 188 192 190 192 204 222 240 246 238 220 198 177 158 145 140 146 155 153 134 104 79 69 65 59 49 38 27 22
9497 22 36 72 121 164 192 208 214 207 191 179 179 182 176 161 144 130 118 109 105 105 105 108 117 132 145 150 150 152 154 155 154 150 141 131 126 131 142 151 156 161 165 165 161 161 171 188 200 198 183 165
9477 165 155 154 156 160 165 172 179 186 191 198 211 231 250 256 242 212 179 151 136 136 151 167 171 161 145 132 120 106 89 72 59 52 52 58 63 66 70 77 85 92 101 108 109 102 95 95 100 104 109 117
9457 117 127 139 150 161 170 172 170 164 151 134 118 113 119 128 133 132 122 100 70 42 28 35 62 97 128 153 176 201 217 220 214 208 203 196 190 192 203 223 251 278 291 291 303 345
9439 345 407 480 581 741 968 1265 1658 2157 2655 2940 2861 2468 1968 1535 1215 979 801 673 580 501 432 382 352 337 331 330 328 323 322 325
9427 325 321 302 275 255 247 247 254 269 285 292 285 270 253 240 234 239 244 238 215 188 174 182 203 223 231 227 217 208 204 206 214 225 233 235 233 230 228 226 223 219 213 207 204 207 214 219 219 216 211 205 201 202 208 216
9405 216 221 219 212 203 198 203 220 244 266 278 274 258 236 214 194 175 153 129 109 101 109 129 154 177 190 188 164 120 68 27 4 -2 2 15 35 59 75 81 80 81 87 91 86 75
9388 75 66 65 72 81 85 77 54 28 10 9 17 31 52 80 105 120 126 133 146 162 178 190 195 191 182 176 174 168 154 133 115 109 116 130 141 143 138 134 137 153 182 213 232 230 211 190 175
9369 175 162 146 128 114 110 118 135 149 149 135 116 104 103 108 111 109 105 107 122 145 168 185 196 206 209 201 184 163 143 127 124 136 159 185 205 216 218 213 203 191 179 169
9352 169 161 158 156 155 158 172 192 211 223 228 227 216 196 175 165 170 183 189 183 169 157 150 149 150 156 165 174 177 179 184 191 189 174 150 128 121 129 149 171 187 199 209 220 229 230 219 197
9333 197 169 142 123 121 136 160 183 198 199 188 175 172 187 214 236 235 212 183 164 156 151 146 142 140 134 121 107 97 88 79 69 67 76 95 118 143 172 202 224 232 223 206 192
9316 192 188 189 186 177 162 146 133 128 135 151 168 181 189 192 191 188 193 210 232 249 252 245 230 211 193 177 163 145 122 105 101 109 115 110 100 97 108 132 157 174 180 184 195 215 236
9298 236 247 244 231 211 189 177 180 194 206 206 197 187 178 166 149 131 119 116 121 129 137 138 124 93 57 25 2 -12 -19 -14 2 28 57 86 114 136 145 138 119 98 82 76
9281 76 80 91 102 111 113 104 82 52 26 9 4 12 31 58 86 111 135 157 173 179 174 161 140 117 101 96 99 93 71 38 8 -5 1 23 52 79 100 118 131 140 148 159
9264 159 173 180 175 159 143 131 124 122 121 117 106 93 82 80 88 107 134 160 177 181 180 180 179 173 162 153 151 155 163 176 194 214 225 220 204 194 202 227 252 260 251 243 252 276 300 311
9246 311 309 306 305 306 303 301 299 295 282 259 228 196 164 140 128 131 144 159 169 171 164 150 133 116 103 94 89 91 100 110 117 120 126 140 159 175 181 171 147 114 85 69 68 74 84
9228 84 92 99 105 113 124 135 138 128 111 97 93 98 104 101 82 51 22 9 18 39 59 69 69 67 69 72 73 66 54 48 51 62 70 67 58 53 59 76 95 109 113 109 96 80 65 58 59 73 102
9208 102 142 181 208 217 215 208 202 202 211 227 237 228 197 155 120 105 111 129 145 153 151 144 134 124 120 126 139 148 146 129 105 89 87 91 86 69 46 26 11 3 3 14 29 46 64
9190 64 85 104 115 119 121 122 122 123 128 137 142 142 135 127 116 106 101 99 96 90 90 100 114 119 113 104 106 120 141 155 151 129 105 94 97 104 108 115 131 151 164 160 141 119 101 91 87 89 95 103
9170 103 111 116 120 127 139 150 155 149 131 105 83 76 85 98 103 98 90 79 64 42 23 16 19 24 24 22 23 25 22 18 25 47 72 83 76 63 52 42 28 10 -6 -15 -14 -3 15 40 75
9151 75 120 167 201 214 215 214 214 209 199 196 208 233 258 275 284 287 286 279 263 239 208 171 136 109 94 89 90 100 123 155 184 197 191 168 134 99 74 67 78 99 126 152
9134 152 169 168 152 130 111 96 88 85 88 92 97 102 106 106 102 96 87 71 50 30 18 14 16 25 40 56 66 64 53 43 44 55 71 85 100 115 127 132 135 145 157 163 156 145 138 136
$$ [...]
-2084A5
##END=	
##END=	
