##TITLE=	Oct20-2021.110.fid
TM-VI-121 Zr+PMB-prraz.

##JCAMP-DX=	6.0	$$ MestReNova 14.3.0-30573
##DATA TYPE=	LINK
##BLOCK_ID=	1
##BLOCKS=	2    
##ORIGIN=	Mestrelab Research S.L.
##OWNER=	hrzepa
##$MNOVA/LINK_BLOCK_TYPE=	ITEM	$$ NMR Spectrum
##$MNOVA/ITEM/POLYGON=	(XY..XY)
5321,5835
8722,5835
8722,8208
5321,8208
5321,5835
##$MNOVA/ITEM/Z=	0
##$MNOVA/ITEM/ANGLE=	0
##TITLE=	Oct20-2021.110.fid
##JCAMP-DX=	6.0	$$ MestReNova 14.3.0-30573
##BLOCK_ID=	2
##DATA TYPE=	MNOVA NMR VIEW DATA
##DATA CLASS=	MNOVA VIEW DATA
##$MNOVA/ITEM/ZOOM/X=	-4.005464102252559222,	16.005770000004368114
##$MNOVA/ITEM/ZOOM/Y=	-946.16968858242034912,	10396.94329833984375
##END=	
##TITLE=	Oct20-2021.110.fid
##JCAMP-DX=	6.0	$$ MestReNova 14.3.0-30573
##BLOCK_ID=	3
##DATA TYPE=	NMR SPECTRUM
##DATA CLASS=	XYDATA
##NUMDIM=	1
##ORIGIN=	Bruker BioSpin GmbH
##OWNER=	nmr
##.OBSERVE FREQUENCY=	400.4124024600000098
##.OBSERVE NUCLEUS=	^1H
##.SOLVENT NAME=	Acetone
##.PULSE SEQUENCE=	zg30
##LONGDATE=	2021/10/20 15:23:00.000
##.ACQUISITIONMODE=	SIMULTANEOUS (DQD)
##$ORIGINAL FORMAT=	Bruker XWIN-NMR
##$MNOVA/SCALES_VERSION=	9
##$PARAMETER FILE=	(acqus, ASCII, /private/var/folders/f6/rjf_tdyn2v98c5c0wvkgn4s80000gn/T/V65cDEwWS2e3HftWe75dsA/110/acqus, 0)
$$ ##TITLE= Parameter file, TOPSPIN		Version 3.2
$$ ##JCAMPDX= 5.0
$$ ##DATATYPE= Parameter Values
$$ ##NPOINTS= 11	$$ modification sequence number
$$ ##ORIGIN= Bruker BioSpin GmbH
$$ ##OWNER= nmr
$$ $$ 2021-10-20 15:23:59.940 +0100  nmr@CZC10666PP
$$ $$ /opt/topspin/data/agmb/nmr/Oct20-2021/110/acqus
$$ $$ process /opt/topspin3.2/prog/mod/shimcntl
$$ ##$ACQT0= -2.36344537815126
$$ ##$AMP= (0..31)
$$ 100 100 100 100 100 100 100 100 100 100 100 100 100 100 100 100 100 100
$$ 100 100 100 100 100 100 100 100 100 100 100 100 100 100
$$ ##$AMPCOIL= (0..19)
$$ 0 0 0 0 0 0 0 0 0 0 0 0 0 0 0 0 0 0 0 0
$$ ##$ANAVPT= -1
$$ ##$AQSEQ= 0
$$ ##$AQ_mod= 3
$$ ##$AUNM= <au_zg>
$$ ##$AUTOPOS= <58 >
$$ ##$BF1= 400.41
$$ ##$BF2= 400.41
$$ ##$BF3= 400.41
$$ ##$BF4= 400.41
$$ ##$BF5= 400.41
$$ ##$BF6= 400.41
$$ ##$BF7= 400.41
$$ ##$BF8= 400.41
$$ ##$BYTORDA= 0
$$ ##$CAGPARS= (0..11)
$$ 0 0 0 0 0 0 0 0 0 0 0 0
$$ ##$CFDGTYP= 0
$$ ##$CFRGTYP= 9
$$ ##$CHEMSTR= <none>
$$ ##$CNST= (0..63)
$$ 1 1 145 1 1 1 1 1 1 1 1 1 1 1 1 1 1 1 1 1 1 1 1 1 1 1 1 1 1 1 1 1 1 1 1
$$ 1 1 1 1 1 1 1 1 1 1 1 1 1 1 1 1 1 1 1 1 1 1 1 1 1 1 1 1 1
$$ ##$CPDPRG= (0..8)
$$ <> <> <> <> <mlev> <mlev> <mlev> <mlev> <mlev>
$$ ##$D= (0..63)
$$ 0 1 0 0 0 0 0 0 0 0.06 0 0 0 0 0 0 0.0002 0 0 0 0 0 0 0 0 0 0 0 0 0 0 0
$$ 0 0 0 0 0 0 0 0 0 0 0 0 0 0 0 0 0 0 0 0 0 0 0 0 0 0 0 0 0 0 0 0
$$ ##$DATE= 1634739839
$$ ##$DE= 6.5
$$ ##$DECBNUC= <off>
$$ ##$DECIM= 2496
$$ ##$DECNUC= <off>
$$ ##$DECSTAT= 4
$$ ##$DIGMOD= 1
$$ ##$DIGTYP= 12
$$ ##$DQDMODE= 0
$$ ##$DR= 22
$$ ##$DS= 2
$$ ##$DSPFIRM= 0
$$ ##$DSPFVS= 20
$$ ##$DTYPA= 0
$$ ##$EXP= <proton>
$$ ##$F1LIST= <111111111111111>
$$ ##$F2LIST= <222222222222222>
$$ ##$F3LIST= <333333333333333>
$$ ##$FCUCHAN= (0..9)
$$ 0 2 0 0 0 0 0 0 0 0
$$ ##$FL1= 90
$$ ##$FL2= 90
$$ [...]
$$ ##$Sgu3PowerLevels= (0..7)
$$ 0 0 0 0 0 0 0 0
$$ ##$Sgu4PowerLevels= (0..7)
$$ 0 0 0 0 0 0 0 0
$$ ##$Sgu5PowerLevels= (0..7)
$$ 0 0 0 0 0 0 0 0
$$ ##$Sgu6PowerLevels= (0..7)
$$ 0 0 0 0 0 0 0 0
$$ ##$Sgu7PowerLevels= (0..7)
$$ 0 0 0 0 0 0 0 0
$$ ##$Sgu8PowerLevels= (0..7)
$$ 0 0 0 0 0 0 0 0
$$ ##$SguType= 3
$$ ##$ShimPowMaxUA= (0..63)
$$ 130000 130000 130000 130000 130000 130000 130000 130000 130000 130000 130000
$$ 130000 130000 130000 130000 130000 130000 130000 130000 130000 0 0 0 0
$$ 0 0 0 0 0 0 0 0 0 0 0 0 0 0 0 0 0 0 0 0 0 0 0 0 0 0 0 0 0 0 0 0 0 0 0 0
$$ 0 0 0 0
$$ ##$ShimPowMaxUC= (0..63)
$$ 130000 130000 130000 130000 130000 130000 130000 130000 130000 130000 130000
$$ 130000 130000 130000 130000 130000 130000 130000 130000 130000 0 0 0 0
$$ 0 0 0 0 0 0 0 0 0 0 0 0 0 0 0 0 0 0 0 0 0 0 0 0 0 0 0 0 0 0 0 0 0 0 0 0
$$ 0 0 0 0
$$ ##$ShimPowMaxUG= (0..63)
$$ 524287 524287 524287 524287 524287 524287 524287 524287 524287 524287 524287
$$ 524287 524287 524287 524287 524287 524287 524287 524287 524287 0 0 0 0
$$ 0 0 0 0 0 0 0 0 0 0 0 0 0 0 0 0 0 0 0 0 0 0 0 0 0 0 0 0 0 0 0 0 0 0 0 0
$$ 0 0 0 0
$$ ##$ShimPowRcbType= 3
$$ ##$ShimPowRes= (0..63)
$$ 1e-20 1e-20 1e-20 1e-20 1e-20 1e-20 1e-20 1e-20 1e-20 1e-20 1e-20 1e-20
$$ 1e-20 1e-20 1e-20 1e-20 1e-20 1e-20 1e-20 1e-20 0 0 0 0 0 0 0 0 0 0 0 0
$$ 0 0 0 0 0 0 0 0 0 0 0 0 0 0 0 0 0 0 0 0 0 0 0 0 0 0 0 0 0 0 0 0
$$ ##$ShimPowRng0= (0..63)
$$ 1 1 1 1 1 1 1 1 1 1 1 1 1 1 1 1 1 1 1 1 0 0 0 0 0 0 0 0 0 0 0 0 0 0 0 0
$$ 0 0 0 0 0 0 0 0 0 0 0 0 0 0 0 0 0 0 0 0 0 0 0 0 0 0 0 0
$$ ##$ShimPowRng1= (0..63)
$$ 1 1 1 1 1 1 1 1 1 1 1 1 1 1 1 1 1 1 1 1 0 0 0 0 0 0 0 0 0 0 0 0 0 0 0 0
$$ 0 0 0 0 0 0 0 0 0 0 0 0 0 0 0 0 0 0 0 0 0 0 0 0 0 0 0 0
$$ ##$ShimPowRng2= (0..63)
$$ 1 1 1 1 1 1 1 1 1 1 1 1 1 1 1 1 1 1 1 1 0 0 0 0 0 0 0 0 0 0 0 0 0 0 0 0
$$ 0 0 0 0 0 0 0 0 0 0 0 0 0 0 0 0 0 0 0 0 0 0 0 0 0 0 0 0
$$ ##$ShimPowRng3= (0..63)
$$ 1 1 1 1 1 1 1 1 1 1 1 1 1 1 1 1 1 1 1 1 0 0 0 0 0 0 0 0 0 0 0 0 0 0 0 0
$$ 0 0 0 0 0 0 0 0 0 0 0 0 0 0 0 0 0 0 0 0 0 0 0 0 0 0 0 0
$$ ##$ShimSysFunc= (0..63)
$$ 1 2 3 4 5 7 9 11 15 16 8 10 12 14 6 17 13 18 19 20 0 0 0 0 0 0 0 0 0 0
$$ 0 0 0 0 0 0 0 0 0 0 0 0 0 0 0 0 0 0 0 0 0 0 0 0 0 0 0 0 0 0 0 0 0 0
$$ ##$ShimSysMatrix= 0
$$ ##$ShimSysType= 1
$$ ##$TFXNUM= 0
$$ ##$TRIPLO2= 0
$$ ##$VTU= 2
$$ ##$VTUETH= <149.236.99.20>
$$ ##$VTUTY= <no>
$$ ##$WBREFAM= (0..15)
$$ 135 116 100 100 100 100 100 100 100 100 100 100 100 100 100 100
$$ ##$WBREFLM= (0..15)
$$ 0 0 0 0 0 0 0 0 0 0 0 0 0 0 0 0
$$ ##$WBREFPH= (0..15)
$$ 71.66 -68.25 0 0 0 0 0 0 0 0 0 0 0 0 0 0
$$ ##$WBSGU= (0..15)
$$ 0 0 0 0 0 0 0 0 0 0 0 0 0 0 0 0
$$ ##$XFAC= 2
$$ ##END=
$$ 
##$DECIM=	2496
##$DSPFVS=	20
##XUNITS=	HZ
##YUNITS=	ARBITRARY UNITS
##FIRSTX=	6408.8703656999996383
##LASTX=	-1603.8278811825093726
##DELTAX=	-0.12226593800080123864
##XFACTOR=	1
##YFACTOR=	0.0097489937040796999929
##FIRSTY=	9.4900646209716796875
##MINY=	-0.99299180507659912109
##MAXY=	9451.7666015625
##NPOINTS=	65536
##XYDATA=	(X++(Y..Y))
$$ [...]
2877H04qk%%JKMLql1m0k2RK2J5J0J0Kk2m2l4j0QQPJ1J7J8J3Jk0l6l2j4mqpLJ0jj9k2qOQOQ
2871F16P%j6k9l2k3nJ7K9K5Qrj5pNQkj1nPMj0k0qJ6K6J2j1k3j5%PNjmmkKRJ2RKjNJ5K0K0J6
2865F49J0mk3m3m4k8mRJ0QQJj0j9j7j2j2j0lOQJjORMpq%J3K1K2J0qk1k0rkJLMkqj0JJ2J7J3
2859E21OPQPMPJ8K8K1kk2k2qMQN%mj0oQK1K0Pnpmoj1rJRLj5l3l8l3j9kJ0J0Kll%LJ1J9J1r
2853E08j8pNkj7j3KNnoRJ8J0KPJ7K1K2K4J4j1l1l0j6pjJ2J8Mj6j2J0J8NkJ2K2Qk1k6oJ0Nj6
2848E25k5j9%J6K2K1J6Ork2j9JK1K6K1J9K1J9J1KlnojPJ6J6Qoj4kK4M0K9ROK0K1Jj4LL6N4
2842H92N2M5M4M1L8L6L2K7K6L4M0L4J8J7L0L6J7j1k5k4j7rkMKnj2k0l3m5m3k4jRql7n7m8j8
2838A035K%j2j6j6k9m6m3j1K2L4K5J4RJ3K0L1L5K0lj6rMJ1J1RJ1J4J9K7L6M6M7L9K0K%J4L1
$$ plain form
2877 804 796 794 794 794 795 797 801 804 796 765 725 703 712 734 749 759 769 771 749 707 673 663 671 679 686 697 714 732 745 746 726 690 658 644 640 632 625 628 638 637 618 596 588 594 602 608 616
2871 616 623 623 607 578 546 523 518 535 564 589 597 588 573 566 571 579 577 566 561 568 572 562 542 534 550 576 588 577 554 539 539 546 551 550 546 542 540 542 551 563 572 574 573 578 593 613 633 649
2865 649 659 655 632 589 545 517 513 522 532 540 548 549 539 520 503 491 479 469 466 472 480 481 480 486 495 499 492 484 484 497 518 540 550 542 521 501 492 490 491 494 498 496 488 478 479 491 508 521
2859 521 527 534 542 549 553 560 578 606 627 625 603 581 573 577 585 590 590 586 576 570 578 599 619 626 621 614 610 604 593 584 585 594 597 582 549 511 478 459 457 467 477 479 476 473 473 476 487 506 517 508
2853 508 490 483 488 486 469 456 458 463 458 452 461 479 489 491 498 515 536 558 582 596 585 554 524 508 501 500 512 530 534 518 506 516 534 539 537 549 571 579 558 532 526 536 541 525
2848 525 500 481 481 497 519 540 556 562 553 531 512 513 534 560 581 600 621 640 651 653 650 645 639 638 645 661 677 685 679 665 663 687 727 756 765 771 791 812 813 799 802 838 892
2842 892 944 989 1033 1074 1112 1148 1180 1207 1233 1267 1307 1341 1359 1376 1406 1442 1459 1448 1423 1399 1382 1373 1371 1375 1377 1372 1360 1340 1307 1262 1219 1195 1194 1203 1195 1158 1101 1053 1035
2838 1035 1037 1037 1025 1009 993 964 918 875 864 886 920 945 959 968 981 1001 1032 1067 1087 1084 1068 1059 1063 1074 1085 1094 1105 1119 1138 1165 1201 1247 1294 1333 1353 1355 1355 1369 1400
2833A400K9J0pj1noj7k2j9j3j0qJMpk3k6j2JLJQJ3Oqk0k8m5p0p9o3m0l6n3o4m7j6Jpk8m2l5
2828F10j8JRLoqKJ1Ooj1ojknpj4k3k4j1KMkJNLpj5j1JJ6K4J7lk2k4rOQNORPKlj3k5l5k9nJ9
2822D32K8J4mqJQPJ0J8J6ql9m3j9jlpNJ8J4LQK9L7K3Lopj2j8k2k2j6qJPJ6K6K6Nk6m2k9qL
2816D10mj4j3MK8M4M4K8J1jqj3j4j4j8k1j7mMkj1nJ6L0J6j3l6l6j8LJ5J2%roRK2K6K1J0kj3
2811D61j5oPJ5J4J3J3Nqj6j2j0j5k2j6JJ0PLMNKjKJ0J0jj3k0j6lROljJ7L4K5%j8j1J1K5K0
2806E22%rMK6K9Qj7k5k1j5qMJ2Mj7k3oJ7K3J1mj1j2j1j0j0j2j1pmkoj3j3JK1K9J8J%J3K1P
2800E04j7l0k4j2nmJRK0K9L2K9J8Lpj2j1qj0j1j3j2rlMJ2J1Noj8l3m0l1rJ3K4K0R%jNQM%J0
2795D44K7L4J8qj9j0QK0K0J1kj2j4nLOLJNNlj3j6j0%PRMj0k5k7j6KJ6K6L0K3%k1k5rMJ1J2
$$ plain form
2833 1400 1429 1439 1432 1421 1416 1410 1393 1371 1352 1339 1329 1321 1322 1326 1319 1296 1270 1258 1259 1262 1263 1271 1284 1290 1282 1262 1234 1189 1119 1040 977 937 901 848 784 737 721 722 715 687 645 610
2828 610 592 593 602 605 599 591 593 604 610 604 593 587 586 584 579 572 558 535 511 500 502 506 504 505 510 513 506 491 480 481 497 521 538 535 513 489 480 486 494 499 505 514 521 523 520 507 482 447 418 413 432
2822 432 460 474 470 462 463 471 478 488 506 522 514 475 432 413 412 409 402 407 425 439 442 450 479 516 539 542 536 529 517 499 477 455 439 431 432 439 455 481 507 512 486 444 415 407 410
2816 410 406 392 379 383 411 455 499 527 538 537 529 516 502 488 470 449 432 428 432 430 419 414 430 460 476 463 427 391 373 376 391 403 403 394 388 397 419 445 466 476 474 461
2811 461 446 440 447 462 476 489 502 507 499 483 471 461 446 424 408 409 419 426 429 433 438 440 439 441 451 461 460 447 427 411 408 417 423 420 419 436 470 495 495 477 466 477 502 522
2806 522 522 513 517 543 572 580 563 538 517 502 494 498 510 514 497 474 468 485 508 519 515 504 492 481 471 461 449 438 431 427 425 419 406 393 394 415 444 462 463 463 476 497 504
2800 504 487 457 433 421 416 412 413 422 442 471 503 532 550 553 546 534 523 515 505 494 481 469 460 457 461 473 484 489 483 465 432 392 361 352 365 389 409 418 418 417 422 430 434 434 444
2795 444 471 505 523 515 496 486 494 514 534 545 543 531 517 512 515 521 524 525 530 535 532 519 503 493 493 500 509 513 503 478 451 435 437 453 479 509 532 532 511 486 477 481 492 504
2789E04J4J4NkJRJ6J9J9J9J4Onj5k2k1j0jKNJ4K5K6K2J7J7J9K4K7K0lk2k1j0j3k9l2j2J2J5
2785F67PJ2K9L9L7L1L0K8K5L0M6N7N2L5K2K0K6L1L1K6K1J6J4J4J4J7K1K2Rj2k9k9j7jQJ1J7
2780A377K5L1K9K6L3M2L6Nk6k9oJ7K2J1Jpj6k5k6k5k7l5l7l3k8l1l4k9j7mMPJ5K1K4J9J8K7
2775A355M0M2L4K9L5M2M0L1K3J9K2L5N5O9O5N9P0R0R5P2N0M7O1P2P9Q6R4J03J15J33J49J58
2771C469J62J65J60J49J41J34J17Q3M5J3j5n0q4r8r9j08j28j43j43j37j31j22j08r6r2q6p7
2768B921p9r2j04j10j10j13j06q1n0l5l5m3m5l6j6KKppQK0J4NJ1K7L6L6L8M3L7K7K7M0N3O2
2764B340P4Q7Q2N6L1L1N1P6R6J09J12J06J00R1Q2O6M8K2j5n5p9p9p7r3j17j30j25j23j32j40
2760B495j34j13r1p7p8q3q5p6o2n4n2n1n0m8m6m3m0m5n2n4m5l2k0j2j1k1l2l1j0J8L1K1jj7
$$ plain form
2789 504 518 532 537 535 536 545 561 580 599 618 632 638 633 618 596 575 565 564 566 571 585 610 636 658 675 692 711 735 762 782 779 757 736 726 713 684 652 640 652 667
2785 667 674 686 715 754 791 822 852 880 905 935 981 1038 1090 1125 1147 1167 1193 1224 1255 1281 1302 1318 1332 1346 1360 1377 1398 1420 1429 1417 1388 1359 1342 1341 1349 1360 1377
2780 1377 1402 1433 1462 1488 1521 1563 1599 1604 1578 1549 1543 1560 1582 1593 1594 1587 1571 1546 1520 1495 1468 1433 1396 1363 1335 1304 1270 1241 1224 1220 1224 1231 1246 1267 1291 1310 1328 1355
2775 1355 1395 1437 1471 1500 1535 1577 1617 1648 1671 1690 1712 1747 1802 1871 1936 1995 2065 2155 2250 2322 2372 2419 2480 2552 2631 2717 2811 2914 3029 3162 3311 3469
2771 3469 3631 3796 3956 4105 4246 4380 4497 4580 4625 4638 4623 4573 4489 4391 4292 4184 4056 3913 3770 3633 3502 3380 3272 3176 3084 2998 2921
2768 2921 2842 2750 2646 2536 2426 2313 2207 2126 2076 2041 2006 1963 1918 1882 1866 1868 1870 1863 1856 1864 1884 1898 1903 1914 1941 1977 2013 2051 2094 2131 2158 2185 2225 2278 2340
2764 2340 2414 2501 2583 2639 2670 2701 2752 2828 2924 3033 3145 3251 3351 3442 3524 3590 3638 3660 3645 3590 3511 3432 3355 3262 3145 3015 2890 2767 2635 2495
2760 2495 2361 2248 2157 2080 2002 1919 1834 1758 1696 1642 1590 1539 1489 1441 1395 1352 1312 1267 1215 1161 1116 1084 1064 1052 1041 1020 988 957 947 965 996 1017 1016 999
2756I99j9j8k0k2j8nkk2n0n7l8j4qj7k0j1JOPJ4K5K7K0P%mnrj2j1j1j2j1pJPJ0J3J5Oj5l2
2751F88l0j3kpj4j2m%KJ1K5L4K6Rnj1j2j5j6j4nQK5L3K1qk4j2J5K3Jk9l6j5J8M2M2J3k4m0
2746F88k3MJ8Qpj9k6k3rOLj7k6j5RK5K8K4J3kj3j6j9k6l3k5oJ5K8L0J6lj7rQJ9J7Mj2k2k2
2741E73qkj1l0l2j5NJ7J9K0J6J2J1J1%j4j2J5L8L3Lj6j2LJ0J1J3J6J5QJJRJ8J7J0OJ4K0J0
2736H03j4k8k5j3oqpnJJ0J4Lj5k2pJ7K6J8RPQNMRJ4J4J1Mj0k3k6j5lkjJ2L1L5K1MLRQlj6k1
2730H30j6nJ1J7Pj3k7l0k3rJ3L3M2L7K2Ooj3j6j1lMQNJKJ3K6K7J4L%OJ0J3J4J5QMJ2K3K3J2
2725A089JOJ9K3J5Lpj2j1mJ0J9K2K1K1J8Kk3l6k8rmj5k3j4JKoj1rmlKJ5K9L5L3L2L5L9L8K7
2720A338J7J3J3RlqKJ4J3ORK7M0L9L7M6N1L4OnRK8L2K3J5J2J4K5M1M7L7K1K0L5M9M4K6J2J6
$$ plain form
2756 999 980 962 942 920 902 897 895 873 823 766 728 714 706 689 669 658 659 665 672 686 711 738 758 765 765 761 756 747 735 724 713 701 690 683 684 691 701 714 729 735 720 688
2751 688 658 645 643 636 622 610 606 606 608 619 644 678 704 713 708 697 685 670 654 640 635 643 668 701 722 714 690 678 693 716 717 688 652 637 655 697 739 752 728 688
2746 688 665 669 687 695 688 669 643 620 611 617 620 603 577 562 571 596 624 648 661 659 646 630 611 585 552 527 521 536 564 594 610 607 590 581 589 608 625 629 617 595 573
2741 573 565 563 552 522 490 475 480 497 516 536 552 564 575 586 586 572 560 575 613 646 649 633 621 624 634 645 658 674 689 697 698 699 708 726 743 753 759 773 793 803
2736 803 789 761 736 723 717 709 702 697 698 708 722 725 710 688 681 698 724 742 751 758 766 771 775 784 798 812 823 827 817 794 768 753 750 748 747 759 790 825 846 850 853 862 870 867 851 830
2730 830 814 809 820 837 844 831 804 774 751 742 755 788 830 867 889 895 889 876 860 849 846 850 858 863 864 866 879 905 932 946 949 949 955 965 978 992 1007 1015 1019 1031 1054 1077 1089
2725 1089 1090 1096 1115 1138 1153 1156 1149 1137 1126 1122 1132 1151 1173 1194 1215 1233 1235 1212 1176 1148 1139 1135 1120 1097 1083 1084 1086 1080 1069 1060 1056 1053 1055 1070 1099 1134 1167 1199 1234 1273 1311 1338
2720 1338 1355 1368 1381 1390 1387 1379 1381 1395 1408 1414 1423 1450 1490 1529 1566 1612 1663 1697 1703 1698 1707 1735 1767 1790 1805 1817 1831 1856 1897 1944 1981 2002 2022 2057 2106 2150 2176 2188 2204
2715B204L6N8P0O8O2N6M9L9L2L0L2L5L5L5L5L7L8L4K6K4L4N1O7P6Q5R7J03R3P7P4Q6R5R1Q7
2711D151R3J10J21J20J18J20J25J29J41J63J92K21K45K58K61K58K60K75K98L14L22L32L48
2708H975L69L92M24M71N29N83O29O69P11P58Q06Q58R14R83J061J142J222J308J411J529J656
2706B7400J782J910K051K204K355K493K602K672K682K622K492K325K177K106K138K279K524
2704F6814K885L370L979M710N575O593P758R047J0441J1913J3394J4752J5812J6353J6100
2702B09496J4786J2311Q892N014J197k207n046p258q813r732j0093j0012r596q943q144p298
2700A64554o494n830n393n213n249n399n559n656n652n540n340n073m755m392m000l598l197
2698G8214k796k398k009j632j265r00n39j75J98N78R63J358J783K243K722L211L709M206M666
$$ plain form
2715 2204 2240 2298 2368 2436 2498 2554 2603 2642 2674 2704 2736 2771 2806 2841 2876 2913 2951 2985 3011 3035 3069 3120 3187 3263 3348 3445 3548 3641 3718 3792 3878 3973 4064 4151
2711 4151 4244 4354 4475 4595 4713 4833 4958 5087 5228 5391 5583 5804 6049 6307 6568 6826 7086 7361 7659 7973 8295 8627 8975
2708 8975 9344 9736 10160 10631 11160 11743 12372 13041 13752 14510 15316 16174 17088 18071 19132 20274 21496 22804 24215 25744 27400
2706 27400 29182 31092 33143 35347 37702 40195 42797 45469 48151 50773 53265 55590 57767 59873 62011 64290 66814
2704 66814 69699 73069 77048 81758 87333 93926 101684 110731 121172 133085 146479 161231 177043 193396 209496
2702 209496 224282 236593 245485 250499 251696 249489 244443 237185 228372 218640 208547 198535 188939 179996 171852 164554
2700 164554 158060 152230 146837 141624 136375 130976 125417 119761 114109 108569 103229 98156 93401 89009 85009 81411 78214
2698 78214 75418 73020 71011 69379 68114 67214 66675 66500 66698 67276 68239 69597 71380 73623 76345 79556 83265 87471 92137
2696I2137N024N232N259N096M777M392M083L972M128M559N250O158P208Q306R346J0202J0735
2693A95864J0815J0322R130P118M261P47l006o492r322j1333j2564j3154j3255j2988j2444
2692A43699j1701j0831r890q909p897o874n875m947m127l434k878k474k231k137k160k248
2690E5086k353k435k463k438k380k321k267k198k098j967j825j686j559j452j362j274j172
2688B1836j064r72r03q44p86p36p09o91o65o24n91n75n65n37m95m57m36m21m03l83l60l41
2685H278l20k99k82k71k64k54k32k03j76j63j55j43j29j27j33j37j36j35j41j39j17q9p5q2
2682D076r1r2q4p7p3p1o8n8m0k5k3l9o2q2r1q9p2m5j8prj9k9l7m7n9p1p1n5k8j0nj1k2l2m3
2678B321m2l4k7l1l8l8l0k8k6j0J1J5ol0k9j0lj7l4m0l8m0l7j6J2J7lk0j8j2j9l1k1l%k0l0
$$ plain form
2696 92137 97161 102393 107652 112748 117525 121917 126000 129972 134100 138659 143909 150067 157275 165581 174927 185129 195864
2693 195864 206679 217001 226131 233249 237510 238257 235251 228759 219437 208104 195540 182386 169131 156143 143699
2692 143699 131998 121167 111277 102368 94471 87597 81722 76775 72648 69214 66336 63862 61631 59494 57334 55086
2690 55086 52733 50298 47835 45397 43017 40696 38429 36231 34133 32166 30341 28655 27096 25644 24282 23008 21836
2688 21836 20772 19800 18897 18053 17267 16531 15822 15131 14466 13842 13251 12676 12111 11574 11079 10622 10186 9765 9362 8979 8619 8278
2685 8278 7958 7659 7377 7106 6842 6588 6356 6153 5977 5814 5659 5516 5387 5260 5127 4990 4854 4719 4578 4439 4322 4233 4158 4076
2682 4076 3985 3893 3809 3732 3659 3588 3520 3462 3422 3397 3374 3335 3273 3191 3100 3011 2939 2894 2876 2869 2860 2841 2812 2775 2728 2669 2598 2527 2472 2444 2434 2429 2418 2396 2364 2321
2678 2321 2279 2245 2218 2187 2149 2111 2081 2053 2027 2017 2028 2043 2037 2007 1978 1968 1965 1948 1914 1874 1836 1796 1759 1743 1755 1772 1769 1749 1731 1719 1700 1669 1648 1645 1645 1625 1595
2673A595j4Kj1l1k3RK3om1m4j6Lqk9l3j9%J0J1J0J0Opk7l6k3%J2Jk0k9k5j6j5j9k6l0k3qL
2668A116Jj4k9l2k6j8j0MK8N2O2M9K3nk1k4j9j3qqj2k0j9j3mkmKRNj9m5m6k0QJ7RPJ3J5Mj3
2663I80k5k6j9rnj4l0l2j4JJqmJ4K2Qj5k6k3j2nmrj4pRK0K1J5J1Oqk2k8k1rLJ1Mj8l5k5jJ3
2658F71RJQJ4Mj6k8k5j3mJNJ1K3L8L6J5j2k2j3kkkKJ0J3QMkj3l4n1n0k9lJ5J7J2PLLOJ8L1
2652F64L4J8qj9oJ3J1j5l4k7oPMllNK4M3M5K0j6l0k0porkJpj8j8j5k1k9k4pPPJrk0k5j6LJ8
2647E05K4L0K4Ll0m2k4MK7L4L5L0K4K4K1kl9o1m6j2RJ1QPJj2k1j2OJ7Qj5l5l0rJ3J5NLRJ2
2642E19Lj1j5rKJ1Qlj1rKQJj1j8j7pNJ3J4RNJ2K4L4L0J5kj9l1l4k3nRJ1RJ7L1M5M3K7ml3n1
2636E94m9l6k1qMQ%j2j3kOJoj1j3j1pjnj3j0NJ4MqnQJ2QMOJ1J4J1kk4l6k6lJ2K4L5L7K1kq
$$ plain form
2673 1595 1581 1583 1572 1541 1518 1527 1550 1544 1503 1459 1443 1446 1438 1409 1376 1357 1357 1367 1378 1388 1398 1404 1397 1370 1334 1311 1311 1323 1324 1304 1275 1250 1234 1219 1200 1174 1144 1121 1113 1116
2668 1116 1117 1103 1074 1042 1016 998 988 992 1020 1072 1134 1183 1206 1201 1180 1156 1137 1124 1116 1108 1096 1076 1057 1044 1040 1038 1034 1036 1045 1050 1031 986 940 920 928 945 954 961 974 989 993 980
2663 980 955 929 910 901 896 882 852 820 806 807 808 800 796 810 832 840 825 799 776 764 759 755 746 732 725 734 754 775 790 801 807 799 777 749 728 719 722 733 737 719 684 659 658 671
2658 671 680 681 689 703 707 691 663 638 625 621 622 627 638 661 699 735 750 738 716 703 701 699 697 699 709 722 730 734 732 719 685 634 584 555 552 567 584 596 603 606 609 615 633 664
2652 664 698 716 708 689 683 696 707 692 658 631 625 632 636 633 630 635 659 702 747 767 751 721 701 694 688 679 677 678 671 653 635 620 599 570 546 539 546 553 554 545 525 500 484 487 505
2647 505 529 559 583 586 556 514 490 494 521 555 590 620 644 668 689 687 648 587 541 529 538 549 557 564 565 553 532 520 526 543 551 536 501 471 462 475 490 495 498 507 519
2642 519 522 511 496 487 489 500 508 505 494 485 487 495 496 485 467 450 443 448 461 475 484 489 501 525 559 589 604 602 583 552 518 495 490 499 510 519 536 567 612 655 682 678 645 594
2636 594 545 509 488 480 484 492 492 480 467 465 471 472 466 455 442 431 424 423 418 405 395 400 414 418 410 405 413 425 433 437 443 454 468 479 477 453 417 391 388 400 424 459 496 517 515 507
2631E07LRJj1j7k6l0j9MJ9J6J1K0K8K2J0N%j1j9j1MJ0QJ1K0J7jj3pJ3K6K5J2KJLjj2j7j4o
2626E92LJ2J7J1LOK4L5L0K0K4L2K7J8K0L3L7K9K6L7M8N2N0M9M2K7J8K1K4J9R%j2k7l1j6RK6
2621A344K3J1knJRJ0mk4l6l9m0m0l7l1k8k7k9k7j9j2qj5k2k3j9j7k2k3j1OJ6J4J3K0K8J7p
2616I45k2j0J7L0J6%QL2M5L7L0L4M0L3J9OKNJ4K6K9J2j2k4k8l0l5l4l1l5m3l9k0MJ8K7L6L9
2612A141L6L0K2Kk0l2k1opj7k5k8l7m8m7m4m7n6n1k8j2j1j2lPjk0l2l1k8k3oK1L6K6jk0k5
2607E82k3j9j6j4j6k4l0k7rJ5K6J5j2k9k1LK3K7K0J0Lnj1j1lPRLklKQRROmj7k3j3NJ5J4Jj4
2602D66k8k9j6%NJJJ2K1J4Knllqj4j9k1k2j8j2mOJ7J7Lj1j2mJl%J0J3Jj7k1j4n%PJ5J3jrm
2596C22PJ1J0J3J9K1K0J7Rrk8l5k7j8j5j0QK6K6Qnolmprj5j6pJ8M0M5M2L5K2%j9k0mPLj2k3
$$ plain form
2631 507 510 519 520 509 492 466 436 417 421 440 456 467 487 515 537 547 552 552 541 522 511 515 525 533 544 564 581 580 567 560 573 599 624 636 638 639 642 641 629 612 598 592
2626 592 595 607 624 635 638 644 668 703 733 753 777 809 836 854 874 907 944 973 999 1036 1084 1136 1186 1235 1277 1304 1322 1343 1367 1386 1395 1395 1383 1356 1325 1309 1318 1344
2621 1344 1367 1378 1376 1371 1372 1381 1391 1387 1363 1327 1288 1248 1208 1171 1140 1112 1085 1056 1029 1010 998 990 975 953 930 911 894 872 849 838 844 860 874 887 907 935 952 945
2616 945 923 913 930 960 976 976 984 1016 1061 1098 1128 1162 1202 1235 1254 1260 1262 1267 1281 1307 1336 1348 1336 1312 1284 1254 1219 1185 1154 1119 1076 1037 1017 1021 1039 1066 1102 1141
2612 1141 1177 1207 1229 1231 1211 1179 1158 1152 1145 1128 1103 1075 1038 990 943 899 852 796 745 717 705 694 682 679 686 685 665 633 602 574 551 545 566 602 628 627 607 582
2607 582 559 540 524 510 494 470 440 413 404 419 445 460 448 419 398 401 424 451 471 481 484 479 468 457 454 461 470 473 471 468 470 478 487 496 502 498 481 458 445 450 465 479 480 466
2602 466 438 409 393 393 398 399 400 412 433 447 449 444 441 438 430 416 397 376 354 336 324 320 326 343 360 363 352 340 336 337 334 334 344 357 358 341 320 306 301 301 308 323 336 335 326 322
2596 322 329 340 350 363 382 403 423 440 449 440 412 377 350 332 317 307 315 341 367 375 370 364 361 357 350 341 326 310 303 321 361 406 448 483 505 505 486 466 462 469 472 460 437
2591D37l3m0l7k1OK0J2pj3JJ9K5J9J2Nrk5k5mJ1Nj0j2lklOK5L1J4qj0KJ9K6K1Mj4k2j7mKL
2585D06mj2j7j0LPlj3j3j3j5j5oQJ1Njpj4j9j1NJ5J2OMKoj1j1kPJ4K1K6K9K3Rpk0k2j6rok
2580C28KJ0J0NLRJ7J7RPJ4J4jk2k5j5rj1oJ1J9RnkPPOJ3K1Qj6l1k3r%RK0J9RLLjj3j7mLok0
2574C76j8MK3K9K2Oj1j9j3mkjMRlj8j4NJ1j0l3l2rJ4K3J9Kj5k1pJ2K2K7L3L3J1k2l7k4lNM
2569C78NOkj4k0j7j4j2%J5K5K6K6L5L5J0l0n4n3l7j8kJ9L5L2J1j6l3k9rJ2J8J2NQJ6Rj2l0
2564C36k7rJ1K5L5L8L0J6OJnnJ3L8M0Pl7m8k8qj3k4j9jJ0J1RQKnlNKqj4oQJ9K8K9J5pj8rk
2559D46j0k6k5qRJ4J3Qpk0j7KJ5J1kprj6k4k5j9j3nOJ9K4K2J2lk2l2k4ML2M4L3J0j1j9j3k
2554C65Joj8k5k7k4j4KRlj9j6J2L7L5Oj8j6KK0L3M2M1K5lk3j9jJ1Rmj5j7oJ1J7PlMJ9J9mk4
$$ plain form
2591 437 404 364 327 306 312 332 344 337 324 325 344 369 388 400 405 396 371 346 342 353 358 348 336 333 331 328 334 359 390 404 396 386 388 407 433 454 458 444 422 405 401 403 406
2585 406 402 390 373 363 366 373 370 357 344 331 316 301 295 303 314 319 318 311 297 278 267 272 287 299 305 309 311 305 294 283 281 288 302 323 349 378 401 410 403 383 361 345 336 330 328
2580 328 330 340 350 355 358 367 384 401 410 417 431 445 444 422 397 382 373 362 356 367 386 395 390 388 395 402 408 421 442 450 434 403 380 371 371 380 400 419 428 431 434 433 420 403 399 402 396 376
2574 376 358 362 385 414 436 442 431 412 399 395 393 392 396 405 402 384 370 375 386 376 343 311 302 316 339 358 360 345 324 317 329 351 378 411 444 455 433 396 372 369 374 378
2569 378 383 389 387 373 353 336 322 310 310 325 350 376 402 437 472 482 452 398 345 308 290 288 307 342 374 385 369 336 307 298 310 328 340 345 353 369 378 366 336
2564 336 309 300 311 336 371 409 439 455 461 462 457 452 465 503 543 550 513 465 437 429 416 392 373 372 382 393 402 410 412 407 404 409 411 403 389 383 391 410 438 467 482 475 457 448 446
2559 446 436 410 385 377 386 400 413 421 414 394 377 379 394 405 403 396 387 371 347 322 303 290 285 291 310 334 356 368 365 343 311 287 291 323 367 400 410 399 380 367 365
2554 365 366 360 342 317 290 266 252 254 263 260 241 225 237 274 309 315 297 281 283 303 336 378 419 444 441 418 399 398 409 418 414 399 382 376 387 404 411 408 412 431 450 446 422
2548D22k1lPKkKPRJ0J1Noj2j6j4mJ7L8L6Pk6l5k8j8j0JQJj6j7lJ1NnmQJ8K0J9J3Lqj3j4k1
2543C84k6j8KJ6J1j0k8l3k0%J8J8NqqOJ7J1mj1%J7K2Qj4l2l4k2lJ2J2JqrmmlPK3L8M5M4L2
2538D50J0k0m3m8l1nJ3RloOJ4Rjl%lpqmnqrnlj1j8j3lPRJ0J7K5K9J4rk1j0RJ1lj2mJ5K6K1
2532C88Rjlmj1j9j8kJ2J2MPK1K2Jj8j9j0pnLJ9K7K3J1pk4k7j3RK0K1J7Nj6l1k4pKoj2pKJ1
2527C55K0K9K2LqJJ3J3JnJJ5K6K2Nj9l1k5j1oj2k2k6j7LK2K4J2KLLlj2j4j3qlPRKm%POklO
2521C88J7J7RJrk2k9k5rRJ9Rj0k3j8mOJ0J6K1J8Mj1j6j0MK2L2K2%j4j0LJ3J5J1%j7k8k3j4
2516C74rj5k2k1oK1M2M3K5Okrj8k7k4j2kKRJ4J2jrj0poqpmKRJ6J8J5J2J1QLKLjj3k7k8j3M
2510C50QJlOJ8J5jj7k1j3kNP%j0pJ0K6K2Kj0ppj3j3PK6J6j3l1j8RK2J9J4K0K5J6kj8k3k5l0
$$ plain form
2548 422 401 398 405 407 405 407 414 423 433 444 449 443 431 415 401 397 414 452 488 495 469 434 406 388 378 379 387 388 372 355 352 363 368 363 359 367 385 405 424 437 440 432 419 405 384
2543 384 358 340 342 358 369 359 331 298 278 278 296 314 319 311 303 309 326 337 333 322 322 339 361 369 355 323 289 267 264 276 288 289 281 272 268 264 261 268 291 329 374 418 450
2538 450 460 440 397 349 318 313 326 335 332 326 332 346 355 354 351 351 348 341 333 329 324 316 307 302 299 288 270 257 254 261 270 280 297 322 351 365 356 335 325 334 345 342 330 326 341 367 388
2532 388 397 396 393 389 378 359 341 339 351 363 367 374 395 417 418 400 381 371 364 359 362 381 408 431 442 435 411 384 371 380 400 421 438 443 427 396 372 365 367 361 349 342 344 355
2527 355 375 404 426 429 421 422 435 448 449 444 445 460 486 508 513 494 463 438 427 421 409 387 361 344 347 369 393 405 407 410 413 410 398 384 371 363 360 367 376 378 374 374 381 387 385 382 388
2521 388 405 422 431 432 423 401 372 347 338 347 366 375 365 342 324 320 326 336 352 373 391 395 384 368 358 362 384 416 438 438 424 414 417 430 445 456 456 439 411 388 374
2516 374 365 350 328 307 301 322 364 407 432 438 436 427 409 382 358 346 344 346 355 369 381 380 371 361 354 348 340 333 329 331 340 356 374 389 401 412 420 423 425 428 427 414 387 359 346 350
2510 350 358 359 356 362 380 395 394 377 356 343 341 346 353 353 343 336 346 372 394 396 386 379 372 359 346 353 379 395 382 351 333 342 364 383 397 417 442 458 456 438 415 390 360
2505C60l1j9kOOJ2K4K6J6Lmj0j7j0J6M1M3K7J6J4Jk3l4j9kkj1mJ5K0Kk2k8j6mkj4k7k9j9o
2500B93LQJ4J9J2rk7k9j7qkJJ2K5L5K8Ok1l2j6J0J9Pj2qJ3K8K1OKJ1J4KroJ3K3J3j0k4k0m
2495C84QPJKPMoj2oNPJkjjj0j8k0j1OK3L4K8J4%JRJ9J9J1%jONj4m0m9l1j0nj2j3JJ3J3PKJ
2489C76kllJJ0J6J5OpqPK4K8J3qk4l2k9j9kJ2J6J3Omj5k2j5KJ4Lk2l6k8oJ6K9K8J5LLJ9K9
2484D19J7rk7k3oJ4K9K6Lk7l7j4J5K5J9J4J7J2oj9j0J0J4nk7k6oJ1Prk2j9nQJ2Ojlk%%NJ0
2478C90J1LlnJJmj2j2%J4J7PjOK0K7K2J7K1K5J2j2k6j9LK6L5L1J3ok1k7k3j3opj1rmlnjNL
2473D80j2k2j0QLk2l4j7J1K6K1J0lj5j7oJ0J4Plom%LMjqj1oMJ9K4J3rk3k3k1k7k4pJ2J5QR
2468C70J3Prj9j7qMJ6K2J5RJ2J8Rj2j8KK1K1Omrj5j8j2nllkmj7k8k6j2llJRJ5J6J7J5J1NM
$$ plain form
2505 360 329 310 308 314 320 332 356 382 398 401 397 387 370 360 376 417 460 487 503 517 518 495 461 442 440 438 427 423 438 458 460 438 410 394 390 388 374 347 318 299 293
2500 293 296 304 318 337 349 340 313 284 267 259 257 258 270 295 330 358 364 343 311 295 305 324 331 319 311 324 352 373 379 381 392 406 408 399 393 406 429 442 432 408 388 384
2495 384 392 399 400 402 409 413 407 395 389 394 401 402 400 399 398 388 370 350 339 345 368 402 430 444 444 445 454 473 492 503 503 502 508 513 499 459 410 379 369 364 352 339 340 353 366 373 375 376
2489 376 374 371 368 369 379 395 410 416 409 401 408 432 460 473 465 441 409 380 361 359 371 387 400 406 402 387 365 350 352 366 369 347 311 283 277 293 322 350 365 368 371 390 419
2484 419 436 427 400 377 371 385 414 440 443 416 379 365 380 405 424 438 455 467 461 442 432 442 456 451 424 398 392 403 410 401 379 360 355 363 375 381 380 377 375 375 375 380 390
2478 390 401 404 401 396 397 398 394 382 370 370 384 401 408 407 413 433 460 482 499 520 545 557 545 519 500 503 529 564 595 608 602 581 554 531 518 512 505 494 485 481 478 473 472 477 480
2473 480 468 446 436 444 447 425 391 374 385 411 432 442 439 424 407 401 411 425 432 429 423 419 419 422 426 425 417 406 400 404 423 447 460 451 428 405 384 357 333 326 338 353 361 370
2468 370 383 390 381 362 345 337 341 357 379 394 403 415 433 442 430 412 414 435 456 462 458 449 434 416 404 399 396 393 391 387 370 342 316 304 301 298 299 308 323 339 356 371 382 387 391
2462C91NkroPJ6J2Nkpj1j0l%pj4j2%OJj1j4jJ8K5J0lMK6L2J2pj1j1j5j5MK4K4Qml%oj7k5l1
2456C73l1k1kK0K9K5J6Olj3j5j3ojJPK3M0M5L3J5lk1l9m8l7j8ljjkJMMlj5j9oPMj2j6nLjo
2451B95mKJLJ4K8L0K0J2J5K4L3L3J6j0k6k4j3j1j6j9j9k0k1j8oMJ4J9K0J2PJ5K9L1K1J3J1
2446E15Plj0j4j9k5k0mMnj6j3JLpj7k2j9nK2M0L5J0j4k5k5j4PK6K1kk1j9mK%oj0rkJ0J7J7
2441C87J2Nnj3j1noj1pJ1K5K3J8K5L1J5j8l2j4J2J6kj6k0j3nMJ2J3J0NKJkmpj1j1kJ0J7J6
2436D55RJoj4k7l7l3j6jPNJ0K3L3L1K7K5K6J8Jrqmj0k6l6l1j8qj1k2l3l0j3J1K4J8LmJJ2K2
2430C65K3J9J4J0RMnj2j3oNJ6K6K2Jk7m1l8k7k2j9j2LJ8K9L6M1L6K0Mk%jj2k5l0k1roqpNJ3
2425C76J3QJ2K2K9K6K3J9J1lj5j7j2j0nKJ1J2Mj4l2m1l0kK2K8J7kj2j8j6lJ9L3L0J0j2k6k9
$$ plain form
2462 391 396 394 385 379 386 402 414 419 417 410 399 389 386 386 379 365 353 353 359 360 349 335 334 352 377 387 384 388 414 446 458 451 440 429 414 399 403 427 451 459 455 452 452 446 429 404 373
2456 373 342 321 319 339 368 393 409 415 412 399 384 371 365 364 365 372 395 435 480 513 528 525 504 465 417 380 362 359 358 357 355 356 360 364 361 346 327 321 328 332 320 304 299 302 301 295
2451 295 291 293 294 297 311 339 369 389 401 416 440 473 506 522 512 486 462 449 438 422 403 384 364 343 325 319 323 337 356 376 388 395 410 439 470 491 504 515
2446 515 522 519 509 495 476 451 431 427 431 426 410 397 398 401 394 377 355 336 331 353 393 428 438 424 399 374 360 367 393 414 412 391 372 368 370 370 364 354 345 343 353 370 387
2441 387 399 404 399 386 375 370 364 353 346 357 382 405 423 448 479 494 476 444 430 442 458 456 440 420 407 402 406 418 431 441 446 448 449 447 443 436 425 414 412 422 439 455
2436 455 464 465 459 445 418 381 348 332 331 338 343 353 376 409 440 467 492 518 536 537 528 520 516 506 480 444 413 395 387 376 354 321 291 278 289 313 331 334 330 331 343 365
2430 365 388 407 421 431 440 444 439 427 414 408 413 429 455 477 478 451 410 372 345 323 304 292 295 313 342 378 419 455 475 479 477 477 476 464 439 409 388 379 373 365 358 363 376
2425 376 389 397 409 431 460 486 509 528 539 536 521 504 492 482 477 479 490 502 506 492 460 419 389 387 409 437 454 452 440 422 406 403 422 455 485 495 483 457 428
2420D28k9k6k1j1JJ3J3LlPK6L0K0QJ0J4QkmNOoj8j5%Olj8k1qRJ9J8J4QK%RK2K5Qj9l4l2k2
2415D40j3kRJ5J0LKKmj4j7roj0j7j2LJ5J4Jj0j4j1oNK0L3K8Rnljj4l4l7j9KOJJJ2K4K5J9J3
2409D54J3J3NppOJ4Pj0j8pQJ7J6Kk3m2l5qJ1Kj9k7j8rjORjj4j0RK4K4J7J2J2QNLkqj1o%KO
2404D22J5K0Pj3k0j2jLPJ4J2%j1kK3M4M3J9j0l0l9l4k0mOJ1J2P%mJOok9l9k4KJ1PNJ5K4K0
2398D58Lj0j4j4j1pLJ2J6J0Knj5k8l5k4LK3J6qj9mK1K8J4lqjNMlpqlJPPLknkJ%jKKknKJ8K8
2392D45K5J8J1jj7k6k0oJMJ1K2K4J2oj4nJ0J5J1Jlmoqnmpj5j2%J0Ooj7k3k5j8nNMjkmooQK1
2386C92K0Jj4j5o%MPRJ0J4J6J0LKJ2K1J8Lj8l6m4l1qOMmkQJ4J4RKmqppj2j2lQJ2RNJ0J7K3
2381D52K2J2nk6l8l7k0OK9L8L2K0J3J0KppjMjj0j8k1k2k1j7j5j6j3jJ5K4K2J3J0J4J7Oj0j4
$$ plain form
2420 428 399 373 352 341 342 355 368 371 368 375 401 431 451 459 469 483 491 489 485 490 496 490 472 457 457 463 460 442 421 413 422 441 459 473 481 483 483 492 514 539 547 528 494 462 440
2415 440 427 425 434 449 459 462 464 466 462 448 431 422 416 406 389 377 380 395 409 410 400 386 375 369 374 394 427 455 464 459 456 455 441 407 370 351 353 359 360 361 373 397 422 441 454
2409 454 467 480 485 478 471 477 491 498 488 470 463 471 488 504 506 483 441 406 398 409 411 392 365 347 338 337 343 352 351 337 327 336 360 384 401 413 425 433 438 441 439 431 420 414 414 416 422
2404 422 437 457 464 451 431 419 418 421 428 442 454 454 443 441 464 508 551 570 560 530 491 457 437 433 439 450 462 469 469 465 466 472 466 437 398 374 376 387 394 399 414 438 458
2398 458 461 451 437 423 412 405 408 420 436 446 448 443 428 400 365 341 344 367 383 375 356 352 373 401 415 412 404 403 408 412 409 402 394 391 392 399 406 409 407 402 400 401 401 400 402 404 402 397 399 417 445
2392 445 470 488 499 498 481 455 435 429 430 434 445 467 491 503 497 483 478 488 503 514 515 512 508 502 494 489 485 478 463 451 451 461 467 461 444 421 396 378 373 378 382 381 379 375 369 363 371 392
2386 392 412 413 399 384 378 378 382 389 398 408 422 438 448 451 453 465 486 504 507 489 453 409 378 370 376 380 376 374 382 396 410 419 421 417 409 402 395 383 371 368 376 388 397 402 412 429 452
2381 452 474 486 481 455 417 380 360 366 395 433 465 485 498 508 510 503 496 495 499 498 488 470 449 427 406 389 374 358 345 344 359 383 405 418 428 442 459 465 455 441
2376D41OL5M0J4j9l3k7j7k1l0l0j2J8L7L5J2j4k6k2r%Jlrj0rj0j1mJ3L1L8K9J5NJjnqj4j3
2371D14oNN%KJ2J2j3m0m0j9lomJ5L2K9J1MNKlLJ8K1OrrlMJ3K5K7J3%kjj3l1l1j1J2J6Ppj7
2365D45k3k0j1KJ8K9K1pk9k1KJ1LJJ6K4Qj7k4j9k1k6j5J1K9K5PnmOJ4J5J0J1J6J5O%LKj2k4
2360D72j8oqk1j9kQKmKOjpOK1J9J0OPkj6j8roqmOLj3k7k5j8j2jJ5K5K2J8K3K6J3pj3lPQNj
2354D61ppOJ9J7%j0p%jj1k3k7k1oJ0K0K1K0J5NnqkL%pj4j8j6qloj6j8j2nmlPJ9L1L1K2Mj0
2348D36j2pkkjNQORJ5J0kpLJ4J0jlOJ2ROjj7l3l7k4oPJ8K6J7mj6qL%rr%PMnroLJ4J4%j3j3
2342D15ooj0oJ3K3J5%nnqj8j5LJ6J1kkPOoj1OK9L5K1%j2j5j2nLOkj5k1j2QK6L3K4J3Mknqo
2336E02mJNOKj1k1k4k5k7k1jK0K8J6ok0k5k0j1opp%J3K2K7K9K5J1j%J0J2Kpj4k0k3j0J8L6
$$ plain form
2376 441 447 482 522 536 517 484 457 440 419 389 359 347 365 402 437 449 435 409 387 378 378 379 376 367 357 348 338 327 323 336 367 405 434 449 454 455 454 449 441 427 414
2371 414 408 413 418 418 420 432 444 431 391 351 332 329 323 319 334 366 395 406 410 415 417 414 417 435 456 462 453 444 441 445 458 483 510 523 523 521 520 507 476 445 434 446 462 469 462 445
2365 445 422 402 391 393 411 440 461 454 425 404 406 417 420 421 437 461 469 452 428 409 388 362 347 358 387 412 419 414 410 416 430 445 455 466 482 497 503 503 506 508 496 472
2360 472 454 448 440 419 400 398 406 408 404 406 412 411 404 410 431 450 460 466 473 471 455 437 428 422 414 410 416 419 406 379 354 336 324 323 338 363 385 403 426 452 465 458 445 442 449 457 462 461
2354 461 454 447 453 472 489 489 479 472 472 471 460 437 410 389 383 393 413 434 454 469 474 469 461 459 462 462 455 441 423 407 399 396 390 374 356 344 339 335 332 339 358 389 420 442 446 436
2348 436 424 417 415 413 412 417 425 431 440 455 465 463 456 459 473 483 482 479 485 497 506 512 511 494 461 424 400 394 401 419 445 462 458 442 434 437 437 428 419 419 426 430 425 416 410 413 427 441 441 428 415
2342 415 409 403 393 387 400 423 438 438 433 428 420 402 387 390 406 417 415 413 420 426 420 409 415 444 479 500 500 488 473 461 456 459 465 463 448 427 415 423 449 482 506 519 523 521 516 508 502
2336 502 498 499 504 510 512 501 480 456 431 404 383 382 402 430 446 440 420 395 375 364 358 351 344 344 357 379 406 435 460 471 470 470 480 492 494 487 473 453 430 420 438 474
2331D74L5J8jj9l2k9j3knqKJ2J0JJOJ0J2J2Pj0k0qJ1Pj5k8j6JRQPPJk%MKNJ3K2J7lk1k3j1
2326D48PJ3Opj0KJ7K1Nj8l1k1KJ6RkMK0K5J2j1k5k1%K2K0lk3j7JQPJ8L9L7J2rnRJ7J8K1K0
2320F53J3J1J7J9ROK4M2L7J5QJ8K4J5OLqk7m2m0k8k1k0j8j6j6j5j3j0p%QRnk4l3k2%Qnk3k7
2315E25j5kkokJ0K3K8K2Lj9l3k8j6j3k4l4l8k9mK7M2L0Mj7k2k3k2j4jRQPJ0J1RPJ4K1K0Qq
2310D66j6j2nmj5k4k2j3kJ2K5K9J5klQJ3N%RK0K1J0nk3l4l1k0j3k1k3oJ5K5K6K3K0J4J0RN
2305D86pj3%J8J5%oLNqj7pJ0Qj3k6j4PJ2mk3k0OK6K3Lj1j4j3qJ4M6N8L5mk3j4MJ0Lj1k1k3
2300D92j2OJ5Qqj8j5nJPJ3J7Oj7l7l9k9j6lNLrj7pK1M1L6J6Jllj%MJ1J4J1%j3k1j7lJ4K4K5
2294D98J4%j4k3l2l9l2qK4M4L9J8lj5j5qJNQJ1J8K1J0qk0j5onj0j3qorj3oJ0K5L3L3L1K4J2
$$ plain form
2331 474 509 527 526 507 475 446 433 431 426 418 420 432 442 443 444 450 460 472 484 491 481 461 453 464 471 456 428 412 413 422 430 437 444 445 443 443 447 449 454 467 489 506 503 482 459 448
2326 448 455 468 474 467 457 459 476 497 502 484 453 432 434 450 459 457 461 481 506 518 507 482 461 461 483 503 500 477 460 461 469 476 494 533 570 582 573 568 577 594 612 633 653
2320 653 666 677 694 713 722 728 752 794 831 846 854 872 896 911 917 920 912 885 843 803 775 754 734 716 700 684 669 656 646 639 639 647 656 651 627 594 572 572 580 575 552 525
2315 525 510 508 506 500 498 508 531 559 581 584 565 532 504 488 475 451 417 379 350 346 373 415 445 449 432 410 387 365 351 350 359 367 374 384 395 404 411 425 446 466 474 466
2310 466 450 438 433 429 414 390 368 355 353 365 390 419 434 432 429 437 450 455 455 464 484 505 515 510 487 453 422 402 389 368 345 339 354 379 405 428 448 462 472 481 486
2305 486 479 466 466 484 499 499 493 496 501 493 476 469 479 487 474 448 434 441 453 449 426 406 412 438 461 464 453 439 426 418 432 478 536 571 567 544 530 534 544 547 536 515 492
2300 492 480 486 501 509 501 483 468 463 464 471 484 501 507 490 453 414 385 369 366 371 374 365 348 341 362 403 439 455 456 453 450 449 449 453 464 478 489 489 476 455 438 435 449 473 498
2294 498 512 512 498 475 443 404 372 364 388 432 471 489 486 471 456 448 449 454 462 473 491 512 522 514 494 479 473 468 458 445 437 431 422 409 403 413 438 471 504 535 559 571
2289E71j0k9l7l0j4%NKj%OPjj4j8j3j0j9k6j8LJ4J2RNkj5j4NK5L0K4J8J0nj9k4k6l1k7nK6
2284C64L7K6J5J8K2J2kkPJ2Jj5k6k9k7k3k3k1j8pKRJ1J0OLLJ0J6J5J0Ljlmmj0j3nOJ0LljJ
2279C95pj1qlprMK8L6J8qj7j3nk%NRPjj1j5j3j3k1k1JK9L8J9lnPJ3QOOrl5m5j9K0M0L0J4P
2273D39OMKMJrj3MK2J3j6l2j4J0J4lqKJ6J6RNJqj8k2k0j3mOQNPJ9K8J7j1l0j9PJ8Kj7j9qj
2267D00lKJ7K8J6j0k4k0j0noqrrlPJ3RKlmpkJ1K4K1Lj3j6j5j3oJ2L4L6K2RNLj2k7j9OK7K5
2262D88Nj4k1j8oRK5L0K1QJJjrj7j8j4j4j2pklpoPJ7K1J6J0lk1l2k5j1KQJ2J5J3J4J2QkjJ5
2256D94L2K0j0k8j5MKj3k4k7k4j7pkj1k4k6k0j5j1lJ4K7K7J7OLJ1J8Qj2j9ML5M7L3J6Mok0
2251D88k1pRJ5J2Nj0k8l8l6k2pMJ5K0J8J0jnJJ6K4J8NJjj1k7k6%K4K1Jj0pKMOOJj3k1j5JJ1
$$ plain form
2289 571 561 532 495 465 451 451 456 458 457 457 463 470 469 455 437 424 414 395 369 351 354 368 380 389 394 392 377 363 368 393 423 447 465 475 470 451 427 401 370 343 338 364
2284 364 401 427 442 460 482 494 492 490 497 509 510 495 469 440 413 390 367 346 328 321 323 332 343 353 359 362 365 375 391 406 416 419 418 415 411 407 397 384 379 385 395 398 395 394 395
2279 395 388 377 369 366 359 350 354 382 418 436 428 411 398 393 391 391 396 405 412 411 400 385 372 359 338 317 318 347 385 404 401 396 403 416 424 430 436 427 392 347 328 348 388 418 432 439
2273 439 445 449 451 455 456 447 434 438 460 473 457 425 411 421 435 432 424 426 442 458 467 472 473 465 447 425 405 392 388 394 402 407 414 433 461 478 467 437 418 425 443 445 428 409 401 400
2267 400 397 399 416 444 460 450 426 406 396 391 385 377 368 359 356 363 376 385 387 384 380 373 371 382 406 427 430 417 401 386 373 367 379 413 449 471 480 485 488 476 449 430 436 463 488
2262 488 493 479 458 440 434 443 468 498 519 527 528 529 528 519 502 484 470 456 444 437 435 432 425 419 426 443 464 480 490 487 466 434 409 398 400 408 420 435 448 462 474 482 480 479 494
2256 494 526 546 536 508 493 497 499 486 462 435 411 394 387 385 374 350 324 304 289 278 275 289 316 343 360 366 369 380 398 406 394 375 379 414 461 494 510 514 508 488
2251 488 467 460 469 484 496 501 491 463 425 389 367 360 364 379 399 417 427 426 421 422 438 462 480 485 486 485 474 447 421 421 445 466 467 457 450 452 456 462 468 469 456 435 420 421 432
2246D32Pnj2j1qj4k1k1j4rmQK7L8L5K4J7J0%pmQJ7J8J0jj0j5j2pJJ3J7Mk0k9j9j1k2l5k6l
2241C46RPJ0K3L2K6J4NkoJJ5K1Roj5j9k0j7pNJ3J6J0lj7k0j2mmqqj1j7j6kJ8K8K2J1%j0j1
2236D06kJ2J5PlpJQJ1QMLjopllj5l6m2k3PK3K3J7J8K3K1Nj4k2qJ6K7J8JoJPKqj3mJ5L2L3J6
2230E57lj4j3oJOJj2k2j6kOKoj0j8k5j9JK1K0Mo%RMjQK9L9K2kj3j1qj1j3j5k2k8k4j2nlNK1
2224D16L0K1jk0l4m0l4j6jkqnMN%MJ8K6J8Njmoql%j%QJ5Nk1l5k6mJ5K1K4K7K0MqoQJ7J9J2
2218D58PNMjj1k1k2j2loj0%K4L5K1mj8j3KJ5K5K5Rj1k6k7k1j2nkjJNJ3J9J9J0oj7j3kjj3j6
2213D03jJ4J3MPJ6J5NKMnk1k1pLqj9j4LJ7K6L8M3K9Nj4j6j0noj6l0l2j8%PJ1K2L4L2J5nj7
2208E03k9l6k9j2MN%KJ0J4Rmj4j9j6qkjjLJ6K5K3J0pj5pJ4L3L8K4jk2l4l2k4j1nqj5j1OJ7
$$ plain form
2246 432 439 434 422 411 403 389 368 347 333 324 320 328 355 393 428 452 469 479 479 472 468 476 493 511 521 520 510 495 483 476 477 490 507 511 491 462 443 432 410 375 349 346
2241 346 355 362 372 395 427 453 467 472 470 464 465 480 501 510 504 489 470 450 433 426 431 444 460 470 467 450 430 418 414 410 402 394 383 366 350 348 366 394 416 427 427 417 406
2236 406 404 416 431 438 435 428 429 437 448 456 460 463 462 456 449 446 443 428 392 350 327 334 357 380 397 415 438 459 464 450 428 420 436 463 481 482 476 477 484 486 478 465 461 476 508 541 557
2230 557 554 540 527 521 522 528 529 517 495 479 477 483 485 479 469 451 426 407 408 429 449 453 447 447 456 460 459 467 496 535 557 555 542 531 523 512 499 484 462 434 410 398 393 390 395 416
2224 416 446 467 466 446 412 372 338 322 321 319 311 306 310 315 315 319 337 363 381 386 385 381 375 367 364 364 363 363 371 386 391 370 335 309 305 320 341 365 392 412 416 408 402 410 427 446 458
2218 458 465 470 474 473 462 441 419 407 404 398 388 388 412 447 468 464 446 433 435 450 475 500 509 498 472 445 424 412 407 405 404 405 410 423 442 461 471 465 448 435 433 432 419 403
2213 403 402 416 429 433 440 456 471 476 478 482 477 456 435 428 431 423 404 390 393 410 436 474 517 546 551 537 521 511 506 500 484 454 422 404 404 411 422 444 478 510 525 520 503
2208 503 474 438 409 397 401 406 406 408 418 432 441 437 423 404 388 380 378 377 376 379 395 420 443 453 446 431 424 438 471 509 533 532 510 476 444 420 409 404 396 381 370 376 393
2203C93Mk2k9qJ5J5JkJ0K2K2J5J5J5J3J1J3J9K2J2kj1j2rj0j6k2k4k2j8j2kONmj1oRK5K6J1
2198D57mnMJ2J2J3J4Lj3k1j1krj7j4qj2k3k5k0k4k4lL1M4K6jqLJ1J0J1J8K7L4K9Rj7k6j7o
2193D58j1k1j4NJ5Oj1k0k0j5kJ2K5L2L5L6K6Qj3k8l7l5k1LK0K0J3J0J5K0J6Nrj9k4k7k7j8
2188D08lJ0J1Moj5k2k1rQK2K8L0L1K9J8%j8k2rJ1K3J6MNJ8J9nl8n1l6j4LJ5K3J8nk5j7J2L2
2183D82K3LjQJ1lj3j1mrj9j7plqpPJ9J1oqPJ8Pj3j9qMOLJLJ0J8J9Nj5k1qMok5k7mK3L1K0L
2177D84j3k1k5k3j5KJ8J9Lj0JK5K8Nj2KK1J8%lJ3K3J5RQjj8k5j2NRQRNj0k3k0%J9K4J8J0O
2172E76Ojj4k5k0l%k0l2j6J0J3llJ5K2QjJ8M4M5K1%opqnMRlj7j6kJ1Qpk0j9rjlj0j3rpnLJ1
2166E19J1kj1j0lpk0l2l0j8kQQOJ3K2J6rk6j2K1L7K7J2J6K6K0LqlRJ0Jj4k2j6LK0K3J3jpq
$$ plain form
2203 393 397 375 346 338 353 368 369 367 377 399 421 436 451 466 479 490 503 522 544 556 554 543 531 522 512 496 474 450 428 410 398 396 402 407 403 392 386 395 420 446 457
2198 457 453 448 452 464 476 489 503 506 493 472 461 459 450 433 419 411 399 376 351 331 307 283 280 311 355 381 380 372 375 386 396 407 425 452 486 515 524 507 481 464 458
2193 458 447 426 412 417 432 438 427 407 387 372 370 382 407 439 474 510 536 544 531 503 466 431 410 413 433 453 466 476 491 511 527 532 523 504 480 453 426 408
2188 408 405 415 426 430 424 409 387 366 357 365 387 415 445 476 505 523 523 505 483 474 485 508 524 528 533 551 570 565 527 476 440 426 429 444 467 485 480 455 438 450 482
2183 482 505 508 507 515 526 523 510 499 495 486 467 450 443 440 432 425 432 451 462 456 448 455 473 480 467 448 440 444 450 453 454 457 467 485 504 509 494 473 465 469 463 438 411 407 430 461 481 484
2177 484 471 450 425 402 387 389 407 426 429 419 420 445 473 478 466 468 489 507 507 504 517 540 555 564 572 571 553 528 516 521 530 538 547 552 542 519 499 499 518 542 560 570 576
2172 576 582 581 567 542 522 519 519 499 467 451 461 474 471 468 483 505 513 512 530 574 619 640 640 634 627 619 614 618 627 624 607 591 589 600 608 601 581 562 553 552 549 539 526 517 510 505 508 519
2166 519 530 528 517 507 504 497 477 445 415 397 395 403 411 417 430 452 468 459 433 421 442 479 506 518 534 560 580 583 575 572 581 591 592 578 556 540 543 563 586 599 598 591 583
2161E83qprp%J3J8Qoj0rj3k7l7k8lJ9J7kj9j7jJ5K0K4L1L4K8J2lj1qKJ6K1RplJ5K5J2pj4p
2155F59JJmj2k4l3l5k1JK1K9K3J6K0K9K8J3qj6rJ0K6K2mk8k9rOMljnk0k8j1J6K3R%MMmj0j1
2150F40j4k5k3kK4K7J4PJ0J6J0kj2j7j4mLMLNPJj1j4pPRmk4l2j8OJ6Kk0k8j7jPJ3K1K3Lk7
2144E62l9k4JRJlNOrk4k1lJ2J2J0J4K1K4K6K3J1j3l8m8l5j2J4K8K9J6jj0qJJ2J6J5Pjqj5j5
2139E48j0k%kkMJ8L0K7Nk6m3l2mJ5J3JmKJ2K0K4J9Kj6k5k0nJ6K8K5Nj0rkj0k7l3k4j2rlJ1
2134D95K1J3pj4kJ7K4J6jj2j7j2nNJ4K3L1L3K1lk3l3k8j7pPK2L1K7J7J0Lnj8k2j6pjJJmj3
2129E65j6j1mMJ0J7J7Pj1k8l0j6RK4K1Jj7k9l6l8k7nJ2J4Nj%KRK2L6M6M7M2K7Nj3j0LPok1
2124F33k3j3jMLljJ1K5K6J2mrrj0j1qmmj3k3k3j2PK1K5J8PkqpKRPmj1pnj2k1j9j4j0lJ0J9
$$ plain form
2161 583 575 568 559 552 552 565 583 591 585 575 566 553 526 489 461 458 477 494 492 473 456 455 470 490 514 545 579 607 619 616 605 597 599 615 636 645 638 635 650 675 687 680 666 659
2155 659 660 661 657 645 621 588 553 532 533 554 583 606 622 642 671 699 712 704 688 679 689 715 737 733 705 676 667 673 677 674 673 668 648 620 609 625 648 657 657 661 665 661 651 640
2150 640 626 601 578 576 600 627 641 648 658 674 684 682 670 653 639 635 638 642 645 650 657 658 647 633 626 633 642 638 614 582 564 570 586 588 568 540 523 522 529 542 563 586 589 562
2144 562 523 499 500 509 510 507 512 518 509 485 464 461 473 485 495 509 530 554 580 603 614 601 563 515 480 468 482 510 539 555 554 544 536 537 549 565 580 587 586 578 563 548
2139 548 538 536 536 534 532 536 554 584 611 616 590 547 515 511 526 539 540 536 538 550 570 594 613 615 599 574 554 549 565 593 618 623 613 604 602 592 565 532 508 496 487 484 495
2134 495 516 529 522 508 506 523 547 563 562 550 533 521 516 521 535 558 589 622 643 640 617 584 556 539 532 539 561 592 619 636 646 649 644 626 604 588 581 580 581 582 578 565
2129 565 549 538 534 538 548 565 582 589 578 550 520 504 513 537 558 559 542 513 477 439 412 407 419 433 438 437 437 439 448 470 506 552 599 641 668 673 660 650 653 660 654 633
2124 633 610 597 596 600 603 600 599 610 635 661 673 669 660 651 641 630 622 618 614 601 578 555 543 550 571 596 614 621 619 611 604 606 615 622 618 607 600 595 583 562 543 529 519 516 526 545
2118E45J5RJ9L8M2K3jj5k5l4k8lJ8J3nqOJ3lk8l5j5J8L5K0j2l0j6OJ4QNPN%OJ5Pj4k2nJ2R
2113F09jjLok3k7j7pjPJ5Qqj8j1lmrj3j2pRK6K6Qj0j2qpnQK6L0K2J8K3K9K6J3mk0k9k4j9j8
2107E82j9j9k0l1l6j4L0O4N9L3Qrk6l9l6j9pjJJrk4k5j0RJ0%mj%rj9k1rJ1K5K6J8J1J5K0J9
2102E35J2MLMJ1J9K7K5J1pk4l1l0k3j7j9k3k1oJ4K6K6J8RKmm%J0J5RkpLJ7K2J7J0L%mpj3j8
2097E92j8pMRRJ2J0pl2m2k3MJ7J9K4K7J8kpOJ3Lj3j2JNlj1nK%j0j7oJ4L1L3K3J0KKLkj8l7
2091F21m8l9k4j7j3JK6L9K9RKQJ0kk1l0k6nJ9L0J9lj6j5j0pjRJ5J3Q%j1k2j3J7L7L1Prj2j7
2086E89l2l9k4LK1K3J5J2J5K2J8Jk2l3k5lJ8K7K2Orj3n%nj3j6j3mOJ4J2Jj3j2JJ0Nqj1kNl
2081E41j9k4oK3L9L0PnKJ2J3Jj2j9j7j7j4jK2L9L2Qp%J6K7K3J2lj9k7j5MJ6J4QKmj1j0k%o
$$ plain form
2118 545 560 569 588 626 668 691 690 675 650 616 588 585 603 616 611 603 609 622 619 591 556 541 559 594 614 602 572 556 562 576 584 589 596 601 601 607 622 629 615 593 588 600 609
2113 609 608 607 610 604 581 554 537 530 529 536 551 559 551 533 522 519 515 506 493 481 474 483 509 535 543 533 521 513 506 501 509 535 565 587 605 628 657 683 696 692 672 643 619 600 582
2107 582 563 544 524 493 457 443 473 537 596 629 637 628 602 563 527 508 501 500 501 502 493 469 444 434 443 453 453 449 448 448 439 420 399 390 401 426 452 470 481 496 516 535
2102 535 547 551 554 558 569 588 615 640 651 644 620 589 559 536 519 500 477 456 450 464 490 516 534 543 545 541 537 537 547 562 571 569 562 565 582 604 621 631 634 634 630 623 610 592
2097 592 574 567 571 580 589 601 611 604 572 530 507 511 528 547 571 598 616 614 607 613 626 629 616 604 605 610 607 596 591 593 593 583 566 560 574 605 638 661 671 673 675 678 676 658 621
2091 621 573 534 510 493 480 481 507 546 575 584 586 594 604 602 581 551 525 520 539 569 588 585 569 554 544 537 536 545 560 573 581 581 570 548 535 552 589 620 627 618 606 589
2086 589 557 518 494 497 518 541 556 568 583 605 623 624 602 569 544 541 559 586 608 614 605 592 587 587 582 569 553 540 536 542 556 568 569 556 544 545 555 560 552 541 539 544 541
2081 541 522 498 492 515 554 584 591 586 588 600 613 614 602 583 566 549 535 534 556 595 627 635 628 628 644 671 694 706 703 684 657 642 646 662 676 684 686 682 671 661 659 659 653
2076F53jK3M5L7Jk8l0j7j2j9k7k8k1qLJ1J0J2J4J3NmnLRLj1j9qJ3K6K6J5Mj0k5l2k6j8j7j5
2071E45%K4L4K7J8K2K0OrnJ1J4jj4j1%PRN%mmLJ4K3K4J4%KJ7K2Oj9k4qMkj3j6j5k0k5j9nN
2065F62RJ3K0K7L1L2K9K1J1Llrj6j6oRJ6RmrojlomMQPNPQJrj5rJJ4K7K9J6pk3j8NK7L2J7k
2059I34j1pkmlOJ6J5MmnlljMQJ0J1J4J3%j4j2J1L7M9M3L3L0K6K1K2L3M5M8M8N9P3P3N9N1O2
2054A789P4P4O3O1O8P6Q2R4J12J27J32J30J32J42J53J55J46J44J64K03K34K46K54K74K92K88
2051E709K66K44K36K30K17J98J73J36Q3L0j0m2p4j04j18j17j17j39j74j95j85j51j23j17j22
2048E734j21j19j30j45j41j17r6r6j12j28j37j42j45j53j66j77j70j42j15j10j20j26j25j22
2045B579j15j00q8r0r5q5n6l1k9m2n0m2l0k5l2m3m4l3k3k8m7o0n6m0l1l7m4l9j7OJ5J1NKo
$$ plain form
2076 653 652 675 720 757 758 730 700 683 671 652 625 597 576 568 571 582 592 604 618 631 636 632 627 630 639 642 631 612 604 617 643 669 684 688 678 653 621 595 577 560 545
2071 545 545 569 603 630 648 670 690 696 687 682 693 707 706 692 681 681 688 697 702 702 698 694 697 711 734 758 772 772 774 791 813 819 800 776 768 772 770 757 741 726 706 681 662 657 662
2065 662 671 684 704 731 762 794 823 844 855 858 855 846 830 814 808 817 833 842 838 829 823 822 819 813 809 813 821 828 833 840 848 849 840 825 816 817 831 858 887 903 896 873 855 860 887 919 936 934
2059 934 923 916 914 910 907 913 929 944 948 944 939 936 933 932 936 944 954 965 979 992 992 978 966 977 1014 1063 1106 1139 1169 1195 1216 1238 1271 1316 1364 1412 1471 1544 1617 1676 1727 1789
2054 1789 1863 1937 2000 2061 2129 2205 2287 2381 2493 2620 2752 2882 3014 3156 3309 3464 3610 3754 3918 4121 4355 4601 4855 5129 5421 5709
2051 5709 5975 6219 6455 6685 6902 7100 7273 7409 7492 7522 7512 7470 7396 7292 7174 7057 6940 6801 6627 6432 6247 6096 5973 5856 5734
2048 5734 5613 5494 5364 5219 5078 4961 4865 4769 4657 4529 4392 4250 4105 3952 3786 3609 3439 3297 3182 3072 2952 2826 2701 2579
2045 2579 2464 2364 2276 2186 2091 2006 1950 1919 1890 1848 1798 1756 1726 1701 1669 1626 1582 1549 1526 1498 1451 1391 1335 1295 1264 1227 1183 1144 1127 1133 1148 1159 1164 1166 1160
2041A160k3l8l9k8j9j4rjPJ1J7K0J5Jj3k4k3j7nLQJ2J9J7jk4l3k1mLlj3k1k3j9rKJ4K2K2J2
2036I41Jpj4k8l8l5k0okLROnj1oKlqqmrj3qPJ2Lj0j8j7nJ3K6K5J8J5J4Oj5l0k9j5lMNnj7j8
2030G03kJ2Qj1k5k3j4mRK9M9M9K6pk5k0jJ7K3J9J1MLJ0J9J8Prk0k2k0j3lNLrj8j6oJjkNJ5
2025G74Rrk5k3j1lKJ1K2J8nj5ML7M1J4j7k5k2k4k8k0LK5L6L7K9J2ljJ5K6J8jk0k7k0lOkk4
2020H11l0j5PJ6J5K0L3L8L2J8J0QJ4K2K5K4J9Rj0k7k4jJ7Rqj7j3j4j5oJ0K0Roj7j9j4%RLq
2015I54j0oj1k5k5mJ5J5RRJ2J2J7L0L2J1j8k4j1JLOJ7K3J9J2J1K0L2L8K5KrPL0K9Mj2j2qj5
2010A205j6KK2K4J0nj2mRK5K9J7JpmMRJj5k6k0poj5j3QK9L1K6K1J8QjkLQJ1J7J6OOK0L5K9
2004A497J1J0K7M2M0L0K3K0J1KprlJ7M2N3M2K4J6J3Lj8l1k0RL5L4J6PJ5K3J2qrJ1K8K5Rnr
$$ plain form
2041 1160 1137 1099 1060 1032 1013 999 990 989 996 1007 1024 1044 1059 1060 1047 1023 1000 983 978 981 989 1001 1020 1037 1036 1012 979 958 954 957 954 941 920 897 878 869 871 885 907 929 941
2036 941 942 935 921 893 855 820 800 794 792 795 804 810 805 794 788 790 787 779 771 767 758 745 737 744 756 759 749 731 714 709 722 748 773 791 806 820 826 811 781 752 737 734 738 743 738 721 703
2030 703 701 713 721 710 685 662 648 644 653 682 731 780 806 799 774 754 753 770 793 812 823 827 830 840 859 877 884 875 855 833 813 800 797 802 805 796 778 762 756 757 756 754 759 774
2025 774 783 774 749 726 715 712 714 725 747 765 760 745 749 786 827 841 824 799 777 753 725 705 708 733 769 806 835 847 844 843 858 884 902 901 881 854 834 831 837 835 811
2020 811 781 766 773 789 804 824 857 895 927 945 955 963 977 999 1024 1048 1067 1076 1066 1039 1015 1014 1031 1040 1032 1015 1002 988 973 967 977 997 1006 1000 983 964 950 950 959 962 954
2015 954 944 938 927 902 877 873 888 903 912 921 933 945 962 992 1024 1035 1017 993 982 983 986 992 1009 1032 1051 1063 1074 1094 1126 1164 1189 1191 1182 1189 1219 1248 1252 1240 1228 1220 1205
2010 1205 1189 1191 1213 1237 1247 1242 1230 1226 1235 1260 1289 1306 1307 1300 1296 1300 1309 1310 1295 1269 1249 1242 1236 1221 1208 1216 1245 1276 1302 1323 1341 1349 1348 1346 1349 1357 1368 1385 1401 1407 1413 1433 1468 1497
2004 1497 1508 1518 1545 1587 1627 1657 1680 1700 1711 1713 1706 1697 1694 1711 1753 1806 1848 1872 1888 1901 1904 1886 1855 1835 1844 1879 1913 1929 1936 1951 1974 1986 1978 1969 1980 2008 2033 2042 2037 2028
1999B028mJ6M8P3O7L5MJK2M4M7L6J9P%NK3M7O7O9N2K8J2J7L6N1M2K3K1M4P0P0N2L5K8K6L2
1995C293M9O3N4K9QOJ5K5M0N8P0P1O9P1P4P5Q4R7J03R2P7P1P3P3P7Q3Q9R1R7J18J44J58J53
1991E750J40J25J13J06J09J20J35J46J56J60J57J54J61J79J92J89J78J72J81K01K17K29K40
1988I510K58K80K95L00L08L30L64L92M13M32M61N00N40N72N93O13O42O78P13P44P82Q34Q93
1985B1447R57J031J120J206J274J324J374J439J518J619J732J841J922J982K054K162K294
1983D8296K430K567K712K875L054L256L495L779M098M443M806N192N612O082O612P211P875
1981A24395Q612R435J0362J1409J2577J3851J5204J6616J8053J9454K0723K1740K2396K2583
1979C47410K2191K1119J9300J6727J3472R660N460J063l317p468j1204j4395j6974j8916k0227
$$ plain form
1999 2028 2024 2040 2088 2161 2228 2263 2267 2268 2290 2334 2381 2417 2436 2443 2443 2448 2471 2518 2585 2654 2706 2734 2746 2763 2799 2850 2892 2915 2936 2980 3050 3120 3172 3207 3235 3261 3293
1995 3293 3342 3405 3459 3488 3496 3502 3517 3542 3582 3640 3710 3781 3850 3921 3995 4070 4154 4251 4354 4446 4523 4594 4667 4740 4817 4900 4989 5080 5177 5295 5439 5597 5750
1991 5750 5890 6015 6128 6234 6343 6463 6598 6744 6900 7060 7217 7371 7532 7711 7903 8092 8270 8442 8623 8824 9041 9270 9510
1988 9510 9768 10048 10343 10643 10951 11281 11645 12037 12450 12882 13343 13843 14383 14955 15548 16161 16803 17481 18194 18938 19720 20554 21447
1985 21447 22404 23435 24555 25761 27035 28359 29733 31172 32690 34309 36041 37882 39804 41786 43840 46002 48296
1983 48296 50726 53293 56005 58880 61934 65190 68685 72464 76562 81005 85811 91003 96615 102697 109309 116520 124395
1981 124395 133007 142442 152804 164213 176790 190641 205845 222461 240514 259968 280691 302431 324827 347410
1979 347410 369601 390720 410020 426747 440219 449879 455339 456402 453085 445617 434413 420018 403044 384128 363901
1977C63901k0946k1145k0905k0315j9448j8384j7194j5948j4698j3484j2320j1222j0202r286
1976A38404q479p769p135o566o054n592n168m786m452m155l877l613l369l145k936k740k568
1974E6000k427k306k186k068j957j860j771j691j620j549j473j397j333j283j235j186j144
1972B7514j114j083j040r91r49r13q70q19p69p23o82o42o13n85n49n03m62m36m14l83l55l49
1969A2270l57l58l44l25l09k95k76k62k51k34k09j92j95k06k10k00j83j60j37j22j33j54j60
1966F998j41j18j13j28j37j27j03r0r3j01j01r2q7r5j03r7q0o4n7n5n0m9n3o0o3o3p2q6r7
1963D423r8q6o9n4l9k3pjj3l9o1p0o2m9l6k6k3l1m5m8m1k9k9l5l6k5j4j7k8l0j4Jlk0k6j9
1958C178k2m6p0o8m7l8n5p4o8m0j2LRRnl2n1m8k8j1j3j9k3k4k9l7l9l3k5k0j9k0k8l6l3k0
$$ plain form
1977 363901 342955 321810 300905 280590 261142 242758 225564 209616 194918 181434 169114 157892 147690 138404
1976 138404 129925 122156 115021 108455 102401 96809 91641 86855 82403 78248 74371 70758 67389 64244 61308 58568 56000
1974 56000 53573 51267 49081 47013 45056 43196 41425 39734 38114 36565 35092 33695 32362 31079 29844 28658 27514
1972 27514 26400 25317 24277 23286 22337 21424 20554 19735 18966 18243 17561 16919 16306 15721 15172 14669 14207 13771 13357 12974 12619 12270
1969 12270 11913 11555 11211 10886 10577 10282 10006 9744 9493 9259 9050 8858 8663 8457 8247 8047 7864 7704 7567 7445 7312 7158 6998
1966 6998 6857 6739 6626 6498 6361 6234 6131 6041 5948 5847 5746 5654 5567 5472 5369 5272 5192 5128 5071 5016 4966 4917 4864 4804 4741 4678 4606 4520 4423
1963 4423 4325 4239 4170 4116 4077 4054 4047 4046 4033 3994 3933 3863 3801 3752 3716 3690 3667 3636 3591 3543 3502 3473 3444 3409 3373 3348 3334 3317 3289 3259 3245 3246 3243 3223 3197 3178
1958 3178 3156 3110 3040 2972 2925 2887 2832 2758 2690 2650 2638 2641 2650 2659 2654 2622 2571 2523 2495 2484 2471 2452 2429 2405 2376 2339 2300 2267 2242 2222 2203 2183 2155 2119 2086 2066
1954B066plnkOQJopoqj1j5j9k6k6k3j7j4pMOok2k8k3j7j9j8j5j3j4j6j4j4j9k8l3l3k8j9p
1949A503%jmmkmj4l1m1l6j5J0J9J3OOPJollj0k2k2j5j6k3k0pPJ1J4J5RkmPJ1%j6j8j3j0kJ4
1943A289K9K1lj8j9j4j1qlmoOL0M0K1j5l9m0k9j0PJ8J1ok2l2l2k5j3kPJ0Mj1k9l9l0j6j1k1
1938I85l4l5k5pRJ8K2K6L0K9K0J6J5Rmk0k7k9l0k5j0PJ3J3J7K9L2K4Qqj9k5k1j2oprm%J%k
1933I64qj4j5r%KkooKJ2J4Oj1k7l1k6j7nOJ0J1J2J9K9L6L3J9lk2l5l9l3k4j2m%PK1L0K2Lm
1928I05kmj5k4j8nnj0oJ6L4L3J0j5k3j5pj6l2l8k7qRK3K8J7pj7KK9L5J2j6l5m2m2l0j1QK0
1923G11K3K0J2%ppolJMJqoOJ6J2Lnj2k5k9j8KJ1OJPJ7J5LnnMJ0J1RQPNNQJ3J4PMMMpj6j2K
1917H15J2J3Omj5j8pRJ1mpJ3L6L3J2%PJ2MojJ0J2LKJ7L4L7K2Jrj0nnplJ1K4L3L6M5N3M9K8
$$ plain form
1954 2066 2059 2056 2051 2049 2055 2063 2064 2058 2051 2045 2037 2026 2011 1992 1966 1940 1917 1900 1886 1879 1883 1889 1883 1861 1833 1810 1793 1774 1756 1741 1728 1714 1698 1684 1670 1651 1623 1590 1557 1529 1510 1503
1949 1503 1503 1502 1498 1494 1492 1488 1474 1443 1402 1366 1351 1361 1380 1393 1399 1405 1412 1413 1407 1404 1401 1391 1369 1347 1332 1316 1293 1273 1266 1273 1284 1298 1313 1322 1320 1316 1323 1334 1334 1318 1300 1287 1277 1275 1289
1943 1289 1318 1339 1336 1318 1299 1285 1274 1266 1263 1259 1253 1259 1289 1329 1350 1335 1296 1256 1227 1217 1224 1242 1253 1247 1225 1193 1161 1136 1123 1121 1128 1138 1142 1131 1102 1063 1033 1017 1006 985
1938 985 951 916 891 884 893 911 933 959 989 1018 1038 1054 1069 1078 1074 1054 1027 998 968 943 933 940 953 966 983 1012 1044 1068 1076 1068 1049 1024 1003 991 985 978 969 965 965 966 966 964
1933 964 956 942 927 918 918 920 918 912 906 908 920 934 940 929 902 871 845 828 823 829 839 850 862 881 910 946 979 998 995 973 938 899 866 842 830 826 826 833 854 884 906 909 905
1928 905 903 899 884 860 842 837 832 822 816 832 866 899 909 894 871 856 849 833 801 763 736 728 737 760 788 805 798 781 783 812 847 859 843 808 766 724 694 683 691 711
1923 711 734 754 766 766 759 752 746 743 744 748 749 741 735 741 757 769 772 767 755 730 701 683 685 696 702 703 710 727 742 745 740 735 739 749 760 769 777 784 789 794 802 815 829 836 840 844 848 841 825 813 815
1917 815 827 840 846 842 827 809 802 811 822 818 811 824 860 893 905 905 912 924 928 922 921 931 943 946 948 965 999 1036 1058 1059 1050 1040 1035 1030 1023 1020 1031 1055 1088 1124 1169 1222 1271 1299
1911A299Nqj0%J5L1M2M6N0N7O6P2P4P3O6O2O6Q1R9J06R8P8N7M6N0O0N4L0qm4p0q4q1o9n8n8
1907B293n8n6n5o5p6p9p0o2n7m8l6l2m2n4o1o1n8m5k6pJ%lj3k9m2m0k7j4pj1k4l5l6k4j4p
1902I20LK0K9J9%q%Kj4l9n6n6m0j7OJ2Kj2j6j5j8k4k1lJ5K3J8QjolJJjLJ4K4K1J0Jkoj4j5
1897G65j1j0j7k3j2PJ8J2jj1k1k7k5j4lLLjoqjJ3K0J5Lqj0nJ3L0K9Qj6j9j2j1k1k6j8pJK%
1892E98%MJ3J6NnJJ5K0Pj3l1m0l8j5J3K7J7OOJ2J3Oqk6m6m6k1MJ0jmRJ8J6J2J9K7K4J3Joj4
1886F18k6l7l4j1K0L9L4J5oj6j8j0jLnj5j6j0mKOPLklJOJ0J4K0K4K7K5J5mk0k5j8rKJ2J1%
1881F24j1jJ6J6rl0k6j4j3j7j0LNoqPJ5Lj9l0j9JJ8L0K9K0Moro%Klrj0KK0K9K2R%lorj1j0
1876E80roKJ2J3Jj2j5j0njNJ1Qoj3%K7M1K8%k0j8oKjoj1j1nPK0K4J5mk1k7k4rQJ6Mj4k4j6
$$ plain form
1911 1299 1304 1296 1286 1286 1301 1332 1374 1420 1470 1527 1593 1665 1739 1812 1878 1940 2006 2087 2186 2292 2390 2468 2525 2571 2621 2681 2735 2765 2757 2713 2643 2559 2478 2409 2351 2293
1907 2293 2235 2179 2124 2059 1983 1904 1834 1772 1715 1667 1631 1599 1557 1503 1442 1381 1323 1278 1252 1245 1246 1246 1243 1230 1201 1159 1119 1092 1078 1071 1060 1036 1001 965 941 927 920
1902 920 923 943 972 991 991 983 983 985 971 932 876 820 780 763 769 781 783 771 755 740 722 698 677 674 689 712 730 738 737 731 728 729 730 729 732 746 770 791 801 802 800 794 780 765
1897 765 754 744 727 704 692 699 717 729 728 717 696 669 644 630 627 630 633 632 626 618 617 630 650 665 668 660 650 645 658 688 717 725 709 690 678 667 646 620 602 595 596 598 598
1892 598 598 602 615 631 636 631 632 647 667 674 661 630 590 552 537 550 577 594 600 606 618 631 637 629 603 557 511 490 494 504 503 499 508 526 542 554 573 600 624 637 638 632 618
1886 618 592 555 521 510 530 569 603 618 612 596 578 568 567 570 565 550 534 524 520 522 528 535 538 536 533 534 540 550 564 584 608 635 660 675 671 651 626 608 599 601 613 624 624
1881 624 613 612 628 644 635 605 579 565 552 535 525 528 533 527 519 526 541 544 525 495 476 477 495 525 554 574 578 572 563 557 557 559 556 547 537 539 559 588 610 619 619 616 610 601 590 580
1876 580 571 565 567 579 592 593 581 566 556 551 550 555 566 574 568 555 555 582 623 651 651 631 613 607 609 608 602 591 580 575 582 602 626 641 637 616 589 565 556 564 580 584 570 546 530
1870E30nOJ6K1J6mk5l3k0lJj0j9oK7N3N2K8Mj7l4m0k9j1lnMK3L3J9KMJ6J6LkJkj3j2MJ7J0
1865F13loJMJmj0j7k3k1j5rqpnnpnOJ9K1QooPJ3N%J0K5K3RLJ1J7J3Nmj7k8k8j4nj3k6k7j7
1859D78lRK1K8K5J5RPMMQRKj4k5l1l7l5j7J0K2J0j2k7l1l2k3LL2M2L0J3OOJnmQJ3PjjNNKJ
1853E37Krk9l7k2NK7L4L1J5lj2j0moj0jJ6K6L0M0M7L3nl5l6j8pnoopqnJJ%jlpmQJ8J0mmJ6
1848E93K9J6j1k7k5j9k0k4k0lJ7K1J3NJ0J5Jk3l0j3PMj6k3j0NJ2J5K3K7J6nj6rRK2K6K0Mj8
1843E98l1k9j6kJ2K0J5qk7k3%J9K2J6J3Nj1k4j8mlrpKNnj2oMPPQQ%qonrj5rMJ3J1Kpj7k2j4
1837D44KROQJ9K5J4%%J1J4Nm%PNnj0lMLrk0k1j3mjkoj1j0lJ0J9J5QQJ8K9K8J8Krj3pjJ%lp
1831E70j6k6k7j0J1J7Nj2j4j0j0j6j6jJ6K4K0J3J2K0K8K3Mj6j7JJ8J1j2k6k2j8k4l5l2j3P
$$ plain form
1870 530 525 531 547 568 584 580 555 522 502 499 500 490 471 465 492 545 597 625 629 612 578 538 509 498 495 490 494 517 550 569 571 575 591 607 610 608 609 607 594 582 586 603 613
1865 613 610 604 605 609 610 606 596 579 556 535 520 511 503 496 491 486 479 474 480 499 520 528 522 516 523 536 541 541 551 576 599 608 611 622 639 652 657 653 636 608 580 566 561 548 522 495 478
1859 478 475 484 505 533 558 573 582 589 593 597 605 614 616 602 577 546 509 474 457 467 489 499 487 460 429 397 374 377 409 451 481 494 500 506 507 502 498 506 519 526 525 524 529 534 536 537
1853 537 539 530 501 464 442 447 474 508 539 554 551 539 529 525 519 509 508 524 550 580 620 667 700 695 660 624 606 599 594 588 582 575 567 562 563 564 564 563 560 553 549 557 575 585 581 577 593
1848 593 622 638 627 600 575 556 536 512 492 489 506 527 540 545 555 570 571 548 518 505 512 516 500 477 467 472 484 499 522 549 565 560 544 535 544 566 592 612 616 598
1843 598 567 538 522 520 532 552 567 559 532 509 509 528 550 566 579 584 573 549 531 527 524 515 508 510 515 510 498 492 496 503 510 518 526 526 518 512 507 498 483 474 478 491 502 504 497 480 458 444
1837 444 446 455 461 469 488 513 527 527 527 538 552 557 553 553 560 565 560 550 547 551 554 545 525 504 491 487 486 484 478 467 457 454 464 483 498 506 514 532 561 589 607 609 600 587 580 579 580 580 577 570
1831 570 554 528 501 491 502 519 524 512 498 488 478 462 446 445 461 485 505 518 530 550 578 601 605 589 572 573 591 602 590 564 542 524 500 465 433 420 427
1826D27J5J3J4K3L3L6K6J1lj0j6k3k8k8k0qJ0K5K5J1nnOJ8J9J3J2J1Kj2j7rMOnj7j9j1mKP
1821E29J2J5Qrk2k6j5kLlpJJ5J8J0%ljlkOJ6J9J3Jj5k9l0j0J2J6ROJ6K3J7Nnj3k0j7pqj8j9
1816D86jK2K3OkNJ3Plmjkrj2mNRRJ0J8K5K4J5Lklnrj1j0qmMOlj7k5k1j8j8j2OK1J8MlPJ7J2
1810E68LjOJ5J9J3lk2l0k2pjjoj3j7j7j4qnomLQJ2J6J6Rnj6j2RK8L1J8OKNNKmpqonpj4k0j3
1804E00NJ8J4Jmjnk0k8j6QJ7Qpj6k1k3j2J5M3M8K9Mj0roj0j3pJ1K7K3kk6l1k3j7j5qOJ3Q%
1799D68lj1k5l3j8J3L5L4K3J7J3Lj2k0j4opk1l5l2j7%J3K3K9K7J7QPJ6K1J6%j1rMJ3Rmj4j5
1794E02q%RJ3OmoMJ4J2OKKjlNK0K8J5pk0j6jJ5K0Oj8l2k6rkqj6j4nRJ7K0J3NLRK6L8L4Rk1
1788F45l7l3k2j8j3KJ9K1R%MPkj9k8k5k1k0j6oJ0K9L7L1J8QJ1Rnk6k9j4PJ6J0mj9k7k3qMJ
$$ plain form
1826 427 442 455 469 492 525 561 587 598 595 585 569 546 518 490 470 462 472 497 522 533 528 523 529 547 566 579 591 602 604 592 575 566 570 576 571 554 535 524 520 522 529
1821 529 541 556 564 555 533 507 492 490 493 490 483 484 499 517 527 527 524 523 520 518 524 540 559 572 573 558 529 499 489 501 517 526 532 548 571 588 593 588 575 555 538 531 523 505 486
1816 486 485 507 530 536 534 539 552 559 556 552 551 549 540 528 524 529 538 547 557 575 600 624 639 642 640 637 632 623 612 602 594 590 594 600 597 580 555 534 516 498 486 492 513 531 535 532 539 556 568
1810 568 571 570 576 591 610 623 620 598 568 546 539 538 537 531 518 501 484 470 462 457 451 447 450 458 470 486 502 511 506 490 478 487 515 546 564 570 572 577 582 584 580 573 565 559 554 547 533 513 500
1804 500 505 523 537 538 534 533 528 508 480 464 472 489 497 490 474 453 430 418 433 476 524 553 557 547 538 532 522 509 502 513 540 563 561 535 504 481 464 449 441 447 460 468 468
1799 468 465 454 429 396 378 391 426 460 483 500 513 516 504 484 470 464 457 436 401 369 352 352 365 388 417 444 461 469 476 492 513 529 529 518 509 513 526 535 531 517 502
1794 502 494 494 503 516 522 518 512 516 530 542 548 550 552 551 548 553 573 601 616 609 589 573 572 587 607 613 595 563 537 528 526 518 502 488 483 492 509 529 542 547 550 559 585 623 657 666 645
1788 645 608 575 553 535 522 524 543 564 573 573 577 584 582 563 535 510 489 469 453 447 457 486 523 554 572 580 591 600 595 569 540 526 533 549 559 555 536 509 486 478 482 483
1783D83pmJ1K7K4Nj7j7%J8J2qj7lK1L1K2Nj2k4k4rPMprLJ4Pj2k0j4mMOKjQK5L2K0mk2k6k2
1777E08j0KNmj0qmrj3jJ9K5J4PJ3J4KpOJ9Qk7m4k3J0J9Jj4j2lmj1j2kQJ0RJ4K4K7K0Pnj2r
1772E47LJ3Orj4jK0K2Rnrj2k3l6l5k6j6j1oOK1K5K0J2J3J9K1Qqj4lJ4J9Qnommrj0%J3J9J5
1766E87Q%qj7k2j9j1kPJ2J2RNMMNQJ4J8J5Rkj4k1j7jJ5J6Nqj0lJ0K1J7%k5m1l9k9j6mKkj5
1761D77k2j5MK0K3J8J1PNJ0J6J5%k4l4j8NJ4NlJ%j3k4j4J3K7K2J4J7K8K9K1J1PQJ4J6Q%%Q
1756G07Oj7m8n7l8qRJ1PQOjj3j1QK9L3J8OQJ8J8J2QMlj3rKJj3k8k5j6j7k4k1mJ5K7L3L8L2
1750F98Pk8n0m3j6ORJlKJ4K5L0K6J3oj9k4j6mRJ4J1K%%qk9m0k9jJ5J1knNJ5J5PlokM%j2k6
1745E67k8k1j1kMJ7K9L4K6Qqj4j0m%KLMQJ7K7K4Kk0k7j4NJ4J5J0NjlPK0K5J6LjKLoj9k0j1
$$ plain form
1783 483 476 472 483 510 534 539 522 505 505 523 535 527 510 507 528 559 581 586 574 550 526 517 524 528 521 512 515 529 536 524 504 490 486 490 496 498 497 505 530 562 582 578 556 530 508
1777 508 498 500 505 501 491 483 479 470 457 456 475 500 514 521 534 548 550 543 549 568 576 549 505 482 492 511 512 498 486 483 479 468 456 454 462 472 481 495 519 546 566 573 568 556 547
1772 547 550 563 569 560 546 545 565 587 596 591 582 570 547 511 476 450 434 423 417 423 444 469 489 501 514 533 554 562 554 540 537 551 570 578 573 567 563 559 550 540 540 553 572 587
1766 587 595 595 587 570 548 529 518 516 523 535 547 556 561 565 569 574 582 596 614 629 638 636 622 601 584 583 598 614 619 611 601 598 608 629 646 646 621 580 541 512 496 492 494 492 477
1761 477 455 440 444 464 487 505 516 523 528 538 554 569 569 545 511 493 498 512 517 514 515 515 502 478 464 477 504 526 540 557 585 614 635 646 653 661 675 691 699 699 699 707
1756 707 713 696 648 591 553 545 554 565 572 580 586 585 572 561 569 598 631 649 655 663 681 699 711 719 723 720 707 698 700 701 688 660 635 619 602 578 557 553 568 595 628 666 698
1750 698 705 677 627 584 568 574 583 584 581 583 597 622 652 678 691 685 666 642 626 622 631 645 656 658 658 658 650 621 581 552 551 566 577 575 570 575 590 605 612 609 603 601 605 605 593 567
1745 567 539 518 507 505 509 526 555 589 615 623 615 601 591 587 587 589 592 596 604 621 648 672 674 654 627 613 618 632 647 657 662 661 658 665 685 710 726 729 728 730 733 727 708 688 677
1739F77knj7k1j0LQNOJ5K2J7Jj6k0nJ7K7J5j1l1l3j9JJ3J1JkNJ2P%jOJj2j8j3pj5k2j4QK3
1734F07J9QJKJpj7k7l0k9k4j1QK3K6J6Pkpj0lJ6L1K6%k4l4k9j4JJ2QklRK2J6rl5m0k6nPO%
1728D84mopmNK1L6M2L7K4J0JlkJNJ0RMMJ1J2jk2l2k5j0NJ9L3L2J2j1j8kJ8K4J4KjJ0K3L1K5
1723H16J5QNLJQK8M5M4K6RRK0K6K9L5M5M9M9N3O0N1K4rk5j6MK5M1M2K5kk0k2j8k0k2k1j8k2
1718A380k9l4l2k9l1l4k8j3MJ2PLQK3L6L3J5qj5LK5L1K4K9N9Q5Q3O2N7P5R5J01J04J14J23
1714B338J15R4Q1Q7J06J27J31J10P2L5Lk6n2o5p5r6j28j38j17q3o7o5o1n7p1r4j00q0n2l1
1710A841j8pmj2k7l6l6k8j9j6j8k3j5LK5L9M9N6O1O5P2P3O5N2M8O0Q3J09J30J37J27J10J03
1706C049J06J03Q3O0M0K0pl5o0q7j14j29j28j20j17j16j12j01r5r3r0q6p9p2o8o4o2n7m5l3
$$ plain form
1739 677 675 670 653 632 622 625 633 638 644 659 681 698 699 683 663 658 675 702 717 706 675 642 623 624 637 648 649 647 652 664 671 671 670 676 677 665 647 634 627 612 590 576 584 607
1734 607 626 634 635 637 638 631 614 587 557 528 504 493 501 524 550 566 573 571 564 554 551 567 598 624 624 600 566 537 523 524 536 544 542 539 548 570 586 577 542 502 476 471 478 484 484
1728 484 480 474 467 463 468 489 525 567 604 628 638 639 636 634 635 640 650 659 663 667 678 690 689 667 635 610 600 605 624 657 689 701 690 672 670 688 712 726 728 727 737 760 791 816
1723 816 831 839 844 847 848 856 884 929 973 999 1008 1017 1037 1063 1092 1127 1172 1221 1270 1323 1383 1434 1458 1449 1424 1408 1412 1437 1478 1520 1545 1543 1523 1501 1483 1463 1441 1420 1402 1380
1718 1380 1351 1317 1285 1256 1225 1191 1163 1150 1154 1166 1173 1176 1184 1207 1243 1276 1291 1283 1268 1271 1296 1327 1351 1380 1439 1524 1607 1669 1726 1801 1896 1997 2101 2215 2338
1714 2338 2453 2547 2628 2715 2821 2948 3079 3189 3261 3296 3299 3273 3221 3156 3081 2985 2857 2719 2602 2519 2452 2387 2326 2269 2198 2104 2004 1924 1872 1841
1710 1841 1823 1816 1812 1800 1773 1737 1701 1673 1654 1638 1620 1597 1582 1585 1610 1649 1698 1754 1815 1880 1952 2025 2090 2142 2190 2250 2333 2442 2572 2709 2836 2946 3049
1706 3049 3155 3258 3341 3401 3441 3461 3454 3419 3359 3272 3158 3029 2901 2781 2664 2548 2436 2335 2240 2147 2057 1971 1892 1820 1752 1688 1626 1569 1524 1491
1702A491k4j8j7k5l9m8l4qJ0J1LnpnMJ4K1K4K5K7K3J5J1J4J9K1J8J4QQJ9L2L3K1Onj7l6n2
1698A552n1l4k1j9k4k4k6m3o9q5p4m3j7j2k0k5j9oPJ5J0qk9l7l0k1j5j2qlKMJ0J2Poj5j3J
1693H11J3J2jj0j4j1%J5K9K5Nj4k0j6j8k4k4k1j9j9j2MJ7J6Lj1k0j5jJ0Mj5k8k1JJ4J0joJ
1688F49Mjj3j8j1MJ2J5J8J8J4PKLPPPJ0J8K6K7J8RQJ2Rqk4k8k8l7m7m2j2K5M8N0L4Pj2j4q
1683G65rj9j9jJ9K1R%%kj2k6l1k2lJ8K8K5J6J1RRRQKj2k3j6KJ4J5J2QMmo%Lkj0rnj0j7j3J
1677G37J2Lj3j4KK1K0Onrj5k5k7j4JNmqonrpOJ6J6J5J5J1lj5rJ3K4J6lj5j7j6j1kNMLRJ1K
1672G21j5k6k6k2j4kOJpmPNk1l9k6QK8K5J3Kj1k4k1KK7L4K2Ol%PJ1%j5k2j7j2j6j7mJ7K6K2
1666F26J2Jj2k4k4j7j1rok%jNJ4J7J1%pnKJ2J8Qqj4kJ4J6Okklrj3pNJ5K0K7L1K3Lj6j5nlj7
$$ plain form
1702 1491 1467 1449 1432 1407 1368 1320 1286 1278 1288 1299 1302 1297 1290 1285 1289 1303 1324 1348 1373 1400 1423 1438 1449 1463 1482 1503 1521 1535 1543 1551 1570 1602 1635 1656 1662 1657 1640 1604 1552
1698 1552 1501 1467 1446 1427 1403 1379 1353 1310 1241 1156 1082 1039 1022 1010 990 965 946 940 947 962 972 964 935 898 868 847 832 820 812 809 811 815 825 837 844 838 823 810 811
1693 811 824 836 835 825 811 800 800 815 844 869 874 860 840 824 806 782 758 737 718 699 687 691 708 724 727 716 696 681 680 690 694 679 651 630 631 645 655 654 648 649
1688 649 653 652 639 621 610 614 626 641 659 677 691 698 700 703 710 717 724 734 752 778 805 823 832 840 852 861 853 829 801 773 736 689 647 635 660 708 758 792 799 787 773 765
1683 765 756 737 718 717 736 757 766 766 766 764 752 726 695 673 670 688 716 741 757 768 777 786 795 803 805 793 770 754 756 770 785 797 805 809 805 799 799 802 800 790 781 776 766 749 736 737
1677 737 749 752 739 725 727 748 768 774 769 760 745 720 693 679 680 685 681 673 667 662 653 646 652 668 684 699 714 725 722 707 698 711 735 751 748 733 716 700 689 687 692 696 699 708 719 721
1672 721 706 680 654 632 618 616 622 623 616 612 619 624 603 564 538 546 574 599 612 614 603 579 558 560 587 621 643 649 646 646 653 664 664 649 627 610 598 582 565 561 578 604 626
1666 626 638 639 627 603 579 562 551 542 536 534 534 533 538 552 569 580 580 573 568 570 582 600 608 600 586 584 598 614 620 618 616 613 604 591 584 589 604 624 651 682 705 708 692 677 672 669 652
1661F52k8k2nRJ2J2J8K2J9Rlj4k2k0j1mpj9l1l4k3jJ9L4M2L8K1nk1j2RK4K3K0K6L2K7Rnpn
1656G78qk2l6l8k1kLqj6j1jLMJ0J7J5%j5j7j0jOJ0Plj2rPJ7J1rk2j2J1K7K4Rpj9k6j9lJ6K2
1650F50J5Mkkkoj0oPK0K6K4J1j1l4m4l3j5m%KLmj4rRK0J3NOQmj6rRJ3kj2mJ1Oj4k9k0jJ5K0
1645E90J6J1NMMOjj5k9l0j8jJ1J8K2K3K1J2nk4l4l4k6j5nQJ4J0KJ2L6M2K1npRJ3KpkRMj2k7
1639F28k9j8l%rj5kK3L0Rj8k9k8k3j6jJ6K7L0L1L4L1K1Ppj8k7l5l5k5oJ3K0Rrj9j0RJ7Ppp
1634E66OJ4QJLQjj5j6LK3K6J5JprkJ3K6L2K8J5nk1k6k1j0RL2M2K7ok6k2j1j0j5j5rm%LNLN
1629F63J0QjqmLKlljqj9k2j4jRJ4J2OKOJ3J7K2L0L5K6RKQPpj9j8rrj3rLJ0LqpjKmqnpk0l1
1622F63k2KJ2Mqj0j0k1k9j9KJ7J9J7Pqk0j7nKKPR%j3qJ8M3N4N4N2L7Pk0l0k6k3k3j6oKMRJ4
$$ plain form
1661 652 624 602 597 606 618 630 648 670 689 698 695 681 659 639 628 624 617 598 567 533 510 509 528 562 604 642 663 658 637 625 634 658 681 701 727 759 786 795 790 783 778
1656 778 770 748 712 674 653 651 654 646 630 619 618 621 625 635 652 667 667 652 635 625 624 630 640 647 644 632 623 630 647 658 649 627 615 626 653 677 686 679 660 634 615 612 628 650
1650 650 665 669 667 665 663 657 647 641 648 668 694 718 729 718 684 640 607 592 588 588 590 593 589 575 566 575 595 608 613 619 627 623 607 598 607 620 618 606 602 613 619 605 576 556 555 570 590
1645 590 606 617 622 626 630 636 635 620 591 561 543 542 553 571 593 616 637 649 644 620 586 552 526 511 506 514 528 538 540 552 588 630 651 646 639 648 661 663 656 654 663 667 655 628
1639 628 599 581 578 578 569 554 552 575 605 614 596 567 539 516 500 499 515 542 572 603 637 668 689 696 689 671 644 609 574 549 543 556 576 585 576 557 547 556 573 580 573 566
1634 566 572 586 594 595 598 606 605 590 574 577 600 626 641 642 635 626 624 637 663 695 723 738 733 712 686 665 655 664 696 738 765 759 733 711 700 690 675 660 651 647 647 650 655 658 663
1629 663 673 681 680 672 668 671 673 670 667 666 658 639 617 603 602 611 625 637 643 645 651 664 681 703 733 768 794 803 805 813 820 813 794 776 767 758 745 736 739 749 752 744 737 736 738 734 726 721 714 694 663
1622 663 641 643 655 659 651 641 631 610 581 562 564 581 600 617 624 616 596 579 574 576 578 585 594 594 581 573 591 634 688 742 794 831 838 818 788 762 739 716 700 694 696 700 709 723
1617G23J3J2J6K5L0K6Qj5l2l0j2KKj%%j0k3k3j5j2j6j1KRlj8j6%J5J6R%llmj1j9j9pJ3K6K3
1612F67Qmqj1k0k8k2lJ0Kj3j4mLKlk%LQJ0J0QJ0J1Kj2j6qknmJ0K1J9OJNOnj8k1j6j2j0qmJ
1606E50MQPJnlJ6L7M4L2J2kj0j5k0j4mMKmmKRJ5K0J8J0kj1j5j3%J6K6J5oj7j2lkrj2romKN
1600F53%j8k8k4rlonOJ3QooOJ6RjkMPNMJ0J1mj8j5LJ1%j7j6JJ4J5J3Prl2l8j4J9L4L0K0J5
1594F63J0PJ3K3K3Pj3k7l3k9j3QJ9J5Mjlmqrj1j1j1j0j1j8j7jK3L8L4J4qj8j1NJ5J5J7K9M0
1589G55L8K5J6J4J1Kn%PMrk1k2j7pQK2K0MpPL4M2L1J6J3J0ok4k9k4k1j6jJ7J5nk4k7j6kJ0
1584H38K0J7jk8m5m2k3MK3K5J2OJ0J2MJJ3K7K6J2KjmjJ8M4N2L6K0K4M6O1N8M6M3M7M8L8K7
1579A515L6O0O8L8j2m1l7k6k8l9m7n5o5o8n0k6j1j4k3l2l9m1l8k8j7nNOlrqJOPLpj8k1j1O
$$ plain form
1617 723 736 748 764 789 819 845 853 838 806 776 764 766 768 767 767 767 757 734 711 696 684 668 657 659 668 665 647 631 631 646 662 671 671 668 665 661 650 631 612 605 618 644 667
1612 667 675 671 663 652 632 604 582 579 589 591 578 564 560 563 565 562 560 560 563 571 581 591 599 609 620 622 610 594 586 584 579 575 585 606 625 631 632 637 643 638 620 599 583 571 561 553 549 550
1606 550 554 562 569 570 565 562 578 615 659 691 703 701 691 676 656 642 638 642 644 640 636 638 647 662 682 700 710 708 697 682 669 669 685 711 726 720 703 691 688 686 677 665 656 650 646 648 653
1600 653 653 635 607 583 574 571 565 560 566 579 587 581 575 581 597 606 605 603 607 614 619 623 633 644 640 622 607 610 621 621 604 588 589 603 618 631 638 629 597 559 545 564 598 628 648 663
1594 663 673 680 693 716 739 746 733 706 673 644 631 639 658 673 677 676 673 669 661 652 641 630 619 609 598 580 563 562 585 623 657 671 663 645 634 639 654 669 686 715 755
1589 755 793 818 834 848 859 861 856 856 863 867 858 837 815 798 791 799 821 841 845 838 845 879 921 952 968 981 991 985 961 932 908 887 871 870 887 902 897 873 846 830 828 838
1584 838 858 875 874 846 801 759 736 740 763 788 800 806 816 828 832 833 846 873 899 911 913 912 908 907 925 969 1021 1057 1077 1101 1147 1208 1266 1312 1355 1402 1450 1488 1515
1579 1515 1551 1611 1679 1717 1705 1664 1627 1601 1573 1534 1487 1432 1367 1299 1249 1223 1212 1198 1175 1143 1104 1063 1025 997 980 975 980 986 983 974 966 967 973 980 983 976 958 937 926 932
1575I32K0L1L8L6K5J7K3L5M1M2M3M7M8M7M7M6M4M6M9M6L0J5J2J2ol7n3m4l5m5o7p6o9n4m0
1570A246l3l2l8l9l3k5k1j1OJ9Pk5n3n8l9j6LJ3K0K1J2ok1j9lRJ3J8K8L1J9kj2j0nKJ1J4P
1566I98KJ3L3L4J1j2j1NJ3OmnLJ1J0nk3k8j4PJ9J4NmkMJ1J1QJ2K3L2L5L3L6M1M3M2M4N4O3
1561A568O2N4N6P7J15J44J50J44J48J74K08K42K75L18L60L85L83L49K84J89Q0k5j15j90k54
1557E181l00l23l18k96k70k50k38k28k13j92j69j48j27j09r1p5o3n8n7n2m2l4l2l3l5l8l9
1554A351l3k7l1m0l5qJ8J7ok5k4j7j6j6j4j0qmMKnj2j3j8k7l2j9QK7L0J5%oknk1l6k8lJ3M
1549I48j3k6k8k2j0LJ0J2K5M4M4K3MPK2K4J3Mj0l2m5k8KJ2%pNRok3j5NJ7J4J1J3Rkj1oLJ1
1544A010RLkqj2j6j5qpj4j9j1OJ6J3Llmnklpj0jJ5K1J3NLjj3j9qJ1J9J9J7J4Nqj1kPOLJLO
$$ plain form
1575 932 952 983 1021 1057 1082 1099 1122 1157 1198 1240 1283 1330 1378 1425 1472 1518 1562 1608 1657 1703 1733 1748 1760 1772 1766 1729 1676 1632 1597 1552 1485 1409 1340 1286 1246
1570 1246 1213 1181 1143 1104 1071 1046 1025 1014 1020 1039 1046 1021 968 910 871 855 858 871 891 912 924 918 897 878 875 884 897 915 943 974 993 991 979 969 964 966 977 991 998
1566 998 1000 1013 1046 1080 1091 1079 1068 1073 1086 1092 1088 1083 1086 1097 1107 1102 1079 1051 1037 1044 1063 1077 1082 1078 1076 1080 1091 1102 1110 1122 1145 1177 1212 1245 1281 1322 1365 1407 1451 1505 1568
1561 1568 1630 1684 1740 1817 1932 2076 2226 2370 2518 2692 2900 3142 3417 3735 4095 4480 4863 5212 5496 5685 5765 5740 5625 5435 5181
1557 5181 4881 4558 4240 3944 3674 3424 3186 2958 2745 2553 2384 2236 2109 2000 1909 1834 1771 1713 1656 1604 1562 1528 1496 1463 1428 1390 1351
1554 1351 1318 1291 1260 1220 1185 1177 1195 1212 1206 1181 1157 1140 1124 1108 1094 1084 1076 1072 1076 1078 1073 1061 1048 1030 1003 971 952 960 987 1017 1032 1032 1026 1024 1019 998 962 934 931 944 948
1549 948 935 909 881 859 849 852 862 874 899 943 987 1010 1014 1021 1043 1067 1080 1084 1074 1042 997 969 971 983 983 976 981 990 984 961 946 951 968 982 993 1006 1015 1013 1002 996 999 1010
1544 1010 1019 1022 1020 1012 1000 984 969 961 954 940 921 910 916 932 945 948 945 941 936 934 931 924 914 913 928 949 962 967 970 969 956 937 929 940 959 978 995 1009 1014 1006 995 993 1000 1006 1009 1010 1013 1019
1538A019J2K0K8L3L9M4M5L6J7nj5oRQpj8nJ6K1J0MJ0J1Jj0rNK2L3L5J9ok6l7m4m8l8mL3M7
1533A299L5K0J8K8L2K6J5J8L2M3L3Qj5k4k5k1j5nJ0K8M3M5L5K1J6K3K7K4J9K0J9J7J7K7L3
1529A926K6J3J0K0K7K1J0Llj0j4mJ9M2N0M2K7K1K6K5J5JmKJ5K6L3L8L9L6L3L2L1K7K5K9M2
1524B697N3O1O7P6P7O9O1O4P9Q5P2M9M0M4N6O3O7P5Q3R3R6R6R6J00J10J15J16J23J43J68J83
1521E377J86J87J96K07K11K14K24K41K67L00L37L62L68L71L93M36M81N18N61O23P02P79Q43
1518A4384Q95R44R90J019J030J012R63Q70P34N71M02K46J22L9lj1PM7J07J78K60L64N06O85
1515B6361Q85J092J312J542J775K009K258K529K815L095L350L549L660L655L503L168K627
1513F9185J902J064K13n80j266j816k213k460k586k616k572k473k330k150j950j746j543j332
$$ plain form
1538 1019 1031 1051 1079 1112 1151 1195 1240 1276 1293 1288 1273 1267 1276 1284 1277 1259 1254 1270 1291 1301 1305 1315 1326 1327 1317 1308 1313 1335 1368 1403 1422 1416 1390 1353 1309 1261 1223 1219 1252 1299
1533 1299 1334 1354 1372 1400 1432 1458 1473 1491 1523 1566 1599 1607 1592 1568 1543 1522 1507 1502 1512 1540 1583 1628 1663 1684 1700 1723 1750 1774 1793 1813 1832 1849 1866 1893 1926
1529 1926 1952 1965 1975 1995 2022 2043 2053 2056 2053 2043 2029 2025 2044 2086 2136 2178 2205 2226 2252 2277 2292 2293 2289 2291 2306 2332 2365 2403 2442 2478 2511 2543 2574 2601 2626 2655 2697
1524 2697 2750 2811 2878 2954 3031 3100 3161 3225 3304 3389 3461 3510 3550 3594 3650 3713 3780 3855 3938 4031 4127 4223 4319 4419 4529 4644 4760 4883 5026 5194 5377
1521 5377 5563 5750 5946 6153 6364 6578 6802 7043 7310 7610 7947 8309 8677 9048 9441 9877 10358 10876 11437 12060 12762 13541 14384
1518 14384 15279 16223 17213 18232 19262 20274 21237 22107 22841 23412 23814 24060 24182 24221 24218 24207 24214 24261 24368 24546 24806 25170 25676 26361
1515 26361 27246 28338 29650 31192 32967 34976 37234 39763 42578 45673 49023 52572 56232 59887 63390 66558 69185
1513 69185 71087 72151 72364 71784 70518 68702 66489 64029 61443 58827 56255 53782 51452 49302 47352 45606 44063 42731
1511D2731j111r00p11n33l46j60kJ21K29L44M76O20P77R48J128J309J494J684J894K136K415
1508E4543K732L086L492L955M473N040N664O361P132P954Q803R652J0453J1122J1548J1615
1506A67625J1194J0149Q392N964L076O6k731n082o907q225r083r538r662r539r237q801q258
1504A19403p639o969o271n575m911m300l736l214k734k316j964j661j379j106q44n98l58j06
1502F3722J54M07O51R14J209J518J822K135K502K944L442L978M552N186N892O672P509Q371
1500A23580R219J0020J0722J1218J1359J0993J0006Q321N953L073J1k878n339p269q667r572
1498A80750j0048j0187j0079r795r379q847q223p544o846o150n463m798m185l642l163k735
1496F9666k361k031j729j446j189r63p53n44l47j75j7J57L62N77P85R87J212J475J777K100
$$ plain form
1511 42731 41620 40720 40009 39476 39130 38970 38968 39089 39318 39662 40138 40758 41535 42483 43611 44920 46414 48098 49992 52128 54543
1508 54543 57275 60361 63853 67808 72281 77321 82985 89346 96478 104432 113235 122887 133340 144462 156010 167625
1506 167625 178819 188968 197360 203324 206400 206466 203735 198653 191746 183521 174438 164900 155238 145699 136462 127661 119403
1504 119403 111764 104795 98524 92949 88038 83738 80002 76788 74054 71738 69774 68113 66734 65628 64784 64186 63828 63722
1502 63722 63876 64283 64934 65848 67057 68575 70397 72532 75034 77978 81420 85398 89950 95136 101028 107700 115209 123580
1500 123580 132799 142819 153541 164759 176118 187111 197117 205438 211391 214464 214475 211597 206258 198989 190322 180750
1498 180750 170702 160515 150436 140641 131262 122415 114192 106648 99802 93652 88189 83391 79206 75564 72401 69666
1496 69666 67305 65274 63545 62099 60910 59947 59194 58650 58303 58128 58111 58268 58630 59207 59992 60979 62191 63666 65443 67543
1493F7543K444K814L213L620M012M380M732N053N320N514N618N597N398N000M423L712K931
1491A41324K187J599J232J081J122J354J761K298K938L697M590N606O736Q005R427J1016J2836
1489B18809J5011J7639K0767K4472K8870L4011L9806M6132N2848N9640O5902P0786P3103P0987
1487H38783O2189M5598K2942j387k2725l8612m9160n5569n8821n9543n8386n6049n3046m9639
1486D66575m5941m1976l7722l3255k8820k4718k1122j8076j5576j3584j1999j0714r666q826
1484A44580q127p495o903o369n897n470n079m730m412m117l848l617l414l219l025k845k677
1482F3336k515k360k225k117k037j986j960j932j891j846j819j798j764j713j649j572j475
1480C0677j371j278j197j124j055r87r13q32p60p12o78o37n95n68n49n23m89m63m52m41m24
$$ plain form
1493 67543 69987 72801 76014 79634 83646 88026 92758 97811 103131 108645 114263 119860 125258 130258 134681 138393 141324
1491 141324 143511 145110 146342 147423 148545 149899 151660 153958 156896 160593 165183 170789 177525 185530 194957 205973 218809
1489 218809 233820 251459 272226 296698 325568 359579 399385 445517 498365 558005 623907 694693 767796 838783
1487 838783 900972 946570 969512 968125 945400 906788 857628 802059 743238 683695 625309 569260 516214 466575
1486 466575 420634 378658 340936 307681 278861 254143 233021 214945 199369 185785 173786 163072 153406 144580
1484 144580 136453 128958 122055 115686 109789 104319 99240 94510 90098 85981 82133 78516 75102 71883 68858 66013 63336
1482 63336 60821 58461 56236 54119 52082 50096 48136 46204 44313 42467 40648 38850 37086 35373 33724 32152 30677
1480 30677 29306 28028 26831 25707 24652 23665 22752 21920 21160 20448 19770 19133 18538 17970 17421 16898 16409 15946 15494 15053 14629
1477A4629m05l84l61l41l32l26l05k78k64k66k70k61k49k41k32k15k01j91j84j74j65j55j42
1474H687j23j14j20j29j26j08q6p4p5q1q3p9p7p9p8p2o7p3p9p6o8p0p9q3q0q2r4j02j03j03
1471F024j03q9p0o4q2r0p4m9m8o2p0n7l9k5j6j1j5k4k5j2%kj7l5m4m4l6k7k2k9l8l9k9j9k1
1467D597l8n6o7p1p9r4j00q6o2l9l2l1k9k1j5k4m6o1n3k7pKNQjk3m3m6m4n6p1o3l4j4j9k8
1462C132k1jJ1J0Jorrj1j4j2LK4K8Nk8m0l0k3l7n9o9o1n0m4m3l4j4KKqj2rnorj4k5l6l3j2
1457B434PJ3J4J5J0j2l5l6k3k2m1m9l4j8k5m4l9j5Joj9j7qjllLJ2J7J2pk4k4nJ4J5Moj0qk
1452B035QJ6J5Kj3k6l5m1m3l9k8rKJnjJ0J3jj5j4kPJ2J5J3KrkJ1J1mqQK5K8K3J7Prj9j3lm
1447A938j6l0l5l2j5MOj5l7l4qJ3J8J1OJmkJ4L8N8O1M9K7J3J3J7J3Kj0k3l9n2m8l5l0l6m4
$$ plain form
1477 14629 14224 13840 13479 13138 12806 12480 12175 11897 11633 11367 11097 10836 10587 10346 10114 9899 9698 9507 9323 9149 8984 8829 8687
1474 8687 8564 8450 8330 8201 8075 7967 7881 7807 7732 7651 7568 7489 7412 7333 7255 7183 7116 7043 6964 6888 6820 6750 6671 6588 6508 6426 6332 6230 6127 6024
1471 6024 5921 5832 5762 5698 5616 5526 5452 5403 5355 5293 5223 5166 5127 5102 5086 5075 5060 5036 5011 4999 4999 4997 4980 4945 4901 4857 4821 4794 4772 4743 4705 4666 4637 4618 4597
1467 4597 4559 4503 4436 4365 4286 4192 4092 4006 3944 3905 3873 3842 3813 3792 3777 3753 3707 3646 3593 3566 3559 3561 3566 3574 3573 3550 3507 3461 3417 3361 3290 3227 3193 3179 3160 3132
1462 3132 3111 3110 3121 3131 3132 3126 3117 3108 3097 3083 3071 3074 3098 3126 3131 3103 3063 3033 3010 2973 2914 2845 2784 2734 2690 2647 2613 2599 2601 2603 2595 2583 2574 2569 2563 2554 2540 2515 2479 2446 2434
1457 2434 2441 2454 2468 2483 2493 2481 2446 2410 2387 2365 2324 2275 2241 2223 2198 2154 2115 2100 2101 2095 2076 2059 2051 2050 2047 2044 2047 2059 2076 2088 2081 2057 2033 2028 2042 2057 2061 2055 2045 2037 2035
1452 2035 2043 2059 2074 2076 2063 2037 2002 1961 1918 1879 1851 1842 1844 1845 1840 1839 1849 1862 1861 1846 1832 1830 1837 1849 1864 1877 1879 1870 1868 1879 1890 1886 1878 1886 1911 1939 1962 1979 1986 1977 1958 1945 1942 1938
1447 1938 1922 1892 1857 1825 1810 1814 1820 1805 1768 1734 1726 1739 1757 1768 1774 1775 1771 1769 1783 1821 1879 1940 1989 2016 2029 2042 2059 2072 2074 2064 2041 2002 1950 1902 1867 1837 1801 1757
1442A757m1l5k9k1j2j2j0LK5K5%k4k3j2rj0lJ1J5J2OLmj2j2pkMJ5K0J1jkNRQMlj4j6LK2J6
1437A660pk2k0k1k9k5lJ2Lj4j8j6k0k1rQMj5k5j3J6M1N0L5Kk2j9prk7l9l3j6LK9N6O7N4L6
1432A626K8K6K4J9J8K0K6L9N6O0N0L4K6K0J0LMjj7l2l0k3l5n9o6m8l0l1m7n8n9n4m2k2pmj0
1428A414j1qj2k5l4k4lJ6K7K6J7POJ6K6K6J6QRRLkLK6N1O1N2L7L1L1L1L1L4M4M6L9K4J3%j4
1423B047l1m2m5l9k6qlj3l1m2m8n5n7m5k9k8m4n2l5rJlmJ0K2K4J5MjMJ4J4Jj0LL6N8N5M0L7
1418A685M4M6M1L4K9L1K9L0L6O2J02J33J31J05R2J15J53J74J82K04K52K96L14L15L23L28L02
1414E588K31J25J0r8j88k49k77k83k77k71k68k65k56k40k14j83j61j53j53j44j24r8q3p8p3
1411A818o1m8m3m8n6n9n1l0mJ1Nj8m5n8n7m6l3k3j8j4mMMjmnrj8j8pJkrrlnj6k0j4rj1qMJ5
$$ plain form
1442 1757 1716 1681 1652 1631 1619 1607 1597 1600 1625 1650 1650 1626 1603 1591 1582 1572 1569 1580 1595 1607 1613 1616 1612 1600 1588 1581 1579 1583 1598 1618 1629 1628 1626 1631 1640 1648 1652 1649 1635 1619 1622 1644 1660
1437 1660 1653 1631 1611 1590 1561 1536 1533 1545 1548 1534 1516 1500 1480 1459 1450 1458 1462 1447 1422 1409 1425 1466 1516 1551 1553 1531 1512 1505 1496 1469 1430 1397 1381 1384 1413 1469 1536 1590 1626
1432 1626 1654 1680 1704 1723 1741 1761 1787 1826 1882 1942 1992 2026 2052 2072 2082 2085 2089 2088 2071 2039 2009 1986 1951 1892 1826 1778 1748 1717 1670 1612 1553 1499 1457 1435 1428 1424 1414
1428 1414 1403 1395 1383 1358 1324 1300 1297 1313 1340 1366 1383 1390 1396 1412 1438 1464 1480 1488 1497 1506 1509 1507 1510 1536 1587 1648 1700 1737 1768 1799 1830 1861 1895 1939 1985 2024 2048 2061 2061 2047
1423 2047 2016 1974 1929 1890 1864 1856 1853 1840 1809 1767 1719 1664 1607 1562 1533 1505 1461 1409 1374 1365 1366 1363 1359 1369 1391 1415 1430 1434 1433 1437 1451 1465 1466 1456 1459 1495 1553 1608 1648 1685
1418 1685 1729 1775 1816 1850 1879 1910 1939 1969 2005 2067 2169 2302 2433 2538 2630 2745 2898 3072 3254 3458 3710 4006 4320 4635 4958 5286 5588
1414 5588 5819 5944 5954 5856 5668 5419 5142 4859 4582 4311 4043 3778 3522 3282 3068 2885 2724 2571 2418 2274 2150 2052 1969 1891 1818
1411 1818 1757 1709 1666 1618 1562 1503 1452 1422 1418 1429 1434 1416 1371 1313 1256 1210 1177 1154 1136 1122 1118 1122 1126 1125 1121 1116 1107 1089 1071 1064 1065 1063 1054 1045 1042 1037 1021 1001 987 978 967 959 963 978
1406I78J0nj3j1rj2rMJ2Oj1j5pLNM%lmjLJj6l7m6l1kJ9J5kj0KK1K4Rqj0pppKJ4J3kj6j8j7
1400H09k3k6j3J2L0K7Rj0k2j9JK6L4J8knOJ4RJjknj1j3j2j0prk0l0k1RL7K9kj8kK0J8qk6k2
1395G70kJ3J4RLKMPRPPQJ1J4J5Ppk1k4j9k0k6k6rK0M1M4L5K3J0kj4k4l0l0k0rj%LPOpj8k1
1389G59j2%J0J9J9Lj8k4j0QJ3Kj1j8j6qNQlj6j3RL1L6K2OLJ1K8M1L8K3MomJKpk2l0k3nRPp
1384H64k0k1j0LJ2J4QJKJ1K0K1J3RROmj9k6k0pK%j0rJ0L4L3Pj9j6PK3J7J0ROj3l1k9rNKoj0
1378H79pmorrjQR%j3j7j6j4j6j2%J3J6Pj2k0pJ5K2Lj6qJ5K2Kj3JK2K1LnLRnj7j2PJ9K0J3O
1373H96krj3j7k1j9lJ2J2lj8k1j3qnQK4K4Oj4j4jONMPPNMNJj6l1l1k1j1lLORJ6L0L1J0j8l2
1367G87k3pMJ2K0J7kk1k1nJ3J7J4J0OjplPJ2J0OJ0J4J0jj0j2j7k4k3rNN%KNJqj5j8k4k4pJ8
$$ plain form
1406 978 988 983 970 959 950 938 929 933 945 951 940 925 918 921 926 930 930 927 923 922 925 926 910 873 827 796 794 813 828 826 816 818 839 863 872 864 854 847 840 833 835 849 862 860 844 826 809
1400 809 786 760 747 759 789 816 825 815 793 774 775 801 835 853 851 846 852 866 875 876 875 873 868 857 844 832 822 815 806 786 756 735 744 781 810 808 790 788 808 826 818 792 770
1395 770 768 781 795 804 807 809 813 820 829 836 843 851 862 876 891 898 891 870 846 827 807 781 755 746 766 807 851 886 909 919 917 903 879 849 819 799 790 789 789 792 799 805 798 780 759
1389 759 747 747 757 776 795 798 780 756 746 754 767 769 758 740 724 716 721 729 726 710 697 706 737 773 795 801 804 815 843 884 922 945 949 943 939 940 942 935 913 883 860 855 864 871 864
1384 864 844 823 813 816 828 842 850 851 853 864 884 905 918 927 936 942 938 919 893 873 866 868 868 858 849 859 893 926 933 914 898 905 928 945 955 964 970 957 926 897 888 893 895 889 879
1378 879 872 868 862 853 844 843 851 860 860 847 830 814 800 784 772 772 785 801 808 796 776 769 784 806 809 793 785 800 822 824 811 812 834 855 858 853 856 865 860 843 831 838 857 877 890 896
1373 896 894 885 872 855 834 815 812 824 836 833 815 794 781 773 768 776 800 824 830 816 802 801 807 812 816 823 830 835 839 844 845 829 798 767 746 735 732 735 741 750 766 796 827 837 819 787
1367 787 764 757 761 773 793 810 808 787 766 761 774 791 805 815 821 820 813 810 817 829 839 845 855 869 879 878 868 856 839 815 792 783 788 793 793 795 800 801 793 778 760 736 712 705 723
1362G23L0J9Jonl%%j0k4k8j3QK5K9K8J3j1k8k8k3k6k6oJ9K7J6J0J2Rqj5mR%j3pJ9M0L7K4J5
1357H29Mj5l6m2k9oRJ2Lj1k0j8rLNJnpnJPJ2J3J4J6J9J7J2OPJ4J9J6Kj0j2jJ3J7OnojKkj0
1351H29j6k2k4j7qlqj8k5k3j0RJ9J8RJlom%MJopnoqkJ7L6L9K0nj9k0j5j5j7j3%Qol0l7k2J
1345E91J2J5J7J9J7K1K9L1J5lmLjj4j8qNJ3K2K8J4j3l2k5pjopnmjMJ5K1K3K4J6lk3k9j9pJ
1340G26OJ0Pmj5k0j7pLQLJRK3K5J2ok0k4k1kK8M7L9J5pj8k8l6k8mJ7J7jj0jJ5K1J3%j2j6j4
1335G34j1roMK3L2K2KpkKlmPJ9J0rj9oJ3K1J3jj7k4j7jJ5J6Onj3j3kJ3K3K1J3J0PL%jjjKJ0
1329H69J2NmnOJ5J4Mpj8k6k8k7k3j6kRJ4QMK%j2k9m1l7j6J0K0Pj5k2j5j0j4j3OL4M3K0j0k1
1324F91mK1K4Lj5j4LJ1Nlmlpj3j4qMJ8K5J7Jonqk2k8j4QJ2LKJ2J5Lj0j0KQNoj4j2kPLmJJ8
$$ plain form
1362 723 753 772 773 767 762 759 759 759 749 725 697 684 692 717 746 774 787 776 748 720 697 671 645 639 658 685 701 711 723 732 724 709 705 714 714 701 694 713 753 790 814 829
1357 829 833 818 782 740 711 705 714 726 729 718 698 680 671 674 679 680 675 668 663 664 671 683 696 710 726 745 762 774 780 787 801 820 836 838 828 816 815 828 845 851 846 840 839 841 839 829
1351 829 813 791 767 750 742 739 731 713 688 665 655 664 683 701 710 711 708 702 698 698 702 703 697 690 685 679 671 669 686 722 761 781 776 757 737 722 707 690 677 677 685 679 649 612 590 591
1345 591 603 618 635 654 671 692 721 752 767 764 760 763 762 748 730 722 727 740 762 790 804 791 759 734 727 726 720 713 708 704 703 707 722 743 766 790 806 803 780 751 732 725 726
1340 726 732 742 749 745 730 710 693 686 689 697 700 701 710 733 758 770 764 744 720 699 697 725 772 811 826 819 801 773 737 709 705 722 739 738 728 727 742 763 776 776 764 748 734
1335 734 723 714 708 712 735 767 789 791 784 782 784 781 777 784 803 813 804 785 779 792 813 826 825 808 784 767 766 781 797 803 798 785 772 770 783 806 827 840 850 857 860 860 859 858 857 859 869
1329 869 881 886 882 877 883 898 912 916 909 891 865 837 810 787 771 769 778 792 800 804 806 806 794 765 724 687 671 681 701 708 693 671 656 646 632 619 625 659 702 722 712 691
1324 691 687 708 732 735 720 706 709 720 725 722 718 715 708 695 681 673 677 695 720 737 738 732 727 719 697 669 655 663 675 678 680 692 707 710 700 690 692 700 705 699 685 673 671 678 681 677 678 696
1318F96K6J5%mOJ4J4%j8l2k7qOMmoqj2rKJ6J8J1%qj4j0MK3L1K4J0loJOlk0k6rJ0Rpj3JK0J8
1312G38%j5j2MK0K0PKJ4K4J3j3k6j2QJ5J4J1Ppk3k7j4%Mnj3j1JJ2J3Ooj3j2p%JmjJ3K5K1K
1307G74j1j0MJ6K0Rj3k7j8JOnrKNj0k7k6j2m%J1K4K3Qlj%j2k1j6KJ8K4J9J1MNMlj1j1kNJo
1301G38rj0j7k2k3j7poqj4j4j0lPK3M4N0L2Jj5j2nnnMJ3J0lj2j4j4j0PK8M1L6K6J9Pj2l0l2
1296G57k2j1mjM%j0j9j3NK2K3J0pj3jJ4K2J7J0Nnk1k9j9kLlpLJ2OmnOJ7K0J7J4Qlj8l0l7k9
1291F82j2Kpk7l2j1J6K7K0J8K4K5J2oj7j7j6j4rkOPNjppjNRJ7L2L7J6j4l0j5J0K2K2J3kj8
1286G62k7k6j8j0JJ6K1Oj6k7k0pJ1L9O0N4K6K%Kj1k7k8j2MRRQLkmnqj0rj0j7j6mPjk2k9j5
1280F59MJ1J1RPNPJ4J7J4OKjJRJ6J4Jj3j9k2j7LL2M5K6pj8qNOOJ4J5Jk0k7j8j0j4k5k7k1j0
$$ plain form
1318 696 722 737 737 733 739 753 767 767 749 717 690 682 688 692 688 682 674 662 653 655 671 689 700 700 692 678 668 672 695 726 750 760 757 751 752 758 755 735 709 700 710 719 712 699 700 720 738
1312 738 738 723 711 715 735 755 762 764 778 802 815 802 776 764 772 787 801 812 819 812 789 762 748 748 752 747 734 723 724 736 749 755 749 736 724 717 717 718 714 713 726 751 772 774
1307 774 763 753 757 773 793 802 789 762 744 745 751 746 737 739 744 734 707 681 669 665 665 676 700 723 731 728 727 727 715 694 678 680 698 722 741 752 756 761 765 762 751 740 738 743 744 738
1301 738 729 719 702 680 657 640 633 627 619 605 591 581 578 585 608 652 702 734 735 720 708 703 698 693 697 710 720 717 705 691 677 667 674 702 743 779 805 824 831 819 789 757
1296 757 735 724 720 719 723 723 713 694 681 686 708 731 741 734 721 720 734 756 773 783 788 783 762 733 714 712 715 712 705 708 720 726 722 717 723 740 760 777 791 799 796 778 748 711 682
1291 682 670 672 665 638 606 595 611 638 658 676 700 725 737 731 714 697 681 667 658 656 662 669 674 673 666 659 658 663 672 689 721 758 774 760 730 715 725 747 769 782 780 762
1286 762 735 709 691 681 682 698 719 725 709 682 662 655 666 705 765 819 845 847 847 849 838 811 783 771 775 784 793 801 804 802 798 793 785 775 766 756 739 723 719 726 725 703 674 659
1280 659 663 674 685 694 701 706 713 727 744 758 764 766 765 766 775 791 805 806 793 774 752 735 738 770 815 841 834 816 808 813 819 825 839 854 855 835 808 790 780 766 741 714 693 683
1275F83NK2L9L6J5qj3lKlj0qjjrj3oJ1L1L9K8Prj3j4j7j1LJ4Nj1j8j0jLKKjLJ4K6K6J7RPj
1269H68k0l7l4j7pj1j5pQJ5PorKJ4J7J3J0%j7l6l7j3K0L6K3Jr%J4J6Pk%MKpqLJ9K1J2nj6k0
1264G99j4kQRmj5j5nMOLKlj3j7mK0L5L3J8Lj1k0j4LJ6J0KKMrk6j6J7M1L6J4%j2k4l0j4J0K0
1258H47J4Mnj4k1k1j3j1rkJ6K8K5J4OKpj7j9qPJ0LlJRNj2k4j9pLMM%j1j8rPJ2MJJ0J5NoLK2
1252H25K7Qj1j5nNJ6K7K8J2j1k1j5n%%mj1j9j6LK5L5L4L1K7J7Lpj2j5j8j3ork4l8l6k1nMN
1247G95J0J9K9L3K4Mj3j5kJ3J2rl1l2qK3L1J3rj8j6j0mLOMjmrj5j7j2plPJ8K2QqqJ0K6K3M
1242H86j6k6k3j5j2qPK9M0L0J3NKqj9j8olrqQK2K2J3PKrk0k3j7kJ4K6K5J2jmjmj1j6rQK0J8
1236I21jk0k1kJ8K2J1lnKJ2J5J2O%mj4k0j4JJ0J1J2J1Npj2pnj1j3pJJRL2N1L6ml5m0l5l4k6
$$ plain form
1275 683 688 710 749 785 800 792 779 776 778 775 765 757 756 755 746 733 727 738 769 808 836 843 834 821 807 790 779 782 796 801 790 772 762 761 764 766 768 767 770 784 810 836 853 862 869 868
1269 868 848 811 777 760 753 742 727 720 728 743 750 744 735 737 751 768 781 791 791 774 738 701 688 708 744 767 768 759 759 773 789 796 794 794 798 800 793 785 788 807 828 840 835 819 799
1264 799 785 783 791 800 796 781 766 761 765 771 774 776 773 760 743 739 759 794 827 845 848 837 817 803 806 822 832 834 836 840 831 805 789 806 847 883 897 897 885 861 831 817 827 847
1258 847 861 865 860 846 825 804 791 780 771 769 785 813 838 852 858 860 853 836 817 809 816 826 829 826 827 836 841 829 805 786 779 782 786 790 790 779 761 752 759 771 775 776 786 801 806 800 803 825
1252 825 852 860 849 834 829 834 850 877 905 917 906 885 870 865 865 865 861 850 831 815 818 843 878 912 943 970 987 990 983 971 956 938 925 919 910 886 848 812 791 786 790 795
1247 795 805 824 853 886 910 914 901 886 884 897 909 900 869 837 829 852 883 896 887 869 853 843 839 842 848 852 851 847 838 823 806 794 787 784 791 809 831 839 831 823 833 859 882 886
1242 886 870 844 821 806 794 786 793 822 862 892 905 910 912 904 885 867 861 858 849 841 849 871 893 906 913 915 906 886 863 846 844 858 884 909 921 920 916 915 911 900 884 875 883 903 921
1236 921 920 900 879 877 895 917 928 925 920 922 934 949 961 967 967 963 949 929 915 916 926 937 949 960 965 958 946 939 934 923 910 903 904 905 914 946 997 1033 1029 994 954 919 885 859
1231H59qJ4K3K1J7J6J1Jrj5j4rmkmpqpKJ6K6K1Jj7j8oRK0K0QmlJ1K2J7LnlJNOKj0k5k8j5j
1225I30MLLjj2k5k2LL2M2L0J2LLRJ8K8L1J8mk5l9m4l5j2J2K2J1oj7k1j8mJ8L1K6J2MKKJJ0
1220A035K7L5K1nk6l4k8j0QJ1qk8k7jK7L6L0J7MnkJ2K4K1J0QJ2Mk4m4l7qJ8K9K0jk5l8l4j9
1215A005lJ3L2M3L4J2jK%j1j8j2nj0k0j6kQOOJ2J9J9J7Rmj7j9j0MJ2K0K6K4J2lj0pjNRPok4
1210A157l6l3k3qPK4L7M5M1K4kj8j4LJ3Nj0j0QK0Rk2m4m0j1J3K0J8K0K8L4K7J1lj2j2okoj8
1205A234k9k6rJ2K6L0K9K4J5NMOJ0J1J1PJlorj5j8j5mLLKJ3K8L0J9Mnj1j3j4qkMRJ0MoqjR
1199A361J5J8J8J3KlKQMlJQMrj2jQLmjQOqj9k2k1j5j1j2k0j6OL4M5L9L8M1K8mk7j8PK5L2L5
1194A583K7Lk1k3nJ4K1K6L1K4OrqnojJ7L3L3J4qk0k2j5j0qmQK6L2J6nj5j3qom%KMQJ6K0J5
$$ plain form
1231 859 851 865 888 909 926 942 953 954 945 930 916 907 903 901 897 890 882 875 877 893 919 940 941 924 906 900 909 929 949 957 953 950 961 983 1000 1003 998 995 996 1001 1007 1009 999 974 946 931 930
1225 930 934 937 940 939 927 902 880 883 915 957 987 999 1002 1005 1014 1032 1060 1091 1109 1105 1080 1041 997 962 950 962 984 995 989 972 951 933 929 947 978 1004 1016 1020 1022 1024 1025 1035
1220 1035 1062 1097 1118 1113 1087 1053 1025 1015 1023 1034 1026 998 971 970 997 1033 1063 1080 1084 1079 1077 1089 1113 1134 1144 1152 1164 1168 1144 1100 1063 1055 1073 1102 1122 1121 1096 1058 1024 1005
1215 1005 1002 1015 1047 1090 1124 1136 1135 1137 1137 1126 1108 1096 1091 1081 1061 1045 1043 1051 1057 1063 1075 1094 1113 1130 1139 1135 1118 1099 1089 1093 1105 1125 1151 1175 1187 1184 1174 1167 1166 1171 1180 1187 1181 1157
1210 1157 1121 1088 1065 1057 1064 1088 1125 1170 1211 1235 1233 1215 1201 1204 1217 1222 1212 1202 1210 1230 1239 1217 1173 1133 1122 1135 1155 1173 1193 1221 1255 1282 1293 1290 1278 1266 1260 1258 1252 1234
1205 1234 1205 1179 1170 1182 1208 1238 1267 1291 1306 1311 1315 1321 1331 1342 1353 1360 1361 1358 1352 1343 1328 1310 1295 1291 1294 1297 1299 1312 1340 1370 1389 1393 1388 1377 1364 1350 1342 1340 1344 1353 1363 1367 1361 1353 1352 1361
1199 1361 1376 1394 1412 1425 1427 1424 1426 1434 1438 1435 1436 1444 1448 1439 1427 1426 1434 1437 1433 1432 1440 1446 1438 1419 1397 1376 1361 1350 1338 1318 1302 1308 1342 1387 1426 1464 1505 1533 1529 1502 1484 1491 1516 1548 1583
1194 1583 1610 1613 1592 1569 1564 1578 1599 1625 1656 1680 1686 1677 1669 1664 1658 1657 1674 1707 1740 1754 1746 1726 1704 1689 1679 1671 1667 1675 1701 1733 1749 1744 1729 1716 1708 1702 1698 1698 1700 1704 1712 1728 1748 1763
1188A763Kqj1kJ1J8J9K0K7K5J0nn%rk6l2k0nJQK6M8N2M0K1QKmqqMK6L8K6N%J9L1J4j7l4k8
1183B042j9j8j5%J6J8RKQJ6J4NjMJ5J7PjJQQNNJ1J3O%MJ0RKLJ0J8K0J6J7J8J8J6J5J0%j1j3
1178B338nMJ0J3K2L0L3K8K1Rmj4j1JPKlKJ0J0%j1j6j0NK3L1K3QLJ4L5M7L9J7JMJ7K0PmjJ3
1172B768K2K6K3J1nj7j4jRJ7K3K4J1qj3jJ0J3K0L6N3N4M1K4Mj7k8j3K2M3L5J3JJ1K7L0J7o
1168C265k2k7j6LJ8K5K5K0J2MNJ8L1K8J1JPK2L1K8J2j0j7OM4O3M3J2MJ5J7NjQK4L3L6M1M3
1163C867M5M4L8K0%kJ2K1Qj2k0j2OL0N0N4L9K9L3L6K2NPK5L3K7K2K8L4L4L0K6K1J8J7J2%j2
1158D635j2kRJ4K8N1P0P2O2M8L4J6kj0jJ8L9M7M1L1L5M5M0J9%KJ4K1K1K2K1J0MJ9M3M8L0P
1154E589KOQJ1K8N3O8O7N7M5L9M0M4M8L7K1J1RRPJ2K7M1M2L3L2M0M6L9K6J9K0K7M1N3N6M6
$$ plain form
1188 1763 1765 1757 1746 1744 1755 1773 1792 1812 1839 1864 1874 1869 1864 1864 1855 1829 1797 1777 1772 1773 1781 1807 1855 1907 1947 1968 1976 1978 1974 1966 1958 1962 1988 2026 2052 2057 2057 2076 2107 2121 2104 2070 2042
1183 2042 2023 2005 1990 1990 2006 2024 2033 2035 2043 2059 2073 2078 2077 2081 2096 2113 2120 2119 2120 2128 2136 2141 2146 2157 2170 2176 2176 2180 2190 2199 2201 2204 2214 2232 2252 2268 2285 2303 2321 2337 2352 2362 2362 2351 2338
1178 2338 2333 2337 2347 2360 2382 2412 2445 2473 2494 2503 2499 2485 2474 2475 2482 2484 2481 2483 2493 2503 2503 2492 2476 2466 2471 2494 2525 2548 2556 2559 2573 2608 2655 2694 2711 2712 2716 2733 2753 2760 2756 2755 2768
1172 2768 2790 2816 2839 2850 2845 2828 2814 2813 2822 2839 2862 2886 2897 2889 2876 2875 2885 2898 2918 2954 3007 3061 3102 3126 3130 3113 3085 3072 3094 3137 3172 3185 3186 3197 3224 3254 3271 3265
1168 3265 3243 3216 3200 3203 3221 3246 3271 3291 3303 3307 3312 3330 3361 3389 3400 3401 3408 3430 3461 3489 3501 3491 3474 3480 3524 3587 3630 3642 3646 3661 3678 3683 3682 3690 3714 3747 3783 3824 3867
1163 3867 3912 3956 3994 4014 4014 4012 4024 4045 4053 4041 4021 4009 4015 4045 4095 4149 4188 4217 4250 4286 4308 4313 4320 4345 4378 4405 4427 4455 4489 4523 4553 4579 4600 4618 4635 4647 4647 4635
1158 4635 4623 4621 4630 4644 4672 4723 4793 4865 4927 4975 5009 5025 5023 5013 5012 5030 5069 5116 5157 5188 5223 5268 5308 5327 5327 5329 5343 5364 5385 5407 5428 5438 5442 5461 5504 5552 5582 5589
1154 5589 5591 5597 5605 5616 5644 5697 5765 5832 5889 5934 5973 6013 6057 6105 6142 6163 6174 6183 6192 6199 6211 6238 6279 6321 6354 6386 6426 6472 6511 6537 6556 6576 6603 6644 6697 6753 6799
1149F799L5L2L8L9L0K1K5L0K8K1J2QOOJ8M1O0O3M3K0J2K3M3N3M9L5K5K5L3M6N3M6K9K3L8N8
1145G966O5N4L8K5Pj6k9j6OJ5PLJ3K5K1J4K2L9L7J1j4j8pOJ4K2L3L9L6K5J6J2J2Qmj3nJ5K8
1140H512K3J0Jpj7j7LK5J9j7m1l0JK2K3J9J2LlNJ7J4rl2m4m1l5k7k3l0m4n2m6l0j3MJ2Mj4
1135H157k2j6j3l1n3n3l5k0k1k8k7k7l9n6o1m9l6l2l1k6j7j4k6m4n3m7l1k1k2l0l6m0m7n5
1131F998n5m2k9k4l1l9l8l3l2l3l1k6k8m0m8m3l2l0l7m3m5n0n3m5k7k5m3o4o5m5k9l3m3m5
1127E672m1m1m7n5n2m0k5j5j6k2l0l9m9o0o8o2m2j6klj8k8k6k4k6l1l1k4j6j2pkoj8l3m1m6
1122D558n3o2o3m6k3j7l2m9m5k5j6k7m3m2l7m1m3k9nRjj5k3k6l0k4qMnk1k8k8k3j6j1j4l1
1118C569m5m0k6k1k5k5j9j7j8j2%LkjOLj4l1l5l5n0p3p4n1k5j5j4qLJ1Ojnnnprrj4k1k9l4
$$ plain form
1149 6799 6834 6866 6904 6943 6973 6994 7019 7049 7077 7098 7110 7118 7124 7130 7148 7189 7249 7312 7355 7375 7387 7410 7453 7506 7555 7590 7615 7640 7673 7719 7772 7818 7847 7870 7908 7966
1145 7966 8031 8085 8123 8148 8155 8139 8110 8094 8100 8115 8122 8125 8138 8163 8184 8198 8220 8259 8296 8307 8293 8275 8268 8274 8288 8310 8343 8382 8418 8443 8459 8471 8483 8491 8487 8474 8469 8484 8512
1140 8512 8535 8545 8546 8539 8522 8505 8508 8533 8552 8535 8494 8464 8465 8487 8510 8529 8541 8544 8541 8546 8563 8577 8568 8536 8492 8451 8416 8389 8366 8336 8292 8240 8194 8164 8151 8155 8167 8171 8157
1135 8157 8135 8119 8106 8075 8022 7969 7934 7914 7893 7865 7838 7811 7772 7716 7655 7606 7570 7538 7507 7481 7464 7450 7424 7380 7327 7280 7249 7228 7206 7176 7140 7100 7053 6998
1131 6998 6943 6901 6872 6848 6817 6778 6740 6707 6675 6642 6611 6585 6557 6517 6469 6426 6394 6364 6327 6284 6239 6189 6136 6091 6064 6039 5996 5932 5867 5822 5793 5760 5717 5672
1127 5672 5631 5590 5543 5488 5436 5396 5371 5356 5340 5318 5288 5249 5200 5140 5072 5010 4968 4952 4950 4947 4929 4901 4875 4851 4825 4794 4763 4739 4723 4711 4704 4702 4696 4678 4645 4604 4558
1122 4558 4505 4443 4380 4334 4311 4294 4262 4213 4168 4143 4127 4100 4057 4015 3978 3937 3894 3865 3860 3869 3868 3853 3830 3804 3774 3750 3742 3746 3741 3720 3692 3664 3641 3625 3614 3600 3569
1118 3569 3524 3484 3458 3437 3412 3387 3368 3351 3333 3321 3321 3324 3322 3321 3327 3330 3316 3285 3250 3215 3165 3092 3018 2967 2942 2927 2913 2905 2908 2919 2925 2924 2919 2914 2909 2902 2893 2884 2870 2849 2820 2786
1113B786l4k5j0PJ0%j2j4rj2k0k7k8k8k9k6j3%J1J6J1lk4l7l0j4lpj9k3j2LPlj4j3m%mj2k2
1108B320l5m2l3j3nj2j9j0J0K5K9K3Qj5l0k7j5qlOJ5J0kpkkj7l0k1JJ2Jj9k8k5k5k7k3j0N
1103A960RKjlprjJ3Qj7m2m7l5k0j0kOJ0J1J4J2jk0l2l4k5qJ7L3K6Nj2j4j2j3j5j1qoomoqp
1098A690KJ0J0OLKjnj1j7j9j3kJmlL%k0l4k6KK7M0L6J5j5l6k6J0M4N3L5Oj1j0kmj4j6nOjj9
1092A687l1k9k4k0j7j1kPJ2J2PKnk1m4o0n3k7%RMl%J8L8M1K3kj0nJ%qj6k2j9mQQJkkj3l2m3
1087A353l7j9jJ6K5K5J5J0QJj2k2k3k3k6k8k5j8j0lOJ4J8J9J1lj4j2LJ5J6J2J0J1QOKmj3j3
1082A298JJ1Pnj0jQJ2J2Rok6l9m0k7pJ0J4%j7j8jJ5J8J0Joj2j4j3j5j7j3JJ4J0JjQJ5J3Jj3
1076A188k4j9%K1K3Prj3j0j3j9j7nJ0J4J3RJ0J0Moj4j6j3qppmMJ2J5R%onJPMqj7j3LJ7J7Q
$$ plain form
1113 2786 2752 2727 2717 2724 2734 2734 2722 2708 2699 2687 2667 2640 2612 2584 2555 2529 2516 2516 2527 2543 2554 2551 2527 2490 2460 2446 2443 2436 2417 2394 2382 2385 2392 2389 2375 2362 2358 2358 2354 2342 2320
1108 2320 2285 2243 2210 2197 2192 2180 2161 2151 2161 2186 2215 2238 2246 2231 2201 2174 2159 2151 2148 2154 2169 2179 2177 2170 2168 2166 2149 2119 2098 2099 2111 2112 2093 2065 2040 2015 1988 1965 1955 1960
1103 1960 1969 1971 1970 1967 1960 1951 1950 1963 1971 1954 1912 1865 1830 1810 1800 1798 1804 1814 1825 1839 1851 1850 1830 1798 1764 1739 1731 1748 1781 1807 1812 1800 1786 1774 1761 1746 1735 1727 1721 1715 1711 1705 1697 1690
1098 1690 1692 1702 1712 1718 1721 1723 1722 1717 1706 1689 1670 1657 1655 1656 1652 1649 1652 1652 1632 1598 1572 1574 1601 1641 1677 1692 1677 1641 1615 1625 1669 1722 1757 1763 1752 1742 1740 1736 1722 1706 1701 1707 1706 1687
1092 1687 1656 1627 1603 1583 1566 1555 1553 1560 1572 1584 1591 1593 1588 1567 1523 1463 1410 1383 1383 1392 1396 1393 1393 1411 1449 1490 1513 1511 1501 1496 1497 1497 1489 1473 1451 1432 1428 1436 1444 1445 1443 1441 1428 1396 1353
1087 1353 1316 1297 1296 1312 1337 1362 1377 1387 1395 1396 1384 1362 1339 1316 1290 1262 1237 1219 1209 1206 1212 1226 1244 1263 1274 1271 1257 1245 1248 1263 1279 1291 1301 1312 1320 1326 1328 1324 1311 1298
1082 1298 1299 1310 1317 1312 1302 1301 1309 1321 1333 1342 1336 1310 1271 1231 1204 1197 1207 1221 1221 1204 1186 1185 1200 1218 1228 1229 1223 1211 1197 1184 1169 1152 1139 1140 1154 1164 1165 1164 1172 1187 1200 1201 1188
1076 1188 1164 1145 1145 1166 1189 1196 1187 1174 1164 1151 1132 1115 1110 1120 1134 1147 1156 1166 1176 1180 1174 1160 1144 1131 1123 1116 1109 1105 1109 1121 1136 1145 1145 1139 1134 1135 1142 1146 1138 1121 1108 1111 1128 1145 1153
1071A153%%MKj2k8k6nJ6J2j0k4j6OJ9J5Q%oj3j2rmJMJqj8j5m%j2l0l0nL2N6N0J6k1l3j7J0
1066A047K4J9OmkMPPjqr%J2J1rl7n0m0j7%RJ2J4J0Ljk%JNO%j4k3j6mLjoLK4L7K6jk1k8l0l6
1060I30l7j7J1K5K1J8L0L6K4LmMJ1Kj6l1l6k3%K0K4J7QNNPJ2J6Oj2k2j8j3j2nRJ2j2m6n8l5
1055H59nJ1J7K6L6L2J7ONJ0J2J4J7J6Mj4k2j5kRJ2J3Rkk2l6k9j0JnqMK1J8ok6k8j8j0lOJ7
1050I31J7Mj0j6j2jJ2J4J1J0J7K3J9Lj2k2k7k3j1jkqlJ5L0K5Pj1j7rLJ0Kj1j3%J4J6Pqk0k1
1045I32j2LJ3Q%jRJ8J6Q%KOJj0j5nJ2K1K0K0K2J3qk7l2k8k7k5j0J5K8J7mj7j0LJ3J1Jpqoj
1039I59OJ3Roj3KL3N0M0J3oj6j4plrk0j8jJ5J4LJJ0J3PKOJ2Qjoj4k5l6l3j9njKJ4K6K1nl2
1034I89m0l2j7mOJ6K6L5M1M0K4nk7k5nJ2Nj3k6k3j2%J1J8K2K0J2Njoljnj5k2j6jLoj7j2MJ8
$$ plain form
1071 1153 1153 1153 1157 1159 1147 1119 1093 1088 1104 1116 1106 1082 1066 1072 1091 1106 1114 1114 1108 1095 1083 1074 1070 1071 1075 1076 1068 1050 1035 1031 1031 1019 989 959 954 986 1042 1092 1108 1087 1054 1037 1047
1066 1047 1071 1090 1096 1092 1090 1094 1101 1108 1107 1099 1090 1090 1102 1113 1104 1067 1017 977 960 960 969 981 995 1005 1008 1007 1005 1005 1006 1011 1017 1017 1003 980 964 960 963 962 956 959 983 1020 1046 1045 1024 996 966 930
1060 930 893 876 887 912 933 951 981 1017 1041 1044 1040 1044 1055 1057 1041 1010 974 951 951 971 995 1012 1020 1025 1030 1037 1049 1065 1071 1059 1037 1019 1006 994 989 998 1010 998 952 894 859
1055 859 854 865 882 908 944 976 993 999 1004 1014 1026 1040 1057 1073 1077 1063 1041 1026 1024 1033 1045 1058 1067 1065 1043 1007 978 968 969 964 956 960 981 999 993 967 939 921 911 908 914 931
1050 931 948 952 942 926 914 913 925 939 950 960 977 1000 1019 1022 1010 988 961 938 927 926 924 916 913 928 958 983 990 979 962 953 956 966 968 957 944 944 958 974 981 973 953 932
1045 932 920 923 936 944 944 943 952 970 986 994 994 996 1002 1003 993 978 973 985 1006 1026 1046 1068 1081 1073 1046 1014 986 959 934 924 939 967 984 980 963 953 956 969 980 981 974 966 960 959
1039 959 965 978 987 981 968 970 1003 1053 1093 1106 1100 1084 1070 1063 1060 1051 1031 1013 1012 1027 1041 1044 1045 1055 1068 1075 1077 1083 1095 1103 1102 1096 1082 1057 1021 988 969 964 963 965 979 1005 1026 1021 989
1034 989 949 917 900 896 902 918 944 979 1020 1060 1084 1079 1052 1027 1022 1034 1039 1026 1000 977 965 965 976 994 1016 1036 1048 1053 1052 1046 1043 1042 1037 1022 1000 984 983 986 980 963 951 955 973
1028I73J9J1JnqLJ5J9Oj3j5jJ6K1J5Pkj2k2k4k1j4nNJ0O%LJ4J9J1qj7rPJ7J5Lqj0qooprj4
1023I72j8qJ5K9K0%oNJ5J3QJ3J6Noqlkn%J3K0J4O%jJRK4L3K8J6J0J4K2L0L6M1N0N8N4L5Oj5
1017A559k2j6j2j0j8l0l9l8k9k9m6n6l6LK7J6klJ3J6mk8l5k6j7rNK2K5J3LPK0K9L9N4O3M7
1013A456J6KJ1K3J9J3K9N8P0O0M3L5L0J9J2J7K9L5K3P%MPok7m1m6n5o8p3o3m7l9l8l9m0m8
1008A388n2m0j9%QRLnj4j7j9k4k6j4NJ5J4J1J2J3OKNJ5K1K2J5Kj1j0PK4K8J8O%NJ8K9L3L0
1003A513K4J5Jj2j3JRJj8k6k2j2j3k3l2m0m4m9n0m3k7j8j7j9oJ4L0L2K9K2Nj8l1k6k1k6l4
999A056k5oMKKQJ2POJ0Rmj8j6lKnj4j5j1j1j0pnrj2kJ7K9K4Qoj5k3l1k2jJ9K6K5K3J8Nj2j6
993A013nONpj7k0j4lKjrqJ0L3M2K5lk6k8k0j3j1rlOJ1P%pj1j5j5j6j3r%J3K1K2J6J0OJmoj
$$ plain form
1028 973 992 1003 1004 999 991 994 1009 1028 1034 1021 1006 1005 1021 1042 1057 1064 1062 1050 1028 1004 983 969 964 969 979 985 985 988 1002 1021 1032 1024 1007 998 1005 1022 1037 1040 1032 1022 1014 1008 1002 995 986 972
1023 972 954 946 961 990 1010 1010 1004 1009 1024 1037 1045 1058 1074 1079 1073 1065 1062 1060 1055 1055 1068 1088 1102 1108 1108 1107 1108 1117 1141 1174 1202 1218 1228 1242 1264 1294 1330 1371 1421 1479 1533 1568 1574 1559
1017 1559 1537 1521 1509 1499 1481 1451 1412 1374 1345 1316 1270 1214 1178 1181 1208 1224 1222 1219 1232 1248 1244 1216 1181 1155 1138 1129 1134 1156 1181 1194 1197 1204 1224 1253 1292 1346 1409 1456
1013 1456 1472 1474 1485 1508 1527 1540 1569 1627 1697 1757 1800 1835 1865 1884 1896 1913 1942 1977 2000 2007 2007 2011 2018 2012 1985 1944 1898 1843 1775 1702 1639 1592 1553 1515 1476 1436 1388
1008 1388 1336 1296 1277 1277 1285 1294 1297 1292 1278 1261 1242 1218 1192 1178 1183 1198 1212 1223 1235 1248 1254 1256 1261 1276 1297 1319 1334 1336 1325 1315 1322 1346 1374 1392 1398 1398 1403 1421 1450 1483 1513
1003 1513 1537 1552 1553 1541 1528 1529 1538 1539 1521 1495 1473 1461 1448 1425 1393 1353 1309 1260 1210 1167 1140 1122 1105 1086 1080 1094 1124 1156 1185 1207 1212 1194 1163 1137 1116 1090 1056
999 1056 1031 1025 1029 1031 1033 1041 1053 1060 1066 1076 1085 1081 1063 1047 1044 1046 1041 1027 1012 1001 990 980 973 968 959 947 945 962 991 1015 1023 1017 1002 979 948 926 925 944 970 995 1018 1036 1041 1029 1013
993 1013 1008 1014 1019 1012 995 975 961 958 960 959 950 942 952 985 1027 1052 1049 1023 995 975 962 951 942 939 945 956 963 963 956 945 930 915 899 886 877 877 890 911 933 949 959 965 966 962 956 955
988I55J1K3K7K2J0kpJJ2J4lk3l3k9k0rJOpk4k3ML2L5J0j2j3LK5L2K4QkOJ9K0J0kj2j6j7j7
982A039j9k1j7jJ0Lj9k7pJ8K4J0j1k5k3j1LMllPJ7J4kj7k7k3rJ2K4J8Jj5j8qPJ5QkjJ2J6N
977I58rrjKJPJ9L1L3K3Oj2k2k3j5lJ2K3J9Jj3j3njJMJqj4rlqj2JK5L7K6Pnj0rlMLkJRJ0Kk
971A055L%j0j4m%j0k2j4LJ1PN%j7l3l2j2LMKPMj7l7l3oJ7J9PLPJ8K2J9Qpk0k5j6m%qk0j8n
965H40J0J4Q%jQJ3RjnjQJ9L6N0M7J9j6l4l5k9k4j1NJ0Kj1j4qJM%kOK1K2Lk1k4pRJ4J8K0J1
960I83oj5plj0j3KJ9J4JNJ5Nk7m0j8J2K4K2K2J9J0RK4M0L1Nj4j6j2pKJ1Lj1j5lJj5l4l4k1
955I58rqokkqj5k2l0l7l3k0jJ5K5K8K1J3J0J7K3J8KlOK1K7J9Nj%Mjj6l2k5LL2L5J7LNJ4J3
949A063RPLnj2j2j3j7j6MK5K5Kj4pOP%mkjKJ0J5J7J2J1Nnj3pPJ6J3J2K1K9K6J5Jqj4j5j2j
$$ plain form
988 955 966 989 1016 1038 1048 1046 1039 1040 1052 1066 1063 1040 1007 978 958 949 950 956 949 925 902 906 938 973 983 971 958 961 986 1018 1042 1050 1048 1054 1073 1093 1103 1101 1089 1073 1056 1039
982 1039 1020 999 982 981 991 994 975 948 941 959 983 993 982 957 934 923 926 930 927 924 931 948 962 960 943 916 893 884 896 920 938 939 924 906 898 905 920 928 926 925 937 953 958
977 958 949 940 939 941 942 949 968 999 1032 1055 1061 1049 1027 1004 989 986 998 1021 1040 1041 1028 1015 1010 1009 1010 1014 1015 1007 993 984 981 973 961 962 987 1024 1050 1057 1052 1042 1033 1030 1034 1037 1035 1036 1045 1055 1057 1055
971 1055 1058 1058 1048 1034 1030 1030 1020 998 984 987 998 1005 1010 1010 993 960 928 916 919 923 925 932 936 919 882 849 843 860 879 886 889 896 914 936 955 963 956 936 911 895 891 891 883 863 845 840
965 840 850 864 872 872 871 879 892 901 900 895 894 902 921 957 1007 1054 1073 1057 1023 988 959 935 924 929 939 941 930 916 908 909 913 913 911 917 938 960 963 942 918 911 920 934 952 972 983
960 983 977 962 955 952 942 929 931 950 964 965 970 985 990 963 923 905 917 941 963 985 1004 1014 1023 1047 1087 1118 1123 1109 1093 1081 1074 1076 1087 1090 1079 1064 1061 1062 1047 1013 979 958
955 958 949 941 935 933 931 923 908 886 856 819 786 766 765 780 805 833 854 867 877 894 917 935 937 934 940 961 988 1007 1012 1011 1011 1015 1014 998 966 941 944 976 1011 1028 1031 1036 1050 1063
949 1063 1072 1079 1082 1077 1065 1053 1040 1023 1007 1011 1036 1061 1063 1049 1042 1048 1055 1055 1051 1049 1048 1050 1060 1075 1092 1104 1115 1120 1115 1102 1095 1102 1118 1131 1143 1164 1193 1219 1234 1235 1227 1213 1198 1186 1185
944A185RJ3Oj0k1j9j3j5k2k1oJ0J1jj2j4jK0L4L0J4Kmj3k4j9QM0M7L5K5K3J9J1OQOnj5qPJ6
939A342J0JppkOJ0PMJ4L9O3O4L7QKJ6K6J6%mlj5l9n1l6j5j2k6l4l1j9pLJ0J0%j3k5l0k3mJ3
934A298J8Ommkoj6k7k9k5rJ5K8J6j4l2j5K0M2L8K5J8J6PkJJ9L2K7J3MJ1K4L3L2K4Nj6l3l7
929A501l2j7%J3J2ok6l8m1m2l8k4j0j2k6l5k9j5oJJ7L5L9K6Mj1j7j4o%lj2j2%J6K7K9K4J1
924A283qk6l4l6l3k5j0NJ0J1K2L9M0K1jLK7M6L8K0Noj9k8j6J5L7K7rm0n1m3k9j6pJNNqk6l8
919A151k8oJ0J1PJpj6k1j8j3q%J4K6L1L5L4K1ok8l2j9oLJ0J2%j5j8mJ2J8J1kj7k0pJ1K0J8
914A165J1M%KJ2J7Pj2j5mNLnrj8k6k2nROlj2k3l0j9J0K8J6ljJ7J9OJJ0J7J3Ljj0j9j2J1K5
908A168J3j1k2j4rj4j9j4nlpqNK1K4Nj4j3QK3J4rl1l6k6mJ9L3K9J5%qomqj7k0j2kKNJ4K4K4
$$ plain form
944 1185 1194 1207 1213 1203 1182 1163 1150 1135 1113 1092 1086 1096 1107 1106 1094 1080 1079 1099 1133 1163 1177 1179 1175 1162 1138 1119 1127 1167 1214 1249 1274 1297 1316 1327 1333 1341 1347 1342 1327 1319 1326 1342
939 1342 1352 1353 1346 1339 1337 1343 1353 1360 1364 1378 1417 1480 1544 1581 1589 1591 1607 1633 1649 1649 1645 1642 1627 1588 1537 1501 1486 1474 1448 1414 1383 1364 1357 1360 1370 1380 1380 1367 1342 1312 1289 1285 1298
934 1298 1316 1322 1318 1314 1312 1306 1290 1263 1234 1209 1200 1215 1243 1259 1245 1213 1198 1218 1260 1298 1323 1341 1357 1364 1362 1363 1382 1414 1441 1454 1458 1469 1493 1526 1558 1582 1587 1571 1538 1501
929 1501 1469 1452 1452 1465 1477 1471 1445 1407 1366 1324 1286 1262 1252 1240 1214 1179 1150 1135 1129 1130 1147 1182 1221 1247 1251 1240 1223 1209 1203 1203 1200 1188 1176 1176 1192 1219 1248 1272 1283
924 1283 1275 1249 1215 1179 1146 1121 1111 1116 1126 1137 1159 1198 1238 1259 1258 1261 1288 1334 1372 1392 1397 1391 1372 1344 1328 1343 1380 1407 1398 1358 1307 1264 1235 1219 1212 1213 1218 1223 1215 1189 1151
919 1151 1123 1117 1127 1138 1145 1146 1139 1123 1102 1084 1071 1063 1063 1077 1103 1134 1169 1203 1224 1218 1190 1158 1139 1133 1136 1146 1158 1158 1143 1125 1121 1133 1151 1162 1160 1143 1123 1116 1127 1147 1165
914 1165 1176 1180 1180 1182 1194 1211 1218 1206 1191 1187 1192 1195 1190 1181 1163 1137 1115 1110 1119 1125 1122 1110 1087 1057 1038 1048 1076 1092 1089 1088 1105 1124 1130 1131 1141 1158 1171 1174 1173 1163 1144 1132 1143 1168
908 1168 1181 1170 1148 1134 1125 1111 1092 1078 1073 1070 1063 1055 1060 1081 1105 1110 1096 1083 1091 1114 1128 1119 1088 1052 1026 1022 1041 1074 1103 1118 1118 1110 1104 1100 1092 1075 1055 1043 1041 1043 1048 1062 1086 1110
903A110J3MQJ9K1J8Qnj5j5%J5J8Kj6k4j0J3K3J4%nJLMJ4K6K2ql7m2k7j1KJ3K3K4J8J2OMRK3
898A275L8M1L6L4M5N6N9N1K9OplOROPNjjJ9M4M7K6J0K1M4N9O0M8K9Qmmnj3j6lJ6K3J4J2K5
893B151N1O7O8N0K4mk3l6m0l9l3k8k6k5j8kJ4K3J9J4J4J6Pj0k5l0l2m1n1n1l9k9k9l5m1m2
888A789l3j4Jlj8k1pPKj3k8l3l2k5j5j2j9k2j4lmj5k5k8k8k5j3LJ3J3RLnpjNjj4k0j5qmOK2
883A348L1K3Prj9k0j3jL%KJ6K7K2QJLJj0j9k4k8k6j4NJ5J2Llqj7k1j1NJ3J6K3L3L2J2j2k3
878A383j8oLL%jLRO%jJ0J7J4LjMJ2K3L1K7Qj5k7k2j5j4j0JJ0Nqj6rJ0L1M4M5L5J5%ppoj3k1
872A535j7%J6J4%nMJ5J6J2QLnqj0j7k9l5k5oJ1K3L1K9J8PQJ1%k2l3k3%K1L7M2L6K2Noj5j2
867A656jJ1J8J8J6Rnj9k2j9j6j4oMNljJ3K3K3J7J4RNMONLJ2K1J3rk1j2NJ7K1K1J0lkJ8K7R
$$ plain form
903 1110 1123 1127 1135 1154 1175 1193 1201 1196 1181 1166 1166 1181 1199 1201 1185 1161 1151 1164 1187 1201 1201 1196 1197 1200 1204 1218 1244 1266 1258 1221 1179 1152 1141 1143 1156 1179 1203 1221 1233 1239 1243 1252 1275
898 1275 1313 1354 1390 1424 1469 1525 1584 1635 1664 1670 1663 1660 1666 1675 1681 1688 1693 1692 1691 1710 1754 1801 1827 1837 1858 1902 1961 2021 2069 2098 2106 2102 2098 2093 2080 2064 2061 2077 2100 2114 2126 2151
893 2151 2202 2269 2337 2387 2411 2407 2384 2348 2308 2269 2236 2208 2182 2157 2139 2137 2151 2174 2193 2207 2221 2237 2244 2234 2209 2179 2147 2106 2055 2004 1965 1936 1907 1872 1831 1789
888 1789 1756 1742 1743 1740 1722 1701 1694 1701 1703 1690 1662 1629 1597 1572 1557 1545 1526 1504 1490 1487 1483 1468 1443 1415 1387 1362 1349 1352 1365 1378 1387 1390 1385 1378 1377 1382 1381 1367 1347 1332 1324 1320 1326 1348
883 1348 1379 1402 1409 1400 1381 1361 1348 1347 1350 1350 1352 1368 1395 1417 1425 1426 1429 1430 1420 1401 1377 1349 1323 1309 1314 1329 1341 1344 1341 1333 1316 1295 1284 1289 1302 1318 1341 1374 1406 1418 1406 1383
878 1383 1365 1359 1362 1365 1365 1364 1367 1376 1382 1382 1381 1391 1408 1422 1425 1424 1428 1440 1463 1494 1521 1529 1514 1487 1465 1450 1436 1426 1427 1437 1442 1434 1418 1409 1419 1450 1494 1539 1574 1589 1589 1582 1575 1569 1556 1535
872 1535 1518 1518 1534 1548 1548 1543 1547 1562 1578 1590 1598 1601 1596 1588 1578 1561 1532 1497 1472 1466 1477 1500 1531 1560 1578 1585 1593 1604 1604 1582 1549 1526 1526 1547 1584 1626 1662 1684 1689 1683 1668 1656
867 1656 1655 1666 1684 1702 1718 1727 1722 1703 1681 1662 1646 1632 1626 1630 1635 1632 1631 1644 1667 1690 1707 1721 1730 1735 1739 1745 1750 1753 1765 1786 1799 1790 1769 1757 1762 1779 1800 1821 1831 1828 1826 1844 1871 1880
862A880j8k3nJ6K8L2K2jk3k4j1lJQJ2lk2k3lPkj3j8k0k1mL1N6N3L5K2J1JMK2K8Lk8l2j2NN
857A973KNJ0J3J8K1J9J2J1J3QMJ0K5L1K4J5J4J3PMQJ5J5J6K3K9K7K6K8K5J0j1j4kJ6K4K1J9
852B527K0K6L4L2K4K2L0M1L5Rk1l3j9NK2K6K1K1K5K2J0nj3j6j7j8j4nPK3L8M1K6MLK6M6M1
847C046K3J8L2M7M4K4KplQJ7K6M0N6O5O3N9O4P2O8N7N4N7N1L5K5L6N5N9N2M7M8M8M1L8N0O6
843D583P5P3P4Q6J03J14J09R3Q2Q4R3J06J21J43J72J94K11K28K52K78L04L27L52L81M12M39
839I489M61M82N06N22N08M51L76L25L13L28L56M01M63N36O07O71P35P97Q62R39J019J086J121
837B3354J136J169J244J374J561J811K128K505K935L426L985M598N214N789O294O652O648
835H1823O009M650K867J204Q3m24m61j56M52J317K366L552M856O223P560Q787R745J0005Q996
$$ plain form
862 1880 1862 1839 1834 1850 1878 1910 1932 1931 1908 1884 1873 1870 1871 1879 1891 1888 1866 1843 1840 1847 1845 1832 1814 1794 1773 1769 1800 1856 1909 1944 1966 1977 1978 1982 2004 2032 2035 2007 1975 1963 1968 1973
857 1973 1975 1980 1990 2003 2021 2042 2061 2073 2084 2097 2105 2109 2119 2144 2175 2199 2214 2228 2241 2248 2252 2260 2275 2290 2306 2329 2358 2385 2411 2439 2464 2474 2463 2449 2447 2463 2487 2508 2527
852 2527 2547 2573 2607 2639 2663 2685 2715 2756 2791 2800 2779 2746 2727 2732 2754 2780 2801 2822 2847 2869 2879 2874 2861 2845 2828 2810 2796 2791 2798 2821 2859 2900 2926 2930 2933 2959 3005 3046
847 3046 3069 3087 3119 3166 3210 3234 3236 3229 3226 3234 3251 3277 3317 3373 3438 3501 3560 3624 3696 3764 3821 3875 3932 3983 4018 4043 4079 4134 4193 4245 4292 4340 4388 4429 4467 4517 4583
843 4583 4658 4731 4805 4891 4994 5108 5217 5310 5392 5476 5569 5675 5796 5939 6111 6305 6516 6744 6996 7274 7578 7905 8257 8638 9050 9489
839 9489 9950 10432 10938 11460 11968 12419 12795 13120 13433 13761 14117 14518 14981 15517 16124 16795 17530 18327 19189 20128 21147 22233 23354
837 23354 24490 25659 26903 28277 29838 31649 33777 36282 39217 42643 46628 51226 56440 62229 68523 75175 81823
835 81823 87832 92482 95349 96553 96636 96212 95751 95595 96047 97364 99730 103282 108138 114361 121921 130708 140453 150458 159454
832A59454O514L142m2k214l256l480l145k316j048N45K374M385O474Q492J0319J1727J2106
830B10031J0610O902J788l144o646q519r274r360q877p854o450m841l111j319M44K101L524
828A66005M306L827J795j275m303o444p563p992q010p687p053o200n229m202l170k173j218
826A03414l52K05J26p34k121l521m535n082n311n365n295n108m838m535m233l934l631l322
824D1828l002k667k328k021j772j575j408j256j129j034r57q85q14p58p25p10o98o71o21n63
821A6234n26n18n19n03m70m34m04l75l54l40l32l16k91k68k52k34k20k15k18k15k04j99j99
819H628j89j64j43j42j46j30j03r1r2q5o5n7o7p8p0n9o5p9p8o7o2o7p2o4n4m7l9l2k6k4j7
815F154lRLk0m9o4n9m4l5l4k9j9j0j4k5l0k5j4j1j3j3j1j3k2l5l9k5ML3M5M0K3jk5m0m2l2
$$ plain form
832 159454 165968 169110 169068 166854 163598 160118 156973 154657 153609 154154 156528 160913 167387 175879 186198 197925 210031
830 210031 220641 227543 229331 226187 219541 211022 201748 192388 183511 175657 169207 164366 161255 159936 160380 162481 166005
828 166005 170311 174138 175933 174658 170355 163911 156348 148356 140346 132659 125606 119406 114177 109975 106805 104632 103414
826 103414 103062 103267 103393 102659 100538 97017 92482 87400 82089 76724 71429 66321 61483 56948 52715 48781 45150 41828
824 41828 38826 36159 33831 31810 30038 28463 27055 25799 24670 23636 22679 21794 20980 20222 19497 18787 18089 17418 16797 16234
821 16234 15708 15190 14671 14168 13698 13264 12860 12485 12131 11791 11459 11143 10852 10584 10332 10098 9878 9663 9445 9230 9026 8827 8628
819 8628 8439 8275 8132 7990 7844 7714 7611 7520 7428 7343 7278 7221 7154 7076 7006 6947 6882 6803 6725 6658 6596 6529 6457 6393 6339 6292 6253 6221 6195 6171 6154
815 6154 6151 6160 6163 6143 6094 6030 5971 5927 5892 5858 5829 5810 5800 5786 5761 5731 5706 5692 5681 5668 5655 5644 5631 5609 5574 5535 5510 5514 5547 5592 5632 5655 5654 5629 5589 5547 5515
810E515k0j6j1%J4K0J3jj3j5j3j5k1l3m0l4j9kPM%jjpj2oJ1J8PlKJ3J2mj9j8j1j1j3pRK6L3
805E338L5L3L1K3J4MKJkj1j4j2ojMJ1J3QKLKj1l5m5l5j5qj6k3j9kK2L8L5J9NJLJ4K9M1L7J4
800E527orJNjj0j9k5l0l0k6k6k9l1k9k8k3j7rkJJmk2l8l9j8PJ6J2NMQJ0J0QLlpkRJ9K0J0o
794E187k0k5k2rNK0K9K8J9NnlOJ1J1Nlmlnj3k1j8KK5L8L2J6%rj3j7k4k8k7j9j4j9k6k3j0L
789E062J1J5J2jj1qPOrj3J2M0L2kk5j3PRlqMJ7K1J2ok6l9k9lK3L7L4K3J0%opkPJ1Qlj5k2k5
784E144j7oLOJ2K2K8K1MkRK1K3J1mj7k0j0PJ9J4kj6k3k0j2lkqrnKLJ0K1K7J8%roljLJ7K8L1
778E309K5J8J1ONJ0K0K5J5kj4j5j0qpJJ0PJJOJj6k3j2NJ3J5J3Lj6k5j0J1J4LjPJ4J3K0L1L5
773E509K4J3J5K3K4J2jpNL5N9N5L4K5L6M2K1lqLPJom%QJ9K9K7K5L8N9O5M7K4J6J6J1jmMJ2
$$ plain form
810 5515 5495 5479 5468 5468 5482 5502 5515 5514 5501 5486 5473 5458 5437 5404 5364 5330 5311 5309 5316 5320 5320 5319 5318 5311 5299 5293 5304 5322 5329 5326 5328 5341 5353 5349 5330 5312 5301 5290 5277 5270 5279 5305 5338
805 5338 5373 5406 5437 5460 5474 5478 5480 5481 5479 5468 5454 5442 5436 5435 5439 5450 5463 5471 5473 5476 5478 5467 5432 5387 5352 5337 5329 5313 5290 5271 5269 5291 5329 5364 5383 5388 5389 5392 5406 5435 5476 5513 5527
800 5527 5521 5512 5513 5518 5517 5507 5488 5463 5433 5403 5377 5351 5322 5291 5262 5234 5211 5194 5185 5183 5184 5185 5181 5159 5121 5082 5064 5071 5087 5099 5104 5108 5116 5126 5136 5144 5147 5144 5137 5135 5144 5163 5183 5193 5187
794 5187 5167 5142 5120 5111 5116 5136 5165 5193 5212 5217 5212 5209 5215 5226 5237 5242 5239 5235 5232 5227 5214 5193 5175 5177 5202 5240 5272 5288 5288 5279 5266 5249 5225 5197 5170 5151 5137 5118 5092 5069 5059 5062
789 5062 5073 5088 5100 5099 5088 5080 5087 5093 5084 5071 5083 5123 5155 5153 5128 5115 5122 5131 5128 5120 5124 5141 5162 5174 5168 5142 5103 5074 5071 5094 5131 5165 5188 5198 5198 5192 5185 5183 5190 5201 5209 5206 5191 5169 5144
784 5144 5127 5121 5124 5130 5142 5164 5192 5213 5217 5215 5224 5245 5268 5279 5275 5258 5238 5228 5235 5254 5268 5266 5250 5227 5207 5195 5192 5190 5182 5173 5168 5170 5173 5183 5204 5231 5249 5249 5240 5234 5231 5230 5233 5250 5278 5309
778 5309 5334 5352 5363 5369 5374 5384 5404 5429 5444 5442 5428 5413 5403 5395 5388 5389 5399 5406 5407 5408 5414 5415 5399 5376 5364 5369 5382 5397 5410 5413 5397 5372 5362 5373 5387 5390 5389 5396 5410 5423 5443 5474 5509
773 5509 5533 5546 5561 5584 5608 5620 5619 5612 5617 5652 5711 5766 5800 5825 5861 5903 5924 5921 5913 5916 5923 5924 5918 5914 5914 5922 5941 5970 5997 6022 6060 6119 6184 6231 6255 6271 6287 6298 6297 6293 6297 6309
768F309J6J6K3L4M9O1O5O3O1O0N5L4Oj5k1k2l1m6n2m5l6k7j1RK2K3K4L4L7K0j1k9k2j5k5m5
763F568n0l7j4OK3L1L1K6L0L9M8M7M0L2K8L5N1O4P1P0P5Q6R8J03R9Q0N8L7K0ml5n5n8n8p3
759G512q9r1p6p1p9q6p5o1n4n5n1m7m5m3l9l7l9l7j9LOmr%J0Oqj7j6j4j5j8j8j4qjPJ4J7J5
754F354PjlKPMnrkJ0K2L0L2K5Lk4m3m7l8k2kJ5K3K1K1L1L6K6Qmmpj6j9nJ1K0K1J7J3J3J4J8
749F553J1lj1jJ8K9L0K6J9J2NOPKopNJ4K0K2L0L1K1QLPRQOPOPKmj2j4ronmMJ8K8L1L5L7K8
743G023J0qj2lRJ5J5J2Qjj2j9j3JJ7K4K3K2K4K6K2J1OJ0J7K1K5L1L6L2K2K0K7L0K0RJ4K8L2
738G574K6J9J6J1mk1j7OL2M0K8J1J0J9K3Qj0j4ppk1k2KL9O1N8M2K0lj7j5lJoj2mJ0J6J5J3
733G917J6J5ROJ1K5L5L4K7K2K9M4M7L3J4LLOJ3K6M1M2K4LlMRJ1J5K0J6MkRK1J8LJJ6L0K5J0
$$ plain form
768 6309 6325 6341 6364 6398 6447 6508 6573 6636 6697 6757 6812 6846 6852 6837 6816 6794 6763 6717 6665 6620 6584 6557 6546 6555 6577 6600 6624 6658 6695 6715 6704 6675 6653 6638 6613 6568
763 6568 6518 6481 6467 6473 6496 6527 6558 6584 6614 6653 6701 6748 6788 6820 6848 6883 6934 6998 7069 7139 7214 7300 7398 7501 7600 7680 7738 7775 7795 7791 7756 7701 7643 7585 7512
759 7512 7423 7332 7256 7185 7106 7020 6945 6884 6830 6775 6724 6677 6632 6589 6550 6513 6474 6437 6418 6421 6427 6423 6414 6414 6424 6430 6422 6405 6389 6375 6360 6342 6324 6310 6302 6301 6308 6322 6339 6354
754 6354 6361 6360 6357 6359 6366 6370 6365 6356 6354 6364 6386 6416 6448 6473 6476 6452 6409 6362 6324 6302 6300 6315 6338 6359 6380 6411 6447 6473 6481 6477 6473 6466 6450 6431 6426 6437 6457 6478 6495 6508 6521 6535 6553
749 6553 6564 6561 6550 6549 6567 6596 6626 6652 6671 6683 6688 6694 6701 6703 6697 6690 6695 6709 6729 6751 6781 6812 6833 6841 6844 6851 6860 6868 6874 6881 6887 6894 6896 6892 6880 6866 6857 6851 6846 6842 6846 6864 6892 6923 6958 6995 7023
743 7023 7033 7025 7013 7010 7019 7034 7049 7061 7069 7068 7056 7037 7024 7025 7042 7066 7089 7111 7135 7161 7183 7194 7200 7210 7227 7248 7273 7304 7340 7372 7394 7414 7441 7471 7491 7500 7514 7542 7574
738 7574 7600 7619 7635 7646 7642 7621 7604 7610 7642 7682 7710 7721 7731 7750 7773 7781 7771 7757 7750 7743 7722 7700 7702 7741 7802 7860 7902 7922 7919 7902 7887 7884 7885 7879 7867 7863 7873 7889 7904 7917
733 7917 7933 7948 7957 7963 7974 7999 8034 8068 8095 8117 8146 8190 8237 8270 8284 8287 8290 8296 8309 8335 8376 8418 8442 8445 8442 8446 8455 8466 8481 8501 8517 8521 8519 8528 8549 8567 8570 8571 8587 8617 8642 8652
728H652jmn%RJ9J9J5K0K9L2K5K4L0L0J4oj0JJ9L6M4L8J8%%J6K7K4K1K8L7L1J8J6L0M4M0K1
723I401MKNMLNONPJ4K1J4JlNJ4K1L0M3M3K2nj3lQJ0QOMLJ0K1K6K8L5M4M1K7K1K8L5L1K2K6
718A0080L1K7K0K3L4L5K5K2L0L3K4J1J2J8J5MJJ1K4L0K8K5K3K0J8K6L9M9M9M4L7L0K5J9K0
714A0962K9L9M0K6OpjK0L9M3L9L5L1K8K2K4K6K2J3J2K7M7N8N6N0M1L4L4L9M2L7K9L2M1M3L1
709A2089J8K0L5M7M5L2K0K1K7L2K6J5J2J7K8L7L6K9K4L1N0N9N2L7L1L9N2N6M6K3KJJ6K4K0
705A3149J9L2M2K2j1k7j7jMJ4L2M3M0L8M9N4L9J7J5K8L4K0mj8j0J3L5L7J3j1j6mQJ5J8J8J4
701A3743J5K5L3L1L1L7M1L4K1J6J2%j2j0%lj5j2J6L9L9K5J6Qnj6j7j3j6k6k9j5NK4L0K7K1
696A4100J5Plj1oLJ3J7J8J3lj4qJ4L0L0K6K6K6K1J6J6RlpKJ4J4O%kKJ4K9L3K8K2K3J8RJ2K6
$$ plain form
728 8652 8651 8647 8642 8642 8651 8670 8689 8704 8724 8753 8785 8810 8834 8864 8894 8908 8902 8892 8893 8912 8948 8992 9030 9048 9048 9048 9064 9091 9115 9136 9164 9201 9232 9250 9266 9296 9340 9380 9401
723 9401 9405 9407 9412 9416 9419 9424 9430 9435 9442 9456 9477 9491 9492 9489 9494 9508 9529 9559 9602 9645 9667 9662 9649 9646 9654 9664 9672 9678 9682 9685 9695 9716 9742 9770 9805 9849 9890 9917 9938 9966 10001 10032 10054 10080
718 10080 10111 10138 10158 10181 10215 10250 10275 10297 10327 10360 10384 10395 10407 10425 10440 10444 10445 10456 10480 10510 10538 10563 10586 10606 10624 10650 10689 10738 10787 10831 10868 10898 10923 10942 10962
714 10962 10991 11030 11070 11096 11102 11095 11094 11114 11153 11196 11235 11270 11301 11329 11351 11375 11401 11423 11436 11448 11475 11522 11580 11636 11686 11727 11761 11795 11834 11876 11913 11942 11974 12015 12058 12089
709 12089 12107 12127 12162 12209 12254 12286 12306 12327 12354 12386 12412 12427 12439 12456 12484 12521 12557 12586 12610 12641 12691 12750 12802 12839 12870 12909 12961 13017 13063 13086 13088 13089 13105 13129 13149
705 13149 13168 13200 13242 13264 13253 13226 13209 13208 13212 13226 13258 13301 13341 13379 13428 13482 13521 13538 13553 13581 13615 13635 13631 13613 13603 13616 13651 13688 13701 13690 13674 13670 13678 13693 13711 13729 13743
701 13743 13758 13783 13816 13847 13878 13915 13956 13990 14011 14027 14039 14039 14027 14017 14017 14014 13999 13987 14003 14042 14081 14106 14122 14130 14125 14109 14092 14079 14063 14037 14008 13993 13998 14022 14052 14079 14100
696 14100 14115 14122 14119 14108 14102 14105 14118 14135 14153 14166 14163 14149 14141 14155 14185 14215 14241 14267 14293 14314 14330 14346 14355 14352 14345 14347 14361 14375 14381 14381 14379 14381 14395 14424 14457 14485 14507 14530 14548 14557 14569 14595
691A4595L4J9Jj%j3k8k0OJ9J3J6L4M7L8K5K2K4K1J7K4L3K8J7J8K3J8LpjJ3J6Qlqrj2k0k8k8
686A4954k2j8k4l3l4k3oOPPQRNMJ1K0Rj6l2k2%J1Q%j4l9n7m7j4Lqk7k7j3KPOmj4j1OJ4%k4
681A4568l4l0k5k2j0QJ7RLMRLqj3rkJklOJ9K0NrmJ2J8J4J8L5M3K5KNK6L3J3j4j5NJ4RQK1L1
675A4804J5qj2NJ9J4JjKMKQK2L3L5L0K3J6J0Jj0k0j5jOok4k4pJ0J2Mmqj3j3rmkpj1j2qkoj7
669A4832k7k4rKlk5l9l4j5lj2l1l9l0k0k2k5j7KJ6J7Qmk3m0m6l8l0k8k3j1OK0L0L5K9RnnK
665A4380%qj5j4qQL4M5K6j1k2QM5N1K2pj3kMLMJ8L8N0M7L0Nj3j6oNRQJ3K7M0L3J3nmJ4K7L2
659A4895L0L3L5L3K4J7J8J7J0KKOPPJ1K1K5K2K2L1L8L3K2J8K8M3M9M1K6J3Q%j1k0j2RK8K8
655A5609J6QQJ2J9K7K7J6OJ1K4K3QpnLMkmOK3L7L3J3nLL5O2N7L0J1PQRJ7L7N5N1K6JrlLNP
$$ plain form
691 14595 14629 14648 14649 14648 14648 14635 14607 14587 14593 14612 14625 14641 14675 14722 14760 14785 14807 14831 14852 14869 14893 14926 14954 14971 14989 15012 15030 15033 15026 15025 15038 15054 15062 15059 15051 15042 15030 15010 14982 14954
686 14954 14932 14914 14890 14857 14823 14800 14794 14800 14807 14814 14822 14831 14836 14840 14851 14871 14880 14864 14832 14810 14810 14821 14829 14829 14815 14776 14719 14672 14658 14661 14653 14626 14599 14586 14588 14595 14601 14597 14583 14572 14578 14592 14592 14568
681 14568 14534 14504 14479 14457 14447 14455 14472 14481 14484 14488 14497 14500 14492 14479 14470 14468 14469 14467 14464 14470 14489 14509 14514 14505 14501 14513 14531 14545 14563 14598 14641 14666 14668 14673 14699 14732 14745 14731 14716 14721 14735 14744 14752 14773 14804
675 14804 14819 14811 14799 14804 14823 14837 14838 14837 14839 14843 14845 14853 14875 14908 14943 14973 14996 15012 15022 15023 15013 14993 14978 14977 14983 14977 14953 14929 14922 14932 14944 14948 14944 14936 14923 14910 14901 14897 14895 14888 14877 14865 14857 14855 14849 14832
669 14832 14805 14781 14772 14774 14771 14746 14707 14673 14658 14655 14643 14612 14573 14543 14523 14501 14476 14459 14461 14477 14494 14502 14498 14475 14435 14389 14351 14321 14293 14270 14259 14265 14285 14315 14350 14379 14388 14383 14378 14380
665 14380 14380 14372 14357 14343 14335 14343 14377 14422 14448 14437 14415 14423 14468 14519 14541 14534 14521 14519 14523 14526 14530 14548 14586 14636 14683 14713 14718 14705 14689 14683 14688 14697 14705 14718 14745 14785 14818 14831 14826 14822 14836 14863 14895
659 14895 14925 14958 14993 15026 15050 15067 15085 15102 15112 15114 15116 15122 15129 15136 15147 15168 15193 15215 15237 15268 15306 15339 15361 15379 15407 15450 15499 15540 15566 15579 15587 15587 15576 15556 15544 15553 15581 15609
655 15609 15625 15633 15641 15653 15672 15699 15726 15742 15748 15759 15783 15806 15814 15807 15802 15805 15809 15807 15803 15809 15832 15869 15902 15915 15910 15913 15948 16010 16067 16097 16108 16115 16123 16132 16149 16186 16241 16292 16318 16319 16310 16307 16310 16315 16322
649A6322J4J8J2KNJ8L0K6K1K6M1M6L6K9L0L8L8L8M4N2N0L9K5K3L2M4M9M3K8J3PJ2K1L1M5N6
645A7404N5M3L5L8M1L3J6OPJ0J2J8L0L5K2Lqj5k8m7m8k7lQPJ3J9J6M%NPmj9k7k4j3NK1K8K5
640A7703K2L0L4K5J0NJ8K6J3j2j9jK4K7Nj7j7%J3Oj3k4j8JK0K5J5jpJK0L3L4K8K0J7J3RKm
635A8066plLMKjlpj2rLJ7K3K1J8K3L2L0K0J1J1J6K0K0K3K6K3J7J6K4K5Nl3o4p2o2m5l0k1k1
630A8109k7k9k4j5lJ1K0J3ok0j6jQQQJ6K5K8K3J8K0K1K0J2LjKJ0K1L7M6M4L4L1L9M6L7K6K2
625A8616K3J0rj8r%j4l8n6n6n0m5m4m7m7m1l2l0l9m7l8j4J2L1L6K2ql3l3j3PQjmOJ8K2J9J3
620A8077J5J9K2J8J6J8J6RNJ1J9K4K6K6J5pk3j9prk3k8j6j3k7m2m2l1k5k0j4j0j7l1l9m2m2
616A7809l1kL2M5L2R%PJ9K9L3K7J4LMJ4K3K5J8J2J3J9J6%j9k6j6KJ8K6K0Lj1j6j5k0l3l9l2
$$ plain form
649 16322 16336 16354 16366 16368 16373 16391 16421 16447 16468 16494 16535 16581 16617 16646 16676 16714 16752 16790 16834 16886 16936 16975 17000 17023 17055 17099 17148 17191 17219 17232 17239 17251 17272 17303 17348 17404
645 17404 17459 17502 17537 17575 17616 17649 17665 17671 17678 17688 17700 17718 17748 17783 17805 17808 17800 17785 17757 17710 17662 17635 17632 17640 17647 17660 17679 17695 17699 17699 17704 17711 17707 17688 17661 17637 17624 17629 17650 17678 17703
640 17703 17725 17755 17789 17814 17824 17829 17847 17873 17886 17874 17855 17854 17878 17905 17910 17893 17876 17876 17889 17895 17882 17858 17840 17841 17861 17886 17901 17900 17893 17894 17914 17947 17981 18009 18029 18046 18059 18068 18070 18066
635 18066 18059 18056 18059 18063 18065 18064 18061 18054 18042 18033 18036 18053 18076 18097 18115 18138 18170 18200 18220 18231 18242 18258 18278 18298 18321 18347 18370 18387 18403 18427 18452 18457 18424 18360 18288 18226 18181 18151 18130 18109
630 18109 18082 18053 18029 18014 18011 18022 18042 18055 18049 18029 18013 18012 18020 18028 18036 18052 18077 18105 18128 18146 18166 18187 18207 18219 18222 18221 18223 18233 18254 18291 18337 18381 18415 18446 18485 18531 18568 18594 18616
625 18616 18639 18649 18640 18622 18613 18613 18599 18561 18505 18449 18399 18354 18310 18263 18216 18175 18143 18113 18074 18027 17989 17975 17987 18018 18054 18076 18068 18035 18002 17989 17996 18004 18003 17999 18005 18023 18045 18064 18077
620 18077 18092 18111 18133 18151 18167 18185 18201 18210 18215 18226 18245 18269 18295 18321 18336 18329 18306 18287 18280 18271 18248 18220 18204 18191 18164 18122 18080 18049 18024 18004 17990 17980 17963 17932 17893 17851 17809
616 17809 17778 17776 17808 17853 17885 17894 17894 17901 17920 17949 17982 18009 18023 18026 18030 18044 18067 18092 18110 18122 18135 18154 18170 18170 18151 18125 18109 18111 18129 18155 18175 18178 18167 18151 18136 18116 18083 18044 18012
611A8012k1j7k2k9m2n8o5n3k9j4j3j1KJ3Lj5j5KJ8J3MKLoj3lJ7K3J4J0J5J4joOJ0ql3l3j4
606A7660kqj8j9j2rrj5k2j8mPlk3k7pJ8K3J4MjlLROj0k7l4k7j3J0K6K2Kj2mNjj1jK0L1K7J9
601A7566J8J8J7J8J6J0mpNK1K8J9kk4l0j2J3K5J4mj5j4jJ1J4Mj1j3jJ6K3K1J3JmLJ3J2JnO
596A7779K5L6L9M3M8N1M4L5K6J8J6J6J1jq%J4K1J7J3J7K3K3J7J6K5L5L0Pj6j8NL5N1M7L1J5
591A8586J4K3L6M0L8L4K8J7LJRJ7J2RK0M0M3K6MjPK2L6M4M6M1L8L6L4K9K1J9K3K7L1L2L1K4
587A9540J2knJQPJQK9N1N7M7L4K5K1K1K7L8M8M4L1J6J8L3M7M5K6Kj2j7j2PM1O6O4M2K5K6L7
582B0497L5K2NkJJ4K3K0QOK1M1M6L3K0J6J4QLMQJ6K4L4M5N6O6O7N7M6M5N7O6O7N6M5L2J3j2
577B1623l2l7k0QK7K8J6PJ1J7J9J7J7J7J5J0J1J7K4K9L3L4L0K4K9L7L1Ok1k4mJ6K2J8K1K7
$$ plain form
611 18012 17991 17974 17952 17923 17881 17823 17758 17705 17676 17662 17649 17638 17640 17653 17656 17641 17626 17628 17646 17659 17663 17665 17668 17662 17649 17646 17663 17686 17700 17710 17725 17739 17738 17732 17738 17748 17740 17707 17674 17660
606 17660 17658 17650 17632 17613 17601 17592 17583 17568 17546 17528 17524 17531 17528 17505 17478 17471 17489 17512 17526 17530 17529 17526 17529 17538 17544 17534 17507 17473 17446 17433 17443 17469 17491 17493 17481 17477 17482 17481 17470 17469 17489 17520 17547 17566
601 17566 17584 17602 17619 17637 17653 17663 17659 17652 17657 17678 17706 17725 17723 17699 17669 17657 17670 17695 17709 17705 17690 17676 17675 17686 17700 17704 17693 17680 17679 17695 17718 17739 17752 17753 17749 17752 17765 17777 17778 17773 17779
596 17779 17804 17840 17879 17922 17970 18021 18065 18100 18126 18144 18160 18176 18187 18186 18178 18178 18192 18213 18230 18243 18260 18283 18306 18323 18339 18364 18399 18429 18436 18420 18402 18407 18442 18493 18540 18571 18586
591 18586 18600 18623 18659 18699 18737 18771 18799 18816 18819 18820 18829 18846 18858 18867 18887 18927 18970 18996 19000 18999 19006 19028 19064 19108 19154 19195 19233 19269 19303 19332 19353 19372 19395 19422 19453 19485 19516 19540
587 19540 19552 19550 19545 19546 19554 19561 19562 19570 19599 19650 19707 19754 19788 19813 19834 19855 19882 19920 19968 20012 20043 20059 20077 20110 20157 20202 20228 20230 20218 20201 20189 20196 20237 20303 20367 20409 20434 20460 20497
582 20497 20532 20554 20559 20557 20558 20572 20595 20615 20623 20629 20650 20691 20737 20770 20790 20806 20820 20828 20831 20835 20843 20859 20883 20917 20962 21018 21084 21151 21208 21254 21299 21356 21422 21489 21545 21590 21622 21635 21623
577 21623 21591 21554 21534 21542 21569 21597 21613 21620 21631 21648 21667 21684 21701 21718 21733 21743 21754 21771 21795 21824 21857 21891 21921 21945 21974 22011 22042 22048 22027 22003 21999 22015 22037 22055 22076 22103
573B2103K8K4K0J8J4NKJ2K8L4K9K3K3K5K7L2L6L7L3L0K9K5J3KLJ7L0L1K6K9L5L5K2J4J8L7
568B2949M8L8J8J0J5K0J0lJK0L4L2K1J7K3L3L7K9J4mj1mQJ4J9K4L4M3M7M3L5K7K2K6L8M9M7
564B3823K9J1J2L5O2O3M1J9J8L4M8N4N1M0K5PJJ0K9M6N4M8L1J6J6K9M2M3L6L6M0M1L4K7K1
560B4972K4L4M9N7M9L2K2L1M7N9N7M6L7L5M3N1N7O3P5R1R3P2L7J4J5K9M2N5O6P2O7N3M4M7
555B6637N8O2N1L4K6L6N1N4M9N1O2O4N0M5O4R3R9P0L3J2J3L3O3R1R7Q0O4N9N9N3M8N6P2Q6
551B8575J00J15J16R8P7P7R2R9R2Q5R0R3R2J00J23J37J31J09J01J13J34J50J56J46J25J07
548C1433R7R6R7J00J08J20J34J49J68J83J84J75J65J59J52J40J36J44J52J50J35J36J56J83
545C4852J85J68J59J75K03K14K02J84J75J78J87J94J94J84J75J83K05K22K22K08J90J70J49
$$ plain form
573 22103 22131 22155 22175 22193 22207 22212 22214 22226 22254 22288 22317 22340 22363 22388 22415 22447 22483 22520 22553 22583 22612 22637 22650 22652 22655 22672 22702 22733 22759 22788 22823 22858 22880 22894 22912 22949
568 22949 22997 23035 23053 23063 23078 23098 23108 23105 23106 23126 23160 23192 23213 23230 23253 23286 23323 23352 23366 23362 23351 23347 23355 23369 23388 23412 23446 23489 23536 23579 23614 23641 23663 23689 23727 23776 23823
564 23823 23852 23863 23875 23910 23972 24035 24076 24095 24113 24147 24195 24249 24300 24340 24365 24372 24373 24383 24412 24458 24512 24560 24591 24607 24623 24652 24694 24737 24773 24809 24849 24890 24924 24951 24972
560 24972 24996 25030 25079 25136 25185 25217 25239 25270 25317 25376 25433 25479 25516 25551 25594 25645 25702 25765 25840 25931 26024 26096 26133 26147 26162 26191 26233 26288 26354 26426 26493 26546 26590 26637
555 26637 26695 26757 26808 26842 26868 26904 26955 27009 27058 27109 27171 27235 27285 27330 27394 27487 27586 27656 27689 27701 27714 27747 27810 27901 27998 28078 28142 28201 28260 28313 28361 28417 28489 28575
551 28575 28675 28790 28906 29004 29081 29158 29250 29349 29441 29526 29616 29709 29801 29901 30024 30161 30292 30401 30502 30615 30749 30899 31055 31201 31326 31433
548 31433 31530 31626 31723 31823 31931 32051 32185 32334 32502 32685 32869 33044 33209 33368 33520 33660 33796 33940 34092 34242 34377 34513 34669 34852
545 34852 35037 35205 35364 35539 35742 35956 36158 36342 36517 36695 36882 37076 37270 37454 37629 37812 38017 38239 38461 38669 38859 39029 39178
542C9178J44J65K05K36K43K31K23K27K36K38K33K30K43K57K56K39K28K32K47K55K58K56K51
539D4511K46K50K64K70K55K34K33K53K73K80K80K81K82K80K81K88L03L22L41L46L36L23L17
537E1049L19L18L16L20L28L26L17L23L43L58L54L42L39L41L42L47L66L92M12M15M08M06M13
534E9194M34M51M52M35M21M21M37M61M91N27N52N54N48N61N94O25O36O34O35O48O70P04P43
531G1828P77P95Q09Q36Q73R10R36R64J005J055J097J130J161J199J246J294J335J368J397
529I2015J429J467J504J525J523J514J517J537J562J572J576J589J622J667J708J730J738
527A18795J734J720J691J635J552J451J339J201J026Q18N85L40P8j95m69p24r57j166j355
524A29099j519j655j754j819j860j881j879j854j818j788j764j735j687j623j547j471j401
$$ plain form
542 39178 39322 39487 39692 39928 40171 40402 40625 40852 41088 41326 41559 41789 42032 42289 42545 42784 43012 43244 43491 43746 44004 44260 44511
539 44511 44757 45007 45271 45541 45796 46030 46263 46516 46789 47069 47349 47630 47912 48192 48473 48761 49064 49386 49727 50073 50409 50732 51049
537 51049 51368 51686 52002 52322 52650 52976 53293 53616 53959 54317 54671 55013 55352 55693 56035 56382 56748 57140 57552 57967 58375 58781 59194
534 59194 59628 60079 60531 60966 61387 61808 62245 62706 63197 63724 64276 64830 65378 65939 66533 67158 67794 68428 69063 69711 70381 71085 71828
531 71828 72605 73400 74209 75045 75918 76828 77764 78728 79733 80788 81885 83015 84176 85375 86621 87915 89250 90618 92015
529 92015 93444 94911 96415 97940 99463 100977 102494 104031 105593 107165 108741 110330 111952 113619 115327 117057 118795
527 118795 120529 122249 123940 125575 127127 128578 129917 131118 132144 132962 133547 133887 133965 133770 133301 132577 131620 130454 129099
524 129099 127580 125925 124171 122352 120492 118611 116732 114878 113060 111272 109508 107773 106086 104463 102916 101445 100044
522A00044j341j286j237j195j170j152j136j123j126j150j179j201j221j244j267j278j273
520G9465j258j236j205j171j142j120j098j060j008r65r45r44r28q85q34q07q09q10p94p74
518E9672p62p51p24o88o60o42o28o15o03n89n57n04m58m40m48m57m51m21l82l43l14k93k77
515D7665k60k51k51k55k54k53k58k78l04l29l48l61l77m01m26m37m23l95l68l50l43l42l47
512D0054l49l35l04k79k69k67k57k43k39k45k45k33k14j94j76j66j70j82j89j85j87j96k01
509C4729j87j66j58j61j61j53j44j47j59j68j69j57j42j34j41j48j44j28j24j38j52j37j07
506C1304r4j13j41j46j30j20j26j37j35j21j11j13j17j16j07r7r3j02j16j22j16j11j16j22
504B8482j11q3o4p2r1j01r6r4j02j05r7q4p4p1o8o6p1q0q7q1o7n6o3p8p7n5k9k2k5k5k1k5
$$ plain form
522 100044 98703 97417 96180 94985 93815 92663 91527 90404 89278 88128 86949 85748 84527 83283 82016 80738 79465
520 79465 78207 76971 75766 74595 73453 72333 71235 70175 69167 68202 67257 66313 65385 64500 63666 62859 62050 61240 60446 59672
518 59672 58910 58159 57435 56747 56087 55445 54817 54202 53599 53010 52453 51949 51491 51051 50603 50146 49695 49274 48892 48549 48235 47942 47665
515 47665 47405 47154 46903 46648 46394 46141 45883 45605 45301 44972 44624 44263 43886 43485 43059 42622 42199 41804 41436 41086 40743 40401 40054
512 40054 39705 39370 39066 38787 38518 38251 37994 37751 37512 37267 37022 36789 36575 36381 36205 36039 35869 35687 35498 35313 35126 34930 34729
509 34729 34542 34376 34218 34057 33896 33743 33599 33452 33293 33125 32956 32799 32657 32523 32382 32234 32090 31962 31838 31700 31548 31411 31304
506 31304 31210 31097 30956 30810 30680 30560 30434 30297 30162 30041 29930 29817 29700 29584 29477 29380 29287 29185 29069 28947 28831 28720 28604 28482
504 28482 28371 28288 28224 28152 28061 27960 27864 27770 27668 27563 27466 27382 27308 27237 27169 27103 27032 26952 26865 26784 26717 26661 26598 26520 26443 26388 26359 26337 26312 26287 26266 26241
500B6241l7m5m4m1m1l3k0j8k9l7k6j1j3l1m3l8k3j3j1j4k4l7m6m8m1l1k6k7l2l3l0l2l6l4
495B5196k5j8k4l2k8rJ2K4K6K1J2Jrj9k6k4j2mnpOK9L9L0RnqmNJ2J6J3J3J8K3K0J1JjQK5L6
490B5346K8Jk3k8j2RK1K4K7L3M1L7K8K1K6L6M0L9L2L2M2O4P8P2M2J8J7L8N5N8N3N2N9O6P0
486B6542O5N1L5K7L1M2N1N3M2K1mk2l2k7kL4M9L1mk9l2k8k5k4k3k2j4PK9L1J3rk0k6k6j6P
482B6776K6K7J2lj4j1LJ7J1qj6oJ0R%opqjJ4K4J6L%OMoj8l1m7o1o1m6l0k6l3m7n4m9l2k2k4
476B6291l0k5j6j5k1k3k2k4l2l7m0m4m6m0k8k5l1l3k7k1j9j5mKmj4k2l0l8m0l1j6kQJ5J6J2
472B5529RJ2K2L7M8N2M6M1M5M8L2nm3o7q1q8r1q7q4q7r4r8j03j04j02r5r1r0r2r2r3r5r0p2
468B3977n1l5k6k5l7n0m7k4nmj3j0LLj1j7lK2L9M5N3O9Q8R7R4R5J11J37J58J65J68J69J53
$$ plain form
500 26241 26204 26159 26115 26074 26033 26000 25980 25962 25933 25896 25870 25859 25846 25815 25772 25734 25711 25698 25687 25673 25649 25612 25566 25518 25477 25446 25420 25393 25361 25328 25298 25266 25230 25196
495 25196 25171 25153 25129 25097 25069 25060 25072 25096 25122 25143 25155 25156 25147 25128 25102 25078 25066 25062 25057 25050 25056 25085 25124 25154 25163 25158 25150 25146 25151 25163 25179 25192 25205 25223 25246 25266 25277 25278 25277 25285 25310 25346
490 25346 25374 25375 25352 25324 25312 25321 25342 25366 25393 25426 25467 25504 25532 25553 25579 25615 25655 25694 25726 25758 25800 25864 25942 26014 26056 26074 26091 26129 26184 26242 26295 26347 26406 26472 26542
486 26542 26607 26658 26693 26720 26751 26793 26844 26897 26939 26960 26956 26934 26902 26875 26873 26907 26956 26987 26983 26954 26922 26894 26869 26845 26822 26800 26786 26793 26822 26853 26866 26857 26837 26811 26785 26769 26776
482 26776 26802 26829 26841 26838 26824 26813 26816 26833 26844 26836 26820 26814 26824 26833 26833 26827 26820 26812 26811 26825 26849 26865 26868 26868 26874 26878 26872 26854 26823 26776 26715 26654 26608 26578 26552 26519 26472 26418 26369 26337 26315 26291
476 26291 26261 26236 26220 26205 26184 26161 26139 26115 26083 26046 26006 25962 25916 25876 25848 25823 25792 25759 25732 25711 25692 25677 25673 25675 25671 25657 25635 25605 25567 25527 25496 25480 25478 25486 25501 25517 25529
472 25529 25538 25550 25572 25609 25657 25709 25755 25796 25841 25889 25921 25916 25873 25806 25725 25637 25546 25459 25375 25288 25194 25096 24993 24889 24787 24692 24601 24511 24419 24327 24234 24139 24049 23977
468 23977 23926 23891 23865 23840 23803 23753 23706 23682 23677 23673 23660 23650 23653 23656 23645 23628 23625 23647 23686 23731 23784 23853 23941 24038 24132 24227 24338 24475 24633 24798 24966 25135 25288
464B5288J08M6ml8o6r7j25j44j51j50j45j44j49j47j31j09r4r6j03j08j07r2n8j5J4J5mk9
460B3165m3m3l3k4k6l0k0OK9L2J6LNJ4J9J4RJ6L5M7L8J7J1L3O5Q3Q1O5M6L0K0J4qn0r4j14
456B3428j04q9r2j13j33j37j23j04r1q5q1o6m8m3n5o9o5m9l7m1m7m6l9m0m5m9m6m8n5n4l8
452B1296j4%qk5l9m7m5l9k9k1j4n%j3m6p3o9m0j8j9l2k9j9k0m1o1o2m6l6l5l7l3l4m9o5p0
448B0063o5o0o0n4m0k9l8o1p6p4n9m7m9n9o3n4l4j3lok0l9n4o0n6n6o2o3n0k9j6j9k8l5m1
443A8491m8n4n9n9n7n0l8k8k3k6k7k3j5j6k6l7m4m6n6o4n8m0k5k2k3k0j9k8m4n1m9n3o3o3
439A7137m7k8k2k6l2l2l1k4j3klj6l4n0n5m1j9rj6l2m2l8k6j2KPpl1m0l2j5lQK2K7J4qj6q
434A6407OJ6J7J7J4RMKMJ2K3K5J0j4k5j9j1j5l0m2m6m3l1k1k4l7m2k7plj6k3j6j0j4j6jJ8
$$ plain form
464 25288 25396 25442 25438 25400 25334 25237 25112 24968 24817 24667 24522 24378 24229 24082 23951 23842 23748 23652 23549 23441 23334 23242 23184 23169 23183 23198 23194 23165
460 23165 23122 23079 23046 23022 22996 22966 22946 22952 22981 23013 23029 23032 23037 23051 23070 23084 23093 23109 23144 23191 23229 23246 23257 23290 23355 23438 23519 23584 23630 23660 23680 23694 23686 23636 23542 23428
456 23428 23324 23235 23143 23030 22897 22760 22637 22533 22442 22357 22276 22210 22162 22119 22064 21995 21930 21881 21844 21803 21756 21710 21671 21631 21586 21537 21491 21443 21388 21334 21296
452 21296 21282 21282 21274 21249 21210 21163 21118 21079 21050 21029 21015 21010 21010 20997 20951 20878 20809 20769 20751 20732 20700 20671 20652 20632 20591 20530 20468 20422 20386 20351 20314 20281 20247 20198 20133 20063
448 20063 19998 19938 19878 19824 19784 19755 19717 19656 19580 19506 19447 19400 19351 19292 19229 19175 19141 19128 19125 19119 19099 19060 19006 18946 18890 18834 18772 18709 18659 18630 18614 18595 18567 18532 18491
443 18491 18443 18389 18330 18271 18214 18164 18126 18098 18075 18049 18022 17999 17984 17968 17942 17905 17861 17815 17759 17695 17637 17597 17572 17550 17527 17507 17488 17460 17416 17365 17316 17263 17200 17137
439 17137 17090 17062 17040 17014 16982 16950 16919 16895 16882 16880 16877 16861 16827 16777 16722 16681 16662 16653 16637 16605 16563 16525 16499 16487 16489 16496 16489 16458 16418 16386 16371 16368 16376 16398 16425 16439 16431 16415 16407
434 16407 16413 16429 16446 16463 16477 16486 16490 16492 16496 16508 16531 16556 16566 16552 16527 16508 16497 16482 16452 16410 16364 16321 16290 16269 16245 16208 16166 16139 16132 16129 16113 16090 16074 16064 16050 16034 16033 16051
430A6051J8kk0j8jJ0Nj1k2k2j1%J0J2Mj0j2J5M9O1M3K7K8L5K9J6J2J7K5L5M8M9L2J5K3M6N6
425A6642M0J5Jnp%J9L1L1K9L6M7M8L6K6K1J8J5J4J6K1K6L2L6M1M7N1M2K2J1J5K4J6JLK6N0
421A7537N3M3L6M2N2O6Q5J03J06R2O8O0P5R8J07R9Q8R2J09J19J13J00R4R5R5R1R1J00J09J02
417B0120Q6Q2J03J34J43J27J09J19J54J82J90J93K05K22K31K34K40K49K52K58K79L19L56L80
414B4967L98M36M90N38N59N65N74N97O37O84P28P58P70P75P94Q27Q69R13R59J007J049J092
411D0986J154J242J355J485J631J792J963K145K346K580K856L168L525L943M438N021N703
409H7333O504P437Q500R668J0924J2235J3530J4673J5480J5726J5143J3438J0466O434J948
408B49439k265n706q250r998j1077j1575j1603j1306j0800j0156r401q566p674o742n795m880
$$ plain form
430 16051 16069 16067 16047 16029 16028 16038 16043 16032 16010 15988 15977 15977 15987 15999 16003 15993 15981 15996 16045 16106 16149 16176 16204 16239 16268 16284 16296 16313 16338 16373 16421 16470 16502 16517 16540 16586 16642
425 16642 16682 16697 16698 16693 16686 16686 16705 16736 16767 16796 16832 16879 16927 16963 16989 17010 17028 17043 17057 17073 17094 17120 17152 17188 17229 17276 17327 17369 17391 17402 17417 17441 17457 17458 17461 17487 17537
421 17537 17590 17633 17669 17711 17763 17829 17914 18017 18123 18215 18283 18343 18418 18516 18623 18722 18810 18902 19011 19130 19243 19343 19437 19532 19627 19718 19809 19909 20018 20120
417 20120 20206 20288 20391 20525 20668 20795 20904 21023 21177 21359 21549 21742 21947 22169 22400 22634 22874 23123 23375 23633 23912 24231 24587 24967
414 24967 25365 25801 26291 26829 27388 27953 28527 29124 29761 30445 31173 31931 32701 33476 34270 35097 35966 36879 37838 38845 39894 40986
411 40986 42140 43382 44737 46222 47853 49645 51608 53753 56099 58679 61535 64703 68228 72171 76609 81630 87333
409 87333 93837 101274 109774 119442 130366 142601 156131 170804 186284 202010 217153 230591 241057 247491 249439
408 249439 247174 241468 233218 223220 212143 200568 188965 177659 166859 156703 147302 138736 131062 124320 118525 113645
406A13645m039l297k654k102j629j228q89n96l13j8K89O01R27J275J642K014K397K816L282
403A12123L799M374N025N759O597P575Q740J0123J1735J3602J5751J8174K0830K3644K6470
401B94321K9060L1087L2144L1612K8634K2556J3678L483o084j3719j9184k2838k5041k6010
400C73699k6002k5341k4281k2941k1394j9701j7880j5934j3922j1976j0211q681p398o359
398A41678n523m836m257l769l352k971k610k262j912j549j188q59n57k43J00M55Q15J206J653
396A10019K150K695L307M011M811N715O724P832R011J0225J1427J2512J3319J3649J3267J1901
394B42575R345N681J399k811o384r089j0951j2096j2666j2793j2591j2153j1553j0850j0067
392A34996r212q307p399o525n709m972m343l828l406l049k754k519k330k161j999j844j703
$$ plain form
406 113645 109606 106309 103655 101553 99924 98696 97807 97211 96898 96880 97169 97770 98697 99972 101614 103628 106025 108841 112123
403 112123 115922 120296 125321 131080 137677 145252 153992 164115 175850 189452 205203 223377 244207 267851 294321
401 294321 323381 354468 386612 418224 446858 469414 483092 486575 480491 466772 447588 424750 399709 373699
400 373699 347697 322356 298075 275134 253740 234039 216159 200225 186303 174327 164116 155435 148037 141678
398 141678 136155 131319 127062 123293 119941 116970 114360 112098 110186 108637 107449 106590 106033 105790 105890 106345 107160 108366 110019
396 110019 112169 114864 118171 122182 126993 132708 139432 147264 156275 166500 177927 190439 203758 217407 230674 242575
394 242575 251920 257601 259000 256189 249805 240716 229765 217669 205003 192210 179619 167466 155913 145063 134996
392 134996 125784 117477 110078 103553 97844 92872 88529 84701 81295 78246 75492 72973 70643 68482 66483 64639 62936
390F2936j587j496j419j342j268j212j160j090j000r32r07q99q63q01p45p10o76o36o02n85
387D3006n74n52n23n02m90m78m68m55m35m05l70l40l13k88k68k60k57k55k42k22j97j70j50
385C4792j42j43j44j43j43j42j34j18j03r3q6q5q5q6p7o3n8p1r3j01r3r0r3r3p7n6m4m0k8
381C2068j0oj6k5j6KJ7K6L5M5M8M6M6M4L8L2L8N7O9O7O0O6R1J15J23J14J06J05J10J14J21
377C3730J30J38J41J39J37J42J50J57J62J65J68J75J90K08K20K27K45K72K96L05L04L03L09
374C8413L21L43L69L93M08M16M22M26M26M30M35M40M43M46M49M48M44M57M91N19N22N08N01
372D8470N05N02M86M79M96N26N57N82O07O26O40O44O42O34O34O50O74O89O89O94P05P14P22
369F2567P42P78Q06Q08P99Q03Q18Q22Q08P88P69P50P34P31P42P48P32O99O72O59O63O76O87
$$ plain form
390 62936 61349 59853 58434 57092 55824 54612 53452 52362 51362 50430 49523 48624 47761 46960 46215 45505 44829 44193 43591 43006
387 43006 42432 41880 41357 40855 40365 39887 39419 38964 38529 38124 37754 37414 37101 36813 36545 36285 36028 35773 35531 35309 35112 34942 34792
385 34792 34650 34507 34363 34220 34077 33935 33801 33683 33580 33487 33401 33316 33231 33145 33068 33005 32947 32876 32783 32682 32589 32499 32406 32313 32236 32180 32136 32096 32068
381 32068 32058 32052 32036 32011 31995 31997 32014 32040 32075 32120 32168 32214 32260 32304 32342 32374 32412 32469 32538 32605 32665 32731 32822 32937 33060 33174 33280 33385 33495 33609 33730
377 33730 33860 33998 34139 34278 34415 34557 34707 34864 35026 35191 35359 35534 35724 35932 36152 36379 36624 36896 37192 37497 37801 38104 38413
374 38413 38734 39077 39446 39839 40247 40663 41085 41511 41937 42367 42802 43242 43685 44131 44580 45028 45472 45929 46420 46939 47461 47969 48470
372 48470 48975 49477 49963 50442 50938 51464 52021 52603 53210 53836 54476 55120 55762 56396 57030 57680 58354 59043 59732 60426 61131 61845 62567
369 62567 63309 64087 64893 65701 66500 67303 68121 68943 69751 70539 71308 72058 72792 73523 74265 75013 75745 76444 77116 77775 78438 79114 79801
366G9801O85O71O53O44O46O51O54O64O88P23P50P62P80Q21Q76R17R42R73J031J105J176J242
363I7855J310J377J430J464J493J524J552J566J559J526J469J392J297J186J058R24P88O48
361A21418M95L24J43m4k25l89n23o25o99p51p87q11q27q27q17q09q17q25q17p91p57p17o68
358A08854o04n31m49l56k62j72q9qO3J14J58K26L20M14M80N28N76O24O57O66O64O53O20N47
355A13693M39L14J86O7m5j57k63l60m44n18n86o51p13p79q47r23j002j084j156j208j243j281
353A01439j335j402j470j526j561j569j553j521j480j427j356j274j189j107j023r39q61p87
350G8059p24o74o45o28o10n82n53n35n32n48n75o07o34o56o73o85o92o93o94o90o77o51o22
348F3479n93n67n48n36n26n18n15n23n33n36n36n47n66n77n76n78n96o08n93n60n48n70n90
$$ plain form
366 79801 80486 81157 81810 82454 83100 83751 84405 85069 85757 86480 87230 87992 88772 89593 90469 91386 92328 93301 94332 95437 96613 97855
363 97855 99165 100542 101972 103436 104929 106453 108005 109571 111130 112656 114125 115517 116814 118000 119058 119982 120770 121418
361 121418 121913 122237 122380 122336 122111 121722 121199 120574 119875 119124 118337 117526 116699 115872 115055 114246 113429 112604 111787 110996 110239 109522 108854
358 108854 108250 107719 107270 106914 106652 106480 106391 106383 106446 106560 106718 106944 107264 107678 108158 108686 109262 109886 110543 111209 111873 112526 113146 113693
355 113693 114132 114446 114632 114699 114654 114497 114234 113874 113430 112912 112326 111675 110962 110183 109336 108413 107411 106327 105171 103963 102720 101439
353 101439 100104 98702 97232 95706 94145 92576 91023 89502 88022 86595 85239 83965 82776 81669 80646 79707 78846 78059
350 78059 77335 76661 76016 75388 74778 74196 73643 73108 72576 72028 71453 70846 70212 69556 68883 68198 67506 66813 66119 65429 64752 64101 63479
348 63479 62886 62319 61771 61235 60709 60191 59676 59153 58620 58084 57548 57001 56435 55858 55282 54704 54108 53500 52907 52347 51799 51229 50639
345E0639n78n40n06m85m65m40m18m06m02l94l88l95m10m25m29m22m15m09m02l92l79l60l42
342D0837l27l15k99k75k45k20k03j92j83j73j63j54j47j46j50j56j62j64j58j43j15r2q7j03
339C6465j21j19r6p3o8p5q0p6o8o0m7k9j4j4k4l1k2kQj2n9j13j60k06k54k99l24l28l28l32
335C3039l33l28l22l22l24l15k99k80k60k35k15k10k17k20k07j85j64j55j55j59j57j41j23
333B7713j20j31j44j47j42j40j41j40j38j38j40j41j36j31j27j21j12j04r9r2q1p0o7p4p8
330B4759q2r1j16j47j71j86j95j99j92j83j86k08k29k35k29k24k21k13j95j77j58j47j50j71
327B0454j90j86j59j32j26j41j60j65j50j19r7r9j17j26j17j03j04j12j18j16j06q9p2o5p0
324A7415q3j00j12j15j13j13j17j18j07r3q8q9r2r7j05j02p8m5l1m4n9n8n0m8n8o9q3r2q3
$$ plain form
345 50639 50061 49521 49015 48530 48065 47625 47207 46801 46399 46005 45617 45222 44812 44387 43958 43536 43121 42712 42310 41918 41539 41179 40837
342 40837 40510 40195 39896 39621 39376 39156 38953 38761 38578 38405 38242 38088 37941 37795 37645 37489 37327 37163 37005 36862 36747 36655 36568 36465
339 36465 36344 36225 36129 36056 35988 35913 35833 35757 35689 35629 35582 35553 35539 35525 35501 35470 35448 35446 35454 35442 35383 35270 35110 34904 34650 34351 34027 33699 33371 33039
335 33039 32706 32378 32056 31734 31410 31095 30796 30516 30256 30021 29806 29596 29379 29159 28952 28767 28603 28448 28293 28134 27977 27836 27713
333 27713 27593 27462 27318 27171 27029 26889 26748 26608 26470 26332 26192 26051 25915 25784 25657 25536 25424 25320 25221 25129 25048 24978 24911 24837 24759
330 24759 24677 24586 24470 24323 24152 23966 23771 23572 23380 23197 23011 22803 22574 22339 22110 21886 21665 21452 21257 21080 20922 20775 20625 20454
327 20454 20264 20078 19919 19787 19661 19520 19360 19195 19045 18926 18829 18730 18613 18487 18370 18267 18163 18051 17933 17817 17711 17622 17550 17485 17415
324 17415 17332 17232 17120 17005 16892 16779 16662 16544 16437 16344 16256 16167 16075 15978 15873 15771 15693 15648 15617 15573 15514 15456 15406 15358 15300 15231 15148 15056 14973
320A4973n8m3n3p4q2p3o9o9p0o8p3p5p2o4n7m8l3k7l9o0o9o7p3q9r3q1o9o1m4k4k7o6j05j09
316A2789q0n8o2p7q1p2n9n3n2n1m5l6l7m9o1o1n6n7o8p6o9n6m1l2k7k4j7j4j9l5m5m3k6j4
312A1136j2k0l5n4o5n7l7k9m1n3m1j6j0l1n6n8m3l1l0l7m2m8n0m4l7l7m2m1l2l0m4o1o3n5
308I754m5l8l5l7m4m9l9k7k6l2k6j1qk3l7l2k3k9m2m2l2l1m6o1n5l2nJ1Qj2l2l3j6K%j5k3
303H737j2j%j5k7k5j6qpj4k5m0m9m4k7j2oj0k2l4m2l5j6k%kJKrj9j8qpj7k8l4m4n6o4o1n5
298G829n3m9l8k5j6rmnj7l7n2n2l9k2k3m4o4n9l5k1k6k4oNj5m6n9n0m2m1l4k2j5j9k0j1rj9
293F712k9k3oK%j1l1n4o1m3j1ROmnoj4k2j5lJj4l1m1m2m2m3m0l4l0k9k5j1JJj2k3k2j0jlj8
288E923l4l7k1KJ1jk1k7k0j1j4k1k1j5j0j5l0m1l3qJ8K1Kj5j5LJ7J9J2Lj3l1m0l1j2nj0j0
$$ plain form
320 14973 14915 14872 14819 14745 14663 14590 14521 14452 14382 14314 14241 14166 14094 14030 13973 13925 13892 13865 13826 13766 13697 13630 13557 13468 13375 13294 13225 13164 13120 13096 13069 13003 12898 12789
316 12789 12709 12651 12589 12512 12431 12359 12300 12247 12195 12144 12099 12063 12026 11977 11916 11855 11799 11742 11674 11598 11529 11473 11432 11400 11373 11349 11332 11318 11299 11264 11219 11176 11150 11136
312 11136 11124 11104 11069 11015 10950 10893 10856 10827 10786 10733 10692 10676 10666 10635 10579 10521 10478 10447 10417 10380 10338 10290 10240 10196 10159 10122 10080 10039 10007 9977 9933 9872 9809 9754
308 9754 9709 9671 9636 9599 9555 9506 9467 9440 9414 9382 9356 9345 9337 9314 9277 9245 9222 9193 9151 9109 9077 9046 9000 8939 8884 8852 8847 8858 8866 8854 8822 8789 8773 8775 8775 8760 8737
303 8737 8725 8724 8724 8709 8682 8657 8641 8633 8626 8612 8587 8547 8498 8454 8427 8415 8409 8399 8377 8343 8301 8266 8250 8248 8248 8246 8247 8249 8240 8221 8203 8195 8188 8171 8143 8109 8065 8009 7945 7884 7829
298 7829 7776 7727 7689 7664 7648 7639 7635 7630 7613 7576 7524 7472 7433 7411 7388 7344 7280 7221 7186 7165 7139 7115 7109 7114 7099 7053 6994 6944 6902 6861 6827 6805 6790 6771 6751 6740 6731 6712
293 6712 6683 6660 6654 6656 6656 6645 6614 6560 6499 6456 6445 6454 6460 6456 6451 6445 6431 6409 6394 6391 6392 6378 6347 6306 6264 6222 6179 6139 6105 6075 6046 6021 6010 6011 6012 6000 5977 5955 5945 5944 5941 5923
288 5923 5889 5852 5831 5833 5844 5843 5822 5795 5775 5764 5750 5729 5708 5693 5683 5668 5638 5597 5564 5556 5574 5595 5597 5582 5567 5570 5587 5606 5618 5621 5608 5577 5537 5506 5494 5489 5479 5469
284E469%PJj3j8k1k8l8m2l6k9k1j0%%j3k6l1l3l7l5k5j1mjLOjj2j8j8k0k4k1j2llj0j3rKJ0
278D862R%j0j2mMPPPQKoj9l4m4m0j8NJ8J2%qpJJ1J7J2nk5l8l5j9npk3k8j1J4K0OrnNLj1k1
273D586j9j0nnoj0j3j2oLKpj2j0mqk3l7l8k8j5nMJ0J1Mrj7j2MJ6J1%MK1L4K5Nmqj8l6m5l4
267D284j2MQOLNJ5K5K9J7Jrj3k0k8l1k6k3k9m0m5l4j5LPNOJ1J3Kj3k6l2k8k0j1p%QJ1KpkR
262D003Jk7m6l5pJ3K0K6K9J1k2m9n5m3k3nLjj3j8j7j7k3j9mJ3K4K4J9Nj1j9j8k0k9l5k8j6
257C591qn%%pj0oLQJ2J7J8J3QQmk5l4j8M%k1k9j5lj4k6k2qpj8k7k6j5kJ3J8PormJNPJ1Olp
252C371lKmk3m0m3l0j1LJrj2lJ2J4ml2m3l2j0kmrrm%LMqj9j9mLnj9j9pj%KJ1J3Opj6j8j5m
246B957J0K2K2J2ok3k9k3j4j0j1qKJ1J3J0%j1j9j8j7k7m1m6l4j4QJ9J4j0k5j1K2L5J2j9k3
$$ plain form
284 5469 5469 5476 5477 5464 5446 5425 5397 5359 5317 5281 5252 5231 5221 5221 5221 5208 5182 5151 5118 5081 5046 5021 5010 5006 5005 5008 5014 5013 5001 4983 4965 4945 4921 4900 4888 4885 4882 4872 4859 4850 4852 4862
278 4862 4871 4871 4861 4849 4845 4849 4856 4863 4870 4878 4880 4874 4855 4821 4777 4737 4719 4724 4742 4754 4754 4746 4739 4740 4751 4768 4780 4775 4750 4712 4677 4658 4653 4646 4623 4595 4584 4598 4618 4624 4615 4610 4615 4618 4607 4586
273 4586 4567 4557 4552 4547 4541 4531 4518 4506 4500 4503 4505 4498 4486 4476 4472 4464 4441 4404 4366 4338 4323 4318 4322 4332 4343 4347 4338 4321 4309 4313 4329 4340 4340 4344 4365 4399 4424 4429 4425 4417 4399 4363 4318 4284
267 4284 4272 4276 4284 4290 4293 4298 4313 4338 4367 4384 4385 4376 4363 4343 4315 4284 4258 4235 4206 4166 4121 4087 4072 4075 4082 4087 4093 4104 4117 4119 4106 4080 4048 4020 4000 3989 3982 3982 3990 4001 4003 3996 3994 4003
262 4003 4004 3977 3931 3896 3889 3902 3922 3948 3977 3988 3966 3917 3862 3819 3796 3791 3794 3793 3780 3762 3745 3728 3705 3686 3682 3695 3719 3743 3762 3767 3756 3737 3719 3699 3670 3635 3607 3591
257 3591 3583 3578 3578 3578 3571 3561 3555 3558 3566 3578 3595 3613 3626 3634 3642 3638 3613 3579 3561 3565 3565 3544 3515 3500 3497 3483 3457 3435 3427 3420 3402 3375 3349 3334 3332 3345 3363 3370 3364 3355 3351 3352 3357 3364 3375 3381 3378 3371
252 3371 3368 3370 3366 3343 3303 3260 3230 3219 3222 3223 3214 3202 3199 3211 3225 3221 3189 3146 3114 3104 3102 3098 3089 3080 3076 3076 3079 3083 3075 3056 3037 3033 3036 3031 3012 2993 2986 2985 2985 2987 2998 3011 3017 3010 2994 2976 2961 2957
246 2957 2967 2989 3011 3023 3017 2994 2965 2942 2928 2918 2907 2899 2901 2912 2925 2935 2935 2924 2905 2887 2870 2843 2802 2756 2722 2708 2716 2735 2749 2739 2714 2703 2725 2760 2772 2753 2730
241B730nMmj0l%lmQK2K4J6Oj1l0l6k5pnj6k5k1j2polJNM%nmKRPnj5j5rlKJ2K3K1Mj6k4k3k8
235B520l8l7j4J4K6J8QOLlJJ3J5mk9l6k4j0qj3j1KJ5J8Prj4pJmj4j7j5j8k2j8nKmj1nMNJM
230B293OMJJ4L4L5Qk3l4k4j5j7j8rMPkj0oMQMpj2j3j3j3j0qmmrr%J7K5J8N%NJ0NKOJ3J5J7
224B300J9J6Okjkj3k3j2J2K1Pj3k1j9k0k3j9r%MQJ4K0K0J2Kqj7k3k6k2j6j2j1oQK4L4L7L7
219B283L2J0k0m2l8j5NOrk4k8j9rJPJ3J0MJJ0J8J4jj4k0k4k8j8NK5K6J6QQPLnj5k3k5j9r%
214B107PJ3J2OLLok0k6j2OQnj8k1j5mJ2J8J3QPKj6l4k9j1qk2k0NL3L9L2L1K8Pk2k8j0J1J6
209B100J2ROlj8k7l1l3l4k0RM2N4L9J0j1j9k3k7k6j3LJ3Qoj3qKMklJ0K5K4Mj6k8l2l3k4lJ3
$$ plain form
241 2730 2725 2729 2725 2715 2712 2712 2709 2705 2713 2735 2759 2775 2781 2770 2740 2704 2679 2672 2667 2651 2626 2605 2593 2586 2580 2577 2578 2583 2587 2587 2582 2578 2580 2589 2596 2591 2576 2561 2552 2549 2551 2563 2586 2607 2611 2595 2571 2548 2520
235 2520 2482 2445 2431 2445 2471 2489 2497 2503 2506 2503 2504 2517 2532 2528 2499 2463 2439 2429 2421 2408 2397 2399 2414 2432 2439 2430 2416 2409 2410 2406 2392 2375 2360 2342 2320 2302 2297 2299 2295 2284 2279 2283 2288 2289 2293
230 2293 2299 2303 2304 2318 2352 2387 2395 2372 2338 2314 2299 2282 2264 2255 2259 2266 2264 2254 2248 2252 2260 2264 2257 2245 2232 2219 2206 2196 2188 2184 2180 2171 2162 2162 2179 2204 2222 2227 2227 2232 2242 2247 2249 2255 2268 2283 2300
224 2300 2319 2335 2341 2339 2338 2336 2323 2300 2288 2300 2321 2328 2315 2294 2275 2255 2232 2213 2204 2204 2208 2216 2230 2250 2270 2282 2284 2276 2259 2236 2210 2188 2172 2160 2149 2143 2151 2175 2209 2246 2283
219 2283 2315 2325 2305 2263 2225 2210 2215 2221 2212 2188 2160 2141 2132 2133 2140 2153 2163 2167 2168 2178 2196 2210 2209 2195 2175 2151 2123 2105 2110 2135 2161 2177 2185 2193 2200 2203 2198 2183 2160 2135 2116 2107 2107
214 2107 2114 2127 2139 2145 2148 2151 2145 2125 2099 2087 2093 2101 2096 2078 2057 2042 2038 2050 2068 2081 2089 2096 2098 2082 2048 2019 2008 2000 1978 1958 1963 1996 2035 2067 2098 2126 2133 2111 2083 2073 2084 2100
209 2100 2112 2121 2127 2124 2106 2079 2048 2015 1981 1961 1970 2012 2066 2105 2115 2104 2085 2062 2035 2009 1996 1999 2012 2020 2014 2001 1993 1995 1999 1997 1994 2004 2029 2053 2057 2041 2013 1981 1948 1924 1921 1934
$$ [...]
-1604E30
##END=	
##END=	
