##TITLE=	47DYIv2+Q+qebtAX2szCLg.112.ser
TM-VI-121 Zr+PMB-prraz. hmbc

##JCAMP-DX=	6.0	$$ MestReNova 14.3.0-30573
##DATA TYPE=	LINK
##BLOCK_ID=	1
##BLOCKS=	2    
##ORIGIN=	Mestrelab Research S.L.
##OWNER=	hrzepa
##$MNOVA/LINK_BLOCK_TYPE=	ITEM	$$ NMR Spectrum
##$MNOVA/ITEM/POLYGON=	(XY..XY)
5321,5835
8722,5835
8722,8208
5321,8208
5321,5835
##$MNOVA/ITEM/Z=	0
##$MNOVA/ITEM/ANGLE=	0
##TITLE=	47DYIv2+Q+qebtAX2szCLg.112.ser
##JCAMP-DX=	6.0	$$ MestReNova 14.3.0-30573
##BLOCK_ID=	2
##DATA TYPE=	MNOVA NMR VIEW DATA
##DATA CLASS=	MNOVA VIEW DATA
##$MNOVA/2D/THRESHOLD=	6.974483489990234375
##$MNOVA/ITEM/ZOOM/X=	-0.47501081208716700033,	14.504330000039219684
##$MNOVA/ITEM/ZOOM/Y=	-9.5107036222489718114,	249.98529999918474687
##END=	
##TITLE=	47DYIv2+Q+qebtAX2szCLg.112.ser
##JCAMP-DX=	6.0	$$ MestReNova 14.3.0-30573
##BLOCK_ID=	3
##DATA TYPE=	nD NMR SPECTRUM
##DATA CLASS=	NTUPLES
##NUMDIM=	2
##ORIGIN=	Bruker BioSpin GmbH
##OWNER=	nmr
##.OBSERVE FREQUENCY=	400.41280287000000726
##.OBSERVE NUCLEUS=	^1H
##.SOLVENT NAME=	Acetone
##.PULSE SEQUENCE=	hmbcgplpndqf
##LONGDATE=	2021/10/21 00:42:19.000
##.ACQUISITIONMODE=	SIMULTANEOUS (DQD)
##$ORIGINAL FORMAT=	Bruker XWIN-NMR
##$MNOVA/SCALES_VERSION=	9
##$PARAMETER FILE=	(acqu2s, ASCII, /private/var/folders/f6/rjf_tdyn2v98c5c0wvkgn4s80000gn/T/47DYIv2+Q+qebtAX2szCLg/112/acqu2s, 0)
$$ ##TITLE= Parameter file, TOPSPIN		Version 3.2
$$ ##JCAMPDX= 5.0
$$ ##DATATYPE= Parameter Values
$$ ##NPOINTS= 129	$$ modification sequence number
$$ ##ORIGIN= Bruker BioSpin GmbH
$$ ##OWNER= nmr
$$ $$ 2021-10-21 01:01:55.504 +0100  nmr@CZC10666PP
$$ $$ /opt/topspin/data/agmb/nmr/Oct20-2021/112/acqu2s
$$ $$ process /opt/topspin3.2/prog/mod/go
$$ ##$ACQT0= 0
$$ ##$BF1= 100.683175
$$ ##$FnMODE= 1
$$ ##$NUC1= <13C>
$$ ##$NusJSP= 0
$$ ##$NusT2= 1
$$ ##$NusTD= 128
$$ ##$O1= 12080.308799824
$$ ##$SFO1= 100.6952553088
$$ ##$SW= 259.972631192251
$$ ##$SW_h= 26178.0104712042
$$ ##$TD= 128
$$ ##END=
$$ 
##$PARAMETER FILE=	(acqus, ASCII, /private/var/folders/f6/rjf_tdyn2v98c5c0wvkgn4s80000gn/T/47DYIv2+Q+qebtAX2szCLg/112/acqus, 0)
$$ ##TITLE= Parameter file, TOPSPIN		Version 3.2
$$ ##JCAMPDX= 5.0
$$ ##DATATYPE= Parameter Values
$$ ##NPOINTS= 12	$$ modification sequence number
$$ ##ORIGIN= Bruker BioSpin GmbH
$$ ##OWNER= nmr
$$ $$ 2021-10-21 01:01:59.923 +0100  nmr@CZC10666PP
$$ $$ /opt/topspin/data/agmb/nmr/Oct20-2021/112/acqus
$$ $$ process /opt/topspin3.2/prog/mod/shimcntl
$$ ##$ACQT0= 1000000
$$ ##$AMP= (0..31)
$$ 100 100 100 100 100 100 100 100 100 100 100 100 100 100 100 100 100 100
$$ 100 100 100 100 100 100 100 100 100 100 100 100 100 100
$$ ##$AMPCOIL= (0..19)
$$ 0 0 0 0 0 0 0 0 0 0 0 0 0 0 0 0 0 0 0 0
$$ ##$ANAVPT= -1
$$ ##$AQSEQ= 0
$$ ##$AQ_mod= 3
$$ ##$AUNM= <au_zg>
$$ ##$AUTOPOS= <58 >
$$ ##$BF1= 400.41
$$ ##$BF2= 100.683175
$$ ##$BF3= 400.41
$$ ##$BF4= 400.41
$$ ##$BF5= 400.41
$$ ##$BF6= 400.41
$$ ##$BF7= 400.41
$$ ##$BF8= 400.41
$$ ##$BYTORDA= 0
$$ ##$CAGPARS= (0..11)
$$ 0 0 0 0 0 0 0 0 0 0 0 0
$$ ##$CFDGTYP= 0
$$ ##$CFRGTYP= 9
$$ [...]
$$ 0 0 0 0
$$ ##$ShimPowMaxUC= (0..63)
$$ 130000 130000 130000 130000 130000 130000 130000 130000 130000 130000 130000
$$ 130000 130000 130000 130000 130000 130000 130000 130000 130000 0 0 0 0
$$ 0 0 0 0 0 0 0 0 0 0 0 0 0 0 0 0 0 0 0 0 0 0 0 0 0 0 0 0 0 0 0 0 0 0 0 0
$$ 0 0 0 0
$$ ##$ShimPowMaxUG= (0..63)
$$ 524287 524287 524287 524287 524287 524287 524287 524287 524287 524287 524287
$$ 524287 524287 524287 524287 524287 524287 524287 524287 524287 0 0 0 0
$$ 0 0 0 0 0 0 0 0 0 0 0 0 0 0 0 0 0 0 0 0 0 0 0 0 0 0 0 0 0 0 0 0 0 0 0 0
$$ 0 0 0 0
$$ ##$ShimPowRcbType= 3
$$ ##$ShimPowRes= (0..63)
$$ 1e-20 1e-20 1e-20 1e-20 1e-20 1e-20 1e-20 1e-20 1e-20 1e-20 1e-20 1e-20
$$ 1e-20 1e-20 1e-20 1e-20 1e-20 1e-20 1e-20 1e-20 0 0 0 0 0 0 0 0 0 0 0 0
$$ 0 0 0 0 0 0 0 0 0 0 0 0 0 0 0 0 0 0 0 0 0 0 0 0 0 0 0 0 0 0 0 0
$$ ##$ShimPowRng0= (0..63)
$$ 1 1 1 1 1 1 1 1 1 1 1 1 1 1 1 1 1 1 1 1 0 0 0 0 0 0 0 0 0 0 0 0 0 0 0 0
$$ 0 0 0 0 0 0 0 0 0 0 0 0 0 0 0 0 0 0 0 0 0 0 0 0 0 0 0 0
$$ ##$ShimPowRng1= (0..63)
$$ 1 1 1 1 1 1 1 1 1 1 1 1 1 1 1 1 1 1 1 1 0 0 0 0 0 0 0 0 0 0 0 0 0 0 0 0
$$ 0 0 0 0 0 0 0 0 0 0 0 0 0 0 0 0 0 0 0 0 0 0 0 0 0 0 0 0
$$ ##$ShimPowRng2= (0..63)
$$ 1 1 1 1 1 1 1 1 1 1 1 1 1 1 1 1 1 1 1 1 0 0 0 0 0 0 0 0 0 0 0 0 0 0 0 0
$$ 0 0 0 0 0 0 0 0 0 0 0 0 0 0 0 0 0 0 0 0 0 0 0 0 0 0 0 0
$$ ##$ShimPowRng3= (0..63)
$$ 1 1 1 1 1 1 1 1 1 1 1 1 1 1 1 1 1 1 1 1 0 0 0 0 0 0 0 0 0 0 0 0 0 0 0 0
$$ 0 0 0 0 0 0 0 0 0 0 0 0 0 0 0 0 0 0 0 0 0 0 0 0 0 0 0 0
$$ ##$ShimSysFunc= (0..63)
$$ 1 2 3 4 5 7 9 11 15 16 8 10 12 14 6 17 13 18 19 20 0 0 0 0 0 0 0 0 0 0
$$ 0 0 0 0 0 0 0 0 0 0 0 0 0 0 0 0 0 0 0 0 0 0 0 0 0 0 0 0 0 0 0 0 0 0
$$ ##$ShimSysMatrix= 0
$$ ##$ShimSysType= 1
$$ ##$TFXNUM= 0
$$ ##$TRIPLO2= 0
$$ ##$VTU= 2
$$ ##$VTUETH= <149.236.99.20>
$$ ##$VTUTY= <no>
$$ ##$WBREFAM= (0..15)
$$ 135 116 100 100 100 100 100 100 100 100 100 100 100 100 100 100
$$ ##$WBREFLM= (0..15)
$$ 0 0 0 0 0 0 0 0 0 0 0 0 0 0 0 0
$$ ##$WBREFPH= (0..15)
$$ 71.66 -68.25 0 0 0 0 0 0 0 0 0 0 0 0 0 0
$$ ##$WBSGU= (0..15)
$$ 0 0 0 0 0 0 0 0 0 0 0 0 0 0 0 0
$$ ##$XFAC= 2
$$ ##END=
$$ 
##$DECIM=	3328
##$DSPFVS=	20
##.ACQUISITIONSCHEME=	NOT PHASESENSITIVE
##NTUPLES=	nD NMR SPECTRUM
##VAR_NAME=	FREQUENCY1,	FREQUENCY2,	SPECTRUM
##SYMBOL=	F1,	F2,	Y
##.NUCLEUS=	13C,	1H
##.OBSERVE FREQUENCY=	100.69525530880000019,	400.41280287000000726
##VAR_TYPE=	INDEPENDENT,	INDEPENDENT,	DEPENDENT
##VAR_FORM=	AFFN,	AFFN,	ASDF
##VAR_DIM=	512,	512,	262144
##UNITS=	HZ,	HZ,	ARBITRARY UNITS
##FIRST=	25169.313707327481097,	5807.6787752999953227,	0.19020199775695800781
##LAST=	-957.56783717514929322,	-190.19907926730809322,	0.090333260595798492432
##MIN=	-957.56783717514929322,	-190.19907926730809322,	0.00061720557278022170067
##MAX=	25169.313707327481097,	5807.6787752999953227,	168.38958740234375
##FACTOR=	1,	1,	0.0030025428657735274939
##PAGE=	F1=25169.3
##FIRST=	25169.313707327481097,	5807.6787752999953227,	0.19020199775695800781
##DATA TABLE=	(F2++(Y..Y)), PROFILE
$$ [...]
##PAGE=	F1=2979.36
##FIRST=	25169.313707327481097,	5807.6787752999953227,	0.25774303078651428223
##DATA TABLE=	(F2++(Y..Y)), PROFILE
1641A54j6k5J38m9j37N4l1Q1p9Q7P2j12N6q1l7JmL1K3o0j9N5J20o2M7q8L4kk9Q6q5L4j30O2
$$ 154 138 113 251 202 65 119 88 169 90 177 249 137 193 112 75 76 72 103 126 66 47 102 222 160 207 119 153 151 122 208 123 157 27 89
1242H9m7M1j4J8J3L9R3j67k4R5q9J13Jj13L3%l3L5k7k7J83J9j89KJ1L4L8m1m8R3P2j19J31
$$ 89 42 83 69 87 100 139 232 65 41 136 47 160 161 48 81 81 48 83 56 29 212 231 42 44 55 89 127 86 38 131 203 84 215
854B15nM3O1r3J9k3j14p3J07L8l4pk0n7J10J9k2%Q0o2q3K8m2M5P8j01lP4k5M7k0R4q7j9J3
$$ 215 210 253 314 221 240 217 103 30 137 175 141 134 114 57 167 186 164 164 244 182 99 127 85 130 208 107 104 178 153 200 180 274 187 168 181
444A81j21M5m2O1J2m6O2K1r2MJ28q5mLJ48j96O2L1n5J7q0P7p7K1OJ80j89k7K8Pl4J14L2n6
$$ 181 60 105 63 124 136 90 152 173 81 85 213 128 124 127 275 79 141 172 117 134 54 131 54 75 81 261 72 45 73 80 46 160 192 136
45A36J01j37J92J3r8QjJ3j72km7Q3J6k3J29q3l4Ln7J9
$$ 136 237 100 292 305 207 215 214 227 55 53 6 89 105 82 211 128 94 97 40 59
-190E9
##PAGE=	F1=2877.1
##FIRST=	25169.313707327481097,	5807.6787752999953227,	0.11009088903665542603
##DATA TABLE=	(F2++(Y..Y)), PROFILE
5808A24K5r2nJ2J39R6k53L6M3N6n7j2K6o1L6Q0j42Q1R2n6j52J22j9R6L3n0j8%j20O5J6l4M3
$$ 124 149 57 52 64 203 299 46 82 125 181 124 112 138 77 113 193 51 132 224 168 16 138 119 215 248 198 180 180 60 125 141 107 150
5420A50L5J53j36j42R2Jj26O9o4R6L3j18L8M7J3Lp0n3J46m5PK5n2L0N7k4K1J4Lk7l1J3k0J84
$$ 150 185 338 202 60 152 153 27 96 32 128 161 43 81 128 141 144 74 21 167 122 129 154 102 132 189 165 186 200 203 176 145 158 138 322
5021C22j89j08J87k8p4jQ2j15K6kM5l2R6l6p4K4o7P9o6M6m8R5o6L9q4N6O5r3M6j00K10l9m8
$$ 322 133 25 212 184 110 109 191 76 102 100 145 113 209 173 99 123 56 135 69 115 67 162 96 135 51 107 172 79 125 25 235 196 148
4634A48J39q8j03L8j4N9l7j00P9L9Nj6n6J3M7p9k2J08l8jp7J6J62J4j38K2L4N5Oj11m4J39
$$ 148 287 199 96 134 120 179 142 42 121 160 165 149 93 106 153 74 52 160 122 121 44 60 222 236 98 120 154 209 215 104 60 199
4258A99L8j26p5K13m1j32R1l8n3J11l1j04Q4Kn0o5Q7n6J13m8J6J12j4k08K09j59N5o3m7J46
$$ 199 237 111 36 249 208 76 167 129 76 187 156 52 136 138 88 23 110 54 167 119 135 247 233 25 234 75 130 67 20 166
3906A66m7O7J0j11J12R2q0j73J89O4k23J36p8N5L0o9p3Q1L8n9j2pl0K6N0k6R9j12Q1O5j30
$$ 166 119 186 196 85 197 289 209 36 225 289 66 202 124 179 209 140 67 148 186 127 115 108 78 104 154 128 227 115 196 261 131
3542A31L1R9Pj27O8N8r0p2l9J58Q6j46p8O0J3r4K2O0n9K6o2J18L4p7j1l5Q1r9J26j59J40r1
$$ 131 162 261 268 141 209 267 177 105 66 224 310 164 86 146 159 65 87 147 88 114 52 170 204 127 116 81 162 63 189 30 170 79
3167G9J9N0m7n9R5n6k6P4L1J52k06J06j81P0l1R2l1p9R1n0J75N3k20R3j13K4L7qo3pM6J3N3
$$ 79 98 148 101 42 137 81 55 129 160 312 106 212 31 101 70 162 131 52 143 93 268 321 101 194 81 105 142 134 71 64 110 123 176
2779A76N0j35R7l1K6K2K1j0J78k75p4K48q6n5Q4j30K4m0l6J35n9j4o1R3K4j01P4P3o7N2r5
$$ 176 226 91 188 157 183 205 226 216 394 119 45 293 207 152 236 106 130 90 54 189 130 116 55 148 172 71 145 218 151 203 108
2416A08m5j4K0KJ43j1j8k8J3p7n8P1J93o5j68K7L9PK9l2j01j7J09M6m9J34k20j7Q6J01J8j14
$$ 108 63 49 69 71 214 203 185 157 170 93 35 106 299 234 66 93 132 139 168 136 35 18 127 173 124 258 38 21 107 208 226 112
2040A12J9M1L1n9L12r2l10J14m8o1O8p2L00j20j77J39J9J2q0q2n7L4R6P3q6M8j3o6M7n9J37
$$ 112 131 172 203 144 456 364 54 168 120 59 127 55 355 235 58 197 216 228 148 66 9 43 139 212 126 174 161 95 142 83 220
1676B20m0j34J58m3o6J51n6j41N7m9O6l4R3N3j16J11j20o0M1j9J6P4n3m2L5J33j00P2j05O6
$$ 220 180 46 204 161 95 246 190 49 106 57 123 89 182 235 119 230 110 50 91 72 88 162 109 67 102 235 135 207 102 168
1324A68M2o2Q6q5rj27J10l9KL6o8M7O7N2j63K5J02j08P6J7r7L7m8L1k7Pk0J13O9j70n3L4M5
$$ 168 210 148 234 149 140 13 123 84 86 122 54 101 168 220 57 82 184 76 152 169 72 109 61 92 65 72 52 165 234 64 11 45 90
937I0Q8q0k8P4R3j47J03K4K9M1l9j8q2n4o6J53K8l1k6n0jP1Qk0j8P5j8j01P0o9MP2j07PO7
$$ 90 178 98 70 144 237 90 193 217 246 287 248 230 148 94 28 181 209 178 152 102 101 172 180 160 142 217 199 98 168 99 103 175 68 75 142
526A42j9N4k3Q3q3k3K7r1RJ2J7L4k0K5K1p1l1J26n4K3p9J59j87Q7P2n5l0m7M0n5J1O5J49k49
$$ 142 123 177 154 237 154 131 158 67 76 88 105 139 119 144 165 94 63 189 135 158 79 238 51 138 210 155 125 78 118 63 74 139 288 39
127C9OL1O1j09P7P6l8J20j56J84K8o6n5n9J28j82l7k4O4L7l0Q7p1n2J7n4L5
$$ 39 45 76 137 28 105 181 143 263 107 291 319 253 198 139 267 85 48 24 88 125 95 182 111 59 76 22 57
-190E7
##PAGE=	F1=2774.84
##FIRST=	25169.313707327481097,	5807.6787752999953227,	0.11941400915384292603
##DATA TABLE=	(F2++(Y..Y)), PROFILE
5808A44Pj13N0o4J48Q9k06M7J0L3p3M7J7k2m3N5o8K8P9P6j85Q9J4L0N2n0o7O7j24k4R5j10
$$ 144 151 38 88 24 172 261 55 102 112 145 72 119 136 114 71 126 58 86 165 241 56 145 159 189 241 191 124 191 67 43 138 28
5432B8P8J9J94j38j11J10Jj19L6k1j3M5o4N6l5L5K7k4n1J07K0j4K5q2M4P9m6QrJ3m2j3Rl5
$$ 28 106 125 319 181 70 180 181 62 98 77 64 109 45 101 66 101 128 104 53 160 180 166 191 109 153 232 186 194 185 198 156 143 152 117
5033A17K08k06r1J90M7j08l8O5j05K3MM5o0R0M9r1n3n3J05j10J14q9J44j09K8p8P1J6j5O3
$$ 117 325 119 28 218 265 157 119 184 79 102 106 151 91 181 230 139 86 33 138 28 142 53 197 88 116 38 109 125 110 173
4681A73j19J73nj11J72j04m8K5j8jJ5q7K4R1k7J0n3j4M7l4l8R2p6N2j12K7J60L4j60P4L3l
$$ 173 54 227 222 111 283 179 131 156 138 137 152 65 89 180 153 163 110 96 143 109 71 163 87 139 27 54 214 248 88 162 195 192
4305A92L8j15n2J84P1j58j13J93o2j01P3J5q7J63o6j13J07qq8l5N0j8O3o8R5J14n1j72J56
$$ 192 230 115 63 247 318 160 47 240 178 77 150 165 78 241 175 62 169 161 73 38 88 70 133 65 160 274 223 51 207
3965B07o3jp5n0Q4m4J30pr7J28J06n0k23J96O7k49R1lR7n0rj02J23K2q3n2l3rK5k0J42L8j11
$$ 207 144 143 68 18 102 58 188 181 84 212 318 268 45 241 308 59 150 147 244 194 185 83 206 228 145 93 60 51 76 56 198 236 125
3578A25L9O6j10J3J44j5j67J01L2o7m8k8J16P7j58m1O0N0j03L2M3j12M1kR4M0p4Nm6P7j32
$$ 125 164 230 120 133 277 262 95 196 228 161 113 85 201 278 120 79 139 189 86 118 161 49 90 88 182 222 148 153 107 184 52
3214E2J54j09J22j31J9no2O0N80L01o73k33K0K24k42K38k64J09r2N8pj7Rm3N01O37q17j81
$$ 52 206 97 219 88 107 102 40 100 680 981 308 75 95 319 77 315 51 160 68 126 119 102 111 68 569 1206 389 208
2885B08q8L9K9o2n0j7Q6JR7K1k00J28o4L8J2l3J30J29k54o8K31j21n0J00r2n6j9J3P1o8L2
$$ 208 120 159 188 126 76 59 145 146 243 264 64 192 128 166 178 145 275 404 150 82 313 192 142 242 150 94 75 88 159 91 123
2521A23m3O7Op8N8J1J2J02j30j10O3L8o2J83Mm3m0M1r1n6M1J52k5j45RL0QkJ4q1JN3J7L3R5
$$ 123 80 147 153 75 133 144 156 258 128 18 81 119 57 240 244 201 161 202 111 55 96 248 223 78 87 117 125 123 137 56 57 110 127 160 255
2110B55k35N2M4J18k4q6%k0O6Lj33J3l2J38mj20Q9m8K32j04j28J76l1%n9q7k8mP4O0q4J16
$$ 255 20 72 116 234 210 124 124 104 170 173 40 53 21 159 155 35 124 76 308 204 76 252 221 221 162 75 47 43 117 177 93 209
1735B09j8n7L4j15J66o4j11K07p7r7J45n5j45P4l5P1k3P7K9q9J20j11j16P0k5L9R1n2n7JJ43
$$ 209 191 134 168 53 219 155 44 251 174 77 222 167 22 96 61 132 109 186 215 126 246 135 19 89 64 103 194 142 85 86 229
1371B29j31R5j06R4P7r3Q9q2m2q3J15k9n5J05p4j2Q6K8j56N6J13j06J7L4p1K1n3N9p0L3j3
$$ 229 98 193 87 181 258 165 254 172 130 47 162 133 78 183 109 97 183 211 55 111 224 118 135 169 98 119 66 125 55 88 75
1007G5O9R7j33r3M7M0J10o8k9M0R7j64Q1N0QJ7J2n8j34J8p0J85K0k9l4p7O9K7%k7l2P6K4j00
$$ 75 144 241 108 15 62 102 212 144 115 155 252 88 169 219 227 244 256 198 64 82 12 197 217 188 154 77 146 173 173 146 114 190 214 114
608A14P7o8m0N0p4%L7j5O6j5N6o8j3K3n1k0O0l9O2J9k8M7o5p5J30m3L7r3J34j34O1J03n7o5
$$ 114 191 123 83 133 59 59 96 81 147 132 188 120 107 130 79 59 119 80 142 161 133 180 115 40 170 127 164 71 205 71 132 235 178 113
209A13lJ3n4oJ26J27k22j1K1R6j83J4J31k5J18j64J60N2j6j23o5K09j74r5J8O1K4j0L2p5k0
$$ 113 110 123 69 63 189 316 94 83 104 200 17 31 162 137 255 91 251 303 287 164 99 308 134 39 57 118 142 132 164 89 69
-155F9K2p1K8
$$ 69 91 20 48
-190D8
##PAGE=	F1=2672.59
##FIRST=	25169.313707327481097,	5807.6787752999953227,	0.27780157327651977539
##DATA TABLE=	(F2++(Y..Y)), PROFILE
5808A54k6n2P9j38J17Q1j53O4l9Jp7J23k1K6j9p5K1K1M2J66j75J3N5k0M2k3r4J07j17l6P7
$$ 154 128 76 155 17 134 215 62 126 87 88 11 134 113 139 120 45 66 87 129 295 120 133 188 168 210 187 93 200 83 47 124
5444A24n3k3K6K10j40o2J15Qj11MK0m8j6JO4r1L5L1K0l9Q3O2m6J6q9N4J13o7k8j6L7o1kpj6
$$ 124 71 48 74 284 144 82 197 205 94 98 118 70 54 55 119 28 63 94 114 75 158 220 174 190 101 155 268 201 173 157 194 133 131 124 108
5033A08K04k21l9J47J33j29q0N2q0jj2N8l1N0J20j00j13MO6j15J45j30J84j20j4o1Q9l7O1
$$ 108 312 91 52 199 332 203 123 175 95 94 82 140 109 159 279 179 66 70 136 21 166 36 220 100 86 25 114 77 138
4693A38J03j40R8J5j34J89j08KJ6%q0O2n8n0J60k3j6m6l6K2Pl2O1j02R0j36N7J29N5j67J03
$$ 138 241 101 199 214 80 269 161 163 179 179 99 161 103 53 213 190 174 128 92 114 121 89 150 48 138 2 59 188 243 76 179
4329A79M0n3N3j04o0K20P8j61j10J39p1p6M5Q0j34K08p5j07J23m0j16l%L5K9n1J05J14q2j20
$$ 179 219 166 219 115 55 275 353 192 82 221 150 74 119 199 65 273 198 91 214 174 58 55 55 90 119 68 173 287 205 85
3977H5R3J8l7q9k3L1n2J53j5r0J50R6pk36J67O3k45R1Q3N7j33N1j09J49Or6q6n6NK6OK08l3
$$ 85 178 196 159 70 47 78 26 179 164 74 224 320 313 77 244 307 62 153 236 293 160 211 102 251 257 161 75 19 24 50 56 264 231
3589B31j06j0P2o1m7K05o3j78J23J0l6j4l2Q7N5j55MM2R2j10L1K4j57O6M1P9L4n7J4o9R3j39
$$ 231 125 115 187 126 79 284 221 43 166 176 140 126 94 181 236 81 85 127 219 109 140 164 7 73 114 193 227 170 184 115 208 69
3214F9J47n5Q5j47K8Jj06J77J210Q72j598n67n2K52k70L48l35J79j50OL1K7o8J49R95J285
$$ 69 216 161 246 99 127 128 22 199 1409 2281 683 116 64 316 46 394 59 238 88 94 125 152 84 233 1228 2513
2909B513j709n30j08N8lj05j9n5J30mJ41j7k52J39r0N7k0J7J91N9k28m6K12j44o0R3j3j48
$$ 2513 804 274 166 224 221 116 97 42 172 168 309 292 40 179 89 146 126 143 334 393 165 119 331 187 127 220 207 59
2580E9J8N0j2p1P9j8L7j8n1O3j2N9J13j45q2Q6Mj04K09J0p2m0N8j00j9j7J11%j10pJ8J8m0
$$ 59 77 127 115 44 123 105 142 124 73 136 124 183 296 151 69 155 159 55 264 274 202 162 220 120 101 84 195 195 85 78 96 114 74
2193G4O5n8OL0pR0N1k19Q5rJ36n2o6pm8Q3J12K72j10l46N7M4j49N9J7J28m5q3J77q9nm2o5
$$ 74 139 81 87 117 110 200 251 32 117 108 244 192 126 119 71 154 266 538 428 82 139 183 34 93 110 238 193 110 287 198 193 151 86
1805H6J3m9N1M0p8J79k1n9J3j54J84r1p3K36j01j13J29n5j20P1kR8m0M0Om3R6n5j46L1j8R7
$$ 86 99 50 101 141 63 242 221 162 175 21 205 114 41 277 176 63 192 137 17 88 86 184 144 184 190 147 243 188 42 73 55 152
1430A52O4o0o4l5J49j52J14r9J23Q3j11J00p8n9n4J29k1j16J72n4r1Q6K7j46O0J28q5n4M4
$$ 152 216 156 92 57 206 54 168 69 192 275 164 264 186 127 73 202 181 65 237 183 92 178 205 59 119 247 162 108 152
1089A52l4j3l2O6r2L6J4N7R8j02j22P8J0J04l6n4K7R2j69P5O4k0kN0r3j29M3l1J41J6k9k5
$$ 152 118 105 73 139 47 83 97 154 252 150 28 106 116 220 184 130 157 249 80 155 219 199 197 247 154 25 68 37 178 194 165 140
714A40p2J22j9ol9l5P7N7p5L6m3o0J2mNl9J2N0mK2m4L1nl2MM8q1Q1M5n5Q3q5r4J23n5M6n9
$$ 140 68 190 171 165 126 91 168 225 150 186 143 83 95 91 96 57 69 119 115 137 93 124 119 87 91 139 58 139 184 129 212 127 33 156 101 147 88
279H8R2o8K7J00o3p0J7Lm4n2J86J18j75m2J9J05k19K3J13m4J03j58J22Q8L9j90K5J96j56j35
$$ 88 180 112 139 239 176 106 123 126 82 30 216 334 159 117 136 241 22 45 158 114 217 59 181 269 308 118 143 339 183 48
-73D8M4N6LJ7k0q8M6Qq1N
$$ 48 92 148 151 168 148 60 106 114 33 38
-190C8
##PAGE=	F1=2570.33
##FIRST=	25169.313707327481097,	5807.6787752999953227,	0.28836709260940551758
##DATA TABLE=	(F2++(Y..Y)), PROFILE
5808A56p0M5P4j85P7P7r8O9q1m7L9J03m9L6M6j49K2P1K2J63j52o4R8m2QK3r4J07j04j8J6K7
$$ 156 86 131 205 20 97 174 76 145 64 17 56 159 110 146 192 43 65 136 158 321 169 105 203 161 169 192 98 205 101 83 99 126
5432A26j08L7J77j42MR7J8r9j7N5k7q8K9O6o5k7K9M5l0Q1O2p6Mp2O4J44q2p5lN9p5J3m3L2
$$ 126 18 55 232 90 94 191 209 110 93 148 121 33 62 128 63 36 65 110 80 161 223 147 151 79 143 287 205 130 127 186 111 124 81 113
5033A13J72k25K2Q6K04j37j13M1m4k5n0O8L7J1J50r5j50L6K7n6J15j49J84r2q0k7J04m0Q3
$$ 113 285 60 82 168 372 235 122 163 119 94 44 112 149 160 310 215 65 101 128 72 187 38 222 130 50 23 127 87 170
4693A70J37j59J1J9j22J87r8M3J1J7j36R6l0j30K30Qp8l2m8j6L6k3L2j07Q9p7M4P6O9j56J05
$$ 170 307 148 159 178 56 243 145 188 199 216 80 176 146 16 246 254 176 144 96 80 116 93 125 18 107 30 74 150 219 63 168
4329A68N2q8N1p8o9K37O2j34p8O9p9l0mJ42j61K21o4q6J20q3j05Ml2P4L2nL7J06r3r3O2P3
$$ 168 220 132 183 105 36 273 335 201 123 192 113 83 79 221 60 281 217 131 251 168 63 67 35 109 141 136 173 279 186 93 155 228
3953B28m6j16J3L1o6J16qr7J67P1L9k26J24N7k22J55J03j2k02R8q5J42kq2r8o1k0M3J14J56
$$ 228 182 66 79 110 44 160 152 55 222 293 332 106 230 287 65 220 323 311 109 207 122 264 262 180 82 21 1 44 158 314
3601C14r7r5n0O9Jj06K42j23j07P9j4RJ3l3P7K4j44L9L3J16j22K9Nj32N3M1P6K3l3J9j00J22
$$ 314 217 122 72 141 142 36 278 155 48 127 113 122 135 102 179 203 59 98 131 247 125 154 159 27 80 121 197 220 187 206 106 228
3225B28j22J11j0L3j33L4M7j48K57J897J523k622q41j46J96k88M17l75K66k21qM6N2j16L09
$$ 228 106 217 207 240 107 141 188 40 297 2194 3717 1095 254 108 304 16 433 58 324 103 95 141 193 77 386
2932C86J548J997k670q80j51N1l8j39M0j29J72KJ70n0k81J23q2O6k6J48J03Nj97k2J94j50
$$ 386 1934 3931 1261 381 230 281 243 104 144 15 187 189 359 309 28 151 69 135 109 257 360 365 168 146 340 190
2627A90q0O5O9j96N1O7r0l2O5J3J5m8k0Q1K4J9J08j29m4R4l7j24K20J4j06l1O2r3J6q0R9K
$$ 190 110 175 244 48 99 166 76 44 109 122 137 89 69 150 174 193 301 172 128 222 185 61 281 295 189 158 220 127 143 63 162 164
2251A64p5k2LM2n4Q5n9J1K5PJ13J0j96Q7n1J51o3o7mjM3J86N71k01o00NQ2j43qJ04K5K8n3
$$ 164 89 67 70 112 58 143 84 95 120 127 240 250 54 141 90 241 178 111 107 106 149 335 906 705 105 110 192 49 41 145 170 198 145
1864A45J48j45Kk4k3M2o9J8K7q0K22k3o5j4j12J49j36k0K33j10j09J13o9l4K0K3J24n2oj5
$$ 145 293 148 150 126 103 145 76 94 121 41 263 240 175 161 49 198 62 42 275 165 56 169 100 66 86 109 233 181 175 160
1512A60QO6Nj65k3J1J47J2p7o2n1J41j54J17q4J54N5j14J14p3o4l2J43j7j65K22l6j48O2M5
$$ 160 168 234 239 74 51 62 209 221 144 82 31 172 18 135 51 205 260 146 260 187 123 91 234 217 52 274 238 90 152 197
1160A97j28L5J46m9j23L9Pn0nO5r5K1N9N7Q7p6j63J27k4P7oq0L7P2j60Q6O9n8j1P8j20ln8
$$ 197 69 104 250 201 78 117 124 74 69 134 39 60 119 176 263 187 24 151 127 204 198 118 155 227 67 153 222 164 153 231 111 108 50
772E0M9L7J2l5%j1J24o1j0n5k3O8Q1l4l9J0p1j3M9Rq3M2MNj1j6Q1l7k0N6rj05Q6M3k9J04j15
$$ 50 99 136 148 113 113 102 226 165 155 100 77 145 226 192 153 163 92 79 128 137 54 96 100 105 94 78 159 122 102 158 149 44 130 173 144 248 133
338A33q7J00p3M4k3O0j4K1N9o8l8Ojro5J64J21j21o9K1Q7k13P2P5j06Q9j02L0J38Q6k53J48
$$ 133 46 146 73 117 94 154 140 161 220 152 114 120 119 110 45 209 330 209 140 161 248 35 107 182 76 165 63 93 231 317 64 212
-38B12J37j27j41M5M8k3M0o7j03J15j5p3k1
$$ 212 349 222 81 126 174 151 191 124 21 136 121 48 27
-190B7
##PAGE=	F1=2468.07
##FIRST=	25169.313707327481097,	5807.6787752999953227,	0.23310366272926330566
##DATA TABLE=	(F2++(Y..Y)), PROFILE
5808A54j19J47N5k03L7P6m9M7r1KN7P4k8k3J07j23n8J31K4R9j20j22J32m4l1P4r3Q8q1k6j7
$$ 154 35 182 237 34 71 147 98 145 54 56 113 187 159 136 243 120 62 193 217 316 196 74 206 162 131 205 112 200 119 93 76
5444G6P7p8mR9j40O9N5K6p2k6Q2mq8JN2k6o8M9J9l0R5K4q9j6l5P6J61q9j19L6N7p9N0q3P4
$$ 76 153 75 71 170 30 99 154 180 108 82 164 160 72 73 125 99 31 80 99 69 164 188 99 83 48 124 285 196 77 113 170 91 141 58 132
5033A32J21k07O9L2K30j29j34L5ql0o3K6J07KJ38p9j58L6j0MR1j29J31m1j02l1J16qP0J45
$$ 132 253 46 115 147 377 248 114 149 141 111 48 74 181 183 321 242 84 120 110 114 205 76 207 166 64 33 149 141 211 356
4681C56j71p0J5r3J67p7P5RK1j48J18j3j64K43M3j39j7n6m8N1qLq5L6J9L1PP7j05N7O7j08
$$ 356 185 115 130 37 204 127 202 211 232 84 202 189 25 268 311 172 155 99 51 102 94 97 12 48 67 98 105 182 77 134 201 93
4305I3L8m1p8K30K9q1l0mq3M0o4J78j39J82m3n4R6j22m2l1k3O9O0J3k7Q0p3r3O3J06l2j59
$$ 93 131 90 12 242 271 190 160 156 73 113 49 227 88 270 227 173 269 147 105 74 51 120 180 193 166 246 173 80 143 249 217 58
3930E8M8L7q6Q0Oj05J65M1P4j94P7N2j87K30Q4q2k41J15l5J01jl6r3o4k6L3J72J15j43p7n0
$$ 58 106 143 57 137 143 38 203 244 318 124 201 253 66 296 380 298 57 172 137 238 237 201 108 44 18 51 223 338 195 118 68
3566F8L4M9n3J57j68Qnm9O5K7j5P4Lj48N4Q0R3j43K3jj06N0NQ8J6j3K4j30J45r6P4J5j9r5
$$ 68 102 151 98 255 87 95 90 41 106 133 118 192 195 47 101 181 274 131 154 153 47 97 102 190 206 193 217 87 232 136 210 225 206 111
3167A11L4R2j94L28K501K116l533j056k35J16k58M05l72L43k99J2M5O0j19L97J995K639l472
$$ 111 145 237 43 371 2872 4988 1455 399 164 280 22 427 55 398 99 111 156 216 97 494 2489 5128 1656
2897A656j165j88J9n4j72J12j69J47K3J76o9k91R0j7M7n4J66O1Qj62j2J83j38j05K6J34j91
$$ 1656 491 303 322 268 96 208 39 186 209 385 316 25 115 98 145 91 257 318 326 164 152 335 197 92 118 252 61
2580F1P0P2j27J4rM9Rq4RR6O4n5R8q5rR1p2j24K22J7j44j5N2o4L4j34J32k4n2l5pO9k6N9q8
$$ 61 131 203 76 90 81 130 139 55 64 160 224 169 267 182 173 264 192 68 290 307 163 148 200 136 170 36 168 144 92 57 50 119 93 152 64
2169F4J9J9M6J28j7j86O4o6J62o8q3RM8k0J50N10j74n47L5P7j11qJ17m1P2k6J00j90K8lJ5
$$ 64 83 102 148 276 259 73 137 71 233 165 82 91 139 119 269 779 605 58 93 170 59 51 168 127 199 173 273 83 111 108 123
1805A23N5p5rK6r5K35j6p4m3k5R5j82N0J82j08r1J08r2N8k9K8J41n2n1l1N6M3L3j66n1M6J66
$$ 123 178 103 94 120 25 260 244 170 127 102 197 15 65 247 139 48 156 64 122 93 121 262 210 159 128 184 227 260 94 43 89 255
1430B55n0r8n4qR2r8N3k8J52Oj00J22p0o3rJ51k3j93K46k3j68J7P5j01kJ49mj56kM6p1J7N3
$$ 255 205 107 53 45 137 39 92 64 216 222 122 244 174 111 102 253 230 37 283 260 92 109 184 83 81 230 226 70 68 114 43 60 113
1042A13q3LJ06M9P8m8k08J64m5N4Pp9N4K2j43J14O5r7j1J01j39R8j47J42m4j6m4K4N5J01q6
$$ 113 30 33 139 188 266 218 10 174 129 183 190 111 165 187 44 158 223 126 115 216 77 175 28 170 126 110 66 90 145 246 160
678A60j4p2%M1Q9J4j17Q8r7j0P9nq2M1k9J7l3OJ00n8K0R2p8j09P3J3M9J00j33q5Q3p2QJL9
$$ 160 146 74 74 115 204 218 101 189 92 82 161 156 74 115 86 103 70 76 176 118 138 230 152 43 116 129 178 278 145 60 143 71 79 80 119
268A19K6M3Ko4J8k6j2L5k8N5J34o2r0K4N2j58P6P1j73Q6j0j11J98J12k80K31P1r5j22L5M4
$$ 119 145 188 190 126 144 118 106 141 113 168 302 240 150 174 226 68 144 215 42 128 118 7 205 317 37 268 339 244 122 157 201
-96B01n8N9j18n7J25m7m0m6
$$ 201 143 202 84 27 152 105 65 19
-190A9
##PAGE=	F1=2365.81
##FIRST=	25169.313707327481097,	5807.6787752999953227,	0.28988999128341674805
##DATA TABLE=	(F2++(Y..Y)), PROFILE
5808A51j24J90M2j77j1O5j9Jo2O3L6N2J7j10J47q5j08J74K1J6q2j33J29l2n3J15j05O7n2n8
$$ 151 27 217 259 82 71 136 117 118 56 119 155 207 224 114 261 176 68 242 263 279 197 64 193 161 108 223 118 185 133 75
5456G5mQ2l2l6K7n7M3mK4l2j8R7J0o9j2J5J1p7P7l5l7J14l7o4n1RQ9J54q7j27Q3J3p1J06p6
$$ 75 71 153 121 85 112 55 98 94 118 86 68 165 175 106 94 109 120 43 120 85 48 162 125 61 10 19 108 262 175 48 131 144 73 179 103
5045A03O3O5j65Q0oK08j09j37K7K7k1n1m8J55J8J00n5j38K2o0O8P2q7O3Kq2p5J32J5O6J25
$$ 103 166 231 66 146 140 348 239 102 129 156 135 84 36 191 209 309 254 116 138 78 146 218 131 194 196 114 39 171 186 252 377
4681C77j71j31K6o1J15n1R8RQj17J33rj61K04P5j78pp0n5M8K0k6o1J8P3J9o3P9j5l4P9j20
$$ 377 206 75 101 40 155 104 202 211 219 102 235 226 65 269 344 166 159 89 34 82 102 76 15 33 106 125 62 141 126 92 171 51
4305E1L4lo7J77j2j4J9o5n2Q5r6J63q9J16k3j6N5j40M2r0%L6R7J0o1L7j4j19Q3J24pk01O1
$$ 51 85 82 15 192 180 166 185 120 68 153 57 220 131 247 224 208 263 123 165 75 75 111 208 218 157 194 180 61 144 268 261 60 121
3918A21L4j02O3J6j02J42J2Q6j44L6M9j42K81M7j36k21P5K5L6RL4q6o4k5J1J83Q9j60n7j7
$$ 121 155 53 116 132 30 172 184 270 126 162 211 69 350 397 261 40 115 140 176 185 219 133 69 44 55 238 327 167 110 93
3566I3j5O4L3M9j50N5n9l6N7L4K0N8kj64N9J67L6j72PJ7r7N3n1J22J0pL5j36J36p1N7J0n2
$$ 93 78 142 175 224 74 129 70 34 91 125 145 203 201 37 96 263 299 127 134 151 54 107 56 178 188 181 216 80 216 145 202 212 160
3178A60m9K8J23k13L53K889K509m119j170l07L9j85L21l19L84l45J2N4N1q3M08K216L058l924
$$ 160 111 139 262 49 402 3291 5800 1681 511 204 243 58 379 60 444 99 111 165 216 133 541 2757 5815 1891
2897A891j320k09k0m0j93J61j82Q2N4J60o5k71K7O9L6j73P3J49N4j32k0J80j09j30j4J70j60
$$ 1891 571 362 342 302 109 270 88 170 224 384 319 48 75 144 180 7 80 229 283 151 131 311 202 72 58 228 68
2580F8R1P3j31K6p8Q0K3j23K5R9R0j32Q5j7J6P4r2j03K14J9j79KL7k2L3j66J80n2m6l4KO6
$$ 68 159 232 101 127 49 129 152 29 54 153 243 111 196 179 195 269 177 74 288 307 128 130 167 145 178 12 192 140 94 60 62 128
2204A28OK5j27L2JR2J45k6j87J8n4J73p9p8K2P1j04k2R2j7l0N1j2n4N6M2n1P2PM6k06Q1kK6
$$ 128 134 159 32 64 65 157 302 276 89 107 53 226 147 69 91 162 58 36 128 111 81 132 120 66 122 164 113 185 192 238 32 113 111 137
1805A37N6p5k1K9j10K13np7o2O9L8j42N2J02j06o3J09r4J30o9J3J43l9r3l5R4L3J8j44m2O7
$$ 137 193 118 97 126 16 229 224 147 85 154 192 50 102 204 98 35 144 50 180 111 124 267 228 135 100 194 227 245 101 59 126
1441A26J54j12j15m0O3M2m7l3P1J14m0p6J10o7o3K0J47l8j83K32k1j48l8J03o2k1J15L7j44
$$ 126 280 168 53 13 76 118 71 38 109 223 183 107 217 150 87 107 254 216 33 265 244 96 58 161 99 78 193 230 86
1101H6o7P4m6K3J7o8J5J21K7P6k0j97J21m2O7j3k9M1n1j23J45O2j29oJ23j56J70k01K18n4
$$ 86 19 93 47 70 87 19 34 155 182 258 238 41 162 120 187 174 145 186 135 12 157 219 90 84 207 51 221 20 238 184
749A84o1j6k2Q2P5q1j6q4J7J0O4O4j73J69j30PJ05m4o9L3m7M3m0J8O8o0Q7J02j36r6N2l8J45
$$ 184 123 107 85 167 242 161 145 61 78 88 152 216 43 212 82 89 194 150 81 114 67 110 70 88 156 96 183 285 149 53 105 67 212
361B12Q9j37j00Q0m7n4J5J9N5P5m4l1N6n1l7O2J2p5J55mr6J8J6p1L8Q0j82P2M6j01J31J07
$$ 212 301 164 64 144 97 43 58 77 132 207 163 132 188 137 100 162 174 99 254 250 154 172 188 117 155 235 53 125 171 70 201 308
-14C08k27K19J0o4q9K2N0r3P6j82N1P4p8J1m8
$$ 308 81 300 310 246 157 179 229 136 212 30 81 155 77 88 40
-190D0
##PAGE=	F1=2263.55
##FIRST=	25169.313707327481097,	5807.6787752999953227,	0.24492539465427398682
##DATA TABLE=	(F2++(Y..Y)), PROFILE
5808A46q2J67M5j37m3M0j3n3kR5J3L4O2j83J58m3j27J97%n8l8q9P6j2n3J36j20M4j6j05M5
$$ 146 64 231 276 139 96 136 123 70 68 163 176 210 272 89 247 204 77 274 274 216 178 89 165 153 100 236 116 160 144 39 84
5444H4M9J1n8JL5l0l6j1MKR8J5m1jl3L9p2J00q3m3J27q7J3l0m8Q7J30p7p1R6o0n2J66n6L9
$$ 84 133 144 86 87 122 92 56 45 49 51 149 164 123 122 89 128 56 156 73 30 157 70 83 53 5 92 222 145 74 170 110 58 224 168 207
5033B07K4j29O5l7J59p8j16J1N3qn1p4J51M5N4k8r6J3j27J32N1l1J6Mn7j05J40J8P3Q4j56
$$ 207 231 102 167 130 289 211 95 106 159 151 100 26 177 222 276 248 152 165 38 170 221 190 206 210 153 48 188 206 279 363 207
4669B07j62O9m1L2k4J09Pj5n3J39k1j47J49J02j85rr2l7L1N9m0n6R5K7Pj24Q6P3j11O4j22
$$ 207 45 114 73 105 81 190 197 182 129 268 247 100 249 351 166 157 65 28 59 118 78 22 117 144 151 27 113 186 75 139 17
4305A7O5J2o3J14n5M8N5j05J8Q3j09J34m5M6oJ8Pj20J08j46K0j9J35ln6j9P4j52J00J38J3
$$ 17 82 94 31 145 90 138 193 88 106 189 80 214 169 215 209 227 234 114 222 76 96 77 212 209 153 134 208 56 156 294 307
3941C07k16K8K2j06P1J1r5J15mO2q8J6M2q6K85J1j61j54oP5k0K0R9q1m6j9l0J48Q3j45m3K0
$$ 307 91 119 141 35 106 117 22 137 133 195 107 123 165 79 364 375 214 60 54 129 109 129 228 147 101 82 52 200 283 138 95 115
3566A15m4L9J24l3p3J2p9L6k2N3N1K0jj37N4K32k8k03k2N6r1N1p9J38kk0N3j05Q7m8O5k7n4
$$ 115 71 110 234 201 128 140 61 97 75 128 179 199 198 61 115 347 319 116 94 150 59 110 31 169 167 147 200 95 182 134 199 172 118
3178A18rK0J35j92L11K966K608m235j162l38k9r9K11k41L90l26l8P4K3j1L46K176L147l935
$$ 118 109 129 264 72 383 3349 5957 1722 560 222 193 94 305 64 454 128 90 164 187 176 522 2698 5845 1910
2897A910j311k13m5oj96J74j80MR4J30l6k27o7J51N1j04Q8L8j0j15m4J86o9j49m2J68j20J15
$$ 1910 599 386 341 335 139 313 133 137 231 361 325 98 31 182 233 129 217 255 245 130 86 272 203 54 12 180 60 175
2568A75P0j26K5j15R4M9j46OR5R9j96P4O0K7M6j00o3K03J6k02J4K4K0K1j44J84o5n5j1J9L8
$$ 175 245 119 144 29 123 172 26 32 127 226 30 104 164 191 237 137 74 277 293 91 105 129 149 170 26 210 145 90 79 98 136
2204A36L2pj19K3j7J11J59k3j89m5l1J90r2k3PQ8j29K07N97k14m23m2j19JJ05n1j8M6M2Jj40
$$ 136 168 161 42 65 48 159 318 295 106 61 30 220 128 105 112 200 71 278 875 661 238 196 77 78 183 132 114 160 202 203 63
1840F3R3k5QM6o8j5L0r9J42%o6m9J36k1q5M3K6j13l1J07m3J52r4k1J37j8j29j5J06M5l4j02
$$ 63 156 131 139 185 117 102 132 33 175 175 109 60 196 175 90 133 159 46 15 122 79 231 137 116 253 235 106 91 197 242 208 106
1465A06k5Q3J21j70j04N1M4J9k2q0J34O4n2o1P6o2p0N5J30o0j17J69l4r5p8J05j1j3M3O4j10
$$ 106 81 164 285 115 11 62 106 125 103 23 157 221 169 108 184 122 52 107 237 177 60 229 195 100 22 127 116 103 146 210 100
1101A00p2M3jL9k9p7N3J09pP6Rj54K8j3J13n6L8Oj12n5J06O1j38mJ39j75K18j92K35l1r5J7
$$ 100 28 71 70 109 80 3 56 165 158 234 243 89 117 104 217 161 199 205 93 38 144 205 67 63 202 27 245 53 288 257 162 179
725A79r0O7N5m2j2q7J3Jj2J13j80K10j46L4J26r3o9L4n4P9m8K3jk4J43Q7j67o7L5m4J64Q4
$$ 179 89 156 211 169 157 70 83 84 72 185 5 215 69 103 229 136 67 101 47 126 78 101 100 76 219 306 139 72 107 63 227 311
350C11j29j25Q8j8p0KlO1R4o1K4N9o0o3N1M9j84J75M1q2rLJ2k1Q9j50N4O0p7J01P1j62J74
$$ 311 182 57 145 127 57 59 56 117 211 150 174 233 173 110 161 210 26 201 242 160 151 154 166 145 234 84 138 198 121 222 293 131 305
-38C05l6l7n5RO4j15Q9j90J00J9q2M7m2
$$ 305 269 232 177 186 250 135 224 34 134 153 71 118 76
-190G6
##PAGE=	F1=2161.3
##FIRST=	25169.313707327481097,	5807.6787752999953227,	0.17105767130851745605
##DATA TABLE=	(F2++(Y..Y)), PROFILE
5808A40n7J38O1j01n6J6k1q4N7Q8oJ7R8k11J32rj25K09l9j11J4j9j2K0l1J27j31K6K5j45R0
$$ 140 83 221 282 181 125 141 120 36 93 181 175 192 290 79 211 202 77 286 247 136 150 131 119 139 108 235 104 130 155 10 100
5444A00lM3o6L7P1r4K4j4r2K9Q4J4pK0o3N0o1J12j10l2J07n7L4m4p5O4J05o5rJ07j34k8K14
$$ 100 97 140 74 111 182 88 112 98 6 35 119 133 126 146 83 133 72 184 74 42 149 92 126 82 7 71 176 111 102 209 75 47 261
5056B61m0K2Oj11L3o7J04m1o4j6O1J0o8m6R9P5Rmm1J9j72J58K6L2Lm7l8q9J21OQ3L5j30j60
$$ 261 221 243 249 138 171 104 208 167 103 87 148 158 90 44 143 218 227 223 182 201 29 187 213 245 248 201 163 74 195 201 284 319 189 29
4657B9J12l1m7NJ02jm1L2J31m3j23Q8J27j70j6j20kJ0R5m1m7J42j3lj68R8J34j48J6o2O6R
$$ 29 141 110 63 68 170 169 128 160 291 248 125 213 340 170 154 34 32 42 137 96 49 191 178 175 7 105 239 91 107 45 111 120
4282A20q3R3n2M0O2j06O9O8j15J32m0j2J0L9l7o5J38j81L3r4J67j0k1o6J59j76J03J48K4k07
$$ 120 37 130 78 118 180 74 143 211 96 228 188 176 186 225 188 123 261 80 113 19 186 176 155 89 248 72 175 323 347 140
3930A40l0%j02J04j4q3R0Rom0K7K1k1K39j1j55j05l0P3qK8J00q2%j0r0P9R6r8m0M6n2j2K02
$$ 140 110 110 8 112 98 15 105 114 108 68 95 116 95 334 323 168 63 33 106 98 126 226 144 144 134 44 123 219 121 81 127 75 63 265
3531B65o5j9n2q7J00q3Q7O3l0oo3O5K36q0k25o4J00o5M0j2O7l5m1P2n2L1j7P0q4k6J7PJ32
$$ 265 200 181 129 42 142 59 146 209 179 173 110 175 411 331 106 42 142 77 117 105 172 137 96 168 116 147 130 200 116 90 107 114 246
3143B46j46K15K717K390l851j036l17q5pJ07j73L66k67r3Q6j6Q1K25J938K877l543j143k06
$$ 246 100 315 3032 5422 1571 535 218 133 126 233 60 426 159 66 152 136 217 442 2380 5257 1714 571 365
2873C65m7L1j87J60j63o8J33R8J5j81j36J86Q0m2K37r9j65j18p3J97k8j50nP6p4J33O1j14
$$ 365 318 349 162 322 159 91 224 322 337 156 20 206 286 244 481 382 217 99 26 223 195 45 40 116 42 175 236 122
2545A22K2j08Q0Q0j59l1Q3R1j25l2J23J8J1r4j7J94Mj89NK1M2J1j12J72o6p6L3K9J8M6m0p3
$$ 122 144 36 116 196 37 6 89 180 55 23 146 164 175 81 64 258 262 73 78 99 141 152 40 212 146 70 103 132 150 196 156 83
2169H3kJ0P1J60k0j74j12j5K10r7L3k1J14j13L72J049l58q31j30j25j1J25j24K3J9O6l1o8
$$ 83 81 91 162 322 302 128 16 1 211 114 147 126 240 127 499 1548 1190 359 229 104 93 218 94 117 136 202 171 103
1840A03R1m3k2K5m7NK7p7M5Kk0j6J51p7l4K9j9j12jP8K6J52r9o8J26J2j63L0Q8P7q7o4j5R8
$$ 103 194 151 129 154 107 112 139 62 107 109 89 73 224 147 113 142 123 11 10 88 114 266 167 99 225 237 74 104 192 269 182 118 103 201
1441B01P5k24J3O9%J6j9m6J12J0k5o5L2n3p1Q1J00p8l5R9o7k1n4L5M3mk7P3o9m4%K8P3o0p8
$$ 201 276 52 65 134 134 150 131 85 197 207 182 117 149 96 25 106 206 128 93 192 125 104 50 85 128 124 97 170 101 57 57 85 158 98 20
1031B0N9R0n0P9L7r4p5K5J48r8R9k9j00j8K3O7r9k1J34j75K30j61K21oj16M0j43K6M0K4Pq2
$$ 20 79 169 119 198 235 141 66 91 239 141 240 211 111 93 116 183 84 63 197 22 252 91 312 306 190 230 87 113 153 177 184 102
655A02k4L2q3J07j03J54j28P4J31j21j08O1l8Q9o2K1n7N4J31N3j66k2K1jR4R3j14j51J01J5
$$ 102 78 110 27 134 31 185 57 131 262 141 33 94 56 145 83 104 47 101 232 285 119 97 118 117 211 304 190 39 140 155
303A55l5l0j4M4P5m8Q1M2n8p5JQ2j51R1N7l8p1L2N9p7R5j11L4N2m8J16J6j08J17n9k3k7%Q0
$$ 155 120 90 76 120 195 147 228 270 212 137 138 220 69 160 217 179 108 140 199 122 217 106 140 192 144 260 276 168 285 226 203 176 176 256
-96B56j21R5j44R1k7m7M8l6
$$ 256 135 230 86 177 150 103 151 115
-190A15
##PAGE=	F1=2059.04
##FIRST=	25169.313707327481097,	5807.6787752999953227,	0.31113234162330627441
##DATA TABLE=	(F2++(Y..Y)), PROFILE
5808A35n3J05P8p4n0Ql5m3N7M4j4%J23j81O7J6j21K17q8j35Q0L9j12N8J2Q1j41L4O0j24P0
$$ 135 82 187 265 191 141 149 114 71 128 172 158 158 281 100 167 183 62 279 191 56 136 175 63 121 133 214 73 107 167 43 113
5444A13o4O1m9Q4Q4j38Q7Rj55j1N8J3L6K5m9L5m8J12j13k4P3NJ3q7n8K7J07o6L4J18j76rK33
$$ 113 49 110 61 145 229 91 178 187 32 21 79 92 128 153 104 139 91 203 90 66 139 144 157 70 12 39 146 80 114 232 56 47 280
5056B80l3J7Jr7j4q3M8mLk9L6L4q5j6M6R9l7J8J5L8j67J27oR5J4j30l2k0P2j0R1j7r4j33J28
$$ 280 247 264 265 168 154 71 119 115 118 89 125 159 74 58 104 203 166 184 199 237 70 197 191 286 300 170 138 118 190 180 271 254 160 27 155
4646A55k0r8K6Q5j4o2J10J15p2r1L8J49j50j9j28J3J2J04l8k9J59l9j0j91J01J66j66l3J2
$$ 155 135 37 63 148 134 72 182 297 225 134 172 321 171 152 24 37 49 153 115 86 245 206 196 5 106 272 106 73 85
4305H5N1Rj06J06j4k5M1o1P2N7j06J56q0n4L0L6o4LJ36j86M1p1P6%K6o5J94j92J00J49K8j82
$$ 85 136 145 39 145 131 106 147 86 158 215 109 265 185 131 161 197 133 136 272 86 127 56 132 132 158 93 287 95 195 344 372 190
3930A90p8l3n6J06m7l3L4M2p9l1P2k2M2J58j0j24p7%K2O2M4L4r2O8Lj58kJ28l3n4N3m8m8K26
$$ 190 112 79 23 129 82 49 83 125 46 15 87 65 107 265 255 131 54 54 76 138 182 216 124 192 195 37 35 163 130 76 129 81 33 259
3531B59n0Oj14r3J52j13J21O1p9k1L1Q6J94j08k22q7R9k1L2M5Kq9k6N4NJ3K4M2j48J6L9j5
$$ 259 209 215 101 8 160 47 168 229 150 129 160 246 440 332 110 23 122 101 133 178 180 91 65 119 124 137 161 203 55 71 110 95
3155I5J17r5R8K204J911l062q25k46j22P3M4j41L15k08r2N8n3J80N9J633K312k896q66j89
$$ 95 212 117 215 2419 4330 1268 443 197 75 148 192 51 366 158 66 124 71 251 310 1943 4255 1359 493 304
2873C04k4N4j72J28j30j24J63Q0O1j38j14J25J05p3K83j18k13j38k5J42kj20J3j8k1J29L9
$$ 304 280 334 162 290 160 36 199 279 340 202 88 213 318 245 528 410 197 59 34 176 174 54 67 49 28 157 196
2556A96p3Oo6M9J06j60%%O1Ln3N9rno9kJ90j6j20l7K0L8J1q5J57o2r7Q3K4K8M1o4l9k3M8K2
$$ 196 123 129 63 112 218 58 58 58 119 122 69 128 119 114 45 43 233 217 97 60 80 118 129 44 201 139 42 125 149 177 218 154 115 92 140 162
2134A62J55k9j35j12qJ57p2M6n5J29j29L37R22k67p36j73m7m7J33j23RkP8o1mP6m2m3jk0K9
$$ 162 317 288 153 41 33 190 118 164 109 238 109 446 1368 1101 365 192 145 98 231 108 117 115 193 132 128 204 162 119 118 98 127
1770A27K7o1n4N6K5l0J47j22%Nk1l4k9J2Q6J46q2j18J09N3j96Q1M6J20j08m9rJ07L0k36Q6
$$ 127 154 93 39 95 120 90 237 115 115 120 99 65 36 48 134 280 198 80 189 242 46 127 173 293 185 136 127 234 264 28 114
1406A14R3m4J1k7j0Q8m3J8p5om1l3O7N5p3J6N4j07N3k7m1Q5Jp7O3k5j6k3M0J12q5o8N1O8r2
$$ 114 207 163 174 147 137 225 182 200 125 119 78 45 112 167 94 110 164 57 110 83 42 127 128 51 114 89 73 50 90 202 117 49 100 168 76
995G6Q1P1l9r8MJ35j33J58n7l4j7o3P5k9m5J06j44K04j30J87Rj20M6j66k7K9R7L8o5q9Q2k6
$$ 76 157 228 189 91 95 230 97 255 198 164 147 84 159 130 85 191 47 251 121 308 317 197 243 77 50 79 176 214 149 60 142 116
620A16l7m4R0q1J24J18j18j48P8jO5p6RJ4M0O6Qj32K9NK5J4J11q8j63J06M8Ro8k6M0K8j6J31
$$ 116 79 35 125 44 168 286 168 20 98 97 162 86 95 109 149 215 223 91 120 125 150 164 275 187 24 130 178 187 119 93 133 161 145 276
221B76J7m8o8p6J18r4J6L7L3j69J03O0j16J05p6ML5j6J63m1p7O0o0k1j3nR3j16R1j00Q8o0
$$ 276 293 245 177 101 219 125 141 178 211 42 145 205 89 194 118 122 157 141 304 263 186 246 186 165 152 147 240 124 215 115 203 143
-155A43pM6l4
$$ 143 136 182 148
-190A48
##PAGE=	F1=1956.78
##FIRST=	25169.313707327481097,	5807.6787752999953227,	0.33592709898948669434
##DATA TABLE=	(F2++(Y..Y)), PROFILE
5808A30o8P5Q2n5l3K8m8j2N9j8mj8J43j25oL4j28K22j32o7Q8O8j77O4O4Pj48Q6O7j10N5j03
$$ 130 62 137 219 164 131 159 111 99 158 140 136 118 261 136 130 164 36 258 126 59 147 215 38 102 166 173 25 111 178 68 123 20
5432B0L9J0R8R4j60J15L2j92m3K8K3P3LJMk9J01j11k1M1N1rj42J8k4J35r0M1J24j62nK14l4
$$ 20 59 69 167 261 101 216 248 56 13 41 64 137 140 141 145 116 217 106 85 126 177 168 26 44 20 155 65 106 230 68 63 277 243
5045B43J8Kp4p1m6qQN5j8j7O3o7k2J5J06q0L8N1O8j60R1l7J48L8k18l9P6J3j6R3o7n3r5J09
$$ 243 261 263 189 118 72 64 72 127 109 92 155 88 66 81 187 107 145 196 264 104 195 158 306 344 126 87 163 176 160 253 186 133 38 147
4646A47nj23L5P6l0m9J37R3r8n5J2J61j41oj07j2M3Q4l3mJ52n1rj91P8J77j74p0Q3K9Qj04
$$ 147 142 19 54 130 100 51 188 281 183 128 140 301 160 154 47 35 78 162 129 125 277 226 217 26 104 281 107 37 120 149 157 53
4270E3J06Rp2LJ4L2N7p3J77j47p7N6Mo4O7J09j64M5lp2K7P0k8J85j93Q6J35L4j44q8o7k9J03
$$ 53 159 168 96 99 113 145 202 129 306 159 82 138 142 78 145 254 90 135 132 60 87 157 129 314 121 207 342 376 232 144 77 48 151
3883A51p2K2l2O7n1l7N1q1R2O5J1q3l1j3pJ08P8l8j11J43J9k15K7R4jp5M5m5j3J48pJ9j61
$$ 151 79 101 69 136 85 48 99 18 110 175 186 103 72 59 52 160 238 200 89 232 251 36 63 157 156 81 126 81 68 216 209 228 67
3495F7j0R4j09J34N8j03n5J16J08J27j06j83p8K8K8L3P6m4j41Q5o6N1M7N3pj88M2N9m5R5m9
$$ 67 57 151 42 176 234 131 76 192 300 427 321 138 60 88 116 149 225 181 40 125 59 110 157 210 203 15 57 116 71 166 117
3132A17nJ541J288k053n81j37j10R8K7j30K27j52l7j2p3K65j32J393J583k181n53j62J2O2
$$ 117 112 1653 2941 888 307 170 60 158 185 55 282 130 93 81 8 273 141 1534 3117 936 383 221 233 295
2850B95j58Q3q5j16J42Q1P3r5n2L5J08k33J83ro7j57M9O7op2J3n0mJ02jJ7l9%J1J23j38J7
$$ 295 137 220 135 19 161 242 315 220 168 203 311 78 261 252 185 28 77 144 138 66 79 29 25 127 126 143 104 104 115 238 100 117
2474A17n4kR5n0Pm5M2k0n0J66l9l4n6j0J4K4o3J41o2n3P1KO7K2n7m0l4P3k1J52n2p9q8k4R5
$$ 117 63 61 156 106 113 68 110 90 40 206 167 133 77 67 81 105 42 183 121 68 139 141 208 230 173 133 99 172 151 303 251 172 84 60 155
2063A55%po6R0j55R3R1J23j05j39R3p7J56q3l7l9Q0r8O4M0j7m1Kj8L8L3n9p9J37j2p7J52j49
$$ 155 155 148 82 172 17 110 201 324 219 80 173 96 252 169 132 93 173 75 139 179 162 121 123 105 143 176 117 38 175 163 86 238 89
1676H9Qk9J3L1n5k9J00J45m7j46O9J06k25J12jJ54r8m4MJ05nj66P4J10q2pm4K8O9r1N7p8k9
$$ 89 97 68 81 112 57 28 128 273 226 80 149 255 30 142 141 295 197 153 157 262 257 91 165 275 193 186 142 170 239 148 205 127 98
1289I8k7mO0Kl0KM0j07Q7j4p7Q0Mj02M2K1Ll2M8J35j05m5L9M8j08P7J07j8o9m3P8j57K11p3
$$ 98 71 67 127 129 99 101 141 34 121 107 30 110 114 12 54 75 78 46 94 229 124 79 118 166 58 135 242 224 155 112 190 33 244 171
890A71L3j3j13O3L5o3P0j07J71j11J43J5j01K4j46m5NJ28P8l0j67J24K0j48kM2l0J58R0j01
$$ 171 204 191 78 141 176 113 183 76 247 136 279 294 193 217 71 26 31 159 237 207 40 164 184 36 34 76 46 204 294 193
538A93j24K8M6L3p5k4J12opm0p3O9j7L1m6J23m5j37P9P1M5j05m9N2k3K6J72j1k2m8j62J57
$$ 193 69 97 143 176 101 77 189 183 176 136 63 132 115 146 100 223 178 41 120 191 236 131 82 134 111 137 309 298 276 228 66 223
162B23p5jk0J14k03J13K9j28J23m3m8K3K3K13q0p5Om4k0k1nR7j08Q0o1R4p9K2N5l1
$$ 223 148 147 127 241 38 151 180 52 175 132 84 107 130 343 263 188 194 150 130 109 104 201 93 173 112 206 127 149 204 173
-190A73
##PAGE=	F1=1854.52
##FIRST=	25169.313707327481097,	5807.6787752999953227,	0.21262417733669281006
##DATA TABLE=	(F2++(Y..Y)), PROFILE
5808A23q6M5P2m6j2O5n6j0P8p2K5l5J54q1n9M8j34K12j41L3M4P8j65JJ14p4m5O5M0j03N4n0
$$ 123 37 82 154 108 96 161 105 95 173 101 126 91 245 164 105 153 19 231 90 123 167 245 80 81 195 121 76 141 181 78 132 82
5432H2o8R5O4J08j65J01N1k05m2LN1P6m4P4l2mP8j13k0K8O4k0j21M8l4J36j17J4J14j07kJ63
$$ 82 14 109 173 281 116 217 268 63 21 24 75 151 107 181 149 145 223 110 90 118 182 162 41 89 55 191 74 88 202 95 93 256
5056B56m2K0Ml9j29L6Mm0N3Rp8Q4j5n2J4R6j02M9M6J03j60O2n9J82O8k89n5J68m1JR3j12j5
$$ 256 214 234 238 199 70 106 110 70 123 132 54 138 123 71 85 181 79 128 174 277 117 179 120 302 370 81 26 194 153 154 247 135 120
4669A20o4O6J1j16J6Q6m2JR5P0j09k3J2J58j46K6r3m6Q4N9k6J9J32n1jj80M5J67j69o2J07
$$ 120 56 122 133 17 33 119 77 78 173 243 134 111 123 281 135 161 68 22 106 165 139 158 290 239 238 58 103 270 101 39 146
4305A46J1pp1P7K2r8k0P8k5O3k3J79k17q0P7m6j9J03O5j27M6N8j42kJ03J0J65j82N7J13M3
$$ 146 157 150 79 156 178 80 60 138 113 176 153 332 115 35 112 66 47 150 215 88 134 192 50 48 151 161 326 144 201 314 357
3941C57r9o9q9m0J11p8O2r6P0Kk7K4p9N4lL7n9M4n6j6R4J23q4j40K10L3k39P0P1pr5L2m5L1
$$ 357 258 189 100 60 171 93 155 59 129 131 104 128 49 103 100 137 78 122 66 50 144 267 183 43 253 286 47 117 188 181 86 118 73 104
3542A04L7N4K3j69O8Mp8J16O7j00r6J70J21N4p8j17j01l0O7L4Q3p1q7J39j70L4J04O6m6j52
$$ 104 141 195 218 49 117 121 43 159 226 126 30 200 321 375 297 180 79 49 116 150 233 162 75 214 44 78 182 248 202 50
3190E0J2O2q1O9j0l1Q33O63j051l60kn9N6L6j06J19o1j1r7K0K29k43J196Q39j538k70j27M6
$$ 50 62 124 43 112 102 71 904 1567 516 156 154 95 151 187 81 200 139 128 31 51 280 37 1233 2072 534 264 137 183
2862A83O9j34J0l5k6N0J00L5m9M7p6Q9l4J07k70J13j32N3L8m5k0Nnn3P2n5J50j05O8k7J33
$$ 183 252 118 128 93 67 117 217 252 203 250 174 263 229 336 66 179 47 100 138 93 73 78 73 20 92 37 187 82 150 123 256
2498B56r8J4q9o1J31m8Kp6J19j0o3J02n6L4l8o3j3M4m0J13o6M4Ol3J13Mj4p7j6N6m6J56q9
$$ 256 158 172 83 22 153 105 107 31 150 140 77 179 123 157 119 56 43 87 47 160 94 138 144 111 224 228 214 137 121 177 131 287 198
2110A98k0n2m7L9R9r2Ko6J29M46J314o06j301O0J17j11J98p6n3r4N8j10J04oK2k1M4n0L3M3
$$ 198 178 126 79 118 217 125 127 61 190 636 1950 1344 43 103 220 109 307 231 178 84 142 32 136 130 152 131 175 125 158 201
1758B01p4j8J51p7j27J72j39j9n9N7P8p2k7N2J52Kj38nJ65k36J04m6J76p5l9L3R0k7j02P2
$$ 201 127 109 260 183 56 228 89 70 11 68 146 74 47 99 251 253 115 110 275 39 143 97 273 198 159 192 282 255 153 225
1406B25J05j08m1o4O1O2j29P8o5l5j4mP5n2L0o1N2n2P1j0n7J1J8p0j3N7Mj3M4J26j10j7K1
$$ 225 330 222 181 117 178 240 111 189 124 89 75 71 146 94 124 63 115 63 134 124 67 78 96 26 13 70 74 61 105 231 121 104 125
1019A25L8q0P1J25l6m2p3K8o0J17p6P2Lj02K2P6p1L4o9J38j06J04Qo4k0q4jlN1J18K4k10J14
$$ 125 163 83 154 279 243 201 128 156 96 213 137 209 212 110 132 208 137 171 102 240 134 238 246 182 162 78 77 74 125 243 267 57 171
631A71M3j98M5O3l4J40N6q6q7k9R6Po1o4J80n2n2p8rP7m2L1n4Q9K0j00M0P5O4j29q0P0n7O7
$$ 171 214 16 61 124 90 230 286 200 113 84 180 187 126 62 242 190 138 60 51 128 86 117 63 152 172 72 112 187 251 122 42 112 55 122
232A22J98l2J7k1k35J80r6L9j03J81j31L4j7r8J22pj19K7P1K38r0r9m2k1mn6jQ9j01O4l0J10
$$ 122 320 288 305 284 49 229 133 172 69 250 119 153 136 38 160 153 34 61 132 370 280 181 139 118 114 58 57 146 45 109 79 189
-143A89r1M0P4k6
$$ 189 98 138 212 186
-190A86
##PAGE=	F1=1752.27
##FIRST=	25169.313707327481097,	5807.6787752999953227,	0.033116836100816726685
##DATA TABLE=	(F2++(Y..Y)), PROFILE
5808A10o6NM6m4K3P1n9k7J08p0L6m2J47p2q2O1j05J68r7O1OP8j40n8J49j19P7J3pj01O9J1
$$ 110 44 49 95 51 74 145 86 59 167 97 133 91 238 166 84 145 40 208 111 172 178 256 116 58 207 88 165 178 171 70 139 150
5432A50q7J01LJ21j51M4O9j91j8j6P6N9r7J55o2J6M7j20j7L7M4k2l8L5m9J35j30k3Q1l5J6
$$ 150 63 164 167 288 137 181 250 59 41 25 101 160 63 218 156 172 219 99 82 119 163 141 103 138 89 224 94 71 152 117 133
5068A33R5n3J1MQj77J14L9p2QL5j28Q1M6o6K5R0q6L2MJ34j69M8p2J93J05l26k8J68p0M1Q9
$$ 133 228 175 186 190 198 21 135 174 102 110 145 17 98 144 78 103 193 107 139 143 277 108 156 84 277 382 56 28 196 126 167 256
4693B56j46J5m6PL3o4m6J04m4L8L7M4q9nK3J43j53P1r8o6J08M2j5K8J08l8J0j68K0J42j50
$$ 256 110 125 79 86 119 55 9 113 69 107 144 188 99 94 117 260 107 178 80 14 122 164 149 177 285 247 257 89 109 251 101
4329A01k9R0Om4j8K5L7j11K2P5o4N4K6J57k64m7O4m2K6R2J7r8M8R7r4j06J16M3J40j61J4R1
$$ 101 72 162 168 124 106 131 168 57 79 154 90 144 170 327 63 16 80 38 64 156 173 75 123 220 126 20 136 179 319 158 172 263
3953B63N8n2m0j09o5J31p6Q9j52N6M9qK1p1qK1K0q3J26o0m4L2J67r5j60K37M0k19O5P8j8j07
$$ 263 321 269 229 120 55 186 110 199 47 103 152 144 165 94 86 107 127 44 170 110 66 98 265 170 10 247 287 68 133 211 193 86
3578H6K0m5N8p0J32Qj13Q6o8m6P2Q7p9j02J56J25ql6m3j45m0O4L0P2p2K1J44j78n9J35O3n6
$$ 86 106 61 119 49 181 189 76 162 94 48 120 207 128 26 182 307 299 263 220 75 35 99 129 201 129 150 294 116 57 192 255 199
3202A99j23QM3r0J7K1M1K14J44k52k01J39l4JN3o6L3M8l2r4K5J76j09Q24K27r96n7q4N8R2
$$ 199 76 84 127 37 54 75 116 330 474 222 21 160 126 127 180 114 147 195 163 69 94 270 161 985 1212 216 159 75 133 225
2850B25q7p9j4N4j9J14l7nJ64j86O0L34L47n08j86j07M2L4r1K1j0L5o8K6J3J66j53J01n5J43
$$ 225 138 59 45 99 80 194 157 152 316 130 190 524 871 363 177 70 112 146 55 76 66 101 33 59 72 238 85 186 131 274
2498B74n4oj22p5J02l8L8o8J22pm8L2n8O5lj07PK7k5P8p1J45p0o1J34KM0j17J9kl5J52j27
$$ 274 220 214 92 17 119 81 119 51 173 166 118 150 92 157 154 47 54 81 56 134 63 208 138 77 211 213 253 136 155 153 118 270 143
2110A43J3Lp3QJ79j44O3j13K55Q37K450j041k280n7L7j54K43r2m8j18j0j6L3l2M9QQ2q2L4
$$ 143 156 159 86 94 273 129 192 79 334 1171 3621 2580 300 243 280 126 369 277 229 111 101 85 118 86 135 143 225 143 177
1770A77M3j01O4J28j41j43J80r4n7J6j4J04p5k2pJ59O3j15q6K10k25O3p8J88n0l6P2P0m2m6
$$ 177 220 119 183 311 170 27 207 113 56 72 58 162 87 65 58 217 280 165 79 289 64 127 49 237 187 151 223 293 251 205
1418B05Q9P3j26q4p5Q2O2j47P7l7l3oj7R9r8P7j27R6k1N9j1l1n8M0l2nL0k5M0K3R0q2nmL7
$$ 205 294 367 241 157 82 164 226 79 156 119 86 80 63 162 64 141 14 110 89 148 137 106 48 88 56 51 81 56 96 119 209 127 122 118 155
1007A55l7Q2J21q0k5q6M6K5k2p3O9L1n8j9Q7o4kk7J02j01P0pk3o3rJ0Nl1J51R4k26O8M2j74
$$ 155 118 200 321 241 216 130 176 201 179 106 175 206 148 129 216 152 150 123 225 124 194 187 164 101 92 102 107 76 227 321 95 163 205 31
608C1P0R4m6R7J8p5n0p6J39j0l7r5J96q4l5m8k2M3o1N7j0k5J02p6PN4O5j26q2O7p9J03J99
$$ 31 101 195 149 246 264 189 139 63 202 192 155 60 256 172 137 89 67 110 49 106 96 71 173 97 104 158 223 97 15 82 3 106 305
221C05m3O2J3k77J52j29J18j78K05m6l3n2k4P1K6j51K0J12K32p5j36q0oL4r7J9M4o3K4qJ16
$$ 305 262 324 337 60 212 83 201 23 228 182 149 97 73 144 170 19 39 151 383 308 172 92 86 120 23 42 86 23 47 39 155
-143A55r2M9R2j7
$$ 155 63 112 204 187
-190A87
##PAGE=	F1=1650.01
##FIRST=	25169.313707327481097,	5807.6787752999953227,	0.14253291487693786621
##DATA TABLE=	(F2++(Y..Y)), PROFILE
5808H6j0j5K5j8O4k3m3l2J10LMm1J25j01p4P1p2J35m8N2k6P4j17r4J62r4J36l8n5r9R3P3j05
$$ 86 76 61 86 68 132 109 66 34 144 147 151 110 235 134 60 131 59 194 146 198 172 246 129 35 197 103 239 201 146 47 140 213 108
5420A08J15p0J32j20m6R7j52Mn3R5M4j34K28p8J9K1j27j8O2Nk4L8L6p6J29j19m1J7L9M8L1
$$ 108 223 153 285 165 119 216 64 68 15 110 154 20 248 170 189 210 83 65 127 132 108 146 182 106 235 116 75 92 131 179 210
5056B10o7j5JN8j48J08P3q9l6N1j05j1J06m7L7R2o4J0l8J42j92O4q4J87J43l19j7J17o8R0
$$ 210 143 128 129 187 39 147 220 131 95 146 41 30 136 89 126 218 154 164 126 268 76 140 56 243 386 67 50 167 99 189
4704A89P9j72M5l7n5O2j2n7O9m2N6j5J6k9j2K8J27j35R9j24l5P1M5%J5Q6j0J5j62K4J07j25
$$ 189 268 96 141 104 49 111 99 42 111 69 125 110 126 97 85 113 240 105 204 80 45 116 161 161 176 262 252 267 105 129 236 111
4329A11j9P4J3r0L8l6O0j23J03K4l4nN5J18k61JJ4Q0l1P3k2q8M8J06j9j61Q4O6J15j34m1Q9
$$ 111 92 166 179 89 127 91 151 28 131 155 121 116 171 289 28 29 43 123 92 165 143 55 103 209 190 29 113 179 294 160 119 208
3953B08O7rj3j26r4J57p0J07j97L7Q4QL6p3o3R2j0j35J94k5q6m9J98p2j12J60L5j57K6R1k2
$$ 208 275 266 253 127 33 190 120 227 30 67 151 159 195 122 59 151 141 6 200 175 89 40 238 166 54 214 249 92 118 209 187
3589A87j05Ok2M9p1J43m1k2N2o4n9J3J13n6p4J00J19m9PK0j85J6lJ3N5l5J02J42j54j00Q7
$$ 187 82 88 66 115 44 187 146 124 176 112 53 66 179 123 49 149 268 219 226 246 61 77 74 87 142 107 209 351 197 97 184
3225A84M1l2j08K0J2m3n3K5J00M2O1j74PR3l9n0R5l5l6J01k4l9k1J16n6M06j21m06K6m3L4
$$ 184 225 193 85 105 117 74 21 46 146 188 249 75 82 175 136 86 181 146 110 211 187 148 127 243 187 593 472 66 92 49 83
2862H3J23m2j02n2R5l2Q3q4J2K61k58L7M59M08n81k49r2N9K1j04M4m4N7j8m6J23J17j68R2
$$ 83 206 164 62 10 105 73 156 72 84 345 87 124 583 991 410 161 69 128 149 45 89 45 102 84 38 161 278 110 202
2521B02p2J64k1l4j54o1N2lO7o2P6Qk1k3m4N5L3j20N9j4l0N0p5K22j32n1R0L2O9j28M0p3K4
$$ 202 130 294 273 239 85 24 76 73 140 78 154 162 141 118 74 129 162 42 101 87 57 107 32 254 122 71 161 193 262 134 174 101 125
2134A25J24j63J3O7r8NK04j38M4q5K06Q09K348r30k149j16J5j62K59p8n8r3q4N3k7nK0M9Q8
$$ 125 249 86 99 166 68 73 277 139 183 98 304 1113 3461 2531 382 266 281 119 378 300 242 149 65 118 91 86 106 155 243
1793B43j04P2Rj17J43O7j81o3R8k8p0N5p9J12n7k9j4J16J37r7j49K20j86Nr3J84k8l9J14N0
$$ 243 139 211 220 103 246 313 132 69 167 139 69 124 45 157 100 71 57 173 310 213 64 284 98 103 10 194 166 127 241 291
1441B91n4J0J06L1j42j28n6P9N7j21M1Kl4nLR9j33R4o0P0k8L8j4qq2L0pOJ9q0J10lL8j6k0
$$ 291 237 247 353 384 242 114 58 137 194 73 114 116 82 77 80 179 46 140 80 150 122 160 146 138 56 86 79 85 104 24 134 131 169 153 133
1031A33l9M2NJ03J00j24j7q5J09N9j26p3K3O6Jm9P4m2m7K4O0q2M3l0Qp4M3j2J7q9J68J67k31
$$ 133 94 136 141 244 344 220 203 118 227 286 160 87 110 176 177 128 202 160 113 137 197 115 158 128 136 62 105 93 110 21 189 356 125
643A25L1Qj06P8J00l8N9j9o6l1r4J60j4j2j09J60q9K1j5n6%l2Q5j3j11J65p4k2J8M8q8JK0
$$ 125 156 164 58 136 236 198 257 238 172 141 47 207 193 181 72 232 143 164 149 93 93 61 146 133 22 187 113 91 109 157 69 70 90
256I0n1O5J57l9J00N6k79N6j45K10j64J23L2p1m5K0NM6r9l2J33K15m5j67j04oO8q7L1l2M1
$$ 90 39 104 261 222 322 378 99 155 10 220 56 179 211 140 95 115 120 166 67 35 168 383 338 171 67 61 129 42 73 41 82
-108H2mj2N0p6N2Q8l
$$ 82 78 66 116 40 92 180 177
-190A77
##PAGE=	F1=1547.75
##FIRST=	25169.313707327481097,	5807.6787752999953227,	0.22645433247089385986
##DATA TABLE=	(F2++(Y..Y)), PROFILE
5808D9N7k2K4OJ02j42N%L4R9m1l1Q9j44l0N8n0J21j3L4n5P2j03j01J50l1J36p3r3q9J11J31
$$ 49 106 84 108 114 216 74 79 79 113 212 171 140 229 85 55 113 63 184 171 205 150 222 119 18 168 137 273 200 107 18 129 260
5432B60j27J43j37J33p7j50J47j06J2q7Q4L7j16K46p6NJ7j26l2Q4k8l2Q3N7j11J15q2l2n4
$$ 260 133 276 139 272 195 45 192 86 98 11 95 132 16 262 186 191 208 82 50 134 106 74 157 214 103 218 136 104 50
5092E0Q5Q9j3q3o0jJ02q5O3R3r6n8N6n4k7L8%N8Q7m7j0n1J19k25J13j09J84J69l01l3N6l1
$$ 50 135 224 211 128 68 67 169 84 147 240 144 86 142 88 61 99 99 157 244 197 187 136 255 30 143 34 218 387 86 53 109 78
4716G8J38N5j96Q5k9j14R1K7n7K9l7N9m4j5M1k2J9J16q0Q4j59J1OP5J2j6O3L2J0j66N9P5j12
$$ 78 216 271 75 160 131 17 108 135 78 107 70 129 85 70 111 89 108 224 144 228 69 80 86 161 173 157 220 252 262 96 155 230 118
4329A18l1O9K5j20P8r0R1j11J50l7L9q0N2O8j70k4kJ75q6O0m6q4L7Q1O7j70J9Q3R1j01j04
$$ 118 87 156 181 61 139 49 140 29 179 142 181 101 153 221 51 27 25 200 114 174 128 44 81 162 229 59 78 161 252 151 47
3965D7J37M9K2Jj37r3J58o7J19k26N0Q0J0N5p6j08J51j6q3J33K5j20j03J93k7q6P4J6o4k2
$$ 47 184 233 255 256 119 26 184 117 236 10 60 140 150 205 129 21 172 156 73 206 231 111 8 201 174 88 162 178 114 92
3613I2J00k8q9j1L8QJ2Q3j05P5k6J8j15k7J17l3m0M6J06o2L4O0j96P6q4KM5L9J00J41j06j16
$$ 92 192 164 75 64 102 110 122 205 100 175 149 167 52 25 142 109 69 115 221 159 193 253 57 133 49 51 96 135 235 376 270 154
3237A54OKJ5r6L2k3L0n4l8J17J39K07l89M4L1m5r5J75l7j28P9N5M9p8M8j4Q8K35k90j39k0
$$ 154 160 162 177 81 113 90 120 66 28 145 284 491 102 146 177 132 37 212 175 47 126 181 230 152 200 186 274 509 219 80 60
2873F0j0J34j3j38J6L1K8k1J7j0K28k02j5P1J20j72j8l3P7j3p5N9r1M7P5j21J95O2j61O9q1
$$ 60 50 184 171 33 49 80 108 87 104 94 322 120 105 176 296 124 106 73 150 137 62 121 30 77 152 31 226 288 127 196 115
2509A15K00j3n3j78k1J0N5L7o6J7L3%n1pLN1q3J04o4l0L2q6K55j55k1pJ07M0q9J4q1Q3O3j75
$$ 115 315 302 249 71 50 60 115 152 86 103 136 136 85 78 81 132 49 153 89 59 91 5 260 105 84 77 184 224 135 149 68 151 214 39
2110C9N4L3n7m5J68k9j04mK3N4J99N7k25j6lL7J20Lj11j6o8j0kK7o3J22L9j22J70q3o3J49
$$ 39 93 126 69 24 192 163 59 55 78 132 331 388 163 147 144 181 301 304 193 177 109 99 97 124 61 183 222 100 270 187 124 273
1735B73rj76K4oN1p8P4j29J06j4m0K2J9K23r2j91J95j15n9m0J12pn5J49M3p2P0J05oj57j59
$$ 273 264 88 112 106 157 79 153 24 130 116 76 98 117 340 248 57 252 137 78 38 150 143 88 237 280 208 278 383 377 220 61
1371F1j3O3K7l7k1L9m5j3P7O9j55P0L1N2l9Nk0J1p9qJ4K6J5j10J40k1j0O2m6q6M7M1J25N9
$$ 61 48 111 138 101 80 119 74 61 138 207 52 122 153 205 166 171 151 162 83 75 89 115 130 20 160 139 129 191 145 59 106 147 272 331
972C31j48j0p3J61O9j54q9k5P1O1o1M7k0j03P9K0l9J4n4K2m5O2n8L1l2Q1K29k34L7o2k7P7
$$ 331 183 173 100 261 330 176 87 62 133 194 133 180 160 57 136 156 117 131 77 99 54 116 58 89 57 138 367 133 170 108 81 158
596A58P5j2M9n6n3m3p5J56j3J9j11Q7o3O1Qp7j1J6Q5m7o8J28r7m1Kj0rM9K7p0O7O0k2J24J07
$$ 158 233 221 270 214 161 118 43 199 186 205 94 181 118 179 187 110 99 115 200 153 85 213 116 75 77 67 58 107 134 64 131 191 169 293 400
185D00k42r5J3J43j24K2Q2p0j4K9o0N0l4p8J47K03j4j78j06j0N7p0N3o9R7Rk5k7m0M8N0J3
$$ 400 158 63 76 219 95 117 199 129 115 144 84 134 100 22 169 372 358 180 74 64 121 51 104 35 132 141 116 89 49 97 147 160
-190A60
##PAGE=	F1=1445.49
##FIRST=	25169.313707327481097,	5807.6787752999953227,	0.21885004639625549316
##DATA TABLE=	(F2++(Y..Y)), PROFILE
5808AJ26k5J1K8J42j80J9ol3J82p5j5M6j22mJ6n9J20J6J2p9P4j04o7J04L1R7q7j10l9Q2J83
$$ 1 127 102 113 141 283 103 122 116 83 265 190 175 221 99 95 111 52 172 188 200 121 195 91 24 128 159 256 169 59 20 102 285
5432B85j45J72j81J19l1j72J44q2J9q1J5L5o4K22o4j8M7j27m4Q4k9k9O5Q8j48J05k3k1p4O4
$$ 285 140 312 131 250 219 47 191 109 128 47 62 97 33 255 191 173 220 93 49 133 104 75 140 228 80 185 162 141 67 131
5080A31J29l9r8r7j2J32k5K7Q6r5n8O6j8K2r8N0Q8O3k5k6n1Q5k13J37j11J63J69k84rn4L3
$$ 131 260 221 123 26 14 146 121 148 234 139 81 147 129 151 53 103 191 254 229 203 152 237 24 161 50 213 382 98 89 35 68
4716F8J74K0k19J31j4j28O9N2m7kl1M9m5m1Q2j2lJ12j5M3j97O4p1J23K1n6L4Q4oj81J20M9
$$ 68 242 262 43 174 160 32 101 153 106 104 73 122 77 36 118 106 103 215 200 243 46 110 39 162 183 127 161 245 239 58 178 227
4340B27j11n8P5L8j11Q1q9Q7p3J48r5J15j32J6J8n4n5K1K04j26N1o1m6%L2J41j52m7R2O4n8
$$ 227 116 58 133 171 60 141 52 139 66 214 119 234 102 118 136 82 27 48 252 126 177 116 70 70 102 243 91 44 136 200 142
3977A42j01J64ML4%j42k5R6p1J28k14R0L1mN6p2q4J26KrM2O7j32r9J34K7q8J6l1M5l9R2n7
$$ 142 41 205 209 243 243 101 76 172 101 229 15 105 136 132 188 116 32 158 160 151 193 260 128 29 163 190 102 118 87 132 93 185 128
3589A28o0j2R6k3M4L4j22J33j34J40j79J2M7j2lJR4o1N0O6j75J23j48M5L7O9L0J49l8j34o9
$$ 128 68 56 152 129 173 207 85 218 84 224 45 57 104 92 89 90 184 123 173 239 64 187 39 84 121 190 220 369 331 197 128
3225A28n2P3p2K5n5J13n5n8P9J30J73l07N4k6k0p9K14o3j3n5kJ72j39pL42J097N4j243l22
$$ 128 76 149 77 102 47 160 105 47 126 256 429 122 176 150 130 51 265 202 189 134 132 304 165 158 500 1597 1651 408 86
2885H6J1oJ16L1j46J2q2J54j39J33M2L5mq1P10Q47n00j146Q2J7n1j8O3j16j6J91j89K22Mj44
$$ 86 97 91 207 238 92 104 22 176 37 170 212 247 243 162 872 1719 1219 73 155 172 121 103 166 50 34 225 36 258 262 118
2533A18O1r0K44l5n1j69J1k0J05k4q2K1K4Lk9K3o7L2MJ28j32K7lm7J69j08l0m4J59m3j2p8
$$ 118 179 89 333 298 247 78 89 69 174 150 68 89 113 116 87 110 43 75 79 207 75 102 99 52 221 113 83 39 198 155 143 65
2157F5R0M4k9j1R3k14J74p4k8K14m7J49L32J698M979k245m532j80k78K41j94R4j56L9Nj03
$$ 65 155 199 170 159 252 38 212 138 110 324 277 426 758 2456 7435 5190 658 478 200 441 247 341 185 224 229 126
1852A26N0K4j04J46m5j62L20k39Q7M4p4r4M8q5J33j07J07j29N0M4l0J6p4L12j00k08J36j5
$$ 126 176 200 96 242 197 35 355 116 203 247 173 79 127 42 175 68 175 46 96 140 110 126 52 364 264 56 192 177
1523A77j23K1L5K6r8J71N7r9J33O9k3j72j56J8N5l6P8m6M0n4m0J74M6j70QJ21K5l1k3l2K5
$$ 177 54 75 110 136 38 209 266 167 300 369 346 174 18 36 91 55 133 87 127 73 33 207 253 83 91 212 237 206 183 151 176
1160A76p7n1L3P2kq3R9k3j9R9o3j34O0N4J37Kj44Qn1J63O8j06j06Jj7J04n2K8k6j27R5j5K2
$$ 176 99 48 81 153 151 68 167 144 125 224 161 27 87 141 278 280 136 144 93 256 324 218 112 113 96 200 148 176 150 23 118 103 125
772A25j0q2L3j4P8q5K8M7j0K41k36R4j48K3Q4K0K1P9r2l2r2j7J31j6O0j11%j7O3L6r2J3M3
$$ 125 115 33 66 52 130 45 73 120 110 351 115 209 61 84 168 188 209 288 196 164 72 55 186 170 230 119 119 102 165 201 109 122 165
385A65P0o0l5J05j37m7N1o4K7M2N2r7J03n6rJ27J61j78j50P9M7p8n0P8l1J2K8j11K9L7q9J32
$$ 165 235 175 140 245 108 61 112 48 75 117 169 72 175 119 110 237 398 220 70 149 196 118 68 146 115 127 155 44 73 110 21 153
9A53J97J1j62r8qkn1Q4q0J18K8m0o2k4N3oK9
$$ 153 350 361 199 101 93 91 40 124 44 162 190 150 88 64 117 111 140
-190A40
##PAGE=	F1=1343.23
##FIRST=	25169.313707327481097,	5807.6787752999953227,	0.32334104180335998535
##DATA TABLE=	(F2++(Y..Y)), PROFILE
5808E3Q4j3l3N9J63j44qm1n1K28r2MNl5l1j8r6J16N0j0r4Q7j25k0N0P0L5q1j02L5J6K26j54
$$ 53 137 124 91 150 313 169 161 120 69 297 205 209 214 179 148 130 34 150 200 190 96 183 58 38 88 158 193 112 10 45 61 287 133
5420A33J89j95R8Mj17Q4p9L4o9k3jk4J90n1l7R9j41l5O7Oj0j0J11j80J32K5k6p6K5J55n8j09
$$ 133 322 127 225 229 112 196 117 151 82 59 58 34 224 173 136 235 94 59 126 132 122 112 223 43 175 200 174 98 123 278 220 111
5045A11n8k8R5K3J7M6q3n3R6j0O6j67M6J20J1J8l7o3O0j34J02p3J15J43k62O5j20J8K01j6
$$ 111 53 25 120 143 160 206 123 70 166 156 222 55 101 221 232 250 213 150 210 76 178 105 220 363 101 166 46 64 265 249
4693B49k36J61J3j03%O5k9nl1K4j3n6P3J9l1J13M3j5k09R3q7J24L1q6JJ19k5k01J89K4r7q7
$$ 249 13 174 187 84 84 149 120 115 84 108 95 39 112 131 100 213 256 241 32 125 38 162 193 107 108 227 202 1 190 214 117 30
4317C0P2N1q4O5l7M6l9J27j38J69j49m1j2N1m7JK06j42M3p4J3k7MJ50j13n7O1J3Lk5J20l7
$$ 30 102 153 69 134 97 143 104 231 93 262 113 72 60 111 64 65 271 129 172 98 111 84 88 238 125 68 129 142 145 120 240 203
3941B03L3j8j27M6K7p8J28j86J32j8nJ2o3JL3L4P0m7P6j23j10J10P6j14K6q2J09k5Q3j15l0
$$ 203 236 218 91 137 164 86 214 28 160 142 137 149 86 87 120 154 224 177 253 130 20 130 206 92 118 36 145 120 203 88 58
3578E8L3J09l6L8k9n1J22k18K34k30O6%j6L4l6Q8p6P9L8j45J67j77R5K6O0o3J63L9j60j18
$$ 58 91 200 164 202 173 122 244 26 260 30 96 96 80 114 78 166 90 169 207 62 229 52 147 173 233 170 333 372 212 94
3225I4o5Q7k5j8o3J81o2m4L0M1O5q3M1q4N3l6K04r3K40lm16L23k08mQ99K438l05k542n36L9
$$ 94 29 116 91 73 10 191 129 85 115 156 221 138 179 95 148 112 316 223 463 460 44 367 159 155 1054 3492 3187 645 109 148
2873A48K2J64R8j24j36j09K02r0M4J36k13K68j11K218K249j755k761M3r1o2L2M2j28o9K77
$$ 148 170 334 432 308 172 63 265 175 219 355 142 410 299 2517 4766 3011 250 293 202 140 172 214 86 17 294
2580B94k41K11o1j28R3q9K66q4k1j27J3o0J64q1j22J47m7KJ2K0p4J1L1J40k03J19n4j1L3J2
$$ 294 53 264 203 75 168 79 345 261 240 113 126 66 230 149 27 174 127 129 141 161 87 98 129 269 66 185 131 120 153 165
2228A65q3Q7O8o5oq1K05nr2J61J17l40L15r2L3K40R4K79Q04M266J2408n396j1282o18m74J33
$$ 165 82 169 237 172 166 85 290 285 193 354 471 131 446 354 387 627 721 1000 1804 6070 18478 13082 1800 1182 708 841
1923H41l46%j02n1M9p6k0K8q5R6q2j43L46m12K67j34j06N7j5nJ02j64J72j04qO7J2n9o5L18
$$ 841 495 495 393 342 391 315 295 323 238 334 252 109 455 43 310 176 70 127 112 107 209 45 217 113 105 172 184 125 60 378
1570C78j05j85K5R9j88R1m0R1j23J25R1j38J97qj2j74n8J0Lk8R9j2jm9o4K40M7j85p3J98k2
$$ 378 273 88 113 212 24 115 75 166 43 168 259 121 318 310 298 124 66 76 79 51 150 138 137 88 24 264 311 126 53 251 229
1207B29jk9n1L3q2q6M1J50m3n2M8qJ9P4n9j49Q2K3J24o4j12M4k8J12O0j3j01J7r3J11k0K4
$$ 229 228 199 148 181 99 13 54 204 161 109 157 149 168 242 183 34 116 139 263 199 87 131 103 215 275 262 161 178 85 196 176 200
831B00p4k4j8l7Q2k0r1L5K1P4n9kQ9k8J62k36J84k01%J20o0M7J43j25qj60P6Q3k5J07j14q0
$$ 200 126 102 84 47 129 109 18 53 74 148 89 87 176 148 310 74 258 57 57 177 117 164 307 182 174 14 90 173 148 255 141 61
455F1L6K1Q5j14M8O6L8k3m0R7j83m0J12k8l8J1O5j06J49j01n7J08K04j05q3J5m0l5q0K4L3
$$ 61 97 118 203 89 137 203 241 218 178 275 92 52 164 136 98 109 174 68 217 116 59 167 371 266 183 198 158 123 43 67 100
92A00K7K2q5n5Q8m3P5J91K2j19q6j1q3MQ8q5J19N5o2o2l0O5n7M8
$$ 100 127 149 64 9 97 54 129 320 342 223 137 126 43 47 135 50 169 224 162 100 70 135 78 126
-190A26
##PAGE=	F1=1240.98
##FIRST=	25169.313707327481097,	5807.6787752999953227,	0.40814447402954101563
##DATA TABLE=	(F2++(Y..Y)), PROFILE
5808A06L0K0r7R5J44p6m1r2j1K27r8K7l3N0o2m2j25R5R4l5r5J14j65J8J4P8j6q1qK7m2K45
$$ 106 136 156 59 154 298 222 181 89 78 305 207 234 201 251 189 147 22 117 211 176 81 195 30 48 62 140 124 43 35 62 20 265
5432B65j44J77j77Q1K0o5L5q7O0n8Oq7kJ47l7m6J46j55qM7N8%p6J02j74J94K9n6q1KJ54p0
$$ 265 121 298 121 202 222 157 192 105 165 107 113 26 24 171 134 88 234 79 71 118 176 176 100 202 28 222 251 195 114 116 270 200
5056B00j15Qm4M7N0L2j3m9o6J40k9R4j62QJ34o0Q5m3r9N5n3O5j6N0J06k25J48j39n2K23m0
$$ 200 85 93 49 96 146 178 165 116 50 190 161 255 93 101 235 175 260 217 118 173 120 185 169 219 325 100 248 109 57 280 240
4693B40k06J22N6o3q4O4qL2m2j3L5o7L3N7n9J19Q5p4j65O3l3O2M7q7mQ6l5r3J15Jm7p5J0O0
$$ 240 34 156 212 149 65 129 121 153 111 98 133 66 99 156 97 216 301 227 62 125 92 154 201 114 110 196 161 68 183 184 137 62 72 132
4294A32o7N1K8Mj4R7j55J84j40r2N8N9l5n1J98j34L6p5O4l1J7Q7o5j9K2o9P2K6O9n4L0m1r0
$$ 132 65 116 144 148 134 231 76 260 120 28 86 145 110 59 257 123 159 84 148 117 134 221 156 137 159 90 162 188 257 203 233 192 102
3906A02R1k4p2J04j73J78o2L3o8o0Q9o0O3J40j11M1r9r8Q9J08j46Q6m7M9j1Q8j69j9J08Q3
$$ 102 193 169 97 201 28 206 144 177 109 49 138 78 141 281 170 211 112 14 103 211 65 151 104 153 142 230 61 42 150 233
3554B33m4L7j23P0P1j27J51k58J17Qn7O6p1R0j08J19j3j03J88j76J32PM1j46J77J10j91j33
$$ 233 189 226 103 173 244 117 268 10 127 135 78 144 73 163 55 174 161 58 246 70 202 209 250 104 281 391 200 67
3225F7N2j0J0q6K6J51p4rJ1o1k3J21j1j05J21j3J78j08N44P0p64L33k84O8J506L975p18m047
$$ 67 119 109 119 33 59 210 136 127 138 77 54 175 164 59 180 167 345 237 781 851 87 420 136 204 1710 5685 4967 920
2897I20p42K1N4K69J78j13l42q2J94k5n6K20l58M54r7M060L991l336m712n1j90m9N2jj33p3
$$ 920 178 199 253 522 700 587 245 163 357 332 276 496 138 592 495 4555 8546 5210 498 447 257 208 260 259 126 53
2592E3L02k76J80j36j01J49n1K26j48L6q1kr9K26j01j30K23r7K8J0Oo5N7j9J45k15J62j07
$$ 53 355 79 259 123 22 171 120 346 198 234 153 151 52 278 177 47 270 173 201 211 217 152 209 190 335 120 282 175
2263A75K9p6J10j05J67j0L3j23O3J70l3p7K55J26l94M13j00J48K28K39M48J344P296K1140
$$ 175 204 128 238 133 300 290 323 200 263 433 400 323 578 704 310 723 623 771 999 1238 1686 3030 10326 31466
1981C1466r061j9206j171p02k3m12j28p1j69M7Mj47M6n4K6n9j47L14m01K62k66o3J24j06J10
$$ 31466 22405 3199 2028 1326 1303 891 763 692 523 570 574 427 473 419 445 386 239 553 152 414 148 85 209 103 213
1688B13M9j92K13q6l0M1P2j87M9K35q4j37j17K00k02J22j24J81r7J8J29j74K41j12K1j21K
$$ 213 262 70 283 197 167 208 280 93 142 377 293 156 39 239 37 159 35 216 119 137 266 92 333 221 242 121 123
1371A23L9q7R9l4P0o4l5m9K32O9j89j37K34q8M1op3L6r1n9OK29j04k8QJ5O7J9l8j42J11rO5
$$ 123 162 75 174 140 210 146 111 62 294 363 174 37 271 183 224 218 145 181 90 31 37 266 162 134 142 157 224 243 205 63 174 165 230
984B30j27n7Q9k1M0N3Q5o5pj28Q7L6J5j39R0j25m3J11k0m7OO9L5m1k1J11JL5k31K78k18p8
$$ 230 103 46 135 114 154 207 292 227 220 92 179 215 230 91 181 56 13 124 104 57 63 132 167 126 105 216 217 252 21 299 81 3
608CJ93j53N9K21j57J4j32R3K1l7J48j21j32Q8n5J49j45P8R5pN6q1R8k24k9J50J2r1kL4q5
$$ 3 196 43 102 323 166 180 48 141 162 125 273 152 20 108 53 202 57 135 230 223 279 198 296 72 43 193 205 114 112 146 61
244F1J86n5j45O3K09l7ro0q8rq2pO1L4Rll9j2J2K1J74K0n6p4k4j25P3M4o6P8R5q9n7l3P5r5
$$ 61 247 192 47 110 319 282 273 213 125 116 34 27 88 122 131 128 89 77 89 110 284 304 248 174 150 25 98 142 76 154 249 160 103 70 145 50
-178E0P1
$$ 50 121
-190A21
##PAGE=	F1=1138.72
##FIRST=	25169.313707327481097,	5807.6787752999953227,	0.33526223897933959961
##DATA TABLE=	(F2++(Y..Y)), PROFILE
5808A49k3O0j36J12Q1Lo2j19L6J93j05N2o9J11p8o1j17N8J33o0p8J45j86J4JN9K4j15N2nj8
$$ 149 126 186 50 162 243 246 184 65 101 294 189 241 172 283 205 144 27 85 218 158 80 225 39 53 54 113 137 22 74 69 51
5444E1J72j17J33j39Q5J5k8Rj06R3n0N1j46kQ8j2n6J60j35K1K9J08rj04O2q9K17%j04q4jJ21
$$ 51 223 106 239 100 185 200 172 181 75 168 118 169 23 21 109 97 41 201 66 87 116 224 215 111 173 84 301 301 197 113 112 233
5068B33p0j22Q6o4J8M7O7p4Qr4J73o5J00j27JJ12j29J61m9j52P2J7L0M4k1P2j78K08j54j11
$$ 233 163 41 127 63 81 128 195 121 129 35 208 143 243 116 117 229 100 261 212 60 132 149 179 223 202 274 96 304 150 39
4716C9K48n2j72N8J08j5j53M7%J01o0m6P8p3k2Q5q2J29J08j22j04J2K2%P0o8K0%k5qK9j2K9
$$ 39 287 235 63 121 229 214 61 108 108 209 149 103 181 108 86 171 89 218 326 204 100 112 134 134 204 136 156 156 131 123 152 140 169
4329A69o5l8N1o4L4R1k7LO7j30J37j09p2J05L0l6j16J88j07L0m8P8j3J1K7j8L4qj45J24N0
$$ 169 104 66 117 53 87 178 151 154 221 91 228 119 47 152 182 146 30 218 111 141 93 171 158 169 196 178 212 204 59 183 233
3965B33J3m8L9o5m6J10m9n6O8j73K12j05R4j23q6J56j05N4J87j33l2p0j8L0J14j50J33k7k
$$ 233 246 198 237 172 126 236 187 131 199 26 238 133 227 104 18 174 69 123 310 177 145 75 57 87 201 51 184 157 155
3624A55qR8j70n7J93L4n4O6k05J60Pj1M3k31J31K9r5Q9r5Q8r3J07p3k7J50j51J60k2J8j58
$$ 155 147 245 75 18 211 245 191 257 52 212 219 208 251 20 151 180 85 174 79 167 74 181 108 81 231 80 240 218 236 78
3272G8J46J63k20j08J39m6j0j27Q3J23r1L7J7j00J8J22q9j0Q4lJ39j07Q35J38j006K58l59
$$ 78 224 387 167 59 198 152 142 15 98 221 130 167 184 84 102 224 135 125 209 206 345 238 1073 1211 205 463 104
2955A04J64K058N431j075n492r11m1Q5L86K60r8n65m6J71M4j08K41l41M90m8N894N738m945
$$ 104 268 2326 7757 6682 1190 279 238 323 709 969 871 306 260 431 475 367 608 267 757 709 6603 12341 7396
2685G396o637j77k47m5N6m8j33j00L39k97J49k00L7Q8jJ52k03J01m8k3j01K53q2j13K23j19
$$ 7396 759 582 335 290 346 298 165 65 404 107 256 56 93 181 180 332 129 230 182 159 58 311 229 116 339 220
2380B20O8j6qo0J16o7J42j84J56j48O9q5J03q7J95o9J48k62K12J16m3k9K98J21m20N00r0K56
$$ 220 288 272 264 204 320 253 395 211 367 219 288 203 306 219 414 345 493 231 443 559 516 487 785 906 486 986 896 1152
2052A152K01L67O25J848J0185K9436j2515k6731j728r09j96m60k05r4k58J9R5k82O0om9k1
$$ 1152 1353 1720 2345 4193 14378 43814 31299 4568 2840 1931 1735 1275 1070 976 718 737 832 550 610 604 555 534
1793E34j77K73l40K02k35q1J32j52J54Mj82K16o3n1PJ34l32J76J39j8j03j77J94j47R3j57
$$ 534 357 630 290 492 257 176 308 156 310 314 132 348 285 234 241 375 43 219 358 340 237 60 254 107 200 43
1488D3K14n7o4J46j83K46k03N3j7JP4j64K08j97J89j37k2l0J92J02j74j53K08j51P5L7r2L7
$$ 43 257 200 136 282 99 345 142 195 178 179 253 89 297 100 289 152 130 100 292 394 220 67 275 124 199 236 144 181
1160A81r8k8L4K40j69j5lK3J03l6j1j28J34ql2j78J4J24l1k1P6J29no2j35N2J01j1j55J57
$$ 181 83 55 89 329 160 145 142 165 268 232 221 93 227 219 187 9 23 147 116 95 171 300 295 233 98 150 251 240 85 242
807B42j73k6P0k3K0k6J13j3n2l2J32M7r3j38K73k21k5J53j90K2K67j83L1p8R2l7m4J70j23
$$ 242 69 43 113 90 110 84 197 184 132 100 232 279 186 48 321 100 75 228 38 60 327 144 175 97 189 152 108 278 155
467A55j36J16r0J55j51O9J33o0J47j34R8k50j7J53N7j24J4l7l8K05Ok07L9J44J5N9j26p5k0
$$ 155 19 135 45 200 49 118 251 191 338 204 302 52 35 188 245 121 135 98 60 265 271 64 103 247 262 321 195 120 100
127A00k5K3j8M0j1P8l0o7K6j8J50NJ4n9m5r5Q7rl0J5J42j19o2k0P4j18J00
$$ 100 75 98 80 120 109 187 157 90 116 98 248 253 267 208 163 68 155 146 116 131 273 154 92 72 146 28 128
-190A28
##PAGE=	F1=1036.46
##FIRST=	25169.313707327481097,	5807.6787752999953227,	0.193960532546043396
##DATA TABLE=	(F2++(Y..Y)), PROFILE
5808A75o6R4j29J00j2P4n5p1J3J49j29Q8j09J43p3o9r2N7J30q3n0J76j87k6QM2J11j42L4l0
$$ 175 109 203 74 174 162 236 181 110 123 272 143 231 122 265 192 123 31 88 218 135 85 261 74 48 56 98 209 67 101 71
5456G1K1P5p7O4r2J14qj2K2j39J25m9Q8j74J1J7M7o3R6m5J1K4J43m0j08K1MK26l6j58p8J4
$$ 71 92 167 90 154 62 176 168 156 178 39 164 115 203 29 40 57 104 41 137 92 103 127 270 230 122 143 147 373 337 179 101 115
5080A15N7m5j10J38p8OPJ12j15O2r8J64j06R1q1K6N7j09J65n9j85Q5N9LR4q1N3j37K27j48
$$ 115 172 127 17 155 77 83 90 202 87 149 51 215 109 200 119 145 202 93 258 199 14 99 158 161 255 174 227 90 317 169
4728A69j53K72o0j41j1J58L1j80J4j3J80p5o4R3o7p2Q7r7J41J15j49n5k9O0n0R2m5M3q1QL1
$$ 169 16 288 228 87 76 234 265 85 99 86 266 191 127 220 153 81 168 71 212 327 178 123 94 154 104 196 151 194 113 121 152
4364A52n1pJ03o7m2K8n2j5J45m1J0N3p6L5p0j3J07J3m8j35J38p2K7kN6J8k7nK4Q9l6j74J35
$$ 152 101 94 197 130 88 116 64 49 194 153 163 216 140 175 105 92 199 212 164 29 167 95 122 120 176 194 167 162 186 275 239 65 200
3977B00M7l7j7N4q0k2J16n4m1M0j59K05j48J61j36j10J63r6J8K06j26j14l0N2rR4q6J11k2
$$ 200 247 210 193 247 167 145 261 207 166 206 47 252 104 265 129 19 182 86 104 310 184 70 40 92 83 177 91 202 180
3636A80l4j0J05j26r8K43k4o8J20j56R5n2R7m9j80J29L4j08J02j03O9l0M5j20O6N8j08J81
$$ 180 146 136 241 115 17 260 236 168 288 132 227 175 272 223 43 172 206 98 200 97 166 136 181 61 127 185 77 258
3308B58n1mq0M9J90k29o1J83m0o9r5O1J16j09P6L8j09m4J93j72J03K1%R3r5J045J87j158J97
$$ 258 207 203 123 172 362 133 72 255 215 146 51 112 228 119 195 233 124 80 273 101 204 225 225 318 223 1268 1455 297 494
2967D94m09K32K445O476j302o547j009j20J07M81L22p6p51rJ37J02r9J92k74M76J9P329P100
$$ 494 85 317 2762 9238 7936 1389 380 260 367 848 1170 1094 343 334 471 573 474 666 392 868 887 8216 15316
2697A5316o231q106l12k56n1N2q2j26j57L91l09J27j77J00MM5P3k21J46l2l8o8K36n1r7J89
$$ 15316 9085 979 667 411 360 412 330 204 47 438 129 256 79 179 183 228 301 80 226 194 156 88 324 273 176 365
2392C65j16J02m2j4o4J73r8J28j31J18j71J03n6N4n1J91j03K34l76L39O4n0K1L07J11m17N49
$$ 365 249 351 309 295 231 404 306 434 303 421 250 353 297 351 300 491 388 622 246 585 649 599 620 927 1038 621 1170
2075A170n5L30J59M55P63K213J2276L5425j4981l2163k160j046l49m94k08j65k97j8J71l83
$$ 1170 1115 1445 1604 2059 2822 5035 17311 52736 37755 5592 3432 2386 2037 1543 1335 1170 873 855 1026 643
1840F43M7O5j18J2k12K30k64J24j36j54J63j63J41l3j59K00k4q2k0J84m26K54M9Q1r3j98J48
$$ 643 690 755 637 649 437 667 403 527 391 237 400 237 378 345 186 386 362 280 260 444 18 272 321 402 309 111 259
1523B59p5M2r9J53qj23J46j69K25k22L6Q1j3Q6k02K85l58L16k08j3j4J35J35j40j52J59j52
$$ 259 184 226 127 280 272 149 295 126 351 129 165 246 233 319 117 402 44 360 152 139 125 260 395 255 103 262 110
1207A10N2Q2r8L4r4k8J01K18k12j7J7PJ16p0Rj09J39K2j37p7l0J23m7n3J42Q2P0j25j30J6
$$ 110 162 244 146 180 86 58 159 377 165 148 165 172 288 218 227 118 257 279 142 65 35 158 111 58 200 282 352 227 97 113
854A13J55n0q3J40j79l9M6m2J09n5J30m6j00k6J46J00j96k4K22k14M4J13j92J2K28j99M2l1
$$ 113 268 218 135 275 96 57 103 61 170 115 245 199 99 73 219 319 123 99 321 107 151 264 72 84 312 113 155 124
526A24R3p6m3J72j15j23J28n5Q9j14J9J70j14K20j78R6k57J5J03J04j35L1q6PK06M6k53N6
$$ 124 217 141 98 270 155 32 160 105 194 80 99 269 155 375 197 293 36 51 154 258 123 154 68 75 281 327 74 130
197A30L5M5J14j73qo3O8mp1M6l0J35k5o5Km6J23j6Q0m3p0p1J05n4Nl5J84j50q2J6N4j21J26
$$ 130 165 210 324 151 143 80 148 144 73 119 89 224 199 134 136 90 213 197 277 234 164 93 198 144 149 114 298 148 66 82 136 15 141
-190A41
##PAGE=	F1=934.202
##FIRST=	25169.313707327481097,	5807.6787752999953227,	0.13128045201301574707
##DATA TABLE=	(F2++(Y..Y)), PROFILE
5808A83r8J13r9Q5j08J22k0ql2J06j71J43j58J46m9l6r9J07Q1j01j8J97j72q0K4N3J52j77
$$ 183 85 198 99 184 76 198 178 170 138 244 73 216 58 204 155 119 20 127 208 107 89 286 114 34 58 111 263 86
5479H6L1m2M1j4k7J3m3J30m5j8P8j53J18m9J02j82M0k3J02o2k0P5k5L9J54q5j05MQ5K10p0
$$ 86 117 75 116 102 75 88 45 175 130 112 190 37 155 106 208 26 66 43 145 83 63 138 113 152 306 221 116 120 205 415 345
5115C45k03n6L5k6L1m4R6q1Oo0J57j27Q1p5J34j46R4m8N7j0J6P8p9r1JN8j2J32j05M3j22K03
$$ 345 142 86 121 95 126 82 178 97 103 43 200 73 154 79 213 67 161 113 170 160 176 254 175 84 85 143 131 263 158 201 79 282
4740B82j08j26K38p4j07p2J87O7j68j5m0K43q5o4P9m8j04P2j15J53J06j53l1l8P1q3J08k3
$$ 282 174 48 286 212 105 33 220 287 119 104 64 307 222 158 237 189 85 157 42 195 301 148 117 79 150 67 175 152
4411A52N5j32M9K4j05K4J42o8k2J1k7r6J79l1J2O4l4q2l2M5R6Jn8q5M0m1K6M2J4N3q9rO2J31
$$ 152 207 75 124 148 43 67 209 141 119 130 103 7 186 155 167 231 197 115 83 128 224 225 167 82 122 81 107 149 163 216 127 118 180 311
4012C11o0j67J26K1o2K9O1q2k4J14m7l2K5j33J68j81K20j38j15J25o4rJ97j04j73N3N1l1O8
$$ 311 251 84 210 231 169 198 259 177 153 267 220 188 213 80 248 67 287 149 34 159 95 86 283 179 6 59 110 79 147
3671A47kN5k6n2kJ05o8j05K31p2q1J69q2lr1J78j02j42J32J4r2J09r8L2L5j7j08J01m5o0J98
$$ 147 145 200 174 122 120 225 157 52 283 211 130 299 217 214 123 301 199 57 189 203 111 220 122 154 189 172 64 165 120 60 258
3308B58p6mpm2J93k04k2J88j1j48m9K2J35j29J00O8r4j08K37k27J75l3MN0q6J125K11j184
$$ 258 182 178 171 129 322 118 96 284 273 125 76 98 233 104 204 272 178 70 307 80 255 222 226 276 190 1315 1526 342
2979C42J62m11K41K578O843j366o932j005j87J11N29L51n4q54K0R7J41n3J04j87M26Q6Q029
$$ 342 504 93 334 2912 9755 8389 1457 452 265 376 905 1256 1202 348 368 465 606 553 657 470 896 982 9011
2709I011P752o892q759m32k26n6M6r3j11j96M06l12J11j24J20p4P2Rj79J49l3m1l7K06k9p8
$$ 9011 16763 9871 1112 680 454 398 444 351 240 44 450 138 249 125 245 171 243 252 73 222 189 148 111 317 288 210
2404B10J34r8J22n5j1p5K20j05R8p1O1j74J25k2Kj3J72j15K73m39M17K7n9N7K85J04l83N37
$$ 210 344 246 368 313 302 227 447 342 440 369 430 256 381 359 361 348 520 405 678 239 656 683 624 681 966 1070 687 1224
2075A224PL52J05M84Q29K353J3063L7665j5866l4195k358j084m45n06j40k64k75n1K10m23
$$ 1224 1231 1583 1688 2172 3001 5354 18417 56082 40216 6021 3663 2579 2134 1628 1488 1224 949 898 1108 685
1840F85kJ56j68L4k46J93j86M6l3k20J97j58J10o4j33J69L3j21l3K11m17K40k5J86j02k12
$$ 685 683 839 671 705 459 652 466 512 479 259 456 298 408 344 211 380 413 292 259 470 53 293 268 454 352 140
1535A40J15qk1j6Q4K5j69J44j42J95j86j6J51rN3j97L29m08L44k60j3kP4J57r1j44R9p8k4
$$ 140 255 247 226 210 294 319 150 294 152 347 161 145 296 287 340 143 472 64 408 148 135 133 207 364 273 129 228 150 126
1195A26J12r4L2p7o2J84J76k18k1L3j4J03p1J0q6J24O9k22Pn6J07n2n1J95qJ37j73j18j7J77
$$ 126 238 144 176 99 37 221 397 179 158 191 177 280 209 219 133 257 326 104 111 55 162 110 59 254 246 383 210 92 75 252
843B52q7L2P8j64o2N3p0J95p9J14n0j79L3J12J49k48N3J69k02J10Q2k06L0J62k01M4MR2q7
$$ 252 165 197 275 111 49 102 32 227 148 262 212 33 66 178 327 79 132 301 99 209 291 85 115 277 76 120 124 216 129
502A29m0J65r9j14J25k0L1o9j1J82j61K60j97Q9k45O1J6J47j21K0n0J8J81N1k71P1o0N4J51
$$ 129 89 254 155 41 166 146 177 108 97 279 118 378 181 270 25 86 102 249 128 148 98 116 297 348 77 148 88 142 293
162B93j97P4j12J62n8r7M9l7J52k2l5k3n6Q1l1J31k5r4o8J29q7K9m1K02j75j10O0K1j00J41
$$ 293 96 170 58 220 162 65 114 77 229 207 172 149 93 174 143 274 249 155 87 216 129 158 117 319 144 34 94 115 15 156
-190A56
##PAGE=	F1=831.945
##FIRST=	25169.313707327481097,	5807.6787752999953227,	0.20053111016750335693
##DATA TABLE=	(F2++(Y..Y)), PROFILE
5808A73j14J11m9P0j65J21K5L1o1P4j81J79j80Q3rN5j56J66J5j11J1K01j43j33M1R4J32j92
$$ 173 59 170 121 191 26 147 172 203 142 216 35 214 34 117 108 163 7 173 188 77 88 289 146 13 54 148 280 88
5479H8L1l4L9q9L9O2l2P5q7m4J58j38P6m6Q7j51N9m7J36o0l2Q4o6P3J43j25j06J7J39J71r8
$$ 88 119 85 124 35 74 136 104 179 92 48 206 68 144 98 185 34 93 46 182 122 90 174 108 181 324 199 93 110 249 420 322
5115C22k29j5M6j08J41j5N8p4Oj08J63j13O1l4J05j72J36n9O3o1J42qj04jn4J5j0J59p7J7
$$ 322 93 78 124 16 157 142 200 126 132 24 187 74 135 101 206 34 170 111 174 113 255 247 143 142 88 103 93 252 175 192
4763A92j31J46l1p3J76r3p1r8J65R1j22m4l8K52q8n1M1k1j01O4j19J19Q5j39l0rN2r3J12%
$$ 192 61 207 176 103 279 186 115 17 182 273 151 107 69 321 233 182 223 202 101 165 46 165 250 111 81 72 124 31 143 143
4411A43N2j50Q0j0p3K9J32o0PLj4j03J17KJ4Q9j5j82PP9Q4pn1m4k4k7K3O8l4Q4j58PR5J50
$$ 143 195 45 125 115 42 71 203 143 150 153 139 36 153 155 169 258 243 61 68 147 231 224 173 129 105 78 101 169 135 219 61 68 163 313
4012C13p5j37J06j7k8N4N0o8m3J00l6k7J7j04J24j66K34j45j02O3k5j4J68q5j23O0J3m0N7
$$ 313 238 101 207 190 162 216 266 198 155 255 219 192 209 105 229 63 297 152 50 113 88 74 242 157 34 94 107 67 124
3671A24O2ol0o5K3J01j5j13J93r5p8J73qr0r5K12j09j26J44l0m9J11q4k2Q6o1l6O3j23k3K12
$$ 124 186 180 150 85 108 209 194 81 274 179 101 274 266 176 81 293 184 58 202 172 123 234 150 128 214 153 117 180 57 34 246
3308B46r5L4J1j07J87j49lJ62K6k29Kk5J76j54J08J04o7n0J33k23J78o3J0J7q4J059K07j076
$$ 246 151 185 196 89 276 127 124 286 312 83 85 60 236 82 190 294 227 177 310 87 265 202 212 229 145 1204 1411 335
2979C35J50l76K08K419O421j271o522q86k17Q7N19L41m0q42K8N8J57JJ2r4L44J36P824P531
$$ 335 485 109 317 2736 9157 7886 1364 478 261 348 867 1208 1168 326 354 412 569 570 582 488 832 968 8792 16323
2697A6323o769q426n14j66n0L5p7q9j52L17l03J01q6J39j38P2l2j10J38m1k9l0J80k7n6P4
$$ 16323 9554 1128 614 448 398 433 356 267 115 432 129 230 144 283 145 217 185 75 213 172 143 113 293 266 210 284
2392B84q0J23m2kq5K52r5N2j4Lj66J31J2m0J6J47j03K54m33M27J5p1O3K43J07l29M60R0L14
$$ 284 204 327 285 283 198 450 355 407 393 396 230 361 373 333 349 496 393 647 214 641 656 585 648 891 998 669 1129 1219 1533
2052A533N1M46Q08K234J2348L5604j4954l2318k276j012m67m86k4l61j99p5K04l89q4K57j96
$$ 1533 1584 2030 2838 5072 17420 53024 38070 5752 3476 2464 1997 1511 1487 1126 927 852 1056 667 583 840 644
1805F44N1k75J64j18j3M1k47K08j38Q1q5j18J32J02j53l5K06l80K15p4K63j16k09R6L4p6N8
$$ 644 695 420 584 466 453 494 247 455 317 398 313 195 327 429 276 241 447 67 282 208 471 355 146 242 276 200 258
1488B58N3J7j99J48j04J59j56m8J91J8k7j57L43l59K80k77j8MK2J60l8j30K9J2p8J14q4L3
$$ 258 311 328 129 277 173 332 176 128 319 337 310 153 496 137 417 140 122 126 148 308 270 140 169 181 103 217 133 166
1160A66m6r3K34J20j82j9K5k4O9l9j2o9J02J18k73M8n3Q8m2l0K02q5J73j85j06m1J53j10J52
$$ 166 120 27 261 381 199 180 205 181 250 211 199 130 232 350 77 125 72 160 118 88 290 205 378 193 87 46 199 89 241
819B41Nj38q3Q5n1K07r6P2j7j71O4NJ81k31P0J23j89J57O8k09L0J05j84L5J8Q7o5l0J50q8
$$ 241 246 108 25 110 59 266 170 242 225 54 118 123 304 73 143 266 77 234 302 93 123 228 44 79 97 184 119 89 239 151
467A51j04R9Rml2lJ60j94K61j84P4k10R8p1J74q6k4K7L2J36K2k47O1r5K5J68j98J40j45K28
$$ 151 47 146 155 151 119 116 276 82 343 159 233 23 121 50 224 138 114 141 173 309 331 84 145 50 75 243 45 185 40 268
115B68j06j08N6l5J26k0Mk8l9J1l0J62j3j12q4J61j16L6oK05j96j17Q0j0p4J53
$$ 268 162 54 110 75 201 181 185 157 118 129 99 261 248 136 52 213 97 133 127 332 136 19 99 89 15 168
-190A68
##PAGE=	F1=729.687
##FIRST=	25169.313707327481097,	5807.6787752999953227,	0.26921722292900085449
##DATA TABLE=	(F2++(Y..Y)), PROFILE
5808A47j12R1K1N4j31L0N1M6o0N1o8J12j49m1L7J49j90J72m5j15L0J83r8j40K4J42P4j65J2
$$ 147 35 126 147 201 70 100 151 197 137 188 120 232 83 42 79 228 38 210 165 50 80 263 165 25 49 191 265 100 112
5467A12pK7r2N4J28n0J3j20l8J84j17L6l6N4p9N5r2J71n3K4J5j02J17J14j42j12M9J60J17
$$ 112 105 132 40 94 222 172 185 65 27 211 94 130 94 148 69 124 32 203 150 174 189 87 204 318 176 64 113 273 390
5127C90j20k32M4L3n4J25mL7o0Lr9J03r2K6K1P6j74J89r7L1o7K21o4j25P0q4n3NJ88k6l4j38
$$ 390 270 38 82 115 61 186 182 219 159 162 63 166 74 100 121 197 23 212 115 146 79 300 236 111 181 97 44 49 237 211 177 39
4751C9P2O8j8J07j19l6q2R2J02n2o8kK05r1k5j2Pn4Q1j14K7N5j12n1M7J8p2R7K7L9j49R9n0
$$ 39 111 179 161 268 149 113 31 123 225 173 105 103 308 217 192 180 187 133 214 100 127 182 70 19 66 84 12 109 136 175 26 125 75
4364G5RmJ02l7L5oj8q5L2N5J0J09j6k29N6N7Q3pk2m5l8k9K1P1p9J01j76jJ15J46p7r6P8m4
$$ 75 84 80 182 145 180 174 156 71 103 158 168 277 261 32 88 145 228 221 199 154 116 87 108 179 100 201 25 24 139 285 208 112 190 146
3965A46N3L4K6m0m8O4l1k5J0p7Q8r9K01j59p4J6kj5J28p1q5P0j7l8N8R2o5k0q0O2J00K0j28
$$ 146 199 233 259 219 171 235 204 179 189 112 200 101 302 143 69 85 83 68 196 125 40 110 93 55 113 205 140 120 40 102 202 222 94
3578I4J36q1n0J13N7j47o2J94q8j11J54p7JJ12o7q3J11q0N1qj27k8K14j06R3j6j50J84q9P
$$ 94 230 149 99 212 269 122 60 254 166 55 209 132 133 245 178 95 206 126 177 169 42 14 228 122 215 199 49 233 144 151
3225A51J17N9k88M5l9J95j92J06J37m4PK3j70J25o6K0Jq8Q66J82q59J44l19J57K005N304j060
$$ 151 268 327 39 84 45 240 48 154 291 247 254 277 107 232 166 186 187 99 965 1147 288 432 113 270 2275 7579 6519
2909F519n395o72j99L6M53K99l7p19J0K6J56L1m8rK37J61O755O492n891p176n51q7k7J9m4
$$ 6519 1124 452 253 289 742 1041 1004 285 295 321 477 508 460 451 688 849 7604 14096 8205 1029 478 391 364 383 339
2615C39n9q2J85k80R8o6J56j72L4m8m0J36n0j6l8J63m6l7K4p5J05ONp1K51p5qL3m3j55J20
$$ 339 280 198 383 103 201 135 291 119 153 105 65 201 151 135 97 260 214 177 201 126 231 237 242 171 422 347 339 372 329 174 294
2251B94M9o8L2J19p4J87l55L62K5p8L4J91J22k65L30J80K23J4L45P08J881J0308K9756j2470
$$ 294 343 275 307 426 352 539 184 546 571 493 527 718 840 575 905 1085 1308 1322 1667 2375 4256 14564 44320 31850
1970C1850k6993j940q46m15m33J06m28q1r6J58k95j79L50j98O7k94J41p1l9P8k21J71j06P0
$$ 31850 4857 2917 2071 1656 1223 1329 901 820 724 882 587 408 758 560 627 333 474 403 364 442 221 392 286 356
1688C56r3j26J03J66j60l3J67l17J82r3K93j26j84Q8L5q8P6P8l0k07J60n2J13j40l2J79O3
$$ 356 263 137 240 406 246 213 380 63 245 152 445 319 135 223 258 170 246 324 294 87 247 195 308 168 136 315 378
1371C78j39r5L27k71J76k41l2Oj1J41J1j12m9Q7p9R0p4L6%o7J91N4j05j7pj6K4J7n4o0Q6J48
$$ 378 239 144 471 200 376 135 103 109 98 239 250 138 89 176 97 187 113 149 149 82 273 327 222 205 198 182 206 223 169 109 195 343
995C43k80N1k9O9l1KJ69j14J56j57r6n0Q4j10K47n7j02o0Q6j5J69j00J5M7r2L3q6J61j66M6
$$ 343 63 114 85 154 123 125 294 180 336 179 83 33 117 7 254 197 95 35 121 106 275 175 190 237 145 178 92 253 87 133
643A33R3j69J70O7j81nO7j30JOP9j4JJ15r5q8N4K9j5qK8J16k07K24j36M7j54J16j20J66m6
$$ 133 226 57 227 294 113 108 175 45 46 52 131 117 118 233 138 50 104 133 118 110 138 254 47 271 135 182 28 144 24 190 144
279A44q1J07N9P5k5j80K3o1l0J59j77J71j51K46j17j23P5l3O5j7L7qmp8oJ70j1j23q5J81j54
$$ 144 63 170 229 304 279 99 122 61 31 190 13 184 33 279 162 39 114 81 146 129 166 158 154 76 70 240 229 106 21 202 48
-85D8K9N1K02k09p3M6k5n6J56
$$ 48 77 128 330 121 48 94 69 13 169
-190A69
##PAGE=	F1=627.429
##FIRST=	25169.313707327481097,	5807.6787752999953227,	0.31911239027976989746
##DATA TABLE=	(F2++(Y..Y)), PROFILE
5808A10r2O0R8M3j12l6M2M5l1L7L6N3j38m4J9J92k11J65q5j11K8J47m7j14LJ77jj00l5L2K2
$$ 110 18 78 176 219 107 71 113 158 127 164 200 253 115 71 90 282 71 236 151 40 68 215 168 54 57 234 233 133 98 130 152
5444A52n7L2J58o4l5j17K4J08r1Nk2J9LM2j41J97n3P9m7j40J64P3j25j24Q6J50N8j34j82O8
$$ 152 95 127 285 221 186 69 93 201 110 115 93 112 115 157 16 213 160 239 192 52 216 289 164 40 126 276 334 200 18 86
5092H6ML4O5KM1m1mr2M3p2J7O3M3j64K18j27k8mK24r5j16J09j02p5qK04K2r6j19nJ52L4L9
$$ 86 90 124 189 191 232 191 187 95 138 66 83 146 189 25 243 116 88 84 308 213 97 206 104 29 21 225 247 151 32 27 179 213 252
4704B52j48rn3J7J03J5p7M6J23r4Ro5K8L0J04j24p2K2m9kkj3j1N7N9K2j36R8n9L8k9O9lO2
$$ 252 104 95 42 59 162 177 100 146 269 175 184 119 147 177 281 157 85 107 58 56 54 41 30 87 146 168 32 130 71 109 80 149 146 208
4305B08k4l8m9m3J14nJ04k7k00R5j2R5J0Pq8j5k9J8O0j18J06q7o7J01J27o8n5L6k0J12j9J
$$ 208 184 146 97 54 168 163 267 240 40 135 123 218 228 235 147 132 103 121 181 63 169 82 15 116 243 175 120 156 136 248 229 230
3930B30%k3Qm2j7%n8P3l4J65j68m4L8k2m5R4n8q4Q9k0k0M2R5j15Qo0O4J01M1j53P0l3lPJ09
$$ 230 230 207 215 173 156 156 98 171 137 302 134 90 128 106 61 155 97 13 102 82 62 104 199 84 92 32 96 197 238 85 155 122 119 126 235
3519B35j63j8J41o3n3J29j02L7J10n4j31J05p7J33q4q7k5J78j05J32n4j52J65l9J8O4P8k63
$$ 235 72 54 195 132 79 208 106 143 253 199 68 173 96 229 145 58 33 211 106 238 184 32 197 158 176 240 318 55
3190E5K8J5J48k38J02J52l5L9n3r3M9n4L3Kq5N95J45n77J21k47J01J435L757p85l820m06j42
$$ 55 83 98 246 8 110 262 227 266 213 120 169 115 148 150 65 660 805 228 349 102 203 1638 5395 4610 790 384 242
2873B42l1L50K36m6n11l2JJ48K0n4N6J19J59N069M888m474n297n45%J3rjl0qM6k45J08o6J72
$$ 242 211 561 797 751 240 208 209 357 377 323 379 498 657 5726 10614 6140 843 298 298 311 302 301 271 263 309 64 172 106 278
2533B78j56m2o3M1J28n4j7l8J51p7l0rq8P8R3pqJ98n3p8O6o4j51R5R8p9K5R0l2Q4k18K34N1
$$ 278 122 80 17 58 186 132 115 77 228 151 121 112 24 102 195 188 180 378 325 247 313 249 98 193 291 212 237 327 295 379 161 395 446
2146D46p0k7J35J49k05J79K55R8PK04N52J376P437K1531r012j9493j444o20l10l49K11m44
$$ 446 376 349 484 633 428 607 862 960 967 1171 1723 3099 10536 32067 23055 3562 2118 1498 1188 839 1050 606
1887F06N2j18Q6j65k63M20j82Q8l02J22n0k9Q3j43P7o7Q2q9j57Q8K12j26l6J00k15J18p7K65
$$ 606 658 540 626 461 198 618 436 524 222 344 294 265 348 205 282 215 297 208 51 139 351 225 189 289 74 192 115 380
1559C80j25j41R0rj6j1J51r7j88J80MO1j12K0J02J10k41m0K85j61M4j52n4Rk1R9N2r2j18J24
$$ 380 255 114 204 195 179 168 319 222 34 214 218 279 167 187 289 399 158 118 403 242 286 134 80 89 68 167 219 127 9 133
1207A33k7M8o7M1M9l3J17j8%k0n1Lj4P8j09n2R1J37k53M0PN1l9M3J11q1P8r0r2m9J6K0J68
$$ 133 106 154 87 128 177 144 261 243 243 223 172 175 161 239 130 78 169 306 53 93 100 151 112 155 266 185 263 173 81 32 48 68 236
819B36r1o3j0N4J5J09q3m8J27k6lr5P0j00J4Q4j19J30O9j30n6M5n7k1m9O9N3M5O6j22o2JL2
$$ 236 145 82 72 126 141 250 167 119 246 220 217 122 192 92 106 190 71 201 270 140 84 129 72 51 2 71 124 169 235 113 51 52 84
432H4%MO4O0k04J59n3Nq3J15j10J08j3j12J62Q1Pp2r4k0k9k7J17j29J46j23K19q5j45R7l7
$$ 84 84 88 152 212 8 167 114 119 36 151 41 149 136 24 186 267 274 202 108 88 59 32 149 20 166 43 262 177 32 129 92
68I2j4j7N5L6L4j65L5J57j8j30OJ29j78J8O9K04k17j1pnm5J32
$$ 92 78 61 116 152 186 21 56 213 195 65 71 200 22 40 109 313 96 85 78 73 28 160
-190A60
##PAGE=	F1=525.171
##FIRST=	25169.313707327481097,	5807.6787752999953227,	0.34027701616287231445
##DATA TABLE=	(F2++(Y..Y)), PROFILE
5808F7n7K9J59M0j08o5%M2PK9J08Rj41o%J97k11J54r8r2lR8%q1J1J82p6k8q1O6K8m3K9J43
$$ 67 10 39 198 238 130 65 65 107 114 143 251 260 119 113 113 310 99 253 155 63 60 158 158 77 88 270 194 166 85 151 179 136 165 308
5409C08o9o5p8N2L2o5j0j1oO8L2j44J72o4J21o5j90J98K6q5j17J03J19Qj41p0K6l8J24rOO7
$$ 308 239 174 96 148 180 115 105 94 88 156 188 44 216 152 273 208 18 216 242 157 40 143 262 270 129 59 85 47 171 162 168 235
5033B35k5pq9j1n3O2O3Kj57K26j43q1R6J65j06n8J04j16ol9J50O2j43p8QJ10P9k0j70PoJ3
$$ 235 210 203 114 103 50 112 175 177 20 246 103 22 118 283 177 119 223 107 101 62 212 274 131 53 61 171 250 230 60 67 61 74
4657G4M8M0o0P7L6r9M3j00L8J28J12j41j48j0N3L5r0l4M6L7Q9Qj20Q2m4J4m3L9K8R1n4o3K
$$ 74 122 162 102 179 215 116 159 59 97 225 337 196 48 38 91 126 36 2 48 85 174 182 62 144 100 114 71 110 138 229 175 112 114
4270A14n6J31l4O3l7j13J19r7J13L8K0j51L3k3J3M5j35R2j6r8P6J19o2l0j8O5J08q3j3L9K8
$$ 114 58 189 155 218 181 68 187 90 203 241 261 110 143 120 133 178 43 135 119 21 97 216 154 124 106 171 279 196 183 222 250
3906B50m7p2jj0n4R0pJ36j58k2Q6m1j00P5k5m6K1QJjR4j54M0QJ7R5N8j87QL4N5q8J28j35j1
$$ 250 203 131 130 120 66 156 149 285 127 105 191 150 50 125 100 54 75 83 84 83 177 23 63 71 88 183 241 54 62 96 151 63 191 56 45
3495D5Q4m7N2O5r6M8J05n2j49P5n4J86j34p5J2J36q7J22p7q8J00oL2J4Q0j91j5P0R8k03K8
$$ 45 129 82 134 199 103 151 256 204 55 130 76 262 128 53 65 201 114 236 159 71 171 165 197 211 291 100 85 155 253 50 78
3132G8J29l0N0r1j4j6n7M6K0o1L08J10k92P0j70M7Q44K134n00k162j52p0q5K24J71n8k70p3
$$ 78 207 177 227 136 122 106 49 95 115 54 362 472 180 250 80 127 971 3105 2605 443 291 221 136 360 531 473 203 130
2803A30l7J51l9KR2NJ37L138L093k843l212n12Q9N9m8M2pN1o6k05J33p6J76r2o9k6RR5n2l6
$$ 130 93 244 205 207 299 304 441 3579 6672 3829 617 105 194 253 205 247 240 291 225 20 153 77 253 161 92 66 75 170 118 82
2451H2j0J26j02l8k2M4j7J29n7Q4J12k7j61R0n6j42N0J64o6j5N6J2k9n6P4Q1l7j07Q1J80j59
$$ 82 72 198 96 58 36 80 63 192 135 219 331 304 143 233 177 35 85 249 183 168 224 236 207 151 225 306 269 162 243 423 264
2087B64N4K81l1L8M8L78Q29M386J2792n359j1504r16l81j84k47K69m06J75j46J1l9k96M42
$$ 264 318 599 568 606 654 1032 1861 6247 19039 13680 2176 1260 879 695 448 717 311 486 340 351 312 16 458
1817D58j60J12k88R7n2OQ4n1m8k9J11q2j07OK22n8n0K7q9K4l3J97j10r9J04r6J35j81K34j54
$$ 458 298 410 122 219 167 173 257 206 158 129 240 158 51 57 279 221 171 198 109 133 100 297 187 88 192 96 231 50 284 130
1465A30j10J64N2J0m9O1j0J46k77l0K19m6r8k8p3J4j6M8Q2p7k5k5O4kn0L9Q4%L8r0J08k7q8
$$ 130 20 184 236 246 197 258 248 394 117 87 306 260 162 134 61 75 59 107 189 112 87 62 126 124 74 113 197 197 235 145 253 226 138
1077A38J5k8J24j60k7J04Q0k07M2M2L5p6Q2M9j1k6jr7l7O5J6P3q6l2K4K0L5M2l7j05J95J7
$$ 138 153 125 249 89 62 166 246 39 81 123 158 82 164 213 202 176 175 78 41 106 122 195 109 77 101 121 156 198 161 56 251 268
702B68l8o3j8p0qR5n7P2N7q0q9L0Pl0l7j7J14Q3K0j55l1k9J6J5PR0Jj13PN3k3l6J01q3M9P
$$ 268 230 167 149 79 71 166 109 181 238 158 69 99 106 76 39 22 136 219 239 84 53 24 40 55 62 152 153 40 47 100 77 41 142 59 108 115
279A15q0J59Q0n0j08j8m8k5J4Q4p4Q5o6J77m5j45R4m6r2ML0R4P0j57JJ32k8j36R8R2j27L0
$$ 115 35 194 274 224 116 98 50 25 39 123 49 134 68 245 200 55 149 103 11 15 45 139 209 52 53 185 157 21 119 211 84 114
-96A14m4K13k23O6p0L7l8Q6
$$ 114 70 283 60 126 56 93 55 141
-190A41
##PAGE=	F1=422.913
##FIRST=	25169.313707327481097,	5807.6787752999953227,	0.28455153107643127441
##DATA TABLE=	(F2++(Y..Y)), PROFILE
5808B2j7J5J80M2j01p1m0N6J5K5J39k3j41K3MJ83j91J48j01o8l7M7L2n1M0J66j46K8j02Q1
$$ 22 5 20 200 242 141 70 30 86 101 126 265 242 101 124 128 311 120 268 167 99 62 109 141 90 130 296 150 178 76 157
5456A57L8m0M7R0p0p5k5O6k9m8j5%j8J07K5j41J48q3J44k1k26J78k0m0q3R5P8k7j35J2j0m9
$$ 157 195 155 202 292 222 147 122 188 159 111 96 96 78 185 210 69 217 134 278 257 31 209 189 149 66 161 239 212 77 89 79 30
5080C0J73r5J0J08j6lq4n7k2J07M7l9j53K14j46J3P1Q0j10L1P5j32O0n3Q2J01j55o0J6O4J13
$$ 30 203 108 118 226 210 207 123 66 44 151 198 159 6 220 74 87 158 238 128 159 234 102 162 109 191 292 137 77 93 157 270
4716B70o7j43k3N3N5Oj5k6Q3l9q7N3j00M4J99R8j59j66j9J11M6j56RL8L3J10mj10O8l7j1n3
$$ 270 203 60 37 90 145 151 136 110 193 154 67 120 20 64 263 361 202 36 17 128 174 18 27 65 98 208 204 94 162 125 114 61
4340F1ON2J19q8q5O0k9J22o9j7l5J1J25j78J24O5J5j83P3j3%L8j15O0Oj04O4J34o7k6o9J59
$$ 61 67 119 238 150 65 125 96 218 149 132 97 108 233 55 179 244 259 76 149 136 136 174 59 119 125 21 85 219 152 126 57 216
3965B16O2j42mO3Q5p9j19K4op1J38l5J11j31%J22m0j50N4L8np8L6J3n5J07q9l3P1j7O7P8k07
$$ 216 278 136 132 195 280 201 82 106 100 29 167 132 243 112 112 234 194 44 98 136 131 53 89 102 47 154 65 32 103 86 153 231 24
3578B4PM3J16q8O9j05l9M6l0J54j2q4N2R4o0j44M6j2J90j45p3N5R3o5P1p7rL6J3N0k8O7j21
$$ 24 31 74 190 102 171 66 27 73 43 197 185 101 153 247 187 43 89 77 267 122 49 104 197 132 203 126 117 153 166 216 188 255 134
3190A34m8J07O4j59k2O0j6M6r7M5j1p0NM8k5P8R3q2Nr0rL63P63k47p50Qpq3P8J11n5n5o3j01
$$ 134 86 193 257 98 76 136 120 166 69 114 103 33 38 86 61 139 232 150 155 65 56 419 1182 935 185 193 186 103 181 292 237 182 119 18
2791A8J49j29R7R7q4J07J350J481j341j340l32L7R3r1P3LQ7j20j35J27p6J50j7m4k5l8N8n0
$$ 18 167 38 135 232 148 255 1605 3086 1745 405 73 110 203 112 185 188 275 155 20 147 71 221 204 160 135 97 155 105
2462A05o8N0P6j09m6K1J36K0M1j23J46M1Pk46R9k0n6k0J89l6p9K1M3j05O2o8R8K3j81M5J84
$$ 105 37 87 163 54 8 29 165 185 226 103 249 290 297 51 150 130 74 54 243 207 128 149 192 87 149 81 179 202 21 66 250
2099B50j19L1J87j34R8p9K05L49J769N288k240m604m85j72p2j38K70l04K40j60l8K6j1J64
$$ 250 131 162 349 215 313 234 439 788 2557 7845 5605 1001 516 344 272 134 404 100 340 180 142 168 157 321
1817C21j44J26k24M1m8L1J00Nj08k8J27q6K3p6J53Qo5k3Qo2K3J27r0p9J31j75K66j78J20j49
$$ 321 177 303 79 120 72 103 203 208 100 72 199 113 136 60 213 221 156 133 141 79 102 229 139 60 191 16 282 104 224 75
1465G5j1R2Q3k8K7P9j16J59k29o0J26O2k11P9p4K2j8J2R6o8N2j29J28n1qK3R2K7k3j56J92
$$ 75 64 156 239 211 238 317 201 360 131 71 197 259 48 127 53 75 57 69 165 97 149 20 148 97 89 112 204 231 208 52 244
1101B44l2r6Lj5J41j94K4R7kj50O4P3J7j30J01%N8j14Q8j08j4J22k6km8j4K6oM4j2L9j11J82
$$ 244 212 116 119 104 245 51 75 172 170 20 84 157 174 44 145 145 203 89 177 69 55 177 151 149 101 87 113 107 151 139 178 67 249
714B49L1n6l4l7j01j5J14j0M0K9n5q4K0N4m9l6l7J25J01j4j72lj0L9n6J2Q9n0J5j9J4K4q2
$$ 249 280 224 190 153 52 37 151 141 181 210 155 71 91 145 96 60 23 148 249 235 63 60 50 89 33 45 134 84 99 80 94 118 36
326C6R1n8QK5o2J62M3p3j09Mn0K1JP3k3PRJ50l3j28P6n5o9L7n2R3R9j13n3J06k6j01J06P8
$$ 36 127 69 77 102 40 202 245 172 63 67 17 38 39 112 89 96 105 255 222 94 170 115 46 83 31 124 223 110 57 163 137 36 142 220
-73B20p4M8j78K29k13J38j27O8k8L6
$$ 220 146 194 16 245 32 170 43 111 83 119
-190A19
##PAGE=	F1=320.655
##FIRST=	25169.313707327481097,	5807.6787752999953227,	0.29086625576019287109
##DATA TABLE=	(F2++(Y..Y)), PROFILE
5808A8j4J8J52M6p7o6l8O3j6K5J33m5j26L5K5J58j50J44j13l8n9LM0k6P7J41j99N0q9P2M4
$$ 18 4 22 174 220 143 77 39 102 86 111 244 199 73 108 133 291 141 285 172 134 75 78 118 92 169 310 111 161 72 144 188
5444A88l6Q4J2p0p1K8P6o4n0j8K0k2J17K4j46J41q3J35N6k68J48n5%m2O9M2m4j09M3k2RJ28
$$ 188 152 236 248 178 107 135 211 147 97 79 99 77 194 218 72 213 130 265 321 53 201 146 146 104 173 215 171 62 105 83 92 220
5068B20j78J2J49j4J0o9q9J8J07L9o9j18J53j37J28L1pj13J26L6j51J17n4K1J31j51n7kN0
$$ 220 42 54 203 189 199 130 41 59 166 205 136 18 171 34 162 193 186 73 199 235 84 201 147 168 299 148 91 89 139
4728A39J34j04n9q7R9Q2J0r3qP5q9j6rm1M1K08O7j77j15mR5M4j75L4L6L3J12j5r7N8l6j7o6
$$ 139 273 169 110 23 122 204 214 121 113 188 99 83 74 33 74 282 349 172 57 53 148 192 17 51 87 120 232 217 120 178 142 125 59
4340E9l3O6J38j14p0Q7j0J23r5r4QR0J13k41J16Q2%j14M4nk1M1p9L4j8n4K3J56o3m8n6J78
$$ 59 26 92 230 116 46 133 123 246 151 57 65 155 268 27 143 225 225 111 155 150 129 170 91 125 107 53 76 232 169 121 65 243
3965B43%j81L4N8J34q7j70N6K5q4J67j05Q5q5K8J26j8j60JJ15K5j40K3J7r6J40j7q0O7j6K
$$ 243 243 62 96 154 288 201 31 87 112 28 195 90 175 90 118 244 226 66 67 182 207 67 90 107 11 151 134 54 121 105 107
3601A07J03j54N5k7J45p9K5j11m4L2J2J88p6r2O0Q3q0j24L3M0J45j28k8O3M8n2%n5O5j3J7
$$ 107 210 56 111 84 229 150 175 64 20 52 64 252 176 84 144 227 147 23 56 96 241 113 85 148 196 144 144 89 154 141 158
3237A58P2o1N3o7p7J29M4j21l8k3J6K5q1P9M7l9m7POlP0k7l0%n8J44M1M6j03n5L3j1n1L5J1
$$ 158 230 169 222 155 78 207 251 130 92 69 85 110 29 108 155 116 69 76 82 79 149 122 92 92 34 178 219 265 162 107 140 129 78 113 124
2826A24N1j6n8L7l8KR0j34Q9ML15k06j6m1j22Q7j26Q6lR6r8p2J01o8R9M7k9k3p3L6n0p7R7
$$ 124 175 159 101 138 100 102 192 58 147 151 466 260 244 203 81 168 42 128 125 221 123 51 152 84 183 230 201 178 105 141 91 14 111
2439A11Nj06L2J2J56O4qj68J51PN5k35JL8NmJ41j0j18kM4m5J8p5J8Q9r5M8J0k6R2n2o8M9J
$$ 111 116 10 42 54 210 274 266 98 249 256 311 76 77 115 120 116 257 247 129 127 171 126 144 69 87 176 81 129 139 113 205 153 85 134 135
2028A35r4J2P1M00k10lk06n0j2J2J35o4J10q5J4j11J86Lj44J09j13rK3n1J23J4m8n7R0j18
$$ 135 41 53 124 524 314 311 105 55 43 55 190 126 236 151 165 54 240 243 99 208 95 86 109 58 181 195 147 90 180 62
1676F2J29j04Q9L3o5l8M2j12P3R3p3r5J69q2J80q5n2l6l8L8R6n1Q2Q8j86J41j56o0K1J42j15
$$ 62 191 87 176 209 144 106 148 36 109 202 129 34 203 121 301 216 164 128 90 128 224 173 255 343 157 298 142 82 103 245 130
1312A30k3n5M0l8PR0o2R0q2P1j01N2J4O5M5n6j68J98l3o4k4LJ24j97O1Q1q0p6P9J03Jj70P5
$$ 130 107 52 92 54 61 151 89 179 97 168 67 119 133 198 243 187 19 217 184 120 96 99 223 26 87 168 88 12 91 194 195 25 100
925A00k5J02j56J47j16J7J47o1l5j0kLk5M7j9J01r9J23K2m5l2%j66kJ19K0L5%o1n6L6P9q0
$$ 100 75 177 21 168 52 69 216 155 120 110 108 111 86 133 114 215 116 239 261 216 184 184 18 16 135 155 190 190 129 73 109 188 108
538A08m2k8J14R7l2j55OMR0j43L5M4q4J46K2q9R6j69R2m2KM6q4J77k5m4m6p0j0Q7o2O8K3p2
$$ 108 66 38 152 249 217 62 68 72 162 19 54 98 14 160 182 93 189 20 112 70 72 118 34 211 186 142 96 26 16 103 41 109 132 60
138F0Q7J44n2j01N1n9m3N4m1J2J16p0r4R4j3p1O3Q0k2N7k08J62j41J47j60O8j7l
$$ 60 147 291 239 138 189 130 87 141 100 112 228 158 64 158 145 74 137 217 195 252 44 206 65 212 52 120 103 100
-190A00
##PAGE=	F1=218.397
##FIRST=	25169.313707327481097,	5807.6787752999953227,	0.29975798726081848145
##DATA TABLE=	(F2++(Y..Y)), PROFILE
5808D9l7K5Q8M6l6m8m1O6m4K8J02n7q7K1N8J31r7J37j42Lp3k5K2nJ11J15j88jn1M2M3k1J27
$$ 49 12 37 125 171 135 87 46 112 68 96 198 141 54 75 133 264 167 304 162 165 92 67 89 84 195 310 122 121 70 112 155 134 261
5420B61o3p8n4O5R0p2p4k8N4j5R7K4j56J56n4R6J23l11J35p8M4j5K7K3m8p7L8mN0P0j94k7
$$ 261 198 120 66 131 221 149 75 47 101 86 183 207 51 207 153 249 372 61 196 118 162 147 174 197 149 72 110 106 156 226 32 5
5045EJ65j7K9m1q0J3P2M4q1n7O7r6J88Op3j17J99qj58J55m5j1J32j59l7k8N3J43j30L0j38
$$ 5 170 153 182 141 61 74 146 190 109 52 119 23 211 217 144 27 226 218 60 215 170 159 291 132 95 67 120 263 133 163 25
4681B5J22Q9L6j42k7O5r2N4r5K1L9J80K7j92k8j0P3L3j46N2M1K4R1k6p8N5l5rq1k5L1J34j18
$$ 25 147 236 272 130 103 168 76 130 35 56 95 275 302 110 82 72 145 178 32 84 125 149 240 214 136 191 156 147 66 41 72 206 88
4294H8nN6nJ33j05j7KN6Q6k78Q7Q6j8J4j7om2N3m7J7n1J1l2J65m1q4J0J25n8j70P3K4J60p7
$$ 88 83 139 134 267 162 145 147 203 289 11 98 184 166 180 163 157 115 168 121 138 87 98 66 231 190 106 116 241 183 13 86 110 270 193
3894A93j75N7P0r4J73j85N6oM4Q9J8j32q2J99L9j66j2J7o3J31K4o8%J2q8J31q6O8l7J32r9
$$ 193 18 75 145 51 224 39 95 89 133 222 240 108 26 225 264 98 86 103 40 171 195 127 127 139 51 182 96 164 127 259 160
3531A60J0j29jK3K9J93j09j12O3P3j11o6K7P0O9r3L8N0Qn2p0j2J17l5lR8q7N3l5j07J44K7
$$ 160 170 41 40 63 92 285 176 64 127 200 89 23 50 120 189 96 134 184 192 140 70 58 175 140 137 235 148 201 166 59 203 230
3155B30r2k9l9K1k7m7Q7R8pn4n6K9rM3o5nP4p5J72M13k8m21j50L3P2o1n8R2L5J1k3k2K2q5
$$ 230 138 109 70 91 64 17 104 202 195 141 85 114 105 148 83 78 152 77 249 662 634 213 63 96 168 107 49 141 176 187 164 142 164 79
2756G9R5j36Q6N52K64l63m26J25j90N7j33P5k5Q5k6m9R0o5M4Q9l0j2q8K9n3j9Q5p8oJ6k1J58
$$ 79 174 38 124 676 940 577 151 276 86 143 10 85 60 145 119 70 160 95 139 228 198 186 98 127 74 55 140 62 56 72 51 209
2380B09J07k3j94J17J4J07j89j27R6K3J3J08J2j26j4M1Qn4mq2J20p0R7r9P1O8j62J45j47J56
$$ 209 316 293 99 216 230 337 148 21 117 140 153 261 273 147 133 174 182 128 124 42 162 92 189 90 161 229 67 212 65 221
2028B21m8J46Q56K329r07k272j8j06k8n8L3J6NL7M1k03K10l6j52N6rJ1M2j29J25LK3p4O6j75
$$ 221 173 319 1175 3504 2597 325 307 201 173 115 148 164 169 206 247 44 254 218 66 122 113 124 166 37 162 165 188 114 180 5
1676EK01j20Q6Rm0l8K0r0Q3Q5n6j11J90k5Q4pj33M8r4J2Q1n6R9R6k07R4r5j1k7J43%j50l0
$$ 5 206 86 172 181 141 103 123 33 116 201 145 34 224 199 283 276 143 191 97 109 190 134 233 329 122 216 121 110 83 226 226 76 46
1289D6P4o8K2P1n0P8j6K7j50J11K7J9M4o6j14J22k8pk8qP9j55N0P2j42K7N0J40j1j74jk8J20
$$ 46 120 52 74 145 95 173 157 184 34 145 172 191 235 169 55 177 149 142 114 106 185 30 80 152 10 37 87 227 216 42 41 13 133
901A33j00J06j07M6J41p9j6j0J1k0m1M7K7J16j02P1nqn6M8j88MR4L8L9j3r2j5P2Q4j15k7l0
$$ 133 33 139 32 78 219 140 124 114 125 105 64 111 138 254 152 223 218 210 154 202 14 18 112 150 189 176 84 69 141 225 110 83 53
514E3R0P3l2j11%J4J38k16P6l4mJ60M0j55J53k32Q4l3K3N7r9J73j07K9kq3k3J24j10O3N6j31
$$ 53 143 216 184 73 73 87 225 9 85 51 47 207 247 92 245 13 97 64 87 144 45 218 111 140 138 55 32 156 46 109 165 34
138C4J50J47p4p8L0o1l7P1l0m7J14k7j20R5jo5RQ9K7N1j79P3n4J31j83N4j1k3
$$ 34 184 331 257 179 209 148 111 182 152 105 219 192 72 167 166 101 110 199 226 277 98 171 117 248 65 119 108 85
-190H5
##PAGE=	F1=116.14
##FIRST=	25169.313707327481097,	5807.6787752999953227,	0.16860951483249664307
##DATA TABLE=	(F2++(Y..Y)), PROFILE
5808F9n3M2K0M0Rk3o7N9m6L3O6o9l0oQ8J06m4J26j85N0q2j8k0PJ31R8j13j09j3RL5J5J45j00
$$ 69 16 58 78 118 127 104 37 96 50 83 149 80 50 44 132 238 194 320 135 185 103 85 65 72 203 301 188 79 66 75 110 125 270 170
5409A70j03j8O3J06n8j06j9O6qO1K0j50J77j5M9J51l29J37j01J03j2k5K5m9n2K1L2P1J6j44
$$ 170 67 49 112 218 160 54 35 101 93 154 174 24 201 186 235 386 57 194 93 196 184 159 184 135 83 104 136 207 223 79
5056G9l2Q6j5L9Jn9k4K1O5p8QJ8m6J60Kj03q0J95n9j16J43k9lQ8j85K4j8J5J48j41J01j85
$$ 79 47 133 118 157 158 99 75 96 161 83 91 109 63 223 225 122 42 237 178 62 205 176 173 261 76 100 82 97 245 104 205 20
4681B0J38Q1P2j61p2P1n2O9j23M2J9J40j2j99O7k0M5J6q9Q6M5pN2l1n1N9l5nq5Jj7J08q9M3
$$ 20 158 239 311 150 78 149 97 166 43 85 104 244 232 33 100 80 125 141 52 138 183 176 228 197 146 205 170 165 80 81 64 172 83 126
4282A26K1j2J42j08Q9l5K2N0k89M0R3m2J37o7j4n2P0k8jn3M8q1J45kj21Q7M4r5n7K1%J55o0
$$ 126 147 135 277 169 258 223 245 295 6 46 139 97 234 167 153 101 171 143 142 89 137 56 201 199 78 165 209 114 57 78 78 233 173
3894A73j10J2J05j14J77k03PQ1L4J6N4q0j16K19L3j61m5J5l1J31M9l3q8M9j45J24l5O7rR6
$$ 173 63 75 180 66 243 40 47 128 162 178 232 152 36 255 288 127 82 97 66 197 246 213 125 174 29 153 118 185 176 272
3542B72j42Mj19N0LK8J93j08r6K4O9j48K6K9N6j1l1O8L4k6n5r4M2J13k7n4J26j04P2k7j33
$$ 272 130 134 15 65 68 96 289 181 85 109 178 30 56 85 141 130 99 167 201 175 120 26 68 181 154 100 226 122 194 167 34
3178C4J58Lp3%Rpp5k9P6J28L0n5j01N0m6L8j09M9J36j02J21L63n9l36j11j6J17m8m3M1K7J8
$$ 34 192 195 122 122 131 124 49 20 96 224 254 199 98 148 102 140 31 80 216 114 235 598 539 203 92 76 193 145 102 143 170 188
2803A88J6m4Kr7J07j20N9P60L65n09o10J72k11N0j03M7o6O4M2l4Q3o6jJ05m6Oo4J8n7K9Q3
$$ 188 204 160 162 65 172 52 111 871 1236 727 117 289 78 128 25 72 6 70 112 78 161 95 94 199 153 159 95 113 56 85 168
2439A68j23R3m0p4J43J44j4k12Q2M4J46j59j79J01J7K1Q2L4j09l4N8Nr8N6j18J04r0J42j01
$$ 168 45 138 98 24 167 311 297 85 167 211 357 198 19 120 137 158 240 274 165 131 189 194 96 152 34 138 48 190 89
2099H9R3Mp7J36k17J61J5J59R10K539r87k537O3j49jj14Q0l3oJ15K7j93J41j0j64mQ8M5J6
$$ 89 182 186 109 245 28 189 204 363 1273 3812 2825 288 351 202 201 87 167 134 128 243 270 77 218 208 44 40 128 173 189
1758A89j54J10j6O7q6Q2j13J02j19J14l3J3o3j3j2M4P6k2j02J84rkL9j11O7j37J5L6m4P1J06
$$ 189 35 145 129 196 110 192 79 181 62 176 143 156 93 80 68 112 188 166 64 248 239 237 276 165 232 95 110 146 102 173 279
1394B79j82L0n1O9k2P8P5k32j1J19j01M4M8l4L0N2J1j78J32O4k9K2o6q7Q1k9N6j2l6J7r4J2
$$ 279 97 127 76 145 123 201 276 44 33 152 51 95 143 109 139 191 202 24 156 220 191 213 147 60 141 112 168 156 120 137 43 55
1019E5Q4q0OQJ73j7j80oj1P2l8K7o1M9J13p8L2m0J9j6o2M7P2J10j07L4l7K6q0Q2j59j0N3N4
$$ 55 139 59 65 73 246 229 49 43 32 104 66 93 32 81 194 116 148 108 127 111 49 96 168 278 171 205 168 194 114 196 37 27 80 134
620A34L9j2j32L9J01P7j37J7m7M2L9k0n6j4L4J63k53J14j06P1J31L7j75J86k31L3j0L6M9q4
$$ 134 173 161 29 68 169 246 109 126 79 121 160 140 84 70 104 267 14 128 22 93 224 261 86 272 41 74 64 100 149 65
268F5J52j78J02J5m6o7J36j28N6P1j53J84J53q3o7J7o4m9Q9k4q6R4K1j26R7Jo8m0R7O5L4j33
$$ 65 217 39 141 156 110 43 179 51 107 178 25 209 362 279 212 229 165 116 205 181 95 189 210 84 181 182 114 74 171 236 270 137
-108A37NJ9J12k06M4j6k5
$$ 137 142 161 273 67 111 95 70
-190G0
##PAGE=	F1=13.8818
##FIRST=	25169.313707327481097,	5807.6787752999953227,	0.16423273086547851563
##DATA TABLE=	(F2++(Y..Y)), PROFILE
5808H3p2O4K3K4OKq5J3k8M4M6r2K3rQ7Q7oJ15k26R2r2K1m8j3J34R5k6j84k3lK5O9J16q9j31
$$ 83 11 75 98 122 128 130 45 58 30 74 120 28 51 42 129 216 210 325 99 191 99 120 72 59 193 288 262 78 55 52 77 146 262 173 42
5397D2K0J9J22l1j16L5Qj3K7Ro9J38J6J3J31k97J39j39J79k8q1M2m8l0MO5P7j7j14l6L3kL3
$$ 42 62 81 203 172 56 91 99 86 113 122 53 191 207 220 351 54 193 54 233 205 124 166 118 88 92 157 234 217 103 67 100 98 131
5010A31M6m9p3j9R8p4P1K8n9J01J4r5n3J63j09k2P8j2K6J6j73Q3J9p2J58j25J36k30J52N9
$$ 131 177 128 55 36 134 60 131 159 100 201 215 120 67 230 121 99 177 165 191 207 34 117 136 64 222 97 233 3 155 214
4657B14J14j67j21R9j7N8j02L4j4J05m8j10N8j7RJj9J33L9o3J1k7j5O7m6np4J5n2P3l5O3l
$$ 214 328 161 40 139 122 180 78 112 98 203 155 45 103 86 95 96 77 210 249 186 197 170 155 222 176 171 97 112 60 133 98 161 158
4270A58k1J38j14J78p4J5J1k79MJ12q7K13r1l0l5Q1k3j8l2N4r9Q2M1j41J64m6j02J3k0QJ25
$$ 158 137 275 161 339 265 280 291 12 16 128 41 254 163 133 98 179 156 138 106 160 61 143 184 43 207 161 59 72 52 60 185
3906A85m6l4j3J18j36J71j63NQ8K1o6P2j6r0J66J1j23o6J3k6J45O7J4j76Q0j12M3j3N9L8N3
$$ 185 139 105 92 210 74 245 82 87 175 196 130 202 186 96 262 273 150 84 97 71 216 283 297 121 201 89 132 119 178 216 269
3542B69j97mj8L5k3J5J87r1m0l3O5j14L5M0L0m8L0L2K3n1n0j5L2O4Qj20J37j04J04m2j31J59
$$ 269 72 68 50 85 62 77 264 173 133 100 165 51 86 126 156 108 138 170 193 142 92 77 109 173 181 61 198 94 198 156 25 184
3167A84l2o5M0P0l2q9l7L5J43O5n3j18O5p3M9j29M6J95j27J7O5l9j7l7l7J07l6k4k9M1K0N5
$$ 184 152 87 127 197 165 76 39 74 217 282 229 111 176 103 152 23 69 264 137 154 219 180 163 126 89 196 160 136 107 148 168 223
2791B23m0o1m7J01p5k1N67J59l39l48J33j99O9m5K2o3k1P2qP0n7l7J00p4K4J0k0n6O0Q9r0
$$ 223 183 122 75 176 101 80 647 806 467 119 252 53 122 77 99 36 15 87 79 149 92 55 155 81 105 115 95 39 99 188 98
2427I8J28j06j03Q8J68Rk28Q1O2J60j39j74P3PK2N3N4p1p1R4l4j16J22j32O0o3J15l7N1o4
$$ 98 226 120 17 105 273 282 54 135 197 357 218 44 117 124 146 199 253 182 111 205 171 55 177 45 105 42 157 120 171 107
2075A07L5O3j90O0O6R9M92J472n53j568J84j60O0p4N8o2J1J51mj65P8L8j43nR8N7k6j33J00
$$ 107 142 205 15 75 141 240 732 2204 1651 83 267 107 167 93 151 89 100 251 247 82 160 198 55 50 148 205 179 46 146
1735A46l8Q0j06J23m2l7q7J31o6P5j12J3K4j3N1M1q5J72k9n7M5l2N4j45J9k5j5RJ12j31k5
$$ 146 108 188 82 205 163 126 39 170 104 179 67 80 104 91 142 183 98 270 241 184 229 197 251 106 125 100 85 94 206 75 50
1371E0j5J42k6K3R8k29lJ41j32O9K6k6k2J03K7j63Q6J18o3j6o3p6P6m8J15Jn7m8l4l2J25k9
$$ 50 35 177 151 174 272 43 40 181 49 118 144 118 96 199 226 63 149 267 204 188 125 49 125 77 192 193 136 88 54 22 147 118
995A18k8l4J93j9j91N9l4N9k2n2jK8P9o0P3p5J9K5q7L6Q7J04j05J7o5K9p8R2j20j2J5P2K5
$$ 118 90 56 249 230 39 98 64 123 101 49 48 76 155 95 168 93 112 137 50 86 173 277 172 189 124 153 75 167 47 35 50 122 147
608A47nr2L6R6O3j35O7o8k2J1kml3O3J62k51J40j08N4Q2K2j46J89j98k7L9J7K4m9J28j69R5
$$ 147 142 50 86 182 245 110 177 109 87 98 96 92 59 122 284 33 173 65 119 201 223 77 266 68 41 80 97 121 72 200 31 126
232A26K6Jj00J12j09M6O4j39J94J65q3o6Ro7p5J07k3j11N7P7j06Q5Mp4p6J00Q6Pq3l3O6R6
$$ 126 152 153 53 165 56 102 166 27 221 386 303 237 246 179 104 211 188 77 134 211 105 190 194 120 44 144 230 237 154 121 187 283
-143B83k22M1l5j3
$$ 283 61 102 67 54
-190E4
##PAGE=	F1=-88.3761
##FIRST=	25169.313707327481097,	5807.6787752999953227,	0.18790780007839202881
##DATA TABLE=	(F2++(Y..Y)), PROFILE
5808I9q7P0P6K3l9K0p8p2JN8M8j08M5QN6P6J1J04k49J15j00P2m2o1J26J08L8k08p3J5L3R9
$$ 99 12 82 158 181 142 162 84 12 13 71 119 11 56 64 120 196 207 311 62 177 77 149 107 46 172 280 318 110 37 52 85 184
5432A84N1m8j35K0k8J38kr9P5n8m3J3j0L1P7M0qP3k03J21j45K16n8j31O9m4qj0Q6P2k5j09
$$ 184 235 187 52 72 44 182 180 81 156 98 55 68 58 89 166 206 198 271 68 189 44 260 202 71 140 96 88 78 164 236 211 102
5056A02l6J3J0J7Q6n3j19N7M8q1J20N7r2K6L4o4m8J35j59Q4LLN0n7j1K0M3j60J71q5J36k26
$$ 102 66 79 89 106 192 139 20 77 125 44 164 221 129 155 189 125 77 212 53 137 140 143 193 136 125 145 188 28 199 114 250 24
4681B4J17K7J55j66j43J20oM6o8J7l8R0p6mrJ0l2nN2J77J6j33j5j6K8P2p3%n5J8q3N1K6O5
$$ 24 141 168 323 157 14 134 128 174 106 123 85 175 99 95 86 96 64 59 111 288 304 171 156 140 168 240 167 167 112 130 47 98 124 189
4282A89j8k8J18j30K39j06M4k9k57M8Q5j23K05q5n5J2Q4l2k8j9M9p3k5P3p8J91j11q7Jm2M1
$$ 189 171 143 261 131 370 264 308 279 22 70 155 32 237 152 97 109 193 161 133 114 163 90 65 138 60 251 140 53 54 12 53
3918E3Q4m1M4k0J07j42J45j15J1P9J4j31O6M9m7Q6k0n4p3Pm8J69Q1O0k47R7o8k4j8N0Q7J6
$$ 53 137 96 140 120 227 85 230 115 126 205 219 88 154 203 156 242 222 168 95 102 54 223 304 364 117 214 146 122 104 154 241 257
3542B57k23J5M3Nl1j1J63p4L3p1N2o2J2M4Qj9M0l7J7o7k5M8K8J1N7j45Q6q9J37p2p8J31p8
$$ 257 34 49 92 97 66 55 218 144 177 106 158 96 108 152 160 141 181 144 161 94 69 117 145 156 213 68 154 65 202 130 52 183 105
3155A05o1P3J45n3j15l3nJ30Q8m7r2O3p6O4j13l2K40j37lP2k3m9kk8O5j5j2r3N2L3Q3k4r0
$$ 105 44 117 262 209 94 61 56 186 274 227 135 198 122 186 73 41 281 144 141 213 190 141 139 111 176 161 149 56 108 141 224 200 110
2768A10j1P8j0q2J69j27j4J5N4j21O7J8%r0m9M4K9M3k9n7P4j01M0J00p5n1P2R5l9J54j72p3
$$ 110 99 177 167 85 254 127 113 128 182 61 128 146 146 56 7 51 80 123 94 37 111 10 50 150 75 24 96 191 152 306 134 61
2392F1kJ62K8k40J32L9J50j25j46M7J0K0J8P0k2j22J29p6n7J40j39nL2J3M0j2j01J09j2q8
$$ 61 59 221 249 9 141 180 330 205 59 106 116 136 154 224 202 80 209 133 76 216 77 72 104 117 157 145 44 153 141 53
2040E3J0J7J23j49K42j11j3k8q8P6M2o1Lm9J77l8j33L8Q0p0LL9M9o4q7R7m8P2j40J69L1j82
$$ 53 63 80 203 54 296 185 172 144 56 132 174 113 116 67 244 206 73 111 191 121 124 163 212 148 61 158 110 182 42 211 242 60
1664F0JQ5p4J24j66J07jp3LJ23o2J58p5o1K9M8L3j26Jp2K5k7O8q0qJ5J41l8j1P5j57LJ33j62
$$ 60 61 146 72 196 30 137 136 63 66 189 127 285 210 149 178 226 259 133 134 62 87 60 128 48 40 55 196 158 147 222 65 68 201 39
1265C9R6Rl2l7J09P2j46J5J74p3n8n0n5O4q3J70jo3r8J7m5J48qn6n3J80k2j83J10m9O6j4p3
$$ 39 135 144 112 75 184 256 110 125 299 226 168 118 63 127 44 214 213 150 52 69 24 172 164 108 55 235 213 30 140 91 157 143 70
878G0j2J1N1l1Q4q7J7P6j15RP5J01q9J6p2k2l4R0r4Nj1Q8mKnmO1M6j03R2q1p9%J7L1m9Q7J40
$$ 70 58 69 120 89 173 86 103 179 64 73 148 249 160 176 104 82 48 138 44 49 38 126 122 124 119 115 176 222 119 211 130 51 51 68 99 50 137 277
432B77k20J52j04K2J7jp5J65j50m1O1k4j8J0R4r3K4M3L7j11N6o1L3L8r5J88J79p5p4Lp1j05
$$ 277 57 209 105 127 144 143 68 233 83 42 103 79 61 71 165 72 96 139 176 65 121 60 93 131 36 224 403 328 254 257 186 81
56H1J24l1j29J9J36o6O3J0q3q8R0Q8k3m2m1Q2Q5k16M7p5P
$$ 81 205 174 45 64 200 134 197 207 124 36 126 214 191 149 108 190 275 59 106 31 38
-190C8
##PAGE=	F1=-190.634
##FIRST=	25169.313707327481097,	5807.6787752999953227,	0.068733945488929748535
##DATA TABLE=	(F2++(Y..Y)), PROFILE
5808A22q6L9J32K8q0L5o5q9oL8N7q5K5K0J9P6LR1k43J14q6R5j7j06J14J39O3k10j29M5N7J06
$$ 122 36 75 207 235 155 190 125 36 30 68 125 40 65 85 104 180 183 274 31 145 59 154 137 31 145 284 347 137 8 53 110 216
5432B16k2nj21jn2J45J9p4J02j13r1K8k2R3J7O7j4j1o6Q3n4J47r7j53R5m4J0j1R1N8j7j23
$$ 216 194 189 68 67 15 160 179 105 207 94 3 31 9 102 119 186 172 161 95 178 124 271 174 21 116 72 82 71 162 220 203 80
5056H0k4J5jJ3J13o4j01J18j8r8J51Q2j16m7N4l0n1J14j75J45n4J2N4j11J50l9M7j75J35l5
$$ 80 56 71 70 83 196 132 31 149 131 33 184 266 150 103 157 127 76 190 15 160 106 118 172 61 211 172 219 44 179 144
4704A44J22k14P3j4J90j56q7O2j0M2k8j1l5J03o7mo5O0p0MJ16K00k6k01nnO0P5j03J4m5J8
$$ 144 266 52 125 111 301 145 58 120 110 152 124 113 78 181 114 110 45 105 35 39 155 355 329 128 123 118 178 253 150 164 119 137
4329A37j16N2Q5N0l0k5Q0j50K65j26J07o3k28Q4O4j45J56n6r3Q2P7m9j6l5M1j7q3K8M3J80
$$ 137 21 73 158 208 178 153 233 83 348 222 329 266 38 122 186 41 197 141 48 130 207 158 142 107 148 131 48 76 119 299
3977B99j17j14k9NOM4m2J13j6P9j19R2n5KO3J2j71M0J10Mpn3L3o8oq5J97Q7R9k89R5k3o5l8
$$ 299 182 68 39 44 50 94 52 165 149 228 109 201 146 148 211 223 52 92 202 206 199 146 179 111 105 20 217 304 403 114 209 186 121 83
3578H3M5J24oj64M1Kk0ol3R7o9J07q2K8k7PK8kK8J9j01J8q2K4P3L1k8J05j22j7o6J65j07o
$$ 83 128 252 246 82 123 125 105 99 66 163 94 201 119 147 120 127 155 153 181 200 99 117 35 59 132 163 135 240 118 101 35 200 93 87
3178H7R4j17n4Q0K34p0j64j5J6N7R0m1k6M9q7P5r5j00K45j25P3K64p3k52j3nQJ9j1j32O8M3
$$ 87 181 64 10 90 324 254 90 75 91 148 238 197 171 220 133 208 113 13 258 133 206 470 397 145 132 127 135 154 143 11 79 122
2803A22Q8pn2l1M9O3o7n7L07j43j52pJ1K1O5k1j28n3L6L9QJ5n7L2j7LJ11j19m7O8R5K0J70
$$ 122 210 203 151 120 169 232 165 108 415 272 120 113 124 145 210 189 61 8 44 83 91 106 49 81 64 67 178 59 12 80 175 195 365
2416C65k28m1l6J02M2j56J13nJ19j12r0K1K0K5j5P8K4j79J50r0M6J05j45o8R1n4R7n7p4J02
$$ 365 137 96 60 162 204 48 161 156 275 163 73 94 114 139 124 202 226 47 197 107 153 258 113 45 136 82 179 122 48 150
2063A50n8nQ1o7K05J14Q22l62n62k64Q2mJ03j52Q8j49K11o3j02K4J00Pj5k6L2q2l2P8l9O0
$$ 150 92 87 168 101 306 420 1242 880 318 54 136 132 235 83 171 22 233 170 68 92 192 199 184 158 190 108 76 154 115 175
1711A75j68J98R5k63O8Mn9J45j35J32l5p3n3J51m0J44j28j8M6P1Jj02l4q8O2J3m4l7M9MJ13
$$ 175 7 205 300 37 105 109 50 195 60 192 157 84 31 182 142 286 158 140 186 257 258 156 122 34 96 109 65 28 77 81 194
1347A94l4l4J4n8RJ17j88J21kn0jO3J32j27o8K18n5r3k6k8K4j14K14j0n6j09L6l3J37Oq1l9
$$ 194 160 126 140 82 91 208 20 141 139 89 88 151 283 156 88 306 251 158 132 104 128 14 228 218 162 53 89 56 193 199 118 79
972G9J28l3j31J22m1M7J5o8o1J3K9lO1o1L7R6j36l8N0R7o4K5n1j04L2R4r9L7k7R7m0J0P1m5
$$ 79 207 174 43 165 124 171 186 118 57 70 99 96 157 96 133 229 93 55 105 202 138 163 112 8 40 134 35 72 45 142 102 112 183 138
573A38K0L0n6Q3q7j01PL3L8m6Q6J04j67J42r5om5j5LJ18r4NL0n6l9N8K7rm5P0M7r9lj7K3%
$$ 138 158 188 132 215 128 27 34 67 105 59 145 249 82 224 129 123 78 63 66 184 90 95 125 69 30 88 115 106 61 131 178 79 76 59 82 82
150H2l7J80J83o3q1mp1j28J33n0j37J5J61j6M5J4r1r0P7P3n3j4k6P1P5j75N3r6O
$$ 82 45 225 408 345 264 260 189 61 194 144 7 22 183 167 212 226 135 45 122 195 142 128 102 173 248 73 126 30 36
-190C6
##PAGE=	F1=-292.892
##FIRST=	25169.313707327481097,	5807.6787752999953227,	0.19493673741817474365
##DATA TABLE=	(F2++(Y..Y)), PROFILE
5808A47q5pJ76K6j00N2n7q6pMO6o1LL1k5Q9j9P0j98R3j8L7J8j36J07J85M1j97j17K1O8J02
$$ 147 62 55 231 257 157 209 152 66 59 63 129 68 71 102 77 166 147 217 19 112 94 131 149 13 120 305 346 149 32 53 121 223
5432B23p8K7r4k9j1J09K0n5J23j53j5l1L0K2l5J05j2n6L4K9O4M8j43m2M7n6KMQ5L7j1j41J0
$$ 223 145 172 78 49 38 147 167 112 235 82 67 36 66 88 53 158 146 90 124 153 217 265 122 80 127 71 73 77 162 199 188 47 57
5045E7J3l7L3J18p4l4J31p2j05J60R1j21q7O0j0m1R4j02Q9p0NL3j06K37p3L3j34P4J7J08k14
$$ 57 70 33 66 184 110 76 207 135 30 190 281 160 73 133 123 82 176 74 163 93 98 131 25 262 189 222 88 162 179 287 73
4681G3M4o1K13j31l6mk0M4Nl9KJ17l1q6p1R0r9L0J66J92q4k37M3pO4P6j16L2n4K5j29N3J32
$$ 73 117 56 269 138 102 98 78 122 127 88 90 207 176 90 19 109 10 40 206 398 314 77 120 113 177 253 137 169 115 140 11 64 196
4294A96K2m3j2K5j33K28j29J89r2j88R6M0j64J28j8j37J43O5o3J7q0L2M5l4n3R7J65r5j77
$$ 196 218 175 163 188 55 283 154 343 251 63 159 199 35 163 145 8 151 216 153 170 90 122 167 133 80 177 342 247 70
3953G0J6Mm1J3m6J58jL6o9K3K1j5L0J1j95RJ65N2q9q3J13n7k2p9J75Q3J28k95O7J8p4n9M6
$$ 70 86 90 49 62 16 174 173 209 140 163 184 169 199 210 15 24 189 241 152 69 182 125 103 24 199 282 410 115 182 200 126 67 113
3566A13J42j5j19O1l5k9K6n1K8p7J59p1nrK9j1lO9k1j17J4n4L9O6K7m3J42r2j10m4J75j34
$$ 113 255 240 121 182 147 118 144 93 121 44 203 132 127 118 147 136 133 202 181 64 78 24 63 129 156 113 255 163 53 9 184 50
3190E0O9N7j31j3M3K96q1k08jP0k3O5l9N3L7j18P8o4r2J51r2J37K60j10k44k2Rn3N2rj14R1
$$ 50 119 176 45 32 75 371 290 82 81 151 128 193 154 207 244 126 204 140 48 199 107 244 504 394 150 128 137 84 136 127 13 104
2815A04J6O3Pnm8J7J31k2PL26k27k79RJ02l0P5l3j54k1M4Mk2N5n0oL9J0P5j26m8M3Q7P8J74
$$ 104 120 183 190 185 137 154 285 263 270 596 369 90 99 201 171 246 213 59 38 82 86 64 119 69 63 102 112 187 61 13 56 143 221 395
2416C95k69j4m7L8N1n5O8m5P6r6oKJ4M0l5Q0N0k21J42n6J15N7j42j12R5p3J21o3n5Q7p2O1
$$ 395 126 112 65 103 154 99 167 122 198 102 96 98 112 152 117 197 247 26 168 112 227 284 142 30 125 52 173 110 55 142 70 131
2040A31Q7p8K16J73R90l98p87k93J35j7R1j70J19j47J68o8q1K9R8O8m4r8K2p6J4M1k1N0j33
$$ 131 218 140 356 529 1519 1121 334 41 176 159 250 80 199 52 220 152 71 100 198 266 222 124 146 70 84 125 104 154 21
1700B1J72J30k43P5q9k5J34n0R4n9j7k2M6k4J28j75M7J08M0m7r0o4p5Q5M6q7%L9j6Q4J2n9
$$ 21 193 323 80 155 66 41 175 125 219 160 143 121 167 143 271 96 143 251 291 244 154 90 15 100 146 59 59 98 82 166 178 119
1324A19p4M9kJ04j75J17j3o7M8KJ84r8j50K41j3j14rnk0j04K12j6m3q4K0j8J03K5r9jN2n7
$$ 119 45 94 92 196 21 138 125 58 106 108 292 194 44 285 272 158 149 144 124 20 232 216 173 89 109 91 194 219 120 119 171 114
948A14n4J19j5mN6o8r2L6LRJ8j0P2R3j45q7L1P6m2L6j1m3m0J06j35P9n4J10p0K0J22q6qK2
$$ 114 60 179 164 160 216 148 56 92 95 104 122 112 184 277 132 45 76 152 110 146 135 92 52 158 23 102 48 158 88 108 230 144 136 158
549A58j9M5q7o4QL7L2k8O6O0j09J12p8j8m3L7l1N4l1M4J0n2lK8o5P3j03R8L1p3j1k3J4k2k
$$ 158 139 184 97 33 41 78 110 82 148 208 99 211 133 115 72 109 78 132 101 145 155 103 100 128 63 136 33 131 162 89 78 55 69 47 45
138D5J80J68m7q2qo7j24J15p9m4J7Q7L5M2Or0r9P8M4p6kJM1O6j11N2q1k0
$$ 45 225 393 346 264 256 189 65 180 101 57 74 161 196 238 244 154 55 133 177 101 99 100 141 207 96 148 67 47
-190D7
##PAGE=	F1=-395.15
##FIRST=	25169.313707327481097,	5807.6787752999953227,	0.29956459999084472656
##DATA TABLE=	(F2++(Y..Y)), PROFILE
5808A64q3n2J99J6r7O5n6p8Qk6P5l7l2N8p3J00m3M3j23R0L7o9N2j19R1K29j9j71p0rM4Q8j10
$$ 164 81 29 228 244 147 212 156 78 86 60 135 98 66 124 51 151 108 151 28 118 155 86 138 19 110 339 320 149 79 70 114 202 92
5420I2M6n9m8L8P8Ln1J37j78P6p8N0n2l3J19j5L9j6l3J81n2j84Q7K9p6k5J5Q1J6k4j52O5n
$$ 92 138 79 31 69 147 150 99 236 58 134 56 106 54 21 140 125 164 148 115 296 244 60 147 176 100 75 90 171 187 163 11 76 71
5033G1m1L5Q8p0L1J31j09r9J46Q7j10q0M7oj5O9n4K9l8k5lj5K01q0J2q2K4P0J01k32L7p5J87
$$ 71 30 65 153 83 114 245 136 37 183 270 160 80 127 121 106 175 121 150 112 87 84 69 270 190 202 120 144 214 315 83 120 45 232
4646B32q2j2n3k3K8K8m0L7J11J5j85M1J1o9J7K02J51j46j84O4j7L2Q0r8L9p6M3j04K6J62j3
$$ 232 150 138 85 62 90 118 78 115 226 241 56 97 108 39 56 258 409 263 79 143 126 158 238 140 179 103 146 42 68 230 217
4282B17n3Om4j4R1j10K53j12j35P7J2j67J40Oj14J14M8o9N8j22J0R1K0m4O1J44o9k36Q5k0
$$ 217 164 170 126 112 203 93 346 234 99 176 188 21 161 167 53 167 215 146 204 82 92 183 203 159 220 364 295 59 144 124
3930A24p5j0l4J61K1j5jm9J03k6j0Jj44nJ31Q4j24q0J24m0m0k7J03O6J50k66QO2m8r0N4J49
$$ 124 49 39 5 166 187 172 171 122 225 199 189 190 46 41 172 256 132 52 176 136 96 69 172 238 388 122 130 192 144 54 108 257
3554B57j6j13P6m6j8M3p6km2J20m7l5qP3n6lR1p2n4k2K6mM6Ol2J61o7j52QJ05j34J32K3j06
$$ 257 241 128 204 158 140 183 107 105 63 183 136 101 93 166 110 107 198 126 72 50 76 72 118 124 92 253 186 34 42 147 13 145 168 62
3155F2rN8K78q9j99k1J18o0L0n3J13L9j59P8l5n7K1m0J69J21j21r7Jpr3N6Pr6J33j5J4J6K7
$$ 62 53 111 389 300 101 80 198 138 168 115 228 267 108 186 151 94 115 75 244 365 244 147 148 141 48 104 111 15 148 133 147 163 190
2768A90m0j1J78K5r5J82j57k05P6J25p0M7l6j51K0M1l4k8O9m2l7O5K1M5r8o0J7O9J25J66k91
$$ 190 150 139 317 342 247 429 272 67 143 268 198 245 209 58 78 119 85 57 126 84 47 112 133 178 80 20 37 106 231 397 106
2404A06No1K4L6L1J3p1L5o8Q1j0j8O5n1Q1N9k25J00OJ38Rj27j27N6k7Q2m5n1R0o8J09L3l9
$$ 106 111 50 74 110 141 154 83 118 50 131 121 103 168 117 198 257 32 132 138 276 285 158 31 87 60 142 97 46 136 68 177 210 171
2016A71J52K3N77j99m71j65Q1K8K8j32R8p8Q6n0p3M4Q4J02p6j65L2o0N1jj3L7q0J51J26j96
$$ 171 323 346 923 724 253 88 169 197 225 93 191 113 199 149 76 120 204 306 230 65 97 37 88 87 74 111 31 182 308 112
1664A12R5j81K7Q7M2L3p2N3pl7j6J08k07J11J70kj07q7p3m8R9M9n0J1lm8N8R5q6q0P4n5J02
$$ 112 207 26 53 140 182 215 143 196 189 152 136 244 37 148 318 316 209 122 49 1 100 149 99 110 107 59 117 212 126 46 120 65 167
1277A67j14Q3k4n4N6n2K09n9k00K28M5j20j1J8n1p1J73pl2n0j1J0L9N2j04M9l4p1%J24J3o7
$$ 167 53 136 112 58 114 62 271 212 12 240 285 165 154 172 121 50 223 216 184 134 123 133 172 224 120 169 135 64 64 188 201 134
901A34R0p2q0N7k6Nl4M3J10Q7j38j12L2K8m6M8L7j2q5J22j72J19r3J25q6K2J48j18j9L1pn
$$ 134 224 152 72 129 103 108 74 117 227 314 176 64 96 124 78 126 163 151 66 188 16 135 42 167 81 103 251 133 114 145 138 133
526A33r6K9nL5J7qM7J0o1O9n1qOP7r7qL1N6L0m4j2J3j36J31j33J03Qm1J0m6nJ2l0J87J33l0
$$ 133 37 66 61 96 113 105 152 162 101 170 119 111 117 194 97 89 120 176 206 162 150 163 27 158 25 128 136 95 105 59 54 66 36 223 356 326
103C26p7ko4r6P5j15P3j5K4Q3N3j2p5j18R6J0r0lK7ON4m2L7n6m0
$$ 326 249 247 183 87 162 47 120 105 129 212 265 253 178 60 156 166 76 73 100 106 160 118 155 99 59
-190E9
##PAGE=	F1=-497.407
##FIRST=	25169.313707327481097,	5807.6787752999953227,	0.27733492851257324219
##DATA TABLE=	(F2++(Y..Y)), PROFILE
5808A67q0o1J80mo6O6o8n8L3m0P9k3p8J09q7N9n3K2n3J21M5j60O1n6P7K47j02j31j7k7j2O6
$$ 167 87 26 206 202 136 202 134 76 109 69 148 125 47 156 69 128 75 97 44 165 210 50 111 55 132 379 277 146 129 102 90 156
5432A56j11N3k7l0N5N6j7o8J50j92J61j28O7q4M8N2l7J53r5q9K70j33j79J67L2r2m1jQ4Nn6
$$ 156 45 98 71 41 96 152 135 67 217 25 186 58 125 41 89 141 104 257 162 73 343 210 31 198 230 138 97 96 180 185 129
5068A29j05Q5l3OOK1l9P1J25j19r5J16P7r7n0L3mJ4M0l3j7J4o2m0N6J41o1j4l5qJ23R4k58
$$ 129 24 109 76 82 88 109 70 141 266 147 52 168 245 148 98 131 127 141 181 148 131 145 83 43 99 240 179 165 130 122 245 339 81
4681H1M6m4J16j4k0p3j3k1M4kM0Q6O3k29J16o9k5nK23Q6j93o6M2k3k4Q6n8L4r3O4q6NJ79m8
$$ 81 127 83 199 185 165 92 79 58 102 100 140 226 289 60 176 107 82 77 300 386 193 127 169 146 122 208 150 184 91 155 69 74 253 205
4282B05n2J5j18J43l9n6K36j20p7L2j3j29J55J1j07R5J9o0Q9j37k7J02O8pJ5J11m7k66J48
$$ 205 153 168 50 193 154 98 334 214 137 169 156 27 182 193 86 181 200 140 229 92 65 167 235 228 243 354 307 41 189
3941A89m5q7k8j1J26M4o6P2j13J74k6l7rp8j5O8R4r8o6P6k0o0K3L2M2J65k07q4J25Mj48O5
$$ 189 144 57 29 18 144 188 122 194 81 255 229 192 183 105 90 158 252 154 88 164 144 84 107 139 181 346 139 55 180 184 36 101
3566A01J60j8j37P9k8J0L9j08QKM3k1n6k1J20p1mP7j29M9p7J00m1L4l7jJ58n2j31L8Ol8J08
$$ 101 261 243 106 185 157 167 206 98 106 108 151 130 74 53 173 102 98 175 46 95 18 118 77 111 74 73 231 179 48 86 92 54 162
3178A62lp2j7R7J98r4j40n7J39o0K1p8J24O2j95R0l4oj08L4J61m1j19Q1L9m3p5KL8r6J56j8
$$ 162 159 87 70 167 365 271 131 74 213 153 174 96 220 282 87 177 143 137 29 63 224 183 64 145 184 141 66 68 106 10 166 148
2803A48m2J9N9k7k7J90N6k75k3QJR9J25r4ll9j18N3L0o3j5N8l3n0O3K5L0n7p5K3K8J49J49
$$ 148 106 125 184 157 130 320 376 101 78 86 87 186 311 217 214 175 57 110 140 77 62 120 87 37 100 125 155 98 23 46 74 223 372
2416C72k85J1n6P7k8P4l8q2K4PR0j5o3R8p7Q1N8j96N6N8J22k7j00j20L6M1j0l7l6J01l6J00
$$ 372 87 98 42 119 91 165 127 45 69 76 166 151 88 186 109 190 248 52 108 166 288 261 161 41 77 118 108 71 35 136 100 200
2040B00m0L1N2j87l0J77m7krQ6n4o9M8jRj1p9O5O4J07j05j94N9n2Q2j3n9L8k8J37Q1j32J27
$$ 200 160 191 243 56 26 203 156 154 145 231 177 108 156 155 164 153 74 139 203 310 205 11 70 18 100 87 28 66 38 175 256 124 251
1653B51k18M6K6J15l6p6J15lq5oP7j80J24K04l8j65q0k0l1Q0K5J1K6m8q8M8J65j03j6M5j26
$$ 251 33 79 105 220 184 108 223 220 135 129 206 26 150 354 316 151 71 51 20 100 125 136 162 114 26 74 239 136 120 165 39
1289C9Q3l3O1l6j6K1r7J91j0j62J47R7j14l2M5m9n5J23J9k8j6n5N7m7P8q4R9j11nn5J44K5
$$ 39 122 89 150 114 98 119 22 213 203 41 188 285 171 139 184 135 80 203 222 194 178 123 180 133 211 127 226 115 110 55 199 224
913B24j14J02q4k7O5n4j1p7P5J49Q3j17j16L4np8O7P0k1r7J39j88J41j26J31q1QJ49j26k9
$$ 224 110 212 128 101 166 112 101 24 99 248 331 214 98 132 127 49 116 186 165 68 207 19 160 34 165 84 92 241 115 86
561H6N8j4l5m8P4l3L7qKL8l9l4K6j8K4L0J08j38n1P3M4R2n4n9J3j56J46j21O8lj3J8k6n1O2
$$ 86 144 130 95 47 121 88 125 117 119 157 118 84 110 92 116 146 254 116 65 138 182 274 220 161 174 18 164 43 111 108 95 113 87 36 98
150I8n8J76Q6j9o8K1o8o6L5j24J68p8k0J27O8l4m5j34J19k5r1j2M4k0L6K6kk2n4
$$ 98 40 216 302 283 215 236 168 102 137 13 181 103 83 210 278 244 199 65 184 159 68 56 100 80 116 142 140 118 64
-190F4
##PAGE=	F1=-599.665
##FIRST=	25169.313707327481097,	5807.6787752999953227,	0.20587642490863800049
##DATA TABLE=	(F2++(Y..Y)), PROFILE
5808A50p2k2J22l4oM7r4j8N3l5P2k0j27J79p4k9m6L8k3J52L3j73LK2Q0K33j85p7K5m4p2M0
$$ 150 78 56 178 144 138 185 91 73 126 91 163 143 16 195 121 92 46 84 61 213 246 73 76 98 178 411 226 149 174 130 58 98
5432I8o8M6k1J0N3L4k1q4J42j69J91j77R7n5N8K1p2K32j54j14K98j78q7J43M3r6m4l9Q8Pq7
$$ 98 30 76 55 65 118 152 131 47 189 20 211 34 131 76 134 155 83 315 161 47 345 167 80 223 266 170 126 87 175 182 95
5068I5l6R2o6L7jm7RP4J18r9j05P8P7r8j0J2J6L2J0l4m1N9q7o9R3P9l0l7lk4J71Q4k77N9j0
$$ 95 59 151 85 122 121 74 83 157 275 176 71 149 226 128 118 130 146 178 188 154 113 172 85 16 109 188 158 121 118 94 265 349 72 131 121
4657A21N9N6n2r0jn9N6L4K8N0J11k20J47j30J4l6K33J1j97L1J8k0q4Q9j2K1r5P8p2j5J84p4
$$ 121 180 236 184 94 93 34 90 124 152 202 313 93 240 110 124 88 321 332 135 166 184 164 80 169 157 178 83 161 89 74 258 184
4282A84l6Jr3K12r6l0J64j05l0k9l2o5J48K0j12R2k2l4R9j24o9P6R6N0k2O5k9k58J90o1p7
$$ 184 148 149 56 268 172 142 306 201 171 142 110 45 193 213 101 193 171 137 236 112 43 119 215 265 243 308 279 21 211 150 73
3918G3l5jP8O1j09J35j56K16j9m0rl4m4L1Q3m3q4M5Qq9O9l0J5J74j30j31J55M9k24O7J85k3
$$ 73 38 37 115 176 67 202 46 262 243 203 194 160 116 147 230 187 103 148 156 67 136 106 121 295 165 34 189 238 14 81 266 243
3542B43j68N9OM8J9j33L7K1j7%o3l9J48l5lJ6q8N4p0J20q1L8r7M2J38m8q4O4r8Q3O3k9m0j5
$$ 243 75 134 140 188 207 74 111 132 115 115 52 13 161 126 123 139 51 105 35 155 74 112 15 57 195 147 63 127 29 112 175 146 106 91
3143I1J18Q6r9m5p7J20m4L8q8Q2J06k24J28p2M9j12K5J15r7n5J10O0p9l6l5M3o8J00J4q5J7
$$ 91 209 295 196 151 74 194 150 188 100 182 288 64 192 120 169 57 82 197 100 45 155 215 136 100 65 108 40 140 154 69 86
2779H6J03l7k4J60O3k87J88j36nJ00J10j00m3n7p0P3J4p3jL9k5l3L6J4L6k3q1M5j5J46J26
$$ 86 189 152 128 288 351 64 252 116 111 211 321 221 178 121 51 124 138 65 64 103 78 45 81 95 131 108 27 72 57 203 329
2416C29k48Qj7J09q3P4p5p9P5M2O0k1j01J31j13P2N6j47M6P0P3m1o9r8O0P0n9p9k1J20QL3
$$ 329 81 89 72 181 98 172 97 18 93 135 195 174 73 204 91 163 219 72 118 188 261 220 151 53 113 183 124 45 24 144 152 185
2040A85q7R6l7J0N15j62m05R8p4J04j16oj3N8n2M5r4Q3M0R0j28o4ql5Q6jr7M5j8J08J8o3J52
$$ 185 98 194 157 167 682 520 115 213 139 243 127 121 108 166 114 159 65 148 188 278 150 86 78 43 129 128 31 76 58 166 184 121 273
1653B73k03M0rJ32r4o6J45j1j00J9L6r2P5K00o3k01k3L3m9N8jO2M7p7p3L0J53j03L2M8j15
$$ 273 70 110 101 233 139 73 218 207 107 126 162 70 145 345 282 81 58 91 42 100 99 161 208 131 58 88 241 138 170 218 103
1289A03k3M7N3m0lnj10J05M0j01Q6J22j04o2P7j5o4P6M6l1J0r7J13j26Q3l5J37j57P0j52J66
$$ 103 80 127 180 140 137 132 22 127 167 66 152 274 170 108 185 170 106 182 228 197 207 110 223 97 180 145 282 125 195 43 209
925B09J6j26Q9j00M0O3q0k7m2J5J93Q1r0j14K5j6j07R8O9o5p7J58j81J35j30J17n1k5J23q5
$$ 209 225 99 188 88 128 191 111 84 42 57 250 331 241 127 152 136 29 127 196 131 54 212 31 166 36 153 102 77 200 115
573A15o6R4k0j1K9N3q3M9l1nL6p6l0j1J7O7L1J23j48p9Q4L4J66p3j36L0j51J40o4lLQJ0K4
$$ 115 49 143 123 112 141 194 111 160 129 124 160 84 54 43 60 127 158 281 133 54 138 172 338 265 129 159 8 148 84 81 84 92 102 126
174A26j04R3l3J26L4j9o0N8p8l9jk6J53j54n3J67Q1n2j3j24J31n8p8j6M0l0J2Q8o8K3o5
$$ 126 22 115 82 208 242 223 163 221 143 104 103 77 230 76 23 190 271 219 206 82 213 155 77 61 101 71 83 171 103 126 61
-190F1
##PAGE=	F1=-701.923
##FIRST=	25169.313707327481097,	5807.6787752999953227,	0.17568667232990264893
##DATA TABLE=	(F2++(Y..Y)), PROFILE
5808A17o0L2O8p3O8K1j03J6N3k4N7k7j22K06n6j23l5Q8k8J64K2j43o5Q9Q4J96k46j7M7o3r7
$$ 117 57 89 157 84 152 173 70 86 139 115 172 145 23 229 173 50 15 103 75 239 261 118 53 142 226 422 176 159 206 143 46
5444D6NKL0m6N0N0M%n4P1r8J45j76J09l1L9K4q3K41j83r1K47j81jJ01N6q4m5q7R0J8r8K5J06
$$ 46 51 53 83 37 87 137 141 141 87 158 60 205 29 138 107 146 170 87 328 145 54 301 120 119 220 276 192 147 60 150 168 70 95 201
5045B01j07M3J2n8J6N4J13n9j24L5J00j23L6j4M9L6k0n3m1Q2q2q3Q9L3jn6Rk1K00O8k74O9
$$ 201 94 137 149 91 107 161 274 215 91 126 226 103 139 125 174 210 190 137 96 178 96 13 102 135 134 78 87 66 266 334 60 129
4669A29K1L5J03r4j22J0m2N9L2K1PJ52k02J66j63M3p4K30n2j38N8Oj1j12O7K8Mq5P8n1m3J84
$$ 129 150 185 288 194 72 82 40 99 131 152 159 311 109 275 112 155 81 311 259 121 179 185 174 62 129 157 161 76 154 103 60 244
4294B44q4j9l5L7J82j10m6R6o3kr9m1QJ10M0j17J02p2NQ8r5r3K2R0J19m2Rj1k21K08p0n1l2
$$ 244 160 141 106 143 325 215 169 265 202 200 101 60 68 178 218 101 203 131 136 224 129 36 58 148 267 225 234 223 2 210 140 89 57
3906E7OK5O5j36J73j45J94ok5jj2q1K0O2J3j20M3M3j29J07p4rJ76n1p3R7P1k49NK22k8j73
$$ 57 63 88 153 17 190 45 239 233 208 207 195 114 134 196 209 89 132 175 46 153 79 70 246 195 122 219 290 41 46 268 240 67
3531F7JM1Q9j2j20N4J0m1J3n9oR6L3lo4M0l9RQ9j39N4p1RJ01n3k4Q4j04J15J9o6j2JJ10l5
$$ 67 68 109 198 186 66 120 130 89 102 43 37 133 166 163 99 139 100 109 198 59 113 42 51 152 99 75 159 55 170 189 123 111 112 222 187
3120A87r7O5o2O2l1O2o6KJ66k53J96j35R2p7qN4q3m8J49N4j01lk2Ol0j1P6r3J8J30o8nR6M7
$$ 187 90 155 93 155 124 186 120 122 288 35 231 96 188 111 103 157 74 26 175 229 128 125 103 109 79 68 144 51 69 199 131 126 222 269
2721B69j08K26k17o6J13Q0q9m4j01k1P7no4J1J7j3mQj1N8po2M7l0J23Q7j81LPJ14j07N2r2
$$ 269 161 387 170 104 217 297 208 164 63 42 119 114 50 61 78 65 61 69 58 116 109 47 94 64 187 274 93 96 103 217 110 162 70
2333G0n1J12N7K4k9j20J55j53N1O2r3O8N0Kl1m4p0P6R4m0j14p4J54M3m7o1Q2o6J16O12j87
$$ 70 19 131 188 212 183 63 218 65 116 178 85 153 203 205 174 130 60 136 230 190 76 2 156 199 152 91 173 107 223 835 648
1970F48n52J54r5O8j39N0p3Q4r6J31j29Q7J4O9j40O9o0j1Q6Kp8L4l9O4l4nJ56j58L5%Q8j29
$$ 648 96 250 155 223 84 134 61 145 49 180 51 138 152 221 81 150 90 79 165 167 89 123 84 148 114 109 265 107 142 142 230 101
1594A01k0J07k9r6N6qmK0J60p2j76O6J6n7L3PO5P2q0m4J3Q2q5O7O8p0j02P9M0l3j4qj05J7
$$ 101 81 188 159 63 119 111 107 127 287 215 39 105 121 64 97 104 169 241 161 117 130 212 127 194 262 192 90 169 209 176 162 154 49 66
1195F6M8l6P1J07r4r4J15L1r0M0O1l9K8j28J71j61L8L5J58j71J12k26J73j4j07P2j22J00M8
$$ 66 114 78 149 256 162 68 183 214 124 164 225 186 214 86 257 96 134 169 327 156 268 42 215 201 94 166 44 144 192
854A92r8m1L6p9K37P7p3j06Nk1r8J21L4j27j4J57j50R3r2Q3pn8O7Oj33J27k0K8Q5M1j51O3
$$ 192 94 53 89 10 247 324 251 145 150 129 31 152 186 59 45 202 52 145 53 136 129 71 138 144 11 138 118 146 231 272 121 184
479A84l0k6K6q8j5j4mJ04L3J12j38j00O8O2K03q5k32P1r7Q7J7q1J5J8J0O0j39R1K6O7j3l5
$$ 184 154 128 154 66 51 37 33 137 170 282 144 44 112 174 377 292 60 131 34 121 138 57 72 90 100 160 21 112 138 205 192 157
103A57n5R9q6k1l2P4J23k20J5J08Q1o1Rp0J19q9n0j0J9l8rJ39j48P6p9
$$ 157 102 201 115 94 62 136 259 39 54 162 243 182 191 121 240 151 101 91 110 72 63 202 54 130 51
-190E1
##PAGE=	F1=-804.181
##FIRST=	25169.313707327481097,	5807.6787752999953227,	0.19532008469104766846
##DATA TABLE=	(F2++(Y..Y)), PROFILE
5808G4m2Q8L0j17J34Pm9oK9j7L8m0o9J86l9j60j6Q7l7J63J9j06r2J13Q2J43k65L6M5q2p2p
$$ 74 32 120 150 33 167 174 125 119 148 131 169 129 60 246 207 47 31 118 81 244 263 157 65 178 260 403 138 174 219 137 65 58
5432E8J6K3p2Q1M6l4M4j4j8m0Q3p8O5m1ON3m4J69j88m8J52j32M8N7P0n6n4j19P5L6q1P4J14
$$ 58 74 97 25 106 152 118 162 148 130 90 173 95 160 119 125 178 134 303 115 67 219 87 135 192 262 206 152 33 108 144 63 137 251
5045B51j53K4L9k3j0K0J17j5j40j5J39j54P4l1Q0L4n0q8k5Q6m5p7M9QJ6o4JkJ97N0k40P3M3
$$ 251 98 122 161 138 128 148 265 250 110 95 234 80 154 123 203 237 187 99 74 160 115 38 87 95 111 47 48 46 243 293 53 126 169
4657A69M6J11j32j58J0K3N7mK3l7J78j88J77j72O5j14K14r0l9L5%jr0J6N2j4p3O7j6q1J80
$$ 169 215 326 194 36 46 69 126 122 145 108 286 98 275 103 168 54 268 178 139 174 174 173 83 99 151 137 64 131 115 34 214
4294B14p8j9p3J78J36j12p7N3pPj56m5P6M2O8j09J08j15M5O1n1j01L8j2J72n3m0J3j44J67
$$ 214 136 117 44 222 358 246 169 222 215 222 66 21 97 139 207 98 206 91 136 197 146 45 83 71 243 190 150 163 19 186
3941A86p5j8j7Rj1N7j07J39q5J14ROkqj11L2L4O6j59N6Q6j72J31r8k6J69J6k5M8P8k35m5K18
$$ 186 111 93 76 85 74 131 24 163 78 192 201 207 205 197 86 118 152 218 59 115 201 29 160 62 36 205 221 196 244 322 87 42 260
3554B60k6j49n9N2J19n0m8M1l5k2J9n5K2L6R9pj36J52j27J04O0k16P6k3l0N5o2L0R5o1J04
$$ 260 234 85 26 78 197 147 99 140 105 83 102 47 69 105 204 197 61 213 86 190 250 34 110 87 57 112 50 80 175 114 218
3190B18j2j17J6K3P5j43j5J01k5Om0P8j5r4K29k81K80j81R0n4l0rk9M0Q8K7j07K2%l8J3p7
$$ 218 206 89 105 128 203 60 45 146 121 127 87 165 150 56 285 4 284 103 193 139 109 100 71 111 199 226 119 141 141 103 116 39
2815C9R3p3K4J09r6K5J7J2QJ31j88l8J51L2o4j1j52L2N3l3l8K2LPJ0%l1O7qk3K5j1J05J8j05
$$ 39 132 59 83 192 96 121 138 150 158 289 101 63 214 246 182 171 19 51 104 71 33 55 58 65 75 75 44 111 103 80 105 94 199 217 112
2404A12KJR7r0J9r1k4J31P1rl9j18J59j73J8P2n2J04K1p4ol4l3O1J21J3j21r2J21O1n9ml1
$$ 112 114 115 212 122 141 50 26 157 228 219 180 62 221 48 66 138 86 190 211 137 131 97 64 125 246 259 138 46 167 228 169 165 134
2016A34JPL58p6l31J71q7jj29J06j30Q2q2J97j72N6j0P1j00J27j08K5Q2om2J7n5Rl3J4J32
$$ 134 135 142 500 424 93 264 177 176 47 153 23 105 23 220 48 104 94 165 65 192 84 109 191 185 143 160 105 114 81 95 227
1653B27q4K8K6K6j35L5K8m5o3N9n1Q5m2R5o2m8O2j3m8RM4K5R7n7k9j2ln1Q9R1j1j21O5J1j9
$$ 227 143 171 197 223 88 123 151 106 43 102 51 136 94 189 127 79 141 128 80 89 133 158 255 198 169 157 154 103 192 283 272 151 216 227 208
1242B08m0Qr3N3o1KQ6P4r0j16J51P4j25K0N4m7L5j37K18j50m4J07J64j61J20k64J69o0o4O2
$$ 208 168 176 83 136 75 77 163 237 147 31 182 256 131 151 205 158 193 56 274 124 80 187 351 190 310 46 215 155 91 153
890A53j31J21K7j08n1J20o1J83P2q1r8j2l1o0J30j7j28M7J04j01J9j8M8L2p5j9J11j32Q4k3
$$ 153 22 143 170 62 11 131 70 253 325 244 146 134 103 43 173 156 28 75 179 78 97 79 127 159 84 65 176 44 128 105
538A05N3J43L3k07N9km8Pq0M1ro5J08M6Q2j17j23N4J25J73q3k67R1l8L2Q0j17jJ5L2N6j49
$$ 105 158 301 334 127 186 184 136 143 63 104 95 30 138 184 266 149 26 80 205 378 295 28 119 81 113 193 76 75 90 122 178 29
162B9O2R9K4m8o5m9J22q1qn1J48P9k25R1J3O1n5MK4Q9j20j0%Jo2k1J75k09J21j00
$$ 29 91 190 214 166 101 52 174 93 85 34 182 261 36 127 140 201 146 150 174 263 143 133 133 134 72 51 226 17 138 38
-190C8
##PAGE=	F1=-906.439
##FIRST=	25169.313707327481097,	5807.6787752999953227,	0.20800420641899108887
##DATA TABLE=	(F2++(Y..Y)), PROFILE
5808D5k0J22Pj28J44J1K3l9rk1J8n4j0J50k7j21k3N2m1J62K6p9r0J02P1Q2k33O5K4r2l7N%
$$ 45 25 147 154 26 170 181 204 165 156 135 153 99 89 239 212 91 68 120 79 241 267 188 98 200 271 353 120 185 209 117 80 85 85
5420H5J5q0J05L9p6J00J6r5oK9L7K3p5l5R6J4O4j83JM1k8M1K1Q5k3o8p2QM4n1J12J09j98j1
$$ 85 100 20 125 164 88 188 204 109 103 132 169 192 117 82 178 192 256 73 74 115 87 128 149 234 211 143 71 79 123 72 184 293 95 84
5021H4O9K3l4k8J34K5j45p2J79j62P7j9R2L4p9j30QO4J4o5%PK7m6m3L0J53L3j72P1N2P3Q8
$$ 84 153 176 142 114 248 273 128 56 235 73 150 131 223 257 178 48 56 120 134 69 69 76 103 57 14 44 197 230 58 129 181 254 342
4634C42j61j18l3P2N5n3L2o8J82j83J75j65Q1j35J75q8N0J1j3Mn8pL9k4n8M1L4r5J40o0m3
$$ 342 181 63 30 102 157 104 136 68 250 67 242 77 158 23 198 110 160 171 158 162 104 97 136 112 54 95 129 34 174 114 71
4270G1j4K19Q8j04j12M1L8J4j73l7R5l3Q8p9R4j25O4L4nj05R6l6R8p3n4N4j07J05p4J4RJj5
$$ 71 57 276 364 260 148 189 227 241 68 31 126 93 181 102 196 71 135 169 164 59 155 119 217 144 90 144 37 142 68 82 91 92 77
3883G7M3p2Q5k0J8K7M4k2j9j17N8LJ11j74N4J29j90J22r9l8J55O1PJP8j88k6J29j3j25l9K9
$$ 77 120 48 133 113 131 158 202 180 161 44 102 105 216 42 96 225 35 157 58 20 175 236 243 244 322 134 108 237 224 99 60 89
3507H9J03r5M4K6r9K4K3n7L7J8J17j7j82K35j90J83M3k91R0J4m5J5o1N2R8j8Q9k6j70L8M6
$$ 89 192 97 141 167 68 92 115 58 95 113 230 213 31 266 76 259 302 11 101 115 70 85 24 76 174 156 245 219 49 87 133
3143A33K8r7P3rJ6j6n9P2L6j51K51k47L07j97M8m1m7m1J59O8o9qj02M7Qp2N0K3j7o8K3N9j04
$$ 133 161 64 137 128 144 128 69 141 177 26 277 30 337 140 188 147 100 59 218 286 217 209 107 154 162 90 140 163 146 78 101 160 56
2756E6N9n8j0K8L2J7p0J58l1l0K5j53O1Oo8rL6NK8RRl1M1j4J8j4L4J05o8m6Qk6O3l4k1o7k0
$$ 56 115 57 47 75 107 124 54 212 181 151 176 23 84 90 22 13 49 54 82 91 100 69 110 96 114 100 134 239 171 125 133 107 170 136 115 48 28
2322B8J43Q0l3m8j01J40j43kM4l4J45pj36K1m5J9J9J35P9j14r6P5O9J1%j56J20p8P7j81J38
$$ 28 171 251 218 170 69 209 66 64 108 74 219 212 76 97 52 71 90 225 304 190 94 169 238 249 249 93 213 135 212 31 169
1958A69R6p2p8r0J50j50M0K9J78k03j8j1J13k8Q2j52P4O6j4Lqo0m8K2oQ9LJ6N1j9j31O6k4
$$ 169 265 193 115 25 175 25 65 94 272 69 51 40 153 125 207 55 129 195 181 184 176 116 68 90 84 173 176 192 243 224 93 159 135
1570A35k8rj9o4J43r4J1l5P9K8l7k6nQ2l1J17j5k8m7p5oR2J06N2j07M3l5%p0L5o2R0j38j1
$$ 135 107 98 79 15 158 64 75 40 119 147 110 84 79 161 130 247 232 204 157 82 76 168 274 326 219 262 227 227 157 192 130 220 82 71
1171G1J05M5q8j21J73R8j53NK7l9K5j19K42j22j21J62J58j32R7k77J74j15JL7j04R6Qr6KJ28
$$ 71 176 221 133 12 185 283 130 135 162 123 148 29 271 149 28 190 348 216 313 36 210 95 96 133 29 125 133 37 39 167
819A67l9J42O4j14q9j6n0j3J28o9mRK8m0p2P5L2M5p9r0J78j13L8m3O9J93K8k17J3M7o0j0p1
$$ 167 128 270 334 220 131 115 65 52 180 111 107 116 144 104 32 107 139 184 105 15 193 80 118 75 144 337 365 148 161 208 148 138 67
432F7R9k0j06Q0O5N9r6j31Q6J49Q9o6j58K0j3J9R8j17l1KM8L0j39L0J64Pp4r5j4Q9o0Ql1J50
$$ 67 166 146 40 120 185 244 148 17 103 252 341 275 117 137 124 143 241 124 93 95 143 173 34 64 228 235 161 66 52 141 81 89 58 208
33B08K9j77J29m7J4l4l4J41M8j48L5Ror3l2J87j80J06j20
$$ 208 237 60 189 142 156 122 88 229 277 129 164 173 167 74 42 229 49 155 35
-190C5
##PAGE=	F1=-1008.7
##FIRST=	25169.313707327481097,	5807.6787752999953227,	0
##DATA TABLE=	(F2++(Y..Y)), PROFILE
5808F8k2J21oj08J02K8Q7n1n6m0Ko6M6J01k0n7l1Rk9J74K7o9p9P7N4J8j62P2j3q8j7L1pj0
$$ 68 46 167 161 53 155 183 270 219 163 123 125 59 105 206 186 129 98 107 78 252 279 210 131 208 262 280 118 190 177 89 72 103 96 86
5409H6o8J28K9j19J58L5j50pJ5J22rj04n0J01P2l1j87O4n2P4JjR5Lp5jk1Rl3J56P7k32m4Q6
$$ 86 18 146 175 56 214 249 99 92 107 229 220 116 66 167 239 208 21 85 33 107 108 107 202 205 130 129 108 117 84 240 317 85 41 127
5010A27O8m9p9J61N5j39j19J93j29K8K2R3M0j11j51N6J1O9n1l8J5M3k0o7L2P5K0p8O2M8J01
$$ 127 195 146 67 228 283 144 25 218 89 117 139 232 272 161 10 66 77 146 95 57 72 115 95 28 60 135 155 77 139 187 288
4646B88M7j82l9m4N8N2r4L8n4J45j78J49j51R5p3N9l1R3Kl9Lm2J8j0k2j6qQ3o6N0l8q8J40
$$ 288 335 153 114 70 128 180 86 124 70 215 37 186 35 130 57 116 85 178 180 141 144 102 120 110 88 72 64 147 81 131 93 5 145
4258A45J52M8q2j46N3N2L1j53n4R6p5P5l2N8r4N5K8K4j07J29Rmj12NQ2j31K8m6K3L8j5J2L5
$$ 145 297 345 263 117 170 222 253 100 46 142 67 142 110 168 74 129 157 181 74 203 212 208 96 101 183 52 80 34 57 95 80 92 127
3871A27o6N8J7o4M7P9o0m6n2N1l1J46j50J8J65j82Q8q3l7J31P8K0m0P3j15J4J5Qr9k5N5N0
$$ 127 61 119 136 72 119 198 138 92 40 91 60 206 56 74 239 57 145 62 25 156 234 254 214 287 172 186 201 209 110 85 140 190
3495A90j36J14K3j59P1K5n8M9L6Q1k8j93K79k10K14M2l05N6L5m1nn0K7J02J7O8k2j88L0O4
$$ 190 54 168 191 32 103 128 70 119 155 236 208 15 294 84 298 340 35 91 126 85 80 30 57 159 176 244 222 34 64 128
3143A28k0N1L5r2M8j6n4N4N5j35K07k12L26j97Kl1o0RK59P5k14m1q6P4jr6P5J32q3r3J0K0
$$ 128 108 159 194 102 150 134 80 134 189 54 261 49 375 178 180 149 89 98 357 432 218 177 91 165 164 68 143 275 192 99 109 129
2768A29q1O0q5Q7q1K86k7j62R7j09J7L4j31R2l7m1k8L0OM8J3K0l5Nj4M1n4R4J11j40j8K0n6
$$ 129 48 108 23 110 29 315 288 126 223 114 131 165 34 126 89 48 20 50 56 104 117 137 102 107 93 134 80 174 285 145 127 147 91
2380I1K2M1o6j1m4J48P3m5m8q4J05q2Jrl9J78k4j64K7o2Q2NP8J40r5r0L1P9Q9j3k51K25n7
$$ 91 113 154 88 77 33 181 254 209 161 77 182 100 101 92 53 231 207 43 70 8 90 95 173 313 218 128 159 238 327 314 63 288 231
1993B31L71k93n1Kn9j43k3J52j32j7J15J65k15o9N6R1mK0j82J23L5j4M5k8n5r6P2k2N8O9j
$$ 231 602 309 258 260 201 58 35 187 55 38 153 318 103 34 90 181 177 197 15 138 173 159 204 176 121 25 97 75 133 202 201
1629B01O8m0j34P9k2LJq4QR6r1k2j8J01j9n3kOJ03r1J32L3l9q5j09L4P0J08J09o8K1q4K0j01
$$ 201 269 229 95 174 152 155 156 72 80 176 85 63 45 146 127 74 72 78 181 90 222 255 216 131 22 56 126 234 343 275 296 212 232 131
1230A31O7j0Q5j69k9J06K8q9q8J53J03j52k3j9K7l3o9K23q8j27J48J42q6M9k65J86j71Q0j8
$$ 131 198 188 273 104 75 181 209 120 32 185 288 136 113 94 121 88 19 242 154 27 175 317 231 280 15 201 30 110 92
890I2n4N7J9m7K1J08l0J23N4j59q3Oo9K0J16j09Q9j0m3K4q2Q7M2K8p6n8J20q8J4q3R7K12J5
$$ 92 38 95 114 67 88 196 166 289 343 184 101 107 38 58 174 65 154 144 101 125 43 130 172 200 124 66 186 98 112 29 126 338 353
502C53j67p3J01n7mq7J48k9j39L8P2O0p3j01J33J16j9l9m3k5j4L5Q9j03o0rL5Qj02kK04J5
$$ 353 186 113 214 157 153 66 214 185 46 84 156 216 143 42 175 291 272 233 190 165 151 186 275 172 112 103 138 146 44 42 246 261
127B61r7j17K4M1m4L4j1J20j8j19J57o9m8lr3K57Jj65P3J5lj13m5J68j28J00j27
$$ 261 164 47 71 112 68 102 91 211 193 74 231 162 114 111 18 275 276 111 184 199 196 83 38 206 78 178 51
-190E1
##PAGE=	F1=-1110.95
##FIRST=	25169.313707327481097,	5807.6787752999953227,	0
##DATA TABLE=	(F2++(Y..Y)), PROFILE
5808A06l5J05j2r3N8M2J38l6j01p5qn8P4N1k4J2k9l1J7J84J2p3o9N2L2l3q5O9o1o5k8Q1Kn4
$$ 106 71 176 164 71 129 171 309 273 172 97 89 31 105 156 132 144 115 84 101 285 297 224 155 207 239 206 121 190 129 64 36 117 119 65
5409F5m0J44K2j62K06M0j72m5N7J46l0j11mL0J13q5j41P0nK3l0nQ7J2o3N5j6m1k8K05K4k50
$$ 65 25 169 191 29 235 275 103 58 115 261 231 120 116 146 259 174 33 103 98 121 91 86 173 185 122 177 161 120 92 297 321 71
5033G1k6M4J04n5r5J69O9j25q3J11o8n7P7R0N2j37r4N5k6P1l7n1J9N5Jq5L2j2K1J9M5L3J21
$$ 71 45 89 193 138 43 212 281 156 73 184 116 59 136 226 278 141 47 102 76 147 110 59 78 133 134 49 81 69 90 109 154 187 308
4646C08Nj96K1m4N3M2j24L3mR5j50Q6r2N7J3m9M7R2%o4j0m7Q0o8k0M5m1R7l3l4k9kJ61N5K3
$$ 308 313 117 138 94 147 189 65 98 94 189 39 125 33 90 103 54 101 193 193 129 119 72 152 84 64 109 68 165 132 98 69 67 228 283 306
4235C06m4j70P0L0N7j21q6R6o3J9J8J2m9L6N1L0r6J14O0o0j36P0R7j76n2M8l3N9l5O2L0p6
$$ 306 262 92 162 192 249 128 42 138 75 94 112 124 75 111 162 192 96 210 270 210 74 144 241 65 13 61 28 87 52 114 144 68
3859F8N3K0j05N5R5r8o0N3J2p1J65j19k1J91j62M9n7k5J04O7J6o6N6k4N9r4K5n7l9J02jj33
$$ 68 121 141 36 91 186 88 28 81 93 22 187 68 47 238 76 125 68 43 147 214 230 164 220 196 255 161 186 129 90 192 191 58
3484E8J12L5j70O8L1o0O4N8K0k9j63K74j85J83N3k89K2M3k4mo0nJ02M7L7j1j38k7P5n5J51
$$ 58 170 205 35 103 134 74 138 196 216 187 24 298 113 296 349 60 82 125 101 97 37 32 134 181 218 207 69 42 117 62 213
3120B13j1j25O1k4k7N8L2j12J69j85L39j90k3k4n8O2K68P6k97p0o0J07k7j08Q0K29j16j16
$$ 213 202 77 138 114 87 145 177 65 234 49 388 198 175 151 93 155 423 499 202 132 72 179 152 44 124 353 237 121
2791A21j0K3m8J2o5J39q9L85r6j79N2j80O7%r7J33o3j1m0MrP2L2K3m2l4nL8p9J49J12j74j9
$$ 121 111 134 86 98 33 172 83 468 372 193 245 65 132 132 35 168 105 94 54 58 49 121 153 176 134 100 95 133 54 203 315 141 122
2404A22L7p6RP4j02N8p7J42M5m2l1p6O4k0ml6n2J90l0j55NJ8N0M8n6J79p2p7KJ00J32l0k83
$$ 122 159 83 92 166 64 122 45 187 232 190 159 83 147 127 123 87 35 225 195 40 45 63 113 161 105 284 212 135 137 237 369 339 56
2016E6K78q5M89k97j32n9n3j79K7J35r7o1J70J57k12l4O3M0pk9j17Q8nrP2l5l8q4M5j9O0Q7
$$ 56 334 249 738 441 309 250 197 18 45 180 83 22 192 349 137 103 166 206 199 170 53 141 136 127 199 164 126 42 87 68 128 215
1641B15j9P4m1j39P4J8J2jj04M4N7n1Ln5Q2p3o0J2M3J07j38J35O4n8j14k9j1K9R3J51j2jj18
$$ 215 196 270 229 90 164 182 194 193 89 133 190 139 142 87 169 96 36 48 91 198 60 195 259 201 87 58 47 76 169 320 308 307 189
1254A89L7j31R8N4L8j77j3Q2K1r4m6J18R5j07p7o2J49j22j9J54n4p4Q3J24l4rj76J39j55R8
$$ 189 226 95 193 247 285 108 95 177 198 104 58 176 271 164 87 25 174 52 33 187 133 59 142 266 232 223 47 186 31 129
901A29r2K2kQ5l1J7Q6m0J30L3j95q1M9o1J3R8j21J19rq8P2l4M0P0mo8l0M8n8J4o9R8J70j2
$$ 129 37 59 57 142 111 128 214 174 304 337 142 61 110 49 62 160 39 158 149 61 133 99 139 209 205 137 107 155 97 111 42 140 310 298
502B98p5j60J32l4K8j29J77k7j64KN0Q1m1o8J77O0j17j4O0n1k8N9Q0q2r2nojm8k0K01L7j19
$$ 298 223 63 195 161 189 60 237 210 46 48 98 179 138 70 247 307 190 176 236 185 157 216 296 214 122 117 111 110 62 42 243 280 161
115A61j28L8L7o1O8lQ1m9o7J70o6j01J9n1K60n1j59Q7J8Qj15n5J18o2J02j27
$$ 161 33 71 108 47 115 112 193 144 77 247 181 80 99 48 308 257 98 185 203 211 96 41 159 97 199 72
-190G2
##PAGE=	F1=-1213.21
##FIRST=	25169.313707327481097,	5807.6787752999953227,	0
##DATA TABLE=	(F2++(Y..Y)), PROFILE
5808A33m0P6rq3K4M2J72Nj38j20rjL8J2l4O4j0m8P3J75qp9o8M4Nn5m3P0j12j8l0J14J4r4k2
$$ 133 93 169 160 77 101 143 315 320 182 62 53 52 90 102 68 132 122 74 147 322 314 235 167 211 216 161 118 188 76 58 28 142 156 62 40
5397D0J47L1j92K19L4j70j00J25J21l0j05N6n5J26r0p0L3M3m3k4LN0Ml5Q1Mq8k2K54m3k47
$$ 40 187 218 26 245 279 109 9 134 255 225 120 176 121 247 157 87 120 163 120 96 99 149 153 118 199 203 115 93 347 304 57
5033E7K2k9J28o0m7J35O5j09k3Qpq9O8R0O7j46n9O9k4K6l0l0lO6J8j04L8p3N7O7K1J3J28k1
$$ 57 79 50 178 118 71 206 271 162 139 147 140 51 119 209 276 130 71 140 116 142 112 82 79 145 163 59 97 24 81 148 169 182 310 289
4634B89k03L4l9P8K3j30MN0N9j19L2J5k9P3o0M3Q0kp4l4o1J49q9n0J06n1Q7qp9n3R0J59m9
$$ 289 86 120 81 159 182 52 56 106 165 46 78 93 64 137 77 120 200 198 124 90 29 178 89 39 145 94 181 173 94 41 131 290 241
4247B41J2Pj80P5j6Q3p9j15Q3k3m5O4l9j0K2Q8K1o2N0J01p7j09Q3J11k02j0J6q4O3m2J11K6
$$ 241 253 260 80 155 139 222 143 28 111 88 43 107 68 58 80 168 189 127 177 278 201 92 175 286 84 74 90 6 69 27 138 164
3871A64q7M1Pp8K6Q6j13O7Klr1J39j00m0K01j31Qk7qQ3L1Jo8K6O5J02j64J3Kp6J52m2r3N2
$$ 164 77 118 125 47 73 159 46 113 115 112 21 160 60 20 221 90 98 71 63 146 177 178 110 136 201 303 139 152 154 78 230 188 95 147
3472A47N8j42K8M0o6Q0P0m2j4j11K40j35J00P4k52KM3%Qo4j1N4P0%jp3o8O8o1J80n3r5L8m4
$$ 147 205 63 91 131 65 145 215 173 159 48 288 153 253 327 75 77 120 120 128 64 53 107 177 177 176 103 35 103 42 222 169 74 112 68
3073F8MQ0rq5J41j71L43j70k1k7m1Q3K06P8l03r5k8J45n7r9N3K83j22j13l3M6k9m1p2J68j06
$$ 68 72 152 143 58 199 28 371 201 180 153 112 195 401 479 176 81 53 198 141 42 95 378 256 143 110 156 127 86 14 182 76
2709G6L33r2r0M4k06Q7p2l8J67p2j4l3k1k7R0N7J3m3p4J6No2J71J03j76j9M6q0L3L9j11J21
$$ 76 409 317 227 271 65 152 80 42 209 137 123 90 69 42 132 189 202 159 85 101 106 44 215 318 142 123 169 89 122 161 50 171
2333A71j04J23mk6Lp6K9J6j9k3n9J71k6j35j3Q9PJ06j79J75m8o7OJ23J24m8k44K65j38L47
$$ 171 67 190 186 160 163 87 116 132 113 90 31 202 176 41 28 117 124 230 51 226 178 111 117 240 364 316 72 337 199 546
1981E46j85n1p2n7j61K0J13n2q0J86J54j98NN9k0j8n5k5M1m3j6P3j8j2o0ppQ1O9l2O8k8j26
$$ 546 361 310 238 181 20 40 153 101 21 207 361 163 168 227 207 189 134 109 150 107 91 164 146 134 74 67 60 141 210 178 246 218 92
1594I2M3P4o%j01O1M0j7lq6R9j20l0k3Q6J02j24R7N2p3j27N6n5qO2J74M7k4j23N0j66J29J16
$$ 92 135 209 203 203 102 163 203 186 183 97 196 76 46 23 109 211 87 184 236 163 36 92 37 29 91 265 312 288 165 215 49 178 294
1207B94l0j67K7L8K1j07J2O8R1l4j42J4J55j42m8O2j9j5J8J10J5n2p4P1q5P5p4Oo1J61m0N
$$ 294 264 97 124 162 183 76 88 156 247 213 71 85 240 98 50 112 93 78 96 206 221 169 95 166 81 156 82 88 27 188 148 153
831A53O2o2J58Kk14p0Q7n1LP9j01P8Qp0O6%KJ05l1n5j6k1l2M1j3P3Q8n8K6j74Q7QP2j67J63
$$ 153 215 153 311 313 99 29 116 65 68 147 46 124 132 62 128 128 130 235 204 149 133 112 80 121 108 181 269 211 237 63 150 158 230 63 226
420B26j0j74K6j7P9Lm4K07Kj82PJ33o3m7Q0Q4o4j29K0l2j8nl1J72O0j34j12J4Q3j02Q6mM6
$$ 226 216 42 68 51 130 133 89 296 298 116 123 256 193 146 226 310 246 117 137 105 87 82 51 223 283 149 37 51 134 32 118 114 160
33A60n5l1J66n2j35K3K1K29j05j24O7J7K5j05n1N3RJ00j24
$$ 160 105 74 240 188 53 76 97 326 221 97 164 181 206 101 50 103 112 212 88
-190H8
##PAGE=	F1=-1315.47
##FIRST=	25169.313707327481097,	5807.6787752999953227,	0
##DATA TABLE=	(F2++(Y..Y)), PROFILE
5808A43l3L7%p6J5K4J85N8j57j68J3M8k0KPJ7K3qQ9J48k6p1q2N9k8m5m9P9j44L3K3Q7J6j06
$$ 143 110 147 147 71 86 110 295 353 196 28 41 89 69 71 78 95 118 110 199 347 321 250 168 227 199 154 105 184 40 73 96 183 199 93
5409I3l8J41N9k13K00J7j50m9Q2P4rj04J15j13J02n7j8kO8q8MJ4Pj8oP9L2j34LK85j04k27
$$ 93 55 196 255 42 242 259 109 60 142 216 207 103 218 105 207 150 132 130 198 110 114 128 135 117 111 190 222 88 91 376 272 45
5033D5N6p7J42q2LJ21M9r6M0p1K4k8l7R1Q5j18p1R3j5j3l8J6n1Q0K8j15L6n9Q0O8ppJ25k9
$$ 45 101 24 166 84 87 208 257 161 201 130 154 126 89 180 265 147 76 169 154 141 103 119 68 148 176 61 97 38 118 186 179 172 297 268
4634B68j85qm5J36mq2m4N8L9r9L0Q5p3P7l2RO5oo5o3mJ34o3j18J55n5P7J0p4j13J62J51j40
$$ 268 83 75 30 166 162 80 36 94 133 34 64 149 76 153 121 130 195 189 124 61 57 191 128 10 165 110 187 197 123 10 172 323 183
4247A83J1O2j79O8p3J00k6j09L7J2p4Q8o2j4K1J11J2j0l8J17p3m6P0J20j98L2n1o3K1j0J24
$$ 183 194 256 77 145 72 172 146 37 74 86 12 100 38 24 45 156 168 158 120 237 164 118 188 308 110 142 91 28 49 39 163
3883A63K3r2%%l0mN4q9J78p1J5r6P6r1j2J73r9l0JMP1j5j8m2k0J36J34j79l3N8j11J92o9n3
$$ 163 186 94 94 94 64 60 114 25 203 132 147 51 127 36 24 197 98 68 69 73 144 129 111 69 49 185 319 140 107 165 54 246 177 124
3484A24j7Q8j06k2N2q4R6P3q5J2n1J98q5j8J04k00lM8J6K1m1j7k3R1l6jj3p4M3l5J42p8k7
$$ 124 107 195 89 67 119 35 131 204 119 131 80 278 193 175 279 79 76 124 140 161 120 103 80 171 135 134 121 47 90 55 197 119 92
3096I2pm8kJ09m1m2J06j35K97j35Om8k1Q3J03Q5k44j21J4J76q6p2J7K61j11p7n4N1Jq2l9J09
$$ 92 85 37 35 144 103 61 167 32 329 194 200 152 131 214 317 402 158 37 51 227 141 69 86 347 236 159 105 156 157 75 36 145
2721A45j8L8k9Q6O6j95Q3j50M2J77o9m8j1l9oN9Q3rl4j10M7m4lJ43R2j58NL3q0M7pq7J66j18
$$ 145 127 165 136 222 288 93 176 26 68 245 176 128 117 78 72 131 214 205 171 61 108 64 61 204 296 138 143 176 96 143 136 49 215 97
2322I7Q9n9qN0q1J0J5l3J3o1J34j6j13lJ22m4J60k07R2k4o6M8J34O9p2j52K03r2j3K5O0n4
$$ 97 186 127 119 169 88 98 113 80 93 32 166 150 37 34 156 112 272 65 157 133 67 115 249 318 246 94 297 205 192 217 277 223
1946B23o8j22j6R6qo2J57J56j79L8M9p9k8n8N4J7o0n7N1K0J8n1l6kR1M2l5N5j0q6rJ25m5J2
$$ 223 155 33 17 113 105 43 200 356 177 215 264 185 157 99 153 170 110 53 104 124 142 91 55 53 144 186 151 206 196 110 101 226 181 193
1547A93r6O7N0kk9j03J42j46Qn4Q9R5p8N2lp1r5Q5p5mKJ63R7m5r1N2j97J48J64r5j35O0j3
$$ 193 97 164 214 212 183 80 222 76 84 30 119 214 136 188 185 114 19 104 29 25 27 190 287 242 151 203 6 154 318 223 88 148 135
1160A35K6j20P7J0J20K0j90P7J30j27r1l7J3M0l6J03N0n8rPk5P8k1o4o7J79m9j2L5q6K02l3
$$ 135 161 41 118 128 248 268 78 155 285 158 67 30 43 83 47 150 200 142 133 140 115 193 172 108 41 220 171 159 194 108 310 277
784B77k18ON6n2J2N8p3OK9jJ3OqJ32m1l7j5q1j6Q6L1M6J6j24J10j10k6O7J14j71R4K5j68P3
$$ 277 59 65 121 69 81 139 66 72 101 100 113 119 111 243 202 165 150 69 53 139 170 216 232 108 218 108 82 149 263 92 186 211 43 116
385A16j0l7N4k4K16m5j94K8J51o1o3Q3J07n0j73O3ko7Ll8J36P4j38p3l7J42j10N6rK6m2j6
$$ 116 106 69 123 99 315 270 76 104 255 194 131 214 321 271 98 161 159 92 95 57 193 267 129 56 19 161 51 107 98 124 82 66
9F6J47l4j50K6P1K00j47p2K2QM3q4l4J9N0Q0j19
$$ 66 213 179 29 55 126 326 179 107 129 137 180 96 62 81 131 211 92
-190I2
##PAGE=	F1=-1417.73
##FIRST=	25169.313707327481097,	5807.6787752999953227,	0
##DATA TABLE=	(F2++(Y..Y)), PROFILE
5808A34j2%Mo8L3qJ78J05j55j82L1O5n8J3P7j14N8O1Q1J06l5n1j02R1o5l2o5Q6j33M5P4O8
$$ 134 122 122 126 58 91 83 261 366 211 29 60 125 67 80 157 43 101 162 243 349 314 263 161 252 187 155 90 176 43 88 162 230
5432B30Qj07o6J23J04k31J66oj23K1J7J7L7j20J66j26M0mJ5l0P9j10K6L1j1n5J3M8P1j82O0
$$ 230 238 131 65 188 292 61 227 221 98 119 136 153 190 70 236 110 150 146 161 131 210 100 126 157 146 91 104 152 223 41 101
5068A01K73j45j93P1q5J42j20K8J47K4q8R5j06J0L2j25P8J07o5j14J22j5j8p0P3j17J03K4
$$ 101 374 229 36 107 22 164 44 72 219 243 155 250 144 154 186 61 139 246 181 67 189 174 156 86 159 42 145 169
4740A69j12K9k6R0O3k9k6J17k6j40rm8J19l2ql7l0K4p6N9J21q8N0lj0M0j2m6q7P6Q0k3j49
$$ 169 57 86 60 150 213 184 158 275 249 109 100 52 171 139 131 94 64 88 12 71 192 104 154 151 141 181 169 123 36 112 192 169 20
4352B0J46o2P7K0l8j27J50J39j93OJ06j66N6j23R5L8p5pMj7M2j3n4K5P1J6M5j10R7p0L1N6
$$ 20 166 104 181 201 163 36 186 325 132 138 244 78 134 11 106 144 69 62 66 49 91 78 24 49 120 136 181 71 168 98 129 185
3977A85J20j69N5j24jk7J7J31K4q7p7J5Nj4Pl6K41j26M4r9J0o7J7J31p1o3K0J0O2o1k4Kj8
$$ 185 305 136 191 67 66 39 56 187 211 124 47 62 67 53 60 24 265 139 183 84 94 27 44 175 104 41 61 71 133 72 48 50 32
3589C2J19J54j58q9Q8j21K14q4k1o8J12o7p3N4p0P1P3r9L5J1J68n6j47J41j44PO3J3K6Jl5
$$ 32 151 305 147 58 146 25 239 155 134 66 178 111 38 92 22 93 166 67 102 113 281 225 78 219 75 82 145 158 184 185 150
3225A50q9J00n8j6L6o1J7%P8p6K7m4J9n8J01l3kO1o8J89p9L8q3kP0OR0j57j25M3J91j13n0
$$ 150 61 161 103 87 123 62 79 79 157 81 108 64 83 25 126 93 91 152 84 273 194 232 149 147 217 223 313 156 31 74 265 152 102
2838A02QJ58r0j7o8L6L9j00K6j5J64l8j08Q8J02j68P7j22K7J69n5j05K1m7M2j5J04l3j0j43
$$ 102 110 268 178 161 93 129 168 68 94 79 243 205 97 185 287 119 196 74 101 270 215 110 131 84 126 111 215 182 172 29
2486B9Q4m9J8R2P8j21M7Kq5L7l4m1J91j17M4q5j9J07r0Pj8mJ8o5R5jq7K3J15j00K08j77LP
$$ 29 113 64 82 174 252 131 178 180 95 132 98 57 248 131 175 90 71 178 88 95 77 73 91 26 121 120 33 56 171 71 279 102 105 112
2087A12q1J02J25rj07l5J16M6q8N8kl2q3q1k2N6J9k8J16J61j61O3L1j25l3m2J04J3o4r5jP4
$$ 112 31 133 258 249 142 107 223 269 181 239 237 205 122 41 19 75 94 66 182 343 182 245 276 151 118 76 180 193 129 34 33 107
1711A07L7n2l4qP9J7k7M4Pl3n0J43r5M4j03O2Q0nn5j00J78j61M1p2P1Q7l1K1p9k7k8M4n6l
$$ 107 144 92 58 50 129 146 119 163 170 137 87 230 135 179 76 138 218 213 158 58 236 75 116 44 115 202 171 192 113 86 58 102 46 43
1312D3K9M4J26o1k7L6j32O9J83j32q4O5n8L2q0Q9l6J82K8k19R8R7r1j13m8l6P4o6R7O3l2J1
$$ 43 72 116 242 181 154 190 58 127 310 178 94 159 101 133 53 142 106 288 316 97 195 292 201 88 40 4 78 12 109 172 140 151
937A51l9J8J07J1j39l8J54m3l1jq2K36o6k14J01On6L0L5n0l4J3O7k9l0K2J29l0j5k0j13k6
$$ 151 112 130 237 248 109 71 225 182 151 150 68 304 238 24 125 131 75 105 140 90 56 69 136 107 77 99 228 198 183 163 50 24
561B4J36N8Mj3j77J37k3j27J12J45j37j1P8j53R9K4j59Q9mK04p4j59M8J24n5p0O9J42m2k14
$$ 24 160 218 222 209 32 169 146 19 131 276 139 128 206 53 152 176 17 106 102 306 232 73 121 245 190 120 189 331 289 75
209G5J10M3j25j1l4J05P0j26l9n0J51r5Rj5L0l4j3J24j5j47O1P3J58j58l2j7j7O5n6j4M2L1
$$ 75 185 228 103 92 58 163 233 107 68 18 169 74 83 68 98 64 51 175 160 13 74 147 305 147 115 98 81 146 90 76 118 149
-167A49M6j13
$$ 149 195 82
-190H2
##PAGE=	F1=-1519.99
##FIRST=	25169.313707327481097,	5807.6787752999953227,	0
##DATA TABLE=	(F2++(Y..Y)), PROFILE
5808A08J7pk0l9M6l5J57J31j38j63K8P6o3kJ32k08M8J30O9O1l9k9j10J29j01m3n6Q1j13M2
$$ 108 125 118 98 59 105 70 227 358 220 57 85 161 98 96 228 20 68 198 267 328 289 260 150 279 178 135 79 160 47 89
5456H9J22O2qj04q7Q7J54k36J26k8j02Q5l9l6J03j44J87j04l9N5K8m2P9j13K8N8lr2K2oJ18
$$ 89 211 273 265 161 74 161 315 79 205 177 75 160 121 85 188 44 231 127 88 143 171 129 208 95 123 181 178 86 108 102 220
5092B20k00J10K11j60j47O6p6J47j22kJ93rq4J33j15k1O3j36J8J31j3j53J45k4Qj20J24j79
$$ 220 20 130 341 181 34 100 24 171 49 47 240 231 147 280 165 144 207 71 89 220 207 54 199 175 183 63 187 8
4763HJ30Nr2M6j1P8N6l9l1J03k3q1M0m7L7n2M9k0j18lQL7J35r5K9J9pNj7l3q5J20L2J1j46
$$ 8 138 143 51 97 86 164 220 181 150 253 230 149 189 142 179 127 176 156 38 35 43 80 215 120 149 168 161 166 149 116 31 151 183 194 48
4352D8R8p3Q7K8Rj24J02J30j91k4J30j43M9p1k1J10m5j1n5M2KM6n3K5k0L6P4j10K9r0J06N3
$$ 48 146 73 160 188 197 73 175 305 114 90 220 77 126 55 34 144 99 88 33 75 77 123 70 95 75 111 185 75 104 14 120 173
3977A73J07j31O3j63O4p3J6J50L6q0j12Pllk9J1K56j46O2q8n4LoJ02n1q7L5jM6r0K2KN2J6
$$ 173 280 149 212 49 113 40 56 206 242 162 50 57 54 51 22 33 289 143 205 117 63 66 60 162 111 24 59 58 104 14 36 38 90 106
3578A06J62j30j01N7o5J82q6mp7J18l5r8J7N4m4N6p8L8O9J51n0j96J20j02L3Q4j1J8N7o2j16
$$ 106 268 138 37 94 29 211 125 121 44 162 127 29 46 100 56 112 34 72 141 292 242 46 166 64 97 181 170 188 245 183 67
3214F7Q4n4n3P0m3kL6J8n6N1n8O0m9M7LNL1j5P2j2O4j20J3M7n5Q6q1j11O2J94j35l3JK5n8
$$ 67 151 97 44 114 71 69 105 123 67 118 60 120 71 118 121 126 157 142 214 202 266 146 159 206 151 237 156 45 107 301 166 133 134 159 101
2803A01M0p0L7N3j01Q0j07K58J08j43j14J20j21O7q6qJ67l6j60M3l7Q9j15J19m6L2j49R3P
$$ 101 141 71 108 161 60 140 33 291 399 256 142 262 141 208 122 114 281 245 85 128 91 180 65 184 138 170 21 114 121
2462A21k9L5O9o3Q3l7r0J1k5j0K00j05%l1j07J65j00Rm9P9m6o8O3J2n5M4Q2j52K46j20k3J8
$$ 121 92 127 196 133 216 179 89 100 75 65 265 160 160 129 22 187 87 96 47 126 80 12 75 87 32 76 158 6 252 132 109 127
2087A27q5J08J13q8j37P2J8J50L2j5q1k6j03l8J0jJ6LR1J59j39Q4lj45k9k4J20K0p3n6j3M1
$$ 127 42 150 263 175 38 110 128 278 310 295 214 188 85 47 57 56 72 75 166 325 186 270 267 122 93 69 189 209 136 80 67 108
1711A08K9n3k1pM7lj7N3OJ5n3J15j41R6j16L6J18j9o1p5J71j64P4r1M7Q2MLj25N4k6J6k3l5
$$ 108 137 84 63 56 103 100 83 136 142 157 104 219 78 174 58 94 212 193 132 57 228 64 138 47 94 176 180 183 58 112 86 102 79 44
1312D4Q0n0J13o3M8No8J4J49j38l4N0o8K0JN0m3K31Ok34Q4N9l8j04k9m9L2k8M8N5lJ0o6M4
$$ 44 124 74 187 124 172 177 109 123 272 134 100 150 82 102 103 153 110 341 347 113 197 256 218 114 85 36 68 40 88 143 140 150 84 128
913A28J42K0k02QJ10k2m7m0mK00q8j55J37m3m0L6Pl6j8m9J11l1r8Q2Q4lQk3j09n9J71P3n8
$$ 128 270 290 88 96 206 184 137 97 93 293 205 50 187 144 104 140 147 111 93 44 155 124 26 108 192 189 197 174 65 6 177 250 192
526A92Mj11K3N8p4J3J58p7j08J39j41R1O1j55PK0J75q3j18O5R0m4p2M7J77l4k47J49P2j77
$$ 192 196 85 108 166 92 105 263 186 78 217 76 167 228 73 80 100 275 192 74 139 229 185 113 160 337 303 56 205 277 100
174A00k3j7Q0M5r6k8j7J05o6l7oM8l5l0J12J2j08P7N8R1j29k1k4n1P8k0qP4nNj06
$$ 100 77 60 140 185 89 61 44 149 83 46 40 88 53 23 135 147 39 116 174 265 136 115 91 40 118 98 90 164 159 164 58
-190E8
##PAGE=	F1=-1622.24
##FIRST=	25169.313707327481097,	5807.6787752999953227,	0
##DATA TABLE=	(F2++(Y..Y)), PROFILE
5808G3M7J9p3K1K7n1J37J31j14j38K9Q8n8m2J77j96k8J49O7K6m4j8q7J57j24q4j3N5j04M3
$$ 73 120 139 66 87 114 63 200 331 217 79 108 196 138 96 273 77 49 198 265 291 247 229 142 299 175 91 78 133 29 72
5456G2J67O2k5r5r1K4J99k16Q3l1j06J30o4p5J67j39J50p7r6R9K2l0O9j03J2R0J9j26L4l8
$$ 72 239 301 276 181 90 114 313 97 180 149 43 173 109 34 201 62 212 135 39 138 160 130 199 96 108 198 217 91 125 87
5103H7J48j54Q2J27j60r6N1n3J48q5kJ73m5q1J49j15m3N2o1o8J35K2j62J51l7N0j59J40j68
$$ 87 235 81 163 290 130 34 85 32 180 95 93 266 221 140 289 174 131 183 122 54 189 211 49 200 163 213 54 194 26
4763B6J02k2n8J02k5L4M4l4rP5j5k4P1m8l3n2O5%j39k5M8RJ27j04L2L1Pl1k2l1n0J19KK9j31
$$ 26 128 106 48 150 125 159 203 169 160 235 220 196 267 219 186 134 199 199 60 35 83 92 219 115 147 178 185 154 132 101 51 170 172 201 70
4352G0M3q3J00L3N3j19N2J25j45p5J26j06M9l3o2J18k8nj00P2k3R2m4K6m8K7N4p0nj7J6O8
$$ 70 113 30 130 163 216 97 149 274 129 54 180 74 123 90 28 146 118 113 13 85 62 154 110 136 88 115 169 99 94 77 93 161
3977A61P9r8O4j20P3j25J3J72N8p7p0n1n5L2rRK20j25M8n3j08P0k6P9l8j00N6k6LoJ4m2J07
$$ 161 240 142 206 86 159 34 47 219 277 200 130 79 24 56 47 56 276 151 199 146 38 108 82 161 123 23 79 53 56 50 64 22 129
3589A29p0J70j21m5m8O1R3p7om8J10j0q9l4J79j02l0m6L1J10J35m3j16lq3P2J03m8qJ17q8
$$ 129 59 229 108 63 15 76 169 92 86 38 148 138 49 15 194 92 62 16 47 157 292 249 133 130 47 119 222 174 166 283 195
3225A95r5N4l2r3Q5m2j3O7k5m6P3n3M5j5K4K0KK0K2l2N0Q0j46K7J0j13J07l9q6R1J82j46j2
$$ 195 100 154 122 29 114 72 59 126 101 55 128 75 120 105 129 149 151 171 193 161 211 291 145 172 182 69 176 137 51 142 324 178 166
$$ [...]
-190C0
##END NTUPLES=	nD NMR SPECTRUM
##END=	
##END=	
