##TITLE=	Oct20-2021.113.ser
TM-VI-121 Zr+PMB-prraz. hsqc

##JCAMP-DX=	6.0	$$ MestReNova 14.3.0-30573
##DATA TYPE=	LINK
##BLOCK_ID=	1
##BLOCKS=	2    
##ORIGIN=	Mestrelab Research S.L.
##OWNER=	hrzepa
##$MNOVA/LINK_BLOCK_TYPE=	ITEM	$$ NMR Spectrum
##$MNOVA/ITEM/POLYGON=	(XY..XY)
5321,5835
8722,5835
8722,8208
5321,8208
5321,5835
##$MNOVA/ITEM/Z=	0
##$MNOVA/ITEM/ANGLE=	0
##TITLE=	Oct20-2021.113.ser
##JCAMP-DX=	6.0	$$ MestReNova 14.3.0-30573
##BLOCK_ID=	2
##DATA TYPE=	MNOVA NMR VIEW DATA
##DATA CLASS=	MNOVA VIEW DATA
##$MNOVA/2D/THRESHOLD=	11.9280548095703125
##$MNOVA/ITEM/ZOOM/X=	-0.97334353289575425983,	15.004620000063303209
##$MNOVA/ITEM/ZOOM/Y=	-9.4973415065619892772,	229.94100000033026276
##END=	
##TITLE=	Oct20-2021.113.ser
##JCAMP-DX=	6.0	$$ MestReNova 14.3.0-30573
##BLOCK_ID=	3
##DATA TYPE=	nD NMR SPECTRUM
##DATA CLASS=	NTUPLES
##NUMDIM=	2
##ORIGIN=	Bruker BioSpin GmbH
##OWNER=	nmr
##.OBSERVE FREQUENCY=	400.41280287000000726
##.OBSERVE NUCLEUS=	^1H
##.SOLVENT NAME=	Acetone
##.PULSE SEQUENCE=	hsqcedetgpsisp2.3
##LONGDATE=	2021/10/21 01:04:00.000
##.ACQUISITIONMODE=	SIMULTANEOUS (DQD)
##$ORIGINAL FORMAT=	Bruker XWIN-NMR
##$MNOVA/SCALES_VERSION=	9
##$PARAMETER FILE=	(acqu2s, ASCII, /private/var/folders/f6/rjf_tdyn2v98c5c0wvkgn4s80000gn/T/+J4MKReIQRW$9c8Q2LTHlg/113/acqu2s, 0)
$$ ##TITLE= Parameter file, TOPSPIN		Version 3.2
$$ ##JCAMPDX= 5.0
$$ ##DATATYPE= Parameter Values
$$ ##NPOINTS= 221	$$ modification sequence number
$$ ##ORIGIN= Bruker BioSpin GmbH
$$ ##OWNER= nmr
$$ $$ 2021-10-21 01:51:04.883 +0100  nmr@CZC10666PP
$$ $$ /opt/topspin/data/agmb/nmr/Oct20-2021/113/acqu2s
$$ $$ process /opt/topspin3.2/prog/mod/go
$$ ##$ACQT0= 0
$$ ##$BF1= 100.683175
$$ ##$FnMODE= 6
$$ ##$NUC1= <13C>
$$ ##$NusJSP= 0
$$ ##$NusT2= 1
$$ ##$NusTD= 220
$$ ##$O1= 11073.8951120055
$$ ##$SFO1= 100.694248895112
$$ ##$SW= 239.880525819715
$$ ##$SW_h= 24154.5893719807
$$ ##$TD= 220
$$ ##END=
$$ 
##$PARAMETER FILE=	(acqus, ASCII, /private/var/folders/f6/rjf_tdyn2v98c5c0wvkgn4s80000gn/T/+J4MKReIQRW$9c8Q2LTHlg/113/acqus, 0)
$$ ##TITLE= Parameter file, TOPSPIN		Version 3.2
$$ ##JCAMPDX= 5.0
$$ ##DATATYPE= Parameter Values
$$ ##NPOINTS= 12	$$ modification sequence number
$$ ##ORIGIN= Bruker BioSpin GmbH
$$ ##OWNER= nmr
$$ $$ 2021-10-21 01:51:09.054 +0100  nmr@CZC10666PP
$$ $$ /opt/topspin/data/agmb/nmr/Oct20-2021/113/acqus
$$ $$ process /opt/topspin3.2/prog/mod/shimcntl
$$ ##$ACQT0= 0
$$ ##$AMP= (0..31)
$$ 100 100 100 100 100 100 100 100 100 100 100 100 100 100 100 100 100 100
$$ 100 100 100 100 100 100 100 100 100 100 100 100 100 100
$$ ##$AMPCOIL= (0..19)
$$ 0 0 0 0 0 0 0 0 0 0 0 0 0 0 0 0 0 0 0 0
$$ ##$ANAVPT= -1
$$ ##$AQSEQ= 0
$$ ##$AQ_mod= 3
$$ ##$AUNM= <au_zg>
$$ ##$AUTOPOS= <58 >
$$ ##$BF1= 400.41
$$ ##$BF2= 100.683175
$$ ##$BF3= 400.41
$$ ##$BF4= 400.41
$$ ##$BF5= 400.41
$$ ##$BF6= 400.41
$$ ##$BF7= 400.41
$$ ##$BF8= 400.41
$$ ##$BYTORDA= 0
$$ ##$CAGPARS= (0..11)
$$ 0 0 0 0 0 0 0 0 0 0 0 0
$$ ##$CFDGTYP= 0
$$ ##$CFRGTYP= 9
$$ ##$CHEMSTR= <none>
$$ ##$CNST= (0..63)
$$ [...]
$$ 0 0 0 0
$$ ##$ShimPowMaxUC= (0..63)
$$ 130000 130000 130000 130000 130000 130000 130000 130000 130000 130000 130000
$$ 130000 130000 130000 130000 130000 130000 130000 130000 130000 0 0 0 0
$$ 0 0 0 0 0 0 0 0 0 0 0 0 0 0 0 0 0 0 0 0 0 0 0 0 0 0 0 0 0 0 0 0 0 0 0 0
$$ 0 0 0 0
$$ ##$ShimPowMaxUG= (0..63)
$$ 524287 524287 524287 524287 524287 524287 524287 524287 524287 524287 524287
$$ 524287 524287 524287 524287 524287 524287 524287 524287 524287 0 0 0 0
$$ 0 0 0 0 0 0 0 0 0 0 0 0 0 0 0 0 0 0 0 0 0 0 0 0 0 0 0 0 0 0 0 0 0 0 0 0
$$ 0 0 0 0
$$ ##$ShimPowRcbType= 3
$$ ##$ShimPowRes= (0..63)
$$ 1e-20 1e-20 1e-20 1e-20 1e-20 1e-20 1e-20 1e-20 1e-20 1e-20 1e-20 1e-20
$$ 1e-20 1e-20 1e-20 1e-20 1e-20 1e-20 1e-20 1e-20 0 0 0 0 0 0 0 0 0 0 0 0
$$ 0 0 0 0 0 0 0 0 0 0 0 0 0 0 0 0 0 0 0 0 0 0 0 0 0 0 0 0 0 0 0 0
$$ ##$ShimPowRng0= (0..63)
$$ 1 1 1 1 1 1 1 1 1 1 1 1 1 1 1 1 1 1 1 1 0 0 0 0 0 0 0 0 0 0 0 0 0 0 0 0
$$ 0 0 0 0 0 0 0 0 0 0 0 0 0 0 0 0 0 0 0 0 0 0 0 0 0 0 0 0
$$ ##$ShimPowRng1= (0..63)
$$ 1 1 1 1 1 1 1 1 1 1 1 1 1 1 1 1 1 1 1 1 0 0 0 0 0 0 0 0 0 0 0 0 0 0 0 0
$$ 0 0 0 0 0 0 0 0 0 0 0 0 0 0 0 0 0 0 0 0 0 0 0 0 0 0 0 0
$$ ##$ShimPowRng2= (0..63)
$$ 1 1 1 1 1 1 1 1 1 1 1 1 1 1 1 1 1 1 1 1 0 0 0 0 0 0 0 0 0 0 0 0 0 0 0 0
$$ 0 0 0 0 0 0 0 0 0 0 0 0 0 0 0 0 0 0 0 0 0 0 0 0 0 0 0 0
$$ ##$ShimPowRng3= (0..63)
$$ 1 1 1 1 1 1 1 1 1 1 1 1 1 1 1 1 1 1 1 1 0 0 0 0 0 0 0 0 0 0 0 0 0 0 0 0
$$ 0 0 0 0 0 0 0 0 0 0 0 0 0 0 0 0 0 0 0 0 0 0 0 0 0 0 0 0
$$ ##$ShimSysFunc= (0..63)
$$ 1 2 3 4 5 7 9 11 15 16 8 10 12 14 6 17 13 18 19 20 0 0 0 0 0 0 0 0 0 0
$$ 0 0 0 0 0 0 0 0 0 0 0 0 0 0 0 0 0 0 0 0 0 0 0 0 0 0 0 0 0 0 0 0 0 0
$$ ##$ShimSysMatrix= 0
$$ ##$ShimSysType= 1
$$ ##$TFXNUM= 0
$$ ##$TRIPLO2= 0
$$ ##$VTU= 2
$$ ##$VTUETH= <149.236.99.20>
$$ ##$VTUTY= <no>
$$ ##$WBREFAM= (0..15)
$$ 135 116 100 100 100 100 100 100 100 100 100 100 100 100 100 100
$$ ##$WBREFLM= (0..15)
$$ 0 0 0 0 0 0 0 0 0 0 0 0 0 0 0 0
$$ ##$WBREFPH= (0..15)
$$ 71.66 -68.25 0 0 0 0 0 0 0 0 0 0 0 0 0 0
$$ ##$WBSGU= (0..15)
$$ 0 0 0 0 0 0 0 0 0 0 0 0 0 0 0 0
$$ ##$XFAC= 2
$$ ##END=
$$ 
##$DECIM=	3120
##$DSPFVS=	20
##.ACQUISITIONSCHEME=	ECHO-ANTIECHO
##NTUPLES=	nD NMR SPECTRUM
##VAR_NAME=	FREQUENCY1,	FREQUENCY2,	SPECTRUM
##SYMBOL=	F1,	F2,	Y
##.NUCLEUS=	13C,	1H
##.OBSERVE FREQUENCY=	100.69424889511199694,	400.41280287000000726
##VAR_TYPE=	INDEPENDENT,	INDEPENDENT,	DEPENDENT
##VAR_FORM=	AFFN,	AFFN,	ASDF
##VAR_DIM=	512,	512,	262144
##UNITS=	HZ,	HZ,	ARBITRARY UNITS
##FIRST=	23151.189942674980557,	6007.9998942000029274,	0.051684260368347167969
##LAST=	-956.22249693857020247,	-389.73648400514491641,	0.37088429927825927734
##MIN=	-956.22249693857020247,	-389.73648400514491641,	-200.9541778564453125
##MAX=	23151.189942674980557,	6007.9998942000029274,	257.36383056640625
##FACTOR=	1,	1,	0.0052081877588073003868
##PAGE=	F1=23151.2
##FIRST=	23151.189942674980557,	6007.9998942000029274,	0.051684260368347167969
##DATA TABLE=	(F2++(Y..Y)), PROFILE
$$ [...]
##PAGE=	F1=-11099.3
##FIRST=	23151.189942674980557,	6007.9998942000029274,	0
##DATA TABLE=	(F2++(Y..Y)), PROFILE
5182E4m7J29r3j07J16N1K8k27P5J26j19K3p0R7J18j43j16J26L4K1NK7m0o3Lr7M2p1P2K3N7
$$ 54 7 136 43 -64 52 103 131 -96 -21 105 -14 9 -61 36 154 11 -105 21 55 76 81 108 68 5 8 -89 -47 -118 -46 -23 34
4794C4j26J50j17k8J17r2R7nj6n8L8M4k6P4j56Q6m9J46k00KP3J03J5j55L3J16j4j4R8k23K10
$$ 34 -92 58 -59 -87 30 -62 35 30 14 -44 -6 38 12 86 -70 16 -33 113 -87 -85 -12 91 106 -49 -16 100 86 72 170 -53 157
4405A57j87m2P5L3K5J17j29k8R0j54N2O1l4K7p7n4Q7oPj35k2J53P7j2o6j29N1N1O2k6j1j17
$$ 157 -30 -72 3 36 61 178 49 21 111 -43 9 70 36 63 -14 -68 19 13 20 -115 -137 16 93 81 15 -114 -63 -12 50 24 13 -104
4005a04J79n6J1o5L9K4%m2n8M2J05N9k3j06o5J1PM7J2nrK6n0m1Q2j12O1J54j24K5J2O7j17
$$ -104 75 19 30 -35 4 28 28 -14 -72 -30 75 134 111 5 -60 -49 -42 5 17 12 3 29 -21 -62 20 -92 -31 123 -1 24 36 103 -14
3592a4k1J26o4j12M5N4j4L3j12L6M4P4kjo3jr1J25m9l7N5n9k7n1M0P1J5oN2j34Q2q8P5JL7
$$ -14 -35 91 27 -85 -40 14 0 33 -79 -43 1 75 73 72 9 8 -83 42 -7 -44 11 -48 -75 -126 -86 -15 0 -6 46 -88 -6 -94 -19 -18 19
3153A9j04J42np0oJ35q6j41J00J99r2PNm0K8Q6l43J66rR1l4L7q3j10Q2o3J22l3l4N5ok21L9
$$ 19 -85 57 52 -18 -24 111 25 -116 -16 183 91 98 103 63 91 177 -166 0 -9 82 48 85 2 -108 -26 -89 33 0 -34 21 15 -206 -167
2740a67R6K0R7m6q8N5J82r1j01L3kj06O7M6m6R5k3J9m6J53l7j02Q3r4Q7n9Q2p1Lk7OJ01j47
$$ -167 -71 -51 46 0 -88 -33 149 58 -43 -10 -12 -118 -51 -5 -51 44 21 40 -6 147 110 8 91 -3 84 25 107 36 39 12 18 119 -28
2327b8K6j1n9J62j03rl8L1J05n6p%l0KM4j0k4J05j29n1R2P9jj03K5N3N6L77m24j59KJ13j59
$$ -28 -2 -13 -72 90 -13 -22 -60 -29 76 20 13 13 -17 -15 29 19 -5 100 -29 -80 12 91 90 -13 12 65 121 498 74 -85 -83 30 -129
1914a29J04o9L2M3n6J3J4N6o0Jn7J74l1oK3k21N7M3Q8L5k22L1P2J45q6l5n4j7M5nk32j573
$$ -129 -25 -94 -62 -19 -75 -62 -48 8 -52 -51 -108 66 35 29 52 -169 -112 -69 19 54 -168 -137 -65 80 -6 -41 -95 -112 -67 -72 -304 -1877
1513a877n351K914M226O9R8j8j23J15j14J04j3Qk2O8n4j9p6l4J64r2mP3O7r8M2J50n8m0q8
$$ -1877 -7228 -4314 -88 -19 79 61 -62 53 -61 43 30 38 16 84 30 11 -65 -99 65 -27 -31 42 109 11 53 203 145 105 17
1150A7q7Q6p4KJ09n6P9r1N8O8j92R7Rn2q1J31R8j72Q5l3K6m8m6M5j5J57j51J52j48mk3M8Q9
$$ 17 -70 16 -58 -56 53 -3 76 -15 43 111 -81 16 25 -27 -108 23 121 -51 34 1 27 -21 -67 -22 -37 120 -31 121 -27 -31 -54 -6 83
737H3j25j2mR8j8j3R0M0l5l0j18l3OJ13l9j26J11mm7J49m4p7k1n1K22q5o89P98j06P4j24j8
$$ 83 -42 -54 -58 40 22 9 99 139 104 74 -44 -77 -71 42 3 -123 -12 -16 -63 86 42 -35 -56 -107 115 30 -659 139 33 107 -17 -35
336c5L2j3l6Q0N3q1J01r0j1j7O5P9k15Q1K09q9p8j63J50j75J68j8j2j0Rj42Q4K6J2j13N0J39
$$ -35 -3 -16 -52 28 81 0 101 11 0 -17 48 127 -88 -7 202 113 35 -128 22 -153 15 -3 -15 -25 -16 -158 -74 -48 -36 -149 -99 40
-64D0p3J53j20j2K2O9o3j21Q9P4J7j10j7KN1l9J9Lk3J05o4N1j06l8O4j
$$ 40 -33 120 0 -12 10 79 16 -105 -16 58 75 -35 -52 -50 1 -38 -19 -16 -39 66 2 53 -53 -91 -27 -28
-390b8
##PAGE=	F1=-11193.6
##FIRST=	23151.189942674980557,	6007.9998942000029274,	0
##DATA TABLE=	(F2++(Y..Y)), PROFILE
6008D3n3k5k3L0P8r6J8m9P3j6M5n5P7m8j73J23K39k45O3j9n2K0P5k22K21M2j60k5J39r6L5
$$ 43 -10 -35 -58 -28 50 -46 -28 -77 -4 -20 25 -30 47 -1 -174 -51 188 -57 6 -13 -65 -45 30 -192 29 71 -89 -114 25 -71 -36
5620c6r4K01M6j76R1j03K4J24k78J38L2j2J69j15N5j32Q6j29Q8J8RL8o9n4J3m8N7J2mk8k4
$$ -36 -130 71 117 -59 32 -71 -47 77 -201 -63 -31 -43 126 11 66 -66 20 -109 -21 -3 6 44 -25 -79 -66 -114 -57 -45 -49 -77 -101
5232a01J04j0P4m6K4P1p9q1N9O1K8k19P6J43r5jq8P8J29j37m6J16l9Q0l1jql6J2j22k5pR6
$$ -101 3 -7 67 21 45 116 37 -44 15 76 104 -115 -39 104 9 8 -80 -2 127 -10 -56 60 21 101 70 69 61 25 37 -85 -110 -117 -21
4819b1l1M6j19K44k19j0J22p0Q7M0o6m9M0N5n8J30j79J08p8J27j99K3P7N6N7j65L4J03k0J1
$$ -21 -52 -6 -125 119 -100 -110 12 -58 29 69 3 -46 -6 49 -9 121 -58 50 -28 99 -100 -77 0 56 113 -52 -18 85 65 76
4443G6N7k04K21j78r8J52O2j8P8r5r0J42j54P8M7o2M1o2n1Q5JLj47K0O2J46k3q9j14M2O2L5
$$ 76 133 -71 150 -28 -126 26 88 70 148 53 -37 105 -49 29 76 14 55 -7 -58 27 28 31 -116 -96 -34 112 89 0 -114 -72 -10 25
4042B5J2Oj77J87p0M9o2kM7j3k6l4Q6Q6Ll0q4p0mJ5O6J6rkL0l3l9L8j12K8J73r8J2L5N9j44
$$ 25 37 43 -134 53 -17 32 -30 -32 15 2 -24 -58 28 114 117 87 3 -67 -71 -56 10 26 17 15 45 12 -27 11 -101 -73 100 2 14 49 108 -36
3592c6kR0k3q7N7K2l9M6r7N0K8M1Jk4j0J6j14J31q3j8M2l0n7m6P2O7Pk5J01j65P8r2J02ML8
$$ -36 -38 52 29 -58 -1 21 -18 28 -69 -19 9 50 51 27 17 33 -81 50 -33 -51 -9 -39 -96 -142 -70 -3 4 -21 80 -85 -7 -99 3 7 45
3153D5j30J08N4k6p1O9n9m1M8J48k3m2J8k3K5N6k45P3O9J3l0j2n4l2M7m9R7o1k4M0M9k18L1
$$ 45 -85 23 77 51 -20 49 -10 -51 -3 145 122 80 98 75 100 156 -89 -16 53 66 36 24 -30 -62 -15 -64 33 -28 -52 -12 37 -181 -150
2740a50M7J6J69q9k6k0J93p0j05L5jj09M3O3m5M2O6%r6J95o5r0J25j36M9k1M8n0L2k0JJ04
$$ -150 -103 -87 82 -7 -33 -53 140 70 -35 0 -1 -110 -67 -4 -49 -7 59 59 -37 158 93 3 128 -8 41 20 68 18 50 30 31 135
2340A35j48L7j5j26J60m0Kl2NJ14q9rjK8k1P6j02mJ29j37jP2O7j5p5j6K0R3L97m23j59j2J06
$$ 135 -13 24 9 -117 43 3 5 -27 -22 92 3 -6 -7 21 0 76 -26 -30 99 -38 -39 33 100 85 10 -6 14 107 504 81 -78 -90 16
1926A6j23P5q2M0J07p0rK1Q3q0j9j7J48n8k4J9k28N2N5R0M3k07M0R0J19q0%o8J6L3Pk03m93
$$ 16 -107 -32 -114 -74 33 -37 -46 -25 58 -22 -41 -58 90 32 8 27 -201 -149 -94 -4 39 -168 -128 -38 81 1 1 -67 -51 -18 -11 -214 -707
1513g07k940N73K949J36N0j7j35J11j13J15rK3K9ml3qo6l7J19n0pO5N0r7O4J15m5l3r9m4J23
$$ -707 -3647 -3074 -125 11 61 44 -91 20 -93 22 13 36 65 61 28 20 -46 -83 36 -14 -21 44 94 -3 61 176 131 98 -1 -45 78
1125G8j10J4N6k1M4j26R2K4j76J48M0q2q0J80P9j97O3j7l6m4K3lMJ51j31R2j09J1J1L6R9j36
$$ 78 -32 -18 38 17 61 -65 27 51 -125 23 63 -19 -99 81 160 -37 26 9 -27 -71 -48 -51 -47 104 -27 65 -44 -33 -22 14 113 -23
725b3o0O5M3oJ4J32j5p9k0j18pNJ22jj10O6l0k5J58o3r0Lq1J98j21k93L57kO8j12m0L1J2p6
$$ -23 -83 -18 25 19 33 165 150 71 51 -67 -74 -69 53 52 -58 8 -22 -47 111 48 -42 -39 -120 78 -43 -336 21 19 87 -25 -65 -34 -22 -98
299i8J20Mp9J34q1J5k3O5N3k08R4J89n1j07j20J20j58J65n0j5j3M2j20O4M5J9j07J1J23n1
$$ -98 22 26 -53 81 0 15 -8 57 110 -98 -4 185 134 27 -93 27 -131 34 -16 -31 -44 -2 -122 -58 -13 6 -101 -90 33 -18
-77a8J44j11k2J9J11r3j53J18P9J6j11n9L0O7l6MJ9o1J10n4O3j11o2R6Q
$$ -18 126 15 -7 12 123 30 -123 -5 74 90 -21 -80 -50 17 -19 -15 4 -57 53 -1 62 -49 -111 -15 -7
-390g
##PAGE=	F1=-11288
##FIRST=	23151.189942674980557,	6007.9998942000029274,	0
##DATA TABLE=	(F2++(Y..Y)), PROFILE
6008D2o1j2m4M9R6j41K8J8J6l1O5p0P6n9j52J12K65k57O7J0m9k5Q7k58K82k8j37J8J08p4N4
$$ 42 -19 -31 -75 -26 70 -71 -43 -25 -9 -40 25 -45 31 -28 -180 -68 197 -60 7 17 -32 -57 30 -228 54 26 -111 -93 15 -59 -5
5620ej49K54K8j26ll1j7J22l23J84j0M8J83j06J8j77J32j39J11K4l4K1l2o3K4o3M6N0jl6k7
$$ -5 -154 100 128 2 -1 -32 -49 73 -250 -66 -76 -28 155 49 67 -110 22 -117 -6 18 -16 5 -27 -90 -66 -129 -83 -33 -34 -70 -97
5232i7O5jQ3o2Q9J5o1n3NN8J9j81N4J64p7%j05N4J16j04LJ05j03J36o2m1M5k6J3j19q3M0R9
$$ -97 -32 -33 50 -12 77 92 31 -22 -17 41 60 -121 -67 97 20 20 -85 -31 85 -19 -16 89 -14 122 60 19 64 38 51 -68 -151 -111 -12
4819a2n1K6j36K98k55RJ09l8Q2O0j04j4K0P6q4J51j75J35j04P2j81O9N1MR0j36PR6m4L6J8
$$ -12 -63 -37 -173 125 -130 -121 -12 -50 32 92 -12 -26 -6 70 -14 137 -38 97 -7 65 -116 -47 4 8 98 -38 -31 65 21 57 75
4430G5j50K07j55j35K15P4n3L8p6j36J91j31P8M4r2M3k7m8P7J1%j62M0%J99m3j01r0M0O7j9
$$ 75 -75 132 -23 -158 57 131 78 116 40 -96 95 -36 42 86 -6 37 10 -38 39 50 50 -112 -72 -72 127 84 -17 -107 -67 0 -19
4042a9M4K1k06J70n8O9l3o0O5m0J9oJ36L5n7m3m9l1k9J5Q0%J4oJ9Jm3lj13J0J93p2lL9J8j35
$$ -19 25 46 -160 10 -48 21 -12 -72 -7 -47 -28 -34 102 137 80 37 -12 -43 -72 -57 23 23 37 31 50 51 8 5 -108 -98 95 23 20 59 77 -58
3592e8L5M2J4q4P9Lo5L5m8P1KJk0j4N3K7j36J34j27rL2J1r5k1J02L8j3j5J21j74O6q6J20J1
$$ -58 -23 19 33 -51 28 31 -34 1 -47 24 26 27 7 -7 46 73 -63 71 -56 -65 -33 -22 -117 -138 -36 2 -11 -26 95 -79 -13 -99 21 32
3166C2L7j38N8R7K1j10j8j6N4QP1L6q5K5j0J4L5j14j3J36q0j2o4l0M1L5k9L5l8o7O8P1j87
$$ 32 69 -69 -11 86 107 -3 -21 -37 17 25 96 132 47 72 62 76 111 -3 -16 120 40 28 -36 -66 -25 10 -19 16 -22 -89 -21 50 -137
2753a37J7j0K7K01j14M8r7J72n0q2O1l4r7J4O3l9oJ60l2j28K12q0p9J56j34j4J8J2l6O3j2
$$ -137 -120 -130 -103 98 -16 32 -65 107 57 -25 36 2 -95 -81 -18 -57 -63 97 65 -63 149 69 -10 146 12 -2 16 28 -8 55 43
2365D3j6R8j38M8kj60J29lK8m0mR1r4qk0J04j8P6j60%J62j71N3L7N7j6l1o6l4J68M18m55j42
$$ 43 27 125 -13 35 33 -127 2 -1 27 -13 -17 74 -20 -28 -48 56 38 114 -46 -46 116 -55 -2 35 92 76 45 -21 -55 113 531 76 -66
1952f6m0J19o8K8q9N5J41p6l8K5J06p4n1QJ28p4n4L5j90K2O2P3O1j66L3R0P6o8J6o7M7KJ8
$$ -66 -106 13 -55 -27 -116 -61 80 4 -34 -9 97 23 -28 -20 108 34 -20 15 -175 -153 -91 -18 43 -123 -90 0 76 8 24 -43 4 6 24
1538B4j73p9j637m80K175K03K6n5j00R2j25J38J2OP0o8j5%l2k0M4nm0O2L3o3Q1Q1n4l7p9J6
$$ 24 -149 -228 -1865 -2345 -170 33 59 4 -96 -4 -129 9 21 27 97 29 14 14 -18 -38 6 1 -39 23 56 -7 74 155 101 64 -15 1
1138AJ29j26L5k3oM0j26Q3k2j39J83N1q2n6J94L6j96L4Kp8l8Q7n2J9J13r2M0o0K3L0K8J05
$$ 1 130 4 39 16 10 50 -76 7 -15 -154 29 80 -2 -58 136 172 -24 10 12 -66 -104 -17 -69 -50 63 -29 11 -49 -26 4 32 137
737A37j44j03J18J0J0K8J49p1j12Oj01%K0J44K2r5K6p1K3J30q7p1nq4J65j04j03R9O5O6j05
$$ 137 -7 -110 8 18 28 56 205 134 22 28 -73 -73 -53 91 113 18 44 -27 -4 126 39 -32 -37 -121 44 -60 -163 -64 1 67 -38
349c8m3L0L5j11J67o1p9J63o7L3j6M9L5j91R4J40%j32m8L3j04J52q0J7k4L7r0M6O2K4o2k0
$$ -38 -81 -51 -16 -127 40 -21 -100 63 -4 29 13 62 97 -94 0 140 140 8 -40 -7 -111 41 -39 -22 -46 -9 -99 -53 9 33 -29 -49
-52d9P7k2J11p4m4K1J23r3j83J34Q7Jj01o6L7M7k0LL3o7P8m3P7j10p8J07K4
$$ -49 28 6 117 43 -1 20 143 50 -133 1 88 89 -12 -78 -41 6 -14 -11 22 -45 33 -10 67 -43 -121 -14 10
-390A0
##PAGE=	F1=-11382.3
##FIRST=	23151.189942674980557,	6007.9998942000029274,	0
##DATA TABLE=	(F2++(Y..Y)), PROFILE
6008B8m8qn2O3R8j61J8R2l0l7M9r0R3m7j19N2K65k30O7J1k0n6R3k60K87r3n3M9M4l7L2j62
$$ 28 -20 -28 -80 -17 81 -80 -62 30 0 -37 12 -78 15 -32 -151 -99 166 -64 3 14 -6 -62 31 -229 58 -35 -88 -39 5 -32 0 -162
5607a62K76J1q6o9N0o2J23l33J77j5P7J74p6k0j82J37j35J38K1p3Nko2M2o8K8P0Pl9k9oL3
$$ -162 114 125 39 -30 20 -42 81 -252 -75 -90 -13 161 85 65 -117 20 -115 23 44 -29 -24 -26 -88 -46 -114 -86 -16 -9 -48 -77 -83 -50
5207e0R2q3J30j7m9k1k4M4j3j22K2J72o6K3j07K0J04o9K3R1j48J72o8p4Q2j4Kr9j13O1P6l0
$$ -50 42 -41 89 72 23 2 -22 22 9 -113 -91 81 15 38 -69 -49 55 -14 9 100 -48 124 56 -18 64 50 52 -47 -160 -99 -23 -53
4806e3nj53K92k25J9P8QP6M7j17M1j9R4r5J26j28J54j32J9j49J19J9n9J07p1m6J04q2N6j5
$$ -53 -58 -211 81 -144 -125 -47 -39 37 84 -33 8 -11 83 -12 114 -14 140 8 27 -122 -3 16 -43 64 -7 -53 51 -31 25 10
4430A0p6J80j35j41K46O5p3J1p0j51K24r9N7M5j24M3J4m3P0QMj67L2j9K15o0r4o1M8M9p1N6
$$ 10 -66 114 -21 -162 84 149 76 87 17 -134 90 -9 48 93 -31 12 26 -17 53 61 65 -102 -70 -89 126 66 -28 -89 -41 8 -63 -7
4030gK8j90J23j5O0Qj05P5q6Q3K9J56j6j09o0nK6m5kQ3k3M5j2qM5m3l6j07PJ92m2rK9m9q3
$$ -7 21 -169 -46 -61 -1 7 -98 -23 -109 -26 3 159 143 34 -26 -31 -5 -50 -52 31 8 53 41 33 78 35 -1 -108 -101 91 49 40 69 20 -63
3592f3N8J0K5q7R3Jq4J0J1Q2j1l0n7K1R4L7j48J36j68k5L7N3j21J3J11nl6L0R7j48N1p3J13
$$ -63 -5 5 30 -57 36 37 -47 -37 -26 56 45 15 -42 -21 73 110 -38 98 -70 -95 -58 -5 -126 -113 -2 -7 -43 -13 84 -64 -13 -86 27
3178B7J7M2j29J1J05N1j12r4L8J12mj7O8r6K9j2qL2lm9J59j60J7j01j4Q6M8j7l6J6j37J21
$$ 27 44 86 -43 -32 73 124 12 -82 -44 68 64 47 115 19 48 36 28 60 57 8 167 7 24 -77 -91 -5 43 26 -10 6 -131 -10
2778a0N2j31Lm9L3J93j08J03j56J39m4m5R7q6o4j5N3k5l6K17p8j19J97q4p2J84j08p3N0j8
$$ -10 42 -89 -86 -135 -102 91 -17 86 -70 69 25 -20 77 -9 -73 -88 -35 -60 -96 121 43 -76 121 37 -35 149 41 -32 18 0
2402@l8J04on1R4j25N0K3j59Q5PM9n6J2L6o6Jn9J76RL2j58j4K04k22R2pN6%J6j05r2K47M67
$$ 0 -38 66 60 9 103 -22 28 51 -108 -23 -16 33 -23 -11 25 -41 -40 -99 77 86 118 -40 -54 150 -72 20 13 69 69 85 -20 -112 135 602
1977F02n41j17o7J38rk4q6O8J42o8o9K9J03l4q3NJ31q0p9N4j15j9O0K6R3j08LR0K4n8Qm6P9
$$ 602 61 -56 -123 15 6 -18 -104 -36 106 38 -31 -2 101 67 -16 -11 120 40 -39 15 -100 -119 -59 -33 60 -48 -45 45 69 11 19 -27 52
1563E2m4K7j37r1j242o42J877K35K2r8m3M8j19J64M6m3R1j03j0MJ7J3k7K4r3O1J8JP7O2p5
$$ 52 8 35 -102 -193 -1435 -2077 -200 35 57 -41 -84 -36 -155 9 55 12 103 0 -10 -6 11 24 -3 21 -72 -11 7 8 85 147 72
1175G2n5m4P2J08j07N1r7k5O6q9L7m6r5J82K6m0j0J77k7j62qK0q1l6J23q7K5O7n7K5k5J6L8
$$ 72 17 -27 45 153 46 97 0 -25 41 -48 -11 -57 -152 30 56 16 6 183 156 -6 -14 6 -75 -111 12 -75 -50 17 -40 -15 -40 -24 14
762A4K7J09j51j17J24J5L6QJ34j09j19L8o2k8N5J71J8p3qj14P9Q0j03l6l5p6J32m9p8J4R5
$$ 14 41 150 -1 -118 6 21 57 65 199 90 -29 9 -53 -81 -26 145 163 90 82 -32 47 127 24 -12 -47 -123 9 -40 -118 -104 -9
374iN7r6k7L4M4j27J93j15p5J68n4M2LK4K7j78R2P4N3j38J5q4k5J28q9P9l0j6p7N5O6K0J1
$$ -9 48 -48 -75 -41 3 -124 69 -46 -121 47 -7 35 38 62 89 -89 3 77 130 -8 7 -77 -102 26 -63 16 -14 -30 -107 -52 14 34 45
-39D5m2L0mP0k4p2L1J08p3j89J22R0j6q8m0J4K1nK1M0m9K4k7P0r7p4Q7L9
$$ 45 3 33 29 99 75 3 34 142 69 -120 2 92 76 -12 -52 -38 -17 -22 -1 39 -10 14 -13 57 -40 -114 -27 12
-390A2
##PAGE=	F1=-11476.7
##FIRST=	23151.189942674980557,	6007.9998942000029274,	0
##DATA TABLE=	(F2++(Y..Y)), PROFILE
6008bj9kn0Q1P3j54lJ59o1m6K4j12J14k2o4m8K43j83P0j6K8o1Q5k17K22j26N7O9m6Pj5j29
$$ -2 -21 -23 -73 8 81 -73 -76 83 22 -24 0 -112 2 -20 -84 -132 111 -72 -2 -18 10 -51 34 -183 39 -87 -30 39 -7 0 -15 -144
5607a44K44J4q5p0J03r5J33l19J39MO5J55l9m3j60J04j12J62kq9NJ5n0O2o6PP7J3n0k1q3P7
$$ -144 100 114 29 -41 62 -33 100 -219 -80 -76 -11 144 105 62 -98 6 -106 56 54 -35 -30 -15 -65 -3 -69 -62 15 28 -22 -43 -126 -49
5207d9R5j07J38j9m6J8k2J7o0o0lJ53n0M5r0j8J08n4K5P5j67J75m4q7P4J6k6o9j09O1L1K3
$$ -49 46 -61 77 58 12 30 8 25 -35 -95 -98 55 5 50 -40 -58 50 -4 21 96 -71 104 60 -27 47 63 37 -32 -141 -80 -49 -26
4806b6m7j46K34j54J5M4N6N4J7j00R3o3R7q5O9n7J61j51%j14J36Rj28J10Kj04J26j20O4l6
$$ -26 -73 -219 15 -139 -124 -80 -24 30 47 -53 40 -23 74 -11 58 1 162 11 11 -103 33 42 -86 24 26 -78 48 -72 -8 -44
4430d4j3J53j23j11K34L4o9jo3j35K31p3L0M0j46N4L4l3O6j6J8j45Lj0J86o6o5l4O3Mr2M6
$$ -44 -57 96 -27 -138 96 130 61 60 -3 -138 93 20 50 90 -56 -2 32 -1 65 49 67 -78 -75 -85 101 35 -30 -64 -1 3 -89 -43
4030d3K4j30M7N0J5N2j19Q5j42J46O8J22m4j34p9M5N9l9l5P1l0O1j4l8Q4l3n7r1J0J63rJJ5
$$ -43 -19 -149 -102 -52 -37 15 -104 -19 -161 -15 53 175 131 -3 -82 -37 22 -17 -52 19 -11 50 36 -2 82 49 -8 -99 -89 74 65 66 81
3617H1j15mM1OOp5Q6Pp8k2N4O6Nm3r9P0R0M7j38J36j95o2N8Q4j24M5Q4m1m4Q7M0r2L9n9P6
$$ 81 -34 -38 3 9 15 -60 26 33 -45 -67 -13 53 58 15 -84 -14 76 123 -15 121 -74 -136 -78 6 -118 -73 11 -30 -74 13 53 -39 0 -59 17
3178A7J8N3j09j5P5N3p4j33Q5J14J2q7P2o9K4j6l7L6N6k4J31k05M3j03rR3O5j0r1P1j92J64
$$ 17 35 88 -21 -36 39 92 18 -115 -30 84 96 9 81 12 36 20 -17 19 75 51 182 -23 20 -83 -92 1 66 56 -35 36 -156 8
2778HKo3no1K6J71q5J24j93J15n0qJ24j38j3l6N0j0n3K17j20p8J59q3o4K08q8j02P0l5n8J53
$$ 8 10 -53 -58 -119 -93 78 -7 117 -76 39 -11 -19 105 -33 -46 -82 -32 -42 -95 122 2 -76 83 0 -64 144 56 -46 24 -11 -69 84
2377H4lr2J00j15L4M6j30L8J4M9o2K9k9j5J9j08K21L8l3j09l8K44k62J02m0N4K5N4j14j36
$$ 84 81 -11 89 -26 8 54 -76 -38 -24 25 -37 -8 -37 -52 -33 -141 80 118 85 -24 -62 182 -80 22 -18 36 61 115 1 -135
2002a35K84N40o49r8p6J47M1p1o6O5J29n5r1L2P3K0j01k3J56p7q0N7l1n2M7m6J38n1m1R8j8
$$ -135 149 689 40 -58 -134 13 54 -17 -83 -18 111 56 -35 -3 70 90 -11 -34 122 45 -35 22 -9 -61 -14 -60 78 27 -14 84 66
1613F6n4k1j1J12r3L5r5k07j187p91K000K62L0j20Knp9J79P7j00R0j01k0jO9N2p1K9j40N1
$$ 66 12 -9 -20 92 -1 34 -61 -268 -1455 -2246 -246 16 46 -74 -72 -77 -156 23 100 0 90 -11 -31 -32 37 89 18 47 -93 -42
1238d2OP6N1O4r5q0j9J05P9o6N7j36o8J01l2k5k8p0J48l1L8M1J47r2j14n9L4m7l8J23j05K5
$$ -42 -36 40 91 155 60 -20 -39 66 145 79 136 0 -68 33 1 -24 -52 -122 26 -5 33 74 221 129 15 -44 -10 -57 -95 28 -77 -52
837e2L2l8M8j1k1N4K6J14j57r0P8M6P3m8R1j10r9O2rq2R5J92j5k9m9j37J23K4r9jp1p5J08
$$ -52 -20 -58 -10 -21 -42 12 38 152 -5 -95 -17 29 102 54 145 35 -64 -2 -11 -93 2 194 179 150 101 -36 87 111 12 11 -60 -135 -27
424b7J6j31M0R7L3p6NL6M4j32J78j18o8J33m6M1K9J1K4j75Q6J4R6j19M0j89O0Q7o5J49k6r3
$$ -27 -11 -142 -102 -5 28 -48 -43 -7 37 -95 83 -35 -103 30 -16 25 54 65 89 -86 0 14 110 -9 31 -158 -98 -11 -76 73 47 -46
23d6r0Q7N7PQ2n4NpL6J6q9M5Q3n4j60Q7P7k7q2Qk5RjN4M0k9k8kL3p1m9L8M7
$$ -46 -136 -49 8 15 97 43 48 41 77 93 4 49 132 78 -82 5 82 55 -27 -19 -44 -35 -36 18 58 29 1 -1 32 -39 -88 -50 -3
-390c
##PAGE=	F1=-11571
##FIRST=	23151.189942674980557,	6007.9998942000029274,	0
##DATA TABLE=	(F2++(Y..Y)), PROFILE
6008c9J0J2m3J06K1j22k2K02q9o0K0j27J25JOj52J99j37Q2n0P9m1N5j34J04j10J43Q0j36M9
$$ -39 -29 -17 -60 46 67 -55 -77 125 36 -24 -4 -131 -6 -5 1 -151 48 -89 -7 -57 22 -19 36 -98 6 -104 39 119 -17 32
5632C2o6o7J62M5j24j3J07r6J41k96J03K3K5J31ml9j32N0p3J66l0q4K1K5l5Q2o8oP7J6q1M
$$ 32 -34 -101 61 106 -18 -31 76 -20 121 -175 -72 -49 -24 107 103 64 -68 -18 -91 75 45 -39 -18 7 -28 54 -14 -20 57 73 -8 -4
5232dj34J05Q8j25J16lm1N2J3l6r2j4qJ08j7M0o1m4J23o3K0O2j64J49jq3K6N9o4l1q5N0j6
$$ -4 -138 -33 55 -70 46 43 2 54 67 31 -61 -75 -83 25 8 48 -13 -57 66 3 23 85 -79 70 69 -14 12 71 7 -24 -109 -59 -75
4819g5Q1q8j09J52p4kJ7R5Rqo6J19r6Q7n6RPJ48j42K9j01J01M1j87R7N8j45J53j37M6l5J8
$$ -75 6 -82 -191 -39 -113 -115 -98 -3 6 -2 -68 51 -45 42 -14 -5 2 150 8 37 -64 37 78 -109 -12 46 -99 54 -83 -37 -72 -54
4418e4J30j22m9J83mm6nm8j02K15n7J4K2j51P9K3k0N9m6L3q4l9JJ27o1k3j2P0n5p2K6J3m2
$$ -54 76 -46 -95 88 84 38 33 -15 -117 98 41 55 77 -74 5 28 8 67 21 54 -30 -69 -68 59 -2 -25 -37 33 -22 -94 -68 -55 -97
4005i7m0J10n6Q6r7J00j79J73J03M2l9j26r0Q2N4k3n9M0pM9po2J12j8o3o9J3J09K7K1Lj47
$$ -97 -137 -27 -83 3 -94 6 -173 0 103 145 106 -20 -110 -28 26 3 -56 -16 -23 26 19 -43 69 51 -12 -81 -68 41 68 89 92 -55
3604e5O6j0K2l2l6N8Ol4n6O6K0M6m0j26J13M4N1r7J25k03j05Q3R7r8O6K8n8k8J34k3k8L2n5
$$ -55 11 1 23 -9 -45 13 19 -15 -71 -5 15 61 21 -105 8 52 103 6 131 -72 -177 -94 3 -95 -29 -1 -59 -87 47 24 -4 28 -27
3191b7K7RO3q9k3M1J8pj26J09P6L4j16O4l0N%o7L0O2M0P6k17O0o9j3P8O4oj16J00k02J78o4
$$ -27 0 9 72 -17 -40 1 19 12 -114 -5 71 105 -11 53 23 28 28 -39 -9 53 93 169 -48 12 -57 -70 8 72 66 -50 50 -152 26 -38
2765c8%jn3J0J56o4J14k08J01m8K2J18j74M8m4O5oo4J66j37l3J12p2n4K20r5q9Q0l3r3J97
$$ -38 -38 -39 -92 -82 74 10 124 -84 17 -31 -9 109 -65 -17 -61 4 -2 -66 100 -37 -70 42 -30 -84 136 41 -48 32 -1 -94 103
2377A03kj22J14j10LN2q8kL1L3m8K6p9M2M5j56K19O0q8n1o0K65k59Q2n3M4M4P9q9j54K45O09
$$ 103 101 -21 93 -17 -14 38 -50 -52 -21 12 -36 -10 -89 -47 -2 -158 61 121 33 -18 -78 187 -72 10 -43 1 45 124 35 -119 126 735
1977G35p16q9o4J36P2j01l4M1J21m4r7L4L4N9j02o2J85o3n5M2L0o6K3j18J86j2p9J07l8n1
$$ 735 19 -70 -134 2 74 -27 -61 -20 101 57 -40 -6 28 87 -15 -77 108 45 -10 32 62 -4 19 -99 87 75 -4 103 65 14
1601A4n7K4J40j30M1n6k66j067j548K547L46L4j07J6n0mJ63R5j38P5p7k7rJ00Q1p3Mj53L4
$$ 14 -43 -19 121 -9 32 -24 -290 -1357 -2905 -358 -12 22 -85 -69 -119 -123 40 135 -3 72 -5 -32 -41 59 140 67 71 -82 -48
1238d8j8J42J3Q2j05r9j5R6P3k8N5j39r5J16J8p3J8p7J03r5J15Q2J32j38p8j09L5J0m0Q9j04
$$ -48 -66 76 89 171 66 -33 -48 48 121 93 148 9 -86 30 48 -25 -7 -84 19 -76 39 121 253 115 37 -72 -37 -27 -67 22 -82
850h2J9J2k9R4j9p7R2J8J16j51l8JQ1J13j20L6p7o0O6M2j39J32J87o4L6j01j26J40k0q0L1
$$ -82 -63 -51 -80 14 -5 -82 10 28 144 -7 -45 -44 37 150 30 66 -11 -71 -5 37 -102 30 217 153 189 88 -38 102 82 2 33
462C3r3r6Q9P6j97J19Q1km5M0K9M6j41J19n1n8O3l8K4N7K3K2j81P4j5J10p9J9k48J29K8qJ97
$$ 33 -60 -156 -67 9 -188 -69 12 10 -35 5 34 80 -61 58 7 -51 12 -26 -2 55 78 100 -81 -7 -22 88 9 28 -220 -91 -63 -71 126
48A26rj64j09J15M1j4J25o0J1k5J4L0q2O3N8m9j00M4M9k8q5N7o1J5j3R9K6k2n5K7k4l9j1k0
$$ 126 117 -47 -156 -41 0 -14 111 51 62 37 51 81 -1 62 120 71 -29 15 64 36 -49 8 -53 -38 -51 48 74 52 -3 24 0 -39 -50 -70
-377g0M1
$$ -70 -29
-390b9
##PAGE=	F1=-11665.4
##FIRST=	23151.189942674980557,	6007.9998942000029274,	0
##DATA TABLE=	(F2++(Y..Y)), PROFILE
6008f8J9L2l2J29l6q1k7K12j20p9M4j23J22J5P4k30J38r8J05p0J08%Kl6l1n3J77P9j90P2r3
$$ -68 -49 -17 -49 80 44 -37 -64 148 28 -51 -7 -130 -8 7 81 -149 -11 -109 -4 -74 34 34 36 0 -31 -84 93 172 -18 54 -39
5620c9oN9R8j79N9O9n4J26k72Q5L0j9J03K3lj21ok2J34l6p3M1L7l3J08q2j0P7J3j21M1j42
$$ -39 -45 14 112 -67 -8 61 7 133 -139 -54 -24 -43 60 83 80 -41 -47 -69 65 29 -44 -3 34 1 109 27 17 94 107 -14 27 -115
5219a15J06O3j23P7J0k7P3O8j15p7PjN6K7jk9l6J26q0J0N2j44J11M0q1k7J01r7J2n7L2m4J25
$$ -115 -9 54 -69 8 18 -9 64 132 17 -60 -53 -54 2 29 28 -1 -37 89 9 19 71 -73 38 78 -3 -30 71 -26 -14 -71 -39 -83 42
4806D2j21n8P4ml1PJ09n0j4k5J13j21Q2j7l0L3J19r7Q6j15J6J08k17P6P4j50J73j22MoOJ03
$$ 42 -79 -137 -63 -67 -98 -91 18 -32 -46 -71 42 -79 3 -14 -44 -11 108 11 97 -18 -2 106 -111 -35 39 -111 62 -60 -56 -62 -56 47
4405D7j18K9J03k8j8lk6p7J85n3K0kj36J12j4oM7o7L5Nq0lO8n7K4%N4j03k4PPM7j11J38j30
$$ 47 -71 -42 61 33 15 12 -14 -91 94 41 61 59 -77 35 21 15 62 -5 30 35 -45 -48 20 -37 -13 -13 41 -62 -86 -79 -72 -25 -136 2 -128
3967a28J02o0J26j74J50J21n1qr1q9Q7K6on8j4M7J6Mp2J21nn2n5J6M7N8M6j0j21R1o1L5o6
$$ -128 -26 -86 40 -134 16 137 86 78 -13 -102 -15 11 5 -53 -67 -20 -4 0 -72 49 44 -8 -63 -47 0 58 104 94 -27 64 3 38 -28
3554b8J4K6j2M3q9M8l4Q2k5j24J36k1M4l0J00j99j32R4R6n6P0k9n9QJ52o1J5L1o1j5lN9p5
$$ -28 -14 12 0 43 -46 2 -32 50 25 -99 37 16 60 30 130 -69 -201 -107 -11 -67 3 -26 -85 -77 75 14 29 60 -1 -16 -19 40 -35
3141c5k2L4m3O7q5J06K6M1j07O7j1k8M1q1lM6R7L1k01O0j7j9N8M7rj11R7j70J58j22M5J5l8
$$ -35 -57 -23 -66 1 -84 22 48 89 -18 49 38 10 51 -30 -33 13 110 141 -60 0 -17 -36 22 69 60 -51 46 -124 34 -88 -43 -28 -66
2728f6pJ59n6Q7k05Q4j5L5P5j86J03l8R7k1p4R4j12j6O9n2m1K09j20m3Q0j4j35K12J2j37J30
$$ -66 -73 86 30 117 -88 -4 -19 16 91 -95 8 -30 67 46 -28 66 -46 -62 7 -45 -86 123 3 -40 40 26 -109 103 115 -22 108
2340A08j03l4L5m5k2M7K5k6or7Q9P2j92J78P2j11j6p2K53k06M7m1J3M8R3m3j47J43O63p21
$$ 108 5 -29 6 -39 -61 -14 11 -15 -21 -118 -29 43 -149 29 101 -10 -26 -98 155 -51 -4 -45 -32 16 109 66 -81 62 725 4
1964Dq9l8J15P8j14KOJ20m2q0K5J8O7r9r4J96l8j6J6N7n7j4j59K22kr6J07l3m2q1L9J55j38
$$ 4 -85 -123 -8 70 -44 -42 -36 84 42 -38 -13 5 72 -27 -121 75 37 21 37 94 37 23 -136 86 84 -12 95 62 20 -61 -22 133 -5
1551eL4k8k69q44k611L221M61L7o6Jp8Q2J15R9j44N3n2j9oR3Q7m0m2j19J8n6J86l0J06j07
$$ -5 29 1 -268 -1112 -3723 -502 -41 -4 -70 -69 -147 -65 50 149 5 58 6 -13 -19 74 161 121 79 -40 -22 -78 108 78 184 77
1175G7r8k8M3J02rN5j18q5R8L8r0O7j09O6j35J62R7J40j51p2j45K4O7l5M4r7J1kk2J46m4j28
$$ 77 -21 -49 -6 96 87 142 24 -61 37 75 -15 52 -57 9 -126 36 133 273 122 50 -95 -71 -4 -39 5 -92 -81 -83 -105 41 -3 -131
775a31J46LJ11j24Ro4R4J38j78j1k4k1N1Q0j74J49J50j11J10j48r9J34m6m8N7r7j34P0J29
$$ -131 15 18 129 5 14 -50 44 182 4 -7 -31 -52 -1 79 -95 54 204 93 203 55 -44 90 44 -4 53 -44 -178 -108 21
412B1k54K18N1l5j1O2LO4j62L9N8m5j0k9rQ2N2K4j85M6JQ4k5k9k52J66l5N9K03J3k03j01J13
$$ 21 -233 -15 36 1 -10 52 55 119 -43 -4 54 9 -1 -30 -39 43 95 119 -66 -20 -19 65 40 11 -241 -75 -110 -51 152 165 -38 -139 -26
-2b6K5m3J37o1L2m0j0K6n4Q1M0n7l0J1K2k8r3R4q2L1l5J40Nl8m7N2p6j4K7p2L6
$$ -26 -1 -44 93 32 64 24 14 40 -14 67 107 50 20 31 53 25 -68 26 -56 -25 -60 80 85 47 0 52 -24 -38 -11 -83 -47
-390d7
##PAGE=	F1=-11759.7
##FIRST=	23151.189942674980557,	6007.9998942000029274,	0
##DATA TABLE=	(F2++(Y..Y)), PROFILE
6008g6jM8j7J39o8m7j7J85j47r2P8j01J11K2J12k61P0n8J30o8J09M7o2M6j38J4J56O9j91N9
$$ -76 -77 -29 -46 93 25 -22 -39 146 -1 -93 -15 -116 -5 17 129 -132 -62 -120 10 -58 51 98 36 82 -56 -42 114 183 -8 51
5632E1q1L5k4J46k10R8J5J8Q2k44P9K1l9O9M4N0j36m1J8Q0np0M8M9m8J33r8qQ3Lj52Q1j12
$$ 51 -30 5 -19 127 -83 15 30 48 130 -114 -35 -14 -53 16 60 110 -26 -67 -49 31 26 -44 4 53 5 138 40 32 115 118 -34 47 -65
5219f5Q2K1r6L8NrP9J20k03lKLK0O3o5jJ5J03r3qM7j08P1N7q7n7J29j11N1l4Nl7J42j32j7
$$ -65 17 38 -58 -20 -15 -24 55 175 -28 -31 -29 -26 -6 57 -8 -9 6 109 16 8 55 -53 18 75 -12 -69 60 -51 0 -34 -29 -66 76 -56 -73
4781g3J6M9p0J3J00j08MJ1Q3j48R7K1m2RR2l3J42j43r0J82k12N9N3j26J80q4m5M1k8O6j07
$$ -73 -57 -8 -78 -65 35 -73 -69 -58 25 -123 -26 -5 -47 -38 54 21 163 20 -70 112 -100 -41 12 -114 66 -18 -63 -22 -50 16 -91
4393i1R8J4j9KMj0p8J57n9M7k2j08J37n9J1L2p1J9R2j11j6L2o3O2NJ4j17K2oJ6J11j46J21
$$ -91 7 21 2 4 8 -2 -80 77 18 65 43 -65 72 13 24 56 -15 4 96 -15 -31 1 -62 0 5 19 -98 -76 -82 -66 45 -101 20
3980B0j78R6k9J55j19P9J13j16L5m5p7N6Njk7q1J09k2J6p5J23pk7n1K4j3P8O7k8n0P0q5L6
$$ 20 -158 -62 -91 64 -55 24 137 21 56 11 -66 -10 -5 -6 -33 -114 -5 -27 -11 -86 37 30 3 -48 -24 -37 41 108 80 30 100 15 51
3567E1p6M4J1n2J36j24K3p3Q6kr7J37o8J7M5O4j93j26P7R0j6O3n9n9M8J41o3K8L2o9l9j0L4
$$ 51 -25 19 30 -22 114 -10 13 -60 26 24 -73 64 -4 13 58 122 -71 -197 -120 -30 -46 17 -42 -101 -53 88 25 53 85 16 -23 -33 1
3153Ao8k1O0j06J29l6R1j2K2p9R1k7o8Q8o7n8L9J13J9j71M7K4j7M4L8k6r3Q3j28J18j55O8
$$ 1 -67 -88 -28 -134 -5 -41 50 38 60 -19 72 45 -23 65 -2 -60 -21 92 111 -60 -13 11 -6 38 76 50 -43 40 -88 30 -125 -57
2753e7L9k5k1J69o0N6j82N0N5L3Qj80J41l1J34m7p6L1m8m2L8k6k9J68j34J6N9K4j75J84M8
$$ -57 -18 -43 -64 105 45 101 -81 -31 24 57 65 -115 26 -5 129 82 6 37 -11 -53 -15 -41 -70 98 -36 -20 39 63 -112 72 120
2365A20j42J39q3o6%ok0M4M6k0n2q8J19R8k14J19Q3j06lp5K04j23J7k2l0M0J05mj21K4P27
$$ 120 -22 117 34 -32 -32 -38 -58 -14 32 12 -40 -128 -9 89 -125 -6 77 -29 -32 -107 97 -26 -9 -31 -61 -21 84 80 -41 -17 710
1977G10p16q8j0R9O2j10K7k3J15m8m3%L3N3j04j01J77j6K4j1N6k1p1j40K30k1r1Q7mk8p7K9
$$ 710 -6 -94 -104 -5 57 -53 -26 -49 66 18 -25 -25 8 61 -43 -144 33 17 41 30 86 65 -6 -146 84 63 -28 59 55 27 -50 -21
1576b1J49j16J1qk67o70k664L094M30L8j3k2r1J44N3Q9j18K7l8MK0N0O4J1j01m5Mq2J96o7
$$ -21 128 12 23 15 -252 -922 -3586 -492 -62 -24 -37 -59 -150 -6 47 136 18 45 7 11 31 81 145 156 55 10 14 -68 128 61
1200F1J19j06p6m3l2J55qO1r4m5O3K3p6R5j44M2j33J66Q7J55j26r2j59JJ07j4Pr4Nk5pJ84
$$ 61 180 74 -2 -45 -77 78 70 131 37 -8 55 78 2 97 -47 -5 -138 28 115 270 144 52 -107 -106 1 -13 -6 -100 -95 -120 -127 57
800E7p7j45J87j2J03p4K4r1Q0J32j96l9L2lL0J00j79J43Q8j37J67j58q7J13n3j3P4q6j68M1
$$ 57 -20 -165 22 10 113 39 63 -28 52 184 -12 -51 -19 -22 8 108 -71 72 160 23 190 32 -55 58 5 -8 66 -20 -188 -147
424a47J75k90L03J8n3J5N9l8R9j85l1J52k3n6j6n3R6P5L9j81J1M8K5K1o4k17J65q3J07J67
$$ -147 28 -262 41 59 6 21 80 42 141 -44 -75 77 54 -2 -18 -71 25 100 139 -42 -31 17 42 63 -1 -218 -53 -136 -29 138
48A38L6k11m2P4Pp0J26n7N1m2l7J7k1R2L1o5K5rJ2k8r6J04q2M0n1J60j2o6j1N4r4mM6j02L9
$$ 138 174 -37 -79 -5 2 -68 58 1 52 10 -27 -10 -31 61 92 27 52 43 55 27 -69 35 -47 -7 -58 102 90 24 13 67 -27 -31 15 -87 -48
-390d8
##PAGE=	F1=-11854.1
##FIRST=	23151.189942674980557,	6007.9998942000029274,	0
##DATA TABLE=	(F2++(Y..Y)), PROFILE
6008f6l6M6NJ29n4k9pJ32j52q8R5p8R9L0J08k45J0qJ41n1R2P8j15R2j83N5J05N3j52J3l9N9
$$ -66 -102 -56 -51 78 24 -5 -12 120 -32 -120 -25 -103 -4 26 134 -111 -101 -109 32 -19 73 151 36 128 -55 0 105 158 6 19 -20 39
5607C9o9J64j89Q5k7Q2K7k03O1J4l0L2N8J01j73m0K4M1N0q2M0N3p6J51j06oR9j5j56J09o5
$$ 39 -30 134 -55 30 3 85 112 -91 -30 -16 -46 -14 44 145 -28 -68 -44 -3 47 -35 5 58 -18 133 27 21 120 105 -51 58 -7
5219gM9k8n2Lj0%P5J52k71J01j3pNP2j20K0R3N7r4k9L9o1M0M1r2n5J36j07Q3k2k9jJ39j23
$$ -7 42 14 -38 -35 -45 -45 30 182 -89 12 -1 -8 -3 69 -51 -31 62 119 25 -4 35 -26 14 55 -37 -92 44 -63 20 -2 -31 -32 107 -16
4794a6jj6Q3j18L7P0j38L3L3M9j88J31N2l9m2Q4J3J72j53j81K27j75N1J8r5J68l9p8Q5n2K2
$$ -16 -17 -33 50 -68 -31 39 -99 -66 -33 16 -172 -41 11 -28 -70 14 27 199 46 -135 92 -83 -32 -14 -109 59 20 -58 27 -25 -3
4405cq8J29o1K6J3Rj3j01J42p5Q5l4p5J39r2L3K4o8nJ39j24k4K9q1R4Jm1r2M6j6L7J45j44
$$ -3 -91 38 -23 3 16 25 12 -89 53 -22 63 29 -46 93 1 34 58 -10 -15 124 0 -24 5 -76 18 19 -22 -114 -68 -84 -47 98 -46
3992d6O2j76P2k6J80l5qP9j32P3ko1MJ2nJ7j45J45n2K7p1J23k4J1n3L4o4P9Q3n5M0K0p1K5
$$ -46 16 -160 -88 -114 66 31 23 102 -30 43 41 -20 -16 -4 -9 8 -137 8 -44 -17 -88 35 11 22 -31 3 -61 18 101 46 86 106 35 60
3567F0n8L9J4r4K07j55Rp6M6K5n2J24q9j4R9K0j84q1L0R0JN6m9o9P3J09m3K1L8p0m5mop1k0
$$ 60 2 41 55 -39 168 13 22 -54 -8 17 -35 89 0 -14 85 105 -79 -160 -130 -40 -39 17 -32 -101 -28 81 38 59 97 27 -18 -22 -28 -99 -119
3128a19J00j44J59%P8k2k3m9J21o4j00J15k9j12N3Q6L3j33L0L0jL3O2o1q0Q5j07O8j51P8O1
$$ -119 -19 -163 -4 -4 74 52 29 -20 101 37 -63 52 23 -89 -36 50 83 -50 -20 10 9 42 104 43 -37 48 -59 9 -142 -64 -3
2740cj3l6J69o6K4j36nJ52J6n8j57J43k9J63p1n8j2K9r5J8Mk8J09j13O9QP3j95J09J08j51
$$ -3 -16 -52 117 51 75 -61 -66 86 102 44 -113 30 1 164 93 35 23 52 -43 -25 -21 -49 60 -53 16 24 97 -98 11 119 -32
2352c2J35m7p8m0K8mJ0R9l8r3p1J30J20k16O6R5r0Mp7J35m5J0k3o2K8J22Qq7n7Q08p59p5J9
$$ -32 103 56 -22 -62 -34 -38 -28 71 33 -60 -131 -1 119 -97 -31 64 -26 -22 -99 36 -9 1 -22 -84 -56 66 74 -13 -70 738 -21 -96 -77
1939g7R5L1r5L2l3J02o0Jl7N8M3j21p7J36j0N1l7M8L7j40o4K07n7p6N0L7j4m8RJ25p4l0Qk52
$$ -77 18 49 -46 -14 -47 55 -5 -4 -41 17 60 -61 -138 -2 -12 39 2 50 87 -53 -117 90 33 -43 7 44 30 -18 -9 116 42 12 20 -232
1513b32o49j60R58J1L9L4l5r7J58QP0q5Nl4K8O7lJ7N9j59M4j2p4J75r0J06j00l9n1r6K01j4
$$ -232 -881 -1041 -83 -72 -33 1 -34 -131 27 35 105 20 25 -9 19 86 83 100 159 0 44 32 -42 133 43 149 49 10 -41 -137 64 50
1113E0P1p4kK7j2m0J01j62J4q8J40N8J50p4j07j61k5J25J8j5r0Mo1J1K04j06j22J86j7R8j7
$$ 50 121 47 45 72 60 20 121 -41 -27 -115 25 83 233 159 52 -109 -134 -9 9 -6 -96 -92 -153 -142 62 -44 -166 20 3 101 84
725H4Kp5N2R4j78m3P8j3J8J02j52J07K7j29J88j19j14Q7l9K0P1p1j75JK10l00L52j2n1L2K8
$$ 84 86 11 63 157 -21 -64 14 1 19 121 -31 76 103 -26 162 43 -71 16 -23 -3 68 -3 -178 -177 33 -267 85 73 22 54 82
336H2q6J40j88o4J77J4n8qr0R4P0O2j67j3J00m7M5o4j64J33j02J18J08N9k08N5K0j1q8J09
$$ 82 -4 136 -52 -116 61 75 17 9 -81 13 83 145 -22 -35 65 18 63 -1 -165 -32 -134 -16 92 151 -57 -2 18 7 -81 28
-39B8m7N0l0n6MNR6K4n9N0k2K4k8q7Q8o8L5m8J54k3q7K9K5o5j0M2j15N5
$$ 28 -19 31 1 -55 -51 -46 50 74 15 65 43 67 39 -48 40 -28 7 -41 113 90 3 32 57 -8 -18 24 -91 -36
-390c6
##PAGE=	F1=-11948.4
##FIRST=	23151.189942674980557,	6007.9998942000029274,	0
##DATA TABLE=	(F2++(Y..Y)), PROFILE
6008e1o4K7K9J02Kk7rP4j24o1P6p0Q0M7O6j90k7M4J25l0P4Q6j45J04j58M5N8M0j08m1MQ0p8
$$ -51 -115 -88 -59 43 45 18 9 83 -41 -102 -26 -96 -16 31 97 -93 -120 -76 49 19 93 179 34 138 -20 25 83 123 15 -26 -22 58 -20
5595b0J40j29M6m3J01rj45J7K0llO4J40k25mkM2R8j00K1M8j06J60j04nJ24m7j25J19l0K7p0
$$ -20 120 -9 37 -6 95 86 -59 -42 -22 -25 -28 36 176 -49 -53 -55 -13 85 -15 6 54 -52 108 4 -1 123 76 -49 70 40 67 -3
5194cpk8j3j6P0J55k92J79j6l0%N4j36K8J64J1r3l8K0oK2mp8l9J22r6J08k4n8M1J33j02qk8
$$ -3 -10 -38 -51 -67 3 158 -134 45 29 -1 -1 53 -83 -55 109 120 27 -11 9 3 25 21 -57 -96 26 -70 38 14 -44 -3 130 28 20 -8
4769hJ02j70P2L3j24N3L2L2k30J62P3m1q8J03J3J76j31k26K20j14M7pp6J38mp9J02n1qo4J04
$$ -8 94 -76 -4 29 -95 -42 -10 22 -208 -46 27 -14 -102 1 14 190 59 -167 53 -61 -14 -21 -97 41 37 -42 60 9 1 -63 41
4380D1j05Q9K9Kk8j31J31r5J20m2m3J15j03O5K2p1k1J29j16pL5r9J23rr3m4M4k7O2J56j16
$$ 41 -64 25 54 56 28 -103 28 -67 53 11 -32 83 -20 45 67 -4 -25 104 -12 -19 16 -83 40 31 -62 -106 -62 -89 -27 129 13
3992A3k1j22M0n3J89M9p9L1j06R0K8m2m1M6j4N2j85J33p2M2o2J25n3M7m2M5j06O1Q8q3J13
$$ 13 -8 -130 -90 -143 46 95 16 47 -59 31 59 17 -24 22 8 60 -125 8 -64 -22 -84 41 -12 35 -7 38 -68 -7 81 -2 111
3604A11k8l6J5j5nK5j17K31j72J1l5l1N6pJ12r4l2J12k2j71ol8J01j2O6j7q4P1O6k4J4N3o2
$$ 111 83 47 62 47 42 67 -50 181 9 20 -15 -46 10 3 115 21 -11 101 79 -92 -98 -136 -35 -47 19 2 -82 -11 55 31 45 98 36
3191C6m3J7m9p5k1J24j41J57RQ0j5p3k6J31r0j13J10J2j36P3L6N5r3J3%L4J5J16j03p9J12
$$ 36 -7 10 -39 -114 -135 -11 -152 5 14 94 79 6 -20 111 21 -92 18 30 -106 -33 3 58 -35 -22 -22 12 27 143 40 -39 73
2803G3j14J4j15Q8P1Ko2J60p4pp0o9K40mj05j10R9k9J72q0j9m1R4j50J0L2m0N2n9J07o9J17
$$ 73 -41 -27 -142 -54 17 19 -43 117 43 36 -34 -103 137 133 28 -82 17 -12 160 80 61 20 114 -36 -26 6 -34 18 -41 66 -3 114
2402A14j79MJ77j73J20ko4p0N4Qm1J63o9j17o2J28J36j99L8R5p6J7p9O9%L1n9o3K1J42rn8
$$ 114 -65 -61 116 -57 63 61 -3 -73 -19 -11 -52 111 42 -75 -137 -9 127 -72 -34 61 -15 2 -77 -8 -8 23 -36 -99 -78 64 55 -3
2002cp0Q53q27m8N1R5np3J9k3Q7p8M0o9N3N6j40k3R0k7O2o4M4J01j94L7J61r1o9J2P1oolR8
$$ -3 -73 780 -47 -95 -44 51 46 -27 -8 -31 56 -22 18 -51 2 58 -82 -105 -15 -42 20 -44 0 101 -93 -56 105 14 -55 -43 28 22 16 13 111
1563A11l4p2K0j88p54N379l649q84L5O6m0q8J21nM7o4nl0L3J17k6m0Q4k01J14l7k1J30r6P3
$$ 111 77 5 25 -163 -917 4462 813 -71 -36 30 -10 -98 23 18 65 1 -4 -34 -1 116 90 50 134 -67 47 10 -11 119 23 96
1188I6q7Pn9j18K10j3P9o5K1Mm1kJ05j63k8k2J11K1J08j5r0j58m2J13O0k9p8Pj00K1K10j17
$$ 96 9 16 -43 -161 49 36 115 50 71 75 34 32 137 -26 -54 -76 35 56 164 149 59 -99 -141 -28 32 3 -75 -68 -168 -147 63 -54
787e4p8J40j3R9K6m3k4J6M6j44k8J10m6J8R6j07M9j0r0J72m7j71O3j4M8M8o2j43l9K16k82
$$ -54 -132 8 -5 94 120 77 53 69 115 -29 -57 53 7 25 121 14 63 53 -37 135 88 -83 -20 -34 14 62 0 -143 -182 34 -248
399b48L50k9l2M0j5j28J67j58n6J31N6k5kj13P2L8Q0j43j0J24j01M3l7j10Q5q9R3N5P8k09
$$ -248 102 73 41 81 66 -62 105 -53 -109 22 78 53 51 -62 10 48 128 -15 -25 99 -2 41 4 -106 -21 -110 -17 38 116 -93
23i3J46rk9r8R8l7L1j1m2k6J5R4J6l6N2l9M0j9o7N8m7J6k4J27k7q9N3k8pj6J4j16P5
$$ -93 53 44 15 -83 15 -22 9 -2 -44 -70 -55 39 55 19 71 32 72 53 -14 44 -3 13 -11 116 89 0 53 25 18 2 16 -100 -25
-390b5
##PAGE=	F1=-12042.8
##FIRST=	23151.189942674980557,	6007.9998942000029274,	0
##DATA TABLE=	(F2++(Y..Y)), PROFILE
6008d2o5mM5P1O9k9k8L5p2j4K9q4M9O7Nj12l4Q0Q1nO0P8j58J04q8lL2L4q8q0L1J07p1Q6o4
$$ -42 -107 -111 -66 5 74 45 17 52 -20 -34 -5 -89 -40 27 32 -80 -114 -34 47 42 102 180 22 126 38 35 67 101 13 -67 -36 71 0 86 22
5570B2J6l6O0Jq2m7M7J9k5N3J68k81N2m0Q6J06j15RL8j25J61r6rJ52r3o4J10j6K2r5K2n8J6
$$ 22 38 2 62 63 -19 -66 -19 0 -25 28 196 -85 -33 -73 13 119 4 13 51 -74 87 -9 -18 134 41 -23 87 71 93 -2 20 -38 -22
5157b2n6O4J35k66J90J2n2j4K4j01J3J97j1j01j9j0M6J6o5l3l4R6r6J33l7o8N9J34p4k2l3
$$ -22 -78 -14 121 -145 45 57 5 -9 15 -86 -73 124 113 12 -7 -17 29 45 -20 -53 -87 9 -87 46 9 -59 0 134 60 38 5
4769EJ09k08J05%p5N3RM3k51J59Q5n3j06J36l2J67p6k28J68l8L4op8R4J3n1Q2k7jm6L1j10
$$ 5 114 -94 11 11 -64 -11 -2 41 -210 -51 34 -19 -125 11 -21 146 70 -158 10 -28 6 0 -78 16 29 -22 60 33 32 -14 17 -93
4368i3J40O3k4m4j47J11j11J44n0k0P5r4J04K5r8nP3r5L8K7j09J51k2j27mL3l7Q1J63q8j00
$$ -93 47 110 86 42 -105 6 -105 39 -11 -31 44 -50 54 79 -19 -24 49 -46 -8 19 -90 61 39 -88 -92 -59 -96 -15 148 60 -40
3980d0l9J1r2J73J09j06j7o8P8M7k1n6Q4k1N7j80P4q9O2m3J25q2O3mM9j36L6P9j06J53n9o
$$ -40 -79 -68 -160 13 122 16 -1 -69 9 56 35 -21 63 42 99 -81 -7 -96 -34 -77 48 -34 29 25 74 -62 -26 53 -53 100 41 35
3579C5J9M2o7K5j11K06j67J8L7j12Q5K8J04j01k5Q7n8j51P9j08J20m5R7Pq6M1J5j4J9P4m9
$$ 35 54 96 29 54 -57 149 -18 0 37 -75 10 38 142 41 16 103 45 -106 -27 -135 -15 -60 37 44 -42 -1 14 0 19 93 44
3191D4l9M5p9p3l0J21j05J34jQ5%j13%R9q4r6P6L0j16P9nO5n4j3m2P6mJ75j38q7J55j30m7
$$ 44 5 50 -29 -102 -132 -11 -116 18 17 102 102 -11 -11 88 4 -92 -16 14 -102 -23 -28 37 -17 -30 -72 4 0 175 37 -50 105 -25 -72
2778g2o1J10O9J3r9J52q6l4%j19K81j4j31l7J9k7J59o7K8o7J23j76J3N5o8K3kJ33j53J43j27
$$ -72 -133 -23 46 59 -40 112 26 -8 -8 -127 154 140 9 -28 -9 -36 123 56 84 17 140 -36 -23 32 -36 -13 -15 118 -35 108 -19
2390a9j03K34k00R6L8l2q5P5%q0K08q6j29o2J22J37j62L8O6o6L4q3L0J2N9j14l3J9J64m3m6
$$ -19 -122 112 -88 8 46 14 -71 4 4 -76 132 46 -83 -145 -23 114 -48 -10 56 -10 24 -59 -29 -17 42 -72 -105 -86 78 35 -11
2002a1k2Q08q54j8R1Q0l4m5moP9r1O5p7kQ2j45M7N8n8N6j00M3J53k05J24J07j07p9j4R1qL1
$$ -11 -33 775 -79 -97 -6 74 40 -5 -9 -15 64 -27 38 -39 -41 41 -104 -57 1 -57 -1 -101 -58 95 -110 14 121 14 -65 -79 12 4 35
1588C5NQ4k0r0K1p6q86J2516r627k027K7Q0m8n2M8J3K5o5Kj6KJ49Rq6O9k08J41p1N4P8q6L4
$$ 35 40 124 104 14 35 -41 -927 11589 1962 -65 -38 42 -6 -58 -10 3 28 -37 -35 -51 -49 100 109 23 92 -116 25 -46 8 86 0 34
1188C4o2N5p5r3J72JP2o7K7j2m3K8J20j57p6L6R4qL6K2l0j56l7P1J03m4n1Oj24K2J98r9l9
$$ 34 -28 27 -48 -141 31 32 104 37 64 52 9 37 157 0 -76 -40 54 46 82 104 74 -82 -119 -48 55 11 -40 -34 -158 -136 62 -37 -76
775g6P1j1J07K9p3K9j3J2j14oJ23q5K8Q9m8k3j9k8J30K2k25M1J9O1J2n7q6o1J85k51L06k9
$$ -76 -5 -16 91 120 47 76 63 75 -39 -45 78 -7 21 110 62 39 20 -8 122 144 -81 -40 -21 40 52 -5 -91 -152 33 -218 88 59
374E9pM7n1j56J63r2k6N1Q8J7Mj18L9mP4j14K3J13j26L1op2M0n6N2L0Q6k13J88Ll7r7Q7k7
$$ 59 52 99 48 -108 55 -37 -63 -12 76 93 97 -21 18 14 88 -26 -3 110 -16 15 9 -63 -23 -79 -27 3 89 -124 64 67 30 -67 20 -7
-52gKNJ6q6QR4QlM2o1L5jl6L0k8j0J4R6l2p0M9q4N3qk3j15Q7
$$ -7 -5 0 16 -70 -62 32 40 37 79 18 53 52 16 46 18 8 22 118 86 16 65 -19 34 26 3 -112 -25
-390b5
##PAGE=	F1=-12137.2
##FIRST=	23151.189942674980557,	6007.9998942000029274,	0
##DATA TABLE=	(F2++(Y..Y)), PROFILE
6008c9l6l9M7M4J10k4n4K4j6M0k4j05OQ3n4l3k3R0K1K8M7O8j66J10lo5K7L8r8r1L4J35o3L2
$$ -39 -75 -114 -67 -23 87 63 9 33 17 57 33 -72 -66 17 -37 -70 -93 -3 18 46 93 161 -5 105 102 37 64 102 4 -87 -53 82 19 51
5582E1l0J9j9k3N0l1j03Q5J6k5K3J91l23J01n9J37O8j15J0K9j23J61r2j7J68j43LR2j7L6j04
$$ 51 21 40 21 -2 48 17 -86 -1 15 -10 13 204 -119 -18 -77 60 128 13 23 52 -71 90 -2 -19 149 6 9 101 84 120 16
5194A6L1q6P1j04N6J05k14J31P6o4m4Ol6k4J81nj15K1l8Q1K1j25L7n1O9j15J66o5n0M1J42
$$ 16 47 -39 32 -72 -16 89 -125 6 82 18 -26 -20 -56 -80 101 96 -19 2 -36 45 66 -59 -22 -73 -4 -119 47 -18 -68 -27 115
4806A15m7k9l4J00k06J19k2k0L6l0Q5k32J08Q8o4r7J58r4J62j2k06R7M2NJ7r0M0J5qL1nM5
$$ 115 68 39 5 105 -101 18 -4 -24 12 -18 67 -165 -57 31 -33 -130 28 -66 96 84 -122 -25 17 22 39 -51 -11 4 -4 27 22 67
4405F7k9n7q6J55J13o1n0j38P4j12J50o1qL8p1J35K5j44M5Np4R9qj09J75l2j39NK8m1R5J72
$$ 67 38 -19 -105 50 163 102 52 -86 -12 -124 26 -35 -43 -5 -76 59 84 -60 -15 -10 -84 15 7 -102 73 41 -98 -93 -65 -106 -11 161
4005A61p6j48M2rj23J38J35q5o1m0M3N4jl3J02k6L4j29j1r6Q1j7J17j00M8N5M7j47J6N1j15
$$ 161 85 -63 -21 -30 -153 -15 120 35 -26 -66 -23 31 30 -3 99 73 107 -22 -33 -129 -48 -65 52 -48 0 55 102 -45 -29 22 -93
3617i3J62p1KM1R6j24Rq6J50j37K2J08j68J08N2R3j22J1L9p8j29J43j52J33p3J36ko2nl5q
$$ -93 69 -2 0 41 137 13 22 -64 86 -51 -29 79 -89 19 71 164 42 53 92 14 -115 28 -124 9 -64 72 70 8 3 -32 -40
3229d0L8R1m2l0O5r2n9m5J01o0R6j3Q6J0j36M0L0m9n2L1J8o5O1k9P1k5n6n9J05j4K09j60r7
$$ -40 -2 89 47 17 82 -10 -69 -114 -13 -73 23 10 96 106 -30 10 40 -9 -61 -30 -12 -77 -16 -45 26 1 -55 -114 -9 -23 186 26 -71
2815g1K00j32j09oJ40N0J3j29J53j01m9N2j32K53qj44N4p3k0J30l6O5r7J16j57J8P1j00J9
$$ -71 129 -3 -112 -118 22 72 85 -44 109 8 -41 11 -121 132 124 -20 34 -39 -59 71 35 100 3 119 -38 -20 51 -49 -30
2452c0L0J57k13J43n8j83K61k20O7O6Lr4R8l1q7K12p4j30o0J17J11j09N4Nn1M0q3K8NP0j54
$$ -30 0 157 -56 87 29 -154 107 -113 -46 20 23 -71 27 -4 -91 121 47 -83 -143 -26 85 -24 30 35 -16 24 -59 -31 -26 44 -110
2064a10MK3J76p2n5O2P30q59jJ31L7m2j3k1jQ1r2P6n6q6R9j32J12M8q7K8j30L5J74j59J66
$$ -110 -106 -83 93 21 -34 28 758 -101 -102 29 66 24 11 -10 -11 70 -22 54 -2 -88 11 -121 -9 39 -48 -20 -150 -115 59 -100 66
1676F6N8r7j00j7R3k1N5K6R1l7p2OK5r56J8371j4611k939K1P3o9K4m2M4J0q6L2Jn5J51R6j05
$$ 66 124 27 -73 -90 3 -18 37 63 154 117 45 51 76 -880 17491 2880 -59 -38 35 -34 -10 -52 -8 2 -84 -52 -51 -106 45 141 36
1288C6Qj71J26j05J12L5o7Rl0J00r9m5J10K1M3q0L4l4rM4J42j51j12O4R2k4l7K2M9j44qJ1
$$ 36 44 -127 -1 -106 6 41 -26 -17 -47 53 -46 -91 19 40 83 3 37 3 -6 38 180 29 -83 -19 73 49 12 34 83 -61 -69 -58
887e8J35o8j3lj20J7J67n7j7Rj4J05no6O0l7J3r1RJ18j24M3Q9J4q3j7L1Q7N5k39K5M2N9j8
$$ -58 77 9 -4 -7 -127 -110 57 0 -17 -8 -22 83 78 12 72 35 48 -43 -34 84 -40 3 92 106 23 6 37 124 179 -60 -35 7 66 48
462D8n4k6n6J18k25K50k4J5O1o5j67J28j5Lj2R2M7J7j09Rl7L9q7P1Q4j22K4jn0Qj9K0L9P2
$$ 48 -6 -32 -88 30 -195 55 31 46 107 42 -125 3 -12 -9 -21 71 118 135 26 35 -2 37 -50 21 105 -17 7 6 -44 -36 -55 -35 4 76
36G6k03J64M7l0q9P1j9k3J2J03j68rR4JL3K9p7%J7lJ3rl6N4P2m1m2K1j19R0J8n0j15Q3
$$ 76 -127 37 84 54 -35 36 17 -6 6 109 -59 -68 26 27 60 89 12 12 29 26 39 30 -6 48 120 79 37 58 -61 29 47 -3 -118 -35
-390c5
##PAGE=	F1=-12231.5
##FIRST=	23151.189942674980557,	6007.9998942000029274,	0
##DATA TABLE=	(F2++(Y..Y)), PROFILE
6008c4No5L1K4J06mp6L3K6Q3n5j16l4Q9r8K1rP3k5O8K2P1j78J29N6j03K8M5j16q5K5J49o0
$$ -34 -29 -94 -63 -39 67 63 -13 20 46 129 74 -42 -76 13 -85 -64 -73 0 -25 43 65 136 -42 87 143 40 68 113 -3 -88 -63 86 26
5595B6Ql5M5qj08J17%j32J14pj4j2K08l35J23m6J54Pj04K7K1j04J70r4l5J70j81N6O7j2N5
$$ 26 34 -1 44 36 -72 45 45 -87 27 20 6 -6 202 -133 -10 -56 98 105 1 28 49 -55 115 21 -14 156 -25 31 98 86 141
5207A41j05K6j05J30j38M4P5j63L9J56o4p4KK8p0J28K1j28O1m4Q8L4j70J07q2M8j39K00r8
$$ 141 36 62 -43 87 -51 -7 68 -95 -56 100 36 -38 -36 -8 -78 50 71 -57 4 -40 48 82 -88 19 -63 -15 -154 46 -52
4844e2j3nJ52k7k4l8Q5j53R5k9J3J5p0J51j78K1Q1n8p6J45j33J64M0j83K9J16l4M9j06rJ1
$$ -52 -65 -70 82 55 31 -7 78 -75 20 -9 4 19 -51 100 -78 -57 24 -34 -110 35 -98 66 106 -77 -48 68 34 83 -23 -32 -21
4456b1K4k0nJ01pj16n7J35J57r1n5j00K8r7J46o7j6J5l9J46J9j98J15m6o1J62o2j05J82l4
$$ -21 3 -17 -22 79 72 -44 -101 34 191 100 45 -55 -27 -124 22 -45 -61 -46 -85 61 80 -118 -3 -49 -110 52 -10 -115 67 33
4080C3j33j8L9l6J05J74q2j45Q9j4j32Q9J37l3r6l0lN0QJ6R7l3%n3q1r1R0OJ02j00LJ10M8
$$ 33 -100 -118 -79 -115 -10 164 82 -63 26 12 -120 -31 106 73 -23 -53 -56 -6 2 18 115 82 82 29 -52 -143 -53 -47 55 -45 -42 68 116
3667A16j36RJ0j14J58p9qP6J31j59j2n9Q2q5J3J46j76J22O9O6j47N4Jq2j14J65j45J30q2J63
$$ 116 -20 -11 -1 -115 43 -36 -44 32 163 4 -8 -67 15 -70 -57 89 -87 35 104 170 23 77 78 -4 -118 47 -98 32 -50 113
3291A13m4rn6q0RN9R7m8j3P1r3l5o2Q7l6N7j6P7J0j39R3n3oQj3j6qL2m5Q7oj18l4J03kK08
$$ 113 69 60 4 -76 -67 -8 89 41 28 99 6 -29 -91 -4 -40 17 1 78 88 -51 42 -11 -17 -9 -22 -38 -46 -14 -59 28 22 -96 -130 -27 -29 179
2840A79j75r9K25j02j58K9J69J7Kj34J60j12m8P5j08J66J1j56J46j48rR0JQ5j29Q7r5J7P4
$$ 179 4 -95 130 28 -130 -101 68 85 87 -47 113 1 -47 28 -80 86 97 -59 87 -61 -70 20 21 106 -23 64 -31 -14 60
2477F0j25L5K1J83k31J17Ok18K51k19L8P7K4j03J22p3n9J77m7j13m6J16N4m6P1p0l3K9p4N4
$$ 60 -65 -30 -9 174 -57 60 66 -152 99 -120 -82 -5 19 -84 38 -35 -94 83 36 -77 -123 -7 47 1 72 2 -31 -2 -76 -22
2102b2kM8j45J4L1J76q9p8J56P73r58lJ55k9k3K3k5k4Q3p7Q2k2j51R2j12J57M8j01j3j42J6
$$ -22 -24 24 -121 -107 -76 100 11 -67 89 862 -96 -99 56 27 4 27 2 -22 61 -16 66 44 -107 -15 -127 30 78 -23 -36 -178 -162
1714a62J63p8J58K6o4j14jP5m0P2M2J10p6k3j8N5r26K0347j6406l196L0M5j05J36j27N9Nj10
$$ -162 1 -77 81 107 43 -71 -72 3 -37 35 77 187 111 88 70 125 -801 19546 3140 -56 -26 19 -86 50 -77 -18 -13 -123
1363a23P6Pj11J29J93r1q0j01Q8j26J27Rn4QKJ38j19oN0M3qr5M9o2N1M4J48j36j21N6R4k9
$$ -123 -47 -40 -151 -22 171 80 0 -101 -13 -139 -12 -3 -57 -49 -47 91 -28 -34 16 59 51 -44 5 -57 -6 38 186 50 -71 -15 79 50
962E0p4j9J17j18M2m9J46r6J8j7r2K1J13lj2k1k0P8n6j7N5n6M6o6J2R9j62N8R3P0j08k9P1
$$ 50 -24 -43 74 -44 -2 -51 95 -1 17 0 -92 -71 42 39 27 6 -14 64 8 -9 46 -10 36 -30 -18 81 -81 -23 70 140 32 3 74
549G4N7N1k05J5N0M2l3m9J7l1M0k13K06k4K3Q8n7j68Q1M7J4k9O2N6M2r5on9kp2J14O1r9K3
$$ 74 131 182 -23 -8 42 84 51 2 19 -12 28 -185 21 -3 20 108 51 -117 -36 11 25 -4 58 114 156 61 55 -4 -6 -78 36 97 -2 21
124B1k2l7j8J1RP1L5j69J04Q2ro9M3rl2J1J69k33l3Q9LO2Qo7n3K2J7RJ3n5Q7N5m9j9k0j17
$$ 21 -1 -38 -56 -45 -36 35 70 -99 5 87 78 9 52 43 11 22 191 -42 -75 14 17 79 87 20 -33 -11 6 15 28 -27 60 115 66 47 27 -90
-327i0R5N3n7j09O5
$$ -90 5 58 1 -108 -43
-390d3
##PAGE=	F1=-12325.9
##FIRST=	23151.189942674980557,	6007.9998942000029274,	0
##DATA TABLE=	(F2++(Y..Y)), PROFILE
6008a7L2p3LQO6K9r2M9M3J05o1r6n5R0j28L1oN2m3J06j6Q6j84J44P3r6J9M2j19p4J6J37n2
$$ -17 15 -58 -55 -47 19 48 -44 5 48 153 92 -4 -59 31 -97 -66 -72 -20 -63 43 27 113 -71 73 146 50 69 111 -8 -82 -66 71 19
5595A9K3o4O7j3j49J68J2j25J16l9Om3K12l07J13oJ12l3r7N3J1p7J81r0o5J64k01Q4L8J0O7
$$ 19 42 -22 45 32 -117 51 63 -62 54 15 21 -22 190 -117 -4 -10 102 69 -28 25 36 -41 140 50 -15 149 -52 32 70 80 147
5207A47j06K1j08J65j41K3M3j17l9K19n5q6ON9j03O4N5j28O9j5O7N0j90J51j14M6j57K23j26
$$ 147 41 62 -46 119 -22 1 44 -73 -112 107 52 -34 -28 31 -72 -8 47 -81 -12 -27 40 90 -100 51 -63 -17 -174 49 -77
4844g7K5n2J54k3ln0P0o0K9j6J1Lr7K20j14o5O2k9n3R1j27J61P2j69j5J58o3P5j18m3J2K6
$$ -77 -52 -104 50 27 24 -26 44 -16 13 -3 8 11 -86 134 20 -45 17 -12 -65 26 -101 60 132 -37 -52 106 43 118 0 -43 -31 -5
4443em7k1J26K1j17m0R8J68j01p0m1lp5J35o2m4J2nJ26J5k38J72o6n6K03j07j01J63k3j15
$$ -5 -52 -73 53 74 -43 -83 15 183 82 12 -29 -32 -107 28 -34 -78 -66 -71 55 70 -168 4 -62 -118 85 -22 -123 40 17 -98
4067i8n5O2k7J06J62r6r1Q9mj24M5J23K3j24k5l5K6NO7Q2m6k3J2j10o7Q5J3Q1q0n6J36N4r9
$$ -98 -153 -91 -118 -12 150 54 -37 52 48 -76 -31 92 115 -9 -34 -69 -43 -38 29 111 65 42 54 -56 -123 -38 -25 56 -24 -80 56 110 11
3654A1Nk6j08J53q3l3J16J37j64k6m3J5j8mJ30j37J29Q0K0j57Q2j7p2j08J43q2J05o8J59r3
$$ 11 16 -10 -118 35 -48 -81 35 172 8 -18 -61 -46 -64 -68 62 -75 54 134 154 -3 79 62 -10 -118 25 -57 48 -20 139 46
3279D6N5r9j14M3P6Q9p1J4O4q8j2p0Q7m1K4j2O0Pj24J37j15K6N9m6n1L1J6o9J18Mj82K6O8
$$ 46 101 2 -112 -69 7 96 25 39 103 15 3 -67 20 -21 3 -9 51 58 -66 71 -44 -18 41 -5 -56 -25 -9 -78 40 44 -138 -112 -44
2865d4K9J76j84r4K27n3j73K8J88k5qj06J61j10l3O7n7M6L6j60K08j90%N3K0R9j52N6rNN9
$$ -44 -15 161 -23 -117 110 57 -116 -88 100 75 67 -39 122 12 -21 46 -11 35 71 -89 119 -71 -71 -18 2 101 -51 5 -4 1 60
2477F0j35N4j6K07k07P9L9k07K15j94J7O7K9j15J40j04j6J22l4o8k0J17k7K4O9j20k6J2o4
$$ 60 -75 -21 -37 170 -37 42 81 -126 89 -105 -88 -21 8 -107 33 -71 -87 35 1 -67 -87 30 3 27 96 -24 -50 -38 -102
2114a02R2jOq8j5M2J61r4r8K31R92j185k3J51r3J9N6j3p4O9n3R1Mj58O4r6J78L5r7n3j32q
$$ -102 -10 -11 -5 -93 -108 -66 95 1 -97 134 1126 -59 -82 69 -24 -5 51 38 -36 33 -20 71 75 -83 -19 -115 63 98 1 -52 -184 -192
1714a92J40oJ18J4k3j06K3M4n6Q7M1J17j08K8l1Oq00J7817j4454k716O2Oj52K60j96N3Kj24
$$ -192 -52 -58 60 74 51 -55 -32 12 -44 43 84 201 93 121 90 96 -704 17113 2659 -57 5 11 -141 119 -77 -24 -22 -146
1363a46J21rj39J02K51n2j67j8N7j33J04rm8K2K6J59j19LJ2O6p0j00O3q6J17K7J27j04j00
$$ -146 -25 -34 -173 -71 180 128 -39 -57 0 -133 -29 -38 -86 -64 -38 121 2 5 17 83 13 -87 -24 -110 7 34 161 57 -43
1000d3J6R3l2o2p9J54q0R3q3J37j23L0l2n6L6M4M8nk3k2K2r0N4J6p6R6l4PP6j96O4R8J06r1
$$ -43 -27 66 34 -28 -107 47 -33 60 -23 114 -9 21 -11 -67 -31 13 61 56 33 11 33 -57 -3 13 -63 33 -1 6 82 -114 -50 48 154 63
574F3o0Q2M4L4j45J2L7K5l6l9L8qk1k09J86l8J2J27l8j61M2Q1Nj2J2M9P2q2jq0k2p2J38N3
$$ 63 3 85 129 163 18 30 67 92 56 17 55 47 26 -183 3 -35 -23 104 66 -95 -53 28 33 21 33 82 154 72 71 -9 -31 -103 35 88
149H8o2J6n3j6n1K7K3J04j6j14N1P8J2l2LQk1%J82k44o4P2J5Q0k2k7r6OJ5J1M1o1J06L9n3
$$ 88 26 42 -11 -27 -78 -51 -28 76 60 -54 -3 75 87 55 58 66 45 45 227 -17 -81 -9 6 86 64 37 -59 -53 -38 -27 14 -47 59 98 45
-290D5lo4q1P6Q2l9r4M4
$$ 45 42 -22 -103 -27 55 16 -78 -34
-390c4
##PAGE=	F1=-12420.2
##FIRST=	23151.189942674980557,	6007.9998942000029274,	0
##DATA TABLE=	(F2++(Y..Y)), PROFILE
6008A0L3o4k3rK2O4j03N5L7J05m8n0n0R3j44lj7M1k4J25o1J08j70J35M8m7jK3r2p1J1J02l3
$$ 10 43 -21 -44 -53 -31 33 -70 -15 22 127 79 29 -21 72 -72 -75 -92 -51 -75 50 -11 97 -73 62 110 63 62 85 -7 -78 -67 35 2
5595BN8r0P0l2j28J81J7r6Q0n5K3n3J92k46Q2L6L3k7j12Q3Jn8J85p7r9J61j99Q7MM7N8j02
$$ 2 60 -30 40 8 -120 61 78 -18 62 7 30 -23 169 -77 5 41 74 47 -65 18 19 -39 146 69 -30 131 -68 19 23 70 128 26
5194B6K1r5J65j16mPo8p5K36m0o9NM7j05PR1j13L2M3L5N9j76J49j29O1j64K25j33M3p6J41
$$ 26 47 -48 117 1 -3 4 -64 -139 97 57 -12 -7 40 -65 -58 33 -80 -48 -5 30 89 -87 62 -67 -6 -170 55 -78 -35 -111 30
4806C0l2K4o3N7L2m9Oj5Qj10K74o8j18L1J0k2J1p7J36Q7j55l7J61o6Q3j23o3K7pl4l4R7M4
$$ 30 -2 22 -41 16 48 -1 5 -10 -2 -112 162 94 -24 7 17 -5 6 -71 65 152 -3 -40 121 55 138 15 -48 -21 -28 -62 -96 1 45
4393D5o0m2P4J29r6r4K2Jo0J24m8q5K0K9Q2J5k50J96o7m4K05j22r6J26mq7q1Q6k2R0J28j07
$$ 45 -15 -57 17 146 50 -44 -22 -21 -81 43 -5 -90 -70 -41 41 56 -194 2 -65 -109 96 -26 -122 4 0 -87 -168 -82 -104 -14 114 7
3992G%M9J7j10J3J06O2j51km4j2j3J02P1o5j6L3r0l3O9kO3m3j03J13O5l9j3l8j02J50p7o3
$$ 7 7 56 73 -37 -24 82 144 -7 -9 -53 -65 -78 24 95 30 14 47 -43 -76 -7 -9 54 11 -92 21 86 47 34 -4 -106 44 -33 -96
3579i6J49J10j44k2l7m9M7j9P2p5J32Q5l2j39Q4k5n5j06R5J9N6m3J32j24J09j25j31P1R6P1
$$ -96 53 163 19 -3 -40 -89 -42 -61 11 -64 68 153 121 -18 66 41 -14 -120 -25 -6 50 7 139 15 124 -1 -132 -61 35 106
3204A06j04M5M9p4jo0R0o4Nj4M4Qj00J57j38M0Q3p0o7M4K9j11J55Rk21Q9J7O2J31j86p9K03
$$ 106 2 47 96 22 21 -39 51 -13 -8 -22 22 30 -70 87 -51 -11 72 2 -65 -21 8 -103 52 61 -160 -71 -54 8 139 -47 -126 77
2803G7pj46j1J95p0Kn8J45r2j7M4jo5N9j48K24k04J0K2MJ29j57K8P4pJ5j22O6n2K14j56M3
$$ 77 70 -76 -87 108 38 40 -18 127 35 18 62 61 -4 55 -93 131 -73 -63 -41 -37 92 -65 -37 37 30 45 -77 -11 -63 151 -5 38
2402C8M1j66J69j53OM3K2j22J42j14J5P4n3OLJ15j05Q8M3j18m1Mo0J23J1l8qo7M9J34r4r5
$$ 38 79 -87 82 -71 -65 -22 0 -122 20 -94 -79 -5 -58 -52 -49 66 -39 49 92 -26 -67 -63 -123 0 11 -27 -35 -102 -53 81 -13 -108
2002a08K54J207j357m3J09j29P2Q1Nj30L5l6J09Qj05L3r3J77%p8p6j12k3J24K5P2J8No5L6
$$ -108 146 1353 -4 -47 62 -67 5 86 91 -39 -4 -40 69 77 -28 5 -88 89 89 11 -65 -177 -200 -76 -51 21 39 44 -21 15
1626A5Po0R8K8R6j10N1k0p1o24J2474j0138j805J12l3k01L57k34L3kj21J46m2j29Q6K41kk19
$$ 15 22 -38 60 88 184 74 125 105 34 -590 11884 1746 -59 53 20 -181 176 -58 -25 -27 -148 -2 -44 -173 -87 154 152 -67
1275f7M8N0j34P8l0n3L4L5J60q5j8j1R2j23q3N6q6J66lQ0n2o5m2R1m0j7j24J56l7J21p8J12
$$ -67 -19 31 -103 -25 -55 -108 -74 -39 121 36 18 7 99 -24 -107 -51 -137 29 26 106 54 -11 -53 38 -2 -19 -143 13 -24 97 19 131
875A31j39K0m4k5N7k2Q3J2j3j0n0r2J19l4j00J41nRN8k21O5Q7J15m6r6O8M8K8r6J6J5J3m5
$$ 131 -8 12 -32 -57 0 -22 61 73 60 50 0 -92 27 -7 -107 34 29 38 96 -125 -60 27 142 96 0 68 116 144 48 64 79 92 47
462D7j9M9qm9j98J89o1k8J78k3j53L3Q3j0J0l4L6Q7o5Pj07Kq7J44M6qj7o4K3r8K8M8J24o3
$$ 47 28 77 69 20 -178 11 -50 -78 100 77 -76 -43 40 30 40 6 42 129 64 71 -36 -34 -121 23 69 61 44 -20 3 -95 -67 -19 105 42
36D2n8K6M1K2J9m5L3Rj8J34j89r7L9L8Q3n7K7j01k6j8J4Q0n7J16J3n0J2j04l2M3J04po9K6
$$ 42 -16 10 51 73 92 47 80 89 71 205 16 -81 -42 -4 79 22 49 -52 -78 -96 -82 -2 -59 57 70 20 32 -72 -104 -61 43 36 -33 -7
-390g
##PAGE=	F1=-12514.6
##FIRST=	23151.189942674980557,	6007.9998942000029274,	0
##DATA TABLE=	(F2++(Y..Y)), PROFILE
6008D0Qm0m1k5kR3j10M5J5Q8k5Jl3J03j43n5l6M8J6J11j01J32j24Q5NJ6k1pm4p0%O5oQ1j00
$$ 40 48 8 -33 -58 -60 33 -77 -32 -17 71 46 47 14 117 -26 -81 -117 -69 -53 58 -43 89 -35 50 55 71 50 43 -1 -71 -71 -6 -12 69 -31
5570c1O2n9n5J56J9o3J6m5L6m3J46j70M8O7m9K6j55J11jn8J70o3j15J63j82Q0l4P9L2q7K2
$$ -31 31 -28 -83 73 92 29 45 0 36 -7 139 -31 17 84 35 61 -94 17 16 -42 128 65 -50 113 -69 11 -23 56 88 1 23
5182B3p3J42p6m2l0%p7K03k3l3kOp7l0J22r0l2J05J4N5j32R9j17P9j61K13j21L8p1J14n3N0
$$ 23 -50 92 16 -26 -56 -56 -133 70 47 14 12 18 -59 -89 33 -57 -89 16 30 85 -47 52 -65 14 -147 66 -55 -17 -88 26 -27 23
4781B3o2L9Q7j07L1m8K7j11K91n1j28kL7K5o7jQ0R0j25m7J31m0O8j16p3M9n4Pk8L1M3K1m5
$$ 23 -39 0 87 -20 11 -37 -10 -121 170 119 -9 -11 26 51 -16 -17 63 153 28 -19 112 72 140 24 -49 0 -54 -47 -75 -44 -1 20 -25
4368b5P4M9r1j11P1L9o0J14l2j25K5O1L1J7k25J83o9j6J65r9q4Q4J4m9q5J03k7M8Q3j06R8
$$ -25 49 98 7 -104 -33 6 -54 60 28 -97 -72 -11 20 37 -188 -5 -74 -90 75 -24 -108 -24 -10 -59 -144 -41 -68 -20 63 -43 55
3980E5lL1r8pR7P4j74M0l1n1l3J08P1q3J9Ll6nM6k5M9Nj24N3O3L7n7j4r6J48o1q5J60O7j13
$$ 55 52 83 -15 -22 75 149 -25 15 -16 -67 -100 8 79 -4 15 18 -18 -23 23 -2 47 52 -72 -19 44 81 24 10 -86 62 1 -84 76 143 30
3542C0ql1j02R1k6Rk4J36P8p1r7O6m4l2j04N7J08mj5R8j24J40j33j30O8J20O1j37P6K2l7j2
$$ 30 22 -9 -111 -20 -46 -37 -61 75 153 82 -15 51 7 -25 -129 -72 36 32 17 115 -9 131 -2 -132 -64 56 117 -20 56 78 41 29
3141B9l7P8p8mk2K8J7p1J43j20M0O9p5o5M3O4j62J80J2k14J22k4P6Q5j70n6J54J6q5p6J97
$$ 29 -8 70 -8 -12 -34 -6 11 -60 83 -37 3 72 -3 -68 -25 39 -123 57 69 -145 -23 -47 29 114 -56 -112 42 58 -27 -103 94
2753I4j07L4j5J19o8j0K4L7j43Q3j11J92k07K9On9J84j42MJ36j5n1q5O5o4J92r4J8L1j25J29
$$ 94 -13 21 6 125 57 47 71 108 -35 48 -63 129 -78 -49 -43 -102 82 -60 -56 80 65 14 -71 -6 -70 122 28 46 77 -48 81
2365H1j11LJ5J4j10J14j05K3M8r2Q7QJ05j56J39%o4p6J1o8J42L0o6N2j02M0J02j01n5K17J204
$$ 81 -30 -27 -12 2 -108 6 -99 -76 -28 -120 -33 -25 80 -76 63 63 -1 -77 -66 -134 8 38 -28 24 -78 -38 64 -37 -92 125 1329
1977A329j286m8M2j22J23Q3J8j66rl6J31jk3J2j06J64m4n9o3j08j8J26RM2L0J%L3l0n1J02
$$ 1329 43 -5 37 -85 38 121 139 -27 -36 -72 59 58 35 47 -59 105 61 2 -61 -169 -187 -61 -52 -10 20 21 21 54 24 -27 75
1588G5J5M9p6L3J6j22m67P053n711r21J55n5k43L95k28J2lj06J32p0r4Q8J72M4k27Q3P0j41
$$ 75 90 139 63 96 112 -10 -477 6576 865 -56 99 44 -199 196 -32 -20 -23 -129 3 -67 -161 -73 99 143 -84 -1 69 -72
1238g2P6n9o3K8K8J49k8n3k7J20j53m5J8n1J80k9K4kl2r9R4n5L0j24J32%J09l1Q0j45Nn7n
$$ -72 4 -55 -118 -90 -62 87 59 6 -21 99 -54 -99 -81 -132 48 19 43 41 9 -90 4 -51 -21 -145 -13 -13 96 65 145 0 5 -52 -57
825e7P2o9J05L0qJ1j05o9J55p0j24J64%L1N2k25N9N9R6jj11M2N9M6q9K8Mjo5J2O0l7m2j79
$$ -57 15 -54 51 81 73 84 -21 -90 65 -5 -129 35 35 66 118 -107 -48 11 107 106 -5 37 96 142 53 81 85 84 19 31 91 54 12 -167
399a67K06q2q2K21k0j43N1O6j5J1n5K1P2l3%j35N6j04J42K6N6q0m2Q1j52J7O8J25q7k1K3J
$$ -167 39 -43 -125 96 76 -67 -16 50 35 46 -9 12 84 51 51 -84 -28 -132 10 36 92 12 -30 51 -101 -84 -16 109 22 1 24 25
-2B5K1O6r6O7M3l3M8r4j16qO0P8q3O8o7n4p3J3J27n3J27k5m1L2j31%J0J16K6m6K0
$$ 25 46 112 16 83 126 93 141 47 -69 -77 -17 61 -22 46 -21 -75 -148 -135 -8 -61 66 41 0 32 -99 -99 -89 27 53 7 27
-390B7
##PAGE=	F1=-12608.9
##FIRST=	23151.189942674980557,	6007.9998942000029274,	0
##DATA TABLE=	(F2++(Y..Y)), PROFILE
6008F3k8j1m7l7NJ07j08K4k0O4KL2k0J15j16r3n4O2N4O8j24J51n8Ql7O4k6l0ko0k3M4J8P1
$$ 63 35 24 -23 -60 -55 52 -56 -32 -52 12 14 46 26 141 25 -68 -122 -60 -6 62 -62 89 31 39 2 66 40 10 8 -52 -75 -31 -13 58
5582E8r8O2q4L8J11J7m0n1k0M5k2Q9j05K6Q0r7R5k04J21J9q2J42o2j02J62j49O9p0R1kn1J0
$$ 58 -40 22 -62 -24 87 104 64 13 -7 38 16 105 0 26 106 9 104 -100 21 40 -42 100 38 -64 98 -51 18 -52 39 37 -14 -4
5182dm9J10l7q0n7P5o6J39mLkm5l5m8J36o4r4J53J2M1p6K2p7Q4j55J98r7J3m4P4o8O6l9RQ6
$$ -4 -53 57 20 -60 -117 -42 -108 31 27 30 28 -17 -52 -100 36 -28 -122 31 43 84 8 30 -47 37 -118 80 -17 -4 -48 26 -42 24 -15 -6 80
4743H0j11M1p1N3j06K67n3j12l3M5Q8j28Q7%P9o5p0J02lL8r2q3O7r1N4pl2RR3l5Q9m8r6r3
$$ 80 -31 10 -61 -8 -114 153 100 -12 -45 0 88 -40 47 47 126 61 -9 93 90 128 36 -47 20 -71 -17 -24 -56 -47 46 11 100 52 -44 -137
4318a37Q6R1p2J04j7j52J2R1oJ4j73J45p9L2Q6m6o2N1K0mo7J06l8j1L7r8J76l7K7q8k5J06
$$ -137 -51 40 -32 72 55 -97 -85 6 0 14 -159 -14 -93 -61 25 -21 -83 -32 -12 -16 -83 23 -15 -26 11 -87 89 52 79 -9 -34 72
3917G2O0j84Q6j2p0m3R1P2j02P6n4J5MK4l6M0M3j09k5M2J16j12L4r3J46m1r3J46K6q4Jj6j35
$$ 72 132 -52 34 22 -48 -91 0 72 -30 46 -8 7 11 35 -1 39 82 -27 -52 -10 106 -6 28 -65 81 40 -53 93 119 35 36 20 -115
3504a15J04l0k4pJ47O0q7m6M3q4pr5N3J41n7OP6j01J48j19j15K2J45O9j65J04j9L0m1j7M7
$$ -115 -11 -41 -65 -72 75 135 48 2 45 -39 -46 -141 -88 53 -4 2 78 -23 125 6 -109 -87 58 127 -38 66 47 77 36 19 66
3116F6o6j3k6QL3m1J05q5L5K8n8n6M9R4k01J82J0j60J12l7N8M7j31k5Q5J1rj41J92j34Q1M
$$ 66 0 -13 -39 -31 2 -39 66 -19 16 44 -14 -70 -21 73 -128 54 64 -96 16 -21 37 84 -47 -72 13 24 15 -126 66 -68 13 17
2715A7R9n3j6J6N1j76J07n6J30k12O5Jj49K47j16j4J61qj27k8M9m5J42k9KL1j05J04q3JoJ0
$$ 17 116 63 47 63 114 -62 45 -11 119 -93 -28 -27 -176 71 -45 -59 102 94 -33 -61 -12 -57 85 56 58 89 -16 88 5 6 0 10
2315A0o9N9r4J0M9j17J35mQ9j65J60l6Rj12K2q2J54M4p2P7r8RO5j01OJ69J133j181l7k9p9
$$ 10 -59 0 -94 -84 -35 -152 -17 -21 68 -97 63 27 36 -76 -54 -136 18 62 -10 67 -31 -22 43 -58 -52 117 1250 69 32 3 -76
1926g6J57N1K3j61m6n0J42kN3mj27J41p2m2k0j32MJ43l0L1M3l7O6J3n0l7R1J1lk0j2N8j28
$$ -76 81 132 155 -6 -52 -102 40 38 91 87 -40 101 29 -13 -33 -165 -161 -18 -48 -17 26 -11 55 68 18 -19 72 83 80 60 48 106 -22
1513b2l83L522k794l67J64n2k68L63j71kOq7Q1p6n8R8Q4P3j99Q7R8j57J08q7p7JJ0J38L1q0
$$ -22 -405 3117 323 -44 120 68 -200 163 -8 -10 -4 -91 -10 -86 -144 -46 38 111 -88 -1 97 -60 48 -39 -116 -115 -105 33 64 -16
1138a6m9J45j53jl7J4J50l2k5K3rj38J01o7M5p0Q7L2O1M1M6j35jp5KQ3r3J16L7j5L0j16m8
$$ -16 -65 80 -73 -74 -111 -97 53 21 -4 19 10 -128 -27 -94 -49 -119 -32 0 61 102 148 13 12 -63 -61 22 -71 45 82 67 97 -19 -67
725f7J47o8j34J55l0P8N4k02N0K2N8K3r6K0O5P8j23M9J3k7q9N4P3q4j1j63K27q9j32K42k5
$$ -67 80 12 -122 33 3 81 135 -67 -17 5 63 86 -10 10 75 153 30 79 92 65 -24 30 103 19 8 -155 72 -17 -149 93 68
336F8j34P9M6jj1n2RK7K4l6j47J06j13J42j0J11j48KJ34j88JP1J09q0pJ3qJ9R1j41R8O7m1
$$ 68 -66 13 59 58 47 -5 4 31 55 19 -128 -22 -135 7 -3 108 -40 -38 96 -92 -91 -20 89 9 2 15 7 26 117 -24 74 141 100
-77A00l1j0j05o2P7P2r2P7j4o3j26J2J66n8J39o1k7N6j41kj4J23M7l2K4
$$ 100 69 59 -46 -108 -31 41 -51 26 12 -51 -177 -165 1 -57 82 21 -6 50 -91 -93 -107 16 63 31 55
-390E5
##PAGE=	F1=-12703.3
##FIRST=	23151.189942674980557,	6007.9998942000029274,	0
##DATA TABLE=	(F2++(Y..Y)), PROFILE
6008G2n0Pm4m0K8J02q7No9M6L2K4k5J31o1r9o2O5P0J2j25J62Qp1o0P2ol2J3l8n4N6K2K6q7
$$ 72 22 29 -15 -55 -27 75 -12 -7 -76 -30 2 26 1 132 71 -28 -90 -25 45 57 -68 94 102 31 -29 43 37 5 18 -20 -74 -18 4 30 -57
5570e7P3r8J15O9Rl3q8jM6JL6o1J6P8j02J43k25J03N9j17J11p9o0J43r9N7r4P5k4lk3k3P4
$$ -57 16 -82 33 102 111 78 -10 -11 35 36 72 11 27 105 3 146 -79 24 83 -34 77 -2 -62 81 -18 39 -55 20 -4 -7 -30 -53 21
5157B1qj01n8J31o5P1J1K5J7q8Jm6J18l3j33J73K8K3k9n8j5O5j43J89p4k4pK8o1O6jk8M1o2
$$ 21 13 -88 -146 -15 -80 -9 2 27 44 -44 -43 -89 29 -4 -137 36 64 87 58 0 -15 50 -93 96 22 -2 -9 19 -42 24 23 -5 36 -26
4731b6K6p6P7r4K09n3j02m4L6J41j55J66q0M9J4j11R8K7%m8q9N9r4Q6On0m9J30pR8j30j07
$$ -26 0 -76 1 -93 116 63 -39 -83 -47 94 -61 105 25 74 88 -23 75 102 102 54 -35 24 -70 16 22 -28 -77 53 46 144 14 -93
4330i3k8N6J28q2R0Kj63k5J23k1Nj15J07q9P6nJ6l2K9J1L7l9R6n3o0Kq9K12l1%p5m8J32L6
$$ -93 -121 -65 63 -19 71 73 -90 -115 8 -13 -8 -123 -16 -105 -29 -34 -18 -50 -21 -10 27 -12 84 31 -29 -27 -116 96 65 65 -10 -58 74 110
3905A10j73J07jo1m2P1O4j21J40j05L8j2Oj7L1N4o4r3LJ83j53Q2r4J42l0q2J16Mo8j4J4j38
$$ 110 -63 44 43 -18 -60 11 75 -46 94 -11 27 15 21 4 35 89 25 -68 -65 118 -35 47 -47 95 65 -17 99 103 35 21 35 -103
3504a03Q4m0ml8J76L4q4lK0j27K3q8Q6J00q4K1P2o8J32q0r7n0J59Q6j77J29p4J18p2j6Nk6
$$ -103 -19 -59 -63 -101 75 109 25 22 42 -85 -62 -150 -64 36 -48 -27 45 -23 109 29 -68 -118 41 127 -50 79 5 123 51 35 40 14
3103A4l4j5j2M6j5O4n6K6j6k1n0O6R7k06J62kp4O7k5J7J8p6J0NnO1j81J72j49J18jJ01n2l5
$$ 14 -20 -35 -47 -1 -16 48 -8 18 2 -19 -69 -3 94 -112 50 48 -26 41 16 33 51 -25 -15 -10 -15 46 -135 37 -112 6 5 106 54 19
2678A9J8M5j66J32j0O2k14J14jk31K84q4k2J46J1j88M3J3j1Q2L6j0M5j09R6p6lj3Mmqq1k0
$$ 19 37 82 -84 48 38 100 -114 0 -1 -232 52 -32 -54 92 103 -85 -42 -29 -40 42 78 68 113 4 100 24 21 8 12 8 0 -81 -101
2265a01P0j02J24j9O8j44J54m7N9j23K5r1J61M4o5P8p2k8L5r0O4J98J522j637l0p9k7J65j3
$$ -101 -31 -133 -9 -28 40 -104 50 3 62 -61 -36 -127 34 78 13 91 19 -9 26 -64 0 198 1720 83 53 -26 -53 112 99
1901I9L0j20o3n8J27J2J08k4j50J09o3l4M1j78L6J54n2L5L2q8J14j4m6k6P3J1m0L5n9Q5j07
$$ 99 129 9 -54 -112 15 27 135 111 -39 70 7 -27 14 -164 -128 26 -26 9 41 -47 67 53 7 -19 54 65 25 60 1 86 -21
1513b1l77K163j623j64J26k5k71K76p1j0K8p2Km5l8J07J6P3j57P5J16j76J54r6r0m3j1J39
$$ -21 -398 1765 142 -22 104 79 -192 84 13 3 31 -41 -39 -84 -122 -15 1 74 -83 -8 108 -68 86 -10 -100 -143 -154 -15
1163a5O9q7p1J49j29L6q2Q6R3j2o8K4Nj49J01o5J4K1L2O3oJ11J8j10Pr6kR1r8J15K8l0L9p7
$$ -15 54 -33 -104 45 -84 -48 -130 -44 49 37 -31 -7 -2 -151 -50 -115 -101 -80 -48 15 9 120 138 28 35 -61 -63 28 -70 45 73 43 82 5
737En0J00k6j17J13q2J39N5j61M2nJ7J7o0QO2J09j75P5L9p4r5R7Q0j27L0j70K48p9j54K29
$$ 5 -45 55 29 -88 25 -57 82 137 -24 18 13 30 47 -13 -5 57 166 -9 66 105 31 -64 33 113 -14 16 -154 94 15 -139 90
349I0l0j23R1K8L4l9l6ok6R9q5j35J18j04J43m9J32j88M4J57j83j1N0Q8n6lk0J9K8Q5j68J09
$$ 90 60 -63 28 56 90 51 15 9 -17 82 -3 -138 -20 -124 19 -30 102 -86 -42 115 -68 -79 -29 59 3 0 -20 -1 27 112 -56 53
-52E3P2l6p6L0n9j14Q6P4q5N3L7n6j58J5J86q1J49p9rP8j32l7j8J21M6k8L5
$$ 53 125 89 13 43 -16 -130 -44 30 -55 -2 35 -21 -179 -164 22 -59 90 11 2 80 -52 -89 -107 14 60 32 67
-390F7
##PAGE=	F1=-12797.6
##FIRST=	23151.189942674980557,	6007.9998942000029274,	0
##DATA TABLE=	(F2++(Y..Y)), PROFILE
6008F6m5Ql6l6M6Q4n1Jj27L8O5k0m5J51Op7n6M6O3m0r9J57M7j15o9M3L3rj2mq0R5Kl3o9Q5
$$ 66 21 29 -7 -43 3 87 36 37 -90 -52 13 -7 -52 99 105 28 -28 18 81 41 -58 99 146 31 -38 5 38 29 17 13 -67 28 30 -3 -72 13
5557A3r5J48M5Ll7q8KL7K2nl6QO4p3J51j92M8J04j43Q4j04nJ02l3M4j06M1k2M3p1ML5Qr1k8
$$ 13 -82 66 111 114 77 -11 -9 28 50 45 9 17 81 8 159 -33 15 119 -24 60 -44 -49 53 20 64 -42 -1 -23 20 -51 -47 -12 -4 -95 -123
5119a23J41p6J8J8L3M9j11K3k9O0Rj49J68M8J1j1j15N8K6j20J80n4o6K8j6k7M9L7n7j7Qpo9
$$ -123 18 -58 -40 -22 11 60 -51 -28 -57 3 12 -137 31 79 90 79 -36 22 48 -72 108 54 -12 16 0 -27 22 59 2 -15 -7 -14 -83
4706h3R8p5J36l9j17l1L2J47j43K12j26%R1j64J26L9l0kp8J6o0R8qj9j00J29J7R2j71j09N7
$$ -83 15 -60 76 37 -80 -111 -79 68 -75 137 11 11 102 -62 64 103 73 71 -7 9 -51 47 39 20 -80 49 66 158 -13 -122 -65
4318f5kJ30p6P3K2j60p4J52j7kp0Q0q9R8q2O7NJ0j1O3j5P8o4p7k1p9J99Rk9n8p7J60J6j38
$$ -65 -67 63 -13 60 82 -78 -152 0 -17 -19 -89 -9 -98 0 -82 -15 -10 0 -11 52 37 115 51 -26 -47 -126 73 82 53 -5 -82 78 94 -44
3892d4R2pk7l9O4M6j40J96j24J4l9LK6J6L2kj29m0K18j53J04r7J25k6o0Q9%o3n4M6j06M4o5
$$ -44 48 41 14 -25 39 85 -55 141 17 31 -8 -5 21 37 69 67 -62 -102 116 -37 67 -30 95 69 9 98 98 35 -19 27 -79 -35 -100
3479a00N8j04K28Mp7K0jj37M9q6J29J5p2J8Q1l8R8k7p7j16J49R4j63J47j24J93r1l3l0K6p2
$$ -100 -42 -146 82 86 9 29 28 -109 -60 -146 -17 -2 -74 -56 25 -13 85 58 -19 -135 14 108 -55 92 -32 161 70 37 7 33 -39
3091c9J4k1M5ML5m4J4m6K8n2Q1P1j67J31l0K0P%l0Jk5M1o8j9J17j84J31j54J30k0J33o2o3
$$ -39 -25 -46 -1 3 38 -6 8 -38 -10 -62 19 90 -77 54 24 44 51 51 21 22 -3 38 -30 -49 68 -116 15 -139 -9 -29 104 42 -21
2678b1K1K9j25J56PNk02J59nk70K70n1k0J03L0k04J05l7J1L9R7k6N9j15R6q2rj5qO9n8o8o3
$$ -21 0 29 -96 60 67 72 -130 29 24 -246 24 -27 -47 56 86 -118 -13 -50 -39 0 97 71 130 15 111 29 20 5 -3 66 8 -60 -123
2265a23R8m2N8k2M9j20J32l0O0r9J9q0J60J6m9P7p1l2K0o3Q8L23K558k829m2r6J3J45r3M6
$$ -123 -25 -67 -9 -31 18 -102 30 0 60 -39 -20 -100 60 76 27 104 33 1 21 -42 46 369 2927 98 56 -40 -27 118 25 71
1889G1n4o6m3P9L3J45n2j65O5j4l5R7k21O5J51m3N2k3j19J35m2j6k4N7J0o0P3q9Q9r2m01K026
$$ 71 17 -49 -92 -13 20 165 113 -52 13 -1 -36 61 -160 -95 56 13 65 42 -77 58 16 0 -24 33 43 -17 56 -33 56 -36 -437 1589
1488A589j441j38M6J8k52J66M4j5N8o6p5J1l4J03j2M4j17N5J19j91J92q1r4r2k6J51P3o9q5
$$ 1589 148 10 56 74 -178 -12 32 17 75 9 -66 -55 -89 14 2 46 -71 -16 103 -88 104 23 -71 -163 -189 -38 35 -34 -119
1125a19J21q7N5r7J38L4J9j11J8J7j31Q3n2m4J11k4R1n9J58jp2K0j08k6J05r5R5J6m4L5np4
$$ -119 2 -85 -30 -127 11 45 64 -47 -29 -12 -143 -60 -112 -156 -45 -69 22 -37 121 120 48 68 -40 -66 39 -56 39 55 11 46 41 -33
725c3K9L1o2M5j28J98M0j17M4j3j6ok3kN4J26k17J04O3j27p2J26P2j47O7k00K61n9j41J91
$$ -33 -4 27 -35 10 -118 80 120 3 47 34 18 12 -11 -13 41 167 -50 54 117 -10 -82 44 116 -31 36 -164 97 38 -103 88
349H8k8j07O5J4Q1m9k4k8n9J69j20j01Q3p8J32p1J07j71N4J42j33j2RO7l0Lp0O0N3N5j64Q7
$$ 88 60 -47 18 32 113 64 40 12 -47 122 2 -99 -16 -94 38 -33 74 -97 -43 99 -34 -46 -37 30 0 3 -67 -7 46 101 -63 24
-52B4O2k4p9K3Qj53R0Q1p6J3P2l8j60K5J72j15J51o7J6Q4j11q6MJ04K2k7M8
$$ 24 86 62 -17 6 14 -139 -49 32 -44 -31 41 3 -157 -132 40 -75 76 9 25 109 -2 -88 -84 20 42 15 63
-390F3
##PAGE=	F1=-12892
##FIRST=	23151.189942674980557,	6007.9998942000029274,	0
##DATA TABLE=	(F2++(Y..Y)), PROFILE
6008D6j4kk9k8M4O0j2K3j91M4R8r0o2J77N7m3m1PM6p8m6J29M7j08o8nP4K8o5L2q8J49m5p8
$$ 46 32 30 1 -27 17 77 65 88 -103 -59 39 -51 -113 64 121 78 37 44 90 12 -34 95 142 34 -34 -39 35 63 -2 30 -58 91 46 -32
5582c2l8P8p7J31M6Rm6o0j3K3M0l5j9qL9k5J21j11l0J29j39N7j13L8N4L6K7j05jJ0P3j23L3
$$ -32 -70 8 -69 62 108 117 71 11 -2 21 61 26 7 -1 38 13 134 23 -7 122 -17 40 -73 -35 19 55 82 -23 -24 -14 59 -64 -31
5169c1oOm4K3J03r2j9J5M1P2j10L2Kk5O6j57J41N9Rk0j36J24k0q6J56l1j01N6m7J9K3N1n6
$$ -31 -37 -31 -75 -52 51 -41 -60 -45 -4 68 -42 -10 -8 -33 33 -124 17 76 85 65 -71 53 33 -53 103 72 -29 27 -20 -1 22 73 17
4756A7o8O5n0n1J16n0O9j4j53PM5Q5r6K08j19n5J42k02J65L5m6K5m0m8qR4n0L7j17J06J2P7
$$ 17 -51 14 -36 -87 29 -21 48 34 -119 -112 -67 18 -78 130 11 -44 98 -104 61 96 50 75 35 -13 -21 73 23 60 -57 49 61 138
4355A38j65r2J20n7R6n1N6M1j51j11J61LMn0N8o7P9j14R0M5j8k8O0PN4o9n4k7p7J47N8l6l7
$$ 138 -27 -119 1 -56 40 -11 45 86 -65 -176 -15 -12 -8 -58 0 -67 12 -102 -12 33 15 -13 47 54 108 39 -15 -42 -119 28 86 50 13
3942A3j05J67J2q7N7l3J9n1Q0K5j60K35j07m7o5J6Q0nj7O0j26o5K09j09R3r7Q2j8l7P8Ko3
$$ 13 -92 75 87 0 57 24 43 -8 72 97 -63 172 65 18 -47 -31 49 44 27 87 -39 -104 105 -4 89 -8 74 56 19 97 99 36
3542C6j05P0m8Mj08J34j77K91k4p8J8j6r8O5r2J49o5k1j0R4j4N3K4o0j41J11P2j13J50j45
$$ 36 -69 1 -47 -43 -151 -17 -194 97 73 -5 13 -3 -101 -36 -128 21 -44 -65 -75 19 5 58 82 22 -119 -8 64 -49 101 -44
3166d4K18q6n4n4P2j16M5oL3OK3m4Qp1P7n5Q0L0r3R9p3J04m6J8o8%RN5j15k5J57j58P4j44
$$ -44 174 88 34 -20 52 -64 -19 -25 8 14 37 -7 1 -70 7 -48 32 62 -31 68 -5 99 53 71 3 3 12 67 -48 -73 84 -74 0 -144
2740a44J09l7J83o9r6K2J1o7J74j5l0j75J87j5k50K04j7j5M6L7j58J41q4%L1J40m7M9r6R6
$$ -144 -35 -72 111 42 -54 -32 -21 -88 86 71 41 -134 53 38 -212 -8 -25 -40 6 43 -115 26 -58 -58 -27 113 66 115 19 115
2365A15q4j7k0k9J28o9n2j13J19L7k8oL3j13J12lJ6m0Pm5J41l8k8R1j50L9K9l4N9L81L180
$$ 115 31 14 -6 -35 93 24 -28 -141 -22 15 -13 -19 14 -99 13 10 26 -14 -7 -52 89 51 23 114 -36 3 32 -2 57 438 3618
1977C618l509o0p8K2J02j63P2J3n6j0NM4J73p9j63K1M7m3J34k32P6J34nO5j19j06J38o8K0
$$ 3618 109 49 -29 -7 95 -68 4 17 -39 -49 -44 0 173 94 -69 -48 -1 -44 90 -142 -66 68 63 128 9 -97 41 -27 -7
1613gj6N0%p4R1j02Q5j00m01K052j406j22m7O0k12N7J36j7Q2o3j26P1l3Q1nqq4L1J16j97K07
$$ -7 -23 27 27 -47 44 -58 27 -73 -474 1578 172 50 3 63 -149 -92 44 27 109 46 -80 -9 -42 39 34 26 -58 -27 89 -108 99
1225I9m7q8j33k9J71L4k6q5O2l3N5p8J58kL3j57L3L0r9N1m1r6J61n8J04p8J63%k5K1j03p1
$$ 99 52 -36 -169 -198 -27 7 -19 -104 -42 -75 -20 -98 60 58 91 -66 -33 -3 -102 -51 -92 -188 -27 -85 19 -59 104 104 79 100 -3 -74
825g4J25r0N6J6n1K8O6j01m5P6K0l2j41K26J2q0N4ll7k9%j7M7J29k30J31N9j57k9J35M7j36
$$ -74 51 -39 17 33 -18 10 76 -25 -70 6 26 -6 -147 79 91 11 65 62 25 -4 -4 -21 26 155 -75 56 115 -42 -71 64 111 -25
424b5Q2k37K62m0j00J47k2q2%jJ27l0k4m8o0K03j07p5K4m0J01p2N2j06K6R9n4kl6M7j4K2j22
$$ -25 57 -180 82 42 -58 89 67 -15 -15 -16 111 81 57 9 -51 152 45 -30 -6 -46 55 -17 35 -71 -45 54 0 -2 -38 9 -5 17 -105
11a05Q4Q4K3j32L6N0j3n3%P3j74Q9Q6q6j3Q8k3j35L6J30j46J39k5M5O7q7j28M8P2j4k0N0
$$ -105 -21 63 86 -46 -10 40 27 -26 -26 47 -127 -38 48 -38 -51 37 14 -121 -85 45 -101 38 13 58 125 38 -90 -42 30 16 -4 46
-390D6
##PAGE=	F1=-12986.3
##FIRST=	23151.189942674980557,	6007.9998942000029274,	0
##DATA TABLE=	(F2++(Y..Y)), PROFILE
6008A7K5rk1k2K2L6PP1k42N7J25j63o1K00P0j4k5l9L4r6K3Q3J1o3n5n0J06N4j22O0p0J94j04
$$ 17 42 33 12 -10 12 48 55 126 -116 -59 66 -97 -158 42 112 98 73 34 68 -28 -5 78 89 26 -29 -79 27 81 -41 19 -51 143 39
5595C9q7jM6m9P7O7K6m7k7m0J9M7n1nl6QK9P5j8j09J24j01J9r2N6K1Q9J0r9k9N2Q1j57N2l4
$$ 39 -48 -49 -3 -52 25 92 118 71 44 4 23 70 19 14 -22 -14 15 90 72 -37 87 -14 5 -87 -31 -10 79 89 -10 -39 13 94 -63 -11 -45
5157d5j4K3O7M6r8n1J3M8P2r2M2L5j09J25j61J01N2J4l5j31J67n3n4J13%j12O6o0N1LL7k3
$$ -45 -59 -36 31 77 -21 -72 -59 -11 61 -31 11 46 -63 62 -99 2 54 68 33 -98 69 16 -38 75 75 -37 29 -31 20 23 60 37
4756C7r8R1r2k9J36l2K3J0j90N7P5k7l5J52o2r3J54k00J86K4m6J6K4j11L4Q7r5P7q6O9k6O7
$$ 37 -61 30 -62 -91 45 13 36 46 -144 -87 -12 -39 -74 78 16 -77 77 -123 63 87 41 57 81 -30 4 91 -4 73 -13 56 30 97
4355I7j20o4J33q4M6j4L7N2j40j11J40K6K5m9L2l4L1r5P7Q8n0l8L8K5K6o5j1j3q0P6Q8j0j2
$$ 97 -23 -87 46 -38 8 -6 31 83 -57 -168 -28 -2 23 -26 6 -28 3 -92 -15 73 23 -15 23 48 74 9 -2 -15 -95 -19 69 59 47
3942D7j30J41K4l6L2o8N0p5J14Nj78K56p2j20p2L8J23k6p2R8q2o5J57m0N6q2J0Pk1Q0j0n6
$$ 47 -83 58 82 46 78 10 60 -15 99 104 -74 182 110 -10 -82 -44 79 53 -19 79 -3 -68 89 49 105 23 33 40 19 99 89 33
3542C3j36P8J8k3j60J94k26L37n3q5Jk7j5N8r7J32r7M7n8J01MRN5m8j16N0K2l0J32j20J73
$$ 33 -103 -25 -7 -30 -190 4 -222 115 62 -23 -22 -49 -64 -6 -103 29 -68 -21 -79 22 26 35 90 42 -74 -24 -2 -32 100 -20 153
3153A53n7o0p2J04j47O2K8K1j8K2l8J3j02J14n1N6ooP2j22J61p2J7r2K0K3M1j26l1J86j23
$$ 153 96 36 -36 68 -79 -17 11 32 14 36 -2 11 -91 23 -28 28 22 16 88 -34 127 55 72 -20 0 23 64 -62 -93 93 -30
2765c0K3j22P0m3K21o7j20K2qj2J86n5m5j41J85k8j84J14J9k3kK6n8J39j07n0N7J55o5%l6
$$ -30 -7 -129 -59 -102 119 52 -68 -46 -54 -66 120 65 20 -121 64 36 -148 -34 -15 -38 -40 -14 -72 67 -40 -90 -33 122 57 57 21
2377B1Q9o9k4l3n6J61l9m3j56J25J01r3J6K8j28J12Pm8L2jLJ03r9nJ12l15J85O5k8k3N4J139
$$ 21 110 41 17 -16 -72 89 50 7 -149 -24 77 -16 0 28 -100 12 19 -29 3 2 5 108 9 4 116 -199 -14 51 23 0 54 1193
1977A193j114l5m2kN4k01R4O7l7K5o9K9J87q6j38j2Q7m8J44k03O5J09M4O4k32m7J37r5M7O
$$ 1193 79 44 2 0 54 -147 -53 14 -23 2 -67 -38 149 63 -75 -87 0 -48 96 -107 -42 67 111 175 -57 -104 33 -62 -15 -9
1601iN1j3r5R1j08R4j25l64J822j184o8j20Q6j58k9J72rQ2n7j36J11k3M4K3o9n9MJ18j93J97
$$ -9 42 29 -66 25 -83 11 -114 -478 1344 160 92 -28 58 -100 -129 43 34 116 59 -77 34 11 55 78 9 -50 -46 72 -121 76
1225G6pp3j56j9J82l1L1p1j3L4L5l6J40jJ6j95P1M6o9J8m4j16J53n0Q9o4J25K6K1Nq3j24J38
$$ 76 69 -4 -160 -179 3 -28 3 -68 -81 -47 -12 -48 92 91 107 -88 -17 29 -40 -22 -66 -182 -29 -79 10 -54 71 97 118 123 40 -84 54
812E4q5J0L3m7K7J10j14r6R4R7r8j16K13k2n3O8Qn0l8J5m4N0J20k10J46K2j35JJ29J2j02O0
$$ 54 -31 -21 12 -35 -8 102 -12 -108 -14 83 -15 -131 82 60 7 75 83 33 -5 10 -34 16 136 -74 72 94 -41 -40 89 101 -1 59
412E9k53K56m0m7J15j2m6q6k4J59J6l2n7l8J84m4p3k7jM9n8Ml1k5N3K7J0o7K7j2M9j64R0R9
$$ 59 -194 62 22 -25 90 78 32 -54 -78 81 97 65 8 -30 154 110 37 10 9 58 0 4 -27 -52 1 28 38 -29 -2 -14 35 -129 -39 60
-14F0Oq5k4M3%k2qJ17j76Q1P3j18j0Q5j2r1M2P3j55J14L3P0L3o9j60J06K9m3oL4
$$ 60 66 -19 -43 0 0 -22 -30 87 -89 -8 65 -53 -63 22 10 -81 -39 34 -121 -7 26 96 129 60 -100 6 35 -8 -14 20
-390B0
##PAGE=	F1=-13080.7
##FIRST=	23151.189942674980557,	6007.9998942000029274,	0
##DATA TABLE=	(F2++(Y..Y)), PROFILE
6008a5N1Kj3k4kJ2kJ29k59N7J51k19m4K08L7K1l0o7L1r7Q9L5m3ql1p3J20N5j55P2l1K08j53
$$ -15 36 38 25 1 -1 11 9 138 -121 -64 87 -132 -176 32 69 90 60 -7 24 -73 16 51 8 0 -31 -104 16 71 -84 -12 -43 165 12
5595A2o1K8Jj7J1R6M2l6po7M0L1m5ko2k0P6L7L5j57R9m4k9m8M6J5J21j2q7l3P9P3j60N4l3
$$ 12 -49 -21 -20 -37 -26 70 112 76 69 2 42 73 28 26 -36 -56 20 57 92 -65 34 -10 -39 -87 -41 -26 95 83 -4 -37 42 115 -45 9 -24
5157b4n3P7Q5Pr3p8K1N1M7o6N9O1j64J61j49N0L2K2m0j15J85p0m2O5M2r1M7m8M4mJ0L0j11
$$ -24 -77 0 85 92 -1 -79 -58 -7 40 -26 33 94 -70 91 -58 -8 24 46 6 -109 76 6 -36 29 71 -20 27 -21 23 19 29 59 -52
4743e2Q8j25oJ54k8JK8k15J05J02j40J3P0J9r9J33j54J82Qm1k0R5j46M3Q1j17P8j8J6p2P1
$$ -52 36 -89 -95 59 31 32 60 -155 -50 52 -88 -75 -5 14 -85 48 -106 76 84 43 23 118 -28 15 96 -21 57 39 55 -17 54
4355E4n4m2R4p2NK0J8N2j29o8R0M1N2n3knk2m7M4J24p5l6J1L6ln1K2K3q8QQ8L1K2j50Q6M3
$$ 54 0 -42 52 -20 -15 5 23 75 -54 -122 -32 9 61 8 6 1 -21 -68 -24 100 25 -11 0 36 33 -18 4 27 -61 -53 35 66 88 -62 24 67
3905F7jM5r7M5r3J49j1j85K53l8j75n5M6J46l7j12R9j2m7Q3K8Ol9p8M4j1P8l9l9j26O8P0k6
$$ 67 66 111 14 59 -34 115 104 -81 172 134 -41 -96 -50 96 59 -53 46 34 -13 70 98 104 65 -13 31 20 98 59 20 -106 -38 32 6
3491Fk01K17k30L34q2q7k5k0P0K7r2Q7p3J03j02R5J5k2N7m3n4k1l3O8R5n9P5j5m6q3J17j49
$$ 6 -195 22 -208 126 44 -43 -68 -88 -18 9 -83 4 -69 34 -68 27 42 20 77 34 -20 -41 -74 -6 89 30 105 90 44 -39 78 -71
3091g1O2N8J9o7K3j6K9j38J26k9J4k3O3N8j59J76o9Lj02N5K3kj02m8K10j04Kq6L0m1K25n9
$$ -71 -9 49 68 1 24 8 37 -101 25 -4 10 -13 50 108 -51 125 56 59 -43 12 35 33 -69 -117 93 -11 -9 -95 -65 -106 119 60
2690F0j20K7l8K9J87q0m4j18J55l8r6L3N0m8l2lP2R6r1j17J00J35p1p6N1P4l6l3m0q7J67J3
$$ 60 -60 -33 -71 -42 145 65 21 -97 58 20 -76 -43 7 -41 -73 -76 -4 92 1 -116 -16 119 48 -28 23 97 61 28 -12 -99 68 81
2290H1n2j76J18J19j11K7M3j44J25j9j04J00nN1M7j35J2J21n10L48J16n2j50q97n444O454
$$ 81 29 -147 -29 90 -21 6 49 -95 30 11 -93 7 2 53 100 -35 -23 98 -412 -64 52 0 -150 -1047 -6491 -37
1964c7Q7qm7J0j92R3J05j0M8j22kJ71o5r3k1Q6m7J31j43L4Q2Q5M3l15L1J36j17M8M3N3k2j18
$$ -37 50 42 -5 5 -187 -94 11 1 49 -73 -75 96 31 -62 -83 3 -44 87 -56 -22 60 145 188 -127 -96 40 -77 -29 14 67 45 -73
1563g3P9j17J25j44l17J481q87j9j52R1r5r5J55QN1m3j10J20jkN5j16m7j8J30j82J60L3n4
$$ -73 6 -111 14 -130 -447 1034 147 128 -24 67 -28 -123 32 40 91 48 -62 58 57 55 110 -6 -53 -71 59 -123 37 70 16
1200A6j59KJ77j06R1n0q0J05kJ1J01K7k7k06J04O6n0kn9j00R8KM5m0N8P1N6j3o2j62J31q2
$$ 16 -143 -141 36 -70 21 -29 -109 -4 -6 5 106 133 106 -100 4 70 20 18 -41 -141 -43 -41 4 -36 22 93 149 136 74 -88 43 -39
800c9k3N9l2L5J19j11j12R2J38j40p0J65m6k9P5J1o4k7L5q4O5J03j70J45l8n7pJ24k1o5Lk30
$$ -39 -62 -3 -35 0 119 8 -104 -12 126 -14 -84 81 35 6 81 92 28 1 36 -48 17 120 -50 95 57 0 -7 117 96 31 34 -196
399a96K44n9mJ05pKj60n4J69P2m4m3j8J23M1r2n2K8j3l6j1J2o8K5Q2J3p1Qk2P6j95R5Q7Pm9
$$ -196 48 -11 -15 90 83 85 -75 -129 40 112 68 25 7 130 171 79 27 55 42 6 -5 7 -61 -36 46 59 -12 -4 -26 50 -145 -50 37 44 -5
-39eo2L9J5jJ8J30j68O8L9j62K0O3Kl3L2K1j29P1Q9Q8no3j83J62j6m9Rk
$$ -5 -67 -28 -13 -14 4 134 -34 34 73 -89 -69 -6 -4 -37 -5 16 -113 -42 47 135 130 67 -116 46 30 -19 -10 -12
-390a2
##PAGE=	F1=-13175
##FIRST=	23151.189942674980557,	6007.9998942000029274,	0
##DATA TABLE=	(F2++(Y..Y)), PROFILE
6008d1M9L6j0l1j5j0k6J66k28K8J84k39l0J90k5P3o3o7L3p9J23Qr5L0Jo9J10L3j43O1J5J85
$$ -41 8 44 34 3 -12 -22 -48 118 -110 -82 102 -137 -167 23 -2 71 8 -59 -26 -105 18 26 -69 -39 -38 -107 3 36 -107 -46 -31 154
5607A54j74j6L3l0Pm1J17M0onr5R0j5pj4p5k8R9J8K7j61P0J0p9JK1K7J38m4o3k0P8O3j30L8
$$ 154 -20 -36 -3 -33 -26 -67 50 90 84 79 -16 74 59 52 38 -37 -65 34 52 79 -82 -12 -2 -81 -80 -59 -32 106 62 -1 -21 57 120 -10 28
5169B8pr4R2O4J0q1r4M7L5J8l9P1P5j75J53j08jLK9k6j00J84p8n6L7P6m0lj4mMoP6j14P5j45
$$ 28 21 -73 19 83 93 12 -82 -35 0 18 -21 50 125 -50 103 -5 -6 -3 26 0 -100 84 6 -50 -13 63 23 20 6 2 6 0 76 -38 37 -108
4718a08J6J58m5%M6k25J40J12k11K4KR3p6R5q2J62j3m1n6J50j47J4P6j02M6N5n3r4Q3Ol2L9
$$ -108 -92 66 21 21 67 -158 -18 94 -117 -93 -91 2 -74 21 -61 101 88 47 -9 141 -6 8 84 -18 28 83 30 -64 19 25 -7 32
4318C2m3rM6oM6j14mK9M7O2m2m1J0o1lJ6J43q3l1JL7l2l4L6O9r9l7O8M7P4j72L2N0J8R4j04
$$ 32 -11 -20 26 20 66 -48 -52 -23 24 86 44 3 13 -48 -51 -35 108 25 -6 -5 32 0 -34 2 71 -28 -65 3 50 124 -48 -16 34 52 146 42
3867D2kq7J73k6j79K31j6j92k5K2J53l4j19N9O7l8J9P4m0K5j53P6mN9p4j4p4M6R6rk13J98
$$ 42 40 -47 126 100 -79 152 136 -56 -81 -59 94 60 -59 0 67 29 48 122 82 107 -46 30 26 85 11 -3 -77 -31 65 56 -157 41
3466D1j83K63j06p5m8LJ21j4p9M0j8J26j12P6J1l5M1n2K1q3n6J34N6J0l3K4k0p9J10j27N6
$$ 41 -142 121 15 -60 -108 -105 16 2 -77 -37 -55 71 -41 35 46 11 52 0 21 -62 -118 16 72 82 49 73 53 -26 84 -43 13
3078A3O4K6j22J4K3M4j61J10Pk8l0J00N7j62J38m1j0r7R3J7o2o3p7K27j04K2m8Kl5J86n4q6
$$ 13 77 103 -19 -5 18 62 -99 11 18 -10 -40 60 117 -45 93 52 42 -55 38 55 -7 -70 -147 80 -24 -2 -50 -48 -83 103 49 -37
2678c7L7p6M6J71n9m0j08J06m6j1j6O8p9m3l9J91K8m1j74J32R4o0j52J33N3Km7k5j16J59N7
$$ -37 0 -76 -30 141 82 42 -66 40 -6 -17 -33 35 -44 -87 -126 65 93 52 -122 10 104 44 -108 25 78 80 33 8 -108 51 108
2290A08q4j58J02Q0q3K2P8j39J31p3j32J43oQ2j1j28J7J07o47M45J52r0k90k372j5996J8501
$$ 108 24 -134 -32 48 -35 -13 65 -74 57 -16 -148 -5 -11 71 60 -68 -51 56 -591 -146 6 -84 -374 -2746 -18742 -241
1964b41L14Kr4k1j44O3J28K6N4j38l6J21k3l8pL9l2J00p1oM6J15J0l34R3J32j29K4Q6M4k4
$$ -241 73 75 -19 -40 -184 -121 7 33 87 -51 -87 34 11 -27 -34 5 -27 73 2 -4 42 157 167 -167 -74 58 -71 -47 39 83 59
1576E9j27O5j38J75j42k90J261o94j7j49P9l4j36J13K4rj6p3J03K6l8Q0j40m9k7J41j57J01
$$ 59 -68 -3 -141 34 -108 -398 863 169 152 3 82 48 -88 25 49 40 24 -49 54 80 42 122 -18 -67 -94 47 -110 -9
1225iO9l6j47K6J48j58J36k6j22J64m9N0N5N8o7j79J00Q1l3po9o7K9P1ql6j2J20P3j1o1j59
$$ -9 60 24 -123 -97 51 -107 29 3 -119 45 -4 46 101 159 92 -87 13 94 61 54 -15 -82 -53 18 10 -26 -38 82 155 144 83 -76
825g6J02q6k9P7rM8J06j00j00R1J24j57k6J06m6kN9J1q3%O5j28Q4Q3j21J20r7M9n1J32n0l8
$$ -76 26 -60 -89 -12 -21 27 133 33 -67 24 148 -9 -35 71 25 23 82 93 10 10 75 -53 31 114 -7 113 16 65 14 146 96 58
424E8p1j72K29r3K5J05jN0j92r0J58J19n4j0j4N2J07j14n7M3o9kMQq2J6J01Mn0qm0R9k19J22
$$ 58 -13 -185 44 -49 -24 81 80 130 -62 -152 6 125 71 61 47 99 206 92 35 78 9 7 11 19 -63 -47 54 58 8 0 -40 59 -160 -38
-2c8M8J6l9o7L5L7oP6J19j63N3qj96O5K1L0K8Lj3o8QJ25R5k6o2k00J95n8k2J3m5
$$ -38 10 26 -13 -80 -45 -8 -14 62 181 18 71 63 -133 -68 -47 -17 11 14 1 -67 -59 66 161 135 73 -127 68 10 -12 1 -44
-390d4
##PAGE=	F1=-13269.4
##FIRST=	23151.189942674980557,	6007.9998942000029274,	0
##DATA TABLE=	(F2++(Y..Y)), PROFILE
6008e3K5P9k1l7ml3m1J56j53l0K24k16l2J42q7J42j17l6L0m9J11J5j30M2L4n0Q1Kr0L4N2J30
$$ -53 -28 51 30 -7 -11 -44 -85 71 -82 -112 112 -104 -136 6 -81 61 -56 -92 -62 -111 0 15 -115 -73 -39 -89 -8 -6 -96 -62 -10 120
5607A20j60K2J7l2J6o4J21J2M2j7j26J54p9O1m3o8j0Q4J8k7j27M1N3j11L1lM0J55r4k3qN4
$$ 120 -40 -18 -1 -33 -17 -81 40 52 94 77 -49 105 26 87 44 -24 -34 50 68 41 -86 -45 8 -103 -72 -75 -35 120 26 3 -5 49
5207D9O5p6J4K2j21O1J6N4o9r0Q3qMj3O7P5j49J03l6m1k8L4pq6J80r7p6M0Q7K5p7L6p3J8M
$$ 49 114 38 52 74 -47 14 30 84 15 -75 8 0 4 -9 58 133 -16 87 51 10 -18 16 9 -77 103 6 -70 -30 57 82 5 41 -32 -14 -10
4769a0Q8j05O4j49L5J37p2J0P0k26J56R8k16kk4J35m3N7j5J46l9n2o9J77j22l5O6n9JJ01j27
$$ -10 78 -27 37 -112 -77 60 -12 -2 68 -158 -2 96 -120 -122 -146 -11 -54 3 -12 134 95 43 -26 151 29 -6 60 1 2 103 -24
4380b4p4R3M1l1Mk1KO2l5M7r3M5j6M1M6j5o8Mp0NJ6J33o6l4J9K2n6k2L8J04j04n2N3QJ41j95
$$ -24 -98 -5 36 5 9 -12 -10 52 17 64 -29 16 0 41 87 72 4 8 -62 -57 -41 92 26 -8 11 33 -23 -45 -7 97 -7 -59 -6 2 143 -52
3930e2OL3L2J50p7q3n3J78l3j65J92lj72Lk9J47j7r2oJ29n1j3R2p0R4j97Q3J0J8r3PKJ5R3
$$ -52 -46 -13 19 169 92 9 -44 134 101 -64 128 125 -47 -44 -73 74 57 -35 -41 88 37 24 116 46 140 -57 26 36 54 -39 -32 -30 -15 78
3504G8K2j82J42j03J43j16n5o2L9J22m9o1J2L0J11p5N5j6l4K5p0Q2j23k1J28L5N1j03M9Kn5
$$ 78 100 -82 60 -43 100 -16 -71 -133 -94 28 -21 -82 -70 -40 71 -4 51 35 1 26 -44 38 -85 -106 22 57 108 5 54 56 1
3116AQ7j00O5L2L4j62oP1M2j40O2M9o1l6J06O7j27O1pj4p0J11J3j23k3j05K33j20P3k3qk0
$$ 1 88 -12 53 85 119 -43 -49 22 64 -76 -14 35 -26 -62 44 111 -16 45 38 24 -46 65 78 -45 -68 -173 60 -60 13 -10 -18 -38
2715c8J11n7k5M7j15M7J28J1m4j02N8o3O3l1O8r2n0o4K63m8K0j95J43M4l4j97J74L2L2o4J6
$$ -38 73 16 -9 38 -77 -30 98 109 65 -37 21 -42 21 -10 58 -34 -84 -148 115 67 87 -108 35 79 45 -152 22 54 86 22 38
2327C8j40J45Q0j29j04P9Ol5LJ30j06J13j38j19J43mR8n8q4J0P6o64M21J48j04m07l855k6864
$$ 38 -102 43 123 -6 -110 -31 -25 -60 -57 73 -33 80 -58 -177 -34 -38 60 2 -82 -72 4 -660 -239 -91 -195 -602 -4457 -31321
1977c1321L0853N75j4j23m8p3J2J45N0N9j24n8N5K2J5J2l3nN7jm0mJ33j7k81J07J23j29j0
$$ -31321 -468 107 93 -30 -78 -151 -139 6 56 115 -9 -67 -12 10 25 37 4 -1 56 55 15 11 144 127 -154 -47 76 -53 -63
1613f3J18K5k5j07N3j65K22j15k92J186o22n4j30O1J3j54Q7K1q3K6m9P2N3n4R4j42n9j8J36
$$ -63 55 80 55 -52 1 -164 58 -57 -349 837 215 161 31 92 105 -49 38 59 -24 2 -47 25 78 24 118 -24 -83 -101 35
1250C5j17K8J02k2j33N0R9j67J51Qj44J96j01P4K1O7q0j09M8Q1j0qn7m0k0J20m3o8n9J51P1
$$ 35 -82 -54 48 26 -107 -57 42 -125 26 34 -110 86 -15 59 80 147 67 -42 6 87 77 69 12 -28 -48 72 29 -39 -98 53 124
862A24K4q5j06O2j02j1P7J8N2Q8q4p8J08O0j54kO3j8K5J8J5j01K9J00j61R1O8p6P5j36J40
$$ 124 148 63 -43 19 -83 -94 -17 1 53 141 57 -21 87 147 -7 -9 54 36 61 79 94 -7 22 122 -39 52 120 44 119 -17 123
474A23r9J42o7l5j28j04K12j22L6J04QQ3j70j24J38J44o7K2k4PJ28j14n9M0j05M5K8k5p2K6
$$ 123 24 166 99 64 -64 -168 44 -78 -42 62 70 153 -17 -141 -3 141 74 96 72 79 207 93 34 74 -31 14 42 17 -55 -29
99b9R3k0j8k6n3J16k31J64JJ9m8n0K8N9l2J42R1j60M1n0k02J09l2Q0P3m4k8J0o5J30R3j8n6
$$ -29 64 44 26 0 -53 63 -168 -4 -3 16 -32 -82 -54 5 -27 115 206 46 87 37 -165 -56 -88 -8 65 21 -7 3 -62 68 161 143 87
-315H7k06J92r5K8Op7
$$ 87 -119 73 -22 6 12 -65
-390f5
##PAGE=	F1=-13363.8
##FIRST=	23151.189942674980557,	6007.9998942000029274,	0
##DATA TABLE=	(F2++(Y..Y)), PROFILE
6008e0nJ13n3l1K6n0l1R1n5r8K61j52o0Q3j26K04j73J6K1k0O1N1j35L8M7l5M7k6j1MN9O6j16
$$ -50 -55 58 5 -26 0 -50 -81 10 -45 -143 118 -34 -94 -11 -137 67 -106 -90 -69 -89 -28 23 -112 -74 -27 -62 -15 -41 -52 -48 11 77 -39
5595c9L3krPo1J06k7R9l5j58K00j29J37p6n2K8L0L5q6p9RQ5j15L2j1L8J73j52L1k1K7Q7j8
$$ -39 -6 -8 -17 -10 -71 35 8 107 72 -86 114 -15 122 46 -6 22 52 87 1 -78 -69 16 -99 -67 -78 -40 133 -19 12 -9 18 105 87
5182H7kK6j18Jl6J09n9o6J20p3J0RM3O9j08M1M6o7n2L8Pp0J76j33p8P2N7P9j48Q6j26K6L4
$$ 87 85 111 -7 -6 -42 67 8 -58 62 -11 -1 8 51 120 12 53 99 32 -20 18 25 -45 131 -2 -80 -8 49 128 -20 66 -60 -34 0
4769@O0q4N9j36N1Q9r2K0J01k22J60O6j73m3oJ37k4L0K5J44o9o5n6J81r1p7N0rl6J04j85k2
$$ 0 60 -24 35 -101 -50 39 -53 -33 68 -154 6 72 -101 -144 -150 -13 -37 -7 18 162 93 28 -28 153 62 -15 35 26 -10 94 -91 -113
4368a13R1M3k6J2l0K5P7p3O2o0N0k6K5J0J7p4j2n7k4M1R6l0m2N4Jp6j9L5J14r5m1N3p9K10
$$ -113 -22 21 -5 7 -23 2 79 6 68 8 58 32 57 67 84 10 -2 -59 -83 -42 54 24 -18 36 37 -39 -58 -23 91 -4 -45 8 -71 139
3942A39k15K7j4N4J77k1j66j0J64k6j49J47Mj34J5q1J29J2m7o5J58r0j0R1p4J39k06O4K8k5
$$ 139 -76 -49 -63 -9 168 147 -19 -29 135 109 -40 107 111 -23 -8 -89 40 52 5 -60 98 8 -2 89 15 154 -52 12 40 15
3567A5q7J4O9k1P9N3j15O5j6J2j05m2o2P6Q4n8m5MN0O9pM8o5k9K7r2J11j26N8M1M4M9j09N2
$$ 15 -72 -58 11 -10 69 122 7 72 56 68 -37 -79 -141 -65 19 -39 -84 -80 -30 39 32 80 15 -14 13 -79 32 -94 -36 5 49 98 -11 41
3141D1J2j2M7q8R7k2L4j74l0J12J6o5pP9p6n0R8P7o8k3J8j5k1R6J8j60jj16K22j37J27k0%
$$ 41 53 41 88 0 97 75 109 -65 -95 17 33 -32 -39 40 -36 -86 12 89 21 -2 16 1 -20 76 94 -66 -67 -183 39 -98 29 9 9
2728IPK8o6L5N3j39M2N9J00n8r0L2r3J22k7O0p5o9o0K63j10O8j77J34Jkj97J62J3N1q0N9j45
$$ 9 16 44 -22 13 66 -73 -31 28 128 70 -20 12 -81 41 14 74 -1 -70 -130 133 23 91 -86 48 49 47 -150 12 25 76 -4 55 -90
2315i0J30P8j60l4N0p0Oj3J79n8O5j81o9R9MJ03q3l8kM5n56K85R3n9m63m686l3159L7971P50
$$ -90 40 118 -42 -76 -26 -96 -90 -103 76 18 83 -98 -167 -68 -64 39 -44 -82 -84 -39 -595 -310 -217 -276 -739 -5425 -38584 -613 137
1952A37m4j17q1jm2J62M4P5j02n9kN7N7J5j00K2J1O4n4p2J37j1j96P6J09j22l5J32Jl6n7N0
$$ 137 93 -24 -105 -106 -148 14 58 133 31 -28 -30 27 84 99 -1 21 32 96 42 -30 107 96 -100 -24 85 -37 -72 60 61 25 -32 18
1551A8j92K45p3l06J134n75r7j16M8L2j40R3pj53Q7n2L9Q0n2R0j25o8JJ07o2l8J22j2j22O9
$$ 18 -174 71 -2 -308 826 251 154 38 86 118 -22 71 64 -89 -2 -54 -15 65 13 103 -22 -90 -89 18 -44 -82 40 28 -94 -25
1175b5M2j40J37N2j54J92j44Q5NM4n8j0k9N8K5j5k3l4l4J20l9j30o6J49N4Q5j22k5L0j24Q
$$ -25 17 -123 14 66 -88 104 -40 45 50 94 36 26 -3 55 80 65 42 8 -26 94 55 -75 -141 8 62 147 25 0 30 -94 -86
787h6O6M2L7Q0n5p3J48l4j35oN3L0M1l1K6j10M5J23j68P6P0m6K1j52J86j16J32o9n4j37n8
$$ -86 -20 22 59 139 84 11 159 125 -10 -16 37 67 108 77 103 -7 38 161 -7 69 139 93 114 -38 148 32 164 95 41 -96 -154
399a54J96j32L7Q6K7Q5j08j44J14J50q2L0l2kJ12q8o8K5j18J00L4m8o6N0P7n2Nm0n2J20k16
$$ -154 42 -90 -53 33 60 145 37 -107 7 157 75 105 73 71 183 95 27 52 -66 34 68 20 -46 4 81 29 34 -6 -58 62 -154
11a54J89l2Qn3l7K3P5o9J90N2j52L6p3j71J40p9J42P8r7k8Q6j38J10Q2J8m1j87J50j26Q2q
$$ -154 35 3 11 -42 -79 -56 19 -50 140 192 40 76 3 -168 -28 -107 35 113 16 -12 74 -64 46 128 146 105 -82 68 -58 24 16
-377A6q2
$$ 16 -66
-390f6
##PAGE=	F1=-13458.1
##FIRST=	23151.189942674980557,	6007.9998942000029274,	0
##DATA TABLE=	(F2++(Y..Y)), PROFILE
6008c8k2J24j01qO0n6Nj3L7j46K74o7r5L5j38K26k06O8K0j1OR0j11L4K6l4K8m2N9j2L5J2o0
$$ -38 -60 64 -37 -45 15 -41 -36 -49 -12 -158 116 49 -46 -11 -149 77 -129 -61 -41 -52 -46 44 -67 -33 -7 -41 -13 -55 4 -8 27 39 -21
5595b1Q%K5k5l9Q4n8J48n4j81K07j41J94r8l9O3m6O5j15l4l5J14r7RKK2J78k00Q5o5J9J23
$$ -21 -13 -13 12 -13 -52 32 -26 122 68 -113 94 -47 147 49 10 73 27 92 -23 -57 -92 22 -75 -66 -64 -42 136 -64 21 -44 -25 98
5194I8K0Mlq7o0p3J51n0l6J48j45K2L2J1N8o9jJ10q7n1M0Pn1J64j83l5J10j1J08j98J29j32
$$ 98 118 122 119 32 -28 -101 50 0 -36 112 -33 -11 21 32 90 21 20 130 43 -8 32 39 -12 152 -31 -66 44 33 141 -57 72 -60
4794f0J9O7Kn8N9j10O6K4r0K5J22k02J57L1j14p6K4J14k8RM9J40r5p0k9J69o8q3K9K5n8P2
$$ -60 -41 26 28 -30 29 -81 -15 9 -81 -56 66 -136 21 52 -62 -138 -114 0 -28 -19 30 170 75 5 -24 145 77 -6 23 48 -10 62
4393F2k02L0Q0K6k9O0n8M1R0j14Q6j3OKJl3M0n8k8l9o3P0M3J7m9Q3rr0k5L8R0o8k0P0j82K60
$$ 62 -140 -110 -30 -4 -33 27 -31 10 100 -14 72 59 65 67 68 35 75 17 -11 -50 -113 -43 0 17 -32 51 42 -48 -73 -35 55 -13 -33 37 -145 115
3942A15k20Q8q4P7J64M4k16J9J35kj42J10Or8Or7R2N3pr5J50j33PQ4n3J38j90M2M2m8o5JJ05
$$ 115 -105 -17 -101 -24 140 184 -32 -13 122 120 -22 88 94 -4 2 -95 -3 50 43 -52 98 -35 -28 56 3 141 -49 -7 35 -13 -78 -77 28
3529B8n4P1P2m1lM7p9p8n1m9J03L1l7l0%M3K0N8O9j21l0M7j07J02r0J41q7P1J3n9L8J2L5l
$$ 28 -26 45 117 76 73 120 41 -37 -88 -137 -34 -3 -40 -70 -70 -27 -7 51 120 -1 -31 16 -91 11 -79 62 -25 46 59 0 38 50 85 82
3103H2r3J35p3K7j60n5J43k2L5p5Q1o9o8R3P6j2p7L2l1L5N9L6j64lj00J93j48J55l4K3M7m2
$$ 82 -11 124 51 78 -82 -137 6 -16 19 -56 25 -44 -112 -19 57 45 -32 0 -31 4 63 99 -65 -68 -168 25 -123 32 -2 21 68 26
2703B6p7P2N3j33L6j9J65p5p4M2j35J68j2M8l1j10k2J96j43R1j38J18k7K2j59J17pO8r1P6
$$ 26 -51 21 74 -59 -23 -42 123 48 -26 16 -119 49 37 85 54 -56 -78 118 -25 66 -72 46 19 41 -118 -1 -8 60 -31 45
2327D5j25J07O0j51K1K4j12J8j2K06k1%j81LK4K2R9q6k2jK1l75J01QM1m37m485l1943L6551
$$ 45 -80 27 87 -64 -43 -19 -131 -113 -125 81 60 60 -121 -118 -94 -72 27 -59 -81 -82 -61 -436 -335 -327 -286 -723 -5208 -37151 -600
1964f00P49o8p4j25N6q1J77%J03r4l9k4P6P8pj40M6k9J19m9j45J24M2j30J6J08j20l9J26k1
$$ -600 149 81 7 -118 -62 -143 34 34 137 43 4 -20 56 134 127 -13 33 4 123 74 -71 53 95 -35 -19 89 -31 -70 56 35
1588C5n4MM8k01K31l0l09J033n04j22j11M4K3j05J21m7j99J60p9J2J08m6P1j01o4J8O1jq0
$$ 35 -19 -15 33 -168 63 33 -276 757 253 131 20 64 87 -18 103 56 -143 17 -62 -50 58 12 83 -18 -82 -64 -3 -4 -84
1225h4J16kj13Q2oj01J08J00j62J55j67R2Njj9R9r5J5O8l4J1m0k3P0Nj97l7J20K5J46j50N3
$$ -84 32 30 -83 -1 -7 -108 0 100 -62 93 -74 18 23 22 3 102 7 22 90 56 67 27 4 74 79 -118 -155 -35 -10 136 -14 39
825C9J8j40RM9N8J0Q2j0r1J94j30r8l4P4P7M1o1K6r7L7J24j46M2Q8l3k0j56J78q3R0n6q2j00
$$ 39 57 -83 -74 -25 33 43 125 115 24 218 88 -10 -44 30 107 148 87 113 16 53 177 31 73 161 128 108 -48 130 47 137 81 -1 -101
412a01m6J81j16L2M8N7M9k9j49R9J41r2Mk9J0Q6m3q2Oj07J37K2l3r3Q1P4q6Rn5k1J04j67J69
$$ -101 -147 34 -82 -50 -2 55 104 75 -74 25 166 74 78 49 59 145 102 20 26 -81 56 78 45 -48 33 107 21 30 -25 -46 58 -109 60
-2F0m0j3l7m5K2Q1r8K00J3j32L5p4j16J54j03K04K3j38j4J35j81P4O3O2j6j42P8j39J14j6
$$ 60 20 7 -30 -75 -53 28 -70 130 143 11 46 -28 -144 10 -93 111 134 -4 -18 117 -64 10 73 135 119 -23 55 -84 30 14
-377A4o3
$$ 14 -49
-390d9
##PAGE=	F1=-13552.5
##FIRST=	23151.189942674980557,	6007.9998942000029274,	0
##DATA TABLE=	(F2++(Y..Y)), PROFILE
6008b4j8J09j51L2P9n0M8j20J03j52K49J5j21K1j38J95k08J06L0k8j5R8o6M1k7m7M6n4R5o
$$ -24 -42 67 -84 -52 27 -23 25 -95 8 -144 105 120 -1 20 -118 77 -131 -25 5 -23 -38 60 -6 35 8 -39 7 -47 48 42
5632D2j2j5rm2K5N6p6qO8p3J79p1j86J77j11K13r6l4O1j09J04j10Kq4J38p2k4L4JJ52k14J20
$$ 42 30 15 6 -36 -11 45 -31 -39 29 -44 135 64 -122 55 -56 157 61 27 88 -21 83 -27 -25 -109 29 -43 -67 -33 -32 120 -94 26
5232B6j25L1J59K7L1n0l9j02q3J62m2j6J65j98K1M6kM0m4jJ37j12k0N0om1J35k23M7J32r8
$$ 26 -99 -68 91 118 149 99 60 -42 -125 37 -5 -21 144 -54 -33 13 11 51 7 6 143 31 11 61 55 14 149 -74 -27 105 7
4844GJ05k09J57q9JQ7o4m2O7q3P7l7n9K5J16j57J50Oo7r4L6R1n5qP4J21j11o2j0J53o0n1J1
$$ 7 112 -97 60 -29 -28 59 -5 -47 20 -63 14 -23 -82 -57 59 -98 52 58 -9 -103 -67 24 -31 -39 35 156 45 -17 -27 126 66 15 26
4430B6L9o8K7j77O0O6Qm6J17p8L7R7j52J04M8o0M3k4o3M2k6l5l2q0P5mO3m6Q2J1j06k2L3M8
$$ 26 65 -3 24 -153 -93 -27 -19 -65 52 -26 11 108 -44 60 108 48 91 67 4 46 20 -15 -47 -127 -52 -56 7 -39 43 54 -52 -74 -41 7
4005Gl1LP6k48K74k04J64j60Q9J22Q8k02K4R4K5j42Q2Qp6j1p0L6J08Kq0J13j54RQ2k1R5j62
$$ 7 -24 -21 55 -193 81 -123 41 -119 -30 92 180 -22 2 96 121 -21 61 69 -7 -18 -88 -52 56 58 -22 91 -63 -54 28 7 102 -60
3604f0M0M3l8m6l1J06o9P8P0Ll1P0j03n4q0k5J18k4Rj0j8K4k1R5J16j71l2P2j08O0k5J84j94
$$ -60 -20 23 -15 -61 -92 14 -55 23 93 96 65 135 32 -22 -102 -127 -9 -33 -24 -34 -52 -28 -49 46 162 -9 -41 31 -77 -17 -42 142 -52
3191e2R6l4K0J2J3O8n4j09J64j10K6j31q1J67n6J17j23N9m6q2R6O3K3q1L5p3P9K5O5j38k7
$$ -52 44 10 30 42 55 123 69 -40 124 14 40 -91 -172 -5 -61 56 -67 -8 -54 -136 -40 23 46 -35 0 -73 6 31 96 -42 -69
2803f9o5J51j43J41n6N6Q8q0q4P2N3r7K7p9J77q3o6Q8j72J94KL7K4j65L6Q6j39R3j00J07m2
$$ -69 -134 17 -126 15 -41 15 103 23 -61 11 64 -33 -6 -85 92 9 -57 31 -141 53 55 92 116 -49 -13 73 -66 27 -73 34 -8
2415hK7j02P0k9R1r5N6q4P4L3r9M1J5j06lMK04j6n4j39P4n6M6Q2o2m5J2Kj91n8o7J59l41l413
$$ -8 19 -83 -13 -42 49 -46 10 -74 0 33 -66 -25 -10 -116 -119 -115 89 73 19 -120 -46 -102 -56 26 -36 -81 -69 -67 -258 -316 -383 -224 -565 -3978
1989c978k4227K7766N71p1nj70R0r9J81o1J23j06Mj6Q6P5m7j46O2m9J59l7k02R5J30j23l9
$$ -3978 -28205 -439 132 61 56 -114 -24 -123 58 -3 120 14 18 2 88 163 116 -30 32 -17 142 105 -97 -2 128 5 -34
1651c4J25j28k0J05l7p0N8L4j81J81Rk97R19m42j30r4L6mo3J39p4k07K35j16j0J33n5M9p8
$$ -34 91 -37 -57 48 11 -59 -1 33 -148 33 42 -255 664 222 92 -2 34 30 -33 106 32 -175 60 -56 -66 67 12 61 -17
1288a7m5K0J7N6r4P8J0r5Q9l8p7Q1J40j63J01j66J02J0m3J1J89j20l5J08o1K1l8qoP0k48J2
$$ -17 -62 -42 -25 31 -63 15 25 -70 19 -19 -96 -15 125 -38 63 -103 -1 9 -34 -23 166 46 11 119 58 79 41 33 27 97 -151 -139
887a39Q1j2J84j57J02K3j32j3K8O2j2Q8M1j25K35k07m4p1J07J02K4n1%n8JJ06r5%J08l9k7
$$ -139 -58 -70 114 -43 59 82 -50 -63 -35 27 15 103 144 19 254 47 3 -68 39 141 165 114 114 56 57 163 68 68 176 137 110
499A10j60J30j1K0l0j04l6o6J68p6K1pR4rL3j38R6J23q8l7k1J6P7lq6lq5J40OJ4j55J05R0
$$ 110 -50 80 69 89 59 -45 -81 -147 21 -55 -34 -41 53 44 77 -61 35 158 70 33 12 28 105 102 16 13 -72 68 74 88 -67 38 128
86A28j11ko4L5O5q7R6k8l5Mp2K6P7j04J72j9j01L2o0n4J49j01K40p5j53J8J40j64L1L8Q7J0
$$ 128 17 15 -49 -14 51 -36 60 32 -3 1 -71 -45 32 -72 100 81 -20 12 -48 -102 47 -54 186 111 -42 -24 116 -48 -17 21 108 118
-315A18q2jj26J13j5l3
$$ 118 36 35 -91 22 7 -26
-390b6
##PAGE=	F1=-13646.8
##FIRST=	23151.189942674980557,	6007.9998942000029274,	0
##DATA TABLE=	(F2++(Y..Y)), PROFILE
6008ikP2j73P0P1l6P8j88J32j18J86P2j25N6j46J27j93J25M7o1J4O0j6O0j00o2J06o9Q3K0
$$ -9 -11 61 -112 -42 29 -7 71 -117 15 -103 83 155 30 86 -60 67 -126 -1 46 -15 -1 59 43 103 3 -59 47 -22 61 81
5632H1o0j3L1j02O3P0j38L6O3p7J82p7j70J29o2J92o2l0Pj39J44q4K6j13J46n4o0P7j1R2j89
$$ 81 21 8 39 -63 0 70 -68 -32 31 -46 136 59 -111 18 -44 148 86 56 63 -76 68 -16 10 -103 43 -11 -71 6 -5 87 -102
5244a02J25j73M8J77J4O0q5J0j19o7J44l9j0J68k15kM6K4Ql2L4J25j40L4O7k6m6Q3k29J43
$$ -102 23 -150 -102 75 89 149 64 74 -45 -112 32 -7 -17 151 -64 -66 -20 4 12 -20 14 139 -1 33 100 74 28 111 -118 25
4869B5J25j74P4j87J79k5j7Q7j14m8Q9o2P8q3kK2P2p7J29km1j06J7Q7q9k4J12Q4j13n2jJ33
$$ 25 150 -24 50 -137 42 17 0 87 -27 -75 14 -48 30 -53 -55 -33 39 -38 91 89 48 -58 -41 46 -43 -67 45 129 16 -36 -37 96
4468I6o8QlM3o9oj35O5N6Qq5J48n8J4Q7j77J04J12j13O8l9p4K1J3l0m9n4M9l2R9l5N0N7j24
$$ 96 28 36 33 76 7 1 -134 -69 -13 -5 -90 58 0 14 101 -76 28 140 27 95 56 -18 3 16 -14 -63 -117 -68 -100 -1 -36 14 71 -53
4042e3JJ6%NK6N1k49K57j77K32k27P5Q0R4j22J2M4L9j41N7J4o3k9j3k7J68k5l6O7j35j8Q7
$$ -53 -52 -36 -36 -31 -5 46 -203 54 -123 109 -118 -43 37 131 9 21 65 104 -37 20 34 -29 -58 -71 -98 70 45 9 76 -59 -77 10
3642A0jL4j24O6K8Jm8p1Q5n6R0M5KpN5o3n0j11LJ22p6O0J9n7J6m8R8J67j96k4P5r7OM9J61
$$ 10 9 43 -81 -15 13 14 -34 -105 -20 -76 14 59 61 54 109 46 -4 -115 -112 10 -66 -6 13 -44 -28 -76 22 189 -7 -31 44 -53 -47 2 163
3204A63k24R9o3Q4k0K9P6q7j31J70j32M5r8j10J83o6J38j33K9j7q4R8M4M1m8L6j34R3K1R0
$$ 163 -61 38 -25 59 39 68 144 57 -74 96 -36 9 -89 -199 -16 -82 56 -77 -48 -65 -149 -51 -7 34 -14 22 -112 -19 2 92
2828I2r6n7l3J08j26R5p4R3J10q5q5M6N2l9Qr4J35p9p4J51j85J93RK3P3k13Q5k2j02Q3p7J03
$$ 92 -4 -61 -94 14 -112 -17 -91 2 112 27 -58 -12 40 1 9 -85 50 -29 -103 48 -137 56 65 88 161 -52 33 11 -91 -8 -85 18
2427A8n3J9m9M6m8J13r1J7l8L3lk3K1L8o2m4K3J77m2p5p6J26j20O9M5j6q3L0k1n5j53r3K38
$$ 18 -35 -16 -65 -19 -67 46 -45 -28 -66 -33 -36 -59 -38 0 -62 -106 -83 94 52 -23 -99 27 -93 -24 21 5 -78 -48 -69 -124 -277 -370 -132
2014a32k14k031j4156J6316L06n0N9j91R8r7J61j02J20j32O4NR6M4q6j26P2m8J77l3k20N1
$$ -132 -346 -2377 -16533 -217 89 39 98 -93 5 -92 69 -33 87 -45 19 24 120 164 78 -48 24 -24 153 120 -100 -49
1689d9K32j71p7J56j38J3P1m5p0R1mj31J17L8k74Q44m34j27n4K0k9l7J25o2j82K94j48k4J38
$$ -49 183 12 -65 91 -47 -34 37 -8 -78 13 9 -122 -5 33 -241 603 169 42 -12 8 -21 -58 67 5 -177 117 -31 -55 83
1326H3p9L5o2j9OkR4q9J9J9n9R7o0p4P0J51j43M3j46J17J6o6J6K39j07p1J32q9Lj2qp4J28
$$ 83 4 39 -23 -42 -36 -38 56 -33 -14 5 -54 43 -17 -91 -21 130 -13 30 -116 1 17 -49 -33 206 99 28 160 71 74 62 54 -20 108
912A08k70N9N4m9J86j41J09L5r8l6lN2j5R3P7j60K56k44K1j01J33R2ojn1pn4Q9l0l3J10n6
$$ 108 -162 -103 -49 -98 88 -53 56 91 -7 -43 -46 6 -9 84 161 1 257 13 34 -67 66 158 152 151 100 93 39 128 98 65 175 119
512A19Mj67O6O2m9Lj05K1r9J52k9J2p2J31o3O3j22J07R1n8o3k2jQ7J7o8jn5J00OO6k24J06
$$ 119 123 -44 22 84 35 38 -67 -46 -145 7 -22 -10 -82 49 -14 49 -73 34 125 67 4 -18 -19 68 85 17 16 -39 61 67 133 -91 15
99A5J13j19j1o7R4J6KKj6n2O5j03K3P1q3J22l7p3K6l8j0J27q2K34j75j36O5J06q1j6J6P2L0
$$ 15 128 9 -2 -69 25 41 43 45 29 -23 42 -61 -38 33 -50 72 35 -38 -12 -50 -60 67 -15 219 44 -92 -27 79 -2 -18 -2 70 100
-315A00k6o5q6Q0kj5
$$ 100 74 9 -77 3 1 -14
-390a4
##PAGE=	F1=-13741.2
##FIRST=	23151.189942674980557,	6007.9998942000029274,	0
##DATA TABLE=	(F2++(Y..Y)), PROFILE
6008A0OK7j50R0L8k3Q3j97J27o3J09Q8j08J31j71O3j81J24N3q4P7j0K7P5j68o6J88q5L3M3
$$ 10 16 43 -107 -17 21 -2 81 -116 11 -52 57 145 37 168 -3 60 -121 3 56 -28 49 39 66 141 -27 -93 95 10 43 86
5632H6q4J5O0j48Q6O3j96R3O6q5J65o8j38Q6k5J48kj6r3j29J72n7M0j05J29m7r3J21j7K0j40
$$ 86 2 17 77 -71 15 78 -118 -25 41 -44 121 53 -85 1 -24 124 122 106 13 -116 56 -1 39 -66 63 16 -77 44 27 47 -93
5244i3J07j86N0J57J2P1r2M9j17l5J08m2j4J58j89l8K4R1l8l1P8R3j64R2Q6m7o3J7j84K15
$$ -93 14 -172 -122 35 47 118 26 75 -42 -77 31 -11 -25 133 -56 -94 -70 21 -17 -48 30 123 -41 51 137 90 27 44 -140 75
4869G5R4k15K4j48K01K4k6O8j24q1J23m8O5j11O3K0LK1R1Jk2j25k0J09j18l7J53M6j03n4M
$$ 75 169 -46 -22 -170 31 55 29 97 -27 -108 15 -33 32 -79 -16 4 7 28 119 120 98 -27 -47 62 -56 -93 60 106 3 -51 -47
4481d7J09q6O1j1N5o4j7j05N9M8K6j27J26RqN6j84Q5J65j32N8l4p3j0M7j5q2MMl3J13k6QJ01
$$ -47 62 -24 37 26 81 17 0 -105 -46 2 28 -99 27 36 28 84 -100 -15 150 18 76 42 -31 -41 6 -9 -91 -87 -83 -116 -3 -29 -21 80
4055H0j39M7j5m2L7N2j6j86K28j53K71k72M1N8O3mjqL1j27K3L2n5l3L3p3K15p1J4K2q2o5R3
$$ 80 -59 -12 -27 -69 -32 20 4 -182 46 -107 164 -108 -67 -9 54 50 49 41 72 -55 -32 0 -55 -88 -55 -128 87 16 30 52 -30 -95 -2
3642bnj4p5J04NN0p2j00N4j4Q5Ql2N4K3Qp2j25K9J19j26R9N2j01K3o4Q7J91j90jN0q6l4J09
$$ -2 -7 -21 -96 8 13 63 -9 -109 -55 -69 16 24 -8 46 69 77 5 -120 -91 28 -98 1 53 -48 -25 -89 -2 189 -1 -2 48 -38 -72 37
3216C7Q5j71P6o3J06n4O1O4q8j53J53j54R2o2j43J86m8R1j04J8kp8R2K8O7j9L7j85P0O0Q8
$$ 37 122 -49 27 -36 70 16 77 141 53 -100 53 -101 -9 -71 -214 -28 -76 15 -89 -71 -73 -151 -59 -31 36 17 54 -131 -61 -1 87
2828H7n3p4k0P4j02L3p9J27J00o3q2RN1K4k0o3O9o7r5J99j62J67NnJ14k31R8r2m4O4o7J05
$$ 87 34 -40 -60 14 -88 -55 -134 -7 93 30 -52 -43 8 32 12 -51 18 -49 -144 55 -107 60 65 60 174 -57 41 -51 -95 -31 -98 7
2427Go3jpN1o2J17q3nmj1m6N2k0Q6j1q1K8J41p9n9k1J56j66Q6oL9r9L1m5J9j84o0K41j03r18
$$ 7 -56 -57 -64 -13 -75 42 -41 -46 -50 -61 -107 -55 -75 11 0 -81 -53 88 9 -50 -71 85 -81 5 -1 38 -61 -30 -75 -56 -240 -300 -59 -162 -1080
1989a080o089P134P1j5Q5j64Q3q7J16r3Q8j56J29J5J11mj12r7P9k8J67m6j91OL11k36r8J83
$$ -1080 -7169 -35 36 21 106 -58 25 -62 54 -39 49 -107 22 37 148 144 32 -65 14 -14 153 107 -84 -78 233 -3 -101 82
1639H2j31M5L0n0m8J07o8o5O7N5k56Q06m66j17Pkm3k9P8j0j40L15j61k6J16j04K9n9J0j7Q
$$ 82 -49 -4 26 -24 -72 35 -33 -98 -31 24 -232 574 108 -9 -2 -4 -47 -76 2 -8 -148 167 6 -20 96 -8 21 -38 -28 -45 -37
1250c7J07q2l8K6j3J11q5p8P6J23r3pj19J35K0o9MK38p7p9J29j13k7L8k4j11J56k61Q8M6p6
$$ -37 70 -12 -50 -24 -37 74 -11 -89 -13 110 17 10 -109 26 46 -23 -19 219 142 63 192 79 52 90 66 -45 111 -150 -62 -16 -92
862i2J57j13Q7M5n5l5m7K9MR8P6j76K48k29P6j10J42M9l5O2j05L6j10Q9L2n0Q4p1N5j71NJ03
$$ -92 65 -48 39 84 29 -6 -53 -24 -20 78 154 -22 226 -3 73 -37 105 154 119 181 76 112 2 91 123 73 157 86 141 -30 -25 78
462G8q9L7q5N7j37J35LJ0j31J61q5N9j11J33L6qm9m5l4R6K4k8Nk7L5K6R0k54P7J20j04j3n6
$$ 78 -11 26 -59 -2 -139 -4 -1 9 -122 39 -46 13 -98 35 71 63 14 -31 -65 31 55 27 32 5 40 66 156 -98 -21 99 -5 -18 -74
48g4J25k1Q0q0j8n9J25j18LO8m1P0m0o3J5pPR0n8J81k30r2J14M6M4n9lK4L9J1r6l0K7J8j8
$$ -74 51 30 110 30 12 -47 78 -40 -37 31 -10 60 20 -43 -28 -35 -28 62 4 185 -45 -137 -23 23 67 8 5 29 68 79 -17 -47 -20 -2 -20
-390b0
##PAGE=	F1=-13835.5
##FIRST=	23151.189942674980557,	6007.9998942000029274,	0
##DATA TABLE=	(F2++(Y..Y)), PROFILE
6008C6pj5q3Q2oj7O9j54J01k0M4O6q5K27k01K8j78J11K6p0J36q3N5P8k15m7K56r6k8M0p5O4
$$ 36 29 14 -69 13 7 -10 59 -95 6 -14 30 96 11 238 37 65 -113 -2 24 -46 90 7 62 140 -75 -122 134 38 10 50 -25 39
5607C9P5j63Q2L9k41J59O7r9J33m4r9N8j6J05O6Rk04r6J77l3L8n7Q7m7j15J51j5l6r6Q0j63
$$ 39 114 -49 33 72 -169 -10 57 -42 91 47 -52 6 -10 95 161 170 -34 -130 47 14 52 -5 82 35 -80 71 56 20 -76 4 -159
5219a59K6J03M6M7p3Q2j06jO3m3k2J37j34o6j8J72q7l0J05N7j66J26R6o5p7m5r6K41N2k11
$$ -159 -133 -30 16 63 -10 72 -34 -35 28 -15 -37 100 -34 -100 -118 54 -33 -63 42 99 -67 59 155 90 13 -32 -128 113 165 -46
4844d6l8j05K22L8l3M4r3j23J56l4M2j33J17K2o2J04M2N%j47m8J43j40m0J79K3q7o5OQ7j06
$$ -46 -84 -189 33 71 38 82 -11 -134 22 -12 30 -103 14 36 -26 78 120 125 125 -22 -70 73 -67 -107 72 95 8 -57 -51 36 -70
4456g0Q1j5P9n0rj05N5L9M9j43N4J00j7K0j77O1J88j21J9ro4m4P5Mj15N8l1j0J06l4k2J16
$$ -70 11 -4 75 25 16 -89 -34 5 54 -89 -35 65 48 68 -109 -48 140 19 38 29 -35 -79 -4 0 -115 -57 -88 -98 8 -26 -48 68
4055F8j42R4m4o9O2Q0j06r0K09j47K73k90J0N2J9J08qn3J1r2k9O1m0k7M4q7K30j09M6j3k1
$$ 68 -74 20 -24 -93 -31 49 -57 -147 62 -85 188 -102 -92 -40 -21 87 79 26 37 -55 -84 -23 -63 -90 -46 -133 97 -12 34 21 0
3667@j04R2l2l3j6J32j5Q5j01j03K5L9M5k7o0J16nO8j01j15M5J12j64J17P0j28L7o8P1J80
$$ 0 -104 -12 -44 -77 -93 39 24 109 8 -95 -70 -31 14 -13 -73 43 38 106 5 -110 -65 47 -117 0 70 -58 -21 -89 -18 162
3291A62j59L5Nr1l9J41op6M2l5Q1q6R7L8m5j76J22j79J51k0j69J64pPn8M4j5p3P6K0J21k2
$$ 162 3 38 43 -48 -87 54 48 -28 14 -21 60 -26 71 109 64 -112 10 -169 -18 -38 -207 -43 -50 -43 -101 -57 -72 -145 -69 -49 72 50
2891E0K4j99L3J18N0j7p0k8N8q3k2o9J52N8k9p2j8L7P5m6mJ4n9j19K11j11J25j0l8J46k13
$$ 50 74 -125 -92 26 76 59 -11 -39 19 -64 -86 -155 -3 55 26 -46 -64 -27 48 2 -2 12 -47 -166 45 -66 59 49 11 157 -56
2502e6O9j08J8L9o3J03o7k5K6P0o8Q7o9J1Pm7q2J01o0J37K2r4J4R7r1k1LJ68k02J02n8Q5p7
$$ -56 13 -95 -77 -38 -101 2 -65 -90 -64 6 -62 25 -44 -33 -26 -73 -155 -54 -114 23 45 -49 -35 62 -29 -50 -47 121 -81 21 -37 48 -29
2089b9J2o4L9j69J0J73m0l32k022K472n6K1N9q9M4p2N6k9L5j63J78LJ29n1j22p2P7%J32o4
$$ -29 -17 -81 -42 -211 -201 -28 -68 -400 -2422 50 -6 15 74 -15 29 -43 13 -16 19 -144 34 37 166 115 -7 -79 -2 -2 130 66
1714F6j25k8L45k75j11J89r8O4nn5j7J08j39jN3N3k51P74m95r9O0j7m1k9J8O2j05K87j48j5
$$ 66 -59 -87 258 -17 -128 61 -37 27 22 -33 -50 58 -81 -82 -29 24 -227 547 52 -47 13 -4 -45 -74 -56 6 -99 188 40 25
1338B5P3j13K9p4M0m1L8R8q2o4K2K3J32j17o4Q6O0j4n0r6J49K1o0mJ96n4o2R7j28m6R8m2j15
$$ 25 98 -15 14 -60 -20 -61 -23 75 -7 -71 -49 -26 106 -11 -75 11 71 57 7 -89 60 81 21 17 213 159 97 194 66 20 118 76 -39
925c9J43k26R5M7q2J13q3N0N5k6Kr7qL9J02M1j74K17j68J03j01J40pn2R9j29N8j50J09P3m9
$$ -39 104 -122 -27 20 -62 51 -32 18 73 47 49 -48 -56 -17 85 126 -48 169 1 104 3 143 136 84 183 54 112 -38 71 144 95
537I5L7p3R9j62m6R2r1P5n6P2j75J19RK3j73J76o1L1j10J73m5M9kp6o7Q1L3K1%mk8N0Q3k20
$$ 95 132 59 158 -4 -50 42 -49 26 -30 42 -133 -14 -5 18 -155 21 -40 -9 -119 54 9 58 56 -20 -87 -6 27 48 48 44 16 66 149 -71
111g1K4R6p3nl7J11k6J28j22l3o0J68j14k7O0J1L8m2p2KL4kM8l6R6k19l2J42j5J62q1k5l3
$$ -71 -47 49 -24 -29 -66 45 19 147 25 -8 -68 100 -14 -41 19 30 68 26 -46 -44 -10 -12 36 0 96 -123 -155 -13 -28 134 53 28 -5
-302eL4K7r7K8l2M3l7
$$ -5 29 56 -41 -13 -45 -2 -39
-390c9
##PAGE=	F1=-13929.9
##FIRST=	23151.189942674980557,	6007.9998942000029274,	0
##DATA TABLE=	(F2++(Y..Y)), PROFILE
6008F6m4l9%N9m9k0N5q6O9j7J2K1p1L14k14K2j74Q7k6j4J48j22O6O9k33rK78r6o6Km3J22P1
$$ 66 22 -17 -17 42 -7 -27 28 -58 11 -6 6 27 -44 270 56 78 -96 -9 -35 -49 99 -23 43 112 -121 -130 148 52 -14 -12 -55 67 138
5595A38j42N9Qk65K13N7j10R8j9o2M1k3P9J16L4k84n5J53mJ8OL5n1j18J66j7n6p2N4j16j4
$$ 138 -4 55 63 -202 11 68 -42 56 37 -25 16 -7 72 188 222 -62 -117 36 32 50 56 91 40 -78 88 71 15 -57 -3 -119 -133
5207a33K7J13pl6J05q7K0J7l1l2J07p4o8o6K26j18j9J05K2j41J27Q2p1p7q5PK23J3j67r9o6
$$ -133 -106 7 0 -36 69 -18 2 19 -12 -44 63 -11 -79 -145 81 -37 -56 49 71 -70 57 139 68 -9 -94 -87 136 149 -18 -117 -183
4819a83K28J8m6K6l7j41J64j9K2j53J47K2r6J39%LK8j59m6J61j53k7J71J8o9o7jP4j10O1k7
$$ -183 45 63 17 43 6 -135 29 10 32 -121 26 48 -48 91 91 94 122 -37 -83 78 -75 -102 69 87 18 -49 -50 24 -86 -25 -52
4430e2J03k2Qj30N2K7O5j14m6J74pRj64M6J67r5k6K4n3o4Q1K7j24P5m5L2Q9o8k0Q5j29J17
$$ -52 51 29 37 -93 -41 -14 51 -63 -109 65 58 67 -97 -51 116 21 -5 19 -34 -98 -17 10 -114 -39 -84 -52 37 -31 -51 34 -95 22
4030B2o1p5Q7R7j86KK06j55K43k84LM8j6J77j2q1%m4q3Q9k1k0J9o4J97j15N2l5J7j07Q0o3
$$ 22 -39 -114 -27 70 -116 -114 92 -63 180 -104 -101 -53 -69 108 96 15 15 -29 -112 -23 -44 -64 -45 -109 88 -27 25 -10 7 -100 -20 -83
3629h3k9L8J38k1R0j17p6kQ0k6m5m9J46j6Q0j07q4M4J00j73J10O3j20M3o3N1J44j09P0m3j16
$$ -83 -112 -74 64 43 133 16 -60 -62 18 -8 -53 -102 44 28 108 1 -83 -39 61 -112 -2 61 -59 -16 -79 -28 116 7 77 34 -82
3241h2oJ48p4%K1LK6j15J32KK8j91Q6k01K04K2j79J15M7p7j1R5n3p9N3L1J89o0j1j61OJ65
$$ -82 -88 60 -14 -14 7 10 36 -79 53 55 83 -108 -22 -223 -19 3 -176 -61 -14 -91 -102 -7 -60 -139 -86 -55 134 74 63 -98 -92 73
2840G3k2Rn0l8N3p4n9m3J68lOn4l0kJ06m9M8j1n8j33J80n7Q9k8o2J67j74J8q1O8J1o0R4n8
$$ 73 51 60 10 -28 25 -49 -108 -151 17 14 20 -34 -64 -66 40 -9 39 28 -30 -163 17 -40 49 21 -41 126 -48 -30 -111 -43 -32 -92 2 -56
2415e6n4N8Q9o9K6n3N7Ko7r5J20q2J51L6p8j0M1n4J4qJ74k43J19q2J03k8k0o8K6j24O9P4k6
$$ -56 -110 -52 37 -32 -6 -59 -2 0 -67 -162 -42 -124 27 63 -15 -25 16 -38 -24 -32 142 -101 18 -64 39 11 -9 -77 -51 -175 -106 -32 -58
2002e8j72j166J449p9N3j1J0j3n5PN7j8j51J97k6J40p4j23n8O1K5Q5p0m4m4L24k59j24J67
$$ -58 -230 -1396 53 -26 27 16 26 13 -42 -35 22 4 -147 50 24 164 90 -33 -91 -30 -5 80 10 -34 -78 246 -13 -137 30
1639C0m5O7j7o5JJ00j91M7P9K6k59P38m89q0P2j0l1k0l4J27r5K18j11RL4j01K1j05P4o0O6
$$ 30 -15 52 35 -30 -29 71 -120 -73 6 32 -227 511 22 -58 14 4 -27 -47 -81 46 -49 169 58 67 101 0 21 -84 -10 -70 -4
1250dQ2r0m5NK9J53j50l0R5k2P5q0q9J54K3m8PJ34n0l2M7j38l7J43m9r5R7j69Q1M3p0P7n6
$$ -4 78 -12 -57 -52 -23 130 -20 -50 45 23 98 18 -71 83 106 58 65 199 149 117 164 26 -11 132 83 -12 85 -84 -3 40 -30 47 -9
837iJ2O9l0O3j34n1P5J03rj54J74q3R6r3J33m8n4R1j07O3j73J40Q6l9qn9J14j39p3L9p0J13
$$ -9 3 72 42 105 -29 -80 -5 98 89 -65 109 26 122 29 162 114 60 151 44 107 -66 74 160 121 113 54 168 29 -44 -5 -75 38
437C8l8Q4k21J19k0M9j86J76nqj09K12j29R0M8r8q1L6N8O5k9J2p0O3O4j35k9M4l9Qk3N9MJ41
$$ 38 0 84 -137 -18 -38 11 -175 1 -4 -12 -121 91 -38 52 100 2 -79 -43 15 80 51 63 -7 56 120 -15 -44 0 -39 -31 -54 5 9 150
11A50j25m9n6J81r3n2L6O5L1n4q8j0P6k6J5j1Oj58K6J36o4K32o6n7p4J8L0p6O9q3P3n7
$$ 150 25 -24 -80 101 8 -44 -8 57 88 34 -54 -64 12 -14 1 -10 -4 -162 -136 0 -64 168 102 45 -29 -11 19 -57 12 -71 2 -55
-390e5
##PAGE=	F1=-14024.2
##FIRST=	23151.189942674980557,	6007.9998942000029274,	0
##DATA TABLE=	(F2++(Y..Y)), PROFILE
6008H8q8m1O9L5q5k2N8k6M1n9J9l0p0L63j93K5j54O4r1O9R8j18P3N0k15K6K49q5o5n7mJ66
$$ 88 0 -41 28 63 -22 -44 14 -12 29 -30 -11 -41 -111 252 59 84 -70 -6 -97 -28 70 -48 25 75 -140 -114 135 50 -15 -72 -76 90
5607I0M4r4L9j3k67K29L2r7O0pk8K3k0P1J32L9k99k1J08M0j7N0oo0r6J64l0l9o5K7n9m8m2
$$ 90 134 40 79 66 -201 28 60 -37 23 16 -12 11 -9 62 194 233 -66 -87 21 61 44 94 88 28 -68 96 66 27 -38 -11 -70 -118 -160
5194a60J77p3J1J12n7K0k9Lm5P4l4l5j06K19j14RQ3rr8J05L9o4o5r0R3J81j7j02j38l8K02
$$ -160 17 -56 -45 67 10 30 1 4 -41 33 -1 -36 -142 77 -37 -28 55 46 -52 53 92 28 -37 -127 -34 147 130 28 -110 -148 54
4806E4j1o9K2J7j17J38j3J4j63J47K1q9J06j4kN4j50j3J44j65LJ34K1n6l9k4P3q4Qm8J11J5
$$ 54 43 -26 -4 13 -104 34 21 35 -128 19 40 -49 57 43 41 95 -55 -68 76 -89 -86 48 69 13 -26 -50 23 -61 -53 -101 10 25
4405B5K2j55M6QP0n1j32K01J2L8j51M9R9o7n3M7m3n9O7M7r6L6l5P3Q5j16PK3j07J00o4n4J11
$$ 25 47 -108 -62 -54 16 -35 -167 34 46 84 -67 -18 81 14 -39 8 -35 -94 -27 20 -76 -40 -75 -2 83 -33 -26 -3 -110 -10 -74 -128 -17
3992a7R1k21O3K04j61J88k57K6K9k4J87k1q8J2Kj21J03Lk2k2k4J30r1M6m7J9o4N5q1j9P2J26
$$ -17 74 -147 -84 120 -41 147 -110 -84 -55 -79 108 87 -1 11 13 -108 -5 -2 -24 -46 -70 60 -31 15 -32 -13 -77 -22 -103 -122 -50 76
3592G6j0O4j15k8l1J00j12l2%J34qL7p5m3K5Q2j40P6L8q2L3n2J7J11m6Q8q1j55N1J43j00K2
$$ 76 66 130 15 -13 -44 56 -56 -88 -88 46 38 75 0 -43 -18 64 -76 0 38 -44 -11 -63 -46 65 19 107 26 -129 -78 65 -35 -13
3191a3K5K8k9j33J59m2J06j90N4k07K27N4j71N6R6j26J5J43r4r2K6O4K37j06o5q7LJ77j02
$$ -13 12 40 11 -122 37 -5 101 -89 -35 -242 -15 39 -132 -76 20 -106 -91 52 -42 -134 -108 -44 193 87 22 -65 -62 115 13
2828A3K7l0l6N1p1p8jJ80o7K9k7k7o8J16k0O9oo3j35J28k7P3l9n9J61j32k8l6J01j5o1P9l5
$$ 13 40 10 -26 25 -46 -124 -125 55 -12 17 -10 -37 -105 11 -9 60 54 -9 -144 -16 -43 30 -9 -68 93 -39 -67 -103 -2 -17 -78 1 -34
2415c4q6R4R7o8m5l6J01jp2p8J17q2J08M4m5k4l1K9K9l6J74k84J37p0Q8K4n0o2kn6Q2rl9j89
$$ -34 -120 -26 71 3 -42 -78 23 22 -50 -128 -11 -93 15 59 14 -10 -41 -12 17 -19 155 -129 8 -62 26 50 0 -62 -64 -120 -38 -47 -86 -275
1989b75j508J808n1Q4r6R6p3m1j5J28n7j27J86n9J31n6j19n3K8M3L8m9K2l8K58j97j32J21
$$ -275 -1783 25 -26 58 -38 58 -15 -56 -71 57 0 -127 59 0 131 75 -44 -97 -69 -26 12 -37 -15 -53 205 8 -124 -3
1639cJ1N6Mq3jQ0k07Q0J26k0k73P09m53o8L0K5j7kn9J55j06J31o0M0K4p9jj43J12p2P6P2r5
$$ -3 8 64 68 -15 -16 64 -143 -63 63 43 -230 479 26 -42 -12 13 -4 -6 -65 90 -16 115 55 95 119 40 39 -104 8 -64 12 84 -11
1225a1Kk0MJ56j60OR5r0J47r7r6J48K3l3L4P6n8olj39j3J63m6o2L6r5M9K4m1N6l6j5Q1o0J19
$$ -11 -9 -29 -25 131 -29 -23 72 -18 129 32 -64 84 107 74 108 184 126 120 117 -22 -35 128 82 20 56 -39 10 34 -7 49 13 -2 79 19 138
787A38j39r1J06R5n6j17J39j6P1j03J23n3m7M3n2O9j78J61P4k6k9m2J00j07p4k7m7J42m1J01
$$ 138 -1 -92 14 109 53 -64 75 59 130 27 150 97 50 93 41 110 -68 93 167 141 112 70 170 63 -11 -38 -85 57 16 117
412A17k72J41o8P8j72J63N2m3j02K34j90J06P1r4p1k1R3R6p9K0r6O9N5m2o1j1j4K0k6mM9J25
$$ 117 -155 -14 -82 -4 -176 -13 39 -4 -106 128 -62 44 115 21 -50 -71 22 118 39 59 -37 32 87 45 -16 -27 -41 -21 -47 -51 -2 123
11A23j04n1m6J58o4n4qJ08M6q1q6k7J10n4NJ1o1q0P0R5q9K37j6r5r0qL3m4Q7j21J08o8
$$ 123 19 -32 -78 80 16 -38 -46 62 108 27 -59 -86 24 -30 -25 -14 -75 -155 -85 10 -79 158 142 47 -43 -51 -18 -62 25 -96 12 -56
-390e6
##PAGE=	F1=-14118.6
##FIRST=	23151.189942674980557,	6007.9998942000029274,	0
##DATA TABLE=	(F2++(Y..Y)), PROFILE
6008I1j14k4J03J7j09j9Q4JK8j33N1o7p0L49j43K1j08M8j37J43Lp9Q4K5j66M0J86o7k7j05
$$ 91 -23 -47 56 73 -36 -55 29 30 58 -75 -24 -91 -161 188 45 66 -42 6 -131 12 15 -64 20 45 -121 -81 105 38 11 -94
5632i4K1J72kl5L9j0k50J91lm9K1j9%PjP8J05K2k44ON4R1n3N4k8o3o0J48o3Ln7rJn7p8J90
$$ -94 -73 99 97 62 101 91 -159 32 29 -20 1 -18 -18 -11 -12 66 171 193 -51 -45 9 100 47 101 73 10 -50 98 35 38 -19 -28 -27 -84 -162 28
5182B8j21O1R6j7ko6N2n9M4k6K0j26J52p6N1N3l7n2P7j8m7n4o3J38J39l9l3j42k3J40k6r3
$$ 28 -93 -32 64 47 45 -21 31 -28 16 -10 10 -116 36 -40 11 64 27 -25 52 34 -13 -67 -130 8 147 108 75 -67 -90 50 24 -69
4781f9K7M6n0Q5l0K0j47J24J7n3J9NKO5j30M1Q5j74M5Q7J9m8J8o1Q1k4n3q5J00N4K7j59L7
$$ -69 -42 4 -46 39 9 29 -118 6 23 -30 -11 -6 -4 61 -69 -28 57 -117 -72 15 34 -14 4 -57 24 0 -53 -138 -38 16 43 -116 -79
4368g9j6O8J0j77J81L0R2j30N9kl7m5M1l7k7L7N6l7m1j1R4J06j58L7l4q3M4n9oJ23O1j97Q5
$$ -79 -95 -27 -17 -194 -13 17 109 -21 38 36 -1 -46 -5 -42 -69 -32 24 -13 -54 -65 29 135 -23 14 -20 -103 -59 -118 -124 -1 60 -137 -52
3955e2J77j43J23k13N5mlJ49l4p8M6K8j25R5K5l3n8J1N6n2M3n0j0J2K3q3k3R0J05RK3j04K0
$$ -52 125 -18 105 -108 -53 -57 -60 89 55 -23 23 51 -74 21 46 13 -45 -34 22 -30 13 -37 -47 -35 -12 -95 -118 -28 77 86 109 5 25
3542B5o1J05j85J1N5R7J5m3j2ppO2p5K0J6l1Rl8l3R7K3Q1j07j88J08J41r6qN7K2n8j34J80
$$ 25 -36 69 -116 -105 -50 47 62 19 7 0 -7 55 -20 0 16 -15 -6 -44 -77 20 43 124 17 -171 -63 78 -18 -26 31 53 -5 -139 41
3128D1r5J63j66L0j90K10O5j53J1J28j32J4J63j18r1j6J25K25j19j24rK2J48j59L4j9k0L8
$$ 41 -54 109 -57 -27 -217 -7 58 -95 -84 44 -88 -74 89 -29 -120 -136 -11 214 95 -29 -38 -16 132 -27 7 -12 -32 6
2778Fn7q3N2J82j17L6jnj52J14L4N6Qo5j26P9l1P8m0k1J18r9n2jJ20l5o3O2mj18J26R3o1r9
$$ 6 -51 -134 -82 100 -17 19 18 13 -139 -25 9 65 73 8 -118 -39 -70 8 -32 -53 65 -34 -86 -87 33 -2 -65 -3 -7 -125 1 94 33 -66
2352f6k5J15Rn9m4J05o9K2O1j8k3j02J28K4n9J59l03J45l2M8O0o1o2k8K2M7m8n5k05j624J948
$$ -66 -91 24 33 -26 -70 35 -34 -12 49 31 8 -94 34 58 -1 158 -145 0 -32 16 76 15 -47 -75 -53 -6 -54 -109 -314 -1938 10
1964A0k5J11j66J41j15l2mJ49o5j02J53q6J06j0j06n5j3N4Nj3O1j1J68j17j30N9N8L5M8j05
$$ 10 -15 96 -70 71 -44 -76 -80 69 4 -98 55 -31 75 65 -41 -96 -109 -55 -50 -63 -2 -13 155 38 -92 -33 25 60 108 3
1588Cj6M8j79R8J61n9k92O97m07o8m2P1jJ8n6J36j17N0rP1N3o7l2j73J46p4O5P5r7M7m6l0
$$ 3 -13 35 -144 -46 115 56 -236 461 54 -14 -56 15 14 32 -24 112 -5 45 36 107 160 93 61 -112 34 -40 25 100 3 50 4 -26
1188b6J32j32J4R2j24J88j07j02J35J6j5O2L4o6Rl7j30J1J62m8k5j6j7J0rnM6k5k6P9r0J42
$$ -26 106 -26 -12 80 -44 144 37 -65 70 86 71 133 167 101 110 73 -57 -46 116 68 43 27 10 20 11 6 52 27 1 80 -10 132
787A32j02j25J34P2r1o5J25NM8j31J06k2m5j6J2Q8j72J60M6qk4l4O6p5m7o7l9J44m8J08l13
$$ 132 30 -95 39 111 20 -45 80 85 133 2 108 86 41 25 37 125 -47 113 159 151 127 93 159 84 37 -30 -69 75 27 135 -178
399a78J76j13J01j42J37Q6o7q1K23k07J00O1p6l9o3J21J10j28K1j17P7O0K5p5l9mL5m6n6Q0
$$ -178 -2 -115 -14 -156 -19 67 0 -81 142 -65 35 96 20 -19 -82 39 149 21 42 -75 2 62 87 12 -27 -31 4 -42 -98 -18
23a8R7q0l0k7J03l5l0o1J28O8j09n3n1J22p6K1K7r0k5R2L7q1J86N0j21r1l7L3oQ1j38J35o2
$$ -18 79 -1 -31 -58 45 10 -20 -81 47 115 6 -47 -98 24 -52 -31 -4 -94 -119 -27 10 -71 115 165 44 -47 -84 -51 -57 24 -114 21 -41
-390d1
##PAGE=	F1=-14212.9
##FIRST=	23151.189942674980557,	6007.9998942000029274,	0
##DATA TABLE=	(F2++(Y..Y)), PROFILE
6008G4j10JJ00Lj18j0J20LK4k09R4q1o2K67q2J3m7M9j51J75r7k5J04nr8K5J19n2K6j18K7J28
$$ 74 -36 -35 65 68 -50 -60 60 63 87 -122 -28 -109 -171 96 14 27 -20 29 -122 53 -44 -69 35 30 -68 -43 76 24 50 -68 -41 87
5607H7m8J6O1J3k15J13m4K2j3n2K3kK6Q5N3lj46K4J0J31p4J7k8n7k7J21j16N4l1n9O4l6p1
$$ 87 39 55 116 129 -86 27 -17 5 -8 -60 -37 -39 -13 72 125 122 -24 0 10 141 67 84 56 -1 -28 93 -23 31 0 -59 5 -31 -102
5194a02J30j29R3O5K3l1r0R8o7J8m2P3j18N5k7J02K3n8j8N9o4l4n7j8J50J00n2K1j06k5O2
$$ -102 28 -101 -8 57 80 49 -41 57 -10 8 -34 39 -79 -24 -51 51 74 16 -2 57 -7 -41 -98 -116 34 134 82 103 -3 -28 34
4806C4k7r5L6L8L1L5p6L3r9R3J0j7q3M0K4N7j15R7Oj82Q7N4J3m9Q5r8R0N4j02j34Q2Q2K4j35
$$ 34 7 -88 -52 -14 17 52 -24 9 -90 3 13 -4 -87 -47 -23 34 -81 16 22 -160 -73 -19 -6 -55 30 -68 22 76 -26 -160 -78 4 28 -107
4380a07L3m2O4L8j72J34M4J36r7O4j09nmKl7K5QM6K9j24K7Q0J41j74M7m8o7k6n9N7J08K6j27
$$ -107 -74 -116 -52 -14 -186 -52 -8 128 31 95 -14 -19 -23 -21 -58 -33 -25 21 50 -74 -47 33 174 0 47 -1 -68 -94 -153 -96 12 38 -89
3967h9P8J06r5O5j53O2l7L3Q9m0n9Q1K8r6O9M1m4p8K1J4k4N2m9m1Q3j0p5m0J02Q0K5j7r1N0
$$ -89 -11 95 0 65 -88 -26 -63 -30 59 19 -40 41 69 -27 42 83 39 -39 -18 -4 -28 24 -25 -66 17 7 -68 -108 -6 74 99 82 -9 41
3542D1q7J03k21O7Q1O3M6j19M2J3l6M4lm5J6J3j7k6q0R4Q5N9j30j98J48J44q0o4J06j8n9j09
$$ 41 -46 57 -164 -97 -16 47 93 -26 16 29 -7 37 34 -11 5 18 1 -25 -105 -11 74 133 3 -195 -47 97 17 -47 59 41 -18 -127
3141a27J97j42J77j26J7j51J55N5j38jJ32r6j9J51j11o5p4K04J46p8j75N0M3R4j75L4k3jJ0
$$ -127 70 -72 105 -21 -4 -155 0 55 -83 -84 48 -48 -67 84 -27 -92 -166 38 184 106 -69 -19 24 118 -57 -23 -46 -47 -37
2778c7k0p4J01J71j44K2K2K6k27J08R6K0J9o0j10N2o2R0l7L9M5p4n6J4J32n2n9M6K1j39J41
$$ -37 -57 -131 -30 141 -3 19 41 67 -160 -52 44 64 83 23 -87 -35 -97 -7 -44 -5 40 -34 -90 -76 56 4 -55 -9 12 -127 14
2390A4P9m4j21k3R7K9l1k1J01o2o5Q8rj7j39J93J5o2J23k77J30OjQ1n2q0l4Q7rl9o4j91j296
$$ 14 93 49 -72 -95 2 31 0 -21 80 18 -47 41 32 15 -124 69 84 22 145 -132 -2 4 3 84 32 -48 -82 5 -4 -43 -107 -298 -1594
1977a594J612j8J25k02J40j18m0K9J20m2q1J10j03P7L8p6o1n4O7j7K2P1K9Q1n0j13qQ5J4R2
$$ -1594 18 0 125 -77 63 -55 -95 -66 54 12 -69 41 -62 15 53 -23 -84 -138 -71 -88 -66 5 34 115 65 -48 -56 29 43 135
1601A35j24k4Rj13R3J62p0l11O87l62p6r7R8J7L2l3P6j09qL0J02R7p8n6j81J63o3M2Q6r3N7
$$ 135 11 -13 -4 -117 -24 138 68 -243 444 82 6 -91 7 24 56 23 99 -10 -18 12 114 211 133 77 -104 59 -4 38 124 31 88
1213H8n9m9Q5p2j5R0j12J90j18r1J16KPP6Ko7K2m9j11J9J56o9Rl7M8l4l9L3L7l0k0M6r5J35
$$ 88 29 -20 65 -7 -22 68 -44 146 28 -63 53 55 62 138 140 73 95 46 -65 -46 110 41 50 13 61 27 -12 21 58 28 8 54 -41 94
787I4l3j53J56M0j15kJ26k0L7j49P2K4n7o1O0J23j61J39J7J6jn0K6n2Ko3m4J12l7Q8l20K05
$$ 94 61 -92 64 104 -11 -13 113 93 130 -19 53 77 20 -41 19 142 -19 120 137 153 152 102 128 76 78 15 -29 83 46 134 -186 19
387A9j39J16j13J07Q3p4n6J80j86Q5L8o1Lp7J28J12j51J4j43R8O5M9p3l5kN5p0r1Q3P0p1J3
$$ 19 -120 -4 -117 -10 73 -1 -57 123 -63 22 60 -1 2 -75 53 165 14 28 -115 -17 48 97 24 -11 -13 42 -28 -119 -36 34 -37 -24
-14b4kM4k0Jr7J19Q3j19Mq0J05q7O4K1p7j4R2j3m4J11R7j15r6n6K8L4N6j33J43m6
$$ -24 -26 18 -2 -1 -98 21 104 -15 -11 -91 14 -73 -9 12 -65 -79 13 0 -44 67 164 49 -47 -103 -75 -41 15 -118 25 -21
-390b1
##PAGE=	F1=-14307.3
##FIRST=	23151.189942674980557,	6007.9998942000029274,	0
##DATA TABLE=	(F2++(Y..Y)), PROFILE
6008D0p5K6P4j5j13LJ44oK7k60J31o8m7J36k8J2J4O3j31J48j61K4J35m3k9j2O9m6P0q9J2N3
$$ 40 -35 -9 65 50 -63 -60 84 78 105 -155 -24 -92 -139 -3 -31 -19 -5 58 -73 75 -86 -62 73 30 1 -11 58 12 82 -7 5 58
5607E8p2M6Q6L9j65K5q0R3m3p8L5KL6Q6Mj6m6L4j6J39p1l4j8m2rQ7j80J00J3j10J27kl1K1
$$ 58 -14 32 118 157 -8 17 -63 30 -13 -91 -56 -54 -18 68 72 56 10 44 28 167 96 62 44 2 -7 80 -100 0 13 -97 30 28 -3 18
5182A8j00Q2M6N0n4r5J19n5po6J03q5k9QJ41Jo6%N0p4l7p4L0J43O0n8N3n0m2kj8o5M0mJ03
$$ 18 -82 0 46 96 42 -53 66 11 4 -62 41 -44 -73 -65 76 77 11 11 61 -13 -50 -124 -94 49 109 51 104 54 12 10 -8 -73 -33 -37 66
4743F6Qj38M6l4P2lkj53O1O1L6j15J36o1j84J16M0J5n2J23j16R5J23j20j83P7Q6Rr0M0o6O3
$$ 66 74 -64 -18 -52 20 17 15 -138 -77 -16 20 -95 41 -20 -204 -88 -48 -33 -85 38 -78 17 140 20 -163 -86 0 9 -81 -41 -107 -44
4343d4K8j40R2M9J42n0N4j88K6N1n1m5Q3j5J6P8j80P8L5J64j58K8qo0q0o6J11O1Pm0N9mk4
$$ -44 -16 -156 -64 -15 127 77 131 -57 -31 20 -31 -76 7 -8 8 86 -94 -16 19 183 25 53 45 -15 -95 -161 -50 11 18 -22 37 33 9
3930IK4q1K8n2O7L7l0m3R5Qn0L6M4m3p7JK2j3P0n4m7J15m1o4n6J22M3K9l9q2N8j02R9k10J12
$$ 9 33 -48 -20 -72 -5 32 2 -41 54 62 12 48 92 49 -28 -27 -5 -18 52 -2 -49 66 25 -39 -95 27 70 99 60 -22 36 -66 33 -177 -65
3491f5O5M6Q0j59N6J5n1L4M7j09M5M5l2k2j00P9J24L6j54j72J61J46o5j20J58p6m1o6K02j65
$$ -65 0 46 126 -33 23 38 -13 21 68 -41 4 49 17 -5 -105 -26 98 134 -20 -192 -31 115 50 -70 88 12 -29 -95 107 -58
3116e8J54r0J2r3P8L5j35K2J08l3p3J22q5j5j45K83L3Pk07P6N4L1j52K4k0Jl1L7m6J29J44
$$ -58 96 6 18 -75 3 38 -97 -75 33 0 -73 49 -36 -51 -196 87 120 127 -80 -4 50 81 -71 -47 -67 -66 -97 -60 -106 23 167
2728A67j54mL6N6k58J02J37j3K2n4q7M7r5Q2l1R0k8m6n4J1J41o6m7M2K4j40J24N9j3j18k7
$$ 167 13 9 45 101 -157 -55 82 69 91 37 -50 -3 -98 -16 -47 43 15 -31 -85 -74 67 1 -46 -4 20 -120 4 63 50 -68 -95
2340i5O7N2lk3J09o6j16J11j6k2j25J96K1m5O3j96Q4K9m6R4l1j09j6J18n3jo2j86r44J247
$$ -95 -28 24 21 -2 107 41 -75 36 20 -2 -127 69 90 45 108 -88 -4 25 -21 73 42 -67 -83 35 -18 -19 -81 -267 -1211 36
1964C6j6J10j99J06p4p5O6P5ln9N8j07O4M9k4p3q7Q6k7L7O4P1J9j8q7o7R9%J10j36ol5j9N9
$$ 36 20 130 -69 37 -37 -112 -46 29 26 -33 25 -82 -18 31 7 -66 -153 -67 -94 -57 7 78 97 79 -8 -75 24 24 134 -2 -8 -43 -62 -3
1538cJ22l9l35O68l22q1j05Q6K9M4%j0p5m0N4J31J21j06o4j59J58m4K5R1q7K6n2m2L4qo3R3
$$ -3 119 80 -255 413 91 10 -95 -9 20 64 64 54 -21 -61 -7 124 245 139 75 -84 74 30 55 146 59 85 33 -9 25 17 -46 47
1138D7o6J65j42n4R7j9K4P3k5o1M6n1q4J2J60j08L6k5Q4q0n1P4J4m9kj3p3J14M4j72J66Qj33
$$ 47 -19 146 4 -50 47 28 52 125 100 39 85 34 -50 -38 122 14 50 25 109 29 -22 52 66 17 15 2 -71 43 87 -85 81 89 -44
725d4O2J21n7L2j34K7O0q0r0Q8J58j47J10nM7K6r2om7N6j3n5O1JL7k82K12j45J29r8Q1N5p2
$$ -44 18 139 82 114 -20 7 67 -13 -103 -15 143 -4 106 101 148 174 82 76 29 85 72 17 78 79 116 -166 46 -99 30 -68 13 68 -4
311dl6J20j50P6K8p2M4o5J09J11j32kj69J29N1M1o5j1kP6p3j09N4N4p9O3K1Ok8J6r4R0Q1j07
$$ -4 -40 80 -70 6 34 -38 6 -59 50 161 29 27 -142 -13 38 79 14 3 1 77 4 -105 -51 3 -76 -13 8 14 -14 2 -92 -2 79 -28
-114b8O8j07O5q3J22rl8m2P3l7RM6R2o5j13n0J1P0K1j07J23k9
$$ -28 40 -67 -2 -85 37 28 -10 -52 21 -16 -7 39 131 66 -47 -97 -86 -16 5 -102 21 -8
-390h
##PAGE=	F1=-14401.6
##FIRST=	23151.189942674980557,	6007.9998942000029274,	0
##DATA TABLE=	(F2++(Y..Y)), PROFILE
6008Ak5L9M7l8r5J4J39oL3k76J59m0l7kRK4O1Q4r5O7j64N6J68q0J9n0L6m6Q9l8j5j2o3N1R1
$$ 1 -24 15 62 24 -71 -57 82 76 109 -167 -8 -48 -85 -87 -78 -54 7 91 -4 63 -101 -45 123 43 62 12 48 2 91 53 38 26 -37 14 105
5570A05N1j14l4r9J30o0p4L0K0J4P9k0qK4K7j3J09m9o8ok6rN2k31J27N8j39J74K6K0q9m9K0
$$ 105 156 42 8 -91 39 -21 -95 -65 -45 -31 48 28 20 44 71 58 167 118 50 44 18 9 61 -170 -43 15 -124 50 76 96 7 -42 -22
5157b2N4N9o1q8J10j9l1q5J00l5o9J5J49rn4OM3m2o5r1O7J30J6o0O2Po6l2j8mL2o2J49J4j91
$$ -22 32 91 30 -58 52 33 2 -83 17 -18 -87 -72 77 68 14 20 63 21 -44 -135 -68 62 78 18 80 87 21 -11 -29 -33 -1 -63 86 100 -91
4718i1N2K7O4k1mj71M3J01J5j24J46r1j73J21M1L0n2J12j05Q9J62r9k16R0O5k1l8N4p8O4%
$$ -91 -39 -12 52 31 27 -144 -101 0 15 -109 37 -54 -227 -106 -65 -35 -87 25 -80 9 171 72 -144 -54 11 -10 -48 6 -72 -8 -8
4330hj09O5M8J07%K9k08M2R4q8n6J31l9j9R1j88J34j7J45j19j3P0n7j01p3J32lJ4L7M0j22
$$ -8 -117 -52 -4 103 103 132 -76 -34 60 -28 -84 47 8 -11 80 -108 26 9 154 35 22 92 35 -66 -139 -7 -10 4 41 81 -41
3942d1M3J4j3l7m0Q2J4j3l1P7j4nJK6k1o0k9O8j5Q7p3j9R1o4m3n9J47j5K9m5o9N6j07Q6j53
$$ -41 2 16 3 -34 -74 8 22 9 -22 55 41 36 37 63 42 -18 -47 21 6 93 20 1 92 28 -15 -74 73 58 87 42 -27 29 -78 8 -145
3504a45J21K4M1J13j50K3pl8L1O1j50Q8O0l0k3q4M7J20K6j79j11J49J40n5j61J94j24j4k4
$$ -145 -24 0 41 154 4 27 20 -18 13 74 -76 12 72 42 19 -65 -18 102 128 -51 -162 -13 127 72 -89 105 -19 -33 -57
3141e7J83j52J14o8Ql1KJ8j37N9O6M2j33R7n2L2k09L34o9J06k14O9N4k3j09J0lj7p2R2OJ20
$$ -57 126 -26 88 20 28 -3 -1 17 -120 -61 5 47 -86 11 -41 -9 -218 116 47 153 -61 8 62 39 -70 -60 -63 -80 -152 -60 -54 66
2740F6J08j58k9M1O7k18R6J39l0J9n1n2M3j09M2k2J08o4j4n0kJ39p3k9N1Lj18P2L9K6j11k4
$$ 66 174 16 -13 28 95 -123 -27 112 82 101 50 -2 41 -68 -26 -48 60 -4 -18 -68 -70 69 -4 -33 18 21 -97 -25 14 40 -71 -95
2340i5L9P3J7m6J27q7j15J20k7n2o2J39N1k7%q5J9L2p7J02pj31K2J05o7M0m9k09q38J135%
$$ -95 -56 17 34 -12 115 28 -87 33 6 -46 -108 31 82 55 55 -30 -11 21 -56 46 39 -92 -70 35 -32 8 -41 -250 -1088 47 47
1952D7O3j65O1jj36R5M9L3l3Kr7P3RM3q8j10J03k4K3N7J01pk1o3j06J04mR6j39L9p4Q2jN6
$$ 47 110 -55 6 5 -131 -36 13 46 13 15 -82 -9 0 43 -45 -155 -52 -76 -53 4 105 98 77 14 -92 12 8 104 -35 4 -70 12 11 67
1526F7K4l62O41k92p5o6L6J9O8L2r2k8m8N8J57J02j33n8j10J30j6J6Q2q2k0l3j7%L2j01R4
$$ 67 91 -271 370 78 3 -63 -27 -8 60 92 0 -28 -76 -18 139 241 108 50 -60 70 54 70 152 70 50 17 0 0 32 -69 25
1138B5nJ32j74qQ6m0K6O0m5o2Q8n5n5jJ75j46N5MQ3j21l9J12j9p6J7p3m2J00J03j80J56j2
$$ 25 20 152 -22 -30 56 16 42 102 57 -5 83 28 -27 -28 147 1 56 60 143 22 -17 95 76 0 17 -56 -98 2 105 -75 81 69
737F9j43J13R0o4J6q3j5O9r2j17R3J83j33Q4j6Q1M5j47j9o9J01N6o0J8N7l6j99J96j42J42
$$ 69 -74 39 129 65 81 -2 -17 52 -40 -157 -64 119 -14 70 54 135 180 33 14 -55 46 102 42 60 117 81 -118 78 -64 78
361G8j03P2K2o8l2O5j21P4M3j07P2m8Q0J13q0k3j82J55J3K0m3LMQ6m2j12KN0r4J03L6Lo4P
$$ 78 -25 47 69 1 -31 34 -87 -13 30 -77 -5 -53 27 140 60 37 -145 10 23 43 0 3 7 93 51 -61 -59 -9 -103 0 36 39 -25 -18
-64a8n5N7O7q2J21j28J3n8J76n5Qr0M6k6N5NL5J6j34j4k2R2j0o7P8j8
$$ -18 -73 -16 51 -31 90 -38 -25 -83 93 38 46 -44 2 -24 31 36 71 87 -47 -61 -83 9 -1 -68 10 -8
-390h
##PAGE=	F1=-14496
##FIRST=	23151.189942674980557,	6007.9998942000029274,	0
##DATA TABLE=	(F2++(Y..Y)), PROFILE
6008c1J3M6K7n6p3K7R9J1M0k67J81j2m3j02L3L7R3R8o3l6j11O6J90j02L1o6Rm5P9J4n4l0k4
$$ -31 -18 28 55 -1 -74 -47 52 63 103 -164 17 5 -38 -140 -107 -70 23 121 58 22 -89 -23 167 65 96 30 39 -6 73 87 33 3 -21
5595b1L5O7M0p1m8r8J18o2l1J1M1l4O5j2J4N3LJ8N3k8n8Lk5j0J6k44J20Q8j24J84L3O7j62
$$ -21 14 81 121 50 2 -96 22 -40 -71 -60 -19 -53 12 0 14 67 70 88 141 113 55 58 33 23 39 -205 -85 3 -121 63 96 163 1
5182AJp8R8N0n4q2Q5L6m9j01P8Ro1%J19Jk5jM1J6j13r3Q6J16l1o0N6M3q7k6k8N9J9j16J73
$$ 1 2 -76 22 72 18 -64 21 57 8 -93 -15 -6 -67 -67 52 53 28 27 68 84 -29 -122 -36 80 49 -11 45 88 1 -25 -53 6 25 -91 82
4743H2L4k11N2O4O8m4oj43j5J26Nj27J25p3j53J04M0N5m3O1p3P0J60l9k17J06K7o7PP2p8O4
$$ 82 116 -95 -43 21 89 45 39 -104 -119 7 12 -115 10 -63 -216 -112 -72 -17 -60 1 -72 -2 158 119 -98 8 35 -32 -25 47 -31 33
4343C3j2r7M5L4O4L3Jj61K5J12q9o3J55p0m1P1j51J76m6Q1q0n3J50n2r2o9J06o1M7Q7K1k08
$$ 33 21 -76 -31 3 67 100 101 -60 -35 77 -12 -75 80 10 -31 40 -111 65 19 100 20 -33 117 65 -27 -96 10 -51 -4 83 104 -104
3942a04Q4L7M1j18mP6K9j1k4L0j5K5l0j3J4l0m9J21j9R3j01L1K0p1j0l9J52q1L1m2m8N7j02
$$ -104 -20 17 58 -60 -64 12 41 30 6 36 21 46 16 3 17 -13 -62 59 40 133 32 63 83 12 2 -37 115 34 65 23 -25 32 -70
3529g0N7o2Q7j2L1J37j07l0m7%K7N3j61J25O1j7k6m5RP1L2j91l4J24J16m3j85K07j50K5%J30
$$ -70 -13 -75 12 0 31 168 61 31 -16 -16 11 64 -97 28 89 72 46 1 10 81 113 -78 -112 12 128 85 -100 107 -43 -18 -18 112
3128A12j09P4n5JJ9n4Qj28Q3K7J11j78Q5k4M6k39L33j23J83j95M2M5n5p0kK7m1j06J21P3P8
$$ 112 3 77 22 23 42 -12 -4 -132 -49 -22 89 -89 -4 -28 18 -221 112 -11 172 -23 19 64 9 -61 -63 -36 -77 -183 -62 11 89
2740H9P5j69m1M3N5j10Q0J06l6K1n3j2K6j01k0mQ6n4J9l4k2J28p2j5P5l7q3kK6O0j15qK4Q7
$$ 89 164 -5 -46 -3 52 -58 22 128 92 113 60 48 74 -27 -47 -51 35 -19 0 -34 -56 72 0 -15 60 23 -60 -62 -36 24 -91 -99 -75 12
2315A2J4n6J45j13q7J15k7r4RO0R1j7n1J6m2L5r5R0J4j23O4O6o0O1k7k38q75J158L3kj12J7
$$ 12 26 -30 115 2 -85 30 3 -91 -82 -22 69 52 1 17 -25 10 -85 5 19 -104 -40 26 -34 27 0 -238 -1113 45 78 76 -36 -19
1914a9P3k03J09O1M7ln4p3R9o8J04r9j20J07j0j4O0J08km7m3j19J05%O2j38R5r9J65n9j7R1
$$ -19 54 -149 -40 21 68 65 11 -62 37 -31 73 -26 -146 -39 -49 -63 -3 105 103 56 13 -106 -1 -1 61 -77 18 -81 84 25 8 99
1513I9l89O20k72n8j3k9j9J11N5j45J1l9N2J66M7j40n1m8Q6J5J8N8p7n0j5OlL1j07Q9M9J05
$$ 99 -290 330 58 0 -13 -42 -61 50 105 -40 -29 -68 -16 150 197 57 6 -42 44 59 77 135 58 8 -7 -1 -4 27 -80 9 58 163
1113A63k03K6Q6n4J2M7m9p8J42o9k9j2J90j60O6K7N3j55mJ37n4r0K0j06l2J06J30j75J31j2
$$ 163 -40 -14 72 18 30 77 28 -50 92 23 -6 -18 172 12 78 105 158 3 -1 136 82 -8 12 -94 -126 -20 110 -65 66 54
737E4j45J34L2k1j5k5m0N7p0j56P9J90j16O2k3J17N4k00kj22J30J14o2J2J02j03r6J68j37
$$ 54 -91 43 75 54 39 14 -26 31 -39 -195 -116 74 -42 20 -3 114 168 -32 -34 -156 -26 88 26 38 140 37 -59 109 -28
374b8J40j17Q6Jo7m8L1j01O8P4j45P3l2N6J21k3n0j66J65l4ljj1J4P8J2r1o6N5r4J13L7L0
$$ -28 112 -5 81 82 15 -33 -2 -103 -35 39 -106 -33 -65 -9 112 89 39 -127 38 4 1 0 -11 3 81 93 2 -64 -9 -103 10 47 77
-39G7j19j7RL8M5o6J52j34l8j5K04r5M7j38K3J2P6j1m8R5j43M6p2J01l2k3K8j6
$$ 77 -42 -59 -50 -12 33 -33 119 -15 -53 -68 136 41 88 -50 -27 -15 61 50 2 97 -46 0 -72 29 -3 -26 2 -14
-390a4
##PAGE=	F1=-14590.4
##FIRST=	23151.189942674980557,	6007.9998942000029274,	0
##DATA TABLE=	(F2++(Y..Y)), PROFILE
6008e4K7N2K0o2o2N0M3L0N0k48K07%o7j39N1L5J12R7m9j23l3N4J91q9Qo2j8l6N6M5r9J1K3
$$ -54 -27 25 45 -17 -79 -29 14 44 94 -154 53 53 -14 -153 -102 -67 45 142 93 -30 -63 -9 182 93 101 39 21 -15 41 86 -13 -2 21
5595B1J2K0K0n2k4p7O0m9L6j5N8q3M3J9K9M8k7O9nk5nJ0n1Pj7k12Q0R4o9J53J5R8j82L9j70
$$ 21 33 53 73 21 -3 -80 -20 -69 -33 -48 10 -73 -30 -11 18 66 39 108 103 78 73 83 32 39 22 -190 -110 -16 -85 68 83 181 -1 38 -132
5157a32J47L0l3q9O4R1n0j16N2K9k7j8N4L6J7k1M9O5j56p3Q6R0o5o5M4N8r6Jm5R9J0j49J81
$$ -132 15 45 12 -77 -13 78 28 -88 -36 -7 -34 -52 2 38 55 34 83 148 -8 -81 5 95 30 -35 9 67 -29 -28 -73 26 36 -113 68
4743F8M5j95N4P6O9o6J3r6r6J34Pj19Q0j9j31P8K5P1k1Jl6L6J33L7j79J03rj16L4Q7p2O4O
$$ 68 113 -82 -28 48 117 51 64 -32 -128 6 13 -106 -26 -45 -176 -98 -73 -2 -23 -22 -58 -22 111 148 -31 72 63 -53 -19 68 -4 60 66
4330F6j00J6NM6M3k7o2k4R8m9o1J51j09m0L5q8J87l9nn5p3K00n3o1m3L7q8Q8J09pk36R1Q1
$$ 66 -34 -18 -13 33 76 49 -13 -37 61 12 -49 102 -7 -47 -12 -100 87 48 43 -12 -85 115 62 1 -42 -5 -93 -5 104 97 -139 -48 33
3917C3P1j88M0O0P1m2j2l1RL7n2o0N0lm2J47k4Q9j27P7o0n7L1nJ18j30L5l7j7O7r3J5M3K6
$$ 33 104 -84 -44 16 87 45 33 2 11 48 -4 -64 -14 -17 -59 88 64 153 26 103 43 -14 17 12 130 0 35 -2 -19 48 -45 -30 13 39
3491C9l5J5J39n5o6r2N4QM6j39J37M7%k5j6j1jM7j85L6J00P2k3j87J87j49P9nN3n3L6l7kM5
$$ 39 4 19 158 103 37 -55 -1 7 53 -86 51 98 98 73 57 46 45 92 -93 -57 43 115 92 -95 92 -57 22 17 70 17 53 16 14 59
3066E9q2pr4P9PJ58j92P8nK7k31K83j30K21j51ML6o0m8qN5n6j22J12J35J8O0j97l0M5K9K7
$$ 59 -23 -30 -124 -45 -38 120 -72 6 1 28 -203 80 -50 171 20 24 60 0 -48 -56 -1 -57 -179 -67 68 86 146 -51 -81 -36 -7 20
2665B0N3N4m3L2n6K9j1p9q2L1L8j3M2mm3J13n6j9J00p4n4o6K1P3j34K4J6R4j1k3J45j27o9
$$ 20 73 127 84 116 60 89 78 -1 -83 -52 -14 -27 15 11 -32 81 25 6 106 32 -22 -88 -67 6 -128 -104 -88 6 -5 -28 117 -10 -79
2252g9J07j4j23M9lJ18j4p1O8p6N0r8M4L1q3R0L3n2M9Nk49q52J102P3o3m7k9J23k44J05R8
$$ -79 28 14 -109 -60 -63 55 41 -30 38 -38 12 -86 -42 -11 -94 -4 29 -23 26 31 -218 -1070 32 105 42 -5 -34 89 -155 -50 48
1864D8L3K6r7m0J28j46J29r2j08Q0J5o5P5R1K0p6l1j04J01QK5j33J34r3J98q0p8J38m12O03
$$ 48 81 107 10 -30 98 -48 81 -11 -119 -39 -24 -89 -14 77 97 21 -10 -114 -13 -5 20 -113 21 -72 126 46 -32 106 -306 297
1488B97k51l2J3q0p3J60P2j62L1j9L9J51j4j20n9J1L7M6K9K6p0m3k0J9J3Rq7P6Q4Q2k06K5
$$ 297 46 14 27 -53 -126 34 106 -56 -25 -44 -5 146 132 12 -47 -36 1 47 76 102 32 -11 -31 -12 1 10 -77 -1 83 165 -41 -16
1088a6R6m8j5L7k5j16J93q7j3j2J85j38P0K6J4j74L8J39p6q1Nr6n6J22J32j64J09Lj45J23
$$ -16 80 32 17 54 29 -87 106 19 6 -6 179 41 111 137 151 -23 15 154 78 -3 2 -94 -150 -28 104 -60 49 52 -93 30
712C0l0O0n4jl9M2qk05M8J83r5L5k9J52N4k40M2j84J38J42o7M0J19j42mJ47j34J11j30J18
$$ 30 0 60 6 5 -34 8 0 -205 -157 26 -69 -34 -63 89 143 -97 -55 -239 -101 41 -26 14 133 -9 -13 134 0 111 -19 99
336I9%p7o4J3p6N0R6j63N6k3M2J34J0p8j24J62o9k6O3o1L1N5O0m7j39O8o6Q1L6N9j69l2O7
$$ 99 99 22 -42 -29 -105 -55 41 -122 -66 -89 -47 87 97 19 -105 57 -12 -38 25 -36 -5 50 110 63 -76 -8 -74 7 43 102 -67 -99 -32
-77c2L9K8p5J60j22q3L7K00j13O7j68RO2O7oj19J40j33J15j33R8l9J4j2j9
$$ -32 7 35 -40 120 -2 -85 -48 152 39 106 -62 -53 9 76 70 -49 91 -42 73 -60 38 -1 13 1 -18
-390a8
##PAGE=	F1=-14684.7
##FIRST=	23151.189942674980557,	6007.9998942000029274,	0
##DATA TABLE=	(F2++(Y..Y)), PROFILE
6008f7K0N5K6n6o5Q3mK8O6k27K35j6r4j11O3RJ25P9n8j63L3K7J70m1l0n5l5j6L2M6j36P9O0
$$ -67 -47 8 34 -22 -87 -4 -8 20 86 -141 94 78 -16 -127 -64 -55 70 149 91 -72 -39 -12 158 117 87 32 -3 -19 13 59 -77 2 62
5595F2lk9Pn6J3m5k5k2R8l9O9j12J2N7K4K9m5J25m5n1O4J9r6M8m6j49K6P7JR7j7J05j61O7
$$ 62 59 30 37 -19 -6 -51 -76 -98 0 -39 30 -82 -70 -13 11 40 -5 120 75 24 88 107 11 59 13 -136 -110 -33 -32 65 48 153 -8 59
5169E9k14J62Pnj04N2J36l3j28L2K1%k2k7R1O2n1O7Q0j70m1P9M3p4p7L8N9r7L4o1J01J5j50
$$ 59 -155 7 14 9 -95 -43 93 60 -68 -36 -15 -15 -37 -64 27 89 38 105 185 15 -26 53 96 22 -55 -17 42 -55 -21 -82 19 34 -116
4756a16J74L4j56N9P3O4q6N9n6j69J24J7j04K1M8j11N7pO4J1l9Jj2R5J01j13P4k4j49M2R8
$$ -116 58 92 -64 -5 68 132 46 105 49 -120 4 21 -83 -62 -14 -125 -68 -75 -11 0 -39 -38 -50 45 146 33 107 83 -66 -24 74
4368G4p9O7M8j03k4m0O8L7n1M5q0O2J2n4J25j40j8oj7J59np5n3o0K08o7j7jn8p5J22J06m8
$$ 74 -5 62 110 7 -17 -57 11 48 -3 42 -38 24 36 -18 107 -33 -51 -57 -74 85 80 5 -48 -108 100 33 16 15 -43 -118 4 110 62
3955F2k05P5J20Q3k34P5N3J19j01Lq0M3L3n9j00P3J2j3J33l2P5j33R9j11k4O1L2M5j35L1l4
$$ 62 -143 -68 52 135 -99 -24 29 148 47 50 -30 13 46 -13 -113 -40 -28 -41 92 60 135 2 101 -10 -34 27 59 104 -31 0 -34
3567c4J8Q1q4k0J28l2m3pJ17j5o6j22J01k4N3j02J24K1J6k0j9nn5N9j61Q2P9J2Qj64J43j38
$$ -34 -16 65 -19 -39 89 57 14 7 124 109 43 -79 22 -2 51 -51 73 94 110 90 71 66 11 70 -91 -9 70 82 90 -74 69 -69
3166f9J44k8j8rj0LQL4q7l2l8N1J2J77j75O3Moj91K03j06K20r0l8K9m4m0pO6n1j20P6J63l3
$$ -69 75 47 29 20 10 13 21 55 -32 -64 -102 -51 -39 138 -37 26 30 24 -167 36 -70 150 60 22 51 7 -33 -40 26 -25 -145 -69 94 61
2740F1O2k25pM8J2J40J1Qo1N5n6O2n6n9j16P2oJ8N5L7o2J03k4m2J06r0n0r4K9N6j50N3J5R2
$$ 61 123 -102 -109 -61 -49 91 102 110 49 104 48 110 54 -5 -121 -49 -55 -37 18 55 -7 96 72 30 136 46 -4 -98 -69 -13 -163 -110 -95 -3
2315cn2O0J16j19p7J00Nj19M5l0J12no3O0o9P7r6l0L8k0Q8L3n3QM0k46p32R44J06j02K0p3
$$ -3 -55 5 121 2 -75 25 30 -89 -44 -74 38 33 -30 30 -39 38 -58 -88 -50 -70 18 51 -2 6 46 -200 -932 12 118 16 36 -37
1914c7J36k32Q3J24OM3j16qJ45j89J10o6o9K5M2j21J01N4M1r0k5p2R4J5pj25J38m6J74n0j21
$$ -37 99 -133 -50 74 80 123 7 -1 144 -45 65 -1 -70 -45 -3 -124 -23 31 72 -18 -43 -115 -21 -6 -13 -138 0 -46 128 78 -43
1526d3J54m26N78k18nmj00j13J93Q3j50L5%K5J10n1p7q9N8oP6N0j4n5j3n1L0L2j1o4N9J00
$$ -43 111 -315 263 45 40 36 -64 -177 16 99 -51 -16 -16 9 119 68 -9 -98 -40 -46 30 80 66 11 -2 -53 -23 9 -2 -66 -7 93
1125I3N0j70qJ06k0l9J8K6j66K28r9noJ52q6O2Oj8j71Q1J05p7m7k7n2j00J35J18j55J11K2
$$ 93 143 -27 -35 71 51 12 30 56 -110 118 19 14 8 160 74 136 142 124 -47 34 139 62 15 -12 -64 -164 -29 89 -66 45 67
737F7j51R3p5J44q0k7k4M6O8k46RJ70p2nl1J78M9k61R7k25J22J36p8Q5J13j51N0J43j19M5
$$ 67 -84 9 -66 78 -2 -29 -53 -7 61 -185 -176 -6 -78 -83 -114 64 113 -148 -51 -276 -154 -18 -96 -11 102 -49 1 144 25 70
361G0j35J52J8r6o4%l4K4R5j56L4j4L3J42J2j04p2J54p5n1J26j16M9K7P2Nj95Q5j3J6M2P0
$$ 70 -65 87 105 9 -55 -55 -89 -65 30 -126 -92 -106 -73 69 81 -23 -95 59 -16 -67 59 -57 -8 19 91 96 -99 -14 -27 -11 31 101
-39A01k00j6R7N0K1j04J51r3j21Q5J66j07P0j72MJ07L7Qj49J38j07J70j87R0l2L3l4j9
$$ 101 -99 -115 -18 32 53 -51 100 7 -114 -29 137 30 100 -72 -68 39 76 84 -65 73 -34 136 -51 39 7 40 6 -13
-390a3
##PAGE=	F1=-14779.1
##FIRST=	23151.189942674980557,	6007.9998942000029274,	0
##DATA TABLE=	(F2++(Y..Y)), PROFILE
6008g2MN6L9n0p4J18k9%Q2j98K57n6j14l7N8k4J35M2p9j46O0jJ30K5n9o7k4KK4K4j50J30P1
$$ -72 -68 -12 27 -23 -97 21 -8 -8 74 -124 133 77 -37 -74 -16 -40 95 137 58 -88 -28 -29 101 126 67 0 -24 -22 2 26 -124 6 77
5595G7Po6J0p7M5j1j10J5J27n5P7j16j9Q7JRl4J59n8r6J13K8j33R5o5q5j2M9M9N2n6Q7j13
$$ 77 84 18 28 -49 -4 -15 -125 -110 17 -38 39 -77 -96 -9 -8 1 -33 126 68 -28 85 113 -20 75 10 -75 -87 -38 11 63 7 94 -19
5182a9R2k05J23j2K7j15M5J60lj29J9qMj4j01J56R8q7R0N6j40j2O7j1o1r0L5N8r2O2p4Q1K9
$$ -19 73 -132 -9 -21 6 -109 -64 96 93 -36 -17 -25 -21 -35 -136 20 118 31 121 177 37 25 92 81 20 -70 -35 23 -69 -7 -81 0 29
4769B9j19J44Pj09O4O4N6j01J10k6k10R4L6r0l9J01r5N1n0L3N2n2L7o8O2J28m6L3qj52M1J04
$$ 29 -90 54 61 -48 16 80 136 35 145 119 -91 3 39 -51 -90 11 -84 -33 -83 -50 2 -50 -13 -81 -19 109 63 96 88 -64 -23 81
4368H1j12P4R1q7o9q5J11L0p8J24j15K3O3m6Q9j39%m0M5J08K7r9o9j9J86r5K7M8j54l6J45
$$ 81 -31 43 134 47 -22 -107 4 34 -44 80 -35 -12 51 5 94 -45 -45 -85 -40 68 95 -4 -73 -92 94 -1 26 74 -80 -116 29
3980B9P9r4j42N3J33Q8k47Q9O5J47j59K0j02O3K0m6j22P9OK0R8n0N1j07R0j17J9O2O0l6r0
$$ 29 108 14 -128 -75 58 146 -101 -12 53 200 41 61 -41 22 42 -4 -126 -47 -41 -21 77 27 78 -29 61 -56 -37 25 85 49 -41
3592d1Ok4M0Q6p0l4J61n4m7k4P4J1m0j27J25o3P4o8R4kK8j4n1J0o0O2j28R9N9n5N1j18Q5j29
$$ -41 -35 -59 -19 67 -3 -37 124 70 23 -1 73 84 44 -83 42 -21 53 -15 79 77 105 91 40 50 -10 52 -76 23 82 27 78 -40 45 -84
3166h4J97n1n0J2p2O3L8qq0p1K9J7L7J63j35L0jj2j45J22o8J88l2o8K0j7m2KN8l7r7L5J43
$$ -84 113 62 12 24 -48 15 53 45 -35 -106 -77 -60 -23 140 5 35 34 22 -123 -1 -69 119 87 19 39 22 -20 -18 40 3 -94 -59 84
2753H4n5P1k33RN1K4J80l1j8q5Q4n6Q5r2n0j13R9j5QO2P0p0J02J5p3Q6p7q2p1N0J2j45O3J6
$$ 84 29 100 -133 -124 -73 -49 131 100 82 -3 81 25 110 18 -32 -145 -46 -61 -53 9 79 9 111 126 53 139 62 -20 -91 -41 -29 -174 -111 -95
2327i5P6q8J70N2p5j09Q5K2p9J3l1O9K1l9J3k5R6r9r9L1M5O3O2n9l8O3k41o16Q02J21j12P8
$$ -95 -19 -107 63 115 40 -69 16 38 -41 -28 -59 10 31 -8 5 -20 76 -23 -122 -91 -46 17 79 20 -18 45 -196 -812 -10 111 -1 77
1926G7j06J17j69N1J08j0M1j09J5J43j78N3l3mm3O0j69J25J3N1q2k0m1Q2K5m4j09J10L1J18
$$ 77 -29 88 -81 -30 78 68 109 0 15 158 -20 33 0 -4 -47 13 -156 -31 -18 33 -49 -69 -110 -28 -3 -47 -156 -46 -15 103
1551A03Qj42J43m31N45j78J6n7q2j18J93R5j31L5JJ5N6m9l0j22Q1l6J06Q2o3l0J6r9M6M1j2
$$ 103 111 -31 112 -319 226 48 64 7 -75 -193 0 95 -36 -1 0 15 71 22 -8 -130 -49 -85 21 103 40 10 26 -73 -27 14 2
1163Bn2M7J02kj08n0J06K3m9j1Q1k19K50j02LJJ02k6L2ql9j38J15L9o0lo3mj29J32J03j60
$$ 2 -50 -3 99 97 -11 -61 45 68 19 8 89 -130 120 18 21 22 124 98 130 122 83 -55 60 99 39 36 -27 -31 -160 -28 75 -85
762h5J44L2j61N8r0J95q2p7j1P0J16k55j7J42m4n9k0J83M7k63J36k26Q0J09p8J11J14j44N4
$$ -85 59 91 -70 -12 -102 93 11 -66 -77 -7 109 -146 -163 -21 -65 -124 -144 39 86 -177 -41 -267 -187 -78 -156 -45 69 -75 -21
399b1J49q5l8j30J66M9j13m1j2J5KP2j30K0KJ7J39qj24l4J54m9p7J59j47O4J0M1L4k13J00
$$ -21 128 43 5 -125 41 90 -23 -64 -76 -61 -59 13 -117 -97 -95 -78 61 53 -71 -105 49 0 -77 82 -65 -1 9 50 84 -129 -29
11b9M2n5O2N6k02K5R6N6K6j36J23m2j52J14J18q5O6j57jJ32NK5j38J00p7K00k09P2j3L2m4
$$ -29 13 -42 20 76 -126 -101 -5 51 77 -59 64 22 -130 -16 102 17 83 -74 -75 57 62 87 -51 49 -28 172 -37 35 22 54 10
-377A0q
-390B
##PAGE=	F1=-14873.4
##FIRST=	23151.189942674980557,	6007.9998942000029274,	0
##DATA TABLE=	(F2++(Y..Y)), PROFILE
6008g1pN4M9m9p6J37l6m2J02j60K62j13j22N7K8m5J42jj00q9M4j0Q0P5o0j03K3KL9j4j29J35
$$ -71 -78 -24 25 -24 -100 37 1 -41 61 -99 163 50 -72 -15 13 -32 110 109 9 -80 -36 -46 34 109 49 -54 -31 -29 10 -4 -133 2
5607BN9M3q9K1r8O2K4j79O1J12n9Q4j11l0R6k7qJ4J54n2j42J23L4j43J24o8m5j2K0N4M7r3
$$ 2 61 104 15 36 -62 0 24 -155 -94 18 -41 43 -68 -98 -2 -29 -37 -23 131 79 -63 60 94 -49 75 7 -38 -50 -30 24 71 -22
5207b2M1m7J13j59L9k9O3j08L3J62K6j10Kl4j1pj46K08J16j22J06J3p4MN0n2m0r5K9O5q6P9
$$ -22 19 -28 85 -74 -35 -64 -1 -109 -76 86 112 2 4 -30 -41 -48 -194 14 130 8 114 127 53 57 107 55 15 -80 -51 14 -72 7
4806Gq2O5L8o9Q9j9o2O3N1N4j11J38jk10M8O2p5r4J28p4N0q7qQ8m8P1j15L1J19j2J1L4j24
$$ 7 -75 -10 28 -41 48 29 -33 30 81 135 24 162 161 -49 -1 61 -14 -108 20 -54 -4 -91 -99 -11 -59 12 -103 -72 47 35 46 80 -44
4393d4M2J03j71R1J13n5j05j07J42L1j06J47j08lQ2l3M7r3no7R4N1L5p4q7L1J56j22O1Q4k24
$$ -44 -2 101 -70 21 134 79 -26 -133 9 40 -66 81 -27 -30 52 19 66 -27 -32 -99 -5 46 81 7 -80 -49 107 -15 46 130 -94
4005i4PJ48L4j19q3L3J12R8k23Q1R0J39j83K6q0M3J0k5j25P7j7L8P1p2J6n9O8q5N2L2P2q8
$$ -94 -87 61 95 -24 -107 -74 38 136 -87 -6 84 223 40 66 -14 29 39 14 -111 -34 -51 -13 58 -14 2 -57 11 -74 -22 10 82 -6
3604fj1m6oM0P7m6k5J31l0n1l5K9L1j3j12J23r0R0n7O2nL8j4q3Rj7N4r0R7K9j15J03o2L0j25
$$ -6 -17 -63 -69 -29 48 2 -23 108 78 27 -8 21 52 39 -73 50 -40 50 -7 55 50 88 74 -9 0 -17 37 -53 44 73 -42 61 -1 29 -96
3166i6K11n9k8Qj41J30P6o2o8j16Q5jO6J25q5j5k6K6j12N7j8J39mo9OJm4K2L2k1o2J5P7m2
$$ -96 115 56 28 36 -105 25 101 39 -29 -145 -60 -61 5 130 45 30 4 30 -82 -25 -43 96 92 23 29 30 -14 8 40 19 -43 -28 49 7
2740GP1k04NN2O3J36n6k6r6J02n5J00j06n0q7R4K0m3P4P8o3J05M8r7M7m4j39j4Q2l9j10M1
$$ 7 78 -126 -121 -69 -6 130 74 48 -48 54 -1 99 -7 -57 -144 -50 -30 -73 1 79 16 121 169 72 119 75 -64 -78 4 -35 -145 -104
2340a04J8N0j07K62l0%j43N4L2k1k3k7MO4j4l3L1R4j12j31J1R0L1J01o1o5P1k45n64P34J23
$$ -104 -86 -36 -143 119 89 89 -54 0 32 11 -12 -39 -35 29 15 -18 13 107 -5 -136 -125 -35 -4 97 36 -29 42 -203 -767 -33 90
1952I0j05J18j12P7p8J5N1kK3r1L6J19j26j3rO2r0O1j99J36k2N0n1j7k3O2M5r1q6O2J16O9
$$ 90 -15 103 -9 68 -10 5 56 54 77 -14 22 141 15 2 -7 55 -35 26 -173 -37 -59 -9 -60 -77 -100 -38 7 -84 -170 -108 8 77
1551G7N1j46J24m18N12j51K6j20m2q0J61J08j26L9j7LQj8Pj32P5m4J27J19j16MK7j41O6L3
$$ 77 128 -18 106 -312 200 49 75 -45 -87 -167 -6 102 -24 15 -2 1 9 -9 -2 -134 -59 -103 24 143 27 31 58 -83 -17 16
1175A6On2M4R8o7n0p2R3O0m0m8J17k59K62j00J9LN4K2k0Nn3p8J39m3m0K6p5J6j18J12R1j74
$$ 16 22 -30 14 112 45 -5 -77 16 76 36 -12 105 -154 108 8 27 30 84 106 86 91 38 -40 99 56 16 42 -33 -17 -135 -23 68 -106
762a06J86K5j57K8q7K01n9j07j3R6J07k20j5R1j4j17QJ63N2k47J38j89J0Q5m7J05J34j35J0
$$ -106 80 105 -52 -24 -111 90 31 -76 -89 7 114 -106 -121 -30 -44 -161 -153 10 62 -185 -47 -236 -226 -141 -188 -83 51 -84 -74
399g4J56l5j04j20J50Q6j16mj5M6nM2j00J7K0oJ24m0j24k1J61or6J40j36P3RrJ9j87J10P3
$$ -74 82 47 -57 -177 -27 59 -57 -61 -76 -30 -35 7 -93 -76 -56 -62 62 22 -102 -123 38 32 -64 76 -60 13 22 13 32 -155 -45 28
-2B8r7Q5L0j83O5Q1M6L7j50P9K0j63J14O8n5O7j34j4J33j3L2j01M4m8J98j82M1J3K1n6J5
$$ 28 -69 16 46 -137 -72 9 55 92 -58 21 41 -122 -8 60 5 72 -62 -76 57 44 76 -25 19 -29 169 -13 28 41 62 6 21
-390B1
##PAGE=	F1=-14967.8
##FIRST=	23151.189942674980557,	6007.9998942000029274,	0
##DATA TABLE=	(F2++(Y..Y)), PROFILE
6008f2j3N3M7n1n5J17l6p0J19j17K42j68j19J39j7m6J45l7j02k9KJ1L0Q1l1j42R1k7P5o1p6
$$ -62 -75 -22 25 -26 -81 36 0 -70 49 -68 174 6 -113 26 9 -37 108 71 -31 -60 -58 -47 -17 64 33 -109 -18 -45 30 -31 -107
5620a07J04L4R1j07K3j00O0O4k27J11O9o2R2j12oP7m4k8Q8J06l3j67R3L3j14J13n1l7K8oK0
$$ -107 -3 31 122 15 38 -62 -2 62 -165 -54 15 -47 45 -67 -73 4 -40 -68 20 126 93 -74 19 52 -62 51 0 -37 -9 -15 5
5232EQ6j24k0K9J18j08m7m6R3p9J7J44M0o9k4m0k8j6j52K29J14j48J08k9QPK4n9l2q6J5Q1
$$ 5 91 -33 -53 -24 94 -14 -61 -107 -14 -93 -76 68 108 39 15 -25 -53 -69 -221 8 122 -26 82 53 61 68 92 33 1 -85 -70 11
4831A1q2Q5q5P1K7j5K1l1j6M3L8N9j13J24K7j69j5J02n8j35J25l6L7j04m4J07m1J04j44jR4
$$ 11 -71 14 -71 0 27 12 33 2 -14 29 67 126 13 137 164 -5 -20 82 24 -111 14 -22 15 -89 -133 -26 -67 37 -107 -108 -14
4443a4l0K6Q2p9N2R3k37J17J09k7j18r4J37L9j30J22o7lO0j0Pj9l6q9J28PK2k3r4O9J31j27
$$ -14 -44 -18 64 -15 37 130 -107 10 119 92 -26 -120 17 56 -74 48 -19 -22 38 28 35 16 -20 -109 19 26 48 25 -69 0 131 4
4042DP5R1k50L9J27k2j06m4PP8J09j59M9J13R7j59J5k4qNrj21P8m1L8O7q6k0j2N2m3O6j5O7
$$ 4 79 170 -80 -41 86 64 -42 -86 -79 -1 108 -51 -2 111 208 49 64 40 32 37 28 -93 -15 -56 -18 49 -37 -57 -69 -17 -60 6 -9 58
3617E8r5O7j03J1J7N8qmN3K5n3l8mM8Jr7J05r1Q8p6L9K2M7k6q6j6M3L7m9Q8j0j60J62j9rj20
$$ 58 -37 30 -73 -62 -45 13 5 1 54 79 26 -12 -16 32 33 -64 41 -50 38 -38 1 23 70 44 -42 -58 -15 22 -27 61 51 -109 53 34 25 -95
3166i5J78n4K9rj86J79J02j06n3j49J15KR0O9l6n6o4Q7r4J5M1Q2j8l3j1Km7N4mj1k6K7pj0
$$ -95 83 29 58 49 -137 42 144 38 -15 -164 -49 -47 43 112 76 20 -44 43 -51 -36 5 87 69 36 25 27 -20 34 30 19 -7 20 13 3
2740CN5j39j9M5J11M4n4k8q0R3n6J17j06m8n5N4P9r9Q9O0m7J03O3j07J2j0j94M6J18p5n6m
$$ 3 58 -81 -100 -55 56 100 46 18 -62 31 -25 92 -14 -62 -117 -63 16 -83 6 66 19 122 185 78 90 80 -114 -68 50 -25 -81 -85
2340h5J2K6j06L00r8P9j54PL5L0m7l2o0J12Jm9Q3O4j33j12j5J09OJ20n4n2N9k48n49P01J14
$$ -85 -73 -47 -153 147 49 128 -26 -19 16 46 -1 -33 -93 19 20 -29 54 118 -15 -127 -142 -33 -27 93 39 -13 46 -202 -751 -50 64
1952F4r3J34q7L5jj4j7K8mp1N3P8o0n7j2J05r5M9j99J24m1L5prk3K6Q9j47o2J8J77N8M7j45
$$ 64 -29 105 18 53 52 38 21 49 45 -26 27 105 45 -12 -24 81 -14 35 -164 -40 -81 -46 -53 -62 -85 -59 30 -117 -179 -161 16 74 121 -24
1526b4J16l80M87j50K4j70Ok2J11J20j37M3n2qj9K1K8j02L9k8J28J49j59L6K4j54Q0J1K2m6
$$ -24 92 -288 199 49 73 -97 -91 -113 -2 118 -19 24 -28 -36 -55 -34 -6 -108 -69 -97 31 180 21 57 81 -73 7 18 40 -6
1150fN3Q5j20k7n8P3P1j6q2J22k75K64r9M4pL2M4q2M6o5kJ52j19l1K5m7jo8Q3Q1j85K07Kj24
$$ -6 47 132 12 -15 -73 0 71 55 -27 95 -180 84 -15 29 22 54 98 16 62 -3 -5 147 28 -3 22 -25 -26 -94 -11 70 -115 92 94 -30
725c0Qq5J65k2q1l0J04M6j52J2J2J6j65N8J25O6k24J04j44p9Q7K3P6J60j33n8J52J8j29j03
$$ -30 -22 -107 58 36 -45 -75 29 75 -77 -65 -53 -37 -202 -144 -19 47 -177 -73 -217 -296 -209 -186 -110 50 -83 -141 11 29 -100 -203
349b03J03J28r7K3JM1jK2o8J6L4l2J03p7r6l0J66L5j00P3q8P1K1m1l6j32J10O2q4R1J5j59
$$ -203 -100 28 -69 -46 -45 -4 -5 17 -51 -35 -1 -33 70 -7 -103 -133 33 68 -32 41 -47 24 45 4 -32 -164 -54 8 -76 15 30 -129
-52a29P9P5J6N1j40K4P3j38Q6K2j5P7j21l3J14j3K3o1qk4J73j09nM2J1p8M8
$$ -129 -50 25 41 92 -48 -24 49 -89 -3 19 4 81 -40 -73 41 28 51 -10 -18 -42 131 22 17 59 70 -8 40
-390D0
##PAGE=	F1=-15062.1
##FIRST=	23151.189942674980557,	6007.9998942000029274,	0
##DATA TABLE=	(F2++(Y..Y)), PROFILE
6008d4k4N9K7m3j5O2m0o7J32q7K03k01j10J87n8l9J40n2p9Ll8O1k1M9Qj52J46p9J25j07j0
$$ -44 -68 -9 18 -25 -40 22 -18 -85 47 -40 163 -38 -148 39 -19 -58 82 30 -49 -46 -84 -23 -44 5 13 -139 7 -72 53 -54 -64
5620f4O4J0J28j28Pp3M0J03k49J51K8p1R6j27N6K9m3m5J52L9qj63M7K8o2N7j4n1Q9k7l1J47
$$ -64 0 10 138 10 17 -56 -16 87 -162 -11 17 -54 42 -85 -29 0 -43 -88 64 103 95 -68 -21 7 -55 2 -12 -63 26 -1 -32 115
5219A15j41p8R9R2o6r4o7J14m4OJ15L9j8o4j8l2m2j27K11J00j60J04n9P8Krk9m8o9jJ02p8
$$ 115 -26 -104 -5 87 21 -73 -140 -26 -70 -64 51 90 72 8 -10 -42 -84 -211 0 100 -60 44 -15 63 65 56 27 -21 -90 -91 11 -67
4819f7P3p7R9qK3l3k9K1J0L0O3j07Q1N1j05p6J48l3j61J02K3Lr4o4J03n2J32j51l6Q0q8O6
$$ -67 6 -71 28 20 43 10 -19 2 12 42 105 -2 79 130 25 -51 97 64 -97 5 28 31 -63 -127 -24 -76 56 -95 -131 -51 -139 -73
4418g3J18l6O8P5k83J45Q6j7j09n3R9M9j46P7j4J9J1K4k7N0p7j13J55j8KK1p1O9J19j00O1
$$ -73 45 9 77 152 -131 14 100 83 -26 -79 20 69 -77 0 -14 5 16 40 13 63 -14 -127 28 10 12 33 -38 31 150 50 111
4030A11P2k31N8Q2p1o0k5k7M9J14o6jJ14M5j07rM4o1Pj6j18Q7m5L0P6q3m0NN5qN8n8M9o3J13
$$ 111 183 -48 10 92 21 -39 -64 -91 -42 72 6 5 119 164 57 48 92 31 38 22 -96 -9 -54 -24 52 -31 -71 -66 -11 -19 39 -19 30 -33 80
3592H0j41J2j7M5K9K2l3P2m7l4k4N9Qr8R4p0O9j21K9P1N3n0m3n8P9J5jQ1n5j76K15ok5j11
$$ 80 -61 -49 -66 -21 8 30 -3 69 22 -12 -36 23 31 -67 27 -43 26 -95 -66 5 58 8 -35 -93 -14 1 0 81 26 -150 65 59 34 -77
3166g7J19m4P9k6j87J98R9j20l5j61J15J8R8J4Lp4j02J32q6oJ01K5o0K5k5mn2R0m3nqP5q0
$$ -77 42 -2 77 51 -136 62 161 41 6 -155 -40 -22 76 90 93 19 -83 49 -37 -43 58 83 23 48 23 19 -33 57 14 9 1 76 -4
2753dK2K6o7m5K9J46m9k6l5l7N4n6J39j05l5l3pJ34j24J02K6l1R3M9j05LPk15P4J48p7om9
$$ -4 18 44 -23 -68 -39 107 58 32 -3 -40 14 -42 97 -8 -43 -76 -83 51 -73 29 55 24 117 166 61 64 71 -144 -70 78 1 -5 -54
2340e4j1J7q8K72j29J35j33l8K7N9n7m4j07J50Lk5J11K8j52o1l5J03JJ04n3KK9k42n22O52
$$ -54 -65 -48 -136 136 7 142 9 -29 -2 57 0 -44 -151 -1 2 -23 88 116 -36 -97 -132 -29 -28 76 23 25 54 -188 -710 -58
1964e8R8q3J31m1%M2l4o3O6l1n4O7K7qo8l5J01n5L4j65R1m7J1L8Ll4k7J57j93m3oJ92Q3Jj47
$$ -58 40 -43 88 47 47 89 55 -8 58 27 -27 40 67 59 -9 -44 57 2 36 -129 -38 -85 -74 -36 -33 -67 -94 63 -130 -173 -179 13 96 97 -50
1526e0J24l14M63j62Oj90M0K8N9J27j53M2q6k1k4N0M1m0k4PJ05J55j67N0K6j27P6j9J7k0O2
$$ -50 74 -240 223 61 67 -123 -83 -55 4 131 -22 20 -66 -87 -111 -61 -20 -60 -84 -77 28 183 16 66 92 -35 41 22 39 19 81
1138H1O9j38m9j2N2N4J1r8R6k57K42j03P6k6L8M2j25Q8q3P6J51j67l8jJ6l9oN6O9j77J86k5
$$ 81 150 12 -37 -49 3 57 68 -30 66 -191 51 -52 24 -2 36 78 -47 41 -42 34 185 18 -20 -21 -5 -44 -50 6 75 -102 84 59
737E9o4lr5J06J0%m7P6k8p6M7q3M2j92J20R4Q4k08N6j28j67J18J25M7J51j23j27J39N9j10
$$ 59 -5 -8 -103 3 13 13 -34 42 14 -62 -15 -98 -56 -248 -128 -34 50 -158 -102 -230 -397 -279 -154 -107 44 -79 -206 -67 -8 -118
361a18q3M4J68o4K3M3mMK5l6KM3m9Q2j21l3n0J64M9q2j4k6N6L7l3j02p9J03J7k3O8J7j32N3
$$ -118 -201 -157 11 -53 -30 13 9 13 38 2 4 47 -2 80 -41 -74 -124 40 89 7 -7 -33 23 60 27 -75 -154 -51 -34 -57 11 28 -104 -51
-64e1R7k7O4j18k8R5o9L8j7L8Q9j23n3Q8jol1m3lJ35j8n6P1Pj04P9
$$ -51 46 19 83 -35 -63 32 -37 1 -16 22 111 -12 -65 23 22 16 -15 -58 -61 74 56 0 71 78 -26 53
-390E3
##PAGE=	F1=-15156.5
##FIRST=	23151.189942674980557,	6007.9998942000029274,	0
##DATA TABLE=	(F2++(Y..Y)), PROFILE
6008a8m7P2oj8K8rm2l8J33q2J60k06q5J83p4l8J21l9l2j2n3J16o4ML8j21J59j30J74j45M3
$$ -18 -65 7 1 -17 11 2 -40 -78 55 -27 133 -73 -158 25 -49 -87 34 -5 -37 -49 -102 14 -50 -46 -8 -129 30 -100 74 -71 -28
5620b8M9qJ34j49j8j7LJ21k43J66J6q8R4j44J26l8k5n3J72j4L1j43OK7j3j9L7p3J42m7p0J91
$$ -28 21 13 147 -2 -20 -37 -34 87 -156 10 26 -62 32 -112 14 -24 -49 -102 70 56 87 -56 -50 -23 -36 -55 -18 -91 51 4 -66 125
5219A25j33j12J41L1k7q6r5J27k2NQ5L7K5j13K2j6p9q6J57Q8j54J03q7J26km2J7q4n0nJ19
$$ 125 -8 -120 21 52 25 -61 -156 -29 -51 -46 39 76 101 -12 10 -6 -85 -171 -14 74 -80 23 -64 62 60 18 35 -49 -99 -104 15
4831A5p6N1o3J32n1L3n6k5M9l0L3N8r5L7O0l7j09J83j4j66P2R5m9o1o5P4q6J54j39o9R2j52
$$ 15 -61 -10 -73 59 8 41 -15 -40 9 -21 12 70 -25 12 72 35 -74 109 95 -71 1 96 47 -14 -79 -5 -91 63 -76 -145 -53 -205
4430b05J04J25oP3N9k85J58N9k5q3pM6N7j55M4K6N4m5O0m2P7j01j44J76k1oL2j6L3J06n2K6
$$ -205 -101 24 18 91 150 -135 23 82 57 -26 -33 13 70 -85 -41 -15 39 -6 54 12 89 -12 -156 20 -1 -7 25 9 42 148 96 122
4030A22M4j84P9K1j01nj3o3L7J06L1o2R2Ro5l7R5p9J1m5j15J02k4K7P1n6l4j8P9J1L4q4K9
$$ 122 166 -18 61 82 -19 -24 -37 -100 -63 43 74 12 104 113 48 11 106 27 38 -7 -122 -20 -44 -17 54 -2 -36 -54 25 36 70 -14 15
3617A5k3J15j42ln2M6N3M5q4Q1m0j6l1N0J9j16J06m8N3j78K9J15O0p5K8r2O3lN1P4r2j64K49
$$ 15 -8 107 -35 -38 -90 -44 9 54 -30 51 11 -5 -36 14 33 -83 23 -25 28 -150 -121 -6 54 -21 7 -85 -22 -25 26 100 8 -156 93
3204I3k4j4j03O9m2R4l9j39J83O9j03j9j46R1L0Q9k1K6p0j14J26p6j3J44k0j03P6k8Mn9J07
$$ 93 69 55 -48 21 -21 73 34 -105 78 147 44 25 -121 -30 0 89 68 94 24 -90 36 -40 -53 91 71 -32 44 16 20 -39 68
2815F8p4Kj0J31j19M1Jl0m4QJ48j01J1m6J4Mn9J69j17j3j9o4J57j01J05j2k0Q1Kr3K7mj81
$$ 68 -6 -4 -14 117 -2 39 40 10 -34 -26 122 21 32 -14 0 4 -55 114 -3 -16 -35 -99 58 -43 62 50 30 111 113 20 47 43 -138
2402a38N2J64m5J3o3n2L0o4J95j17J51q3o4OO3n6n5j26J64KJ9J12Pj59j2m1Q5J1N9n9P2j3
$$ -138 -86 78 33 46 -17 -69 -39 -103 92 -25 126 43 -21 -15 48 -8 -63 -189 -25 -23 -4 108 115 -44 -56 -97 -12 -1 58 -1 71 58
2002E8k25m95O07Q1q0J17%j5N5n2p3R9n0l8P5k9K0n1o5N5RK4j05N1m7k0P8J4m7q7K32k09l0
$$ 58 -167 -662 -55 26 -54 63 63 48 103 51 -22 77 27 -11 64 35 55 4 -61 -6 3 27 -78 -27 -74 -94 -16 -2 -49 -136 96 -113 -143
1588a43oJ59J18n4j56J42k36M30j61k2j80M9M6J5J20j48L1j07l3j0O3N4K3j03N7N5J37j25
$$ -143 -149 10 128 74 -82 60 -176 254 93 71 -109 -60 -14 1 121 -27 4 -103 -136 -146 -83 -29 -6 -109 -52 3 140 15
1238A5L2M0o5N3m7j2K5O3N1j13j01M9L5J6L7j00N8k01J82j10J05n2N9K8j25J00j01J45J30
$$ 15 47 87 22 75 28 16 41 104 155 42 -59 -10 25 41 78 -22 36 -165 17 -93 12 -40 19 47 -78 22 -79 66 196
875A96j81m9m5Q7n8K9N0M7j43J26m4lmj11M7K9R9n7K0p0k1O7j66N9j90J76Q4R3k07K6j54k34
$$ 196 15 -34 -79 8 -50 -21 29 76 -67 59 15 12 8 -103 -56 -27 72 15 35 -35 -56 11 -155 -96 -286 -110 -26 67 -140 -114 -268 -502
474e02J64K22N1P8r5j76J24Q5p2n5j2J99l6KR5p0ON0mk5M9o0O7j66N0o8J54K5l8r0K6L4M7
$$ -502 -338 -116 -65 13 -82 -258 -134 -49 -121 -176 -188 11 -25 -23 72 2 8 58 54 29 78 18 85 -81 -31 -99 55 80 42 -48 -22 12 59
61E9Oj40n7R5m2N8K2K6r9kJ49p3Q0j08o3P5L1j2m8J00Q7j35o5O9J2m6j4n0OR9N7r7R5Nj18
$$ 59 65 -75 -132 -37 -79 -21 1 27 -72 -74 75 2 82 -26 -89 -14 17 5 -43 57 144 9 -56 13 25 -21 -35 -85 -79 20 77 -20 75 80 -38
-377c8R9
$$ -38 61
-390F1
##PAGE=	F1=-15250.8
##FIRST=	23151.189942674980557,	6007.9998942000029274,	0
##DATA TABLE=	(F2++(Y..Y)), PROFILE
6008A4q1Q2l8K1N7o9k6j3J16r7J26j79m2J28n8m7Q1oL1p0l6J57r4k8M2n9J25j54K08j68O6
$$ 14 -67 15 -23 -2 55 -14 -40 -53 63 -34 92 -87 -129 -1 -59 -106 -25 -31 0 -70 -106 51 -43 -71 -29 -88 37 -117 91 -77 -11
5620a1O5k0J05j54l3N0m5R9k01J47L4j06Q8j47J67j11Lm1J33k6Q1j24j9L4J4q0R2r5J67o4
$$ -11 54 34 139 -15 -48 2 -43 56 -145 2 36 -70 18 -129 38 -73 -70 -111 22 -4 77 -47 -66 -32 -18 -98 -6 -101 66 2
5244Bq5J88r6j08J47n5J2l6j24J34j9OO4N1M7j71P3J0j14m5P4R2j27J13j23J50ko3N6j25m0
$$ 2 -83 105 9 -99 48 -7 5 -31 -155 -21 -40 -34 30 81 128 -43 30 40 -74 -119 -45 47 -80 33 -90 60 58 -5 51 -74 -114
4856a14J5J23p5K4m2J45q1J7m8k2N7o2N0M2q2J9M3J6r4J85pj53M4J59r3k5m8K5j32J70j22
$$ -114 -99 24 -51 -27 -69 76 -5 12 -36 -58 -1 -63 -13 29 -53 -34 9 25 -69 116 109 -44 0 159 66 41 -7 18 -114 56 -66
4468f6q4J16j78J12J01PO4N0k39J41L7l7m8K3nO8j56K9N0P4q5Q7k8M8q8j80J88nlJ2N8k4Q2
$$ -66 -150 -34 -212 -100 1 8 72 122 -117 24 61 24 -24 -1 -6 62 -94 -65 -15 59 -26 61 33 81 -7 -187 1 -4 -7 5 63 39 121
4055A21j0j0K6j29J03l2j05K8Mq4K6R4R7j18O0Qo4n7J10m8J2q1j05J11J7L3L5j0qp0J18K0
$$ 121 111 101 127 -2 101 69 -36 -8 -4 -88 -62 32 129 11 71 79 15 -42 68 20 32 -49 -154 -43 -26 7 42 32 24 -46 72 92
3654I2Jr3J5LQ2j06k7p8O1N1O9q2L8l7K0l1K1K8j28J36m2N5k21K5J31P2r5R9j03%qR6O6j12
$$ 92 93 0 15 18 100 -6 -33 -111 -50 1 70 -12 26 -11 9 -22 -1 27 -101 35 -7 48 -173 -148 -17 55 -40 59 -44 -44 -52 44 110 -2
3229bj31K52n7J6r9M7m3P4m8p7J49L3o7j5j04N3K6O8k2J9m9r1P6o3j4J55l9j23R6j4L0o1Q8
$$ -2 -133 119 62 78 -21 26 -17 57 9 -68 81 114 47 32 -72 -19 7 75 53 72 23 -68 8 -55 -69 86 47 -76 20 6 36 -25 63
2815F3q6Ok3J67j20M9j5m1qj2J19j06L8m8M8l1p2K04j41Olr8J42m9R8m2j6P5o3p2O9l8j05
$$ 63 -23 -17 -40 127 7 56 41 0 -8 -20 99 -7 31 -17 31 0 -72 132 -9 -3 -6 -104 38 -11 87 45 29 104 41 -31 38 0 -105
2402a05mJ59%Kl4j06O1m1J03q3J32j7o5k2M6m3o2j13J52JO0Q9J1j45Rl6O6K0J2p0J28n8k00
$$ -105 -109 50 50 52 18 -88 -27 -68 35 -48 84 67 2 -20 26 -17 -79 -192 -40 -39 21 110 121 -24 -15 -51 15 35 47 -23 105 47 -153
1989a53m95O00P2q7J04J6kN4o9o1J16n3k4P4p7K5k3q5j2O5K9m1J9m8m9J07J4n0j40K89j90
$$ -153 -648 -48 24 -63 41 57 55 109 40 -21 95 42 18 92 15 40 17 -68 -80 -15 14 -27 -8 -56 -105 2 16 -34 -174 115 -75
1601g5j6RR8J37q8j67J56j71L87j26n7j47L4L1k3J00j14K4j17l9J1O2P5N1j71J09rJ00m5j3
$$ -75 -91 -82 16 153 65 -102 54 -117 270 144 87 -60 -26 5 -18 82 -32 -8 -125 -164 -153 -91 -16 35 -136 -27 -36 64 19 6
1225FN7J5K2o3m9O5N5L3n9j54J02K1k3N9r1K2j15Q5j15J19p4P8J5p9O8j13J88R4j64m9q7J31
$$ 6 63 78 100 37 -12 53 108 141 82 -72 30 51 28 87 -4 18 -97 -12 -127 -8 -82 -4 11 -68 0 -113 75 169 5 -44 -131 0
825@l7J7P5J1q6M7m3L1Jj17NL5J66n2m1o9jO6k11O8j64J98Q4Q1j98L3k10k69J96K74J06m4
$$ 0 -37 -20 55 66 -20 27 -16 15 16 -101 -96 -61 105 53 12 -57 -58 8 -203 -135 -299 -101 -17 64 -134 -101 -311 -580 -384 -110 -4 -48
424d8m3k01J18J00m0k6n3K14l0k2J35j33J1R3J4n8O1p2N8j92J24q4J48k9J7j28N5J8M1M1j28
$$ -48 -91 -292 -174 -74 -114 -140 -193 21 -9 -31 104 -29 -18 75 89 31 92 20 78 -114 10 -74 74 45 62 -66 -11 7 48 89 -39
36c9o7Q7q7J21k7K1n0o5K14j07R7j20p8K3J31m7n9J54N7j39p0O3J7q3%k8j2Q5Q9j14J03lj02
$$ -39 -106 -19 -106 15 -12 9 -41 -106 108 1 98 -22 -100 -77 54 7 -52 102 159 20 -50 13 30 -53 -53 -81 -93 -8 81 -33 70 67 -35
-377c5R7
$$ -35 62
-390F2
##PAGE=	F1=-15345.2
##FIRST=	23151.189942674980557,	6007.9998942000029274,	0
##DATA TABLE=	(F2++(Y..Y)), PROFILE
6008D6j15P8n6O2O0r9K0j8Q4j18J07j33J3M8k6n0J9L2R2j41MJ61j01k9J9oO7j34K15j70N5
$$ 46 -69 9 -47 15 75 -24 -4 -22 62 -56 51 -82 -69 -21 -47 -97 -78 -46 46 -95 -91 70 -31 -60 -41 -47 20 -114 101 -69 -14
5620a4R9l1N4j24l1J12r7L4j24R4O4j11Q4j22J45j61K7j1N6JJ30j18l3N3J1r3J33j11J56p3
$$ -14 85 54 108 -16 -47 65 -32 2 -122 -28 36 -75 9 -113 32 -129 -102 -113 -57 -56 74 -44 -77 -24 -13 -106 27 -84 72 -1
5244aq3J42m0p8J28j39M8K6j43J32k1oN2R0M3k29J25L4j46lk1J07q4J32j66J55Ko9P8j50m3
$$ -1 -84 58 18 -60 68 -71 -23 3 -140 -8 -29 -35 17 107 150 -79 46 80 -66 -69 -90 17 -67 65 -101 54 56 -13 65 -85 -128
4856a28N9J04p1Jk4J32q8pl1j4M5p6P1K5p8K7J7L6l5J52j3j30K5J89j09Nk7k7j73J77j05p1
$$ -128 -69 35 -36 -35 -59 73 -15 -22 -53 -67 -22 -98 -27 -2 -80 -53 -36 0 -35 117 104 -26 -1 188 79 84 57 30 -143 34 -71 -142
4456a42J25j47Q3O2NM8M4j59R4J6l5j1K5m6R1j51K5O5O3r7Q9K1k1l6k16J86K0Nj8J16p3M3
$$ -142 -17 -164 -81 -19 -14 34 78 -81 13 29 -6 -17 8 -38 53 -98 -73 -8 55 -42 47 68 47 11 -205 -19 1 6 -12 104 31 74
4055G4Qk7K4q1J24n5q8K2K5p4lR1J08j51L8L7j03o9J00RNr6q7J08O2L6k1M3K2j24J51K4l5
$$ 74 82 55 79 -2 122 67 -21 1 26 -48 -51 40 148 -3 35 72 -31 -100 0 9 14 -82 -169 -61 1 37 16 59 81 -43 108 132 97
3642I7q8J2J6L4n9m0r2P8L2Q6l8l7m7P2k5j7J5j12J70o5Q6k30MJ16Q5r8J36q8p6NJ17N5j20
$$ 97 9 21 37 71 12 -28 -120 -42 -10 76 38 1 -46 26 1 -16 -1 -113 57 -8 78 -152 -148 -32 53 -45 91 3 -73 -68 49 104 -16
3229a6q5K23q3N5r8M6l8M5n3m0J14J0l4k0m6J2J2L6J1k2k8l9K1n3j5J34l2j12Q1J4O3n2K5
$$ -16 -101 122 39 94 -4 42 4 49 -4 -44 70 80 46 26 -20 -8 4 40 51 29 1 -38 -17 -70 -85 49 17 -95 -14 0 63 11 36
2815C6o3Ml4J58r8N6j6r2N5k4O9q2M5k8M6l1r8K34j60RJ8r8J03qR2o3j7Q1j24l9J07q2j6p0
$$ 36 -27 -23 -57 101 3 59 43 -49 6 -18 51 -31 14 -14 32 1 -97 137 -23 -14 4 -94 9 1 93 30 13 94 -30 -69 38 -44 -60 -130
2390a30J37L5k7K9j64R7k1L0n8J06M5n1m5J7j6p0o9J14NQ7M9L1j20Ol0N8J3j8o7J44r3j67
$$ -130 7 42 15 44 -120 -23 -44 -14 -72 34 79 28 -17 0 -16 -86 -155 -41 -36 51 100 131 11 17 -13 45 58 40 -27 117 24 -143
1989a43n20O17P9j02R6OL1N5q0n4J14l3j7O4j08K4pq5o8Q5M8PJm9o5J26qm2j65L03j45%K6
$$ -143 -663 -46 33 -69 27 33 64 119 39 -15 99 66 49 113 5 29 22 -63 -131 -46 2 9 10 -39 -104 22 14 -28 -193 110 -35 -35 -9
1576iL7J34r2j64J47j35L37n9r0r8NMo7P7o2L3j29k8K6N1J00L3k02J47o7O0L7o5N6R4mn8p6
$$ -9 28 162 70 -94 53 -82 255 196 106 8 13 17 -50 27 -35 -2 -131 -159 -133 -82 18 51 -151 -4 -71 -11 26 -39 17 111 107 49 -27
1163b7Q0M7J5kj84J30Om1P1p7rj7k3j10J07q2P5J8rJ0j13J96N1j29l1j09J26K6l8J19l2k0
$$ -27 53 100 115 113 -71 59 65 24 95 18 9 -8 -31 -141 -34 -116 -41 -23 -32 -22 -135 61 112 -17 -48 -157 -31 -5 -43 76 44 24
762B4k4k7K8Lj00pM1J67m6p1m8j0N7k07O6j27J68N0M4j35P4k64k69J80K54K19j59J7k02J15
$$ 24 0 -27 1 4 -96 -103 -62 105 59 -12 -60 -70 -13 -220 -154 -281 -113 -63 -19 -154 -80 -344 -613 -433 -179 40 -119 -102 -304 -189
387a89J16k7lq0K12n1k6J41j71L3J38Op7P3r4N8j85J63r9J54r2O7j24O0K4J2L9p3q5P5j01
$$ -189 -73 -100 -103 -183 29 -22 -48 93 -78 -45 93 99 22 95 1 59 -126 37 -62 92 0 67 -57 3 27 39 78 5 -80 -5 -106
-2a06J44o0oJ0j11K65j20J11j43q6l1J96n3m5J78%j19p6P0J1j05K0J4n8R6P9j06R1k1n6P2
$$ -106 38 -22 -28 -18 -129 136 16 127 -16 -102 -133 63 10 -35 143 143 24 -52 18 29 -76 -56 -42 -100 -4 75 -31 60 39 -17 55
-390E5
##PAGE=	F1=-15439.5
##FIRST=	23151.189942674980557,	6007.9998942000029274,	0
##DATA TABLE=	(F2++(Y..Y)), PROFILE
6008G1j34N6n4R3L8r9Q0n3N6j39J01p9O0j7j0l0m6N4J37j98N3J30q4j3j3QJ9q2J94j49K0J32
$$ 71 -63 -7 -61 32 70 -29 51 -2 54 -85 16 -63 -3 -20 -30 -60 -106 -52 85 -113 -60 70 -14 -27 -40 -32 -13 -95 99 -50 -30 102
5607A02m4Jn7j5J48j44n1k5K5Q2r7Q4o6O5j76L4K6j6M3J57j21m3P4qn4J53j27J23p9p4Q0J2
$$ 102 58 59 2 -13 135 -9 -60 -85 -60 22 -75 9 -57 8 -168 -134 -108 -124 -81 76 -45 -88 -14 -22 -76 77 -50 73 -6 -80 0 12
5207A2l8J06j95O8P6j39J09jm4M6J39J8k70J70M7j78M1j05J20l2J46j97J46Kn7Q1j47n6J10
$$ 12 -26 80 -115 -47 29 -110 -1 -2 -46 0 139 157 -113 57 104 -74 -33 -138 -18 -50 96 -101 45 47 -10 71 -76 -132 -22
4844b2O1n2k2j0J00p6k4k6OK7p3P9K2q5M0%J9M3J00j8j09J2J77r0K0j0p3j83J69q6l3J02p7
$$ -22 39 -13 -35 -45 55 -21 -45 -71 -65 -38 -111 -32 -10 -95 -55 -55 -36 7 107 89 -20 -8 169 79 99 89 16 -167 2 -84 -117 -15 -92
4430i2K9L0pM7K8p4L6j0j7K5Rp8J23j34RP9K6q4O8Q9r8M5k43J57M5Rl0J28r2n%j1K2l9J27
$$ -92 -63 -33 -40 7 35 -39 -3 -13 -30 -5 4 -74 49 -85 -76 3 29 -55 13 102 4 49 -194 -37 8 17 -13 115 23 18 18 7 29 -10 117
3992A17m1o4nM2m0n5J06O1j51L8P5j53o8P7N5op9o5Q9R6K4o9R1L5j51J61K8p4o5J3L0j0k6
$$ 117 76 12 7 49 9 -46 60 121 -30 8 83 -70 -138 -61 -6 -12 -91 -156 -67 29 53 -16 75 110 -41 120 148 74 9 22 52 42 16
3579A6l5r8Q7J5Q9J8j09o7J17nm2l7o2J86j07J30j88m3R0Q8q5J27m9j31K6J09M6j30l5J70
$$ 16 -19 -117 -30 -15 74 92 -17 -84 33 28 -14 -51 -113 73 -34 96 -92 -135 -45 43 -42 85 36 -95 -69 40 86 -44 -79 91
3204I1q6Q7r1M6k2M1o5m6R9Lk0j9Rk7JkO4q5k0K4mn2k2R9j0q0N0M5Q0l1n9j2ol1J00p2P2o
$$ 91 5 92 1 47 25 66 1 -45 54 57 37 18 27 0 1 -1 63 -22 -42 -18 -22 -74 -96 3 -7 -87 -37 8 88 57 -2 -14 -20 -51 49 -23 49 43
2728D3j46J14k9J6n4L8J5Qjj27K41j53qM2o9N6KR2p2l0J01j55MJ22j21N2j16J05M2m1Q8k20
$$ 43 -103 11 -18 -2 -56 -18 -3 5 4 -123 118 -35 -43 -1 -70 -14 -12 80 8 -22 79 -76 -72 50 -71 -19 -135 -30 12 -29 59 -161
2327a61J27ono0J00R0m2n2j5K0p8rO3NJ06LM3r1ll2N9j3k3l5J19j10j26n32O00J05j17R0r
$$ -161 -34 -40 -45 -105 -5 85 43 -9 -24 -4 -82 -91 -28 -23 83 86 129 38 35 3 62 49 26 -9 110 0 -126 -658 -58 47 -70 20 11
1914A1N9N8p2o2Q4J0k4O3j25L0qp4r8P5P2K4ql9o3J35m9k8j61K73r2J1L3oJ28p8j38J07j30
$$ 11 70 128 56 -6 78 88 64 127 2 32 24 -50 -148 -73 -1 23 15 -24 -87 48 -1 -29 -190 83 -9 2 35 29 157 79 -59 48 -82
1501h2K94J2j11l9k3j2j13N6j5N9j51OK1L3J20j1j81J52r6K4Q3r6L3J48j5l0q7O6M6kM0j86
$$ -82 212 224 113 74 51 39 -74 -18 -33 26 -125 -119 -98 -65 55 44 -137 15 -81 -57 26 -70 -37 111 96 66 -21 45 91 89 129 -57
1100e7J25nl7P0n2m9O8j01r2P7q3N2M0M7l3j05J66J8r4Kj00P6J00j05J53o5L9p0pKoo4J2N2
$$ -57 68 63 26 96 44 -5 63 -38 -130 -53 -136 -84 -44 3 -30 -135 31 49 -45 -43 -143 -67 33 -72 81 16 55 -15 -22 -20 -26 -90 -78 -26
$$ [...]
-390G1
##END NTUPLES=	nD NMR SPECTRUM
##END=	
##END=	
