##TITLE=	Oct27-2021.33.fid
TM-VI-137solid 13C

##JCAMP-DX=	6.0	$$ MestReNova 14.3.0-30573
##DATA TYPE=	LINK
##BLOCK_ID=	1
##BLOCKS=	2    
##ORIGIN=	Mestrelab Research S.L.
##OWNER=	hrzepa
##$MNOVA/LINK_BLOCK_TYPE=	ITEM	$$ NMR Spectrum
##$MNOVA/ITEM/POLYGON=	(XY..XY)
5321,5835
8722,5835
8722,8208
5321,8208
5321,5835
##$MNOVA/ITEM/Z=	0
##$MNOVA/ITEM/ANGLE=	0
##TITLE=	Oct27-2021.33.fid
##JCAMP-DX=	6.0	$$ MestReNova 14.3.0-30573
##BLOCK_ID=	2
##DATA TYPE=	MNOVA NMR VIEW DATA
##DATA CLASS=	MNOVA VIEW DATA
##$MNOVA/ITEM/ZOOM/X=	-31.107771267257835035,	251.11459999734066173
##$MNOVA/ITEM/ZOOM/Y=	-78.638546943664550781,	716.41991424560546875
##END=	
##TITLE=	Oct27-2021.33.fid
##JCAMP-DX=	6.0	$$ MestReNova 14.3.0-30573
##BLOCK_ID=	3
##DATA TYPE=	NMR SPECTRUM
##DATA CLASS=	XYDATA
##NUMDIM=	1
##ORIGIN=	Bruker BioSpin GmbH
##OWNER=	nmr
##.OBSERVE FREQUENCY=	100.67161678785400625
##.OBSERVE NUCLEUS=	^13C
##.SOLVENT NAME=	CDCl3
##.PULSE SEQUENCE=	zgpg30
##LONGDATE=	2021/10/27 13:25:00.000
##.ACQUISITIONMODE=	SIMULTANEOUS (DQD)
##$ORIGINAL FORMAT=	Bruker XWIN-NMR
##$MNOVA/SCALES_VERSION=	9
##$PARAMETER FILE=	(acqus, ASCII, /private/var/folders/f6/rjf_tdyn2v98c5c0wvkgn4s80000gn/T/BOVh4QqES26$yNpK5mGsig/33/acqus, 0)
$$ ##TITLE= Parameter file, TOPSPIN		Version 3.2
$$ ##JCAMPDX= 5.0
$$ ##DATATYPE= Parameter Values
$$ ##NPOINTS= 11	$$ modification sequence number
$$ ##ORIGIN= Bruker BioSpin GmbH
$$ ##OWNER= nmr
$$ $$ 2021-10-27 13:25:33.842 +0100  nmr@CZC2524DW0
$$ $$ /opt/topspin/data/agmb/nmr/Oct27-2021/33/acqus
$$ $$ process /opt/topspin3.2/prog/mod/shimcntl
$$ ##$ACQT0= -2.05882356948211
$$ ##$AMP= (0..31)
$$ 100 100 100 100 100 100 100 100 100 100 100 100 100 100 100 100 100 100
$$ 100 100 100 100 100 100 100 100 100 100 100 100 100 100
$$ ##$AMPCOIL= (0..19)
$$ 0 0 0 0 0 0 0 0 0 0 0 0 0 0 0 0 0 0 0 0
$$ ##$ANAVPT= -1
$$ ##$AQSEQ= 0
$$ ##$AQ_mod= 3
$$ ##$AUNM= <au_zg>
$$ ##$AUTOPOS= <53 >
$$ ##$BF1= 100.660544
$$ ##$BF2= 400.32
$$ ##$BF3= 100.660544
$$ ##$BF4= 100.660544
$$ ##$BF5= 100.660544
$$ ##$BF6= 100.660544
$$ ##$BF7= 100.660544
$$ ##$BF8= 100.660544
$$ ##$BYTORDA= 0
$$ ##$CAGPARS= (0..11)
$$ 0 0 0 0 0 0 0 0 0 0 0 0
$$ ##$CFDGTYP= 0
$$ ##$CFRGTYP= 9
$$ ##$CHEMSTR= <none>
$$ ##$CNST= (0..63)
$$ 1 1 145 1 1 1 1 1 1 1 1 1 1 1 1 1 1 1 1 1 1 1 1 1 1 1 1 1 1 1 1 1 1 1 1
$$ 1 1 1 1 1 1 1 1 1 1 1 1 1 1 1 1 1 1 1 1 1 1 1 1 1 1 1 1 1
$$ ##$CPDPRG= (0..8)
$$ <waltz16> <> <waltz16> <> <mlev> <mlev> <mlev> <mlev> <mlev>
$$ ##$D= (0..63)
$$ 0 1 0.00345 0 0 0 0 0 0 0.06 0 0.03 2e-05 3e-06 0 0 0.0002 0 0 0 0 0 0
$$ 0 0 0 0 0 0 0 0 0 0 0 0 0 0 0 0 0 0 0 0 0 0 0 0 0 0 0 0 0 0 0 0 0 0 0 0
$$ 0 0 0 0 0
$$ ##$DATE= 1635337533
$$ ##$DE= 6.5
$$ ##$DECBNUC= <off>
$$ ##$DECIM= 704
$$ ##$DECNUC= <off>
$$ ##$DECSTAT= 4
$$ ##$DIGMOD= 1
$$ ##$DIGTYP= 12
$$ ##$DQDMODE= 0
$$ ##$DR= 21
$$ ##$DS= 4
$$ ##$DSPFIRM= 0
$$ ##$DSPFVS= 20
$$ ##$DTYPA= 0
$$ ##$EXP= <c13q>
$$ ##$F1LIST= <111111111111111>
$$ ##$F2LIST= <222222222222222>
$$ ##$F3LIST= <333333333333333>
$$ ##$FCUCHAN= (0..9)
$$ [...]
$$ ##$Sgu3PowerLevels= (0..7)
$$ 0 0 0 0 0 0 0 0
$$ ##$Sgu4PowerLevels= (0..7)
$$ 0 0 0 0 0 0 0 0
$$ ##$Sgu5PowerLevels= (0..7)
$$ 0 0 0 0 0 0 0 0
$$ ##$Sgu6PowerLevels= (0..7)
$$ 0 0 0 0 0 0 0 0
$$ ##$Sgu7PowerLevels= (0..7)
$$ 0 0 0 0 0 0 0 0
$$ ##$Sgu8PowerLevels= (0..7)
$$ 0 0 0 0 0 0 0 0
$$ ##$SguType= 3
$$ ##$ShimPowMaxUA= (0..63)
$$ 130000 130000 130000 130000 130000 130000 130000 130000 130000 130000 130000
$$ 130000 130000 130000 130000 130000 130000 130000 130000 130000 0 0 0 0
$$ 0 0 0 0 0 0 0 0 0 0 0 0 0 0 0 0 0 0 0 0 0 0 0 0 0 0 0 0 0 0 0 0 0 0 0 0
$$ 0 0 0 0
$$ ##$ShimPowMaxUC= (0..63)
$$ 130000 130000 130000 130000 130000 130000 130000 130000 130000 130000 130000
$$ 130000 130000 130000 130000 130000 130000 130000 130000 130000 0 0 0 0
$$ 0 0 0 0 0 0 0 0 0 0 0 0 0 0 0 0 0 0 0 0 0 0 0 0 0 0 0 0 0 0 0 0 0 0 0 0
$$ 0 0 0 0
$$ ##$ShimPowMaxUG= (0..63)
$$ 524287 524287 524287 524287 524287 524287 524287 524287 524287 524287 524287
$$ 524287 524287 524287 524287 524287 524287 524287 524287 524287 0 0 0 0
$$ 0 0 0 0 0 0 0 0 0 0 0 0 0 0 0 0 0 0 0 0 0 0 0 0 0 0 0 0 0 0 0 0 0 0 0 0
$$ 0 0 0 0
$$ ##$ShimPowRcbType= 3
$$ ##$ShimPowRes= (0..63)
$$ 1e-20 1e-20 1e-20 1e-20 1e-20 1e-20 1e-20 1e-20 1e-20 1e-20 1e-20 1e-20
$$ 1e-20 1e-20 1e-20 1e-20 1e-20 1e-20 1e-20 1e-20 0 0 0 0 0 0 0 0 0 0 0 0
$$ 0 0 0 0 0 0 0 0 0 0 0 0 0 0 0 0 0 0 0 0 0 0 0 0 0 0 0 0 0 0 0 0
$$ ##$ShimPowRng0= (0..63)
$$ 1 1 1 1 1 1 1 1 1 1 1 1 1 1 1 1 1 1 1 1 0 0 0 0 0 0 0 0 0 0 0 0 0 0 0 0
$$ 0 0 0 0 0 0 0 0 0 0 0 0 0 0 0 0 0 0 0 0 0 0 0 0 0 0 0 0
$$ ##$ShimPowRng1= (0..63)
$$ 1 1 1 1 1 1 1 1 1 1 1 1 1 1 1 1 1 1 1 1 0 0 0 0 0 0 0 0 0 0 0 0 0 0 0 0
$$ 0 0 0 0 0 0 0 0 0 0 0 0 0 0 0 0 0 0 0 0 0 0 0 0 0 0 0 0
$$ ##$ShimPowRng2= (0..63)
$$ 1 1 1 1 1 1 1 1 1 1 1 1 1 1 1 1 1 1 1 1 0 0 0 0 0 0 0 0 0 0 0 0 0 0 0 0
$$ 0 0 0 0 0 0 0 0 0 0 0 0 0 0 0 0 0 0 0 0 0 0 0 0 0 0 0 0
$$ ##$ShimPowRng3= (0..63)
$$ 1 1 1 1 1 1 1 1 1 1 1 1 1 1 1 1 1 1 1 1 0 0 0 0 0 0 0 0 0 0 0 0 0 0 0 0
$$ 0 0 0 0 0 0 0 0 0 0 0 0 0 0 0 0 0 0 0 0 0 0 0 0 0 0 0 0
$$ ##$ShimSysFunc= (0..63)
$$ 1 2 3 4 5 7 9 11 15 16 8 10 12 14 6 17 13 18 19 20 0 0 0 0 0 0 0 0 0 0
$$ 0 0 0 0 0 0 0 0 0 0 0 0 0 0 0 0 0 0 0 0 0 0 0 0 0 0 0 0 0 0 0 0 0 0
$$ ##$ShimSysMatrix= 0
$$ ##$ShimSysType= 1
$$ ##$TFXNUM= 0
$$ ##$TRIPLO2= 0
$$ ##$VTU= 2
$$ ##$VTUETH= <149.236.99.20>
$$ ##$VTUTY= <no>
$$ ##$WBREFAM= (0..15)
$$ 132.2 106.2 100 100 100 100 100 100 100 100 100 100 100 100 100 100
$$ ##$WBREFLM= (0..15)
$$ 0 0 0 0 0 0 0 0 0 0 0 0 0 0 0 0
$$ ##$WBREFPH= (0..15)
$$ 77.55 -65.76 0 0 0 0 0 0 0 0 0 0 0 0 0 0
$$ ##$WBSGU= (0..15)
$$ 0 0 0 0 0 0 0 0 0 0 0 0 0 0 0 0
$$ ##$XFAC= 2
$$ ##END=
$$ 
##$DECIM=	704
##$DSPFVS=	20
##XUNITS=	HZ
##YUNITS=	ARBITRARY UNITS
##FIRSTX=	25277.332242342450627
##LASTX=	-3131.3251784229105397
##DELTAX=	-0.43348832563920591809
##XFACTOR=	1
##YFACTOR=	0.041718113113586009766
##FIRSTY=	2.4741413593292236328
##MINY=	-13.509465217590332031
##MAXY=	651.29083251953125
##NPOINTS=	65536
##XYDATA=	(X++(Y..Y))
$$ [...]
13454d7Nkj1pJ0J5j4m4l2K6O7M9Lj7jJ0LkQJ4Lj2j4pmp%J3K1J8Qrl1m3l7k0o%kpj0lJ5L1K9
13435d1J0oj3j3qLJ9L2L9M5M1K6kk9m1l5j3J3L5L7K4J1ORQlj6k7l3l3k5j7j4j2NL2M4J8j5
13418F1k0MJ8Lj3qLkj6j1J1K2J4OOM%JNok8m0k3jJ5K5K8J3j7m0l6k2j4rJOnj7qK3M3M0K5J5
13399E6Qjj6l2l5j8J3K7J4nj0llnLJ8J9RLQJk4m6m5k0QK1K2J3QRR%j8l4l5k2qKRJ1J0Nkok
13379h4jj3l3m2k7nOQJ8L4L9K6Mj0j7j2J4M6N6L5MpQK8L0J1j6l1k8j7j8l0l9l5k5j4%J8K6
13362i3K3J0jlJ0L0L8K5jj5rLJ3J8J6KrkJ8K1lk5l5l7m5l4OM3L8Oj1LJ8J7OPJ6Rk3n6o4l3
13344a03J4L9K7kk6l9l8j9PK3K3K4L8M9L3jk7k7j8%K1K6Ll4m3j1J8J3opOJ1LMJ8J8ol5m2k1
13326h7JOJPK7M0L2J8J2J5Rj1l2l8l5k4j1jK%KOPKmkLlj4k2k4j7nJ0K4K4RmlRK1J9Q%klnn
$$ y = [-47, -42, -44, -55, -62, -52, -37, -51, -95, -127, -101, -34, 15, 18, 1, 0, 10, 13, 11, 19, 33, 36, 24, 10, 3, -1, -8, -8, 5, 26, 44, 52, 43, 12, -31, -68, -88, -94, -94, -96, -103, -113, -116, -101, -70, -41, -31, -37, -50, -63, -71, -68, -49, -17, 22, 67, 108, 134, 132, 103, 62, 27, 14, 27, 62, 99, 123, 134, 140, 149, 157, 154, 138, 111, 78, 45, 20, 3, -11, -23, -18, 14, 58, 76, 61, 41, 45, 63, 66, 53, 45, 48, 46, 30, 19, 30, 52, 66, 72, 78, 82, 82, 83, 88, 82, 54, 14, -9, -10, 5, 30, 58, 71, 54, 14, -22, -44, -58, -67, -66, -60, -65, -82, -90, -67, -24, 16, 41, 56, 64, 63, 47, 15, -20, -38, -25, 2, 16, 11, 1, -2, -5, -10, -7, 11, 30, 39, 42, 50, 51, 27, -19, -64, -84, -76, -55, -33, -20, -12, -3, 6, 6, -12, -46, -81, -103, -111, -109, -100, -89, -79, -74, -76, -82, -84, -85, -98, -131, -173, -200, -205, -199, -191, -173, -139, -100, -74, -70, -80, -97, -109, -95, -49, 7, 42, 46, 39, 47, 75, 105, 116, 100, 69, 41, 24, 6, -24, -63, -98, -123, -137, -137, -119, -93, -70, -60, -61, -64, -54, -24, 14, 39, 38, 23, 14, 17, 30, 48, 64, 66, 57, 55, 73, 94, 91, 66, 31, -6, -51, -85, -79, -36, 2, 8, -3, 0, 18, 35, 41, 48, 64, 73, 50, -6, -70, -103, -89, -50, -23, -25, -51, -90, -128, -147, -140, -117, -94, -70, -32, 17, 50, 49, 22, -5, -23, -23, -2, 24, 27, -7, -50, -61, -43, -30, -36, -43, -37, -26, -23, -19, -1, 17, 11, -24, -66, -87, -86, -80, -79, -72, -45, -5, 27, 45, 57, 72, 81, 70, 38, 0, -35, -59, -70, -71, -69, -69, -67, -61, -54, -52, -56, -58, -55, -58, -72, -94, -118, -135, -140, -130, -106, -82, -73, -77, -80, -71, -50, -31, -23, -23, -25, -28, -33, -38]
13306c8moj3j8j9j2mOJ8K5L1L3K6Kl2n2l7r%qj5qjnqkRJ5J5J0QJ3K2K5J1mlPJk4l8k4KJ5J3
13286g7J4J3jk6l8k7mJ2J3NJJ0K3K4RmjJ1Qj0k2j3QK3K3J6MLJ4L5L8J8mrQJ9J6NNNj1l9n0
13268D7l4j3j5k6j6J6L3J5rj5lMKPJ6J7%k1l1k9j8JK1K5Pj3j7oPQQJ2J6Ork6k9k4j8pJ4L6
13249f1M1K2mk1j8jJ6J8QkLK0K3Lj8k1qMQQOlj9k3rJ5K6K0Kj3j5j1j4k5k9j4QK0K1K3K1Nk4
13231a2l9k1J1K0Lj5j3lKklJ2L7M8M1J9%oqo%Mlj8k5k0j6k1j5J4M1L8Lk9l4k5j7rQK2K9K6
13212A8K8K4Nk2k9j3J0J0pk0k0j3nJPOmk0k7k0kJ9L3L3K2J0LJlopjJok0l4l1j5MJ6J8J1kj3
13193f0j2%RMqmK4N5O3M3J5Knk2m7o1n3k7lJ3K3K5K3J7J9J8Mj8k6qJ7K0lk4k1mPOJrk0j9j
13175d7K2L0J4j3l9n1m3k1LJ1ONJ8M0N2M0J1j6k5j6jQJ5L0M0L4J7Lkj2l2n0n2m1j7J7M6N1
$$ y = [-38, -42, -48, -61, -79, -98, -110, -114, -108, -90, -65, -34, -1, 25, 27, -5, -57, -94, -103, -103, -111, -126, -134, -135, -140, -148, -150, -141, -126, -111, -101, -93, -80, -58, -33, -22, -26, -29, -22, -21, -45, -83, -107, -105, -90, -77, -63, -50, -51, -77, -115, -142, -146, -134, -121, -116, -115, -105, -82, -58, -49, -53, -54, -43, -35, -45, -67, -80, -72, -49, -26, -10, -6, -3, 11, 46, 84, 102, 98, 89, 97, 116, 132, 137, 142, 147, 136, 97, 47, 13, 0, -15, -41, -57, -41, -8, 7, -2, -17, -20, -16, -14, -7, 9, 26, 26, 5, -26, -55, -73, -72, -51, -26, -19, -32, -49, -55, -48, -40, -32, -20, -4, 2, -7, -33, -62, -86, -104, -111, -97, -61, -20, 2, -2, -23, -41, -42, -26, -8, 0, -2, 1, 21, 44, 47, 29, 8, 0, 4, 12, 20, 26, 23, 4, -19, -28, -13, 13, 33, 35, 22, 7, -4, -18, -43, -72, -86, -78, -58, -37, -14, 7, 12, -12, -51, -72, -61, -41, -38, -53, -66, -69, -67, -69, -72, -60, -23, 25, 66, 85, 85, 79, 71, 65, 65, 69, 66, 48, 23, 3, -13, -34, -49, -35, 6, 44, 47, 18, -16, -41, -58, -67, -59, -37, -8, 18, 46, 70, 75, 53, 24, 11, 21, 31, 24, 4, -16, -29, -34, -33, -26, -20, -24, -44, -71, -91, -93, -74, -41, -8, 14, 24, 27, 28, 25, 19, 12, 11, 12, 6, -14, -48, -79, -94, -90, -74, -56, -45, -47, -60, -72, -72, -63, -59, -67, -71, -47, 8, 71, 114, 129, 131, 126, 104, 57, -4, -57, -84, -87, -74, -51, -26, -3, 14, 33, 51, 55, 37, 11, 3, 20, 40, 37, 13, -8, -12, -5, 1, 2, -7, -27, -46, -47, -25, 5, 19, 6, -33, -84, -127, -148, -145, -134, -128, -123, -105, -65, -13, 27, 38, 22, -3, -19, -20, -12, 3, 33, 73, 107, 124, 127, 125, 113, 81, 31, -21, -62, -79, -62, -16, 35]
13158C5K2j8l7k8j0jmj0oPJ7J4KjJ0J9J7P%jmj2j8k3j9kK0L0J8mj4j2j5k0j1J8M2L0j4n4o1
13141i1l8j3rk2k5oK9N5N9N1L9K9J4ok1k6k1j6nRK3K8J8Mpj9l6m8l6nJ7Rj2k0j0RL3N9O7M0
13123A00rm1l6j7j7l7n0m3k3%J3J9K2K6K9J9lk0j5QK2J4nk0k2j9j3KK1L8M5L8J7pk3j6LK7
13107B7L7L1Pk3m4l7j4NRNOQOMPMpj8j6j6k3k7j3J0J6J0J2K3J8mj7nQjk1k5k4m0n3l7lJ2N
13088a98J3M2N6K8j0j1J6L3K4Jj3k5l3l0j4PJ8J1mj5j3nmj0pQK0J5PJ3L0K8Lk3k8j5MJ9K3
13071c9J5LKJ2J5Kk1l2l0k3k2k1j9j9j5KL0M9M0J5lpjJLJ0J6J3Jppkkj0j2OL3M3L0Kj7k1k0
13053gj9j2%QQNPJ0LlrlQJ4J2ql1l7k3lOMRJ6J6Nmorj5j4%J4J1lpRK1J0j7l2k0KJ5J1Ljpj8
13031h1k9l0k5j8j4nJ1K3K7J7Mpj2pKJ5L1M0L4J0j6k9k1lJ8K8K1nl5m5k3J6L9L2J1LJ6J4j7
$$ y = [35, 57, 39, 2, -26, -36, -37, -41, -51, -57, -50, -33, -19, -17, -18, -8, 11, 28, 35, 35, 34, 30, 18, 0, -23, -42, -44, -24, 6, 24, 20, 6, -6, -21, -41, -52, -34, 8, 38, 24, -30, -91, -129, -142, -151, -173, -198, -204, -175, -120, -61, -10, 29, 58, 72, 66, 45, 19, -2, -18, -23, -14, 9, 37, 55, 59, 52, 33, -3, -51, -87, -92, -75, -66, -78, -98, -108, -99, -66, -7, 60, 100, 91, 50, 14, -3, -20, -57, -107, -150, -173, -173, -160, -141, -119, -93, -64, -45, -48, -68, -83, -75, -53, -39, -44, -64, -86, -105, -118, -116, -95, -57, -12, 26, 43, 36, 13, -3, 0, 27, 64, 95, 102, 79, 35, -2, -16, -11, -2, 3, 9, 17, 23, 27, 34, 38, 31, 13, -3, -19, -42, -69, -82, -72, -56, -46, -34, -11, 7, 3, -14, -19, -11, -12, -33, -58, -82, -122, -175, -212, -215, -203, -198, -185, -143, -87, -59, -69, -80, -64, -31, -7, -6, -19, -44, -77, -107, -121, -114, -96, -85, -89, -104, -117, -122, -126, -136, -143, -135, -115, -100, -93, -80, -50, -22, -19, -42, -70, -85, -81, -62, -39, -24, -21, -19, -7, 8, 10, -11, -43, -73, -96, -118, -139, -158, -177, -192, -190, -160, -111, -71, -56, -59, -66, -67, -66, -63, -53, -37, -24, -23, -30, -37, -39, -41, -51, -63, -57, -24, 19, 49, 51, 34, 13, -7, -26, -38, -38, -30, -22, -17, -10, 0, 3, 0, -9, -12, -4, 10, 22, 14, -17, -54, -77, -80, -74, -70, -61, -45, -29, -24, -28, -34, -43, -58, -72, -72, -58, -47, -50, -57, -48, -27, -17, -34, -66, -86, -84, -69, -58, -55, -56, -63, -81, -110, -140, -165, -183, -197, -202, -191, -168, -141, -124, -120, -127, -139, -146, -144, -129, -98, -58, -24, -14, -30, -59, -80, -83, -65, -37, -16, -21, -56, -101, -124, -108, -69, -37, -26, -23, -7, 7, -10]
13014a0n9n2PO1O0K1qj2rj9l0l4l4k3%K5L3K7K3L2L7L3K0kl0m8l3JK5K7K2J5ml7n5m5k3j1
12998a09kJ6K7J5j1k3k1j4lJ9L1J8nj4lJ2K1K4J3j1k9k1PK3K3K1K0Jk9m1j6J6K7J4LRK3K4
12981E5Pj5k3j1Kmk2l2k5qNQjj3j1MJ7K1J9J8J1kj1pKjj3j6lJ1K0J9Oj5l0k6j2lKPNnj1JJ2
12962f8Mj0j4j1j3j0J1L5L7K3J6J6J2RJ7K2NlJ9M4K8nkL1N1O0Q9J19J24J49K52L84M83O60
12947B564J029J359J145K29q52j376j192p51m73l66k70j75j45j52j18o0l9m8m1j9j9k8k2j2
12937A68k5m8m2j4NJ2J4Qj2k4j3lk2m4l9j0J6L2M9N3K5j6k8j5qj5j1LJ3J0RQlj4rJ1J9RLJ0
12919F2Oj4l2l2k5j7oJ2K1J6RJ0J2LnKJ7J6%j4j1MJ8K0J0rk5l2k8k3k1j9j1QK8M1M2L5J4j9
12902F3m7m9k5MK0K6K4K1J6J2Nj2l1k7kJ5J1%jnk2l5j5K3L7J6j7l1k7j0OQql4m5m2l4k2OL7
$$ y = [-10, -69, -121, -114, -53, 7, 28, 20, 8, -1, -20, -50, -84, -118, -141, -141, -116, -83, -56, -33, -1, 36, 69, 89, 87, 57, 9, -24, -23, 2, 29, 51, 66, 62, 25, -30, -75, -98, -109, -111, -95, -68, -53, -64, -87, -108, -122, -125, -106, -75, -57, -62, -76, -79, -67, -46, -22, -9, -20, -49, -70, -63, -40, -17, 4, 24, 25, -4, -45, -61, -45, -18, -4, -1, 8, 31, 55, 62, 47, 24, 13, 15, 11, -11, -43, -68, -76, -71, -63, -64, -77, -88, -84, -67, -46, -27, -9, 2, 0, -11, -18, -16, -17, -30, -46, -49, -38, -18, 1, 7, -8, -38, -64, -76, -79, -77, -70, -65, -70, -81, -80, -68, -64, -74, -88, -99, -112, -122, -111, -76, -39, -16, 0, 16, 28, 37, 54, 76, 81, 78, 97, 141, 169, 164, 162, 193, 244, 304, 393, 512, 636, 785, 1037, 1421, 1904, 2564, 3593, 4952, 6097, 6326, 5474, 4098, 2906, 2155, 1682, 1316, 1046, 871, 726, 574, 456, 396, 357, 309, 268, 249, 230, 202, 180, 168, 143, 95, 53, 39, 44, 56, 70, 78, 66, 42, 29, 26, 4, -40, -79, -89, -73, -41, 8, 61, 86, 70, 42, 27, 19, 4, -7, -4, 9, 19, 28, 36, 33, 19, 10, 21, 40, 49, 52, 62, 68, 54, 22, -10, -35, -52, -58, -46, -25, -9, 0, 10, 22, 25, 20, 22, 39, 55, 55, 41, 30, 34, 52, 72, 82, 73, 48, 16, -12, -35, -56, -75, -86, -78, -50, -9, 33, 68, 82, 63, 16, -33, -58, -54, -34, -8, 16, 37, 53, 65, 70, 58, 27, 0, -2, 13, 24, 24, 23, 18, -4, -39, -54, -31, 6, 22, 5, -26, -53, -63, -57, -49, -57, -91, -136, -178, -212, -234, -228, -191]
12885a91M9L3K0K3K9J9Jj1q%RJ5J3QRJ0Kj6k1nJ4J8PLOKj7k9k4%K6L4K1kj7j5mNJ1J6J9J8
12867H0J8K0J6PLQR%pjPMj1j9j5j4j6j2jKj0j9j7j1k0l7m3k5OL4M3K5mk7k5j0rj7rK8P0P9
12848H0M4nl2l3j6oj0k6l6l3k0oQK5L6K5ql8m8l8j5J1L5M0L0J9J6Ppj9kK8L9J7k0m4m7l0p
12831h6Jj7l7k8OK8K1NMJ3J7J6K3L5M1K6Kj7k5k3j7j6j2nLPJ0J5J3kk2k4jK6L2J8j8n6o7l1
12814a42K6M8K5%QK3Ok8l4j2%j9l6k0J4L8M5M4L4K0Jj1j2mNNoj4qknj5j3NJ7J3MJkpMK6L8
12795F0J8j0j8o%pj5j7j7k0rJ7L8M4L1Pj8l8m2k8rlnjK2N1O1L3j5m9m5j4ONlJQom1p2o5k7
12777a98QJ2%nNJ3POJ9K8J0j8k3LK7K2kj3kJ0RMK%ooLJ5K3K4J8Mj4j6%J3J2%%RJ2jj7k6l1
12758f0l0j7NK0J9J3J4J6Mj1mK5M5L6J0nl%j1k9l7k7j6qnkJJlmlj0k2j4J9N4O0M7L7L6J9j8
$$ y = [-191, -142, -109, -89, -66, -37, -18, -17, -28, -36, -36, -27, -12, 1, 9, 18, 28, 30, 14, -7, -12, 2, 20, 27, 30, 36, 38, 21, -8, -32, -32, -6, 28, 49, 47, 30, 15, 11, 16, 27, 43, 62, 80, 98, 118, 134, 141, 144, 152, 161, 161, 154, 153, 160, 164, 153, 134, 119, 105, 89, 77, 76, 78, 68, 49, 32, 21, 1, -36, -79, -104, -98, -64, -21, 4, 0, -27, -52, -62, -71, -88, -97, -69, 1, 80, 124, 119, 87, 54, 38, 32, 22, -4, -40, -73, -93, -99, -91, -66, -30, -5, -13, -51, -99, -137, -152, -141, -106, -66, -36, -17, -1, 6, -1, -20, -22, 6, 45, 62, 42, -2, -49, -79, -86, -85, -102, -139, -167, -161, -133, -112, -107, -103, -90, -73, -57, -34, 1, 42, 68, 70, 53, 28, 5, -12, -28, -40, -45, -42, -35, -25, -10, 3, 1, -21, -45, -46, -20, 12, 30, 12, -44, -111, -142, -116, -68, -43, -43, -35, -12, -6, -34, -68, -80, -80, -99, -135, -155, -141, -103, -58, -14, 20, 40, 41, 30, 18, 14, 19, 24, 18, 4, -4, -6, -11, -26, -39, -34, -17, -4, 0, 1, -1, -8, -4, 22, 60, 78, 68, 50, 44, 44, 37, 22, 5, -12, -32, -41, -24, 14, 58, 89, 96, 78, 40, -2, -30, -39, -42, -47, -48, -26, 25, 86, 119, 104, 55, 10, -4, 2, 7, 4, 5, 13, 7, -34, -106, -171, -198, -190, -178, -178, -183, -178, -165, -158, -152, -133, -105, -95, -113, -136, -133, -106, -84, -86, -99, -101, -91, -82, -78, -76, -76, -82, -88, -85, -70, -47, -23, -5, -1, -15, -31, -31, -18, -6, -6, -6, 3, 15, 14, -3, -29, -60, -90, -107, -102, -82, -63, -50, -36, -20, -16, -27, -31, -6, 39, 75, 85, 80, 77, 77, 66, 37, 0, -27, -43, -51, -56, -58, -57, -56, -59, -63, -66, -76, -98, -112, -93, -39, 21, 68, 105, 141, 160, 142]
12740A42n4o0l9j4NJ2Qmk0k9k4j2KJ4J7J6K0K2J7ol1m3l7k2mK1M9O3N7L7K5K3J9J0Jjql1n9
12723H2o6m8l2l1l6k6j0jNJ5K2J1j8l5l0j5qnKJ0QjkJ4M8P7P8M2nl5l6l7m0l3jL9N8M4J0k5
12705a1m5l9j9jMJ0K2L0J9PRJ9J5j1k7rL3O9O5K7j4l4l6l9m3l7j9kJlKJ3K1K0J7J3NKJ1J8
12688F3Rj4k7k9k7l5m2l3j2QJ4%j9k4j0J1J8K3L9N5M6J1k4k9jL7O0N1K4jj1j2j8k7k7j2J3
12672D8M1N7N0K8J4J9L2N1R2J53K08K50L25M37M81L28ll24m68m25l12k13j46j08r0p8o1m4
12660C42m6n7n7m2k7j6JJ3Oj4k8l1k9k5j2J0K1J2j0k5k9j7NK5L0K5K1K0J9J3Lj5l5l7j8KM
12644Bk%J2K2K6L3L5K2%j5k6l8m1k0QJ2rk4j3LMomOJ3J0OMnj5k2k7k7k2j1lLJ4K4J9pl4m0
12625a33k3LJ8J9J3RJ3J3%j2oJ6K5QrkJ7K2Nj5k2k0mK1M0L9K6J0jrrkMkj2j4j0j8l9m5k3J5
$$ y = [142, 88, 28, -11, -25, -20, -8, 0, -4, -24, -53, -77, -89, -87, -73, -56, -40, -20, 2, 19, 13, -18, -61, -98, -120, -124, -103, -54, 9, 66, 103, 128, 151, 170, 180, 181, 180, 172, 141, 82, 16, -32, -64, -95, -131, -157, -167, -168, -163, -148, -126, -115, -133, -168, -198, -213, -221, -226, -224, -214, -206, -207, -209, -195, -147, -70, 8, 50, 45, 10, -26, -63, -103, -136, -137, -98, -40, 4, 14, -11, -56, -95, -114, -115, -111, -101, -79, -49, -30, -23, -14, 5, 20, 9, -18, -27, 6, 75, 140, 167, 153, 119, 83, 44, 1, -36, -55, -57, -56, -59, -57, -44, -23, -3, 14, 27, 32, 34, 45, 63, 72, 58, 31, 2, -25, -60, -102, -135, -147, -139, -125, -125, -144, -168, -178, -167, -149, -126, -87, -32, 14, 25, 1, -28, -29, 8, 68, 119, 143, 142, 131, 119, 101, 74, 47, 35, 48, 89, 146, 196, 224, 238, 257, 289, 340, 432, 585, 793, 1043, 1368, 1805, 2286, 2614, 2611, 2287, 1819, 1394, 1082, 869, 723, 615, 525, 447, 386, 342, 296, 239, 182, 140, 113, 97, 98, 111, 117, 103, 75, 44, 15, -10, -22, -12, 9, 21, 11, -14, -43, -60, -55, -30, 0, 25, 46, 66, 85, 98, 101, 86, 51, 14, -4, -2, 2, 0, 0, 12, 34, 60, 93, 128, 150, 150, 135, 109, 71, 30, 10, 18, 30, 21, -3, -16, -13, -9, -15, -19, -13, 0, 10, 16, 20, 15, 0, -22, -49, -76, -98, -109, -112, -109, -95, -71, -52, -59, -93, -133, -156, -153, -135, -116, -103, -94, -81, -68, -68, -80, -86, -70, -45, -37, -46, -48, -31, -9, -4, -19, -41, -61, -65, -44, -4, 35, 61, 71, 70, 61, 52, 50, 54, 52, 40, 26, 16, -2, -41, -86, -109, -94]
12607i4L4K1rk6j6NJ0lj1mJrk3j7PK2K2J5K1K9K8K0Poj9l2m1l6j1J9L6L3K2J5J4J0J0J1Jk5
12590C1m4m1k0jJ1K1K0nl3l1jK4K3J5J9K3J6QJ8K6J3j4l4l9l4k4lQJj0mJ5K7K2J4J4J3J1R
12573F4J2J0LlnprrkKkrj3j0kNJ3K5L6L5J4k0l7k8okj4k1j1jlj0j3rqj2j9k2j8j1mm%K1M3
12553f1M4J9qj4okj0k5l9m4l4nK6L8K6OlJJ1J6J1LKJ3K6K9K0NooJMKmj2k1k8k4%K6K6Lk4l2
12534e0k3oRK0J6NKJ3J9Qj8l3k6oK3M6M3J1k1k3%J2PMJ1Nk5m5k9J2L6K1qk9l2rK4M7N0L2R
12516A02k0m2m2j3K0K1j5m4l5KL0K8QppOJ4Oj2j5lJ0Oj0k4k8j4J6M4M6J5j9k2kJ1MkNJ1PL
12499C9QLj7l1j2K0L6J8j1k2j9j4oJ1L9N6N5L5Ok0k7j9j0j8l4m1l7l3k7j0J4L1K1j1m0n2m1
12482a60j9NK1K1J3KjlopJK3M7N0L1RMJ0J0lj8k1j6j3j1jJ2K0J7OkolMJ0J2Lj5l0l2j5NOr
$$ y = [-94, -60, -39, -48, -74, -90, -85, -75, -78, -89, -93, -92, -101, -124, -141, -134, -112, -90, -75, -54, -25, 3, 23, 30, 24, 5, -27, -68, -104, -115, -96, -60, -27, -5, 10, 24, 34, 44, 55, 56, 31, -13, -54, -74, -75, -64, -43, -23, -28, -61, -92, -93, -69, -46, -31, -12, 11, 27, 35, 53, 79, 92, 78, 44, 5, -29, -53, -56, -48, -47, -57, -61, -46, -19, 3, 17, 31, 44, 55, 64, 76, 86, 89, 86, 81, 74, 65, 56, 54, 56, 54, 45, 32, 22, 20, 25, 38, 63, 99, 134, 148, 128, 91, 63, 57, 55, 41, 20, 9, 8, 5, -5, -18, -27, -35, -47, -66, -88, -106, -117, -121, -125, -125, -104, -61, -17, 2, -6, -20, -26, -28, -38, -63, -102, -146, -180, -185, -159, -121, -95, -89, -92, -91, -80, -64, -53, -50, -48, -35, -9, 20, 40, 45, 39, 33, 34, 38, 40, 36, 24, 3, -25, -49, -49, -23, 3, 6, -18, -50, -73, -79, -70, -50, -34, -29, -27, -14, 5, 13, -5, -38, -64, -70, -47, -1, 42, 53, 32, 9, 9, 21, 28, 32, 43, 48, 23, -22, -51, -39, -3, 18, 10, -19, -51, -60, -36, 11, 61, 93, 102, 82, 40, -2, -15, 5, 26, 11, -33, -68, -66, -36, -8, 0, -7, -14, -8, 6, 12, 0, -15, -18, -8, -2, -12, -36, -64, -78, -62, -18, 28, 43, 24, 2, 0, 11, 15, 13, 18, 29, 36, 39, 47, 50, 33, 2, -10, 10, 46, 64, 53, 31, 12, -2, -8, 3, 42, 98, 153, 188, 194, 174, 147, 128, 118, 100, 66, 25, -12, -45, -72, -82, -68, -37, -16, -27, -67, -119, -160, -179, -174, -153, -132, -119, -117, -118, -121, -127, -134, -133, -110, -63, -13, 18, 27, 31, 41, 51, 48, 30, 9, -7, -20, -31, -32, -20, 0, 17, 23, 21, 15, 12, 16, 26, 38, 41, 26, -4, -36, -51, -46, -40, -49]
12463d9k0rJ1J5Kj3j7j4pJ0L1L8J8j0j8%K4L0K3J3OJqj7j6j0qj2j9j5omj2j8nJ7K4Nk0k8n
12446i2L0M5L2Nj9k8l3k8j0K1M1L4Nk0k9k4j1KJ0J3RMlonJLpj6j2J0K7K5Oj2j6j1lOJ2J7J5
12427a2J1Mnk0l4l6k3lJ2J6J0Mjrj4pQJ2lk1k2j0jnq%J2J9K1K2K3J8J4J6J5J4J6K3K5Qk0l5
12409C4l1j7qllk2n3o8m9j2J3J9K3L1L4K7J7J6J5Qnj4j5nJ3K9K7Rj2k0j5j1j0j0j0qKJ6K4
12392d4J9J0PQ%j8k8j7JRKjKjj7l6l7j9JJ4K0K4J4nj7j0QJ4QMQJ4J2J0RNoj1kJ1J5J2J6K6
12373C4J9ol1l7k9k2k0j8j1JPPLNJ4K5L0K9K1J0kpKK1L0K1MlKNql4n2m8k9j2KJ4K7K5Lk4l4
12355f6k0ojmMK4N0O5N7J3m3p1n2j1J9K1J8K0K4K1J3Nmj3j8j3nKK%kjKKJLJ1J7J0oj9j4no
12336B4j3rJ4M0M3K6Mj0k3l6l8k5j8k7m3l8j6NJ1J8L2M1K8Mj2j5qKJ5J9J2J0K5M6M9K7nk4
$$ y = [-49, -69, -78, -67, -52, -50, -63, -80, -94, -101, -91, -60, -22, -4, -14, -32, -32, -8, 22, 45, 58, 64, 65, 57, 40, 24, 14, 6, -6, -25, -40, -46, -50, -62, -80, -85, -68, -44, -39, -59, -87, -92, -62, -17, 15, 20, 1, -27, -60, -88, -98, -77, -36, -2, 3, -17, -46, -70, -81, -79, -69, -56, -47, -43, -46, -52, -57, -56, -53, -60, -76, -88, -78, -51, -26, -20, -32, -48, -59, -62, -56, -44, -27, -12, -1, 3, -2, -22, -56, -92, -115, -118, -106, -90, -80, -76, -77, -86, -100, -107, -99, -87, -90, -111, -133, -143, -144, -149, -157, -157, -145, -126, -105, -83, -60, -42, -28, -12, 3, 17, 33, 56, 81, 89, 69, 34, 3, -14, -22, -25, -28, -50, -103, -171, -220, -232, -219, -200, -177, -146, -112, -85, -68, -52, -37, -29, -34, -48, -63, -68, -55, -26, 1, 10, -2, -22, -37, -48, -58, -68, -78, -86, -84, -68, -44, -25, -15, -8, 0, 0, -18, -46, -63, -62, -53, -51, -52, -50, -51, -68, -104, -141, -160, -159, -145, -125, -101, -87, -92, -109, -119, -111, -97, -89, -85, -77, -63, -51, -41, -32, -27, -33, -44, -46, -35, -20, -8, 8, 34, 53, 47, 16, -21, -50, -72, -92, -110, -121, -120, -113, -106, -103, -98, -84, -59, -29, 0, 21, 31, 29, 22, 24, 45, 75, 96, 100, 97, 99, 104, 96, 62, 10, -38, -67, -79, -77, -63, -36, -11, -8, -32, -66, -86, -92, -93, -97, -93, -69, -19, 46, 103, 116, 73, 2, -50, -61, -42, -21, -3, 17, 41, 62, 75, 80, 76, 63, 45, 32, 27, 29, 31, 31, 29, 28, 30, 32, 33, 36, 47, 64, 74, 68, 49, 35, 30, 24, 11, 2, 16, 56, 99, 125, 129, 119, 96, 60, 22, -3, -21, -48, -91, -129, -145, -140, -129, -111, -79, -38, -10, -6, -18, -33, -41, -39, -24, -5, 7, 17, 42, 88, 137, 164, 159, 135]
12319A35k9j9nkj7l1k4okj3j7jJ0mk0j3J0K6K8K4J2nj4lJ1Pj2k2j5j3j7rJ2K7J7Jn%KJNJ0
12301B0Nrj6mJ0J3rl9n1k5J6L9L1J3ORJ2J3J7J5kl0m4l7j6PK6L9L5J4j3k8k5j5ork1k3nK8
12284e9N4N6M0K0Nj1k9l9k4RL7L1ll9m7k7nPKrj6pJ5L5L1J0qj1plQK8M3K6j3m6n0l0k0k1k4
12266i1j9nQK0K6K7J7Kj0j4j6k2k5j6LJ8K0J5J2R%qpLPmk2l8l6k0OK5K5J4J1K1K9K5J1RJ3
12248B3J3Jj1j0pj7l2l2qJ4J4nj8j7o%KNO%kRL0M1K9Nj4j8j2orj9l1l1k3j0MJ9L2K8Rj0j2
12229g6NK3K5J5Loj5k2j8JK6L6K3Lj0j3j6k2k0pOKj2j3JJ4Roj8j9j6qOJ8J8OKJ3K3J9Nmj0
12211b9k0k2%K9L2Mk6k4%J8K1K1K4J7NoporpmKPJ6K2K1J4J0J0%j6k3j7j4k1k8k8k2j4jJ6J8
12192c7Jj2jK3K9J2qj4j2qnoj1j0KK2L0J8jj8l0k7j3kkmKJ3J8K6M1N8N2K8J2Nj3l7l7mK4J2
$$ y = [135, 106, 87, 82, 80, 63, 32, 8, 2, 0, -13, -30, -31, -21, -25, -45, -58, -48, -22, 6, 30, 42, 37, 23, 20, 31, 38, 26, 4, -11, -24, -41, -50, -38, -11, 6, 7, 2, 2, 4, 5, 10, 20, 25, 16, 0, -4, 6, 19, 10, -29, -80, -105, -89, -50, -19, -6, 0, 9, 21, 34, 51, 66, 64, 34, -10, -47, -63, -56, -30, 9, 44, 58, 45, 17, -8, -23, -29, -38, -59, -82, -87, -59, -5, 51, 91, 111, 116, 105, 76, 37, 13, 22, 59, 90, 87, 48, 1, -26, -31, -24, -22, -31, -47, -54, -39, -4, 27, 37, 29, 18, 11, 8, 16, 44, 87, 113, 100, 54, 4, -26, -46, -67, -91, -110, -115, -107, -87, -61, -34, -17, -15, -25, -39, -55, -77, -102, -118, -115, -97, -77, -62, -50, -41, -41, -49, -56, -53, -46, -50, -72, -110, -146, -166, -160, -135, -110, -96, -85, -64, -35, -10, 1, 10, 23, 36, 37, 26, 16, 9, -8, -40, -72, -80, -66, -52, -57, -75, -92, -98, -98, -96, -91, -85, -85, -87, -78, -48, -7, 22, 27, 13, -5, -17, -23, -32, -51, -82, -113, -136, -146, -142, -123, -91, -63, -54, -64, -76, -71, -48, -23, -8, -5, -11, -26, -48, -66, -65, -39, -3, 20, 23, 13, 0, -16, -38, -58, -65, -59, -57, -69, -82, -81, -67, -58, -64, -82, -101, -117, -125, -119, -101, -83, -77, -75, -62, -39, -20, -15, -19, -29, -49, -71, -71, -42, -10, -6, -32, -56, -56, -38, -17, 4, 28, 45, 50, 44, 37, 31, 22, 15, 11, 13, 20, 36, 58, 79, 93, 103, 113, 113, 97, 74, 57, 43, 22, -6, -34, -56, -70, -71, -55, -37, -36, -48, -49, -26, 3, 15, 7, -7, -19, -27, -32, -38, -49, -59, -57, -35, -5, 13, 12, -6, -36, -63, -76, -78, -80, -84, -82, -69, -51, -25, 16, 74, 126, 154, 166, 171, 158, 121, 84, 80, 104, 116]
12174A16k5m0k6j0j0j0%J5K4K4K2J5Noj8k9l1j9o%llkqj9j8lJ2J0lj0mOQjmjPOlj7k4k4j1
12155a18QK6L3K9K4K6K7J9Kk1l2k7j5j4k4k1MK9K8J2KMN%%PJ0J6L3M7L0lk2j8j8k9k5JJ5K
12138E2oJ0K2J5PJ9K6J8J2J9J4mJ0O6R7O9M1P2J06R5J10K15L53M76P22J162J452J072Nj056
12125E271j432j140p18m96l87k46j35j28j52j10l9j4k4rK4L5K1Lk6o7q8o3l0k1k3rORJ1K6
12112D9L5J7mmKj3l2k6nJnMK9L9K8J6J3Nj0j9k4l8m9l2QL8L2OnMRKnlPMpj1LK0J6mj6j2lJ
12092F1LNnk1k9j9njJOQJpj2j7k4k3nJ3J7Qlj4k7l0nL1N3M6K7Oj1j9j8j5j5rRK9L1K1RM%k
12072E3jKjpj0j8k8l0rJ5J9Ooj3k1k1oJ6K3J5J6J8Oj9l0j3Jqk3k0kJ2J9K3J8pl2l7k3j0rj5
12054a57j8j8j2JJ4K2K8K6J7KnjLkrjJ1J5QQK1L4L0Pj7k3j2OJ5J8K7L2J9j3l4l1j0RJ7J3%
$$ y = [116, 91, 51, 25, 15, 5, -5, -5, 10, 34, 58, 80, 95, 100, 94, 76, 47, 16, -3, -9, -9, -12, -15, -17, -25, -44, -62, -65, -53, -43, -46, -56, -60, -54, -46, -47, -51, -52, -45, -39, -42, -59, -83, -107, -118, -110, -84, -51, -22, 2, 28, 55, 74, 76, 55, 23, -4, -19, -33, -57, -78, -74, -45, -17, -5, -3, 1, 6, 6, 6, 13, 23, 39, 72, 119, 149, 146, 124, 106, 88, 59, 34, 35, 50, 52, 46, 56, 78, 93, 100, 119, 145, 163, 175, 194, 208, 204, 214, 280, 377, 446, 487, 559, 665, 760, 870, 1085, 1438, 1914, 2636, 3798, 5250, 6322, 6327, 5271, 3839, 2699, 1981, 1485, 1098, 852, 717, 589, 437, 327, 288, 274, 250, 241, 265, 300, 321, 324, 298, 231, 143, 80, 50, 29, 6, -3, 3, 12, 23, 49, 84, 101, 97, 93, 95, 82, 50, 24, 19, 20, 15, 19, 48, 87, 115, 131, 144, 149, 139, 120, 96, 58, 9, -23, -15, 23, 55, 61, 56, 60, 69, 71, 66, 63, 70, 74, 67, 56, 59, 79, 95, 91, 75, 63, 60, 61, 64, 69, 64, 43, 14, -5, -10, -11, -10, -4, 4, 5, -2, -14, -31, -55, -78, -83, -70, -53, -45, -48, -62, -89, -119, -124, -93, -40, 6, 33, 39, 28, 9, -9, -24, -39, -48, -39, -10, 21, 42, 51, 55, 55, 53, 52, 54, 53, 46, 36, 18, -10, -40, -49, -34, -15, -9, -15, -28, -49, -70, -76, -60, -37, -22, -6, 12, 18, -1, -31, -44, -43, -51, -74, -94, -96, -84, -65, -42, -24, -31, -63, -100, -123, -133, -142, -157, -175, -193, -205, -204, -190, -168, -140, -114, -97, -95, -100, -101, -98, -100, -109, -110, -99, -84, -76, -68, -47, -13, 17, 24, 7, -16, -28, -22, -7, 11, 38, 70, 89, 76, 42, 11, 1, 10, 27, 40, 40]
12036D0j4j7rrk4l6k6lJ7K6L3L1K2Onrj9l3l6j9%J3K1L5M4L9J5j1k5k8k3j0J1K5K4Oj3j6j0
12020A3morj0pjLKlKK0L8L4Pk0k8j8kJ9L9M3K7Lrj4k0k2j1Jjk0l0j7J1M0N4M4J6j0k8m2n5
12001B9n2l1%K3L9N3N4K6j4l6l3k3j6j0mklLJ4J7J5K0K9K4Kj5j1JLkk%Jmj1k1l4l7k9j5kO
11983d8J1Kj6k8k4j2ppmmokJ3K4J8KkJjnKJ7K6K5K2J4ol0l6rK0L1K7K6K0jk9l4k1pj1k3k0
11964i2%K6L7K3%rPL0L4J1k1l9l7l1k0lJ1J4Lj0j5j3j3j0lMJrk5l5l1qK2L7K4Lqqj0j3%K1
11946a55K7J1jJ0L4N1M7L4K0J1J0Qnk8m4l8k3j1%PJ0%j2j5j3j3j4oRJ2Jj3j0PK8M0K9Mj4j3
11929a8%Lqj9j5kPLmrlJ3K3J6Jj2j1%RJ5J1N%LLrk7l3j9OK0J5lj6j4LJ2Mj3j5NL0L9L8L3K4
11909I1J2kj4k4k7j8nmj4j8jK4L4K6Oj3k3j5J0L3M0L1J8Lk0m8o2n2l3j4%J1K5L4L0J4pj9q
$$ y = [40, 26, 9, 0, -9, -33, -69, -95, -98, -81, -55, -22, 9, 31, 37, 32, 23, 4, -29, -65, -84, -84, -71, -50, -15, 29, 68, 83, 72, 47, 19, -4, -14, -3, 22, 46, 52, 39, 23, 13, 9, 3, -6, -16, -23, -24, -21, -19, -22, -20, 0, 38, 72, 79, 59, 31, 13, 11, 30, 69, 112, 139, 142, 133, 119, 99, 77, 66, 67, 66, 46, 16, -1, 10, 50, 104, 148, 164, 154, 126, 84, 29, -23, -54, -54, -31, 8, 61, 115, 141, 127, 91, 58, 35, 19, 9, 5, 3, 0, 3, 17, 34, 49, 69, 98, 122, 124, 109, 98, 99, 102, 100, 98, 98, 99, 95, 84, 63, 29, -8, -37, -52, -54, -48, -37, -35, -51, -79, -103, -115, -122, -129, -133, -137, -143, -145, -132, -108, -90, -88, -90, -89, -90, -95, -93, -76, -50, -25, -3, 11, 5, -25, -61, -70, -50, -19, 8, 34, 54, 53, 24, -10, -31, -38, -49, -72, -92, -92, -66, -29, -6, -6, -15, -8, 22, 56, 67, 46, 7, -30, -61, -81, -84, -73, -59, -56, -66, -81, -94, -107, -117, -120, -116, -115, -124, -149, -184, -215, -223, -201, -164, -140, -137, -145, -153, -163, -176, -176, -155, -128, -117, -118, -108, -74, -23, 24, 58, 78, 89, 99, 107, 102, 74, 30, -8, -31, -42, -42, -35, -25, -25, -37, -52, -65, -78, -92, -98, -89, -77, -76, -89, -99, -92, -64, -24, 5, 9, -5, -18, -18, -15, -23, -42, -57, -59, -52, -49, -53, -62, -65, -52, -29, -13, -12, -24, -35, -35, -26, -11, 0, 5, 5, 8, 11, 2, -25, -58, -77, -71, -51, -36, -39, -55, -69, -66, -54, -50, -63, -78, -73, -43, -4, 34, 67, 91, 103, 101, 87, 63, 36, 18, 13, 9, -5, -23, -24, 0, 34, 60, 66, 53, 30, 15, 25, 58, 98, 129, 147, 150, 130, 82, 20, -32, -65, -79, -79, -68, -43, -9, 21, 35, 28, 9, 1]
11892AK2M9N7L9J2j1k5l5m5m1j6J5K9K7K2J8J2lj3j4k2m6o3n3j6J6K2J2Jk%%%lj1j6j9j6k
11875a18K2M2M0J8lj2k0k9l7l1j7kQJ4K0K0J3N%MJ9L0K6J4MLLnj1jJ9L2K6Rj1k4l0k5j3j%
11857AklMJ4K1K2K0J0nj7j9j0LJ2J0jj9l4l6k2MK6K7J3j0k5k8j0K0M5N4M0J1k1l9l4j4Mjj7
11840fk8j5OJ6J8K2L0K4%k3l1k3j1KJ5J8RnqlmrrOJ7J5JmMJ3Qqk0j3NJ7J0jJJ0Prk2j8j0p
11820a3jJ7L7K9pm7o4n0j8OJ0mj3oOPJJQPkkJ1K3J3j1k5j7%OkrjJ2J2ok5k3%K1K2J1MPJ4J6
11800d5J3Rjj6l3m2l2pJ6K2J7J1J0J0J0J4J8J4Mm%J3J9J1qk4k2kJ8J1j4l5k2J6M3M0K6J6J5
11783H9J7Qj6m3n5l7qKrj5KL0L9L0K2K0K0RJMMrk2k2j1j3k6k6oJ3Oj7k8j4PJ5Poj7j3JJ8K3
11765b6J6QMJmpoj2k0k2j0Kmj9k6j5RL1L6K1kj6j0KNmqmLNMJmj1qQL0L9K2JnJ2L1K9QrlOk
$$ y = [1, 23, 72, 129, 168, 180, 169, 144, 109, 64, 23, 7, 22, 51, 78, 100, 118, 130, 127, 114, 100, 78, 32, -31, -84, -100, -84, -62, -50, -49, -51, -51, -51, -51, -54, -65, -81, -100, -116, -118, -96, -54, -14, 4, 1, -11, -31, -60, -97, -128, -145, -147, -139, -125, -105, -85, -72, -67, -67, -63, -44, -14, 12, 26, 30, 33, 36, 31, 20, 19, 38, 70, 96, 105, 94, 70, 40, 15, 2, 1, 1, -1, -4, 0, 14, 35, 57, 77, 87, 82, 65, 46, 36, 39, 51, 61, 60, 41, 7, -29, -51, -47, -21, 6, 19, 9, -16, -44, -54, -34, 11, 65, 105, 116, 95, 56, 22, 8, 12, 11, -6, -34, -49, -43, -27, -9, 13, 43, 67, 67, 44, 13, -10, -21, -19, -4, 14, 23, 18, 10, 7, 3, -6, -15, -9, 8, 23, 24, 20, 24, 37, 45, 37, 17, 4, 9, 26, 36, 35, 36, 46, 53, 44, 22, 4, -6, -13, -14, 3, 40, 69, 62, 15, -49, -99, -117, -111, -101, -105, -118, -124, -118, -111, -110, -109, -101, -94, -96, -98, -87, -64, -51, -62, -87, -104, -104, -98, -100, -109, -110, -98, -86, -92, -117, -140, -140, -119, -97, -86, -82, -75, -61, -45, -32, -23, -24, -40, -73, -115, -147, -154, -138, -116, -99, -88, -78, -68, -58, -44, -26, -12, -8, -12, -12, 1, 20, 31, 23, -1, -23, -25, -7, 4, -10, -45, -67, -51, -8, 32, 58, 74, 89, 106, 114, 98, 55, 0, -37, -45, -43, -52, -67, -65, -35, 4, 34, 56, 76, 96, 105, 106, 110, 114, 105, 83, 61, 50, 37, 11, -15, -21, -8, -2, -19, -47, -61, -54, -39, -32, -38, -55, -68, -67, -49, -26, -10, -2, 2, 3, -1, -8, -14, -26, -46, -68, -78, -76, -80, -99, -125, -140, -131, -100, -64, -43, -45, -61, -71, -69, -64, -68, -76, -80, -77, -72, -68, -67, -71, -82, -90, -82, -52, -13, 9, 10, 5, 17, 48, 77, 85, 76, 73, 79, 77]
11743G7k6m3l3j1QJ6J2MjKJ9L2L1J3j3l3l9k5LK8L9K7Lj3j7j4j4j7j5lJ0J9K2J9J4Qjj1j5
11726F2j0MJ9K1Nj7k8k1kJ6K2J6kk0k6k1j3qj1j6k4k7j9NL3M2K3j0l0k0RK8K3J2RJ2J2RQJ0
11709G5Olj2k0l6n4n7m2k5j7j2LK5L7L7L6L2K1Nm%NMkkMPlj4j6o%mj4j9j8j6j5rOJ7J9J2L
11690f6opjPJ1MmrplMQmk3l3j7RK2J4JqpJJ4K2K3J7J6K0J8J7J9J9Oj8l5k8qQOmj1mJ1J6Mj9
11670el4k7j0QK3L7M0K8Nj2j4j4k3l6l8k4kJ7L3M4M3K4kj4j3j2j7k0j1MNljJ9L7L2Lk3k4r
11652A4Knj8j7MK5L1K0Nk1n2o2l3J6L7J5rjJ9K0ok8l1k1oJ3L1L8L7L9L9K7Mj9k9l7m7n3m2
11635a01k2mOJ1Kk2n1n8l4LL3M9N2M8L4K1J6J9K4J9Kk0l7l9k6qjlmJ0L1M2L8K2Qjmnj1k0k6
11618gk1qmj1j8qJ5K4Rj2j5mkj5k7j9m%onRJ7RkjJ5K6K5J5jj9k5j4KLqpJ4L0J9pj4NK4K2M
$$ y = [77, 51, 8, -25, -36, -28, -12, 0, 4, 3, 5, 24, 56, 87, 100, 87, 54, 15, -10, -7, 21, 60, 87, 90, 77, 60, 46, 32, 15, 0, -3, 7, 26, 48, 67, 81, 89, 88, 77, 62, 52, 56, 75, 96, 101, 84, 56, 35, 33, 49, 71, 87, 85, 65, 39, 18, 5, -3, -14, -30, -54, -81, -100, -95, -62, -20, 3, -7, -37, -57, -48, -20, 3, 15, 24, 36, 48, 57, 65, 75, 81, 78, 66, 46, 10, -44, -101, -143, -168, -185, -197, -194, -169, -132, -95, -59, -27, -6, -1, -5, -5, 0, 4, 2, 0, 4, 11, 8, -6, -22, -28, -28, -32, -46, -65, -83, -99, -114, -123, -117, -100, -81, -69, -66, -72, -79, -80, -73, -62, -58, -62, -71, -78, -81, -77, -69, -73, -96, -129, -146, -137, -115, -101, -100, -108, -115, -114, -100, -78, -55, -38, -22, -2, 16, 33, 52, 71, 77, 59, 24, -4, -12, -4, 2, -2, -13, -17, -6, 10, 14, -5, -39, -66, -76, -68, -45, -8, 32, 60, 65, 53, 39, 25, 2, -34, -72, -96, -98, -81, -48, -4, 39, 63, 61, 47, 34, 22, 5, -15, -26, -22, -17, -20, -21, -2, 35, 67, 70, 47, 23, 14, 16, 11, -7, -24, -20, 5, 36, 56, 61, 40, -12, -74, -107, -91, -54, -39, -48, -49, -30, -10, -16, -44, -75, -96, -102, -89, -58, -20, 17, 56, 95, 122, 126, 107, 78, 41, -6, -59, -101, -123, -127, -121, -110, -108, -130, -181, -239, -273, -270, -237, -188, -136, -88, -54, -33, -17, 2, 26, 45, 47, 27, -10, -49, -75, -83, -84, -87, -91, -81, -50, -8, 30, 52, 60, 59, 55, 50, 39, 19, -7, -28, -36, -40, -51, -69, -77, -62, -38, -29, -41, -56, -60, -62, -77, -104, -123, -127, -127, -133, -138, -129, -112, -103, -105, -106, -91, -65, -40, -25, -26, -45, -70, -84, -82, -79, -87, -94, -80, -50, -31, -38, -52, -47, -23, -1, 3]
11598Cj5k8l3k4jJ7J9PLJ0K0J3pk7l0j4RK7L1K2Pj1l2m9m9k4J8N5O2L9Qj7l3m3l9j7J3L2K8
11581e0J1j%J1K4K2Qj4l1l8l6k4nJ3K1J9J2Kqj1ML1M6L6Rj2j9k0j8oJ7L6M6L6J0k8o1o9m7
11564h4j4RJ7K1K2J4%rnkorkMkj3j0RK7L2K6K3K4K3J9J1%qj0j0j3j3nLmj8j9kJ0pl4m4k9j2
11545i0j0j8k5k6k3k1j5pJ3M3O6N6K4Jkmj7k8j4J4L1K7J3MMJ4L2L5J7j0k3k3k2j7j0jjkQK0
11528A3K0NjPJ0pk5k5j3omNJ6J4PQK0K4Pj2j6qlpj4j9k2j9pJ1J4lj9qK3M1K7%pMOj4k8j9L
11508b1J6K0K9L0Nk6l1mJ7Mk0k1%RLj0rqj0j3qjKJMJ8K8K5Nj6k5k5j9rNJ5Qj4l2k8qPRRJ2
11489g7Roj5rKKj2k1j6j0rnJ1L3M2L1OqkJ7K8J4rk6k5j6j0pmNJ8L2L2J7jj1j2j3k1k4j1Jj
11470h1j9l0k3qJJ%KQJ2J9K5L0K6J2mqMJ6J2qk9l1j5jmj9k2LM2N5K7j6l2j3J3K4K0J4RMNJ7
$$ y = [3, -12, -40, -73, -97, -98, -81, -62, -55, -52, -42, -22, -9, -16, -43, -73, -87, -78, -51, -20, 2, 9, -2, -34, -83, -132, -156, -138, -83, -21, 18, 26, 9, -24, -67, -106, -123, -110, -78, -50, -39, -40, -40, -29, -5, 17, 25, 11, -20, -58, -94, -118, -123, -110, -89, -70, -58, -56, -64, -75, -71, -40, 6, 42, 51, 39, 20, 0, -18, -24, -7, 29, 75, 111, 121, 93, 32, -37, -84, -98, -89, -72, -51, -29, -15, -15, -24, -29, -31, -37, -46, -48, -44, -46, -59, -69, -60, -33, -1, 25, 48, 72, 95, 114, 125, 125, 117, 107, 97, 84, 71, 66, 69, 65, 47, 28, 26, 36, 29, -5, -49, -78, -90, -100, -118, -143, -169, -192, -213, -228, -235, -222, -179, -113, -57, -33, -32, -34, -38, -55, -83, -97, -83, -52, -25, -12, -8, -4, 10, 42, 77, 94, 84, 61, 38, 16, -1, -11, -12, -13, -15, -7, 13, 33, 38, 37, 44, 54, 47, 22, -3, -16, -22, -26, -21, -5, 9, 16, 24, 44, 68, 75, 63, 47, 39, 36, 29, 15, -4, -26, -45, -52, -41, -27, -30, -49, -57, -34, 7, 34, 34, 27, 31, 37, 23, -5, -24, -21, -5, 15, 44, 74, 79, 53, 22, 18, 35, 39, 19, -2, -2, 7, 10, 0, -9, -17, -27, -40, -48, -49, -47, -46, -42, -24, 4, 29, 34, 18, -7, -32, -51, -60, -55, -40, -32, -46, -78, -106, -114, -107, -98, -89, -77, -68, -74, -89, -98, -96, -94, -106, -127, -143, -153, -162, -167, -156, -123, -81, -50, -44, -52, -54, -37, -9, 5, -4, -30, -55, -71, -81, -88, -92, -87, -69, -37, -5, 12, 11, 0, -12, -25, -46, -70, -81, -80, -81, -100, -130, -153, -161, -160, -159, -159, -157, -149, -137, -118, -93, -63, -37, -25, -29, -37, -33, -17, -5, -13, -42, -73, -88, -89, -93, -112, -134, -131, -89, -34, -7, -23, -55, -68, -55, -31, -11, 3, 12, 16, 21, 38]
11451C8K6J3j6l0k0oqj9j2J2K4J1poJ0J2j0l1l3j3LKrj7j7qMJ5K0K1J6RLLOJ0J2J4J5J6J5
11433F8J5J7J2pl4m7l5j3lorjJ4K0J6J4J1Npj2jRLj3j6kRP%QJ9J4mj4mJ1K0K4K0kl0m1k1O
11414B0J0rk4k8k5k1j4%Nnj9j4J5M4M5J8j4k3rLPJ1J9K2J6J0K1L3L3J7Kj1l0m2l0KK3J6Jl
11397G2nk0l8l0jK2K4J1NRJ1MkkMJ0J3J0Lqj8k3k6k7k3qOMj1j9j1Jnk2k6nJ6K3K2K8L6L6K1
11378F1Plj1j6j3pnj1j3qKPKrj8k0j2NK1K1PnJK3M1L5Qj7k0qJJjjpj5j6p%%jpj6k5k2%K5L1
11358a5J5Jmpj4k3k6k4j3RL2L6K1RJ7K6J0k1k9j4j6l7m2qM0N0K7N%mj4j7mJ1J8K3K5J3j2k6
11340A8j5K%j6k4j4KPOjj1j6j0jPQLj1k7k9pJ7J6oj8lK0K6J8RJolMQ%rj0mlkjLJkmmrj5j4
11319a19j0j4j9nL2O7P1M6Ok5l2k1lLjpooj1j5mJ8L7L9L1J5kj7k6l0l1k7j8oNJ3J4Kk0l2k7
$$ y = [38, 64, 77, 61, 31, 11, 5, -3, -22, -34, -22, 2, 13, 6, 0, 10, 22, 12, -19, -52, -65, -62, -60, -69, -86, -103, -111, -107, -92, -72, -51, -35, -26, -23, -20, -14, -4, 8, 22, 37, 53, 68, 83, 100, 112, 105, 71, 24, -11, -24, -27, -33, -42, -43, -29, -9, 7, 21, 32, 37, 30, 18, 17, 26, 29, 16, 0, -2, 7, 14, 14, 22, 41, 55, 51, 37, 33, 44, 64, 88, 108, 106, 76, 35, 14, 20, 30, 21, -3, -31, -56, -77, -91, -91, -86, -91, -110, -124, -109, -65, -20, -2, -16, -39, -48, -45, -38, -27, -8, 14, 30, 40, 61, 94, 127, 144, 146, 135, 105, 63, 33, 35, 58, 74, 75, 72, 67, 47, 9, -21, -22, 0, 24, 35, 40, 49, 60, 64, 62, 60, 64, 74, 87, 97, 100, 92, 74, 51, 25, -2, -25, -33, -27, -23, -34, -53, -64, -63, -68, -90, -116, -121, -105, -82, -60, -32, 4, 40, 61, 68, 65, 54, 38, 25, 18, 13, 2, -11, -19, -17, -10, -8, -17, -35, -55, -67, -62, -41, -20, -13, -18, -17, 6, 47, 82, 90, 73, 53, 45, 46, 47, 46, 45, 38, 23, 7, 0, 0, 0, -1, -8, -24, -49, -71, -71, -46, -15, 0, 1, -3, -10, -24, -47, -73, -97, -110, -101, -69, -33, -12, -3, 14, 40, 50, 29, 0, -14, -30, -67, -109, -117, -77, -27, 0, 5, 5, 1, -13, -30, -34, -23, -5, 18, 43, 56, 44, 18, 3, 5, 5, -11, -35, -49, -47, -40, -34, -35, -46, -62, -72, -73, -66, -58, -55, -66, -93, -122, -129, -112, -96, -102, -120, -123, -103, -77, -59, -50, -49, -55, -58, -54, -46, -46, -55, -65, -69, -72, -74, -75, -72, -71, -73, -77, -81, -90, -105, -119, -129, -143, -162, -167, -135, -68, 3, 49, 55, 30, -2, -23, -26, -23, -24, -31, -37, -43, -54, -69, -73, -55, -18, 21, 52, 67, 65, 48, 22, -8, -39, -66, -84, -90, -85, -72, -58, -56, -76, -108, -135]
11301a35j1%MJ6L6M9L9J2qj7k0j3MK4K6J0qj0nkpj7k3k8k8j7nJKOJ3J2JplQJ5J1QJ1K3L3L6
11282C6K3RLONoj6j5mOJ3Pnj5j2kmj9l3k5jK0K2QjjJ0K2K2Rqj6j3%J5K0J2%lQJ4Kk4l6l1j7
11262a5pPK2L0K2%k0k5j4MK1K6J8QkqmQK0J5ql2m3l9l1j8nJ1K4L3K9J7lj5j9j4qJNjpoLMr
11243b5j5PL7M2J0k8m0k3OK2J8Rkj5k5k8j4PJ4Jk2l5l3j6OK1J9MkPJ3Jj0nJ3K2J8RKrk1j7
11225g7mKlnNJ7J6J1J3J8J8J5RJj5k6k5rKLjoj0j0lORQJ0J3J6Ppl1m5l7j0RNqoJ0J8Rko%O
11204i0J7K6K1Jj9k1j0MJ8L2L8L8K8J6jj3j2%Onk3l2l3k9j9kJ1Oqj5oQJ8J9Mj9l6l4k2j6p
11186a61J3K9J7j2j3K2N2L9Mj0jJj5k5j9n%QJ7K3K3K2K7K1QNJ6K2Kl4o1o2m5j2J3K1J5J7K8
11169a0K7kl0k4PK5J1mlLmj3j1lLQJ9K3J1qj3PK9L7L2K3Kk5l9k6%J6J4Jj5k7l1j4L%k4l4j5
$$ y = [-135, -146, -146, -142, -126, -90, -41, -2, 10, 2, -15, -35, -48, -44, -20, 6, 16, 8, -2, -7, -9, -16, -33, -56, -84, -112, -129, -134, -133, -131, -125, -112, -100, -99, -106, -109, -101, -86, -75, -67, -56, -33, 0, 36, 59, 68, 71, 77, 82, 76, 60, 45, 41, 47, 60, 67, 62, 47, 35, 33, 29, 10, -23, -48, -49, -29, -7, 1, 0, -1, 9, 31, 53, 62, 54, 38, 25, 25, 40, 60, 72, 72, 69, 77, 91, 93, 69, 33, 2, -15, -22, -15, 7, 37, 59, 59, 39, 14, 0, 4, 25, 51, 69, 77, 75, 67, 63, 71, 91, 106, 98, 66, 23, -16, -47, -65, -70, -59, -35, -2, 27, 44, 41, 26, 7, -7, -15, -14, -9, -10, -17, -23, -20, -16, -25, -40, -33, 4, 46, 56, 28, -12, -35, -29, -7, 11, 20, 18, 3, -22, -50, -64, -57, -43, -42, -64, -99, -132, -148, -142, -121, -102, -98, -100, -93, -80, -79, -89, -94, -81, -59, -41, -32, -30, -39, -60, -77, -81, -79, -82, -87, -82, -65, -49, -38, -25, -7, 11, 26, 35, 36, 21, -5, -30, -39, -37, -34, -35, -41, -51, -61, -64, -58, -49, -41, -31, -18, -2, 5, -2, -33, -78, -115, -125, -116, -111, -119, -125, -115, -97, -88, -90, -96, -96, -90, -73, -47, -26, -25, -44, -65, -75, -71, -53, -21, 17, 55, 83, 99, 98, 85, 73, 73, 79, 74, 51, 19, -14, -43, -62, -64, -53, -47, -55, -70, -76, -68, -50, -31, -27, -46, -82, -116, -138, -154, -161, -148, -119, -102, -114, -127, -105, -53, -14, -10, -20, -21, -20, -35, -60, -79, -84, -84, -76, -59, -36, -13, 9, 36, 57, 65, 70, 86, 108, 110, 76, 15, -47, -92, -104, -91, -70, -55, -38, -10, 17, 15, -15, -39, -32, -7, 4, 0, -3, 0, -4, -17, -28, -31, -28, -20, -1, 22, 33, 25, 12, 19, 48, 85, 117, 140, 142, 117, 78, 52, 52, 68, 82, 83, 68, 41, 10, -4, -1, -1, -25, -59, -74]
11150g4J3J4j3l6l6k1mJ4K5K3J5K0L4L2J3%J3K7J4j0nJ7J7j9n2m9k9j5mJ6L3L0J2KKjqpln
11133ej7j9j1qj5k1j0RK3K7J4rk6j7J1K6J4ljJ0Mj1j3NK2K0J2RNnrnnj9k9j7QK1J6P%j1k3
11114d6k3oPkj9k6j8nJ0K8M0L3J3%j%j7l3k8jK6L3K1RKjrj9k4j6MK3K5Pj2j7mOMmnklnjL%
11094e3rqJ2L1L0J1lmJPJ7K4K1J0OJ1Nk7o4p0m3rLlj1qmnroJ0K7L0J6kj2j3mJ4K8K6Mj8j9
11075f0%J4J0MPJ2Qkmnj2k6k5nK1K9J7NNJ1J2jj4j4jJ4K1J4lj8k7k7j6kLmj1qRK0Rj6k8j6
11056a00NK2K8L3K7J6Kmmrj8k6l1l5k6KK9K4ok1nK0K6J7J6J9J4kq%PNJjoj4j8j1rj4j7j1m
11037h7mkNQnk2k5j3KJ0J0P%nJJ2K0K3K1J5jj7j6MK1J6nk2k2j8j7j3lJ2J9J3Jj0j4j3j0j1
11019a35j4qJ1K5J3j4k8qK9N0M3K2J0QJ5J6RjLJ8K9J9NRK8K8pm5m9k8j7k6l2k1lJ3L1M6M5
$$ y = [-74, -61, -47, -60, -96, -132, -153, -157, -143, -118, -95, -80, -60, -26, 6, 19, 19, 32, 59, 73, 63, 58, 75, 92, 73, 21, -28, -57, -72, -76, -60, -27, 3, 15, 17, 19, 18, 10, 3, 0, -5, -22, -41, -52, -60, -75, -96, -106, -97, -74, -47, -33, -42, -68, -85, -74, -48, -34, -37, -38, -28, -24, -35, -48, -43, -21, -1, 11, 20, 25, 20, 11, 6, 1, -18, -47, -64, -56, -35, -19, -12, -12, -23, -46, -69, -75, -68, -70, -89, -115, -133, -138, -128, -100, -60, -27, -14, -14, -15, -15, -32, -65, -93, -94, -68, -35, -14, -5, -3, -4, -13, -32, -56, -72, -68, -45, -20, -13, -25, -42, -46, -40, -36, -40, -45, -47, -50, -55, -56, -53, -53, -62, -70, -58, -27, 3, 14, 11, 7, 8, 15, 32, 56, 77, 87, 93, 104, 109, 82, 18, -52, -95, -104, -101, -104, -115, -123, -127, -132, -141, -147, -137, -110, -80, -64, -66, -78, -91, -95, -81, -53, -27, -23, -41, -60, -60, -46, -36, -32, -25, -13, -5, -7, -11, -16, -28, -54, -79, -84, -63, -34, -17, -12, -7, 4, 16, 15, 1, -13, -14, 0, 21, 35, 32, 14, -13, -40, -56, -58, -55, -59, -70, -78, -69, -49, -40, -56, -84, -100, -95, -73, -45, -12, 15, 31, 33, 29, 25, 16, -2, -28, -59, -94, -120, -118, -89, -65, -71, -92, -97, -77, -51, -34, -18, 1, 15, 13, 5, 5, 12, 17, 18, 17, 11, -3, -21, -32, -41, -55, -72, -83, -87, -91, -93, -88, -80, -85, -107, -132, -145, -143, -133, -123, -116, -116, -121, -120, -108, -88, -65, -44, -29, -30, -47, -63, -59, -38, -22, -27, -49, -71, -89, -106, -119, -122, -110, -91, -78, -77, -87, -101, -114, -124, -135, -149, -157, -146, -121, -108, -122, -150, -158, -129, -79, -36, -14, -4, 4, 19, 35, 44, 43, 46, 64, 93, 112, 117, 126, 154, 182, 175, 130, 81, 53, 36, 10, -22, -43, -46, -33, -2, 44, 89]
11002H9J2k4l3j8mnoLJ2Oj3l2m2l6j6NRnk3k7j6kPMlj1oRJ7Oj8k4kL0M5L4J5MKNJnj3j5mJ6
10982g2L0K7J2KPJ9J1j4l1k3MK3K2J5Olj8k8k6j1%krj0lQJ7K0J8J0JprJJ3Qj3l2k3J3M2M3
10964C8J8qj1OK6L2J7lk0k7k7j9rprj3oKjj1qJ3K9K1mj6kK0L1K1Kj5j7mJ1J1nj4jJ9K2Nj1
10945G6j3rj1j2JJ9K3Lk4l6k9j8j3j5j3%J4J9J4J1J7J9Lk0j9OK6J7rj6KJ5jk7l8k3PL4N0N6
10928H6M6K3j0m0n3m1j4RK3K5J8Kj4j1RJ9Oj7k2nJ4K2K5K4J3j2l5m3l2j5l%oj6l0l8l2j0J7
10911a18L0K0JoOK1L0K9K9K6J7Kj4j5PL4M1J5k1l9l6l3k9j6OJ3jj9k0qmnnMJ5K3K6K6K0J1
10894F3Mqk6l6l1j3llkLNNQK1K8K2Kj8k6k1mJ0J4J0QNnj8k8k4j0PK1K8K3J1oj6j4%J3J1mj0
10875dOL0L0Lj9j8j1j1j7k3l1m4n1l9j6LK1M1M9L1kj9j7j3j7k1k3k3j6OL1L6K3J3K2K7J1r
$$ y = [89, 101, 77, 44, 26, 22, 17, 11, 14, 26, 32, 19, -13, -55, -91, -107, -102, -93, -98, -121, -148, -164, -166, -159, -155, -158, -169, -175, -166, -149, -143, -161, -185, -187, -157, -112, -78, -63, -59, -57, -52, -51, -56, -69, -84, -88, -72, -42, -15, -3, -1, 6, 25, 36, 22, -9, -32, -28, -5, 17, 32, 38, 35, 17, -11, -37, -48, -48, -50, -59, -69, -72, -64, -47, -27, -9, 1, 2, -5, -14, -13, 0, 8, -5, -37, -60, -47, -5, 38, 56, 48, 37, 43, 69, 101, 118, 115, 95, 68, 41, 22, 13, 6, -3, -16, -22, -20, -21, -32, -40, -27, 2, 23, 19, 3, 1, 21, 52, 73, 75, 60, 43, 39, 50, 61, 56, 42, 41, 60, 82, 87, 76, 63, 54, 43, 31, 32, 51, 74, 77, 53, 17, -12, -30, -43, -58, -71, -71, -57, -38, -24, -13, 4, 23, 26, 6, -13, -7, 19, 36, 27, 11, 13, 28, 27, 0, -38, -61, -54, -20, 30, 86, 132, 155, 145, 105, 52, 11, -3, 6, 29, 54, 72, 74, 60, 49, 58, 77, 83, 66, 44, 39, 53, 75, 100, 124, 137, 125, 90, 47, 15, 0, -3, -3, -9, -25, -55, -93, -125, -135, -118, -88, -68, -67, -73, -67, -46, -16, 13, 42, 68, 85, 87, 73, 58, 65, 99, 140, 155, 134, 95, 59, 26, -3, -19, -13, 0, -1, -20, -40, -48, -52, -57, -62, -58, -43, -20, 6, 32, 52, 63, 67, 59, 33, -3, -34, -47, -50, -53, -55, -52, -47, -42, -34, -13, 15, 37, 39, 21, -5, -26, -30, -20, -6, 4, 12, 17, 12, -6, -34, -58, -68, -61, -40, -12, 11, 22, 16, 0, -14, -14, -1, 10, 6, -4, 2, 32, 62, 65, 46, 28, 17, 6, -11, -34, -65, -109, -160, -199, -215, -212, -191, -150, -101, -70, -72, -91, -108, -121, -138, -159, -182, -205, -221, -215, -184, -148, -125, -112, -90, -63, -52, -61]
10858f1pJ5L3L7L6K5Jk4k6%K0J0k3m8m7k0J2K9K7J5QOPRJ9K3J0j8l5j9QJ7Mokjj9m4n5m0j0
10840a34J6K4J3qj7mJ1PprKQL%M%rnJ8K9Qj7pK8M1K2PJ8K5Jl3m5m0l3k6oJ8J7oj8j1jk%J6
10821a02L2K9J8J6J1j0l9m1j0J7J5KMK2L5K5Mj7k5k4k2k5l6l9k8j1kkJPJ1NjLJ3J9J0mj2q
10804a59NJ1Nj2k9k4LL9N5M1J4JQJ9J8QPRKj2k0j8j1omKNMNJ3J9J3lj2j0mlmNK1K7J7jrmj
10784C0lj0j1opk3l7l1lK8L9L0J2Kmnlnj3j9j1NJ7K2K0K0J0oj2j1j8m5o8o1k5J2L0K9J3rk5
10766a52k4j2kOK4M8N9M4K0Lj4l3m0k6mLjJRJ1Lk%%mJJ5J5mj9j2NQmj2rprmM%j5k2pJ7K8K7
10746h7K2K5L1K6J7%j5k1k2j9j3pKJ8M0N7O1M1Ml3n5n7m3k5j2j0j1lJ2K6K6J8Poj6j6kJ7K4
10729AK1J2%j2k2k5j7plMJ8L4L9K7J2Jpj8l1l5l1k0oJ4L5M0K5nk2k1nKjj0j1nKLNJ5K9L2J5
$$ y = [-61, -68, -53, -20, 17, 53, 78, 79, 55, 29, 29, 49, 59, 36, -12, -59, -79, -67, -38, -11, 4, 12, 18, 25, 34, 53, 76, 86, 68, 33, 14, 22, 39, 43, 37, 35, 34, 15, -29, -84, -124, -134, -118, -94, -81, -89, -106, -110, -99, -92, -99, -108, -106, -98, -95, -95, -91, -91, -100, -105, -87, -58, -50, -67, -74, -46, -5, 17, 24, 42, 67, 68, 35, -10, -50, -83, -109, -115, -97, -80, -86, -104, -115, -116, -118, -118, -102, -70, -41, -23, -7, 4, -6, -45, -86, -96, -79, -64, -62, -58, -36, -1, 24, 28, 11, -14, -38, -60, -85, -121, -160, -188, -199, -201, -203, -202, -195, -184, -179, -180, -177, -164, -145, -135, -139, -151, -159, -154, -143, -138, -150, -179, -203, -200, -161, -106, -65, -51, -50, -42, -23, -5, 3, 10, 19, 21, 9, -11, -29, -40, -46, -50, -48, -43, -39, -34, -21, -2, 11, 8, -4, -14, -18, -21, -25, -20, 1, 28, 45, 44, 35, 31, 30, 27, 17, 6, 0, -7, -30, -67, -98, -101, -73, -34, -4, 8, 10, 6, 1, -2, -7, -20, -39, -50, -45, -28, -6, 14, 34, 44, 38, 26, 15, -3, -48, -116, -177, -202, -190, -160, -131, -118, -127, -152, -176, -188, -190, -184, -160, -112, -53, -9, 11, 14, 0, -33, -73, -99, -103, -100, -101, -100, -91, -80, -77, -79, -79, -79, -83, -82, -67, -52, -56, -75, -87, -82, -74, -78, -90, -99, -106, -115, -119, -115, -115, -130, -152, -159, -142, -114, -87, -65, -40, -9, 17, 34, 34, 19, -2, -24, -43, -56, -63, -61, -43, -3, 54, 115, 156, 160, 127, 72, 15, -28, -53, -65, -75, -86, -89, -77, -51, -25, -7, 0, -6, -22, -38, -40, -23, 1, 22, 34, 34, 22, 0, -25, -42, -49, -52, -48, -30, 4, 43, 70, 82, 83, 76, 58, 27, -8, -39, -59, -65, -51, -16, 24, 49, 44, 22, 1, -4, -2, -3, -13, -24, -29, -27, -24, -19, -4, 25, 57, 72]
10710G2j2l2l5k4nJ5K6K8K4J7Nj4k6k0pjplQJ0ql2m4l9k5oK2M5M6K5LnjLKkoqmPJ4J2MJJn
10690A9j8l0k6mJ5J1rk7k6j5oll%LJ0K4L6L0QrqLNlrqJL%jJ0L1M4L0rm4n0k7KK0K0J3J0LJ
10670A7MRQjrkJ5K0Jl2n1m3j1K5M8M4K2lj8k1k2j8nJ9K6J2j1j7oNJ0Okorrj5j6nK1M4M4K1
10651H9pk4k7k2pQJ2kk2l0k0nKkj1j6mK4M8M6K9J1Njj3j9j0J0K4J8nk8m0l3j4J1K5K2Jk0k3
10634b0j7nLJ1K2K1Pj5j8nJ0Kj8l1k0PL3M2L7K2Qlj3k0k4k2k5l1l3j7OJ6Mj3j7j3roMJ2Po
10615a27qJ1K9K8J7QMnj2jK4L7K8Orj1okJKqk0k6k1j3j1j5j5j0qj2j9j8JK9M8M3K3MJOPMN
10596a1J7L1L3J8rl3l9k4p%jKJ2J6J4Mjpj3j2mJlj0mJ1J1mj9k0j3j5k1j9j0lj3l6n1m6k3j
10578c02J0J2J7L3M5M4K6OlNK6M1L1Kj8j8lPJ0J3J3Lqj2rj1k2k2mK1K5Nj4rJ8L4K0nj8j0R
$$ y = [72, 60, 28, -7, -31, -36, -21, 5, 33, 57, 74, 79, 65, 39, 19, 12, 11, 4, 1, 9, 19, 11, -21, -65, -104, -129, -135, -113, -68, -22, 3, 6, 1, 0, 3, 5, 3, -3, -11, -15, -8, 6, 18, 22, 23, 24, 19, 1, -29, -55, -59, -44, -33, -42, -69, -95, -110, -116, -119, -122, -122, -119, -109, -85, -49, -19, -11, -20, -28, -25, -20, -23, -32, -40, -39, -36, -36, -37, -27, 4, 48, 78, 69, 25, -25, -52, -50, -30, -10, 3, 13, 16, 17, 21, 30, 38, 37, 28, 26, 41, 61, 62, 30, -21, -64, -75, -50, -2, 42, 64, 61, 43, 22, 0, -18, -23, -4, 22, 34, 23, 6, 0, 5, 15, 21, 19, 13, 4, -5, -20, -36, -41, -20, 24, 68, 89, 82, 58, 31, 9, 2, 10, 22, 20, -2, -32, -52, -57, -55, -57, -68, -84, -88, -64, -16, 30, 59, 70, 75, 74, 61, 42, 32, 42, 66, 84, 79, 51, 11, -22, -36, -25, 0, 22, 23, 3, -20, -37, -42, -39, -28, -6, 15, 22, 7, -11, -16, -6, -4, -22, -53, -73, -66, -33, 9, 46, 68, 76, 73, 60, 40, 16, -6, -31, -62, -95, -112, -106, -90, -86, -99, -116, -129, -138, -144, -140, -128, -121, -127, -135, -124, -95, -67, -50, -42, -38, -43, -55, -56, -32, 5, 33, 39, 30, 19, 13, 11, 12, 14, 6, -14, -40, -61, -74, -85, -100, -115, -125, -133, -145, -164, -182, -181, -152, -104, -61, -38, -34, -33, -27, -20, -16, -11, 6, 37, 70, 88, 79, 46, 7, -17, -24, -24, -25, -23, -11, 5, 19, 23, 22, 15, 2, -10, -14, -13, -16, -26, -30, -19, -8, -12, -31, -51, -64, -79, -100, -119, -129, -132, -145, -181, -232, -278, -301, -302, -292, -280, -263, -230, -185, -141, -115, -109, -112, -107, -81, -40, -9, -7, -25, -43, -46, -39, -29, -16, -3, 0, -8, -20, -29, -40, -62, -84, -88, -67, -42, -37, -51, -60, -42, -8, 12, 7, -11, -21, -12]
10560a2J9J8J0mj3j0MJ0L%RJ9J6J0J4K5K3Mj1j3n%PJ0Pqk2l1l4l5k8j9j6j7pQJ0j1k9j4J9
10543i4L8K3%qNJ8J5Kj1rPJ8K0J1RJ7K8L2K5Oj7k7j9JJ7J8Ppk0k7l0l0k5j5pj1k3k5j2%%O
10524i4K8M7L6Oj6j2kOJ2K4J8mk1j9j0j3j7jK3K7J0oj0j2j4j0J4L4L8K4Pj2l1m3l4j4J%lL
10507d0J8L3M6M1J8j3k6j2J4K2Nj9l5l8l2k3mQml0m5k9NK5K0QOK1L3L2J9Ojoj8l1l5j6RK3
10490d5J0j4l1l4k2kJ4J9J1jolQK1L7M4L7J5JOJ6J3mk2l4l4k7j4jLKOJ2J4LojON%kMJ1J6J3
10470D4Kj3k0nJ7K0Kj7k7l0k9j3J0J8Jj9j1J1J7ml1l6k0MK1K7K0J2J5K0J5LomMMmj7k8l0j5
10452i2PJ7%k1j9RL0L0J8J5J8Qj5l2k7oJ6K7K2Ok3n4o5m5pK3L1K3J5J5K4L2L6L2J7kj9k7k6
10436ik5j9j2lOPJqj3j5k4l0k1PL4M0K6J2J3J8J2JKJ5K5J3orMRKnJNrk7k8j8j6j9j1J5L4L2
$$ y = [-12, 7, 25, 35, 31, 18, 8, 12, 22, 25, 25, 34, 53, 69, 79, 93, 118, 141, 145, 134, 121, 116, 116, 123, 133, 140, 132, 110, 79, 45, 10, -18, -37, -53, -70, -77, -69, -59, -70, -99, -113, -94, -56, -33, -33, -41, -36, -18, -3, -1, -12, -21, -14, 4, 24, 35, 44, 61, 89, 121, 146, 152, 135, 108, 89, 90, 107, 125, 132, 125, 105, 78, 48, 18, -7, -22, -29, -40, -63, -88, -100, -100, -100, -94, -66, -19, 17, 23, 7, -5, -7, -1, 11, 35, 53, 49, 28, 9, -1, -14, -31, -32, -9, 18, 28, 22, 12, 0, -14, -24, -10, 24, 62, 86, 93, 81, 50, 7, -27, -41, -40, -40, -43, -40, -22, 11, 57, 98, 116, 103, 77, 65, 79, 101, 106, 87, 52, 14, -18, -41, -45, -37, -41, -71, -116, -145, -140, -115, -95, -87, -81, -60, -27, 5, 24, 30, 29, 23, 5, -26, -61, -77, -68, -45, -35, -49, -80, -114, -136, -138, -124, -105, -94, -95, -101, -104, -96, -75, -38, 6, 43, 58, 59, 65, 81, 94, 90, 68, 34, 0, -27, -41, -42, -39, -37, -31, -19, -5, -2, -8, -9, -3, 2, 2, 0, 4, 15, 31, 44, 46, 33, 13, 8, 25, 45, 47, 30, 3, -27, -56, -69, -59, -41, -40, -59, -70, -59, -42, -46, -77, -113, -133, -129, -108, -81, -61, -49, -34, -14, 1, 4, -2, -6, -2, 2, -2, -19, -47, -77, -92, -85, -68, -68, -89, -108, -99, -69, -39, -21, -6, 12, 20, 5, -27, -54, -60, -44, -17, 5, 11, -12, -66, -131, -176, -183, -160, -129, -106, -91, -76, -52, -20, 16, 48, 65, 63, 44, 17, -9, -34, -53, -65, -68, -62, -55, -54, -62, -75, -90, -114, -144, -165, -158, -124, -84, -58, -46, -33, -15, -3, -2, 0, 15, 40, 53, 47, 38, 42, 51, 53, 48, 49, 54, 45, 18, -10, -28, -44, -63, -74, -59, -25, 7]
10416GJ8J0Pjj6k4k1j6qMJ5J2pk4k5j3moj0nJ9M0L7Ok1k0kOK%QPpj8j3kjpj2j4j6j3KK4L9
10397f3L9L0J8Lj2j9k2j4QL0L4J4j4k7l0l6l9k7%J6R%MJ1RNJ3K6K7J7J4K1K1ml6n0m3k6qJ0
10380i1K9L3K2jj8k5k0qRK3K9K8K6J8Kj3j6oOMlm%LJpj5k3k6j8mKjMJ7K3J1ppNJ4PJNJ8K5
10360E2J8Mj4k5k6j3JOkj4k2j6kJ1K1K2J4ok7l2j6PJ5J1Nnj8k4j1J4K3J0rj3rmjLNKlpj7l3
10341a25l9k1PK1J5RJ3J9J7J5K2K6J5mj0lJpj5j0PK2J7N%OJ2Jj6k3j1KNJLJ0RLOK4L0J5j1
10322F3k0oPKj2j3lLlj3j6j4oKQ%j2j7nRNlPL7O3O2L5%k7l6l0k5l5m9m3j9JJMK5M4L1Kj6j4
10302b6pojJ0Oj0j8nJ4J8J0jnoKJ8K5J5lj6j7j2mMJj1j5jJ4J4NQK0K2%k8l6k5nQJ2J1J1J6
10283FK0J1JlLKoq%Kj0j8qJ2J9J1MJ2K3K2J4Pmj8k3lK7L2Ml1l7j8MJ0J1J0Jj5k6j9mJqj7k1
$$ y = [7, 25, 35, 42, 41, 25, 1, -20, -36, -44, -40, -25, -13, -20, -44, -69, -82, -86, -92, -102, -107, -88, -48, -11, -5, -26, -46, -48, -42, -40, -40, -32, -25, -32, -50, -63, -65, -66, -73, -85, -99, -115, -128, -126, -102, -63, -24, 6, 24, 27, 15, -4, -26, -40, -32, -2, 32, 46, 32, 5, -25, -61, -100, -127, -127, -111, -102, -102, -98, -87, -78, -73, -60, -34, -7, 10, 24, 45, 66, 62, 26, -24, -67, -93, -101, -91, -62, -29, -7, -8, -26, -51, -71, -79, -70, -47, -18, 10, 36, 54, 56, 43, 27, 21, 27, 31, 28, 24, 24, 27, 28, 21, 6, -17, -43, -61, -65, -63, -64, -60, -43, -20, -9, -16, -23, -18, -4, 3, 4, 9, 27, 52, 70, 74, 60, 35, 9, -4, -3, 3, 1, -13, -35, -51, -53, -42, -21, 1, 15, 9, -18, -50, -66, -59, -44, -33, -28, -33, -51, -75, -86, -72, -49, -39, -48, -61, -70, -74, -75, -72, -67, -65, -68, -75, -92, -125, -164, -185, -178, -157, -142, -133, -120, -101, -84, -69, -47, -21, -6, -10, -20, -23, -22, -29, -44, -54, -47, -25, -8, -3, -3, 3, 15, 16, 0, -23, -34, -32, -27, -26, -23, -13, -4, -1, 5, 29, 59, 74, 63, 43, 37, 44, 46, 34, 21, 18, 21, 18, 5, -11, -25, -31, -29, -21, -21, -33, -50, -55, -46, -41, -44, -37, 0, 63, 125, 160, 160, 133, 97, 67, 42, 7, -42, -85, -104, -103, -102, -98, -73, -29, 2, 4, -12, -26, -33, -39, -40, -30, -24, -34, -52, -57, -43, -25, -15, -16, -21, -27, -25, -7, 18, 33, 30, 14, -3, -15, -19, -15, -14, -25, -40, -41, -27, -13, -8, 0, 20, 42, 42, 14, -22, -47, -52, -44, -32, -21, -10, 6, 26, 37, 38, 35, 38, 40, 34, 26, 26, 28, 18, 0, -8, 4, 23, 34, 38, 50, 73, 95, 109, 116, 112, 94, 71, 68, 95, 127, 131, 100, 63, 45, 49, 59, 70, 80, 81, 66, 40, 21, 17, 18, 10, -7, -28]
10264b8k4k6j7NK9M0L7K7J0j2k9k7j5kKLOOlj1lJ9L5L2J7QJj7m2m5j9K1L9L4J3j4l9m9l8j4
10247i0LPJ3K2J6j3m0l5kL2M4L6J8Jj3k7l8l9k1PK2J4lrmkjLQQ%%ORM%NRKppJ3M3N9N1J6k1
10226I9l6k5jK2M2M8K9j5n7p2n8m0k4j0LJ3J0MlnlLP%j9l5l5j4J8L8L6J7MQJ8J7LpkLrl4m8
10208a10l4oJ2PqqJ0K2J1j7l0j5J3L2L4K6J4KmKJ3J2jj6k0j3m%mrj2nNJ0RQJ1J5J0%nOK6M0
10188B9M1K4kk1k8j8kJ2J3PMJ0J4%k5m2l0pJ3J9J8Qqk1j7nJlj2j8k6l7l7j9NK3K6K8K8K7K4
10171dJ8Rpj6j5opj6k3k0j7j5oJ1K1J5krjJ4K3K1Kk2k8j2J2J8Nj6k7k7j3PK0J5MPJ4Nj8k8
10152a14qK2L0J7KoqojOJ0J4J3Lj3j4QK8K5J1LLmj6j5kJ2J2Pkj7l1k4QL8M0K5J4Pok3k8j4
10134FLMrj8j3NJ7J0oj7j2oj2k2j7jJ2J8K5L0J7j2l2k2KJ2NNJ8K7J6qj6nRJ5J0%j0j5qJNK
$$ y = [-28, -52, -78, -95, -90, -61, -21, 16, 43, 53, 41, 12, -15, -30, -32, -30, -27, -21, -15, -18, -29, -32, -13, 22, 54, 71, 79, 80, 63, 21, -24, -43, -22, 17, 51, 64, 50, 11, -38, -76, -90, -87, -80, -67, -45, -29, -42, -82, -117, -119, -87, -43, -7, 11, 12, -1, -28, -66, -105, -126, -119, -97, -83, -86, -95, -99, -101, -102, -99, -91, -83, -83, -83, -77, -68, -64, -64, -59, -50, -48, -55, -62, -49, -6, 53, 104, 120, 99, 63, 38, 37, 59, 101, 149, 178, 163, 106, 34, -24, -64, -88, -98, -95, -82, -72, -68, -71, -76, -79, -76, -69, -69, -88, -123, -158, -172, -154, -116, -80, -63, -59, -51, -33, -16, -13, -20, -22, -19, -28, -62, -110, -144, -150, -138, -131, -139, -147, -137, -115, -104, -121, -151, -166, -153, -121, -87, -61, -47, -45, -49, -47, -34, -22, -23, -39, -59, -72, -76, -76, -80, -89, -101, -106, -101, -91, -82, -74, -63, -48, -38, -38, -43, -37, -11, 29, 70, 94, 92, 71, 43, 25, 23, 35, 48, 55, 59, 69, 83, 83, 58, 16, -14, -21, -8, 11, 29, 37, 29, 8, -9, -14, -13, -16, -28, -46, -72, -109, -146, -165, -160, -137, -111, -83, -55, -28, -4, 14, 23, 16, 0, -15, -21, -28, -44, -67, -87, -104, -119, -125, -114, -93, -78, -80, -89, -90, -76, -53, -32, -30, -52, -80, -92, -80, -62, -57, -73, -100, -127, -140, -133, -113, -98, -94, -87, -73, -68, -86, -114, -122, -100, -70, -53, -51, -57, -65, -71, -72, -66, -56, -42, -29, -26, -39, -53, -45, -17, 8, 19, 22, 25, 21, 5, -10, -12, 0, 12, 19, 17, 0, -31, -55, -47, -9, 31, 56, 70, 77, 71, 48, 20, 6, 9, 13, 4, -14, -27, -22, -5, 5, -1, -18, -30, -36, -48, -70, -87, -88, -76, -58, -33, -3, 14, 2, -30, -52, -50, -38, -33, -28, -10, 17, 33, 25, 9, 4, 13, 28, 38, 38, 28, 13, 5, 6, 11, 13]
10115A3NJ8K2Oj8k6j4oj8k9k5qMOJ2K5L3K1%j6rMNj3l1k3OK5K1Nrj8k6k3oQJj2j1PK5L1K9
10096iK7K4K5L2L3J1k8m7l7j7qoJOlj2pJ0J4J0J0K0K0kk8l9l1j7qpj1j3qKNjnnpj3qRJ9J1
10077h8pj1%J1J7K6L5L0J0qnJ2K2K1Rpk5m2m7l9k3j1ppj1j5j7j1lMOJnlPJ9K4J9J8L0M3L5
10059GOk0k1jJ5J0kqqj1j3j0%PQQQJ0J2RLmojJ2K7K9J5nj7j9j9k2j9%K2K3ll5n3m6k5lJ5K4
10039a01K1QkkNJ3J3Lj1j9j1OJ7J1jrrqj1pNJ2Lj7k6j9j1mJ1L8N3L8Mj6j6pOK7M6M0%l7m0
10021dj8LJ7K7L4K0j2l8m4l9l1j8kRJ1J4K0J8Nj1j4kPRPKpj1KK8M2L5J0j1j9j4JJ4J7Oj1k3
10003B9k2j1lKLKNLmj1j2%J3Qrk4j4NQj0k4j7KJ7K4L5M2K9kk6k0KJ2Qkpon%NQjj3k1j5NK6
9982A4L5K3Jj2oPJ2Jj5k4j7njqj4j2kOJ0J3J0mj6j0J1J2j7n0m7oL1L7K0Opk4l8l6j9p%J5L8
$$ y = [13, 18, 36, 58, 64, 46, 20, 6, 0, -18, -47, -72, -80, -76, -70, -58, -33, 0, 21, 21, 5, -4, 0, 5, -8, -39, -62, -56, -31, -10, -5, -14, -32, -58, -81, -87, -79, -78, -90, -101, -94, -69, -38, -9, 18, 42, 67, 99, 132, 143, 115, 68, 31, 14, 6, 0, 1, 7, 4, -8, -15, -5, 9, 19, 29, 49, 69, 67, 39, 0, -31, -48, -56, -63, -74, -87, -95, -93, -88, -89, -94, -99, -106, -119, -127, -118, -99, -88, -95, -106, -106, -95, -78, -52, -17, 13, 23, 15, 10, 22, 44, 65, 74, 67, 42, 0, -47, -86, -109, -120, -127, -134, -145, -160, -177, -188, -191, -187, -181, -180, -185, -188, -181, -162, -138, -119, -101, -71, -28, 7, 13, -7, -28, -29, -14, -4, -6, -14, -22, -33, -46, -56, -56, -49, -41, -33, -25, -15, -3, 6, 9, 5, -1, -2, 10, 37, 66, 81, 76, 59, 40, 21, -1, -20, -20, 2, 25, 22, -13, -66, -112, -137, -140, -125, -101, -80, -72, -74, -76, -71, -58, -45, -42, -53, -72, -83, -77, -60, -49, -50, -59, -68, -76, -87, -94, -89, -77, -74, -91, -117, -136, -147, -151, -140, -102, -49, -11, -7, -23, -39, -46, -40, -13, 33, 73, 73, 36, -4, -22, -19, -2, 25, 59, 79, 67, 29, -15, -54, -85, -103, -105, -96, -85, -71, -51, -33, -28, -39, -53, -55, -48, -39, -32, -30, -37, -48, -46, -18, 24, 59, 69, 58, 39, 25, 26, 40, 57, 63, 52, 29, 7, -4, -7, -5, -2, 0, 5, 8, 4, -7, -19, -19, -6, 2, -7, -31, -45, -40, -32, -42, -66, -83, -81, -64, -40, -5, 37, 66, 64, 38, 18, 20, 32, 40, 38, 31, 25, 20, 20, 25, 33, 32, 19, -2, -17, -12, 14, 49, 72, 73, 61, 55, 62, 74, 75, 60, 36, 19, 14, 13, 5, -9, -21, -23, -17, -7, 6, 16, 12, -4, -14, -3, 9, -8, -58, -105, -111, -80, -43, -23, -17, -24, -48, -86, -122, -141, -148, -148, -133, -95]
9963i5L9J1j7j5PJ0qj5QL8M2J8j0k3j7NK2K3Ppj0pj3k0j2MJ3Omj0j5j8j4jKkjJ8L8M5L9K5
9945H6Mj8k7j9lNJ0J2Mj1j6%J4Mj5j2J0K1Lj8k8l4m9n5m2k0pPL4N5M6J2mJ1L3K9J2kpj3k1
9928ik7k4j3kQQJopNK2L8L9K4kj5j0jlj1j1nnpKK9N7N8K8rk8k7j8k1l2l9l9l3k6j4OK3K4K1
9908e1K6K7Ml7n8m0qOQK2M5M8J9j0j8qMKqk5l8m0k7oJ6L3L8K3rl6l5j5MQkq%J8L0K7J7RJ2
9890c3J4J3PNLmj3j8j5qqj2j6rOJ6Rj3k6k2oJ3L6N3N4L1kk0k4k0j5nQJ1RPRLojJ3J4mj5OM0
9870F5N0K8kk1l7n0m7k3OJ2LLJ2Ppj3NK0Ok1k8j2j0l2n2m2j8qj3j1JQRJ2J6J3joNJ6J1J%P
9851a38Pmj0lRJ9L0L8L2J1pnJ6L4L8K2kj8j6jOok6l4k2JJ7J8J2M%loqooj2j6j3jNkqJK1K9
9831cJ5jlNOqk5l3l5l8l6k2kPJnPK6L3J8lj0nKMKkkNK2L6K7MrJJ9J6kk2l2l0k5j7j5j1jK1
$$ y = [-95, -56, -45, -62, -77, -70, -60, -68, -83, -75, -37, 5, 23, 13, -10, -27, -22, 0, 23, 30, 23, 13, 6, -7, -27, -39, -35, -22, -16, -20, -30, -45, -63, -77, -78, -76, -78, -79, -61, -23, 22, 61, 86, 90, 72, 45, 26, 23, 28, 38, 50, 54, 43, 27, 27, 41, 45, 30, 18, 28, 49, 52, 34, 6, -28, -77, -132, -174, -194, -201, -194, -160, -105, -59, -47, -51, -40, -7, 22, 34, 32, 25, 12, -9, -36, -60, -73, -75, -67, -59, -58, -64, -71, -66, -44, -6, 33, 57, 55, 40, 30, 29, 26, 15, 4, -1, -6, -13, -11, 18, 75, 133, 161, 152, 124, 97, 79, 58, 26, -13, -52, -85, -111, -125, -119, -96, -72, -51, -25, 2, 6, -31, -89, -129, -137, -131, -123, -101, -56, -8, 11, 1, -17, -25, -21, -19, -27, -52, -90, -130, -157, -163, -147, -114, -76, -53, -62, -98, -133, -148, -144, -136, -138, -146, -146, -128, -98, -71, -54, -45, -33, -19, -6, 1, 6, 9, 5, -8, -26, -41, -49, -57, -69, -85, -94, -88, -72, -63, -76, -102, -124, -130, -117, -81, -28, 26, 57, 55, 35, 11, -9, -24, -29, -21, -10, -1, 6, 15, 18, 12, 11, 24, 38, 34, 19, 25, 65, 115, 143, 141, 120, 83, 33, -14, -37, -31, -19, -16, -13, -1, 6, -1, -14, -9, 11, 17, -4, -32, -44, -54, -86, -138, -180, -198, -206, -219, -230, -229, -221, -212, -200, -184, -171, -172, -178, -173, -157, -146, -145, -145, -138, -131, -135, -145, -148, -139, -120, -90, -52, -20, -9, -16, -21, -5, 29, 67, 89, 87, 69, 53, 52, 58, 52, 26, -8, -30, -29, -12, 6, 18, 22, 22, 19, 13, 5, -1, -7, -19, -35, -48, -49, -44, -46, -54, -53, -32, -3, 12, 11, 8, 13, 19, 11, -14, -47, -82, -120, -156, -178, -180, -173, -172, -177, -170, -144, -111, -93, -96, -106, -111, -109, -105, -103, -105, -107, -102, -80, -44, -17, -13, -22, -21, -2, 14, 12, -10, -42, -72, -97, -114, -129, -140, -141, -120]
9810a20L3K3LpJNNJ1K5K7J3JNJ7J9Prk7m7n4l4KK9L6L4K2Lk0j9mJ0RMOJj2j7p%ppJ4K8J4j6
9791@k1jJ1kj4mJ7K3J4Lj1k1k3pJ0Oj6l1k2oLkojJ2K1K0Qpj7j4LK7M0L3J3rk2k4k5j8j0rj3
9772i2j2NK9L7K4OJLJqj2jNnk4l0j9rj0j3oJ1K2K3K0J8J7J5Mj8l4k1J6M0K1j4j9J4L6K4%J
9754D6J4Nk2k9pJ6J7POJ0%k5m4m6l4j7JK0L3L1J8%j4k7l3k6nK0L5K8J2MJ0K1K0Kk0k7j9j4
9736c3k0k7j6J3L9L9K0Jj0k0l6n0n2l7j1J5K8L1K5K0K0J9J7J2NMQRj0l5n1l5lJ5Pj2j6KK8
9719i7K9Lk9l5j0J9L5L5L6L0K0Qmk2n0n9k3L9P4N9K2oq%Olk7m7m7l3l2m3m2j4J8K4J4J5L5
9703a10M5K5rl2l0rRJ1Kpj2j6j3JJ3Lk3l0jL3L5J0nRK9L3K7K2K1J5kj7k2j1NPmj7k1j7j5o
9684g4J1K5K1J1J0J9J5kj4j3rj3pPJ3Lpj3j2j4j0kpk8m4l8j9qjJ6L0K6Kj8j4RL9N4M5K1J1
$$ y = [-120, -87, -64, -61, -68, -67, -62, -57, -46, -21, 6, 19, 20, 25, 42, 61, 68, 59, 32, -15, -69, -103, -101, -72, -36, -2, 20, 23, 3, -16, -20, -10, -1, 3, 9, 10, -2, -19, -26, -26, -33, -40, -26, 2, 16, 0, -21, -22, -11, -13, -27, -31, -14, 9, 23, 26, 15, -6, -29, -36, -26, -20, -36, -67, -89, -95, -92, -94, -100, -101, -89, -68, -48, -40, -47, -64, -78, -75, -48, -8, 25, 38, 29, 7, -17, -42, -60, -70, -79, -92, -104, -99, -70, -33, -9, -3, -2, 1, 2, -6, -18, -19, -14, -19, -43, -73, -92, -101, -111, -124, -130, -119, -97, -74, -54, -36, -19, -4, 0, -18, -52, -73, -57, -17, 4, -10, -29, -15, 21, 45, 45, 46, 60, 65, 43, 14, 7, 23, 40, 47, 53, 63, 63, 38, -6, -52, -86, -103, -102, -82, -49, -18, 0, 0, -14, -41, -74, -100, -105, -85, -50, -22, -10, -6, 4, 25, 45, 47, 27, 0, -19, -33, -53, -80, -96, -83, -44, -5, 15, 16, 6, -14, -50, -100, -152, -189, -200, -185, -157, -126, -101, -81, -61, -42, -25, -13, -8, -4, 4, 13, 3, -32, -83, -118, -121, -106, -99, -111, -127, -125, -97, -68, -65, -94, -129, -139, -120, -85, -50, -14, 16, 36, 44, 40, 18, -32, -91, -114, -75, -1, 58, 80, 74, 66, 66, 72, 69, 42, -5, -52, -85, -117, -160, -202, -216, -198, -174, -160, -145, -110, -65, -40, -49, -81, -111, -120, -111, -100, -98, -105, -117, -133, -146, -145, -132, -129, -152, -182, -183, -150, -115, -105, -110, -101, -72, -39, -12, 10, 31, 46, 44, 27, 5, -6, -1, 6, 2, -15, -36, -53, -68, -74, -63, -38, -17, -6, 4, 23, 38, 36, 22, 9, 0, -13, -20, -13, 0, 3, -4, -17, -29, -43, -53, -55, -62, -90, -134, -172, -191, -199, -200, -184, -154, -128, -126, -144, -158, -149, -110, -56, -11, 10, 21]
9667B1J8K8K0QOJ2Orj1PK3J9jj9k4j8pNKj6l3l3k1j5k2k7k0JK0K6J8Noj0j0opj4k1j2J2L0
9648g5K6PnlQK3L0J9j1l5l1mJ8J8J1J0J5Rnj0kRJ4Nj0k5k6j2OJ5J1M%lnoMJ4J8J1LLMMNRO
9628G1j2l6m1k6kJ7K9K9J5j1k2j2Jjj9k9k7j5LK5L5K1KMK2L4K5J1%oj0oJmj7k6j9mRK3K4O
9610F2k0k9k0j7k5k6j2JJjNRRJ1J9J7lk5k7j4mJ%nmJ5M2N0L4J5J1J6J9K6K5lm6n2j4K1K2K6
9592A10O0R3J22K20M01M90L01r7m02m25k73j64j53j49j00m2lK5M5L4Mj1njj3k1j2jOJ4K1J7
9578I1ONJ4K0J4Lqk2k9k4j4j0j3j6k8n0n3j8K7L9J5j0j5j1j0JJ4J2j1k8j7J0K9L4L6L2K5J1
9561E1mk3l0j8PK0J7QRPmj6j6j2j1rlmj3j8nQMj4k2j0J0K2J8Onrj5k5k7j6jLLJ7M2M9K6mj4
9542b1qnqj1j6k8m0m2l3j6RL7N1M7L6K8J8ok4k1kOjkNRMOK1L3L3L0L4L4J9pk4j9%Qlk2k7j1
$$ y = [21, 39, 67, 87, 95, 101, 113, 119, 110, 99, 106, 129, 148, 147, 128, 104, 86, 79, 84, 86, 70, 37, 4, -17, -32, -54, -81, -101, -100, -80, -54, -36, -31, -37, -47, -57, -63, -70, -84, -105, -117, -105, -75, -49, -42, -47, -50, -42, -19, 11, 30, 19, -16, -47, -51, -33, -15, -4, 6, 21, 30, 25, 15, 13, 22, 36, 41, 31, 6, -20, -32, -26, -11, 0, 4, 4, 1, -4, -10, -6, 8, 26, 37, 40, 43, 47, 51, 56, 65, 71, 59, 23, -18, -44, -46, -29, 0, 29, 44, 33, 11, -1, 0, -1, -20, -49, -76, -91, -88, -63, -28, -7, -5, -1, 21, 55, 80, 91, 91, 85, 75, 69, 70, 66, 49, 23, 4, 0, 9, 32, 56, 62, 42, 13, -7, -24, -49, -75, -87, -86, -85, -86, -81, -72, -63, -52, -33, -16, -19, -44, -71, -85, -89, -88, -88, -93, -97, -82, -40, 10, 44, 59, 70, 86, 105, 131, 156, 153, 107, 55, 41, 62, 84, 110, 170, 263, 385, 605, 1006, 1496, 1797, 1700, 1298, 873, 600, 436, 283, 134, 34, -8, -11, 14, 59, 93, 97, 86, 81, 80, 67, 46, 34, 33, 39, 53, 74, 91, 97, 102, 116, 136, 150, 153, 145, 123, 94, 70, 56, 46, 33, 17, -11, -61, -114, -132, -105, -66, -51, -61, -76, -87, -97, -96, -82, -70, -81, -109, -126, -116, -87, -53, -17, 15, 40, 51, 47, 24, -6, -24, -17, 3, 20, 28, 37, 44, 40, 24, 8, -4, -15, -24, -27, -31, -44, -62, -67, -59, -55, -69, -91, -101, -91, -69, -51, -45, -50, -59, -74, -99, -126, -142, -143, -140, -137, -120, -78, -29, -3, -7, -21, -29, -34, -42, -53, -69, -97, -137, -179, -212, -228, -219, -182, -131, -84, -48, -20, -2, -8, -32, -53, -55, -49, -50, -52, -47, -38, -34, -28, -7, 26, 59, 89, 123, 157, 176, 169, 145, 126, 126, 134, 131, 109, 82, 71]
9523G1MKj3j7j2j6k9l1j4NJ0ONPL%%%lqmJkj0j2lLLjkloj2j2q%NP%j2k1j5J3M4N4L3Jj7j4
9501b0KJ4J0%qj3j3j3j4j0moj6k0j0OQ%MJ7K1QlNJ6J3%j1j6j9j1J3L8M0K3Nnj9l6m7l2pJ2
9483i8J7K0K2J7kj9j9OM0N5M0RpmJpj5lK1K8Qj4j5pj0k3k3j3oj2oJ5K6J1k2l5k3LJ5Qoj2j
9464d0J8K2J4kj2j8k9k7qJ9L5L1J9Nj0j7j1qj3j5JK2K5J6K1L8L9Ml2l6qJ7J8Nj0j7j3lMK%
9446D6mj4k8k7lJ5%k8l3rJ8K8K2Rj0j9oJ5J7mk5l0k9l6l8k3LK2K1Rpj5j1QL3M8M6L0RjQL2
9428C9M3K5j3m5n2m3l2l0k9j1K2M8M8L0J9J2lk8l9k8j0lKJ5K5J9KojMLpk0k7k3j2lpj1pMQ
9410a22PKnpOL3N1M1J9PQP%LJ8K9J8kk5l9l9j4K1M1L1QljKmj0j2j3k0k8l8m2l6j4J4L1K7J2
9391c8MJ1K0J5%j9l1l1k1j0JPRJ3K1K6K3J8J1Lnr%J2J5jk2l4l3j7JPok4k9j8pnrrJJ1J5Rm
$$ y = [71, 75, 77, 64, 47, 35, 19, -10, -41, -55, -50, -40, -34, -29, -22, -19, -19, -19, -19, -22, -30, -34, -33, -35, -45, -57, -60, -57, -54, -55, -57, -60, -66, -78, -90, -98, -98, -93, -86, -86, -98, -119, -134, -121, -77, -23, 10, 11, -6, -20, -18, -4, 6, 6, -2, -15, -28, -41, -55, -65, -69, -75, -91, -111, -121, -115, -107, -107, -103, -86, -65, -57, -60, -55, -39, -26, -26, -37, -53, -72, -83, -70, -32, 8, 31, 36, 31, 12, -24, -71, -103, -110, -98, -81, -61, -39, -22, -24, -43, -62, -56, -16, 39, 79, 88, 81, 77, 78, 71, 56, 53, 74, 102, 110, 96, 81, 74, 64, 41, 18, 5, -1, -13, -19, -4, 22, 33, 11, -24, -47, -44, -29, -21, -27, -39, -40, -22, 0, 14, 12, 0, -18, -47, -74, -82, -63, -28, 3, 22, 27, 17, 0, -11, -19, -32, -47, -46, -24, 1, 17, 38, 76, 115, 119, 87, 51, 43, 60, 78, 83, 73, 56, 43, 40, 44, 46, 46, 42, 28, 0, -27, -30, -15, -15, -43, -76, -85, -67, -39, -17, -8, -18, -37, -43, -28, -11, -15, -40, -70, -99, -135, -173, -196, -193, -171, -150, -141, -148, -163, -174, -166, -133, -85, -39, -9, 0, -1, 7, 39, 82, 107, 94, 49, -3, -46, -78, -108, -137, -148, -126, -78, -30, 0, 19, 31, 28, 0, -39, -67, -77, -80, -78, -63, -38, -19, -17, -23, -24, -20, -17, -24, -44, -71, -94, -106, -109, -116, -127, -134, -130, -122, -115, -113, -118, -125, -119, -86, -35, 6, 25, 32, 40, 47, 47, 50, 68, 97, 115, 113, 88, 49, 10, -4, 17, 58, 89, 97, 94, 93, 95, 91, 81, 69, 56, 36, 8, -30, -72, -108, -122, -108, -77, -50, -38, -34, -23, -3, 12, 12, -7, -38, -69, -90, -100, -99, -92, -83, -70, -49, -23, 0, 18, 29, 32, 27, 18, 18, 30, 45, 44, 22, -12, -45, -62, -61, -54, -60, -84, -113, -131, -138, -143, -152, -161, -160, -149, -134, -125, -129]
9372a29j3oJ2K4J8OKJ0K4K8J2j5l6k7KJ9J0m%J9L0J9Pkpj4k3k5k2j8nJ8L5K7Lj4j5j0j1j6
9354h7j3n%kmOK1L3L9M6N9N6K9j2l4k4jRjj3k4l4m3m0k7j5o%J3J8Nj2qJ9L4J9j0k3j1OJ0%
9336b7qj0lMMrk0j6jMoj1J0M9P0N5J4k1l1j6%pl2n1m1rK1L5L5K6J5J1J4J4kk9m4m0k7k4k3
9318a27j0K0M3M8L1J2mj3j6j7j2kJ2J1pl3m0k3MK2K9K9K9K5K2K1K1J8Poj8j8pRJ0pl0l3k1
9302b1j0oJK0K8J4j9m3m3l2k0rloj2pJ5L7M8N5O0N8L4%k1k0j4qljok1k9k6k3k3k1j0MJ1J5
9284e7K3K9J2j6l9l1qMMJ0K6L6K6Qpj6k3k9k8k3k0k1j8lK1M4N4M4J8nj7j7j3lJ1K2J6Kpl%
9266Foj7j6q%nj2rJJ0Kj5k3j1PJ1LLK0L4L3K7K2Rj0k6k5j8k0j5NK2Pl5n7l7LK6K3J1MPJ6K1
9247c2J7QJLOQMKKNRPmj2j2jNjj1j9k5k4k0j3j0pLJ6K4K1J2Mqj7j2NJ5Pj1k2k1j7oRJ9J4J0
$$ y = [-129, -142, -148, -136, -112, -94, -88, -86, -76, -52, -24, -12, -27, -63, -90, -88, -69, -59, -63, -63, -44, -14, 5, 12, 10, 3, -11, -34, -59, -81, -99, -104, -86, -51, -24, -21, -35, -50, -60, -71, -87, -100, -105, -105, -107, -111, -105, -84, -51, -12, 34, 93, 149, 178, 166, 132, 108, 107, 116, 115, 102, 78, 44, 1, -39, -66, -81, -87, -87, -74, -56, -51, -63, -71, -52, -18, 1, -9, -32, -43, -37, -27, -27, -35, -45, -48, -44, -40, -49, -69, -85, -86, -82, -88, -99, -89, -40, 30, 85, 99, 78, 47, 31, 31, 24, -8, -59, -100, -109, -88, -53, -18, 8, 23, 34, 48, 62, 60, 31, -13, -53, -80, -104, -127, -137, -117, -74, -26, 5, 17, 13, 0, -16, -33, -45, -47, -35, -24, -31, -64, -104, -127, -123, -101, -72, -43, -14, 11, 33, 54, 75, 93, 100, 94, 76, 58, 51, 60, 70, 63, 33, 0, -21, -31, -37, -36, -16, 12, 26, 7, -36, -79, -111, -131, -140, -143, -149, -161, -168, -153, -116, -68, -13, 47, 105, 139, 139, 118, 98, 84, 76, 73, 72, 66, 45, 16, -10, -33, -56, -77, -87, -83, -72, -57, -34, -5, 7, -9, -48, -79, -87, -83, -79, -69, -43, -7, 19, 27, 20, 4, -19, -48, -76, -99, -119, -140, -158, -161, -140, -96, -42, 2, 20, 15, -2, -19, -32, -35, -24, -2, 14, 16, 9, 6, 6, 0, -17, -33, -41, -41, -46, -58, -67, -66, -56, -54, -69, -92, -103, -96, -85, -82, -79, -59, -25, 8, 35, 57, 66, 56, 30, 5, -13, -33, -48, -43, -21, -14, -49, -106, -143, -140, -114, -91, -80, -76, -69, -53, -32, -15, -7, -6, -3, 3, 11, 15, 17, 19, 24, 33, 40, 36, 24, 12, 11, 16, 15, 4, -15, -40, -64, -84, -97, -107, -114, -111, -95, -71, -50, -38, -34, -42, -59, -71, -66, -51, -44, -55, -77, -98, -115, -121, -112, -93, -79, -69]
9227f9J8K9K4Nj3j4opj6k5k1j0k%JRK0K9K7J6jj2j0NK3K4Rj0k3k8l3l2j9jJ0J3J2RRQmk9n1
9208a36m6j9LKjJ5L8L6J3moopjJ4J9Oj2k1k5k6k1j2nn%J8L6M1L7L4K9J2rj5kJ3J5Nrj5qJ0
9189a5K7L8L6K3R%jKKjlnooJQ%k1m0m7m0j8K1N9O6L1j2l0j9pj1k1k2j5nLJ1J4J5Rjj2j6j4
9170a3j1mNJ5J7J1QK1L7L6J6rk2k6l3m1m0k4NK9M1M1K9Qj7l8m1k9rJ2K6K1jl0m8m6l4k2j1
9153a71%J0K1L2L6K2nj8j9k4l6l1QM6M1Nj8j2nj3k4j8mQK0L6M7M1K1LppjKnk4l4k6j4rjK2
9135a05M8M8K0rj6pNQNKJOJ2J9J7Mj7l8m3k7MK9L3J4rk3j6NK7L4K8J0j5l7m2k8lJ4J4QQJ5
9117CK4K1J5J0Lj1l5m8m3k1KJ3Lk1m6m3qL6N7M7K4Lj7k9l0k2j6j5nJ4K2J8J7K6L1J4j6k9k6
9100g8j9j3lRJ6K2L0L5K4Omknj7k6k1JK8M9N1K5j2k5oJ7J4ok0j8j6j3lOlk9m8m1k4j1kRJ9
$$ y = [-69, -51, -22, 2, 7, -6, -20, -26, -33, -49, -74, -95, -105, -107, -107, -106, -97, -77, -48, -21, -5, -6, -18, -28, -23, 0, 24, 33, 23, 0, -28, -61, -93, -112, -113, -103, -90, -78, -69, -60, -52, -56, -85, -136, -182, -201, -198, -196, -197, -182, -144, -108, -95, -99, -105, -111, -118, -119, -105, -86, -80, -92, -113, -138, -164, -185, -197, -202, -207, -207, -189, -153, -112, -75, -41, -12, 0, -9, -24, -26, -13, 2, 7, -2, -17, -25, -15, 12, 50, 86, 109, 118, 118, 117, 119, 121, 120, 117, 112, 106, 100, 101, 109, 109, 88, 48, 1, -39, -57, -36, 23, 89, 120, 108, 78, 59, 52, 41, 20, -2, -17, -22, -19, -8, 6, 21, 30, 29, 17, 1, -13, -24, -28, -23, -8, 9, 20, 28, 49, 86, 122, 138, 129, 107, 81, 48, 7, -33, -57, -52, -23, 18, 59, 88, 96, 79, 41, 0, -29, -38, -26, 0, 21, 20, -10, -58, -104, -138, -160, -171, -171, -161, -140, -108, -72, -50, -55, -73, -92, -116, -152, -183, -175, -129, -88, -83, -101, -113, -118, -131, -155, -173, -177, -169, -149, -113, -66, -25, -4, -1, -8, -15, -16, -14, -19, -43, -77, -103, -117, -126, -127, -105, -57, -9, 11, 2, -14, -21, -16, -8, -3, -1, 0, 6, 18, 37, 54, 58, 41, 3, -40, -67, -63, -34, -1, 13, 4, -19, -35, -30, -3, 31, 59, 69, 54, 17, -25, -53, -56, -42, -28, -20, -12, 3, 27, 48, 63, 73, 76, 65, 30, -18, -61, -82, -80, -67, -64, -85, -131, -174, -182, -146, -89, -42, -18, -15, -32, -61, -91, -113, -129, -144, -149, -135, -113, -95, -78, -52, -21, -7, -23, -52, -78, -97, -110, -113, -104, -88, -66, -36, -1, 23, 29, 25, 23, 18, 1, -25, -46, -45, -17, 32, 83, 108, 96, 71, 65, 82, 96, 90, 70, 52, 36, 23, 20, 26, 23, -6, -54, -95, -119, -130, -132, -123, -104]
9082a04J4JrqjQK1L3L5K8K0J1nk3k4pJ5J8lk5l1k2j0KJ2K1K8L3L0J4j0k5j9rkMJ2J1rk6j9
9064b0J2L1K7Prj9k7l4l5k8j7KK3L7M2L7L2K1Noojoj5k0rRJ9J2mj8k2j9j7j9k0j4lJ6K9K8
9046AJ1qrNK6L9M0K4nl1l9l2k4k2j2RK0J0j1k8k9j6KJ6J3rk4j5MJ1LJJ1K0K0J2lk3l8l7j7
9028a34MK1L1L4K8J9J5J3Jj1nJ9K8Ll2l8k3j3k0k2kK9M5M0L0K2K0J6Nqk1l1l5k9j5LJ6K4K1
9012D8Rj1k7l3l0k4k2j7qLJ3J9J2j2m2m8k7KJ3RJ0J7J9J1LOK0L1L2K0lk5l6l0j2PJ6Qrj6j
8994a05K6M1L8K9K7K1Oj5k8l2k6k1j8k0k1j4%Nok4k4j1LRJ4K5L4K7Pj2j8j8j4qlnrpKNkj3
8976a55j4qkRK9M5M6L3K1J7Kk1l6l3k8k8j7K5P4Q8O5L6K2Qj5l3l3k1j4oJ1K5J9ql6m9m6l3
8959f1j2LNJmj0qOL4M7K5j3k5qJ2Nj7l1k7j5nLOOJ0J4J4PJNLj0k8k8j0J6L7L6J6nj2OK0J9
$$ y = [-104, -90, -89, -98, -106, -107, -99, -78, -45, -10, 18, 38, 49, 44, 21, -3, -10, 5, 23, 20, -5, -36, -58, -68, -66, -54, -33, -5, 28, 58, 72, 62, 37, 18, 9, 7, 11, 23, 34, 25, -1, -20, -8, 23, 50, 57, 48, 29, 2, -32, -67, -95, -112, -110, -87, -50, -8, 29, 61, 82, 87, 81, 75, 74, 68, 53, 33, 24, 33, 52, 64, 60, 42, 20, 1, -16, -35, -55, -69, -72, -56, -27, 1, 12, 4, -5, 0, 26, 65, 105, 129, 124, 93, 54, 22, -2, -24, -36, -27, -7, 3, -8, -36, -65, -81, -79, -63, -50, -59, -83, -98, -94, -83, -80, -79, -68, -48, -28, -16, -19, -42, -80, -117, -134, -130, -109, -78, -44, -16, 3, 18, 31, 32, 21, 16, 35, 63, 66, 34, -4, -27, -40, -60, -82, -84, -55, -10, 30, 60, 82, 102, 118, 123, 115, 94, 63, 28, -1, -16, -13, 3, 27, 48, 57, 46, 19, -14, -44, -68, -90, -107, -115, -112, -99, -80, -68, -80, -122, -170, -197, -195, -182, -173, -163, -146, -127, -116, -113, -107, -87, -56, -24, -4, -7, -32, -68, -98, -110, -103, -87, -79, -88, -104, -105, -79, -38, 0, 29, 56, 77, 83, 68, 40, 8, -18, -39, -57, -77, -98, -112, -112, -107, -113, -137, -161, -172, -169, -160, -146, -121, -87, -60, -53, -65, -83, -101, -115, -123, -126, -131, -140, -147, -145, -140, -142, -155, -169, -177, -179, -170, -141, -96, -50, -17, 4, 21, 23, 2, -34, -67, -95, -123, -140, -115, -41, 47, 112, 148, 170, 178, 163, 130, 97, 76, 62, 56, 67, 92, 111, 103, 67, 18, -28, -61, -73, -70, -65, -64, -68, -78, -86, -80, -46, 1, 26, 13, -12, -20, -8, -3, -20, -51, -78, -93, -98, -95, -89, -83, -73, -59, -45, -38, -37, -32, -29, -39, -67, -95, -105, -89, -52, -16, 0, -5, -17, -11, 9, 28]
8940B8QPJ3J0KLJ2J5Qlpj0j8l0m5n8n9l0J6M9N0K7OKRJ6J1jrmKok2k9k3k0k6j9QL2K2j1k6
8921a00j0J8K3J0%OJ6K0Rqj9j0J4L7L8J0k4l6j7J5L3L1J3pk8m7n5m2j9NK2L6M6M1K0rl2l5
8905c5k6j0LKJPK2K8Qk5n6n6k9PL2L6K8J9J2JrqLK0K6K1OqoQK0Rj5k3oJ3Qj8l4k7j3rj5j3
8886a01onj6k8k6j3JRJ0QJ0J8K8L1K6K1K0J6Qqj4j6j9k2j0K0N0N4L5Roj1j1qoj0k2k7k3oR
8868c1J4Mpj3rnopjJ1J8J2j0l5m2k3RK5K1J4J7K0J2NJ3K6J9pk2j4oj3k5j7J2M0M6L1Lj6j6
8850D7oKNJ1J3Jk2l2k3oJ0K8L7L0Mj5k0j9k4j9pj1l5n0k7J0J7jpJ0J8Jj4mJ6K4K0J9K2K9L6
8833F8M0L3J4pj6j4j1j3k5m4n3l5NL9M5K7pl9m4j7K2L1Jk2j3J6K6J8PKj0l1m6m4l0j1PK0K2
8816h9J9K2K9K6Ok1m4m4k6kJ3J7J5J0nk4l2k1kJ1J9L3M2L2Kj8j1J0K4J9Ooj2j7j5kK3M2L8
$$ y = [28, 36, 43, 56, 66, 68, 71, 83, 98, 106, 103, 96, 86, 68, 38, -7, -65, -124, -154, -138, -89, -39, -12, -6, -4, 5, 21, 32, 31, 22, 18, 20, 14, -8, -37, -60, -80, -106, -125, -117, -85, -63, -74, -100, -110, -92, -69, -59, -59, -53, -37, -17, -8, -16, -35, -45, -31, 6, 44, 54, 30, -6, -23, -8, 25, 56, 69, 62, 34, -13, -68, -110, -129, -124, -102, -66, -20, 21, 41, 32, 0, -35, -61, -71, -68, -66, -65, -58, -36, -8, 0, -25, -81, -137, -166, -159, -127, -91, -63, -44, -32, -31, -40, -48, -45, -25, 1, 22, 28, 20, 14, 22, 42, 51, 36, 13, 7, 20, 28, 10, -24, -51, -64, -73, -88, -101, -107, -112, -128, -156, -182, -195, -194, -185, -175, -167, -157, -139, -111, -80, -54, -33, -13, 3, 11, 3, -11, -27, -46, -68, -78, -58, -8, 46, 81, 90, 84, 73, 62, 54, 48, 38, 16, -11, -34, -40, -31, -17, -13, -20, -33, -42, -47, -53, -60, -61, -50, -32, -20, -30, -65, -107, -130, -121, -96, -75, -61, -44, -24, -12, -7, 6, 32, 51, 44, 22, 8, 2, -11, -36, -53, -41, -1, 45, 76, 79, 63, 47, 41, 43, 48, 59, 72, 73, 51, 19, -4, -10, 0, 28, 65, 95, 99, 84, 64, 45, 21, 2, -5, -16, -51, -101, -128, -118, -101, -102, -109, -99, -81, -80, -94, -98, -82, -58, -38, -19, 3, 32, 68, 108, 141, 155, 148, 132, 118, 107, 94, 69, 25, -28, -63, -58, -19, 26, 53, 46, 7, -37, -54, -32, -1, 0, -22, -35, -19, 7, 25, 32, 34, 24, -7, -53, -97, -127, -138, -131, -111, -89, -70, -48, -19, 7, 13, -8, -52, -96, -122, -124, -111, -94, -79, -69, -74, -98, -130, -151, -153, -142, -123, -90, -48, -16, -14, -32, -43, -33, -9, 10, 16, 10, -2, -19, -34, -36, -13, 29, 67]
8799F7J3olPJj8k5j1NJ7K2K3J8QLJoj7k1j8k3k9k5rNQJ4K7K3Jk3k4j4j3j8j0J1L1M2N0M1J3
8781A38k1k9j3nj9l3k9k3k8l8k3PK0QkPJ7Mj7j8NK3K7K4L0L7K1rl1l0j4llj0oJ4L5L7Qk6l7
8763ek4%J1Qmj1lJ7K7K4J1MPJ4K1K4J0j6l4k5MJ5jk8l7k7j8j2j5k1k4k0oJ3K6L6L6K3Mj4k3
8745c3k4j8nPJ8K5L4L3J0k9m7l4nJ1J3J0J2K1L1L6K3ql4l9k8j6mJ4K2Mk2l3k5j7k1k1j0KM
8728a43KOJ0J1J8M0O4P3N8L0Kj4k2k4k6k8k4j9j7k5k7k0qNJ1J1NlplJLMQJ0Lnj1j5j6j0LJ2
8709g7Nrk3k6j7KK6L5K9J3NKmp%K0L0K2nk4l0k3j4p%LONJ1J9J9Oj5k6k7k1j3LK4L4K9K0J9
8691A9J8Rlploj1j1ooj6j3QL4M3K2oj9j1MOj0l5n3m3qL3N0L6PrlJ1J2%oKJ4J0j2l0k4ML5M5
8671G1L0QJPJ2Npj3j3j1j0pJOlj9k9k3rlqoQJ8J7N%OQjj2j6j5k0l0l3k1%J3Oj2k0j0J2L0M4
$$ y = [67, 80, 74, 71, 78, 79, 61, 36, 25, 30, 47, 69, 92, 110, 118, 121, 122, 116, 99, 78, 60, 37, 8, -17, -26, -21, -13, 1, 28, 51, 52, 29, 5, -9, -22, -40, -50, -39, -8, 34, 84, 125, 138, 117, 88, 75, 70, 51, 18, -11, -34, -62, -100, -123, -116, -96, -88, -90, -83, -66, -62, -79, -97, -92, -69, -42, -18, 12, 49, 70, 61, 30, 0, -14, -17, -20, -30, -36, -22, 13, 50, 58, 32, -5, -29, -29, -18, -10, -14, -25, -28, -11, 16, 40, 51, 55, 62, 76, 97, 121, 131, 115, 81, 56, 60, 75, 74, 46, 9, -18, -36, -48, -63, -84, -108, -128, -134, -121, -95, -59, -23, 0, 4, -10, -33, -57, -75, -80, -73, -55, -30, 4, 37, 47, 18, -29, -63, -68, -57, -44, -34, -22, -1, 30, 66, 89, 81, 47, 8, -20, -36, -40, -26, -4, 0, -22, -55, -80, -97, -118, -139, -149, -147, -143, -141, -135, -125, -114, -96, -56, 8, 81, 139, 169, 171, 157, 135, 111, 85, 57, 33, 14, -3, -28, -55, -75, -83, -78, -67, -56, -51, -54, -61, -64, -63, -60, -56, -48, -38, -35, -40, -51, -66, -82, -92, -89, -77, -72, -81, -104, -130, -147, -145, -119, -84, -55, -42, -37, -35, -39, -46, -46, -26, 4, 26, 21, -3, -33, -56, -70, -77, -77, -74, -68, -63, -52, -33, -14, -8, -23, -49, -76, -97, -110, -107, -83, -49, -20, 0, 19, 37, 46, 43, 36, 33, 27, 16, 5, -1, -7, -23, -36, -28, 6, 49, 71, 65, 46, 35, 39, 45, 35, 0, -53, -96, -104, -71, -21, 15, 22, 13, 10, 21, 33, 33, 27, 29, 43, 53, 41, 11, -13, -9, 26, 71, 101, 109, 110, 117, 129, 134, 127, 114, 101, 90, 80, 73, 74, 80, 77, 58, 29, 6, -3, -6, -14, -20, -12, 6, 23, 28, 28, 34, 42, 41, 29, 13, -2, -22, -52, -85, -106, -106, -93, -87, -99, -119, -129, -117, -87, -43]
8651d3N4N9M6J6j3k6k3j1KQLmj0j8l6n0m0oJ7J0j0qJ0J4KjJ7L2K1JkJ5K6J2j3k9k8k0j2KJ9
8634a7K8J8pl4m4l5j8lPJ0J3J6J3Lj1j4LK4L3K6K3K6J7j7n0n0k3PJ6J7K1J6nk5k5nQMlmlo
8615e0pppj2rMJ7K0J9J8J3Jj1j0oqj7k0j5j2j2j0KJ6K5K5J6KkJ4K9K1rj9%K1J5j4k7k3j8k2
8597f9j6J4M9O2N0K4Jj1j4j7k5l1j8J3L9L8J7KNOqk5l3k6j9oJ0K9L2K3J8K2K4J0j1k0k0k7
8581I2l5k2J3L4K1j1j8lPnk0k3j7j3pPJ9J3KPK0J9kj6j0jj0l5m6l3%K8M2M0L1J6Kop%NMk%
8562H0NOmj4j8j5oKJ1J3J1OMmj9k9k2o%pj6j0QK3K6J1j2k6k0jJ2J1OONKlqqqLJ4J4lj7j1K
8541fPLk%lj5k3j4MJ4J1jljkj4j9oJ8K4QpJK1K8K2J1lk6m1l0LK4J0j3k4k1j8k2k3k1j6oOJ2
8522a53RQK2M0M5K7Lj3k1j9j2omqj2j1mJmj8k1%K8L0J2NK5M0J6j9k4J3M5L4nl3k5JK1K1J5
$$ y = [-43, 11, 70, 116, 132, 119, 93, 70, 59, 61, 69, 72, 68, 58, 40, 4, -46, -86, -92, -75, -65, -75, -83, -73, -59, -57, -58, -41, -9, 12, 13, 11, 26, 52, 64, 51, 22, -6, -26, -38, -36, -17, 11, 29, 22, -12, -56, -91, -109, -112, -105, -95, -82, -66, -53, -50, -61, -75, -72, -48, -15, 11, 34, 60, 77, 60, 10, -40, -63, -56, -40, -23, -2, 14, 9, -16, -41, -46, -38, -34, -37, -41, -44, -50, -57, -64, -71, -83, -92, -88, -71, -51, -32, -14, -1, 0, -11, -21, -27, -35, -52, -72, -87, -99, -111, -121, -119, -103, -78, -53, -37, -35, -37, -23, 6, 27, 18, -1, -1, 20, 35, 21, -6, -29, -47, -69, -85, -71, -22, 40, 90, 114, 115, 104, 90, 73, 48, 17, -1, 12, 51, 89, 106, 108, 113, 119, 111, 86, 53, 27, 8, 2, 12, 41, 73, 96, 114, 136, 160, 170, 159, 139, 119, 92, 57, 35, 48, 82, 103, 92, 74, 71, 78, 73, 53, 30, 13, 0, -7, 0, 19, 32, 34, 41, 61, 80, 78, 62, 52, 51, 41, 6, -40, -73, -73, -45, -3, 37, 68, 84, 86, 80, 73, 73, 78, 82, 80, 80, 85, 91, 87, 73, 55, 40, 34, 36, 47, 60, 71, 77, 81, 77, 58, 29, 7, 1, 1, -6, -22, -32, -24, -1, 25, 36, 24, -2, -22, -23, -11, 0, 6, 12, 17, 19, 16, 8, 0, -8, -5, 9, 23, 20, 3, -8, -6, 1, 4, 2, 2, -1, -16, -39, -53, -49, -35, -24, -25, -28, -29, -31, -45, -64, -70, -52, -28, -20, -27, -26, -5, 23, 45, 56, 53, 27, -14, -44, -41, -17, -7, -20, -44, -65, -83, -105, -128, -149, -165, -171, -165, -153, -144, -136, -114, -74, -29, -2, 1, -12, -33, -52, -64, -70, -74, -82, -94, -105, -109, -108, -112, -130, -151, -151, -123, -93, -81, -76, -51, -11, 5, -14, -38, -25, 20, 54, 49, 16, -9, -8, 13, 34, 49]
8504D9K0L5L5J5orok0m2m1j7NQLKnj7k2j8j9k8l0rJ9L2K7J7Oj%RRpl5m8l9j7OJ2lk4k2J4N1
8485a11N4K6LKJ2J8J8J7RjnKJ0Rjn%OJ1J1QNJqj7j7j3j0j8k5k3j1NJ7K1J2nk0k3j1KJ1J3P
8466a4%JROj1l2l8l4l2l0j6OJ6J3J4K1J9J2J0K2L4L0K5K2J7Kj2qNJ4J0ONMkj2k8l5k5oMnj2
8447b5pK%nmMJ0J4K1J8ol0k8mP%rj2j7k5j8OJ7PmQK9K8J1%LJ0J7J9J0j2l4l6k1jJ4K6L4K7
8428D4Mk1l3l3k6j3JPLJQJ9K8K9K8K9L0K3Nj8k2LL0K8pl4k1RK4Pj9l3k5pJ0J5Pj%Mlj5j5p
8409D3ornRJ3KqjJ0%k6l9l2j6j3j5j8j8k1j3RL5M5L8J7nj8k1j3j0j8k9k8j3NJ4J5J5J2J4K4
8391g5L6L6J7oj6j6j0lKJ3K2L1L3K1Lqqprrljj5k5nK6L5Jm0n0l4j0OJ8J9Oj2j2jMjjNKj6k6
8371h3j7jJ5K9M1L1nm1m9k3OK5L1K7Qj5k8k1jK1L6L6K1N%Klj8k6k2j7j4pNJ2J1N%qj4qJ0K3
$$ y = [49, 69, 104, 139, 154, 148, 139, 133, 113, 71, 30, 13, 18, 26, 29, 31, 26, 9, -13, -31, -50, -78, -108, -117, -98, -66, -39, -22, -16, -17, -17, -8, 1, -6, -41, -89, -128, -145, -139, -127, -130, -154, -176, -162, -111, -57, -31, -28, -26, -14, 4, 22, 39, 48, 47, 42, 44, 54, 63, 62, 57, 57, 63, 74, 85, 93, 98, 99, 91, 74, 57, 44, 34, 16, -9, -32, -43, -38, -21, 0, 12, 7, -13, -36, -47, -45, -34, -21, -14, -14, -13, -4, 2, -9, -41, -79, -113, -145, -175, -191, -185, -169, -156, -142, -121, -102, -90, -80, -58, -24, 6, 31, 53, 70, 72, 60, 52, 57, 71, 81, 87, 92, 96, 94, 82, 54, 19, -6, -12, -8, -13, -25, -32, -30, -30, -35, -39, -35, -25, -11, 10, 28, 22, -8, -36, -40, -33, -33, -42, -54, -71, -96, -114, -108, -91, -84, -88, -80, -51, -23, -12, -12, -9, 1, 18, 37, 47, 35, 1, -35, -56, -57, -43, -17, 17, 44, 48, 27, -6, -39, -65, -78, -77, -70, -67, -66, -58, -39, -11, 18, 46, 75, 105, 128, 133, 115, 93, 96, 126, 154, 147, 113, 92, 101, 125, 132, 113, 80, 55, 48, 58, 73, 80, 79, 79, 83, 80, 65, 50, 43, 37, 28, 23, 32, 45, 47, 39, 38, 48, 48, 22, -17, -49, -65, -78, -93, -111, -129, -150, -163, -154, -119, -74, -36, -19, -24, -42, -63, -76, -86, -104, -133, -161, -174, -169, -155, -140, -125, -113, -99, -75, -39, -3, 14, 8, -8, -24, -34, -37, -35, -22, 0, 31, 64, 85, 88, 80, 72, 65, 56, 47, 44, 43, 28, 3, -2, 24, 59, 60, 20, -30, -64, -74, -68, -50, -31, -25, -37, -49, -50, -46, -47, -48, -43, -41, -57, -83, -100, -101, -86, -57, -16, 15, 10, -31, -80, -103, -97, -72, -41, -14, -6, -21, -49, -70, -71, -50, -14, 22, 43, 48, 48, 50, 47, 29, 3, -19, -36, -50, -57, -52, -40, -29, -24, -24, -32, -46, -54, -44, -21]
8353b1J7QJ4L0L2J4pj0LJ3J2kk1m0n3n4l3NL6M6L1J0qk0k4k1j0njOJ2J1Kllqj5oK5N6O2M0
8334A20J5kj4j5j0j0k5l9l1lJ5J6QJ1K1K8K6J7Lonj1l4n8n9k9KJ1PM%j0j3J0L8L3Mj5MK7J4
8317D5k6n3m5j8jQJ9L0K7J3j%RJ8J5KqpNJ5J9J5J0OknJRLj9l5k7JK4K8K3J1mk2l3l3k3j5j3
8298c4q%Q%j9l0j7J5L3K8K0K1K6J1j6k9j9qj4l1l8k4QL7M5L6K6K4K1PooOPoj4jJ7K3J5RQN
8279A36Krk3l7l4j2J0J5Nqj2rNK2L3K3lk5l6l3k2j0JJ1K2L4L2J0j1j4jJ1J3J0Kj2k7l6m1n1
8262f9n6m6k3j0nJQRj%J8M3N4M1J4j4k8j8NJ3KJK1L8L0J4J8L9M4J8j9l7l9l8k8lK2K6kl3l1
8244b1oJ5J2rk3l0l5l0pK2L1J4mmLmj6j6pkmKJ3J9J5J3J8J6LqpLJ1J6J6J1JjPJ8J9Kk4m6n3
8224e7l7lK3L5L5K6Pk6m2k6J6M3L4RokOOok6l6l1rJ2J1pk1j2PJ5Mj3j0RL3M8N4M7K2j1l8m2
$$ y = [-21, -4, 4, 18, 48, 80, 94, 87, 77, 80, 93, 105, 103, 82, 42, -11, -65, -98, -93, -57, -11, 20, 30, 22, 2, -22, -43, -53, -58, -59, -53, -41, -30, -28, -31, -34, -42, -57, -63, -38, 18, 80, 120, 135, 133, 119, 104, 94, 84, 59, 20, -11, -14, 1, 17, 25, 36, 57, 85, 111, 128, 131, 125, 120, 109, 75, 17, -42, -71, -69, -58, -51, -47, -47, -57, -70, -60, -22, 11, 15, 0, 4, 31, 45, 19, -34, -79, -97, -98, -90, -71, -41, -14, -1, -2, -2, 7, 25, 40, 42, 34, 27, 32, 47, 66, 81, 91, 97, 95, 90, 91, 100, 103, 84, 49, 22, 23, 47, 75, 98, 109, 105, 83, 50, 17, -6, -21, -34, -42, -42, -34, -34, -53, -83, -100, -85, -52, -24, -4, 17, 43, 54, 38, 9, -10, -18, -32, -63, -101, -125, -117, -80, -35, 1, 27, 51, 72, 79, 73, 67, 73, 80, 74, 60, 59, 76, 99, 114, 123, 131, 136, 138, 129, 106, 69, 35, 23, 33, 48, 53, 45, 33, 24, 29, 51, 84, 107, 104, 79, 43, 10, -12, -22, -21, -10, 12, 46, 78, 88, 77, 63, 62, 73, 86, 96, 98, 86, 59, 23, -18, -69, -125, -171, -194, -204, -209, -208, -200, -191, -192, -192, -174, -131, -77, -36, -22, -36, -64, -82, -77, -64, -62, -61, -40, -2, 28, 42, 60, 99, 143, 161, 142, 105, 66, 28, 0, -3, 19, 45, 43, 10, -21, -27, -12, 0, -9, -32, -62, -97, -127, -134, -112, -81, -67, -71, -75, -72, -76, -92, -108, -115, -117, -121, -119, -106, -87, -72, -59, -41, -25, -22, -30, -37, -34, -23, -7, 9, 20, 21, 20, 27, 45, 64, 66, 42, -4, -57, -94, -97, -74, -39, -4, 22, 29, 3, -39, -65, -49, -6, 28, 37, 31, 29, 35, 41, 35, 9, -27, -58, -67, -55, -44, -51, -72, -84, -77, -62, -58, -71, -81, -72, -39, 9, 63, 110, 132, 121, 83, 41]
8206D1k7rj%knj2j7k7m2m9l3NL6M0K8J9K1K0J6J7K7L0J9lk3l6l7k6jK4K6Qj6j8lJ5J7Jj3j4
8188dj1rj5k1k1j6jJ7K9K5J4J3K3K7J3lJJ0Jk0l0j6J%j2k1j8j5j4j1OL0M9N1K8ol1k9j0J5
8171A9K7K5J0pj8j9j7k0k5k8k5j8nJ2K2K0Pnj1j1rjNJ1J3J1Opj9k0j3j1j8k7j4K0N2O0M0J2
8154B4pj7k7l5l5k4oJ5L0L2J8kj3j1KJ5K8L1K5Oj3j6kJ7L1K7J5Lpk0m1n1l6qNkrlKrk4k1l
8135a16J1PknPK5L6K8PjJ2K9K1jrlmk3m2m1j8J3M1N1M6K9J5ROL%j0l0m2l1mQol0m4l7j6NJ9
8116h7J4M%QJ3J5K2K9J9j0l2l2k3j7qQJ2LlJ5L4K2mj2QK7L1K2J8J2%j1j7k1k9k9k1j7k0j8
8099g5rJko%J5K7L5M4N2L7mn4q0p2l9mK0L1K8J8Lj1j8j9j0OK3K7J8O%pj1lJ2Qk2n3m7qK5L3
8080h5K7K3K0J6J6J9J6Kj5j9j1JJ3K4K7J0j8m3n0l9rK3L9L1J2mpLJ6K1J6J2J0Pql1m4m8m8
$$ y = [41, 14, 5, 4, 4, 2, -3, -15, -32, -59, -101, -150, -183, -178, -142, -102, -74, -55, -34, -14, 2, 19, 46, 76, 95, 92, 69, 33, -4, -30, -31, -7, 19, 27, 11, -7, -10, 5, 22, 23, 10, -4, -15, -24, -39, -60, -81, -97, -98, -81, -52, -27, -13, 0, 23, 50, 63, 60, 61, 71, 72, 52, 22, 6, 7, 7, -5, -26, -44, -59, -73, -84, -78, -48, 1, 52, 80, 74, 43, 14, 4, 19, 46, 71, 81, 74, 56, 37, 20, 0, -25, -53, -78, -96, -101, -89, -67, -47, -40, -45, -56, -67, -76, -77, -72, -61, -48, -37, -31, -38, -57, -77, -90, -101, -119, -146, -160, -140, -88, -28, 12, 24, 17, 0, -27, -62, -97, -121, -127, -112, -82, -50, -32, -34, -47, -58, -56, -41, -13, 18, 43, 49, 36, 20, 18, 35, 66, 93, 108, 111, 104, 84, 43, -8, -44, -52, -47, -49, -58, -61, -59, -68, -92, -113, -116, -105, -98, -100, -105, -98, -73, -37, -9, -2, -3, 9, 38, 59, 58, 49, 46, 42, 19, -23, -64, -82, -69, -28, 23, 69, 98, 113, 122, 128, 131, 131, 121, 91, 49, 18, 14, 22, 16, -14, -58, -95, -111, -106, -87, -73, -69, -69, -61, -48, -33, -11, 18, 37, 27, -5, -37, -60, -77, -85, -77, -65, -62, -65, -50, -16, 6, 2, -10, -2, 25, 56, 78, 96, 108, 108, 97, 80, 59, 30, 1, -20, -37, -57, -75, -84, -83, -85, -91, -91, -76, -49, -14, 30, 82, 119, 115, 61, -19, -91, -130, -134, -114, -83, -55, -37, -34, -45, -63, -82, -92, -86, -63, -36, -18, -12, -12, -19, -30, -33, -21, -13, -35, -88, -135, -143, -118, -85, -58, -35, -15, 1, 17, 36, 52, 54, 39, 20, 9, 10, 23, 47, 74, 84, 66, 23, -27, -66, -75, -52, -13, 18, 30, 26, 19, 22, 38, 59, 75, 87, 97, 104, 96, 65, 21, -27, -75]
8063g5l9j3K2M9N2L7J5nj6j5ooj4j2lKj%J2J7J1jj3l2n0m5j0K4L6L2L7M0L4K2J2j1n0p1m8
8046h2OL2K3J4K1K7J3%%OMLMmk6m1k9jJ4R%mqj4k1k2j4MJ8J8PLNOjqrj1j6j2LJ2RJ4L5M5K3
8026E5j2k0JRrj9LK9K6jk3k4k4l1l0j0J6K5J9J1J2J9K0J8K0J7Lj5k3j6onj1j3j1j5k1k6k4
8009h6k0j2%RJ6J8K2K3J7J0J0J3Oqj9j7j0rj2rmJNJ0J1JrnJ1K2J7J0POJlLJ2J0j0k8k1LK0
7990A2J8MonNJ6K1Qj7l8l5j5J2K8L9L8L4K8K3J4Jrj6k6m0m2k9j2mjRK0J7RJ3K6J9j6m9m7k0
7972a3%KnrrjJ0J5J2J7L0L6J3j8k9j9j6k8l1j2RJ3J0J4J4mk9l7j8OK3K8K5J0lmJ1K1J9J3%
7954F6k2m9n9l6KL0L8L5K9J9J2J5K1K5K0Pj4l5m6l3rRJ7J7J1pk5l1k2j7j7j4nkj3k6k6j4%
7937a49J5L1L7K4LqJRQ%pqjJ3K2K1J3Lmk1m6o2n2j8J4K4J9J9L5N6N3K1k8o1p2o1l3OM8O4M1
$$ y = [-75, -114, -127, -105, -56, -4, 33, 48, 43, 27, 12, 6, 0, -14, -26, -29, -27, -28, -28, -16, 1, 12, 11, -2, -34, -84, -129, -139, -115, -79, -47, -10, 30, 64, 86, 98, 87, 37, -34, -82, -76, -44, -21, -7, 14, 41, 54, 54, 54, 60, 64, 67, 71, 67, 41, 0, -29, -30, -16, -7, -7, -11, -19, -33, -54, -76, -90, -86, -68, -50, -43, -40, -35, -29, -30, -38, -47, -58, -74, -86, -83, -71, -62, -48, -13, 32, 55, 43, 23, 24, 33, 24, 5, 8, 37, 63, 62, 39, 15, -9, -40, -70, -80, -64, -39, -20, -9, 3, 22, 42, 60, 80, 97, 100, 85, 62, 46, 40, 35, 24, 11, 0, -15, -36, -62, -86, -106, -118, -118, -109, -93, -75, -53, -30, -13, -3, 7, 20, 26, 18, -1, -18, -28, -37, -49, -58, -62, -61, -56, -46, -35, -34, -43, -48, -37, -15, 2, 12, 19, 25, 26, 23, 26, 38, 48, 38, 10, -11, -8, 12, 30, 34, 28, 23, 28, 44, 65, 73, 56, 18, -17, -32, -20, 8, 47, 85, 119, 147, 170, 184, 185, 176, 160, 134, 94, 52, 23, 11, 7, 6, 15, 35, 52, 61, 74, 100, 119, 103, 54, 7, -13, -13, -11, -16, -25, -34, -35, -25, -10, 2, 19, 49, 85, 98, 80, 51, 32, 16, -12, -43, -55, -46, -33, -23, -9, 5, 1, -28, -65, -83, -77, -54, -26, -1, 9, 6, 2, 13, 34, 53, 66, 66, 44, -5, -64, -100, -98, -68, -30, 5, 34, 53, 65, 80, 101, 126, 146, 153, 139, 104, 58, 25, 16, 25, 42, 59, 70, 63, 38, 7, -15, -32, -49, -63, -68, -70, -83, -109, -135, -149, -149, -134, -103, -66, -42, -39, -47, -46, -37, -29, -29, -36, -44, -45, -32, -10, 11, 24, 27, 23, 2, -44, -106, -158, -176, -162, -138, -119, -100, -65, -9, 44, 65, 37, -24, -96, -157, -190, -184, -136, -72, -31]
7920c1Nj2kP%j2pJ5L2K8Qj5k2j2MJ5J6J2P%pj2j1j0j3j5rLJ1J5K0K7K6J5Mpj6k7k7rQJ6J1
7901B9J1J9K0ll3m5l2pRJ6J8K3K4K1J7J0LmnlJJpj6k0rJ5L4K9Jk9m1l3j8j3j5j6oRJ3lk5l0
7882i0pK7M9M9L6J6jj1qLMj4l9n1m5k5%J9K8K5J1krrqpqroNJ4J0mj6j1NJ7K0J0LKPPok4l3
7862g6k5j1JJ0J2Oj0k5l1k4j1RL0M6N3N4N1L7J3koqj7k7k9k2k1j9j0Jlj6j9pNOMPJ4K0L3M7
7844D0M1Pl3m6k8oLkpnLJ5J7jk3l0j7LJ1J1J5L1M4M4K9J1%j1k1k5j5nnnQK5K1ok2j4ll%K1
7825F7M2M0K5J6Oj3l0k2lmj9j5J2K0JqJ2K8Rj8j3J7K5jl3m0k5lJ4K4K3J9J3Jj8k9j8RL2M3
7808A86M4L6J8jj1j5j9k1j3KJ3J7K0K0RKQK5L7L8L1J9MNK6M8M9L6L8N7P8R4J18J51J85K17
7792A551K64L18L84M98O95R66J309J764K292K573K132Q32q32k066k458k203j749j353j033
$$ y = [-31, -26, -38, -40, -33, -33, -45, -52, -37, -5, 23, 31, 16, -6, -18, -14, 1, 17, 29, 36, 36, 29, 17, 6, -4, -17, -32, -41, -38, -27, -12, 8, 35, 61, 76, 80, 73, 57, 30, 3, -6, 2, 18, 29, 40, 59, 79, 76, 43, -2, -34, -41, -32, -16, 2, 25, 49, 70, 87, 97, 100, 96, 91, 88, 89, 90, 83, 67, 47, 38, 53, 87, 116, 117, 88, 47, 14, -4, -17, -32, -48, -54, -45, -32, -35, -60, -90, -97, -70, -21, 28, 64, 80, 79, 68, 60, 63, 67, 53, 14, -37, -82, -107, -107, -88, -60, -35, -24, -26, -35, -44, -52, -59, -67, -76, -82, -77, -63, -53, -57, -73, -84, -79, -62, -42, -32, -29, -27, -20, -13, -19, -43, -76, -101, -112, -111, -101, -89, -83, -93, -118, -149, -173, -184, -175, -145, -99, -46, 8, 59, 96, 109, 107, 101, 93, 76, 49, 20, -2, -23, -42, -52, -51, -54, -70, -89, -96, -91, -85, -81, -74, -60, -40, -7, 40, 81, 88, 55, 9, -19, -25, -22, -24, -31, -36, -33, -18, -1, -2, -25, -55, -72, -69, -58, -47, -32, -1, 43, 87, 116, 127, 127, 116, 95, 70, 55, 50, 45, 40, 48, 73, 94, 88, 66, 52, 49, 46, 46, 67, 109, 149, 174, 190, 196, 183, 153, 131, 128, 124, 105, 90, 102, 122, 123, 115, 127, 155, 164, 146, 133, 150, 175, 174, 141, 101, 76, 73, 87, 111, 134, 153, 166, 167, 149, 120, 102, 111, 143, 186, 230, 266, 284, 283, 272, 257, 238, 217, 204, 206, 219, 236, 256, 276, 285, 287, 295, 320, 357, 395, 426, 445, 449, 454, 480, 528, 577, 613, 651, 708, 786, 880, 998, 1149, 1334, 1551, 1815, 2133, 2517, 3015, 3710, 4676, 5985, 7749, 10041, 12614, 14746, 15578, 14746, 12680, 10222, 8019, 6270, 4917, 3884]
7784C884p62n58m18l15k31j76j46j22j03r9j01q6n4k1%J4J6Kj3j7j5k4m4n9o3n5l9j4J%mj
7770C77Kqj8pJ4J4ok1j1J7M7O8P4O7O0O0N5M8O1J03J38J44J61K28L28M35N78P95J083J444
7757F330J929K450K601J909L92j263k272k411k042j597j231r36p11n68m57l43k44j93j64j35
7748A044j15j18j16q6n4m5m8m1l2l6l1qQok8j5K4M6M0J9Pkj1j6j7j0QK9L2K3K0L1L3J9J2K5
7733E85M8N8O0O6P2Q1R4J13J22J36J87K74L71M85O56Q93J169J525K022K483K422J465j45j640
7722A3602k382k348j939j503j138q47o39n05l95k89k12j79j61j35j08q8p4o2o0o6n9l7k0k1
7712C35k6j7%Pmk9n0n6m9l9l5k9j0QJ9J5MnnQK4K7J5Mjqk0k0jJ4J1%OK0J7jj2kJ2J9J8J3j
7693A76rLJ9J3j7m1m1l0k5j7%J2Nj6k9k7k3k1k0j4KK3M0L9K4PlqrlRJ4QLJ2K6K7J1lqmMRJ0
$$ y = [3884, 3122, 2564, 2146, 1831, 1600, 1424, 1278, 1156, 1053, 954, 853, 767, 713, 692, 692, 706, 722, 724, 711, 694, 679, 655, 611, 552, 489, 434, 395, 381, 382, 382, 378, 377, 379, 371, 353, 346, 360, 374, 368, 347, 336, 353, 400, 468, 542, 609, 669, 729, 784, 832, 893, 996, 1134, 1278, 1439, 1667, 1995, 2430, 3008, 3803, 4886, 6330, 8259, 10709, 13310, 15219, 15611, 14348, 12076, 9665, 7623, 6026, 4795, 3859, 3148, 2580, 2123, 1780, 1536, 1343, 1179, 1044, 929, 811, 695, 609, 555, 510, 462, 421, 389, 353, 322, 314, 322, 316, 288, 273, 297, 343, 383, 402, 409, 407, 396, 380, 363, 353, 361, 390, 422, 445, 465, 496, 529, 548, 560, 585, 633, 691, 751, 817, 889, 970, 1064, 1177, 1299, 1435, 1622, 1896, 2267, 2752, 3408, 4301, 5470, 6995, 9017, 11500, 13922, 15387, 15242, 13602, 11220, 8872, 6933, 5430, 4292, 3445, 2806, 2301, 1906, 1617, 1405, 1226, 1065, 930, 822, 734, 660, 598, 538, 472, 413, 376, 356, 335, 309, 292, 292, 299, 295, 266, 216, 160, 111, 72, 37, 8, -2, 6, 25, 40, 44, 39, 34, 42, 66, 93, 108, 112, 111, 103, 83, 63, 62, 76, 87, 87, 93, 113, 130, 129, 117, 115, 127, 146, 164, 177, 176, 167, 170, 189, 202, 185, 144, 103, 73, 48, 31, 31, 43, 48, 32, 3, -24, -47, -68, -88, -102, -100, -77, -37, 2, 26, 33, 30, 22, 13, 10, 19, 33, 41, 44, 56, 82, 109, 120, 117, 109, 105, 109, 118, 128]
7674A28NmpLJ0Mk1m2l9j2J0Nj6l3m4m5l7j0K2M2M3M3N2N7M6K3jj9k7k2rkpj8j9j2omkKQJ2
7656E7J0jj6j9pQJ1Mlrj2j6k1k8k5pJ6L0K5Ppj7j1QK4K2MlPQj6m3m1j0J9L3L9M2K3j3l6k1
7638A5J3K6Pk2l1j1J4K8K5J4kk1l5k8jK7L8K6Oj7l6m2l4k4k1k0kK5M1L8K1Mj5k2j2jpk0j1
7621f7J9L4J3k1l1j6KJ2K2K9K3J2OJ0Mj2k3j5OJ7Pqj3pnj3k3k0pLMRK1L5L6K3OKPJ3Nk2m8
7602B9m8k5lNLPJ3J2Jj6k9m0l9k4oKKLJ1J3J0J3K3K8J8NKPPLJMOOPQO%nrj5k9l4k5nRJ1J2
7581f5K4L5K9Pj1j5qj2k1k2kK3L3J8orJ1L3L0Pprj3k8l5k1KJ3J8K0J6mk2j7lLnkJ2J2rl2l1
7563f3j3LJ2K2L1K8K2J6Rj1l6m8m5k7lJ6K3J9J4J2Lj7l5l0kK0J7mk1j7OK7K6J1mnkklRK4K9
7545A1K5J7J2PkpnLJj0k0j5JJ9K5K1K4L3L5K0rl9n5n2l6j4%Knj3j8k1j6mPOKPK3L6L9K8Rj3
$$ y = [128, 133, 129, 122, 125, 135, 139, 118, 76, 37, 25, 35, 40, 24, -9, -53, -98, -135, -145, -123, -81, -38, 5, 57, 114, 160, 183, 182, 163, 136, 114, 105, 103, 96, 78, 59, 47, 41, 37, 35, 37, 45, 57, 67, 66, 50, 31, 24, 32, 43, 47, 44, 35, 23, 7, -14, -42, -67, -74, -58, -28, -3, 4, -3, -20, -31, -23, 1, 23, 27, 24, 31, 39, 23, -20, -61, -71, -52, -19, 20, 62, 85, 72, 36, 15, 28, 54, 61, 39, 8, -3, 11, 39, 64, 78, 76, 55, 20, -8, -9, 18, 56, 82, 88, 71, 35, -7, -41, -65, -86, -106, -108, -83, -42, -4, 17, 21, 6, -16, -28, -29, -36, -56, -67, -48, -14, -1, -22, -53, -69, -67, -55, -33, -4, 19, 31, 37, 47, 51, 39, 16, 1, 7, 24, 31, 23, 10, 3, -2, -15, -38, -58, -65, -62, -58, -49, -28, 7, 43, 66, 72, 74, 81, 94, 99, 77, 29, -19, -44, -47, -42, -39, -32, -19, -7, -6, -22, -51, -91, -130, -154, -160, -158, -156, -153, -142, -129, -119, -106, -83, -55, -37, -32, -30, -23, -16, -13, -12, -8, -2, 4, 11, 19, 25, 25, 20, 11, -4, -33, -67, -92, -97, -88, -77, -65, -41, -6, 23, 30, 19, 4, -4, -16, -37, -59, -61, -38, -5, 13, 7, -2, 9, 42, 72, 79, 72, 63, 50, 22, -13, -34, -32, -19, -1, 19, 35, 31, 9, -8, -11, -8, -13, -15, -3, 9, 0, -32, -63, -76, -73, -61, -39, -8, 20, 42, 58, 67, 56, 20, -28, -73, -100, -103, -87, -64, -45, -31, -19, -16, -33, -68, -98, -100, -80, -63, -67, -88, -105, -99, -72, -46, -35, -39, -44, -46, -48, -51, -42, -18, 11, 36, 53, 65, 72, 70, 63, 58, 61, 62, 52, 32, 17, 18, 37, 62, 83, 107, 140, 175, 195, 186, 147, 92, 40, 4, -10, -10, -8, -13, -26, -44, -65, -81, -85, -78, -72, -70, -63, -40, -4, 35, 63, 72, 59]
7526E9k3j3OJ8J3KnmOJ6K1J3Lloj5l0l5k3%J9L0J8ql1k5%J5Jj8j4LJ5J3Kj1k8m0l0LM0O3O3
7507H0L7pm7n9m6k8j8qLJ1J3J8L5M5L8J0j5k1j1JMKKJ2K5L0J8%rj0j5k7m1l6j8MJ7J3Jj2j7
7489b6pOJ2OloJJ6K7L3K4Mj3j6pmj2k3k3j8j9k7k8j1J3J6kk2j7J4M4N4L8Rk1l4k9j0OJ5K3
7471a7K6K2MlPJ9Pk1l6k1jNLNNrk6k4jJ7K2J9K2J8J4J5K0Ol1o1n4k4%OJ2K6L4L1K2J0ok0j8
7453B4jLj7l8l6j7j0j8k1qQJ8K8L9M0K0JqppjJ1K0Kk5l3j5LLpoQJ6J6J1OLJ2L3N3N1K8Jj2
7434A71j2rj1k1k9k5rQJ3J2J1Lj5l2k9pNjj0kJ0PprkNMMQRPJ2J8Qj6k8j3PNj4k3nJ9L1K4J1
7414H3L%lj2k0k0mQLj6k1jJ7J3qj8lJ2Pj3k2j1PRnj8j6mOLkKJ0J7J5J5K2K7J9Pjoj2j8k2k1
7394Hj9j3LK6L7K9Oj4k4k2j2rk0l4l1j3OJ2J5K6L7L5L3L2K4ml6m4k5pqk2j9mKoj6j6j2j4j8
$$ y = [59, 36, 23, 29, 47, 60, 62, 57, 53, 59, 75, 96, 109, 112, 109, 103, 88, 58, 23, 0, 0, 19, 49, 67, 59, 28, 3, 3, 18, 19, 1, -13, -10, 5, 18, 20, 9, -19, -59, -89, -86, -46, 17, 80, 117, 110, 63, 4, -42, -70, -88, -96, -93, -82, -69, -51, -16, 29, 67, 77, 62, 41, 30, 31, 35, 37, 39, 51, 76, 106, 124, 124, 115, 105, 90, 63, 22, -14, -32, -28, -11, 2, 3, -9, -26, -33, -27, -15, -9, -12, -18, -17, -1, 26, 59, 83, 87, 74, 58, 51, 47, 35, 12, -11, -29, -48, -75, -103, -114, -101, -85, -87, -109, -126, -112, -68, -14, 24, 33, 12, -22, -51, -61, -55, -40, -17, 9, 31, 35, 32, 39, 58, 65, 44, 8, -13, -14, -9, -6, -1, 4, -5, -31, -55, -56, -39, -17, 2, 24, 42, 56, 71, 91, 97, 66, 5, -49, -73, -73, -67, -55, -29, 5, 36, 58, 68, 62, 42, 24, 23, 26, 9, -29, -65, -82, -92, -110, -131, -139, -131, -113, -85, -46, -6, 14, 15, 7, 0, -7, -8, 3, 23, 25, 0, -33, -48, -45, -42, -49, -55, -47, -31, -15, -4, 2, 5, 17, 50, 103, 154, 182, 183, 171, 159, 150, 139, 118, 89, 64, 55, 63, 76, 88, 99, 102, 87, 55, 26, 19, 24, 23, 13, 11, 21, 28, 21, 12, 10, 15, 19, 23, 31, 40, 47, 59, 77, 85, 69, 41, 28, 35, 40, 26, 3, -2, 17, 48, 72, 83, 86, 86, 83, 71, 51, 31, 27, 35, 38, 22, 1, 0, 17, 30, 22, 4, 1, 13, 20, 7, -15, -26, -19, -10, -15, -33, -49, -53, -47, -44, -46, -44, -34, -17, -2, 13, 35, 62, 81, 88, 87, 81, 69, 51, 29, 8, -11, -24, -21, 5, 42, 71, 77, 63, 39, 17, 5, -4, -24, -58, -89, -102, -96, -84, -69, -43, -6, 29, 62, 94, 118, 114, 78, 34, 9, 2, -6, -28, -47, -51, -49, -55, -71, -87, -99, -113, -131]
7376a31j0J5L8L9K1L%OLkKJ5K1J5LnpkJ2K8L0Ok6m3m3l5k3qRJ5J1OJ1J8J8Qlj0j0j0j2j3m
7357d4PJ7J5OKJ3L8N4M0%l3l0mJ2Npolj9m3n0l0LK3K1Rlj0j0n%LLLK%j1k5l2k4kJ8K8L3L0
7338fJ7oj8j0J2K6K3J1lj5k7l3l4k6j6nMRJ1QLmmmmnMJ6K2J9J4J5J1L%J5K3Ml0l4j3Mqk5k7
7318h3k4k8l0j3J1K4K9L4L6K3Lqrpommj4k7k6qJ2K2K6K8K4K3K8L5K7Oj3k2l0m0m1k4jJ2J3
7301d6RJ1J3J0%j6k8k2jJ1Lj4k0jK0K7J8Mpj7k5k9k1mJ6K9K8J5nj0J0M1N3L1rl4l3k2k0k1
7284e6j7pQJ7J4ok7k9rJ7L4M0L4K0NMJ2Pj4k7j5K%j8k6k0j4j4pNJ1Lmjlj0j4%K3L2K3NqqN
7264c3J5J4LJRJ3%j6k2j8j0OK9L7J8k0l6k4qj0j7nK1L4K5J0L%nrj0j4k7m1m0j7J7L5K9Rnq
7246f7j3k5l1j9KJ3J0RJ8K5J4nj6j1MK3L7L2Pk7m1k9qNJ1K2L4L4K3J7J7J3nk7l7k9j4%J2J6
$$ y = [-131, -141, -126, -88, -49, -28, -25, -25, -19, -16, -18, -16, -1, 20, 35, 38, 33, 26, 24, 36, 64, 94, 100, 74, 31, -12, -47, -70, -78, -69, -54, -43, -37, -26, -8, 10, 18, 15, 5, -5, -15, -27, -40, -44, -37, -20, -5, 1, 3, 16, 54, 108, 148, 148, 115, 85, 81, 93, 98, 91, 85, 82, 63, 20, -30, -60, -57, -34, -13, -4, -7, -17, -27, -32, -32, -29, -26, -23, -21, -21, -32, -57, -89, -113, -115, -97, -69, -36, -6, 11, 5, -13, -23, -11, 15, 38, 49, 46, 31, 4, -29, -63, -89, -105, -110, -106, -97, -86, -78, -75, -79, -83, -87, -91, -96, -92, -76, -54, -35, -21, -6, 5, 8, 8, 23, 46, 50, 20, -14, -27, -23, -31, -56, -83, -107, -135, -165, -178, -167, -143, -114, -80, -44, -21, -18, -26, -35, -42, -48, -52, -56, -70, -97, -123, -131, -119, -97, -71, -43, -19, 4, 32, 67, 94, 100, 87, 65, 35, -5, -46, -70, -71, -59, -46, -37, -26, -13, -3, -3, -19, -47, -69, -70, -59, -56, -70, -90, -91, -71, -44, -26, -22, -29, -46, -71, -100, -121, -125, -109, -80, -52, -37, -42, -52, -42, -1, 52, 83, 74, 40, 7, -15, -35, -56, -73, -80, -72, -55, -41, -47, -74, -103, -112, -95, -61, -21, 13, 33, 38, 42, 54, 61, 47, 20, 5, 7, 7, -11, -37, -57, -71, -85, -92, -87, -76, -73, -77, -78, -81, -91, -105, -105, -82, -50, -27, -22, -30, -38, -33, -18, -4, -1, 0, 9, 22, 22, 6, -16, -34, -44, -38, -9, 28, 46, 26, -10, -34, -42, -52, -69, -74, -53, -19, 6, 16, 19, 19, 14, 5, -5, -19, -46, -87, -127, -144, -127, -92, -63, -54, -59, -67, -80, -105, -136, -155, -153, -140, -130, -121, -103, -78, -64, -69, -85, -96, -92, -69, -32, 0, 7, -20, -61, -90, -98, -93, -82, -60, -26, 8, 31, 48, 65, 78, 73, 46, 9, -20, -34, -34, -22, -6]
7229fRok5l2j8RL1L2J1j6l4k5NL5M3L2J2lrj4j4pNJ2Onj6k4k4j5kOJ0J1J5J9K4L1K9J2j3k1
7210G0oQKj7k2mJ2J5NKKjj2k0j9qPJ4OppJ1K4J7lj0%J3J1Koj2k2l1k3qMMNJ1J2lk2k5rMJ0
7190b6J3J6J4POJ6K4J6jqlMOJkmnnj2k3k6j2MNnj2pMJ3J6J5Lj3j6ork3k9qJ7J3j0k1lJ8K2
7170c6QnpNK7L6J7k0l7j4K4L8K4Krj7k2k2j7j0%J3L2N0N3K9j5n4o8m8j4J3K5K3J3Lmj0j9l3
7153d6l7k7j5lJ1K9L7K5POJ8K7K7K8K9J7j4m1n0m5l5j6J6M3N1M0J6j3l4l5j6%%j3j4pKOPJ4
7135eK0K9L1K2%j8k1j4nNJ7K3Ol2o5p1m4pK5M2M5L0J3ko%OJ1J3J4Nj5l5l5k5j9k5k7j2OQJ
7117a11oolOK1K2Mj9j8MJ7J3J1J8J7NLJ5K0Mj7j2MPoj8j5nMRNj3l1l3j6LJ2J5J4RkpqnlQK8
7097e6M1L9K3Kj9k7j6JQMLJ4K1J3lj2rlkmj0k0k4j1J1K0Qj3k4k1j0jNNL%loroJJ3K3L2L5K9
$$ y = [-6, 3, -3, -28, -60, -78, -69, -38, -6, 5, -11, -45, -70, -65, -30, 13, 45, 57, 54, 45, 31, 17, 10, 15, 27, 33, 28, 12, -12, -36, -51, -53, -47, -37, -26, -11, 8, 32, 63, 92, 104, 91, 70, 64, 72, 74, 57, 35, 31, 43, 58, 63, 65, 67, 66, 54, 34, 15, 7, 14, 28, 34, 27, 20, 31, 55, 72, 69, 59, 59, 72, 83, 85, 79, 67, 45, 14, -9, -17, -13, -9, -4, 7, 19, 16, -6, -31, -40, -36, -26, -13, 3, 17, 24, 30, 46, 70, 86, 85, 77, 74, 78, 84, 85, 83, 79, 74, 69, 57, 34, 8, -4, 0, 5, 0, -12, -19, -15, -2, 14, 29, 32, 19, 3, -3, -12, -35, -64, -72, -55, -42, -52, -73, -76, -58, -36, -28, -33, -40, -35, -8, 28, 45, 25, -12, -26, -2, 36, 60, 62, 53, 36, 14, -8, -25, -35, -35, -22, 10, 60, 113, 142, 127, 73, 5, -43, -57, -44, -19, 4, 17, 20, 16, 6, -13, -46, -83, -110, -125, -128, -117, -88, -51, -26, -19, -13, 5, 32, 59, 87, 116, 133, 119, 78, 28, -17, -52, -68, -52, -9, 42, 82, 98, 85, 51, 16, 0, 0, 0, -13, -27, -34, -32, -26, -19, -5, 15, 44, 75, 97, 97, 79, 58, 44, 39, 44, 61, 84, 90, 58, -7, -78, -122, -129, -104, -62, -17, 13, 26, 24, 18, 18, 24, 35, 48, 62, 67, 52, 17, -18, -43, -62, -87, -114, -126, -120, -112, -111, -117, -123, -126, -120, -99, -77, -73, -92, -110, -106, -89, -76, -65, -47, -30, -25, -22, -7, 13, 17, 0, -12, -8, -1, -7, -25, -40, -45, -41, -32, -27, -40, -71, -104, -120, -117, -105, -90, -76, -67, -69, -76, -84, -89, -92, -84, -56, -15, 24, 47, 49, 30, 3, -13, -12, -4, 0, 3, 17, 38, 51, 48, 36, 27, 24, 22, 18, 8, -12, -36, -47, -36, -16, -8, -21, -45, -66, -76, -77, -72, -67, -64, -64, -67, -73, -82, -88, -87, -74, -51, -19, 16, 45]
7077D5J0rj6qOJ1OjlKJ0J3Kj7k7j8MJ5J3N%qk1l2l6k7j5jJ3J8J6J4K2K4J4nj2mOJ0J2J1Lo
7058C9j0j3j9l0k5kK3L3L3L1K2Kk4l8k3J4N7P2M9Mk2j9mJrk2k8k6j3PJ4Nj2j9j3rj4k1l0l6
7040g5l6k3pkj5k3qK2L8K8J0RK5L0J0j6j9kJ1RNJ0K0K9L1K4Kl1n3n1k9kK8N1N8M7L1K6K6J3
7023B01rk3k9l9n4n4l3nMmpOK1J9jk0j9KJ4Lj9k5j1RJ9J5Nj0k2l3l8l6k1LJ9J4RK6N2N9L3
7005B1J0NJ0Lj6l2l6l6k8k0j5rKJ3J1pk4k1qQK5M4M8K7kj3rqj0oQJ2QNNpl3m8l2kK0K5K0J5
6986g7Npj2j0onkMOOKjoj4k2k0kK1L4K9J8PKKJ1L6N8N9K6j2k8j2J0Mk8o8q3o7k8J5L9L6Pk2
6967i5l4k6j0NK2L7L1Mk4k8j2MJ2K3L3L5K3J7J6J2jj1j0%NOQNpl0m9n8m7j7J8L9L3J5ORJ0
6949c1OKLLmj1j4j9l1l8k7lK1K8K6K2J7Rkj5k5k6j2J3L2L1J9MmpmJNLjMJ0Nqj6j0JNKnrq%
$$ y = [45, 55, 46, 30, 22, 28, 39, 45, 44, 41, 43, 53, 66, 68, 51, 24, 6, 10, 25, 38, 43, 43, 35, 14, -18, -54, -81, -96, -97, -84, -66, -50, -36, -14, 10, 24, 19, 7, 3, 9, 19, 31, 42, 45, 39, 29, 16, -3, -33, -58, -60, -37, -4, 29, 60, 82, 84, 60, 22, -1, 13, 70, 142, 191, 195, 173, 154, 150, 151, 142, 120, 92, 66, 53, 60, 74, 79, 67, 48, 35, 26, 12, -9, -39, -75, -111, -134, -141, -143, -158, -181, -189, -167, -129, -101, -91, -82, -57, -27, -17, -33, -52, -54, -43, -34, -29, -19, 1, 30, 61, 85, 87, 56, 3, -48, -77, -79, -51, 0, 58, 105, 136, 162, 188, 201, 192, 169, 140, 101, 47, -7, -40, -45, -41, -45, -52, -46, -25, -6, -7, -27, -46, -44, -30, -27, -46, -71, -82, -73, -54, -39, -34, -44, -66, -99, -137, -173, -194, -191, -172, -158, -149, -123, -71, -12, 21, 31, 36, 46, 49, 33, 1, -35, -71, -99, -119, -134, -143, -141, -128, -117, -124, -148, -169, -177, -169, -144, -100, -52, -25, -27, -40, -49, -57, -67, -73, -65, -53, -45, -40, -35, -42, -75, -123, -155, -157, -137, -112, -92, -77, -72, -79, -91, -101, -107, -112, -114, -110, -104, -98, -96, -97, -103, -117, -139, -159, -161, -140, -106, -77, -59, -52, -50, -48, -37, -1, 57, 116, 142, 130, 102, 90, 100, 104, 76, 8, -75, -142, -170, -155, -116, -80, -73, -95, -129, -155, -165, -160, -138, -101, -70, -66, -90, -118, -130, -126, -114, -91, -58, -23, 0, 17, 33, 45, 44, 33, 23, 23, 28, 34, 42, 47, 40, 10, -39, -97, -144, -161, -143, -104, -71, -56, -50, -41, -31, -25, -23, -20, -17, -21, -32, -46, -65, -96, -134, -161, -164, -143, -115, -89, -67, -50, -41, -43, -58, -83, -109, -121, -108, -76, -45, -26, -22, -26, -33, -37, -36, -31, -28, -29, -25, -15, -10, -18, -34, -44, -43, -38, -36, -41, -50, -58, -58]
6929e8NRJ1K0K0Jk6l4j5NPkOK6L3K2nl1n3n2k4J1K6J6OJ7L3K8jl1l5j3J5K0Kj8k1j2pqKK0
6910h5K6J2j2k0j0J1K7K8J8PJ3K0Ok4m2l4j5JJ7M0M9K8j6m9n7m3j6J4K9J8jmJ5L1K3%j9k2
6894c6j2NJ4J4Nj1k9m2l9j9JNlnPK3L5M0L7J6qk2nK7M5L8J7%LJ5J4pl0l2j7nmj1j9l0m5n6
6876a26n9m9k6J3M7N4L7K0J8K0Ok0l7l4j5J3L1K8RojJ2J6J4K0L2L8K4NplJ1J9J8J1NL%nn%
6858A31jj5k7l3l3l6l9k6lJ9K7K1RjLJ2J6NkOJ2rm6p0n8k9mJ5K9L3K6K0J8Qqj1NJ9J4LMJ5
6840A9Rj2j7jJ2Mj7k4rJ6L7N0M6K4ol2n0n9n6l1PK7J6j1k7j6RK3J2j2l3l0qJ7L3L1J5lj2o
6822f5LPJ0J8K7J8j7m9n3l0nMPK0M0N4M5K4Kj3k1k1rJ3L5L0ll9m7l1rMJ4K6K9J7j2m3o2n0
6805a32rL7N7L9Pj3j5qljpj4j4%J2RkpMJ5J3OK%j2k9l2j3J8L3K8K2K3K3Oj6k6j7j0j1nOJ4
$$ y = [-58, -53, -44, -33, -13, 7, 8, -18, -52, -67, -62, -55, -57, -51, -25, 8, 30, 25, -6, -59, -111, -135, -124, -98, -82, -76, -59, -26, 2, 1, -30, -65, -78, -63, -43, -41, -59, -80, -92, -99, -107, -105, -85, -59, -47, -59, -79, -89, -78, -51, -23, -5, 2, 15, 35, 41, 17, -25, -59, -74, -73, -56, -16, 33, 61, 45, -4, -61, -104, -120, -106, -77, -59, -60, -64, -49, -18, 5, 5, -14, -36, -48, -43, -29, -15, -10, -21, -50, -92, -131, -150, -149, -144, -147, -152, -145, -122, -87, -47, -10, 6, -2, -24, -29, -2, 43, 81, 98, 98, 101, 116, 130, 123, 93, 61, 44, 39, 35, 24, 5, -25, -70, -126, -185, -234, -260, -247, -200, -146, -109, -89, -71, -51, -45, -65, -102, -136, -151, -138, -107, -79, -70, -76, -77, -65, -49, -35, -15, 17, 55, 79, 84, 77, 74, 85, 104, 122, 133, 138, 141, 141, 136, 131, 131, 130, 115, 88, 55, 22, -14, -53, -79, -82, -63, -36, -15, -6, -7, -4, 8, 24, 29, 27, 33, 45, 36, -10, -80, -138, -167, -171, -156, -127, -94, -68, -48, -30, -22, -30, -41, -36, -17, -3, 0, 4, 19, 28, 16, -1, -2, 10, 14, -3, -27, -36, -20, 17, 67, 113, 137, 131, 99, 49, -10, -66, -97, -90, -63, -47, -58, -85, -101, -92, -69, -57, -69, -102, -132, -140, -123, -90, -59, -44, -47, -59, -65, -62, -55, -45, -27, 0, 18, 1, -48, -101, -131, -136, -132, -125, -105, -65, -11, 34, 58, 60, 47, 26, 5, -4, 9, 44, 74, 71, 32, -15, -46, -55, -51, -37, -11, 18, 35, 23, -20, -82, -132, -141, -104, -47, -8, -1, -14, -29, -37, -40, -41, -48, -62, -76, -76, -64, -55, -57, -64, -60, -45, -32, -26, -24, -24, -36, -65, -97, -110, -92, -59, -31, -9, 14, 37, 43, 27, 1, -16, -26, -37, -42, -36, -22]
6786b2J0NJ0J4Kj4j8j8k3l1k4lJ1ROJ2K6L5L4K1Jj7k4j8j4pOJ7J6QNNlj4oQJ0j4l4k9j2j8
6768i2m0m8k8KK2K4J5KPL8O5N3Nl7m5j6K0M6N5M7K7Onj1j4j6j6j5j4j0qrj0kPJ2QQJ0jj8k2
6750BpKj2k7j8QK2RqmJ6K6J3j5l5l5j6JJ0J7K7L7L6K5J6Qnk7l4k2j%j8l9l5j5MQlj2j2j0q
6731a31kJ4L2L4K4J3QQJ0J5K3K0Lj9k9k0ML2M4L1jk5k5rJLNNrl1m4m0l2k1%L0M2K5nj4kQJ
6713b4j5k1j4MK1L1K3J5J0J0Lj6l1k9mK3L4K4KqMJ9K2J5Okk0l6k8jK0J7ONlk8n6n4k5jmj6
6695a22j3LJ1J5K3K6J2j2k0jK5K5Kj7j2LPLNK1L6L1J0j5k9k8j8KJ6J4%j1rKMoj1lJ4J6nl3
6676c9m5k9nJ1J5J5J8K2K2J8J6Nj7l8m8l8k4j7j0NK3K8J9J5K5L6K6Kj4j5j1j5j8j2loj8k9
6660a30l0k3qQK2L0L5L4K2lk0j7lJnKJ9L1L0K3J9Qrk4k4k2k1qJ4K9K3Omoj2j8j6mNOKnj2j2
$$ y = [-22, -12, -7, 3, 17, 19, 5, -13, -31, -54, -85, -109, -112, -101, -92, -86, -74, -48, -13, 21, 42, 43, 26, 2, -16, -30, -37, -31, -14, 2, 10, 15, 20, 17, 3, -3, 5, 15, 1, -33, -62, -74, -92, -132, -180, -208, -206, -184, -160, -145, -143, -136, -98, -33, 20, 25, -12, -57, -73, -53, -7, 48, 95, 122, 128, 123, 112, 98, 82, 66, 51, 37, 27, 19, 10, 0, -2, 5, 17, 25, 33, 43, 42, 24, 2, -5, -3, -15, -42, -60, -52, -30, -21, -29, -33, -17, 9, 22, 7, -28, -63, -79, -78, -68, -51, -24, 13, 49, 74, 90, 98, 93, 66, 32, 10, 9, 9, -9, -48, -83, -98, -94, -86, -89, -101, -113, -123, -131, -133, -119, -87, -53, -29, -16, -8, 0, 10, 25, 48, 68, 71, 52, 23, 3, 7, 39, 83, 114, 113, 88, 63, 54, 55, 58, 63, 68, 59, 28, -16, -56, -88, -109, -109, -79, -37, -12, -17, -31, -33, -25, -24, -39, -60, -74, -70, -49, -18, 5, 20, 30, 40, 43, 27, -4, -33, -37, -14, 20, 44, 46, 38, 42, 61, 83, 98, 104, 102, 82, 46, 18, 17, 37, 54, 60, 65, 62, 34, -22, -76, -101, -102, -106, -122, -135, -132, -121, -106, -83, -57, -45, -57, -77, -78, -53, -28, -26, -43, -55, -52, -45, -42, -37, -16, 20, 51, 61, 46, 17, -11, -29, -27, -11, 3, 3, -8, -17, -15, -11, -17, -28, -31, -17, -1, -6, -39, -84, -113, -118, -107, -92, -77, -59, -37, -15, 3, 19, 24, 7, -31, -79, -117, -141, -158, -168, -163, -140, -112, -93, -78, -53, -17, 9, 11, -3, -18, -29, -44, -62, -74, -77, -83, -101, -130, -160, -183, -191, -183, -161, -131, -96, -62, -40, -43, -63, -80, -83, -82, -87, -85, -66, -35, -5, 18, 37, 45, 36, 12, -12, -34, -55, -63, -49, -20, 3, 9, 5, -1, -13, -31, -47, -51, -46, -40, -38, -43, -55, -67]
6641f7oJ%PK7M6L9Qk2k8j7rnmpj3j7j4oRK6L6L5L0K7K6J2j1l1l2k4j2OK4L0J8kj6k3k8k2j
6623a0K2L3J9ok8m0l8k1lNLkj0k0k7k3j4j3rJ0L7M4K3oj1ljoLK2K8Ll1l7j5PQLRK2K7K1J3
6604a2Noj5j6qrj7j4J1L1K2nj3LK2K1J0LMLlj1j6j8rJ0K7L1J3j0j8qQJ0rl0l9l2j0J5L8M1
6586@K5jj6j5j2oKJ1Rpk1j8JJ8K1Rj1k8k5nJ6K1J6J2J7L1L9L6K0qk9k7mJ6J2qk1j7JJ4K1J9
6568A08J3OkoomLQPjj7k9l6l2k5j9j1JJ6K6K3Mk0l3k6oNMMJ5K6J8JpOK2J9PjLLqj9j3QJ9J0
6547F4prMQmk0j8pok3l6k6pJlJJ7K8K0PQJ9K8J8Mmqj7k2j3JOlj2j4j1j8k9k9j5%J4K6M1M4
6528bL0Prj0jQR%ppkkj5l3m2l4j3RJ8J0jlJ1K0J9J1J0J4J8K0K1J0j1k8k0%Qlj6j3jRMj1k7
6508d5l5k4JK2K5J3%kKLlj6k2j7qrj5j3%RJ0J3K5L4K4KrjRKj6k7j6OJ6NplJ2K2K0J3J4J0j
$$ y = [-67, -73, -72, -72, -65, -38, 8, 47, 55, 33, 5, -12, -21, -26, -30, -37, -50, -67, -81, -87, -78, -52, -16, 19, 49, 76, 102, 114, 103, 72, 40, 16, 4, 10, 34, 64, 82, 80, 64, 41, 13, -9, -10, 12, 45, 64, 58, 30, -10, -48, -69, -72, -67, -64, -66, -76, -96, -123, -146, -160, -173, -182, -172, -135, -91, -68, -74, -85, -88, -89, -95, -92, -70, -42, -39, -70, -107, -122, -115, -107, -104, -95, -73, -46, -25, -12, -7, -13, -28, -44, -52, -61, -78, -92, -81, -50, -28, -33, -46, -43, -21, 0, 10, 13, 17, 20, 17, 6, -10, -28, -37, -27, 0, 31, 44, 34, 16, 8, 16, 26, 17, -13, -52, -84, -94, -79, -41, 0, 25, 24, 8, -7, -19, -25, -23, -12, -3, -10, -31, -49, -48, -30, -9, 0, -11, -39, -64, -69, -53, -32, -16, -4, 13, 44, 83, 119, 139, 131, 102, 75, 71, 87, 99, 91, 70, 53, 54, 68, 89, 108, 121, 127, 125, 119, 113, 109, 112, 120, 127, 126, 109, 80, 44, 12, -13, -32, -43, -42, -26, 0, 23, 27, 7, -26, -52, -58, -53, -49, -45, -30, -4, 14, 15, 8, 14, 36, 55, 62, 61, 64, 67, 59, 40, 27, 35, 54, 64, 57, 48, 52, 60, 56, 36, 18, 11, 5, -18, -54, -80, -87, -86, -89, -88, -71, -43, -23, -16, -8, 11, 39, 57, 61, 57, 49, 32, 10, -3, -2, 4, 1, -11, -25, -36, -54, -83, -112, -127, -127, -113, -87, -46, -2, 28, 35, 26, 16, 15, 23, 32, 32, 25, 18, 16, 14, -1, -34, -76, -110, -123, -114, -96, -86, -87, -90, -79, -59, -40, -29, -19, -5, 13, 33, 54, 64, 53, 25, 5, 5, 13, 10, -6, -19, -20, -11, -7, -18, -45, -80, -104, -103, -81, -56, -43, -43, -45, -43, -40, -43, -59, -81, -98, -106, -115, -130, -143, -143, -134, -124, -111, -86, -52, -28, -26, -35, -36, -27, -25, -41, -68, -84, -78, -62, -57, -64, -67, -55, -33, -13, 0, 14, 24, 23]
6489B3j0pLRMnj3j0kPKj1k5l0l1l5k9mK7M3M4M0K4nl3l6j0J6K6K0J2MkJOKj2j3%J2J0NJ0J9
6470D6J7J3J4J4ml3m6l0%K3L2K9K7K5J6mk3k9k6l4m7m5rK4K4Kq%NKPJ6J1nj4mJqj6qkj8l4
6451i9k1K4N6N1K3Lmj1l0n2n1k0K1M4M1K8K5K9K5J3Jmqj2k1k1rRJ4j0m8o9n1rK6L3J3j2k0
6434a03JL7N0K2j8l8k5JJ7K1K2K5L1K4Jk6l4j0J7K3Jj9j7jJ3J7J4Kj5k3j6nNOJ1J3J8K6L5
6417A03L0Kk7l7l0k1j9j4pLJ3K6L3J5j8l7k7nQRNMPJ7L1L4J9mj6j8k4l6l4j6PJ3NkJJ4K8L3
6399F8K0ql7m9m3k9j7kJ4K6J9lk0k1qNJ1J6K1K2J5J1J1J5J3Krq%J0Qrl0l5k1kLpk1k5k9l8
6381a61l9j9J3L5L6K8K6K7K0RMOLorNK3L2K2QlpoKJ4J9Nj4k0j0looLJ1%k1k7j0QOj6m0n2m6
6361a56j8K2M9M6J9kjQJ0NNJ0Nj1k5k2pNQQP%oj1j6k2k4rJ6L1K8K1K4K3Qj3j4OJ9J5PJrk2
$$ y = [23, 13, 6, 9, 18, 22, 17, 4, -6, -8, -1, 1, -10, -35, -65, -96, -131, -160, -164, -137, -94, -50, -10, 14, 9, -24, -60, -70, -54, -28, -8, 4, 8, 6, 7, 13, 15, 3, -10, -10, 2, 12, 17, 27, 46, 63, 76, 90, 104, 100, 67, 21, -9, -9, 14, 46, 75, 102, 127, 143, 139, 116, 87, 61, 27, -20, -65, -74, -50, -26, -24, -32, -32, -27, -25, -18, -2, 9, 4, -10, -14, -13, -21, -37, -45, -47, -65, -99, -120, -96, -40, 11, 34, 37, 33, 22, -8, -60, -111, -131, -110, -66, -25, 3, 28, 57, 82, 95, 96, 92, 84, 72, 51, 30, 21, 30, 44, 34, -14, -83, -134, -143, -117, -84, -71, -83, -103, -102, -65, -15, 7, -11, -49, -74, -73, -56, -35, -13, 12, 43, 67, 68, 42, 8, -2, 15, 38, 39, 20, 3, 2, 15, 32, 46, 48, 33, 10, -6, -11, -6, 0, 11, 24, 42, 68, 103, 133, 135, 108, 71, 41, 20, 1, -13, -20, -17, -4, 22, 55, 70, 52, 15, -12, -17, -9, 0, 5, 9, 16, 33, 64, 98, 117, 113, 97, 79, 55, 19, -15, -31, -24, -11, -6, -8, -7, 7, 35, 68, 88, 80, 43, -6, -49, -78, -95, -97, -83, -57, -38, -41, -61, -82, -90, -85, -74, -58, -37, -15, 0, 11, 22, 37, 50, 52, 43, 35, 35, 45, 53, 44, 14, -21, -42, -44, -41, -48, -69, -94, -123, -161, -200, -219, -206, -171, -135, -107, -81, -54, -34, -25, -21, -15, -12, -18, -27, -22, 1, 33, 55, 63, 60, 53, 47, 49, 63, 82, 87, 73, 53, 43, 40, 34, 28, 31, 42, 42, 21, -6, -16, -8, -2, -18, -58, -110, -156, -174, -152, -103, -57, -38, -40, -41, -33, -23, -18, -13, -3, 2, -9, -34, -56, -63, -58, -50, -42, -35, -35, -41, -52, -68, -90, -114, -123, -107, -76, -48, -27, -3, 20, 28, 15, 1, 7, 26, 41, 48, 49, 40, 18]
6342A8j9KJ9Nk0k0KJ4Kk2l1k0NK9M1L5J6KKRJ1Plj0rnnj4k3j8nQJ7J8J7J1Lnk2m8n9l4J1L0
6323e8J4jPK2J6NMRKj3j3rj5k6j4J6K9J5KQK1J4jnKNjmoj0pMJ6J1mj5j6j7k4l1l0k3pJ2K4
6304i2J8OQK9L8K0j4l0k1JJ5J5Lj7l0k7rJ0J5Plmjjj2k0lL1M7K4j2l0j1J0J1kmJkk1l5j9J6
6285i5M5M4K3N%qk6m7m3j5J6K1Kj5j8j0%RK0K3Oj6k0NK9L1J7J5K9L4J3mLK1J7qk2j6rk4l9
6267gl9k7k0j2J3M6N1K2rj3MJ5Oj5k6k4j1ooJK3M1M0K7J8J7Pj3k4j7%Mkj1j7j6pKLKJ2K3J6
6248G1j0k7j7KJ0PLpk3k8qJ5J8PKOJ1J6K9L9M6O0Q5R6R4J20J93K75L33M02N07N32L12j31n35
6233B505o63n33l43k23j54j00p3q0q9o9m1l0k8j7PL1M8M1Ql1m9l7k0j1lJ0J3kk1l1k8k0lJ7
6219a9K1PmkLlmQK8K1jqLQqk0rJ2J3rk9k6pJ0J5J2RRJ6L0L9K8Lj8j8jRNpj8k5l0k8j6oklo
$$ y = [18, -1, 1, 20, 25, 5, -15, -13, 1, 3, -19, -50, -70, -65, -36, 5, 40, 56, 58, 60, 69, 80, 87, 84, 74, 65, 60, 55, 41, 18, 0, -5, 3, 20, 38, 55, 66, 69, 64, 42, -6, -65, -99, -88, -58, -44, -45, -38, -16, 0, 5, 9, 18, 20, 7, -6, -15, -30, -56, -70, -54, -25, -10, -8, 0, 21, 35, 34, 29, 31, 36, 35, 31, 25, 15, 8, 12, 28, 39, 35, 20, 4, -13, -37, -68, -98, -121, -128, -116, -92, -74, -68, -60, -31, 7, 27, 13, -17, -38, -37, -22, -7, -4, -21, -51, -78, -87, -77, -62, -55, -58, -62, -63, -64, -76, -96, -99, -68, -21, 3, -9, -39, -50, -40, -29, -31, -35, -34, -36, -57, -92, -111, -95, -50, -6, 17, 22, 22, 14, -12, -59, -102, -117, -101, -80, -78, -93, -111, -121, -121, -112, -92, -69, -63, -79, -99, -94, -65, -34, -17, -2, 27, 61, 74, 70, 73, 94, 111, 103, 81, 65, 56, 32, -7, -46, -73, -93, -105, -92, -46, 5, 27, 18, 5, 9, 24, 30, 15, -11, -35, -46, -52, -58, -57, -34, 7, 47, 74, 92, 109, 116, 103, 79, 62, 62, 66, 64, 53, 36, 20, 13, 15, 18, 20, 32, 55, 71, 61, 34, 17, 19, 29, 36, 39, 32, 9, -19, -27, -12, 6, 13, 15, 21, 32, 48, 77, 116, 162, 222, 307, 403, 497, 617, 810, 1085, 1418, 1820, 2327, 2859, 3171, 3040, 2505, 1842, 1309, 966, 743, 589, 489, 416, 336, 247, 178, 137, 107, 79, 62, 69, 100, 148, 189, 197, 166, 117, 80, 60, 49, 46, 56, 69, 67, 46, 15, -13, -33, -36, -19, 2, 9, 5, 3, 6, 3, -1, 7, 35, 56, 55, 47, 50, 58, 50, 30, 21, 33, 46, 37, 8, -18, -25, -15, 0, 12, 21, 30, 46, 76, 115, 143, 146, 128, 110, 109, 118, 123, 116, 98, 73, 43, 15, -1, -7, -9, -12, -18]
6198a8rj4j1OL1M5M4K7Oj3k5l2l1j9jJ4J8J6J5J9K3J6jk0l6l9k9j6j0j3j1mJoj2rloj7k3j4
6180a61kNQQ%j4k2j6MJ8J7NkMJ5J1rl0l1j1J7L6L5J6mj2MK6L3K1Lpj7l5n6n4k1J4K0KmJ3L1
6161a42K4kj6nQQ%LJ5K3K3J8J1LMJ7L4L3J1j1j5roj6k7k6j2NJ0kk1l0j8J2M0M9L2J3MJj5m0
6143a2n5l9j3lj0oJ1K4K0MnpkNNj4l7l5KL8L6Jk2j3LMJJ3L2L5J1j2k1j5oJMPJ0J8K5K6K0J1
6124D0Knj4j9j9k2k6k4j5lKORQjrjJ4J8OrrKJ4K2J8Oqj3rmkJ0K9L5J7qj6mkj4k1j3MJ0Nkk
6103a7LJ0J0Nkj0k4l5l2pJ9K0Jj1lPMkjMnk3k5kK6L7K8J8K2L8L7Rl0n3n2m9m9m9m0k8j7%K3
6085b45L9L5K3K6L5L6J8kj5k3k4j2LJ0OQK0K3Nj8k4j5nl%J0K1K6K6J3j0k5j6J4L6L3J5kj0
6068C2rmJmj6k1oK1L9M1K5nm3p2p6n5k3LL0N0N4L4QjMKmpj2j8k5j4J2K8J9%kJ2K3K5J5Lj3
$$ y = [-18, -27, -41, -52, -46, -15, 30, 74, 101, 107, 94, 69, 37, 6, -13, -14, 0, 18, 34, 49, 68, 91, 107, 106, 86, 50, 11, -18, -34, -44, -57, -68, -72, -71, -77, -89, -98, -101, -107, -124, -147, -161, -163, -158, -150, -142, -142, -156, -178, -194, -190, -172, -155, -150, -152, -148, -133, -122, -131, -161, -192, -203, -186, -150, -115, -99, -103, -115, -111, -85, -52, -31, -28, -35, -52, -87, -143, -197, -218, -204, -184, -182, -186, -173, -142, -118, -120, -136, -141, -133, -125, -125, -122, -107, -84, -61, -43, -32, -29, -25, -8, 26, 59, 70, 59, 44, 35, 29, 13, -14, -40, -52, -47, -37, -39, -60, -90, -108, -96, -56, -7, 25, 38, 42, 43, 28, -12, -67, -106, -119, -122, -132, -138, -127, -103, -83, -79, -84, -91, -93, -88, -83, -97, -134, -169, -167, -129, -93, -92, -114, -127, -124, -120, -119, -106, -74, -39, -28, -40, -61, -76, -82, -81, -77, -70, -60, -42, -17, 9, 29, 40, 42, 37, 23, 4, -15, -37, -63, -87, -102, -105, -103, -97, -88, -80, -81, -90, -91, -77, -59, -53, -62, -71, -69, -55, -33, -15, -9, -17, -30, -39, -43, -45, -35, -6, 29, 46, 38, 22, 18, 16, 2, -19, -32, -28, -18, -13, -15, -17, -14, -4, 6, 11, 9, -1, -25, -60, -92, -99, -80, -60, -59, -70, -73, -66, -62, -64, -65, -61, -66, -89, -114, -116, -90, -53, -25, -7, 15, 53, 90, 99, 69, 16, -36, -85, -134, -183, -223, -251, -268, -268, -245, -206, -171, -148, -122, -87, -51, -33, -35, -50, -73, -97, -109, -106, -96, -90, -82, -62, -39, -34, -52, -76, -91, -96, -99, -99, -89, -68, -42, -16, -3, -13, -38, -54, -40, -4, 29, 44, 42, 32, 23, 19, 20, 16, 0, -21, -27, -6, 33, 74, 99, 94, 51, -21, -97, -152, -175, -172, -142, -92, -38, -4, 4, 3, 7, 9, 5, -2, -14, -32, -57, -71, -59, -31, -12, -12, -14, -2, 21, 46, 61, 64, 51]
6049E1k4l1l4l2k5j2lKMJ4K4J7nk6k8nK0L4L3K3J3Jj1j7JL0L7Ql0m0j3K2L7K6Jk6m1l7j2J2
6032d2J8Jj4j0J5L5L5J0j2j3LK2K3Rpj4rjnj8k8k4j1%NJ3K5L3K2Kj2pJ3L3M1L3J8Kj5k9l6
6014A04l7m4n6n6l0QK5K2J2J0QORJ6K1K8M1N2M1Ok7l6k6j2KJ5K5L1L0K2Nj4k0j8k4l9m2k4
5998C4jOpj7j0QK7K8Ok6l9k4jRJ1J7J6Lj0oMJn%J2J5NQK3K6Nk3l4k5j5nloj2j4rqp%J0J3O
5977a4KOJ3J4Qpk3l3j9PK0J2KMJj4j9%K3J7j0k9k2KJ8K1J7J5K2K2Kl3m7l1lJ2J4J9J9Rj0j2
5959ekPJoj0j1okJopRL0K8Jk4k9j7%K0L5L6K3J1QJk0m5n6n8m7k3J4L7L6K2J7K1J3rk0j6qr
5940f5j7j9j7j2%J3J5jl0m5l0QM5N2K8KokjmjJ2K7L5L6L4K6K3K9L3J7j5l1k2JJ1PQJ3Oj7l2
5922A14k4nnk9n5n6k1K7N4M9J8rk3k4k3k2j5lM%j3k1j6%J2J1LlJJ0J9K3K3K2J9J4J3J1Kj5
$$ y = [51, 27, -4, -38, -70, -95, -107, -110, -108, -104, -90, -66, -49, -54, -80, -108, -113, -93, -59, -26, -3, 10, 11, 0, -17, -16, 14, 51, 59, 29, -11, -24, -2, 35, 61, 62, 36, -5, -42, -54, -42, -24, -23, -37, -47, -32, 3, 38, 48, 36, 23, 26, 48, 71, 80, 73, 59, 50, 49, 44, 26, -2, -26, -37, -37, -32, -19, 6, 39, 61, 63, 51, 44, 57, 90, 131, 164, 182, 184, 169, 140, 104, 67, 23, -33, -89, -119, -111, -86, -64, -52, -42, -34, -28, -19, -3, 18, 46, 87, 139, 180, 186, 159, 123, 97, 85, 87, 102, 127, 158, 188, 210, 215, 201, 181, 163, 139, 100, 58, 34, 33, 39, 32, 15, 5, 13, 40, 68, 74, 48, 9, -15, -16, -7, 4, 21, 37, 40, 30, 24, 28, 29, 24, 24, 36, 51, 56, 64, 87, 113, 118, 95, 61, 36, 21, 16, 13, 7, -5, -19, -28, -36, -43, -43, -33, -20, -14, -12, -6, 7, 21, 29, 22, -1, -34, -53, -46, -26, -14, -12, -8, -7, -21, -40, -40, -17, 0, -10, -39, -61, -59, -41, -20, -3, 12, 34, 56, 58, 25, -22, -53, -56, -44, -30, -11, 8, 17, 7, -5, -7, 0, 1, -5, -15, -26, -32, -34, -33, -39, -46, -37, -7, 21, 22, -2, -31, -48, -48, -28, 7, 43, 66, 77, 85, 86, 66, 21, -35, -93, -140, -163, -149, -112, -76, -54, -37, -16, -3, -12, -32, -48, -56, -65, -82, -101, -118, -130, -130, -117, -102, -103, -133, -178, -208, -200, -155, -103, -75, -73, -79, -81, -82, -86, -87, -75, -48, -13, 23, 57, 83, 106, 135, 168, 185, 170, 139, 117, 118, 129, 136, 144, 157, 163, 146, 114, 90, 85, 80, 51, -4, -60, -81, -54, 0, 49, 67, 58, 35, 11, -12, -34, -49, -52, -48, -48, -61, -82, -98, -98, -86, -75, -72, -75, -74, -64, -45, -22, 1, 23, 42, 56, 69, 80, 82, 67]
5904F7k8k7j2JRRKrj5j8j1olJ0L1L8K0j5l8l7k7j5lOJ1J4K1K7K5J0kjjj8l6l2KK9K6J0KRJ4
5886C9Nrj8j6pLLkj0kJ3J6J1OJ0J3P%QJ8Qk1m6m2l1l0l3j9J0K8K2J2J9L9N0M4K5Mj4k1j3M
5867H3J4Qj0k6l5k9j1LLrk2k5k5k2pJ6L1K9J8J0OjlMJ5J5Lnoqj5j3OK5K7J6QJ0Poj0JJ7J8
5848A05jj4j4j0j5k0qJ3K0Rmmnk5m3l6nJ7J4JpprlPQjj0kRRNRJ3Lk0l3k6j6j5j3kJ6K6K5J9
5828d0J1KkKPLooNJ1kj8j1J3K7J2j2j3J4L5K6KnJ2K2Ll1m0j6J6K9J5mj2roqj3j0jML%JKkp
5808ClJ0J6OpmJ7L0J9j0k4j7qj5l2l9k7j1qj9l1k9rK2M3M7L4K0Nj3l1l5k8k2k2j1J6L8L7J8
5791g4NORNnj5k1j8oOJ1J4K6M5M5K1j8m2m2k8j7j9k3j7kPNNJ9L6L8K3J8L2M4L1OoOJ7Oj9l3
5772H1k1LJ5PopMOmj1pjqj6j3kjqj2j4k0k8k4qLKonLOJj1j9j8%K0K5J1JJ2L1K9Mk0k3j3kL
$$ y = [67, 39, 12, 0, 1, 10, 19, 21, 12, -3, -21, -32, -38, -41, -31, 0, 38, 58, 43, 5, -32, -59, -74, -77, -71, -60, -46, -25, 2, 27, 37, 35, 34, 33, 15, -21, -53, -51, -22, 4, 14, 16, 25, 39, 44, 35, 17, 1, -6, -3, 0, -2, -12, -14, -1, 15, 26, 32, 42, 55, 62, 62, 70, 88, 96, 75, 29, -13, -44, -74, -107, -126, -116, -88, -66, -54, -35, 4, 54, 98, 123, 127, 113, 92, 79, 83, 97, 105, 95, 69, 34, 5, -6, -3, 0, -9, -31, -56, -81, -103, -110, -94, -63, -34, -16, -6, 0, -1, -4, 0, 15, 30, 33, 28, 22, 14, -1, -14, -8, 17, 44, 60, 68, 78, 85, 79, 69, 70, 87, 105, 104, 90, 76, 66, 51, 31, 23, 36, 56, 65, 61, 57, 52, 27, -16, -52, -57, -40, -26, -25, -32, -39, -48, -51, -44, -36, -37, -47, -49, -40, -31, -26, -17, -4, -1, -21, -54, -80, -96, -111, -124, -126, -110, -84, -59, -40, -29, -27, -29, -27, -20, -17, -23, -29, -24, -13, -15, -33, -44, -31, -4, 8, -4, -17, -3, 32, 58, 60, 55, 67, 89, 92, 61, 21, 5, 21, 50, 65, 61, 49, 40, 34, 26, 13, 3, 2, 6, 9, 9, 10, 12, 10, 3, 0, 10, 26, 32, 25, 21, 38, 68, 87, 77, 53, 36, 28, 13, -19, -58, -85, -96, -104, -123, -154, -183, -192, -170, -127, -80, -46, -26, -21, -34, -65, -100, -128, -150, -172, -183, -167, -129, -92, -74, -69, -63, -54, -49, -54, -69, -90, -108, -114, -108, -97, -83, -57, -12, 33, 54, 36, -6, -48, -76, -93, -112, -135, -152, -154, -147, -142, -137, -118, -82, -44, -21, -3, 29, 73, 104, 110, 104, 110, 127, 133, 114, 81, 60, 63, 78, 85, 79, 72, 76, 82, 78, 67, 60, 59, 51, 35, 22, 20, 19, 11, -1, -15, -35, -63, -87, -95, -92, -90, -96, -101, -98, -92, -91, -102, -121, -139, -139, -119, -94, -83, -82, -70, -39, -10, -6, -26, -49, -62, -64, -61]
5751f1MMMRJ6J4Noqnrk2k7j4J2K9K1nl3m2l0kL1N3N3L6J9QKmnjOMpj9l0m1m9m8l6k0qLK1L9
5731a39M5L9L4L4L8K6%k5l2k0pj1k0k1j6j2qLJ5J2%mQJ7J1LOJ4J0KOJ6J3MLJ5J6%rLJ8J4l
5713I8j4j5k1l2l6k4qLNjrrKJ3J0%jJ2K3J8POJ3J8J0j2l1l6k7pJ0J1Kqq%RJ2J3J4J5J3QOM
5693E6ok1k3lK2K5Oj6j6MK2K4Rj5l2l0pJ3J9%k7m1l4j3MNlpkMO%qqKJ3J6Orj8j6lJ7L2K8J0
5673a5mlKj%J7L4L4J0j7l4l8l7k2nkrmJ8K8J4oqNJ2J2J2Qlj7j5pnqojoj7j9j6j1jK2M3L9J9
5653hQJ3jl7o3m5oJ0%oPK6K8J3nj1lJ5K3J8J1J6K5K3J0nrnNJ0P%%RJ1jj6j9j2ppnJKJLJ8L2
5633G4L6K7Nk1m2m8l5j5J0K3J9KmJ3L1K6%j9k2j8j6j0klj6k5j2J5K8K6J3%qpJRJ5K2K9K4N
5615A30j5k0j5j3j5j6j5j3qjLOQJ5J6NqmJ4K3J7J1J9K4Pj9k4oJ2J4Kj3k7m0m0k5j2j0j0NL2
$$ y = [-61, -57, -53, -49, -40, -24, -10, -5, -11, -19, -24, -33, -55, -82, -96, -84, -55, -34, -39, -72, -114, -144, -146, -115, -62, -9, 27, 46, 54, 56, 52, 47, 46, 52, 56, 49, 30, 0, -41, -90, -138, -174, -194, -202, -199, -178, -139, -94, -55, -21, 13, 51, 77, 77, 52, 20, 0, -7, -18, -38, -59, -75, -87, -95, -92, -77, -65, -65, -69, -61, -44, -33, -30, -24, -10, 0, 2, 8, 24, 37, 41, 44, 59, 75, 75, 66, 69, 87, 101, 98, 84, 69, 48, 16, -20, -44, -52, -49, -44, -45, -54, -63, -61, -48, -38, -38, -39, -27, -4, 14, 21, 27, 40, 58, 68, 56, 25, -11, -38, -45, -35, -24, -22, -30, -38, -38, -29, -17, -4, 10, 25, 38, 46, 52, 56, 50, 29, 6, 3, 25, 50, 56, 40, 24, 28, 50, 74, 83, 68, 36, 6, -1, 12, 31, 31, 4, -37, -71, -84, -80, -75, -78, -85, -87, -83, -77, -77, -85, -93, -91, -78, -62, -56, -65, -83, -99, -102, -85, -53, -25, -15, -19, -22, -20, -21, -21, -4, 30, 64, 74, 57, 23, -15, -52, -74, -79, -81, -90, -94, -76, -48, -34, -40, -48, -43, -31, -19, -7, 1, -2, -19, -34, -41, -46, -54, -60, -61, -67, -84, -103, -119, -130, -131, -109, -66, -27, -8, 0, 13, 12, -25, -88, -133, -139, -129, -129, -135, -128, -102, -74, -61, -66, -77, -80, -65, -42, -24, -13, 3, 28, 51, 61, 56, 47, 42, 47, 57, 64, 64, 64, 73, 84, 83, 67, 48, 36, 29, 22, 17, 18, 20, 21, 24, 42, 74, 110, 137, 142, 121, 79, 31, -4, -19, -9, 14, 33, 35, 31, 44, 75, 101, 101, 82, 60, 42, 26, 16, 14, 11, -5, -30, -42, -27, 1, 27, 40, 40, 32, 25, 26, 35, 50, 72, 101, 125, 130, 115, 95, 80, 67, 52, 36, 21, 8, 0, -1, 2, 8, 16, 31, 47, 52, 44, 40, 54, 77, 94, 105, 124, 148, 155, 136, 112, 106, 118, 132, 134, 121, 94, 54, 14, -11, -23, -33, -43, -38, -6]
5597fM3L0J1OPpk9l0nJ8J5mj0nj0k6l7l1j6lPJ7J3pk3j9kOJLJ7K8K3RJNJ0J3J3Npj7j8j6j5
5577d2j8j5rpj1j4oRK1K1J6J0Llonjmj5k9l7l6l1k0nJ1K3K9K6J5LJJ4L0K8Pj4j7mQPjpJJ7
5558e7K6J4j4l3k7lJ2Nj1j5JK8M4M0J9kq%RMj5k9l0j9j1j3j7qJ1K7K5Pj1j8j2QK8L3K1PJ1
5540B7K8L6K5Opk1l8n4m4j1K4L6K4Ol%JjJQJ8J7J0RJ5J8J2Koj4k2j7jJ4Rj1k8l2l0k1oRJ4
5522BRMJmo%J2J2JoKRmk2k0%J7J4ok5l2j6NJ6Lj7k9k8k3j2NK2L1K7J8J1QJ8L1L3J5qj8j8j7
5502A5j7qRJ6Mj0j4rLK5N1N2K4rj8qkqj6j5j0lMLmj2pPJ5Rpk3k9k0rpj8k2rRNj5k0NL3L7J5
5482hqk0k7l2l1j7QL1L9L6K9K4J7LpkJ0J2qk9l1j6%J1K0K5J9Nmoqj0kJ5L0L4K8K0Rrk5l0k1
5463G4j2rj4k0k4k3j4LK0K6K2R%jjpj9k2j4LJ0NmoKJ0J2Rkj0j3j1nMPJk0m2m4j7J7K9J8PJ7
$$ y = [-6, 37, 67, 78, 84, 91, 84, 55, 25, 20, 38, 53, 49, 39, 34, 24, -2, -39, -70, -86, -89, -82, -65, -52, -59, -82, -101, -103, -97, -96, -93, -76, -48, -25, -16, -15, -10, 0, 13, 26, 31, 24, 7, -11, -27, -42, -60, -75, -84, -91, -102, -116, -122, -113, -92, -71, -55, -45, -42, -45, -51, -56, -57, -61, -76, -105, -142, -178, -209, -229, -234, -223, -200, -171, -145, -130, -127, -126, -112, -82, -54, -47, -61, -78, -82, -74, -67, -68, -75, -74, -57, -31, -17, -31, -64, -91, -94, -82, -77, -88, -103, -102, -74, -30, 10, 29, 27, 19, 19, 28, 32, 17, -12, -42, -61, -72, -85, -102, -110, -99, -72, -47, -40, -51, -69, -81, -73, -45, -12, 9, 16, 27, 55, 91, 116, 122, 115, 94, 56, 2, -42, -53, -29, 7, 31, 37, 34, 34, 35, 34, 35, 43, 61, 78, 88, 97, 112, 130, 142, 144, 138, 124, 102, 85, 84, 98, 107, 96, 68, 36, 6, -15, -21, -12, 2, 11, 15, 16, 12, 6, 6, 18, 30, 31, 25, 27, 36, 32, 10, -10, -10, 7, 21, 15, -10, -42, -58, -53, -37, -34, -51, -80, -108, -131, -143, -138, -116, -85, -58, -40, -29, -21, -3, 28, 61, 76, 68, 50, 32, 15, -2, -10, -1, 15, 19, 9, -5, -14, -11, 14, 65, 117, 141, 132, 114, 106, 104, 96, 80, 65, 55, 52, 56, 59, 55, 43, 36, 43, 58, 67, 60, 37, 8, -12, -21, -28, -46, -68, -77, -68, -63, -78, -98, -93, -60, -23, -8, -16, -36, -63, -95, -126, -143, -135, -104, -65, -29, 0, 24, 41, 44, 37, 35, 45, 57, 49, 20, -11, -27, -27, -16, 4, 29, 48, 53, 49, 43, 35, 25, 23, 38, 68, 102, 130, 150, 159, 150, 125, 95, 74, 62, 53, 39, 19, -5, -28, -42, -39, -19, 7, 29, 38, 38, 37, 36, 29, 10, -12, -26, -23, -13, -8, -12, -18, -16, -6, 6, 15, 13, 3, -10, -21, -26, -22, -15, -14, -34, -76, -120, -137, -120, -91, -73, -66, -49]
5444d9L7L7J7rj2JJ5J0pk5l9m9m4j6K9O3N6J5k6l6k0KOlj3j2jRJ6K2K0J2Komknj1j0%J0Mr
5425b5j8j6j0mJNRMnj2j0jONOJ2J8J3mj7j1PJ4lk4l1k1oKlj9l2l1j1J8K9J3j5l0j7J7M6N9
5406i2N4M0K8J9J3RNKmj2j5rJMK%RK0K0J0NNPjj0j1rrrlQJ2N%%lrj2oJrl2n0m9k9nNnj9k0
5385a48lJ7L2L4K8J3nj6qQJ7J8J0mk1l2k1KJ6J8J7K4L1K8J8R%j5l8m9l5mJ7J0j8l2j7J3K3
5368f3Nj3j0NQjkJ1K0J3KOJ9L0L0K1PnnNJ6J3Jj2j6j6j2n%oj9k0lK2L3K5J0lj5l1l5k0JJ1
5349BRPJ3J4kk7m1l7k4qOK0K7K3J3RQMlplQK1L3L9K9Mk2m3n2n3m6k6nPOklkknpkJ2K9L8L2
5328iJ3lqlRJ5K0K1J0j4l5l7j8PJ5Mj0j2mLNJ0J6K1J6LqpNJ8K6K5J6Kj4k7k8j4QJ6%k9m2l0
5309d8kJ6J6RNJ1J9K3J6Kj3k4k6j6JJ3J2lj2pKKpj1lKlj4j4%J7K7K2J0oj6j5qkJLQJ7K9K9
$$ y = [-49, -12, 25, 42, 33, 21, 22, 37, 47, 40, 15, -24, -73, -117, -133, -104, -41, 15, 30, 4, -32, -52, -50, -44, -47, -60, -72, -73, -64, -48, -26, -6, 6, 8, 2, -2, -4, -9, -20, -30, -30, -20, -16, -25, -43, -59, -69, -73, -72, -67, -58, -54, -59, -71, -81, -82, -76, -71, -65, -53, -35, -22, -26, -43, -54, -47, -33, -36, -60, -91, -112, -118, -116, -119, -138, -170, -201, -212, -194, -165, -152, -167, -197, -214, -197, -151, -92, -38, 2, 30, 49, 62, 71, 76, 78, 74, 62, 47, 38, 39, 43, 45, 45, 54, 74, 94, 104, 109, 114, 121, 120, 110, 99, 90, 81, 72, 69, 77, 89, 94, 94, 94, 91, 82, 70, 64, 65, 56, 24, -26, -75, -104, -109, -104, -109, -128, -148, -151, -134, -102, -68, -40, -27, -32, -48, -56, -48, -31, -13, -3, -7, -28, -60, -81, -79, -63, -45, -28, -4, 27, 55, 73, 82, 82, 67, 29, -20, -55, -59, -42, -32, -50, -82, -99, -86, -63, -58, -71, -81, -76, -68, -69, -71, -60, -40, -27, -25, -19, 0, 30, 60, 81, 88, 83, 78, 83, 99, 112, 113, 101, 85, 69, 57, 52, 52, 46, 27, 7, 4, 26, 59, 84, 94, 91, 76, 45, 10, -10, -9, 2, 11, 18, 31, 45, 43, 16, -25, -62, -86, -94, -88, -68, -41, -18, -5, 4, 12, 16, 13, 6, 3, 11, 32, 65, 104, 133, 137, 115, 72, 20, -33, -79, -105, -110, -103, -97, -99, -102, -104, -106, -111, -118, -120, -108, -79, -41, -9, 4, 1, -7, -10, -1, 14, 34, 55, 65, 51, 16, -21, -39, -32, -17, -13, -23, -35, -39, -36, -31, -21, -5, 16, 32, 35, 27, 20, 25, 43, 69, 94, 110, 112, 98, 71, 43, 29, 37, 53, 53, 24, -18, -48, -50, -34, -18, -9, -4, 7, 26, 49, 65, 67, 54, 30, 4, -12, -11, 2, 14, 11, -1, -8, -6, -4, -11, -22, -25, -23, -26, -40, -54, -54, -37, -10, 12, 22, 16, 0, -15, -23, -25, -24, -21, -13, 4, 33, 62]
5290F2J3j3k8k2p%MJ2K3K5J3NRJ5Ok2n2o4n0k0%jj1rJ0K3K1J6J8J8Kk7m0k9nRJ6K3L1K9J4
5272A7j1k5k5j2jQJ7K3J7MojQRlj7k1j6pNJ7J9Oj2k2oK7M8M4J4j6l4l5j9LK4K9J7PPJ2J0K
5253A05k%MRJ3Rj1l7m9m1l3l2l5l0j4KPKKJ3L0L5J9pk4k5j8j0qj1j0LK6M3L6J4komkJNNlo
5234c7JRJ2PLKQK1K9K6J1jqk1l1k4JJ6%k7l6j8JJ0J6K2J7Jj6k3j7j2j5k4l2k9j2RK1K6K8K9
5215e7K2J3J2Qrl5m4k6KJ8J6Mj0j7j6mJ2K7M2M8M1K1PQJ1jj9k4k4k6l1k2kJ2QjLJ5K1J2qk0
5197a3j5LJ4Oj6l2l3k3qJ1L4M6L4Lk8l4j3J4K1J1kKJ3J8J3LkmnpmOJ9K5J8Q%j3k9m3l8j1K0
5179c1L5L8L5K3kk8m4l8j8OK6L1J7j0k6j8JJ4J5QMJmj3j2mMMLJ0J8J9Nrj9k7l3k5JK9K9J3
5160B8mj5k2l1j9J0L6L4J5nj0j0qq%J1K4K6J4lk0k7k1qJ%rrMQlj2%K0K0PMJ9K1nl9m5k4JJ1
$$ y = [62, 75, 62, 34, 12, 5, 5, 9, 21, 44, 69, 82, 87, 96, 111, 117, 95, 43, -21, -71, -91, -91, -92, -103, -112, -102, -79, -58, -42, -24, -6, -4, -31, -71, -100, -105, -96, -80, -57, -26, 3, 17, 6, -19, -44, -56, -57, -49, -32, -9, 8, 12, 6, 5, 13, 22, 19, 2, -19, -35, -42, -37, -20, -1, 5, -7, -29, -35, -8, 40, 84, 98, 82, 48, 13, -6, -3, 21, 50, 67, 74, 81, 93, 103, 105, 103, 103, 107, 116, 129, 138, 127, 90, 41, 0, -33, -65, -100, -130, -144, -142, -135, -133, -131, -118, -88, -53, -34, -41, -65, -90, -108, -118, -126, -137, -147, -144, -118, -75, -39, -25, -27, -33, -37, -39, -38, -33, -28, -31, -37, -36, -27, -15, -8, -5, -3, 5, 26, 55, 81, 92, 91, 83, 62, 31, 7, 8, 24, 24, -3, -39, -57, -56, -46, -30, -8, 9, 10, -6, -29, -46, -58, -73, -97, -129, -158, -170, -161, -140, -114, -86, -57, -35, -22, -10, -2, -11, -46, -90, -116, -114, -96, -80, -76, -86, -103, -119, -123, -111, -84, -42, 6, 47, 68, 75, 83, 94, 93, 74, 50, 26, 0, -31, -53, -55, -43, -35, -36, -33, -18, 3, 15, 7, -13, -28, -25, -11, -5, -21, -53, -86, -109, -117, -106, -72, -26, 8, 11, -17, -51, -64, -50, -29, -18, -20, -18, -5, 13, 26, 29, 27, 23, 18, 11, 7, 13, 32, 57, 75, 83, 83, 70, 41, -2, -40, -51, -31, 4, 42, 77, 100, 98, 70, 26, -12, -30, -24, 2, 33, 50, 40, 14, -4, -3, 11, 26, 34, 38, 39, 35, 22, 10, 6, 10, 14, 17, 27, 45, 64, 69, 60, 41, 14, -19, -44, -43, -14, 15, 28, 24, 9, -13, -44, -63, -53, -17, 17, 32, 27, 17, 7, -1, -9, -9, 2, 26, 52, 66, 63, 43, 16, -5, -13, -12, -12, -21, -30, -26, -18, -21, -33, -33, -13, 7, 14, 18, 37, 58, 53, 14, -31, -55, -54, -43]
5141d3%k3m0l8j0K3L7L4K7K0J1OJ2J8J1ok1k7l1l7m0l2j3J1L0L8L0J2jlLJ4J8J0mrl%j2k2
5124e0pJ9K6J3MPJ2J2J6J9Kk7m3k7pJRK6M4M2L0K3J6nl2l8k2rnkPJ0NNJ5J7Nj4k3k4k3k4k4
5105b1k5k3qJ5L3L3K0kk1l0k6j3kLOJ3J8K3K3J8kk1j5PK3J4kKJ6J6mk1k1j1%PRMmqplKJ0J4
5085C9Qnj4j4j1j1oRJ9J7Jj5j8j3lOQNLKkoj1pOK1L2K6Rmnqj9k4qJ7K4J1oj5k7m9o4m9j4J3
5066a52J5Olj0j4j3lJ5L7N2M4J4j5k0lNkpRL2M4M0K0ol1l8k9j7j5j5pNJ1QNLoj5j1LJ2Mj6
5047f4l1l0j4PK1K2J6J1J2Prk7k6j7j3k0k1rPJ0MnpmLJ1J1kj5j0J5L3K1oj6lJ3J5PQJ4J4N
5028f2LJ6K5J8JlRJ7Mj5j3LJ1rl2l0nJ2J2NRJ7K5L0K7Qj8l5l2j9qlKLnj3j3j0j2j4kJ2J4%
5009g0j1lJ0K3L9N2N4L3PkLKj4k5k7k4k9l2k6j1pj2j7j3j5k9l4j7J4L0K6K3K5J9kj8nJ4Rk0
$$ y = [-43, -43, -66, -106, -144, -154, -131, -94, -60, -33, -13, -2, 4, 16, 34, 45, 39, 18, -9, -40, -77, -117, -149, -162, -151, -121, -83, -53, -41, -42, -45, -42, -28, -10, 0, -4, -13, -16, -16, -28, -50, -57, -38, -12, 1, 5, 12, 24, 36, 52, 71, 73, 46, 3, -24, -31, -30, -21, 5, 49, 91, 121, 144, 160, 155, 123, 85, 63, 54, 49, 47, 54, 64, 69, 74, 89, 106, 111, 97, 74, 50, 27, 3, -21, -46, -69, -77, -62, -29, 4, 24, 22, 1, -29, -55, -68, -70, -67, -61, -48, -30, -7, 16, 34, 32, 11, -4, 3, 26, 40, 38, 40, 56, 72, 68, 47, 26, 15, 15, 22, 31, 35, 31, 23, 16, 13, 15, 25, 39, 47, 42, 28, 14, 3, -8, -14, -5, 14, 31, 32, 17, -1, -14, -17, -11, -3, 2, 5, 7, 5, -1, -12, -19, -13, 8, 40, 66, 75, 71, 66, 58, 39, 15, 7, 24, 48, 59, 53, 38, 11, -38, -102, -151, -165, -152, -137, -131, -134, -144, -158, -171, -174, -159, -122, -70, -26, -12, -27, -47, -50, -45, -47, -54, -45, -13, 31, 71, 91, 85, 54, 16, -13, -30, -45, -60, -67, -62, -51, -43, -38, -35, -41, -56, -67, -64, -52, -48, -64, -95, -125, -139, -132, -111, -89, -73, -62, -50, -43, -52, -79, -105, -122, -135, -155, -176, -185, -178, -168, -164, -169, -176, -180, -177, -166, -155, -157, -172, -182, -167, -134, -113, -119, -135, -138, -125, -110, -103, -95, -81, -67, -62, -59, -43, -18, 0, 1, -2, 7, 24, 28, 13, 0, 3, 14, 5, -27, -57, -62, -50, -38, -33, -24, -7, 18, 48, 75, 83, 65, 30, -2, -21, -29, -32, -30, -27, -32, -45, -58, -68, -80, -94, -96, -84, -70, -70, -81, -84, -74, -51, -12, 40, 94, 127, 134, 132, 135, 137, 123, 98, 71, 47, 18, -14, -40, -51, -58, -70, -87, -100, -115, -144, -178, -195, -181, -151, -125, -102, -77, -58, -60, -78, -83, -69, -60, -80]
4992h0m4l7j0J7L4L8K7J0jOJ3J2QRJ3J2J3K0K8K3Rlj0k1l1k6oJ1J2Nkoj5k6k6j7mjlMK2L3
4974A0K3mk3j5OJ7J7J3J1Oj2k9k9j3%mj9k6j7jRJ0PLopPL3M0K0oj4KJ4J1%oqj2j4j8j5rkL
4954d7NPJ3J9J0nj5j6rmknqpPK0J5nk1j2OJ0jqkRJ3RNLLLPJ5K5K2Mj8k9k3j8j7k0j9j8k0j9
4934a38kK4M3M5L7K7J5%j7k9l3l2l0k6k4j7j0kMJ1K0K8L6M9O2N7K4j5l1k3j0j1j7j4LK0K5
4918D9J2qk5k8k0j7k0k5k1pLL%PK3L8L7K6J5J2J2Olj1j8k0j3jJj4l3l0oJ8K3J2ok8l9l0pQ
4899a25NJRJ9J6PMMmj2pOQqk8l2k6j3%J7K5K0RLOJ0J1Lqj7j1NJ8J6Nnj7k5k4pJ4K3J8J3J5
4880e9J5%k2l5k9pK1M6N3L7J4Kjmj6k6k5j0%JkjKJ%NPjj7j9kJ4Qj5l0k2p%lMK7M7M6K2kj1
4860Fj2k3n1p0n7j6K2L2K2J5RKlMJ8J7NjNPrj8KL4M6K9Qnj8l8m8l9k3j1lJ1J9J6kk3l8l6j2
$$ y = [-80, -124, -161, -171, -154, -120, -82, -55, -45, -46, -40, -27, -15, -7, 2, 15, 27, 40, 60, 88, 111, 120, 117, 107, 86, 55, 29, 23, 34, 46, 51, 49, 43, 28, 2, -24, -41, -45, -46, -49, -45, -23, 10, 33, 29, 6, -9, -3, 14, 31, 44, 55, 61, 49, 20, -9, -22, -22, -26, -45, -71, -88, -89, -80, -70, -63, -60, -66, -73, -66, -33, 7, 27, 21, 7, 9, 23, 34, 34, 28, 20, 8, -6, -24, -39, -48, -50, -47, -42, -35, -22, -3, 7, 2, -13, -29, -38, -42, -44, -49, -57, -64, -57, -37, -22, -27, -48, -60, -54, -44, -45, -53, -55, -46, -33, -24, -19, -16, -13, -10, -3, 12, 37, 59, 63, 45, 16, -7, -25, -42, -62, -81, -99, -119, -138, -140, -116, -73, -28, 9, 36, 51, 51, 34, 5, -28, -60, -90, -116, -140, -157, -167, -169, -165, -154, -134, -106, -70, -21, 41, 98, 122, 107, 76, 53, 43, 32, 15, 1, 4, 24, 49, 61, 53, 28, 0, -20, -37, -57, -82, -103, -110, -107, -104, -104, -97, -74, -36, 1, 27, 42, 54, 66, 72, 69, 58, 40, 20, 7, 6, 7, -7, -40, -70, -76, -58, -35, -23, -29, -57, -96, -126, -133, -125, -120, -119, -110, -91, -75, -68, -64, -60, -64, -76, -83, -77, -69, -77, -105, -137, -163, -176, -176, -159, -134, -114, -105, -102, -96, -86, -75, -72, -80, -97, -108, -103, -85, -69, -64, -69, -86, -111, -135, -142, -128, -105, -87, -74, -59, -44, -44, -66, -101, -130, -137, -116, -70, -17, 20, 34, 36, 35, 31, 15, -11, -36, -46, -46, -45, -47, -48, -46, -45, -45, -40, -33, -34, -51, -70, -72, -58, -50, -65, -95, -117, -124, -124, -127, -123, -96, -49, -3, 19, 17, 6, -6, -29, -80, -150, -207, -223, -201, -169, -147, -132, -123, -121, -124, -120, -102, -85, -80, -81, -76, -69, -78, -96, -94, -60, -14, 15, 23, 18, 0, -38, -86, -125, -148, -159, -162, -151, -132, -116, -118, -141, -179, -215, -227]
4841b27K3M5M0K3J3J6K3L3M1M4K3pk6k5j9j8j6j4k0l4m1k4MK1K4K2K4K0J3J2J9J8nl4m3k9
4826h1j4j3j9rJ3K7K1PKKjmLJ0Oj3k1lJ9K1QkNJ1OljRJ3Kj6l0k6nJ9K7J7Kpj0j5j5j0%QRR
4805d2Mrk2j9NK7K8J2%PJ4Pj2l3m1l9k8j0KNJ1K7M2L6QrJJ8J6%pjNLnqj4k5l4l1rK1M4M7K4
4786A6nj9qQJ3Nnrp%J0Qlj4qJ0J8Mk1l3k1MJ9J4jkK2L8K4j8m7l9j5JLONqk4j8QK9K4OkKMn
4765c1j4j2nqj8j6NL2L8J5j3j9%J9K1J7J6J6Jj5j7jQql5m9k8PK7K4Pj0k2k7k4j1nrj6rRJ6
4747a44J1MRJ6J1MMRLj1j3jOjqpm%J7N0P5O5K9Klpk8n6o3m6j2J9L8L8L0J4kj7k4j2J7M2L8
4728I2J1j8k1mJ4J1j2m1o4p2n9k8PK4J5pj8nJ7L3L7K9J2mqlkj3k4j7JJ2RONLklPJ1LoMK6L7
4709eJ9pj9j2NJ9J9J1lj0nMOMLRJ4Qqk2k0rNJ3K0K3J2qk7k4qJj3m0n4m5j6J3K4J3rj5LK4L2
$$ y = [-227, -204, -159, -119, -96, -83, -67, -44, -11, 30, 74, 97, 90, 64, 39, 20, 2, -14, -28, -48, -82, -123, -147, -143, -122, -98, -76, -52, -32, -19, -7, 12, 30, 25, -9, -52, -81, -95, -108, -127, -136, -123, -96, -75, -68, -66, -64, -65, -69, -66, -56, -50, -63, -84, -87, -68, -47, -39, -41, -36, -25, -19, -22, -23, -14, -1, 1, -15, -45, -71, -76, -57, -30, -13, -11, -18, -28, -43, -58, -68, -68, -60, -51, -42, -38, -47, -69, -88, -83, -56, -28, -16, -16, -9, 5, 12, 0, -33, -74, -113, -141, -151, -149, -144, -133, -106, -64, -28, -20, -29, -28, -10, 6, 6, -1, -2, 3, 6, 1, -7, -21, -46, -80, -111, -120, -99, -55, -8, 16, 11, -8, -16, -8, 5, 10, 5, -4, -11, -11, -1, 7, 4, -10, -18, -8, 10, 14, -7, -40, -61, -57, -38, -24, -25, -27, -5, 33, 57, 39, -8, -47, -62, -61, -58, -52, -47, -55, -79, -97, -89, -60, -36, -30, -32, -30, -26, -31, -45, -57, -62, -70, -88, -104, -99, -67, -29, -14, -27, -46, -46, -27, -6, 11, 27, 43, 44, 29, 12, 11, 19, 11, -24, -73, -101, -94, -67, -43, -36, -46, -68, -95, -119, -130, -135, -144, -160, -169, -160, -144, -133, -129, -120, -104, -93, -89, -85, -76, -73, -84, -97, -98, -92, -93, -101, -108, -112, -112, -95, -45, 30, 95, 124, 126, 123, 116, 88, 32, -31, -77, -89, -70, -32, 6, 36, 50, 48, 31, 7, -5, 12, 54, 92, 103, 85, 64, 60, 74, 85, 73, 32, -32, -104, -163, -191, -184, -160, -145, -152, -170, -175, -158, -125, -88, -59, -47, -51, -59, -62, -64, -77, -101, -118, -117, -105, -96, -90, -85, -82, -84, -87, -80, -69, -66, -72, -68, -42, -5, 14, 7, -12, -24, -19, 0, 19, 30, 27, 17, 12, 16, 22, 26, 29, 38, 52, 60, 52, 30, 10, 1, 6, 19, 39, 62, 74, 66, 39, 15, 7, 8, -5, -45, -99, -144, -160, -147, -123, -110, -119, -134, -131, -107, -75]
4689g5K1P%nqrrnQK7L2J5opJ0J5Lj0j3k2l8l7mL6M2K1LMkk1l0j0J8K5J5RJ8L0L2K6J8Ooqk
4670A14%j3l7m7k9JK3K4J6J4J8J5Mqj5k8m2m7l6j3RK8M4M3K9J4J8K9K6Qm%Mok2k3j5j1j2q
4652F5jlk4m8n4l2kJ1Mj5k4j3K1N9P2N3K3J0J8K8K2Lj0j2j4k4l8m7n0m9m2k4lJ7K2J6QPJ2
4635e8J1Knpn%RK5K9J9JmJ1K6K5Oj5k7k0nMMlm%knj0j0j3j5j4j1pmKRQKnj2j8j9oJ9M2M4K5
4615A9LqMK8L8K0j7m0l8k4k0k5k9k7k2j3mLPJ5K2K3J7J1OJnjJ1J6MpjJ2J7J0J0J3Jk2l8l8
4596f8k6pK1M8N1K7pk6k3j5rjQJ1O%mqj1j1plKJ5L7N5M9K4nj3lQJj6k7l0k8j7jK0K6J0pj3
4577C3qjLLpk0j3J5M6M3J0k4l3k8k1j1J1K8K6Nj9k7j9lJ2J9Rj3l2l7j8QK3J4nj6mJ6K4K3J7
4560B9Nj9m0m0j3J3J2nj5qMPLLPNjk%JklOK0K3Pj0pK0M6N0L1Kj4j7j2rj2k3l0k5rOJ6K1K1
$$ y = [-75, -54, -47, -47, -52, -60, -69, -78, -83, -75, -48, -16, -1, -7, -14, -4, 11, 14, 4, -9, -31, -69, -106, -110, -74, -32, -11, -8, -4, -6, -27, -57, -67, -49, -24, -9, 0, 18, 48, 80, 106, 124, 130, 124, 116, 114, 114, 101, 64, 17, -12, -11, 12, 36, 52, 66, 84, 99, 103, 95, 80, 52, 10, -37, -73, -86, -77, -49, -5, 38, 67, 81, 99, 128, 154, 162, 158, 158, 162, 156, 134, 111, 96, 85, 73, 65, 64, 61, 37, -11, -65, -97, -99, -88, -84, -99, -123, -136, -115, -56, 16, 69, 92, 102, 120, 148, 170, 173, 163, 151, 137, 113, 75, 28, -22, -71, -113, -137, -140, -123, -101, -85, -77, -70, -58, -47, -45, -50, -57, -62, -62, -53, -28, 1, 20, 21, 17, 28, 54, 79, 85, 70, 43, 23, 18, 22, 26, 23, 19, 19, 17, 12, 2, -8, -21, -36, -50, -61, -68, -72, -70, -61, -53, -51, -56, -68, -86, -105, -111, -92, -50, -6, 19, 22, 14, 18, 46, 84, 104, 87, 47, 9, -15, -35, -60, -89, -116, -138, -151, -155, -152, -145, -130, -108, -85, -68, -57, -51, -50, -55, -56, -45, -29, -25, -32, -33, -21, -4, 6, 16, 29, 30, 8, -30, -68, -94, -101, -80, -32, 19, 46, 39, 13, -10, -25, -34, -35, -27, -16, -10, -10, -14, -22, -33, -44, -51, -54, -52, -37, 0, 55, 104, 128, 123, 110, 107, 115, 116, 100, 73, 43, 15, -2, -3, 17, 43, 53, 46, 33, 25, 24, 27, 30, 23, 3, -10, 5, 51, 94, 104, 80, 47, 19, -2, -13, -2, 26, 52, 57, 38, 11, -8, -11, 1, 20, 29, 16, -16, -53, -71, -63, -40, -26, -31, -47, -51, -35, -11, 12, 29, 34, 15, -25, -65, -78, -65, -53, -58, -73, -81, -77, -70, -67, -64, -57, -52, -53, -55, -55, -54, -56, -59, -53, -33, -10, -3, -13, -20, 0, 46, 96, 127, 129, 115, 98, 86, 77, 65, 42, 12, -13, -22, -16, 0, 21, 42]
4540D2J1qk7l0j9j0qrjJ1J3PMOJj5j8LK8K9Qp%J2J1lj4k1l3m0l3j5ljlLJ4K5L0L0K2Rok3l7
4520f5m1k5NL0L4J9mj5j1MJ4J6J5K0K2J3rk1j9j7k4l5l2j2J2K8L0K5K1K1J7Jj8k1oNlj1%J6
4503b1J1j5k6j3MJnOK7L1J6jj5k9l6k4LL0L9L2J7j0l1l2oK4L0J7kj4j3oJ2K5K3OjPJ3jk6l7
4485A0k9j9j4%K6M2L0%k2k5k3j8oJ0J3POJ2Rrl0k8rMmk5m0m1k3MK1J7Koonj2j5nRJ8J5J1J5
4466a33M0P5R0O5J3k6k9j6j7k9l2j8qj3k6k9k4j6mQJ3nl8n2l1NK5K3K2L3M5L7J7jlOJ4Oj3
4449b6k8k6j1oj1rKPpk2j9LJ9K1J9J8J8J2Kqj4lK1L7K2oj9mK3L5K8J0kkMKj1k2j8j2j6k8l1
4430e8j8kJ1K7L6K6Kj6k2k4k6qK6M8M4K7J6Mj4j8LL1L1Pqqrj7j8lJ1Oj0k9l3j7PJ7kk5k6p
4412c8lj8k5rMOQK6M0L1J3ORll0m8m3j5K5N5O0L7%k4l3l1k9k1j1rj1rNJ3J0LOJ5K1J3kj2j1
$$ y = [42, 53, 45, 18, -12, -31, -41, -49, -58, -59, -48, -35, -28, -24, -18, -17, -32, -50, -47, -19, 10, 18, 11, 11, 23, 34, 31, 17, -4, -37, -77, -110, -125, -128, -129, -132, -129, -115, -90, -60, -30, -8, 1, -5, -28, -65, -106, -131, -126, -96, -62, -43, -47, -62, -73, -69, -55, -39, -24, -4, 18, 31, 22, 1, -18, -35, -59, -94, -126, -138, -126, -98, -68, -43, -22, -1, 16, 17, -1, -22, -28, -23, -26, -37, -37, -21, -10, -25, -51, -64, -60, -59, -64, -58, -31, 0, 16, 15, 0, -29, -65, -89, -86, -56, -17, 15, 32, 22, -9, -41, -47, -23, 7, 24, 22, 8, -5, -11, 1, 26, 49, 55, 54, 61, 74, 73, 47, 10, -19, -38, -52, -52, -26, 16, 46, 46, 24, -1, -24, -42, -48, -38, -25, -18, -12, 0, 9, 0, -30, -58, -67, -63, -67, -92, -132, -173, -196, -192, -171, -154, -152, -158, -164, -169, -181, -196, -201, -192, -174, -159, -148, -133, -93, -18, 72, 137, 150, 124, 95, 79, 62, 33, 1, -17, -25, -38, -64, -93, -117, -133, -137, -129, -116, -121, -159, -211, -242, -237, -212, -189, -167, -134, -89, -52, -35, -36, -39, -33, -19, -13, -26, -54, -80, -91, -97, -108, -117, -115, -108, -115, -137, -156, -153, -134, -113, -94, -76, -58, -46, -44, -52, -66, -69, -48, -11, 11, 5, -14, -18, 5, 40, 68, 78, 76, 74, 78, 80, 69, 47, 29, 17, 1, -27, -58, -76, -78, -67, -40, -4, 22, 24, 8, -14, -38, -64, -72, -46, 2, 46, 73, 89, 93, 79, 61, 64, 95, 126, 133, 125, 117, 108, 91, 73, 70, 81, 87, 77, 48, 15, -2, 5, 22, 20, -5, -31, -38, -41, -59, -84, -93, -89, -83, -75, -49, -9, 22, 35, 41, 50, 47, 17, -31, -74, -89, -64, -9, 51, 88, 88, 64, 31, 0, -29, -50, -61, -70, -81, -90, -85, -72, -62, -59, -53, -38, -17, -4, -6, -18, -29]
4393b9KK0L0K6J0qj5j2j0j0oOK2K7K1J9K0J4Jj3k1k7l6l6k4qnj2j4mMKrpJ2L1L4J7NQQpk6
4375@k0J3L8K9lk7l5l7k9j6j0k0k6qK4L5J9PJ8M0M5K8Kj6j6pKkj4j4pknj0j1j2r%J1J2LKJ2
4356a6J4%nOJ2lk5k4jJ0OJ0K4K5Kk3l1k8k3j4OK5K4J0%KLlrmNQJk1m3m3j1L9O2M4Rj1j3j3
4337a7j9j8jJ9K9K6K1J2QQJ0Mj5l0k6j4j4k5k8j3KLlonmJK0M0M2L2K5K3Ok9n1l5LK9K8J6R
4319F3Lj1k6k9j8j2j6k4l0l5l8k9pJ9L7L9L2K0MokJ0J3kk0k7k4k3k1j7oJMQJ7K0J3%oJJ2K1
4300i2K6K4J8PKJQJ7K3J6kj8j6kP%j8l1k9j5mnj7k4j0K1N1O2N0L0J0mj4j7j4mJ0K1K0Kk4m3
4282B3l9k0%J3J5Qnj3j3pnmKJ1J3POJ0Rj1k6k0npk2k3LK9L1Qk5m6m5k5nlqOL2L9J7pmOkk0
4262a22j4K0M3L0NkJ2K3K0J3RKj0k6m1n4n1l1qJ2K8M0M5L1Rnmjlqj4j9j7%K7M6M1K8J7Rlj9
$$ y = [-29, -27, -7, 23, 49, 59, 51, 36, 24, 14, 4, -2, 4, 26, 53, 74, 93, 113, 127, 128, 115, 94, 67, 31, -5, -29, -37, -42, -54, -68, -72, -68, -66, -75, -82, -70, -39, -5, 12, 17, 25, 33, 26, 0, -20, -7, 31, 60, 57, 30, -5, -42, -71, -87, -97, -117, -143, -151, -127, -92, -73, -66, -48, -8, 37, 65, 67, 51, 35, 28, 30, 28, 14, 0, -7, -9, -14, -24, -35, -47, -56, -56, -45, -33, -30, -28, -16, -2, -2, -7, -1, 11, 8, -17, -41, -42, -32, -26, -16, 8, 33, 35, 12, -19, -47, -70, -84, -78, -53, -29, -19, -19, -17, -14, -17, -26, -30, -25, -17, -16, -37, -80, -123, -134, -95, -33, 11, 20, 9, -4, -17, -36, -54, -55, -36, -7, 19, 40, 52, 60, 68, 78, 82, 67, 37, 11, -3, -17, -42, -70, -83, -81, -78, -81, -87, -92, -96, -95, -75, -35, 7, 39, 64, 87, 93, 64, 13, -22, -19, 10, 38, 54, 63, 66, 55, 29, 0, -18, -30, -46, -70, -100, -135, -173, -202, -209, -190, -153, -114, -82, -62, -58, -64, -66, -56, -43, -45, -65, -92, -116, -139, -160, -177, -183, -182, -178, -170, -153, -133, -120, -120, -126, -125, -113, -92, -66, -42, -24, -17, -15, -14, -6, 11, 34, 50, 48, 30, 14, 12, 19, 19, 1, -30, -59, -74, -78, -83, -100, -124, -134, -113, -62, 0, 50, 80, 90, 86, 72, 55, 41, 37, 47, 68, 88, 90, 66, 23, -16, -36, -36, -23, -8, 0, -5, -18, -31, -38, -43, -47, -45, -34, -21, -14, -8, 2, 11, 0, -26, -46, -51, -58, -80, -103, -100, -71, -40, -32, -57, -103, -148, -173, -178, -181, -189, -183, -151, -112, -95, -102, -106, -100, -102, -122, -136, -116, -73, -43, -38, -40, -28, -5, 15, 28, 37, 39, 29, 3, -38, -92, -143, -174, -182, -170, -142, -102, -57, -26, -17, -22, -26, -27, -30, -38, -52, -71, -88, -88, -61, -15, 26, 54, 71, 80, 77, 58]
4244E8k1j1JL%%kqj8k5l3m1m0l0j5LK1L6M2L1J4KKRJ4J7K0K4L1L3K0j0l8m5k7nKrk1k7k2j0
4226g5MJ6K3K3J7Nj1j9j5onj4k2k0mJ9L7M0K6Oj0j1nlj2k7l4k7pLlj7j6LJ8J5mk4l4l4j9J4
4208b09N1O2M5K2J6J9J7LlLNoj2mJ2J6QJmj0j4j1pj5k1lK8L9J7k2l9l3j7nkmj1qOJ6Rrj6o
4189i6RJ8J8Mk0l5k1J3M1M4K9J3mj9l0k6j0NJ4J4Q%mpj2j6j3qmKJ3K2J6MMJ7J7%j9j9kJ4K4
4170bL6M4L1Lk5l8m0l4k5qOJ3J3P%lnppMJ7J9Lj3j8qjnj0pJPLj1l0m0k6MK9L3J8%j1qPJ9J6
4150d9mk4k7qJ8L7L7K0J2J5J6ll0m1k8j0mmlklmkKPRQlj5j0J0J7kk1j5OJ2lj8j1QJ9J8J1n
4130f7k4l8l4j4LQLMJ6K6J9nk2j7mpk3k5nJ8K0Lj6j9oJ9L1K2PNK2L4K7J6J3J5Rmj0j0qkRJ5
4111DJ0qk4l5l4k6j3pj5k7k9k4k0j7kK5M6M1K0jj6k8k9rK2M2L6J4klOJ3J0LmqoMJ8K5J7mj7
$$ y = [58, 37, 26, 27, 30, 30, 30, 28, 20, 2, -23, -56, -97, -137, -167, -182, -179, -158, -122, -80, -49, -35, -33, -31, -22, -8, 9, 29, 53, 84, 117, 137, 127, 89, 44, 17, 12, 14, 5, -16, -43, -65, -75, -71, -55, -32, -9, 8, 13, 2, -17, -32, -38, -43, -57, -79, -99, -103, -84, -47, -7, 19, 25, 15, 4, -1, -4, -16, -43, -77, -104, -111, -108, -111, -128, -144, -141, -123, -108, -112, -136, -170, -204, -223, -209, -158, -96, -51, -29, -13, 6, 23, 26, 23, 26, 31, 25, 13, 9, 21, 37, 45, 46, 42, 32, 18, 7, 0, -15, -36, -39, -11, 28, 45, 23, -16, -49, -66, -71, -73, -77, -88, -96, -90, -74, -65, -74, -90, -96, -87, -69, -51, -47, -67, -102, -123, -110, -69, -25, 4, 17, 13, -6, -36, -62, -72, -67, -53, -39, -31, -31, -35, -42, -54, -70, -83, -91, -95, -93, -80, -58, -42, -38, -34, -17, 0, 0, -19, -38, -40, -26, -2, 34, 78, 109, 112, 87, 49, 9, -25, -50, -58, -52, -39, -26, -19, -19, -22, -27, -34, -41, -37, -20, -1, 2, -11, -29, -37, -38, -43, -53, -60, -59, -52, -49, -60, -90, -130, -156, -152, -123, -90, -72, -72, -83, -91, -84, -65, -49, -53, -77, -104, -112, -94, -57, -20, 0, 12, 27, 43, 40, 10, -31, -59, -69, -73, -77, -80, -82, -85, -89, -91, -89, -82, -73, -65, -68, -83, -93, -83, -66, -68, -89, -104, -98, -86, -89, -107, -118, -110, -91, -73, -62, -67, -91, -129, -163, -177, -174, -166, -163, -159, -143, -117, -98, -103, -125, -142, -146, -153, -176, -201, -206, -188, -168, -165, -181, -200, -206, -187, -156, -134, -127, -122, -100, -66, -39, -23, -10, 5, 14, 10, 0, -10, -18, -20, -11, 4, 14, 6, -18, -53, -87, -113, -126, -133, -148, -175, -204, -228, -248, -265, -267, -242, -196, -155, -135, -136, -152, -180, -209, -218, -196, -154, -118, -104, -106, -109, -103, -90, -80, -77, -81, -89, -95, -91, -73, -48, -31, -35, -52]
4092e2pJ1J7%k1j9RL7L8K4J4J7J3pl1l9k6j1m%mj4k7k4qJ0J4Mqj8k2j5MK0J9OolQK2L6M1L2
4074C0J2j3l1l9l8k8k1j8k0j3JJ5K0J5J1J0J1J0J0J3J9K5K2J2ok2l7l8k3kQMkNJ8K2J4J4K9
4057aL9K5nj7mRlk9l5j3J4J9LpJJ1Oj6l5l0j2NRJ1J7K7L1K8K1J8J6Rkj4k0j6oLM%qj4j6j8
4038Ej5j2oNJ5K2J8jj5j0J0J6Jj7j6olj1j3p%KNJ2J1KmJJ0J1J2J1Nrk1j3NJ5J4lk6m3m0j5
4019i8J8M1N2N3L4kl0k4JJ2ql3l9l2j7kP%j6k5j8j0pLK2L3J9koLPONnl7p1o6j9L0M2K1lj0
4000a71JJ9L2K6J2NPOqj8j3ork0k5k1j9k1j9j2kJ5M3O6O0K7pk3j4QM1O3N3Kn3o7m0jK3L0K8
3982bK0PonPJ4J1lj6k0j1LNj0l2l9k6j4j2j3LK8M3M1K8J1%jJ1J3ol0k7MK7K2%j5k3l3k5J1
3964f0N1N3J9qjJ1ll2m0k3KJ5J9J8jk9m3k7kOLMJ6K1J3PJ1J3nk1j6J2L2K2j0l5m1l0j5jPR
$$ y = [-52, -59, -48, -31, -31, -52, -71, -62, -25, 13, 37, 51, 68, 81, 74, 43, 4, -22, -33, -37, -37, -41, -55, -82, -106, -114, -104, -90, -86, -94, -112, -134, -149, -145, -125, -106, -100, -106, -109, -101, -79, -43, -2, 30, 42, 29, -2, -41, -79, -107, -128, -146, -166, -179, -178, -163, -143, -128, -117, -107, -96, -86, -76, -63, -44, -19, 3, 15, 9, -13, -50, -88, -111, -113, -105, -101, -103, -98, -80, -58, -44, -30, -1, 38, 63, 58, 41, 37, 46, 43, 14, -21, -34, -20, -1, 2, -5, -4, 7, 13, -3, -38, -68, -80, -75, -66, -55, -38, -11, 20, 48, 69, 87, 103, 112, 110, 96, 76, 60, 54, 57, 61, 61, 53, 39, 23, 5, -10, -22, -28, -23, -8, 14, 32, 31, 16, 6, 16, 32, 33, 16, 0, -6, -9, -20, -33, -40, -40, -38, -33, -21, -10, -8, -12, -11, -1, 10, 22, 33, 38, 29, 8, -5, 0, 15, 29, 26, 0, -43, -83, -98, -80, -39, 13, 66, 100, 98, 68, 44, 45, 57, 49, 16, -23, -55, -72, -74, -67, -67, -83, -108, -126, -136, -143, -140, -118, -85, -66, -68, -74, -71, -64, -58, -53, -58, -95, -166, -232, -251, -221, -179, -158, -161, -171, -170, -151, -119, -93, -81, -76, -69, -63, -71, -89, -102, -108, -117, -137, -162, -183, -202, -223, -242, -254, -256, -241, -198, -132, -72, -45, -52, -75, -89, -81, -40, 23, 76, 78, 25, -42, -82, -83, -60, -30, -2, 18, 25, 19, 14, 21, 35, 46, 43, 27, 7, -4, -1, 4, -6, -38, -77, -103, -117, -129, -142, -139, -111, -68, -27, 1, 12, 12, 11, 22, 35, 29, -1, -28, -24, 3, 25, 25, 10, -13, -46, -71, -60, -9, 44, 63, 55, 54, 65, 62, 30, -10, -33, -31, -16, 3, 21, 20, -9, -52, -79, -81, -75, -72, -68, -52, -31, -18, -11, 0, 13, 8, -13, -29, -17, 15, 37, 27, -8, -49, -79, -94, -95, -88, -79]
3946g9NQJ7K8K5RrrJJ2J1Lkqj7k5j8pjmkPRjqJJ4J0oj0OK2K6K4J8Roj3rlklJOOKlrj8j4QL3
3923C5L7K6J3Nj1l6m8l7k0j6k1k1rOK4L7L6K4J7J5Qk2n5o5l8lJ6J8J6J7J8K3K5J7pk9l3k3
3907f1j9k1j8lQLj2j5jJ6K4J7Mpj1oKMJoqlPJ3J1%plJ3K6L5L7M0L4J0k2m5m2k3jNMJlj4k8
3887f4l1j9%J2K1L0L9L5J8mj5j0%L%lKNol0m7m3k7pRK8M1L9K2Lrk0k7k8k8k6j8jJ7J9Kj1o
3868a35NLno%qk4k5NM3N5L7J1oj4j8j4jJ4K0J7J3Pmj2j6j6j6j9j5LK6L4K0qk4j9JK0L1L2K3
3850A5Rqj8j6omj4k5k6j5JJ3J9K2J7kk8l9k7jJ9K3J2Jn%J2K3K6K0J0PKjkMMnj8k1rOJ4J4J8
3830B1J9J7Rkon%%j0k2k4k0k1k4j6MJ6QpoJ3K3J1rk3k9l0k4rKNjl%MPOPJ1J2Lj9l0j8PJ3k
3810a42j1KK4L4L4L1K2Lj6k2j8j9j8oQMqmJ7L2K3RLlk0l1j9NJ2jj1pJNJ0K2L1K1Kj1j2j1j4
$$ y = [-79, -74, -66, -49, -21, 4, 13, 4, -5, -4, 8, 19, 22, 20, 12, -5, -30, -48, -55, -56, -60, -62, -55, -46, -47, -55, -54, -40, -30, -36, -46, -40, -18, 8, 32, 50, 59, 53, 40, 31, 28, 26, 23, 24, 30, 36, 38, 35, 26, 8, -6, 2, 35, 72, 98, 111, 116, 105, 69, 21, -16, -36, -52, -73, -94, -103, -97, -73, -36, 0, 24, 41, 56, 64, 42, -13, -78, -116, -119, -103, -85, -69, -52, -34, -11, 14, 31, 24, -5, -38, -61, -80, -101, -119, -122, -114, -111, -123, -138, -139, -123, -99, -82, -78, -85, -96, -102, -100, -96, -95, -101, -109, -112, -105, -92, -81, -81, -88, -91, -78, -52, -17, 20, 60, 94, 104, 82, 37, -5, -28, -29, -24, -20, -19, -22, -36, -64, -95, -114, -114, -102, -81, -51, -12, 23, 41, 37, 22, 12, 12, 15, 15, 12, 14, 19, 13, -17, -64, -107, -134, -141, -132, -104, -63, -24, -2, 1, -8, -28, -55, -83, -111, -137, -155, -156, -139, -120, -118, -129, -135, -130, -127, -132, -138, -138, -146, -170, -195, -190, -147, -92, -55, -44, -50, -64, -82, -96, -97, -83, -63, -46, -33, -26, -30, -42, -58, -74, -90, -109, -124, -121, -95, -61, -41, -49, -73, -92, -91, -71, -40, -8, 15, 24, 16, -2, -18, -24, -28, -42, -67, -93, -108, -107, -94, -75, -53, -36, -38, -66, -105, -132, -133, -114, -91, -79, -78, -83, -83, -71, -48, -22, -2, 8, 15, 17, 16, 14, 18, 22, 17, -1, -22, -31, -25, -11, 3, 21, 40, 57, 66, 64, 58, 53, 53, 53, 43, 21, -3, -23, -44, -68, -84, -80, -64, -56, -63, -69, -56, -33, -22, -31, -54, -83, -113, -137, -146, -144, -139, -140, -143, -143, -139, -132, -126, -119, -108, -96, -93, -112, -142, -160, -153, -140, -142, -153, -151, -127, -93, -59, -28, -6, -3, -19, -41, -59, -78, -96, -102, -94, -90, -98, -102, -85, -53, -30, -21, -18, -21, -41, -72, -91, -86, -74, -75, -86, -93, -92, -87, -77, -55, -24, -3, -1, -12, -24, -35, -49]
3791d9j5pMRLlkQJ5J7J7Qnk5l0j8LJ1lk8l9k3J0L1K7R%MJ2J9K7K4Rj8k8j9omoKQKj0j1omK
3771g8K0M7N2K5j6l7l1j2LJ1J5J5J4J0jj2j2nlj3k9l1j8jKnj2nJ0J8Rrk3k8k0kJ4J6NjJ3L4
3753g1L4J5JKPJoj0j0j0nJ0K8L5K9J2oj4j1jlj7k2j3krj9j0J8L1J1j4j7JJ1OMJ6L1K0j7n0
3735a4m8rL5M7L1Nprj0k1l5m4l6qK7N1N2L7J6kk1l5k9oK0K5J0j1j7j5r%MLlmLLj3l8m4k9q
3716a56JLMPRJ4J3ol5m5k2J0K2J4RJ0PmkJ6L6M1L3J6pk1j4ORj4l4j9J6K6ll4l1JK2J7LlMQ
3697g3KmnnopmMRJ6K6L1J5j7l0qK3K8Pqqmj0j1RL3L7J6oj1kJ1J8J2rl2l9k5qmj2j4mRJ2Pj
3677d2rj8k0rPJ7J1NQJ7J9J1QJ9K4J2nj0%NmrjPkj8j5J0K8J5j3k4j6LJ4K2K0Pnqjnk5l5k2
3657b7MJ3%j1KK1K8J0j0j6j3qnK%j7m3n0k9jJ8K7L6L9K9Rk%OORK0K8K1%j9k8l0k9k8k1pJ0
$$ y = [-49, -64, -71, -67, -58, -55, -58, -60, -52, -37, -20, -3, 5, 0, -25, -55, -73, -70, -59, -62, -90, -129, -152, -142, -111, -84, -75, -75, -71, -59, -40, -13, 11, 20, 2, -26, -45, -51, -55, -61, -59, -51, -49, -59, -70, -76, -80, -78, -58, -11, 41, 66, 50, 13, -18, -30, -27, -16, -1, 14, 28, 38, 37, 25, 13, 8, 5, -8, -37, -68, -86, -87, -85, -90, -102, -107, -97, -79, -70, -79, -102, -130, -150, -152, -138, -122, -117, -118, -105, -71, -37, -22, -21, -19, -12, -11, -17, -27, -37, -47, -52, -42, -14, 21, 50, 62, 56, 42, 31, 30, 27, 10, -12, -25, -27, -36, -55, -65, -47, -16, -5, -19, -36, -35, -24, -18, -14, 2, 33, 53, 36, -14, -62, -71, -36, 11, 42, 47, 40, 31, 21, 0, -35, -79, -115, -123, -96, -45, 7, 44, 60, 58, 37, 2, -27, -33, -13, 12, 22, 11, -6, -21, -30, -30, -26, -23, -26, -30, -27, -24, -37, -75, -119, -148, -156, -155, -152, -148, -141, -132, -118, -105, -111, -146, -191, -213, -203, -181, -167, -158, -148, -141, -145, -147, -131, -95, -54, -21, -5, -12, -33, -47, -41, -32, -46, -80, -99, -83, -57, -60, -94, -125, -124, -102, -85, -82, -85, -81, -73, -71, -75, -80, -85, -91, -98, -102, -98, -89, -73, -47, -16, -1, -18, -48, -56, -33, -5, 2, -6, -14, -18, -28, -39, -30, 3, 40, 56, 50, 39, 37, 48, 66, 78, 69, 37, -2, -27, -35, -39, -51, -65, -69, -60, -48, -41, -42, -51, -69, -89, -98, -91, -74, -63, -58, -50, -33, -14, -3, 5, 24, 48, 60, 55, 45, 45, 50, 46, 37, 36, 43, 41, 23, 8, 18, 46, 61, 48, 24, 8, 11, 25, 47, 67, 74, 69, 61, 60, 55, 30, -5, -27, -23, -10, -10, -21, -19, 2, 30, 40, 30, 14, 1, -7, -12, -10, -10, -27, -70, -120, -149, -150, -132, -105, -69, -30, -1, 8, 6, 6, 12, 18, 27, 47, 75, 96, 96, 77, 49, 19, -10, -38, -59, -66, -56]
3638e6K0K3J7J3J4J9K1J6Mj0k2k3j4%J1J3Nlmjjj1k1j7oJlj0JK7N4N2K4j4l8l9k4j1j0k0k9
3621e2k7j4LJ1PKNJ4K0J9J6J1jj0oPJ6Nj2j4jQJ3J1J0Kj1k5k4j4llj4k4j9kJ3J9J1LkLPLr
3601d8j9j9j0lPK2L1K4Lj1qnroJ4L1K6Qpj6k9m1l8k1nJ2L5N2L4rm6m4k2%J3J8R%J1M5N8K6
3583F3k6m8l6j6j0j4k0k4k0kK1K7J5%kOJ5K5L3K8J2j1k8m2m2k7lJ8K4J2pk0k0qKJKJ8L6M1
3566b7K2nk4l3l2j7OJ9J8PkmKJ1J2mk4k5%K9M3M1L0Ml0m7l5nJ3J6J4J4Nrj5j0nrrKJ8K3J0
3547a2nj0kLmj6j3NK1J9Oj%PJ8L7M6L1LrlKj4l7m5l7k6k0j5j4k3l3l2j3J1K6K7K2J9J6J3L
3529d9nlJ1K4K6J4kj4j4qmj0j8j1J3L5L4J7PJ0J6J0nj9k7k8k5j8j7j9j8j2oo%J2J7QjOJ8J5
3511d6Jrj0j4j7oJ2K2J5J4K0J8LnPK2J1j0j6mJj0k2k4k5l3l7k7j0JOJ3K0K5L3L9L3J6%pj2
$$ y = [-56, -36, -13, 4, 17, 31, 50, 71, 87, 91, 81, 59, 36, 22, 22, 33, 46, 51, 48, 44, 43, 42, 31, 10, -7, -13, -12, -15, -25, -24, 3, 57, 109, 133, 119, 81, 42, 18, 7, -3, -23, -52, -79, -93, -90, -79, -72, -70, -65, -51, -31, -12, 4, 15, 14, 4, -2, 5, 21, 26, 14, 0, -1, 7, 20, 31, 41, 43, 32, 7, -17, -31, -34, -37, -51, -75, -94, -96, -83, -64, -53, -50, -52, -49, -42, -39, -48, -67, -86, -96, -99, -92, -70, -39, -15, -12, -23, -31, -36, -45, -51, -37, -6, 20, 28, 21, 5, -24, -65, -103, -124, -129, -117, -82, -30, 4, -5, -51, -95, -117, -117, -104, -86, -77, -77, -66, -21, 37, 63, 37, -11, -47, -63, -73, -87, -107, -131, -151, -153, -132, -105, -90, -90, -92, -86, -71, -46, -13, 15, 27, 16, -12, -54, -96, -123, -126, -108, -84, -72, -79, -99, -119, -127, -125, -124, -122, -104, -68, -27, -5, -10, -34, -67, -99, -116, -110, -91, -73, -66, -68, -72, -70, -59, -47, -51, -75, -100, -100, -71, -28, 13, 43, 47, 17, -30, -65, -70, -57, -41, -27, -13, -8, -17, -32, -42, -47, -56, -65, -63, -45, -22, -12, -17, -27, -29, -26, -30, -46, -59, -54, -33, -14, -8, -9, -9, -2, 16, 53, 99, 130, 133, 124, 121, 123, 109, 72, 27, -10, -36, -56, -71, -85, -108, -141, -173, -186, -175, -149, -122, -100, -81, -65, -52, -49, -54, -57, -46, -22, 4, 18, 16, 2, -12, -20, -24, -34, -52, -63, -50, -15, 19, 36, 43, 53, 69, 79, 74, 55, 28, 0, -25, -43, -60, -79, -97, -109, -115, -121, -121, -109, -92, -84, -85, -79, -61, -46, -45, -54, -64, -78, -95, -101, -89, -67, -52, -38, -18, 0, 3, -2, 5, 27, 38, 28, 12, 8, 9, -1, -23, -47, -72, -105, -142, -169, -179, -178, -172, -159, -139, -114, -81, -42, -9, 7, 7, 0, -12]
3493a2j7k3k3k3k9l8m1l0j0J1K6L1L4L9M0K7NnLJ5J5OMMLJLPRNmj3j8j0PJ9K0J0NKLJ0K3L0
3474A21J9kj1pj%QK0J7rl3l5j5mj1k7l8m0l0j5kNJ1K4L9M3L0Qpj1oJJ4K2J3j1k2oJ8J7pk2
3456E8j7j2k4l8l0qPJ4K6L1J8qj7m%j0j4JJ6Rj5l2l7l1j8onj3j0J3L2K5Jj3nJ0J6J3J1J5K9
3438b2M3M5K8J2J0J2nk9l0jK4K5J1NJ1Rnj8j4KJ6J2nj3KK3J9j3m8n3l2j4j1j8rJ4K5J4okK5
3420C9M5L4Oj0qpj5j9j2%jj2j7j3lLLMJ2K4K5Lk7m1k5%J5J6%k3l7l1qKqk0qJ8K9K0QPQ%j0
3400c4qJ0L1L6K4jj8j8lJ1J2QJrk8m8n1k7RL4M1L1J7%j1j5j8k2k3j2%M%jJ2K3K1J4RQnk0j9
3382c5JJ9J6QLkj3k4j8KJ5Pj1k3k2qMMnrKJ7K4K7K7K3Kk6l8k8oJ5K7L0K4Mj2j8j5j6j5j5j4
3363g2j6j3LK1K3J1MJ3J9Rpj4lJ2J6J8J7J2mk3k9k6j6j6j7j0J5M3N4M1Pk4l5k2%K1K9K0Mq
$$ y = [-12, -29, -52, -75, -98, -127, -165, -206, -236, -246, -235, -209, -178, -144, -105, -65, -38, -33, -38, -35, -20, -5, 1, 5, 9, 12, 13, 16, 23, 32, 37, 33, 20, 2, -8, -1, 18, 38, 48, 53, 55, 58, 68, 91, 121, 140, 138, 127, 120, 119, 119, 127, 147, 164, 155, 122, 87, 72, 68, 57, 30, -8, -48, -78, -93, -95, -90, -79, -55, -16, 27, 57, 65, 58, 47, 41, 42, 56, 78, 91, 80, 58, 52, 70, 87, 80, 58, 41, 29, 5, -33, -63, -71, -64, -50, -24, 7, 25, 17, 0, -4, -4, -14, -28, -27, -11, -2, -17, -49, -86, -117, -135, -141, -146, -159, -169, -156, -124, -99, -98, -111, -116, -106, -90, -77, -66, -51, -22, 21, 66, 94, 106, 116, 128, 123, 94, 64, 63, 87, 112, 123, 128, 139, 148, 143, 125, 111, 113, 129, 141, 136, 123, 125, 148, 167, 154, 106, 53, 21, 7, -4, -22, -31, -17, 8, 22, 16, 14, 39, 84, 118, 124, 114, 106, 99, 84, 65, 53, 53, 52, 40, 23, 10, 7, 10, 13, 17, 29, 53, 78, 81, 54, 13, -12, -12, 3, 19, 19, -4, -41, -72, -80, -78, -86, -106, -114, -96, -67, -47, -39, -32, -24, -24, -34, -42, -32, -1, 35, 59, 58, 40, 22, 19, 30, 42, 50, 51, 42, 14, -34, -85, -112, -103, -69, -28, 3, 20, 20, 9, -6, -24, -46, -69, -81, -81, -77, -77, -78, -66, -43, -22, -8, 1, 9, 4, -16, -35, -34, -15, 1, 9, 12, 10, -3, -27, -45, -43, -28, -21, -32, -55, -77, -85, -81, -77, -82, -91, -89, -72, -48, -21, 6, 29, 31, 5, -33, -61, -67, -52, -25, 5, 29, 33, 21, 3, -12, -28, -43, -58, -72, -88, -101, -98, -77, -54, -43, -39, -26, -7, 2, -5, -19, -22, -10, 6, 24, 41, 53, 49, 26, -3, -29, -45, -61, -78, -88, -73, -30, 24, 65, 72, 48, 13, -9, -9, 12, 41, 61, 65, 57]
3346E7j1j1j9k6j8NK0J1pj0OK0J7mk4k7j8kJ3J6J1%qj2j5j5rOK4L2K7J2jprj2j8k8l3k6j0
3328a03%mj5j6kJ2RkrqonLJ9L3L1J4LJ2L7M6K5j1k4j1MJj5k6l7m4m0j2K6M7M9M2L8K7Kk4m8
3310A8o5o9m6kK8L0K2K7L9L9L4L1K6mn1p6o0k5rj9l1k2KJ7J8J0RJ7K1Nk2m1l1nJ5K1K0J8J5
3293i6Ooj1nPK0K8L0K7K4K6K4J4mj6k0j6j5j2ojKjnmkK%qk4l5l3k3j7j3oOQpk0j1J3L0L3L4
3273h3M1M3L0RMJ3K0Rj0j8j5j2j9k8k2nJ0J0LjJK%jknpkQJ5J0%kMJ0Nqj3j2nl%NQkj9k3oJ6
3252d7J9QJMQjj8k8k3j2jOJ6K1J8R%%JKOJ1Onj4kJ8J9nk2pK0L7L1K4J6%j5j5JPJ%J1J4ok8
3232H6k9j3nrj6j2%J8L0K3kj9qK1L6K3lk1k5j9j0nqj1oJlj5k2j3jPQLpj4rRJ9J8J4J6Pj7l1
3212a4j8QJ3nj4NL4N1M9M0K4Mj0j4j0plQJ6Qj8l6l8k9k2k2k6k4j4mPJ8K5K5J7OjMJ1J3J4K0
$$ y = [57, 46, 35, 16, -10, -28, -23, -3, 8, 1, -9, -3, 17, 34, 30, 6, -21, -39, -41, -28, -12, -1, -1, -9, -21, -36, -51, -60, -54, -30, 2, 29, 41, 40, 33, 24, 12, -6, -34, -67, -93, -103, -103, -107, -122, -138, -140, -128, -119, -121, -130, -138, -144, -149, -146, -127, -94, -63, -49, -46, -34, 3, 49, 74, 63, 39, 28, 32, 33, 18, -8, -45, -89, -129, -141, -115, -68, -19, 23, 61, 88, 90, 66, 18, -47, -116, -162, -164, -136, -106, -84, -57, -18, 21, 55, 86, 112, 108, 57, -19, -79, -104, -113, -132, -163, -185, -183, -166, -148, -138, -129, -112, -91, -86, -108, -149, -180, -185, -170, -149, -129, -111, -96, -90, -96, -107, -112, -105, -85, -57, -27, 0, 24, 50, 74, 88, 84, 68, 48, 32, 17, 5, -1, -2, 0, -1, -6, -10, -12, -10, -10, -18, -42, -77, -110, -133, -150, -163, -169, -163, -155, -162, -182, -193, -180, -150, -117, -83, -42, 1, 31, 40, 44, 57, 77, 86, 76, 58, 43, 31, 12, -16, -38, -43, -33, -23, -20, -21, -20, -18, -18, -19, -21, -26, -33, -35, -27, -12, -2, -2, -4, 0, 10, 15, 7, -6, -18, -23, -26, -26, -21, -13, -15, -34, -57, -63, -47, -28, -20, -19, -15, -7, -8, -26, -54, -77, -89, -90, -84, -68, -47, -29, -20, -20, -20, -19, -17, -11, 0, 6, 1, -13, -15, 3, 22, 17, -5, -12, 8, 45, 76, 100, 116, 116, 101, 86, 87, 94, 95, 95, 106, 120, 114, 86, 57, 44, 39, 30, 14, 2, 2, 20, 50, 73, 71, 52, 44, 65, 101, 124, 121, 100, 75, 56, 46, 41, 33, 22, 16, 17, 14, -1, -23, -36, -37, -30, -22, -19, -26, -40, -49, -40, -21, -3, 11, 27, 34, 17, -14, -32, -24, -11, -16, -30, -25, 9, 60, 109, 149, 173, 177, 167, 153, 143, 136, 133, 141, 157, 165, 147, 111, 73, 44, 22, 0, -26, -50, -64, -68, -61, -43, -18, 7, 24, 30, 29, 33, 44, 57, 71, 91]
3194I1K4J8Krj3j8l3m8m8m4l9l8k8oK2L8L4J6nj6j3lMPJ4K3K4J6J2J4Nk0m8n0k0J6L5L1J8
3177c5Nl%QJ6J2OJ%ok0l1k8j4qj4j6KK9M4M5M0L5J7j5l6k3RL2L0J7PJlj0j8k9l0j6LNj3l3
3159c7l3j5pj2k0j9j0NJ7K3J7OKMjj3k0qJ0J4Nm%RQnk0k4j3OK0K3J8Nj3k7j7K3O1O3K7j1k7
3140A0l1l9m0k1NJ3KoMJ5J8K0K6L0L0K9L1K3%k1k2j4j8l0l2k0j4j7j6kJ5J9J2MKJ2L0M0J5
3123F2k8m7k2J5K7J8J7K5K2kj9j9j6k8l6k2J2L7L1Kk6l4k0jLpj1JJ7J8Onrj3j5j1NJ9K3K2
3106iK0K1J6Kj3k2k8l5l8l4j9MK3L0K5J7RKmoMJ7J6lk5k9rJ4J7Jj2oJ2K3K2J8J1P%pj0j5j8
3087a1j7j0kKjkmqj0pJPMnj5k2k1pJ4K9K8J0qj0QL2L8K5KnLOknJ2L3K9kl1l9l2k8k8j5KNj1
3067f8k4j3J2L0K9J7MJRK2K8J6mj5j0jKjpj2k1k8k1njpmJ8L9L6J6jmqk1l6m0l6k7j7mJ2K1
$$ y = [91, 115, 133, 135, 126, 113, 95, 62, 14, -34, -78, -117, -155, -183, -189, -167, -129, -95, -79, -84, -100, -113, -116, -112, -105, -91, -68, -44, -28, -16, -2, 3, -17, -65, -115, -135, -119, -84, -53, -35, -30, -33, -33, -25, -9, 3, 9, 10, 10, 4, -16, -47, -75, -89, -97, -111, -127, -125, -96, -52, -7, 33, 68, 85, 70, 34, 11, 20, 52, 82, 99, 106, 107, 104, 94, 76, 47, 17, 1, 4, 9, -4, -37, -70, -85, -92, -104, -124, -143, -153, -148, -131, -108, -91, -85, -83, -79, -80, -93, -113, -121, -111, -97, -92, -96, -96, -87, -79, -84, -104, -128, -141, -135, -115, -92, -74, -69, -82, -109, -126, -103, -42, 21, 48, 37, 10, -21, -60, -100, -121, -116, -103, -101, -107, -103, -88, -70, -50, -24, 6, 36, 65, 96, 119, 119, 98, 76, 62, 44, 14, -18, -38, -52, -69, -85, -87, -72, -53, -41, -37, -35, -23, 7, 47, 62, 34, -13, -35, -20, 7, 25, 42, 67, 89, 87, 68, 49, 33, 5, -31, -53, -41, -4, 27, 29, 3, -31, -51, -52, -49, -56, -67, -66, -49, -31, -25, -30, -39, -52, -67, -78, -73, -54, -31, -9, 11, 32, 48, 50, 37, 15, -13, -48, -86, -120, -139, -135, -112, -82, -57, -40, -31, -29, -33, -39, -35, -18, -2, -5, -30, -59, -68, -54, -37, -36, -48, -54, -42, -19, 3, 21, 32, 39, 39, 32, 22, 7, -11, -28, -38, -40, -38, -39, -41, -45, -53, -63, -70, -69, -62, -58, -63, -78, -100, -121, -128, -114, -85, -57, -47, -55, -65, -57, -25, 13, 38, 40, 35, 38, 44, 42, 37, 49, 82, 111, 109, 78, 39, 7, -21, -49, -64, -62, -57, -68, -92, -105, -93, -63, -34, -17, -13, -12, -3, 19, 47, 63, 59, 44, 34, 33, 35, 34, 27, 15, -6, -34, -55, -60, -61, -68, -72, -54, -15, 21, 37, 36, 32, 24, 3, -33, -73, -109, -136, -153, -157, -145, -124]
3048a24K9L6L7K3Kj3j8j5rnJPJ1J4J1kj7k6k1pOJ4J7J2%j2j1kJ1K1K9L0K6Qpj5j9k4l0k3j
3030e6K3L5L1J5NK%j2l3m6m3k9j5ML4O3O0L0KJ0L6L5Kk9l6k4rMJ2J3KmkLNLLkj5k2j8j0rp
3011A1lkrj2LK1K6J6J2J4J2Nkok0l8m3l5k5j9j3lNNLlj5k6k3pOPMN%j0qJ6M2M8K8Lj7k2j6
2992h5KJ1Oj%J1K3L3L6K7Lj5j2%nj9k2rKKKPRLJPJ0Moomlnmlqj2j1j0j8l1l6k5%K2K1kj8j0
2970a38J5K7K1K0K9L5K2JkOOjLJ6J9Lj6j9j1oj0j7k0j5MK8M1L0Qrj3j2j0KK3L4K0pk2j6ll
2952F3rj7k5l6l8j9KMnlPNj0j9pQMnjRJ3J2K0L1K2mk1j7kKlkQJ3Qlj7k2j3LJ8J5PMJ0J0ok5
2931c1l1k0pkomMP%oQL3M5K9jk2k2j0lljRK1J9Rlj2j8k6k2qJ0K2L3L9L1Pj5k3k5l5m6m1k0
2912a37oKJ4L3M0K7QJMNNRK0K9L3K7J2k%Ppm5p1n7k0LkpKJ1PkJQJ4J8K0J8Jj5j2KQMk%%j0
$$ y = [-124, -95, -59, -22, 1, 3, -10, -28, -43, -52, -57, -56, -49, -38, -24, -13, -15, -32, -58, -79, -86, -80, -66, -49, -37, -37, -49, -60, -62, -51, -30, -1, 29, 55, 63, 56, 41, 22, -2, -32, -55, -56, -33, 2, 33, 48, 53, 55, 55, 43, 10, -36, -79, -108, -123, -119, -85, -22, 38, 68, 70, 80, 116, 151, 153, 124, 88, 64, 55, 59, 71, 84, 86, 82, 80, 83, 88, 91, 94, 92, 77, 55, 37, 27, 18, 11, 8, 6, -3, -15, -12, 9, 35, 51, 63, 77, 89, 94, 92, 86, 66, 28, -15, -50, -75, -94, -107, -110, -105, -100, -97, -100, -115, -141, -164, -171, -165, -158, -154, -149, -149, -159, -167, -151, -109, -61, -33, -30, -47, -69, -85, -83, -72, -66, -67, -67, -56, -33, 0, 36, 63, 66, 51, 39, 39, 34, 15, -7, -16, -14, -12, -10, -3, 6, 9, 10, 17, 27, 31, 25, 19, 15, 12, 7, 3, 0, -8, -20, -31, -41, -59, -90, -126, -151, -151, -129, -108, -110, -128, -138, -123, -96, -75, -55, -26, 9, 31, 32, 30, 36, 42, 41, 44, 60, 79, 82, 66, 47, 36, 30, 20, 3, -17, -32, -28, 0, 41, 71, 79, 70, 57, 45, 35, 37, 60, 94, 114, 107, 85, 69, 66, 63, 54, 37, 12, -24, -62, -81, -79, -75, -80, -83, -76, -71, -81, -100, -107, -99, -95, -100, -101, -92, -79, -67, -47, -16, 6, 2, -19, -36, -38, -36, -39, -41, -33, -20, -12, -15, -32, -54, -67, -64, -46, -31, -24, -20, -10, 0, -6, -31, -62, -82, -89, -91, -97, -101, -97, -90, -90, -96, -88, -55, -10, 19, 18, -4, -26, -36, -39, -42, -43, -34, -13, 6, 15, 12, 0, -18, -44, -66, -74, -64, -42, -9, 30, 61, 68, 53, 30, 5, -30, -76, -117, -137, -143, -141, -127, -94, -54, -27, -19, -18, -14, -9, -4, 5, 25, 54, 87, 114, 126, 124, 124, 131, 124, 79, 8, -49, -69, -66, -68, -75, -73, -62, -55, -57, -56, -48, -34, -16, 4, 22, 23, 8, -4, -2, 6, 10, 8, 8, 8, -2]
2892bk6l3l6l8k9JL7M3J7j2j5OK2J7MnmLJ4J7Pj2k5k3j5pLJ8K6K0Mj1j2kJ4K2J3qk7l3k4r
2873a00QK5L7L9L7K6J2JMK0K8J5nj7j5rkKmj9k6rJ4J4j3l2k5oKOJ6K6J6qj8lJ7J9Kj5j6nN
2855D4NlpNK1K2Nj4j8j2pmQK9M3L2jl9o1n9m2k2j2lJ3L3M0K9J3QRJ0PJ1K0K1Rj1k7l4l8l3
2837a0k6j4lMMkj3j8j1KJ3J7J7J4RL%PROko%%pk1k9k4pJ2K3K0QLJ2K5K2Kj4j3%L%jMLpj4j7
2815a7j6j5nJ0J4lj6j0RJ6Q%nj2j6j2JJ2J6K0K2J6OJ0K8L8J9j2k8k0rml%KlqrnmmkQJ7J6k
2795D8j8k2j6j8k8l2k4rLJ7L0L2J6rk1j6oKPQLpj2kJ9L0J8j5m6n1l0rpk0k3j0PJ6J8K5L9M7
2777f6L8J5qk0k0j5mOR%j6k3j6qnKK0L2K5LqMJ9J6mk0j4NJ9Qk4m9m5k1kNPJ2J1JqoJklJ0K6
2757a13K5Jk8l7k6lK3M0M5L8K6J4MlmJJ4K1J7OjQJ7Jl2m7k6RJ5ql2k6lJ0QKmj2k0j6jJ8K5
$$ y = [-2, -28, -61, -97, -135, -164, -163, -126, -83, -66, -78, -93, -87, -65, -48, -44, -49, -53, -50, -36, -19, -12, -24, -49, -72, -87, -94, -91, -73, -47, -27, -23, -34, -46, -48, -34, -12, 1, -7, -34, -67, -91, -100, -92, -67, -30, 9, 46, 72, 84, 85, 89, 109, 137, 152, 147, 130, 115, 106, 104, 106, 102, 83, 57, 48, 62, 76, 63, 31, 6, 0, 2, 8, 24, 50, 66, 58, 40, 37, 54, 73, 75, 60, 44, 39, 44, 49, 46, 39, 44, 65, 87, 92, 78, 60, 48, 41, 37, 45, 74, 117, 149, 148, 109, 48, -11, -53, -75, -87, -90, -77, -44, -4, 25, 38, 46, 55, 65, 72, 83, 103, 124, 133, 122, 95, 61, 23, -10, -36, -50, -53, -49, -45, -47, -60, -78, -89, -87, -74, -57, -40, -26, -17, -14, -14, -7, 2, 8, 6, 0, 0, 0, -7, -28, -57, -81, -88, -76, -53, -33, -25, -22, -10, 15, 37, 39, 25, 12, 12, 15, 15, 14, 18, 21, 14, 0, -17, -33, -48, -53, -43, -29, -32, -48, -58, -49, -33, -25, -25, -30, -42, -58, -70, -69, -57, -41, -21, 1, 17, 23, 33, 61, 99, 118, 106, 78, 58, 49, 45, 42, 42, 44, 41, 33, 24, 19, 15, 11, 9, 17, 34, 50, 48, 30, 8, -8, -26, -54, -86, -110, -119, -116, -99, -69, -37, -21, -30, -51, -67, -73, -71, -64, -56, -53, -60, -72, -74, -55, -25, -7, -22, -68, -119, -149, -158, -165, -185, -208, -218, -211, -195, -177, -152, -113, -66, -28, -13, -21, -41, -61, -76, -80, -74, -65, -65, -81, -104, -120, -128, -133, -131, -111, -79, -54, -51, -59, -55, -36, -20, -24, -44, -58, -53, -34, -26, -50, -99, -144, -165, -167, -162, -155, -143, -132, -131, -139, -145, -144, -146, -149, -139, -113, -88, -87, -115, -152, -178, -181, -158, -118, -73, -35, -9, 5, 9, 6, 2, 3, 17, 38, 55, 61, 60, 68, 85, 86, 54, 7, -19, -10, 5, -3, -35, -61, -64, -54, -46, -44, -48, -60, -80, -96, -97, -79, -54]
2738e4J0j6l2j8J3L0K2Jj0j0kJ0K5L2K4Ooj6k7l3j8OJ8Nj2k1k9m0l9j3K0L6K9K1K0K7K8K2
2722IJ3MOJ4J5Jrnlj9m1m2j6J0J6J2J1Qmj1pmj3k1j0M%j7k0oJ0Mj4k6j9ML5N3M6J6j3k5k0
2703g4j2nmoqmJPJ6L1M4L4Oj9k0j1j1k2k6j5JJ2J2J0QQJ0J0Mpj3nJ0J4Jj5j3NJ6Oj1j8j5j4
2684h2j3nJ3K8L8L9K7nl9m2j5RRj1k7l4l7l1j2LjnQL1L9K7J9K5K4kl9n4m3k2qkMJ5K8L6L6
2666g1L0K5J9J0nj4j4jJ5K3K3J4NORJk3m3l4lK8L4K1MKJ2K1J2j1l1l6k8qRK1J9Ooj4k0k4k3
2648d0j3lj%jj0k0j7OK6J8qj4MK2J5nj5j5k3l7l8j9KRLPK0L1K9K7L4M2L6J5mj0j3j6rJ0K6
2630E1J3k0l9k8oRRQQJ1NloJJ2J5NmJJ9L0K6J7J0ol1m6k9%Roj8mK0K9K6K6K2Qj3k5k3j6j0
2611E7%J1J4NjLQjj9l1l2k7k1qNPnk3l0k4rMJ0J4J1Kj2k2j7PK9L3K2Q%mnmmppKJ1Oj7l5l2
$$ y = [-54, -44, -60, -92, -110, -97, -67, -45, -44, -54, -64, -66, -56, -31, 1, 25, 31, 25, 9, -18, -51, -69, -63, -45, -40, -52, -73, -102, -142, -181, -194, -174, -138, -109, -88, -68, -41, -13, 9, 22, 26, 32, 46, 61, 62, 53, 48, 45, 26, -15, -57, -73, -63, -47, -35, -24, -16, -20, -31, -38, -42, -55, -76, -86, -82, -82, -99, -119, -125, -115, -111, -125, -151, -170, -166, -131, -78, -32, -16, -29, -54, -74, -86, -91, -95, -101, -109, -113, -112, -105, -89, -58, -14, 20, 26, 7, -13, -24, -35, -57, -83, -98, -97, -85, -73, -63, -55, -47, -37, -27, -23, -30, -43, -48, -38, -24, -23, -38, -51, -46, -30, -24, -35, -53, -68, -82, -95, -100, -87, -59, -21, 18, 45, 40, 1, -41, -56, -47, -38, -49, -76, -110, -147, -178, -190, -187, -188, -193, -185, -154, -115, -88, -69, -44, -20, -22, -61, -115, -158, -180, -188, -190, -186, -171, -143, -107, -71, -41, -16, 3, 13, 8, -6, -20, -21, -6, 17, 40, 54, 59, 65, 74, 75, 52, 9, -25, -28, 0, 34, 55, 59, 61, 73, 94, 106, 95, 64, 28, 0, -8, 1, 22, 41, 47, 41, 27, 7, -17, -40, -53, -56, -57, -57, -58, -68, -88, -105, -99, -73, -55, -63, -77, -73, -51, -36, -41, -56, -71, -94, -131, -169, -188, -186, -177, -174, -167, -147, -116, -87, -60, -26, 16, 52, 67, 63, 53, 40, 24, 15, 25, 51, 64, 44, 5, -23, -29, -20, -11, -3, 5, 16, 21, 18, 12, 13, 25, 40, 45, 41, 42, 61, 91, 117, 134, 144, 138, 107, 61, 32, 32, 41, 35, 17, 13, 33, 62, 88, 114, 136, 144, 131, 106, 83, 67, 57, 57, 68, 82, 87, 86, 89, 97, 96, 77, 46, 14, -13, -34, -42, -37, -30, -35, -58, -88, -112, -121, -117, -107, -93, -82, -80, -92, -114, -131, -124, -95, -62, -40, -32, -32, -36, -41, -45, -49, -56, -63, -61, -50, -44, -61, -96, -128]
2590a28rJ6L6M5L4Lk2k4nJ1J8K3K3J4j0k6j9LJ8J7Mj1j3lJ2J3ql1l2rJ2Qj8m0l8j5QK0K3K6
2573g4K5J3ok3l2l1k6j8JJ9K7K0Kj0lJ6K9K6J2mj5k1k2j5n%j1k6l0j4J7M2M5K2j2k8j7QK6
2556i3K6J4lj6k0j0Jjrj2jJ3K3K7K8K4J7J0Kj0j8k0j6j3j1mPJ0lj7j4kKrk0j7mKkpkJ8M2M9
2537c9L4Ql%ONJQK2L0K8K6K8K9K1Mj9m0n1m4k3jJ1J4J7K0J8Kk1m2m3j5K1M2K3j7m4m0j6RJ9
2519a2Rj5l4l3j3J1K0J0oj2kPJj8l5k8jK4K8J5LlopLK6M3L6J0j7l1k7rJ2J7Pno%j0l5m5k3
2501a51J2K7J8LNJ9K4J5jqlJ2K2J8Nnj1j4j6j2JJ0QMQJ4J8J2QRJ0RNmk0l6m1l6k2oJ1K1J8
2482d0Lj0j4j0lPJ4J3QOJ0J2QOJ2K1K2Rlj1j4j4qPJ8J8Ooj0qj2j8j5JJ2Prj0KJ0JnQL2L4J4
2462A01rj5rqj3j9k3j6jK3L7K4ql5l7k1ppj4pJ3K5J6%KJ9L0J3j4l0k8k8k4j4MJ3jl2n1m1j
$$ y = [-128, -137, -121, -85, -40, -6, -3, -25, -49, -54, -43, -25, -2, 21, 35, 25, -1, -20, -17, 1, 18, 22, 11, -2, -5, 7, 20, 12, -19, -51, -60, -48, -40, -58, -98, -136, -151, -143, -123, -100, -74, -49, -36, -42, -65, -97, -128, -154, -172, -171, -152, -125, -105, -103, -113, -116, -100, -71, -45, -33, -37, -52, -73, -95, -110, -115, -115, -126, -152, -182, -196, -179, -137, -92, -70, -82, -110, -127, -119, -93, -67, -53, -56, -72, -92, -102, -101, -102, -111, -123, -124, -111, -88, -61, -33, -9, 8, 18, 20, 10, -8, -28, -44, -57, -68, -72, -65, -55, -58, -75, -89, -91, -89, -98, -118, -135, -139, -137, -139, -146, -148, -130, -88, -39, -5, 3, 0, 0, 6, 11, 12, 20, 42, 72, 100, 126, 154, 183, 204, 208, 189, 149, 98, 54, 31, 30, 41, 55, 72, 92, 110, 112, 91, 49, 6, -9, 12, 54, 77, 60, 16, -24, -40, -31, -12, -3, -18, -52, -85, -98, -87, -67, -57, -63, -75, -77, -70, -69, -87, -122, -150, -151, -127, -99, -84, -81, -84, -90, -97, -94, -68, -25, 11, 21, 4, -27, -54, -63, -51, -34, -27, -32, -38, -38, -48, -83, -128, -151, -139, -112, -94, -91, -86, -67, -43, -28, -29, -37, -40, -28, -6, 12, 17, 12, 1, -13, -29, -41, -40, -30, -22, -18, -10, 4, 22, 34, 42, 51, 61, 70, 75, 71, 51, 15, -26, -62, -84, -90, -79, -58, -40, -37, -47, -61, -71, -74, -67, -53, -40, -32, -26, -16, -4, 4, 10, 22, 43, 65, 74, 71, 60, 46, 32, 24, 31, 49, 67, 73, 67, 57, 49, 37, 19, 4, 5, 17, 24, 15, 5, 7, 17, 18, 13, 21, 53, 87, 101, 92, 77, 68, 60, 47, 28, 5, -11, -12, 11, 48, 72, 64, 29, -8, -29, -36, -43, -57, -64, -51, -26, -10, -10, -8, 11, 41, 54, 40, 10, -18, -46, -70, -84, -80, -67, -68, -100, -151, -192, -193]
2444a93M3O0M1Rj0qKRJ6K2K2J6Lrk0k9k6j0J2J8jk8l1JM6O4M5Mj6mJ4J3mj8j5m%nj1j1l%j
2426Cl%PJ2RLmj1j5j0NJ3Qj1k7l9m0l1%M0N5L3%j1%RMj%kj3k4k4j1JROpk1k1oQROPJ3J2Nl
2404e8j1j8k0j1j%%J3L0L0J2mn%kn%OPQJ7K8K4Lj6j7jK0L2L5K6J3ok5l9m2l2k3j5j0lPJ8K9
2385fL3K6J2LOJ1Ooj9k6k7j4OK2J3j4l6m1k9j4kMPRJ1J5K3L4M5M0K2J1J1Mk4n4n3j8J2K1J9
2367D3K0J7Jj5k2k6l6m3k7jR%j2j6qPK7L6K2nj1KPqk3k0n%mkMlj6j1J9M2L6Nj9k3j4omLJ4
2348f6K0J8J1J2K4L8L3J5pk7m2m0k1OJ7RJJ4L1L2J9QJ0J5J5Npj4j5j6j5j2lLmk7m7m4j5J9
2331d7L3J7pk1j4KPLKOJj2j7oLmk1k4j9k0k6j4J3L1K6J6J5K0K0K2L1M0K8Kj7k5k9k3pJ4K4
2313B3K5K2J4lj7j4MJ5J5J8K0Rj4l1l2k6k0j0j1k7m8m9j9RJ4J3K6M1L2J2JJql2m5l4qJ5K5
$$ y = [-193, -150, -90, -49, -40, -50, -58, -56, -47, -31, -9, 13, 29, 32, 23, 3, -26, -52, -62, -50, -32, -33, -61, -92, -91, -45, 19, 64, 68, 52, 48, 62, 75, 71, 53, 38, 34, 34, 29, 18, 7, 4, 4, 3, 0, 0, 7, 19, 28, 31, 27, 16, 1, -9, -4, 9, 17, 6, -21, -60, -100, -131, -131, -91, -36, -3, -3, -14, -14, -5, -1, -2, -2, -4, -17, -41, -65, -76, -75, -66, -60, -67, -88, -109, -115, -107, -98, -92, -85, -72, -60, -55, -58, -69, -87, -107, -118, -119, -119, -119, -106, -76, -46, -34, -38, -43, -43, -45, -50, -50, -44, -37, -29, -12, 16, 40, 43, 27, 10, 9, 29, 61, 96, 122, 135, 129, 104, 65, 23, -9, -32, -47, -57, -60, -53, -35, -6, 27, 53, 65, 68, 74, 85, 91, 85, 66, 40, 13, -1, 5, 27, 40, 26, -10, -51, -80, -94, -96, -92, -85, -76, -65, -50, -27, 7, 52, 92, 114, 125, 136, 140, 116, 62, 9, -9, 3, 24, 43, 63, 80, 81, 66, 44, 18, -18, -61, -88, -89, -80, -80, -92, -108, -116, -109, -82, -46, -24, -29, -40, -38, -31, -39, -62, -82, -87, -87, -91, -93, -89, -92, -108, -119, -100, -58, -22, -17, -36, -59, -73, -79, -83, -80, -66, -46, -28, -17, -5, 19, 57, 90, 105, 98, 71, 29, -11, -32, -26, -9, 0, 1, 15, 46, 78, 97, 105, 115, 130, 145, 150, 143, 129, 114, 98, 83, 71, 68, 71, 67, 40, -7, -51, -66, -47, -14, 3, -4, -25, -39, -37, -30, -27, -25, -19, -18, -30, -47, -53, -50, -54, -75, -99, -118, -138, -164, -178, -165, -134, -108, -92, -77, -57, -37, -15, 16, 56, 84, 86, 69, 44, 15, -8, -15, -1, 23, 48, 70, 84, 81, 64, 50, 54, 69, 84, 102, 122, 131, 117, 86, 54, 28, 8, -2, -13, -40, -88, -137, -156, -147, -133, -120, -94, -53, -21, -9, -8, -7, -15, -47, -92, -126, -134, -119, -94]
2296i4K3J0PK1M1M3J7j1l0l8l8k4nkj4j2J2L0J9%OL7N8N4L5J2rk8k7j0Okk4m0m0l7l4l2l1
2279a51l6l9k6QM2N3L7J7J4K4L3L3L1K5J5NNRMj3k5k3j2mkpj6k3k5j6ooj4j9rJ1K8L2K2J4
2262a0J5J5Jj7j4J0L2L1K0J7K4K0%j8k4k1j4mmj7k6j6QJ1j2l4k3RK9K1Mkjnj7k4j2NJ0kj0
2244d5jJ3Rj2k3j2JKprnqj6j9j2qpoOK7M9M8J6l5o9n9k5KJ1J1R%j0nK1M2M5L3L4M6N7M8K2
2225A59ok5l6n3p0p8n2oK5K1mj6oOQQJ6K3J6mj8j3OK3K3Prj0LJ3J2RJ5K6K5Qj1j0MJ4J3NJ
2207F2KRJ4J3pl8n0k0K9N5L2j3m4l9j8pqj5qJ1K7J9ok4j5OJ2nk2j9%J4J3Mnj3j1jJ6K9K9K0
2188B8Kj9l1l3k5j3%J2J9J6LplJ2K0J6Kj1j0KJ9K5J9jj8k2j3noj5k3k9l8m6m2j6J7L8M0L4
2171a02L1K9K5K0J9J4Nk%Mlj8k1mROj7l4k3JJ0OKJ2K7K9K4K2K8L0J7ok4l4l3k4j1%jrj6j7
$$ y = [-94, -71, -61, -54, -33, 8, 51, 68, 57, 27, -11, -49, -73, -78, -80, -94, -106, -94, -64, -45, -45, -39, -2, 56, 110, 145, 157, 148, 120, 93, 83, 89, 87, 63, 23, -17, -54, -88, -120, -151, -187, -226, -252, -244, -202, -149, -112, -95, -81, -57, -24, 9, 40, 65, 80, 85, 90, 99, 103, 90, 65, 42, 30, 26, 24, 17, 1, -22, -47, -63, -69, -75, -89, -108, -117, -106, -78, -46, -24, -10, 5, 20, 21, 4, -10, 0, 32, 63, 83, 100, 124, 144, 144, 126, 102, 81, 67, 63, 59, 42, 16, 0, 8, 19, 7, -27, -50, -41, -12, 9, 13, 11, 10, 5, -12, -36, -48, -43, -33, -35, -45, -46, -33, -24, -36, -59, -71, -70, -68, -75, -84, -89, -97, -113, -132, -144, -152, -159, -165, -159, -132, -83, -35, -19, -54, -123, -182, -207, -205, -194, -183, -174, -174, -184, -189, -168, -126, -81, -48, -14, 32, 89, 137, 159, 153, 128, 92, 39, -31, -109, -161, -167, -142, -121, -125, -141, -147, -141, -133, -125, -109, -86, -70, -74, -92, -105, -99, -76, -53, -46, -55, -65, -62, -49, -37, -28, -13, 13, 38, 46, 35, 25, 29, 43, 56, 61, 62, 64, 73, 87, 100, 93, 55, 5, -15, 14, 69, 101, 88, 44, 5, -13, -20, -28, -43, -51, -40, -13, 6, 0, -24, -39, -33, -21, -26, -48, -67, -67, -53, -40, -36, -41, -54, -65, -66, -50, -21, 8, 28, 30, 11, -20, -53, -78, -91, -91, -79, -60, -44, -41, -48, -51, -39, -19, -3, -1, -12, -22, -20, -1, 24, 43, 42, 24, 2, -11, -16, -22, -37, -60, -89, -127, -173, -215, -231, -214, -176, -136, -102, -71, -42, -17, 3, 22, 36, 41, 39, 39, 43, 40, 22, 1, -3, 6, 12, -5, -39, -62, -61, -51, -45, -43, -31, -4, 25, 49, 71, 99, 129, 146, 140, 116, 82, 49, 25, 14, 14, 13, 4, -12, -29]
2153b9j0LJ2J2O%nj5l2l9k4LJ7J5J0J3J8J6Olj0qlkj1j8qJ2K1J1pj2j0qrnnj3k2j4NJ5J1P
2134a09J1K0K2K6L2L0Kl5n2l2%J0lj5kK0L0K0RJ7L4L2Ok0k9k2j5j3j2j4j6j3MK5L0J5pj7j4
2117d5kJ1J4Orj2kJ2K0J7J4Kj6l4m3m1l0rK7N8N9K4j6l5k7oJ0J9J8J0OJ7K9K5Mj6k4k3k0j7
2100b5pKOQJ8L1K7J0nqpj0j4oJ2L0L3J8jj4j8l0m7n8n4m0k6qJ6M1M8L2J4QJ0Moj3j2qooqj5
2081h4k0j6mQK2L5L6J6j1k3j6njJ0L1M5L8J4jJKrj6j1ml%J5K8J8j2l8m3k8j4%RQqk4k8j5M
2062i4J7K2J6QJ0K1K3Qj3j6llj6k5j7kNLKLmj4j5oPK0L2L8K9%l1m4l7j8mlrj1qmk%Llj9l3
2042a87k6%L2N1N1M0K4J4J4K4L2L2K2Pj3k7k9j7KJ6K2J3lj8k2k1j9j4JJ8K3J7J0J4J6jk7m1
2025C0l3j6JJ6L1L7J9rk1nJ7J8mk3k5k3k6k8k3j7k3k2lL0M7L7J6jroRJ9Rj7k7j6KQMLJkMJ7
$$ y = [-29, -39, -36, -24, -12, -6, -6, -11, -26, -58, -97, -121, -118, -101, -86, -76, -63, -45, -29, -23, -26, -36, -44, -47, -49, -60, -78, -86, -74, -53, -42, -49, -61, -71, -79, -88, -93, -98, -111, -133, -147, -142, -127, -116, -109, -98, -78, -56, -30, 2, 32, 34, -1, -53, -85, -85, -75, -78, -93, -95, -75, -45, -25, -16, 1, 35, 67, 73, 53, 24, 2, -13, -26, -38, -52, -68, -81, -77, -52, -22, -7, -14, -31, -45, -47, -36, -22, -16, -25, -37, -39, -27, -7, 10, 24, 26, 10, -24, -67, -108, -138, -147, -120, -62, -3, 21, 5, -30, -57, -63, -53, -34, -16, -6, 0, 17, 46, 71, 75, 59, 35, 12, -8, -25, -32, -30, -24, -16, 2, 33, 60, 70, 65, 57, 50, 40, 26, 20, 32, 62, 95, 113, 112, 98, 80, 50, 3, -55, -109, -149, -175, -183, -167, -126, -78, -46, -32, -24, -14, -10, -16, -29, -41, -49, -55, -61, -69, -84, -104, -120, -124, -116, -94, -59, -23, -7, -18, -41, -57, -62, -63, -53, -22, 23, 61, 75, 74, 75, 77, 68, 52, 41, 37, 34, 34, 49, 77, 95, 83, 45, 2, -26, -40, -40, -31, -23, -31, -55, -83, -98, -94, -77, -55, -39, -31, -21, 0, 23, 31, 18, 2, -1, -4, -20, -45, -62, -64, -59, -56, -54, -51, -55, -69, -84, -90, -83, -63, -31, 7, 36, 36, 5, -39, -76, -94, -98, -101, -110, -121, -129, -133, -135, -135, -132, -135, -154, -187, -213, -213, -181, -130, -79, -39, -15, -1, 13, 37, 69, 101, 123, 130, 117, 90, 61, 44, 46, 62, 84, 97, 94, 76, 54, 33, 14, 0, 1, 19, 42, 59, 69, 83, 99, 98, 71, 30, -3, -19, -18, -2, 29, 66, 85, 76, 55, 50, 67, 85, 81, 58, 33, 10, -16, -44, -67, -84, -107, -129, -132, -102, -55, -18, -2, -3, -12, -18, -9, 10, 19, 2, -25, -41, -39, -31, -27, -24, -23, -25, -21, -4]
2006dJ9%k8m1l4rK3N2N0K2j1k0j5j3qJ3L1K4qk5j8qoOK6L4J3j2j4nloLJ7J6Lnpj5l4n0n2l6
1988a35qK2L9L9K5J1JkNJ3Oj4k2j1PQjjONJQK6K3Jj5kJ9J9lk7l0j5MJ0lj7j9nPJ2J8K6J5j6
1968C0l5k7nOJmnrk1k4j2RK3K5J6J5K7L8L0NpKRjj3lK1K2rm1m6k3%J3K0J7J0kj9l3l2nK2J7
1949Bj3m0l4j1OJ2K0L2L6K8Rrj9j4JRLrj6k4l2l1nL2N4M4J7mj1nJ4L2L1jm2n6l5j1qk3k8j6
1931a15JMJkJLNMNNMMNMONJj1j5mJ4K0J5QMrk8l9l2j6lKJ1K5L1K5RKQJ6J2lj9j9j0kNJ7L0
1910a5K8Rj5k6k9k9k9k6j7qJJ1J8J6J1J0J9K3J5pk7l3j7PK1K0J5J0J1J1J1J1Mmj0lQRPRK2
1892D2K3Lk8m4l1kJ3Jj7j8KJ9K3K8M3N1L0pl7m7m5l4j8LJ3J3J3J7J7Nqroj1k5l1k5j3lmj6
1874a20k8k6j4kMJ5K7K9J4KNJ8K3J9Prk5k6oJ8J9KkJ9L5J9j8m1k4J4M2L6J4j2k8l1k2jJ8J7
$$ y = [-4, 15, 15, -13, -54, -88, -97, -74, -22, 28, 50, 39, 19, 4, -9, -17, -4, 27, 51, 43, 18, 0, -8, -14, -8, 18, 52, 65, 53, 39, 34, 31, 25, 28, 45, 61, 64, 59, 52, 37, 3, -47, -99, -135, -143, -121, -82, -43, -18, -7, -6, -8, -3, 10, 16, 2, -20, -31, -24, -16, -17, -18, -12, -7, -6, 2, 28, 51, 52, 37, 35, 54, 73, 70, 43, 13, -2, 2, 12, 9, -8, -27, -32, -25, -13, 5, 31, 46, 30, -5, -32, -37, -31, -30, -34, -39, -48, -69, -93, -105, -96, -73, -48, -32, -17, 10, 48, 78, 83, 76, 78, 87, 86, 73, 70, 91, 113, 104, 63, 17, -6, -6, 7, 27, 44, 54, 52, 33, 0, -32, -37, -15, 2, -11, -51, -85, -96, -90, -78, -58, -26, 10, 38, 47, 38, 19, 5, 6, 15, 18, 9, -7, -31, -63, -94, -99, -67, -13, 31, 48, 44, 33, 28, 42, 74, 105, 104, 62, 6, -29, -40, -48, -71, -99, -115, -114, -110, -109, -111, -110, -107, -102, -98, -93, -88, -84, -80, -75, -71, -65, -60, -59, -70, -85, -89, -75, -55, -40, -32, -28, -37, -65, -104, -136, -152, -155, -153, -142, -117, -86, -61, -52, -50, -42, -26, -14, -17, -36, -55, -65, -67, -62, -45, -15, 13, 22, 7, -19, -48, -77, -106, -132, -149, -157, -156, -145, -127, -111, -100, -90, -71, -48, -33, -40, -67, -100, -117, -110, -89, -69, -54, -44, -33, -22, -11, 0, 4, 0, -10, -13, -5, 4, 11, 20, 42, 65, 68, 40, -4, -35, -37, -24, -23, -40, -58, -56, -37, -14, 14, 57, 108, 138, 131, 94, 47, 2, -32, -50, -47, -34, -21, -8, 9, 26, 31, 23, 14, 8, -3, -28, -59, -84, -97, -100, -104, -120, -148, -174, -188, -190, -186, -171, -144, -115, -101, -99, -94, -76, -53, -34, -27, -36, -61, -87, -93, -75, -56, -54, -56, -37, -2, 17, -1, -42, -66, -52, -10, 26, 40, 28, 0, -31, -53, -54, -36, -19]
1857a9nk5k4j1kJJ4L5M3K7lk1j9j3j3k0k3j9j1qqrrj2j5pRJ5NnOK9M0K9Oj0j6j2JJ1RmoPJ7
1837d5J0nj2j1rqJJ1J0RJ6L0L1J8Koj4k9l8k5LK3K4J7J5Mj5k9k6mQjj6j4JJ1Ojklj1k0j2Q
1818i8K5L1K9K3J7NKRJ8J6Lj1j5j0%%j2k9m0m4l3j3J0K2J6%pPK6L2K0Lkpj4k5l0k1KK5L6K4
$$ y = [-19, -24, -49, -73, -84, -86, -85, -71, -36, 7, 34, 31, 10, -9, -22, -35, -55, -78, -97, -108, -116, -124, -133, -142, -154, -169, -176, -167, -152, -147, -152, -146, -117, -77, -48, -42, -52, -68, -80, -79, -68, -59, -63, -69, -62, -45, -35, -40, -52, -63, -72, -80, -79, -68, -58, -49, -33, -3, 28, 46, 48, 42, 28, -1, -39, -64, -61, -38, -14, 3, 18, 22, 7, -22, -48, -52, -44, -45, -61, -75, -74, -63, -57, -58, -60, -63, -74, -94, -106, -98, -73, -42, -13, 10, 27, 32, 34, 43, 61, 77, 80, 69, 54, 44, 44, 44, 32, 3, -37, -81, -114, -127, -117, -95, -79, -79, -86, -79, -53, -21, -1, 2, 0, -7, -21, -46, -76, -97, -95, -70, -34, -10]
$$ [...]
-3131b2
##END=	
##END=	
