##TITLE=	Oct27-2021.30.fid
TM-VI-137solid

##JCAMP-DX=	6.0	$$ MestReNova 14.3.0-30573
##DATA TYPE=	LINK
##BLOCK_ID=	1
##BLOCKS=	2    
##ORIGIN=	Mestrelab Research S.L.
##OWNER=	hrzepa
##$MNOVA/LINK_BLOCK_TYPE=	ITEM	$$ NMR Spectrum
##$MNOVA/ITEM/POLYGON=	(XY..XY)
5321,5835
8722,5835
8722,8208
5321,8208
5321,5835
##$MNOVA/ITEM/Z=	0
##$MNOVA/ITEM/ANGLE=	0
##TITLE=	Oct27-2021.30.fid
##JCAMP-DX=	6.0	$$ MestReNova 14.3.0-30573
##BLOCK_ID=	2
##DATA TYPE=	MNOVA NMR VIEW DATA
##DATA CLASS=	MNOVA VIEW DATA
##$MNOVA/ITEM/ZOOM/X=	-4.0077130307847514956,	16.00802000001239378
##$MNOVA/ITEM/ZOOM/Y=	-2212.1026695892214775,	24333.484619140625
##END=	
##TITLE=	Oct27-2021.30.fid
##JCAMP-DX=	6.0	$$ MestReNova 14.3.0-30573
##BLOCK_ID=	3
##DATA TYPE=	NMR SPECTRUM
##DATA CLASS=	XYDATA
##NUMDIM=	1
##ORIGIN=	Bruker BioSpin GmbH
##OWNER=	nmr
##.OBSERVE FREQUENCY=	400.32240192000000434
##.OBSERVE NUCLEUS=	^1H
##.SOLVENT NAME=	CDCl3
##.PULSE SEQUENCE=	zg30
##LONGDATE=	2021/10/27 12:32:00.000
##.ACQUISITIONMODE=	SIMULTANEOUS (DQD)
##$ORIGINAL FORMAT=	Bruker XWIN-NMR
##$MNOVA/SCALES_VERSION=	9
##$PARAMETER FILE=	(acqus, ASCII, /private/var/folders/f6/rjf_tdyn2v98c5c0wvkgn4s80000gn/T/1UfOSUm$Qq6M61Sed1dJYg/30/acqus, 0)
$$ ##TITLE= Parameter file, TOPSPIN		Version 3.2
$$ ##JCAMPDX= 5.0
$$ ##DATATYPE= Parameter Values
$$ ##NPOINTS= 11	$$ modification sequence number
$$ ##ORIGIN= Bruker BioSpin GmbH
$$ ##OWNER= nmr
$$ $$ 2021-10-27 12:32:40.161 +0100  nmr@CZC2524DW0
$$ $$ /opt/topspin/data/agmb/nmr/Oct27-2021/30/acqus
$$ $$ process /opt/topspin3.2/prog/mod/shimcntl
$$ ##$ACQT0= -2.3109243697479
$$ ##$AMP= (0..31)
$$ 100 100 100 100 100 100 100 100 100 100 100 100 100 100 100 100 100 100
$$ 100 100 100 100 100 100 100 100 100 100 100 100 100 100
$$ ##$AMPCOIL= (0..19)
$$ 0 0 0 0 0 0 0 0 0 0 0 0 0 0 0 0 0 0 0 0
$$ ##$ANAVPT= -1
$$ ##$AQSEQ= 0
$$ ##$AQ_mod= 3
$$ ##$AUNM= <au_zg>
$$ ##$AUTOPOS= <53 >
$$ ##$BF1= 400.32
$$ ##$BF2= 400.32
$$ ##$BF3= 400.32
$$ ##$BF4= 400.32
$$ ##$BF5= 400.32
$$ ##$BF6= 400.32
$$ ##$BF7= 400.32
$$ ##$BF8= 400.32
$$ ##$BYTORDA= 0
$$ ##$CAGPARS= (0..11)
$$ 0 0 0 0 0 0 0 0 0 0 0 0
$$ ##$CFDGTYP= 0
$$ ##$CFRGTYP= 9
$$ ##$CHEMSTR= <none>
$$ ##$CNST= (0..63)
$$ 1 1 145 1 1 1 1 1 1 1 1 1 1 1 1 1 1 1 1 1 1 1 1 1 1 1 1 1 1 1 1 1 1 1 1
$$ 1 1 1 1 1 1 1 1 1 1 1 1 1 1 1 1 1 1 1 1 1 1 1 1 1 1 1 1 1
$$ ##$CPDPRG= (0..8)
$$ <> <> <> <> <mlev> <mlev> <mlev> <mlev> <mlev>
$$ ##$D= (0..63)
$$ 0 1 0 0 0 0 0 0 0 0.06 0 0 0 0 0 0 0.0002 0 0 0 0 0 0 0 0 0 0 0 0 0 0 0
$$ 0 0 0 0 0 0 0 0 0 0 0 0 0 0 0 0 0 0 0 0 0 0 0 0 0 0 0 0 0 0 0 0
$$ ##$DATE= 1635334359
$$ ##$DE= 6.5
$$ ##$DECBNUC= <off>
$$ ##$DECIM= 2496
$$ ##$DECNUC= <off>
$$ ##$DECSTAT= 4
$$ ##$DIGMOD= 1
$$ ##$DIGTYP= 12
$$ ##$DQDMODE= 0
$$ ##$DR= 22
$$ ##$DS= 2
$$ ##$DSPFIRM= 0
$$ ##$DSPFVS= 20
$$ ##$DTYPA= 0
$$ ##$EXP= <proton>
$$ ##$F1LIST= <111111111111111>
$$ ##$F2LIST= <222222222222222>
$$ ##$F3LIST= <333333333333333>
$$ ##$FCUCHAN= (0..9)
$$ 0 2 0 0 0 0 0 0 0 0
$$ ##$FL1= 90
$$ ##$FL2= 90
$$ ##$FL3= 90
$$ [...]
$$ ##$Sgu3PowerLevels= (0..7)
$$ 0 0 0 0 0 0 0 0
$$ ##$Sgu4PowerLevels= (0..7)
$$ 0 0 0 0 0 0 0 0
$$ ##$Sgu5PowerLevels= (0..7)
$$ 0 0 0 0 0 0 0 0
$$ ##$Sgu6PowerLevels= (0..7)
$$ 0 0 0 0 0 0 0 0
$$ ##$Sgu7PowerLevels= (0..7)
$$ 0 0 0 0 0 0 0 0
$$ ##$Sgu8PowerLevels= (0..7)
$$ 0 0 0 0 0 0 0 0
$$ ##$SguType= 3
$$ ##$ShimPowMaxUA= (0..63)
$$ 130000 130000 130000 130000 130000 130000 130000 130000 130000 130000 130000
$$ 130000 130000 130000 130000 130000 130000 130000 130000 130000 0 0 0 0
$$ 0 0 0 0 0 0 0 0 0 0 0 0 0 0 0 0 0 0 0 0 0 0 0 0 0 0 0 0 0 0 0 0 0 0 0 0
$$ 0 0 0 0
$$ ##$ShimPowMaxUC= (0..63)
$$ 130000 130000 130000 130000 130000 130000 130000 130000 130000 130000 130000
$$ 130000 130000 130000 130000 130000 130000 130000 130000 130000 0 0 0 0
$$ 0 0 0 0 0 0 0 0 0 0 0 0 0 0 0 0 0 0 0 0 0 0 0 0 0 0 0 0 0 0 0 0 0 0 0 0
$$ 0 0 0 0
$$ ##$ShimPowMaxUG= (0..63)
$$ 524287 524287 524287 524287 524287 524287 524287 524287 524287 524287 524287
$$ 524287 524287 524287 524287 524287 524287 524287 524287 524287 0 0 0 0
$$ 0 0 0 0 0 0 0 0 0 0 0 0 0 0 0 0 0 0 0 0 0 0 0 0 0 0 0 0 0 0 0 0 0 0 0 0
$$ 0 0 0 0
$$ ##$ShimPowRcbType= 3
$$ ##$ShimPowRes= (0..63)
$$ 1e-20 1e-20 1e-20 1e-20 1e-20 1e-20 1e-20 1e-20 1e-20 1e-20 1e-20 1e-20
$$ 1e-20 1e-20 1e-20 1e-20 1e-20 1e-20 1e-20 1e-20 0 0 0 0 0 0 0 0 0 0 0 0
$$ 0 0 0 0 0 0 0 0 0 0 0 0 0 0 0 0 0 0 0 0 0 0 0 0 0 0 0 0 0 0 0 0
$$ ##$ShimPowRng0= (0..63)
$$ 1 1 1 1 1 1 1 1 1 1 1 1 1 1 1 1 1 1 1 1 0 0 0 0 0 0 0 0 0 0 0 0 0 0 0 0
$$ 0 0 0 0 0 0 0 0 0 0 0 0 0 0 0 0 0 0 0 0 0 0 0 0 0 0 0 0
$$ ##$ShimPowRng1= (0..63)
$$ 1 1 1 1 1 1 1 1 1 1 1 1 1 1 1 1 1 1 1 1 0 0 0 0 0 0 0 0 0 0 0 0 0 0 0 0
$$ 0 0 0 0 0 0 0 0 0 0 0 0 0 0 0 0 0 0 0 0 0 0 0 0 0 0 0 0
$$ ##$ShimPowRng2= (0..63)
$$ 1 1 1 1 1 1 1 1 1 1 1 1 1 1 1 1 1 1 1 1 0 0 0 0 0 0 0 0 0 0 0 0 0 0 0 0
$$ 0 0 0 0 0 0 0 0 0 0 0 0 0 0 0 0 0 0 0 0 0 0 0 0 0 0 0 0
$$ ##$ShimPowRng3= (0..63)
$$ 1 1 1 1 1 1 1 1 1 1 1 1 1 1 1 1 1 1 1 1 0 0 0 0 0 0 0 0 0 0 0 0 0 0 0 0
$$ 0 0 0 0 0 0 0 0 0 0 0 0 0 0 0 0 0 0 0 0 0 0 0 0 0 0 0 0
$$ ##$ShimSysFunc= (0..63)
$$ 1 2 3 4 5 7 9 11 15 16 8 10 12 14 6 17 13 18 19 20 0 0 0 0 0 0 0 0 0 0
$$ 0 0 0 0 0 0 0 0 0 0 0 0 0 0 0 0 0 0 0 0 0 0 0 0 0 0 0 0 0 0 0 0 0 0
$$ ##$ShimSysMatrix= 0
$$ ##$ShimSysType= 1
$$ ##$TFXNUM= 0
$$ ##$TRIPLO2= 0
$$ ##$VTU= 2
$$ ##$VTUETH= <149.236.99.20>
$$ ##$VTUTY= <no>
$$ ##$WBREFAM= (0..15)
$$ 132.2 106.2 100 100 100 100 100 100 100 100 100 100 100 100 100 100
$$ ##$WBREFLM= (0..15)
$$ 0 0 0 0 0 0 0 0 0 0 0 0 0 0 0 0
$$ ##$WBREFPH= (0..15)
$$ 77.55 -65.76 0 0 0 0 0 0 0 0 0 0 0 0 0 0
$$ ##$WBSGU= (0..15)
$$ 0 0 0 0 0 0 0 0 0 0 0 0 0 0 0 0
$$ ##$XFAC= 2
$$ ##END=
$$ 
##$DECIM=	2496
##$DSPFVS=	20
##XUNITS=	HZ
##YUNITS=	ARBITRARY UNITS
##FIRSTX=	6408.3305663999999524
##LASTX=	-1604.3676804825092859
##DELTAX=	-0.12226593800080123864
##XFACTOR=	1
##YFACTOR=	0.019446950287890875375
##FIRSTY=	12.396068572998046875
##MINY=	0.032340176403522491455
##MAXY=	22121.349609375
##NPOINTS=	65536
##XYDATA=	(X++(Y..Y))
$$ [...]
2756 574 649 635 562 510 516 553 572 555 525 509 509 508 490 458 430 417 430 469 521 562 585 605 628 635 604 544 490 465 472 496 513 506 478 455 445 431 409 413
2751 413 469 546 588 585 575 580 582 564 542 533 527 507 472 438 414 398 393 396 406 419 438 458 467 460 441 424 424 443 462 461 446 448 472 487 469 442 436 434 406 379 411 496
2746 496 558 553 529 552 612 655 656 635 605 565 524 497 482 464 444 430 418 396 378 393 437 469 465 450 455 465 447 407 387 407 433 430 411 416 451 475 452 400
2741 400 367 384 432 464 454 427 435 492 553 564 528 494 489 497 499 506 519 509 463 422 423 451 464 456 455 454 421 362 328 345 378 387 375 366 365 369 388 424 464 491 505
2736 505 506 483 437 394 377 381 389 387 380 381 409 462 501 491 452 443 472 490 466 433 423 406 342 261 238 299 398 476 508 505 496 509 539 543 500 454 460 507 527 488
2731 488 432 415 441 472 472 435 388 378 437 537 618 640 609 557 515 507 541 588 603 577 552 567 611 643 645 624 591 548 499 454 424 410 409 417 427 430 423 419
2727 419 442 500 564 593 577 540 507 478 450 438 448 466 484 518 570 607 597 559 531 515 489 461 458 473 464 430 417 453 506 529 515 485 449 409 381 383
2722 383 411 450 475 472 451 452 499 552 545 474 410 408 441 456 446 441 442 435 427 431 434 414 383 372 383 389 382 376 376 374 374 392 425 449 454 454 463 468 463 460 473 498 518 519 496 452
2717 452 405 381 390 420 457 493 524 542 546 543 535 519 504 503 518 536 545 545 545 544 542 535 518 490 452 411 370 337 322 331 355 382 408 437 463 477 476 461 436 407 389
2711 389 394 420 462 516 564 572 535 488 471 480 485 477 475 486 498 507 519 526 519 514 535 568 562 512 469 470 486 473 437 420 430 450 475 524 595 653 662 622 561 512 489
2706 489 486 488 486 481 473 464 463 483 508 506 473 438 425 423 413 397 382 360 330 319 340 369 383 394 426 465 480 478 478 468 427 387 404 471 523 521 493 470 445 415 410
2701 410 443 478 487 494 523 552 550 533 537 549 528 472 428 423 444 468 489 496 477 445 427 431 437 437 441 450 444 421 404 407 410 393 367 363 391 429 445 425 388 370 385 408
2696 408 413 414 446 502 532 516 485 472 467 449 431 434 449 455 460 486 520 519 470 410 387 403 423 417 383 352 355 393 430 432 402 381 405 472 542 571 548 506 492 508
2691 508 512 477 436 436 475 502 494 474 470 475 467 443 419 415 431 448 442 411 390 407 447 476 490 513 537 527 479 438 437 453 442 398 347 302 270 270 307 350 362 357
2687 357 382 448 508 518 483 447 442 455 455 431 415 443 502 537 511 456 418 404 390 376 385 414 427 401 355 323 325 355 391 412 419 436 474 504 497 461 434 425
2682 425 420 419 435 458 459 430 400 385 376 365 366 378 388 395 419 456 477 468 447 430 412 397 408 439 454 446 456 495 509 459 393 373 379 360 332 360 441 499 497 481
2677 481 497 511 478 408 350 326 324 331 341 359 393 442 480 474 437 407 398 389 379 400 452 486 471 445 456 483 476 433 400 399 409 409 397 367 331 331 399 497 552
2672 552 546 529 532 525 482 428 400 394 391 397 422 445 446 440 453 470 457 423 409 421 418 384 361 395 469 525 533 514 492 470 439 405 392 420 474 522 541 541 537 526 493
2667 493 443 407 397 402 415 446 489 506 475 424 401 408 422 443 488 534 532 485 455 481 515 498 437 394 391 400 405 422 467 525 570 586 570 531 498 491 491 469 430
2662 430 405 393 359 301 269 298 354 382 369 341 314 286 273 292 332 357 353 348 366 404 437 439 400 340 297 300 337 367 369 364 385 443 505 522 476 410 393 439
2658 439 488 493 475 481 498 488 467 490 556 583 530 449 411 419 433 444 462 477 471 463 482 522 556 584 618 634 597 530 493 501 511 493 465 447 428 415 442 507
2653 507 553 542 513 512 519 491 456 465 496 470 379 315 337 389 390 353 344 377 407 424 464 518 509 401 274 236 292 347 343 322 347 398 405 356 314 335 393 421
2649 421 397 355 340 358 386 403 406 403 406 411 399 360 316 311 359 425 452 429 399 416 485 560 585 544 474 432 454 513 546 513 438 384 371 369 350 336 356 390
2644 390 391 356 340 379 445 489 502 507 510 498 468 435 412 409 432 472 501 504 506 526 537 491 406 361 400 476 523 532 536 536 512 476 469 488 482 427 369 364 404 428 407
2639 407 367 346 348 366 401 453 497 502 468 420 373 326 288 284 319 353 351 335 354 408 452 461 463 488 514 497 442 406 431 497 550 556 525 492 477 466 442 407
2634 407 388 396 421 445 465 479 476 458 442 439 433 415 402 425 478 518 518 489 456 434 424 424 426 418 401 392 401 420 431 429 417 398 377 367 377 402 422 432 437 441 421
2629 421 361 284 255 301 373 392 355 332 366 418 427 401 397 430 463 470 462 456 453 452 465 485 494 486 480 489 503 508 504 495 481 470 470 475 474 467 456 435 406 407 468 551 569 501
2624 501 417 389 402 407 399 405 422 420 393 366 362 382 414 431 409 364 348 380 414 400 363 356 379 391 383 388 407 409 391 392 421 440 428 414 428 454 457 434 400 366
2619 366 339 334 352 377 397 420 443 458 471 503 541 540 485 433 443 497 528 509 472 452 456 469 476 456 413 386 410 462 481 445 407 422 480 524 520 486 455
2614 455 450 467 492 503 482 431 378 359 379 409 413 389 358 338 330 328 333 340 343 348 364 381 379 360 357 387 424 429 404 378 365 355 344 345 363 384 397 414 449 490 511
2609 511 509 500 502 504 490 459 431 416 417 434 467 498 489 436 385 382 418 445 440 422 415 423 451 504 559 573 536 488 459 432 393 363 368 389 402 421 466 506 490 428
2605 428 392 423 484 515 503 479 469 476 492 502 500 489 478 477 486 500 498 464 405 358 347 359 373 387 399 383 334 301 330 383 381 321 288 332 396 405 364 336
2600 336 342 351 345 349 391 461 513 512 466 429 446 504 544 531 487 445 410 379 364 378 401 408 407 417 434 441 444 463 493 507 500 494 495 478 434 396 395 420 433 429 435 471
2595 471 510 512 470 421 402 409 417 420 431 449 451 426 397 391 399 403 400 401 403 399 401 431 478 513 526 534 542 529 487 444 431 435 422 384 345 328 335 349 352 334 305 290 308 350
2589 350 394 425 446 451 429 383 342 337 358 368 346 315 301 300 303 320 366 419 433 407 385 400 428 429 414 415 432 437 431 449 494 514 467 383 336 363 432 481 481
2585 481 448 423 435 485 537 552 519 461 415 403 420 440 446 445 450 464 478 486 483 471 452 438 428 412 384 363 367 380 377 369 389 443 493 516 532 557 565 522 447
2580 447 389 362 344 332 348 397 444 459 456 454 446 415 370 346 364 410 448 451 418 385 386 420 450 456 460 478 489 465 431 434 479 513 500 459 425 408 410 439 487
2575 487 515 501 482 502 546 552 502 446 435 465 500 515 511 496 480 467 455 442 444 475 513 517 476 422 385 362 343 339 361 388 382 334 274 243 261 313 364 387
2570 387 393 402 409 395 374 389 443 477 459 429 432 447 426 382 369 395 425 438 446 449 431 409 416 445 457 449 458 490 495 444 378 350 359 377 402 435 464 478 493 519
2566 519 535 519 484 456 443 442 457 470 454 417 418 485 564 582 544 506 495 487 470 456 449 427 390 368 388 441 497 531 535 531 549 584 595 562 527 534 559 551 511
2561 511 486 492 501 505 524 544 526 485 486 537 564 523 471 477 505 484 427 411 454 491 478 449 448 461 451 427 422 438 449 446 446 449 430 376 323 322 378 443 472 468 459
2556 459 446 406 339 292 308 382 470 526 534 496 433 381 375 413 453 453 411 370 367 390 399 382 364 369 379 382 401 451 497 492 451 427 422 397 365 396 497 567 535
2551 535 463 459 513 526 482 467 536 625 650 619 586 574 564 549 538 523 495 469 469 490 500 491 479 474 470 473 499 543 567 549 515 506 527 547 544 533 539 557 557 526
2546 526 490 479 487 477 434 387 370 380 390 387 377 362 336 313 319 358 396 400 375 356 357 360 355 358 384 417 427 408 378 357 352 361 380 403 424 440 448 442 427 428 459
2541 459 502 524 514 499 503 523 540 540 523 497 478 476 477 452 395 344 334 364 406 441 467 483 490 488 478 450 410 383 390 411 406 370 337 337 362 388 405 417 418 394
2536 394 349 311 314 354 393 403 399 408 421 405 364 348 376 399 370 325 333 395 438 422 380 360 365 379 407 451 486 480 436 382 345 343 379 427 448 443 452 496 533
2531 533 509 418 311 248 263 347 432 448 402 383 440 507 492 414 370 388 402 372 351 392 460 488 468 433 396 356 340 372 420 430 408 413 463 498 468
2527 468 400 363 379 416 442 456 474 503 531 543 532 516 511 506 475 424 396 418 456 457 419 388 393 413 430 453 490 517 508 476 452 446 445 455 494 551 580 560
2522 560 526 522 545 556 536 502 478 474 487 505 511 502 492 494 501 502 499 508 517 493 427 365 354 393 438 457 461 467 475 469 449 428 415 405 393 386 388 389 381 371 370 372 362 348 363
2517 363 414 465 473 441 405 380 353 320 303 317 343 349 335 324 329 344 359 378 401 414 401 370 349 364 410 459 490 500 501 498 492 484 479 475 469 460 454 450 447 454 477 506
2512 506 527 538 548 557 553 528 490 450 424 433 481 533 541 505 472 471 478 463 440 436 444 437 415 405 412 414 394 366 348 347 360 374 375 370 392 450 503 503 468 449 453 440 407
2507 407 405 456 507 508 482 479 490 477 450 457 495 505 459 403 387 402 412 410 424 458 486 491 481 473 470 463 454 450 459 477 494 503 498 478 452 449 495 573 625 604 526 453
2501 453 423 427 436 437 436 434 425 414 419 452 497 516 485 431 406 417 421 383 346 371 448 497 477 432 422 442 446 418 389 390 423 466 488 476 447 438 467 508 530 522 499
2496 499 476 467 475 476 443 394 387 437 485 477 443 453 503 530 510 482 475 471 457 464 504 541 531 484 446 434 432 429 430 439 454 473 484 471 435 403 402 425 446 448 437 432
2491 432 440 449 430 384 350 369 419 439 401 352 339 357 369 367 368 380 393 402 407 406 401 404 413 408 383 367 381 403 407 410 440 480 483 439 388 360 355 363 387 428 479 533 575
2486 575 580 537 481 460 472 480 472 466 465 449 423 428 471 512 520 505 481 433 370 342 373 413 406 372 365 388 398 377 356 350 342 326 323 344 370 385 398 416 420 399 378
2481 378 389 427 466 487 495 500 500 489 457 404 343 306 319 372 425 436 398 337 291 283 312 364 420 458 459 419 364 330 340 381 423 458 499 547 574 551 497
2477 497 460 457 459 448 452 493 531 506 424 353 328 321 300 285 303 339 371 408 457 489 478 454 460 481 472 436 424 442 433 378 338 367 429 452 435 431 461 482 462
2472 462 421 397 390 380 366 363 382 411 434 441 438 439 455 479 493 489 477 460 424 363 309 306 360 417 426 394 370 378 400 415 425 441 452 438 401 371 380 424 471 479
2467 479 441 391 371 390 422 437 435 426 420 427 459 506 527 488 400 318 292 327 388 429 441 448 473 493 468 404 365 395 457 481 445 390 363 371 390 389 359 330
2462 330 340 386 416 404 383 392 412 405 388 406 448 452 409 378 400 442 456 443 431 423 406 388 382 388 400 415 427 422 407 397 385 359 349 406 511 562 506 411
2458 411 376 400 422 424 441 478 495 484 480 492 491 470 457 459 444 410 411 473 544 559 531 519 539 548 520 483 477 496 505 494 491 513 544 545 504 441 384 344 335 369
2453 369 433 480 473 432 411 434 467 466 427 380 357 356 355 343 341 382 445 467 415 350 350 414 473 495 510 537 546 512 462 436 432 426 420 432 456 468 464 460 464 473 492 523
2448 523 548 543 514 491 489 496 501 508 521 522 494 444 404 402 432 459 447 397 352 349 379 409 422 424 424 415 397 390 408 431 423 383 352 366 403 409 373 345 369 428 463 447
2442 447 412 403 423 438 421 383 363 375 392 379 341 323 343 376 391 395 400 397 384 384 405 413 383 357 382 430 432 396 394 437 454 415 379 389 396 360 336 383 447
2438 447 436 379 384 477 564 577 547 516 479 433 418 455 501 513 509 524 537 506 443 409 434 477 486 458 432 444 485 515 505 477 468 482 490 476 461 456 438 391
2433 391 347 360 435 513 527 470 399 382 428 481 487 457 445 471 496 480 433 392 374 370 376 392 422 469 530 580 591 565 539 542 560 563 548 529 515 508 508 498
2428 498 460 408 387 409 428 399 344 329 376 444 485 494 483 461 436 417 400 380 371 386 416 433 433 437 453 462 452 434 414 383 347 340 376 425 449 451 460 475 481
2424 481 475 473 468 450 442 486 569 619 587 514 466 456 454 452 477 524 551 530 483 445 425 419 431 451 453 433 426 452 474 447 386 344 341 351 356 372 421 482 517 499
2419 499 441 384 369 390 397 369 351 391 461 487 452 400 364 333 309 317 349 362 353 377 453 515 506 457 429 423 405 377 363 362 377 434 531 596 575 514 501 536
2414 536 551 530 513 505 477 448 470 534 565 544 533 550 531 443 353 322 325 320 328 378 429 442 453 509 574 574 514 455 421 394 379 397 422 412 391 420 492
2410 492 536 518 478 452 431 413 421 451 460 431 398 393 398 399 404 417 419 413 426 451 436 363 287 265 289 326 370 422 450 430 390 369 364 351 343 362 390 390 365 352
2405 352 357 358 356 376 419 456 466 457 441 422 409 414 425 422 412 412 415 397 370 376 417 442 415 368 363 411 466 477 432 364 331 362 420 435 392 354 376 431 449 418
2400 418 387 390 412 425 435 459 483 474 434 408 426 463 465 417 358 328 326 325 318 315 324 344 382 439 475 451 388 362 407 468 478 443 414 412 422 447 498 541 519
2395 519 435 366 369 412 441 456 491 534 538 489 437 427 444 448 426 401 398 418 445 456 435 382 332 327 373 427 441 415 388 399 445 495 514 485 422 369 364 397
2390 397 418 402 375 371 386 396 403 426 458 465 440 413 412 433 453 465 472 476 482 495 508 507 497 495 501 497 489 503 537 545 507 463 457 468 452 414 398 405 396 359 337 362 412
2385 412 454 483 503 508 494 473 463 469 489 515 526 496 436 389 379 382 371 349 340 349 361 368 375 391 428 490 556 587 573 546 532 516 477 434 415 414 412 413 434 454
2380 454 442 414 422 475 523 527 505 492 491 492 503 523 531 514 496 497 502 489 480 517 590 638 617 556 517 519 528 501 440 392 404 470 530 539 514 512 548 576 556 517 511
2375 511 537 544 510 480 499 540 547 516 485 474 461 437 424 430 430 416 422 466 506 497 454 420 390 347 328 385 486 519 447 371 392 481 530 503 456 445 463
2371 463 484 503 523 539 553 567 575 566 550 546 542 510 456 427 447 487 502 494 481 463 427 386 370 387 417 441 454 456 445 430 424 431 448 478 523 557 544 491 451
2366 451 457 472 447 400 392 435 472 463 444 464 510 530 510 486 479 476 461 437 409 388 399 456 519 523 466 414 410 419 397 366 375 417 444 440 436 453 481 510 534 538 513
2361 513 489 500 527 514 452 399 405 450 485 488 462 422 387 381 391 370 301 241 257 337 406 417 395 397 439 497 537 545 533 517 502 482 461 452 458 468 485 521
2356 521 565 580 548 500 470 453 433 424 447 483 487 451 411 401 417 440 461 472 463 439 417 408 402 391 377 369 366 370 377 379 373 373 389 411 426 446 490 545 574 562 530
2351 530 501 489 504 545 583 583 553 527 510 478 444 454 513 551 520 460 436 444 438 412 399 409 423 436 457 464 427 369 348 380 421 443 460 482 488 477 483 510
2347 510 504 430 340 317 368 435 473 488 491 483 478 496 526 520 461 399 396 449 497 497 461 433 437 465 496 513 500 453 399 378 404 438 433 393 362 359 360 343 324 328 355
2342 355 396 446 489 496 465 439 454 488 494 473 467 479 475 443 426 459 521 567 580 562 520 476 469 504 539 530 485 452 452 470 484 478 446 394 350 340 364 394 413
2337 413 421 425 434 447 451 427 378 337 331 341 336 322 326 355 383 400 422 453 472 467 452 440 433 432 440 451 461 490 563 655 693 640 549 498 505 524 523 513 522 550 568 555
2332 555 523 505 512 516 492 454 437 443 443 437 455 499 517 480 425 393 375 358 367 428 497 512 485 480 508 518 490 469 480 485 449 407 414 470 526 543 523 490 468
2327 468 463 461 446 434 454 497 510 481 458 488 542 561 534 500 487 491 500 514 525 523 515 521 539 542 506 442 390 386 431 481 487 456 444 479 519 507 447 390 370 389
2322 389 435 493 532 526 491 472 476 468 432 397 397 423 443 446 451 476 513 540 539 514 481 458 450 450 448 437 414 391 387 406 430 446 461 489 516 532 549 578 590 546
2317 546 465 410 409 424 425 429 452 473 468 461 491 548 580 561 515 489 501 534 547 514 458 427 434 430 381 318 302 333 356 346 334 347 372 385 394 409 412 388 365
2312 365 382 425 448 442 450 494 542 550 529 513 503 479 448 442 461 473 469 484 524 546 520 484 480 485 463 440 460 498 492 450 450 512 560 541 507 520 560 570 545
2308 545 520 492 442 395 398 442 473 472 457 439 411 390 408 453 471 442 401 378 367 364 385 433 474 486 487 502 522 528 521 514 508 496 475 450 438 461 513 544 514
2303 514 456 444 495 550 563 555 550 529 472 418 406 409 379 338 352 421 464 431 377 388 473 562 595 573 537 508 484 469 475 498 510 487 449 439 465 490 485
2298 485 471 481 512 534 530 516 512 522 531 526 512 508 517 523 517 519 547 573 548 480 426 415 410 384 370 405 453 450 399 362 379 425 464 485 487 467 436 408 377 335 308
2293 308 329 387 435 458 488 535 557 520 453 419 434 458 451 418 395 406 436 448 434 424 444 475 477 446 417 407 398 381 373 378 382 379 394 438 482 495 484 479 494
2288 494 516 532 529 506 474 459 474 497 503 485 458 438 434 444 449 433 410 416 451 470 455 439 460 501 518 506 497 508 522 528 525 511 479 445 433 442 451 443 421 392
2284 392 361 352 384 447 502 520 506 475 442 431 460 501 501 445 387 375 385 369 332 333 391 452 457 409 348 296 262 268 329 412 453 439 417 421 426 407 390 405
2279 405 431 430 418 437 480 496 481 476 490 492 479 495 545 563 514 455 452 492 518 523 528 518 466 406 401 441 451 405 365 386 450 500 509 483 438 396 380 393 424
2274 424 467 515 536 500 429 380 364 353 336 348 392 424 411 381 378 398 416 427 439 444 435 425 430 444 455 466 476 471 457 457 477 493 496 510 539 541 488 429 428
2269 428 473 499 480 453 446 443 432 421 421 427 439 458 461 425 366 326 317 306 282 284 350 445 500 489 452 442 470 507 522 515 512 525 536 516 466 415 394 404 425
2265 425 432 418 403 408 432 454 467 484 500 486 435 385 374 385 383 379 408 471 522 539 541 550 548 525 500 500 513 510 486 465 475 521 577 601 563 471 373 319 323 359
2260 359 384 378 357 361 402 451 480 494 505 501 467 426 413 421 414 386 372 388 418 449 488 524 528 496 457 425 389 357 356 389 414 413 422 462 499 490 455 439 449 461
2255 461 461 453 429 398 394 442 512 553 555 533 487 427 407 468 564 604 565 521 539 603 644 624 558 497 492 548 608 606 541 475 448 449 456 471 495 497 455 387 334
2250 334 322 348 388 409 399 380 384 407 418 408 407 432 451 421 347 271 231 245 303 374 426 446 446 445 449 465 488 497 474 444 443 466 473 456 451 475 485 442 371
2245 371 336 362 418 462 475 467 460 463 454 409 353 345 405 475 492 462 427 404 376 347 338 357 391 437 491 533 545 535 520 500 472 456 468 487 484 468 461 455 429
2241 429 395 383 383 363 343 370 434 457 406 344 342 389 431 443 438 431 428 430 427 399 354 339 379 439 469 467 461 464 465 461 448 415 366 340 368 427 471 485 482 466 444
2236 444 443 480 523 522 485 455 447 432 402 384 380 359 328 349 449 562 608 585 552 532 500 441 380 345 341 363 402 429 407 351 320 348 397 402 356 313 317
2231 317 361 414 464 503 511 475 427 427 493 566 577 529 478 465 477 484 482 490 513 537 547 536 515 507 528 567 595 589 554 511 482 483 507 525 509 471 458 498 557
2226 557 578 548 503 473 463 464 479 505 524 529 535 559 582 567 506 444 437 493 564 599 587 550 507 463 417 370 317 257 211 212 273 367 447 486 484 454 420 404
2222 404 407 411 405 404 423 455 474 475 474 476 469 444 413 397 404 428 452 462 455 442 436 439 448 459 466 464 463 475 496 496 463 427 414 406 368 315 305 354 414 436 427 417 421 436 459
2216 459 484 491 483 487 511 522 493 458 471 523 555 530 482 451 442 438 440 464 502 523 510 486 490 518 524 472 393 353 378 435 481 505 513 491 437 382 358 364 383 416
2211 416 465 506 515 511 531 568 577 543 501 472 450 442 480 561 627 635 611 602 611 607 588 576 571 549 499 442 407 403 414 414 393 378 407 474 514 480 412 395 459 543
2206 543 568 524 459 422 422 432 428 409 380 344 315 327 397 480 511 484 459 470 477 440 392 385 412 427 430 457 504 524 502 478 478 479 454 415 384 366 364 393 451
2202 451 502 525 533 539 526 490 470 490 520 516 479 448 432 418 406 414 432 428 408 408 439 457 434 394 381 392 397 391 390 391 374 352 376 467 561 568 487 407 400 447 494
2197 494 531 584 639 643 588 527 506 508 499 486 495 510 493 436 384 382 434 506 550 533 469 413 401 418 426 416 407 417 447 499 557 580 534 450 395 395 412 408 390
2192 390 388 404 416 405 382 380 421 486 520 497 458 458 489 496 468 452 474 503 515 538 591 634 627 588 564 550 514 467 453 475 493 486 484 504 526 532 531 530 514 480
2187 480 452 448 455 454 450 454 462 458 445 436 437 454 485 516 518 488 459 458 467 459 444 458 506 561 602 637 662 656 609 554 524 524 532 533 526 506 466 416 375 359 364 377 394 419
2181 419 455 498 530 535 512 483 480 510 548 562 546 515 488 476 481 498 509 495 461 434 443 481 520 537 530 508 480 455 447 454 462 462 457 455 456 454 449 441 430 421 430 458 487
2176 487 496 490 484 476 452 419 402 410 426 438 455 481 494 481 466 488 542 578 558 503 463 470 506 531 519 494 503 554 602 600 557 516 487 448 413 423 474 506 479
2171 479 439 445 484 509 515 523 515 449 353 320 384 472 510 521 555 593 577 519 491 517 538 511 467 447 435 399 364 390 483 579 614 588 547 527 524 508 466
2167 466 423 408 415 413 392 387 420 463 473 461 470 505 527 506 471 453 446 427 409 429 485 526 505 427 345 307 324 372 421 459 495 537 577 600 596 565 516 461
2162 461 423 419 453 505 540 530 484 449 458 491 491 443 398 407 458 496 501 493 493 496 501 519 546 555 536 515 517 532 539 533 523 505 477 454 446 445 441 446 465 468 428 372 352 380
2157 380 415 432 450 488 530 547 538 520 501 487 491 521 561 588 589 563 525 500 509 540 556 542 520 514 517 519 527 543 535 481 411 383 413 471 521 541 511 435 360
2152 360 342 378 419 442 472 515 528 485 431 422 452 465 440 403 385 393 427 476 511 506 478 463 472 481 482 495 521 533 518 497 493 491 479 479 515 562 569 523 466 443
2147 443 467 521 577 604 579 523 484 491 524 534 497 444 422 449 484 469 406 364 401 484 533 513 470 455 466 476 477 475 466 448 436 445 462 468 463 452 428 394
2143 394 379 416 481 516 492 438 396 386 408 444 467 465 461 481 499 471 406 369 385 404 374 319 299 335 399 463 506 501 438 352 302 310 358 419 480 525 540
2138 540 525 499 476 469 493 540 577 577 559 557 569 573 571 576 572 532 469 426 419 430 457 507 555 556 520 501 518 531 515 505 520 517 464 404 389 404 396 363 346 365
2133 365 398 426 442 444 445 469 513 519 459 396 406 469 497 465 436 452 485 510 540 582 603 583 544 508 471 442 457 512 545 517 466 447 453 446 430 432 448 454
2129 454 448 445 442 440 456 500 542 550 541 537 522 470 421 428 466 452 374 314 332 393 439 479 554 645 689 659 591 540 528 544 556 552 551 579 612 595 523 464 467 494
2124 494 479 432 414 437 449 426 416 454 496 487 440 418 444 477 481 467 458 453 437 422 432 459 466 435 401 410 455 494 504 501 495 471 423 390 403 435 432 392 365
2119 365 381 412 419 402 382 372 380 412 462 502 507 484 456 436 423 418 418 418 423 442 469 478 469 473 502 516 480 429 415 432 433 425 451 497 494 422 359 367 407 423 431 469
2114 469 509 494 444 425 443 448 434 451 507 532 490 439 437 468 480 472 475 484 478 467 475 489 482 465 470 491 494 473 451 430 391 344 331 363 402 418 419 416 402 385 386
2109 386 391 357 283 239 277 358 416 442 474 508 506 467 440 448 468 479 490 507 509 489 475 489 502 489 471 482 501 484 440 427 466 511 516 496 487 487 475 453
2104 453 439 436 432 435 461 504 533 527 495 451 406 377 384 419 453 467 469 469 461 441 426 428 435 435 438 455 482 511 546 577 570 512 453 442 463 454 404 367 387 440 484 505
2099 505 506 482 439 404 397 397 383 373 394 434 460 467 474 483 474 453 459 506 556 575 571 571 574 555 511 468 450 451 447 433 422 431 459 489 509 518 518 511 498 489 495 520 565 614
2094 614 625 559 433 332 324 387 446 469 487 518 535 520 496 485 466 427 400 417 449 446 418 422 465 487 454 404 387 403 428 464 519 559 548 505 485
2089 485 503 527 533 534 532 492 408 335 338 408 477 507 510 510 503 481 459 451 451 452 457 460 431 358 290 295 374 453 472 446 434 457 498 534 548 526 468 408 388 410 429
2084 429 414 387 381 395 402 391 388 413 457 486 476 431 381 355 358 376 388 382 367 361 385 435 482 494 474 449 427 401 377 382 419 448 431 390 378 416 476 522
2080 522 532 501 446 409 418 453 467 451 442 459 472 456 429 424 439 448 437 412 388 381 404 450 498 526 529 511 476 451 464 508 541 537 521 516 509 482 457 456 460 437
2075 437 397 385 408 435 448 459 469 456 420 399 412 439 456 468 483 489 477 468 489 526 544 527 497 483 491 498 483 461 468 513 552 535 475 426 410 405 402 422
2070 422 471 517 540 561 586 579 520 460 450 472 473 450 441 454 458 442 431 436 437 428 433 458 479 478 467 467 490 546 625 673 638 537 452 432 438 424 410 438 493 518
2065 518 507 510 557 606 601 551 511 511 526 523 508 512 540 563 554 529 517 530 558 591 623 642 631 589 532 468 400 346 326 341 378 426 476 498 469 409 370 378
2061 378 415 461 517 574 601 586 564 560 553 514 456 421 423 445 467 472 452 419 411 444 487 503 500 509 526 521 491 468 472 497 531 560 560 510 440 401 403 405 383 361 366
2056 366 378 372 362 380 426 471 499 526 564 602 624 624 611 596 589 592 596 583 544 500 484 507 544 559 547 540 555 570 552 495 420 351 311 327 404 492 523 484
2051 484 427 400 392 374 352 361 412 471 500 490 463 449 468 510 543 541 505 468 459 474 490 490 477 459 440 419 410 428 475 529 565 568 536 475 410 374 379 397 402
2046 402 400 406 412 399 383 396 438 465 453 429 429 450 469 482 497 500 466 403 358 367 413 447 444 431 446 493 531 526 493 474 481 492 496 513 565 630 667 656 616 578
2041 578 561 560 558 544 524 517 527 540 542 536 532 539 554 563 550 522 506 518 539 539 525 518 514 486 438 408 415 428 417 394 384 393 414 438 439 393 324 298 342 401 420 420
2036 420 441 462 434 374 347 368 385 382 407 489 576 594 541 473 433 428 446 473 491 495 493 487 468 437 422 444 489 520 522 507 497 504 523 538 527 484 431 402
2031 402 414 449 467 445 407 405 452 502 507 478 463 476 489 484 481 497 528 565 600 608 567 496 452 464 495 502 481 449 410 368 348 361 376 369 359 378 422 463
2027 463 497 533 553 529 477 440 435 442 453 481 515 511 467 437 456 476 424 310 227 241 326 407 442 444 447 456 467 481 501 524 534 534 534 527 491 434 402 423 457
2022 457 454 432 462 554 628 611 523 447 425 437 450 451 442 435 444 475 504 500 471 458 474 487 475 470 505 554 556 511 485 514 543 509 441 423 476 530 529 495 474
2017 474 456 409 346 324 367 443 505 529 514 474 436 424 427 421 399 376 362 356 367 403 442 444 411 397 441 509 541 520 484 463 458 463 479 501 508 482 437 407
2013 407 417 458 493 497 481 475 482 483 467 451 453 465 475 486 509 535 540 516 478 456 467 499 513 487 447 453 514 568 562 521 508 531 544 525 510 524 550 574 612
2008 612 665 678 604 480 392 379 405 430 451 479 507 530 545 546 528 506 505 518 516 505 523 571 584 522 447 442 498 524 485 447 468 522 552 552 543 523 481
2003 481 438 421 419 407 396 420 470 500 488 457 435 424 425 449 486 504 489 468 462 457 439 430 454 490 499 483 474 484 492 482 465 457 458 456 445 429 423 442 482 508 492
1998 492 449 419 421 431 423 398 378 375 389 405 405 380 348 342 372 421 468 508 541 559 549 514 468 425 395 383 393 422 469 524 566 577 560 533 503 458 404
1994 404 379 404 451 463 424 370 339 346 387 453 517 545 524 481 443 408 370 350 373 416 424 382 337 339 383 432 476 518 547 544 515 482 444 386 336 350 429
1989 429 503 511 481 474 493 496 478 481 528 580 595 578 550 509 455 419 432 475 494 469 443 462 513 542 526 499 501 525 535 526 523 532 524 487 461 475 499 483 437
1985 437 415 431 439 416 393 400 416 414 406 419 443 455 466 499 542 557 541 520 511 503 490 487 495 501 502 512 524 509 461 421 424 450 460 445 433 441 448 431 392 355 343
1979 343 357 383 408 441 502 583 638 624 552 484 471 506 539 533 497 461 434 396 353 344 400 483 518 481 422 399 413 429 436 442 438 412 382 389 434 474 475 452
1975 452 436 439 451 467 482 483 457 415 384 379 394 419 448 474 489 489 478 469 474 495 514 516 510 519 537 534 505 489 517 572 614 636 649 639 584 509 471 479 484 456 435
1970 435 457 494 494 463 447 461 481 503 544 594 602 548 473 429 424 428 424 413 396 381 385 412 447 467 475 481 486 486 489 506 527 531 514 498 501 519 535 543 540 533 527 528 534 538 528
1964 528 504 478 471 484 492 474 453 478 553 611 591 515 463 475 514 526 501 461 420 388 383 410 445 459 455 457 473 480 466 448 455 490 528 539 515 484 486 528 566
1960 566 555 501 462 472 507 520 501 471 450 438 438 455 480 493 487 477 473 471 466 472 488 496 483 470 475 478 445 385 348 353 367 361 346 347 364 380 403 446 491 502 469
1955 469 426 404 410 438 474 499 492 460 430 415 407 404 423 479 548 583 553 471 388 358 401 477 520 504 466 455 459 431 365 321 344 409 446 429 405 430 503
1950 503 573 598 577 543 529 547 575 563 489 393 343 367 422 461 480 499 511 491 449 424 432 444 443 447 468 478 444 387 348 344 360 388 436 491 525 529 526 533
1945 533 536 532 546 587 614 578 497 444 458 501 515 495 481 494 519 534 531 509 470 436 439 479 525 550 560 565 553 516 475 462 473 476 464 455 453 436 403 391 428
1941 428 479 489 449 401 392 422 460 480 478 469 464 463 469 496 550 596 583 512 453 471 537 568 526 456 415 412 423 437 467 511 546 551 529 507 503 510 498 456 409 400
1936 400 432 460 443 394 371 407 471 498 471 434 438 476 492 460 416 410 439 466 469 461 454 443 432 436 450 447 410 370 369 414 466 489 471 430 391 377 398 445 497
1931 497 540 568 577 561 524 475 430 398 388 401 430 464 493 513 513 484 437 403 399 412 423 445 495 559 595 580 538 492 442 396 395 461 552 596 577 536 499
1926 499 448 386 359 393 448 473 475 493 525 531 502 471 463 468 471 479 502 530 547 547 534 512 484 451 422 421 458 503 498 433 374 384 437 470 476 494 516 492 440 455
1922 455 562 654 629 526 458 462 489 507 528 540 504 429 375 373 389 398 418 461 487 463 415 393 409 435 447 436 403 367 363 403 451 460 437 423 439 463
1917 463 471 457 418 353 293 286 342 404 412 371 340 350 386 425 463 498 512 495 471 463 455 425 385 371 388 407 420 446 481 487 453 430 461 517 546 554 584 634
1912 634 647 594 519 477 468 450 410 376 380 413 434 411 366 353 402 473 505 486 455 434 410 374 354 378 430 468 476 469 466 472 490 509 511 484 438 399 383 389 416
1908 416 454 486 501 501 508 529 553 560 551 545 551 557 545 522 513 524 531 517 494 478 455 416 392 417 472 503 500 504 524 523 480 434 427 446 453 445 434 413 379 355 364 384 374
1902 374 341 331 364 416 459 487 492 457 397 360 377 425 446 408 330 270 276 343 416 445 424 388 370 381 412 438 435 417 425 472 509 498 466 463 480 466 422
1898 422 398 410 420 409 425 492 561 576 557 552 552 510 431 376 381 409 419 415 422 432 419 386 373 399 437 441 404 366 364 396 432 450 446 428 412 421 458 491 493 482
1893 482 498 537 556 539 515 505 479 425 390 417 467 464 402 357 376 426 449 436 408 380 358 357 387 424 445 456 481 514 523 499 472 466 471 467 463 479 509 525
1888 525 521 521 531 525 491 462 469 493 490 457 438 451 471 471 462 465 473 464 426 361 284 227 224 270 321 345 365 419 501 570 602 600 576 541 513 507 508 490 458 448 483 539
1883 539 578 588 577 556 532 503 465 422 393 401 449 512 566 603 622 620 591 544 499 481 496 522 525 497 465 451 445 431 417 415 415 398 383 408 470 510 486 427
1879 427 390 386 386 376 375 399 434 458 474 500 532 545 522 486 468 471 474 473 486 508 502 451 399 399 439 462 446 428 439 459 456 431 415 421 439 441 414 372 347 357
1874 357 379 385 385 408 446 458 438 434 472 515 516 477 432 404 404 428 453 446 423 446 530 599 574 484 416 399 389 363 358 396 453 502 540 561 540 483 442 449 479
1869 479 489 474 456 435 408 387 392 418 435 434 433 452 491 526 534 516 492 473 447 406 368 353 354 348 345 372 418 440 433 432 451 463 460 484 551 599 571 494 445 442
1864 442 445 435 434 441 429 398 392 432 481 504 511 523 528 503 455 418 415 451 505 543 540 515 508 531 552 546 523 498 467 431 424 468 527 537 482 409 371 385 443 516
1859 516 567 565 523 484 472 471 469 474 491 497 469 432 433 484 550 584 577 550 527 515 507 497 483 472 468 467 466 462 462 467 466 448 421 407 418 430 417 389 386 427 479 490 448
1854 448 393 367 378 404 426 437 434 420 410 420 447 467 461 445 450 479 494 463 402 369 393 455 511 536 521 470 405 376 414 483 521 507 477 453 416 353
1850 353 306 318 376 427 444 450 465 479 478 467 460 455 443 424 406 405 436 496 554 575 560 537 518 488 443 412 413 431 442 456 491 535 555 547 536 534 533 533 548 572
1845 572 566 516 458 433 438 444 443 449 450 416 351 311 339 398 413 364 302 284 312 360 411 456 481 484 494 530 568 568 534 512 517 517 489 458 457 470 467 449 444 462 488
1840 488 505 507 487 448 411 401 421 464 522 567 551 473 407 415 456 442 375 346 394 455 474 483 525 559 524 449 417 445 477 479 463 442 418 413 449 499 513
1835 513 501 524 590 631 597 537 521 548 573 582 592 596 566 504 450 435 453 481 501 507 504 510 528 531 492 433 409 441 493 517 513 505 499 479 449 431 434 433 415 406 437
1830 437 493 530 537 541 541 504 432 394 438 502 499 443 424 464 482 438 408 468 567 598 553 515 528 541 516 485 493 526 542 535 524 512 485 452 440 458 480 479
1825 479 461 455 483 522 521 452 362 329 379 456 493 483 462 446 418 381 369 394 419 405 375 382 436 475 443 363 311 329 390 453 499 527 525 495 464 462 485
1821 485 504 506 500 498 492 473 438 392 355 357 404 458 474 447 408 375 344 332 372 457 527 538 513 501 504 500 493 509 541 545 502 445 415 413 426 452 490 512 491 447
1816 447 433 467 502 481 414 365 372 413 448 471 497 516 501 445 385 363 389 442 487 501 493 499 533 567 561 521 497 517 562 601 628 638 615 564 523 517 520 491
1811 491 439 410 423 455 473 473 465 462 471 484 484 464 448 460 488 493 464 426 411 429 469 504 503 460 409 393 407 411 395 386 395 397 374 349 351 380 417 441 435 397 357
1806 357 353 384 404 392 381 404 443 469 486 508 519 504 492 516 557 559 513 462 438 435 442 463 487 494 486 491 507 500 467 453 485 524 518 476 446 443 444 435 427 426 424 426 447
1801 447 475 478 442 396 376 388 429 488 542 558 531 496 489 502 509 510 516 514 484 442 431 464 508 524 506 465 414 382 410 497 579 602 581 572 577 554 498 467 495
1796 495 541 552 535 526 520 490 446 442 497 566 600 592 566 537 510 498 508 529 545 559 577 588 574 536 499 482 481 479 476 476 470 444 399 361 352 366 385 405 440 484
1791 484 498 461 397 355 352 373 397 410 405 383 371 394 439 470 473 467 471 478 479 478 475 459 435 427 441 455 457 467 492 500 468 426 411 413 392 355 347 378 411 419 426 451 463
1786 463 438 396 375 379 391 406 434 465 479 475 469 459 434 412 425 466 482 443 395 403 466 515 500 448 420 427 428 395 354 350 383 406 388 348 333 358 399 426
1782 426 437 451 471 480 474 466 467 464 436 396 376 389 417 440 455 470 480 486 500 524 538 520 494 499 542 587 607 612 621 632 629 604 561 508 467 464 500 546 578 592
1777 592 587 549 480 426 426 458 464 434 411 429 469 493 496 490 481 476 489 517 530 506 470 475 535 608 642 624 584 562 572 589 579 536 500 512 557 571 514 426 385
1772 385 421 492 539 543 539 561 603 629 615 582 563 573 593 599 576 528 477 455 471 505 524 529 545 576 594 575 534 498 473 458 463 490 512 506 498 527 584 616
1767 616 603 583 592 616 625 619 617 618 609 593 590 604 630 667 709 738 748 762 794 833 870 927 1007 1054 1025 964 956 990 971 865 755 717 722 704 666 643 628 590
1763 590 553 559 590 588 545 516 526 536 520 503 501 493 465 447 467 502 526 548 579 597 585 572 595 634 636 590 547 543 564 573 557 529 519 556 642 738 797 809
1758 809 800 791 791 810 859 927 982 1011 1035 1062 1066 1026 961 908 876 843 798 756 736 734 730 710 677 637 591 539 486 442 418 422 458 519 573 582 543 493 466 464 470 483
1753 483 517 563 589 578 551 542 562 592 607 597 571 547 530 519 525 566 623 643 605 558 565 611 627 591 546 527 514 490 491 536 585 587 564 561 566 530 465 438
1748 438 477 530 548 542 543 543 522 482 444 418 408 429 475 511 507 478 457 457 471 493 515 510 473 437 437 456 455 433 421 432 446 461 499 551 562 501 417 381 410
1744 410 462 498 514 513 494 471 465 470 454 397 330 296 300 313 319 330 359 395 418 425 424 417 404 401 427 478 516 517 488 445 392 341 328 371 436 468 459 444 433 403
1739 403 358 354 426 525 575 563 533 523 527 529 516 469 394 347 376 445 472 436 404 416 429 400 366 386 444 468 430 377 356 370 401 430 445 446 454 474 473 424
1734 424 366 364 420 464 458 434 428 416 373 328 332 381 432 462 475 469 445 426 443 482 500 487 474 485 503 506 499 497 494 477 451 431 423 424 428 436 451 470 482 485 491 515
1729 515 547 554 519 476 472 506 533 524 493 463 435 410 408 439 474 469 419 371 375 429 484 499 479 458 452 450 441 437 445 452 445 452 498 558 573 537 503 502 508 497 494 522 548
1724 548 526 475 453 479 510 506 475 446 438 447 460 467 480 519 575 605 583 544 529 519 472 408 397 450 502 504 487 496 512 498 467 460 482 506 515 512 493 458 439
1719 439 463 508 523 496 463 452 460 477 498 509 496 477 487 523 546 533 513 510 512 501 489 489 484 454 420 420 453 488 505 511 499 457 402 379 411 463 482 458
1714 458 426 424 453 478 473 451 450 472 476 435 385 375 397 401 381 388 438 473 440 375 353 388 428 440 440 452 473 486 477 439 384 352 372 421 446 437 436 469 503 512
1709 512 516 532 528 469 386 353 390 458 523 577 610 609 594 607 635 619 537 457 446 478 484 449 423 436 465 480 482 482 482 486 510 554 592 599 584 570 571 575 565 531
1705 531 491 472 486 509 512 501 501 513 511 488 466 462 462 459 479 538 601 618 581 521 463 424 424 466 517 529 508 504 538 567 550 510 498 512 509 473 443 458 506
1700 506 547 565 563 549 525 509 527 571 596 579 554 559 585 590 572 571 601 619 585 518 468 447 436 435 461 515 567 591 583 549 501 466 471 513 565 608 630 610
1695 610 542 469 454 494 520 490 445 441 473 496 492 480 479 494 521 535 503 428 367 360 379 376 365 393 464 524 541 536 527 511 491 491 518 548 560 555 544 531 531 560
1690 560 598 603 564 516 486 471 468 484 501 478 413 371 401 472 514 494 435 367 322 328 388 463 509 526 535 544 554 570 577 535 449 389 415 483 511 493 488 522
1686 522 563 588 608 617 589 535 497 483 456 412 399 439 488 515 548 602 626 567 457 385 390 442 497 529 529 508 497 512 526 507 454 390 346 352 418 502
1681 502 534 509 501 554 604 579 520 524 595 644 623 574 539 506 460 426 419 425 427 435 443 428 399 403 451 495 501 502 535 578 588 567 550 546 539 532 539 553 559 569 600 641
1676 641 662 657 649 650 663 698 761 830 870 876 880 915 978 1044 1077 1056 999 950 936 936 923 904 894 878 832 772 735 720 690 633 580 553 538 515 492 484 488 499 524
1671 524 560 591 602 606 625 659 690 698 673 630 600 609 643 664 668 687 747 824 877 893 904 940 1015 1122 1250 1387 1528 1680 1850 2027 2186 2307
1667 2307 2389 2456 2522 2571 2556 2449 2273 2083 1912 1769 1653 1555 1447 1306 1160 1062 1022 991 932 864 816 782 743 709 695 693 688 697 743 798 813
1664 813 781 748 748 782 835 895 939 942 915 898 897 883 839 799 805 862 951 1052 1149 1227 1307 1424 1583 1743 1884 2042 2243 2453 2620 2736 2805 2793
1660 2793 2673 2505 2383 2302 2164 1929 1688 1529 1423 1298 1161 1074 1043 1001 925 863 856 885 907 913 908 886 840 786 746 731 749 799 845 841 794
1656 794 773 819 895 932 910 861 804 746 705 700 715 722 727 747 773 779 777 806 860 887 882 914 1018 1131 1175 1172 1197 1260 1287 1240 1171 1139 1118 1037 886 742
1651 742 673 670 664 612 533 474 458 471 495 524 561 594 593 550 492 472 513 580 611 582 541 544 588 619 609 588 599 628 625 575 518 500 529 577 615 631 623 596
1647 596 563 547 560 585 588 555 516 504 515 519 516 532 571 605 615 619 633 641 629 616 631 659 662 632 601 593 607 635 667 676 638 568 519 525 564 598 614 628 648
1642 648 658 637 583 524 497 516 559 590 600 603 613 632 655 670 657 621 599 619 654 657 628 601 584 546 491 475 529 611 664 683 687 670 618 554 517 511 518
1638 518 534 557 560 524 478 474 510 536 532 529 546 553 523 487 487 522 557 577 595 627 664 692 697 676 637 600 580 574 564 542 518 504 504 517 538 555 551 522 497 514
1633 514 578 642 660 641 630 644 654 637 618 634 683 729 751 753 739 708 667 635 617 612 625 667 723 756 741 696 657 644 652 669 688 701 694 659 618 607 636
1628 636 667 660 635 645 685 687 622 559 581 661 706 683 651 659 690 709 714 719 720 719 728 744 739 713 704 733 763 748 704 688 734 824 907 932 879 795 750 753 744 696 673
1623 673 736 829 847 769 686 672 718 776 823 847 847 844 869 911 924 896 870 875 886 878 868 877 891 882 862 868 912 973 1027 1051 1037 1005 992 1010 1027 1017 1000 1007 1025
1618 1025 1025 1024 1060 1119 1143 1112 1077 1079 1092 1067 1000 935 909 920 944 954 940 923 932 965 986 977 969 996 1047 1079 1081 1076 1086 1108 1136 1170 1199 1210 1207 1207 1207 1189 1162 1166
1613 1166 1226 1313 1383 1429 1467 1497 1502 1480 1450 1428 1423 1441 1482 1525 1546 1553 1582 1653 1736 1791 1809 1811 1818 1837 1863 1885 1892 1897 1928 2005 2107 2193 2242 2265 2287 2316 2344
1609 2344 2368 2402 2462 2537 2587 2589 2564 2554 2574 2618 2685 2775 2864 2931 2997 3099 3226 3322 3366 3416 3528 3681 3825 3960 4120 4306 4488 4658 4831
1605 4831 5006 5173 5354 5583 5844 6084 6293 6531 6858 7284 7796 8381 9023 9707 10468 11380 12482 13746 15153 16754 18642
1603 18642 20879 23501 26581 30251 34675 40032 46527 54367 63726 74697 87197 100812 114661 127440 137659 144005
1601 144005 145664 142536 135219 124786 112477 99477 86801 75223 65208 56894 50150 44709 40295 36698 33772
1599 33772 31391 29440 27838 26540 25491 24611 23853 23252 22861 22672 22616 22648 22779 23040 23449 24016 24767 25731 26937 28424 30237
1596 30237 32405 34950 37942 41498 45737 50751 56658 63649 71987 81977 93993 108556 126385 148356 175354 208038
1594 208038 246568 290247 337044 383159 423178 451264 463043 457088 435070 400720 358539 312991 268080 226952
1593 226952 191487 162208 138651 119914 105048 93183 83563 75598 68904 63256 58492 54467 51051 48138 45646
1591 45646 43507 41692 40197 39000 38052 37309 36781 36504 36494 36730 37210 37984 39127 40683 42665 45101 48065 51668 56028
1589 56028 61270 67540 75026 83990 94793 107924 124010 143829 168268 198168 234022 275608 321561 368904 412847
1587 412847 447409 467105 468906 453180 423037 382873 337249 290449 246162 206997 174146 147540 126368 109561
1585 109561 96089 85141 76151 68697 62398 56954 52219 48153 44704 41768 39254 37088 35184 33461 31906 30559
1583 30559 29431 28467 27613 26877 26299 25904 25689 25641 25762 26088 26688 27604 28806 30254 31985 34105 36695 39813 43594 48281
1581 48281 54129 61311 69962 80219 92095 105274 119007 132130 143174 150615 153302 150859 143756 133019 119896
1579 119896 105666 91531 78456 67014 57377 49442 42979 37723 33429 29898 26974 24517 22405 20551 18911 17472
1577 17472 16227 15165 14260 13476 12778 12132 11514 10917 10361 9868 9434 9025 8615 8214 7847 7521 7235 7000 6817 6647 6428 6148
1574 6148 5876 5684 5573 5485 5375 5258 5167 5101 5029 4931 4811 4685 4564 4448 4335 4227 4134 4069 4024 3973 3897 3804 3712 3620 3518 3421 3364 3354
1571 3354 3348 3300 3217 3136 3072 3011 2944 2886 2841 2794 2746 2728 2758 2807 2825 2805 2777 2760 2741 2708 2671 2640 2605 2564 2528 2507 2478 2419 2346 2292 2268 2260 2259 2271 2292 2300
1566 2300 2280 2242 2207 2191 2194 2205 2197 2152 2082 2016 1976 1966 1990 2032 2051 2012 1941 1906 1920 1923 1872 1814 1815 1861 1875 1822 1742 1681 1645 1632 1643 1665 1674 1668 1666 1661 1622 1554
1562 1554 1515 1538 1569 1539 1465 1426 1462 1524 1546 1517 1478 1474 1513 1558 1564 1517 1452 1409 1396 1405 1438 1487 1511 1463 1364 1300 1327 1409 1464 1459 1422 1386 1353 1324 1314 1334
1557 1334 1361 1359 1326 1306 1336 1394 1419 1388 1341 1328 1344 1340 1291 1230 1205 1228 1271 1293 1274 1222 1170 1148 1156 1169 1174 1181 1198 1212 1201 1166 1123 1081 1038 1008 1017 1068 1114
1553 1114 1107 1066 1056 1109 1173 1183 1139 1096 1090 1106 1120 1137 1163 1185 1183 1164 1140 1105 1051 998 967 962 973 999 1028 1026 983 951 994 1087 1138 1111 1063 1054 1054 1011 945 927
1548 927 968 1007 992 947 920 923 936 947 962 978 976 945 896 851 830 838 878 948 1027 1070 1044 972 921 932 977 1005 1005 994 979 944 899 878 900 938 959 952 932
1544 932 914 909 928 965 1003 1028 1041 1038 1009 958 909 884 881 889 908 932 942 930 923 950 990 985 919 840 806 826 869 904 921 911 881 861 879 915 922 881 833 836 885
1539 885 926 921 887 866 864 859 841 829 840 866 892 912 930 941 931 888 824 765 734 735 753 772 790 808 814 793 756 736 743 753 743 725 727 753 780 795 807 814 812
1534 812 801 790 774 740 698 673 673 681 686 705 749 800 832 829 794 737 691 697 758 820 830 800 787 816 857 865 834 792 768 768 775 770 756 752 764 772 765 771 811 855 854 811
1529 811 778 785 806 807 792 784 789 797 808 826 847 869 903 948 986 1008 1027 1048 1058 1052 1063 1119 1212 1309 1381 1414 1398 1356 1334 1357 1392 1397 1369 1335 1295 1234 1158 1085
1524 1085 1026 979 955 947 920 866 842 898 977 974 878 785 769 801 828 853 881 874 814 760 772 823 843 830 834 871 905 920 944 987 1021 1027 1029 1060 1117 1176 1226
1520 1226 1273 1331 1407 1508 1642 1818 2034 2260 2456 2611 2740 2836 2857 2785 2665 2548 2424 2257 2051 1846 1651 1456 1284 1187 1169 1174
1517 1174 1162 1136 1100 1049 1001 992 1005 970 873 796 813 885 930 937 949 971 961 910 870 868 872 855 849 889 944 953 924 933 1027 1154 1226 1238 1272 1378 1516 1616
1512 1616 1684 1779 1934 2130 2342 2563 2768 2910 2963 2941 2865 2741 2588 2432 2271 2079 1865 1678 1539 1414 1292 1216 1209 1216 1182 1141 1143 1159
1509 1159 1119 1031 964 940 912 869 861 902 938 930 911 919 933 922 895 873 846 815 822 892 978 1013 993 965 952 946 945 964 993 1015 1040 1099 1189 1271 1328 1383 1453
1504 1453 1516 1541 1530 1507 1479 1430 1343 1231 1139 1106 1127 1153 1144 1107 1071 1039 991 927 885 893 930 955 951 947 969 1001 1005 968 934 945 988 1008 976 926 899 894 884
1500 884 861 836 819 807 797 783 760 735 726 742 765 780 793 809 810 777 736 731 765 798 801 783 758 721 677 658 686 744 797 833 852 851 823 790 788 827 885 940
1495 940 989 1032 1050 1031 1003 1005 1041 1070 1064 1042 1032 1022 983 923 883 880 883 860 816 774 747 737 743 750 746 755 807 878 895 837 770 751 742 687 613 595 635 673 682 689
1490 689 685 632 546 509 552 610 623 618 642 678 685 673 672 682 691 721 794 870 887 842 787 758 748 752 771 789 780 747 709 673 636 617 643 695 718 686 625 574
1486 574 544 532 540 563 593 624 649 655 635 606 587 577 571 580 621 673 705 717 734 754 756 740 725 710 673 623 593 588 569 522 490 517 595 671 707 700 679 676 691
1481 691 682 622 551 541 598 654 657 630 614 611 608 615 641 661 644 589 519 467 470 540 626 656 625 603 625 649 638 630 657 676 638 580 568 594 599 578 571 578 561 530
1476 530 539 587 610 583 548 535 520 489 470 474 475 472 504 573 604 550 467 448 511 596 642 628 566 506 500 550 598 608 612 634 637 587 515 478 475 471 482 537 606
1471 606 621 578 541 542 548 536 529 543 549 530 516 535 571 596 610 619 606 562 513 493 508 536 559 559 528 492 497 543 567 532 492 519 598 642 607 550 548 604 668
1466 668 699 699 680 650 616 596 599 615 621 618 625 651 675 670 644 629 625 601 548 518 548 606 625 599 583 603 616 583 536 526 550 564 549 531 527 527 526 542 579 603
1461 603 582 537 515 536 574 603 624 647 666 670 649 606 555 520 522 557 596 615 616 614 606 579 538 508 500 495 476 464 489 543 576 561 532 532 541 502 406 323 318 371
1457 371 408 402 399 447 530 596 616 600 568 544 538 535 508 458 437 482 563 608 593 559 555 585 622 644 651 655 662 664 649 615 587 579 572 539 496 485 514 538 529 512 525
1452 525 556 573 575 587 610 620 605 580 563 548 532 520 524 548 586 628 649 627 561 485 445 459 505 539 539 518 505 506 503 483 468 490 549 606 626 613 601
1447 601 611 619 588 523 485 522 595 620 573 523 532 573 577 535 497 494 504 500 492 495 500 493 480 478 492 505 499 462 407 371 384 428 453 435 404 404 444 497 536 546 529
1442 529 498 471 461 465 474 479 472 448 424 424 455 500 541 578 609 626 623 611 599 588 576 568 568 575 595 626 646 626 578 553 578 619 636 632 630 625 599 563 545 544 539 536
1437 536 556 582 575 539 524 550 579 581 581 606 636 646 648 670 699 702 679 654 630 598 571 575 591 576 528 497 513 547 565 574 588 592 573 551 554 566 562 557 580 612
1432 612 603 560 543 576 614 624 632 659 664 608 541 546 616 661 637 596 589 591 563 529 538 581 608 601 589 590 594 599 618 631 591 493 405 384 408 415 398 404 454 509 523
1427 523 497 467 459 475 506 532 530 503 491 526 594 644 651 632 615 603 586 563 546 539 544 555 567 574 578 583 581 563 535 521 530 546 548 543 549 569 584 588 593 605 618 618 597
1422 597 558 510 475 479 522 572 584 546 493 483 531 594 619 606 603 626 638 612 580 579 595 588 568 579 622 647 626 589 572 575 589 614 637 627 578 533 524 524
1417 524 497 455 439 458 485 498 497 490 495 535 603 656 663 648 651 665 663 648 648 657 638 586 541 535 558 576 571 548 539 577 650 696 673 614 579 569 547 521 533 577
1412 577 601 593 596 627 648 633 614 611 604 577 559 559 534 470 436 485 563 578 534 519 566 618 620 588 567 572 588 591 571 541 527 531 523 488 458 460 469 446 412 416 461
1407 461 504 535 580 636 665 659 661 689 717 730 760 822 866 844 781 738 731 728 705 664 619 584 575 598 634 663 681 690 683 658 634 630 646 675 713 747 749 712 667
1402 667 645 642 640 643 654 652 620 584 588 620 632 601 564 555 560 553 537 536 560 590 603 590 560 542 562 624 696 748 770 772 764 743 713 679 657 659 685 713 710 660 581
1397 581 511 472 466 490 537 590 613 585 525 480 473 482 477 464 469 498 519 501 456 427 446 504 555 563 533 515 540 581 589 551 509 499 514 534 554 580 602 605 592
1393 592 579 578 587 604 619 612 579 545 546 589 645 674 661 613 556 518 517 539 559 563 555 548 544 540 537 538 541 541 534 525 523 524 512 487 469 481 518 562 606 643 650 612 562 546
1387 546 560 549 496 459 483 535 555 540 531 536 526 499 477 463 435 404 407 448 478 462 422 400 403 415 428 445 458 455 441 433 441 460 479 496 525 574 623 632 601
1382 601 585 622 672 670 623 598 615 627 600 566 567 586 587 567 548 533 521 524 546 562 552 540 559 596 616 604 576 546 527 542 582 601 570 524 512 523 511
1378 511 482 489 539 574 562 536 534 534 507 475 481 512 522 492 453 425 400 380 390 438 482 476 436 426 478 548 568 522 454 418 434 489 551 594 605 601 611 645
1373 645 676 669 619 553 504 492 510 529 527 514 518 538 547 536 529 540 545 520 489 488 516 542 555 561 551 516 484 505 581 660 694 682 648 615 598 609 631 636 620
1369 620 602 581 538 480 452 474 514 536 539 545 558 581 617 652 649 597 543 532 545 535 501 488 514 545 552 544 547 558 553 521 490 496 554 622 645 608 553 519 501
1364 501 474 446 443 466 489 496 488 466 440 441 493 567 605 591 569 578 608 632 647 658 654 623 577 539 511 481 448 432 443 477 517 544 545 522 497 487 490 496 510
1359 510 535 553 533 474 421 418 460 494 479 439 427 462 506 515 502 506 534 554 550 540 540 535 514 499 515 550 575 581 579 574 569 571 581 575 535 490 484 513 528 502 463
1354 463 453 477 501 501 478 457 463 501 546 573 588 609 629 618 583 563 568 563 528 507 537 585 590 552 524 527 525 503 491 517 549 547 517 496 501 513 515 513 520 534 538
1349 538 517 482 468 493 536 558 555 548 550 554 562 584 603 580 516 458 444 454 464 486 526 552 534 507 513 537 530 501 494 502 472 409 389 448 523 539 504 473 475 506
1344 506 562 624 649 610 537 472 429 418 464 558 622 599 541 537 591 617 577 521 504 511 509 499 493 488 488 507 525 496 428 399 452 524 529 489 492 555 595 550 470
1339 470 440 472 505 494 454 431 440 464 472 453 418 392 400 452 526 584 599 584 578 602 640 653 619 546 475 447 476 527 552 545 541 563 584 568 519 468 439 440
1335 440 475 532 571 561 519 490 489 505 530 564 589 576 530 490 477 466 436 412 423 455 473 469 467 478 492 507 538 582 610 597 555 525 526 538 526 481 439
1330 439 445 498 553 565 539 510 494 488 498 528 556 534 455 384 380 426 458 455 467 525 584 576 507 454 465 508 521 487 445 431 449 475 495 510 533 574 626
1326 626 669 681 655 608 567 554 561 560 532 494 479 487 481 445 404 392 406 417 409 385 363 371 431 520 569 530 438 376 382 425 464 492 510 509 497 502 539 583 592 557
1321 557 500 454 445 480 531 557 547 534 543 558 551 530 522 533 545 545 537 524 502 482 480 496 513 519 509 484 461 470 524 591 618 589 538 500 489 496 507 507 494 490 509
1316 509 529 513 473 466 514 575 597 585 572 567 557 541 535 536 517 468 402 345 321 349 423 503 541 533 514 509 504 479 451 455 495 533 547 558 593 636 647 620 596
1311 596 589 565 492 404 361 372 398 412 424 437 442 444 462 479 454 395 370 415 493 554 599 636 641 597 553 560 586 567 512 490 514 525 499 480 498 516 497
1306 497 465 453 451 436 415 410 414 415 415 413 399 387 412 464 479 427 369 382 451 508 527 530 521 485 447 458 515 550 531 500 502 527 540 540 551 582 609 600 546 481
1302 481 462 507 565 579 561 562 584 579 544 530 558 582 568 553 575 599 568 489 427 418 438 458 475 495 514 522 509 472 428 405 413 431 447 465 477 446 374
1297 374 327 362 437 467 450 456 511 546 505 425 380 383 400 416 448 488 508 500 492 506 526 527 515 521 555 594 614 614 602 574 521 460 429 446 487 518 533 542 546
1292 546 536 521 514 516 514 499 468 429 408 439 512 572 573 539 520 515 479 405 342 333 368 410 434 431 417 429 492 564 576 530 503 538 583 570 512 467 455 452 449
1287 449 457 469 471 479 511 548 546 505 462 442 435 434 451 486 514 519 502 465 414 382 403 464 510 512 493 486 487 483 481 494 514 524 518 500 477 457 452 466 490 515 526 511
1282 511 473 444 445 461 462 455 468 497 508 496 498 520 519 473 435 456 507 515 466 420 428 474 505 491 440 388 369 390 426 452 463 456 430 397 393 433 485 512 520 529
1277 529 533 514 484 465 445 404 364 375 439 500 521 523 538 562 578 586 586 567 531 515 536 569 576 561 552 561 578 592 591 566 527 502 510 536 561 585 611 617 591 557
1273 557 547 551 543 525 517 511 484 452 455 494 526 535 550 585 596 552 494 483 508 504 453 410 423 466 477 441 400 394 425 464 489 495 480 452 435 455 506 549 551 520
1268 520 499 507 517 496 454 432 454 496 513 485 434 402 406 436 470 495 504 498 486 484 499 519 532 553 599 651 659 604 532 508 542 583 581 537 486 467 493 542
1263 542 575 574 560 569 603 625 612 592 607 652 686 685 671 672 676 647 579 508 473 474 485 487 479 473 478 505 551 591 594 563 539 551 579 574 525 465 433 428 433 450 487 529
1258 529 540 515 491 503 540 563 561 566 593 615 600 558 530 530 537 531 513 486 448 420 442 511 564 551 505 497 535 557 524 473 454 465 471 459 440 417 399 408 463
1253 463 541 597 611 598 577 547 502 444 378 326 319 360 407 411 377 354 361 374 373 376 403 440 465 477 482 463 421 403 451 535 579 560 530 527 524 487 446 454 501
1248 501 521 486 438 424 440 456 467 482 500 510 517 531 540 513 455 411 421 470 502 475 407 357 366 418 459 461 446 455 490 524 540 535 511 483 490 547 603 589
1244 589 526 504 545 562 494 413 419 483 498 456 452 519 575 555 509 504 518 500 470 478 506 494 443 419 453 512 562 594 604 588 577 612 676 696 643 561 511
1239 511 495 486 478 479 484 481 475 475 476 476 487 508 516 501 497 530 572 569 520 476 462 449 415 391 421 482 503 454 397 400 454 487 466 436 446 482 498 485 474 477 475 455
1234 455 442 453 482 508 526 534 525 499 462 416 365 330 336 378 419 440 459 492 521 525 517 518 523 517 508 502 481 434 397 410 458 489 490 498 528 548 536 524 545 580 585
1229 585 551 512 499 509 517 509 489 477 489 512 525 523 523 527 516 482 449 454 497 545 565 550 519 496 493 495 476 434 399 403 442 487 512 518 513 499 480 460 449 439
1224 439 419 385 357 358 389 427 441 426 398 384 402 451 502 518 500 489 511 537 526 491 478 493 489 448 416 436 481 490 454 418 411 415 412 411 430 457 469 456
1219 456 435 433 469 532 582 582 530 461 412 398 403 402 393 402 447 500 513 485 468 492 515 494 461 476 528 543 494 445 457 506 535 528 516 516 519 522 534 553 561 550
1215 550 532 520 516 511 493 458 423 415 448 498 527 524 502 487 495 526 560 565 534 503 509 543 559 540 512 504 507 499 481 468 467 472 477 480 476 464 450 444 451 468 486 491 478 464
1209 464 468 488 498 481 449 421 407 418 459 506 520 494 473 488 510 495 463 467 512 542 529 508 509 509 482 458 475 517 535 515 487 472 470 482 515 553 567
1205 567 555 539 525 494 452 437 464 500 506 497 513 557 584 566 516 473 457 463 468 454 415 371 351 367 413 469 514 538 537 524 515 516 514 498 478 483 519 550 528
1200 528 462 413 414 429 413 387 407 471 515 515 510 528 529 477 408 388 414 437 438 446 475 510 547 595 634 620 558 506 499 506 486 456 450 466 479 492 524 558 557 518
1195 518 484 483 498 496 475 457 455 456 443 421 413 428 447 449 444 462 501 527 525 522 533 526 477 426 427 459 449 385 343 381 456 495 490 492 521 553 571 584 591 567 503 423
1190 423 351 299 281 311 375 424 431 419 425 445 454 453 460 475 473 452 434 438 455 459 444 420 408 414 431 441 448 471 516 548 534 491 458 448 446 457 496 538 527 462
1185 462 417 442 501 544 569 586 557 462 373 380 461 504 473 440 455 477 463 446 461 469 436 408 442 507 531 512 507 518 494 434 400 425 471 494 500 500 472
1180 472 411 370 394 456 490 479 462 470 492 505 504 504 519 548 574 575 555 536 537 545 538 517 502 501 503 498 495 507 537 565 570 555 540 538 542 546 563 604 649 658 634 616 617
1175 617 593 506 397 356 414 500 529 501 487 529 579 569 501 449 456 486 483 443 402 378 371 397 472 563 612 608 590 580 555 512 489 503 507 458 391 371 404
1171 404 449 487 522 541 523 493 499 538 558 538 515 514 513 492 465 446 426 409 429 497 557 557 521 508 536 571 590 599 596 563 516 506 556 623 644 610 570 564
1166 564 581 587 574 571 594 618 609 577 556 553 530 473 419 409 428 429 399 374 377 397 413 418 418 413 403 391 379 372 391 444 499 510 474 441 450 482 492 467 430 403
1161 403 396 414 449 473 463 435 425 445 472 482 479 474 466 452 441 443 454 455 440 426 432 453 468 470 469 471 463 446 443 480 536 570 567 551 540 523 499 498 532 560 543 505
1156 505 505 548 577 557 522 520 553 580 571 526 473 453 486 550 589 585 579 614 676 710 683 615 548 522 540 572 573 536 505 510 533 538 536 554 575 549 473 411 416 472
1151 472 531 574 601 598 553 483 438 450 502 544 535 494 481 521 563 549 497 485 534 581 573 541 539 563 573 560 542 513 469 436 447 477 479 457 455 479 491 475
1146 475 459 458 455 445 461 505 530 508 475 475 506 541 577 614 623 584 529 504 510 519 521 518 497 455 433 472 545 584 578 572 585 580 536 492 485 495 479 446 441 484 544
1141 544 578 573 544 518 519 544 569 579 583 595 602 585 550 529 535 550 555 559 582 622 640 610 547 491 465 455 442 432 438 454 463 466 479 504 517 498 468 463 490 515
1137 515 502 456 420 418 436 439 422 408 416 438 455 462 464 463 462 462 458 443 428 442 495 554 581 572 550 519 471 414 370 340 309 281 276 298 327 351 377 403 431 479
1132 479 559 628 614 516 429 428 483 524 534 535 528 495 454 443 458 467 472 510 582 634 623 560 487 436 428 469 533 573 570 541 501 452 414 417 458 497 505 509 535 562
1127 562 550 497 444 415 399 379 366 389 454 527 549 496 412 366 380 409 414 399 389 383 370 360 373 408 439 449 439 418 406 430 491 546 542 490 447 450 472
1122 472 472 450 437 448 463 459 445 438 435 416 391 404 480 578 626 603 542 485 441 420 446 508 556 547 506 485 499 525 544 553 542 509 475 463 462 446 418 407
1118 407 413 415 411 418 429 419 396 405 453 497 507 513 540 569 574 576 600 618 580 495 422 400 410 416 409 392 373 373 411 471 501 465 391 346 372 447 513 532 516 504
1113 504 506 500 478 466 487 528 557 571 586 595 577 542 525 534 535 509 486 497 526 533 509 483 481 497 512 523 541 566 585 584 566 542 515 485 458 453 481 514 517 486
1108 486 459 468 502 527 529 523 527 543 567 592 606 594 566 545 539 524 488 452 449 473 481 453 422 429 471 509 516 503 486 468 451 446 459 481 503 518 511 468 406 369
1103 369 379 399 381 334 311 334 373 394 397 396 396 397 403 413 418 428 460 506 514 458 376 342 384 468 540 567 542 481 427 413 428 433 410 380 371 394 445 511 568
1098 568 591 578 549 516 474 426 400 415 450 471 476 488 500 486 444 414 432 483 526 535 509 458 402 375 396 445 480 485 479 481 479 449 386 313 265 270 333 420
1094 420 478 479 455 446 463 483 492 492 483 456 423 421 464 518 540 524 506 508 521 530 538 557 576 564 511 454 442 483 525 517 473 452 481 528 541 507 442 366 296 260
1089 260 274 314 339 338 345 393 463 507 503 484 490 517 527 500 464 459 485 506 503 491 482 466 440 421 426 438 432 414 411 416 398 361 353 405 480 518 507 487 492 517 541
1084 541 546 531 506 490 498 513 508 470 425 401 406 429 455 469 458 426 401 398 398 378 350 350 388 436 465 475 473 461 449 456 475 467 422 390 423 493 523 495 464 467
1079 467 470 438 397 398 443 492 516 523 527 538 559 590 620 638 640 621 579 541 546 592 620 595 562 579 615 590 501 437 456 514 538 527 524 543 563 576 593 607
1074 607 598 567 545 550 566 562 523 460 396 350 336 358 405 445 447 410 380 403 464 508 502 471 450 436 416 387 357 325 301 313 374 451 503 526 547 571 580 564
1069 564 541 532 533 524 483 414 356 358 420 484 493 452 411 400 407 416 432 456 473 468 442 410 398 423 469 491 467 433 448 516 581 595 569 539 521 507 489 461 429
1065 429 406 407 417 415 405 421 474 533 560 551 524 490 456 435 432 436 439 442 443 425 391 374 403 459 497 509 523 556 585 587 568 545 522 492 465 463 493 536 561 559
1060 559 550 555 572 584 580 564 550 547 557 570 565 536 499 481 484 486 477 466 458 448 434 433 457 500 551 592 595 547 483 464 494 504 456 404 420 485 524 512 494 496 492
1055 492 471 470 513 558 558 524 504 512 526 532 534 532 522 512 507 496 471 452 461 486 499 505 531 567 572 535 497 496 526 557 578 585 573 542 511 487 466 460 497 561 587
1050 587 535 461 444 478 494 472 466 501 537 533 518 527 543 526 490 474 477 461 423 400 415 445 462 465 463 459 451 442 430 415 402 394 382 373 393 454 511 503 434 370 365
1045 365 409 460 490 493 480 473 481 481 452 417 421 454 457 414 384 412 469 504 519 535 539 510 472 467 488 492 468 443 432 427 428 442 457 455 446 449 448 418 376 370 399 419 414
1040 414 416 445 471 470 464 471 468 429 373 344 352 374 394 412 435 469 517 560 563 525 488 484 497 494 479 473 480 479 465 449 435 420 410 418 439 454 449 425 402 401 430 464
1034 464 462 422 390 401 432 437 415 415 460 514 522 476 421 401 412 418 401 385 403 447 476 470 446 424 403 382 369 361 344 324 328 362 394 398 385 376 368 358 370 412
1029 412 446 437 413 421 450 456 444 458 505 537 520 474 434 419 438 485 526 525 498 492 518 532 513 484 459 413 351 330 371 410 378 314 298 336 367 372 400 464
1025 464 512 510 501 531 566 550 495 469 494 514 486 444 450 504 554 560 538 519 512 503 480 450 427 423 444 482 514 516 490 455 435 436 451 474 503 531 536 502 449 433
1020 433 482 536 510 407 332 367 464 506 454 373 342 367 412 450 479 502 527 556 571 555 525 519 546 575 582 583 598 606 570 489 404 361 371 413 449 454 439
1015 439 432 447 472 488 489 477 465 475 509 529 481 366 258 217 240 284 322 355 380 396 413 431 434 421 418 436 442 406 358 345 367 382 378 387 419 446 442 417
1011 417 391 370 356 357 363 359 351 366 408 441 438 417 413 431 443 434 420 416 422 426 433 456 495 521 508 467 437 439 454 465 484 518 539 518 482 484 521 530 489 452 471 516
1006 516 519 466 400 357 330 312 318 355 404 443 464 466 444 405 375 376 406 446 482 507 511 486 440 401 390 403 416 420 428 457 507 549 551 516 478 471 483 475 443 431
1001 431 460 488 466 417 410 455 488 463 427 437 473 471 423 384 395 438 479 508 519 505 474 448 428 403 384 398 442 472 459 425 399 383 369 375 421 484
996 484 512 489 451 440 457 472 470 474 506 553 568 536 500 506 538 546 519 497 504 515 506 489 485 490 496 514 550 584 595 580 545 495 452 446 471 481 458 437 451 478
991 478 482 472 475 480 460 423 405 401 385 363 374 423 463 459 429 407 398 389 383 389 410 447 497 543 560 543 519 512 517 511 491 476 480 494 488 452 416 424 468 493 469 433 433
986 433 458 463 441 424 423 424 427 453 494 514 506 494 491 480 455 434 419 394 370 392 468 536 539 495 466 478 503 509 503 513 554 596 592 549 531 579 628 591 489 433
981 433 461 490 460 426 454 504 501 465 461 482 468 426 423 464 481 448 425 456 505 523 508 480 441 397 371 371 372 360 360 391 441 486 519 525 496 464 473 507 495
977 495 425 378 410 467 473 439 431 458 471 457 444 440 423 400 412 460 490 470 434 431 460 491 510 514 496 459 419 388 363 343 347 382 423 443 447 448 441 412 380 374
972 374 388 381 343 324 371 460 512 492 444 435 474 516 527 514 499 486 474 473 489 514 528 530 528 519 496 470 463 481 495 475 430 397 403 430 440 422 408 429 469
967 469 491 482 465 440 395 344 338 391 444 446 425 433 465 479 478 494 516 504 467 452 457 429 369 351 405 455 433 384 385 437 487 526 572 594 540 434 367 378
962 378 428 466 480 471 432 380 348 343 350 372 420 464 462 437 452 506 530 502 484 519 554 519 431 358 329 333 364 413 441 425 402 414 440 436 409 403 421 432 432
957 432 448 471 471 451 450 472 484 473 463 469 479 493 520 534 501 441 417 447 479 473 450 436 420 401 412 462 498 480 448 467 525 558 538 486 430 384 368
953 368 395 443 475 486 500 511 492 444 413 437 503 560 564 514 449 418 439 490 542 579 590 560 503 465 473 503 515 506 494 481 470 482 527 563 548 501 474
948 474 472 467 466 497 535 526 476 461 513 583 618 630 631 589 497 419 416 458 478 475 491 515 494 429 386 401 438 461 491 555 625 652 631 597 569 543 511 477 446
944 446 416 394 395 432 494 545 547 493 420 373 368 383 396 409 426 449 468 480 485 485 480 467 447 433 442 477 506 502 473 455 469 499 521 521 497 460 433 432 448 462
939 462 475 501 534 549 539 530 533 523 484 449 465 518 544 521 495 513 554 559 517 475 477 513 550 570 575 563 531 494 482 502 531 542 537 533 534 532 525 517 496 448 398
934 398 402 478 571 599 548 480 457 479 503 502 478 446 424 430 464 504 525 541 579 629 643 597 529 491 485 469 425 377 359 373 400 421 425 409 392 406 459 515
929 515 536 514 477 450 439 441 455 475 489 490 480 467 459 461 470 477 468 440 403 373 362 378 414 454 486 504 508 488 436 373 342 367 425 472 489 493 502 515 522 516 500
924 500 482 469 473 495 527 564 595 595 542 456 397 398 423 417 384 372 399 427 430 429 443 450 434 420 427 426 385 337 345 413 480 509 512 505 485 475 515 601 667 667 629 593
919 593 556 498 432 386 361 349 368 420 458 432 363 323 347 404 454 477 469 432 400 408 455 501 523 526 519 495 452 405 364 338 346 389 423 405 357 341 361 360
914 360 316 283 305 342 332 292 289 348 426 476 499 514 527 536 540 536 513 470 421 389 387 413 444 463 467 462 448 417 379 366 390 424 436 429 430 461 515 565 572 511
909 511 414 349 356 397 413 400 400 427 451 448 430 427 445 474 505 537 569 586 570 515 449 413 423 447 456 461 491 539 561 538 506 505 525 523 486 446 441 473 512 533
905 533 533 519 498 473 450 442 449 462 463 448 424 415 430 454 467 478 515 573 600 559 488 460 482 504 492 468 455 443 429 435 463 476 459 451 482 523 527 505 493
900 493 495 490 485 495 502 471 414 382 388 398 397 407 439 472 487 488 475 449 430 441 459 444 407 403 440 468 463 459 474 469 423 388 413 469 489 467 441 430 431 453 498
895 498 529 503 441 401 403 419 432 450 468 463 440 429 438 446 449 459 471 460 431 428 471 521 539 532 531 542 552 559 567 564 540 508 496 513 540 562 580 594 596 584 571
890 571 565 560 541 514 495 489 481 466 461 485 520 531 514 491 467 428 383 379 426 470 456 410 395 410 402 357 334 376 446 480 471 462 475 498 506 484 437 392 388 432 479
885 479 475 424 377 361 356 338 320 329 364 391 388 366 346 332 319 314 333 369 391 383 373 403 470 535 568 582 604 629 643 643 637 628 610 589 575 569 562 559 570 585 582 568
880 568 586 662 768 845 874 873 855 808 731 656 615 601 592 583 582 575 543 490 441 405 366 330 329 371 408 399 359 337 345 353 346 340 348 362 368 365 355 340 324 321 330 342 356
874 356 380 420 466 494 484 440 392 379 404 430 424 400 390 393 387 374 383 417 448 460 472 498 527 541 542 526 483 425 393 407 434 436 424 428 447 450 433 429 457 500
869 500 534 546 542 529 516 513 524 546 560 545 497 447 438 466 482 445 377 332 323 329 340 371 422 460 460 431 401 390 406 441 470 466 429 393 389 420 465 508 535
865 535 533 501 466 460 478 481 443 392 374 398 428 432 418 416 429 428 402 372 365 376 380 371 363 371 392 416 438 461 482 491 475 437 401 384 382 382 391 412 420 391 347 345 399 456
859 456 469 460 472 511 543 552 546 531 506 482 471 464 443 410 384 368 353 344 361 399 436 458 471 482 492 505 519 522 511 508 529 546 520 456 396 353 313 286 304
855 304 362 402 393 369 369 390 413 443 471 465 418 383 403 445 444 402 376 387 395 378 362 370 383 382 378 387 391 371 343 342 368 399 426 466 518 546 522 461 407 391 413
850 413 458 509 537 514 451 395 383 397 408 412 427 449 457 453 455 460 445 408 384 388 401 408 418 428 408 357 324 344 386 408 416 434 443 417 380 385 430 460 449 428
845 428 424 420 393 354 328 333 365 400 405 377 364 404 471 513 532 575 636 646 585 521 512 518 472 388 332 325 340 365 416 476 491 448 403 405 437 449 429 406 406 416
840 416 409 373 327 303 316 353 385 389 371 356 370 407 437 440 436 456 496 522 519 505 492 477 456 447 457 464 453 437 437 444 441 429 422 420 423 441 482 519 519 485 449 432
835 432 432 450 487 521 518 478 447 456 488 505 488 450 414 401 409 406 371 328 327 376 424 435 427 439 467 477 467 461 470 471 448 416 400 406 421 431 434 435 445 479 547 643
829 643 734 787 803 826 892 962 956 849 710 633 633 648 621 559 505 488 500 509 490 455 442 472 515 530 517 506 501 484 462 473 522 558 536 484 464 486
825 486 513 519 513 504 483 458 447 448 429 386 361 392 457 509 533 545 550 532 499 478 474 459 413 363 347 373 418 461 484 477 446 427 448 491 497 438 353 309 336
820 336 400 441 431 389 357 362 391 419 433 438 434 419 395 376 366 360 362 385 431 471 471 431 390 391 428 454 436 386 349 344 354 362 380 418 455 456 423 395 394 404 401
815 401 384 367 363 381 422 462 471 446 428 442 461 445 401 378 396 429 443 439 437 447 460 465 455 438 419 391 345 304 312 370 416 401 366 385 438 438 366 319 370
811 370 469 523 524 526 536 525 500 498 513 497 445 409 409 406 378 356 360 356 326 318 373 441 444 386 343 360 413 468 515 543 537 508 490 490 485 467 459 473 489 490 486 484 471
805 471 448 446 471 488 462 420 407 425 429 403 383 409 464 496 475 429 411 446 494 499 460 429 435 439 396 333 317 358 384 348 292 289 345 399 415 413 426 457 483
800 483 490 479 451 414 385 378 383 383 379 393 428 458 455 427 401 385 369 355 365 410 462 487 483 475 469 452 425 414 431 454 444 397 347 337 376 433 467 459 426 394
796 394 375 365 357 356 359 361 353 341 339 353 374 382 369 348 340 350 367 380 396 416 429 426 418 416 412 394 378 390 418 419 382 351 363 401 431 447 463 461 414 344 308 318
790 318 329 313 311 365 439 461 426 402 429 466 454 402 366 365 361 325 280 262 267 263 243 237 270 325 363 371 366 358 341 318 312 338 375 386 373 375 410 447 448 421 406
785 406 415 416 388 361 370 405 425 416 403 411 430 434 420 410 423 447 459 447 427 422 432 431 404 371 364 384 400 385 348 318 304 301 302 309 321 333 343 356 372 374 347 302
780 302 276 292 327 341 330 332 361 384 364 329 331 373 397 379 368 409 475 498 463 417 402 414 431 454 490 521 522 497 473 470 473 451 404 373 396 456 488 454
776 454 385 344 346 356 345 325 325 350 385 421 448 461 462 465 483 506 518 514 496 466 424 379 351 360 408 473 509 485 421 384 410 456 448 375 311 325 394 448 452
771 452 430 411 393 372 362 373 387 380 369 393 453 505 508 474 446 449 476 502 511 499 471 436 402 380 379 395 409 406 392 380 377 385 411 458 500 500 456 407 380 367
766 367 359 372 418 465 482 483 504 533 529 491 452 422 376 323 310 349 380 354 309 311 361 397 394 389 416 461 499 528 559 587 596 576 530 477 456 494 567 606 579
761 579 523 495 500 494 457 417 407 424 442 447 438 416 383 351 335 346 390 465 548 593 571 512 469 458 436 376 320 331 400 453 447 418 413 424 415 387 372 381 398
756 398 423 465 508 512 476 449 463 485 469 420 388 396 417 420 395 358 333 344 390 443 469 464 454 447 428 388 348 331 338 363 401 438 446 424 409 426 452 459 466 506
752 506 550 538 470 422 442 489 507 499 499 502 483 460 466 482 468 431 423 453 474 464 463 497 530 525 505 504 508 480 434 414 432 459 475 482 470 428 373 344 350 365 382
747 382 428 506 567 571 537 510 492 460 417 396 401 403 391 396 433 461 431 370 353 400 446 434 392 382 404 401 355 311 309 336 369 414 469 504 498 483 487 484 435 364
742 364 328 331 318 270 234 252 305 356 402 459 522 569 578 542 476 419 405 418 417 400 404 436 453 435 421 456 517 555 555 535 501 457 425 422 425 407 381 377 385 370
737 370 338 337 381 433 466 488 509 510 488 463 451 433 398 367 365 385 410 442 481 498 468 413 384 400 435 447 425 388 361 359 378 402 417 419 413 407 401 388 362
732 362 341 358 412 450 422 354 323 359 411 419 393 378 382 377 356 349 372 410 451 494 529 533 504 478 474 468 429 376 364 402 440 427 380 344 339 340 332 330 348 370 372
727 372 362 371 405 441 454 447 432 413 388 367 364 370 363 329 290 278 302 344 380 410 447 486 505 494 481 492 519 538 540 533 510 459 397 374 409 463 484 471 459
722 459 467 488 516 549 567 551 523 525 552 544 476 403 392 424 432 397 377 410 463 483 468 447 423 384 344 337 358 375 379 402 450 480 460 425 424 445 439 404 396 442
717 442 497 513 501 506 541 577 582 551 501 455 438 456 492 513 505 481 471 494 529 532 484 421 394 403 406 386 379 414 470 507 522 529 524 497 465 454 456 445 427 434 470
712 470 500 499 489 499 529 564 592 602 582 543 519 530 553 553 529 509 515 535 539 516 481 460 465 481 489 480 461 440 423 414 403 373 331 312 341 391 421 433 462
708 462 508 534 522 489 446 398 370 402 473 499 441 364 355 413 477 518 547 566 547 488 420 378 370 391 425 448 450 449 456 448 412 375 375 393 391 389 437 514 539 481
703 481 413 407 445 464 458 458 464 445 400 367 372 404 439 462 476 487 497 499 487 471 468 472 458 428 416 436 456 451 444 466 496 490 450 423 432 455 465 459 447 434 425 427 436
697 436 451 475 502 502 459 404 389 414 440 444 453 490 541 580 593 581 547 511 496 503 510 500 480 465 456 454 461 468 466 466 479 492 483 465 469 492 496 482 496 553 591 571
692 571 541 572 640 660 611 558 553 577 587 578 570 581 614 662 688 662 602 559 555 570 581 590 595 580 547 526 532 537 522 508 524 562 599 629 647 628 568 511 511 551
687 551 571 555 542 558 571 551 516 503 509 507 494 504 567 667 749 761 702 632 615 658 713 748 777 814 828 784 704 652 653 670 667 655 664 690 710 713 713 716 720
683 720 733 764 799 810 797 787 795 804 794 781 792 821 833 811 780 772 793 823 846 852 832 786 734 711 729 762 769 740 713 727 776 822 847 866 893 910 898 871
678 871 854 846 836 838 876 934 949 891 809 771 789 826 860 896 931 941 927 922 955 1018 1076 1107 1108 1092 1077 1077 1091 1098 1084 1061 1050 1059 1079 1105 1124 1112 1047 951 887
673 887 908 997 1085 1118 1110 1114 1157 1214 1245 1245 1237 1235 1227 1213 1222 1278 1361 1426 1451 1457 1469 1480 1483 1496 1542 1608 1652 1658 1651 1653 1659 1668 1704 1779 1857 1896 1910 1943 1995 2023 2016 2024 2083
668 2083 2175 2267 2359 2451 2508 2505 2494 2548 2665 2769 2815 2842 2910 3028 3165 3297 3409 3487 3540 3603 3699 3821 3957 4106 4267 4412 4532 4648 4782
664 4782 4912 5020 5144 5342 5603 5855 6060 6264 6513 6789 7047 7294 7587 7952 8353 8748 9135 9550 10032 10599 11244 11948 12703
662 12703 13528 14456 15500 16652 17916 19328 20931 22741 24756 26998 29529 32407 35659 39297 43356 47898 52978 58619
659 58619 64828 71608 78960 86872 95314 104225 113497 122972 132460 141717 150411 158096 164264 168403 170062 168903 164798
657 164798 157919 148752 137984 126350 114512 103008 92229 82402 73613 65856 59091 53235 48151 43681 39721 36241
655 36241 33225 30608 28306 26265 24463 22857 21390 20037 18810 17704 16685 15733 14867 14096 13381 12681 11997 11359 10786
653 10786 10282 9858 9501 9158 8790 8424 8117 7869 7624 7355 7089 6849 6619 6378 6147 5950 5775 5593 5400 5221 5070 4948 4846
650 4846 4749 4632 4480 4306 4144 4016 3928 3863 3801 3737 3685 3646 3597 3520 3432 3369 3331 3289 3236 3186 3131 3044 2939 2869 2850 2830 2770 2695 2642 2592 2525 2475
646 2475 2478 2496 2469 2407 2374 2381 2388 2377 2372 2366 2323 2258 2244 2300 2353 2334 2269 2218 2192 2171 2164 2180 2186 2150 2091 2053 2029 1989 1940 1921 1927 1915 1873 1837 1839 1866 1888 1882 1841 1776
641 1776 1728 1724 1741 1735 1708 1698 1714 1725 1714 1702 1699 1680 1634 1598 1609 1648 1670 1662 1642 1616 1586 1564 1560 1555 1520 1467 1444 1472 1512 1503 1430 1334 1276 1282 1328 1373 1389 1382 1363
637 1363 1342 1334 1347 1372 1385 1373 1343 1297 1242 1211 1238 1302 1330 1284 1211 1171 1157 1131 1106 1118 1154 1161 1125 1090 1081 1068 1036 1015 1028 1051 1048 1019 983 952 944 986 1063
632 1063 1111 1089 1033 1007 1017 1026 1021 1024 1039 1038 1012 984 977 987 1004 1025 1035 1017 976 944 940 944 927 885 845 832 856 909 958 966 923 861 831 851 896 923 924 922 932 929
627 929 889 839 830 868 889 855 805 793 809 810 793 791 803 805 804 835 887 902 860 815 808 807 760 677 620 627 683 749 783 762 710 687 719 763 767 737 716 720 729 736 748
622 748 760 755 742 752 785 796 755 681 620 595 602 633 681 728 736 688 616 578 597 626 614 575 563 593 625 635 646 673 676 623 554 534 562 579 560 537 536 547
618 547 556 564 570 563 541 523 516 521 546 594 640 649 625 605 597 581 556 550 560 549 508 479 491 520 533 546 575 593 581 575 624 708 753 726 667 631 634 655 667 649 606
613 606 568 564 585 600 596 585 576 562 544 527 508 484 466 474 508 543 557 554 549 553 557 539 491 441 432 469 502 492 460 455 481 504 509 525 571 617 617 568 513 499 526
608 526 563 587 611 651 689 687 644 604 598 607 602 595 608 626 618 582 540 506 483 488 530 575 578 549 537 555 568 554 543 560 588 596 579 555 538 534 538 538 526 527 563 610
602 610 616 581 554 561 568 545 518 513 515 505 508 553 614 640 619 582 551 528 516 524 537 534 512 485 462 456 486 551 606 604 547 484 447 436 436 442 446 436 417 407 418 446
597 446 476 485 456 413 412 465 511 489 419 371 372 389 398 413 441 460 457 449 450 446 427 408 409 430 464 500 519 510 502 533 585 593 543 499 520 576 595 564 533 537 564 587
592 587 594 581 552 533 540 557 545 497 442 404 381 365 359 365 375 391 422 467 496 486 454 432 438 458 476 493 512 528 530 520 509 500 486 465 453 458 471 471 456 447
587 447 459 482 498 499 496 505 529 550 534 476 419 419 482 558 599 602 587 561 526 489 459 432 418 428 455 463 444 443 498 568 580 527 475 466 477 476 475 483 480 456 452 509
582 509 591 629 614 608 646 692 704 699 717 750 754 722 699 720 780 859 967 1117 1292 1447 1556 1626 1668 1672 1614 1492 1336 1196 1110 1071 1030 955 869
578 869 824 831 842 815 762 719 692 666 648 655 677 683 681 718 807 892 920 913 934 992 1030 1008 963 953 986 1024 1032 1014 983 939 876 803 741 711 718 746 760 727 653
573 653 578 538 526 514 501 511 551 583 576 547 538 560 579 564 524 494 495 525 567 604 632 656 679 691 679 656 654 700 787 878 932 938 918 919 970 1057 1141 1195
569 1195 1227 1257 1298 1344 1381 1387 1351 1288 1232 1198 1167 1113 1039 970 923 888 846 792 737 701 688 681 664 643 639 652 658 636 602 583 574 553 528 527 564 606 619 596
564 596 553 517 507 531 567 579 557 531 525 529 532 562 645 749 808 805 789 805 838 864 896 961 1045 1099 1100 1063 1013 971 960 993 1045 1078 1087 1110 1170 1247 1310 1354
559 1354 1371 1340 1256 1158 1097 1080 1066 1023 950 865 791 751 751 768 767 729 666 609 588 604 627 625 605 610 652 682 654 591 548 532 509 480 480 505 507 484 498 579
555 579 653 644 578 547 569 578 532 472 452 474 508 537 558 568 577 604 639 651 627 588 560 535 505 481 477 487 497 504 505 485 440 398 384 392 392 378 375 403 454 508
550 508 544 554 540 518 501 496 500 500 474 406 329 303 356 438 480 473 462 463 455 429 413 421 424 404 392 425 482 514 515 525 569 628 665 663 629 587 568 581 598 584
545 584 546 528 553 602 649 692 744 803 862 913 938 915 845 756 678 611 549 500 479 477 479 487 510 537 542 528 522 543 584 625 646 623 552 474 449 488 529 519
540 519 470 433 432 445 453 455 452 442 426 415 418 436 469 516 561 586 586 574 566 563 563 571 591 615 627 612 572 529 511 521 536 536 525 529 569 648 738 793 782 723 666
535 666 631 596 553 542 590 650 650 595 553 557 566 547 526 533 547 539 526 542 580 611 631 651 662 653 639 637 629 589 540 526 536 520 480 475 533 596 608 586 586 621
530 621 657 675 687 702 711 705 675 626 586 597 653 698 694 676 695 737 746 711 682 688 702 694 682 691 702 689 664 655 666 686 727 799 870 884 825 746 714 754 839
526 839 926 983 1005 1033 1120 1282 1470 1617 1708 1775 1846 1899 1898 1837 1742 1637 1520 1382 1233 1102 1007 946 901 863 841 853 889 912 897 860 844 863
522 863 890 904 926 985 1069 1125 1116 1051 967 895 855 857 890 933 976 1018 1049 1046 1006 971 987 1063 1158 1229 1260 1264 1270 1304 1370 1471 1619 1831 2106 2415 2731
517 2731 3046 3334 3536 3596 3516 3349 3141 2911 2668 2431 2218 2039 1897 1788 1693 1598 1524 1503 1533 1570 1590 1610 1646 1684 1712 1752 1829 1931
514 1931 2028 2120 2228 2354 2480 2600 2729 2865 2985 3079 3162 3242 3308 3352 3381 3404 3423 3456 3528 3633 3732 3812 3914 4081 4293 4507 4732 5039
511 5039 5478 6021 6588 7092 7449 7581 7451 7088 6558 5911 5183 4435 3760 3229 2847 2561 2320 2101 1904 1734 1591 1480 1414 1395
508 1395 1402 1405 1380 1335 1296 1291 1335 1423 1529 1627 1721 1850 2034 2235 2378 2419 2369 2258 2105 1928 1768 1655 1579 1509 1435 1372 1331 1319 1353 1443 1568
504 1568 1694 1825 1990 2199 2425 2661 2920 3181 3363 3405 3329 3184 2980 2706 2406 2155 1966 1786 1587 1411 1306 1261 1240 1227 1216
501 1216 1183 1117 1050 1032 1062 1099 1105 1075 1023 974 963 1012 1101 1198 1288 1370 1424 1412 1332 1233 1159 1106 1045 965 880 806 749 711 694 692 694 687 669 648 640 652 673
496 673 687 691 707 751 802 818 783 726 691 690 703 703 691 684 696 731 780 836 888 931 969 999 1015 1008 978 924 846 760 696 670 661 647 635 644 660 647 604 580 609
492 609 663 685 651 583 514 472 471 499 520 514 492 477 479 495 528 575 612 618 604 592 587 582 587 608 626 622 609 610 607 574 533 544 613 680 701 698 705 722 739 770 818
487 818 845 815 752 716 732 764 773 750 702 645 596 568 559 556 552 546 542 550 576 601 590 544 506 505 518 510 492 493 515 538 563 600 624 601 540 493 484 495 515 554 593
481 593 589 537 497 514 560 583 566 526 480 453 485 578 663 671 615 578 606 669 710 703 663 619 597 599 595 576 573 619 687 709 666 605 569 550 532 533 567 603 606
477 606 596 619 671 708 710 710 725 723 674 603 561 565 583 585 566 537 510 501 526 573 603 597 585 609 663 702 702 693 713 751 763 740 727 767 843 887 865 809 776 775
472 775 774 760 766 813 869 882 862 863 906 946 947 940 972 1024 1026 960 895 899 952 986 979 967 982 998 977 917 855 819 810 815 828 844 854 860 884 944 1028 1097 1134 1161 1204
467 1204 1254 1283 1293 1317 1366 1414 1433 1430 1427 1431 1439 1453 1479 1502 1511 1519 1548 1594 1631 1656 1698 1780 1893 2015 2132 2228 2285 2310 2348 2431 2543 2648 2731 2802 2860
463 2860 2900 2936 2996 3076 3144 3191 3243 3324 3417 3500 3582 3679 3784 3873 3942 4014 4107 4216 4336 4472 4631 4806 4984 5170 5382 5627 5882 6120 6348
459 6348 6604 6896 7186 7436 7677 7976 8339 8707 9047 9407 9856 10409 11058 11832 12792 13969 15360 16979 18866 21053 23566
456 23566 26465 29848 33808 38409 43750 50037 57603 66905 78551 93390 112596 137642 170084 211223 261710 320858
454 320858 385452 448753 501203 533525 540569 523004 485797 435344 377775 318797 263594 215938 177350 147312
453 147312 124297 106689 93152 82662 74459 67975 62773 58556 55139 52370 50072 48101 46404 44969 43742 42652
451 42652 41678 40865 40284 40015 40114 40574 41377 42593 44360 46750 49741 53355 57720 62958 69129 76355 84905 95117 107424
448 107424 122537 141520 165745 197171 238837 294681 368481 462998 579534 715912 862046 997334 1095727
447 1095727 1137522 1118577 1049116 944918 820400 688124 560503 448447 357883 288617 236765 197923 168589
445 168589 146154 128730 115069 104304 95713 88709 82881 77914 73539 69598 66036 62787 59765 56967 54469 52288
443 52288 50351 48632 47207 46134 45407 45042 45123 45698 46723 48179 50132 52658 55789 59598 64270 70057 77261 86295 97738
441 97738 112359 131233 155800 187598 227770 276676 333430 394820 454183 502062 529470 531799 510263 470090
439 470090 417685 359123 300013 245308 198492 160888 131872 109798 92926 79905 69785 61852 55529 50388
438 50388 46160 42656 39695 37123 34854 32821 30939 29138 27423 25831 24356 22969 21677 20502 19405 18315 17236
436 17236 16261 15454 14781 14177 13631 13164 12757 12365 11973 11608 11277 10958 10633 10322 10057 9842 9647 9442 9215 8976 8739 8504 8269
433 8269 8038 7833 7682 7583 7502 7388 7217 7006 6798 6626 6486 6352 6211 6074 5959 5872 5801 5729 5643 5532 5396 5258 5160 5123 5124 5118 5084 5047
429 5047 5034 5037 5014 4937 4817 4689 4577 4494 4438 4398 4359 4312 4254 4192 4133 4078 4029 3992 3970 3964 3960 3946 3925 3912 3908 3905 3900 3896 3885 3848 3775 3685 3600 3524 3460 3428 3434
425 3434 3443 3407 3322 3228 3148 3078 3016 2982 2981 2990 2984 2969 2959 2951 2945 2939 2916 2851 2749 2662 2626 2627 2634 2654 2700 2752 2765 2736 2698 2671 2644 2616 2608 2627 2648 2642 2606 2560 2529 2528
420 2528 2543 2540 2500 2452 2441 2470 2502 2517 2531 2546 2534 2482 2417 2376 2355 2328 2289 2256 2237 2231 2243 2272 2293 2272 2209 2148 2130 2153 2184 2193 2169 2124 2085 2071 2071 2057 2021
415 2021 1992 1998 2026 2024 1971 1910 1911 1984 2062 2083 2057 2034 2036 2040 2036 2039 2048 2042 2020 2014 2037 2056 2040 2016 2022 2045 2041 2008 1986 1975 1929 1835 1752 1734 1767 1797 1806 1806 1793 1749 1690 1664
410 1664 1683 1706 1695 1669 1667 1688 1689 1645 1596 1596 1646 1687 1672 1630 1622 1658 1686 1672 1638 1615 1586 1527 1466 1454 1478 1483 1459 1457 1506 1559 1572 1560 1559 1570 1583 1605 1638 1640 1582
405 1582 1503 1462 1452 1428 1399 1412 1456 1463 1413 1368 1370 1382 1359 1324 1325 1359 1388 1398 1395 1370 1319 1272 1259 1262 1253 1240 1248 1262 1245 1204 1176 1164 1143 1129 1162 1222 1232 1165
401 1165 1091 1092 1163 1245 1292 1294 1249 1177 1124 1135 1198 1259 1277 1258 1234 1218 1195 1147 1098 1092 1134 1175 1179 1179 1218 1271 1276 1232 1199 1196 1184 1150 1142 1184 1221 1206 1171 1159 1148
396 1148 1105 1068 1094 1160 1190 1172 1169 1213 1262 1272 1254 1236 1224 1218 1230 1255 1276 1287 1301 1311 1287 1233 1204 1234 1286 1298 1258 1208 1192 1208 1229 1238 1246 1270 1297 1298 1276
392 1276 1279 1335 1409 1460 1515 1627 1785 1927 2044 2206 2459 2765 3063 3340 3584 3755 3814 3766 3626 3386 3062 2729 2450 2208 1968 1759
388 1759 1645 1615 1591 1535 1486 1474 1468 1435 1385 1347 1328 1326 1343 1364 1353 1306 1271 1281 1309 1310 1288 1282 1300 1313 1306 1294 1292 1306 1340 1403 1478 1542 1596 1666 1759 1854 1943
384 1943 2057 2230 2471 2784 3192 3712 4323 4985 5658 6286 6759 6961 6856 6503 5980 5347 4675 4051 3531 3104 2730 2410 2174
381 2174 2033 1958 1908 1846 1752 1638 1538 1469 1415 1368 1350 1365 1367 1316 1249 1224 1236 1234 1216 1235 1294 1327 1302 1270 1272 1274 1235 1189 1187 1228 1283 1358 1465 1572 1636
377 1636 1679 1753 1856 1953 2057 2232 2497 2803 3100 3375 3602 3721 3702 3587 3421 3200 2910 2583 2271 2006 1801 1674 1612 1553 1447
374 1447 1322 1254 1271 1323 1341 1296 1213 1145 1141 1199 1250 1230 1160 1118 1135 1162 1154 1139 1164 1206 1200 1135 1076 1069 1086 1085 1078 1106 1161 1188 1165 1134 1145 1193 1236 1250 1243 1235
369 1235 1238 1256 1276 1276 1255 1241 1253 1279 1287 1274 1257 1236 1196 1146 1120 1138 1173 1193 1190 1183 1190 1217 1259 1295 1297 1254 1181 1104 1040 1010 1017 1035 1016 956 910 935 1011 1063 1050
364 1050 1012 1006 1035 1056 1048 1048 1095 1177 1239 1255 1249 1247 1245 1238 1245 1281 1327 1357 1384 1429 1470 1460 1410 1387 1427 1475 1466 1404 1339 1303 1294 1298 1298 1278 1245 1234 1255 1275 1265 1243 1234
359 1234 1224 1189 1148 1133 1128 1103 1077 1096 1147 1168 1149 1147 1193 1246 1265 1260 1250 1217 1156 1117 1140 1195 1229 1242 1275 1329 1373 1403 1437 1458 1429 1366 1329 1342 1361 1355 1351
355 1351 1379 1417 1433 1439 1466 1510 1540 1557 1582 1616 1639 1657 1692 1740 1764 1748 1721 1714 1728 1752 1776 1785 1759 1708 1683 1713 1773 1811 1817 1812 1807 1800 1800 1812 1816 1792 1758 1759 1806 1861
350 1861 1883 1868 1834 1800 1781 1775 1757 1717 1693 1742 1845 1917 1915 1894 1923 1987 2035 2066 2118 2180 2208 2198 2192 2205 2204 2171 2135 2125 2128 2132 2153 2199 2237 2239 2226 2242 2285 2309
345 2309 2286 2246 2235 2274 2339 2392 2412 2407 2399 2403 2414 2415 2394 2348 2283 2214 2158 2122 2109 2121 2150 2173 2177 2186 2230 2294 2335 2341 2345 2367 2378 2348 2304 2293 2316 2329 2315 2298 2299
340 2299 2314 2330 2347 2356 2337 2293 2256 2258 2292 2327 2345 2342 2315 2258 2190 2148 2150 2178 2195 2181 2136 2068 1999 1957 1965 2009 2051 2066 2060 2042 1995 1907 1815 1779 1817 1884 1923 1917
336 1917 1889 1871 1883 1930 1999 2065 2109 2130 2140 2155 2187 2230 2264 2276 2280 2297 2313 2292 2228 2156 2107 2081 2062 2050 2039 2016 1972 1922 1880 1838 1790 1751 1732 1719 1698
331 1698 1666 1627 1578 1531 1508 1508 1492 1443 1399 1395 1404 1389 1374 1403 1448 1441 1378 1334 1351 1386 1401 1421 1478 1539 1556 1541 1540 1561 1567 1540 1499 1474 1475 1503 1543 1565 1547 1507
327 1507 1480 1468 1440 1375 1293 1232 1210 1214 1204 1156 1087 1047 1057 1074 1043 978 944 966 996 987 961 968 1006 1016 968 896 849 833 824 817 820 824 808 778 763 756 721 656 628
322 628 683 772 808 784 770 803 835 812 746 689 669 677 705 738 758 755 743 741 756 788 835 871 855 793 737 724 724 697 663 666 697 710 686 655 649 667 692 704
317 704 683 633 596 604 632 634 620 638 687 711 682 644 635 642 640 648 688 729 725 685 660 677 720 751 747 703 646 621 637 660 653 634 633 643 638 628 648 691 709 675 620
312 620 579 560 557 571 593 602 594 593 620 668 721 770 791 748 651 579 601 678 714 676 627 628 661 682 693 720 752 757 744 748 770 767 730 704 719 739 731 722 751 787
308 787 764 687 635 651 687 684 657 654 670 659 621 604 633 679 710 729 747 754 735 709 712 751 791 795 762 724 715 739 778 813 824 796 731 663 638 659 681 663
303 663 624 608 621 634 639 656 688 700 677 656 671 703 710 696 698 721 728 702 673 675 703 725 726 713 703 708 733 766 777 753 718 699 696 691 678 673 684 697 700 697 686
298 686 664 638 629 644 665 681 705 735 733 680 628 655 754 817 769 656 583 580 599 601 606 639 681 701 700 704 718 728 720 699 675 660 656 653 636 610 600 615 629 610
293 610 560 514 503 529 583 652 717 756 765 757 749 740 727 710 686 653 616 590 586 596 603 598 581 567 578 620 663 663 616 574 580 612 620 594 575 583 592 573 546 547 575 599
288 599 610 626 647 641 594 545 537 560 564 534 507 519 564 603 613 598 576 567 571 578 582 592 620 645 636 591 556 560 586 605 620 641 647 617 578 583 628 656 645 640 671
283 671 708 708 684 671 666 644 620 622 634 616 571 551 575 600 585 543 514 518 552 598 630 625 599 587 587 565 518 500 542 597 601 557 526 534 558 570 566 540 496 468
278 468 499 574 628 619 575 535 510 495 505 544 579 576 553 551 576 590 568 537 529 546 559 548 520 494 492 519 558 580 573 562 566 569 533 461 415 439 508 562 583
273 583 596 605 590 558 556 593 608 559 493 487 536 572 571 577 612 641 631 603 586 572 544 515 511 534 570 604 618 601 578 586 614 610 569 561 624 700 712 666 625 605
268 605 579 552 544 538 498 451 460 525 579 595 618 666 679 620 547 539 577 584 546 524 557 615 646 631 587 536 499 483 479 478 489 523 563 577 567 579 638 708 726
263 726 675 607 578 584 578 549 544 594 663 691 676 668 685 687 647 591 549 515 476 454 472 512 541 552 571 606 643 667 663 620 562 541 582 629 607 527 476 506
259 506 576 614 600 564 539 539 565 609 652 671 656 611 562 538 547 561 552 534 542 578 613 622 610 586 554 523 517 542 580 608 618 613 590 552 515 498 515 561 607
254 607 615 574 519 489 480 473 480 525 580 584 535 500 520 550 532 483 465 483 486 450 405 394 423 476 529 557 543 502 467 461 471 472 460 458 495 568 632 640 593 534
249 534 499 494 527 595 651 631 549 509 569 654 648 558 496 524 588 618 617 616 614 585 531 479 452 451 461 461 453 465 519 590 634 646 651 646 609 556 547 593 632 620 587
244 587 573 564 533 507 521 554 563 563 596 641 633 566 511 505 510 486 455 450 459 458 460 484 513 522 525 547 574 561 512 490 532 594 606 558 505 506 563 630 667 674 671 664 638
239 638 596 567 575 607 627 617 595 586 595 607 602 569 520 486 486 506 521 531 553 580 576 531 494 527 617 686 675 606 541 516 533 578 631 659 642 599 578 600
234 600 634 631 580 518 492 520 571 596 577 547 541 555 555 535 520 524 531 529 529 537 533 503 476 488 534 575 598 619 645 664 667 668 672 664 636 606 584 563 540 536 566 607
229 607 622 600 561 529 516 523 547 579 615 654 680 664 612 571 578 611 617 590 568 574 578 559 544 565 596 586 537 507 530 565 557 513 484 480 465 424 399 430 484
224 484 507 507 536 596 624 589 548 563 613 626 591 563 572 590 586 567 543 512 487 509 583 646 642 593 566 577 590 586 587 594 576 537 527 570 614 604 565 563 604
220 604 636 629 612 615 628 633 635 637 623 592 582 618 661 655 606 582 612 644 617 544 487 479 494 490 464 447 464 504 521 488 432 409 440 490 522 539 568 611 654
215 654 686 703 687 634 578 570 616 675 703 688 639 580 542 545 565 569 558 570 614 655 666 664 669 663 626 575 536 505 476 465 481 488 461 439 477 550 581 555 537
210 537 556 564 532 503 520 547 531 496 500 538 555 542 539 557 566 560 569 590 579 525 478 461 446 420 435 525 621 639 591 565 593 617 600 572 569 569 543 506 490
205 490 493 498 505 516 509 473 438 451 506 551 561 559 572 595 605 597 576 551 535 544 576 606 610 591 575 574 577 558 511 457 428 432 446 445 440 456 499 544 564 551 515 471
200 471 441 438 455 476 507 552 578 541 454 401 435 515 559 552 537 542 550 551 562 586 591 557 505 472 469 490 528 573 597 586 562 552 556 544 508 476 477 512 555 578
195 578 575 558 551 560 571 571 574 600 643 657 612 524 449 425 444 470 479 473 474 494 524 542 537 517 492 464 434 418 433 464 478 460 434 429 452 497 554 598 587 519
190 519 459 477 560 627 638 635 657 674 651 613 607 620 602 551 516 513 509 484 464 478 513 547 572 578 556 531 543 594 638 652 659 675 674 639 604 598 593 556 511 505
185 505 530 536 504 459 425 412 434 493 548 551 511 476 470 476 490 518 540 531 518 552 618 633 575 518 527 565 562 528 524 569 624 659 673 664 623 562 512 492 500 524
181 524 546 548 537 541 561 561 525 491 499 520 505 465 445 445 428 391 370 371 369 374 425 510 542 481 406 412 485 525 488 428 408 431 455 451 425 405 417 453 477 471 462
176 462 480 511 508 463 417 409 430 444 445 448 465 494 531 576 625 656 649 611 571 549 543 541 546 562 573 549 497 467 491 540 553 515 473 463 468 456 437 452 506 561
171 561 586 594 611 632 622 576 526 500 490 476 470 504 582 660 682 637 568 529 534 542 507 438 396 423 484 519 520 536 587 632 628 587 562 573 589 576 542 521
166 521 529 541 524 482 459 483 526 538 504 460 436 424 420 436 476 508 508 499 521 570 614 637 643 627 578 518 485 482 479 468 480 520 550 541 522 533 563 567 536 504
161 504 489 475 447 428 444 487 524 539 543 538 502 428 367 390 492 578 560 463 392 415 502 582 614 599 559 521 506 510 501 462 416 406 445 500 525 493 433
157 433 404 441 508 541 520 479 453 444 447 470 493 475 408 348 346 387 429 462 491 503 482 451 444 456 468 493 544 587 585 559 557 564 526 456 435 490 545 535 490
152 490 474 489 509 533 569 589 569 535 532 550 547 519 494 493 513 550 581 565 497 441 451 487 483 456 476 537 554 499 447 464 509 505 450 405 401 422 449 479
147 479 508 531 546 553 552 553 568 588 587 571 572 591 581 521 463 460 490 497 481 480 492 477 430 404 425 462 476 477 493 526 547 537 500 457 433 439 459 464 439 405 389
142 389 408 454 503 524 517 515 539 561 545 504 487 502 502 467 438 463 520 549 535 520 539 573 579 549 521 531 568 588 566 524 488 466 458 474 506 515 474 424
138 424 424 469 496 476 448 451 471 480 475 454 409 365 377 455 526 520 459 412 401 403 404 415 429 424 404 395 404 424 462 518 552 523 457 422 432 432 391 342 319 314 313 333
132 333 381 423 427 412 417 452 492 521 532 518 492 489 532 592 613 575 513 477 487 524 550 542 507 466 427 390 365 366 390 417 443 472 484 451 382 332 332 358
128 358 381 406 444 476 486 494 515 532 528 536 582 624 601 526 472 472 491 497 494 489 470 444 448 489 527 525 493 465 450 446 454 468 469 460 460 470 466 434 399 379 359 336 339
123 339 385 437 449 428 415 431 462 485 486 454 407 391 422 448 406 312 247 257 313 368 412 448 471 476 471 459 428 383 361 383 423 429 383 314 265 270 324 384
118 384 396 362 336 361 415 450 458 467 483 480 455 437 450 481 502 506 497 471 434 408 420 461 491 481 445 417 425 466 517 550 554 534 506 475 446 429 432 441 433 403
113 403 372 359 357 350 345 363 397 413 401 395 430 494 542 549 521 474 415 367 355 379 412 431 441 455 467 471 474 486 491 472 445 442 466 483 473 454 460 498 534 527 468
108 468 402 393 450 508 505 458 431 441 445 421 402 418 437 429 417 448 515 564 568 542 504 459 424 420 439 456 469 499 534 535 500 475 480 477 436 394 394 426 454 473
103 473 491 488 448 403 401 428 428 393 374 405 461 506 539 569 581 561 527 506 498 489 477 473 478 487 499 506 496 462 426 412 428 460 491 506 503 493 485 473 442 399 363
98 363 347 352 379 428 470 475 460 478 535 574 546 478 436 445 478 503 506 486 462 462 480 474 427 387 397 438 461 470 494 520 502 450 424 451 494 513 510 506 505 514 530
93 530 523 468 404 404 467 509 481 439 444 471 466 450 481 554 599 581 535 497 477 474 485 492 472 442 438 460 470 464 472 508 538 531 498 469 453 450 468 504 532 533 520 513
88 513 504 478 442 424 429 445 457 464 470 475 479 480 472 456 446 450 460 457 437 423 440 483 514 503 465 443 458 480 478 461 456 457 430 371 318 306 339 400 459 476 430 369
83 369 382 490 601 610 520 425 392 413 452 491 516 509 468 428 424 451 479 484 469 449 437 431 423 412 405 408 407 390 372 380 414 441 438 421 424 462 518 565 592 595 582
78 582 559 530 494 451 409 389 405 444 458 417 351 333 391 470 506 498 489 489 471 439 429 442 425 361 310 328 390 429 448 488 535 515 414 326 337 412 461
73 461 458 455 473 476 441 406 411 439 442 412 382 381 403 426 432 424 418 440 489 537 551 538 516 488 452 436 462 502 496 442 414 454 513 522 492 471 461 429 387 383 412 413
68 413 366 326 338 369 377 385 430 478 466 404 372 408 465 481 450 403 364 341 339 356 376 387 393 410 438 463 467 448 426 423 433 432 422 435 485 530 535 522 532 555
63 555 546 512 501 515 506 452 410 426 467 478 460 453 457 448 436 460 515 542 500 419 361 362 403 428 400 344 322 355 388 371 341 367 440 477 444 413 449 522 556
58 556 532 490 460 438 424 422 417 389 357 358 385 395 377 366 386 413 426 452 520 597 622 582 524 490 473 447 412 392 399 420 437 439 434 439 452 450 417 374 356 367
54 367 376 370 379 426 489 518 502 479 483 514 543 544 513 479 477 508 525 493 446 448 497 522 481 416 395 428 468 481 469 451 439 443 457 461 445 441 474 526 551 538 515
49 515 502 489 469 455 457 468 478 491 504 504 482 452 436 447 473 486 462 406 360 363 402 429 421 395 374 362 354 350 344 333 327 336 343 328 309 332 401 457 457 428 423 453
43 453 487 505 503 484 466 480 533 582 582 544 510 497 491 488 498 513 507 480 463 469 475 456 421 393 382 388 414 458 497 505 474 424 382 372 395 434 470 501 525 535
39 535 529 524 531 534 506 459 430 430 434 417 392 387 408 444 488 530 550 526 463 395 362 378 426 467 476 457 430 404 375 343 321 327 363 412 442 437 417 411 413 393 352 337
33 337 375 425 432 406 397 412 416 401 403 430 440 413 388 405 446 466 462 458 464 463 447 421 389 361 349 356 363 350 319 294 304 365 460 523 497 408 351 374 427 440 414
28 414 395 391 385 384 409 435 416 360 340 394 473 509 488 448 426 430 460 509 560 582 556 503 470 476 489 468 432 439 500 544 517 453 421 423 411 374 365 413 482 519
23 519 503 451 399 384 408 434 429 418 447 502 523 497 472 477 478 449 412 403 408 397 373 360 372 406 453 483 460 393 337 321 307 270 253 299 373 405 389 381 403
19 403 418 404 387 393 416 452 502 546 547 511 492 515 528 481 399 349 356 386 412 435 452 447 423 409 412 396 342 285 276 310 344 363 396 448 473 433 362 328 342
14 342 356 334 288 254 252 285 338 372 360 329 333 373 395 375 364 414 498 550 555 544 527 488 438 423 451 474 460 440 460 507 523 487 436 411 416 421 405 376
9 376 352 343 346 352 356 362 371 379 379 365 348 348 369 385 366 326 311 347 404 433 426 414 418 427 424 408 394 398 415 432 440 451 474 499 501 475 445 432 436 449 466 475 462 439 441 471
4 471 485 454 411 394 387 352 304 287 300 307 302 327 390 444 443 403 368 364 392 435 454 416 354 339 389 434 418 376 377 419 438 411 377 372 387 397 418 474 555 615
-1 615 613 550 461 388 359 376 417 443 426 371 323 318 348 372 374 377 398 422 425 411 397 394 395 396 399 399 384 352 317 301 316 356 397 420 432 442 444 427 407 410 429 428
-6 428 399 374 374 384 386 390 402 412 414 428 461 476 441 376 326 308 319 354 401 422 398 370 383 414 403 357 345 396 452 457 431 424 437 424 366 301 272 286 310
-11 310 318 313 323 363 416 450 454 439 423 419 443 498 551 558 514 459 432 430 432 423 399 356 305 279 304 366 419 430 406 375 347 317 289 290 339 408 441 423 398 403
-16 403 420 406 357 304 267 255 278 330 366 349 306 304 354 394 380 352 372 435 483 481 448 426 431 444 439 412 388 381 375 356 343 361 391 391 362 353 374 377 336 305
-21 305 343 424 476 466 428 402 396 399 392 364 338 355 412 444 407 354 364 424 444 386 312 298 341 386 400 389 372 366 378 390 380 349 324 317 306 280 260 272
-26 272 312 359 404 441 451 433 415 424 442 436 409 402 427 454 445 406 364 340 346 384 435 461 441 403 390 414 446 459 456 442 406 345 291 285 327 377 409 429 446
-30 446 439 390 321 275 276 313 360 393 390 351 314 318 355 375 358 345 383 457 507 506 480 460 442 413 379 357 338 303 262 248 276 321 351 366 377 387 396 416
-35 416 451 479 476 450 426 411 401 405 429 456 460 454 468 492 485 442 412 425 455 470 478 494 495 457 403 370 364 367 377 395 403 384 356 345 347 351 374 417 439 417 403
-40 403 453 521 508 422 372 410 455 418 328 268 261 286 339 418 476 472 432 416 434 448 436 414 390 369 364 379 381 344 305 324 393 441 442 438 464 491 490 482 496
-45 496 512 501 474 467 490 516 524 509 470 415 365 333 305 270 248 264 304 334 354 394 459 497 473 425 416 450 472 455 438 459 498 511 494 475 459 427 385
-49 385 365 382 402 400 390 396 400 375 336 328 360 393 397 394 408 422 400 349 317 328 355 363 362 387 441 480 477 452 435 426 401 366 342 331 315 298 318 389 464 490
-54 490 463 428 415 421 428 430 425 410 386 357 333 326 341 366 376 362 334 297 245 196 203 283 372 387 328 267 250 265 293 332 361 340 272 217 208 204 165 129 159
-59 159 246 320 351 363 373 356 312 289 313 343 329 284 269 297 319 293 235 204 235 311 379 398 374 354 365 385 379 349 325 316 305 291 298 328 351 353 359 390
-64 390 417 415 411 439 467 433 354 321 374 439 438 392 369 380 383 364 349 344 328 308 319 367 405 390 328 265 241 268 325 364 362 344 343 355 357 357 382 421 433 416
-68 416 418 459 500 508 495 480 454 414 388 399 425 439 445 451 439 408 395 419 436 405 358 351 371 369 354 383 452 492 471 443 463 501 493 430 362 330 336 353 362 364
-73 364 376 401 412 390 363 360 363 336 304 323 377 376 296 232 267 351 385 368 375 415 424 386 360 378 390 350 291 272 303 353 407 458 480 447 383 340 341 361
-78 361 370 372 387 418 445 450 444 457 484 483 423 344 315 345 379 380 370 374 380 372 377 413 444 426 392 409 476 512 471 389 333 321 333 349 352 340 336 360 387 369 316
-83 316 297 349 418 435 408 387 380 355 315 296 316 354 386 409 422 432 449 467 449 393 362 404 469 471 421 404 437 441 381 336 372 432 427 372 349 372 388
-88 388 377 373 387 384 351 328 339 363 369 360 351 348 356 383 413 418 407 412 436 448 434 420 418 412 400 412 453 479 454 411 403 424 435 422 405 384 340 287 281 344 433 486
-93 486 487 463 442 433 440 467 495 489 434 368 349 390 439 444 419 418 451 471 441 388 361 372 392 397 388 380 383 399 417 420 406 388 384 394 404 405 395 378 364 372 403 433
-98 433 438 418 387 348 299 254 235 247 280 318 344 349 345 361 405 446 459 456 465 475 453 398 356 367 420 482 525 530 493 440 414 427 443 423 377 347 356 395 442
-103 442 477 488 478 463 462 472 476 466 453 437 410 371 350 381 455 518 523 487 461 465 475 468 463 481 504 498 466 438 418 380 326 307 347 407 427 413 411 436 451
-107 451 430 391 367 359 351 343 346 352 339 302 264 252 261 271 278 295 331 369 387 384 372 359 342 325 329 360 394 408 410 420 426 386 302 242 265 342 385 356 297 261
-112 261 258 270 295 331 346 317 268 248 269 304 340 386 429 433 397 371 385 402 383 352 364 420 468 470 441 407 373 327 277 242 246 292 352 380 363 341 356
-117 356 399 426 425 428 450 471 473 465 448 408 350 312 318 337 327 293 282 317 373 409 402 366 335 334 362 389 398 398 391 365 315 272 275 321 378 414 430 442 465 492
-122 492 492 446 376 336 343 358 346 329 352 404 431 408 367 352 370 402 425 426 410 391 381 368 346 336 363 412 439 434 431 441 436 400 375 404 459 475 437 397
-126 397 396 412 408 387 378 383 376 348 324 323 328 319 307 320 353 372 367 363 371 361 316 271 282 344 405 430 436 436 416 371 330 332 365 384 359 312 288 309 354 383 385 392 425
-132 425 464 475 470 485 512 499 438 385 388 413 403 363 348 378 418 432 420 405 411 446 498 531 524 498 479 460 419 371 360 383 396 374 347 340 340 338 345 359 344
-136 344 297 277 329 401 416 381 366 395 423 418 400 383 345 285 257 302 381 421 412 395 394 386 354 319 309 316 312 294 285 308 347 361 337 318 353 426 471 454
-141 454 413 407 440 478 506 526 526 490 443 431 461 495 501 485 460 426 381 349 346 365 387 397 385 354 329 338 373 394 390 378 365 323 254 208 223 271 296 290
-146 290 280 275 265 267 306 361 378 338 289 271 275 278 289 327 382 423 430 415 397 387 379 357 322 296 300 325 335 321 304 311 335 359 382 409 435 437 401 338 283
-150 283 277 329 397 421 386 344 361 442 521 534 486 436 428 449 459 447 436 436 423 381 331 309 318 339 357 366 357 331 309 307 302 276 253 271 314 329 305 284 293
-155 293 313 326 341 363 374 368 365 370 365 347 346 365 368 337 306 301 292 255 221 230 261 275 281 323 394 444 451 438 424 408 390 376 366 356 365 397 423 418 410 436 474 472
-160 472 429 390 369 345 327 348 392 399 361 341 379 435 469 488 501 473 395 327 318 330 301 254 264 342 415 429 410 406 419 422 403 378 368 376 394 414 440
-165 440 478 510 509 468 409 353 310 300 333 377 372 309 254 262 299 307 290 293 321 335 316 288 279 297 336 383 415 424 431 459 491 502 494 480 449 394 355 371 414
-170 414 426 418 455 547 612 593 521 466 444 437 431 412 373 334 341 392 425 402 369 378 408 408 388 392 417 418 384 363 380 407 420 436 465 483 464 424 405 425 475
-174 475 528 557 542 491 437 407 401 414 444 481 496 472 428 399 396 393 371 339 331 364 416 449 440 400 354 315 285 266 261 259 252 253 283 333 368 361 332 317 327 341
-179 341 337 314 289 285 313 358 393 404 410 433 457 446 389 321 285 282 292 307 332 354 341 294 261 291 372 445 469 454 434 425 427 432 430 411 380 363 373 392 397
-184 397 400 425 461 468 438 407 399 398 388 386 408 421 396 364 384 448 487 468 437 431 422 379 337 350 394 401 364 346 387 448 478 478 471 462 450 455 479 488 448 388 370
-189 370 404 442 447 434 440 467 490 491 470 448 442 454 459 431 378 336 329 344 356 360 366 382 401 414 419 420 417 409 402 411 439 471 477 454 428 420 419 405 389 395 414 415 396 387 393
-195 393 375 312 249 246 306 375 405 398 388 402 439 465 444 384 338 348 399 440 445 435 444 478 507 494 426 332 264 254 287 326 351 356 345 334 337 349 341 307
-199 307 283 298 327 321 273 228 226 267 326 376 391 365 333 339 379 402 383 359 371 403 397 327 228 167 179 247 312 326 287 239 227 260 315 360 370 346 315
-204 315 300 307 326 357 397 421 400 346 304 301 321 342 361 373 363 335 323 349 390 416 426 427 406 345 270 224 218 225 238 272 327 373 391 396 407 414 401 377
-208 377 367 382 412 448 485 513 513 478 422 374 345 322 286 248 233 249 272 277 272 271 269 259 252 259 267 261 252 266 296 311 304 309 342 372 374 362 361 365 353 333 327 333 339 352
-214 352 382 410 403 360 320 306 305 317 365 450 511 497 439 406 408 382 296 205 186 249 334 387 399 384 362 349 347 339 318 314 354 415 438 411 372 348 319 274
-218 274 250 276 325 354 374 416 451 421 337 286 318 381 402 386 388 415 415 367 317 325 381 414 383 326 308 330 336 300 265 277 316 332 328 348 398 431 428 423
-223 423 437 440 410 386 405 439 436 395 362 359 374 393 408 397 349 300 304 364 424 443 427 400 371 346 338 343 350 361 389 423 431 404 372 355 341 332 364 445 524
-228 524 537 498 469 477 486 462 419 391 379 362 333 309 312 341 377 390 361 306 270 285 327 330 269 201 212 302 372 351 292 294 368 426 415 383 394 426 417 361
-232 361 313 303 300 271 226 199 202 230 280 345 405 428 402 351 324 344 387 410 401 394 412 438 447 447 458 471 459 423 389 376 375 369 351 323 294 277 279 290 301
-237 301 319 350 378 392 407 434 453 432 388 364 363 355 337 352 408 444 416 364 362 412 444 409 334 279 274 295 304 294 293 325 375 393 364 323 310 320 328 330 333
-242 333 333 317 295 292 308 328 353 395 433 423 355 277 248 281 342 392 407 386 354 340 353 369 367 352 345 347 335 296 246 224 252 318 382 410 402 383 377 390
-247 390 409 413 396 377 374 378 362 319 283 285 314 342 362 382 398 405 426 475 521 508 436 364 327 306 278 269 303 353 371 352 322 294 254 208 185 202 248 295
-251 295 320 320 309 311 325 327 317 329 379 417 390 313 258 257 271 268 265 283 302 292 263 252 268 296 327 369 412 428 410 382 372 369 345 296 254 250 273 285 270
-256 270 257 280 330 372 390 396 403 406 404 410 426 432 407 358 313 301 335 396 438 419 357 313 326 373 408 421 422 403 348 276 239 249 272 276 276 298 334 354 352 339
-261 339 327 324 340 369 377 342 290 273 305 345 361 360 357 348 338 348 385 418 416 393 386 390 363 297 248 259 300 301 242 173 152 184 234 270 290 307 331 358 374
-266 374 370 354 347 356 367 363 347 337 337 335 331 348 395 440 435 378 320 301 306 307 311 347 402 418 368 295 263 292 346 383 388 378 382 409 426 395 327 273 265 280 287 292 307
-271 307 315 295 268 268 287 281 246 226 244 279 303 317 333 353 374 388 368 300 224 203 241 270 252 228 251 299 327 338 366 397 391 354 341 366 391 394 404
-275 404 435 451 429 401 405 416 388 333 307 331 366 374 368 383 416 425 380 296 224 205 235 274 288 273 245 221 207 207 223 251 281 308 334 356 357 330 296 292
-280 292 325 361 373 384 424 466 442 334 220 193 254 325 349 334 317 319 339 366 384 383 379 387 392 361 298 255 266 310 348 361 354 324 272 228 222 252 277
-285 277 274 261 271 308 336 328 294 276 291 311 309 307 339 391 409 377 341 345 377 408 432 446 431 386 361 397 456 467 420 370 345 318 279 272 322 384 389 335
-289 335 280 271 309 365 404 409 386 358 330 286 224 171 163 199 250 295 334 369 398 414 408 369 316 287 304 344 370 372 356 315 257 224 261 340 381 345 284
-294 284 266 292 314 309 293 291 313 355 398 414 396 375 385 412 424 415 409 411 405 393 399 422 419 370 313 290 286 258 207 177 186 205 209 214 238 273 296 311 338 374 397
-299 397 391 360 325 297 280 263 245 237 255 296 347 390 407 385 329 276 262 278 284 273 279 317 352 356 350 366 386 377 345 328 326 316 299 304 324 321 298 309 370 413
-304 413 382 311 274 280 285 274 277 301 311 297 290 313 341 346 343 357 374 363 332 316 331 353 358 350 344 342 333 311 282 261 263 293 332 357 362 354 339 318 298 290 287 273 258
-309 258 280 348 417 430 391 353 346 349 334 314 325 372 417 421 384 342 334 357 372 360 349 366 385 352 278 240 281 349 380 375 377 382 361 325 314 331 332 317 333
-314 333 390 428 400 341 313 322 341 360 383 383 343 295 294 332 349 317 271 251 262 292 332 371 394 407 435 478 503 497 483 484 485 461 416 365 316 278 271 297
-318 297 322 318 298 293 298 293 284 293 316 329 335 353 371 353 304 279 302 335 334 316 320 342 350 343 341 346 337 324 337 373 393 378 357 357 369 375 385 403 396 342 276 268 332 417
-324 417 463 457 418 365 324 320 354 389 389 349 300 269 260 263 270 283 300 304 279 241 230 257 287 290 291 327 379 390 348 304 300 320 336 345 347 321 268 239 275 344 384
-329 384 383 377 380 378 372 381 398 393 369 373 421 474 483 444 380 300 214 145 113 111 125 150 189 235 283 329 359 343 281 218 193 197 206 233 304 396 445 423 374 357 377
-334 377 389 366 334 336 382 432 432 380 322 305 324 345 354 361 371 375 374 386 416 436 414 360 319 327 373 417 433 423 404 377 338 294 269 278 312 347 354 325 282
-339 282 264 293 339 356 331 297 283 277 251 202 161 154 185 230 254 244 230 252 298 314 278 245 274 344 393 396 381 356 297 212 170 216 300 335 305 275
-343 275 292 327 323 283 268 313 372 382 349 349 421 504 514 446 375 352 361 358 334 302 272 261 282 323 346 333 314 320 343 360 365 366 353 314 273 269 301 336 353
-348 353 362 373 375 363 361 396 459 507 502 443 365 304 276 277 299 342 388 406 384 355 365 407 430 409 379 383 411 415 379 344 352 394 424 412 369 321 290 285 301
-352 301 320 318 304 314 368 429 441 394 337 315 321 328 335 361 403 434 431 395 344 301 288 305 331 345 355 378 403 398 358 322 316 327 327 318 318 332 350 369 389 395
-357 395 370 327 306 322 341 321 262 200 165 166 201 263 316 316 260 208 221 294 361 370 332 290 268 271 299 350 405 436 431 407 381 355 321 276 225 180 155
-362 155 157 181 212 233 238 225 203 194 215 259 298 311 306 306 317 323 311 290 287 319 374 416 416 378 331 298 282 281 299 333 359 352 312 271 259 278 312 343 361 366
-367 366 367 377 393 390 351 297 265 267 275 267 256 273 309 315 266 198 175 204 230 205 157 160 232 309 324 298 304 363 418 408 347 290 268 274 291 309 323 329 339 352
-372 352 347 318 302 336 390 393 328 255 225 226 240 281 359 428 433 386 350 358 383 392 382 369 360 350 330 294 256 244 271 314 336 317 261 189 140 160 235 293
-376 293 286 256 274 332 360 338 321 337 346 312 273 273 290 278 252 269 338 399 412 400 398 396 363 309 287 326 393 434 448 476 522 529 461 374 355 396 417 386
-381 386 361 384 411 388 338 312 310 301 298 344 415 434 375 302 281 305 321 304 277 274 306 350 365 334 290 278 301 323 321 316 334 368 392 388 355 312 296 327
-386 327 376 384 339 293 287 302 309 318 359 413 428 386 335 321 335 330 293 261 270 308 331 325 316 327 341 329 300 293 322 357 365 344 312 286 282 308 346 366 359 347 346
-391 346 348 351 372 410 431 409 372 363 386 400 383 361 357 361 348 317 289 279 284 293 303 317 329 327 310 298 308 331 336 313 288 286 296 296 292 303 324 334 333 347 379
-396 379 398 386 365 366 376 364 329 301 297 293 269 240 241 273 299 296 273 251 239 235 237 240 241 246 267 299 316 315 324 353 366 325 264 239 248 245 228 245 298 322 294 277
-401 277 321 382 405 413 449 477 440 373 363 407 413 351 306 339 391 383 332 311 345 401 442 449 415 365 348 377 400 378 348 355 377 363 321 299 294 257 190 159
-405 159 192 237 250 259 307 385 442 451 424 381 342 321 309 284 238 198 185 183 176 177 207 251 275 273 265 262 261 277 324 386 414 385 331 302 309 325 331 335 353 380 396
-410 396 392 375 364 362 354 331 306 299 313 330 336 336 349 388 430 435 387 328 322 380 436 424 358 305 306 345 392 434 463 464 448 441 440 407 331 268 275 332 380 401 424
-415 424 439 404 326 283 323 392 400 344 290 282 297 297 279 260 257 281 334 390 411 389 354 339 342 336 306 261 226 218 228 223 183 139 138 188 242 260 251 248 260 272
-420 272 278 279 268 238 210 216 259 308 333 337 335 331 322 315 322 340 353 346 327 323 351 399 425 400 333 263 215 202 220 258 295 312 308 294 277 269 286 329 365 361 327 302
-425 302 305 315 322 339 364 372 354 347 382 434 460 453 433 396 334 275 259 271 257 205 172 199 254 283 281 274 275 287 328 396 442 420 351 303 304 321 332 349 371
-430 371 367 322 270 247 251 264 296 357 420 441 422 405 418 447 476 503 523 515 462 371 279 230 252 326 403 446 459 459 442 402 363 348 343 324 302 313 344
-435 344 342 301 279 313 356 350 300 259 249 253 260 276 299 317 325 322 299 257 221 218 240 260 272 297 331 352 352 352 363 368 347 303 259 228 213 202 185 180 212 280
-440 280 332 323 269 234 250 296 337 353 342 307 267 246 246 256 267 270 254 229 247 339 452 488 419 323 275 276 287 294 305 312 312 320 339 345 325 304 305 302 269 226
-445 226 209 217 225 240 288 362 411 408 370 327 292 261 228 196 183 213 277 331 345 345 367 397 399 381 387 430 474 482 453 401 351 342 390 450 461 414 356 319 292
-449 292 278 296 334 344 305 264 262 278 272 252 246 249 247 251 278 304 294 258 239 246 259 272 300 335 339 300 257 246 258 268 278 307 350 373 356 317 285 272 276
-454 276 288 304 322 335 343 351 359 358 344 331 329 327 309 282 266 262 250 235 243 281 313 313 304 324 363 373 338 295 283 297 307 291 257 239 263 315 348 332 293 277
-459 277 293 320 346 373 380 339 261 202 201 244 296 344 377 373 332 291 284 292 277 247 255 322 395 402 345 295 306 346 347 300 270 305 363 379 349 332 349 356 326
-464 326 299 315 354 362 339 332 360 390 389 365 343 334 336 344 349 340 332 356 408 436 395 316 274 301 351 372 372 394 439 464 442 404 389 398 407 403 386 358 333 339 379 403
-469 403 367 297 259 272 290 287 295 334 361 334 292 300 353 389 380 363 369 377 362 331 308 295 282 267 254 244 244 259 276 273 251 250 287 326 318 266 223 229 271 314
-474 314 332 325 306 284 261 239 228 240 264 280 288 307 345 386 411 419 418 409 395 383 363 320 265 243 271 303 287 246 246 305 368 398 415 449 479 470 419 360
-478 360 312 279 262 267 294 335 382 417 410 357 291 252 249 264 292 341 399 435 428 388 347 331 350 388 414 411 391 371 355 344 336 323 283 223 185 207 265 303
-483 303 304 289 276 257 239 240 253 249 232 241 297 363 396 399 391 369 332 310 338 396 434 431 410 392 377 367 379 414 445 444 408 361 324 305 298 294 301 330 381 427
-488 427 435 401 351 316 310 320 311 267 222 225 279 328 334 315 301 279 231 185 181 198 187 154 159 223 301 350 375 392 397 390 378 355 303 244 224 243 252 235 240 290
-493 290 329 304 249 228 247 267 281 310 347 368 385 418 442 415 356 334 363 389 375 354 362 383 379 343 293 251 240 275 333 365 346 300 259 233 222 236
-497 236 273 308 327 337 345 346 339 337 336 321 303 322 388 455 470 430 361 282 217 205 254 319 352 364 387 413 406 367 328 301 269 240 248 297 340 337 296 251 218
-502 218 199 192 198 210 228 249 262 260 256 267 283 274 239 216 232 270 296 298 288 276 260 242 232 252 312 384 409 357 278 251 290 331 335 329 343 350 310 253 235
-507 235 261 279 269 264 288 315 317 301 284 273 276 314 375 397 347 278 278 350 411 403 359 342 355 359 341 329 343 365 365 335 291 262 270 305 332 326 312 334 390
-512 390 425 407 371 361 366 347 312 307 339 354 309 237 213 262 335 368 342 290 256 256 271 275 264 258 266 277 278 276 291 324 354 363 356 346 331 296 244 209 230 299
-516 299 361 371 339 312 317 336 348 355 367 384 388 371 343 316 303 309 326 338 342 348 367 388 384 346 292 244 213 198 193 191 193 203 230 273 321 370 417 453 455 421
-521 421 379 358 350 324 282 266 296 331 321 280 270 310 350 341 303 292 317 346 356 369 399 419 398 337 279 264 299 361 414 435 433 433 445 451 434 392 344
-526 344 309 304 332 378 411 409 369 315 274 260 267 274 268 258 255 251 230 201 188 196 208 212 213 218 233 267 327 390 419 412 406 417 416 382 348 349 365 354 329 339 375 383 345
-531 345 313 315 314 278 241 250 292 319 330 357 399 415 385 337 306 297 297 297 288 268 250 255 274 283 280 285 296 288 258 242 260 277 258 224 225 257 281 283 298 337 363 339
-536 339 281 232 218 237 276 314 330 320 310 315 319 304 281 271 262 227 181 161 166 153 108 78 101 157 204 236 268 297 320 352 402 436 416 369 357 381 387
-541 387 355 340 376 413 395 352 347 376 382 359 360 395 399 331 246 219 249 285 308 335 357 347 326 351 432 499 496 448 414 402 380 341 304 277 253 247 276 321
-545 321 340 326 320 349 387 403 403 397 369 308 247 236 278 326 339 315 271 227 203 213 251 285 278 223 157 134 168 215 227 221 261 356 429 416 359 335 347
-550 347 337 295 278 313 355 356 330 314 312 322 355 409 436 392 305 248 253 285 303 301 294 296 309 328 333 309 272 257 282 326 345 320 275 253 263 272 254 236 262
-555 262 318 335 289 244 271 344 381 344 274 227 225 267 334 388 397 376 366 376 380 370 361 352 317 265 249 291 339 331 280 251 273 318 354 376 382 362 330 322 359
-559 359 408 416 370 305 263 255 265 276 291 321 361 389 384 353 324 322 344 370 383 380 364 334 293 257 249 264 280 277 270 281 309 332 335 325 311 294 277 270 290 338
-564 338 397 430 405 338 286 292 329 327 265 197 186 236 301 344 349 322 276 242 240 265 295 324 351 366 356 332 321 327 322 287 246 244 290 348 376 370 360 370 386
-569 386 373 322 269 252 264 273 274 288 325 362 378 386 398 394 350 278 223 206 204 197 203 244 307 348 354 342 320 282 243 250 313 378 386 347 320 327 337 333 335 351 349 303
-574 303 241 217 245 291 318 312 287 270 284 321 347 343 325 321 335 353 368 375 367 347 333 342 367 389 403 407 392 361 334 321 307 279 252 245 249 253 262 279 278 251 247
-579 247 296 343 316 245 227 279 313 293 285 340 389 360 295 280 303 292 254 274 368 451 457 419 393 372 334 295 274 244 186 139 158 227 279 294 309 341
-584 341 359 332 282 241 207 170 150 173 223 254 251 244 258 271 258 230 227 258 292 297 274 249 244 271 324 371 378 346 309 292 281 256 232 238 269 288 270 229
-588 229 198 199 229 260 263 240 224 237 258 263 269 307 354 351 291 238 245 289 314 308 290 260 218 193 211 239 223 178 177 244 312 326 314 331 358 345 300 285 310
-593 310 303 223 131 115 175 224 204 147 115 122 133 120 91 70 74 108 164 224 254 239 203 196 235 284 302 293 293 319 342 335 302 260 216 176 161 181 214 232
-598 232 235 238 243 248 272 326 379 380 331 292 299 324 329 317 307 296 271 252 268 317 363 385 383 363 329 293 270 263 263 262 252 227 199 196 230 268 273 251 227 211 191
-603 191 179 202 262 324 348 323 275 248 268 309 313 267 234 268 339 379 385 406 434 410 336 297 337 386 370 319 307 327 319 277 252 266 282 277 275 295 320
-607 320 340 372 422 454 429 355 277 234 230 252 275 287 290 298 318 338 346 342 337 341 353 347 306 254 238 271 307 303 275 263 271 269 257 263 295 329 356 381 390 353 286
-612 286 248 273 321 342 339 339 338 310 261 216 186 165 163 208 297 380 401 352 278 235 244 279 303 305 294 276 248 221 217 238 257 253 243 254 292 337 357 336 289
-617 289 269 312 381 393 332 273 278 310 302 268 283 357 422 433 416 402 374 321 282 286 298 271 224 222 275 331 353 361 380 394 375 331 295 282 281 284 291 301 304
-622 304 305 313 319 303 269 251 274 320 358 382 400 410 400 375 347 314 270 235 241 274 285 258 239 260 292 290 269 274 314 349 357 360 382 417 440 427 371 295 242
-627 242 243 279 313 337 362 380 369 339 326 332 324 294 282 311 351 361 346 332 319 294 271 272 288 275 223 172 171 218 268 283 270 264 279 293 286 277 296 326 324
-631 324 288 265 287 321 316 275 242 246 276 302 304 277 243 239 279 338 377 380 347 284 225 225 301 395 433 410 380 375 377 363 335 306 286 283 299 307 282 240 227 257
-636 257 290 285 251 234 264 324 362 344 295 266 274 276 248 232 273 341 369 351 336 336 315 277 274 326 378 392 394 409 412 381 354 363 375 352 329 352 382 358 306
-641 306 308 371 417 412 410 439 446 384 296 249 247 262 294 347 379 353 309 317 371 396 371 366 433 514 505 393 270 224 248 272 248 196 163 170 202 232 248 260
-646 260 276 291 292 278 272 294 335 365 363 335 302 274 262 276 312 335 316 269 245 262 282 262 216 192 216 262 288 278 246 210 194 211 250 273 249 197
-650 197 176 217 287 323 304 268 253 262 270 274 291 323 346 341 313 288 280 276 251 209 187 219 280 313 301 289 321 370 376 334 296 300 320 313 274 241 252 310 381
-655 381 417 399 358 334 326 302 261 239 263 315 368 403 404 361 315 325 391 433 395 324 294 311 330 341 359 366 323 249 214 237 262 248 239 281 339 348 306
-659 306 274 279 295 294 286 294 317 345 373 397 405 398 389 393 406 412 405 395 396 405 401 373 346 354 392 422 430 442 467 457 380 285 246 256 241 179 149 215 329 395 388 356
-665 356 337 316 280 249 238 237 238 252 285 324 359 400 443 463 447 423 412 403 374 334 307 284 241 185 153 165 211 269 316 322 280 232 232 275 303 287 263
-669 263 268 288 295 300 320 332 303 254 238 272 313 321 295 258 234 246 306 386 424 386 302 231 204 216 249 286 305 295 267 249 260 296 335 356 355 338 321
-674 321 309 303 300 299 296 294 299 308 307 291 289 333 408 455 432 358 285 248 249 270 294 309 319 338 363 371 350 325 330 362 385 376 347 329 339 363 366 316 220 121 69 78
-679 78 138 223 306 353 349 316 292 292 298 301 307 314 307 282 269 285 307 300 271 258 273 287 272 245 241 262 289 313 336 349 336 301 273 270 283 295 304 307 295 270 258
-684 258 276 301 300 280 269 275 277 265 254 245 224 190 179 217 283 331 351 363 374 365 321 262 229 248 299 334 325 287 259 250 241 222 213 231 261 278 282 294 322 356
-689 356 385 407 413 396 361 320 275 229 197 196 220 246 264 287 327 378 420 438 427 394 353 314 280 253 241 248 258 258 253 263 294 331 359 371 365 343 313 282
-693 282 242 196 168 183 230 269 286 306 353 408 430 400 338 279 241 218 200 197 228 287 327 316 280 272 298 310 289 274 297 331 332 303 280 280 288 299 311
-698 311 308 263 192 151 170 218 237 218 204 227 273 300 295 288 303 323 309 260 228 256 318 347 317 267 252 275 300 305 299 295 292 292 310 353 394 388 327 254 215
-703 215 220 244 264 275 282 290 302 305 281 236 204 203 214 218 231 277 333 348 320 298 319 362 396 415 420 403 368 331 301 264 227 224 264 306 317 314 331 359 367 351
-707 351 338 342 354 366 370 361 346 347 357 337 278 241 277 343 363 328 295 283 268 252 275 340 391 397 383 370 344 297 267 272 277 252 220 206 201 190 194 221 238
-712 238 222 216 254 299 290 246 240 285 316 290 239 221 250 304 352 369 350 320 307 295 252 184 138 141 176 221 276 329 341 306 268 267 290 304 312 336 360 345
-717 345 282 222 215 251 273 243 183 151 173 218 246 260 292 338 350 309 259 256 293 320 307 273 248 244 254 260 242 207 190 213 245 242 208 189 198 209 217 256
-721 256 333 384 345 248 184 195 237 251 231 206 197 210 245 287 309 295 269 268 296 330 351 357 348 320 286 273 299 353 401 414 384 338 314 327 346 328 278
-726 278 249 275 327 352 339 309 275 234 198 193 221 251 255 237 225 234 264 302 329 331 313 303 325 363 380 357 315 292 309 352 390 391 350 294 257 254 267 277
-731 277 281 280 262 219 169 147 167 205 236 259 292 329 332 282 209 169 180 205 202 178 164 168 166 153 158 195 231 237 242 281 322 296 217 181 237 312 319 279 268 292
-736 292 304 299 324 378 400 373 359 388 408 378 342 352 369 331 268 264 322 360 326 263 223 209 204 201 190 159 133 159 232 285 273 231 209 202 184 170 194
-740 194 249 297 324 349 372 374 350 326 314 303 284 265 256 256 262 275 290 291 271 244 235 256 293 312 289 241 211 230 284 338 366 362 335 311 309 323 319 285 252
-745 252 248 256 241 204 183 200 233 254 256 252 254 273 300 316 301 269 249 248 246 227 199 182 185 207 235 248 233 203 192 217 265 305 317 304 292 305 331 326 267
-750 267 198 175 193 200 186 196 253 306 304 270 268 306 324 282 218 199 237 281 281 244 213 214 227 226 216 229 270 313 337 343 337 319 295 283 288 294 294 294 290 261 205
-755 205 165 165 178 163 137 141 161 142 78 41 83 166 218 227 235 262 284 282 273 278 290 291 281 285 314 349 360 338 308 292 282 261 245 268 330 377 363 306 258
-759 258 243 239 221 202 217 276 347 378 344 271 221 228 271 306 320 324 327 318 300 288 295 313 331 333 304 241 174 142 152 165 151 118 97 106 144 201 245 241 191
-764 191 156 190 271 324 303 241 203 222 278 328 340 323 314 334 361 359 324 285 258 243 241 262 294 302 268 214 176 173 206 269 329 347 316 277 269 277 270 252 262
-769 262 321 401 450 430 348 255 214 246 306 347 364 383 408 419 419 427 445 445 412 361 321 306 310 316 304 268 229 207 195 180 181 227 291 314 283 256 282 326
-774 326 326 285 259 279 317 336 337 340 346 340 313 278 252 239 226 205 190 202 231 248 242 237 251 265 255 236 242 274 306 320 321 313 291 261 248 267 300 321 328 339
-778 339 367 392 388 355 330 343 376 391 381 374 375 355 310 280 294 314 287 224 183 181 175 139 105 104 130 166 214 269 298 285 263 268 288 290 279 293 334 353 324
-783 324 280 269 294 310 295 279 304 360 390 351 269 201 172 159 141 136 161 205 237 249 253 251 242 239 252 264 247 207 189 214 257 281 295 317 333 301 224
-788 224 166 173 216 226 192 175 212 265 274 241 224 251 291 308 307 309 315 311 306 315 331 331 312 288 256 203 147 129 164 218 252 270 296 328 340 322 301 295 296 289 281
-793 281 297 342 390 405 377 328 286 257 226 190 166 175 213 250 266 274 296 324 323 278 221 198 211 216 188 160 175 218 236 218 216 273 352 383 356 328 336 349
-797 349 324 274 244 244 248 246 259 301 354 389 391 361 310 270 272 314 350 338 288 242 220 215 224 261 320 366 366 332 306 317 343 348 323 295 282 268 233 196 202 257
-802 257 313 332 321 301 264 203 158 173 234 268 237 177 152 181 245 316 366 370 328 269 228 223 253 300 326 298 227 167 157 176 187 182 182 194 203 201 199 206 211
-807 211 202 179 168 193 253 313 329 296 247 216 214 235 273 306 306 275 245 242 250 254 266 307 356 370 342 299 270 265 287 326 342 298 207 136 138 202 269 291 265
-812 265 232 239 288 336 345 325 313 312 296 261 237 227 207 168 145 164 202 226 234 247 259 262 265 280 287 264 235 242 277 289 254 202 169 157 149 149 167 194 211 224
-817 224 246 274 292 303 327 361 365 315 245 206 210 229 242 246 234 198 163 178 250 316 314 264 242 282 344 371 355 333 342 379 407 392 342 298 284 288 293 303
-821 303 313 293 227 154 128 159 214 275 341 392 405 394 393 389 340 252 193 190 197 179 168 200 248 276 295 332 361 336 271 227 224 234 229 217 211 212 218 226 221 208
-826 208 226 302 393 428 392 343 328 340 347 338 319 300 296 318 346 344 298 234 186 175 203 244 257 213 139 89 89 116 138 146 148 169 229 310 349 305 222 179
-831 179 196 229 252 278 302 287 236 209 245 301 319 304 296 305 318 333 353 346 286 204 166 191 240 272 283 289 298 312 324 329 321 294 240 158 83 66 113 177
-836 177 214 229 241 239 211 179 174 193 210 226 243 232 176 127 154 238 278 223 141 124 169 197 168 119 111 160 236 300 326 316 280 237 215 239 292 319
-840 319 291 249 248 280 289 269 271 313 336 297 237 222 244 237 184 142 164 234 294 309 293 277 280 295 302 292 280 277 267 234 198 198 238 279 302 323 352 352 293
-845 293 223 216 272 309 274 218 222 286 335 332 317 334 367 377 357 326 283 223 168 156 188 220 216 188 172 195 251 306 322 296 264 254 247 210 156 135 159
-849 159 179 159 122 116 143 174 189 199 205 205 200 201 213 235 268 301 316 309 309 335 364 359 325 307 321 335 316 280 258 253 245 230 226 242 269 295 318 341 360 370
-854 370 375 375 367 348 322 296 268 231 195 186 219 277 324 333 308 268 240 249 298 353 374 357 332 320 308 287 269 271 287 306 330 351 333 256 167 137 170 204
-859 204 202 193 209 230 221 196 194 210 211 195 208 267 334 364 353 327 300 280 279 295 301 278 256 274 308 296 228 177 203 272 312 308 302 312 303 261 229 246 287 308
-864 308 308 313 320 305 278 270 287 294 279 267 268 252 207 181 218 292 334 326 306 291 262 219 209 254 313 332 316 302 294 269 238 238 276 315 337 362 394 407 392
-868 392 391 427 463 450 408 388 387 359 305 283 316 349 332 283 252 244 236 223 232 264 295 309 308 296 265 217 167 135 136 187 283 383 428 389 298 215 180 181
-873 181 182 173 179 220 274 296 282 269 282 308 333 360 378 360 305 262 254 245 211 203 275 380 412 352 288 281 301 298 287 300 326 343 365 401 420 390 340 321
-878 321 331 329 302 275 271 293 341 398 413 357 276 254 307 367 368 316 254 212 200 213 231 234 233 251 279 281 257 255 299 345 347 323 322 340 326 263 204 207 270 334
-883 334 351 325 296 293 313 333 341 334 316 301 310 347 372 342 278 254 302 367 381 348 323 326 332 326 324 321 285 207 136 127 177 236 266 268 261 261 266 265 248 225 214 220 224
-888 224 219 221 237 248 232 206 202 229 265 292 306 305 291 273 265 261 254 248 255 271 281 287 309 346 362 344 318 320 345 365 367 358 331 276 211 168 158 163 170 188 216 239
-893 239 250 255 255 238 209 197 218 250 259 249 246 263 292 323 348 352 330 303 296 306 307 289 271 266 268 273 286 308 327 332 326 311 284 255 248 272 308 328 328 326 322 304 265
-898 265 219 185 168 169 191 242 311 369 392 383 373 383 403 407 383 345 312 285 263 250 254 275 300 311 302 284 273 268 264 269 295 333 346 320 280 250 220 172 133
-903 133 152 212 243 209 156 141 164 192 212 226 221 197 185 212 250 255 232 225 237 235 215 208 220 217 190 191 260 357 409 393 340 286 240 211 217 265 331 376 371
-908 371 315 239 188 185 227 291 349 372 345 289 247 241 252 256 256 275 316 367 415 446 444 409 368 349 345 327 287 246 226 228 247 278 312 337 341 322 288 261 261
-913 261 275 263 211 164 181 257 328 342 309 269 245 237 243 258 274 282 276 257 243 256 294 315 285 230 210 231 240 212 193 226 276 279 236 212 245 307 348 356
-917 356 351 348 354 367 378 372 345 316 308 321 330 310 266 227 222 245 265 263 251 255 275 293 293 279 255 226 193 161 132 115 121 150 172 164 139 137 170 206 219 226 252 283
-922 283 282 239 189 171 183 200 207 214 232 252 254 230 196 169 157 158 173 205 248 280 286 270 246 228 222 235 271 317 349 361 371 402 442 455 425 377 342 325
-927 325 311 305 324 359 378 363 330 290 238 182 163 203 262 285 267 257 278 304 310 305 309 315 300 255 197 152 149 186 227 229 199 182 191 194 174 165 199 247 264 252
-932 252 247 253 248 230 224 231 230 224 245 293 320 298 266 267 289 292 273 258 259 259 247 226 197 157 127 135 185 242 277 295 310 316 300 263 223 203 219 273 338 376 381 384
-937 384 410 439 429 380 333 312 300 283 281 308 322 273 175 112 131 197 247 263 265 258 223 167 119 96 87 88 112 152 172 148 109 97 118 144 169 207 254
-942 254 273 256 241 262 299 307 285 272 281 279 242 201 203 240 267 265 263 285 314 321 317 327 342 325 263 194 165 182 215 237 241 239 243 257 270 267 242 212 206 236 277
-947 277 291 258 199 163 174 210 222 193 154 140 146 146 138 143 161 162 130 93 91 132 195 263 319 341 312 249 201 201 237 274 291 289 277 260 235 195 148 122 133
-951 133 163 182 194 219 252 258 227 190 175 182 209 265 329 350 316 287 311 349 345 324 353 417 430 376 339 373 413 386 314 267 250 228 210 237 293 316
-956 316 290 273 306 353 362 338 323 326 318 277 230 218 238 238 190 131 122 162 197 209 244 312 352 325 287 297 314 268 193 183 232 238 168 108 118 132 90 45
-960 45 78 157 187 153 128 157 201 216 202 180 159 152 172 217 259 278 281 285 299 319 327 309 275 253 260 271 260 221 175 143 149 202 271 306 297 289 305 310 276 246
-965 246 279 356 397 363 293 249 262 328 407 450 454 459 477 457 373 289 279 315 318 286 282 306 293 238 217 267 313 296 257 257 267 227 160 145 213 313 373
-970 373 360 291 211 170 175 195 208 224 252 276 290 309 327 308 249 207 222 260 271 261 264 281 294 309 337 350 328 298 303 330 333 307 286 276 253 218 202
-974 202 210 211 190 172 190 240 300 344 356 347 347 366 381 367 337 313 293 269 261 281 293 258 201 179 207 246 279 321 365 382 364 342 325 296 255 234 247
-979 247 269 274 261 240 223 233 276 314 300 253 236 267 308 327 338 350 352 350 360 360 305 221 189 228 264 247 226 255 302 318 318 343 366 333 262 227 262
-983 262 330 384 396 361 305 286 331 395 413 384 356 345 333 318 318 332 344 360 393 426 424 382 320 256 206 200 241 283 281 254 254 281 296 287 278 271 250 231 254
-988 254 312 354 361 359 352 323 290 310 385 433 398 328 298 314 332 336 339 341 329 316 321 342 360 366 364 350 325 301 284 263 236 232 269 322 351 346 326 301 268 236
-993 236 216 210 215 234 271 309 318 286 218 137 83 92 157 223 256 274 306 337 335 308 286 277 267 266 299 354 378 345 288 254 250 261 279 303 324 327 315 302 302 307
-998 307 301 277 243 216 201 189 176 171 193 238 273 263 208 152 141 185 250 303 332 339 315 265 217 203 210 204 180 160 163 184 226 289 338 329 274 235 244 268 277
-1003 277 286 307 315 289 259 254 253 239 241 282 313 274 204 190 250 315 339 346 359 360 344 333 334 329 317 318 312 254 157 110 155 228 249 237 255 304 338 334 313 283
-1008 283 240 201 189 194 195 202 237 283 302 298 306 332 342 324 307 303 285 241 205 215 258 288 278 248 234 248 270 270 253 258 299 329 305 254 243 282 316 318 318
-1012 318 342 353 319 275 282 332 360 336 292 266 252 230 200 176 156 134 120 136 189 251 282 263 222 208 237 273 271 237 210 215 233 236 224 214 213 222 251
-1017 251 291 309 279 231 227 282 345 359 328 295 279 262 229 188 148 117 115 160 235 293 308 295 274 237 192 181 227 286 295 255 229 240 251 234 227 269
-1021 269 338 374 362 335 319 312 309 318 329 321 291 260 240 217 190 184 223 283 323 328 320 309 290 260 228 211 210 227 260 292 297 269 242 258 310 347 333 290 263
-1026 263 269 289 303 303 285 245 203 192 219 251 255 245 255 289 307 284 242 219 222 222 205 190 204 233 231 182 137 156 226 276 267 236 237 260 266 248 238 249 262
-1031 262 267 278 289 280 253 237 235 208 153 134 194 278 297 251 222 256 301 287 218 156 140 153 161 154 156 189 240 271 263 244 241 241 220 194 213 287 363 388 367
-1036 367 335 309 283 252 221 191 165 155 172 216 276 332 358 347 315 285 255 212 177 188 238 278 278 264 258 245 220 222 270 314 302 257 245 274 295 287
-1040 287 272 265 255 250 277 329 361 359 350 349 330 290 268 286 318 331 333 329 307 271 261 290 303 254 178 150 178 213 220 217 225 242 259 269 264 251 253 281 302 291
-1045 291 272 282 299 273 208 169 185 216 219 204 197 193 179 167 170 175 168 166 193 246 296 326 328 300 260 244 263 279 259 236 265 329 353 304 238 225 265 301
-1050 301 301 288 292 315 335 341 331 313 298 289 282 265 238 215 207 215 234 258 275 271 248 230 229 225 203 192 231 301 332 288 215 184 197 218 231 261 309 339 324
-1054 324 273 219 187 189 214 231 214 188 207 281 356 370 317 243 207 232 289 318 284 221 193 215 242 243 243 275 314 320 293 271 274 283 284 279 276 268 244 211 194
-1059 194 218 276 325 319 266 219 215 249 298 352 386 361 280 209 211 267 309 316 320 341 356 346 321 294 261 226 215 235 257 254 239 239 252 248 211 167 161 211 286
-1064 286 330 317 273 239 228 221 209 197 190 187 192 211 243 280 317 331 287 191 110 112 176 219 205 178 182 188 152 88 52 75 140 222 302 363 398 413 414 395
-1068 395 357 316 287 261 231 213 226 257 277 273 258 249 249 255 256 234 186 137 118 129 152 175 201 226 242 250 259 271 281 290 301 314 331 355 379 381 355 332 340
-1073 340 356 336 277 230 228 257 293 326 349 345 319 307 332 366 367 330 284 249 222 206 213 247 293 333 358 368 364 347 320 286 250 226 230 249 244 189 110 64
-1078 64 85 144 187 193 184 186 195 200 201 196 172 130 105 133 197 251 281 306 331 333 301 264 245 240 236 240 248 247 240 253 290 309 279 241 252 309 353 349 323 307 305 309 304 273
-1083 273 205 136 124 181 247 260 220 176 160 159 153 136 124 136 177 228 261 259 234 218 236 289 343 351 301 234 199 202 216 232 257 280 274 245 232 244 238 187
-1088 187 128 103 105 108 128 192 271 312 317 337 378 379 312 226 190 208 239 259 269 270 262 253 247 228 189 147 121 113 119 147 191 219 213 191 178 165 142 133 161 196
-1093 196 181 117 67 67 94 117 135 158 178 191 212 247 278 292 300 310 308 292 277 266 242 210 211 263 324 350 356 376 395 376 329 305 311 306 271 246 259 287
-1097 287 299 300 307 310 287 240 197 174 172 178 174 155 138 146 171 178 158 150 178 219 241 257 293 330 319 258 206 214 262 293 278 238 218 237 262 241 165 89 74
-1102 74 120 173 202 226 265 299 294 246 190 154 152 183 233 268 256 207 165 167 202 230 226 203 183 169 147 124 136 200 284 328 304 244 205 213 257 300 321
-1107 321 323 333 363 391 379 318 244 207 219 257 283 271 221 152 101 99 146 202 212 154 65 12 32 100 169 211 228 221 199 184 196 217 217 205 226 287
-1111 287 326 295 228 194 206 215 197 187 215 264 301 323 342 352 334 290 239 196 174 182 211 228 216 194 197 220 234 229 224 229 223 193 153 127 118 122 144 191 246
-1116 246 277 267 222 165 131 145 198 236 215 160 137 172 220 234 222 221 233 232 222 235 278 311 297 248 201 173 164 180 230 298 347 357 332 289 239 190
-1120 190 160 157 169 170 148 111 78 55 36 23 34 88 170 236 254 235 217 231 278 337 379 386 372 364 371 373 350 315 304 333 389 445 471 449 396 354 342
-1125 342 338 312 279 275 297 311 306 314 351 389 398 384 366 345 324 326 363 399 385 325 268 252 270 301 331 360 384 399 395 361 308 270 273 303 333 354 366 358 327
-1130 327 297 283 260 205 152 155 201 225 205 184 194 208 198 192 220 263 276 259 239 222 192 154 134 145 175 211 248 274 280 268 243 210 187 201 250 291
-1134 291 294 280 275 260 207 151 157 225 283 276 212 131 68 53 99 170 210 211 213 232 232 198 167 170 185 188 201 245 286 274 215 161 145 162 197 227 221 171 128
-1139 128 143 194 205 155 108 124 177 203 188 182 226 297 337 321 285 267 251 198 122 96 152 230 259 253 271 308 311 274 254 269 275 253 257 322 397 410 372
-1143 372 337 318 287 248 228 216 171 102 74 117 191 250 293 325 329 299 274 290 329 341 312 270 238 210 175 138 109 106 149 242 350 414 408 356 301
-1148 301 268 257 256 250 232 210 202 211 223 220 208 201 210 236 276 320 354 374 385 386 371 341 310 291 283 279 278 280 283 293 317 346 345 292 212 160 162 189 201 197 204 234 261
-1153 261 251 201 152 151 199 250 266 258 255 257 239 202 172 172 193 226 270 310 319 290 252 226 205 178 164 174 184 168 146 156 196 214 181 120 79 81 114 146
-1157 146 158 160 182 226 259 267 278 325 382 398 362 320 306 318 336 340 309 249 211 242 317 364 364 363 385 396 372 340 326 304 259 237 276 335 340 280 209
-1162 209 161 135 133 159 191 198 179 166 176 198 224 240 225 180 152 179 225 232 209 204 224 223 197 187 206 210 187 180 213 245 243 234 252 283 301 310 319 316 302 314
-1167 314 358 375 317 233 196 195 169 113 92 128 177 199 204 208 208 208 225 246 231 175 131 141 179 201 212 247 310 350 329 264 214 210 220 195 140 117 164
-1171 164 237 272 266 265 276 262 211 169 171 200 223 235 243 244 236 230 228 221 213 223 244 242 220 230 289 336 312 250 223 233 223 177 140 137 138 120 120 168 237 268 250
-1176 250 227 233 263 280 260 208 158 147 188 265 349 404 404 352 290 264 284 315 326 320 313 312 311 302 277 242 221 242 296 343 349 314 251 179 134 148 211 263
-1181 263 270 259 275 306 306 264 223 209 204 190 181 200 234 257 264 266 264 255 250 264 284 281 254 231 232 239 225 204 217 282 362 408 401 360 322 309 316 318 289 232 180 159
-1186 159 159 161 160 167 179 186 195 223 265 288 274 242 212 186 164 166 201 247 270 264 242 207 158 122 128 180 248 303 327 302 234 169 159 200 240 244 229 219 207
-1191 207 185 173 189 219 237 240 232 218 216 255 325 369 349 297 263 248 229 217 243 284 282 235 206 232 266 261 233 232 264 290 291 288 306 340 363 347 299 258
-1196 258 255 271 263 223 198 215 246 245 219 206 226 262 292 298 265 205 162 175 227 274 299 316 332 324 285 240 214 205 207 223 248 264 257 234 207 181 162 164 193
-1200 193 231 250 243 227 230 254 275 265 226 190 177 174 163 152 156 167 173 184 215 250 261 247 244 267 292 292 273 251 232 216 217 233 249 250 246 242 228 200 178 180
-1205 180 196 202 186 161 144 150 182 221 231 202 163 142 141 144 151 166 185 197 206 220 235 241 238 227 212 209 240 300 340 329 297 293 331 381 410 398 339 260 219
-1210 219 241 283 287 263 263 285 275 214 154 147 186 235 272 286 273 253 261 294 307 286 272 299 330 318 277 258 266 256 211 172 181 223 254 256 251 260 276 272 239
-1215 239 201 188 196 197 187 196 235 277 294 286 264 220 154 102 105 156 205 216 201 188 186 191 196 204 225 260 284 270 226 196 207 238 253 246 231 211 179 142 109
-1220 109 87 95 161 265 334 319 262 233 239 239 237 272 331 346 304 267 274 284 268 265 303 330 294 238 239 285 290 226 164 158 185 197 191 185 180 174 187 233 281 298
-1224 298 298 314 335 318 258 209 218 264 293 289 280 283 278 255 241 259 282 266 219 195 223 271 288 274 254 242 231 227 238 252 242 207 177 177 199 222 231 231 236 261
-1229 261 306 350 378 394 412 426 416 380 335 296 258 215 177 162 179 219 264 294 312 330 346 333 277 206 171 190 234 272 289 290 277 261 259 271 283
-1234 283 284 285 291 295 294 306 326 312 231 128 86 133 200 210 173 156 188 226 225 204 208 236 249 242 244 261 251 198 160 187 239 234 171 124 135 160 151 132 137 149
-1239 149 138 123 145 187 194 163 154 200 252 247 201 183 220 262 251 200 164 168 175 143 90 75 127 211 263 253 196 138 124 166 229 265 268 270 287 287 248 202
-1243 202 193 217 230 219 215 245 292 322 318 278 222 178 166 180 200 204 188 156 134 153 205 235 209 172 193 264 309 286 235 200 177 148 129 137 156 167 185
-1248 185 230 282 299 279 256 250 246 223 182 132 80 39 24 39 73 104 108 79 48 65 144 233 271 252 222 216 234 260 281 284 265 242 241 259 270 256 227
-1252 227 206 197 190 173 148 140 175 241 291 296 285 294 306 276 210 169 189 241 279 292 287 268 237 204 182 177 194 222 227 184 123 107 147 190 198 191 194 189 158 131
-1257 131 148 187 195 163 140 156 186 190 163 131 117 120 121 107 91 99 132 161 168 176 203 234 245 254 292 349 388 400 406 403 365 288 216 199 238 297 336 333 300 273
-1262 273 273 281 260 211 171 163 178 197 213 212 187 159 167 215 258 259 225 192 182 199 225 226 189 144 138 174 210 225 237 255 263 260 280 327 358 342 313 303 288
-1267 288 229 156 132 172 226 250 243 230 238 278 323 317 250 185 178 200 189 163 192 277 342 344 318 304 284 239 196 176 170 168 185 218 227 205 204 251 292 277 242
-1272 242 250 285 282 234 202 211 223 212 208 238 270 253 190 141 163 249 332 348 295 236 216 222 223 230 266 297 269 198 164 197 241 241 217 214 230 230 208 183 173
-1276 173 185 215 239 227 182 157 189 244 268 265 278 319 344 325 282 252 241 234 221 198 167 139 136 164 210 250 261 237 206 211 267 331 352 334 312 296
-1281 296 260 201 153 134 128 118 116 130 146 157 185 236 269 244 190 165 177 183 168 160 179 203 212 219 232 227 185 141 145 191 231 237 230 233 238 237 239 248 238 196 154 162
-1286 162 217 260 253 218 199 210 233 248 246 214 155 107 114 167 218 244 266 300 319 303 273 254 226 168 121 143 219 269 253 218 208 200 160 112 104 138 172
-1290 172 183 182 172 151 138 157 191 200 188 196 227 229 179 136 158 223 267 273 279 303 318 302 267 230 192 157 144 159 188 211 228 245 261 272 275 259 221 188
-1295 188 201 257 303 292 238 192 182 195 210 216 218 227 253 290 309 290 245 204 188 196 218 247 263 247 204 171 181 238 312 368 381 350 294 238 203 191
-1299 191 191 188 176 165 167 176 170 145 124 125 137 141 152 197 263 301 281 233 206 213 229 222 180 109 42 22 65 147 221 259 263 251 244 244 236 204 160 139 153 186 221
-1304 221 255 273 246 184 153 200 281 322 313 306 322 326 297 269 270 282 279 271 278 285 268 240 242 277 310 311 294 289 303 319 314 286 253 227 203 173 159 186 238 265
-1309 265 246 212 200 197 171 130 109 124 155 185 215 238 236 213 197 208 239 268 283 281 267 247 226 205 191 196 218 225 192 145 133 157 169 138 98 101 158
-1314 158 230 277 275 227 165 135 153 188 201 191 188 203 215 210 205 214 234 252 259 256 247 242 249 270 295 310 304 268 217 189 213 267 297 277 239 228 234 210 144 81
-1319 81 71 107 144 164 191 235 270 270 249 241 250 244 209 170 163 192 232 255 246 213 181 168 175 186 194 204 219 237 262 294 318 311 283 265 271 280 275 267 265 257 231 206
-1324 206 194 183 166 178 243 315 315 231 141 116 138 138 91 30 1 13 45 82 130 196 247 235 159 91 99 164 209 202 183 191 210 218 233 283 352 399 407 386
-1329 386 345 284 224 194 199 215 223 221 220 229 250 269 264 238 228 258 292 278 220 174 168 170 150 129 147 197 232 227 202 189 195 210 228 255 297 338 341 289 217 183
-1333 183 206 243 245 216 195 204 225 242 257 266 244 179 107 83 113 154 169 170 192 237 272 267 232 200 193 214 247 274 277 258 237 233 246 260 265 253 224 182 152
-1338 152 158 193 221 224 212 201 182 150 125 132 164 190 196 198 204 204 197 201 232 272 298 309 316 316 299 271 253 255 277 312 346 354 327 297 300 326 330 307 296 318 333 302
-1343 302 248 214 206 197 180 168 155 126 96 107 160 213 237 248 268 285 286 293 326 366 379 360 328 293 256 231 232 249 262 267 273 276 269 262 274 292 278 230 191
-1348 191 196 217 209 168 137 142 166 184 202 241 288 300 263 216 211 243 267 257 236 232 239 233 216 201 184 151 109 87 107 153 190 192 166 147 160 192 204 180
-1353 180 154 159 183 195 195 211 245 263 241 196 158 141 141 155 183 220 247 240 185 114 85 116 153 141 110 131 204 255 238 201 207 241 244 205 165 154 166
-1357 166 173 157 118 90 111 171 208 182 135 136 190 239 248 232 215 196 177 165 160 147 135 150 198 241 245 215 182 172 191 230 263 269 254 244 257 282 304
-1362 304 313 300 257 205 184 199 210 184 147 142 171 203 221 235 245 230 180 114 70 64 90 131 172 209 240 258 254 228 202 198 220 247 262 261 258 257 250 217 167
-1367 167 134 143 176 190 166 136 132 152 164 148 113 82 78 106 152 188 207 230 272 315 332 318 294 268 227 167 108 73 70 93 130 165 182 182 184 193 187 148
-1371 148 103 109 174 243 259 230 204 198 183 151 142 193 265 288 255 228 253 297 305 275 242 219 191 164 167 202 231 225 209 221 256 265 222 166 159 218 293 321
-1376 321 295 266 277 311 318 292 271 274 262 201 127 103 135 160 142 119 142 200 246 265 286 318 334 311 264 229 222 237 250 240 208 191 221 276 293 261
-1380 261 236 263 311 320 290 267 257 227 172 134 135 142 116 76 64 86 115 133 150 177 203 207 178 128 96 108 145 160 133 103 117 173 223 232 210 181 162
-1385 162 157 168 190 214 230 241 252 264 273 277 284 303 324 320 275 209 157 131 118 114 123 135 135 139 177 234 253 220 194 231 297 324 309 300 315 324 310 291 279 260
-1390 260 236 234 258 270 246 224 247 308 359 374 367 360 364 377 400 423 429 398 336 281 280 322 339 283 208 203 269 311 271 204 189 222 233 199 159 150 165 186
-1394 186 212 237 241 218 196 204 245 297 335 341 312 263 220 199 195 194 191 186 179 174 181 213 269 318 326 283 223 197 219 265 296 292 263 228 209 205 205 202 209 239 277 300
-1399 300 309 319 324 301 257 232 238 244 225 202 200 199 179 154 151 157 152 150 178 222 239 221 202 201 203 195 189 193 207 230 263 282 261 214 200 243 301 318 286 246 239 272
-1405 272 315 322 271 190 124 96 102 130 169 198 200 186 178 168 145 130 158 213 246 255 278 315 312 250 190 189 221 242 253 274 293 289 278 274 250 199 175 219 280
-1409 280 282 242 239 290 329 316 280 249 212 174 168 198 222 212 188 172 158 152 169 194 189 161 169 225 256 215 154 149 195 235 255 278 296 277 228 188 170 160
-1414 160 162 187 205 173 117 108 159 200 186 157 167 202 223 228 244 269 279 276 281 290 273 226 190 199 242 282 300 298 277 238 198 185 207 235 242 233 232 243 253 253
-1419 253 247 233 208 187 197 230 243 221 203 223 260 263 220 161 105 53 20 31 82 130 146 132 110 98 113 150 170 140 85 68 102 140 148 146 152 143 108
-1423 108 90 129 195 239 267 315 368 366 291 199 150 150 167 179 182 187 206 239 264 263 256 265 268 229 177 180 245 285 239 155 116 127 135 134 161 216 248 227 189 167
-1428 167 149 114 84 86 110 134 170 235 292 281 210 154 154 169 154 132 155 215 256 255 248 253 237 181 128 134 192 243 250 226 202 188 180 174 167 163 177 207 228 217
-1433 217 191 182 184 163 120 105 141 184 184 161 168 208 222 181 128 120 150 172 157 120 92 85 98 122 149 168 170 165 166 184 214 243 259 252 224 189 163 156 168 198
-1438 198 241 276 282 270 286 350 410 400 316 233 208 225 234 214 186 168 162 160 163 175 193 206 200 178 179 237 335 409 411 363 314 288 278 278 280 261 212 161 142
-1443 142 144 130 100 95 126 154 145 121 124 161 209 249 271 260 213 161 144 168 198 206 196 184 172 153 134 133 158 194 220 225 215 202 195 206 239 283 314 316 290
-1448 290 250 208 182 183 199 209 211 227 268 311 327 312 280 244 221 235 284 325 319 281 255 250 241 227 232 254 264 254 252 269 276 259 244 255 274 282 288 301 303 283
-1453 283 258 249 242 224 210 212 216 202 189 199 218 215 189 156 124 106 126 182 220 207 181 194 228 224 183 155 157 156 149 163 191 187 144 118 140 174 179 171 173 178 182 202
-1458 202 237 253 237 227 236 219 153 95 99 127 116 83 93 144 168 144 128 164 228 283 319 333 312 259 204 174 162 153 150 151 146 144 173 237 301 327 309 263
-1462 263 204 154 137 154 180 190 187 191 207 225 236 233 218 216 254 325 385 401 384 356 317 255 185 139 128 135 138 131 126 142 179 205 187 135 94 94 117 143 180
-1467 180 234 270 247 183 137 141 168 187 198 215 231 223 195 165 143 122 93 65 51 58 87 130 175 207 218 209 192 176 167 160 152 140 124 106 103 129 174 209
-1472 209 215 206 202 206 209 222 249 262 232 180 159 176 183 155 136 160 193 189 171 190 232 229 167 111 98 103 102 132 216 297 316 297 309 350 358 314 258 215 161 95
-1477 95 64 100 171 228 267 307 342 353 340 316 279 230 189 176 180 181 180 193 217 236 244 240 215 171 141 151 189 217 226 239 269 302 312 290 241 193 185 226
-1481 226 277 283 240 191 170 178 212 265 307 298 241 186 169 178 188 202 229 255 257 237 217 213 215 206 177 137 110 118 160 218 274 308 294 238 193 206 253 259 207
-1486 207 154 146 158 156 156 188 239 273 284 285 269 225 177 159 169 186 205 238 264 261 249 274 325 341 293 224 181 167 171 195 235 260 255 244 247 249 226 193 184
-1491 184 192 187 168 168 203 247 272 277 272 256 230 216 230 256 259 238 232 258 282 263 216 192 204 211 181 143 141 176 213 228 225 209 186 172 178 192 198 201 220 252 267
-1496 267 248 205 162 143 166 220 266 271 250 243 250 238 204 186 202 230 250 273 305 321 304 280 282 300 305 296 295 302 304 297 284 256 201 140 113 123 133 126 123 150
-1501 150 190 209 201 186 181 184 190 199 203 190 160 139 146 172 191 197 208 230 242 227 205 201 203 181 147 151 212 277 289 249 205 180 161 131 97 78 82 106 144 187
-1506 187 222 236 224 209 225 281 339 355 337 329 339 327 273 221 212 230 223 184 149 148 181 224 241 209 147 117 150 202 222 223 244 276 279 263 279 326 341
-1510 341 294 236 217 231 258 309 376 406 364 291 252 254 264 262 252 234 211 208 239 270 265 241 239 255 256 242 244 263 268 255 253 268 270 244 214 191 148 78 25
-1515 25 34 84 124 139 155 182 200 198 188 195 229 276 310 308 271 225 191 175 183 228 292 323 294 242 222 225 205 159 140 177 227 242 233 241 268 284 281 282 294 294
-1520 294 265 226 203 200 207 216 219 209 189 182 203 236 254 246 222 198 184 187 208 234 250 261 275 292 304 312 325 339 337 317 296 291 295 293 292 304 321 307 241 155 110
-1525 110 136 202 255 276 281 283 280 275 286 317 342 338 315 293 276 259 253 271 303 322 323 310 281 236 199 201 228 237 219 211 219 206 163 143 188 261 289 265 244 258
-1530 258 284 292 286 281 281 288 298 298 277 250 247 264 269 250 234 249 282 300 286 246 207 202 243 300 332 339 358 400 429 417 390 382 387 373 342 320 313 299 280 289 338
-1535 338 387 386 328 256 221 239 291 338 353 341 329 331 337 334 339 375 436 477 466 418 377 369 377 376 361 347 346 354 361 353 322 280 256 266 288 297 298 317 344 343 306 279
-1540 279 299 346 371 361 346 349 363 371 366 345 307 273 269 294 325 347 370 394 396 368 341 353 385 389 350 314 322 355 360 328 303 323 360 353 284 204 175 201 239
-1545 239 254 249 238 217 182 157 181 261 353 405 402 361 308 262 236 234 248 264 285 330 397 448 439 380 325 316 342 360 344 303 264 245 245 249 245 238 248 283 323
-1549 323 336 310 267 242 248 270 282 282 287 309 333 337 319 303 300 296 274 244 237 262 294 304 289 273 277 293 308 322 351 396 433 446 450 469 489 471 412 354 334
-1554 334 340 344 341 341 331 296 256 248 276 309 330 356 392 410 389 345 317 321 350 384 401 387 348 317 312 323 334 345 355 339 279 212 205 264 326 332 297 272 277
-1559 277 292 298 298 302 311 328 348 354 331 290 264 276 313 348 362 343 294 238 218 254 319 368 386 385 375 351 316 293 291 299 304 315 340 368 389 407 429 449 449
-1564 449 429 407 399 405 426 463 500 521 518 505 491 481 478 484 491 486 460 416 360 308 281 282 290 287 284 300 323 325 312 324 362 381 358 331 342 372 374 345 318 313 316 325
-1569 325 349 379 387 361 327 312 321 337 339 311 268 252 295 369 420 431 435 454 467 455 439 445 460 456 437 425 422 406 380 370 391 416 416 395 384 397 416 409 373
-1574 373 337 334 355 365 351 343 369 409 427 410 379 356 347 349 357 357 347 340 347 359 367 385 424 459 451 411 390 411 443 451 444 448 467 485 491 480 450 412 395 408 425
-1579 425 424 417 431 454 460 446 435 434 425 407 398 397 383 355 348 384 443 493 521 529 514 489 491 528 560 553 526 521 532 520 479 446 436 424 401 396 430 474 493 487 478 467
-1584 467 443 424 433 462 479 474 460 438 401 367 366 392 403 382 366 382 409 416 416 442 477 477 433 387 381 413 456 488 502 498 488 478 459 422 382 369 388 408
-1588 408 406 393 387 392 402 416 435 454 471 492 515 524 511 487 462 435 412 418 459 495 491 467 472 510 531 503 451 421 415 413 409 416 437 463 487 499 490 462 438 443 465
-1593 465 467 434 397 401 458 530 563 536 484 457 473 502 511 498 485 485 495 503 504 503 510 528 541 531 503 483 480 477 452 420 411 432 463 478 473 457 448 459 487 517 531
-1598 531 527 511 493 488 513 559 592 582 545 512 494 480 468 468 480 487 485 489 500 510 523 551 582 584 548 508 489 477 455 438 449 483 515 535 544 536 506 472 464
-1603 464 484 512 529 535 533 532 540 553 548 517
-1604E17
##END=	
##END=	
