##TITLE=	HuLqnhfBRc6G9w3E6qRlXw.31.ser
TM-VI-137solid cosy

##JCAMP-DX=	6.0	$$ MestReNova 14.3.0-30573
##DATA TYPE=	LINK
##BLOCK_ID=	1
##BLOCKS=	2    
##ORIGIN=	Mestrelab Research S.L.
##OWNER=	hrzepa
##$MNOVA/LINK_BLOCK_TYPE=	ITEM	$$ NMR Spectrum
##$MNOVA/ITEM/POLYGON=	(XY..XY)
5321,5835
8722,5835
8722,8208
5321,8208
5321,5835
##$MNOVA/ITEM/Z=	0
##$MNOVA/ITEM/ANGLE=	0
##TITLE=	HuLqnhfBRc6G9w3E6qRlXw.31.ser
##JCAMP-DX=	6.0	$$ MestReNova 14.3.0-30573
##BLOCK_ID=	2
##DATA TYPE=	MNOVA NMR VIEW DATA
##DATA CLASS=	MNOVA VIEW DATA
##$MNOVA/2D/THRESHOLD=	79.66432952880859375
##$MNOVA/ITEM/ZOOM/X=	-0.98135677571250334861,	11.004809999983093505
##$MNOVA/ITEM/ZOOM/Y=	-0.98135677571250334861,	11.004809999983093505
##END=	
##TITLE=	HuLqnhfBRc6G9w3E6qRlXw.31.ser
##JCAMP-DX=	6.0	$$ MestReNova 14.3.0-30573
##BLOCK_ID=	3
##DATA TYPE=	nD NMR SPECTRUM
##DATA CLASS=	NTUPLES
##NUMDIM=	2
##ORIGIN=	Bruker BioSpin GmbH
##OWNER=	nmr
##.OBSERVE FREQUENCY=	400.32200160000002143
##.OBSERVE NUCLEUS=	^1H
##.SOLVENT NAME=	CDCl3
##.PULSE SEQUENCE=	cosygpqf
##LONGDATE=	2021/10/27 12:52:36.000
##.ACQUISITIONMODE=	SIMULTANEOUS (DQD)
##$ORIGINAL FORMAT=	Bruker XWIN-NMR
##$MNOVA/SCALES_VERSION=	9
##$PARAMETER FILE=	(acqu2s, ASCII, /private/var/folders/f6/rjf_tdyn2v98c5c0wvkgn4s80000gn/T/HuLqnhfBRc6G9w3E6qRlXw/31/acqu2s, 0)
$$ ##TITLE= Parameter file, TOPSPIN		Version 3.2
$$ ##JCAMPDX= 5.0
$$ ##DATATYPE= Parameter Values
$$ ##NPOINTS= 129	$$ modification sequence number
$$ ##ORIGIN= Bruker BioSpin GmbH
$$ ##OWNER= nmr
$$ $$ 2021-10-27 13:02:08.380 +0100  nmr@CZC2524DW0
$$ $$ /opt/topspin/data/agmb/nmr/Oct27-2021/31/acqu2s
$$ $$ process /opt/topspin3.2/prog/mod/go
$$ ##$ACQT0= 0
$$ ##$BF1= 400.32
$$ ##$FnMODE= 1
$$ ##$NUC1= <1H>
$$ ##$NusJSP= 0
$$ ##$NusT2= 1
$$ ##$NusTD= 128
$$ ##$O1= 2001.60000002825
$$ ##$SFO1= 400.3220016
$$ ##$SW= 12.009563022959
$$ ##$SW_h= 4807.69230769231
$$ ##$TD= 128
$$ ##END=
$$ 
##$PARAMETER FILE=	(acqus, ASCII, /private/var/folders/f6/rjf_tdyn2v98c5c0wvkgn4s80000gn/T/HuLqnhfBRc6G9w3E6qRlXw/31/acqus, 0)
$$ ##TITLE= Parameter file, TOPSPIN		Version 3.2
$$ ##JCAMPDX= 5.0
$$ ##DATATYPE= Parameter Values
$$ ##NPOINTS= 12	$$ modification sequence number
$$ ##ORIGIN= Bruker BioSpin GmbH
$$ ##OWNER= nmr
$$ $$ 2021-10-27 13:02:11.521 +0100  nmr@CZC2524DW0
$$ $$ /opt/topspin/data/agmb/nmr/Oct27-2021/31/acqus
$$ $$ process /opt/topspin3.2/prog/mod/shimcntl
$$ ##$ACQT0= 1000000
$$ ##$AMP= (0..31)
$$ 100 100 100 100 100 100 100 100 100 100 100 100 100 100 100 100 100 100
$$ 100 100 100 100 100 100 100 100 100 100 100 100 100 100
$$ ##$AMPCOIL= (0..19)
$$ 0 0 0 0 0 0 0 0 0 0 0 0 0 0 0 0 0 0 0 0
$$ ##$ANAVPT= -1
$$ ##$AQSEQ= 0
$$ ##$AQ_mod= 3
$$ ##$AUNM= <au_zg>
$$ ##$AUTOPOS= <53 >
$$ ##$BF1= 400.32
$$ ##$BF2= 400.32
$$ ##$BF3= 400.32
$$ ##$BF4= 400.32
$$ ##$BF5= 400.32
$$ ##$BF6= 400.32
$$ ##$BF7= 400.32
$$ ##$BF8= 400.32
$$ ##$BYTORDA= 0
$$ ##$CAGPARS= (0..11)
$$ 0 0 0 0 0 0 0 0 0 0 0 0
$$ ##$CFDGTYP= 0
$$ ##$CFRGTYP= 9
$$ ##$CHEMSTR= <none>
$$ ##$CNST= (0..63)
$$ [...]
$$ 0 0 0 0
$$ ##$ShimPowMaxUC= (0..63)
$$ 130000 130000 130000 130000 130000 130000 130000 130000 130000 130000 130000
$$ 130000 130000 130000 130000 130000 130000 130000 130000 130000 0 0 0 0
$$ 0 0 0 0 0 0 0 0 0 0 0 0 0 0 0 0 0 0 0 0 0 0 0 0 0 0 0 0 0 0 0 0 0 0 0 0
$$ 0 0 0 0
$$ ##$ShimPowMaxUG= (0..63)
$$ 524287 524287 524287 524287 524287 524287 524287 524287 524287 524287 524287
$$ 524287 524287 524287 524287 524287 524287 524287 524287 524287 0 0 0 0
$$ 0 0 0 0 0 0 0 0 0 0 0 0 0 0 0 0 0 0 0 0 0 0 0 0 0 0 0 0 0 0 0 0 0 0 0 0
$$ 0 0 0 0
$$ ##$ShimPowRcbType= 3
$$ ##$ShimPowRes= (0..63)
$$ 1e-20 1e-20 1e-20 1e-20 1e-20 1e-20 1e-20 1e-20 1e-20 1e-20 1e-20 1e-20
$$ 1e-20 1e-20 1e-20 1e-20 1e-20 1e-20 1e-20 1e-20 0 0 0 0 0 0 0 0 0 0 0 0
$$ 0 0 0 0 0 0 0 0 0 0 0 0 0 0 0 0 0 0 0 0 0 0 0 0 0 0 0 0 0 0 0 0
$$ ##$ShimPowRng0= (0..63)
$$ 1 1 1 1 1 1 1 1 1 1 1 1 1 1 1 1 1 1 1 1 0 0 0 0 0 0 0 0 0 0 0 0 0 0 0 0
$$ 0 0 0 0 0 0 0 0 0 0 0 0 0 0 0 0 0 0 0 0 0 0 0 0 0 0 0 0
$$ ##$ShimPowRng1= (0..63)
$$ 1 1 1 1 1 1 1 1 1 1 1 1 1 1 1 1 1 1 1 1 0 0 0 0 0 0 0 0 0 0 0 0 0 0 0 0
$$ 0 0 0 0 0 0 0 0 0 0 0 0 0 0 0 0 0 0 0 0 0 0 0 0 0 0 0 0
$$ ##$ShimPowRng2= (0..63)
$$ 1 1 1 1 1 1 1 1 1 1 1 1 1 1 1 1 1 1 1 1 0 0 0 0 0 0 0 0 0 0 0 0 0 0 0 0
$$ 0 0 0 0 0 0 0 0 0 0 0 0 0 0 0 0 0 0 0 0 0 0 0 0 0 0 0 0
$$ ##$ShimPowRng3= (0..63)
$$ 1 1 1 1 1 1 1 1 1 1 1 1 1 1 1 1 1 1 1 1 0 0 0 0 0 0 0 0 0 0 0 0 0 0 0 0
$$ 0 0 0 0 0 0 0 0 0 0 0 0 0 0 0 0 0 0 0 0 0 0 0 0 0 0 0 0
$$ ##$ShimSysFunc= (0..63)
$$ 1 2 3 4 5 7 9 11 15 16 8 10 12 14 6 17 13 18 19 20 0 0 0 0 0 0 0 0 0 0
$$ 0 0 0 0 0 0 0 0 0 0 0 0 0 0 0 0 0 0 0 0 0 0 0 0 0 0 0 0 0 0 0 0 0 0
$$ ##$ShimSysMatrix= 0
$$ ##$ShimSysType= 1
$$ ##$TFXNUM= 0
$$ ##$TRIPLO2= 0
$$ ##$VTU= 2
$$ ##$VTUETH= <149.236.99.20>
$$ ##$VTUTY= <no>
$$ ##$WBREFAM= (0..15)
$$ 132.2 106.2 100 100 100 100 100 100 100 100 100 100 100 100 100 100
$$ ##$WBREFLM= (0..15)
$$ 0 0 0 0 0 0 0 0 0 0 0 0 0 0 0 0
$$ ##$WBREFPH= (0..15)
$$ 77.55 -65.76 0 0 0 0 0 0 0 0 0 0 0 0 0 0
$$ ##$WBSGU= (0..15)
$$ 0 0 0 0 0 0 0 0 0 0 0 0 0 0 0 0
$$ ##$XFAC= 2
$$ ##END=
$$ 
##$DECIM=	4160
##$DSPFVS=	20
##.ACQUISITIONSCHEME=	NOT PHASESENSITIVE
##NTUPLES=	nD NMR SPECTRUM
##VAR_NAME=	FREQUENCY1,	FREQUENCY2,	SPECTRUM
##SYMBOL=	F1,	F2,	Y
##.NUCLEUS=	1H,	1H
##.OBSERVE FREQUENCY=	400.32200160000002143,	400.32200160000002143
##VAR_TYPE=	INDEPENDENT,	INDEPENDENT,	DEPENDENT
##VAR_FORM=	AFFN,	AFFN,	ASDF
##VAR_DIM=	512,	512,	262144
##UNITS=	HZ,	HZ,	ARBITRARY UNITS
##FIRST=	4405.4455391999963467,	4405.4455391999963467,	0.46329933404922485352
##LAST=	-392.85674445383250486,	-392.85674445383250486,	0.056105785071849822998
##MIN=	-392.85674445383250486,	-392.85674445383250486,	0.00092971074627712368965
##MAX=	4405.4455391999963467,	4405.4455391999963467,	8070.61279296875
##FACTOR=	1,	1,	0.0053803942285583017738
##PAGE=	F1=4405.45
##FIRST=	4405.4455391999963467,	4405.4455391999963467,	0.46329933404922485352
##DATA TABLE=	(F2++(Y..Y)), PROFILE
$$ [...]
##PAGE=	F1=-2956.33
##FIRST=	4405.4455391999963467,	4405.4455391999963467,	0
##DATA TABLE=	(F2++(Y..Y)), PROFILE
4405 47 79 85 45 72 89 121 77 130 54 74 65 143 168 168 105 155 64 194 58 41 71 14 197 175 131 134 120 56 79 13 78 135 264 162 82
4077 82 64 141 39 39 186 105 103 43 72 76 122 48 49 44 105 107 62 108 61 123 118 243 310 97 33 36 43 67 183 177 112 73 126 113 11 56 94
3729 94 54 57 101 89 177 143 161 60 141 52 48 78 50 69 36 140 190 37 114 68 86 152 59 174 152 76 119 90 117 100 86 201 145 131
3410 131 148 125 124 96 211 182 73 209 99 82 84 33 101 68 134 174 47 72 99 285 230 1365 1603 808 327 279 209 222 99 102
3128 102 95 353 849 698 415 252 80 171 66 55 151 150 161 136 121 113 190 80 32 84 33 221 282 84 41 122 1400 1973 487
2856 487 208 234 206 39 134 168 162 139 72 116 185 184 125 157 117 134 37 53 81 25 48 115 155 98 113 102 91 106 107 23 45 112 33 115 224
2527 224 212 103 173 182 103 80 131 124 141 258 205 132 143 70 65 167 44 44 89 181 126 54 49 94 107 76 124 164 15 19 73 169 61 108 158
2199 158 217 47 88 120 240 229 49 90 66 21 48 144 257 92 272 133 53 117 35 83 49 74 63 102 140 108 104 219 124 103 191
1908 191 110 104 117 74 72 82 150 90 46 173 76 156 57 100 112 195 157 116 93 148 91 34 173 162 79 109 103 45 94 196 26 528 1368
1598 1368 2008 1460 695 173 123 54 182 134 58 78 85 248 285 161 90 140 170 62 27 72 36 73 66 132 9 140 96 135 108 87
1316 87 142 134 60 44 74 213 147 144 195 191 191 115 62 106 255 126 83 35 75 142 190 78 75 141 56 99 169 110 81 128 181 73 133 59 120
987 120 213 24 160 1 100 73 58 174 61 53 104 69 129 66 97 308 117 98 218 126 86 230 224 148 174 463 221 204 304 391
706 391 569 1000 2146 6528 23630 11839 2158 715 441 214 379 316 462 380 104 183 124 182 163 320 87 250 252 69
480 69 377 1312 2312 2252 971 145 211 158 114 181 191 40 157 7 42 51 72 44 17 229 79 174 149 167 122 67 115 99 169 26
199 26 58 98 86 65 165 275 49 151 46 90 123 79 17 88 54 17 116 186 175 240 148 77 105 40 99 81 46 159 148 84 66 102 119
-111 119 53 191 114 103 54 79 24 99 69 108 116 86 122 114 76 19 111 130 119 19 86 64 93 182 77 83 110 75 77 112
-393A12
##PAGE=	F1=-2975.11
##FIRST=	4405.4455391999963467,	4405.4455391999963467,	0
##DATA TABLE=	(F2++(Y..Y)), PROFILE
4405 84 118 59 72 42 67 148 61 70 22 61 61 149 146 91 101 112 112 254 61 78 71 34 118 194 123 119 101 63 64 58 94 127 251 152 57 29 125 82
4049 82 86 250 142 87 25 60 29 111 37 22 34 79 129 88 73 51 115 131 225 291 88 69 56 68 91 164 155 106 93 82 78 28 78 89 44
3720 44 41 97 129 163 111 148 64 133 71 52 46 64 46 46 116 147 95 131 102 83 127 55 144 127 57 106 122 145 106 97 191 154 57 134 92 100 75 174
3363 174 119 79 210 135 81 146 59 78 45 126 138 55 64 135 289 173 1270 1602 773 318 282 217 238 82 116 81 382 842 749 316
3081 316 258 93 172 86 44 136 187 196 147 99 90 215 113 18 76 17 217 237 114 57 135 1392 2140 534 242 195 214 34 113 158
2800 158 151 116 45 149 200 167 115 141 76 118 54 38 85 55 27 121 155 95 113 98 90 85 83 40 48 143 68 85 178 205 120 126 117 107 71 129 117 130
2443 130 229 206 110 113 43 88 165 37 65 77 196 134 88 44 112 138 109 135 149 9 14 63 137 45 87 159 197 64 64 134 272 247 22
2133 22 73 104 40 63 125 228 92 270 155 88 128 29 90 64 120 55 123 136 59 134 165 93 101 176 140 137 118 64 93 51 140 112 52 167
1814 167 77 163 72 120 98 223 177 83 107 120 112 54 194 166 46 125 83 113 48 208 57 733 1495 2117 1473 761 157 162 75 197
1532 197 141 34 94 89 264 308 139 126 134 155 44 19 85 82 45 84 138 38 142 52 125 90 111 113 157 31 55 42 193 119 101 174 148
1222 148 208 125 37 96 219 143 41 54 54 165 207 88 80 141 62 88 144 57 81 93 146 54 94 75 116 148 20 169 87 87 68 73 138 25
903 25 4 49 42 140 128 71 222 56 119 126 135 54 162 103 75 8 241 87 88 300 173 215 248 708 1354 5989 3424 624 136 197
621 197 107 109 99 217 133 72 19 48 79 51 145 26 343 204 106 513 2389 5158 5304 2922 264 346 272 96 200 189 60
368 60 102 51 31 10 78 70 50 212 82 114 109 124 112 62 108 110 183 31 83 81 98 37 181 246 31 167 44 54 76 65 17 74 84 45
48 45 109 175 185 224 119 63 114 34 119 83 70 153 126 49 95 123 124 46 199 119 115 54 24 48 61 75 85 71 69 158 69 94 49 132 121 111 35
-299 35 98 122 70 164 100 44 83 76 98 110
-393A10
##PAGE=	F1=-2993.89
##FIRST=	4405.4455391999963467,	4405.4455391999963467,	0
##DATA TABLE=	(F2++(Y..Y)), PROFILE
4405 132 134 43 161 83 29 244 67 93 12 45 118 165 142 93 112 60 159 275 80 152 56 93 30 193 124 126 68 100 31 128 93 133 206
4096 206 171 13 73 92 144 127 288 154 50 74 76 105 105 41 12 16 52 174 94 78 38 102 120 220 234 108 108 112 98 115 141 152 81 128
3776 128 42 39 32 99 98 47 8 84 158 159 95 125 81 131 117 58 34 97 22 63 95 99 152 123 139 83 93 49 95 127 29 101 155 160 86 107 157 182
3419 182 32 120 55 87 55 130 96 98 201 169 85 189 80 58 20 131 89 78 68 166 242 94 1120 1546 656 299 269 229 256 80
3138 80 130 84 381 875 840 176 271 121 151 117 29 110 223 204 166 84 69 197 140 35 81 50 193 153 151 82 322 1334 2326 562
2856 562 268 169 209 38 104 136 123 103 66 153 210 146 109 119 12 83 69 60 92 94 11 121 138 103 108 101 102 68 62 44 58 177 98 97 115 171
2518 171 127 97 77 133 57 129 116 122 173 216 67 63 84 100 138 48 94 56 210 113 142 49 141 148 153 141 119 7 25 122 128 29 38 172 159 77
2180 77 16 149 297 232 43 48 151 61 57 104 201 84 220 163 144 107 38 74 102 167 79 131 121 18 156 102 69 117 135 172 176 88 62
1870 62 96 25 101 138 35 132 90 145 66 149 87 275 180 39 116 81 141 79 177 172 68 140 36 158 99 173 132 950 1675 2197 1385
1579 1385 660 119 194 89 218 117 15 99 101 224 319 95 164 104 121 55 42 138 133 55 126 128 42 130 95 130 69 106 44 167 52
1288 52 104 53 134 102 60 176 67 226 82 33 106 170 168 56 77 83 211 159 233 107 86 94 101 92 51 151 97 63 38 72 93 163 35
978 35 116 155 222 20 94 193 16 128 146 104 94 214 251 132 46 211 329 125 254 215 95 253 240 423 250 319 288 421 457
706 457 937 1970 2988 10773 36483 17783 3063 1239 412 283 503 508 380 432 459 340 234 185 251 299 127 571 356
490 356 300 436 2231 5528 5568 3497 439 407 298 84 140 98 178 22 146 67 110 52 30 154 201 139 96 112 64 87 18 182
227 182 83 176 116 123 90 156 43 233 159 88 188 52 48 48 27 81 115 144 92 99 150 215 164 78 50 147 39 107 123 134 128 123 77 112 148 140
-111 140 81 182 163 161 38 79 90 41 91 98 28 50 213 53 104 94 178 110 90 41 162 179 57 102 142 51 140 132 146 107
-393A07
##PAGE=	F1=-3012.67
##FIRST=	4405.4455391999963467,	4405.4455391999963467,	0
##DATA TABLE=	(F2++(Y..Y)), PROFILE
4405 177 136 140 303 221 124 368 132 177 29 91 231 228 182 204 137 43 205 256 156 261 67 168 96 174 162 140 111 172 81 203
4124 203 77 144 144 208 115 164 75 212 161 287 138 26 159 120 228 108 59 30 32 85 244 95 134 28 90 89 232 148 165 158 165
3833 165 130 134 111 172 91 177 53 10 21 111 145 76 85 51 175 169 102 92 114 155 196 66 80 133 18 77 111 101 220 97 174 75 48
3523 48 67 42 164 36 131 182 162 56 117 110 210 121 123 27 111 76 86 182 121 193 194 92 206 91 92 49 178 30 104 80 191 152
3222 152 33 923 1423 472 273 243 247 274 105 135 105 353 923 949 27 296 164 134 153 58 93 256 180 202 70 124 146 162 84
2950 84 96 116 171 49 189 101 548 1187 2411 589 276 178 197 54 103 100 91 108 118 122 217 127 109 106 71 40 80 114 103 132 60 113
2650 113 96 129 107 128 123 63 74 37 90 218 114 152 80 115 140 88 130 181 46 135 122 117 95 238 28 9 146 98 97 72 125 128 231
2340 231 76 208 72 172 135 202 143 78 47 39 189 151 101 41 206 123 118 51 160 321 184 121 43 200 91 27 83 185 81
2067 81 138 157 202 57 54 42 141 218 150 125 111 18 162 65 121 171 77 204 215 57 66 85 89 91 170 40 76 117 114 66 205 118 335 172
1748 172 94 122 102 177 126 122 208 118 172 47 175 205 162 243 1073 2039 2627 1706 625 58 198 99 265 54 25 107 131 119 325
1476 325 110 211 72 77 138 89 196 185 159 191 108 33 141 230 168 145 70 59 171 115 190 147 62 173 95 207 78 255 56 140
1194 140 174 208 219 197 113 200 284 81 434 180 63 196 185 92 208 272 277 132 155 170 188 330 209 275 245 402 157 215 399
922 399 197 354 385 338 311 405 446 410 354 565 677 495 514 532 454 745 773 1085 989 930 841 926 1416 2601 5029 8654 29332
668 29332 102151 50246 8810 3379 1255 915 1384 1425 1281 1208 1058 810 593 577 639 751 403 861 578 504 300 571
462 571 2635 2141 2145 457 408 236 254 240 208 392 224 278 242 305 170 117 329 284 291 230 175 148 162 145 322 117 238 226 186 173
180 173 250 172 340 61 199 232 80 98 175 91 206 227 228 153 90 127 277 121 154 114 210 71 84 198 244 148 189 226 116 175 184
-111 184 156 172 255 263 6 162 150 80 124 192 140 93 280 93 112 153 252 190 152 83 263 217 61 7 230 197 286 247 221 128
-393A28
##PAGE=	F1=-3031.45
##FIRST=	4405.4455391999963467,	4405.4455391999963467,	0
##DATA TABLE=	(F2++(Y..Y)), PROFILE
4405 212 147 267 469 391 271 489 240 250 69 178 367 336 269 324 170 91 240 214 268 389 123 247 192 147 226 150 222 262
4143 262 185 272 52 148 118 244 241 273 115 280 186 248 110 102 250 181 351 124 79 50 90 156 325 123 201 26 76 55 256 86
3861 86 234 226 208 162 143 96 206 168 234 103 64 7 115 213 124 179 37 186 191 126 49 151 204 295 77 136 161 30 94 151 168 296
3560 296 73 205 56 14 126 68 217 92 186 200 152 70 127 84 234 204 152 21 148 131 54 294 139 194 213 99 205 93
3297 93 163 100 255 34 126 102 208 45 90 688 1245 234 232 208 269 294 132 127 137 301 1008 1133 162 327 222 165 193 124 107
3025 107 282 138 255 54 222 113 176 138 115 193 178 117 224 102 749 962 2335 609 265 214 195 79 109 55 99 120 176
2772 176 77 222 118 121 122 161 64 104 169 117 162 117 101 33 174 116 176 143 74 111 60 143 262 124 214 123 61 165 96 215 231 63
2471 63 156 132 119 37 269 74 82 209 84 74 101 158 247 260 70 275 110 198 113 246 151 81 105 58 242 183 198 107 256 129
2189 129 186 126 165 346 117 207 95 245 138 20 91 183 108 85 152 250 12 78 40 175 272 235 122 132 58 151 106 201 258 15
1908 15 232 250 117 74 91 174 160 202 100 28 154 104 105 285 169 385 164 186 142 173 208 201 66 269 159 218 145 179 305 242
1626 242 349 1224 2560 3245 2250 826 66 210 154 345 82 54 144 194 45 334 208 274 102 85 255 158 265 243 286 275
1382 275 119 100 207 394 231 280 95 181 194 205 296 272 138 302 194 265 226 298 196 285 283 348 299 353 199 353 386 194 649
1110 649 291 228 345 312 215 409 416 512 331 316 313 358 558 471 480 457 606 364 405 650 462 639 685 635 595 664 691 780 772 1009 1097
818 1097 957 860 931 933 1354 1461 1895 1883 1703 1540 1651 2613 4660 8712 15583 51736 181963 89827 15841 6005 2247
621 2247 1738 2447 2551 2387 2097 1782 1354 1025 1055 1109 1203 875 1153 787 728 672 2811 2271 3944 1361 433 634 389 589
396 589 564 511 660 496 430 478 607 345 315 551 449 498 411 287 315 322 326 483 262 404 346 275 288 363 327 485 187 334 305 144
114 144 180 334 211 366 366 324 219 136 144 364 212 309 216 300 119 131 294 381 241 299 403 122 201 250 255 215 374 398 60 239
-167 239 212 160 170 326 279 187 354 140 128 215 342 333 281 176 373 231 73 114 352 372 458 388 316 185
-393A85
##PAGE=	F1=-3050.23
##FIRST=	4405.4455391999963467,	4405.4455391999963467,	0
##DATA TABLE=	(F2++(Y..Y)), PROFILE
4405 230 173 384 622 557 425 584 367 295 108 264 492 453 376 426 207 145 255 182 381 510 194 320 268 128 286 156
4161 156 336 344 299 324 29 146 158 261 359 384 181 338 200 184 105 187 327 245 448 147 93 73 155 215 397 186 258 38 54
3889 54 44 280 142 292 303 238 192 136 133 236 260 288 152 122 26 116 273 179 269 99 191 220 156 7 181 258 388 92 185 180 43
3598 43 111 185 245 369 83 230 36 63 200 127 261 157 247 204 145 114 140 104 255 269 198 21 173 182 55 387 149 204 231
3326 231 101 196 94 235 150 332 101 140 129 215 69 157 448 1071 165 165 170 282 309 143 102 169 232 1231 1484 305 358 286
3063 286 230 233 203 134 298 117 316 47 320 167 184 187 129 265 213 258 250 94 897 725 2136 602 234 252 215 107 119 17
2800 17 155 129 231 90 225 120 139 165 239 125 148 210 131 180 168 94 39 224 134 233 154 101 143 115 203 301 137 264 179 79
2518 79 197 118 294 262 105 186 138 125 117 296 139 152 263 61 92 128 188 360 291 115 329 153 211 108 276 168 149 162 80
2246 80 274 198 288 157 311 177 254 193 166 367 55 285 159 281 196 74 140 188 158 144 171 279 87 115 77 201 321 306
1983 306 137 180 111 130 165 266 355 38 250 278 211 77 141 261 240 218 171 68 192 138 157 366 207 413 172 267 177 229 214
1711 214 282 104 326 177 255 224 191 361 327 410 1416 2980 3578 2490 1014 238 289 257 438 213 94 209 274 238 353
1476 353 315 346 173 162 378 237 354 308 403 365 177 207 294 550 302 421 210 299 249 306 401 404 266 441 308 339 373 349 359
1203 359 440 399 500 394 489 324 502 505 384 836 416 419 502 446 357 615 557 738 546 485 448 551 783 739 689 701 798 577 619
931 619 891 725 926 989 943 891 925 938 1159 1178 1459 1506 1420 1221 1333 1420 1959 2162 2700 2766 2491 2256 2406 3813 6707 12307
687 12307 22433 73663 260543 128882 22833 8637 3184 2601 3502 3671 3499 2926 2496 1883 1444 1524 1577 1562 1456
509 1456 1413 988 977 1141 5236 6403 9171 3831 528 1007 694 924 902 818 923 797 581 719 977 485 530 769 622
293 622 716 585 421 483 488 510 628 432 603 456 378 391 469 471 633 363 469 389 222 267 482 335 530 496 416 277 235 205 446
20 446 350 471 322 396 178 222 385 515 347 417 568 151 219 316 349 294 493 529 129 303 259 247 212 459 411 294 427 181
-243 181 147 265 430 473 416 300 469 223 80 223 471 544 612 529 420 259
-393B59
##PAGE=	F1=-3069.01
##FIRST=	4405.4455391999963467,	4405.4455391999963467,	0
##DATA TABLE=	(F2++(Y..Y)), PROFILE
4405 228 194 457 728 681 553 637 491 309 124 322 576 541 470 492 243 196 240 177 469 597 256 375 313 129 320 156 420
4152 420 399 402 349 38 147 201 251 443 475 244 378 205 122 135 254 372 295 501 171 104 93 211 239 440 258 294 69 22
3889 22 45 292 222 320 372 257 215 112 193 245 336 325 187 177 42 113 308 233 337 166 187 249 180 32 195 294 450 111 215
3617 215 193 55 117 201 304 421 116 246 65 103 265 168 285 215 300 195 155 145 154 136 270 309 248 16 172 207 70 442
3354 442 157 212 254 100 182 105 286 189 388 163 149 155 211 139 210 283 986 475 73 144 271 310 130 64 193 161 1629 1968
3091 1968 401 375 343 287 272 275 147 298 144 370 52 396 250 187 220 131 317 253 384 259 100 982 589 1910 553
2856 553 189 277 249 126 128 37 214 130 276 157 221 127 156 211 287 176 197 232 133 189 201 96 104 261 148 286 150 141 155 172 258
2565 258 325 158 291 209 137 220 147 356 261 151 209 131 133 199 307 195 200 297 58 114 147 207 436 309 162 362 186 207 125 288
2283 288 187 221 200 104 286 180 347 178 359 229 295 240 164 375 29 339 209 305 254 127 198 190 207 219 211 280 158 158 108 215
2002 215 354 343 168 229 166 100 211 298 439 75 253 300 288 73 211 336 289 210 234 114 221 183 195 422 222 411 202
1748 202 322 208 243 190 346 173 359 174 270 256 198 344 350 410 1462 2961 3426 2241 1059 452 405 363 509 342 136
1513 136 273 339 418 374 397 403 235 244 476 305 446 365 482 441 245 314 359 660 362 534 334 386 311 396 477 513 365 554 412
1241 412 405 482 394 496 571 494 609 480 569 452 609 611 547 957 526 584 625 552 463 780 666 899 727 622 541 712 947 954 856
969 856 907 937 743 803 1067 921 1153 1225 1196 1129 1121 1125 1457 1478 1815 1811 1786 1512 1643 1801 2421 2711 3320 3449 3121 2831 3005 4745
706 4745 8280 15018 27678 90255 320452 158734 28267 10714 3850 3321 4335 4541 4387 3531 3052 2303 1764
546 1764 1877 1947 1787 1984 1623 1205 1226 1374 5656 6977 10563 4617 741 1276 923 1118 1124 1031 1117 1071 715 894 1343 526
321 526 701 922 748 893 712 540 607 607 643 721 575 772 529 466 446 539 571 744 505 578 460 284 336 581 431 657 587 488
58 488 311 341 265 489 463 601 410 475 239 298 446 609 420 516 683 199 225 358 415 362 583 627 195 351 277 316 234 555
-205 555 509 386 490 212 155 288 489 564 520 433 533 206 70 300 547 677 710 645 518 328
-393C28
##PAGE=	F1=-3087.79
##FIRST=	4405.4455391999963467,	4405.4455391999963467,	0
##DATA TABLE=	(F2++(Y..Y)), PROFILE
4405 216 196 467 759 738 625 642 588 297 104 338 601 572 528 515 271 241 192 176 514 629 296 401 321 152 318 144 452
4152 452 415 477 342 67 159 213 213 473 524 289 394 201 101 167 285 378 322 501 191 121 102 244 220 441 316 300 117 15
3889 15 33 286 271 309 416 263 226 74 240 227 376 336 201 221 51 108 317 280 366 213 171 269 191 55 192 302 465 131
3626 131 221 212 60 106 196 330 440 142 248 117 119 306 182 279 256 335 175 182 155 164 152 274 318 285 8 147 199 73 448 170
3344 170 209 278 94 159 128 300 210 413 207 153 173 193 163 256 304 975 771 82 136 233 287 98 23 202 135 2090 2448 439
3081 439 370 380 310 308 323 137 280 186 403 55 438 307 185 236 120 341 281 467 247 126 1006 588 1713 465 137 281
2837 281 277 126 127 60 250 119 305 215 207 131 167 245 293 205 235 234 112 193 211 101 146 270 150 327 126 186 142 212 292 328 179
2546 179 292 205 187 222 168 397 223 189 210 111 133 252 290 236 216 299 97 115 155 209 457 307 190 365 201 190 135 280 191
2274 191 271 206 132 279 132 360 173 390 266 293 263 158 358 33 358 235 318 296 172 244 187 236 265 246 252 218 197 128 211
2002 211 363 336 198 264 206 65 236 290 488 90 238 314 327 62 275 383 296 176 279 148 232 214 208 436 218 377 243
1748 243 352 219 212 162 378 219 368 168 270 249 186 258 307 367 1377 2481 3202 1869 1094 643 490 434 528 427 166 308
1504 308 362 538 379 437 414 266 297 519 341 512 395 501 483 289 392 375 695 393 592 426 423 342 451 499 570 402 617
1250 617 487 437 523 416 571 647 541 639 536 576 544 642 673 638 983 590 682 677 602 497 863 719 953 833 697 567 796 1011
987 1011 1066 938 1017 986 814 911 1133 1001 1265 1332 1332 1247 1203 1201 1601 1599 1991 1937 1968 1661 1784 1979 2623 2975 3605 3776 3440 3126
725 3126 3294 5185 8998 16200 30062 97560 347401 172254 30870 11759 4084 3730 4761 4957 4850 3796
574 3796 3330 2533 1913 2026 2141 1885 2278 1779 1427 1437 1264 3546 3011 6842 2647 1130 1344 1006 1092 1150 1087 1195 1251 817
349 817 948 1620 448 781 966 790 986 762 607 660 646 688 740 651 864 548 513 438 553 600 785 579 638 497 305 364 611
95 611 475 714 616 523 312 424 296 473 519 668 462 512 293 331 459 641 436 574 723 246 215 360 433 388 621 666 246
-158 246 377 262 351 227 591 551 442 533 229 146 279 502 580 570 549 552 195 43 334 558 747 727 709 597 375
-393C75
##PAGE=	F1=-3106.57
##FIRST=	4405.4455391999963467,	4405.4455391999963467,	0
##DATA TABLE=	(F2++(Y..Y)), PROFILE
4405 208 184 417 712 721 625 599 632 266 61 310 566 535 537 489 281 270 120 159 510 598 304 392 292 184 285 120 426 393
4143 393 508 299 94 181 193 154 445 516 307 380 191 115 181 274 349 320 450 200 148 98 249 164 397 346 274 174 49 20 263
3870 263 280 260 420 256 220 32 253 185 374 315 197 245 55 102 308 314 350 227 141 271 186 70 179 280 427 148 199 239
3607 239 56 82 177 318 421 152 234 158 107 312 171 245 271 349 150 212 152 165 155 263 293 297 6 110 164 59 407 186 191
3335 191 293 81 124 154 274 210 402 223 151 182 163 139 301 412 909 936 187 129 180 242 55 34 192 195 2471 2790 422
3081 422 338 387 288 332 334 108 246 216 408 49 442 317 179 234 97 336 287 489 216 151 971 591 1512 357 102 262
2837 262 284 101 114 69 252 97 311 240 177 125 169 256 254 210 250 222 65 201 203 106 154 248 141 350 85 224 109 221 298 311
2556 311 187 266 174 219 203 175 415 154 212 183 85 121 267 245 260 197 266 156 101 152 189 423 285 197 340 194 165 121 263 168
2274 168 285 176 165 257 67 324 155 398 283 246 268 143 316 30 343 229 320 311 205 265 179 238 277 253 198 258 221 140 189
2002 189 346 286 216 279 219 28 241 253 492 86 204 309 319 62 319 397 261 129 294 170 219 226 202 406 201 319 274
1748 274 362 211 153 182 375 235 359 177 270 253 166 152 247 320 1524 2199 3602 2086 1238 730 501 440 482 443 169 294
1504 294 333 565 346 431 364 256 302 493 331 525 383 456 478 292 420 335 642 380 582 458 400 323 458 459 560 368 617
1250 617 516 418 484 403 567 646 528 579 548 507 572 587 671 634 909 586 690 642 586 446 843 699 886 840 692 518 777 960
987 960 1047 915 1001 929 771 914 1073 945 1238 1280 1320 1211 1146 1142 1554 1513 1946 1851 1923 1628 1715 1910 2513 2888 3483 3667 3370 3068
725 3068 3198 5028 8681 15560 28992 93780 334758 166104 30011 11519 3820 3728 4686 4820 4756 3684 3270
565 3270 2517 1858 1934 2118 1875 2216 1865 1578 1556 919 179 4350 3056 1701 1648 1272 989 875 984 979 1143 1292 866 862 1744
330 1744 306 754 892 737 969 723 601 636 598 631 682 642 854 510 503 368 509 554 745 569 637 486 275 348 567 463
86 463 684 578 512 277 464 289 399 512 658 471 490 325 313 424 605 389 582 676 279 185 319 405 361 599 635 270 375
-167 375 226 347 196 559 530 444 543 226 125 243 467 518 557 622 517 195 16 331 504 743 658 705 638 384
-393C84
##PAGE=	F1=-3125.35
##FIRST=	4405.4455391999963467,	4405.4455391999963467,	0
##DATA TABLE=	(F2++(Y..Y)), PROFILE
4405 206 170 329 599 640 550 513 604 217 56 247 491 440 492 418 259 270 44 125 465 514 275 344 227 206 236 89 352 341
4143 341 491 225 113 196 156 90 372 455 292 334 170 123 175 229 298 292 360 196 173 94 226 92 314 342 219 225 77 43 229
3870 229 257 187 378 235 194 3 232 130 337 265 181 243 52 107 298 337 296 204 99 250 164 80 163 233 348 158 153 263 46
3598 46 72 156 270 371 143 204 173 72 285 143 186 257 340 127 232 154 158 154 237 237 274 25 81 128 31 332 195 156 287 56
3316 56 89 174 214 192 359 202 142 178 129 80 343 500 693 914 262 106 132 183 10 68 165 284 2688 2931 375 286 366 222
3053 222 334 308 76 200 230 386 43 410 275 169 221 70 307 267 444 172 164 878 498 1254 259 114 226 263 49 94
2809 94 67 222 67 290 228 132 110 158 244 178 196 237 201 28 209 186 118 129 200 124 349 34 242 66 199 271 274 172 218 134
2527 134 234 169 165 411 66 218 128 72 94 249 177 267 155 205 217 102 139 151 352 258 189 295 169 145 80 245 117 263 113
2255 113 195 225 24 253 139 381 285 169 259 114 252 38 304 197 307 294 223 264 169 214 264 226 129 271 227 144 155 310
1992 310 205 219 274 200 3 228 202 450 70 155 274 272 79 334 375 200 88 274 185 179 218 187 345 167 258 273 355 194 92
1720 92 239 342 228 341 191 267 299 173 136 223 294 1898 2699 4320 2625 1337 658 428 375 376 379 140 231 264 493 266
1476 266 387 257 208 260 403 274 477 327 359 425 253 393 252 513 322 510 421 325 253 415 367 485 272 558 496 346
1232 346 377 354 488 570 456 441 511 383 531 454 607 541 750 510 610 527 511 321 728 610 715 746 614 406 661 813 904
978 904 794 859 776 628 815 905 773 1084 1082 1162 1026 967 960 1334 1247 1691 1573 1662 1421 1455 1616 2117 2478 2982 3152 2929 2672 2741
715 2741 4321 7411 13255 24732 79846 285677 141806 25901 10049 3117 3311 4129 4160 4087 3241 2893 2239 1608
546 1608 1625 1880 1762 1796 1825 1549 1514 644 3383 10422 8993 5628 2001 1141 918 583 714 762 984 1180 831 665 1690
330 1690 264 646 730 602 842 601 523 554 490 494 568 551 745 426 435 264 425 449 632 481 572 424 201 297 466 405 574 483
67 483 453 217 451 255 289 454 574 436 409 328 255 355 519 296 540 555 285 133 247 346 292 524 541 264 343 188 313
-186 313 156 471 451 387 509 198 99 194 397 398 489 630 429 194 24 307 406 668 520 625 624 346
-393C46
##PAGE=	F1=-3144.13
##FIRST=	4405.4455391999963467,	4405.4455391999963467,	0
##DATA TABLE=	(F2++(Y..Y)), PROFILE
4405 184 149 231 443 513 418 390 500 149 88 161 400 308 400 310 201 229 24 94 392 400 211 263 134 199 185 61 251 273 430
4133 430 130 128 191 122 52 276 354 246 259 133 117 154 170 242 241 249 185 181 104 185 31 207 307 144 254 98 63 194 221 121 294
3842 294 203 151 21 186 78 275 194 160 215 44 123 294 346 218 149 49 205 125 86 148 173 247 160 96 267 41 90 144 199
3570 199 299 119 162 156 25 232 109 117 222 308 115 234 165 144 157 205 159 215 47 69 124 14 242 188 108 258 15 82 187
3297 187 137 161 296 146 127 163 98 6 371 561 346 761 284 78 106 124 34 94 124 361 2737 2902 332 223 330 125
3053 125 310 257 56 149 234 344 56 352 193 156 204 49 263 225 341 123 163 739 306 939 213 146 181 219 45 77 64
2800 64 170 42 246 184 74 88 131 214 85 171 202 175 108 204 169 141 79 137 106 319 28 231 31 154 216 224 137 157 108 237
2518 237 130 142 385 21 206 55 75 56 211 104 259 117 139 267 136 117 111 281 248 171 241 126 135 22 232 65 214
2265 214 31 212 189 66 171 127 342 278 97 240 72 177 61 252 148 280 250 222 244 155 172 240 175 65 251 214 133
2011 133 120 262 114 209 254 152 24 204 153 371 61 111 202 198 102 316 325 134 66 219 185 112 189 169 273 114 219 235 320
1739 320 180 43 279 285 204 311 176 241 335 213 192 216 283 2071 3295 4701 2881 1296 427 295 257 238 254 88 138 179
1495 179 346 147 318 118 142 184 280 188 376 241 239 337 184 322 154 345 232 398 325 221 149 338 249 366 148 458 437
1241 437 237 231 280 360 440 343 261 435 236 439 275 500 389 543 379 468 365 401 159 549 470 485 578 489 259 484 612 675
978 675 606 631 565 434 646 675 534 845 789 897 737 709 704 1001 873 1290 1173 1248 1092 1071 1179 1536 1856 2226 2358 2226 2038
725 2038 2044 3250 5504 9843 18315 59119 212085 105261 19522 7691 2137 2577 3218 3134 2977 2601 2294 1711 1213
546 1213 1185 1459 1537 1146 1576 1262 1253 564 4023 11534 10988 7023 1868 881 721 330 472 534 767 945 693 412 1485
330 1485 354 506 533 418 635 423 395 446 369 320 433 406 565 320 321 159 332 315 476 341 458 320 107 231 338 326
86 326 411 356 357 162 393 213 176 374 436 370 280 297 181 279 413 186 456 387 255 63 168 281 201 415 401 233 280 156 268
-186 268 122 354 334 279 429 144 67 150 314 252 390 567 295 171 12 272 295 536 341 479 547 264
-393B64
##PAGE=	F1=-3162.91
##FIRST=	4405.4455391999963467,	4405.4455391999963467,	0
##DATA TABLE=	(F2++(Y..Y)), PROFILE
4405 131 111 150 268 365 272 243 333 74 99 66 314 177 278 185 123 147 56 95 300 281 122 163 31 153 140 40 151 199 338
4133 338 32 149 160 106 85 181 240 177 169 79 128 124 131 194 174 140 180 164 125 139 20 94 250 62 253 118 62 162 187 118 181 163
3833 163 104 29 130 49 204 115 136 167 55 138 288 341 142 78 5 143 71 82 131 112 146 156 64 243 49 110 144 115 219 91
3551 91 116 124 37 164 87 71 185 260 117 223 174 126 158 177 80 132 66 60 145 43 156 164 53 210 38 105 196 63 125 224 89
3260 89 107 136 75 63 373 613 142 701 266 105 108 77 69 110 84 406 2666 2791 322 160 298 17 259 205 52 108 235
3006 235 295 79 275 93 139 186 42 215 171 203 79 159 569 98 627 230 158 145 161 139 82 68 110 46 192 123 20 64 85
2734 85 178 35 146 152 146 194 178 156 168 39 82 91 262 74 189 22 115 142 163 92 99 105 232 100 108 338 89 181 21 76 29 169
2434 169 59 240 122 104 298 183 90 90 246 260 149 192 71 137 37 223 95 155 58 204 156 102 115 113 286 268 107 209
2171 209 40 106 80 200 93 240 198 202 214 136 128 219 137 51 200 184 102 96 212 67 189 229 86 34 175 113 268 83 107 107 114
1880 114 121 269 256 87 48 140 168 35 144 145 211 107 211 172 252 176 21 274 212 168 268 120 192 308 263 224 195 282 2062
1607 2062 3724 5028 3048 1400 117 170 165 111 111 59 61 108 169 29 245 21 95 107 173 99 250 154 140 238 110 229 73
1354 73 184 135 277 201 119 49 251 140 236 76 347 360 120 89 203 219 286 215 84 339 101 330 95 383 228 334 225
1100 225 306 209 287 4 353 309 259 379 356 113 296 406 416 396 372 356 267 453 443 291 580 471 589 416 435 440 638 484
837 484 841 747 781 719 665 710 908 1175 1393 1472 1428 1318 1275 2073 3405 6104 11220 36333 130884 64875 12325 4978
631 4978 1114 1694 2154 1979 1899 2018 1613 991 749 728 912 1190 477 1079 739 780 361 1576 5862 5750 4548 1126 393
415 393 323 192 364 385 552 658 464 167 1198 397 385 360 228 393 226 248 342 286 159 311 247 354 226 181 82 256 184
161 184 318 187 323 193 66 161 212 251 230 226 250 156 303 183 91 300 273 288 128 238 125 216 315 107 351 216 186 65
-102 65 114 227 114 296 246 194 197 124 228 103 238 203 142 315 74 24 134 235 119 291 442 138 123 39 228 194 367 159
-365 159 301 414 171
-393A71
##PAGE=	F1=-3181.69
##FIRST=	4405.4455391999963467,	4405.4455391999963467,	0
##DATA TABLE=	(F2++(Y..Y)), PROFILE
4405 93 75 118 101 231 188 94 144 74 87 57 241 118 149 68 95 43 67 124 202 179 34 72 58 79 107 41 81 129 237 59 178 112
4105 112 109 142 102 138 98 103 23 178 93 142 158 101 61 190 132 140 100 25 10 184 11 222 136 47 135 159 165 64 123 71 49 78 56 139
3786 139 40 109 114 99 141 269 321 104 19 45 83 19 77 112 61 64 149 84 194 72 115 154 34 147 73 77 114 88 90 99 99 173 205 125 206
3457 206 167 104 148 162 76 41 75 40 159 65 87 129 12 155 88 127 200 17 92 155 113 83 103 68 109 341 670 392 874 246
3175 246 166 135 49 91 121 63 412 2526 2672 337 104 287 82 194 168 56 89 237 252 93 191 65 116 160 47 171 122
2922 122 62 51 167 390 225 385 261 141 132 103 237 110 79 64 72 148 62 41 44 46 153 104 123 98 115 255 130 149 186 76 82
2631 82 74 188 106 126 39 123 66 100 57 71 108 225 82 69 275 128 150 84 65 54 136 85 211 153 116 304 224 66 92 250 278
2340 278 127 160 41 141 83 209 160 105 130 171 128 124 108 94 221 249 166 168 84 52 87 156 41 195 173 167 179 115 95 209 162 81
2039 81 130 141 58 88 163 112 162 213 56 38 149 81 164 124 137 67 37 139 210 177 75 23 52 138 80 88 114 177 213 225 119 157 175
1729 175 78 226 136 124 222 56 160 214 304 227 204 291 2410 4434 5946 3634 1810 234 184 212 32 74 111 73 77 17 119
1476 119 194 106 93 76 141 47 128 98 115 154 55 132 36 86 66 177 90 44 65 178 67 129 133 248 288 28 29 140 96 145 99 45 245
1166 245 9 241 50 284 124 170 90 169 132 194 108 187 161 123 202 255 10 141 238 182 211 147 221 216 281 258 99 348 202 305
884 305 148 201 228 322 161 441 387 364 382 345 311 365 584 661 681 704 674 603 1038 1551 2804 4915 16147 58788 29000 5787
640 5787 2484 415 857 1150 966 2041 1918 1022 390 319 366 370 710 154 448 255 237 161 4510 5214 5325 3066 99
424 99 431 332 361 402 320 385 408 203 77 909 346 297 245 90 170 76 118 268 258 42 224 111 159 183 43 58 212 76 190
152 190 72 212 73 117 93 104 197 70 123 178 192 204 176 48 247 117 210 39 165 107 175 236 100 245 106 95 150 112 193
-121 193 64 189 121 172 111 109 201 99 150 88 43 193 31 26 158 166 72 228 284 32 80 113 181 116 192 35 169 255 160
-393A60
##PAGE=	F1=-3200.47
##FIRST=	4405.4455391999963467,	4405.4455391999963467,	0
##DATA TABLE=	(F2++(Y..Y)), PROFILE
4405 134 79 126 35 167 203 27 18 124 75 128 179 161 42 28 146 52 75 147 117 108 72 65 112 20 83 67 70 70 160 107 197 71 120 195
4086 195 43 69 27 122 20 236 73 175 130 50 54 203 107 140 86 14 84 121 58 175 142 47 107 136 207 57 96 65 77 37 70
3795 70 93 23 79 68 146 130 235 286 111 46 78 56 69 98 98 58 17 143 104 140 106 105 163 39 100 73 53 138 133 18 125 152 195 160
3476 160 128 189 146 74 127 156 134 44 76 16 152 68 45 91 44 110 118 133 192 39 68 102 182 52 77 79 129 278 738 489 1062 258
3175 258 206 175 37 92 131 65 379 2323 2541 357 63 295 155 135 139 69 87 237 223 90 109 137 87 114 58 138 95 55 47 186
2894 186 228 399 277 269 99 139 56 314 151 93 65 100 130 22 65 34 80 146 159 105 51 84 273 70 151 187 129 133 57 112 115 68
2593 68 69 166 53 45 52 86 107 213 72 32 198 132 116 123 47 78 118 128 176 170 131 282 247 56 89 263 279 108 145 93 135 105 183 202
2274 202 85 176 125 104 133 120 79 154 216 209 126 144 46 86 124 14 154 189 127 142 108 83 206 224 105 73 93 15 80 117 161 134 205
1964 205 117 34 130 53 96 161 156 133 35 154 158 105 84 21 28 108 152 33 76 179 342 254 120 63 161 135 153 87 72 181 92 168 104
1654 104 307 203 249 286 3022 5256 6844 4260 2104 405 268 278 33 123 177 87 105 83 193 183 128 108 105 152 53 47 82
1401 82 128 100 26 47 44 86 54 111 59 13 109 140 38 65 179 174 234 34 71 103 19 43 29 104 171 58 188 130 220 129 88 39 93 144
1081 144 130 155 83 52 140 116 209 73 47 125 11 80 30 198 239 157 144 24 191 64 103 116 44 107 105 60 164 151 132 142 197 48
781 48 8 209 154 121 187 257 160 308 247 494 448 1859 8094 4059 1003 746 625 298 374 446 3196 2447 849 1057 234
546 234 167 361 173 527 486 570 344 562 9030 14843 15599 8441 1082 1022 813 582 500 269 279 266 94 200 661 252 223
311 223 191 109 38 114 46 228 254 51 175 21 16 184 85 64 193 31 109 78 165 58 147 35 16 167 52 65 176 218 127 190
30 190 34 217 24 147 142 99 111 149 177 114 161 119 58 215 142 178 77 109 106 171 45 139 179 98 116 58 137 116 62 64 196 105 123
-280 123 202 137 119 98 175 133 73 88 103 184 119 216
-393B16
##PAGE=	F1=-3219.25
##FIRST=	4405.4455391999963467,	4405.4455391999963467,	0
##DATA TABLE=	(F2++(Y..Y)), PROFILE
4405 160 75 111 122 176 206 90 106 127 59 156 121 194 41 59 172 106 105 143 82 61 126 100 120 62 47 91 85 33 129 110 187 67 120 229
4086 229 17 43 32 170 35 268 85 197 113 64 77 198 92 123 101 4 127 65 69 131 123 61 70 119 223 130 85 59 93 17 71
3795 71 72 57 57 29 175 109 193 242 120 62 96 67 125 147 101 105 14 133 98 105 142 92 161 95 90 80 50 156 164 60 138 198 227 134 130 169
3457 169 117 31 105 152 173 96 74 4 121 48 46 60 70 84 110 124 164 55 52 73 225 29 68 107 127 196 825 380 1084 280 198 205
3157 205 34 71 139 70 316 2042 2343 370 54 301 189 106 96 84 89 228 205 68 44 185 56 40 69 115 93 126 67 192
2894 192 106 479 316 249 53 158 27 351 194 106 93 120 128 29 62 38 133 146 187 90 31 69 242 14 151 173 170 195 49 51 100
2603 100 58 110 200 110 49 56 109 107 192 61 22 117 105 81 130 42 80 110 160 143 160 125 238 245 68 63 264 254 86 135 147 112 99 142
2283 142 204 98 188 85 84 125 126 67 90 166 218 92 186 77 86 103 32 126 214 96 102 114 92 202 279 118 64 59 8 58 77 185 110
1973 110 193 185 9 110 31 115 184 139 172 65 158 115 77 106 45 91 88 181 23 35 212 448 302 156 49 116 163 69 90 24 137
1682 137 136 158 120 248 144 278 226 3296 5527 6888 4381 2017 400 308 263 121 108 229 57 165 104 202 200 87 125 147
1438 147 139 45 46 68 124 77 4 36 80 95 52 81 76 25 121 133 42 40 182 131 193 46 68 96 54 35 51 99 119 79 153 151 190 153 69 59
1100 59 87 145 91 145 59 22 158 140 205 102 19 70 85 12 77 205 241 83 95 61 128 114 69 180 39 61 41 157 64 46 195
809 195 60 155 77 188 182 88 165 136 196 156 73 431 748 1822 5464 19187 9912 1573 695 843 356 95 512 4226 3214
574 3214 1308 1969 462 122 568 591 932 884 773 518 661 9690 17289 18491 10552 1478 1179 951 587 516 186 208
368 208 200 186 245 438 178 139 171 160 93 150 29 196 229 119 150 18 53 182 155 50 181 80 59 104 151 101 127 26 72 149
86 149 121 52 187 203 121 207 45 199 95 103 200 71 108 119 130 111 115 142 112 229 180 168 104 62 148 165 15 185 147 80 130 111 212
-224 212 111 65 70 208 47 161 177 58 152 119 188 74 61 138 128 221 77 228
-393B28
##PAGE=	F1=-3238.03
##FIRST=	4405.4455391999963467,	4405.4455391999963467,	0
##DATA TABLE=	(F2++(Y..Y)), PROFILE
4405 115 41 48 162 170 141 84 105 66 24 133 61 174 72 43 136 110 162 108 91 37 141 111 100 76 29 101 105 31 119 77 138 94 103 234
4086 234 43 77 55 191 63 258 125 197 108 86 95 159 69 98 132 23 137 17 47 106 80 63 38 112 214 168 87 48 90 43 57
3795 57 63 66 62 30 171 85 160 195 108 47 102 71 162 204 117 156 14 113 75 106 170 98 142 131 102 84 69 151 177 121 124 229 249 120 146
3466 146 141 85 24 104 143 176 117 79 17 72 22 71 34 83 74 62 109 119 61 47 66 223 65 66 150 118 124 936 293 916 277 148 211
3157 211 31 42 143 81 245 1680 2040 376 71 288 183 105 30 89 93 204 193 33 45 191 36 55 77 98 96 149 109 162
2894 162 68 505 514 234 69 182 34 334 235 115 118 128 123 34 57 58 164 137 187 80 49 89 170 29 137 159 197 254 65 18 66
2603 66 78 152 207 157 88 51 122 115 155 46 40 49 57 58 109 69 58 100 179 121 122 96 189 216 99 21 248 207 53 120 175 87 68 86 169 124
2265 124 167 63 77 93 121 56 35 104 189 68 200 109 92 92 40 108 219 88 63 119 116 192 306 131 68 71 14 19 47 185 92 164 236
1955 236 41 83 34 158 188 88 156 68 146 90 98 136 57 154 75 157 77 18 259 513 366 206 81 56 146 42 111 71 85 137 87
1664 87 205 158 160 304 94 3406 5742 7281 4775 2084 384 300 156 247 39 257 28 216 66 148 213 12 152 183
1438 183 93 4 55 41 101 73 23 84 119 89 46 90 69 53 119 128 53 39 153 138 153 39 38 108 91 55 67 94 77 77 117 129 182 150 50
1110 50 42 97 109 61 103 73 46 136 170 215 107 34 62 119 10 88 191 211 52 85 59 126 143 90 164 58 24 69 179 71 55 226
809 226 71 83 96 223 227 112 212 204 192 198 167 554 957 2163 6664 23676 11969 2148 856 789 439 270 477 4716
584 4716 3863 2026 2766 644 256 395 1041 1184 850 583 306 208 4929 8997 9940 6376 928 711 575 277 339 57
377 57 141 115 192 202 229 105 83 152 174 113 112 72 140 169 196 132 19 54 154 173 30 169 129 19 94 115 101 61 39 158 127 153 75
67 75 162 143 184 207 80 177 134 83 199 114 95 74 89 97 101 132 131 187 218 143 119 49 163 141 48 209 100 36 153 158 237 119 40 51 173
-261 173 53 171 130 53 133 98 132 27 33 170 99 185 101 160
-393A60
##PAGE=	F1=-3256.81
##FIRST=	4405.4455391999963467,	4405.4455391999963467,	0
##DATA TABLE=	(F2++(Y..Y)), PROFILE
4405 49 116 92 183 118 71 30 69 69 90 120 54 108 99 38 69 94 232 98 97 70 120 120 118 58 123 100 136 40 95 81 67 139 105 210 71 143
4067 143 53 181 134 208 165 181 112 83 119 90 37 87 161 64 115 23 12 109 43 62 58 118 183 169 109 72 77 73 56 53 51 77 100 137 75 156 152
3720 152 75 33 102 68 179 252 138 194 29 80 78 118 182 122 114 147 111 88 99 143 175 160 86 246 257 103 183 109 53 88 130 129 147 110
3401 110 88 38 20 61 89 6 92 67 39 94 70 67 52 63 179 125 62 199 106 114 1070 622 630 241 102 189 27 64 142 112 195 1280
3100 1280 1660 371 89 252 142 109 46 83 108 166 180 23 84 162 42 153 84 81 93 131 160 95 146 648 930 284 139 203
2837 203 61 271 271 114 130 124 109 24 100 89 167 113 161 84 66 127 83 51 105 166 207 301 92 10 31 92 184 185 182 114 56 124 129 116 30
2509 30 56 49 8 67 72 116 43 83 184 108 70 53 174 166 132 40 217 151 11 100 172 110 29 44 111 151 124 52 87 47 107 67 7 50 128
2180 128 53 191 133 100 89 28 97 203 105 42 116 147 176 298 153 47 105 42 26 40 170 85 118 263 111 57 65 175 177 44 93
1889 93 57 127 122 108 161 53 231 72 91 135 49 300 531 434 275 80 103 104 124 122 139 58 149 35 265 189 308 381 110 4182
1607 4182 7272 9844 6505 2932 600 279 60 353 87 250 104 229 30 63 201 63 176 198 37 67 50 59 76 65
1382 65 36 113 137 77 69 124 55 79 125 108 48 52 110 177 107 43 35 124 126 58 63 148 38 83 82 97 182 130 50 4 93 53 45 56 94 59 110 183
1025 183 218 111 54 74 120 12 118 161 177 59 81 52 131 147 68 95 62 17 66 168 88 116 189 48 78 68 186 226 88 131 160
734 160 109 169 102 352 586 1314 4117 14799 7343 1410 539 552 347 273 234 4577 4178 2722 3337 817 496 371 956
518 956 859 340 393 313 702 5251 8936 9206 4122 630 646 350 444 87 146 82 11 169 217 211 78 172 112 164 120 58 183 86
255 86 118 271 107 3 33 124 171 115 172 176 45 62 62 75 55 69 234 90 160 114 100 60 264 181 120 143 142 95 154 191 105 27 58 92
-64 92 102 114 95 114 250 99 123 58 151 119 116 204 85 72 169 206 221 128 99 83 98 135 168 71 22 156 68 25 135 36 147 100 83
-374 83 152 35
-393C5
##PAGE=	F1=-3275.59
##FIRST=	4405.4455391999963467,	4405.4455391999963467,	0
##DATA TABLE=	(F2++(Y..Y)), PROFILE
4405 149 216 205 202 66 171 68 132 174 174 178 103 49 140 84 111 104 282 164 84 118 75 146 167 50 218 89 169 53 59 145 59 180
4105 180 152 168 91 210 38 155 209 145 180 164 117 61 142 29 50 96 169 120 75 46 44 125 67 80 91 137 143 143 143 120 74 91 83 45 24
3776 24 77 177 88 87 174 121 37 73 107 73 187 275 155 212 51 41 111 122 176 143 87 142 111 94 122 159 170 166 38 248 251 84 217
3466 217 81 29 144 174 110 100 89 93 63 58 108 89 27 104 54 121 82 48 74 63 54 110 179 58 238 93 156 1216 1092 343 188
3175 188 128 151 24 109 135 152 183 917 1286 346 104 199 80 110 110 84 121 124 164 66 123 121 51 227 101 68 86 90 201 67 260
2884 260 969 1517 402 219 213 88 184 293 102 123 109 94 25 159 114 148 76 113 107 72 159 66 64 66 186 203 326 116 21 30 102
2593 102 191 151 188 121 79 117 136 105 28 65 79 62 89 48 164 63 64 174 91 25 10 199 110 148 77 178 105 55 78 145 159 34
2293 34 73 62 171 76 41 94 44 90 104 41 51 52 49 171 144 101 92 13 88 179 128 45 109 168 156 264 179 14 122 82 54 52 148 93 72
1964 72 263 173 61 87 154 157 86 15 53 105 183 84 159 44 306 82 38 176 54 320 502 491 338 62 175 76 176 113 188
1692 188 69 218 138 277 275 411 438 303 5130 9071 12449 8189 3750 816 255 182 375 166 199 178 200 79 61 152 91
1457 91 172 182 49 143 55 121 55 45 20 132 121 54 100 157 57 88 147 73 21 58 74 201 78 46 57 129 162 58 62 203 43 119
1156 119 85 81 178 110 78 40 67 6 70 32 118 72 108 185 204 124 66 85 119 19 170 129 157 81 63 58 128 129 40 20 82 45 53 160 136
828 136 158 134 39 183 42 154 226 198 95 97 103 152 66 66 104 142 528 2150 955 236 78 271 168 279 97 3924 4032 3174
565 3174 3619 1057 738 1527 34 729 804 893 904 1619 13617 25437 27242 14383 1965 1632 1123 1021 471 318 83
368 83 144 179 398 346 194 272 72 149 142 127 283 108 164 318 76 10 81 122 188 208 190 216 85 33 83 77 136 121 277 51 154
77 154 147 31 50 323 135 149 101 136 114 98 256 141 33 74 99 111 108 28 81 256 57 122 70 131 137 183 179 125 154 180 261 182 158 183
-243 183 135 22 215 164 58 53 237 110 82 237 97 104 167 43 224 94
-393I4
##PAGE=	F1=-3294.37
##FIRST=	4405.4455391999963467,	4405.4455391999963467,	0
##DATA TABLE=	(F2++(Y..Y)), PROFILE
4405 213 239 257 185 94 254 114 186 213 207 218 107 105 166 92 181 107 270 225 49 140 21 161 179 49 268 55 181 77 34 192
4124 192 103 181 201 127 95 253 33 124 244 106 151 145 118 34 143 61 76 96 148 169 40 41 63 129 82 97 93 164 105 108 166 153 80 83
3804 83 106 40 30 58 234 54 107 179 106 44 114 127 79 190 257 160 208 63 38 127 115 148 144 63 121 104 98 119 177 176 134 10 234 234
3485 234 76 218 57 18 174 223 88 64 64 87 80 104 133 67 62 114 28 186 76 46 81 77 40 50 210 68 247 91 188 1356
3204 1356 1558 273 148 165 113 32 133 128 175 183 669 1021 290 116 144 35 116 138 102 108 89 147 107 171 95 46 248 139 65 87
2922 87 48 210 137 374 1322 2128 537 289 206 103 122 286 93 94 87 89 59 194 115 120 38 47 137 66 172 109 82 35 193 187 318
2631 318 131 32 34 103 165 129 183 111 96 98 124 123 54 60 87 112 99 65 192 77 50 148 62 25 31 223 67 125 86 138 80 104 52 117 183
2302 183 65 112 68 175 42 32 73 72 102 135 73 70 25 47 151 140 88 91 48 81 160 141 33 98 165 139 217 191 28 102 109 49 63 120
1983 120 116 46 230 195 87 77 100 135 118 56 45 71 216 53 111 49 346 99 69 176 13 313 419 525 348 99 180 54
1720 54 162 90 208 44 281 179 225 260 363 369 458 5167 9240 12591 8228 3797 810 209 259 283 210 131 221 175 125 99
1476 99 60 58 143 145 92 199 72 189 55 67 30 156 81 22 110 181 59 92 179 56 49 44 81 183 102 31 71 118 190 63 84 214
1175 214 111 165 130 86 165 102 96 60 50 46 107 52 137 81 114 185 169 143 61 92 133 37 204 111 141 101 35 65 112 87 45 22 99 44 41
847 41 165 175 145 105 66 243 34 158 240 286 137 59 167 140 137 170 323 759 2089 7528 4128 752 393 86 86 333 339 2998
584 2998 3401 3203 3593 1361 901 2995 2112 3541 1866 1328 1223 1931 15644 30222 33105 18629 2434 1994 1398
405 1398 1197 687 378 144 249 146 531 358 233 282 100 130 137 175 299 112 219 301 49 10 115 112 198 249 190 239 103 23
142 23 126 96 164 155 254 74 139 154 20 85 321 96 144 69 132 110 58 268 157 43 116 102 127 89 54 96 208 37 113 75 114
-149 114 165 208 130 138 202 199 309 144 178 222 135 59 255 152 82 114 276 143 124 271 114 80 207 115 253 143
-393A43
##PAGE=	F1=-3313.15
##FIRST=	4405.4455391999963467,	4405.4455391999963467,	0
##DATA TABLE=	(F2++(Y..Y)), PROFILE
4405 170 131 225 97 139 234 122 158 140 187 175 48 170 147 30 184 73 173 243 44 113 43 134 119 26 240 53 154 117 38
4133 38 191 119 113 222 118 82 256 60 90 209 123 80 110 118 26 110 74 88 71 116 189 54 17 41 101 50 89 54 189 79 92 161
3833 161 162 94 48 101 30 57 58 249 75 136 147 104 75 131 164 68 186 192 157 190 59 61 103 110 93 117 62 97 95 90 77 155 194 74 9 205
3495 205 204 84 172 20 32 166 271 62 64 34 83 91 127 126 26 88 114 32 202 92 48 82 90 38 48 206 110 218 136 188 1459
3204 1459 1957 473 160 168 87 54 123 126 164 160 587 939 220 126 103 79 135 116 125 58 68 136 136 227 85 52 205 199 76 105 36 174
2903 174 186 451 1562 2578 649 333 180 101 122 242 113 54 60 93 105 184 80 85 68 41 164 52 161 115 112 20 171 172 275
2631 275 133 40 15 82 103 132 182 92 89 75 83 130 106 37 74 147 94 90 186 72 51 113 52 23 57 211 65 58 66 110 74 129 25 116 157
2302 157 99 128 93 155 31 37 16 75 159 138 108 63 65 62 131 140 76 78 90 80 139 141 30 88 137 135 177 177 33 71 111 49 76 81 141 56 162
1955 162 159 123 38 71 125 100 92 56 32 194 118 24 90 321 144 85 131 86 297 285 529 273 201 102 54 97 125 225 123 298 197
1664 197 242 225 241 270 553 5498 9614 13027 8271 3958 743 287 281 201 259 213 218 244 180 103 68 46 124 128 112 204 105 249 109
1391 109 141 97 179 36 45 87 206 47 112 208 68 94 18 129 125 147 14 78 87 190 82 118 179 187 185 172 104 139 109 98 64 102 73
1081 73 121 88 147 85 112 184 121 158 40 87 149 64 203 135 116 115 17 61 92 65 56 21 91 27 39 172 185 76 108 98 224 57 171
772 171 255 301 120 70 150 94 176 256 387 1021 2732 10266 5452 1074 510 53 174 329 433 2065 2380 2741 3280 1653
546 1653 936 4459 5179 7753 2698 1574 1138 1204 7619 15010 17430 11319 1268 1165 822 714 507 253 241 314 285
349 285 463 207 156 160 153 91 75 136 179 73 221 197 37 22 90 77 159 204 165 250 89 38 116 120 104 147 150 137 117 125 12 74 236 133
30 133 89 68 136 71 47 201 125 101 142 91 143 34 83 90 106 19 85 78 100 164 161 54 85 192 238 327 136 145 185 85 97 231 107 89
-290 89 141 214 115 82 200 85 58 177 109 183 74
-393G4
##PAGE=	F1=-3331.93
##FIRST=	4405.4455391999963467,	4405.4455391999963467,	0
##DATA TABLE=	(F2++(Y..Y)), PROFILE
4405 166 95 240 133 211 114 192 139 84 251 112 151 226 82 122 126 158 73 235 148 35 115 99 49 112 148 174 102 171 64 156 149 26
4105 26 228 170 76 218 108 77 113 196 91 54 133 53 56 50 145 82 150 174 81 77 22 40 45 96 63 204 75 120 125 172 147 38 86 14
3786 14 71 116 219 141 192 81 118 88 117 208 64 181 90 161 173 49 67 46 139 22 78 130 84 88 66 32 87 211 70 34 168
3495 168 157 94 105 38 72 122 307 34 74 5 111 128 134 104 36 97 99 106 166 137 98 78 98 60 60 168 175 164 214 167 1492 2227 675
3185 675 216 160 74 82 82 131 117 107 675 1056 199 131 78 124 168 62 143 31 72 137 148 274 88 103 107 269 96 131 72 98 183
2894 183 465 1636 2731 712 339 144 85 136 174 160 68 38 98 151 136 22 46 146 110 180 43 131 78 145 51 123 172 207 122
2621 122 72 43 34 44 144 190 77 51 86 26 110 171 20 56 164 105 101 150 84 70 89 92 9 74 159 102 50 37 110 98 123 63 151 86
2302 86 142 126 104 109 29 65 64 80 228 110 137 53 71 117 123 167 105 62 116 100 119 150 113 98 106 156 161 135 20 141 102 131 102 36 154
1973 154 105 77 88 166 91 136 136 44 114 148 110 124 205 93 153 229 239 101 104 208 299 132 500 118 327 139 172 171 233 271 315 316 340
1664 340 481 466 478 551 587 8797 14872 19990 12518 5971 1160 557 349 375 345 398 156 370 262 152 200 138 134 143 120 146
1419 146 171 283 174 206 155 174 19 89 53 237 35 132 216 59 104 49 174 58 168 29 71 50 143 119 138 122 247 151 183
1147 183 134 109 122 97 76 158 93 95 121 150 87 108 177 82 163 53 61 145 86 179 198 78 132 22 35 79 123 50 58 51 81 74 158 182 21
818 21 135 158 134 113 169 261 264 63 176 47 94 187 244 224 746 1676 7128 3704 809 322 49 205 231 413 1307 1193 1882
565 1882 2737 1846 843 5611 8721 12751 3107 2125 1333 698 13490 21737 21633 10333 1710 1218 1250 791 391 284
377 284 371 347 670 150 305 374 164 201 44 108 93 66 248 255 17 53 52 11 156 142 132 212 274 51 75 48 203 49 144 74 200
86 200 96 69 78 108 103 243 16 94 141 36 110 89 105 233 142 65 159 65 60 151 150 83 35 103 99 144 53 130 86 158 292 307 179 70
-233 70 116 196 163 173 45 112 148 49 133 201 68 195 99 137 133 52 148
-393A48
##PAGE=	F1=-3350.71
##FIRST=	4405.4455391999963467,	4405.4455391999963467,	0
##DATA TABLE=	(F2++(Y..Y)), PROFILE
4405 359 345 395 315 314 135 330 277 284 413 226 322 277 42 287 125 309 227 241 252 69 185 168 163 223 113 299 78 220 115
4133 115 136 221 175 238 239 105 166 158 112 44 288 186 56 161 95 49 65 236 152 226 142 90 159 96 58 128 152 144 200 98 163 90 204
3823 204 220 84 101 27 70 181 163 213 257 21 145 74 81 239 104 191 25 176 164 53 51 57 189 50 63 224 85 87 40 107
3542 107 61 206 131 86 129 93 98 122 93 113 75 315 6 83 38 150 186 138 101 92 86 83 189 103 178 165 74 94 91 53 117 233 142 283
3222 283 169 1440 2315 774 266 190 58 100 26 143 53 63 901 1308 257 140 52 142 202 81 151 110 98 137 140 295 121
2969 121 159 7 320 111 151 122 48 149 407 1593 2562 714 309 117 68 130 132 196 116 35 103 183 103 71 36 222 150 182 55
2696 55 101 52 163 98 77 182 141 108 126 96 30 92 144 191 71 6 133 61 78 220 45 47 157 149 92 118 126 86 99 133 67 85 92 140
2377 140 143 44 129 143 100 123 192 13 177 123 101 38 39 98 134 123 270 68 144 96 52 180 141 202 143 60 114 133 136 172 198 119 97 183
2058 183 171 78 48 248 95 216 131 17 145 172 63 113 187 181 193 149 81 136 254 198 59 243 173 205 103 341 147 154 296
1786 296 293 104 433 74 415 308 283 300 319 298 498 370 524 700 736 783 875 532 12490 21053 28009 17629 8178 1727
1560 1727 795 445 544 399 547 52 461 330 243 292 200 108 152 158 71 253 266 207 220 186 123 78 124 72 252 26 126 186 18
1288 18 82 96 188 68 141 41 41 93 59 165 131 84 268 66 155 173 108 134 103 95 177 124 81 145 157 96 103 145 89 168 124 46 116 85
969 85 148 252 27 172 57 20 88 172 22 130 10 159 138 121 187 100 177 232 30 179 148 248 216 82 278 139 184 198 202
696 202 120 262 102 1350 662 398 38 197 183 97 413 767 276 891 2048 1870 693 6239 11902 17538 3233 3007
490 3007 2232 2526 33321 60664 64032 33494 4904 3562 3040 2088 1139 708 484 345 1033 301 635 753 440 240
302 240 85 244 213 334 469 380 175 72 67 102 286 251 207 331 315 31 111 53 306 203 200 237 242 85 21 173 203 143 347 113
20 113 132 138 98 197 147 182 367 121 37 175 154 49 275 317 162 21 147 128 157 94 267 216 194 336 254 247 108 177 376 243
-261 243 186 115 167 191 152 250 422 180 380 201 216 279 222 366
-393C66
##PAGE=	F1=-3369.49
##FIRST=	4405.4455391999963467,	4405.4455391999963467,	0
##DATA TABLE=	(F2++(Y..Y)), PROFILE
4405 460 450 463 384 347 265 396 355 388 472 302 409 275 59 391 156 370 314 206 280 151 211 247 217 259 152 341 74 231
4143 231 153 130 258 258 204 250 132 135 175 126 88 332 212 96 168 131 70 96 279 178 251 110 78 220 141 100 158 184 178 163 130 180
3842 180 80 215 247 83 110 47 57 212 117 237 274 25 156 33 53 227 134 195 62 169 154 66 25 109 203 62 53 293 82
3570 82 89 50 167 127 148 146 125 100 30 96 181 107 116 76 276 16 105 57 157 214 126 103 138 71 93 246 56 168 192 80 73 118 39
3260 39 86 243 192 298 226 1317 2206 738 263 224 49 86 28 166 50 109 1209 1569 306 167 24 129 213 138 128 145
3016 145 108 114 115 274 161 173 88 314 95 161 175 116 140 286 1513 2187 658 256 126 52 105 139 180 126 33 114 185 137 118 85
2734 85 256 133 171 85 91 81 134 114 64 174 121 112 167 122 57 122 112 166 68 56 171 96 74 213 46 29 123 194 46 104 138 78 113
2424 113 143 134 93 57 136 179 43 130 174 82 165 199 43 160 115 84 60 58 104 147 147 254 48 118 162 27 200 166 193 131 52 71 143
2114 143 190 158 228 107 83 180 204 34 59 301 65 234 155 35 103 219 85 170 140 227 183 142 144 118 305 217 54 184 167 213
1833 213 33 375 160 154 273 201 155 315 203 382 382 297 312 326 213 576 363 588 664 766 827 912 323 12840 21713 28648
1588 28648 18047 8162 1881 812 448 507 338 609 199 450 325 299 301 224 49 176 226 188 311 188 190 167 205 67 161
1354 161 150 115 222 67 134 127 85 100 130 148 97 65 82 23 175 94 196 98 87 244 115 104 208 147 136 116 103 146 169 149 156 177
1053 177 112 92 74 131 171 194 90 80 53 122 258 38 211 99 82 113 170 49 174 63 202 189 101 205 127 212 259 84 216
781 216 105 221 181 92 289 265 219 203 163 263 241 1500 3536 2057 530 363 312 133 100 402 393 578 170 1294 1682 655
537 655 6311 13773 20937 3623 3337 2763 3154 41144 78024 84278 46118 6377 4695 3879 2683 1571 969 492
368 492 276 1104 627 718 922 568 206 127 304 256 468 537 435 267 38 38 154 318 306 250 374 311 42 117 104 327 273 207
105 207 336 224 79 43 220 231 214 356 147 151 119 140 227 223 217 404 69 44 192 184 81 327 393 169 62 174 159 184 164 313
-177 313 272 234 322 191 286 165 236 449 236 223 179 188 231 273 273 532 247 470 235 275 370 337 455
-393D55
##PAGE=	F1=-3388.27
##FIRST=	4405.4455391999963467,	4405.4455391999963467,	0
##DATA TABLE=	(F2++(Y..Y)), PROFILE
4405 251 229 230 208 187 257 242 191 262 249 191 307 135 39 337 41 222 173 13 149 168 151 223 93 137 41 213 67 166 131 75
4124 75 170 169 37 138 155 110 119 44 76 244 123 116 111 136 26 45 185 80 194 55 99 224 113 49 68 132 104 87 152 139 49 149
3823 149 160 39 40 76 37 178 123 156 191 53 116 63 48 141 123 147 34 98 139 66 15 94 126 50 80 293 77 87 92 151 131 27
3523 27 85 119 92 61 110 163 35 97 105 175 33 131 84 137 154 59 52 174 80 149 236 84 65 134 120 42 132 36 112 164 286 233 304 1162
3204 1162 1940 605 181 223 159 25 67 203 95 183 1547 1703 282 227 74 89 172 132 41 88 72 76 88 211 157 100 95 219
2941 219 63 184 224 151 153 121 1396 1832 564 203 166 66 96 117 83 61 40 135 146 154 115 183 210 54 160 120 91 76 42 51 118
2650 118 126 152 150 160 100 29 66 60 124 80 76 185 59 141 113 36 37 68 205 58 50 59 87 103 123 195 135 83 43 111 86 91 166 73 178 132
2311 132 63 48 106 92 171 94 39 54 82 195 94 86 218 50 131 210 145 62 3 38 95 243 84 166 117 79 118 266 107 57 240
2020 240 150 125 221 78 74 217 79 149 127 218 122 166 149 19 255 157 193 36 65 201 114 273 195 157 159 97 145 239 249 243 308 343
1720 343 252 409 202 583 381 622 594 749 969 1000 511 14182 24386 32655 20434 9431 2238 892 656 468 414
1523 414 789 487 418 334 386 308 354 272 300 278 377 326 213 231 137 255 136 234 185 174 147 193 234 110 157 165 149 39 115 90 162 73
1222 73 220 193 182 99 136 203 257 87 204 162 123 152 118 95 212 203 135 181 131 101 71 180 136 211 106 66 54 130 192 130 189 103 117
912 117 132 117 154 143 113 146 173 125 220 107 230 166 78 157 17 196 147 9 137 258 110 186 104 300 308 1812 5383 2807
649 2807 512 466 281 41 228 157 254 443 88 493 1268 886 6034 13590 21999 5130 2297 2030 872 22384 44586
452 44586 50732 30419 3808 2880 2350 1587 967 749 305 222 635 557 281 583 321 58 129 181 52 307 260 238 131
236 131 116 82 68 134 162 68 234 168 41 61 34 162 152 44 260 123 82 53 139 93 99 171 46 126 84 105 128 129 98 244 80 120
-64 120 203 101 77 192 259 31 158 147 148 159 127 152 172 154 200 158 240 79 112 277 102 116 149 123 162 176 44 360 160 313
-346 313 108 155 257 204 239
-393B39
##PAGE=	F1=-3407.05
##FIRST=	4405.4455391999963467,	4405.4455391999963467,	0
##DATA TABLE=	(F2++(Y..Y)), PROFILE
4405 507 531 476 474 347 363 241 390 517 425 509 307 216 328 118 372 323 291 453 216 216 147 108 281 335 328 189 300 71 110
4133 110 241 209 171 350 176 295 36 65 193 340 90 309 278 41 111 151 185 113 204 294 121 217 146 106 171 227 231 134 152 149
3851 149 57 144 183 124 290 149 167 43 59 257 98 180 268 82 174 21 64 211 155 262 129 189 59 51 32 92 282 282 231 125
3570 125 80 164 60 147 272 199 113 111 110 200 40 168 268 199 57 44 134 203 264 63 160 91 218 111 250 140 245 177 69
3297 69 222 80 126 116 233 110 449 149 376 1006 1589 471 136 291 382 127 128 247 142 285 1890 1621 215 334
3072 334 153 40 64 21 169 100 123 147 84 133 70 91 143 76 199 250 258 105 147 158 1156 1718 458 172 217 176 204 124 156 122
2790 122 117 168 90 88 171 364 68 163 185 154 119 75 209 130 272 109 191 209 90 151 168 151 189 167 128 52 242 87 312 100 178
2499 178 134 66 192 236 128 144 245 130 140 242 256 215 173 122 258 85 127 92 227 65 252 185 198 192 294 190 128 173 116
2227 116 285 226 167 266 170 133 379 291 243 128 161 46 320 248 213 341 260 81 363 273 258 163 449 145 403 200 218 237 306
1955 306 266 451 319 277 329 184 294 302 381 542 347 308 359 321 242 536 536 504 526 364 528 455 611 582 874 722 898 760 954
1682 954 1023 1283 1764 1831 2370 2429 1549 33714 58236 78151 49437 23087 4973 2073 1600 1269 1077 1500 888 846
1495 846 739 778 618 693 617 522 340 618 407 535 470 317 333 224 274 296 333 218 378 377 160 163 214 223 159 211 231 240 85 179 245
1203 245 151 203 243 210 353 124 122 110 121 227 181 134 248 166 104 118 155 157 220 248 28 149 41 61 129 208 86 282 52 137 107
912 107 117 65 311 96 272 72 120 144 214 154 298 126 239 72 178 201 115 235 219 229 327 354 156 257 166 966 4183 1665
649 1665 235 468 127 158 568 528 970 577 606 508 640 1348 5868 11224 20536 8408 3092 2607 5551 44746 72485
452 72485 75222 38082 6523 5048 3677 2933 1739 1008 187 627 515 919 1063 678 493 522 281 221 543 525 507 459
246 459 351 427 295 230 362 454 523 402 184 186 77 216 307 366 458 244 265 149 152 137 330 343 296 305 173 53 39 226 272 352
-36 352 185 364 270 203 133 294 249 164 374 405 47 78 234 365 302 402 258 133 228 108 243 295 233 551 244 238 215 106
-299 106 245 557 285 661 243 417 255 227 345 445
-393D45
##PAGE=	F1=-3425.83
##FIRST=	4405.4455391999963467,	4405.4455391999963467,	0
##DATA TABLE=	(F2++(Y..Y)), PROFILE
4405 1728 1749 1635 1465 1170 1019 1077 1340 1526 1497 1430 1013 794 823 560 1067 1122 1094 1192 801 504 487 461 914 1003 983 797 711
4152 711 321 356 654 731 774 957 646 593 171 346 590 862 576 828 629 292 183 428 572 624 678 712 388 403 72 370
3908 370 547 688 651 510 395 144 223 422 549 546 700 464 330 113 153 538 489 579 626 285 313 61 333 501 458 666 424
3654 424 348 115 140 265 443 666 608 309 241 86 287 270 433 654 524 282 156 140 381 282 495 611 413 248 54 109
3410 109 420 573 381 463 328 294 132 395 160 539 534 350 388 172 107 275 462 422 719 341 448 858 1227 474 389 564
3166 564 697 327 238 280 245 458 2246 1325 340 494 231 85 141 207 475 405 345 307 103 147 119 399 397 332 448 346 273 34
2903 34 229 441 745 1857 380 177 271 360 427 371 463 381 241 206 160 85 414 640 237 407 269 184 228 267 530 434 518 264
2640 264 228 280 161 385 453 460 437 313 199 100 423 340 594 419 408 264 160 260 487 421 470 513 270 252 287 453 473 509 458
2368 458 521 232 156 210 413 349 594 528 413 358 425 365 408 530 455 586 441 326 336 388 461 708 644 579 325 321 252 506 630
2095 630 592 711 564 273 493 524 620 509 897 567 691 391 457 465 728 698 944 651 615 604 432 741 747 917 1080 790 742
1842 742 719 721 752 1147 1175 1169 1139 846 1069 1023 1432 1421 1800 1613 1718 1593 1881 2227 2622 3853 3865 4799 4972 3078 69318 119695
1598 119695 159693 101615 47065 9963 4234 3128 2645 2131 2745 1435 1788 1521 1506 1219 1172 1026 816 581 978
1419 978 739 1012 831 576 392 302 355 560 634 498 590 483 183 87 311 442 431 393 350 272 25 128 296 292 368 375 274 369
1156 369 224 115 177 230 324 275 245 330 145 286 52 208 221 383 382 260 253 207 146 199 326 236 529 281 409 214 99 99 515
884 515 351 609 481 397 241 163 305 517 604 696 513 532 316 143 581 777 727 989 866 481 291 545 690 1536 1504 1331
640 1331 1068 552 451 1176 1656 2319 2375 2155 1738 162 1982 6363 7951 17834 13582 9254 8080 16290 146242 260897
452 260897 276827 146255 22200 16786 12859 9584 5997 3133 849 1385 2289 2791 3130 2548 1870 1325 655 866
283 866 1511 1688 1779 1521 1175 901 609 744 1164 1346 1466 1203 756 456 300 661 1023 1132 1234 848 710 285 366 613
58 613 986 1059 1027 850 433 78 297 744 918 1033 878 813 494 206 511 766 953 884 994 807 163 151 604 964 1059 1124
-186 1124 824 552 418 325 800 1005 1086 1386 878 681 621 601 1013 1537 1312 1678 1148 1180 952 1007 1281 1572
-393 1572
##PAGE=	F1=-3444.61
##FIRST=	4405.4455391999963467,	4405.4455391999963467,	0
##DATA TABLE=	(F2++(Y..Y)), PROFILE
4405 3348 3343 3142 2761 2263 1995 2187 2599 2891 2885 2655 2012 1545 1473 1322 1994 2174 2143 2131 1552 964 968 1059 1729 1878 1851 1586 1238
4152 1238 689 751 1204 1442 1576 1723 1248 988 449 729 1114 1549 1256 1486 1099 617 390 788 1101 1292 1299 1265 755 626
3927 626 304 751 1058 1283 1220 990 697 211 498 812 1048 1101 1220 863 541 221 429 931 1002 1133 1085 581 464 200 680
3692 680 908 903 1183 806 563 224 285 592 903 1148 1009 620 386 132 459 630 884 1111 925 562 222 172 629 675 916
3457 916 1046 714 507 71 138 698 973 818 857 629 403 125 572 461 931 975 721 598 272 115 494 778 848 1073 679
3222 679 547 723 906 743 729 964 1062 563 382 290 417 713 2630 903 658 692 291 184 382 525 858 793 635 484
2997 484 119 271 390 789 758 706 747 436 265 241 468 796 297 2088 370 212 328 590 727 742 830 695 386 237 325
2762 325 346 765 979 588 682 384 212 406 552 917 829 817 484 269 359 407 714 826 852 737 481 267 260 695 675 953 801
2509 801 687 400 264 458 787 814 876 843 474 396 357 694 828 923 883 829 430 290 409 703 726 1033 932 687 547 553 599
2255 599 774 970 892 960 706 497 458 689 894 1143 1080 972 564 485 518 821 1104 1106 1154 928 522 646 837 1096 1040 1430 1078
2002 1078 1030 619 742 855 1273 1297 1515 1101 1004 927 821 1299 1395 1601 1731 1277 1239 1176 1279 1478 1923 1954 1961 1826 1456 1729
1757 1729 1836 2447 2535 2935 2699 2705 2571 3124 3781 4327 6445 6380 7771 8093 4917 114071 197083 261991 167254 77024
1570 77024 16283 6953 4992 4292 3406 4332 2133 3050 2538 2438 1973 1707 1451 1173 1069 1492 1287 1564 1229 835 420
1372 420 469 626 974 1043 855 788 495 187 261 591 792 760 606 401 231 176 414 503 602 577 485 330 360 447 433 490 456 415 350
1100 350 376 529 457 646 336 321 250 531 609 655 646 566 358 240 442 519 872 754 866 515 229 124 749 751 1100 1060 897 517
837 517 77 478 874 1251 1349 1152 1048 586 252 995 1473 1548 1893 1637 997 463 1063 2302 508 3985 2825 2149 1259
621 1259 820 1970 3121 4180 4717 4347 3268 1062 2730 7677 8141 17136 20189 17687 15743 30163 278744 509182
452 509182 545492 293788 43120 32578 25154 18414 11803 6187 1680 2366 4450 5514 5818 5011 3684 2358
302 2358 1164 1706 2757 3256 3417 2926 2264 1486 983 1422 2189 2526 2683 2262 1493 807 583 1254 1940 2144 2232 1700 1278
86 1278 457 652 1245 1826 2001 1955 1551 807 130 640 1426 1778 1927 1754 1385 769 248 984 1421 1876 1818 1782 1313 420 398
-149 398 1143 1771 2039 2072 1591 1104 688 777 1544 1945 2182 2443 1723 1311 1165 1284 2048 2791 2688 2995 2355 2184 1876 2073
-374 2073 2546 3045
-393 3045
##PAGE=	F1=-3463.39
##FIRST=	4405.4455391999963467,	4405.4455391999963467,	0
##DATA TABLE=	(F2++(Y..Y)), PROFILE
4405 5076 5026 4730 4126 3435 3080 3384 3943 4354 4337 3954 3081 2344 2166 2163 2996 3282 3253 3107 2334 1483 1488 1738 2583 2802 2779 2406
4161 2406 1787 1080 1204 1791 2201 2435 2517 1874 1396 779 1143 1675 2271 1991 2155 1593 961 644 1168 1683 1997 1962 1824 1158
3936 1158 842 594 1163 1618 1905 1823 1484 1000 351 793 1245 1572 1684 1761 1269 760 348 728 1367 1535 1715 1562 893 605
3711 605 375 1040 1349 1390 1717 1201 779 346 467 954 1393 1638 1412 1001 527 203 654 1026 1391 1567 1317 871 295 240
3485 240 900 1101 1358 1491 1036 754 94 279 986 1380 1285 1266 938 521 86 756 819 1349 1421 1102 812 356 186 738 1126
3250 1126 1291 1435 1025 681 622 661 1235 1055 1382 1414 794 523 272 623 1006 3036 497 1007 893 319 293 633 880 1251
3025 1251 1189 931 636 117 412 696 1191 1138 1077 1039 483 238 479 774 1193 511 2278 429 256 386 825 1049 1146 1187
2800 1187 1002 517 249 496 651 1140 1317 961 930 493 239 608 864 1303 1244 1105 698 309 443 683 1070 1214 1250 1033
2574 1033 619 312 454 990 1030 1323 1175 959 509 349 710 1088 1236 1286 1173 681 520 460 937 1213 1338 1309 1120 621
2349 621 437 639 1025 1123 1480 1318 958 716 664 854 1166 1414 1349 1313 965 639 616 1023 1338 1597 1502 1337 798 629 791
2114 791 1200 1582 1637 1583 1278 759 798 1155 1607 1599 1951 1578 1350 837 1028 1297 1844 1938 2056 1548 1358 1234 1254 1873 2088 2300
1870 2300 2365 1718 1699 1634 1895 2248 2722 2725 2722 2457 2065 2396 2728 3462 3693 4060 3769 3673 3528 4416 5417 6061 9081 8895 10736
1635 10736 11212 6787 160045 276736 367074 234881 107806 22821 9748 6867 5923 4706 6001 2919 4431
1495 4431 3626 3402 2743 2216 1847 1584 1718 2112 1927 2107 1591 1057 502 790 1069 1481 1496 1220 932 385 330 641 1029 1215
1269 1215 1101 803 363 175 458 853 876 981 812 530 352 492 781 849 899 746 480 369 531 833 911 1102 702 487
1044 487 226 648 905 1131 1155 1021 651 259 528 823 1271 1323 1425 915 462 86 984 1200 1671 1722 1494 909 175 632
818 632 1299 1958 2088 1900 1660 960 413 1408 2197 2494 2895 2540 1634 741 1469 3438 651 5832 4323 3358 2046 1200
612 1200 2797 4668 6254 7164 6748 4921 1954 3480 9420 12925 20641 27165 26670 24013 44744 417887 772654
452 772654 832865 453990 65466 49549 38342 27804 18108 9553 2524 3414 6619 8521 8687 7584 5615 3449
302 3449 1702 2585 4063 4932 5136 4422 3426 2079 1353 2144 3261 3777 3956 3372 2269 1174 878 1886 2893 3216 3275
105 3275 2607 1863 625 955 1921 2698 2999 2918 2283 1208 169 1007 2147 2694 2876 2655 1982 1045 339 1467 2144 2850
-102 2850 2800 2597 1830 698 686 1736 2635 3074 3062 2408 1679 989 1287 2345 2951 3323 3536 2629 2001 1743 2043 3171 4103
-318 4103 4157 4372 3642 3254 2866 3229 3919 4606
-393 4606
##PAGE=	F1=-3482.17
##FIRST=	4405.4455391999963467,	4405.4455391999963467,	0
##DATA TABLE=	(F2++(Y..Y)), PROFILE
4405 6547 6444 6066 5270 4444 4037 4425 5090 5607 5545 5048 3988 3029 2757 2906 3864 4210 4190 3917 2983 1940 1938 2357 3295 3583
4180 3583 3565 3084 2241 1416 1621 2289 2849 3170 3168 2393 1719 1096 1505 2161 2874 2626 2691 1999 1257 881 1488 2199 2590 2531 2262
3945 2262 1511 1008 865 1514 2109 2423 2327 1885 1240 509 1046 1633 2005 2171 2214 1591 936 469 994 1754 1974 2202 1955 1147
3720 1147 711 553 1344 1726 1810 2152 1524 947 449 649 1275 1815 2028 1728 1339 629 275 833 1371 1843 1929 1612 1138 357
3495 357 340 1140 1468 1730 1851 1301 939 120 460 1219 1706 1685 1601 1187 612 26 909 1149 1699 1783 1408 983 400 284 953
3260 953 1434 1662 1716 1299 818 589 542 1816 1292 1715 1677 971 621 236 809 1276 3413 222 1293 1055 310 395 837
3044 837 1197 1570 1505 1165 724 99 538 971 1517 1448 1368 1258 470 205 689 1057 1575 934 2348 513 286 440 1013 1324
2819 1324 1491 1459 1233 603 232 632 934 1456 1577 1275 1097 564 271 787 1130 1608 1590 1315 851 332 520 920 1381 1529
2593 1529 1566 1260 689 320 634 1235 1329 1621 1465 1164 565 397 941 1331 1594 1608 1429 841 590 573 1131 1544 1662 1648 1329
2358 1329 764 545 847 1306 1457 1835 1600 1159 823 741 1075 1506 1770 1726 1563 1152 721 770 1322 1697 1968 1819 1591 972
2133 972 727 1012 1550 1964 2065 1904 1532 932 920 1410 2048 2060 2349 1954 1577 999 1261 1687 2320 2482 2452 1881 1600 1461
1908 1461 1634 2345 2672 2865 2836 2025 2025 1995 2439 2895 3377 3319 3292 2901 2544 2947 3510 4267 4648 4934 4595 4427 4284 5483 6807
1673 6807 7458 11235 10893 13099 13702 8338 198199 342957 454305 291226 133446 28297 12071 8385 7230
1532 7230 5804 7443 3671 5675 4583 4201 3387 2618 2182 2010 2392 2716 2524 2546 1855 1230 730 1204 1573 1980 1903 1529
1326 1529 1002 196 615 1080 1522 1629 1396 949 248 313 790 1324 1308 1344 1039 487 374 776 1159 1280 1309 1044 514 317
1100 317 708 1174 1378 1566 1080 675 167 731 1211 1600 1664 1484 958 298 574 1096 1652 1878 1972 1325 723 55 1180 1607
875 1607 2206 2337 2067 1319 395 746 1702 2585 2760 2609 2244 1352 594 1742 2811 3361 3796 3386 2262 1100 1705 3849
668 3849 1435 6495 5504 4405 2755 1512 3474 5974 8093 9216 8824 6395 2706 4070 11015 18019 25899 33053
499 33053 34305 31133 56968 534140 995765 1078580 593435 84535 64153 49687 35805 23546 12487 3241
368 3241 4313 8386 11105 11160 9721 7259 4371 2147 3320 5151 6359 6575 5692 4415 2550 1637 2754 4160 4832
189 4832 5010 4294 2925 1473 1124 2424 3682 4118 4141 3370 2341 751 1209 2503 3416 3845 3713 2892 1540 184 1323
-8 1323 2756 3470 3680 3389 2478 1259 447 1857 2780 3672 3627 3267 2244 939 951 2252 3374 3948 3877 3098 2161 1254
-214 1254 1752 3035 3812 4268 4439 3399 2601 2237 2718 4148 5198 5409 5515 4737 4165 3718 4235 5115 5931
-393 5931
##PAGE=	F1=-3500.95
##FIRST=	4405.4455391999963467,	4405.4455391999963467,	0
##DATA TABLE=	(F2++(Y..Y)), PROFILE
4405 7417 7269 6842 5927 5059 4643 5074 5777 6364 6230 5679 4524 3449 3109 3385 4398 4741 4739 4370 3350 2224 2218 2776 3700
4189 3700 4046 4024 3462 2493 1624 1907 2583 3234 3613 3525 2692 1874 1329 1731 2459 3216 3017 2973 2216 1439 1045 1674 2530 2931
3964 2931 2876 2473 1731 1085 1061 1723 2420 2716 2613 2100 1361 640 1201 1886 2245 2452 2474 1749 1027 557 1173 2001 2210 2483
3739 2483 2173 1278 764 691 1528 1954 2064 2384 1700 1026 507 788 1482 2077 2225 1883 1552 666 326 953 1583 2135 2117 1738
3513 1738 1301 386 440 1294 1690 1946 2043 1440 1023 147 627 1341 1873 1929 1779 1320 651 61 997 1374 1896 1981 1572 1068
3288 1068 390 376 1090 1630 1882 1836 1441 909 642 651 2335 1383 1882 1789 1054 647 212 931 1461 3678 139 1451 1135
3072 1135 265 475 946 1407 1739 1668 1278 728 74 630 1150 1691 1614 1516 1351 396 186 823 1235 1861 1220 2275 578
2856 578 288 484 1109 1488 1694 1586 1332 619 189 701 1131 1634 1694 1463 1143 579 308 899 1284 1765 1785 1393 905 321
2631 321 574 1059 1579 1694 1726 1367 672 292 756 1370 1499 1773 1606 1252 553 400 1094 1465 1802 1766 1550 914 591 660
2405 660 1232 1741 1817 1825 1403 828 584 978 1477 1651 2014 1711 1236 842 768 1211 1718 1955 1938 1649 1220 726 879 1515 1886
2171 1886 2168 1956 1670 1042 764 1130 1781 2164 2289 2042 1629 1005 986 1540 2318 2314 2534 2117 1655 1068 1392 1929 2592 2801
1945 2801 2614 2018 1677 1559 1877 2609 3014 3169 3029 2132 2146 2184 2789 3272 3739 3598 3542 3065 2784 3265 4006 4683 5184 5358
1720 5358 4994 4806 4684 6093 7644 8208 12441 11942 14358 15032 9246 220456 381669 505187 324319 148540
1570 148540 31554 13429 9225 7956 6492 8362 4229 6523 5210 4661 3775 2854 2419 2374 2938 3160 2947 2794 1978
1391 1978 1350 1042 1600 2012 2358 2176 1724 1002 241 937 1479 1946 1941 1583 1032 163 564 1097 1719 1680 1610 1214 366 447 1077
1156 1077 1491 1636 1625 1284 527 213 879 1467 1745 1936 1383 840 171 781 1456 1954 2056 1855 1204 383 583 1286 1931
941 1931 2296 2379 1645 946 182 1298 1882 2582 2763 2484 1641 619 812 1992 2991 3207 3118 2662 1664 757 1928 3186
734 3186 3945 4391 3968 2721 1456 1792 3647 4187 6133 6142 5049 3234 1691 3843 6745 9245 10430 10092 7357 3195
546 3195 4343 11940 21206 29674 36419 38848 35463 64007 600596 1127075 1226077 680158 95923 73041 56614
405 56614 40639 26790 14245 3737 4841 9430 12581 12666 10945 8238 4909 2392 3740 5768 7207 7401 6443
246 6443 5002 2786 1766 3107 4685 5443 5596 4815 3313 1628 1264 2741 4125 4640 4628 3812 2602 803 1352 2859
58 2859 3813 4344 4155 3236 1720 176 1517 3111 3929 4149 3791 2754 1359 536 2065 3178 4155 4111 3634 2454 1089
-139 1089 1135 2572 3815 4464 4321 3502 2443 1421 2068 3454 4330 4800 4945 3848 2971 2537 3155 4759 5823 6159 6158
-337 6158 5386 4707 4239 4861 5860 6720
-393 6720
##PAGE=	F1=-3519.73
##FIRST=	4405.4455391999963467,	4405.4455391999963467,	0
##DATA TABLE=	(F2++(Y..Y)), PROFILE
4405 7472 7302 6877 5936 5132 4749 5177 5837 6442 6226 5694 4558 3508 3132 3488 4468 4745 4773 4356 3345 2263 2261 2895 3699
4189 3699 4085 4040 3450 2482 1660 1996 2598 3263 3658 3497 2705 1815 1426 1768 2499 3212 3072 2930 2187 1468 1097 1683 2595
3974 2595 2938 2913 2407 1765 1054 1142 1736 2475 2713 2609 2079 1333 711 1221 1942 2232 2461 2477 1703 1009 588 1229 2045 2183
3748 2183 2496 2163 1250 755 758 1549 1976 2089 2355 1687 1000 505 848 1528 2116 2177 1839 1592 626 343 984 1612 2198 2086
3523 2086 1663 1324 370 504 1326 1717 1955 2021 1415 987 175 739 1319 1838 1962 1754 1312 624 134 994 1443 1888 1969 1554
3297 1554 1043 321 433 1114 1665 1905 1757 1422 917 766 992 2673 1301 1842 1718 1019 593 227 958 1518 3749 411
3091 411 1448 1112 200 516 932 1465 1718 1638 1243 651 61 679 1188 1667 1596 1495 1292 284 198 848 1254 1973 1396 2107
2865 2107 601 257 512 1087 1496 1705 1540 1274 559 138 688 1197 1630 1633 1484 1056 532 345 915 1288 1735 1781 1317 847
2640 847 271 586 1061 1622 1666 1690 1325 574 241 791 1361 1499 1736 1571 1201 478 358 1130 1456 1811 1721 1502 880 529
2415 529 690 1216 1753 1761 1805 1318 806 557 994 1495 1658 1970 1626 1167 766 739 1227 1752 1927 1936 1550 1148 659 912 1553
2180 1553 1860 2147 1882 1555 993 737 1119 1827 2138 2253 1965 1541 967 977 1511 2350 2304 2464 2025 1565 1030 1392 1963 2593
1955 2593 2821 2505 1924 1575 1509 1926 2606 3033 3140 2892 2018 2043 2163 2862 3290 3721 3494 3415 2920 2737 3279 4104 4614 5179
1729 5179 5236 4881 4731 4649 6110 7731 8140 12431 11814 14245 14918 9298 221943 384342 508513 326839 149755
1570 149755 31870 13520 9204 7956 6629 8548 4452 6778 5360 4680 3830 2881 2518 2588 3221 3320 3101 2796 1945
1391 1945 1412 1319 1868 2276 2513 2248 1769 951 500 1198 1742 2187 2074 1616 1053 277 794 1300 1945 1893 1719 1295 215
1175 215 559 1287 1686 1832 1770 1409 533 152 995 1638 1916 2122 1535 941 273 790 1575 2104 2236 2047 1321 481 566 1355
950 1355 2036 2476 2542 1793 1076 313 1307 1962 2705 2894 2644 1786 792 825 2097 3081 3316 3298 2798 1810 855 1924 3236
734 3236 4101 4531 4133 2877 1688 1757 3135 6321 5246 6145 5146 3381 1698 3816 6799 9403 10546 10260 7560 3339
546 3339 4205 11845 21674 30248 36304 39212 35962 64145 601187 1134962 1239826 693315 96867 74072 57488
405 57488 41240 26960 14301 3996 4832 9587 12521 12810 10997 8321 4929 2373 3745 5763 7273 7414 6491
246 6491 5046 2725 1704 3116 4715 5459 5568 4809 3344 1596 1263 2760 4117 4651 4616 3829 2584 768 1348 2907
58 2907 3792 4377 4136 3234 1698 158 1546 3127 3960 4166 3767 2738 1312 575 2043 3234 4185 4140 3605 2405 1116
-139 1116 1194 2617 3851 4499 4283 3524 2461 1442 2163 3502 4380 4794 4931 3864 3019 2574 3246 4859 5827 6227 6144
-337 6144 5434 4745 4307 4958 5975 6788
-393 6788
##PAGE=	F1=-3538.51
##FIRST=	4405.4455391999963467,	4405.4455391999963467,	0
##DATA TABLE=	(F2++(Y..Y)), PROFILE
4405 6697 6536 6165 5293 4645 4331 4709 5255 5823 5535 5088 4083 3196 2817 3195 4054 4219 4287 3876 2972 2047 2056 2687 3292 3694
4180 3694 3607 3051 2210 1519 1868 2329 2929 3301 3084 2437 1551 1365 1606 2268 2864 2782 2572 1918 1338 1028 1512 2376 2610 2629
3955 2629 2080 1605 921 1094 1549 2263 2414 2315 1831 1163 705 1101 1785 1972 2201 2220 1464 884 553 1153 1871 1897 2242 1927
3729 1927 1067 686 735 1404 1787 1880 2070 1486 875 445 811 1401 1925 1895 1605 1454 519 320 914 1451 2019 1843 1404 1206
3504 1206 309 509 1226 1545 1753 1790 1229 840 199 770 1151 1606 1780 1530 1169 535 190 897 1342 1677 1754 1362 912 206
3279 206 442 1017 1528 1729 1486 1256 829 912 1433 2796 1058 1602 1475 874 472 268 885 1438 3581 857 1293 985
3072 985 140 508 797 1360 1513 1420 1069 517 67 677 1078 1448 1402 1316 1090 184 224 760 1101 1873 1540 1949 578 208
2847 208 519 946 1344 1523 1333 1073 439 117 599 1118 1445 1404 1344 856 437 370 832 1138 1527 1578 1103 694 191 546 927
2612 927 1503 1449 1467 1147 421 190 728 1206 1330 1517 1372 1024 364 280 1043 1303 1619 1483 1291 752 428 648 1085 1575
2387 1575 1507 1603 1091 712 495 886 1354 1480 1716 1366 965 617 655 1116 1603 1689 1725 1288 955 540 864 1423 1628 1906 1616
2152 1616 1274 838 653 984 1667 1899 1965 1691 1291 835 894 1328 2133 2037 2158 1703 1327 899 1260 1776 2320 2537 2153 1626
1926 1626 1324 1322 1772 2338 2729 2789 2455 1714 1747 1942 2644 2944 3328 3031 2944 2513 2423 2980 3785 4077 4639 4600 4289 4226 4190 5539
1682 5539 7043 7274 11213 10553 12800 13398 8467 202397 350477 463642 298267 136804 29168 12328 8327
1541 8327 7235 6182 7946 4264 6369 4988 4254 3538 2691 2445 2582 3164 3140 2951 2546 1766 1398 1461 1932 2297 2396 2095
1335 2095 1655 870 698 1326 1804 2178 1989 1483 1023 424 932 1345 1946 1889 1648 1255 161 646 1342 1688 1820 1709 1386
1119 1386 528 241 1017 1641 1846 2076 1497 948 373 742 1534 2009 2161 2016 1272 546 526 1287 1938 2374 2416 1729 1080 393
894 393 1200 1828 2539 2692 2509 1715 872 781 1986 2835 3053 3102 2608 1749 857 1727 2946 3788 4178 3827 2673 1710 1597
678 1597 2586 6715 4321 5558 4684 3166 1533 3400 6126 8507 9549 9303 6932 3123 3656 10632 19480 27307 32560
499 32560 35310 32507 57323 535768 1017609 1116540 629753 87120 66988 52129 37585 23941 12527 4072
368 4072 4244 8865 10934 11510 9903 7495 4422 2093 3337 5138 6539 6611 5826 4541 2376 1460 2781 4246 4873
189 4873 4930 4277 3013 1381 1122 2478 3658 4147 4107 3421 2291 656 1195 2639 3358 3937 3659 2884 1478 147 1407
-8 1407 2799 3559 3722 3330 2429 1127 552 1796 2930 3760 3713 3185 2104 1016 1114 2375 3469 4048 3766 3163 2212 1310
-214 1310 2012 3168 3950 4257 4401 3439 2734 2341 2967 4425 5204 5604 5471 4872 4267 3906 4506 5431 6120
-393 6120
##PAGE=	F1=-3557.29
##FIRST=	4405.4455391999963467,	4405.4455391999963467,	0
##DATA TABLE=	(F2++(Y..Y)), PROFILE
4405 5277 5158 4883 4152 3717 3491 3782 4172 4656 4328 4009 3216 2593 2236 2583 3255 3288 3404 3044 2323 1628 1650 2205 2576 2973
4180 2973 2830 2363 1740 1234 1557 1838 2311 2631 2383 1961 1140 1165 1284 1823 2256 2221 1982 1474 1082 857 1201 1926 2029 2091
3955 2091 1574 1292 716 938 1206 1837 1888 1804 1416 893 628 867 1450 1529 1737 1760 1091 683 459 966 1519 1421 1788 1520 772
3720 772 577 625 1126 1432 1493 1596 1145 682 344 685 1133 1549 1446 1238 1179 372 263 759 1140 1645 1444 1023 979 220 448
3485 448 1019 1222 1389 1405 928 616 214 717 873 1231 1430 1161 932 405 219 721 1102 1310 1390 1043 704 68 397 821
3260 821 1248 1402 1081 987 662 1016 1832 2751 699 1218 1110 649 316 302 732 1243 3207 1335 1027 780 117 452 576
3044 576 1120 1175 1067 799 367 80 625 851 1085 1080 1031 789 159 240 582 810 1580 1681 1881 528 163 501 713 1068 1194
2809 1194 1016 780 287 137 459 917 1123 1057 1085 584 317 370 672 872 1190 1226 802 487 104 454 689 1253 1098 1110 876
2574 876 259 159 585 940 1033 1163 1062 765 247 184 857 1039 1276 1108 962 562 319 540 870 1250 1115 1273 769 580
2349 580 449 679 1083 1164 1310 998 676 431 532 898 1307 1297 1361 927 690 400 746 1154 1249 1500 1222 894 622 530 759
2114 759 1334 1506 1496 1285 940 646 748 1035 1714 1584 1686 1230 997 707 1027 1410 1835 2018 1645 1203 989 1039 1452 1871
1889 1871 2175 2203 1822 1291 1331 1573 2191 2321 2650 2320 2238 1946 1921 2430 3128 3197 3696 3604 3357 3407 3409 4517 5735 5808 9072
1654 9072 8454 10353 10820 6920 166215 287717 380665 245032 112550 24038 10121 6787 5946 5238 6669 3683
1504 3683 5377 4161 3479 2961 2304 2186 2333 2774 2645 2534 2093 1475 1295 1413 1769 2070 2023 1746 1408 769 766 1283 1654
1288 1654 1917 1700 1206 951 498 941 1217 1726 1665 1417 1098 248 660 1230 1488 1602 1462 1216 499 348 929 1472 1553 1808
1063 1808 1279 856 420 627 1340 1687 1852 1774 1066 548 458 1097 1662 2014 2027 1469 961 401 998 1514 2119 2203 2115 1448 843
828 843 680 1682 2317 2475 2580 2134 1492 759 1377 2383 3082 3412 3122 2158 1508 1312 2112 5222 3605 4531 3777 2646
621 2646 1230 2696 4891 6772 7679 7467 5606 2605 2804 8493 15345 21611 25924 28083 25932 45161 420180 803558
452 803558 886207 504984 69027 53496 41860 30689 18490 9303 4048 3173 7382 8304 9042 7956 5968 3509
302 3509 1623 2616 4046 5184 5189 4609 3612 1824 1091 2184 3390 3828 3836 3348 2403 1030 873 1966 2859 3248 3224 2689
95 2689 1796 497 928 2125 2617 3132 2840 2271 1116 141 1139 2204 2824 2919 2592 1898 844 469 1384 2339 2985 2936 2474
-121 2474 1623 818 916 1906 2758 3223 2893 2512 1759 1054 1651 2536 3144 3322 3478 2677 2185 1893 2388 3565 4105 4445 4300
-337 4300 3842 3386 3133 3619 4358 4880
-393 4880
##PAGE=	F1=-3576.07
##FIRST=	4405.4455391999963467,	4405.4455391999963467,	0
##DATA TABLE=	(F2++(Y..Y)), PROFILE
4405 3543 3490 3332 2776 2564 2425 2611 2837 3214 2886 2707 2156 1842 1521 1800 2253 2167 2335 2049 1552 1106 1134 1566 1714 2091
4180 2091 1889 1546 1182 871 1137 1240 1555 1810 1549 1393 677 875 882 1266 1527 1524 1290 960 760 629 823 1350 1332 1420 1009
3945 1009 900 483 717 789 1297 1255 1195 932 585 500 572 1012 1011 1179 1199 672 455 329 713 1069 867 1242 1035 437 449 453 777
3692 777 993 1025 1040 743 461 229 500 784 1073 936 821 838 227 187 551 754 1166 978 610 698 139 332 753 825 946
3457 946 953 586 364 211 596 545 797 994 736 659 260 222 504 786 870 962 672 468 70 310 572 885 1001 628 683 454
3213 454 1021 2072 2618 303 775 701 395 170 310 536 982 2736 1721 713 537 127 356 321 802 786 658 502 242
2997 242 92 531 566 661 709 709 452 184 228 354 452 1171 1782 1899 472 145 457 436 733 799 659 462 141 154 305 643
2753 643 740 671 776 299 203 338 478 552 799 807 482 278 55 327 403 931 697 698 579 158 146 396 623 682 754 717 490 166
2490 166 89 618 718 864 684 586 360 229 389 618 855 676 897 422 445 447 422 743 787 845 608 364 254 391 621 936
2246 936 838 932 549 417 269 586 808 815 1021 791 503 407 392 499 902 1051 957 835 572 447 567 698 1183 1058 1153 717
2002 717 652 500 744 946 1247 1382 1094 758 651 719 1037 1311 1502 1516 1141 840 885 1135 1610 1568 1840 1521 1456 1345 1348 1740
1757 1740 2287 2170 2564 2473 2291 2450 2465 3273 4097 4060 6480 5977 7425 7738 4984 121151 209561 277407 178602 82176
1570 82176 17566 7378 4908 4348 3981 4979 2823 4012 3050 2522 2216 1776 1765 1884 2138 1938 1948 1524 1119 1103 1180 1417
1363 1417 1653 1476 1271 1076 647 689 1084 1334 1469 1270 845 837 477 822 949 1342 1276 1087 854 317 581 990 1133 1230 1095
1128 1095 937 437 401 747 1170 1111 1383 938 683 398 450 1037 1216 1389 1384 751 480 363 826 1273 1486 1470 1078 749 339
894 339 741 1095 1543 1543 1559 1060 718 533 1253 1649 1715 1859 1490 1104 588 948 1671 2155 2414 2189 1464 1145 938 1691 2647
659 2647 3062 3276 2629 1942 856 1861 3382 4605 5358 5185 3884 1904 1827 5856 10357 14580 17810 19202 17757 30450
471 30450 281248 542650 602553 348233 46790 36724 29089 22265 12205 5654 3993 1826 5296 5462 5988
330 5988 5596 4097 2399 1076 1750 2743 3521 3479 3126 2482 1196 678 1473 2342 2572 2538 2240 1658 624 579 1347 1906 2162
114 2162 2173 1809 1214 329 609 1487 1741 2147 1874 1533 701 121 809 1482 1928 1941 1726 1268 527 349 900 1598 2042 1992
-111 1992 1635 1071 571 647 1317 1878 2219 1861 1727 1206 731 1164 1753 2150 2210 2372 1760 1500 1328 1649 2476 2781 3026 2895
-337 2895 2589 2309 2164 2508 3006 3356
-393 3356
##PAGE=	F1=-3594.85
##FIRST=	4405.4455391999963467,	4405.4455391999963467,	0
##DATA TABLE=	(F2++(Y..Y)), PROFILE
4405 1869 1889 1840 1455 1439 1365 1447 1535 1806 1516 1463 1129 1104 829 1018 1261 1095 1308 1106 831 594 620 915 892 1237 987 774
4161 774 655 503 702 666 821 1017 756 856 259 564 496 720 832 844 640 488 440 397 457 772 672 758 507 511 262 486
3917 486 392 764 644 621 478 309 354 277 563 529 649 654 296 260 193 450 624 371 721 571 135 329 252 432 563 582 519
3664 519 363 256 128 300 427 598 475 439 508 146 111 335 379 687 541 257 419 118 188 484 442 518 528 277 134 188
3419 188 440 235 395 567 349 408 131 205 293 472 449 561 333 251 170 200 326 513 610 219 414 255 910 2093 2443 128
3175 128 367 325 169 77 287 341 713 2305 1924 418 304 141 241 99 474 432 278 258 166 105 412 304 264 369 419 146
2931 146 188 187 125 140 756 1807 1943 419 144 391 174 412 428 334 186 30 142 175 362 380 334 489 63 117 274 294 252
2678 252 432 414 228 112 84 191 131 607 334 319 328 169 131 204 320 356 375 418 272 141 26 381 406 474 299 237 191 166 228
2405 228 383 479 287 552 127 334 464 188 405 437 415 277 92 132 255 341 570 407 530 234 198 163 419 457 426 567
2161 567 416 178 263 265 259 466 628 464 424 275 277 382 391 647 580 662 286 365 320 469 483 679 757 609 395 384 427 611 775
1889 775 852 873 583 447 492 706 1025 859 1064 798 758 821 823 1042 1439 1212 1476 1447 1296 1539 1532 2057 2472 2381 3966 3612 4584
1635 4584 4760 3043 76133 131542 174391 112229 51728 11027 4647 3063 2739 2646 3207 1865 2557 1878 1572 1445
1466 1445 1187 1246 1324 1401 1168 1322 949 756 846 822 961 1149 878 766 723 503 498 780 925 943 794 475 684 372 612 613 886
1213 886 816 736 575 323 425 689 706 792 702 611 345 385 513 806 627 902 560 473 322 236 694 707 881 939 405 360 252
959 252 532 863 910 871 653 497 236 480 665 940 857 969 658 533 362 795 982 940 1105 829 673 392 528 958 1215
725 1215 1405 1240 765 732 550 1270 754 2500 2013 1473 1210 485 1069 1931 2480 3070 2947 2144 1169 929 3259 5639 7793
509 7793 9880 10566 9728 16296 148598 290682 326477 193404 25166 20257 16565 14181 7719 4058 3939 489
358 489 2782 3256 3059 3261 2278 1326 569 926 1510 1902 1850 1693 1393 627 309 805 1318 1377 1312 1188 940 249 310 755 1001
124 1001 1126 1178 974 667 188 308 868 914 1194 973 819 332 83 490 785 1062 994 918 672 252 223 446 869 1133 1084
-111 1084 844 563 330 368 737 1013 1254 891 977 670 414 656 988 1180 1156 1315 887 828 766 913 1390 1514 1654 1548 1384
-346 1384 1277 1202 1419 1661 1872
-393 1872
##PAGE=	F1=-3613.63
##FIRST=	4405.4455391999963467,	4405.4455391999963467,	0
##DATA TABLE=	(F2++(Y..Y)), PROFILE
4405 578 667 676 426 565 515 511 500 703 468 498 319 518 325 386 456 281 507 402 326 188 217 399 257 564 304 204 272 193
4143 193 337 249 243 400 148 445 47 320 224 298 295 305 167 159 183 214 171 305 190 225 163 198 86 294 132 340 163 192 133
3870 133 123 228 39 187 175 240 220 38 160 92 229 290 190 319 210 80 234 63 166 219 247 131 75 99 71 129 127 211
3607 211 145 161 248 157 58 153 105 295 211 76 189 141 53 265 142 183 211 60 42 151 289 49 101 223 82 218 60 177
3344 177 150 233 116 266 135 87 224 94 134 200 299 99 237 121 712 1909 2231 360 95 45 82 56 241 187 491 1994
3100 1994 1915 197 127 153 129 102 198 182 31 170 122 120 291 170 36 131 211 94 160 125 67 215 435 1760 1961 368 134
2847 134 313 80 177 184 94 13 38 98 96 154 109 162 280 137 70 189 154 70 152 128 164 15 106 79 79 342 81 77 187 200 103 54
2546 54 103 120 104 247 184 140 71 195 175 177 28 27 89 120 95 213 201 101 292 125 260 462 136 163 187 105 59 95 104 144 108 277
2246 277 94 230 78 89 83 270 168 170 215 177 39 221 171 90 112 306 119 115 131 162 225 169 199 255 288 166 196 197 252 129 235
1955 235 250 263 195 236 223 250 357 349 384 351 176 223 345 541 377 467 282 313 435 442 458 743 520 624 724 536 825 762 1071
1682 1071 1173 1081 1983 1768 2312 2406 1454 39080 67412 89806 57674 26636 5576 2410 1591 1390 1462 1678 1013 1285
1495 1285 865 790 790 629 716 765 716 488 776 468 453 568 433 505 668 379 320 408 350 255 454 522 464 365 166 505 223 368
1232 368 298 458 387 435 321 277 232 409 309 383 370 305 241 313 278 459 220 467 238 280 221 23 391 285 435 530 110 218
969 218 153 284 514 403 352 286 261 133 257 316 432 282 462 355 341 193 404 438 311 471 304 287 220 190 381 454 589
715 589 464 227 378 220 809 1633 1769 930 509 592 220 449 848 800 1244 1159 740 532 305 1208 2090 2530 3607 3791
490 3791 3325 5279 46818 93772 108819 69468 8111 7095 6620 7909 7585 5836 3880 984 1084 2141 890
330 890 1276 837 481 196 301 574 615 616 581 552 219 47 318 496 463 376 391 376 68 149 299 312 349 418 361 250 100 111 390
58 390 282 444 325 250 133 71 244 241 379 249 324 228 116 136 117 292 423 379 245 190 137 137 270 319 503 172 392 251 171
-214 171 230 383 409 355 500 228 292 317 322 504 536 588 498 444 530 415 565 570 695
-393F95
##PAGE=	F1=-3632.42
##FIRST=	4405.4455391999963467,	4405.4455391999963467,	0
##DATA TABLE=	(F2++(Y..Y)), PROFILE
4405 334 307 119 203 238 148 177 146 232 184 96 228 189 249 14 60 268 24 225 226 75 167 204 132 167 205 219 171 26 92 182 108
4114 108 104 236 204 198 243 148 153 72 36 207 137 33 120 44 103 194 109 87 54 53 170 177 106 151 101 87 76 153 125 85 70 20 65 113 153
3786 153 74 102 195 328 94 38 180 175 93 91 13 58 139 96 7 68 16 78 51 43 66 99 179 47 34 136 42 92 128 54 149 67 124 43
3466 43 30 109 56 131 113 188 154 89 27 98 101 82 147 136 124 91 125 178 17 226 16 71 30 105 257 180 122 489 1597 1972 477
3175 477 154 113 140 36 190 100 347 1770 1723 97 88 168 55 173 62 79 175 204 93 138 186 197 200 91 114 222 130 62 200
2903 200 350 251 1663 1913 332 105 234 190 101 176 74 87 52 40 78 151 49 196 172 226 51 99 63 136 40 95 218 16
2640 16 100 41 204 167 68 175 160 198 66 76 111 19 124 229 191 135 113 108 129 49 124 180 67 80 44 144 99 200 134 222 224 423
2340 423 220 178 95 148 43 183 128 68 47 94 140 102 117 83 33 154 48 118 14 135 135 214 130 69 104 110 122 70 119 101 128 70
2039 70 107 142 61 274 144 129 120 192 66 84 78 142 176 153 37 114 152 107 393 93 164 80 214 306 194 125 290 187 245 141 307
1748 307 316 185 418 187 405 300 433 474 512 868 737 979 1073 527 16254 28013 37965 24190 11237 2192 1009
1551 1009 784 543 605 658 475 428 254 288 390 198 272 309 208 86 386 167 283 314 152 138 302 238 13 173 211 29
1307 29 200 199 161 56 36 321 86 146 111 137 88 225 159 206 57 216 97 114 153 108 148 215 88 194 146 151 112 171 138 157 199
1016 199 179 120 225 118 85 106 174 279 47 44 41 82 71 94 158 117 116 118 231 203 55 169 88 187 62 175 9 112 34 111 140
725 140 207 90 172 157 31 327 1611 906 227 159 186 212 63 451 339 382 170 336 80 253 492 857 875 1164 1204 1024
480 1024 2006 21438 32894 32656 15800 2659 1237 1497 4110 9069 7706 3792 2168 3735 2724 1126 561 289
311 289 114 8 144 114 189 312 227 174 12 100 150 66 112 198 199 38 214 154 36 158 241 117 236 11 84 136 161 92 30 210
30 210 121 176 130 99 91 47 209 167 128 147 117 134 92 45 151 132 90 30 47 56 146 82 309 37 89 106 80 72 70 167 184 185 41 158 49
-299 49 103 136 167 194 125 368 102 185 154 32
-393C2
##PAGE=	F1=-3651.2
##FIRST=	4405.4455391999963467,	4405.4455391999963467,	0
##DATA TABLE=	(F2++(Y..Y)), PROFILE
4405 585 502 335 423 352 310 391 402 373 378 285 439 155 325 177 284 416 163 325 256 176 264 265 250 109 333 329 211 137 27 235
4124 235 235 170 370 109 219 283 143 208 164 171 299 190 52 102 97 187 276 239 99 130 130 115 222 95 281 157 167 72 132 195 203
3833 203 115 73 179 131 146 89 105 232 363 80 107 182 150 194 129 83 25 209 147 24 75 29 182 155 62 91 94 172 51 27 195
3542 195 85 135 113 112 131 119 68 114 95 151 70 152 96 158 188 129 106 123 41 108 119 156 107 179 97 219 54 188 39 99 130 31 297
3232 297 187 164 311 1264 1692 454 204 157 151 10 165 68 288 1562 1427 102 127 184 73 170 134 60 219 216 101 157 109
2978 109 213 241 112 109 259 128 16 270 370 195 1527 1762 330 61 164 229 119 219 128 83 35 58 108 211 97 217
2734 217 143 243 52 24 30 160 98 133 227 35 69 58 248 80 76 235 156 171 31 121 155 22 183 252 197 125 136 124 172 86 145
2443 145 225 80 48 62 138 99 234 63 224 215 358 249 257 102 227 45 183 154 30 118 32 199 113 115 66 38 69 116 109 76 137
2152 137 144 186 128 97 172 22 155 145 85 70 103 56 262 123 31 282 113 85 61 303 151 245 25 84 124 144 145 65 217 66
1870 66 381 115 203 90 45 340 226 156 337 31 158 242 175 368 255 344 277 272 290 227 413 608 662 551 755 822 487 11698
1607 11698 20221 27315 17421 8153 1762 616 653 461 268 424 376 312 365 169 325 168 150 54 130 275 165 128 252
1391 252 122 209 90 98 353 181 47 115 124 149 13 153 127 118 162 78 16 121 84 128 108 132 139 102 139 202 174 67 156 89 128 34
1091 34 61 256 18 168 161 105 276 153 276 46 48 200 24 110 207 159 140 192 61 30 67 21 191 105 284 80 199 167 60
818 60 140 67 344 164 272 165 71 120 213 289 306 270 251 74 133 198 583 266 426 478 86 288 115 480 724 617 469 640
556 640 161 302 840 1309 1882 2327 2438 2503 4236 39853 73408 79295 42932 6415 4444 2818 2391 9313 8345 3633
368 3633 3304 6839 5256 2819 1671 692 327 59 247 194 518 512 440 268 54 139 164 285 252 372 335 122 263 182 59
133 59 277 366 237 320 89 105 174 160 221 183 269 288 196 196 51 205 208 384 241 195 148 118 188 217 174 286 236 143 62 93 169 323
-167 323 125 443 113 162 149 192 169 259 308 305 289 171 248 184 345 295 351 425 326 440 337 270 444 315
-393C15
##PAGE=	F1=-3669.98
##FIRST=	4405.4455391999963467,	4405.4455391999963467,	0
##DATA TABLE=	(F2++(Y..Y)), PROFILE
4405 499 426 291 363 306 286 374 377 311 299 221 442 135 284 164 285 335 137 280 179 173 255 254 192 89 299 289 190 167 52 192
4124 192 201 136 343 84 158 305 111 196 131 182 260 177 52 82 102 183 226 215 80 152 171 106 185 79 289 110 167 34 128 198
3842 198 223 90 32 184 76 112 80 132 223 295 77 94 128 149 245 109 76 27 174 118 13 74 21 205 152 39 70 136 140 54 26
3551 26 180 121 129 40 178 108 121 71 107 73 146 48 130 113 164 149 91 116 91 14 113 96 138 100 180 65 202 61 135 57 101 154 36
3241 36 254 201 186 226 1018 1461 328 199 123 121 64 183 43 298 1362 1128 127 134 186 105 117 166 24 180 192 137 175 63
2978 63 176 195 89 130 228 131 21 287 297 228 1340 1485 347 8 108 202 117 215 131 33 28 117 163 220 86 185 152 210 64
2706 64 26 71 123 98 102 186 78 29 46 235 69 14 223 149 136 23 124 139 34 181 261 201 116 146 167 170 72 88 193 104 24 52
2405 52 137 57 213 71 156 207 286 219 278 118 230 54 124 176 18 123 57 171 106 94 24 52 28 110 65 61 100 112 138 129 91 123
2105 123 34 100 144 38 48 94 35 300 122 37 208 61 41 28 317 122 279 57 14 64 105 179 48 212 90 269 116 201
1842 201 184 36 265 213 98 283 73 78 282 143 320 257 237 289 222 343 280 324 593 596 472 749 733 492 11740 20256 27104
1588 27104 17416 8125 1949 561 580 541 333 478 350 387 422 173 338 276 298 130 220 314 52 129 238 62 275 178 55
1354 55 362 236 44 89 182 187 96 143 176 107 49 120 107 97 153 156 70 136 102 170 120 232 230 76 213 75 92 80 67 254 56 164
1053 164 156 105 328 146 277 90 17 188 77 115 239 127 184 217 51 62 84 97 202 89 291 110 135 181 117 142 95 332
790 332 202 247 231 51 125 206 265 290 267 179 46 165 472 677 504 580 540 148 301 185 354 678 547 420 582 228 187
537 187 733 1096 1520 2046 2102 2309 3589 31925 61155 67636 38578 5470 4011 2534 1833 8013 7689 3369 4358
358 4358 9608 8705 5189 2658 879 415 85 201 165 504 423 390 236 130 136 100 311 157 294 287 150 235 185 26 221
124 221 289 196 276 93 126 156 128 189 143 174 311 163 233 61 174 190 364 198 164 97 98 149 191 137 262 188 124 87 80 173 310 84
-177 84 377 140 154 155 180 152 236 244 274 214 154 265 154 357 223 289 384 278 359 357 213 438 271
-393B71
##PAGE=	F1=-3688.76
##FIRST=	4405.4455391999963467,	4405.4455391999963467,	0
##DATA TABLE=	(F2++(Y..Y)), PROFILE
4405 247 208 117 193 146 145 224 220 140 117 95 340 76 172 77 177 148 55 166 70 125 170 180 57 43 216 183 131 144 61 96 114 52 252
4096 252 102 83 280 130 134 34 164 159 140 85 43 96 114 113 114 132 139 179 119 117 73 239 88 130 15 120 168 186 46 81 138 38
3795 38 65 51 142 187 188 56 43 91 161 258 61 47 48 91 67 44 70 23 182 89 122 30 171 97 63 15 139 141 89 71 224 107 85
3485 85 98 73 15 112 77 110 144 163 81 27 84 91 36 102 75 87 120 143 46 160 61 97 62 97 127 76 175 204 194 254 906 1347 172
3175 172 210 57 99 101 220 8 343 1230 921 171 110 160 121 78 156 51 104 158 161 188 46 108 112 72 148 165 101 50 271 176 268
2884 268 1085 1086 337 49 80 137 115 188 114 59 48 160 216 186 82 139 171 155 70 37 108 82 73 63 123 116 14 11 194 110 67 177 154
2574 154 108 43 104 96 109 160 267 223 111 146 207 135 31 59 131 124 7 52 135 23 199 105 60 181 224 161 257 159 197 125 47 185
2274 185 21 94 107 108 92 117 23 44 63 54 83 23 70 79 91 121 73 21 72 30 108 85 31 66 36 270 188 28 106 9 8 49 277 41
1955 41 254 100 117 45 41 152 51 150 153 116 108 156 221 83 128 147 92 181 137 74 224 82 211 185 131 221 156 299 323 88 407
1664 407 457 321 571 501 325 8729 15042 20349 13161 6145 1555 419 374 463 327 403 201 291 317 96 279 260 346 125
1438 125 221 223 45 84 186 115 240 172 54 269 215 31 99 155 168 113 43 149 74 14 113 140 36 151 92 99 108 124 177 107 190 207
1138 207 130 215 90 102 72 74 187 26 105 115 106 323 120 202 95 9 128 98 113 240 166 163 160 46 53 113 160 167 36 207 67 78
837 78 183 138 128 117 223 181 168 231 38 97 111 145 161 160 54 66 137 545 1408 493 529 458 247 261 248 124 416 232 178 332
556 332 189 6 373 535 519 953 902 1244 1585 11969 23998 27434 17188 2281 1810 1061 2016 5788 6114 2998 5184
358 5184 11635 12028 7912 3541 974 496 190 104 246 332 192 199 115 244 145 11 236 51 108 162 172 174 187 52 88 118 90
105 90 161 94 132 114 57 112 70 22 256 119 233 94 108 95 273 130 89 41 59 72 92 14 151 118 93 100 41 119 192 118 229 162
-196 162 106 141 91 62 114 111 149 85 83 218 58 239 66 117 207 136 182 256 65 274 73
-393G3
##PAGE=	F1=-3707.54
##FIRST=	4405.4455391999963467,	4405.4455391999963467,	0
##DATA TABLE=	(F2++(Y..Y)), PROFILE
4405 59 54 90 122 26 40 80 69 207 102 189 220 100 63 74 81 41 112 118 115 83 57 117 67 99 202 90 83 99 87 36 130 101 174 125 68
4077 68 225 191 77 56 173 69 111 153 4 110 54 13 20 189 122 163 130 92 127 185 160 84 48 109 137 144 30 180 92 89 37 30 141
3767 141 174 104 54 50 117 175 248 71 80 53 35 77 95 68 63 153 29 195 17 188 60 78 44 115 170 47 139 254 124 55 126 62
3466 62 44 94 111 117 174 145 51 45 46 122 66 79 56 22 150 119 73 124 68 92 72 106 87 122 95 192 200 353 870 1331 100 244 7
3157 7 116 108 250 35 389 1227 863 225 76 106 134 113 131 92 32 128 155 187 42 42 37 92 145 111 50 104 238 75 251 762 610
2865 610 275 105 89 68 117 159 93 114 62 184 243 136 95 114 178 102 60 17 119 94 56 87 64 130 37 30 147 150 124 132 161 87 62
2556 62 81 71 164 155 280 249 114 141 229 95 5 118 107 126 51 106 143 80 210 122 45 129 184 109 215 194 163 191 53 172 23
2265 23 70 154 60 103 152 47 15 94 20 133 53 78 55 60 99 58 104 91 63 72 125 19 41 50 216 248 50 37 21 50 93 226 64
1955 64 230 112 189 72 57 100 93 88 218 70 95 110 214 119 34 101 170 97 159 154 135 93 137 148 158 143 131 206 331 197 169 435
1654 435 349 389 398 225 5784 10011 13925 9093 4345 992 400 196 324 283 343 41 168 207 67 176 166 307 63 234
1429 234 96 105 116 127 145 154 146 94 139 166 8 100 80 107 103 94 95 117 28 70 143 156 123 29 132 71 192 145 102 164 146 184 186 111 111 36 98
1081 98 136 54 38 48 106 279 108 120 124 26 104 96 121 229 225 157 101 127 38 142 203 122 133 106 36 131 169 132 154 170 127 172 141 200 45
753 45 70 18 110 28 48 115 98 89 413 1282 118 388 348 366 209 302 184 153 200 268 196 121 153 237 396 406 595 456 390 787 8830
462 8830 14105 13978 7016 1003 772 864 2250 3430 4151 2561 5581 12598 14320 10296 4322 1067 599 304 96 392
274 392 173 33 12 14 318 157 84 160 221 75 100 206 127 194 113 81 71 81 55 109 119 90 34 101 176 112 175 88 199 117 130 64
-27 64 214 152 34 74 15 59 32 99 43 157 106 105 72 73 64 237 102 201 93 133 16 22 47 125 47 111 89 157 77 104 174 118 50 97
-346 97 16 127 130 98 121
-393A21
##PAGE=	F1=-3726.32
##FIRST=	4405.4455391999963467,	4405.4455391999963467,	0
##DATA TABLE=	(F2++(Y..Y)), PROFILE
4405 145 116 149 153 127 100 88 8 334 142 269 148 149 41 106 90 126 137 150 169 70 52 89 120 131 220 55 69 58 92 75 196 150
4105 150 120 119 80 163 219 65 104 171 50 117 206 45 139 66 62 50 203 111 133 118 120 161 156 206 44 54 98 121 117 63 242 56 118 52
3786 52 59 126 184 64 63 87 148 184 225 109 114 35 57 115 135 75 88 152 72 221 18 176 37 92 56 108 182 36 169 265 135 76
3485 76 137 70 65 103 110 131 195 114 81 70 26 127 91 54 43 33 150 129 92 100 84 92 83 114 60 148 35 170 208 467 820 1306 128
3175 128 258 47 135 98 259 71 411 1367 955 267 69 36 156 158 112 109 15 105 130 169 40 18 7 106 113 100 115 171 200 120 162
2884 162 417 143 179 146 118 33 102 124 72 143 69 195 237 93 100 114 158 63 33 24 112 112 51 118 29 119 44 58 102 162 133 106 153 67
2565 67 73 71 86 177 169 298 256 123 133 221 73 20 157 146 104 103 175 158 110 218 114 109 57 164 90 164 195 154 235 105 139 16 67
2255 67 176 40 122 165 49 21 106 76 143 73 84 56 46 69 42 174 83 79 56 122 11 70 44 160 253 57 64 20 85 122 194 108 225
1945 225 80 215 84 112 55 104 72 242 155 65 129 177 122 87 90 205 62 145 200 106 134 111 143 201 84 160 122 283 365 33 463
1654 463 440 332 474 304 5598 9724 13330 8655 4246 695 462 236 227 266 360 213 153 229 169 78 70 218 44 268 75
1419 75 124 197 123 144 108 152 137 33 118 45 92 45 49 89 204 58 172 43 37 137 278 106 108 133 77 274 115 87 201 93 203
1128 203 153 122 104 21 135 149 84 14 23 105 216 128 95 147 52 142 85 138 224 269 171 98 177 57 154 221 112 208 40 74 184 148
828 148 109 196 195 121 153 160 154 47 40 92 164 78 31 183 100 111 183 491 539 312 267 433 174 306 303 45 391 411 273 74 216 364
527 364 613 833 1100 1013 709 1618 17139 31109 33580 18296 2567 1846 1546 1983 1548 2302 2115 5413 12331 15000
340 15000 11690 4898 1147 666 391 119 453 93 113 95 40 313 139 100 134 298 158 101 203 123 193 122 146 149 106 18 101
86 101 93 97 48 112 245 150 92 49 145 112 159 100 189 198 23 119 19 101 78 151 34 197 134 98 122 84 65 287 49 209 117 131 89
-224 89 56 95 179 67 155 127 121 116 23 255 174 125 126 75 26 208 38 220
-393B20
##PAGE=	F1=-3745.1
##FIRST=	4405.4455391999963467,	4405.4455391999963467,	0
##DATA TABLE=	(F2++(Y..Y)), PROFILE
4405 139 114 108 117 166 89 108 55 364 80 263 184 162 62 80 97 122 91 172 164 95 128 57 98 125 199 81 76 46 58 103 229 147 61 96
4086 96 77 119 199 83 110 130 64 170 225 79 185 79 82 42 180 101 104 79 141 149 147 202 76 37 88 112 91 134 256 21 122 76
3786 76 99 97 183 35 99 106 158 188 193 128 121 75 59 135 154 90 92 178 118 200 17 133 32 101 42 87 158 77 167 256 129 103 128 71 53
3457 53 113 72 132 202 75 100 71 33 96 105 45 47 69 112 153 100 81 104 78 86 104 49 148 61 163 213 558 741 1207 107 231 80
3157 80 129 108 246 105 396 1600 1150 285 111 53 185 183 106 110 29 91 109 136 34 31 21 98 57 114 234 234 163 186 58 144 251
2865 251 138 160 147 50 62 83 64 145 83 203 203 68 115 118 118 43 6 70 128 102 55 127 25 93 36 63 66 139 98 102 130 47 72 78 106 149
2527 149 191 319 237 126 123 182 66 40 157 190 66 147 237 171 117 203 93 142 32 157 112 109 160 171 254 130 99 15 69 171 62
2236 62 131 160 31 48 98 110 110 76 73 102 36 36 26 182 66 62 64 88 28 106 52 108 199 41 94 9 108 130 189 111 221 25 201 81
1917 81 135 38 76 94 225 196 32 181 126 89 96 84 187 35 116 197 147 132 68 106 187 65 173 85 180 395 154 396 419 330 479
1626 479 352 5624 9749 13105 8459 4159 596 414 277 194 238 332 321 145 264 251 22 85 111 62 264 110 100 254
1401 254 146 118 131 161 149 22 69 66 88 93 36 68 257 62 193 77 79 124 353 113 155 102 115 345 116 50 237 82 183 131
1119 131 113 88 51 156 167 72 25 77 92 148 151 104 132 58 174 74 151 231 290 163 107 173 88 139 212 143 228 68 98 189 124 85 213
809 213 173 128 93 153 99 34 36 141 164 98 91 188 71 167 53 439 995 349 207 414 153 248 297 122 401 384 268 42 180
537 180 327 603 715 1048 941 703 1456 15019 28086 31118 17864 2430 1754 1379 1213 429 912 1693 4682 10892
349 10892 13948 11722 5112 1195 663 444 104 408 89 83 113 18 230 89 59 144 273 154 70 152 152 172 88 155 161 91 55
95 55 79 66 107 23 105 232 102 35 11 93 83 135 104 155 215 39 140 32 122 102 147 43 181 152 90 149 132 102 249 59 172
-196 172 132 127 113 42 94 161 59 128 129 116 97 2 231 126 183 106 76 32 199 33 213
-393B13
##PAGE=	F1=-3763.88
##FIRST=	4405.4455391999963467,	4405.4455391999963467,	0
##DATA TABLE=	(F2++(Y..Y)), PROFILE
4405 54 135 9 43 179 21 101 145 314 97 212 275 147 79 31 81 73 29 182 131 141 173 56 48 117 143 140 94 61 20 126 232
4114 232 120 41 95 80 110 154 106 105 64 93 233 210 108 243 71 77 37 148 96 85 26 150 101 142 167 144 15 81 103 54 209
3823 209 233 46 133 97 134 58 158 26 154 120 159 188 153 134 107 135 44 137 152 107 85 210 154 154 44 72 42 107 29 45 109 130
3523 130 154 229 113 108 106 68 35 110 16 119 195 41 104 78 54 49 103 63 59 82 52 173 123 68 116 49 78 80 42 132 113 182 210 616 705
3194 705 1084 33 180 117 100 153 212 142 346 1843 1378 284 172 114 212 193 108 105 46 95 109 94 28 40 28 77 10 120 342
2922 342 284 129 217 141 141 471 198 152 171 69 21 48 80 133 111 215 165 70 162 125 81 35 44 108 182 74 63 120 24 68 30 46 48
2612 48 93 43 110 109 30 57 90 119 99 212 338 202 112 112 123 60 67 137 215 26 170 285 178 129 169 78 147 92 153 156 54 105 191
2302 191 246 125 75 47 64 157 136 131 155 5 59 77 121 54 90 72 148 27 10 39 136 89 52 87 48 55 119 99 75 117 15 111 52 115
1983 115 125 202 99 206 51 165 79 126 43 25 128 193 191 57 209 84 36 79 108 142 18 85 155 178 92 14 47 142 112 148 79
1692 79 61 312 211 240 289 335 369 326 4463 7687 10325 6697 3272 460 242 225 189 162 210 333 97 237 293 12 113
1457 113 16 36 203 93 95 276 141 84 140 147 132 24 25 61 101 112 37 61 253 98 180 106 130 103 368 142 153 55 152 390 131
1166 131 53 233 105 138 125 82 68 74 155 160 50 40 108 63 80 157 99 81 47 181 66 156 245 294 120 95 124 115 104 188 178 201 132
856 132 103 153 96 74 196 119 102 42 125 46 47 102 166 109 72 163 153 32 184 92 978 1103 386 167 325 125 161 210 223 262 231
565 231 160 9 88 157 443 269 552 514 307 590 6533 12205 14121 9085 1252 878 678 305 248 213 1287 3545 8572
349 8572 11493 10399 4841 1192 599 467 118 295 194 10 105 55 102 25 19 170 200 104 80 95 185 136 62 130 158 101 106 93
86 93 56 107 32 122 159 41 89 68 59 47 70 96 140 212 93 141 27 129 129 142 44 124 158 96 154 187 105 157 119 115 135 126 93 48 84 98
-252 98 14 71 111 123 49 42 137 27 208 128 56 63 139 39 166
-393A66
##PAGE=	F1=-3782.66
##FIRST=	4405.4455391999963467,	4405.4455391999963467,	0
##DATA TABLE=	(F2++(Y..Y)), PROFILE
4405 40 207 98 99 194 86 112 225 226 227 168 346 136 105 81 76 98 78 185 129 173 190 116 88 124 88 195 104 78 89 143 220 114 95
4096 95 118 97 125 130 123 105 37 143 270 171 131 292 58 72 110 121 97 72 25 155 38 120 130 202 20 77 94 12 252 188 83 172
3795 172 117 156 24 120 64 199 137 160 185 110 145 89 160 61 131 135 118 85 225 179 110 73 19 63 114 74 31 73 172 138 188 96 97 84
3476 84 65 43 87 40 102 173 46 107 98 66 12 82 91 63 74 31 181 161 71 113 31 62 55 29 112 148 204 204 649 801 1089 108 137 151
3157 151 62 201 164 183 274 2017 1579 269 237 147 230 200 108 95 79 113 109 56 31 62 38 60 66 115 421 317 96 228 261 248 571
2865 571 248 156 188 84 49 42 99 119 145 235 148 94 215 135 77 34 79 126 237 63 64 104 27 55 51 23 47 42 53 114 104 24 42 98
2546 98 126 52 220 347 167 79 100 62 54 84 120 218 10 165 313 173 160 125 72 133 129 149 203 15 55 191 203 98 89 85 55 153
2246 153 224 129 155 36 61 53 116 28 114 102 167 24 28 74 62 131 57 120 29 81 103 149 78 70 23 124 93 106 115 214 105 177 87 125 78
1917 78 105 56 23 152 169 156 93 199 68 26 90 153 100 68 55 99 181 47 71 51 103 171 93 70 66 188 227 73 122 350 213 253
1617 253 3197 5380 7351 4804 2268 411 73 116 204 55 46 273 132 179 292 28 94 83 36 114 42 149 270 100 86
1382 86 113 114 109 48 50 35 128 97 54 92 218 140 146 117 169 85 331 170 117 38 182 401 134 113 190 130 95 128 38 50 91 141 138 94 74
1053 74 115 30 29 146 85 21 35 172 63 162 258 287 62 70 56 135 64 162 191 155 189 95 101 63 77 160 61 67 109 116 43 99 169 179 38
725 38 42 219 113 14 150 58 891 836 366 176 206 83 116 147 305 80 60 53 46 93 75 336 203 106 525 236 356 4500 6962
452 6962 6622 3144 900 642 476 500 357 312 877 2255 5830 8274 8082 4077 1111 499 464 187 168 302 90 121 105
236 105 40 44 78 186 149 62 146 104 209 97 85 102 192 145 152 127 53 99 76 161 76 103 148 108 42 33 15 98 161 203 147 132 13 133
-83 133 162 170 56 58 150 106 148 226 101 83 180 68 131 132 69 88 113 45 34 75 97 132 45 90 39 113 217 206 114 75 85 117 167
-393A67
##PAGE=	F1=-3801.44
##FIRST=	4405.4455391999963467,	4405.4455391999963467,	0
##DATA TABLE=	(F2++(Y..Y)), PROFILE
4405 84 239 152 156 202 156 120 247 136 309 136 365 156 119 126 86 153 104 164 165 171 185 162 145 117 55 218 94 92 150 134 197 137 121
4096 121 131 102 143 138 119 99 80 191 262 124 145 307 53 83 175 92 100 69 58 164 19 71 106 235 27 66 89 27 241 138 97
3804 97 216 132 162 33 81 94 211 151 157 177 66 160 81 131 104 127 114 114 91 215 186 82 97 75 87 124 129 90 90 189 116 140 88 96 72
3476 72 56 47 49 76 83 143 72 112 111 59 32 48 115 51 53 68 180 191 79 98 53 48 37 22 102 158 206 211 673 1015 1281 214 131 167 26
3147 26 232 111 221 201 2087 1720 250 293 147 238 212 96 72 113 135 90 37 45 92 50 55 105 113 465 341 70 259 373 466
2875 466 710 244 208 195 95 72 47 104 112 175 256 162 124 243 147 96 34 106 123 264 83 54 79 44 59 77 42 43 14 99 104 110 23 61
2556 61 103 130 32 204 338 145 41 93 33 46 88 118 202 29 138 319 152 190 78 61 116 141 145 237 24 26 168 127 68 118 118
2265 118 50 160 296 135 150 75 76 39 107 58 123 139 148 25 61 111 24 161 43 153 29 99 65 182 87 97 44 137 120 79 102
1973 102 206 116 136 90 92 71 109 90 48 148 156 109 108 165 67 57 119 185 79 109 52 60 159 39 103 93 83 204 44 59 112 107 219 54
1654 54 75 332 131 150 2984 4955 6779 4284 1925 516 191 7 219 44 141 184 212 150 250 64 48 140 113 72 30
1419 30 199 249 58 123 66 83 97 103 82 15 152 66 105 126 180 169 108 109 189 82 265 174 70 61 200 381 121 156 126 145 77 130
1119 130 5 36 106 125 121 150 103 107 31 51 122 82 62 35 159 62 181 260 264 20 55 29 145 33 149 175 115 216 81 71 31 77
818 77 122 22 57 159 123 90 156 214 175 19 34 226 94 33 86 202 336 357 295 199 104 43 149 162 314 76 90 105 78 182
537 182 154 321 449 419 782 500 873 9044 16311 17236 8730 1532 1152 827 747 411 270 472 1083 3189 5022 5347 2953
321 2953 936 383 437 247 77 345 110 122 115 131 92 112 165 137 38 179 136 214 76 104 82 231 163 166 138 42 83 94 187 71
39 71 143 181 114 41 41 61 89 166 187 181 124 13 130 185 193 54 24 129 102 136 228 115 105 202 54 118 142 76 109 138 42 56 105 85 134
-290 134 54 112 85 177 199 258 165 61 61 165 183
-393A83
##PAGE=	F1=-3820.22
##FIRST=	4405.4455391999963467,	4405.4455391999963467,	0
##DATA TABLE=	(F2++(Y..Y)), PROFILE
4405 69 198 147 166 189 176 102 200 73 318 108 332 198 109 127 93 175 81 119 195 133 165 171 167 97 43 198 65 106 182 95 166 159 109
4096 109 128 91 151 142 91 88 107 221 216 84 144 280 52 120 207 56 100 84 66 174 61 15 91 240 25 44 86 49 176 92 92 240
3795 240 140 151 64 51 105 186 159 144 164 28 165 86 57 145 138 103 97 92 177 167 70 120 136 104 135 172 148 122 179 86 91 95 121 74 38 32
3457 32 12 87 62 109 90 117 105 32 64 33 133 25 26 80 176 198 80 89 77 41 23 43 107 145 182 238 689 1263 1533 277 144 161
3157 161 10 243 76 246 160 2071 1810 229 329 118 239 228 79 41 143 156 54 32 62 120 78 55 121 127 482 363 63
2903 63 323 477 794 973 198 277 184 100 69 46 94 116 200 271 185 145 237 157 114 33 125 107 252 102 52 46 66 71 92 73 32 34 123
2593 123 87 120 24 100 114 135 36 164 310 139 44 97 58 34 97 119 174 39 112 306 118 202 38 47 107 144 145 246 29 24 138
2302 138 51 81 142 142 55 168 333 150 130 109 106 38 103 69 106 160 97 28 98 147 76 169 43 178 43 107 26 197 86 117 57 158
2002 158 130 41 79 176 110 81 78 74 57 136 144 48 114 141 64 104 141 66 66 133 191 97 128 102 64 124 58 94 122 69 201 93 52 106 92 193
1664 193 121 150 243 188 19 2928 4981 6782 4110 1833 574 280 86 205 102 245 125 241 154 180 104 45 172 176 107
1429 107 74 208 220 74 148 43 60 94 154 89 62 158 45 161 141 150 171 70 89 186 81 191 146 33 70 201 338 98 163
1156 163 61 140 88 127 35 25 117 105 117 178 113 91 39 84 90 107 111 50 141 61 207 245 229 35 80 61 142 21 150 136 85 203 89
847 89 77 28 66 99 6 62 162 117 133 200 228 150 44 38 175 91 46 62 342 380 104 194 187 49 40 179 160 239 105 112 130 90 236
537 236 122 256 408 422 729 462 797 8330 15236 16537 8640 1446 1103 763 549 404 157 119 234 1114 2365 2802
330 2802 1706 686 264 391 270 113 311 66 80 83 171 126 116 100 119 21 161 142 195 91 111 81 245 141 143 118 15 58
67 58 83 196 112 128 183 81 62 50 80 57 121 164 191 122 20 114 193 182 36 39 103 81 123 189 144 137 177 74 90 152 87 119 135 44 55
-261 55 99 59 123 25 99 144 169 152 265 170 29 29 166 153
-393A53
##PAGE=	F1=-3839
##FIRST=	4405.4455391999963467,	4405.4455391999963467,	0
##DATA TABLE=	(F2++(Y..Y)), PROFILE
4405 55 108 104 159 164 149 83 116 69 273 133 274 241 81 93 98 168 43 88 201 95 135 143 160 104 46 143 46 121 181 52 138 169 79
4096 79 118 92 148 122 51 104 114 230 156 62 128 218 48 170 205 30 99 104 53 184 91 78 82 224 24 33 79 55 81 57 93 230 138
3786 138 130 99 38 104 135 157 119 146 4 154 94 36 175 162 104 69 81 121 124 73 146 183 110 145 193 190 138 148 59 44 119 152 87 14 29
3457 29 40 79 38 75 100 123 89 16 99 62 142 38 2 68 177 176 69 98 89 44 8 68 124 120 135 264 679 1456 1707 283 153 138
3157 138 28 238 97 251 183 2031 1886 214 335 73 241 242 78 14 169 172 39 23 76 142 124 53 115 147 482 390 81
2903 81 390 554 1111 1247 145 318 154 97 49 51 80 128 218 275 199 152 201 160 120 32 138 93 203 107 77 30 84 77 90 92 34 54
2603 54 125 79 132 41 135 133 140 44 109 266 145 70 108 81 17 126 111 141 41 123 282 78 192 41 53 110 165 151 227 22 40 134
2302 134 116 132 155 152 72 171 328 158 95 130 131 41 112 60 70 160 46 39 133 178 105 162 107 191 72 102 38 194 90 114 61 183 127
1992 127 17 42 131 88 26 92 70 47 160 201 45 59 124 36 99 149 70 58 127 181 143 125 154 85 89 78 56 150 67 166 154 39 73
1682 73 74 152 191 177 95 252 135 2309 4142 5721 3398 1543 513 288 146 155 108 274 151 203 145 105 141 80 193 207 129
1429 129 107 176 192 103 147 76 36 104 186 70 115 141 41 201 140 124 147 38 67 162 69 123 92 17 62 181 278 71 136 17 115
1138 115 113 116 45 15 121 78 123 170 104 75 24 100 57 152 139 74 113 60 226 216 199 44 123 72 129 27 154 87 55 160 130 85 54
828 54 52 94 10 74 125 90 163 219 213 111 58 68 85 92 59 92 369 733 300 90 131 48 51 173 109 126 38 54 112 86 247 14 114
518 114 184 152 396 190 319 3760 6434 7200 3600 734 566 360 191 313 209 153 220 456 836 956 601 417 151 335
293 335 260 207 223 43 24 32 160 150 106 11 91 66 105 135 153 126 134 108 236 93 99 79 25 22 72 205 132 76 156 25 90 55 73 14
-27 14 42 139 191 122 23 85 198 146 44 52 84 62 112 120 171 136 126 112 57 164 77 147 120 59 58 68 18 100 45 71 177 108 103 248 136
-355 136 44 44 129 82
-393H2
##PAGE=	F1=-3857.78
##FIRST=	4405.4455391999963467,	4405.4455391999963467,	0
##DATA TABLE=	(F2++(Y..Y)), PROFILE
4405 95 27 55 171 138 96 101 89 79 214 204 231 267 54 57 96 162 77 111 178 114 97 97 141 141 61 72 69 134 153 75 121 164 73 108 121 133
4067 133 89 14 141 112 222 112 57 108 141 42 211 183 26 100 112 35 195 114 131 84 195 34 80 63 53 51 53 116 184 125 115 134
3767 134 51 100 73 144 88 127 28 130 102 114 191 187 111 35 65 60 63 95 168 205 101 146 193 209 134 110 53 2 154 173 104 10 56 64 60 28
3429 28 44 104 138 82 53 128 90 144 91 25 50 180 132 53 115 88 55 36 80 140 95 76 265 610 1519 1720 238 156 107 45 228
3138 228 151 235 251 2036 1994 211 309 28 247 255 110 7 195 178 79 23 86 157 172 52 98 154 477 423 109 431 573 1310
2875 1310 1403 125 315 111 89 36 63 77 138 230 263 195 141 153 152 114 33 145 99 131 106 107 44 95 67 70 93 57 76 114 94 145 71
2565 71 152 148 144 57 65 212 155 79 118 93 3 158 93 109 36 164 255 51 167 68 76 119 209 160 184 27 63 159 212 187 154 152 94 168 287
2236 287 145 56 131 135 41 133 50 34 136 67 63 157 203 111 151 170 194 96 85 61 178 110 112 66 199 123 56 9 87 79 54 123 67 53 168
1908 168 242 70 15 106 31 110 168 85 45 116 167 187 111 181 103 74 98 12 177 80 116 185 11 53 64 100 268 159 79 270 261 1737
1607 1737 3360 4623 2881 1367 381 250 188 96 85 242 212 121 111 61 167 93 214 201 125 129 128 171 103 120 115 23 128 201 39
1335 39 163 106 35 215 135 107 105 52 50 132 61 68 38 27 42 142 211 43 103 41 77 137 102 42 18 113 50 127 135 86 65 34 96 31 198
1006 198 148 94 74 65 230 186 192 39 156 65 114 41 151 46 23 112 169 80 80 58 100 33 104 74 53 173 207 182 79 85 115 43 83
696 83 76 103 270 643 223 55 71 82 41 134 55 69 79 33 117 78 226 130 49 173 255 59 182 355 2364 5232 5240 3148 205
424 205 109 206 418 242 283 275 305 871 851 543 162 199 65 280 231 287 130 102 76 13 113 170 101 75 81 108 55 148 93 157 169 134
124 134 217 46 63 48 67 34 92 214 135 54 107 60 110 51 70 24 74 115 188 118 32 60 202 112 69 58 70 80 112 55 178 108 81
-186 81 143 55 183 57 188 128 88 72 52 21 72 110 69 187 35 84 225 92 83 107 85 21
-393B1
##PAGE=	F1=-3876.56
##FIRST=	4405.4455391999963467,	4405.4455391999963467,	0
##DATA TABLE=	(F2++(Y..Y)), PROFILE
4405 117 65 10 191 101 55 120 127 55 170 260 221 264 44 61 75 177 121 142 134 158 55 53 127 167 69 10 102 139 111 115 105 153 87 93 151
4077 151 112 72 6 163 110 200 93 64 106 82 55 227 162 11 104 99 30 200 139 148 93 158 65 143 45 52 126 92 137 109 110 125 166 73
3758 73 102 14 119 63 112 49 110 110 149 191 198 117 5 52 20 25 134 177 199 81 136 175 201 116 80 59 36 186 181 120 19 73 68 44 45
3429 45 22 109 162 97 83 142 105 144 146 45 50 180 88 53 124 78 68 71 73 145 73 56 231 462 1425 1552 162 156 81 56 220 208 200 328
3110 328 2124 2155 225 261 33 255 267 155 9 217 168 115 52 89 164 204 57 84 142 466 454 136 433 526 1353 1402 143
2856 143 278 79 79 41 67 89 141 233 235 170 115 113 135 97 36 142 116 52 112 124 50 98 42 34 78 85 95 101 121 151 105 145 144 143 78 89 157
2509 157 161 66 120 99 5 174 69 86 39 206 224 54 134 83 96 122 256 167 128 48 80 185 281 232 142 142 109 155 223 107 34 109
2208 109 113 44 156 66 32 94 108 97 160 212 100 144 201 194 101 59 65 150 129 130 85 194 126 95 51 53 97 103 139 59 68 162 254 100 59 85
1870 85 36 132 176 104 38 110 157 206 104 175 113 92 110 18 186 93 78 178 32 47 93 42 305 116 211 235 327 1935 3638 4675
1588 4675 3116 1468 261 202 211 79 83 182 257 33 72 72 175 85 225 170 106 139 101 157 74 81 142 53 153 202 17 199 71
1316 71 25 197 129 105 56 103 38 131 94 24 48 49 17 93 142 17 97 70 50 142 96 43 36 92 33 119 89 72 66 90 79 20 226 144 99
987 99 32 76 218 170 204 32 167 56 112 54 137 31 33 82 182 62 99 84 112 59 140 33 36 163 171 148 76 119 161 116 59 95 89
678 89 107 357 158 95 90 122 16 84 88 95 186 93 147 68 185 195 169 308 514 325 403 676 5125 11434 12151 7398 641 495
415 495 454 601 280 297 276 159 769 923 747 509 86 57 233 200 325 71 125 121 34 62 185 113 133 83 115 76 177 42 170
142 170 186 137 191 29 61 34 98 83 121 204 129 89 46 124 112 31 90 31 150 97 184 109 52 67 192 101 76 52 53 115 129 59 157 67
-177 67 66 151 88 209 66 211 157 98 73 67 44 52 151 84 175 46 83 191 67 100 148 59 59
-393E9
##PAGE=	F1=-3895.34
##FIRST=	4405.4455391999963467,	4405.4455391999963467,	0
##DATA TABLE=	(F2++(Y..Y)), PROFILE
4405 101 78 43 189 44 66 110 131 21 141 273 226 234 49 75 47 208 138 150 94 181 35 28 128 159 71 58 132 133 75 131 77 144
4105 144 86 68 159 88 79 5 152 110 170 83 78 133 79 102 209 151 31 108 69 30 199 169 127 102 121 114 201 62 54 179 148 139 18 110
3786 110 154 188 93 115 33 86 56 102 67 109 125 131 174 190 119 30 42 44 86 179 171 168 56 115 148 172 90 71 68 66 204 177 132 20 68 57
3448 57 39 62 29 121 186 122 98 137 108 144 195 59 73 173 90 76 119 65 81 102 57 138 63 118 171 240 1212 1253 147 157 71 64 215
3138 215 259 154 399 2281 2349 252 211 67 260 275 193 44 225 142 133 91 89 165 212 70 87 117 447 474 155 397 433 1276
2875 1276 1294 170 239 83 71 41 55 101 134 223 196 130 83 95 118 75 41 125 128 21 130 125 36 93 27 18 51 111 103 92 143 147 133 115
2556 115 116 132 110 145 116 153 42 112 102 8 165 43 76 71 231 185 66 104 82 108 116 284 164 74 71 84 194 313 259 124 125 111
2255 111 131 163 57 57 74 73 52 172 97 47 43 128 132 143 201 80 141 187 194 81 52 53 118 132 155 115 166 135 124 89 43 111 126 127 52 80
1917 80 151 232 116 96 57 42 151 169 122 48 112 145 193 110 143 108 120 105 24 169 104 70 139 81 21 115 20 271 65 284 172 317
1617 317 2163 3939 4873 3290 1469 194 146 207 101 116 134 267 33 55 101 166 73 211 129 84 133 98 145 30 45 151
1372 151 83 163 194 16 218 71 19 149 115 106 17 154 31 170 147 15 75 74 12 44 76 7 105 96 67 121 102 54 60 61 35 92 49
1063 49 69 75 141 55 21 225 130 86 8 88 196 170 211 39 153 55 131 62 113 46 64 72 160 36 112 110 127 90 164 18 52 138 128 119
743 119 91 145 203 164 31 111 67 22 552 402 94 132 145 48 76 126 92 240 97 154 48 133 164 241 281 563 396 434 637 4623
462 4623 11148 12044 7758 590 489 441 510 302 279 201 69 385 687 550 500 63 91 199 172 311 51 110 133 59 61 193
217 193 142 151 77 85 118 196 66 159 165 115 153 38 71 17 104 123 134 166 119 102 36 166 96 34 117 26 189 90 178 98 77 93 161 103 68
-111 68 36 36 143 158 93 115 59 61 135 120 239 102 196 180 80 50 78 50 57 150 86 157 71 77 135 58 91 153 64 67
-393F7
##PAGE=	F1=-3914.12
##FIRST=	4405.4455391999963467,	4405.4455391999963467,	0
##DATA TABLE=	(F2++(Y..Y)), PROFILE
4405 86 61 106 162 30 89 72 86 82 122 240 227 186 69 72 66 239 131 136 106 174 59 21 142 124 74 95 160 120 68 120 58 140 63 47
4086 47 138 67 81 17 113 105 142 73 93 171 103 158 163 139 85 106 34 20 194 206 82 109 98 171 243 109 57 203 201 121 73 132 184 197 105
3758 105 139 65 61 60 93 80 125 145 82 143 163 116 55 36 68 147 222 155 120 36 87 117 132 64 74 84 84 202 169 142 26 48 37 40 69 56
3419 56 141 204 141 99 119 101 149 231 66 106 165 130 103 103 53 89 123 60 126 71 186 112 135 976 948 269 155 82 69 208 297 106
3119 106 451 2451 2522 281 182 101 257 276 212 85 216 107 131 129 90 158 193 84 99 100 412 478 160 331 328 1151 1178 199 226
2847 226 100 67 29 32 107 122 198 152 84 52 93 112 56 49 94 123 73 155 120 23 81 55 64 26 136 98 85 150 137 150 68 73 112 150 194 102
2509 102 129 30 95 105 26 139 18 75 117 237 132 64 81 72 115 105 283 147 47 91 75 183 305 263 110 101 101 98 138 51 83 52
2208 52 35 62 174 122 51 14 128 158 116 167 55 137 131 189 50 86 34 99 114 169 140 124 140 140 112 66 107 115 98 64 85 140 185 114 116
1880 116 25 43 159 155 135 81 118 129 157 114 103 88 139 86 19 132 120 69 85 122 30 107 52 172 32 295 159 244 1919 3494
1598 3494 4333 2919 1213 161 85 175 110 147 138 239 54 47 134 157 78 167 90 58 108 89 129 16 33 138 98 152 177 24 219
1326 219 95 12 77 89 91 37 195 32 219 191 56 80 91 44 4 19 26 96 118 101 76 120 61 89 39 40 50 36 77 85 168 27 32 196
1006 196 110 60 34 94 168 174 202 60 128 51 152 66 87 80 91 67 109 8 118 129 142 121 168 40 73 108 109 101 104 159 236 181 37 115
687 115 58 46 736 523 51 143 142 94 113 130 77 232 75 131 19 75 55 292 121 423 274 315 311 1637 5543 6121 4815 322
424 322 241 304 247 249 246 116 237 213 395 191 287 81 109 178 145 254 71 102 118 102 92 194 172 137 63 32 152 190 106 123 108 88
124 88 110 49 72 38 77 141 127 107 101 81 86 176 73 82 136 65 185 91 176 96 99 113 127 103 70 28 39 162 194 108 81 105 53 105 138 262
-214 262 132 147 184 46 24 75 60 80 108 72 164 69 77 86 47 70 129 96 43
-393D3
##PAGE=	F1=-3932.9
##FIRST=	4405.4455391999963467,	4405.4455391999963467,	0
##DATA TABLE=	(F2++(Y..Y)), PROFILE
4405 113 65 159 121 99 98 25 12 132 119 178 211 137 93 57 104 262 115 118 150 144 83 15 152 87 79 107 182 107 83 97 92 130 32 58 97
4077 97 53 63 41 61 89 126 63 106 202 121 202 103 114 131 96 7 11 195 244 36 113 106 222 264 153 55 211 238 100 151 158 200 193 108
3758 108 161 85 63 56 80 84 140 162 87 97 124 106 76 38 80 190 255 141 67 26 62 86 95 46 73 101 92 180 160 153 41 43 18 42 70 87
3419 87 166 214 147 91 97 90 160 254 63 142 159 163 120 78 46 92 136 79 119 88 230 90 381 826 761 426 146 101 72 195 320 69
3119 69 479 2568 2616 304 172 133 243 267 203 111 191 72 117 158 91 146 158 90 107 109 358 464 153 248 245 1044 1135 237 225 103
2837 103 65 28 21 106 113 158 110 46 28 96 122 50 57 56 100 104 179 122 44 69 86 106 40 156 84 77 137 127 151 27 57 93 188 227 113 93
2499 93 38 77 101 56 109 2 71 160 222 71 45 70 62 119 92 251 116 61 115 56 160 265 240 103 77 84 73 155 94 92 71 53 70
2189 70 156 129 46 53 119 166 91 119 35 131 51 174 34 127 24 101 87 168 147 84 136 143 121 96 92 80 73 90 83 131 131 100 121 18 35 156
1851 156 144 144 120 123 116 113 105 72 62 140 64 27 93 136 52 39 144 80 81 59 73 48 262 207 141 1446 2630 3396 2224 869 142 88
1551 88 128 98 162 179 186 45 21 163 170 100 105 63 31 71 67 108 49 47 117 97 124 149 49 202 109 20 10 70 55 73 224 44 254 214
1232 214 98 67 96 73 22 31 39 63 134 132 25 145 56 122 68 42 26 49 93 91 161 6 47 151 87 34 46 92 139 168 178 86 106 42
912 42 158 65 60 122 118 60 59 32 119 140 151 144 155 74 88 77 119 90 110 162 256 179 66 108 69 47 566 440 82 123 125 122 140 110 90 186
574 186 115 104 12 11 81 332 67 217 80 214 144 2351 1501 1736 1468 669 416 400 137 172 192 89 295 382 264 183 55
321 55 130 109 168 118 174 121 116 89 142 111 192 187 106 44 32 175 161 125 65 33 81 84 57 64 97 19 128 108 49 70 36 116 156 60 128 147 116
-27 116 149 88 179 105 116 121 121 99 94 37 45 182 230 106 85 151 45 84 143 266 144 92 167 44 42 56 91 107 41 58 191 61 83 120
-346 120 49 66 97 137 45
-393D5
##PAGE=	F1=-3951.68
##FIRST=	4405.4455391999963467,	4405.4455391999963467,	0
##DATA TABLE=	(F2++(Y..Y)), PROFILE
4405 139 96 182 87 144 94 12 60 141 128 113 180 106 106 46 118 271 99 112 180 107 90 16 141 85 74 94 190 98 96 76 145 102 36 85
4086 85 59 48 26 60 30 58 122 51 113 217 138 217 41 80 153 78 6 33 210 280 37 111 131 253 263 179 47 214 252 102 207
3795 207 172 196 177 107 171 94 78 40 56 77 145 170 157 40 82 89 92 49 79 212 272 141 40 28 47 60 67 42 60 108 95 137 153 172
3476 172 56 65 5 40 67 117 186 217 137 77 78 89 174 264 53 171 152 173 123 47 48 91 142 88 121 99 240 96 607 846 648 552
3175 552 130 113 68 174 323 53 480 2592 2595 314 160 160 220 243 160 109 159 48 103 177 85 131 121 84 105 131 291 435 139
2903 139 171 201 986 1182 284 206 86 63 51 45 101 114 107 73 19 16 98 140 57 64 37 64 109 194 136 64 64 106 138 72 167 71 68 107 123 137
2565 137 55 93 91 213 236 133 60 38 65 82 90 87 19 60 187 188 30 29 66 61 115 83 197 71 77 142 34 129 203 194 100 59 67 76 184 127
2227 127 78 100 90 78 124 113 39 87 111 152 75 93 37 128 36 151 41 153 29 110 73 154 136 65 128 139 119 113 93 89 82 113 80 126
1908 126 94 85 115 45 18 145 140 146 154 127 111 82 87 55 57 121 48 39 64 139 33 39 144 113 61 49 134 75 204 231 46 1190 2054 2724
1588 2724 1590 664 128 142 84 77 164 209 125 39 26 176 203 132 60 47 20 36 57 87 69 65 113 84 89 107 81 170 103 58 91 89 35 109
1269 109 238 65 262 213 134 46 89 92 35 56 47 29 138 154 44 169 41 157 117 51 64 63 117 96 121 38 60 105 65 28 40 81
969 81 107 151 146 107 95 35 141 58 32 163 154 57 80 65 119 148 147 150 133 103 92 47 128 82 104 157 257 174 92 97 96 200 219 228 164 91 109
621 109 125 141 88 102 150 175 96 34 66 184 337 179 114 84 238 387 4388 6014 6473 2828 958 656 529 248 146 141 90
368 90 245 370 237 275 118 161 93 161 98 88 168 106 58 157 112 196 178 78 12 67 186 119 127 13 47 84 95 68 49 159 58 88
67 88 88 34 24 15 116 112 62 152 153 151 98 72 177 121 126 118 143 98 116 40 35 206 258 95 97 178 34 81 138 246 137 81 133 69 65 20 125
-280 125 128 42 60 204 58 76 185 71 79 77 168 78
-393G8
##PAGE=	F1=-3970.46
##FIRST=	4405.4455391999963467,	4405.4455391999963467,	0
##DATA TABLE=	(F2++(Y..Y)), PROFILE
4405 133 114 168 70 160 84 30 110 106 129 79 147 99 101 52 103 260 85 123 183 84 86 22 102 108 62 63 179 97 97 73 185 62 66 102 55 51
4067 51 24 70 43 20 121 40 112 215 163 199 12 60 144 57 10 57 234 308 66 98 149 258 245 181 35 220 245 127 235 171
3786 171 169 155 114 164 98 89 26 22 68 139 173 220 24 49 67 104 60 69 209 274 159 75 40 52 43 48 46 38 98 105 81 144 197 66 86 10 37
3438 37 64 138 192 211 114 60 59 108 189 264 39 180 140 164 111 21 63 92 145 74 124 100 211 95 743 1043 487 609 125 113 56
3147 56 147 303 57 458 2517 2461 311 136 175 190 204 87 78 131 41 94 183 71 117 103 64 90 146 223 397 128 122 193 978 1272
2865 1272 335 162 59 63 77 75 93 127 54 42 5 16 97 158 69 69 55 44 90 197 156 68 72 116 159 96 168 67 62 72 122 115 91 131 112
2537 112 217 222 149 57 24 61 43 120 74 34 51 192 139 66 60 63 66 104 80 140 19 80 170 36 97 134 135 104 53 59 94 204 138 47 115
2208 115 117 93 98 77 35 114 106 116 58 119 52 131 98 134 40 156 34 107 78 134 119 71 132 137 111 109 127 163 115 126 79 126 85 78 102 78 22
1861 22 131 139 142 174 138 116 75 87 63 76 94 45 42 43 127 52 65 129 122 57 70 214 107 134 205 16 1117 1840 2302 1195 610 111
1560 111 161 55 68 157 207 71 58 84 170 226 166 64 44 36 25 72 79 79 78 131 69 60 55 106 125 77 104 165 125 73 146 239 92 241 193
1232 193 158 33 73 103 38 59 49 59 130 171 85 190 26 187 162 69 98 75 147 104 62 72 68 73 51 43 22 68 75 126 111 118 92 47 101
903 101 48 11 197 197 70 132 93 120 154 131 136 115 114 82 37 118 75 87 150 239 172 114 88 123 324 425 37 213 64 106 104 120 75 109
584 109 160 195 109 41 144 229 287 168 105 108 221 402 4078 6125 6486 3010 849 621 469 209 152 165 71 138 193 167 177 132
321 132 148 67 156 101 13 192 46 29 137 97 211 152 68 55 74 182 76 129 77 108 86 118 96 29 210 136 36 79 61 33 56
30 56 93 58 63 147 153 160 46 51 160 137 127 112 160 106 124 47 16 228 272 85 92 184 28 85 128 204 121 111 97 80 74 35 141 142 107 84 186
-318 186 54 71 225 90 89 78 180 92
-393I2
##PAGE=	F1=-3989.24
##FIRST=	4405.4455391999963467,	4405.4455391999963467,	0
##DATA TABLE=	(F2++(Y..Y)), PROFILE
4405 103 111 126 66 157 73 47 130 55 113 89 133 99 81 61 84 229 72 148 165 83 79 28 44 126 66 41 150 103 87 93 205 52 91 102
4086 102 65 60 75 74 56 24 119 54 102 199 191 153 55 74 110 42 26 74 252 320 93 74 149 235 215 162 32 225 225 154 238 157 129 137 134 144
3748 144 97 91 43 22 75 125 177 255 87 39 50 112 68 53 184 265 186 124 59 87 38 38 53 18 83 121 23 131 221 70 95 18 38 63
3429 63 143 179 194 85 41 43 135 198 254 33 163 121 144 94 33 84 100 144 47 122 94 154 88 770 1311 420 583 155 103 38 118 263
3128 263 74 420 2364 2238 302 113 172 157 150 20 50 115 42 90 178 60 103 113 39 63 148 175 353 126 106 195 986 1330
2865 1330 378 109 50 76 100 103 83 142 32 27 35 22 94 170 79 73 69 75 49 185 178 56 84 122 170 106 161 79 58 54 120 94 111 150 138 201
2527 201 190 154 80 13 59 15 141 61 54 61 172 78 105 107 59 73 90 87 116 39 73 196 74 70 79 75 119 55 57 102 210 131 37 111 132 115
2189 115 111 40 37 131 94 62 29 155 63 137 129 129 38 137 32 93 84 105 109 83 149 145 102 94 175 238 150 128 86 133 88 75 87 115 49 116 136 131
1833 131 177 156 121 92 119 96 91 73 53 39 29 111 77 94 108 115 47 117 244 146 71 157 29 964 1559 1891 1184 664 112 126 42 77
1532 77 144 173 26 71 142 157 224 188 71 50 58 44 80 86 85 83 147 56 65 3 115 74 37 148 225 150 111 181 231 120 192 165 166 55 59 111
1194 111 40 42 46 97 114 184 113 206 24 204 194 93 115 90 177 120 15 97 77 61 50 68 23 59 45 102 74 120 99 64 52 61 46 222
875 222 238 107 172 111 122 160 107 107 101 106 63 74 96 65 69 143 207 169 133 82 141 349 596 30 209 47 114 79 93 72 156 190 162 138
556 138 36 211 226 196 72 56 71 109 240 2031 3134 2772 1051 410 343 244 99 164 228 38 38 54 86 53 73 97 41 151
293 151 120 58 196 48 8 93 73 234 128 77 129 57 165 45 138 135 146 95 134 145 22 242 195 46 87 94 87 80 58 9 49 115 146
-17 146 147 20 43 125 148 118 111 161 126 121 80 41 239 268 83 83 178 62 85 114 149 106 131 82 76 73 97 132 147 156 121 143 44 104 228 96
-355 96 90 93 173 80
-393H0
##PAGE=	F1=-4008.02
##FIRST=	4405.4455391999963467,	4405.4455391999963467,	0
##DATA TABLE=	(F2++(Y..Y)), PROFILE
4405 75 93 79 59 150 65 77 127 48 84 103 135 92 58 65 97 183 60 176 141 92 79 38 15 129 88 68 118 114 75 125 204 82 106 83
4086 83 61 73 117 77 66 47 116 81 84 173 214 94 87 96 66 46 47 87 254 312 116 48 130 194 182 130 46 222 204 171 220 140 96 134 161
3758 161 121 90 85 67 65 96 108 186 265 139 53 60 116 78 37 142 248 211 166 78 143 46 44 56 29 87 139 52 109 234 70 99 25 49
3438 49 70 131 150 162 54 30 33 152 199 235 36 125 100 122 83 58 106 114 138 49 119 85 88 96 694 1505 666 486 202 93 22 82 205
3128 205 99 372 2160 1962 295 113 153 127 86 110 92 112 42 81 168 85 85 136 35 25 139 163 306 135 105 197 960 1305
2865 1305 399 93 73 108 116 127 68 148 56 49 68 28 89 169 77 82 69 115 6 161 193 36 90 124 171 98 152 108 54 58 111 88 114 148
2546 148 156 169 146 147 98 35 56 75 149 49 80 80 136 14 131 154 56 73 78 103 143 89 67 217 120 49 70 30 140 62 57 93 205 114
2227 114 77 92 136 137 149 49 43 135 75 4 16 166 66 136 127 133 68 103 36 93 76 62 102 88 166 161 91 93 218 284 177 119 104 141 86
1898 86 68 71 150 73 103 122 114 164 170 120 126 169 135 92 65 66 36 39 106 79 124 93 106 26 153 227 175 52 143 6 914 1437 1982 1578 826
1570 826 152 44 35 88 129 125 16 67 186 160 194 187 55 53 83 69 66 95 88 78 146 42 103 51 108 39 6 180 267 159 128 207 217 145
1250 145 132 139 158 94 61 120 48 34 41 114 94 193 129 216 37 205 208 115 116 111 200 140 48 103 87 67 60 93 52 56 22 87 35 117 122 77 28 97
894 97 83 237 269 159 193 114 122 165 84 73 79 88 45 117 76 51 59 132 170 157 141 87 151 260 466 85 167 34 136 87 75 76 233 204
574 204 92 173 27 250 206 97 113 101 163 82 205 1434 3897 3915 2155 160 83 85 208 200 257 13 12 191 95 237 129 35
311 35 28 140 131 107 189 141 17 42 48 250 115 97 194 26 140 37 143 171 163 118 142 197 31 254 219 88 107 132 125 85 32 41 24
2 24 73 127 128 49 47 88 148 98 117 150 149 116 125 79 232 246 90 94 170 106 84 95 95 99 131 91 68 74 149 103 147 184 158 95 36 153 202 89 90
-365 90 110 153 55
-393E5
##PAGE=	F1=-4026.8
##FIRST=	4405.4455391999963467,	4405.4455391999963467,	0
##DATA TABLE=	(F2++(Y..Y)), PROFILE
4405 63 68 53 41 143 60 109 111 66 49 112 125 73 47 63 119 129 55 194 128 99 82 56 56 118 101 108 106 125 75 153 189 100 107 48 39 88 140 86
4049 86 88 53 116 96 64 142 227 39 112 106 28 60 66 93 232 286 131 36 102 145 153 97 65 203 186 175 188 122 100 145 180 108 76 70 80 102
3711 102 113 93 195 261 172 73 95 121 97 29 89 224 229 196 94 208 57 65 58 47 115 150 103 78 225 68 107 36 68 91 106 118 114
3401 114 27 30 26 151 190 209 39 79 89 105 80 76 123 123 128 82 118 83 58 127 542 1523 939 353 236 100 26 39 138 122 319 1919
3100 1919 1660 293 129 130 108 22 192 149 116 37 64 156 132 60 157 57 21 124 181 258 156 117 218 875 1215 394 136 101
2837 101 151 123 139 49 142 74 84 90 31 83 147 61 97 66 139 66 130 196 20 84 117 164 73 146 148 44 58 90 92 110 138 160 130 101 129
2509 129 102 53 63 131 142 57 110 94 102 47 148 194 51 63 71 122 184 125 78 229 161 39 92 11 152 67 60 76 190 94 115 76 135
2199 135 148 178 77 47 124 67 63 55 147 61 123 99 136 110 69 58 120 49 18 82 80 172 177 85 116 249 292 190 102 132 146 78 52 55 174
1870 174 88 92 96 94 140 166 106 171 224 162 81 54 73 29 52 106 62 150 90 104 20 163 180 179 73 154 57 1109 1776 2612 1960 959
1570 959 205 58 55 84 114 91 55 47 210 180 150 158 25 49 108 93 34 96 87 69 126 32 148 85 90 65 46 195 289 152 121 217 202 165
1250 165 89 118 141 131 81 127 60 74 38 110 78 195 138 224 60 190 205 130 107 137 206 156 64 84 96 84 77 111 78 53 12 82 6 117
931 117 151 81 55 128 109 242 281 206 196 100 120 166 65 41 43 74 39 142 69 34 56 113 130 132 131 109 161 135 409 297 136 18 169
621 169 120 74 86 300 187 13 192 27 251 184 25 204 145 253 195 328 2684 6454 7172 4143 495 299 236 298 228
387 228 231 14 8 212 135 342 207 24 39 119 118 135 178 198 52 6 37 246 97 118 230 12 115 47 131 183 167 134 145 234 35
95 35 248 207 107 129 163 136 75 39 72 26 60 91 122 82 55 86 136 69 127 133 161 118 160 109 206 212 100 116 165 138 81 70 59 91 113 91
-243 91 65 82 173 64 146 191 177 58 39 182 160 70 94 113 124 42
-393D2
##PAGE=	F1=-4045.58
##FIRST=	4405.4455391999963467,	4405.4455391999963467,	0
##DATA TABLE=	(F2++(Y..Y)), PROFILE
4405 51 38 48 16 128 61 131 91 56 19 131 96 46 56 60 119 73 60 196 126 98 81 78 65 95 90 137 127 133 92 165 164 91 94 6 21 100 137
4058 137 100 120 54 118 90 53 112 227 28 127 102 7 71 78 91 191 248 134 41 80 103 134 70 81 166 170 169 149 102 128 158 184 111 57
3739 57 42 83 127 111 86 199 256 185 95 136 131 118 28 31 192 238 208 104 266 67 92 59 57 143 152 140 45 191 65 119 52 91 121 83
3419 83 116 66 24 33 12 129 173 181 35 52 92 99 76 84 133 117 112 106 119 91 84 163 359 1364 1038 237 240 125 46 36 73 129 263 1643
3100 1643 1346 295 137 129 108 52 244 184 117 25 40 143 176 34 167 77 59 109 213 211 182 132 258 753 1124 364 191 121
2837 121 190 121 128 35 127 77 118 93 30 76 107 36 112 82 139 118 103 184 17 76 95 148 35 143 187 31 45 65 92 111 135 149 90
2527 90 65 107 93 59 86 167 122 80 136 96 97 93 161 226 47 43 67 137 209 141 104 231 186 37 106 14 142 64 65 78 169 77 133 81 130
2199 130 142 180 88 46 104 95 112 84 110 51 105 59 137 142 41 90 156 10 70 41 57 163 193 93 141 263 265 190 83 165 144 66 27
1889 27 44 179 94 80 63 70 111 140 78 217 275 169 68 29 68 21 48 95 59 163 103 104 33 150 126 156 77 136 125 1221 2060 3014
1588 3014 2014 939 251 150 113 62 98 76 82 23 213 200 111 109 21 44 128 110 28 87 80 59 95 53 184 100 68 103 75 191 287
1297 287 137 93 210 189 178 103 104 122 155 102 125 70 126 42 91 66 190 144 229 86 163 189 134 93 163 194 160 50 41 101 104 101 115 88
978 88 42 7 78 50 121 173 76 75 136 123 235 270 236 185 74 112 163 48 16 29 72 46 139 60 17 48 88 89 97 103 132 168 168 741 476 152
640 152 38 205 146 89 106 334 139 45 183 38 216 151 20 222 113 261 225 323 2393 6026 6943 4220 538 346 268
405 268 261 206 165 27 49 125 174 336 219 39 71 92 84 137 160 203 100 23 47 216 54 132 224 45 96 61 103 175 165 131 143 245
105 245 35 232 168 99 148 175 122 56 60 91 53 86 41 131 108 80 123 111 36 132 111 150 128 175 127 166 174 104 124 159 145 71 41 47 74 86
-233 86 66 60 97 161 39 146 178 171 37 53 179 123 44 100 99 86 52
-393E2
##PAGE=	F1=-4064.36
##FIRST=	4405.4455391999963467,	4405.4455391999963467,	0
##DATA TABLE=	(F2++(Y..Y)), PROFILE
4405 32 17 44 32 98 67 140 70 36 20 161 74 40 85 60 89 26 69 180 127 90 74 96 40 60 57 153 168 136 113 156 134 61 69 53 45 105
4067 105 110 115 154 78 118 61 55 86 218 56 129 93 26 76 88 78 141 208 126 45 74 79 126 55 94 112 153 158 108 80 148 163 173 122 36 4
3729 4 87 136 87 85 198 256 181 118 170 143 134 35 28 155 240 202 110 304 70 118 63 65 156 142 162 37 139 59 134 68 114 149 77 149 75
3401 75 47 34 31 93 149 152 28 63 110 106 61 88 134 91 93 111 119 104 106 190 221 1116 938 184 211 154 72 92 32 113 207 1334 1028 291
3081 291 132 158 130 107 260 191 107 10 17 125 202 26 165 84 83 97 249 165 203 132 282 625 1053 320 230 132 214 113 91 38
2800 38 111 69 142 72 35 66 72 27 115 110 117 150 98 161 30 93 55 123 14 143 212 29 28 76 84 123 145 127 51 41 86 77 54 118 180 90
2462 90 98 151 86 117 118 172 248 53 36 67 140 210 130 131 220 188 37 101 31 107 55 69 105 142 63 125 101 123 118 154 80 44 94 140 137 92 82
2114 82 39 98 35 132 151 12 123 180 37 133 14 23 147 208 116 148 260 221 181 69 194 133 52 11 41 165 96 66 35 42 84 99
1814 99 49 253 313 153 60 16 50 30 21 71 92 160 124 110 35 127 87 123 59 79 182 1087 1951 2843 1709 773 282 207 187 35
1532 35 77 57 89 23 203 209 97 55 39 55 139 120 61 77 70 48 63 94 203 101 48 125 87 172 260 121 53 188 180 183 138 95 105 166
1213 166 117 110 75 170 51 67 55 176 154 234 108 131 164 126 76 182 171 150 15 22 102 119 130 104 78 41 29 67 91 125 184 65 84
903 84 115 127 213 237 240 165 42 98 157 34 11 76 75 61 107 35 13 37 66 64 62 72 134 161 251 956 514 179 92 236 151 110 136 331
584 331 76 71 151 61 165 102 40 185 134 199 167 191 712 2806 3507 2473 340 206 218 140 128 87 44 104 43 221 268 174 28
311 28 114 86 51 118 132 173 148 32 59 166 11 134 186 76 90 75 77 155 159 106 130 228 42 214 125 73 160 165 92 36 82 97 66 111
-8 111 23 140 122 122 162 77 22 128 87 117 139 169 134 125 139 96 108 153 129 51 33 50 44 57 22 51 110 118 47 144 150 140 22 76 149 102 19
-355 19 104 78 42 64
-393F4
##PAGE=	F1=-4083.14
##FIRST=	4405.4455391999963467,	4405.4455391999963467,	0
##DATA TABLE=	(F2++(Y..Y)), PROFILE
4405 41 38 39 61 68 72 137 52 65 38 183 97 79 123 66 45 33 73 151 130 78 61 104 20 20 28 158 212 138 125 133 104 25 37 98 71 103 74 124
4049 124 186 118 112 18 62 66 201 80 112 86 57 77 96 55 97 173 110 43 74 73 126 52 104 63 131 145 71 69 149 156 153 128 22 43 106 133
3711 133 46 88 199 260 167 139 191 153 137 49 77 125 238 179 119 317 63 140 72 78 150 118 172 63 84 50 152 88 132 170 88 190
3410 190 131 67 38 80 62 118 126 26 84 143 116 32 94 129 48 77 99 109 110 108 195 223 885 721 177 157 173 102 142 38 76 155 1006
3100 1006 721 278 128 190 159 147 248 173 84 24 30 98 205 41 148 78 88 88 281 127 210 107 266 505 947 277 246 137
2837 137 213 108 31 53 102 61 150 33 50 51 92 47 102 128 81 154 116 137 54 146 22 92 54 139 214 47 33 132 80 138 160 100 16
2527 16 28 69 61 48 149 170 56 98 149 69 134 117 177 257 82 73 76 132 186 93 151 197 168 29 77 57 51 59 70 127 106 54 98 116 113 82
2189 82 108 62 54 112 177 136 79 88 29 103 44 118 133 28 147 182 76 175 67 15 133 226 144 134 239 179 174 66 213 114 39 38 51
1880 51 137 98 61 29 15 60 73 62 270 324 123 60 51 30 45 25 72 120 143 139 124 44 105 78 108 32 37 213 892 1620 2269 1266 566
1570 566 289 221 253 40 62 25 75 38 190 207 110 18 43 78 147 127 78 73 71 36 47 131 202 96 35 125 82 142 211 107 8 156 173
1260 173 180 159 92 92 173 121 84 77 195 56 48 42 160 169 241 121 101 133 111 58 192 154 125 29 89 107 129 155 84 52 82 69 46 122 125 186
922 186 51 91 72 128 178 190 221 140 17 81 149 36 27 116 81 83 65 11 27 41 62 77 51 63 103 135 265 869 387 187 155 260
621 260 136 123 164 300 45 67 120 88 131 53 60 163 273 129 102 121 1296 1454 1048 241 226 51 235 94 28 22 49 137 118
349 118 257 223 107 16 158 115 66 83 104 154 176 37 63 106 81 130 141 100 92 89 75 129 147 71 103 190 54 199 99 50 160 135
48 135 59 28 98 88 59 121 80 143 121 163 187 33 50 112 71 71 137 146 128 93 113 75 74 148 97 20 72 59 20 51 32 37 114 70 60 129 117
-299 117 95 6 103 111 89 11 103 76 21 63
-393F3
##PAGE=	F1=-4101.92
##FIRST=	4405.4455391999963467,	4405.4455391999963467,	0
##DATA TABLE=	(F2++(Y..Y)), PROFILE
4405 66 62 39 73 62 67 134 45 110 41 179 125 128 154 77 54 67 75 113 141 65 47 99 77 56 63 159 251 149 126 105 75 7 9 130 87 105 67
4058 67 125 213 153 95 24 69 48 179 99 77 86 89 82 103 29 71 145 90 40 62 70 130 58 113 69 103 138 45 81 135 136 131 120 38 87 135 123 2
3701 2 88 203 265 157 157 194 157 127 73 115 125 231 146 132 305 50 156 88 99 128 84 178 89 59 34 174 120 143 181 101 214 180
3401 180 76 52 133 71 80 99 27 103 188 120 18 108 124 33 79 79 86 98 97 173 308 703 525 169 90 170 127 171 43 32 111 706 461
3091 461 252 138 200 182 164 228 143 52 45 58 60 188 53 120 61 79 83 302 115 201 74 219 398 784 259 238 137 188 116 43
2809 43 76 99 64 140 13 67 30 142 61 75 127 63 132 140 124 82 211 82 74 86 127 188 72 53 194 92 146 168 73 17 20 62 52
2499 52 49 172 144 40 77 130 54 131 93 171 250 128 120 90 115 145 36 161 163 130 10 50 82 14 91 64 127 59 48 62 121 98 43 55
2180 55 44 77 143 192 111 52 105 26 105 51 88 96 73 158 165 102 187 102 48 127 244 165 106 204 149 168 68 217 91 38 62 72 98 105 80
1851 80 35 25 37 91 102 264 303 89 67 79 41 57 82 120 121 118 138 135 83 95 84 109 8 89 212 927 1492 1781 1056 426 259 195
1551 195 287 61 65 15 54 39 177 194 132 9 34 94 156 137 70 70 86 36 51 151 185 92 36 107 59 112 151 99 33 122 166 167 158 95 83
1222 83 187 114 62 80 196 52 43 33 146 188 251 122 76 96 95 44 193 156 93 68 149 119 136 170 63 57 144 115 22 137 117 182 35
912 35 102 26 131 135 136 184 112 29 59 140 55 36 133 90 114 62 60 54 58 79 103 66 81 41 98 230 557 179 181 209 275 110 114 173 251 68
574 68 46 110 107 128 22 68 178 371 88 145 197 2461 4221 4232 2027 334 179 279 147 83 23 44 141 137 258 225 49 39
311 39 189 150 102 43 92 178 174 40 61 49 137 129 124 118 91 97 90 101 123 57 73 142 61 193 94 51 145 94 26 49 100 65 43 121 128 137 105 185
-45 185 195 17 81 83 78 48 114 116 107 82 96 44 52 143 63 21 124 79 51 84 80 25 108 73 59 98 91 51 22 124 84 67 16 98 83 46 51
-393E1
##PAGE=	F1=-4120.7
##FIRST=	4405.4455391999963467,	4405.4455391999963467,	0
##DATA TABLE=	(F2++(Y..Y)), PROFILE
4405 77 76 49 67 81 50 140 56 152 25 143 129 167 164 91 99 98 86 78 160 55 51 84 127 120 105 160 279 173 121 87 54 25 17 145 91 123
4067 123 102 122 231 169 67 54 74 29 152 118 31 94 113 96 105 9 61 122 66 49 43 62 134 69 119 111 73 140 38 101 117 105 113 98 70
3739 70 120 165 118 43 79 202 267 159 165 180 154 109 103 135 149 220 107 149 272 41 166 112 126 96 57 182 104 74 15 197 162 147
3438 147 182 111 218 205 73 73 181 106 37 65 21 125 235 117 65 130 123 85 100 57 51 72 89 125 411 613 458 165 30 146
3157 146 140 174 26 31 83 503 316 217 156 178 186 157 216 112 30 58 88 15 160 55 82 36 79 80 308 133 177 64 175 349 672
2865 672 281 220 134 149 134 111 108 95 75 117 51 76 16 179 58 53 105 83 91 155 120 104 267 152 94 102 106 138 95 69 240 109 143 162
2546 162 52 41 19 65 52 56 184 113 59 42 98 46 108 51 154 227 174 158 98 98 105 26 158 121 83 26 66 101 76 131 53 97 20 43
2227 43 44 117 79 32 32 36 99 163 179 73 28 112 29 91 42 50 51 111 155 132 111 166 107 65 121 259 175 75 160 133 159 68 209 73 48
1898 48 76 101 55 117 112 38 49 30 125 129 236 253 60 76 91 72 79 141 172 93 93 124 130 131 110 84 103 7 120 184 1034 1565 1691 1142 389
1570 389 183 153 275 67 74 42 56 24 163 172 150 31 21 96 163 157 42 64 106 59 63 143 155 86 44 83 24 89 94 96 65 91 155 144 138
1241 138 104 78 208 100 71 86 175 37 51 45 141 207 266 116 58 54 83 39 183 166 67 91 190 133 142 173 46 111 208 160 24 130
941 130 100 170 21 111 37 137 94 85 140 82 61 34 127 74 37 125 102 150 102 107 91 72 108 121 79 102 39 82 195 232 131 174 237 276
621 276 91 84 152 198 79 25 109 111 128 16 63 179 366 43 198 200 2207 4461 4602 2560 276 197 236 157 139 56 62 138 85
349 85 221 221 57 62 197 170 122 47 97 207 146 39 62 20 165 137 142 134 79 97 100 73 88 90 97 92 59 199 104 58 115 55 8 85 85 33 67
2 67 118 157 126 90 183 187 73 104 52 97 76 74 90 73 84 90 17 87 138 39 64 180 114 90 133 111 20 106 106 45 53 79 16 64 136 73 37 20
-355 20 90 77 62 46
-393D6
##PAGE=	F1=-4139.48
##FIRST=	4405.4455391999963467,	4405.4455391999963467,	0
##DATA TABLE=	(F2++(Y..Y)), PROFILE
4405 71 82 65 53 99 27 157 76 203 37 84 114 183 145 100 132 121 109 77 178 52 81 68 154 177 135 163 293 208 122 91 47 42 31
4096 31 148 86 155 141 128 237 161 28 65 76 24 128 136 18 106 122 116 101 7 54 100 43 68 51 51 134 77 121 143 51 150 46 112 107
3776 107 71 96 68 105 138 188 124 72 59 188 260 171 160 152 144 89 131 135 172 201 65 164 228 54 171 138 154 60 70 181 108 88 4 215
3457 215 204 144 171 122 205 201 70 95 212 139 8 23 26 153 270 112 111 158 129 136 124 43 12 60 93 67 532 769 542 186 53
3166 53 110 140 158 9 53 77 471 366 178 166 125 168 128 211 83 41 59 115 35 130 52 43 9 99 77 295 165 142 62 149 438 754
2865 754 335 206 126 124 151 154 143 88 83 86 75 71 40 190 42 67 69 109 44 155 116 113 299 208 141 103 78 74 115 78 258 114 126 142 43
2537 43 57 25 71 61 59 186 82 84 32 60 49 70 8 125 188 206 179 92 92 92 77 143 78 46 65 117 115 125 164 35 43 73 38 54 111 62
2199 62 64 56 44 111 160 143 35 28 106 30 65 29 37 16 129 139 93 108 125 86 63 111 268 173 50 115 123 139 70 196 67 54 81 129 14
1870 14 132 141 38 64 56 151 131 190 189 42 81 91 98 122 192 200 55 78 112 102 169 145 74 93 17 109 143 940 1446 1688 1205 431 72
1560 72 132 220 64 67 51 76 11 150 144 154 76 21 82 160 182 39 72 118 93 72 109 119 83 48 71 26 75 54 93 85 71 137 110 106 113 79
1222 79 224 80 104 91 137 20 61 69 147 223 282 107 48 11 73 50 168 170 57 94 204 140 148 166 30 169 256 193 46 103 75 151
922 151 10 111 56 149 79 46 98 51 97 4 110 85 32 100 112 185 133 136 130 79 142 127 79 117 115 124 174 82 193 174 228 254 87 45 106
593 106 160 65 18 99 94 108 49 86 152 265 77 207 165 772 2388 2358 1744 95 129 107 211 151 83 109 160 29 161 187 128 80
311 80 182 168 119 92 98 213 109 34 67 45 161 149 162 152 55 87 102 48 49 139 166 55 61 213 133 58 78 30 48 122 57 8 119 121
-8 121 168 114 105 159 169 130 118 46 113 107 29 76 39 89 92 46 146 132 35 99 233 164 119 179 120 30 120 122 30 14 78 10 117 139 67 40
-346 40 45 84 52 61 73
-393G3
##PAGE=	F1=-4158.26
##FIRST=	4405.4455391999963467,	4405.4455391999963467,	0
##DATA TABLE=	(F2++(Y..Y)), PROFILE
4405 56 82 78 53 110 23 174 96 265 102 41 107 167 101 99 146 128 132 109 186 56 120 56 152 213 149 164 293 242 135 111 60 64 36 146
4086 146 75 182 168 150 225 128 19 59 75 54 121 151 55 117 115 136 92 12 44 81 32 86 85 43 129 80 114 154 48 163 64 106 106 50
3767 50 77 41 133 141 204 139 84 29 154 242 186 139 118 129 76 149 117 177 175 29 172 184 74 170 161 178 27 104 173 106 86 24 222 230
3448 230 132 144 131 189 173 79 112 222 157 51 40 66 182 281 105 141 186 139 167 141 49 33 84 100 61 657 1101 714 219 105
3166 105 76 126 134 51 57 96 628 562 143 161 58 129 88 203 55 54 55 137 77 106 46 32 27 121 75 268 194 100 46 124 680 969 394
2856 394 207 114 136 158 158 167 83 82 58 82 49 68 175 22 90 30 117 4 141 106 107 299 238 187 95 52 25 128 78 246 107 97
2556 97 109 42 67 28 71 79 52 179 54 98 63 29 55 37 44 90 137 211 180 70 105 118 104 120 36 45 104 167 129 154 178 14 22 133 31
2227 31 63 106 61 100 75 66 109 136 97 12 34 91 33 40 50 69 27 117 116 56 104 90 68 51 99 272 165 38 81 114 114 78 182 66 50
1898 50 76 146 35 147 155 35 64 86 164 107 135 127 45 74 90 109 177 229 194 56 76 114 57 184 179 62 101 20 63 105 617 1014 1515
1588 1515 1100 494 51 151 140 77 39 40 88 36 143 118 139 127 44 64 143 207 84 109 126 126 73 66 80 98 43 80 79 66 39 85 89 62
1269 62 112 67 73 118 82 226 59 138 92 93 18 67 89 157 233 294 100 46 29 62 75 150 160 59 78 194 137 154 152 18 209 275 207
959 207 66 65 48 128 9 106 50 174 105 25 69 15 131 37 85 85 27 71 119 209 142 139 157 85 169 128 73 128 175 198 163 143 177 177 186 209
621 209 87 37 78 149 48 24 81 61 73 90 139 124 149 166 183 217 1009 605 1012 972 413 205 85 334 132 95 158 203 77 106
340 106 136 191 93 146 144 95 129 82 203 85 33 71 67 134 154 169 165 30 70 99 40 49 185 230 54 76 233 178 59 59 28 87 151 21
20 21 19 165 135 164 104 142 122 150 182 123 73 118 119 35 80 48 93 104 82 202 125 50 116 273 219 134 210 108 50 142 116 39 51 78 33
-308 33 167 135 61 76 82 84 41 48 107
-393A07
##PAGE=	F1=-4177.04
##FIRST=	4405.4455391999963467,	4405.4455391999963467,	0
##DATA TABLE=	(F2++(Y..Y)), PROFILE
4405 44 71 79 67 116 41 178 107 317 177 81 118 124 44 86 144 116 140 138 176 63 155 40 124 219 152 156 282 265 151 134 86 85 35 149
4086 149 63 194 184 177 200 77 67 47 80 91 130 160 75 119 100 150 76 28 33 63 38 96 113 43 117 71 95 144 52 173 86 87 104 58 57
3758 57 25 146 131 212 154 83 8 105 212 193 107 93 111 70 149 83 164 142 36 172 147 86 157 177 190 28 130 160 100 79 41 216
3457 216 229 109 102 138 184 135 94 120 209 161 89 96 121 203 260 93 146 206 152 172 144 70 66 113 97 105 767 1407 872 232 154 53 102
3147 102 114 91 63 132 930 835 118 141 51 89 54 188 35 55 64 152 104 88 41 61 55 127 75 237 219 55 73 112 1014 1217 436
2856 436 221 96 171 153 120 170 84 69 40 72 16 88 144 13 97 26 102 19 119 94 91 271 237 222 93 33 64 132 65 215 109
2565 109 59 72 41 74 25 60 100 36 170 25 99 86 27 60 46 76 58 79 184 162 37 136 157 98 93 4 66 136 206 148 166 175 19
2255 19 82 177 22 58 101 77 134 83 93 95 109 75 19 30 68 51 33 86 99 49 76 91 28 108 101 97 56 88 271 158 38 68 101 97 87
1926 87 167 60 37 66 144 69 159 147 27 56 107 167 66 83 81 76 56 97 103 223 248 154 85 85 124 10 177 198 58 123 10 25 80
1617 80 272 560 1318 887 505 152 177 71 110 23 15 91 55 149 106 111 166 75 52 111 220 126 157 143 158 66 71 41 135 28 100 135
1316 135 62 52 72 78 52 80 20 46 114 88 209 35 160 87 64 23 65 95 165 237 297 94 48 56 48 105 134 138 63 49 168 121 161 134
997 134 33 219 259 202 84 48 43 109 25 115 40 210 146 15 64 27 154 82 52 79 28 54 120 215 131 113 165 97 180 130 67 134 208
687 208 270 187 426 224 172 123 152 71 53 123 149 50 35 69 25 62 117 187 111 159 211 147 271 2213 2645 3423 1718 724 327 169
405 169 423 108 87 195 245 92 101 91 213 102 99 110 58 145 51 196 73 33 69 80 98 143 157 163 26 56 95 62 84 215 264 79
105 79 95 252 223 84 77 35 117 164 16 32 189 154 150 92 174 84 138 223 120 100 107 110 59 95 79 99 121 110 245 123 81 108 293 264
-214 264 134 217 80 73 151 94 62 83 79 54 196 128 54 101 116 94 71 29 125
-393A25
##PAGE=	F1=-4195.82
##FIRST=	4405.4455391999963467,	4405.4455391999963467,	0
##DATA TABLE=	(F2++(Y..Y)), PROFILE
4405 35 48 67 77 123 59 165 102 338 243 125 122 69 13 64 131 84 135 143 148 72 176 14 79 198 148 135 262 272 160 148 115 97 31
4096 31 162 61 189 194 197 166 39 111 52 99 125 143 163 75 109 83 155 52 52 26 48 39 92 119 55 98 49 63 114 43 173 105 60 89
3776 89 71 37 16 142 117 211 163 74 48 50 170 186 77 94 88 72 129 39 146 109 69 166 124 83 132 184 187 60 138 145 91 87 57 196 200
3448 200 78 52 142 186 104 101 116 178 153 117 148 178 214 212 76 124 213 161 147 135 92 85 125 77 134 849 1588 932 207 198 41 73 111
3138 111 118 100 175 1296 1127 106 115 100 93 48 171 49 56 94 167 113 79 41 89 75 110 79 215 244 25 143 159 1339 1478 450
2856 450 240 74 201 135 54 144 87 47 32 52 22 99 114 20 81 54 67 28 96 85 73 229 210 242 109 26 101 126 39 185 132 18
2556 18 45 37 77 25 41 117 26 162 6 95 93 52 64 70 90 34 27 133 135 29 181 191 63 68 27 90 160 229 177 166 157 54 122 197 33
2227 33 40 98 90 162 86 114 77 106 96 25 17 40 80 33 114 117 79 16 69 12 114 138 148 77 87 266 151 46 73 83 109 83 148 47 36
1898 36 57 124 92 166 115 27 53 114 159 46 55 72 127 41 108 81 244 247 91 98 94 125 40 153 199 68 130 15 63 68 391 728 1308
1588 1308 712 435 213 183 64 141 64 11 97 58 166 105 79 182 110 47 68 217 148 196 175 186 50 120 13 179 8 118
1326 118 188 76 85 63 52 35 54 27 40 98 94 176 24 163 76 68 19 53 88 170 232 286 90 45 68 35 133 123 112 67 24 148 95 167
1006 167 109 61 196 209 178 104 79 71 104 51 150 69 246 178 2 77 76 160 128 16 73 40 51 116 201 106 69 149 112 169 133 64 133 216
687 216 315 218 689 328 150 64 109 37 50 179 149 59 48 62 28 98 127 208 99 202 185 130 246 2349 2829 3770 1892 860
424 860 352 150 425 93 60 215 271 73 138 63 180 105 58 89 28 134 25 199 58 31 60 85 71 120 130 142 42 63 91
152 91 99 112 220 258 98 109 266 253 127 105 35 134 160 49 58 184 169 134 74 188 57 138 248 115 119 81 84 64 103 98 111 135 126 269
-167 269 128 118 81 286 285 120 196 53 95 140 69 82 98 80 70 192 116 42 108 137 114 98 11 119
-393A19
##PAGE=	F1=-4214.6
##FIRST=	4405.4455391999963467,	4405.4455391999963467,	0
##DATA TABLE=	(F2++(Y..Y)), PROFILE
4405 26 17 46 77 132 69 142 80 318 279 146 96 40 54 39 112 50 124 120 105 83 179 24 30 159 143 103 234 259 158 147 134 93 26 183
4086 183 74 171 199 200 132 80 145 78 130 148 147 157 60 84 70 148 23 75 32 42 27 76 103 72 70 13 25 72 17 165 112 51 58 72 22
3758 22 5 118 104 198 159 63 87 25 121 164 70 118 65 85 97 14 148 89 98 154 113 66 98 180 165 90 127 127 76 118 71 168 150 45 23
3429 23 145 186 95 93 98 137 139 133 187 227 216 154 71 77 204 162 99 118 102 94 116 43 132 898 1641 868 143 233 47 40 127 131 144 218 1623
3100 1623 1369 97 89 123 141 55 159 82 73 131 188 105 79 52 107 84 74 90 216 272 50 203 242 1536 1716 440 260 52
2837 52 216 111 63 96 83 35 29 28 56 109 94 35 46 75 23 37 72 81 69 195 170 246 138 31 118 115 4 172 159 29 56 39 77
2527 77 40 25 125 49 156 39 104 88 84 68 83 88 20 28 69 107 71 229 207 10 52 47 117 177 237 213 161 134 96 133 188 63 19 98
2208 98 89 184 90 120 66 123 123 33 16 32 110 36 124 125 120 48 52 14 112 168 187 90 97 257 143 57 82 60 141 60 125 31 53 51 91 104 165 61
1851 61 56 70 110 142 75 65 102 187 59 113 50 234 224 31 87 94 114 71 125 190 88 112 51 90 68 600 1061 1337 662 322 226 164
1551 164 81 155 99 32 111 50 186 104 52 175 140 49 24 192 142 215 213 207 29 162 46 215 29 129 231 102 122 71 16 42
1269 42 58 67 54 76 101 132 50 147 61 83 32 37 81 174 217 262 91 37 67 27 149 113 91 72 36 149 65 172 78 88 150 134 141 122 116
941 116 100 116 85 195 109 265 191 17 93 126 149 169 32 72 62 47 108 172 72 44 117 126 141 130 55 122 203 317 195 741 335
649 335 120 55 104 45 25 209 156 64 65 51 49 139 133 194 91 175 124 176 183 1553 1306 2089 1148 804 272 33 340 85 49 219
368 219 281 81 174 51 102 109 44 104 57 101 37 200 38 43 46 84 59 100 87 109 58 83 93 139 124 195 217 98 114 269 258 170 124 30
48 30 138 146 76 103 153 174 120 49 180 50 143 254 111 128 45 50 58 97 101 129 141 128 271 140 150 64 253 272 96 151 60 109 114 54
-271 54 89 96 84 78 155 95 24 104 140 134 103 14 88
-393H8
##PAGE=	F1=-4233.38
##FIRST=	4405.4455391999963467,	4405.4455391999963467,	0
##DATA TABLE=	(F2++(Y..Y)), PROFILE
4405 19 15 32 70 142 74 125 51 262 276 145 42 56 71 18 88 48 118 84 71 96 166 64 17 120 142 68 201 229 144 132 135 77 22
4096 22 206 90 150 196 187 108 130 164 108 158 159 136 144 40 49 62 128 12 88 50 57 5 51 75 88 35 39 38 28 21 151 103 77 14 55 16 22
3748 22 80 95 170 142 54 118 54 72 129 80 144 43 110 78 60 176 93 117 139 109 45 71 165 123 108 103 106 57 160 82 136 92 33 53 149
3419 149 173 100 75 68 92 127 139 209 260 214 118 93 21 183 153 47 101 99 109 95 8 101 889 1609 732 50 251 74 21 151 134
3128 134 170 251 1824 1509 85 71 109 192 52 145 110 100 164 219 92 80 72 111 83 32 106 240 303 80 232 330 1520 1847 422
2856 422 279 38 212 87 135 64 68 55 24 14 77 123 77 56 13 87 27 57 45 78 83 180 133 239 163 47 117 103 31 175 170 68
2556 68 86 56 74 61 28 120 85 156 70 130 79 118 71 82 73 12 55 11 88 117 269 200 46 47 58 150 191 234 250 156 119 139 117 158 98
2227 98 29 102 70 193 97 108 71 130 133 46 38 60 134 62 113 126 160 103 38 23 99 181 204 84 119 244 130 65 92 39 176 22 96
1917 96 17 71 49 53 106 150 20 98 92 100 116 103 82 139 246 95 111 30 198 181 49 62 79 96 87 96 174 108 85 83 89 83 652 1144 1148 681
1579 681 247 199 128 78 154 112 45 126 42 204 103 36 152 161 74 37 149 110 212 239 217 6 184 87 235 61 128 257 128
1307 128 153 88 27 89 93 95 71 64 108 86 85 117 42 89 68 28 94 182 193 227 94 34 61 27 148 98 81 79 60 165 45 177 41 108
987 108 99 52 100 130 142 117 135 118 229 133 260 181 40 105 171 126 201 69 75 88 39 98 134 33 78 77 135 105 113 40 101 176 273 98
668 98 511 192 118 78 117 108 29 205 176 73 82 36 55 165 149 166 105 94 132 257 188 435 1000 467 1010 631 140 150 214 70
$$ [...]
-393A0
##END NTUPLES=	nD NMR SPECTRUM
##END=	
##END=	
