##TITLE=	0KeHG1J6Qq2CMhD7k$IwRg.34.ser
TM-VI-137solid hmbc

##JCAMP-DX=	6.0	$$ MestReNova 14.3.0-30573
##DATA TYPE=	LINK
##BLOCK_ID=	1
##BLOCKS=	2    
##ORIGIN=	Mestrelab Research S.L.
##OWNER=	hrzepa
##$MNOVA/LINK_BLOCK_TYPE=	ITEM	$$ NMR Spectrum
##$MNOVA/ITEM/POLYGON=	(XY..XY)
5321,5835
8722,5835
8722,8208
5321,8208
5321,5835
##$MNOVA/ITEM/Z=	0
##$MNOVA/ITEM/ANGLE=	0
##TITLE=	0KeHG1J6Qq2CMhD7k$IwRg.34.ser
##JCAMP-DX=	6.0	$$ MestReNova 14.3.0-30573
##BLOCK_ID=	2
##DATA TYPE=	MNOVA NMR VIEW DATA
##DATA CLASS=	MNOVA VIEW DATA
##$MNOVA/2D/THRESHOLD=	4.9440979957580566406
##$MNOVA/ITEM/ZOOM/X=	-0.47669846964044454429,	14.506009999935889354
##$MNOVA/ITEM/ZOOM/Y=	-9.5219447936452610293,	250.03239999719292541
##END=	
##TITLE=	0KeHG1J6Qq2CMhD7k$IwRg.34.ser
##JCAMP-DX=	6.0	$$ MestReNova 14.3.0-30573
##BLOCK_ID=	3
##DATA TYPE=	nD NMR SPECTRUM
##DATA CLASS=	NTUPLES
##NUMDIM=	2
##ORIGIN=	Bruker BioSpin GmbH
##OWNER=	nmr
##.OBSERVE FREQUENCY=	400.32280223999998725
##.OBSERVE NUCLEUS=	^1H
##.SOLVENT NAME=	CDCl3
##.PULSE SEQUENCE=	hmbcgplpndqf
##LONGDATE=	2021/10/27 20:07:43.000
##.ACQUISITIONMODE=	SIMULTANEOUS (DQD)
##$ORIGINAL FORMAT=	Bruker XWIN-NMR
##$MNOVA/SCALES_VERSION=	9
##$PARAMETER FILE=	(acqu2s, ASCII, /private/var/folders/f6/rjf_tdyn2v98c5c0wvkgn4s80000gn/T/0KeHG1J6Qq2CMhD7k$IwRg/34/acqu2s, 0)
$$ ##TITLE= Parameter file, TOPSPIN		Version 3.2
$$ ##JCAMPDX= 5.0
$$ ##DATATYPE= Parameter Values
$$ ##NPOINTS= 129	$$ modification sequence number
$$ ##ORIGIN= Bruker BioSpin GmbH
$$ ##OWNER= nmr
$$ $$ 2021-10-27 20:27:19.789 +0100  nmr@CZC2524DW0
$$ $$ /opt/topspin/data/agmb/nmr/Oct27-2021/34/acqu2s
$$ $$ process /opt/topspin3.2/prog/mod/go
$$ ##$ACQT0= 0
$$ ##$BF1= 100.660544
$$ ##$FnMODE= 1
$$ ##$NUC1= <13C>
$$ ##$NusJSP= 0
$$ ##$NusT2= 1
$$ ##$NusTD= 128
$$ ##$O1= 12079.3932956644
$$ ##$SFO1= 100.672623393296
$$ ##$SW= 260.03107487261
$$ ##$SW_h= 26178.0104712042
$$ ##$TD= 128
$$ ##END=
$$ 
##$PARAMETER FILE=	(acqus, ASCII, /private/var/folders/f6/rjf_tdyn2v98c5c0wvkgn4s80000gn/T/0KeHG1J6Qq2CMhD7k$IwRg/34/acqus, 0)
$$ ##TITLE= Parameter file, TOPSPIN		Version 3.2
$$ ##JCAMPDX= 5.0
$$ ##DATATYPE= Parameter Values
$$ ##NPOINTS= 12	$$ modification sequence number
$$ ##ORIGIN= Bruker BioSpin GmbH
$$ ##OWNER= nmr
$$ $$ 2021-10-27 20:27:23.051 +0100  nmr@CZC2524DW0
$$ $$ /opt/topspin/data/agmb/nmr/Oct27-2021/34/acqus
$$ $$ process /opt/topspin3.2/prog/mod/shimcntl
$$ ##$ACQT0= 1000000
$$ ##$AMP= (0..31)
$$ 100 100 100 100 100 100 100 100 100 100 100 100 100 100 100 100 100 100
$$ 100 100 100 100 100 100 100 100 100 100 100 100 100 100
$$ ##$AMPCOIL= (0..19)
$$ 0 0 0 0 0 0 0 0 0 0 0 0 0 0 0 0 0 0 0 0
$$ ##$ANAVPT= -1
$$ ##$AQSEQ= 0
$$ ##$AQ_mod= 3
$$ ##$AUNM= <au_zgonly>
$$ ##$AUTOPOS= <53 >
$$ ##$BF1= 400.32
$$ ##$BF2= 100.660544
$$ ##$BF3= 400.32
$$ ##$BF4= 400.32
$$ ##$BF5= 400.32
$$ ##$BF6= 400.32
$$ ##$BF7= 400.32
$$ ##$BF8= 400.32
$$ ##$BYTORDA= 0
$$ ##$CAGPARS= (0..11)
$$ 0 0 0 0 0 0 0 0 0 0 0 0
$$ ##$CFDGTYP= 0
$$ ##$CFRGTYP= 9
$$ ##$CHEMSTR= <none>
$$ [...]
$$ 0 0 0 0
$$ ##$ShimPowMaxUC= (0..63)
$$ 130000 130000 130000 130000 130000 130000 130000 130000 130000 130000 130000
$$ 130000 130000 130000 130000 130000 130000 130000 130000 130000 0 0 0 0
$$ 0 0 0 0 0 0 0 0 0 0 0 0 0 0 0 0 0 0 0 0 0 0 0 0 0 0 0 0 0 0 0 0 0 0 0 0
$$ 0 0 0 0
$$ ##$ShimPowMaxUG= (0..63)
$$ 524287 524287 524287 524287 524287 524287 524287 524287 524287 524287 524287
$$ 524287 524287 524287 524287 524287 524287 524287 524287 524287 0 0 0 0
$$ 0 0 0 0 0 0 0 0 0 0 0 0 0 0 0 0 0 0 0 0 0 0 0 0 0 0 0 0 0 0 0 0 0 0 0 0
$$ 0 0 0 0
$$ ##$ShimPowRcbType= 3
$$ ##$ShimPowRes= (0..63)
$$ 1e-20 1e-20 1e-20 1e-20 1e-20 1e-20 1e-20 1e-20 1e-20 1e-20 1e-20 1e-20
$$ 1e-20 1e-20 1e-20 1e-20 1e-20 1e-20 1e-20 1e-20 0 0 0 0 0 0 0 0 0 0 0 0
$$ 0 0 0 0 0 0 0 0 0 0 0 0 0 0 0 0 0 0 0 0 0 0 0 0 0 0 0 0 0 0 0 0
$$ ##$ShimPowRng0= (0..63)
$$ 1 1 1 1 1 1 1 1 1 1 1 1 1 1 1 1 1 1 1 1 0 0 0 0 0 0 0 0 0 0 0 0 0 0 0 0
$$ 0 0 0 0 0 0 0 0 0 0 0 0 0 0 0 0 0 0 0 0 0 0 0 0 0 0 0 0
$$ ##$ShimPowRng1= (0..63)
$$ 1 1 1 1 1 1 1 1 1 1 1 1 1 1 1 1 1 1 1 1 0 0 0 0 0 0 0 0 0 0 0 0 0 0 0 0
$$ 0 0 0 0 0 0 0 0 0 0 0 0 0 0 0 0 0 0 0 0 0 0 0 0 0 0 0 0
$$ ##$ShimPowRng2= (0..63)
$$ 1 1 1 1 1 1 1 1 1 1 1 1 1 1 1 1 1 1 1 1 0 0 0 0 0 0 0 0 0 0 0 0 0 0 0 0
$$ 0 0 0 0 0 0 0 0 0 0 0 0 0 0 0 0 0 0 0 0 0 0 0 0 0 0 0 0
$$ ##$ShimPowRng3= (0..63)
$$ 1 1 1 1 1 1 1 1 1 1 1 1 1 1 1 1 1 1 1 1 0 0 0 0 0 0 0 0 0 0 0 0 0 0 0 0
$$ 0 0 0 0 0 0 0 0 0 0 0 0 0 0 0 0 0 0 0 0 0 0 0 0 0 0 0 0
$$ ##$ShimSysFunc= (0..63)
$$ 1 2 3 4 5 7 9 11 15 16 8 10 12 14 6 17 13 18 19 20 0 0 0 0 0 0 0 0 0 0
$$ 0 0 0 0 0 0 0 0 0 0 0 0 0 0 0 0 0 0 0 0 0 0 0 0 0 0 0 0 0 0 0 0 0 0
$$ ##$ShimSysMatrix= 0
$$ ##$ShimSysType= 1
$$ ##$TFXNUM= 0
$$ ##$TRIPLO2= 0
$$ ##$VTU= 2
$$ ##$VTUETH= <149.236.99.20>
$$ ##$VTUTY= <no>
$$ ##$WBREFAM= (0..15)
$$ 132.2 106.2 100 100 100 100 100 100 100 100 100 100 100 100 100 100
$$ ##$WBREFLM= (0..15)
$$ 0 0 0 0 0 0 0 0 0 0 0 0 0 0 0 0
$$ ##$WBREFPH= (0..15)
$$ 77.55 -65.76 0 0 0 0 0 0 0 0 0 0 0 0 0 0
$$ ##$WBSGU= (0..15)
$$ 0 0 0 0 0 0 0 0 0 0 0 0 0 0 0 0
$$ ##$XFAC= 2
$$ ##END=
$$ 
##$DECIM=	3328
##$DSPFVS=	20
##.ACQUISITIONSCHEME=	NOT PHASESENSITIVE
##NTUPLES=	nD NMR SPECTRUM
##VAR_NAME=	FREQUENCY1,	FREQUENCY2,	SPECTRUM
##SYMBOL=	F1,	F2,	Y
##.NUCLEUS=	13C,	1H
##.OBSERVE FREQUENCY=	100.67262339329600707,	400.32280223999998725
##VAR_TYPE=	INDEPENDENT,	INDEPENDENT,	DEPENDENT
##VAR_FORM=	AFFN,	AFFN,	ASDF
##VAR_DIM=	512,	512,	262144
##UNITS=	HZ,	HZ,	ARBITRARY UNITS
##FIRST=	25168.397401625570637,	5807.04592319999756,	0.69266152381896972656
##LAST=	-958.48414287705929837,	-190.8319313673060833,	0.083566032350063323975
##MIN=	-958.48414287705929837,	-190.8319313673060833,	0.0014878222718834877014
##MAX=	25168.397401625570637,	5807.04592319999756,	67.83554840087890625
##FACTOR=	1,	1,	0.0032416909188512912574
##PAGE=	F1=25168.4
##FIRST=	25168.397401625570637,	5807.04592319999756,	0.69266152381896972656
##DATA TABLE=	(F2++(Y..Y)), PROFILE
$$ [...]
##PAGE=	F1=2569.41
##FIRST=	25168.397401625570637,	5807.04592319999756,	0.53492909669876098633
##DATA TABLE=	(F2++(Y..Y)), PROFILE
$$ plain form
290 49 80 38 73 35 90 163 68 104 128 66 178 197 129 132 100 67 45 131 156 98 184 43 128 137 193 46 120 198 180 43 68 138 338 321
-109 321 193 76 145 48 108 198 264
$$ packed form
290D9L1m2L5l8N5P3r5L6K4o2J12J9o8Ll2l3k2Q6K5n8Q6j41Q5RN6j47P4P8j8j37K5P0K00j7
-109C21j28j17O9r7O0R0O6
-191B64
##PAGE=	F1=2467.15
##FIRST=	25168.397401625570637,	5807.04592319999756,	0.45802262425422668457
##DATA TABLE=	(F2++(Y..Y)), PROFILE
$$ plain form
5807 142 45 120 74 104 66 86 53 137 132 54 80 188 111 51 57 166 176 206 243 57 90 59 229 200 146 165 65 125 125 207 129 71 165 107
5408 107 297 102 300 219 108 132 289 223 229 99 66 71 42 26 119 111 30 41 8 190 60 88 56 154 187 151 32 117 92 118 105 416
5032 416 230 173 128 102 17 196 194 283 91 224 252 189 301 201 225 229 182 120 50 154 259 211 91 154 107 28 102 34 54 76 57
4669 57 127 109 200 137 29 95 208 134 219 163 69 131 201 170 130 263 108 220 236 132 85 145 156 210 202 237 97 99 1 69 124 54 74
4281 74 95 114 235 79 104 126 67 175 163 175 215 224 300 89 284 258 202 87 223 158 194 204 188 137 264 332 181 249 233 93 192
3917 192 122 164 112 117 175 84 138 181 56 154 191 198 159 77 138 135 166 126 83 147 76 217 102 81 255 76 252 103 124 136 191 37
3542 37 93 131 159 112 92 104 70 119 105 192 210 100 126 288 169 170 65 183 136 271 119 362 235 114 151 125 354 891 1419
3201 1419 5500 2464 623 118 253 310 187 165 258 270 267 117 219 545 714 1744 7512 4245 748 213 258 239 94
$$ packed form
5807A42r7P5m6L0l8K0l3Q4np8K6J08p7o0OJ09J0L0L7j86L3l1J70k9n4J9j00O0%Q2p8n8R4n8
5408A07J90j95J98q1j11K4J57o6Oj30l3Nk9j6R3qq1J1l3J82j30K8l2R8L3l6j19Q5k5K6j3L11
5032D16j86n7m5k6q5J79kQ9j92J33K8o3J12j00K4Mm7o2p0J04J05m8j20O3m7p9P4o8K0K2j9
4669E7P0j8R1o3j08O6J13p4Q5n6r4O2P0l1m0J33j55J12J6j04m7O0J1N4qL5j40Kr8O8N5p0K0
4281G4K1J9J21j56K5K2n9J08j2J2M0RP6k11J95k6n6j15J36o5L6J0j6n1J27O8j51O8j6j40R9
3917A92p0M2n2NN8r1N4M3j25R8L7Pl9q2O1lL1m0m3O4p1J41j15k1J74j79J76j49K1J2N5j54
3542C7N6L8K8m7k0J2l4M9j4Q7J8j10K6J62j19Jj05J18m7J35j52K43j27j21L7k6K29N37N28
3201A419M081l036j841n05J35N7j23k2R3J2lj50J02L26J69J030N768l267l497n35M5j9j45
$$ plain form
2931 94 339 67 1370 1765 1086 489 182 44 231 88 37 170 164 83 127 43 104 53 115 100 233 107 57 232 262 86 121 153
2603 153 147 158 254 132 58 101 31 163 173 192 36 325 314 35 69 49 49 40 86 136 243 234 119 241 225 165 83 218 399 184 118
2239 118 266 172 106 124 28 60 37 79 128 112 106 195 62 143 143 274 152 60 115 113 132 38 172 151 61 128 145 73 126 166 175 52 133 139
1840 139 106 99 178 260 53 63 80 101 47 161 89 30 147 165 25 98 138 210 98 56 118 132 35 160 191 53 43 138 63 26 201
1476 201 172 200 318 258 134 294 162 72 122 232 271 95 179 106 72 119 106 96 170 104 159 105 149 118 57 121 111 270 324 202 192
1112 192 134 91 33 124 156 207 304 218 76 175 128 166 216 29 93 102 116 46 123 216 156 94 102 73 125 117 182 234 110 149 43 102 86 160
713 160 70 101 91 176 114 121 149 111 77 181 105 205 149 118 99 100 94 22 80 126 162 148 129 111 75 112 71 89 223 38 81 351 280 192
314 192 274 33 86 86 65 23 95 181 69 85 156 77 138 170 172 164 101 72 9 119 137 81 172 69 106 99 160 40 83 188 204 70 46 167
$$ packed form
2931I4K45k72J303L95o79n97l07j38J87j43n1J33oq1M4q4O1n1O2j5J33j26n0J75L0j76L5L2
2603A53oJ1R6j22p4M3p0J32J0J9j56K89j1k79L4k0%rM6N0J07rj15J22j6o0q2J35J81k15o6
2239A18J48r4o6J8r6L2k3M2M9j6oQ9j33Q1%J31j22r2N5kJ9r4J34k1r0O7J7p2N3M0Rj23Q1O
1840A39l3pP9Q2k07J0J7K1n4J14p2n9J17J8j40P3M0P2j12m2O2J4r7J25L1j38j0R5p5l7J75
1476B01k9K8J18o0j24J60j32r0N0J10L9j76Q4p3l4M7j3j0P4o6N5n4M4l1o1O4j0J59N4j22j0
1112A92n8m3n8R1L2N1R7q6j42R9m7L8N0j87O4RJ4p0P7R3o0o2Qk9N2qO5N2j24L9j06N9j6P4
713A60r0L1j0Q5o2PK8l8l4J04p6J00n6l1j9Jop2N8M6L6j4j9j8l6L7m1J8J34j85M3K70p1q8
314A92Q2k41N3%k1m2P2Q6j12J6P1p9O1L2Kqo3k9o3J10J8n6R1j03L7pO1j20M3J05J6j34k4J21
$$ plain form
-85 167 342 327 208 49 175 53 107 182 250
$$ packed form
-85A67J75j5j19j59J26j22N4P5O8
-191B50
##PAGE=	F1=2364.9
##FIRST=	25168.397401625570637,	5807.04592319999756,	0.3482405245304107666
##DATA TABLE=	(F2++(Y..Y)), PROFILE
$$ plain form
5807 150 43 101 43 104 73 128 127 151 188 58 52 191 124 75 79 166 154 181 224 16 81 57 216 203 156 164 86 107 121 206 127 64 194 99
5408 99 248 160 358 203 151 85 264 220 218 92 88 116 99 38 88 62 87 64 59 221 57 106 65 177 218 156 19 94 92 155 79 432
5032 432 247 151 119 144 35 179 196 242 70 225 265 173 306 231 202 158 202 92 128 125 221 182 102 157 147 17 73 77 28 106 89 113
4657 113 116 170 105 58 100 238 81 189 185 55 94 173 121 102 228 122 199 217 113 51 182 111 189 208 211 56 135 2 26 87 97
4293 97 130 92 152 255 87 101 139 56 196 198 135 202 265 306 92 270 255 169 41 219 138 145 172 137 101 237 301 173 257 273 104
3929 104 248 113 163 91 135 205 86 107 140 31 144 192 183 124 67 157 136 144 127 81 122 81 190 124 111 288 64 278 112 80 135
3565 135 159 65 82 114 114 57 63 137 58 100 98 189 176 55 145 284 227 173 92 149 139 245 184 391 225 145 199 172 275 622 1034 4127
3190 4127 1856 534 133 192 236 140 186 261 235 226 94 206 369 573 1240 5529 3182 493 206 212 233 46 300 138 943
$$ packed form
5807A50j07N8n8O1l1N5jK4L7j30oJ39o7m9MQ7j2K7M3k08O5k4J59j3m7Qp8K1J4Q5p9o3J30r5
5408I9J49q8J98j55n2o6J79m4kj26mK8j7o1N0k6K5k3nJ62j64M9m1J12M1o2j37P5kO3p6L53
5032D32j85r6l2K5j09J44J7M6j72J55M0r2J33p5k9m4M4j10L6lR6l9q0N5j0j30N6Mm9P8j7K4
4657A13LN4o5m7M2J38j57J08mj30L9P9n2j9J26j06P7J8j04o2J31p1P8J9Lj55P9j33K4O1J0
4293I7L3l8O0J03j68J4L8q3J40Ko3O7O3M1k14J78j5q6j28J78q1PK7l5l6J36O4j28Q4J6j69
3929A04J44j35N0p2M4P0j19K1L3j09J13M8rn9n7R0k1Qj7m6M1m1J09o6j3J77k24K14j66l2N5
3565A35K4r4J7L2%n7OP4p9M2kR1j3j21R0J39n7n4q1N7j0J06o1K07j66q0N4k7J03L47M12L093
3190D127k271j322m01N9M4r6M6P5k6rj32J12J63K04O67M289k347k689k87OK1j87K54j62Q05
$$ plain form
2896 943 1240 827 327 132 54 233 79 72 178 157 104 193 121 116 87 78 55 188 87 108 238 264 69 96 150 157 102 199 89 67 144
2532 144 76 117 157 189 40 350 286 34 28 60 63 75 52 126 233 228 160 256 230 144 117 181 408 198 101 234 160 97 122 28 37 23 61
2145 61 98 136 119 239 85 119 147 291 200 59 86 115 132 43 155 132 50 100 137 68 142 184 202 136 144 128 108 85 132 269 17 91
1769 91 56 68 58 168 93 41 164 161 62 89 134 163 80 102 159 140 32 152 206 67 46 144 69 27 183 158 193 315 279 117 293
1405 293 123 77 63 154 238 120 184 151 96 145 141 70 180 128 211 111 165 130 62 145 105 288 321 203 202 131 69 6 141 147 197 321
1030 321 212 51 133 169 201 198 51 136 145 166 21 111 187 146 71 148 118 93 148 225 248 152 186 64 162 112 154 74 56 113 146 111 141
643 141 109 76 72 171 80 166 112 124 74 100 71 32 57 118 160 156 166 106 97 141 56 124 283 83 115 350 294 189 250 37 95 134 92 10
243 10 104 193 100 91 175 97 97 134 191 165 93 98 48 137 131 73 168 98 86 83 116 65 54 159 206 97 32 173 341 325 218 28 185 50
$$ packed form
2896I43K97m13n00j95p8J79j54pJ06k1n3Q9p2nk9rk3J33j01K1J30K6j95K7N4Pn5R7j10k2P7
2532A44o8M1M0L2j49L10o4k52oL2LJ2k3P4J07no8R6k6q6k7O4K27k10r7J33p4o3K5r4Rj4L8
2145F1L7L8j7J20j54L4K8J44r1j41K7K9J7q9J12k3q2N0L7o9P4M2J8o6Qj6k0k3M7J37k52P4
1769I1l5J2j0J10p5n2J23lr9K7M5K9q3K2N7j9j08J20N4j39k1R8p5m2J56k5L5J22l6j62J76
1405B93j70m6j4R1Q4j18O4l3n5M9mp1J10n2Q3j00N4l5o8Q3m0J83L3j18jp1o2o3J35ON0J24
1030C21j09j61Q2L6L2lj47Q5RK1j45R0P6m1p5P7l0k5N5P7K3r6L4j22R8n0M2q0j8N7L3l5L0
643A41l2l3mR9r1Q6n4J2n0K6k9l9K5O1M2mJ0o0rM4q5O8J59k00L2K35n6j05O1k13N8L9m2q2
243A0R4Q9r3rQ4p8%L7N7k6p2Nn0Q9on8R5p0j2lL3n1j1J05M7j09o5J41J68j6j07j90J57j35
$$ plain form
-156 50 107 164 222
$$ packed form
-156E0N7N7N8
-191B22
##PAGE=	F1=2262.64
##FIRST=	25168.397401625570637,	5807.04592319999756,	0.38262525200843811035
##DATA TABLE=	(F2++(Y..Y)), PROFILE
$$ plain form
5807 158 45 80 28 90 83 154 171 158 209 63 20 168 116 90 98 162 125 144 172 23 113 88 192 212 168 159 108 101 131 180 123 61 198 102
5408 102 208 217 393 183 193 120 225 204 201 70 98 136 146 72 91 5 130 103 111 230 71 115 71 176 224 162 45 76 100 166 50
5044 50 396 257 126 105 173 68 190 190 202 61 224 263 161 311 245 179 110 218 82 194 101 160 145 104 153 178 23 54 119
4704 119 68 139 120 86 120 132 87 130 102 259 84 145 170 34 63 122 69 65 178 109 163 181 91 51 205 104 153 191 154 70 163 0
4328 0 17 85 126 181 130 178 247 78 129 153 77 215 219 106 180 284 303 107 243 249 138 39 197 106 91 138 87 77 185 236 158 262
3953 262 304 117 305 110 145 69 161 211 82 86 113 21 132 162 161 85 41 181 157 122 115 87 103 92 168 153 129 303 69 281 97
3589 97 85 111 135 93 92 84 111 26 58 150 110 73 95 164 153 9 148 278 280 161 126 94 128 208 228 389 202 172 255 214 212 328 630
3201 630 2593 1180 413 174 169 187 74 206 272 202 193 124 182 192 416 712 3389 2016 224 181 172 234 13 260 193 539 748
$$ packed form
5807A58j13L5n2O2pP1J7j3N1j46m3J48n2k6QO4l7J9K8j49R0k5J04K0m4rn1pL0M9n7o2J37r6
5408A02J06RJ76k10J0p3J05k1lj31K8L8J0p4J9q6J25k7QJ19j59M4m4J05M8o2j17L1K4O6j16
5044E0L46j39j31k1O8j05J22%J2j41J63L9j02J50o6o6o9J08j36J12r3N9j5m1M9K5j55L1O5
4704A19n1P1j9l4L4J2m5M3k8J57j75O1K5j36K9N9n3mJ13o9N4J8r0m0J54j01M9L8l7q4R3j63
4328@J7O8M1N5n1M8O9j69N1K4p6J38Mj13P4J04J9j96J36Oj11r9J58r1j5M7n1j0J08N1p8J04
3953B62M2j87J88j95L5p6R2N0j29MK7r2J11L0jp6m4J40k4l5pk8J6j1P6j5k4J74k34K12j84
3589I7j2K6K4m2jqK7q5L2R2m0l7K2O9j1j44J39J30Kj19l5l2L4Q0K0J61j87l0Q3m1kJ16L02
3201F30J963j413p67k39nJ8j13J32O6p0ro9N8J0K24K96K677j373j792m3rO2k21K47o7L46K09
$$ plain form
2884 748 530 169 94 66 209 61 123 176 175 144 271 193 138 113 49 21 125 55 147 232 257 90 81 125 145 62 134 46 102 194 133 101
2509 101 149 196 31 340 246 55 39 77 92 120 12 95 217 212 186 247 230 127 136 118 384 214 95 190 151 88 109 28 36 61 54 80
2133 80 140 117 246 120 97 148 287 227 58 58 120 143 91 147 130 40 66 126 84 168 195 207 213 175 107 139 88 79 273 48 101 63 29 82
1734 82 186 114 60 171 140 123 81 129 111 58 142 206 134 29 143 211 82 42 165 85 41 171 154 186 293 274 88 273 113 121
1382 121 17 77 212 143 178 190 95 162 175 60 162 169 255 103 159 140 75 159 99 296 315 210 216 139 45 48 132 101 161 319 202 32
1006 32 112 199 219 169 98 169 173 211 5 103 154 133 66 188 150 54 179 266 257 179 211 79 212 128 127 73 31 159 109 101 137 53 81 72 152
596 152 26 117 89 103 40 97 58 53 25 133 153 147 183 95 116 171 29 141 292 144 177 326 284 173 215 52 104 176 124 10 125
232 125 197 134 121 189 118 90 116 191 147 86 119 84 168 137 74 165 129 74 89 71 90 73 109 179 123 64 158 343 322 228 26 178 42
$$ packed form
2884G48k18l61p5k8J43j48O2N3jl1J27p8n5k5o4k8J04p0R2Q5K5j67rM4K0q3P2q8N6R2o1l2
2509A01M8M7j65L09r4j91j6L8J5K8j08Q3J22nk6O1j7j03Rj8K66j70j19R5l9o3K1q1QK5pK6
2133H0O0k3J29j26k3N1J39o0j69%O2K3n2N6j7r0K6O0m2Q4K7J2Ol8o8L2n1rJ94k25N3l8l4N3
1734H2J04p2n4J11l1j7m2M8j8n3Q4O4p2j05J14O8j29m0J23q0m4J30j7L2J07j9j86J85j60Q
1382A21j04O0J35o9L5J2r5O7J3j15J02PQ6j52N6j9o5Q4o0J97J9j05Op7r4LQ4l1O0J58j17j70
1006C2Q0Q7K0n0p1P1ML8k06R8N1k1o7J22l8r6J25Q7rp8L2j32J33q4jn4m2J28n0qL6q4K8rQ0
596A52j26R1k8J4o3N7l9nk8J08K0oL6q8K1N5j42J12J51j48L3J49m2j11M2j63N2P2n2j14J15
232A25P2o3j3O8p1k8K6P5m4o1L3l5Q4l1o3R1l6n5J5j8J9j7L6P0n6n9R4J85k1r4k02J52j36
$$ plain form
-156 42 110 147 191
$$ packed form
-156D2O8L7M4
-191A91
##PAGE=	F1=2160.38
##FIRST=	25168.397401625570637,	5807.04592319999756,	0.50283235311508178711
##DATA TABLE=	(F2++(Y..Y)), PROFILE
$$ plain form
5807 159 44 62 61 62 93 153 178 140 186 65 17 125 88 99 108 157 92 124 103 55 155 135 155 225 179 155 128 107 137 131 112 57 185 113
5408 113 189 237 390 159 206 167 192 185 184 47 102 125 182 123 130 48 155 136 154 222 82 117 65 159 202 153 73 67 105 153 35 314 244
5021 244 109 83 180 97 239 176 180 64 217 241 155 313 238 161 110 228 94 237 83 86 110 106 151 193 39 45 148 107 170 147 58
4657 58 124 95 97 181 103 263 144 121 122 39 76 44 51 23 126 63 119 145 91 84 197 129 103 148 75 111 174 4 54 113 133 214 180 185 207
4246 207 52 176 170 117 226 216 108 157 274 289 121 207 226 115 83 173 79 38 113 58 80 114 150 138 262 316 140 351 121 107
3894 107 43 180 191 87 65 104 60 146 118 145 61 11 181 172 112 90 106 97 125 169 188 129 297 73 257 60 130 78 124 121 124 41 153
3506 153 105 79 142 168 48 90 124 141 37 141 276 318 132 157 33 100 171 248 357 176 184 294 241 175 64 304 1178 553 293
3166 293 219 176 189 3 221 283 176 188 166 151 40 280 266 1526 989 12 138 152 235 38 226 216 234 379 228 128 99
$$ packed form
5807A59j15J8jJL1O0K5l8M6j21m8J08l7J1RM9o5L2k1m8J00k0K0P0m6k4k7k1L0oj9n5J28p2
5408A13P6M8J53k31M7l9K5pjj37N5K3N7n9Pq2J07j9J8O8j40L5n2R4M3m9q0oL8M8j18K79p0
5021B44j35k6R7q3J42o3Mj16J53K4q6J58p5p7n1J18j34J43j54LK4mM5M2j54OJ03m1O3k3q9
4657E8O6k9KQ4p8J60j19k3Jq3L7l2Pk8J03o3N6K6n4pJ13o8k6M5p3L6O3j70N0N9K0Q1l4NK2
4246B07j55J24on3J09j0j08M9J17J5j68Q6J9j11l2R0r4m1P5n5K2L4L6j2J24N4j76K11k30j4
3894A07o4J37J1j04k2L9m4Q6k8K7q4n0J70ro0k2J6rK8M4J9n9J68k24J84j97P0n2M6lLq3J12
3506A53m8k6O3K6j20M2L4J7j04J04J35M2j86K5j24O7P1P7J09j81QJ10n3o6j11K40Q74o25k60
3166B93p4m3J3j86K18O2j07J2k2j5j11K40j4J260n37r77J26J4Q3j97J88j0J8J45j51j00k9
$$ plain form
2849 99 72 167 36 148 166 217 196 340 244 158 129 65 25 68 24 164 213 235 118 107 86 120 100 94 59 150 231 168 136 152 209 8 298
2462 298 193 74 96 100 128 152 38 45 209 192 189 216 217 112 135 43 330 224 104 140 145 86 102 48 46 113 34 87 130 98 217 154 98
2075 98 162 260 231 60 34 129 167 145 150 143 43 34 118 110 200 197 185 264 210 75 173 104 37 265 95 90 110 22 91 204 139 75 161 133 201
1664 201 94 133 98 35 169 242 115 29 135 203 96 35 191 116 65 163 162 179 270 257 50 235 120 160 6 17 191 159 155 216
1312 216 78 173 189 67 120 208 275 79 128 136 96 160 92 286 307 218 226 150 24 85 97 30 105 295 186 50 131 213 217 138 125 181
936 181 173 226 27 99 124 125 70 206 163 15 198 293 256 190 221 86 228 135 83 71 72 211 70 89 104 21 109 74 130 49 65 86 55
549 55 5 77 65 75 70 179 141 131 188 82 128 193 29 141 253 178 238 288 251 147 181 76 115 207 152 37 155 194 151 154 199 134
173 134 125 133 182 130 85 127 106 189 145 78 161 163 81 112 33 102 117 41 129 150 110 123 349 316 238 49 157 34 117 138 162
$$ packed form
2849I9k7R5j31J12J8N1k1J44r6q6k9o4m0M3m4J40M9K2j17j1k1L4k0ol5R1Q1o3l2J6N7k01K90
2462B98j05j19K2MK8K4j14PJ64j7lK7Jj05K3r2K87j06j20L6Nn9J6n4kO7p9N3M3l2J19o3n6
2075I8O4R8k9j71k6R5L8k2Npj00rQ4qR0lj2P9n4j35R8o9o7K28j70nK0q8O9J13o5o4Q6k8O8
1664B01j07L9l5o3J34P3j27q6J06O8j07o1J56p5n1R8jJ7R1j3k07J85j15M0j54J1J74l2mO1
1312B16j38R5J6j22N3Q8O7j96M9Qm0O4o8J94K1q9Qp6j26O1J2o7P5J90j09j36Q1Q2Mp9j3N6
936A81qN3j99P2K5Jn5J36m3j48J83R5l7o6L1j35J42r3n2j2JJ39j41J9J5q3Q8l5N6q1J6K1l1
549E5n0P2j2J0nJ09l8j0N7j06M6O5j64J12J12p5O0N0l7j04L4j05L9R2n5j15J18L9m3LM5o5
173A34rQM9n2m5M2k1Q3m4o7Q3Kq2L1p9O9J5p6Q8K1m0J3K26l3p8j89J08j23Q3K1K4
-191A62
##PAGE=	F1=2058.12
##FIRST=	25168.397401625570637,	5807.04592319999756,	0.59704566001892089844
##DATA TABLE=	(F2++(Y..Y)), PROFILE
$$ plain form
5807 149 43 68 111 34 106 131 156 103 125 64 60 76 51 105 105 152 65 143 45 72 180 187 103 234 189 150 138 105 125 69 98 46 159 127
5408 127 190 209 339 131 182 184 167 182 173 50 115 86 215 181 168 86 161 154 183 202 79 119 56 145 159 128 94 63 101 126 55 200 206 109
5009 109 56 164 121 303 160 179 86 198 198 152 307 209 152 130 230 101 256 69 20 84 116 153 188 62 37 154 125 190 164 53
4657 53 128 64 120 194 101 241 195 137 56 81 133 62 78 21 94 8 71 129 119 103 154 153 44 89 15 140 165 6 78 140 116 225 215
4269 215 169 140 24 220 187 161 225 185 125 139 233 262 129 165 184 109 120 161 80 17 101 86 104 49 64 120 254 307 167 372 143
3906 143 47 19 185 154 108 35 120 104 183 87 140 64 21 149 168 123 56 139 105 171 193 222 110 272 64 214 27 181 70 116
3553 116 144 159 22 197 171 98 117 203 41 80 92 137 71 140 279 335 88 181 71 58 143 246 302 157 180 306 254 161 137 168
3201 168 232 78 209 254 179 211 75 236 285 157 198 189 121 79 196 31 233 264 164 85 160 219 61 199 203 53 148 68 214
$$ packed form
5807A49j06K5M3p7P2K5K5n3K2o1mJ6k5N4%M7q7P8r8K7J08Pq4J31m5l9j2l3K0n6K9n2J13l2
5408A27O3J9J30k08N1Kj7J5rj23O5k9J29l4j3q2P5pK9J9j23M0o3Q9J4l1l4l1L8K5p1J45Or7
5009A09n3J08m3J82j43J9r3J12%m6J55r8n7k2J00j29J55j87m9O4L2L7L5j26k5J17k9O5k6j11
4657E3P5o4N6P4r3J40m6n8q1K5N2p1J6n7P3q6O3N8j0j6N1jj09M5p4J25K5j59P2O2k4J09j0
4269B15m6k9j16J96l3k6O4m0o0J4R4K9j33L6J9p5J1M1q1o3Q4j5J8n5J5N6J34N3j40K05k29
3906A43r6k8J66l1m6p3Q5j6P9r6N3p6m3J28J9m5o7Q3l4O6K2K9j12J62k08J50j87J54j11M6
3553A16K8J5j37J75k6p3J9Q6j62L9J2M5o6O9J39N6k47R3j10j3Q5J03N6j45K3J26n2r3k4L1
3201A68O4j54J31M5p5L2j36J61M9j28M1ro8m2J17j65K02L1j00p9P5N9j58J38Mj50R5q0J46
$$ plain form
2861 214 130 72 121 52 138 166 273 249 383 264 173 137 98 33 90 46 156 182 201 133 153 61 90 152 115 112 204 247 169 174 161 223 45
2474 45 234 132 87 156 134 159 170 75 16 224 170 169 170 186 95 120 47 254 222 117 93 141 93 109 92 48 158 20 111 116 72 160 181
2086 181 123 188 212 213 73 23 139 196 191 160 161 64 23 113 141 229 191 142 280 234 37 190 119 54 239 122 55 160 51 81 208
1722 208 149 82 134 165 284 119 156 153 36 175 258 91 54 127 182 103 30 209 152 95 155 174 168 263 243 18 180 128 183 3 31
1359 31 169 163 123 227 95 179 181 79 69 229 266 45 92 114 117 155 85 259 296 223 217 152 28 112 44 53 44 252 163 89 179 211 199 112
959 112 124 168 146 203 34 100 104 125 76 197 154 20 202 291 243 188 216 94 201 136 35 70 107 251 34 89 43 83 123 75 110
596 110 129 17 100 16 33 52 85 90 132 238 127 118 190 81 134 202 62 130 181 181 281 248 201 117 156 112 127 225 176 66 187 189 147
208 147 176 208 137 170 167 169 130 93 125 109 193 147 76 152 196 102 145 8 100 156 46 72 176 156 73 349 304 247 90 124 36 125 135 140
$$ packed form
2861B14q4n8M9o9Q6K8J07k4J34j19r1l6l9o5N7m4J10K6J9o8K0r2K9O2l7lR2M3p8Nj3O2j78
2474D5J89j02m5O9k2K5J1r5n9K08n4jJJ6r1K5p3K07l2j05k4M8m8J6j7m4J10j38R1Nm4Q8K1
2086A81n8O5K4Jj40n0J16N7nl1Jr7m1R0K8Q8l8m9J38m6j97J53p1o5J85j17o7J05j09L0J27
1722B08n9o7N2L1J19j65L7lj17J39Q3j67l7P3N5p9p3J79n7n7O0J9oR5k0k25J62n2N5j80K8
1359C1J38om0J04j32Q4Kj02j0J60L7k21M7K2LL8p0J74L7p3oo5j24Q4o8RrK08q9p4R0L2j2q7
959A12J2M4k2N7j69O6MK1m9J21m3j34J82Q9m8n5K8j22J07o5j01L5L7J44k17N5m6M0M0m8L5
596A10J9j12Q3q4J7J9L3NM2J06j11rP2j09N3O8j40O8N1%J00l3m7q4L9m4J5R8m9j10J21Km2
208A47K9L2p1L3lKl9l7L2j6Q4m6p1P6M4r4M3j37R2N6j10K6J04k0q3K76m5n7j57L4q8Q9J0N
-191A40
##PAGE=	F1=1955.86
##FIRST=	25168.397401625570637,	5807.04592319999756,	0.60414808988571166992
##DATA TABLE=	(F2++(Y..Y)), PROFILE
$$ plain form
5807 128 54 96 161 46 121 95 123 87 44 64 100 41 40 106 89 149 56 175 44 72 178 236 44 235 193 143 130 82 98 6 83 33
5431 33 128 141 192 134 242 99 127 165 139 196 172 75 140 39 251 235 184 101 150 152 192 178 57 122 71 151 113 95 108 60 86 98 82
5044 82 77 152 115 28 130 138 360 143 192 126 165 135 147 286 157 153 143 226 91 256 62 47 70 125 156 164 90 24 135 121 195 170 71
4657 71 130 47 135 166 92 190 212 158 16 122 202 165 102 63 105 84 29 145 154 97 83 160 18 54 101 151 136 4 90 153 83 213 224
4269 224 134 66 62 253 195 196 209 131 131 127 169 220 131 120 125 127 144 159 101 42 101 130 131 78 40 105 237 282 184 356 167 26 25 174 114 136
3847 136 31 162 146 218 85 144 88 44 88 148 144 26 174 109 212 224 245 79 233 40 160 61 226 104 101 159 183 77 220
3506 220 209 101 84 205 51 71 99 139 90 158 281 329 35 197 138 27 121 228 237 158 168 294 252 160 252 241 659 242 179 274
3154 274 161 210 138 254 274 142 198 185 97 151 168 161 399 103 233 34 180 182 71 172 161 27 65 211 265 160 74 86 102
$$ packed form
5807A28p4M2O5j15P5k6K8l6m3K0L6n9jO6j7O0r3J19j31K8J06N8j92J91m2n0j3m8J6r2P7n0
5431C3R5J3N1n8J08j43K8L8k6N7k4r7O5j01K12j6n1q3M9KM0j4j21O5n1Q0l8j8J3m8K6J2j6
5044H2nP5l7q7J02QK22k17M9o6L9l0J2J39j29mj0Q3j35J65j94j5K3N5L1Qp4o6J11j4P4k5r9
4657G1N9q3Q8L1p4R8K2n4j42J06Q0l7o3l9M2k1n5J16Rn7j4P7j42L6M7N0j5j32Q6O3p0J30J1
4269B24r0o8mJ91n8JJ3p8%mM2N1q9j1NKJ7J5n8n9N9K9Jn3l8O5J32M5r8J72j89j41jJ49o0K2
3847A36j05J31j6P2j33N9n6m4M4O0mj18J48o5J03J2K1j66J54j93J20r9J65j22lN8K4j06J43
3506B20j1j08j7J21j54K0K8M0m9O8J23M8k94J62n9j11R4J07Rp9J0J26m2r2R2j1M18m17o3R5
3154B74j13M9p2J16K0j32N6j3q8N4J7pK38k96J30j99J46Kj11J01j1j34L8J46N4j05q6J2J6
$$ plain form
2814 102 102 185 320 287 388 249 181 139 118 41 162 86 123 141 164 130 190 83 60 179 153 158 257 240 136 186 169 231 88 160 69 96
2438 96 212 176 180 178 98 73 265 157 135 123 140 71 109 117 166 203 123 58 136 108 128 143 36 187 43 139 108 77 92 197 152 204 148
2051 148 183 97 30 149 223 219 164 170 88 41 107 169 248 176 108 262 244 19 186 122 90 195 120 11 195 80 62 187 129 76 94
1687 94 213 357 138 198 237 76 159 254 72 93 115 149 98 31 209 176 123 143 180 154 275 238 50 119 129 194 31 50 146 153 91
1323 91 226 154 176 155 91 45 223 226 11 83 80 130 160 82 215 278 222 180 143 64 124 14 130 39 196 133 128 232 197 173 96 97 130
936 130 100 150 31 107 92 125 85 162 130 52 190 258 213 175 197 115 141 130 25 75 121 271 22 103 41 140 114 68 92 199 35 124
560 124 86 61 62 105 96 179 290 117 114 194 111 137 197 91 120 98 160 298 211 139 83 144 154 139 226 189 90 213 184 127 185 215 127 204
161 204 198 155 144 109 118 99 180 141 65 137 222 117 175 7 89 180 130 54 204 198 14 335 278 250 139 84 54 130 132 124
$$ packed form
2814A02%Q3J35l3J01j39o8m2k1p7J21p6L7J8K3l4O0j07k3J19k6NR9j7j04N0j7O2j43P2r1K7
2438I6J16l6Mkq0k5J92j08k2j2J7o9L8QM9L7q0o5P8k8K0J5j07J51j44R6l1l1J5J05m5N2n6
2051A48L5q6o7J19P4mn5Oq2m7O6O2P9p2o8J54j8k25J67o4l2J05p5j09J84j15j8J25n8n3J8
1687I4J19J44k19O0L9j61Q3R5j82K1K2L4n1o7J78l3n3K0L7k6J21l7j88O9J0O5j63J9R6Po2
1323I1J35p2K2k1o4m6J78Lk15P2lN0L0p8J33O3n6m2l7p9O0j10J16r1J57o3nJ04l5k4p7JL3
936A30l0N0j19P6j5L3m0P7l2p8J38O8m5l8K2q2K6j1j05N0M6J50k49Q1o2R9k6m6K4J07j64Q9
560A24l8k5JM3rQ3J11j73lQ0q3K6O0j06K9k2O2J38q7p2n6O1J0j5Q7l7r9J23k9n7N8L0q8P7
161B04om3j1l5Rj9Q1l9p6P2Q5j05N8j68Q2R1n0p6J50oj84L21n7k8j11n5l0P6Kq
-191A24
##PAGE=	F1=1853.61
##FIRST=	25168.397401625570637,	5807.04592319999756,	0.48921498656272888184
##DATA TABLE=	(F2++(Y..Y)), PROFILE
$$ plain form
5807 101 78 127 201 76 134 62 106 127 45 62 132 44 65 94 65 150 63 191 65 55 153 279 40 224 187 131 100 36 82 44 78 44
5431 44 101 147 180 33 114 65 58 121 95 209 177 94 166 55 284 274 176 92 122 133 181 155 27 126 109 176 99 72 118 58 63 77 104 33
5032 33 106 117 22 83 147 392 131 204 167 127 65 133 245 87 165 146 217 62 249 69 75 64 120 151 127 122 25 95 100 184 165 94 136
4645 136 47 133 106 80 112 187 157 64 151 266 253 111 98 136 146 46 180 178 66 14 145 76 92 172 149 95 5 92 156 48 182
4281 182 203 91 57 123 272 188 219 178 73 117 118 100 168 130 79 61 165 155 157 121 53 104 160 148 138 79 95 210 246 179 301 186
3906 186 101 43 152 85 163 68 211 189 234 99 150 124 61 13 124 160 31 201 95 237 249 251 43 185 14 108 107 264 146
3565 146 76 160 192 133 220 212 92 61 176 64 61 135 143 92 185 274 303 28 209 186 52 101 202 174 181 159 268 234 163 290 306 854
3190 854 335 173 275 124 173 185 282 256 128 178 160 82 188 176 160 471 165 228 23 186 132 71 142 110 58 80 214 248 182
$$ packed form
5807A01k3M9P4j25N8p2M4K1q2J7P0q8K1K9k9Q5q7J28j26j0R8J26k39J84l7n6l1o4M6l8L4l4
5431D4N7M6L3j47Q1m9pO3k6J14l2q3P2j11K29j0r8q4L0J1M8k6j28R9j7O7p7k7M6o0NJ4K7p1
5032C3P3J1r5O1O4K45k61P3l7m0o2O8J12j58P8j9P1j55J87j80Oj1N6L1k4nr7P0NQ4j9p1M2
4645A36q9Q6k7k6L2P5l0r3Q7J15j3j42j3L8J0j00J34kj12n2J31o9J6Q0k3n4r0Q7O4j08J34
4281A82K1j12l4O6J49q4L1m1j05M4Jj8O8l8n1j8J04j0Kl6o8N1N6j2j0n9J6J15L6o7J22j15
3906A86q5n8J09o7P8r5J43k2M5j35N1k6o3m8J11L6j29J70j06J42J2Kk08J42j71R4jJ57j18
3565A46p0Q4L2n9Q7qj20l1J15j12lP4Qn1R3Q9K9k75J81k3j34M9J01k8Pk2J09l4p1J27J6N48
3190H54n19j62J02j51M9J2R7k6j28N0j8p8J06j2j6L11l06O3k05J63n4o1P1l2n2K2J34L4o6
$$ plain form
2849 182 80 73 146 59 202 333 301 356 203 182 133 121 68 226 115 72 97 139 118 202 106 23 176 175 182 299 217 100 168 172 225 116
2474 116 92 13 102 255 216 190 183 106 114 308 162 102 87 84 40 123 175 82 168 117 48 124 126 150 189 25 190 54 169 112 121 64 205
2086 205 177 195 78 158 128 43 158 239 218 153 163 102 60 100 188 249 152 132 223 245 61 165 110 113 153 102 62 208 112 58 147 76 57
1699 57 55 249 407 143 252 329 131 121 230 68 129 97 109 78 35 186 181 142 122 172 137 292 236 101 78 123 200 80 55 127 130
1335 130 76 216 211 159 124 107 85 190 163 26 103 43 134 186 91 159 248 218 117 137 111 121 65 188 87 135 99 161 271 171 149
971 149 95 59 75 48 98 46 122 85 111 96 119 101 83 170 201 165 154 166 143 68 115 44 82 118 265 56 120 127 181 91 52 72 244 75
572 75 142 151 77 96 120 88 198 323 111 111 197 157 140 185 111 119 24 134 289 181 73 44 138 191 146 206 183 102 232 178 102 181 218
185 218 112 222 220 145 158 129 112 86 160 126 46 118 236 115 190 18 72 185 205 90 238 236 50 305 234 240 184 48 80 129 119
$$ packed form
2849A82j02pP3q7J43J31l2N5j53k1m9j2n3J58j11m3K5M2k1Q4r6q3J53jPJ17q2j17O8MN3j09
2474A16k4p9Q9J53l9k6pp7QJ94j46o0j5lm4Q3N2r3Q6n1o9P6KK4L9j64J65j36J15n7Rn7J41
2086B05k8J8j17Q0l0q5J15Q1k1o5J0o1m2M0Q8O1r7k0R1K2j84J04n5LM0n1m0J46r6n4Q9p1j9
1699E7kJ94J58k64J09P7j98j0J09j62O1l2J2l1m3J51nl9k0N0l5J55n6j35k3M5P7j20k5P2L
1335A30n4J40nn2l5j7k2J05k7j37P7o0R1N2r5O8Q9l0j01K0k6J0n6J23j01M8l6O2J10j00k2
971A49n4l6J6k7N0n2P6l7K6j5K3j8j8Q7L1l6j1J2k3p5M7p1L8L6J47k09O4PN4r0l9K0J72j69
572G5O7Rp4J9K4l2J10J25k12%Q6m0j7M5p4Qr5J10J55j08j08k9R4N3m5O0k3q1J30n4p6P9L7
185B18j06J10kp5J3k9j7k6P4l4q0P2J18j21P5j72N4J13K0j15J48kj86K55p1On6j36L2M9j0
$$ plain form
-179 119 110
$$ packed form
-179A19r
-191A10
##PAGE=	F1=1751.35
##FIRST=	25168.397401625570637,	5807.04592319999756,	0.28306472301483154297
##DATA TABLE=	(F2++(Y..Y)), PROFILE
$$ plain form
5807 75 102 146 219 95 136 41 113 180 111 58 152 59 80 71 52 155 73 181 76 44 128 311 99 201 166 114 56 20 108 72 90 80
5431 80 89 141 150 92 18 36 21 74 59 205 178 98 181 99 301 290 147 66 84 103 153 132 41 123 146 209 126 70 125 64 49 64 120 112 92
5021 92 109 46 35 148 390 131 199 193 109 57 108 189 18 188 150 201 23 245 92 75 63 96 135 89 153 65 46 79 164 153 122 149
4645 149 54 116 62 75 35 127 125 91 167 315 311 105 121 157 179 92 209 182 53 79 112 124 133 224 144 54 22 95 155 37 139 159 58
4258 58 111 181 280 160 226 140 63 88 114 54 109 127 57 25 214 159 149 137 49 107 167 149 175 94 88 175 207 145 215 192 162 56 137 65
3859 65 186 88 240 228 223 116 155 163 74 80 118 163 59 210 57 247 265 238 14 136 37 63 147 298 183 47 147 188 179 207 186
3495 186 84 89 132 76 48 172 144 80 205 252 262 71 220 209 79 82 174 119 213 154 239 205 167 272 280 663 254 162 257 82 107
3131 107 213 321 245 113 144 126 77 200 197 86 212 41 177 35 164 85 74 116 67 84 40 66 201 191 90 66 172 47
$$ packed form
5807G5K7M4P3j24M1r5P2O7o9n3R4r3K1rj9J03q2J08j05l2Q4J83k12J02l5n2n8l6Q8l6J8j0
5431H0RN2Rn8p4J8j5N3j5J46k7q0Q3q2K02j1j43q1J8J9N0k1r1Q2K3O3q3n6N5o1j5J5N6qk0
5021I2J7o3j1J13K42k59O8oq4n2N1Q1j71J70l8N1j78K22j53j7j2L3L9m6O4q8j9L3Q5j1l1K7
4645A49r5O2n4J3m0R2kl4P6J48mk06J6L6K2q7J17k7j29K6L3J2RR1q0r0l2P3O0j18J02K0j01
4258E8N3P0R9j20O6q6p7K5K6o0N5J8p0l2J89n5j0j2q8N8O0j8K6q1oQ7L2o2P0k3l0j06Q1p2
3859F5J21r8J52j2nj07L9Qq9OL8M5j04J51j53J90J8k7k24J22r9K6Q4J51j15j36J00M1rK8k1
3495A86j02NM3n6k8J24k8o4J25M7J0j91J49j1j30LR2n5R4n9Q5l4l8J05QL83m09r2R5j75K5
3131A07J06J08p6j32L1j8m9J23lj11J26j71J36j42J29p9j1M2m9J7m4K6J35j0j01k4J06j25
$$ plain form
2802 47 186 295 286 295 139 177 117 110 107 262 124 12 74 135 112 185 99 27 152 173 180 326 188 119 128 174 203 118 40 37 102 276 247 189
2403 189 193 104 126 330 182 89 69 31 14 157 216 57 123 100 60 100 137 172 223 47 171 38 200 121 168 104 209 199 158 39
2051 39 153 156 63 164 241 188 130 137 96 71 98 194 225 121 191 185 245 107 138 88 115 140 96 124 201 149 82 109 48 29 48 259 425 138
1652 138 306 415 187 71 192 77 152 74 67 47 39 142 165 146 93 147 122 295 228 156 98 114 203 133 54 123 101 81 202 239 124
1288 124 108 132 134 140 91 66 127 24 129 225 114 97 204 213 58 152 161 108 99 223 124 78 66 180 284 131 134 107 53 20 3 108 87
901 87 142 88 76 101 107 78 117 155 151 103 128 131 163 47 83 43 80 102 238 99 125 204 200 79 35 53 260 109 145 196 82 119 131 64
502 64 185 329 113 100 194 197 145 179 120 126 42 120 257 156 17 2 130 213 144 164 159 98 245 170 84 167 215 103 223 233 138 162
126 162 148 109 81 140 105 25 102 233 92 183 43 56 169 255 124 278 267 109 262 177 213 212 36 109 124 91 97
$$ packed form
2802D7J39J09rRj56L8o0plJ55j38j12O2O1k3P3q6p2J25K1PJ46j38o9RM6K9q5p8lO5J74k9n8
2403A89Mq9K2K04j48r3k0l8j7J43N9j59O6k3m0M0L7L5N1j76J24j33J62p9M7o4J05j0m1j19
2051C9J14Lr3J01P7n3n8Pm1k5K7R6L1j04P0oO0j38L1n0K7K5m4K8P7n2o7K7o1j9J9K11J66k87
1652A38J68J09k28j16J21j15P5p8pk0qJ03K3j9n3N4k5J73o7p2n8J6Q9p0p9O9k2k0J21L7j15
1288A24j6K4KOm9k5O1j03J05R6j11j7J07Rj55R4Rn3rJ24r9m6j2J14J04j53Lk7n4l3j7J05k1
901H7N5n4j2K5Ok9L9L8mm8K5LL2j16L6m0L7K2J36j39K6P9mj21m4J8K07j51L6N1j14L7J2o7
502F4J21J44k16j3R4Ln2L4n9Oq4P8J37j01j39j5J28Q3o9K0no1J47p5q6Q3M8j12J20J0r5K4
126A62j4l9k8N9l5q0P7J31j41R1j40J3J13Q6j31J54j1j58J53q5L6jj76P3J5l3O
-191I7
##PAGE=	F1=1649.09
##FIRST=	25168.397401625570637,	5807.04592319999756,	0.16891866922378540039
##DATA TABLE=	(F2++(Y..Y)), PROFILE
$$ plain form
5807 55 118 147 211 96 120 35 128 217 149 52 161 65 70 54 69 157 82 150 82 67 145 328 148 167 128 105 49 75 149 80 116 118 103 121
5408 121 112 190 127 34 59 59 102 178 171 84 177 124 294 278 108 34 40 73 116 109 81 109 167 243 163 70 129 81 70 66 130 153 97 95 70 47 140
4974 140 352 147 168 189 134 116 72 132 79 217 165 173 17 246 120 59 63 57 110 60 178 119 26 72 143 144 158 169 52 91 114 73 98
4586 98 71 70 93 178 342 328 95 131 158 175 127 216 160 106 134 83 159 150 259 143 34 42 104 157 54 98 108 54 149 228 277 111 220
4199 220 106 101 60 121 53 52 122 66 68 265 159 139 148 34 110 151 134 180 82 79 135 168 90 114 184 196 76 150 42 199 75 230 251
3812 251 191 129 159 196 82 158 137 156 87 197 15 259 272 207 20 93 70 27 182 328 214 39 123 174 208 193 142 91 158 111
3460 111 88 34 197 140 64 210 213 210 95 230 208 92 73 147 72 237 146 217 170 173 226 132 223 108 140 221 53 32 226 366 256
3096 256 107 106 95 82 199 218 5 141 136 111 32 130 81 94 108 40 128 184 240 226 185 102 45 177 66 131 210 247 217 80 162 91
$$ packed form
5807E5O3K9O4j15K4q5R3Q9o8r7J09r6Nj6J5Q8p5O8o8j5P8J83j80J9l9k3n6K6P4o9L6Kj5J8
5408A21rP8o3r3K5%M3P6pq7R3n3J70j6j70p4OL3M3pk8K8N8P6q0r3N9m8j1mO4K3n6kk5k3R3
4974A40K12k05K1K1n5j8m4O0n3J38n2Qj56K29j26o1MoN3n0J18n9r3M6P1JJ4J1j17L9K3m1K5
4586I8k7jK3Q5J64j4k33L6K7J7m8Q9n6n4K8n1P6rJ09j16j09QO2N3j03M4J0n4R5P9M9j66J09
4199B20j14nm1O1o8jP0n6KJ97j06k0Rj14P6M1j7M6r8lN6L3p8K4P0J2j20P4j08J57j24J55K1
3812B51o0o2L0L7j14P6k1J9o9J10j82K44J3o5j87P3k3m3J55J46j14j75Q4N1L4j5n1n1O7m7
3460A11k3n4J63n7p6J46Llj15J35k2j16j9P4p5J65r1P1m7LN3r4R1j15L2Q1j68k1J94J40j10
3096B56j49jj1j3J17J9k13J36nk5p9R8m9J3J4o8Q8N6N6j4m1q3n7J32j11O5P9L7l0j37Q2p1
$$ plain form
2720 91 96 146 262 111 44 93 146 126 143 55 81 119 151 155 334 161 176 83 179 171 92 13 66 94 272 266 180 211 102 109 317 200 92
2333 92 66 17 36 188 240 108 82 79 76 61 135 185 244 82 138 50 227 126 198 143 210 222 108 92 171 171 87 167 230 139 117 95 65 72
1934 72 108 187 177 91 241 165 245 147 114 74 97 150 112 172 187 184 113 124 134 24 70 247 409 137 349 485 235 41 147 92 154
1570 154 52 27 23 40 93 131 135 58 107 115 275 217 213 146 108 200 177 65 133 79 94 185 228 76 116 170 174 85 55 114 150 34 115 261
1171 261 150 39 147 213 87 186 202 90 111 236 148 32 51 184 266 79 129 121 90 60 31 154 129 164 107 25 93 140 69 151
819 151 152 153 38 102 108 167 85 38 62 66 77 197 139 109 259 194 99 49 55 250 133 131 214 76 119 143 26 143 311 128 78 180 220
431 220 154 188 119 130 82 123 213 133 46 55 112 212 127 111 141 77 256 159 90 159 205 101 209 240 135 150 160 107 85 130 84 9 91
44 91 212 52 157 79 50 138 270 142 316 288 157 214 122 169 213 42 135 118 52 82
$$ packed form
2720I1NN0J16j51o7M9N3k0J7q8K6L8L2MJ79j73J5r3R6qp9p9N3K8J78oq6L1j09PK08j17j08
2333I2k6m9J9J52N2j32k6llj5P4N0N9j62N6q8J77j01P2n5O7J2j14j6P9%q4Q0O3r1k2k2l0P
1934G2L6P9j0q6J50p6Q0r8l3m0K3N3l8O0J5lp1J1J0j10M6J77J62k72K12J36k50j94J06n5O2
1570A54j02k5mJ7N3L8Mp7M9QJ60n8mo7l8R2k3j12O8n4J5R1M3j52M0N4Mq9l0N9L6j16Q1J46
1171B61j11j11J08O6j26R9J6j12K1J25q8j16J9J33Q2j87N0ql1l0k9J23k5L5n7q2O8M7p1Q2
819A51JJj15O4ON9q2m7K4MJ1J20n8l0J50o5r5n0OJ95j17kQ3j38M3K4j17J17J68j83n0J02M0
431B20o6L4o9J1m8M1R0q0q7RN7J00q5j6L0o4J79r7o9O9M6j04J08L1j05J5J0n3k2M5m6p5Q2
44I1J21j60J05p8k9Q8J32j28J74k8j31N7r2M7M4j71R3j7o6L0
-191H2
##PAGE=	F1=1546.83
##FIRST=	25168.397401625570637,	5807.04592319999756,	0.37627387046813964844
##DATA TABLE=	(F2++(Y..Y)), PROFILE
$$ plain form
5807 42 119 128 181 82 86 49 139 230 153 48 167 65 37 75 97 154 92 115 92 100 195 327 178 128 76 120 96 113 177 77 145 149 142 103 95
5396 95 252 191 52 76 75 172 135 156 58 154 121 265 242 68 41 32 50 86 83 112 84 166 273 190 60 131 104 112 90 138 161 90 83 89 102
4985 102 121 287 174 119 153 177 159 26 113 149 248 191 130 43 245 141 53 58 35 78 49 191 173 51 74 128 141 199 193 37 75 179
4610 179 63 182 123 14 77 191 346 307 90 126 140 139 140 196 117 174 158 98 181 143 281 141 48 64 124 163 67 81 75 63 162 255
4234 255 260 48 206 88 132 57 145 52 15 113 89 110 310 158 132 153 20 117 119 107 152 55 67 94 134 71 58 169 197 109 185 36
3859 36 197 30 174 246 149 133 159 216 80 217 166 149 109 163 72 284 275 165 29 60 100 11 217 352 240 62 93 156 217 189
3506 189 95 113 234 130 101 38 210 131 60 198 160 151 94 245 191 98 83 119 33 242 132 208 139 187 180 105 326 239 115 173 56
3143 56 57 227 407 288 112 73 76 99 190 230 41 380 270 60 36 135 130 116 122 25 171 353 474 293 162 122 11 162 81 58
$$ packed form
5807D2P7RN3r9Ml7R0R1p7j05J19j02k8L8K2N7o2K3k3QR5J32j49n0n2M4k4J7O4j00O8Mpl9q
5396I5J57o1j39K4jR7l7K1r8R6l3J44k3j74k7rJ8L6lK9k8Q2J07q3j30P1k7Qk2M8K3p1pOJ3
4985A02J9J66j13n5L4K4j8j33Q7L6R9n7o1q7K02j04q8Nk3M3k9J42j8j22K3N4J3N8oj56L8J04
4610A79j16J19n9j09O3J14J55l9k17L6J4jJN6p9N7j6o0Q3l8J38j40r3J6O0L9r6J4oj2R9R3
4234B55Nk12J58j18M4p5Q8r3l7R8k4K1K00j52k6K1j33R7Kj2M5r7J2K7M0o3j3J11K8q8P6j49
3859C6J61j67J44P2r7j6K6N7j36J37n1j7m0N4r1K12rj10j36L1M0q9K06J35j12j78L1O3O1k8
3506A89r4J8J21j04k9o3J72p9p1J38l8rn7J51n4r3j5L6q6K09j10P6o9M8pp5K21q7j24N8j17
3143E6JJ70J80j19j76l9LK3R1M0j89L39j10k10k4R9nj4Or7J46J82J21j81j31m0j11J51q1k3
$$ plain form
2791 58 107 194 137 86 133 57 94 178 225 88 89 123 161 156 95 58 133 90 117 117 328 145 217 57 189 144 67 31 82 84 242 270 165 233
2391 233 105 73 267 201 91 68 35 61 206 250 154 62 59 85 31 117 182 251 113 108 122 246 121 202 153 211 243 78 153 196 166 110
2016 110 160 213 105 133 50 11 66 128 179 108 73 265 156 240 178 97 89 64 147 117 196 177 208 133 183 228 57 82 224 365 155 372
1640 372 525 263 79 101 108 135 41 21 57 37 65 90 115 23 55 115 231 214 270 188 111 187 202 94 146 77 108 164 179 41 139 218
1265 218 203 36 103 166 175 45 94 281 195 46 86 217 145 220 228 71 105 232 163 28 62 173 221 17 130 128 123 114 52 185 155
901 155 181 136 46 72 176 74 183 160 198 35 83 109 158 103 33 128 43 46 159 169 71 283 168 129 91 85 222 147 113 211 64 97
525 97 153 18 82 276 157 47 158 219 164 205 107 126 107 127 166 112 85 110 84 186 96 86 170 42 263 153 131 177 192 99 181
161 181 241 134 129 158 109 87 135 78 6 87 176 20 120 117 61 98 245 147 338 296 187 170 106 124 191 43 152 110 36 68
$$ packed form
2791E8M9Q7n7n1M7p6L7Q4M7j37JL4L8no1l7P5m3K7%K11j83P2j60J32m5p7l6N1KJ58K8j05O8
2391B33j28l2J94o6j10k3l3K6J45M4r6r2lK6n4Q6O5O9j38nJ4J24j25Q1m9N8L2j65P5M3l0n6
2016A10N0N3j08K8q3l9N5O2N1p1l5J92j09Q4o2q1qk5Q3l0P9j9L1p5N0M5j71K5J42J41k10K17
1640C72J53k62j84K2PK7r4k0L6k0K8K5K5r2L2O0J16j7N6q2p7P6J5j08N2o9L1N6J5j38R8P9
1265B18j5j67O7O3Rj30M9J87q6j49M0J31p2P5Qj57L4J27o9j35L4J11M8k04J13knro2J33l0
901A55K6m5r0K6J04j02J09k3L8j63M8K6M9n5p0R5q5LJ13J0r8K12j15l9l8oJ37p5l4R8j47L3
525I7N6j35O4J94j19j10J11O1n5M1r8J9j9K0L9n4k7K5k6J02r0j0Q4j28K21j10k2M6J5r3Q2
161A81O0j07nK9m9k2M8n7p2Q1Q9j56J00ln6L7J47r8J91m2j09j7o4J8O7j48J09m2p4L2
-191F8
##PAGE=	F1=1444.58
##FIRST=	25168.397401625570637,	5807.04592319999756,	0.48249083757400512695
##DATA TABLE=	(F2++(Y..Y)), PROFILE
$$ plain form
5807 33 104 94 137 61 49 84 149 222 130 53 175 66 36 113 115 142 101 92 104 119 238 311 184 92 39 159 136 123 180 78 169 168 197 120
5408 120 115 265 198 66 72 90 224 91 136 46 119 94 227 192 38 78 78 41 82 54 123 58 146 293 206 52 129 130 153 124 147 154 65
5021 65 78 101 150 92 204 204 109 95 211 170 26 149 200 278 224 86 54 237 144 77 46 67 46 50 191 216 64 78 124 140 235 216
4645 216 12 75 219 36 238 210 60 55 207 326 257 90 110 113 86 129 166 57 230 154 147 188 127 291 129 62 85 152 174 73
4293 73 99 90 67 155 261 225 20 191 85 150 81 174 27 35 99 111 140 343 156 128 146 16 124 84 75 102 40 52 58 105 139 131 156
3906 156 170 150 219 82 176 55 96 211 109 123 158 223 69 249 191 147 122 115 131 315 275 122 30 33 124 48 250 364 261 91
3553 91 63 139 204 194 59 142 297 153 117 63 209 127 75 174 99 89 77 269 169 110 101 88 26 221 117 211 117 203 155 324 686
3190 686 401 95 121 73 112 222 435 317 120 49 71 128 178 224 39 442 323 64 49 175 178 113 144 32 156 346 477 259
$$ packed form
5807C3P1j0M3p6j2L5O5P3r2p7J22j09l0P7KK7m1rJ2J5J19P3j27r2n3J20k3j3N7j02R1jK9p7
5408A20nJ50o7j32OJ8J34j33M5r0P3k5J33l5j54M0%l7M1k8O9o5Q8J47q7j54P7JK3k9K3Pq9
5021F5J3K3M9n8J12%r5j4J16m1j44J23N1P8n4j38l2J83r3o7l1K1k1MJ41K5j52J4M6J6R5j9
4645B16k04O3J44j83K02k8j50nJ52J19o9j67K0Lk7M3L7j09J73p6pM1o1J64j62o7K3O7K2j01
4293G3K6rk3Q8J06l6k05J71j06O5o9R3j47QO4J2K9K03j87k8J8j30J08m0rK7o2J2OM7L4qK5
3906A56J4k0O9j37R4j21M1J15j02J4L5O5j54J80n8m4k5pJ6J84m0j53r2LR1p6K02J14j03j70
3553I1k8P6O5j0j35Q3J55j44l6n4J46q2n2R9p5j0j2J92j00n9rj3o2J95j04R4r4Q6m8J69L62
3190F86k85l06K6m8L9J10K13j18j97p1K2N7N0M6j85M03j19k59j5J26Lo5L1j12J24J90J31k18
$$ plain form
2861 259 126 157 52 136 77 19 31 143 84 137 92 40 109 200 161 96 118 136 174 189 91 151 174 65 84 79 316 144 222 50 206
2497 206 143 101 57 92 86 192 258 142 250 112 55 190 183 78 70 45 77 209 249 180 67 46 86 67 93 159 247 137 97 202 251
2133 251 104 183 132 212 257 88 197 214 142 127 142 197 124 164 62 56 60 154 184 32 73 258 138 221 198 81 119 48 112 87 190
1769 190 171 212 131 245 297 85 72 212 308 189 373 528 265 130 60 124 101 41 55 108 32 74 56 100 15 17 118 174 230 321 212
1405 212 122 159 205 137 153 86 120 136 107 72 163 272 221 14 159 211 201 47 70 277 237 106 54 218 178 240 236 51 86 218 175
1042 175 58 80 149 157 48 131 123 139 153 68 188 155 185 163 106 40 194 85 206 166 240 84 77 125 157 92 84 210 41 29 136 183
666 183 28 274 132 148 135 119 187 148 115 196 55 70 156 60 16 235 189 24 131 194 172 217 87 116 122 126 126 91 106 161 63 139 53
279 53 119 230 7 264 155 193 222 179 88 142 231 134 109 145 112 80 148 99 9 85 131 47 86 150 90 80 187 144 336 290 194 135 136
$$ packed form
2861B59j33L1j05Q4n9n8J2J12n9N3m5n2O9R1l9o5K2J8L8J5r8O0K3j09J9nK37j72P8j72J56
2497B06o3m2m4L5oJ06O6j16J08j38n7J35pj05qk5L2J32M0o9j13k1M0j9K6O6Q8j10m0J05M9
2133B51j47P9n1Q0M5j69J09J7p2j5J5N5p3M0j02oMR4L0j52M1J85j20Q3k3j17L8p1O4k5J03
1769A90j9M1q1J14N2k12j3J40R6j19J84J55k63j35p0O4k3o0J4N3p6M2j8M4q5KJ01N6N6R1j09
1405B12r0L7M6o8J6o7L4J6k9l5R1J09n1k07J45N2j0j54K3K07m0j31n2J64m0O2mj85L5J32m3
1042A75j17K2O9Qj09Q3qJ6J4q5J20l3L0k2n7o6J54j09J21m0P4j56pM8L2o5qJ26j69j2J07M7
666A83j55K46j42J6j3j6O8l9l3Q1j41J5Q6r6m4K19m6j65J07O3k2M5j30K9OM%l5J5N5r8P6q6
279E3O6J11k23K57j09L8K9m3r1N4Q9r7k5L6l3l2O8m9r0P6M6q4L9O4o0j0J07m3J92m6r6n9J
$$ plain form
-109 136 112 163 41 154 99 78 64
$$ packed form
-109A36k4N1j22J13n5k1j4
-191F4
##PAGE=	F1=1342.32
##FIRST=	25168.397401625570637,	5807.04592319999756,	0.38271233439445495605
##DATA TABLE=	(F2++(Y..Y)), PROFILE
$$ plain form
5807 33 76 54 90 38 63 122 160 195 95 61 185 74 99 141 115 123 109 81 122 119 255 282 170 77 78 200 152 106 159 86 182 176 257 172
5408 172 146 227 158 73 70 104 244 72 116 78 89 54 198 147 24 115 125 48 99 20 113 52 117 296 210 71 122 151 177 151 159 158 38
5021 38 77 107 183 60 121 230 178 71 226 147 82 200 231 305 259 113 63 220 126 108 44 97 44 56 176 236 56 86 127 129 260
4657 260 236 26 84 228 18 257 273 100 38 218 288 193 84 87 103 35 99 166 8 265 137 192 180 123 286 103 70 105 184
4316 184 188 74 135 132 59 136 247 174 81 181 80 167 116 196 28 50 84 126 160 355 151 122 123 23 131 67 51 43 54 32 45 82
3941 82 219 211 156 125 184 234 140 136 132 110 162 90 100 158 218 49 253 205 144 124 65 172 328 271 96 31 10 141 94 271 360 272 115
3553 115 44 126 174 197 40 172 332 155 131 89 196 133 101 145 41 34 72 303 150 123 114 54 45 177 110 225 101 209 148 380
3201 380 707 422 86 73 87 141 217 440 321 115 34 75 165 164 201 34 350 318 116 57 231 230 63 164 50 98 88 69 30
$$ packed form
5807C3M3k2L6n2K5N9L8L5j00l4J24j11K5M2k6Qj4k8M1lJ36K7j12r3JJ22m8m6N3p3R6oQ1q5
5408A72k6Q1o9q5lL4J40j72M4l8J1l5J44n1j23R1J0p7N1p9R3o1O5J79q6j39N1K9K6k6Qjj20
5021C8L9L0P6j23O1J09n2j07J55p9o5J18L1P4m6j46n0J57r4j8o4N3n3J2J20O0j80L0M1KJ31
4657B60k4k10N8J44k10K39J6j73o2J80P0r5j09LJ6o8O4O7j58K57j28N5j2n7J63j83l3L5P9
4316A84Mj14O1lp3P7J11p3r3J00j01Q7n1Q0j68K2L4M2L4J95k04k9Jj00J08o4j6qJ1k2J3L7
3941H2J37qn5l1N9N0r4mmk2N2p2J0N8O0j69K04m8o1k0n9J07J56n7j75o5k1J31m7J77Q9q8j57
3553A15p1Q2M8K3j57J32J60j77k4m2J07o3l2M4j04pL8K31j53k7ro0rJ32o7J15j24J08o1K32
3201C80L27k85l36j3J4N4P6K23j19k06q1M1R0jL7j67L16l2k02n9J74jj67J01j14M8j0j9l9
$$ plain form
2861 30 88 205 111 100 39 51 23 104 110 183 76 72 130 213 105 149 127 126 177 217 133 241 199 44 70 59 305 154 189 42 228 173
2485 173 166 85 102 107 135 232 108 256 117 80 105 152 55 68 71 82 206 242 185 71 56 77 116 85 117 235 153 101 266 239 76 157
2110 157 90 214 259 103 218 218 108 133 111 182 163 182 119 124 63 182 205 56 80 225 103 186 208 71 143 81 58 34 154 159 195
1746 195 102 291 328 99 44 220 255 226 353 492 241 175 39 140 60 40 90 165 41 92 42 106 40 64 117 123 260 364 220
1405 220 134 122 188 186 155 91 125 101 35 114 178 322 229 34 198 240 219 42 50 251 269 168 79 207 176 238 228 27 62 200 182
1042 182 86 88 118 89 110 128 105 139 172 85 170 128 170 176 151 6 191 94 213 164 262 119 77 136 186 69 126 279 73 52 122 178
666 178 65 237 99 150 170 145 154 135 141 186 66 69 145 93 45 199 215 45 101 153 173 212 61 113 126 122 100 70 105 199 74 81 8 158
267 158 282 35 259 161 256 271 169 69 96 202 128 105 123 109 66 163 135 16 78 86 73 65 173 137 121 118 136 309 272 176 108 169
$$ packed form
2861C0N8J17r4j1o1J2k8Q1OP3j07mN8Q3j08M4k2jN1M0q4J08m2j55K6j1K46j51L5j47J86n5
2485A73pq1J7NK8R7j24J48j39l7K5M7r7J3LJ1J24L6n7j14j5K1L9l1L2J18q2n2J65k7j63Q1
2110A57o7J24M5j56J15%j10K5k2P1j9J9o3No1J19K3j49K4J45j22Q3K2j37P2o2k3k4J20NL6
1746A95r3J89L7k29n5J76L5k9J27J39k51o6j36J01q0k0N0P5j24N1n0O4o6K4N3OJ37J04j44
1405B20q6j2O6kl1o4L4k4o6P9O4J44r3j95J64M2k1j77QK01J8j01q9J28l1O2j0k01L5J38j8
1042A82r6KL0k9K1J8k3L4L3q7Q5m2M2Ok5j45J85r7J19m9R8j43m2N9N0j17N7J53k06k1P0N6
666A78j13J72j38N1K0k5Rj9OM5j20LP6n2m8J54J6j70N6N2K0L9j51N2J3mk2l0L5R4j25Pp3J50
267A58J24k47K24r8R5J5j02j00K7J06p4k3J8j4m3R7k8j19O2Qj3qJ08l6j6lJ8J73l7r6o8O1
$$ plain form
-109 169 146 155 57 140 80 120 70
$$ packed form
-109A69k3Rr8Q3o0M0n0
-191G0
##PAGE=	F1=1240.06
##FIRST=	25168.397401625570637,	5807.04592319999756,	0.27033141255378723145
##DATA TABLE=	(F2++(Y..Y)), PROFILE
$$ plain form
5807 43 43 20 48 26 110 146 162 153 65 61 189 84 165 151 99 98 118 67 147 101 243 247 141 92 131 226 137 71 123 90 184 175 308 227 161 149
5384 149 99 78 81 121 236 92 99 121 80 18 189 126 27 143 165 71 122 15 85 70 86 276 202 103 109 162 177 161 171 177 50 71 107
4997 107 197 41 63 243 264 123 220 99 139 235 243 327 292 204 93 195 91 140 76 105 79 71 148 225 31 102 130 104 269 254 63
4633 63 91 216 72 238 291 110 32 218 239 127 75 74 126 30 63 208 72 275 133 218 155 136 260 67 72 126 217 202 78 170
4281 170 175 49 110 217 115 122 175 67 188 161 206 87 50 77 131 168 342 141 111 88 38 133 86 43 10 66 9 67 64 284 269 166
3906 166 84 201 222 187 84 193 200 135 95 73 160 206 25 231 203 131 112 27 187 308 261 97 38 26 142 145 273 337 271 135
3553 135 46 118 134 190 40 196 331 131 137 104 171 147 128 115 40 18 94 340 139 126 117 20 55 119 109 243 82 197 140 191 306
3190 306 264 108 44 103 145 213 421 292 92 29 82 203 152 166 75 196 300 185 111 384 371 45 181 78 384 903 851 429
$$ packed form
5807D3%k3K8k2Q4L6J6rq8mJ28j05Q1j4n2jK0n1Q0m6J42Mj06m9L9R5q9o6N2l3R4rJ33q1o6j2
5384A49n0k1LM0J15j44PK2m1o2J71o3r9J16K2r4N1j07P0j5J6J90p4r9ON3J5j6J0Oj27K1L6
4997A07R0j56K2J80K1j41R7j21M0R6QQ4l5q8j11J02j04M9o4K9k6qP7P7j94P1K8k6J65j5j91
4633F3K8J25j44J66N3j81p8J86K1j12n2jN2r6L3J45j36K03j42Q5o3j9J24j93NN4R1j5j24R2
4281A70Nj26O1J07j02PN3j08J21k7M5j19l7K7N4L7J74k01l0k3n0R5m7m3l3N6n7N8lK20j5j03
3906A66q2J17K1l5j03J09Po5m0k2Q7M6j81K06k8p2j9q5J60J21m7j64n9j2J16LJ28O4o6j36
3553A35q9P2J6N6j50J56J35k00Ol3O7k4j9j3p5k2P6K46k01j3rr7L5O4j0J34j61J15n7N1J15
3190C06m2j56o4N9M2O8K08j29k00o3N3J21n1J4r1J21J04j15p4K73j3l26J36j03L06N19n2m22
$$ plain form
2861 429 74 262 164 53 81 205 118 82 177 211 136 115 148 213 119 207 119 94 166 232 170 299 213 46 86 56 300 170 132 48 251
2497 251 211 220 110 112 132 88 193 63 244 116 100 34 120 39 59 116 81 209 231 172 70 92 62 148 105 73 218 164 105 297 209
2133 209 43 145 53 215 248 101 213 211 85 130 74 160 180 175 175 180 72 209 226 120 80 181 55 140 207 85 149 121 79 82 98
1769 98 130 162 52 313 319 94 51 238 221 257 317 425 193 211 67 161 27 32 121 227 70 103 52 133 62 110 112 97 288 394 213
1405 213 138 86 159 234 158 89 120 61 40 133 182 361 230 47 211 251 224 33 37 209 286 227 103 175 144 215 210 6 43 179 182 111
1030 111 88 88 28 161 122 82 127 171 102 150 83 140 171 171 28 171 87 201 151 264 139 75 136 231 66 150 315 103 70 102 164
666 164 127 178 81 136 189 157 128 110 170 187 96 96 118 112 89 177 228 79 75 108 166 187 38 127 119 120 89 47 81 215 101 22 41 167 299
255 299 56 250 159 301 304 159 55 49 150 115 114 104 91 47 172 171 25 67 54 80 55 183 196 195 102 124 266 246 136 82 183 188
$$ packed form
2861D29l55J88r8j11K8J24q7l6R5L4p5k1L3O5r4Q8q8k5P2O6o2J29q6j67M0l0K44j30l8q4K03
2497B51m0Rj10KK0m4J05j30J81j28j6o6Q6q1K0N7l5J28K2n9j02K2l0Q6m3l2J45n4n9J92q8
2133B09j66J02r2J62L3j47J12kj26M5n6Q6K0n%Nj08J37J7j06m0J01j26Q5O7j22O4k8m2LJ6
1769I8L2L2j10K61Ok25m3J87j7L6O0J08k32J8j44R4j34NQ9J06j57L3n1Q1p1M8Kj5J91J06j81
1405B13p5n2P3P5p6o9L1n9k1R3M9J79j31j83J64M0k7j91MJ72P7n9j24P2l1P1nk04L7J36Lp1
1030A11k3%o0J33l9m0M5M4o9M8o7N7L1%j43J43q4J14n0J13j25o4O1R5j65Q4J65k12l3L2O2
666A64l7N1r7N5N3l2k9j8O0J7r1%K2ok3Q8N1j49mL3N8K1j49Q9qJl1m2L4J34j14p9J9J26J32
255B99k43J94r1J42Lj45j04oJ01l5jj0j3m4J25jj46M2j3K6k5J28J3jr3K2J42k0j10n4J01N
$$ plain form
-120 188 174 85 114 51 147 82
$$ packed form
-120A88j4q9K9o3R6o5
-191H2
##PAGE=	F1=1137.8
##FIRST=	25168.397401625570637,	5807.04592319999756,	0.32423183321952819824
##DATA TABLE=	(F2++(Y..Y)), PROFILE
$$ plain form
5807 59 16 14 30 59 149 145 141 100 57 47 184 94 218 147 85 68 132 60 181 74 211 212 108 117 167 225 98 49 88 84 175 171 337 260 150
5396 150 49 87 86 90 137 217 126 81 156 86 30 190 132 32 161 191 106 143 48 48 84 59 234 181 126 89 160 148 155 182 191 78 55 99
4997 99 190 61 68 242 325 178 198 55 188 246 246 339 317 302 140 165 53 175 124 88 117 98 106 186 5 117 124 74 263 268 97 95
4622 95 200 131 189 258 89 33 207 186 78 90 87 164 56 37 258 127 264 151 221 113 151 214 31 72 147 244 210 86 194
4281 194 208 52 83 174 62 137 174 46 204 214 203 141 44 82 121 164 302 128 106 63 63 128 131 46 45 67 34 97 55 322 303 175
3906 175 61 195 181 214 37 221 263 150 111 58 161 188 11 190 186 108 86 15 179 250 245 117 48 56 122 194 258 298 259 153 59
3542 59 115 89 169 58 213 293 90 130 107 135 157 150 84 87 40 122 371 138 112 110 22 56 60 102 258 57 170 148 394 474 93 163
3166 163 46 126 134 208 383 237 58 46 84 227 142 125 103 88 295 262 245 675 637 190 192 137 890 2218 2223 1075 97 321 202
$$ packed form
5807E9m3kJ6K9R0mmm1m3j0J37r0J24p1o2j7O4p2J21j07J37Jj04RN0N8j27m9L9mR1mJ66p7j10
5396A50j01L8jMM7Q0r1m5P5p0n6J60n8j00J29L0q5L7r5%L6k5J75n3n5l7P1j2PK7Rj13k3M4
4997I9R1j29PJ74Q3j47K0j43J33N8%R3k2j5j62K5j12J22n1l6K9j9QQ0j81J12Pn0J89Nj71k
4622I5J05o9N8O9j69n6J74k1j08J2lP7j08j9K21j31J37j13P0j08L8O3j83M1P5R7l4j24J08
4281A94J4j56L1R1j12P5L7j28J58J0j1o2r7L8L9M3J38j74k2m3%O5Lq5jK2l3O3m2K67j9j28
3906A75j14J34j4L3j77J84M2j13l9n3J03K7j77J79mp8k2p1J64P1nj28o9QO6P2O4M0l9j06r4
3542E9N6k6Q0j11J55Q0k03M0k3K8K2po6Lm7Q2K49k33k6kq8L4MM2J56k01J13k2K46Q0l81P0
3166A63j17Q0QP4J75j46j79j2L8J43q5j7k2j5K07l3j7M30l8m47Kn5P53J328Nj148r78K24j19
$$ plain form
2826 202 14 249 473 299 74 243 222 221 146 160 200 170 244 98 70 143 229 181 311 222 71 116 55 299 187 97 90 269 238 247
2474 247 126 122 149 74 144 14 213 106 93 23 94 51 45 163 81 226 218 146 80 145 43 157 132 65 200 167 110 291 165 31
2121 31 154 68 212 227 88 189 199 88 123 45 123 166 149 217 212 80 237 233 162 65 149 21 98 197 117 132 147 150 164 35 89 133
1746 133 66 311 278 70 109 251 211 270 275 340 135 238 115 190 42 23 146 290 108 112 70 163 75 138 104 93 297 409 199
1405 199 132 71 129 275 163 81 106 23 68 122 173 379 225 46 201 243 214 26 32 162 285 272 103 128 100 177 184 30 38 155
1053 155 173 132 89 62 26 194 112 61 107 154 114 141 49 100 153 168 51 142 58 171 131 256 154 66 130 268 85 161 309 118
701 118 65 64 158 178 111 81 107 188 159 110 76 183 193 130 121 82 116 117 171 225 106 53 79 149 140 47 151 103 122 90 26 37 209 120 25
290 25 74 137 275 56 240 139 314 309 142 60 28 78 94 126 93 61 25 176 196 29 54 41 70 42 180 254 275 164 111 221 220
$$ packed form
2826B02j88K35K24j74k25J69k1jp5J4M0l0P4j46k8P3Q6m8J30q9j51M5o1K44j12r0pJ79l1R
2474B47j21mK7p5P0j30J99j07j3p0P1m3oJ18q2J45qp2o6O5j02J14k5o7J35l3n7J81j26j34
2121C1J23q6J44J5j39J01J0j11L5p8P8M3j7O8nj32J57mp1r7Q4j28P7R9q0J5J5LJ4j29N4M4
1746A33o7K45l3k08L9J42m0N9NO5k05J03j23P5j48j9J23J44j82Mm2R3q8O3l4j1K04J12k10
1405A99o7o1N8J46j12q2K5q3M5N4N1K06j54j79J55M2k9j88OJ30J23j3j69K5k8P7Pj54QJ17
1053A55J8m1m3k7l6J68q2n1M6M7m0K7r2N1N3J5j17R1q4J13m0J25j02q8O4J38j83P6J48j91
701A18n3jR4K0o7l0K6Q1k9m9l4J07J0o3rl9L4JN4N4j19n3K6P0rr3J04m8J9l2o4J1J72q9r5
290B5M9O3J38k19J84j01J75nj67q2l2N0J6L2l3l2l6J51K0j67K5j3K9k8J38P4K1j11n3J10j
$$ plain form
-73 220 78 50 171 212 196 111 81 15 154 89
$$ packed form
-73B20j42k8J21M1j6q5l0o6J39o5
-191H9
##PAGE=	F1=1035.54
##FIRST=	25168.397401625570637,	5807.04592319999756,	0.37497445940971374512
##DATA TABLE=	(F2++(Y..Y)), PROFILE
$$ plain form
5807 74 20 25 59 111 169 115 89 44 64 22 167 102 252 138 93 37 153 93 215 59 176 183 84 139 179 193 43 74 68 72 163 173 336
5420 336 262 118 53 129 98 83 138 206 157 59 173 84 50 185 140 34 165 196 143 160 73 27 84 39 178 149 136 65 142 96 150 195
5044 195 183 96 31 82 172 97 97 225 347 203 169 76 224 229 245 339 330 377 184 135 54 213 168 50 149 134 55 128 40 122 103 67 250
4657 250 279 124 96 191 181 125 181 57 46 185 137 64 134 114 194 80 28 285 167 236 176 204 60 159 151 5 70 164 258 207 99
4293 99 200 220 67 54 125 36 125 173 33 199 265 197 177 42 90 97 149 237 119 121 78 89 120 190 46 61 73 73 117 56 334 317 171
3906 171 48 162 117 218 34 212 271 170 120 58 157 166 25 142 155 85 51 36 155 165 225 138 55 82 79 229 231 251 241 170 67
3542 67 116 47 135 85 221 226 43 108 96 87 152 157 51 127 43 134 387 143 84 99 43 62 44 86 261 27 140 203 968 1252 369
3178 369 220 67 152 124 198 334 174 39 79 80 225 131 87 96 80 300 336 430 1041 956 344 194 225 1498 3801 3843 1801 128
$$ packed form
5807G4n4NL4N2N8n4k6m5K0m2J45o5J50j14m5n6J16o0J22j56J17Pr9N5M0J4j50L1oMR1J0J63
5420C36p4j44o5P6l1j5N5O8m9r8J14q9l4J35m5j06J31L1n3J7q7m6N7m5J39k9j3p1P7m6N4M5
5044A95j2q7o5N1R0p5%J28J22j44l4r3J48NJ6R4rM7j93m9q1J59m5j18R9j5p9P3q8Q2j9l6J83
4657B50K9j55k8R5j0n6N6j24j1J39m8p3P0k0Q0j14n2K57j18O9o0K8j44R9qj46O5R4R4n1j08
4293I9J01K0j53j3P1q9Q9M8j40J66O6o8k0j35M8PN2Q8j18Km3J1L1P0j44J5J2%M4o1K78j7j46
3906A71j23J14m5J01j84J78N9j01n0o2R9Rj41J17J3p0l4j5J19J0O0q7q3K7lJ50KK0j0p1j03
3542F7M9o9Q8n0J36Nj83O5j2rO5Nj06P6q4R1K53k44n9J5n6J9j8M2J75k34J13O3P65K84q83
3178C69j49j53Q5k8P4J36j60j35M0JJ45r4m4Rj6K20L6R4O11q5o12j50L1J273K303M2k042j673
$$ plain form
2849 128 371 219 105 470 796 513 76 293 222 297 156 165 172 200 249 70 94 119 208 164 280 223 86 145 57 300 196 133 141
2509 141 278 245 240 131 131 153 91 93 57 169 86 66 37 75 79 35 200 87 254 205 114 114 199 24 140 150 97 189 160 118 253 113
2133 113 63 163 104 201 199 78 157 190 96 118 49 73 128 124 238 212 84 259 224 175 33 148 55 81 182 151 95 153 198 218 34
1769 34 61 135 149 284 226 33 169 250 212 263 231 251 82 259 162 224 75 36 168 345 145 119 92 180 78 144 97 85 282 407
1417 407 183 114 80 107 299 163 78 87 22 63 83 152 372 216 34 176 226 195 20 29 120 272 296 92 96 67 137 154 56 46 130
1053 130 153 150 101 44 55 208 98 53 85 129 118 141 60 65 128 149 67 112 39 126 109 249 172 54 130 275 101 170 268 116 38 19
678 19 172 210 74 92 68 167 153 99 43 175 190 161 134 53 110 133 175 212 121 34 82 124 77 89 172 82 119 97 33 27 181 118 53 92
279 92 78 218 36 233 97 289 286 116 75 61 37 81 133 91 69 4 177 208 28 45 35 62 22 165 296 340 231 100 184 198
$$ packed form
2849A28K43j52j14L65L26k83m37K17p1P5j41RPK8M9j79K4K5Q9m4J16n7j37N9q8K43j04o3Q
2509A41J37l3nj09%K2o2Kl6J12q3k0k9L8Mm4J65j13J67m9r1%Q5j75J16J0n3R2k9m2J35j40
2133A13n0J00n9R7kj21P9L3r4K2o9K4N5mJ14k6j28J75l5m9j42J15r3K6J01l1n6N8M5K0j84
1769C4K7P4J4J35n8j93J36Q1l8N1l2K0j69J77r7O2j49l9J32J77k00k6k7Q8j02O6m7j2J97J25
1417D07k24o9l4K7J92j36q5Ro5M1K0O9K20j56j82J42N0l1j75RR1J52K4k04Mk9P0J7r8j0Q4
1053A30K3lm9n7J1J53j10m5L2M4j1K3q1NO3K1q2M5p3Q7j7J40p7j18P6J45j74O9R8j52p8j9
678A9J53L8j36J8k4R9j4n4n6J32J5k9k7q1N7K3M2L7r1q7M8M2m7J2Q3r0L7k2o4oJ54o3o5L9
279I2j4J40j82J97j36J92lj70m1j4k4M4N2m2k2o5J73L1j80J7j0K7m0J43J31M4j09j31Q4J4
$$ plain form
-73 198 8 48 139 212 202 128 55 23 141 88
$$ packed form
-73A98j90M0R1P3j0p4p3l2J18n3
-191H8
##PAGE=	F1=933.286
##FIRST=	25168.397401625570637,	5807.04592319999756,	0.45686790347099304199
##DATA TABLE=	(F2++(Y..Y)), PROFILE
$$ plain form
5807 85 34 29 97 167 173 65 16 53 75 26 142 111 264 130 115 12 176 149 242 74 154 166 77 152 171 135 16 105 63 71 157 188 304
5420 304 233 92 138 160 111 71 122 210 182 43 168 67 55 170 134 29 154 178 173 169 84 46 77 47 119 110 145 45 109 36 172 211
5044 211 152 103 16 55 152 131 112 193 324 195 133 127 240 186 246 327 325 412 205 112 89 245 206 13 171 170 15 79 74 119 69 95 238
4657 238 285 143 98 195 217 62 80 74 74 159 93 76 184 133 205 105 31 279 192 198 190 177 29 163 88 6 64 177 254 193 112 188 205
4269 205 81 33 71 44 95 173 38 166 299 195 188 47 90 59 128 159 125 153 112 110 118 250 45 67 107 111 121 60 326 317 155 33
3894 33 111 52 201 57 180 224 164 114 56 143 142 42 105 116 85 16 73 124 73 202 150 54 104 27 243 202 208 222 183 66 121 33 90
3506 90 112 223 142 28 77 77 34 127 144 18 156 28 126 384 150 53 92 57 78 86 64 245 3 118 270 1321 1604 499
3178 499 246 102 171 129 183 285 120 59 123 83 187 112 70 61 92 312 396 619 1372 1212 461 184 319 2084 5334 5388 2457
$$ packed form
5807H5n1nO8P0Oj08m9L7K2m9J16l1J53j34j5j03J64k7R3j68Q0J2q9P5J9l6j19Q9m2QQ6L1J16
5420C04p1j41M6K2m9m0N1Q8k8j39J25j01j2J15l6j05J25K4nmq5l8L1l0P2rL5j00O4p3J36L9
5044B11n9m9q7L9R7k1j9Q1J31j29o2oJ13n4O0Q1kQ7k07r3k3J56l9j93J58jj55O4nM5n0K6J43
4657B38M7j42m5R7K2j55J8o%Q5o6j7J08n1P2j00p4K48q7Oqj3j48J34p5q2N8J13P7o1q1P6J7
4269B05j24m8L8k7N1P8j35J28J33j04pj41M3l1O9L1l4K8m1kQJ32k05K2M0MJ0o1K66rj62j22
3894C3P8n9J49j44J23M4o0n0n8Q7jj00O3J1l1o9N7N1n1J29n2r6N0p7K16m1OJ4l9j17N5q8N7
3506I0K2J11q1j14M9%m3R3J7j26J38j28R8K58k34r7L9l5K1Qk2J81k42J15J52J051K83j105
3178D99k53j44O9m2N4J02j65o1O4m0J04p5m2rL1K20Q4K23P53j60p51k77J35J765L250N4k931
$$ plain form
2861 2457 148 398 214 217 698 1080 676 82 319 215 342 142 164 134 194 224 43 141 108 169 126 224 208 78 168 71 296
2544 296 194 183 181 275 233 206 126 140 146 116 52 118 117 59 71 31 59 106 38 218 103 286 194 82 154 244 20 103 151 122 188 144 128
2157 128 196 66 100 158 127 178 170 76 126 184 87 119 68 48 92 121 237 182 89 270 210 160 37 170 84 85 166 176 44 139 205 226 75
1769 75 83 170 226 235 184 7 211 233 211 231 188 175 67 275 199 248 99 71 187 380 172 123 114 177 69 127 94 67 244 385 171
1405 171 89 95 97 298 149 87 70 43 28 41 126 342 203 12 154 208 171 21 30 90 255 291 114 131 70 107 122 75 58 105 128 164
1030 164 121 40 73 202 76 64 64 105 113 138 74 43 104 127 85 86 96 72 88 248 197 45 139 246 102 179 210 102 30 58 195 225
654 225 108 109 25 129 143 91 47 149 169 180 135 57 103 146 184 196 120 12 111 91 6 136 182 65 106 106 63 95 147 97 61 103 57
267 57 146 3 228 42 231 241 82 85 95 108 105 139 92 133 25 178 209 34 43 26 70 12 138 306 375 274 94 161 179 70 101
$$ packed form
2861B457k309K50j84LM81L82m04n94K37j04J27k00K2l0O0L0j81R8l3O1m3R8j6j30R0r7K25
2544B96j02j1kR4m2k7q0J4Ol0o4O6jn8J2m0K8M7o8J80j15J83r2j12P2R0k24Q3M8k9O6m4j6
2157A28O8j30L4N8l1N1qr4N0N8r7L2n1k0M4K9J16n5r3J81o0n0j23J33q6JQ1J0j32R5O6K1j51
1769G5QQ7N6Rn1j77K04K2k2K0m3j3j08K08p6M9j49k8J16J93k08m9rO3j08N8l3k7J77J41k14
1405A71q2OKK01j49o2j7k7j5J3Q5K16j39j91J42N4l7j50RO0J65L6j77J7o1L7J5m7j7M7K3L6
1030A64m3q1L3J29j26j2%M1QK5o4l1O1K3m2JJ0k4J6J60n1j52R4J07j44P7L1j08p2K8J37L0
654B25j17Jq4J04J4n2m4J02K0J1m5p8M6M3L8J2p6j08R9k0q5J30M6j17M1%m3L2N2n0l6M2m6
267E7Q9j43K25j86J89J0j59LJ0J3lL4m7M1j08J53L1j75Rj7M4n8J26J68O9j01j80O7J8j09L1
$$ plain form
-97 101 94 191 188 137 50 57 117 74
$$ packed form
-97A01pR7ln1q7PO0m3
-191G4
##PAGE=	F1=831.028
##FIRST=	25168.397401625570637,	5807.04592319999756,	0.53255742788314819336
##DATA TABLE=	(F2++(Y..Y)), PROFILE
$$ plain form
5807 92 44 30 130 215 166 37 95 111 84 74 125 121 258 119 125 8 195 202 253 104 152 163 82 154 157 72 63 122 54 83 171 218 250 193
5408 193 118 193 162 122 80 94 212 199 56 141 43 47 147 113 23 131 137 188 164 80 64 92 79 67 75 165 41 68 38 219 228 105 105 33
5009 33 24 143 157 110 150 266 162 88 172 231 123 250 306 302 403 193 112 125 267 241 67 185 201 58 90 102 125 42 123 232
4657 232 289 155 97 211 239 39 55 128 109 133 58 92 216 136 193 128 48 246 204 156 187 151 77 172 63 11 56 186 231 176 122
4293 122 163 163 91 45 18 58 66 177 52 108 306 198 176 47 83 15 107 84 149 185 138 119 132 300 47 72 158 142 112 69 306 309
3917 309 139 37 66 81 175 70 148 143 132 94 47 120 121 54 106 78 102 32 114 90 8 177 145 46 126 65 232 177 176 207 188 56 124
3530 124 69 43 128 221 54 63 55 53 35 83 111 18 169 5 110 359 161 45 92 74 89 127 36 198 16 88 293 1059 1025 271
3178 271 218 158 177 158 168 247 78 75 168 99 119 81 88 60 122 325 427 764 1555 1295 501 160 387 2518 6469 6509 2892 159
$$ packed form
5807I2m8j4J00Q5m9j29N8J6k7j0N1mJ37j39Oj17J87PN1j49M8J1q1P2Lq5rN9o8K9Q8M7L2n7
5408A93p5P5l1m0m2J4J18j3j43Q5r8MJ00l4r0J08ON1k4q4j6K8j3j2QR0j24K7l0J81Rj23%p2
5009C3rJ19J4m7M0J16j04p4Q4N9j08J27N6mJ01k10q1J3J42k6j74J18J6j43L2J2K3q3Q1J09
4657B32N7j34n8J14K8k00J6P3j9K4p5L4J24q0N7o5q0J98m2m8L1l6p4R5j09n2M5J30M5n5n4
4293A22M1%p2m6k7M0QJ11j25N6J98j08k2j29L6o8R2k3O5L6m7j9J3J68k53K5Q6j6l0m3K37L
3917C09j70j02K9J5R4j05P8nj1l8m7P3Jo7N2k8K4p0Q2k4q2J69l2r9Q0o1J67n5jL1j9j32O8
3530A24n5k6Q5R3j67Rqkj8M8K8r3J51j64J05K49j98j16M7j8J5L8r1J62j82P2K05P66l4p54
3178B71n3o0J9j9J0P9j69lR3o9K0l8Pk8O2K03J02L37P91k60p94l41K27K131L951M0l617k733
$$ plain form
2849 159 392 193 332 876 1217 705 89 311 208 346 108 158 94 154 185 19 175 108 120 88 170 169 42 180 93 282 179
2532 179 207 198 260 207 154 115 151 135 141 60 170 71 29 126 12 45 128 45 216 129 312 187 57 180 267 42 58 136 127 192 122 131 137
2145 137 56 127 136 132 140 141 71 101 182 51 126 79 99 91 127 216 130 98 263 206 122 110 193 92 84 156 191 11 112 170 186 98 118 210 273
1734 273 168 162 42 226 206 200 178 142 121 93 287 220 249 106 117 204 385 183 117 130 149 54 94 95 47 193 343 162 61 107 100
1370 100 269 119 103 63 56 37 79 98 293 186 21 150 199 144 40 40 72 240 260 176 200 89 98 95 84 72 81 109 172 134 55 86 176
983 176 46 90 52 92 100 125 66 36 85 110 114 75 166 18 74 250 224 52 149 184 93 182 159 84 72 111 212 230 159 127 37 81 133 90
584 90 88 113 128 184 126 77 106 158 189 186 99 48 149 53 62 176 184 59 82 117 93 163 133 72 56 120 126 94 50 220 22 155 185 52 87
173 87 121 175 163 148 91 200 46 176 204 57 48 37 86 36 99 279 370 283 95 150 158 149 167 52 157 160 142 60 83 91 54
$$ packed form
2849A59K33j99J39N44L41n12o16K22j03J38k38N0o4O0L1j66J56o7J2l2Q2jj27J38q7J89j03
2532A79K8rO2n3n3l9L6j6Oq1J10r9m2R7j14L3Q3q3J71q7J83j25j30J23Q7k25J6P8rO5p0RO
2145A37q1P1RmQJp0L0Q1j31P5m7K0qL6Q9q6l2J65n7q4j2Q3j01qP2L5j80J01N8J6q8K0R2O3
1734B73j05oj20J84k0ok2l6k1k8J94o7K9j43J1Q7J81k02o6J3J9r5M0Jm8J46J50j81j01M6p
1370A00J69j50j6m0pj9M2J9J95j07j65J29M9n5j04%L2J68K0q4K4j11Rlj1j2RK8O3l8p9L1R0
983A76j30M4l8M0QK5n9l0M9K5Ml9R1j48N6J76k6j72R7L5r1Q9k3p5j2L9J01J8p1l2r0M4N2m3
584I0kK5J5N6n8m9K9N2L1lq7n1J01r6RJ14Qj25K3L5k4P0l0o1j6O4Ol2m4J70j98J33L0j33L5
173H7L4N4j2j5n7J09j54J30K8j47rj1M9n0O3J80R1q7j88N5QrJ8j15J05Lj8q2K3Ql7
-191E4
##PAGE=	F1=728.77
##FIRST=	25168.397401625570637,	5807.04592319999756,	0.47611162066459655762
##DATA TABLE=	(F2++(Y..Y)), PROFILE
$$ plain form
5807 96 54 34 153 245 155 86 195 161 89 131 134 133 241 99 108 6 206 239 246 136 169 170 89 146 153 62 93 122 34 95 208 259 192 177
5408 177 181 211 145 132 104 79 195 207 94 96 45 40 121 89 39 98 79 182 141 69 69 135 108 36 59 196 44 38 72 268 239 54 108 47
5009 47 28 143 173 95 99 190 119 30 207 200 66 255 280 258 359 147 141 155 279 284 129 194 222 95 132 123 157 70 130 227 293 162 90
4622 90 233 252 75 139 170 148 113 44 106 217 120 161 142 75 202 203 116 171 133 126 187 97 33 47 194 191 169 126 134 103 111 84 33 70 59
4211 59 183 72 40 284 201 149 42 80 33 97 57 176 203 146 113 162 328 58 77 206 162 99 84 285 298 142 64 94 156 148 78
3847 78 135 82 93 67 41 89 106 57 136 54 111 59 140 53 59 151 120 32 151 128 200 151 157 199 179 40 119 114 31 128 212 32 98 65 28
3436 28 87 37 74 42 161 24 106 309 180 73 100 112 78 154 11 115 38 76 258 209 860 552 151 240 179 218 161 239 37
3096 37 69 208 119 67 47 122 109 140 323 422 821 1507 1138 453 129 403 2701 6928 6938 3005 175 350 163 430 947
$$ packed form
5807I6m2k0J19R2r0o9J09l4p2M2LjJ08j42Rj02K00L3Pj10L3Jq1N7Pr1L1K9q8O1J13N1o7j5
5408A77ML0o6j3k8k5J16J2j13Kn1nQ1l2n0N9j9J03m1p2%O6k7p2K3J37j52oL4J96k9j85N4o1
5009D7j9J15L0p8MR1p1q9J77pj34J89K5k2J01k12oJ4J24Nj55O5K8j27L7rL4q7O0R7O6j31p2
4622I0J43J9j77O4L1k2l5o9O2J11r7M1j9o7J27Jq7N5l8pO1r0o4J4J47lk2m3Ql1Qk7n1L7j1
4211E9J24j11l2K44q3n2j07L8m7O4m0J19K7n7l3M9J66k70J9J29m4o3j5K01J3j56p8L0O2qp0
3847G8N7n3J1k6k6M8J7m9P9q2N7n2Q1q7OR2l1q8J19k3P2m9OM2k0j39P9nq3R7Q4j80O6l3l7
3436B8N9n0L7l2J19j37Q2K03j29j07K7J2l4P6j43J04p7L8J82m9O51l08m01Q9o1L9n7P8k02
3096C7L2J39q9n2k0P5j3L1J83R9L99O86l69o85l24K74K298M227J0l933k830J75j87K67N17
$$ plain form
2802 947 1138 559 106 265 201 305 62 148 63 93 158 1 181 103 73 74 140 111 23 180 117 254 151 197 194 237 182 101 105 163 128
2438 128 165 107 205 47 17 180 16 41 140 48 199 162 327 183 44 177 264 78 28 109 109 190 101 119 90 87 140 105 126 90 118
2075 118 57 86 188 9 133 77 157 113 121 184 68 110 233 215 70 193 212 78 70 154 195 59 80 106 113 106 143 237 280 88 146 62
1699 62 215 174 182 112 92 92 122 295 223 219 91 167 218 353 173 101 142 104 43 60 100 48 139 282 154 34 113 107 217 79 115 74
1323 74 60 103 146 74 234 166 50 159 201 116 73 64 63 232 212 245 260 107 99 82 80 94 58 105 172 129 77 93 134 18 114 50 90 78
924 78 101 45 41 74 101 159 93 218 29 74 252 243 71 155 108 83 171 124 69 105 142 213 234 193 142 80 38 123 105 133 84 72 170 108 90
513 90 122 166 186 180 65 119 187 24 120 200 183 66 51 126 114 220 159 74 50 146 191 102 98 201 64 81 131 37 82 137 219 232 158 88
114 88 246 57 169 198 90 56 74 89 60 53 219 327 257 101 142 130 219 223 39 122 132 146 71 96 73 47
$$ packed form
2802I47J91n79m53J59o4J04k43Q6q5L0O5j57J80p8l0JO6k9q8J57o3J37j03M6lM3n5q1MN8l5
2438A28L7n8R8j58l0J63j64K5R9r2J51l7J65j44j39J33Q7j86n0Q1%Q1q9J8k9lN3l5K1l6K8
2075A18o1K9J02j79J24n6Q0m4QO3j16M2J23j8j45J23J9j34qQ4M1j36K1K6PpL7R4M3j92N8q4
1699F2J53m1Qp0k0%L0J73p2mj28P6N1J35j80p2M1l8o1J7M0n2R1J43j28j20P9oJ10j38L6m1
1323G4j4M3M3p2J60o8j16J09M2q5m3rjJ69k0L3J5j53qj7kJ4l6M7O7m3n2J6M1j16R6o4M0j2
924G8K3n6mL3K7N8o6J25j89M5J78rj72Q4m7k5Q8m7n5L6L7P1K1m1n1o2m2Q5j8K8m9j2R8o2j8
513I0L2M4K0oj15N4O8j63R6Q0j7j17j5P5j2J06o1q5k4R6M5q9mJ03j37J7N0r4M5N5Q2J3p4p0
114H8J58j89J12K9j08l4J8J5k9pJ66J08p0j56M1j2Q9Mj84Q3J0J4p5K5k3k6
-191D7
##PAGE=	F1=626.513
##FIRST=	25168.397401625570637,	5807.04592319999756,	0.29873964190483093262
##DATA TABLE=	(F2++(Y..Y)), PROFILE
$$ plain form
5807 97 64 43 163 254 139 137 279 193 88 195 166 150 221 70 65 19 206 252 222 164 199 177 97 132 164 104 103 110 11 99 255 302 155
5420 155 208 242 196 136 138 115 93 157 207 138 42 75 59 96 83 76 64 43 155 104 70 63 182 118 51 68 225 41 67 78 296 237 12
5032 12 114 47 59 146 177 77 50 114 84 42 234 155 87 256 247 198 300 80 189 180 286 334 185 203 228 110 158 140 204 115 108 214
4657 214 295 167 76 248 261 107 193 182 185 102 51 121 183 92 113 144 97 164 193 87 149 125 158 200 131 66 41 202 142 182 128 112 56
4269 56 149 128 79 83 64 183 98 38 241 196 119 48 98 70 93 87 193 199 134 90 198 330 79 76 237 169 99 109 267 286 172 88 164
3882 164 220 130 88 131 110 84 48 50 59 94 49 166 55 96 73 138 19 77 125 76 27 181 175 156 121 144 201 152 24 97 153 74 108 191
3483 191 89 123 92 11 128 50 84 55 127 41 129 233 207 122 109 171 41 167 79 24 89 200 301 2322 4048 1819 212
3166 212 344 210 305 162 285 15 41 236 133 130 62 153 146 100 293 376 767 1213 805 375 116 360 2594 6598 6569 2769
$$ packed form
5807I7l3k1J20R1j15kJ42q6j05J07k9j6P1j51nm6J87M6l0n8L5k2q0L5L2o0jPr9Q8J56M7j47
5420A55N3L4m6o0Kk3k2O4N0o9r6L3j6L7j3pj2k1J12n1l4pJ19o4o7J7J57j84K6J1K18n9k25
5032A2J02o7J2Q7L1j00k7O4l0m2J92p9o8J69rm9J02k20J09rJ06M8j49J8K5j18M8j8O4q9pJ06
4657B14Q1j28r1J72J3j54Q6j1Lq3n1P0O2r1K1L1m7O7K9j06O2k4L3M2o9o5k5J61o0M0n4j6n6
4269E6R3k1m9Mj9J19q5o0K03m5p7p1N0k8K3oJ06Oo5m4J08J32k51lJ61o8p0J0J58J9j14q4P6
3882A64N6r0m2M3k1k6l6KRL5m5J17j11M1k3O5j19N8M8m9m9J54oj9l5K3N7m9j28P3N6p9L4Q3
3483A91j02L4l1q1J17p8L4k9P2q6Q8J04k6q5j3O2j30J26q8n5O5J11J01K021J726k229j607
3166B12J32j34R5j43J23k70K6J95j03lo8R1pm6J93Q3L91M46m08m30k59K44K234M004k9l800
$$ plain form
2861 2769 210 284 133 487 883 860 369 149 185 191 226 26 135 46 31 153 22 159 85 48 86 130 69 86 166 137 213 116 164
2521 164 180 208 173 66 105 176 132 189 161 219 55 41 212 54 59 145 49 175 194 327 179 43 142 236 122 45 85 78 174 87 93 69
2145 69 120 137 86 119 53 109 37 81 205 80 137 68 199 132 106 155 30 120 181 226 20 270 226 44 64 166 195 97 53 50 64 109
1769 109 157 243 250 11 129 69 192 145 161 60 50 78 141 295 211 166 61 214 224 286 140 78 156 64 45 59 111 68 91 209 147
1405 147 13 115 116 154 41 116 100 65 162 201 54 179 142 79 162 211 91 111 103 60 232 167 295 296 128 98 77 65 126 38 113 161
1030 161 103 105 89 83 41 123 52 87 49 69 65 54 68 104 212 134 234 64 85 250 249 90 161 90 83 151 92 58 113 144 199 241 200 148 114
619 114 32 117 134 173 77 29 140 80 90 143 164 173 172 57 208 218 52 163 207 179 79 30 131 119 258 205 104 54 168 224 138
255 138 137 167 85 58 90 37 74 149 237 295 169 84 258 55 158 194 123 62 118 73 78 9 140 259 202 109 126 99 271 260 59 92
$$ packed form
2861B769k559P4j51L54L96k3m91k20L6OL5k00J09q9j5J22j31J37p4l7L8M4o1J7Q0k9P6r7M8
2521A64J6K8l5j07L9P1m4N7k8N8j64j4J71j58NQ6r6J26J9J33j48j36R9R4j14p7M0pR6q7Ok4
2145F9N1J7n1L3o6N6p2M4J24j25N7o9J31o7k6M9j25R0O1M5k06K50m4j82K0J02K9r8m4lJ4M5
1769A09M8Q6Pk39J18o0J23m7J6j01j0K8O3J54q4m5j05J53J0O2j46o2P8r2j9J4N2m3K3J18o2
1405A47j34J02JL8j13P5j6l5R7L9j47J25l7o3Q3M9j20K0qm3J72o5J28Jj68l0k1j2O1q8P5M8
1030A61n8Kj6om2Q2p1L5l8K0mj1J4L6J08p8J00j70K1J65jj59P1p1pO8n9l4N5L1N5M2m1n2l4
619A14q2Q5J7L9r6m8J11o0J0N3K1Rjj15J51J0j66J11M4k8j00m9J01j2J39n3j01n0J14N6q6
255A38jL0q2k7L2n3L7P5Q8N8j26q5J74k03J03L6p1o1N6m5No9J31J19n7r3J7k7J72j1k01L3
$$ plain form
-120 92 111 147 79 96 67 75
$$ packed form
-120I2J9L6o8J7k9Q
-191G5
##PAGE=	F1=524.255
##FIRST=	25168.397401625570637,	5807.04592319999756,	0.18165314197540283203
##DATA TABLE=	(F2++(Y..Y)), PROFILE
$$ plain form
5807 97 73 56 159 242 117 169 332 207 95 261 201 173 207 39 19 56 193 243 185 182 234 180 104 115 175 132 97 96 32 91 295 336
5431 336 164 259 282 162 148 137 101 120 104 200 182 39 104 92 67 98 118 36 85 122 84 90 50 215 104 89 83 243 25 117 69 298
5056 298 218 35 128 32 82 143 169 66 26 56 72 115 246 111 153 250 206 132 248 29 239 197 288 380 230 212 220 107 155 153 248
4692 248 150 59 191 291 173 53 246 265 124 201 159 216 99 53 134 119 75 60 138 103 141 175 73 131 122 171 197 141 101 41 205
4328 205 98 204 134 102 76 192 164 116 97 59 170 123 83 190 183 97 71 134 92 82 110 193 173 106 54 227 302 106 75 244 166
3964 166 114 139 252 273 217 99 234 261 127 101 120 151 103 50 66 47 80 28 180 66 56 72 103 56 69 99 26 43 210 197 111
3600 111 84 135 209 110 26 58 178 118 74 156 123 137 114 26 151 88 135 52 62 47 163 135 234 185 119 235 29 179 175 148 169 408
3225 408 559 5267 8201 3456 432 455 291 404 166 384 71 36 249 145 212 115 171 151 49 250 295 611 785 722 422
$$ packed form
5807I7k4j7J03Q3j25N2J63j25j12J66o0k8L4j68k0L7J37N0n8lN2n4p6J1O0m3l5jo4N9K04M1
5431C36j72R5K3j20j4j1l6J9j6R6j8j43O5j2k5L1K0q2M9L7l8Om0J65j11j5oJ60k18R2m8K29
5056B98q0j83R3r6N0O1K6j03m0L0J6M3J31j35M2R7m4p4J16k19K10m2R1R2j50j8Qj13M8kR5
4692B48r8r1J32J00j18j20J93J9j41P7m2N7j17m6Q1j5m4j5P8l5L8L4j02N8rM9K6n6m0o0J64
4328B05j07J06p0l2k6J16k8m8j9l8J11m7m0J07pq6k6O3m2j0K8Q3k0o7n2J73P5j96l1J69p8
3964A66n2K5J13K1n6j18J35K7j34k6J9L1m8n3J6j9L3n2J52j14j0J6L1m7J3L0p3J7J67j3q6
3600A11k7N1P4r9q4L2J20o0m4Q2l3J4k3q8J25o3M7q3J0j5J16k8R9m9o6J16k06J50mk7K1K39
3225D08J51M708K934m745l024K3j64J13k38K18l13l5K13j04O7r7N6k0j02K01M5L16J74o3l00
$$ plain form
2931 422 138 276 2233 5566 5493 2245 258 223 108 489 686 639 643 214 99 177 127 54 120 44 22 154 45 112 54 48 102
2614 102 116 105 151 143 150 162 79 148 175 181 184 72 118 189 146 218 217 210 74 66 214 109 94 149 57 152 218 309 169 53 77 192 165 66 89
2204 89 49 140 79 60 74 144 123 103 120 73 119 25 87 229 152 133 67 217 145 117 142 58 122 116 221 36 325 239 2 95 189 196 121
1816 121 38 97 118 116 169 227 194 76 121 72 177 126 144 95 76 63 149 288 195 125 61 254 218 192 90 55 176 62 54 85 127 93
1441 93 53 134 141 9 114 129 114 22 102 129 71 200 232 38 139 120 106 148 219 71 147 155 62 235 146 313 305 156 87 68 56 163
1065 163 23 122 139 70 144 73 40 71 111 53 79 16 34 119 67 64 128 264 184 210 87 97 243 237 104 171 152 94 141 49 51 96 116 182
666 182 245 181 145 132 45 116 159 202 88 69 100 59 78 158 152 154 158 110 302 234 98 187 198 167 90 47 131 108 275 246 133 59 173 222
267 222 168 160 121 79 92 73 34 66 159 235 340 178 81 237 42 149 193 150 63 156 44 93 31 64 185 133 119 96 85 298 271 78
$$ packed form
2931D22k84J38J957L333p3l248j987l5j15L81J97m7Mm29j15P8n0p3O6p6k2J32j09O7n8oN4
2614A02J4j1M6qPJ2q3O9K7OLj12M6P1m3P2jpj36qJ48j05j5N5r2R5O6R1j40j16K4J15k7r9K3
2204H9m0R1o1j9J4P0k1k0J7m7M6r4O2J42p7j9o6J50p2k8K5q4O4oJ05j85K89q6k37R3R4Pp5
1816A21q3N9K1kN3N8l3j18M5m9J05n1J8m9j9j3Q6J39r3p0o4J93l6k6j02l5J21j14qL1M2l4
1441I3m0Q1Pj32J05J5j5r2Q0K7n8J29L2j94J01j9j4M2P1j48P6Qr3J73q9J67qj49o9j9j2J07
1065A63j40R9J7o9P4p1l3L1M0n8K6o3J8Q5n2lO4J36q0K6j23J0J46oj33O7j9n8M7r2KM5K0O6
666A82O3o4l6j3q7P1M3M3j14j9L1m1J9Q0oKMm8J92o8j36Q9J1l1p7m3Q4k3J67k9j13p4J14M9
267B22n4ql9m2J3j9l9L2R3P6J05j62r7J56j95J07M4m3q7R3j12M9o2L3J21n2j4k3j1K13k7j93
$$ plain form
-109 78 68 98 145 87 85 65 114
$$ packed form
-109G8j0L0M7n8kk0M9
-191A14
##PAGE=	F1=421.997
##FIRST=	25168.397401625570637,	5807.04592319999756,	0.3305415809154510498
##DATA TABLE=	(F2++(Y..Y)), PROFILE
$$ plain form
5807 97 76 68 141 214 88 182 348 206 122 320 221 201 198 26 65 101 165 211 142 184 265 177 110 101 173 131 80 91 59 74 312 351 207
5420 207 300 294 142 168 126 61 147 53 191 219 99 118 118 25 111 153 25 135 116 113 116 34 224 71 126 93 248 2 162 101 275
5056 275 186 69 157 18 87 131 148 68 51 23 87 175 238 96 208 235 166 77 212 67 277 203 280 407 259 219 203 106 132 159
4704 159 275 172 10 163 275 178 28 220 260 124 167 111 235 102 36 139 45 89 16 132 92 136 149 68 122 122 163 173 120
4363 120 134 49 196 77 218 147 100 121 222 184 144 117 50 140 136 106 148 160 90 96 170 96 60 111 175 128 64 13 243 249 129 93 231
3976 231 158 127 167 237 253 262 105 292 276 141 109 105 161 112 53 78 62 59 16 171 75 4 62 62 117 59 76 44 61 237 193 73 43 128
3577 128 215 65 48 40 185 155 42 110 132 139 125 43 156 105 180 31 28 48 189 42 250 250 131 288 98 213 280 291 263 647
3225 647 913 8470 12587 5157 686 553 400 490 169 499 117 90 250 164 258 164 176 130 177 237 193 395 644 1225 619
$$ packed form
5807I7k1qP3P3j26R4J66j42q4J98r9k0lj72L9L6O4M6o9M2Q1q8o7rP2m2n1J1l2J5K38L9j44
5420B07R3oj52K6m2o5Q6r4J38K8j20J9%r3Q6M2j28J10j9lLq2J90j53N5l3J55k46J60o1J74
5056B75q9j17Q8j39O9M4J7q0j7k8O4Q8O3j42J12K7o9q9J35j45K10p4P7J27j48m0j6r7K6K7
4704A59J16j03j62J53J12r7j50J92M0j36M3n6J24j33o6J03r4M4p3J16m0M4J3q1N4%M1J0n3
4363A20J4q5J47j19J41p1m7K1J01l8m0k7o7R0ml0M2J2p0OP4p4l6N1O4m7o4n1K30Oj20l6J38
3976B31p3l1M0P0J6Rj57J87j6j35l2mN6m9n9K5j6lm3J55r6p1N8%N5n8J7l2J7J76m4j20l0Q5
3577A28Q7j50j7qJ45l0j13O8K2Pj4q2J13n1P5j49lK0J41j47K08%j19J57j90J15O7J1k8L84
3225F47K66P557M117p430m471j33j53R0l21L30l82k7J60q6R4r4J2m6M7O0m4K02K49N81o06
$$ plain form
2931 619 176 201 1710 4084 3964 1560 294 205 89 438 401 927 1182 283 124 155 41 94 104 52 45 146 67 53 21 41
2626 41 112 88 163 205 112 155 108 58 184 186 158 203 105 145 199 164 250 267 184 90 87 190 172 133 162 71 137 227 276 148 75 7 147 196
2227 196 74 122 47 95 75 30 91 159 110 143 132 110 137 49 101 246 211 125 83 211 159 166 143 80 119 57 195 62 345 247 53 143
1851 143 216 201 135 42 171 182 130 181 193 129 139 143 82 180 120 129 163 144 41 147 272 194 146 109 282 198 92 55 41 197 74 67
1476 67 104 144 125 29 72 135 27 111 151 132 23 76 149 75 209 235 31 123 107 129 117 220 63 175 213 75 232 152 297 298 186
1112 186 72 46 78 196 21 124 115 68 194 57 60 85 77 55 73 22 28 168 69 64 164 302 229 154 101 106 234 210 110 183 206 111
736 111 154 21 46 72 69 168 239 141 135 128 38 121 167 214 96 112 78 85 59 161 130 134 141 179 387 235 146 197 183 147 90 78 124 83 271
326 271 270 147 55 149 191 185 163 70 52 123 84 33 62 169 221 355 182 81 194 34 145 193 169 52 183 42 110 59 31 121 78
$$ packed form
2931F19m43K5J509K374j20k404j266q9j16L49l7N26K55q99j59L1j14N3J0n2pJ01p9j4l2K0
2626D1P1k4P5M2r3M3m7n0J26Kk8M5r8M0N4l5Q6J7q3r4lJ03j8l9K9r1O6R0M9j28p3o8J40M9
2227A96j22M8p5M8k0m5O1O8m9L3j1k2K7q8N2J45l5q6m2J28n2Pk3o3L9o2J38j33K83r8j94R0
1851A43P3j5o6r3J29J1n2N1J2o4J0Mo1R8o0RL4j9j03J06J25p8m8l7J73q4j06l7j4J56j23p
1476F7L7M0j9r6M3O3j08Q4M0j9j09N3P3p4J34K6k04R2j6K2j2J03j57J12L8j38J57q0J45Jj12
1112A86j14k6L2J18j75J03rm7J26j37LK5qk2J8n1OJ40r9nJ00J38p3p5n3NJ28k4j00P3K3r5
736A11M3j33K5K6lR9P1r8opr0Q3M6M7j18J6l4Pk6J02l1MPL8K08j52q9N1j4l6n7j2M6m1J88
326B71jj23r2R4M2ok2r3j8P1l9n1K9J07N2J34j73j01J13j60J11M8k4j17J31j41O8n1k8R0m3
$$ plain form
-38 78 127 53 104 293 260 87 45 89 140 103 78 58 148
$$ packed form
-38G8M9p4N1J89l3j73m2M4N1l7k5k0R0
-191A48
##PAGE=	F1=319.739
##FIRST=	25168.397401625570637,	5807.04592319999756,	0.35173299908638000488
##DATA TABLE=	(F2++(Y..Y)), PROFILE
$$ plain form
5807 95 74 75 111 178 62 178 332 197 161 357 219 231 190 21 111 138 124 160 102 164 283 171 111 94 157 106 59 101 77 52 298
5443 298 341 256 313 277 162 180 105 31 176 37 181 242 158 112 121 37 106 172 32 167 151 162 134 18 210 46 151 98 245 25
5091 25 195 176 239 148 102 201 34 76 112 118 72 71 21 111 207 207 118 237 214 155 57 179 94 289 193 257 402 267 221 184 134 115 153
4704 153 277 184 79 141 244 181 31 176 241 113 111 75 239 109 22 128 43 115 44 139 66 146 116 63 122 122 138 131 69 161 65 173
4328 173 81 215 163 107 162 229 184 164 145 53 100 131 114 131 129 99 109 194 87 45 95 142 74 21 48 241 176 140 122 206 150 128 189 219
3929 219 227 296 122 332 268 163 109 102 147 103 42 82 90 37 52 140 83 64 55 102 176 72 57 84 68 258 169 48 23 119 209 39 74
3542 74 102 175 183 52 65 125 135 128 56 151 91 198 14 133 55 200 108 254 307 148 318 165 262 370 414 352 867 1240 11257
3201 11257 16292 6558 906 616 504 540 174 584 134 147 247 192 255 192 171 102 320 268 89 208 1036 1820 827 203
$$ packed form
5807I5k1JL6O7j16J16J54j35l6J96j38J2m1j69R0K7j4L6n8O2J19j12o0j7O3n1m7M2k4k5K46
5443B98M3q5N7l6j15J8p5p4J45j39J44O1q4m6Rq4O9O6j40J35j6J1k8j16J92j64J05n3J47k20
5091B5J70j9O3r1m6R9j67M2L6Om6jn0R0R6%q9J19k3n9r8J22q5J95r6O4J45j35m6l7n0j9L8
4704A53J24r3j05O2J03o3j50J45O5j28kl6J64j30q7J06q5P2p1R5p3Q0l0n3N9%J6po2R2r6J08
4328A73r2J34n2n6N5O7m5k0j9r2M7L1j7J7kl0J0Q5j07m2N0M7o8n3K7J93o5l6j8Q4n6k2O1L0
3929B19QO9j74K10o4j05n4pM5m4o1M0Qn3J5Q8n7j9rM7P4j04j5K7j6J90q9j21k5R6R0j70L5
3542G4K8P3Qj31J3O0J0pp2R5o0J07j84J19p8J45r2J46N3j59J70j53R7J08M4o2N15L73J0017
3201A1257N035r734n652k90j12L6l66M10m50J3J00n5O3o3k1o9K18n2j79J19Q28P84r93o24
$$ plain form
2920 203 203 1142 2489 2324 866 291 230 72 348 104 1427 1672 336 230 126 80 125 91 65 47 138 88 26 15 26 118 49
2603 49 203 247 78 150 63 65 243 199 144 217 145 179 205 176 275 304 150 101 104 151 230 165 185 82 131 217 229 111 108 84 116 204 74
2215 74 166 65 59 80 14 116 167 118 181 149 126 149 95 124 242 246 119 108 188 175 226 142 81 116 66 148 64 328 246 101 183 236 211
1828 211 143 71 233 222 146 190 144 73 183 185 95 183 123 110 221 215 42 140 252 216 202 153 294 169 68 94 53 209 72 93 107
1464 107 155 155 28 47 134 53 105 180 177 16 53 153 76 185 209 48 127 111 142 82 212 68 189 265 103 218 169 256 288 213 60
1100 60 24 120 219 27 121 107 96 243 68 108 80 31 54 87 54 65 199 55 72 197 316 259 91 113 118 223 174 109 182 219 128
736 128 178 79 37 77 22 156 215 92 124 107 13 135 151 205 90 133 100 135 43 153 100 118 132 240 450 223 194 195 166 121 75 107
361 107 109 56 250 276 145 42 99 147 188 144 30 20 139 112 55 63 176 195 336 175 84 145 48 142 193 177 33 196 77 132 75
$$ packed form
2920B03%R39J347j65j458n75o1j58K76k44J323K45j336j06j04m6M5l4k6j8R1n0o2j1J1R2o9
2603D9J54M4j69P2q7KJ78m4n5P3p2L4K6k9R9K9j54m9LM7P9o5K0j03M9Q6J2j18lk4L2Q8j30
2215G4R2j01oK1o6J02N1m9O3l2k3K3n4K9J18Mj27j1Q0j3N1q4o1L5n0Q2q4K64q2j45Q2N3k5
1828B11o8p2J62j1p6M4m6p1J10Kr0Q8o0j3J11oj73R8J12l6j4m9J41j25j01K6m1J56j37K1J4
1464A07M8%j27J9Q7q1N2P5lj61L7J00p7J09K4j61P9j6L1o0J30j44J21P6j62J15m9Q7L2p5j53
1100F0l6R6R9j92R4j4j1J47j75M0k8m9K3L3l3J1J34j44J7J25J19n7j68K2NJ05m9o5P3L7r1
736A28N0r9m2M0n5J34N9j23L2j7r4J22J6N4j15M3l3L5r2J10n3J8J4J08K10k27k9Jk9m5m6L2
361A07Kn3J94K6j31j03N7M8M1m4j14j0J19k7n7QJ13J9J41j61r1O1r7R4N1j6j44J63j19N5n7
$$ plain form
-3 75 56 68 83 131 5 133 261 233 86 24 82 136 123 93 47 169
$$ packed form
-3G5j9J2J5M8j26J28J28k8j47o2N8N4j3l0m6J22
-191A69
##PAGE=	F1=217.481
##FIRST=	25168.397401625570637,	5807.04592319999756,	0.16192127764225006104
##DATA TABLE=	(F2++(Y..Y)), PROFILE
$$ plain form
5807 92 67 72 72 141 63 166 294 187 194 361 193 253 173 16 126 154 74 109 79 122 283 167 104 97 138 72 35 120 89 32 258 302
5431 302 292 297 237 203 179 75 69 203 61 166 246 210 83 94 117 82 166 50 180 201 198 142 7 178 63 155 99 239 54 209
5079 209 252 203 111 130 249 52 58 93 82 65 78 45 127 199 159 146 236 196 194 61 147 88 271 162 216 363 255 216 166 182 136 136 258
4692 258 193 139 131 199 176 56 131 207 99 77 105 224 115 62 99 87 134 79 157 33 167 78 52 126 121 102 82 15 185 85 134 91
4316 91 192 176 123 206 215 167 180 172 61 81 111 128 145 94 122 105 199 79 70 69 103 32 52 97 222 93 133 140 182 146 109 204 196 195 309 154
3894 154 349 240 184 103 113 137 83 13 79 123 41 96 90 96 122 58 174 220 97 47 105 65 272 132 53 75 99 186 46 96 175 156
3518 156 205 89 45 115 131 125 62 147 47 183 58 240 73 192 200 249 343 167 313 214 299 422 493 418 1018 1450 12993 18474
3190 18474 7334 1043 624 576 539 183 599 109 186 247 220 203 190 164 95 420 301 10 211 1445 2213 950 209 247
$$ packed form
5807I2k5N%O9p8J03J28j07PJ67j68O0q0j57J10K8q0L5l0M3J61j16o3pM1o6l7Q5l1n7K26M4
5431C02j0No0l4k4j04oJ34j42J05Q0l6j27J1K3l5Q4j16J30K1ln6j35J71j15R2n6J40j85J55
5079B09M3m9r2J9J19j97OL5j1j7J3l3Q2P2m0j3R0m0kj33Q6n9J83j09N4J47j08l9n0J6m6%J22
4692B58o5n4qO8k3j20P5P6j08k2K8J19j09n3L7j2M7n5P8j24J34q9k6P4nj9k0o7J70j00M9m3
4316I1J01j6n3Q3Rm8J3qj11K0L0J7J7n1K8j7R4j20rjL4p1K0M5J25j29M0PM2l6l7R5qjJ14j55
3894A54J95j09n6q1J0K4n4p0O6M4q2N5oOK6o4J16M6j23n0N8m0K07j40p9K2K4Q7j40N0P9j9
3518A56M9j16m4P0J6oo3Q5j00J36j25J82j67J19QM9R4j76J46r9Q5J23P1p5O00M32J1543N481
3190A8474j1140o291m19m8l7l56M16m90P7O1k7j7j3k6o9L25j19k91K01J234P68j263p41L8
$$ plain form
2908 247 638 1100 891 298 235 259 62 250 197 1794 1970 358 323 92 132 147 85 75 47 150 108 75 38 54 127 33 218 281
2579 281 60 136 43 83 290 200 139 219 185 212 207 180 278 318 118 104 116 112 267 179 208 79 128 186 174 60 146 147 103 188 77 208
2204 208 80 72 100 10 141 169 143 201 162 116 146 151 155 212 251 121 130 162 185 273 131 63 118 113 91 54 279 237 139 200 236 222 148 118 275
1793 275 236 159 190 85 38 211 225 97 166 126 85 258 274 79 132 229 258 243 168 290 136 136 157 84 201 76 134 96 151 172 42
1429 42 56 139 83 94 206 212 7 63 142 90 136 160 76 141 131 141 73 196 81 191 299 138 190 185 203 288 236 63 48 159 224 33
1053 33 116 121 115 271 96 152 58 26 52 119 76 105 208 28 91 213 300 267 71 131 145 213 136 103 157 182 135 195 136 25 103 34 137
666 137 172 55 117 79 54 159 115 173 66 129 140 178 42 137 67 104 136 280 484 208 234 186 152 103 44 135 94 43 220 266 131
302 131 48 34 108 180 106 28 37 142 140 91 70 176 156 282 152 87 109 71 132 188 174 39 194 104 158 83 76 34 116 128 40 147 211
$$ packed form
2908B47L91M62k09n93o3K4j97J88n3J597J76j612l5k31M0J5o2j0k8J03m2l3l7J6P3r4J85O3
2579B81k21P6r3M0K07r0o1Q0l4K7nk7R8M0k00j4J2mJ55q8K9j29M9N8j2j14Q6Jm4Q5j11J31
2204B08j28qK8r0J31K8k6N8l9m6L0NMN7L9j30RL2K3Q8j42o8N5nk2l7K25m2r8O1L6j4p4l0J57
1793B75l9p7L1j05m7J73J4j28O9m0m1J73J6j95N3R7K9j5p5J22j54%K1p3J17j25N8l8N5K1j30
1429D2J4Q3n6J1J12Ok05N6P9n2M6K4q4O5j0J0o8J23j15J10J08j61N2nJ8Q5n2j73j5J11O5j91
1053C3Q3NoJ56j75N6r4l2K6O7m3K9J03j80O3J22Q7l3j96O0J4O8p7l3N4K5m7O0n9j11P8o9J03
666A37L5j17O2l8k5J05m4N8j07O3J1L8j36R5p0L7L2J44K04k76K6m8l4m9n9R1m1n1J77M6j35
302A31q3j4P4P2p4p8RJ05km9k1J06k0J26j30o5K2l8O1N6j4j35J55r0N4p5pm2Q2J2q8J07O4
$$ plain form
-85 211 199 79 20 81 137 143 127 41 173
$$ packed form
-85B11j2j20n9O1N6Oj6q6J32
-191A73
##PAGE=	F1=115.223
##FIRST=	25168.397401625570637,	5807.04592319999756,	0.1335751265287399292
##DATA TABLE=	(F2++(Y..Y)), PROFILE
$$ plain form
5807 92 57 61 29 111 88 154 249 182 208 326 148 260 144 59 104 141 31 103 87 59 267 165 88 105 123 48 10 138 98 32 216
5443 216 236 301 253 182 232 167 45 106 215 82 142 229 247 30 37 207 63 131 71 181 243 208 140 19 142 84 132 100 235 84
5091 84 202 303 169 77 152 293 58 66 82 49 44 71 80 122 154 116 156 208 193 252 52 134 66 222 112 168 297 223 204 145 224 182
4715 182 110 225 201 179 124 147 160 75 102 164 93 104 155 193 114 112 56 100 143 100 175 4 188 38 37 126 115 61 52 102 208 103 89
4328 89 90 155 178 142 257 194 141 196 187 60 115 90 156 177 55 153 90 187 83 104 47 66 60 107 138 190 11 107 131 168 142 75 211 168
3929 168 161 297 185 343 198 192 96 116 143 69 27 75 158 66 136 35 110 163 60 225 237 112 50 109 74 277 94 83 140 70 147
3565 147 51 111 230 137 227 125 62 111 128 122 62 156 19 136 108 330 97 170 263 240 354 185 273 238 302 424 518 445 1062 1485
3213 1485 13265 18615 7295 1071 569 599 483 196 530 46 197 253 238 116 160 161 108 458 299 66 302 1639 2288
$$ packed form
5807I2l5Ml2Q2k3O6R5o7K6J18j78J12j16q5M5L7j10P2j6k8K08j02p7J7J8p5l8J28m0o6J84
5443B16K0O5m8p1N0o5j22O1J09j33O0Q7J8k17PJ70j44O8o0J10O2l5o8j21J23n8M8l2J35j51
5091H4J18J01j34r2P5J41k35QJ6l3nK7RM2L2l8M0N2j5N9k00Q2o8J56j10N6J29p4j9n9P9m2
4715A82p2J15k4k2n5K3J3q5K7O2p1J1N1L8p9kn6M4M3m3P5j71J84j50jQ9j1n4rN0J06j05j4
4328H9JO5K3l6J15o3n3N5rj27N5k5O6K1j22R8o3R7j04K1n7J9oM7L1N2j79R6K4L7k6o7J36m3
3929A68pJ36j12J58j45or6K0K7p4m2M8Q3r2P0j01P5N3j03J65J2j25o2N9l5K03j83j1N7p0P7
3565A47r6O0J19r3R0j02o3M9J7oo0R4j37J17k8K22k33P3R3k3J14j69Q8l5O4J22R4p3O17M23
3213A485J1780N350j1320o224n02L0j16k87L34m84J51N6j5j22M4Jn3L50j59k33K36J337O49
$$ plain form
2943 2288 950 194 267 270 144 130 113 138 271 79 184 366 1895 2005 342 376 56 149 165 93 76 67 181 132 117 62 104 141
2614 141 88 211 308 102 118 46 97 308 182 141 210 217 233 203 176 246 304 99 100 124 86 274 168 219 61 120 137 124 27 182 182 97
2239 97 160 87 239 92 108 127 17 155 166 166 196 160 89 125 205 189 161 230 127 142 143 185 297 114 34 120 147 65 76 214 225 164
1863 164 189 213 227 154 172 293 231 165 175 25 25 230 248 78 128 123 56 266 314 124 126 206 308 253 148 268 106 187 208 120 170
1499 170 121 178 81 126 166 73 64 151 114 75 218 224 39 92 123 128 83 97 108 159 157 121 103 176 95 184 306 167 152 193 150 301 253 76
1100 76 86 187 211 41 112 141 107 262 113 187 30 63 63 152 89 138 202 3 119 207 257 250 99 156 188 209 99 95 109 104 127 197 175
713 175 31 121 54 104 113 67 114 74 122 188 91 121 33 107 169 197 56 121 35 88 142 292 491 199 262 170 139 104 5 161 87 52 185
326 185 247 117 90 61 88 158 53 36 67 135 157 125 83 171 106 201 118 87 95 93 116 176 163 84 180 112 182 87 93 79 138 113 74 137 158 163
$$ packed form
2943B288j338p56P3Lj26j4j7K5J33j92J05J82J529J10j663L4l20R3J6p2j7rJ14m9j5n5M2L7
2614A41n3J23R7k06J6p2N1K11j26m1O9PJ6l0k7P0N8k05JK4l8J88j06N1j58N9J7j3r7J55%q5
2239I7O3p3J52j47J6J9j10J38J1%L0l6p1L6Q0j6k8O9j03J5JM2J12j83q0Q6K7q2J1J38J1o1
1863A64K5K4J4p3J8J21o2o6J0j50%K05J8j70N0no7K10M8j90KQ0J02n5j05J20j62Q1K1q8N0
1499A70m9N7r7M5M0r3rQ7l7l9J43Oj85N3L1Nm5J4J1N1kl6j8P3q1Q9J22j39j5M1m3J51m8j77
1100G6J0J01K4j70P1K9l4J55j49P4j57L3%Q9o3M9O4j99J16Q8N0pj51N7L2K1j10mJ4nK3P0k2
713A75j44R0o7N0Rm6M7m0M8O6r7L0q8P4O2K8j41O5q6N3N4J50J99k92O3r2l1l5r9J56p4l5J33
326A85O2j30k7k9K7P0j05j7L1O8K2l2m2Q8o5R5q3l1QkK3O0j3p9R6o8P0r5Oj4N9k5l9O3K1N
$$ plain form
-97 163 71 33 97 144 155 163 52 160
$$ packed form
-97A63r2l8O4M7J1Qj11J08
-191A60
##PAGE=	F1=12.9655
##FIRST=	25168.397401625570637,	5807.04592319999756,	0.20918394625186920166
##DATA TABLE=	(F2++(Y..Y)), PROFILE
$$ plain form
5807 97 54 47 24 95 115 148 211 181 197 258 92 247 106 122 48 99 43 154 116 24 237 163 69 118 112 45 16 148 107 51 211 157 275
5420 275 191 125 232 151 33 118 200 95 107 193 264 41 39 288 90 73 88 176 271 192 131 34 112 80 86 105 237 113 174 313 130
5056 130 46 166 323 50 103 86 24 8 57 115 88 91 103 137 164 215 295 26 154 79 149 62 126 221 178 190 114 249 219 84 190
4692 190 206 193 108 94 132 82 94 131 99 136 186 155 107 154 40 78 148 101 179 18 200 12 22 117 102 32 64 192 234 114 48 75
4316 75 115 167 156 310 184 118 213 183 54 167 90 189 210 24 185 80 160 92 120 41 41 99 157 163 153 58 71 87 167 136 40 210
3941 210 134 133 258 200 316 149 181 88 96 149 74 71 74 185 89 171 49 123 185 51 234 223 111 63 108 117 271 61 117 206 44 103
3565 103 39 117 253 122 253 156 82 106 127 117 57 171 93 69 151 392 124 140 286 230 342 196 204 241 269 382 490 425 984
3225 984 1339 12017 16676 6444 989 457 571 379 206 401 54 174 263 242 42 118 163 117 438 256 99 334 1574
$$ packed form
5807I7m3pk3P1K0L3O3l0J6O1j66J55j41J6p4N1n6J11l8r2K13p4r4M9oo7k9J32m1n6J60n4J18
5420B75q4o6J07q1j18Q5Q2j05J2Q6P1k23kK49j98j7J5Q8R5p9o1r7P8l2OJ9J32j24O1J39j83
5056A30q4J20J57k73N3j7o2j6M9N8k7LJ2L4K7N1Q0k69J28p5P0q7O4R5m3J2p6J35l0j35J06
4692A90J6j3q5j4L8n0J2L7l2L7N0l1m8M7j14L8P0m7P8j61J82j88J0R5j5p0L2J28M2j20o6K7
4316G5M0N2j1J54j26o6R5l0j29J13p7R9K1j86J61j05Q0o8K8p9%N8N8Oj0r5J3J6Q0l1r6J70
3941B10p6jJ25n8J16j67L2r3QN3p5lLJ11r6Q2j22P4O2j34J83j1j12m8M5RJ54k10N6Q9j62N9
3565A03o4P8J36j31J31r7p4K4K1j0o0J14p8k4Q2K41k68J6J46n6J12j46QL7K8J13J08o5N59
3225I84L55J0678M659j0232n455n32J14j92j73J95l47J20Q9k1k00P6M5m6L21j82j57K35J240
$$ plain form
2955 1574 2042 827 169 240 71 394 666 282 122 263 128 170 424 1715 1782 289 382 27 130 181 114 65 95 210 158
2661 158 146 90 146 160 153 190 327 174 101 50 102 295 151 146 190 234 234 193 169 178 264 97 89 125 82 253 131 211 33 101 81 98 78
2274 78 211 183 95 148 96 255 104 136 148 44 145 156 170 170 138 83 87 246 216 103 189 133 144 131 176 298 104 6 114 160 105
1910 105 137 164 221 175 156 168 221 166 221 286 216 162 145 47 31 251 252 37 94 110 36 245 328 161 113 187 355 232 107 231 87
1546 87 203 237 146 119 188 214 75 82 138 122 68 165 138 48 213 218 76 116 105 183 89 37 141 179 181 94 151 158 109 172 287 181 113 189
1147 189 110 315 267 91 115 203 180 51 108 148 70 209 109 213 20 83 93 179 97 160 188 27 148 181 196 213 117 192 240 209
795 209 69 93 72 4 109 182 193 54 121 52 64 50 98 115 103 187 212 125 68 32 87 177 186 70 106 15 65 141 276 475 199 270
420 270 145 131 120 57 185 94 65 152 226 112 147 133 83 125 16 31 96 120 157 145 100 170 56 110 98 86 102 116 100 153 149 139 158
$$ packed form
2955A574M68j215o58P1j69L23K72l84j60J41j35M2K54J291O7j493R3l55J03N1o7m9L0J15n2
2661A58j2n6N6J4pL7J37j53p3n1N2J93j44nM4M4%m1k4RQ6j67qL6m3J71j22Q0j78O8k0J7k0
2274G8J33k8q8N3n2J59j51L2J2j04J01J1J4%l2n5MJ59l0j13Q6n6J1j3M5J22j94r8J08M6n5
1910A05L2K7N7m6j9J2N3n5N5O5p0n4j7r8j6K20Jk15N7J6p4K09Q3j67m8P4J68j23j25J24j44
1546H7J16L4r1k7O9K6j39PN6j6n4R7k7r0J65Nj42M0j1P8r4n2J04L8Kq7N7Pm9O3J15j06o8P6
1147A89p9K05m8j76K4Q8k3j29N7M0p8J39j00J04j93O3J0Q6q2O3K8j61J21L3J5J7r6P5M8l1
795B09j40K4k1o8J05P3J1j39O7o9J2j4M8J7j2Q4K5q7n7l6N5R0Rj16L6r1N0P6J35J99k76P1
420B70j25j4j1o3J28r1k9Q7P4j14L5j4n0M2j09J5O5K4L7j2m5P0j14N4j2j2J6J4j6N3mj0J9
$$ plain form
32 158 99 200 90 116 148 140 92 100 106 117 127 66 48 128 155 159 189 68 132
$$ packed form
32A58n9J01j10K6L2qm8QOJ1J0o1j8Q0K7ML0j21O4
-191A32
##PAGE=	F1=-89.2924
##FIRST=	25168.397401625570637,	5807.04592319999756,	0.19582609832286834717
##DATA TABLE=	(F2++(Y..Y)), PROFILE
$$ plain form
5807 111 67 43 60 91 133 151 191 182 165 172 37 213 66 184 30 48 70 208 155 90 201 156 66 138 105 50 40 140 109 74 250
5443 250 98 217 132 80 199 138 54 102 151 110 75 146 257 119 118 344 140 22 94 168 282 157 120 49 94 51 28 119 250 140
5091 140 138 280 85 34 170 332 43 142 101 17 45 45 140 36 87 113 89 123 255 304 51 180 131 66 86 104 154 131 179 72 255
4727 255 234 70 167 204 183 76 46 95 79 86 127 115 139 191 124 100 183 85 52 156 86 163 26 198 42 37 98 79 53 84 263 261 115
4340 115 27 51 84 144 161 354 194 108 225 160 63 207 104 212 232 33 210 88 129 98 111 45 32 123 194 170 121 107 44 25
3988 25 180 125 58 198 96 121 199 191 272 102 152 80 50 137 86 109 80 190 102 196 103 130 189 27 199 178 97 76 124 176 254 41
3612 41 141 258 53 71 24 116 234 111 278 182 92 94 128 109 47 181 158 24 179 417 152 105 276 214 314 194 117 222
3283 222 214 321 424 360 798 1050 9551 13109 4975 823 306 498 248 199 281 137 124 266 232 102 106 169 113 382 185 99
$$ packed form
5807A11m4k4J7L1M2J8M0rj7Pj35J76j47J18j54J8K2J38n3o5J11m5r0P2l3n5j0J00l1l5J76
5443B50j52J19q5n2J19o1q4M8M9m1l5P1J11j38jK26k04j18P2P4J14j25l7p1M5m3k3R1J31j10
5091A40kJ42j95n1J36J62k89R9m1q4K8%R5j04N1K6k4L4J32M9k53J29m9o5K0J8N0k3M8j07J83
4727B55k1j64R7L7k1j07l0M9j6PM1j2K4N2o7k4Q3r8l3J04p0P7j37J72j56nO1j9k6L1J79kj46
4340A15q8K4L3O0J7J93j60q6J17o5r7J44j03J08K0j99J77j22M1l1J3o6j3R1P1k4m9j4o3j9
3988B5J55n5o7J40j02K5P8qQ1j70N0p2l0Q7n1K3k9J10q8R4r3K7N9j62J72k1q1k1M8N2P8k13
3612D1J00J17k05J8m7R2J18j23J67r6r0KL4j9o2J34k3j34J55K38k65m7J71o2J00j20p7J05
3283B22qJ07J03o4M38K52Q501L558q134m152n17J92k50m9Q2j44j3J42l4j30MO3n6K69j97q6
$$ plain form
2978 99 293 1296 1557 618 149 177 57 502 790 306 223 245 192 180 380 1321 1370 210 346 22 88 198 142 47 113 220
2673 220 186 162 114 164 176 207 161 335 245 87 47 98 261 119 150 163 231 209 176 162 85 207 110 72 118 93 213 76 183 15
2321 15 70 46 109 129 227 156 106 169 90 252 117 149 157 80 108 139 151 138 110 123 39 263 228 62 141 137 139 114 164 277 110 25 105 151
1922 151 153 200 158 225 172 114 118 201 192 257 255 195 146 103 104 44 276 243 20 112 92 36 197 313 181 88 183 391 192 101 188 82 185
1535 185 239 152 62 243 232 76 31 108 174 77 174 149 22 192 202 111 126 94 239 144 50 175 199 197 87 207 149 122 159 246 179
1171 179 88 171 89 318 279 102 128 214 135 62 102 132 20 121 99 233 34 85 128 195 108 166 177 39 173 145 136 163 112 238 290
807 290 210 51 99 119 98 95 152 189 75 116 33 52 43 120 117 134 236 220 183 83 74 91 163 146 74 94 27 35 127 234 444 206 256 116
408 116 136 140 115 203 103 71 124 206 119 202 189 80 90 75 20 135 102 145 147 119 179 60 53 118 87 121 138 96 123 145 191 134 82 208
$$ packed form
2978I9J94J003K61r39m69K8j20M45K88m84q3K2n3j2K00R41M9j160J36l24O6J10n6r5O6J07
2673B20l4k4m8N0J2L1m6J74r0j58m0N1J63j42L1J3O8k2l3j4p7J22r7l8M6k5J20j37J07j68
2321A5N5k4O3K0R8p1n0O3p9J62j35L2Qp7K8L1J2j3k8J3q4K24l5j66P9mKk5N0J13j67q5Q0M6
1922A51KM7m2O7n3n8MQ3rO5ko0m9m3Jo0K32l3k23R2k0n6J61J16j32r3R5K08j99r1Q7j06J03
1535A85N4q7r0J81j1j56m5P7O6r7R7k5j27J70J0r1J5l2J45r5r4J25K4kj10J20n8k7L7Q7o7
1171A79r1Q3q2K29l9j77K6Q6p9p3M0L0j12J01k2J34j99N1M3O7q7N8J1j38J34k8rK7n1J26N2
807B90q0j59M8K0k1lN7L7j14M1q3J9rP7lJ7J02j6l7j00rJ7P2j7p2K0o7QR2J07K10k38N0j40
408A16K0Mk5Q8j00l2N3Q2q7Q3j3j09J0j5n5J15l3M3Kk8O0j19pO5l1L4J7m2K7K2M6n7n2J26
$$ plain form
9 208 89 138 205 132 77 123 64 100 93 68 65 163 164 155 198 77 96
$$ packed form
9B08j19M9O7p3n5M6n9L6pk5lR8JrM3j21J9
-191I6
##PAGE=	F1=-191.55
##FIRST=	25168.397401625570637,	5807.04592319999756,	0.28391256928443908691
##DATA TABLE=	(F2++(Y..Y)), PROFILE
$$ plain form
5807 129 92 56 88 96 141 159 189 179 123 93 31 165 32 229 114 82 85 240 198 145 164 142 84 171 121 64 59 111 97 91 298 120 151
5420 151 118 83 142 126 77 67 92 140 97 101 226 189 182 359 178 81 83 152 276 117 109 63 83 43 47 140 271 157 115 221 75 64 165
5032 165 317 62 169 118 35 104 47 148 55 150 117 23 110 295 275 108 186 181 22 154 107 112 90 176 38 249 223 75 159 195
4680 195 156 33 10 52 70 67 145 141 112 176 108 104 201 131 89 168 77 128 22 183 67 78 74 49 85 88 299 281 105 26 36 70 112 157
4281 157 381 215 107 221 125 83 223 116 219 232 50 220 109 108 106 88 45 32 125 213 157 99 130 56 78 201 119 106 170 61
3929 61 123 134 160 222 63 109 76 16 109 97 134 93 167 109 213 147 129 180 26 131 115 78 85 162 232 235 33 148 285 75 67 38 112
3542 112 178 111 288 201 93 81 134 95 37 176 202 86 186 405 176 72 248 188 275 178 30 174 148 265 342 260 547 689
3213 689 6431 8700 3209 611 142 395 116 155 239 182 69 250 216 170 143 170 102 315 106 69 206 905 970 377 147
$$ packed form
5807A29l7l6L2QM5J8L0j0n6l0o2J34j33J97j15l2LJ55m2n3J9k2n8Q7n0n7nN2j4oK07j78L1
5420A51l3l5N9j6m9j0K5M8m3MJ25l7pJ77j81r7KO9J24j59qm6K0m0MR3J31j14m2J06j46j1J01
5032A65J52k55J07n1q3O9n7J01r3R5l3r4Q7J85k0j67P8nj59J32m7Nk2Q6j38K11k6j48Q4L6
4680A95l9j23k3M2J8lP8mk9O4o8mR7p0m2P9r1N1j06J61j16J1mk5L6LK11j8j76p9J0L4M2M5
4281A57K24j66j08J14r6m2J40j07J03J3j82J70j11jkj8m3j3R3Q8n6n8L1p4K2J23q2j3O4j09
3929F1O2J1K6O2j59M6l3o0R3j2L7m1P4n8J04o6j8N1j54J05j6l7PP7P0Lk02J15J37k10qk9P4
3542A12O6o7J77q7j08j2N3l9n8J39K6j16J00K19k29j04J76o0Q7r7j48J44k6J17P7q2K87J42
3213F89N742K269n491k598m69K53k79L9Q4n7j13J81l4m6k7K7o8K13k09l7J37O99O5n93k30
$$ plain form
2920 147 109 50 372 604 187 267 232 248 186 272 833 879 117 282 33 49 213 169 31 115 206 206 170 126 147 177 237 129 329 294
2567 294 74 48 84 226 101 148 131 205 161 152 149 23 149 133 49 101 110 175 33 148 41 32 70 133 157 228 113 134 205 77 225
2204 225 126 152 153 118 65 120 115 117 113 170 20 256 226 63 103 144 133 82 156 242 123 47 116 132 179 245 185 229 159 86 97 168 231 277 211
1793 211 166 114 55 153 58 301 226 73 162 82 51 130 273 182 50 205 406 148 154 150 88 143 218 132 60 272 232 74 54 113 212
1429 212 91 175 145 31 161 187 137 124 84 283 190 99 211 213 200 116 265 153 130 144 196 167 79 138 88 301 288 101 125 224 87
1065 87 67 96 97 54 63 118 243 39 76 152 205 124 153 173 48 191 110 106 110 97 287 331 206 54 110 195 173 97 113 165 81 118 30 83
666 83 89 126 116 148 257 209 230 151 117 114 134 89 62 84 39 25 106 172 402 213 222 88 149 160 165 209 101 71 104 186 134 246 219 73
267 73 74 133 27 187 89 132 133 136 199 105 99 154 103 141 155 104 98 162 232 116 87 202 80 153 238 122 86 146 25 105 71 73 79 186 167
$$ packed form
2920A47l8n9L22K32m17Q0l5J6o2Q6N61M6p62J65k49J6J64m4j38Q4R1%l6m4K1L0O0j08K00l5
2567B94k20k6L6J42j25M7j7P4m4rlj26J26j6q4N2RO5j42J15j07rL8O3K4P1j15K1P1j28J48
2204B25r9K6Jl5n3N5nKmN7j50K36l0j63M0M1j1n1P4Q6j19p6O9J6M7O6o0M4p0p3J1P1O3M6o6
1793B11m5n2n9R8r5K43p5j53Q9q0l1P9J43r1j32J55K01k58Omo2N5P5q6p2K12m0j58k0N9R9
1429B12j21Q4l0j14J30K6n0j3m0J99r3r1J12Kj3q4J49j12k3J4N2k9q8N9n0K13j3j87K4R9j37
1065H7k0K9Jm3RN5J25k04L7P6N3q1K9K0j25J43q1mMj3J90M4j25j52N6Q5k2p6J6N2q4L7q8N3
666H3OL7j0L2J09m8K1p9l4lK0m5k7K2m5j4Q1O6K30j89Rj34O1J1NM4j08l0L3Q2n2J12k7j46
267G3JN9j06J60r8M3JLO3r4oN5n1L8J4n1oO4P0j16k9J15j22P3Q5j16l6O0j21Q0l4KOJ07j9
$$ plain form
-144 167 151 192 76 55
$$ packed form
-144A67j6M1j16k1
-191E5
##PAGE=	F1=-293.808
##FIRST=	25168.397401625570637,	5807.04592319999756,	0.27666988968849182129
##DATA TABLE=	(F2++(Y..Y)), PROFILE
$$ plain form
5807 146 118 73 104 103 140 169 195 168 83 57 67 112 32 244 186 154 88 247 242 175 131 126 102 212 170 91 68 63 70 98 323 176 124 152 124
5396 124 77 114 90 31 107 191 160 83 177 235 218 327 189 137 62 125 256 89 98 78 73 97 105 159 288 161 131 166 135 103 151 281 94
5009 94 178 134 67 165 60 138 116 203 105 50 122 319 213 159 159 217 90 211 132 95 64 182 58 237 195 89 160 183 130 16 20
4645 20 14 57 38 157 175 68 150 101 120 212 158 150 175 104 90 17 161 75 120 66 23 104 77 292 287 87 27 50 69 74 149 390 234 103
4246 103 195 84 93 209 128 214 206 52 210 133 112 128 83 44 35 108 210 127 89 132 80 158 220 133 148 124 49 124 88 114 174 35 64
3859 64 77 79 94 101 142 110 117 118 220 177 122 165 69 51 51 61 86 208 270 222 25 137 278 83 75 62 110 110 140 273 206 89 89 146 72
3448 72 32 155 217 143 172 362 189 66 223 152 230 145 64 107 64 217 267 143 287 335 3292 4324 1493 395 20 283
3143 283 35 74 242 159 68 208 199 207 185 159 94 252 42 12 115 515 423 177 164 82 68 177 229 114 177 237 279 186 143 380
$$ packed form
5807A46k8m5L1jL7K9K6k7q5k6J0M5q0K12n8l2o6J59no7m4nk4J10m2p9k3nPK8K25j47n2K8k8
5396A24m7L7k4n9P6Q4l1p7R4N8j7J09j38n2p5O3J31j67Rk0nK4QN4J29j27l0L5l1l2M8J30j87
5009I4Q4m4o7R8j05P8k2Q7r8n5P2J97j06n4%N8j27J21p9l7l1J18j24J79m2j06P1K3n3j14M
4645B0oM3j9J19J8j07Q2m9J9R2n4qK5p1j4p3J44q6M5n4m3Q1k7K15nk00o0K3J9NP5K41j56j31
4246A03R2j11RJ16q1Q6qj54J58p7k1J6m5l9rP3J02q3l8M3n2P8O2q7J5k4p5P5l6K6O0j39K9
3859F4J3KJ5PM1l2PJJ02m3n5M3r6j8%J0K5J22O2m8j97J12J41j95qj3M8%L0J33o7j17%N7p4
3448G2m0J23O2p4K9J90j73j23J57p1P8q5q1M3m3J53N0j24J44M8K957J032k831j098l75K63
3143B83k48L9J68q3r1J40rQk2k6o5J58k10l0J03M00r2k46j3q2j4J09N2j15O3O0M2r3m3K37
$$ plain form
2791 380 423 29 209 48 81 226 187 30 104 180 216 173 118 98 156 235 99 303 307 61 58 65 205 104 135 95 159 97 122 123 109 110
2415 110 159 23 75 125 159 70 123 64 20 99 148 154 215 75 165 235 102 174 129 152 140 154 101 103 97 108 157 199 66 231 214 75 86
2028 86 158 126 38 158 205 135 66 158 118 176 258 209 225 139 85 116 134 278 282 163 129 68 35 187 69 319 209 112 203 95 81 60
1652 60 217 168 8 242 396 106 206 124 101 90 187 84 122 269 218 59 106 142 217 100 166 132 51 129 176 146 114 62 305 206
1300 206 135 243 214 189 149 315 169 127 126 152 156 74 94 99 262 289 86 106 232 60 71 95 63 106 138 163 241 32 64 153 216 142
924 142 123 175 73 199 82 115 62 89 331 355 193 73 122 253 204 107 67 130 72 125 53 114 115 114 108 137 248 182 248 214 155 135 99
537 99 34 35 80 39 53 87 97 349 211 176 69 161 181 200 200 81 66 94 164 148 270 224 65 91 179 41 242 87 133 112 147 222
161 222 144 150 177 137 154 163 113 105 193 255 109 109 183 63 163 242 120 114 164 16 119 67 77 86 189 161 154 175 65 22
$$ packed form
2791C80M3l94J80j61L3J45l9j57P4P6L6m3n5k0N8P9j36K04Mk46lPJ40j01L1m0O4o2K5Jj4J
2415A10M9j36N2N0L4q9N3n9m4P9M9OO1j40R0P0j33P2m5K3j2J4n3KoJ1M9M2j33J65j7j39J1
2028H6P2l2q8J20M7p0o9R2m0N8Q2m9J6q6n4L1J8J44Mj19l4o1l3J52j18K50j10r7R1j08j4k1
1652F0J57m9j60K34J54k90J00q2k3j1R7j03L8J47n1j59M7L6P5j17O6l4q1P8M7l0l2n2K43r9
1300B06p1J08k9k5m0J66j46m2jK6Mq2K0NJ63K7k03K0J26j72J1K4l2M3L2K5P8k09L2Q9O3p4
924A42j9N2j02J26j17L3n3K7K42K4j62j20M9J31m9r7m0O3n8N3p2O1JjoK9J11o6O6l4n9k0l6
537I9o5JM5m1J4L4J0K52j38l5j07R2K0J9%j19j5K8P0j6J22m6j59K6Q8j38K01j55M6k1L5P5
161B22p8OK7m0J7Rn0qQ8O2j46%P4j20J00P9j22oN0j48J03n2J0RJ03k8pK1j10m3
-191B2
##PAGE=	F1=-396.066
##FIRST=	25168.397401625570637,	5807.04592319999756,	0.13849940896034240723
##DATA TABLE=	(F2++(Y..Y)), PROFILE
$$ plain form
5807 157 134 87 108 110 132 177 196 147 61 71 94 62 63 224 235 211 87 241 280 178 108 110 103 249 229 120 68 49 50 90 311 216 150 187
5408 187 165 39 98 91 32 188 248 222 106 127 249 222 253 170 163 53 92 225 81 89 92 67 154 147 168 282 156 164 153 208 136 133 232 119
5009 119 166 146 101 217 75 115 157 221 86 106 135 318 133 189 105 243 149 237 167 91 56 193 93 222 161 101 162 173 125 60
4657 60 39 39 49 19 148 206 52 126 90 134 216 162 197 168 152 84 34 135 62 150 84 42 105 57 244 275 70 38 71 73 44 142 383
4269 383 247 83 142 44 78 170 156 200 159 30 179 162 144 165 111 52 35 78 184 90 94 120 98 220 227 172 176 65 67 108 76 63 141
3882 141 25 38 78 134 117 97 136 127 64 134 219 195 115 148 115 22 24 54 79 248 285 220 11 111 236 76 73 74 110 109 191 232 196 85
3483 85 120 161 43 35 121 204 180 141 296 184 105 208 123 177 99 131 163 167 152 211 29 94 79 735 797 152 205 125 188 90 146 321
3107 321 75 113 139 186 214 207 131 88 196 13 63 88 215 27 133 192 103 143 167 629 642 83 270 274 186 33 80 98 53 149 72
$$ packed form
5807A57k3m7K1KK2M5J9m9q6J0K3l2JJ61J1k4j24J54L9j02p0KpJ46k0j09n2j9JM0K21r5o6L7
5408A87k2j26N9pn9J56O0k6j16K1J22k7L1q3pj10L9J33j44QLk5Q7pK1J14j26Qj1N5p2lR9j13
5009A19M7k0m5J16j42M0M2O4j35K0K9J83j85N6q4J38r4Q8p0p6l5J37j00J29o1o0O1J1m8o5
4657F0k1%J0l0J29N8j54P4l6M4Q2n4L5k9j6o8n0J01p3Q8o6m2O3m8J87L1k05l2L3Kk9R8K41
4269C83j36j64N9r8L4R2j4M4m1j29J49j7j8K1n4n9j7M3J06r4MK6k2J22Pn5Mj11KM1l2j3P8
3882A41j16J3M0N6j7k0L9ro3P0Q5k4q0L3l3r3KL0K5J69L7o5k09J00J25j60lJL6jQ2M1l6j11
3483H5L5M1j18qQ6Q3k4l9J55j12p9J03q5N4p8L2L2Mj5N9j82O5j5O56O2o45N3q0O3r8N6J75
3107C21k46L8K6M7K8pp6m3J08j83N0K5J27j88J06N9q9M0K4M62J3n59J87Mq8j53M7J8m5R6p7
$$ plain form
2744 72 146 230 190 42 99 164 213 175 91 35 116 206 78 256 279 45 69 58 203 120 111 57 100 30 89 85 170 94 183 20 45 133 167
2356 167 116 120 77 50 104 151 125 196 65 187 252 179 98 121 151 125 182 184 95 141 91 204 202 102 200 199 75 92 175 117 26 169 184 143
1957 143 81 208 120 147 235 211 209 120 88 138 118 321 278 120 84 42 85 206 76 324 196 127 221 121 124 44 160 148 27 275
1605 275 363 64 223 104 116 41 163 21 186 243 200 33 141 157 180 107 154 119 57 102 160 137 106 25 300 190 153 264 199
1265 199 167 166 344 190 108 99 121 149 61 49 110 206 280 62 72 230 77 85 100 75 136 213 198 222 16 60 135 227 159 79 177 118 198
877 198 64 136 29 86 355 357 169 95 132 279 187 113 30 91 53 119 69 128 110 85 96 103 216 152 231 256 188 146 69 52 5 87 22
490 22 78 78 17 280 193 133 64 166 203 214 174 45 58 97 141 158 270 209 63 115 213 49 286 98 148 94 149 241 165 176 173 180 161
103 161 158 121 138 222 260 116 126 153 44 177 221 131 143 170 28 129 68 76 80 168 146 165 152 52 36
$$ packed form
2744G2P4Q4m0j48N7O5M9l8q4n6Q1R0j28J78K3k34K4j1J45q3rn4M3p0N9mQ5p6Q9j63K5Q8L4
2356A67n1Mm3k7N4M7k6P1j31J22O5p3q1K3L0k6N7Kq9M6n0J13kj00R8jj24J7Q3n8r1J43J5m1
1957A43o2J27q8K7Q8k4kq9l2N0k0K03m3j58l6m2M3J21j30K48j28o9R4j00Lq0J16j2j21K48
1605B75Q8k99J59j19J2p5J22j42J65N7m3j67J08J6K3p3M7l5o2M5N8k3l1q1K75j10l7J11o5
1265A99l2jJ78j54q2rK2K8q8j2O1R6P4k18J0J58j53QJ5k5O1P7j5K4k06M4P5R2o8q0R8n9Q0
877A98j34P2j07N7K69Kj88p4L7J47r2p4q3O1l8O6n0N9j8k5J1PJ13o4P9K5o8m2p7j7m7Q2o5
490B2N6%o1K63q7o0o9J02L7J1m0j29J3L9M4J7J12o1j46N2R8j64K37j88N0n4N5R2p6J1lPj9
103A61ll7J7Q4L8j44J0K7j09J33M4r0J2K7j42J01o1QMQ8k2J9j3j00j6
-191C6
##PAGE=	F1=-498.324
##FIRST=	25168.397401625570637,	5807.04592319999756,	0.37720623612403869629
##DATA TABLE=	(F2++(Y..Y)), PROFILE
$$ plain form
5807 161 135 96 103 114 118 180 183 117 57 86 110 31 99 173 253 238 87 239 304 160 92 101 81 268 271 138 59 122 87 65 265 224 172 196
5408 196 189 63 79 77 48 260 291 259 145 114 229 202 155 125 156 76 64 190 85 82 102 68 192 168 160 246 156 188 171 262 153 122 181
5021 181 127 137 157 125 250 90 87 169 200 78 136 137 288 51 190 34 262 196 226 199 90 65 202 112 205 131 101 165 168 149 93
4657 93 55 77 70 48 115 224 87 105 75 134 208 146 217 144 191 119 62 106 27 157 109 71 88 56 169 245 63 64 93 87 57 142 365 251
4258 251 49 73 27 42 122 201 182 105 11 131 199 192 203 140 71 28 45 138 68 112 107 108 251 218 223 188 39 87 66 76 17 128 49 49 70
3847 70 169 153 84 119 141 89 158 209 202 110 131 154 65 50 60 63 271 278 216 11 80 170 67 57 74 108 178 243 180 175 90 155 171 36 38 79
3424 79 169 194 97 217 163 159 196 131 118 46 182 354 441 95 181 69 118 196 1423 2085 896 59 196 142 129 364 599 167
3096 167 148 56 183 201 202 94 79 143 22 146 129 62 192 187 225 116 231 364 1553 1388 485 342 238 185 76 129 128 103 113
$$ packed form
5807A61k6l9PJ1MO2Lo6o0K9K4p9O8P4Q0j5j51J52O5j44o8Rk0J87Lj33p9O3l5k2K00m1n2K4
5408A96pj26J6kk9K12L1l2j14l1J15k7m7l0L1q0j2J26j05lK0l4J24k4qQ6r0L2j7R1j09l1N9
5021A81n4J0K0l2J25j60lQ2L1j22N8JJ51k37J39j56K28o6L0k7j09k5J37r0R3p4l0O4Lj9n6
4657I3l8K2pk2O7J09j37J8l0N9P4o2P1p3M7p2n7M4p9J30m8l8J7l2J13P6j82JK9ol0Q5K23j14
4258B51k02K4m6J5Q0P9j9p7r4J20O8pJ1o3o9m3J7R3p0M4nJJ43l3Nl5j49M8k1J0n9J11p9%K1
3847G0R9j6o9L5K2n2O9N1pr2K1K3q9j5J0LK08Po2k05O9R0j03j0J7L4P0O5o3nq5O5J6j35KM1
3424G9R0K5r7J20n4mL7o5j3p2J36J72Q7l46Q6j12M9P8J227O62j189q37J37n4j3K35K35m32
3096A67j9r2J27J8Jj08j5O4j21J24j7o7J30nL8j09J15J33J189j65r03j43j04n3j09N3jk5J0
$$ plain form
2755 113 104 210 222 175 55 121 180 201 177 51 82 81 162 75 188 216 29 70 81 210 138 80 31 43 45 60 57 199 83 200 46 38
2380 38 131 183 145 126 78 75 80 142 80 181 78 194 257 271 41 102 147 113 201 258 96 218 55 229 181 120 174 183 64 112 187 101
2004 101 65 185 187 152 86 241 130 101 181 187 183 112 75 138 131 351 266 84 50 99 143 209 82 315 187 116 216 145 169 88 119 130
1628 130 47 288 317 18 195 74 132 31 163 55 239 214 180 19 152 144 105 126 144 114 46 85 132 117 108 44 266 146 152 267
1276 267 168 145 157 343 208 69 59 97 136 41 25 115 145 255 66 31 212 107 112 101 119 138 247 204 186 12 65 118 235 172
924 172 39 179 169 190 58 148 27 75 352 332 146 120 139 266 136 114 39 59 34 92 68 120 72 41 90 62 175 141 184 269 216
560 216 149 52 91 48 107 16 89 82 64 193 157 116 72 167 223 210 131 11 49 112 124 161 245 185 71 128 233 51 308 114 165 81
185 81 138 251 168 178 142 214 172 143 125 173 235 245 129 128 119 52 199 185 154 165 162 32 128 59 66 62 131 125 177 130 44 65
$$ packed form
2755A13rJ06J2m7j20O6N9K1k4j26L1jQ1q7J13K8j87M1J1J29p2n8m9J2KJ5lJ42j16J17j54q
2380C8R3N2l8j9m8lNO2o2J01j03J16O3J4k30O1M5l4Q8N7j62J22j63J74m8o1N4Rj19M8P5q6
2004A01l6J20Kl5o6J55j11k9Q0Omp1l7O3pK20q5j82l4M9M4O6j27K33j28p1J00p1K4q1L1J1
1628A30q3K41K9k99J77j21N8j01J32j08J84k5l4j61J33ql9K1J8l0o8L9M7j5ro4K22j20OJ15
1276B67r9k3J2J86j35j39j0L8L9r5j6R0L0J10j89l5J81j05Nj1J8J9J09m3j8j74N3N3J17o3
924A72j33J40j0K1j32R0j21M8K77k0j86k6J9J27j30k2p5K0k5N8k4N2m8l1M9k8J13l4M3Q5n3
560B16o7r7L9m3N9r1P3pj8J29l6m1m4R5N6j3p9j20L8O3J2L7Q4o0j14N7J05j82K57j94N1q4
185H1N7J13q3J0l6P2m2k9j8M8O2J0j16jro7J47j4l1J1lj30R6o9PmO9oN2m7q6K1
-191F5
##PAGE=	F1=-600.582
##FIRST=	25168.397401625570637,	5807.04592319999756,	0.51410913467407226563
##DATA TABLE=	(F2++(Y..Y)), PROFILE
$$ plain form
5807 157 125 101 94 114 102 174 155 89 56 101 117 36 130 104 243 233 90 249 312 135 75 101 54 257 278 137 46 206 149 28 201
5443 201 200 160 173 186 93 59 53 51 299 303 262 181 155 185 174 66 70 117 106 55 163 97 80 105 76 206 166 137 182 169 188 180 285 152 119
5032 119 141 116 98 169 123 254 102 63 155 150 89 135 129 238 24 166 45 278 233 182 212 82 84 200 110 185 112 88 173 171 185 107
4657 107 70 112 124 91 67 219 117 90 79 118 188 116 212 106 207 163 94 79 36 137 122 86 67 93 96 205 69 94 126 113 98 150
4281 150 345 243 27 63 63 9 113 248 165 80 66 82 241 243 229 149 93 17 43 81 81 137 103 115 252 198 270 188 89 96 14 79 21
3894 21 129 84 71 50 179 174 62 103 146 156 182 189 200 114 113 183 74 64 76 41 272 256 199 32 69 117 84 33 66 100 236 277 147
3506 147 150 110 186 175 60 35 42 124 186 49 134 151 214 172 177 57 22 217 574 784 198 170 130 163 335 2642 3698 1460 106
3166 106 225 156 136 614 1014 380 167 47 192 184 178 76 64 92 36 221 165 47 236 198 253 107 318 612 2618 2256 969
$$ packed form
5807A57l2k4pK0j2P2j9o6l3M5J6q1R4k6J39j0j43J59O3j77o0K6m7K03K1j41r1J60n7j21J73
5443B01jm0J3J3r3l4okK48Mm1q1k6L0j1j08MM7j1n1J08o6j7K5k9J30m0k9M5j3J9qJ05j33l3
5032A19K2k5j8P1m6J31j52l9R2no1M6oJ09k14J42j21K33m5n1L0j30KJ16r0P5p3k4Q5kJ4p8
4657A07l7M2J2l3k4J52j02k7j1L9P0p2R6j06J01m4o9j5m3J01j5l6j9K6LJ09j36K5L2j3j5N2
4281A50J95j02k16L6%n4J04J35q3q5j4J6J59Kj4q0n6p6K6L8%N6l4J2J37n4P2q2r9Pq2O5n8
3894B1J08m5j3k1J29nj12M1M3J0K6PJ1q6jP0j09j0J2l5K31j6n7j67L7M8l3n1L3L4J36M1j30
3506A47Lm0P6j1j15k5PQ2O2j37Q5J7O3m2Nj20l5J95L57K10n86k8m0L3J72K307J056k238j354
3166A06J19o9k0M78M00o34k13j20J45qoj02j2K8n6J85n6j18J89l8N5j46K11K94K006l62j287
$$ plain form
2849 969 448 207 177 148 138 190 128 99 137 265 202 144 66 164 216 192 182 11 166 98 125 83 104 132 36 61 117 215 152 58 47 43 100
2462 100 42 77 200 60 207 71 67 118 192 156 124 72 92 30 125 48 181 87 185 251 349 137 72 138 110 211 302 101 295 35
2110 35 224 148 118 166 168 51 136 186 77 91 198 203 163 75 241 131 54 111 146 155 122 46 116 158 362 248 54 69 172 193 202 90
1734 90 294 181 94 196 161 204 117 103 127 54 277 274 37 134 33 141 69 183 119 276 200 155 47 140 117 34 165 144 115 22
1382 22 76 99 106 122 114 209 82 136 246 125 132 127 311 214 12 46 72 105 24 38 107 104 215 112 50 179 124 140 90 153 115 236 177
995 177 144 33 78 125 232 180 57 176 212 178 63 148 43 48 318 281 146 149 146 219 101 119 58 36 25 45 57 95 8 13 100 59 137
607 137 156 116 254 239 152 50 112 84 141 75 86 88 142 98 111 136 92 177 234 194 81 46 39 135 119 156 200 168 86 128 245 55 304
220 304 130 172 68 116 247 155 171 93 226 188 124 124 193 222 217 138 117 97 85 226 147 181 178 140 32 109 46 54 41 90 100 179 106 52
$$ packed form
2849I69n21k41l0k9j0N2o2k9L8J28o3n8p8R8N2k4j0j71J55o8K7m2K1K8r6K5N6R8o3r4j1mN7
2462A00n8L5J23j40J47j36mN1P4l6l2n2K0o2R5p7J33r4R8O6R8k12o5O6k8J01R1k01J94k60
2110C5J89p6l0M8Kj17Q5N0j09J4J07Nm0q8J66j10p7N7L5Rl3p6P0M2K04j14j94J5J03K1Rj12
1734I0K04j13q7J02l5M3q7j4K4p3K23lk37R7j01J08p2J14o4J57p6m5j08R3k3q3J31k1k9r3
1382B2N4K3PJ6qR5j27N4J10j21PnJ84r7k02L4K6L3q1J4O9lJ11j03o2J29n5J6n0O3l8J21n9
995A77l3j11M5M7J07n2j23J19L6l4j15Q5j05NK70l7j35LlP3j18J8o1k2j1K0J2L8q7NQ7m1P8
607A37J9m0J38j5q7j02O2k8N7o6J1KN4m4J3K5m4Q5N7m0j13l5pR6j6L7M4l2q2M2J17j90K49
220C04j74M2j04M8J31r2J6p8J33l8o4%O9K9np9k1k0j2J41p9L4ll8j08P7o3Qj3M9J0P9p3n4
$$ plain form
-179 52 86
$$ packed form
-179E2L4
-191H6
##PAGE=	F1=-702.84
##FIRST=	25168.397401625570637,	5807.04592319999756,	0.40865692496299743652
##DATA TABLE=	(F2++(Y..Y)), PROFILE
$$ plain form
5807 148 115 104 89 112 87 157 117 76 46 128 118 53 149 34 213 200 96 259 308 113 51 109 90 213 243 122 34 279 207 25
5455 25 142 150 114 125 160 120 42 28 40 301 278 233 206 207 130 153 68 37 64 123 74 151 118 87 100 86 196 146 115 118 190 164 163 274 130
5044 130 118 119 93 62 182 91 227 108 47 128 86 109 107 115 184 69 124 118 289 254 117 198 63 104 184 96 167 111 66 186 181 214 99
4657 99 83 145 194 139 41 192 125 84 110 87 156 80 188 71 202 197 125 64 100 102 117 80 78 144 74 168 75 120 175 149 139 161 329 224
4258 224 62 142 111 50 172 281 149 100 121 59 279 289 238 138 118 44 78 24 104 158 113 120 230 183 302 184 136 93 91 105 51
3894 51 134 113 95 42 161 171 34 107 140 210 199 162 191 126 89 201 52 74 96 17 249 228 161 49 92 141 123 43 56 85 255 279
3518 279 148 131 140 216 176 77 25 40 82 159 34 67 181 266 138 230 29 62 242 764 1128 370 169 153 149 436 3380 4604
3190 4604 1741 218 225 191 124 845 1443 586 176 115 209 181 147 104 62 52 66 276 181 15 186 159 264 81 394 876 3626
$$ packed form
5807A48l3j1j5K3k5P0m0m1l0Q2j0o5R6j15J79j3j04J63M9j95o2N8j9J23L0j21q8K45p2j82
5455B5J17Ql6J1L5m0p8j4J2K61k3m5k7Jp7K3q5l1K7N9m9P7l3l1J3j4J10n0l1LP2k6jJ11j44
5044A30j2Jk6l1J20r1J36j19o1Q1m2K3kQO9j15N5oJ71l5j37Q1j35M1Q0q8P1n6m5J20nL3j15
4657I9j6O2M9n5r8J51o7m1K6k3O9p6J08j17J31np2o1L6KJ5l7kO6p0R4r3M5N5k6j0K2J68j05
4258B24j62Q0l1o1J22J09j32m9K1o2K20J0n1j00k0p4L4n4Q0N4m5PJ10m7J19j18m8m3kJ4n4
3894E1Q3k1j8n3J19J0j37P3L3P0j1l7K9o5l7J12j49K2K2p9K32k1o7j12M3M9j8q0J3K9J70K4
3518B79j31j7RP6m0r9n2J5M2P7j25L3J14Q5j28R2k01L3J80N22L64p58k01j6mK87K944J224
3190D604k863j523Pl4o7P21N98q57m10o1R4k8l4m3m2j0J4K10r5j66J71k7J05j83L13M82K750
$$ plain form
2873 3626 3082 1432 565 227 159 201 64 193 134 90 159 304 172 106 74 206 247 194 191 19 236 148 108 88 20 48 72 57 152
2532 152 215 158 64 73 80 144 42 110 185 29 203 92 103 93 189 151 111 65 108 42 105 63 189 89 164 229 394 257 53 125 119 213
2157 213 309 111 354 84 194 121 97 178 153 50 153 171 46 94 201 214 174 50 205 115 47 41 96 135 148 21 93 178 347
1816 347 222 42 113 234 225 189 108 265 179 94 171 172 221 119 101 141 66 248 247 82 95 35 141 116 205 164 296 207 122 74 115 120
1441 120 117 218 149 111 17 68 80 124 139 191 141 12 109 204 81 127 84 256 202 61 117 39 54 31 49 86 103 162 162 112 137 123 153
1053 153 64 165 76 194 140 118 55 91 145 214 182 109 167 242 168 74 137 58 9 258 212 176 178 153 148 150 132 58 36 19 26 57 59 69 69 124
631 124 97 103 187 44 218 253 159 55 111 100 184 149 73 90 211 87 80 171 121 198 233 175 36 73 33 159 127 143 142 169 106 122 253
243 253 63 274 139 167 49 86 229 127 169 49 208 197 103 115 191 185 180 134 114 100 115 243 115 206 182 110 35 75 63 52 43 67
$$ packed form
2873C626n44j650q67l38o8M2j37J29n9m4O9J45j32o6l2J32M1n3lj72K17q8m0k0o8K8K4j5R5
2532A52O3n7r4RPO4j02O8P5j56J74j11J1j0R6l8m0m6M3o6O3m2J26j00P5O5J65j37k04P2oR4
2157B13R6j98K43k70J10p3k4Q1k5j03J03J8j25M8J07J3m0j24J55r0o8oN5L9J3j27P2Q5J69
1816C47j25j80P1J21rl6q1J57q6q5P7JM9j02j8M0p5J82jj65J3o0J06k5Q9m1J32q9q5m8M1N
1441A20lJ01o9l8r4N1J2M4J5N2n0j29R7R5j23M6m3J72n4j41N6p8J5k3J8L7J7N9%n0K5j4L0
1053A53q9J01q9J18n4k2o3L6N4O9l2p3N8P5p4r4O3p9m9K49m6l6Kk5nKj8p4k2j7PL1KJ0%N5
631A24k7OQ4j43J74L5r4j04N6j1Q4l5p6J7J21j24pR1n0P7L5n8j39L7m0J26l2J6jK7o3J6J31
243B53j90K11j35K8j18L7J43j02M2j20J59j1r4J2P6onm6k0j4J5J28j28R1k4p2p5M0j2j1rK4
$$ plain form
-132 67 81 164 81 72 98
$$ packed form
-132F7J4Q3q3rK6
-191I8
##PAGE=	F1=-805.097
##FIRST=	25168.397401625570637,	5807.04592319999756,	0.43279239535331726074
##DATA TABLE=	(F2++(Y..Y)), PROFILE
$$ plain form
5807 137 119 105 92 116 79 130 84 80 25 159 111 68 150 42 175 151 107 256 301 94 38 124 169 142 174 110 26 328 252 72 111 85
5431 85 49 66 134 154 37 22 24 273 221 187 214 238 81 142 106 53 40 121 116 151 146 102 88 95 170 121 126 116 202 126 128 236 92 109 118 78
5009 78 53 197 46 171 107 41 108 33 132 65 99 142 92 84 177 299 257 50 156 48 116 154 84 159 132 65 197 194 226 73 91 174
4633 174 266 189 70 150 113 90 142 50 115 47 157 64 185 217 153 64 164 100 92 54 119 192 107 143 73 142 229 184 169 175 325 196 98
4246 98 217 159 77 249 294 137 121 162 73 308 320 233 119 150 94 118 31 113 166 137 124 197 178 310 186 161 82 180 154 77 136 125
3870 125 128 92 120 147 17 140 123 242 205 129 176 144 58 209 35 90 113 5 208 200 107 58 127 211 167 87 50 69 228 245 154 119
3495 119 168 246 183 67 26 66 50 117 76 68 244 318 110 272 74 90 262 875 1391 524 161 143 130 508 3781 5034 1844
3178 1844 312 209 221 107 1008 1766 732 185 156 226 197 119 148 84 45 96 305 175 39 165 95 249 54 446 1109 4363
$$ packed form
5807A37j8j4j3K4l7N1m6mn5J34m8m3Q2j08J33k4m4J49M5k07n6Q6M5k7L2o4q4L02p6j80L9k6
5431H5l6J7O8K0j17j5KK49n2l4K7K4j57O1l6n3j3Q1nL5nm4j4PP5m9Nj0Q6p6KJ08j44J7Rm0
5009G8k5J44j51J25o4o6O7p5R9o7L4M3n0qR3J22m2k07J06j08O8L8p0P5k7o7J32lL2j53J8Q3
4633A74R2p7j19Q0l7k3N2r2O5o8J10r3J21L2o4q9J00o4ql8O5P3q5L6p0O9Q7m5j5OJ50j29r8
4246I8J19n8q2J72M5j57j6M1q9K35J2q7j14L1n6K4q7Q2N3k9j3P3j9J32j24k5p9R8k6p7N9j1
3870A25Ll6K8K7j30J23j7J19l7p6M7l2q6J51j74N5K3j08K03qr3m9O9Q4m4q0l7J9J59J7r1l5
3495A19M9P8o3j16m1M0j6O7m1qJ76P4k08J62j98J6J72O13N16q67l63j8j3L78L273J253l190
3178A844j532j03J2j14R01P58j034n47k9P0k9p8K9o4l9N1K09j30j36J26p0J54j95L92O63L254
$$ plain form
2873 4363 3687 1766 662 283 131 232 28 199 133 78 164 319 144 77 79 230 256 203 202 33 281 187 106 87 77 39 114 75
2544 75 176 210 153 82 89 106 180 50 126 173 50 187 116 134 57 172 137 91 64 124 121 84 98 190 88 140 191 397 368 89 120 136
2168 136 210 281 124 383 134 155 113 66 207 139 63 156 141 25 80 192 212 175 31 145 84 79 21 49 130 178 42 104 180 308
1816 308 187 59 146 275 238 175 140 230 183 127 152 179 214 100 104 173 97 213 235 112 148 84 131 166 218 184 298 229 87 88 92 166
1441 166 203 271 157 98 44 59 84 155 153 261 92 55 85 149 45 117 44 195 173 141 211 11 14 46 49 55 112 101 194 172 98 105 144 26
1042 26 152 38 151 129 123 72 96 157 182 176 162 149 255 166 82 116 69 33 184 138 213 205 158 70 230 142 37 77 27 71 82 18 145
654 145 120 147 130 80 224 50 170 256 168 59 93 89 225 226 59 87 266 186 98 200 148 224 217 156 40 81 41 180 140 123 83 184
279 184 125 120 261 71 225 136 150 27 56 197 93 179 58 163 184 78 95 172 133 140 113 130 118 129 237 95 226 176 79 41
$$ packed form
2873D363o76j921j104l79j52J01k04J71o6n5Q6J55j75o7KJ51K6n3jj69K48r4q1j9j0l8P5l9
2544G5J01L4n7p1PJ7P4j30P6M7j23J37p1J8p7J15l5m6k7O0ll7J4R2j02N2N1K06k9k79L1J6
2168A36P4P1j57K59k49K1m2m7J41o8p6R3j5j16N5J12K0l7j44J14o1nn8K8Q1M8j36O2P6J28
1816C08j21j28Q7J29l7o3l5R0m7n6K5K7L5j14MO9p6J16K2j23L6o4M7L5N2l4J14o9j42JMP4
1441A66L7O8j14n9n4J5K5P1kJ08j69l7L0O4j04P2p3J51k2l2P0k00LL2LON7j1R3k2p4PL9j18
1042B6J26j14J13k2on1K4O1K5oj4j3J06q9q4L4m7l6J51m6P5qm7q8J60q8j05M0n0M4J1o4J27
654A45k5K7j7n0J44j74J20Q6q8j09L4mJ36Jj67K8J79q0q8J02n2P6po1j16M1m0J39m0j7m0J01
279A84n9nJ41j90J54q9J4j23K9J41j04Q6j21J05K1j06J7P7l9Pk7J7j2J1J08j42J31n0r7l8
$$ plain form
-73 41 47 103 63 64 76 83 129 62 97 99
$$ packed form
-73D1ON6m0JJ2PM6o7L5K
-191I9
##PAGE=	F1=-907.355
##FIRST=	25168.397401625570637,	5807.04592319999756,	0.63364070653915405273
##DATA TABLE=	(F2++(Y..Y)), PROFILE
$$ plain form
5807 124 138 105 99 128 81 96 69 85 8 185 92 82 131 84 141 98 121 232 303 80 81 140 250 78 96 119 30 346 283 112 110 15 49
5420 49 34 149 195 54 28 21 231 149 146 206 233 47 131 109 60 67 105 170 155 173 123 72 101 140 113 175 171 194 98 90 182 54 102 132 85
5009 85 77 210 86 96 98 44 102 46 163 21 78 109 99 73 214 307 239 37 96 90 116 113 83 160 168 96 198 206 223 34 92 197 328
4622 328 232 94 117 105 100 157 24 69 21 129 78 166 220 175 68 213 151 52 28 160 225 143 140 65 160 271 207 184 186 328 169 116
4246 116 265 199 88 311 288 129 118 178 88 322 332 220 112 189 149 153 62 105 160 164 128 166 169 292 193 164 72 252 202 100 138
3882 138 115 166 162 66 115 54 188 98 256 195 95 161 163 30 206 72 109 122 18 161 177 54 59 159 277 205 137 56 60 164 180
3518 180 133 112 184 273 202 30 50 86 34 64 125 112 306 366 113 294 119 97 279 874 1506 618 138 112 160 548 3883 5066
3190 5066 1809 371 185 240 93 1064 1894 782 197 161 234 226 103 179 112 52 113 310 152 70 222 72 208 36 459
$$ packed form
5807A24J4l3oK9m7J5k7J6p7J77r3j0M9m7N7m3K3J11P1k23JN9J10j72J8K3q9L16o3j71kr5L4
5420D9j5J15M6j41k6pK10q2lO0K7j86Q4k2m9PL8O5j5J8n0n1K9L9k7O2mK3r6qR2j28M8L0m7
5009H5qJ33j24J0Kn4N8n6J17j42N7L1j0k6J41R3o8k02N9oK6ll0P7Qp2J02QJ7j89N8J05J31
4622C28r6j38K3j2nN7j33M5m8J08n1Q8N4m5j07J45o2r9k4J32O5q2lp5R5J11o4k3KJ42j59n3
4246A16J49o6j11K23k3j59j1O0r0K34J0j12j08P7m0Mr1M3N5Ml6L8LJ23r9k9r2J80n0j02L8
3882A38k3N1mr6M9o1J34r0J58o1j00O6Kj33J76j34L7J3j04J43J6j23NJ00J18p2o8q1MJ04J6
3518A80m7k1P2Q9p1j72K0L6n2L0O1j3J94O0k53J81j75k2J82N95O32q88m80k6M8L88L335J183
3190E066l257j438j86N5j47R71Q30j112n85l6P3qj23P6o7o0O1J97j58q2J52j50J36j72M23
$$ plain form
2896 459 1257 4656 3926 1893 711 321 99 237 80 218 139 61 149 307 135 88 77 225 235 208 214 31 298 205 110 81
2591 81 145 88 147 99 187 203 136 91 92 124 214 52 121 173 110 157 144 156 19 144 118 71 77 140 195 67 134 169 92 120 139 364 454 152
2192 152 132 157 203 227 134 376 168 126 117 46 241 127 83 147 103 50 65 175 196 163 63 100 50 107 51 8 135 203 58 140 165
1828 165 251 146 75 159 291 233 162 183 193 197 164 145 179 189 69 119 218 132 183 220 122 221 122 113 215 219 183 285 255 79 86 83 213 254
1429 254 317 162 83 64 47 91 176 158 312 108 111 87 94 27 92 20 144 135 220 304 54 83 57 40 49 101 35 200 218 71 79 113 21 119
1030 119 46 132 147 137 81 86 152 145 166 208 126 256 174 84 86 77 67 107 77 233 221 157 65 294 137 40 139 65 98 112 23 204 156 160 146
619 146 113 262 105 119 244 171 60 65 58 253 290 55 81 302 280 130 212 163 246 191 133 72 80 67 195 146 99 37 202 137 134 271
243 271 75 165 116 119 13 33 155 70 196 88 101 144 49 65 144 86 100 74 154 128 121 201 99 239 160 53 49 56 139 72 84 107 105 78
$$ packed form
2896D59P98L399p30k033j182l90k22J38j57J38p9p8Q8J58j72m7j1J48J0k7Oj83K67r3r5k9
2591H1O4n7N9m8Q8J6o7m5JL2R0j62O9N2o3M7j3J2j37J25k6m7OO3N5j28O7L5p7K8J9K25R0l02
2192A52k0K5M6K4r3K42k08m2rp1J95j14m4O4m4n3J5J10K1l3j00L7n0N7n6m3J27O8j45Q2K5
1828A65Q6j05p1Q4J32n8p1K1J0Ml3j9L4J0j20N0R9q6N1L7r8R9r9rJ02Ml6J02l0j76PlJ30M1
1429B54O3j55p9j9j7M4Q5j8J54k04Lk4Po7O5p2J24rQ5Q4k50K9k6j7RN2o6J65J8j47QL4r2R8
1030A19p3Q6J5j0n6NO6pK1M2q2J30q2r0Krj0M0l0J56j2o4r2K29j57r7R9p4L3J4q9J81m8Mj4
619A46l3J49j57J4J25p3j11NpJ95L7k35K6K21k2j50Q2m9Q3n5n8o1Qj3J28m9m7o2J65o5lJ37
243B71j96R0m9Lj06K0J22q5J26j08J3M3r5J6P9n8J4k6Q0k6pQ0j02J40p9j07mPQ3o7J2K3kk7
$$ plain form
-156 78 67 120 91
$$ packed form
-156G8j1N3k9
-191I1
##PAGE=	F1=-1009.61
##FIRST=	25168.397401625570637,	5807.04592319999756,	0
##DATA TABLE=	(F2++(Y..Y)), PROFILE
$$ plain form
5807 104 157 103 104 143 85 76 68 83 35 196 60 99 100 107 119 53 132 193 317 96 145 152 316 105 79 140 47 334 301 138 111 53 112 61
5408 61 203 233 77 22 38 193 85 126 183 189 40 111 77 40 78 96 226 157 193 146 53 106 117 134 233 219 163 106 73 127 59 111 152
5021 152 100 106 214 168 35 84 58 97 75 201 22 52 68 104 81 221 307 205 78 56 160 108 71 86 168 203 132 183 214 214 33
4657 33 86 210 369 261 93 116 129 106 147 38 20 23 107 84 139 207 190 64 238 212 3 59 182 236 177 159 61 174 284 210
4305 210 180 193 329 150 113 279 227 102 344 270 126 91 166 90 323 323 208 120 230 195 176 74 85 143 183 131 148 144 249 199
3953 199 152 68 290 231 120 145 88 203 229 65 92 98 237 72 265 169 67 152 180 59 195 113 120 122 19 133 160 45 59 186
3600 186 320 237 179 75 62 78 97 86 103 182 284 229 55 78 90 35 29 171 142 345 403 143 299 157 83 295 756 1439 629
3260 629 99 78 200 552 3659 4686 1635 383 158 243 85 999 1791 724 214 130 228 254 108 187 129 41 111 300 118
$$ packed form
5807A04N3n4JL9n8rqJ5m8J61j36L9JPJ2o6P9O1J24k21M9PJ64k11k6O1r3K87l3j63k7n8N9n1
5408F1J42L0j56n5J6J55j08M1N7Oj49P1l4l7L8J8J30o9L6m7r3N3J1J7R9j4n6n7l3N4o8N2M1
5021A52n2OJ08m6j33M9k6L9k2J26j79L0J6L6k3J40Q6j02j27k2J04n2l7J5Q2L5p1N1L1%j81
4657C3N3J24J59j08j68K3J3k3M1j09j8LQ4k3N5O8j7j26J74k6k09N6J23N4n9j8r8J13J10p4
4305B10l0J3J36j79l7J66n2j25K42p4j44l5P5p6K33%j15q8J10l5j9j02J1N8M0n2J7mJ05n0
3953A99m7q4K22n9j11K5n7J15K6j64K7OJ39j65J93r6j02Q5K8j21J36q2PKj03J14K7j15J4J27
3600A86J34q3n8j04j3J6J9j1J7P9J02n5j74K3J2n5oJ42k9K03N8k60J56j42p4K12M61O83q10
3260F29n30k1J22L52L107J027l051j252k25Q5j58R14P92j067n10q4R8K6j46P9n8q8P0J89j82
$$ plain form
2967 118 66 274 122 148 24 421 1284 4432 3739 1784 696 312 70 220 76 232 153 42 115 267 152 127 64 184
2685 184 184 199 222 22 287 199 121 72 190 117 159 113 184 195 108 89 87 148 245 45 107 185 174 111 177 164 46 105 98 60 102 147 253
2298 253 58 171 123 109 105 89 311 504 211 152 175 191 160 128 330 189 118 115 63 268 114 105 134 66 90 75 160 173 136 105 118 36
1922 36 125 59 27 140 220 49 169 140 188 104 72 148 286 220 149 225 159 214 185 147 168 154 39 148 267 155 162 190 113 269 137
1558 137 100 258 213 166 259 273 108 69 84 234 262 347 163 82 76 37 85 177 150 333 151 151 115 53 21 51 22 117 98 285 378 99
1182 99 142 65 31 98 69 30 181 241 57 56 70 58 87 77 127 155 133 82 64 141 114 163 248 118 256 195 86 47 81 89 36 43 222 223
783 223 150 135 329 119 100 201 114 97 133 60 231 168 159 147 197 295 140 70 216 164 56 41 54 257 326 58 76 317 341 142
431 142 198 158 257 166 104 96 102 104 203 142 79 41 213 139 170 284 77 102 84 78 11 18 112 78 208 99 43 84 43 37 119 67 60 29 169 122
$$ packed form
2967A18n2K08j52K6j24L97Q63L148o93j955j088l84k42J50j44J56p9j11P3J52j15k5o3J20
2685A84%J5K3k00K65q8p8m9J18p3M2m6P1J1q7j9kO1R7k00O2P8j1o3O6j3j18N9pl8M2M5J06
2298B53j95J13m8j4mj6K22J93k93n9K3J6l1l2K02j41p1ln2K05j54rK9o8K4j5Q5J3l7l1J3q2
1922C6Q9o6l2J13Q0j71J20k9M8q4l2P6J38o6p1P6o6N5k9l8K1j4j15J09J19j12PK8p7J56j32
1558A37l7J58m5m7R3J4j65l9J5J50K8Q5j84q1ol9M8R2k7J83j82%l6o2l2L0k9R5j9J87R3k79
1182I9M3p7l4O7k9l9J51O0j84jJ4j2K9j0N0K8k2n1j8P7k7M9Q5j30J38o1j09l9L4Qn3PJ79J
783B23p3j5J94k10j9J01q7j7L6p3J71o3rj2N0R8j55p0J46n2j08j5J3K03O9k68J8K41K4j99
431A42N6m0R9r1o2qOKR9o1o3l8J72p4L1J14k07K5j8oo7PR4l4J30j09n6M1m1oQ2n2pl1J40m7
$$ plain form
9 122 96 134 136 246 133 35 54 75 157 70 100 147 129 39 94 135 74
$$ packed form
9A22k6L8KJ10j13r8J9K1Q2q7L0M7j8r0N5M1o1
-191G4
##PAGE=	F1=-1111.87
##FIRST=	25168.397401625570637,	5807.04592319999756,	0
##DATA TABLE=	(F2++(Y..Y)), PROFILE
$$ plain form
5807 72 162 98 105 149 85 95 67 73 58 191 22 117 69 113 106 24 133 155 344 149 205 159 355 170 120 153 69 299 307 149 103 112 160
5420 160 80 256 255 97 14 68 174 63 115 153 113 64 82 27 17 60 121 271 154 205 165 34 110 115 164 282 241 116 138 80 81 88
5044 88 133 165 106 132 201 236 71 76 80 83 91 239 52 47 31 118 81 195 288 166 103 99 225 97 50 87 183 229 155 151 215 207 75 74 206
4633 206 380 269 77 141 172 102 115 59 30 55 91 69 92 180 198 50 238 256 46 104 181 223 213 188 72 179 261 191 160 191 322
4269 322 139 93 262 237 133 343 248 128 52 132 86 308 295 202 127 260 222 182 68 73 127 186 136 150 97 191 196 137 67 287 230
3906 230 133 156 65 230 275 127 87 138 273 50 280 132 52 152 190 107 173 136 125 117 10 137 149 63 68 206 339 262 207 101
3553 101 68 19 23 57 91 160 269 253 140 101 80 48 80 209 148 348 417 175 293 189 66 304 546 1204 559 55 63 207 524
3213 524 3132 3927 1339 344 129 227 77 832 1484 577 235 76 209 272 135 172 130 12 91 285 81 43 281 168 86
$$ packed form
5807G2R0o4PM4o4J0k8Oj5J33j69R5m8M4pq2J09K2J89j95N6m6J96j85n0L3q4K30Qj58m6RM8
5420A60q0J76jj58q3N4J06j11N2L8m0m9J8n5j0M3O1J50j17N1m0j31P6NM9J18m1j25K2n8JP
5044H8M5L2n9K6O9L5j65NMLQJ48j87nj6Q7l7J14R3j22o3mJ26j28m7L7R6M6p4mO4qj32jJ32
4633B06J74j11j92O4L1p0J3n6k9K5L6k2K3Q8J8j48J88J8k10N8P7M2j0k5j16J07Q2p0l1L1J31
4269C22j83m6J69k5j04K10r5j20p6Q0m6K22j3r3p5J33l8m0j14NN4N9n0J4n3R4Nn9p0K20n7
3906B30r7K3r1J65M5j48m0N1J35k23K30j48q0J00L8q3O6l7j1qj07J27J2q6NJ38J33p7n5j06
3553A01l3m9ML4L4O9J09j6j13l9k1l2L2J29o1K00O9k42J18j04j23K38K42O58o45n04QJ44L17
3213E24K608P95k588r95k15R8j50P55O52r07l42j59J33O3j37L7m2j18P9J94k04l8K38j13q2
$$ plain form
2920 86 5 332 1176 3744 3171 1470 618 250 60 190 36 238 164 24 74 209 178 170 41 113 111 178 221 27 257 179 141
2603 141 66 210 128 143 107 171 183 71 85 87 184 268 38 110 203 231 51 206 160 99 61 78 65 135 142 287 53 201 59 141 93
2239 93 71 261 511 246 163 188 176 92 97 252 210 120 100 93 278 97 128 131 40 130 111 157 142 98 136 160 49 136 49 59 140 233 21
1851 21 177 115 137 77 50 120 266 214 135 256 133 224 183 151 144 120 25 176 309 155 148 147 95 278 128 102 289 206 144 227 275 140
1476 140 41 79 224 233 357 157 97 87 34 67 156 129 318 178 173 150 42 30 2 39 122 72 329 417 132 181 82 32 161 69 94
1112 94 153 244 50 53 50 84 89 97 108 133 103 77 49 142 99 171 284 155 266 223 96 2 83 101 28 30 181 211 143 197 331 108 171 246
713 246 160 75 143 92 220 152 145 145 294 314 152 26 172 148 49 40 107 235 323 69 73 311 358 125 160 134 255 156 91 109 152 146 203
326 203 125 72 70 214 127 222 298 79 48 53 31 14 5 76 100 210 83 29 46 80 49 101 66 26 46 166 98 65 56 199 250 94 31 60
$$ packed form
2920H6q1L27Q44K568n73j701q52l68j90J30j54K02p4j40N0J35l1qj29P2kO7M3j94K30p8l8
2603A41p5J44q2J5l6O4J2j12J4KR7Q4k30P2R3K8j80J55m6o1l8J7j3P0PJ45k34J48j42Q2m8
2239I3k2J90K50k65q3K5j2q4NJ55m2r0k0pJ85j81L1Lr1R0j9M6j5m4L8K4j11Q7q7J0Q1R3k12
1851B1J56o2K2o0k7P0J46n2p9J21j23R1m1l2pk4r5J51J33j54pjn2J83j50k6J87q3o2Q3M8j35
1476A40r9L8J45RJ24k00o0j0n3L3Q9k7J89j40nk3j08j2k8L7Q3n0K57Q8k85M9r9n0J29r2K5
1112I4N9R1j94LlL4NQJ1K5l0k6k8R3m3P2J13j29J11m3j27r4Q1J8p3KJ51L0o8N4J34k23O3P5
713B46q6q5O8n1J28o8p%J49K0j62j26J46k4r9rO7J28Q8k54MK38M7k33L5k6J21r9o5J8M3oN7
326B03p8n3kJ44q7R5P6k19l1Nk2j7rP1K4J10j27n4J7L4l1N2l5m0K0J20o8l3rJ43N1j56o3K9
$$ plain form
-73 60 79 154 54 117 190 141 71 121 135 49
$$ packed form
-73F0J9P5j00O3P3m9p0N0J4q6
-191D9
##PAGE=	F1=-1214.13
##FIRST=	25168.397401625570637,	5807.04592319999756,	0
##DATA TABLE=	(F2++(Y..Y)), PROFILE
$$ plain form
5807 31 146 89 105 139 78 141 58 60 69 172 44 137 55 112 92 12 122 133 375 217 243 159 362 212 139 152 85 255 298 148 90
5443 90 157 189 76 286 257 107 49 107 176 71 95 123 39 96 47 36 65 40 173 295 145 209 174 15 116 131 182 312 236 64
5091 64 171 92 53 103 148 165 104 156 167 273 113 90 109 74 100 272 77 83 81 136 70 138 240 134 104 162 266 88 74 88 212
4727 212 241 162 109 207 200 110 58 183 357 251 80 164 206 88 72 73 81 96 79 45 36 143 201 25 216 274 88 138 158 188 242 212
4352 212 92 169 208 156 129 179 300 128 71 228 229 171 311 226 132 44 89 89 279 254 204 123 270 223 172 53 86 122 172 141 170 40
3976 40 129 182 126 69 246 202 131 162 64 239 288 185 88 163 287 32 302 103 43 153 193 145 144 133 135 113 30 162 141 63 86 222
3600 222 341 276 215 121 71 85 61 97 70 123 226 265 227 114 61 70 145 237 126 317 402 199 285 215 85 298 291 858 430 26
3248 26 69 172 475 2409 2925 975 261 103 194 63 603 1049 381 260 24 183 274 167 142 116 34 61 268 55 53 243
$$ packed form
5807C1J15n7J6L4o1O3q3KRJ03j28R3q2N7k0q0J10J1K42j58K6q4K03j50p3J3o7J70M3j50n8
5443I0O7L2j13K10k9j50n8N8O9j05K4K8q4N7m9j1K9k5J33J22j50O4l5j59J01J5N1J30p6j72
5091F4J07p9l9N0M5J7o1N2J1J06j60k3J9l5K6J72j95OkN5o6O8J02j06l0N8J04j78j4J4J24
4727B12K9p9n3R8pr0n2J25J74j06j71Q4M2j18j6JQJ5j7l4rJ07N8j76J91N8j86N0K0L0N4l0
4352B12j20P7L9n2k7N0J21j72n7J57Jn8J40q5r4q8M5%J90k5n0q1J47m7n1j19L3L6N0l1K9j30
3976D0Q9N3n6n7J77m4p1L1r8J75M9j03r7P5J24k55K70j99o0J10M0m8jj1Kk2q3J32k1p8K3J36
3600B22J19o5o1r4n0J4k4L6k7N3J03L9l8j13n3RP5R2j11J91Q5k03Q6p0j30K13pN67m28m04
3248B6M3J03L03J934N16j950p14j58R1j31N40M46o68j21k36J59R1j07k5k6q2K7K07k13kJ90
$$ plain form
2943 243 182 37 26 207 946 2750 2356 1034 497 152 76 158 56 240 164 8 50 146 195 206 54 51 47 158 209 41 216
2626 216 158 163 69 207 128 101 83 150 166 31 83 102 225 277 46 136 225 272 22 228 150 149 16 58 86 170 128 293 42 212 20
2262 20 185 87 94 228 474 248 153 202 157 32 42 162 235 119 71 114 264 75 154 147 31 163 155 160 105 58 148 181 56 146 46
1898 46 89 136 246 51 167 100 116 75 17 85 236 218 116 268 120 216 158 149 111 97 43 189 334 133 134 107 94 255 102 115
1546 115 304 203 127 195 253 155 7 66 190 184 343 142 111 107 51 48 120 104 270 174 178 179 51 53 46 71 153 55 346 411 145 196 112
1159 112 52 218 134 154 136 231 46 65 85 91 130 104 73 97 61 84 68 150 98 175 317 228 283 249 115 47 84 104 78 13 120 196 147
772 147 237 303 126 233 261 192 67 146 119 171 108 126 149 372 307 140 17 119 128 45 55 161 188 284 87 67 288 335 81 105
420 105 102 243 170 120 113 202 186 195 96 81 98 199 105 275 305 84 42 46 29 42 24 54 113 202 46 38 86 127 86 85 53 24 91 142 62 53
$$ packed form
2943B43o1j45j1J81P39J804l94j322n37l45p6Q2j02J84p6j56M2R6M9J1j52lmJ11N1j68J75
2626B16n8Nr4J38p9k7j8O7J6j35N2J9J23N2k31R0Q9M7k50K06p8jj33M2K8Q4m2J65k51J70j92
2262B0J65r8PJ34K46k26r5M9m5j25J0J20P3j16m8M3J50j89P9pj16J32qNn5m7R0L3j25R0j00
1898D6M3M7J10j95J16o7J6m1n8O8J51j8j02J52j48R6n8rl8j4n4J46J45k01Jk7j3J61j53J3
1546A15J89j01p6O8N8r8j48N9J24oJ59k01l1mn6lP2j6J66r6MJj28KpK5Q2r8K91O5k66N1q4
1159A12o0J66q4K0j8R5j85J9K0OL9k6l1K4l6K3j6Q2n2P7J42q9N5l4j34o8L7K0k6o5J07P6m9
772A47R0O6j77J07K8o9j25P9k7N2o3J8K3K23o5j67j23J02Rq3J0J06K7R6j97k0K21M7k54K4
420A05lJ41p3n0pQ9j6Rr9j5J7J01r4J70L0k21m2Mj7J3j8L0N9Q9j56qM8M1m1jl2k9O7N1q0r
$$ plain form
-3 53 75 274 251 52 52 74 66 134 35 133 221 136 119 139 115 17
$$ packed form
-3E3K2J99k3j99%K2qO8r9R8Q8q5j7K0k4r8
-191A7
##PAGE=	F1=-1316.39
##FIRST=	25168.397401625570637,	5807.04592319999756,	0
##DATA TABLE=	(F2++(Y..Y)), PROFILE
$$ plain form
5807 50 116 78 108 112 66 186 43 51 67 146 89 156 58 108 69 10 102 129 406 278 248 154 336 216 116 150 86 217 269 144 85 185
5431 185 198 55 283 243 107 94 152 186 70 73 100 92 122 20 66 117 87 229 292 129 206 169 7 126 151 183 322 212 27 194
5079 194 95 48 93 144 150 109 177 112 277 127 126 140 95 105 295 94 125 146 145 78 62 167 113 80 213 271 97 126 100 251 243 156 76
4692 76 192 185 129 41 142 302 209 115 175 211 66 31 77 129 141 68 56 103 101 201 12 182 268 119 157 120 141 250 217 109 144
4328 144 138 115 96 154 262 118 64 197 204 197 255 206 135 72 57 98 237 209 213 112 253 197 152 40 111 121 146 143 198 36 77 161 120
3941 120 77 183 155 110 157 67 229 265 216 80 165 270 12 324 114 28 147 186 162 109 106 157 114 68 190 137 44 107 234 334
3589 334 278 203 129 70 131 100 135 42 85 160 259 292 114 50 91 203 251 85 261 361 209 277 230 131 272 60 483 279 23
3248 23 83 111 418 1644 1874 612 155 84 156 45 368 592 191 280 56 154 258 195 118 91 69 43 247 65 84 170 167 8
$$ packed form
5807E0O6l8L0Mm6J20j43QJ6P9n7O7r8N0l9n9R2K7K77j28l0r4J82j20j00L4o4J31N2j25n9J00
5431A85J3j43K28m0j36j3N8L4j16LK7qL0j02M6N1l0J42O3j63P7l7j62J19K5L2J39j10j85J67
5079A94r9m7M5N1Om1O8o5J65j50jJ4m5J0J90k01L1K1jo7j6J05n4l3J33N8j74K9k6J51qq7q0
4692G6J16pn6q8J01J60r3r4O0L6j45l5M6N2J2p3j2M7kJ00j89J70Q6j49L8l7K1J09l3j08L5
4328A44ok3j9N8J08j44n4J33PpN8m9p1o3j5M1J39k8Mj01J41n6m5j12P1J0K5lN5j62M1Q4m1
3941A20m3J06k8m5M7r0J62L6m9j36Q5J05k58L12k10q6J19L9k4n3lN1m3m6J22n3r3O3J27J00
3589C34n6p5p4n9O1l1L5r3M3P5R9L3j78o4M1J12M8j66J76J00j52O8m7r9J41k12M23k04k56
3248B3O0K8L07J226K30j262m57p1P2j11L23K24m01Q9k24R8J04o3p7k7k2k6K04j82J9Q6lj59
$$ plain form
2920 8 65 71 635 1670 1477 580 364 61 102 127 98 228 150 2 55 93 195 233 114 120 96 156 184 52 173 147 181 85 184 118
2567 118 54 54 126 141 7 78 122 261 274 64 160 252 290 99 238 144 189 33 45 115 197 121 272 21 195 80 232 100 119
2227 119 210 402 216 126 222 136 21 31 108 255 109 34 121 228 51 183 177 22 184 198 157 60 27 143 179 52 162 65 111
1887 111 133 262 112 149 94 125 89 34 64 197 227 91 259 115 185 119 143 72 92 72 178 336 101 114 104 122 212 77 129 303
1535 303 206 121 168 208 148 28 60 148 133 305 120 110 135 92 35 75 93 202 141 172 197 61 79 82 112 200 42 334 357 131 189
1171 189 147 87 257 206 205 134 215 52 74 133 79 175 99 62 96 54 110 98 149 104 160 346 308 298 262 139 92 81 99 118 31 58 190
783 190 166 250 253 160 268 242 203 102 148 139 93 42 111 157 415 269 116 42 70 115 50 71 195 124 224 105 59 255 282 39 66
420 66 88 223 199 168 108 232 212 181 57 95 125 168 89 313 297 93 76 56 72 82 54 52 106 185 41 24 132 167 120 71 43 43 121
$$ packed form
2920HN7ON64J035j93q97k16l03M1K5k9J30p8j48N3L8J02L8j19Ok4O0K8j32J21k6L4r6R9o6
2567A18o4%P2J5j34P1M4J39J3k10R6R2L8j91J39r4M5j56J2P0Q2p6J51k51J74j15J52j32J9
2227A19R1J92j86r0R6q6j15J0P7J47j46p5Q7J07j77J32oj55J62J4m1r7l3J16L6j27J10r7M6
1887A11K2J29j50L7n5L1l6n5L0J33L0j36J68j44P0o6K4p1K0k0J06J58k35J3j0J8R0j35N2J74
1535C03r7q5M7M0o0j20L2Q8j5J72j85j0K5m3n7M0J8J09o1L1K5j36J8LL0Q8j58K92K3k26N8
1171A89m2o0J70n1jp1Q1j63K2N9n4R6p6l7L4m2N6j2N1m5N6J86l8j0l6j23m7j1J8J9q7K7J32
783A90k4Q4Lr3J08k6l9j01M6rm6n1O9M6K58j46j53p4K8M5o5K1J24p1J00j19m6J96K7k43K7
420F6K2J35k4l1o0J24k0l1j24L8L0M3p9K24j6k04j7k0J6J0k8kN4P9j44j7J08L5m7m9k8%P8
$$ plain form
32 121 105 38 65 155 347 248 36 90 101 50 108 45 143 230 116 151 142 77 21
$$ packed form
32A21j6o7K7R0J92r9k12N4J1n1N8o3R8Q7j14L5ro5n6
-191B1
##PAGE=	F1=-1418.64
##FIRST=	25168.397401625570637,	5807.04592319999756,	0
##DATA TABLE=	(F2++(Y..Y)), PROFILE
$$ plain form
5807 113 89 72 111 73 54 219 40 57 58 120 122 169 60 101 36 12 79 129 429 318 215 149 285 180 58 172 65 196 222 139
5455 139 91 191 192 40 256 224 98 132 196 195 54 76 83 160 135 53 66 153 152 272 264 107 194 149 30 140 161 172 315 178 35
5091 35 203 85 63 61 118 124 133 195 60 262 117 169 170 138 109 303 101 155 190 139 120 27 80 101 35 243 237 133 185 119 287 240 141
4704 141 80 177 153 133 34 91 221 147 147 168 182 48 6 70 170 179 59 101 207 59 204 45 146 250 134 161 75 93 232 196
4352 196 114 107 70 82 72 119 207 116 83 182 174 202 186 187 135 90 51 104 191 179 221 100 210 150 135 40 132 110 117 141 225 71 47 141 113
3941 113 94 123 101 74 142 56 203 210 213 56 140 221 22 337 156 8 132 172 158 69 64 183 114 109 213 135 47 126 243 323 262 174
3565 174 129 70 150 109 138 30 63 82 234 322 103 67 107 248 250 43 194 304 206 263 229 174 225 145 165 156 24 99 58 364 979
3201 979 965 305 72 70 129 39 182 210 99 286 99 124 227 217 122 64 88 59 221 111 100 86 150 28 108 42 308 724 710
$$ packed form
5807A13k4j7L9l8j9J65j79J7JO2KM7j09M1o5k4O7N0L00j11j03o6J36j05j22J14j07J31K6q3
5455A39m8J00Jj52K16l2j26L4O4jj41K2PP7k5q2J3Q7jJ20qj57Q7m5j19J10K1J1J43j37j43
5091C5J68j18k2kN7ORO2j35K02j45N2Jl2k9J94k02N4L5n1j9r3N3K1o6K08oj04N2o6J68m7r9
4704A41o1R7k4k0r9N7J30p4%K1J4j34m2O4J00Rj20M2J06j48J45j59J01J04j16K7q6J8J39l6
4352A96q2pl7J2j0M7Q8r1l3R9qK8j6Jn2m5l9N3Q7j2M2j21J10o0j5r5R2k2PK4Q4j54k4R4k8
3941A13j9K9k2k7O8q6J47PLj57Q4Q1j99L15j81j48J24M0j4q9nJ19o9nJ04p8q8P9J17Q0o1q8
3565A74m5n9Q0m1K9j08L3J9J52Q8k19l6M0J41Kk07J51J10r8N7l4n5N1q0K0rj32P5m1L06O15
3201I79j4o60k33kN9r0J43K8j11J87j87K5J03j0r5n8K4k9J62j10j1j4O4j22Q0o6K66M16j4
$$ plain form
2861 710 219 251 100 124 100 108 189 130 4 52 59 178 248 184 215 173 170 152 64 141 149 198 108 146 102 68 58 106 115 41 63 139 288 265 78
2450 78 163 281 287 172 240 145 212 67 56 142 214 139 230 23 148 129 272 139 130 198 307 168 110 247 121 72 108 139 259 89
2098 89 10 112 174 26 212 214 3 192 231 136 11 28 123 165 44 188 88 121 131 278 166 136 90 139 100 62 68 148 230 58
1746 58 236 115 134 91 138 36 110 105 144 315 71 82 137 161 170 67 134 289 210 129 146 145 124 61 80 117 97 248 91 94 158 147 23
1359 23 26 110 141 92 171 200 70 92 100 151 246 39 297 264 93 168 175 135 272 256 243 131 202 66 77 173 50 208 93 96 136 88
983 88 151 118 129 120 117 368 373 300 255 160 125 70 85 143 72 20 201 190 235 192 183 267 192 188 142 150 147 17 51 109 155 411 204 114 55 56 111
549 111 61 89 199 55 173 114 57 215 215 78 100 107 199 230 204 97 229 214 165 14 106 154 123 105 322 268 100 102 58 109 118 83
173 83 72 81 160 89 17 158 195 144 79 88 58 126 65 61 78 214 399 237 63 133 130 51 84 73 141 212 91 165 133 26 61
$$ packed form
2861G10m91L2j51K4k4QQ1n9j26M8PJ19P0o4L1m2lj8q8P7QM9r0L8m4l4j0M8Rp4K2P6J49k3j87
2450G8Q5J18Oj15O8r5O7j45j1Q6P2p5R1k07J25j9J43j33rO8J09j39n8J37j26m9L6L1J20j70
2098H9p9J02O2j48J86Kk11J89L9r5j25J7R5M2j21J44j00L3J0J47j12l0m6M9l9l8OQ0Q2j72
1746E8J78j21J9m3M7j02P4nL9J71k44J1N5K4Rj03O7J55p9q1J7jk1o3J9L7k0J51j57LO4j1j24
1359B3LQ4L1m9P9K9j30K2QN1R5k07K58l3j71P5Pm0J37j6j3j12P1j36J1R6j23J58j15LM0m8
983H8O3l3J1rlK51Np3m5r5l5n5J5N8p1n2J81j1M5m3rQ4p5mm6Qlj30L4N8M6K56k07r0n9JN5
549A11n0K8J10j44J18n9n7J58%j37K2PR2L1k6j07J32j5m9j51R2M8l1j8K17n4j68Km4N1Rl5
173H3j1RP9p1p2J41L7n1o5Rl0O8o1mJ7J36J85j62j74P0lp9L3j1O8P1j21P4l2j07L5
-191F1
##PAGE=	F1=-1520.9
##FIRST=	25168.397401625570637,	5807.04592319999756,	0
##DATA TABLE=	(F2++(Y..Y)), PROFILE
$$ plain form
5807 173 95 78 114 39 46 231 73 84 56 101 135 172 60 87 17 21 62 124 438 329 148 145 218 114 23 218 22 189 165 130 103
5443 103 179 174 65 223 213 86 156 231 202 40 112 70 196 136 97 31 165 203 289 220 80 171 114 56 153 153 156 294 141 54 201
5079 201 58 91 35 76 94 162 205 80 249 100 207 193 181 106 297 96 166 201 116 166 85 2 97 27 248 171 186 242 139 308
4727 308 240 124 108 165 106 128 47 45 131 73 152 142 124 42 5 53 199 203 52 142 295 19 215 80 116 230 136 156 31 54 192
4363 192 151 106 70 24 70 74 78 139 132 120 180 151 188 113 166 129 90 64 100 155 175 219 92 146 91 127 45 147 83 84 137 248 83 36 130
3953 130 100 111 90 46 72 137 57 171 140 180 21 91 145 53 331 199 29 107 154 146 36 38 202 108 145 226 136 91 137 246 308 226
3577 226 140 131 75 147 99 103 65 64 9 195 311 85 97 112 276 238 58 131 246 190 241 209 195 163 236 82 114 45 113 59 318 500
3201 500 364 80 93 54 129 62 98 74 147 273 126 92 190 238 155 50 88 90 193 168 104 74 169 71 150 108 61 149 194 144 179 166
$$ packed form
5807A73p8j7L6p5PJ85j58J1k8M5L4L7j12K7p0MM1O2L14j09j81lP3j04r1J95j96J67k4l5k7
5443A03P6nj09J58j0j27P0P5k9j62P2m2J26o0l9o6J34L8Q6o9j40R1n7n8R7%LJ38j53q7J47
5079B01j43L3n6M1J8O8M3j25J69j49J07j4j2p5J91k01P0L5q5N0q1q3R5p0K21p7J5N6j03J69
4727C08o8j16j6N7n9K2q1kQ6n8P9j0j8q2l7M8J46Mj51R0J53k76J96j35L6J14r4K0j25K3J38
4363A92m1m5l6m6M6MMO1pj2O0k9L7p5N3l7l9k6L6N5K0M4j27N4n5L6q2J02o4JN3J11j65m7R4
3953A30l0J1k1m4K6O5q0J14l1M0j59P0N4r2K78j32j70P8M7qj10KJ64r4L7Q1r0m5M6J09O2q2
3577B26q6rn6P2m8Ml8jn5J86J16k26J2J5J64l8j80P3J15n6N1l2j4l2P3j54L2o9O8n4K59J82
3201E00j36k84J3l9P5o7L6k4P3J26j47l4R8M8q3j05L8KJ03k5o4l0R5r8P9m2m7Q8M5n0L5j3
$$ plain form
2826 166 137 85 85 121 114 18 25 45 147 251 242 287 231 181 119 84 127 156 215 130 96 85 115 93 100 97 71 52 148 310 259 86 138 303 266
2415 266 229 238 147 216 87 96 157 218 175 179 59 80 167 296 194 122 189 206 149 143 271 120 127 172 187 243 77 40 85 109 12 236 254
2028 254 42 186 250 99 34 41 97 154 48 222 106 115 133 289 199 130 84 147 100 70 79 93 224 18 214 116 72 103 135 37 150
1664 150 135 96 276 51 47 176 198 148 66 127 266 207 144 130 82 89 88 114 102 83 182 61 69 167 203 21 31 138 121 62 188 191 74
1276 74 86 98 177 273 54 244 149 59 141 189 188 263 272 261 114 200 84 77 203 10 224 100 127 164 112 191 122 106 151 71 380 407
901 407 281 229 173 139 55 73 149 110 20 224 206 199 135 179 227 118 149 163 145 140 92 132 119 132 365 125 162 59 77 111 72 112 176
513 176 10 161 111 78 171 146 137 152 132 178 252 216 80 191 186 154 35 110 185 83 151 298 215 101 109 56 137 137 102 107 46 127 130 57
114 57 167 209 158 110 155 76 108 41 100 86 239 420 214 87 170 151 69 64 98 128 170 72 167 116 33 100
$$ packed form
2826A66k9n2%L6pr6PK0J02J04rM5n6n0o2l5M3K9N9q5l4j1L0k2Plk6j9R6J62n1j73N2J65l7
2415B66l7Rr1O9j29RO1O1m3Mj20K1Q7J29j02p2O7J7n7oJ28j51PM5J5N6j66l7M5K4r7K24J8
2028B54k12J44O4j51o5PN6N7j06J74j16RJ8J56r0o9m6O3m7l0RJ4J31k06J96r8m4L1L2r8J13
1664A50j5l9J80k25mJ29K2n0q2O1J39n9o3j4m8PjK6j2j9R9j21QR8L6j82J0J07j7n9J26Lj17
1276G4J2J2P9R6k19J90r5r0Q2M8jP5Rj1j47Q6j16pJ26j93K14j24K7L7n2P9o9j6M5q0L09K7
901D07j26n2n6l4q4J8P6l9r0K04j8po4M4M8j09L1J4j8nm8M0j3J3K33k40L7j03J8L4l9M0O4
513A76j66J51n0l3R3k5rJ5k0M6P4l6j36J11nl2j19P5P5j02O8J47q3j14Qn3Q1%l5No1Q1Lp3
114E7J10M2n1m8M5p9L2o7N9j4J53J81k06j27Q3j9q2nL4L0M2r8R5n1q3O7
-191A00
##PAGE=	F1=-1623.16
##FIRST=	25168.397401625570637,	5807.04592319999756,	0
##DATA TABLE=	(F2++(Y..Y)), PROFILE
$$ plain form
5807 219 128 91 114 49 40 221 124 123 66 87 124 160 76 69 56 38 64 118 429 311 58 145 148 33 93 260 47 186 125 112 114 152 149 106
5408 106 213 214 82 162 255 210 52 154 63 202 130 131 29 156 226 271 168 52 140 69 82 160 126 142 268 102 67 188 25
5068 25 130 74 32 64 178 204 133 251 100 230 204 212 92 275 83 158 186 84 192 116 49 106 84 229 85 234 282 153 306
4727 306 242 109 134 157 58 126 68 38 52 7 122 102 49 45 8 27 213 206 51 163 344 18 235 111 97 212 125 150 13 27
4375 27 145 92 87 64 14 81 95 44 65 154 161 179 145 163 46 144 112 78 87 85 140 187 199 83 73 32 121 48 159 44 41 137 266 71
3976 71 43 131 77 124 79 10 132 153 97 146 76 130 24 32 51 78 303 225 57 76 142 148 31 77 207 96 168 226 140 130 136 238 283
3589 283 171 118 141 87 131 92 52 105 68 50 150 266 65 125 104 282 215 97 82 197 167 213 174 185 95 241 164 126 84 123 72
3225 72 277 222 309 111 127 41 161 91 106 188 191 241 136 59 162 260 191 57 80 119 167 220 109 140 217 120 192 115 182 341 181
$$ packed form
5807B19r1l7K3o5rJ81r7jn7K1L7L6q4pj3j8K6N4L11j18k53Q7Lj15O0J67k13J39o1j3KL8lm3
5408A06J07Jj32Q0R3m5j58J02r1J39p2Jj02J27P0M5j03j16Q8p1J3P8l4J6J26j66l5J21j63
5068B5J05n6m2L2J14K6p1J18j51J30k6Qj20J83j92P5K8j02J08p6o7N7k2J45j44J49M8j29J53
4727C06o4j33K5K3r9O8n8l0J4m5J15k0n3ml7J9J86pj55J12J81l26K17j24j4J15q7K5j37J4
4375B7J18n3nk3n0O7J4n1K1Q9PJ8l4J8j17R8l2l4RkN5M7J2j16j0m1Q9p3J11j15lR6J29j95
3976G1k8Q8n4M7m5o9J22K1n6M9p0N4j06QJ9K7K25p8j68J9O6Oj17M6J30j11P2N8q6j0OJ02M5
3589B83j12n3K3n4M4l9m0N3l7j8J00J16k01O0k1J78o7j18j5J15l0M6l9J1r0J46p7l8m2L9n1
3225G2K05n5Q7j98J6q6J20p0J5Q2LN0j05p7J03R8o9j34K3L9M8N3j11L1P7r7P2p7O7J59j60
$$ plain form
2861 181 219 154 197 140 95 57 40 108 48 45 67 109 243 273 321 263 174 96 109 129 164 230 143 46 73 143 130 113 94 96 77 150 328 263 94
2450 94 91 305 239 261 239 139 204 87 152 156 220 209 132 93 30 205 297 252 95 185 115 184 201 284 137 187 213 209 211 94 64 45 47 35
2051 35 245 292 92 166 251 74 70 49 77 147 64 257 117 96 137 292 207 117 71 149 98 56 80 57 213 30 208 124 13 136
1699 136 131 76 199 158 53 229 33 68 206 228 152 57 109 242 193 155 121 56 53 108 146 89 87 118 36 54 158 244 50 86 157 131
1323 131 83 222 175 73 59 84 183 274 81 185 39 92 117 181 237 236 252 259 79 213 102 80 218 34 221 132 129 157 111 221
971 221 113 107 191 116 376 402 246 193 178 132 51 97 133 136 15 247 205 151 94 149 158 37 89 157 126 119 157 199 136 89 293 71 239
584 239 71 95 105 78 137 137 61 173 99 114 134 90 179 180 143 162 259 202 61 128 129 154 79 107 214 98 203 246 145 94 99 77 159 131
185 131 107 146 33 88 146 93 168 209 164 143 213 107 72 53 134 92 233 405 179 94 193 157 89 51 114 113 116 65 167 100 85 130
$$ packed form
2861A81L8o5M3n7m5l8j7O8o0lK2M2J34L0M8n8q9p8J3K0L5O6q7r7K7P0j3j7j9Kj9P3J78o5j69
2450I4lK14o6K2k2j00O5j17O5MO4j1p7l9o3J75R2m5j57R0p0O9J7Q3j47N0K6mKj17l0j9Kj2
2051C5K10M7k00P4Q5j77mk1K8P0q3J93j40k1M1J55q5r0m6P8n1m2K4k3J56j83J78q4j11J23
1699A36nn5J23m1j05J76j96L5J38K2p6r5N2J33m9l8l4o5lN5L8n7kL1q2J8J04Q6j94L6P1k6
1323A31m8J39m7j02j4K5R9R1j93J04j46N3K5O4N6jJ6Pj80J34j11k2J38j84J87q9lK8m6J10
971B21j08oQ4p5K60K6j56n3j5m6q1M6L6Lj21K32m2n4n7N5Rj21N2O8l1pL8M2o3m7K04k22J68
584B39j68K4J0k7N9%p6J12p4J5K0m4Q9Jl7J9R7n7j41O7JK5p5K8J07j16J05M3j01n1Nk2Q2k8
185A31k4L9j13N5N8n3P5M1m5k1P0j06l5j9Q1m2J41J72k26q5R9l6o8l8O3jLn1J02o7j5M5
-191A30
##PAGE=	F1=-1725.42
##FIRST=	25168.397401625570637,	5807.04592319999756,	0
##DATA TABLE=	(F2++(Y..Y)), PROFILE
$$ plain form
5807 243 164 99 112 73 49 190 175 162 78 73 96 133 112 57 94 65 84 119 399 269 50 149 92 53 142 275 115 177 128 82 120 117 125
5420 125 146 231 216 91 155 267 223 87 194 66 195 121 144 97 132 216 221 118 26 109 23 99 156 89 123 241 66 76 169 56
5068 56 175 132 34 35 170 189 165 254 118 232 206 226 62 242 72 136 171 62 186 109 60 121 124 192 29 259 294 165 280 245
4715 245 99 152 147 43 132 86 51 48 70 68 74 26 43 36 12 208 187 57 159 345 48 258 134 79 194 106 148 52 11 107 37 66
4340 66 96 42 109 122 54 54 168 196 168 150 140 16 121 83 65 114 63 147 196 161 62 19 18 104 47 172 37 17 149 277 54 74
3964 74 145 57 132 69 69 201 176 141 128 54 87 65 60 43 87 252 225 73 43 141 165 44 128 198 84 178 211 143 149 118 213 245 105 114
3565 114 156 101 108 104 63 131 63 81 104 200 50 144 83 268 185 120 54 161 155 190 135 142 45 181 158 124 120 126 67 230 86 387 223 117
3166 117 43 222 110 126 228 218 203 134 46 151 275 215 69 78 145 144 250 121 185 252 154 231 76 262 384 243 205 163 195 130
$$ packed form
5807B43p9o5J3l9k4J41j5j3q4nK3L7k1n5L7k9J9L5K80j30k19R9n7l9Q9J33j60O2m9m6L8lQ
5420A25K1Q5j5j25O4J12m4j36J07j28J29p4K3m7L5Q4Nj03r2Q3q6P6N7o7L4J18j75J0R3j13
5068E6J19m3r8JJ35J9k4Q9j36J14k6K0j64J80j70O4L5j09J24p7m9O1LO8j63K30L5j29J15l5
4715B45j46N3nj04Q9m6l5lK2kOm8J7pk4J96k1j30J02J86k97K10j24n5J15q8M2r6m1R6p0K9
4340F6L0n4O7J3o8%J14K8k8j8j0j24J05l8j8M9n1Q4M9l5r9m3jQ6n7J25j35k0J32J28k23K0
3964G4P1q8P5o3%J32k5l5j3p4L3k2nj7M4J65k7j52l0R8K4j21Q4P0j14R4L3o8Ol1R5L2j40R
3565A14M2n5Pmm1O8o8J8K3R6j50R4o1J85q3o5o6J07oL5n5Pr7J36k3l4mOn9J63j44L01j64j06
3166A17p4J79j12J6J02j0j5o9q8J05J24o0j46RO7jJ06j29O4O7r8P7j55J86J22j41l8m2L2o5
$$ plain form
2814 130 120 61 34 109 91 120 114 74 227 270 314 268 149 90 126 133 164 234 148 46 63 140 163 135 98 116 116 151 343 273 111 34 274
2427 274 210 264 242 119 185 66 214 142 233 228 106 119 87 246 272 302 55 182 50 232 249 275 164 246 227 200 176 128 77 51
2075 51 41 63 235 319 138 135 241 106 86 53 82 127 85 282 125 69 142 287 194 88 49 152 103 30 70 82 202 83 219 135
1722 135 35 160 121 120 242 174 52 185 20 133 226 253 173 51 85 223 172 158 119 83 26 120 165 71 102 69 33 61 130 260
1370 260 85 137 163 131 109 257 164 66 16 69 169 244 110 129 75 153 101 155 273 209 201 238 50 245 123 85 215 78 203 181
1018 181 99 119 85 235 97 131 226 209 353 358 201 155 178 107 76 144 98 146 50 259 184 109 77 107 76 46 25 131 94 86 191 240
643 240 154 40 222 107 316 102 98 91 80 156 97 92 176 93 149 124 58 195 173 132 153 246 174 45 62 54 160 117 100 234 162 248 183
255 183 67 89 94 125 176 97 103 178 59 49 135 113 170 197 163 161 248 144 31 75 157 97 207 360 140 85 200 150 108 61 124 103 65
$$ packed form
2814A30j0n9k7P5j8K9om0J53M3M4m6j19n9L6PL1P0q6j02J7P7K3k8l7J8%L5J92p0j62p7K40
2427B74o4N4k2j23O6j19J48p2R1nj22J3l2J59K6L0k47J27j32J82J7K6j11Q2j9k7k4m8n1k6
2075E1j0K2J72Q4j81lJ06j35k0l3K9M5m2J97j57n6P3J45r3j06l9J03m9p3M0J2J20j19J36q4
1722A35j00J25l9jJ22o8j22J33j65J13R3K7q0j22L4J38n1j4l9l6n7R4M5r4L1l3l6K8O9J30
1370B60j75N2K6l2k2J48r3r8n0N3J00P5j34J9n4P8n2N4J18o4qL7j88J95j22l8J30j37J25k2
1018A81q2K0l4J50j38L4R5j7J44Nj57m6K3p1l1O8m6M8r6K09p5p5l2L0l1l0k1J06l7qJ05M9
643B40q6j14J82j15K09k14mpj1P6n9nQ4q3N6k5o6J37k2m1K1R3p2j29J7qJ06m3j7J34p2Q6o5
255A83j16K2NL1N1p9OP5j19j0Q6k2N7K7l4kQ7j04j13M4Q2o0J10J53k20n5J15n0m2m7O3k1l8
$$ plain form
-132 65 64 169 88 126 148
$$ packed form
-132F5jJ05q1L8K2
-191A48
##PAGE=	F1=-1827.68
##FIRST=	25168.397401625570637,	5807.04592319999756,	0
##DATA TABLE=	(F2++(Y..Y)), PROFILE
$$ plain form
5807 244 190 100 109 79 88 143 212 189 86 56 64 95 155 60 120 101 113 131 350 215 141 155 69 123 157 252 173 159 149 49 117 83 114 181
5408 181 257 210 104 136 268 231 129 229 74 195 106 131 155 106 182 153 80 31 89 30 106 138 58 92 221 40 83 147 111 221
5056 221 186 64 11 137 164 166 238 132 215 205 227 21 202 68 111 190 73 146 75 31 131 135 144 97 250 275 175 238 245 96 164
4692 164 130 63 142 94 52 81 123 72 110 77 38 69 53 185 149 67 130 303 70 273 141 51 169 84 155 89 28 83 40 53 135 87
4316 87 147 144 91 117 163 215 151 159 128 61 103 42 61 128 40 160 186 108 25 50 47 73 47 182 76 87 171 281 65 114 164 69 138 59
3917 59 127 250 183 163 106 66 79 101 129 125 76 186 198 70 16 146 174 50 171 182 84 176 183 141 141 80 167 193 47 114 167 114 78
3530 78 119 109 140 50 84 60 133 47 152 52 233 151 120 43 136 167 177 105 76 59 98 105 97 136 120 64 168 12 320 293 64 62 298
3143 298 120 153 249 241 174 124 72 153 274 220 75 82 164 123 253 131 187 247 161 264 74 256 256 215 131 183 173 103 143 81 75 112 140
$$ packed form
5807B44n4r0Rl0RN5O9k3j03l0QL1O0r5O0j9J2J8K19j35p4J4q6N4L4R5p9j4j0j00O8l4L1O7
5408A81P6m7j06L2J32l7j02J00j55J21q9K5K4m9P6k9p3m9N8n9P6L2q0L4J29j81M3O4l6J10
5056B21l5j22n3J26K7KP2j06Q3j0K2k06J81j34M3P9j17P3p1m4J00MRm7J53K5j00O3Pj49O8
4692A64l4o7P9m8m2K9M2n1L8l3l9L1j6J32l6q2O3J73k33K03j32r0J18q5P1o6o1N5m3J3Q2m8
4316H7O0ln3K6M6N2o4Ql1o7M2o1J9O7q8J20K6p8q3K5lK6k6J35j06J1Q4J10k16M9N0r5O9p9
3917E9O8J23o7k0n7m0J3K2K8mm9J10J2j28n4J30K8j24J21J1r8R2Pm2%o1Q7K6j46O7N3n3l6
3530G8M1j0L1r0L4k4P3q6J05j00J81q2l1p7R3L1J0p2k9j7L9PqL9j6n6J04j56L08k7k29kK36
3143B98j78L3R6qo7n0n2Q1J21n4j45PQ2m1J30j22N6O0q6J03j90J82%m1q4N2j0p0M0o2oL7K8
$$ plain form
2755 140 193 161 54 205 234 269 249 113 97 126 126 152 224 143 86 49 112 190 151 96 129 140 159 351 281 135 40 210 179 241 237 90
2380 90 167 31 271 124 261 227 99 134 142 278 224 335 46 173 40 257 269 241 187 295 227 168 146 155 78 118 90 92 206 326
2028 326 173 94 227 155 80 59 109 81 105 285 131 43 149 272 181 42 39 162 123 41 54 124 192 136 232 143 60 163 104 159 267
1664 267 183 80 151 44 195 236 273 201 90 72 216 161 154 119 110 27 124 169 49 118 41 58 77 92 249 112 178 162 109 112 279 168
1288 168 57 34 66 138 191 138 85 142 201 92 116 291 196 134 205 81 285 144 87 193 115 177 233 45 75 45 228 78 146 246
936 246 291 313 284 159 121 174 77 107 183 47 139 104 253 149 101 66 84 3 109 65 99 57 50 191 249 168 44 192 169 377 140
572 140 86 74 80 157 71 98 156 98 168 139 60 184 133 105 145 216 149 40 63 39 165 145 91 237 234 282 131 5 109 128 179 187 42
185 42 102 191 81 35 106 116 177 176 155 156 255 173 52 92 168 97 174 301 120 73 193 137 121 92 131 103 31 63 171 78 152 150
$$ packed form
2755A40N3l2j07J51K9L5k0j36j6K9%K6P2q1n7l7O3P8l9n5L3J1J9J92p0j46r5J70l1O2mj47
2380I0P7j36K40j47J37l4j28L5QJ36n4J11k89J27j33K17J2k8n4J08o8n9k2Rp7M0k8KJ14J20
2028C26j53p9J33p2p5k1N0k8K4J80j54q8J06J23r1j39lJ23l9q2J3P0O8n6R6q9q3J03n9N5J08
1664B67q4j03P1j07J51M1L7p2j11j8J44n5pl5rq3R7M5j20O9p7J7J9J5J57j37O6j6n3LJ67j11
1288A68j11k3L2P2N3n3n3N7N9j09K4J75r5o2P1j24K04j41n7J06p8O2N6j88L0l0J83j50O8J00
936B46M5K2k9j25l8N3r7L0P6j36R2l5J49j04m8l5J8q1J06m4L4m2pJ41N8q1j24J48k3K08k37
572A40n4j2OP7q6K7N8n8P0k9p9J24n1k8M0P1o7j09K3k4J26k0n4J46lM8j51j26J04J9N1Qj45
185D2O0Q9j10m6P1J0O1jk1JR9q2j21M0P6p1P7J27j81m7J20n6j6k9L9k8p2L2J08r3P4k
-191A50
##PAGE=	F1=-1929.93
##FIRST=	25168.397401625570637,	5807.04592319999756,	0
##DATA TABLE=	(F2++(Y..Y)), PROFILE
$$ plain form
5807 225 205 95 100 60 146 88 225 201 87 41 56 58 196 75 131 145 141 144 284 166 216 159 78 177 139 191 205 129 153 36 107 53 121
5420 121 206 267 191 114 112 261 223 167 252 80 203 81 92 188 90 142 100 60 70 84 66 108 112 65 56 214 25 87 126 155 256 228 84
5032 84 33 84 132 137 194 129 192 211 219 41 159 74 99 234 99 81 66 40 129 114 94 155 211 228 184 191 239 99 173 113 74 148 91 53
4633 53 92 156 150 177 98 49 101 101 147 100 78 84 231 79 271 126 9 136 66 168 120 61 62 75 55 165 132 182 155 125 170 140 210
4246 210 130 174 129 96 100 7 69 118 36 171 154 56 33 65 51 54 52 183 105 159 195 276 84 146 181 103 137 68 173 267 167 149 66 77
3847 77 95 133 186 178 48 122 151 47 40 147 157 56 203 165 98 167 145 127 111 38 99 130 55 103 171 121 44 118 131 132 37 65 40 81
3448 81 56 148 22 184 115 100 37 117 196 166 95 41 93 49 70 62 125 108 91 97 102 161 323 35 89 367 132 184 274 254 161 111 100 151
3049 151 253 204 82 81 177 108 228 132 151 194 135 287 155 206 112 192 58 191 152 65 157 100 80 113 187 245 188 54 180 176 198
$$ packed form
5807B25k0j10Nm0Q6n8J37k4j14m6J5KJ38j21N6J4mLJ40j18N0n7q1R9l8N2J4p6K4j17P1n4O8
5420A21Q5O1p6p7kJ49l8n6Q5j72J23j22J1R6r8N2m2m0J0J4j8M2Mm7rJ58j89O2L9K9J01k8j44
5032H4n1N1M8NN7o5O3J9Qj78J18q5K5J35j35j8j5k6Q9j5k0O1N6J7m4PM8j40P4o0l9P4n7l8
4633E3L9O4oK7p9m9N2%M6m7k2OJ47j52J92j45j17J27p0J02m8n9JJ3k0J10l3N0k7l0M5l0P0
4246B10q0M4m5l3Mr3O2M9q2J35j7r8k3L2j4LkJ31p8N4L6Q1j92O2L5p8L4o9J05R4j00j8q3J1
3847G7J8L8N3qj30P4K9j04pJ07J0j01J47l8o7O9k2j8j6p3O1L1p5M8O8n0p7P4J3Jr5K8k5M1
3448H1k5R2j26J62o9j5o3Q0P9l0p1n4N2m4K1qO3j7j7ONN9J62k88N4K78k35N2R0k0r3n0j1N1
3049A51J02m9j22jR6o9J20r6J9M3n9J52j32N1r4Q0j34J33l9q7R2n7k0L3P4N8n7j34J26mK2
$$ plain form
2685 198 213 83 112 104 103 128 197 132 117 35 87 210 160 82 129 137 179 349 283 156 85 119 141 198 214 59 158 34 310 117 292 211
2309 211 93 141 172 285 156 343 98 155 61 249 255 182 194 324 229 132 129 163 66 190 131 119 163 312 190 51 215 184 49
1969 49 71 140 15 120 261 131 28 154 246 187 17 81 174 149 76 53 154 189 184 233 137 67 148 90 186 268 184 107 131 82 238
1605 238 242 287 228 155 98 223 176 151 113 120 42 120 160 30 126 38 94 88 53 215 123 201 164 92 98 278 182 51 74 72 97 130 166 54
1206 54 174 221 83 76 289 199 64 167 138 317 159 84 153 143 150 278 17 73 3 202 62 137 244 337 258 197 134 87 163 59
854 59 129 191 16 115 151 224 105 131 44 88 45 151 125 77 37 16 165 229 175 83 212 219 412 171 67 65 79 134 69 79 119 101 166
466 166 149 69 154 72 72 136 173 137 42 108 97 164 163 84 221 299 300 107 58 157 188 225 188 19 117 182 87 56 75 108 184 149 137 130 233
56 233 183 103 102 163 89 150 250 137 71 183 125 124 121 133 116 20 61 166 61 162 138
$$ packed form
2685A98J5j30K9qjK5O9o5j5q2N2J23n0p8M7QM2J70o6j27p1L4K2N7J6j55R9j24K76j93J75q1
2309B11j18M8L1J13j29J87k45N7r4J88Op3J2J30r5r7lL4r7J24n9j2M4J49j22j39J64l1j35
1969D9K2O9j25J05J41j30j03J26R2n9j70O4R3k5p3k3J01L5nM9r6p0Q1n8R6Q2q4p7K4m9J56
1605B38MM5n9p3n7J25m7k5l8Pp8P8M0j30R6q8N6ol5J62r2P8l7p2OJ80r6j31K3kK5L3L6j12
1206E4J20M7j38pK13r0j35J03k9J79j58p5O9j0PJ28k61N6p0J99j40P5J07R3p9o1o3m7P6j04
854E9P0O2j75R9L6P3j19K6q7M4m3J06k6m8m0k1J49O4n4r2J29PJ93k41j04kJ4N5o5J0M0j8O5
466A66j7q0Q5q2%O4L7l6r5O6j1O7jp9J37P8Jj93m9R9L1L7l7j69R8O5r5l1J9L3P6l5j2pJ03
56B33n0q0jO1p4O1J00j13o6J12n8jlJ2j7r6M1J05j05J01k4
-191A38
##PAGE=	F1=-2032.19
##FIRST=	25168.397401625570637,	5807.04592319999756,	0
##DATA TABLE=	(F2++(Y..Y)), PROFILE
$$ plain form
5807 190 212 97 81 35 206 33 209 198 90 44 73 39 228 100 127 194 163 150 206 143 263 159 88 212 99 111 204 88 131
5467 131 50 92 27 134 219 252 165 116 93 252 193 195 254 80 203 59 38 189 86 127 106 59 118 86 93 123 87 93 52 225 19 89
5091 89 105 179 271 256 89 67 22 99 96 130 109 183 224 205 100 114 89 111 271 118 46 120 108 120 71 58 187 162 164 192 151 226 104
4704 104 181 115 68 141 77 80 83 171 223 234 85 79 130 148 102 54 84 31 152 76 251 83 64 101 58 180 141 97 51 102 76 181 159
4316 159 201 153 147 197 103 180 111 192 140 119 109 55 88 79 69 176 102 60 97 51 43 93 64 171 111 218 214 260 82 157 185 133 122 89 195
3906 195 251 130 101 8 97 110 162 224 194 36 87 102 28 82 136 107 83 221 150 112 156 103 102 73 73 14 67 89 73 173 119 6 95
3518 95 119 116 41 63 77 48 74 133 25 124 79 76 33 95 215 147 102 116 114 64 68 37 90 95 131 63 180 41 319 114 125 410 160 203
3119 203 285 242 161 106 106 133 212 173 98 70 186 111 186 120 103 111 97 295 237 155 155 195 64 171 153 36 159 124 56 116 221 261 187
$$ packed form
5807A90K2j15j6m6J71j73J76j1j08m6K9l4J89j28K7O7l1j3N6o3J20j04p1J24j13J2R3j16M3
5467A31q1M2o5J07Q5L3q7m9k3J59n9KN9j74J23j44k1J51j03M1k1m7N9l2PL0l6Om1J73k06P0
5091H9J6P4R2j5j67k2m5P7lL4k1P4M1j9j05J4k5K2J60j53p2P4j2J2m9j3J29k5KK8m1P5j22
4704A04P7o6m7P3o4LLQ8N2J1j49oN1J8m6m8L0n3J21p6J75j68j9L7m3J22l9m4m6N1k6J05k2
4316A59M2m8oN0r4P7o9Q1n2k1j0n4L3rj0J07p4m2L7m6qN0k9J07o0J07mM6j78P5K8n2j1l3J06
3906A95N6j21k9r3Q9J3N2O2l0j58N1J5p4N4N4k9k4J38p1l8M4n3jk9%n9N3K2j6J00n4j13Q9
3518I5K4lp5K2J4k9K6N9j08R9m5lm3O2J20o8m5J4kn0Ml1N3NL6o8J17j39K78k05J1K85k50M3
3119B03Q2m3q1n5%K7P9l9p5k8J16p5P5o6j7Qj4J98n8q2%M0j31J07j8j17J23l5o8O0J05M0p4
$$ plain form
2732 187 56 155 113 119 168 73 130 65 62 99 160 120 128 55 106 220 165 59 113 110 213 342 276 167 110 32 97 148 166 36 160 73 322
2344 322 123 309 193 75 145 173 258 84 320 151 135 87 211 211 104 179 324 243 112 130 151 44 252 156 150 124 283 193 28
2004 28 196 180 33 89 161 69 127 209 119 26 154 208 210 77 143 180 173 100 87 167 193 223 217 112 61 128 85 194 244 173 130 123 112 250
1605 250 246 296 249 221 149 240 207 155 101 114 54 107 146 24 120 62 133 94 23 170 116 202 173 116 93 255 191 50 94 75 57 93 190
1218 190 34 173 213 68 45 272 204 19 133 189 324 158 78 103 160 130 306 72 101 37 160 48 107 223 338 198 118
901 118 132 49 140 57 136 159 70 77 173 171 63 174 27 88 60 170 166 72 49 11 128 193 173 105 245 253 414 185 48 69 73 88 93 42
502 42 78 89 142 129 74 116 10 51 124 127 131 46 134 123 155 170 77 192 350 305 107 89 212 247 254 177 71 148 151 75 78 60 102 186 120
91 120 111 92 192 169 145 104 143 79 141 221 174 80 182 120 112 134 127 141 18 61 148 34 162 115
$$ packed form
2732A87j31R9m2OM9r5N7o5lL7O1m0Qp3N1J14n5j06N4lJ03J29o6j09n7p8O5N1J8j30J24q7K49
2344C22j99J86j16j18P0K8Q5j74K36j69j6m8J24%j07P5J45q1j31J8K1j07K08r6ok6J59r0j65
2004B8J68j6j47N6P2r2N8Q2r0r3J28N4Kj33O6L7pp3j3Q0K6L0oj05n1O7m3J09N0p1m3pj1J38
1605B50mN0m7k8p2R1l3n2n4J3o0N3L9j22R6n8P1l9p1J47n4Q6k9n7k3J62o4j41M4j9j8L6R7
1218A90j56J39M0j45k3K27o8j85J14N6J35j66q0K5N7l0J76k34K9o4J23j12N9J16J15j40q0
901A18J4q3R1q3P9K3q9PR6kj08J11j47O1k8J10mr4k3l8J17O5k0o8J40QJ61k29j37K1MJ5Nn1
502D2L6J1N3j3n5M2j06M1P3LMq5Q8j1L2J5r3J15J58m5j98j8J23L5Pp7j06P7Lp6Lj8M2Q4o6
91A20rj9J00k3k4m1L9o4O2Q0m7r4J02o2qK2pJ4j23M3Q7j14J28m7
-191A15
##PAGE=	F1=-2134.45
##FIRST=	25168.397401625570637,	5807.04592319999756,	0
##DATA TABLE=	(F2++(Y..Y)), PROFILE
$$ plain form
5807 147 210 112 49 73 255 14 171 191 106 70 86 45 251 133 115 242 177 143 126 148 278 151 83 233 66 80 166 41 101
5467 101 59 81 21 136 217 215 138 109 103 243 146 207 229 80 185 75 24 160 89 147 136 69 164 97 112 157 80 111 91 252 38 91
$$ packed form
5807A47O3r8o3K4J82k41J57K0q5l6J6m1K06j18j8J27o5l4j7K2J30j27o8J50j67J4Q6j25O0
5467A01m2K2o0J15Q1kp7k9oJ40r7O1K2j49J05j10n1J36p1N8j1o7R5o7J5M5p7L1k0J61k14N3
$$ [...]
-191B5
##END NTUPLES=	nD NMR SPECTRUM
##END=	
##END=	
