##TITLE=	JZrdbi6eSxa+eg8MkzW5Gg.32.ser
TM-VI-137solid hmqc

##JCAMP-DX=	6.0	$$ MestReNova 14.3.0-30573
##DATA TYPE=	LINK
##BLOCK_ID=	1
##BLOCKS=	2    
##ORIGIN=	Mestrelab Research S.L.
##OWNER=	hrzepa
##$MNOVA/LINK_BLOCK_TYPE=	ITEM	$$ NMR Spectrum
##$MNOVA/ITEM/POLYGON=	(XY..XY)
5321,5835
8722,5835
8722,8208
5321,8208
5321,5835
##$MNOVA/ITEM/Z=	0
##$MNOVA/ITEM/ANGLE=	0
##TITLE=	JZrdbi6eSxa+eg8MkzW5Gg.32.ser
##JCAMP-DX=	6.0	$$ MestReNova 14.3.0-30573
##BLOCK_ID=	2
##DATA TYPE=	MNOVA NMR VIEW DATA
##DATA CLASS=	MNOVA VIEW DATA
##$MNOVA/2D/THRESHOLD=	6.1928906440734863281
##$MNOVA/ITEM/ZOOM/X=	-0.98135677571250334861,	11.004809999983093505
##$MNOVA/ITEM/ZOOM/Y=	-4.6325299116681737388,	174.98660000188448294
##END=	
##TITLE=	JZrdbi6eSxa+eg8MkzW5Gg.32.ser
##JCAMP-DX=	6.0	$$ MestReNova 14.3.0-30573
##BLOCK_ID=	3
##DATA TYPE=	nD NMR SPECTRUM
##DATA CLASS=	NTUPLES
##NUMDIM=	2
##ORIGIN=	Bruker BioSpin GmbH
##OWNER=	nmr
##.OBSERVE FREQUENCY=	400.32200160000002143
##.OBSERVE NUCLEUS=	^1H
##.SOLVENT NAME=	CDCl3
##.PULSE SEQUENCE=	hmqcgpqf
##LONGDATE=	2021/10/27 13:03:28.000
##.ACQUISITIONMODE=	SIMULTANEOUS (DQD)
##$ORIGINAL FORMAT=	Bruker XWIN-NMR
##$MNOVA/SCALES_VERSION=	9
##$PARAMETER FILE=	(acqu2s, ASCII, /private/var/folders/f6/rjf_tdyn2v98c5c0wvkgn4s80000gn/T/JZrdbi6eSxa+eg8MkzW5Gg/32/acqu2s, 0)
$$ ##TITLE= Parameter file, TOPSPIN		Version 3.2
$$ ##JCAMPDX= 5.0
$$ ##DATATYPE= Parameter Values
$$ ##NPOINTS= 129	$$ modification sequence number
$$ ##ORIGIN= Bruker BioSpin GmbH
$$ ##OWNER= nmr
$$ $$ 2021-10-27 13:15:31.572 +0100  nmr@CZC2524DW0
$$ $$ /opt/topspin/data/agmb/nmr/Oct27-2021/32/acqu2s
$$ $$ process /opt/topspin3.2/prog/mod/go
$$ ##$ACQT0= 0
$$ ##$BF1= 100.660544
$$ ##$FnMODE= 1
$$ ##$NUC1= <13C>
$$ ##$NusJSP= 0
$$ ##$NusT2= 1
$$ ##$NusTD= 128
$$ ##$O1= 8556.27425043792
$$ ##$SFO1= 100.66910027425
$$ ##$SW= 179.955338625584
$$ ##$SW_h= 18115.9420289855
$$ ##$TD= 128
$$ ##END=
$$ 
##$PARAMETER FILE=	(acqus, ASCII, /private/var/folders/f6/rjf_tdyn2v98c5c0wvkgn4s80000gn/T/JZrdbi6eSxa+eg8MkzW5Gg/32/acqus, 0)
$$ ##TITLE= Parameter file, TOPSPIN		Version 3.2
$$ ##JCAMPDX= 5.0
$$ ##DATATYPE= Parameter Values
$$ ##NPOINTS= 12	$$ modification sequence number
$$ ##ORIGIN= Bruker BioSpin GmbH
$$ ##OWNER= nmr
$$ $$ 2021-10-27 13:15:34.780 +0100  nmr@CZC2524DW0
$$ $$ /opt/topspin/data/agmb/nmr/Oct27-2021/32/acqus
$$ $$ process /opt/topspin3.2/prog/mod/shimcntl
$$ ##$ACQT0= 1000000
$$ ##$AMP= (0..31)
$$ 100 100 100 100 100 100 100 100 100 100 100 100 100 100 100 100 100 100
$$ 100 100 100 100 100 100 100 100 100 100 100 100 100 100
$$ ##$AMPCOIL= (0..19)
$$ 0 0 0 0 0 0 0 0 0 0 0 0 0 0 0 0 0 0 0 0
$$ ##$ANAVPT= -1
$$ ##$AQSEQ= 0
$$ ##$AQ_mod= 3
$$ ##$AUNM= <au_zgonly>
$$ ##$AUTOPOS= <53 >
$$ ##$BF1= 400.32
$$ ##$BF2= 100.660544
$$ ##$BF3= 400.32
$$ ##$BF4= 400.32
$$ ##$BF5= 400.32
$$ ##$BF6= 400.32
$$ ##$BF7= 400.32
$$ ##$BF8= 400.32
$$ ##$BYTORDA= 0
$$ ##$CAGPARS= (0..11)
$$ 0 0 0 0 0 0 0 0 0 0 0 0
$$ ##$CFDGTYP= 0
$$ ##$CFRGTYP= 9
$$ ##$CHEMSTR= <none>
$$ [...]
$$ 0 0 0 0
$$ ##$ShimPowMaxUC= (0..63)
$$ 130000 130000 130000 130000 130000 130000 130000 130000 130000 130000 130000
$$ 130000 130000 130000 130000 130000 130000 130000 130000 130000 0 0 0 0
$$ 0 0 0 0 0 0 0 0 0 0 0 0 0 0 0 0 0 0 0 0 0 0 0 0 0 0 0 0 0 0 0 0 0 0 0 0
$$ 0 0 0 0
$$ ##$ShimPowMaxUG= (0..63)
$$ 524287 524287 524287 524287 524287 524287 524287 524287 524287 524287 524287
$$ 524287 524287 524287 524287 524287 524287 524287 524287 524287 0 0 0 0
$$ 0 0 0 0 0 0 0 0 0 0 0 0 0 0 0 0 0 0 0 0 0 0 0 0 0 0 0 0 0 0 0 0 0 0 0 0
$$ 0 0 0 0
$$ ##$ShimPowRcbType= 3
$$ ##$ShimPowRes= (0..63)
$$ 1e-20 1e-20 1e-20 1e-20 1e-20 1e-20 1e-20 1e-20 1e-20 1e-20 1e-20 1e-20
$$ 1e-20 1e-20 1e-20 1e-20 1e-20 1e-20 1e-20 1e-20 0 0 0 0 0 0 0 0 0 0 0 0
$$ 0 0 0 0 0 0 0 0 0 0 0 0 0 0 0 0 0 0 0 0 0 0 0 0 0 0 0 0 0 0 0 0
$$ ##$ShimPowRng0= (0..63)
$$ 1 1 1 1 1 1 1 1 1 1 1 1 1 1 1 1 1 1 1 1 0 0 0 0 0 0 0 0 0 0 0 0 0 0 0 0
$$ 0 0 0 0 0 0 0 0 0 0 0 0 0 0 0 0 0 0 0 0 0 0 0 0 0 0 0 0
$$ ##$ShimPowRng1= (0..63)
$$ 1 1 1 1 1 1 1 1 1 1 1 1 1 1 1 1 1 1 1 1 0 0 0 0 0 0 0 0 0 0 0 0 0 0 0 0
$$ 0 0 0 0 0 0 0 0 0 0 0 0 0 0 0 0 0 0 0 0 0 0 0 0 0 0 0 0
$$ ##$ShimPowRng2= (0..63)
$$ 1 1 1 1 1 1 1 1 1 1 1 1 1 1 1 1 1 1 1 1 0 0 0 0 0 0 0 0 0 0 0 0 0 0 0 0
$$ 0 0 0 0 0 0 0 0 0 0 0 0 0 0 0 0 0 0 0 0 0 0 0 0 0 0 0 0
$$ ##$ShimPowRng3= (0..63)
$$ 1 1 1 1 1 1 1 1 1 1 1 1 1 1 1 1 1 1 1 1 0 0 0 0 0 0 0 0 0 0 0 0 0 0 0 0
$$ 0 0 0 0 0 0 0 0 0 0 0 0 0 0 0 0 0 0 0 0 0 0 0 0 0 0 0 0
$$ ##$ShimSysFunc= (0..63)
$$ 1 2 3 4 5 7 9 11 15 16 8 10 12 14 6 17 13 18 19 20 0 0 0 0 0 0 0 0 0 0
$$ 0 0 0 0 0 0 0 0 0 0 0 0 0 0 0 0 0 0 0 0 0 0 0 0 0 0 0 0 0 0 0 0 0 0
$$ ##$ShimSysMatrix= 0
$$ ##$ShimSysType= 1
$$ ##$TFXNUM= 0
$$ ##$TRIPLO2= 0
$$ ##$VTU= 2
$$ ##$VTUETH= <149.236.99.20>
$$ ##$VTUTY= <no>
$$ ##$WBREFAM= (0..15)
$$ 132.2 106.2 100 100 100 100 100 100 100 100 100 100 100 100 100 100
$$ ##$WBREFLM= (0..15)
$$ 0 0 0 0 0 0 0 0 0 0 0 0 0 0 0 0
$$ ##$WBREFPH= (0..15)
$$ 77.55 -65.76 0 0 0 0 0 0 0 0 0 0 0 0 0 0
$$ ##$WBSGU= (0..15)
$$ 0 0 0 0 0 0 0 0 0 0 0 0 0 0 0 0
$$ ##$XFAC= 2
$$ ##END=
$$ 
##$DECIM=	4160
##$DSPFVS=	20
##.ACQUISITIONSCHEME=	NOT PHASESENSITIVE
##NTUPLES=	nD NMR SPECTRUM
##VAR_NAME=	FREQUENCY1,	FREQUENCY2,	SPECTRUM
##SYMBOL=	F1,	F2,	Y
##.NUCLEUS=	13C,	1H
##.OBSERVE FREQUENCY=	100.66910027424999896,	400.32200160000002143
##VAR_TYPE=	INDEPENDENT,	INDEPENDENT,	DEPENDENT
##VAR_FORM=	AFFN,	AFFN,	ASDF
##VAR_DIM=	512,	512,	262144
##UNITS=	HZ,	HZ,	ARBITRARY UNITS
##FIRST=	17614.246348710370512,	4405.4455391999963467,	0.25172278285026550293
##LAST=	-466.31298099976766025,	-392.85674445383250486,	0.848880767822265625
##MIN=	-466.31298099976766025,	-392.85674445383250486,	0.00039172309334389865398
##MAX=	17614.246348710370512,	4405.4455391999963467,	93.6995697021484375
##FACTOR=	1,	1,	0.0040447506280366744835
##PAGE=	F1=17614.2
##FIRST=	17614.246348710370512,	4405.4455391999963467,	0.25172278285026550293
##DATA TABLE=	(F2++(Y..Y)), PROFILE
$$ [...]
##PAGE=	F1=8980.87
##FIRST=	17614.246348710370512,	4405.4455391999963467,	0.49325123429298400879
##DATA TABLE=	(F2++(Y..Y)), PROFILE
-261 261 525 285 182 54 200 198 169 27 40 92 85 211 135 81
-393H1
##PAGE=	F1=8910.1
##FIRST=	17614.246348710370512,	4405.4455391999963467,	0.22308160364627838135
##DATA TABLE=	(F2++(Y..Y)), PROFILE
4405 20 123 65 16 108 164 30 319 315 136 229 166 13 251 274 90 77 78 157 247 208 258 376 269 61 159 19 318 230 90 80
4124 80 139 242 290 329 124 47 120 137 34 73 8 83 126 125 82 57 132 215 173 76 164 357 223 46 77 59 64 81 132 58 29 171 159
3814 159 86 87 123 140 169 193 254 247 143 63 178 188 417 153 214 212 116 219 243 108 27 44 206 37 253 268 231 53 217 76
3532 76 83 192 172 130 63 69 46 21 36 48 143 338 204 111 80 177 243 143 146 152 147 138 196 23 174 152 153 39 49 216 84 246 265 260
3213 260 109 99 113 156 13 75 43 53 158 48 77 121 100 17 154 286 23 265 130 143 103 213 90 104 221 198 271 155
2950 155 96 160 38 105 127 24 389 191 792 232 48 57 102 55 174 186 63 134 224 265 141 228 40 94 181 155 124 198 120 39
2668 39 60 102 191 200 45 143 196 62 167 202 205 46 153 89 11 131 41 105 132 121 113 208 72 127 153 139 117 181 220 139 199 252 39
2358 39 79 26 183 251 239 32 157 145 59 91 148 147 240 123 123 144 49 42 185 280 227 230 206 50 47 151 234 206 116 105 91 227 233 36
2039 36 52 121 95 51 114 114 190 161 123 148 53 138 117 55 168 14 84 76 38 50 260 257 170 100 197 145 130 75 104 74 138 83 35 185 224
1711 224 237 207 62 81 194 275 58 263 157 65 85 110 121 56 136 123 149 240 113 161 164 206 97 73 221 228 14 37 73 76 193
1419 193 46 20 32 106 160 97 88 77 112 131 189 228 126 35 85 161 236 177 129 138 92 81 74 81 15 133 194 156 117 134 148 81 140 157 126
1091 126 234 181 41 140 123 112 123 99 108 38 89 58 293 227 148 168 140 187 62 207 222 128 88 46 139 190 79 73 37 95 165 120 85
781 85 87 91 75 110 178 187 104 114 161 116 247 169 12 59 34 0 173 149 72 88 194 200 112 124 240 250 237 181 55 49 118 97 90 141 321
452 321 101 119 29 41 131 219 150 218 160 90 82 161 68 73 276 242 244 217 164 218 155 64 131 95 174 57 99 179 157 92 140 184 27 243
133 243 166 50 110 144 55 200 125 13 122 178 151 99 184 107 76 58 68 57 92 73 70 30 120 104 175 19 148 139 153 77 114 63 45
-177 45 55 116 105 99 115 37 90 116 262 558 265 125 103 192 178 183 100 49 122 68 181 56 105
-393A05
##PAGE=	F1=8839.34
##FIRST=	17614.246348710370512,	4405.4455391999963467,	0.19425095617771148682
##DATA TABLE=	(F2++(Y..Y)), PROFILE
4405 6 146 100 45 129 185 40 335 274 116 182 115 32 218 257 132 71 112 137 232 168 243 391 318 111 171 13 290 233 100 88
4124 88 147 225 310 395 122 33 143 84 43 53 12 61 147 189 49 60 175 226 154 97 140 328 239 52 89 106 105 93 147 103 49 201
3823 201 184 45 125 100 88 165 211 244 248 160 54 145 153 338 137 236 231 130 251 234 103 64 49 174 64 235 233 219 108 257 71
3532 71 92 167 184 88 42 46 56 28 8 75 90 301 154 125 134 116 202 139 195 152 133 118 171 22 198 170 151 70 62 193 126 227 268 323
3213 323 207 76 58 147 23 125 65 74 127 51 101 148 77 47 121 289 13 238 167 102 63 251 74 121 194 144 230 111 33 123
2931 123 40 110 136 172 527 410 1352 396 106 12 152 32 152 214 21 126 202 220 133 252 58 82 129 91 51 235 152 55
2668 55 80 131 138 190 53 112 159 86 140 202 226 130 102 112 39 103 12 113 90 118 136 234 97 107 139 180 94 142 197 136 208 222 116 95
2349 95 88 197 205 244 19 139 124 33 119 166 160 256 131 202 168 70 25 181 320 227 253 225 57 65 132 236 181 60 113 156 171 248 74
2039 74 62 146 87 95 134 167 192 161 92 177 57 97 142 65 107 28 73 115 122 63 245 241 174 86 197 134 133 79 124 46 160 130 18 190
1720 190 163 258 239 97 105 233 265 89 276 103 80 80 132 142 18 101 135 170 221 105 133 169 215 107 86 189 181 55 117 125 112 224
1419 224 55 8 9 44 127 94 88 120 143 102 156 197 138 27 89 196 183 86 129 146 129 65 93 90 7 137 200 171 127 80 162 69 186 112
1100 112 165 248 147 8 110 101 82 111 79 63 17 106 44 275 228 102 155 146 186 141 177 141 96 103 51 140 169 61 74 58 136 178 127
790 127 99 89 75 63 118 212 197 51 97 180 137 248 170 45 51 17 17 165 131 36 100 228 206 107 102 250 271 230 170 35 65 121 97
480 97 83 146 321 121 92 95 99 150 265 152 186 168 109 90 183 119 74 276 217 230 210 132 233 218 117 124 125 185 89 95 205 161 63 117
161 117 223 19 250 198 70 69 95 88 258 167 62 124 151 157 84 153 87 109 73 78 56 83 55 76 64 98 106 207 22 156 143 197 104
-149 104 99 101 104 95 157 123 75 137 40 144 108 243 546 246 69 132 170 137 178 165 92 164 69 149 53 131
-393A31
##PAGE=	F1=8768.57
##FIRST=	17614.246348710370512,	4405.4455391999963467,	0.39132171869277954102
##DATA TABLE=	(F2++(Y..Y)), PROFILE
4405 19 161 130 75 147 210 93 319 219 101 131 64 45 166 225 181 45 145 114 198 140 224 371 343 162 159 14 245 224 134 87
4124 87 150 187 306 445 121 25 160 46 53 103 23 66 170 236 20 55 206 241 123 142 118 267 233 98 96 135 138 102 147 139 88 223
3823 223 194 51 158 66 15 130 224 215 241 173 55 104 108 239 104 268 256 156 255 205 102 103 88 152 113 195 191 202 138 277 82
3532 82 94 146 204 45 88 19 67 39 21 97 40 248 101 139 179 48 147 154 245 156 134 128 130 48 206 183 144 94 69 172 179 201 262 357
3213 357 321 61 44 127 64 169 103 77 70 49 113 129 62 95 109 286 54 186 173 89 20 268 79 136 153 90 162 96 99 70 42 92
2912 92 132 213 482 332 1158 344 137 34 172 52 128 222 43 112 186 181 126 269 95 64 85 26 38 260 163 76 130 156 100 183
2631 183 66 77 118 98 99 196 275 225 54 135 71 107 51 111 56 108 149 262 127 135 123 202 65 87 155 108 205 184 174 109 155 205 147
2321 147 216 57 112 87 4 153 182 176 240 146 257 180 114 80 159 326 217 255 222 74 82 115 208 127 39 107 197 120 247 107 61 160
2020 160 67 140 159 190 170 154 80 192 62 70 158 96 48 49 75 167 200 101 217 216 184 74 186 108 126 79 130 37 175 144 7 176
1720 176 109 278 245 126 126 238 226 112 279 57 92 55 141 146 42 76 148 180 182 93 100 154 201 103 91 144 121 76 205 174 133 242
1419 242 79 40 36 34 87 91 148 193 176 78 128 157 145 37 132 214 123 24 130 154 176 40 108 116 28 140 174 155 143 34 163 59 223
1110 223 70 199 251 103 32 74 72 44 86 55 31 45 141 54 249 211 44 128 140 191 214 174 87 63 104 76 142 143 35 72 94 174 203
800 203 137 102 92 53 59 128 231 186 17 121 193 147 218 173 89 42 6 30 143 113 36 125 263 193 97 105 276 305 226 166 78 102 133
490 133 92 68 130 284 128 99 163 167 167 294 153 150 185 124 110 188 162 76 257 186 204 188 102 234 260 159 104 161 184 147 96 206 155
180 155 24 72 235 62 251 211 92 44 46 101 295 200 107 143 126 156 68 127 67 120 100 100 64 116 14 91 106 56 100 220 27 157
-121 157 149 233 117 75 150 176 135 169 132 58 165 76 178 98 210 489 230 53 144 135 95 160 212 144 204 103 134 130 153
-393A53
##PAGE=	F1=8697.81
##FIRST=	17614.246348710370512,	4405.4455391999963467,	0.51731103658676147461
##DATA TABLE=	(F2++(Y..Y)), PROFILE
4405 23 159 149 106 153 228 122 277 165 94 94 31 39 100 192 219 35 173 91 146 126 196 320 339 201 132 18 193 210 163 83 144
4114 144 130 280 467 123 25 164 33 56 183 31 84 185 260 63 48 219 254 90 197 99 179 208 152 106 138 151 113 129 164
3842 164 127 235 190 80 182 40 92 87 225 169 228 183 81 78 57 177 57 299 280 185 231 157 112 140 120 138 165 165 155 180 143 282
3542 282 118 100 141 220 19 129 12 91 41 61 91 17 190 64 135 219 45 97 170 272 149 140 148 77 81 186 190 138 105 73 154 215
3241 215 170 244 357 413 94 128 108 110 196 146 88 11 46 111 175 213 129 136 275 107 119 149 91 20 261 102 140 113 99 87 117 141 92
2931 92 35 72 99 29 316 334 404 134 98 13 142 122 114 205 55 94 195 172 124 271 141 64 86 73 68 256 147 96 191 173 94 173
2631 173 79 78 98 96 55 174 325 312 52 148 88 133 108 100 52 102 146 287 167 175 92 194 34 30 99 57 195 150 199 122 217 208 99
2321 99 156 79 93 52 36 186 189 187 196 183 276 176 151 138 123 302 201 239 204 96 91 100 168 57 117 115 202 83 236 136 55 164 41
2011 41 176 164 172 128 153 84 193 83 70 164 134 10 53 80 194 256 151 190 189 197 68 172 75 113 84 123 54 163 125 26 145 89
1711 89 287 231 140 135 213 175 130 277 31 82 26 129 135 69 70 146 175 137 90 94 118 171 97 94 94 69 67 252 194 137 247 114 79 64 73 47
1372 47 82 198 259 203 62 114 119 144 65 187 216 66 61 125 161 222 53 117 165 59 137 124 112 156 63 142 55 244 70 225 238 53
1072 53 71 40 41 35 47 55 24 99 184 68 218 180 33 93 130 187 269 204 133 93 94 96 136 115 42 70 136 197 223 129 92 92 34 60 141 232 167
725 167 88 169 205 138 161 173 128 36 30 31 108 102 76 139 290 169 88 132 305 332 222 166 129 140 145 97 43 100 212 117 138 227 233 180 306
396 306 151 112 199 123 139 174 188 79 222 154 170 153 84 212 277 183 92 193 168 194 95 186 132 34 56 217 91 249 200 105 44
105 44 22 98 307 221 137 165 104 142 55 115 66 108 136 130 72 164 41 105 153 23 85 212 29 150 155 250 106 44 171 231 165 154 130
-205 130 63 185 120 194 96 172 394 216 86 147 96 98 143 237 190 232 150 148 195 172
-393A72
##PAGE=	F1=8627.04
##FIRST=	17614.246348710370512,	4405.4455391999963467,	0.36373853683471679688
##DATA TABLE=	(F2++(Y..Y)), PROFILE
4405 24 138 150 135 142 234 131 221 128 92 86 27 42 25 168 230 63 201 82 84 118 159 246 307 222 102 16 148 197 165 80 133 60 242
4096 242 454 127 29 157 30 97 257 40 100 194 263 111 57 214 256 73 243 81 78 168 199 122 119 142 131 99 176 155 235 177
3814 177 104 196 44 185 68 210 112 208 187 113 77 39 201 19 316 293 204 184 97 137 174 149 127 205 183 137 158 129 272 160
3532 160 112 148 223 20 137 37 125 41 111 62 46 138 66 116 258 103 65 174 263 123 149 162 23 104 136 189 137 101 86 136 220
3241 220 143 215 328 450 118 187 110 152 199 184 122 78 49 95 272 345 136 194 250 150 48 104 104 50 228 125 144 101 150 86 149
2950 149 150 215 83 107 17 538 1042 1643 3363 956 227 143 123 229 115 169 41 83 233 192 131 256 189 96 113 143 68 224
2687 224 113 108 247 174 117 152 85 132 110 83 17 133 356 377 75 149 86 155 161 83 68 116 125 305 210 197 49 161 19 63 34 36
2387 36 184 126 184 133 264 203 94 79 86 97 53 69 208 183 190 143 235 261 164 173 186 95 251 185 212 179 116 93 78 145 11 190 148
2077 148 171 64 216 158 51 162 19 196 148 115 72 164 96 188 129 92 162 167 34 47 85 187 277 203 170 160 209 74 164 46
1795 46 101 96 115 71 121 82 63 114 123 278 211 136 125 168 131 139 275 30 54 42 102 111 81 76 125 153 97 97 127 72 130 101 101 51 49 32 245
1448 245 180 120 237 150 116 82 96 20 63 224 298 212 57 117 96 133 105 241 204 26 84 111 165 261 103 130 229 88 131 64 57 170
1147 170 121 98 58 241 95 236 211 32 101 24 43 67 7 88 26 160 221 70 184 146 86 60 126 168 301 239 199 165 89 104 115
856 115 89 80 73 176 196 223 100 68 87 35 63 158 218 158 149 214 219 112 87 161 161 34 50 18 64 100 105 137 299 141 78 160 322 337 209
527 209 164 164 168 148 118 12 65 130 92 176 278 280 180 300 142 77 202 108 167 151 192 80 179 126 136 110 81 162 266 192 96 215
227 215 140 219 84 160 92 65 96 168 99 244 169 114 38 36 91 293 227 144 174 87 114 45 113 84 81 175 163 76 202 99 113 200 55
-83 55 68 187 26 132 155 241 70 1 158 253 178 120 120 77 195 147 196 105 132 275 202 119 150 67 151 130 244 221 242 192 178 237
-383 237 188
-393A88
##PAGE=	F1=8556.28
##FIRST=	17614.246348710370512,	4405.4455391999963467,	0.091839529573917388916
##DATA TABLE=	(F2++(Y..Y)), PROFILE
4405 38 104 135 160 117 226 127 168 118 90 112 59 89 53 156 206 84 228 91 22 108 115 164 252 218 85 15 128 183 135 76 123 13
4105 13 198 403 126 33 142 38 164 305 42 105 201 249 147 93 198 241 77 268 68 31 123 230 138 97 120 162 71 175
3842 175 165 218 166 123 201 65 260 75 175 59 182 185 138 82 70 247 58 311 291 202 125 36 166 201 182 121 223 233 135 138
3560 138 108 247 190 121 150 213 13 103 53 154 56 160 53 68 104 88 106 292 151 51 161 218 95 163 168 27 108 64 178
3288 178 143 84 115 117 188 131 179 284 412 98 208 129 187 179 208 171 143 61 77 310 374 124 263 207 169 24 52 150 78 176 147 171
2988 171 129 192 154 188 157 366 186 191 125 1388 2398 3634 7722 2194 610 362 262 358 121 131 43 102 285 228 148 224
2743 224 227 130 128 199 56 175 95 109 284 157 157 124 74 202 140 62 5 80 359 412 85 136 67 160 200 60 84 147 85 313 246 192
2443 192 36 117 46 130 33 105 176 107 134 139 289 189 126 61 78 119 79 95 214 160 181 121 281 227 158 178 215 98 186 169 188 158
2142 158 131 95 43 144 49 239 186 115 66 187 167 43 159 19 196 122 34 13 180 108 184 187 119 157 187 37 35 89 154 265 246
1851 246 162 132 213 95 159 37 97 105 127 87 57 61 103 115 175 245 195 114 93 120 105 142 276 45 53 74 86 81 80 81 86 118 65 106 164 52
1513 52 87 122 114 21 56 54 189 147 84 211 180 142 84 95 26 31 224 302 196 55 134 100 113 149 288 186 18 77 94 160 287 156
1213 156 157 292 108 121 26 33 190 174 40 64 215 107 228 172 70 113 26 82 96 49 128 21 217 240 57 149 128 126 47 132 137
922 137 306 255 238 232 105 97 83 71 113 78 208 167 200 61 42 79 54 65 176 193 168 191 243 236 83 15 129 184 33 61 27 21 101
612 101 114 133 285 114 64 174 317 315 182 150 174 178 139 143 21 33 115 74 196 307 295 159 279 126 48 192 92 187 130 181
330 181 80 136 106 109 69 86 93 226 189 97 228 105 216 61 149 43 78 130 96 88 231 126 126 8 39 95 259 219 130 161 80 75
30 75 39 110 102 50 206 191 78 224 146 115 236 84 55 158 28 105 150 209 17 56 129 233 170 76 101 87 201 143 189 117 90 149
-271 149 189 140 160 61 210 119 244 235 233 219 205 254 199
-393A99
##PAGE=	F1=8485.51
##FIRST=	17614.246348710370512,	4405.4455391999963467,	0.13220110535621643066
##DATA TABLE=	(F2++(Y..Y)), PROFILE
4405 66 74 105 176 94 207 118 125 126 81 161 116 156 118 146 153 85 244 103 44 92 69 95 180 189 88 36 137 159 81 74 117 72 153 319 117
4077 117 43 125 72 225 316 33 92 208 226 167 140 183 209 92 265 65 106 81 240 144 100 112 211 64 160 158 182 163 140 199 84
3786 84 305 73 126 55 150 173 148 95 96 254 93 281 272 175 78 29 186 221 219 131 216 276 137 125 88 204 197 117 141 194 43 30 57
3476 57 164 93 195 103 75 92 106 120 314 182 48 130 148 100 176 169 66 93 25 158 149 62 153 97 129 139 143 240 310 84 213 141
3175 141 215 147 212 222 190 80 66 266 284 131 330 152 161 67 22 228 112 118 172 225 168 217 206 252 194 516 317 285 317 2429
2894 2429 4054 6054 12773 3627 1119 634 478 485 122 122 96 150 331 273 171 182 239 141 130 235 91 133 131 96 294 120
2650 120 206 118 47 264 174 42 7 28 335 413 74 111 38 148 217 33 108 175 34 306 268 164 78 75 83 191 80 174 173 91 68
2358 68 138 286 162 154 132 60 135 93 115 202 122 159 149 304 199 170 168 222 119 116 156 177 148 139 103 30 139 53 259 208 50 85 153
2049 153 155 25 158 33 177 107 64 48 189 114 187 236 135 153 188 17 23 87 109 227 268 160 110 204 126 153 48 100 99 159 110
1757 110 39 105 139 141 217 191 185 77 54 83 88 141 277 68 97 92 116 67 72 82 38 77 39 113 183 90 75 154 127 2 67 121 109 135 35
1429 35 171 198 152 73 72 62 20 208 273 154 49 153 124 88 186 326 171 28 46 81 144 295 195 190 342 116 112 44 69 213
1147 213 217 35 71 169 102 204 127 101 106 21 121 112 89 163 17 262 236 30 113 141 143 58 141 102 286 243 242 274 129 80 61 62 133 81
828 81 232 132 157 48 40 73 76 64 192 166 188 211 249 252 80 68 74 195 27 59 69 46 97 100 144 248 86 46 172 287 268 141
527 141 124 161 170 123 157 38 24 183 92 190 308 271 119 243 108 28 171 103 198 119 165 80 106 96 94 60 85 33 169 178 77 238
227 238 73 187 42 162 26 73 134 25 61 208 79 144 49 25 110 213 196 100 124 86 34 37 99 111 33 221 204 81 230 173
-55 173 113 255 94 51 138 49 80 142 164 49 121 142 177 148 31 74 91 213 111 175 121 49 45 177 149 171 70 256 100 242
-337 242 234 209 228 219 248 203
-393B03
##PAGE=	F1=8414.74
##FIRST=	17614.246348710370512,	4405.4455391999963467,	0.042109008878469467163
##DATA TABLE=	(F2++(Y..Y)), PROFILE
4405 99 78 69 177 93 183 107 91 136 61 215 180 223 162 132 85 69 242 100 86 69 29 71 101 139 106 70 154 120 57 86 116 110 108 214
4086 214 97 68 102 114 261 286 11 61 212 201 171 183 181 167 116 237 74 158 49 226 136 122 141 278 90 132 147 133 166 155
3804 155 196 98 318 59 72 97 116 150 144 127 105 208 104 229 241 127 87 64 189 232 258 162 190 288 134 120 75 151 181 99 127
3513 127 171 100 69 51 149 143 206 158 66 94 117 143 314 200 46 87 71 140 178 167 94 69 99 128 146 51 191 72 59 154 119 209 180
3204 180 185 232 131 231 116 195 266 214 95 65 203 119 183 386 106 147 88 52 316 151 90 199 284 190 230 223 338 239 639 454
2922 454 368 532 3456 5683 8455 17504 4969 1649 901 693 580 124 149 149 201 360 317 194 145 214 121 145 251 157 124
2687 124 184 73 274 69 259 166 36 301 204 40 14 37 290 385 49 82 29 122 208 22 144 189 21 286 274 123 114 53
2424 53 122 236 103 225 172 85 57 129 255 124 165 194 36 133 89 134 186 93 129 190 296 191 189 147 207 131 49 146 180 144 137 119
2124 119 89 110 30 252 207 7 113 123 122 2 155 51 147 113 138 90 185 107 193 262 127 154 170 33 21 87 65 179 263 158
1842 158 97 181 155 140 67 110 75 195 141 99 153 166 157 235 125 171 36 65 65 69 142 275 97 146 91 172 93 65 87 27 37 29 124 178
1523 178 133 117 182 134 10 88 179 72 166 47 124 203 144 56 37 126 69 186 225 91 41 161 147 64 205 353 162 46 6 78
1241 78 120 286 214 214 367 116 117 47 97 231 247 88 76 119 97 167 85 109 90 2 150 115 118 193 28 285 208 7 76 174 139 71
941 71 151 77 244 203 219 283 142 68 71 50 135 78 246 138 104 82 66 73 98 61 205 144 206 215 230 260 108 129 47 188 14 44 113
631 113 94 83 68 162 189 60 34 157 238 207 95 91 146 145 106 152 41 49 242 125 162 280 212 82 197 96 19 142 146 201 116 156
330 156 79 95 97 93 91 74 77 123 163 34 249 61 134 64 180 56 66 107 68 27 173 37 160 118 4 123 166 158 63 71 102 5 35
20 35 82 107 40 217 198 88 227 176 112 254 90 50 138 88 74 137 126 103 183 207 107 126 54 41 96 229 90 163 112 20 77 168
-280 168 144 173 88 280 70 238 226 175 220 216 226 197
-393A97
##PAGE=	F1=8343.98
##FIRST=	17614.246348710370512,	4405.4455391999963467,	0.34036204218864440918
##DATA TABLE=	(F2++(Y..Y)), PROFILE
4405 130 100 36 161 109 157 99 58 140 34 254 231 275 181 113 24 44 218 72 109 43 22 85 24 78 128 105 165 67 121 119 117 123 69 102
4086 102 73 109 68 146 259 219 19 22 210 178 158 209 193 133 148 194 86 177 30 192 123 139 191 355 135 93 154 92 165 163 197 106
3786 106 302 51 40 132 83 118 129 172 103 121 87 166 200 76 133 78 172 234 296 202 150 265 124 118 69 104 147 77 115 148 159 176 42
3476 42 112 191 188 193 43 97 123 152 292 210 37 37 13 181 162 165 110 71 155 90 130 73 219 44 22 164 111 195 77 307 257 100
3175 100 224 102 166 298 215 101 65 210 72 246 427 106 163 84 79 392 187 120 218 326 181 238 200 427 258 712 570
2922 570 423 723 4234 6905 10273 20810 5909 2066 1096 854 617 142 181 179 233 367 346 206 135 152 80 192 250 214
2696 214 133 220 50 229 31 309 242 85 302 223 57 46 73 237 337 30 64 59 91 172 44 177 181 68 255 269 92 132
2434 132 64 161 260 94 253 171 96 112 114 200 77 157 225 32 111 74 158 187 118 108 220 262 193 199 125 173 128 7 138 186 139 127
2133 127 141 152 58 68 231 191 40 143 121 73 30 145 73 119 124 178 110 167 90 196 257 88 160 144 78 41 111 27 132 230 146 95
1833 95 147 170 120 95 128 35 220 172 141 178 179 146 229 58 149 35 115 58 58 144 267 125 181 71 230 148 62 108 82 7 44 142 155
1523 155 159 171 193 130 19 118 211 106 203 113 87 197 120 44 42 210 121 166 180 21 33 148 156 46 202 366 158 70 45 83 94
1232 94 262 209 218 364 119 144 27 104 238 259 122 75 100 113 124 61 93 88 24 164 109 137 215 42 280 158 49 39 208 119
950 119 72 156 73 189 146 185 260 136 79 95 34 121 71 250 190 50 117 92 75 119 61 214 130 220 208 190 254 137 175 124 162 11
649 11 19 145 134 59 34 169 112 38 32 133 181 147 60 68 161 114 96 130 58 89 258 140 121 229 131 89 147 93 16 111 193 198 118 157 76
321 76 105 108 102 127 53 127 125 153 35 258 72 60 105 187 71 79 59 124 8 131 7 167 188 42 124 124 110 32 22 120 23 34 65 90
2 90 50 199 172 103 219 161 109 238 87 55 156 137 93 133 108 135 225 272 92 124 118 43 105 236 133 168 90 38 135 157 124 160 117
-308 117 283 36 228 218 139 201 198 196 181
-393A81
##PAGE=	F1=8273.21
##FIRST=	17614.246348710370512,	4405.4455391999963467,	0.4750207066535949707
##DATA TABLE=	(F2++(Y..Y)), PROFILE
4405 154 114 23 127 116 134 99 25 136 26 261 254 303 176 93 31 26 179 20 116 24 64 92 45 19 142 131 165 20 190 157 117
4114 117 119 48 30 63 154 27 158 221 131 48 41 197 158 127 213 204 126 176 148 93 168 21 144 120 141 243 432 184 48 184 97
3823 97 153 159 200 106 267 58 65 148 55 78 107 210 100 44 54 103 154 60 172 72 142 229 327 235 107 213 110 115 67 88 113 78
3523 78 105 126 205 269 39 75 223 141 199 24 98 127 140 253 215 23 16 38 202 127 161 116 107 185 47 101 111 232 25 57 162
3232 162 112 192 48 384 279 74 184 107 135 312 198 92 64 243 169 285 448 137 210 66 95 441 213 163 219 342 137
2978 137 238 145 492 235 722 639 441 841 4571 7378 10958 21797 6202 2241 1164 921 586 177 198 177 230 353
2772 353 349 201 155 73 79 251 236 241 130 226 50 176 66 349 308 142 264 226 73 86 100 190 280 46 68 90 65 117 59 193
2490 193 152 99 221 261 103 135 93 198 261 59 259 166 116 155 97 132 30 132 222 62 74 60 183 215 178 112 234 213 192 190
2208 190 109 127 114 49 132 183 127 124 162 199 34 146 213 181 47 169 151 39 58 126 91 99 125 178 104 142 66 190 222 29 175 124
1908 124 110 76 162 13 97 177 119 101 110 164 89 132 152 31 234 194 150 170 173 120 210 7 118 71 152 51 74 144 252 145 201 41
1607 41 280 212 63 143 144 40 58 158 124 163 208 177 115 23 142 214 118 211 174 94 183 87 47 90 299 165 157 159 40 32 115 145 38
1297 38 176 366 161 88 83 94 78 227 183 197 329 124 183 42 92 227 249 127 66 128 142 82 74 63 110 49 167 102 147 225 50
1006 50 246 96 94 26 233 94 58 155 75 132 88 150 216 111 104 110 34 101 70 242 242 14 137 115 75 138 72 222 124 230 198 139
706 139 237 152 202 211 117 35 20 155 157 39 54 155 31 23 34 104 126 104 63 74 204 96 88 105 117 141 225 123 78 166 58 123 99
396 99 95 13 87 224 186 124 162 72 129 127 112 148 28 148 151 158 105 260 92 28 146 184 67 105 20 154 39 91 21 160 245 84
95 84 112 94 67 44 49 135 26 37 56 67 58 179 132 121 210 136 92 216 103 75 186 186 118 123 100 139 235 300 144 142 182 92 113 227 198
-233 198 196 67 62 159 138 89 134 152 269 19 207 209 108 179 168 166 155
-393A55
##PAGE=	F1=8202.45
##FIRST=	17614.246348710370512,	4405.4455391999963467,	0.35345426201820373535
##DATA TABLE=	(F2++(Y..Y)), PROFILE
4405 164 108 47 80 100 115 109 9 125 52 228 248 304 157 79 53 20 147 55 117 34 116 81 96 28 136 137 157 44 237 180 111 111
4105 111 54 100 77 191 60 146 160 57 65 79 175 143 83 195 201 142 189 109 92 142 18 91 135 134 288 497 224 27 218 134 129 137
3804 137 202 95 226 57 100 140 30 36 82 230 102 114 65 57 104 83 194 62 113 217 342 246 68 146 93 111 66 100 97 116 87
3513 87 107 227 333 41 76 225 77 179 46 93 133 111 214 216 55 66 45 202 89 149 109 143 191 26 67 143 227 38 74
3241 74 147 115 194 89 389 323 100 114 111 110 301 168 70 65 227 181 282 445 158 256 66 103 455 229 186 198 330 72 226
2969 226 78 513 178 669 642 425 850 4372 6902 10130 20059 5742 2085 1080 877 495 210 195 150 188 320 322 177
2753 177 184 58 141 296 211 232 102 206 65 138 114 372 342 183 191 211 82 125 122 160 224 69 82 111 61 55 54 179 111 107 190 256 142
2443 142 135 126 232 243 50 250 153 130 170 79 70 31 89 187 97 31 63 200 252 235 132 235 169 193 161 104 78 102 79 128 165 111 144
2133 144 173 218 88 220 213 192 34 190 187 71 79 98 96 79 113 140 75 118 38 173 171 84 200 126 119 118 219 50 74 116 80 113 78 140
1814 140 60 171 173 84 237 199 127 129 149 121 197 43 85 102 162 47 103 139 231 155 203 18 320 275 61 177 206 83 65 159 97
1523 97 146 215 129 96 18 152 198 78 184 219 133 163 58 53 135 370 193 160 155 81 42 79 119 34 133 349 168 89 110 112 83 185
1222 185 142 158 266 123 217 96 68 197 215 104 49 168 165 49 107 45 136 63 167 99 146 217 50 187 48 134 65 243 72
950 72 45 146 71 85 51 116 166 78 124 112 51 84 81 219 267 47 134 133 70 151 86 228 126 236 189 96 215 150 208 276 62 58 50 143
631 143 161 59 103 136 71 14 44 76 83 93 90 100 247 107 75 98 198 198 156 73 39 105 67 144 61 95 20 75 229 164 140 164 70 157
311 157 153 116 146 35 142 157 183 171 249 112 121 179 181 63 125 60 159 65 71 41 137 278 122 93 79 74 93 85 146 19 47 58 71 66 164
-17 164 87 134 198 115 55 201 134 109 220 228 136 99 80 119 208 278 185 164 232 146 112 201 243 234 61 75 151 110 48 108 185 246 45 182
-337 182 194 85 156 136 148 120
-393A20
##PAGE=	F1=8131.68
##FIRST=	17614.246348710370512,	4405.4455391999963467,	0.12755803763866424561
##DATA TABLE=	(F2++(Y..Y)), PROFILE
4405 155 81 81 27 62 102 120 25 111 74 160 224 283 136 77 66 19 149 132 122 60 174 63 125 55 104 120 144 70 253 176 95 113 66
4096 66 156 97 209 121 113 98 81 65 105 152 132 39 163 180 155 177 75 83 111 24 41 152 124 324 537 245 65 235 164 102 100 195
3795 195 77 196 39 126 111 14 16 62 232 109 189 124 35 58 102 195 71 104 200 334 230 44 79 79 107 63 110 106 167 61 92
3504 92 220 359 43 106 192 45 146 75 84 140 84 188 211 114 109 25 182 76 127 85 161 183 58 37 157 206 61 77 126 118 194
3213 194 153 333 380 153 49 104 94 265 127 38 68 164 125 239 412 158 277 96 106 438 236 182 157 303 68 197 55
2959 55 481 123 566 574 394 737 3676 5489 7710 15810 4600 1582 857 729 373 219 175 118 114 272 271 136 209 116 200
2725 200 314 177 193 57 169 74 134 149 373 332 201 100 184 84 158 145 151 177 83 91 118 73 9 25 134 69 94 168 255 181 140
2434 140 157 263 213 115 234 133 129 159 57 40 66 32 135 125 32 79 202 272 267 146 227 143 205 119 111 32 100 97 125 134 105 189 170 210
2114 210 131 271 227 216 11 203 208 114 94 67 81 52 87 81 53 103 11 145 129 175 229 144 101 159 262 90 63 64 45 126 55 112 71
1804 71 203 179 133 234 185 85 64 110 166 204 71 59 119 142 59 126 129 209 155 190 40 347 324 52 197 261 127 76 137 81 114
1513 114 192 58 96 13 147 181 13 146 240 174 136 45 53 165 406 199 172 144 96 69 84 89 35 77 315 174 68 131 138 104 145
1222 145 99 114 186 105 231 145 45 154 165 61 34 195 174 54 142 62 148 60 170 106 131 183 47 119 68 161 107 237 55 65
941 65 135 56 60 58 73 124 48 126 104 58 82 98 184 259 86 110 142 61 152 90 230 130 228 182 85 202 135 196 305 4 75 74 130 152
621 152 97 149 140 148 17 70 57 59 104 112 122 267 134 52 111 274 248 92 25 6 55 114 141 32 86 44 74 206 134 161 159 77 181 182
302 182 112 121 77 121 129 217 220 226 135 206 203 184 79 132 98 148 88 80 63 100 281 148 77 85 121 152 106 152 36 63 67 115 76 153 49 136 183
-45 183 106 12 190 165 146 251 252 147 56 42 87 150 206 190 175 258 191 100 165 254 261 76 76 120 75 66 104 208 221 69 162 168 71 135 115
-374 115 144 84
-393H4
##PAGE=	F1=8060.92
##FIRST=	17614.246348710370512,	4405.4455391999963467,	0.032776460051536560059
##DATA TABLE=	(F2++(Y..Y)), PROFILE
4405 129 39 118 22 26 95 120 32 100 84 75 205 251 126 92 87 27 187 202 129 89 228 63 129 61 56 80 128 74 240 143 68 118 71 180
4086 180 108 203 169 66 68 125 49 124 142 118 46 137 149 156 142 39 71 90 37 1 156 112 348 544 238 106 224 174 81 52 177
3795 177 56 190 41 141 80 48 55 56 227 118 226 181 35 53 108 179 89 108 178 296 188 42 24 72 104 60 106 125 214 36
3513 36 78 190 346 44 128 129 106 120 90 72 146 86 177 194 174 139 29 152 91 95 43 154 179 95 30 144 176 83 87 109 129 192 181
3204 181 254 379 195 92 81 93 207 80 21 73 88 52 173 346 149 264 130 107 395 237 151 104 277 144 157 96 403
2950 403 114 437 441 375 525 2639 3378 4009 9896 3005 802 546 517 268 191 147 106 31 218 209 89 222 148 231 304 134
2706 134 138 46 128 68 148 167 353 280 190 53 155 82 182 169 159 145 85 92 108 86 44 26 81 38 66 155 252 210 150 175 289 178 186
2396 186 218 109 111 128 25 46 91 49 101 137 69 99 184 264 267 143 210 131 227 77 127 17 112 105 123 96 122 242 152 190 148 288 241
2086 241 232 9 209 205 141 107 39 48 52 50 25 79 104 44 115 122 248 246 163 78 189 278 121 70 34 47 132 42 102 116 218 163 164 224 156 54
1748 54 16 70 219 219 93 44 120 102 91 137 116 189 151 165 71 355 351 33 193 295 163 104 92 73 78 147 59 128 19 136 175 120
1448 120 148 236 202 107 46 46 176 399 181 190 127 90 103 123 73 47 16 264 170 49 149 168 127 123 65 81 100 68 219 175 43 108
1147 108 116 30 45 203 169 90 169 81 142 44 179 120 103 125 43 62 109 168 139 218 39 101 130 41 53 71 31 99 32 108 93 50 91 111
828 111 150 226 121 77 136 53 142 73 228 134 200 178 97 205 117 168 291 46 82 88 154 145 130 181 163 204 40 108 53 57 121 125 131 254
509 254 154 17 123 325 275 110 89 56 37 144 117 20 65 75 84 161 100 179 151 95 194 206 103 87 129 109 74 245 242 193 160 270
208 270 216 188 104 126 122 133 106 99 94 62 255 158 78 106 164 210 115 155 71 77 82 169 86 137 31 124 162 114 75 177 183 176 271 254 154 14
-130 14 8 64 80 100 155 169 254 216 80 131 235 261 92 69 80 61 132 125 218 199 86 159 131 63 114 116 151 57
-393E7
##PAGE=	F1=7990.15
##FIRST=	17614.246348710370512,	4405.4455391999963467,	0.071332693099975585938
##DATA TABLE=	(F2++(Y..Y)), PROFILE
4405 89 16 156 61 64 91 104 35 99 100 40 203 217 133 116 116 45 234 252 130 119 266 93 107 47 46 39 105 60 206 87 31 118 71 171
4086 171 104 177 193 42 75 137 33 146 148 97 83 139 127 142 90 7 64 94 50 31 139 91 355 513 205 139 183 161 73 11 150
3795 150 41 205 96 147 96 98 96 67 229 124 224 221 52 90 114 149 95 108 152 230 135 52 18 75 106 54 89 148 245 39 60 146
3495 146 301 45 136 66 169 120 87 69 145 117 167 162 218 151 70 120 101 77 24 126 189 126 47 108 149 105 109 109 156 190 122 194 263 213
3175 213 156 47 114 141 38 57 82 24 14 120 256 152 221 150 105 337 230 101 55 269 211 117 126 295 125 320 266 383 289
2903 289 1501 1094 1322 4108 1315 250 270 326 224 123 128 114 55 164 146 58 225 137 226 280 87 81 89 90 51 153 169 315
2640 315 198 159 119 134 82 198 193 173 134 74 90 84 92 67 85 96 43 41 149 240 227 161 171 303 141 237 208 84 83 87 22 44 104 128 131
2311 131 126 97 118 152 228 236 121 185 120 243 55 154 40 136 107 123 62 152 286 122 182 138 270 242 230 12 209 179 149 116 24
2020 24 37 107 28 30 119 118 90 93 139 287 237 173 100 199 263 135 88 27 62 123 37 110 159 215 127 169 204 121 71 95 52 251 227 117 43
1692 43 106 65 126 138 104 174 148 131 104 338 348 26 168 302 184 141 29 66 45 95 143 170 22 126 175 223 194 209 216 97 46
1401 46 47 170 350 146 208 129 83 130 155 80 69 46 201 150 86 162 195 144 134 47 73 34 25 184 180 62 74 102 64 75 195 157 122
1091 122 182 87 122 23 191 135 66 52 39 55 134 154 153 187 24 128 137 39 48 76 62 88 37 73 84 65 101 114 133 185 149 70 112 48 126
762 126 27 227 134 149 175 104 219 105 134 241 81 81 96 218 162 148 196 178 231 72 148 62 74 136 128 122 209 161 23 118 336 271
462 271 171 154 121 63 156 86 48 28 103 104 107 75 186 145 120 194 218 91 89 179 109 42 254 233 153 181 306 217 180 118 115 135 124 120 113 132
124 132 66 206 149 99 129 189 252 115 156 105 82 99 214 91 117 33 99 136 131 143 151 179 191 272 235 166 66 54 63 68 24 93 148 222 217
-205 217 56 107 194 233 94 60 47 85 199 151 216 180 95 166 93 61 93 132 160 61
-393F1
##PAGE=	F1=7919.39
##FIRST=	17614.246348710370512,	4405.4455391999963467,	0.157527923583984375
##DATA TABLE=	(F2++(Y..Y)), PROFILE
4405 48 62 188 84 111 87 75 40 114 146 101 208 187 153 140 137 58 272 274 122 142 277 136 62 24 88 72 75 50 165 29 25 110 77
4096 77 138 86 141 197 96 82 116 34 172 156 64 106 162 132 121 32 51 64 121 61 52 106 60 341 447 163 165 121 136 73 42 125 36 224
3776 224 161 149 151 152 131 89 241 116 193 235 80 122 133 111 81 90 125 141 121 63 43 94 115 42 63 174 254 54 35 97 230 50 139
3466 139 99 209 138 69 76 133 151 149 116 234 143 103 92 95 107 95 82 206 152 74 79 128 125 126 121 198 196 47 175 59 210 198 14 150
3147 150 94 60 106 99 65 37 120 165 167 164 154 101 273 213 45 58 280 250 98 129 189 107 260 80 404 266 600 1645 5328 4916
2865 4916 690 1091 331 316 222 22 142 124 102 118 85 68 218 91 193 256 42 31 124 56 34 136 157 267 108 121 183 125
2603 125 86 207 213 186 141 55 93 52 89 81 139 164 90 47 144 215 236 172 140 300 104 259 204 67 67 48 86 22 100 202 187 92 113
2293 113 134 116 179 181 85 154 104 240 66 189 49 169 105 120 49 176 314 87 195 115 223 225 208 11 205 139 139 118 32 80
2011 80 175 69 40 142 130 130 86 152 286 198 169 163 183 227 126 105 39 55 97 38 116 184 197 78 147 174 90 102 170 65 253 226 148
1701 148 52 77 61 152 131 97 163 154 93 139 292 314 59 130 280 185 171 44 56 23 63 211 204 14 121 165 290 234 168 215 129 49
1401 49 71 153 275 112 220 159 93 140 161 90 95 103 134 112 146 165 214 150 175 47 93 48 36 138 166 85 62 121 101 107 177 142 137 175 77
1072 77 105 17 196 141 30 40 48 77 139 125 144 149 28 137 151 45 43 81 121 83 60 39 85 125 105 108 140 152 167 101 73 48 119 45 235
743 235 131 82 171 96 238 111 110 171 92 75 112 292 196 154 189 168 230 107 184 80 100 146 125 97 145 154 60 99 302 235 212 193 190
433 190 106 156 62 90 26 121 130 72 64 178 148 148 182 210 80 134 219 104 87 235 197 113 194 315 204 154 111 108 146 118 130 116 172 112
114 112 145 128 128 148 189 266 107 160 130 74 115 242 86 101 44 68 108 142 191 110 153 191 256 201 184 117 89 68 133 131 25 117 170 193
-205 193 34 91 143 179 78 53 34 116 248 165 207 163 98 165 70 65 73 147 166 84
-393H4
##PAGE=	F1=7848.62
##FIRST=	17614.246348710370512,	4405.4455391999963467,	0.23031614720821380615
##DATA TABLE=	(F2++(Y..Y)), PROFILE
4405 25 102 209 93 141 78 45 51 147 218 151 201 158 177 153 139 58 298 269 105 153 260 180 14 53 110 136 55 60 127 56 68 99 97 96
4086 96 60 110 199 177 88 78 43 193 156 22 106 182 155 100 19 91 64 162 76 65 68 47 305 351 153 190 61 116 72 69 112 45 235
3776 235 220 160 202 200 155 113 254 92 151 227 103 137 159 67 60 55 99 41 184 73 59 132 137 19 34 198 239 58 7 53 143 54 145
3466 145 174 222 155 59 88 111 174 129 67 215 117 114 71 77 156 168 45 217 170 105 113 110 135 128 135 250 212 235 187 210 203 226 35 182 92
3138 92 108 158 118 162 115 148 124 174 113 146 92 208 183 34 100 300 256 110 112 128 57 275 84 416 453 666 3361 8991 9099
2865 9099 1668 1804 546 442 221 96 189 126 111 87 31 85 203 34 149 238 16 16 134 23 31 100 137 220 41 93 219
2612 219 120 95 212 226 190 153 32 97 22 75 106 175 220 158 77 134 178 242 188 79 278 82 246 200 60 83 30 160 27 80
2330 80 259 229 49 121 143 92 143 111 48 122 96 223 84 231 38 202 104 113 60 182 322 49 212 106 158 191 175 49 199
2058 199 106 125 107 55 125 235 120 24 144 127 150 86 153 251 136 155 226 145 187 101 113 74 25 60 39 109 189 170 34 100 134 69
1757 69 125 234 77 229 223 181 66 42 80 157 117 95 157 168 58 172 222 262 93 93 240 168 180 115 50 15 66 247 220 26 118
1466 118 132 304 242 130 202 182 63 108 135 197 115 219 189 110 127 138 90 113 147 83 71 196 154 223 145 226 61 140 67 71 102 142
1166 142 104 57 139 122 132 157 125 126 149 59 102 20 184 130 30 105 84 95 134 99 109 107 44 127 162 47 56 102 171 81 93 64 100 198 101
837 101 97 158 139 170 130 34 60 139 134 249 127 16 163 83 254 132 114 101 77 69 145 351 227 157 165 131 208 140 212 104 125 148 119
527 119 61 77 139 88 80 231 176 223 200 248 151 149 58 134 90 125 147 81 74 158 163 177 165 182 70 178 242 83 122 186 140 80 194 309
208 309 177 113 87 108 156 108 136 111 206 155 90 108 158 160 165 244 83 176 146 53 126 256 70 98 69 39 97 137 210 56 114 181 227 170
-111 170 201 147 106 63 195 209 54 83 109 152 13 84 85 110 52 48 31 133 271 165 191 145 95 148 67 76 60 151 163 103
-393A03
##PAGE=	F1=7777.86
##FIRST=	17614.246348710370512,	4405.4455391999963467,	0.18508702516555786133
##DATA TABLE=	(F2++(Y..Y)), PROFILE
4405 33 129 216 94 152 64 50 66 191 294 183 177 130 192 147 123 40 312 240 84 145 219 218 78 117 96 196 91 79 92 104 111 101
4105 101 132 81 32 102 220 265 112 62 43 199 142 23 83 184 177 85 60 118 56 210 106 73 56 80 253 240 192 213 76 120 70
3814 70 79 113 65 236 265 195 230 232 160 140 258 61 108 200 111 138 176 25 75 25 82 52 270 83 63 188 172 16 5 209 201 49
3513 49 23 15 52 56 150 227 206 160 90 98 84 186 127 62 166 82 101 68 64 195 229 60 212 178 137 168 92 124 112 138 300 232 374 193
3194 193 343 197 250 71 198 104 146 209 130 253 208 167 153 155 92 133 78 145 141 76 134 315 236 135 98 133 59 310 200 408 601
2903 601 1033 4355 11281 11694 2275 2207 694 533 231 211 246 119 85 81 53 87 183 56 116 217 27 56 120 6 46 53 114
2650 114 180 51 80 231 115 108 213 228 181 160 11 90 6 48 147 185 241 229 110 116 132 247 206 4 237 92 205 193 57 110
2368 110 46 235 79 46 286 238 60 132 149 97 137 41 38 103 104 204 94 271 13 226 108 95 78 165 313 6 222 130 90
2095 90 155 147 104 192 113 130 81 91 161 274 162 35 136 100 141 85 148 196 83 136 270 93 161 75 113 121 52 27 34 94 179 145 48
1786 48 38 91 53 142 280 78 193 229 207 86 36 96 142 97 97 155 187 35 196 148 217 113 70 194 142 162 174 58 19 76 246
1495 246 220 68 116 77 263 218 121 181 230 79 144 126 138 154 200 192 116 93 92 78 116 171 83 72 224 129 220 134 272 84 199 58
1194 58 89 95 123 117 42 138 125 147 137 105 86 108 41 112 10 154 97 56 152 136 112 132 101 54 67 55 103 161 47 82 132 204 78 126
875 126 110 126 259 89 85 175 147 160 137 51 88 178 224 261 124 52 149 81 269 163 136 57 39 68 186 383 241 165 134 81 175 167
574 167 230 125 140 141 115 25 26 123 98 77 142 117 209 179 282 188 136 72 168 154 121 146 104 99 134 184 202 145 137 57 198 245 61 124 117 76
236 76 66 185 302 142 69 56 109 160 93 139 100 224 178 53 100 181 164 125 191 47 205 155 33 127 265 57 99 107 23 124 112
-55 112 198 2 82 169 196 156 207 146 108 46 238 246 100 56 52 102 12 89 19 38 49 39 37 129 262 150 168 131 89 116 69 95 61 139
-374 139 150 106
-393A06
##PAGE=	F1=7707.09
##FIRST=	17614.246348710370512,	4405.4455391999963467,	0.18041588366031646729
##DATA TABLE=	(F2++(Y..Y)), PROFILE
4405 40 142 205 93 153 44 74 84 239 353 206 142 108 191 126 93 17 317 197 66 121 170 246 148 188 48 248 158 98 56 133
4124 133 146 132 175 112 25 114 259 348 152 84 33 187 122 61 45 164 190 77 95 125 33 260 153 76 80 118 191 128 244 234 133
3833 133 134 70 73 114 90 228 294 252 228 241 144 170 249 67 70 161 97 136 171 38 121 58 80 123 337 94 55 257 214 58 25 199
3532 199 151 32 42 34 35 54 140 244 171 157 144 110 65 186 145 103 96 57 72 89 66 210 268 105 192 173 162 202 83 86 88 128 335 243
3213 243 371 185 273 192 263 112 195 89 167 252 126 306 275 172 185 110 94 121 62 89 89 107 147 314 200 154 114 148 133 323
2931 323 254 381 646 1154 4523 11892 12258 2386 2255 746 536 277 304 293 98 51 101 111 73 157 108 105 184 29 97 99 30
2678 30 69 4 97 156 65 69 228 113 126 211 219 156 159 17 65 11 18 191 169 225 285 140 87 81 253 221 99 184 122 144 176 49 127 67
2358 67 295 137 15 278 210 121 160 155 133 144 37 65 107 113 192 93 299 44 237 118 67 98 128 292 59 229 175 31 135
2086 135 142 163 186 149 163 43 136 194 287 185 83 137 49 105 87 148 142 97 123 290 39 148 75 107 167 121 35 24 81 162 130 86 31
1776 31 53 31 154 304 83 167 242 216 113 70 110 117 76 102 158 204 36 206 112 208 111 59 160 121 118 211 78 30 71 214 212 116
1476 116 114 6 187 183 140 153 253 84 171 130 104 196 161 157 103 57 37 65 103 168 111 122 229 101 208 126 301 106 255 40 89
1185 89 102 115 122 33 121 117 153 117 84 24 62 24 129 18 110 44 78 170 188 131 145 125 47 57 63 75 145 54 107 154 223 80 147 142 154 291
847 291 71 77 184 166 151 121 99 125 215 294 259 126 89 131 106 281 201 160 54 15 75 221 382 229 180 126 33 142 188 239 134
556 134 136 124 118 22 29 107 91 81 61 92 180 142 286 209 122 97 185 204 130 121 116 129 115 202 218 128 87 42 186 234 78 95 42 26 73 170
217 170 296 106 45 31 105 155 81 139 85 219 175 40 99 193 167 85 123 58 239 160 45 119 275 79 90 153 35 171 71 163
-64 163 49 81 162 172 159 192 113 105 27 259 243 122 44 17 54 32 105 50 25 90 29 56 107 221 125 139 129 84 91 61 119 72 113 128
-383 128 92
-393I2
##PAGE=	F1=7636.33
##FIRST=	17614.246348710370512,	4405.4455391999963467,	0.44884777069091796875
##DATA TABLE=	(F2++(Y..Y)), PROFILE
4405 43 141 176 93 156 23 88 105 279 383 222 109 97 172 107 59 53 311 152 53 95 138 256 205 248 29 291 228 120 21 146
4124 146 174 183 217 156 40 132 292 412 193 105 17 167 105 84 51 123 196 72 131 121 18 307 208 79 103 133 130 30 277 246
3842 246 172 136 75 59 107 109 218 308 317 200 223 104 205 229 108 33 116 62 140 139 78 162 103 90 161 365 102 53 327 255 100 50
3542 50 169 100 17 46 76 99 50 111 225 132 156 198 135 70 174 165 140 26 72 37 121 71 202 282 149 165 153 178 201 98 30 63
3241 63 103 345 240 254 263 96 207 258 159 180 41 172 280 108 311 297 178 189 68 100 111 56 62 29 119 131 287 158 159 145
2959 145 139 192 297 246 344 588 1060 3991 10916 11071 2109 1986 713 450 343 363 318 58 60 137 157 54 126 142 107 135 17
2706 17 133 102 46 97 40 92 151 50 47 221 115 147 208 199 119 151 32 28 45 61 222 139 182 311 162 55 36 257 225 189 136 146
2405 146 74 147 36 128 83 329 192 59 236 149 179 206 165 192 138 90 91 124 104 180 82 304 93 245 140 27 120 78 263 130
2124 130 247 221 16 141 159 218 182 182 204 23 179 231 278 186 124 156 33 64 94 159 109 146 123 287 20 134 93 98 203 185 48
1833 48 14 72 148 124 121 85 24 13 167 302 114 167 253 202 146 102 125 110 72 109 162 210 49 196 144 234 89 54 144 116 57 221
1532 221 101 40 55 163 211 156 115 77 126 163 162 117 243 70 183 139 78 220 106 90 80 67 28 76 84 143 124 177 217 84 188
1241 188 129 303 124 291 72 81 98 112 118 73 102 103 155 91 77 50 34 9 149 53 65 22 94 163 224 141 166 147 131 90 84 54 116 71
922 71 122 153 231 99 145 146 176 285 54 73 188 193 167 102 145 166 237 332 241 131 96 110 146 293 241 182 65 75 89 239 351 197
621 197 194 157 3 113 201 239 124 117 105 134 39 37 87 67 73 56 95 149 98 261 208 113 127 180 231 158 84 113 152 104 209 220 113 43
302 43 31 149 214 119 52 34 37 89 155 281 76 42 31 98 143 78 134 67 189 149 41 91 192 170 69 87 124 260 161 67 102 282
2 282 129 80 197 60 212 25 118 84 98 166 161 161 159 67 105 24 258 210 122 47 41 26 47 124 118 74 139 32 76 84 156 94 110 142 80 104
-337 104 44 144 82 77 99 63
-393F3
##PAGE=	F1=7565.56
##FIRST=	17614.246348710370512,	4405.4455391999963467,	0.63171297311782836914
##DATA TABLE=	(F2++(Y..Y)), PROFILE
4405 46 130 137 94 171 24 85 126 300 376 223 87 94 142 114 43 100 293 114 53 93 141 246 240 284 95 320 284 147 38 148 195
4114 195 234 247 196 54 144 300 445 220 109 13 152 97 86 106 73 200 70 173 125 66 340 257 85 112 120 89 47 277 244
3842 244 182 115 84 48 93 114 209 314 375 158 183 51 242 201 138 5 68 15 147 80 112 186 137 100 162 343 102 81 383 285
3560 285 129 72 127 61 13 37 118 138 46 68 182 114 171 238 167 87 153 170 155 69 108 10 148 69 179 276 186 143 120 183 171 123 76
3250 76 43 74 324 221 335 441 415 250 239 200 168 32 169 288 87 286 282 197 174 95 108 102 76 88 39 112 82 226 115 145
2969 145 163 104 215 241 192 300 452 847 3016 8769 8729 1617 1504 619 302 388 385 319 16 86 177 183 44 91 161 111 80 49
2706 49 157 136 57 125 78 95 161 14 34 216 117 170 204 174 83 143 47 42 101 128 230 119 133 298 169 39 28 253 216 257 116
2415 116 153 20 109 17 117 94 326 233 110 169 74 222 251 171 260 113 131 104 138 68 152 67 278 131 261 174 20 141 29
2142 29 228 201 275 261 47 154 180 260 185 197 229 59 212 270 253 167 142 174 103 75 102 176 97 181 130 268 48 110 106 85 220 228
1842 228 41 15 61 138 123 154 121 18 47 185 280 169 190 253 164 178 120 137 135 95 113 163 201 66 168 195 266 62 58 143 130 9
1541 9 205 123 43 41 110 227 180 132 156 149 168 171 71 195 46 174 144 42 220 48 41 66 113 65 112 93 121 110 215 198 86 161
1241 161 140 277 136 294 120 76 76 105 106 133 95 89 157 62 99 126 63 14 171 89 45 83 103 137 235 132 181 156 221 133 121 49 75
931 75 85 125 123 230 136 119 118 188 245 48 76 186 221 213 110 185 202 236 331 215 136 77 91 184 302 277 202 79 130 108 232 298 152
621 152 198 204 13 88 213 232 95 98 92 160 43 34 64 40 51 96 88 128 55 215 185 109 151 159 228 191 67 102 157 96 198 202 102 15 32
293 32 98 191 154 34 76 53 103 139 246 60 28 50 99 126 83 122 55 140 115 50 70 183 177 86 118 187 258 155 76 82 275 180 111 232
-27 232 89 233 28 78 101 110 182 160 151 123 89 110 35 236 167 112 56 68 36 54 141 173 108 179 47 81 90 75 64 91 159 75 140 23
-346 23 166 86 50 69 26
-393B6
##PAGE=	F1=7494.79
##FIRST=	17614.246348710370512,	4405.4455391999963467,	0.55424934625625610352
##DATA TABLE=	(F2++(Y..Y)), PROFILE
4405 50 117 115 89 192 51 73 143 293 334 202 82 92 113 143 65 136 258 88 71 112 158 218 248 287 146 331 315 171 72 146 210
4114 210 268 259 226 59 147 276 441 232 100 26 158 101 64 161 37 206 72 217 157 120 352 291 106 103 81 96 94 242 224 162
3833 162 82 100 45 80 102 205 316 412 123 135 43 272 168 142 33 32 41 156 14 134 193 159 103 129 274 90 123 411 297
3560 297 138 94 88 42 24 21 155 148 53 28 133 137 205 256 194 97 125 155 148 135 140 17 160 59 157 257 211 130 82 178 133 141 166 39
3241 39 61 278 195 553 577 667 276 225 216 163 112 172 277 78 261 256 223 162 152 125 95 110 127 110 93 8 136 71 114 151 54 207
2941 207 175 114 250 282 598 1896 6058 5925 1076 945 486 135 386 380 296 70 90 214 185 41 53 172 118 56 112 169 178
2687 178 66 146 111 96 179 39 73 215 114 190 201 152 75 144 65 86 167 195 211 125 114 250 160 61 54 234 199 293 134 146 62 70
2387 70 7 100 100 286 255 151 90 69 244 278 162 321 85 159 103 146 18 99 58 223 148 289 217 63 156 37 189 256 296 287
2105 287 73 156 189 285 193 197 225 89 225 293 225 139 130 171 166 118 104 193 87 191 136 245 61 77 102 65 216 241 18 28 49 131
1804 131 121 191 138 38 85 215 261 230 217 243 112 200 120 138 163 131 115 161 179 84 130 234 288 61 74 146 153 68 170 141 33 52
1504 52 88 257 188 173 222 208 175 167 33 115 61 145 134 34 202 36 107 81 156 88 154 142 150 70 232 178 91 130 151 227 143 263 149
1194 149 73 39 91 94 195 106 76 158 49 142 193 108 31 186 117 58 127 108 106 217 101 179 155 299 170 162 59 29 85 124 70 218
894 218 178 72 61 189 183 59 84 178 246 265 142 217 230 215 295 199 138 39 78 208 302 300 221 102 171 128 204 233 106 187 242 8
593 8 72 223 216 51 109 91 192 38 48 50 39 37 118 58 120 19 163 145 103 161 129 198 207 90 88 141 78 165 165 91 8 39 50 166 175 55
255 55 92 48 111 120 192 65 14 78 114 109 92 111 61 83 101 66 42 171 186 111 160 224 234 144 65 65 247 218 179 248 119 225 59 53 100
-74 100 117 206 165 129 117 166 114 49 197 131 102 66 87 58 54 153 208 129 201 55 65 127 18 54 87 164 65 170 13 181 79 66
-374 66 52 18
-393A8
##PAGE=	F1=7424.03
##FIRST=	17614.246348710370512,	4405.4455391999963467,	0.27737733721733093262
##DATA TABLE=	(F2++(Y..Y)), PROFILE
4405 47 105 135 77 210 85 80 149 255 267 158 97 85 99 169 96 149 208 75 94 124 165 176 233 256 166 318 313 181 95 144 218 273 250
4096 250 244 54 139 229 401 229 87 45 186 122 20 198 54 211 78 257 206 167 338 303 145 80 49 130 118 182 186 117 78
3823 78 122 50 71 73 204 318 421 117 106 99 288 136 115 56 54 91 167 82 144 192 172 95 78 173 64 156 401 286 128 118 67 35
3523 35 49 20 183 134 72 45 106 182 246 248 202 98 96 127 128 186 163 49 152 50 148 231 220 121 55 164 112 143 245 71 82 219
3222 219 185 573 534 600 237 218 195 151 182 198 253 79 239 234 243 171 190 143 90 142 152 176 73 93 39 30 67 107 20 185 135 52 193
2912 193 147 371 890 3407 3278 613 434 340 16 329 358 258 126 76 242 166 29 12 185 133 92 185 169 209 77 154 140
2659 140 89 196 82 126 215 100 205 198 139 99 158 84 115 230 252 168 143 135 178 137 94 74 198 177 293 161 131 111 42 35 87 99
2358 99 218 256 178 28 142 246 271 132 356 89 173 89 150 78 27 66 150 140 316 259 97 162 77 150 280 291 295 98 141 180
2077 180 294 207 198 194 102 216 288 198 111 95 140 205 150 109 207 65 179 136 225 57 44 83 42 195 222 32 53 48 127 116 228 146
1776 146 63 110 253 271 286 236 228 59 202 101 122 176 165 111 161 161 105 93 254 299 84 94 145 176 111 131 155 12 79 124 291 184
1476 184 227 265 245 168 156 75 21 121 97 105 86 177 73 173 106 185 95 189 200 222 15 229 158 88 101 159 169 144 203 143 65 35 73
1166 73 92 252 127 64 154 77 188 244 154 40 189 135 71 141 114 81 179 56 156 149 352 194 193 77 17 70 129 62 192 213 34
875 34 24 183 114 79 92 162 259 299 167 236 248 183 237 203 138 21 83 209 290 303 236 130 191 145 163 162 66 162 258 28 78 231 186
565 186 13 146 103 226 46 81 58 63 69 116 40 119 23 122 95 91 153 101 150 195 114 75 114 47 111 115 82 18 43 24 147 186 64 88
246 88 28 109 100 127 93 77 107 136 94 104 109 84 31 126 79 16 166 194 135 181 223 203 141 43 57 203 235 249 243 142 189 79 43 88 127
-83 127 228 165 103 141 233 117 66 148 113 95 79 98 88 56 157 218 138 198 50 35 169 96 70 84 151 48 181 31 188 65
-365 65 104 54 43
-393D3
##PAGE=	F1=7353.26
##FIRST=	17614.246348710370512,	4405.4455391999963467,	0.34419614076614379883
##DATA TABLE=	(F2++(Y..Y)), PROFILE
4405 36 96 178 56 217 123 117 140 190 188 99 130 76 97 180 121 135 147 69 107 113 150 128 204 200 152 282 279 173 105 140 218 247 225 244 38
4077 38 125 189 343 218 76 68 228 164 46 215 85 212 86 283 248 199 298 296 197 49 89 157 125 109 134 62 117 148 59 67 36
3786 36 204 319 401 131 112 148 282 117 69 76 100 132 182 152 147 191 180 80 33 61 47 170 354 252 108 141 60 32 84 31 198
3495 198 109 96 73 109 227 286 218 185 90 78 96 114 221 177 98 131 49 150 198 211 106 61 147 107 138 297 122 112 163 218 266 251
3194 251 214 158 203 154 116 229 250 222 73 200 210 244 192 197 154 89 165 156 226 72 192 109 50 20 37 69 171 135 70 138 169 235 166
2884 166 1296 1215 300 75 204 117 227 330 211 158 77 257 136 19 34 203 154 136 257 164 225 94 149 167 77 205 108
2631 108 174 214 73 210 194 133 121 179 103 120 274 291 112 151 162 108 111 123 85 146 156 264 175 118 151 37 65 84 91 140 239 190 53
2321 53 203 226 224 80 357 118 177 75 151 159 53 90 100 115 329 286 114 162 110 112 264 249 284 123 116 154 286 221 211 144 95 191
2020 191 248 173 96 48 86 212 166 139 216 28 152 135 208 38 21 54 42 163 179 68 83 67 129 105 260 160 84 114 284 309
1739 309 328 242 215 37 177 67 93 170 192 101 174 174 125 72 255 309 106 112 134 194 131 101 160 25 105 183 314 176 273 278 252 148
1438 148 151 145 101 188 38 59 140 164 93 210 126 198 91 211 245 292 42 217 145 74 78 164 126 132 128 103 64 85 54 103 296 153 49
1128 49 141 113 225 279 201 42 176 143 80 122 125 69 135 12 113 147 371 203 206 102 59 46 142 136 153 233 83 110 174 51 100 97
828 97 137 257 303 168 239 255 155 176 218 137 65 115 185 264 279 240 156 191 157 128 89 39 127 248 72 109 232 140 54 180 122 258
527 258 74 111 74 83 111 95 84 114 46 105 47 81 132 76 95 155 118 56 112 8 48 71 80 39 42 32 148 188 55 89 26 94 80 65 132
199 132 151 130 154 80 118 118 113 6 163 83 11 175 195 164 189 179 184 160 49 56 152 229 299 217 155 134 88 45 72 141 236 153 82 161 272
-130 272 120 83 104 108 83 97 109 128 72 147 207 137 173 43 64 199 164 96 70 117 28 170 51 187 50 137 61 55
-393E5
##PAGE=	F1=7282.5
##FIRST=	17614.246348710370512,	4405.4455391999963467,	0.57015454769134521484
##DATA TABLE=	(F2++(Y..Y)), PROFILE
4405 28 87 216 28 214 162 162 115 112 115 48 170 70 98 172 133 103 90 63 103 78 117 83 174 138 112 230 220 143 105 133 213 201 194 222
4086 222 11 114 192 289 202 73 98 272 215 121 220 116 210 91 289 265 213 241 277 252 30 148 163 120 42 74 28 155 170 74
3804 74 68 16 202 317 360 141 129 175 252 115 20 97 145 162 195 197 146 192 187 67 40 44 80 162 275 198 102 157 49 30 120 35 200
3495 200 83 113 84 120 261 316 174 145 76 79 77 119 243 187 157 111 52 155 157 187 82 91 134 104 142 314 173 134 122 282 306 289
3194 289 679 249 175 155 56 247 312 197 53 140 178 223 204 176 152 96 172 144 253 94 277 211 110 68 62 123 165 148 106 120 257
2903 257 240 268 100 71 179 162 112 176 102 300 160 155 111 254 103 50 82 226 177 170 314 153 222 113 133 188 67 199 112 207
2621 207 211 37 201 188 128 124 199 121 99 290 306 57 142 175 85 93 145 93 88 135 221 168 111 180 41 89 89 80 69 211 186 80 236 189
2302 189 143 16 320 142 170 73 148 229 124 115 129 97 316 288 113 160 135 82 209 177 257 146 94 117 265 232 234 97 75 163 185
2011 185 147 100 37 38 191 180 201 219 15 112 141 195 11 14 26 69 135 128 93 111 91 145 92 276 183 93 95 296 341 348 234 207 57 125
1692 125 21 60 151 210 83 204 216 137 72 239 321 130 129 116 201 128 78 152 68 121 235 315 171 294 263 240 124 153 210 197 244
1401 244 36 11 184 167 85 213 134 193 82 216 264 336 86 208 152 56 61 165 112 103 56 59 99 137 39 117 318 177 30 115 135
1110 135 245 299 246 49 151 146 86 76 138 69 103 20 59 149 353 201 198 133 94 26 156 207 108 234 147 192 163 11 120 101 109 237
809 237 274 146 227 252 147 131 226 134 113 166 149 231 230 227 173 173 166 122 21 44 92 217 128 150 219 80 100 192 150 286 102 129 85 90
490 90 144 71 132 102 61 108 46 92 103 54 41 98 104 34 154 49 39 73 88 62 40 51 172 179 42 114 50 71 68 22 173 219 136 163 66
161 66 127 128 136 21 190 77 19 196 184 199 202 100 181 195 81 54 107 204 316 176 154 80 86 55 56 154 222 125 74 159 274 125 91
-149 91 83 110 60 120 133 173 98 119 178 126 133 68 130 212 213 119 45 70 29 142 71 183 45 155 61 56
-393E6
##PAGE=	F1=7211.73
##FIRST=	17614.246348710370512,	4405.4455391999963467,	0.51648181676864624023
##DATA TABLE=	(F2++(Y..Y)), PROFILE
4405 29 76 238 8 202 192 200 78 52 78 66 206 71 99 151 132 83 68 55 80 46 75 47 149 111 55 178 152 96 104 118 206 154
4105 154 164 179 36 117 233 261 182 90 136 310 261 196 228 154 205 89 273 246 211 180 258 296 51 193 151 106 30 31 46 168 186
3814 186 93 77 30 197 309 306 136 130 177 203 118 25 124 186 180 195 210 145 190 193 67 57 117 134 138 179 134 119 160 28 25 151 28 193
3495 193 57 112 80 123 273 332 138 94 58 89 83 131 257 196 211 108 60 159 118 158 54 125 134 111 150 294 207 140 100 328 871
3204 871 772 1261 408 147 199 45 231 360 187 24 80 144 184 194 141 146 114 162 132 250 120 331 280 168 136 152 169 154 149 122
2922 122 155 311 278 400 605 613 171 215 110 215 25 262 113 118 146 234 72 90 131 247 189 191 347 134 203 130 114 204 72
2650 72 176 94 223 204 6 182 182 125 103 212 138 61 277 299 20 116 172 113 93 162 101 43 115 183 139 104 198 51 95 97 73 21
2349 21 176 169 83 237 140 53 60 260 149 154 83 137 280 173 132 187 109 275 262 95 156 150 67 126 101 222 165 87 76 229 235 251 77
2039 77 57 153 131 123 123 81 79 151 207 277 217 58 65 160 184 19 17 26 99 123 96 95 125 112 174 82 274 206 85 70 286 339 343 216 203 82
1701 82 57 33 36 133 218 57 242 259 138 79 206 333 169 149 101 193 106 49 135 116 123 264 288 165 283 230 227 103 161 257 266 282
1401 282 96 48 215 178 54 190 131 177 74 206 254 342 108 202 181 47 41 161 113 66 45 105 159 178 34 125 315 190 37
1128 37 79 134 243 304 284 74 123 151 88 21 148 80 88 27 29 152 308 199 174 165 119 32 161 249 76 217 198 254 149 40 138
837 138 111 91 210 219 113 205 241 158 108 217 130 164 223 125 198 163 197 178 145 176 144 67 80 73 174 183 186 192 14 136 180 184 308 119
518 119 136 88 91 166 90 161 80 71 118 87 124 76 56 26 55 87 31 208 101 92 111 101 81 40 75 204 159 50 151 67 63 73 38 201
199 201 266 121 161 52 122 131 148 21 199 63 26 215 158 235 236 8 172 222 103 48 70 174 296 130 141 65 65 72 44 161 186
-92 186 84 74 138 249 130 86 87 118 34 145 174 214 120 73 137 104 95 117 194 204 239 133 40 24 59 107 93 179 52 157 60 61
-393F1
##PAGE=	F1=7140.97
##FIRST=	17614.246348710370512,	4405.4455391999963467,	0.2459920346736907959
##DATA TABLE=	(F2++(Y..Y)), PROFILE
4405 28 65 241 38 187 206 221 37 62 87 114 227 72 101 123 124 109 87 60 55 74 36 26 127 139 9 138 92 41 104 94 198
4114 198 130 137 116 90 133 273 257 158 129 182 336 288 259 253 198 199 83 234 193 197 129 242 319 76 216 130 85 54 56 57 153 190 115 90
3795 90 33 191 290 251 113 105 158 145 111 41 149 221 189 180 198 145 182 196 78 52 163 181 114 84 74 144 150 43 18 174 25 176
3495 176 25 88 65 118 262 332 139 55 53 96 106 133 270 211 246 120 84 163 97 137 27 157 140 131 141 239 212 127 89 303 1003
3204 1003 965 1175 409 92 200 121 177 371 203 25 41 116 140 157 108 146 139 138 135 224 139 346 303 211 201 229 199 127 139 130 207 319
2903 319 263 354 592 601 151 169 150 255 126 216 94 59 161 196 45 120 177 256 182 198 349 103 171 138 96 215 90 134 60 222
2621 222 192 45 156 177 132 61 215 156 22 236 272 24 81 155 138 111 175 113 49 102 163 95 93 203 78 81 100 75 19 129 140
2330 140 72 210 91 83 128 199 142 129 92 118 306 193 135 222 133 214 210 72 142 153 70 51 96 191 183 92 36 180 225 251 81 54 165
2020 165 129 111 161 125 138 106 240 344 211 92 42 193 174 47 24 47 124 128 106 75 122 123 212 84 253 217 57 81 265 293 316
1729 316 186 197 113 61 89 31 119 214 26 272 276 127 82 160 336 216 172 102 171 71 30 118 164 120 264 237 152 241 194 222 89
1438 89 170 281 296 297 147 84 236 184 35 152 126 157 77 184 218 313 108 188 214 64 30 145 112 59 90 189 221 201 40 123 287
1147 287 184 87 38 109 222 295 310 109 101 158 76 49 146 102 84 22 67 151 251 206 144 193 133 41 151 250 80 186 225 283 129
856 129 71 152 130 94 192 155 85 181 221 171 100 191 126 214 273 135 178 105 160 172 116 191 173 127 126 83 131 225 208 154 48 157 147 214
537 214 320 119 138 89 93 180 148 173 50 84 129 127 155 59 95 83 84 88 50 247 150 127 146 110 96 41 100 230 147 78 182 74 98 94
217 94 72 211 283 89 150 30 99 124 147 28 189 50 32 217 119 263 285 91 143 227 100 46 40 161 249 91 130 87 19 97
-64 97 34 160 136 49 72 114 214 135 70 99 131 26 167 223 240 130 38 94 72 74 169 241 176 239 141 70 43 95 77 114 175 63 145
-374 145 77 83
-393H3
##PAGE=	F1=7070.2
##FIRST=	17614.246348710370512,	4405.4455391999963467,	0.40399783849716186523
##DATA TABLE=	(F2++(Y..Y)), PROFILE
4405 18 59 228 68 177 196 222 38 82 102 150 226 68 102 90 118 151 101 94 66 118 22 26 98 176 71 115 59 33 106 81 187 137 105
4096 105 45 151 153 284 256 131 173 231 347 289 302 284 235 193 86 178 114 175 97 227 315 89 223 114 65 55 87 53 125 183 136
3804 136 97 24 183 255 202 78 60 122 88 90 34 168 250 196 160 180 138 176 197 93 37 188 212 105 23 48 165 133 97 24 187
3513 187 38 151 33 44 44 112 230 320 179 54 97 95 129 119 282 232 251 131 134 167 95 138 13 187 135 137 116 162 192 96 73 173
3213 173 278 615 198 108 66 110 191 92 333 239 61 6 95 108 95 81 159 162 102 151 193 144 322 280 229 251 280 210 92 134 146 247
2912 247 286 194 233 296 304 104 83 180 291 191 166 123 32 150 148 38 130 218 243 148 195 323 61 131 137 88 220 110 81 23 207
2621 207 173 79 133 178 152 20 206 175 41 179 233 39 48 130 139 142 183 130 79 105 157 46 79 194 115 67 91 84 43 69 100 62 168
2311 168 62 157 185 165 127 97 89 98 305 181 125 224 144 145 148 63 110 143 77 93 154 173 197 94 10 125 199 233 96 61 188 152 118
2002 118 201 163 183 71 261 388 207 110 92 231 167 66 35 68 143 136 136 43 106 122 246 99 217 212 29 129 248 209 271 145
1720 145 187 155 140 140 40 102 197 6 278 256 110 79 118 324 252 194 115 136 33 79 116 209 131 233 175 130 182 171 222 78 175
1429 175 279 282 288 179 97 251 182 79 118 133 140 97 158 164 261 102 153 234 95 65 116 111 98 124 260 270 204 50 111 239 156 151 15
1119 15 66 193 271 316 138 90 166 53 92 131 132 90 51 102 147 204 225 116 214 137 39 127 208 110 146 225 277 113 102 161 151 109 194
809 194 99 71 160 191 171 95 154 124 258 305 161 173 108 143 156 96 211 202 164 166 103 101 236 213 106 93 158 105 230 321 109 144 90
499 90 99 187 206 177 16 99 138 151 173 55 144 146 130 103 58 260 189 136 167 109 106 39 120 243 170 109 197 79 144 121 108 200 272 49
180 49 125 8 60 110 132 50 162 68 36 192 83 277 332 165 95 202 73 55 35 183 192 70 137 99 52 133 29 148 82 62
-102 62 64 107 192 141 52 110 146 46 179 264 246 122 77 60 33 62 211 268 134 212 143 102 77 129 58 133 166 77 123 108 117
-393A17
##PAGE=	F1=6999.44
##FIRST=	17614.246348710370512,	4405.4455391999963467,	0.66866141557693481445
##DATA TABLE=	(F2++(Y..Y)), PROFILE
4405 26 63 206 94 174 161 202 82 80 102 170 200 58 101 59 119 180 94 145 106 145 36 36 56 193 127 107 59 84 109 116 170 161 63 45
4086 45 209 165 254 242 111 205 271 342 263 317 302 249 187 107 113 46 152 80 207 282 85 219 108 70 45 95 56 120 163 157 89 32 171
3776 171 204 167 37 40 78 49 65 25 176 272 211 156 179 119 183 195 109 45 208 221 112 71 62 184 119 159 39 190 53 115 83 54
3476 54 45 118 193 305 227 62 173 89 140 102 289 255 223 135 214 164 100 168 31 212 105 102 145 140 199 69 47 152 1635 1053 2800
3185 2800 575 378 208 265 130 249 285 113 80 75 107 67 52 176 179 62 162 198 137 266 227 220 281 296 205 67 153 177 268 227
2903 227 117 119 106 101 46 62 194 301 215 117 176 81 124 104 68 116 246 205 88 187 274 12 89 137 92 220 121 41 33 186 146 102
2603 102 117 189 175 66 186 190 76 115 189 69 38 102 120 181 183 149 101 125 152 6 69 174 147 98 68 95 78 10 58 71 128 64 196
2293 196 225 163 112 60 76 82 276 141 112 195 136 87 117 83 60 120 74 167 195 167 205 85 52 96 154 202 126 73 207 153 134 232 197
1983 197 207 59 257 402 206 115 154 263 162 76 56 90 160 134 159 42 92 104 264 124 177 196 63 175 233 106 215 96
1720 96 170 199 207 181 71 73 163 34 255 197 100 81 116 292 260 203 123 93 15 144 129 243 170 179 122 102 123 164 215 67 177 255 231
1410 231 258 188 93 260 174 128 112 165 133 125 136 108 211 122 94 232 124 114 76 122 138 144 301 299 190 58 93 184 116 218 44 49
1110 49 181 235 296 151 82 171 46 115 104 161 105 95 117 137 182 246 91 232 138 27 94 135 147 104 199 239 124 140 166 164 117 204
809 204 65 60 146 150 155 89 117 120 283 315 178 181 154 163 131 90 230 231 165 189 114 90 208 201 51 113 138 67 225 311 104 154 89 98 187 240
471 240 182 16 109 140 153 168 52 182 205 160 114 43 247 215 124 170 99 116 36 131 246 217 137 196 90 174 142 143 174 239 32 87
171 87 49 16 101 109 73 125 117 45 137 83 272 364 206 62 159 54 72 76 230 155 69 169 87 139 178 32 123 39 99 51 116 189 148 57
-149 57 120 155 72 177 285 229 97 126 50 13 37 240 276 87 162 144 125 94 158 47 146 145 97 99 138 151
-393A51
##PAGE=	F1=6928.67
##FIRST=	17614.246348710370512,	4405.4455391999963467,	0.66471099853515625
##DATA TABLE=	(F2++(Y..Y)), PROFILE
4405 56 75 180 115 172 108 166 131 93 86 174 156 45 96 50 124 184 69 195 147 150 51 46 9 180 167 119 67 123 113 180 148 193 24 111
4086 111 255 163 188 212 106 217 290 318 216 304 288 230 177 137 52 98 133 66 181 224 65 213 103 102 68 76 83 149 135 178 77 61
3786 61 151 140 148 32 92 33 53 71 49 170 286 235 175 202 86 203 186 126 75 228 213 124 114 71 206 113 220 44 188 57
3504 57 68 129 133 89 146 169 295 263 64 262 83 133 112 281 274 167 136 317 147 116 224 56 231 51 17 266 265 295 108 32
3222 32 530 4630 3152 6741 1597 851 567 377 313 134 326 183 193 51 137 156 25 190 189 28 158 254 118 193 181
2988 181 192 289 280 199 66 193 212 268 162 129 64 272 298 1 119 198 271 199 78 226 117 96 88 106 79 257 149 22 182
2715 182 214 39 52 153 108 216 116 75 70 167 112 115 111 213 191 124 159 197 101 53 146 117 50 80 97 215 170 164 115 153 153 21 66 157
2396 157 161 157 42 107 111 77 47 97 114 68 190 249 169 94 24 55 69 223 80 120 149 110 59 146 114 44 89 58 219 199 163 200 64
2086 64 102 127 96 168 170 98 217 118 146 249 224 212 66 227 387 208 116 204 277 154 83 92 117 180 114 168 80 92 73 258 156 144
1786 144 175 117 204 206 9 155 49 146 228 246 208 122 39 114 53 210 109 102 95 160 245 231 193 119 52 48 197 138 261 224 110 93 76
1476 76 81 159 196 53 176 218 154 212 171 92 264 160 158 136 210 130 151 128 60 188 172 23 209 147 151 37 142 160 154 307 307 165
1175 165 63 75 137 80 274 64 96 201 197 249 144 69 167 77 120 74 182 118 132 111 122 183 259 67 253 149 12 62 56 182
894 182 67 156 179 165 189 165 163 113 207 58 38 142 99 130 80 92 115 282 302 176 195 188 198 100 99 242 262 128 188 105 98 146 179 25
574 25 105 106 55 197 293 114 162 80 87 180 242 181 36 110 131 127 139 37 201 246 167 111 18 214 224 109 155 92 125 40 136 244 258
264 258 156 184 107 174 147 169 143 200 59 38 97 30 103 84 86 88 174 70 64 115 249 378 212 88 122 87 87 130 279 150 83 211
-36 211 65 226 220 41 82 23 129 41 121 194 153 78 127 155 101 163 283 193 58 153 57 52 22 254 272 62 101 146 142 96 181 43
-337 43 146 112 120 81 153 182
-393A82
##PAGE=	F1=6857.91
##FIRST=	17614.246348710370512,	4405.4455391999963467,	0.43518391251564025879
##DATA TABLE=	(F2++(Y..Y)), PROFILE
4405 80 88 155 135 167 60 117 174 156 60 165 107 42 92 79 127 165 40 229 179 150 67 61 51 151 182 142 68 142 109 238 126 227
4105 227 66 165 275 142 108 169 110 205 281 274 158 271 240 179 163 159 36 169 127 57 156 148 32 204 83 137 121 44 110 188 105
3814 105 200 102 86 119 74 144 69 145 7 82 111 78 150 291 263 200 228 43 223 168 142 102 245 195 135 143 66 228 108 269 42
3523 42 183 46 19 156 216 148 185 164 296 276 89 346 81 115 149 251 284 98 144 426 120 154 296 78 245 60 114 415
3260 415 449 448 192 76 991 8323 5881 11321 2807 1423 995 537 517 55 354 265 312 38 189 268 72 196 192 24 143
3025 143 334 93 115 183 163 277 238 209 76 239 237 250 119 190 57 299 353 26 156 194 206 154 52 261 131 79 110 134 27
2753 27 247 87 77 184 153 85 27 184 127 207 96 124 102 159 72 120 110 245 194 170 129 193 115 2 113 169 56 79 93 232
2471 232 139 168 121 177 177 25 68 160 150 205 50 124 128 137 84 132 134 59 142 254 165 70 20 31 55 163 30 152 106 79 66 193 146
2161 146 106 65 34 248 167 157 178 34 152 177 35 141 210 132 216 54 151 248 243 199 84 183 354 209 124 231 266 142 101 139
1880 139 147 203 82 161 115 99 35 227 191 126 153 168 211 150 84 96 47 116 234 247 225 178 59 55 58 173 39 107 121 209 186 170 156
1570 156 114 43 76 226 127 254 272 36 77 59 65 145 165 30 184 179 71 161 132 115 259 139 160 169 249 125 164 136 35 203 227
1279 227 60 174 161 163 38 160 160 158 285 301 139 66 62 107 73 309 64 149 239 173 184 121 49 153 111 118 52 189 118 148 91 102
978 102 189 256 44 280 181 13 40 69 213 40 117 112 213 246 158 145 97 192 76 23 147 46 108 68 86 104 255 269 159 210
696 210 192 220 74 119 242 284 61 163 72 125 72 157 101 73 77 75 153 272 131 165 73 76 174 214 161 38 102 110 72 91 7 197 260
387 260 155 97 74 169 214 115 123 100 133 64 142 239 270 158 162 118 141 128 180 116 167 84 17 137 56 111 62 91 63 218 105 56 144 210
67 210 370 190 127 126 129 90 186 314 159 103 248 78 293 251 51 32 37 148 40 115 203 156 91 129 143 133 142 257 141 12 152
-224 152 77 90 85 253 258 87 70 150 163 92 199 50 131 77 142 79 146 212
-393B12
##PAGE=	F1=6787.14
##FIRST=	17614.246348710370512,	4405.4455391999963467,	0.43319478631019592285
##DATA TABLE=	(F2++(Y..Y)), PROFILE
4405 86 95 132 153 156 72 62 204 237 34 144 67 52 85 111 124 129 46 240 205 165 81 80 95 139 172 154 59 138 95 268 111 259 125
4096 125 199 265 108 94 126 109 182 244 211 99 231 165 104 143 161 66 212 130 53 148 67 31 191 46 162 175 59 118 218 86
3814 86 224 169 95 79 44 144 104 177 35 112 155 95 119 289 282 214 239 12 227 137 149 118 263 177 146 164 61 239 99 302
3532 302 57 181 24 54 155 289 200 218 165 300 264 142 409 83 107 190 200 279 48 158 522 106 200 367 87 253 153
3279 153 257 545 635 603 273 132 1436 12007 8673 15615 3968 1985 1395 714 694 153 363 337 413 83 252 368
3072 368 143 196 190 39 133 407 79 43 221 150 250 190 231 82 277 243 221 111 227 68 208 281 32 158 182 131 101 40
2809 40 275 126 66 139 139 31 217 37 145 187 100 123 25 214 143 191 71 157 121 158 35 121 113 276 185 197 100 179 119 36 93
2518 93 212 48 98 112 223 95 158 118 191 221 26 70 191 115 219 84 147 121 171 118 164 164 53 70 243 148 38 47 10 44 140
2227 140 92 186 89 56 84 224 174 163 81 38 258 114 150 138 5 190 210 46 137 228 158 200 21 151 237 249 171 108 143 317
1945 317 204 140 230 226 127 137 189 178 225 58 144 137 98 22 184 227 119 130 210 208 69 150 42 82 85 210 213 239 227 114 15 51 192
1635 192 122 101 150 234 122 90 97 133 79 91 222 90 222 299 40 50 58 70 124 127 4 206 156 20 118 78 152 242 108 139 195 268
1335 268 112 162 155 32 235 268 122 136 168 147 67 169 145 160 248 290 119 75 61 98 83 315 40 190 272 175 116 94 28 134
1053 134 129 125 47 180 99 139 66 84 191 238 46 307 225 22 35 129 235 33 111 60 246 301 143 111 75 162 110 56 159 44
772 44 104 51 90 88 208 227 136 221 163 211 75 145 225 284 24 126 34 168 74 147 185 49 73 108 108 248 140 166 90 101 177 169 113
462 113 36 90 83 22 45 38 176 244 131 80 150 114 185 140 78 119 135 100 153 226 249 139 133 117 94 85 173 99 146 98 61 157 64 115 45 90
124 90 56 234 135 130 154 157 340 157 154 158 146 78 237 326 160 124 268 124 324 261 61 39 57 161 47 103 225 157 89 119 118 159
-177 159 124 214 81 33 127 116 125 157 237 235 123 114 151 190 94 212 67 99 85 156 91 118 241
-393B41
##PAGE=	F1=6716.37
##FIRST=	17614.246348710370512,	4405.4455391999963467,	0.67997890710830688477
##DATA TABLE=	(F2++(Y..Y)), PROFILE
4405 69 96 113 169 144 113 23 214 302 23 117 47 67 72 128 116 89 73 225 225 203 85 100 120 174 150 139 34 118 82 257 106 278
4105 278 172 211 222 82 167 89 91 171 191 138 49 199 79 26 116 139 83 221 128 44 162 17 84 178 5 172 210 112 99 237
3823 237 86 249 242 85 57 75 138 130 182 52 135 185 101 85 280 283 214 231 42 204 92 143 124 288 164 159 181 74 228 87
3542 87 315 97 183 15 104 128 340 233 233 152 300 229 200 438 85 124 214 135 256 78 174 582 138 232 416 79 256 242
3279 242 382 618 783 718 323 175 1772 14864 10911 18646 4817 2413 1674 857 809 258 352 380 484 153 315 437
3072 437 207 190 186 54 142 454 96 18 255 153 215 165 245 87 297 231 187 112 230 99 102 186 22 128 159 85 78 41 267 108
2790 108 45 155 117 83 172 45 186 185 59 151 36 229 153 166 72 166 125 158 26 123 119 296 165 201 73 163 119 55 88 236
2509 236 25 118 135 191 56 130 107 190 266 52 76 238 64 190 111 171 94 174 131 181 183 70 12 215 124 9 66 10 51 172
2227 172 168 201 92 52 112 232 196 192 129 68 255 67 148 89 37 205 209 92 158 218 160 166 84 149 224 236 133 135 127 285 191 155 204 162
1908 162 116 181 233 205 243 82 126 145 86 54 158 257 113 105 244 207 48 194 6 111 56 160 157 254 256 165 63 40 255 214 83
1617 83 177 221 63 18 34 174 122 87 187 34 166 297 110 22 77 90 103 96 26 236 163 58 102 47 185 214 66 114 208 257
1335 257 91 147 176 31 263 283 157 107 176 114 87 174 126 161 219 279 102 103 78 115 82 288 8 217 287 194 84 83 29 126 125 141
1034 141 52 153 72 109 45 80 190 210 74 321 261 26 38 165 246 42 134 66 253 342 120 61 53 128 152 94 175 92 117 34 91
743 91 70 150 187 116 221 107 169 105 171 194 255 109 109 80 214 128 155 261 86 89 136 77 221 134 171 131 158 189 129 39 75 81 60 98
424 98 72 89 147 201 115 70 223 49 141 162 22 138 127 140 167 201 201 99 105 107 106 30 151 89 130 100 90 152 60 111 33 89 62 214
105 214 145 185 139 95 290 127 170 187 126 53 279 310 152 140 264 165 313 251 68 85 75 171 53 97 264 157 69 99 81 171
-177 171 117 162 16 75 91 165 156 220 208 199 143 169 148 215 109 220 84 61 139 161 109 74 263
-393B63
##PAGE=	F1=6645.61
##FIRST=	17614.246348710370512,	4405.4455391999963467,	0.75822114944458007813
##DATA TABLE=	(F2++(Y..Y)), PROFILE
4405 36 92 96 178 136 142 62 203 330 35 89 48 81 48 126 103 66 91 189 236 243 76 116 118 227 151 97 14 104 106 205 113 279 200 201 154
4077 154 99 230 65 53 186 138 72 38 183 5 53 89 95 78 197 112 21 184 79 142 177 58 163 218 154 55 251 92 269
3804 269 299 58 87 97 121 146 159 58 144 193 109 78 265 265 205 206 62 151 52 124 124 325 160 171 194 92 197 80 309 136 182
3513 182 37 137 83 364 240 225 122 292 181 242 428 85 149 215 72 215 122 179 593 195 236 427 56 256 307 459
3269 459 618 865 767 324 192 1923 16214 12067 19680 5150 2604 1767 919 838 334 321 380 523 216 361 467 249
3063 249 181 179 71 161 464 137 69 262 154 182 190 234 91 289 211 153 98 213 135 85 159 6 88 122 88 100 46 241 84 31
2781 31 151 78 121 130 80 197 175 39 166 52 225 156 132 103 151 108 153 52 126 125 296 136 182 49 159 125 56 92 238 8
2499 8 122 144 145 63 90 93 175 289 86 101 289 34 124 120 188 68 152 115 169 182 90 66 173 100 27 76 21 74 216 229 185 95 71
2189 71 152 222 210 188 179 89 244 69 155 41 69 190 171 120 189 188 127 114 119 141 216 202 99 161 130 257 170 161 162 88 118 219 265 223
1870 223 247 126 116 145 69 80 174 276 102 87 269 212 127 220 41 124 29 93 114 268 259 198 96 39 314 284 59 198 173 24
1588 24 65 75 216 158 65 128 30 106 266 170 66 110 114 91 86 47 259 189 71 110 88 201 175 26 122 208 219 66 129 195 26 272
1288 272 266 161 88 189 92 95 180 113 161 218 264 80 151 109 154 59 234 70 232 280 209 107 92 53 141 105 160 57 114 55 71 38
987 38 94 188 181 102 313 279 34 43 172 242 64 153 102 231 358 88 11 44 109 189 120 187 130 131 32 79 55 92 163 101 209 38 100
678 100 139 192 159 200 178 133 155 247 153 180 313 139 109 148 60 191 113 182 176 216 205 117 55 144 85 51 176 130 133 120 143 125 70 280
358 280 25 88 167 36 151 106 174 178 164 143 49 91 100 176 46 119 79 111 95 99 126 58 99 35 91 72 163 130 202 104 27 219 110 182
39 182 202 72 28 304 268 138 146 233 177 260 224 68 115 86 183 55 101 309 157 36 74 38 165 127 118 51 107 71 207 180 259 172
-261 172 154 136 204 146 224 125 220 91 52 197 159 125 28 273
-393B73
##PAGE=	F1=6574.84
##FIRST=	17614.246348710370512,	4405.4455391999963467,	0.71216094493865966797
##DATA TABLE=	(F2++(Y..Y)), PROFILE
4405 25 88 79 172 133 151 104 172 311 53 71 65 92 15 109 88 79 90 147 234 269 57 123 90 269 195 58 66 116 164 122 129 258 202 174 74
4077 74 138 255 54 6 213 103 59 67 174 65 105 71 43 62 148 78 20 194 126 191 197 105 139 196 169 4 261 91 281 324 32
3786 32 129 90 95 155 118 57 133 176 131 108 245 237 195 172 69 76 75 101 117 363 164 177 196 101 154 82 288 153 168 54 148 41 360
3476 360 227 200 79 276 133 254 382 78 162 195 40 163 151 167 550 245 216 392 41 253 332 474 544 864 742 271
3232 271 175 1853 15724 11859 18461 4882 2511 1654 873 779 374 273 335 533 250 376 456 259 177 164 92 168 432
3016 432 185 110 242 143 165 242 193 89 251 200 119 67 200 159 86 157 21 111 72 95 121 41 203 55 63 129 65 143 115 113 180 165
2715 165 50 168 73 201 151 90 134 118 71 143 76 130 126 272 98 145 27 177 147 41 97 220 42 104 133 104 90 50 78 149
2434 149 280 108 148 334 78 36 114 195 81 120 77 130 160 94 96 124 80 44 77 26 99 240 267 137 104 112 191 206 215 160 213 92
2133 92 223 98 164 7 92 146 110 122 213 168 61 57 119 119 213 145 109 181 129 225 149 158 113 45 127 241 281 232 235 161 116 141 62 97 211
1804 211 276 93 87 281 215 180 223 64 122 3 36 125 271 237 207 102 48 342 324 44 212 107 44 112 143 236 178 51 64 88
1523 88 92 213 212 123 148 133 87 94 55 260 215 50 116 138 200 133 52 165 199 163 41 118 207 22 255 220 140 76 204 103 92 185
1222 185 109 159 241 242 63 212 149 198 19 161 138 239 257 211 139 103 79 166 77 175 68 72 57 47 49 116 187 160 118 283 277 52 50
912 50 157 227 99 152 132 190 346 48 81 68 119 217 127 191 147 136 50 53 49 49 156 93 187 34 24 165 201 133 131 221 166 219 253 135
593 135 214 333 178 135 137 41 159 83 188 211 256 217 129 145 218 108 70 228 172 157 102 83 152 77 312 105 31 158 89 158 74
302 74 198 178 125 95 2 100 101 237 95 85 57 86 85 93 91 69 81 56 94 82 98 94 181 57 43 132 96 184 203 11 39 306 204 121 137
-27 137 178 153 177 192 57 118 82 196 54 107 348 155 31 57 42 148 154 111 119 129 84 224 193 270 136 102 102 213 158 210 135 209
-327 209 87 91 238 156 138 38 266
-393B66
##PAGE=	F1=6504.08
##FIRST=	17614.246348710370512,	4405.4455391999963467,	0.77282494306564331055
##DATA TABLE=	(F2++(Y..Y)), PROFILE
4405 57 89 59 149 133 143 130 133 251 69 69 90 97 28 89 75 103 70 117 215 268 47 121 44 283 250 94 123 145 222 43 153 219 180
4096 180 137 30 166 240 52 63 231 89 85 99 159 109 138 74 54 66 86 35 70 183 153 224 231 136 105 148 151 66 261 75 280 309
3795 309 56 156 57 69 157 73 52 99 137 165 145 222 209 183 134 79 12 133 85 101 385 171 169 182 94 118 87 257 133 130 62 137
3495 137 38 329 214 176 38 255 100 232 312 66 157 159 54 108 164 132 459 269 187 315 62 248 316 429 420 782 649 176
3232 176 128 1578 13517 10344 15291 4076 2161 1365 722 650 376 213 255 513 246 353 411 236 188 144 111 157 365
3016 365 228 139 200 116 174 291 131 75 182 209 86 53 208 169 59 129 51 183 22 86 121 23 161 22 102 96 106 150 134 145
2734 145 149 165 75 159 99 165 134 43 150 81 17 132 93 133 118 229 64 109 17 211 187 22 101 190 71 67 103 88 99 47 62 117
2434 117 236 105 204 367 128 55 98 190 114 101 61 80 122 88 93 73 73 57 73 31 125 239 279 78 133 165 213 190 209 128 221 73
2133 73 190 118 168 9 100 81 81 102 220 185 46 46 88 82 213 76 164 189 112 184 133 149 68 82 129 239 284 233 203 176 119 142 67
1823 67 107 238 258 95 102 273 203 190 200 73 107 31 76 161 252 195 193 78 56 331 334 45 221 69 67 139 191 225 179 90 53 126 133
1513 133 153 231 165 178 137 84 100 51 238 230 18 103 172 186 94 99 213 187 106 25 113 210 29 213 153 112 74 218 121 88 187 107 154
1203 154 268 207 84 274 189 231 30 88 197 242 225 203 157 104 100 184 52 184 90 41 62 60 74 132 185 152 116 243 265 81 63
912 63 134 207 142 131 152 143 306 3 158 113 152 235 116 182 136 130 75 16 54 42 157 92 159 87 65 179 198 127 72 233 178 254 223
602 223 85 246 319 193 168 107 12 128 52 179 228 267 225 144 220 277 140 117 242 188 152 101 33 178 88 316 178 28 152
330 152 128 158 39 208 162 108 75 30 118 103 264 123 56 27 75 72 80 65 82 60 94 94 88 58 47 128 17 110 37 80 170 193 92 65
11 65 282 135 97 112 107 99 83 162 31 96 65 207 58 108 370 153 80 63 95 134 189 147 183 141 105 208 190 253 111 52 50 199 185
-299 185 174 135 188 79 135 253 163 147 70 243
-393B43
##PAGE=	F1=6433.31
##FIRST=	17614.246348710370512,	4405.4455391999963467,	0.93044555187225341797
##DATA TABLE=	(F2++(Y..Y)), PROFILE
4405 79 95 39 108 131 124 136 100 165 87 71 109 94 64 81 68 119 37 106 181 238 63 113 11 268 285 143 168 169 261 88 175 167 142 99
4086 99 84 168 202 55 123 231 80 97 127 140 139 158 88 108 102 37 40 121 150 159 235 262 148 69 85 102 117 245 50 267 258 98 156 32
3767 32 60 151 59 49 45 89 198 169 196 189 164 97 105 93 187 77 75 376 169 142 149 79 101 84 221 77 67 68 114 53 276 217 173 15
3448 15 230 87 180 235 65 144 120 60 66 170 76 339 259 169 213 90 237 263 346 284 637 512 63 66 1160 10133 7895 10935
3185 10935 2922 1644 975 498 483 343 145 159 457 211 294 344 185 216 137 122 133 276 258 156 147 77 205 320 85 50
2941 50 88 228 57 86 235 175 65 104 82 240 38 78 102 14 123 11 128 74 154 149 162 171 126 174 99 139 125 123 107 17 146 66
2640 66 48 117 106 136 106 181 66 114 32 243 235 43 106 161 86 34 60 91 85 75 37 86 166 75 252 386 169 128 81 174 134 104 105 71
2321 71 82 109 65 36 79 77 70 40 150 222 267 76 176 216 210 169 192 120 197 38 141 128 163 13 97 34 133 71 208 228 137 85 51
2011 51 34 214 41 226 188 76 133 120 138 35 117 114 212 277 232 157 174 117 157 80 116 240 221 109 113 241 177 160 151 69 82 75 135
1701 135 179 214 144 159 30 65 284 315 46 225 93 77 146 210 184 161 148 96 136 167 101 223 183 193 123 80 91 43 203 233 72
1410 72 70 187 167 64 136 243 172 73 28 106 200 41 152 80 103 82 228 117 88 181 102 144 282 161 135 322 223 245 75 61
1128 61 235 241 197 196 162 93 114 186 35 184 118 37 75 93 103 143 177 158 98 211 254 114 83 114 189 184 98 161 106 245 45 221 160
818 160 193 245 91 161 102 116 100 36 68 61 153 97 131 119 123 181 188 133 58 219 159 257 159 59 266 279 181 199 92 37 101 32 149 222
499 222 247 229 157 267 306 168 173 216 172 117 116 5 190 104 296 232 78 161 145 147 19 204 132 130 83 37 122 91 247 124 49 64
199 64 105 53 67 53 83 44 147 89 91 77 19 66 39 169 69 71 139 174 168 80 232 100 66 75 48 58 50 137 14 58 53 209 73 98 372
-130 372 149 133 86 147 134 220 198 236 146 121 160 170 217 100 6 51 174 218 125 127 160 83 170 242 185 152 86 207
-393B07
##PAGE=	F1=6362.55
##FIRST=	17614.246348710370512,	4405.4455391999963467,	0.95358788967132568359
##DATA TABLE=	(F2++(Y..Y)), PROFILE
4405 83 102 39 61 130 98 123 83 84 108 66 118 78 91 80 67 120 28 99 140 183 81 103 53 230 282 163 187 175 271 154 187 111 100 75
4086 75 123 142 168 58 171 218 65 87 151 129 164 173 98 151 144 72 89 164 106 148 222 279 145 58 29 33 148 212 32 244 182 133 129 77
3767 77 69 140 94 50 19 65 221 175 171 172 136 62 139 161 227 65 43 334 153 96 102 71 91 70 191 48 29 76 88 52 208 231 186 17
3448 17 212 85 108 169 87 137 91 48 49 174 37 215 217 162 117 104 215 189 253 184 459 358 36 36 691 6353 5085 6372 1677
3175 1677 1082 578 261 317 285 78 68 367 161 211 267 120 252 163 122 114 186 270 162 95 28 240 325 106 21 19 241 43 123
2903 123 261 190 80 93 108 257 67 93 89 47 105 40 133 90 190 149 182 183 123 181 119 113 150 80 72 49 124 84 119 94 111 138 97 144
2584 144 92 160 51 259 283 83 116 147 86 59 15 90 71 90 4 61 87 27 277 385 196 168 70 148 133 112 152 103 64 168 40
2293 40 39 87 106 74 53 174 206 235 133 213 253 181 137 163 134 150 19 81 135 150 34 92 80 194 51 186 266 219 105 63 20 212
1992 212 94 273 182 28 82 103 125 16 131 80 167 262 235 105 164 114 189 107 128 218 170 121 117 190 146 111 86 53 48 126 181 169 168
1682 168 102 113 36 82 214 274 40 223 113 78 137 200 124 128 196 123 119 170 73 195 175 189 94 75 63 53 173 228 139 23 190 145
1382 145 43 160 250 152 80 42 90 177 53 85 40 117 98 232 91 98 169 94 130 274 109 185 346 245 238 107 96 244 234 184
1100 184 199 159 74 117 172 30 176 144 48 110 133 127 151 160 172 68 199 248 145 111 105 183 214 65 164 81 170 91 257 196 232 250 60
790 60 133 56 99 119 87 84 77 139 106 108 125 156 178 177 135 72 189 110 234 71 115 269 229 149 218 136 83 76 40 99 195 204 227 167 283 299
452 299 180 222 163 127 61 135 12 187 126 260 256 118 181 137 122 20 186 103 178 103 26 107 59 194 103 69 134 159 31 47 39 71
152 71 45 211 81 104 97 48 50 65 212 154 82 100 146 220 81 163 135 51 29 72 110 113 114 62 40 69 196 92 76 353 145 178 116 185
-167 185 142 236 241 273 144 140 94 135 171 99 33 117 152 239 79 116 133 106 191 213 213 151 85 168
-393A68
##PAGE=	F1=6291.78
##FIRST=	17614.246348710370512,	4405.4455391999963467,	0.75431680679321289063
##DATA TABLE=	(F2++(Y..Y)), PROFILE
4405 71 104 66 55 140 69 98 81 67 136 61 126 58 107 75 66 107 71 88 100 108 83 94 79 177 241 143 175 161 254 190 183 63 69 71 132 97 157
4058 157 58 199 207 49 64 171 133 181 188 98 172 172 123 134 192 70 125 190 277 139 85 49 41 153 170 50 215 99 157 81 127 77
3758 77 130 139 54 84 100 231 162 145 149 104 36 165 206 253 44 12 272 126 38 83 74 77 54 177 130 115 85 67 33 138 234 195 19
3448 19 208 81 39 121 117 145 84 32 51 176 101 116 152 142 74 100 179 114 181 147 285 213 95 75 266 2961 2515 2514 589 592 276
3157 276 135 184 216 44 24 254 109 122 190 56 284 214 116 113 119 263 161 60 22 263 306 150 8 120 236 54 139 269
2894 269 216 58 62 123 230 70 123 105 79 120 62 119 127 211 153 190 178 132 181 136 83 169 45 33 74 92 113 187 62 105 139 95 127
2584 127 105 207 71 252 325 123 128 151 76 93 28 76 91 82 51 47 18 51 274 364 211 175 65 113 114 111 171 122 81 234 64 52 84
2274 84 134 85 64 195 204 193 175 229 263 139 95 127 147 97 60 45 148 137 58 93 123 226 66 167 284 270 95 99 58 203 141 294
1973 294 177 26 46 76 104 11 134 49 111 240 242 57 159 118 232 149 144 179 109 122 114 129 132 79 30 34 30 177 212 139 143 96 65 99
1654 99 105 140 223 30 218 102 80 116 169 80 91 222 120 83 139 75 156 145 168 66 82 37 79 168 222 196 40 186 122 25 175
1363 175 236 124 103 57 68 140 60 43 82 131 117 229 72 119 153 88 115 244 62 214 342 251 217 117 126 223 220 190 208 154 53
1072 53 106 143 33 157 160 60 157 180 141 158 134 187 37 202 237 168 145 116 190 227 42 165 58 88 129 254 212 263 250 33 106
781 106 43 84 126 131 98 83 122 115 90 109 162 172 171 130 74 156 50 199 20 176 257 186 109 217 210 126 54 64 37 149 154 218 178 268 259
452 259 172 248 115 62 11 145 7 172 150 218 247 143 198 106 83 14 155 101 228 119 35 76 26 120 73 95 197 212 38 15
171 15 38 49 62 276 87 136 99 77 91 75 234 215 102 74 114 246 69 94 191 76 21 117 175 161 89 114 79 99 166 106 44 316
-130 316 140 206 146 204 145 229 269 288 139 172 54 95 124 100 67 179 140 235 56 104 113 131 197 180 232 142 76 135
-393A35
##PAGE=	F1=6221.02
##FIRST=	17614.246348710370512,	4405.4455391999963467,	0.45451578497886657715
##DATA TABLE=	(F2++(Y..Y)), PROFILE
4405 53 101 96 102 165 42 70 83 97 169 72 146 60 116 65 69 86 114 87 70 39 64 89 82 118 172 92 135 131 227 198 162 44 59 70 110 41 151
4058 151 53 205 209 44 44 183 138 183 197 88 172 178 159 170 202 66 96 148 260 144 124 84 104 134 127 79 183 55 166 26 159
3767 159 77 127 177 58 138 148 228 136 119 112 88 50 172 228 266 15 28 217 112 34 121 74 74 55 178 210 197 87 55 5 91 213
3466 213 185 34 218 75 52 86 134 151 99 54 64 174 175 74 76 98 90 80 129 70 147 132 150 96 98 109 110 525 676 324 170 249 175
3157 175 207 99 159 72 63 138 60 50 119 8 305 259 107 117 92 242 154 51 67 265 267 176 24 201 210 74 126 252 240 40
2875 40 44 125 172 45 152 131 100 158 82 98 163 221 158 185 155 135 181 155 58 179 47 8 83 60 138 246 35 83 138 95 122 92 232
2565 232 93 226 352 156 138 161 69 108 51 53 125 56 107 43 31 111 244 322 214 156 61 70 90 101 155 110 103 279 104 53 66 148
2265 148 103 70 212 213 147 182 215 242 109 58 90 148 79 98 93 166 133 70 92 135 220 96 166 278 286 69 120 77 182 163 284 172
1964 172 68 41 41 75 18 148 73 57 210 247 23 165 133 276 196 162 134 54 106 108 77 139 88 51 32 69 218 231 111 155 126 36
1664 36 149 125 86 177 30 219 71 92 86 131 93 60 223 99 50 87 89 120 105 147 69 118 74 110 183 217 232 93 178 100 11 183
1363 183 209 86 124 76 50 91 62 64 127 129 137 219 107 148 134 85 101 195 45 215 313 239 195 107 132 182 199 208 213 153 32 83 102 37 130
1034 130 162 74 194 228 143 160 101 193 18 207 211 178 177 151 212 219 44 165 38 18 153 212 209 281 242 25 87 83 78 118 159 104 82 109
715 109 118 75 79 148 166 171 120 61 130 53 169 99 215 238 163 74 195 277 161 41 90 51 100 123 201 190 230 198 150 244 120 21 66 140
396 140 27 153 172 186 210 152 201 59 57 35 112 128 268 121 66 39 67 45 48 117 233 251 84 56 85 24 78 334 120 180 96 102
95 102 124 69 231 242 117 71 85 247 56 74 229 112 63 138 211 180 61 161 126 125 124 110 35 263 138 211 173 200 136 203 279 281
-205 281 135 216 103 57 84 97 101 224 134 200 53 90 108 143 189 157 230 121 85 120
-393A20
##PAGE=	F1=6150.25
##FIRST=	17614.246348710370512,	4405.4455391999963467,	0.25150009989738464355
##DATA TABLE=	(F2++(Y..Y)), PROFILE
4405 38 93 116 146 199 20 55 86 105 202 95 170 91 121 71 83 63 144 113 52 89 35 84 70 57 98 49 81 94 210 189 129 64 59 57 60
4077 60 20 123 46 193 224 52 40 181 127 166 197 76 155 159 175 197 199 76 66 106 234 161 162 99 147 97 93 101 150 88 161 40 166
3767 166 77 137 205 58 170 188 216 100 89 64 100 86 159 234 271 13 53 206 134 77 167 70 103 67 178 252 254 80 73 30 106 173
3466 173 154 60 232 68 95 66 130 143 121 100 97 165 232 80 6 58 98 52 69 87 137 106 102 17 51 125 279 755 545 1326 546 70
3166 70 191 253 57 130 99 88 50 55 61 56 38 308 276 98 105 93 220 141 52 99 243 217 176 27 248 164 90 83 210 248 97 116 119
2856 119 106 3 179 147 108 198 100 85 189 224 158 169 120 129 191 175 41 180 77 35 78 41 160 290 56 42 135 89 124 57 228
2565 228 117 187 359 178 141 164 78 107 63 34 141 61 161 48 55 155 199 266 205 125 50 18 78 83 111 72 113 289 134 49 39
2274 39 142 122 76 225 222 103 152 174 191 111 56 60 141 99 121 146 181 143 62 74 116 180 124 183 259 276 91 121 74 152 160 246 159 89 42
1945 42 19 42 37 183 120 11 176 247 18 174 150 310 237 176 97 52 77 99 58 152 109 78 60 117 239 244 110 181 169 56 175
1654 175 133 77 148 37 232 66 110 55 105 126 45 204 99 51 46 102 101 71 148 105 175 132 139 202 210 245 135 161 83 28 186 178 38
1344 38 141 101 56 42 57 90 160 111 156 201 161 179 122 86 94 139 80 186 270 208 177 91 111 133 178 221 210 164 14 51 50 41 97 148 84
1016 84 207 269 139 153 67 183 21 204 171 176 200 199 244 196 77 165 51 72 160 142 201 282 225 40 83 116 85 95 165 98 79 102
715 102 113 62 48 125 160 176 115 44 112 102 147 148 227 222 152 49 160 320 185 49 115 117 93 134 178 202 177 133 128 211 155 79 109 132 67
387 67 135 187 176 157 146 193 18 93 88 67 156 290 100 85 16 123 19 39 127 230 271 143 130 149 12 82 375 169 216 103 125
95 125 137 52 203 232 120 74 65 231 55 112 238 137 94 131 207 172 37 195 162 137 91 103 78 199 150 193 192 173 120 165 273 258
-205 258 133 261 167 31 68 87 135 248 128 137 50 79 117 137 170 148 200 89 118 125
-393A25
##PAGE=	F1=6079.49
##FIRST=	17614.246348710370512,	4405.4455391999963467,	0.10647573322057723999
##DATA TABLE=	(F2++(Y..Y)), PROFILE
4405 31 84 119 171 232 5 62 92 85 229 115 177 123 126 103 115 47 155 148 43 170 58 79 71 5 72 72 40 62 214 181 90 92 54 33
4086 33 8 69 64 39 169 241 61 48 163 98 133 189 71 133 124 168 218 186 74 48 73 208 186 193 94 163 50 67 115 119 122 145 75 152
3767 152 91 159 218 55 178 213 204 61 59 18 118 122 135 234 268 37 72 234 173 96 186 83 146 74 164 247 275 75 121 57 150 133
3466 133 105 84 235 66 115 72 104 116 143 146 142 150 261 77 61 105 85 25 8 119 130 98 129 32 48 132 351 1004 745 1366 594
3175 594 76 162 220 42 119 105 103 61 112 112 13 64 286 256 88 73 108 213 124 56 114 201 161 162 25 257 108 94 22 149 231 146
2875 146 181 110 73 61 206 145 112 232 117 85 202 219 148 140 83 116 208 189 31 176 106 56 63 43 181 318 96 24 128 70 136
2584 136 51 199 141 151 339 187 134 157 93 111 87 35 127 118 203 60 71 174 155 202 184 96 27 42 88 63 57 30 108 262 151 65
2283 65 25 115 141 89 232 223 64 99 116 123 131 71 42 130 112 129 177 183 154 51 36 79 119 145 206 235 253 163 107 71 125 142 188 129 86 28
1945 28 49 33 63 224 158 24 145 239 30 172 155 326 262 181 76 95 48 82 65 162 132 78 95 158 234 249 125 196 215 90 172
1654 172 132 95 130 41 252 99 123 32 97 143 50 175 142 65 58 113 104 48 179 148 234 183 161 214 199 239 164 135 91 56 184 149 16
1344 16 151 132 78 41 46 98 181 88 175 177 200 204 135 91 95 94 128 135 229 163 159 98 70 92 171 216 204 188 11 33 22 50 60 119 84 192 296
997 296 134 131 37 156 22 189 128 163 208 243 280 167 131 168 83 126 149 82 208 269 198 66 103 129 107 64 147 79 77 95 99 51 25
687 25 105 154 181 117 36 98 130 118 159 219 214 136 32 121 332 196 62 133 170 144 171 154 207 121 91 118 161 176 123 129 145 114 124 189 181
358 181 107 133 183 52 150 147 57 169 293 56 81 42 164 51 42 122 189 272 202 206 210 37 69 391 219 228 111 135 133 38 155 189 115
48 115 74 57 207 63 144 218 149 112 104 166 146 22 213 182 138 104 89 127 132 174 160 197 130 106 128 256 227 129 297 217 19 87 69
-261 69 170 254 120 56 42 84 136 119 143 148 147 52 157 142
-393A42
##PAGE=	F1=6008.72
##FIRST=	17614.246348710370512,	4405.4455391999963467,	0.2116171717643737793
##DATA TABLE=	(F2++(Y..Y)), PROFILE
4405 35 76 102 170 251 13 77 104 73 243 125 159 141 129 146 157 54 142 166 38 238 120 90 102 57 112 102 53 43 227 176 56
4114 56 121 46 29 85 115 20 37 147 250 68 63 134 64 92 175 78 117 89 144 230 166 57 59 58 189 210 214 76 152 23 48 120 98 133
3795 133 125 85 125 114 183 218 45 160 223 197 22 50 50 127 151 111 238 258 56 88 266 200 88 164 119 183 68 134 201 259 93
3504 93 176 75 186 121 46 98 224 69 107 91 77 76 157 181 184 126 258 54 107 182 76 12 49 141 118 139 155 54 141 138 350 622
3204 622 475 772 440 146 90 129 72 105 89 119 91 173 157 54 87 237 200 74 31 133 228 112 82 115 146 104 154 36 235
2931 235 52 81 51 93 184 162 207 108 90 116 230 136 125 255 126 93 202 202 127 100 61 100 219 188 21 174 126 65 47 47 201
2640 201 329 128 86 117 43 162 105 155 161 130 290 181 119 143 99 138 134 51 86 181 227 72 96 167 124 142 155 76 33 108 110 41 41 55
2321 55 89 208 157 105 49 80 154 110 229 208 30 55 66 73 148 73 36 117 100 122 178 167 155 79 63 65 54 154 227 217 234 235 93 98 122
1992 122 127 123 83 63 7 82 61 90 257 177 51 135 225 47 153 140 318 269 174 65 128 58 55 70 173 170 57 128 185 204 240 131
1692 131 193 259 121 147 134 116 105 38 269 120 121 21 98 136 73 148 194 65 73 119 123 25 218 186 276 213 175 214 180 222 177 107 132
1382 132 83 181 121 64 153 165 103 85 33 90 188 76 191 154 209 214 172 95 101 88 176 76 199 111 132 136 44 72 183 187 203 214 24 56
1063 56 88 77 25 80 66 156 303 128 101 20 116 17 161 107 147 197 271 314 141 190 177 109 155 123 109 232 243 165 100 150 122 141 54
753 54 111 56 75 79 75 44 18 93 145 179 122 38 91 127 77 135 198 209 107 29 91 313 192 65 144 202 200 207 131 202 74 83 114 113 168 142
415 142 127 179 159 115 180 181 81 119 180 91 198 196 99 166 278 13 53 87 182 62 57 102 129 260 250 267 259 75 41 379 257 211 103
105 103 123 120 48 98 123 99 74 62 179 70 154 182 153 117 71 104 112 13 211 186 131 151 73 167 72 194 129 186 77 108 104 231 197 123
-214 123 314 252 11 118 45 200 246 115 34 44 114 153 109 120 143 82 37 182 157
-393A57
##PAGE=	F1=5937.96
##FIRST=	17614.246348710370512,	4405.4455391999963467,	0.30550885200500488281
##DATA TABLE=	(F2++(Y..Y)), PROFILE
4405 48 70 70 145 250 34 90 121 115 244 128 128 140 128 186 196 77 109 151 35 283 184 130 145 104 148 105 73 37 233 164 44 150
4105 150 41 60 156 157 101 46 138 247 73 82 109 63 65 159 87 113 82 108 230 143 39 88 58 179 227 221 54 119 53 31 121 101 121
3795 121 110 66 96 129 197 203 31 124 218 198 15 69 92 121 173 105 253 242 78 107 277 202 72 107 161 206 55 106 147 216 127 216
3495 216 88 202 136 12 98 202 80 78 108 90 35 159 198 211 95 227 20 138 243 86 17 94 151 100 184 164 63 222
3232 222 140 325 250 178 101 230 201 30 46 118 81 69 142 95 216 189 93 110 167 122 56 24 158 253 116 126 113 88 49 167 62
2941 62 195 21 52 116 92 121 154 196 118 115 156 247 133 158 271 124 104 191 171 96 59 65 87 212 165 37 179 139 62 36 42 216
2640 216 323 148 150 102 42 193 160 115 171 131 220 161 93 127 86 179 191 68 41 231 230 78 127 141 106 95 123 70 90 171 133 20
2340 20 77 114 62 148 159 150 79 72 160 129 212 177 8 80 84 113 161 60 36 101 66 108 155 133 139 126 144 105 14 147 239 210 219 284 82 141
2002 141 144 129 61 40 48 41 114 89 113 269 174 70 147 209 69 114 105 285 257 157 52 141 92 36 68 192 221 50 156 200 156 215
1701 215 121 179 299 144 116 151 137 71 35 270 110 105 18 94 110 110 128 222 51 63 121 155 13 244 216 290 217 180 199 160 204 178
1401 178 99 187 108 181 100 104 146 188 123 122 29 73 180 73 204 141 184 208 209 96 109 108 214 43 175 63 96 180 83 75 204 131 210
1091 210 228 35 88 156 121 17 48 35 110 289 115 79 26 78 26 120 129 133 169 274 340 130 241 195 121 155 90 170 255 207 129 139
790 139 210 102 180 90 73 59 68 54 47 42 23 90 132 167 122 41 95 99 25 91 174 200 67 60 77 269 171 54 145 211 232 229 110 187 49
462 49 87 105 89 135 136 111 208 193 100 162 164 86 104 182 122 226 221 144 154 254 69 29 148 181 62 78 68 85 240 279 298 290 123 18
142 18 340 280 169 73 81 121 76 57 49 72 73 77 149 73 143 145 150 115 52 50 77 4 186 174 119 197 56 194 38 195 111 157 34 130 100
-186 100 202 177 108 311 269 2 148 24 219 231 121 110 52 152 159 127 116 129 44 68 185 163
-393A63
##PAGE=	F1=5867.19
##FIRST=	17614.246348710370512,	4405.4455391999963467,	0.20906484127044677734
##DATA TABLE=	(F2++(Y..Y)), PROFILE
4405 61 65 29 99 226 56 98 139 182 232 130 121 124 117 216 224 101 71 100 44 301 238 187 182 137 161 82 77 32 222 131 67 174 49 86 209
4077 209 192 171 65 138 232 78 95 105 94 65 146 91 122 98 70 212 121 52 121 64 178 228 212 42 71 78 26 119 122 95 107 30 78
3767 78 130 193 173 13 78 200 199 44 88 118 102 195 117 277 223 104 132 262 180 96 52 191 218 62 112 144 164 156 226 103 199 153
3466 153 65 84 181 106 37 129 135 23 144 192 217 57 177 32 157 273 99 22 123 151 75 200 165 70 271 131 313 552
3204 552 422 420 100 211 70 108 154 56 76 166 79 232 203 118 128 95 39 43 46 166 271 135 165 114 45 10 187 84 159 42 32
2912 32 164 139 82 155 162 141 135 174 251 140 204 283 114 114 169 128 59 53 82 79 185 122 83 189 152 52 28 28 223 306 157 199 87 78
2593 78 219 197 92 170 148 143 133 62 112 55 215 240 81 65 259 215 79 150 107 91 67 97 92 158 224 148 15 114 180 37 110 166
2293 166 190 110 110 162 136 180 141 22 124 140 187 175 49 36 83 22 91 119 91 107 161 221 153 38 122 242 213 199 298 68 172 173
1992 173 143 21 61 76 78 145 104 123 256 150 79 165 188 89 61 56 227 232 135 35 133 120 63 68 209 268 87 178 208 108 173 100 166
1682 166 329 158 113 182 162 50 38 251 76 84 28 81 75 154 114 213 48 33 120 192 64 246 235 269 197 174 170 141 190 171 114 232
1382 232 131 187 100 133 134 193 131 143 45 54 155 65 213 144 132 188 228 93 112 121 234 73 148 41 58 212 135 94 215 60 216
1091 216 219 45 108 212 173 40 63 48 72 259 90 82 40 58 43 74 176 125 127 252 356 143 269 217 122 131 60 209 256 165 94
800 94 176 266 84 215 137 70 92 55 46 34 39 35 90 114 145 119 36 101 61 25 46 150 182 28 105 77 213 135 36 135 201 228 228 94 164
471 164 41 88 96 97 90 113 90 209 206 77 147 128 99 84 180 151 230 214 173 140 228 119 63 215 176 65 93 36 92 217 281 292 303 174
152 174 46 281 283 128 44 30 161 111 65 30 32 63 90 114 80 123 118 139 111 52 60 49 20 142 149 99 226 35 211 43 172 102 112
-158 112 55 161 113 173 170 86 288 274 20 168 37 220 210 143 170 50 178 145 155 131 104 69 102 162 153
-393A53
##PAGE=	F1=5796.42
##FIRST=	17614.246348710370512,	4405.4455391999963467,	0.10926804691553115845
##DATA TABLE=	(F2++(Y..Y)), PROFILE
4405 67 60 17 42 182 76 102 154 243 211 133 148 106 94 233 236 115 72 44 71 291 272 240 206 148 155 53 75 29 191 71 102 184 70
4096 70 97 233 215 214 88 141 208 82 92 113 119 76 137 92 141 113 37 172 102 85 149 71 182 207 186 46 20 82 43 116 140 66 110
3786 110 42 82 117 166 130 22 36 170 194 65 93 129 78 221 136 298 206 128 156 224 146 149 107 201 222 95 147 192 131 164 200 125
3485 125 184 161 107 72 169 149 30 168 177 38 113 161 202 20 128 74 170 269 95 23 136 144 42 178 164 75 283 108 320 683
3204 683 537 508 100 176 112 164 165 45 106 182 57 221 194 125 135 75 43 48 44 147 269 151 184 115 46 40 197 95 147 62 81 189
2903 189 182 123 181 127 167 152 170 241 145 249 293 104 120 139 80 22 92 99 76 148 66 137 200 170 49 15 31 220 280 160 226 76 115
2593 115 234 208 80 156 172 88 104 52 99 30 240 269 85 111 262 190 80 157 75 72 62 88 136 220 255 149 33 149 250 31
2311 31 109 184 220 142 157 166 125 140 121 33 157 192 251 187 70 34 67 37 75 82 63 72 171 273 186 47 82 233 224 165 273 41 171
2002 171 192 159 41 101 111 110 173 103 117 216 109 79 170 160 102 22 21 152 199 117 43 110 130 109 82 212 291 132 198 213 84 125 79
1692 79 162 345 162 148 213 183 73 45 218 62 81 53 67 58 196 103 169 83 37 118 226 121 219 240 219 158 156 128 129 178 160 130 249
1382 249 158 200 130 149 128 176 123 143 72 43 116 39 215 157 73 169 223 91 108 113 234 110 118 56 43 224 175 116 207 63 214 186
1081 186 58 112 249 222 54 95 103 51 221 60 95 48 55 56 68 222 120 82 212 361 179 266 235 117 92 46 218 226 117 68
800 68 200 302 73 239 178 101 127 37 72 60 29 48 88 93 117 114 18 93 50 59 28 129 157 9 154 81 162 94 43 116 181 188 203 81
480 81 137 34 100 120 119 52 88 70 169 194 48 150 91 110 57 172 191 215 174 179 125 202 144 101 273 182 68 91 48 106 193 257 249 301
161 301 219 75 209 267 121 82 96 239 149 90 79 24 41 92 74 103 110 92 120 110 61 92 43 45 82 117 70 231 19 218 51 130
-139 130 89 60 99 189 136 148 175 59 249 269 38 180 68 198 185 175 205 31 181 115 173 147 74 92 123 117 128
-393A28
##PAGE=	F1=5725.66
##FIRST=	17614.246348710370512,	4405.4455391999963467,	0.1407346576452255249
##DATA TABLE=	(F2++(Y..Y)), PROFILE
4405 63 55 48 28 133 91 104 164 285 186 130 169 98 62 233 232 114 117 106 108 259 284 272 212 135 135 43 78 32 144 24 139 173 96 91 226
4077 226 224 228 109 139 178 83 67 115 125 83 131 94 165 117 35 120 91 120 171 78 184 160 145 58 23 69 69 112 144 47 106 88 99 100 121 79
3739 79 53 39 133 178 75 85 126 57 250 153 303 189 138 174 170 119 194 187 199 220 130 177 234 129 147 144 150 169 162 137 88 166 202 66 220
3410 220 204 42 72 114 178 33 121 115 177 238 76 23 134 128 25 128 165 76 262 72 335 550 434 311 84 133 144 169 146
3138 146 42 132 180 41 188 171 109 127 113 98 66 11 103 244 153 174 109 62 59 187 91 162 80 148 192 205 181 216 102 191 164 150
2837 150 217 139 285 299 104 116 102 35 14 134 112 79 123 43 184 204 190 63 1 67 209 249 160 224 71 139 238 195 64 134 198
2546 198 87 81 90 91 68 258 273 79 138 245 166 89 152 52 47 72 88 184 267 258 130 52 180 315 35 122 210 238 174 191 175 98 104
2236 104 130 35 178 233 296 190 105 41 57 78 59 52 72 55 157 291 200 36 39 216 236 115 216 12 134 203 171 69 120 127 134
1945 134 194 85 97 155 69 80 155 123 107 73 54 71 162 114 82 78 122 151 110 191 278 165 215 217 89 80 69 166 346 156 195 231 194 99
1626 99 48 181 103 105 83 63 90 226 94 105 129 78 116 245 170 166 229 153 110 124 83 122 165 146 128 234 199 213 170 156 131 140 98 120
1307 120 100 47 71 2 211 168 68 168 208 100 94 89 219 143 95 75 63 215 192 126 176 138 202 139 76 101 260 258 58 113 156 50
1006 50 187 45 96 44 50 62 115 253 120 59 161 355 222 232 245 115 53 43 200 168 65 54 204 306 68 242 202 129 148
734 148 21 106 94 13 53 78 78 94 114 16 69 77 71 34 106 128 14 198 81 135 65 81 89 162 120 157 69 107 50 141 177 144 41 79 53
405 53 92 154 24 169 91 118 26 164 244 188 111 161 104 174 143 122 309 197 65 74 84 93 170 216 178 286 249 92 133 228 144 142 192
95 192 332 189 104 108 75 15 74 53 142 112 66 107 113 80 106 63 69 19 84 32 212 43 214 49 93 67 26 133 207 157 128 184 34
-214 34 203 259 52 184 99 158 153 209 217 24 162 88 167 153 46 89 128 58 94
-393I4
##PAGE=	F1=5654.89
##FIRST=	17614.246348710370512,	4405.4455391999963467,	0.17304359376430511475
##DATA TABLE=	(F2++(Y..Y)), PROFILE
4405 53 54 70 80 99 108 113 167 302 166 114 158 94 42 218 219 102 159 198 144 211 274 271 205 97 105 52 85 41 89 97 169 141 125 71 189 222
4067 222 218 122 133 141 81 23 102 116 86 127 103 188 109 77 90 91 151 182 86 178 91 93 71 49 57 91 111 130 49 88 118 113 91 76 41 87 70 100
3711 100 151 74 72 116 50 276 166 280 171 130 181 113 111 214 243 199 208 152 184 244 140 105 91 172 163 162 156 134 166 253 94 263 214 40
3391 40 53 62 159 71 165 156 178 194 58 18 121 102 75 72 162 71 221 35 348 313 215 103 38 136 171 128 98 29 140 155 42 143
3091 143 155 77 106 141 133 83 46 70 200 134 145 99 62 56 160 78 189 107 212 178 205 217 239 100 207 167 124 180 121 304 296 110
2790 110 95 64 10 29 167 118 89 128 89 208 194 198 79 20 109 199 213 156 197 66 150 233 165 43 107 220 102 72 141 96 120 279
2490 279 254 66 138 216 149 103 150 47 19 91 86 225 290 232 98 70 195 363 35 126 234 247 195 204 185 65 80 147 29 193
2208 193 264 323 176 139 70 60 112 41 29 95 66 135 274 195 20 37 193 241 54 137 59 66 210 180 96 113 116 150 202 54 66 80
1908 80 83 93 122 88 109 127 86 40 130 125 124 49 95 179 146 150 231 177 224 213 101 50 68 170 333 144 232 229 187 105 52 149 146 137 109 87 136
1560 136 238 89 72 169 111 114 243 198 94 203 88 63 79 60 114 147 130 114 200 256 224 201 157 139 93 74 82 120 57 27 52 200
1260 200 169 118 194 202 122 79 72 206 176 90 85 90 192 186 116 127 201 185 104 100 80 247 273 57 106 191 63 166 60 77 28 58 62 164
941 164 263 126 74 107 339 252 174 245 120 29 38 171 103 15 53 184 273 64 221 204 139 151 26 132 123 24 45 66 80 84 119 60
640 60 50 105 72 28 81 97 26 231 74 133 65 121 58 148 43 106 54 73 97 198 241 162 42 93 35 18 93 22 188 129 122 18 165
330 165 299 158 50 124 80 145 118 128 312 207 63 77 114 52 150 180 98 260 259 95 64 169 159 189 276 418 227 102 111 116 37
39 37 41 93 183 129 77 117 116 104 100 80 83 48 63 40 175 79 192 52 94 41 48 148 213 168 116 194 34 157 245 61 179 124 112 115 234
-290 234 209 67 133 95 140 146 36 64 123 5 59
-393E9
##PAGE=	F1=5584.13
##FIRST=	17614.246348710370512,	4405.4455391999963467,	0.041917953640222549438
##DATA TABLE=	(F2++(Y..Y)), PROFILE
4405 45 57 83 122 99 135 134 167 295 157 91 117 82 68 190 206 91 177 270 170 158 249 236 195 45 66 66 88 53 37 163 187 105 154
4096 154 45 134 215 195 124 122 100 78 37 85 99 88 122 115 198 94 129 117 99 173 185 94 162 36 48 87 52 76 99 112 106 65 56 123 111
3767 111 83 72 67 119 91 88 117 61 64 104 62 291 176 225 150 101 175 61 116 208 264 211 188 151 164 219 142 47 113 182 161 164 170 189 162 292
3429 292 106 274 211 57 77 24 157 106 217 197 171 157 66 5 103 64 137 60 151 64 173 29 348 209 14 240 3 161
3166 161 184 64 35 28 130 110 59 103 165 53 81 138 150 95 117 114 151 97 125 100 39 35 126 68 211 138 259 162 187 221 244 119 212
2856 212 157 102 130 98 304 281 112 63 50 10 31 186 115 99 151 134 201 168 183 83 36 143 195 173 147 150 54 149 224 126 58 87 231
2546 231 93 80 183 114 164 305 220 57 115 183 139 111 159 62 10 117 75 249 288 185 85 87 179 385 54 117 248 248 200 195 188
2255 188 53 68 157 19 200 282 336 149 163 111 89 141 20 34 115 79 130 235 177 37 72 167 231 22 56 112 30 223 188 125
1973 125 84 82 162 196 18 33 11 143 115 78 86 119 168 102 100 113 143 156 40 59 186 182 110 157 167 217 198 104 41 70 168 313 130 251
1654 251 203 160 88 73 129 166 160 130 141 174 229 89 113 196 126 115 218 203 32 163 42 35 29 74 103 125 110 110 196 324 233 216 152 138
1335 138 47 85 55 128 64 28 97 189 158 161 227 207 148 88 101 212 211 93 85 117 163 159 81 73 233 169 101 124 57 215 265 54 79 202
1016 202 81 153 74 40 34 108 65 192 252 141 105 60 313 253 103 234 129 26 22 149 90 52 64 143 208 69 180 187 124 132 57
725 57 151 141 52 35 62 101 90 126 108 70 123 85 18 51 64 70 252 64 139 74 154 27 136 30 82 34 38 153 254 286 166 37
424 37 118 14 118 19 46 192 165 118 35 170 339 132 68 82 79 124 83 130 284 198 93 126 130 9 136 169 35 221 248 92
142 92 22 96 148 210 333 480 257 88 90 137 70 29 156 212 149 137 147 110 119 82 79 79 96 63 93 131 111 147 77 116 22 65 142 208 160
-186 160 108 198 53 122 228 67 163 139 88 75 247 190 112 124 120 101 128 35 53 118 52 37
-393C7
##PAGE=	F1=5513.36
##FIRST=	17614.246348710370512,	4405.4455391999963467,	0.28845253586769104004
##DATA TABLE=	(F2++(Y..Y)), PROFILE
4405 46 65 87 146 111 170 160 163 271 166 75 69 59 99 159 196 103 163 305 182 112 220 173 195 38 30 91 84 66 11 197 188 112 184 24
4086 24 76 206 167 111 102 54 72 94 81 84 95 118 123 192 76 176 155 112 180 185 99 137 94 82 106 35 111 86 110 88 81 20 104 88 65 102
3748 102 109 143 99 105 85 45 59 93 76 292 186 146 128 59 160 27 119 183 249 231 168 123 119 169 131 15 177 175 153 165 188 237 150 310
3429 310 101 245 196 94 104 39 165 139 253 231 156 149 90 20 90 20 193 94 134 71 133 53 330 231 81 263 10 166 180 51
3147 51 47 68 116 71 95 78 191 72 68 103 149 101 187 187 119 48 139 117 3 46 106 70 219 162 282 154 158 200 228 138 204 136 84 72
2828 72 86 286 252 103 34 84 20 38 185 97 104 172 164 167 131 140 67 55 160 198 133 134 98 30 145 219 90 104 87 227 52 100 204
2518 204 136 194 328 182 56 76 153 123 103 175 86 39 146 63 256 264 130 117 103 128 379 101 97 250 247 186 168 178 84 58 154 10
2218 10 196 287 342 118 174 152 134 167 12 54 130 82 144 190 151 69 99 141 202 86 51 151 112 241 196 156 53 38 168 178 26
1926 26 3 67 199 129 33 127 140 189 109 147 118 160 168 46 22 169 211 114 76 141 190 173 103 46 70 157 291 115 245 155 113 59 113
1617 113 122 157 171 147 214 191 201 94 158 206 126 119 178 185 76 117 29 58 35 94 89 109 86 139 256 389 241 212 139 123 16 123 78
1307 78 118 64 60 123 186 142 181 250 205 166 131 157 239 244 85 75 147 136 117 29 60 230 157 110 143 36 173 237 43 47 186 94 132 72
987 72 7 75 178 78 197 227 160 133 61 279 216 41 207 136 22 7 147 144 112 87 94 120 85 127 156 86 97 99 169 147 76 56 74
678 74 127 103 128 146 94 138 119 29 27 32 131 259 64 140 71 173 19 118 73 100 13 20 200 293 299 151 41 149 17 210 63 86
377 86 172 181 106 39 169 351 111 119 60 117 131 60 138 232 175 149 192 130 61 129 184 61 167 218 91 45 33 109 204 354 505 270
77 270 69 52 138 100 66 212 219 163 206 179 92 112 58 54 55 125 77 143 92 135 84 115 127 19 55 122 193 135 101 194 67 102 209 75
-243 75 136 146 109 46 248 170 147 150 129 66 104 23 92 122 87 40
-393D0
##PAGE=	F1=5442.6
##FIRST=	17614.246348710370512,	4405.4455391999963467,	0.47151798009872436523
##DATA TABLE=	(F2++(Y..Y)), PROFILE
4405 59 77 85 150 115 203 181 159 239 186 83 68 58 115 135 186 133 120 301 182 84 195 101 209 87 57 125 81 79 35 192 170 166 213
4096 213 33 40 195 141 83 66 11 60 140 92 78 108 116 127 171 54 202 167 124 167 186 95 105 158 149 123 10 135 60 101 90 92 24 68
3776 68 46 33 124 134 151 94 130 61 56 53 81 83 277 195 66 108 13 139 25 118 156 208 248 164 72 67 107 113 65 226 147 129 164 211 268
3448 268 133 305 86 177 170 130 115 72 166 169 264 252 135 162 113 54 91 25 232 124 115 98 120 70 292 200 87 135 53 153 162 99
3147 99 99 117 122 92 149 69 214 107 76 42 127 103 243 247 122 17 167 140 61 101 108 73 208 172 277 156 129 171 189 139 182 108 64
2837 64 31 99 256 210 83 43 138 76 79 159 67 100 181 178 128 108 82 33 85 155 200 94 123 64 6 143 221 66 149 105 203 12 129
2527 129 203 156 214 338 148 57 31 127 99 79 186 107 63 170 63 249 222 87 161 112 49 349 158 72 241 245 157 132 158 131
2246 131 48 145 4 179 279 342 94 171 180 182 188 36 64 139 78 158 152 117 97 113 116 161 150 105 167 179 258 201 185 59 42 167 151 57
1926 57 21 119 234 127 8 172 166 189 117 164 137 172 155 48 8 131 223 156 31 110 144 151 106 59 68 135 271 103 214 91 59
1635 59 39 157 123 125 173 161 292 186 159 106 176 198 119 124 135 155 130 75 28 99 81 109 73 113 64 178 336 436 245 193 118 94 18
1326 18 158 112 94 55 87 125 191 131 179 249 181 169 187 210 268 266 61 55 181 119 68 46 108 198 142 101 154 26 129 203 26 41 147
1016 147 94 94 54 50 121 247 98 181 199 175 154 104 241 147 54 159 132 12 34 161 198 173 114 87 27 103 81 121 32 52 144 189 139
706 139 89 98 90 143 113 126 165 96 156 151 43 50 15 193 253 78 133 55 179 42 88 89 124 18 46 224 306 276 118 75 182 42 274
396 274 140 139 125 173 94 31 151 332 98 148 73 161 159 74 149 171 156 208 249 118 99 130 200 104 97 173 91 65 72 59 174 338 488
86 488 262 54 25 132 134 96 246 197 162 263 199 59 81 52 46 41 134 95 179 65 148 17 147 119 36 18 110 173 100 91 179 67 104
-224 104 194 90 105 148 145 49 239 158 165 186 106 53 85 7 143 129 104 54
-393E4
##PAGE=	F1=5371.83
##FIRST=	17614.246348710370512,	4405.4455391999963467,	0.29159492254257202148
##DATA TABLE=	(F2++(Y..Y)), PROFILE
4405 83 88 75 136 110 224 186 156 207 208 104 96 105 112 124 168 164 60 264 173 81 179 47 225 124 107 155 87 93 53 151 138 222 240 54 49
4077 49 177 118 43 23 46 43 171 101 77 125 120 137 142 25 195 141 130 138 193 79 73 190 205 133 24 134 57 84 103 96 47 34 28 33 128
3748 128 137 141 80 148 49 96 66 67 76 251 201 73 84 26 111 30 114 138 158 256 176 14 64 50 96 96 249 104 90 162 234 275 114 280
3429 280 71 86 132 151 112 109 151 196 251 253 110 172 132 90 108 55 243 137 101 137 132 81 242 170 155 66 114 142 141 126 126 159 154 138 209
3100 209 92 229 129 95 39 84 106 279 280 137 54 176 160 126 164 117 65 180 167 248 160 106 159 133 125 148 73 33 69 131 219 162
2800 162 56 62 194 157 138 109 51 85 178 180 131 129 77 23 126 126 192 63 119 65 44 142 227 58 177 127 161 83 158 184 177 230 329 120
2480 120 49 25 107 73 50 183 115 81 180 75 234 170 71 186 110 58 303 207 48 227 244 122 99 140 178 60 132 12 148
2208 148 259 331 78 156 189 219 198 68 56 134 76 161 123 80 114 116 92 127 205 139 153 211 268 202 208 96 83 155 119 77 41 151 241
1898 241 116 37 199 186 169 132 147 157 177 119 47 22 80 216 198 65 87 86 151 117 74 66 103 250 98 162 46 68 35 192 124 86
1598 86 172 169 357 163 112 122 167 173 108 134 109 121 156 50 24 140 119 132 55 134 52 200 392 453 242 164 90 62 32 180 128 70
1297 70 41 108 102 198 131 165 224 137 151 232 245 280 273 26 29 211 112 32 110 162 148 118 68 160 55 89 181 51 57 90 79 40 30 81 159
969 159 295 117 157 174 179 165 144 206 75 98 92 108 8 62 176 230 228 138 143 65 112 67 92 41 24 183 206 121 92 140 98 143 113 118 163
640 163 80 174 165 46 92 37 245 240 92 122 49 173 65 51 92 128 31 72 219 288 221 79 121 212 66 304 205 193 58 147 92
349 92 46 116 287 98 150 91 186 185 104 152 114 155 256 288 100 112 137 201 133 32 113 81 68 117 40 133 292 433 235 47 68 138
48 138 174 103 249 149 142 297 207 38 37 80 104 84 119 114 191 50 155 53 161 104 69 39 130 147 64 80 154 50 125 188 109 83 151
-261 151 172 71 224 157 170 212 53 59 83 48 185 131 105 72
-393G2
##PAGE=	F1=5301.07
##FIRST=	17614.246348710370512,	4405.4455391999963467,	0.1564614027738571167
##DATA TABLE=	(F2++(Y..Y)), PROFILE
4405 107 95 58 107 110 227 173 157 177 219 122 104 160 104 116 140 183 42 205 163 93 167 56 227 140 146 173 105 108 76 90 101 255 261 77
4086 77 66 152 102 23 67 88 39 184 95 80 143 133 161 113 18 161 90 125 102 200 54 58 185 233 129 39 108 98 65 106 90 55 40
3776 40 73 77 117 121 115 67 149 49 137 113 57 57 220 198 138 51 52 70 23 108 130 119 257 187 57 116 8 88 102 252 73 61 159 246
3457 246 259 96 243 75 9 84 149 111 148 122 212 217 234 84 164 151 120 130 64 223 133 97 172 144 92 183 188 266 183 165 139 117 116 121
3138 121 185 188 165 258 154 245 133 120 120 35 112 291 282 140 82 154 179 186 217 117 46 152 153 201 158 91 181 73 110 105 34 15 112 168
2819 168 185 120 26 66 245 248 199 39 90 58 169 178 178 175 149 72 166 77 172 43 127 72 82 135 227 60 179 141 103 146 183 157 200 244
2499 244 300 99 40 76 92 62 42 169 107 92 169 86 219 113 73 180 96 147 248 237 30 214 240 90 77 138 215 92 113 31
2218 31 111 232 308 62 132 178 240 194 104 53 109 78 154 92 49 115 113 78 128 246 146 109 205 266 195 224 132 111 131 85 82 59 165 224
1898 224 115 61 200 191 134 151 101 169 176 78 61 21 31 189 222 82 84 25 180 135 86 64 64 223 100 106 90 144 38 206 119 59 173
1588 173 167 393 135 76 142 139 137 98 149 115 89 151 46 25 175 145 170 32 157 55 194 401 433 226 133 59 47 54 192 128 79
1297 79 37 122 69 196 139 144 180 95 114 248 254 268 267 34 20 230 103 52 166 204 98 87 26 166 111 65 179 113 64 41 55 22
997 22 27 95 183 313 128 134 154 166 166 167 190 110 127 21 64 17 82 183 240 271 149 206 131 107 82 71 99 63 207 211 94 90 168 93 124
668 124 98 107 144 76 188 154 38 133 62 281 224 97 112 69 159 85 23 108 110 39 88 188 243 151 47 166 232 84 303 251 233 26
368 26 111 100 99 74 229 113 138 95 178 191 124 146 75 162 279 304 83 101 145 185 154 86 48 54 61 130 68 94 228 352 201 50 120
58 120 160 216 84 221 89 105 306 209 70 38 117 175 133 77 134 176 45 157 88 150 106 109 101 166 116 40 75 123 22 160 191 125
-243 125 80 156 182 92 207 165 172 223 23 69 99 96 208 120 97 90
-393I0
##PAGE=	F1=5230.3
##FIRST=	17614.246348710370512,	4405.4455391999963467,	0.52612930536270141602
##DATA TABLE=	(F2++(Y..Y)), PROFILE
4405 122 96 39 73 122 214 152 162 146 215 128 88 201 116 103 105 183 93 136 161 108 151 82 211 138 165 176 133 121 104 40 70 260 272 101
4086 101 74 129 96 68 137 116 68 182 74 88 160 150 199 92 66 129 78 108 81 203 24 78 145 222 107 36 63 142 59 93 77 46
3786 46 64 112 110 103 93 83 66 132 57 165 174 66 31 194 182 186 22 63 16 4 102 130 103 251 180 102 161 12 94 89 249 103 90 152
3466 152 236 223 81 205 101 82 47 124 127 177 87 215 174 200 62 140 165 134 144 52 172 117 99 196 138 105 121 155 318 193 185 132
3166 132 91 71 88 187 204 160 276 230 266 130 152 194 62 127 286 254 118 89 111 200 232 253 103 41 148 139 144 143 81 222 61 108
2865 108 67 23 67 135 201 162 100 7 55 285 325 249 54 150 27 158 176 224 211 219 116 192 50 146 35 145 63 111 116 209 64
2574 64 151 143 40 187 196 133 221 252 257 81 54 132 86 70 55 147 86 102 138 100 209 54 72 144 73 214 192 241 20 203 225 70
2274 70 71 152 234 125 84 53 74 204 272 39 111 156 242 174 137 87 63 84 141 55 53 98 107 81 160 268 133 47 169 252 176 231 159 124
1955 124 96 53 75 76 168 194 137 80 173 176 93 167 44 170 169 81 94 11 37 146 224 67 96 28 218 153 92 56 23 186 104 99 150 222
1635 222 64 194 104 61 178 155 392 113 71 162 104 98 98 167 146 62 134 60 31 197 160 211 14 169 63 157 358 378 196 103
1354 103 33 58 81 203 133 116 54 128 63 181 143 121 130 85 65 221 235 237 254 74 46 228 82 89 207 228 65 58 60 176 179 85 188
1044 188 184 66 86 33 68 51 90 199 299 127 122 148 137 157 169 198 198 141 80 26 21 91 179 231 293 144 250 170 88 104 66 142 105 209
725 209 198 64 92 180 76 90 70 95 119 110 191 122 24 171 86 297 209 93 102 95 141 102 47 142 78 50 95 145 184 83 34 198 237
415 237 96 280 271 247 99 78 109 166 34 175 136 140 87 139 165 126 136 60 154 274 299 76 69 151 156 165 163 51 12 48 106 83 77 162 266
86 266 181 61 163 184 250 45 169 70 60 295 212 111 69 141 227 155 15 153 138 55 158 88 120 134 146 154 191 77 36 78 105
-205 105 38 200 195 131 80 161 176 106 186 176 179 223 92 84 117 135 210 99 88 103
-393A03
##PAGE=	F1=5159.54
##FIRST=	17614.246348710370512,	4405.4455391999963467,	0.55941849946975708008
##DATA TABLE=	(F2++(Y..Y)), PROFILE
4405 121 91 29 48 134 193 150 169 113 198 122 71 216 147 79 69 164 128 68 175 119 123 96 181 127 163 170 163 127 127 45 55 240 272 124 76
4077 76 109 97 112 196 127 110 167 56 105 169 165 237 83 122 157 135 82 88 198 26 118 96 172 68 20 52 170 71 65 63 26 83 128 119 92
3748 92 62 66 73 100 64 173 228 94 22 180 153 211 56 63 52 27 97 133 99 239 147 118 181 12 112 81 249 156 145 137 203 174 68
3438 68 174 133 125 70 91 148 188 64 201 131 159 51 115 170 126 145 45 99 104 106 208 115 117 59 43 282 132 171 125 78 27 39 167
3128 167 192 126 257 289 286 139 191 247 118 157 269 201 67 78 97 221 257 267 80 65 170 128 90 116 73 263 108 112 62 61 121
2837 121 134 226 155 105 31 42 308 371 277 136 204 32 147 176 245 225 265 143 192 108 132 36 168 37 127 86 167 64 97 130 41
2546 41 199 194 124 233 249 207 65 88 188 93 79 60 122 55 112 100 122 207 42 58 88 54 243 143 223 13 193 190 60 80 165
2255 165 227 146 46 74 64 183 223 24 100 141 231 147 163 133 16 94 125 14 87 66 100 96 192 269 116 55 135 230 146 229 176 123
1955 123 59 25 63 91 162 166 163 92 129 141 54 173 80 166 155 130 132 21 64 96 208 40 113 66 246 170 91 36 18 135 103 155 191
1645 191 285 116 156 81 90 183 136 353 99 94 177 71 73 119 182 182 50 150 93 35 203 164 238 32 164 65 97 276 301 157 79
1354 79 13 73 104 219 163 151 76 126 94 159 139 97 93 97 40 151 195 195 241 106 71 202 44 121 233 236 54 55 109 190 248 137 189 247
1034 247 72 160 25 89 83 72 214 262 115 126 171 103 140 155 217 268 140 156 81 19 87 162 212 289 126 262 178 63 129 98 160
743 160 136 192 168 35 100 174 50 49 57 79 98 148 183 83 17 207 111 293 194 88 86 109 124 118 77 172 63 79 92 116 134 42 28 211
424 211 222 102 248 265 232 158 58 113 236 34 138 163 175 71 86 110 107 131 63 121 240 279 82 23 152 122 165 219 121 58 38
133 38 51 79 82 118 200 186 77 195 194 268 35 104 117 41 272 227 136 75 148 246 135 100 170 90 85 155 57 101 171 169 183 190 38 42 85 123
-205 123 89 233 192 122 66 161 154 113 162 183 197 219 146 106 123 157 191 71 84 104
-393A04
##PAGE=	F1=5088.77
##FIRST=	17614.246348710370512,	4405.4455391999963467,	0.30550816655158996582
##DATA TABLE=	(F2++(Y..Y)), PROFILE
4405 106 79 34 50 135 171 185 176 77 178 110 84 201 172 52 47 130 133 37 200 124 83 108 146 116 144 165 188 123 133 52 69 206 259 143
4086 143 74 87 97 139 231 119 151 139 80 136 167 172 266 87 179 223 190 53 101 190 59 159 107 93 24 29 110 176 87 29 51 21 95
3776 95 117 99 85 37 79 78 58 60 159 261 129 50 177 113 213 103 60 121 69 95 137 88 218 96 102 167 7 136 110 246 194 192
3476 192 114 156 122 55 156 163 133 115 91 162 179 65 175 95 117 51 107 162 98 131 79 36 120 122 218 98 121 13 135 180 176 133 135 107
3157 107 96 21 125 152 91 210 314 292 168 227 270 154 194 251 134 22 71 146 236 257 260 65 87 189 116 65 77 66 290 157
2875 157 111 88 94 165 111 237 157 113 55 45 313 371 280 204 242 71 135 179 235 214 280 148 164 184 147 40 186 0 130 46 101
2584 101 56 41 107 102 183 176 136 231 229 159 61 121 235 112 74 51 99 36 122 78 152 209 103 38 41 59 232 108 188 2 178 133 53
2274 53 101 167 193 148 28 90 94 181 167 59 107 145 212 121 175 165 64 110 107 24 120 25 91 110 206 249 108 128 148 205 108 215 189 117
1955 117 34 11 57 103 150 145 176 94 100 91 28 168 166 165 133 177 165 40 71 45 180 57 128 91 253 181 87 8 46 75 89 214 206 320
1635 320 175 97 57 135 183 118 287 84 119 183 40 75 157 185 211 82 213 136 48 190 158 239 56 144 56 36 182 221 116 57
1354 57 18 89 113 234 203 170 94 116 123 143 128 76 85 101 82 55 146 152 228 124 86 156 10 146 245 231 49 75 137 198 304 192 173
1044 173 290 82 226 35 77 122 53 236 214 99 143 221 84 124 135 225 301 127 214 145 13 70 135 187 256 113 241 159 41
772 41 157 154 151 150 161 130 10 109 155 22 15 89 60 83 162 167 53 32 244 140 265 172 92 61 104 114 133 98 182 98 119 83 118 122 40
443 40 19 202 188 105 216 235 194 190 56 115 299 73 119 196 227 56 83 34 77 134 74 68 188 247 102 30 149 89 152 243 187 129
142 129 35 43 77 94 116 175 201 96 214 187 264 84 42 162 73 251 257 138 60 144 226 89 220 185 70 126 148 33 131 203 175
-149 175 181 161 49 49 85 170 139 249 176 100 41 154 128 112 131 179 219 221 170 128 115 158 163 44 84 89
-393H9
##PAGE=	F1=5018.01
##FIRST=	17614.246348710370512,	4405.4455391999963467,	0.15394724905490875244
##DATA TABLE=	(F2++(Y..Y)), PROFILE
4405 90 66 44 62 118 154 241 180 44 169 111 114 161 172 47 52 98 114 78 221 124 38 125 118 109 125 162 203 111 120 31 109 171 234 154 65 51
4067 51 87 144 237 93 181 98 133 172 155 167 282 96 228 276 215 26 102 187 92 193 178 10 58 51 174 160 92 17 40 42 99 83
3767 83 62 82 27 97 73 24 43 125 267 160 83 179 69 198 137 59 182 118 88 137 63 190 50 71 119 35 162 155 226 201 220 86
3466 86 120 77 44 156 186 116 150 132 166 155 83 145 68 82 56 113 141 61 106 128 85 163 144 236 120 115 50 265 63 270 94 159 159
3157 159 177 73 70 93 113 171 300 274 202 251 260 161 229 237 65 100 103 208 235 235 237 82 91 183 98 77 33 58 300 193 95 117 112 193 77
2828 77 233 159 111 74 61 302 325 259 248 259 110 118 184 201 194 271 133 113 247 182 48 189 36 124 23 40 40 76 86 153 148 152 163
2518 163 218 194 124 78 145 265 137 55 33 78 62 122 84 177 210 166 47 62 76 186 83 146 11 158 61 42 129 158 138 132 66 99
2218 99 136 197 108 108 128 155 193 112 173 173 117 134 97 55 142 44 78 115 197 212 111 187 201 181 66 190 203 113 43 16 61 113 127 128 171
1889 171 86 119 32 31 156 247 171 103 204 188 54 58 13 148 102 139 107 234 180 87 53 71 13 59 248 195 323 224 38 35 186 175
1588 175 109 217 60 139 176 13 88 197 172 221 138 284 172 79 161 145 214 69 118 42 56 120 169 84 35 46 115 103 238 233 170
1297 170 103 101 130 141 117 64 95 100 130 88 107 110 214 127 86 101 67 164 248 221 45 94 135 193 336 238 140 305 85 277 74 35 163
987 163 50 263 172 88 165 280 98 114 114 207 296 104 248 193 11 47 100 159 198 120 194 122 37 181 212 120 148 132 99 6 108
696 108 130 5 31 131 38 75 147 150 51 63 284 169 212 140 102 49 84 124 153 105 166 148 160 71 127 141 55 27 172 137 107 191 191 145
377 145 193 67 121 343 116 109 233 272 42 137 47 72 142 86 18 131 209 131 86 142 59 127 236 243 200 40 120 103 110 142 179 205 121
67 121 218 165 237 132 18 182 109 241 293 128 78 143 174 129 343 197 103 172 140 73 181 223 165 148 114 102 55 77 217 177 242
-224 242 145 73 52 138 117 111 94 161 235 231 162 145 105 139 146 19 81 60
-393F0
##PAGE=	F1=4947.24
##FIRST=	17614.246348710370512,	4405.4455391999963467,	0.29536548256874084473
##DATA TABLE=	(F2++(Y..Y)), PROFILE
4405 91 55 52 68 87 144 293 179 22 174 133 135 108 140 84 72 101 96 118 225 120 22 146 106 108 125 159 207 96 107 36 162 140 199
4096 199 155 50 15 71 123 215 54 193 50 185 202 134 153 282 100 257 291 207 12 88 189 117 217 250 81 119 56 222
3833 222 131 83 50 29 57 94 34 65 81 31 100 62 36 38 78 249 179 113 178 38 167 151 56 226 169 65 135 27 168 64 80
3542 80 42 75 181 190 186 173 227 54 128 59 36 168 201 92 169 173 176 136 109 120 48 55 56 112 113 57 77 168 155 209 167 262 162 99 82 308
3204 308 36 290 86 173 206 242 130 31 52 177 178 256 234 226 256 220 139 251 232 19 186 159 247 215 198 201 127 82 142 69 93 36
2903 36 40 293 214 64 139 114 202 53 211 157 101 90 76 280 243 222 265 257 140 94 191 155 184 249 104 59 286 213 58 173 60
2612 60 114 68 95 34 145 87 183 111 144 199 198 149 107 109 158 271 161 27 25 58 107 109 97 182 205 213 95 95 82 122 56 107 28 143 34
2283 34 24 158 147 78 105 113 103 165 218 61 153 159 156 176 122 164 161 152 160 106 78 149 103 62 112 165 166 110 218 252 164 27 154 227 120 62
1945 62 20 63 120 93 108 152 77 162 26 45 144 312 180 67 204 200 56 33 52 115 135 145 118 192 165 102 114 95 56 13 245 164
1645 164 296 251 63 26 226 157 115 173 35 151 156 40 94 227 146 208 194 328 184 122 122 131 174 68 97 35 107 129 166 69 11
1354 11 81 150 76 222 239 152 103 79 113 147 113 57 109 114 161 193 92 73 194 120 70 55 115 171 243 212 49 102 109 176 338 264 102
1044 102 291 78 312 139 42 193 68 284 145 91 182 330 124 116 93 162 259 75 258 217 23 36 61 126 125 138 133 80 50 193
762 193 254 81 134 118 81 14 95 105 18 57 157 21 76 112 142 68 105 321 191 136 101 107 77 67 155 175 100 129 185 189 64 121 156
452 156 80 47 131 77 115 179 143 106 172 87 132 362 153 104 273 294 26 184 114 110 150 97 43 88 165 161 138 131 33 98 203 288 262 47
133 47 191 144 131 165 182 190 154 206 135 192 165 45 173 131 239 321 125 141 152 106 249 449 207 142 216 131 111 212 227 143 97 80
-167 80 152 60 76 252 196 212 104 62 102 116 138 117 53 138 239 245 131 153 115 110 159 6 71 27
-393B7
##PAGE=	F1=4876.47
##FIRST=	17614.246348710370512,	4405.4455391999963467,	0.34462219476699829102
##DATA TABLE=	(F2++(Y..Y)), PROFILE
4405 104 54 55 63 56 135 323 173 27 181 157 142 60 84 134 90 140 110 135 202 115 47 162 112 110 150 154 204 89 123 93 213 115 161 151
4086 151 31 84 65 82 180 12 182 27 221 217 111 143 270 91 263 264 180 22 77 190 131 232 300 135 175 35 248 97
3823 97 60 75 31 62 76 17 125 81 42 88 52 55 82 32 214 181 132 172 49 121 145 49 250 215 28 140 8 165 98 137 53 127
3523 127 190 204 137 116 212 21 162 78 32 178 206 86 173 191 211 139 140 109 35 36 57 90 84 90 60 188 210 243 186 276 191 77 100 251
3204 251 67 219 115 166 233 280 190 75 87 236 212 199 179 233 242 160 96 255 238 48 257 215 253 176 156 160 180 90 69 40 94 82
2903 82 9 271 219 39 156 110 195 56 175 151 97 102 88 254 145 182 259 240 159 72 201 112 194 222 69 61 295 225 70 136 64
2612 64 103 121 171 59 199 110 189 92 167 234 181 104 106 143 164 252 179 17 29 38 157 88 105 162 190 234 150 108 73 73 30 75 49 148 97
2283 97 13 183 142 45 78 155 107 168 223 49 184 193 145 162 145 154 145 169 186 130 101 146 164 55 118 117 119 94 216 281 155 24 111 258
1964 258 147 74 23 58 127 51 89 135 85 195 73 57 143 352 187 31 182 201 46 28 85 84 145 146 122 140 137 132 176 116 111 46 205
1654 205 126 251 249 124 50 242 132 135 174 49 155 124 76 86 238 112 174 236 328 160 164 82 127 137 55 87 41 139 164 185 63
1363 63 14 116 185 37 188 220 116 97 56 78 154 119 41 126 140 172 267 91 63 173 107 42 43 141 162 229 209 59 104 90 155 310
1063 310 266 86 256 75 335 214 111 201 94 290 130 97 186 359 142 132 65 108 210 54 246 217 40 52 37 89 71
809 71 144 73 47 71 189 271 60 116 114 62 17 72 86 24 80 162 27 88 77 149 97 148 349 202 50 73 98 119 87 193 197 83 81
499 81 198 201 79 101 153 109 64 100 35 130 180 105 87 136 113 144 351 176 105 306 282 7 201 153 155 154 103 59 66 120 184 182 119 23 73
171 73 159 323 305 49 238 173 149 170 170 161 190 181 101 138 182 56 140 134 229 327 141 202 154 49 368 522 213 167 250 125 127 205 214 116
-149 116 58 95 190 66 100 270 192 167 57 77 149 87 173 128 30 125 225 253 95 156 145 87 192 33 59 27
-393B7
##PAGE=	F1=4805.71
##FIRST=	17614.246348710370512,	4405.4455391999963467,	0.32343041896820068359
##DATA TABLE=	(F2++(Y..Y)), PROFILE
4405 108 62 55 52 49 123 322 161 43 177 161 137 46 73 180 102 181 138 126 155 112 52 164 128 110 183 145 199 91 164 142 247 97
4105 97 137 153 14 160 86 30 151 35 147 63 233 213 94 148 248 69 245 205 154 48 87 181 133 243 322 151 219 28
3842 28 246 68 30 87 50 62 51 58 186 77 53 80 48 61 142 53 174 163 134 159 78 67 124 46 255 250 50 161 38 176 112
3551 112 193 147 188 185 197 111 44 178 30 185 105 24 170 201 106 169 182 265 163 169 115 33 21 70 46 59 119 66 184 247 257 194 257
3241 257 192 57 104 141 55 99 150 142 237 284 247 126 134 269 237 144 121 218 218 98 45 241 251 69 299 257 227 124 122 122 227 132 25
2931 25 51 78 123 30 244 207 69 168 116 180 69 131 145 112 111 103 230 51 153 244 217 165 67 213 87 211 188 34 106 275 211
2640 211 80 87 51 87 168 223 88 229 136 168 89 202 258 173 66 111 170 168 215 190 43 34 19 208 85 115 117 164 226 196 102 75 91
2330 91 43 51 78 177 144 48 208 149 66 69 192 117 142 201 59 193 221 138 149 171 153 142 172 205 152 129 143 221 74 148 60 82 62 188
2011 188 284 154 57 65 290 190 76 36 53 136 9 78 129 106 207 104 67 151 363 189 24 145 190 23 46 103 59 134 143 114
1729 114 108 101 172 230 128 153 110 139 92 203 222 174 94 225 102 161 198 91 152 85 97 66 231 82 127 250 279 98 192 61 138
1438 138 117 48 80 50 150 182 192 50 36 140 206 15 143 181 66 97 43 49 165 135 17 146 160 165 293 82 95 165 97 7
1156 7 48 138 136 206 213 68 110 115 141 259 245 104 208 86 346 282 171 183 121 279 118 96 176 365 146 156 42 104 172 68 219
865 219 199 56 72 59 52 101 127 23 39 93 175 261 81 103 105 27 26 44 73 25 103 149 42 106 60 174 137 181 361 204 57 79 74
556 74 149 129 227 213 60 34 181 194 114 86 129 127 72 107 73 153 188 81 77 97 138 151 312 178 120 321 233 22 186 159 192 152 107
246 107 45 54 74 198 211 106 34 52 122 346 325 41 258 179 152 153 146 130 219 144 71 92 190 56 95 118 197 306 163 235 132 64
-55 64 449 553 214 174 268 117 124 158 184 91 83 130 210 71 143 271 170 119 18 104 181 50 201 134 58 130 193 247 72 158 170
-346 170 75 219 56 60 51
-393E1
##PAGE=	F1=4734.94
##FIRST=	17614.246348710370512,	4405.4455391999963467,	0.25225430727005004883
##DATA TABLE=	(F2++(Y..Y)), PROFILE
4405 96 74 53 42 67 104 289 143 55 158 137 132 61 144 211 105 202 150 100 107 111 30 152 141 104 210 135 191 97 199 162 256 80 134
4096 134 170 5 222 119 28 146 77 88 94 219 198 86 166 221 40 210 136 141 83 114 157 126 254 315 132 248 98 217 62
3823 62 21 84 68 68 31 79 226 66 62 107 45 61 197 100 139 129 117 141 104 26 97 62 250 268 113 197 54 183 105 228 226 251 168
3513 168 181 128 46 131 70 181 123 14 139 190 142 161 160 321 187 187 132 41 10 98 23 39 127 82 160 268 250 189 195 167 57 104 91
3204 91 28 13 173 112 221 254 289 161 157 272 240 104 76 181 194 65 19 216 267 74 309 281 176 65 100 100 257 183 121 95
2922 95 55 149 68 217 181 107 168 142 170 69 87 136 140 120 120 210 27 145 230 196 157 77 222 97 214 144 17 140 232 169 87 43
2621 43 46 64 202 239 103 233 153 127 83 223 267 172 58 113 188 173 170 192 66 45 14 255 117 139 61 131 195 222 91 119 139 74
2321 74 35 116 214 162 97 235 165 91 85 223 135 91 146 56 176 236 153 139 190 164 149 172 214 163 161 155 268 108 195 5 63 31 154
2011 154 266 158 94 23 313 239 67 63 68 150 24 81 133 120 201 116 74 159 342 184 43 112 164 11 48 100 45 105 134 87 118
1720 118 63 212 267 125 179 169 78 67 164 178 202 139 182 68 182 214 135 142 44 97 40 208 68 80 230 198 23 200 68 159
1438 159 113 64 63 52 141 180 176 26 50 150 206 46 105 131 55 108 56 76 187 156 46 159 167 151 269 57 139 175 93 33 45 105
1138 105 95 174 225 78 128 161 140 192 207 127 161 99 337 322 209 142 146 254 104 84 153 350 139 180 67 158 163 107 185 171 71
847 71 82 102 30 167 96 22 37 111 165 232 116 99 85 37 44 18 62 24 121 132 50 126 52 204 180 196 356 203 127 103 42 154 166
537 166 250 220 54 23 139 175 157 92 93 125 78 146 120 176 195 74 64 61 155 153 250 160 150 308 153 57 147 146 216 148 111 23 62 39 203
208 203 222 92 45 33 113 359 320 30 252 159 130 116 122 109 231 103 55 76 198 56 54 92 143 262 176 230 80 107 472 545 210
-83 210 167 268 105 120 85 137 71 123 149 216 74 185 259 136 81 32 133 197 35 209 126 86 138 145 219 66 161 173 71 226
-365 226 67 75 63
-393F3
##PAGE=	F1=4664.18
##FIRST=	17614.246348710370512,	4405.4455391999963467,	0.17828524112701416016
##DATA TABLE=	(F2++(Y..Y)), PROFILE
4405 77 86 48 34 83 77 229 114 58 128 91 136 71 219 219 99 196 131 82 101 115 42 130 141 95 225 130 176 102 207 147 242 55 140
4096 140 190 7 253 149 71 159 118 15 108 185 184 82 188 189 30 169 83 136 122 138 121 114 261 285 94 259 178 171 73 42 67
3804 67 74 88 33 74 238 50 66 157 35 70 238 132 116 85 85 118 119 58 73 94 244 266 169 230 58 173 95 240 275 302 146 166
3504 166 153 102 78 107 150 127 33 84 176 187 148 154 364 201 187 151 54 6 129 85 33 113 97 122 270 225 172 95 145 83 108 124 10
3194 10 78 180 90 192 197 302 177 152 250 228 84 57 128 177 86 49 194 277 72 294 289 116 15 85 105 261 218 200 136 36
2912 36 157 95 196 145 123 153 176 169 54 56 122 166 127 133 194 66 150 224 183 137 85 227 136 189 88 37 151 173 105 88 34 76 34
2603 34 214 216 95 217 158 86 67 214 256 173 82 109 196 180 126 185 81 66 30 292 161 171 51 98 160 225 91 182 176 94 26 156
2302 156 243 158 153 264 188 107 119 246 154 41 70 49 134 232 185 138 191 188 158 177 211 163 194 187 297 136 239 39 66 51 143 234 166
1992 166 131 10 321 279 49 101 96 169 50 89 141 111 183 111 78 158 294 173 55 101 123 47 24 78 52 70 120 43 144 26 245
1701 245 286 105 190 214 87 46 140 130 205 173 142 39 187 208 173 127 16 72 31 177 72 45 177 134 100 185 82 177 116 84
1419 84 31 47 117 166 137 23 51 153 183 69 93 80 127 128 82 126 215 179 96 157 168 149 206 20 173 198 91 66 49 55 44 134 242
1110 242 96 152 193 140 123 164 133 123 100 298 319 222 101 167 228 84 64 123 319 126 195 114 209 167 145 151 139 84 78 143 57 228
809 228 89 61 25 118 165 193 150 98 69 104 65 12 53 30 128 124 56 153 35 229 213 187 336 204 169 119 38 133 185 265 219 85 53
499 53 79 160 198 106 55 105 91 191 149 199 200 82 55 38 157 147 178 133 187 265 65 101 101 139 230 146 117 66 100 47 204 217 77 53
180 53 20 132 361 294 46 234 119 79 65 112 94 217 68 66 91 212 70 46 81 76 207 174 190 10 143 438 506 202 152 247
-102 247 86 129 41 79 58 143 144 210 72 213 237 102 61 54 163 206 92 198 104 95 134 89 171 58 165 149 70 207 56 87 60
-393F0
##PAGE=	F1=4593.41
##FIRST=	17614.246348710370512,	4405.4455391999963467,	0.12175442278385162354
##DATA TABLE=	(F2++(Y..Y)), PROFILE
4405 73 99 42 23 91 46 151 73 55 98 59 148 74 266 199 87 166 86 100 134 123 108 116 124 96 224 133 146 104 183 97 216 14 136
4096 136 201 23 245 165 100 175 156 73 107 141 181 75 202 156 49 133 65 125 155 151 83 107 260 243 63 254 249 129 79 54 40
3804 40 70 115 38 48 219 41 64 205 21 89 258 141 101 40 60 92 118 92 61 129 241 244 202 249 55 140 112 232 287 329 125
3513 125 151 162 132 36 132 100 113 70 27 163 235 132 176 384 197 170 167 72 15 149 146 52 82 109 78 249 186 146 25 168 118 120
3213 120 104 24 91 169 82 164 125 283 177 123 210 218 89 57 67 161 117 70 182 274 77 269 286 74 55 64 126 240 223 248 158 31
2912 31 147 103 181 102 116 122 201 172 27 50 95 185 132 136 184 75 160 225 180 109 84 222 187 137 32 58 143 109 31 89 50 118 14
2603 14 203 160 64 187 152 91 51 175 227 173 117 99 197 184 93 172 90 83 44 311 190 196 104 72 142 205 105 238 195 94 27 189
2302 189 255 148 206 289 212 117 159 257 166 62 29 78 77 207 214 159 170 221 176 189 195 158 223 225 304 148 265 65 91 86 157 193 176 164
1983 164 26 314 299 45 146 118 195 81 96 148 73 165 96 81 149 227 156 64 118 73 81 31 65 77 37 106 16 158 9 264 287
1692 287 73 191 237 136 36 128 91 182 184 152 53 168 179 203 108 46 31 62 147 82 27 103 157 189 149 84 184 123 93 14 43 82
1391 82 152 86 68 41 167 145 77 110 46 207 146 106 172 237 202 142 137 170 170 129 18 187 219 87 88 76 16 11 92 261 124 169 197 126
1072 126 66 130 115 108 90 223 268 215 92 181 211 62 50 94 279 114 193 153 232 163 171 119 103 91 66 173 102 278 129 99 23 112
772 112 171 155 181 93 85 170 83 25 49 43 120 125 69 188 26 240 226 158 306 207 174 117 75 94 181 275 215 127 78 18 160 233 109 29
452 29 79 111 228 153 218 205 103 71 53 139 132 107 113 214 198 85 149 70 158 231 155 126 113 146 78 204 199 62 58 39 165 357 257
142 257 83 220 73 5 16 117 77 175 48 93 109 234 96 78 101 17 156 162 129 83 169 361 450 190 133 208 62 143 97 18
-139 18 47 132 119 194 60 225 202 76 48 61 192 220 171 178 84 82 115 36 113 38 170 108 79 169 22 91 45
-393D5
##PAGE=	F1=4522.65
##FIRST=	17614.246348710370512,	4405.4455391999963467,	0.051259908825159072876
##DATA TABLE=	(F2++(Y..Y)), PROFILE
4405 86 112 34 11 92 30 70 47 56 76 91 159 83 279 156 76 121 28 131 156 131 176 124 94 110 207 139 105 104 131 24 200 48 116
4096 116 194 49 197 164 111 182 186 155 99 98 184 64 207 124 64 111 65 112 175 154 60 107 249 201 58 236 300 136 65 56 19 78
3795 78 142 35 36 174 45 56 237 32 104 261 125 86 19 73 66 97 104 64 157 242 207 203 243 52 90 157 216 264 326 118 124 157 129
3485 129 35 138 66 81 109 66 152 275 117 203 371 175 143 179 92 27 151 194 79 48 120 42 203 135 120 139 227 149 142 19 79
3194 79 81 148 88 152 71 232 170 84 164 230 104 57 38 140 136 75 184 253 90 249 275 82 100 33 142 201 196 255 153 52 121 98
2894 98 169 57 114 81 209 171 24 65 57 201 133 128 177 60 171 226 182 76 82 205 237 65 48 75 121 45 49 97 69 150 38 172
2593 172 84 25 153 143 138 52 122 191 172 148 86 197 181 74 156 97 86 52 307 194 208 155 56 143 171 126 270 195 82 38 204
2302 204 246 150 244 299 230 119 190 250 160 100 94 130 25 165 224 198 129 256 207 201 167 158 245 253 282 136 262 73 130 108 165 150 187
1992 187 189 26 295 291 79 188 122 222 130 99 151 20 152 80 91 135 150 130 87 145 28 109 103 100 108 22 96 79 159 42 264 274
1692 274 46 183 238 168 69 125 70 143 166 199 91 126 137 224 89 80 34 108 126 91 25 46 217 248 95 68 173 133 82 61 46 42
1391 42 143 40 117 26 200 107 69 131 56 267 154 121 205 244 223 173 103 174 207 66 48 183 230 79 97 105 52 66 52 275 150
1100 150 169 174 97 58 111 76 122 101 115 179 196 112 188 205 41 47 72 235 104 176 176 221 141 178 93 63 89 58 185 148 312 173 122
790 122 56 99 172 121 208 88 124 217 93 35 57 61 101 121 95 225 61 237 213 118 276 210 141 100 112 68 153 276 215 162 97 39
490 39 171 255 95 24 58 134 253 134 237 214 133 100 86 102 109 48 106 222 121 158 192 66 186 214 180 139 136 175 104 205 174 48
189 48 65 76 199 352 219 123 225 51 84 52 132 62 110 41 124 122 258 127 117 128 32 122 147 67 155 178 263 390 174 114 157 37
-111 37 144 141 39 30 90 85 166 37 221 154 63 43 53 210 242 253 159 93 51 100 48 64 21 172 66 97 125 29 98 24
-393B4
##PAGE=	F1=4451.88
##FIRST=	17614.246348710370512,	4405.4455391999963467,	0.27108988165855407715
##DATA TABLE=	(F2++(Y..Y)), PROFILE
4405 101 123 25 23 89 53 31 97 71 67 132 157 103 257 110 79 74 32 151 150 132 226 140 63 122 175 138 64 99 62 58 203 119 94 170 81
4077 81 125 145 109 178 201 224 93 62 181 50 202 95 67 105 62 108 179 147 64 117 229 172 56 210 326 189 31 71 31 113
3795 113 167 27 79 113 54 42 245 65 109 255 91 68 44 107 60 54 92 75 175 238 162 173 211 54 31 208 201 216 294 130 94
3504 94 160 95 49 126 97 35 144 121 136 294 114 209 322 137 114 196 105 40 132 226 104 46 125 39 133 76 99 223 279 164 168 95
3204 95 142 81 124 101 161 98 160 161 48 123 279 120 50 77 115 141 66 195 215 104 239 257 113 131 6 146 156 144 226 121 103
2912 103 81 92 155 16 140 42 195 163 65 85 37 219 128 118 171 38 184 220 183 44 95 181 274 17 90 85 93 21 117 119 102 164
2612 164 62 140 32 65 122 137 182 58 96 162 172 170 77 201 167 66 143 103 71 55 283 173 205 190 43 151 133 155 271 178
2330 178 73 48 195 216 170 256 288 234 104 197 224 136 112 135 174 59 115 213 240 97 288 242 200 128 167 256 257 231 102 228 73
2039 73 172 110 145 114 194 200 21 269 256 133 218 106 243 190 98 151 75 146 68 111 126 74 98 123 167 40 134 181 152 137 49 94 140
1729 140 161 70 242 249 41 166 220 178 118 125 67 117 122 239 122 70 108 235 68 109 75 158 119 99 32 90 249 263 34 38 147 143
1429 143 53 102 53 10 135 39 160 28 240 82 58 144 81 289 148 125 223 233 245 186 63 171 242 55 64 165 228 65 92
1156 92 118 82 123 13 278 163 152 145 68 92 104 42 152 150 18 92 170 125 192 205 28 43 62 191 91 148 182 184 104 167 74 33 75
847 75 64 173 187 326 192 120 89 95 163 90 232 97 157 232 93 41 75 83 78 107 127 256 106 230 176 77 251 213 80 70 134 95
546 95 108 262 218 177 112 73 179 262 75 31 48 160 263 98 253 231 167 126 113 53 80 14 104 212 68 195 219 66 201 174
264 174 216 154 125 174 121 204 145 37 73 117 227 348 189 159 245 74 171 102 150 71 37 39 153 135 276 154 153 139 45 111 134 31
-36 31 197 164 170 335 156 95 102 32 129 149 75 8 29 59 123 27 209 100 60 60 31 209 261 326 149 119 43 111 94 48 44 167 43
-346 43 113 89 86 123 12
-393A2
##PAGE=	F1=4381.12
##FIRST=	17614.246348710370512,	4405.4455391999963467,	0.5324885249137878418
##DATA TABLE=	(F2++(Y..Y)), PROFILE
4405 108 130 18 50 83 80 78 168 97 67 151 142 126 214 101 102 43 66 152 119 120 244 142 41 116 133 122 50 88 9 132 223 185 90 137
4086 137 111 73 111 100 163 196 271 97 33 169 40 192 69 56 110 61 117 170 132 77 133 212 163 38 185 334 245 19 112 45
3804 45 160 190 37 129 55 60 26 230 100 103 251 58 50 69 133 83 18 59 88 178 221 117 118 156 63 28 248 194 158 244 161 110 189
3495 189 41 49 105 151 19 168 154 109 285 124 180 235 90 93 220 106 54 96 241 120 81 117 61 58 34 89 258 300 158 194
3213 194 189 191 89 108 113 178 152 81 146 21 110 356 142 36 107 91 134 46 205 164 114 227 228 137 143 43 138 117 89 173 75 173 37
2903 37 91 134 27 177 12 164 154 103 100 87 242 115 116 165 39 191 201 180 29 121 158 292 80 112 91 66 74 168 148 147 161 75
2603 75 136 95 129 100 132 202 52 116 156 176 179 78 211 144 65 133 106 50 59 246 136 193 208 28 161 96 192 243 147 72 52 162
2302 162 168 197 238 251 220 67 168 180 97 94 138 192 106 66 186 263 117 314 265 178 80 183 251 230 155 61 171 80 201 96 92 109
2002 109 190 197 43 239 201 191 230 77 253 248 94 146 152 146 62 140 131 12 71 157 174 82 165 246 192 161 96 99 190 174 92 201 217 40
1682 40 139 190 174 160 120 69 143 65 254 137 23 129 232 42 130 99 207 127 111 39 141 241 233 31 22 115 149 20 128 64
1401 64 28 124 59 190 44 266 71 71 145 98 268 127 120 225 208 264 186 29 159 263 68 65 143 214 46 80 108 99 182 30 267
1110 267 156 127 143 75 124 96 76 182 212 131 115 138 118 196 202 34 24 67 149 69 124 179 134 65 141 68 64 46 79 139 211 313 176
800 176 85 110 107 144 59 248 128 171 210 84 43 93 110 62 88 159 274 150 235 123 49 233 219 16 41 139 140 61 227 216 164 119
499 119 86 176 250 69 49 65 190 259 58 265 256 205 150 126 12 56 36 102 198 80 182 224 52 189 116 253 166 84 142 131 201
208 201 116 30 81 156 245 345 174 185 267 105 243 140 163 97 48 38 171 152 284 173 182 126 39 121 128 39 200 127 103 290 137
-83 137 79 59 54 104 127 86 29 55 62 68 64 195 61 59 94 5 186 265 379 147 135 89 137 128 51 80 155 37 118 67 134 161 33
-393C3
##PAGE=	F1=4310.35
##FIRST=	17614.246348710370512,	4405.4455391999963467,	0.7182623744010925293
##DATA TABLE=	(F2++(Y..Y)), PROFILE
4405 114 131 16 75 75 95 110 225 125 77 145 125 142 165 138 133 35 73 136 75 93 228 119 39 85 85 91 71 88 68 189 247 231 105
4096 105 106 134 114 81 91 142 169 291 108 20 155 41 179 46 37 123 68 128 154 107 90 151 208 174 20 172 334 281 67 165 49
3804 49 200 209 63 166 63 66 8 198 126 90 254 61 47 90 144 116 88 18 100 167 184 90 53 86 78 78 267 194 107 190 200 178 231
3495 231 34 47 91 192 70 178 166 66 243 133 123 118 70 92 250 90 66 57 240 127 115 93 82 67 75 89 239 280 129 211
3213 211 234 208 108 109 116 191 190 18 119 23 143 433 176 18 107 76 116 30 204 113 115 202 188 153 133 76 128 86 72 123 67 247
2912 247 61 91 103 58 200 10 121 148 126 102 153 268 93 123 153 60 184 166 169 48 143 151 291 122 112 98 44 123 198 173 188
2621 188 145 77 159 157 186 89 119 194 42 139 169 182 175 86 222 126 61 127 102 63 77 216 99 178 208 21 180 67 233 199 109 63
2321 63 43 114 109 218 196 194 189 9 101 130 56 55 103 178 140 30 153 256 166 332 265 133 30 195 229 173 82 66 104 98 204 72
2020 72 20 135 173 181 78 207 147 245 223 55 246 286 90 143 210 147 60 166 151 47 67 175 161 124 210 285 205 176 154 117 223
1729 223 193 105 150 180 29 101 160 168 179 104 72 201 53 244 130 51 179 216 9 140 98 244 148 133 49 163 204 168 83 58
1448 58 101 149 44 133 88 46 116 65 200 53 265 64 116 134 104 212 94 111 211 175 274 178 12 140 263 73 63 126 193
1175 193 24 69 77 114 240 79 243 131 118 175 112 145 83 135 201 265 223 192 105 97 202 195 64 21 82 113 43 126 182 86 47 109 77
865 77 116 7 96 93 219 274 127 24 117 126 115 28 254 166 158 156 72 41 105 141 58 79 183 277 192 256 67 39 220 227 62 38 132 177
546 177 63 173 201 118 117 86 158 219 86 80 112 223 242 32 267 287 243 178 125 44 53 66 103 201 104 128 215 20 154 71 276 167
246 167 36 88 141 195 89 28 86 183 254 341 176 200 278 126 288 161 167 114 103 37 174 172 273 177 201 92 49 146 125 56 168
-45 168 78 94 253 115 70 53 76 84 107 70 62 125 78 36 112 177 75 52 123 29 157 252 404 142 130 141 154 143 43 111 140 27
-346 27 109 48 160 195 61
-393F1
##PAGE=	F1=4239.59
##FIRST=	17614.246348710370512,	4405.4455391999963467,	0.76470476388931274414
##DATA TABLE=	(F2++(Y..Y)), PROFILE
4405 121 125 18 90 63 92 115 253 147 92 124 115 147 125 177 162 54 52 113 46 58 185 76 61 38 44 53 94 117 107 229 265 244 116
4096 116 83 145 177 88 86 118 125 282 125 38 154 48 164 33 21 144 80 127 138 71 105 168 214 195 42 168 333 290 103 209
3814 209 54 223 227 89 187 115 79 12 156 139 78 259 84 60 110 141 145 159 42 113 145 126 101 45 42 93 114 262 197 78 144 238
3513 238 253 267 87 67 92 209 113 175 168 12 175 131 57 24 115 115 275 65 77 54 228 124 137 54 101 134 129 99 173 220 79 212
3213 212 227 192 145 118 110 190 202 60 83 71 203 482 221 12 73 72 94 52 186 79 103 168 143 167 104 100 129 60 99 111 105 307 134
2903 134 82 62 81 204 36 77 139 124 87 215 288 63 129 136 79 154 125 150 70 144 159 274 136 102 109 31 161 209 186 210 123 71
2603 71 178 200 231 85 91 163 73 142 182 186 160 94 227 130 52 121 86 99 108 205 79 165 191 35 209 47 267 155 82 34 20 64
2302 64 59 225 151 131 151 59 33 103 46 21 45 137 162 22 131 217 200 335 243 74 38 198 192 99 109 112 44 110 176 55 71 163 142
1992 142 156 111 175 136 289 204 57 222 297 91 146 235 138 66 180 182 93 78 171 128 166 259 289 189 179 214 152 235 203 114 107 143 48
1682 48 58 137 163 166 83 74 251 99 223 107 81 228 187 31 142 74 260 177 169 74 153 173 89 121 91 115 144 84 119 125 55 130 56
1372 56 185 53 236 73 177 116 106 147 55 102 180 140 269 168 13 120 241 78 75 120 171 12 65 35 130 289 126 209 101
1100 101 140 212 143 157 74 189 206 295 275 240 91 94 211 188 108 73 96 88 37 162 200 52 60 81 93 161 49 121 60 213 216 60 52
790 52 114 135 76 41 244 194 120 79 66 34 106 172 67 90 199 267 228 282 30 36 207 228 103 59 133 201 107 111 176 43 103 86 131
480 131 170 109 115 168 254 215 30 255 315 280 212 119 66 66 100 111 227 102 95 213 27 103 92 272 153 48 30 153 181 66 37
189 37 89 188 254 339 191 204 274 135 303 159 158 112 134 34 158 188 239 167 212 57 83 176 125 76 120 57 134 221 91 77 69 89 89
-121 89 133 33 91 177 88 83 155 153 108 34 135 61 154 231 398 133 107 184 154 140 26 135 131 29 96 22 156 211 85
-393H5
##PAGE=	F1=4168.82
##FIRST=	17614.246348710370512,	4405.4455391999963467,	0.70930814743041992188
##DATA TABLE=	(F2++(Y..Y)), PROFILE
4405 124 113 20 92 48 72 97 242 161 106 105 115 145 101 195 184 94 40 94 53 29 130 61 99 37 41 24 105 165 123 254 273 222 108 72
4086 72 140 216 124 83 98 72 248 139 64 166 52 148 56 25 167 98 113 126 29 125 181 214 214 64 158 328 271 114 234 75 225
3795 225 241 107 193 156 99 39 114 136 69 256 90 78 128 132 161 212 87 129 132 56 137 106 96 102 138 233 198 78 112 266 309 285 125
3485 125 105 96 200 140 164 178 48 94 113 58 142 185 150 285 56 87 86 216 115 144 29 118 183 169 118 81 138 16 192 195 149 175
3185 175 119 98 174 188 100 79 130 263 487 264 36 17 76 82 91 150 73 70 141 101 185 68 114 139 34 122 132 134 342 211 74 32
2884 32 96 197 78 48 116 95 53 264 297 31 126 121 89 98 101 124 80 117 171 250 125 96 122 36 182 206 184 207 103 63 171 222 261
2574 261 85 49 123 131 137 183 184 133 98 221 157 50 110 63 128 143 211 80 158 161 47 234 39 284 124 88 39 26 32 60 214 130
2274 130 87 118 121 121 125 68 52 40 82 178 25 134 160 209 319 202 62 92 190 147 40 198 149 4 103 119 52 140 176 109 128 132 142
1964 142 175 320 194 63 183 282 96 154 220 114 82 179 216 135 84 146 80 200 293 258 147 168 263 198 224 195 122 89 110 101 26
1673 26 129 155 128 85 75 274 135 202 76 91 263 148 71 138 41 250 206 213 115 120 176 41 141 107 135 133 115 93 166 61 171
1382 171 51 148 51 186 104 236 98 104 118 16 99 138 104 246 158 20 98 200 97 103 123 152 33 71 8 141 322 159 166 96
1100 96 174 231 156 169 84 231 196 298 280 245 107 122 223 185 155 128 100 77 68 218 235 39 75 67 105 187 103 157 69 196 158 21
800 21 120 108 129 32 87 218 200 67 19 75 23 96 198 92 111 208 249 251 297 41 33 188 211 111 82 156 216 145 61 158 52 79 101
490 101 101 112 128 143 212 275 182 28 227 331 311 247 115 62 80 135 118 260 75 161 236 76 54 136 237 124 75 39 162 151 55
199 55 53 91 165 242 334 209 198 253 132 287 131 142 90 135 29 127 194 182 150 218 56 111 201 126 96 95 94 185 189 70 100 77 93 113
-121 113 187 25 112 201 88 137 189 120 129 4 124 93 187 216 361 120 82 213 141 121 36 149 135 54 92 24 125 206 100
-393A00
##PAGE=	F1=4098.06
##FIRST=	17614.246348710370512,	4405.4455391999963467,	0.61671990156173706055
##DATA TABLE=	(F2++(Y..Y)), PROFILE
4405 119 98 23 79 35 44 64 192 169 110 99 112 145 96 186 196 138 85 89 69 38 95 116 142 87 67 22 103 212 118 270 269 171 80 78 121
4077 121 226 157 78 91 31 193 141 88 179 49 135 99 35 188 118 92 117 31 151 187 193 219 65 130 308 232 98 238 105 212
3795 212 251 114 190 176 123 70 74 116 59 235 67 98 143 124 163 236 120 150 154 30 173 161 159 101 150 186 195 97 95 276 341 289 136
3485 136 144 85 168 147 151 201 95 39 86 106 239 250 184 277 75 96 118 213 106 132 71 132 203 192 138 55 80 56 152 176 97 181 107 87
3166 87 148 158 118 126 183 305 446 290 59 66 85 103 131 102 78 17 146 70 202 67 119 143 7 125 150 135 346 277 93 64 103
2875 103 190 131 58 70 71 8 292 292 17 125 124 89 25 112 88 80 62 178 228 97 97 134 56 178 192 169 180 86 57 134 225 273 81 3
2556 3 97 186 154 169 172 96 100 202 189 75 96 60 136 170 220 108 156 129 50 241 39 281 103 119 111 70 38 89 179 135 102 102 160 228
2236 228 170 89 84 94 30 190 19 160 133 207 281 149 118 143 176 103 79 277 162 5 75 46 56 179 168 91 102 137 109 224 340
1945 340 208 57 135 250 104 160 169 87 105 162 248 173 74 113 35 214 296 201 93 143 290 240 195 166 125 88 85 153 32 139 143 89
1645 89 126 76 265 141 182 58 84 281 103 104 133 49 212 225 255 160 81 197 80 149 101 145 115 133 66 200 70 225 73 93
1363 93 65 134 139 280 90 97 138 19 108 91 74 207 149 34 66 146 124 134 126 140 56 84 39 144 331 167 116 124 198 223 152 189 108
1053 108 255 174 274 247 212 131 161 234 185 195 171 86 79 103 277 279 51 81 71 107 186 151 201 88 173 122 68 165 100 109 13 127 178
743 178 179 47 96 95 23 80 214 128 129 211 226 253 293 54 30 162 173 87 99 191 228 167 51 165 146 54 127 81 54 142 160 231 282 147
424 147 12 187 327 328 272 116 35 92 165 114 287 37 248 277 127 55 165 173 84 73 73 166 100 67 71 92 114 213 320 220 184 219
124 219 120 247 81 132 59 112 28 97 186 117 137 222 78 116 217 133 106 114 132 231 156 81 132 75 95 139 234 79 126 195 81 181
-177 181 211 80 134 48 92 127 229 219 302 104 74 226 122 99 64 155 147 77 97 57 77 182 99
-393I9
##PAGE=	F1=4027.29
##FIRST=	17614.246348710370512,	4405.4455391999963467,	0.42702558636665344238
##DATA TABLE=	(F2++(Y..Y)), PROFILE
4405 109 85 35 57 30 38 38 113 177 99 104 102 151 106 155 198 170 141 101 76 55 121 179 179 122 87 26 91 240 98 276 252 103 39 97 90 210
4067 210 172 69 105 52 123 123 106 182 37 134 139 40 199 135 70 106 78 178 183 142 201 44 93 262 184 71 233 131 190 255 106
3776 106 174 169 145 100 42 82 49 193 16 119 155 126 153 226 139 172 204 85 194 198 199 89 154 131 185 121 91 269 354 294 121 179
3476 179 50 118 135 135 224 120 88 61 139 294 296 206 254 97 105 139 225 106 107 116 139 198 200 154 137 123 121 100 183 73 165 82 79 117 130 113
3138 113 180 214 319 371 290 76 137 88 148 162 76 81 49 178 46 212 112 119 128 14 114 151 108 319 317 133 104 107 191 189 88 3
2837 3 121 47 298 275 39 144 149 81 53 135 47 87 29 180 212 65 100 141 86 148 174 148 141 70 55 87 210 267 71 46 93 220
2537 220 196 146 150 49 102 169 215 117 87 105 125 184 221 160 157 108 43 226 34 257 83 151 188 116 58 105 122 137 149 101 166 314 212
2227 212 109 105 127 30 197 3 188 173 224 234 84 167 185 163 72 125 324 149 23 48 44 55 180 146 101 85 127 75 260 348 239
1936 239 43 93 217 113 155 94 105 131 139 269 204 56 93 55 200 263 131 60 107 286 263 153 119 120 87 71 188 41 165 137
1654 137 100 175 79 228 114 159 68 69 284 56 122 130 90 154 229 279 196 55 202 110 150 72 140 90 142 52 219 84 278 113 54
1363 54 94 100 157 296 91 81 155 41 123 54 66 159 138 51 23 90 150 157 125 134 73 98 62 143 319 147 56 155 202 189 140 217 129 255
1044 255 142 230 190 159 143 189 240 186 216 191 55 85 129 330 321 76 86 87 100 157 187 248 100 144 112 96 180 81 82 47 147 133 134 102
725 102 165 118 41 66 216 165 142 208 205 233 269 48 26 134 118 49 111 220 238 177 63 193 224 58 155 83 20 152 163 224 277 115
424 115 14 143 298 325 276 111 11 103 184 95 304 27 307 312 172 102 173 104 46 48 89 161 33 99 83 98 41 165 289 219
142 219 163 174 106 191 17 139 41 76 43 89 166 101 134 221 86 94 222 150 96 140 151 263 121 127 171 73 111 159 263 131 135 167 70
-167 70 217 223 43 133 105 44 161 255 233 231 89 81 228 102 85 83 153 157 83 102 80 29 148 80
-393H0
##PAGE=	F1=3956.52
##FIRST=	17614.246348710370512,	4405.4455391999963467,	0.19488707184791564941
##DATA TABLE=	(F2++(Y..Y)), PROFILE
4405 110 80 55 44 37 67 52 23 187 75 111 96 159 121 107 195 174 184 121 72 58 181 224 201 133 98 30 73 243 73 272 226 38
4105 38 19 112 64 181 170 60 135 86 45 89 120 173 21 148 163 55 196 137 57 91 120 196 167 68 159 20 98 189 137 81 241
3814 241 142 164 252 82 140 136 158 121 43 42 45 131 61 138 159 136 135 188 141 191 254 119 193 214 208 75 154 83 167 139 89 245 361 313 85
3485 85 208 22 59 106 115 233 119 144 52 152 301 315 212 224 106 114 147 242 126 75 144 135 181 197 157 203 189 175 50 197 100
3194 100 143 52 72 86 130 87 217 210 299 290 261 82 189 76 197 184 118 87 118 217 31 208 161 116 90 26 101 138 64 270 323 173
2894 173 127 111 200 245 118 72 207 94 281 252 61 183 174 67 119 145 34 121 106 182 202 37 103 142 120 95 153 129 106 58 59
2603 59 90 181 237 53 78 94 225 236 121 123 11 105 129 229 159 100 165 102 186 214 217 157 103 32 193 17 217 64 174 253 156
2311 156 88 101 59 122 196 104 138 365 245 137 122 131 58 196 16 202 234 275 209 14 189 213 158 60 141 333 120 73 69 108 48
2020 48 145 126 118 78 107 38 277 347 268 49 80 193 121 135 34 167 151 118 278 224 48 96 96 154 200 73 93 81 248 258 112
1729 112 60 102 76 67 196 32 195 152 144 211 86 178 64 130 86 59 272 14 119 126 126 90 214 274 213 47 176 107 153 27 126
1438 126 62 144 68 219 100 320 154 91 123 92 149 278 94 53 143 50 137 50 85 109 125 69 27 48 171 169 115 133 82 108 83 151
1138 151 290 106 17 171 186 134 132 243 136 229 100 178 132 108 140 198 239 193 220 186 33 94 139 368 351 105 100 109 84 104 202 291
837 291 123 112 100 101 179 49 58 69 141 99 80 160 213 138 66 70 202 191 153 198 188 194 228 31 34 126 65 48 118 229 247 184 67 218
518 218 270 90 180 106 39 156 155 204 266 90 43 106 251 296 255 94 49 113 189 71 309 45 324 325 210 150 173 100 40 62 89
227 89 146 56 140 86 114 43 102 242 202 137 120 103 132 46 154 51 53 70 99 150 162 136 213 74 51 218 173 67 145 148 276 85 181
-83 181 219 91 141 170 279 175 138 130 55 249 228 25 135 163 18 189 256 242 167 73 90 223 80 86 86 144 152 73 93 82 9 111
-383 111 57
-393E7
##PAGE=	F1=3885.76
##FIRST=	17614.246348710370512,	4405.4455391999963467,	0.35410591959953308105
##DATA TABLE=	(F2++(Y..Y)), PROFILE
4405 130 85 79 55 46 94 82 61 199 45 116 112 160 132 54 191 143 206 139 66 45 238 241 205 121 99 54 60 220 56 255 197 28 57
4096 57 113 72 151 162 70 169 110 41 70 133 157 28 165 161 84 180 122 56 67 150 198 139 56 103 48 164 99 97 132 271 136 136 246 44
3776 44 84 82 161 129 79 2 48 59 150 154 152 151 114 139 129 195 281 120 166 208 183 76 151 59 143 144 81 210 368 349 41 228 85 13
3457 13 73 97 225 105 190 55 160 268 308 200 197 103 126 141 254 158 59 149 122 168 190 146 237 232 210 36 201 136 125 20 70
3166 70 64 162 46 230 168 254 233 210 82 209 42 237 200 186 105 174 248 56 190 196 114 36 28 94 116 19 207 295 199 130 116 217
2865 217 289 144 138 284 131 244 230 75 218 181 50 160 141 72 174 182 185 197 26 110 136 157 38 132 117 91 52 67 147 144 184
2574 184 27 86 85 203 255 101 102 61 109 87 233 189 137 219 78 186 205 259 156 102 26 152 10 168 70 185 295 186 128
2302 128 88 59 104 235 101 86 375 264 177 143 113 78 182 35 193 275 332 228 76 181 222 159 64 127 305 106 138 108 150
2030 150 40 95 122 124 83 86 9 277 339 281 77 92 176 127 97 95 228 159 101 272 230 65 103 121 91 129 70 147 111 181 224 90 13
1720 13 76 61 73 177 10 215 177 172 224 97 139 39 99 90 59 245 41 97 117 147 60 182 237 208 45 123 74 159 23 109 38
1429 38 141 100 199 112 343 188 149 140 92 121 230 94 25 102 47 140 69 106 63 113 91 75 39 187 170 97 138 87 109 107 171 252 64
1119 64 70 165 161 66 136 256 128 178 52 132 95 87 125 185 232 212 214 158 75 102 133 382 361 129 129 133 64 36 195 323 170 84 66 94
$$ [...]
-393B09
##END NTUPLES=	nD NMR SPECTRUM
##END=	
##END=	
