##TITLE=	Aug01-2022.11.fid
TM-VI-137, acetone-d6

##JCAMP-DX=	6.0	$$ MestReNova 14.3.0-30573
##DATA TYPE=	LINK
##BLOCK_ID=	1
##BLOCKS=	2    
##ORIGIN=	Mestrelab Research S.L.
##OWNER=	hrzepa
##$MNOVA/LINK_BLOCK_TYPE=	ITEM	$$ NMR Spectrum
##$MNOVA/ITEM/POLYGON=	(XY..XY)
5321,5835
8722,5835
8722,8208
5321,8208
5321,5835
##$MNOVA/ITEM/Z=	0
##$MNOVA/ITEM/ANGLE=	0
##TITLE=	Aug01-2022.11.fid
##JCAMP-DX=	6.0	$$ MestReNova 14.3.0-30573
##BLOCK_ID=	2
##DATA TYPE=	MNOVA NMR VIEW DATA
##DATA CLASS=	MNOVA VIEW DATA
##$MNOVA/ITEM/ZOOM/X=	-20.698776542268014111,	240.66949999422217843
##$MNOVA/ITEM/ZOOM/Y=	-821.72928225994110107,	9017.73016357421875
##END=	
##TITLE=	Aug01-2022.11.fid
##JCAMP-DX=	6.0	$$ MestReNova 14.3.0-30573
##BLOCK_ID=	3
##DATA TYPE=	NMR SPECTRUM
##DATA CLASS=	XYDATA
##NUMDIM=	1
##ORIGIN=	Bruker BioSpin GmbH
##OWNER=	nmr
##.OBSERVE FREQUENCY=	100.69424847706599735
##.OBSERVE NUCLEUS=	^13C
##.SOLVENT NAME=	Acetone
##.PULSE SEQUENCE=	zgpg30
##LONGDATE=	2022/08/01 21:13:00.000
##.ACQUISITIONMODE=	SIMULTANEOUS (DQD)
##$ORIGINAL FORMAT=	Bruker XWIN-NMR
##$MNOVA/SCALES_VERSION=	9
##$PARAMETER FILE=	(acqus, ASCII, /private/var/folders/f6/rjf_tdyn2v98c5c0wvkgn4s80000gn/T/agfIlzqoTS2ZO3wQwatgVQ/11/acqus, 0)
$$ ##TITLE= Parameter file, TOPSPIN		Version 3.2
$$ ##JCAMPDX= 5.0
$$ ##DATATYPE= Parameter Values
$$ ##NPOINTS= 11	$$ modification sequence number
$$ ##ORIGIN= Bruker BioSpin GmbH
$$ ##OWNER= nmr
$$ $$ 2022-08-01 21:13:53.103 +0100  nmr@CZC10666PP
$$ $$ /opt/topspin/data/agmb/nmr/Aug01-2022/11/acqus
$$ $$ process /opt/topspin3.2/prog/mod/shimcntl
$$ ##$ACQT0= -2.01680680282977
$$ ##$AMP= (0..31)
$$ 100 100 100 100 100 100 100 100 100 100 100 100 100 100 100 100 100 100
$$ 100 100 100 100 100 100 100 100 100 100 100 100 100 100
$$ ##$AMPCOIL= (0..19)
$$ 0 0 0 0 0 0 0 0 0 0 0 0 0 0 0 0 0 0 0 0
$$ ##$ANAVPT= -1
$$ ##$AQSEQ= 0
$$ ##$AQ_mod= 3
$$ ##$AUNM= <au_zgonly>
$$ ##$AUTOPOS= <43 >
$$ ##$BF1= 100.683175
$$ ##$BF2= 400.41
$$ ##$BF3= 100.683175
$$ ##$BF4= 100.683175
$$ ##$BF5= 100.683175
$$ ##$BF6= 100.683175
$$ ##$BF7= 100.683175
$$ ##$BF8= 100.683175
$$ ##$BYTORDA= 0
$$ ##$CAGPARS= (0..11)
$$ 0 0 0 0 0 0 0 0 0 0 0 0
$$ ##$CFDGTYP= 0
$$ ##$CFRGTYP= 9
$$ ##$CHEMSTR= <none>
$$ ##$CNST= (0..63)
$$ 1 1 145 1 1 1 1 1 1 1 1 1 1 1 1 1 1 1 1 1 1 1 1 1 1 1 1 1 1 1 1 1 1 1 1
$$ 1 1 1 1 1 1 1 1 1 1 1 1 1 1 1 1 1 1 1 1 1 1 1 1 1 1 1 1 1
$$ ##$CPDPRG= (0..8)
$$ <waltz16> <> <waltz16> <> <mlev> <mlev> <mlev> <mlev> <mlev>
$$ ##$D= (0..63)
$$ 0 1 0.00345 0 0 0 0 0 0 0.06 0 0.03 2e-05 3e-06 0 0 0.0002 0 0 0 0 0 0
$$ 0 0 0 0 0 0 0 0 0 0 0 0 0 0 0 0 0 0 0 0 0 0 0 0 0 0 0 0 0 0 0 0 0 0 0 0
$$ 0 0 0 0 0
$$ ##$DATE= 1659384832
$$ ##$DE= 6.5
$$ ##$DECBNUC= <off>
$$ ##$DECIM= 760
$$ ##$DECNUC= <off>
$$ ##$DECSTAT= 4
$$ ##$DIGMOD= 1
$$ ##$DIGTYP= 12
$$ ##$DQDMODE= 0
$$ ##$DR= 21
$$ ##$DS= 4
$$ ##$DSPFIRM= 0
$$ ##$DSPFVS= 20
$$ ##$DTYPA= 0
$$ ##$EXP= <c13>
$$ ##$F1LIST= <111111111111111>
$$ ##$F2LIST= <222222222222222>
$$ ##$F3LIST= <333333333333333>
$$ [...]
$$ 90 74 58 42 26 10 0 0
$$ ##$Sgu3PowerLevels= (0..7)
$$ 0 0 0 0 0 0 0 0
$$ ##$Sgu4PowerLevels= (0..7)
$$ 0 0 0 0 0 0 0 0
$$ ##$Sgu5PowerLevels= (0..7)
$$ 0 0 0 0 0 0 0 0
$$ ##$Sgu6PowerLevels= (0..7)
$$ 0 0 0 0 0 0 0 0
$$ ##$Sgu7PowerLevels= (0..7)
$$ 0 0 0 0 0 0 0 0
$$ ##$Sgu8PowerLevels= (0..7)
$$ 0 0 0 0 0 0 0 0
$$ ##$SguType= 3
$$ ##$ShimPowMaxUA= (0..63)
$$ 130000 130000 130000 130000 130000 130000 130000 130000 130000 130000 130000
$$ 130000 130000 130000 130000 130000 130000 130000 130000 130000 0 0 0 0
$$ 0 0 0 0 0 0 0 0 0 0 0 0 0 0 0 0 0 0 0 0 0 0 0 0 0 0 0 0 0 0 0 0 0 0 0 0
$$ 0 0 0 0
$$ ##$ShimPowMaxUC= (0..63)
$$ 130000 130000 130000 130000 130000 130000 130000 130000 130000 130000 130000
$$ 130000 130000 130000 130000 130000 130000 130000 130000 130000 0 0 0 0
$$ 0 0 0 0 0 0 0 0 0 0 0 0 0 0 0 0 0 0 0 0 0 0 0 0 0 0 0 0 0 0 0 0 0 0 0 0
$$ 0 0 0 0
$$ ##$ShimPowMaxUG= (0..63)
$$ 524287 524287 524287 524287 524287 524287 524287 524287 524287 524287 524287
$$ 524287 524287 524287 524287 524287 524287 524287 524287 524287 0 0 0 0
$$ 0 0 0 0 0 0 0 0 0 0 0 0 0 0 0 0 0 0 0 0 0 0 0 0 0 0 0 0 0 0 0 0 0 0 0 0
$$ 0 0 0 0
$$ ##$ShimPowRcbType= 3
$$ ##$ShimPowRes= (0..63)
$$ 1e-20 1e-20 1e-20 1e-20 1e-20 1e-20 1e-20 1e-20 1e-20 1e-20 1e-20 1e-20
$$ 1e-20 1e-20 1e-20 1e-20 1e-20 1e-20 1e-20 1e-20 0 0 0 0 0 0 0 0 0 0 0 0
$$ 0 0 0 0 0 0 0 0 0 0 0 0 0 0 0 0 0 0 0 0 0 0 0 0 0 0 0 0 0 0 0 0
$$ ##$ShimPowRng0= (0..63)
$$ 1 1 1 1 1 1 1 1 1 1 1 1 1 1 1 1 1 1 1 1 0 0 0 0 0 0 0 0 0 0 0 0 0 0 0 0
$$ 0 0 0 0 0 0 0 0 0 0 0 0 0 0 0 0 0 0 0 0 0 0 0 0 0 0 0 0
$$ ##$ShimPowRng1= (0..63)
$$ 1 1 1 1 1 1 1 1 1 1 1 1 1 1 1 1 1 1 1 1 0 0 0 0 0 0 0 0 0 0 0 0 0 0 0 0
$$ 0 0 0 0 0 0 0 0 0 0 0 0 0 0 0 0 0 0 0 0 0 0 0 0 0 0 0 0
$$ ##$ShimPowRng2= (0..63)
$$ 1 1 1 1 1 1 1 1 1 1 1 1 1 1 1 1 1 1 1 1 0 0 0 0 0 0 0 0 0 0 0 0 0 0 0 0
$$ 0 0 0 0 0 0 0 0 0 0 0 0 0 0 0 0 0 0 0 0 0 0 0 0 0 0 0 0
$$ ##$ShimPowRng3= (0..63)
$$ 1 1 1 1 1 1 1 1 1 1 1 1 1 1 1 1 1 1 1 1 0 0 0 0 0 0 0 0 0 0 0 0 0 0 0 0
$$ 0 0 0 0 0 0 0 0 0 0 0 0 0 0 0 0 0 0 0 0 0 0 0 0 0 0 0 0
$$ ##$ShimSysFunc= (0..63)
$$ 1 2 3 4 5 7 9 11 15 16 8 10 12 14 6 17 13 18 19 20 0 0 0 0 0 0 0 0 0 0
$$ 0 0 0 0 0 0 0 0 0 0 0 0 0 0 0 0 0 0 0 0 0 0 0 0 0 0 0 0 0 0 0 0 0 0
$$ ##$ShimSysMatrix= 0
$$ ##$ShimSysType= 1
$$ ##$TFXNUM= 0
$$ ##$TRIPLO2= 0
$$ ##$VTU= 2
$$ ##$VTUETH= <149.236.99.20>
$$ ##$VTUTY= <no>
$$ ##$WBREFAM= (0..15)
$$ 135 116 100 100 100 100 100 100 100 100 100 100 100 100 100 100
$$ ##$WBREFLM= (0..15)
$$ 0 0 0 0 0 0 0 0 0 0 0 0 0 0 0 0
$$ ##$WBREFPH= (0..15)
$$ 71.66 -68.25 0 0 0 0 0 0 0 0 0 0 0 0 0 0
$$ ##$WBSGU= (0..15)
$$ 0 0 0 0 0 0 0 0 0 0 0 0 0 0 0 0
$$ ##$XFAC= 2
$$ ##END=
$$ 
##$DECIM=	760
##$DSPFVS=	20
##XUNITS=	HZ
##YUNITS=	ARBITRARY UNITS
##FIRSTX=	24231.369385662510467
##LASTX=	-2084.0185409410978536
##DELTAX=	-0.40154708059210514337
##XFACTOR=	1
##YFACTOR=	0.071434464498714031477
##FIRSTY=	11.5048675537109375
##MINY=	-1.9356421232223510742
##MAXY=	8197.9365234375
##NPOINTS=	65536
##XYDATA=	(X++(Y..Y))
$$ [...]
8322D13J0JJPJ2J5J1Lpj3qjNQJ0J0PPJ2J5J0%opnoj2j6j5j2pnopo%NQOJnj5k0j6pkpj0oKO
8302C58PJ0J2J0LKQJ3J5J9K4K6J8O%oj4k1k2j8j2rpoj3k5l4l1j4QK3K9K7K4K4K3J8J5J5J4
8286E19Kj9l5l5k6j5mOQJnlORJ0J0PMJMOjj8l1l1k1nJ2K4K2QjLJ5K3K5J8Rmj4j3oknj0j0m
8267D34NJ0J0NkmjNNJpj1mPJ8K1J8J0mj9k5j4KJ4J5Pmj3j9j6pjKKLOQPKqk1k6j7kRJ1O%pj0
8247D01okkpoPK6L6L0J5krnJLJlqj2j8j9j3pnj0rjRJ7J8J7J4J3J7J7J5RRJ5K4K7J7JomNPp
8228F10k6l4k4p%qj7k0k0k0k0j2n%%KJoj6j8qPJ9K3K4K1J8J4J1Lnj0rmKQQLmjJ4K5J4j2k9
8210D92k5mJ5K2J6Lj3k4k3rJ2K6L0K8K5K7K2J1mj5j8j6j5j5j9k4k7k5j8pMJ5K2K3J6O%jjj
8194E11%LLjmLJ4K0J7QNMkj0j0%J0Qmj5j7j2pm%MLk%QJ7J6Poj2j7k1k4k4k0j4j0j0j1j3nN
$$ y = [413, 423, 424, 425, 432, 444, 459, 470, 473, 466, 453, 445, 444, 449, 457, 467, 477, 484, 491, 503, 518, 528, 528, 522, 515, 510, 504, 492, 476, 461, 449, 442, 437, 431, 424, 418, 418, 423, 431, 437, 438, 433, 418, 398, 382, 375, 373, 366, 356, 350, 352, 358, 365, 375, 387, 397, 400, 402, 410, 423, 438, 457, 481, 507, 525, 531, 531, 525, 511, 490, 468, 450, 438, 429, 422, 416, 403, 378, 344, 313, 299, 307, 330, 359, 386, 410, 434, 457, 475, 490, 505, 519, 521, 502, 467, 432, 406, 391, 387, 393, 401, 402, 397, 394, 400, 409, 419, 429, 436, 440, 441, 445, 451, 450, 432, 401, 370, 349, 344, 356, 380, 402, 410, 409, 412, 427, 450, 475, 493, 502, 498, 484, 471, 465, 463, 458, 448, 438, 434, 439, 449, 459, 464, 462, 458, 457, 462, 467, 468, 461, 450, 446, 453, 471, 492, 510, 520, 516, 497, 472, 458, 460, 474, 489, 496, 492, 479, 460, 444, 437, 436, 438, 440, 443, 449, 457, 464, 466, 458, 437, 411, 394, 392, 401, 412, 418, 418, 411, 401, 395, 393, 391, 384, 378, 385, 411, 447, 477, 492, 490, 481, 476, 477, 480, 481, 478, 470, 458, 440, 421, 408, 401, 396, 386, 377, 376, 385, 402, 420, 437, 451, 464, 481, 498, 513, 522, 531, 546, 570, 597, 614, 615, 609, 605, 610, 617, 610, 584, 550, 526, 519, 519, 511, 494, 474, 454, 434, 414, 402, 397, 397, 397, 399, 400, 394, 378, 360, 352, 359, 378, 401, 425, 446, 464, 478, 489, 492, 487, 477, 468, 464, 466, 474, 482, 485, 481, 480, 494, 519, 533, 521, 492, 467, 463, 478, 500, 516, 519, 506, 482, 459, 450, 462, 488, 518, 546, 571, 598, 620, 631, 627, 612, 594, 578, 563, 548, 529, 505, 478, 453, 435, 428, 432, 447, 469, 492, 508, 514, 514, 513, 512, 511, 511, 514, 517, 516, 512, 515, 529, 549, 566, 574, 579, 583, 581, 571, 561, 561, 571, 579, 575, 560, 543, 531, 524, 520, 520, 524, 527, 525, 525, 533, 550, 566, 573, 567, 555, 538, 517, 493, 469, 449, 435, 425, 415, 404, 391, 386, 391]
8175C91J0PMQJ3J1L%KJmj2j2qKJ1J6Qmj2j3j2j4j7j9k3k4j4J0K9K6Rj%QJ2J6J9J7QKKL%jK
8156D60QRNJmj2j8j8j1jORL%JRJ1LplOPlpPK6L4K0Jj4j9j9j5j3j1j0j0j0j3j6j6rMJ5J9J6
8138D21Qlj0j1lPJ1ROQJ2R%j1j1plpj1j0mJOJ5K7L6L2K2J1Kmj1j6j5qOJ8K0Qrj8j3JJ0J1O
8119E38jqj3j8k2k4k2j6qKJ2K0K4K7K7K6K0J1%opj1j5k1k3j9j4qkJK%%%MOOOM%qj4j6j3j1
8101D16j4j6j4j0pnJQJ5K2K6K5J8OmpnkJJJ%J%JPJ5J9J5Mll%mj1j4j0kJkproJPJ4J9K1J7R
8081E36Klqj0j0mLNJnj2j5j5j1qopj2j7j2jJ3J5J0KjjMJ6L0L3K1Mqj0j2rlRJ5J1Jpj5k4l4
8063D51l1j7KJ5K1K3K5K5K0J2Okj1k1k5j6%J1J4Rjj4k7l3l0k0j1porj6k5l1k7j4MK3L7M4L8
8047C86K4RjomLJ3J5Oj2k2j6kRNkpjQJ7J6J2QRJ1J2J2J1OJjjkjJORNJloj5k7l7l7l2k6k0j3
$$ y = [391, 401, 408, 412, 420, 433, 444, 447, 447, 449, 450, 446, 434, 422, 414, 416, 427, 443, 451, 447, 435, 422, 410, 396, 379, 360, 337, 313, 299, 309, 338, 364, 373, 372, 372, 380, 392, 408, 427, 444, 452, 454, 456, 459, 459, 458, 460, 468, 477, 482, 483, 479, 467, 449, 431, 420, 419, 425, 434, 437, 437, 438, 447, 458, 461, 454, 451, 457, 464, 461, 454, 461, 487, 521, 541, 542, 528, 509, 490, 475, 462, 451, 441, 431, 421, 408, 392, 376, 367, 371, 386, 405, 421, 429, 426, 416, 405, 402, 409, 420, 429, 435, 443, 455, 464, 464, 453, 442, 435, 432, 425, 414, 404, 400, 401, 407, 422, 449, 485, 517, 539, 550, 552, 548, 537, 521, 506, 498, 504, 522, 542, 550, 541, 523, 510, 511, 521, 532, 538, 537, 529, 516, 498, 476, 452, 430, 414, 406, 408, 420, 440, 464, 491, 518, 544, 564, 575, 575, 569, 562, 551, 536, 515, 492, 473, 459, 451, 449, 450, 452, 452, 452, 452, 456, 462, 468, 474, 478, 478, 470, 456, 440, 427, 416, 402, 386, 372, 362, 355, 350, 351, 359, 374, 396, 422, 447, 465, 471, 467, 460, 455, 453, 454, 455, 456, 456, 457, 457, 458, 465, 480, 499, 514, 518, 515, 512, 512, 508, 497, 483, 473, 471, 472, 470, 463, 454, 448, 449, 456, 470, 489, 510, 527, 536, 538, 535, 527, 517, 507, 503, 506, 511, 512, 507, 495, 480, 465, 454, 446, 440, 433, 421, 404, 392, 391, 404, 419, 429, 431, 430, 429, 433, 449, 479, 512, 533, 537, 529, 519, 507, 498, 495, 504, 519, 530, 531, 524, 509, 485, 451, 420, 403, 405, 420, 441, 464, 489, 514, 534, 546, 552, 550, 539, 518, 493, 477, 477, 488, 502, 511, 510, 496, 469, 436, 406, 386, 375, 368, 362, 353, 337, 312, 281, 254, 240, 244, 267, 304, 348, 386, 410, 419, 418, 412, 408, 411, 424, 439, 445, 433, 411, 395, 393, 402, 407, 405, 398, 397, 405, 422, 438, 450, 458, 467, 478, 490, 502, 513, 519, 520, 519, 518, 516, 515, 516, 522, 531, 536, 537, 534, 528, 513, 486, 449, 412, 380, 354, 334, 321]
8027C21kRK0L1L7M0L5K7J1pj8k0rJPLmplOJ1Qkj3j9j9j6j0l%J%LPJ6K1K4K4J8Lj8l3k9qJ7
8009D61K9K6J5OKKKMMJk%LMmj4k1k3j8oJ1K3J9Nrj3oPK1K8K7J8J3ROkj1j3nMNmk0l0k8j9j4
7990D93k0k6k2j4pmllmplLOK%PJ2Ppj9j8oNJ0NJjmj0j8k0j2qj1j8k1j3jJ2K2K4K2K3K4K4J4
7972D16Jqoklj1k0k1j0PK3L0L0K8K0RlplKNNMLJlrj8k4k1mJ4K0J4Mkklrj3j0KJ9L5M0L5K6
7953E81J1lj5k0j7j0mJMNkrj0oj0j7k0j0MJ3RJmlKONMJjlj1j7k0j8j7j5oQJ4Prj6qNJ6K3K6
7933D45K1J2LJQJ4J4Qjj0j3rKQQKnj2k0k6k8k4j7j2rojOJ2J4J2J1J2J2J0OPJ2J4Ppj5j3nK
7915D50OON%nj1j3j3j3j2j1j3j7j8j4%J7K7K4J6J0J1J1PJnj2j4j1nJPJ3J8J3nk0j9j1orj1
7898C75lRJ4J3RPPM%lJPJ0OjlLRRLmrromnppqrnQK2L0K9K9K7K1Mj2j6j0mnqj1j0pkJKJlqj6
$$ y = [321, 319, 328, 348, 379, 416, 456, 491, 518, 529, 522, 504, 484, 475, 476, 483, 486, 482, 475, 472, 478, 489, 497, 495, 482, 463, 444, 428, 418, 415, 415, 416, 416, 419, 426, 442, 463, 487, 511, 529, 532, 514, 481, 452, 444, 461, 490, 516, 531, 537, 539, 541, 543, 547, 551, 552, 550, 550, 553, 557, 553, 539, 518, 495, 477, 471, 482, 505, 524, 529, 520, 507, 501, 508, 529, 557, 584, 602, 615, 624, 630, 628, 617, 604, 599, 603, 608, 604, 584, 554, 526, 507, 493, 473, 447, 425, 411, 404, 400, 397, 394, 390, 383, 380, 383, 389, 391, 391, 398, 410, 417, 410, 391, 373, 367, 372, 382, 387, 388, 387, 383, 373, 355, 335, 323, 315, 304, 286, 265, 252, 251, 263, 285, 309, 331, 354, 378, 402, 416, 417, 409, 403, 401, 398, 387, 367, 346, 336, 343, 366, 396, 426, 454, 474, 483, 480, 473, 470, 472, 477, 482, 486, 489, 490, 487, 478, 460, 436, 415, 411, 425, 445, 459, 463, 461, 459, 456, 447, 434, 424, 426, 445, 480, 520, 555, 581, 592, 589, 574, 554, 537, 527, 523, 524, 528, 533, 531, 522, 512, 506, 496, 479, 459, 449, 453, 466, 475, 476, 472, 469, 471, 477, 482, 486, 487, 486, 483, 472, 455, 435, 417, 400, 385, 379, 387, 401, 408, 399, 383, 375, 380, 396, 419, 445, 466, 478, 481, 482, 490, 504, 518, 526, 525, 515, 502, 493, 495, 503, 511, 513, 508, 496, 476, 450, 422, 398, 381, 369, 360, 354, 353, 359, 371, 385, 397, 408, 420, 432, 442, 448, 455, 467, 481, 488, 481, 466, 453, 448, 450, 456, 462, 467, 467, 462, 451, 438, 425, 412, 400, 389, 376, 359, 341, 327, 327, 344, 371, 395, 411, 421, 432, 443, 450, 451, 446, 434, 420, 409, 404, 405, 412, 425, 443, 456, 451, 431, 412, 401, 395, 386, 375, 372, 381, 395, 408, 417, 424, 431, 435, 435, 432, 433, 440, 450, 456, 455, 452, 455, 464, 473, 476, 472, 463, 454, 448, 444, 439, 432, 425, 417, 408, 403, 411, 433, 463, 492, 521, 548, 569, 573, 561, 545, 535, 531, 526, 518, 507, 497, 490, 488, 489, 491, 492, 489, 481, 465]
7876D65j9j6rjLOPLmponmLJ1J7J1LJQJ9K4J6kj5j4mjqk5l2k4oPPjppjNJ1J5J6J7J5J4J1J0
7857E07RQRRJ2J1Nrj8j7j0jLNQJ3J3Pnj7k3k0j5j3j6j7j6j4j3j0ppj3j5rJPJ1J4J5J2RJ2K1
7839D36K7K3J1KJRJ9K0J3Kpj6k6l4l1j8lONlj3k2k2j7pmkkJPJ7K6K7J7N%NRRPONMMM%pj5j4
7820D64oJMNPNlj3j8j2jJ1J9J9J3%j0j3j4j2qlKKmrlJ0J5RLMQOpk0k6k2j2JJ4J4PJNJ2J2P
7800D64LjmpojLPJ3K0K3J7RLlpnJLoj9k4k0j2ooj1j5j3qnnm%PJ5K8M3M4K9NroLQOkj0j2rm
7780E14k%ONok5l3k8j0NJ1J4J4J7J9J5%k0l6m3l8k3kJ4J7J0MPJ3J6J4J0J3J8K6K8K4J5OOQ
7764F03Olj5k0j6qJLJmqj3k0k7k3j0MPJpo%L%mlJJlmkJLKOJ1J4J5J1%j3k1j6%J4J9K2K3K4
7744E50J8QlrrlMJ2J1Kj0j8j8j4p%lj7l0k8j1RJ4Mqj2rnnmjLKoj9k6k2qPJ9K4K4J7RNQJ3J0
$$ y = [465, 446, 430, 421, 420, 423, 429, 436, 439, 435, 428, 422, 417, 413, 416, 427, 444, 455, 458, 459, 467, 486, 510, 526, 524, 509, 495, 491, 490, 482, 457, 425, 401, 395, 402, 409, 408, 401, 394, 393, 398, 409, 424, 440, 457, 472, 486, 497, 507, 516, 524, 533, 542, 554, 565, 570, 561, 543, 526, 516, 515, 518, 523, 531, 544, 557, 564, 559, 542, 519, 499, 484, 471, 455, 438, 422, 408, 395, 385, 378, 371, 358, 343, 334, 335, 342, 353, 367, 382, 394, 403, 415, 436, 463, 486, 497, 499, 500, 509, 528, 548, 561, 563, 556, 540, 514, 480, 449, 431, 428, 434, 439, 436, 423, 401, 379, 362, 355, 351, 349, 347, 348, 355, 372, 398, 425, 442, 447, 447, 452, 461, 470, 477, 483, 488, 492, 496, 500, 500, 493, 478, 464, 458, 459, 463, 468, 475, 480, 477, 464, 446, 434, 433, 444, 463, 482, 495, 495, 485, 472, 458, 446, 438, 435, 437, 439, 435, 426, 423, 433, 448, 457, 460, 464, 472, 478, 471, 451, 425, 403, 391, 392, 406, 420, 427, 428, 433, 445, 457, 464, 467, 466, 462, 455, 449, 448, 451, 458, 471, 491, 514, 531, 540, 543, 540, 533, 528, 529, 532, 526, 507, 483, 463, 451, 445, 439, 428, 413, 400, 392, 387, 382, 378, 378, 385, 400, 428, 471, 515, 544, 549, 540, 534, 537, 545, 551, 549, 539, 527, 518, 514, 512, 512, 518, 523, 517, 492, 459, 431, 421, 426, 437, 451, 465, 482, 501, 516, 516, 496, 460, 417, 379, 356, 354, 368, 385, 395, 399, 406, 419, 435, 449, 459, 472, 490, 516, 544, 568, 583, 589, 595, 603, 609, 606, 591, 571, 555, 547, 548, 551, 552, 548, 540, 527, 507, 480, 457, 447, 451, 458, 459, 452, 446, 446, 449, 449, 445, 442, 443, 444, 441, 437, 435, 436, 439, 441, 447, 458, 472, 487, 498, 498, 485, 464, 448, 448, 462, 481, 503, 526, 550, 568, 576, 573, 564, 555, 552, 556, 568, 579, 581, 571, 553, 535, 521, 514, 514, 511, 494, 464, 436, 425, 434, 448, 452, 444, 432, 423, 418, 413, 409, 408, 411, 413, 407, 388, 362, 340, 332, 339, 358, 382, 406, 423, 432, 437, 445, 458, 468]
7725D68kj8k5k0j1noplMJ4K2K6K6K1J5Lrj8j7oKNKK%oj2j6j5j3j0kORPMOJ1J4J5J3Nnj5j8
7706D41j4olnmLJ2J7Nj0j8j1KJ1J3J3QNNNJj0j6j4qoj2j5j5j0ojLNOPMnj5j8rJLmqmPJ7K1
7686C68J1pk3k2pQJ2QPJ4K6K7J7MnjPJ3J7J5Rjj1j9j8j3okjoj4j8j5kQJ1Njllqj7k3k5j8p
7668B91NJ9L1L8L4K1Nk%QJ3J1MjKJ0J6J6J3J5J7J2L%jnj3j5j2m%JLKnj7k6l3l2k1%K0K3J2
7650D58mqjQJ2J2QPJ1J9K5K4J4Lprj2j9k9l1k0kPNjlKOPJpj3j1jRJ5J8J8J3Pkj3k1k5k1j6
7632D33j5k2k4j7nK%nrj6k0j6kJ5K7L7M5M7L5J3nqMJ7K2J3mk0k7k2j3%J5K8L4K8J9Qkqj3j4
7615E55j5j1%J8K7J8jj0nJpk1k7k2r%ORNlrrmlqj7k1j5lJ1J8J4NjLQRKqj8k1j9j5j1qjJ1K4
7596D22L5L6K8J6QLLJMQJ0Lj2k5k7k1pPJ4J2%j2j2kJ0J6J9K1K2J2jj5k1k2j6jJ1J4Npj1j0
$$ y = [468, 466, 448, 423, 403, 392, 387, 381, 374, 371, 375, 389, 411, 437, 463, 484, 499, 502, 493, 475, 458, 452, 454, 459, 461, 463, 463, 457, 445, 429, 414, 401, 391, 389, 395, 404, 411, 415, 421, 432, 446, 461, 474, 479, 474, 459, 441, 427, 421, 418, 413, 409, 412, 424, 441, 446, 436, 418, 407, 409, 420, 433, 446, 454, 459, 464, 469, 470, 460, 444, 430, 422, 416, 404, 389, 374, 364, 358, 357, 360, 365, 371, 378, 382, 377, 362, 344, 335, 336, 339, 335, 327, 323, 330, 347, 368, 379, 372, 349, 327, 320, 328, 340, 348, 355, 369, 395, 422, 439, 443, 438, 437, 444, 457, 474, 489, 498, 497, 486, 467, 449, 436, 430, 428, 427, 421, 407, 389, 374, 372, 380, 391, 396, 395, 392, 389, 381, 364, 341, 316, 298, 291, 296, 315, 346, 384, 418, 439, 444, 442, 442, 450, 463, 474, 478, 477, 479, 489, 505, 521, 534, 549, 566, 578, 581, 581, 580, 575, 562, 547, 535, 531, 531, 532, 535, 537, 532, 515, 489, 456, 424, 403, 403, 423, 446, 458, 454, 446, 445, 453, 465, 477, 485, 492, 503, 522, 547, 571, 585, 588, 581, 572, 560, 541, 512, 481, 461, 459, 466, 471, 470, 467, 469, 475, 482, 483, 476, 463, 452, 451, 460, 475, 493, 511, 524, 531, 529, 516, 495, 470, 449, 433, 418, 396, 372, 355, 350, 352, 352, 347, 338, 322, 302, 286, 284, 299, 326, 363, 408, 455, 490, 503, 498, 490, 494, 511, 533, 546, 542, 522, 495, 473, 460, 460, 475, 503, 537, 565, 584, 592, 590, 582, 569, 555, 540, 529, 529, 547, 574, 592, 591, 581, 576, 577, 570, 549, 522, 500, 491, 491, 497, 506, 511, 508, 499, 490, 486, 483, 475, 458, 437, 422, 419, 430, 448, 462, 467, 466, 469, 477, 486, 488, 480, 462, 441, 422, 407, 396, 388, 387, 398, 422, 457, 493, 521, 537, 545, 548, 551, 552, 556, 564, 574, 577, 565, 540, 513, 492, 485, 492, 506, 518, 518, 506, 494, 492, 502, 518, 537, 558, 580, 592, 591, 576, 555, 533, 517, 516, 527, 541, 546, 539, 528, 518]
7579E18mNJ5J9J4PKkonjNKnj1j0j2j6k1j8pQJ9J9J4J0J2J7K4K8K7J7Lj1k1k7l2k7j2PJ5J3
7562E72QQLorn%pk4l2k6j3pqj1rmkk%PJ5J6J0Jpj1rLJ7K2J4Kljmj3k1k2j4jJ1J4J1LmqrlQ
7542D50J7J5N%lnrj1ojNJ0J2Q%rj1j0polKPJ0J3J3J5J3J1N%knj0j7j9j8j1nlnj1j2lJ0J7J4
7523D50J1RKqj6j7j6k0k5k3j3%RJ5J6J5J6J7J7J0kj0j2j1ojMPMmj3j5j0jOQJ2J9K5J8%j6k0
7506D31j1jRJ6K1J9J2Kj1k4l2l4l0k6k1j5lJ2K5K8K4J3Lpj1j1pmoj0qLJ3J3KomOJ2J3QORJ4
7488D32J7J1OJjnj0j3j2j1j3j4j0qnkOJ6J9J1nj8k4k0oJ3K7L1K6K2K0J9J5Pkrj1nOJ6J9J2
7471E48Ll%ORLnmQK0K1Nj6l0l0k0j0j0j3j0mJKLNKnj5k0k3j9oJ0J9K0J6J5J2Jj1j7j5j3j0
7454D20pLJ1RJj3k0j4jJ1J2PL%noMJ8K7K9K4J1pk4k6j6ojJOPlj8k3j9j2mMJ0Mj0k6k8j9%J6
$$ y = [518, 514, 519, 534, 553, 567, 574, 576, 574, 568, 563, 562, 567, 569, 564, 553, 543, 531, 515, 494, 476, 469, 477, 496, 515, 529, 539, 551, 568, 592, 620, 647, 664, 667, 656, 635, 608, 576, 549, 537, 544, 559, 572, 580, 588, 591, 585, 576, 571, 571, 564, 540, 508, 482, 469, 462, 454, 443, 434, 430, 428, 426, 426, 433, 448, 464, 474, 475, 468, 457, 448, 451, 468, 490, 504, 506, 503, 502, 498, 485, 464, 442, 428, 427, 438, 452, 463, 466, 462, 454, 445, 442, 450, 467, 482, 487, 487, 484, 479, 470, 459, 453, 452, 457, 467, 479, 487, 487, 478, 467, 457, 450, 444, 441, 443, 450, 460, 473, 486, 501, 514, 525, 530, 530, 528, 523, 513, 496, 477, 459, 448, 443, 440, 435, 424, 412, 409, 419, 436, 450, 461, 470, 472, 464, 448, 431, 415, 395, 370, 347, 334, 334, 343, 358, 374, 389, 405, 422, 439, 449, 447, 437, 425, 414, 408, 407, 411, 418, 422, 418, 405, 390, 380, 379, 385, 393, 405, 424, 449, 467, 467, 451, 431, 420, 419, 428, 444, 465, 484, 496, 498, 487, 463, 431, 397, 367, 341, 320, 305, 302, 314, 339, 367, 391, 404, 407, 400, 389, 378, 371, 367, 361, 351, 343, 346, 359, 372, 374, 368, 364, 370, 382, 395, 403, 409, 418, 432, 449, 460, 466, 467, 466, 461, 451, 438, 426, 415, 402, 388, 378, 370, 365, 363, 369, 385, 404, 415, 410, 392, 368, 348, 342, 355, 382, 413, 439, 461, 481, 500, 515, 522, 520, 511, 500, 495, 501, 517, 536, 548, 551, 548, 548, 554, 563, 566, 561, 557, 565, 585, 606, 611, 595, 565, 535, 515, 505, 495, 482, 472, 468, 469, 471, 474, 479, 481, 476, 461, 441, 418, 399, 393, 403, 422, 442, 458, 473, 485, 486, 475, 458, 443, 430, 420, 413, 416, 427, 436, 437, 424, 404, 390, 389, 400, 412, 419, 422, 422, 417, 411, 415, 433, 460, 489, 513, 524, 517, 493, 467, 451, 445, 444, 445, 451, 458, 455, 437, 414, 395, 383, 379, 383, 393, 397, 387, 361, 333, 314, 314, 330]
7435C30K4K0J1RJ1J5J2Lmrj0nLJ4J8J8J3RQQPOMJjllnj1j5j3olml%MM%lmrj5j7pPJ8J9J6J1
7415D73RROjpp%RJ3J3J0ROLkj0j9k5k4j7rqj0j5k5l2l5k9k0rKJ6K9L2K5J3NMOONLPJ3J8J4
7397D54jj8k9k9j7nNNKLQJ3J3OOJ8K9L0J5nk0k5j9oNJ1J0Lmj3k1k0j3nkjkmrpLJ8K8K4J5N
7378D54%LJ0J9K3J8Kj2j9j5romLJ3J5Qpj5j5nLNNKJlj0j9k1j8j9k0j4MK2K6K0J1OJlmpqj0
7360D11oj%knoqj1oPJ7J6LljMNLNJ0J0Noj4j8j4mJ0K0J6Mqj5j4rjOPmk0k2j1NJ5K2L7N2N6
7340E37M5L4K8K3Pj0j5pKQJ3J9K2J2mk1l3m2m3l8k5j7j6k0j6oRK0K6L0K8J4%rolrj9k6k8k5
7324D39j6pjnj4j3OK7L3K1Kj0j2lRJ8J8J3PNNLnj6k4k8k7k2j7r%QJ0QOOQOJqj7k0j2jNL%o
7305C74rj2rkMQJ3J7K0J9J2NKMJ0J7K2K2J5Kj0j6j8j9k2k6k6k2j8j6j3rjNRJ4J8J7J3PMKJ
$$ y = [330, 354, 374, 385, 394, 405, 420, 432, 435, 431, 422, 412, 407, 410, 424, 442, 460, 473, 482, 490, 498, 505, 511, 515, 516, 515, 512, 509, 504, 493, 478, 465, 459, 456, 452, 449, 449, 453, 457, 457, 454, 450, 441, 426, 409, 402, 409, 427, 446, 462, 473, 482, 491, 497, 496, 489, 482, 482, 491, 504, 517, 527, 536, 542, 545, 543, 533, 514, 489, 465, 448, 439, 431, 421, 406, 381, 349, 314, 285, 265, 256, 258, 274, 303, 335, 360, 373, 378, 382, 388, 394, 399, 402, 409, 422, 440, 454, 453, 435, 406, 377, 360, 355, 360, 365, 367, 370, 378, 391, 404, 410, 416, 434, 463, 493, 508, 503, 483, 458, 439, 433, 438, 449, 459, 462, 458, 445, 424, 404, 391, 386, 384, 383, 381, 377, 368, 361, 364, 382, 410, 434, 449, 454, 454, 457, 467, 486, 509, 527, 529, 517, 498, 483, 474, 468, 464, 467, 480, 495, 503, 496, 481, 466, 461, 464, 469, 474, 476, 477, 474, 464, 445, 424, 406, 387, 367, 353, 357, 379, 405, 425, 436, 442, 443, 440, 436, 429, 421, 411, 405, 404, 404, 402, 397, 391, 383, 372, 366, 373, 390, 406, 409, 406, 405, 409, 414, 417, 422, 432, 442, 447, 441, 427, 409, 395, 391, 401, 421, 437, 441, 433, 418, 404, 395, 394, 400, 407, 403, 383, 361, 350, 355, 370, 392, 429, 481, 537, 582, 616, 644, 667, 674, 664, 649, 642, 644, 652, 665, 684, 706, 718, 714, 693, 660, 618, 575, 537, 512, 495, 479, 459, 443, 437, 446, 466, 492, 522, 550, 564, 564, 555, 549, 546, 537, 518, 492, 464, 439, 423, 416, 415, 410, 396, 383, 389, 416, 449, 470, 472, 462, 450, 447, 456, 474, 492, 505, 512, 517, 522, 525, 520, 504, 480, 452, 425, 403, 386, 377, 377, 385, 395, 403, 409, 415, 423, 429, 430, 422, 405, 385, 373, 372, 377, 380, 380, 374, 365, 353, 344, 342, 346, 354, 367, 384, 404, 423, 435, 440, 442, 446, 456, 473, 495, 517, 532, 534, 524, 508, 490, 471, 449, 423, 397, 375, 357, 341, 328, 319, 318, 323, 332, 346, 364, 381, 394, 401, 405, 407, 408]
7287D08kmKJ0J7K2K8L5L4K0lk0k4k0j7j2p%NLjnjRJ6J5Qjqj3j4j2pkjKLLK%nrj4j6j6k0k3
7268C65k0j1lLPJ2J7J6J4J8K2K5K0J1Klk%OJ2J7J9J3Kqj3j7k0j9j7j3r%J7L0L0J9RNQRMj1
7251E66k8l9m0l0j6KK0K9K5K1K5L1K5Nj4k7l9m6m1k2jJ0RPNMMKnj3j5pNJ2J3J1J3J1OjlLJ1
7234D88J3PjJPRNkqj0j2j5j5j2j0nl%JKRJ5J6J1Jj0k0k6k6j6KK0K5J5%j1j5j5j3kJ2J7Qmj1
7216D22j3j6j9j1KJ4J9K1K5K6K1J0lj2j6j0nmmMK1L3L0Pk2m0m1k7j6j4j4pLJ0QJpj3j6qNJ5
7199C59J6J1PQJ3J8J7Pqj4qNJ2J2MmokMLjkJJqj9k2j6p%%lnoj0j3rNK2K6J9J4J9L0L3K4J4
7180E41POLmj2j4j1j3k4l7l6k1lPPOLlj0j4j4j5j2lJ0J5J4J1QLjj%KMOQOQJ9L1L0J6NOJ2J0
7161E56KJLmk1l3k8j1kkqj1j0pjJ0K1K7K8K4J4lj7k4k7l0l1j9MJ8J6LkMJ3J6Nj0k3k5j7qj
$$ y = [408, 406, 402, 404, 414, 431, 453, 481, 516, 550, 570, 567, 547, 523, 503, 486, 474, 467, 467, 472, 475, 474, 469, 468, 477, 493, 508, 516, 515, 507, 494, 480, 468, 461, 459, 458, 460, 463, 466, 468, 468, 463, 454, 440, 424, 408, 388, 365, 345, 334, 331, 334, 341, 353, 370, 386, 400, 418, 440, 465, 485, 496, 498, 495, 493, 493, 499, 511, 528, 547, 560, 562, 554, 541, 524, 504, 485, 468, 455, 446, 446, 463, 493, 523, 542, 551, 556, 564, 573, 577, 566, 538, 499, 459, 429, 413, 415, 435, 464, 489, 510, 535, 566, 591, 596, 582, 555, 516, 470, 429, 407, 406, 416, 425, 432, 437, 441, 445, 447, 442, 429, 414, 407, 412, 424, 437, 448, 461, 472, 478, 477, 474, 477, 488, 501, 508, 507, 508, 515, 524, 529, 527, 519, 509, 497, 482, 467, 455, 445, 440, 437, 437, 438, 440, 449, 464, 480, 491, 492, 482, 462, 436, 410, 394, 396, 416, 441, 456, 456, 445, 430, 415, 402, 400, 412, 429, 437, 433, 422, 409, 393, 374, 363, 365, 379, 398, 419, 444, 470, 491, 501, 498, 486, 470, 460, 455, 451, 447, 451, 472, 505, 535, 542, 520, 480, 439, 412, 396, 382, 368, 361, 364, 374, 382, 383, 376, 363, 347, 339, 344, 359, 375, 386, 393, 401, 414, 432, 449, 456, 448, 434, 426, 431, 443, 455, 459, 455, 449, 447, 451, 454, 453, 451, 452, 453, 445, 426, 404, 388, 381, 381, 381, 378, 373, 367, 357, 344, 335, 340, 362, 388, 407, 421, 440, 470, 503, 527, 541, 548, 554, 557, 553, 541, 527, 516, 503, 479, 442, 406, 385, 382, 389, 396, 402, 405, 402, 392, 378, 364, 349, 337, 334, 344, 359, 373, 384, 392, 395, 394, 393, 393, 395, 399, 405, 413, 419, 427, 446, 477, 507, 523, 528, 534, 546, 556, 558, 559, 562, 558, 537, 504, 476, 465, 463, 461, 453, 442, 432, 425, 424, 434, 455, 482, 510, 534, 548, 545, 528, 504, 477, 447, 416, 397, 401, 419, 435, 438, 436, 440, 453, 469, 474, 464, 441, 416, 399, 391, 390]
7144C90NJ5K5K8K2J5J1RMjmpo%RJ7K2K3J9J0%lJLKjlpj4k1k7l0k7j4QK3K3J1Kmj2j9k3k2k1
7126D31k4k7k9k4j1OJ8K0J5J3J9K0J1mj6j8j1kNNJJJ0K4L3L1J9LrqKJ3J6J1Jj1k1k6j6%J0
7109D81J1RJ2J5J3Nll%JJjllLJ0J1Moj1j1j0j4k0k3k2j7oNJ3J6J5J2Moj2qKJ4J5QKKONnj6
7091D95j6lJ2J7J0Jrj3j6j9k0k0j8j4pLQJ1J2J2J4J0KmlJMOJ0J6K0J5lk0k5j2NJ6J7J5J6J1
7074E37nk2k7j8j4k3l3l0j1J1K3K7K4J6OKOJ4J7J0lj1qJPMJMN%pj0j1j3j4j2mOJ7K9L7L2J7
7056E77Njnj1j6j9k5l3l4k1oKLPRO%KJ1J1%rj2j2j8k5k3j2lkJRK1K9K9K1PmpjOMjjOJ3J5J2
7037E05Q%j3k5k9j9njJMJ3J6J1%nqokJKJlmlmnm%NOKklJOJ0QPPMjkJOPNKJknj0j1j0j0pKJ2
7014D55K1J9J0kpnJMKknpo%J1J7J6OjLJ2J8J2LookMQQOMMKlj0k0k5k7k0pNQQJ1J6J2lk1k6
$$ y = [390, 395, 410, 435, 463, 485, 500, 511, 520, 524, 523, 519, 512, 506, 506, 515, 532, 554, 577, 596, 606, 606, 603, 604, 607, 609, 608, 605, 598, 584, 563, 536, 506, 479, 465, 473, 496, 519, 530, 532, 528, 516, 497, 474, 452, 431, 407, 380, 351, 327, 316, 322, 340, 360, 375, 388, 407, 427, 438, 434, 418, 400, 389, 387, 392, 397, 398, 399, 409, 433, 466, 497, 516, 519, 510, 502, 504, 517, 533, 544, 545, 534, 513, 487, 471, 471, 481, 492, 501, 513, 528, 541, 546, 543, 540, 540, 541, 542, 541, 538, 535, 538, 548, 559, 563, 557, 546, 535, 525, 511, 491, 468, 446, 429, 423, 428, 441, 457, 472, 484, 488, 482, 470, 462, 464, 478, 493, 501, 503, 505, 511, 516, 511, 495, 479, 476, 488, 505, 515, 516, 507, 494, 478, 459, 439, 419, 401, 387, 380, 383, 391, 402, 414, 426, 440, 450, 452, 448, 445, 446, 450, 456, 466, 482, 502, 517, 514, 494, 469, 457, 462, 478, 495, 510, 526, 537, 532, 510, 483, 465, 451, 428, 395, 365, 354, 365, 388, 415, 439, 455, 461, 463, 469, 483, 500, 510, 507, 496, 488, 489, 496, 500, 501, 505, 510, 510, 503, 493, 482, 469, 455, 443, 439, 445, 462, 491, 528, 560, 577, 582, 581, 576, 565, 549, 530, 505, 472, 438, 417, 411, 413, 416, 423, 432, 438, 438, 440, 451, 462, 462, 453, 441, 429, 411, 386, 363, 351, 348, 346, 347, 356, 377, 406, 435, 456, 463, 459, 452, 451, 457, 461, 460, 459, 465, 478, 493, 505, 513, 513, 500, 475, 446, 427, 422, 421, 422, 426, 439, 455, 466, 466, 461, 453, 447, 445, 446, 448, 449, 446, 442, 439, 435, 430, 426, 426, 431, 437, 439, 437, 434, 435, 441, 451, 459, 466, 473, 477, 476, 474, 475, 481, 488, 493, 495, 496, 494, 489, 479, 468, 458, 448, 441, 443, 455, 476, 495, 505, 503, 496, 491, 492, 496, 498, 496, 491, 484, 478, 478, 489, 506, 522, 528, 527, 530, 542, 560, 572, 575, 569, 563, 561, 565, 573, 581, 587, 591, 595, 597, 594, 584, 564, 539, 512, 492, 485, 490, 498, 506, 517, 533, 545, 542, 521, 495]
6994D95j7olprqonpj2j6j7j3ojKNOPJ1K3L8M6L8K3RKlj3k1k0j5j4j8k1j5oloqm%%opjQJ1J1
6974D21QRJ3J3RPNJj0k3k7k2j6qjNOKj%LNPPLpj0kPQNRJ2Pnj2j0j0k0k8k4r%lj2j3pMJ3J8
6954C27J6J0NJLJ0J4J5J2J2J1Noj2pMJ1RKqj6k0j3kLMJ0K2L0J9mk2k3j0JMklPJ8K4K4K6K9
6937E40K7J6QJlpq%J0Qlj4j7j1pqj4j9j9j4pLJ4K0J9J2Lkpqppj4k7l7l6k2oOJ4J6J1mj6k0
6919C64j3KJ9K6K2J2LJjprlNNrk4k7j4KJ3J7J7J8J6J0LlonJQRQLLOJ1J3J0MJLQRNlj1k2l2
6899D68l3k5j4qmJJ1J8J5MnmKLK%KLmj3j8j3ppqrmJNNNNQJ0J1POJ0K2L6M0L4J9Mmj2k0k9l2
6879D84k8k0j6j2mQJ3J1LmnmmnojMJ1J2RLllLQKj4k0rJ0K1J9J8K3L2L4L3K6J5jj7k5j8p%l
6861E73j2k1k7l2l6k8rQJ4J5K3M0M5L5J7Mnj3k2k5k0j2JJ3J6Kj8l4l5k8j5nkqj4j2onj0j0
$$ y = [495, 478, 472, 469, 462, 453, 445, 439, 434, 427, 415, 399, 382, 369, 363, 362, 364, 369, 375, 382, 393, 416, 454, 500, 538, 561, 570, 572, 569, 556, 535, 515, 500, 486, 468, 447, 432, 426, 423, 417, 409, 405, 405, 405, 399, 392, 391, 399, 410, 421, 429, 438, 451, 464, 473, 480, 485, 486, 476, 453, 426, 404, 388, 380, 379, 384, 390, 392, 391, 391, 394, 399, 406, 413, 416, 409, 399, 397, 404, 412, 417, 426, 438, 445, 440, 428, 418, 408, 388, 360, 336, 327, 327, 324, 312, 299, 292, 296, 309, 327, 343, 353, 358, 359, 362, 372, 386, 401, 413, 425, 436, 441, 435, 423, 416, 420, 431, 440, 442, 434, 418, 398, 385, 383, 386, 390, 400, 422, 452, 471, 467, 445, 422, 412, 413, 417, 415, 412, 419, 437, 461, 485, 511, 540, 567, 583, 591, 592, 589, 582, 574, 574, 584, 592, 589, 575, 558, 547, 540, 532, 518, 499, 480, 466, 459, 462, 476, 496, 515, 527, 530, 528, 521, 513, 506, 499, 485, 458, 421, 385, 363, 357, 363, 377, 393, 404, 400, 384, 364, 351, 353, 372, 398, 420, 432, 435, 436, 435, 428, 419, 416, 421, 426, 417, 393, 366, 352, 354, 367, 384, 401, 419, 435, 445, 448, 445, 439, 434, 435, 443, 452, 460, 463, 466, 472, 483, 496, 506, 510, 511, 514, 522, 531, 536, 533, 522, 500, 468, 435, 410, 396, 388, 384, 385, 396, 414, 429, 433, 428, 424, 426, 429, 431, 431, 433, 436, 432, 419, 401, 388, 381, 374, 366, 357, 353, 354, 359, 364, 369, 374, 382, 392, 403, 410, 416, 426, 448, 484, 524, 558, 577, 581, 577, 565, 545, 516, 484, 456, 436, 420, 408, 404, 412, 425, 436, 439, 435, 430, 426, 422, 417, 411, 410, 414, 425, 437, 446, 449, 446, 443, 446, 454, 456, 442, 422, 413, 423, 444, 463, 481, 504, 536, 570, 603, 629, 644, 643, 626, 601, 583, 576, 576, 573, 561, 540, 513, 481, 445, 417, 408, 416, 430, 445, 468, 508, 553, 588, 605, 609, 604, 591, 569, 544, 524, 512, 513, 526, 542, 544, 526, 492, 457, 429, 414, 409, 407, 399, 385, 373, 367, 362, 352, 342]
6845C42kKjnn%NRJ2J4QJjk%MQQjj0oPJ9J6Mj0j8k2j9pQJ8J8J5J3J4J3Pnj6k5k4j6qpj1j0%
6826C34J1J5J2J3J6J5R%nj1j5j6j4j0nkKOJ0J0J1PLkmlJQJ3J0LLQJ4J1M%jpj9k4j9lJ3K4K6
6807D52K1J5J6K5L3L0J6Lj1l0n0n4l8j0J7L5M1L1J5kqolLJ2J9J3Jqqnoj0j2j7k4k9k6j5mM
6791D26ONJKJ0J9K0J1jj2k2k6j9lJ3K0J8J4J0OMRJ6J8QmrmLMjllmrj3j2kQRnk2k7j5OK0K2
6772D92J8J6J1jj3k0j5mJ2K4K6K0J1Kpj9k6k5j7j2j2j5j2LK6M6N1M0J9%j6k6k7k2j3nlKLK
6756E14%JLNLKKJjjPJ7J9Qj1k8l0k1oPJ7K1J9Oj0j9k6l1l4k6pPJ4J9K4K7J9Pmj0j3j0JJ1J1
6738E04jj3j8j6j0kKJmnqj0j2j0nJPJ5K2K0J5J5K5L0K5J4Kj0k1k7k5j7j3j2mQJ7J4Krj0KJ7
6720D96K3J9J5J4J1Kj2j4pRK0K5J9RKkpj7k9l0j8nJJJJlj4k5k5j4kJlj0j6k0k1j9j1JJ1J5
$$ y = [342, 340, 342, 341, 336, 331, 331, 336, 345, 357, 371, 379, 380, 379, 377, 377, 381, 389, 397, 396, 386, 380, 387, 406, 422, 426, 416, 398, 376, 357, 350, 358, 376, 394, 409, 422, 436, 449, 456, 451, 435, 410, 386, 370, 362, 355, 344, 334, 334, 345, 360, 372, 385, 401, 416, 425, 425, 420, 409, 394, 378, 364, 354, 349, 347, 349, 355, 365, 375, 386, 393, 396, 394, 390, 387, 388, 396, 409, 419, 422, 425, 433, 447, 458, 462, 462, 461, 454, 435, 411, 392, 389, 402, 426, 452, 473, 488, 504, 529, 562, 592, 608, 611, 600, 570, 520, 466, 428, 418, 435, 470, 511, 542, 557, 555, 547, 541, 538, 541, 553, 572, 585, 586, 578, 570, 565, 559, 549, 537, 520, 496, 467, 441, 426, 422, 426, 432, 437, 438, 440, 450, 469, 489, 500, 499, 487, 465, 439, 420, 417, 430, 450, 468, 482, 492, 498, 502, 511, 527, 545, 553, 549, 540, 536, 539, 543, 542, 539, 536, 532, 523, 510, 498, 496, 504, 513, 508, 486, 459, 444, 450, 470, 492, 510, 526, 537, 536, 523, 503, 488, 484, 496, 520, 546, 566, 577, 579, 572, 553, 527, 502, 485, 473, 461, 446, 434, 437, 463, 509, 560, 600, 619, 619, 603, 577, 550, 528, 515, 510, 507, 509, 512, 514, 514, 515, 518, 523, 526, 528, 530, 531, 530, 529, 536, 553, 572, 580, 569, 541, 511, 490, 484, 491, 508, 529, 548, 554, 544, 525, 499, 468, 434, 408, 401, 408, 422, 441, 465, 492, 511, 518, 514, 504, 491, 481, 482, 493, 504, 503, 490, 472, 456, 446, 444, 446, 447, 443, 438, 430, 420, 408, 398, 393, 394, 401, 416, 438, 458, 473, 488, 513, 543, 568, 582, 584, 574, 553, 526, 501, 484, 471, 459, 455, 463, 480, 494, 496, 487, 477, 479, 496, 519, 538, 553, 567, 578, 580, 568, 554, 547, 556, 576, 601, 620, 629, 631, 629, 622, 605, 576, 546, 528, 523, 524, 525, 526, 527, 524, 510, 485, 460, 446, 444, 445, 442, 432, 416, 396, 375, 356, 345, 346, 357, 372]
6703C72J6J6J8J9J6Nqj7j6pKMOJ0J2Nj1k3k2j3pqj0rnljOJ6K5K4J3%qnJPJ4K2K8K2Nj2j7q
6685D74PJ4J2Mpj1qKJ2J7J5Qpk4m0m6m0k6j0MJ9L3M0L4K0MmqpmjJJ%LJ0J9K4K0Rlj1j4j5j8
6667E02k3k8l3l3k7j7mJ2K8M1M7M3L3K3Qpk0k3k1k1k1j5njkkKPOOJ1J9K4K2J6RMjoj1j0pk
6650E23lqj2j6j9k0j4rrj6j9j2MJ3J5J2QN%nj1j4j2qpqnJQPLJNJ2J8K0J7J4RQNmj1j8k1k1
6631D06j6oQJ7J7J5J3J0Okj6l1l4k3mNLoqkRJ8K4K6K0J0kqrnlk%ORJ0N%qj7k5k3j5nOJ4J7
6612D04J0oj6j6j4j2j4j3oJQJ4J6J8K0K5K9K8J9%k3l8l4j6MJ3J6J7J6J1NMMPRQKj3k5k7k1
6596D14j8k1k1j4jQQJj2k3k3j0J0K5L1L0K4J3LlJJ0J8K0J6J0LlnlPJ5J9J9J6J2%j3k3k5k1
6579D94j6j0nnnkRJ8K0J7J3J2J0Okj4k3k3j5pjJLNMKJLKmqj1j1oNJ3J5J4J4J7J1lj2j0jNM
$$ y = [372, 388, 404, 422, 441, 457, 462, 454, 437, 421, 414, 416, 420, 426, 436, 448, 453, 442, 419, 397, 384, 377, 369, 359, 350, 345, 342, 341, 347, 363, 388, 412, 425, 425, 417, 412, 413, 420, 434, 456, 484, 506, 511, 499, 482, 474, 481, 495, 507, 511, 504, 493, 485, 487, 499, 516, 531, 539, 532, 508, 468, 422, 382, 356, 346, 350, 369, 402, 442, 476, 496, 500, 496, 488, 481, 477, 476, 477, 478, 478, 481, 491, 510, 534, 554, 563, 560, 549, 535, 520, 502, 479, 451, 418, 385, 358, 341, 337, 349, 377, 418, 465, 508, 541, 564, 572, 565, 545, 522, 501, 480, 459, 444, 439, 438, 436, 434, 436, 443, 449, 455, 466, 485, 509, 531, 547, 556, 560, 559, 553, 542, 532, 525, 523, 520, 512, 500, 484, 465, 445, 431, 422, 413, 397, 378, 366, 370, 383, 398, 410, 418, 423, 423, 418, 407, 393, 381, 373, 366, 358, 353, 354, 362, 369, 372, 373, 378, 390, 408, 428, 445, 459, 468, 476, 481, 477, 466, 448, 427, 406, 390, 384, 392, 409, 426, 441, 454, 464, 470, 468, 452, 421, 387, 364, 360, 365, 368, 362, 354, 352, 361, 379, 403, 429, 449, 459, 457, 449, 440, 435, 432, 430, 430, 436, 445, 455, 460, 460, 452, 435, 410, 387, 372, 367, 373, 387, 404, 414, 408, 392, 376, 362, 350, 336, 323, 317, 318, 326, 340, 356, 374, 394, 419, 448, 476, 495, 495, 472, 434, 400, 384, 388, 401, 417, 434, 450, 461, 466, 470, 474, 481, 490, 498, 500, 487, 462, 435, 414, 396, 375, 354, 340, 339, 347, 355, 356, 344, 321, 298, 288, 298, 323, 354, 384, 408, 421, 424, 421, 422, 432, 450, 470, 486, 496, 499, 496, 491, 488, 495, 510, 529, 548, 564, 576, 576, 563, 540, 515, 494, 478, 468, 463, 458, 453, 451, 460, 478, 498, 515, 528, 540, 550, 556, 554, 540, 517, 494, 479, 472, 471, 472, 475, 480, 484, 486, 487, 490, 492, 488, 480, 469, 458, 452, 457, 470, 485, 499, 513, 530, 541, 538, 526, 516, 515, 520, 524]
6560E24J%j%PJ8K4K4K1J4Jj4k2j8nMPPLqk3l5l2j8JJ6K0J4Mjjj%LRJ5J4J0%j3k6k5j1PJ9J5
6542E48Lj1k3k4j3jPNL%qk4l5l3j8kQJ3J3RKmmm%LNPNLKK%JPJ8K4K3J3NLLLjlkKNLpk2l7l9
6521D33k9j2%PRO%nnkmj0j0kJ1J4Onj1p%RJ1P%qrkPJ4J5J4J2J1QNnj4k0k0j6j3j2j1j3j7k4
6502C13k4j5KK0K9K7K0K1K7L0J8pl0k9rJ7L5L5K6J1Kloj1j8k0j3jRJ3J1PLKMM%nnnpj3j8j7
6484D30rjOJ6K6L1K7J9J4J3J2J3J3J3QKJQJ5J3Jj2k2k9k9j6kQMnj1j3j3rm%lj1j8k1k3k7l3
6467C82l3k7j4KJ6K8L4L3K3Rj0j9j8qLOMMKJKOJ2J3OMQJ4J1%j2k0k1k2k2j9j2lORJ2J5J8J7
6449D40Mj3k3k2j4jRJ5J8K0K0J5QKLMKnpkjnj2j4j0nKQJ1Pkrj0mMJ1J3P%mqrqn%LLMLPJ5K6
6428D91K8J4pj7j3njjoj0j2oLP%qj0mMJ2J9K2J8J6J6K0K1J6Q%rj3j0lOQNmj8k5k1nMKno%j
$$ y = [524, 525, 525, 524, 524, 531, 549, 573, 597, 618, 632, 633, 619, 597, 579, 574, 578, 585, 592, 595, 587, 564, 529, 497, 479, 480, 496, 516, 530, 534, 533, 532, 531, 531, 534, 543, 558, 572, 582, 582, 569, 543, 518, 507, 514, 533, 548, 551, 540, 517, 493, 480, 479, 486, 491, 494, 494, 486, 462, 427, 394, 376, 374, 382, 395, 408, 417, 419, 415, 411, 407, 407, 410, 415, 422, 427, 430, 432, 434, 434, 435, 442, 460, 484, 507, 520, 525, 528, 531, 534, 533, 530, 528, 530, 535, 538, 531, 509, 472, 433, 404, 392, 392, 399, 408, 414, 414, 409, 404, 402, 398, 388, 378, 376, 387, 401, 407, 402, 391, 384, 384, 393, 404, 411, 411, 403, 394, 392, 399, 413, 428, 442, 454, 465, 473, 478, 473, 459, 439, 419, 403, 390, 378, 367, 354, 337, 313, 289, 274, 276, 296, 325, 352, 372, 393, 420, 450, 468, 461, 431, 402, 393, 410, 445, 480, 506, 517, 519, 516, 510, 499, 481, 461, 448, 447, 456, 469, 480, 487, 490, 492, 496, 500, 500, 495, 490, 485, 478, 465, 447, 430, 421, 420, 426, 442, 468, 499, 526, 545, 559, 572, 584, 597, 610, 623, 631, 633, 634, 642, 657, 670, 671, 659, 637, 608, 579, 563, 561, 569, 573, 568, 557, 544, 531, 522, 518, 518, 515, 504, 486, 465, 442, 415, 382, 349, 322, 308, 310, 326, 354, 388, 421, 444, 453, 443, 424, 406, 398, 401, 407, 411, 415, 417, 418, 420, 426, 438, 451, 457, 461, 469, 483, 494, 494, 482, 462, 441, 419, 397, 378, 366, 363, 369, 378, 390, 405, 423, 440, 444, 431, 408, 386, 372, 371, 380, 395, 413, 433, 453, 468, 476, 478, 481, 485, 487, 482, 475, 473, 472, 467, 455, 441, 431, 426, 428, 436, 447, 454, 452, 443, 433, 429, 433, 444, 457, 464, 464, 460, 452, 443, 435, 430, 430, 433, 436, 440, 443, 450, 465, 491, 519, 533, 526, 509, 496, 491, 490, 489, 483, 473, 461, 455, 458, 465, 465, 457, 447, 443, 447, 459, 478, 500, 518, 534, 550, 570, 591, 607, 615, 615, 606, 593, 583, 580, 586, 594, 599, 595, 577, 552, 531, 526, 530, 532, 527, 521, 521, 520]
6409E20j1k7l9m5m9m2k6nRJ6J8K2K3J8J5J6K0K1J8J5J3Olj1j2qoj1j4qKONOJ4J9J5RJ0J6J9
6393E54J8J5J4QJpj3k5m0m8m3k7j3JJ4K1J5Kpj0j0j2j1rqj6k5k8j9pLRJ6K4L0L0K0J0MONk
6376D40pmPJ5J5PMQJ8K4K0Orj8j8j0l%%LJ2J8J0j2l3m1l6k4rMJ1PklNJ9K9K7J3rk5k8j9oN
6358D11J4J8J6Q%mjNRJ0PMJkmoljmpj1j6k1j8nJ4K4J9Qlj5k2j9rJOJ3K1K2J1lrnjLPJ7K4K8
6338E32L3L5K9J5nk4m0m8m8l9k3pPJ6J8J4QQJ6K9L6L2K0J0OOkrj3pLJ4K7L3K4Nj2k1l0l8m1
6322E69l1j6j1k0k9k9j6%J2J3%j7k8k9k0pQK0K6K6K5K5K3J6RNRJ2J4J2Okrj7k2k7k8k4j6o
6306D26OJ4J6Nj0k2k5k1j6qJQPkj2j5j4j3qNJ8K1J3Lmrj4j0JJ6K2J7PJ%PJ7K1J6J0J1J2RR
6288E16J5K3J5ok5k7j2NJ5J3MopkQJ4J7J8J1ok1k0p%pk4l8l9l3k4j5pOJ9K7K6J6J0ROMKNO
$$ y = [520, 509, 482, 443, 398, 349, 307, 281, 276, 285, 301, 319, 341, 364, 382, 397, 413, 433, 454, 472, 487, 500, 506, 503, 492, 480, 472, 466, 455, 441, 433, 435, 441, 446, 452, 466, 485, 500, 509, 519, 535, 554, 572, 587, 601, 609, 610, 603, 590, 565, 525, 477, 434, 407, 394, 395, 409, 430, 445, 447, 440, 430, 420, 408, 397, 388, 380, 364, 339, 311, 292, 285, 288, 297, 313, 337, 367, 397, 417, 427, 431, 437, 442, 440, 433, 429, 436, 451, 466, 473, 477, 485, 503, 527, 547, 553, 544, 526, 508, 498, 495, 495, 495, 498, 510, 528, 538, 526, 493, 452, 416, 392, 383, 387, 398, 405, 403, 400, 405, 424, 453, 480, 493, 484, 459, 431, 412, 406, 411, 425, 443, 459, 467, 467, 463, 462, 467, 476, 486, 493, 497, 498, 496, 492, 486, 483, 482, 478, 471, 460, 444, 423, 405, 400, 414, 438, 457, 465, 462, 447, 425, 406, 397, 398, 404, 417, 438, 460, 471, 468, 459, 454, 453, 456, 463, 480, 504, 532, 565, 600, 629, 644, 639, 615, 575, 527, 479, 440, 417, 410, 417, 433, 451, 465, 473, 481, 497, 526, 562, 594, 614, 624, 630, 636, 634, 625, 612, 605, 608, 622, 649, 682, 706, 711, 699, 678, 648, 610, 569, 538, 522, 511, 491, 462, 433, 417, 417, 429, 442, 442, 425, 397, 368, 348, 341, 349, 369, 395, 421, 446, 471, 494, 510, 519, 524, 533, 545, 559, 571, 577, 575, 566, 549, 527, 500, 472, 448, 432, 426, 432, 446, 462, 467, 457, 435, 410, 389, 373, 365, 366, 374, 381, 379, 367, 352, 338, 325, 317, 322, 340, 361, 374, 377, 373, 364, 350, 340, 341, 357, 379, 396, 403, 404, 404, 411, 428, 449, 465, 475, 486, 498, 507, 516, 531, 554, 569, 563, 538, 511, 499, 504, 519, 532, 536, 530, 523, 521, 529, 543, 560, 578, 589, 583, 562, 542, 535, 535, 528, 504, 466, 427, 394, 370, 355, 348, 354, 373, 400, 426, 442, 452, 461, 467, 471, 473, 478, 484]
6270D84MNRQmj9k5k3k3k7l1k3rNJ1J1QJ0J3J4RKkJPJ5K0J5kj7k0rkjLJ6K6J9Jj1rjMKkJJ2
6251D75L0M8O3Q3J07J35J63J94K10J73O4p7j78k03j78j45j16r1o5n0m1k7j2%QJ4J5Mj3k3k4
6239E43k2k1j8q%%%OJ1RJm%RJ1Npj3qNJ6K6K8K0jk8m3m1k9j8j1jPJ6K3K6J9Mrj0njLQJ0%j8
6220D90k9k4j2JQOlj5j7mJ7K9L1K5J8J3R%opMJ7K3K3K2J8Rnk1l3l8l9k8j2KJ0J5J8J7Mj0j7
6203E09j5q%QJ3J0%qojMMJoj2j5j4j3j5j5j1llrj2qJNL%NJ0QJpj1j6k4k7j9kJ5K4K2J3RJ6
6184D01K4K8K5K4K5J7ok9l4j9KJ6K3K3J8Qkl%LQJ7K4K1Nj5k9l3l2k9k4j3JQNkj0j4j8j7qP
6167C96J9J7Rjqj3qNK1L1K8J8J0Jrj7k2j6kJ2J5Nj6l1l7l4l2k6j8qKRJ8K4K8K8K9K6J8Mqj4
6151D53j2qlMJ5K0J7Lj0j3qknrrnkmqj6k4k9k8k1j1JJ8L5M5L9K5Rmj0j2lOJ2J4J3Lj1k5k7
$$ y = [484, 488, 493, 502, 510, 506, 487, 462, 439, 416, 389, 358, 335, 326, 331, 342, 353, 361, 371, 384, 398, 407, 409, 407, 408, 415, 430, 450, 465, 463, 446, 426, 417, 415, 414, 417, 433, 459, 478, 479, 468, 459, 458, 462, 464, 462, 463, 475, 505, 553, 616, 699, 806, 941, 1104, 1298, 1508, 1681, 1745, 1668, 1490, 1287, 1109, 964, 848, 757, 692, 642, 601, 574, 562, 562, 570, 584, 599, 603, 590, 567, 543, 521, 500, 482, 474, 474, 474, 474, 480, 491, 500, 501, 497, 497, 506, 517, 522, 515, 502, 494, 499, 515, 541, 569, 589, 588, 560, 517, 476, 447, 429, 418, 417, 424, 440, 463, 489, 508, 512, 503, 493, 488, 487, 490, 498, 508, 508, 490, 461, 437, 425, 426, 434, 440, 437, 422, 405, 401, 418, 447, 478, 503, 521, 534, 543, 543, 537, 530, 534, 551, 574, 597, 619, 637, 646, 641, 620, 587, 549, 510, 482, 470, 472, 482, 497, 515, 532, 536, 526, 509, 494, 486, 486, 494, 507, 517, 517, 509, 503, 502, 506, 510, 511, 505, 493, 478, 464, 451, 436, 421, 410, 407, 404, 395, 383, 375, 376, 381, 384, 384, 389, 399, 407, 408, 401, 390, 374, 350, 323, 304, 302, 317, 341, 363, 376, 385, 401, 425, 453, 478, 502, 527, 544, 538, 509, 475, 456, 458, 474, 497, 520, 538, 546, 544, 541, 541, 544, 552, 569, 593, 614, 619, 604, 575, 542, 510, 481, 457, 444, 445, 453, 458, 456, 446, 432, 414, 397, 389, 396, 415, 432, 441, 440, 432, 419, 411, 416, 437, 468, 496, 514, 524, 525, 516, 499, 477, 461, 459, 471, 486, 491, 475, 444, 407, 373, 341, 315, 297, 289, 291, 300, 318, 342, 370, 398, 427, 453, 471, 475, 467, 453, 441, 433, 430, 434, 449, 469, 486, 489, 479, 466, 458, 456, 451, 442, 433, 428, 426, 422, 414, 398, 374, 345, 317, 296, 285, 286, 304, 339, 384, 423, 448, 457, 453, 443, 431, 428, 434, 446, 460, 473, 476, 465, 440, 413]
6133D13j8pkMRNnj5j6j3q%J0J3Npj3j4j4qPK1K9K6K0J6Qkj0j5k3k4j3LJ0Koonpj2rlNQJ2J7
6114C68J7J6J7J8J1jj1j0kLjj3k3k9k3pJ7L4L6J9%kJ4K5K1RPJ1J3RLJ%jkknpqrj3k0j6JJ9
6096D84K3J1qj6j0MJ2RjpmKPNlj2j3kJ3K1J8J2Q%j2j9j2%Nkj2j9k2k0qPJ2Noj2j7k0k0j1%
6078C70ONQJ5K2K0K0K3K9L0L2L2K6J2mnLJ3Pj0k9l9l6k4j0lknqrj2j0%J3K1J7Nmm%krj1lN
6060D95Mjmnj0j6j8r%KknpqplLOMkmJJ3K2K1J3LlokOJ2Oqj7j5rooopj3j5rKK0L7N1M9L0Mj1
6039E70j0pm%%pj9k3j4JJ2J7J8J4Mpj3j4j2j0mMJ0J3RJqj3j0%PQMkprkQJ9J6kk1k9k5j6qM
6020D43J9K7K2J1PQLj1k6l3l2k2j0KK%jMOJlmpj6k2j7oMJ0J0QOJ3K6L4L0J6jj2j7pJ3L0L1
6002E39J8KmmKPMpj9j4JJ5J5N%%NJ2J3P%lKNJrj2rmKOJ1J1%j6k8k7k2k2k4k1j1jLOJ4J8J1
$$ y = [413, 395, 388, 386, 390, 399, 404, 399, 384, 368, 355, 347, 347, 357, 370, 375, 368, 355, 341, 327, 319, 326, 347, 376, 402, 422, 438, 446, 444, 434, 419, 396, 372, 359, 362, 372, 374, 368, 362, 357, 350, 338, 329, 326, 331, 339, 351, 368, 385, 401, 418, 436, 447, 446, 435, 425, 423, 426, 425, 412, 389, 360, 337, 330, 347, 381, 417, 436, 436, 434, 448, 473, 494, 503, 510, 521, 534, 543, 546, 547, 547, 546, 544, 542, 537, 530, 522, 513, 500, 480, 464, 465, 484, 507, 518, 510, 494, 484, 488, 500, 509, 508, 501, 497, 499, 506, 511, 508, 496, 483, 481, 494, 515, 533, 545, 553, 553, 541, 522, 510, 510, 515, 513, 501, 482, 460, 440, 432, 439, 451, 456, 450, 438, 421, 401, 381, 370, 370, 376, 381, 389, 404, 426, 446, 466, 489, 518, 548, 580, 612, 638, 650, 646, 641, 644, 657, 664, 654, 625, 586, 550, 526, 516, 513, 511, 506, 498, 489, 477, 467, 467, 480, 501, 518, 523, 519, 515, 515, 513, 504, 493, 490, 495, 499, 498, 494, 489, 479, 463, 445, 436, 436, 438, 436, 431, 424, 416, 409, 406, 409, 415, 419, 417, 413, 414, 427, 449, 470, 483, 486, 483, 477, 475, 481, 493, 499, 491, 474, 459, 450, 444, 438, 432, 425, 412, 397, 388, 390, 410, 447, 498, 547, 577, 581, 570, 560, 553, 549, 549, 549, 542, 523, 500, 486, 487, 499, 516, 534, 548, 552, 545, 532, 518, 506, 496, 492, 496, 506, 519, 528, 529, 521, 508, 498, 498, 505, 513, 517, 515, 508, 499, 497, 505, 524, 540, 538, 517, 488, 463, 447, 439, 443, 462, 489, 511, 522, 529, 537, 540, 529, 503, 470, 438, 416, 406, 408, 410, 410, 409, 413, 419, 420, 417, 413, 406, 390, 368, 351, 345, 349, 359, 369, 377, 383, 396, 422, 456, 486, 502, 501, 489, 472, 465, 478, 508, 539, 557, 559, 555, 551, 553, 560, 564, 557, 538, 524, 525, 540, 555, 560, 560, 560, 565, 577, 590, 597, 597, 594, 596, 601, 602, 593, 581, 572, 568, 570, 576, 587, 598, 598, 582, 554, 527, 505, 483, 459, 438, 427, 426, 429, 435, 449, 467, 478]
5983D78krpkMPRLmqkORJrj2mJ6L6M2L0J0nj0o%L%nonljJKlmjMJrk0k2j9j5j5j5j9j7j0MJ1
5962D08R%pj2rKJ3J4MnmJ%mpn%NJ3K0J9J1Loj5k3j8qlnpLJ7K5K1J0KMJ5K6L2K6J3lj5k0j9
5943E21j2mMRROMNMjkQJ8J5jj3pMLj0k1k1j0KJ2J6J1%roNJ6J5Lj0j4j5j8k5l0k9k1j1kLLN
5924D09NOMJJPJ5J9K1J8J6J5J6J3Jj8k9k5j4rj0j0JJ3J8J1jqmLQOJnrj1rnmoj1j2j0jJ2K1
5906D50J9J2OQJ6K5L1L1K1Mpnjpk3l8l9k6pJ0J3Mqj2qmjLJ2J9K1J5RLoj9l0k8j5jOQPLj0k3
5887D38k5j4mkjJMLLOJ0Nrj9j2J0L2M5M6L8K8J5Loj1j2j4k2k5j7OK7L2K3Rjorrqnmnmnrj5
5869E11j8j6j3j4j6j9j5oMJ0PM%mrj2pJRJ4J4J5J4J1PMMJoj3j6j6j7j9j9j5lOJ3J2QMjmkO
5850C99J4J4J0PJ0J3J3RNJnqlRJ6J0%j0j6j7j5j2rkJ2K5L0K5J6Pmj4j5oORjj0j2nNRJ2J6K1
$$ y = [478, 476, 467, 460, 458, 462, 469, 478, 481, 477, 469, 467, 473, 482, 483, 474, 462, 458, 474, 510, 552, 582, 592, 587, 577, 571, 571, 574, 574, 569, 563, 558, 555, 554, 555, 557, 554, 550, 549, 553, 554, 545, 525, 503, 484, 469, 454, 439, 420, 403, 393, 397, 408, 417, 417, 410, 398, 389, 391, 404, 418, 422, 417, 413, 414, 414, 410, 403, 398, 398, 403, 416, 436, 455, 466, 469, 463, 448, 425, 407, 399, 396, 391, 384, 387, 404, 429, 450, 460, 462, 466, 481, 507, 539, 565, 578, 575, 560, 540, 521, 509, 505, 509, 518, 527, 533, 537, 542, 546, 545, 543, 551, 569, 584, 583, 570, 563, 567, 570, 560, 539, 518, 508, 510, 522, 538, 549, 549, 540, 534, 539, 555, 570, 573, 563, 549, 534, 516, 491, 461, 432, 411, 400, 398, 401, 404, 409, 414, 420, 424, 425, 426, 433, 448, 467, 488, 506, 522, 537, 553, 566, 567, 549, 520, 495, 481, 472, 462, 452, 453, 466, 484, 495, 494, 486, 482, 485, 493, 499, 500, 495, 486, 475, 466, 461, 457, 451, 440, 428, 418, 417, 429, 450, 469, 481, 487, 495, 511, 536, 567, 598, 619, 623, 616, 611, 610, 603, 580, 542, 503, 477, 470, 480, 493, 497, 489, 477, 469, 465, 464, 467, 479, 498, 519, 534, 543, 546, 540, 521, 491, 463, 448, 447, 453, 461, 468, 471, 461, 438, 413, 399, 395, 393, 392, 393, 397, 400, 403, 409, 419, 424, 415, 396, 384, 394, 426, 471, 517, 555, 583, 598, 601, 595, 584, 572, 558, 536, 511, 494, 500, 527, 559, 582, 591, 590, 584, 575, 566, 558, 553, 549, 544, 540, 535, 526, 511, 493, 477, 464, 450, 434, 415, 400, 394, 398, 408, 415, 419, 419, 415, 406, 394, 387, 388, 397, 411, 425, 440, 454, 465, 472, 476, 480, 481, 475, 462, 446, 430, 413, 394, 375, 360, 357, 363, 376, 388, 396, 400, 399, 395, 393, 399, 413, 427, 437, 444, 454, 467, 480, 489, 494, 495, 490, 482, 479, 488, 504, 514, 514, 504, 488, 471, 456, 444, 435, 433, 445, 470, 500, 525, 541, 548, 544, 530, 515, 509, 515, 524, 523, 513, 501, 496, 501, 510, 522, 538, 559]
5832E59K1J2kj1j3j4j8k5k7k7k4k7l1l3k6j3KJ4K1K0J3OMPQNlJJ7L3L2J3qj5nQJ3J6J9K1J5
5816E58Kqj0ojJKkj3k0j6njpj1oNJ5J4Lj8l8l8j5J4L0K4J3MMNKnj0mQJ5Rlj2j1rrj0j0rj1
5797D10j3j0mKMjnqnmlMJ7K2J7M%KMJKPJ3J6J7J7J8K2K4J6mk6l7k8j5mj%KLPJ4J9J4Loj0r
5777E08j0j5k2k6k3j5jJ0J9K3K1J6J2J4J5J0nj9k6k2pQK1K3J3%roMJ2J3P%pj3k1k4j9pJPJ9
5761D79L5L9K3jj5j2j0j9l0l0j5NK0K5J8%j8k8k9k7k5j7lJ2K0K4K9L1K9J7%j4j6pMJ1J5J6
5745E36J0lj8k1k0k1k8k7j6opqn%mj2j2%K1L8M6M0K1jj8k1j6nMJ1J3J2J3J7K1K2K0J0kj4j2
5729E58nJjoj0j4j8j6q%KJlj2k1k6j9lJ2K1K4J7Kj3k0j8j3mQJ8J9J2Jrj9k8k8j9mOPJpp%O
5710C65NkmjMjj0j3mJ1K2K5J9Oqj3qJOJj2j8j6mPQJj1j9j9j0kLNJ0J9K0J3M%lj1j6qJ1K6K8
$$ y = [559, 580, 592, 590, 579, 566, 552, 534, 509, 482, 455, 431, 404, 373, 340, 314, 301, 303, 317, 338, 358, 371, 377, 381, 388, 396, 401, 398, 399, 416, 449, 481, 494, 486, 471, 466, 474, 487, 503, 522, 543, 558, 560, 552, 542, 536, 535, 536, 538, 536, 523, 503, 487, 482, 481, 474, 463, 457, 462, 477, 491, 494, 476, 438, 400, 385, 399, 429, 453, 466, 470, 474, 479, 481, 476, 466, 462, 470, 485, 494, 491, 479, 468, 459, 450, 440, 430, 421, 410, 397, 387, 383, 385, 389, 388, 383, 375, 370, 366, 363, 367, 384, 406, 423, 427, 427, 429, 433, 434, 436, 443, 456, 472, 489, 506, 524, 546, 570, 586, 582, 556, 519, 491, 476, 472, 471, 471, 473, 476, 483, 497, 516, 530, 533, 527, 517, 508, 498, 483, 461, 435, 412, 397, 396, 406, 425, 448, 469, 485, 497, 511, 526, 536, 531, 512, 486, 464, 457, 465, 486, 509, 522, 522, 513, 507, 511, 523, 536, 543, 543, 536, 523, 502, 478, 459, 452, 453, 460, 479, 514, 553, 576, 575, 560, 548, 538, 519, 489, 459, 444, 449, 469, 494, 512, 512, 494, 466, 437, 410, 385, 368, 365, 377, 397, 421, 450, 481, 510, 527, 527, 513, 497, 490, 494, 505, 520, 536, 546, 543, 525, 504, 484, 463, 435, 408, 392, 386, 379, 371, 366, 366, 362, 350, 338, 338, 359, 397, 443, 483, 504, 503, 485, 464, 448, 443, 447, 458, 471, 483, 496, 513, 534, 556, 576, 586, 584, 570, 558, 553, 554, 553, 547, 537, 523, 505, 489, 481, 481, 483, 484, 481, 469, 448, 422, 403, 400, 412, 433, 457, 474, 476, 463, 443, 425, 412, 408, 416, 434, 453, 465, 466, 457, 438, 410, 382, 363, 359, 365, 372, 373, 366, 359, 359, 365, 370, 368, 364, 363, 367, 366, 356, 343, 339, 350, 372, 397, 416, 422, 414, 401, 393, 394, 400, 401, 389, 371, 355, 351, 358, 366, 367, 356, 337, 318, 308, 306, 309, 314, 324, 343, 363, 376, 380, 380, 377, 366, 350, 342, 353, 379, 407]
5692D07J8N%%NJ0J1Lqj5j2nLQJ7K5K8K0Nrj6k3k9k8j2J1K4K3K1K4K2Pj1j6lJ1J3PMKJjlrj6
5673E19k2k1j8k1k5k1j0LJ0J5J5J5J3J9K5K6J8PLMQOlj9k9l1j8lJ1J7J6J0Kjjlj1k1k7k7j7
5657D13kJ3J5J0%lKJ0J4J3PJ%koplKMLJjjkLJ3J7J1LOJ3J7J0kj6k2j9nPJ1J1J5K0J9Qoj9l2
5638E44l7k8j1LOMRJ6J8J1jj3k6l0k7j4%RNj0k8l5k6j0KQJ2J6J3RNJmj0rjOPNMORJ5K1K3J4
5619D81ok3l0k2nQPmj3j6j4j2mMRP%kjLRJ8K3J8Q%loj3j3oKNLMN%rj1lPP%%J1K2K2J2Jm%M
5598D80OPPNMMJ3K2K5J7LkJNKnj3j7k1k0j7rJJ1K0K4J9Ppj3j2qj1j7j8j4qkLPPLmj0j6j7j0
5580D32JJ3J7J4J0J3J8J6Qlj4k0k0j6j4j9k3k1j0MJ2J1QJnj0j1lJ0J9J9Ppj5j0KJ2J1kj1j0
5563D14jMmj7k3j8lQJ1NJJKLjmlKORJ2J6J9K1J7QKLJ2K0J8Lj4k3k6k2j7mJ5K9K7J0qj7j6j3
$$ y = [407, 425, 430, 430, 430, 435, 445, 456, 459, 451, 436, 424, 419, 422, 430, 447, 472, 500, 520, 525, 516, 500, 477, 448, 420, 408, 419, 443, 466, 487, 511, 533, 540, 529, 513, 510, 521, 534, 541, 545, 547, 548, 547, 544, 535, 519, 497, 476, 458, 437, 412, 391, 381, 384, 394, 409, 424, 439, 452, 471, 496, 522, 540, 547, 550, 554, 562, 568, 565, 546, 517, 486, 468, 465, 476, 493, 509, 519, 521, 520, 519, 516, 505, 484, 457, 430, 413, 411, 424, 439, 449, 449, 446, 448, 458, 472, 485, 492, 493, 493, 491, 485, 478, 475, 477, 481, 484, 485, 484, 483, 481, 484, 497, 514, 525, 528, 534, 547, 564, 574, 572, 556, 534, 515, 510, 517, 528, 539, 554, 574, 593, 601, 595, 576, 544, 507, 479, 468, 471, 477, 481, 490, 506, 524, 535, 534, 521, 495, 465, 438, 424, 424, 433, 438, 428, 400, 365, 339, 329, 331, 339, 351, 367, 380, 389, 394, 395, 391, 381, 372, 371, 377, 384, 389, 393, 399, 408, 423, 444, 467, 481, 475, 452, 422, 400, 395, 403, 410, 406, 393, 377, 363, 351, 347, 351, 360, 367, 367, 365, 364, 367, 376, 394, 417, 435, 443, 443, 440, 434, 421, 408, 402, 404, 409, 412, 416, 421, 421, 412, 401, 398, 405, 412, 412, 412, 423, 445, 467, 479, 480, 476, 476, 480, 486, 493, 500, 505, 509, 513, 526, 548, 573, 590, 593, 591, 592, 597, 599, 594, 581, 564, 543, 523, 506, 497, 498, 509, 529, 553, 572, 579, 572, 559, 547, 539, 528, 511, 493, 479, 471, 469, 472, 479, 486, 489, 485, 475, 459, 442, 432, 433, 446, 463, 477, 487, 500, 518, 534, 542, 539, 525, 505, 485, 469, 455, 436, 413, 392, 382, 386, 398, 409, 417, 418, 413, 403, 392, 389, 399, 418, 437, 444, 437, 422, 412, 414, 426, 437, 435, 424, 414, 413, 417, 413, 396, 373, 355, 352, 360, 371, 376, 377, 378, 380, 383, 382, 378, 375, 377, 383, 392, 404, 420, 439, 460, 477, 485, 487, 490, 502, 522, 540, 543, 529, 506, 480, 458, 441, 437, 452, 481, 508, 518, 510, 493, 477, 464]
5545D64j2j2j4j6j4p%%rj6j6j2mPK0K7J9KqqkmolOJ3J5J3J5K1K1J4LmlJLKMJ0J6J2jj7k8k8
5526D64k0j3j3j0kRJ2Oqj5j3oJMMKJmj5k2k1j0JONLNJ4K6L4L1K0J0Nlj1j4r%KJkMJ3K3K4J4
5507E33nj5j1LJ0J2J4K2K2Rj0j9j2KJ9K6K0Jk0l0k7j5ploj1j6j4mNJ0RPPNLmj1j7j3%Pjk0
5490D55l6k8nJ4J7Qmj2j6j4j2j1j0ok%qj9k8k5rJ3L1L9L9L5L2K6J4Lmqj0j0qpj1j7k2j6nP
5473C70J4J5J5J2POJ0J6J6J1PJ0J6J4Moqnoj1j3pKJ0Oqk2k8j9LK0K7K3J7J1Kj0j6j3nKjpq
5455D73nJjoj0oKQJ2J5J7J4Nlp%J1J8J4Kj4k4k6k5k3j8j0KJ4K1J6Noqorj6j9j4mMJ0J6J6J0
5437D46MJNQPkj5k1j4nLNLMMOJ0J4J2Mlmlmm%NRJ1J5J3Lj2j9j3kMLjpj0j4j8k2k1j6rqj0n
5417C37PJ1Jj4j5mQJ5K1K7L2K8K3K1K3K6K0Lj5k6k5j6rnkj%OJ2J2kj7j9oJ0J7J4Pkj1j7j5
$$ y = [464, 452, 440, 426, 410, 396, 389, 389, 389, 380, 364, 348, 336, 332, 339, 359, 386, 405, 407, 399, 391, 389, 385, 379, 376, 382, 395, 410, 423, 438, 459, 480, 494, 497, 493, 490, 491, 494, 496, 500, 510, 526, 538, 537, 520, 492, 464, 444, 431, 418, 408, 406, 415, 427, 433, 425, 410, 397, 391, 392, 396, 400, 402, 403, 399, 384, 362, 341, 331, 332, 338, 343, 346, 351, 365, 391, 425, 456, 476, 486, 491, 488, 477, 463, 454, 454, 456, 457, 455, 459, 472, 495, 519, 533, 528, 513, 502, 505, 515, 527, 541, 563, 585, 594, 584, 565, 553, 555, 574, 600, 620, 621, 601, 571, 544, 529, 522, 519, 513, 502, 486, 472, 468, 473, 483, 492, 499, 506, 511, 514, 510, 499, 482, 469, 469, 476, 475, 455, 419, 391, 386, 400, 417, 425, 421, 409, 393, 379, 367, 356, 346, 340, 338, 338, 330, 311, 283, 258, 249, 262, 293, 332, 371, 406, 438, 464, 478, 481, 477, 469, 459, 449, 441, 434, 423, 406, 384, 368, 363, 370, 384, 399, 414, 426, 433, 439, 449, 465, 481, 492, 499, 509, 525, 539, 543, 537, 529, 524, 518, 507, 494, 487, 489, 499, 505, 497, 475, 447, 428, 431, 451, 478, 501, 518, 529, 531, 521, 505, 492, 487, 489, 488, 481, 473, 468, 469, 468, 462, 452, 446, 448, 456, 468, 483, 500, 514, 519, 516, 509, 509, 520, 538, 552, 554, 540, 516, 490, 465, 442, 424, 414, 416, 430, 451, 467, 472, 466, 458, 452, 443, 427, 408, 394, 390, 394, 404, 420, 436, 446, 450, 451, 456, 464, 471, 469, 454, 433, 419, 414, 417, 422, 425, 429, 433, 439, 449, 463, 475, 479, 476, 472, 469, 465, 461, 461, 466, 475, 486, 501, 514, 517, 505, 486, 473, 471, 475, 478, 477, 470, 460, 446, 428, 406, 385, 369, 360, 352, 342, 337, 344, 355, 356, 342, 327, 323, 331, 346, 367, 394, 426, 454, 477, 498, 521, 547, 567, 570, 555, 529, 504, 488, 479, 474, 472, 471, 471, 477, 489, 501, 499, 482, 463, 457, 467, 484, 498, 505, 503, 492, 475, 460]
5400D60rmoqrpjOJ1J5K0K8L3L2K4Rnj3rMJ0Omrqqrj3j7j6qPJ8J3pk2k4j6j2p%RJ4J1J0J2J5
5381E16J1Llpj4k6l2k3%K0K5J7RPNJqj5j9j7j2nNJ3K3K6K0Ploorj4k0j8j2JJ4K1K1J3Lqj6
5363D88k0j4JJ5K2J9J1NKJknnl%nj7l1l8l7l2k8j9pLJ0J7K7L2K7J7RPLkkOJ2J3J4J6J8J0M
5346E42NJ1J2Nlj0j8k5k3j4jMJoj4j7j8j6j4j0lLPRJ6K0J9J2PJ0J1MnpojLKqk5l8l5j6KJ0
5328C82J0ONJ1J9K5K6K4J9Roj8k2k2k7l3l2j8jQJ2J3J1QNQJ3J1Loqn%MQJ3J1NlolJMMJlrj8
5308D39k7l2l1k4j5j4j5j2jJ4K4K9K6J7Lj4k4k4j8qQK6L7L7K9J5jrnJ1K4K0Jj8k2j6njmj0
5292D10j0jJ1J7J3Lorqorj1pKPOMLMJoj1j2qnjjkmKJ0J6J3PjmlMRLqj5j1mjmkPJ5J5RJllJ
5270D17NQMj%OJ6K1K4K0J5Jk0m4n7n5l3qQJ3J2J2Qkp%J8K8K8K2J2Lj0j6j0JJ1J3J4J4J1PM
$$ y = [460, 451, 447, 441, 433, 424, 417, 416, 422, 433, 448, 468, 496, 529, 561, 585, 594, 589, 576, 567, 571, 581, 587, 583, 574, 566, 558, 549, 536, 519, 503, 495, 502, 520, 533, 526, 504, 480, 464, 452, 445, 445, 454, 468, 479, 489, 501, 516, 527, 530, 527, 520, 506, 480, 448, 425, 425, 445, 470, 487, 496, 503, 508, 509, 501, 486, 467, 450, 438, 433, 438, 451, 474, 500, 520, 527, 524, 518, 512, 503, 489, 469, 451, 439, 440, 454, 475, 496, 509, 512, 504, 488, 468, 454, 455, 470, 492, 511, 522, 527, 529, 530, 528, 523, 518, 515, 515, 510, 493, 462, 424, 387, 355, 327, 308, 301, 304, 314, 331, 358, 390, 417, 434, 443, 450, 453, 451, 449, 455, 467, 480, 494, 510, 528, 538, 542, 547, 558, 570, 575, 572, 562, 544, 519, 496, 482, 481, 485, 486, 480, 466, 449, 431, 415, 401, 391, 388, 391, 398, 407, 423, 443, 462, 474, 481, 491, 502, 506, 501, 494, 488, 487, 490, 492, 484, 459, 421, 386, 370, 372, 382, 392, 398, 403, 414, 433, 458, 484, 508, 527, 536, 530, 512, 490, 468, 441, 408, 376, 358, 357, 365, 377, 390, 401, 409, 414, 422, 435, 446, 449, 443, 435, 430, 430, 434, 442, 455, 466, 471, 468, 462, 459, 460, 464, 468, 469, 466, 457, 439, 412, 380, 349, 325, 310, 296, 281, 269, 268, 282, 306, 335, 361, 378, 381, 367, 343, 319, 301, 293, 301, 327, 364, 401, 430, 445, 444, 435, 430, 441, 465, 485, 486, 468, 446, 430, 425, 424, 420, 410, 400, 399, 410, 427, 440, 443, 437, 428, 420, 414, 405, 394, 387, 389, 396, 402, 406, 409, 413, 414, 408, 397, 385, 377, 372, 371, 370, 368, 364, 366, 376, 392, 405, 412, 411, 407, 404, 408, 417, 420, 412, 397, 386, 382, 381, 377, 375, 382, 397, 412, 421, 422, 419, 416, 417, 422, 430, 434, 433, 433, 439, 455, 476, 500, 520, 535, 536, 516, 472, 415, 360, 327, 319, 327, 340, 352, 364, 372, 370, 363, 363, 381, 409, 437, 459, 471, 474, 464, 448, 438, 439, 450, 463, 477, 491, 502, 509, 513]
5253E13KJLJ0J6J9J5Onj5k0j7j4j4k3k5j8mPJ4J5J4Qkj1j2j2j0okLJqk7l9l6j4J4K7K1Kj1
5236C66j3rjNJ0Onj4j5lJ1K3L1L1K8J8Orj7j5m%mj1rLJ4J9K0K3K9L1K5J6QLKlj2j9j9j1nl
5219E27KOQMlnnj0j4j2JJ9L2L4K7J0qk3l2l1k6j5kJ0J8J7J0%opkKORQKrj8k3k4j9rLPKqj5
5200D38j5j1lQJ9K8L3L3L3L3K8J8Lrj9k5k4j3MJ3J0lj2j7j6qOK0K7J8Lqj1ppj2k4k9k4j3J
5183D66RJ3R%pmKLnj3rjM%m%OJ2RKnj0j0j2j7k3k4j7pjmj0j1mMRJ6K5L3L7L1J9NlkLPKj0j8
5163D95j8j4j6k0k2k0j4pOJ8K2J3jmNJ0QMPJ2J5J0L%KLKmj4k4k8k4j5kJ1K1K1J1Kmqj1j0M
5145D25J7J8R%jJNQJ2Rlj4j1jKrj9j7qpj3k0j6ojoj3j1kQJ7K0J8J1RJ5K4K6J6jj6k5k3qJ5
5127D34L0K8J4%poJPQL%jlj1j6j1NK3L6M3M1L0J3j0l4m6m3k2KJ7K1K0J7Rkj2k1k3j2NJ5Nj7
$$ y = [513, 515, 516, 519, 529, 545, 564, 579, 585, 580, 565, 545, 528, 514, 500, 477, 452, 434, 430, 437, 451, 466, 480, 488, 486, 475, 463, 451, 441, 435, 433, 436, 437, 429, 402, 363, 327, 313, 327, 354, 375, 377, 366, 353, 344, 343, 348, 358, 364, 359, 345, 330, 327, 338, 361, 392, 423, 451, 469, 475, 466, 449, 434, 430, 430, 426, 415, 406, 409, 423, 442, 462, 485, 514, 545, 570, 586, 594, 597, 599, 596, 584, 565, 546, 535, 530, 527, 529, 535, 543, 547, 544, 539, 534, 524, 510, 498, 499, 518, 550, 584, 611, 621, 613, 590, 558, 527, 501, 486, 484, 494, 512, 529, 539, 539, 533, 526, 524, 526, 532, 541, 549, 551, 542, 524, 501, 477, 458, 449, 452, 459, 461, 453, 438, 423, 412, 409, 417, 436, 464, 497, 530, 563, 596, 624, 642, 645, 636, 617, 592, 568, 555, 559, 572, 582, 579, 567, 550, 534, 526, 532, 552, 579, 597, 600, 592, 581, 574, 567, 555, 531, 502, 478, 465, 466, 475, 488, 497, 497, 490, 486, 488, 491, 486, 473, 464, 463, 467, 467, 463, 463, 469, 481, 490, 492, 487, 477, 467, 455, 438, 415, 391, 374, 367, 366, 362, 352, 341, 337, 341, 350, 366, 391, 424, 461, 492, 511, 516, 513, 511, 514, 521, 523, 513, 495, 477, 463, 447, 427, 405, 385, 371, 364, 370, 388, 410, 423, 422, 418, 423, 433, 441, 445, 452, 464, 479, 489, 492, 492, 494, 497, 499, 495, 481, 457, 429, 405, 390, 388, 399, 420, 441, 452, 454, 450, 442, 431, 421, 425, 442, 460, 469, 469, 468, 469, 474, 482, 494, 503, 500, 486, 475, 474, 476, 467, 448, 431, 423, 416, 403, 383, 367, 361, 360, 354, 341, 330, 328, 336, 353, 373, 391, 402, 411, 426, 450, 476, 492, 491, 475, 450, 427, 419, 434, 464, 492, 506, 506, 499, 493, 494, 501, 509, 512, 512, 511, 508, 497, 481, 470, 475, 498, 534, 577, 618, 648, 661, 651, 617, 571, 528, 506, 508, 525, 546, 566, 583, 592, 590, 578, 557, 534, 522, 527, 542, 547, 530]
5110E30l4l2k1pKKnj8k3j6plkllonLJ4K4K6K0Rnj4j6j3oJOJ0J3J5J3QOQJ3J6J4J4J7J3Kk0
5092E40l7m7m5l1rJ5L1L3K0Mj0j3pOJ7K3K0J2kj2j4qJOOKklloj2j7j5r%PQPORJ0OkmJO%j3
5073D75k2k2k0k0j9j6r%RJ4J4J3J1J4K2L4M4M0K0ql0l7l2k1j1lJNQP%j1j9j4JJ5K1J8PkkO
5056D81J7K3J7%j6k6k6k1j5rjNOJlpqmk%lqj3j7k1k1j0RK6L8M1L7K9J6MmoqmNJ9K7K2R%%K
5037E81KOJ6K1J2j0k6k9k2j5lJ4K9L1K1PkmMJ1Opk0k6k7k8k6j5k%kJJ5K4J9J0OLqk4k8j8k
5020D95QPJmppomlpj2j2j1roKJ4J9J7QNORNnj4j8j5j2j1pLJ5K1J3MKNNJl%LOPKpj2kJ7K8K3
4999E57J4QKj0k4k8k7k9l5l7k8j8j3j1mNJ6K3K6K2J2%qo%PJ0J6J9K0J2JnnmmlklnpnmnojP
4980D40J3J4Pnj3j0%QNjmmmnljKMKmj1j1o%JkmlkLQRONRJ3Qmj4j2LK2L0K2PJOJ5J3LnnkKN
$$ y = [530, 496, 464, 443, 436, 438, 440, 435, 417, 394, 378, 371, 368, 366, 363, 360, 354, 349, 352, 366, 390, 416, 436, 445, 440, 426, 410, 397, 391, 392, 398, 408, 421, 436, 449, 457, 463, 471, 484, 500, 514, 528, 545, 558, 560, 540, 503, 456, 411, 380, 371, 386, 417, 450, 470, 474, 464, 451, 444, 450, 467, 490, 510, 522, 520, 508, 494, 486, 487, 493, 499, 501, 499, 496, 493, 487, 475, 458, 443, 434, 434, 441, 449, 456, 462, 471, 481, 487, 485, 481, 482, 488, 488, 475, 453, 431, 411, 391, 372, 356, 347, 347, 356, 370, 384, 397, 408, 422, 444, 478, 522, 562, 582, 574, 544, 507, 475, 454, 443, 440, 441, 446, 454, 461, 461, 450, 431, 417, 418, 433, 454, 472, 479, 477, 475, 481, 498, 521, 538, 538, 522, 496, 470, 449, 434, 425, 424, 429, 435, 436, 433, 426, 418, 414, 412, 412, 409, 401, 388, 371, 350, 329, 319, 328, 354, 392, 433, 470, 499, 515, 519, 515, 509, 501, 497, 502, 521, 548, 570, 579, 579, 579, 581, 583, 589, 605, 626, 638, 628, 602, 573, 551, 536, 533, 547, 576, 607, 628, 635, 633, 629, 633, 644, 650, 643, 623, 597, 570, 542, 516, 501, 499, 499, 497, 498, 513, 537, 556, 566, 572, 575, 567, 543, 515, 497, 495, 503, 510, 511, 507, 500, 493, 487, 483, 480, 473, 461, 449, 438, 429, 423, 425, 439, 458, 475, 483, 488, 494, 503, 508, 503, 489, 471, 456, 444, 433, 426, 429, 444, 465, 478, 482, 484, 489, 494, 495, 492, 492, 495, 501, 508, 510, 503, 491, 489, 506, 534, 557, 571, 579, 581, 571, 547, 519, 492, 463, 428, 391, 363, 345, 332, 321, 317, 322, 338, 361, 387, 409, 421, 421, 413, 407, 407, 414, 424, 440, 459, 479, 491, 492, 487, 482, 478, 474, 471, 469, 466, 461, 454, 449, 445, 440, 434, 433, 440, 453, 467, 474, 469, 456, 446, 446, 454, 459, 458, 454, 450, 446, 441, 438, 437, 439, 443, 445, 441, 430, 419, 413, 413, 414, 412, 408, 405, 403, 406, 414, 423, 429, 434, 443, 456, 464, 460, 446, 434, 437, 459, 489, 511, 518, 519, 525, 540, 553, 556, 551, 546, 544, 546, 551]
4958E51ONJmj0j5j7j4qpj1j6j8j6qJ0K9L7K8J1oj7k4k5k0j7k0k3k0j1jK%%OJ7L0L6L1J9J0
4941E01OMKmj0j9k6k3j3kNPMJpj4k1k1j6r%J0K2K9L1K2Qoj2rkL%lmmmjMJ1J3Qjqj2rmkjKP
4921D33QLqj1j0j0j1j0%PROPPNjnjQJ5J4KomPJ8J6RLLMKjoj0j0oloqqnkJJoj8k2j5pnoKJ9
4899C88L0L3L1K8K3J6J1J2J2Lqj5j7j9k4k8k3j1lmj1j7j4qkkmlQK0K8K1PljRJ6J8J7J2Mj3
4882E17l1m1m0l2k0kJ9L6M4M5M0K8J1j1k5k7j6mLKkomqj8l1k9j5loj9k3rJ0K0K2K1J5NkJJ0
4866D25J7J7J0PQJ6K4K3Rj0k2k3j9j5rJQJ1J0Kqk0k0rKNJk%KknmMJ6K3K7K4J5Mrj4j0lkqr
4847D88mK%j0j9k2k2j9j1KJ3J4Olj1k2l6m5m4k8lK2L5L7L1K8K5J9J1QOLnj4j6j0jJ0K2L4L8
4830E09L3K6K5K5K5J6Jj7k9l2k6j9j2n%KLRJ7J3lk3l3k9j6lJ2K1J6kj9k5k4k1j3MJ9K2Rmo
$$ y = [551, 557, 562, 563, 559, 549, 534, 517, 503, 495, 488, 477, 461, 443, 427, 419, 429, 458, 495, 523, 534, 528, 511, 487, 462, 442, 425, 405, 382, 362, 351, 350, 352, 352, 352, 358, 375, 405, 441, 472, 491, 501, 507, 511, 513, 509, 499, 480, 454, 431, 418, 416, 421, 428, 432, 433, 426, 412, 391, 370, 354, 345, 345, 355, 377, 406, 437, 459, 467, 461, 449, 440, 438, 441, 441, 438, 434, 430, 426, 425, 429, 440, 453, 461, 460, 452, 440, 431, 427, 425, 424, 426, 433, 441, 444, 436, 425, 415, 405, 394, 384, 384, 391, 400, 406, 413, 420, 425, 424, 419, 418, 426, 441, 455, 457, 451, 447, 454, 472, 488, 497, 500, 503, 507, 509, 508, 502, 492, 482, 476, 473, 467, 459, 451, 446, 444, 445, 446, 440, 422, 400, 385, 378, 373, 367, 369, 388, 418, 451, 482, 510, 533, 549, 560, 572, 584, 587, 579, 564, 547, 528, 504, 476, 453, 442, 439, 435, 424, 407, 393, 385, 383, 381, 377, 374, 382, 402, 430, 451, 458, 455, 454, 463, 479, 497, 514, 526, 530, 517, 486, 445, 405, 373, 353, 351, 370, 406, 450, 495, 535, 563, 574, 563, 538, 511, 495, 491, 494, 496, 494, 488, 484, 476, 458, 427, 398, 383, 380, 374, 355, 332, 323, 333, 353, 375, 396, 411, 416, 414, 415, 425, 442, 459, 469, 476, 484, 500, 524, 547, 556, 546, 524, 501, 482, 467, 458, 459, 467, 478, 488, 490, 482, 462, 442, 433, 435, 440, 441, 439, 439, 441, 439, 434, 430, 434, 450, 473, 500, 524, 539, 543, 534, 520, 510, 507, 505, 497, 488, 484, 486, 486, 476, 457, 435, 413, 394, 383, 385, 398, 412, 418, 415, 404, 382, 346, 301, 257, 229, 226, 248, 283, 320, 351, 379, 404, 423, 434, 442, 448, 451, 446, 432, 416, 406, 405, 415, 437, 471, 509, 542, 568, 593, 618, 643, 659, 660, 643, 614, 582, 556, 537, 525, 520, 520, 522, 525, 534, 551, 564, 561, 538, 505, 476, 460, 457, 469, 490, 506, 504, 485, 460, 436, 415, 402, 406, 425, 447, 456, 452, 446]
4814D46KNjqrLJ7K3K2J8J8J3lk4l7l3j7k%oj5j7rMK1L5M0L6K2Nqj4j7k0k6k8k2qNNmj5k0j7
4796C60pMJ0J2QPJ0J7J8J4MlmJJ5L2M9N5M8K8Rjmpj6k9l4l6l3k9k5k2j9j3nkrj9j9pPJ5K0
4779D00K1J9J1N%nj1j1rorj2rKK1L5L5J9nk0k4k3k6k3j0QJ9K3K5K1Rqj6qMOlj3j4rJQPnk4
4761C96l4k6mJ5K3K1J7J2MnrjRJ0Kpj1j3j5j5rklrj5j1lNRQOLMQJ3J3Lj1k3k6k1oJ1K5L3K8
4742C99J8J3J5J9K1K4L0L4K6Nj6k3j6pj0j9k7k1lJ6K1J3kj0roj1k6m2m9m2k9j9rJ0L7O3O8
4727D36N4L4J9RJrj7k1k2k4j9nJ6L0L1J8Lj1j8j8oJ0K1K1J9K0K1J7Ppj6k1k3k2j7j0lNJ0J3
4711E26Nnj4k1k3k2k1j7qKJ0J3J3J5K5L4L3K2Mj2j5qLRMmj1j6k1k0j1MRJj1k1j9j2oqj8k3
4694C65j6KJ9K4K3J8J4J1Ojj3k4k8j8kJ1J6K1K7K7K1J4J3J6J8J3PJpj9l0l4l1k7j7jJ3J2k
$$ y = [446, 448, 453, 452, 444, 435, 438, 455, 478, 500, 518, 536, 549, 546, 522, 485, 452, 435, 433, 433, 427, 412, 395, 386, 390, 411, 446, 486, 522, 544, 549, 541, 527, 510, 490, 464, 436, 414, 406, 411, 416, 412, 397, 377, 360, 353, 357, 367, 379, 387, 394, 404, 421, 439, 453, 457, 454, 450, 451, 466, 498, 547, 602, 650, 678, 687, 686, 682, 675, 659, 630, 596, 560, 527, 498, 473, 451, 432, 419, 414, 412, 403, 384, 365, 358, 365, 380, 400, 421, 440, 451, 456, 456, 451, 440, 429, 420, 414, 405, 393, 384, 386, 407, 442, 477, 496, 491, 471, 447, 424, 398, 375, 365, 373, 392, 415, 440, 461, 470, 462, 446, 438, 442, 448, 445, 432, 418, 409, 410, 418, 425, 420, 396, 362, 336, 332, 347, 370, 391, 408, 420, 424, 419, 410, 409, 418, 428, 430, 423, 412, 399, 384, 369, 360, 358, 355, 346, 331, 320, 317, 322, 331, 339, 345, 348, 352, 360, 373, 386, 389, 378, 355, 329, 308, 302, 313, 338, 371, 399, 417, 430, 445, 464, 485, 509, 539, 573, 599, 604, 588, 565, 549, 542, 532, 513, 486, 465, 462, 478, 499, 512, 510, 500, 491, 485, 474, 448, 406, 357, 315, 286, 267, 258, 268, 305, 368, 436, 490, 524, 543, 552, 553, 544, 527, 506, 484, 460, 441, 436, 452, 482, 513, 531, 534, 523, 505, 487, 481, 491, 512, 533, 552, 572, 593, 610, 617, 610, 594, 573, 550, 528, 511, 501, 498, 503, 513, 526, 531, 526, 512, 491, 468, 446, 425, 408, 400, 402, 412, 425, 438, 453, 478, 512, 545, 567, 571, 559, 544, 536, 539, 548, 552, 548, 537, 521, 500, 480, 469, 473, 482, 483, 472, 451, 432, 420, 414, 406, 388, 365, 349, 351, 370, 394, 417, 435, 449, 460, 466, 465, 452, 428, 400, 382, 380, 391, 407, 428, 455, 482, 503, 517, 530, 546, 564, 577, 584, 585, 578, 559, 529, 495, 464, 437, 420, 419, 432, 444, 442]
4678D42j1oPJ5J4J3J2Ooj1qjOQPKprp%PJ2J7J6Qnj2j3j2j2rKJ6K5K0Nj3k6l3k8j2QK1J8Po
4660D67j5k3k9k8j8lJ2K1K5K5K2K1J8J4J4J7J6Q%kKKnj5k3k9l1k7j3KQPMOQPKoj3j2jJ1J6
4643D62J0%omNJ4J7J7K2K7K5J0j0k7l4l7l4k6k0j9k2j7oQJ6K0K0J6J1NJkkJOROLJ%JNJ0J3
4625D95RJj0k1l0l1k6j9j0KJ1J4J4J3J1jj4j5mRJ4J3J4J3Mpj4j3oLJ2K2K7K3Qoj3rkJnj1j4
4608D52rl%kqrkJ0J5J2PJ0J9K1Qj0k5l2l2k7j3PK1K2J3OJNJ1J8J9J2kj3j3rqj3j8j6j0mjN
4590D15J3K1K2K4K4K4J6%rqkqk0k4j1KLlnlmlMJ3J1%rlJ4K9L7L4K3Poj0j0j1j3j5j6j7j2l
4572E11LJoqrj1j4j1njLJ1K0K3J2pk9l9l7k1JK2K9K2Orj1lJkj0j4j0jJ3K3K6K1J2Jrj8j6o
4555D54PJ4J1Nkopqqj1pjL%qj0qnnqrn%PJ3K0K9L3K6J2mj0pJMLoj3j7j3pjLLpj9k4j8qMJ5
$$ y = [442, 431, 425, 432, 447, 461, 474, 486, 492, 486, 475, 467, 466, 472, 480, 487, 489, 482, 473, 466, 466, 473, 485, 502, 518, 526, 521, 509, 496, 484, 472, 463, 465, 481, 506, 526, 531, 518, 492, 459, 431, 419, 427, 448, 466, 473, 467, 452, 429, 400, 372, 354, 351, 363, 384, 409, 434, 456, 477, 495, 509, 523, 540, 556, 564, 564, 562, 564, 566, 561, 546, 523, 494, 463, 436, 423, 425, 433, 440, 444, 450, 458, 465, 467, 461, 448, 436, 435, 446, 462, 472, 472, 466, 462, 467, 481, 498, 515, 537, 564, 589, 599, 589, 562, 528, 491, 457, 431, 411, 392, 370, 353, 347, 355, 371, 391, 411, 427, 438, 443, 444, 442, 440, 441, 447, 456, 462, 465, 466, 466, 467, 472, 482, 495, 504, 505, 495, 474, 444, 413, 387, 368, 358, 360, 371, 385, 399, 412, 423, 422, 408, 393, 389, 398, 412, 425, 439, 452, 456, 449, 435, 422, 416, 419, 431, 453, 480, 503, 511, 505, 492, 483, 481, 482, 477, 466, 452, 443, 440, 440, 438, 430, 421, 419, 429, 444, 456, 463, 473, 492, 513, 521, 511, 486, 454, 422, 395, 382, 389, 410, 432, 445, 451, 452, 457, 468, 486, 505, 517, 515, 502, 489, 480, 472, 459, 441, 425, 415, 411, 410, 415, 428, 449, 471, 495, 519, 543, 559, 559, 550, 542, 540, 532, 512, 488, 477, 479, 482, 479, 474, 471, 467, 464, 468, 481, 492, 492, 483, 480, 494, 523, 560, 594, 617, 624, 618, 608, 598, 587, 574, 559, 543, 526, 514, 511, 514, 515, 509, 501, 492, 481, 467, 456, 451, 450, 453, 464, 484, 507, 519, 512, 483, 444, 407, 386, 387, 409, 438, 460, 466, 457, 446, 443, 444, 442, 432, 418, 408, 407, 420, 443, 469, 490, 502, 503, 494, 476, 460, 454, 461, 475, 486, 491, 489, 483, 476, 468, 460, 449, 442, 441, 444, 444, 436, 426, 418, 413, 408, 400, 391, 386, 386, 393, 406, 426, 455, 488, 514, 526, 522, 512, 505, 506, 510, 513, 507, 494, 477, 464, 457, 456, 459, 462, 455, 436, 412, 394, 386, 390, 405]
4534D05K4K1Nrj1rrj2kJ1J7J2NNQQPJ0J0ROKjlnj0k1l0k6j0MPKmqr%J4K3K0Onj2j1lRJ8K0
4515D78K1K1J4kk0l3l8l5k0LK1K4J5QOJ1J9K9L6L4K3Pj0k8l5k9rJ2J8J1kj0lJ2J8Rrk1k3k0
4499E03k4k8l2l1k9k3j3LJ7K1J3OOJ6K2K1J5J3J6J4Npj5j3jJ0J4QjkMJ2J2Nok1l0k7j1OJ4
4482D62J0%oj0j1q%J2K0K1K0J8J0pk5k9j9j2j6k0j6nJ0K2L0K4Lj6j9mJ1J3Mnom%LPQPJrj7
4465D52j6j4j5j9j3%J2J7J9J7J5J0Llnkjnj3j7j5j1j0j0mRK1K5J9RjkMJ3J3N%loj0j3j0mk
4447D39KLNKnj3j5j0kjj0k0j4NJ5Nj1j7qOJ3J2PjmmjJPJ5J8RmqLK0K7K2Oj0j9j7j0nJPJ3J3
4428D67J3J7K7L4L0J9J0PJpj3pJKrk2k7k5k1k0j7j1olJLKoj9k9l7m3m5m1k9j8j2rnQK2L3L7
4411B53L2K6J5PMQJ4J7J6J5J4J1RJ0J2Rkj3k0j9j3nLJ0RQNjprlMJ2J7K4K8K7K2J2kj5k2k2
$$ y = [405, 429, 450, 455, 446, 435, 426, 417, 405, 403, 414, 431, 443, 448, 453, 461, 469, 476, 486, 496, 505, 511, 513, 512, 509, 504, 494, 473, 443, 417, 407, 411, 418, 420, 416, 408, 399, 399, 413, 436, 456, 462, 457, 445, 434, 431, 440, 458, 478, 499, 520, 534, 532, 512, 479, 441, 406, 386, 389, 410, 434, 449, 457, 463, 474, 493, 522, 558, 592, 615, 622, 612, 584, 549, 520, 511, 523, 541, 552, 550, 540, 537, 549, 567, 576, 567, 546, 523, 503, 479, 451, 419, 388, 359, 336, 323, 326, 343, 364, 377, 383, 389, 405, 427, 448, 463, 476, 492, 506, 511, 504, 489, 476, 475, 485, 499, 507, 506, 504, 508, 520, 532, 537, 531, 510, 480, 453, 442, 448, 462, 472, 472, 466, 456, 445, 437, 437, 449, 469, 490, 510, 528, 538, 531, 506, 477, 458, 446, 430, 410, 394, 389, 399, 421, 451, 475, 478, 462, 443, 439, 450, 463, 467, 462, 456, 452, 452, 455, 462, 470, 477, 478, 469, 452, 436, 422, 407, 388, 375, 375, 387, 404, 423, 440, 455, 465, 468, 465, 460, 458, 457, 452, 439, 422, 407, 396, 386, 376, 372, 381, 402, 427, 446, 455, 454, 452, 456, 469, 482, 487, 487, 484, 478, 468, 455, 445, 441, 439, 441, 444, 449, 451, 446, 433, 418, 408, 406, 405, 395, 375, 361, 366, 381, 386, 375, 358, 350, 356, 369, 381, 388, 387, 383, 379, 378, 379, 386, 401, 419, 428, 424, 416, 419, 439, 466, 488, 494, 484, 465, 448, 438, 433, 434, 441, 454, 467, 480, 497, 524, 558, 588, 607, 617, 624, 625, 618, 605, 598, 599, 601, 592, 570, 543, 518, 497, 477, 460, 449, 443, 440, 441, 444, 446, 440, 421, 392, 355, 312, 267, 226, 197, 179, 167, 158, 153, 161, 183, 216, 253, 285, 311, 326, 333, 337, 345, 359, 376, 392, 407, 421, 432, 441, 451, 463, 472, 470, 457, 437, 418, 405, 400, 403, 413, 422, 430, 435, 434, 427, 418, 415, 419, 431, 448, 472, 500, 527, 549, 561, 559, 544, 522, 500]
4393E00j6pQK0K3J3jj1j2j1rrj0j2j4j0qmJJ0J3Nrj9k0k1k6k8j7JJ6K3K6K5K0J2JlKQJ2P%
4376D69pj3j5j1JJ4J9J5J0Nmj5k4k5j8oJMJjmk%J%KJ4L0L5K2KnjLkmLJ3J2NjjNPRLpj6j6p
4356E00KOLqk4l4k8rOJ1J0J2J8J6RNJ0J4J2Krj0rqpNK4L4K4MljM%pj2j8k2k1j5j6k3k6j9p
4338C95MOJpj3j0mJ%mrj3j4oPJ9K4K6K4J8Qlj2k3l1k7j5lnj0qJJ0J6K1K3J4ql3m3l2j1kpj2
4320B53lJ6K8K7J7J0MmpmLNKKJ0K6M2N0M4K5J1ONKkjkj0j7j7j0qj1j2rjRK1K7K3J3QNJnqm
4301E60LOMJlrj1j0j0j4j4j1rj1j3j2qlll%RJ8K4K3J5%k0l3l7k7j5mNJ8L1L9M1L6K1jj5j6
4284E42j0prpkkn%J5K4J5ok1k6k2j8j7k0k4k2rRK1K2J7J0nk1k5j8kQJ1J6K5L3L3K7J9J1jj5
4267E44k3j3LJ4J5J1Nlqnnj3k5k8j8j0j2j5j4j5k2k5rJ7L3L1K3K1K0J8J1%j2k3k5k0j3oKJ1
$$ y = [500, 484, 477, 485, 505, 528, 541, 540, 529, 517, 506, 497, 488, 478, 466, 452, 442, 434, 430, 431, 441, 454, 459, 450, 431, 411, 390, 364, 336, 319, 320, 336, 359, 385, 410, 430, 442, 443, 440, 442, 450, 462, 469, 469, 462, 449, 434, 423, 424, 438, 457, 472, 482, 487, 483, 468, 444, 419, 401, 395, 396, 400, 401, 400, 396, 394, 394, 395, 395, 397, 411, 441, 476, 498, 500, 495, 494, 497, 495, 491, 494, 507, 519, 524, 523, 522, 527, 534, 543, 546, 539, 523, 507, 500, 502, 508, 511, 503, 479, 445, 417, 408, 414, 425, 435, 447, 465, 481, 490, 495, 505, 519, 531, 533, 524, 514, 505, 497, 490, 495, 519, 553, 577, 581, 578, 577, 581, 581, 574, 562, 544, 522, 501, 486, 470, 447, 421, 402, 395, 399, 405, 406, 399, 386, 376, 372, 373, 373, 369, 360, 347, 333, 327, 334, 353, 377, 403, 427, 445, 453, 450, 438, 415, 384, 357, 342, 339, 334, 324, 316, 317, 327, 343, 364, 387, 401, 393, 360, 317, 285, 274, 272, 265, 253, 250, 266, 294, 321, 338, 348, 352, 348, 341, 337, 340, 345, 347, 349, 359, 385, 427, 477, 521, 546, 557, 563, 568, 570, 568, 567, 565, 555, 538, 521, 511, 503, 492, 480, 471, 470, 479, 500, 527, 550, 563, 571, 576, 577, 572, 564, 560, 563, 569, 573, 574, 571, 562, 551, 541, 531, 517, 503, 492, 483, 472, 459, 447, 439, 436, 433, 430, 430, 439, 457, 481, 504, 519, 519, 499, 466, 429, 402, 387, 383, 388, 406, 437, 476, 517, 553, 574, 573, 558, 542, 532, 525, 516, 509, 507, 505, 500, 500, 515, 539, 554, 548, 527, 501, 479, 461, 444, 424, 400, 378, 369, 378, 399, 421, 438, 448, 443, 422, 397, 379, 377, 385, 396, 412, 437, 470, 503, 530, 549, 560, 559, 544, 521, 508, 511, 525, 540, 551, 556, 553, 545, 540, 535, 522, 497, 469, 451, 441, 429, 414, 400, 385, 363, 338, 329, 346, 379, 410, 433, 454, 474, 492, 503, 503, 491, 468, 443, 423, 410, 404, 406, 417]
4251D17J6J6J4J2RKnpmnj1k2l1l0j8mORQJ0J2J2J6K5K9K2Opolpj5k0j4prj8k3j8qLJ0J2PJ
4233C82nppopqpjQJ3J0MNJ8L0L5L3K7J5Jj0j1pnnlRK1K3Rj0k8l7l5k2KK5L4K6J2kj0j5j5j0
4215D69kLNRJ4J1lj5j4lORJ4K2K6K3J5J0Qkj7l0k7pJ3K2J7Kj1k3k6k0j0llnpj1j7k1j8qLJ2
4197D10J2Plj1r%J2J7Rj0l2m6m1k4kK1L7M6M2L0J4Jqrpmmrj5j8j4qkKMJ2K2K3J3kj6k1k4k3
4179C72j4mKJJOJ6K0J8J4J1RKqj3nOQmj8j6oKLOROoj6j4jJ8K7K0Mn%J2J8J1LNJ3K3K3J3mj7
4160E51j8rKQJ4J8J7Qlrpmnrj3j4j4j5k2l0k7j4KQONONmj1j4j1qqj1rLJ6K1J2nj7j6pLRJ0
4141C90J3J8K6K9K2J2jrqjRJ4J3J0QQNjj1j5qNJ2Mqj6j4j1qomrj6j8j1pnomkJOJ4J8J6RN%
4122D68ppKJ9K8L0K2Rpj5j3j0j7l0l9l1j0J9M6N7N1L3J2mj4j7j2qnlmqj6k3k5k1j5qjLPJ7
$$ y = [417, 433, 449, 463, 475, 484, 486, 481, 474, 470, 465, 454, 432, 401, 371, 353, 349, 355, 364, 372, 382, 394, 406, 422, 447, 476, 498, 504, 497, 491, 488, 481, 466, 446, 432, 425, 416, 398, 375, 357, 349, 352, 362, 374, 381, 382, 377, 370, 363, 357, 350, 342, 335, 334, 342, 355, 365, 369, 374, 392, 422, 457, 490, 517, 532, 533, 523, 512, 505, 500, 495, 492, 501, 522, 545, 554, 544, 516, 479, 444, 422, 424, 449, 483, 509, 521, 519, 509, 494, 479, 469, 467, 470, 475, 484, 498, 509, 506, 491, 477, 474, 480, 489, 503, 525, 551, 574, 589, 599, 607, 605, 588, 558, 531, 524, 537, 559, 576, 578, 567, 544, 518, 498, 488, 485, 482, 477, 470, 459, 442, 421, 403, 395, 398, 410, 422, 429, 426, 415, 406, 406, 418, 435, 444, 434, 402, 356, 315, 291, 289, 310, 347, 393, 435, 465, 479, 480, 472, 463, 456, 452, 448, 439, 424, 406, 392, 384, 382, 384, 388, 400, 422, 445, 458, 456, 440, 419, 395, 372, 358, 354, 356, 357, 358, 364, 380, 400, 418, 432, 443, 452, 454, 446, 433, 428, 434, 442, 438, 420, 404, 398, 400, 403, 409, 418, 424, 418, 402, 388, 387, 405, 432, 452, 456, 451, 451, 463, 481, 492, 495, 500, 513, 536, 559, 572, 568, 551, 533, 524, 526, 534, 548, 566, 583, 591, 588, 579, 572, 568, 563, 554, 541, 527, 513, 498, 476, 446, 419, 405, 407, 415, 421, 426, 432, 437, 433, 422, 408, 397, 389, 381, 370, 361, 364, 380, 401, 413, 408, 391, 375, 368, 371, 380, 390, 403, 421, 447, 476, 498, 510, 509, 500, 492, 491, 500, 514, 527, 537, 545, 553, 558, 557, 546, 531, 523, 528, 540, 544, 536, 520, 506, 495, 487, 481, 477, 468, 452, 434, 423, 416, 411, 405, 401, 399, 400, 406, 420, 438, 454, 463, 468, 468, 461, 454, 456, 475, 503, 533, 555, 564, 557, 542, 529, 519, 502, 472, 433, 402, 392, 411, 457, 514, 565, 598, 610, 606, 592, 575, 563, 555, 550, 547, 543, 535, 519, 496, 471, 450, 435, 427, 426, 429, 436, 453]
4105D53L3M3L9K5J3Mpk3l4l1k1j0l%JMMMLNQJ3J0OMPPOONkj3j6pPJ3J0MJJjnppqj0j4j3j0
4085D97pj0k0k7k8k2j2l%oj8k5k0qJKJjJOPLmrqmMJ4K1J9J1MNRJ0OLJKJkoojLNOQJ7K4K8K3
4064D95J6J1J2J5J6RJmjKjoj2j7j8j4pjMPOjqj0jJ0J5Qqk5l2k0%J2RMMMjj1j7j6j3oLJ2J7
4046D42J7J8K2K1J0nj4j3oMJ0J2J2J0J0RMnj5k3k3k0j2kJ0J9K1J1j0l1m4m0k6j1mKJ1K1L0
4030D22L5L6L2K1Rlrj1j0olmmMJ6J9Qoj4j6j8k0j7j4j2j0mQJ7J6J0ONNQJ4J9K0J5Nlnllj0
4012E45j7k4k8l0k7j2MJ7J8J6J5J6K0K1J8J1Kknqj3j3mQJ0Kn%J9L2K9J7MKKMORMmrrpj1j7
3994F06j9j6j5j6j5j4j1kPJ2Nnqmmrj3j1mMJ1J6J4Jrj0jLJllLJ1J6J7Rok0l1l6l1k0pkoj4
3975C71j6qQK0K0J3PJ0J8K4K7K3J4PLmj2j7j3oqj3j3kJ2J7J5RKkLQJ1NJK%j2k0j8rnqoMJ1
$$ y = [453, 486, 529, 568, 593, 606, 610, 603, 580, 546, 515, 494, 484, 481, 481, 482, 486, 490, 494, 497, 502, 510, 523, 533, 539, 543, 550, 557, 563, 569, 574, 572, 559, 543, 536, 543, 556, 566, 570, 571, 572, 571, 566, 559, 552, 544, 534, 520, 507, 497, 490, 480, 460, 433, 405, 383, 371, 368, 368, 362, 344, 319, 299, 291, 292, 294, 295, 294, 295, 301, 308, 311, 307, 298, 290, 286, 290, 304, 325, 344, 355, 359, 364, 373, 383, 389, 392, 393, 395, 396, 394, 388, 382, 381, 384, 389, 395, 403, 420, 444, 472, 495, 511, 522, 534, 549, 565, 574, 575, 571, 570, 572, 571, 565, 553, 536, 518, 504, 497, 496, 500, 507, 513, 512, 504, 494, 493, 503, 518, 526, 518, 493, 461, 441, 441, 453, 462, 466, 470, 474, 473, 462, 445, 429, 416, 410, 413, 425, 442, 459, 477, 499, 520, 530, 525, 511, 498, 492, 496, 506, 518, 530, 540, 550, 559, 563, 558, 543, 520, 497, 477, 465, 463, 473, 492, 513, 524, 514, 483, 439, 399, 373, 362, 358, 360, 371, 392, 422, 457, 493, 525, 546, 555, 552, 543, 532, 522, 516, 513, 509, 505, 509, 525, 544, 552, 546, 532, 516, 498, 478, 461, 447, 435, 425, 421, 429, 446, 462, 472, 478, 483, 488, 496, 510, 529, 549, 564, 569, 566, 561, 558, 555, 545, 528, 504, 476, 446, 419, 407, 411, 428, 446, 462, 477, 493, 513, 534, 552, 563, 565, 563, 558, 550, 537, 524, 520, 528, 538, 540, 535, 535, 554, 586, 615, 632, 636, 638, 640, 644, 650, 659, 663, 659, 650, 641, 634, 623, 606, 587, 571, 556, 540, 525, 511, 500, 498, 505, 517, 522, 517, 509, 505, 501, 492, 479, 468, 464, 468, 479, 495, 509, 510, 501, 491, 490, 493, 494, 491, 488, 491, 502, 518, 535, 544, 538, 518, 487, 451, 420, 400, 393, 391, 385, 371, 355, 347, 355, 375, 395, 408, 415, 425, 443, 467, 494, 517, 531, 538, 541, 537, 525, 508, 495, 489, 481, 468, 455, 453, 465, 482, 497, 506, 508, 506, 509, 517, 528, 533, 534, 536, 536, 524, 504, 486, 477, 472, 464, 458, 462, 473]
3957D73J2RRNnj3j0pj3k7l5l0j8j6k3k9k8k1j1JJ3K4L0L5L9L5K4Onqqj0j4j5j0nkJMKjJPJ4
3939C80J3OLNJ2Rmj8k2j5nMQPLmlRJ8K1J6R%j1k1k1j5rnnJRJ5J8J1JooJMNPJ3J6J0pk2k7j3
3920C95PK2K7K1J8J5J2PNPJ0Njnqj2k0k5k0pRJ3Pnj7j8j2lJNJ3J9K1J4QJ0J3Rmj2j3j2j2j5
3902D72j3j1nLRJ0RQJ5K4K5J9Oj1k1j8mRJ4J5J8K1J6QMNMlj4k0k5k6k0qKNjj0j4r%J0J6J9
3884E33J3Lqj3mOJ1PLkqj4j6j3oKOQQRJ1QjqpklpnNJ0ONRJ3J2PM%nqnLLok1l4l5k6j0jjqj0
3862D18rppmQK2L3L6L0K0J4J0Lpj5j7j4j0mPJ4J0jj1r%Lnj8k3j7pnoqonJJ1J9K1J5Mnj2j6
3844D51j2NK2K9K2Qnj1q%N%j0k1k3j6%K1L5L2J5kj2j2onprnKMJmoj0j1q%Lmqo%Kj%PJ0M%N
3824D61J5K6L5L6K7Qj2k4k5k1j2nj%JLJpj7k2j9j5j2qkOJ0Mjnmqj6j8qJ0K7L8M3M2L6K5J8
$$ y = [473, 485, 494, 503, 508, 503, 490, 480, 473, 460, 433, 398, 368, 350, 334, 311, 282, 254, 233, 222, 223, 236, 260, 290, 325, 364, 399, 423, 429, 424, 416, 408, 398, 384, 369, 359, 354, 352, 353, 357, 359, 358, 359, 366, 380, 393, 399, 402, 407, 419, 428, 424, 406, 384, 369, 364, 368, 376, 383, 386, 382, 379, 388, 406, 427, 443, 452, 452, 441, 420, 399, 384, 375, 370, 365, 366, 375, 390, 408, 419, 420, 414, 408, 409, 413, 418, 425, 438, 454, 464, 457, 435, 408, 395, 402, 424, 451, 472, 490, 505, 517, 524, 529, 536, 546, 551, 550, 545, 537, 525, 505, 480, 460, 453, 462, 475, 482, 477, 460, 442, 430, 427, 428, 433, 446, 465, 486, 500, 508, 518, 531, 540, 536, 524, 511, 499, 487, 472, 459, 448, 443, 446, 455, 465, 474, 482, 497, 521, 546, 565, 571, 560, 539, 521, 517, 526, 540, 555, 573, 594, 610, 618, 622, 627, 631, 628, 614, 594, 569, 543, 523, 515, 517, 522, 521, 511, 497, 488, 488, 498, 514, 533, 546, 549, 541, 528, 524, 530, 541, 548, 551, 549, 541, 527, 511, 498, 492, 494, 500, 508, 516, 525, 536, 544, 543, 535, 528, 526, 523, 516, 511, 516, 526, 532, 537, 546, 559, 571, 578, 582, 582, 577, 569, 564, 567, 570, 564, 543, 509, 474, 448, 438, 437, 436, 428, 418, 409, 402, 395, 391, 399, 421, 454, 490, 520, 540, 554, 564, 567, 560, 545, 528, 514, 504, 500, 507, 521, 531, 530, 519, 510, 510, 513, 508, 490, 467, 450, 443, 438, 432, 424, 418, 413, 414, 425, 444, 465, 480, 484, 479, 467, 451, 439, 444, 466, 495, 517, 525, 520, 509, 501, 501, 506, 506, 496, 475, 452, 436, 436, 457, 492, 524, 539, 537, 525, 513, 507, 502, 495, 486, 481, 483, 487, 488, 484, 478, 468, 457, 449, 449, 452, 448, 440, 434, 434, 436, 435, 435, 442, 452, 456, 456, 461, 476, 502, 537, 573, 600, 608, 596, 572, 547, 526, 514, 509, 508, 508, 509, 512, 513, 506, 489, 467, 448, 433, 421, 413, 411, 417, 427, 431, 430, 425, 421, 413, 397, 379, 371, 381, 408, 446, 489, 531, 567, 592, 610]
3806F10J0Jnmj%lnmnplNNok3l2l3k8k3k4l0l2j9KK0K7J9J0MKLjj1k4k8j3J1L3M2L4J7%qj1
3788D72j0j0rqon%NJ1J6K7L6L7K5Rjorj1j3j3j7k1k4j9mJ6L2L5K6J7J2Lj4l4m3l9k8j7j0n
3772D03kklkKLKKNJ7L1L7L4J9Nmpponoj0j6k0j9j3j1j1j0lOJ2J4J4J8K1K5K7K7K4J4jk0k8
3754E56k0%J6K0J3Lqj9k7k7k5l0l7l0j3KKjPK6M3M4L2J3oj7k1k1j8j3kQJ6J8J4Krj1o%jjJ
3737D73LJjKLJkjKoj8j9lJ8L1L4L6L4K0ol2m1l4k4j9k0j5oLNNOQJ1J5K3L2L5L3K2Rkoopj0
3718E87j0j0j6k5k8j9rqj3j0JPJj0k0k6k5k0rKJ2J8K3K9L5L5K6Rmj2j8k4k9k5j8j5j3qPK1
3702C89K9K7J8Mnn%Klj0j2rJJ1J8J3JpmLLkmjMPNJornQJ8J9Pj3k9l1k5j4lPQ%j3j8j3kNPM
3682C76mj5k2j7nQJ6J8J6J5J5J6J4J1RJ0J6K3K9K8K2J2Jrk0l1l7l6k6j1%RJ1J3Pnj6j9rRK4
$$ y = [610, 620, 621, 616, 612, 611, 611, 608, 603, 599, 594, 587, 584, 589, 594, 588, 565, 533, 500, 472, 449, 425, 395, 363, 344, 346, 366, 393, 412, 422, 426, 428, 431, 430, 419, 395, 367, 354, 365, 398, 440, 474, 491, 491, 483, 472, 462, 452, 443, 435, 429, 424, 424, 429, 440, 456, 483, 519, 556, 581, 590, 589, 583, 574, 563, 550, 537, 520, 499, 475, 456, 452, 468, 500, 535, 561, 578, 590, 593, 579, 545, 502, 463, 435, 418, 408, 403, 401, 399, 396, 394, 396, 399, 401, 403, 408, 425, 456, 493, 527, 546, 551, 547, 540, 533, 527, 522, 516, 506, 490, 470, 451, 438, 427, 416, 406, 403, 409, 421, 435, 449, 467, 488, 513, 540, 567, 591, 605, 604, 584, 556, 536, 536, 552, 572, 585, 588, 580, 561, 534, 507, 482, 452, 415, 385, 372, 374, 376, 375, 382, 408, 451, 495, 527, 540, 534, 517, 496, 475, 457, 444, 442, 450, 466, 484, 498, 500, 491, 480, 474, 474, 473, 472, 473, 476, 477, 476, 478, 481, 482, 480, 479, 481, 475, 457, 438, 435, 453, 484, 518, 554, 588, 608, 602, 570, 529, 495, 471, 452, 432, 417, 411, 414, 419, 424, 430, 438, 449, 464, 487, 519, 554, 587, 609, 618, 616, 610, 604, 597, 587, 577, 567, 551, 526, 498, 479, 470, 462, 449, 439, 440, 447, 448, 438, 418, 392, 367, 347, 338, 340, 352, 370, 393, 422, 457, 492, 518, 527, 523, 511, 493, 469, 440, 415, 397, 382, 369, 361, 368, 389, 418, 445, 463, 467, 462, 457, 457, 459, 456, 446, 434, 425, 426, 437, 455, 468, 469, 462, 458, 461, 464, 462, 458, 457, 461, 468, 473, 474, 468, 459, 454, 462, 480, 499, 506, 493, 464, 433, 408, 394, 391, 398, 406, 406, 393, 375, 362, 360, 365, 372, 376, 372, 357, 335, 318, 313, 321, 337, 355, 371, 386, 401, 417, 431, 442, 451, 461, 477, 500, 529, 557, 579, 591, 592, 583, 563, 532, 495, 459, 433, 422, 422, 431, 442, 455, 462, 457, 441, 422, 413, 422, 446]
3665D46K8K4J5Nlj1k1l3l6l0j9pOK2L4L4K5J8J2Npj5j7j5j3oKRJ3K0K7L1K8J9J3Olk0l4l9
3649E13k8j1MN%nnopnJNONNJmpnmrj6k2k0j3MK2L1K7J8J0QJ0J1J0QOQJ1QJokPJ3J0Kpj6j8
3629E54j6oKLjrj3qjmj7l2m2m1l2j7mNNONLLJ2L0M2M1K5Qnj6j8j4rmJMlj2j6lJ4K6K9K8K4
3611E27J3lj0ojmj1j9j8j2pj1k1k5j6lJlqrokJlqpLJ1J2PNLpj8k0j5qlLJ5K5L0K9K5K0J8K0
3592D84K0J5QPPKqrjJ0J3Nrk8m1m1l3k3j6mQJ5J3QLkkNJ2J6J7K5L7L7K1Kopj4k4k3j6j2j6
3574D55k2j8p%jmnJPJ2J8K3K5K4K0J9J7J3Mllj%loj1j7j9j6j3j4j9k2k1j3kJ2K2K7K3J2KJ
3557D97J1K2K6J9Poj8k6l1k6j7q%%pj3j0LJ6K4K8L0K8K5K5K8K3RkJPLj2k9l6l7l3k9k0j0j
3540D61%oj6j9j4lNRJ2J6K0K5K4J6Krj5j1kRJ0Krj1mkj1k1j5JJ2J1KklJMKloomoj0j4j5j5
$$ y = [446, 474, 498, 513, 518, 515, 504, 483, 450, 414, 384, 365, 358, 364, 386, 420, 454, 479, 497, 509, 514, 507, 492, 475, 460, 447, 441, 443, 452, 465, 485, 512, 543, 571, 590, 603, 609, 606, 586, 552, 513, 485, 474, 478, 483, 483, 478, 473, 467, 460, 455, 456, 461, 467, 472, 477, 478, 474, 467, 462, 458, 449, 433, 411, 391, 378, 382, 404, 435, 462, 480, 490, 498, 508, 519, 529, 537, 543, 551, 562, 570, 571, 565, 563, 570, 583, 593, 595, 588, 572, 554, 538, 532, 534, 537, 536, 527, 514, 506, 505, 501, 484, 452, 410, 369, 337, 320, 316, 321, 326, 332, 337, 340, 343, 355, 385, 427, 468, 493, 501, 496, 480, 462, 448, 439, 435, 436, 440, 437, 425, 409, 406, 420, 446, 475, 503, 527, 540, 537, 527, 521, 520, 516, 505, 486, 468, 456, 449, 438, 417, 392, 376, 373, 374, 371, 363, 354, 348, 346, 347, 344, 336, 329, 332, 343, 355, 362, 367, 370, 363, 345, 325, 310, 302, 299, 302, 317, 342, 372, 401, 426, 446, 464, 484, 504, 519, 527, 534, 541, 543, 535, 526, 525, 535, 548, 553, 544, 516, 475, 434, 401, 378, 362, 358, 366, 381, 394, 402, 405, 403, 401, 406, 418, 434, 451, 476, 513, 550, 571, 573, 567, 560, 546, 522, 499, 483, 471, 455, 433, 415, 408, 408, 407, 403, 398, 399, 406, 418, 436, 459, 484, 508, 528, 547, 564, 577, 581, 578, 575, 574, 574, 571, 565, 554, 537, 518, 502, 489, 475, 456, 434, 413, 400, 398, 410, 432, 459, 482, 494, 496, 497, 508, 530, 556, 575, 582, 576, 558, 532, 501, 475, 458, 450, 450, 450, 443, 430, 420, 423, 439, 463, 491, 521, 549, 574, 599, 627, 650, 659, 657, 658, 665, 668, 656, 627, 591, 554, 521, 492, 472, 462, 461, 461, 455, 439, 420, 406, 403, 408, 417, 429, 445, 465, 490, 514, 530, 532, 523, 508, 497, 495, 504, 514, 516, 507, 496, 492, 490, 479, 458, 443, 444, 456, 467, 469, 467, 464, 465, 469, 471, 468, 462, 456, 452, 446, 436, 422, 407, 392]
3522C92j1nmpj1qLJ8L3M6N2M4K4Jj6k5k4k0j5j3qjJkqj1pjQJ7K0J9J6J5J0LkLJ2J7J4Mj2k5
3504E36k3rNJ1OKKMLKJOJ5K2J4qk3j7ljj3k4k6k5k6k2j4ojJ0K8M2M5L6J9Jj4k1k0j7j6j3j1
3487D57j0j2j3rlNJ0J1J3J3J2RJ1K3L7L8K2Jj0j7k4l3l5l6l6k6kK4K9J4LJjrqNJ4J2Lkqj3
3470D60j5rmj0k1k3j5jJ4K4K1J0looljKjrj1lRJ4J3J2RM%MJ1J5RLkoj0j4rOK8M1L7J9LjJj
3451E85pj0j0j1j0KJ6K4K0J1Mjpj9l0l5k7j4lOJ3J7J3jj4j8j4j2j0njKjmrj3j3mJ0J9K0J9
3434D78J9J8J4Onj9k4j9rmopnKJ0K0L1L3K3Nj3k6l1l1k8k3j4jJ3K7L6L9L1J2rk3l0k8j6lJ0
3417D53J8K2K4J9Nj3k4l1l7l4k0%J2J0KjkJPJ1J4J7K4K8K4J5PKlokPJ5J9J8J4Nnj4j6j2nk
3400E66jlLJ1J4Plpqj0j0mKjqrnj2k5l2k5j6j6j7j3lNNJjNJ4J9J4Njlj0k1k7k2j4oOK2L3K9
$$ y = [392, 381, 376, 372, 365, 354, 346, 349, 367, 400, 446, 498, 542, 566, 567, 551, 526, 502, 482, 467, 454, 446, 445, 446, 444, 436, 425, 418, 417, 425, 442, 462, 481, 497, 512, 522, 525, 523, 526, 538, 555, 569, 573, 561, 536, 513, 504, 509, 520, 526, 528, 530, 534, 537, 539, 540, 546, 561, 583, 597, 589, 566, 549, 546, 545, 532, 508, 482, 457, 431, 409, 395, 389, 388, 398, 426, 468, 513, 549, 568, 569, 555, 534, 514, 497, 481, 468, 457, 447, 435, 422, 413, 410, 415, 425, 436, 449, 462, 474, 483, 494, 517, 554, 592, 614, 615, 605, 588, 564, 531, 496, 460, 424, 398, 396, 420, 449, 463, 466, 467, 466, 457, 449, 454, 468, 480, 483, 481, 473, 460, 445, 436, 432, 422, 401, 378, 363, 362, 376, 400, 421, 431, 428, 422, 416, 413, 412, 414, 413, 404, 393, 390, 399, 413, 426, 438, 447, 451, 451, 455, 466, 481, 490, 493, 491, 485, 475, 461, 452, 458, 486, 527, 564, 583, 586, 585, 586, 585, 578, 568, 558, 547, 537, 539, 555, 579, 599, 610, 614, 613, 606, 587, 557, 522, 495, 481, 478, 484, 497, 514, 527, 526, 512, 494, 480, 468, 458, 453, 452, 454, 453, 449, 440, 427, 414, 410, 420, 439, 459, 478, 497, 515, 529, 535, 530, 511, 487, 468, 459, 455, 449, 442, 437, 439, 449, 469, 500, 533, 556, 561, 548, 522, 491, 460, 432, 409, 395, 394, 407, 434, 470, 509, 540, 552, 543, 520, 490, 462, 446, 443, 453, 471, 493, 517, 536, 541, 528, 504, 473, 436, 402, 382, 382, 394, 404, 406, 405, 403, 404, 411, 422, 436, 453, 477, 505, 529, 544, 551, 553, 550, 544, 542, 549, 564, 583, 601, 615, 620, 615, 601, 585, 573, 568, 566, 565, 562, 565, 576, 590, 597, 594, 587, 579, 569, 559, 555, 557, 556, 548, 539, 534, 522, 497, 465, 440, 424, 408, 391, 378, 375, 380, 385, 386, 385, 390, 404, 423, 437, 442, 441, 438, 428, 407, 380, 358, 344, 338, 344, 366, 399, 428]
3381D28J7PMLJlpj2j0mMPOMNJ3K1K3J5LkjK%mqj8k5k5j5mNJ4K3K9K7K3K2K5K5K0Rnj3j1om
3362F08pkOQjj5k5l1l2k9l1l4k6kK4L1J9J0J1R%nKRLrj4j0qonpqmJ0K3K8L3L6L1J2j2k6k3
3344E41qJ4L2L4K2Qjqk3m0m9m8m2l1j3MOJl%NNJnoNK4L2K4Oj1k1k4j6KK0K8K8K2Prj4jJ8K0
3326E36Qkpqj0mQJ5J1LmnjJjj0j7k0k3l0l2j8MJ8J5QMOJ3J9J7Nj1k1k1j6j3j0plLJ7K9L0K1
3308D97J0KormOJ3J0kj1j4pKOkj2j3rqrpqj6k7k8j7okKJ0J6J4Mkqj2j5j2jRJ4J0%j1j3pnq
3289C14j5j8rJ0K9L3J7nj9j8rMJ6J9J2NOJ1RLjKMNNPMKNJ2J5J2RPOMJ0J9K1J4PPJ3J7K0J6
3271F37Jj5k2j5nkjoj4k1k3k1k3k2qJ6L0K4Rlrj1qjkj1j6j2mJRK8M5M4K7Qqj9k5l2m0m2k8
3253D10mJ3J2LLPJ2J5J7J4Kj3k1k2j5JJ9K4Rrj5pJJ0K1K8K4J5Mnj7j8mJ9L3L6L3K8J9J0OK
$$ y = [428, 445, 452, 456, 459, 460, 457, 450, 438, 428, 424, 428, 435, 441, 445, 450, 463, 484, 507, 522, 525, 523, 522, 524, 524, 520, 512, 494, 469, 444, 429, 425, 430, 444, 467, 496, 523, 546, 568, 593, 618, 638, 647, 642, 629, 618, 612, 608, 601, 599, 605, 613, 612, 597, 572, 541, 509, 480, 449, 415, 389, 387, 411, 442, 461, 471, 482, 491, 491, 486, 488, 497, 500, 491, 477, 467, 459, 453, 448, 441, 433, 429, 439, 462, 490, 523, 559, 590, 602, 590, 564, 541, 533, 547, 579, 613, 635, 643, 642, 634, 611, 571, 522, 474, 432, 401, 388, 392, 398, 399, 396, 396, 401, 406, 407, 402, 396, 401, 425, 457, 481, 487, 476, 455, 431, 415, 417, 437, 465, 493, 515, 522, 513, 499, 498, 516, 536, 544, 542, 535, 527, 517, 513, 521, 536, 547, 550, 546, 541, 540, 541, 540, 530, 513, 493, 470, 440, 408, 390, 394, 412, 427, 435, 439, 445, 458, 477, 494, 499, 488, 467, 446, 430, 417, 407, 400, 397, 400, 417, 446, 476, 497, 507, 509, 503, 494, 490, 496, 509, 519, 517, 506, 492, 485, 487, 493, 491, 479, 466, 457, 449, 440, 433, 425, 409, 382, 354, 337, 331, 329, 331, 341, 357, 371, 375, 373, 365, 353, 338, 326, 325, 334, 348, 358, 358, 347, 334, 327, 322, 314, 299, 281, 272, 282, 311, 344, 361, 356, 337, 319, 310, 314, 330, 349, 361, 366, 372, 383, 392, 395, 394, 396, 400, 405, 410, 417, 421, 423, 428, 440, 455, 467, 476, 483, 489, 493, 503, 522, 543, 557, 564, 571, 584, 601, 621, 637, 638, 623, 601, 586, 581, 579, 578, 572, 558, 537, 514, 493, 470, 448, 440, 456, 486, 510, 519, 516, 507, 496, 488, 487, 485, 474, 458, 446, 442, 443, 452, 480, 525, 569, 596, 604, 596, 577, 552, 520, 480, 438, 410, 406, 419, 431, 434, 437, 444, 456, 471, 488, 502, 504, 491, 470, 448, 433, 434, 453, 477, 486, 477, 462, 455, 456, 466, 487, 515, 539, 554, 558, 553, 536, 518, 514, 533, 566, 602, 635, 663, 682, 692, 698, 700]
3236G00mj0j1j4k0k1rPJ1QJmj5l0m3n2n0l2lJ7J3kqjJ0J6K5L3L5K9J7%j7k7j8LJ6J8J6J5J1
3220F10N%jKKok4m2m3k2JRPNLoj8j9j0kPJ6K2J4K%PLj1k1j7j0rqopj1mRJ7J3MLRJ6K2K7K8
3201E66L1L2K4Jk9m7m8m4l5j8KJ3R%oj0j4pMJ3J4J5K0J8QJ%kj0j7j5j0j1j5j8j7j6rKOOPJ1
3183D05J2Lorj0qkJ1K2K8L4L6L0J7J3J6J4kj8k2j8j1lNO%lOJ4J1%j1j3kJ9L6L2Qrj3j2j7k2
3166E67k1k1k4k3j2lnj5k0k0j4%J7K7K1RMMMNRJ0MLQJ2ROJ0J0NMJ3K1J7QONjrqnrj7j7rrj3
3147E43j3pl%JjnnPK1K5K5K8L1K4Ppj5k0k3j5onj2j8j7rOK1K8K6J9Qj0k8l1k2j5k3k9j5PJ6
3130D89J5J5J5J0RJ6K3J8MJNJqroj5l2m6m8m4l4j3J6L7M3L9K3nk8l1j7olLJ0OnpKJ2J3J7K5
3112E10K8K1J0kj4j8oJ0J1KKJ3J5%j1j0mkNJ6K1J2jorj3j4qnonlmqrj0k0l2l2j6kknmmmMJ6
$$ y = [700, 696, 686, 675, 661, 641, 620, 611, 618, 629, 637, 638, 634, 619, 589, 546, 494, 444, 412, 409, 426, 439, 437, 429, 428, 438, 454, 479, 512, 547, 576, 593, 593, 576, 549, 531, 534, 550, 568, 584, 599, 610, 615, 615, 614, 616, 618, 612, 588, 546, 503, 481, 482, 491, 498, 503, 506, 500, 482, 463, 453, 451, 458, 474, 496, 510, 512, 512, 519, 522, 511, 490, 473, 463, 454, 446, 440, 433, 422, 418, 427, 444, 457, 461, 464, 473, 489, 511, 538, 566, 597, 629, 653, 654, 625, 578, 530, 486, 451, 433, 435, 448, 457, 457, 451, 441, 427, 420, 424, 437, 451, 466, 486, 504, 512, 513, 513, 511, 501, 484, 469, 459, 448, 433, 415, 398, 382, 373, 375, 381, 387, 394, 405, 417, 420, 414, 405, 395, 387, 385, 396, 418, 446, 480, 516, 546, 563, 576, 592, 606, 604, 586, 564, 546, 535, 532, 537, 543, 543, 540, 546, 560, 571, 571, 560, 547, 545, 564, 600, 632, 640, 631, 618, 606, 589, 567, 546, 525, 501, 478, 466, 463, 458, 443, 423, 403, 389, 389, 406, 433, 454, 463, 467, 471, 475, 480, 489, 499, 503, 506, 514, 526, 535, 541, 551, 561, 566, 570, 583, 604, 621, 629, 635, 640, 639, 630, 622, 617, 608, 591, 574, 565, 556, 543, 530, 523, 520, 520, 521, 520, 515, 510, 517, 538, 563, 588, 616, 647, 671, 678, 671, 656, 636, 613, 598, 592, 587, 575, 557, 540, 531, 537, 558, 586, 612, 631, 639, 629, 601, 570, 548, 533, 510, 481, 466, 473, 489, 504, 519, 534, 544, 553, 569, 592, 610, 614, 615, 620, 621, 613, 604, 598, 583, 551, 505, 457, 413, 379, 366, 382, 419, 462, 501, 524, 519, 491, 460, 443, 437, 434, 437, 447, 453, 448, 441, 443, 455, 468, 485, 510, 538, 559, 569, 567, 553, 535, 529, 539, 550, 552, 554, 567, 582, 582, 571, 561, 557, 555, 560, 576, 597, 609, 608, 602, 593, 580, 566, 558, 553, 547, 542, 539, 535, 527, 518, 508, 488, 456, 424, 408, 406, 404, 399, 395, 391, 387, 391, 407]
3093D07J9RJPJ6J9J6J2Jj3j8j4qjJ3K9L1J0j5k7k6k1j1nnro%kj1j5mLMPJ4J7J0RJ7K2J9J6
3076E17J9J4jj4j3poooj0j5j3%J1J2J1RMlLJ8K2QjLQJmjJj4l2l5k8k4j7o%jKJ6K7K0PMNOQ
3057D99J6J6Nnqj2k4k8j9ojRK6L4K3OK%qpJ0K1J1qj2ljnpqj4j3JJ0LpjPKoNJ7J3lpkkqoOJ1
3036E22PNLnj1okj1k4j7JJ1J1QJj1j7mJ1PljJ0J2J1K7M7M2J7jljJRJ5Oj1j2klqo%JLJ6K6J4
3017F85nlJ3J3jkLqk5k4okj7j5MJ5O%PPkkJ0J5NjLLJMJ2Mj0oJ0J0lnOOomJ7K5J1kj1l2n6n6
2997E91l0j2j0oJ1K1K3L9O5O4L2QNKj0nJ3J9MMJ8J6qj4RK4J3PJ7K0RJ4L6L9J6QL2M6L6M4Q4
2980A294J11R6P8P8P6N8P2J33J97K53L54N22P21R53J260J541J489Q81j01r80j411j394j147
2971E134q64o44m89l71k64j85j38j01o3m4n2m9j8Omj2J2L3K8L1P0J02J01J10J62K06K06K07
$$ y = [407, 426, 435, 436, 443, 459, 478, 494, 506, 507, 494, 476, 462, 454, 453, 466, 495, 526, 536, 521, 494, 468, 447, 436, 431, 426, 417, 411, 411, 409, 398, 383, 379, 382, 386, 393, 407, 424, 434, 443, 460, 482, 501, 517, 536, 550, 549, 535, 522, 515, 509, 503, 497, 487, 472, 459, 459, 470, 482, 493, 502, 506, 503, 506, 524, 546, 554, 553, 556, 564, 565, 561, 560, 561, 547, 515, 480, 452, 428, 411, 405, 405, 404, 406, 422, 449, 469, 476, 480, 485, 491, 499, 515, 531, 536, 531, 523, 511, 487, 459, 440, 434, 433, 442, 468, 502, 525, 531, 533, 533, 525, 518, 528, 549, 560, 552, 540, 537, 536, 531, 524, 516, 502, 489, 490, 500, 503, 496, 495, 502, 504, 498, 503, 520, 533, 530, 523, 521, 519, 511, 505, 511, 522, 529, 534, 537, 532, 521, 515, 513, 502, 478, 461, 462, 473, 484, 492, 493, 482, 465, 461, 472, 479, 476, 475, 485, 497, 508, 535, 582, 624, 641, 640, 637, 636, 637, 646, 661, 667, 656, 644, 642, 639, 631, 625, 625, 626, 629, 645, 671, 685, 680, 677, 690, 703, 702, 700, 703, 695, 670, 646, 640, 638, 621, 606, 610, 625, 631, 631, 638, 645, 643, 641, 651, 666, 671, 670, 673, 676, 677, 681, 693, 697, 687, 681, 691, 701, 698, 693, 699, 705, 699, 695, 712, 737, 748, 746, 735, 703, 647, 591, 561, 549, 539, 533, 544, 565, 588, 627, 692, 756, 788, 796, 801, 803, 793, 788, 801, 820, 824, 828, 846, 862, 854, 840, 849, 873, 886, 893, 910, 930, 939, 953, 989, 1028, 1044, 1052, 1084, 1130, 1166, 1210, 1294, 1405, 1501, 1579, 1657, 1733, 1791, 1863, 1996, 2193, 2446, 2800, 3322, 4043, 4996, 6256, 7797, 9286, 10167, 10066, 9086, 7675, 6281, 5134, 4270, 3626, 3137, 2766, 2502, 2317, 2179, 2078, 2015, 1971, 1919, 1870, 1852, 1858, 1854, 1842, 1854, 1887, 1915, 1946, 2016, 2118, 2219, 2329, 2491, 2697, 2903, 3110]
2960C110K48K80K78L12M40O00P52R95J415J976K663L550M424M513L051K62k572m173m285l559
2952A4280k713k039j527j135q52o61n21m06l07k31j78j28p9m9n1n3k7LJ0K5Q1J36J50J65K30
2942D123L06L44L73M41M96N03N66P90J111J444J913K692L756N073O777Q600R220O975J773
2934E7276m164q023q764p479n781m404l328k463j847j442j128q67o85n71m69l71k99k56k20
2926D715j75j27q2m1KN5R8J21J51K17K97L53M01M85N67O03O64Q61J179J547K058K889M063
2917B0901N537P447R636J0821R005L525l543q782j0362r155p147n464m154l079k300j806j426
2910I654j083q45p19o09m79l87l48l05k34j74j42j05m5J4M6O3Q4J23J74K25K77L40M12M78
2901F415N66P34R87J288J690K325L244M442O014P907R229Q304M191j821o846q856q175o499
$$ y = [3110, 3358, 3638, 3916, 4228, 4668, 5268, 6020, 7015, 8430, 10406, 13069, 16619, 21043, 25556, 28607, 28869, 26297, 22124, 17839, 14280, 11567, 9528, 8001, 6866, 6014, 5353, 4832, 4426, 4119, 3888, 3710, 3582, 3503, 3454, 3403, 3350, 3323, 3326, 3336, 3361, 3442, 3578, 3728, 3893, 4123, 4429, 4773, 5146, 5587, 6083, 6586, 7152, 7942, 9053, 10497, 12410, 15102, 18858, 23931, 30708, 39308, 48528, 55503, 57276, 53112, 45089, 36325, 28846, 23065, 18661, 15333, 12870, 11023, 9581, 8453, 7586, 6901, 6330, 5861, 5490, 5191, 4935, 4715, 4540, 4413, 4331, 4290, 4292, 4347, 4445, 4566, 4717, 4934, 5231, 5584, 5985, 6470, 7037, 7640, 8304, 9165, 10344, 11891, 13949, 16838, 20901, 26438, 33885, 43521, 54342, 63347, 66872, 63329, 54547, 44185, 35030, 27883, 22419, 18265, 15186, 12886, 11080, 9654, 8571, 7726, 7007, 6398, 5919, 5532, 5184, 4879, 4645, 4471, 4329, 4224, 4179, 4193, 4239, 4302, 4386, 4509, 4683, 4908, 5185, 5525, 5937, 6415, 6981, 7715, 8702, 9990, 11680, 14005, 17249, 21691, 27705, 35612, 44841, 53145, 57336, 55515, 48669, 39813, 31638, 25139]
2894B5139n010l848k864k125j668j333j009p73o63n80m55l50l06k64j88j36j39j35r5n7m8
2885C093k9J6N0M8M6P7J22J62K09K82L72M78O12Q08J102J516K066K809L738M505M334K610
2876B9026l03l050m395m245l420k644k048j536j137r04p49n76m25l43k85k02j46j52j64j27
2868B175q7q9r8p0l6l5m0j5Qkj5ML0L8M6Q2J22J46J78K48L47M63O21Q61J174J450J466J004
2857I976J00q59j408j425j164r12p27n56m10l33k84k12j40j17j17q8n6n8p3n7l4m1n4l4nj2
2847I00m1m9m1m8o1m9k2j3j3QK9J8pnJ6K0J4K1L1J7rrRJ5%qj0k1l1k4n%mKJ1Jj3j0Mjj1nJ2
2829F18RnJK2K8K0J8K1Pj6k0rj1k2k1pmrnJj0k5j9PJ7J1J2K5K9K1J6J3ol4m3l3k7k8j7JQk
2812E32j0j3k6m2m0j7%NJ6L1L1K0K0K9K6QlOJ2QNLj2l7m3k3rj1j5lJ0J4J4J2Kj5j8o%poRK1
$$ y = [25139, 20129, 16281, 13417, 11292, 9624, 8291, 7282, 6509, 5846, 5266, 4811, 4461, 4155, 3891, 3703, 3567, 3428, 3293, 3198, 3141, 3093, 3064, 3080, 3130, 3178, 3224, 3301, 3423, 3585, 3794, 4076, 4448, 4926, 5538, 6346, 7448, 8964, 11030, 13839, 17577, 22082, 26416, 29026, 28723, 25673, 21278, 17033, 13613, 10969, 8921, 7385, 6248, 5344, 4595, 4019, 3594, 3251, 2966, 2764, 2618, 2466, 2302, 2175, 2088, 1999, 1901, 1831, 1795, 1760, 1720, 1705, 1713, 1711, 1696, 1700, 1730, 1768, 1814, 1896, 2018, 2164, 2342, 2590, 2937, 3400, 4021, 4882, 6056, 7506, 8972, 9976, 10076, 9217, 7809, 6384, 5220, 4308, 3581, 3025, 2615, 2282, 1998, 1786, 1646, 1529, 1412, 1324, 1268, 1210, 1137, 1080, 1046, 1005, 951, 917, 912, 900, 859, 810, 769, 721, 660, 611, 589, 576, 563, 571, 600, 618, 611, 606, 622, 642, 656, 677, 708, 725, 716, 707, 716, 731, 731, 723, 713, 692, 661, 637, 632, 632, 628, 630, 641, 642, 629, 619, 623, 622, 611, 606, 618, 627, 622, 623, 645, 673, 693, 711, 732, 739, 723, 703, 694, 683, 661, 640, 633, 629, 620, 615, 616, 606, 581, 562, 569, 586, 597, 609, 634, 663, 684, 700, 713, 707, 673, 630, 597, 570, 542, 525, 526, 534, 532, 522, 509, 483, 441, 401, 384, 384, 389, 405, 436, 467, 487, 507, 536, 562, 570, 567, 573, 585, 593, 598, 601, 589, 552, 509, 486, 477, 466, 451, 448, 458, 472, 486, 498, 500, 485, 467, 461, 461, 454, 448, 457, 478]
2795D78J5PJnj3pJ2K2J6J0J5J5Jj1j3roPK6K9J3KJmk5m2l8k7k6k3qRJ7K0K9L0J8Kmj0k2k6
2778D76k2j8k4k6j4KJ1K3M2M9L0Kj0rqrlJllJ0K1J7PKjnpJLrj7rJ0J6Rjj4k2k3j4qj8k4j7
2760C94nqj6j7rokOJ2RNJ1K1K2J2PJ1J4J8K2J9Nj5k8l2l0j8MK1J8J1J1J2Lpp%komNJ0J2J5
2743D98J0pk6k8k1j5rNK1K0Mj5k6l3l1j6LJ6K8M1M3K6NllorkQMj3k7l0k8k1mJ4J4JkMJ1RR
2725D19J1Npj2mPJ3J6J6QknlJNJ6K2J5Jl%jojJ0J3Nmrj7k8l0k1j3j1j0j1j3j4mN%j2j2MJ7
2706C56K2K5L0K9K0J3Rnk3l0k1j3j2nJ4K6K1J1Ljrj4j0lLRJ8K0J9J9J8Pqj1jLl%J2K0Rlmo
2689E54k1l7l7k3rLJ0J1Krj1lQK3L6L3Ok4m1m0k9j2QK3K9L1K6Rk0l7l4k0j0qmOJ4K2K3J2j0
2672D50k4k3j5mJ0K8L5K4P%JJmmmj1j7j7j6j6j4lOOjlJjqj2rlKQJ0NjjPJ2J2RONOPJooOJ4
$$ y = [478, 493, 500, 501, 496, 483, 476, 488, 510, 526, 536, 551, 566, 567, 556, 543, 534, 528, 535, 561, 590, 603, 605, 606, 602, 577, 535, 497, 470, 444, 421, 413, 422, 439, 459, 488, 518, 536, 538, 534, 524, 502, 476, 454, 436, 412, 386, 372, 374, 385, 408, 450, 499, 529, 531, 521, 512, 504, 495, 492, 493, 490, 487, 497, 518, 535, 542, 544, 543, 538, 531, 532, 535, 526, 509, 500, 510, 526, 535, 534, 520, 498, 475, 461, 453, 435, 411, 394, 389, 381, 365, 348, 339, 333, 331, 337, 349, 358, 363, 374, 395, 417, 429, 436, 447, 461, 479, 501, 520, 525, 510, 482, 450, 420, 402, 406, 427, 445, 456, 467, 479, 482, 475, 468, 468, 466, 460, 456, 461, 471, 483, 498, 508, 501, 475, 447, 426, 411, 402, 407, 428, 448, 452, 437, 411, 378, 347, 331, 334, 350, 378, 419, 462, 488, 493, 490, 487, 481, 472, 470, 478, 482, 469, 442, 412, 384, 363, 359, 373, 387, 388, 386, 390, 401, 410, 419, 430, 435, 428, 416, 412, 419, 432, 448, 464, 472, 470, 465, 462, 463, 468, 484, 506, 521, 522, 519, 519, 518, 512, 511, 521, 534, 539, 535, 526, 509, 481, 451, 430, 417, 406, 396, 385, 372, 358, 354, 359, 359, 347, 335, 339, 356, 378, 403, 433, 462, 482, 495, 504, 499, 476, 446, 425, 412, 400, 395, 409, 435, 456, 467, 470, 469, 460, 446, 436, 433, 436, 445, 463, 483, 502, 521, 539, 546, 538, 527, 526, 529, 526, 526, 538, 558, 567, 564, 560, 554, 533, 496, 459, 436, 427, 430, 440, 451, 453, 444, 433, 430, 438, 461, 497, 530, 536, 512, 471, 431, 402, 390, 398, 421, 450, 481, 507, 516, 496, 459, 425, 405, 395, 387, 383, 389, 403, 425, 448, 460, 450, 426, 403, 388, 384, 394, 422, 457, 481, 488, 488, 489, 490, 486, 482, 478, 467, 450, 433, 417, 401, 387, 384, 390, 396, 395, 392, 393, 392, 384, 372, 363, 360, 362, 370, 380, 385, 384, 383, 390, 402, 414, 423, 429, 434, 440, 447, 448, 442, 436, 442, 456]
2652D56J0KjJkj0j3j1pmloj0jJ7K8K7K0J8J8Poj7k3k2j4LJ1OjMNpk2k4j3rj1r%QJ6K7L5L0
2634E03J6PLlj1j5j7k4l1k3oRQKknojOJ0QJ1J8K2J9J2%j6k6j8mL%LJ4J8J0Kmj3k2j8lNkqj
2615D30RNoj2j4j2oJNKmjNJ2J9K0J0jlNJ5K1K3K6K2J2Mkj2k4k5j3%MJ2K5L4K8J3Kqj6k0j6
2597E69j1j2j7j8j4jJ5K8K7J1oj2j1j0rmjjoqj0j5j8j5lJ0K1K3J3krj2j6k8l3k4j5j0nJ0K6
2581C97L2K5J8J0Jnlkoj5j6j2%J5K5K0MolNMkoj1j9k2j7pkOK0L1K4Pk%QJ3J5J0%rj1qp%J3
2562E12K2J6kj4j8j9k1j9j2mLJ0J9J8Pnj6k1k0j0kjjQK4L4L2K1RK%Kjj1j8j3kJkJJ5K2J6K
2544E64j0j4j3q%LLJok0k8k1lJ0J3J4J5J1kj3j1LJ3J4Mqj2qjkpolpj6j7mJ6K9K6Rj0k3k1r
2526D45kJ%MJ0J6K4K4J6M%%jpj0j3j7k0j2kLkojKKmj5l2m2l3rJ1J9K1J9J1lj5j6j6j4j2n%
$$ y = [456, 466, 468, 467, 468, 466, 456, 443, 432, 425, 421, 418, 412, 402, 401, 418, 446, 473, 493, 511, 529, 536, 530, 513, 490, 468, 454, 457, 468, 474, 473, 477, 482, 475, 453, 429, 416, 407, 396, 387, 387, 395, 411, 438, 473, 503, 519, 526, 529, 526, 515, 500, 483, 459, 428, 405, 399, 408, 416, 418, 416, 411, 405, 404, 410, 420, 428, 439, 457, 479, 498, 510, 510, 494, 468, 450, 446, 449, 449, 452, 466, 484, 494, 496, 492, 479, 457, 439, 436, 441, 439, 431, 430, 439, 444, 438, 426, 412, 400, 394, 395, 400, 402, 398, 397, 402, 414, 433, 453, 463, 462, 459, 464, 479, 500, 523, 549, 571, 583, 587, 585, 573, 549, 524, 511, 511, 515, 527, 552, 586, 614, 627, 629, 621, 605, 585, 569, 558, 546, 529, 511, 497, 496, 511, 539, 566, 577, 571, 559, 548, 538, 529, 525, 524, 523, 517, 509, 499, 484, 466, 451, 448, 458, 479, 502, 515, 513, 504, 492, 476, 448, 415, 391, 376, 366, 361, 371, 397, 429, 454, 472, 482, 483, 478, 475, 473, 467, 452, 436, 424, 424, 439, 464, 484, 488, 482, 479, 484, 488, 486, 480, 469, 450, 428, 411, 404, 402, 408, 428, 459, 483, 490, 488, 488, 496, 509, 524, 534, 534, 525, 514, 506, 499, 499, 512, 534, 550, 548, 534, 516, 497, 476, 457, 445, 441, 444, 454, 473, 491, 498, 493, 477, 456, 436, 426, 424, 423, 422, 430, 454, 488, 520, 541, 550, 552, 552, 554, 553, 542, 524, 511, 509, 510, 508, 509, 524, 546, 562, 564, 554, 540, 527, 519, 519, 522, 525, 526, 520, 500, 472, 451, 448, 458, 471, 485, 500, 511, 509, 496, 485, 488, 501, 515, 519, 511, 499, 491, 490, 488, 481, 475, 472, 465, 449, 432, 428, 444, 473, 499, 508, 498, 475, 454, 445, 443, 444, 444, 448, 458, 474, 498, 522, 538, 542, 542, 542, 541, 534, 524, 511, 494, 474, 462, 460, 463, 461, 455, 454, 456, 458, 454, 439, 407, 365, 332, 323, 334, 353, 374, 393, 404, 401, 386, 370, 354, 340, 328, 323, 323]
2508C23NJ6K8K4Lk0k8k5k4k1rJ0K7M1N0M7K8QmnmMJ5J7OpoORLJKPJ1J6K0J6J1QQLoj1rolj
2489E84%oj5j6j1olkkpj0j2j2j0mQJ9J9Ppj4j1n%%j%Lkrj0%POj%QRQOJ0Pjrj4k0l0m0l5k1
2469C55jJ6K6K7K1J1kj3j5oQK0K3J7LpkRPoj5oJ0J9J3MmpmPJ6J1JkLJ1J6K3K4J4mj2mPNmj4
2450E99k0j6jJ5K1J4NPJ1J1OJj0k6m1m2l2k1j3oMJ1J4J2Ook0k6k4j8j5j4j2qjMMKJNJ1J6K1
2433D29K0J5J0Kpj8k3k1j2jRJ6J6J1QJ1Q%qoOJ6J2M%kkJNLqj9j4LK0K3J1jppqj1j1mLjj1j5
2414D45j4j2j3j1mPJ7K5K9K5J6Okn%J1J9J8J2Loj8k6k7j8j0nNK0K9K3Orj6j4oJkj4j8qPJ3
2396D79PjkKLPJ2J7J3Kj1j6j4rjRJ8J8OprmjJJ0K3K6J5jj4k1k4j9qNJ2J3J0lk0l3l7l0j7j
2378D05J3J8R%j0j4j2lJ3K1K4K1J8Pl%J8L2K5J0KJnj7k2k1j7j9k1k3k1j3%RJ0OJnj2j3%J9
$$ y = [323, 328, 344, 372, 396, 399, 379, 351, 326, 302, 281, 272, 282, 309, 350, 400, 447, 475, 483, 479, 474, 470, 474, 489, 506, 512, 505, 499, 505, 514, 517, 518, 520, 527, 538, 554, 574, 590, 601, 609, 617, 620, 614, 603, 594, 588, 585, 584, 584, 578, 563, 547, 536, 530, 527, 525, 523, 516, 506, 494, 482, 472, 468, 476, 495, 514, 521, 514, 500, 489, 484, 484, 484, 483, 483, 486, 484, 475, 465, 465, 472, 478, 477, 477, 485, 494, 502, 508, 518, 525, 524, 515, 501, 481, 451, 411, 376, 355, 354, 370, 396, 423, 444, 455, 453, 440, 425, 419, 427, 447, 470, 487, 490, 483, 481, 490, 497, 491, 476, 470, 480, 499, 512, 516, 512, 505, 501, 508, 524, 535, 536, 534, 537, 548, 564, 587, 611, 625, 621, 609, 605, 612, 617, 613, 599, 579, 563, 562, 577, 598, 612, 617, 624, 635, 646, 652, 653, 643, 617, 576, 534, 502, 481, 468, 462, 466, 477, 491, 503, 509, 503, 483, 457, 433, 415, 400, 386, 374, 366, 365, 369, 373, 375, 376, 381, 392, 408, 429, 449, 464, 474, 476, 469, 451, 428, 407, 395, 394, 403, 419, 435, 446, 454, 465, 473, 473, 465, 459, 465, 481, 493, 497, 497, 495, 493, 494, 499, 502, 494, 475, 461, 464, 484, 507, 518, 517, 510, 503, 495, 484, 473, 469, 472, 471, 460, 445, 431, 419, 406, 395, 391, 398, 415, 440, 469, 494, 510, 516, 514, 509, 509, 520, 539, 557, 569, 572, 566, 548, 522, 495, 477, 467, 462, 467, 487, 516, 539, 545, 536, 520, 506, 500, 501, 499, 485, 467, 459, 466, 479, 486, 485, 483, 485, 488, 495, 507, 524, 537, 539, 528, 512, 498, 489, 488, 497, 515, 533, 539, 532, 523, 519, 518, 519, 529, 552, 578, 593, 592, 578, 557, 533, 514, 506, 511, 523, 536, 546, 543, 523, 490, 453, 423, 406, 405, 418, 436, 445, 445, 435, 421, 409, 406, 419, 440, 464, 485, 503, 510, 507, 507, 525, 557, 582, 592, 594, 595, 590, 573, 551, 530, 513, 494, 473, 450, 429, 416, 416, 425, 435, 441, 442, 437, 425, 412, 412, 431]
2362D31L2L6L3K5J5QQJ0Lrj7k3l0l1j9%J5J6J2PJjOJ4J6Plrj9l2l9l0j7pJJ3K4K6J9PkkNJ2
2344E12J2OKNQNmj0j2j3j6j7j8j5j1nLRJ1PjmkjjmmJJ0J8K6K9K9K6K0Pj0k4k7k3j8j3mPJ4
2326E10J4J3J1Noj8k7l4l5k5j0kmppljKNONOJ1K3L1L4K8K0J6J7J4LqpLJ0RRJ0J0Kpj2j0ro
2307E89kknpnJQQLoj8k3j5oLRJ4J7J3OLLKjkKJ2J8J3mj7j9roj6k4k6k0k0k2k4k5k4j9kK1L3
2288D09K9J0rj7pJ4K7K9K2J3Mrj6j5j2j6k0j5LJ8K4K2J9J6J0OKJlpj3j5j2nLNNMJmj0rppj0
2270D58j0qj1j3qNJ5J4OjnlJMJomRJ6Rpj2lNKopljoj7k4k4k0j6j1qqj6k5k7j4J2L9O0O7O1
2251D60M2K0%qpmmj4k7l9m6m3k7mJ5J9J3OPJ4K0J9Qkokjpj6j2JJ0RL%kk%NOMknnklnjJ4L2
2231D31M1K8Rpj2j5j8j8j2mJOJ0J0QOONKoj2j8k4k8k8k5k0j0OJ9K3K5K7K9K5J5NKLKJLJ0J6
$$ y = [431, 463, 499, 532, 557, 572, 580, 588, 598, 601, 592, 575, 552, 522, 491, 472, 472, 487, 503, 515, 522, 523, 522, 528, 542, 558, 565, 562, 553, 534, 502, 463, 433, 416, 409, 410, 423, 447, 473, 492, 499, 497, 495, 500, 512, 524, 530, 532, 537, 545, 550, 546, 536, 524, 511, 495, 478, 460, 445, 434, 429, 432, 441, 452, 459, 458, 454, 452, 451, 450, 446, 442, 443, 453, 471, 497, 526, 555, 581, 601, 608, 598, 574, 547, 524, 506, 493, 489, 496, 510, 524, 537, 548, 553, 547, 529, 502, 468, 433, 408, 398, 396, 392, 385, 378, 375, 374, 376, 381, 387, 392, 398, 409, 432, 463, 497, 525, 545, 561, 578, 592, 595, 587, 580, 583, 593, 602, 611, 621, 631, 633, 626, 614, 604, 595, 589, 587, 585, 580, 573, 568, 569, 577, 585, 588, 582, 564, 541, 526, 520, 523, 532, 546, 563, 576, 582, 585, 588, 590, 589, 587, 589, 601, 619, 632, 628, 611, 592, 583, 577, 561, 537, 511, 491, 471, 449, 425, 400, 376, 357, 355, 376, 409, 438, 448, 439, 422, 415, 429, 456, 485, 507, 520, 524, 515, 499, 484, 472, 456, 436, 421, 424, 442, 466, 488, 507, 523, 533, 539, 541, 542, 539, 532, 519, 504, 492, 487, 490, 495, 500, 504, 505, 501, 491, 482, 475, 468, 458, 448, 440, 429, 416, 408, 413, 428, 442, 448, 447, 442, 439, 440, 444, 445, 439, 435, 444, 460, 469, 462, 450, 447, 452, 454, 448, 441, 438, 437, 431, 414, 390, 366, 346, 330, 319, 311, 303, 287, 262, 235, 221, 233, 272, 332, 399, 460, 502, 522, 522, 514, 507, 503, 499, 485, 458, 419, 373, 330, 303, 299, 314, 333, 346, 352, 359, 373, 393, 412, 420, 418, 412, 410, 409, 402, 386, 374, 375, 385, 394, 397, 397, 395, 393, 393, 398, 404, 408, 406, 401, 396, 394, 391, 386, 385, 399, 431, 472, 500, 509, 502, 490, 475, 457, 439, 427, 423, 424, 430, 440, 450, 458, 464, 470, 475, 477, 471, 459, 441, 417, 389, 361, 336, 316, 306, 312, 331, 354, 379, 406, 435, 460, 475, 480, 482, 485, 487, 488, 491, 501, 517]
2214E17J5NmlKkj6l3l7l0j7mMJ0J4J8J8J2N%%KMOROmj3j1lKK%jlkMJ2J1Krj6j7j3kJ0J6J3
2194D79Lnj0j6j7j0MJ4J3MlnkjJKKMQJ4J4Nqj4j2lOJ1Rkj4k2j9j2nJPP%ljOJ2J5J5Oqk2k9
2175D19k6j6JK1L2K4jk3k8j6%QJ2J9K8K9J9Nkk%koj0qkQJ7K3K1J8J0pk5l2k1lMLJLMmj2j3
2157D70nPJ1Kj2j7j1npj0mNRMrj8k1j8qMJ4K2L1L8L6K2Kj4k0j8j2rqqnJKKLOMmj4j5mJ2K4
2138D55K4J8J0QLoj4j7j3j1ro%Mjopmkpj1j1okmprkPJ0NmroKJ1J5J4QONKlnjQJ5K0K1J4Jj0
2117D93qjNLknjKNkj4k2j8oQJ3J0MKOJ1J1Plj3j7j3oklkNJ3J1Lqj6k1k2rJ2K8L5L1K4J2%q
2098E32pnprnNJ1J0Kkl%MQJ0Mpj5j5j0j1k3l2l3k5k0j6qJPPQJ5K0J9J3J0PKJOPLkKRJ1QJ0
2078D97J3Q%%J0J9J8J5J6J8J0mj9k7k6k2j2kL%npnrj7k6k6j9j3j3j5j5j2oOK1L2L1K2J2Ol
$$ y = [517, 532, 537, 533, 530, 532, 530, 514, 481, 444, 414, 397, 393, 397, 407, 421, 439, 457, 469, 474, 474, 474, 476, 480, 486, 495, 501, 497, 484, 473, 470, 472, 474, 474, 473, 470, 468, 472, 484, 495, 497, 488, 472, 455, 442, 440, 450, 466, 479, 482, 477, 467, 451, 434, 424, 428, 442, 455, 459, 456, 451, 449, 448, 449, 451, 453, 457, 465, 479, 493, 498, 490, 476, 464, 461, 467, 478, 487, 485, 471, 449, 430, 418, 413, 414, 421, 428, 428, 425, 424, 430, 442, 457, 472, 478, 470, 448, 419, 393, 377, 378, 399, 431, 455, 454, 431, 403, 387, 387, 395, 407, 426, 454, 483, 502, 507, 505, 503, 503, 501, 495, 485, 477, 475, 483, 500, 523, 544, 562, 572, 565, 540, 508, 487, 484, 488, 491, 492, 495, 499, 495, 483, 470, 465, 472, 483, 485, 473, 456, 445, 440, 433, 423, 419, 424, 433, 437, 428, 410, 389, 371, 363, 367, 381, 403, 434, 472, 508, 530, 532, 518, 498, 480, 468, 459, 451, 443, 438, 439, 441, 443, 446, 452, 456, 452, 438, 423, 419, 431, 455, 479, 497, 507, 515, 518, 512, 498, 481, 468, 457, 448, 442, 442, 446, 445, 439, 432, 428, 426, 419, 408, 397, 391, 389, 385, 378, 369, 367, 374, 384, 389, 385, 376, 370, 372, 383, 398, 412, 420, 426, 431, 433, 430, 425, 424, 432, 447, 467, 488, 502, 503, 493, 485, 484, 489, 492, 490, 485, 484, 486, 491, 489, 475, 453, 435, 429, 437, 450, 460, 464, 466, 472, 483, 494, 501, 498, 485, 468, 455, 449, 447, 444, 442, 447, 460, 471, 474, 466, 450, 429, 407, 398, 410, 438, 473, 504, 528, 540, 540, 532, 525, 520, 513, 504, 499, 504, 515, 525, 527, 525, 522, 522, 526, 534, 544, 548, 541, 526, 511, 501, 490, 467, 435, 402, 377, 357, 341, 333, 334, 341, 348, 356, 371, 391, 410, 423, 433, 440, 442, 443, 449, 456, 459, 457, 459, 468, 479, 487, 497, 510, 518, 518, 518, 528, 547, 565, 580, 596, 614, 624, 620, 601, 574, 548, 526, 514, 512, 515, 515, 510, 503, 498, 489, 472, 446, 420, 401, 388, 375, 360, 345, 333, 327, 333, 354, 386, 417, 439, 451, 457, 454]
2061D54j2j7j4mJ0K8L8L3J5%kKKoj4j5oPJ5J2NLJpj9k5k1rKJ1J4J3Kj0j7qPK0K6K8L1L0K0
2044F23Npj1rpl%%oj0nJjqj1nMOJ0J0Mj3k7k5j2jPJ2J6J8J7J4Mqk1k5j9j4pJJ4K2J8Npj0o
2025E33nrj4j7k2k7k8j6LJ7K2K1J6J1OLkj1k5k7j7%J4J7J2Jj2k4k4j3LJ3J3OjjOJ1J3J2J2
2009D70J0MLMM%nqnJRK0K6K3J8J7J5Mj3k2j5ollJRRL%KQJ2J3J3J3QLlj2k3k9k7j5opj3j4n
1989D88NJ2J4J2RNK%nj6k7k5j0J1K2J9RKMJ3K1J9Lj7k6j8jJ1J0NJLMPQPOJkoj1j1j1j1j4j7
1971E05j5rlOJ7K8K8J8Omj1j8k2k0j4lPJ6J9J6J0%j3j9j4kPPRJ7K3J5jj6k6l1l1k6j8j3qj
1954D16KJjLJ0RMmrrmQJ5J3Mmorj1j0mMRRKqj2kJ5K5K3J8J4J0Jqj4j8j9j8q%MJloomkKOJ4
1933D43K0J9J0LKRJ0%j6k7k7k0j0JJ2J9J9J5J2RPMM%rj9j9oJ1J9J7J1OJ%RJ8J6MqrrrpKJ7
$$ y = [454, 442, 425, 411, 407, 417, 445, 483, 516, 531, 531, 529, 531, 533, 527, 513, 498, 492, 499, 514, 526, 531, 534, 535, 528, 509, 484, 463, 454, 456, 467, 481, 494, 496, 486, 469, 461, 468, 488, 514, 542, 573, 603, 623, 628, 621, 610, 601, 594, 591, 591, 591, 585, 575, 570, 571, 570, 562, 551, 546, 550, 556, 566, 576, 580, 567, 540, 515, 503, 502, 509, 521, 537, 555, 572, 586, 590, 582, 561, 536, 517, 503, 496, 497, 511, 533, 551, 556, 549, 539, 533, 528, 519, 505, 488, 466, 439, 411, 395, 398, 415, 437, 458, 474, 485, 491, 494, 492, 481, 456, 429, 412, 412, 426, 443, 455, 456, 444, 420, 396, 383, 386, 399, 412, 418, 417, 416, 422, 433, 446, 458, 470, 480, 484, 487, 491, 495, 495, 490, 482, 477, 478, 487, 507, 533, 556, 574, 591, 606, 610, 597, 575, 560, 554, 551, 548, 549, 558, 567, 570, 570, 572, 580, 592, 605, 618, 631, 639, 642, 639, 627, 604, 575, 548, 533, 527, 520, 507, 493, 488, 493, 505, 519, 531, 540, 545, 547, 547, 542, 526, 499, 474, 464, 475, 497, 516, 525, 527, 531, 544, 565, 584, 587, 570, 544, 526, 525, 536, 546, 551, 552, 555, 559, 566, 574, 581, 587, 588, 586, 580, 569, 558, 547, 536, 522, 505, 490, 481, 478, 484, 501, 529, 557, 575, 581, 577, 566, 548, 526, 506, 492, 489, 496, 512, 531, 547, 557, 557, 544, 525, 511, 509, 516, 523, 532, 549, 572, 587, 586, 570, 544, 513, 482, 456, 438, 425, 417, 416, 418, 419, 418, 421, 431, 440, 444, 440, 431, 422, 418, 426, 441, 454, 458, 454, 448, 439, 428, 418, 414, 418, 427, 436, 438, 430, 418, 416, 431, 456, 479, 497, 511, 521, 522, 514, 500, 482, 463, 445, 437, 437, 441, 442, 439, 433, 427, 423, 421, 423, 429, 443, 463, 482, 492, 495, 497, 506, 516, 516, 500, 473, 446, 426, 416, 417, 429, 448, 467, 482, 494, 503, 510, 514, 518, 518, 509, 490, 471, 465, 476, 495, 512, 523, 529, 530, 530, 539, 557, 573, 577, 569, 560, 551, 542, 535, 537, 554]
1915E54K9L3L2K5J4kj9k6k1j0mrj6k1k1k1k3j9j1nllJOPLknmmoqj1j7j9j9j2nnj0j8j8pQK1
1897C29K7K7K8L0L2K4NplJ2K3K3J8J1ok6l6k9j1OJ3J1MkJJ1J8J3kj5k4k1rNJ0N%oj5k8l2j9
1880C95kKpj7k1j4nKNOOPNlqlLLllLJ0J5J8J2MJOJ4J4RRJ4Rmj3qNJ4J8J8J5Noj4j4mJ1K4K6
1860E59K0J2Mmj3j3oKMMjj3k3k7k3j2KJ9K9K2Mj4k2k2j5lQJ2J2Ojj3k3k4j7j2j0%K2L7L2J0
1843E09prkPJ3J1jj6k3k3j9j0LJ5J8J0NLmj4k2k4k1j9j5nOJ2J7K5L2K7J0pj2qoj1j5j4j1r
1826C96r%J2K2K1J9J2%j3j7rJkj0j5j0%QJ4J5Nqj1qmqj2j0lMJ2J9J9J0jn%ORJ0J0QOKjmmq
1807D68j2j9k4k4j6qopmJ0K7L4L0J7Ojpj1j5j4j1rrj2j6j7j3kOJ2J3J6K1K2J4nk3k6j2RK2
1790D04K5J8J2PLJLQQNlj0j2rmMJ1J3J3J0RJ1J1PNMMNNPQOMjj1k2k8k8k5j9j0PJ7J6NkKQJ4
$$ y = [554, 583, 616, 648, 673, 687, 685, 666, 640, 619, 609, 605, 596, 580, 559, 538, 517, 494, 475, 464, 459, 456, 453, 454, 460, 467, 470, 468, 463, 459, 455, 449, 441, 430, 413, 394, 375, 363, 358, 353, 343, 325, 307, 300, 308, 329, 356, 383, 411, 441, 473, 497, 502, 495, 492, 504, 527, 550, 568, 579, 573, 547, 511, 482, 471, 477, 490, 501, 505, 503, 504, 515, 533, 546, 544, 529, 505, 484, 475, 480, 490, 495, 495, 489, 474, 446, 414, 395, 393, 395, 388, 371, 350, 336, 331, 333, 338, 344, 350, 357, 362, 359, 351, 348, 351, 354, 351, 348, 351, 361, 376, 394, 406, 410, 411, 417, 431, 445, 454, 463, 477, 486, 482, 469, 461, 466, 480, 498, 516, 531, 536, 530, 516, 502, 498, 509, 533, 559, 579, 591, 595, 591, 578, 565, 559, 561, 565, 569, 568, 555, 532, 505, 482, 470, 472, 491, 520, 542, 546, 532, 510, 488, 473, 470, 478, 490, 502, 508, 507, 494, 471, 447, 430, 418, 408, 408, 430, 467, 499, 509, 502, 493, 491, 498, 511, 522, 521, 505, 482, 459, 440, 430, 433, 448, 466, 476, 481, 484, 480, 466, 444, 420, 399, 380, 365, 360, 366, 378, 395, 420, 452, 479, 489, 482, 470, 462, 456, 445, 430, 416, 405, 396, 387, 387, 399, 421, 442, 461, 473, 473, 460, 443, 434, 435, 433, 423, 408, 398, 398, 406, 420, 435, 440, 432, 421, 413, 409, 401, 389, 379, 376, 380, 392, 411, 430, 440, 439, 434, 434, 440, 449, 459, 469, 477, 483, 485, 484, 480, 476, 468, 456, 437, 413, 389, 373, 365, 359, 352, 348, 358, 385, 419, 449, 466, 472, 471, 464, 453, 438, 424, 413, 404, 395, 383, 367, 350, 337, 335, 341, 353, 366, 382, 403, 425, 439, 434, 411, 385, 373, 382, 404, 429, 447, 459, 466, 469, 470, 473, 481, 489, 494, 491, 481, 469, 460, 456, 460, 471, 484, 497, 507, 516, 527, 538, 545, 550, 554, 558, 563, 568, 575, 583, 589, 593, 592, 581, 559, 531, 503, 478, 459, 449, 456, 473, 489, 494, 492, 494, 502, 516]
1770E16J3RLkpj0j0lMOjqnNJ6J8J5J0NLKPJ2J5Qlj1j2qrk0l0l1j6LJ4J4Opj6j8j4rj0j4j7
1752D13j4lJ2K2K9L0L0K1Onm%lj8l2l7k9j3OK4L1K6J5NMRJ4J5J3J4K1K4J6jj6k0j6j4j0mk
1735E59nrokkmjLNlqnKRJ4J8J9Pj1k8l4l0j8lJ3K5K5J8J0RJ1J1Mpj7j9j0KOJmppj2j7j4qj
1716D79KNNJlLJ4K1K2K3J9J2KkJM%mlmppKJ4J8J1%j1j9k0j1MJ2Oqk0k8k8k1rklj0j7j6pJ0
1697D30K9M1M6M5L8L0K3K0J6Nqj1mK%j1k0k0j5j0j0j1j6k1k7l2l0k1lJ5K4K3J3M%nj5k2j8
1682D74lJ4J9J4NjkkJNQQMjqj2j0lLN%j1j6j2MJ4J4Koqnmpj3j1jJ2K1K3K4K5K1J3MJlj4k2
1662E63k1j2kMPJ0O%jNJ2J4J4J0NLMMjpj0rpojMKqj8k4k7k8k1q%nj6j9j3oMJ7L0K7J5QJ4K2
1643E34K2J3%rj5j2mQJ5J6J5J2O%noj0j6k1j9j3qppqj1j2j4k1k7k8j7LK1L0K3Roj3j1rlOJ6
$$ y = [516, 529, 538, 541, 539, 532, 522, 512, 509, 513, 519, 518, 510, 505, 510, 526, 544, 559, 569, 574, 577, 579, 586, 598, 613, 621, 618, 607, 595, 587, 578, 558, 528, 497, 481, 484, 498, 512, 518, 511, 495, 477, 463, 454, 444, 430, 413, 399, 396, 408, 430, 459, 489, 519, 540, 546, 541, 537, 537, 534, 516, 484, 447, 418, 405, 411, 435, 466, 492, 507, 512, 516, 525, 539, 554, 567, 581, 602, 626, 642, 641, 625, 605, 589, 575, 565, 561, 559, 554, 545, 539, 537, 535, 531, 530, 533, 538, 535, 527, 522, 524, 533, 547, 565, 584, 591, 580, 552, 518, 488, 470, 467, 480, 505, 530, 548, 558, 567, 578, 589, 593, 586, 569, 550, 540, 542, 548, 549, 545, 538, 531, 519, 502, 488, 480, 479, 481, 486, 491, 492, 489, 492, 506, 527, 549, 572, 591, 603, 605, 603, 604, 608, 608, 604, 601, 597, 590, 583, 585, 599, 617, 628, 628, 617, 598, 578, 567, 571, 583, 589, 581, 561, 533, 505, 484, 475, 473, 470, 460, 443, 427, 420, 430, 459, 500, 546, 591, 629, 659, 682, 702, 718, 723, 715, 704, 700, 702, 702, 691, 671, 651, 636, 626, 616, 605, 589, 568, 541, 509, 479, 458, 455, 470, 494, 517, 530, 534, 534, 529, 514, 492, 474, 471, 485, 504, 518, 523, 522, 520, 518, 519, 524, 532, 540, 544, 543, 535, 523, 513, 510, 513, 518, 518, 507, 491, 479, 483, 497, 511, 513, 507, 499, 494, 490, 483, 470, 459, 458, 470, 491, 514, 538, 563, 584, 597, 601, 602, 599, 585, 563, 542, 530, 528, 532, 539, 549, 555, 555, 554, 559, 571, 585, 599, 609, 614, 617, 621, 625, 624, 617, 607, 598, 591, 585, 584, 588, 590, 582, 564, 540, 513, 485, 464, 456, 456, 451, 435, 416, 403, 397, 401, 418, 448, 475, 490, 498, 512, 534, 556, 569, 569, 560, 545, 533, 529, 537, 552, 568, 583, 595, 601, 601, 596, 590, 580, 564, 543, 524, 511, 503, 496, 489, 481, 470, 458, 444, 423, 396, 368, 351, 354, 375, 405, 428, 437, 431, 418, 407, 398, 395, 401, 417]
1625D17K0J1pj9k3k5l0k7j5k%mnMJ6K6L1L4L1K6K4K1J4Kj4j9j3KJ3J6J4J0Njnonqj7k0j2k
1609D58lj1j8j3oJJ1J6J0lj3j1qj4k1j7mJ3K7L4L0J0j6l0l2k6j9rLJ2J4J2Nmj1j0jLkj1j4
1592C32j0lJ1K8L9L9L1K4K1J4Mmnmpj8k9l3k5qQJ8J5PNJ4K6L1K9K5J7Olqj1j6j9j6oLOMMM
1574E40NNPLoj4j8k0k5k9k5j7j1oLJ7K3J6KoojNJ3K3L0L2K9K2J5QKmj2j9k1j5lQJ0Nknqj1
1556E39j2mRJ4Lj7l4l5j5J1K6K5J8J1QQONMjopopj1j4j5j7k1k0j0OJ8K6L3L5K4Jk5m2m5l5
1540D31j9jJ3J8J6Q%pj1j2j0mLQJ1J3J9K8L0K2OorooqmOJ2RKloj1j4j4j2j3j3qj%kJO%rj1
1520D42KJ4J6J1OJnnKJ4K3K6J9Kj7k6j5%Jj0j6oRJ3NnqpmmnnkKLjjKRJ1OlqnmoqmJKmoLJ6
1499D71K7K9K7K4J8J2Lj1k6l5k9j8p%MOOJ0J9K5J8Lnllpj0jQMrk0j9j4j1j5j8j8j4o%NRPK
$$ y = [417, 437, 448, 441, 422, 399, 374, 344, 317, 302, 300, 300, 296, 291, 295, 311, 337, 368, 402, 433, 459, 483, 504, 518, 520, 506, 487, 474, 476, 489, 505, 519, 529, 534, 533, 528, 522, 517, 509, 492, 472, 460, 458, 455, 444, 426, 413, 407, 408, 419, 435, 445, 442, 429, 418, 410, 396, 375, 358, 354, 367, 394, 428, 458, 468, 452, 422, 390, 364, 345, 336, 339, 351, 365, 377, 382, 378, 367, 357, 356, 359, 357, 346, 332, 322, 319, 330, 358, 397, 436, 467, 491, 512, 526, 530, 526, 521, 517, 510, 492, 463, 430, 405, 397, 405, 423, 438, 445, 450, 464, 490, 521, 550, 575, 592, 598, 595, 587, 576, 560, 541, 525, 519, 522, 528, 532, 536, 540, 545, 550, 557, 560, 554, 540, 522, 502, 477, 448, 423, 406, 395, 389, 392, 409, 432, 448, 450, 444, 438, 437, 442, 455, 478, 508, 540, 569, 591, 606, 614, 616, 612, 600, 581, 560, 545, 542, 550, 560, 565, 563, 558, 550, 539, 527, 523, 532, 546, 549, 532, 498, 463, 448, 459, 485, 510, 528, 539, 547, 555, 561, 566, 570, 569, 563, 556, 550, 543, 532, 518, 503, 486, 465, 445, 435, 441, 459, 485, 518, 553, 577, 578, 553, 511, 466, 431, 412, 411, 424, 442, 458, 466, 466, 459, 448, 436, 426, 422, 425, 433, 444, 457, 476, 504, 534, 556, 562, 556, 547, 541, 535, 527, 523, 529, 541, 550, 552, 549, 543, 532, 518, 504, 492, 479, 466, 458, 457, 457, 455, 456, 462, 462, 453, 442, 444, 458, 474, 485, 491, 492, 487, 482, 484, 498, 521, 547, 566, 568, 551, 525, 510, 510, 511, 501, 485, 479, 488, 501, 506, 501, 493, 486, 482, 478, 473, 468, 466, 468, 471, 470, 469, 471, 480, 491, 497, 494, 486, 481, 477, 471, 463, 459, 460, 462, 458, 452, 455, 471, 498, 527, 554, 578, 596, 608, 611, 600, 574, 539, 510, 492, 485, 485, 489, 495, 501, 511, 530, 555, 573, 576, 571, 568, 565, 558, 548, 547, 555, 559, 550, 530, 511, 497, 486, 471, 453, 435, 421, 415, 415, 420, 429, 436, 438]
1481D38lmJPJ1RMjqj1oQK5L4L0K0J4J5K0J9J0nj7j9j2ppj5k2k6k3k0j7j1lOJ1QjpmJ1K3K2
1463D97J2KMRPmj6j7j0kjlmllljJlj2j9j7j2nLJ1J5J1LlnoqrqnKJ1J6J5QQJ4J8J3jj0j0kR
1443D87J5J2OKJjoqnprnQK1J7Kj1j1nnj4k4k2rNJ3J2RNLJLRK0K9L1J8ok4l0k5j7j2nNJ2RN
1423D99OJ2J9K4K3J6RKjlrj8k7l3k8j9roonlnj2j6j2omjMJ3K1K6K8J7lj9k0p%mj8k5k0nJ3
1405C88K3K0J5J9L1L9L0J5L%MPPM%kmj1j7k3j9rjLLJJklmnorrlMOKl%PJ1NkqmNJ2J3J0OPJ4
1384E71J8J8J1ONKmrj1romllkOK3M3N1N1N8Q4J24J70K21K53K24J07n6j83k24k07j79j53j17
1370H76p8n5m8m0k0JJ3J3Qmj6k2j8j7k2k4k0j2j2j5j7j5j0mJlj7k4j6%RMnrojPJ3J5J1M%m
1353D21j0j4j2pJJ1K5L6M2L7K3OopjPJ1J0Nlj6l0l7l7k7qJ4L0L0K0J1M%qj8k6k9k3j0J0K3
$$ y = [438, 435, 431, 432, 439, 450, 459, 463, 462, 454, 443, 437, 445, 470, 504, 534, 554, 568, 583, 603, 622, 632, 627, 610, 591, 579, 572, 565, 550, 528, 502, 479, 459, 442, 431, 428, 434, 445, 453, 452, 445, 441, 452, 475, 497, 509, 511, 515, 524, 531, 527, 511, 494, 484, 482, 481, 478, 474, 471, 468, 465, 464, 465, 462, 450, 431, 414, 402, 397, 400, 411, 426, 437, 440, 437, 432, 426, 418, 409, 401, 396, 398, 409, 425, 440, 448, 456, 470, 488, 501, 500, 490, 480, 478, 487, 502, 514, 520, 522, 523, 522, 516, 508, 503, 496, 487, 482, 490, 511, 528, 530, 519, 508, 503, 498, 484, 460, 438, 429, 434, 447, 459, 468, 473, 476, 477, 480, 489, 509, 538, 569, 587, 581, 557, 527, 502, 485, 473, 468, 473, 485, 494, 499, 505, 517, 536, 560, 583, 599, 608, 610, 609, 606, 597, 579, 552, 519, 491, 472, 463, 457, 451, 446, 443, 438, 426, 410, 398, 392, 388, 387, 391, 404, 425, 451, 479, 496, 493, 474, 454, 447, 447, 443, 425, 400, 380, 375, 388, 411, 431, 446, 465, 496, 535, 565, 580, 583, 583, 587, 594, 601, 605, 605, 603, 599, 588, 571, 548, 529, 520, 519, 522, 525, 526, 527, 525, 522, 518, 513, 507, 498, 489, 486, 490, 496, 498, 495, 495, 502, 513, 518, 516, 508, 504, 509, 521, 534, 544, 550, 557, 571, 589, 607, 618, 624, 629, 631, 627, 618, 607, 598, 592, 588, 585, 582, 580, 586, 609, 652, 703, 754, 812, 896, 1020, 1190, 1411, 1664, 1888, 1995, 1939, 1756, 1532, 1325, 1146, 993, 876, 798, 743, 695, 655, 635, 636, 649, 662, 670, 666, 650, 628, 610, 593, 571, 547, 527, 515, 503, 488, 471, 456, 446, 442, 443, 440, 423, 399, 383, 383, 392, 396, 391, 382, 376, 375, 382, 395, 410, 421, 425, 425, 421, 411, 397, 385, 378, 379, 390, 415, 451, 493, 530, 553, 559, 553, 546, 545, 552, 563, 573, 578, 575, 559, 529, 492, 455, 428, 420, 434, 464, 494, 514, 525, 529, 529, 521, 503, 477, 448, 425, 415, 425, 448]
1336D48K1PlKJ4K2J9Qkj2k0k2j9j0lLQPQJ1K0K7K6K0J3%j5k7k5j5m%lonj%joqplkmm%KKjl
1316D57ljNJ3K3K9K6J6RRJ1Ooj4j1kNMlm%PRKj4k7l0k4j8j4oLJ0QJnonl%NNlk1l6m2l7k4p
1297B97J0K7L6L4K3J4J4K2K1Qj4l1l2k3j1%NQNPJ3K2K2J3LKQJ2QKjKMM%oj3k1k4k1j3n%KL
1279D36J1J8K0J1nj9k2j5oKJ0J5J9J3Mk%MOOLKNJ4K1J7Jj7k4k2j6j2j1j1j2j0pmjNRQjj0r
1260D24%PNlj3j5pQK1L1L7L8K7Nj6k4j9j5j5j7j7rPL1M8M1J4j3j8j0jKKPJ3J8K3K1J2kj2j5
1244F01j3j0nlj%jnrrJJ2K0K1J9J4J1J2J1Mj0j9k2j9j5qjJLQJ5J0oj8j1OJ3Pmnmqj6k2k2j9
1225E04j5j1j0pn%OJ8L4M8M6K7Mj2j7j3mQJ3Qoj2nKlk0l6m1l3j8nNJ6K0J7QjnlNJ0Olj4j8
1207D88j5pLQJ2J5J9K0J8J0jprnJPJ0RMmrj4j4j0kNQNlj3j7j3ppj5j9j1MJ8J8Rmj5k1k1j3
$$ y = [448, 469, 476, 473, 475, 489, 511, 530, 538, 536, 524, 504, 482, 463, 453, 450, 453, 461, 468, 476, 487, 507, 534, 560, 580, 593, 593, 578, 551, 526, 511, 507, 507, 504, 498, 493, 492, 492, 491, 485, 477, 470, 467, 465, 461, 457, 457, 459, 461, 460, 457, 454, 453, 458, 471, 494, 523, 549, 565, 574, 583, 594, 600, 594, 580, 569, 567, 572, 576, 573, 569, 569, 576, 585, 587, 573, 546, 516, 492, 474, 460, 454, 457, 467, 475, 476, 471, 465, 460, 457, 457, 462, 467, 464, 443, 407, 365, 328, 304, 297, 307, 334, 370, 404, 427, 441, 455, 477, 498, 506, 492, 461, 429, 406, 395, 395, 400, 408, 413, 420, 433, 455, 477, 490, 493, 495, 503, 515, 523, 525, 524, 526, 530, 534, 534, 528, 515, 494, 470, 449, 436, 431, 431, 433, 436, 447, 465, 485, 496, 491, 472, 450, 435, 429, 431, 441, 456, 475, 488, 492, 490, 490, 494, 500, 506, 509, 511, 516, 530, 551, 568, 569, 552, 528, 506, 490, 478, 467, 456, 444, 434, 427, 423, 422, 427, 436, 444, 443, 433, 424, 424, 431, 436, 433, 420, 405, 398, 406, 427, 458, 495, 533, 560, 565, 549, 525, 506, 491, 476, 459, 442, 433, 440, 471, 519, 560, 574, 561, 543, 533, 532, 534, 536, 543, 556, 574, 597, 618, 630, 628, 616, 601, 588, 578, 573, 570, 569, 569, 568, 563, 554, 545, 546, 558, 578, 599, 618, 632, 643, 655, 666, 670, 660, 641, 619, 600, 585, 577, 576, 577, 580, 588, 603, 613, 607, 589, 578, 584, 597, 604, 600, 595, 591, 583, 567, 545, 523, 504, 489, 478, 468, 461, 456, 456, 462, 480, 514, 562, 608, 635, 639, 627, 610, 597, 593, 601, 614, 622, 616, 604, 599, 601, 598, 578, 542, 501, 468, 450, 445, 450, 466, 486, 503, 511, 510, 505, 502, 507, 517, 523, 520, 506, 488, 473, 466, 469, 477, 489, 504, 523, 543, 561, 571, 570, 563, 554, 549, 550, 557, 567, 576, 580, 576, 567, 553, 539, 529, 527, 532, 540, 545, 542, 529, 512, 499, 492, 485, 470, 451, 440, 444, 462, 480, 489, 485, 470, 449, 428, 415]
1189D15NK2K7J8MLRJ5Pj0k4k7k3j3jQRMoj0oJNPPJ0J0Ojj2k0k7k7j7lNMjJRJ4J7K0K3K0Oq
1170D75j4r%PJ4J7J7J3Nnj7l1l9l3j6JJ4K2K2J8OlpnljLOPQJ3J9K1J5Jrj3nMJ0J1J1J3J0%
1152E73j0j1j2j7k4j8NK8L5K3Nj0j6j5plpj5j7j1qrj0rmmm%OJ0OkpokKLKLQJ3J3PL%nj6k5
1132D41k4j3k%ml%OJ2J5J5J0Knj0nOJ8K1J1nj4j5j1oKJ3J8J5QOOKpj7j9j6oQK3L3L1J7OKP
1114E72Nlj1j2pj%JLLMORJ5J5J3QKJLMlj5k4k4k0k0k1j8j0oj1j6j6j0%MOOMMLKLMOOOPJ0J3
1093E00K1K8L0K5J4PLLKlj4k2k6k3j7k0k9l2k2JK2L1L0K3J6QKnrqmmj0j7k2j8j3j0j1j2oO
1077D15J4J3Mpj6j6j3j6k0j5JJ8K8K8K8K7K0Qkoqj3j9j6nKLNJ0K0L1L9M1L8L2K1Rkrj0ppq
1059F40qqqrqjMMlrj3j3j4j8k7l3k8j0J2K5K5K3K4K5J9RKJNJ0J1Pj0k7l5k0LK1K2Rnj5k3k7
$$ y = [415, 420, 442, 469, 487, 491, 494, 503, 518, 525, 515, 491, 464, 441, 428, 427, 435, 444, 448, 442, 432, 426, 427, 432, 439, 446, 456, 466, 472, 471, 459, 439, 412, 385, 368, 365, 370, 374, 373, 374, 383, 397, 414, 434, 457, 477, 483, 475, 461, 452, 452, 459, 473, 490, 507, 520, 525, 520, 503, 472, 433, 400, 384, 385, 399, 421, 443, 461, 467, 464, 457, 452, 449, 448, 451, 457, 464, 472, 485, 504, 525, 540, 541, 532, 519, 514, 518, 528, 539, 550, 563, 573, 573, 563, 552, 540, 523, 499, 481, 486, 514, 549, 572, 577, 567, 551, 536, 529, 526, 519, 504, 487, 476, 468, 459, 449, 440, 436, 432, 428, 428, 434, 444, 450, 448, 441, 435, 433, 435, 438, 440, 443, 451, 464, 477, 484, 487, 487, 482, 466, 441, 417, 404, 402, 402, 398, 395, 395, 401, 413, 428, 443, 453, 455, 450, 440, 435, 441, 459, 480, 491, 486, 472, 457, 446, 440, 442, 455, 473, 488, 496, 502, 508, 510, 503, 486, 467, 451, 445, 453, 476, 509, 540, 557, 563, 565, 572, 577, 574, 563, 551, 544, 543, 543, 544, 547, 550, 554, 560, 569, 584, 599, 612, 620, 622, 623, 626, 630, 627, 612, 588, 564, 544, 524, 503, 485, 475, 469, 458, 442, 426, 416, 416, 420, 426, 432, 436, 440, 443, 445, 448, 452, 458, 464, 470, 477, 487, 500, 521, 549, 579, 604, 618, 625, 628, 631, 633, 630, 616, 594, 568, 545, 528, 508, 479, 447, 425, 426, 448, 479, 509, 532, 548, 556, 558, 553, 544, 536, 532, 528, 518, 501, 479, 461, 448, 438, 427, 415, 409, 415, 429, 442, 446, 439, 423, 407, 394, 378, 358, 343, 344, 362, 390, 418, 446, 473, 493, 501, 499, 493, 485, 472, 453, 437, 432, 434, 437, 442, 452, 472, 503, 542, 583, 621, 653, 674, 683, 681, 672, 662, 655, 648, 640, 632, 624, 616, 607, 599, 598, 602, 606, 603, 594, 581, 568, 554, 536, 509, 476, 448, 438, 450, 475, 500, 523, 547, 572, 591, 600, 602, 603, 608, 618, 629, 636, 626, 599, 564, 544, 547, 568, 590, 599, 594, 579, 556, 529]
1042E29k5j2QK6L1K4J7J2Moj6j3nkopmjoj6k5k5j8kJ4K2J8J1RRLj1k8l7l7k8j7qkPJ8K8K7
1024D60K1J6Rkj0rKRLmpopnJQOnj2pJPOMLNN%%J0K4K8J9Loj2j5j7j3plkNJ6K5K4J0nj5j5j2
1004E34rqroJJ2K1K5K1Rmj1j5j4j4j9k6k7j9j1j3k3k7j6oj0k1j9ML2M5L9K0LonLJ1J4J1J0
987D77J5J6Nj4k5k4j7j3r%J1J1mj9j9qNQPOQJ5K4K2J4KlnoqmNJ2J1QQJ8K5K4Qj2k5k5j5jR
969E18J5J6J6J6Pqk3k3j0NJ0PM%kknj2j7j2QK4K5J0oj7k0j7qmqj4j3kJ0J6J9J8J7J5J5J5P
952E90pk0l1l9m3l8k6j1l%KJjlmljLRJ6J5J0M%JJmj4j9j4lJNJ0J9K2J6PLKjllLJ2K0K1J4O
932E22KJnj4k1k1j7j0k%kn%J1J8J7J2O%JJ2K6L2J8jj2j5k0k6k8k2j6j2o%KlqpjPJ0Plpnlk
913D10onpj3j6j2LJ8K9L5L9L8L1K3J4Onj5k4k7k1q%jj1j2nMNknkRK2L4L7L0J7Olrj1qJNjj7
$$ y = [529, 504, 492, 500, 526, 557, 581, 598, 610, 614, 608, 592, 579, 574, 572, 566, 559, 555, 554, 548, 532, 507, 482, 464, 462, 476, 498, 516, 527, 536, 545, 548, 537, 509, 472, 435, 407, 390, 382, 380, 387, 405, 433, 460, 481, 497, 506, 504, 494, 485, 487, 496, 499, 495, 488, 482, 475, 470, 471, 479, 485, 480, 468, 461, 462, 469, 475, 479, 482, 487, 492, 492, 492, 502, 526, 554, 573, 576, 570, 558, 543, 526, 513, 506, 503, 501, 506, 522, 547, 571, 581, 576, 561, 546, 534, 525, 517, 508, 502, 503, 515, 536, 561, 582, 591, 587, 576, 561, 547, 533, 514, 488, 461, 442, 431, 418, 395, 368, 352, 346, 336, 315, 296, 300, 332, 377, 416, 436, 439, 433, 428, 431, 442, 456, 467, 477, 492, 508, 513, 499, 474, 450, 433, 420, 411, 411, 422, 433, 429, 410, 391, 383, 388, 396, 403, 409, 417, 432, 456, 478, 492, 494, 491, 486, 480, 472, 468, 473, 485, 496, 504, 512, 530, 555, 579, 587, 575, 550, 525, 510, 509, 518, 533, 549, 565, 581, 588, 580, 557, 534, 524, 529, 539, 546, 550, 550, 548, 546, 541, 529, 512, 500, 508, 532, 557, 567, 561, 544, 524, 507, 499, 495, 487, 473, 460, 458, 468, 484, 503, 521, 538, 553, 568, 583, 590, 583, 563, 532, 493, 450, 412, 386, 375, 372, 372, 374, 375, 374, 371, 367, 364, 363, 366, 375, 391, 406, 416, 420, 420, 421, 422, 418, 404, 385, 371, 368, 369, 374, 384, 403, 425, 441, 448, 451, 453, 452, 449, 446, 449, 461, 481, 502, 516, 522, 524, 525, 520, 506, 485, 464, 447, 437, 435, 435, 433, 428, 428, 439, 457, 474, 486, 492, 492, 493, 505, 531, 563, 581, 580, 568, 553, 533, 507, 479, 457, 441, 429, 423, 423, 425, 422, 414, 407, 406, 413, 423, 430, 427, 420, 415, 412, 410, 404, 399, 392, 379, 363, 351, 354, 372, 401, 436, 475, 513, 544, 567, 581, 587, 582, 567, 543, 516, 495, 487, 487, 486, 475, 463, 458, 462, 467, 465, 460, 458, 467, 489, 523, 560, 590, 607, 613, 610, 601, 590, 582, 583, 588, 587, 570]
894E70l3m0l7k7j1RL0L8K9Prj2nNJ6K4K6K5K2J9Qoj5j4ronpj1k1k6j9LK5L6L3K4J4Nnj1j0
877F29poj2k1k1j6qqpnKMKJNJ4K4K8L2L6L7K3kk4l1k9k5k5k1j0KJ2J7J3Lj2k1k1j5qnoqj3
859D97j5j2kJ0J9K2J8J2Nlj5k4k8k8l2l6l4k0mORJ2J8K2K2K1J5Mrj5j2%J6K7L4L2K4J3Kon
843E60kJjjLJ2K2K2Ok3m8n3l6j3LPPRJ0PJrj4j1KJ7K4K1J5RKkoj1j2j0lKJlqj4j9k2j5kRJ6
824D50J5Q%mlJOOJrk4l2k5j0MJ2J4J5J8J8J3KplJ0K2J8Kj4k3k6k5j7qjKKLNOORJ2J4J1LJK
804D80NOORJ3J2%j6k2j5mLLjnpkJjnlNJ4J5J0Mlj3k3k4j7p%%JOK1L1K8J4jolJMJ3K4K7J5l
784E90k1k8k9k3j4mK%kMJ9L2L1K1Qlj3j8j4n%kj0j6j9j8j0onpjJ0J8J3NOJ3J7J7J1NklJ%r
766E41j7j9j2m%OJ5K2J6%j5j6%K0K9K5J9J4Qlj1qljoj0rnLJ5K7L1K5J1nk3l3l4k4j8k0k1j1
$$ y = [570, 537, 497, 460, 433, 422, 431, 461, 499, 528, 535, 526, 514, 509, 514, 530, 554, 580, 605, 627, 646, 654, 648, 633, 619, 610, 604, 599, 592, 581, 560, 534, 515, 518, 543, 579, 612, 636, 650, 655, 650, 639, 629, 622, 616, 604, 583, 562, 546, 538, 530, 523, 518, 520, 524, 526, 527, 532, 546, 570, 598, 630, 666, 703, 726, 724, 700, 669, 640, 615, 590, 569, 559, 561, 573, 590, 603, 606, 594, 573, 552, 537, 529, 524, 518, 510, 497, 482, 470, 468, 478, 497, 519, 537, 549, 554, 551, 536, 512, 484, 456, 424, 388, 354, 334, 330, 336, 345, 357, 375, 397, 419, 440, 455, 459, 450, 435, 423, 423, 439, 466, 500, 532, 556, 569, 571, 565, 560, 558, 559, 558, 557, 560, 572, 594, 616, 622, 599, 551, 498, 462, 449, 452, 459, 466, 475, 485, 492, 493, 484, 470, 459, 461, 478, 502, 523, 538, 547, 549, 547, 541, 530, 518, 508, 505, 507, 508, 505, 497, 483, 464, 442, 427, 425, 434, 450, 465, 473, 473, 469, 466, 467, 473, 479, 480, 471, 447, 415, 390, 380, 384, 396, 410, 425, 443, 461, 474, 476, 469, 466, 476, 498, 516, 518, 504, 481, 455, 430, 413, 405, 404, 406, 408, 411, 416, 422, 428, 437, 449, 463, 474, 477, 478, 480, 485, 491, 497, 506, 519, 531, 531, 515, 493, 478, 474, 477, 480, 479, 474, 467, 465, 466, 465, 460, 457, 462, 476, 491, 501, 505, 502, 489, 466, 442, 425, 418, 418, 418, 419, 425, 446, 477, 505, 519, 518, 512, 509, 510, 514, 527, 551, 578, 593, 590, 569, 541, 512, 489, 475, 471, 473, 473, 471, 475, 494, 526, 557, 578, 586, 583, 570, 552, 538, 533, 533, 531, 521, 505, 486, 468, 458, 452, 447, 440, 439, 449, 467, 480, 485, 491, 504, 521, 538, 549, 554, 552, 549, 550, 550, 541, 524, 505, 493, 489, 489, 495, 510, 532, 548, 548, 533, 517, 517, 537, 566, 591, 610, 624, 632, 629, 618, 610, 607, 606, 600, 590, 581, 576, 579, 594, 621, 652, 677, 688, 683, 660, 627, 593, 569, 551, 531, 510, 499]
748D99KRNlpojmj4l1m0l2j2QJ9J9J8J8K2K4K8K9K8K4J5PNQJ0RLkj1k5l6l7k4oOLqj9k6k1m
730D49J8L0K9J6POJ4K0K1J1%poljnrj2j6j8j8j9j5qMJ4J8J5J5J2Mmpnj0j9k2j6qprqk%%LO
712D58OPJ3J9J6Ok%KMNJ0K1L1L6K8Rqj2j0pnJPNmj0j0j2j8k7l0k9k6j6MK2K6J9J0NLLMKmj0
693E42pOJ6J1mj9k5k3j5nKjj3k3k6k2k1k7k5j0J1K4K4J7J4J6J5J1LklKJ0J9K7L1K4Lj7k2o
676E12J0Qrk5l1k5j3LJ4J5Nlmkqj8k1j3KJ5K4K3J6Nqk2k7k2rJ%oqmNJ8K9L3K5RlpkNNKoj2
657D76j2mLOOOPMoj4j7j3j0j2j4r%J1K0K1J6O%mpj3j7j8j8j4mJ3K3K2J0jkjjlllnkJ1K8L5
638D97K8J5NLJllOJ5J2kj8k2j6j1onkmrj0mQJ3J3J0OLmj2j3lQJ4J3J4J7J7J1LmoqmKOjrj1
618E50ojLQJ4J0ok6l4l0k0j6j3j0kKjooKJ5J9J3MJMPRJ0ROKLRJ4J0Koj1j1rmMJ0P%kQK5L4
$$ y = [499, 501, 510, 515, 512, 505, 499, 498, 494, 480, 449, 409, 377, 365, 373, 392, 411, 429, 447, 469, 493, 521, 550, 578, 602, 617, 624, 629, 637, 647, 656, 659, 657, 646, 621, 585, 548, 524, 518, 524, 527, 519, 500, 474, 453, 449, 467, 497, 526, 542, 549, 555, 569, 589, 610, 621, 621, 614, 608, 605, 604, 599, 590, 578, 562, 544, 526, 507, 492, 484, 488, 502, 520, 535, 550, 562, 566, 562, 555, 550, 540, 521, 499, 483, 475, 468, 459, 451, 449, 449, 449, 452, 458, 464, 471, 484, 503, 519, 525, 523, 523, 525, 529, 534, 544, 565, 596, 632, 660, 669, 661, 649, 639, 632, 627, 628, 635, 640, 636, 626, 616, 604, 586, 559, 529, 500, 474, 458, 462, 484, 510, 529, 539, 544, 547, 550, 554, 556, 552, 542, 535, 541, 557, 568, 564, 545, 520, 497, 482, 477, 479, 478, 465, 442, 416, 394, 373, 346, 321, 311, 322, 346, 370, 387, 401, 417, 432, 443, 446, 444, 441, 443, 453, 472, 499, 530, 554, 557, 540, 518, 512, 522, 530, 521, 496, 465, 440, 427, 430, 444, 459, 464, 461, 457, 455, 447, 429, 408, 395, 397, 412, 436, 459, 475, 480, 472, 450, 423, 401, 392, 393, 393, 387, 379, 375, 380, 398, 427, 460, 485, 494, 491, 484, 482, 487, 492, 494, 488, 476, 464, 460, 463, 469, 475, 481, 488, 492, 486, 472, 455, 442, 432, 420, 406, 397, 397, 408, 428, 449, 465, 471, 471, 467, 460, 447, 430, 412, 394, 380, 376, 389, 412, 434, 444, 443, 441, 440, 439, 436, 433, 430, 425, 423, 434, 462, 497, 525, 540, 545, 548, 549, 546, 543, 549, 564, 576, 574, 556, 534, 518, 507, 501, 496, 494, 490, 481, 471, 467, 475, 488, 501, 511, 517, 520, 516, 504, 491, 488, 496, 510, 523, 537, 554, 571, 582, 585, 581, 575, 567, 563, 565, 571, 570, 561, 550, 544, 543, 546, 554, 568, 578, 572, 546, 512, 482, 462, 446, 433, 423, 421, 423, 422, 416, 410, 412, 427, 446, 459, 463, 464, 468, 475, 484, 494, 503, 509, 511, 514, 523, 537, 547, 549, 543, 532, 521, 512, 508, 512, 522, 529, 529, 527, 535, 560, 594]
598E94K8J4Jlkknqj0qnnj2j6j2lNMoj7k5k6j9j2pljRJ9K5K1J1LJNJ5K2K2J4lj9k8k6k3j8j4
580D75rkMJ1J5J8J9J8J0lj2j1%RPkj1j6k1k7k5j5mmj1j4rmlnlJQJ5K4K5J8Lqj0ollqqJJ9L6
561D79M4L9K8J6Nnj6k4k4j7%J7K4J8Qkoj0j3rmkk%J0K1K2J2mj3j3nOJ7K2K0Oj2k4k2oNKj1
543E77j8j0jJrk0k3j9j1mkk%RK0K6K8K4K3J9Qrk1k4k5l0l5l3j9lMMLNJ0J5J8J9K4L4M2L8K3
526F56Qkk%%pj8k7k8j8nOJ4J7J5Poj5j7j6j5j0opj5k7l2k4rMOKl%QJ3Rjj2j8j7j2j1j4j4m
507C53J4K9L2K3J1%ppqpmMJ8K5K4J6Qjj2j9j9j0lpj8l1l6l0j6KJ6K9L6L7K6Rnj0nLJ2J8J5
490E05Kj0j3pjjOK2M3N7N1L1Mj6k5k6k6l1k8j6jL%knj4k3k2j0loj2rjJ%JMQRJ2J8K4K3K0J9
471E55K1K3K1J3ok4l1k4pQJ4J0Lmqrj2j2qJJ1J9K7L0K7J6Kpql%kqj1p%jj0k0j9rklqj0j1j0
$$ y = [594, 622, 636, 637, 634, 632, 630, 625, 617, 607, 599, 594, 589, 577, 561, 549, 546, 551, 555, 549, 532, 507, 481, 462, 450, 443, 440, 439, 448, 467, 492, 513, 524, 527, 528, 533, 548, 570, 592, 606, 603, 584, 556, 530, 507, 489, 475, 466, 464, 468, 479, 494, 512, 531, 549, 559, 556, 544, 533, 533, 542, 549, 547, 536, 520, 499, 472, 447, 432, 428, 424, 413, 399, 390, 386, 383, 378, 375, 376, 384, 399, 423, 448, 466, 469, 461, 451, 445, 442, 439, 431, 423, 424, 443, 479, 523, 562, 590, 606, 611, 606, 590, 566, 542, 525, 525, 542, 566, 584, 592, 590, 584, 574, 561, 552, 548, 546, 544, 544, 554, 575, 597, 609, 605, 592, 579, 574, 580, 597, 619, 639, 645, 633, 609, 587, 581, 586, 588, 577, 559, 549, 548, 549, 540, 520, 497, 478, 467, 463, 461, 459, 459, 468, 488, 514, 542, 566, 589, 608, 616, 607, 586, 562, 537, 507, 472, 439, 420, 417, 421, 425, 428, 433, 443, 458, 476, 495, 519, 553, 595, 633, 656, 664, 662, 660, 660, 660, 653, 635, 608, 580, 562, 557, 563, 577, 594, 609, 616, 610, 595, 578, 562, 547, 537, 531, 524, 509, 482, 450, 426, 417, 421, 427, 429, 426, 426, 434, 447, 456, 455, 443, 425, 408, 396, 385, 371, 357, 353, 367, 396, 428, 451, 462, 462, 455, 448, 440, 433, 429, 433, 451, 476, 500, 516, 524, 523, 511, 492, 473, 463, 460, 453, 435, 404, 368, 338, 322, 324, 340, 369, 405, 442, 468, 477, 472, 462, 457, 460, 472, 490, 505, 507, 497, 484, 477, 476, 475, 481, 503, 546, 603, 654, 685, 689, 673, 648, 622, 596, 565, 537, 521, 520, 523, 523, 521, 516, 502, 479, 457, 447, 444, 438, 426, 417, 416, 417, 417, 418, 422, 430, 439, 451, 469, 493, 516, 536, 555, 576, 599, 620, 633, 627, 603, 572, 548, 541, 549, 563, 573, 576, 572, 564, 555, 543, 531, 523, 524, 535, 554, 581, 611, 638, 654, 656, 649, 641, 638, 638, 636, 628, 617, 610, 610, 609, 599, 579, 560, 551, 549, 546, 538, 528, 517, 507]
453E07j0nKJ1J6J3Nnj4j7j1%RR%ppjPJ0J0N%JMOOOJ1J4J1KljOOlj3j4nLjj4k2j8lJ2K2K3K2
432E85K0J8J0jj1j5j5j2nLPJornKPOjj4k3k5j8j6k2k9k7k4k0j5lJ2K2K6K2J3NLRJ4J2Mjj%
414D83KJ3K4K7J9ROPMkqj3j4nRJ9J5OJLMmj3j4rlJMJ2K8M2M4L1Roj5k0k3k5k5k2k0j6j4j5
396E36j8k1j8j0KJ2J5QlroJNPRJ1J1Moj8k0j4kMLNJ1K0K1J6J2J0RNjljJjoj0nPK0K2J4Jqj6
377F06j9j7rKRRLj1l2m9n0l1nJ6K6K7J8jj8k1rPJ6J0j0l0m1l6k0nNJ3J6J4J3J4J7J3PLQJ1
360D69J2J2J8K3J8QkomNJ6K3J8Lqpkmj3k0j4m%nj0pKOLnrj1rpkjJQJ7K5K6K1J1MjkjJ%qj9
339E69k8k6j6pklnkMRJ4J3Jj1j8j8j9k3k1j2JJ5K9M1M7L9K5J5J1QJqj8k7l2k8j8pjKKjrj5
322D71j1KJ8K7K1J0joqrj0kJ0J7J2LjJjnj0mMOnk0k6k0oPJ5J4Pnj2j6j6pPK2K7J9Opj0rmj
$$ y = [507, 497, 492, 494, 505, 521, 534, 539, 534, 520, 503, 492, 492, 501, 510, 510, 503, 496, 495, 502, 512, 522, 527, 527, 528, 532, 538, 544, 550, 561, 575, 586, 588, 585, 584, 590, 596, 593, 580, 566, 561, 564, 563, 549, 527, 509, 506, 518, 540, 563, 585, 605, 623, 633, 632, 621, 606, 591, 579, 574, 577, 584, 585, 579, 570, 565, 567, 574, 580, 579, 565, 542, 517, 499, 483, 461, 432, 405, 381, 361, 346, 343, 355, 377, 403, 425, 438, 443, 446, 455, 469, 481, 485, 484, 483, 483, 485, 498, 522, 549, 568, 577, 583, 590, 594, 592, 584, 571, 557, 552, 561, 580, 595, 601, 602, 605, 609, 605, 592, 578, 569, 566, 567, 571, 583, 611, 653, 697, 728, 737, 731, 716, 696, 673, 648, 623, 601, 581, 565, 551, 536, 518, 497, 479, 469, 471, 483, 498, 506, 503, 494, 488, 489, 494, 501, 510, 521, 532, 536, 530, 512, 492, 478, 476, 480, 483, 488, 499, 519, 540, 556, 568, 578, 587, 592, 591, 588, 587, 588, 587, 581, 571, 566, 573, 593, 615, 629, 630, 622, 606, 587, 570, 561, 563, 572, 581, 584, 573, 541, 492, 442, 411, 406, 422, 448, 475, 493, 492, 474, 453, 444, 451, 467, 477, 467, 437, 396, 360, 340, 335, 340, 353, 369, 383, 396, 410, 427, 440, 447, 450, 458, 469, 481, 493, 511, 534, 552, 560, 558, 552, 548, 553, 569, 592, 610, 613, 605, 598, 596, 592, 579, 559, 545, 541, 541, 536, 526, 519, 521, 527, 530, 525, 516, 505, 496, 489, 487, 486, 487, 495, 512, 537, 563, 584, 595, 599, 598, 596, 595, 596, 596, 588, 569, 541, 515, 499, 492, 490, 487, 482, 480, 484, 493, 507, 520, 521, 510, 492, 474, 455, 432, 411, 399, 400, 415, 444, 485, 532, 571, 596, 611, 622, 630, 631, 623, 605, 578, 546, 518, 500, 493, 492, 494, 496, 495, 486, 471, 460, 462, 480, 507, 528, 538, 537, 531, 523, 514, 504, 502, 512, 529, 541, 544, 543, 544, 543, 538, 528, 524, 528, 534, 529, 509, 483, 463, 457, 464, 479, 493, 500, 495, 483, 467, 451, 444, 451, 473, 500, 519, 525, 518, 508, 499, 495, 494]
302D94LMOQROKkk%LKJKNMoj3j1%RJ1J3J8K0J3Knpqj1j6k1k3k1j2LJ6J9Rj0k5k9k1rmlnl%N
282D20J4K3L0K7J8Kj1j7j2lOOjj0j3oLJokJ4L1L5K9J8Pnj2oOJ6J7R%qj0j2j7l1m1l4j3Jlj4
264D46k1k4k3k0j1LJ7L4M5M2K7PnqlLJ3J9J7Rkj5k7l7l7k5oQJ3J2J2J6J7J1kj2j3rm%NJ1J7
247E00K3K2J1qk3k4j5jJ1J9J8J4J0RRMklPJ7J8J3M%%KLJkoj0j6k4k6k2j0%MjrrmOJ5K3K8K4
228F00J3mj4j8j6j2rj0j4j1KJ9K7K2Pmj1j4k0k3k3j4jRJ0J3J7J9QloJMlj3k0k5l3l5k6j3m
211C72kKJ1J6J1KkQK1K9K8J9QJjJPPKlLJ7K6K2Kj9k9k1KK4L3K7J4Njmqj3k1k4k4k0j5j2j2
193D89j1j0j0oNJ5K5K7K4J4%j5j7rMJ2J0M%jjJMRJ2J3J2RLoj5j6j5qJJ3J9Pj3k5j8LK0K2J4
175E95%j2j7j3porj2j1okklpponJJ3K7K5Pj7k9k6j1J0K8L8L1J3ql0m7n3m4k4mJ2K2K9L1L3
$$ y = [494, 497, 501, 507, 515, 524, 530, 532, 530, 528, 528, 531, 533, 534, 536, 541, 545, 539, 526, 515, 515, 524, 535, 548, 566, 586, 599, 601, 596, 589, 581, 570, 554, 533, 510, 489, 477, 480, 496, 515, 524, 514, 489, 460, 439, 430, 426, 423, 418, 415, 415, 420, 434, 457, 487, 514, 532, 534, 523, 506, 494, 491, 497, 503, 502, 492, 479, 473, 476, 477, 471, 469, 483, 514, 549, 578, 596, 603, 598, 586, 580, 586, 602, 619, 628, 628, 620, 610, 598, 581, 550, 509, 475, 462, 463, 460, 446, 425, 401, 378, 358, 347, 350, 367, 401, 446, 488, 515, 522, 517, 509, 506, 509, 522, 541, 558, 567, 565, 550, 523, 486, 449, 424, 418, 426, 439, 451, 463, 479, 496, 507, 505, 493, 480, 471, 467, 467, 472, 483, 500, 523, 545, 556, 548, 525, 501, 486, 485, 496, 515, 533, 547, 557, 566, 575, 579, 577, 574, 581, 598, 616, 629, 633, 633, 633, 635, 638, 639, 637, 631, 621, 605, 581, 555, 533, 523, 523, 527, 526, 517, 508, 504, 510, 525, 548, 576, 600, 613, 609, 595, 577, 561, 549, 540, 530, 516, 505, 507, 526, 553, 575, 582, 578, 567, 553, 533, 510, 487, 473, 472, 481, 491, 504, 521, 540, 548, 545, 539, 540, 544, 541, 528, 508, 483, 450, 415, 389, 376, 372, 370, 372, 383, 399, 410, 412, 410, 418, 439, 468, 496, 515, 523, 524, 523, 524, 531, 538, 540, 537, 540, 557, 583, 605, 607, 588, 559, 538, 540, 564, 597, 624, 638, 643, 642, 638, 630, 617, 596, 572, 548, 528, 513, 501, 489, 478, 468, 458, 452, 457, 472, 497, 524, 548, 562, 562, 547, 530, 521, 525, 537, 547, 551, 551, 550, 549, 550, 554, 563, 575, 588, 600, 609, 612, 606, 591, 575, 560, 552, 553, 566, 585, 592, 579, 554, 536, 539, 559, 581, 595, 595, 583, 566, 553, 546, 540, 531, 519, 508, 502, 500, 498, 495, 488, 481, 475, 470, 471, 484, 511, 536, 543, 526, 497, 471, 460, 470, 498, 536, 567, 580, 572, 542, 495, 442, 398, 374, 370, 382, 404, 433, 464, 497]
157D97L5K9J7Kpqpj0j5j4j0l%mj3k3k7k1j4rjJ3K8L5L3K8K6K2Rj0k8l7l6l1k5j2LJ7K0J9J6
141D84Qlj0qjMKJORRN%lnjRJ5J5J0NjmolOK2L9M2K7Oj2k4l1k8pJ3J5pk9l0j5JJ0J7K2K0Rk
121F01pj0j6j9j5pJJ%JNOPJ0J6J7J1LMRJ1MnmJLmj1j7k1k1j9j7j5rOJ9K3J3lj0j1pm%Jnj9
102D97l5l8k2LK1K4J7J1J3J9K5L0K7K0J4J3Rkj9l0k8j0PJ5J2KlJQJ0Koj0nmqj6j9j3olmMK1
84E44L2K4Oqj0j0j0nMJ4J8J6J2Mlmjmj6k5j9mOQJ0Nj0k9l5k0JJ1J2J2J5J2LkJQJ2J5J4Qnj6
66E91j6j3j0j0qmjlnmKNKpj1nRK0J4M%QK2K7K5J3kj8k6k1j2nkKQJ0Npj4j2onlKJ6K7K7J4m
46F19j4k1k7l1k8j7mLLlj2k0k3j7JK2L0K2RL%klNJ4K0J5Nnj4k2k3k0j9j8j3kQJ0QOJpj4oJ0
28D29K3K5K1J2NMRJ5J4RKkoqj2j8k6k4oJ8K6J3nj3j1qqpLJ8L3L0J1j2k4j9rkPJ5J4NkJRJ3
$$ y = [497, 532, 561, 578, 580, 573, 565, 558, 548, 533, 519, 509, 506, 506, 502, 489, 466, 439, 418, 404, 395, 394, 407, 435, 470, 503, 531, 557, 579, 588, 578, 550, 513, 477, 446, 421, 409, 412, 429, 449, 468, 484, 492, 489, 479, 471, 470, 474, 476, 477, 483, 492, 501, 506, 506, 503, 498, 497, 506, 521, 536, 546, 551, 550, 546, 540, 537, 543, 565, 604, 646, 673, 679, 667, 643, 612, 584, 577, 590, 605, 598, 569, 539, 524, 525, 535, 552, 574, 594, 603, 601, 594, 584, 568, 549, 534, 527, 528, 529, 529, 530, 535, 541, 548, 558, 574, 591, 602, 605, 609, 618, 629, 633, 628, 624, 625, 628, 624, 613, 596, 575, 554, 535, 518, 503, 494, 500, 519, 542, 555, 552, 542, 531, 524, 520, 520, 521, 516, 497, 462, 424, 402, 405, 426, 450, 467, 478, 491, 510, 535, 565, 592, 612, 626, 639, 648, 646, 627, 597, 569, 559, 566, 581, 593, 595, 592, 593, 601, 611, 613, 607, 597, 592, 588, 580, 564, 545, 532, 526, 523, 519, 523, 544, 576, 600, 606, 598, 588, 578, 568, 563, 567, 581, 599, 615, 627, 631, 628, 624, 623, 619, 603, 578, 559, 555, 561, 569, 579, 584, 574, 545, 510, 490, 491, 502, 514, 526, 541, 553, 556, 554, 555, 563, 575, 590, 604, 612, 607, 591, 575, 562, 552, 542, 534, 530, 529, 526, 521, 517, 519, 524, 526, 519, 508, 503, 512, 532, 546, 550, 550, 558, 580, 607, 632, 645, 643, 625, 599, 578, 566, 561, 559, 561, 569, 579, 584, 577, 563, 551, 545, 540, 537, 539, 555, 582, 609, 623, 619, 605, 584, 557, 526, 498, 481, 477, 480, 483, 480, 468, 448, 425, 408, 409, 431, 461, 483, 492, 495, 495, 493, 490, 495, 509, 529, 544, 549, 544, 530, 508, 485, 465, 446, 428, 415, 413, 421, 431, 439, 445, 446, 439, 425, 419, 429, 452, 477, 498, 510, 515, 519, 528, 543, 557, 566, 568, 566, 560, 552, 540, 522, 496, 472, 466, 484, 510, 523, 518, 505, 494, 486, 478, 471, 474, 492, 525, 555, 566, 554, 530, 511, 502, 500, 507, 522, 536, 541, 539, 540, 549, 562]
9E62J3J0Nok0l2l5l3k8k2j5j3qmjjmJJ2K1K2J4kj2j0JJ3J3Jj2k0k1j4p%MOJ1J4J3P%j0j7j9
-9C77j4j0j1j1%K3M3M9L7J7LLJ8K9K3Jk1l3l6l6l2k8j8jJ8K9K8J8J2J3J2Nmj2k0k7k7k0j3
-24C84rlQJ7J5J2J7K9L5L3K5J6Kj0j5j1qpqpqj5k1j7pJNK%%J0K1K8K2Ppj7j6mJ0J8J8J6J3
-42E74Qjj0j0olpj0j2j2rjJ4K4K3J1KJNJ1J1QJnrj7k9l7l1j1J4K5K2Rnj5k3k7k5j2NJ9J8Q
-60D86LJ0J8J8Pmj0j4j9k4k2j6pKJ2K1K6K5K2J9J5Npj7j8rMJ3J6K1L3M0L0Oj8k7k7k5k3k1
-76E44j7j7j8j2%J0RJlLJ2J5J2OLNJ0Q%qoKO%j0j6j4rk%mqnOK1K4J8OlolPJ7K3K3K0J5Nqj9
-96F43k2j5MK3L1J9lk0k5k4k4k1j3l%km%Kkj2j5pNJ2OllPJ6J4PLOJ0P%rj3oOJ8K2J0ok1k8
-115E70k8k2j4nklolOJ7K2J9J5J6J9J5Plrj4j7j8j4rqqpqj1j7j7j3oj%MJ2J9K1J4LooJRJ3
$$ y = [562, 575, 585, 590, 584, 564, 532, 497, 464, 436, 414, 399, 386, 378, 374, 373, 372, 368, 369, 381, 402, 424, 438, 436, 424, 414, 415, 428, 441, 442, 430, 410, 389, 375, 368, 368, 372, 378, 389, 403, 416, 423, 423, 413, 396, 377, 363, 353, 342, 331, 331, 354, 397, 446, 483, 500, 503, 506, 524, 553, 576, 577, 556, 523, 487, 451, 419, 391, 373, 372, 390, 419, 447, 465, 477, 490, 502, 507, 503, 491, 471, 444, 417, 397, 384, 375, 372, 380, 397, 412, 424, 441, 470, 505, 538, 563, 579, 581, 571, 556, 545, 537, 530, 522, 515, 507, 492, 471, 454, 447, 448, 453, 455, 455, 455, 465, 486, 514, 536, 543, 536, 519, 503, 499, 509, 527, 545, 561, 574, 582, 581, 571, 561, 555, 552, 545, 535, 523, 511, 502, 501, 515, 539, 562, 573, 575, 576, 581, 592, 603, 611, 612, 607, 598, 581, 552, 515, 484, 473, 487, 512, 534, 543, 538, 523, 500, 473, 448, 436, 441, 460, 478, 486, 489, 499, 517, 535, 542, 538, 528, 514, 495, 471, 449, 433, 426, 428, 440, 461, 487, 512, 534, 553, 568, 573, 566, 549, 531, 522, 526, 539, 555, 576, 609, 649, 679, 685, 667, 640, 613, 588, 565, 544, 527, 510, 492, 480, 480, 490, 499, 500, 497, 500, 512, 527, 539, 545, 548, 553, 563, 571, 571, 563, 557, 559, 565, 565, 555, 539, 525, 516, 514, 514, 510, 502, 497, 503, 524, 548, 566, 572, 569, 563, 560, 567, 584, 607, 630, 650, 665, 670, 662, 643, 621, 606, 610, 633, 664, 683, 680, 660, 635, 611, 587, 566, 553, 550, 550, 548, 544, 544, 546, 544, 532, 517, 510, 515, 527, 533, 530, 527, 534, 550, 564, 571, 574, 580, 590, 597, 597, 588, 575, 569, 575, 593, 615, 625, 619, 598, 570, 542, 520, 506, 501, 499, 496, 490, 487, 493, 510, 532, 551, 566, 582, 601, 616, 623, 620, 611, 597, 580, 562, 548, 539, 531, 523, 516, 508, 497, 480, 463, 450, 444, 443, 443, 447, 459, 478, 499, 513, 516, 510, 504, 505, 514, 527]
-133E27RJpj1j2j9k7k7k1j0mmlkMJ1K0K6K9K5J7J2J2J5J6Prj8rRJ9J2jrj6j9j5mNNOJ6L1L4
-151F21K0kj8k4k0j0%%rj2jJ4J6Nj1j6j3mQJ6J4Ojllqj2pPJ8J6Kj8k6j8LK2K9K1Qmj3k2k6
-169E45k3j3lnj7k7k9k3j5qJJ6K8L1K4J9K2K5K3J6QLJkorronqj4j4j3qmKQJ4J4RKnj0j6k5
-187D94l4l5k0MK0K0J0MMNJlmnoqnKJ0J5J8J5Lj1j4KJ9K6J7Mj1k1k5j6JJ3J6J3Nlpn%%jk%
-206E05%JRK4L2K0Lonj0k3l2k8j1OJ9K4K1J9J8J7Nj5l1l1k0q%LKnj1j0jPNkqmNJ1RQJ3K6L6
-224E87L9L9M1M0L3J7kj9l2m0l9l5k9k1j2olkKKkmk%lplPJ2Opj7j9j4nMJ0J3J0QMLLMkj2k1
-243E26k6k4k0j7j8k5k6j4PJ7J2kmNK0K7K8K5K6K7K4J3kj5j6j0lKJ1J8J6NmkONqj8j8j2rj1
-260E16j0mKjrj2j0kNJ3J4RjnJQMpj2nRJ6J7J6J7J3N%%MORPjj3j9j2kkj0j0MJ8K3K0J3Mj2
$$ y = [527, 536, 537, 530, 519, 507, 488, 461, 434, 413, 403, 399, 395, 392, 390, 394, 405, 425, 451, 480, 505, 522, 534, 546, 561, 577, 584, 575, 557, 548, 557, 576, 588, 587, 578, 562, 543, 528, 524, 529, 534, 540, 556, 587, 621, 641, 639, 621, 597, 577, 567, 567, 567, 558, 546, 545, 559, 575, 580, 569, 553, 540, 536, 544, 560, 574, 580, 579, 576, 573, 565, 553, 546, 553, 571, 587, 589, 571, 545, 527, 530, 552, 581, 602, 610, 606, 593, 571, 545, 522, 509, 506, 501, 484, 457, 428, 405, 390, 382, 383, 399, 427, 458, 482, 501, 523, 548, 571, 587, 595, 598, 599, 597, 591, 582, 573, 567, 562, 554, 540, 526, 513, 505, 501, 503, 511, 525, 539, 548, 550, 545, 535, 519, 494, 460, 425, 405, 409, 429, 449, 459, 463, 467, 472, 473, 470, 466, 461, 455, 447, 442, 444, 454, 469, 487, 502, 505, 494, 480, 482, 501, 527, 544, 548, 537, 516, 491, 475, 476, 489, 505, 518, 523, 520, 513, 508, 508, 508, 507, 505, 505, 505, 506, 515, 539, 571, 591, 594, 588, 583, 573, 550, 518, 490, 479, 485, 504, 528, 549, 568, 586, 603, 608, 593, 562, 531, 511, 503, 503, 506, 508, 503, 492, 482, 481, 488, 493, 491, 483, 479, 484, 495, 504, 512, 525, 551, 587, 626, 665, 706, 746, 779, 796, 794, 775, 743, 703, 664, 629, 600, 579, 567, 561, 558, 556, 558, 560, 558, 554, 552, 552, 549, 542, 539, 546, 558, 564, 557, 540, 521, 507, 502, 506, 516, 529, 539, 547, 551, 554, 557, 561, 559, 547, 526, 500, 476, 456, 439, 421, 396, 370, 356, 363, 380, 392, 390, 386, 391, 411, 438, 466, 491, 517, 544, 568, 581, 579, 564, 548, 538, 535, 537, 548, 566, 582, 587, 583, 581, 587, 592, 584, 566, 548, 536, 527, 516, 506, 502, 504, 503, 494, 482, 472, 470, 475, 488, 502, 511, 510, 505, 506, 514, 518, 511, 499, 494, 503, 519, 536, 552, 569, 582, 587, 587, 587, 591, 597, 606, 613, 612, 599, 580, 568, 566, 564, 554, 544, 548, 566, 589, 609, 622, 626, 614]
-279F14l0l8l1j7olnnLJ2J5J2POPQPOKkjQJ2Poj7j7j0n%%%KOJ2J7K2L0L1K4Nj3k1j8j1rj2
-298E98j7j4olj2k6k7j7kNL%jKNOLJKMJnpl%knklpj3oJ0K4K4J4Knj3k0k6k7k1rRK4L1K4J1
-318E04lj2j7j2mNPMKLMmj5k5k8k3rJ3L3L8L2K2K0K3K3J9J2Nmj5k8l7m0l5k8k2j3OL1N0M9
-334E31L2J2KllLQJ2Qjqqpoqj0j1j8k5k9k5j6j0okKL%KORKmkJ1J8J2JlmnnLJ6K3K2J6J6K0
-354E71K4J9J0lj3j3KJ9K0Mj4k4k1j4mLM%pj1j2j5j8j1MJ5J5J1QOjj1j5j1%Mlj2j6qNJ2J5
-371E14J9K5K4J0rk0k0j2jJ0J4J7J6J5J3PKjknnljmrrrj3j3pMOjrj3rnKOQQJ2J6J0jrmPJ4
-391E85J1Lqj3j6j6j5j1jJ2J5Olm%lj4k1j5jJ1J4Qjprqn%QJ5J7J3Pjrj3j0mjJLMJlpj2j7j7
-410D69pQJ6J6J0OjqkJ4K3Pk1m1l9k5j5pNK0K8K4RjjMMlj0qJJ3J9K0J8Oj0k0j4NJ6J3NJJk
$$ y = [614, 584, 546, 515, 498, 492, 489, 484, 479, 482, 494, 509, 521, 528, 534, 541, 549, 556, 562, 564, 562, 561, 569, 581, 588, 582, 565, 548, 538, 533, 533, 533, 533, 535, 541, 553, 570, 592, 622, 653, 677, 682, 669, 648, 630, 619, 610, 598, 581, 567, 561, 558, 546, 520, 493, 476, 474, 479, 482, 482, 481, 483, 488, 494, 497, 498, 500, 504, 505, 500, 493, 490, 490, 488, 483, 481, 478, 471, 458, 452, 462, 486, 510, 524, 526, 521, 508, 488, 462, 435, 414, 405, 414, 438, 469, 493, 504, 501, 489, 472, 460, 456, 461, 468, 472, 474, 477, 481, 477, 462, 437, 409, 386, 377, 390, 423, 461, 493, 515, 535, 558, 581, 600, 612, 617, 613, 598, 570, 533, 493, 458, 430, 408, 395, 401, 432, 482, 531, 563, 575, 577, 574, 571, 574, 582, 594, 602, 601, 593, 585, 578, 572, 564, 554, 543, 525, 500, 471, 446, 430, 420, 414, 412, 414, 417, 417, 419, 425, 434, 436, 432, 430, 441, 459, 471, 472, 469, 465, 460, 455, 458, 474, 497, 519, 535, 551, 571, 595, 614, 624, 621, 608, 595, 597, 616, 636, 640, 626, 602, 581, 567, 563, 566, 570, 570, 563, 552, 540, 525, 507, 496, 500, 515, 530, 541, 549, 555, 554, 543, 528, 517, 517, 521, 518, 506, 490, 482, 487, 499, 514, 533, 558, 582, 592, 583, 563, 543, 531, 530, 540, 554, 571, 587, 602, 615, 622, 624, 623, 621, 616, 611, 608, 607, 603, 594, 585, 576, 563, 550, 543, 547, 553, 552, 543, 530, 521, 516, 518, 524, 532, 540, 552, 568, 578, 577, 568, 564, 571, 585, 596, 599, 591, 578, 562, 546, 531, 520, 519, 531, 546, 552, 549, 545, 545, 542, 528, 507, 492, 491, 502, 516, 524, 523, 516, 507, 499, 494, 494, 502, 517, 534, 547, 554, 553, 544, 531, 521, 517, 516, 517, 520, 524, 525, 522, 515, 503, 486, 469, 462, 470, 486, 502, 512, 518, 517, 509, 507, 521, 544, 551, 530, 489, 450, 425, 410, 403, 408, 428, 456, 480, 489, 488, 487, 491, 495, 492, 482, 474, 475, 488, 507, 527, 545, 551, 541, 521, 507, 512, 528, 541, 546, 547, 548, 546]
-429E46j0j3j0l%%KJkop%QJ1NlqolJMQJ4J2OKjjkMJ5K0J4JlNQMpj3j2j0onpj4j8j8j3rqrq
-450D56kJ0K0J9J1KJJ1L0M4M5K1j1l4l2j6NK0K6K3J4Jqj0rnlkqj8k7k9l2l7m2m0k6qOJ3K1
-467D00K9L2K5J3QJ0J4J0%j0j7k0k0j8j9k4k5j9oQK1K8L0K5J6QLkoqlMRRQRROKkqj6k6l0k2
-485D35jJ9K8K9L0L4L6K6Prj3j0qojQR%j1j6j9k2k3j6kJqk0k3j2MJ9K6K3K1K6L4L0Rj4k3j8
-502E79j3j2j0lJJkmorj4j1qqroNJ7K1J4Kqj1nMJ5J8J5Npk0k5j9pMKnj6k2k3j7oLJoj0LK2
-521D10L6L6K4J0KLJ0J1Morj0j1j2j0m%JjjjLJ0J3Opj7j8j6qJJ1J5J1J0J3J7J1Lmopj5k3k8
-539D57k9k9k3j1NJ9K9L4L3K5J4OJlnj0j2j1oklj1j6j3jJ0J0Mj%KJlqj6j8j4jJ0J2PLLOJ2
-557D57J6J4QKjkmmJJ1J8J7J3Mnj5j7j1KJ4J8J0mj4j0NJ7J7OmqqkQJ3J4J2J1J0O%pj1j7k3
$$ y = [546, 536, 523, 513, 510, 510, 510, 512, 513, 511, 505, 498, 498, 506, 517, 522, 519, 511, 505, 502, 503, 507, 515, 529, 541, 547, 549, 548, 547, 545, 549, 564, 584, 598, 599, 596, 601, 609, 613, 606, 593, 581, 571, 565, 560, 553, 539, 521, 503, 490, 481, 473, 464, 456, 454, 464, 484, 503, 514, 516, 517, 528, 558, 602, 647, 668, 657, 623, 591, 575, 580, 600, 626, 649, 663, 664, 656, 646, 637, 632, 629, 627, 619, 601, 574, 545, 513, 476, 434, 394, 368, 360, 366, 379, 400, 429, 461, 486, 499, 507, 517, 531, 541, 541, 531, 514, 494, 474, 456, 437, 413, 388, 369, 363, 371, 392, 420, 450, 475, 491, 499, 502, 500, 494, 486, 483, 487, 496, 505, 513, 522, 531, 537, 539, 537, 529, 513, 487, 457, 435, 434, 453, 481, 510, 540, 574, 610, 636, 643, 634, 621, 611, 603, 597, 596, 604, 613, 613, 602, 586, 567, 545, 522, 506, 504, 505, 497, 477, 454, 442, 446, 465, 491, 514, 535, 561, 595, 625, 634, 620, 597, 579, 566, 554, 544, 541, 542, 543, 541, 537, 531, 522, 508, 497, 489, 481, 472, 466, 471, 488, 509, 523, 525, 517, 506, 501, 505, 520, 538, 553, 558, 551, 531, 506, 487, 480, 484, 486, 481, 465, 443, 420, 403, 397, 400, 401, 395, 385, 388, 410, 446, 482, 506, 516, 518, 521, 531, 542, 546, 540, 531, 521, 510, 498, 488, 484, 484, 485, 484, 483, 482, 485, 495, 508, 514, 507, 490, 472, 456, 448, 449, 460, 475, 486, 496, 509, 526, 537, 540, 536, 530, 523, 508, 485, 457, 428, 399, 376, 365, 370, 389, 418, 452, 485, 510, 524, 530, 531, 528, 523, 513, 501, 490, 484, 482, 479, 468, 452, 439, 438, 448, 458, 462, 461, 461, 463, 464, 461, 453, 437, 419, 405, 404, 414, 426, 433, 436, 439, 445, 457, 473, 487, 495, 497, 496, 494, 490, 486, 487, 498, 516, 533, 546, 550, 545, 530, 513, 502, 504, 518, 536, 546, 542, 528, 518, 523, 540, 557, 563, 559, 551, 543, 541, 549, 562, 576, 588, 599, 609, 615, 615, 608, 597, 580, 557]
-575E57k4j7lQJ0Kqj0%J1J7J6J0jj3k0k1k0k0k2j7q%OJ4K3K9K6J9Rjqo%Koj5j0PK5L1K2Nj6
-593E83k9l2k1rkkljMPQQLj0k3k5j2OJ7J8J4Rjj7k7k5rNJ3J7K2K2J8J3QNLLPROjlmqj1j0l
-612E40%oj4j7j2qqj0qkRK0K9L0K2Nqj3oLRJ3J5J6K0K2K2J6jj6k1j3kMLkoj1j7k2k2j6kJ0
-630E45J4J2QJ0Qkj3j9j7j4j2qlJLMONMOJ2J9J7Qnj5j4qknj1r%J1J4J0Moj7k7k9k4j3KJ3K1
-648D84K0J4kk0l4l6k9k4k9l5k4LL4N5N2L3QmLJ9K8K6K2J9J7J0jj4l0l9m0l1j7o%MONNM%j
-665D55KRJ4J7K3K9K8J8KpqkPJ9K7K6K0J2QQLkmLJ5J9Qrk3k7k5k8l4l2k1JK2K9K4J2Lmj1j5
-683F11j5r%OOmj6k4j9qjlj0j5j6oQJ6J2Klkmj3k3k5j7rkOJ4K3K5J7KqoJKLJ8M4O2N5K7jj5
-701F86j8j4j3j5k2k2j1lrk0k3j5nkmllkjjjkJPJ1J4J3QjplLPJ0J8L0L4K4Mj7l6m3l3j4LP
$$ y = [557, 533, 516, 513, 521, 531, 533, 525, 515, 515, 526, 543, 559, 569, 568, 555, 535, 514, 494, 474, 452, 435, 427, 427, 433, 447, 470, 499, 525, 544, 553, 552, 544, 538, 538, 540, 534, 519, 509, 516, 541, 572, 594, 599, 583, 554, 522, 501, 492, 490, 488, 485, 484, 488, 495, 503, 511, 514, 504, 481, 456, 444, 450, 467, 485, 499, 508, 507, 490, 463, 438, 429, 434, 447, 464, 486, 508, 526, 539, 547, 552, 555, 558, 565, 574, 580, 579, 576, 572, 564, 553, 543, 540, 540, 534, 520, 503, 491, 483, 475, 465, 457, 455, 464, 484, 513, 543, 565, 570, 562, 549, 543, 546, 555, 568, 583, 599, 619, 641, 663, 679, 678, 662, 641, 628, 626, 630, 633, 631, 625, 614, 597, 575, 553, 537, 535, 545, 559, 571, 579, 589, 597, 595, 582, 563, 546, 532, 520, 512, 509, 510, 513, 517, 523, 528, 532, 538, 550, 569, 586, 594, 589, 574, 560, 552, 550, 545, 534, 525, 525, 536, 550, 560, 564, 558, 541, 514, 485, 461, 448, 450, 463, 484, 504, 518, 516, 496, 462, 426, 397, 373, 344, 309, 285, 288, 322, 377, 429, 462, 470, 466, 469, 488, 516, 542, 564, 583, 600, 610, 609, 595, 565, 526, 486, 455, 438, 432, 432, 436, 442, 447, 452, 456, 456, 455, 457, 466, 480, 497, 520, 549, 577, 595, 597, 590, 582, 580, 587, 606, 633, 659, 679, 691, 699, 707, 710, 708, 704, 707, 722, 741, 749, 740, 717, 690, 665, 637, 603, 571, 550, 551, 573, 602, 626, 638, 641, 637, 626, 611, 596, 587, 587, 593, 599, 595, 579, 555, 536, 528, 527, 524, 514, 499, 483, 477, 485, 501, 513, 515, 512, 510, 506, 493, 470, 445, 428, 419, 417, 423, 437, 460, 485, 502, 504, 496, 490, 491, 493, 496, 514, 558, 620, 675, 702, 701, 686, 668, 654, 641, 626, 604, 582, 571, 568, 559, 539, 516, 501, 496, 494, 490, 487, 484, 482, 481, 480, 479, 477, 478, 485, 496, 510, 523, 531, 530, 523, 520, 523, 530, 540, 558, 588, 622, 646, 650, 633, 597, 554, 521, 507, 510, 517]
-720E17ORJ1PjmlnomMJ0RPMMLJlmonomjMLjqj4j5j3j3rkQJ8J9J5PJlm%J0J4J0JjPJ5J4ROO
-742F24Moj7k3k3j9j7j4nQJ1mk9m2l6j8KK1L8M2L3J6NJKMMJornMRJ0Onk0l1k8j3lnj9l5m0
-760C73l5k2j1%J4L0L4K7J9K2K9K9J6Kqj2j5j2jQJ3Pjj3j7j3jJ0J7K1K3K2J8J6J5J5RKlpq
-777F12qrj1k1l1m0l9k8j1MOnj5j4kJ0K1K7K8K4J3QRJ1Mj3l0l7k7pJ1J8J7J7K0K6K6J6Jj3
-793E68k0j8j4roj0j9l0l4k9k2j6j2JJ9L3L6L1K3J6RMNJ2J5J4Lqj6j8j6j0JJ6K3K2K2K8L3
-808F27K6Oopjmrj3j7k3k9k6j3%PPPNMMMMJklkPJ6J6QlokJmrj1j5j7j7rLJ3K0K6K6K5J9Ro
-828F37k5l5l3k5k3k1j2MJ4J5J3Pmk0l1k8j8j0JJ4K5K5J9J1MklQJ9J9Qqk0k5k9k6j4MK0K6
-844D81J8jj8k1qQJ9J8Plrrj3k1k4j5lPJ2J7K4K6K9L0K7J7MLJ0J2Mmnloj1j3j8k9l3k1LK2
$$ y = [517, 523, 532, 543, 550, 549, 545, 542, 537, 531, 527, 531, 541, 550, 557, 561, 565, 568, 569, 566, 562, 556, 551, 545, 541, 540, 544, 547, 546, 538, 524, 509, 496, 483, 474, 472, 480, 498, 517, 532, 539, 540, 537, 533, 533, 543, 557, 567, 568, 567, 574, 589, 603, 612, 618, 624, 628, 622, 605, 582, 559, 540, 523, 509, 504, 512, 523, 519, 490, 448, 412, 394, 396, 417, 455, 497, 530, 546, 551, 552, 554, 558, 562, 563, 557, 548, 543, 547, 556, 566, 572, 567, 547, 516, 488, 475, 472, 467, 448, 413, 373, 338, 316, 305, 305, 319, 349, 383, 410, 429, 451, 480, 509, 525, 527, 519, 507, 492, 480, 479, 487, 500, 507, 506, 493, 476, 463, 462, 472, 489, 510, 533, 555, 573, 589, 604, 619, 628, 630, 627, 620, 612, 604, 595, 584, 563, 532, 492, 453, 425, 414, 418, 424, 419, 404, 390, 388, 398, 419, 446, 474, 498, 511, 519, 528, 539, 543, 530, 500, 463, 436, 429, 440, 458, 475, 492, 512, 538, 564, 580, 581, 568, 548, 530, 516, 507, 501, 491, 472, 442, 408, 379, 357, 341, 329, 330, 349, 382, 418, 449, 472, 488, 497, 501, 506, 518, 533, 547, 550, 542, 526, 508, 492, 482, 483, 499, 522, 544, 566, 594, 627, 653, 659, 653, 646, 645, 641, 632, 619, 602, 579, 550, 524, 511, 511, 518, 525, 532, 537, 541, 545, 549, 553, 554, 552, 549, 547, 554, 570, 586, 594, 591, 585, 583, 584, 580, 571, 560, 545, 528, 511, 502, 505, 518, 538, 564, 590, 615, 634, 643, 637, 612, 577, 544, 519, 496, 475, 463, 467, 481, 496, 509, 516, 512, 492, 461, 433, 415, 405, 406, 420, 445, 470, 489, 500, 504, 502, 499, 507, 526, 545, 553, 545, 525, 500, 471, 445, 431, 435, 455, 481, 499, 498, 480, 459, 451, 459, 478, 496, 503, 500, 491, 482, 469, 448, 424, 409, 406, 413, 425, 442, 466, 492, 521, 551, 578, 595, 599, 602, 612, 624, 628, 624, 619, 616, 610, 599, 586, 568, 539, 506, 485, 488, 510]
-862E10K6K5K1J6J0J0J1Npj9k2k4l1l7l2j7jJ0J1Mqj6j7j4j1qkLNlj2j4lJ3K5K4J8J5J8K2
-878E04K4K7L2K9J8Jj3j7j4j1ppqojPJ3J5J4RJqj3j7k3l2l2k4j1kLJ0K0K7K2Qoj2rJQJ2J1
-895E43RPNKj%MQOKmpqojQJ1J1J1J1Pmj6j8r%jj2k1j8mRLj3k3j7KJ5J2JqpLJ2J3Ojmloj1j1
-916D87p%L%mpj2j4j3nLQKpj1nQJ4J1LJPJ5J3Nj%QJ8K4J9Qmj4j9k4l0l2k6j6pjMJ1J7K3K3
-935D76J7PknomJPJ1J1QJ1J2Lj8l9m5l2j1RK6L9M4M0K7J2NOQNoj2j1nlpqrprj3k0k9l2k6j4
-953D12jPRJ0J0RKrj5rLJ3J7J7J7PmpMJ8K1J7J7K1K6K5J9J2Krj0kKmrj0prj2qJQQMmj6k5k2
-973E46j2lkmpj0j2qLJ4J9J7J3PKKRJ2QKJRJ8K2J8J5J5J7J5Kj8l2l2k4j7j5j7j7j1jNKqj4
-990E29j2nlnqmKOOLoj1j0%J1J6J4Pjj2j9k3k2k2j9j1MK1L2K9J5%nJJ3J6Qnj1qlmopKJ0J1
$$ y = [510, 536, 561, 582, 598, 608, 618, 629, 634, 627, 608, 586, 562, 531, 494, 462, 445, 444, 454, 465, 469, 461, 445, 428, 414, 403, 395, 393, 396, 401, 398, 386, 372, 369, 382, 407, 431, 449, 464, 482, 504, 528, 555, 587, 616, 634, 635, 622, 605, 591, 580, 573, 566, 558, 552, 551, 558, 571, 586, 600, 609, 610, 602, 589, 572, 549, 517, 485, 461, 450, 448, 451, 461, 481, 508, 530, 538, 532, 520, 511, 512, 520, 532, 543, 552, 559, 564, 566, 565, 565, 569, 577, 583, 585, 581, 574, 566, 560, 559, 567, 578, 589, 600, 611, 618, 614, 598, 580, 571, 571, 570, 558, 537, 519, 515, 524, 527, 514, 491, 474, 476, 491, 503, 504, 496, 489, 492, 504, 517, 523, 522, 518, 515, 509, 498, 487, 480, 480, 483, 483, 479, 472, 460, 446, 433, 428, 431, 439, 441, 434, 423, 418, 426, 440, 451, 454, 455, 462, 477, 490, 495, 494, 494, 502, 520, 544, 563, 571, 567, 553, 534, 510, 480, 448, 422, 406, 399, 398, 402, 413, 430, 453, 476, 493, 500, 498, 493, 487, 483, 484, 491, 502, 513, 521, 532, 544, 547, 529, 490, 445, 413, 402, 411, 437, 476, 520, 560, 587, 599, 604, 610, 618, 623, 617, 605, 594, 589, 586, 579, 571, 562, 555, 546, 533, 513, 484, 452, 426, 412, 411, 418, 427, 437, 447, 456, 458, 449, 434, 425, 428, 441, 458, 475, 492, 499, 495, 488, 492, 510, 531, 548, 565, 586, 612, 637, 656, 668, 670, 661, 651, 649, 651, 647, 638, 628, 621, 612, 600, 592, 593, 601, 609, 613, 609, 593, 568, 546, 534, 531, 529, 525, 518, 508, 496, 488, 491, 505, 524, 541, 554, 561, 563, 565, 574, 586, 594, 596, 597, 606, 624, 646, 664, 679, 694, 711, 726, 728, 710, 678, 646, 622, 605, 590, 573, 556, 545, 544, 549, 551, 543, 529, 517, 512, 509, 504, 496, 492, 494, 500, 506, 509, 503, 492, 482, 482, 493, 509, 523, 530, 529, 517, 498, 475, 453, 431, 412, 401, 405, 426, 458, 487, 502, 502, 497, 498, 511, 527, 535, 530, 519, 511, 508, 504, 498, 491, 493, 503, 514]
-1009E14QRJ6K2K1J0%pj0j4j6j8j4mNROLLOKoj3j6j3j2qkPJ0J0RJ5K4L3L2K3Opj3r%M%j0k4
-1028E91l4l9l8l6l1k7j5JK0L3L3J7mj9j5KJ4J1lj0nKMNJ2J9K4K1J3Mlpj1j9k6k3j1jKRK1
-1044D81L3L1K4J7J1jj7k5k1j0LJ4J9J5Oj%kqj4j5j6k2k6k5j9j2oKJ2J9K1J8J0LKJ3K2J8P
-1060E61kkkrj8k2j6oKORJ2J4J1N%nqqmNJ3J7J8J7J3Lj0j5j3j1j3j6j2%J4K8L3K5Oj1k0k2
-1077E67k2k5k1j3jOQLlqj1j5j5j2qoo%RJ6J4PNOOJkkmj1j7j4lQJ8K7L2K8J5%j1k1l0l8m3
-1095D14m2l1j1J2K5K6J9J3QLpj8k2k2j4lOQRJ4K3K8K4J9K3L1L4L1K4J3lj7k3k0j5rkMLjk
-1112E52LLpk1k5j5kPOjkJ2L2M8M7L6K0NnqnJQJ3J5Nj0k2k4k3k8l5l3k2j1okLQRRPLnq%RJ4
-1131E55Q%llJNOLnj2j7j3nPJ4J6J4J0jj4k1k0j2qrj0oJPLnoNK4L6L3J5j3l6m4l5j9j1j3r
$$ y = [514, 522, 531, 547, 569, 590, 600, 600, 593, 583, 569, 553, 535, 521, 517, 522, 531, 537, 540, 543, 549, 551, 545, 532, 516, 503, 491, 483, 481, 488, 498, 508, 517, 532, 556, 589, 621, 644, 650, 643, 630, 621, 621, 625, 625, 615, 591, 557, 518, 480, 444, 413, 386, 371, 372, 392, 425, 458, 475, 471, 452, 437, 439, 453, 464, 461, 451, 446, 448, 452, 457, 469, 488, 512, 533, 546, 550, 547, 540, 529, 510, 484, 461, 450, 449, 451, 460, 481, 514, 545, 569, 586, 597, 596, 579, 554, 533, 523, 526, 540, 559, 574, 580, 579, 579, 577, 569, 555, 540, 524, 502, 476, 451, 432, 420, 414, 416, 428, 447, 468, 486, 496, 499, 501, 514, 536, 554, 561, 559, 557, 555, 546, 528, 506, 490, 484, 486, 492, 501, 513, 527, 538, 543, 543, 538, 530, 522, 518, 523, 536, 553, 571, 588, 601, 604, 594, 579, 566, 555, 542, 526, 514, 514, 528, 556, 589, 614, 620, 609, 589, 567, 545, 520, 499, 486, 485, 491, 499, 502, 499, 491, 480, 465, 450, 438, 430, 424, 418, 418, 427, 443, 457, 464, 469, 475, 481, 482, 480, 478, 474, 463, 446, 432, 429, 437, 455, 482, 514, 542, 557, 557, 546, 525, 495, 457, 414, 372, 341, 330, 342, 367, 393, 412, 425, 433, 436, 429, 411, 389, 367, 353, 350, 356, 364, 373, 387, 410, 438, 462, 481, 504, 535, 569, 600, 624, 637, 634, 617, 594, 574, 559, 550, 548, 552, 555, 554, 552, 555, 558, 551, 530, 505, 490, 488, 495, 501, 500, 498, 510, 542, 590, 637, 673, 693, 698, 693, 685, 680, 681, 689, 702, 717, 722, 712, 690, 666, 643, 615, 580, 547, 525, 514, 508, 506, 509, 517, 526, 535, 542, 545, 540, 532, 532, 541, 555, 563, 563, 560, 557, 558, 563, 569, 572, 567, 555, 538, 525, 520, 527, 541, 557, 571, 581, 580, 566, 545, 525, 513, 505, 496, 486, 480, 481, 488, 491, 486, 480, 485, 509, 545, 578, 593, 580, 544, 500, 465, 446, 435, 422, 413]
-1149D13NK3K7K0J0NNQJ7L0L6L0J7PNLnj7k4j9qkjJRJ9K4J7Kj6l2l9l6k8j9qNJ7K1J4Jqrl
-1167E17JjjJLoj8k1rRK0J9J3N%JRJ8K8L8M7M8L4J1knqj5k1j2OJ8J7Noj3j7j7j4j1j0j5k2
-1184F24l0l2k4qJ3K3J6kj5j2lMJoj0j0qonpj0j3j4j3j3rkQJ9K3J8OKQJ6J9R%omPK5M2M7L5
-1202G03J4jnqj8l2m0l7k7j4nlmnkNJ3J6K0K4K7J9mk7k8mK5L7K7Mj6k6k6j7j0qj4k0j8j0K
-1219E07J9K8K5J0pj5j1jOLrk8l6k6nJ6K5K2J2LJ%lj0j6j5r%KKJ%LJ2K4L1K4Pqj3nNOnk2l5
-1237E15l2j7%OLjJNQNKMQJ2J1J0QOKnj2j9k2j8lJ1J6J0Jl%RJ5J4Plj6k5k6j6%RRNLQJ1J3
-1256E29J1RQPRPJj2k3k9l0k5j4%J6K2K1J4RPNJorrpqj2j1oJQJ5J7J4Nkoj2j3j0KPMmjRJ4
-1276E23Rlj5k4l1l1k0lRJ1J0J1J4J1Jj1j3qjLPJ3J6J0MNQNnqmjloqj1j1oQK0J9ROOQMJnj4
$$ y = [413, 418, 441, 468, 488, 498, 503, 508, 516, 533, 563, 599, 629, 646, 653, 658, 661, 656, 639, 615, 596, 588, 586, 585, 586, 595, 614, 638, 655, 657, 641, 609, 570, 534, 506, 487, 479, 484, 501, 522, 536, 537, 529, 520, 517, 518, 517, 516, 517, 520, 514, 496, 475, 466, 475, 495, 514, 527, 532, 532, 533, 542, 560, 588, 626, 673, 721, 755, 766, 764, 759, 751, 736, 715, 703, 709, 727, 744, 749, 743, 730, 713, 696, 682, 671, 661, 646, 624, 594, 562, 538, 530, 543, 566, 582, 580, 565, 553, 550, 554, 555, 549, 539, 529, 521, 515, 510, 503, 493, 480, 466, 453, 440, 431, 429, 437, 456, 479, 497, 503, 505, 513, 529, 548, 557, 557, 551, 547, 554, 579, 621, 668, 703, 717, 716, 711, 703, 685, 653, 613, 576, 549, 535, 530, 527, 523, 518, 516, 521, 534, 550, 570, 594, 621, 640, 636, 609, 581, 577, 602, 639, 666, 670, 654, 628, 602, 585, 575, 567, 553, 533, 515, 505, 507, 526, 554, 579, 589, 582, 567, 556, 555, 561, 564, 555, 527, 491, 465, 460, 476, 501, 523, 535, 538, 539, 539, 536, 526, 510, 495, 486, 486, 488, 490, 491, 491, 494, 506, 530, 561, 585, 592, 584, 571, 566, 571, 577, 572, 550, 515, 483, 466, 466, 472, 475, 474, 475, 480, 488, 493, 495, 499, 507, 519, 530, 540, 548, 554, 556, 551, 539, 520, 498, 480, 477, 488, 504, 514, 515, 512, 512, 521, 536, 550, 557, 554, 538, 513, 487, 471, 471, 480, 489, 494, 497, 505, 516, 529, 540, 549, 557, 564, 573, 580, 581, 569, 546, 517, 487, 462, 448, 448, 464, 486, 507, 521, 530, 537, 542, 543, 537, 528, 519, 512, 504, 492, 481, 475, 476, 484, 499, 516, 530, 535, 533, 527, 515, 502, 492, 494, 501, 505, 501, 500, 509, 523, 532, 529, 514, 490, 459, 428, 408, 405, 414, 425, 435, 446, 460, 471, 472, 461, 448, 440, 439, 442, 449, 462, 478, 488, 492, 497, 505, 510, 505, 497, 493, 492, 489, 483, 475, 464, 453, 447, 455, 475, 494, 503, 509, 515, 523, 527, 528, 523, 509]
-1295E09k0j2JJ0Lpj3j2oMJ6K0Qrj8j3jRJ9K6K8K2Nj4l5n0n1l7j0J3J6Lj1rOJ9J9J4QKk%R
-1313D59J5J4Kj2k3k5k0j1kOJ5K4K9K7K2K1K1J3mj7j9rJPMoj4j3JJ8K8K6J8J1PN%oolJJ%K
-1330F08ORMjpj1j4j6j0kJmoKJ7L3L7L0K0J3Oj1l1m4l8j5QJ9J2nj9k4j6%J8L3L8L1J3pk1k1
-1347F35rMJ0Lj0j9j8pMJ0QJmomnpj3j6j6j7j8j3kJ1J5RkpqnlJLJmrj0pk%nqoNJ5J7J1J1J1
-1367E25Onj6j2%RLoj0mQJ5J5J1RPKpk2l2l0j3RK5K8K5K0J6J4J6K0K0J2lj1j0ljmmllrj7k2
-1385E68j7j0jLM%pj4k0k7k9k5j0RK0K2J4QPOOKmj1j5j2mJKJ%LOPOKjKPRMj0j9k1j1NK3L0
-1405E09K7K0J3Rmk3l4l1j5%PMlnmppnJN%j2j8j7p%MMLNRJ6J9J4J2J4K4L0L1K4Rj1k8l0j6
-1423E36jKrj7j5plpj3j1jRJ1J3J9K7K8K1J0JkKOOjj4j8j3qj5k6l3k7j8qJJ4K3K3K0K1K3K1
$$ y = [509, 489, 477, 478, 488, 491, 484, 471, 459, 453, 457, 473, 493, 501, 492, 474, 461, 460, 469, 488, 514, 542, 564, 569, 555, 520, 470, 419, 382, 372, 385, 401, 404, 393, 384, 390, 409, 428, 442, 450, 452, 450, 450, 459, 474, 488, 490, 478, 455, 430, 410, 399, 397, 403, 418, 442, 471, 498, 520, 541, 562, 575, 571, 554, 535, 526, 527, 534, 538, 532, 518, 505, 506, 524, 552, 578, 596, 607, 614, 619, 619, 613, 607, 604, 605, 606, 606, 608, 614, 623, 627, 626, 619, 608, 594, 578, 568, 566, 567, 563, 557, 559, 576, 609, 646, 676, 696, 709, 715, 704, 673, 629, 591, 576, 584, 603, 615, 610, 591, 567, 551, 551, 569, 602, 640, 671, 684, 677, 656, 635, 626, 630, 640, 643, 633, 614, 596, 589, 593, 603, 611, 612, 608, 602, 598, 593, 586, 573, 557, 541, 524, 506, 493, 491, 502, 517, 526, 524, 517, 509, 504, 501, 502, 505, 506, 502, 493, 483, 476, 474, 474, 469, 461, 455, 460, 475, 492, 503, 514, 525, 531, 526, 510, 498, 498, 507, 510, 504, 494, 490, 498, 513, 528, 539, 548, 555, 557, 550, 528, 496, 466, 453, 462, 487, 515, 540, 560, 576, 590, 606, 626, 646, 658, 655, 644, 634, 631, 630, 626, 622, 619, 616, 607, 590, 568, 551, 541, 540, 543, 547, 547, 540, 526, 506, 479, 450, 425, 415, 424, 444, 466, 480, 488, 495, 501, 507, 509, 505, 494, 479, 467, 463, 464, 466, 467, 467, 470, 476, 483, 489, 491, 490, 492, 499, 508, 512, 502, 483, 462, 451, 456, 479, 509, 536, 556, 569, 578, 574, 551, 517, 486, 471, 471, 478, 482, 479, 474, 470, 463, 456, 451, 452, 457, 457, 445, 427, 410, 403, 403, 407, 411, 414, 419, 428, 444, 463, 477, 489, 503, 527, 557, 588, 612, 621, 610, 582, 552, 536, 535, 537, 528, 511, 496, 489, 486, 479, 466, 455, 454, 463, 474, 487, 506, 533, 561, 582, 592, 593, 591, 593, 599, 605, 604, 590, 572, 559, 551, 536, 510, 477, 450, 432, 424, 425, 439, 462, 485, 505, 526, 549, 570]
-1440E70J1KkjJjkloj1j6j5oRK3K8J9jj9k5k1j6j8k0j7lJ3K2J9Nj1k2k4k0j5j2j6j8j6mQJ2
-1457C81N%NJ5K0J8J5J9K4K2J6J3J4J1LmlJJ%loj8l3l8k5%J8K2J9J4J6K0K5K4J6Mj0k1k5k1
-1473E54j2ljkkjjlnqj2j7j8j3ooroRK9L7K9J2K%J%opoj0j6j8j0JRJ1J5K0K0J3jj4k0j6mP
-1492E16J1QJmrj2j1nOJ6K3K0PnpmjonNJ5J2%qqnopomkloj1j3j0JJ1J2QLJKMQJ0Olj5k8l6
-1513D66l8l3k2oJ3L0L9L5K8K3J9J0LMPOjorj5k6k9k1p%KOJ3K1K2J8Q%kMJ0J2J1J2J1O%%J1
-1530F35K4L0K5J3lj6k6k8k3rLJ0QJ3K1K6J8jj4j4rqj2j6j4j2j7k6l4l0j7lQJ7K6L6L5K6J0
-1546F52oj7k3j6pj0k2l0k3j0KNLlj3j9j5kQJ0M%mjMJ5K5K8K7J9J3QNQJ2J4J0Mnj1j5j5p%
-1564F02%j1k1k0qLPPJ1J4J0KomLNmj3j2jJ2J7J5Qjj0j6j9k2k3j6jK2L5L6K4J1jj0j4qKQL
$$ y = [570, 581, 583, 581, 580, 581, 580, 578, 575, 569, 558, 542, 527, 521, 530, 553, 581, 600, 599, 580, 555, 534, 518, 500, 480, 463, 460, 473, 495, 514, 519, 508, 486, 462, 442, 427, 415, 399, 381, 365, 361, 369, 381, 386, 386, 391, 406, 426, 444, 459, 478, 502, 524, 540, 553, 567, 578, 581, 577, 574, 575, 576, 576, 573, 567, 549, 516, 478, 453, 453, 471, 493, 512, 526, 542, 562, 587, 611, 627, 631, 621, 600, 575, 554, 542, 539, 538, 536, 534, 533, 532, 529, 524, 516, 504, 487, 469, 456, 450, 444, 435, 429, 438, 467, 504, 533, 545, 547, 547, 548, 548, 542, 535, 529, 519, 503, 485, 475, 476, 485, 496, 511, 531, 551, 564, 563, 549, 529, 513, 509, 516, 527, 535, 536, 532, 523, 511, 500, 495, 501, 517, 540, 560, 567, 562, 555, 551, 550, 544, 539, 544, 559, 571, 571, 563, 555, 550, 544, 537, 531, 527, 525, 522, 516, 505, 492, 482, 483, 494, 506, 514, 517, 518, 520, 524, 532, 542, 548, 545, 530, 502, 466, 428, 395, 373, 367, 380, 410, 449, 484, 512, 535, 554, 564, 567, 571, 578, 584, 583, 577, 568, 553, 527, 498, 477, 470, 470, 472, 478, 491, 512, 534, 552, 560, 560, 558, 562, 572, 584, 595, 607, 618, 624, 624, 624, 635, 659, 689, 714, 727, 724, 708, 682, 654, 631, 622, 625, 635, 643, 656, 677, 703, 721, 720, 706, 692, 683, 675, 663, 647, 633, 621, 604, 578, 544, 514, 497, 494, 502, 519, 545, 581, 616, 642, 652, 646, 629, 606, 590, 583, 573, 551, 521, 498, 488, 490, 495, 498, 495, 482, 463, 448, 446, 454, 464, 468, 468, 464, 463, 467, 482, 507, 535, 562, 581, 594, 602, 607, 615, 627, 641, 651, 655, 650, 639, 624, 609, 602, 602, 602, 591, 570, 550, 542, 545, 552, 559, 570, 584, 594, 596, 590, 586, 589, 594, 590, 577, 565, 564, 576, 593, 608, 616, 615, 605, 589, 570, 548, 525, 509, 508, 530, 565, 601, 625, 636, 635, 625, 611, 603, 605, 613, 616]
-1581F16oj1j1qpmJMJmrro%NPNjpj2j1oNJ5J3PNQJ5J5J3QJqj0jRJ0kj7k5k7k8k4j8j0m%NN
-1601D87Koj5j7j4JJ8L0K7J0qj0kPJj4k9l1k2j4rkJ4L4M5L6J1j7l1k7j2NJ4J3J0J0J3J6J6
-1617E40J5J8K1J7Nmqj1j6j9j2KJ2J4J0Lrk1k6j8oLM%mj0j2pNJ8K2J2qk6l0k0pMJ3K2K6K3
-1634E35J3NJlj1j8k0j0LJ0QJlMJ3K0K0J4NmoJJ0J2%j5k3k4j3jRJ5J7J9J8Qlj1j3j1j0mMR
-1652E71Jj0j6j5j3j1j0lQJ7K1J7Plo%RJ4J1Lj0k2k8k3r%%prm%lrrnmjMRRK%NJ3J2Kj1j8k0
-1671D56j0PK1K4J8J1OKkkjKNOM%JOJ5J5Nj2k6k9j7kPKoj1j2j4j7j9j7j4qLJ6K6L1L2L0K3
-1689E55J1KNJ5K5L1K7J0j3l1l6l1k2j1MJ9K8K5J5Jj4k3k3j4mkmjRJ9K1J6Pok1k8k2pMNKL
-1706E46J3K1K2J7NnplNOnj6k2j9j1kMJ1J3J3J3RJj4k5k5j2KNrk7l3k3%K3L0K0Jj2rKJ4K0
$$ y = [616, 610, 599, 588, 580, 573, 569, 570, 574, 575, 571, 562, 553, 547, 547, 552, 559, 564, 563, 556, 544, 533, 527, 532, 547, 560, 567, 572, 580, 595, 610, 623, 631, 632, 624, 614, 613, 622, 632, 630, 613, 588, 561, 533, 509, 491, 481, 477, 477, 482, 487, 489, 483, 468, 451, 437, 438, 456, 486, 513, 523, 515, 505, 503, 510, 511, 497, 468, 437, 415, 401, 392, 390, 404, 438, 483, 519, 530, 513, 482, 455, 443, 448, 462, 475, 485, 495, 508, 524, 540, 555, 573, 594, 611, 616, 612, 604, 593, 577, 558, 546, 548, 560, 574, 584, 587, 578, 557, 531, 513, 507, 510, 514, 514, 510, 500, 488, 481, 486, 504, 526, 538, 530, 504, 474, 454, 447, 451, 464, 486, 512, 535, 548, 553, 554, 551, 540, 522, 502, 492, 495, 505, 513, 514, 511, 515, 528, 548, 568, 582, 587, 583, 577, 578, 588, 600, 600, 585, 562, 538, 525, 524, 533, 548, 565, 584, 602, 610, 607, 596, 583, 572, 562, 558, 562, 571, 572, 562, 546, 531, 518, 507, 497, 494, 502, 519, 540, 557, 564, 561, 555, 555, 564, 578, 589, 592, 582, 560, 532, 509, 500, 500, 500, 493, 484, 480, 480, 477, 468, 459, 454, 450, 449, 453, 462, 471, 473, 473, 478, 491, 503, 505, 494, 476, 456, 446, 453, 474, 498, 516, 527, 533, 535, 533, 531, 530, 532, 537, 543, 547, 547, 548, 554, 569, 584, 589, 577, 551, 522, 505, 503, 510, 512, 506, 495, 483, 469, 452, 433, 416, 402, 394, 397, 413, 439, 470, 502, 532, 555, 566, 568, 573, 588, 613, 644, 671, 681, 668, 637, 601, 570, 548, 537, 541, 560, 588, 613, 628, 629, 615, 592, 569, 555, 551, 549, 545, 544, 553, 572, 593, 609, 616, 610, 589, 561, 539, 532, 536, 541, 543, 546, 559, 580, 602, 619, 624, 619, 612, 609, 614, 620, 615, 599, 577, 558, 547, 545, 549, 560, 573, 586, 599, 608, 609, 595, 570, 545, 533, 535, 540, 531, 504, 471, 448, 448, 471, 501, 521, 522, 510, 501, 503, 517, 537]
-1723E37J8Qlj3j1%J4K2K0J2NK%pj6k2j9j3j3k0k2j6pornJ2K8K7J2mj1qjMRJ2Plrq%MJkj%
-1742E05%KMQQNLKLLPJ2J5J5J0Jorj0qpnllomMJ5K1K0J8J4Lj6l2l2k2j0%OJ0J0MJNJ1J8K1
-1761F11J9Oj4l4m2m1k9j4PK5L1K6J3Jj1j4qPJ6J5J1J2J5Rnj1j0j0j7k2j7mKJklnnjNJ0J4
-1778E37J7J8J3kj4j7j3j3j6j5kJ8K6J7JnnjjKJ1J4Roj6j7j0lJlj2j9j5lJ2J4Lj0j5j1mmo
-1795D55%J3K2K2K2K3K7K3J6J2O%qrj0j3k0j6%J5J4lj7j4KJ4Qpk3k8k4j6nLLnj3j4j1qpkQ
-1813D35J7J7J2OLMOQKmpjOJ1J3J6J9J9J9J8J6Qlj5k2k6k3j5nLM%j2k5l0k2j0mrj3j0lKLJ
-1831D09j%PJ7K6K1PnmMJ4J7J6J3J2J1ROKjlnj1j6j3p%NNM%lrj0j1oKJ7K5K4J3M%nj4k2k4
-1850E20j5qlMJ5K5L0K3J1jqqpqj0pLJ2J2OJ%LMLJJ%MNLkllnj2j5j3pnrj2qKJ1J7J3Moj0k
$$ y = [537, 555, 563, 560, 547, 536, 536, 550, 572, 592, 604, 609, 611, 611, 604, 588, 566, 547, 534, 521, 501, 479, 463, 456, 450, 441, 436, 448, 476, 503, 515, 511, 500, 492, 491, 495, 504, 516, 523, 520, 511, 503, 503, 507, 508, 506, 505, 505, 505, 507, 511, 519, 527, 532, 535, 537, 540, 543, 550, 562, 577, 592, 602, 603, 597, 588, 578, 570, 563, 558, 555, 552, 546, 542, 546, 561, 582, 602, 620, 634, 637, 621, 589, 557, 535, 525, 525, 531, 541, 551, 555, 556, 561, 572, 590, 611, 630, 636, 622, 588, 546, 505, 476, 462, 469, 494, 525, 551, 564, 565, 554, 540, 532, 539, 555, 570, 581, 593, 608, 617, 612, 601, 591, 581, 564, 542, 525, 521, 523, 524, 522, 519, 514, 509, 508, 513, 523, 537, 554, 572, 585, 583, 569, 552, 539, 526, 510, 495, 493, 511, 537, 554, 555, 550, 545, 544, 543, 545, 556, 570, 579, 573, 557, 540, 530, 527, 528, 525, 513, 494, 479, 476, 488, 502, 505, 495, 480, 469, 465, 461, 455, 455, 468, 490, 512, 534, 557, 584, 607, 623, 635, 641, 641, 633, 624, 614, 601, 581, 565, 565, 580, 594, 591, 574, 560, 562, 576, 584, 577, 554, 526, 502, 486, 481, 484, 487, 482, 469, 455, 444, 436, 429, 427, 435, 452, 469, 481, 487, 490, 494, 500, 508, 510, 506, 499, 498, 504, 515, 528, 544, 563, 582, 601, 619, 635, 643, 640, 625, 603, 577, 554, 539, 534, 537, 541, 541, 529, 504, 474, 452, 442, 438, 429, 416, 406, 403, 405, 408, 409, 408, 408, 415, 432, 458, 479, 486, 481, 477, 481, 495, 512, 528, 541, 553, 564, 573, 579, 581, 580, 577, 572, 561, 545, 532, 525, 525, 530, 535, 539, 539, 536, 527, 517, 506, 500, 502, 519, 544, 568, 581, 585, 585, 580, 566, 544, 520, 505, 497, 494, 498, 513, 538, 568, 591, 602, 601, 593, 585, 578, 570, 560, 553, 556, 568, 580, 586, 587, 587, 590, 594, 597, 598, 599, 599, 603, 608, 611, 609, 606, 603, 598, 586, 571, 558, 551, 546, 537, 525, 517, 519, 530, 547, 560, 564, 558, 548, 546]
-1870E46OQPLLLMPJ4K0J9Qoj5j4mJ0J5J2LkkORJj7l4m4m3l3j6NK6L6L3K5J9J8K0J5Kj4k6k8
-1888F05k5k1j7qjmrqJJ3J7J4QKjKJ0K0K0J7J3Qjj3k3k7k9k4j5mLJ%klno%NQJ0J0RMnj0r%
-1907E30RJ3J5J3RMJMOJj3k4k3j0MPLjmpqlKPQQRJ1J1Nnj4j5j1rj6k4k5j3jNOJ0J6J7J1%q
-1926E11rqpqqJJ6K8K5J2jnnrj9k4j9nJ0J8J6QLQJ4J1%pmKKmrj3j1nMJ4J7J7J5J2MljNJ1J1
-1945F11PLknpj0j6k1j7pLPPONPJ3K0J9J3PPMmj0qoomLJ0Opj2oPJ7J8J2LkJNMmj1j2qlJLK
-1966F43JMPOJrj2j1nLJ0J1PJ%JLMjrj8j9j5oLOMnj4j6qk%JLOLnj1j3j0kPJ4J6J4J6J9J7R
-1986F49klKPPMjll%LLJjpj6k6l2k6j3%RJ2PL%MRJ0QNKkljPRLnj2j3j3rlOJ3J9K4K5K0Qjq
-2008F76j6k2k4j5%J1J5J6J3J1PLmj0j6j7j1ok%jlm%PJ3J1Mmj0j4j4j2mMNJlkjoj2j8j3%J4
$$ y = [546, 552, 560, 567, 570, 573, 576, 580, 587, 601, 621, 640, 648, 642, 627, 613, 609, 619, 634, 646, 649, 647, 645, 651, 660, 661, 644, 610, 566, 523, 490, 474, 479, 505, 541, 574, 599, 618, 636, 656, 671, 673, 659, 633, 605, 580, 559, 542, 534, 533, 529, 520, 512, 513, 526, 543, 557, 565, 567, 566, 568, 578, 598, 618, 635, 648, 656, 655, 642, 619, 592, 563, 539, 524, 520, 523, 524, 524, 522, 519, 514, 508, 508, 513, 521, 531, 541, 550, 554, 549, 539, 530, 530, 539, 552, 567, 580, 589, 593, 594, 598, 604, 605, 592, 568, 545, 535, 539, 546, 549, 548, 544, 537, 529, 526, 528, 535, 543, 551, 560, 571, 582, 587, 582, 568, 553, 542, 533, 517, 493, 468, 455, 454, 459, 465, 475, 491, 508, 519, 519, 511, 502, 494, 487, 479, 471, 472, 488, 516, 541, 553, 552, 547, 542, 533, 514, 490, 471, 466, 476, 494, 510, 518, 521, 529, 543, 554, 554, 547, 543, 545, 547, 543, 534, 521, 510, 505, 509, 523, 540, 557, 572, 584, 588, 585, 584, 589, 600, 611, 618, 621, 619, 614, 607, 597, 581, 560, 543, 536, 539, 546, 553, 559, 564, 571, 584, 604, 623, 636, 643, 650, 654, 650, 640, 632, 626, 620, 616, 619, 629, 635, 628, 616, 610, 617, 634, 652, 664, 667, 665, 666, 671, 675, 671, 660, 648, 640, 637, 638, 641, 643, 644, 648, 655, 661, 662, 653, 641, 630, 625, 628, 638, 649, 656, 657, 657, 658, 661, 665, 664, 655, 637, 618, 603, 597, 600, 606, 610, 605, 591, 575, 567, 565, 565, 566, 569, 575, 578, 573, 562, 549, 539, 537, 544, 558, 574, 588, 604, 623, 640, 649, 647, 644, 646, 653, 660, 664, 663, 660, 657, 657, 660, 663, 664, 663, 656, 640, 614, 582, 556, 543, 543, 552, 564, 571, 574, 574, 578, 587, 597, 605, 610, 612, 610, 607, 606, 613, 622, 625, 620, 608, 595, 582, 573, 570, 576, 589, 608, 632, 657, 677, 685, 684, 676, 660, 638, 614, 599, 599, 610, 625, 641, 654, 665, 672, 675, 671, 661, 645, 628, 617, 611, 609, 609, 608, 605, 601, 601, 608, 621, 632, 636, 632, 622, 608, 594, 582, 578, 582, 587, 588, 585, 583, 582, 576, 564, 546, 533, 533, 547]
-2026E47K2K3K0J4Opk0k8k7j8qJOQOKklpj0j0plNJ3K1K4K0J2PPRRPOPPQNKloqj1j4j4j1oj
-2046F00LPJ0J3J4J2J1QKoj5j9j5mQJ6J6J1OLM%pj7k1k0qLJ0PJlnoolKJlrj2rnKOQOOQPjj3
-2067F04j9j5qoqpKPNJjKNPJ2J9J7Poj1qLJ1J4J3QPQMnj6k3k1j7j2jPJ1QLJ%j
$$ y = [547, 569, 592, 612, 626, 632, 625, 605, 577, 550, 532, 524, 525, 531, 539, 545, 547, 545, 542, 535, 525, 515, 508, 505, 510, 523, 544, 568, 588, 600, 607, 614, 623, 632, 639, 645, 652, 659, 667, 672, 674, 671, 665, 657, 646, 632, 618, 607, 601, 600, 603, 610, 620, 633, 647, 659, 670, 678, 680, 674, 659, 640, 625, 621, 629, 645, 661, 672, 678, 681, 685, 685, 678, 661, 640, 620, 612, 615, 625, 632, 633, 630, 625, 619, 613, 610, 612, 613, 610, 601, 589, 580, 575, 577, 583, 591, 597, 603, 611, 618, 617, 604, 585, 570, 562, 556, 548, 541, 543, 550, 555, 556, 555, 557, 562, 569, 581, 600, 617, 624, 618, 607, 599, 602, 613, 627, 640, 648, 655, 663, 667, 662, 646, 623, 602, 585, 573, 572, 579, 590, 598, 601, 602, 602, 601]
-2084F01
##END=	
##END=	
