##TITLE=	Oct20-2021.120.fid
TM-VI-124 Zr+ph-prraz.

##JCAMP-DX=	6.0	$$ MestReNova 14.3.0-30573
##DATA TYPE=	LINK
##BLOCK_ID=	1
##BLOCKS=	2    
##ORIGIN=	Mestrelab Research S.L.
##OWNER=	hrzepa
##$MNOVA/LINK_BLOCK_TYPE=	ITEM	$$ NMR Spectrum
##$MNOVA/ITEM/POLYGON=	(XY..XY)
5321,5835
8722,5835
8722,8208
5321,8208
5321,5835
##$MNOVA/ITEM/Z=	0
##$MNOVA/ITEM/ANGLE=	0
##TITLE=	Oct20-2021.120.fid
##JCAMP-DX=	6.0	$$ MestReNova 14.3.0-30573
##BLOCK_ID=	2
##DATA TYPE=	MNOVA NMR VIEW DATA
##DATA CLASS=	MNOVA VIEW DATA
##$MNOVA/ITEM/ZOOM/X=	-4.005464102252559222,	16.005770000004368114
##$MNOVA/ITEM/ZOOM/Y=	-356.69930362701416016,	3971.194183349609375
##END=	
##TITLE=	Oct20-2021.120.fid
##JCAMP-DX=	6.0	$$ MestReNova 14.3.0-30573
##BLOCK_ID=	3
##DATA TYPE=	NMR SPECTRUM
##DATA CLASS=	XYDATA
##NUMDIM=	1
##ORIGIN=	Bruker BioSpin GmbH
##OWNER=	nmr
##.OBSERVE FREQUENCY=	400.4124024600000098
##.OBSERVE NUCLEUS=	^1H
##.SOLVENT NAME=	Acetone
##.PULSE SEQUENCE=	zg30
##LONGDATE=	2021/10/20 15:26:00.000
##.ACQUISITIONMODE=	SIMULTANEOUS (DQD)
##$ORIGINAL FORMAT=	Bruker XWIN-NMR
##$MNOVA/SCALES_VERSION=	9
##$PARAMETER FILE=	(acqus, ASCII, /private/var/folders/f6/rjf_tdyn2v98c5c0wvkgn4s80000gn/T/NUryoiTIR7m5Xfqk0JN6PA/120/acqus, 0)
$$ ##TITLE= Parameter file, TOPSPIN		Version 3.2
$$ ##JCAMPDX= 5.0
$$ ##DATATYPE= Parameter Values
$$ ##NPOINTS= 11	$$ modification sequence number
$$ ##ORIGIN= Bruker BioSpin GmbH
$$ ##OWNER= nmr
$$ $$ 2021-10-20 15:26:33.481 +0100  nmr@CZC10666PP
$$ $$ /opt/topspin/data/agmb/nmr/Oct20-2021/120/acqus
$$ $$ process /opt/topspin3.2/prog/mod/shimcntl
$$ ##$ACQT0= -2.36344537815126
$$ ##$AMP= (0..31)
$$ 100 100 100 100 100 100 100 100 100 100 100 100 100 100 100 100 100 100
$$ 100 100 100 100 100 100 100 100 100 100 100 100 100 100
$$ ##$AMPCOIL= (0..19)
$$ 0 0 0 0 0 0 0 0 0 0 0 0 0 0 0 0 0 0 0 0
$$ ##$ANAVPT= -1
$$ ##$AQSEQ= 0
$$ ##$AQ_mod= 3
$$ ##$AUNM= <au_zg>
$$ ##$AUTOPOS= <59 >
$$ ##$BF1= 400.41
$$ ##$BF2= 400.41
$$ ##$BF3= 400.41
$$ ##$BF4= 400.41
$$ ##$BF5= 400.41
$$ ##$BF6= 400.41
$$ ##$BF7= 400.41
$$ ##$BF8= 400.41
$$ ##$BYTORDA= 0
$$ ##$CAGPARS= (0..11)
$$ 0 0 0 0 0 0 0 0 0 0 0 0
$$ ##$CFDGTYP= 0
$$ ##$CFRGTYP= 9
$$ ##$CHEMSTR= <none>
$$ ##$CNST= (0..63)
$$ 1 1 145 1 1 1 1 1 1 1 1 1 1 1 1 1 1 1 1 1 1 1 1 1 1 1 1 1 1 1 1 1 1 1 1
$$ 1 1 1 1 1 1 1 1 1 1 1 1 1 1 1 1 1 1 1 1 1 1 1 1 1 1 1 1 1
$$ ##$CPDPRG= (0..8)
$$ <> <> <> <> <mlev> <mlev> <mlev> <mlev> <mlev>
$$ ##$D= (0..63)
$$ 0 1 0 0 0 0 0 0 0 0.06 0 0 0 0 0 0 0.0002 0 0 0 0 0 0 0 0 0 0 0 0 0 0 0
$$ 0 0 0 0 0 0 0 0 0 0 0 0 0 0 0 0 0 0 0 0 0 0 0 0 0 0 0 0 0 0 0 0
$$ ##$DATE= 1634739992
$$ ##$DE= 6.5
$$ ##$DECBNUC= <off>
$$ ##$DECIM= 2496
$$ ##$DECNUC= <off>
$$ ##$DECSTAT= 4
$$ ##$DIGMOD= 1
$$ ##$DIGTYP= 12
$$ ##$DQDMODE= 0
$$ ##$DR= 22
$$ ##$DS= 2
$$ ##$DSPFIRM= 0
$$ ##$DSPFVS= 20
$$ ##$DTYPA= 0
$$ ##$EXP= <proton>
$$ ##$F1LIST= <111111111111111>
$$ ##$F2LIST= <222222222222222>
$$ ##$F3LIST= <333333333333333>
$$ ##$FCUCHAN= (0..9)
$$ 0 2 0 0 0 0 0 0 0 0
$$ ##$FL1= 90
$$ ##$FL2= 90
$$ [...]
$$ ##$Sgu3PowerLevels= (0..7)
$$ 0 0 0 0 0 0 0 0
$$ ##$Sgu4PowerLevels= (0..7)
$$ 0 0 0 0 0 0 0 0
$$ ##$Sgu5PowerLevels= (0..7)
$$ 0 0 0 0 0 0 0 0
$$ ##$Sgu6PowerLevels= (0..7)
$$ 0 0 0 0 0 0 0 0
$$ ##$Sgu7PowerLevels= (0..7)
$$ 0 0 0 0 0 0 0 0
$$ ##$Sgu8PowerLevels= (0..7)
$$ 0 0 0 0 0 0 0 0
$$ ##$SguType= 3
$$ ##$ShimPowMaxUA= (0..63)
$$ 130000 130000 130000 130000 130000 130000 130000 130000 130000 130000 130000
$$ 130000 130000 130000 130000 130000 130000 130000 130000 130000 0 0 0 0
$$ 0 0 0 0 0 0 0 0 0 0 0 0 0 0 0 0 0 0 0 0 0 0 0 0 0 0 0 0 0 0 0 0 0 0 0 0
$$ 0 0 0 0
$$ ##$ShimPowMaxUC= (0..63)
$$ 130000 130000 130000 130000 130000 130000 130000 130000 130000 130000 130000
$$ 130000 130000 130000 130000 130000 130000 130000 130000 130000 0 0 0 0
$$ 0 0 0 0 0 0 0 0 0 0 0 0 0 0 0 0 0 0 0 0 0 0 0 0 0 0 0 0 0 0 0 0 0 0 0 0
$$ 0 0 0 0
$$ ##$ShimPowMaxUG= (0..63)
$$ 524287 524287 524287 524287 524287 524287 524287 524287 524287 524287 524287
$$ 524287 524287 524287 524287 524287 524287 524287 524287 524287 0 0 0 0
$$ 0 0 0 0 0 0 0 0 0 0 0 0 0 0 0 0 0 0 0 0 0 0 0 0 0 0 0 0 0 0 0 0 0 0 0 0
$$ 0 0 0 0
$$ ##$ShimPowRcbType= 3
$$ ##$ShimPowRes= (0..63)
$$ 1e-20 1e-20 1e-20 1e-20 1e-20 1e-20 1e-20 1e-20 1e-20 1e-20 1e-20 1e-20
$$ 1e-20 1e-20 1e-20 1e-20 1e-20 1e-20 1e-20 1e-20 0 0 0 0 0 0 0 0 0 0 0 0
$$ 0 0 0 0 0 0 0 0 0 0 0 0 0 0 0 0 0 0 0 0 0 0 0 0 0 0 0 0 0 0 0 0
$$ ##$ShimPowRng0= (0..63)
$$ 1 1 1 1 1 1 1 1 1 1 1 1 1 1 1 1 1 1 1 1 0 0 0 0 0 0 0 0 0 0 0 0 0 0 0 0
$$ 0 0 0 0 0 0 0 0 0 0 0 0 0 0 0 0 0 0 0 0 0 0 0 0 0 0 0 0
$$ ##$ShimPowRng1= (0..63)
$$ 1 1 1 1 1 1 1 1 1 1 1 1 1 1 1 1 1 1 1 1 0 0 0 0 0 0 0 0 0 0 0 0 0 0 0 0
$$ 0 0 0 0 0 0 0 0 0 0 0 0 0 0 0 0 0 0 0 0 0 0 0 0 0 0 0 0
$$ ##$ShimPowRng2= (0..63)
$$ 1 1 1 1 1 1 1 1 1 1 1 1 1 1 1 1 1 1 1 1 0 0 0 0 0 0 0 0 0 0 0 0 0 0 0 0
$$ 0 0 0 0 0 0 0 0 0 0 0 0 0 0 0 0 0 0 0 0 0 0 0 0 0 0 0 0
$$ ##$ShimPowRng3= (0..63)
$$ 1 1 1 1 1 1 1 1 1 1 1 1 1 1 1 1 1 1 1 1 0 0 0 0 0 0 0 0 0 0 0 0 0 0 0 0
$$ 0 0 0 0 0 0 0 0 0 0 0 0 0 0 0 0 0 0 0 0 0 0 0 0 0 0 0 0
$$ ##$ShimSysFunc= (0..63)
$$ 1 2 3 4 5 7 9 11 15 16 8 10 12 14 6 17 13 18 19 20 0 0 0 0 0 0 0 0 0 0
$$ 0 0 0 0 0 0 0 0 0 0 0 0 0 0 0 0 0 0 0 0 0 0 0 0 0 0 0 0 0 0 0 0 0 0
$$ ##$ShimSysMatrix= 0
$$ ##$ShimSysType= 1
$$ ##$TFXNUM= 0
$$ ##$TRIPLO2= 0
$$ ##$VTU= 2
$$ ##$VTUETH= <149.236.99.20>
$$ ##$VTUTY= <no>
$$ ##$WBREFAM= (0..15)
$$ 135 116 100 100 100 100 100 100 100 100 100 100 100 100 100 100
$$ ##$WBREFLM= (0..15)
$$ 0 0 0 0 0 0 0 0 0 0 0 0 0 0 0 0
$$ ##$WBREFPH= (0..15)
$$ 71.66 -68.25 0 0 0 0 0 0 0 0 0 0 0 0 0 0
$$ ##$WBSGU= (0..15)
$$ 0 0 0 0 0 0 0 0 0 0 0 0 0 0 0 0
$$ ##$XFAC= 2
$$ ##END=
$$ 
##$DECIM=	2496
##$DSPFVS=	20
##XUNITS=	HZ
##YUNITS=	ARBITRARY UNITS
##FIRSTX=	6408.8703656999996383
##LASTX=	-1603.8278811825093726
##DELTAX=	-0.12226593800080123864
##XFACTOR=	1
##YFACTOR=	0.012987781768687749195
##FIRSTY=	10.035162925720214844
##MINY=	4.3183660507202148438
##MAXY=	3610.176513671875
##NPOINTS=	65536
##XYDATA=	(X++(Y..Y))
$$ [...]
2204H71K0L5L3J0j9l4k9j4oqj2j2j1j5j0NK4K8J5JKJ6K3J8QQJ6J5ok0j1J7K5Jk7k7%K1J9J2
2199I82J0Qpl2m6l8j5QQj1l0l1j5qj2j4lPMpqLJ8L1M0M3L4J7J1J7L1M1M2L3J4mj6k5l4m1l5
2194I70k2j0mJJj1l2l5j0K4L8K6Jj6k4k1j7j1LK3L9L4J5NJ1Rj2k6j6QJ2%mMLj1j8j1klLK5
2189I39L5J7j6k6j5nmjJ0J2jk0l2l7l4k0lKmmJ0K2J8J2K0M1N3M3J8pk5l0k1lPLj0j5j0knk0
2184H92k9k2JK0J8kj8k2j6j5k1k6j8LL0N4O2N0K0j1k1j1jqj8j0J0K0J1MRJ2lj7j2LJ1J2K7
2179I68M3L4ol5k3J0K7J5lqjQJ2PJlJjj3k6l3k7j3KJ4J9K0K0J8jk7l5j5NKj3rQJ1rk3j3QJ3
2174I29Lj2j9k2j2KJ0LpkJ2K0J6J0QKqj2JJ6J8J2J1J5%l3n7m0NL6L5K3J9J3nk2k3rmpo%Kk
2168I19%PJj8k2mJ9K6J9J4Qoj7j3oqj5j0PJ5Jj8k8k3j2MJ8K0J2J3K5L2J9qk8l3k4pJ2K6K6
$$ plain form
2204 871 891 926 959 969 950 916 887 873 867 859 847 835 824 809 799 804 828 856 871 872 874 890 913 931 939 947 963 978 972 952 941 958 983 984 957 930 930 951 970 982
2199 982 992 1000 993 961 915 877 862 870 878 867 837 806 791 783 771 757 754 761 765 758 750 753 771 802 842 885 919 936 947 964 995 1036 1078 1111 1125 1121 1105 1080 1046 1005 970
2194 970 948 938 934 935 936 925 893 858 848 872 910 936 937 921 897 876 859 848 851 874 913 947 962 967 978 987 975 949 933 941 953 953 949 953 956 945 927 916 914 911 914 939
2189 939 974 991 975 949 934 929 925 924 934 946 945 925 893 856 822 802 799 801 797 793 803 825 843 855 875 916 969 1012 1030 1023 998 968 947 944 951 954 944 929 919 917 912 892
2184 892 863 841 842 862 880 878 860 838 822 807 786 760 742 745 775 829 891 941 961 950 929 918 917 909 891 881 891 911 922 926 935 947 944 927 915 918 929 941 968
2179 968 1011 1045 1039 1004 981 991 1018 1033 1030 1022 1021 1029 1041 1048 1049 1046 1047 1046 1033 1007 974 947 934 936 950 969 989 1009 1027 1026 999 964 949 954 956 943 934 942 953 944 921 908 916 929
2174 929 932 920 901 879 867 869 879 882 875 873 885 905 921 931 939 941 933 921 922 938 956 968 979 994 994 961 904 864 869 905 940 963 982 995 990 968 945 936 932 925 919 919 921 919
2168 919 919 926 927 909 887 883 902 928 947 961 969 963 946 933 927 919 904 894 901 916 917 899 871 848 836 840 858 878 890 903 928 960 979 971 943 910 886 879 891 917 943
2163I43J7Lpj3oJ2K9L1J7Krj8k6k6j6qqj3j8j7nK0M7M7J3k8l5kL6M7K6Jj3j1nKOPJ0Ppk9l9
2158I64k8j1koqrpoJJ6K5J8%k0l6m0l4k4j8oJ6L2K7RQK7L8K1klK1L6J7k4n8n4k0PLk4l3j6
2153G97MOMK0M1M1K3J2J8J6ol2l8l0j9nJ5L3L1J2qj5j2pqj4j4n%qj3lJ6K7L0L3L6K0j0k5r
2148I54J5K2Oj1j8j8rknj7k1oJ0PmNK7L3J0j9k9k0pJJ0J4J2%k1l9m7l6j7kLKJJ0K7M5M6K7
2143I39Lo%NRPLoj3oMLlkQQmrjLpj5mRNj1j8j0pj1j3j0qq%J5J9RkRL1L6J9oj5roj1j3%K3K9
2136I62J4j3k7k8k5k3j6%J4J4OMKqk5l4k2KK2L1L4L7L1J3j0j3OK3J5oj6jQnl0l4j5NJ0QJ2
2131I22J3Jj8k5j5RK9L6K2Krj0qj9l3l0j0J5K7K3J1MPJ4J5Nj1j9j8j3j0mRJ9K5K3J1ql0m0
2126I12l2j9j1j0pJJ4K8L6K8Lk0k3oJ2J9J4Kj3k2j7mPJ1J5K5K9J6nqPK1J4j3m2n4m2j7KLJ
$$ plain form
2163 943 960 963 956 943 937 949 978 1009 1026 1028 1019 1001 975 949 933 925 917 904 886 869 864 884 931 978 991 963 928 926 962 1009 1035 1036 1023 1012 1007 1009 1015 1022 1032 1039 1032 1003 964
2158 964 936 925 923 917 909 900 893 887 888 904 929 947 947 927 891 851 817 793 775 769 785 817 844 853 861 888 926 947 945 942 963 999 1016 992 934 880 860 867 870 846 813 797
2153 797 801 807 811 831 872 913 936 948 966 982 976 944 906 876 857 852 867 900 931 943 935 920 908 901 893 879 865 860 860 852 839 836 852 879 909 942 978 998 988 963 954
2148 954 969 991 997 986 968 950 941 939 934 917 896 890 900 907 903 908 935 968 978 959 930 910 903 904 914 928 940 940 919 880 833 797 780 778 781 783 784 794 821 866 912 939
2143 939 942 936 936 941 950 957 960 954 941 935 939 942 939 937 945 953 949 940 939 942 935 920 916 925 930 919 901 891 884 873 860 850 842 834 834 849 868 877 875 884 915 951 970 964 949 940 934 923 910 910 933 962
2136 962 976 963 936 908 883 860 844 844 858 872 878 882 884 876 851 817 795 797 819 850 884 921 952 965 955 942 948 971 986 980 964 963 971 966 936 902 887 892 902 910 922
2131 922 935 936 918 893 878 887 916 952 974 976 967 957 949 930 897 867 857 872 899 922 933 937 944 958 973 978 967 948 930 917 907 903 912 931 956 979 990 982 952 912
2126 912 880 861 850 840 833 834 848 876 912 940 943 923 900 894 906 925 939 941 928 906 889 885 892 903 918 943 972 988 983 975 982 1003 1017 1004 962 908 866 849 851 854 855
2121H55J3L6M1J7j7k6oJ4J6P%j0k1k5j4lnj0NL2M4K7lk2l3l5k1J0L5L6J6ql1m4l7qK1K9K3
2117H98K5L4K9Oj7k7k7j8KK0J7ok4k6k0j9j0J0L2L3K2J4J4J3OJLPOjj1j7j6j3j8k8l2k5j7
2112H20j6pJ6L4L3K1J7J5QJJ6L7L1pm0m7l4k5k0j1JOJ0J8K5J4qk7l0k0nNPOJ0J8J6%j9k4j0
2107H35MPNORQ%j0j4qOK0K4J6NJJ2K6K2jk9l3j0J6J6j1l7m0j6J6L8M3L3K2J6PmqJJ0%k2l3
2102I48k5j9k1k1qNOLJ4L7N5M8K2qk8k6qJj1l3l0NM1M1J2j2j5oNJ5J9Lk5m2l2pJ0RJorkJ0
2096I16J7Kl0n7o1n2l3rJ3K4K0K1L2L5J6onJ9L9L9K7K0J2ql3m7l8j7oj1j4kJ9K6J5MLJ1J3
2092I14J5J7J5KrnOLqkK4L6K2K%RJj5k0j0jJOJ5Rrj5LK0Rj7l2k7j7j4j2kJ5L0L8L3J6Jj0j7
2086A020k9l4j5J8L5K3%j1nLJ0Qjj7k0KL1M0K1nk2k9k8j6ork4k9j2J2J7Lrrml%QJ2J6K5L7
$$ plain form
2121 855 868 904 945 962 945 919 913 927 943 950 950 940 919 894 880 877 872 862 867 899 943 970 967 945 912 877 856 866 901 937 953 945 914 870 833 825 846 875 898
2117 898 923 957 986 992 975 948 921 903 905 925 942 936 912 886 866 847 837 847 879 912 934 948 962 975 981 982 985 992 998 997 986 969 953 940 922 894 862 837 820
2112 820 804 797 813 847 880 901 918 933 941 942 958 995 1026 1019 979 932 898 873 853 842 843 849 859 877 902 916 908 881 851 831 826 831 838 844 854 872 888 888 869 845 835
2107 835 839 846 851 857 866 874 874 864 850 842 848 868 892 908 913 914 926 952 974 973 944 911 901 917 933 922 885 845 829 845 883 926 959 981 997 1004 1000 992 993 1003 1003 981 948
2102 948 923 904 883 862 854 859 865 868 882 919 974 1022 1044 1036 1008 982 974 975 964 931 901 906 947 988 1000 988 973 967 972 987 1006 1009 984 942 910 903 913 922 923 917 908 906 916
2096 916 933 935 905 848 787 735 702 693 706 730 750 771 803 838 854 848 843 862 901 940 967 987 999 991 958 911 873 856 850 839 825 823 842 868 883 887 890 901 914
2092 914 929 946 961 963 954 949 955 958 950 948 972 1008 1030 1032 1032 1041 1042 1027 1007 997 996 997 1003 1018 1027 1018 1003 1006 1026 1035 1018 986 959 942 928 916 914 929 959 997 1030 1046 1047 1037 1020
2086 1020 991 957 942 960 995 1018 1018 1007 1002 1005 1015 1023 1022 1005 985 987 1018 1058 1079 1074 1052 1023 995 979 973 964 940 911 899 911 928 931 922 913 909 906 906 914 926 942 967 1004
2081A004M0K5%j5j3lJjl%J1J8J2lj4j4rj1l1n4o7n6l1nJ3K5K7J9jj6rJ9L7J8k0m1j9K1L8K4
2076I16Jnlj1k4k2%K4L1K4J9J5J1OKkj0j8j0J2K8K6J2NMJpj3j4j2lPJ4Pj6l5m2l3j3QK3K4
2071I27J9J7J9J3pk8l3k5j4j1oMJ3J0kj3j5j6j8j4JK2L5L8L4L6M2L8J6j8m3m7l2j9j4j0NK6
2066I30M0L6J2j8l6l3j8pqj0KJ9K5J3%jJ%kOJ8K1J0jkKJnrplMJ4J7Rj2k7k8k0j2nNPkpRL5
2060I63L9Lm0n7m1k1j8k5k6rK8O7P6M8J1kPJ2Kpj0k3m5m6j1K8L3J0j1j4j2rNK7L7K8J9K2K6
2056A064J2j2k6k5j8j5j9k5k5k2j9j5kJ5K4J4KNJ5Qj7l1k1KRJpppj0j3qOK0K5J6K%J0J2lj8
2051H97j2J%j4j3QK6K6J7J3J4Mj3k1j1PJ5Mj7k8j8QK5K6J6RJ0PMLJ2J6J0JLJ5J0j4l4k0RJ6
2045A017nk8k4r%NK1L2J8j4l2k8j7j0%Njj5j1J8M7M5K0lj7k7l2k4qPJ1Rjj6k4j7%J4J9K0J2
$$ plain form
2081 1004 1044 1069 1069 1054 1041 1038 1039 1038 1035 1035 1046 1064 1076 1073 1059 1045 1036 1025 994 940 873 817 786 781 794 819 846 865 864 848 839 858 895 913 893 852 833 854 892 916
2076 916 917 912 909 898 874 852 852 876 907 931 950 965 976 982 984 982 972 954 944 956 984 1010 1022 1027 1031 1032 1025 1012 998 986 983 990 1004 1011 995 960 918 885 872 880 903 927
2071 927 946 963 982 995 988 960 927 902 888 877 871 875 888 898 896 883 868 852 834 820 821 843 878 916 950 986 1028 1066 1082 1064 1021 974 942 923 909 899 904 930
2066 930 970 1006 1018 1000 964 931 913 906 898 888 890 909 934 947 947 946 947 947 945 951 969 990 1000 999 997 999 1000 995 986 979 976 980 994 1011 1020 1008 981 953 933 921 916 921 928 926 919 928 963
2060 963 1002 1005 965 908 867 846 828 803 777 768 796 863 939 987 998 996 1003 1015 1017 1010 1000 977 932 886 875 903 936 946 935 921 909 900 905 932 969 997 1016 1038 1064
2056 1064 1076 1064 1038 1013 995 980 961 936 911 889 870 855 853 868 892 906 908 913 928 936 919 888 867 869 878 879 872 865 858 848 835 827 833 853 878 894 896 896 906 918 915 897
2051 897 885 886 886 872 859 867 893 919 936 949 963 967 954 933 922 929 944 948 931 903 885 893 918 944 960 969 979 986 990 993 1005 1021 1031 1032 1035 1050 1060 1046 1012 992 1001 1017
2045 1017 1012 984 960 951 951 956 977 1009 1027 1013 981 953 936 926 926 931 930 915 904 922 969 1014 1034 1031 1014 987 955 931 923 930 941 950 949 933 909 892 892 906 925 945 957
2040I57lj1jJ8K1J1KRJ7J7J1Mqk0k0rlrk1k4k4k1rJ5L1K5J2J9L7L5%l9n5m8l5j5J2L8M4K8
2036I88QJNJ0Mj5l8m0j4J4J9Jk0k6j8kK1L7L0Jj5kK4L6K9J7Nj2j9pJ2J1j0k4j7qqj1j0rj6
2031I32k0j2KQJ1J5Qj5l4l2j3%NP%j8k8j2K2M3M0K9K2J4JkMNmpKMj0j4J1L8L8J4KPJ4J6K0
2025A113J8Kk2l2l0l5m9m6j6J8L1K5J2j0m0n7l8%K0J4MRK0K0J1NRJ3J4J0OMPK0L0K7Pj9l1
2021A044k9k0j1pj3k8l6k3NJ7jk7l8l6l4l0j2J8L1K2J6L2N5N6L1kk4l2k6j9j4j0lLlk5m0k7
2016G60NL5M7M1J6j1j5J0K7J2j9k0QK0lk9k3%P%jPPk%J5K1Mk0k6rRJ5J9K8L4K1nk6k1LK3L1
2011I95K6J5mk7l8l1j7rlMJ1J0MK%j4l6m0j4J6K0OMK4M2L4J1j0j9k1j6kJ0Nj3k4j6LK2K9K5
2006I64J1npMJ1lk4l1k1pMJ4K0J2nrPK0J8ONMj0l2l8j4J5K5J3kjJ0K1K0Nj7l5l9l6l2l1k3
$$ plain form
2040 957 954 943 942 960 981 992 994 1003 1020 1037 1048 1052 1044 1024 1004 995 992 983 962 938 914 893 884 899 930 955 967 986 1023 1058 1058 1019 964 916 881 866 878 916 960 988
2036 988 996 997 1002 1012 1016 1001 963 923 909 923 942 943 923 897 879 877 898 935 965 966 951 949 973 1009 1038 1055 1060 1048 1029 1022 1034 1045 1035 1011 994 986 978 967 957 948 932
2031 932 912 900 902 910 921 936 944 929 895 863 850 850 855 862 862 844 816 804 826 869 909 938 960 974 975 973 977 982 978 971 973 977 967 953 964 1002 1040 1054 1056 1063 1077 1093 1113
2025 1113 1131 1133 1111 1079 1049 1014 965 919 903 921 952 977 989 979 939 882 844 844 864 878 882 891 911 931 942 947 956 969 983 993 999 1003 1010 1030 1060 1087 1094 1075 1044
2021 1044 1015 995 984 977 964 936 900 877 882 899 898 871 833 797 763 733 721 739 770 792 808 840 895 951 982 980 956 924 898 879 865 855 852 855 852 827 787 760
2016 760 765 800 847 888 904 893 878 888 915 927 908 888 896 916 913 884 861 861 868 868 867 874 881 879 879 894 915 919 899 873 864 873 888 907 935 969 990 985 959 938 941 964 995
2011 995 1021 1036 1032 1005 967 936 919 910 907 911 922 932 936 938 938 924 888 848 834 850 870 876 880 904 946 980 991 981 962 941 925 923 933 938 925 901 885 888 910 939 964
2006 964 975 970 963 967 978 975 951 920 899 892 896 910 930 942 937 928 935 955 973 979 984 988 978 946 908 894 909 934 947 945 944 954 975 995 1000 983 948 909 873 841 810 787
2000G87KL7O1O0M0K3J3kk1k9k0plNK2L4J9rj7LJ6jl2l8j8KO%kJ0K8M2L7Qk6m3l7j0J5K9K0
1995A004rl3l1oJ5J4KkKkj4j9rMQOMORJ4J8J7Mj3k5l3l7l1j6nklNJ6J6L%J0J9Mk1l5k7mK2
1990H45L5K7Oj1j3j0j2j0%J3J1JKJ4K3K1J6J6J2KopkOJ2Pj4m2n0l0KK2L1K7J4qk2k1j5j6k2
1985H54k2j1nqj8j8PM1N7L5nk4j3J1L1M4N0M5L0K1K2J7lk1k3k1k7k9j3J4K2Rpj2j3j5j7k0
1980I65k1j1J1K6J5pj5j0opOK8K9Kk0j3RJ8J0Jlj2j9j2RJ7Kk4l5j9J4M2M3K3nk7m0m4m0l0
1975H50j9j0%L%qjJ4K3J7Jj2j3mJ2K4J6pk1j1J4L2L8L6K0%j2kJ2J1j0l2l7k4NL4M1K3JKK1
1970A027L1K1Jj2k0k1j9k1l0l6k4OL0K9Oj8k3rRRmj1%J3RkjJ6K5J3oj4j0jJ0J0jj4j6j0j2
1965I30k2k1nJ2J9K3L1L3K3J7J8J6mk4k6j9j9k5j8JOj2l4l4j9pj2k3k0lK1L5M0M3M6L4Lk8
$$ plain form
2000 787 789 826 887 947 987 1010 1023 1021 1000 971 951 944 941 946 968 1002 1021 1012 995 998 1014 1013 981 943 925 927 933 933 931 941 969 1011 1048 1056 1030 987 950 940 955 984 1004
1995 1004 995 962 931 925 940 954 956 954 956 954 940 921 912 916 924 930 934 940 949 963 981 998 1002 989 964 931 894 863 847 842 840 837 842 858 874 877 877 887 906 910 889 854 827 823 845
1990 845 880 907 913 902 889 879 867 857 857 870 881 882 884 898 921 942 958 974 986 988 982 975 973 979 991 998 984 942 892 862 864 886 917 944 958 950 928 907 892 876 854
1985 854 832 821 816 808 790 772 779 820 877 912 907 883 870 881 912 956 1006 1051 1081 1102 1124 1141 1138 1117 1094 1073 1046 1017 1004 1018 1040 1049 1042 1030 1017 1002 985 965
1980 965 944 933 944 970 985 978 963 953 947 940 946 974 1003 1005 985 972 981 999 1009 1010 1007 995 976 964 973 990 992 968 933 914 928 970 1013 1036 1031 1004 964 920 880 850
1975 850 831 821 821 824 824 816 815 829 852 869 870 858 845 841 853 877 893 886 865 854 868 900 938 974 994 994 982 980 992 1003 993 961 924 900 905 939 980 1003 1004 1006 1027
1970 1027 1058 1079 1080 1068 1048 1027 1008 987 957 921 897 903 933 962 968 950 927 918 927 936 932 921 921 934 943 941 940 956 981 994 988 974 964 963 973 983 982 968 952 942 930
1965 930 908 887 882 894 913 936 967 1000 1023 1040 1058 1074 1070 1046 1020 1001 982 957 939 940 946 934 900 866 847 840 828 805 785 782 803 838 878 921 967 1001 1004 976
1961I76l2j4jpj5pJ2K1J1J%Mjj2j8j3mNRJ3J2QMMOOMJlrnJ1K5J7lj4kJ6J3pk6k8j2RK4K7K3
1955A029J6J1jj7k1nJ0Kk1l2k0j2k2l2j9J4L3J9j1k9j9RL2L5K3PJMJ5K5K7J5j3m4n2l2MK6
1950I55K3J3J2J5J1jmOJ3Kj5k7k7k2j5oMJ7K8L8L5K1Knk%oj7k1j4m%knkjrj6j3mKNROj2k9
1945I38j7J8L7J3j9k3JJ7Rkk%%MPNkJJ1Rok3k6k4k1j5kNKnnMJ8L4M2K8jj5LL2M6L4J2j2l2
1939A078l7k8j6j4j6j6j6k0j8jK2L6L4K6J3jlPJ4Qoj7k2k3j7jNok1j3J0J9Pj1j4qrj6j9j2
1934H78OK7L7K6P%J0K3K8K1Pj3l3m5m4l4j7J0L7M3K5JlLJj1j6qLMnj4k2k6k2nJ9L4L0Qqrj
1929I52%onKKpj1kJ1J2OJ0K0K3J6PJ3K5L3L1K0mk9m1k6MK2J7OKmj6k9k3okk0m0m4l3k2j8j3
1924H33nKJ4L0M3L8K4J2Olj6k0oJ6L1K8J4j0k3k0lJj8l8m2k6rMJ7L1L5L0J8QLJpk0k6k0mJ
$$ plain form
1961 976 944 930 929 922 907 900 912 933 944 945 945 949 948 936 918 905 901 906 915 928 940 948 952 956 962 968 972 973 970 961 956 967 992 1009 1006 992 990 1006 1019 1012 986 958 946 955 979 1006 1029
1955 1029 1045 1056 1055 1038 1017 1012 1022 1024 1003 971 951 939 917 885 866 880 913 932 921 892 873 882 914 949 972 979 980 984 999 1024 1051 1066 1053 1009 957 925 929 955
1950 955 978 991 1003 1018 1029 1028 1024 1030 1043 1045 1030 1003 976 954 939 933 937 954 982 1020 1055 1076 1078 1073 1071 1071 1065 1048 1027 1013 1009 1009 1007 1002 1000 999 990 974 961 957 959 964 973 979 967 938
1945 938 921 939 976 989 970 947 948 965 974 972 970 970 970 974 981 986 984 985 996 1005 999 976 950 926 905 890 888 893 895 890 885 889 907 941 983 1011 1010 995 998 1030 1076 1110 1122 1110 1078
1939 1078 1041 1013 997 983 967 951 935 915 897 896 918 954 988 1014 1027 1026 1023 1030 1044 1052 1046 1029 1007 984 967 966 971 965 944 931 941 960 967 956 942 934 925 909 890 878
1934 878 884 911 948 974 981 981 991 1014 1042 1063 1070 1057 1024 979 935 901 884 894 931 974 999 1000 997 1000 1001 990 974 966 969 973 968 954 932 906 884 879 898 932 962 970 962 953 952
1929 952 952 946 941 943 945 938 927 925 936 948 954 964 984 1007 1023 1030 1043 1068 1101 1132 1152 1148 1119 1078 1052 1056 1078 1095 1101 1103 1099 1083 1054 1031 1025 1023 1003 963 919 886 864 846 833
1924 833 828 830 844 874 917 955 979 991 997 994 978 958 952 968 999 1027 1041 1031 1008 988 985 986 968 930 888 862 853 857 874 905 940 970 988 996 999 1000 993 973 947 927 923 924
1919I24nmJ7L8M1K7J8J4Jk0k8j6mnpMJ6Rj7l3k7rJKNNpl0m2k4PK3K0J9L1M1K5rk8j7NPoj3
1913I49KK1K7J9RJrk3k8k8k6k3lM0P6O9K6j1j4kjj0j5j4j9k6k3mJ7K0OqrKJ1Roj9k4k1j1K
1908I29J2J4J0Llj1j9j5nkj7k7j8MJ7J9K1K1Oj7k6j0J6L3L2J7oj8qOMoJK0K1lk6k2nMKMRJ3
1903I74J8K3K0PljJrk1j5JNpk1k5k5j5MK1K5J8J2J0LlKJ7K3J3lj8k8k4qRQkppj6k8k6jK3K8
1897I52J6Jj4k4k0nONJOJ1R%noj0j7k5k6j2J5M3N4M4K3OknloqkJ1J2qk3rJ8K1lk2j9j9l4l8
1892H89j0K3K2rk8k4j2kL%j5l0k5mJ5K2K6K6J4nj6j1KJ5K6K5Qj2j4omj1pJ1K1J5J0J9K2J0
1887I79oj2j6k2j6J6N1N1J5k3l0j0J1J7J0OJ3J9J1j1l5m2l6k1jK2L9M5M0K5ll4m2k1OJ5RN
1882A024OOMJ0J0ok7k4OL1K8%k0j9JJ9J8kk1k4j3j0j6j8p%pj1JK3K8J5%n%MNPJ3K0K1J0rk4
$$ plain form
1919 924 919 915 932 970 1011 1038 1056 1070 1071 1051 1023 1007 1003 998 991 995 1011 1020 1003 970 943 934 935 937 942 947 940 910 868 844 851 874 894 913 944 985 1010 1001 973 956 961 968 962 949
1913 949 951 972 999 1018 1027 1028 1019 996 968 940 914 891 888 928 1004 1073 1099 1088 1074 1072 1071 1061 1046 1032 1013 987 964 960 977 997 1003 995 986 988 999 1008 1002 983 959 938 927 929
1908 929 941 955 965 968 965 954 935 920 915 913 896 869 851 855 872 891 912 933 939 922 896 886 902 935 967 984 978 960 952 958 962 956 957 977 998 995 969 947 942 946 948 952 961 974
1903 974 992 1015 1035 1042 1039 1038 1039 1030 1009 994 995 1000 993 972 947 922 907 911 932 957 975 987 997 1000 997 999 1016 1039 1052 1049 1031 1003 979 971 980 988 986 979 972 956 928 902 901 924 952
1897 952 968 969 955 931 911 906 912 917 918 924 935 944 944 939 933 923 906 881 855 843 858 901 955 999 1022 1028 1026 1021 1018 1012 1004 1002 1013 1025 1017 994 985 1003 1024 1021 999 980 961 927 889
1892 889 879 902 924 915 887 863 851 849 852 852 837 807 782 778 793 815 841 867 881 876 860 849 851 866 892 917 925 913 899 893 889 878 871 882 903 918 928 947 969 979
1887 979 973 961 945 923 907 923 974 1025 1040 1017 987 977 988 1005 1015 1021 1034 1053 1064 1053 1018 976 940 919 918 940 979 1024 1064 1089 1086 1052 1010 989 995 1010 1019 1024
1882 1024 1030 1036 1040 1050 1060 1054 1027 1003 1009 1040 1068 1068 1048 1029 1030 1049 1067 1065 1044 1020 1007 997 981 963 956 956 949 938 939 962 990 1005 1005 1000 1000 1004 1009 1016 1029 1049 1070 1080 1071 1047
1877A047k7k6k9l3k7j8j2j2j2j1pmMJ6K2J4MKJ0J1Jj8k9k2kK5M2L8J8LNJ5J6Jj3j2KJ5K0J2
1872A029nk3k4qNpk8l3j8kOJ4K5K3Orojrk5k9k4k1j6KK6L2J2qrMJ7L3N0N7L9Lk2k2qPJ1Kj7
1867A029m0m6k6J0M0M7L1J0klJNOOjrj6j9k2j6LL0M3K4pk1j1LM%JMLmnrk1l2l0j2KMOJ1J3
1861I84Om%J4J6MplPLj1k2j8qlkkMJ1J2Pqk3l2k8j8mJ2K6L6L3J9lk0k4j3NJ8J8J0Kk%%oj7
1855I69k8k8j7jJ4K7K8J2j1k2j3KMrk2k5k4k1j1PJ8J4PJ3K1J8NJQJ1Lrj7k5l3k7ML6M1K5J4
1850I59J4J3kj4j1JNok9n0m9j7K9N4M4K1J2J1Lj1rPJ6NomRJ3Mmqrj2j0lLNOQJj8l9m1k0NJ5
1845H91RPK0M0M3K1ok0j7j4k8m5m8k4RK2J1mkJ3J9J1MJ1K4J9ql0k4JJ8J6J2K1L0K1jj5j1o
1840I90j4k1qJ7L4K7RkkNQkj6j7JK6L5K4Ppj8l0l5l3k1j0JPPNKlj2k1j6nLkrqJJ2K0J8QlL
$$ plain form
1877 1047 1020 994 965 932 905 887 875 863 851 840 833 829 833 849 871 885 889 891 901 912 913 895 866 844 842 867 909 947 965 968 973 988 1004 1005 992 980 982 997 1017 1029
1872 1029 1024 1001 977 969 974 967 939 906 888 886 892 906 931 954 960 951 945 944 935 910 881 857 836 820 822 848 880 892 884 875 879 896 929 979 1036 1075 1078 1056 1034 1026 1033 1044 1046 1029
1867 1029 989 943 917 927 967 1014 1045 1055 1053 1050 1051 1056 1062 1068 1067 1058 1042 1023 1001 985 988 1018 1061 1085 1078 1057 1046 1049 1053 1053 1054 1058 1061 1057 1052 1043 1022 990 960 948 950 954 960 971 984
1861 984 990 986 986 1000 1016 1020 1013 1010 1017 1020 1009 987 969 961 958 956 954 958 969 981 988 980 957 925 897 879 875 887 913 949 982 1001 998 978 954 941 946 964 982 992 994 992 992 992 986 969
1855 969 941 913 896 895 909 936 964 976 965 943 930 932 936 927 905 880 856 835 824 831 849 863 870 883 904 922 927 928 936 947 950 941 924 899 866 839 843 879 920 945 959
1850 959 973 986 984 970 959 960 965 959 930 880 831 814 843 897 941 962 974 985 988 977 968 975 991 996 990 986 995 1008 1012 1008 1000 991 979 969 966 969 974 980 988 989 971 932 891 871 876 891
1845 891 900 907 927 967 1010 1031 1025 1005 988 974 946 901 853 829 838 860 871 867 865 878 897 908 912 923 947 966 958 928 904 905 923 939 951 972 1002 1023 1022 1007 996 990
1840 990 976 955 947 964 998 1025 1034 1032 1030 1035 1043 1041 1025 1008 1009 1035 1070 1094 1101 1094 1076 1046 1011 978 957 947 948 955 962 967 969 966 954 933 917 912 915 913 904 896 897 909 929 947 955 952 955
1834I55K3K8Mk6k7JK1J0j6l0k4j1JOJ2J9K4K2J1LOJ1J1RJ5K3K0QPJ4J0j6l2k2k%j2j3mnk2
1829A012l4k7j2kLRJ2J0Kl%J3K5K2%l0m3l1nJ7K8K2Nj6k2j5j0j4j4KK1K6J9J5J4Nrj0OK0J0
1824A021j4l0l0j8kJ5K3K0J1J0J9K0Oj3k2k3k5k2rJ2J9J3Jpj2j1QL6M8K7j1l5l9l8k9nK5L3
1819I72J0k2l8k8pJ8L1K7J6J8L2L1Oj6oJ8K1%j3qj0k8l9k1QK4K2J6J7K0K0J2j0l6n2m8l2j5
1815I10njj3k7j4K8O1M8Pj8j4rj9k7j7%N%LJ2J7J7K4L3K9Nk2l7l4j9kJ3K9L8L6J4j9l4k1O
1810I83K1J5JlJMNJ0K4K8J4j5l0j8LQrk7l4l5l7k6JK6K8Nj7k1qJ2L1L6K3OMJ9L2K5Q%J1K9
1805A133L3J6qk2j8j3j6k2k4k4k8l2k6j3qj7j9lJ9K7J6JmKOjj8l2k9j8j0mOJ4J4J0J9L5K9
1800I71Kk1k0j3k0k3mK1J6j5l2j5J6M0N5O2N3K4qk7l4l6k7oPOjMJ6J7J2J1J2Oqj4nLjrqLJ0
$$ plain form
1834 955 978 1006 1010 984 957 958 979 989 973 943 919 908 909 915 927 946 970 992 1003 1006 1012 1023 1034 1043 1058 1081 1101 1109 1116 1130 1140 1124 1092 1070 1068 1068 1056 1043 1039 1034 1012
1829 1012 978 951 939 937 940 949 961 971 973 970 970 983 1008 1030 1030 1000 957 926 921 938 966 988 993 977 955 940 930 916 902 904 925 951 970 985 999 1004 995 985 991 1011 1021
1824 1021 1007 977 947 929 927 942 965 985 996 1006 1025 1045 1051 1038 1016 993 968 946 937 949 968 981 982 975 963 952 960 996 1044 1071 1060 1025 986 948 919 914 939 972
1819 972 982 960 922 894 887 905 936 963 979 997 1029 1060 1066 1050 1044 1062 1083 1083 1070 1062 1052 1024 985 964 972 996 1018 1034 1051 1071 1091 1103 1093 1057 1005 957 925 910
1815 910 905 904 891 864 850 878 939 987 994 976 962 953 934 907 890 890 895 895 898 910 927 944 968 1001 1030 1035 1013 976 942 923 921 934 963 1001 1037 1051 1032 998 977 983
1810 983 1004 1019 1020 1017 1018 1022 1027 1037 1061 1089 1103 1088 1058 1040 1043 1051 1042 1015 981 946 909 883 884 910 938 943 926 905 897 909 940 976 999 1005 1009 1028 1060 1085 1093 1093 1104 1133
1805 1133 1166 1182 1174 1152 1134 1121 1105 1083 1059 1035 1007 975 949 936 928 911 892 889 908 935 951 952 948 950 956 955 937 905 876 858 848 844 850 864 878 888 907 942 971
1800 971 973 952 932 919 899 876 872 893 909 894 862 847 863 903 958 1020 1073 1097 1089 1062 1028 992 965 959 966 972 971 975 991 1008 1020 1031 1043 1049 1041 1027 1022 1025 1024 1015 1007 1010 1020
1795A020Kj3k7l3k9j9nOJ2QJ%LNNORJ0PKJKLORQkj4k0k4k4pK6N1M1Nk0j0J2J5JnJ0K4K5J9
1789A102K1K6J7rl5l8j8NJ8J4Pkrj2j0mJnj9l5l3j2J5K8K1Lj4k9l2j9MK1J4rk0qJ4K1J4NJ1
1784A010K7L5K6Kk2l0j8jJ1J1M%JMKqk7m1m3l4k0j3p%J5K6K6J2mj7k1j1RK5K2Jj6j8j1nlK
1779I01QQKLJ6L1L5K4RJNK0L3K6ll3m2k6lRjk2l0k1opj5j4jP%mNK0J6qk9l4k6j8j0lJ3L2M3
1774I11L3J2kLJ4J0jjQQklJ4K7K3Oj0j8j8rQK1J8Nrk3l1k9j7rj6k7k6j0MJ6L4N4N8L3nl2l6
1768I86k4lJ3J5Nmnoj1j2OL2M1K3rk5k3j1jJmj6j9kK8N0M5J5j5k3rMO%k%nk4m1m1k8j5j1p
1763H74LJ1J4J8K9L4K5Lj0j0LJ2J1Kj3j6mJ7K6J3rk4j8KK2K3Nj2qJ0J8QprkMJ2K7L3J1k7m8
1758A053l9k4k2j9NL7M5K1lnJnj7k3k0j9j8pNMj3k1j0QJ7J8J9J6OlKJ1J4J0J5K5J6j5m2m0
$$ plain form
1795 1020 1022 1009 982 949 920 901 896 902 914 922 923 923 926 931 936 942 951 961 968 970 971 973 976 982 991 999 997 983 963 939 915 908 934 985 1026 1031 1011 1001 1013 1028 1029 1024 1034 1058 1083 1102
1789 1102 1123 1149 1166 1157 1122 1084 1066 1071 1089 1103 1110 1108 1099 1087 1077 1073 1074 1069 1050 1015 982 970 985 1013 1034 1037 1023 994 962 943 947 968 982 973 953 945 959 980 994 999 1010
1784 1010 1037 1072 1098 1100 1078 1048 1030 1029 1040 1051 1055 1055 1056 1060 1062 1054 1027 986 943 909 889 876 869 869 884 910 936 948 944 927 906 895 904 929 951 952 936 918 907 902 899 901
1779 901 909 917 919 922 938 969 1004 1028 1037 1038 1043 1063 1096 1122 1119 1086 1044 1018 1015 1024 1023 1001 971 950 944 937 922 908 907 914 914 910 915 935 951 943 914 880 854 836 826 823 836 868 911
1774 911 944 956 954 957 971 981 980 979 987 995 993 990 1004 1031 1054 1060 1050 1032 1014 1005 1013 1034 1052 1057 1048 1025 994 965 948 939 923 896 870 860 864 880 914 968 1026 1059 1054 1022 986
1768 986 962 959 972 987 992 988 983 977 966 954 960 992 1033 1056 1047 1022 999 988 987 988 984 968 949 947 975 1025 1070 1085 1070 1047 1038 1042 1048 1048 1046 1046 1041 1017 976 935 907 892 881 874
1763 874 877 888 902 920 949 983 1008 1011 1001 991 994 1006 1017 1019 1006 990 986 1003 1029 1042 1033 1009 991 993 1015 1038 1043 1031 1023 1033 1051 1059 1052 1043 1041 1045 1057 1084 1117 1128 1101 1053
1758 1053 1014 990 968 949 954 991 1036 1057 1054 1049 1050 1045 1028 1005 985 966 948 941 946 950 937 916 906 914 931 949 968 984 990 987 989 1000 1014 1024 1039 1064 1080 1065 1023 983
1753I83j8ljkjoj2j2KJ5J6J0RJ3J0pk5k5lK4L5K6Nj3k2k3j4JJ4J7J0KoqKK1L2K0jqLJ1Kro
1747A058LKj3l0l9l4j7MJ7J1j0k5k6j3PK6L7L0J2KPJ4J0JjNJ2J4J4J4J3OjnqpKJ1Qqk6l2k5
1742A020j4olk%Knj8k3qK0L3J8mnJ5L1K0JJJ8L0K5J8K0K2Pj6k6j8rmKJ5J5kk7l3j8JQLpj7
1737A080k1j7kJ4K7L2K0rl8l6jL5M3K5J1P%j5k5j8lOLlnkLLmj3nJ8L3K7NkJ1K9L6K8K1J6J7
1731A331J4Lj8k7j7NPj3k9k3mMoj5j4j1j4k3k3rJ6L7L5J6jnpj8k6j8KJ3PLONj3l8n0l3kJ9
1726A066J9O%J3K7K9J9J7K7L0J5MJ4L5L8K3Nqj9l2l4k5j2lKNLJLMJj1k5l1k6j4jMok3l1k5
1721A084j6j3pOJ3%k1k6oK0K5Lk0j7J0L1K7J1NJ6K1J7J0Lqj9j6KJ6J7J8K6J9j1m4n0l1rOJ8
1716A110J6jj1OL4L3kl1l1k2k5k1NL8M8L5J6Jj7k6j6PJ7Lk3l6k6LK9L6J7ok1k5k6k3j5qm%
$$ plain form
1753 983 965 962 961 959 958 952 940 928 930 945 961 971 980 993 1003 996 971 946 943 967 1002 1028 1033 1020 998 975 961 962 976 993 1003 1005 999 991 993 1014 1046 1066 1065 1057 1060 1071 1073 1064 1058
1747 1058 1061 1063 1050 1020 981 947 930 934 951 962 952 927 901 888 895 921 958 988 1000 1002 1009 1023 1033 1034 1033 1038 1050 1064 1078 1092 1105 1111 1110 1105 1097 1090 1092 1103 1111 1103 1077 1045 1020
1742 1020 1006 1000 997 995 995 997 992 974 951 943 963 996 1014 1010 1005 1020 1051 1071 1072 1073 1091 1121 1146 1164 1184 1206 1213 1197 1171 1153 1144 1140 1142 1157 1172 1170 1143 1110 1092 1093 1101 1104 1097 1080
1737 1080 1059 1042 1040 1054 1081 1113 1133 1124 1086 1050 1049 1084 1127 1152 1163 1170 1170 1155 1130 1112 1109 1115 1118 1115 1110 1108 1111 1114 1110 1097 1092 1110 1143 1170 1175 1173 1184 1213 1249 1277 1298 1314 1331
1731 1331 1345 1348 1330 1303 1286 1291 1298 1285 1256 1233 1229 1233 1227 1212 1198 1187 1173 1150 1127 1118 1134 1171 1206 1222 1221 1216 1209 1191 1165 1147 1149 1162 1169 1172 1178 1183 1170 1132 1082 1049 1047 1066
1726 1066 1085 1091 1091 1104 1131 1160 1179 1196 1223 1253 1268 1272 1286 1321 1359 1382 1387 1379 1360 1328 1294 1269 1257 1254 1256 1261 1264 1265 1268 1272 1273 1262 1237 1206 1180 1166 1165 1169 1163 1140 1109 1084
1721 1084 1068 1055 1048 1054 1067 1067 1046 1020 1014 1034 1059 1062 1042 1025 1035 1066 1093 1104 1109 1125 1146 1163 1173 1176 1168 1149 1133 1135 1151 1168 1186 1212 1231 1220 1176 1126 1095 1086 1092 1110
1716 1110 1126 1125 1114 1120 1154 1187 1185 1154 1123 1101 1076 1055 1060 1098 1146 1181 1197 1198 1181 1155 1139 1146 1163 1166 1143 1107 1081 1084 1113 1149 1166 1160 1139 1114 1088 1065 1050 1042 1038 1038
1711A038RJ6J1kj3j5j2k%j3l3l2JL9M5J9kqrj7j5OL2M1K9Qj0j6qKkj4j7oMJpqppmNQKKJ2J3
1706A064rl4l2jK9L9L4K8J9Nrj9k4k7k7k8l4l4k0RL8N3N0L6J9JopljkmjMPMnj0qlmkJL%%J1
1700A100J5Jj5j5%J1J6K6L8L2jl0l2j3OJ4J0kj7k9l4l6l3j7QK8L2L3L8M0K1pk7l2l1k4j3k
1695A059MRJ6J8Oj2j3JJ2Qnj3j0kNLj4l5m2k1J1L8M4L4J8M%J%kj0j5j2KJ8K0QJOJ7J9J5J4
1690A205J6J4RQOjj3j9j7j4j5j3j3j4k1k1j4oMJ4J8J3NK%j1k9l5k6j1KK2M4N1L5J5J0Onj7
1685A184j5%OkqpmoonnmLJ9L1L2K9K7K8K6J4JolMkk0l5l3k4j5q%LmlJ7M2M2J1j6j7JROJ0L1
1679A328N1N0K0j8l9l1rRJ7K0K2K2J7Pkj1j0jQNoj2mQJ4J3J5J6J3RLmj3j5oOJ6K7K7Pk1k8
1674A520lK4J9pk0oJ4J5Lqj1j2nJ2L1M2M4M3M5M9N5O3O6N7M0K6K2K6L3M3N5P0Q0Q0P3O3N8
$$ plain form
1711 1038 1047 1063 1074 1072 1059 1044 1032 1030 1030 1017 984 952 953 992 1037 1056 1054 1046 1037 1020 1005 1011 1043 1084 1113 1121 1111 1095 1087 1089 1087 1073 1056 1050 1054 1055 1048 1040 1033 1026 1022 1027 1035 1037 1039 1051 1064
1706 1064 1055 1021 989 988 1017 1056 1090 1118 1137 1142 1133 1114 1090 1063 1036 1008 974 940 920 929 967 1020 1070 1106 1125 1126 1120 1113 1110 1109 1107 1103 1102 1106 1113 1117 1112 1102 1094 1091 1087 1085 1086 1089 1089 1089 1100
1700 1100 1115 1116 1101 1086 1086 1097 1113 1139 1177 1209 1208 1178 1146 1133 1139 1153 1163 1161 1144 1115 1081 1045 1012 995 1003 1031 1063 1096 1134 1174 1195 1188 1161 1129 1098 1074 1061 1059
1695 1059 1063 1072 1088 1106 1112 1100 1087 1088 1100 1108 1103 1090 1080 1078 1083 1086 1072 1037 995 974 985 1023 1067 1101 1119 1123 1123 1124 1124 1122 1112 1097 1085 1087 1105 1125 1133 1134 1140 1157 1176 1191 1205
1690 1205 1221 1235 1244 1252 1258 1257 1244 1225 1208 1194 1179 1166 1153 1139 1118 1097 1083 1077 1081 1095 1113 1126 1131 1133 1133 1122 1093 1058 1032 1021 1023 1045 1089 1140 1175 1190 1200 1206 1201 1184
1685 1184 1169 1169 1175 1173 1165 1158 1154 1148 1142 1137 1132 1128 1131 1150 1181 1213 1242 1269 1297 1323 1337 1338 1332 1329 1333 1331 1311 1276 1243 1219 1204 1196 1196 1199 1195 1192 1209 1251 1293 1304 1288 1271 1272 1281 1287 1297 1328
1679 1328 1379 1429 1449 1431 1392 1361 1352 1361 1378 1398 1420 1442 1459 1466 1464 1453 1443 1442 1450 1455 1449 1437 1433 1441 1455 1468 1483 1499 1512 1521 1524 1520 1507 1492 1486 1492 1508 1535 1562 1569 1548 1520
1674 1520 1517 1541 1560 1553 1533 1527 1541 1556 1559 1551 1540 1528 1523 1535 1566 1608 1652 1695 1740 1789 1844 1907 1973 2030 2070 2096 2118 2144 2177 2220 2275 2345 2425 2505 2578 2641 2699
1670B699O0O7P0O6O3O8P9Q9R3R8J04J13J23J43J74K07K31K45K60K85L16L51L90M40N01N62
1667G897O19O75P37Q16R13J012J083J099J051R32P42M79J78j14l51n16o26o98p40p54p41p04
1664A2989o62o25n90n37m54l55k67k06j70j45j22r1m7NM9O9P6R6J38J85K14K33K68L31M10
1661A0792M79N31N75O34P18Q21R29J035J153J310J513J751K010K286K575K847L071L236L319
1658D1585L269K985K398J538N39m19j210j800k220k501k654k695k655k567k445k289k104j913
1656B4842j730j551j367j180j007q55p23n98m82l90l33k96k50j85j21p0k9J6P3J42K20L01
1654A4427L63M05M49N23O24P41Q80J055J258J459J653J866K120K397K668K919L140L288L290
1651D5525L056K520J688O76l32j182j823k276k582k761k836k837k779k670k518k334k136j936
$$ plain form
1670 2699 2759 2826 2896 2962 3025 3093 3172 3261 3354 3452 3556 3669 3792 3935 4109 4316 4547 4792 5052 5337 5653 6004 6394 6834 7335 7897
1667 7897 8516 9191 9928 10744 11657 12669 13752 14851 15902 16834 17576 18055 18233 18119 17768 17252 16626 15928 15188 14434 13693 12989
1664 12989 12327 11702 11112 10575 10121 9766 9499 9293 9123 8978 8856 8765 8718 8723 8772 8841 8917 9013 9151 9336 9550 9783 10051 10382 10792
1661 10792 11271 11802 12377 13011 13729 14550 15479 16514 17667 18977 20490 22241 24251 26537 29112 31959 35030 38266 41585
1658 41585 44854 47839 50237 51775 52314 51895 50685 48885 46665 44164 41510 38815 36160 33593 31148 28859 26755 24842
1656 24842 23112 21561 20194 19014 18007 17152 16429 15831 15349 14959 14626 14330 14080 13895 13774 13704 13675 13691 13764 13906 14126 14427
1654 14427 14790 15195 15644 16167 16791 17532 18412 19467 20725 22184 23837 25703 27823 30220 32888 35807 38947 42235 45525
1651 45525 48581 51101 52789 53465 53133 51951 50128 47852 45270 42509 39673 36836 34057 31387 28869 26535 24399 22463
1649B2463j744j555j365j176j004q58p37o35n56n03m65m28l92l57l11k54k03j79j70j42q6
1646I343k5K1M5N7O6Q7J31J96K69L52M51N51O31O91P59Q46R23R63R61R07P71N29K18j01l82
1643A9260o17q04r20r57r46r34r39r37q98q25p49o87o21n39m64m23m08l84l41l02k75k44k03
1641D843j75j72j71j51j29j28j36j31j11r6q7p3n9o1p5q2q7r7j00p2l0j3l0m5l9l3n1p3o6
1637B270l4oNJ2J6jm0q2j01r1n9l2l0m8o8o5m8l4k9k4j2mjoj0j1qrj5k0j0QJ7OmkNLmlLOJ
1632A441j0k1l4l7k1NJ6Nj0j6j8l3n1n3k9JJ4OKJ7L8M0K2J3K3K7Ll3m2k1LOjmpj8k4j5J1L7
1627A232M5L0qm6n5l0NJ7J2MJlrpLJ9K9K9J7%j0rnpj1j1j5l6n7m9qL8O1N6L8J3j8l8l3j4%
1622A170kj1k0k1j6pJLRK4M1M3K2JnMJ2J5J5Qj3l6l5qJ8K0Kj1j7k5l4l3j7kPJ7K9K8Ok2l1
$$ plain form
1649 22463 20719 19164 17799 16623 15619 14761 14024 13389 12833 12330 11865 11437 11045 10688 10377 10123 9920 9741 9571 9429 9343
1646 9343 9318 9339 9384 9441 9507 9594 9725 9921 10190 10542 10993 11544 12175 12866 13625 14471 15394 16357 17318 18225 18996 19525 19743 19642 19260
1643 19260 18643 17839 16919 15962 15016 14082 13143 12206 11308 10483 9734 9047 8426 7887 7423 7000 6592 6208 5867 5565 5290 5046 4843
1641 4843 4668 4496 4325 4174 4045 3917 3781 3650 3539 3443 3356 3283 3224 3163 3088 3006 2919 2822 2722 2650 2620 2607 2577 2532 2493 2460 2409 2336 2270
1637 2270 2236 2230 2235 2247 2263 2262 2222 2140 2039 1948 1889 1857 1827 1779 1711 1646 1598 1564 1535 1511 1499 1495 1494 1488 1478 1467 1459 1450 1435 1415 1405 1413 1430 1436 1432 1430 1435 1438 1434 1431 1434 1440 1441
1632 1441 1431 1410 1376 1339 1318 1323 1339 1344 1334 1318 1300 1267 1216 1163 1134 1135 1149 1155 1157 1174 1212 1252 1274 1287 1310 1337 1340 1307 1265 1244 1247 1253 1252 1248 1241 1223 1199 1184 1195 1232
1627 1232 1277 1307 1299 1253 1198 1168 1173 1190 1202 1206 1207 1204 1195 1188 1191 1210 1239 1268 1285 1285 1275 1266 1261 1254 1243 1232 1217 1181 1124 1075 1067 1105 1166 1222 1260 1273 1255 1217 1184 1170 1170
1622 1170 1168 1157 1137 1116 1100 1093 1094 1097 1106 1130 1171 1214 1236 1237 1232 1236 1248 1263 1278 1286 1273 1237 1202 1194 1212 1232 1234 1223 1206 1181 1147 1114 1097 1095 1102 1119 1148 1176 1182 1160 1129
1617A129k4j2kKlj5k3j4OK2K7L2L5K4Jj2kJ6K2J1mqmNP%ppNJ3Jk4l6k4PK9K9Rqqnj2k8l7k6
1611A087j5j9l8m7l3oJ4K2K1K2K6K7K1J8K5L9L9J7k0m3l8j3RJ8J7J5Qlj2j0j%lrj1j4j8j3
1607A079MJ3Jj9j6J4M3M6K7Noompj7k9k9j5k%qj5j5j4j3j2qnKRJ3J7K6L9L3Oj8j6JJj4j8k
1601A071J2Oj1j8oMOjj0j0LK0L1K7J7Olj0lJ3K0Qj3k1j5j4k0k8k2mJ5J9%k3k6jK8L7K9J9L
1596A135k5n1m4j1J9J6%mJ0K2J6mk5l2k6j6j2qJ0L2L5J0k8n0n1l4oK4M4M2K6J5J8K6K8K2J3
1592A136OMMjj5k7k5j0QJ6J2%j3k5l1l0j7MK2K8K1QMJ2K5L1K5RnqLJ5J2kj5j7j0opj3j5j0
1587A103%PNlj2j6j7k2k8k8j6QL1L8K8J4PJ3J9J8J2NJmqj1j0kJ5L4M1K9J2jprnKLj1k6k4r
1582A176%rj5pQJ5J1QJ2J8K1K0Qj4l1l4k9l1l5k7pMjmPK4K9K3J6J0jroPJ3Omqrj0j3mJ7M7
$$ plain form
1617 1129 1105 1093 1091 1093 1090 1075 1052 1038 1044 1066 1093 1125 1160 1184 1185 1173 1171 1187 1209 1220 1216 1208 1204 1209 1216 1216 1209 1202 1207 1220 1221 1197 1161 1137 1144 1173 1202 1211 1203 1195 1190 1178 1150 1113 1087
1611 1087 1072 1053 1015 968 935 929 943 965 986 1008 1034 1061 1082 1100 1125 1164 1203 1220 1200 1157 1119 1106 1115 1133 1150 1165 1173 1170 1158 1148 1147 1147 1144 1135 1124 1110 1092 1079
1607 1079 1083 1096 1097 1078 1062 1076 1119 1165 1192 1197 1191 1185 1181 1174 1157 1128 1099 1084 1082 1082 1074 1059 1044 1030 1017 1005 997 992 994 1003 1016 1033 1059 1098 1131 1137 1119 1103 1104 1105 1091 1073 1071
1601 1071 1083 1089 1078 1060 1054 1058 1064 1063 1053 1043 1046 1066 1097 1124 1141 1147 1144 1134 1131 1144 1164 1172 1159 1138 1123 1109 1089 1061 1039 1035 1050 1069 1069 1046 1020 1019 1047 1084 1113 1132 1135
1596 1135 1110 1059 1015 1004 1023 1039 1039 1035 1045 1067 1083 1079 1054 1022 996 980 968 960 970 1002 1037 1047 1019 969 918 884 878 902 946 988 1014 1029 1047 1073 1101 1123 1136
1592 1136 1142 1146 1150 1149 1134 1107 1082 1072 1080 1096 1108 1108 1095 1070 1039 1009 992 996 1018 1046 1067 1075 1079 1091 1116 1147 1172 1181 1176 1168 1171 1186 1198 1196 1181 1164 1154 1148 1141 1128 1113 1103
1587 1103 1103 1110 1115 1112 1100 1084 1067 1045 1017 989 973 981 1012 1050 1078 1092 1099 1112 1131 1149 1161 1166 1167 1163 1155 1144 1134 1132 1147 1181 1222 1251 1263 1262 1255 1246 1241 1243 1246 1235 1209 1185 1176
1582 1176 1176 1167 1152 1145 1153 1168 1179 1187 1199 1217 1238 1258 1266 1252 1221 1187 1158 1127 1092 1065 1058 1062 1061 1057 1064 1088 1117 1140 1156 1166 1165 1156 1150 1157 1170 1176 1172 1164 1155 1145 1132 1128 1145 1192
1576A192P2P5N2J8j0k1k7l1k8j4LPmk2l8l6j4J3K0%j9j4RK1Ok1l5k8j1nk4n2n6k1K5L7J3j6
1572A016k6k7k5j2J7L9K9LoJ0J9Mk3l6l2j9mJ7L6M5M2L5K6J3lj7k4j6MK9M6M7L5J7jj4k4l2
1567A188l5l5l0k4j6j1plmj1k2l1k9j6kOJ1K0L2L5K4Lj7k9l1k4j1JNNQJ5J9J8J6J2MjQK6L4
1562A101K2N%PPlj4k1k4k0lJ4J9Onooj4k5j9JJ4Mk1l7l1j6jJ1K7L7K8Lj3mJ6J9MpjJj2k5j7
1557A001QK7L1K1Oj5l0l2k8k6k7j7KQkqjPLqoLMnj1jJ7K9K9K0RkrpLJ0Lj9m3m4k0J4L3L6L3
1551I96K8K3J9J9K2K1J2lk3l9l7j2K0M0M3L7K2jk6l3k6k0j9j3k%rrRL1L7K8J9J1%j5k3k0j8
1546A089j5qkpk1k7j8pqj6k1j1LJ1Kj1j9j0QK4L1L1L2K9J9Mj1k5k8k1j0oo%J2K0J3mk0k1j0
1541I65PJ9J7Mj0j9k6l4l3j9jJrj1OK6L6L9N0N3L1rl5l1j4j1j9k1j4nJJ5K5K0Kj1j4j6k5k7
$$ plain form
1576 1192 1264 1339 1391 1409 1399 1378 1351 1320 1292 1278 1281 1288 1284 1262 1224 1188 1174 1187 1207 1207 1188 1174 1183 1204 1210 1189 1154 1126 1115 1110 1086 1034 978 957 982 1019 1032 1016
1572 1016 990 963 938 926 943 982 1011 1014 1008 1018 1037 1041 1018 982 950 931 927 944 980 1025 1067 1102 1128 1141 1138 1121 1097 1081 1085 1114 1160 1207 1242 1259 1258 1244 1220 1188
1567 1188 1153 1118 1088 1064 1048 1037 1030 1027 1023 1012 990 959 930 914 912 918 929 949 981 1016 1040 1043 1026 997 966 942 931 932 937 942 950 965 984 1002 1018 1030 1034 1033 1041 1067 1101
1562 1101 1123 1128 1128 1135 1142 1139 1125 1104 1080 1060 1057 1071 1090 1096 1091 1085 1079 1065 1040 1021 1022 1036 1040 1019 982 951 935 934 945 972 1009 1037 1040 1027 1023 1039 1058 1062 1055 1054 1055 1043 1018 1001
1557 1001 1009 1036 1067 1088 1094 1079 1049 1017 989 963 936 919 921 929 927 919 918 925 928 920 914 917 921 916 905 904 921 950 979 999 1008 1006 997 990 993 1003 1006 987 944 900 880 894 927 963 996
1551 996 1024 1047 1066 1085 1107 1128 1140 1137 1114 1075 1038 1026 1046 1086 1129 1166 1188 1187 1161 1128 1102 1082 1063 1050 1048 1048 1039 1030 1039 1070 1107 1135 1154 1165 1165 1150 1127 1107 1089
1546 1089 1074 1066 1064 1057 1036 1009 991 984 976 960 939 928 931 942 944 933 914 904 912 936 967 998 1030 1059 1078 1082 1071 1046 1018 997 987 981 975 975 987 1007 1020 1016 996 975 965
1541 965 972 991 1008 1012 1002 983 957 923 890 871 870 871 862 851 857 883 919 958 1008 1061 1092 1083 1048 1017 1003 992 973 952 938 933 934 949 974 994 996 985 971 955 930 903
1536I03j0J2J8J2J0J3J4J7K4K3Mj7j8JJ1Jj1j0ml%QJ2Kp%P%j3j1J0K7K9K4J7Jk1l1k1j0j9
1531I94l8m4k6MK9L8K9J0qj8j8rQL1M3L7J4j1l2l8k9j0KNQK7M7N0K5pk8k9j9mRJ2QNJj1l0
1526A027l7k1PK8L2K2Rrk1k1j1nqj8k0j6nQJ8K4K5K9L0K4J2Kj%JKORNlj2k0k5k2pRK0K2K0
1521A109J4KnkQMj4k9k6j1LQMlrj2j8l3m6m2k4oPK4M0L9J5j1rJ6L9M9M1K4Lo%Pjj7j7olj9
1516A087k9k0nkj2j7j0kJNJ2J5Qmj0%J1Rpk1j8mMLlj1k4k8j5J4L7M7M7L8K0Jolj0l6n3l9q
1510I62J1J7K4L0J7j0k4j4KKqrMJ8K0J1lj4j7k0k3k2rPJ3RJ3K3K1lj8%L1M1J7noORNK%k%J4
1505A122K0Pj2j0J2J5j6m5l4MK2J2LJ4J9ll5l8j5NJ0J2J9K5K0Pqj8k4j8qnj4k2k2j6pKJ4J8
1500A012RljJ4K6K0lk9m5m4l5k1oJ0K2K0Jj8j9KK0J8Jr%J4J5RJ5L2M1K4KnNJ6J8Pj0l0m2l4
$$ plain form
1536 903 893 905 923 935 945 958 972 989 1013 1036 1040 1023 1005 1006 1017 1018 1007 997 993 990 990 998 1010 1012 1005 1005 1012 1012 999 988 998 1025 1054 1078 1095 1096 1075 1044 1023 1013 994
1531 994 956 912 886 890 919 957 986 996 988 970 952 943 951 982 1025 1062 1076 1065 1033 995 966 956 958 963 971 998 1045 1095 1120 1113 1085 1056 1037 1033 1042 1054 1062 1067 1068 1057 1027
1526 1027 990 969 976 1004 1036 1058 1067 1058 1037 1016 1005 1000 992 974 954 938 933 941 959 983 1008 1037 1067 1091 1103 1105 1104 1104 1105 1107 1113 1122 1127 1124 1112 1092 1067 1045 1038 1047 1067 1089 1109
1521 1109 1123 1125 1120 1118 1126 1130 1116 1087 1061 1050 1053 1061 1065 1062 1053 1041 1023 990 944 902 878 872 879 903 943 982 997 986 977 993 1032 1081 1122 1146 1149 1143 1143 1150 1149 1132 1115 1109 1106 1087
1516 1087 1058 1038 1033 1031 1019 1002 992 990 991 996 1008 1023 1031 1027 1017 1017 1028 1037 1030 1009 991 987 991 994 991 980 956 928 913 927 964 1011 1058 1096 1116 1117 1111 1108 1098 1062 1009 970 962
1510 962 973 990 1014 1044 1061 1051 1027 1013 1015 1017 1009 1000 1004 1022 1042 1053 1050 1036 1019 999 976 954 945 952 965 974 987 1010 1031 1028 1010 1010 1041 1082 1099 1094 1088 1094 1103 1108 1110 1110 1108 1108 1122
1505 1122 1142 1149 1137 1127 1139 1154 1138 1093 1059 1063 1085 1097 1100 1114 1133 1130 1095 1057 1042 1047 1057 1069 1088 1113 1133 1140 1132 1114 1090 1072 1064 1059 1045 1023 1001 985 978 980 994 1012
1500 1012 1021 1018 1017 1031 1057 1077 1074 1045 1000 956 921 900 894 904 926 946 947 929 910 912 932 950 951 942 942 956 971 980 995 1027 1068 1092 1094 1089 1094 1110 1128 1135 1125 1095 1053 1019
1495A019rJ3K4K4J6%k2l1k2lRMrk4k6rJ1J9Pj2k2k2j6pjmj5j2J3M1M1J3j8l5l0j4kok2k2O
1490H45M1N1L8K9L5L4J6nj3j2j3j5j2j8l7m7k8RK6J0j3j1J0L1L7L0K1Pj3l3m0l0j5j5k9l1
1485H40j1J6K8K7L1M1M6M1K8J1j0k1j2J7L8L0Lj9j8%J8K0Mj7k2nK0K6Rj9l1j8NK0J2oj7j7
1481A088j2p%POoj4pQJ2Lnqj3k2k8k2pNJ3J7J7J9K1K3J4LKJ3J9Lk2l9m1l7k9j0NKj5k5j7r
1476I05opMJ6K0J8J7J9J8J2Jrj9k0j0OK5M2M4K7kj7j2pqj2nkj1k1j4jql0l2oJ9K2J3J2Pj2
1470I76l1l0oJ5K5K6K4J6Q%mj1k0k3k1j3nQJ5J3Mmnqj6j6nJ6L3L3J6kj0j1j2j6j2JPJkJ3L7
1465A004M7L2J0jLJ4K1J5nk1k5j6pnoqj3j2LJ7J5koQK2J3mpNNj2k4j4NJ4Mj0j5rljJK%oj4
1460A014j4nLOKmqnMJ3J7J6J1MnrlQOj1k7k2j2j6k8k5LL6M9L8J7mj4pJ5M2N5M7K4nl1m5m4
$$ plain form
1495 1019 1010 1023 1047 1071 1087 1087 1065 1034 1012 1009 1018 1022 1013 989 963 954 965 984 991 979 957 935 919 912 911 907 892 880 893 934 975 988 970 935 905 891 889 883 861 839 845
1490 845 886 937 975 1004 1039 1073 1089 1084 1071 1059 1046 1031 1019 1001 964 917 889 898 924 934 921 910 920 951 988 1018 1039 1046 1033 1000 960 930 915 900 871 840
1485 840 829 845 873 900 931 972 1018 1059 1087 1098 1088 1067 1055 1072 1110 1140 1143 1124 1106 1106 1124 1144 1148 1131 1109 1104 1124 1150 1159 1140 1109 1091 1096 1116 1128 1122 1105 1088
1481 1088 1076 1069 1069 1076 1082 1076 1062 1055 1063 1075 1078 1073 1065 1052 1030 1002 980 973 978 991 1008 1025 1044 1065 1088 1102 1105 1107 1120 1139 1142 1120 1081 1040 1003 974 964 969 971 956 931 914 905
1476 905 899 892 896 912 932 950 967 986 1004 1016 1017 1008 989 969 959 965 990 1032 1076 1103 1101 1084 1072 1065 1057 1045 1040 1038 1027 1006 992 991 983 953 921 915 934 956 969 981 988 976
1470 976 945 915 909 924 949 975 999 1015 1023 1023 1019 1008 988 965 944 931 926 934 949 962 966 962 957 949 933 917 912 928 961 994 1010 1008 998 987 975 959 947 948 955 956 954 967 1004
1465 1004 1051 1083 1093 1092 1095 1109 1130 1145 1140 1119 1094 1078 1071 1066 1060 1052 1039 1027 1030 1047 1062 1060 1054 1062 1084 1097 1093 1086 1091 1096 1084 1060 1046 1051 1065 1069 1059 1044 1035 1032 1031 1032 1034 1034 1028 1014
1460 1014 1000 995 998 1004 1006 1002 994 989 993 1006 1023 1039 1050 1054 1049 1040 1037 1045 1051 1040 1013 991 979 963 935 910 913 949 998 1036 1053 1049 1035 1028 1043 1085 1140 1187 1211 1206 1175 1130 1086
1454A086l0j4j2j9k1nJ9K8J9MKMKklJkj1j5j3mOK0L5L6K3Jj6k5k1j2qj8l8m0j2K4L0Kk8l5
1449I38j8m%KJ0J6J1%nLJ8K7K5J9J5J2Mj0k6l0j7PK3J7pk7k5KK9L4J7mrjNjrpKNJ%Kkj6k9
1444I97l0j8%K3M3M8L1%j9k0nJ3K5K9K3J5J0Jj6l6m6l7j9rkPJ5J5Nnn%Llj1j3r%J0J3J4J1
1439A048J1J0PjnLK0L1K1j0l9n1l6rK0L2K2%j9k1j0LLpk3k9k3lJ8L1L2K6J3mk0k4j3%M%kJ
1433A007Mmj8l1l3k5mK3M7N3L7J9J0Qkk1l1j5J3L0K2Mj0j4j2j1j0qlNRMj0j9j5qnplJjnJK2
1428I94M0L3Pj6k0j0OJ3Pj1l1l8k9j3NJ8K7K6J2pk2k4k1j6j2oOJ6J9QnpLJ4J4LmJJ3K1K5L4
1423A073M1L5J1j6k5j7qrj6j4p%knlKLkrj6j7j3pKOkj4j3J5M8N3J8k3l3qJ1Kj6j7lN%mJPR
1417A023J8M0N2L5Lj3pJj0k1j7kLmj4k0k1j8%K0K4Pj5k3k2j8j4jJ7K9K7J2pj4jJ9K2Oj0j0
$$ plain form
1454 1086 1056 1042 1030 1011 990 985 1004 1032 1051 1055 1057 1061 1063 1061 1058 1059 1057 1046 1031 1018 1014 1020 1040 1075 1111 1134 1135 1119 1094 1073 1061 1053 1035 997 957 945 969 999 1001 973 938
1449 938 920 916 916 918 928 944 955 955 950 953 971 998 1023 1042 1057 1069 1073 1063 1037 1007 990 997 1020 1037 1030 1003 978 980 1009 1043 1060 1056 1047 1046 1051 1050 1041 1034 1036 1041 1042 1042 1044 1042 1026 997
1444 997 967 949 949 972 1015 1063 1094 1094 1075 1055 1050 1063 1088 1117 1140 1155 1165 1166 1150 1114 1068 1031 1012 1003 1001 1008 1023 1038 1043 1038 1033 1033 1036 1033 1022 1009 1000 1000 1010 1023 1037 1048
1439 1048 1059 1069 1076 1075 1070 1073 1093 1124 1145 1135 1096 1045 1009 1000 1020 1052 1074 1074 1055 1034 1024 1027 1030 1023 1000 971 948 945 963 994 1026 1052 1065 1061 1041 1017 1004 1004 1008 1008 1006 1007
1433 1007 1011 1007 989 958 925 900 896 919 966 1019 1056 1075 1085 1093 1091 1070 1039 1024 1037 1067 1089 1093 1083 1069 1057 1046 1036 1028 1025 1030 1039 1043 1033 1014 999 991 986 979 976 977 976 971 972 994
1428 994 1034 1067 1074 1058 1038 1028 1034 1047 1054 1043 1012 974 945 932 937 955 982 1008 1020 1013 991 967 946 930 918 912 918 934 953 961 956 949 952 966 980 983 979 980 993 1014 1039 1073
1423 1073 1114 1149 1160 1144 1119 1102 1094 1085 1069 1055 1048 1048 1046 1041 1038 1040 1043 1041 1032 1016 999 986 979 981 987 985 971 958 973 1021 1074 1092 1069 1036 1028 1039 1041 1025 1008 1005 1010 1010 1006 1007 1014 1023
1417 1023 1041 1081 1133 1168 1171 1158 1151 1152 1142 1121 1104 1102 1105 1101 1087 1067 1046 1028 1028 1048 1072 1079 1064 1041 1019 1001 987 986 1003 1032 1059 1071 1064 1050 1049 1068 1090 1096 1086 1076
1412A076JKjklrj5qLKpoJ3K5J7MLONJJlk6n5o6m2mJ7J5JKK0L6L5K1J4K2K4Qj2j8j1opqpnJ
1406A054J3J7OqqJqk8l0lK7K7Mj5j2LJ4J8J0Jnoj2k9l7k2RL2L7K7J1pj9j3PK6K3J0LJ1K0J7
1401A166Jj3k3k3j3PJ6mm5p1n1oK4J8jj0pKJ3K7K8J1rj3jRJ1J0J4J9J6J2PLmj4k4l1l2j9j
1396I99J2J5J4J1QKkrk0l0k2%J7K3K5L7M0K2oj9j0JMQK1K2om0n0l3j6j0nRK5K8K0J2Kj4k8
1391A057l2k0nLJnnNJ5J0nqJ3L3K8Mj3j2mKJ7K9J9j0l3k8j1lj0j8k4k5j3J3L3K6M%J8M1M8
1386A135L7Pl1n9n3k5nqj8j7ojJJ0K4L4L3K7K1J8J2%j0j2noj8k9j9lkj9l2k4qRK5L5K7MkJ8
1381A065L3J4k3l7k2pkJ1L6M9L5Pj0j2j2k2l5m3l5j4OJ2MjLJ1J5J6J2JrrjMJn%J0J7J5Nnn
1376A073NPpk4j7RK3Qj9k8k5k2j4MJ8J7J0J5K2J3kLJ9K0lk2j3MPlj0nNJ0Mj3k4j4PJ1JLK7
$$ plain form
1412 1076 1077 1079 1078 1076 1073 1064 1049 1041 1044 1046 1039 1033 1046 1071 1088 1092 1095 1101 1106 1107 1108 1105 1079 1024 958 916 912 929 944 945 947 967 1003 1038 1059 1073 1095 1119 1127 1115 1097 1086 1080 1073 1065 1058 1053 1054
1406 1054 1067 1084 1090 1082 1074 1075 1067 1039 1009 1006 1033 1060 1064 1049 1037 1040 1054 1072 1082 1083 1078 1072 1060 1031 994 972 981 1013 1050 1077 1088 1081 1062 1049 1056 1082 1105 1115 1118 1129 1149 1166
1401 1166 1167 1154 1131 1108 1095 1102 1118 1114 1069 998 947 941 965 983 982 972 965 967 980 1007 1035 1046 1037 1024 1023 1032 1043 1053 1067 1086 1102 1114 1121 1124 1120 1106 1082 1051 1019 1000 999
1396 999 1011 1026 1040 1051 1059 1061 1059 1050 1030 1000 978 978 995 1018 1043 1080 1120 1142 1136 1117 1107 1108 1112 1120 1141 1163 1157 1117 1067 1034 1018 1008 1003 1012 1037 1065 1085 1097 1099 1085 1057
1391 1057 1025 1005 1000 1003 1004 999 994 999 1014 1024 1019 1011 1024 1057 1085 1089 1076 1064 1060 1062 1079 1108 1127 1117 1084 1056 1045 1042 1032 1014 990 965 952 965 998 1024 1028 1028 1046 1087 1135
1386 1135 1172 1179 1148 1089 1036 1011 1006 998 980 963 957 956 957 967 991 1025 1058 1085 1106 1124 1136 1136 1126 1114 1109 1103 1085 1056 1037 1034 1032 1013 981 957 949 958 983 1018 1045 1049 1047 1065
1381 1065 1098 1112 1089 1052 1030 1023 1021 1032 1068 1117 1152 1159 1149 1137 1125 1103 1068 1025 990 976 982 994 998 997 1000 1011 1026 1042 1054 1055 1046 1037 1036 1040 1041 1036 1036 1046 1063 1078 1083 1078 1073
1376 1073 1078 1085 1078 1054 1037 1046 1069 1077 1058 1030 1005 983 969 973 991 1008 1018 1033 1055 1068 1066 1069 1088 1108 1105 1083 1070 1074 1081 1078 1068 1063 1068 1078 1082 1069 1045 1031 1038 1049 1050 1053 1080
1371A080L9J4j9j9QK0Pomnk5m1l2qRRNMJ%QJ8K0Roj3j7k3k5j8kJ5K1J5Mnj0j1qqj0j2pQK7
1365A007L7L2J8Jj1j0llj4k5j6J0K7J8%pJRJ4J4J7K0K1J5OjkKM%mj0j6k5k5j4ppmJ0J9kl9
1360A057n4k7J8M0K5lk1k1j1%RJ0Onk0k7k1nRJ6J6J8K2K3J7Qj0k6l1j5J7M2M1J5j7l0k1jJ0
1355A053J4J9K5K8K3J1lk1l2k6nJ5K0J5J1J0Jj0j6k0k9l5k5lJ3Oqj4rqj0oPJ7J4PKNNORJ0
1350A066kk4l1j3J5K5J3knjlqpmj0l0m7m5k8j1nkJ3L3M2K8MqnmpmJ0K6K8J4oj8j9lK6M6M2
1345A079J6rj0QK1K1J1J0J3Qpj6j4j2j7k3j9rnkRK3J6j1l6l4k0pLK0L3K7J4RR%j5k3k0j9j9
1340A003j2jJ2K4L7M1J6k3m3k7kKj1j5qklnjJlrj3j4j2kJ2K2K3J6J1J2K4L1K4Jk2l7l9l3j5
1335I60LJ2J0Jrj7j5NL1M4L8K7K5L2L3K5J2Jpqqj4k0rK0M1L7J8LmolNPJjJ5L4L9K9K6K9J9
$$ plain form
1371 1080 1119 1133 1114 1095 1103 1123 1130 1124 1120 1115 1090 1049 1017 1009 1018 1027 1032 1036 1037 1037 1045 1063 1083 1092 1086 1073 1056 1033 1008 990 988 1003 1024 1039 1043 1038 1028 1017 1009 1001 991 979 972 980 1007
1365 1007 1044 1076 1094 1095 1084 1074 1071 1068 1054 1029 1013 1023 1050 1068 1068 1061 1062 1071 1085 1099 1116 1136 1157 1172 1178 1177 1175 1177 1181 1181 1177 1167 1151 1126 1101 1087 1080 1073 1069 1079 1098 1096 1057
1360 1057 1003 976 994 1034 1059 1056 1035 1014 1003 1003 1012 1022 1028 1023 1003 976 955 950 959 975 991 1009 1031 1054 1071 1079 1069 1043 1012 997 1014 1056 1097 1112 1095 1065 1044 1043 1053
1355 1053 1067 1086 1111 1139 1162 1173 1170 1149 1117 1091 1086 1101 1121 1136 1147 1157 1158 1148 1132 1112 1083 1048 1023 1020 1033 1039 1031 1017 1008 1000 990 984 991 1008 1022 1029 1031 1036 1041 1047 1056 1066
1350 1066 1064 1040 1009 996 1011 1036 1049 1047 1042 1041 1038 1030 1023 1019 1009 979 932 887 859 848 843 841 854 887 929 957 961 953 948 944 937 933 943 969 997 1011 1005 987 968 965 991 1037 1079
1345 1079 1095 1086 1076 1084 1105 1126 1137 1147 1160 1168 1161 1145 1131 1119 1102 1079 1060 1051 1046 1044 1053 1076 1092 1081 1045 1011 991 984 987 1007 1040 1067 1081 1090 1099 1099 1084 1061 1041 1022 1003
1340 1003 991 990 1002 1026 1063 1104 1120 1097 1054 1027 1025 1027 1016 1001 993 991 988 983 982 983 980 971 958 944 932 930 942 964 987 1003 1014 1026 1050 1081 1105 1106 1084 1047 1008 975 960
1335 960 963 975 985 986 977 960 945 950 981 1025 1063 1090 1115 1147 1180 1205 1217 1218 1211 1203 1195 1181 1161 1152 1172 1213 1250 1268 1271 1267 1261 1258 1263 1270 1271 1270 1285 1319 1358 1387 1413 1442 1461
1329A461%oNJ4Jj9j5J1K4Ll8o3n5l2k6m3n6m3j8lknmj0j8k0j1%J2L1N0M9L2J8J8J4lj3kJ8
1325A256J5j1l7m8n0m2k0MJ1mj7j0PJ7J3MJKKLL%jMK2L5K7Jk1k0oMLJknnJRNqj8j9j6oQJ8
1319A110Rj3l2l9m0l6k4lOOOJ3J2MQL3N0K9rk0NK7J9j2l6m3l2rQQ%jQJ5J0%pk0l4l7j7J0K8
1314I60K8J2qk1k0j1lNJ8K7J5nrJ3L4L0J1PJ2Ok5n7o6m1MM2N3L4Mk0l2l9l5j4J3K6J6nj3l
1309I43PRQJ5K5K1PkLQjj1nJ3J5mj7j4kOJ8L8M5K4qk3j6j1j2j6j3j3j1ojmj1j1JJ1J2J2J3
1303A042Qkpopj3j7j2mKJ0J7J5%j5j4mNPJ0J8K8L1J4j5l9l5rJ5J6Kj1j6j5pMJ2PKLRLrqMJ1
1298A030kj9k1j0nqnPJ6Lk1l6k4NK9L7K8J2%pj0j1pJML%LPNljQJ3NolOJ3J0OJpj0mMjj7k7
1292I91j6oqj3kK6M7M0J2j8k8j4J6L6L2Rj2j3KK1K9K1Jj5j7nJ6L1L2J4rk1j9j9l0l9l6k2j2
$$ plain form
1329 1461 1461 1455 1460 1474 1475 1456 1441 1452 1476 1479 1441 1378 1323 1291 1265 1222 1166 1123 1105 1102 1100 1095 1091 1081 1063 1043 1032 1032 1044 1075 1125 1174 1206 1224 1242 1256 1253 1240 1238 1256
1325 1256 1271 1260 1223 1175 1125 1083 1063 1067 1078 1074 1057 1047 1054 1071 1084 1088 1089 1091 1093 1096 1099 1099 1098 1102 1124 1159 1186 1187 1166 1146 1140 1144 1147 1148 1146 1141 1136 1137 1146 1151 1143 1125 1106 1090 1084 1092 1110
1319 1110 1119 1106 1074 1035 995 959 935 932 938 944 950 963 975 979 987 1020 1070 1099 1090 1070 1075 1102 1121 1109 1073 1030 998 989 997 1005 1005 1004 1012 1027 1037 1037 1030 1010 976 939 922 932 960
1314 960 988 1000 992 971 951 940 937 942 960 987 1002 997 988 1001 1035 1065 1076 1083 1095 1101 1076 1019 953 912 916 958 1011 1045 1049 1029 997 958 923 909 922 948 964 959 946 943
1309 943 950 959 967 982 1007 1028 1035 1033 1036 1044 1043 1032 1027 1040 1055 1051 1034 1020 1018 1024 1042 1080 1125 1149 1141 1118 1102 1091 1079 1063 1050 1037 1026 1020 1019 1015 1004 993 994 1005 1017 1029 1042
1303 1042 1050 1048 1041 1035 1028 1015 998 986 982 984 994 1011 1026 1026 1011 997 993 998 1005 1015 1033 1061 1092 1106 1091 1052 1017 1008 1023 1039 1041 1030 1014 999 992 996 1008 1015 1017 1020 1029 1032 1023 1015 1019 1030
1298 1030 1028 1009 988 978 973 965 960 967 983 986 965 929 905 910 939 976 1004 1016 1016 1009 999 988 981 982 986 989 989 992 999 1004 1001 1000 1008 1021 1026 1020 1017 1023 1036 1046 1052 1053 1046 1036 1032 1036 1035 1018 991
1292 991 975 969 961 948 946 972 1019 1059 1071 1053 1025 1011 1027 1063 1095 1104 1092 1079 1081 1102 1131 1152 1153 1138 1121 1116 1132 1163 1195 1209 1200 1179 1160 1141 1111 1072 1036 1014 1002
1287A002jJ8L4L3J6Lloj5j8j0jkprplJQJ0RJ1J6J4%j6j9j3q%J5K9L2J9jj6k1j2%Mrk5k5j5
1282A012j2j8j6kJ1J3QPJ0J2J7K3K0J2J0J7J7jj7nK1L2J3plJ4K3J9J0lk1l4k6nPjk0l1l5l4
1277A037k6rNQMNJ3J6J4QNkqlJ7K6J0j6j9LJ4pm1n3m0k5j7j0jlj9k6nL0M8M7M5M3L0Jk5l1
1272A043j9mQJ6J3Jj2j4pknmjlj2j5lJ6K1J1%kJlmJQLn%J9K3Lk3k5nJ2QknKPRPNJJOJ1QJp
1265A083ojLM%%OJ4J5J1NJoj8k5k2j7j7j7j1%J0J5J5J3Pjrj2mK0M3M1J5mlOlk0k0rqk6l6k2
1260A010PK4K6K2K1J5Kk0l9m0j6J5K3J0ojJ6J9Nj3j7nJ0Prk4k1kR%j7k6k1j6j5j0J2M1N9M8
1255A083K1nj2j4k4l7l5j6KRJ9L7M5K7lj7j0%jj1k6l1k2lR%j3qNJj5j8JJ5J1LQK0J9RLN%q
1249A023kJ5L0K7J2nj5j7j1jJ5L4M8M7K3ok0j2OJ6J1j1m0o2o5n4l5j3J5L4L5K1QLMQJ3J7Q
$$ plain form
1287 1002 1001 1019 1053 1086 1102 1105 1102 1096 1081 1063 1053 1052 1050 1043 1034 1027 1024 1025 1033 1043 1052 1063 1079 1093 1093 1077 1058 1045 1037 1037 1052 1081 1113 1132 1131 1115 1094 1082 1082 1086 1077 1052 1027 1012
1282 1012 1000 982 966 964 975 988 996 1003 1013 1025 1042 1065 1085 1097 1107 1124 1141 1140 1123 1118 1139 1171 1184 1177 1174 1188 1211 1230 1240 1237 1216 1182 1156 1151 1158 1157 1137 1106 1071 1037
1277 1037 1011 1002 1007 1015 1019 1024 1037 1053 1067 1075 1080 1078 1070 1067 1084 1110 1120 1104 1085 1088 1102 1095 1054 1001 961 936 919 909 908 905 886 860 855 885 933 980 1025 1068 1098 1099 1074 1043
1272 1043 1024 1020 1028 1044 1057 1058 1046 1032 1025 1023 1018 1014 1013 1010 998 983 980 996 1017 1028 1028 1026 1027 1024 1020 1021 1029 1032 1027 1027 1046 1069 1072 1049 1024 1019 1031 1039 1037 1032 1034 1041 1050 1057 1062 1063 1064 1070 1081 1089 1090 1083
1265 1083 1077 1076 1079 1083 1083 1083 1089 1103 1118 1129 1134 1135 1129 1111 1086 1064 1047 1030 1013 1002 1002 1012 1027 1042 1055 1062 1061 1052 1040 1036 1056 1099 1140 1155 1151 1148 1154 1151 1131 1111 1102 1094 1068 1032 1010
1260 1010 1017 1041 1067 1089 1110 1125 1127 1107 1068 1028 1012 1027 1050 1060 1054 1053 1069 1088 1093 1080 1063 1058 1068 1075 1066 1042 1021 1019 1028 1028 1011 985 964 948 933 923 935 976 1035 1083
1255 1083 1104 1099 1087 1073 1049 1012 977 961 963 972 991 1028 1073 1100 1097 1080 1070 1070 1069 1058 1032 1001 979 976 985 985 972 964 969 970 955 937 938 953 964 967 975 995 1014 1023 1026 1031 1031 1023
1249 1023 1021 1036 1066 1093 1105 1100 1085 1068 1057 1056 1071 1105 1153 1200 1223 1217 1197 1185 1191 1207 1218 1207 1167 1105 1040 986 951 938 953 987 1022 1043 1051 1054 1058 1066 1079 1096 1104
1245A104oj0lJrj8j3kNNMkk0l6k9nJ6J9J3J0PKmorj3j3p%KLJ0K3L2K4Nj4j8nLqj7kL2M9K8
1239A128pj5jROJ3L5N0L8Qj7l3m4m6l4j8j0qmNJ1J4J2jk2k9pJ7J3k2m8m1j7oj1j5oPK0K1J6
1234I61J0J6L0L5J9MQK6L3J8jj2j7k4l2l6l4k6j2MJ3J2QRJ1J4J7J4Jk1l3k2jJ2J1J0J7K8L1
1229A101K1%k0k8j2J5K9J4j6l7l7k4j1qj9l7m1k1J6M0L8K4K4L9N1M7K8Lj8k9k0KJ6Oj8l5l5
1225A048k8k0rJ5L6M2L0J4lj8l5m5m1k7j1mjNJ5K5K6J8Plj2j6j2LJ7K0Roj6j8j5j2j1qOK4
1220I89L7K9J1mmOJ2J5J2ROOLrl0m0k8LK3K3R%jkkJ3L4L8J2j9k2MK2Qj8k4j1ok3m2l9j7JL
1215I87kmjMM%nmMNnj8k0rRK5L7L4J6LJ1L1L1Kl0l3j6oj4k2j2NJ0%mOJ9J4ql1l9l2j7KJ3J0
1209I50pj8pJ8M3N6M8K3j3l8l5j6mnnOJ5J6J9K6K4%k5l1k0j8k2j7OJ9J5MPJ3PlNL1N2M6J1
$$ plain form
1245 1104 1098 1088 1085 1086 1077 1059 1046 1044 1049 1054 1058 1056 1036 1000 971 966 982 1001 1014 1024 1031 1033 1029 1023 1014 1001 988 981 981 983 986 996 1019 1051 1075 1080 1066 1048 1043 1046 1038 1021 1019 1051 1100 1128
1239 1128 1121 1106 1105 1114 1120 1133 1168 1218 1256 1264 1247 1214 1170 1124 1090 1072 1062 1054 1050 1055 1066 1080 1092 1091 1069 1040 1033 1050 1063 1041 993 952 935 929 918 903 897 904 924 945 961
1234 961 971 987 1017 1052 1071 1075 1083 1109 1142 1160 1159 1147 1130 1106 1074 1038 1004 978 966 970 983 995 1003 1012 1023 1037 1054 1068 1069 1048 1015 993 992 1004 1015 1025 1042 1070 1101
1229 1101 1122 1122 1102 1074 1062 1077 1106 1120 1104 1067 1030 1006 995 987 968 931 890 869 885 925 963 987 1011 1050 1101 1148 1176 1179 1161 1132 1112 1114 1130 1136 1118 1083 1048
1225 1048 1020 1000 991 1006 1042 1084 1114 1128 1125 1107 1072 1027 986 959 948 944 943 948 963 988 1014 1032 1039 1036 1024 1008 996 999 1016 1036 1045 1039 1023 1005 990 978 967 959 965 989
1220 989 1026 1055 1066 1062 1058 1064 1076 1091 1103 1112 1118 1124 1127 1118 1088 1048 1020 1023 1046 1069 1078 1078 1077 1075 1073 1086 1120 1158 1170 1151 1129 1133 1155 1163 1145 1121 1110 1104 1081 1039 1000 983 984 987
1215 987 985 981 980 984 988 988 983 979 983 988 983 965 945 936 945 970 1007 1041 1057 1060 1071 1102 1133 1135 1105 1072 1056 1050 1036 1014 1002 1007 1017 1017 1013 1019 1038 1052 1044 1013 974 942 925 927 940 950
1209 950 943 925 918 936 979 1035 1083 1106 1093 1055 1020 1004 1000 995 990 996 1011 1027 1046 1072 1096 1096 1071 1040 1020 1002 980 963 969 988 1003 1007 1014 1027 1034 1031 1036 1067 1119 1165 1176
1204A176k2l1j5J1L0M2L9J5k4n0m1j3%qj8j6j0mQK3K5Kk4l5l4l2k4nJ0PmkJ5K4K8L2L8K8Q
1199A149lMJ1Lj3j7r%QQKqj4pMJ2RJomLLqj6qOOqj5rpj7k3j4%J%NPkqRM0N6M9L2J8QJJNJo
1193A240okj4l7m0j2J8J7j0k3rJ2J7Mj0j4oPJ6J5Pjpj4k5l2l2l4l5k7qJ1QnnJ5L2K5Kj8k3
1188I97j9oJ0J8J3QJ2J6Kk1k9k1k4l8l4jL2K8Lj2qmjRJ9J8J5K5L8L0Oprk0l8l8j4%j3k8j4
1183I00J5K9K6K2J7PLQNj4k5oK0K0jmJ0J3oj7j3j5l4l9j5J8L1K5K1K2J7PMPJ2J9K3J8KnOJ4
1177A147Jk3k8j4pj8k7j6lKjLOkj3j3kMKNK4M6M4J1l7o3m9j1K0K4J0jJOM%%LOP%rj6j1NJ3
1172A030Kk0k6mK3L5K7J3jj3j7qPJ3J1QQol2m7k6PK2Nj5j1OK0K2J9J8K7M3M9L0j1m4m6k6p
1167A085LJ6L0L6K7J6J3J6J0pk8m4m9l8k1qJJ2K3K4Rormpj9k5j9roo%J0J5J5J7K0J7Noj1j5
$$ plain form
1204 1176 1154 1123 1108 1119 1149 1191 1230 1245 1221 1171 1130 1117 1117 1109 1091 1075 1065 1061 1069 1092 1117 1119 1095 1060 1026 994 970 965 975 982 978 976 991 1015 1043 1075 1113 1141 1149
1199 1149 1146 1150 1161 1164 1151 1134 1125 1125 1133 1141 1143 1135 1121 1114 1118 1130 1139 1140 1134 1130 1133 1136 1128 1112 1104 1110 1116 1108 1093 1084 1077 1060 1037 1023 1023 1024 1024 1029 1036 1034 1026 1035 1075 1131 1180 1212 1230 1238 1239 1240 1245 1246 1240
1193 1240 1234 1232 1218 1181 1141 1129 1147 1164 1154 1131 1122 1134 1151 1155 1145 1131 1125 1132 1148 1163 1170 1169 1162 1148 1123 1091 1059 1025 990 963 955 966 974 969 964 979 1011 1036 1038 1020 997
1188 997 978 972 982 1000 1013 1021 1033 1049 1051 1030 1001 980 956 918 884 883 915 943 946 934 926 922 921 930 949 967 982 1007 1045 1075 1081 1074 1065 1045 1007 969 955 955 942 914 900
1183 900 915 944 970 992 1009 1016 1019 1027 1032 1018 993 987 1007 1027 1026 1022 1032 1045 1039 1022 1009 994 960 921 906 924 955 980 1001 1023 1040 1047 1051 1058 1070 1089 1112 1130 1132 1127 1133 1147
1177 1147 1148 1125 1097 1083 1076 1058 1031 1015 1012 1014 1013 1016 1022 1020 1007 994 992 996 998 1003 1027 1073 1117 1128 1091 1028 979 968 988 1012 1022 1021 1022 1028 1032 1032 1032 1035 1041 1048 1048 1039 1023 1012 1017 1030
1172 1030 1032 1012 986 982 1005 1040 1067 1080 1079 1066 1049 1041 1048 1061 1072 1080 1088 1082 1050 1003 977 984 1006 1011 996 985 991 1011 1033 1052 1070 1097 1140 1189 1219 1208 1164 1118 1092 1085
1167 1085 1088 1104 1134 1170 1197 1213 1226 1242 1252 1245 1217 1173 1124 1086 1065 1057 1058 1070 1093 1117 1126 1120 1111 1107 1100 1081 1056 1037 1028 1022 1016 1016 1026 1041 1056 1073 1093 1110 1115 1109 1098 1083
1162A083k0j8oRRJonMJ0J3Pj0k2k3rj%LJ6K7K3Oqj3k0k7k3pJ2K2L1L8L8K3Lmllj4k3k1j3o
1156A073qroMJ6K4K0OmJJ9L3K9Qj5k7k1JK5L9L4J7KLJ1Rj0j9JL8M6J6j9k1MK5L1L4M3M3K4
1151A520lj5mJ0J8J4J3J7K8M2N3N0L3QmJ0K7K7QLK3N5P0P4P6P7O9N6N9O8O1L5K3L9O2P0P1
1147B843Q5J06J15J13J18J46J88K31K67K93L20L67M32N00N60O18O88P56Q05Q32Q37P90O43
1144A2653L93J01j58l46m74n59o18o63o92o99o81o41n90n36m87m43l99l50l03k73k55k27j74
1141C579j25j04j09j13j02q2o4n3m7n0n7n7m1j6%ok7l3j4J2J8JpPL2M1L7L3L4L3L3M3N7O0
1137B913M8L8M2N3O2P4Q7R4R1R3J07J24J30J24J27J47J70J76J59J40J38J55J75J89K05K33
1134F094K70L06L35L63L93M39N05N92O89P86Q84R89J103J222J346J477J597J679J695J642
$$ plain form
1162 1083 1063 1045 1039 1048 1057 1058 1052 1047 1051 1061 1074 1081 1071 1049 1026 1017 1016 1016 1019 1035 1062 1085 1091 1083 1070 1050 1023 1000 993 1005 1027 1058 1096 1134 1157 1160 1156 1153 1150 1136 1113 1092 1079 1073
1156 1073 1065 1056 1050 1054 1070 1094 1114 1120 1116 1117 1136 1169 1198 1206 1191 1164 1143 1144 1169 1208 1242 1259 1261 1264 1275 1284 1274 1255 1256 1294 1340 1356 1337 1316 1320 1345 1376 1410 1453 1496 1520
1151 1520 1517 1502 1498 1508 1526 1540 1553 1570 1598 1640 1693 1743 1776 1784 1780 1790 1817 1844 1852 1855 1878 1933 2003 2077 2153 2230 2299 2355 2414 2482 2543 2578 2601 2640 2702 2772 2843
1147 2843 2928 3034 3149 3262 3380 3526 3714 3945 4212 4505 4825 5192 5624 6124 6684 7302 7990 8746 9551 10383 11220 12010 12653
1144 12653 13046 13147 12989 12643 12169 11610 10992 10329 9637 8938 8257 7616 7026 6490 6003 5560 5161 4811 4508 4235 3980 3753 3579
1141 3579 3454 3350 3241 3128 3026 2944 2880 2827 2780 2730 2673 2616 2575 2559 2559 2553 2526 2493 2479 2491 2509 2510 2503 2510 2542 2583 2620 2653 2687 2720 2753 2796 2853 2913
1137 2913 2961 2999 3041 3094 3156 3230 3317 3411 3502 3595 3702 3826 3956 4080 4207 4354 4524 4700 4859 4999 5137 5292 5467 5656 5861 6094
1134 6094 6364 6670 7005 7368 7761 8200 8705 9297 9986 10772 11656 12645 13748 14970 16316 17793 19390 21069 22764 24406
1132B4406J537J406J276J170J091J015R00P22M86K21k8k33l91n21o51q02r83j189j391j547
1129B6494j637j667j657j622j562j481j386j280j167j055r48q49p57o74n93n13m36l73l30
1127F507l04k82k61k39k18j99j87j83j76j67j59j59j63j59j44j28j16j04r1q4p9o9n5m1l5
1124B705l5m3o0p7q2p0m9k6mQnm4p9p5l0J3J5k6o9p8n5k5kJ3K2K1J5OJqk3k8j6OJ3Kj3j5j2
1119A791j5k1k1j1kjj1k1k2rPJ3Lj5k7k7k0j1oj0j8j7ojrk2k3k0k7m5n2l2pok9m5l8k4k4l1
1114A088l1k2j7j7j2LJ8J5Krj4j4oRK4K0%j7j7o%kmJNKj3k9l7l0qJ9M4N1M0K0PJ2K6K9J8J3
1109A161J7J6Kj0lJ6K3J2nj7k5l0k9k6k7l3l3k1lK0M2N5N1K7MpkPJ3J0pk4k5rJoj9k4j9j6
1104A057j7j2JQRJ0J8J9Ppj3p%jljJ3K8K7Rj3j7lQJ0J0K4L1J3j5k2lJ4J4J2K4K4ll9l9j5q
$$ plain form
1132 24406 25943 27349 28625 29795 30886 31901 32801 33523 34009 34230 34202 33969 33578 33057 32406 31604 30621 29432 28041 26494
1129 26494 24857 23190 21533 19911 18349 16868 15482 14202 13035 11980 11032 10183 9426 8752 8159 7646 7210 6837 6507
1127 6507 6203 5921 5660 5421 5203 5004 4817 4634 4458 4291 4132 3973 3810 3651 3507 3379 3263 3159 3068 2984 2905 2836 2781 2740 2705
1124 2705 2670 2627 2567 2490 2408 2338 2289 2263 2259 2267 2262 2218 2139 2064 2034 2047 2062 2036 1967 1889 1834 1809 1807 1820 1842 1863 1878 1884 1885 1877 1854 1826 1810 1816 1829 1831 1818 1803 1791
1119 1791 1776 1755 1734 1723 1721 1720 1709 1688 1666 1657 1664 1677 1680 1665 1638 1611 1591 1580 1574 1564 1546 1529 1523 1522 1513 1491 1468 1448 1421 1376 1324 1292 1285 1279 1250 1205 1167 1143 1119 1088
1114 1088 1057 1035 1018 1001 989 992 1010 1025 1027 1018 1004 990 984 993 1017 1037 1037 1020 1003 997 997 995 991 992 997 999 986 957 920 890 882 901 945 996 1036 1056 1063 1075 1101 1130 1148 1161
1109 1161 1178 1194 1196 1186 1183 1199 1222 1234 1229 1212 1187 1157 1128 1102 1075 1042 1009 988 985 1005 1047 1102 1153 1180 1184 1177 1175 1182 1195 1205 1198 1174 1149 1140 1141 1135 1116 1092 1073 1057
1104 1057 1040 1028 1029 1037 1046 1056 1074 1093 1100 1093 1080 1073 1073 1072 1069 1068 1081 1109 1136 1145 1132 1115 1112 1120 1130 1140 1164 1195 1208 1193 1171 1168 1182 1196 1208 1232 1256 1253 1214 1175 1160 1152
1099A152l1m6k5QJ6MNK1L3K7J2mk2k9j9mpk0j4J1K2Jj9rJ7K3Oj2j0NK1L6L5J6noJ3K4J1rj4
1094A214mRJ2Jk2m3m5k8j4j7k2j2OJ0KKJ6K4Qk5n1n6l7j0J7L6M0L0J6J3K0K5K0J3K0L5L6J4
1089A253qj1kjj0j9k0j8j4oNRLjKJj3l0l2j7k%pj1qnmJJ0J6Mj6k7j5QK4K1J1NMPJ2J8K0J1
1084A148nk0k7l2l3k5oRJ2NMJ1J2LnpnpoNK0K6K1J0kj6k4rJ8K8Pk4l6k9j7qmoj4j7pQJ2ML
1078I75J4J9Pj5k2pJ6K6J6pj9j3joj9j6J2L8L4J5QJ4J3nk2j7KK5M0M5L6J9QLnk2l1j6NQqk0
1073A127j5j0j8k8k3nPOL%jkJQJ4K0K9L3J7j8n0n3l2j0nrj0MJ6J3rk5j2K3M1K9OKJ7L0L1K9
1068A171K3Nj5j6LJ5Lj4j6olj3k1j5%J6L0K9J2rk1k6l1k7qJ6J9mk5l0k7k6j8LK4K6J0lmnj3
1063A009j8j2JJ2J8J8Rlj2j0jMMOJ8K9K6J1pj1JK0K7J4j2l1k8j0Mnk3l4k5nJ4K3K9K4J0rj3
$$ plain form
1099 1152 1121 1075 1050 1058 1074 1078 1083 1104 1137 1164 1176 1172 1150 1121 1102 1098 1091 1071 1057 1068 1090 1091 1072 1063 1080 1103 1109 1097 1087 1092 1113 1149 1184 1200 1195 1189 1202 1226 1237 1228 1214
1094 1214 1210 1219 1231 1232 1210 1167 1122 1094 1080 1063 1041 1029 1035 1045 1047 1049 1065 1089 1097 1072 1021 965 928 918 935 971 1011 1041 1057 1070 1090 1115 1135 1148 1168 1203 1239 1253
1089 1253 1245 1234 1232 1231 1221 1202 1182 1164 1150 1144 1149 1158 1161 1160 1162 1163 1150 1120 1088 1071 1069 1069 1062 1051 1043 1038 1034 1035 1045 1061 1065 1049 1022 1007 1015 1039 1060 1071 1076 1080 1087 1099 1117 1137 1148
1084 1148 1143 1123 1096 1064 1031 1006 1000 1009 1021 1026 1030 1041 1053 1056 1051 1044 1039 1032 1026 1031 1051 1077 1098 1108 1106 1090 1066 1057 1075 1103 1110 1086 1050 1021 1004 996 992 986 972 955 948 956 968 972 975
1078 975 989 1008 1015 1000 978 971 987 1013 1029 1022 1003 990 989 983 964 948 960 998 1032 1047 1055 1069 1082 1077 1055 1038 1040 1065 1105 1150 1186 1205 1213 1216 1211 1189 1158 1142 1147 1155 1147 1127
1073 1127 1112 1102 1084 1056 1033 1028 1035 1041 1044 1044 1043 1041 1042 1050 1064 1084 1113 1146 1163 1145 1095 1042 1010 1000 995 986 976 980 996 1009 1000 975 963 986 1027 1056 1062 1064 1081 1111 1142 1171
1068 1171 1194 1199 1184 1168 1171 1186 1189 1175 1159 1153 1150 1137 1116 1101 1101 1117 1147 1176 1188 1179 1158 1132 1101 1074 1066 1082 1101 1097 1072 1042 1015 989 971 974 998 1024 1034 1031 1027 1022 1009
1063 1009 991 979 980 992 1010 1028 1037 1034 1022 1012 1011 1015 1019 1025 1043 1072 1098 1109 1102 1091 1092 1112 1139 1153 1141 1110 1082 1072 1076 1071 1048 1014 989 984 998 1021 1050 1074 1084 1075 1062
1058A062MK6K4kl1m0l2k3j4KK3L2K6K0K4K6J3ljJ4K5J6jj4k0j8j4nLRJ4Rpk0j3OJ8Rqk3l1
1053A085k7KM2N6K6j6k5pJj7l3k7pJllQK1K8L1K8J5j2m0m7k6OK5K5J3lj2j3%K1L4L0Qk2m7
1048A119n4l9j6MJ4K0K0Nj7k2jK5L2K0PkojQRj1l3k8jK1K5K4K7K4J1kLJ4J3mk6m1m5l2j3K
1043A053Mjj0j9k2j0J1K1J6J2J2Mj6k8j6PJ9J9J8J9J1KJLmj9k0nPQKKjj1k0j4LK2L2K9J6J
1038A138qk4m7o3n4k5JJ2J8K4J4rk3oK5M2L5K4J9J1oj7j7j0qoMK1L2K1%j0jJ1J0lrmQJ5J5
1033A150Nj4l0k6j0%lpMK2K8J7POJ5K2K2J3qk8l3k1oKKNJ2J5Rjj3k6l9m5l0jJ5RMJ7L6K6j0
1028A112l3k8j5j2nK1M2K8qk1r%rj6j0qk3l2j9LJ2J4K0K8J5j3l1k4rmj0j5pJ1K7K5Pj2qJ7
1023A001L7L0J0NK3L8K8ml0l4k7k4k6j9pJMPJ1Pnj5j5j3j4j3nKJKJ1K6L2K6J1nk4l5k3QK8
$$ plain form
1058 1062 1066 1092 1116 1114 1083 1043 1011 988 974 976 999 1031 1057 1077 1101 1127 1140 1137 1136 1150 1175 1191 1190 1176 1156 1138 1124 1119 1122 1131 1145 1154 1147 1127 1114 1120 1138 1147 1139 1116 1085
1053 1085 1058 1060 1102 1158 1184 1168 1143 1136 1137 1120 1087 1060 1053 1054 1051 1048 1056 1077 1105 1136 1164 1179 1167 1127 1080 1054 1060 1085 1110 1123 1120 1108 1095 1095 1116 1150 1180 1188 1166 1119
1048 1119 1065 1026 1010 1014 1028 1048 1068 1073 1056 1034 1033 1058 1090 1110 1117 1115 1109 1108 1116 1125 1114 1081 1053 1052 1073 1098 1122 1149 1173 1184 1182 1185 1199 1212 1208 1182 1141 1096 1064 1051 1053
1043 1053 1057 1056 1046 1027 1005 995 1006 1027 1043 1055 1067 1071 1055 1027 1011 1018 1037 1056 1074 1093 1104 1106 1107 1110 1106 1087 1067 1062 1069 1077 1079 1081 1080 1069 1049 1035 1038 1060 1092 1121 1137 1138
1038 1138 1130 1106 1059 996 942 917 918 930 948 972 986 977 954 948 973 1015 1050 1074 1093 1104 1098 1081 1064 1054 1046 1040 1044 1065 1097 1118 1118 1108 1107 1118 1128 1125 1116 1112 1120 1135 1150
1033 1150 1155 1141 1111 1085 1075 1075 1072 1065 1069 1091 1119 1136 1143 1149 1164 1186 1208 1221 1213 1185 1152 1131 1125 1127 1129 1134 1146 1161 1170 1169 1156 1130 1091 1046 1016 1015 1030 1039 1043 1060 1096 1122 1112
1028 1112 1079 1051 1036 1024 1019 1040 1082 1110 1102 1081 1072 1072 1063 1047 1037 1029 1006 974 955 958 970 984 1004 1032 1047 1034 1003 979 970 966 956 941 934 945 972 997 1004 992 984 1001
1023 1001 1038 1068 1078 1083 1106 1144 1172 1168 1138 1104 1077 1053 1027 1008 1001 1002 1006 1013 1024 1031 1026 1011 996 983 969 956 951 953 954 956 967 993 1025 1051 1062 1057 1033 998 975 983 1011
1018A011J9kpJ3L4L3J7QJ6K3J4%nnj6l4l7j4QJ2JqqplNJ0RNJ0J0ok7k7oJ2J2KjnrkK5M6L3
1012A159rl8l0lJ0kk0k3j0MNkjJ0J9J1j0k4k4k0j8j5oRK0K2J5MKJ1J7J1nj6j3ojJPJ4K4K9
1007A108K0lk7k8j1NPjqrj3k5l2k8j0J0K0J3lj1lJ1K2K7K5J2qk8l8l3j5J1L4M8M9M5L7K3N
1002A198nKK0K9L1K9K1Kk4m1m6m4m2l2j6KJ8K5K1PMK2M6M2Qj8j5lj0k5k2jLk3n0m9k3%J0M
997A055knKJ7K0Oj7l0k2rLRJ4J6Pqk3l0l1k7j6%J3J9J9K4K7K2J0J0K5M0L0ol8l5jL4L9J3j2
992A162j3J0K9J9pj8qJrk6l2k0qk%%jpj2j0j1j8l2m1l6j4J6L7M1L1K3K7K9J8pl1l6k1kPOJ
987A035JMJ4J9J0j3l1k4mLjKJ8K9K0N%L%kQK0J4mj5j1j0j8k6k1pJOJ4J9J6RJ0R%j8k3nK2L3
982A111K0mj3pMMKjpj8k6j7OJ9J4%j3k5l1k0KJ7J6J3K0L2K8J5Koj7k3j7nnj8k8k5j1PK4K6
$$ plain form
1018 1011 1030 1028 1021 1034 1068 1101 1118 1126 1142 1165 1179 1179 1174 1169 1153 1119 1082 1068 1076 1088 1089 1081 1073 1066 1063 1068 1078 1087 1092 1102 1112 1106 1079 1052 1046 1058 1070 1072 1071 1066 1057 1055 1080 1126 1159
1012 1159 1150 1112 1082 1079 1089 1087 1067 1044 1034 1038 1043 1041 1040 1050 1069 1080 1070 1046 1022 1002 984 969 963 972 992 1014 1029 1033 1035 1046 1063 1074 1069 1053 1040 1034 1033 1034 1041 1055 1079 1108
1007 1108 1128 1125 1098 1070 1059 1064 1071 1070 1062 1053 1040 1015 983 955 945 955 975 988 985 974 971 982 1004 1031 1056 1068 1060 1032 994 961 946 957 991 1039 1088 1133 1170 1193 1198
1002 1198 1193 1195 1215 1244 1275 1304 1325 1327 1303 1262 1216 1172 1130 1098 1082 1084 1102 1127 1148 1155 1159 1181 1227 1269 1277 1259 1244 1241 1231 1206 1184 1183 1186 1163 1113 1064 1041 1041 1051 1055
997 1055 1053 1048 1050 1067 1087 1093 1076 1046 1024 1015 1018 1027 1041 1057 1064 1056 1033 1003 972 945 929 929 942 961 980 1004 1031 1053 1063 1073 1098 1138 1168 1162 1124 1089 1088 1122 1161 1174 1162
992 1162 1149 1159 1188 1207 1200 1182 1174 1175 1166 1140 1108 1088 1080 1078 1078 1078 1077 1070 1058 1048 1037 1019 987 946 910 896 912 949 990 1021 1044 1071 1100 1118 1111 1080 1044 1023 1021 1028 1034 1035
987 1035 1036 1040 1054 1073 1083 1070 1039 1015 1011 1014 1013 1015 1033 1062 1082 1087 1087 1090 1090 1088 1096 1116 1130 1126 1111 1100 1090 1072 1046 1025 1018 1019 1025 1039 1058 1074 1083 1093 1102 1102 1084 1061 1056 1078 1111
982 1111 1131 1127 1114 1107 1111 1115 1117 1116 1109 1091 1065 1048 1054 1073 1087 1087 1074 1049 1018 998 1000 1017 1033 1046 1066 1098 1126 1141 1143 1137 1120 1097 1080 1075 1070 1052 1024 999 988 995 1019 1045
977A045J4mrjRJ4J6J8J2Lknrj6k0j9j8j3OL0L6J4rj2jPRJ4K1J4kj8j9rNJ4Rnj6j5j3k0k3r
971A023J4K1QlkKoj5qJ5L3L4J8nl1m5l7oK7L7K4Kj5k7m1n4n6l6lK6L2J7KPK6K7Lk1j6PJ9R
966A006MK2M7M9K0j3l1l0j8qjJNJ0J4J4J0LJKRJ7J6Mj2k1k5k5j9lJ3K0K0J4ml4n5m3pK3K3
961A018Q%%lrj2nOJ1Okprj2j6j8j3nLJ3K5L5L6L5L6L1Qk5m1k6rk0m0m1j5ONlJJ1J3J2K1L4
956A043L0Pj3rOJ4OlkKlj9l3l6k6j0QK5L6L8L6K5RopOJ4Rqj7oJ3K7K1kk6l6k5oRK2L6L6J5
950A200k1m6n0m5m4l9k3lJrj5j0LO%onJ1L0L4J4j3k4j0RJ3jj1pJ2L0L3J6moJ5L4K7Oooj0k0
945A060j2K1M3K9ok3j0%j1l0l5k3rNJ9K2J2mpQK2K9L5M1M1K1j1l5l5j9%QPjj3k6l0k0JJ3Q
940A085%MJ6J7Lqo%J%RJ4Kj9k6j4mpj0MK2K6J8J1J0kk2l1j7NKk0m2m6l4k0lJ2K0J9J2J1J9
$$ plain form
977 1045 1059 1055 1046 1045 1054 1068 1084 1102 1114 1117 1115 1110 1101 1085 1065 1046 1028 1015 1021 1051 1087 1101 1092 1080 1079 1086 1095 1109 1130 1144 1142 1124 1105 1096 1101 1115 1124 1119 1103 1088 1075 1055 1032 1023
971 1023 1037 1058 1066 1063 1061 1063 1057 1042 1034 1049 1082 1116 1134 1129 1098 1053 1016 1010 1037 1074 1098 1100 1085 1058 1017 963 907 871 868 894 926 943 945 952 978 1005 1008 987 971 978 997 1006
966 1006 1010 1032 1079 1128 1148 1135 1104 1074 1056 1048 1047 1048 1053 1063 1077 1091 1101 1104 1105 1107 1116 1133 1149 1153 1141 1120 1095 1070 1051 1048 1061 1081 1101 1115 1111 1077 1022 979 972 995 1018
961 1018 1026 1026 1026 1023 1014 1002 997 1003 1014 1020 1018 1011 1002 990 974 956 943 938 941 954 979 1014 1050 1085 1121 1152 1160 1135 1094 1068 1059 1039 999 958 943 949 954 951 952 963 976 988 1009 1043
956 1043 1073 1080 1067 1058 1064 1078 1084 1081 1079 1081 1078 1059 1026 990 964 954 962 987 1023 1061 1097 1122 1131 1125 1118 1124 1138 1147 1139 1122 1116 1129 1156 1177 1175 1149 1113 1088 1082 1091 1113 1149 1185 1200
950 1200 1179 1133 1083 1038 994 955 932 929 930 921 906 896 899 905 905 899 894 905 935 969 983 970 946 936 945 958 957 946 939 951 981 1014 1030 1026 1020 1035 1069 1096 1102 1096 1090 1080 1060
945 1060 1048 1069 1112 1141 1135 1112 1102 1102 1091 1061 1026 1003 994 999 1018 1040 1052 1048 1041 1049 1071 1100 1135 1176 1217 1238 1227 1192 1157 1138 1138 1146 1153 1152 1139 1113 1083 1063 1064 1077 1085
940 1085 1085 1089 1105 1122 1125 1117 1111 1111 1112 1112 1121 1135 1137 1118 1092 1078 1074 1067 1057 1061 1083 1109 1127 1138 1148 1146 1124 1093 1076 1081 1083 1063 1021 975 941 921 918 930 950 969 981 992 1011
935A011K9L5K8Nk2l6l3j6OL1L9J9k0l8j8J3J6mj0J5M1M2K1Moj4k1k1k0k4k5j4NJ0kj5j3jJ0
930A007J8L0M3L9J9krnmolONj2k8k1J5N1N5K5j0l1m0n0n6m8k2PJ8Qoj2mPJ4J7J3Jj7k8k0M
925I68L0M7N3M1J3j7l3k4j1mmMJ9K9K8K1J2lj9k6j8kROkj0j2j1qommllqj4j4j1rpnkMOJ2J8
919A026K7L3L2K5Qj0k1j7%J7J7kk3k5%K5L1J7ONLooRJ9Oj5j7kRLqj3j9k8k5nJ3J1oj6j7j7
914A044j6j1kKJ1L1M8M0Ok7k8pJ5K3K1J5NMRJ3Oj3k2j4MRmk1k1mJ4K0J0oj7k3j7KK5L4K9J9
909A206J3kl3o2n6j2L7O4O0L9J1j3k7k2pLmj8k6k1mJ5K1J3L%pk9o0p2n2j9JNJ2K9M4M5L5K6
904A136K1J4%j8l2l3k1qLJ1K4L3L4K6J9J6J1PRJ7J6Jj6k2j9j9k0j5j1j6k1j2QK2J7%k0l9m4
899A059l2pJ5K1K5L6N1N9O0N5M9M1L2K4K4K8L7M7N3N0M2K6Kj9k6j0J0K3K1J0kqLK6M8N8O0
$$ plain form
935 1011 1040 1075 1103 1108 1086 1050 1017 1001 1007 1038 1077 1096 1076 1038 1020 1033 1049 1045 1035 1050 1091 1133 1154 1158 1152 1138 1117 1096 1076 1052 1027 1013 1018 1028 1026 1011 998 997 1007
930 1007 1025 1055 1098 1137 1156 1154 1145 1140 1136 1130 1127 1133 1138 1126 1098 1077 1092 1143 1198 1223 1213 1182 1142 1092 1036 988 966 973 991 999 993 981 977 984 998 1015 1028 1029 1012 984 964 968
925 968 998 1045 1098 1139 1152 1135 1102 1078 1067 1063 1059 1063 1082 1111 1139 1160 1172 1169 1150 1124 1106 1104 1113 1119 1117 1107 1095 1084 1076 1070 1066 1062 1059 1056 1048 1034 1020 1009 1000 993 988 986 990 996 1008 1026
919 1026 1053 1086 1118 1143 1151 1141 1120 1103 1103 1120 1137 1135 1112 1087 1087 1112 1143 1160 1166 1171 1174 1168 1162 1171 1190 1196 1181 1164 1162 1171 1174 1166 1153 1134 1106 1081 1076 1089 1100 1094 1078 1061 1044
914 1044 1028 1017 1015 1017 1028 1059 1107 1147 1153 1126 1098 1091 1106 1129 1150 1165 1170 1174 1183 1196 1202 1189 1167 1153 1157 1166 1162 1141 1120 1116 1130 1150 1160 1154 1137 1114 1097 1099 1124 1158 1187 1206
909 1206 1219 1217 1184 1122 1066 1054 1091 1155 1215 1254 1265 1252 1225 1203 1196 1199 1195 1177 1151 1130 1126 1141 1162 1175 1178 1178 1171 1142 1082 1010 958 939 940 945 957 986 1030 1075 1110 1136
904 1136 1157 1171 1171 1153 1121 1088 1067 1059 1062 1073 1097 1130 1164 1190 1209 1225 1236 1243 1252 1269 1285 1286 1270 1248 1229 1210 1190 1175 1164 1148 1127 1115 1123 1145 1162 1162 1142 1103 1059
899 1059 1027 1020 1035 1056 1081 1117 1168 1227 1287 1342 1391 1432 1464 1488 1512 1540 1577 1624 1677 1727 1769 1795 1797 1778 1752 1742 1752 1775 1796 1806 1804 1796 1799 1825 1873 1931 1991
895A991N6M0J1qpNMj0j5lJ2K2K9L5K8J6K8P4J13J02M6j0l7n1o8p7o4l8k9l7m1k5lJ2J2QJq
890B114k0l3n0o2n8m2l1l9m5l4j1lj3k0j3pj4k3k2k0k6l6l2j8nMJ7K1Lk6l6k6j7j8j6nok6
885A306m3k7QK4J0j1j8j9k4k8k5j8j8j4%K3L1J4rj9j2nj3k1j1J0K5K7L1L7L3Rj6k2j3oj0j4
881A172j6k6l4k1RL2K6Mrj0opojpk1l6l2j1J5L4L9L9L3K4RjNJ9K4J4jqj1k3l3k5jJ3Lj8k1
876A129mJ1J2KnlKPJ1J1OMRJ5J4OLNjk1l5l3k4k7l3k0LJ8J8K4L6L5J7MJ6L1K3KkJpk4j9QK5
870A250J3j0k3k7l2l3j7MJ7K4L1L6L4K5J5jj9k5j1kj4k9k4oqk8k7J0M4L8Lk5l0j9nRJ2%j7
865A133k7k5k5k4j6nJmrlJ5K7K6J0rk0j9j2n%jpnQK2J7nj6ML2K7rm1l9j2J1K2K3K5K4J5%p
860A097JJ6K3J7PJjlKJ7K6K2K5M5O3N2K8K1M1N0K8joRK7L7M9O0O5O4N4K9KkK2M6M3K5J8K1
$$ plain form
895 1991 2047 2087 2098 2090 2083 2088 2092 2082 2067 2064 2076 2098 2127 2162 2190 2206 2234 2308 2421 2523 2569 2559 2522 2471 2403 2326 2262 2224 2195 2158 2117 2092 2089 2101 2113 2121 2122 2114
890 2114 2094 2061 2011 1949 1891 1849 1818 1779 1734 1700 1689 1686 1673 1653 1640 1633 1619 1596 1574 1554 1528 1492 1460 1442 1437 1441 1458 1479 1482 1456 1420 1394 1377 1359 1343 1338 1332 1306
885 1306 1263 1236 1244 1268 1278 1267 1249 1230 1206 1178 1153 1135 1117 1103 1103 1126 1157 1171 1162 1143 1131 1126 1113 1092 1081 1091 1116 1143 1174 1211 1244 1253 1237 1215 1202 1196 1186 1172
881 1172 1156 1130 1096 1075 1084 1116 1142 1146 1137 1127 1121 1114 1108 1107 1100 1079 1043 1011 1000 1015 1049 1088 1127 1160 1184 1193 1192 1197 1216 1240 1254 1253 1245 1234 1211 1178 1153 1152 1165 1168 1150 1129
876 1129 1125 1136 1148 1150 1145 1142 1144 1151 1162 1173 1179 1183 1192 1207 1221 1227 1230 1235 1234 1213 1178 1145 1121 1094 1061 1041 1044 1062 1080 1104 1140 1175 1192 1196 1212 1243 1266 1268 1266 1267 1260 1236 1217 1225 1250
870 1250 1263 1253 1230 1203 1171 1138 1121 1125 1142 1166 1197 1233 1267 1292 1307 1306 1287 1262 1251 1249 1235 1206 1182 1176 1168 1140 1113 1123 1167 1205 1208 1183 1153 1134 1129 1138 1150 1150 1133
865 1133 1106 1081 1056 1032 1016 1011 1012 1008 999 996 1011 1038 1064 1074 1065 1045 1026 1014 1009 1009 1008 1001 996 1004 1026 1043 1038 1022 1026 1058 1085 1076 1035 996 984 995 1017 1040 1065 1089 1104 1104 1097
860 1097 1098 1114 1137 1154 1161 1162 1161 1158 1160 1177 1203 1225 1250 1295 1358 1410 1438 1459 1500 1550 1578 1577 1571 1580 1607 1644 1693 1753 1818 1882 1936 1965 1967 1965 1987 2033 2076 2101 2119 2140
855B140K2K4M3P6R6Q6O1M1L1K6K4K2J4PJ2K3L2L7M6N2M9L1K0K1K8L5M4M9L0lk2mK6L4J8RJ7
851C297K4J6%j1j3nJ0K3J9ol0l5k1rj5m1o5p2n5l0j3j2k3m2m8l4j1lj6l7n0o1p7q8p5n2m2
846B297m7m9l7k4k4k7k6k2k3k5k3k9m6o3o6n6m5k9lK8L8K6J2J2J9J9J7K7N7R0J04R5Q2Q1J01
842B441J26J45J47J45J53J72J93K02K04K15K47K96L50L95M26M45M65M98N44N92O32O70P06
839A0409P30P20O73O03N34M86M79N13N67O12O49P01P84Q87R95J103J209J310J390J447J493
836B8294J550J641J783J983K242K572K982L471M037M687N413O175O927P644Q249Q460P844
834A05954O165L769J476Nn07m18q0M51J287K460L892N489P174Q867J0490J1870J2523J1651
832A92518Q751M356k1k950m094m108l681k951j727L8K213M654P231R779J2161J4178J5157
$$ plain form
855 2140 2162 2186 2229 2305 2401 2487 2548 2589 2620 2646 2670 2692 2706 2713 2725 2748 2780 2817 2863 2915 2964 2995 3015 3036 3064 3099 3143 3192 3222 3219 3197 3193 3219 3253 3271 3280 3297
851 3297 3321 3337 3337 3326 3313 3308 3318 3341 3360 3354 3324 3289 3268 3259 3244 3203 3138 3066 3011 2981 2968 2956 2933 2891 2843 2809 2798 2795 2779 2742 2692 2631 2554 2466 2391 2339 2297
846 2297 2250 2201 2164 2140 2116 2089 2063 2041 2018 1993 1970 1941 1895 1832 1766 1710 1665 1636 1633 1661 1699 1725 1737 1749 1768 1787 1804 1831 1888 1978 2082 2177 2259 2340 2441
842 2441 2567 2712 2859 3004 3157 3329 3522 3724 3928 4143 4390 4686 5036 5431 5857 6302 6767 7265 7809 8401 9033 9703 10409
839 10409 11139 11859 12532 13135 13669 14155 14634 15147 15714 16326 16975 17676 18460 19347 20342 21445 22654 23964 25354 26801 28294
836 28294 29844 31485 33268 35251 37493 40065 43047 46518 50555 55242 60655 66830 73757 81401 89650 98110 105954
834 105954 112119 115888 117364 117369 116862 116444 116364 116815 118102 120562 124454 129943 137117 145984 156474 168344 180867 192518
832 192518 201269 205625 205604 202654 198560 194452 190771 187820 186093 186131 188344 192998 200229 210008 222169 236347 251504
830B51504J3899R589K975l707q333j0414j0926j0936j0683r895q457o562m441k239n3K058
828A93379L993N298N128K862j053n141p971r184r410r356r196q748p915o790n520m214k949
826A23213j740o05K63M32m45k195m109n477o093o242o273o301o238o020n676n282m890m496
824E1826m086l658l230k822k444k113j843j632j454j288j145j051j006r79r43q93q36p74p12
822A8917o57o12n74n40n10m76m33l87l50l30l19l11l16l36l63l80l80l62l30k99k84k78k58
819I832k20j86j79j87j84j67j56j62j77j86j90j90j91j87j83j79j71j58j43j33j30j31j32
816E910j32j34j41j48j45j31j20j31j61j82j73j42j22j29j49j52j34j14j10j16j13r6q3q2
813B770q6r1r2r1q5p7p6q8j02j00q9p7o6m1j2Jj4l6l7j5kj3l5m9m3l1k6k9k5rJ0J8J4J0J3
$$ plain form
830 251504 265403 274992 277967 274260 265927 255513 244587 233651 222968 213073 204616 198054 193613 191374 191321 193379
828 193379 197372 202670 207798 210660 209607 204466 196495 187311 177901 168545 159349 150601 142686 135896 130376 126162 123213
826 123213 121473 120868 121131 121563 121118 118923 114814 109337 103244 97002 90729 84428 78190 72170 66494 61212 56322 51826
824 51826 47740 44082 40852 38030 35586 33473 31630 29998 28544 27256 26111 25060 24054 23075 22132 21239 20403 19629 18917
822 18917 18260 17648 17074 16534 16024 15548 15115 14728 14378 14048 13729 13418 13102 12766 12403 12023 11643 11281 10951 10652 10368 10090 9832
819 9832 9612 9426 9247 9060 8876 8709 8553 8391 8214 8028 7838 7648 7457 7270 7087 6908 6737 6579 6436 6303 6173 6042 5910
816 5910 5778 5644 5503 5355 5210 5079 4959 4828 4667 4485 4312 4170 4048 3919 3770 3618 3484 3370 3260 3144 3031 2935 2852 2770
813 2770 2684 2593 2501 2410 2325 2248 2172 2084 1982 1882 1793 1716 1650 1609 1597 1598 1584 1548 1511 1496 1494 1481 1446 1397 1354 1323 1297 1268 1243 1234 1244 1262 1276 1286 1299
809A299J8K3K2J5O%QK3L1K5K2L4N3O3N4L8K6J6KqkK1M5M7K3knRJ7Lj3mK7N2N0K6OjOJ2Oj4
804B079k8k1lKnpMJ2RkjLLqk5m2n2m1j9pk0l8l3j2%oj0mlj4j9qPOqj7j2%QLpj0lOLj1j8j2
798A619nj2k3k5k0j8j7rnj1j3LL6N4M3K4Qlk1k7j5MPloNJ2Kj5j9j1pj0j3nJ5L1L1K2J7K0K0
793A660Kj9k6j6jQK1M0M8L4%k5l2j9%J4J5Jj1j1lkrpKJk0m4m5k8j9k6l3k3ML3N7O7N4K6lj9
787A646k4l2l8l6k7j6qmk%Jnj7k6j5J0K2Oj6j5QK5J8mj6qMNj4l8l9j6Q%k3k9rMlj0JJ6J1o
782A289j0PK8L7L2J0k2m7m7k9j6j5j4nLJkjJlplJ1K7L7M1L4K4K2K6K4Lk7m3l3j1NKj2k6k8
777A263j9oNJ1J1LmlQJ9K1J5Nmj3k0k0j5pJ0K6L4K5Prj8k2k4k2j5lJ1J9J5J0RNoj2KL0N0M7
772A419M1M8N9N7M6M5N2N7N2M2L0J7NJNROmj4j0J7N1O1M6L7N5P3N4Lk7k4j3k0k6qJ2J0%J6
$$ plain form
809 1299 1317 1340 1362 1377 1383 1383 1391 1414 1445 1470 1492 1526 1579 1642 1696 1734 1760 1776 1778 1770 1768 1789 1834 1881 1904 1902 1897 1906 1923 1926 1913 1909 1936 1988 2038 2064 2070 2069 2075 2087 2093 2079
804 2079 2051 2030 2027 2029 2024 2017 2021 2033 2042 2040 2039 2042 2045 2037 2012 1970 1918 1877 1858 1851 1831 1793 1760 1748 1748 1742 1732 1728 1725 1711 1692 1684 1691 1697 1689 1672 1660 1660 1668 1671 1664 1654 1651 1657 1660 1649 1631 1619
798 1619 1614 1602 1579 1554 1534 1516 1499 1490 1485 1474 1461 1464 1500 1554 1597 1621 1629 1626 1605 1578 1563 1567 1574 1571 1565 1570 1582 1584 1569 1550 1539 1532 1522 1509 1504 1519 1550 1581 1603 1620 1640 1660
793 1660 1662 1643 1617 1601 1600 1608 1629 1669 1717 1751 1751 1726 1694 1675 1675 1689 1704 1705 1694 1683 1680 1678 1669 1662 1664 1665 1645 1601 1556 1528 1509 1483 1450 1427 1431 1464 1521 1588 1642 1668 1665 1646
787 1646 1622 1590 1552 1516 1489 1473 1465 1461 1459 1459 1460 1455 1438 1412 1397 1407 1429 1435 1419 1404 1412 1437 1455 1451 1435 1427 1431 1436 1422 1384 1345 1329 1337 1337 1314 1285 1276 1280 1277 1267 1268 1284 1295 1289
782 1289 1279 1286 1314 1351 1383 1393 1371 1324 1277 1248 1232 1217 1203 1198 1201 1202 1200 1199 1200 1197 1190 1187 1198 1225 1262 1303 1337 1361 1383 1409 1433 1436 1409 1366 1333 1322 1327 1329 1317 1291 1263
777 1263 1244 1238 1243 1254 1265 1268 1264 1261 1269 1288 1309 1324 1329 1325 1312 1292 1272 1257 1250 1260 1286 1320 1345 1352 1343 1325 1303 1279 1257 1242 1239 1250 1269 1284 1294 1303 1308 1302 1290 1292 1322 1372 1419
772 1419 1460 1508 1567 1624 1670 1715 1767 1824 1876 1918 1948 1965 1970 1971 1976 1985 1991 1987 1973 1963 1980 2031 2092 2138 2175 2230 2303 2357 2360 2333 2309 2296 2276 2250 2242 2254 2264 2264 2280
767B280N2P4O8N1M3L9K7Nj9m1n3n0m2m5n5n2l7k5k1qJ6L4K8J1QK2K3Lk3l3k9l1m6o2o4n5m9
763A944m4l5j4QJ4Jj5k3k4k3l1m3n5n2l4k1k7m7n7m2j3MLmj0j4k0k7k2rkrj8j3QK9L8M1L9
758A381K9Rj1j5qmj3k1k2j7rkNPLkmmrj5k0j7j0kPJ4K0K3J5Lnnjnj0j0qj4k2j7LK1K1J0Jq
752A262j5j7nJ0J3Lj1k1k2j1J2K5J7%mNJ1Lj5l5m7m5k6n%kOK1K5J7PN%rj0JKj2k5j6OK0J7
747A135J3J1QLKLkj1qRK5J9ok7k8j1LPlj8k8l0j9mPJ1J1Pnk3k7oK3L0J4jKRPOJ7K9L1L2L3
741A250J9j9n0m7j6MJlPJ7J4NLJj2k5k6j5m%LJ3L1M2L7J4nj2qj0j4j4j1j7k2j0J4J8nk8k9
736A091k1k3l0k1mJ4K6L7L6J4j5j9JK0J7Omj2j6j2KJ1RJpj1pOK3K4J4J0J6J8Qnnkjknj7m0
731A125n6m1kL0M1L0J0j4k3j5KRPLLLLMLrk0j3QK4J8Oqk2m0n1m5k9j0NJ8K0Qj0j6nJ7M1N6
$$ plain form
767 2280 2332 2406 2474 2525 2568 2607 2634 2639 2620 2579 2526 2476 2434 2389 2334 2282 2245 2220 2199 2191 2207 2241 2269 2280 2288 2310 2333 2336 2313 2280 2251 2220 2174 2112 2048 1993 1944
763 1944 1900 1865 1851 1859 1873 1874 1859 1836 1812 1789 1758 1715 1660 1608 1574 1553 1526 1479 1422 1380 1367 1371 1374 1370 1360 1346 1326 1299 1277 1268 1266 1257 1239 1226 1234 1263 1301 1342 1381
758 1381 1410 1419 1408 1393 1385 1381 1368 1347 1325 1308 1299 1297 1302 1309 1312 1310 1306 1302 1293 1278 1258 1241 1231 1229 1236 1250 1270 1293 1308 1311 1306 1301 1300 1295 1285 1275 1267 1253 1231 1214 1217 1238 1259 1269 1270 1262
752 1262 1247 1230 1225 1235 1248 1251 1240 1219 1197 1186 1198 1223 1240 1240 1236 1241 1252 1255 1240 1205 1158 1113 1087 1082 1082 1080 1086 1107 1132 1149 1156 1161 1161 1152 1142 1143 1145 1133 1108 1092 1098 1118 1135
747 1135 1148 1159 1167 1170 1172 1175 1173 1162 1154 1163 1188 1207 1201 1174 1146 1135 1138 1145 1142 1124 1096 1066 1047 1043 1050 1061 1072 1079 1074 1051 1024 1018 1041 1071 1085 1084 1086 1095 1102 1108 1125 1154 1185 1217 1250
741 1250 1269 1250 1200 1153 1137 1141 1142 1139 1146 1163 1177 1182 1185 1186 1174 1149 1123 1108 1104 1104 1107 1120 1151 1193 1230 1244 1239 1227 1219 1209 1195 1181 1170 1153 1131 1121 1135 1153 1148 1120 1091
736 1091 1070 1047 1017 996 992 1006 1032 1069 1105 1119 1104 1085 1086 1106 1123 1129 1125 1113 1097 1085 1087 1098 1107 1108 1101 1090 1083 1089 1112 1136 1150 1160 1176 1194 1202 1197 1192 1190 1189 1187 1182 1165 1125
731 1125 1069 1028 1026 1056 1097 1127 1137 1123 1100 1085 1087 1096 1103 1106 1109 1112 1115 1119 1122 1113 1093 1080 1088 1112 1130 1136 1128 1106 1066 1015 970 941 931 936 954 974 982 972 956 951 968 1009 1065
726A065N4L5Pk0l5l9k9qJ0K0K3K6K7K5J6RORJ0lk6m4m2k6j9k1j9mQJ0RJ8K4J3oj2jJ0Ojlj0
721A072j9j5J2M7N7L9J5QJ4J4MkKQjj7k7k3j9j8j4jQMprOJ7J3MOJ0Nrj4mJ1K0K3K7K8J6ql4
715A249m8n0m7l4j5MKj7k7oK9M4K6%j1lOPK%NJ2J4NjQK6L3J7mj1qj0k0k6k4k2j9j3pqj2qL
710A041QNMRJ1LmLK4L8L6J6j0k5k1nKj1k7k7j4mj0j6oJ3K1J0mlJ1K1K1J7J6J4OLJ1J3pl5m2
705A106k0MLj3j8qMJ1Qlj6j9lQKj1rMPjMK6K9Jl7m7k7ML2N0N2K9MkNMj0k1j0LOJnopmJkj3
699A096j7lJ1J0mqjRJ0Mpk3l1j7J5L6K5ol0l4j8JJ2R%LK3M0L4Qj7l0l3l0k1oRK1K9K9J7nk7
693A083l5k4LK7K8Mk0k3j4j2j7j0J1K0Nj1rRK5L5M4M6L3J9J2Mj5l5k9%J8J4NJ4K5K4J2Ljl
689A265mkpk9n2n6l8j6%J7L5M3L1Qoj2j3j4nMOlpnmppPJ8Rj5l0k1kOPRJ0mk1k3oPKj3j9pJ0
$$ plain form
726 1065 1119 1154 1161 1141 1106 1067 1038 1030 1040 1060 1083 1109 1136 1161 1177 1186 1192 1201 1211 1208 1182 1138 1096 1070 1051 1030 1011 1007 1015 1025 1034 1052 1076 1089 1083 1071 1070 1080 1086 1085 1082 1072
721 1072 1053 1038 1050 1097 1154 1193 1208 1216 1230 1244 1248 1246 1248 1256 1255 1238 1211 1188 1169 1151 1137 1136 1144 1148 1141 1132 1138 1155 1168 1172 1178 1188 1193 1184 1170 1166 1177 1197 1220 1247 1275 1291 1283 1249
715 1249 1201 1151 1104 1070 1055 1059 1061 1044 1017 1011 1040 1084 1110 1110 1099 1096 1102 1109 1111 1111 1116 1128 1142 1147 1146 1154 1180 1213 1230 1226 1215 1207 1197 1177 1151 1127 1105 1086 1073 1066 1058 1046 1038 1041
710 1041 1049 1054 1058 1067 1078 1081 1077 1080 1104 1142 1178 1194 1184 1159 1138 1133 1135 1124 1097 1070 1056 1052 1042 1026 1020 1033 1054 1064 1060 1057 1068 1089 1110 1127 1143 1157 1163 1166 1177 1190 1183 1148 1106
705 1106 1086 1090 1093 1080 1062 1054 1058 1069 1077 1074 1058 1039 1036 1044 1046 1035 1026 1030 1037 1036 1040 1066 1095 1096 1059 1012 985 989 1021 1071 1123 1152 1156 1154 1159 1163 1153 1132 1122 1125 1131 1132 1127 1121 1114 1110 1111 1109 1096
699 1096 1079 1076 1087 1097 1093 1085 1084 1093 1103 1107 1100 1077 1046 1029 1044 1080 1105 1099 1069 1035 1017 1018 1030 1039 1039 1042 1065 1105 1139 1147 1130 1100 1067 1037 1016 1010 1019 1040 1069 1098 1115 1110 1083
693 1083 1048 1024 1027 1054 1082 1086 1066 1043 1029 1017 1000 990 1001 1021 1026 1015 1006 1015 1040 1075 1119 1165 1198 1217 1229 1233 1218 1183 1154 1154 1172 1186 1191 1205 1230 1254 1266 1269 1268 1265
689 1265 1261 1259 1252 1223 1171 1115 1077 1061 1061 1078 1113 1156 1187 1195 1189 1177 1164 1150 1145 1149 1155 1152 1145 1140 1136 1129 1122 1129 1147 1156 1141 1111 1090 1088 1094 1101 1110 1120 1116 1095 1072 1066 1073 1075 1062 1043 1036 1046
683A046K2K6K7K7K3J2nj2pMJj4l1l5k3oL%poQK3K6K3K4L0K1kk3k0kQmk6m0l6j2K0L6L3J9P
678A158Joj1j0j3k5l9l9j9J0L1L9L3J8NLJ1K1K0jk6k9KM8O1K7k2m3l1j4onm%MJ4K4K1Mj0j1
673A191pj3k1j9j0JOO%j2k8l8l2j3PJ9J9J6J8K5K3J2lj2nJ0J8Nk2m2l9j9lOJ1Oqj8lL6O6O2
667A196L4Nrj4j0nnj8k8k2mNpk8l7k7pRJ6K0K2K0J2PJ1K0J6Lj0j2j4j6j1jlk1l6k6%J8K8L6
662A107L5J3j5k4j1OJ0J1J2Q%ljJKJ2K3K1J0J5L3L0j1n8o9m4j7jQQoj9j2RJ9Rjloj4j5NK9
657A106M0L5K0lk7l6j8RJ6nk8k4KK7K3kk8l3k7j9rJ3L9N5M7K4%j8k4j4QJ7kl7n5m5j5J3K8
652A053L1K7J8Mj2k2j7KJ6J5OPJ2QjMK9M4K3k1n0m3j7OK2K7K6J9J0LmpNK3K8Ll2l9j2J8K4
647A236J5J1K1J7rl9n0l9l1l5l7k2NK3K5K1J9J7J5J0jk5n5p3n7j7K6M3L3J0KJ9M0M1J8pj4
$$ plain form
683 1046 1068 1094 1121 1148 1171 1183 1178 1166 1159 1163 1164 1150 1119 1084 1061 1055 1058 1058 1051 1045 1053 1076 1102 1125 1149 1179 1200 1198 1175 1155 1153 1161 1157 1131 1091 1055 1043 1063 1099 1132 1151 1158
678 1158 1159 1153 1142 1132 1119 1094 1055 1016 997 1007 1038 1077 1110 1128 1133 1136 1147 1168 1188 1187 1161 1132 1134 1182 1243 1270 1248 1205 1174 1160 1154 1149 1145 1145 1149 1163 1187 1208 1212 1202 1191
673 1191 1184 1171 1150 1131 1121 1122 1128 1134 1134 1122 1094 1056 1024 1011 1018 1037 1056 1072 1090 1115 1138 1150 1147 1135 1130 1140 1158 1163 1141 1099 1060 1041 1038 1044 1055 1061 1053 1035 1032 1068 1134 1196
667 1196 1230 1235 1226 1212 1202 1197 1192 1174 1146 1124 1120 1125 1118 1090 1053 1026 1019 1028 1044 1064 1086 1106 1118 1125 1136 1156 1172 1175 1165 1153 1139 1123 1112 1111 1108 1087 1051 1025 1025 1043 1071 1107
662 1107 1142 1155 1140 1116 1105 1111 1121 1132 1144 1152 1152 1149 1148 1149 1151 1163 1186 1207 1217 1232 1265 1295 1284 1226 1157 1113 1096 1095 1103 1111 1105 1086 1074 1083 1102 1111 1110 1107 1101 1087 1072 1077 1106
657 1106 1146 1181 1201 1198 1171 1135 1117 1126 1142 1137 1109 1085 1087 1114 1137 1135 1107 1074 1047 1028 1019 1032 1071 1126 1173 1197 1197 1179 1155 1141 1149 1166 1164 1127 1072 1027 1012 1025 1053
652 1053 1084 1111 1129 1133 1121 1099 1082 1084 1100 1115 1121 1128 1140 1148 1147 1151 1180 1224 1247 1226 1176 1133 1116 1122 1144 1171 1197 1216 1226 1229 1225 1218 1223 1246 1274 1277 1245 1206 1194 1212 1236
647 1236 1251 1262 1283 1300 1291 1252 1202 1163 1132 1097 1060 1038 1043 1066 1091 1112 1131 1148 1163 1173 1172 1147 1092 1019 962 945 971 1014 1047 1057 1059 1078 1118 1159 1177 1170 1156
643A156mPMnj6k1j2NK0K4K4K4J5j3m2m6k2knj1KJ8J7QRJ8J1pj5npl3n7n1k5rokNOMJ6L9M5
637A061J8j8k7j0J0J0jqrrpNK4L6L6L0K7K2Nj8l2k8j7j6k3k5j7o%RK1K2Kk0k3lJ1O%RK7L4
632A108L1K9K4%l1l9k4j1j2lK9N5M2Lj7qLnj8j7oMJ0J3Ork2k0j0jMMok7l6j8J4L6L6K4Rkm
627A138MRLrpQK1K4K0J8J0ok2l1l2l0k4j6mQJ7K1J8J0QJ0J3Q%j0j8l0l2j7QK5K7K1J4Kj7k5
622A135j2RJ7J1Ljj6l6m1j9RJ4mj8qJ2K0J4OJ2K3J8j2n3o5l4J5M5L7J6jpj2qQK5K7J1pj7j7
617A099j1nmlRL5N5N1K0j1l0l6l2j8oj1k7k9jL2L6Qk1k7j8pon%LLMJ2K4L3K9J2qk2k6j4LJ2
612A102Jj9k7j2PJ0mj1mMmj6j3RK5J8nk0j9rj0k1k1pJ4K0J7J5K3K6J1j4k5j7jlj6k0nJ5K4
606A018K0Pok1k9j7LJ5J3RJ0J4J1NQK3M0M4L5K2J5J3Nj5m1n6m8j8J4L6L1Pk3l3k1JK1L2L0
$$ plain form
643 1156 1152 1159 1163 1158 1142 1121 1109 1114 1134 1158 1182 1206 1221 1208 1166 1120 1098 1096 1091 1080 1082 1100 1117 1125 1134 1152 1163 1156 1141 1136 1129 1096 1039 988 963 954 948 946 951 957 961 977 1016 1061
637 1061 1079 1061 1034 1024 1034 1044 1043 1035 1026 1017 1010 1015 1039 1075 1111 1141 1168 1190 1195 1177 1145 1117 1100 1084 1061 1036 1019 1013 1013 1022 1043 1065 1067 1047 1024 1021 1032 1038 1038 1047 1074 1108
632 1108 1139 1168 1192 1192 1161 1122 1098 1087 1075 1072 1101 1156 1198 1201 1184 1176 1179 1174 1156 1139 1133 1137 1147 1160 1166 1157 1135 1115 1105 1104 1108 1112 1106 1079 1043 1025 1039 1075 1111 1135 1144 1142 1138
627 1138 1142 1151 1154 1145 1138 1146 1167 1191 1211 1229 1239 1233 1211 1180 1148 1118 1094 1078 1074 1082 1099 1120 1138 1148 1156 1166 1179 1187 1187 1177 1159 1129 1097 1080 1088 1113 1140 1161 1175 1177 1160 1135
622 1135 1123 1132 1149 1160 1163 1162 1146 1110 1069 1050 1059 1073 1069 1051 1043 1055 1075 1089 1095 1107 1130 1148 1136 1083 1018 984 999 1044 1081 1097 1096 1089 1077 1069 1077 1102 1129 1140 1133 1116 1099
617 1099 1088 1083 1079 1076 1085 1120 1175 1226 1246 1235 1205 1169 1137 1119 1113 1102 1075 1046 1045 1077 1113 1121 1100 1073 1055 1048 1042 1037 1037 1040 1043 1047 1059 1083 1116 1145 1157 1149 1127 1101 1087 1090 1102
612 1102 1103 1084 1057 1045 1052 1062 1058 1047 1043 1047 1043 1027 1014 1023 1048 1066 1061 1041 1022 1013 1003 982 961 954 968 988 1005 1020 1043 1069 1080 1066 1041 1024 1023 1020 1004 984 979 994 1018
606 1018 1038 1045 1039 1018 989 972 975 990 1003 1012 1022 1036 1047 1052 1060 1083 1123 1167 1202 1224 1239 1252 1257 1242 1201 1145 1097 1079 1093 1129 1160 1167 1144 1111 1090 1091 1112 1144 1174
602A174J5qj7rOPlj2j7j9j7o%nk1k1lJ4J0pj6j0klrj2j1r%J7L1K6J4J1K3L3K0lk1k5k2j7o
596A070NNqj3%J7K7K6J7OkKJ5J9Qmk%j7m6n0k2J6L6M0L2J5j1k8k7j2k%klljQK5L7K9ll0l3
591A136j8rj8k5j5kkkJ1K4K2J1J5K9K3pk1lJ7J1oj2orj8j8oJjJPJ5J5J1Jj0j6j6j5j2jJ7K3
586A122Nj4j2JL%KMpj8kK6L3J3LJ8L0K2J2J0Mj6l1k6j8k0k0lJ2ll2l4lK4K3J0J1K0K4J5Kl
581A187jLkj6k1j5mlKJ4K1Mk3k4MK8K3%j6j9j4j1pklmlPK2L9L7J3j5j5PK2J1pqNJ8J9Rj0l1
575A221l3j4Lmj8j5OJ3mk7l5l2j9lJ6J9J2NJ3K4K7K6K6J8JrLK8M1L1J0qj4mJ1Qk4n8n5j3K5
570A198K6JqMJ4Kk4m2m1k2LK5L5K1ql0l1j0J0J0nj3mK1M2M7K8rm5o5o5n3l3lL1M3K5nj0J7
565A077M1L7J3qj0mmj2k0k0j1jNPROlj2kK6M6L6Qqn%ok0k7k3j1LRQOJ1J8J2nj6j0jPJ4J9R
$$ plain form
602 1174 1189 1181 1164 1155 1161 1168 1165 1153 1136 1117 1100 1094 1094 1089 1068 1047 1044 1058 1068 1061 1045 1035 1033 1030 1021 1009 998 989 989 1006 1037 1063 1077 1088 1111 1144 1164 1161 1140 1115 1093 1076 1070
596 1070 1075 1080 1072 1059 1059 1076 1103 1129 1146 1152 1150 1152 1167 1186 1194 1190 1188 1188 1171 1125 1075 1053 1069 1105 1145 1177 1192 1181 1153 1126 1114 1112 1112 1110 1107 1104 1103 1111 1136 1173 1202 1199 1169 1136
591 1136 1118 1109 1091 1066 1051 1049 1047 1045 1056 1080 1102 1113 1128 1157 1180 1173 1152 1149 1166 1177 1171 1159 1153 1144 1126 1108 1102 1103 1102 1103 1110 1125 1140 1151 1152 1142 1126 1110 1095 1083 1082 1099 1122
586 1122 1127 1113 1101 1102 1105 1105 1107 1111 1104 1086 1084 1110 1143 1156 1159 1177 1207 1229 1241 1251 1255 1239 1208 1182 1164 1144 1124 1121 1133 1130 1098 1064 1061 1085 1108 1118 1129 1149 1173 1188 1190 1187
581 1187 1186 1189 1187 1171 1150 1135 1131 1128 1130 1144 1165 1169 1146 1122 1126 1154 1177 1177 1161 1142 1128 1117 1110 1108 1105 1101 1098 1105 1127 1166 1203 1216 1201 1186 1193 1215 1226 1219 1211 1216 1234 1253 1262 1252 1221
575 1221 1188 1174 1177 1173 1155 1140 1146 1159 1155 1128 1093 1061 1042 1039 1055 1074 1086 1091 1104 1128 1155 1181 1207 1225 1226 1217 1220 1248 1289 1320 1330 1322 1308 1304 1315 1323 1299 1241 1186 1173 1198
570 1198 1224 1225 1217 1221 1235 1237 1213 1171 1130 1108 1111 1136 1171 1192 1184 1154 1123 1113 1123 1133 1128 1115 1111 1132 1174 1221 1249 1240 1195 1130 1065 1012 979 976 1007 1050 1075 1070 1060 1077
565 1077 1118 1155 1168 1160 1150 1146 1142 1130 1110 1090 1079 1078 1083 1090 1099 1105 1102 1090 1088 1114 1160 1196 1204 1196 1191 1191 1185 1165 1138 1115 1104 1107 1116 1124 1130 1141 1159 1171 1166 1150 1140 1139 1146 1160 1179 1188
560A188j8l7k4LJ0pj3JJ4kl6n2m1j2J5L1K7Jk5k8pJ0J2RJ8L2K8RnJJ5J5Jj2k2k5k3j4%J6L3
555A086N5N9K9j4k9KM3N4L4J0nj7k8k0%J2N%ORkj1nJj3l7l7j1J4J7Pjj0k1j8JJ9J9PKJqk7
549A178m0l3j2RK4K9K3J3OjnnPK4K8J4MJ4L0K6P%J8L4J6j8k7oJ6J0j6l3l8l5k3ML2L3Qj9k6
544A270k2j8rPK1J7Lqj2j3j0JJ3J1pk3j9nlj8k8j4J7L6K6PLJ5J6jj7j0NPqj8mJ9L3K8J7QJ0
539A323J7K2J8%k1l0j9J1L5M0K6J6J1%j9k8j2QQqj6rkrj4j3rj0nJ1K3J7NkJNJ3K7M1M4L3K4
534A553J8Qj1k8k6mK0K6J5J0K5M5M7K6J3J9K5J2prPK1J8Lj6l4l3j0J6J4j3l2l0k4k5j8J3M4
529A678N0K8Oloj0r%J3J8J8J8K1K9L7M4M0K1lj0NL2N0N3N4O6P7P1N5M7N5O7P2P1P0O3N0K5
525B963rm0n8o0n3n1m5k5kMnj0oj6m7o8n8l1k2k9m1m8n7o2n4m2m6n7m9j7Nmk3l0k3k4l8m4
$$ plain form
560 1188 1170 1133 1109 1112 1122 1115 1102 1103 1117 1115 1079 1027 986 974 989 1020 1047 1048 1023 995 988 998 1010 1019 1037 1069 1097 1106 1101 1102 1117 1132 1133 1121 1099 1074 1051 1037 1037 1053 1086
555 1086 1141 1200 1229 1215 1186 1188 1231 1285 1319 1329 1324 1307 1279 1259 1259 1271 1276 1276 1282 1291 1289 1278 1273 1274 1261 1224 1187 1176 1190 1207 1214 1213 1203 1182 1164 1165 1184 1203 1210 1212 1213 1205 1178
549 1178 1138 1105 1093 1102 1126 1155 1178 1191 1197 1196 1191 1186 1193 1217 1245 1259 1263 1277 1307 1333 1340 1340 1358 1392 1408 1390 1363 1357 1373 1383 1367 1334 1296 1261 1238 1242 1274 1307 1315 1296 1270
544 1270 1248 1230 1221 1228 1249 1266 1269 1261 1249 1236 1226 1227 1240 1251 1244 1221 1202 1197 1194 1176 1148 1134 1151 1187 1213 1220 1223 1238 1254 1253 1236 1226 1231 1238 1230 1212 1208 1227 1260 1288 1305 1313 1323
539 1323 1340 1362 1380 1380 1359 1329 1310 1321 1356 1396 1422 1438 1449 1449 1430 1402 1390 1398 1406 1398 1382 1373 1371 1362 1348 1335 1326 1316 1311 1322 1345 1362 1367 1365 1366 1371 1384 1411 1452 1496 1529 1553
534 1553 1571 1579 1568 1540 1514 1510 1530 1556 1571 1581 1606 1651 1698 1724 1737 1756 1781 1793 1786 1777 1784 1805 1823 1826 1810 1776 1743 1733 1749 1763 1750 1718 1688 1664 1639 1621 1634 1678
529 1678 1728 1756 1762 1759 1753 1743 1734 1734 1747 1765 1783 1801 1822 1851 1888 1932 1972 1993 1990 1980 1985 2017 2067 2120 2174 2240 2317 2388 2443 2490 2545 2612 2684 2755 2825 2888 2938 2963
525 2963 2954 2914 2856 2796 2743 2692 2647 2622 2620 2624 2619 2609 2603 2587 2540 2472 2414 2383 2361 2332 2291 2243 2186 2124 2070 2028 1982 1925 1876 1859 1864 1860 1837 1807 1784 1760 1722 1678
520A678l6k1j3j6j9j2KJ6K7L5L5K2KqkRQJRK5L2J8%j2k2l2l5k8k2k5k6j7j5l2n7n6k4J0J3
515A412ql2l8k9j1QK3L2K6Pj7l4m2l9k2JK1K5J2nj6k0j5kLnj8j8KK1K4J6M%KNKj1k0rJ2J5
510A262ok4j3Knk5l0j1OJ1J5K3K5J7K0L3L6Ql1m8l7k2j7k0j5MK0J9lk8l3j4RJ6OklJNRJ2J3
505A185J8K9L6L4J5ql1m7n0k9MK2J3mj1j1k0l8l8j1K5M1L6K1Mj8l8m1k5j1qJK3M3L8J7PJ4
500A187J9J1MJ1J8J1qj9pJ3K5K2Qmj1j1plJNPOkj5k3j5%MmpLJ1jj8j9p%nj2j2j5j5qPJ6J1
495A152%oj3j8rQJ0pj6NL3L5J5JJ1L0L2J7ok0j3J5L5K9J3J3K5K0%j0KJ1MnPK2J6lj0%J1J3
490A449K3L6L9K4PJlj4k2j3OJ8K2K0J3jj2oNLj1j3LK0J3oj1kJnoOJ4Kj8k0lJ5J9J6J3Lj9m0
484A566m2k6nJ1J5J4J0J0J3J5RmrLK5L5K6J6J8K7K2Lj6k1j4kRJ7J6OLJ0K6L6L6K9J5%nJ3K9
$$ plain form
520 1678 1642 1621 1608 1592 1573 1561 1563 1579 1606 1641 1676 1698 1700 1692 1690 1699 1707 1708 1717 1742 1774 1792 1792 1780 1758 1726 1691 1663 1641 1616 1590 1573 1558 1526 1469 1413 1389 1399 1412
515 1412 1404 1372 1334 1305 1294 1302 1325 1357 1383 1390 1373 1339 1297 1258 1236 1237 1258 1283 1295 1290 1274 1254 1239 1237 1240 1235 1217 1199 1201 1222 1246 1262 1266 1266 1268 1273 1275 1264 1244 1235 1247 1262
510 1262 1256 1232 1219 1221 1216 1191 1161 1150 1156 1167 1182 1205 1230 1247 1267 1300 1336 1344 1313 1265 1228 1206 1189 1169 1154 1158 1178 1197 1194 1166 1133 1119 1128 1144 1150 1148 1145 1146 1151 1160 1172 1185
505 1185 1203 1232 1268 1302 1317 1309 1278 1231 1181 1152 1156 1178 1191 1187 1176 1165 1145 1107 1069 1058 1083 1124 1160 1181 1185 1167 1129 1088 1063 1052 1044 1045 1068 1111 1149 1166 1173 1187
500 1187 1206 1217 1221 1232 1250 1261 1253 1234 1227 1240 1265 1287 1295 1291 1280 1269 1262 1259 1260 1265 1272 1278 1276 1261 1238 1223 1223 1227 1223 1216 1219 1230 1229 1211 1192 1185 1185 1180 1168 1156 1141 1126 1118 1125 1141 1152
495 1152 1152 1146 1133 1115 1106 1114 1124 1117 1101 1106 1139 1174 1189 1190 1201 1231 1263 1280 1274 1254 1241 1256 1291 1320 1333 1346 1371 1391 1391 1381 1383 1394 1398 1393 1400 1422 1438 1435 1425 1425 1436 1449
490 1449 1472 1508 1547 1571 1578 1579 1576 1562 1540 1527 1533 1551 1573 1593 1606 1605 1593 1587 1592 1595 1584 1571 1574 1594 1607 1601 1590 1588 1589 1584 1578 1584 1598 1600 1582 1562 1559 1574 1593 1609 1622 1625 1606 1566
484 1566 1524 1498 1493 1504 1519 1533 1543 1553 1566 1581 1590 1586 1577 1580 1605 1640 1666 1682 1700 1727 1749 1752 1736 1715 1701 1699 1708 1725 1741 1747 1750 1760 1786 1822 1858 1887 1902 1902 1897 1910 1939
479A939K2mrJ2K8J7LK0M8M9J7j2j3%J0J6K5K3Kk0k0OL4N3O1O3O6P5R2J07J12J07R8R6R8J06
475C327J14J21J29J38J50J56J64J81K04K14K01J84J82J94K03K10K28K60K94L25L59L89M09
472H336M35M90N72O45O86P25P94Q96J021J170J356J584J848K143K471K825L191L560L910M191
470D2849M305M105L456K327R03m76j528k198k612k888l042l065k990k869k708k504k275k043
467B6747j803j544j282j048q50o72n16l92l05k42j87j31o7J3R8J76K50L19L85M52N36O41P50
465B1328Q57R82J149J343J553J790K078K425K835L330L917M581N301O093O940P753Q424Q843
462I1522Q753P723N454K257r83l430m892n724o294o677o804o686o417o062n645n198m735m246
460D1916l720l179k668k207j812j505j284j122r86q75p92p16o31n40m59l84l10k47j91j18
$$ plain form
479 1939 1961 1957 1948 1960 1988 2005 2008 2028 2076 2125 2142 2130 2117 2117 2127 2143 2168 2191 2193 2173 2153 2159 2193 2246 2307 2370 2436 2511 2603 2710 2822 2929 3027 3123 3221 3327
475 3327 3441 3562 3691 3829 3979 4135 4299 4480 4684 4898 5099 5283 5465 5659 5862 6072 6300 6560 6854 7179 7538 7927 8336
472 8336 8771 9261 9833 10478 11164 11889 12683 13579 14600 15770 17126 18710 20558 22701 25172 27997 31188 34748 38658 42849
470 42849 47154 51259 54715 57042 57945 57469 55941 53743 51131 48243 45201 42136 39146 36277 33569 31065 28790 26747
467 26747 24944 23400 22118 21070 20220 19548 19032 18640 18335 18093 17906 17775 17708 17721 17819 17995 18245 18564 18949 19401 19937 20578 21328
465 21328 22185 23167 24316 25659 27212 29002 31080 33505 36340 39670 43587 48168 53469 59562 66502 74255 82679 91522
462 91522 100275 107998 113452 115709 114726 111296 106404 100680 94386 87709 80905 74219 67802 61740 56095 50897 46162 41916
460 41916 38196 35017 32349 30142 28330 26825 25541 24419 23433 22558 21766 21050 20419 19879 19420 19036 18726 18479 18288 18170
458A8170j8P9J48K07K85L95N17O48P95R68J160J382J651J970K321K690L066L417L702L869
455D7422L827L423K539J238j95j423k265k771l079l286l393l380l263l089k898k698k478k224
453B2007j953j684j436j219j036q95p94p19o54n90n39n04m72m26l79l54l50l42l07k63k34
450F857k22k13j98j84j74j58j41j32j33j32j27j27j34j38j27j07r5j02j22j33j20r1p7r1j11
447C468j06q0o4p1q4q7q6r4r6p7n1l7l8l8l1k7k0mJ1Qj1k7k7k6l6m3l3j9k1l5m3l3k1j8j6
443A987rKJ1J1Nj0k8l7k9j4orj1ojkkloj8k7k5j7k2l9n2m0j9j3k7m0l3nJ8K3J5RLok1l2l2
438A443k2j5j2j3pKPMJPK0K8K3J1OPJ4J5J1OLRK4M1M6L4J3oj1mKmj4j8oJ5K8K0RJ4L6N0L3
433A850Kj5rkj2l0l6k4j6k2l4l8k8j5qj0j3j0kLnk2l6l9l5k3KL3M6K6rk8k4j8k4l4l6k3jK5
$$ plain form
458 18170 18152 18231 18379 18586 18871 19266 19783 20431 21226 22194 23354 24736 26387 28357 30678 33368 36434 39851 43553 47422
455 47422 51249 54672 57211 58449 58254 56831 54566 51795 48716 45430 42037 38657 35394 32305 29407 26709 24231 22007
453 22007 20054 18370 16934 15715 14679 13784 12990 12271 11617 11027 10488 9984 9512 9086 8707 8353 8003 7661 7354 7091 6857
450 6857 6635 6422 6224 6040 5866 5708 5567 5435 5302 5170 5043 4916 4782 4644 4517 4410 4315 4213 4091 3958 3838 3747 3670 3579 3468
447 3468 3362 3282 3218 3147 3063 2976 2890 2796 2700 2623 2572 2535 2497 2459 2428 2401 2381 2377 2388 2396 2385 2358 2331 2305 2269 2226 2193 2174 2153 2118 2075 2042 2021 2003 1987
443 1987 1978 1980 1991 2002 2007 1997 1969 1932 1903 1889 1883 1874 1863 1857 1856 1854 1852 1849 1843 1825 1798 1773 1756 1734 1695 1643 1603 1584 1571 1544 1504 1471 1466 1484 1507 1522 1531 1534 1528 1507 1475 1443
438 1443 1421 1406 1394 1381 1374 1376 1383 1387 1388 1395 1415 1443 1466 1477 1483 1490 1504 1519 1530 1536 1539 1548 1572 1613 1659 1693 1706 1700 1689 1685 1687 1683 1669 1651 1645 1660 1688 1708 1717 1731 1767 1817 1850
433 1850 1852 1837 1828 1826 1814 1784 1748 1724 1708 1686 1652 1614 1586 1571 1563 1553 1540 1530 1528 1531 1526 1504 1468 1429 1394 1371 1373 1406 1452 1478 1469 1441 1417 1399 1375 1341 1305 1282 1281 1306
428A306M0L3Pk2l3k6nJ5K6K2J0Kmrj5j2qplJ8M4M5J4j9l0k5j9rJ4K9J3k2m0l0j4qoJOkj2j4
423A251qJPNkqmMJj2j5JK0K1Mj6k1oJ8L2K3Mqj3k2k7j8Jjk2l8k3kONRJ6J7K2L3K8%k7j7RJ2
417A240j0j6J1L2K0j1k6k1j2j1j0o%J1K2K6J6kj5k2k2j9j3o%NPlj8k6j9rqqlJ2K5K6Ok3m1
412A079k7KJ7OnOK7L6K4QKOJ1J4Pj0k6k3kJ9K1J1J%NPlj3j1J2L7M0K2nk0k4j8rjmj6k5k0m
407A154QPNJ0K4L4K8J4NJ0K0L1L7L3K2J3K1L4L3Ok7m0l5k7k5k5k5l0l6l6k3nJ2J8J4M%J2K6
402A301K4Kk0k6j5j0j7k8k9j5QK7L5L6M0M5M4L5K1RLjnj1j0lJ1K1K4K0K4L3M4M5L8L0J8jk4
397A723m5n3m2j8%lk6m2l7k5k7m4m7l2j8k4l3k3MJ7Qnj0j4k4k8j2M%rKL4N7N0L0K1K2K1J5
392A367J0kj8k6j0J0Qj3k3jL0M5M0K8J9J0Llpj6k5l1l4l5l8l5k6k0j7j4lJ0J4QLLkj3k3j7
$$ plain form
428 1306 1346 1379 1386 1364 1331 1305 1300 1315 1341 1363 1373 1375 1371 1362 1347 1335 1327 1320 1317 1335 1379 1424 1438 1419 1389 1364 1345 1336 1350 1379 1392 1370 1330 1300 1286 1278 1272 1273 1279 1277 1265 1251
423 1251 1243 1244 1251 1256 1254 1246 1242 1246 1247 1235 1220 1221 1241 1262 1266 1250 1229 1223 1241 1273 1296 1300 1292 1279 1257 1230 1212 1213 1212 1190 1152 1129 1127 1133 1138 1147 1163 1180 1202 1235 1263 1263 1236 1219 1228 1240
417 1240 1230 1214 1225 1257 1277 1266 1240 1219 1207 1196 1186 1180 1180 1191 1213 1239 1255 1253 1238 1216 1194 1175 1162 1156 1156 1161 1168 1165 1147 1121 1102 1093 1085 1077 1074 1086 1111 1137 1143 1120 1079
412 1079 1052 1054 1071 1077 1072 1078 1105 1141 1165 1173 1175 1181 1192 1206 1213 1203 1177 1154 1152 1171 1192 1203 1204 1204 1209 1216 1213 1200 1189 1201 1238 1278 1300 1295 1275 1251 1233 1224 1223 1219 1203 1178 1158 1154
407 1154 1162 1169 1174 1184 1208 1242 1270 1284 1289 1299 1319 1350 1387 1420 1442 1455 1476 1510 1543 1549 1522 1482 1447 1420 1395 1370 1345 1315 1279 1243 1220 1215 1227 1245 1259 1263 1263 1275 1301
402 1301 1325 1327 1307 1281 1266 1256 1239 1211 1182 1167 1175 1202 1237 1273 1313 1358 1402 1437 1458 1467 1470 1469 1464 1453 1443 1440 1451 1472 1496 1516 1540 1573 1617 1662 1700 1730 1748 1747 1723
397 1723 1678 1625 1583 1565 1565 1562 1536 1494 1457 1432 1405 1361 1314 1282 1264 1240 1207 1184 1188 1205 1213 1208 1198 1184 1160 1132 1120 1124 1124 1115 1117 1151 1208 1258 1288 1309 1331 1352 1367
392 1367 1377 1375 1357 1331 1321 1331 1339 1326 1303 1302 1332 1377 1417 1445 1464 1474 1477 1474 1467 1451 1426 1395 1361 1326 1288 1253 1227 1207 1190 1176 1173 1183 1197 1205 1208 1211 1209 1196 1173 1156
388A156JJ5J7J0MJmnoj3k4l1j9NK5L7L8K5jk0k1j1qj8k5k3j9j7j0kmj0kK8N1M0Kl0m3l6k1
383A032mJ2L0M9N8L6lk7j9pj4k8j7OJ2kpPJ7OnjNnk4l3k9j2PJ2j2m8m5QN8O1K6QJ6J4j6m1
377A081l3lK3L3L3K2OjJ%oqKJ2Lj7l1l3k6qJ6K3Mk4k6jK4L1K5J7Nqj5j7j5j4lJ3J4qk6k4j2
372A029j1j7oJ8L2K2%j6j6JK8N1N5M2K9K0Qqj1J0K7J7j2k9j8NK0J9Mrj1jJ0J2Loj1j1nPJ8
367A289K4J9J0kj1rpj1k2k6j9j0j0j1jJ8L4M5M9M5K9QKJ3L0L7K2rm3n6l9j2%noKKqj1QL2L4
362A424J2j1j8qLJ0ROPJ3K7L6K6kk8k7mRmk6l1j9j3j4j6j0qoLJ3Oj3k4j9j5k1j1K2N1N0L4
357A413J8Mj6k6j1J1J0rj3lNRK3M2M2J7kJJ1P%LRJ0Mlj7l5m1k3jQNQJ7J2j1l2k9j1nj5k5j9
352A342lpl7o0m8oK4K3J1J6L5L9J8k2m9m5j4J4J2j1j8%J6J1OJ9L3J8j3k4j1pk6m1l6k4k1j4
$$ plain form
388 1156 1157 1172 1189 1199 1203 1204 1200 1195 1189 1176 1152 1121 1102 1107 1132 1169 1207 1232 1231 1211 1190 1179 1171 1153 1128 1105 1086 1069 1059 1057 1053 1043 1041 1069 1120 1160 1162 1132 1089 1053 1032
383 1032 1028 1040 1070 1119 1177 1213 1210 1183 1164 1157 1143 1115 1098 1104 1116 1114 1107 1114 1131 1137 1132 1131 1136 1131 1107 1074 1045 1033 1040 1052 1040 992 947 955 1013 1074 1100 1108 1124 1138 1122 1081
377 1081 1048 1045 1068 1101 1134 1156 1162 1161 1162 1162 1156 1148 1150 1162 1165 1148 1117 1084 1058 1050 1066 1089 1093 1069 1043 1042 1066 1097 1122 1139 1144 1136 1121 1104 1089 1075 1072 1085 1099 1091 1065 1041 1029
372 1029 1018 1001 995 1013 1045 1067 1067 1051 1035 1036 1064 1115 1170 1212 1241 1261 1269 1261 1250 1260 1287 1304 1292 1263 1245 1250 1270 1289 1293 1284 1273 1272 1282 1294 1297 1291 1280 1269 1264 1271 1289
367 1289 1313 1332 1342 1340 1329 1320 1313 1302 1280 1254 1235 1225 1215 1204 1203 1221 1255 1300 1349 1394 1423 1431 1433 1446 1476 1513 1535 1526 1483 1427 1388 1376 1376 1371 1365 1367 1369 1361 1350 1358 1390 1424
362 1424 1436 1425 1407 1399 1402 1412 1421 1427 1434 1447 1474 1510 1536 1534 1506 1479 1475 1484 1480 1454 1423 1404 1391 1377 1361 1351 1343 1337 1340 1353 1359 1346 1322 1303 1288 1267 1256 1278 1329 1379 1413
357 1413 1431 1435 1419 1393 1382 1393 1403 1394 1381 1378 1383 1392 1415 1457 1499 1516 1514 1515 1526 1533 1533 1536 1545 1555 1559 1556 1539 1504 1463 1440 1439 1447 1452 1460 1477 1489 1478 1446 1417 1406 1401 1386 1361 1342
352 1342 1339 1332 1295 1235 1187 1181 1205 1228 1239 1255 1290 1329 1347 1325 1276 1231 1217 1231 1243 1232 1214 1214 1230 1241 1247 1266 1299 1317 1304 1280 1269 1262 1236 1195 1159 1135 1114 1100
347A100J2M0M4J9j0k3j8nJ0J7J8J3Lj5l2l3j4OKk2k9kL7N3L4Jk0k6j7kJ6K2Pj9l7l2j4ll%
342A078J2K5K0ml1m4l7k2j2j0nMJ6K4K3J5%j4k0j3KJ7K4K2J6J3J4K1K0RlmPNj5l6l4j5knj2
337A049rJJ2K6L7L4J0j4j4JJ0jj1rkpk2k6j3J3L7M7M1K4Nj1k7m5n1l4mK2L1L1K8Rk2m5l9p
332A055K2K2Nj0q%M%kNJ5K3K5J6Jj4j7kK2K9Qk6m1k8kPlqPL0L4J3j5k7l1l9m5l8j8mpj1OL9
327I92N7M7J3k3m3m2k4pljJ2L4M4L6K5K7L2J3k8n9n3j9J2K2J7Qkj2j8j8j6j6j3%J5K1J3OQ
322A057J1NJRK5L0K3J0%qj4j6j1qn%J1J2lj9k0lJ7K0Qpj7k2l0l9l4oK6L3J1j3k2j5lPJ8K3
317A042J9QNQJ2J1NlnLJ0MrpRK4J6kj0qj3k4k2kJ6K2J5Nj3l3l8k6j3roJ4M0N2M3K6Rpj7j5
311A136j2j6k4k0mJ1Qpj4r%Mjqj1n%%nqonJJ2K3K1Nrj4j0prj4j7j3KJ4Nj4j4J0K3Oj6nL1M2
$$ plain form
347 1100 1112 1152 1196 1215 1205 1182 1164 1159 1169 1186 1204 1217 1220 1205 1173 1140 1126 1132 1134 1112 1083 1081 1118 1171 1205 1206 1186 1160 1143 1141 1157 1179 1186 1167 1130 1098 1084 1081 1078 1078
342 1078 1090 1115 1135 1131 1100 1056 1019 997 985 975 970 974 990 1014 1037 1052 1052 1038 1018 1005 1007 1024 1048 1070 1086 1099 1113 1134 1154 1163 1160 1156 1163 1168 1153 1117 1083 1068 1066 1061 1049
337 1049 1040 1041 1053 1079 1116 1150 1160 1146 1132 1133 1143 1142 1131 1122 1120 1113 1091 1065 1052 1065 1102 1149 1190 1214 1219 1208 1181 1136 1085 1051 1047 1069 1100 1131 1159 1168 1146 1101 1062 1055
332 1055 1077 1099 1104 1094 1086 1086 1090 1090 1088 1093 1108 1131 1156 1172 1173 1159 1142 1140 1162 1191 1199 1173 1132 1104 1102 1109 1106 1098 1105 1135 1169 1182 1167 1140 1109 1070 1025 987 969 965 958 947 953 992
327 992 1049 1096 1109 1086 1043 1001 977 970 967 966 978 1012 1056 1092 1117 1144 1176 1189 1161 1102 1049 1030 1042 1064 1081 1089 1087 1075 1057 1039 1023 1007 994 994 1009 1030 1043 1049 1057
322 1057 1068 1073 1074 1083 1108 1138 1161 1171 1171 1163 1149 1133 1122 1114 1109 1109 1120 1132 1129 1110 1090 1087 1104 1124 1132 1125 1108 1086 1056 1017 983 977 1003 1036 1047 1034 1012 997 994 1001 1019 1042
317 1042 1061 1069 1074 1082 1094 1105 1110 1107 1102 1105 1115 1119 1110 1103 1112 1136 1152 1150 1140 1132 1119 1095 1073 1071 1087 1109 1124 1129 1116 1083 1045 1019 1006 997 991 1005 1045 1097 1140 1166 1175 1168 1151 1136
311 1136 1124 1108 1084 1064 1060 1071 1079 1072 1058 1049 1049 1053 1052 1044 1033 1028 1028 1028 1023 1015 1009 1004 1005 1017 1040 1061 1066 1057 1043 1033 1026 1017 1003 986 973 975 989 994 980 966 976 999 1005 989 984 1015 1057
306A057J5j9k4pOPJ0J8J7OMJ5L3L6K4Mj6j9oJ6K6J0j3k5k6k3k3j7lJ2J8J7J4Lj8l7l6j9nk
301A030lnj3k1j9lJ2J3MlkKRJ5J6J3ONOjj1j7j5j3j2jJ6L2K9J4%j0k0k9k8j2J1K6K7J6Kj0
296A056k1k5j9mNOMJ0K3K7K0J3J1Lj4k9k8k1j6k1k2j8qNK0K9K7J7Nlj1j2pLJ4K1K8K7Pj8k7
291A057j4K%j2j2QK4J5j1k9k1LJ9J6QQJ8K1J0mrqoj4k6l5k6pQLpkK1M1L8J8Lpj8k1qJ7K8J2
285A101j2k1j9j9k2j3NPj6l9l4qRQKOJ5J7J9K2K4J3jorj7k4j3J1K8L1L4L9L5Ok7l6j9KMrk1
280A053k2j3mnj0mJ7M3N5M9K8Lj9k6j5KNpj6j1LRKj4k0j4llj5j9nJ9K8K0Npj3j0%QRQJ3K0
275A124J8RJpj8k0pQjk3l0oJ6J7OLKj0k7k1NK3J2j4l4m2m0k6LL3N0M8L7K1Jk6m8n0k9kQOQ
270I78J9K2J0knmrpJ0K9K4jj6j3ljmllnLK0K8J0j5k3j4mjKOOkj3k3k9k4kL0M8M2K0Lj0j7j9
$$ plain form
306 1057 1072 1053 1029 1022 1028 1035 1045 1063 1080 1086 1090 1105 1138 1174 1198 1202 1186 1167 1161 1177 1203 1213 1200 1175 1149 1126 1103 1086 1083 1095 1113 1130 1144 1147 1129 1092 1056 1037 1032 1030
301 1030 1027 1022 1009 988 969 966 978 991 995 992 990 992 1001 1016 1032 1045 1051 1056 1062 1061 1050 1033 1018 1005 993 992 1008 1040 1069 1083 1083 1073 1053 1024 996 984 995 1021 1048 1064 1066 1056
296 1056 1035 1010 991 987 992 998 1002 1012 1035 1062 1082 1095 1106 1109 1095 1066 1038 1017 1001 980 958 940 932 937 957 986 1013 1030 1035 1032 1021 1009 1002 1005 1019 1040 1068 1095 1102 1084 1057
291 1057 1043 1045 1045 1033 1021 1029 1053 1068 1057 1028 1007 1010 1029 1045 1053 1061 1079 1100 1110 1106 1097 1089 1083 1069 1043 1008 982 975 983 986 979 977 998 1039 1077 1095 1098 1091 1073 1052 1044 1061 1089 1101
285 1101 1089 1068 1049 1030 1008 995 1000 1007 991 952 918 910 919 927 929 935 950 967 986 1008 1032 1045 1044 1038 1029 1012 988 975 986 1014 1045 1079 1118 1153 1159 1132 1096 1077 1079 1083 1074 1053
280 1053 1031 1018 1014 1009 999 995 1012 1055 1110 1159 1187 1190 1171 1145 1130 1132 1137 1130 1114 1103 1106 1115 1117 1103 1083 1069 1066 1063 1048 1029 1024 1043 1071 1091 1096 1089 1076 1066 1066 1074 1083 1091 1104 1124
275 1124 1142 1151 1152 1145 1127 1107 1100 1108 1107 1084 1054 1048 1064 1081 1087 1090 1092 1082 1055 1034 1039 1062 1074 1060 1026 984 944 918 921 954 1004 1052 1089 1110 1111 1085 1037 987 958 956 964 970 978
270 978 997 1019 1029 1027 1022 1018 1009 1002 1012 1041 1065 1064 1048 1035 1032 1031 1027 1024 1021 1016 1019 1039 1067 1077 1062 1039 1025 1021 1020 1022 1028 1034 1032 1019 996 967 943 941 971 1019 1061 1081 1084 1074 1057 1038
264A038j4j3k0k8k6j7j0jK0M4N6M3K2J0Loj4j6j2j9l6m4l0nJ1J3J1J4J7Pj1j9nJ8K9K2J0O
259A048Loj4j4qj2k3k5j3LJ1J8L3M4M2K9J9Lk2m2l8rJ6J4mj0LJ8K1Qoj0j2j7k4k5j8oPK1L1
254A034K7Roolpj9k0j1jLPJ0Onj2qloj5k1k1j4kJ1QlqLJ3Oj0j3OL4M6L6J3kmjnj6k0j9j4l
249I74J6L4L1Nj5qJ2J8RJ2K3K1LrkNj4m1m3j1J9J8qk6k1oMNONlj7k5k2qLMjnMJ9K9K5J6J4
243A049K4K8J6j2m1n1l5ML6L9J8%JOkj5j2NJ4kk8m2k9lJ7K0RmqjPJ0Njk%ok3l4k9j5rqjJ7
237I12K8K1Q%pj9k7k9l1l6l3j0K3M3M2L0J4jrlKK%J0J4mk6k9j4jNK3M4M5K6J9L1L4J1nRK8
232A140K1%j0j0j8k7j6PK0J6J2J3Pjoj2l4n8n3j6J9K4Nj2j7pJ1K1J1klMNLJ5L2K5nk3j5j0
227A056k4k8mK5K1%%J6J4j2l0k6j8j7j4MK1K4J7J3Rjj1j7k0k1j6ppk1k5j2OLj7k9j8MK1K7
$$ plain form
264 1038 1024 1011 991 963 937 920 910 909 929 973 1029 1072 1094 1104 1107 1101 1087 1071 1059 1040 1004 960 930 925 936 949 960 974 991 998 987 968 963 981 1010 1032 1042 1048
259 1048 1051 1045 1031 1017 1009 997 974 949 936 939 950 968 1001 1045 1087 1116 1135 1138 1116 1074 1036 1027 1043 1057 1053 1043 1046 1064 1085 1093 1087 1077 1065 1048 1024 999 981 975 982 1003 1034
254 1034 1061 1070 1064 1058 1055 1048 1029 1009 998 997 1000 1007 1017 1023 1018 1006 998 995 989 974 953 932 918 916 927 935 932 924 927 940 946 936 923 929 963 1009 1045 1058 1056 1052 1051 1046 1030 1010 991 977 974
249 974 990 1024 1055 1060 1045 1037 1049 1067 1076 1088 1111 1132 1135 1126 1124 1129 1115 1074 1031 1020 1039 1057 1049 1023 1002 996 1000 1005 1011 1016 1013 996 971 949 941 944 948 947 942 946 965 994 1019 1035 1049
243 1049 1073 1101 1117 1105 1064 1013 978 982 1018 1057 1075 1075 1076 1082 1080 1065 1053 1058 1072 1070 1042 1000 971 968 985 1005 1014 1010 1002 1001 1008 1018 1023 1022 1020 1020 1014 991 957 928 913 904 896 895 912
237 912 940 961 969 969 962 943 916 887 856 820 787 777 800 843 885 915 929 928 919 916 918 920 920 930 944 940 914 885 871 870 875 898 942 987 1013 1032 1063 1097 1108 1103 1112 1140
232 1140 1161 1161 1151 1141 1123 1096 1080 1087 1107 1123 1135 1148 1155 1154 1148 1136 1102 1044 991 975 994 1018 1023 1011 994 987 998 1019 1030 1028 1025 1029 1034 1037 1052 1084 1109 1104 1081 1066 1056
227 1056 1032 1004 1000 1025 1046 1046 1046 1062 1076 1064 1034 1008 990 973 959 963 984 1008 1025 1038 1047 1046 1035 1018 998 977 961 954 947 926 901 889 895 898 881 852 834 838 859 886
222H86K1QlkJ3K3J3mrkPLkLJ6K0QnqJJ1J4Qj2m1n8m3nK9M1L8L3K9K5K2J9Rqk0j6rqj7k1j1
217I96MJ9K7K8K1J0oj8k5j6LJ9J9Plqj5j7mJ7L1K6J9K3K8K0Mqj3j6j9j7j7j7j4JJ5J4PQK1
212A154K0nl0l1j7qj3j5j2j2j1nJ0K2J9Nj0k0k2k0j9k7l6k6KK3J4pj1PK2J6mk0k5j9oOJ0J0
207I09J6K0J2nqQK3J3rj3QK6K1Jj5k0k0j5LK5L7K8PqpNRjj6k0j3jPPmk0l2k5mOpk4k8j9pN
201H55K6M5M4K4OLkj6k5j7%QJj0j9k1j3J0L5M4L0NrpNJ1kk9m4l8j6kOJ9L3K9J0JJ6L6L3J1
196A076NK0L1J6j2k4qJ1J6Mj2k5k5j2MJ0NKPRkj7j8mRMmnKLnj5k6l0k1JJ8J9Jj9l5l8k4PK8
191I27J9j0k2oJ6K4K4K9L4K5J5J4K0K0Qkj0j7j9j3kMQJ3J6Mj4k2j7k3m3n1l4oQJ4K5L0J2j7
186I81k3KL4M6L7K1Orj3qjlj1j9k1k0j0QK7L8M2L9K5Lj6j9j6j9k6k5qNOjpj0j4j4lP%k2l5
$$ plain form
222 886 907 915 912 910 923 946 959 955 946 944 951 954 952 955 971 991 999 994 986 987 998 1012 1020 1008 967 909 866 861 890 931 969 1002 1031 1056 1078 1097 1106 1098 1078 1062 1053 1045 1028 1007 996
217 996 1000 1019 1046 1074 1095 1105 1099 1081 1056 1040 1043 1062 1081 1088 1085 1077 1062 1045 1041 1058 1089 1115 1134 1157 1185 1205 1209 1201 1188 1172 1153 1136 1119 1102 1088 1089 1104 1118 1125 1133 1154
212 1154 1174 1169 1139 1108 1091 1083 1070 1055 1043 1031 1020 1015 1025 1047 1066 1071 1061 1041 1019 999 980 953 917 891 893 916 930 923 912 919 941 957 953 933 908 889 883 889 899 909
207 909 925 945 957 952 944 952 975 988 979 966 974 1000 1021 1022 1007 987 967 952 955 980 1017 1045 1052 1044 1037 1042 1051 1050 1034 1014 1001 1000 1007 1014 1010 990 958 933 929 935 928 904 876 857 850 855
201 855 881 926 970 994 1000 1003 1001 985 960 943 943 951 952 942 923 902 889 899 934 978 1008 1013 1004 997 1002 1013 1011 982 938 900 884 882 888 907 940 969 979 980 996 1032 1065 1076
196 1076 1081 1101 1132 1148 1136 1112 1104 1115 1131 1135 1123 1098 1073 1061 1065 1075 1080 1082 1089 1098 1096 1079 1061 1057 1066 1070 1066 1061 1063 1066 1061 1046 1020 990 969 970 988 1007 1008 989 954 916 892 899 927
191 927 946 936 914 908 924 948 972 1001 1035 1060 1075 1089 1109 1129 1137 1135 1125 1108 1089 1076 1074 1078 1086 1099 1115 1119 1105 1083 1066 1043 1000 949 915 909 917 931 956 986 998 981
186 981 958 960 994 1040 1077 1098 1104 1095 1082 1074 1073 1070 1059 1040 1019 999 989 997 1024 1062 1104 1143 1168 1171 1155 1136 1120 1101 1075 1050 1042 1047 1053 1052 1045 1035 1021 1007 1004 1011 1011 989 954
181I54k5pNPPM%KJ4K7L2K5J5J5J9J9J0lj4k0k3j8rkmj5j8mJ7K6J5krlKkpnOJ6J2jj6k0j5p
175A000KJ0K0K6K2J4QOjrj0MK1K8J7kk1k5j6m%pj6j2RL3M2K2j8m6m9l4j6nLPMkMJ5J6Jj8k7
170I96k4j9qLQPRJ2PnpJ0K5J4j1j7kNj2l0k0LJ4LmJMlj5j3jLJjOJ3J2RJ0K0K5K3J6Rlj7k2
164A034j7j1qoJNnj6j2PJ7J3RJ5K1J4ko%OJ2J8K0Rj1j7nOlj3rOJ1%j8l1l3k6rQJ2jk1l2k1
158I11J2M8O3M6J3j2k1k6l0k5j8j9k4j3J6L9L3J0jJOQJ6K0J5Lmmj6m3n9m5j0J9L2K9J1j8m1
154I22m2k0RL6N0N1L6J1nql%jljNJ6K2J6Ll%NPJqj8j6kJ2Lk3l5j4J4K0OjJ1K8K8J3nj9k8k7
148A043j5JJ3J2nk2k7j7kJornLJ1J6J7J4J1J4K1K0Nj3k2k0j2j3j8k3j8kJ5K3J6Lj1j6j2lK
143I70jmnqj6j6kJ2J0mkK0M2L6J1LJ4K5J5nj6k4l5m0k7kJ0Lj0j1mmkJ0K5K7J2JMNmrNK8L6
$$ plain form
181 954 929 922 927 934 941 945 945 947 961 988 1020 1045 1060 1075 1094 1113 1123 1120 1106 1086 1063 1045 1036 1034 1030 1015 997 993 1010 1036 1051 1049 1040 1037 1039 1037 1030 1025 1031 1047 1059 1058 1042 1022 1007 1000
175 1000 1002 1012 1032 1058 1080 1094 1102 1108 1107 1098 1088 1092 1113 1141 1158 1156 1135 1110 1094 1090 1090 1083 1067 1055 1064 1097 1139 1161 1143 1097 1048 1014 998 993 996 1003 1007 1005 1009 1024 1040 1041 1023 996
170 996 972 953 945 948 956 963 972 984 991 986 979 989 1014 1028 1017 1000 998 1003 991 961 941 944 958 961 957 958 962 959 944 931 930 933 934 933 939 952 964 973 983 1003 1028 1051 1067 1076 1073 1056 1034
164 1034 1017 1006 998 992 993 998 993 977 965 972 989 1002 1011 1026 1047 1061 1059 1053 1053 1059 1071 1089 1109 1118 1107 1090 1085 1091 1088 1075 1066 1072 1083 1083 1065 1034 1001 975 966 974 986 985 964 932 911
158 911 923 971 1034 1080 1093 1081 1060 1034 1004 979 961 942 918 905 921 960 993 1003 1002 1003 1009 1017 1033 1053 1068 1071 1067 1063 1047 1004 945 900 890 909 941 970 981 963 922
154 922 880 860 869 905 955 1006 1042 1053 1048 1040 1037 1037 1036 1033 1032 1037 1053 1075 1091 1094 1091 1091 1096 1103 1104 1096 1078 1062 1060 1072 1075 1052 1017 1003 1017 1037 1043 1042 1053 1081 1109 1122 1117 1098 1070 1043
148 1043 1028 1029 1042 1054 1049 1027 1000 983 981 982 976 967 962 965 976 992 1009 1023 1034 1048 1069 1089 1094 1081 1059 1039 1027 1014 996 973 955 953 968 991 1007 1010 999 983 971 968 970
143 970 969 965 960 952 936 920 918 930 940 936 934 954 996 1032 1043 1046 1060 1085 1100 1095 1079 1055 1020 980 953 951 961 964 954 943 939 935 933 943 968 995 1007 1008 1012 1017 1013 1004 1009 1037 1073
137A073K4J1Mlj5k1j7j3rolj0k7l3j5J2K3J3ok8m2l0RM1L6PoPJ6P%J2K6K2J2J2J8Rqj5pjq
132A071j5j4mLLlrr%J2J6J2Mkprj1j9k6k3kJ6Rj3k6j6jKJPK0K6K2J0jqo%PNkj2k3l3l5k5k
126H90J6K3J3MQK6L8K4mj8j0MOmj6k8l7l9k6kK4M6M9K5j0k1QM5N1K3j0k8m1n3n3l0MK8L3K5
122I83J4POMj1l4m0k4JJ4J1N%nqnlooNK1J9MkJ4L5M6L9K4Oj1k6k8j8mORPOKj1k5k5pJ2J6P
116A024PJ7J5ql3k6MK1Oj8j6QK4J7%oJkj3k0j5j0pLK5M7M4J1k6m0k9j3j2j7j4LJ8Rj4l1k6
111I08nJ8L4M2L8J7j6m9n9l8jK4K7K3K5K9J8kqKQLLK3M4L4nl4l0j0nj9l4k8j1Jkj7k4pK4M8
106I89M8L1Qj0k5l9m3l1j3JOJ3K4L4L1K2J7K2J9Lj4j5llj6l0k8j2MJ7K7L1K2Nj1j4mJ0J1l
101A081j9k2j3lJMOMpj8j9j2jPQLlkNJ0RLlj3k0j9kK2M5N4M3J8qj5j0j1k0k2lJ7J9Lj6k8l5
$$ plain form
137 1073 1097 1108 1112 1109 1094 1073 1056 1043 1034 1028 1025 1015 988 955 940 952 975 988 982 954 912 882 891 932 968 975 969 976 992 999 999 1011 1037 1059 1071 1083 1101 1110 1102 1087 1080 1079 1071
132 1071 1056 1042 1038 1041 1044 1041 1032 1023 1023 1035 1051 1063 1067 1065 1058 1049 1038 1019 993 970 968 984 993 980 954 938 937 939 940 947 967 993 1015 1025 1024 1016 1010 1010 1017 1022 1020 1008 985 952 917 892 890
126 890 906 929 942 946 954 980 1018 1042 1038 1020 1010 1014 1020 1016 1000 972 935 896 870 868 892 938 987 1012 1002 981 989 1034 1085 1108 1098 1070 1029 976 923 893 897 925 958 983
122 983 997 1004 1010 1014 1003 969 929 905 906 920 931 936 936 931 923 918 915 909 903 908 929 948 952 950 964 999 1045 1084 1108 1114 1103 1077 1049 1031 1027 1033 1042 1049 1055 1057 1046 1021 996 989 1001 1017 1024
116 1024 1031 1048 1063 1055 1022 996 1000 1021 1027 1009 993 1001 1025 1042 1042 1036 1037 1035 1022 1002 987 977 970 973 998 1045 1089 1100 1074 1034 1005 992 980 963 949 952 970 979 965 934 908
111 908 903 921 955 997 1035 1052 1036 987 928 890 889 913 940 963 988 1017 1035 1033 1025 1027 1035 1038 1041 1064 1108 1142 1137 1103 1073 1063 1058 1039 1005 977 966 967 965 948 924 917 941 989
106 989 1037 1068 1076 1066 1041 1002 959 928 915 916 922 935 959 993 1024 1046 1063 1085 1104 1107 1093 1078 1075 1072 1056 1026 998 986 990 1007 1034 1065 1087 1092 1081 1067 1063 1073 1084 1081
101 1081 1062 1040 1027 1024 1025 1029 1035 1039 1032 1014 995 983 982 989 997 1000 997 995 1000 1010 1019 1022 1019 1006 986 967 965 987 1032 1086 1129 1147 1139 1124 1114 1103 1083 1061 1058 1075 1094 1097 1081 1053 1018
95A018l5k6j3JJ6L2L7K1kj2qrk1k2nJ4J2nj4%K4M0L9K7J0pj8j7mPLj7k9j8OJ4Mj1j8j9rJ5
90A001L8L8J2mKJ0ql5l9k2j0j3pJ8L6K7Kj5j5j0nMJ2J0MQK7L7K3mj8j4mmj3k1k1j2JJ4K1J9
85A070J2jj4j7kK2K7Ok3l7l5k8j3J4M5M9K5nj3%J2J3J4J8K2J5jj7k3j8j5k3l3k9qJ2J7J3J1
80A062Mpj2LK9L5J0k2l5k7j3kMRJ1Mj1l1m1k7LK1J3j1k2lK9N3N4L3Jk8l0jL8N0K9jj5j0rj6
75A121k1k0k2k5k0lJ1J0jj1k3l8l9j7J8L1J7%OK6M0L9L0K3J1jro%jj5k6k4rpk4l6k2J1K6P
70A007k3l0j0J6K8K7K2J1%j1j1jJ2J7J6J7J9J6Krj1j2k6l5j6K2M0J6k1l1j4QJ4Pmj6k3j3N
65A005J1kj9k8k1qJ1K6L2K4J0JKRK0K7K3QqrLJ9K8K0Jk1l0k4j3kRJ9J6Jj4j6j6k3l5l0qPJ
60A006j1oJ4K4J8Mknj0j1lK%kPK1J6kj3nJ1J1lj5rQJ8J1mj2kJ5K5J9Jj8l1l2j4J3L2K6Jk2
$$ plain form
95 1018 983 957 944 945 961 993 1030 1051 1049 1037 1029 1020 999 977 972 986 998 993 979 979 1003 1043 1082 1109 1119 1112 1094 1077 1073 1080 1083 1066 1037 1019 1025 1039 1043 1032 1014 995 986 1001
90 1001 1039 1077 1089 1085 1087 1097 1089 1054 1015 993 983 970 963 981 1017 1044 1046 1031 1016 1006 1001 1005 1017 1027 1031 1039 1066 1103 1126 1122 1104 1090 1086 1082 1069 1048 1027 1015 1016 1030 1051 1070
85 1070 1082 1081 1067 1050 1048 1070 1097 1103 1080 1043 1008 980 967 981 1026 1075 1100 1095 1082 1082 1094 1107 1121 1139 1161 1176 1175 1158 1135 1117 1102 1079 1046 1017 1009 1021 1038 1051 1062
80 1062 1066 1059 1047 1050 1079 1114 1124 1102 1067 1040 1027 1025 1029 1038 1049 1053 1042 1011 970 943 946 967 980 969 947 944 973 1026 1080 1113 1114 1086 1056 1055 1093 1143 1172 1171 1156 1146 1137 1121
75 1121 1100 1080 1058 1033 1013 1010 1021 1031 1030 1019 996 958 919 902 920 951 968 968 974 1000 1040 1079 1109 1132 1143 1142 1133 1127 1127 1126 1111 1085 1061 1052 1045 1021 985 963 974 1000 1007
70 1007 984 954 944 960 988 1015 1037 1048 1048 1037 1026 1025 1037 1054 1070 1087 1106 1122 1124 1115 1104 1092 1066 1031 1015 1037 1077 1093 1072 1041 1027 1035 1049 1056 1052 1036 1013 1000 1005
65 1005 1016 1014 995 967 946 938 949 975 1007 1031 1041 1042 1044 1053 1073 1100 1123 1131 1123 1114 1117 1136 1164 1184 1185 1164 1134 1110 1097 1095 1104 1123 1139 1140 1126 1110 1094 1071 1036 1006 998 1005 1006
60 1006 995 989 1003 1027 1045 1049 1047 1042 1032 1021 1018 1020 1020 1018 1025 1046 1062 1060 1047 1042 1053 1064 1061 1046 1037 1045 1063 1074 1070 1058 1056 1071 1096 1115 1116 1098 1067 1035 1021 1034 1066 1092 1093 1071
55A071k8j9mRJ3Qnj2j1nklj1k4l3l4k0JK6L9L2Ok4l8l2pK1M0M2K9J2N%qk8m4m7l2j4%LLPJ4
49H96K0J8QKPJ8K4K5K4K2J0qj9pK0L2J2k2m0l1j5j1j4rPK3K7J7kk5l2j5K0M4M1J4j4k3j4m
44A026kpLK9M9M4J7kqj2k0k2k1k3l1l3j9mPJ2Rmj7j6j%k3m9m7k8j4jL0P4R3O6J8j9l6l5k5
39I58j1nomKMkoNK0K1J3J0K1K9K4J1J%KK%%KKoj9l0l5l1j2J6L3K5JqQK5J7j4l8m0l0k2j6r
34I08nJJ2L0L6K4LpmjKPJ1Nj1j8mJ3J1oj5j0LJ3K5L2K1kj4mJ4K0K3L0L1Rk4m1l7l0k8k3j3
29I87j2k0j3K0N0N0K3Knnqj0njOJ5K0J3kj2j2qmlmj3j8j0J2L0L1K1J2Jqj4j7k3l4l9k7qMQ
23I70J4K0J5jj4j5j2j8k1qJ8K9J0j6k1KK1J9Njjj0k0j8qkm%J7K5J7OLjk0l8l3oJ2J4PJ1J9
18I66K1J3nk7l6k3NK5K5J7J5J4Nrj5rRK5L0K0QJ0K2J7nk3j2J2K0Rnrj3j9k4k1rPK1J4j4m1
$$ plain form
55 1071 1043 1024 1020 1029 1042 1050 1045 1033 1022 1017 1015 1012 1001 977 944 910 890 891 917 956 988 994 970 932 900 893 914 954 996 1025 1037 1042 1042 1034 1006 962 915 883 869 869 872 875 882 896
49 896 916 934 942 944 951 969 993 1018 1042 1064 1074 1066 1047 1040 1060 1092 1104 1082 1042 1011 996 985 971 962 969 992 1019 1036 1034 1009 977 962 982 1026 1067 1081 1067 1044 1030 1026
44 1026 1024 1017 1020 1049 1098 1142 1159 1157 1149 1137 1117 1095 1074 1051 1020 987 968 964 971 983 992 988 971 955 954 954 931 882 835 807 793 792 822 896 989 1055 1073 1054 1018 983 958
39 958 947 942 936 932 934 938 936 930 935 955 976 989 999 1020 1049 1073 1084 1085 1085 1087 1089 1089 1089 1091 1093 1087 1068 1038 1003 972 960 976 1009 1034 1035 1027 1035 1060 1077 1063 1025 985 955 933 917 908
34 908 903 904 916 946 982 1006 1009 1002 998 997 999 1006 1017 1022 1011 993 989 1002 1013 1007 992 982 985 998 1023 1055 1076 1074 1060 1056 1070 1090 1113 1143 1174 1183 1159 1118 1081 1051 1023 1000 987
29 987 975 955 942 962 1012 1062 1085 1087 1082 1077 1069 1059 1054 1053 1059 1074 1094 1107 1105 1093 1081 1073 1069 1066 1062 1049 1031 1021 1033 1063 1094 1115 1127 1128 1120 1106 1089 1066 1032 993 966 958 962 970
23 970 984 1004 1019 1018 1004 989 977 959 938 930 948 977 987 971 950 952 973 992 997 996 995 985 965 947 939 937 933 933 950 975 992 998 1001 1000 980 942 909 903 915 929 936 947 966
18 966 987 1000 995 968 932 909 914 939 964 981 996 1010 1015 1006 991 982 991 1016 1046 1066 1074 1084 1106 1123 1118 1095 1083 1095 1115 1124 1119 1110 1097 1078 1054 1033 1024 1031 1052 1066 1052 1011
13A011l9j2NJmNJ8K0J7J6J0rk4j9mjokPR%qj5k7l9l0KL1L7K9K8L2K9J6%j4j8j1PJ9Rj3k9k6
7A008rQJ4Jj9l0j9JJ2QJjmj2j6j2lLNJ1K1L4M0L5K0NKKlj5j7nJ5K2J1j0k6l1k0%J5J2rl7m9
2I59l8pK9M7M0J9kj1rnnomknj2j2olqrLK0J8nk4j3J5L3K2JoMJ6J3lj3qPJ3Jj7k4j5nrj9k0
-4I35j1oj3j7qJ1J7J6K5M9N8L2pk2oNmk0k4k0j3%K1L1J9jn%mk1l2k0JJ6K1J6Lj3k0j4mOJ9
-9I96K4J5oj9j5j0j7k8j7J2M1N4M1J1k3m2m0k6j5oPK0K4J8J5J1LolJ3K2K0J0Jjk%lj3k3k1
-14A022oOJj4k0j7rnnpqqqj0j1%K1M0M6L4J6mj6j4jJ3J1jj6k3k6k3j4lok4m0l3pJ3K0K1L2
-20I17L7K3jj1jROmn%jjPJ5J1nj1qj0k5l4j9J0K6K6K0J6J1RJ1J6J1lj6k7l0k8j2J3L6M8M4
-25A070L1J5Mpj7k7k8j7ojMJ5K2J5KjLlk0k6qJ2J3pk8l3k4j1pj1j2MK4K7J1KJ0K1J2j0k1r
$$ plain form
13 1011 972 960 965 966 962 967 985 1005 1022 1038 1048 1039 1015 996 992 991 985 983 990 999 999 991 976 949 910 880 882 913 950 979 1007 1039 1068 1084 1084 1070 1052 1041 1048 1067 1076 1063 1034 1008
7 1008 999 1007 1021 1022 1003 973 954 955 967 975 976 975 971 959 943 931 928 931 936 947 968 1002 1042 1077 1097 1102 1104 1106 1103 1088 1071 1066 1081 1103 1114 1104 1078 1047 1027 1027 1042 1054 1045 1008 959
2 959 921 914 943 990 1030 1049 1047 1036 1027 1022 1017 1011 1007 1005 1000 988 976 970 967 959 950 953 973 991 986 962 949 964 997 1019 1020 1014 1018 1034 1047 1044 1031 1023 1030 1043 1044 1027 1003 988 983 974 955 935
-4 935 924 918 905 888 880 891 908 924 949 998 1056 1088 1081 1059 1053 1058 1054 1034 1010 990 977 977 998 1029 1048 1047 1042 1042 1038 1017 985 965 966 982 1003 1019 1022 1009 989 975 971 977 996
-9 996 1020 1035 1029 1010 995 985 968 940 923 935 976 1030 1071 1082 1059 1017 977 951 936 930 937 957 981 999 1014 1025 1028 1022 1019 1032 1054 1074 1084 1085 1084 1082 1082 1079 1066 1043 1022
-14 1022 1016 1022 1023 1009 989 972 963 958 953 946 938 930 922 912 901 901 922 962 1008 1042 1058 1054 1038 1024 1023 1036 1047 1046 1030 1007 981 958 944 941 935 911 871 838 831 844 864 885 917
-20 917 954 977 976 965 964 973 979 975 970 970 969 968 975 990 1001 996 985 977 967 942 908 889 899 925 951 971 987 998 1007 1018 1034 1045 1042 1026 999 969 941 929 942 978 1026 1070
-25 1070 1101 1116 1120 1113 1096 1069 1041 1024 1018 1017 1021 1036 1058 1073 1075 1074 1077 1074 1054 1028 1020 1032 1045 1038 1010 977 953 942 935 924 912 916 940 967 978 980 990 1011 1023 1013 992 983
-30I83J5L1K9J2pj6j1lmj0j6k0j5OL1L3J0j2j2lj1k7k5%K6L1K5K1J6Nj3l2m8m4j6J9L5K5N
-35A013qj8k3j2J2K3Oj7j3J2K6K1PJjj0j7j7pLJ1J3J0Jj0j6j3%RJ1OKKkj0j6j6rqrqLJ3J8
-40I63J9K4L4L3J4j0k1j6j6l0m4l2kJ9K1K0L0L3J7qj4KJ1Lqrpk1l9m1k1MJ6K0K3K8K8K4J8
-45A065Qnj5qJ1J9J3NPMj9m7n8m0j7jJ3K0J5nj7nK1L9L7K3kk8m3l6j3J1K8L6L5K2J3J9K9K3
-50A157j1m7n8l8rJ4J7J1NRJ8J4kj6j6qpj5k4k7k7k3j2J0L2M1K9Oj5k3k3k1k0j5JJ6K2J6J0
-54I71QKj1k5k1%K5L6L0K5K2J2j1l2l3j1J2J4Kj2j6j5j7k6k5mK9N1M7K2kj2j0m%ok0l3l6l8
-59H88m4m5j8K8O2O1M1K7K1J1qk7l4l0j7LJ1lk4k6jK3K1M%J3K4J6KKJ5K1Rpj6j9k0j4%J0J
-64I61j6k0KK6L5K7J8J4J3J1Kj5k8k9j6ljkJ1L4M0J2k9n3m6k4oj%MJ3K1J9Jk7m8m5k3NK3K7
$$ plain form
-30 983 998 1029 1058 1070 1063 1047 1036 1033 1029 1019 1003 983 968 974 1005 1038 1048 1036 1024 1021 1010 983 958 958 984 1015 1040 1061 1077 1082 1069 1037 989 945 929 948 983 1008 1013
-35 1013 1005 987 964 952 964 987 993 976 963 975 1001 1022 1029 1030 1029 1019 1002 985 978 981 992 1005 1015 1016 1006 990 977 977 986 997 1003 1005 1007 1005 995 979 963 954 946 937 929 932 945 963
-40 963 982 1006 1040 1073 1087 1077 1056 1040 1024 994 950 918 916 935 956 976 1006 1039 1056 1048 1034 1036 1047 1050 1042 1033 1026 1005 966 925 904 908 924 944 967 995 1023 1047 1065
-45 1065 1073 1068 1053 1045 1056 1075 1088 1093 1100 1104 1085 1038 980 940 923 922 935 955 970 965 948 943 964 1003 1040 1063 1061 1033 990 954 941 952 980 1016 1051 1073 1086 1105 1134 1157
-50 1157 1146 1099 1041 1003 994 1008 1025 1036 1041 1050 1068 1082 1080 1064 1048 1040 1033 1018 994 967 940 917 905 915 947 988 1017 1023 1008 985 962 941 921 906 907 923 945 961 971
-54 971 979 981 970 945 924 924 949 985 1015 1040 1062 1074 1063 1031 998 987 999 1013 1015 1003 987 972 955 929 904 900 929 980 1027 1049 1047 1035 1025 1021 1021 1015 995 962 926 888
-59 888 844 799 781 809 871 932 973 1000 1021 1032 1024 997 963 933 916 919 930 927 903 877 876 899 920 924 924 937 961 977 979 981 996 1017 1026 1019 1003 984 964 950 950 960 961
-64 961 945 925 927 953 988 1015 1033 1047 1060 1071 1073 1058 1030 1001 985 982 981 979 990 1024 1064 1076 1047 994 948 924 918 917 917 921 934 955 974 975 948 900 855 832 837 860 887
-69H87J6mj8pK2M1K9LoOJ2jj8k3j7rNK7M2L7K0Jj8l3l6k0kLNJ8L6L3RnKJ6K0J9K2J7pl3l7
-75A054j4J2J3lj8k2k1k4l0k7rJ3K4J7J0PJ0Nlpmlj1k6l4l0j9j0kJ0K5L1K5J7J2Lj1j9lJ6
-79I54J5j3l0j4J8L2K3PKkqj5k1k3j5LK2L3L4L4L7L5J8pk7l1k0lROjnlmj0r%Pnk6l0j3PRp
-85I63k0k0j3okmpoNK2K5J2JOJ7J5Krj4j8j5LK8K9Kk8k7jK6L5L3K3Nj7k5j2RJ4Kj4j9j1jQ
-90I96J4J0nk4k5nJ5Oj9l0j5RJ7J6Rmj9j8PK6J2j9k5kK1K2Olqj1nJ4K7K7J3Loj9k6k4j4mN
-96I45J1Pj0k6j9NK3K2K2L9N6N2K9J5J5J1j6m1l5nQrl5l5j6oj5k8l1k1mJ2J7OnMK0J6qk1o
-101I43J6J9MmKQJ1J5J8J4PNQQPQJ1jk3l6k7kK0K8K4Mj8l4l1j7kJ0K0K9K8J8QJ0J8K0Rmol
-106A142qj8k2j0PJ7J8J4Orj9k1k0k2j8lJ1Lj8l1k3mJ1J5J4RJ1K0K4Qk0l4k1%MlkJ0J9K0K1
$$ plain form
-69 887 903 899 881 874 896 937 966 969 963 969 981 980 962 939 922 913 918 945 987 1024 1044 1045 1027 994 958 938 936 939 944 962 998 1031 1040 1035 1037 1053 1073 1092 1114 1131 1124 1091 1054
-75 1054 1040 1052 1065 1062 1044 1022 1001 977 947 920 911 924 948 965 975 982 992 997 994 987 983 980 969 943 909 879 860 850 848 858 883 914 939 956 968 971 960 941 938 954
-79 954 969 956 926 912 930 962 985 992 994 992 984 969 948 925 910 913 935 968 1002 1036 1073 1108 1126 1119 1092 1061 1041 1038 1047 1053 1052 1047 1044 1040 1030 1021 1021 1028 1023 997 967 954 961 970 963
-85 963 943 923 910 904 902 898 891 885 890 912 937 949 950 956 973 988 990 981 967 949 934 937 965 994 996 968 941 940 966 1001 1034 1057 1062 1045 1020 1008 1017 1031 1033 1019 1000 989 988 996
-90 996 1010 1020 1015 991 966 961 976 982 963 933 918 927 944 960 969 965 946 928 935 961 973 954 929 927 948 970 976 973 965 954 949 963 990 1017 1030 1033 1027 1008 982 958 944 940 945
-96 945 956 963 953 927 908 913 936 958 980 1019 1075 1127 1156 1171 1186 1197 1181 1140 1105 1100 1108 1099 1064 1029 1013 1007 992 964 933 912 908 920 937 943 938 942 962 978 970 949 943
-101 943 959 978 982 978 980 988 999 1014 1032 1046 1053 1058 1066 1074 1081 1089 1100 1099 1076 1040 1013 1011 1031 1059 1083 1087 1069 1035 1004 987 985 995 1015 1044 1072 1090 1098 1108 1126 1146 1155 1151 1145 1142
-106 1142 1134 1116 1094 1084 1091 1108 1126 1140 1146 1137 1118 1097 1077 1055 1037 1034 1045 1048 1030 999 976 972 983 998 1012 1021 1032 1052 1076 1084 1064 1030 1009 1009 1013 1010 1008 1018 1037 1057 1078
-111A078K5J9Lj2j6j3j6k1k4k2j8qQK2J7ok6k3lJ5K3K1J8J5J2J2Rkj9l2l2k6k1j6lRJ8K4K8
-116A017K6Nj9l0k5j8j7oJ8L3J6j9l6k4oJkMJ5J8QkpmKJ5K8L0J5lmJ1J7Kk1k8j4jmk0l2k9
-121I10j6PL0M3L6J5kjJ3K8K6J0j7l9m7m0k6j0jkm%OQjnOL1M5K7j2m6n5m2j5J4L8N0M5L3K4
-126A064K2K2Pk2n3o4m5j5NQJ2L0M8M1Jm1n0k7MJ7J2jj3j9k0j7pPK0L2L3K1Lqj4k2l4m3l5
-131H59j8j3k4l3k0PK4K1J4J9L1L4K4Nj5l4m0k4MJ7PooLOLKKLQK2L4L0J5Kmj1k2k2pRJ4J3
-136I33J7J8J1kmjqk3l4l4l1k6j1J7L3K3Jq%Jqj2QL3L7J9MOJ6J5Npj4j6j8j7j2nlnj3j3jK1
-141H92L6L0J3j%RJ7K0J7J3Kj4k9k7j0RRmj9j8rQK9M0L2RoJJ4J2mj9k8l6m3l9k6j8j9k2j4
-146H07OL4O3Q4Q3N9K9Jk1l6m0l1j5oJRJ7J5jk4l8l9k6rMJ4J7J5QNLK%%RJ2Jj4j6qj2k5l0
$$ plain form
-111 1078 1103 1122 1125 1113 1097 1084 1068 1047 1023 1001 983 975 983 1005 1022 1016 990 967 964 979 1002 1023 1041 1056 1068 1080 1089 1087 1068 1036 1004 978 957 941 938 947 965 989 1017
-116 1017 1043 1048 1029 999 974 956 939 933 951 984 1000 981 945 921 915 916 914 918 933 951 959 957 950 946 948 963 991 1021 1036 1033 1029 1040 1057 1059 1038 1010 996 995 991 971 939 910
-121 910 894 901 931 974 1010 1025 1023 1022 1035 1063 1089 1099 1082 1043 996 956 930 920 919 917 913 913 919 927 926 921 927 958 1003 1030 1018 972 917 875 860 874 912 962 1007 1040 1064
-126 1064 1086 1108 1115 1093 1040 976 931 916 921 929 941 971 1019 1060 1061 1020 970 943 947 964 976 975 962 943 923 906 899 906 926 958 991 1012 1015 1007 993 971 937 894 859
-131 859 841 828 804 771 751 758 782 803 817 836 867 901 925 930 915 881 841 817 821 838 845 839 833 836 842 845 847 849 852 860 882 916 946 961 963 959 948 926 904 897 906 920 933
-136 933 950 968 979 977 973 972 964 941 907 873 842 816 805 822 855 878 879 871 871 872 864 852 860 893 930 949 953 959 975 990 995 988 974 958 940 923 911 906 903 898 885 872 871 892
-141 892 928 958 971 970 970 979 996 1016 1033 1046 1048 1034 1005 978 968 977 986 982 963 945 936 944 973 1013 1045 1054 1048 1049 1063 1075 1071 1052 1024 988 945 906 880 862 843 821 807
-146 807 813 847 910 994 1077 1136 1165 1166 1145 1109 1069 1038 1023 1017 1018 1027 1044 1059 1058 1034 996 957 931 922 926 940 957 972 980 985 988 990 990 990 999 1011 1012 998 982 974 962 937 907
-152I07j1RPqj2MK1L0K9J7mk4k4mJ3Rnj2r%PQNjn%NOLpk0k8k1kJ5J4jj5j7rkJLJ6L5M5L4J5
-157A017QJ9K8K1Oqj7l1l9l1j6rj0p%OKljOJ2J8K2J5lk1k7k4k3j8nRJ3J0J0J5J0KlJjrpL%
-163I40k4m4k5J4L1J1j2j3KJ2J4J6J7J1MJlj2j9j6rl%OJ0LmMK8M7N0M4K6ll7m7k5J4L8L7K0
-168A104nk3k6j6oJMJ1Rlj4rLR%j4k2k2j2MJ1Nj0j9j7j2rkJ3K5K5Qj1j8pJ1J9J5PNNKqj9k8
-173I64k6j0J4K7J6lj4k0k7l0j4J9M0L5J3j2k9l2j4J6L5K8J4J2K1J9PkkklMJ8K5J7Mlj2k9
-178A064l9k6OL4L6J7ok3k8k1rmqoJ3L5L1mm3n4m0k0pMJ7K2K1J5Qpk7k9rJ1Qj1k1j4njRK0
-183I09K0NoMK0J8KqkJ2J5J0Klnmkmmmoj0j8j7rPK4L3L1J7N%NJ3J1%j5k7k6j7pnnnoqj1lQ
-189I34J3Rjqj3j3nJ0K1J8Kj4k1j7qJRJ7K2K5J8Kj8k6j8MK2K0Opj1j2k3l5l6k5j7j4JK2K9
$$ plain form
-152 907 896 905 912 904 892 896 917 947 976 993 989 965 941 937 950 959 954 942 933 933 940 948 953 952 947 947 952 958 961 954 934 906 885 883 898 912 911 896 879 870 868 869 872 888 923 968 1002 1017
-157 1017 1025 1044 1072 1093 1099 1091 1074 1043 1004 973 957 948 938 931 931 937 939 936 935 941 953 971 993 1008 1005 984 957 933 910 892 887 896 909 919 929 944 954 956 953 954 953 944 937 940 940
-163 940 916 872 847 861 892 903 891 878 880 892 906 922 939 950 954 955 952 940 921 905 896 893 893 899 909 912 908 912 940 987 1037 1081 1107 1104 1067 1020 995 1009 1047 1084 1104
-168 1104 1099 1076 1050 1034 1028 1029 1033 1044 1053 1050 1036 1027 1030 1039 1039 1025 1003 981 969 973 984 989 979 960 943 931 922 920 933 958 983 991 980 962 955 966 985 1000 1007 1012 1017 1019 1011 992 964
-173 964 938 928 942 969 985 982 968 948 921 891 877 896 936 971 984 972 943 911 897 913 948 976 990 1002 1023 1042 1049 1047 1045 1043 1040 1044 1062 1087 1104 1108 1105 1093 1064
-178 1064 1025 999 1005 1039 1075 1092 1086 1063 1035 1014 1005 1001 993 987 1000 1035 1066 1062 1019 965 925 905 898 902 919 941 962 977 985 978 951 922 913 924 932 921 900 886 881 880 889 909
-183 909 929 934 928 932 952 970 972 964 962 974 989 999 1001 998 993 989 987 983 979 975 969 959 941 924 915 922 946 979 1010 1027 1032 1032 1037 1050 1061 1061 1046 1019 993 976 969 964 959 954 948 940 929 926 934
-189 934 947 956 955 947 934 921 916 926 947 965 967 953 932 915 907 908 917 934 956 981 999 1001 983 957 939 943 965 985 991 984 973 961 938 903 867 842 825 811 812 834 863
-194H63Pj8j2L1O9O2J5l0l3lK3J5j6l0j6%lj3pQJl0n0l5nRORJ7J9J7J8K3Rk0m0k6J1M4N2M0
-199I81J3j3k2j0J3K1Qj3j7nPMorm%RK7M7M3J0k3k9j5jOROj3l2k9lJ4Lj4k1k7m4n2k7K0M7
-204H59M0K1J5K3L4L6K8Pj8l0k2j2j1j4pOJ9K8L3K6Rqj8j7j0LJ4J4lk1k6j6pomknj4j3%QL
-210I42oJJ7K1J1MJ2K6K9K0QJnj1j5j4j3j0plmnj0j8k9l5k1PK7J6j1j7J1M4M5J7olJ0Rnj0
-215A020jJ5J9J0qk0k3j8qPJ9K5K0Ooqlok1m1m3j8J8L7J9j2k5j1NJ0J1J9K6J8%j0mO%j8l4
-220I72l4rK3L8J7j7l8l3k4j5ML5N8N0K0qj4qljkKJ5K6K3Kj5j2NRok5l1k9l1l1j8QL3M4M3
-225A023L8K2rm2n3l0QK4J1pj1prj8k3k4k3j6JK1K3MqKK3L1K6J7J4J5J0Jrk0k4j9lPKj7k7
-230I24j4J3L1K8J3jqmOJ8K4J4nk2l1k7kL4N2L5Jj1lkk2l8l3k4l3m8m2j1J9L6M1M0K6NlQK5
$$ plain form
-194 863 870 852 840 871 940 1002 1017 987 954 951 974 989 973 943 927 927 924 911 904 912 913 883 833 798 793 802 808 817 834 853 870 888 911 920 900 860 834 845 889 941 981
-199 981 994 981 959 949 962 983 991 978 961 956 963 967 961 952 948 948 957 984 1031 1074 1084 1061 1032 1017 1016 1022 1031 1037 1024 992 963 960 974 977 963 942 915 871 819 792 812 859
-204 859 899 920 935 958 992 1028 1056 1063 1045 1015 993 981 970 956 949 955 974 1002 1035 1061 1070 1062 1044 1027 1017 1020 1034 1048 1045 1024 998 982 975 969 965 963 958 944 931 931 939 942
-210 942 936 937 954 975 986 990 1002 1028 1057 1077 1085 1086 1081 1070 1055 1041 1028 1018 1011 1008 1004 999 989 971 942 907 886 893 920 936 925 908 919 963 1008 1025 1019 1016 1026 1035 1030 1020
-215 1020 1019 1034 1053 1063 1055 1035 1012 994 986 993 1012 1037 1057 1063 1057 1049 1046 1040 1019 978 935 917 935 972 991 979 954 943 948 958 969 988 1014 1032 1032 1022 1018 1024 1024 1006 972
-220 972 938 929 952 990 1007 990 952 919 895 880 884 919 977 1027 1047 1039 1025 1017 1014 1013 1011 1013 1028 1054 1077 1079 1064 1052 1057 1066 1060 1035 1004 975 944 913 895 903 936 980 1023
-225 1023 1061 1083 1074 1032 979 949 957 981 992 985 974 967 958 940 917 893 870 854 855 876 899 903 895 897 920 951 977 994 1008 1023 1033 1034 1025 1005 981 962 959 966 968 951 924
-230 924 910 923 954 982 995 994 986 982 988 1006 1030 1044 1039 1017 986 959 957 991 1043 1078 1079 1068 1065 1063 1041 1003 970 946 913 865 823 812 831 867 908 948 974 979 976 984 1009
-235A009L2K0LpnJkj4j9j0nj8l4l1j1krj3lLllJ6L5L4J2pj3j9k9l8l7k4kK0K8K4J7J9K4K1
-240I60J5Pkj3k1k3j9j7j2KJ4J2L%MNNLLjkNJ0ol5n0m0k4j8j2J1M0N3M6L1K0J2jj8k5k0mP
-245I05Jj5k1j1joj6j7kJ9L2L4K0kk3l2l1k5j0J2K9K6J0LJ2J7Mj2j4jLrk0j0J3K3J0rrPK3
-250I07K6K0J3NkKJ1J2kj5j3pj4l3m2l2k2j6mK2M1M0K8K1K0Rrj6%K3L2J6qj9j3NJ6J6J0QJ4
-255A050J4Mj3k0rRJ5Npnpk1m0m0j7KQMmj7k9k3KJ7Oj1JK7L6K5J1Mj1l1k7NL9M6K4rl5m3l1
-260I04j1qk4k8lK8L3J1qrjQJ7J7MqmJ3J6Jj6j8rkMJ0J2QLLKnqm%nj3j1JPjj4j9j1%PJ2J5
-266H96K0J7J0J1K7L8K3j7m6l4jJ7J5J4J7Rj4l2l3k7k8k8j5rk1k9mL8N5M0K5L2L9J8j2j9p
-271I85Kj%Lkj1j4rj1j4oJ2J7L%J6K1ol4k8nlk3l2j4Klj4j4j0qmNR%nNJ8J9J6J7J3nj7kL3
$$ plain form
-235 1009 1041 1061 1064 1057 1052 1053 1051 1037 1018 1008 1003 985 951 920 909 907 898 885 882 885 882 879 895 930 964 976 969 956 937 908 870 833 809 807 827 855 879 896 915 939 960
-240 960 975 982 980 967 946 923 904 887 875 877 891 903 906 906 910 915 920 923 926 925 923 928 938 932 897 847 807 783 765 753 764 804 857 903 934 954 966 965 947 922 902 898 905
-245 905 906 891 870 859 858 852 836 819 817 836 868 902 922 920 897 865 834 809 799 811 840 866 876 879 891 908 912 900 886 885 888 879 859 849 862 885 895 886 877 884 907
-250 907 933 953 966 971 969 971 982 994 992 977 964 957 943 910 868 836 814 798 794 816 857 897 925 946 966 975 966 950 950 973 1005 1021 1013 994 981 986 1002 1018 1028 1036 1050
-255 1050 1064 1068 1055 1035 1026 1035 1050 1055 1048 1043 1036 1015 975 935 918 920 928 932 928 911 882 859 861 878 884 873 874 901 937 962 973 977 966 935 908 913 952 998 1022 1013 978 935 904
-260 904 893 885 861 833 830 858 891 902 894 885 884 892 909 926 930 922 918 931 947 948 932 914 905 903 907 917 929 937 940 943 945 940 932 928 928 923 910 899 900 907 906 892 873 862 862 869 881 896
-266 896 916 933 943 954 981 1019 1042 1025 979 945 944 961 976 990 1007 1016 1002 970 937 910 882 854 839 830 809 780 776 814 869 909 934 966 1005 1023 1011 992 985
-271 985 987 986 986 989 987 976 962 953 942 928 922 934 951 954 954 970 991 985 951 923 918 915 892 860 846 848 845 831 817 807 799 795 800 809 809 804 809 827 846 862 879 892 887 870 868 901
-276I01M8L4Oj8l5l8k0KNj2j9jJ8J0j6k5j5%QJ5K3J8Kj0lQJ1POQN%%%nj7k9k9j8lKkpkJ0J6
-282H39Q%QK0J6mj7jL3N2M1J2qj2opj7k5k2j1pj1j7j4kOOjqj5j9j8j2lQK0L1L7L3J8Jj1j7
-287I04j7k4l0k8j1KJrnJ7M4N5M7K2ql0l5k0OK9L8K6ml6m8l4oJ6K5J9Kj4j5jMrk6k2PL3L4
-292H99J3kJJ7K2J0qj8j9j7j9k7l5l9l4j3J4L2M0M4M6M0J9kj3r%QJ5K0J4Jj4k1j7pKL%KL%
-297I51mjPOj1k8k8rJ1K1J4mk4k5j3lprjPJrj4k1l0k5LL5L8K5K0K4Rk0l2j2J2J6QO%j3j7j
-303H53J5J1JOJ8J3nj7j3%J3K5K8J8Lqj6k4k0KJ8Oj5j2J1J4oj9JL2M4L5K2J0ok1k1oQQlj2
-308I91j2rj3k4k5j6rj5k4k4j6rjRJ1mk1k0JJ6J9J6J6J3MjjkjNQjrPL5L8Rj9k2j4j7j7LK4
-313H79K0mk0k3k5k8j8NJ8J2%kRK9L9L6K4J5Jk3m8m4j4Lj2k7kL8M9K5PNOjMK2K7Lk5l4l4m1
$$ plain form
-276 901 949 983 989 971 936 898 878 880 885 873 854 853 871 881 865 840 825 825 833 848 871 889 891 881 878 886 897 904 910 918 923 923 923 923 918 901 872 843 825 822 824 822 815 813 823 839
-282 839 847 847 855 875 891 887 870 869 902 954 995 1007 999 987 981 974 957 932 910 899 892 881 864 850 848 854 860 859 851 836 817 799 787 784 792 812 843 880 913 931 932 921 904
-287 904 887 863 833 805 794 796 797 788 783 800 844 899 946 968 960 930 895 875 881 910 948 974 970 934 886 852 846 862 887 906 908 894 879 878 882 873 847 825 832 865 899
-292 899 912 910 911 928 950 960 952 934 915 898 879 852 817 778 744 731 745 777 817 861 907 947 966 964 951 942 942 950 965 985 999 1000 986 965 948 941 943 946 946 948 951 951
-297 951 947 946 953 959 948 920 892 883 894 915 929 925 901 876 863 860 853 844 843 850 851 842 828 807 777 752 755 790 828 853 873 897 906 886 854 842 854 870 878 884 884 871 854 853
-303 853 868 879 880 886 904 917 912 895 882 882 895 920 948 966 969 961 945 921 901 903 921 927 912 900 911 925 919 900 901 933 977 1012 1034 1044 1038 1017 996 990 998 1006 1003 991
-308 991 979 970 957 933 908 892 883 868 844 820 804 795 794 803 814 810 789 769 770 786 805 821 837 850 854 853 852 850 849 854 862 861 852 859 894 932 941 922 900 886 869 852 855 879
-313 879 899 895 875 852 827 799 781 786 804 816 816 814 823 852 891 927 951 966 967 944 896 852 838 841 829 802 800 838 887 912 919 924 930 929 933 955 982 985 960 926 892 851
-318H51m2k7qrj7j2NR%%J8L2K9K0K0K4J5jmJ2K0Mk0j7J4M5M3J7qj7k1l0l5l0j9j1nNJ5K0J6
-323I01RMNQJ0PKmj3k6l2k4nJ5K7K6J3ok1k2j5j2j1oKRPJpj4j7qMQ%%J9M3M7K8ml2m6l4kK4
-329H58K2pl3k7OM2N5M1J4nrLJ5J7Kj4j8j0pj6k5k0jJ1J6J5Qj0k5k2jOj1k7j7J7M3M8L4J0
-334I78j1j5LK3K3Kk0k5j1Kjk1l9k9KK6K2Lj0j0j3j5j0JRJ1RLpj6j2lnj1oJ4L0L2K8K7L1K1
-339A010%k3l0j8kJj1j1J4M6N2K3j1k9l1k4j0KOLQJ5J4%j1pKKnqj4k0j9j1qj6j8lJ2Pj4k6
-344H37k3j9k1j9lJ7K7K2Rqj5pJ1K3K2J4Ook5l9l1pJ3J3%mMJ4J2PJ0K1K1J1LJ2K7L3L1K8J8
-349A039lk9m0l4k2rQK8L8K5Mj2k3l5l9k7JK0Rk0m1m1k8j5JK2M0M2K8QmnNJ8K6J9Lrj1j1j4
-354I12j4ploj3j4j0o%J0J2KroMNj0j7JK6L5J5j1j8JK5K7Oj3qKlj8j9jJ4J2NMlk0l5l8l2k6
$$ plain form
-318 851 809 782 774 765 748 736 741 750 750 750 768 800 829 849 869 893 908 907 903 915 935 939 919 902 916 961 1004 1021 1013 996 975 945 910 880 861 850 845 850 865 885 901
-323 901 910 914 919 927 937 944 946 942 929 903 871 847 842 857 884 910 923 917 896 874 859 847 836 830 832 841 848 849 842 828 811 803 807 815 815 815 834 877 924 952 948 916 870 836 834 858
-329 858 880 873 840 813 819 861 916 957 971 966 957 960 975 992 994 980 962 952 945 929 904 884 883 894 910 925 933 923 898 876 875 881 870 843 826 843 886 934 968 978
-334 978 967 952 955 978 1001 1003 983 958 947 949 948 927 888 859 861 887 909 912 902 892 879 864 854 855 864 875 884 887 880 864 852 849 844 833 827 841 871 903 931 958 989 1010
-339 1010 1010 987 957 939 937 938 927 916 930 976 1028 1051 1040 1011 980 956 946 948 954 957 965 980 994 994 983 976 978 980 975 967 953 933 914 903 895 879 861 858 870 877 863 837
-344 837 814 795 774 755 752 769 796 818 827 819 804 797 808 831 853 867 873 867 842 803 772 765 778 791 791 787 791 805 817 824 834 855 876 887 890 902 929 962 993 1021 1039
-349 1039 1036 1007 967 933 911 902 910 938 976 1001 1005 993 970 935 896 869 870 890 899 879 838 797 769 754 755 777 817 859 887 895 891 886 891 909 935 954 957 948 937 926 912
-354 912 898 891 888 882 869 855 845 839 839 849 861 863 854 848 852 857 847 830 831 857 892 907 896 878 879 904 931 937 924 916 918 915 897 878 877 891 903 908 912 909 889 854 816 784 758
-360G58j4RK6K8K7M3P0P2L6j3m2m2k6j5qlNJ3Rj3m1n0l3kK1K7K2J3QJ3K3L0L8M4M6L5J8Kq
-365A126k3m2n4n1l8k4oQJ0Km%Npk3k4j4j3k4k5JL5N0L9J8nk1k6j9qmJJ2K8K9J0j3k2j5lJ2
-370H78K5K5Qj5k9k3lJ6J4mk8l2j0K4L9K5pl1k8lK0K5J4PJ2J5%k3l0j9pnrj1j5k1k1j6j0r
-374G38jJ3K1J9J9K4K5Rqj2kMJkJkojJ9L2K8J1KNJ3J6J4Omppqj8k8k5j5rj3j7j7j7k1k0qJ1
-380G63K4K4K1K4L6M1K9Oj6k6k5j9j8k0k2j5JJ5J9J8J3Poj8j7mJ0J2Jj8l1k6jJ7Nk3k6PL6
-385G98K7mj7mOMkmj3l0l1pK3L6L3K6J8Nj1k0k4k6k1j3kNJ4K0J3j0k6k1nLMJ1J8J4kj1kJ6
-390G88K5K3J6J0OJoj3j2PK8K8RpnRJ2%j6k2k0k1k6k2RM8O3L6kj4NK0J4jj5l1m7m8k5LJ5R
-395H31pk8m6l5PM7M5J8LJ0J3mj8j1OJ1NOJ4K0J5%k4m6n4l8j1PRMNJ4K3K4J5jj4j8j7j1KK1
$$ plain form
-360 758 744 753 779 807 834 877 947 1019 1055 1042 1000 958 932 917 909 906 911 924 933 920 879 829 796 794 815 842 864 877 885 898 921 951 989 1033 1079 1114 1132 1134 1126
-365 1126 1103 1061 1007 956 918 894 888 896 906 908 904 904 909 902 879 855 841 828 804 779 780 815 865 904 922 917 896 870 851 843 839 840 852 880 909 919 906 884 869 866 878
-370 878 903 928 936 921 892 869 866 882 896 892 864 832 822 846 885 910 903 872 844 841 861 886 900 907 919 934 934 911 881 862 855 850 841 830 815 794 773 757 747 738
-374 738 737 750 771 790 809 833 858 867 859 847 845 849 850 848 849 847 841 840 859 891 919 930 932 937 950 966 980 986 982 975 968 960 942 914 889 874 865 852 835 818 801 780 760 752 763
-380 763 787 811 832 856 892 933 962 968 952 926 901 882 864 844 822 807 808 823 842 860 873 880 874 856 839 835 845 857 858 840 809 783 782 799 804 781 755 762 798
-385 798 825 821 804 800 806 810 808 804 791 761 730 723 746 782 815 841 859 864 853 833 809 783 762 749 747 752 766 786 799 789 763 742 737 740 744 755 773 787 785 774 772 788
-390 788 813 836 852 862 868 869 863 850 838 845 873 901 910 903 898 907 919 919 903 881 861 840 814 792 801 849 912 948 946 932 937 957 971 970 955 924 877 829 804 807 822 831
-395 831 824 796 750 715 722 769 814 832 835 845 858 854 836 825 831 842 847 853 867 887 902 902 878 832 778 740 729 736 745 749 754 768 791 815 830 829 815 797 780 769 771 792
-400G92L0K4PjOJ1jk5l8k4%J3J0MLjqj2mLmk0k6j6opj3pQL1M9N9M9K5Jj4k2k8k2nJ2J2lk0
-405H22l0k8j2J2L0L2J5qk6k8qJ8L3L4K5J8J1Jj4l0m1l8j4J3K1Nj7k1j4pjRJ2MjJ7M1L7Nl0
-410H47l7j8J0L0K8Kk8m0k5kJ8L3L8K2j1k7j1J3J1j2k2jL1M6L8J8PJ9L7L3%l4l7j5kj2k3k1
-415I03j3j3k0j5kQJ2J2J0kj9l0j9RK8J9j4m4m6k5kJ0J9L0L7L5K7K0J2%j4j8r%kkJ0K4K4O
-420I46pmQJ4RQJ0Kj5l0l5l4l6l6k2%RMkJ0L0L6K0jkJ1J8Rnj1qj1j8k3k0j3nOJ8K1J3Lnj3
-425H49l3n3n4k7J3L7L5K0J3J3Pqk0j2JNmnPJ9J5MlnlkPJ4J5Onj1r%QJ2J3J6J4Lo%J7J6rl7
-431H73m0k0%J0J5J0Kn%OJj3k2k1j9j3NK8L8L0J0j1k6k4%K7K7%k5k8j6qnNK1L3L5J9j0l7l6
-436H16rJ8K3J3J1J3%k2l0rK3L6K6Qnj6k2j8kJ2J0ok3k5j8j2nLPKmrj3j6j3QK8K9J3OJ0J4
$$ plain form
-400 792 822 846 853 852 858 869 868 843 805 781 781 794 804 808 811 810 802 790 786 789 785 765 739 723 717 710 697 690 698 729 778 837 886 911 912 898 876 848 826 821 833 845 842 822
-405 822 792 764 752 764 794 826 841 833 807 779 771 789 822 856 881 899 910 911 897 867 826 788 774 787 808 813 796 775 761 754 753 762 774 778 777 794 835 872 877 847
-410 847 810 792 802 832 860 862 834 794 769 767 785 818 856 878 867 840 829 842 853 841 819 818 849 895 933 951 958 977 1014 1047 1047 1013 976 961 959 947 924 903
-415 903 890 877 857 842 840 848 860 872 882 880 861 831 812 821 849 868 854 810 764 739 737 747 766 796 833 868 895 915 927 927 913 895 886 886 884 882 892 916 940 946
-420 946 939 935 943 957 966 974 984 986 971 941 906 872 836 800 778 778 787 791 789 799 829 865 885 884 882 893 911 920 915 904 896 885 867 844 824 811 806 812 830 851 864 867 862 849
-425 849 816 763 709 682 695 732 767 787 800 813 820 812 792 780 781 786 782 777 784 803 818 822 819 814 811 809 816 830 845 851 846 835 826 826 834 846 859 875 889 892 886 886 903 919 910 873
-431 873 833 813 813 823 838 848 850 845 845 851 852 839 817 796 777 764 769 797 835 865 875 864 838 814 814 841 868 868 843 815 799 791 786 791 812 845 880 899 889 852 816
-436 816 807 825 848 861 872 885 885 863 833 824 847 883 909 917 912 896 874 856 854 866 876 870 847 822 804 792 787 790 797 799 795 786 773 757 744 752 780 809 822 828 838 852
-441H52Pjkqj8j7OK8K5Jj6j6j2rkQJ4J4J3J1Loj2j7j4ML0L9K0mj3j4k6m2l2oPqk1pK0L0J9
-446H28NLNKj2k5k5j1MQMkqj7j9kK8N1M8L3J3j0l6m9l5lK5K8Rj4k3j5jRRJ3J6Qpk1k5k3j4
-452G52NK5L1K0J0J0Prk1j9qKPNnj8j8%J7J5J0K1L4L0J7J1J3jk5l8k7j1qqlMNMLlq%J9K8R
-457H84j8k2nJ4J4nk5l2j5J1K2Qj2k0j2pj7l4l6rL3N8M7Ok7l6l0k8k5j3OK0J9Q%kOJ8L1L9
-462H14L7J8j3l8l0LL2L0J0oj6l1m7m0qJ5J2mlJ7L1K9J3j0l3m5k7J5M5L5kk6j3J5K9J8kj5
-467H09k0j4lOPOJ0J5J2MKNKpj3nLN%oqro%PQJ0J4J3jj7j9j1j0j7k2j7pJQJ1MmJK4M4M6L5
-473H96K3J4mk8n0o0n1k4J1M0M6L8K9K4K1J0lj1j4k0l0l4k4%J4Rrj6qNJ0QOJj0j6j1KJ1J8
-477H13K6K9J1j7k6pJ8K4J2OJ2J7J5J0RJ1Qjrj2rnmrj6j7j2lMQOjrj0lRK3L3L3J4j9m2l5j3
$$ plain form
-441 852 859 858 856 848 830 813 819 847 872 873 857 841 829 820 818 826 840 854 867 878 881 875 863 846 832 836 866 905 925 921 908 894 868 826 794 788 795 787 766 759 779 809 828
-446 828 833 836 841 843 831 806 781 770 774 782 786 784 776 759 740 738 766 817 865 898 911 901 865 816 781 778 803 831 840 826 803 788 787 796 805 818 834 842 835 814 789 766 752
-452 752 757 782 813 833 843 853 860 851 830 811 803 805 812 817 812 794 776 776 793 808 818 839 873 903 920 931 944 943 918 880 853 842 834 826 823 827 832 836 839 836 828 828 847 875 884
-457 884 866 844 839 853 867 862 837 805 790 801 823 831 819 799 787 780 763 729 693 684 717 775 822 828 801 765 735 707 682 669 675 695 714 722 722 720 726 744 775 814
-462 814 851 869 856 818 788 791 823 853 863 857 841 810 763 723 715 730 742 738 735 752 783 812 825 815 782 737 710 725 770 805 803 777 764 779 808 826 824 809
-467 809 789 775 772 778 785 791 801 816 828 832 834 839 841 834 821 816 819 824 824 818 810 801 795 795 802 810 820 834 847 846 829 810 799 789 772 750 733 726 727 735 746 750 746 747 771 815 861 896
-473 896 919 933 929 901 851 791 740 716 727 767 813 851 880 904 925 935 932 921 907 887 857 823 799 799 813 822 813 797 789 794 804 812 818 819 809 793 782 784 795 813
-477 813 839 868 879 862 836 829 847 871 883 889 901 918 933 943 952 963 971 970 961 949 940 935 931 922 906 889 877 874 878 886 892 891 882 872 869 878 901 934 967 981 962 920 885 872
-483H72kj3k4j7LJ5J2LKOJ5K0J2pk5k3rmk3l9l0LL0L4K6J3%qlJ7M0M5K7ll1m2k7KK2J4j0k5
-488H68k5j9j7j3rqj1oJ4L4L6J6j3k8k7j6mMQO%jNK0L2K7Qj3k1j9k4l4l6j9J0K9L2K9L2L5
-493H82K4jk3l1k8k4j3J0L1K6lk7l2k5j3LK6L9L8L7M2L8Rk4l2j9j8l6m6k9LK6L2J9ok7k8n
-497G95J6K3K5L5L7K3NKKj4l7m0k5j4j4j1KJ1Lj0j4mJ1J8J6KrpRJ6Oj1j1LJ3Rjllj1k5l1k1
-503G66%J3J1OJ1K5L4K9J4jj2j6j6j7k3k3qJ2J8PmnlmnkkljRJ5Qk%J1J6J3Noj9k9k3j0mjJ8
-508H02N2O6M1ll1l3l3l6k9mK1K8J6Kpj9k5j7KJ0%j4j3oj0j8oK7N1M1Pk3l1k5j2%PPLOJ7K0
-513H31Rj1k1j7qJM%j5l4m2k7omj7j7J0M2M0J3KK9N8N3J8j0j8j5oLJ1MrrNJ7J2jj0j6k2k9
-519G98l4l6k9pJ5K1Rll%rj8j0J3L1L2K1J3J5K2K6J8jk1k7j6jPOJpj9l3l5j9J2L5M1L3K5K2
$$ plain form
-483 872 870 857 833 816 819 834 846 849 851 857 872 892 904 897 872 849 840 836 813 774 744 747 777 811 837 850 850 842 839 856 896 941 968 965 934 892 865 867 889 903 893 868
-488 868 843 824 807 794 785 777 766 760 774 808 844 860 847 819 792 776 772 776 784 790 790 789 794 814 846 873 881 868 847 828 804 770 734 715 725 754 786 815 847 882
-493 882 906 905 882 851 823 799 786 796 827 853 850 823 791 766 753 756 782 821 859 896 938 976 985 961 929 910 892 856 810 781 784 810 842 861 855 828 800 795
-497 795 811 834 859 894 931 954 959 961 963 949 912 872 847 833 819 808 810 821 824 814 800 796 807 825 841 843 834 827 836 852 858 847 836 839 852 861 860 857 854 843 818 787 766
-503 766 766 779 790 796 807 832 866 895 909 908 896 880 864 847 824 801 793 805 823 830 826 821 818 814 809 807 805 802 801 810 825 833 831 831 842 858 871 876 870 851 822 799 789 785 784 802
-508 802 854 920 961 958 927 894 861 825 796 792 813 841 857 859 852 833 808 791 793 803 803 789 776 770 760 742 736 763 814 855 862 839 808 783 771 771 778 785 788 794 811 831
-513 831 840 829 808 791 783 784 788 788 773 739 697 670 664 660 643 626 636 678 718 731 733 762 820 873 891 881 863 848 842 845 856 860 851 842 847 864 876 875 865 849 827 798
-519 798 764 728 699 692 707 728 737 734 731 731 722 704 694 707 738 770 791 804 819 841 867 885 884 863 836 820 819 826 832 833 826 807 774 739 720 732 767 808 841 866 888
-524H88J4Kqoj%qk0k8k5j3loj8j9j2oj1j4oPP%LJ7K8K4J8K1L2L4J5j5l1j8J0K4J8J1J5J6L
-529I39j9k5j2loj3j7j6j6j4j4j9j8j2loj1%K5L2Ol0m0k3%J9L6M2K5qk8k4qlpjJ5L2K8J2m
-534H11mLRJ1J4J7J5Mpj0lOJ1Onj7k5k9l0k0KK5L0J3j1k8k8j6MK0K6K1K0K6K4PrqKjj6k5j1
-539H24J0J8Mj4k0kK8M4K2k2n0m3j7%lrnQJ7RmoJ3L4L1Lk7m2m2l9l2j9mMRJ8L1L7L8L8L4J9
-544H93j0l1l2j4LJ0Omj0j4j1kJ2K5K9K0NopprrjRJ3J1J7L5L9J0m0p2o1k6MJ6J7J0lj2j2K
-549G93K0L3K8Ml2m6k4J3L2K8K9M2M5J9k3m4m2l2k7k3j8j7k0j4jNrk2rK3M2L1Pj0k0l1l5j0
-554F85L7P4P4N0L7L1J5j6l5k6j1rj0jQol3m6l2k2k9l5k0NJ5ROJ6K3J5ok0j6NK7L2J2j3j5
-559G75MJ4%k3k2KK4J9kk2k8k8k3qQJ8J6J2J1Kj5k5j8rj5k3j1K6N2N0L2K2J6jk2k5qNLqj3
$$ plain form
-524 888 902 904 896 890 889 889 881 861 833 808 795 792 786 768 749 737 731 720 706 700 707 714 714 717 734 762 786 804 825 857 891 906 891 860 842 852 876 894 905 920 936 939
-529 939 920 895 883 880 874 861 844 828 812 798 784 765 747 735 732 726 715 715 740 772 778 748 708 685 685 704 740 782 807 799 771 747 739 736 729 728 743 775 803 815 811
-534 811 807 810 819 830 844 861 876 880 873 863 860 866 877 883 878 861 836 807 777 757 759 784 814 827 816 788 760 744 748 768 794 815 835 861 885 892 883 875 877 876 860 835 824
-539 824 834 852 856 842 822 820 848 892 914 892 842 799 782 782 779 770 765 773 790 799 795 789 802 836 867 870 843 801 759 720 688 669 665 669 678 696 727 764 802 840 874 893
-544 893 883 852 820 806 809 819 825 821 811 797 786 784 796 821 850 870 875 869 862 855 846 837 836 845 858 869 886 921 960 970 930 858 797 771 775 791 808 818 815 803 791 793
-549 793 813 846 874 878 846 800 776 789 821 849 878 920 965 984 961 917 875 843 816 793 775 758 738 724 723 728 719 697 688 711 753 784 791 781 761 730 695 685
-554 685 722 796 870 920 957 988 1003 987 952 926 915 906 896 895 903 897 864 818 786 764 735 700 680 685 700 709 715 731 754 769 763 743 727 732 759 791 803 790 775
-559 775 779 793 793 770 748 750 774 793 791 769 741 713 690 682 690 708 724 736 747 749 734 709 691 682 667 644 633 659 711 761 793 815 831 830 808 783 775 780 783 775 762
-564G62j6k7m3m6k7%J7K1K2K9L3K5MqjJ8K4J4lj1nKQJ0Pjj3j8j1NJ4J0Jpqj0j3j1lKPJ6K5
-569G94K1Lj2oJ2K3K3K1J5ml0m4l6j9qpmJOJ0Plj0mJ2J8Qqj4j2j3j1jJ3K1K8L5L3J0k0l2j8
$$ plain form
-564 762 746 719 676 630 603 603 620 641 663 692 725 750 754 746 745 763 787 801 798 787 782 784 792 802 809 808 795 777 766 771 785 795 796 789 781 771 758 747 744 746 753 769 794
-569 794 815 818 806 800 812 835 858 879 894 890 860 816 780 761 753 746 742 743 749 759 766 763 753 749 761 779 787 779 765 753 740 729 728 741 762 790 825 858 868 848 816 798
$$ [...]
-1604F99
##END=	
##END=	
