##TITLE=	+3Z390YqR86JeR5Scu8LQA.122.ser
TM-VI-124 Zr+ph-prraz. hmbc

##JCAMP-DX=	6.0	$$ MestReNova 14.3.0-30573
##DATA TYPE=	LINK
##BLOCK_ID=	1
##BLOCKS=	2    
##ORIGIN=	Mestrelab Research S.L.
##OWNER=	hrzepa
##$MNOVA/LINK_BLOCK_TYPE=	ITEM	$$ NMR Spectrum
##$MNOVA/ITEM/POLYGON=	(XY..XY)
5321,5835
8722,5835
8722,8208
5321,8208
5321,5835
##$MNOVA/ITEM/Z=	0
##$MNOVA/ITEM/ANGLE=	0
##TITLE=	+3Z390YqR86JeR5Scu8LQA.122.ser
##JCAMP-DX=	6.0	$$ MestReNova 14.3.0-30573
##BLOCK_ID=	2
##DATA TYPE=	MNOVA NMR VIEW DATA
##DATA CLASS=	MNOVA VIEW DATA
##$MNOVA/2D/THRESHOLD=	3.0924835205078125
##$MNOVA/ITEM/ZOOM/X=	-0.47501081208716700033,	14.504330000039219684
##$MNOVA/ITEM/ZOOM/Y=	-9.5107036222489718114,	249.98529999918474687
##END=	
##TITLE=	+3Z390YqR86JeR5Scu8LQA.122.ser
##JCAMP-DX=	6.0	$$ MestReNova 14.3.0-30573
##BLOCK_ID=	3
##DATA TYPE=	nD NMR SPECTRUM
##DATA CLASS=	NTUPLES
##NUMDIM=	2
##ORIGIN=	Bruker BioSpin GmbH
##OWNER=	nmr
##.OBSERVE FREQUENCY=	400.41280287000000726
##.OBSERVE NUCLEUS=	^1H
##.SOLVENT NAME=	Acetone
##.PULSE SEQUENCE=	hmbcgplpndqf
##LONGDATE=	2021/10/21 02:27:05.000
##.ACQUISITIONMODE=	SIMULTANEOUS (DQD)
##$ORIGINAL FORMAT=	Bruker XWIN-NMR
##$MNOVA/SCALES_VERSION=	9
##$PARAMETER FILE=	(acqu2s, ASCII, /private/var/folders/f6/rjf_tdyn2v98c5c0wvkgn4s80000gn/T/+3Z390YqR86JeR5Scu8LQA/122/acqu2s, 0)
$$ ##TITLE= Parameter file, TOPSPIN		Version 3.2
$$ ##JCAMPDX= 5.0
$$ ##DATATYPE= Parameter Values
$$ ##NPOINTS= 129	$$ modification sequence number
$$ ##ORIGIN= Bruker BioSpin GmbH
$$ ##OWNER= nmr
$$ $$ 2021-10-21 02:46:41.534 +0100  nmr@CZC10666PP
$$ $$ /opt/topspin/data/agmb/nmr/Oct20-2021/122/acqu2s
$$ $$ process /opt/topspin3.2/prog/mod/go
$$ ##$ACQT0= 0
$$ ##$BF1= 100.683175
$$ ##$FnMODE= 1
$$ ##$NUC1= <13C>
$$ ##$NusJSP= 0
$$ ##$NusT2= 1
$$ ##$NusTD= 128
$$ ##$O1= 12080.308799824
$$ ##$SFO1= 100.6952553088
$$ ##$SW= 259.972631192251
$$ ##$SW_h= 26178.0104712042
$$ ##$TD= 128
$$ ##END=
$$ 
##$PARAMETER FILE=	(acqus, ASCII, /private/var/folders/f6/rjf_tdyn2v98c5c0wvkgn4s80000gn/T/+3Z390YqR86JeR5Scu8LQA/122/acqus, 0)
$$ ##TITLE= Parameter file, TOPSPIN		Version 3.2
$$ ##JCAMPDX= 5.0
$$ ##DATATYPE= Parameter Values
$$ ##NPOINTS= 12	$$ modification sequence number
$$ ##ORIGIN= Bruker BioSpin GmbH
$$ ##OWNER= nmr
$$ $$ 2021-10-21 02:46:46.091 +0100  nmr@CZC10666PP
$$ $$ /opt/topspin/data/agmb/nmr/Oct20-2021/122/acqus
$$ $$ process /opt/topspin3.2/prog/mod/shimcntl
$$ ##$ACQT0= 1000000
$$ ##$AMP= (0..31)
$$ 100 100 100 100 100 100 100 100 100 100 100 100 100 100 100 100 100 100
$$ 100 100 100 100 100 100 100 100 100 100 100 100 100 100
$$ ##$AMPCOIL= (0..19)
$$ 0 0 0 0 0 0 0 0 0 0 0 0 0 0 0 0 0 0 0 0
$$ ##$ANAVPT= -1
$$ ##$AQSEQ= 0
$$ ##$AQ_mod= 3
$$ ##$AUNM= <au_zg>
$$ ##$AUTOPOS= <59 >
$$ ##$BF1= 400.41
$$ ##$BF2= 100.683175
$$ ##$BF3= 400.41
$$ ##$BF4= 400.41
$$ ##$BF5= 400.41
$$ ##$BF6= 400.41
$$ ##$BF7= 400.41
$$ ##$BF8= 400.41
$$ ##$BYTORDA= 0
$$ ##$CAGPARS= (0..11)
$$ 0 0 0 0 0 0 0 0 0 0 0 0
$$ ##$CFDGTYP= 0
$$ ##$CFRGTYP= 9
$$ [...]
$$ 0 0 0 0
$$ ##$ShimPowMaxUC= (0..63)
$$ 130000 130000 130000 130000 130000 130000 130000 130000 130000 130000 130000
$$ 130000 130000 130000 130000 130000 130000 130000 130000 130000 0 0 0 0
$$ 0 0 0 0 0 0 0 0 0 0 0 0 0 0 0 0 0 0 0 0 0 0 0 0 0 0 0 0 0 0 0 0 0 0 0 0
$$ 0 0 0 0
$$ ##$ShimPowMaxUG= (0..63)
$$ 524287 524287 524287 524287 524287 524287 524287 524287 524287 524287 524287
$$ 524287 524287 524287 524287 524287 524287 524287 524287 524287 0 0 0 0
$$ 0 0 0 0 0 0 0 0 0 0 0 0 0 0 0 0 0 0 0 0 0 0 0 0 0 0 0 0 0 0 0 0 0 0 0 0
$$ 0 0 0 0
$$ ##$ShimPowRcbType= 3
$$ ##$ShimPowRes= (0..63)
$$ 1e-20 1e-20 1e-20 1e-20 1e-20 1e-20 1e-20 1e-20 1e-20 1e-20 1e-20 1e-20
$$ 1e-20 1e-20 1e-20 1e-20 1e-20 1e-20 1e-20 1e-20 0 0 0 0 0 0 0 0 0 0 0 0
$$ 0 0 0 0 0 0 0 0 0 0 0 0 0 0 0 0 0 0 0 0 0 0 0 0 0 0 0 0 0 0 0 0
$$ ##$ShimPowRng0= (0..63)
$$ 1 1 1 1 1 1 1 1 1 1 1 1 1 1 1 1 1 1 1 1 0 0 0 0 0 0 0 0 0 0 0 0 0 0 0 0
$$ 0 0 0 0 0 0 0 0 0 0 0 0 0 0 0 0 0 0 0 0 0 0 0 0 0 0 0 0
$$ ##$ShimPowRng1= (0..63)
$$ 1 1 1 1 1 1 1 1 1 1 1 1 1 1 1 1 1 1 1 1 0 0 0 0 0 0 0 0 0 0 0 0 0 0 0 0
$$ 0 0 0 0 0 0 0 0 0 0 0 0 0 0 0 0 0 0 0 0 0 0 0 0 0 0 0 0
$$ ##$ShimPowRng2= (0..63)
$$ 1 1 1 1 1 1 1 1 1 1 1 1 1 1 1 1 1 1 1 1 0 0 0 0 0 0 0 0 0 0 0 0 0 0 0 0
$$ 0 0 0 0 0 0 0 0 0 0 0 0 0 0 0 0 0 0 0 0 0 0 0 0 0 0 0 0
$$ ##$ShimPowRng3= (0..63)
$$ 1 1 1 1 1 1 1 1 1 1 1 1 1 1 1 1 1 1 1 1 0 0 0 0 0 0 0 0 0 0 0 0 0 0 0 0
$$ 0 0 0 0 0 0 0 0 0 0 0 0 0 0 0 0 0 0 0 0 0 0 0 0 0 0 0 0
$$ ##$ShimSysFunc= (0..63)
$$ 1 2 3 4 5 7 9 11 15 16 8 10 12 14 6 17 13 18 19 20 0 0 0 0 0 0 0 0 0 0
$$ 0 0 0 0 0 0 0 0 0 0 0 0 0 0 0 0 0 0 0 0 0 0 0 0 0 0 0 0 0 0 0 0 0 0
$$ ##$ShimSysMatrix= 0
$$ ##$ShimSysType= 1
$$ ##$TFXNUM= 0
$$ ##$TRIPLO2= 0
$$ ##$VTU= 2
$$ ##$VTUETH= <149.236.99.20>
$$ ##$VTUTY= <no>
$$ ##$WBREFAM= (0..15)
$$ 135 116 100 100 100 100 100 100 100 100 100 100 100 100 100 100
$$ ##$WBREFLM= (0..15)
$$ 0 0 0 0 0 0 0 0 0 0 0 0 0 0 0 0
$$ ##$WBREFPH= (0..15)
$$ 71.66 -68.25 0 0 0 0 0 0 0 0 0 0 0 0 0 0
$$ ##$WBSGU= (0..15)
$$ 0 0 0 0 0 0 0 0 0 0 0 0 0 0 0 0
$$ ##$XFAC= 2
$$ ##END=
$$ 
##$DECIM=	3328
##$DSPFVS=	20
##.ACQUISITIONSCHEME=	NOT PHASESENSITIVE
##NTUPLES=	nD NMR SPECTRUM
##VAR_NAME=	FREQUENCY1,	FREQUENCY2,	SPECTRUM
##SYMBOL=	F1,	F2,	Y
##.NUCLEUS=	13C,	1H
##.OBSERVE FREQUENCY=	100.69525530880000019,	400.41280287000000726
##VAR_TYPE=	INDEPENDENT,	INDEPENDENT,	DEPENDENT
##VAR_FORM=	AFFN,	AFFN,	ASDF
##VAR_DIM=	512,	512,	262144
##UNITS=	HZ,	HZ,	ARBITRARY UNITS
##FIRST=	25169.313707327481097,	5807.6787752999953227,	0.28329670429229736328
##LAST=	-957.56783717514929322,	-190.19907926730809322,	0.54172718524932861328
##MIN=	-957.56783717514929322,	-190.19907926730809322,	0.00070707767736166715622
##MAX=	25169.313707327481097,	5807.6787752999953227,	15.603086471557617188
##FACTOR=	1,	1,	0.00299289097733889016
##PAGE=	F1=25169.3
##FIRST=	25169.313707327481097,	5807.6787752999953227,	0.28329670429229736328
##DATA TABLE=	(F2++(Y..Y)), PROFILE
$$ [...]
##PAGE=	F1=-10211.9
##FIRST=	25169.313707327481097,	5807.6787752999953227,	0
##DATA TABLE=	(F2++(Y..Y)), PROFILE
5808A10j2K8M9o7m2J19l9p2J40r3J22j5j73K9J50m7j35J0J1R7m5k8K1jn9Q0M5N6m4j17j2J37
5432B03j2P3j18o1l4K8j6N9l2K40j67j22J2Q9J06m8r1j2L5j5K9J19j13J91n9j58K4kl5l2L5
5068A16J80m0q1K5o2j1J02m8M1j9j61Q8J75j72o5J0pJ1J1o3J48k8l0r0J25n6k7J3PJ9l5N4
4693A30p0Q9L9J6m9P6n1O3j15R8Q4j80K0O1j23K1M7mj09Q3l1M3K3j06J48N4k8j08p1J12lj08
4317E1jL2M2M3o5o6J09Jm8n3P2m6k4K6J3RJ36K6j74O9j08Q3k1P1n9Ll2l8rJ02l6J24N5j05
3918A82M3J11j61l2K1j05QN6p5J8J9n4P7o6L6J29k0j25M7L8p7J19J16p7N2j43M2n4M2m1J05
3554B31o1L4N3pn9r7j9j9Q4q2m6M4P9Q8j39J04j4L9M6j04k8j7m8N0M3rq0R7K9j62L9n4J91
3167B06J08k16PQ0M6q6k2J2M0p3K1O3Lm1O2L6j37LjR1R8n1l3Po4LP0m1j71P6Km9J20K63j13
$$ y = [110, 98, 126, 175, 108, 66, 185, 146, 74, 214, 121, 243, 228, 55, 84, 234, 187, 52, 62, 73, 170, 125, 97, 118, 117, 58, 138, 183, 239, 195, 78, 66, 203, 191, 264, 146, 85, 51, 79, 63, 122, 90, 330, 163, 41, 53, 142, 248, 200, 109, 97, 132, 117, 146, 265, 152, 343, 284, 126, 150, 148, 113, 81, 116, 296, 256, 175, 200, 138, 127, 229, 181, 222, 203, 42, 130, 305, 133, 68, 78, 71, 82, 93, 30, 178, 150, 120, 30, 155, 99, 72, 85, 92, 111, 76, 130, 60, 149, 188, 204, 155, 231, 180, 243, 128, 226, 310, 130, 150, 211, 88, 109, 156, 152, 43, 126, 95, 138, 161, 55, 203, 257, 229, 121, 50, 162, 159, 51, 50, 82, 124, 167, 102, 36, 145, 146, 98, 45, 117, 71, 47, 73, 86, 95, 231, 257, 83, 152, 44, 127, 106, 177, 118, 121, 89, 51, 42, 144, 108, 232, 287, 182, 225, 336, 175, 143, 164, 59, 67, 123, 48, 66, 85, 31, 108, 42, 78, 207, 187, 62, 109, 147, 70, 189, 305, 228, 280, 137, 179, 125, 167, 126, 231, 170, 204, 257, 250, 191, 94, 75, 56, 140, 58, 12, 56, 135, 223, 84, 188, 174, 213, 259, 155, 127, 110, 62, 112, 155, 146, 66, 163, 192, 30, 69, 15, 206, 314, 98, 105, 185, 231, 145, 123, 135, 175, 102, 123, 186, 189, 148, 210, 246, 109, 112, 111, 202, 300, 249, 216, 223, 159, 162, 232, 191, 20, 96, 98, 49, 169, 432, 319]
2756C19k21k8J19N6j09K5J4k9M6j11O4p6Q3n3J69k05P0J93j23j90J51L5j46N3L8j6%j18J31
2416A41J35j56J1n1L8J45pM5k6j40j7L6k9N8L8j76L1K9LP2j22J03l5J06P5j98K0m8nM7ON2
2040A81j03M4N3j5p5P9J38n4j35LJ67k02j0J83j5Qk4q1o9%m4J64j31K1J18n3R4kp6j18J37
1676A83p1J75k45J46L2j32j5QP4pn0oNQ8K18j13k02K5J39J9Kp8mj05l9N6LJ25l6j17%p4J61
1289A65R3o7N9q0P5k8Jj5j32L6p3M0oJ01j6p7L2J72n9j03M5q8j6J9j1j5R7J30l5j19j6k8l8
901D3N3J49j08k5Q0K2J5j80P2J2J68j69PmNk8L4J42k0k08k4N9J0op1J41q5O7l1r3K20k00J11
514A58l3k5K4N9K9q0n9R1j33P5R8r9N3K05k13p3L5P0m8n6K21j13M0j48R2L5o0l1K7o3R7NL5
127B15j11J9m9R2q8K9J37q8j3N6Q6j24Pr0J10J07j79l4nJ64lj00L0J15Nj78m8
$$ y = [319, 98, 70, 189, 245, 136, 161, 175, 146, 192, 81, 145, 69, 152, 99, 268, 63, 133, 326, 203, 13, 164, 199, 53, 106, 144, 128, 128, 10, 141, 276, 120, 131, 80, 118, 263, 256, 301, 275, 135, 118, 154, 125, 183, 221, 45, 76, 105, 108, 180, 58, 161, 126, 232, 307, 109, 129, 81, 76, 123, 129, 181, 78, 122, 175, 160, 85, 164, 302, 248, 113, 116, 283, 81, 71, 254, 239, 247, 223, 142, 73, 73, 29, 193, 62, 83, 201, 148, 242, 240, 164, 46, 183, 112, 287, 42, 188, 220, 88, 73, 81, 155, 148, 98, 92, 97, 185, 403, 290, 88, 113, 252, 271, 273, 195, 191, 86, 47, 103, 106, 231, 195, 78, 78, 4, 165, 258, 191, 250, 170, 245, 217, 218, 203, 71, 107, 34, 74, 68, 169, 153, 76, 108, 280, 221, 118, 163, 75, 59, 78, 67, 52, 149, 279, 244, 125, 109, 81, 43, 96, 245, 137, 112, 192, 214, 229, 49, 121, 133, 301, 132, 139, 135, 140, 112, 146, 288, 268, 60, 36, 95, 105, 99, 28, 169, 84, 151, 120, 27, 247, 47, 158, 125, 100, 124, 183, 212, 132, 73, 164, 31, 106, 204, 105, 158, 363, 150, 77, 112, 182, 134, 78, 299, 186, 226, 78, 170, 205, 145, 114, 141, 78, 175, 180, 215, 104, 123, 74, 166, 78, 107, 244, 156, 143, 199, 285, 161, 168, 78, 188, 295, 116, 82, 77, 241, 238, 138, 168, 283, 288, 110, 62]
-190F2
##PAGE=	F1=-10314.2
##FIRST=	25169.313707327481097,	5807.6787752999953227,	0
##DATA TABLE=	(F2++(Y..Y)), PROFILE
5808F7M2QL9p3k1J75o9j04K05r2N9Oj75J7J69j8j77NK2Q9j2p5L4Nn7P6L3Q1m1j13k5J54mO3
5409B93j33l2q6N7k4M9q3K39j32j16M3L2J91p5r8j3L2q0k7J57l0J25j7j57N8j6m2o2K3J68
5056B44K1q5Rl8k7R8k0nlj57R9J66j29r5j0MJ2L8p8J01o6QnQ1o0Pj4Rj5JL6j18M0N2Q5m3J45
4622B88k9n0l8L7J22j45k1O0j13PO8J6j56J11lK1m6n4J51K3p3l9p9J65l8j16L6M1p3P5k9j5
4247A04N6n2Jq0J18l4o0M4L8J4P1k4j51N6o4J00l2R3l9l1q2qK0J00n3J27N7r3k8O8j19KK1
3859A40l8ok0n5L5L9qL7n4KN0P4j88Q4O7n5J13Q7r1N7j94R7p5P2n8J08r9Q4Q2n0o1q0j9n7
3460B0J30m1q2P4L2J25j32J18l6K0O8j29k0No1kK1L1ql0P1j17L6p1J77J34k26J0L5O3p3L7
3085A79n4K0j7k1Q9Oj12J33K7j47K6o0J22J50r7k2K7j13L0J08n9j51K8M5q4Q4K59j42j80j4
$$ y = [67, 109, 117, 156, 83, 62, 237, 168, 64, 269, 177, 236, 242, 67, 84, 253, 235, 58, 63, 85, 174, 162, 87, 121, 126, 69, 145, 178, 259, 218, 105, 80, 234, 230, 293, 160, 128, 42, 99, 75, 124, 41, 280, 148, 32, 75, 107, 298, 223, 125, 112, 144, 64, 37, 194, 164, 289, 272, 115, 173, 157, 115, 53, 76, 244, 265, 180, 189, 151, 124, 222, 202, 197, 194, 37, 136, 302, 173, 78, 68, 72, 84, 122, 44, 145, 79, 87, 82, 163, 103, 110, 96, 105, 90, 91, 127, 9, 49, 101, 186, 143, 288, 259, 209, 171, 208, 330, 185, 164, 224, 111, 118, 186, 202, 46, 157, 154, 175, 129, 75, 226, 249, 176, 137, 58, 223, 185, 69, 105, 146, 73, 148, 119, 104, 160, 108, 109, 29, 147, 113, 53, 97, 135, 149, 220, 196, 45, 101, 37, 137, 105, 198, 159, 128, 46, 38, 58, 158, 105, 232, 289, 196, 168, 236, 117, 119, 140, 102, 96, 76, 21, 56, 95, 87, 124, 70, 72, 122, 196, 8, 92, 159, 104, 217, 304, 213, 270, 76, 173, 98, 170, 112, 220, 121, 205, 287, 237, 176, 96, 77, 20, 150, 109, 27, 101, 133, 258, 126, 244, 208, 228, 296, 167, 147, 152, 91, 89, 110, 141, 133, 103, 174, 57, 93, 22, 199, 333, 107, 117, 152, 215, 142, 179, 125, 145, 128, 107, 196, 202, 90, 223, 250, 103, 129, 69, 191, 341, 244, 222, 249, 136, 166, 274, 215, 64, 92, 137, 53, 137, 396, 254, 74, 60]
2732F0J69M9j16jK2k4Qj43Q5qR4j52K05j92J27J03p6j45J09N3j97N3O9l0k9o5Q0J45j16n6
2380H1o3J63J06n2M7M7j78m5K4mL4J14j20l4j2k4R2j16N8k1J13P2j76Nm1P3j3l7R7l7L6k9
2005A60j6k9O0J16n0j17k2J61j72l1K01j4kpo3r8k3k4J22o8K6O8j1M8j4l0j45J25n6J76k18
1641E3J08J2r9j6N2k5j7K6Ql4J45K11q6k50K0R3M1P5q6n7j17k0L3K3J03j6j00N4m9R8O7q5
1265A65N8l6O5l9l3m7p3K6o6M4j0Q0j0n7O0J11m2j01L3k8p4L0j5K0J15Q0n3j11P6n2n5O9J72
878C02j56l5L0M3L3j30M4J5J58j31m6nn4OO3J70n0j55q6J29q5M1p5J40q0M4jn6J62j58N3k
502A28J9j2N3Mo0q8M0m5R6O7p6O0J36k04n3N4J06q5p3K50j33N8j65P4O2n2j1K3r1J15K0rr3
115A15J6l8J3k2j2J66q5p0M9R6l6o6l5J20J21j95m3L0J30k6j36K7J40M0j73n2
$$ y = [60, 229, 278, 162, 161, 183, 159, 167, 24, 109, 101, 195, 43, 248, 56, 183, 286, 210, 65, 174, 227, 30, 83, 152, 122, 93, 28, 108, 253, 137, 81, 18, 181, 287, 235, 282, 329, 151, 106, 130, 126, 160, 274, 154, 120, 108, 84, 176, 60, 118, 97, 210, 282, 106, 111, 70, 143, 130, 93, 190, 153, 189, 160, 144, 115, 175, 291, 241, 124, 102, 263, 91, 60, 261, 247, 245, 238, 175, 77, 54, 30, 152, 84, 110, 178, 167, 215, 201, 171, 26, 151, 95, 271, 53, 161, 173, 74, 58, 110, 85, 68, 94, 102, 68, 213, 424, 338, 88, 108, 201, 242, 317, 231, 174, 57, 37, 70, 93, 196, 180, 80, 134, 85, 183, 250, 165, 223, 187, 252, 213, 180, 133, 60, 86, 20, 64, 54, 134, 124, 67, 127, 238, 196, 95, 128, 100, 26, 56, 41, 61, 176, 256, 203, 92, 168, 116, 61, 130, 302, 146, 111, 141, 184, 217, 87, 131, 146, 304, 173, 127, 122, 68, 74, 137, 307, 257, 102, 16, 145, 60, 101, 26, 166, 86, 130, 129, 73, 235, 77, 130, 128, 147, 135, 188, 192, 132, 44, 84, 39, 135, 202, 126, 186, 322, 118, 65, 119, 225, 140, 67, 317, 184, 242, 77, 151, 213, 161, 150, 173, 82, 197, 217, 208, 115, 131, 93, 106, 84, 72, 238, 153, 83, 132, 228, 192, 126, 91, 211, 332, 137, 94, 124, 254, 228, 92, 119, 259, 299, 126, 74]
-190G4
##PAGE=	F1=-10416.4
##FIRST=	25169.313707327481097,	5807.6787752999953227,	0
##DATA TABLE=	(F2++(Y..Y)), PROFILE
5808B0J04j4J3o6RK06p7j44K38l4j4Rj70nJ81K2k20nK9Q5K1r9L3lm4N7K8J10m2j01n4J76q
5420B41O8j56Nj06N5k6L0q2J77j01n7K5MK56r4j11j6L3k1m4M6N0M9J0j24O7k8l3j14MJ49R9
5045B55r5J7pp4R0K9n8%r2Q3J37j01j06k3kN2L3n5J8l1j7O4L2n1K7m0L1k7PL3m3k1n3J44j
4634A55J66oj43K7j4J60j25o8N8p3nP4M2j91J24OJ4j18QJ34%j12K9q1K01o1j08O8M6j82J05
4270A30LK6Kr7N5r7J70k1j18N8O9K5pp6j04K4K8N6l6J10pn9j26kO1R3o2J18P6p5p7L9q0j1
3871H8K4L4L1q9p9O2L3K5J4m5N5j22J61j52L5Q0pQ5N7q3L3k10J53j01Q7q2R7j20J57R8r4o1
3495A64q0K9p4J30j2r2Q5j6J52j27J36o0j3O0j41K3K5o5k6j8N0O1r2M9o0L2o4J28J45k18o
3132A05J5O9m8O4q4rK6l3R7J2j35J58J7j63M1p6J59J57j54nP3j61M1J34o6j38J7O0j18L0K26
$$ y = [20, 124, 110, 123, 57, 66, 272, 195, 51, 289, 255, 241, 250, 80, 75, 256, 278, 58, 53, 82, 167, 188, 89, 122, 119, 75, 132, 160, 270, 228, 127, 73, 249, 241, 309, 153, 158, 52, 107, 81, 111, 29, 206, 105, 48, 73, 77, 333, 239, 128, 112, 145, 124, 80, 126, 176, 225, 235, 111, 178, 150, 117, 3, 7, 156, 255, 160, 177, 170, 96, 186, 215, 157, 157, 65, 148, 285, 184, 78, 55, 53, 105, 138, 83, 101, 70, 53, 117, 149, 98, 125, 85, 116, 89, 96, 129, 86, 65, 12, 156, 155, 321, 315, 172, 199, 185, 345, 220, 152, 210, 137, 132, 206, 248, 57, 181, 187, 201, 83, 91, 225, 225, 113, 142, 61, 262, 201, 93, 161, 207, 25, 130, 133, 159, 161, 64, 119, 22, 192, 171, 53, 111, 180, 205, 198, 122, 18, 42, 70, 126, 90, 200, 193, 134, 8, 6, 67, 160, 98, 216, 292, 217, 140, 179, 99, 88, 112, 146, 177, 88, 9, 71, 104, 129, 143, 98, 153, 31, 192, 40, 75, 155, 148, 233, 290, 207, 240, 30, 183, 82, 169, 87, 184, 64, 221, 319, 225, 164, 84, 113, 39, 169, 157, 65, 150, 134, 286, 159, 295, 235, 222, 282, 141, 164, 189, 124, 98, 80, 130, 191, 99, 148, 88, 120, 56, 184, 329, 111, 105, 120, 189, 141, 205, 121, 112, 138, 105, 202, 214, 79, 237, 254, 91, 132, 56, 215, 372, 218, 213, 286, 125, 166, 300, 234, 96, 113, 173, 55, 85, 311]
2768C11j39j12k0K13N5j18l7M1k8k3l5j2K5J06j94J79j69K03nm1q5O1O1k28O2Q8m4n5j0LJ62
2404B15n3j09K5J58N2q7M4J23j88r7RL3OJ76m9q2p2k4R0j12QQJ02O8j54rK6J05n6r5J29J8
2028B08K1o3k1oK8Q0l2j05l0J57j17n6J82j8LOl6j22m0j0O1OL4L4K3ll9K3q8M0l7J53j79O3
1629A20ll7N4J9j17j0M8L4n7J96J73o5k79L2M4M8J20o3j05j19RK8%P7J9p6P2JM0J7p2L7J9
1242B04M1l9p9n3J1j6l5O5m3M8k2m2J18L3m6p3K6J6r5L8j0K0J13J7n0n0J13p8m4O3J92j88
866A55n4j8P9L3o3J1lJ54r1p9np4l1J12J80n8j19j11J76r7K1q6J12n2K1K8l0R5j01j9K6P2
491A84m9L9j1l3r3j0P1N1L5l6M7N4j51o0J01J31j12r8K60j47P3j08j1R6m7lK6j21J29L4n3
127A88o9J2Rm9j7k3J60o6j15N2Q8L8j41R0P7J35k05p0N3J05l4j33k7J59P4j41n6
$$ y = [311, 172, 60, 40, 253, 308, 190, 153, 194, 166, 143, 108, 96, 121, 227, 33, 212, 43, 246, 241, 200, 115, 176, 237, 9, 71, 159, 115, 60, 50, 53, 215, 162, 53, 78, 236, 288, 201, 245, 368, 180, 83, 92, 125, 131, 307, 258, 176, 104, 80, 170, 58, 66, 74, 176, 244, 90, 81, 107, 212, 156, 61, 190, 208, 229, 166, 145, 139, 167, 247, 215, 110, 80, 237, 120, 64, 246, 228, 231, 237, 201, 79, 39, 29, 90, 96, 130, 164, 187, 184, 145, 168, 80, 120, 83, 236, 57, 120, 117, 80, 134, 153, 36, 26, 74, 108, 51, 247, 420, 355, 76, 108, 152, 200, 320, 257, 152, 33, 42, 70, 70, 147, 166, 90, 162, 163, 203, 220, 148, 185, 204, 245, 206, 127, 74, 85, 69, 34, 99, 56, 104, 82, 40, 158, 191, 145, 72, 98, 114, 19, 57, 47, 67, 180, 197, 147, 97, 210, 132, 88, 151, 343, 155, 101, 83, 162, 195, 132, 143, 140, 294, 203, 124, 119, 45, 14, 126, 306, 248, 129, 18, 194, 97, 118, 32, 144, 92, 113, 141, 111, 206, 105, 86, 112, 184, 135, 174, 163, 130, 37, 27, 98, 149, 184, 148, 195, 249, 98, 38, 139, 270, 158, 60, 320, 173, 246, 138, 127, 223, 176, 173, 199, 78, 207, 241, 188, 119, 131, 140, 91, 74, 51, 211, 145, 30, 82, 170, 208, 67, 157, 234, 369, 164, 94, 147, 252, 218, 85, 58, 217, 291, 150, 94]
-190I4
##PAGE=	F1=-10518.7
##FIRST=	25169.313707327481097,	5807.6787752999953227,	0
##DATA TABLE=	(F2++(Y..Y)), PROFILE
5808C6J06l9j6k2J0K05o0j61K14N2o3j2j64qJ63O4k52j9M1P1M5p8Mk1pK5K8J28n1q2q3J96
5432B50j9Q5j90M0r6L2k0%k4P4p4Rj4J9K71j03j06l2M7P2n8o9Q7kmo9O0k9j7n1L5m5J67j10
5033A16N0K2j03N9Q3j14j2j5P3J03r2j07j1l2J05Nom3J8o7J00j4k3J4m0O9j4k7K4L8Or4M5
4646A16M4J60J8j99P1m5J83j25r5M5j3j4O0P2k13J23jK8j78O2J04rj32P8q7K14n8j05Q1N7
4294B42k25J01J8M7l7j18R9o5J64oj76O7J07M0p7j31rL6L8k0l7J24L4q9n9l2L1Q5n9J00J08
3930C01o4r7N0p4l9J3R0O0j09j11Q9JL9Ll1J21j85J14r9rP2M8N7L3o7Jj08R8j27R5j06P0r4
3542C5K05J03j30m8j09Q7p0J22mr6Q9n1J64j20J47p4n0J9j22P3M3o2l2n0N1J13r1k7PK1n4
3178H9P8J37k01k6K7N2j3N4q2l2M9k0R0J6j17J39J3j78N2l3J64J28k06J1J31j86K5J44o1j27
$$ y = [36, 142, 103, 87, 65, 75, 280, 220, 59, 273, 325, 262, 250, 86, 78, 241, 305, 53, 34, 75, 146, 191, 113, 117, 96, 89, 114, 142, 270, 219, 137, 54, 250, 231, 316, 126, 166, 70, 102, 82, 82, 58, 132, 58, 67, 53, 72, 343, 240, 134, 102, 149, 221, 163, 94, 181, 179, 175, 106, 166, 137, 120, 69, 104, 59, 226, 116, 166, 188, 85, 144, 227, 113, 101, 86, 159, 262, 170, 63, 52, 20, 125, 130, 124, 81, 99, 32, 132, 118, 95, 109, 69, 138, 124, 97, 121, 159, 165, 71, 116, 160, 320, 338, 139, 210, 165, 348, 223, 128, 173, 160, 146, 206, 278, 65, 188, 187, 215, 37, 99, 203, 194, 62, 140, 53, 267, 209, 104, 185, 242, 17, 118, 136, 183, 146, 28, 127, 62, 226, 220, 44, 111, 218, 258, 181, 50, 41, 77, 115, 95, 58, 182, 216, 127, 68, 36, 67, 152, 93, 193, 301, 237, 140, 190, 116, 77, 90, 180, 240, 131, 20, 109, 110, 149, 152, 121, 242, 57, 171, 72, 63, 135, 183, 240, 273, 206, 207, 99, 197, 70, 165, 59, 129, 35, 240, 343, 213, 165, 56, 143, 73, 195, 191, 95, 184, 133, 297, 177, 324, 250, 200, 219, 97, 170, 213, 151, 119, 69, 120, 233, 142, 115, 122, 143, 89, 167, 304, 103, 77, 104, 156, 143, 197, 115, 83, 132, 112, 202, 218, 101, 240, 253, 75, 127, 94, 258, 386, 180, 191, 322, 136, 161, 305, 244, 117]
2826A17K2N4j30m0J72q3n1m9K44P3j14p4O6m3m6M7n0J6J17j50P2j39K60q5l0k0J0N8k11N2
2474F5Q6l4n0Km6J49J3j00N9J32qj09L8J86j75j49j4O1j1K12K8j17j31L1N9j09k7L9O0O1j35
2110F6j6J27R2p8j54J44N2Om9l1j0oL9rr8L3J08p0m1J21m2K2J8pj37n6NpP4N2J3L8m7o3P7
1700A66n2k0%J04j42K1lK0J00lj34J8l0O1l2K04J14n7k89Q1j8N7J23j8j35j17N8M2p0M4O4
1336A57n3N7N2J1n0k7%P6J0l8j20M7K5r4OP7o5Mm6lJ51k3p5k6M6J7o3N5l6oR3m0J7KQ1j02
913A17KM2J95j96p0n3J06J9K0j3o1J64n3q6j3l3k9O0J63m0j13p6J74o9l3r6Q8j3J5L2j1J5
538A54l4n5K3J18q2K3j4oo8RO4J0J1OL7j4q3n6J16J55j20j25K41j51Q3k9j11J34m0k0L9j47
162F8J28N4q7m6LN8n5o6L2P8l6j16N9N4P1j85K09K6J41j94j22O8R4l2p9p3J14R4r0n0
$$ y = [117, 139, 193, 63, 23, 195, 112, 61, 12, 256, 329, 215, 141, 207, 164, 118, 165, 115, 131, 248, 98, 170, 31, 291, 206, 176, 156, 166, 224, 13, 65, 151, 117, 67, 69, 23, 172, 185, 85, 144, 276, 268, 159, 197, 383, 208, 59, 45, 106, 95, 307, 335, 218, 87, 118, 177, 68, 41, 80, 140, 201, 66, 50, 177, 269, 191, 37, 181, 233, 239, 190, 159, 149, 143, 182, 173, 75, 108, 216, 146, 105, 226, 184, 206, 224, 217, 80, 24, 29, 22, 96, 148, 161, 199, 152, 89, 166, 114, 94, 94, 198, 56, 77, 74, 94, 194, 191, 57, 75, 45, 106, 74, 278, 392, 335, 46, 127, 109, 166, 289, 271, 136, 19, 77, 119, 49, 93, 157, 104, 161, 213, 224, 174, 147, 147, 223, 233, 195, 75, 122, 147, 53, 59, 136, 71, 75, 29, 26, 177, 154, 79, 53, 99, 116, 53, 108, 72, 66, 159, 119, 136, 138, 219, 117, 119, 161, 356, 160, 90, 37, 143, 162, 182, 169, 108, 272, 219, 133, 120, 87, 58, 118, 281, 241, 128, 52, 226, 157, 124, 28, 116, 103, 118, 150, 139, 154, 120, 65, 88, 206, 124, 147, 133, 127, 59, 68, 132, 142, 153, 159, 196, 182, 99, 43, 159, 314, 194, 69, 310, 159, 242, 213, 102, 236, 196, 176, 215, 68, 196, 250, 163, 117, 120, 178, 123, 57, 89, 167, 131, 15, 74, 128, 199, 14, 223, 249, 390, 196, 74, 142, 236, 204, 125, 52, 166, 260, 170, 120]
-190A20
##PAGE=	F1=-10620.9
##FIRST=	25169.313707327481097,	5807.6787752999953227,	0
##DATA TABLE=	(F2++(Y..Y)), PROFILE
5808F6Q9o4l3L6j1J74k1j43J40J38p9n2j55J0J14R9k65j2M4L6N6j7m5m2N6j6K9J29o9o1p5
5444E6J90l8J14k37O5o1J1j8m5M5J4k1Lm9O3K27r4o8n6O3J38q3j08O7po3lL9j2j3K7N9j39
5056F6J18j29J08L4n3jJ02j68l0M7O5P3r6r8L9k8Q3l9O2m8J0p3R1m3J3l9K3Q0Jp1lJ17L3j06
4657A40p0P0J47L8k11R4n9J80j42o6jN1k1L3J02k18J04j0N7k05P9P7mj10Q3j07K06k8j06P8
4305A81O5j90M9J9M3m8j08J15j6J27J3k10O4J39N5j23j37L5R9j2j14l0J44O5j04Mm7j7Q0m8
3953I3Q1J42o4j01P9q8m2k3J19P5j11j17J04l8L9JoJ76j84Ln4l0M9R9M0K0m9k2j9K6j42J02
3578A58j03J6RJ68J03j52k0j58J28o6J28pr4Q8p4J67j09J39o8q4m4rN5M7n1l0p1M8J41p6j03
3214G6P5J2m0L1J13j81j3M0QK6J2o5l3N2KP2J3q7J14J4j88P0J8J55Q1k29J6J81j84rJ36m7
$$ y = [66, 155, 91, 58, 94, 83, 257, 236, 93, 233, 371, 292, 240, 85, 95, 209, 308, 43, 31, 75, 111, 167, 150, 105, 63, 119, 103, 132, 261, 192, 131, 56, 246, 208, 322, 85, 150, 89, 100, 82, 37, 82, 96, 75, 78, 29, 92, 319, 225, 157, 101, 164, 302, 219, 111, 178, 171, 108, 105, 144, 132, 119, 146, 205, 66, 184, 55, 163, 197, 144, 143, 245, 77, 47, 94, 159, 232, 136, 38, 77, 49, 132, 93, 155, 107, 117, 44, 135, 92, 105, 66, 89, 169, 170, 99, 96, 213, 246, 140, 70, 140, 287, 325, 114, 208, 149, 329, 187, 121, 120, 171, 150, 183, 285, 67, 171, 161, 218, 13, 92, 169, 165, 55, 138, 31, 237, 209, 103, 181, 246, 56, 105, 124, 167, 119, 11, 126, 110, 237, 250, 40, 104, 243, 298, 175, 38, 73, 172, 160, 46, 16, 160, 225, 121, 125, 78, 61, 141, 93, 174, 316, 252, 151, 230, 142, 100, 77, 196, 271, 160, 43, 147, 109, 148, 149, 143, 319, 135, 138, 84, 54, 103, 202, 242, 262, 213, 191, 172, 198, 56, 158, 55, 71, 80, 248, 351, 199, 179, 21, 149, 83, 211, 204, 110, 198, 124, 291, 182, 321, 253, 169, 125, 116, 171, 218, 167, 137, 66, 114, 255, 179, 76, 151, 163, 123, 154, 267, 86, 73, 113, 121, 147, 159, 94, 61, 113, 115, 187, 200, 113, 227, 241, 53, 123, 141, 296, 377, 148, 164, 345, 161, 152, 288, 241]
2838B41j06K4L2j11l0M0M1p1m3K24R4j07r9Q9o9o2J06m9mJ17j09qr2K60j23m1M2m2M6j63L5
2474F2O1Jj7k6J0M9N6o6N6J07n8j24L6K22j48j75j5L5j4K14J06j38j79J11L2j00k1K2J6M4
2122A59j21%K07N9q7j94J38O6okm3l1l6NOr1J47L2m4kO1j02N8K9J0j39n6J3kN8P6LK4q1o0
1711E4J18m6m6L8N1j19KK1L1J19j2j31J6o1O6OJ88N0o1k81J62q3P4Q3L8j39r7P6O1j17j8J03
1336A46l0K9Q4J2j19K9k9J19j1n0j41J56J8j71L7Q0o6m2j7M5R5l1r2j0Q7j3l2R5p7m3O4k6
960I6J05k2Pj16Q2J6J76j86p3l2O9jJ10k4j43J75j7p3l6LJ0%J07jj24k5J57l9q7j01Q3J9K4
573A39J2Mo7L4j8k9J35j07J7j0Rk6ML7k0kM4M7k7o4k4Q3J81j11j54K01j38Q5M0j96J70k8o5
185A56O7j63J02P9j01l0mR6n0r2Q5l5Lo8L9J5O3q4J92k7J44j53j82O2R7k5k3n4PR1k7l5
$$ y = [241, 135, 159, 191, 80, 50, 90, 131, 60, 17, 241, 335, 228, 129, 218, 149, 87, 193, 144, 140, 257, 148, 140, 48, 308, 185, 144, 186, 144, 190, 27, 62, 123, 124, 107, 81, 91, 140, 196, 130, 186, 293, 235, 111, 147, 369, 221, 46, 31, 66, 52, 266, 372, 234, 55, 166, 198, 98, 77, 99, 115, 159, 38, 38, 245, 304, 217, 23, 161, 227, 221, 219, 176, 145, 109, 114, 120, 29, 176, 208, 164, 162, 223, 121, 179, 208, 218, 79, 23, 36, 34, 92, 168, 171, 195, 114, 54, 172, 126, 80, 118, 169, 50, 52, 73, 104, 223, 211, 80, 96, 35, 101, 107, 295, 345, 284, 3, 165, 82, 156, 239, 277, 138, 41, 117, 178, 61, 43, 146, 116, 145, 229, 241, 122, 151, 122, 241, 230, 180, 39, 195, 213, 42, 79, 159, 93, 51, 34, 79, 174, 143, 51, 41, 128, 115, 83, 178, 101, 58, 122, 96, 201, 179, 186, 70, 152, 168, 344, 158, 85, 53, 122, 121, 231, 207, 64, 239, 222, 149, 113, 116, 126, 126, 233, 232, 108, 83, 240, 201, 114, 13, 96, 115, 139, 151, 155, 88, 122, 104, 75, 210, 103, 120, 110, 119, 93, 97, 134, 114, 112, 156, 203, 176, 112, 88, 171, 352, 241, 87, 288, 150, 235, 275, 79, 249, 221, 156, 223, 60, 162, 241, 140, 110, 106, 202, 152, 60, 145, 110, 113, 45, 84, 99, 162, 78, 270, 243, 387, 234, 52, 114, 211, 186, 163, 109, 116, 207, 180, 145]
-190A45
##PAGE=	F1=-10723.2
##FIRST=	25169.313707327481097,	5807.6787752999953227,	0
##DATA TABLE=	(F2++(Y..Y)), PROFILE
5808G5Q0q1l8P5k7J19L5j00M4K03p0r7j36L2M7J27k56K9J4qN6O4j05m0J07m7K8J15r5m1k8
5444H1J64o2J48k89P4qNk8m9O0J0K0n0m6Q1J50o6np0N8J69r6j12L8J0j28O3oK8l2J00O6j52
5056A26Rr9J32K3L0l8Q3k14nM7M5N1j00o9R2lJ3q9J34k9j6o4Q6l6J3j12J27O1J0j06m7J80
4681B35O2j04j66O9J33N6j86J00o2J46j68L5q8J04k5kJ35k10O6OP0j76M1P0On9N5j26J65J8
4329B00j04O9N8j33lJ6J1k5p9R6M0P5L5k03O1J33P0j43r5J8J63o0j88L3J17N6p9K8o3m7P7
3965A34l6O4J74p7r8J00j00l1n6J16P8j07q9R1o5L5PK7K10j79r5k4k8J8J36M1J2l4k2K2m7
3601A77j32J05o5k0O2J06J05j60J3j78J11o5J45j0q6Q3q8J67q7J08m4j10q4J49k6L0l7j6q7
3261F6M9J42o2j57J31J9l1qP8j66N7J0l4O2n3m2QJ9K1M1Nm9R3J5j82R0N3J38L2k08KK03j62
$$ y = [75, 155, 74, 36, 111, 84, 203, 238, 138, 182, 385, 315, 218, 82, 114, 161, 288, 32, 61, 75, 67, 123, 187, 82, 42, 149, 102, 130, 245, 150, 109, 81, 245, 183, 331, 42, 116, 108, 113, 85, 36, 96, 106, 126, 76, 30, 111, 261, 195, 190, 120, 178, 347, 251, 139, 177, 187, 59, 122, 116, 144, 112, 212, 278, 126, 135, 36, 168, 191, 221, 183, 266, 52, 47, 94, 139, 190, 90, 21, 113, 110, 123, 34, 168, 139, 123, 59, 145, 109, 122, 10, 137, 198, 208, 102, 55, 235, 297, 193, 27, 96, 229, 285, 99, 199, 137, 283, 115, 150, 62, 166, 141, 139, 274, 64, 130, 136, 206, 30, 71, 141, 147, 88, 143, 17, 182, 200, 96, 165, 223, 90, 87, 103, 114, 89, 10, 106, 146, 221, 256, 53, 114, 247, 317, 174, 79, 97, 260, 200, 12, 45, 162, 218, 139, 167, 104, 57, 134, 98, 162, 336, 259, 161, 261, 161, 130, 74, 190, 268, 161, 72, 163, 98, 133, 140, 167, 377, 198, 103, 79, 51, 69, 205, 246, 258, 224, 202, 224, 177, 45, 150, 85, 65, 127, 233, 338, 178, 191, 13, 124, 59, 204, 194, 108, 191, 103, 270, 183, 291, 247, 137, 53, 202, 176, 206, 169, 153, 66, 115, 257, 195, 38, 169, 188, 157, 149, 227, 61, 118, 128, 94, 156, 103, 61, 69, 88, 109, 150, 155, 106, 199, 214, 32, 122, 175, 313, 345, 137, 139, 342, 180]
2873A80m0J19l8o8J9mn9KlP4j33qJ77J06r9j04J03j05o5J39k7j9J01p9l4n0K10j22o0Q6q0
2509A19L1j16K5K4N0J1n9O8k8O7k8L2Q7q9j32M2K20j16j54K3m6nJ65J73j41k00J79J8q6j7
2157A17m%J0j06K2K49K3q8k06J14O6j1N3n3n6n6ojm9K22k8l6L5L2j92J15L2J0j33k3jJ5K9
1770I5R3kj5r8k2J31o3l8N6J4j15K0M4NJ17j6j24%oK9K1J62Kp8j44J44j11O3K7Q4j26q7Q3
1383A45P9j25p8J03lK4O9L1j64O4l0J39j3p7j38K14K8k23M5P4m8n5L9M3NLn2o2J15k6k6J41
1007B41j08q3L9P1J16p5q2q2J42oJ41j65o4OPj1J79k1j71J24J6n0p4K8N7j6PM5j14PJ33j5
631B22j30o6O2L3L0j1K3j20P2L8q1J25j25L3j0J1K6k8Ol7nP4P6mq5LM7K05r8j86J60j08P5
244B27Q2k47J97j4j29J05j60P1P8q6k3jJ12n1o2R0j35M8l4J7j6L7M1J45p6J40q3k01JJ07j2
$$ y = [180, 140, 259, 221, 153, 172, 168, 109, 111, 108, 182, 49, 41, 218, 324, 225, 121, 224, 119, 54, 193, 166, 147, 248, 169, 135, 85, 295, 173, 113, 199, 119, 150, 34, 59, 83, 133, 144, 85, 153, 125, 192, 164, 196, 283, 194, 62, 104, 324, 208, 54, 77, 31, 26, 191, 364, 223, 23, 202, 220, 134, 117, 113, 113, 123, 17, 39, 288, 311, 223, 17, 131, 197, 186, 239, 186, 130, 74, 68, 67, 18, 240, 212, 176, 211, 243, 51, 166, 198, 208, 75, 52, 51, 66, 95, 188, 186, 171, 73, 51, 182, 119, 81, 137, 151, 36, 56, 100, 105, 222, 206, 82, 82, 76, 105, 126, 288, 290, 212, 68, 212, 101, 164, 191, 275, 149, 62, 145, 224, 99, 21, 124, 121, 145, 214, 245, 81, 145, 115, 254, 241, 164, 26, 240, 268, 45, 90, 164, 116, 61, 100, 143, 148, 151, 99, 37, 152, 126, 100, 241, 133, 50, 89, 160, 276, 201, 119, 37, 179, 173, 314, 149, 85, 91, 98, 87, 266, 245, 74, 198, 214, 164, 90, 118, 175, 159, 166, 211, 97, 104, 237, 222, 92, 26, 88, 121, 151, 140, 163, 43, 115, 153, 72, 197, 72, 105, 95, 106, 132, 104, 110, 73, 68, 142, 218, 214, 129, 132, 179, 384, 286, 100, 260, 152, 227, 309, 62, 259, 245, 116, 221, 61, 132, 210, 124, 101, 100, 212, 161, 99, 189, 54, 102, 68, 85, 69, 106, 147, 292, 216, 356, 273, 72, 73, 180, 168]
-120A68J4k4p6N5L8j0
$$ y = [168, 182, 158, 82, 137, 175, 165]
-190A65
##PAGE=	F1=-10825.5
##FIRST=	25169.313707327481097,	5807.6787752999953227,	0
##DATA TABLE=	(F2++(Y..Y)), PROFILE
5808F7P2p8m6R0l2N2R8l9m2K25m7j36r7M0k3J45k27P1l3l8N4J41j67J4J02o4L1R3j18k9J5
5444I4J53q7J81l12N3M1J4m0J1pJ8L9j02j1O8O5k6O4p0K9J71q0j10K6J9j40R4o6Q1p0J51N3
5068C04j60n6J2P5rJ08n3O0k42M2K2mL4r1j0J13K6p2m2J06j2k1p0J20j6k8r5J41L0J5j26p7
4693B4K00Q9q6j86QJ15P0j39R5o1Q1j70J56j83J29k6l1J68j91K3O2L4j40J1P8J1oJ9j10P4
4340A18O5r0O5J9o1n4K8k7Nk4K1J00J9N6j68Q1P3Q2j47n4%K08q7j70L2J00Qk5J1p7l4O7l9
3953A01N8J97j03r0J08j07k0n9P8P5j05l7N3p8M5K4M9K19j65j60j3j8qJ53N7Ok9rK6j17q5
3589D6R7k3rM6L8J09j57L5j43L0l6J33%p6P4r7J76n2O3j8j23KJ68q9j2k3%r2O0J16n3j77J61
3202A74M5l4l3M0j52J28l7m7Q1j21K0N8n5L1jmmO9J3j39Q1P3J18j2j56j8J91j28n5J07m3k5
$$ y = [67, 139, 61, 15, 105, 73, 125, 223, 184, 142, 367, 320, 184, 87, 127, 104, 249, 22, 93, 60, 22, 76, 217, 50, 64, 166, 102, 133, 226, 108, 79, 94, 247, 160, 341, 29, 82, 123, 137, 97, 108, 101, 119, 158, 56, 45, 113, 178, 152, 216, 146, 175, 346, 266, 156, 182, 201, 61, 155, 89, 170, 100, 251, 304, 144, 88, 100, 175, 166, 274, 221, 281, 39, 81, 103, 99, 133, 42, 32, 145, 171, 99, 57, 163, 151, 130, 60, 180, 164, 136, 41, 182, 212, 227, 101, 24, 224, 313, 227, 41, 49, 164, 234, 95, 190, 129, 210, 40, 196, 13, 142, 116, 85, 253, 62, 85, 147, 181, 41, 52, 130, 141, 135, 154, 44, 118, 183, 93, 158, 177, 116, 62, 90, 63, 68, 44, 65, 165, 184, 240, 72, 153, 226, 308, 161, 107, 107, 315, 228, 58, 90, 190, 198, 173, 184, 107, 73, 140, 101, 159, 356, 253, 163, 271, 164, 144, 85, 163, 238, 133, 96, 149, 71, 116, 140, 189, 408, 243, 83, 70, 52, 44, 197, 254, 260, 231, 222, 248, 131, 46, 143, 120, 111, 157, 195, 304, 147, 182, 39, 69, 33, 166, 166, 90, 164, 67, 243, 191, 254, 236, 113, 115, 283, 194, 182, 159, 159, 67, 127, 243, 190, 13, 174, 219, 185, 152, 192, 40, 168, 131, 84, 165, 44, 64, 122, 67, 98, 97, 93, 89, 158, 171, 32, 113, 186, 304, 292, 136, 118, 309, 181, 126, 233, 190, 165]
2826A65J1l6QJ3J1L9j72J3J49J03r8q4J02j38l4J25lk6P3o3j7j9J35r2p4J04q9Rq0J9KR1J6
2439A63p5J13o8M0QmO9r3j38N6J74q0q6L9m2k0M1K19j30j38J68J3o7k0k2Ll0n5qK62mq4j86
2052A8P5O3lQ6n9p3o0Rk6K8K21o1l3N4L6k55J62J4mj26K7k2qM2J01qo8p7JJ33q7mM8j3j09
1641B2N2N6l4J06k5j13k3Q7pJJ32j6j02RJ13j13K2PR5j18q6Q5R3j10q4M5K2N6J2M9j62N4p
1254A18J39Jj08j03J98O3k44L3N9k3l2O1L8r2N3k0r6J11On9J80j22j06L0J36J02j24j61O6
913A04R4k4J01j39n2L8m4%K01j4j28K1M3l2j16M1J00J7j22Q9o1pJ12mj52nL4K1K6k4M5p3J2
526A02Q0j22J11j35P2j5MP2n5m1m1J5Q2J02J0r3J5K7K19r1k24J38o8N0R4k49K00jj88J34j22
162H2Q3mm8j8J1J06o1JO2j87Q8k2j9m1K9J43Q6j17J32Nj91q5J08J1K4J0j13j2R3J9
$$ y = [165, 176, 140, 148, 161, 172, 211, 39, 52, 201, 304, 206, 122, 224, 86, 52, 177, 174, 148, 221, 158, 141, 122, 257, 165, 91, 195, 106, 115, 35, 54, 56, 147, 163, 88, 201, 133, 173, 181, 177, 246, 153, 15, 71, 245, 165, 79, 118, 76, 56, 97, 316, 186, 48, 216, 229, 162, 142, 120, 123, 93, 38, 30, 292, 288, 204, 18, 93, 156, 153, 239, 180, 107, 47, 56, 30, 58, 279, 218, 185, 239, 275, 20, 182, 196, 192, 66, 93, 71, 63, 105, 206, 198, 130, 53, 54, 187, 100, 96, 144, 131, 22, 74, 130, 96, 202, 177, 64, 41, 128, 121, 122, 254, 238, 136, 145, 258, 145, 167, 174, 269, 151, 65, 150, 243, 133, 49, 94, 116, 172, 184, 233, 71, 125, 118, 257, 258, 150, 47, 245, 308, 64, 97, 156, 133, 101, 162, 200, 108, 161, 141, 45, 156, 162, 103, 283, 161, 55, 85, 221, 323, 199, 38, 104, 198, 174, 275, 136, 84, 122, 78, 78, 279, 265, 137, 158, 201, 169, 53, 94, 194, 211, 89, 178, 117, 110, 222, 218, 66, 61, 95, 116, 142, 118, 163, 90, 102, 182, 60, 171, 36, 108, 93, 97, 169, 114, 73, 32, 47, 129, 231, 241, 148, 163, 190, 409, 318, 94, 232, 164, 214, 308, 59, 259, 258, 70, 204, 82, 165, 161, 113, 95, 106, 212, 151, 152, 214, 27, 115, 93, 74, 33, 62, 205, 291, 174, 306, 311, 120, 35, 143, 154, 178, 188, 75, 63, 156, 175]
-190A75
##PAGE=	F1=-10927.7
##FIRST=	25169.313707327481097,	5807.6787752999953227,	0
##DATA TABLE=	(F2++(Y..Y)), PROFILE
5808E9N2m8l0M1j9j6J52L3r6J93k0j57m1L6q1J43j71Q6r2j2M7J76k00O8N8o5L7P6j08l1J1
5444H1J61j00K06k94L3M4K4l7O8r2J6N1j39L0M7j0J4J21n7k0J51k8j12L1J3j30J14j18J32
5103B00j12J65K5j61o6J06J5m7J59n2N2k51O9K1o0Lo2L7J22O1j61P1J3j1Pq0J72rq6o7J37
4740B10kJ5j31l1J22J12n5j57l4O6P2r0Q7n7qj2J27k13Q3k4l9J85j59K5R3m3j00J4Q1J0L6
4376A83k3r8JJ00o3P2n4J3r0O0J9n2L4r1J57l4P1j22J19j8R0j47%k8K23q7j47K9J02n4L2k7
4000A70q6K4M9n7O6K08j44p3J00j10rk8J0P4j09K5po9P3N1M2K12j41j80k0j1k9J57P6kl9J2
3624B35Rj76j4Q4NNJ9k8J18j55M2r1m3R9mL0n8M5j06J98qK9j7j19Q1J47j04o4j8Rq7Q5P1m7
3225A72j48J47P9m9m0%j17J51q1k6Q2j28P7O9j24L6m0PLM1Po7L2R1R6m8j03k1J51q7m8J12
$$ y = [59, 111, 63, 33, 74, 55, 39, 191, 224, 128, 321, 301, 144, 103, 139, 58, 201, 30, 116, 24, 12, 59, 235, 35, 103, 161, 96, 133, 209, 101, 70, 81, 242, 142, 348, 54, 87, 131, 155, 118, 186, 94, 110, 161, 22, 52, 99, 89, 103, 224, 167, 147, 298, 270, 158, 189, 202, 72, 186, 68, 200, 88, 253, 278, 117, 51, 157, 172, 125, 284, 232, 284, 33, 102, 123, 63, 66, 4, 41, 163, 224, 63, 134, 147, 136, 143, 63, 235, 226, 140, 73, 210, 208, 223, 92, 61, 183, 295, 240, 83, 49, 115, 187, 97, 184, 127, 119, 107, 234, 21, 104, 80, 41, 226, 67, 92, 185, 142, 42, 56, 137, 147, 183, 160, 62, 63, 163, 100, 172, 118, 131, 41, 101, 120, 68, 102, 11, 168, 134, 205, 83, 202, 184, 274, 127, 127, 99, 322, 235, 88, 117, 219, 165, 197, 170, 84, 108, 157, 100, 166, 374, 230, 157, 257, 147, 138, 110, 120, 194, 85, 110, 103, 34, 107, 158, 200, 412, 271, 91, 71, 60, 31, 188, 264, 262, 223, 235, 244, 68, 54, 138, 143, 148, 167, 139, 257, 102, 144, 53, 10, 109, 105, 135, 77, 122, 16, 214, 206, 235, 218, 99, 180, 327, 223, 159, 141, 150, 63, 148, 219, 172, 24, 171, 250, 201, 161, 161, 44, 195, 114, 88, 170, 42, 119, 188, 64, 100, 60, 67, 70, 111, 118, 51, 83, 174, 270, 222, 119, 98, 249, 162, 114, 226]
2850B26n9qJ1m7P2OnJ0j47j2J52Q5j00n1Q5j38J8N9J1l4M3n7K3J0N2m0q1R2n8k4n9J4K7Q9
2451A65ln9J30p1k4M3m5N2o3r9K7Q2m2K2K8j3n0o4K22j04n1J21J3l4k7k5%p0J1n9K39j3p5
2063A64j37L4O0J9P6o5p7l8J5j2M6K00o8k5M7O5k31J41j7k2j29R3m1p0Q6J01j8j09ml6J34
1700A82r1K9K3m2o1N5O2p6R5m7j00pJ51l5m1J02lj20J44P3j16k7N0O2j28q8Q6R7p8p4j6M3
1324A04R8l9M1j20J5K2J25J8j24n2J26J15k37J1L4RrP2L1j67R7j4q4O3P8j17J99j17j14L7
972A01J46Q1j53j05J04L4m3O8j04n6O6o7J5J77pp1n4N4k7j48M7J19R3k27R9J3n5R6kj46M3
608I1K5j9J0j8O8j2n7R9j59J11j31J14qoR2n1j01j2L7M9J11jo7J0K9K21j00k56J38l2J9Q0
232B74k12J81Rj82R8m3J28j36nj9K3Q8p3P4J8j74J07l2o5n2P7J59K8j40J16R2j77j36P3M3
$$ y = [226, 167, 159, 170, 123, 195, 201, 196, 206, 59, 47, 199, 284, 184, 133, 218, 80, 98, 157, 168, 134, 177, 120, 143, 153, 205, 165, 84, 176, 118, 94, 35, 49, 76, 165, 162, 103, 233, 162, 138, 181, 136, 188, 125, 26, 53, 135, 93, 115, 143, 130, 80, 16, 238, 134, 83, 204, 217, 183, 156, 131, 131, 61, 72, 13, 252, 239, 164, 27, 61, 121, 140, 216, 151, 74, 36, 51, 39, 85, 285, 217, 192, 239, 304, 73, 214, 197, 175, 46, 139, 98, 28, 114, 215, 197, 88, 84, 48, 182, 91, 120, 143, 101, 40, 95, 157, 81, 176, 129, 29, 22, 173, 138, 97, 199, 196, 76, 220, 293, 177, 150, 200, 262, 134, 46, 132, 229, 151, 77, 61, 104, 202, 163, 204, 84, 99, 121, 246, 264, 140, 88, 214, 329, 92, 103, 137, 146, 137, 209, 240, 73, 170, 156, 72, 135, 213, 96, 295, 178, 64, 101, 247, 328, 175, 70, 174, 208, 165, 233, 129, 73, 139, 72, 87, 264, 257, 186, 132, 186, 159, 11, 58, 177, 270, 43, 142, 155, 100, 196, 194, 48, 91, 116, 97, 107, 89, 157, 145, 88, 187, 28, 139, 8, 122, 114, 108, 200, 149, 48, 36, 73, 122, 233, 232, 165, 175, 204, 425, 325, 69, 207, 175, 194, 274, 62, 243, 252, 70, 168, 125, 253, 117, 112, 93, 116, 204, 131, 205, 223, 49, 156, 124, 59, 7, 84, 243, 271, 131, 247, 339, 162, 26, 99, 142]
-120A42J6L9j06p5J14M3
$$ y = [142, 158, 197, 91, 16, 130, 173]
-190A73
##PAGE=	F1=-11030
##FIRST=	25169.313707327481097,	5807.6787752999953227,	0
##DATA TABLE=	(F2++(Y..Y)), PROFILE
5808G2PKNm6NJ8Q4J05j15J19Mj56J4L4p4P2r2O9r2mM4J64j70O8Jn3L8P6o2l1n8J75r7K19k72
5397G3N6NK2j2J12j83OO2j09J9K4l4J2J60m0n8R8N3j20M4Jj31J41j45J72j39J27lj56l0J66
5033A93m1p3J70l1N4k44Q2L6n1n3j8J3J31R5k46J82o2l7N9o4K02k0j41n8J38l0J4j22K4K2
4681A24J27j9j16m5K6N7n5Q1n2r9J72N3k09J8k2j3J67j17P1O7j22n5L0Q1NO5o6r9k8J21k8
4317A20Q0j41P6r7R0Q8j35Q6j15J11q0P4p5J56j02Q6j47P8p8K02n8j29K6J12j03P2o7q9J09
3977A50K4q2Q9K04j94m8P9j07LK0p0Q2j12Q1o9m1R4Q4PJ94j04j70l1nn6J63Q5j5o3L6rk10
3601IM8P9J2J5jp8J17j57L8k2L5J11j72P8j1k6k7J39L2J8m9r3J09J23p2j06l5Qp3J24K3m6
3225A50j11J32R8p1k5m1o3J20j08J5P1p7R0O5j65M6m1L4o5K7pj2k6J16O9p5p1jR9m8k1J33
$$ y = [72, 79, 81, 86, 40, 45, 63, 147, 252, 137, 256, 260, 104, 118, 152, 78, 150, 58, 127, 35, 31, 75, 239, 69, 137, 138, 85, 123, 199, 137, 106, 48, 223, 126, 345, 73, 129, 134, 156, 144, 256, 73, 79, 141, 32, 51, 75, 41, 53, 213, 173, 115, 213, 266, 146, 190, 191, 60, 201, 56, 228, 89, 216, 213, 57, 27, 193, 152, 79, 249, 218, 272, 28, 110, 146, 95, 42, 24, 37, 168, 263, 17, 199, 137, 100, 159, 95, 297, 277, 136, 78, 216, 186, 200, 78, 102, 124, 251, 232, 116, 71, 97, 154, 99, 180, 128, 29, 201, 254, 45, 63, 41, 28, 195, 78, 149, 216, 94, 39, 69, 150, 155, 220, 154, 55, 27, 148, 120, 200, 59, 135, 38, 128, 216, 81, 167, 52, 163, 83, 157, 82, 238, 136, 222, 75, 153, 75, 277, 219, 90, 116, 228, 125, 197, 130, 41, 150, 174, 92, 181, 385, 191, 143, 222, 115, 118, 138, 68, 150, 38, 119, 50, 9, 103, 187, 194, 388, 284, 114, 83, 78, 22, 185, 270, 255, 192, 228, 219, 9, 57, 136, 148, 163, 162, 84, 201, 44, 82, 60, 95, 206, 34, 112, 101, 75, 48, 187, 219, 237, 188, 95, 204, 327, 255, 149, 114, 122, 49, 173, 196, 150, 39, 171, 269, 198, 173, 132, 69, 189, 81, 96, 167, 90, 180, 245, 80, 126, 85, 119, 54, 81, 74, 62, 36, 152, 221, 146, 75, 74, 173, 125, 104, 237]
2850B37o1n0K0k3J17on9lq3n5J81O2q7l9N5r4M2qJ0n1J6n3O7M2k4K3r1O3Jo3m4J4N1P0l2j1
2427A34J16m9j10P7q4L6Po2nm4PJ31pJ5q3j8Q7o3J6O9K1J6m4j5j8r5O9n7J31kn9p6J2M7N3
2016A53K4p1p7jJ4J6L8J63n8mJ6J10k12J29n2l3j40J72o1r0P3J03l4j02M6q8J34n4K8Kp8P
1641G3M2P0j19R7q1n7M1J34n7q8P7L9j15K27K6j32p2J45Mj50r3Q8Q5l5n1o0N2J22n3Ko1j9
1265H1L7J06K5j12nK6J75k13j1QM0qQ3K8j89J15l9l6j2J63j68J82j01j11M8J21N8j50JP7j0
901B09n9M2n3r4R6n9RJ33pj8p7M7l9q7K8O5J88k26K6O8j15Q6qj18P5L2q0j3RQ2L7j05R8j52
502B0Q7p4R6K2j2P9k0j51J3M3K0R9k9k0oM9K11j20k76J54oj7N2j58J56J5j01oN9J61k11jl3
115I5K5O6p6J39k3j60J36m5j11k1R8J34k0j39R6J58j66j42OP3NO2q1n2M2N8
$$ y = [237, 176, 126, 146, 123, 240, 234, 175, 172, 89, 34, 215, 277, 190, 151, 206, 112, 154, 146, 156, 105, 121, 68, 135, 177, 153, 176, 85, 148, 149, 86, 42, 56, 107, 177, 145, 134, 250, 201, 91, 168, 84, 120, 127, 65, 60, 16, 23, 154, 147, 162, 79, 61, 148, 85, 101, 170, 191, 207, 163, 148, 130, 35, 104, 47, 178, 176, 117, 41, 53, 100, 153, 177, 106, 29, 28, 42, 58, 96, 259, 201, 197, 213, 323, 111, 240, 188, 155, 15, 187, 126, 36, 109, 212, 178, 76, 122, 34, 168, 114, 142, 144, 66, 73, 115, 185, 66, 163, 82, 25, 66, 200, 143, 55, 132, 171, 56, 283, 309, 177, 105, 250, 254, 104, 11, 99, 184, 149, 98, 38, 90, 212, 159, 161, 100, 81, 118, 224, 249, 137, 132, 158, 333, 120, 109, 117, 157, 149, 232, 260, 71, 186, 147, 111, 99, 262, 94, 276, 175, 64, 112, 233, 291, 141, 142, 219, 209, 150, 192, 139, 45, 141, 82, 91, 224, 217, 199, 122, 169, 130, 43, 71, 136, 324, 98, 124, 192, 77, 163, 155, 37, 112, 144, 64, 51, 60, 142, 179, 74, 172, 20, 107, 33, 129, 151, 139, 218, 198, 47, 60, 103, 123, 222, 193, 173, 167, 216, 427, 307, 31, 185, 179, 162, 214, 56, 212, 227, 126, 120, 179, 340, 129, 128, 95, 120, 186, 110, 249, 226, 66, 202, 157, 46, 25, 123, 257, 237, 98, 194, 352, 186, 44, 50, 123, 128, 190, 109, 57, 99, 157]
-190A57
##PAGE=	F1=-11132.2
##FIRST=	25169.313707327481097,	5807.6787752999953227,	0
##DATA TABLE=	(F2++(Y..Y)), PROFILE
5808I2l9N2M3p6rO8l1J61j10M0J5j25L9M4l1k5j1K9j7p5N5J37j13N0n1m3K8J01j6k3r0J20
5432A89q1K18k45R1m0QK6J41k66oP7l2k9%K2o5J89l5k7j5J30j27N7lj50J67j45J95j37M4k
5068A49j16j7J86p7q3J41J5N1k23Q5N2Kp5o0%J36J22k50K03q7r8J16k7K02m1j75o6J40n0Q
4716A63r4O0o6J31J0o5o8K9L9l7O9m2o0K04j9j79l9j5J3J27p1J12K1j83OK7Q5KP6j05j07j
4340B3J18QQ6k18J10p6J05J43j98J23j24O3j19O1l1J75j51O8j35J55j45J50j3j10K0J25j31
4024H2Q8r4n6J65%j08J17J91k48j5N0q3J2N8j38R4n0P3n2m5N1J17l8J70n5j47m4J1q4J65Q0
3660B67l3r7O3k0j07j6P3MJ9kp7O3j09L4J1J03J11k41N5N2p3M3M1N9J1r2m8R2J05qj27p7M
3272H3m7J59j2n0q7J31Q7q7Oo6k5N6p8K9N9k1R0N0j73N7l8M7j30N8l4pJ7P4K3p5n2RM6k0J9
$$ y = [92, 53, 105, 148, 72, 63, 131, 100, 261, 151, 191, 206, 81, 120, 164, 133, 108, 97, 126, 109, 34, 89, 226, 113, 163, 112, 69, 97, 198, 182, 159, 69, 189, 108, 326, 81, 172, 132, 140, 166, 307, 41, 35, 112, 80, 51, 51, 73, 8, 197, 162, 135, 120, 250, 123, 180, 177, 27, 194, 49, 244, 107, 151, 149, 33, 16, 202, 125, 42, 183, 198, 249, 26, 111, 163, 165, 90, 30, 30, 166, 288, 38, 241, 154, 56, 172, 145, 347, 306, 131, 65, 205, 155, 163, 69, 129, 63, 194, 204, 139, 71, 100, 139, 102, 171, 129, 69, 273, 254, 75, 36, 21, 34, 161, 90, 202, 223, 40, 46, 73, 158, 160, 236, 131, 24, 23, 141, 149, 235, 17, 127, 51, 156, 299, 101, 224, 100, 163, 44, 105, 74, 249, 98, 166, 31, 186, 41, 191, 178, 68, 88, 213, 82, 170, 76, 20, 185, 185, 77, 194, 385, 137, 122, 172, 89, 101, 159, 21, 115, 65, 138, 86, 41, 92, 209, 171, 341, 286, 139, 95, 106, 22, 187, 267, 234, 137, 200, 180, 73, 57, 130, 134, 153, 151, 74, 137, 28, 62, 73, 176, 287, 46, 101, 153, 80, 123, 164, 223, 234, 142, 94, 186, 291, 283, 156, 79, 83, 36, 195, 183, 133, 46, 177, 264, 177, 183, 117, 92, 148, 70, 99, 158, 137, 227, 277, 104, 161, 123, 170, 40, 98, 64, 57, 74, 148, 171, 96, 44, 53, 99, 79, 98]
2862I8J51l5j47L4L1J40j2j36Mk1o9K01M4n3o0J9m2N8n5mp2on0J02P1p5Q1j08L4O2r9k9K4
2474H1M1N2n6N4Q2j9k00J21j23K1R8n1rM2l1Q3n6L8j14L6l0J7J8K4N0O8p1j0l2p3P7k7j5K6
2075A12k0l8J3K3Q9m6p2k8j4L9J2K4J14m2L0k5J57k00J21q4l9q5J88p9m4j6J06n1m4M4j22
1711B3J22J3j0Mj07N5L0Q1j52J10r1QJ1J09p6j04M3R2r5K54k1j59r7K58n6j67m8L5N5J7l0
1347A07p9N4J16m3m3Jk1J3R0K2p7K8p1K23j78l2jN5l6R9L3j68J23r1K6q8K33j81J16q3j04
984D3O6Q1L6j17P8M2k5o5K1Pj46J05k7j4Q3j9J8n3L6o2%M0k4K63k06j7Q0j74P5j7q1R4N0j38
584C3j9K9P2P4j27R1q1Lk3O4O5j5N5J7j95L0M7RP4o7L3k9P8J92j44k50J49Nm4J2j06J33K7
197A92rr9J41J69k13k3o1J4M9o7J87n0j59J63n0j34k0J13J02n1j19P8J92j54j32l4O6PP3n4
$$ y = [98, 249, 214, 67, 101, 132, 272, 260, 124, 128, 107, 38, 239, 283, 230, 170, 189, 147, 205, 150, 146, 74, 68, 18, 120, 191, 116, 197, 89, 123, 185, 86, 57, 81, 122, 174, 118, 172, 254, 235, 35, 156, 33, 54, 152, 101, 92, 134, 103, 186, 130, 168, 54, 90, 60, 77, 95, 119, 169, 237, 166, 156, 124, 51, 128, 101, 86, 112, 92, 54, 67, 90, 179, 133, 61, 33, 19, 58, 70, 94, 208, 166, 196, 171, 328, 128, 249, 165, 126, 41, 229, 150, 106, 90, 196, 145, 101, 145, 23, 145, 158, 148, 152, 45, 100, 130, 211, 59, 169, 78, 86, 97, 206, 130, 26, 69, 161, 66, 320, 299, 140, 43, 301, 245, 78, 30, 65, 120, 137, 107, 28, 82, 198, 155, 112, 113, 92, 105, 195, 217, 140, 168, 97, 320, 142, 110, 109, 164, 128, 227, 260, 92, 215, 124, 150, 62, 295, 114, 230, 147, 43, 109, 190, 226, 109, 187, 229, 204, 139, 160, 167, 21, 126, 99, 85, 168, 149, 167, 114, 150, 88, 88, 128, 104, 367, 161, 144, 224, 50, 125, 108, 27, 121, 171, 33, 14, 43, 115, 189, 62, 153, 72, 75, 52, 116, 181, 166, 221, 238, 43, 73, 120, 129, 203, 136, 169, 140, 218, 410, 266, 16, 165, 170, 126, 138, 32, 165, 192, 183, 84, 225, 394, 181, 158, 97, 111, 160, 93, 280, 230, 71, 234, 184, 50, 30, 143, 245, 194, 75, 153, 345, 191, 59, 25, 91, 98, 171, 117]
-155A17l4j1N6
$$ y = [117, 83, 72, 128]
-190A28
##PAGE=	F1=-11234.5
##FIRST=	25169.313707327481097,	5807.6787752999953227,	0
##DATA TABLE=	(F2++(Y..Y)), PROFILE
5808A02o4R0Q1p9m0Q1j06J82r1jno4K0N9J8r1M6k0P1j51N0J07m9L0p5n1RJ41J3np1Qn9K02
5409B88k08J24p5qN4J56l13lQ2K5o0k6N4o3J68o2O4q7J13j26O3Lj41J46j26K05j17n8P2n1
5056I3q1J74p3p4P5Q1K3j75P2N7N4j02r6J4J28J26k06J65o4j53J38J2J82o4j70n7J02o3Ln0
4704G1P1r6R4K2j2j02N2L5k3L9k8J0J78p4j19p8JmR6l7J31k5j83O3j4R2JO5j27o8J0R1N0Q6
4305B68k35P2l6J10J74k32J38j36M9j36J9K6J45j46M2o1J54k11R0K5p0K1J09j29P6p5J5J38
3977B04j3j36J32J77k90K3K1k3RO3j16L7K7N9j7j00RJ44p3J43Kj19n5K9r2J40O3n1j32Q6j5
3613A36qo6N7j3J8K2l7m1L7L1m2J45R2k33j2J23n1M2n5O5j0j16J0M1J05O0j32j27K7j6J62
3249B14l0n6q0J36M5q7M4n7k3k4L2j8N2L3P2K5j51O0m8N0j62J13o0k8J11J3l7j0qo0j3j7O3
$$ y = [102, 38, 128, 209, 130, 90, 171, 65, 247, 156, 155, 150, 86, 106, 165, 183, 92, 138, 118, 189, 38, 88, 195, 146, 176, 101, 50, 59, 200, 213, 208, 137, 145, 86, 288, 80, 204, 129, 121, 175, 331, 18, 15, 97, 122, 62, 36, 90, 27, 195, 133, 197, 110, 223, 97, 160, 163, 22, 168, 42, 247, 130, 72, 144, 93, 12, 186, 113, 39, 114, 195, 218, 43, 115, 172, 226, 124, 28, 42, 170, 296, 90, 255, 191, 38, 176, 188, 370, 306, 136, 79, 181, 118, 121, 71, 142, 46, 140, 162, 150, 48, 100, 135, 112, 151, 123, 133, 311, 237, 118, 40, 41, 37, 133, 96, 227, 202, 19, 82, 68, 160, 161, 226, 99, 31, 41, 132, 182, 268, 33, 105, 69, 179, 353, 121, 259, 123, 172, 36, 55, 81, 226, 80, 122, 61, 215, 4, 94, 119, 49, 70, 179, 50, 126, 51, 66, 204, 191, 55, 187, 364, 74, 97, 118, 95, 104, 167, 51, 88, 115, 174, 157, 57, 66, 210, 137, 280, 282, 163, 108, 137, 45, 185, 248, 197, 65, 151, 136, 128, 62, 119, 106, 124, 146, 109, 68, 105, 136, 94, 239, 331, 98, 86, 209, 158, 200, 145, 210, 200, 84, 94, 135, 240, 300, 168, 41, 68, 52, 214, 184, 128, 48, 184, 229, 142, 186, 129, 106, 82, 114, 96, 148, 181, 253, 278, 127, 187, 139, 189, 27, 140, 80, 52, 163, 176, 139, 129, 121, 61, 48, 31, 94]
2862I4J55Lk32J7J08J40oj98K0Mm0J97L0j6r0j6pP9p1k8o2k2m3Q8R1q9J13j31K5R9j26j4M2
2474A14JL6o2J16M3jk18J30j48K2J42m1lJ22o2Pj02N6j23O2p8R7m0qJ06R8j04k1j7l4N3J5
2099A58j56O2M5m6J8PJ20j09m2L2n1N9j4%O4l1O9n9J91j88J08j00n2J0J64r4Nj00R9o3K1J9
1723A46j20Q9P8o0L5j12N5K5R7j66J21o9K8m2Q4q9m3k1J29r2K50o0j87j1K74j06j58j2pOP5
1359A37l6o4M5Q4l4o7N5Pm4Q2J5l1L9j37K39j41m9J8M5r0J26M4j34J39j48Q1j39K63j55K6
1007A76p8q9Q8M1J6o2J08Pqm6mN1j26K5J7l7K8m1L4oL9p2O5N8n7K68j89j9O7k18N0k7m6J12
608A25O2j36K6l0K8J03j24Q7k6p4J6K2J05j4L9N1k39N2N4QM5r7O8n2J07J65j60j61R4J2m2
244A14n1n2J02N3N3j29J59J52j76l7r2rM1m7K10o2j58J71m5j14l3R7O5o4r5P8J87j33j16r
$$ y = [94, 249, 252, 20, 37, 145, 285, 279, 81, 101, 105, 65, 262, 292, 276, 186, 170, 163, 242, 171, 143, 81, 59, 16, 104, 195, 106, 219, 88, 113, 212, 86, 72, 114, 115, 151, 89, 205, 248, 247, 29, 159, 11, 33, 175, 134, 131, 253, 191, 198, 96, 152, 29, 91, 13, 110, 70, 62, 168, 266, 162, 141, 124, 90, 143, 158, 2, 64, 109, 63, 81, 88, 208, 99, 57, 89, 38, 97, 83, 83, 147, 116, 185, 126, 317, 129, 237, 137, 85, 95, 259, 165, 170, 70, 169, 106, 127, 146, 26, 115, 193, 133, 168, 56, 111, 136, 233, 67, 188, 119, 147, 105, 189, 100, 57, 36, 165, 73, 323, 263, 76, 65, 339, 233, 75, 63, 56, 62, 137, 101, 37, 82, 166, 132, 65, 120, 127, 83, 165, 180, 149, 188, 51, 290, 149, 100, 118, 163, 73, 199, 243, 109, 248, 100, 181, 42, 305, 150, 176, 98, 9, 97, 138, 154, 92, 200, 207, 199, 153, 149, 200, 74, 99, 116, 79, 107, 66, 100, 94, 133, 61, 126, 184, 127, 395, 206, 187, 254, 36, 86, 59, 13, 125, 187, 51, 77, 47, 75, 178, 54, 141, 115, 41, 57, 79, 184, 170, 209, 260, 21, 73, 127, 135, 180, 83, 151, 99, 206, 371, 211, 50, 144, 156, 114, 63, 11, 113, 166, 219, 90, 249, 401, 225, 188, 96, 87, 128, 81, 291, 229, 71, 242, 197, 83, 50, 147, 212, 148, 53, 131, 318, 185, 69, 60]
-108F0j5L2O6l3j8l4L3
$$ y = [60, 45, 77, 143, 110, 92, 58, 91]
-190I1
##PAGE=	F1=-11336.7
##FIRST=	25169.313707327481097,	5807.6787752999953227,	0
##DATA TABLE=	(F2++(Y..Y)), PROFILE
5808I5n5J10J08q3o5O8j30J60o4K0n5jk9P2O4j06O9p1J59j98RO9J3K1p3p2J3J48K7J9m4j02
5432I6l3J72j60J45r5pM7J58k74J2L5N2o8m9M5l0J69j26J63p1Qj05N0J4q7O9r8K01q3j45J73
5068A78m4j23J39j6p8K8J21k0j06N1M6Q5j36p7J2J18J10j59J15j5j67J11L7J48p8j26k6K6
4740A54p5LLO9p8L2J2L0j13N0M2Jj4nN7J48j07m7j11Pj5P6k3J21n7q3N9n6P1J1L3j28J5k3
4340E9M8J04Q0k41K0K1J02J78k32J23j45O7j39j7Q3O1q8J9lJ25j92O1m4L9L4J7r1L0MK0J02
3977B05mj66J14J70l09N8JN2kM2o0l5P7P1oj56k4J58q5J18N5r0n7L5q7J00L7o5j13N1NP3q6
3589G7K3k5J0O2oj10J50K6r9J68N2j99p0J98jJ1j40M8m3j13P2k2J32R8j28j46P2j3J48l6o6
3225A30q5J36j0o9P8k0n0r5J59q4M9Q1L5nj07M8o2M3j48J48q3JJ56l8p7O7J9j24m5j7N7J45
$$ y = [95, 40, 150, 258, 175, 110, 178, 48, 208, 144, 164, 109, 108, 79, 151, 215, 109, 178, 107, 266, 68, 77, 146, 159, 180, 107, 35, 48, 196, 223, 242, 198, 96, 63, 235, 75, 220, 125, 118, 165, 323, 49, 61, 96, 148, 80, 31, 76, 46, 215, 89, 252, 181, 189, 84, 134, 148, 61, 130, 32, 233, 150, 5, 178, 134, 11, 150, 134, 56, 84, 205, 185, 79, 130, 176, 261, 125, 48, 60, 178, 288, 129, 244, 229, 62, 173, 210, 358, 280, 154, 128, 154, 79, 82, 85, 154, 76, 108, 120, 150, 37, 87, 129, 130, 116, 111, 168, 316, 209, 162, 51, 58, 43, 119, 96, 217, 160, 77, 136, 80, 151, 162, 195, 67, 82, 59, 107, 211, 291, 50, 70, 91, 193, 371, 139, 262, 117, 184, 45, 28, 111, 172, 84, 103, 100, 225, 33, 94, 50, 89, 123, 140, 49, 79, 83, 103, 205, 201, 35, 149, 319, 10, 68, 69, 121, 119, 161, 101, 66, 143, 214, 208, 52, 28, 186, 101, 219, 274, 184, 127, 162, 75, 175, 212, 147, 34, 85, 90, 163, 77, 100, 75, 85, 147, 141, 31, 181, 207, 108, 276, 328, 129, 59, 257, 256, 267, 127, 175, 132, 19, 91, 69, 201, 299, 171, 25, 97, 84, 232, 196, 130, 45, 181, 171, 102, 180, 160, 110, 15, 174, 90, 139, 220, 255, 250, 143, 191, 129, 172, 24, 172, 89, 90, 246, 208, 131, 198, 217, 93, 48, 31, 88, 233]
2850B33L8j80m3J16J13Rj84Kk2RJ84J9Nj03m7OJ06n9n7j8k8o8O1R5p0J16j56M3J06j52J0N7
2474A41n4K1m1J55PLj55R6j27L0J00j9NJ75q1p2j31P7o8K8l2Q3q3k4J45J04j37m7L9j8L2N7
2099B09j46j6R5p7L2MJ30j46%M7n6N9k7l7K9m1J01o6J97j75R6q3q1J01J22j02M5j35N6o0O5
1735A40pr5M1J25j06Q6j15L3K8J13j57J23m6L0j02O4r1K5m3J30r9K14q2k00J36K12j40j32
1406H5nJk8J05q0qK2L8m5m8Q5N0j19Q8PJ4K8j47K02j07n7N2J4j43J59M6r8J53j84J17j60K55
1031B92j04m2p8j0K3J3Oj1R6k3L4lk1N7q3q0O3m5k8l5K0K0O8m2O9O5l8K24j79MN4k36Qm8N
620A5J17N6r4L2o8k8J24j04R1mj30M5j9J25j6M3P4k38M7O6kK9j11P9p6J29J29j60p2M7K6%
244A52j07J9LR9O1j16J33J15j17m0j08l5L9k4K07p1j34J46k5o6l0N0J6n2q1R1J48r3j00J0
$$ y = [233, 271, 91, 48, 164, 277, 286, 102, 104, 82, 91, 275, 294, 299, 196, 149, 155, 261, 202, 145, 127, 99, 31, 92, 187, 117, 233, 77, 120, 226, 74, 84, 141, 87, 108, 67, 222, 229, 232, 77, 173, 46, 76, 176, 157, 162, 337, 256, 184, 53, 130, 62, 90, 58, 141, 58, 34, 179, 283, 146, 99, 138, 120, 152, 209, 63, 47, 142, 65, 97, 101, 231, 85, 85, 132, 76, 135, 108, 71, 100, 59, 160, 94, 291, 116, 212, 129, 48, 149, 271, 169, 214, 79, 135, 75, 140, 133, 38, 79, 204, 98, 184, 69, 102, 130, 243, 86, 209, 163, 193, 91, 155, 64, 89, 46, 176, 77, 291, 209, 9, 145, 357, 217, 85, 80, 81, 53, 158, 78, 70, 92, 130, 85, 37, 122, 172, 53, 141, 148, 162, 190, 43, 245, 138, 81, 133, 147, 4, 163, 209, 111, 264, 80, 197, 37, 292, 188, 146, 68, 58, 81, 94, 100, 89, 185, 162, 196, 193, 172, 229, 146, 66, 129, 84, 56, 21, 41, 61, 129, 87, 156, 221, 183, 407, 228, 232, 286, 50, 58, 10, 15, 132, 188, 94, 126, 58, 30, 154, 50, 141, 137, 7, 52, 33, 158, 142, 185, 259, 21, 68, 134, 132, 161, 50, 129, 53, 182, 311, 151, 79, 126, 152, 152, 45, 64, 67, 166, 227, 111, 244, 359, 242, 202, 94, 59, 98, 74, 281, 210, 76, 222, 197, 131, 101, 151, 167, 115, 34, 125, 273, 180, 80, 90]
-108I0q2O9L3k2Ml2j0
$$ y = [90, 8, 77, 110, 88, 92, 60, 50]
-190E0
##PAGE=	F1=-11439
##FIRST=	25169.313707327481097,	5807.6787752999953227,	0
##DATA TABLE=	(F2++(Y..Y)), PROFILE
5808G6j0J04J16r3p3L5j14J08l7Q1r7L7p3O5J01q6O9j09K33k19m8J8O5L0n9q1M6R0L7L9k1
5444B30j83lJ28j05J57j03J5%J51k00J5j0N9n5o7J4JK00k01K31l6q5o1J4K3m5J0p4J87m9j10
5080D8J39m2j29R7N8j02K6J13n5l0L6J9Q6j68j6j5J18Q5j24P5L1j63P3M9J00p3n9pm3q1J3
4716E9N3O2q0QnM4o4j7M9L8q0M0O7J20j18J5j38J1j4O2k1Q2o3K3N8p7J6L9j4j03O5m6j5J75
4317B31O5k30k4P3Q4J55k07Q4j44J05j42pJ03m8K3rRQ9j48J13j38J14N1q9m2l0P4PO8L0j75
3953D5L4J70k03kmR9j2K4lq6P6R8j0j97j0J21p4J05R4o2n2K3p1N4Mo8Nq5L3J27q0j8j5j3R5
3542A42Qn6J53kj41J81lj43j12K64O1m4k00J0o7j2M5p6J71R3j15j13Q6j9J39l7q1r2J26n8
3190A08l7R3K4p9n0J61j32M7J10j1l2n6K0o2K3r6J50r5O9J46q6q2J25L8j71o1J6%J25N7j07
$$ y = [76, 66, 170, 286, 193, 120, 155, 41, 149, 112, 193, 96, 133, 60, 125, 226, 140, 209, 100, 333, 114, 66, 84, 149, 179, 120, 39, 85, 175, 212, 251, 230, 47, 44, 172, 67, 224, 121, 136, 136, 287, 87, 102, 92, 151, 96, 29, 43, 44, 244, 43, 274, 238, 153, 92, 106, 129, 84, 94, 20, 207, 158, 48, 187, 145, 16, 113, 171, 69, 95, 208, 153, 123, 159, 178, 264, 96, 80, 65, 183, 268, 144, 219, 250, 87, 160, 209, 309, 236, 177, 170, 127, 46, 59, 112, 174, 94, 102, 97, 141, 77, 60, 109, 147, 67, 107, 174, 294, 176, 191, 53, 64, 50, 112, 91, 173, 110, 133, 191, 114, 130, 169, 155, 52, 117, 71, 56, 231, 296, 66, 42, 115, 199, 354, 147, 231, 87, 192, 50, 43, 146, 98, 121, 112, 121, 210, 62, 175, 37, 151, 202, 113, 71, 41, 115, 122, 190, 220, 45, 79, 249, 46, 44, 40, 139, 127, 151, 148, 62, 138, 236, 226, 29, 19, 140, 66, 171, 265, 203, 151, 174, 103, 157, 161, 93, 98, 13, 46, 173, 93, 75, 60, 47, 142, 150, 94, 247, 245, 104, 285, 282, 139, 27, 291, 352, 308, 108, 118, 51, 39, 84, 8, 179, 272, 157, 44, 130, 111, 250, 213, 132, 40, 166, 108, 71, 164, 188, 109, 59, 220, 88, 135, 245, 234, 202, 146, 166, 104, 127, 31, 181, 86, 155, 301, 215, 133, 258, 296, 125, 64, 80, 80, 205, 262, 155]
2826A55k9O4N9K8j29k8p6O4J63J3kr0o1mJ33k7r1L2l6j02O0P1l5R7j75P9R4j87N2O3j13J3
2451E5PJ56k2rq0P9j06M0L2J2J2J97q4j40r5O8j5J2m2P9o8rJ02R8j62n8J03l2K8R0j63l6J15
2063A64j01O3LJ18j51QM5l8M7j7p7L5o5R3m5J69j53Q5l5q9J32P0r7O7j17pm0O9j6p3LJ31j13
1676F8J28j27K3K3J18j22J15k9J5j51N0o4N7n3J32r8J42p0r6J53J40j54j01j8L9n1J12j42
1347C9P7rPp0KP1J02j91J02j2N8Lj32J44q0n1P9k1l0O2J1o2J51j94J40j72K35m4n1m0%n8k
960F4J2J3O4m5Q9M9k8K8k9j64Q0l5o7M7K7n4R0j5M9N6%J72j78M2M8k41jl2OJ04K2l8J9r2m6
549A6J09p3R4j3j09K3j1Q1k7O3Q5j84J3Q5m3L7j04P3r0J23Q8j37RjO3M6j22K4p2J34K6r3R7
162B10P1n1l7j02l9K7pJ80q6p9R3J5k0j2J1n3lp7R0Q6l0r0Lm8L8j3k1L8k3n9
$$ y = [155, 126, 190, 249, 277, 148, 120, 44, 108, 271, 284, 282, 192, 131, 127, 260, 233, 142, 174, 138, 36, 96, 167, 132, 229, 54, 133, 227, 40, 92, 155, 42, 55, 62, 218, 196, 187, 107, 186, 80, 120, 152, 164, 176, 373, 289, 149, 54, 122, 107, 119, 77, 156, 88, 79, 181, 279, 117, 59, 162, 130, 158, 248, 85, 49, 164, 63, 126, 129, 247, 96, 104, 149, 111, 158, 141, 64, 99, 34, 127, 82, 251, 98, 183, 148, 59, 191, 261, 164, 231, 114, 107, 67, 136, 120, 47, 50, 181, 68, 196, 69, 92, 115, 233, 111, 226, 197, 212, 61, 111, 47, 104, 51, 183, 85, 227, 157, 61, 214, 354, 200, 99, 81, 120, 69, 181, 39, 116, 107, 114, 44, 46, 117, 219, 28, 130, 118, 176, 179, 47, 191, 111, 60, 139, 118, 88, 150, 161, 99, 250, 56, 196, 24, 259, 215, 164, 124, 124, 66, 64, 76, 89, 153, 108, 197, 246, 218, 246, 217, 53, 133, 98, 31, 78, 105, 51, 141, 126, 175, 231, 231, 403, 225, 267, 315, 74, 73, 41, 47, 151, 173, 135, 154, 62, 16, 125, 52, 146, 133, 24, 47, 36, 117, 90, 153, 238, 54, 67, 152, 109, 146, 42, 115, 25, 148, 236, 99, 108, 107, 170, 216, 94, 118, 46, 180, 206, 113, 210, 281, 230, 193, 91, 52, 79, 72, 252, 166, 87, 180, 195, 175, 163, 174, 121, 118, 41, 131, 217, 187, 97, 100, 52, 90, 77, 56, 94, 71, 12]
-190A2
##PAGE=	F1=-11541.3
##FIRST=	25169.313707327481097,	5807.6787752999953227,	0
##DATA TABLE=	(F2++(Y..Y)), PROFILE
5808E7N0P9J03j10n4rq6N3j3J41j10N0p8K9J10m6O4j34K88k24r0k7P6N9l7q3N7J9M9M6ok20
5432CL5P2m3J49j02N2o4J30j14J9n4N2l4o8lrK45k08J98jj34j6k2J7j8no6J61j9r0Q9k0j09
5045B3Q5J03j34K3R0o6M0L1j3N3j77M4n4J34N4j07O4N5j48L9N1L9m6Rj1p9l7NP9N0j10J7j1
4657I5L2lq6L1Q7j43J04M3J01j19N2j47RqM7rJ7k4J01N5q1n8Q6o3o3O7k9p9K23M4j92j2N6
4270A34N9J14j63L2j28J45j34JJ10j25J40m7rM7r4J58j39J01O8j64j3o7J00lM4P6j68k7J16
3930A64q1m1oJ02k0K5M7j01J1J29j9j87M0K2n9J18J11l8m7lm1J0l4n8J05q5m3J39n6n3J4m1
3554B4J00J0K0J39n2j58J88o1p3r9K72J19j14k30m2N8j8kk8J06O2r5p0Q8j8J37l2j05q5J05
3202A46o5j8P9N7q9j6J48j49M2J14n4m7j3k3k7j2l6J28q7J39R8j31n3J62N2k01p1N5n8J03
$$ y = [57, 107, 186, 289, 179, 125, 116, 30, 83, 70, 211, 101, 151, 73, 102, 212, 166, 230, 96, 384, 160, 70, 43, 119, 178, 141, 58, 115, 134, 183, 229, 223, 3, 38, 110, 67, 216, 114, 166, 102, 232, 118, 137, 83, 135, 101, 33, 30, 21, 266, 58, 256, 255, 121, 105, 83, 100, 82, 77, 11, 172, 153, 63, 152, 132, 23, 108, 211, 77, 100, 190, 124, 164, 195, 182, 235, 58, 102, 48, 182, 236, 129, 193, 248, 100, 139, 190, 229, 183, 192, 181, 102, 65, 70, 149, 199, 89, 106, 95, 127, 124, 38, 69, 156, 13, 117, 160, 261, 142, 194, 47, 56, 48, 95, 86, 103, 79, 180, 235, 154, 96, 182, 119, 56, 123, 94, 15, 238, 282, 90, 78, 134, 193, 307, 144, 176, 48, 193, 59, 60, 170, 45, 185, 138, 129, 176, 82, 240, 101, 202, 270, 106, 93, 26, 126, 123, 167, 243, 75, 48, 164, 83, 42, 36, 138, 118, 143, 190, 89, 100, 229, 210, 23, 63, 85, 26, 144, 255, 217, 170, 167, 126, 136, 102, 44, 149, 64, 21, 160, 104, 51, 65, 24, 124, 134, 154, 293, 241, 83, 271, 210, 137, 38, 310, 429, 315, 85, 43, 101, 83, 81, 53, 159, 221, 126, 56, 144, 126, 263, 231, 126, 41, 146, 81, 63, 142, 199, 110, 94, 242, 93, 135, 249, 195, 148, 135, 112, 85, 73, 37, 165, 78, 217, 315, 184, 131, 293, 345, 144, 73, 128, 70, 173]
2850A73N1l3MJ9j0M7o9m7j08Q6J34Rl4n0n4k6J50J3j25P5m6j05O2K2PN9j76J13Q2k01P9N1
2474A52j33NM8J20m2k9j0P9p2M2m7M1J8J90p2j79%J9J0K3q7Q0l3LL4R3j69J3Q8o8M7J07k08
2087F3j3J18j05J03mR2j28j6K5mK7J4j07P0o2K0j4J26j26P4J0o9J22J4p8P1p5m3k9M4ko7Q
1700E9P1m2J10j41N9j8J03o6J00j9j7j77M8pL9n8J31p8M6ql8J60P6j50o4l5Q1j01J19j67J47
1336A63m2Nk4m0M9J49k23J01n7J05k2j24R5n4l3Q5m3O9J6o9l3J29j82J63j78K12Nk4Pk1j25
972E9j4J5K9K8n8J41R3l1j0K1j94M4j2o5O3O4p2O2j4L0L6M2J27j85Q7N2k38K1k6pJ01m0J8
584A67oj07pM8l6R9m9o2NNK7m1P6Q3j28NR6j09P4j02P6o7O7M4q3O5n3J07P8j37K4j11J38k2
185A64p5P0L2J0m3p5j1JJJ33j08%L0P7kJ5nj29O8r1P5K1M9r1k5j1K0m7k9P7j1p0
$$ y = [173, 224, 191, 195, 214, 204, 251, 182, 135, 27, 113, 247, 256, 222, 172, 118, 92, 242, 255, 130, 205, 159, 54, 116, 138, 145, 204, 28, 141, 223, 22, 101, 152, 19, 24, 72, 192, 150, 121, 111, 190, 118, 160, 113, 154, 172, 362, 290, 111, 111, 130, 140, 163, 76, 156, 123, 126, 160, 253, 84, 97, 185, 117, 164, 271, 63, 50, 168, 63, 166, 162, 254, 126, 110, 135, 131, 158, 172, 65, 135, 73, 93, 79, 205, 79, 153, 163, 94, 216, 230, 152, 223, 148, 105, 76, 120, 118, 51, 59, 130, 88, 198, 57, 116, 98, 201, 135, 235, 216, 199, 22, 70, 63, 102, 44, 175, 97, 143, 135, 97, 257, 333, 183, 119, 84, 165, 64, 183, 16, 163, 121, 126, 102, 62, 111, 260, 37, 138, 81, 186, 164, 40, 135, 81, 48, 133, 90, 159, 175, 106, 73, 202, 20, 183, 5, 217, 222, 198, 205, 184, 59, 45, 60, 89, 117, 59, 200, 293, 262, 252, 273, 79, 123, 111, 46, 109, 173, 101, 163, 149, 179, 215, 257, 384, 199, 286, 338, 100, 121, 95, 88, 189, 149, 167, 161, 54, 47, 95, 59, 158, 109, 47, 52, 57, 84, 43, 119, 202, 74, 79, 175, 66, 140, 38, 114, 47, 114, 158, 75, 140, 87, 194, 272, 135, 159, 48, 186, 164, 89, 159, 191, 201, 158, 83, 72, 73, 74, 207, 99, 99, 129, 206, 204, 219, 214, 85, 153, 62, 137, 158, 207, 116, 91, 80, 100, 53, 24, 101, 90, 20]
-190B0
##PAGE=	F1=-11643.5
##FIRST=	25169.313707327481097,	5807.6787752999953227,	0
##DATA TABLE=	(F2++(Y..Y)), PROFILE
5808F1Q9M6P0j30qn1m8RK7J48j02M9o3JP7%O5j44L18k13j09j4kR6kq9L8m2O4L9%j41J0J0L2
5397I1J07r5R3j00P6k8K5p4J9k5m4Ol0K52j64R7K7j36Ol7m%K7o2J10jr0M5J6p6J18J01j71
5010G9OO7n1R3L5l9qr7J7q8J65J9j09Q7M5j21J7M9l4oN5l1p3L8qP7K7j49M5j2J6M6r1l8J29
4599A57j23R8PR4j26O0j28nJ8L4jo3O3J21N1p3j30J42r8l0L4M5n2J41J6j39K3OL3O4j09k2
4223A08r2J72j06j6J09q0J58q5k9Rn6J78j15P5P6k01Pp3P9rL2J19j59M8o6J2l4k1P7k5N0Q3
3848B25r7p8J39j5j10L3l4l1J03J09k2n0k9Kk2o3n1J61l9q9Q7k5o9L4l9O4JR6J20j12j05J48
3472B42j05ro0K44J63j91k25j8J61r5j5%L4L1o5m1Q7pJ33j7j37n3P5k9k9M1P1o6k7J40j31
3108A02L8R0q7m6J3o4M9m6j2R1n2J80L0j56pJ76N6k11o7Q8j03Q2K3K9M7j7p8O2qm8q8M5R4
$$ y = [61, 150, 196, 266, 136, 128, 77, 29, 38, 65, 213, 111, 160, 97, 98, 175, 175, 240, 96, 414, 201, 92, 78, 76, 172, 170, 81, 119, 77, 141, 180, 180, 39, 49, 59, 91, 198, 103, 196, 96, 172, 144, 169, 95, 114, 89, 45, 51, 21, 273, 109, 206, 233, 97, 103, 66, 62, 62, 89, 27, 137, 136, 46, 91, 107, 31, 149, 250, 79, 85, 152, 101, 194, 229, 190, 182, 85, 102, 14, 179, 198, 89, 176, 221, 100, 117, 166, 132, 126, 181, 150, 77, 115, 107, 184, 211, 62, 107, 95, 111, 157, 66, 28, 157, 34, 132, 139, 233, 107, 167, 39, 34, 52, 86, 85, 22, 85, 206, 257, 184, 54, 196, 98, 68, 102, 147, 95, 236, 252, 113, 136, 142, 175, 239, 130, 108, 16, 188, 82, 66, 175, 95, 253, 168, 139, 148, 92, 270, 155, 230, 306, 105, 112, 39, 118, 109, 141, 260, 101, 149, 83, 95, 61, 40, 117, 92, 142, 225, 128, 50, 189, 174, 64, 97, 63, 32, 135, 244, 222, 172, 143, 145, 123, 60, 9, 170, 131, 42, 129, 104, 35, 69, 30, 94, 95, 191, 311, 199, 94, 242, 137, 128, 68, 312, 475, 284, 59, 41, 202, 107, 92, 92, 126, 157, 92, 51, 138, 131, 264, 247, 110, 57, 132, 103, 74, 115, 186, 120, 93, 233, 102, 140, 230, 143, 97, 110, 46, 95, 49, 37, 128, 76, 256, 286, 130, 123, 299, 355, 144, 77, 165, 62, 144, 167, 196, 243, 226, 148, 210, 202, 154, 66, 111, 205]
2721B05Oq0Mk3n1J53M3j49J05n1p4N5l8M5J2j12Q9Q5j34K3K2n2k3K3O6n6m6M0J02l0L6j02
2345I3L6K8J57n2j54O2k8J3M1j26P9j2K2m1Q9j50R9M0j09Q1J08k71M0J10q7J36j6O3q1n5k2
1981I3L5ON8j21J02o6l6JQ7r5N2L6l5J05m1m5O1l0m2m3K2K1p4L8j3N3N7j31J14q2O1OQ0j5
1582B19o4j37K6L7J5m0R1l4o0R7n0J71K8j31k3m1J02j62J12q4J28p2K7K7j10M2J76k29J04
1242A65j20J49m1j20O0pl9O9l1J16J1j45k7Q8r1J35j27J28L2QO1m4j67qk5N7Lo2J74J18l4
878B86l9N8j90j1J9m7L4J00n1K3l4J8J4Q0R1j97J30O5k20N0l1j7J08j11O5m3j12K2PNJ06j00
502G8qnKO%K4N6q2L6Q7j60J12j12Q9n4K2KnQ4j11J42R7j43K2j26J21n8o2N3QN5o8l2J9j8R
80H0P6j25P7j9J43k3M9jj92J27j13N8l0J23j02n9J4J7n1k4R2Mo9
$$ y = [205, 211, 131, 135, 112, 61, 214, 257, 108, 213, 162, 88, 143, 105, 150, 162, 50, 139, 224, 90, 113, 135, 83, 60, 83, 149, 93, 47, 87, 189, 159, 195, 93, 129, 157, 314, 262, 108, 170, 142, 155, 196, 70, 149, 137, 159, 118, 207, 57, 156, 196, 87, 168, 276, 5, 45, 155, 68, 204, 188, 251, 170, 115, 93, 128, 134, 192, 71, 173, 107, 71, 72, 159, 64, 116, 152, 117, 222, 181, 136, 197, 167, 125, 82, 104, 125, 51, 89, 76, 129, 186, 55, 169, 87, 148, 154, 234, 219, 155, 18, 44, 81, 96, 56, 147, 113, 53, 150, 100, 271, 299, 168, 145, 104, 206, 44, 156, 72, 200, 128, 155, 182, 72, 114, 290, 61, 165, 45, 194, 153, 33, 93, 86, 47, 116, 85, 201, 212, 67, 40, 128, 37, 172, 45, 173, 205, 213, 274, 230, 63, 55, 30, 87, 90, 28, 202, 320, 286, 247, 305, 115, 104, 123, 76, 110, 210, 159, 182, 148, 166, 180, 260, 351, 154, 284, 349, 129, 179, 148, 131, 239, 128, 193, 150, 38, 60, 67, 72, 178, 78, 70, 65, 67, 73, 73, 97, 153, 71, 107, 194, 34, 146, 34, 123, 69, 91, 93, 88, 172, 61, 203, 300, 157, 179, 53, 174, 116, 54, 107, 115, 170, 102, 70, 89, 71, 80, 156, 31, 108, 89, 232, 209, 258, 257, 65, 192, 79, 137, 107, 230, 128, 69, 83, 100, 49, 25, 117, 121, 52]
-190E2
##PAGE=	F1=-11745.8
##FIRST=	25169.313707327481097,	5807.6787752999953227,	0
##DATA TABLE=	(F2++(Y..Y)), PROFILE
5808H2J00J4K6j49O0p6%JN5R5q9L6n2MJ0M6P9j45L25j91j08rp3J10M6q9j0q5Q3K2jm0rm2J08
5397A34M1q9J32r2%L8L5n3k7o0JLJ2J89j18JM7j12Kk9l6M4N5o1N6kr4P6om7J64Q6k08k2M7
4986A07k2J21M7n5p6K9p3l7J39k1r6J11Or1J9L9j01J8P2n6k9J09j0N0nj71Q0k3J9O9n0m1P2
4599A50q5P1qR3j54N2q3rN8M7m0l5M7R7N1n4j61J69j05k0j0J49n5O5j8r0O3m7RJ7n2o5l6J66
4200A77o2n1R5kJ46j13k9po1J73p9M4P5k08L1o9M0j4K3J53j49J36j86K7ml8L5l0R6J00q9p9
3824H1M8J0l7J3j5oM6R2j7o7l7M9l3m9o3J44K6j22K9Kn9L0j6J4k2J57R9j55K3M7j21K3l2K11
3425B93J87k55j92R2J60j71kMl7L7k6n2Q3J4J12J2j74mM1Jl7oP0rq6J41q9M1M4j05l1K7j0
3038G3N0m8l6M1jJ81l3j13MJ58N2k07l7J03j29O5j4O4R4m5j36P3N4l4p3jM5Kj15N0K3o4J37
$$ y = [82, 182, 196, 222, 73, 133, 57, 57, 58, 113, 208, 119, 155, 103, 107, 117, 163, 242, 97, 422, 231, 123, 114, 41, 151, 197, 108, 98, 13, 96, 118, 117, 77, 68, 26, 134, 175, 86, 218, 126, 126, 164, 199, 146, 119, 59, 60, 63, 75, 264, 146, 147, 194, 82, 84, 55, 19, 63, 118, 57, 113, 111, 17, 93, 87, 40, 204, 290, 82, 60, 107, 85, 206, 253, 198, 122, 151, 78, 41, 180, 159, 63, 174, 180, 89, 108, 147, 46, 64, 136, 80, 51, 160, 150, 200, 195, 24, 104, 81, 100, 169, 119, 78, 150, 65, 136, 128, 221, 67, 119, 36, 27, 85, 132, 92, 57, 104, 201, 252, 198, 37, 206, 101, 81, 71, 220, 165, 230, 212, 122, 185, 138, 147, 164, 112, 47, 11, 177, 115, 64, 159, 157, 303, 190, 161, 154, 93, 266, 187, 231, 306, 98, 129, 60, 100, 86, 109, 262, 113, 249, 63, 90, 86, 48, 83, 53, 149, 249, 160, 81, 129, 139, 102, 115, 100, 94, 140, 232, 215, 148, 111, 160, 127, 78, 15, 159, 185, 63, 92, 94, 35, 65, 49, 63, 41, 198, 297, 142, 165, 212, 91, 114, 82, 293, 480, 225, 33, 125, 285, 114, 112, 116, 79, 116, 90, 38, 121, 135, 247, 259, 85, 81, 122, 123, 86, 80, 150, 141, 55, 196, 107, 148, 192, 87, 56, 83, 73, 123, 75, 39, 80, 79, 260, 227, 114, 118, 276, 328, 121, 84, 187, 58, 123, 109, 173, 267, 222, 86, 159, 213, 179, 106, 105, 150, 152, 37, 87, 110, 46, 183]
2650A83N5j59J23n1k5L8r0P1l3j5L0J09q0k7k4L9n3pJ6o6JJ5J42KL0j10j7M7J07l4p0O5o6
2263A46RN4j39P6k5N3j03Q1j15J52Mj40J12J01j92l6R4n5J48k5M2k2q7r9P4k3J10j19J22p5
1911A23o4jO4o7J2M2J6Q5q6nM4Lk0o6K0K7q0O5k8O6Rp4J36j35QO9O0j3j14m0j3M2J6j0J0K9
1488A30j01J43r8J80Mj06Rk9R8j77M9K7R1j01O6O3j71M7J79k22J14j18J26n6j04M0M9p7M3
1148I8jJ07K9j56n8L7L6Q1r0N4K9K8J19n6j87K4p5O5Jo7J78J21m1l8P2j66n9N2k8oJ09j0j3
761A89o4J2kJ13N9k12J68Q3j86P6m2k5J16j72R8q0j00J9pM6J08j44N5k5K4k6L7j9lm5R7N0
385A98j17Q1j15Q7n8J1j8M2Q4j62J50J07j29J0j10Q9n3n1K1KP4j07J9L4k3K0K0m8N3m2J92
21B61o9Q6J4k31J57j27L5m6J65j21q1K1K7l0lQ1K3p8
$$ y = [183, 238, 79, 202, 151, 126, 164, 74, 145, 112, 97, 127, 236, 156, 129, 105, 144, 91, 84, 100, 34, 35, 50, 192, 194, 224, 114, 97, 144, 251, 217, 147, 212, 146, 155, 209, 70, 146, 121, 174, 71, 152, 37, 189, 193, 53, 165, 266, 74, 38, 132, 77, 225, 200, 242, 220, 133, 34, 108, 85, 195, 76, 198, 123, 59, 58, 122, 55, 67, 109, 125, 210, 124, 119, 163, 166, 146, 80, 100, 127, 47, 112, 84, 150, 159, 85, 221, 86, 94, 163, 223, 210, 96, 56, 43, 85, 101, 91, 101, 130, 29, 172, 74, 254, 258, 152, 161, 132, 230, 53, 102, 129, 220, 119, 185, 248, 77, 124, 303, 81, 195, 77, 203, 147, 43, 83, 132, 55, 98, 97, 204, 233, 77, 19, 56, 92, 173, 83, 137, 166, 194, 313, 257, 70, 94, 19, 84, 85, 18, 196, 317, 276, 238, 310, 144, 85, 137, 109, 103, 212, 202, 189, 125, 137, 135, 248, 307, 95, 263, 346, 160, 236, 194, 169, 285, 113, 211, 131, 31, 50, 43, 89, 197, 53, 108, 83, 107, 81, 118, 99, 96, 51, 148, 198, 81, 162, 47, 134, 76, 87, 69, 111, 195, 33, 183, 290, 161, 171, 61, 150, 97, 46, 67, 69, 143, 36, 55, 89, 66, 86, 106, 58, 111, 69, 261, 192, 278, 292, 61, 218, 91, 126, 80, 245, 124, 43, 64, 91, 61, 58, 139, 162, 84]
-190H4
##PAGE=	F1=-11848
##FIRST=	25169.313707327481097,	5807.6787752999953227,	0
##DATA TABLE=	(F2++(Y..Y)), PROFILE
5808I8R6rk1j48J21q4L9j1Q0M5q2J1n2K8o2Q6J04j39L07j57r7l1o7N1R9o9o3k3J4K1k2M5j9
5420H9q0J68j9r6J66p0n2P5M6j4n1j14K6j4P1J14q6m5N4r6j1j5pP8L5o0J4k4l5J24q7l4K00
5033B50P8k34n1K8MJ24O2o1j13J27j77N0J00o1k5Q0m4o4N0J9m7m1J0l3nJ58Qol6j23P5m2M4
4646A04N6Rk2j4n8M8RR4k01M0k0K6N9Q0j05J9j1M8O3k6j22J34q4m1j5K15p7J6n2o6J06q9j2
4258A11qqo7KJ33j8q5O7O9J26j28qLj04J50m3J6O3j88O1o5Mk6J6J80j37K04k17pK0n2k0l6
3871HJ56R3q1k7q0N5%rK5J5MN8k6r3pQ0k8j9r6R8R8j46j4J4l5K3Rk1l3J56P8j38J36n8j27
3460F8K6k2J77J92k84j21J58J43k20PMr7J00rp9O5M4O2N3k09M5LRk1n1N5P1j61J31l7N1jj01
3073E1k3N5P2rm8l8j7L3J48n5Mm9J05M5j99K8Q7j33N6j8M4J27o6j77Q2J21k0o7m0mOj3l8N9
$$ y = [98, 194, 185, 164, 16, 137, 53, 92, 81, 161, 206, 124, 135, 83, 111, 49, 135, 239, 100, 407, 250, 153, 122, 55, 106, 205, 136, 73, 50, 64, 85, 63, 108, 89, 9, 177, 158, 62, 228, 158, 106, 181, 227, 213, 162, 48, 74, 60, 131, 245, 159, 114, 168, 72, 61, 46, 39, 117, 152, 92, 106, 82, 47, 171, 84, 50, 250, 328, 94, 43, 71, 75, 199, 261, 200, 87, 214, 37, 87, 187, 126, 101, 181, 137, 73, 123, 142, 95, 54, 64, 31, 26, 184, 192, 186, 150, 27, 102, 60, 104, 160, 169, 147, 133, 75, 123, 132, 226, 25, 65, 45, 71, 130, 210, 105, 124, 113, 161, 224, 198, 76, 210, 126, 85, 70, 285, 208, 224, 172, 106, 212, 123, 111, 103, 95, 28, 30, 163, 145, 60, 127, 196, 322, 194, 186, 189, 85, 235, 192, 208, 271, 83, 144, 79, 83, 57, 73, 253, 116, 320, 103, 96, 116, 64, 44, 8, 164, 257, 176, 149, 69, 124, 124, 115, 140, 155, 159, 217, 191, 98, 91, 171, 143, 124, 28, 126, 224, 78, 64, 78, 43, 66, 75, 54, 21, 177, 255, 117, 253, 195, 68, 94, 72, 249, 441, 157, 36, 194, 337, 117, 124, 128, 31, 131, 122, 43, 108, 152, 214, 267, 58, 103, 106, 115, 94, 43, 98, 169, 8, 139, 102, 153, 152, 51, 28, 83, 155, 146, 98, 60, 43, 76, 224, 169, 173, 124, 229, 274, 75, 103, 190, 57, 113, 95, 139, 266, 200, 23, 105, 226, 206, 139, 99, 95, 101, 88, 50, 109]
2674A09o1J11M8j42J21n1K6J1j19P2n7O8l0J44m8n4q0J21q7k8mk4M7m0J44J5L1j01p3P7N0
2310A96l2K7L8r2RN5j32Q2p2R2j15M7o1J40oj46J21R3r0j20Q1k5J30k1K7M0j05j22N0o7J61
1946A83j03J22q0q3PN5n0m4N4O4O1j17L7K2J8Nq2M6Np5P9RNj8PJ24j57j5Q1M0j1j33L1l6K5
1535G6L9Rp1R7n9R3j44J67Qq5K4lP4j32m9J33M2j26J16Q0k06M9J66k04J19p6P7p4q3L7R0j05
1160G9PJ1P6N1j26n1K1P1M7p5NoL1J72n1j91O0o8J8J9p5J51J06m9kO1j35q5P5qk1O9L2l9r0
749I0QoJ34L3k31J95J01j34R1n4l3J14k09J20j08o1k7JQ2R5j69J26m9M9o2M1j9n9jJ32j1m6
373A33M7j04O8p4K2oM0P5j81J19J04r1j4o1N8qm9k4j4P5o4JK1j6L5k7L5J1m5K12j13J18K8
-14C11k42J56j21Jj5J54j46o6J6L4qK1O5L8q3
$$ y = [109, 48, 159, 207, 65, 186, 135, 161, 172, 53, 125, 68, 136, 106, 250, 202, 148, 68, 189, 102, 74, 70, 46, 93, 53, 197, 212, 243, 142, 69, 146, 196, 164, 191, 229, 137, 146, 201, 69, 151, 79, 171, 56, 103, 42, 182, 176, 30, 151, 244, 154, 34, 115, 90, 220, 199, 226, 266, 161, 39, 89, 22, 183, 80, 202, 122, 39, 46, 101, 51, 7, 61, 125, 186, 69, 106, 128, 146, 151, 69, 115, 120, 45, 124, 133, 138, 120, 127, 251, 94, 79, 160, 200, 189, 56, 87, 51, 76, 115, 124, 53, 150, 91, 184, 40, 207, 215, 130, 154, 151, 225, 93, 44, 177, 219, 93, 209, 289, 83, 132, 298, 94, 213, 137, 214, 140, 57, 94, 184, 79, 86, 97, 173, 224, 98, 47, 68, 139, 186, 111, 116, 110, 141, 313, 262, 71, 131, 63, 81, 100, 25, 176, 282, 233, 231, 292, 157, 72, 147, 139, 118, 187, 219, 180, 90, 98, 92, 226, 259, 28, 223, 324, 190, 281, 227, 194, 308, 99, 219, 111, 50, 23, 24, 106, 201, 32, 158, 109, 158, 96, 137, 118, 59, 58, 190, 179, 133, 180, 76, 144, 70, 92, 86, 126, 201, 20, 139, 243, 152, 138, 77, 135, 127, 78, 54, 40, 115, 51, 52, 73, 57, 92, 65, 100, 111, 66, 278, 165, 283, 311, 69, 225, 104, 105, 90, 244, 98, 32, 48, 82, 74, 95, 160, 198, 115]
-190A15
##PAGE=	F1=-11950.3
##FIRST=	25169.313707327481097,	5807.6787752999953227,	0
##DATA TABLE=	(F2++(Y..Y)), PROFILE
5808A03Q1k2n8l8O9q7P3l4R9K3p9k4o8O0l3N3J18j29K63j12p9q0ql9J32k5q7L1l4M5m6N6j8
5420A06q7J83m5j11J77n5o5R2N7K3n8j19j3j8J08M7p5l2N4j04kk8M9J01Jo1j3n6K4J58j38
5056A00l8K11Q2k36p4%K1J10P7o4q3J54k36R1Q0q6M2L4p6m3Q5kL0m8p3O0j01J67M2q4l0m6
4681F6L8m4P1J4N7jr8l5L3M1R3j98j4M7N3M2J17j60N0n9k2J00np0Q9n1q2K3K25j05Jp9p1J45
4282B11j07k7J6j3l6K9P6J4j04K9J20J01j31K3K2j55J15j0mM5j42Q0o5k0m3M3J81j26K27k22
3930A27J1J1o8o8K4J47O0p2K3j50P7Jk3O1L9j4J3n1j12O2P8j6Kj18N5J51j56l7Qj4L8J2l1
3542G0RO1N6m6J76j24j65M0l5J40J79k51m0J69J16k26j5J3r2J31j4q5M2P5j8J06k35P7l8O
3190H2J2m5lJ50j14rJ2O5k3n9m5R2J08o6n5mm0KR8oQ7j01L0L5j84J21L4j20O1K5k4J26p8j24
$$ y = [103, 184, 162, 104, 66, 135, 48, 121, 87, 186, 209, 130, 106, 38, 98, 65, 118, 236, 107, 370, 258, 179, 99, 91, 52, 184, 159, 72, 103, 69, 114, 68, 124, 106, 19, 202, 157, 46, 223, 168, 103, 195, 252, 275, 217, 98, 85, 67, 175, 222, 147, 115, 169, 65, 63, 35, 84, 185, 186, 125, 112, 56, 80, 238, 100, 62, 273, 355, 119, 45, 45, 66, 176, 253, 189, 106, 260, 24, 115, 195, 109, 151, 185, 109, 66, 151, 149, 179, 131, 58, 118, 17, 184, 226, 142, 112, 66, 104, 60, 131, 145, 202, 201, 103, 68, 101, 142, 235, 37, 23, 70, 123, 165, 282, 122, 172, 113, 91, 191, 186, 116, 205, 154, 72, 95, 320, 215, 216, 137, 66, 211, 104, 77, 93, 80, 44, 73, 149, 163, 59, 88, 208, 309, 178, 201, 223, 68, 183, 173, 169, 214, 72, 152, 87, 67, 24, 67, 248, 122, 349, 127, 138, 149, 81, 13, 37, 184, 244, 172, 195, 45, 122, 123, 100, 161, 200, 186, 199, 148, 36, 98, 176, 160, 162, 44, 99, 250, 94, 57, 65, 51, 89, 101, 70, 79, 140, 196, 150, 326, 202, 37, 77, 42, 182, 361, 110, 70, 239, 355, 129, 114, 127, 35, 166, 152, 67, 109, 184, 166, 272, 37, 114, 76, 82, 94, 49, 46, 196, 82, 73, 85, 150, 127, 68, 23, 115, 223, 157, 102, 98, 58, 60, 158, 152, 239, 138, 168, 203, 19, 140, 174, 54, 115, 140, 116, 242, 164, 40]
2791D0J5J89j1p2o8l6N7N0r8L6l7Q7K7q6R1o0O7k3j08L4n0J08p2J73l6n1j31J72j14k6J5J8
2416A00L1l1Q8J8M2r9r5J13km9J03kr7J2M4j17J07j37J26p5J0%N4Kj24J01R0Kj81Q3oP8MJ1
2016B04J00j18q9Kn8J20p7R8p2j03N2L8m6LM1L2K4j24P3lJ2K7q5Q8l1o1Q8L2o7k3Q0R1j42
1629A06PL1K2pp9K9n2LO7J1q3J13l8N5j33Q5M4q0K1L0L6o3o8J52j0j44J68P7k06L6J48j77
1254A01J09l1M3r5o2L8J20j11l6%M3O1q4j6L7N0L3p9mo5J6K05k4j85Q4n4j8N0p8R2Q3n2N8
866B29L2j09q9Q0J3llN5n2r3MjJ35J5j64J22J15p2R3o6m4J01k23J39j17k0n7j1J11N6j67J92
491B01n0Lp7M6J5l4QJ10q5K9K3q0M4r6L6J1K7N9j49N8O9l4m8QM9L2o9k4m6M2M4m7j8qN5o4
68D0P2Nm1J97j27J30K9k27J39r0n2M1J09j67j1K5PjN4M1M3p7
$$ y = [40, 55, 244, 233, 161, 93, 57, 114, 164, 66, 102, 65, 152, 179, 93, 184, 124, 191, 168, 60, 94, 44, 152, 80, 253, 217, 166, 35, 207, 93, 67, 82, 100, 131, 100, 188, 206, 248, 149, 54, 167, 165, 116, 219, 217, 120, 132, 176, 59, 166, 29, 155, 80, 90, 90, 144, 146, 22, 123, 213, 215, 34, 117, 111, 189, 193, 204, 304, 186, 97, 99, 41, 161, 84, 182, 110, 7, 59, 97, 51, 54, 95, 127, 151, 27, 100, 97, 109, 136, 51, 139, 108, 47, 135, 167, 100, 77, 157, 248, 106, 113, 144, 166, 159, 80, 109, 57, 60, 127, 138, 55, 168, 130, 185, 52, 137, 181, 101, 122, 152, 188, 125, 57, 209, 199, 55, 223, 300, 94, 130, 278, 101, 210, 179, 222, 127, 65, 103, 223, 112, 76, 76, 119, 180, 96, 80, 117, 167, 200, 121, 117, 52, 68, 273, 249, 64, 148, 94, 76, 126, 48, 140, 223, 171, 229, 261, 152, 63, 143, 156, 153, 150, 205, 153, 60, 64, 63, 198, 213, 49, 171, 286, 214, 307, 241, 197, 298, 75, 214, 97, 77, 20, 9, 120, 176, 9, 201, 151, 154, 77, 123, 138, 104, 112, 222, 137, 166, 189, 109, 153, 57, 93, 104, 131, 190, 41, 99, 168, 134, 86, 94, 143, 175, 106, 82, 36, 78, 122, 75, 57, 49, 104, 40, 112, 117, 76, 273, 146, 276, 305, 78, 217, 127, 75, 116, 225, 58, 47, 72, 79, 78, 132, 173, 216, 139]
-190A39
##PAGE=	F1=-12052.5
##FIRST=	25169.313707327481097,	5807.6787752999953227,	0
##DATA TABLE=	(F2++(Y..Y)), PROFILE
5808I5N9k3p4N7Pq1R4m9R5K8p3m6o9N0P5JQ5j09J95o2n4j36N9l1M1L6q2N6m6N4n5K8j1o1J44
5397A97k9r6J36n8n3J07O5M8n9r6o8KJ01lp9LN7j22L0o0R8J24l1o2l4o6L7J79j36n2J86R7
5021C63k08q8m9M4Q3Q6p2j2J39k27N8Q4r3P0Jq1k1J03j4P5l4n6M0j65J39Q3j58P6o6J1k2R0
4646A79k0N5J5j66rL4O3Q7j62o5J01N2J0J50j86O1q5j03J69j3k9N0j8j28P0J98j20J3r2j03
4294HJ75r5k5O1n8k2Q5RK4r7j2J42Q1j20M3M1j96P5J8qK2p9P7p1l1l2J06J37j15J93k14O9
3918A91j3q7o7N3J27No4N5j45N8j7j2P6N8j3k9q6k2M6O3oJ5j19M9J47j47n7%pP0ll5M0j8K6
3507A32N9J73j41k04O5p3Q6J56j55RJ51Q1j88p2L5m5J13k2p3L3J06j17J67k40P5n7oL8J1n0
3155D7J65o2j16K6P4j3k5o8J23J13j10o6N6n1n6M1Q6J09j23m5K4o2J20m8q8P5P0p6Q2q1l3
$$ y = [95, 154, 131, 57, 114, 121, 40, 134, 85, 180, 208, 135, 89, 20, 70, 145, 146, 231, 122, 317, 255, 201, 65, 124, 93, 134, 170, 88, 144, 98, 152, 97, 125, 114, 53, 197, 168, 72, 208, 150, 97, 204, 269, 317, 258, 162, 94, 96, 197, 194, 115, 118, 175, 53, 83, 23, 121, 245, 214, 152, 118, 52, 89, 268, 132, 80, 266, 363, 155, 67, 18, 62, 145, 231, 159, 147, 286, 59, 117, 201, 108, 178, 179, 98, 77, 180, 166, 241, 207, 151, 191, 26, 165, 248, 90, 166, 100, 111, 89, 179, 159, 214, 229, 63, 54, 88, 151, 238, 76, 11, 112, 164, 174, 324, 138, 199, 114, 11, 180, 167, 138, 188, 170, 42, 112, 310, 190, 203, 111, 8, 183, 88, 63, 124, 66, 44, 129, 138, 162, 65, 53, 195, 276, 156, 199, 240, 44, 119, 137, 129, 151, 72, 149, 78, 47, 15, 121, 258, 143, 336, 122, 191, 178, 91, 24, 77, 204, 209, 145, 200, 55, 113, 96, 84, 160, 218, 205, 176, 90, 68, 114, 177, 171, 186, 67, 116, 263, 116, 59, 59, 52, 122, 119, 84, 124, 106, 132, 191, 364, 223, 19, 84, 11, 97, 253, 98, 107, 258, 339, 151, 79, 114, 69, 182, 160, 87, 120, 226, 109, 276, 36, 111, 54, 48, 86, 97, 47, 212, 150, 34, 60, 134, 121, 96, 28, 151, 264, 154, 88, 144, 93, 37, 78, 164, 273, 150, 105, 129, 67, 187, 139, 51, 126, 196, 120, 202, 121, 88]
2791H8o7K43j0q2q3l3J21L3j07k0RP6Kk7O5r0J00o0o0l1l2J05r0J87l8j8j15J29j30J6K3L8
2416A42LnJ4K6N7j09o6J39m0q0J45m3q1J1L0r4J38j40Q7l5K5L1m9lo4N5Q2P0k07Q8J1MN0j8
2016A74J53j28n6j3m0N0m6M5m4m7M6Pn2O0N8l6k3r0Q5l0qL8p2J24n8m2R6K4j06j2J05M8r2
1629A18K9k9OJrLn7j5Q4lk8P5k9L3q1k3R1r2MN7j1Ol0J19n8j46K11N8j79J3J31j45Q1MK7j06
1207A10m4L5J44j02q0j9L3L4m2L6L6L2L3r5J7q7j6J76J8j61P7l6l1Q2o9RQ1m3J07lj02q5P2
819A17L6K6o3M8n2n2Rj1J02Rm8LJ08j0Q7p4n8P6k06J48j07J1m7m1J19nn8J49Kj80J5J5Q4L5
420A87j4O2j59J05%m1J7j08L2K9K2L4j01N6l8L0q4P2N8N7r4J6m6n3J42p5l9k5Q3r2O1L7l0
33A01J48j04J09J9j94J20m3j17R8N8j80M9M8l3rR4J0L6n9
$$ y = [88, 21, 264, 254, 172, 89, 56, 177, 210, 103, 83, 92, 168, 170, 143, 208, 118, 218, 158, 98, 67, 35, 140, 50, 237, 199, 181, 66, 195, 65, 81, 104, 142, 145, 140, 154, 180, 237, 128, 62, 201, 161, 81, 226, 183, 102, 113, 143, 49, 187, 47, 134, 99, 124, 155, 106, 103, 39, 94, 176, 246, 39, 127, 138, 142, 192, 174, 327, 199, 143, 130, 90, 140, 94, 139, 95, 48, 94, 101, 49, 109, 167, 131, 108, 18, 103, 73, 65, 103, 31, 155, 97, 55, 151, 175, 69, 57, 162, 210, 118, 147, 118, 124, 125, 116, 119, 62, 47, 131, 128, 100, 175, 146, 179, 98, 75, 166, 74, 78, 135, 124, 130, 100, 219, 161, 15, 226, 284, 105, 118, 249, 104, 185, 189, 216, 110, 66, 101, 245, 143, 63, 44, 77, 111, 69, 105, 141, 173, 206, 111, 128, 41, 25, 201, 219, 58, 135, 99, 68, 150, 81, 90, 171, 128, 235, 232, 130, 45, 117, 153, 179, 116, 164, 112, 60, 69, 58, 160, 169, 121, 124, 232, 222, 309, 235, 177, 253, 47, 195, 88, 99, 52, 11, 130, 125, 67, 216, 218, 38, 53, 68, 152, 187, 173, 235, 76, 181, 181, 140, 157, 49, 81, 110, 132, 166, 65, 121, 83, 113, 29, 101, 159, 216, 122, 138, 92, 39, 181, 106, 67, 42, 125, 33, 94, 131, 101, 249, 145, 254, 273, 79, 199, 156, 39, 137, 195, 15, 64, 112, 79, 70, 164, 174, 210, 151]
-190A51
##PAGE=	F1=-12154.8
##FIRST=	25169.313707327481097,	5807.6787752999953227,	0
##DATA TABLE=	(F2++(Y..Y)), PROFILE
5808G6L6j6m9R6m1o7R4m4O1N0n4l3k8m7J80j3K2p9J12j3j8j61Q9L1j13R4p1P9m5M0n3kjj8
5409I4O4J4m8P1q5l1J25O9O0n9o1j13L2O0l0q5K2O9j36N9q1J31J43n0o7m7m4pJ90q7o8J21
5033B25J21j55q3q1M6M6Q1q9P1J12k14J7J11r4N8j3p0RJ04j7Q4j7k6mj97J14J15j59J81j49
4681A27nnJ16j9j1K4j82JN1O0P1j30o7J31K2k7J75j83N8q6m0J15n2pK2Qj36Q1J40j02K9q9
4305I0l5Q2o0pQ4r5j8J40n4J5o4m3J28Q2r5L4O0k27L4N5kpk6O3p4k7K4J31R1j05J18j97J33
3918B28l7j02m6O4J07o0n4O3j12M1m7M6M9O5jn4j22J18k4O1rJ8r8O8J04j27q7J0j7R7k0l1
3542I1N8n4j7J32J51j21j49K7n9k9J03l9M4J13M4j20j22M2nQ3l2n0L9J34k13K25k19M3qk5
3190F7LO8n4J21qj16l5O4Orq3J48J02j38p5J28p0p8pJ28J05j16q6nP5R7j42k9P7J00j03J9
$$ y = [76, 112, 96, 47, 143, 102, 35, 129, 85, 146, 196, 142, 109, 81, 34, 214, 201, 223, 144, 256, 243, 225, 64, 153, 184, 71, 165, 94, 173, 128, 168, 115, 113, 112, 94, 158, 172, 124, 195, 110, 79, 204, 273, 333, 274, 213, 100, 132, 192, 162, 77, 99, 168, 32, 91, 10, 141, 284, 234, 167, 120, 76, 69, 259, 172, 104, 225, 346, 191, 108, 27, 73, 119, 200, 111, 182, 294, 80, 97, 208, 114, 172, 159, 89, 98, 202, 185, 269, 252, 226, 222, 25, 139, 254, 95, 276, 127, 122, 117, 233, 214, 203, 227, 45, 46, 97, 157, 228, 98, 31, 162, 184, 157, 332, 149, 207, 121, 81, 196, 144, 137, 159, 167, 31, 112, 252, 150, 179, 90, 55, 137, 77, 70, 154, 59, 41, 181, 127, 142, 78, 35, 163, 245, 150, 184, 244, 17, 51, 106, 104, 97, 71, 134, 60, 33, 57, 188, 279, 174, 292, 95, 228, 191, 89, 43, 107, 214, 154, 100, 163, 51, 92, 45, 91, 140, 205, 204, 150, 28, 146, 122, 183, 174, 192, 94, 162, 266, 139, 52, 62, 45, 142, 122, 91, 149, 95, 78, 210, 361, 240, 91, 118, 59, 30, 133, 94, 138, 251, 295, 175, 53, 95, 90, 173, 141, 91, 130, 264, 51, 276, 57, 100, 92, 67, 70, 138, 84, 205, 197, 81, 46, 110, 116, 107, 24, 172, 274, 136, 61, 189, 119, 41, 34, 162, 267, 151, 65, 60, 135, 232, 90, 61, 138, 238, 135, 154]
2815A54p6M0r9K58j0r8q1k0J70j3r4p8O7Q4k3J0N6j34J30q9np8n1Q2p8J80m3K8n9K4j15O5
2439A04ON6l0K3o7O3N2j21NJ52o8j09J47p7m4lJ8l4J29j08K6j9P1M4r8o9N3mL8J06j92P6L3
2052A59o4J11o9J98j40k1j7m7J7j6k8MJ4K9k5o1J07P6r7o8k3P1m3m2L9m7J34o5j6R7ro9pN0
1653A32J1k0L8p2pJ0M2j9m8k1Q3l3M2K4j7K4k8l7P1j09JL8m1M2J7Q9j03q3J91L3j38qJ15j15
1254A04M1K1K7r2l8K9J55r0j09J4L5l3j7O6K6J7M5j14M5n9J1K7O6j09K7j2k8J05m7o3J22k8
878A44J00k9j19p7M8O0N1q2J8m1J3K3l5L7J2O5p9N9M1P6p4p6M7j21J02p4K1l8k8R2o3P5M4
491A92J19o6L8k45J33J02m8Kk20J88m3J4j5r6MM7L2jm9R2j76Q9n1N4O7P7j08P2m3j24J83q5
115A35l9n3J09j17L0Q3k1Q3o0O7%j52J15Nj81J41K5j40M3P0o6k7J32j8J6l2
$$ y = [154, 78, 118, 19, 277, 267, 169, 88, 68, 238, 225, 131, 53, 120, 204, 181, 191, 247, 113, 243, 154, 149, 71, 20, 102, 24, 204, 161, 189, 130, 154, 39, 104, 110, 166, 136, 159, 92, 155, 207, 86, 91, 243, 175, 66, 213, 136, 92, 89, 107, 73, 202, 94, 120, 101, 172, 216, 118, 49, 102, 98, 136, 242, 50, 126, 159, 95, 206, 137, 335, 195, 174, 157, 110, 127, 111, 83, 87, 101, 130, 105, 44, 151, 227, 130, 62, 39, 110, 67, 25, 64, 17, 151, 86, 70, 167, 158, 89, 82, 132, 143, 123, 161, 89, 82, 92, 134, 115, 67, 46, 129, 96, 138, 162, 145, 169, 141, 104, 175, 66, 67, 105, 64, 106, 123, 212, 109, 26, 217, 250, 112, 104, 219, 104, 145, 166, 193, 101, 63, 92, 247, 157, 48, 62, 97, 64, 47, 113, 139, 156, 201, 87, 132, 73, 84, 111, 177, 68, 95, 83, 55, 160, 113, 50, 172, 144, 244, 215, 96, 19, 67, 127, 178, 96, 114, 73, 86, 109, 74, 111, 123, 188, 109, 168, 209, 285, 211, 135, 182, 61, 163, 89, 110, 72, 44, 136, 73, 148, 192, 311, 245, 283, 38, 171, 273, 225, 227, 7, 195, 152, 166, 151, 55, 59, 106, 138, 137, 88, 180, 4, 93, 42, 96, 163, 240, 132, 204, 161, 37, 220, 135, 96, 43, 152, 35, 65, 148, 127, 210, 150, 217, 217, 65, 180, 185, 4, 145, 170, 30, 73, 143, 77, 50, 182, 164, 180, 148]
-190A48
##PAGE=	F1=-12257.1
##FIRST=	25169.313707327481097,	5807.6787752999953227,	0
##DATA TABLE=	(F2++(Y..Y)), PROFILE
5808E7J2qOQ6n6n7O8j8jQ5k1kk0r9K23rl7m6L9K3K8j58Q1Q6k47J30o2J10m3J5l4l2JL2l6O2
5385A58K1J6j35j0J42O8N9n9k2j37N6J2m1p3OQ8j17M1o8J35J57n9o9n3pq1J97j7p5K3J46q2
5010B20n8r1L9JM9j00J43Q0k04PJ32r8J6j0n5M6R6k0O4pJ1n7j99J12J22q8K33k34j6mJ43P
4634B80j01J9j15l9O5M9M2j09j8J33l1n1J89j65N3p4J8O6r3kNK5p9M1N4l3J2p2M2k1k4J0R0
4247A66r4pJ48j01Lj9n8Q0J13o0kP4k14KP5ll3j3N1n8MM7J36N7r7L5j70J73n1j11j5O8Q3j17
3848I2m2M6o7M8m3Q5j4O2J2n3p2J59r6Q1k6J1o2Q1N8j07j13K8m1J10k8j2N6m9o1J54J25p9
3472B43q0qm5j5n1K4R2O6Nl9r1pPM5m9j8N4J55k82K64j84LO4m6o2J11m8O4M4q6o2K4J0mq4
3061A4J60Q7j47q4J95r6n1NM1J11r8n3o4J66P6k27N3N7J15j20l4o2Q4j02K47rj16n5j8K01
$$ y = [57, 69, 61, 67, 153, 97, 40, 108, 90, 89, 174, 153, 151, 131, 32, 255, 246, 209, 163, 202, 225, 253, 95, 176, 262, 15, 145, 83, 193, 150, 165, 131, 99, 100, 132, 96, 158, 179, 195, 60, 50, 192, 260, 319, 260, 238, 101, 157, 169, 128, 55, 61, 149, 32, 73, 5, 140, 297, 238, 169, 116, 109, 28, 225, 208, 133, 156, 302, 220, 162, 71, 110, 111, 160, 60, 203, 283, 79, 86, 218, 120, 136, 126, 71, 117, 213, 193, 257, 250, 261, 204, 5, 117, 239, 151, 384, 150, 134, 130, 273, 280, 179, 198, 83, 44, 109, 158, 200, 91, 73, 206, 175, 124, 313, 148, 201, 127, 145, 211, 118, 116, 121, 146, 67, 108, 162, 129, 141, 69, 111, 90, 66, 76, 166, 72, 65, 213, 112, 115, 96, 38, 118, 231, 171, 169, 243, 29, 31, 106, 103, 70, 57, 108, 50, 54, 101, 237, 294, 197, 232, 62, 235, 184, 73, 58, 126, 209, 92, 50, 96, 29, 77, 34, 119, 105, 167, 179, 126, 54, 213, 117, 198, 172, 183, 121, 202, 260, 153, 40, 68, 27, 137, 109, 97, 153, 104, 43, 197, 322, 243, 163, 155, 110, 95, 44, 68, 160, 226, 231, 192, 101, 94, 101, 146, 97, 79, 133, 288, 6, 270, 86, 89, 153, 107, 45, 156, 108, 172, 216, 130, 68, 92, 102, 98, 14, 174, 261, 114, 30, 225, 129, 78, 83, 124, 235, 137, 84, 20, 186, 262, 35, 88, 145, 260, 140, 106, 44, 128, 26, 273, 264, 148, 93, 75, 276]
2709B76n9p3j28J26J04m6K5N7j80J63j04L2r8p3L2j8J25l5O4Mr7m0O1k4Q0o4M1j18J30Jj24
2345D0R1J50q6j26J18r9Ol5J5M4Q4p0j2l1J23M3r5j35J74m6n9J12j41M0O1j01J63j32K31j52
1993A75J7k2p7K6J0r8N5N5J2n0o9J50Q4j50q7L8N2m4n8K4k0J02n5K0Q1m4jj0m6kN3L5r4kM
1582F4O3k9k4j6O9p5J10l4NJ8J9KK3j18K4l2K1l2P9O7j56jJ52Rr8j3R8r6KJ6L6m0n3K3J51
1171B34q1r9N8K9k3l4J5K5LO4j30N7l2L9q4Q6l9m7L1l3J06j3o1J51m5P4m5j46l0k7P7O4n2
784I2Rk8M5L4n3l5NJ71j09l5P7O5o6r0K3LJ7k0Nm0J5N3l7J33r6K88K35om72K5J41r1n6j41
385F1J52j08Q2n5o0l8O3N4m0MJ14j77K8QLN7R7j03J22m7j53J69p6l5n4J05j35J9J01k1L2k5
9A44L1k5j01J20L4j58R4L2j09J1Q4q3m5J50k9j4l
$$ y = [276, 217, 144, 16, 142, 246, 200, 225, 282, 102, 265, 161, 193, 95, 22, 54, 36, 161, 126, 190, 194, 97, 57, 118, 94, 174, 110, 151, 33, 163, 164, 40, 131, 281, 195, 69, 187, 88, 94, 59, 74, 118, 202, 132, 120, 89, 212, 255, 160, 25, 199, 153, 94, 206, 65, 105, 166, 65, 228, 96, 327, 175, 192, 170, 93, 119, 129, 31, 86, 141, 153, 103, 34, 184, 268, 118, 31, 69, 121, 77, 19, 43, 23, 125, 70, 90, 171, 127, 126, 116, 70, 68, 121, 156, 62, 60, 64, 127, 98, 74, 58, 127, 52, 162, 128, 133, 151, 170, 172, 195, 77, 101, 69, 90, 58, 137, 204, 48, 47, 199, 208, 110, 97, 195, 99, 101, 117, 153, 113, 60, 83, 234, 153, 54, 112, 141, 118, 84, 99, 124, 127, 191, 61, 118, 86, 125, 41, 127, 88, 41, 72, 39, 145, 132, 71, 222, 177, 251, 206, 60, 30, 3, 80, 144, 92, 101, 73, 118, 152, 99, 64, 69, 240, 131, 96, 173, 238, 172, 82, 105, 108, 125, 105, 110, 70, 85, 138, 101, 234, 138, 426, 661, 655, 183, 208, 349, 258, 202, 61, 213, 105, 187, 132, 72, 34, 97, 151, 111, 115, 229, 52, 80, 88, 91, 148, 245, 142, 264, 217, 64, 233, 157, 122, 68, 173, 38, 57, 158, 137, 169, 144, 175, 150, 49, 169, 203, 45, 139, 171, 62, 73, 157, 74, 29, 179, 150, 136, 133]
-190A33
##PAGE=	F1=-12359.3
##FIRST=	25169.313707327481097,	5807.6787752999953227,	0
##DATA TABLE=	(F2++(Y..Y)), PROFILE
5808D6j0oN8O2k5o9K8Ro5J18J7K3k4q7J85jp7j2%L3Q0j71Q3J08k75Q9m9J34m3kln8j4P6r3
5397F5O1R8j8j76j3J46O8M7o1J4j35O8j6l9l8l2J03o3l9k2J02J63n9o6m9L1j05J54M1o6r3
5033G1J66%k2j02N2l8j7l8J36M4j87N6J05j02m4Om4Q7P9k7K7j3M9j03r7M9J10oK64k94j8k8
4657A21J63L9j69lk6p9O1M7Kj03P4R9q8l3J79j52N3n9N5J8j03j0lL4k0K0n6Q2n1m7J07q3j8
4270E1K5P8n6OJ11j19J0Po4J8J68m1k3P6j88K4N0j7l6m2L7j0K7M7J15L5r0k8j15J53n2j05
3894E2K3N8N3j38J7j8j1N6J6M2q8N4K6k1j1J50j56J12m6pk1Q4J9r2j08K6m7Q0j3K1K8k8p5
3507C7J19J03l0j3l7k7Ro2p7J51J7k8L7k8m4j3jp3J6P2J63k39K01j36k9J11p1j15J29k7kQ9
3132B02l9n8j1pj5m3J30P8j29q1K19j25jMo2J44r6J3p5J59O2k25P9K0J16j24o4l3Q0r6K24
$$ y = [46, 36, 30, 88, 150, 125, 56, 84, 93, 28, 146, 163, 186, 162, 75, 260, 259, 182, 170, 170, 203, 283, 112, 195, 303, 28, 117, 68, 202, 159, 157, 154, 96, 82, 158, 65, 126, 224, 206, 30, 17, 163, 231, 278, 217, 231, 96, 164, 148, 109, 71, 39, 142, 79, 40, 18, 120, 283, 224, 158, 109, 140, 35, 189, 230, 164, 71, 237, 237, 215, 113, 165, 127, 110, 72, 208, 252, 65, 121, 226, 124, 80, 86, 42, 129, 208, 181, 208, 195, 244, 141, 44, 93, 203, 197, 461, 167, 149, 121, 284, 323, 154, 151, 125, 46, 107, 154, 156, 53, 127, 226, 138, 105, 284, 132, 185, 126, 181, 199, 96, 86, 83, 117, 97, 117, 61, 143, 92, 45, 152, 69, 51, 76, 154, 98, 104, 215, 96, 106, 113, 49, 67, 235, 194, 171, 247, 59, 83, 133, 116, 80, 38, 75, 65, 92, 139, 254, 289, 199, 171, 56, 209, 157, 52, 75, 133, 186, 48, 65, 47, 36, 92, 108, 150, 62, 116, 142, 121, 110, 260, 104, 216, 170, 163, 142, 226, 245, 153, 45, 71, 24, 104, 91, 112, 140, 112, 37, 156, 259, 229, 216, 179, 152, 161, 99, 22, 173, 190, 162, 199, 171, 127, 114, 113, 40, 56, 128, 291, 52, 253, 117, 88, 199, 128, 13, 142, 115, 113, 202, 163, 105, 94, 87, 72, 29, 159, 237, 108, 27, 246, 121, 120, 124, 62, 206, 110, 123, 48, 207, 269, 44, 123, 143, 259, 135, 71, 38, 118, 22, 246]
2768B46oj30j0k6K11q8n3j28J37J28o6K2N9k16K02j04L8j07m7jQN0oP4N9j93M1J9n6J16r2
2404H1L6k5J14r0p5J31J32r8j28P7j06M7o8J6J14K2k0k9n9J64K6p3j04K28q9j71R6o7j9R1
2052A54r9J91j90K49j59N5k6j32N8L6j11O1P0lo4o8J90Q0j99k9M1L2n2n1K2k4M6k6N5N2o3
1688I6N0oj31O1M0K5r0L1l5N7k5J1pN6j12J49q7L1J3M7M3pj23M1q9J12j26J45M7j99L2J24
1312A74lo9qQ3q9k4mN7K0p9K3J29p7n3P3J6J9n5o6N1k5Q7j24L2j7O6n2j0K7n3N7n6N1L2k3
901A10J61q8O8n5j49J3Jl7O5J6M4m3M3L7n5o3m8K51j16j35R9N8n2q5OJ05o1M6l1n8Q0J2L4
514A73J33j90M30O13m4p50j05J46j32j08n7J10j59J40r5j3n6N2P9p2N0J05j68mL9j7J7J16
185B33q1J53o2j65J40m9l5k3P0j42L3Q7l7J7j5K2m7k5R3L8j23M2P9j12k4Q7q0l2J15j9m7K1
$$ y = [246, 240, 110, 100, 74, 285, 197, 144, 16, 153, 281, 215, 237, 296, 80, 282, 178, 216, 109, 62, 61, 69, 119, 113, 187, 246, 53, 94, 113, 57, 173, 81, 117, 92, 206, 116, 41, 172, 304, 206, 78, 155, 49, 96, 28, 44, 158, 180, 160, 131, 72, 236, 262, 189, 85, 313, 224, 53, 149, 82, 63, 154, 55, 246, 56, 305, 146, 201, 175, 43, 101, 137, 26, 87, 157, 154, 90, 22, 212, 292, 93, 64, 105, 137, 85, 34, 56, 32, 78, 52, 107, 159, 96, 146, 140, 9, 70, 110, 135, 45, 76, 41, 98, 73, 84, 77, 133, 21, 170, 83, 114, 127, 174, 217, 210, 87, 128, 39, 151, 25, 170, 217, 18, 50, 174, 171, 102, 94, 177, 88, 64, 60, 117, 137, 58, 81, 210, 133, 80, 153, 169, 188, 133, 67, 118, 93, 180, 56, 88, 71, 137, 85, 75, 102, 49, 106, 50, 101, 133, 110, 271, 183, 251, 196, 47, 60, 61, 24, 89, 105, 149, 106, 149, 186, 131, 68, 20, 271, 155, 20, 119, 177, 125, 40, 46, 151, 90, 136, 105, 47, 127, 139, 173, 306, 116, 546, 1159, 1115, 365, 260, 406, 274, 166, 109, 219, 60, 200, 105, 92, 36, 88, 167, 95, 145, 250, 82, 78, 117, 100, 117, 233, 152, 305, 243, 78, 218, 169, 134, 111, 181, 39, 72, 159, 122, 139, 124, 146, 99, 74, 167, 205, 82, 124, 203, 91, 67, 154, 74, 42, 157, 138, 91, 112]
-190A12
##PAGE=	F1=-12461.6
##FIRST=	25169.313707327481097,	5807.6787752999953227,	0
##DATA TABLE=	(F2++(Y..Y)), PROFILE
5808D6k4j0R1L7K9q4j6J8l1O5M5L3k7m9J03Mq8J7KK1J27k07J04R0k52N4l7J36m4PJ6p2m3J04
5409A65m9k4J56l3j69j7R2P0K3n7M0j08O4Pl0k6k8Q2k3p3l3N8J59n5n6l3N9p7Q7N9l9j34J01
5021A58Q2J3j12Q3o3j03P5O3Qj53J21N0r7j07K6l0J19M9l7j3l3P9j22N4o0R5O8K83l22j1p1
4657I2J66O7j84m2N2r4K9N8m2p1J42L9j33L7J42j56O2m6P6l9p6j9OL4KL5r6J24j18NJ23r1
4282H4n1O2K7LJ3N3r5L3jo2l2K09m8kO0j75M0M2l0j9n6pL9L7L6P7K1q2n5m5Q5m0q8O3L6J4
3859A46p7N8k1l5N1N5mj54M5O4J9jJ35j90J34n8k8J5Q0j3q4o1qqj1M1M6j5j3m6L6R6J0L4n7
3448A81lK1m1j00J22k8n1R5K9n1l0n3p4J3Q6J56j83J36q3n0J24r5r7P8J0o4J11J9l8l2j9m0
3073D9J0P7Q5q9p4J89j53O1qq1J39j24P0q1J23O2j53N4k8J08j06p1%L9q6J84%j37M6l6K00
$$ y = [46, 22, 12, 103, 140, 169, 85, 69, 87, 56, 121, 166, 199, 172, 123, 226, 230, 142, 159, 161, 182, 309, 102, 206, 296, 44, 98, 61, 197, 153, 160, 176, 104, 61, 165, 116, 92, 248, 215, 46, 29, 121, 191, 214, 157, 197, 89, 153, 160, 130, 104, 76, 158, 135, 62, 29, 87, 246, 191, 135, 102, 161, 84, 171, 230, 191, 57, 158, 240, 253, 141, 224, 161, 58, 133, 196, 204, 51, 172, 222, 125, 18, 44, 14, 133, 182, 145, 132, 99, 178, 56, 110, 50, 145, 213, 496, 174, 163, 92, 258, 325, 141, 99, 151, 57, 86, 144, 102, 31, 173, 212, 79, 116, 258, 102, 164, 118, 194, 155, 79, 60, 66, 100, 102, 137, 41, 165, 47, 52, 175, 84, 33, 95, 122, 125, 138, 191, 96, 129, 128, 66, 34, 243, 195, 193, 253, 78, 118, 160, 130, 111, 55, 48, 87, 124, 160, 237, 258, 176, 121, 76, 161, 121, 33, 96, 132, 146, 69, 127, 106, 71, 122, 177, 173, 19, 64, 128, 147, 146, 281, 91, 225, 167, 139, 154, 234, 221, 137, 76, 68, 60, 49, 90, 136, 121, 108, 62, 98, 194, 204, 238, 181, 178, 199, 158, 58, 180, 152, 101, 196, 225, 174, 144, 91, 17, 30, 116, 272, 89, 225, 142, 92, 216, 121, 24, 102, 112, 48, 159, 178, 140, 108, 89, 49, 59, 136, 221, 132, 58, 247, 94, 155, 147, 66, 205, 81, 151, 70, 193, 255, 102, 156, 128, 236, 130, 59, 59, 98, 12, 196, 196, 59, 105, 69, 269]
2709B69r8l7j00J23J39p4LN6k41K48r6J4j00kJ1j6j3K3P4R6k11N1l1p4J64j00j7J02R0j67
2357H6nJ26R4j06j10L8j02O8p8J6J54m2M2l4q7J84om9m4K80j38k70O8J3o4R1o9J95k22K41
2005B70j56Q9k3j46L2O4q8M0O2j4o1n0K13P2k43M8K9K1q0k5J9l6j7K6O6L2n8O1Lo2N2m4Po5
1606C8O2q4L4qN6JN0j17J31r7K2K0M0P9k0j23M6j00J60j14J52L0j76m8J09On5qP4q8k8j3Q5
1218A16L8r5K4R6o8nO5%N9o6j18Q1o4J09j01j7k2R1J7j15P6JN7o2o2P5J7J63j42R5o0j19J3
831G7L7p1qR1Q5p8L9K9l5n0m7K06j19j01LN3l0l8j0J44j13J06o4p6J30j9R4J12j61M61R93
467A640o0j022k49J26j56j55PO1j25J34j16K0m1J8R7q7P8P3j56mM1j1l0J25n4J63q5j61J05
127A76pm1K7K2j43M5P6p3M8l5N2m7K8M5J7q3jJ40j24o2Q2o5lM4Rp0L4
$$ y = [269, 171, 134, 34, 157, 296, 222, 225, 281, 40, 288, 192, 206, 106, 104, 115, 99, 86, 109, 183, 279, 68, 119, 88, 14, 178, 78, 61, 163, 253, 86, 81, 207, 301, 195, 85, 123, 21, 89, 11, 27, 181, 139, 181, 147, 60, 244, 238, 189, 145, 425, 287, 17, 85, 98, 34, 125, 56, 251, 29, 270, 114, 203, 180, 34, 66, 130, 42, 82, 144, 130, 69, 19, 232, 304, 61, 109, 138, 159, 79, 54, 73, 37, 20, 46, 112, 144, 86, 147, 150, 88, 140, 96, 103, 38, 100, 16, 50, 42, 98, 99, 149, 32, 163, 66, 88, 108, 148, 227, 207, 84, 130, 30, 190, 76, 228, 258, 82, 34, 143, 149, 94, 86, 160, 72, 44, 31, 116, 154, 59, 83, 179, 111, 106, 171, 171, 230, 164, 46, 127, 63, 172, 71, 54, 32, 123, 140, 25, 101, 102, 159, 97, 35, 110, 127, 290, 148, 243, 183, 64, 77, 114, 43, 35, 126, 211, 133, 172, 201, 166, 116, 69, 275, 156, 55, 58, 111, 81, 43, 33, 177, 64, 170, 106, 30, 160, 141, 235, 347, 186, 647, 1640, 1580, 558, 309, 435, 279, 124, 131, 192, 67, 201, 85, 105, 64, 82, 179, 92, 170, 243, 87, 83, 124, 113, 83, 208, 154, 317, 232, 71, 176, 169, 128, 155, 177, 34, 79, 155, 82, 130, 95, 147, 100, 128, 173, 190, 107, 106, 246, 122, 60, 142, 77, 74, 118, 127, 57, 91]
-190I1
##PAGE=	F1=-12563.8
##FIRST=	25169.313707327481097,	5807.6787752999953227,	0
##DATA TABLE=	(F2++(Y..Y)), PROFILE
5808D9k7JQ7J3Q0q4n5QM0j1N2L5j6o%kp2L4L2LJ63k57J37M0j82M8n8J24m7M4J3p8o9J17J3
5397A69r4J72l4j53LPQ1j3m5N5n3L1P1k0l5k6O0J0o1r2J9J45n3m2mP0m9N0L9jo5o4J52L9j18
4986A51J19o0j56J34j8k7r8J63qp6q8k7L0R2jm2l5l9P2j6J18j69N3J30K82l12Oj26J43Q9j40
4622A44r3J04p8k5Q1p3M4R2l7j31J05J03j73P9l4R1r6m0j1K7K3j2O4n8P2j03M8P1p6p9J17
4258A46o4O2J2nk7L6k2m9j7J68p9O4K6j74N0M2k8Ro0m0M9L8K0L7J0p0m9J1J5k1o3R8Ml3QQ0
3836A84j6p1M7Q4m4j50kJ27L0l5J23j91J30n9m1L6Q7m9p9%n2M6r0R8M9n5j1On7R4L9M9o7K6
3437A86J9j7o5N9o7n1J24O5m3k2r6k5n8R6J30j23P5l2o5J06j07k6oO0m2K1P8j0n1lm7K5K4
3049A12J07n1q5J48j81J28k0j9Q5j54R4q7P0Q4p6K4p9R2n4o9J6mo2J16Rj31R0l9J72r0k4q7
$$ y = [49, 22, 23, 110, 123, 203, 119, 64, 72, 112, 101, 153, 188, 172, 166, 166, 164, 92, 126, 158, 161, 324, 67, 204, 244, 62, 110, 52, 176, 129, 173, 186, 108, 39, 156, 169, 75, 247, 213, 60, 63, 70, 151, 138, 93, 148, 95, 126, 197, 177, 142, 116, 176, 186, 125, 33, 52, 197, 144, 102, 98, 168, 119, 169, 208, 207, 142, 78, 230, 269, 151, 270, 210, 54, 188, 170, 143, 45, 208, 200, 124, 36, 9, 39, 131, 130, 88, 53, 14, 86, 70, 188, 19, 72, 202, 484, 172, 178, 52, 195, 284, 144, 51, 155, 77, 52, 133, 60, 104, 196, 159, 28, 133, 236, 63, 142, 108, 199, 103, 63, 52, 79, 102, 90, 154, 96, 168, 65, 113, 184, 108, 29, 146, 82, 144, 156, 151, 124, 160, 138, 89, 72, 240, 161, 225, 251, 77, 127, 169, 141, 150, 90, 50, 99, 137, 157, 194, 204, 134, 85, 96, 111, 90, 27, 125, 129, 96, 104, 184, 168, 97, 144, 228, 184, 34, 32, 159, 189, 154, 277, 86, 216, 157, 116, 152, 239, 190, 111, 111, 59, 105, 15, 113, 162, 107, 96, 102, 45, 139, 178, 227, 160, 186, 205, 188, 123, 182, 115, 64, 188, 253, 210, 188, 92, 67, 9, 105, 235, 112, 187, 155, 90, 196, 89, 63, 57, 117, 75, 96, 174, 164, 113, 110, 63, 88, 112, 219, 168, 83, 231, 50, 178, 158, 139, 224, 70, 164, 77, 147, 231, 155, 179, 100, 192, 138, 69, 85, 81, 19, 135, 144, 13, 103, 64, 236, 146, 122, 35]
2674C5J22J27o9k6M5k19K61q2l2p2M8K4m4n4K9R1J05j90K6p3KJ43r2q7J91O9j86K3J18L8j16
2310A55o8J0r0O1m9L3J38r6R7k6j04J76m3l3L7L17j89l01RP7l1P%J52k00J89j39J10j2q2r1
1946A4R2o0K5L5j6m8j3K04O8k71J13J1K4j18K9pm5%J0N5M7n5M5J1oN4j09k4l5Q1r4K0j0Q7
1547A14KN5j33J02m0m2N2j8J17k7j18M2o7J57p1J62J9j69j28R4L6m5k8Q0r3nJ0Q6Rp9QO5n0
1160I7K2M8j8Q1o2q6N5r4J20q0m2j0P0P0j46O0N3O7m9q6JM1J60j88J40n3r4%P2n5m5R5J15
772B59j21M3J2Ol6l3J23j21rr5K1J3pj9J51j38J45p7n0J09k9J31P1p2M25J290m6j219l93R9
420D33j51k04M4Jj2P9j02J8j6rJ01q0Q0L4j39PK2Pm7J10l0J53j13j35O3M0m9Q4j8j47M5Q5
45A54j15J05p1Q7l5N5kj8m4k1J86j30r6P3m5J8k9M3p5L6
$$ y = [35, 157, 284, 215, 189, 234, 15, 276, 194, 162, 90, 138, 162, 118, 64, 93, 184, 289, 99, 125, 52, 54, 197, 105, 18, 209, 278, 92, 115, 233, 271, 155, 87, 97, 7, 68, 19, 52, 190, 94, 191, 165, 61, 237, 194, 161, 198, 515, 326, 25, 34, 111, 80, 87, 87, 239, 39, 228, 89, 199, 187, 105, 14, 106, 46, 71, 106, 90, 42, 29, 233, 301, 30, 143, 154, 178, 60, 89, 82, 37, 37, 47, 102, 149, 94, 139, 150, 144, 198, 89, 65, 30, 111, 17, 37, 27, 114, 116, 171, 38, 140, 100, 58, 110, 92, 209, 182, 64, 106, 39, 196, 125, 287, 306, 137, 9, 103, 139, 94, 66, 146, 53, 48, 58, 144, 153, 74, 82, 147, 97, 119, 167, 149, 230, 168, 82, 137, 43, 163, 83, 41, 31, 101, 171, 25, 85, 138, 205, 156, 70, 71, 112, 272, 84, 224, 171, 77, 77, 149, 94, 49, 144, 259, 138, 181, 193, 199, 163, 130, 253, 132, 123, 28, 49, 62, 55, 36, 187, 49, 194, 117, 67, 176, 147, 278, 349, 277, 702, 1992, 1946, 727, 334, 433, 282, 78, 122, 123, 111, 190, 88, 106, 90, 81, 182, 102, 182, 216, 77, 84, 106, 113, 66, 176, 146, 299, 186, 51, 114, 154, 105, 189, 171, 24, 69, 154, 39, 144, 73, 160, 125, 180, 178, 160, 116, 95, 281, 151, 55, 128, 83, 101, 72, 115, 40, 76]
-190G6
##PAGE=	F1=-12666.1
##FIRST=	25169.313707327481097,	5807.6787752999953227,	0
##DATA TABLE=	(F2++(Y..Y)), PROFILE
5808E7l7K0O7nJ11o6q8pR9o4L5L6J2K5q4l5k4K4P0oJ81l03J69k8n7M3j17J12m9R6nq4p7J15
5409A36N7j19J45k3j34K8n6R1n9j9N6K5m2J43om5m3L8M6l7j53J1J05m7l0K3O9k8L4KM1Nj90
5021B4J87N4j20J48k6j61J16q9n6m2J81n3m3m6o2N7N4o9j3K9M9l1O7J09j57q7J54K58k65K6
4669A93j66Q2J02n6j37J22m7p9J11n4J09Qj09jN8P4j80R0k1J10r1p5RN1Nj8O5m3L6k8P5j1
4294A84m9r4J68j39Q2Lm1N0J4l6k8J5R0j23J62k6j77N8M2j0M2p6l5K7K5JJ9qm4k7M3j1k5m6
3894C0J30k9q4P8J01k8r7M9J02o9j08j9J50J8r1J19j61R9n6m3M7J14r3p7N6q8R4o7O5M1q0
3531A03k2O2p2K6O0L3o9N7ORk3Or2k7J23P2l1Rj10j4j00R9Q5p0K3J0p3O7j04N5l8Q0J5j02
3132E3J02J8p2L3l5J2k0J28k5j01J08j96J84k2L2M4j58P5q6%J44k2oj24O8L2q0K2l3l5L8K4
$$ y = [57, 20, 40, 107, 102, 213, 147, 59, 52, 151, 87, 122, 158, 170, 195, 111, 76, 52, 76, 146, 140, 321, 18, 187, 159, 102, 145, 28, 140, 91, 187, 182, 98, 21, 136, 193, 74, 219, 196, 62, 90, 34, 125, 66, 47, 103, 128, 86, 229, 223, 178, 135, 173, 219, 182, 29, 40, 145, 98, 68, 91, 160, 132, 166, 168, 209, 214, 24, 211, 265, 145, 293, 267, 106, 222, 133, 77, 35, 216, 163, 120, 74, 12, 69, 123, 54, 41, 70, 119, 88, 155, 264, 107, 20, 174, 432, 167, 193, 27, 109, 211, 155, 18, 140, 93, 14, 125, 71, 180, 188, 79, 78, 136, 210, 30, 120, 99, 209, 118, 43, 52, 103, 108, 90, 155, 112, 148, 120, 195, 184, 135, 41, 209, 70, 152, 155, 114, 164, 178, 142, 114, 129, 219, 96, 258, 232, 55, 113, 155, 145, 187, 111, 76, 103, 128, 129, 148, 140, 96, 69, 112, 101, 76, 30, 160, 131, 47, 125, 226, 198, 101, 150, 252, 183, 75, 56, 206, 224, 133, 252, 91, 190, 134, 91, 138, 252, 159, 82, 138, 50, 144, 77, 142, 183, 103, 81, 143, 71, 97, 157, 190, 121, 178, 184, 193, 170, 176, 84, 57, 180, 252, 221, 230, 120, 106, 6, 105, 190, 120, 143, 153, 80, 147, 43, 98, 60, 140, 155, 53, 155, 173, 101, 134, 99, 111, 91, 219, 194, 93, 201, 5, 189, 167, 199, 243, 85, 160, 74, 74, 218, 196, 190, 66, 134, 166, 86, 108, 75, 40, 78, 102]
2756A02n0L7k7J33o8j1p1J11Q9n2n6K2p9J65o7q5j6P8L5o9o7NJ32R1j68mr2Q9J17r3n2J45
2380B24N0j63L0J11l1j27roo2J7j5P7R6j23J15kj05J41p0l6J33L22k32k83j1P9J3p8R1O8j50
2016F4J26j14J07Mk9j10K5j1Lj0Rn2K7J63P9k69J48j5L9j37Q7m5m6L3m2N5Q6p6K8K1J4O6j34
1629I4m9k8Q3m6N1m2O3nP1j67P8K8j07J07p6J32m9j05L6k1J24j9J73J3j63j32RP8k7o7J05
1265A42r9K8J4Q1l2l4k6M5k9K3L5l7Q0m1k3Pr5J10p1k1L1K0P1r8k1R2Q3k0n4j20K6J61j84
878D4J51l5q8pJ03l5n1O8J33j63N1j1O7k4l0L3j17Q4j12m9O8l5oJ47j40J54o2k5O1k0J48J1
502C13K8L53J432lj286n17P9j10k43M4o7J28J9o4j5J5k2R2n4N4Nj14OoK3k3P8j7J27j41p1
138D3J1P3o1J36k5j62L4J08q5J01j01Q8k5P8l8m7k0j6K04j27j15O3k5K4q5O6o4L5
$$ y = [102, 52, 89, 62, 195, 127, 116, 45, 156, 245, 193, 137, 159, 80, 245, 178, 93, 77, 155, 190, 121, 54, 59, 191, 282, 114, 110, 18, 107, 224, 131, 79, 224, 274, 111, 141, 252, 221, 94, 85, 79, 17, 34, 19, 96, 192, 69, 184, 182, 77, 218, 148, 112, 245, 567, 335, 52, 41, 120, 133, 55, 146, 214, 64, 190, 76, 183, 187, 158, 48, 73, 62, 65, 55, 64, 12, 39, 202, 281, 12, 160, 145, 184, 47, 134, 89, 43, 76, 34, 89, 175, 99, 127, 148, 162, 228, 94, 45, 17, 100, 54, 105, 63, 126, 121, 192, 25, 103, 131, 24, 131, 55, 187, 138, 33, 69, 48, 172, 153, 326, 339, 176, 44, 53, 131, 104, 37, 142, 43, 71, 85, 166, 134, 100, 74, 119, 90, 113, 148, 111, 191, 150, 127, 134, 39, 149, 78, 57, 88, 108, 179, 81, 60, 152, 235, 215, 161, 41, 67, 228, 44, 195, 160, 72, 65, 168, 133, 82, 150, 283, 120, 171, 160, 227, 203, 173, 206, 89, 173, 61, 12, 80, 45, 39, 186, 46, 200, 138, 113, 174, 154, 302, 313, 341, 694, 2126, 2123, 837, 320, 399, 289, 46, 90, 23, 151, 170, 106, 91, 106, 84, 176, 122, 176, 181, 67, 73, 67, 90, 67, 145, 128, 255, 114, 43, 54, 127, 66, 202, 177, 15, 49, 157, 72, 173, 72, 160, 135, 213, 175, 128, 108, 92, 296, 169, 54, 117, 92, 116, 31, 97, 33, 68]
-190F8
##PAGE=	F1=-12768.3
##FIRST=	25169.313707327481097,	5807.6787752999953227,	0
##DATA TABLE=	(F2++(Y..Y)), PROFILE
5808G3n4L6M3j8J12l2r5l5J37q4j0M6N4L1q9q5M8n7J01pJ83k63J21r2Q4L5j68R0n9J51k7r6
5432G4n9R9P7j23J00kr9M4n4O3p9NL6R9j21J74J6m5p6J2R0j1k02L7M1k2k4K9O1j4K9l6P6O3
5033B58j98J25O5j21J58L5j68P6j39m8k6J77p4qk1p5P2K1p1N9M1N5%K8J04j27j03M7K16j90
4681A68M0j61nR6K6j42Q8j4p2J00k1J32q3j11R8j7N7j40O3j2J33l9j70L0Q0j6J5J6m7J9N8
4317A69J09r8j4j11K03j60M8j1l8J00k5l9jN0lj62K70r0j39L9K1K5P3j08Ko%k2M3l3Pk7N3
3930A25J2n5m8J62n3j06R5J15n7j05N4J10p5o4j4J45mj47J23j10N1n9l5N9J55j28q2Q8j05
3589D7J22m4L5L5r4l8J11m7o6Q3ko6Q1j1M1jk6r1jJ13N0k9N4r5k5j10R6K8l3j5L2o1J3p0J12
3178A28l3P8N2j17J5M3r5Q2k0ln5J35j1j13P8j02J24j2N7K2j49L8o2o6K16pl3j43L3J20r4
$$ y = [73, 19, 55, 98, 80, 192, 160, 65, 30, 167, 83, 73, 119, 173, 204, 115, 30, 78, 21, 122, 115, 298, 35, 156, 64, 148, 183, 15, 105, 46, 197, 170, 74, 15, 114, 191, 68, 168, 166, 67, 111, 57, 120, 41, 46, 82, 181, 60, 234, 250, 205, 129, 141, 231, 220, 18, 55, 96, 74, 50, 79, 140, 126, 155, 119, 195, 258, 60, 185, 250, 129, 287, 322, 154, 230, 91, 43, 17, 194, 120, 112, 91, 16, 88, 109, 38, 97, 138, 193, 193, 221, 325, 198, 95, 142, 358, 168, 208, 47, 42, 138, 164, 22, 110, 96, 24, 124, 103, 235, 152, 41, 139, 122, 179, 39, 102, 90, 223, 184, 14, 44, 124, 108, 123, 139, 92, 111, 169, 278, 180, 166, 55, 258, 98, 146, 135, 97, 197, 172, 133, 132, 182, 179, 17, 287, 197, 58, 97, 118, 143, 216, 108, 110, 104, 104, 82, 125, 92, 99, 72, 125, 137, 82, 34, 196, 143, 37, 132, 247, 190, 85, 139, 249, 174, 110, 96, 241, 237, 90, 213, 103, 154, 95, 60, 119, 274, 146, 64, 152, 47, 169, 125, 160, 195, 101, 63, 174, 127, 61, 144, 142, 76, 157, 146, 187, 186, 160, 69, 68, 181, 231, 202, 256, 161, 136, 26, 122, 150, 117, 102, 134, 73, 86, 16, 128, 95, 173, 225, 108, 123, 166, 71, 153, 133, 130, 75, 210, 199, 86, 164, 62, 186, 174, 231, 253, 104, 142, 80, 14, 230, 223, 190, 47, 80, 200, 106]
2815A06K2o0ok1M4Lk2%Q7l4Ql6O6K6k6o1k6P2N5n5j26O3P8M2r3n4k2J68O8j49l9p6J49R2j05
2404A38nP9L1j22L7J11j03j01J9j1m6j4MJ21N6j29R2L7r3R2q0n7K35K81k63k40pO5M0j24J72
2040B15l1r5P8q7P6J4Qo7n6M3j5p1P2o5K6R6J07k33J45n2O1j01J04p6k9K2p4R6Q3j10K8M0
1664A52j2Q8j20l4n7N2K2Q4o4K1j7Q8j83L6P8j11J29k3N3r3q4K8K8P1K4J78Qj47j08p1J02
1300A18Jj06J41r8M0RN8o1K2o7M1j9J0L2n0N0nL6m0n9P7p2K0N7J7K4k8j10J06J02J4k0j69
913G1n7J68q1N9rr5PJ18k3o4M5J41j94N8l4J35nm8m8r0J41j12l4N5q6M7J16j26J31k8j1QJ
526A56J55o2J14K57J386N7j196o04P6m4k22k6N4Q6l9l0n7M7j6P0j7Mmo8k8k0K0K0N1j1Q3j62
150C0L4J2K9q0J65Lj84K7J20l1Q4j24N8k2J00o1m8k6RJ91j14j12N0nJ1r2N4m7L8
$$ y = [106, 128, 68, 62, 41, 85, 88, 66, 66, 153, 119, 127, 91, 157, 183, 157, 96, 70, 142, 197, 142, 16, 79, 157, 199, 106, 52, 30, 198, 266, 117, 78, 2, 151, 243, 138, 133, 212, 243, 121, 158, 269, 166, 65, 84, 73, 27, 13, 17, 138, 194, 65, 157, 194, 101, 193, 113, 56, 291, 572, 309, 69, 62, 127, 167, 43, 215, 184, 89, 167, 80, 156, 170, 178, 111, 55, 98, 83, 12, 84, 19, 45, 141, 248, 15, 160, 108, 169, 68, 172, 96, 67, 89, 15, 111, 194, 84, 112, 152, 140, 228, 108, 74, 17, 69, 91, 175, 111, 132, 115, 203, 20, 56, 134, 23, 152, 129, 182, 89, 5, 33, 61, 132, 156, 334, 342, 195, 87, 16, 118, 119, 13, 154, 56, 96, 105, 163, 102, 124, 57, 98, 79, 89, 121, 71, 121, 116, 152, 112, 53, 130, 58, 78, 135, 152, 176, 148, 38, 144, 246, 260, 240, 71, 14, 182, 101, 160, 151, 56, 63, 181, 158, 94, 139, 280, 86, 144, 110, 245, 240, 192, 144, 54, 195, 83, 49, 104, 18, 65, 181, 55, 186, 158, 147, 155, 156, 311, 249, 363, 620, 2006, 2063, 867, 263, 339, 295, 73, 47, 101, 187, 148, 118, 61, 108, 92, 162, 145, 149, 145, 77, 49, 29, 49, 69, 120, 109, 192, 30, 64, 76, 105, 25, 190, 193, 9, 36, 156, 125, 209, 85, 143, 121, 221, 160, 112, 86, 95, 286, 172, 60, 110, 105, 116, 24, 78, 31, 69]
-190F9
##PAGE=	F1=-12870.6
##FIRST=	25169.313707327481097,	5807.6787752999953227,	0
##DATA TABLE=	(F2++(Y..Y)), PROFILE
5808I1o9M6K6k9P9Pn6n9J23o0q3P3Q4J4k9o2L5p5L7pJ72j84M3r9J61L3j47K9o2J70l9j18k3
5420B2P8Q0j27N0K9l8L7l4K8n4j7K4J59j42J09N0l7j20j0J35J0k12N0j4K1k2J8M4rL4o4R3
5045A71J00j82P0P3j20J48J04j82L3j61L2m9J14p1K4j7q1R0rM5M4J6L1O0k1R8q7j09n4J75
4693B85j08M1j52J5L3N5j29L8Pl1P5j2J40j61K3O3p6L8p9K3j0J52Qk15RJ05l4O1n5n3J1J34
4317B01J43j70K9j34K12j56Lk6kJ11o6m1L3Q3r4m8K30j53l7Kn9P1R8j43N8l1k5l9P8l2L9n5
3941H0N6M4p8o1J87o8r0O2J15r7r4O0J05o1k6kJ26l7j72J20n5Lp2j3O6K00j35j00R1j05J25
3578A74k0QL6j02n5J45j5j46J13l9n1Q1k8P7ql6n5OJ05J0l7R3n4l8j06Q9j8j8k9K1k3j5j7
3190D8J02l4Q6P1r3r5O0j14J32oj0o9J16j6j17O7j7O3JO8J2j46Pj5%J60k5n4j13LJ59j05J6
$$ y = [91, 22, 68, 94, 65, 144, 151, 95, 36, 159, 99, 16, 89, 173, 187, 158, 96, 131, 56, 93, 86, 258, 74, 117, 18, 179, 212, 65, 94, 32, 202, 163, 45, 22, 100, 180, 53, 103, 132, 94, 131, 97, 125, 71, 54, 78, 237, 95, 204, 254, 217, 97, 87, 222, 232, 20, 70, 56, 77, 55, 73, 117, 108, 142, 78, 171, 271, 89, 159, 232, 112, 260, 364, 182, 215, 54, 86, 37, 151, 80, 104, 87, 6, 96, 87, 132, 176, 192, 223, 283, 262, 360, 273, 164, 110, 285, 177, 218, 66, 81, 114, 169, 40, 78, 85, 54, 129, 117, 257, 96, 119, 182, 106, 144, 65, 88, 78, 230, 238, 23, 32, 137, 103, 164, 109, 56, 67, 201, 344, 174, 203, 69, 281, 125, 128, 102, 100, 211, 145, 104, 137, 220, 126, 78, 308, 155, 118, 120, 61, 132, 230, 87, 145, 114, 89, 50, 128, 96, 135, 80, 136, 180, 102, 41, 228, 160, 70, 132, 247, 150, 56, 116, 221, 160, 134, 132, 258, 221, 49, 169, 114, 117, 45, 32, 98, 298, 163, 63, 154, 49, 174, 154, 162, 198, 96, 41, 186, 171, 25, 138, 99, 48, 129, 101, 178, 170, 134, 79, 85, 190, 200, 163, 256, 202, 164, 58, 147, 129, 111, 82, 103, 80, 65, 48, 150, 116, 202, 273, 180, 85, 145, 31, 163, 157, 147, 78, 194, 178, 61, 128, 111, 174, 175, 243, 255, 109, 116, 101, 101, 261, 236, 182, 69, 72, 231, 126, 142]
2803A42r0L0n2N9J6o4M0L4J0K7lQm7Qj2o2J44m8m9l0L2N4N1j20j8j0J46N6j28q1l3J74O0j24
2404A20M4K2J1p8M6J18j61Jl3rm9K6j9J30L0j48O4Q4p3L8p3m2K85J97k76j86nP1L9j28K29
2040B75j11n4N8p1K0J7K5Oq1N3j6r1Q1o6JJ6J48j67J11r4P6l2Q3q9Kk9J0Q6K2j39M4O7p0J11
1641B02q2mp1j4Q8J09p2k6k7R3j50j9P6l4R8N2l1j23m3j0P5J6L5J75Lj22p4n9M0L1j02J44
1265A74r5L2RJ4o6O3r3M4j7j2M1m5j0L4P7p2KK5p4P9M9M3k9M8j82Q2J18M4J0j79l6R3j8l1
866A22J8q5K2J15k0q2K5J37k01N8m7J87K2q5j10jJ10j01%L7p4N3P6j04Q4J9j4l3J5J62j28
502A77J69J51J162J17r64o41R3K8j69p6J58J8q9k1r0P4OM0J9n6Qoq5N5n1L8L9j0L0p3L6N0
127A37l1n3J02M7j98L4J04J7Q6j47K7l7J13o5j7n7L7J54r5q7K9J4j2o2K2k7M1
$$ y = [142, 52, 82, 30, 89, 105, 41, 81, 115, 125, 152, 149, 157, 110, 118, 106, 44, 188, 140, 91, 61, 93, 147, 198, 78, 60, 50, 196, 252, 124, 43, 10, 184, 244, 120, 164, 186, 197, 119, 165, 283, 122, 123, 90, 81, 32, 58, 39, 169, 199, 51, 115, 199, 126, 164, 91, 49, 334, 531, 255, 69, 64, 135, 174, 46, 275, 164, 110, 168, 97, 117, 134, 159, 165, 84, 137, 121, 30, 111, 45, 46, 62, 210, 43, 154, 60, 136, 104, 187, 98, 100, 71, 81, 167, 189, 50, 94, 161, 91, 202, 120, 116, 45, 31, 119, 228, 156, 130, 103, 196, 46, 27, 103, 69, 167, 219, 188, 65, 22, 12, 87, 103, 138, 313, 316, 194, 120, 61, 101, 132, 30, 174, 79, 111, 120, 134, 68, 131, 38, 82, 65, 53, 94, 49, 39, 73, 150, 78, 80, 105, 31, 110, 159, 202, 173, 221, 39, 121, 239, 283, 293, 114, 78, 171, 153, 122, 140, 55, 77, 192, 172, 90, 115, 252, 51, 109, 62, 249, 271, 186, 76, 75, 185, 84, 84, 121, 47, 100, 176, 72, 156, 175, 161, 128, 143, 305, 177, 346, 497, 1659, 1776, 812, 171, 264, 292, 123, 47, 205, 223, 134, 113, 23, 97, 103, 143, 162, 106, 114, 108, 23, 78, 27, 65, 104, 94, 124, 51, 87, 137, 106, 53, 155, 202, 4, 38, 142, 159, 245, 98, 125, 88, 201, 136, 119, 62, 99, 253, 158, 71, 100, 114, 102, 40, 62, 35, 76]
-190G6
##PAGE=	F1=-12972.9
##FIRST=	25169.313707327481097,	5807.6787752999953227,	0
##DATA TABLE=	(F2++(Y..Y)), PROFILE
5808A05p8M8K9m2K1L7J2n9N9Mr6L4Q6j7M2n1M1o4m0k0J56j12j5j4J20L8j14Om8J34m1j23j1
5420B7P1Q8j39j6P7K5J7k0km3m3L3K10j26j8R4k5j60k3J69K7j85M2m0M3k4K9J6j5M5o4P4J13
5033B57j63M0Q5j10J20J53j94jj54J01n4J8m4M6l1m3P0l9J56K8j3j7J22n3Q5n0j04j37J68
4693B42n6L5j48M8K7K4j16J4%J0O2l6J36k05J44K2j02Oj6qk0J60L2j91k5J04m3R0j10k1l3
4329B6J86J64k17Q0j52J84j40l1k9M0R3r2n6O4J16j51O6J65k00P2j0j63R9J14j54J04m7k5
4000A06k9N5pM3q4N3P0q1p9J97p0p6L1J00j36o8O1R2l3jJ1J09q3j18O7j1k9q1N9J1K35j19
3624A95j23P3j00J13Oj5M4j05n9J51J5j87J31o9j6M4m4J15l9k8KjJ00l4l7R8jm3q8P1m1j1
3249A17k3k9K8J2l0R1m8J07O8n8j88O6j05J56Prn7P9m7j04P0M1J6NQ2%j51j0M1M9J17n6p0
$$ y = [105, 27, 75, 104, 62, 83, 120, 132, 73, 132, 136, 40, 74, 160, 143, 185, 134, 175, 111, 71, 51, 207, 95, 80, 66, 186, 224, 110, 116, 68, 202, 161, 38, 27, 98, 186, 47, 31, 108, 133, 150, 130, 128, 85, 42, 75, 285, 159, 141, 235, 210, 50, 27, 196, 223, 38, 80, 40, 83, 59, 88, 104, 89, 134, 70, 144, 257, 94, 134, 219, 109, 229, 382, 188, 187, 33, 134, 80, 98, 54, 100, 69, 26, 96, 57, 213, 241, 228, 211, 333, 280, 365, 315, 211, 74, 242, 186, 221, 73, 121, 148, 172, 56, 70, 70, 80, 142, 106, 242, 37, 181, 203, 101, 107, 91, 83, 63, 223, 255, 64, 39, 143, 100, 190, 80, 59, 26, 212, 376, 159, 239, 87, 271, 131, 100, 71, 111, 204, 112, 56, 120, 236, 85, 151, 316, 116, 188, 178, 15, 114, 228, 74, 178, 131, 106, 77, 132, 125, 168, 84, 137, 207, 126, 47, 244, 174, 98, 129, 229, 93, 25, 86, 178, 145, 144, 155, 264, 181, 63, 130, 119, 90, 9, 68, 79, 314, 195, 72, 145, 45, 158, 164, 149, 193, 88, 29, 180, 195, 8, 139, 70, 54, 98, 54, 169, 130, 102, 104, 103, 203, 169, 132, 230, 229, 186, 98, 169, 128, 117, 94, 65, 93, 105, 75, 166, 118, 225, 293, 235, 47, 113, 8, 164, 171, 162, 105, 184, 137, 33, 103, 144, 160, 165, 247, 247, 96, 86, 127, 176, 293, 237, 167]
2862A67p2J3J41j04%r2M5p0P2Qq0P9k0M7M6J6l9j18N8N8l6Q9j15n7P5JK0O3j45K2LJ04O6r7
2462A48j05lJ64J9j42Q6j1om5N5J34j88P7p8mo5O5l3J11K7j79M2J23m2j7n2K8K58Q9k73j34
2099D9kJ00J0j07K63j49l5N5o3m9J3K6R0p0L6mj19P5n1k1k2J53q6N8q3M9J8L6q2M4r4J29O0
1711B27p1j34N9Q5j11J03l5K6p4k3Q0J21o1p1k5P6j02j0mP1N0J11j07r7n8LR4j8LJ64Kr4m8
1324A32l5j2N7r5J45r0J1J4l9m3P2q7L7pl5M5k1j1j3R9p1N9l3n3J25OQ0o4J12k26L3J23O2
937B77L5j68jN0j9q8M0m5QJ08k3r1OJ21j74M5l0J88N0j28j34R2K7p5M0J5l2K9M3p3L4O3l2
549A58n7J0J69j56J77O0Q05J64o43o16J13Q7j09o8J76j2j28l8p2N7L9PM2j02K5O1j02J02q4
209F5oL6j1j7N2k2P8n6j7jQ4j65K9O1N6J07j67K2q0J15n1K2q6N1J06p8n0OK8l7k6Pj7M6
$$ y = [167, 95, 108, 249, 145, 145, 53, 98, 28, 100, 108, 28, 107, 87, 134, 180, 196, 157, 39, 97, 155, 119, 208, 93, 36, 111, 112, 132, 195, 50, 72, 75, 179, 245, 148, 43, 40, 204, 223, 81, 167, 156, 150, 105, 160, 294, 106, 183, 105, 101, 36, 101, 68, 179, 206, 27, 69, 192, 150, 133, 81, 109, 367, 456, 183, 49, 47, 147, 157, 50, 313, 164, 129, 184, 121, 72, 85, 111, 201, 131, 167, 163, 44, 119, 68, 47, 25, 178, 92, 150, 67, 116, 134, 170, 88, 132, 38, 167, 227, 156, 22, 81, 166, 55, 158, 123, 149, 75, 52, 132, 253, 192, 121, 96, 172, 70, 60, 56, 127, 177, 288, 181, 84, 26, 29, 123, 105, 108, 272, 274, 180, 132, 97, 85, 142, 47, 192, 102, 113, 127, 88, 45, 117, 30, 67, 60, 25, 70, 49, 38, 25, 124, 53, 112, 79, 26, 151, 157, 237, 173, 285, 59, 92, 215, 277, 312, 144, 143, 193, 174, 86, 126, 81, 89, 197, 174, 83, 89, 210, 36, 81, 51, 239, 289, 161, 27, 119, 146, 71, 111, 126, 94, 123, 166, 93, 127, 190, 158, 101, 111, 280, 124, 301, 361, 1166, 1330, 687, 71, 184, 271, 162, 94, 270, 258, 130, 92, 20, 77, 116, 123, 165, 63, 88, 149, 47, 149, 65, 59, 95, 84, 67, 119, 97, 175, 119, 102, 101, 185, 20, 49, 110, 166, 273, 106, 128, 48, 163, 112, 134, 48, 99, 205, 127, 77, 83, 111, 74, 48, 55, 38, 84]
-190H4
##PAGE=	F1=-13075.1
##FIRST=	25169.313707327481097,	5807.6787752999953227,	0
##DATA TABLE=	(F2++(Y..Y)), PROFILE
5808A08q0N1M4o1l7M7Q1m0j5Q1r6k0O6n3R9m6O8m5r2l3J31n9m7K4J00M1p6Mm1R4m4r1l1P7
5409A09J00j49k2O8O1kj8l1l8o7O4K42r9j61J44j5j30j0J16M2j52L8l5K9l3O8j6k7N4l6K9
5045A23J10j44K5R7q4Q9J53j93k2j15J29m8p4MN7n0NK9o8K42J6l8p2J62n5O5k9q0k01K06n6
4681A83L2j38M5O7j3j04L1l7L8O2q9J18j77J91or7l9N3l6l6J59K7j31l6P2l5R5j16Qp6J88
4317B03J61k34J34j57J29j19n4nP0N4q5o1M3J45j24J00J06k16J49jj47JJ17j20J11n2j6k2
3988A10J5J8M3j00M1Q3o2j01J91n7o9J6P4j50k7K7P4PQK0J08j33l3%Rl0l2P9o9K53r4j41N3
3601A31j01R8L4l6N2r6k3J00L9j66J13r4J3Mm7J33p3oN1j2R6o8rN3M8l8o0M5m8Qk1q3O0M3
3202A40m6Q5o9J33M4j9k33M4m8J18K2Jl2N2j00m3N0O0pj1J10l2j48j3Q6Q5Q4q7p6m6L3J16
$$ y = [108, 28, 79, 123, 62, 25, 72, 153, 113, 98, 179, 83, 63, 129, 76, 175, 129, 197, 152, 60, 27, 158, 99, 52, 76, 176, 217, 141, 145, 104, 198, 154, 63, 32, 109, 209, 60, 38, 106, 167, 165, 147, 116, 78, 11, 75, 317, 218, 57, 201, 186, 56, 46, 162, 204, 52, 90, 55, 84, 51, 119, 103, 76, 130, 94, 123, 233, 89, 114, 211, 127, 216, 369, 176, 154, 39, 168, 120, 46, 50, 107, 57, 62, 91, 23, 265, 281, 243, 171, 333, 278, 343, 314, 234, 33, 239, 183, 215, 77, 122, 189, 176, 72, 103, 66, 104, 166, 77, 195, 18, 209, 203, 106, 67, 120, 84, 48, 207, 234, 103, 67, 139, 104, 199, 83, 91, 15, 203, 364, 130, 264, 107, 236, 117, 63, 58, 128, 182, 97, 36, 79, 224, 100, 200, 306, 90, 239, 238, 91, 92, 209, 89, 200, 148, 132, 110, 125, 143, 186, 86, 127, 210, 148, 47, 238, 181, 112, 128, 202, 52, 25, 52, 126, 133, 141, 161, 269, 136, 103, 103, 112, 82, 50, 129, 60, 313, 219, 78, 131, 30, 128, 162, 126, 178, 82, 59, 159, 198, 32, 145, 51, 64, 68, 21, 154, 81, 75, 126, 114, 210, 142, 133, 186, 234, 196, 136, 181, 133, 141, 120, 37, 97, 140, 94, 179, 110, 243, 287, 268, 35, 79, 31, 149, 171, 172, 140, 192, 92, 49, 99, 159, 152, 141, 251, 219, 71, 58, 144, 229, 313, 226, 150, 104, 137, 253]
2826B53r8j9l6Qo8P5kq3J11o3O3N9J7o2j37R0R4k7K5j17l8Q9%j6Q0j61M6kO8R6o2j00J1J16
2427B10k6j56J19k0j0l2N5J60j77Q9r0Mq4R5m6Q1N1j40n1J39Ko4k8Q7K12j8k56o0k7J43m1
2063A21o4K67j44l8N7n7j03KPJ71m5J0J3j45N2j3l3K2P6nlk7K6Kk8o0R1r3J93J9j60n6K7P8
1664A60q4M1lM9o4JL1J12l1j00j5L8n7J9j6J11rJ40j73l4r5M4R3l8m3J51J5p8n0j0k8P2r5
1277E4J46q0j4J6p9lM3l9KL5l2J4j9M9o9O4j3O4q1j8J47n5J13p6J56k43j6J06P0N9j44K7K9
890B13m5j07N2rj9J01k0q1mQ7j21K6nJ46O8j56o6R9o9l2P1j2J0%K6l8PQ4o2o1j8J73j25J31
491B44QL91J81l02m40L3J15n0m0J42lj49o3j8LP6k4M6r0MJ24r9J24j18l4K8j5j7J11p5Q3n7
115A19J9r8R8r1J9MQ1J37j78L5j17R0j7M2r3M4O4p7j2j1M0n8J5Ok5N1
$$ y = [253, 155, 136, 100, 108, 40, 115, 113, 30, 141, 78, 141, 200, 217, 155, 18, 108, 202, 175, 200, 83, 45, 134, 134, 118, 198, 37, 83, 81, 149, 245, 183, 83, 94, 210, 184, 28, 147, 127, 117, 85, 140, 300, 123, 212, 122, 126, 42, 137, 91, 172, 223, 83, 32, 171, 173, 109, 81, 168, 380, 362, 106, 46, 19, 162, 121, 57, 324, 180, 142, 199, 142, 39, 41, 48, 219, 174, 184, 197, 52, 104, 91, 58, 80, 156, 151, 148, 121, 147, 149, 121, 61, 152, 59, 252, 271, 111, 55, 82, 160, 76, 117, 114, 163, 99, 100, 131, 243, 212, 112, 97, 135, 78, 97, 81, 192, 183, 323, 150, 116, 21, 65, 158, 120, 77, 228, 243, 165, 115, 105, 77, 149, 54, 200, 120, 106, 122, 43, 40, 83, 44, 46, 81, 49, 63, 44, 93, 24, 88, 75, 139, 58, 40, 187, 132, 245, 169, 325, 82, 66, 172, 242, 301, 157, 184, 213, 168, 61, 113, 104, 85, 186, 166, 85, 81, 168, 47, 73, 68, 214, 282, 126, 60, 159, 90, 58, 129, 117, 127, 127, 153, 115, 122, 206, 144, 83, 65, 238, 113, 244, 252, 643, 824, 522, 82, 115, 230, 180, 140, 282, 279, 130, 67, 49, 52, 128, 104, 150, 60, 64, 188, 89, 213, 95, 61, 89, 74, 57, 168, 93, 176, 119, 138, 40, 138, 47, 66, 70, 151, 288, 110, 145, 28, 118, 101, 143, 50, 94, 158, 81, 69, 58, 98, 40, 55, 61, 36, 87]
-190H7
##PAGE=	F1=-13177.4
##FIRST=	25169.313707327481097,	5807.6787752999953227,	0
##DATA TABLE=	(F2++(Y..Y)), PROFILE
5808A02p8N8N2p9m1NJ26no5J39j07n9M6q7J24m1J06k0j23JO5l0m6J0J21K0l9Rk9N2n5m4m9
5420C9R1J03j60K1K6O9k1l0m9k0k9O2K32p8j92R6j0k4l5L2O8j32M1k7J6l6R0m5k9N3Mj7J08
5033B17j14nJ04n0O9J08j77l1o4J24l4j45O2O4m8K3j7p4K67Qn1j08J61l1M2k7l7k12K31r0
4681A65L7j06pJ29l4r8N9o8N2P0j54Q7p4J47j6q5n6J03o7m7J52ln0l7K4pQ4q1j1n5J24J34
4305C11k25J86j50P6j01o7L9Q0J1n2kp9J54m1Q2N6k08J87K3j14r3J03p1R8n3j2j8oK5N3r8
3941I4J9P8l0j23J70l0o2J3M3j01k5k7N7N3KK2J23j57J0m4J3%k2J08j39K46p0j43M0j01Q6
3578A03N0n5N5p1K2K5N1j37J10j15K1j4J3P6q9J9P2k1Q6q2K7rQ2l1k6K1m8L8k9j00M6O3l8
3190A15P5q9J57J0J2k22Jk1P8M0J7pM5j29J3K5M9j8m4J43q8j05j4J03J10N9j11p0m4N4R6q9
$$ y = [102, 24, 82, 134, 55, 14, 19, 145, 140, 75, 214, 107, 48, 94, 7, 131, 90, 196, 176, 53, 54, 119, 89, 43, 53, 174, 194, 155, 164, 135, 187, 132, 88, 39, 130, 233, 73, 94, 120, 189, 168, 138, 89, 69, 40, 102, 334, 256, 64, 160, 150, 126, 91, 123, 191, 59, 100, 73, 89, 53, 143, 98, 69, 122, 126, 109, 217, 103, 98, 202, 152, 221, 329, 152, 121, 57, 181, 147, 2, 64, 128, 80, 103, 86, 12, 279, 287, 236, 128, 289, 258, 300, 273, 236, 24, 255, 165, 202, 96, 89, 218, 184, 86, 145, 77, 129, 199, 45, 132, 58, 205, 189, 104, 48, 151, 84, 37, 189, 186, 136, 99, 123, 116, 200, 119, 108, 53, 177, 311, 86, 272, 122, 198, 97, 30, 69, 149, 160, 108, 106, 27, 181, 140, 222, 278, 70, 257, 280, 166, 73, 176, 105, 203, 150, 138, 120, 114, 139, 192, 94, 113, 191, 161, 38, 208, 178, 116, 129, 172, 71, 46, 19, 76, 129, 131, 153, 276, 119, 129, 85, 98, 98, 76, 184, 45, 291, 221, 78, 118, 17, 103, 153, 98, 153, 82, 104, 129, 180, 43, 153, 38, 59, 45, 58, 134, 45, 64, 136, 115, 201, 119, 146, 137, 219, 188, 162, 183, 135, 173, 144, 44, 90, 153, 115, 190, 101, 258, 268, 280, 58, 59, 38, 116, 156, 173, 166, 211, 82, 95, 120, 169, 151, 107, 250, 162, 57, 43, 146, 256, 315, 204, 134, 90, 144, 240, 151]
2815A51l7M6m8n4O5Qr7J43q8N2O1Mn7r3P4J05l4l1o6j5M0K8n5J06j65L9j4N5J24l5q3K7M5
2427B01o3j13R0j6Ll8M6J92j30L1p0J6j00J12n8N5R8q8j42J08N9q3j7J16J55r4k34P3q0J52
2075A81j01kK33j10n4N8n6r7jk3J96j7j2K3j47J5L1m0K9L4O5o7K3L9n5r6mJ12l5J96k8k09
1700H1MkN1l4LrO4m5K3j4Q1J4j07j1ok1N0L5R5o7J37k20M2r6O3O9n7o7J35N6r1q6J2%P2r9
1277E5J43o5k9lo3J0KJ8l3Q1l5J2o3Q9n1oN5L6r9pJ56j06J24o7J75k22n7O0P5Q3j12L7J4n7
878A50j03O2Jm8R7pn4JN0q2J4j3J10O5j49KR2j42J3P7m1M3k8L1rJ4P9r5n2l5J44n8O2KJ0J63
455C66rj97r5J07KLO4L7j46p2Ll0J02m7K9k1n1J70r1J38j50l5Qj9K4J07j21N9m4O3j02J5J0
68G7J4l8P8J57j81M3r6K7L1K9q7L1M7j08K6k1O6m7K5Jm5N0
$$ y = [151, 114, 160, 112, 58, 123, 131, 34, 177, 89, 141, 202, 206, 149, 56, 130, 235, 201, 170, 104, 89, 129, 157, 102, 208, 43, 82, 68, 123, 247, 212, 129, 156, 201, 138, 25, 115, 99, 102, 64, 110, 302, 172, 203, 133, 149, 49, 161, 103, 158, 256, 168, 26, 134, 193, 110, 93, 209, 364, 270, 36, 109, 29, 181, 80, 78, 311, 201, 147, 205, 149, 52, 51, 28, 224, 207, 195, 218, 71, 86, 117, 77, 106, 140, 205, 138, 161, 200, 145, 49, 45, 157, 122, 318, 290, 81, 85, 83, 134, 100, 103, 94, 158, 113, 136, 122, 203, 217, 110, 99, 93, 72, 122, 157, 252, 185, 322, 102, 144, 48, 111, 180, 123, 56, 191, 247, 156, 70, 82, 82, 154, 55, 198, 133, 104, 101, 38, 48, 50, 68, 35, 116, 81, 93, 30, 119, 68, 62, 117, 153, 54, 47, 203, 97, 221, 154, 329, 107, 50, 110, 185, 268, 156, 193, 207, 150, 47, 109, 110, 62, 159, 152, 98, 99, 149, 67, 81, 68, 178, 243, 94, 96, 188, 46, 59, 136, 95, 138, 110, 141, 132, 146, 225, 130, 78, 43, 187, 129, 191, 193, 203, 366, 357, 160, 65, 172, 174, 177, 241, 278, 132, 60, 63, 33, 135, 88, 117, 96, 45, 215, 124, 262, 112, 77, 85, 66, 90, 197, 76, 135, 91, 154, 52, 67, 77, 91, 53, 131, 288, 107, 150, 54, 81, 112, 141, 54, 85, 132, 24, 50, 29, 95, 48, 73, 74, 29, 79]
-190G9
##PAGE=	F1=-13279.6
##FIRST=	25169.313707327481097,	5807.6787752999953227,	0
##DATA TABLE=	(F2++(Y..Y)), PROFILE
5808I0o7O3M4r4j3J5O7M2p2J53j18m8K8j2j4k2J30J2j44M9lj3j6j6J52k9jPqJ1p7Nm9J10Q6
5397B48j72N5MO1m2n5m0L5oO2J91q0j07l1j6R2q0l5J12j29M0k7K1j3O0p0j3L9M9n1J13p2n6
5010H7R8k0N7M8j52l4nR5j5j29N4P3l6K4o0m2K12Nn4r8J03OL1m5K3j66K03j24M7n7q0J83l6
4622A96j02P7q1O3P7j78K7J2Q8pq2KQ6j00m5J44n1L6l8l0M0P4n0n9jM6Q4j95K25j34N7q0o5
4235C6M2Q9j6k6N5j09L9N6N5J7j88J84O5o9j64P3m1Q3m9j9j1QNQ2q4mM7Nj33J28J3n5J6J7
3836A47m8m0l5J4R4qJ4J36j36oo5K2L8m6J37j70K03n2j15K7o1N5L5o9M9l3N9n1N4j05J15j01
3460E8%k0O9Nq1L5O8k7O4p2M5l8Q5l0POm5P5m8r2J3O9j0O1j08J81j3K2k01j3l7L8N8L9QN4
3038B25j00J9OL7l9p3J62j52jl0Q1J21M5j27n5n9O9Q4q4m0J22r8m4M3L8j01J61j07L4M7j5
$$ y = [90, 23, 86, 130, 36, 23, 38, 105, 147, 75, 228, 110, 62, 90, 78, 64, 42, 172, 184, 40, 89, 86, 73, 57, 41, 193, 164, 163, 170, 162, 173, 96, 101, 52, 162, 248, 76, 131, 135, 196, 154, 99, 59, 94, 88, 150, 341, 261, 154, 123, 107, 199, 119, 84, 196, 67, 107, 80, 101, 88, 148, 78, 65, 104, 153, 102, 215, 143, 87, 185, 165, 222, 270, 118, 84, 79, 174, 159, 30, 84, 157, 121, 145, 85, 43, 255, 260, 206, 108, 211, 217, 248, 203, 226, 60, 263, 139, 186, 129, 49, 232, 196, 94, 171, 90, 153, 230, 52, 79, 91, 179, 172, 90, 92, 178, 78, 33, 177, 126, 162, 124, 94, 134, 208, 158, 99, 98, 144, 228, 33, 258, 124, 181, 101, 36, 78, 167, 151, 125, 180, 71, 110, 166, 221, 238, 50, 234, 299, 230, 66, 139, 98, 181, 132, 113, 102, 110, 115, 197, 113, 109, 156, 161, 28, 156, 169, 114, 130, 147, 99, 59, 24, 38, 132, 124, 138, 274, 138, 132, 67, 89, 127, 81, 218, 48, 251, 199, 84, 111, 50, 105, 140, 71, 120, 87, 146, 95, 149, 44, 159, 58, 58, 38, 107, 112, 31, 66, 134, 107, 171, 99, 144, 106, 191, 161, 168, 174, 129, 204, 156, 64, 77, 146, 136, 197, 89, 270, 257, 279, 78, 65, 28, 66, 124, 163, 171, 225, 125, 144, 150, 187, 148, 75, 237, 85, 84, 54, 135, 256, 301, 174, 119, 60, 129, 213, 129, 89, 211, 113, 69, 112, 150, 49, 210, 103, 137, 184, 169]
2674A69l2o4P2J04n3n7j5prO6r5J36j59J3j3P2J20k6n0M0l3p9l4J6j3K7m8K7K29o4p8k5K4
2286A61j06J17o7N0J43n1k14N0J18o1k5J10R5j26j75J70j21J32j49N9J72o4p5N6o3m7J0j8
1958H1J45jj8J7j25pN6m8mL6J09j30O0O8j15q1M9O2L2J66o6k01Rk8K8J0K0m7O3k2L5m3L4O9
1559B13r6k3l9QO8Q7P5j14J14k33J06o9O1K6p4o3J21J09j26j34K4N7O0j00J32m6k9m6p%kL8
1183I8k3Q0n3M0q4N8j9k7Q2lp2k5J41j17R5m6J70j62r3%P8J05p4J7Rl9r5P2k0o3R3K1k4QK6
772A54o2Kn2R5L9j00L7R3j41NO1o9O6m8N7%M0O7j18m1JO4nLQl3o2J62j5j71O7N2M2l3Q3j11
350A37n4k1l5J10n5kM9p2J62p3J44j59k6k0j2N7P9j60J2j2J03l7r6Q3J3m1N3J47j78L3m4k1
-26F4Q0j3p6K2N7r3Ll7J16k3%j2o5L9
$$ y = [169, 137, 73, 145, 249, 196, 139, 124, 117, 108, 174, 79, 215, 56, 69, 56, 128, 248, 222, 172, 212, 179, 100, 66, 82, 69, 96, 48, 75, 304, 240, 162, 137, 161, 55, 172, 105, 155, 298, 247, 33, 83, 201, 140, 115, 225, 320, 194, 19, 189, 68, 200, 51, 110, 282, 218, 143, 199, 136, 89, 99, 81, 226, 225, 207, 224, 99, 92, 148, 100, 96, 132, 241, 111, 171, 239, 124, 43, 92, 154, 186, 352, 286, 85, 94, 66, 94, 104, 124, 77, 140, 118, 153, 110, 144, 213, 117, 94, 55, 63, 131, 218, 293, 179, 293, 60, 166, 97, 158, 184, 110, 47, 168, 277, 151, 17, 41, 98, 158, 58, 190, 144, 115, 69, 62, 62, 60, 98, 75, 155, 102, 142, 58, 116, 97, 70, 152, 149, 77, 52, 193, 76, 171, 125, 295, 133, 40, 40, 118, 223, 149, 166, 175, 136, 41, 113, 93, 30, 123, 144, 120, 128, 154, 92, 94, 42, 137, 176, 76, 113, 206, 65, 70, 131, 62, 128, 80, 137, 137, 177, 244, 126, 85, 86, 150, 145, 148, 156, 123, 61, 223, 208, 37, 104, 156, 198, 165, 248, 137, 83, 62, 27, 137, 82, 80, 129, 57, 219, 146, 290, 131, 105, 85, 73, 130, 209, 49, 61, 49, 152, 115, 19, 102, 115, 74, 127, 274, 96, 129, 85, 64, 144, 131, 55, 77, 134, 41, 44, 7, 123, 100, 100, 88, 23, 62]
-190F2
##PAGE=	F1=-13381.9
##FIRST=	25169.313707327481097,	5807.6787752999953227,	0
##DATA TABLE=	(F2++(Y..Y)), PROFILE
5808G8l5M9K1r7j0P4k9Q0m5J27j12QK0J0j17M2O6N1j61R4o7J4K9oJ31q1L8rK2k0j10M9l1J32
5409B05M8j80P4qN4o3p8K3O8j7P6J41j12jj31l8J97j29p1J56j22J8l7L5K3Mr0J3J9R6p2J15
5033B16k9j08P4LM7Lj29l3N8N1Qj08M8Q8l2K7r4k6J39Jm6m9J4L6L5p4R4j29J67j36N6j5q8
4646F9J54j8j18Q3p4P9P0j67QL4K4J8r5Q2L9j21l4J35r9J11m6p8R9O7m0j09P1l5L1j21K04
4282B23j13Q5o8o5J2R8k0k1J05r3j19J42L9pj51J31J18k0k08M3n0P3m1l6ON5l6J31p2k4JL0
3906A48j02N9O1n1J2%k0m4mk1J03j4jJ30r8m5o8N1N7q4J55j61J32l7m4Kk2L6j1p2M7JQ1j14
3507F2M8o2J13n8j2n4J13n6p1M1N9l0K6l7M2j2N1m4L1Pm4J15p2p9mO0J8N0j40K12oOj93Mp4
3096A0K0N0O8QO3l7J1j9L6p7n3J35j34M5m5M0J15L8j30m1n6N5P7q5j3J59j20m8KP9p4J53j21
$$ y = [78, 43, 92, 113, 16, 6, 80, 51, 131, 86, 213, 101, 109, 129, 139, 22, 64, 130, 181, 20, 114, 47, 61, 90, 84, 215, 134, 172, 163, 185, 165, 55, 104, 73, 205, 253, 73, 147, 139, 193, 130, 52, 75, 143, 126, 202, 343, 231, 230, 99, 61, 258, 129, 58, 214, 92, 110, 73, 108, 131, 135, 45, 58, 77, 173, 101, 216, 187, 79, 153, 156, 203, 206, 77, 44, 102, 153, 161, 53, 101, 189, 157, 184, 90, 64, 203, 204, 158, 109, 123, 159, 194, 120, 214, 85, 252, 116, 172, 157, 69, 223, 205, 87, 170, 96, 175, 245, 78, 86, 120, 144, 162, 67, 149, 188, 67, 33, 168, 69, 180, 134, 56, 155, 222, 182, 73, 144, 109, 140, 19, 223, 110, 195, 127, 62, 74, 172, 152, 131, 236, 143, 24, 166, 205, 198, 47, 178, 296, 276, 68, 111, 61, 134, 93, 57, 63, 118, 82, 213, 141, 117, 118, 148, 46, 105, 166, 115, 127, 127, 107, 63, 59, 38, 141, 127, 126, 256, 158, 113, 45, 96, 153, 69, 224, 63, 195, 158, 114, 116, 94, 130, 119, 47, 94, 95, 176, 62, 110, 48, 161, 103, 91, 37, 150, 94, 23, 64, 123, 93, 119, 82, 124, 112, 163, 119, 150, 157, 113, 228, 156, 77, 73, 133, 151, 201, 61, 273, 267, 273, 80, 84, 10, 30, 80, 148, 156, 219, 182, 193, 174, 210, 133, 80, 215, 81, 126, 81, 121, 236, 274, 144, 103, 47, 102, 179, 94, 81, 240, 120, 72, 74, 153, 79, 232, 111]
2709A11K0J7k9jm4P1J02p8l8jj0l3R2j39J69j28j0OQ3Q3l5oM5j03n6jk6k0M5m5J4K53Jk00
2310A09L8J3r9J08o6O6J63l3k62rJ64j2l3O7M4j17r0K08j56J10j64R7J08k4j00N2q2K8K6j7
1958A37R9qpor3kO1o2n8P1J14j81Q7R5j54K4M1J3P0J10p9j64j7o7M0M4M9p2L6kL6o3kJ15q0
1547A25m7m1K8O1J17O0j40Q4k00J34l3M5k3q3m1J08J50j66o2k4O7L8q9J15l0k3r0M4oJ2M3
1183A33LN7q3Q1p7k0RNO7n1j0m2R1p8J8j7J46p1j37K2J5J13l1l1K2qq3Q1o4k8O3M9LJ0Km0
761A19j0j00R8nl3M0J01j10k0M4r3P4n9R3j5P7N6j21m0L4K0Nl8j2J35q0j8P5j89J2J02O1j17
373H6J12m9l0o6l0J14m7j9P3m0R3m2J46j38k0n3J0O9M1j80K5J6O9K6q3L2J4l8M9J10j72%L5
-14A13m3J23p5n9J7P4m8m2k6J33j3k7l4p6K1
$$ y = [111, 131, 148, 119, 118, 74, 145, 247, 169, 131, 130, 120, 87, 179, 40, 209, 81, 71, 77, 160, 243, 208, 202, 247, 144, 88, 87, 61, 41, 86, 41, 55, 308, 309, 109, 147, 160, 61, 169, 103, 169, 332, 299, 37, 28, 192, 180, 147, 214, 258, 141, 51, 259, 103, 213, 49, 146, 254, 230, 130, 182, 100, 128, 154, 137, 236, 228, 221, 215, 122, 120, 181, 119, 61, 132, 246, 65, 152, 247, 93, 117, 158, 171, 241, 351, 272, 108, 91, 24, 64, 108, 157, 85, 121, 119, 155, 92, 90, 205, 125, 78, 37, 65, 126, 243, 303, 163, 247, 47, 181, 148, 193, 170, 87, 46, 154, 304, 138, 76, 52, 119, 157, 68, 183, 153, 130, 40, 84, 78, 90, 133, 136, 193, 110, 191, 114, 94, 103, 108, 175, 124, 114, 72, 163, 85, 103, 86, 232, 161, 24, 46, 61, 174, 143, 112, 134, 126, 43, 124, 60, 32, 95, 144, 147, 157, 159, 119, 109, 9, 107, 102, 69, 109, 210, 100, 80, 124, 31, 105, 46, 139, 124, 201, 257, 136, 96, 130, 150, 155, 117, 105, 240, 160, 142, 217, 28, 40, 142, 203, 86, 198, 149, 119, 53, 23, 137, 90, 71, 144, 104, 197, 155, 301, 163, 143, 90, 100, 169, 210, 30, 55, 71, 140, 166, 83, 115, 129, 91, 140, 250, 78, 78, 113, 70, 193, 118, 59, 76, 150, 102, 60, 34, 167, 154, 127, 93, 17, 38]
-190C8
##PAGE=	F1=-13484.2
##FIRST=	25169.313707327481097,	5807.6787752999953227,	0
##DATA TABLE=	(F2++(Y..Y)), PROFILE
5808G1OK3j0m6%O2l9M3k0P9p7O7J3Mr8L0k9R3j42R0j04M8O8qR4j06P2l7N0l1j45Q2kJ55Jj81
5385G6O8j1O1p0k1K5O3m8R9R8j69J06j80o1K54j63n3J58j02j6n3M0O0l0p9pOJ32p4R7J0j49
5010F7L7J7M3qj10K2N5OL0r0M2J06l9L6j14k8O2jl1On3L7N1j01J59j09J31j17N5Pn6P3J6j39
4610F2Q0m6R4M7j41L7J8l6M6j08J36j6j22j9J29j36J63o2q6J34N7m5j22J19j02%k7J16q0J29
4258B19o7p4k2J03rk4J39o8j37Q4L3oq8J9J74K2k31M2r3N4k8k4PJ03p8J87o3n1l7M1l8K1O9
3871A79n5mj4j0l7L7l1Q5j4j8R8o0p9m3P3N5j15J54j32O4k4N8l3kK5o8m9N2J2Q6j58M2oR2
3472A60j0pj18J56r3o9K9O7l9k5J4N3K2Jo8M4K0m6J50r8o3LM1K6M6j69K36K9k6k00L6r1P4
3085H5l9Q9qO3M5Ln8M3j22J8P8k4j3n1MR2L7j15m4rNO8q3L8J40j00n5m9R0j6J28j26J2k5k7
$$ y = [71, 77, 100, 90, 44, 44, 106, 67, 110, 90, 169, 92, 159, 172, 176, 78, 108, 79, 172, 30, 120, 16, 64, 132, 124, 218, 112, 184, 147, 197, 166, 21, 103, 101, 256, 257, 76, 144, 133, 194, 124, 103, 128, 191, 143, 242, 340, 171, 277, 97, 36, 290, 127, 74, 232, 130, 114, 61, 101, 161, 131, 52, 45, 51, 183, 109, 206, 216, 67, 104, 121, 164, 156, 46, 68, 123, 129, 159, 69, 111, 217, 178, 214, 100, 72, 134, 133, 102, 108, 55, 92, 143, 42, 201, 92, 223, 106, 161, 168, 112, 185, 201, 62, 142, 96, 190, 237, 96, 133, 151, 115, 161, 53, 189, 173, 51, 32, 161, 25, 188, 126, 40, 174, 231, 186, 64, 183, 81, 81, 54, 170, 90, 219, 152, 78, 56, 159, 150, 126, 265, 197, 60, 144, 177, 171, 83, 102, 276, 298, 67, 109, 16, 70, 42, 18, 25, 128, 50, 237, 174, 123, 86, 127, 89, 110, 179, 124, 120, 106, 96, 59, 96, 65, 150, 136, 118, 216, 156, 77, 34, 107, 162, 47, 201, 69, 133, 109, 167, 134, 132, 157, 89, 40, 92, 104, 190, 32, 74, 68, 160, 150, 143, 25, 181, 88, 19, 48, 115, 76, 51, 65, 118, 140, 141, 73, 117, 137, 91, 241, 143, 80, 83, 124, 150, 196, 27, 263, 292, 266, 66, 102, 11, 85, 46, 135, 127, 190, 235, 238, 180, 223, 101, 119, 197, 173, 160, 109, 113, 205, 242, 127, 83, 74, 79, 147, 64, 102, 242, 142, 87, 38, 128, 112, 240, 114, 126, 101, 74]
2674G4J7k3O2J02j00J8k9j9j3Q1j55J68o7QmP0M0o1M5L8j48j1ok7l6M7k3K3K45M6k79R0k4
2286A49p8P8n2Q4J56k3k66mJ20N0l2kJ2q1m7K32j67Q8j52J12O3Kj33N7j20J20M1pN8l8J2l8
1911A94n7OO5p6j13J14Q3k02J07J03j62J09M7ON8L9o3j18l8o4N1M8N0o9oJ1K9r0K1J10p1o4
1535E8kJ6L3J17N3j36N9j54J38MK2o6o9j1Q1J60j92L0l9L4J4o6R6j9k7r7O7j4J6O1L4K4j20
1148A05J21n8j04J5Q8K0j01P2n7L9l4o8PJ17L1j60O7m9P6J4q3M7Lm7P5j13L9K7N6K5J1l7n
761A39j5o6N2m3nK8J11q1l6M0p7L7n6J11m2J13N2j03o1N7K7k1o8n5J87k9q2P6j57J6Q9N1j10
373G9O3K4j2j03l4J29l2j4M0K3qkJ47j00j8q5L9P4jj53R7j6rO2p2mJ7m7O4P3j65m8J32m6J54
-38B48j41l8J3Q3j9p8qJ41kn2o1p3N
$$ y = [74, 91, 68, 130, 232, 132, 150, 121, 102, 89, 170, 15, 183, 116, 124, 120, 190, 230, 169, 214, 252, 104, 93, 87, 60, 24, 71, 48, 71, 316, 362, 83, 173, 149, 71, 149, 97, 181, 337, 314, 48, 44, 164, 214, 182, 180, 192, 111, 64, 296, 129, 217, 65, 177, 240, 242, 109, 166, 46, 166, 207, 200, 258, 220, 232, 194, 137, 143, 208, 132, 19, 133, 216, 14, 121, 224, 62, 171, 218, 224, 282, 321, 258, 140, 102, 38, 89, 137, 187, 118, 112, 123, 152, 62, 83, 193, 122, 58, 56, 72, 105, 222, 275, 139, 198, 44, 182, 186, 208, 142, 73, 62, 143, 303, 111, 141, 102, 136, 150, 84, 180, 161, 134, 37, 104, 90, 106, 167, 201, 225, 105, 226, 168, 64, 79, 167, 187, 86, 158, 101, 140, 106, 38, 45, 162, 193, 33, 100, 51, 127, 141, 58, 105, 108, 61, 136, 23, 62, 89, 145, 170, 181, 144, 139, 124, 58, 110, 67, 62, 90, 201, 120, 84, 124, 47, 84, 28, 139, 97, 210, 262, 159, 98, 155, 182, 161, 93, 38, 225, 196, 114, 190, 33, 49, 138, 189, 79, 142, 166, 154, 51, 17, 146, 114, 100, 140, 163, 155, 153, 300, 200, 182, 97, 136, 210, 209, 56, 153, 137, 128, 190, 118, 114, 131, 84, 148, 221, 56, 8, 140, 94, 248, 107, 69, 82, 165, 146, 68, 60, 201, 199, 147, 86, 13, 18]
-190A8
##PAGE=	F1=-13586.4
##FIRST=	25169.313707327481097,	5807.6787752999953227,	0
##DATA TABLE=	(F2++(Y..Y)), PROFILE
5808G0M1%m1J5J6J9J4j2l7J8j0R9Oj0p4J4r8J27q3L5l7J3Q9l3M8q2Q0o2P0k1j68J00K6J77
5409C09m1j82M5mQ1n4M2k5N1q6J26O3k31J94j75m5K23j76lJ28p4m2p0K5Q9ko2p8K4J30n5M9
5033A74N0j78jK4N6J5p0P3oj7M1q0L8J18n9N3j16m8NJk2M1l4l3P5q1J65r7R7p8M7Lj9j6N4
4622A75j46P0oJ01J2j03P2Qq2O3j06J39o6r7rJ31j35J63q5j9J06M3n2q2J11j40J2j6M2j6J44
4258B32p3q3k8Q2Kj2J45m5r2pK1K0l1j07K23M5k39P3o4l3J4N4m9Q4j00K25n0q5n5L7L6L2L9
3871B11o6l4l0pk2P5l5O2j4l0M8k7r7K2N2M2j25J34j01J5jJ56o8jJ5j24J4M7KP5j71K8N5O0
3472A60K5Qj87J92j05m7k5R4n5l6K0J04J8l8o4L2J8m6J75j20m6K8K3MN0j14J76P0n8k08P1
3108A19j00J30p4N4k7M2J30%j11M7j55J06L6O2q3m5j8O0L7q3p1M6l5N9n9O6Q9m6n5k2k2N5
$$ y = [70, 111, 111, 70, 85, 101, 120, 134, 122, 85, 103, 93, 192, 198, 188, 114, 128, 30, 157, 74, 109, 72, 85, 174, 141, 189, 107, 187, 125, 195, 174, 6, 106, 132, 309, 268, 86, 131, 127, 208, 154, 196, 171, 222, 136, 262, 325, 94, 288, 113, 68, 291, 115, 112, 240, 166, 124, 54, 79, 168, 166, 104, 26, 50, 180, 125, 174, 224, 46, 45, 69, 125, 140, 70, 143, 137, 120, 161, 81, 119, 237, 178, 231, 115, 67, 72, 73, 51, 92, 58, 25, 100, 19, 184, 87, 184, 106, 153, 156, 137, 121, 175, 29, 99, 93, 194, 206, 103, 175, 183, 101, 164, 58, 197, 131, 34, 25, 156, 21, 184, 99, 80, 186, 229, 177, 95, 206, 66, 78, 62, 104, 88, 232, 159, 76, 48, 130, 132, 120, 265, 220, 128, 121, 142, 162, 131, 24, 247, 292, 53, 126, 62, 29, 43, 97, 48, 132, 32, 257, 207, 122, 67, 104, 140, 172, 211, 145, 111, 81, 74, 52, 127, 92, 154, 140, 110, 158, 131, 34, 56, 108, 150, 25, 159, 58, 73, 72, 228, 160, 159, 174, 50, 64, 111, 113, 188, 17, 45, 100, 160, 185, 193, 6, 198, 93, 46, 21, 115, 60, 24, 44, 148, 166, 128, 64, 96, 114, 68, 243, 123, 77, 105, 128, 132, 182, 68, 244, 314, 256, 48, 119, 19, 149, 75, 129, 102, 144, 274, 274, 163, 210, 55, 161, 197, 259, 176, 131, 113, 173, 210, 127, 56, 102, 67, 126, 67, 133, 222, 176, 121, 99, 77, 132]
2732A32R9j18Rp3%J4jM2J04j11Q0p9k3L7M1p3N5J3N5l6L2J0r5Q9K5j61K9k0Kn3M0kM0K20O3
2322C86k85J12o8o4L3l0R3J27j5k22K2L6J09k4p3%l7l4K19j47O9j18J12M5J0j70R0j26J50
1981B00M9J7K4p8K1p0j7MP3q7r9R0L0j04N3P3j33J50O6K9J2k7k6o5m8l5L2L9L9n6m1J7L0j43
1582A9R7N5o5m5K6j5jQ7N6j00M5j35J41M1nr7k4J3L4J36j94J13m9Njm0Q6j4m8p3P6l0PR2O4
1171B57j0j57J49l8j64qK06m0j37J42q0K5k5o9m0J07J09j43M5n2J1O0o1Pj3J0N2j24O2J6L7
807A34M9J2r3M4j1l0L3m0m2J5J12n9m3M9m9jl8Q6n0J29N2p0j05P7O1n5r4k5Q5K3k4J2r9N3
408I8L9K2l1k1P4%j14l3J37k5j5rR9j13L8J48o7j6j08O8Q1m0j09J36m7o9N9p4lK0p2Q6N1j46
9D4K5R4l3J67j95k2PQ6rj12L6J26J3o7r2m1O
$$ y = [132, 231, 113, 122, 49, 49, 63, 62, 104, 208, 97, 177, 98, 75, 112, 153, 80, 135, 148, 203, 167, 199, 209, 114, 203, 228, 67, 96, 76, 78, 25, 65, 63, 103, 323, 386, 101, 213, 145, 81, 114, 84, 177, 304, 289, 67, 89, 125, 234, 210, 137, 137, 100, 66, 285, 138, 207, 89, 201, 246, 256, 86, 176, 50, 200, 249, 266, 290, 212, 233, 163, 146, 150, 223, 136, 37, 127, 157, 53, 106, 179, 46, 196, 262, 291, 303, 276, 250, 185, 137, 102, 134, 173, 212, 156, 115, 132, 162, 19, 116, 171, 106, 61, 87, 72, 71, 158, 214, 114, 159, 24, 165, 206, 201, 104, 80, 93, 127, 263, 69, 182, 133, 138, 137, 97, 183, 169, 121, 48, 124, 94, 101, 193, 257, 247, 90, 239, 201, 37, 29, 235, 195, 58, 200, 120, 145, 120, 51, 11, 118, 227, 84, 129, 77, 88, 148, 87, 94, 81, 91, 143, 19, 81, 97, 134, 183, 195, 102, 146, 135, 105, 138, 98, 56, 71, 183, 124, 81, 130, 81, 80, 42, 128, 78, 207, 259, 189, 84, 161, 222, 167, 73, 48, 133, 156, 132, 144, 45, 98, 137, 159, 128, 107, 181, 181, 67, 34, 171, 146, 131, 122, 221, 108, 146, 294, 227, 211, 103, 171, 252, 212, 103, 239, 192, 123, 182, 108, 105, 125, 53, 139, 190, 44, 69, 163, 130, 297, 102, 80, 87, 173, 164, 52, 88, 214, 227, 160, 68, 27, 33]
-190C3
##PAGE=	F1=-13688.7
##FIRST=	25169.313707327481097,	5807.6787752999953227,	0
##DATA TABLE=	(F2++(Y..Y)), PROFILE
5808G2O5j0p3O9L1k7N8j3r5m1O0J04jj7o4Mq5J04j4m2N0k1R4p5%j5N3p2P8Lj69J02M2J97o2
5397B90j93K7J4R1l3P7q7M5j21J47L4k62K37j37k0J52j67M9R2m8n3q0lJ05O8p6j17M0R4k1
5045A44k1Q7k00M8l8J02L7m4J05q3jL7q0L8J15q3O8r9p8J0K0n4L3J3m6M3j5R9p4O0l0L4k4
4657A23K3q0N8n6%K2R4j9n9R5J0j03N8j02J12j01n8jJ39j08J16q9N3O2L2n1l8P6j45K4m0j1
4282C6P7J14q6q2K3J1NK7J16l2m1m0k2N6Rj25J66M8k30J12l4l4J8P3q2M5r7K29l1j06o4K6
3906H5J07M9J1p9o9n1JoJ00l1L5j8l5rJ0r4Q4KK5j02R8q7LL9K13r6j5J2j47P3K2oN0j43jJ06
3484A36L3L3K7j79J52r6k6n9J00p1M3o0J52j1n4%Nl5l8J83j30l0O2Qm6O2k6R0R3p5j92Q6j15
3096B2J77p5Kk4j1K03Nj72L9j33J57K1J00j37l3k4L1L7n3j02P9n0N9l8P2L8K0n5K3j60J12
$$ y = [72, 137, 127, 54, 123, 154, 127, 185, 172, 77, 36, 96, 200, 199, 182, 118, 122, 37, 141, 127, 85, 135, 114, 208, 133, 133, 118, 171, 99, 177, 180, 11, 113, 155, 352, 290, 97, 124, 138, 229, 196, 273, 186, 231, 110, 257, 291, 29, 266, 129, 109, 261, 94, 143, 235, 187, 134, 54, 51, 156, 224, 148, 31, 71, 165, 144, 123, 210, 10, 58, 20, 122, 159, 115, 220, 137, 136, 173, 93, 131, 246, 163, 231, 132, 54, 64, 84, 30, 63, 76, 30, 73, 58, 157, 83, 143, 113, 147, 123, 146, 66, 124, 68, 68, 90, 184, 165, 106, 201, 211, 108, 166, 64, 176, 75, 17, 16, 155, 47, 163, 74, 127, 189, 221, 170, 132, 208, 63, 87, 47, 36, 113, 227, 141, 59, 82, 93, 98, 125, 241, 209, 168, 128, 106, 162, 171, 46, 212, 260, 30, 142, 108, 74, 92, 165, 83, 128, 31, 260, 229, 123, 59, 85, 192, 241, 252, 173, 104, 53, 54, 48, 148, 117, 152, 134, 99, 90, 100, 6, 90, 92, 117, 15, 113, 26, 29, 68, 281, 185, 170, 182, 35, 108, 130, 124, 174, 31, 30, 136, 169, 202, 229, 50, 202, 106, 80, 21, 121, 50, 93, 33, 185, 174, 120, 120, 125, 90, 52, 235, 105, 75, 137, 145, 99, 161, 135, 225, 318, 243, 51, 137, 22, 199, 124, 126, 102, 91, 294, 299, 127, 166, 33, 190, 211, 311, 174, 141, 117, 148, 185, 132, 30, 109, 59, 118, 80, 152, 190, 210, 155, 178, 18, 130]
2732A30Q4j03Nj10L5%K5J0J04j02J19j31NO7J0%p7R5J10o4k8jj15J04Rj29M0k2L1o5N5rM8
2345A30J93N3k53J23q6q1j3j1R5Q4lj45K9k7J55k6j15jll2J60j01N3n8R4M5J3k03J50r4R9
1981B24M4N2Lj13J1r2K6j5Q1q7o1M3l6K3J1J4p2J35R5N6m2o4Qj2n9j7NK7M1m5o6L0M4j55J05
1570A42nn3J8J3m6l2K8O9l9M1j21J17P1k5j14L1L1k7R2j60J59n6j1jj9Q6j1q1m6Q7m6j1J25
1183B06Q6l6j88J57k2j77J7K55r5j26J56j14M1l6k2q0R7J39j10j8l1k7R3j0p7rN0K2r2L2K3
819A04QO8J3j45R6rjL2m0o0KR5m4m8O0k7j4k8M4oR4N8l5j65J07J00q7j18M6n5R7L4p4m7P8
408A33qoM7n8Q0Oj05k0J37k7l3m7J69j75M4J49m5k2j11R3Q9o9p2J47p4r6J9r0M7J7j01R8M2
21A58j05Q5M1j3J62k23k5PR2k3j41J04Q3L1o6j15%Q
$$ y = [130, 214, 111, 116, 6, 41, 41, 66, 76, 180, 78, 197, 66, 71, 138, 148, 148, 71, 166, 276, 212, 184, 183, 68, 172, 181, 52, 92, 70, 101, 36, 91, 82, 130, 323, 376, 123, 246, 160, 79, 66, 55, 150, 234, 231, 86, 115, 88, 243, 217, 102, 101, 98, 66, 226, 125, 178, 120, 214, 259, 272, 69, 219, 125, 224, 268, 320, 323, 210, 221, 129, 155, 140, 221, 134, 73, 116, 80, 103, 114, 128, 56, 191, 286, 342, 300, 236, 244, 232, 173, 156, 161, 188, 229, 184, 118, 148, 192, 37, 142, 137, 84, 102, 115, 69, 37, 65, 134, 95, 136, 15, 132, 203, 178, 64, 95, 126, 99, 191, 31, 190, 134, 123, 122, 103, 189, 178, 97, 51, 138, 92, 81, 206, 292, 256, 68, 225, 203, 26, 43, 298, 203, 77, 233, 119, 160, 124, 102, 22, 119, 258, 148, 130, 99, 72, 165, 155, 78, 69, 119, 141, 49, 81, 104, 112, 180, 193, 48, 144, 135, 134, 166, 126, 66, 68, 163, 119, 71, 131, 104, 90, 62, 106, 100, 194, 252, 217, 52, 159, 259, 172, 54, 100, 45, 142, 176, 102, 55, 133, 125, 119, 166, 108, 188, 194, 89, 69, 206, 179, 146, 99, 268, 93, 137, 286, 241, 219, 108, 201, 290, 221, 149, 296, 222, 126, 145, 55, 102, 119, 18, 116, 158, 53, 138, 179, 166, 328, 105, 80, 87, 179, 156, 15, 119, 202, 233, 167, 52, 52, 60]
-190F0
##PAGE=	F1=-13790.9
##FIRST=	25169.313707327481097,	5807.6787752999953227,	0
##DATA TABLE=	(F2++(Y..Y)), PROFILE
5808G6P1kj11J19M1n8P3J7j46k6L8R0nnp7Rl2N2N4j20J31m9R0j18m7P2Jo8P3L5j53Q6N1K13
5409C75o1k05K3L7P4k0R1j51N0j35J52Oj73J54q6NP0j43R3O1l2m7q3k2J06J32j05j00K2N0
5056A38K1r8J21j37Q8r0J12L5m1J31j59M9K6q8M3R4j06P7o4j14O4L0q5j9M0jR%M6l4K1J5J9
4669A43n7O9m7m6P4n9J2P2k1k9R7J9j07M8j11R2r4n0K0J30q6N6l1O7K4L5l8k7L3j23J1l0j0
4282C6J13N6j07n7R5o9j4Q4P2l7Pj1q2P3L6j08Q4L5j63J06k1k0J9Q5j08J2q0K03pr4p7J6J62
3894B39N6rq6j00o8K1nJ07j7Pk3l3o3O6n4Q1n4J2n1O3o7J6M2K34j11m0K5j07P9k2jJ6j05j5
3495C3J36J7J5M6j49R5p1qo5Q0p4R2q4J37l9l7P0j6j12k0J72j28j2J06qj18Q6M8K3Q8p5j56
3120G2Q6j15J84o6m4Lo7K37J7k26J7k3J25J8J03j60k1k1QM2m5q0N0m7P2m1P5OP3o1O4j70L8
$$ y = [76, 147, 145, 34, 153, 194, 136, 209, 226, 80, 54, 92, 182, 177, 172, 95, 104, 72, 124, 178, 58, 189, 140, 230, 112, 65, 137, 138, 70, 143, 178, 25, 111, 162, 375, 314, 109, 132, 169, 243, 223, 314, 163, 213, 78, 230, 236, 63, 217, 131, 136, 206, 63, 156, 217, 185, 138, 55, 33, 139, 271, 166, 66, 88, 138, 159, 61, 182, 45, 133, 43, 155, 190, 149, 280, 121, 170, 196, 108, 151, 245, 139, 216, 152, 38, 102, 132, 47, 28, 68, 67, 76, 76, 122, 88, 109, 124, 143, 86, 155, 108, 62, 136, 77, 89, 161, 140, 111, 208, 227, 120, 168, 57, 149, 55, 5, 25, 155, 69, 125, 94, 161, 185, 220, 182, 155, 188, 65, 76, 46, 36, 149, 205, 98, 41, 136, 67, 53, 137, 209, 172, 179, 168, 86, 159, 195, 87, 171, 206, 43, 149, 128, 108, 127, 212, 104, 116, 36, 239, 232, 138, 61, 77, 239, 295, 286, 200, 100, 32, 53, 48, 155, 138, 145, 122, 89, 26, 92, 38, 119, 65, 77, 26, 89, 22, 38, 80, 314, 203, 163, 188, 81, 160, 138, 137, 153, 48, 33, 169, 186, 201, 247, 98, 193, 122, 114, 49, 129, 55, 147, 63, 200, 161, 124, 194, 178, 66, 46, 218, 90, 78, 184, 176, 58, 144, 192, 215, 303, 228, 72, 158, 43, 227, 161, 117, 120, 53, 290, 307, 81, 98, 75, 200, 218, 321, 161, 140, 119, 127, 169, 124, 44, 94, 47, 119, 78, 153, 159, 232, 171, 235, 65, 103]
2732A03J01r9Ko4nj0N7j6Q4p2J25j74O5O2J9L0j94J46J64p5q9np8N9j0o8K8oL6o5R2m2M4J65
2333C10K8k10J26o6j28m9LR0L5J4n6K0n0J75m4j00j6J2k1N6m3M5K2O4M9J7k17K11q0L9K3Q7
1958C46Mj36j7j00O8m4Q3p6k9J5p7J01j9l2j2R3J20O4q1n5J9K9o8j1k8OP6m7q0N6O8j47N7
1570A46m9k0P7j8m5l0PROM3o5L0R2k8j18O3M7q7N8m7R5o0j2J7j6R9pr7m5R4n2k7J41J01m8
1160B54k13J47j3j29P3K21j32r4J35j54O3l4J7j00R1J46p0r7%l3J12J9j64M9M1om4j8L5rP1
796A64Rj00P4k5K0L4m9l1k0O8l2n9O6j1nk4jO7L0P1j1k29J59J20j11j40Q6n9J28L4j34k7Q6
408A48m5k1J07o1N5J0q1oJ31l1o4o0K14j77J0J47j9n4r0J08R9q2n0J30r0r2l6n6P5%n9N2K5
21A37o7J18nJ3J36k12n6J8J03n6q3J05K5M0m7j06J3R
$$ y = [103, 204, 105, 107, 43, 38, 28, 85, 69, 153, 81, 206, 32, 97, 159, 178, 208, 14, 160, 324, 249, 160, 155, 77, 136, 126, 58, 86, 80, 116, 51, 143, 101, 145, 310, 338, 128, 254, 188, 60, 11, 14, 104, 139, 153, 97, 117, 67, 242, 198, 98, 82, 94, 73, 129, 86, 131, 153, 217, 266, 283, 66, 277, 197, 236, 259, 346, 350, 214, 197, 97, 165, 121, 204, 128, 99, 114, 37, 138, 119, 87, 75, 168, 288, 352, 271, 216, 235, 264, 196, 185, 157, 163, 239, 192, 112, 168, 236, 89, 146, 97, 77, 154, 136, 91, 61, 68, 77, 83, 126, 61, 91, 183, 155, 37, 100, 147, 60, 118, 71, 166, 106, 94, 111, 95, 194, 187, 90, 45, 139, 87, 60, 201, 302, 254, 41, 188, 175, 46, 119, 340, 208, 114, 249, 95, 158, 124, 141, 41, 132, 278, 208, 111, 111, 78, 190, 209, 45, 94, 135, 129, 85, 67, 102, 93, 164, 173, 73, 147, 122, 142, 176, 127, 96, 76, 144, 112, 53, 119, 108, 103, 79, 78, 145, 175, 246, 235, 6, 165, 285, 174, 34, 120, 61, 189, 223, 89, 62, 148, 103, 82, 189, 128, 183, 193, 112, 106, 237, 206, 142, 82, 296, 119, 129, 276, 257, 203, 113, 221, 320, 238, 188, 318, 228, 136, 100, 44, 119, 119, 60, 112, 137, 70, 188, 183, 196, 332, 120, 64, 82, 185, 129, 46, 151, 176, 216, 169, 63, 76, 85]
-190H5
##PAGE=	F1=-13893.2
##FIRST=	25169.313707327481097,	5807.6787752999953227,	0
##DATA TABLE=	(F2++(Y..Y)), PROFILE
5808H4N9J7j44J55M3o5N6N6j59nj9O9nK6j10M1mJ5J06j77J89o6P5j44p3J33n7o1O5O4j12L7
5432H9N5K24m0k05K1O2L6j7Q4k02O5j06J23k1o8N4l7K6lj13J23M1l1l3o8k5J05J48j35n0j0
5068I2J1O1j26J13m1R0j29J22K6n6J49k24J16K4j06N0O0j16Q0k3j48J08L6j01n8L1M4J7k0
4728H2KJ5oM4Ko6J07qr7J23j01KK8K9m1Q3K6j02N3j40J16m6r1K4J12o2j5O9L2NN2j9n0qr2
4317F2rL8kR4j0j29K2J21j12n1J24L7n3M6L4j15N0M9r1J8J8m9N5k5j2K5R9j22j5n6J53J4n2
3930A56q7J1J95N2k2r1j18o6L9k1J00Nj4l1k3l9P4o3Q0r3J2nM4j8j3J7K35j09o4N4o1P3p7
3542A32J9k0o8j7J45J3j2N6j10L0k8Mp9P4o4J04o7O9n6K2J12m1j72NJ40j15J0J53k3j99J28
3178A45Q2j0N6o3j26R5r6J50n3q3L7o5J92L8k53k1Q5Q0J8Q5j42k3ok0O1p0qk3k6R5o6O9KR7
$$ y = [84, 143, 160, 16, 171, 214, 149, 205, 261, 102, 97, 78, 147, 142, 168, 58, 99, 95, 110, 216, 39, 228, 162, 237, 93, 20, 153, 96, 35, 100, 164, 52, 89, 144, 368, 328, 123, 144, 206, 242, 225, 309, 107, 172, 66, 189, 168, 100, 154, 117, 143, 140, 27, 150, 191, 160, 127, 59, 34, 139, 287, 152, 102, 92, 103, 164, 38, 151, 110, 200, 71, 193, 219, 163, 312, 88, 204, 228, 122, 172, 232, 116, 196, 173, 25, 133, 169, 68, 10, 41, 85, 102, 82, 84, 99, 93, 137, 139, 73, 180, 172, 75, 198, 97, 99, 127, 156, 115, 198, 224, 122, 175, 35, 151, 105, 14, 38, 150, 88, 73, 142, 174, 179, 231, 212, 162, 154, 62, 53, 91, 89, 183, 173, 44, 66, 187, 75, 24, 148, 185, 132, 178, 212, 97, 147, 196, 105, 123, 141, 92, 147, 122, 110, 135, 234, 112, 97, 41, 194, 208, 156, 69, 80, 275, 327, 305, 214, 96, 30, 69, 48, 148, 153, 139, 108, 85, 46, 120, 57, 137, 44, 56, 51, 95, 77, 64, 81, 316, 207, 143, 197, 136, 209, 132, 151, 131, 63, 46, 191, 204, 192, 248, 138, 168, 140, 144, 65, 139, 75, 179, 112, 181, 125, 147, 259, 218, 46, 51, 191, 76, 86, 239, 216, 17, 145, 227, 217, 273, 210, 84, 179, 83, 233, 180, 97, 134, 69, 261, 299, 46, 25, 110, 190, 208, 293, 151, 128, 122, 102, 163, 93, 85, 62, 36, 131, 65, 134, 136, 233]
2779B33p2R2j39m7J42j11Lk7l6k2R6k0M1l5J10j91J07M6O3J5j81O2K02n9j20k0k0%m0nK5j
2404I1K8n5J38q4K6J37Kj63J08k0j84K1nJ7jJ3K6Jj9J58p7m2m3QJk7k9M2J14L3M0K6k08K56
2005C29p8j7j1J11K8j51n0q9J03p5Q0n9nJ4l0N5n1l9K4N3J29M4r3qNM8o8j1o1k3J35o3p7Q6
1606A85R5j52%n4J3J13n2qk7N5n6l4M0j9m7J04kj00L4N9j06R7lj2o1OL6l1J22mo8p8P9m1l2
1195E1J30J04m1k16J07qn0J06J67j45o2R7j84P5mL8j08P1J52l3j55K4l3J34K2k34J21Lk3K0
843A26p4L3RM5%KK8o9L5L0n7K1m6M0j6p5O0OJ4j2m0J23l1R0jj96J38J06j22j55R2l7J61K4
444B52j54l2P8n8j9J40n8J9J7n3KJ16l0r3m9K24j52k4J37K4j23n2J16J09q0m5R7r3o2n7M9
80A46Ol1j3M1Np0J30l9L6R7j62j10L8J16r4mQ2k5K8j3p0mJ6
$$ y = [233, 161, 253, 114, 67, 209, 98, 101, 74, 38, 16, 112, 92, 133, 98, 208, 17, 124, 170, 233, 248, 67, 129, 331, 272, 152, 132, 112, 112, 72, 67, 92, 91, 119, 64, 202, 118, 144, 281, 283, 120, 228, 208, 24, 45, 40, 57, 56, 69, 95, 96, 77, 235, 158, 116, 73, 81, 82, 55, 26, 68, 182, 215, 255, 281, 73, 329, 251, 234, 223, 334, 362, 211, 161, 72, 175, 100, 180, 121, 116, 130, 100, 155, 104, 65, 89, 142, 271, 315, 222, 214, 219, 267, 199, 188, 127, 104, 239, 176, 99, 185, 280, 128, 128, 74, 87, 200, 148, 140, 113, 168, 112, 78, 118, 99, 52, 156, 154, 54, 88, 147, 41, 138, 135, 123, 62, 68, 104, 73, 195, 191, 123, 45, 124, 83, 51, 181, 285, 244, 28, 135, 127, 77, 183, 350, 205, 143, 240, 56, 131, 127, 165, 57, 128, 280, 247, 92, 116, 83, 217, 239, 5, 126, 129, 106, 126, 52, 85, 94, 139, 139, 141, 169, 100, 135, 165, 108, 129, 83, 123, 107, 32, 92, 98, 112, 100, 60, 183, 152, 242, 241, 45, 183, 289, 167, 12, 104, 67, 228, 252, 98, 66, 144, 86, 67, 207, 149, 168, 185, 132, 134, 250, 220, 127, 78, 302, 150, 126, 263, 287, 164, 112, 228, 337, 257, 212, 309, 216, 154, 97, 146, 152, 121, 108, 149, 154, 84, 214, 175, 211, 308, 146, 36, 74, 190, 96, 92, 174, 149, 177, 164, 94, 90, 106]
-190A06
##PAGE=	F1=-13995.4
##FIRST=	25169.313707327481097,	5807.6787752999953227,	0
##DATA TABLE=	(F2++(Y..Y)), PROFILE
5808A02L3K9j22J33M1n6J9Q7j31k4m4M2%N9j32P8j3JJ32j99K17p0M3j46k5J05j00m2M2P7n6
5444H0l2N4K27j0j88J6R0j0k5N9k24P7l4O7m9J0j8J5K8n0n1J00L0m1k0k4k9J18R9j56K1m2
5068H8k5R4p4M3N2O5j60J33K1q1J62k69J78L5j32N7K4j12Q2Qj64J18M4r7n2LM4M4m4l0N4j3
4693I6M8qm6J24qn1Q1j29J9m2J13q6P1K0r7P9j61J61l2j27J2R9l0q5J60j5NP2Jq6l5p7oJ01
4294A41j3Q0o3q0N0J08j15m6Q8K7o2P0N4j13MM5o6m1J7N9Jm0k7M0J16j20l7l2Q9K1Mr1J6K12
3894B96M1l3r9j15n5N8n0R1K5k1l6j8J0N9q6P8j02K9J9J6K0m7j5K20r0q2R5k6O1j29M5n3k6
3507H0k1J38J6k8N3p7l3K9J2j12R4n2R3l1k3o1J03J18p0j88K4R2j00L9J98l9k36J43P6j6J9
3143B40n0j14J24p2R3m2j10P1l0R9O7k32%P6M7J1O1q4m6J8n8R3j20Q5j01J9J11q1K5J3R6p6
$$ y = [102, 135, 164, 42, 175, 216, 160, 179, 266, 135, 111, 67, 109, 109, 168, 36, 114, 101, 102, 234, 35, 252, 182, 225, 79, 54, 159, 59, 17, 59, 136, 80, 48, 102, 329, 319, 131, 147, 237, 227, 202, 261, 37, 114, 80, 147, 98, 108, 90, 105, 133, 83, 32, 132, 162, 121, 101, 77, 48, 166, 265, 109, 130, 88, 63, 157, 83, 126, 178, 243, 83, 216, 237, 156, 318, 49, 227, 262, 130, 187, 211, 99, 181, 189, 25, 143, 187, 90, 38, 41, 85, 129, 85, 55, 109, 96, 144, 136, 90, 214, 206, 155, 236, 107, 126, 84, 197, 111, 182, 202, 105, 184, 23, 184, 152, 25, 37, 136, 106, 21, 181, 166, 171, 243, 244, 158, 123, 46, 40, 141, 128, 208, 145, 65, 115, 223, 108, 62, 150, 177, 115, 185, 239, 126, 130, 175, 109, 68, 85, 144, 145, 105, 78, 118, 234, 114, 77, 45, 134, 155, 159, 68, 84, 296, 337, 304, 205, 90, 35, 93, 43, 134, 159, 138, 102, 84, 94, 153, 67, 145, 43, 72, 91, 107, 127, 80, 65, 285, 195, 113, 208, 182, 243, 114, 159, 106, 80, 59, 197, 213, 185, 238, 161, 128, 157, 169, 57, 151, 99, 192, 161, 138, 77, 180, 298, 228, 40, 64, 156, 56, 95, 293, 254, 18, 161, 237, 221, 240, 190, 76, 200, 128, 221, 179, 69, 140, 110, 209, 276, 44, 44, 120, 167, 178, 239, 155, 109, 127, 69, 162, 42, 127, 26, 45, 156, 75, 100, 113, 209, 133]
2768A33R7j00n5J48j16Oj7n0l5J27j9NjQ3j63Q9L9J17k7j49l5K18j9j05m8Mj5q5M6M3k6L0
2392A20n0J82j20%J09j8j10N2M0j66N8j3k4L7n2L6j9N4J05j03J4o2j1K8N0q8l6J86J4J1L9
2028B63j85K80p7o1m9J18O4j63p1n3J19j09Q3m3KL4Pop5j8L8K3J16Op0M7k4M1n1j8o3n2J76
1641B29q8n6J10J17j69n1qOJ42p9M1l6Q6p7q4L3Mq9J02M8r2k6O1m4J46l1j06n8K8L8n6J47
1265A88lj2j09L1k2k1R7R3j0j79L5oK4J18J01j37l1M7j76N7M8L9r9L1J53kj68K3l6J63Nj93
890D9R1l7k3Q3j10mN5J0j1Q9J1j17M1Pn1O9o9J1J2q1L7K7K8J6o6J37p7J12nj42J10O5j20j30
491A7M6k8J98K1j50l1N2l3j2J47o0k4M2l5nR4k1j07k4J99j21m0J21P8k09j6J21J15o3n3N6
127B75p8k4l5J07n5p0K1O0J3j22J24n8N2N1q2j18OJ25j26M7O2m6mK3k5l2L1
$$ y = [133, 230, 130, 75, 223, 107, 113, 96, 46, 11, 138, 119, 124, 123, 206, 43, 132, 171, 288, 261, 112, 77, 295, 276, 171, 123, 127, 112, 27, 73, 116, 90, 120, 70, 252, 132, 132, 241, 223, 113, 165, 205, 39, 97, 84, 60, 97, 45, 81, 62, 116, 221, 118, 132, 70, 59, 87, 137, 49, 13, 199, 213, 224, 263, 78, 358, 281, 220, 171, 289, 353, 190, 119, 66, 185, 76, 159, 116, 118, 152, 159, 153, 78, 60, 98, 121, 237, 243, 173, 220, 196, 237, 186, 168, 105, 53, 229, 141, 85, 195, 312, 143, 92, 84, 90, 232, 153, 194, 158, 244, 167, 83, 116, 120, 31, 133, 181, 89, 63, 124, 80, 226, 195, 89, 31, 59, 97, 41, 188, 185, 173, 64, 95, 73, 52, 149, 242, 232, 53, 88, 82, 106, 224, 325, 188, 157, 204, 28, 85, 133, 172, 73, 104, 257, 255, 87, 110, 74, 237, 242, 49, 140, 103, 80, 163, 53, 49, 104, 114, 103, 192, 203, 86, 127, 134, 83, 152, 83, 94, 106, 25, 62, 89, 117, 133, 67, 204, 127, 239, 234, 92, 202, 267, 147, 17, 63, 35, 233, 254, 104, 73, 125, 92, 80, 227, 167, 143, 185, 150, 145, 239, 218, 111, 87, 286, 165, 125, 246, 324, 115, 99, 220, 335, 272, 219, 275, 197, 173, 138, 245, 190, 120, 141, 201, 214, 92, 216, 158, 210, 261, 179, 61, 67, 192, 66, 113, 175, 129, 125, 148, 123, 91, 122]
-190A22
##PAGE=	F1=-14097.7
##FIRST=	25169.313707327481097,	5807.6787752999953227,	0
##DATA TABLE=	(F2++(Y..Y)), PROFILE
5808A35PJ0p7R6L7m6k0J01p3p6j5KRP7j19P9l7J3J24j77K17o6oj35J2Q3j16J9lM2Nm5PK04
5409B68J1j58J3J23n1m5K3j25pM6J5o9M6l3P6j2o9K0M9J5m7k2L8k0J19Mj53R5o5o3J18k2m
5021A14J21K1j63J27K2j06J72k58J79O2j62O2qj00R1J6j47Q5O0p8n1K1rP3n4m2P0j2L3nk7
4657A07J31l7K5J8j33N4j28J93j31P3jj01J21j43J61l7j38j4R3J7p2J37n2J6Q1K4j14k3j13
4317A4M3J15j8P0r4PK5P8r4l9L8K5n1Q4L2q3l7K0k1j01O3J07l9l7q6O9J28r9n2k3L1NN9q5
3918E4K8K18K7m6j10r0m0Q0p6P8K6j0l1k1L9N2j06P1r7M6M7l1N6q3l2J77n8q4J28lM5j67O5
3531A52p2K4m2J26J8k3L5n1r2R1J6j58J43m5O7J4j07n4J73Q7r6j53K3L9q5P4K29n1k40J31
3178A73N4j1ol9j12J57n0L2l5j10Q8QqJ01j89L2J5M2lM0oq7M9r7J23j40J44j59O2J22p5n8
$$ y = [135, 142, 152, 75, 171, 208, 162, 142, 243, 170, 94, 79, 81, 90, 167, 48, 127, 90, 103, 227, 50, 267, 201, 195, 60, 72, 155, 39, 58, 55, 97, 102, 57, 64, 268, 279, 121, 134, 257, 206, 161, 184, 59, 52, 98, 113, 44, 90, 57, 133, 121, 52, 72, 121, 136, 89, 67, 105, 85, 204, 208, 55, 150, 85, 22, 140, 118, 114, 235, 256, 93, 220, 242, 136, 308, 50, 229, 291, 129, 191, 183, 83, 174, 190, 43, 128, 188, 110, 59, 80, 71, 144, 90, 48, 118, 106, 139, 134, 107, 238, 201, 226, 244, 111, 165, 37, 230, 99, 172, 171, 70, 191, 48, 209, 172, 34, 20, 113, 130, 58, 195, 143, 159, 240, 264, 150, 127, 14, 57, 172, 154, 224, 130, 137, 162, 240, 146, 107, 145, 170, 119, 203, 235, 152, 115, 135, 114, 13, 76, 183, 144, 107, 21, 90, 218, 119, 67, 44, 75, 80, 139, 54, 82, 300, 327, 281, 171, 81, 41, 121, 45, 123, 149, 139, 108, 87, 126, 178, 72, 143, 46, 92, 139, 108, 164, 81, 49, 226, 168, 84, 212, 209, 254, 87, 152, 80, 104, 62, 188, 206, 183, 218, 167, 75, 166, 182, 24, 167, 122, 189, 203, 96, 42, 215, 302, 206, 53, 76, 115, 30, 104, 333, 282, 42, 173, 227, 216, 210, 171, 59, 216, 166, 198, 163, 53, 141, 149, 141, 242, 53, 85, 100, 142, 139, 179, 173, 86, 135, 38, 161, 21, 165, 6, 68, 190, 115, 57]
2803E7K8P9n8P6p4J9R9p8jl8m3k8J14j9pK2N4j29M4M3J60p3j14j09K04L1o2o4k2J0q4M8O6
2416A51p6O1p0K18j40k0P6l3n3l7R8q0M2k9qO7m7n8j3J18L8r6L1o7k6L5J43j02m8J23J6l7
2040A77N8j61K83p1q5q6J14Q7j66p1QJ17j59J08m2j3O1L7o0o4j1M9pR0j0l0O8n6J7j6l2Ol1
1653A09R9j05j5J04J28j88q3N4l1J74r0P8n0R4q2j00L6j0q5Q7R2r6q0M3M5J75o2j41n6J2K5
1289H1m5J37qM9j21l4lrO7O8L7j31pj4N5J10M3j17Jj6j04rJ05K8p1k6J44J5j33Mm6J93j7j45
890H1M8n0JJ01j06n3P9pj7J31K3j32K6l4k8R2p4k3N0o0QM3L2M1q0J12j02J31j4r3Q6Qj10o3
491D7k4K2J66J6j30oRJ1pJ41o1p1R0m1k6O7nr2mJ53r4l4R4J24k59j4J25J14l5p0K2n1OrJ44
80C18r4j12M0Q4N3j99J13o6N8RJ0q1o5J16j34N2M8m3l1M3K4n7M8
$$ y = [57, 85, 164, 106, 182, 108, 127, 226, 148, 147, 109, 66, 38, 152, 133, 126, 148, 202, 73, 117, 160, 320, 247, 133, 24, 228, 259, 197, 133, 111, 121, 37, 85, 151, 75, 136, 66, 284, 144, 124, 200, 167, 114, 77, 175, 95, 137, 108, 100, 167, 120, 62, 49, 167, 205, 109, 140, 73, 47, 82, 225, 123, 75, 198, 214, 177, 235, 74, 357, 286, 201, 115, 229, 316, 150, 79, 87, 204, 45, 153, 111, 98, 159, 196, 136, 72, 61, 110, 103, 193, 183, 153, 221, 165, 182, 166, 134, 140, 109, 208, 103, 88, 192, 320, 132, 49, 103, 72, 246, 156, 234, 184, 278, 196, 96, 132, 122, 37, 124, 216, 120, 40, 83, 128, 303, 241, 100, 44, 56, 81, 36, 173, 165, 214, 93, 59, 56, 47, 114, 182, 219, 88, 81, 67, 122, 232, 275, 158, 159, 143, 39, 30, 135, 163, 92, 66, 210, 225, 92, 96, 50, 243, 226, 81, 129, 79, 80, 181, 75, 22, 101, 94, 77, 208, 231, 99, 125, 91, 63, 155, 81, 58, 108, 48, 56, 99, 131, 172, 92, 204, 102, 233, 219, 126, 212, 220, 110, 47, 23, 45, 211, 227, 97, 91, 100, 111, 104, 245, 184, 113, 203, 162, 136, 203, 198, 106, 102, 255, 161, 127, 221, 345, 86, 72, 197, 311, 276, 206, 228, 177, 183, 174, 318, 224, 112, 152, 236, 289, 90, 203, 137, 195, 204, 214, 133, 68, 184, 50, 102, 150, 107, 76, 119, 143, 86, 134]
-190A34
##PAGE=	F1=-14200
##FIRST=	25169.313707327481097,	5807.6787752999953227,	0
##DATA TABLE=	(F2++(Y..Y)), PROFILE
5808A72pl9l0P0K9m3m5R5kj46N3m3K1Q4j05N8n4M4Q6j18K00o3p0j03K0P7j21Q2om6O5J6l1
5420A00J04Qj24L1J45p4p5j6J5p9P4j0o9L2J7J17o9q6O3K7j0k9k8O6J1R8j09p1J07p7o6Q9
5045A12J6j1J52k9j18Q5L1j25J79j88J04R4j85O9l7q5J00Qj07K2R2n8n1M4n7Q3m5l5O8j5Q
4681A21J2k4J34p4R9m9j04Q4j86K29j56Q8k6j16J55j17J33m4j12j0N1P0m3O8p0K1Q0N0j17
4340A47K8j41M5R8qN9j02P6oM2n7l5j1J2k7R0j5k8n5l2M9p2M8R9o1j4q3L6J06n9n4l9L7o9
3941DJ04o8L1K16J5o0j27n1j3R5p9N5kJ7ql2M4M7j10N8j03O7Q6q3P7j13J1P7k7n0J26J0K2
3554B36j86Q0o6P7r0J17J3lJ0k7j32J30J7j30J45n0L7N4j39l0J79K6j13q4J1km7P8K41o1k37
3190E4J14L7oj7k3r1J54l3j7l2o0O7L3j04J24j45M5m3P4k6L0N6j32Q5r2J02p2J14j79O8J37
$$ y = [172, 165, 126, 96, 166, 195, 152, 107, 202, 200, 54, 107, 64, 85, 169, 64, 122, 68, 112, 198, 80, 280, 217, 147, 44, 64, 141, 20, 102, 96, 50, 115, 131, 100, 204, 212, 88, 119, 264, 190, 115, 99, 114, 35, 109, 99, 30, 62, 79, 196, 127, 41, 104, 131, 121, 92, 64, 130, 141, 239, 130, 59, 166, 89, 23, 112, 128, 117, 269, 240, 122, 207, 238, 113, 292, 104, 208, 302, 117, 186, 149, 64, 164, 172, 65, 87, 179, 121, 70, 114, 57, 140, 95, 60, 128, 113, 121, 133, 109, 243, 169, 268, 219, 115, 199, 13, 242, 86, 174, 148, 32, 187, 70, 203, 159, 47, 37, 88, 158, 115, 183, 113, 134, 214, 264, 147, 175, 34, 79, 177, 169, 228, 126, 202, 196, 238, 181, 146, 135, 147, 120, 210, 195, 167, 112, 80, 129, 57, 105, 204, 143, 129, 46, 82, 188, 129, 75, 36, 73, 4, 108, 40, 71, 287, 302, 242, 115, 64, 51, 146, 67, 122, 120, 137, 129, 97, 141, 188, 78, 136, 33, 100, 186, 103, 180, 67, 78, 155, 128, 78, 204, 214, 236, 50, 130, 64, 141, 51, 168, 181, 178, 188, 161, 29, 159, 176, 46, 191, 141, 178, 232, 93, 63, 242, 268, 155, 71, 82, 80, 33, 111, 352, 291, 54, 168, 205, 199, 182, 159, 68, 222, 189, 172, 140, 80, 147, 180, 76, 200, 55, 100, 57, 131, 105, 135, 191, 59, 144, 52, 154, 82, 196, 17, 85, 222]
2826B22o5j32K6N4jM2r0J22K9Kk1p4j9l1Q3k0QL1K7r0k0N7J78j12q1n6Q8O5po2q4N4m0K6P6
2416A85j31J09j06K35j37j6L3n6lq7J05J2K0o0K6Q0j6j40L8J23j8o9K4o9k2J7J97r1n8N1L8
2052B14q9P9j44K68o0r0j10J09P6j52m7P2J08k30J58n3n8R3O4r5j4l5P0n9P8M5k5L9q4rK5
1688A44m4J05k8Jp9J0O3J26j95p3P9m9J90q8R2o6P8p3q5N2m6o1O9J12r6p9j4J17J81p4j32
1324A37p2k6J9J6P6j1R4j10r9K2j8O0K7Q8q5rl6M3R0Rr4L5r0j7l0J12J1k9q6J18K0p2j1n7
925B5K06l0j15J0J6J0N1o3k0j5Mj0J17N7j15op5PQ0m9o8R4l4kN2L9L9q6O7j05J42k5n9O5m3
514A61j02K4k4L0Q7%r7M4m4M5QJ24o2j09J47o5n9M0J5n3J1R3p1j5N8J50k28o2J15J03%q6%
127A78k0J8QJ71j06j51M4R6J15k72J04o3M9j6R0l3j30Q4j07OM5l8j1K2P0n7M5
$$ y = [222, 157, 25, 51, 105, 104, 146, 56, 178, 207, 209, 188, 114, 95, 64, 147, 127, 135, 166, 193, 103, 83, 140, 318, 206, 125, 69, 157, 222, 215, 153, 69, 123, 83, 109, 185, 54, 163, 57, 292, 155, 139, 172, 116, 113, 26, 131, 143, 163, 103, 129, 209, 193, 53, 91, 214, 196, 127, 151, 82, 60, 77, 274, 183, 125, 176, 214, 125, 204, 60, 328, 268, 178, 68, 177, 253, 101, 54, 126, 234, 4, 162, 109, 51, 144, 208, 113, 99, 64, 134, 75, 153, 198, 173, 212, 128, 119, 144, 100, 205, 177, 178, 99, 109, 172, 298, 103, 30, 109, 60, 250, 162, 254, 188, 266, 193, 108, 160, 114, 53, 122, 234, 138, 59, 45, 162, 343, 269, 137, 65, 39, 58, 74, 150, 139, 233, 123, 24, 46, 28, 88, 115, 203, 118, 109, 73, 116, 206, 215, 121, 156, 66, 49, 19, 131, 142, 113, 27, 145, 165, 93, 82, 25, 231, 201, 86, 96, 112, 122, 173, 110, 90, 75, 79, 69, 186, 243, 128, 122, 47, 54, 134, 85, 17, 111, 77, 75, 127, 166, 205, 119, 186, 81, 223, 198, 139, 204, 161, 59, 83, 59, 89, 176, 176, 79, 123, 79, 124, 132, 256, 194, 85, 232, 167, 108, 148, 163, 110, 121, 214, 143, 128, 186, 336, 108, 46, 161, 264, 264, 178, 178, 158, 176, 184, 355, 249, 98, 142, 238, 353, 81, 185, 122, 171, 155, 245, 212, 82, 166, 59, 65, 110, 72, 61, 83, 153, 96, 141]
-190A41
##PAGE=	F1=-14302.2
##FIRST=	25169.313707327481097,	5807.6787752999953227,	0
##DATA TABLE=	(F2++(Y..Y)), PROFILE
5808B00j1r5LO9J7n3m3P4O0k05J15q5L7J02r8Rl8O9K9m0J74o8j35j4l1P9j05J26Kj24R8Q5
5432B03l5jl7r4R4J32q4r8n5J11o3M1oo7J5N5J50j12j08Q1L3l7KjK6N7N9k11O5P1q7m4J9L5
5033A09K1J43o4m1J4M8j35J82j14NJ23j92P5o2o7R8Ro9n1J40n4m8O2o1M9k1j9N7k8j3L5l3
4657I8J31r4J42j07n6J00j54J68j46R7l7j17J46r4Q4m5n6K6jR7k0ro8RP2P9r1Q9j50%O6J8
4282A77L7r8J31l5J6k2l2n0k1PQ1o8M1m2j05J27k6J7O7o7J6m1lL7pm9o5R9m6K1m2lK09Qp3
3871A96j38j9L3R0o2K8n3N0L5m4K5M6j05M6j23R6J18j20P6j30Q7k1k9K2Q7Qpj81Q9j5J06j64
3495B7J17JJ2rOr7P4J6k8J08p2QQ5j32j7J61n2j16nj1%j1M9K34o9k22Q7L3lk5Pm5J03k1m1
3085A52l4NL7M0j15P0r6L6p2J12m7L1P8j69J21n7M8j5R1j85N8J58n9j42k3K5P7K8j32J91m8
$$ y = [200, 189, 94, 97, 166, 183, 130, 87, 161, 221, 16, 131, 46, 83, 185, 87, 96, 58, 127, 156, 116, 290, 222, 87, 73, 42, 121, 16, 142, 144, 20, 118, 203, 168, 167, 130, 36, 130, 262, 178, 80, 25, 136, 73, 114, 108, 41, 56, 111, 261, 149, 41, 122, 155, 118, 120, 119, 145, 202, 261, 50, 115, 186, 99, 55, 74, 109, 130, 273, 209, 168, 182, 230, 95, 277, 163, 168, 291, 99, 174, 112, 45, 143, 152, 83, 32, 172, 118, 70, 132, 71, 120, 99, 80, 137, 109, 96, 131, 98, 229, 135, 277, 170, 114, 214, 60, 228, 82, 179, 142, 25, 171, 77, 161, 116, 60, 86, 85, 182, 162, 153, 85, 94, 166, 245, 154, 243, 93, 93, 159, 177, 214, 116, 247, 212, 228, 206, 174, 124, 103, 110, 191, 123, 164, 122, 17, 144, 118, 135, 202, 135, 151, 110, 107, 144, 137, 88, 23, 122, 76, 97, 55, 52, 261, 269, 196, 58, 39, 72, 162, 100, 128, 75, 125, 160, 116, 141, 187, 82, 128, 5, 101, 219, 99, 175, 45, 132, 111, 82, 104, 191, 199, 192, 11, 100, 85, 191, 27, 144, 145, 157, 148, 154, 57, 131, 147, 119, 227, 155, 163, 248, 116, 99, 260, 208, 92, 87, 76, 76, 65, 114, 348, 279, 57, 144, 177, 174, 149, 156, 111, 214, 193, 152, 118, 123, 160, 200, 85, 155, 59, 95, 23, 135, 88, 119, 197, 28, 149, 92, 140, 125, 216, 31, 89, 247, 188, 46, 23, 48, 125, 153, 21, 212, 164]
2721A64J03m5j11J1m3M5j9L8K8On1q7P5J63j29n6M3ML6M6m6j63J02J3J0P4j49J19j29K24j09
2357A67Rj6r3K8J7jO0Oj12P0Q3L1j91R4Q8m4n7M1q8j5J4J88o1p3rP0j24R7j42K44m4q5j11
1970D1J10K1j05oJ05R7k17J29o1q5Q3R0j01K6n8J05j30R2J20n5rj06j9O0n1J82m8o6j2KKJ11
1594B47j82j3M8JJ51p9Q1q5M6n3n5P4o6m6M9J02q1m2l4J16J64o8j08q1o9L9N3J5mJ07p4j43
1218A0O6o7P0k4J25m5ko3J5P2J0q5P2j14OJ4O2jJ3j21O0J4Pj0n8J75k4j14lJ24ml9J2J4j32
807C5M2j1O7J02p9n3q2M3L3jp5Q6rqO9O2Lq6J3q0J34l0m6M8o2j07J15j1jK7k7n4J05r2N3M5
385A68Q9o5j24J90q9j02K0L4j2K9L1m8MJ7J54j44r4O7P6L5r1j1QJ0J8J84r5j78M0Q3J86l20
9G0J00n7L3j5J35J5j76L5n0m0N1p8N1k9J09k0J0
$$ y = [164, 267, 222, 111, 122, 79, 124, 105, 143, 171, 177, 126, 39, 114, 277, 148, 92, 135, 139, 175, 221, 175, 12, 114, 127, 137, 211, 62, 181, 52, 276, 167, 176, 160, 67, 95, 112, 111, 171, 177, 65, 135, 218, 249, 58, 152, 240, 196, 139, 180, 92, 77, 91, 279, 218, 145, 136, 206, 82, 179, 37, 281, 237, 152, 41, 151, 172, 67, 61, 166, 263, 46, 175, 114, 29, 112, 202, 101, 127, 69, 174, 44, 136, 256, 201, 192, 86, 67, 127, 76, 258, 210, 144, 132, 134, 136, 247, 65, 52, 100, 101, 252, 173, 254, 169, 215, 162, 107, 181, 115, 69, 118, 220, 139, 97, 63, 179, 343, 275, 167, 86, 17, 56, 109, 124, 120, 227, 153, 10, 76, 9, 79, 55, 180, 135, 133, 70, 85, 157, 167, 82, 154, 40, 46, 60, 122, 121, 134, 13, 73, 87, 94, 84, 26, 201, 177, 63, 60, 184, 180, 141, 153, 167, 35, 77, 66, 133, 235, 156, 103, 21, 64, 97, 96, 21, 107, 98, 90, 159, 221, 224, 138, 151, 71, 205, 175, 129, 177, 115, 8, 123, 112, 111, 138, 111, 57, 162, 70, 123, 168, 257, 192, 68, 258, 169, 67, 87, 121, 109, 138, 169, 121, 125, 142, 296, 152, 58, 125, 201, 236, 145, 134, 142, 152, 170, 354, 259, 81, 121, 204, 390, 70, 170, 113, 146, 131, 266, 281, 105, 140, 90, 50, 101, 23, 74, 45, 154, 134, 144]
-190A44
##PAGE=	F1=-14404.5
##FIRST=	25169.313707327481097,	5807.6787752999953227,	0
##DATA TABLE=	(F2++(Y..Y)), PROFILE
5808B08qj30RQ8Pp7rN6Q7j87R3j13N5J42q7p7L5N6l8L9J43q3j68Q2j00Q0l0J00Qj20N9J32
5432B52l2n6r7k6J26Q7q9r9l6Q8k1K4Rq1L0N5J72j39q7M2N2n6K8M5m0R8J5k16J16M9r9l3n2
5045B9L7P7J01o0L5o2P0j41J71m6q4J27j71P7q6l2O9N7q0%Q8p5m2P0j6j3kNL6m3k5N3l7J17
4646B04q1J33j47j4J06r9Q9j08R2l7j06J14p9K6l6J1O4j4P4jp2n8j9O4J06m7J44j53n8K9N2
4282A79Nr1J76n5J5j3k9p1p2O7L1j02J04pq6R6K4j6K3o0L8kk2m2M6m9o7J47l9j0m0m7J94R
3883B34q3r1n0R0O3l6Oj07P8Q9n8pM7r6M6q9P2J23j28N2j12J36m5r6J02N4k2l7p8L1L9J22
3507B49k16R1j8Rj1M6m6k1K5Q3Q0j10j6J04j20KJ39j31r3N3l8L8pJ7K11p2j90N1L4Kl3M0L
3120A55L4pm1l9N9J2L6n2m2m4J3k5Q2n9L7P1j74J35k8kK0Q5j61J2J92n8j31n0K2J02K3r1J40
$$ y = [208, 200, 70, 79, 167, 174, 97, 88, 144, 231, 44, 137, 24, 79, 221, 134, 57, 92, 148, 110, 149, 292, 209, 41, 123, 23, 103, 73, 173, 181, 61, 120, 252, 220, 164, 67, 41, 167, 254, 165, 66, 30, 118, 97, 121, 130, 49, 79, 134, 306, 167, 80, 122, 174, 118, 146, 191, 151, 249, 264, 48, 164, 213, 114, 81, 29, 66, 143, 244, 184, 219, 157, 227, 86, 257, 211, 127, 254, 83, 160, 74, 42, 111, 168, 88, 88, 176, 101, 59, 129, 113, 100, 98, 103, 139, 96, 71, 124, 87, 204, 123, 256, 109, 95, 201, 102, 191, 83, 175, 138, 32, 146, 67, 93, 57, 68, 132, 118, 192, 191, 119, 61, 42, 106, 212, 165, 309, 156, 98, 127, 179, 184, 93, 269, 214, 229, 216, 187, 116, 44, 111, 142, 40, 144, 137, 51, 147, 171, 155, 178, 118, 156, 154, 132, 90, 136, 87, 20, 167, 128, 118, 78, 31, 225, 234, 151, 60, 10, 100, 163, 127, 133, 26, 104, 193, 135, 128, 175, 79, 125, 36, 108, 231, 103, 155, 43, 179, 134, 38, 140, 194, 172, 135, 57, 88, 127, 249, 33, 124, 106, 115, 104, 150, 104, 83, 108, 191, 271, 161, 145, 249, 129, 131, 270, 139, 46, 99, 61, 99, 92, 109, 320, 248, 58, 109, 143, 145, 112, 152, 155, 189, 182, 141, 102, 161, 173, 209, 157, 115, 71, 84, 59, 141, 82, 119, 190, 16, 151, 123, 121, 141, 226, 65, 77, 269, 211, 80, 30, 52, 154, 177, 86, 226]
2732B26j16J95o8j37L6o0J3j6P2J4oj6j33Q2J18j18m5J52rn6R8m0j40N2N7JO9j17O5j10J79
2369B42n9L2o1j33L9J14l7M0Mj64R5Q7Q0k05J39K1l9o0Q4j23j2M5J17k0r6m9J01j21J02j33
2016C0K02l2p7o8Q9n6j8J1J14Q2j78Q7n0j8l0J01o9K0o2J38j56P8J56q1n2j11oP5n4K11p8
1653A98q2M7j2o0Q3j45M0J3P5R7o7N4j06J0k0k9Q4m3n9L8N4m9J2k5P1J33n2p6p2n6L9L3k5
1265A03J7P8k0j61J10p7L4l9J01j1Lp7k5O6L9r1J08m4n3L0K4JL4j13k5LR4j0o2J29jj39M1
878F7J87k1j27R0L5j98O4l8J4J40l4j15j6N7l4M6o1L5J4j4J00R0n5p9l4l4J00k4n3K9k2n6
502E3J14%n0j8n2j3J62j22L8R9L8p5j11K05r5j50K4L5J3N2k2j9J0j8J39m4r5J3K0O8p3k4K1
115A23lK1J83o9j91M3L9K43l20R3n4J6J2J36N4j97j2Ml6O7j14M1o5J37L3m0
$$ y = [226, 110, 305, 237, 100, 136, 76, 89, 73, 145, 159, 153, 137, 4, 86, 204, 86, 41, 193, 184, 128, 226, 186, 46, 98, 155, 156, 225, 108, 173, 63, 242, 183, 215, 154, 21, 60, 174, 137, 177, 181, 17, 112, 199, 279, 74, 213, 234, 195, 135, 219, 96, 84, 129, 246, 226, 130, 81, 182, 61, 163, 30, 232, 200, 123, 55, 144, 88, 70, 81, 195, 277, 99, 186, 136, 118, 88, 189, 120, 140, 78, 216, 60, 138, 294, 213, 161, 50, 44, 119, 65, 276, 198, 116, 163, 151, 91, 174, 29, 69, 82, 157, 254, 187, 241, 135, 145, 125, 96, 180, 137, 78, 116, 170, 121, 133, 108, 179, 312, 260, 184, 112, 56, 95, 128, 103, 120, 198, 178, 17, 127, 50, 84, 45, 146, 135, 138, 61, 36, 102, 141, 50, 158, 114, 61, 91, 115, 116, 150, 37, 12, 15, 109, 99, 37, 166, 165, 26, 67, 254, 233, 106, 196, 231, 33, 97, 59, 73, 213, 179, 64, 48, 105, 71, 117, 56, 91, 105, 91, 191, 281, 226, 147, 113, 79, 179, 155, 102, 131, 109, 53, 167, 167, 117, 99, 47, 34, 196, 74, 112, 211, 249, 174, 63, 268, 173, 23, 47, 82, 95, 147, 125, 106, 116, 98, 237, 193, 98, 111, 131, 199, 126, 102, 123, 120, 141, 324, 255, 64, 107, 146, 389, 69, 162, 108, 124, 136, 272, 326, 129, 117, 121, 85, 152, 38, 79, 14, 151, 184, 144]
-190A44
##PAGE=	F1=-14506.7
##FIRST=	25169.313707327481097,	5807.6787752999953227,	0
##DATA TABLE=	(F2++(Y..Y)), PROFILE
5808A93lj21k1J13Mj10M6O0O8j66O2j07O2J81o3j76J25K5j03J04J08j09q7P7j40P3M6N3Nr7
5456A02K5J39k7p0r9L1J05L0q9p8j5J5L3L1J3q8M2M4J76j52k5l7O9o4M9R8j02J13k6j41R3
5092A95M9j09l4n9l1J39M3rQ5j18Q1j48J38J9j26Q1j16O4j00K1J7J46j48J08Mj22k7O8M5n2
4740A04j4L0J0n3k3N5k4R7o3R7j60lJ05k5J0o6Q0m0r9J03o9l6K2K6R7LJ9J0j02n5j7M4J11
4352A74%J83j45j16%P5l0p5K03n6L3l9k9o9p6J04n8NK6M1l6J4Q0m2l1m6N5K4l1q0P5o6k8J52
3953A91m3qn8n7J57K0q8j0o3Q5J9j1Jj17O1J41p7l4M6r0O3n4N3Q7j01J9o3J33k7j68J62N9
3578B28q4n0K3j0N8J36k20K9l7j4OQ5qj05P1J40O6j55l5J13j19M3J14j94k0M5n3O9j7j2J79
3214B72o9j37K0J5J1k7N1N0l7J3k7m2R2qK6K5j28j9JRM6p0N0N6j16R0j5k9K4R8j09n7K34o1
$$ y = [193, 190, 69, 48, 161, 165, 55, 101, 161, 229, 63, 125, 18, 80, 261, 198, 22, 147, 172, 69, 173, 281, 172, 85, 162, 22, 95, 141, 194, 199, 102, 127, 266, 239, 169, 70, 101, 206, 236, 147, 69, 54, 69, 102, 133, 146, 58, 100, 144, 320, 168, 143, 106, 175, 111, 160, 258, 156, 269, 243, 102, 195, 244, 135, 101, 42, 11, 150, 193, 184, 269, 151, 232, 84, 222, 241, 115, 196, 80, 144, 44, 65, 82, 228, 80, 188, 192, 70, 43, 111, 156, 104, 90, 120, 130, 77, 54, 109, 85, 182, 119, 216, 56, 53, 158, 133, 143, 77, 157, 117, 18, 121, 52, 16, 38, 64, 161, 164, 183, 193, 91, 36, 19, 63, 174, 174, 357, 212, 96, 96, 171, 141, 66, 269, 213, 246, 207, 178, 109, 33, 137, 79, 84, 110, 151, 115, 129, 209, 167, 136, 90, 145, 169, 138, 58, 133, 67, 39, 191, 148, 140, 82, 25, 182, 202, 114, 104, 41, 126, 145, 134, 135, 18, 79, 220, 143, 109, 155, 65, 128, 74, 127, 214, 113, 132, 69, 202, 175, 7, 169, 228, 144, 94, 117, 107, 165, 301, 81, 110, 73, 59, 65, 150, 142, 37, 108, 248, 314, 159, 124, 237, 118, 161, 275, 81, 61, 106, 53, 122, 105, 93, 272, 203, 66, 86, 101, 112, 85, 136, 186, 149, 162, 135, 93, 185, 177, 203, 228, 100, 81, 82, 91, 137, 67, 117, 173, 57, 147, 132, 103, 127, 225, 116, 59, 293, 232]
2815B32j25o1O8P3qm1Q3j58K48q2j48M4p1KpR3rj1Rr2K6M9n4m0K19qj25J32n9r3rP5MP1o3
2404A64k7m8J10KL9j00j21LJ78k8pJ6j00j6J01J15j73J59p2j7n8J30j59qR1J6K4j22n7J08
2052A43p7Q5r1J37l1p6JM4j01N2J1J08O2j20M8j6L1j07P9k3j9n4J59j37K8J54q6q0p9kP6n7
1676F2J92j10m6P5j7j05N1r7O2LJ23N4n1K9j31j2L5k3N8J9r6N8m4jO8j1K2J01l8m1n5l0L8
1289A42j2l2K9K7M1j80J64q1pj8K9K8ln2k6K7N1r4J34J2p9J5KQL0j00ooR3k6p7J16J9j13N3
878A08J91l2j54J13M5j96N8q0K3J08J1j75O9P3o7N0o2k5L6j7J48J07j18o9l1rL8jp8QN3l8
502H7J24J6r1p5jm0J93j22PJ57k2q5q6J96p5j60M7rRP9o1K1mk2R6M4r0om8Q6l1m8J1pK3J64
80B77l8j83N6k2K63k63O6n4PM6J06P4j90l7L0k8J00j16k2n1J25Q2q6
$$ y = [232, 107, 46, 114, 187, 179, 138, 221, 63, 311, 229, 81, 125, 54, 56, 49, 142, 133, 122, 131, 39, 65, 114, 60, 20, 239, 231, 106, 238, 179, 86, 77, 152, 156, 227, 164, 137, 89, 199, 201, 240, 140, 19, 22, 200, 172, 165, 181, 81, 65, 166, 281, 108, 267, 195, 178, 120, 250, 91, 83, 174, 190, 214, 92, 35, 143, 66, 151, 60, 197, 166, 90, 91, 135, 34, 86, 97, 205, 267, 147, 195, 179, 210, 103, 182, 159, 140, 86, 245, 108, 136, 290, 204, 124, 45, 43, 119, 62, 254, 144, 98, 173, 156, 51, 102, 5, 67, 70, 193, 247, 196, 225, 94, 82, 117, 94, 152, 171, 75, 133, 89, 88, 156, 145, 167, 268, 230, 189, 134, 104, 142, 130, 98, 127, 154, 195, 15, 179, 98, 91, 73, 102, 130, 127, 75, 49, 76, 127, 33, 167, 179, 100, 115, 117, 125, 155, 55, 49, 43, 136, 110, 33, 149, 168, 55, 108, 299, 267, 113, 226, 271, 75, 133, 53, 76, 184, 195, 20, 89, 162, 95, 145, 83, 58, 94, 77, 225, 332, 214, 145, 114, 105, 143, 142, 64, 72, 125, 87, 211, 227, 136, 61, 60, 20, 213, 91, 98, 255, 233, 148, 62, 258, 183, 23, 70, 61, 70, 149, 88, 109, 105, 83, 179, 223, 133, 127, 79, 165, 134, 86, 97, 90, 113, 277, 239, 56, 112, 90, 353, 90, 156, 102, 109, 155, 261, 335, 145, 108, 138, 110, 210, 94, 72, 21, 146, 228, 142]
-190A42
##PAGE=	F1=-14609
##FIRST=	25169.313707327481097,	5807.6787752999953227,	0
##DATA TABLE=	(F2++(Y..Y)), PROFILE
5808A58Oq3n7J16J2j45J06P7L0j66N1p0N6K00k9k26J70j2j43J41O0j37L6K1j45Q4R3Jj2o4
5456A29J5R9k1o4o9N5Q2j9p7m8k4m4Q4N3mp8L9L7J57j49N3j27P8o6O8J46j35Q5n6o2O9O3j09
5068A60m5j4n0R2oO3J17j42O5j56Q8P5j13km0L4r1N9k1K20k19K07p1j76J9K8J04n3n7M8j5
4704A08n0qL2QQ0p2P6j21m2Q6N2n0m4P1n1l5O4m7lL9n0J21M0m2Jr4m7M9J1O5K4K06j25j63
4305H9j3P5m9k2J73m1N4q4l4m8j1Q1j18J11p7P7Np5J33o0q6k5O8L1l3k6N0j16L1J29n3J3q3
3918F6k9R7M2r1M6n3O4l1MK4j00J6J78r3m8L7q7R4l7N2J7m3j1k1J00Jj61J45R0j44j1O1m1
3531A33M8J53k02l2m8m4L2J15J4r2Q9J14O1j88n4J16j26J04Q0k19L2K3l6O2l3l9J46o2o3J0
3178I4l1J1J9J4R4r9M1k0l3J01k6J5R6j58m0K1NJ4q1O7N0n0L5k3k5PJ18m7j14K64p3j21p1
$$ y = [158, 164, 81, 24, 140, 152, 7, 113, 190, 220, 54, 105, 35, 91, 291, 262, 36, 206, 194, 51, 192, 252, 115, 151, 172, 27, 111, 204, 205, 193, 129, 144, 243, 222, 158, 89, 144, 226, 207, 130, 82, 58, 14, 98, 151, 147, 69, 108, 145, 302, 153, 206, 79, 157, 91, 159, 305, 170, 255, 199, 137, 206, 269, 160, 115, 101, 51, 143, 137, 200, 317, 175, 240, 84, 172, 247, 134, 132, 92, 126, 35, 94, 73, 293, 74, 281, 210, 34, 53, 81, 185, 132, 75, 123, 108, 58, 50, 82, 90, 170, 98, 174, 53, 11, 97, 149, 99, 55, 126, 75, 40, 104, 57, 54, 93, 43, 164, 204, 162, 163, 69, 22, 71, 82, 147, 171, 377, 252, 89, 76, 151, 102, 80, 253, 212, 266, 182, 148, 100, 89, 170, 52, 163, 86, 163, 168, 93, 226, 166, 80, 55, 123, 154, 121, 95, 145, 29, 60, 189, 136, 149, 66, 37, 134, 176, 85, 131, 78, 142, 111, 115, 139, 39, 55, 233, 140, 92, 129, 42, 136, 99, 151, 168, 125, 114, 93, 193, 194, 33, 178, 268, 124, 113, 174, 133, 181, 334, 132, 100, 52, 8, 40, 155, 169, 77, 166, 280, 341, 153, 99, 215, 89, 193, 273, 54, 86, 109, 73, 135, 102, 63, 209, 147, 84, 94, 63, 74, 93, 107, 201, 102, 143, 123, 90, 191, 165, 180, 276, 118, 78, 99, 104, 118, 37, 104, 154, 104, 139, 116, 91, 98, 216, 169, 55, 319, 246, 125, 54]
2791E4J27L6o9J8L7j58K35q3j43L5o7J5K8P0l7j0J7m2j1j5O3k1J90k0j25J28r6n6n0O3K0Q4
2416B17kj31L8L9N8K5j28p1J4J28%l5K9k6j33J12J31j04J42j69Ml5J58j74%J21p8O6j21mL5
2052A06j4N1m4Q6m5q1P2j0n7L3QQ8L9m8K2K6N3j46M8J1o1n0J63j04k7J31p1r1j5l0P8o0J37
1664A98j34K6P0rr3L7p6L0K1J21L1l1K0j54MQ5k4rR2j47J16j58L4J13Kj2P7l9om5jL8n8j5
1265A04K1k2R5j82K06p4n1rl0Q7l5%Ok1J4p8J44M6q3j1jLK5q5J2k0J02n6r4J50J6o7K9J65
866C06l2j19Q0M5j75O4j18P9K7M9j57Q4Q1p4L1p1q5N3j3K09J01j68n9K5k0m5M0j08j3J13l5
502I5J54M0j11j47Q6q0J71r4k8K00p4q7p5J78l0j48O0m0qQ8p8N8l1ML5J02q5np6O9Ro9k5K0
103G8J9J28qj55O5m7K13j70K5n8J1P2O2P2j61l3K1l2J40j07n9k3Q4J15j13
$$ y = [54, 181, 217, 148, 166, 203, 45, 280, 197, 54, 89, 22, 37, 65, 135, 98, 88, 105, 63, 52, 37, 100, 79, 269, 249, 124, 252, 156, 100, 50, 113, 133, 217, 215, 84, 122, 161, 219, 244, 116, 45, 59, 187, 187, 152, 181, 155, 22, 134, 265, 161, 303, 134, 138, 103, 261, 87, 87, 208, 130, 196, 75, 71, 106, 92, 143, 99, 185, 140, 59, 131, 121, 64, 97, 105, 193, 232, 184, 206, 232, 285, 139, 187, 198, 137, 87, 250, 146, 119, 250, 179, 88, 73, 43, 121, 61, 198, 64, 90, 160, 151, 58, 95, 19, 49, 70, 191, 222, 191, 211, 57, 61, 146, 122, 113, 205, 58, 174, 16, 50, 163, 165, 153, 230, 191, 185, 140, 139, 177, 119, 104, 125, 103, 198, 16, 222, 148, 97, 88, 58, 145, 110, 110, 116, 95, 109, 31, 175, 221, 138, 127, 126, 129, 154, 69, 81, 61, 163, 107, 13, 163, 179, 112, 141, 306, 274, 155, 235, 280, 105, 169, 51, 130, 157, 206, 49, 133, 214, 140, 171, 100, 15, 68, 55, 264, 365, 197, 138, 163, 143, 98, 138, 30, 17, 130, 95, 249, 289, 178, 31, 117, 37, 208, 114, 86, 286, 212, 125, 50, 228, 198, 50, 110, 70, 62, 150, 72, 130, 99, 103, 138, 240, 155, 150, 74, 143, 152, 83, 58, 78, 97, 225, 217, 62, 127, 80, 293, 123, 148, 90, 101, 173, 235, 307, 146, 113, 134, 102, 242, 135, 76, 53, 137, 252, 139]
-190A39
##PAGE=	F1=-14711.2
##FIRST=	25169.313707327481097,	5807.6787752999953227,	0
##DATA TABLE=	(F2++(Y..Y)), PROFILE
5808A11J7l5n5P0K5q1O7R5lj86Q0n8O4J90Qk48J94m7j37J41%j41J36n8j10J04J07m3m4k4L1
5444A70K6k5m0n3Q2N8n4l8j8n1MM0O8m0m8K3L7J18j27J18k03P6o0Q2J76j30J9p1QN1Q3j01
5068A80n4L1n5K1j0R5J51j41K5j64L8J14q0n8J9j0o2Q0m2K54k41K59j29j92O6m3J40l5j00
4728E7N2k8l1J3j9M9P6j19R0m9j7j0P9o6m8O4m6N3jj7K2L4j28J37Q2p7m5n3rO7J2J5J3K12
4329C64r6j84j2M7k6L8R1j8O1j15m9j4M8M9r9J27j10O8L2j49J66p0j34NP9J3k0N0L6j43L9
3965G4R0o5N8q8k2L8P0r3P0l0M2q1MQ0r8NJ70r2n1K2q7J31m1O2o6L7m0KN2K7j18J00J22j69
3566A15M7N6p0K2J68j65p8n1Mj2J29K0m5R5N2N7j98p5J12j30J69M2k15M1K1kK7m3o4J04m3
3202I0J6J2m4m2Q9l7J17j45P0k6rQ6l7KJ50j45p8O8k8k2m9M5N7Oj8n1J1nJ20J2j35K58r7j07
$$ y = [111, 128, 93, 38, 108, 133, 52, 119, 214, 211, 25, 105, 47, 111, 301, 309, 61, 255, 208, 71, 212, 212, 71, 207, 149, 39, 143, 250, 207, 163, 139, 170, 196, 171, 131, 78, 160, 218, 164, 126, 108, 57, 61, 101, 169, 129, 81, 104, 141, 259, 132, 250, 47, 123, 63, 145, 321, 191, 210, 139, 147, 198, 281, 180, 126, 157, 102, 123, 113, 208, 359, 218, 243, 79, 117, 231, 151, 93, 112, 102, 40, 120, 78, 332, 91, 350, 221, 29, 95, 52, 192, 157, 57, 109, 81, 50, 63, 44, 93, 169, 50, 140, 91, 74, 64, 143, 77, 29, 93, 47, 100, 99, 82, 104, 138, 10, 147, 229, 152, 107, 54, 45, 112, 124, 139, 152, 364, 268, 84, 72, 119, 93, 131, 222, 204, 265, 150, 101, 87, 135, 184, 85, 212, 102, 170, 202, 53, 219, 149, 15, 20, 99, 112, 92, 142, 178, 35, 74, 164, 99, 157, 69, 47, 85, 155, 62, 132, 102, 144, 63, 67, 147, 49, 54, 224, 132, 81, 103, 16, 147, 106, 168, 102, 139, 99, 101, 153, 180, 62, 162, 284, 115, 162, 218, 148, 170, 338, 173, 95, 44, 48, 36, 165, 185, 140, 235, 287, 344, 146, 71, 183, 53, 222, 264, 49, 90, 111, 109, 136, 93, 29, 133, 90, 106, 118, 74, 32, 121, 84, 201, 56, 126, 100, 91, 177, 140, 142, 292, 147, 69, 137, 109, 87, 38, 83, 140, 146, 128, 77, 88, 83, 203, 215, 80, 338, 241, 134]
2803A34p1J79j1j40Q2Mj31J71p3j21J7k9L3O0K3o6jLJ6l7L6O9j7J44m3o9R7j36k9p8K7N1J07
2416B01N0j92R3rQ9pj37l1N1L8L2k6K9L2j30L5J32k8R4k36MMJ59j48NJ17j43J07o8Rj9K3J1
2028A41pN2o1o7J06m2l3J8pO1J9K2J7N9M9j60L3K9q9o4J49o8o6J06m6q8M1n9P4n4O2p7K9O6
1629A45Ln7O4j16mM4P2L3j4K8j70M3J08j2o0J20j99J91j27o1J21J5k1O6o1K4n3K6M3q5Oj1
1254A01m9J29j53K22n5q3k6k5J31q9M0L3m9m8m3J41O3q1l8J5j9M3p8J1n2J42q2q2J67Ml1n
878A54J20k0o2L0M0j46P7j48J27l5P5j30R0P6p6J0p8m9j8MK65P1j96m4Q1k7j41Q4j06J9O7
514A14m0J99P0j20j91J28r4J19n5n5K20j14n8r2J55K3j44P7n0MO4p4P5n6J8rJ28p5oo7L9L0
138A63q1o0O7QQ2K0j19N1l1J26o6k3o4K5Q6J9M3j18rrm6J71q3m1k2L5J26j19
$$ y = [134, 63, 242, 231, 91, 173, 177, 46, 217, 144, 23, 40, 11, 44, 104, 127, 61, 60, 63, 79, 42, 78, 147, 130, 274, 231, 162, 259, 123, 94, 16, 43, 94, 201, 251, 59, 152, 143, 232, 225, 88, 57, 108, 146, 178, 152, 181, 213, 83, 118, 250, 222, 316, 80, 84, 88, 247, 99, 104, 221, 78, 185, 117, 126, 107, 130, 141, 134, 186, 125, 58, 164, 122, 89, 107, 100, 161, 180, 202, 219, 278, 327, 167, 200, 229, 140, 76, 225, 157, 91, 197, 151, 63, 104, 45, 119, 65, 127, 50, 79, 145, 148, 91, 155, 39, 35, 79, 151, 184, 170, 198, 28, 71, 179, 167, 107, 227, 28, 219, 92, 31, 152, 167, 146, 212, 151, 175, 122, 148, 191, 106, 112, 101, 52, 181, 28, 250, 195, 112, 86, 61, 192, 103, 143, 176, 127, 79, 36, 177, 240, 159, 121, 136, 117, 160, 82, 93, 41, 183, 101, 19, 186, 190, 159, 154, 274, 254, 192, 222, 262, 116, 193, 45, 172, 137, 212, 82, 172, 248, 172, 182, 104, 55, 37, 41, 306, 377, 181, 137, 218, 191, 50, 134, 28, 47, 114, 74, 273, 343, 223, 32, 160, 66, 185, 130, 75, 295, 181, 123, 31, 186, 209, 65, 142, 92, 96, 160, 86, 161, 105, 123, 114, 242, 167, 161, 94, 133, 163, 82, 22, 89, 97, 179, 199, 80, 131, 100, 226, 160, 137, 73, 98, 184, 203, 246, 128, 119, 110, 64, 235, 152, 111, 89, 124, 250, 131]
-190A31
##PAGE=	F1=-14813.5
##FIRST=	25169.313707327481097,	5807.6787752999953227,	0
##DATA TABLE=	(F2++(Y..Y)), PROFILE
5808F4K8Qm0L1K2kPJ04j5j58Q6q3Q5J51M0k51K11q2r6J26o9n4J35j52l0J06R6p2p6J0O9m7
5432A52m9jo7J12L6p2K7J2p8L1J3O0p7%OL4O3q2J43k36N7m9Q5J84r3o4o9N9L6J03r2n4P2o5
5033A37m6L9O1J96j24k9j62%J32n6l7K0o1k8R2n9K55k06K54j61j53Q1j11J45j3j06K2j7jK8
4681I2n7N4Q4j58J00J4jk1J3m2l3K8J3P4n9OK0L5j26Q5J16n5j25ROO6K1j8k2K04o6j69nmM1
4270A20O0m%N5j02p0K6Q3Ko3J16q0K2M7j65J41p3o3k0M9k5K6Q5M7j27qL9o5J28o3p1pJ02q4
3871E8N5mK1j22%J51p4LJ05n4o2J5q5J48n6O8j41J30q1K6j1N2m5K8J34j40Q2M2r2k1J81j13
3495A98j03m8K3j7J23J1MR5pM4j84r1R8j05J96Mj98K9M4K7j3l7m4JqQ4J3j6o0P9m3R2j67Q2
3096A06m2L0N1m0j1J80j07q7J08o6o7L4k9O9M8o2q8O2J5Q3O0j35K24j27p6n2K05o7j84J34
$$ y = [64, 92, 100, 60, 91, 113, 111, 118, 222, 207, 49, 135, 52, 137, 288, 328, 77, 288, 206, 110, 236, 167, 113, 248, 96, 66, 172, 268, 196, 120, 130, 199, 152, 103, 102, 35, 147, 183, 111, 138, 150, 72, 103, 116, 176, 99, 99, 105, 139, 202, 120, 263, 27, 84, 35, 120, 304, 211, 147, 78, 137, 173, 276, 184, 130, 202, 137, 91, 130, 191, 387, 263, 234, 72, 72, 204, 148, 111, 131, 70, 42, 134, 75, 330, 124, 378, 217, 64, 145, 34, 179, 166, 60, 82, 65, 64, 92, 35, 89, 173, 15, 115, 129, 128, 107, 120, 78, 45, 73, 86, 160, 101, 107, 127, 162, 36, 121, 237, 182, 57, 66, 72, 138, 159, 141, 119, 323, 257, 88, 83, 79, 120, 180, 176, 176, 231, 129, 59, 85, 168, 170, 107, 223, 143, 165, 212, 47, 188, 115, 52, 32, 81, 56, 82, 167, 214, 87, 79, 118, 53, 181, 118, 47, 40, 142, 58, 113, 109, 130, 8, 8, 159, 85, 88, 193, 139, 77, 92, 7, 155, 99, 167, 26, 156, 75, 101, 90, 142, 97, 125, 259, 119, 201, 243, 151, 130, 311, 198, 95, 47, 70, 53, 176, 187, 191, 286, 279, 323, 139, 48, 146, 41, 237, 241, 43, 72, 116, 143, 130, 93, 49, 50, 42, 126, 139, 123, 63, 142, 99, 191, 24, 106, 64, 94, 145, 105, 94, 274, 167, 80, 188, 122, 55, 89, 60, 129, 177, 115, 27, 89, 104, 187, 247, 112, 336, 209, 133, 81, 286, 219, 35, 169]
2744A69j9j15R9n2p9L3nM6O6l1p1J5l5P6n8J02M1j8Q8p2J6N0j43j7m9K1LJ22Q2j69P8k3Q4
2357B35m5j13k2Q9n0O1RJ8O4j00l2J41J7K9k20k6J6J42q8kQ9j70J44j5kk4K2k2J5K6o9k7R5
1970A85l5n7L0m2L5NP8K9P3K5j49L3M0j00r6J22l9o1P7k5p2P7q5O4l1J5M1p8R8Jm2J01j53
1582F4LK4JN9j7M6j62N3J23Qn5Q7k22K35j02r5P7L0pO3j00N3q0M5N2q7K5o3k3J10j10K25k5
1195B35r1o8L0J44j41N1N6n9j06j2J32O7q3n9M3m7R2r1lo4J74q9o1J42knm1O4MmoK9j19Q5
796A97j67J58o2Q7j19J00O0p5pp7J9o7RK87K8k02j6J00j1k03Q0p9M0Jm8K45J01j25k01J26
444A79q4O1k5o5K08j35%j00J04O8j43R3m7K9L3o6Q2p7Rl3J36n5j7n6K8L2q6j5N9j2L8N3r0
56A06J2j7P2K4o7p8M7Q5j0np9L1m6m4J64n0J0l1j9J18j10
$$ y = [169, 150, 35, 134, 82, 3, 36, 31, 77, 143, 112, 41, 56, 21, 97, 39, 141, 182, 164, 252, 180, 196, 246, 103, 86, 37, 58, 61, 183, 265, 96, 174, 151, 235, 190, 77, 55, 144, 94, 155, 164, 182, 246, 146, 114, 255, 272, 301, 81, 55, 71, 213, 125, 123, 212, 42, 186, 171, 169, 145, 167, 145, 160, 186, 117, 90, 185, 150, 93, 123, 81, 116, 121, 199, 228, 301, 326, 177, 210, 250, 150, 54, 176, 137, 76, 153, 128, 56, 133, 48, 112, 81, 96, 137, 59, 157, 158, 116, 217, 64, 67, 91, 92, 151, 134, 180, 18, 71, 194, 202, 147, 234, 12, 247, 145, 50, 127, 157, 150, 213, 113, 166, 86, 131, 183, 96, 121, 58, 35, 145, 35, 260, 235, 144, 76, 106, 250, 109, 160, 216, 157, 51, 39, 171, 238, 155, 96, 139, 92, 184, 93, 90, 26, 200, 111, 50, 192, 190, 185, 144, 208, 212, 208, 202, 231, 112, 197, 30, 188, 126, 213, 94, 194, 254, 179, 172, 95, 114, 47, 56, 343, 371, 169, 153, 253, 242, 39, 119, 40, 80, 81, 33, 278, 379, 254, 53, 179, 95, 156, 131, 66, 274, 139, 139, 39, 143, 211, 68, 161, 114, 143, 176, 110, 192, 115, 124, 91, 227, 172, 155, 99, 127, 159, 73, 58, 117, 105, 143, 196, 106, 118, 101, 173, 197, 130, 52, 99, 184, 174, 169, 90, 121, 75, 31, 195, 145, 155, 124, 105, 223, 113]
$$ [...]
-190A81
##END NTUPLES=	nD NMR SPECTRUM
##END=	
##END=	
