##TITLE=	Lqkfs8QXSB+RjLkTXLqNtw.123.ser
TM-VI-124 Zr+ph-prraz. hmqc

##JCAMP-DX=	6.0	$$ MestReNova 14.3.0-30573
##DATA TYPE=	LINK
##BLOCK_ID=	1
##BLOCKS=	2    
##ORIGIN=	Mestrelab Research S.L.
##OWNER=	hrzepa
##$MNOVA/LINK_BLOCK_TYPE=	ITEM	$$ NMR Spectrum
##$MNOVA/ITEM/POLYGON=	(XY..XY)
5321,5835
8722,5835
8722,8208
5321,8208
5321,5835
##$MNOVA/ITEM/Z=	0
##$MNOVA/ITEM/ANGLE=	0
##TITLE=	Lqkfs8QXSB+RjLkTXLqNtw.123.ser
##JCAMP-DX=	6.0	$$ MestReNova 14.3.0-30573
##BLOCK_ID=	2
##DATA TYPE=	MNOVA NMR VIEW DATA
##DATA CLASS=	MNOVA VIEW DATA
##$MNOVA/2D/THRESHOLD=	1.8856180906295776367
##$MNOVA/ITEM/ZOOM/X=	-0.98001264966690615488,	11.003459999979801509
##$MNOVA/ITEM/ZOOM/Y=	-9.7479769829748601495,	190.10579999390242278
##END=	
##TITLE=	Lqkfs8QXSB+RjLkTXLqNtw.123.ser
##JCAMP-DX=	6.0	$$ MestReNova 14.3.0-30573
##BLOCK_ID=	3
##DATA TYPE=	nD NMR SPECTRUM
##DATA CLASS=	NTUPLES
##NUMDIM=	2
##ORIGIN=	Bruker BioSpin GmbH
##OWNER=	nmr
##.OBSERVE FREQUENCY=	400.41200205000001233
##.OBSERVE NUCLEUS=	^1H
##.SOLVENT NAME=	Acetone
##.PULSE SEQUENCE=	hmqcgpqf
##LONGDATE=	2021/10/21 02:47:17.000
##.ACQUISITIONMODE=	SIMULTANEOUS (DQD)
##$ORIGINAL FORMAT=	Bruker XWIN-NMR
##$MNOVA/SCALES_VERSION=	9
##$PARAMETER FILE=	(acqu2s, ASCII, /private/var/folders/f6/rjf_tdyn2v98c5c0wvkgn4s80000gn/T/Lqkfs8QXSB+RjLkTXLqNtw/123/acqu2s, 0)
$$ ##TITLE= Parameter file, TOPSPIN		Version 3.2
$$ ##JCAMPDX= 5.0
$$ ##DATATYPE= Parameter Values
$$ ##NPOINTS= 129	$$ modification sequence number
$$ ##ORIGIN= Bruker BioSpin GmbH
$$ ##OWNER= nmr
$$ $$ 2021-10-21 02:56:47.716 +0100  nmr@CZC10666PP
$$ $$ /opt/topspin/data/agmb/nmr/Oct20-2021/123/acqu2s
$$ $$ process /opt/topspin3.2/prog/mod/go
$$ ##$ACQT0= 0
$$ ##$BF1= 100.683175
$$ ##$FnMODE= 1
$$ ##$NUC1= <13C>
$$ ##$NusJSP= 0
$$ ##$NusT2= 1
$$ ##$NusTD= 128
$$ ##$O1= 9059.81359838393
$$ ##$SFO1= 100.692234813598
$$ ##$SW= 200.226863172749
$$ ##$SW_h= 20161.2903225806
$$ ##$TD= 128
$$ ##END=
$$ 
##$PARAMETER FILE=	(acqus, ASCII, /private/var/folders/f6/rjf_tdyn2v98c5c0wvkgn4s80000gn/T/Lqkfs8QXSB+RjLkTXLqNtw/123/acqus, 0)
$$ ##TITLE= Parameter file, TOPSPIN		Version 3.2
$$ ##JCAMPDX= 5.0
$$ ##DATATYPE= Parameter Values
$$ ##NPOINTS= 12	$$ modification sequence number
$$ ##ORIGIN= Bruker BioSpin GmbH
$$ ##OWNER= nmr
$$ $$ 2021-10-21 02:56:52.025 +0100  nmr@CZC10666PP
$$ $$ /opt/topspin/data/agmb/nmr/Oct20-2021/123/acqus
$$ $$ process /opt/topspin3.2/prog/mod/shimcntl
$$ ##$ACQT0= 1000000
$$ ##$AMP= (0..31)
$$ 100 100 100 100 100 100 100 100 100 100 100 100 100 100 100 100 100 100
$$ 100 100 100 100 100 100 100 100 100 100 100 100 100 100
$$ ##$AMPCOIL= (0..19)
$$ 0 0 0 0 0 0 0 0 0 0 0 0 0 0 0 0 0 0 0 0
$$ ##$ANAVPT= -1
$$ ##$AQSEQ= 0
$$ ##$AQ_mod= 3
$$ ##$AUNM= <au_zg>
$$ ##$AUTOPOS= <59 >
$$ ##$BF1= 400.41
$$ ##$BF2= 100.683175
$$ ##$BF3= 400.41
$$ ##$BF4= 400.41
$$ ##$BF5= 400.41
$$ ##$BF6= 400.41
$$ ##$BF7= 400.41
$$ ##$BF8= 400.41
$$ ##$BYTORDA= 0
$$ ##$CAGPARS= (0..11)
$$ 0 0 0 0 0 0 0 0 0 0 0 0
$$ ##$CFDGTYP= 0
$$ ##$CFRGTYP= 9
$$ [...]
$$ 0 0 0 0
$$ ##$ShimPowMaxUC= (0..63)
$$ 130000 130000 130000 130000 130000 130000 130000 130000 130000 130000 130000
$$ 130000 130000 130000 130000 130000 130000 130000 130000 130000 0 0 0 0
$$ 0 0 0 0 0 0 0 0 0 0 0 0 0 0 0 0 0 0 0 0 0 0 0 0 0 0 0 0 0 0 0 0 0 0 0 0
$$ 0 0 0 0
$$ ##$ShimPowMaxUG= (0..63)
$$ 524287 524287 524287 524287 524287 524287 524287 524287 524287 524287 524287
$$ 524287 524287 524287 524287 524287 524287 524287 524287 524287 0 0 0 0
$$ 0 0 0 0 0 0 0 0 0 0 0 0 0 0 0 0 0 0 0 0 0 0 0 0 0 0 0 0 0 0 0 0 0 0 0 0
$$ 0 0 0 0
$$ ##$ShimPowRcbType= 3
$$ ##$ShimPowRes= (0..63)
$$ 1e-20 1e-20 1e-20 1e-20 1e-20 1e-20 1e-20 1e-20 1e-20 1e-20 1e-20 1e-20
$$ 1e-20 1e-20 1e-20 1e-20 1e-20 1e-20 1e-20 1e-20 0 0 0 0 0 0 0 0 0 0 0 0
$$ 0 0 0 0 0 0 0 0 0 0 0 0 0 0 0 0 0 0 0 0 0 0 0 0 0 0 0 0 0 0 0 0
$$ ##$ShimPowRng0= (0..63)
$$ 1 1 1 1 1 1 1 1 1 1 1 1 1 1 1 1 1 1 1 1 0 0 0 0 0 0 0 0 0 0 0 0 0 0 0 0
$$ 0 0 0 0 0 0 0 0 0 0 0 0 0 0 0 0 0 0 0 0 0 0 0 0 0 0 0 0
$$ ##$ShimPowRng1= (0..63)
$$ 1 1 1 1 1 1 1 1 1 1 1 1 1 1 1 1 1 1 1 1 0 0 0 0 0 0 0 0 0 0 0 0 0 0 0 0
$$ 0 0 0 0 0 0 0 0 0 0 0 0 0 0 0 0 0 0 0 0 0 0 0 0 0 0 0 0
$$ ##$ShimPowRng2= (0..63)
$$ 1 1 1 1 1 1 1 1 1 1 1 1 1 1 1 1 1 1 1 1 0 0 0 0 0 0 0 0 0 0 0 0 0 0 0 0
$$ 0 0 0 0 0 0 0 0 0 0 0 0 0 0 0 0 0 0 0 0 0 0 0 0 0 0 0 0
$$ ##$ShimPowRng3= (0..63)
$$ 1 1 1 1 1 1 1 1 1 1 1 1 1 1 1 1 1 1 1 1 0 0 0 0 0 0 0 0 0 0 0 0 0 0 0 0
$$ 0 0 0 0 0 0 0 0 0 0 0 0 0 0 0 0 0 0 0 0 0 0 0 0 0 0 0 0
$$ ##$ShimSysFunc= (0..63)
$$ 1 2 3 4 5 7 9 11 15 16 8 10 12 14 6 17 13 18 19 20 0 0 0 0 0 0 0 0 0 0
$$ 0 0 0 0 0 0 0 0 0 0 0 0 0 0 0 0 0 0 0 0 0 0 0 0 0 0 0 0 0 0 0 0 0 0
$$ ##$ShimSysMatrix= 0
$$ ##$ShimSysType= 1
$$ ##$TFXNUM= 0
$$ ##$TRIPLO2= 0
$$ ##$VTU= 2
$$ ##$VTUETH= <149.236.99.20>
$$ ##$VTUTY= <no>
$$ ##$WBREFAM= (0..15)
$$ 135 116 100 100 100 100 100 100 100 100 100 100 100 100 100 100
$$ ##$WBREFLM= (0..15)
$$ 0 0 0 0 0 0 0 0 0 0 0 0 0 0 0 0
$$ ##$WBREFPH= (0..15)
$$ 71.66 -68.25 0 0 0 0 0 0 0 0 0 0 0 0 0 0
$$ ##$WBSGU= (0..15)
$$ 0 0 0 0 0 0 0 0 0 0 0 0 0 0 0 0
$$ ##$XFAC= 2
$$ ##END=
$$ 
##$DECIM=	4160
##$DSPFVS=	20
##.ACQUISITIONSCHEME=	NOT PHASESENSITIVE
##NTUPLES=	nD NMR SPECTRUM
##VAR_NAME=	FREQUENCY1,	FREQUENCY2,	SPECTRUM
##SYMBOL=	F1,	F2,	Y
##.NUCLEUS=	13C,	1H
##.OBSERVE FREQUENCY=	100.69223481359800587,	400.41200205000001233
##VAR_TYPE=	INDEPENDENT,	INDEPENDENT,	DEPENDENT
##VAR_FORM=	AFFN,	AFFN,	ASDF
##VAR_DIM=	512,	512,	262144
##UNITS=	HZ,	HZ,	ARBITRARY UNITS
##FIRST=	19140.455529915001534,	4405.895418600002813,	0.33856999874114990234
##LAST=	-981.45727250430979893,	-392.40686505384644533,	0.28356319665908813477
##MIN=	-981.45727250430979893,	-392.40686505384644533,	0.00053802435286343097687
##MAX=	19140.455529915001534,	4405.895418600002813,	10.696680068969726563
##FACTOR=	1,	1,	0.0028104875267474281955
##PAGE=	F1=19140.5
##FIRST=	19140.455529915001534,	4405.895418600002813,	0.33856999874114990234
##DATA TABLE=	(F2++(Y..Y)), PROFILE
$$ [...]
##PAGE=	F1=-11337.7
##FIRST=	19140.455529915001534,	4405.895418600002813,	0
##DATA TABLE=	(F2++(Y..Y)), PROFILE
960C9J56r7q1Q9O6O1O0j58%M1o6o3K71K5k00J8p2j7L7l6N9j1m4M4O5j58K61J3k05M5P4m7j12
$$ 39 195 98 17 106 172 233 293 135 135 176 110 47 318 343 143 161 89 72 109 73 132 121 77 121 186 28 289 302 97 142 216 169 57
650E7L3Q3J3q5p5j4J27p5j6R0JQ8j28l3J8K1J9O9mj21J03J0m6J9K4j43P8Q5J6j23L7J2m4Q0
$$ 57 90 173 186 101 26 12 139 64 48 138 139 227 99 66 84 105 124 193 189 68 171 181 135 154 178 35 113 198 214 91 128 140 96 176
331A76q9kQ5q7K2N3J28j01L1n7j05N4m3K7K7r1R0n2J16o1K4P5p1J57j28p0k1o0O1J85n3j74
$$ 176 87 85 170 83 105 158 286 185 216 159 54 108 65 92 119 28 118 66 182 121 145 220 149 306 178 108 87 27 88 273 220 46
30D6M6L0Q0j14N1N6l4p9J8O8j14oK3n4M4M8m7m3O9R0O3l7O7J3q2o4n2N3n9L6p8N3J6m0k3J57
$$ 46 92 122 202 88 139 195 161 82 100 168 54 48 71 17 61 109 62 19 88 178 241 204 271 284 202 138 86 139 80 116 38 91 107 67 44 201
-308B01O5n9j14K0j09J30q8O4J44
$$ 201 266 207 93 113 4 134 46 110 254
-392B54
##PAGE=	F1=-11416.5
##FIRST=	19140.455529915001534,	4405.895418600002813,	0
##DATA TABLE=	(F2++(Y..Y)), PROFILE
4406B27j31q0K9K1O0M3m3k6L5p3M1K3Q9J3j03O1j11J11J09K2m3j71O6n3l1M5J23j5j8j4j68
$$ 227 96 16 45 66 126 169 126 100 135 62 103 126 215 228 125 186 75 186 295 317 274 103 169 116 85 130 253 238 220 206 38
4115C8Q4j8oQ7J3j05L0K6o9qRM4m7J02m1m8n7jLNM8M6Jj29R3j3M9P9j03n2J01P2j36M3j29
$$ 38 122 104 98 185 198 93 123 149 80 72 81 125 78 180 139 91 34 33 36 41 89 135 136 7 100 87 136 215 112 60 161 233 97 140 11
3786A1J80p9R7K8o9j04L0J00O2Q3k49N8j5P0j75R8N6j08K5K9O4m6j11Q0l5L9O9q8L1k7R9m6
$$ 11 191 112 209 237 168 64 94 194 256 339 90 148 133 203 28 126 182 74 99 128 192 146 35 115 80 119 188 100 131 104 203 157
3486A57n3M9o5rp2J64j29J29J03q6m8j2p8P2m5j9J07l5q8J55p2P6l0k0N3K2K4j04j43M6J15
$$ 157 104 153 88 79 7 171 42 171 274 188 140 128 50 122 77 58 165 130 42 197 125 201 171 151 204 226 250 146 3 49 164
3195A64Pk2O5j72J01p4lL2N0L8l7r7R0j04oM0J6pjO4n0q9N4L1m3Q1J48q5o6J31o4N2Kj14j
$$ 164 171 149 214 42 143 69 66 98 148 186 149 52 142 38 32 72 88 81 80 144 94 5 59 90 47 128 276 191 125 256 192 244 246 132 131
2866A31J8J17nj15o6R5k8q8O1M0L5J7j29k5L8J37m1q7rp9N1J12J5N1j0j30q8J42jR1j4%r7
$$ 131 149 266 261 146 80 175 147 59 120 160 195 212 83 58 96 233 192 105 96 17 68 180 195 246 236 106 18 160 159 250 236 236 139
2556A39J21r5j27L6m0P3Q1M0J0j84M6Q6q8J97j09J8q5m3Q8o1p2K06l3j40K5L6k5o9K28O4j05
$$ 139 260 165 38 74 34 107 188 228 238 54 100 186 98 295 186 204 119 76 164 103 31 237 204 64 89 125 100 31 259 323 218
2265B18O3j35l1k6k5k0N0Nn7OK3Q0r8JP8j9o6P5M2K1j04Q6k5m9J60o8q7n0L5O4J7P1lrj80
$$ 218 281 146 115 89 64 44 94 99 42 48 71 151 53 54 132 113 47 122 164 185 81 167 142 93 253 185 98 48 83 147 164 235 232 223 43
1936D3K10p8Q1k4j83nJ17l5j03K3K7j1%J56j39K64M8j86r4q4J79j0j69J21M1jM6j22N8j07
$$ 43 253 175 256 232 49 44 161 126 23 46 73 62 62 218 79 343 391 205 111 27 206 196 27 148 189 188 234 112 170 63
1655F3J8O7p8O5L6J15j26p6jp1L4L0nP8N4rm7k1Oo5M6j07J00j3M7j13J81nk1m4jrp7J43K1
$$ 63 81 148 70 135 171 286 160 84 83 12 46 76 71 149 203 194 147 126 132 67 113 6 106 93 140 27 208 203 182 138 137 128 51 194 215
1326B15k7j5l5j3L7P6kj94J27Q4j47k9o5J17J18m5q5O9m5N0k0r5pJ0%l1J87P4k29K16o0j71
$$ 215 188 173 138 125 162 238 236 42 169 253 106 77 12 129 247 202 117 186 141 191 171 76 69 79 79 48 235 309 80 296 236 65
1025F5J49L2k37K10l4j27j1J24p0n0P1O3J4M3j30N1J7n0j08K20M2j52L9j03rL2m6J19m1l2
$$ 65 214 246 9 219 185 58 47 171 101 51 122 185 199 242 112 163 180 130 22 242 284 132 171 68 59 91 45 164 123 91
744I1N2N3j38K24j2j76M0K9n4j01O7N2P2j16m4j9J41r5%O7M2J26j53q2L3K4nO8Rq5O0K3p5
$$ 91 143 196 58 282 270 94 134 163 109 8 75 127 199 83 39 20 161 66 66 133 175 301 148 66 99 123 118 186 195 110 170 193 118
434A18N3j3r6O1Q0Kj12M3j7o1P9l2l7P4o4N9M7J13q9j6l5j29L6l0N9N9j05R0n7J47p4l8P3
$$ 118 171 158 62 123 203 205 93 136 119 58 137 105 68 142 78 137 184 297 208 192 157 28 64 34 93 152 47 137 80 227 153 115 188
124A88o8J68r0q5k2o6Q5J50l7j39K1j1P4q2J02O1p8r1N7L9j37K8K3m9MM5k8l9N0N9Q0k0O0
$$ 188 120 288 198 113 91 25 110 260 223 84 105 94 168 86 188 249 171 80 137 176 39 67 90 41 45 90 62 23 73 132 212 192 252
-186B52K6q8q5n5K3K1M7n8LM3r8kJ11O2Pj00L9j25J24r0M9J47
$$ 252 278 190 105 50 73 94 141 83 86 129 31 29 140 202 209 109 148 23 147 57 106 253
-392B53
##PAGE=	F1=-11495.3
##FIRST=	19140.455529915001534,	4405.895418600002813,	0
##DATA TABLE=	(F2++(Y..Y)), PROFILE
4406A91j21k6kJ2N1O9q7k7N4o6M0J6J13K2q7R9j59Q8P4J8j2j76R8l3k4RJ10j3j5k8j48M6L5
$$ 191 70 44 42 54 105 174 87 60 114 48 88 104 217 239 152 251 92 180 254 272 260 84 182 149 125 134 244 231 216 188 40 86 121
4096A21k0P0M6j14J8M8n7j6o8Q9n4J28r2Rl8o3O7k4%R3K2j53Q8l4O9P5o4j01J37O7j52M2j17
$$ 121 101 171 217 103 121 169 112 96 28 117 63 191 99 108 70 7 74 50 50 143 165 12 100 66 135 210 146 45 182 249 97 139 22
3786B2J60l9P7K5p0r5j9Q2O5P9k10Q3m1N0j15O1N1o9N2j5P9m1j28P2l3M6Q1j08Ln8K01n1j28
$$ 22 182 143 220 245 175 80 61 143 208 287 77 160 119 169 54 115 166 97 149 134 213 172 44 116 83 129 210 102 105 47 248 197 69
3476F9R7j17O8j03J63j70J46J29q9l9%m6Q3o6q3J68o4j00J14o7J13L0r2K5O3J8j20r3Q2Q2
$$ 69 166 49 117 14 177 7 153 282 193 154 154 108 191 125 42 210 146 46 160 93 206 236 144 169 232 250 130 37 119 201
3195B01n1k0Q3j76J76q7j9M0K1L5l7j32R8p1QK0K1JjJ4o8j8M2J0o4P9J84j01k3J24j04L9k1
$$ 201 150 130 213 37 213 126 107 147 168 203 166 34 132 61 69 89 110 111 110 124 56 38 80 90 26 105 289 188 165 289 185 224 203
2885B03j02L5J8J51l0j28o4R8l9q2L9M3K4N9j06k1L5R1j08l9ml7J08N0nP0kj38r7J01JR0m4
$$ 203 101 136 154 305 275 147 83 181 142 60 99 142 166 225 119 98 133 224 116 77 73 36 144 194 189 259 257 119 22 123 124 214 170
2575A70j2o6J28r8j11N1n2O8Q9P3Mj55N9M4j02J93j15j2o6J5P8o6m5J94j6j98M8N0o6n2J69
$$ 170 158 92 220 122 11 62 10 78 167 240 244 89 148 192 90 283 168 156 90 105 183 117 72 266 250 52 100 150 84 32 201
2284B01P1r5O5n7n3m5j5ML7jk3o7M9Q5j11M5J8j0m5N6M0K3j13J55o4NJ42o2j17m7M1LJ0J12
$$ 201 272 177 242 185 132 87 72 76 113 112 89 22 71 156 45 90 108 98 53 109 149 172 59 214 150 155 297 235 118 71 112 115 125 237
1964B37Ol0j76K17k6J0Lj99M2O6k3n0j2j3%L4J38j59K25N0j36j15m5J84j3j89P8Q0PM6j25
$$ 237 243 213 37 254 228 238 241 42 84 150 127 77 65 52 52 86 224 65 290 340 204 89 44 228 215 26 104 184 191 237 112
1673A12K2r1K1Q1r5K1J05L9j74rM2l0NJ4K8M8P0j7l8j02j8L3J16j39O0J7M3j10J44J0k1n0
$$ 112 134 43 64 145 50 71 176 215 41 32 74 44 49 63 91 139 209 192 154 52 34 67 183 44 104 121 164 54 198 208 187 137
1373A37M0j2j13J62L8m8k6n9J2M5N6l5j45J38O5j15m9p5J10J31m6j29N5l2J11o4q6pk8J8L8
$$ 137 177 165 52 214 252 204 178 119 131 176 232 197 52 190 255 140 91 16 126 257 211 82 137 105 216 152 66 59 31 49 87
1082H7J88Q7k63K03l3j77R2L8k00K24o2j12k8J10l1j2K4M4k8K5r2J01pl3j06J10N5p8N3j34
$$ 87 275 362 99 302 269 92 184 222 22 246 184 72 44 154 123 111 135 179 151 176 84 185 178 145 39 149 204 126 179 45
800D5qL1k5J45p4pN2K9j10J81m9j30N2j3p1PRK7R9j33kj0J17j01JP4N7J57j51j20K5L7m0O2
$$ 45 37 68 43 188 114 107 159 188 78 259 210 80 132 119 48 55 64 91 190 57 55 45 162 61 62 136 193 350 199 79 104 141 101 163
481A63J1k7JL6r8J04o2l4M2N7j7q9N6n2n9O2L3p9P0n4Q7O0Q4q0n2j9j12k0M5M7P4j16Q8o5
$$ 163 174 147 148 184 86 190 128 94 136 193 176 87 143 91 32 94 127 48 118 64 151 211 295 215 163 144 32 12 57 104 178 62 150 85
162H5J77r0q3P0p0J61m2p4l4p6J11J07l3j12J8k8O3n8J31O1j21q3R0J0j48N3K4m7pK1pm1M0
$$ 85 262 172 89 159 89 250 208 134 100 24 135 242 209 97 115 87 150 92 223 284 163 80 170 180 32 85 109 62 55 76 69 28 68
-148F8K6Q2MK6L5p9j08L0o9J10L8m5l3O6r1J0J3P2M0p9N3j32J08r6N3J35
$$ 68 94 176 180 206 241 162 54 84 15 125 163 118 85 151 60 70 83 155 195 116 169 37 145 49 102 237
-392B37
##PAGE=	F1=-11574
##FIRST=	19140.455529915001534,	4405.895418600002813,	0
##DATA TABLE=	(F2++(Y..Y)), PROFILE
4406A48j13L4k2J0M8Q2j47K1L4o5K9K2J28L8o3J16k05P3K9J1K0j67J17j3j9k6R0kj6l8j15
$$ 148 35 69 47 57 105 187 40 61 95 30 59 81 209 247 184 300 95 168 197 208 228 61 178 165 146 120 210 208 192 154 39
4115C9J3Q2k4N1P7j19pN4l5M6j10K5m8J45j30M8ro7Q3n2lJ05K6j67P5o9R0Q8k1p7J02L0j65
$$ 39 52 134 110 161 238 119 112 166 131 177 67 92 44 189 59 107 98 31 114 62 59 164 190 23 98 29 119 207 186 109 211 241 76
3805G6M2q1J25jO0J8o7o7k5J4N6P1j46P2n2L5n0K2M2j5N5o2J00l7j10M1m1P4O4j20j2j5K13
$$ 76 118 37 162 161 221 239 172 105 80 94 150 221 75 147 95 130 80 102 144 129 184 122 222 185 75 116 75 149 213 93 81 66 279
3495B79p6j58J31j28R5j21J54j33Q1J60p8l2J4l5R7q7j33K07p4j28P8n4J50Q0j46oQ3Rj22
$$ 279 203 45 176 48 143 22 176 43 124 284 206 174 188 153 250 163 30 237 163 35 113 59 209 289 143 137 220 229 107
3223A07m0J13N5j01k7R3j18J76r2l5M9LJ6l0j27R2n0K0K5Oj6K0jj15N9J9k6k4M0K05j22PJ14
$$ 107 67 180 235 134 107 200 82 258 166 131 180 183 199 169 42 134 84 104 129 135 119 139 138 23 82 101 75 51 91 296 174 181 295
2913B95j30Kk8p5O7K6J65o6j26k5P6p0p4N0M2qR3p0kOM9j61K2OPJ43pl7O8Rj23j02N1QP8p8
$$ 295 165 167 139 64 131 157 322 256 130 105 181 111 37 87 129 121 214 144 142 148 197 36 58 64 71 214 207 170 238 247 124 22 73 81 159 81
2575H1kRR6q5r0N2l5K0J01J04kj06O1j1r5J51j09l8l0O4N0o5j1J76pk48P8N6j05K8M9P9o5
$$ 81 79 88 184 99 9 61 26 46 147 251 249 143 204 193 98 249 140 102 72 136 186 121 110 286 279 31 109 165 60 88 137 216 151
2265A51M2J0o5l8j5K4K5NJ1j23K9R2j03P0l1K4m1N5J0L7j00J70r7O6J15n1j38l8L6l3k0J50
$$ 151 193 203 138 100 85 109 134 139 150 27 56 148 45 115 84 108 67 122 132 169 69 239 142 208 323 272 134 96 132 99 79 229
1964B29K8n1j56J96M5n3Jk08J02L%jo6m0M5L5J16j77J67O9q5j38kJ77j7j90K4J11J3M2j05
$$ 229 257 206 50 246 291 238 239 31 133 136 136 135 69 29 74 109 225 48 215 284 199 61 59 236 219 29 53 164 177 219 114
1673A14k6m1kQ7p3m9J70l6o9k1J8Pk2KM9KR9j5l0j31L3L2J49j61K4N1K3j17J07K7k3o1P8k1
$$ 114 88 47 45 132 59 10 180 144 75 54 72 79 57 59 108 110 209 194 164 33 66 98 247 86 110 161 184 67 174 201 178 117 195 174
1354A74j44J84O9n2m3q2K7N4L4p1q2J35M8p9k4j04J07J09m8j44J6j1J61j07o0l8nJ6P3J92
$$ 174 30 214 283 231 188 106 133 187 221 150 68 203 251 172 148 44 151 260 212 68 84 73 234 127 67 29 24 40 113 305
1072C05R4k82J72j1j84M3K9j13K10q0q3o6J28J3Ll9K3m7nm5J34l2k4q5J0P2mN0j51k3L3J1
$$ 305 399 117 289 278 94 137 166 53 263 183 100 34 162 175 178 139 162 115 110 65 199 167 143 58 68 140 136 186 35 12 45 56
772E6J45j07K4N3nq2J37q7n8N9m1n3N5l6L7O6j29L0nQ4r3mR7M7J72j32j39RN9p8N8JM3m2K5
$$ 56 201 94 118 171 166 84 221 134 76 135 94 41 96 60 97 163 34 64 59 143 50 46 143 190 362 230 91 100 159 81 139 140 183 141 166
443A66j24J64j07K7K1J9l7l8M7o8l4L9O5j00O4j6O9Q3M9q5n9j3n8k2N5J1P1j20Q6q2K04r9
$$ 166 42 206 99 126 147 166 129 91 138 70 36 75 140 40 104 88 157 240 289 204 145 132 74 52 107 118 189 69 155 73 277 178
143A78j07O0p1J41Km7m2r2J37O4l4r6L0j6N5p1J46N4j54n8J06j3j34N3L2l9qJ0nk9M6NL4L8
$$ 178 71 131 60 201 203 156 114 22 159 223 189 93 123 107 162 91 237 291 137 79 185 172 38 91 123 84 76 86 81 52 98 103 137 175
-176A75k5K9n6r4J16n0O4J3l4l5N0n3L1o7Q2K2n9N7j31R1j00P3J05
$$ 175 150 179 123 29 145 95 159 172 138 103 153 100 131 64 146 168 109 166 35 126 26 99 204
-392B04
##PAGE=	F1=-11652.8
##FIRST=	19140.455529915001534,	4405.895418600002813,	0
##DATA TABLE=	(F2++(Y..Y)), PROFILE
4406A13o1L4k3K2M3P0j58N0ro0OM9J21O0m8J19k48P1k0JO4j48J13Nj8n4O2J7k1m3o6jR9k4
$$ 113 52 86 63 85 128 198 40 90 81 21 27 76 197 257 209 328 80 151 131 132 196 48 161 166 148 94 156 173 152 109 43 42 141 117
4087A17M5R0j16mK4k5J16j10q0j7J33j30N0J8n8Q6o5K7Q8J7j79O5p0Q2Q6J5m0P0k4j71L6q
$$ 117 162 252 136 132 156 131 247 137 57 40 173 43 93 111 53 139 74 101 189 206 27 92 22 104 190 205 165 235 211 40 76 68
3786F8O6L0N0lo5k7ol8L9N4q6L6n9M7ppL8L4K7r7J20l6p8Nm6J15K6j14qM2J68j15j48J49j26
$$ 68 134 164 214 211 146 119 113 75 114 168 82 118 59 106 99 92 130 164 191 94 214 178 100 105 59 174 200 86 78 120 288 173 25 174 48
3458D8J13j34J44r9J6J85n6k2K9m1J04j02j59K21o3j75N7l2J79J14j90l3Q6Mj04JJ40M5j29
$$ 48 161 27 171 72 88 273 217 195 224 183 287 185 26 247 184 9 66 34 213 327 137 104 190 194 90 91 231 276 147
3185A47o2R1o4J57r2m4O5lj2j2r9O3k3K8K9j8m7N0J9j32P7%o8K7JK15j34J3J01j29m7j4m9
$$ 147 85 176 112 269 177 133 198 195 183 171 72 135 112 140 169 151 104 154 173 41 118 118 50 77 78 293 159 172 273 144 97 83 34
2875C4R5K9J54j03j03J8N2j16n1P2M1m2J12m1L3m0Nj05K5jL8J50m4p0N0J7r4r7MK8M4q0pR5
$$ 34 129 158 312 209 106 124 176 60 9 81 122 80 192 151 184 144 149 44 69 68 106 256 212 142 192 209 115 18 22 50 94 14 7 102
2556A02O0o2q4N2mnQ6J28k2m8N4p6r2J07q2o3J0Q5L4p0K0J55nk76J12N0j38J00n2R6j4j0M7
$$ 102 162 100 16 68 64 59 145 273 251 203 257 181 89 196 114 51 61 146 180 110 130 285 280 4 116 166 28 128 76 172 158 148 195
2246A95o6lk8L0RJ1M8j45j6R4p7O9n5O9n5P4l1O7j12J57j16J21Q0l1j44k8K7l0p2J65N1o2
$$ 195 129 126 98 128 137 148 196 51 35 129 52 121 66 135 80 154 123 190 78 235 119 240 320 289 145 117 144 114 42 207 258 196
1946A96j28J65J13r0l0k07J67n1RL0j18n0R2K2R7j49O5J09m9j57L8J57k4j79j9J23K1L5n7
$$ 196 68 233 346 256 226 19 186 135 144 174 56 6 98 120 217 68 133 242 193 36 74 231 207 28 9 132 153 188 131
1673A31o2rj6O5k7oJ06p0N6p1k1L6m2oP1p5J39qk3o8M1j0J59j65qQ5qj31P5M8k9o9J01l1j47
$$ 131 69 60 44 109 82 76 182 112 168 97 76 112 70 64 135 60 199 191 168 100 141 131 290 125 117 202 194 63 138 186 157 88 189 158 11
1345A1J80J00l9n4j06M6N3J5j08nJ08M0m7K7j25R8N8n3j35k2K6J75j44k7n4L8j5P8J93R4k77
$$ 11 191 291 252 198 92 138 191 206 98 93 201 241 194 221 96 194 252 199 64 42 68 243 99 72 18 56 41 119 312 406 129
1054A29J34Oj79nJ2k9J90p3n6r0J60N7j1j13J6k3o2LJ39n7k7n1NQ9qL4j39k9J4K7J41j40N5
$$ 129 263 269 90 85 97 68 258 185 129 39 199 256 245 132 148 125 63 66 205 148 121 70 75 164 156 190 51 22 36 63 204 64 119
744A19O3m6n9J00j10K5N5n8qM5o7Q0kj14L5%O4p5L3O6J8J72r8j41mQ5j00O2lR1l1l2j49K01
$$ 119 182 136 77 177 67 92 147 89 81 126 59 139 137 23 58 58 122 47 80 146 164 336 238 97 93 178 78 140 137 228 197 165 16 217
425B17j33P0Jk1m9K9Qo0j2M8M3q2M8L8K4R8J8j04l8j2j6j2N3l0N2j13Q1r6K19q8j29N7p2J22
$$ 217 84 154 155 134 85 114 122 62 50 98 141 59 107 145 169 267 285 181 143 131 115 103 156 126 178 65 146 50 269 181 52 109 37 159
105A59K7j6m0j11J56K6k7r2M4ON5j10J51L9j67k1R8k7j01L6M5j4k5K8k3%M9Jm9Q0n7qk9j9
$$ 159 186 170 130 19 175 201 174 82 126 132 187 77 228 267 100 79 177 150 49 85 130 116 91 119 96 96 145 146 97 177 120 112 83 64
-214F4J26k8K3j6k4j2jlO1q7N5k7m5N4j19P0o9P0O5
$$ 64 190 162 185 169 145 133 132 129 190 103 158 131 86 140 21 91 22 92 157
-392A57
##PAGE=	F1=-11731.5
##FIRST=	19140.455529915001534,	4405.895418600002813,	0
##DATA TABLE=	(F2++(Y..Y)), PROFILE
4406A02jpj4L6L4M9j12K8m6l1j5P3Q8Q1m6J13k83Q2p0J2J11j27Q0K3k4p3L3M1l4m4kJQ7k6
$$ 102 101 94 80 116 150 199 87 115 69 38 23 96 184 265 219 332 49 131 61 73 184 57 137 160 136 63 96 137 103 59 57 58 145 119
4087A19N5Q0j06L3k1m3J73r0j67J6R5r0J7L6m5P8n7M9P4Mj81N2j3K6N9M7lM8q0j61L1P9mM5
$$ 119 174 254 148 181 160 117 290 200 33 49 144 54 71 107 62 140 83 132 206 210 29 81 68 94 153 200 197 245 165 4 35 114 110 155
3767A55L9k7o8J8J3l6L1K6o6Mo0P9kj4M4N7k0j05J21m2l8k5k1J34k2q3J4O1J02j54o8J11j04
$$ 155 194 167 99 117 130 94 125 151 85 89 29 108 106 92 136 193 173 68 189 147 109 84 63 197 175 92 106 167 269 115 47 158 54
3458E4J23j48J39p9l3J94k7qL8n4R8j07j63K11l1j82J5k0J99J26k24n4Q8J6o9J2J60M7j45
$$ 54 177 29 168 89 56 250 223 215 253 199 297 190 27 238 207 25 40 20 219 345 121 67 155 171 102 114 274 321 176
3185A76j07P2k1J24r0m1R0ll0J0o3LK1M2J8m4q5P7M8j39P6mq9N0l0K23j25j7R1r6n8J1o9J10
$$ 176 69 141 120 244 154 113 203 200 170 180 117 120 141 183 201 157 72 149 197 58 134 130 41 91 61 284 159 142 233 137 79 90 21 131
2866A31K6J18j27o2M6L0j53M0K4M1m7J05l7Q3r0n0L5rk4N1J28n9q9K7J2o0p6KL4j2O1l7M5
$$ 131 157 275 148 86 132 162 9 49 73 114 67 172 135 218 128 78 113 104 80 131 259 200 111 138 150 90 14 16 50 38 99 62 107
2556A07N5n0j01P5J9rP0J45o1PL8j36r3O2k8p6K4Q1M1q5M6J29mk31R8L0j29J32j29J30L3n9
$$ 107 162 112 11 86 105 96 166 311 250 257 295 159 66 128 100 24 48 129 170 85 131 260 256 25 123 153 24 156 27 157 190 131
2256A31K9o0N8m9K2j0J0Q7j49l0P1m2M9o2R9o5Q9o0J00j45J35j21J68L5pj30k2J8kp0R4O8
$$ 131 160 100 158 109 131 121 131 218 69 39 110 68 117 55 154 89 178 118 218 73 208 87 255 290 283 153 131 149 147 77 171 239
1955B39n9j02J35J62j02p2j82K15q1mM3j60qQ6MQ5q0k3J29l9j38M5J24l3j62J4N9M3J9%o1
$$ 239 180 78 213 375 273 201 19 234 153 149 192 32 24 110 114 199 119 96 225 186 48 93 217 184 22 36 95 138 157 157 96
1664I6k6j0K4J9L2M5n0R3j03l5N8n1l1J08j45J53Kk3lL5l7J52j51l6J20m4j44M6P5l8o0R2
$$ 96 70 60 84 103 135 180 130 223 120 85 143 92 61 169 24 177 179 156 153 188 151 303 152 116 236 192 48 94 169 131 71 163
1364A63l1o7Q8J16j7n1j20O4M4oj41Q3N9M7k6Q5j28P8po2j16j1M1J59j58j1ojl3P0J87Q7k49
$$ 163 132 65 153 269 252 201 81 145 189 183 42 125 184 231 205 290 162 240 233 171 55 44 85 244 86 75 69 68 35 105 292 379 130
1054A30J01K3j36p5K6j6J78m2l5q6J74J07m6j89L8Rj13K7J28p2m9ON3J21q1J0j12l9J1OJ42
$$ 130 231 254 118 43 69 53 231 189 154 68 242 349 303 114 152 161 48 75 203 131 82 88 141 262 181 191 79 40 51 57 199
763A99j64P8Q3q8m5O7o4N2M7o3RL2q5J24m6j08OJ4Q0n4Q4k1j7J65n6j32pJ08r0O8J0R9J4j07
$$ 199 35 113 196 108 63 130 66 118 165 102 111 143 58 182 136 28 34 48 128 74 158 137 120 285 229 97 90 198 108 176 186 285 299 192
443A92j40J68j35R2rm2j3L5m2n0jP2Ln0M3P7oR3jj36%rOqN5o8J5r4P9q9K04n4j60Q1q3J14
$$ 192 52 220 85 177 168 126 113 148 106 56 55 127 130 80 123 200 194 287 286 150 150 141 147 139 194 126 141 47 126 37 241 187 27 108 25 139
105A39K7Rk8j24J56j0oq7M6K5O3j54J49J3j55J6O9l6n3J5N8K8o1N9m9M5L5lj22J13m0o5j9
$$ 139 166 175 147 23 179 169 163 76 122 147 210 56 205 218 63 79 148 112 59 74 132 160 99 158 109 154 189 186 64 177 137 72 53
-205E3L7J15mlm0j2J3n9M9Q5q5J0o2m6M4q0L3PK6J9
$$ 53 90 205 201 198 158 146 159 100 149 234 149 159 97 51 95 15 48 55 81 100
-392A00
##PAGE=	F1=-11810.3
##FIRST=	19140.455529915001534,	4405.895418600002813,	0
##DATA TABLE=	(F2++(Y..Y)), PROFILE
4406A13K9m6nM8K0K5n1mp3Qk1P9N3R5o0J03k89Q0r6O5J23j23L9M7m2q0K1O0n3m7O1nO8l0P8
$$ 113 142 96 91 139 159 184 133 129 56 64 43 122 175 270 210 313 24 104 8 73 196 73 112 159 117 37 58 118 65 18 79 74 142 112 190
4077A90N2r2P7m7p2J94n2j82j2N1m0lK0l3O2k6M9O9nj69M2K6j6J4Q1K0L5j23p2L1R5o4L5K6
$$ 190 242 150 227 180 108 302 250 68 56 107 67 64 84 51 113 87 136 205 200 31 73 99 83 97 178 198 233 110 38 69 164 100 135 161
3758A61m3o6N0K1rM0Pq7Pm0P8k3JN5N8p3o1P3n5Mm1M1J13o5l5M0M8K6j76N1L3l7R1j58J45
$$ 161 118 52 102 123 114 154 161 74 81 41 119 96 97 152 210 137 76 149 94 98 57 98 211 146 111 151 199 225 49 100 133 96 187 29 174
3429A74p3n9J83mJ1M0o7P9j01j41J72J2j62k1k6K08J16k44o4J08M9n2MJ63N3j68j37M9J0P8
$$ 174 101 42 225 221 232 272 205 284 183 42 214 226 64 43 17 225 341 97 33 141 190 138 142 305 358 190 53 102 112 190
3148A90q8j7J15rk8L0k7p9P9O4np3j04P8O9j43P1J4p0K5m3K23r8o6R1n1j9Kj13J11K4O5j24
$$ 190 102 85 200 191 163 193 166 87 166 230 225 152 48 126 195 52 123 137 67 92 49 272 174 108 199 148 129 131 18 129 153 218 94
2838I4j1M6Lo5K6l3L6j8Q3o4J38j15r4J42k8n0N1P9n1q3J5j6l2m1J9K4kJ06m3pP2o1j08J00
$$ 94 83 129 132 67 93 60 96 78 161 97 235 120 26 168 140 90 141 220 169 86 101 85 53 12 31 55 53 159 116 109 181 120 12 112
2519A12K5j5P3J62j11N2J6j84o8kL6m9j0M9P1j08P1J06%j76Q1mn9J15j72J50N7o4m8m9J26
$$ 112 137 122 195 357 246 298 314 130 62 60 96 47 37 86 157 49 120 226 226 50 131 127 68 183 11 161 218 154 106 57 183
2227A83o5Ok4mJ17j34j3L4qK6p0J09o3Q6p8J33j67J10j19K06j3Mj00j8J3K6l2j3P1m0r0J12
$$ 183 118 124 100 96 213 79 66 100 92 118 48 157 94 180 102 235 68 178 59 265 252 256 156 138 151 177 145 132 203 163 73 185
1927A85J84r6j08j29K33q5l3M4j85L8N9j4Q0jl1Q4m7r2L2Q1m2j34L8K4O8j6M1n1n4%JM3N6
$$ 185 369 273 165 36 269 184 151 195 10 48 107 93 173 172 141 225 178 86 118 199 157 23 61 85 153 137 178 127 73 73 74 117 173
1617A73Jk3Q3j17j9P5m6r2J64j04N1J6l6N8J6m7J31j19o0J47p6j28NJ00m4k2L7%mkJ01Ll0
$$ 173 174 151 234 117 98 173 127 35 199 95 146 162 126 184 200 153 284 165 105 252 176 48 53 153 109 87 124 124 120 118 219 222 192
1307A92j09P2K4k7j29J36oP4j8J31j13N1p7o9r3L3K9J40j28m3N2p1rL6J71P1k03Q6M4p3j26
$$ 192 83 155 179 152 23 159 153 227 209 340 227 278 201 132 39 72 101 241 113 70 122 51 42 78 249 320 117 203 247 174 48
1016D8O1r7J89lk6p1J71J64r3k52Q1J7j42K7J20o9q0Q3Q2J64j64k0p9o2K4l2J49j42O1J04
$$ 48 109 12 201 198 172 101 272 436 343 91 172 189 47 74 194 125 45 128 210 374 210 190 111 49 73 41 190 48 109 213
734B13j08n6L6J7L7M1n0MJ8r2J49n5j04j9J1J18m0J23j29l7J49j0j16oJ24o4P5J8R6O2j73
$$ 213 105 49 85 102 139 180 130 134 152 60 209 154 50 31 42 160 120 243 114 77 226 216 100 94 218 154 229 247 343 405 232
443B32j54J38j27J08qk9L2qp9o2KR4k4k6N2R3j2O7jj71L5OJ3j2N9j01l1o4P6m6J51lj98J28
$$ 232 78 216 89 197 189 160 192 184 105 43 45 139 115 89 141 234 222 289 288 117 152 158 171 159 218 117 86 22 98 52 203 200 2 130
124A30j05J13J2K3j2j21J29m8L3p9L3M2P4j69J28k5j09L3K6m4KkO8P2j03R0p8J02Mj0j60J17
$$ 130 25 138 150 173 161 40 169 121 154 75 108 150 224 55 183 158 49 82 108 64 66 64 132 204 101 191 113 215 219 209 49 166
-176A66Kq7l3M8R4J7j1m6%K2q9Q3R1p8m0n1o4J4%j3N8j6k1
$$ 166 168 81 48 96 190 207 196 150 150 172 83 166 257 179 139 88 24 38 38 25 83 67 46
-392D6
##PAGE=	F1=-11889
##FIRST=	19140.455529915001534,	4405.895418600002813,	0
##DATA TABLE=	(F2++(Y..Y)), PROFILE
4406A22M4o9lN6JJK1l9r4N0l5Q4L1R6q4R8k15OJK5J12j28J0Q1p4p6N0N3n8k9O5j9M9l8J01
$$ 122 166 97 94 150 151 152 173 134 40 90 55 139 170 266 182 280 65 71 72 97 209 81 91 172 98 22 72 125 67 38 103 84 133 95 196
4077A96K4q0J04m8p3J65lj59o3MJ0J5l5l3M9J5K0O9%j44M2K9k6l2J03J9K9j46J4N8Q5j00O
$$ 196 220 140 244 196 123 288 285 126 63 67 77 92 57 24 73 88 108 177 177 33 75 104 78 46 149 168 197 51 65 123 208 108 114
3767A14Ok9j6QJ2K3N0%j18L9k5N8m5K8N6N3j18Rpm8K2l4R4Q0r5J1P2J7n0r3Q0m9M5L2j53J59
$$ 114 120 91 75 83 95 118 168 168 50 89 64 122 77 105 161 214 96 105 98 50 72 38 132 212 117 128 200 217 167 74 154 105 150 182 29 188
3429A88p0p0J60NL4L3p6N4q2j00J08N4j39n4j3J95Q8k43l6J28P8o8mJ50M9j95j39K8L3J9q4
$$ 188 118 48 208 213 247 280 204 258 176 76 184 238 99 45 32 227 315 72 36 164 242 174 170 320 369 174 35 63 96 115 31
3138C1N8J05l2qN5Kj71J52Q5l4j03o9K3P3j31N3N6m5j8k2K04p4r3R2k4Rj6j38R1L6J1p1J1
$$ 31 89 194 162 154 209 211 40 192 277 243 140 71 94 167 36 89 145 100 82 60 264 190 97 189 165 174 158 20 111 147 158 87 98
2828I8K2l3L5Rr0K6J9O7j11J91r0l2R2m1p2M0K1l3l3J3p2MknK0M6R3k9k6P6q2p6R4J3k2Q7
$$ 98 120 87 122 131 41 67 86 153 42 233 143 111 203 162 90 130 151 118 85 98 26 30 28 23 43 89 182 153 127 203 121 45 139 152 130 217
2490B17J79j56P9ok07j5m1M0j6l1j7J12j29J07R2Qj50P0m3J9J02j96J40O1k1j20n6J74o8j2
$$ 217 396 240 319 313 106 91 50 90 74 43 26 138 9 116 208 216 66 136 93 112 214 18 158 219 198 78 22 196 128 116
2209A16k6l5J30j05J0RJ7J2o6R1n6O3q9J58j49Q6j16K27m6j8o2j2J1M5J8r6M1pr6R1J83q0
$$ 116 90 55 185 80 90 99 116 128 62 153 97 160 71 229 80 166 50 277 231 213 151 139 150 195 213 117 158 151 55 146 329 249
1908B49j25o9K32p4o1L4j70M9L7l6Q0O4j5L0n9m4K2L8m9r5L5M7P4n3M2m2p4PJ1L9O1k1j5N8
$$ 249 124 55 287 213 152 186 16 65 102 66 146 210 195 225 166 122 144 182 133 38 73 120 194 141 183 141 67 74 85 124 185 164 149 207
1589B07j14K3Q8l2j56K00m6n8N3q4J10j1m3R5o9p4J55r7o6k7Q6m2K3l9O5J8n8M8PQp2O6om5
$$ 207 93 116 204 172 16 216 170 112 165 81 191 180 137 232 163 89 244 147 81 54 140 98 121 82 147 165 107 155 162 170 98 164 158 113
1270A13l2J09p6J17k2J57q7K3j41p2p1Q1KJ37p1j09J10j57P4l6J47M2j49R1O9j9j47O4p0J23
$$ 113 81 190 114 231 209 366 279 302 161 89 18 99 101 238 167 58 168 11 85 49 196 238 89 180 249 230 83 147 77 200
988B00Pk6n3J45K24j41k87J22Kj44K0J08m4q1J33Q8J91k29n1m1r5M2n8J48r8L1J16r3r4PP2
$$ 200 207 181 128 273 497 356 69 191 193 49 69 177 133 52 185 273 464 235 184 143 48 90 32 180 82 113 229 136 42 49 121
697A21K7L4k3%Kq8J39m9p8Lk5J28k0J45k37LJ05K0r9pJ30l7Q3J2R7R9k24j76J22j21J26jp
$$ 121 148 182 159 159 161 73 212 163 85 88 63 191 171 316 79 82 187 207 108 101 231 194 277 289 386 485 261 85 207 86 212 211 204
387B04O0n0r6q7lJ02k9k2P6Q8kK7J3j92N4L0J9k6O1j25p0oM1lJ05M5j82J26j29J05OK5Oj05
$$ 204 264 214 118 31 28 130 101 79 155 243 241 268 281 89 143 173 192 166 227 102 32 26 67 64 169 214 32 158 29 134 140 165 171 66
68F6Q6q4Q6p8PO2Q9j54R3p2l5K0j7m7M9j9P5J08j36J14j07J63l6j9j55Q1M1q8l2L1O5K6jl0
$$ 66 152 68 154 76 83 145 234 80 173 101 66 86 69 22 71 52 127 235 99 213 106 269 233 214 59 140 181 93 61 92 157 183 182 152
-252A52RQn9P4P3p1p7Jo0k4L2pM7m3m5
$$ 152 161 169 110 184 257 186 109 110 50 26 58 51 98 55 10
-392A0
##PAGE=	F1=-11967.8
##FIRST=	19140.455529915001534,	4405.895418600002813,	0
##DATA TABLE=	(F2++(Y..Y)), PROFILE
4406A13N6p0rO0j8k5J01p1j04P8n6Q4K6Q7j14J04j20q0Q5k7J01j23JJ16j07p0Q1M9n6k3N2
$$ 113 169 99 90 150 132 107 208 137 33 111 55 139 165 252 138 242 122 42 127 100 201 78 79 195 88 18 99 148 92 69 121
4115A21l6L0m4J13Pp1J06l6l7J04M6j16j08m7N4N1p8j6L1K2m1O8K0j11M8JK7l6M6nK8j25O7
$$ 121 85 115 71 184 191 120 226 190 153 257 303 187 79 32 86 137 59 43 74 96 55 123 143 32 80 81 108 72 118 113 141 16 83
3805H3Q0P7j15k1olK8n3rM1N5Pj35O2j5L8m2M3M3M9j40N9p3M0m1j4J07N3j09M5J05j3j00K9
$$ 83 163 240 125 104 98 95 123 70 61 102 157 164 29 91 76 114 72 115 158 207 67 126 53 93 52 38 145 198 89 134 239 226 126 155
3486A55M1j15J08l4j25J77o6p4J33%N7K0p9L3n4n9M6P7j15r0K4J63M4k07%J44Q7r6oJ26K8
$$ 155 196 81 189 155 30 207 141 67 200 200 257 277 198 231 177 118 164 241 126 36 60 223 267 60 60 204 291 195 189 315 343
3195C43k15r7mN7m8J9P8N3o7J9J00Rk27K03Q9n9j31j2l0M5o9kJ05l4n6J9J71o4q0Q5k7J6l2
$$ 343 128 31 27 84 36 55 133 186 119 138 238 247 20 223 312 253 122 110 80 125 56 54 159 125 69 88 259 195 115 200 173 189 157
2885A57j15M0N4j7J1oj1p9J28qj20MM7N4j16J89j6%J6m8q8K3l2qO0rr1M7mk6k2R4O3%qN2j03
$$ 157 42 82 136 119 130 124 113 34 162 154 34 38 85 139 23 212 196 196 212 164 76 99 67 59 119 110 19 66 62 36 14 108 171 171 163 215 112
2537A12k4P2j6k5J03J90j76Q3k1j98J7j8k1J5l3j7O9q5R8R9J3j67O4q0R0R7k22J11N4N8j12
$$ 112 88 160 144 119 222 412 236 319 298 100 117 99 78 93 60 43 112 27 125 224 237 70 134 54 144 241 19 130 184 242 130
2246A30p2J37n4k6k5o9J26p7L2nL7Jl5O3o4L5j03J71j02P7j20K30m9p4l1PPN3O7j23k8K8j10
$$ 130 58 195 141 115 90 21 147 70 102 97 134 135 100 163 99 134 31 202 100 177 57 287 238 164 133 140 147 200 267 144 116 144 34
1936C4O9J62n7j26j2K18n9p7J7j50N7L3n7Q0R6rpo3mJ9Jm6o4K1R2O9o6Nl4r0K1L3J9N1k6k4
$$ 34 103 265 208 82 70 288 229 152 169 19 76 109 52 132 228 219 212 149 145 164 165 119 55 76 168 237 171 176 142 52 73 106 125 176 150 126
1598A26K9j02Q4R7j6j37J34J8j57J27j65J40m5k2M3lp0J29j01J0k4L2k5N5j08J32J0p8j1k3
$$ 126 155 53 137 234 218 81 215 233 76 203 38 178 133 111 154 151 81 210 109 119 95 127 102 157 49 181 191 113 102 79
1317G9O0k3N6m4n9P0P4j35J61l3J62n7%j91p3l9J13l8J53j1j82J59j44Q0j07J15Lr6J07R2
$$ 79 139 116 172 128 69 139 213 78 239 206 368 311 311 120 47 8 121 83 236 225 43 202 58 138 31 146 149 53 160 252
1035B52J5j51M3J3O8l1k7m1J01K72j76k80J37k1j10QQ1qo5J60Q0J89k67p2kj24M8l6J14o3
$$ 252 267 116 159 172 240 209 182 141 242 514 338 58 195 174 64 72 153 145 80 240 320 509 242 170 168 44 92 56 170 107
753A07J2J17n3j39RO5L0J9J4J0rq4R1m2k7L7n6J07QJ45l22Q9O0J5q2j2J23j6R0oJ01J18k52
$$ 107 119 236 183 44 53 118 148 167 181 191 182 98 189 147 120 157 101 208 216 361 39 128 188 203 121 109 232 216 306 300 401 519 267
443B67j97J27j21J46NLP2p2j01r2QN7j3l4J14O2J3k3L9j91N3N4L0m4N9j36k7Kk2K2R5O2j61
$$ 267 70 197 76 222 227 230 302 230 129 37 45 102 89 55 169 231 244 221 260 69 122 176 206 162 221 85 58 60 38 60 155 217 56
133E6J21j41Q3J3K7J6p6L8o2J00r6k6R1J02j35N7j12L4Jn1NK8l9Q3J23j42J23j36K20p3k5
$$ 56 177 36 119 132 159 175 99 137 75 175 79 53 144 246 111 168 56 90 91 40 45 73 34 117 240 98 221 85 305 232 207
-158B07j23J8O8q6j0K0L4J7J6ORk7OM6M0p1o3L3n7mr%K6n0k7
$$ 207 84 102 170 84 74 94 128 145 161 167 176 149 155 201 241 170 107 140 83 79 70 70 96 46 19
-392A9
##PAGE=	F1=-12046.5
##FIRST=	19140.455529915001534,	4405.895418600002813,	0
##DATA TABLE=	(F2++(Y..Y)), PROFILE
4406H2P1n3j8N9l1m2J70r6q8P2q2Q0L6O6j41J27l7j30J19q8Q8j01J1J44j17o3Q1N3n8k8L9
$$ 82 153 100 82 141 110 68 238 142 54 126 44 124 160 226 85 212 175 45 164 76 164 63 74 218 101 38 119 172 114 86 125
4115A25m8J3m6J08Po1Q5k1K2L8Q1o7j35p8P1Q3q5J0L4k4q9L4M9q1N3l7J20k9m0m5K7%K2R0
$$ 125 77 90 44 152 159 98 183 162 184 222 303 236 101 23 94 177 92 102 136 112 23 57 106 25 78 41 161 132 92 47 74 74 96 186
3796A86P3j14l4Qj3M5q6pJ2N8K4j06L2%K0kL7J0M9j31O6o4R8r9lQ0K8j07O6J33l0p9Q3j2j59
$$ 186 259 145 111 119 106 151 65 58 70 128 152 46 78 78 98 96 133 143 192 61 127 63 161 62 59 139 167 60 126 259 229 150 233 221 62
3467F2J35q2q0J90o3o5R0nP5J0q0K3k5k8J1O8r4j17O6J21rj35RJ61Q0j23nR6ok20nm8P5l7
$$ 62 197 115 35 225 162 97 187 182 257 267 187 210 185 157 168 236 142 25 91 212 203 68 77 238 318 195 190 286 280 60 55 7 82 45
3148D5Q6M8kj09N3J67j4k09J97O5p5j53L9m0pRk9J09m0p8N4J37o9m5P1m5Qm0n7j1N3NO0l6
$$ 45 131 179 177 68 121 288 274 65 262 327 252 99 138 98 91 100 71 180 140 62 116 253 184 139 210 165 173 133 76 65 118 123 183 147
2828A47l6p6J51k8r8j9L9L8l8J00P7%o4m3r4nk9RJ36n1o9N9%j9n7P6L6L1K2J5j05L0L6n5k0
$$ 147 111 35 186 158 60 41 80 118 80 180 257 257 193 150 56 51 22 31 167 116 47 106 106 87 30 106 142 173 195 210 105 135 171 116 96
2500I6J12J95j63O6k9j55MJ2p1L8l1L2k3l4Q9J21Rk07O5j02J33R4k16M2M2J57p7j02Q6l0l3
$$ 96 208 403 240 306 277 122 126 138 67 105 74 106 83 49 138 259 268 61 126 24 157 251 35 77 119 276 199 97 183 153 120
2209A20l2q0J06o3N3j2N0j9K4M6q7J4j10J50m8Q0j28K20l2j36j4M0JN4J01j10j00N0j11L9
$$ 120 88 8 114 51 104 92 142 123 147 193 106 120 10 160 112 192 64 284 252 116 102 142 143 197 298 188 88 138 27 66
1927F6J28k6j17K8J98m7p7j1j34P8M6p1P5Q7j7k2n6K1K3k4l6m4J1J26O0n2m3k0j11M2M6oL4
$$ 66 194 168 51 79 277 230 153 142 8 86 132 61 136 223 206 184 128 149 172 148 112 68 79 205 265 213 170 150 39 81 127 121 155
1617A55k2m2Np8J40R6%j05N0P9k36K14k05R9p9K6l4P2n2P5q5P2qk2JP2j37J57j2q5lr3R3K1
$$ 155 133 91 96 18 158 254 254 149 199 278 42 256 51 150 71 97 63 135 83 158 73 145 137 115 116 188 51 208 196 111 108 15 108 129
1298A29M7q3o8J67L3j55J75m9J55k7j3k23p1K3R8q3J81L4k28J77r2N4j46P5m3n1J19J10K9
$$ 129 176 93 25 192 225 70 245 196 351 324 311 88 17 40 138 55 236 270 42 219 127 181 35 110 67 16 135 245 274
1025B74j33OJ16L2r7k3m0M7L01j85k34J13l3n8JL9K6o7J87O6J58k77p4L3j29K4K0P1m6%J08
$$ 274 141 147 263 295 198 175 135 182 483 298 64 177 144 86 87 126 152 85 272 338 496 219 145 178 49 73 93 164 118 118 226
734B26lj72M0OM3%M8L5nq7J5m1M0P5p9O4M2J23l64J64M8j8o1k5J03nR8l2J03J17k55k02J45
$$ 226 223 51 91 97 140 140 188 223 218 131 146 105 145 220 141 205 247 370 6 170 218 200 139 114 217 212 310 278 381 498 243 41 186
425A86j24J66J%O6p0r9p1L4k8J4m9J59K7K2q0O8j65L2O8N1n7M9j29L2oq3M6J03M1j34J12j33
$$ 186 62 228 229 229 295 225 126 55 89 61 75 26 185 212 234 154 222 57 89 157 208 151 200 71 103 97 14 60 163 204 70 182 49
115D9N2K0M1J3m4RNO8j28n9J27J09j24J4j30R0j5p1N3qo1R2J17j21J20j66K62r4k4q2m8P3
$$ 49 101 121 162 175 131 140 145 213 85 26 153 262 138 152 22 112 97 26 79 71 10 102 219 98 218 52 314 220 196 114 66 139
-186A39q5K2L2J1pK4N2Kp4Q1J3Np2NJ6o2J5m3nJ3m4k0
$$ 139 54 76 108 119 112 136 188 190 116 197 210 215 143 148 164 102 117 74 69 82 38 18
-392A8
##PAGE=	F1=-12125.3
##FIRST=	19140.455529915001534,	4405.895418600002813,	0
##DATA TABLE=	(F2++(Y..Y)), PROFILE
4406D7Q3l2k2M6k8j7J82j06n9L8j11P6O2K7j52J56K9j40J00j48O9o1L4J61r6n7N5N2n9m2K8
$$ 47 130 98 76 122 94 77 259 153 94 132 21 97 159 186 34 190 219 79 179 31 100 39 73 234 138 81 136 188 129 87 115
4115A15n8Ll8Q5J9l2O3l4Q3qQ7k8j39q8O5J07p5L5M1o9n0k3K9o9M0l0J79k7j08o3MJ08j6R0
$$ 115 57 60 22 107 126 94 157 123 206 198 285 257 118 30 95 202 127 162 203 134 84 61 90 21 61 31 210 183 75 12 16 124 108 198
3796A98P1j05l8L1n3M8r0L1o2O3M9o4k9K8LM8K6l2M9r2L7j0J06j25J0M1j0j01P7J46k7j4Q8
$$ 198 269 164 126 157 104 152 62 93 31 94 143 79 50 78 81 129 155 123 172 80 117 107 213 88 98 139 129 28 105 251 224 210 298
3486B98o4j90J26p0n2J87o2l4K0%Q6Oq1K8oj1PL5p5j05P7P2n5n6KJ72O2j40pO6m7j76P0m6
$$ 298 234 44 170 100 48 235 173 139 159 159 245 251 170 198 192 181 188 223 148 43 120 192 137 81 83 255 317 177 170 236 189 13 83 37
3166C7N5J4Q6J4m4j36Q9K31n0j97J98K4q4j63P4k2k8L7j9Q9o0q1P2J06p7j4N8o2j3k9J0j9
$$ 37 92 106 192 206 162 26 115 346 296 99 297 321 237 74 148 126 98 135 116 205 145 64 136 242 165 151 209 147 134 105 115 96
2866I6%N7P4o9m9k6J10n4m0l7J8J7K6K8J57k1j36k5o1n8P6qJ36r8n2O8K2rp1K0M1L8M2k4p3
$$ 96 96 153 227 158 109 83 193 139 99 62 80 97 123 151 308 287 151 126 65 7 83 75 211 113 61 129 151 142 71 91 132 170 212 188 115
2537A15O7j2r8mJ07J97j18L5l1r4l7K8q8M4l1P5r9JQ1J46%k45P5o6R8Q9j74l5M4K30m6j33
$$ 115 182 170 72 68 175 372 254 289 258 164 127 155 67 111 80 155 56 57 138 284 284 39 114 48 146 235 61 26 70 300 254 121
2237A21M2nl3m5n8Q7o6N5rM9m9R5L9j02Lq7P9pQ7j21J84oj72j3P9qN2J10p5j40M7j01J5Q9
$$ 121 163 158 125 80 22 109 43 98 89 138 89 184 223 121 124 37 116 109 196 75 259 253 81 68 147 139 191 301 226 86 133 32 47 136
1918A36Rj00L5J78m4o0n3q2Q2N9q4P5M5l3j7m2L1L5m1k4l3J2J35M5j7o9kj17M1M4l0J7j9m9
$$ 136 145 45 80 258 214 154 101 19 101 160 76 151 196 163 146 104 135 170 129 105 72 84 219 264 247 178 176 59 100 144 114 131 112 63
1598F3k0K6J09Q1J3o8l1J31k74K65k12L4j10J12o5P3m4K0m5R2J7o2L0P7j27J39m5q7P4n7k2
$$ 63 43 69 178 259 272 204 173 304 30 295 83 117 7 119 54 127 83 103 58 150 167 105 135 212 85 224 179 92 166 109 87
1307H7M6M2j00l1J88pj29J48o5J40Krk40k5K9P3r7J83N8k31J57l1J2j39L4p5PP7J20K7r8l4
$$ 87 133 175 75 44 232 225 96 244 179 319 321 312 72 47 76 149 52 235 293 62 219 188 200 61 95 20 27 104 224 251 153 119
1007A19K14Oj61j3n5rL05j53j74O3k2j6rON4r6K08N6J13k67n8O5j00m2R0M6m9j8Q9N2j84O6
$$ 119 333 339 178 165 110 101 406 253 79 142 120 104 95 101 155 59 267 323 436 169 111 176 76 34 124 170 121 103 192 244 60 126
706A26n3N8k2O9O8J2r8n6o0J07J13r2J5P3Q3l10J55O1n2l7m5P4lJ01n5R5R6k30j56J37j20
$$ 126 73 131 109 178 246 258 160 104 44 151 264 172 187 260 343 33 188 249 197 160 115 189 186 287 232 327 423 193 37 174 54
415E4J75j3j3M5n3r3k9N8j08M1m0J80kK0j44R0j10j0O9P3n3K8j04O9Nr8P1P0nr8R9j06L3O
$$ 54 229 216 203 248 195 102 73 131 23 64 24 204 202 222 78 168 58 48 117 190 137 165 61 130 135 37 108 178 173 75 174 68 101 107
96A07P1nj9NN7L4j62p6J56J13j26m2r7J17l0p7P1l5l2N5Q9p8J09j75K61q9qn1q0L5o3K9N6
$$ 107 178 173 154 159 216 250 88 12 168 281 155 113 16 133 103 26 97 62 30 85 174 96 205 30 291 202 194 143 63 98 35 64 120
-214A20orKJ03j1j20J48k2k1o4P6k3o9K6n3k7J6k7j0
$$ 120 114 105 107 210 199 79 227 205 184 120 196 173 104 130 77 50 66 39 29
-392B9
##PAGE=	F1=-12204.1
##FIRST=	19140.455529915001534,	4405.895418600002813,	0
##DATA TABLE=	(F2++(Y..Y)), PROFILE
4406F8M6k4j8K1rL6J48j02k8j0j18O9Q8l4q9J26P8j33N3j30k2kN9J69n2n8J7M6n5o6J9o3N
$$ 68 114 90 72 93 84 120 268 166 138 128 10 79 167 133 44 170 248 115 168 38 16 14 73 242 190 132 149 195 140 74 93 30 35
4096C5k6N0M0K2O6r0J21k8O0rj24r0N7J23n2O2M1j02k2pj5p4oL7J67j5j48k4jJ07l2Q0P4j01
$$ 35 9 59 99 121 187 97 218 190 250 241 117 27 84 207 155 217 258 156 134 127 112 38 32 69 236 221 73 49 48 155 123 203 277 176
3777A76l9M3q2L8p7P1j23P5N9l4q0N7j8Q3K6p3M9l8KK8R6j31L9L1o6j04O8J39j0N2Q5r5k22
$$ 176 137 180 98 136 59 130 7 82 141 107 27 84 66 149 175 102 151 113 115 143 239 108 147 178 112 8 76 215 205 257 342 247 25
3467B5R3K1o9J64n9J1o4QR2Oq3M3Pj1K1mn8o7O8K6p4qqJ73L6j33j9L9q7j4K5l6M2M2Q3k3o6
$$ 25 118 139 70 234 175 186 122 130 222 228 145 188 195 184 205 201 143 76 144 170 96 88 80 253 289 156 137 176 89 75 100 64 106 148 231 208 142
3119A42j11Q9K71p7j97J99k2q5j63Q8J2j3J8jP6q1p7P8P5p3kN5p0m0J6M7pp0J07O9j06m8K0
$$ 142 31 120 391 314 117 316 294 209 46 134 146 133 151 150 226 145 68 146 221 148 146 201 131 91 107 154 147 77 184 253 147 99 119
2810A19O6q2L3o7J6oO5rK01n3j87NLl7N6j1J27j31m4O6N8%q4k8Q9RL4n3kO9o5j32K0Q6K00
$$ 119 185 103 136 69 85 79 144 135 336 283 96 101 104 67 123 112 239 108 64 130 188 188 104 76 165 174 208 155 153 222 157 25 45 131 331
2481C31n5Jl3l0p6Ro9L6l8J08j44K0N9J66rk65R4k0K8P9j09nM3J92k8j55J1Qk2n0l4R1o3J5
$$ 331 276 277 244 214 138 147 78 114 76 184 40 60 119 285 276 11 105 85 113 192 83 78 121 313 285 130 141 149 127 77 43 134 71 86
2162H6J1K7p8J55L2r0j0q5L6J5Q3q3J14K7j61k3R6j6N1R3l5j36L0j07J5N3L8q5K0J62n4k9
$$ 86 97 124 46 201 233 143 133 48 84 99 182 99 213 240 79 56 152 136 187 280 245 109 139 32 47 100 138 53 73 235 181 152
1861A52j01kO9O2r4P5on3J0k9K2O2n5j7k8K2J22K0K7o7K2j08J0L7m3kk1l4j8J01N6N1K4k9
$$ 152 51 49 118 180 86 161 155 102 112 83 105 167 112 95 67 89 211 231 258 191 213 105 115 152 109 107 86 52 34 135 191 242 266 237
1542B37r1J68k50K41k11ll3J02k2po1KjO7M5p8M7P4j01J11r0q8J77m4j10M8L9o8kJ58m0q8
$$ 237 146 314 64 305 94 91 58 160 138 131 70 72 71 138 183 105 152 226 125 236 146 58 235 191 81 129 168 100 98 256 216 128
1241A28J06p8J24K8Ok43J2K4M3o3J44O0k05J20K5l9r5Kn1PJ9J16J5n5o4K85rk03lq6n7K89
$$ 128 234 156 280 308 314 71 83 107 150 87 231 291 86 206 231 192 97 99 48 55 74 190 205 150 86 371 362 159 156 70 13 302
941C02p6j32OJ5Kl3KP7j43K03P1Q4k48n4R4m6j02J14M6n6m4N3J04j64P1q2O2l7O9R6L3j08
$$ 302 226 94 100 115 117 84 86 163 20 223 294 378 130 76 170 124 22 136 182 126 82 135 239 75 146 64 126 89 158 254 287 179
640A79q5o8J09J50r7l0R7L2k30J23Q2o7j3p1M2mR2o9P6O5j86n3Q7j04J66l0k2Rl8q3L0P4j18
$$ 179 94 26 135 285 188 158 255 287 57 180 262 195 182 111 153 149 241 172 248 313 127 74 161 57 223 193 171 180 142 59 89 163 45
331D5K6l0J75j3J5j73O0k7n7M5Q7k8Kp0Q0L4r0J03No2n6Q7o7K7k7J11l6rK5Q7Nj83p7J69J15
$$ 45 71 41 216 203 218 45 105 78 21 66 153 125 127 57 137 171 81 184 189 127 71 158 91 118 91 202 166 157 182 269 274 91 14 183 298
2B98j42j00JR9m6p8O3m9J5J3M2k4R5j19J69n8K6l6q1l3Qk2P9k5L0n4J54k4j49J90n9l7l1J13
$$ 298 156 56 57 156 110 32 95 46 61 74 116 92 187 68 237 179 205 169 88 55 63 41 120 95 125 71 225 201 52 242 183 146 115 228
-317B28o0p5K4l0m8J9kJ3
$$ 228 168 93 117 87 39 58 56 69
-392F9
##PAGE=	F1=-12282.8
##FIRST=	19140.455529915001534,	4405.895418600002813,	0
##DATA TABLE=	(F2++(Y..Y)), PROFILE
4406A23ml6j3j3K1P5J09q1jo5o7N5Q4j12K9M3J14j15j3l3k5n3M8J70No4l2M4m2r7J6o3L0k9
$$ 123 119 83 70 57 78 153 262 181 180 115 48 103 187 75 104 147 261 146 133 100 75 22 70 240 245 181 149 193 151 54 70 7 37 8
4087HJ1N9Q6P8j41J18k7J4k2q7q2M5J36j9Q9L1j23rJ2l5p2o6R3J38J3j69k5K3Q1k1P2P4j03
$$ 8 19 78 164 242 101 219 192 206 184 97 15 60 196 177 266 297 174 165 177 142 70 4 97 235 248 79 54 77 158 137 209 283 180
3777A80m6N0p4J6o9R6j19P0L9j9p8M6m0R9L3j01M8K3j6K3P6j17P5M9r5j03LJ09J0J06Q7r7
$$ 180 134 184 110 126 57 153 34 104 143 124 46 92 52 151 184 83 131 154 138 161 237 120 195 244 149 46 49 158 168 274 361 264
3476B64k55N7J22r4J30n4N8j22qR9Lq7O5J5k6M2l7m4k0N0mm6k3j5J63Rq9l4Rq2P2j8j7L6M8
$$ 264 9 66 188 94 224 170 228 106 98 197 200 113 178 193 167 209 172 128 108 158 154 108 85 70 233 242 153 119 128 46 118 100 83 119 167
3148A67Q1o0o8o8P3K79q2j99J88n4q4j58Q2N4K0k6K0P4r8p2Q2M4n4rO2o1n2N9M8Nj12J29M6
$$ 167 248 188 120 52 125 404 322 123 311 257 173 15 97 151 171 145 165 239 141 69 151 195 141 132 194 133 81 140 188 193 81 210 256
2838B56j43l6N9L1r7R6j11M2l6Q4rJ98q2k14L5O8k0J5nJ19j40n2N4R8Rr2n5J38k1jo5Q0N1
$$ 256 113 77 136 167 70 166 55 97 61 145 136 334 252 38 73 141 121 136 131 250 110 58 112 210 219 127 72 210 189 188 123 203 254
2528B54j17j15J2N9J95Ok6l0K0r5m4l3L1n0J23j46L6LJ73j4k11O8J6m4N8l7M7N6J22k3j63
$$ 254 137 22 34 93 288 294 268 238 258 163 119 86 117 67 190 44 80 83 256 242 31 99 115 71 129 92 139 195 317 294 131
2237A31j1OJl7k2R8n3m6M7j0l6J22K1m4l0r5K6L2N0j7K9P3j25l1P7k3N3O0jj02J7j13J3J9
$$ 131 120 126 127 90 68 166 113 67 114 104 68 190 211 167 137 42 68 100 150 133 162 235 110 79 156 133 186 246 245 143 160 47 60 79
1918G9N3p2JJ44p0Mj22N9N4N8r9O8m9o4N7k4qJ00o3k2k9L4R7j3O7m6M7q8l4L0l9l1k0MJ2J23
$$ 79 132 60 61 205 135 139 17 76 130 188 89 157 108 44 101 77 69 169 106 84 55 89 186 173 240 194 241 153 119 149 110 79 59 63 75 198
1579A98mJ1L4Mj18J87k06J79k06JK7R2Oo4r9M1NL0O7p0M9O1o6R0j46q4K77m5j68M0L4rMJ11
$$ 198 194 205 239 243 125 312 106 285 79 80 107 199 205 141 42 83 88 118 185 115 164 225 159 249 103 19 296 251 83 123 157 148 152 263
1260B63o1n1O6q3J08M4K6k33K7J4J8j4J00M2j63Q1P1q6l8j6m6LqQ5%j4p9L21j4k14Mr8J6J24
$$ 263 202 151 217 134 242 286 312 79 106 120 138 124 224 266 103 184 255 169 131 115 69 72 64 149 149 135 56 377 363 149 153 55 71 195
941A95K8j20l8N4J5q1K8J01j01P8J37R1k35r8J16J3r8L9O1m7o9lJ47j11M9o9M8m2M9J09M9
$$ 195 223 103 65 119 134 53 81 182 81 159 296 387 152 54 170 183 85 124 185 138 69 66 213 102 151 82 130 88 137 246 295
650B95j13n9k8QJ79r6o0J12k5j42P6J02n7Lr3J4NN9o6M2M0j25L5L8p8J44m2j2k9n0p3J02P0
$$ 295 182 123 95 103 282 186 126 238 213 71 147 249 192 195 102 116 121 180 114 156 196 71 106 144 66 210 168 156 127 77 4 106 176
340A76r2J5n1J66j0J9j19o5O8n4%O0J5j6m8O4P0p3J32o6j15j5P0j7J8n3J38p1j0N8J05j7j78
$$ 176 84 99 48 214 204 223 104 39 107 53 53 113 128 112 64 128 198 125 257 191 76 61 131 114 132 79 217 146 136 194 299 282 104
30A04o8J58J10j70j00O6Q0o4p7L6m5N5j3j7L3P8m5M2j4P1l5p7r4P9p1Q7m8R2j23J99l2j42
$$ 104 36 194 304 134 34 100 180 116 39 75 30 85 72 55 88 166 121 163 149 220 185 108 14 93 22 109 61 153 30 229 197 55
-270E5J87r5m7J6J20p9p8KK7m2nK0L2
$$ 55 242 147 100 116 236 157 79 81 108 66 61 81 113
-392A13
##PAGE=	F1=-12361.6
##FIRST=	19140.455529915001534,	4405.895418600002813,	0
##DATA TABLE=	(F2++(Y..Y)), PROFILE
4406A70l0n8j0m6M2R4Q3n1J6j15j2P3N9j91J45m2J29q7r0Q3%j18J9J66O0p1q6N4k5j20K0l7
$$ 170 140 82 72 26 68 162 245 194 210 95 83 156 215 24 169 127 256 169 79 162 162 44 63 229 289 218 132 186 161 41 61 24
4105B4L1l7KM5J39P8j66R0j8k2o5m0k6rJ54J9J15J0j35qJ4m0n0o6P6J03N4j88m9M8M9J5P3
$$ 24 55 18 20 65 204 282 116 206 188 166 101 61 35 26 180 199 314 324 189 181 195 155 105 39 115 218 272 84 35 83 132 147 220
3796B20O2j09n7O0k9lq6J02j17R5Oj6n7K3n0Q7M8j06M4P6k5rN5r0J07P6r6j27m0O0J6J44R5
$$ 220 282 173 116 176 147 144 58 160 43 138 144 128 71 94 44 131 179 73 117 193 168 159 214 124 231 307 211 84 44 104 120 264 359
3486C59p9k64M9J50j02R4m3R5j30o3J11pr1Q9J9n0N8n3l6K5K4lj5o5j3J39j2j0l7k0j3L5n9
$$ 359 280 16 65 215 113 207 164 259 129 66 177 170 79 168 187 137 195 142 106 131 155 152 137 72 59 198 186 176 139 119 106 141 82
3176H2J2L4L5Q4q6n7m1O2K55o4j93J63o8q1j15J8J05N3p5L9P8j04o7Q5J9l2k1O9l9l7O0L8
$$ 82 94 128 163 247 161 104 63 125 380 316 123 286 218 137 22 40 145 198 123 162 240 136 69 154 173 141 120 189 150 113 173 211
2875B11Qj12J21J0j72j6Q4No1J04j53Q9p5R8OJ54r6j58j2J30kl2LJ22j34p0K8J38K1r5o4J61
$$ 211 219 107 228 238 66 50 134 139 78 182 29 118 43 141 147 301 205 47 35 165 163 131 134 256 122 52 80 218 239 144 80 241
2575B41l4m8n1J43K5j61o7j2M9J57O1m7j7M6j00j09J1L2o1J17j10N5o6J49j1j26L0L8p7JK6
$$ 241 207 159 108 251 276 115 48 36 85 242 303 256 239 285 185 76 87 119 58 175 65 120 54 203 192 66 96 134 57 58 84
2284H4R3O7O4k0j57k8j1L8j5k2R4l9j02R1n6N3J9RK5n3j05L7N7j9N6k0J16j06m5N2k8N3L5
$$ 84 177 244 308 288 131 103 92 130 115 93 187 148 46 137 81 134 153 162 187 134 29 66 123 104 160 140 256 150 105 157 129 182 217
1974B17J1n4J3r8rj3N9o0j4J19q5K7n2L1L8N4r6M6o8l4Q1k3m2J31o0m1m2M6P9m7Q0j9P6o0
$$ 217 228 174 187 89 80 67 126 66 52 171 86 113 61 92 130 184 88 134 66 32 113 90 48 179 119 78 36 82 161 114 194 175 251 191
1655A91q2L0k1n6j4M8K5J22o0k8M1K8j10J88j58J03j94L1N6Q7J6r9j39J01rPP2m5L6M1k6P9
$$ 191 109 139 118 62 48 96 121 243 183 155 196 224 114 302 144 247 53 84 140 227 243 144 5 106 97 104 176 131 167 208 182 261
1354B61k04l9L22n5j94K9K7N3JN7p1k8L5p5R5M4M4k12J6%PL2O5J5j12M6J09j05j1k4n2LkL2
$$ 261 57 18 340 285 91 120 147 200 201 258 187 159 194 119 214 258 302 90 106 106 113 145 210 225 113 159 268 163 152 128 76 79 77 109
1035A09rJ2p4L22j9j96Kn0L7rJ03j20n8O9L2j37O6J22m7l0K37J03k55j57J24O4r6n6P3j2p5
$$ 109 100 112 38 360 341 145 147 97 134 125 228 108 50 119 151 14 80 202 155 125 362 465 210 53 177 241 145 89 162 150 75
744G5l2J41m3Rl8L3m7K8J05M9j11qnq4J89r1p3J22q0o5K7J07k7Nr8oL2Km5jN7n3M4Qn2J11
$$ 75 43 184 141 150 112 145 98 126 231 280 169 161 156 72 261 170 97 219 139 74 101 208 181 186 88 82 114 116 71 70 127 74 118 126 74 185
406A85l7J5m1q8K1O9M7o1J9q5J50JL2o5j37J02m1OPM8mn8K5R9n2J50j23j35KM3L8lm6J29j02
$$ 185 148 163 122 34 55 124 171 110 129 44 194 195 227 162 25 127 86 92 99 147 143 85 110 209 157 307 184 49 51 94 132 129 83 212 110
77A10j7R7J15k4j46o2J28R3k05ML8P3q6p1oLN3k2n4O8N7K3p4J5J19m0p4r1Q0n6M9l9J25j51
$$ 110 93 190 305 281 135 73 201 294 89 93 131 204 118 47 41 44 97 75 21 89 146 169 95 110 229 189 115 24 104 48 97 58 183 32
-242C2J86l1j07J47j23n6O1J14p2p6m2J00l1l9L8M8
$$ 32 218 187 80 227 104 48 109 223 151 75 33 133 102 63 101 149
-392A49
##PAGE=	F1=-12440.3
##FIRST=	19140.455529915001534,	4405.895418600002813,	0
##DATA TABLE=	(F2++(Y..Y)), PROFILE
4406A98l5p6pm3J3R3P9j3J2j51L7J00L4j99J90j08J12n3j63J94K2j72j0J51J07p4j34P3j1
$$ 198 163 87 80 37 50 143 222 209 221 70 107 207 241 42 232 124 236 183 20 214 236 64 54 205 312 238 104 177 166
4134A66j17J9l1L1l0kK2J72N7j65N6j1k6r9k4N7n6J51N3J40j7j44pj1m0j0o8O7P3Q9k06l5
$$ 166 49 68 37 68 38 36 58 230 287 122 178 167 141 42 18 75 19 170 223 363 346 202 195 184 144 134 66 133 206 295 89 54
3833E4K0J1O5R2K7j15o6Q5J5j3j09Q6j20J38k8k6l7Kl7N2O6q1L1J12l7m2L5n5J22J01q0j52
$$ 54 74 85 150 242 269 154 88 173 188 175 66 152 32 170 142 116 79 81 44 96 162 81 112 224 187 145 180 125 247 348 268 116
3533A16n0K8PJ43R7n7k63P2J16q8O8k8J13j10j27J24j8r5J10K1p5O3n2l4N7jJ9pr5oJ05j8
$$ 116 66 94 101 244 341 284 21 93 209 121 189 161 274 164 37 161 143 48 158 179 104 167 115 81 138 137 156 149 54 48 153 135
3232A35P2l5l3J0Lj00M9L2J0R1q9m8l0O2J97l3j75J40p7p5m6k7J05P2j14N2Q2r6o2Q2Mj9j7
$$ 135 207 172 139 149 152 52 101 133 143 234 145 97 67 129 326 293 118 258 181 106 60 33 138 210 96 148 230 134 72 154 158 139 122
2922A22N9j1k1L5K9Mp8R5l1j81K2P2j2NP2j31R7j13J19QQ4r3l3q2J38J2o9RJ45j31p6j3J63
$$ 122 181 170 149 184 213 217 139 234 203 22 44 116 104 109 181 50 147 34 153 161 245 152 119 37 175 187 118 127 272 141 65 52 215
2612B15M4r9o2J53l3q8k0J73Kj89m2j2O3Q5J07o7J0M4r8j55N4L3o3R6o0P4q4N1Nm3kM8m4o8
$$ 215 259 160 98 251 218 130 110 283 285 96 54 42 105 190 297 230 240 284 186 31 85 118 55 151 91 165 81 132 137 94 92 140 96 28
2293B8L2J28P4K5j6j36m8l2Q1Rl0P3j7j24J15j02J37r9J1Q6o6j07M7Q7j03J16mJ29j08o9L5
$$ 28 60 188 262 287 271 135 87 55 136 145 115 188 171 47 162 60 197 98 109 195 129 22 69 156 53 169 165 294 186 117 152
2002A52k8M7L9pj0J4o9m1k3N2m6k2Q4o2MJ1lK6N4q4J1m6JP8j8m6J20m6o2o1N0Q8m8K8JJ00
$$ 152 124 171 210 203 193 207 138 97 74 126 80 58 142 80 84 95 92 118 172 88 99 53 54 132 114 68 188 142 80 19 69 157 109 137 138 238
1664B38k5j23M0kl2l4P6K3J01j02n5M4L7p2J70j13L8j35J8O4Q8J1j20r5Q1k7%O2j4J9J3J3
$$ 238 213 90 130 128 96 62 138 161 262 160 105 149 186 114 284 171 209 74 92 156 244 255 135 40 121 94 94 156 142 161 174 187
1364A87P6k46K9L12o6j89J6K5J06rRp7k1J3n0Q4K8N6j82k2j5J2P0M3j3n7J5J52q8m6k4n2%
$$ 187 263 17 46 358 292 103 119 144 250 241 250 173 152 165 115 199 227 283 101 79 64 76 146 189 176 119 134 286 198 152 128 76 76
1054G6J5j6JJ2m8K90l1j68lJ7K4n0J05j15n4N4M7j39N8J32Mo4L17J02k99j99J14J03r5j33
$$ 76 91 75 76 88 40 330 299 131 128 145 169 119 224 109 55 109 156 17 75 207 211 147 464 566 267 68 182 285 190 57
772E7N0M2o1J3P7Qk8j7K8o2K8R1K3j10N4J1j33J62q8o4J26j17k5j4R5NJq3j6O3n5mj8J15l8
$$ 57 107 149 88 101 178 186 158 141 169 107 135 226 249 139 193 204 71 233 145 81 207 90 65 51 146 151 152 69 53 116 61 57 39 154 116
443A16j2Jk1O0oL9l7o7L5L5Ml2L0j10J25J6N2k5j33N6k5K0jN3K1q1k9J17l2J53j54q4k7jQ6
$$ 116 104 105 84 144 138 177 140 73 108 143 147 115 145 35 160 176 228 203 70 126 101 121 120 173 194 113 84 201 169 322 168 84 57 56 142
115A42l6jP4j16qJ18J21j6j04n8Q6O3k37J17kQ1j08n6k4M1J9k0k0M1L7P6j18k8J59m4o7n2
$$ 142 106 105 179 63 55 173 294 278 174 116 202 265 28 145 143 224 116 60 36 77 96 76 56 97 134 210 92 64 223 179 112 60
-186F0L3j2J7RJ01j32J17k0o6R5j41k8O3J02l8p8o6J37k5o6M6N8
$$ 60 93 81 98 107 208 76 193 173 107 202 61 33 96 198 160 82 16 153 128 62 108 166
-392A66
##PAGE=	F1=-12519.1
##FIRST=	19140.455529915001534,	4405.895418600002813,	0
##DATA TABLE=	(F2++(Y..Y)), PROFILE
4406B04k2r1Ol8l8R4Q4K7j5j67O8J26J6j81K08j39O4j7j36K01L4k08l7J25J39o3j52P5mj00
$$ 204 182 91 97 59 21 115 199 226 211 44 112 238 254 73 281 142 206 189 53 254 288 80 43 168 307 244 92 167 163 63
4124F3J8l9K8rj5J1J78K4j44K4j1%k5q0R5o1J09Q0J61m2j50kn8m0L4o8P7N4J03k19K0m2l6
$$ 63 81 42 70 61 46 57 235 259 115 139 128 128 103 23 118 57 166 246 407 365 215 213 155 115 149 81 158 212 315 96 116 74 38
3814C8J07J27k5j20o9J22L5k0j14N4j26J84n5m7k8j1LKP9m0J4J30n4n3J3j9J17J17n5j66m7
$$ 38 145 272 247 127 58 180 215 195 81 135 9 193 138 91 63 52 55 57 136 96 110 240 186 133 146 127 244 361 306 140 93
3523I3L0J9R3Q3n0k48Q4O8n5N1nJ09q9j63J24k4q7J16K1r1N6l5m3O9j7M3j5r7lO4J4J11l5
$$ 93 123 142 235 318 268 20 104 172 117 168 163 272 183 20 144 120 33 149 170 79 135 100 57 126 109 152 137 40 37 101 115 226 191
3213A91l7Rnj37Q8L0k2R7p1n1k4P7J18qj47J38r3p1J3J6L6N9j33N7P9p6n3O4kj1PK3K0r%J5
$$ 191 154 163 158 21 109 139 117 214 143 92 68 145 263 255 108 246 153 82 95 111 147 206 73 130 209 133 80 144 142 131 138 161 181 172 172 187
2875A87jk7O5o2j30L4K3k5O2L2n4P4j30J36pjp0R1r8Q2J3p9%J87j43o3m6J64O8j09m7J20k8
$$ 187 186 159 224 162 32 66 89 64 126 158 104 178 48 184 177 176 106 197 99 181 194 115 115 302 159 96 50 214 282 173 126 246 218
2565B18j12PJ76rk00l8J0P2MJ44q4M7J7r2j34N4K8m6O6j5Q9p2p6L5K2k4M9Pn9n1J42Q4Lj6
$$ 218 106 113 289 280 80 42 52 124 128 272 188 235 252 160 26 80 108 62 128 113 202 130 54 89 111 87 136 143 84 33 175 259 262 246
2246B46j09o2l6J05L3m3L3J1j05J09j35J96k05O7Q6o6j09N8J14j33R5M8J24j11r8L0k2K4P4
$$ 246 137 75 39 144 177 134 167 178 73 182 47 243 38 105 191 125 16 74 188 55 150 198 322 211 113 143 121 145 219
1974B19m5K1J2k8p9pL5k5k6N6kn4K9l1K8N7o5j9oqQ6ql6Q6l1o5n2K0J16k8n5lJ17J2j51N5
$$ 219 174 195 207 179 100 93 128 103 77 133 131 77 106 75 103 160 95 76 70 62 148 140 104 190 159 94 42 62 178 150 95 92 209 221 70 125
1636A25QK6p9R6J3O6j26o2M1K8j4J38p8km8l2O0R3Nj39m1M8m2qN4J1Pk3N2P1k14K9K82o9j61
$$ 125 133 159 80 176 189 255 129 67 108 136 122 260 182 180 132 100 160 253 258 119 78 126 84 76 130 141 148 125 177 248 34 63 345 276 115
1307A15MK9J53l1j8r2l0%j0P3OO0j51n6k8J1R8L0l9%j4K05o1j26j8l6oK3m4L7j7j2K38n1j41
$$ 115 119 148 301 270 252 160 130 130 120 193 199 259 108 52 24 35 133 163 124 124 110 315 254 128 110 74 68 91 47 84 67 55 293 242 101
979A01j1Q3jl9P7j01l1J8M0j08L5J22N3o6L88J09l42k17O5J31r0j18p4J05l4N2N3K9n1j3L4
$$ 101 90 173 172 133 210 109 78 96 136 28 63 185 238 172 560 669 327 110 175 306 216 98 24 129 95 147 200 229 178 165 199
687A99q5M8Q3k8j17J15K4j49J11q2l7J24j14m6l4P0K3pm8j7P4o3K3J3J26n7p8J3K3j9N2M3
$$ 199 114 162 245 217 100 215 239 90 201 119 82 206 92 46 12 82 105 98 50 33 107 44 67 80 206 149 71 84 107 88 140 183
387A83l8l2L6J1m9j4M2j08Q7L2Q4qj28jmL1J5N6M4r9p9J17k1J43j54j3m7k1P5o7O3j3o8L4
$$ 183 145 113 149 160 111 97 139 31 118 150 234 226 98 97 93 124 139 195 239 140 61 178 157 300 146 133 86 65 140 73 136 123 55 89
68H9N8J24Op1n3M2K4j49J12m6J03j33k6NK8l1mNK9K4J07r8j29J82m0n5j3k3L5J3M1P0j09L7
$$ 89 147 271 277 206 153 195 219 70 182 136 239 106 80 85 113 82 78 83 112 136 243 145 16 198 158 103 90 67 102 115 156 226 117 154
-252A54Kk7M3j40M3K0P8Pq7l9J06k5p6L9O2
$$ 154 156 129 172 32 75 95 173 180 93 54 160 135 59 98 160
-392A60
##PAGE=	F1=-12597.8
##FIRST=	19140.455529915001534,	4405.895418600002813,	0
##DATA TABLE=	(F2++(Y..Y)), PROFILE
4406A93kj01K7m5n6J03O2O4o0j60P1J43Qj59K18j44J3J3q6J76L5k18o1Q8J52l4j24M2nq0K1
$$ 193 191 90 117 72 16 119 181 245 185 25 96 239 247 88 306 162 175 188 102 278 313 95 34 122 274 240 116 158 153 73 94
4115I4m2J2J9l1PJ64j3j12lk0L5M5j01J04o8P0J02J71o0j50Rj07m4O5o1R5M2J01k21P5p8l5
$$ 94 52 64 83 52 59 223 210 98 95 75 110 155 54 158 90 160 262 433 373 223 232 125 81 146 85 180 222 323 102 177 99 64
3814F4O7J72p9j22m8J33L0k4r5J6p2J67p9p5l2oN9k0N1%jJ35p4k9j5RR5J22l0j68l4K7N6L9
$$ 64 131 303 224 102 54 187 217 193 98 114 42 209 130 55 23 17 76 56 107 107 106 241 167 138 123 132 227 349 319 151 117 144 200 239
3495B39N3n8k10O5K8j4M0K8Q6p8j60J04j8o9J04K5j00M7ro8O6j2M3k5p2pK1Q3R2m1l4KRj26
$$ 239 292 234 24 89 117 103 143 171 257 179 19 123 105 36 140 165 65 112 103 35 101 89 132 107 35 28 49 132 224 183 149 151 160 34
3176C4Q7K6n3R3m6n6j7R9M9kj23J66j14p8N5O5pOj31N9O7m9l7K1%NL7k5N0ll5qoL3L5p6p3
$$ 34 121 147 94 187 141 85 68 167 216 214 91 257 143 65 120 185 178 184 53 112 179 130 93 114 114 119 156 131 181 178 143 135 129 162 197 121 48
2828D8L8k6l6R4jL6N0j37J53k9q2k6J86j07L0ko5k4K33j61m6o4J55Q7j27j2P4k9j26K4J58
$$ 48 86 60 24 118 117 153 203 66 219 190 108 82 268 161 191 189 124 100 333 172 126 62 217 304 177 165 239 210 84 108 266
2537B66j0j89m9N1N9o4J63r5Q6k1q7n8J9J6qL3J5R9n4j40K3N8l4M8N2n1r1J10J03kl1q5m7
$$ 266 256 67 18 69 128 64 227 132 218 197 110 52 71 87 79 112 127 226 172 32 55 113 79 127 179 128 37 147 250 248 217 132 85
2227H5k1Q4N7n5k3M5p2R4j40K12k52J39K5n3j18O9J36r9j2J07J13r7j27M0ql0J27q0K9J2J2
$$ 85 64 148 205 150 127 172 100 194 54 266 14 153 178 125 7 76 212 113 101 208 321 224 97 137 129 99 226 146 175 187 199
1936A99j16J7J8J0k5M1M0q3rn0N5N2l5j3j2k3J00ll1M9k1m4k8j0J28k5q5m2J20M6j66O5RQ9
$$ 199 83 100 118 128 103 144 184 101 92 42 97 149 114 101 89 66 166 163 132 181 160 116 88 78 206 181 96 54 174 220 54 119 128 217
1617B17j25J06JK9j27n2L4KM8J01n5k1L0q1M9J04J1j63kJ6n2k8N8K5Po5Q9O1j49KK33o6j19
$$ 217 92 198 199 228 101 49 83 85 133 234 179 158 188 107 156 260 271 108 106 122 70 42 100 125 132 67 156 217 68 70 303 237 118
1307A18oM2J97o0k3j20m8j1M1N6rN4j23j6qo1R3K5p0N8m2K60m3k17j2j0mJ3m9Q1m8J6J76p0
$$ 118 112 154 351 291 268 148 100 89 130 186 177 231 108 92 84 23 116 141 71 129 87 347 304 87 75 65 61 74 25 106 58 74 250 180
988A80j20k5J37k2j9O3q4Ok5J4p0J3Q7R9o0M49J57l87k15j6J40q0n3r3J5NP4N4L4n9j7M9j11
$$ 180 60 35 172 150 131 194 110 116 91 105 35 48 135 234 174 623 780 393 178 162 302 222 169 76 91 96 170 224 258 199 182 231 120
678A20Q0Q8q6j39J61L9j59O3o6qJ18r1r8OK9Rjl0nN3j3J8J8J31p1j34M1P4j19J32J9m9QL5
$$ 120 200 288 202 63 224 263 104 167 101 93 211 120 22 28 57 66 65 35 30 83 70 88 106 237 166 32 73 147 28 160 179 130 138 173
359A73%j03j0N0q0M2N6J28k3j24o8K0M0L2P5N4j07r0R1k9J20j26N3n1j1J7p3J08j13O4L6k9
$$ 173 173 70 60 110 30 72 128 256 233 109 41 61 101 133 208 262 155 65 156 127 247 121 174 123 112 129 56 164 51 115 151 122
58A22J23K5n2m0%j4mM9r4J29j54J0M0Oq8L3%L5K5J17p2j60J24k7m1J6p2P1L0M6N2q4m8L5M
$$ 122 245 270 218 178 178 164 160 209 115 244 90 100 140 146 58 91 91 126 151 268 196 36 160 133 92 108 36 107 137 183 235 151 103 138 142
-270A42Kj14Q1J1M0L8r3k5O6k6o1J5N8
$$ 142 144 30 111 122 162 200 107 82 148 122 61 76 134
-392A34
##PAGE=	F1=-12676.6
##FIRST=	19140.455529915001534,	4405.895418600002813,	0
##DATA TABLE=	(F2++(Y..Y)), PROFILE
4406A68K0j05N2n6k0J11%R4j03j24K8J40Qj26K16j34j8L0n1J57K2j98q3N9J40Qq7Mj1o2K7
$$ 168 188 83 135 79 59 170 170 264 161 37 65 205 213 87 303 169 151 181 130 287 309 111 28 87 227 235 148 152 141 79 106
4115A06l1j5L9m0KJ39m0q6lm7N2R2r0J13p6L0J21J64o8j39J9j32n2P0m5J02L2R6k11J16q5
$$ 106 75 60 99 59 61 200 160 74 71 24 76 168 78 191 115 145 266 430 362 223 242 110 58 128 83 185 217 313 102 218 133
3824A33j9kK11j08j25oR8Rk8n1j4j1J28r8j02K8RN1Mk3K8j6J32q9K0m3K3O7J12j4j54j6RR9
$$ 133 114 112 323 215 90 84 182 191 163 112 98 87 215 117 15 43 52 103 107 84 112 96 228 139 159 116 139 206 318 304 150 134 143 242
3504B42mK5p7j41J6jK7K8P0N3p8j36Q1j1n7R9K6j08N8J0j00O4JJ2k7l7j6oJ46M1m7l0KK7r0
$$ 242 238 263 186 45 61 60 87 115 185 238 160 24 105 94 37 136 162 54 112 122 22 86 87 99 72 35 19 13 159 200 153 123 125 152 62
3176F2P2J9p1O6k2n2pJ15J7j6j16K07j15j08P9J13k6p0j19O6M9k2j3m1%M0O2p0P4kn4m0j4
$$ 62 134 153 82 148 126 74 67 182 199 183 67 274 159 51 130 243 217 147 28 94 143 121 108 67 67 107 169 99 173 171 117 77 63
2866F3Q3J7p5l8M1n0pN2k4J22L2j37J60m1j26J6K31j14jl0l6n5K67j74l2q0J58Q9j44M2L2
$$ 63 146 163 88 50 91 41 34 86 62 184 216 79 239 198 72 88 319 205 204 174 138 83 350 176 144 64 222 311 167 209 241
2575B41m2j43M9J07Jj57l2O7K5r3J39r2J24m3r3Pj1NM5oL3J01l8j02n8O7l3N1P9m9q8N5J31
$$ 241 199 56 105 212 213 56 24 91 116 23 162 70 194 151 58 65 54 59 104 98 131 232 194 92 34 101 68 119 198 149 61 116 247
2265B47No2o8Pk9M3P7o0p9Q1m3P5j19J94k22J52l4l9q9L6J50n5j40J58R7n3j46O4Rj20J79
$$ 247 252 190 122 129 100 143 220 160 81 162 119 194 75 269 47 199 165 126 37 73 223 168 28 186 283 230 84 148 157 37 216
1974B16r7J5J5M5j38K8JO1j9L0N7q5o6o1J00L6ONm9j4J03ql5J6k1kmk1J12m4o7p2R8P4j74
$$ 216 119 134 149 194 56 84 85 146 127 157 214 129 63 2 102 138 144 149 100 86 189 181 146 162 141 139 135 114 226 182 115 43 141 215 41
1645D1O9JJ44j58J02j0Mj11l5L1l9J07O1m1k3R0j19L3J22L0j87J3j3n2n1O6J7K3j05J22M2
$$ 41 110 111 255 97 199 189 193 82 47 78 39 146 207 166 143 233 114 147 269 299 112 125 112 60 9 75 92 115 10 132 174
1354A74p8k9J69n6p3j1O2K34q7j6j49o8k6R4L5j7M0r5N8j0j01N3K8j09J03o1L03l4k92MKJ7
$$ 174 96 67 236 180 107 96 158 392 305 289 140 72 46 140 175 158 198 103 161 151 50 103 131 22 125 64 367 333 41 45 47 64
1054F4j5k4J05o9L1J09p4r7mJ18k5oO8o5M2n9K0l2m3K5J39k0M60K59m52j98j03J20o3K1n9
$$ 64 49 25 130 61 92 201 127 30 26 144 119 113 181 116 158 99 119 87 44 69 208 188 648 907 455 257 154 274 211 232 173
763A73j29N6P2N9L7o0j7O9j38J20R5j25j68J72O1j68J9l5J0J11p1j41M3L9MJ8p6J3RM9J0l
$$ 173 44 100 172 231 268 208 191 260 122 242 337 212 44 216 277 109 128 93 103 214 143 2 45 84 88 106 30 43 52 101 111 108
462A08J32p5j41O1J10j29J29k2o3M2L4nj49jL1l1mR1J77o8j15p1k9N7K9J13N1j09n9N2n8Q6
$$ 108 240 165 24 85 195 66 195 173 110 152 186 181 32 31 62 31 27 118 295 227 112 41 12 69 98 211 262 153 94 146 88 174
162A74p9J06m5%m5l4J07j52J50J7r2J14K9m3j9m0l1J31j5j40J44j68M9P0j9j44J01m1N0L8
$$ 174 95 201 156 156 111 77 184 32 182 199 107 221 250 207 188 148 117 248 233 93 237 69 118 188 169 25 126 85 135 173
-120A73J12n6j54M8j1l8L7q6P7N1L0N2n5j34P6K0j9q6R1L4MM2p8k5J7l2k4mL2
$$ 173 285 229 75 123 112 74 111 25 102 153 183 235 180 46 122 142 123 37 128 162 166 208 130 105 122 90 66 62 94
-392I4
##PAGE=	F1=-12755.3
##FIRST=	19140.455529915001534,	4405.895418600002813,	0
##DATA TABLE=	(F2++(Y..Y)), PROFILE
4406A33L6r6P4n5J0J24n9J10j17r4l6J12J6q2K00j20j9L5l7J47mj54j03P2R9M2p2rk1m5L2
$$ 133 169 73 147 92 102 226 167 277 160 66 30 142 158 76 276 156 137 172 135 282 278 124 21 93 192 234 162 153 132 87 119
4115A19j2m0M1m3oJ22n1p9L8j9l8J18m6J12q6j0J36J38o9j15L2j35o0N5k1R4J5R8j93J37p1
$$ 119 107 67 108 65 59 181 130 51 89 70 32 150 104 216 130 120 256 394 325 210 242 107 47 102 81 175 190 288 95 232 161
3824A61ro0K37j13j23K5L9j6l0Pk7L4Q5j04p4P6lK1M0r3M1l1J27r4O6n9K4M6Q2j2j25Jj4J32
$$ 161 152 92 329 216 93 118 157 141 111 118 91 125 210 106 32 108 105 126 166 73 114 83 210 116 182 123 147 193 275 263 138 139 125 257
3504B57m1J1r3o1k7k0N0J5J14K5q2j18P4j8n6J05K3j17Q7K2r8O4k6k7j5j6k0K5J35j6l8l2
$$ 257 216 227 134 73 46 26 76 91 205 230 148 30 104 86 30 135 158 41 128 150 52 116 90 63 48 32 12 37 172 156 118 86
3204H6J4L3n5O3J0p5J7Kl3JJ15K1l4j23K35q9j45Q3J51k8j46o6M0K6LK1r5pP2P7r4Q0nl8k6
$$ 86 100 133 78 141 151 76 93 95 62 63 178 199 165 42 277 188 43 126 277 249 103 37 77 103 106 127 32 25 97 174 80 160 155 117 91
2875I1m4P1K4p8KJ4m0L5l5k0J71K3j29J54m4j02J0K36j19j1n7nq4K81j68k8r6J67P4j52J09
$$ 91 47 118 142 64 66 80 40 75 40 20 191 214 85 239 195 93 103 339 220 209 152 147 63 344 176 148 52 219 293 141 250
2584B50Oo8j67J11OK3j09%O1k1l8K9n3J43j8r6Mk4OQ8n6N6R0k9n9j04N0l2O7Q1n1o9J8J53
$$ 250 256 188 21 132 138 161 52 52 113 92 54 83 30 173 155 59 63 39 45 133 77 133 223 194 135 31 81 49 116 197 146 77 95 248
2265B48J8r1o8Q2n7qR0m9j14J01k0O0r3J57j99J64o1l2m5j7J50j3j45P9Q0K0j41R0J7j69J53
$$ 248 266 175 107 189 132 124 214 165 51 152 132 192 99 256 57 221 160 128 83 66 216 203 58 137 217 237 96 186 203 34 187
1974A87r4j9L4O0j02k0j0J19j0J0N6o5r0j1N8J9N2J2q1J3R3j9n2nl0M9J9j7P5p8l3p1O6Q4
$$ 187 93 74 108 168 66 46 36 155 145 155 211 146 56 45 103 122 174 186 105 118 211 192 140 135 105 154 173 156 231 153 120 49 115 199
1655A99j70O8j0J77j64Q0k0nq9nL2p4J43K1l3jJ20j51J9J40N1k02J4l8m3jKj2N4m3N3K3j8
$$ 199 29 97 87 264 100 180 160 155 66 61 93 19 162 183 150 149 269 118 137 277 328 126 140 102 59 58 60 48 102 59 112 135 117
1345A17o1J01m4l4j1Q8K60j05nj67q0n1J35J8k7K3n8J19j6j27J6M3q0N2o5L22k5l22N5n1O4
$$ 117 56 157 113 79 68 156 416 311 306 139 59 8 143 161 134 157 99 218 202 75 91 134 54 106 41 363 338 16 71 20 84
1054H4k1j5J07p9L3M1n5n7M1K3J2k6Q0m0O7p9O8j4j03PJ00R7M06M05n53j93j69N3l6Q5j1k31
$$ 84 63 48 155 76 109 150 95 38 79 102 114 88 168 128 195 116 184 170 67 74 174 271 677 1082 529 336 167 220 184 269 258 27
753B7Q7N0N3L7n5lQ7j64J62R5j40j89J46R1j67k7JJ3J06n5j37L5M9L6K0j24K6rP5Kl6J23o6
$$ 27 114 164 217 254 199 196 283 119 281 376 236 47 193 284 117 90 91 104 210 155 18 53 102 138 158 34 60 51 126 128 92 215 149
443A49j07P1J28j05R5o6o0O2K5qj79O1m9L2rQ0K15j25r0Ko7Pk2J64L7j12rK6r4M3k4J40l4
$$ 149 42 113 241 136 231 165 105 167 192 184 5 66 17 49 40 120 335 210 120 122 55 62 40 204 241 129 120 146 52 95 71 211 177
133A77Qr3J3Q6r7J43j1j21R8Pl3Rq0J0K05p3j64J33j68Q0R2m1j58J53q9N3N4R9n2j38Mrm9
$$ 177 185 92 105 191 94 237 226 105 203 210 177 186 106 116 321 248 84 217 49 129 221 180 22 175 86 139 193 292 240 102 106 97 48
-176D8N1o0O3O0kO6k1j95R9J9k0o4Q4O7j7K1l8k9l0m5RRk4
$$ 48 99 39 102 162 160 226 205 10 109 128 108 44 128 195 178 199 161 132 102 57 66 75 51
-392E1
##PAGE=	F1=-12834.1
##FIRST=	19140.455529915001534,	4405.895418600002813,	0
##DATA TABLE=	(F2++(Y..Y)), PROFILE
4406H7M5o9Q7l6K3J24r0J11r7q6p6M4L9m9J84j16NL4l8J46m0j01j19J12P1L8q5J2l2l0L3P
$$ 87 132 63 150 114 137 261 171 282 185 99 23 67 106 57 241 125 130 164 126 272 232 131 12 124 195 233 148 160 128 98 131 138
4105A38n0K7m4j8J19m7q4Q7J0q2P1J5Q8r5m3J40R6o0q2N6j32p6M6%Q2qJ02j65J29l7rj00K43
$$ 138 88 115 71 53 172 125 41 128 138 56 127 142 230 135 92 232 328 268 186 242 110 34 80 80 162 154 256 91 220 183 174 74 317
3796C17j02j13M1k9l4l9P2k3N7M7q3m0R8j4j7P7j41M4m6J23r6R9o3J9M0K7k5p5J2l3J44p1
$$ 317 215 102 143 114 80 41 113 90 147 194 111 71 169 155 138 215 74 118 72 195 99 198 135 154 194 221 196 121 133 100 244 173
3495A73J3j01J6m0k7L8PJ49J0p7j16P5l9n0J06Rj21J16L3p1O8q6l8j2j1j4M9J06o3Kn5L8K3
$$ 173 186 85 101 61 34 72 79 228 238 161 45 120 81 31 137 146 25 141 174 103 171 85 47 35 24 10 59 165 102 104 49 87 110
3185A10l2O0jo4m2K8pMR6L8l9j30K35m7j67P5J70k3j86J5l1QL4M8p1k0K3Q3r3P2j3J1J8o6
$$ 110 78 138 137 73 31 59 52 56 152 190 151 21 256 209 42 117 287 264 78 93 62 70 104 152 81 61 84 167 74 146 133 144 162 96
2866I6%N2r3N2m6j0O3q6L6J08K3j04J24l6n0k0K19j21j4p4L7j15K75j38l4j14J70M8j45J75
$$ 96 96 148 55 107 61 51 114 28 64 172 195 91 215 179 129 109 328 207 193 119 156 41 316 178 144 30 200 248 103 278
2584B78Kj02j36J49j20N7p2J7N6o8K1o8M9J02L0r8m4%J3R2j12R6N8k5k1j10J2k2Q7N4n3m2
$$ 278 280 178 42 191 71 128 56 73 129 61 82 14 63 165 195 97 53 53 66 158 46 142 200 175 154 44 56 34 121 175 122 80
2284H0J2J54K9r8q3J52r1o3R8j8j06Q2lN4q1J18j86J68n3m1Op3J31K4o8n8N9R8j11J09K0j57
$$ 80 92 246 275 177 94 246 155 92 190 172 66 148 145 199 118 236 50 218 165 124 130 57 188 212 144 86 145 243 132 241 261 104
1983A04L9o9o9Q6L5j7p6K8J00ok2M1k4n9pPJ2Q7Or1L6Q0l0p5j5m0R3L5KK9j11mn8M5P4j48
$$ 104 143 74 5 91 126 109 33 61 161 155 133 174 150 91 84 91 103 190 196 105 141 221 191 116 101 61 154 189 191 220 109 105 47 92 166 18
1645A8O8k5J87j43M6l7mo4M6L2p9J39j8l0M4J21j85J2J51O1k08K2n7k7L0m7k8P4J3j3K0J4
$$ 18 86 61 248 105 151 114 110 46 92 124 45 184 166 136 180 301 116 128 279 340 132 154 97 70 100 53 25 99 112 99 119 133
1345A33r4M1Km0j2J18K69j05Jj66q3k9J01J1m3Rj7J53j4j35k8O6k8l3n2L10j5k78P7r1R2r
$$ 133 39 80 82 42 30 148 417 312 313 147 64 35 136 147 104 113 96 249 235 100 72 138 110 77 25 335 320 42 119 28 120 111
1044A11l7J06q4K7j5l4l1P0m8Q5q9R3j2Q0q7J10J5j46O1k3K65L97N67p01k58k10p2NJ32M7
$$ 111 74 180 96 123 108 74 43 113 65 150 61 154 142 222 135 245 260 114 175 152 417 814 1381 680 422 212 140 145 277 324
763C24k51N9K3M2K8n2K6R6j88K01Q6j38k10J11J26j52p0K7QJ02m0j37L4M2P1J7j43L7J0N3
$$ 324 73 132 155 197 225 173 199 295 107 308 394 256 46 157 283 131 61 88 96 198 158 21 55 97 168 185 42 79 89 142
481A42j1o2R9m2q2R2J36p9O2j03l7P2Pj3j56Q4n1K6NM0K28j75l8N2p6l5n9J65J8j21L8J9j19
$$ 142 131 69 168 126 44 136 272 193 255 152 115 187 194 181 25 109 58 84 89 129 357 182 144 196 120 85 26 191 209 88 126 145 26
171B6%K3J58k1J4j19L8O7m7J36m3j19P5l7j4L8j17J07K02j22j50Q9j47R7R7n6j16J64j10K5
$$ 26 26 49 207 186 200 81 119 186 139 275 232 113 188 151 137 175 58 165 367 245 95 184 37 134 231 175 59 223 113 138
-111A38O8Q0o0j11kl2n6N6l2P2M3m1Q7J4j67M2Oj1l4O0R2k7j0J3k7m0o1mL9n5
$$ 138 206 286 226 115 113 81 25 81 49 121 164 123 210 224 57 99 105 94 60 120 212 185 175 188 161 121 60 56 95 40
-392D0
##PAGE=	F1=-12912.8
##FIRST=	19140.455529915001534,	4405.895418600002813,	0
##DATA TABLE=	(F2++(Y..Y)), PROFILE
4406C6M8l0R0pJ9J04p9R3n5q8r0RP2q8J85j34M2L0l1J43p2o4j19J32P9kj08N6m3k1L2K5n0
$$ 36 84 54 144 137 156 260 181 274 219 131 41 50 122 34 219 85 127 157 126 269 197 133 14 146 225 223 115 171 128 107 139 164 114
4096A14Qm4l6J32m6o8J05L2p7J8M8M8j04o2J29M3l6m3R9j29j15N6NR2k4Q4j25R3Pk8j14K27
$$ 114 122 78 42 174 128 60 165 197 120 138 186 234 130 68 197 240 204 161 260 131 16 72 77 169 145 229 104 197 204 176 62 289
3796B89r2r1M8r0j2j2N4lN7K5m1l0J12j6o4J10j69N1o5J26j03J22o0J2M9m4n6LQl8J32r4L2
$$ 289 197 106 154 64 52 40 94 91 148 173 132 102 214 198 134 244 75 126 61 187 84 206 146 158 207 163 107 110 118 80 212 118 150
3486A50j03P8m2l8L4NJ62Qo3j23P2o2k3Q9j8j20J34M6k7O2j41j7l2j5LN0P7r6O9r4O4Nl1O2
$$ 150 47 125 83 45 79 84 246 254 191 68 140 78 55 144 126 6 140 186 159 221 80 63 31 16 19 69 146 50 119 25 89 94 63 125
3166A25j2l5k3j8PLN7N7k9j24K05nj63P0J62j4j52M2j06K2O3N3m8l4l5Q0p7O4k8P1M7r7k9
$$ 125 113 78 55 37 44 47 104 161 132 8 213 208 45 115 277 263 111 153 47 69 132 185 137 103 68 148 71 135 107 178 225 128 99
2857I9O5r9Q8j06J7Q6p5L1K7K7o0P3k2jn2J96j22j5p6R1j53K54q8m4j19J46J8j23K26J3j30
$$ 99 164 65 153 47 64 150 75 106 133 160 100 173 151 150 98 294 172 157 81 172 19 273 185 141 22 168 186 63 289 302 172
2565A72p0J58j61M6p5J4N4j09O4rK1N7O4j06p1L8J3P1j59J46J0k6J0r6k1J5Q0Pm1k2K8J41
$$ 172 102 260 99 145 70 84 138 29 93 84 105 162 226 120 49 87 100 171 12 158 168 142 152 56 35 50 130 137 96 74 102 243
2265B43K7q1j10K02j21r6R5K7q9N1J3N8r1Q8j55J36k6o2N7j21R5N3K7j31K3J30o8J21K1j56
$$ 243 270 189 79 281 160 64 159 186 97 148 161 219 128 216 61 197 171 109 166 45 140 193 220 89 112 242 174 295 316 160
1983A60o2k3J5L5n2O9n7M4M0j2n9J8L4k1j9m7K3R8qp5M1O7l6r7j5k3R8M2L1j2j19%m6L7M4
$$ 160 98 75 90 125 73 142 85 129 169 157 98 116 150 129 110 63 86 184 176 101 142 209 173 76 61 38 136 178 209 197 78 78 32 69 113
1655A13q9N2l1J70r5Op0Ml7R9L9p8J28n3l4Q9J16k21RJ56N2k02M2o9mK7p2J7M4M4o1M0J3j16
$$ 113 24 76 45 215 120 126 56 60 23 122 161 83 211 158 124 213 329 108 117 273 325 123 165 96 92 119 47 64 108 152 91 131 144 28
1335B8L5P8r5j8J07K61q0oj48r0qN7J5o6J1J0J56Oj24r0R5K4p7m2K47jk27J00q7R6po5J10
$$ 28 63 141 46 28 135 396 316 310 162 72 64 121 136 70 81 91 247 253 129 39 134 158 81 39 286 285 58 158 71 167 160 95 205
1025B05q7J2m5m3j8J05o6J42j59J06OQ7r7J24O6j62J25j18M14N41P20q93m31k49k52P6J54
$$ 205 118 130 85 42 24 129 63 205 46 152 158 245 148 272 338 176 301 183 597 1138 1858 965 534 285 33 109 263
772B63J11k48J7lN0Nn6O6Q7k05K25P4j21k31Q2J61j36r4L2KR8k5j44M6J6R5J5j30M8L1J9l3
$$ 263 374 126 143 140 190 195 139 205 292 87 312 386 265 34 116 277 141 47 79 81 179 154 10 56 72 167 182 52 100 131 150 117
471A17o8O0Mp9J10J39n4K9j29lQ0j4k3j22Q8l3J8J3KK15k03L1P0p0p6j8R1Nj36O7K8j07K1
$$ 117 49 109 113 34 144 283 229 258 129 126 206 192 169 47 135 102 120 133 135 350 147 178 248 178 102 84 175 180 44 111 139 32 53
162E3k5J67pJ5j17L1N0oJ29o5j04N2r4K1O0j31J90J52j53j02K3r8R2Q2o5n8J63j00j6P2N5
$$ 53 28 195 188 203 86 117 167 161 290 225 121 173 79 100 160 29 219 371 218 116 139 41 133 215 150 92 255 155 139 211 266
-129B66p7p3J2p2j0K0j5J00J0p5J04L9j40Kj4NRK5R2k9m1O3k0j4o8o3O8l1
$$ 266 189 116 128 56 46 66 51 151 161 86 190 229 89 91 77 82 91 116 208 179 138 201 181 167 99 36 104 73
-392G3
##PAGE=	F1=-12991.6
##FIRST=	19140.455529915001534,	4405.895418600002813,	0
##DATA TABLE=	(F2++(Y..Y)), PROFILE
4406C1J3PP8K1QO6k8N9rq6j02N1Q2j84K22j74P4K1mJ32q1o3j03J15J04n0j01Q6n8j7L3L9m2
$$ 31 44 51 129 150 158 224 196 255 246 160 58 109 191 7 229 55 129 150 146 278 197 134 31 146 250 200 99 185 127 110 143 182 140
4096A40nn0n8J52n1l3R7M4o1jN0Jj09n8R6rJ0jJ57j32j48N1j4J22qL4q5M9M8o9r6J86q7o0
$$ 140 135 85 27 179 128 95 192 236 175 174 224 225 116 58 154 145 155 154 311 179 31 82 68 190 182 216 131 180 228 159 63 249 162 102
3777A02M9j09N5K1n2K7L7K6jl3J18nj14J27j77O8r3J34j12J44n6OO0j07j06J06j8k1R9j11
$$ 102 151 42 97 118 66 93 130 156 155 122 240 235 121 248 71 139 46 180 68 212 156 162 222 115 9 115 97 76 175 64
3495F4O8r6J07m5m5M6LJ53Rn0j22O3q4J5O9n1r3J13N5K9M5j51j7l8k7J1M2O1r0J02j11O1p
$$ 64 132 36 143 98 53 99 102 255 264 214 92 155 71 86 155 104 11 124 179 208 253 102 85 47 20 31 73 134 44 146 35 96 89
3185H9n7P0k0RK3p6J0j0LP6pj04J50K6j31P6J32lq9L2j66O5P9M7m9n3o1N2m2N5m3J26N4j34
$$ 89 32 102 82 91 114 38 48 38 41 117 110 6 156 182 51 127 259 256 167 199 33 98 177 224 175 122 61 113 71 126 83 209 263 129
2866A29rM1p3R7j41L4J04n9Om0K6pJ3nL1p2J78j22k4m5J37j93K13k7n3r6R5pr9K45L5j41r
$$ 129 120 161 88 185 44 78 182 123 129 89 115 108 121 116 147 75 253 131 107 62 199 6 219 192 139 43 138 131 32 277 312 171 162
2556A62J54j45K1j02jM9j26Q2N6j4J9P6j09n9N9OM1j33J36m0k5L2q1l6O0N6m5Kk6M6J32Pn3
$$ 162 316 171 192 90 89 138 12 94 150 136 155 231 122 63 122 128 169 36 172 132 107 139 58 22 82 138 93 95 69 115 247 254 201
2246B01j41K25j41o0O3N7q0K5K4O7j13O9r4O9mq6J01j52N1P5J23j37lQ6j3J24K2j65j26K7
$$ 201 60 285 144 84 147 204 124 149 173 240 127 196 102 171 167 81 182 30 81 156 279 142 139 225 212 336 358 193 67 94
1964I4Q8Nj72J33j3M7mk6q5KR0pl7q5M3P8k1l6K2N6l6j01j7M5M4L3O4l9p0k8n5L7Pj0K2k3
$$ 94 182 187 15 148 135 182 178 152 67 69 159 152 115 30 73 151 130 94 116 172 136 35 18 63 107 140 204 165 95 67 12 49 56 46 68 45
1626D5J34l3k8j05N4l1J01N6o2J10q0m9J12J23k53PJ56K5j84P0p5K6rn9M6K6N4r6O6Nj15Q3
$$ 45 179 146 118 13 67 36 137 193 131 241 161 112 224 347 94 101 257 282 98 168 93 119 110 51 97 123 177 81 147 152 37 120
1326A20J01j28j6M1K45k8l6j19j01NK0K7r0M1kJ36M7j06j50J12P3n3o3J49J3j78J18o2J04
$$ 120 221 93 77 118 363 335 299 180 79 84 104 131 41 82 80 216 263 157 7 119 192 139 76 225 238 60 178 116 220
1054B20k6q4J21r7nm6o9RJ19m1J62j87J01jR5j22J15J29j47J91j61N10Q17Q67j120o74k99
$$ 220 194 110 231 134 129 83 14 23 142 101 263 76 177 176 271 149 264 393 246 437 276 786 1603 2470 1350 676 377
800C77k74J1J37J60k31l7l2R3k0p4J04O0k04K19O4r3k25M3J87j34q8K4%Q8j4j26M4k1R5K9
$$ 377 103 114 251 411 180 143 111 204 184 110 214 274 70 289 353 260 35 78 265 131 43 67 67 155 141 15 59 38 133 162
518A62r8N5M7j5o1n0K8N8q6R1J38k8lj42K9R0l5l3p9P1j5K2J3k4J79j97R6O2n5j17J8M0Qj16
$$ 162 64 119 166 151 90 40 68 126 40 131 269 241 238 96 125 215 180 147 68 139 124 146 159 135 314 117 213 275 220 103 121 161 169 53
199E3K7N8p3L4r4J75J1Rr6nM2J7J22p0q7L0j46O3P2q2J93P4j54l7n2l4P7N1p0PJ49p1m6N9
$$ 53 80 138 65 99 5 180 191 200 104 99 141 158 280 210 123 153 7 70 142 60 253 327 173 136 84 50 127 178 108 115 264 193 147 206
-120B06K7j01k0K8j18N6j5j5J29j8r0R9N0j14j9m0L5M6pO4l3n3R5j1K7p3j20Q1J2
$$ 206 233 132 112 140 22 78 63 48 177 159 69 168 218 104 85 45 80 126 119 183 150 97 192 181 208 135 15 96 108
-392A08
##PAGE=	F1=-13070.4
##FIRST=	19140.455529915001534,	4405.895418600002813,	0
##DATA TABLE=	(F2++(Y..Y)), PROFILE
4406H0k0MM2M1oJ5N7J8K8p6j05P6J01k31K37j96P4JL0J18o7q2r0P3J28q7k8O4p6j7L9N0l1
$$ 80 60 64 106 147 141 156 213 231 259 183 78 154 255 24 261 65 139 140 170 288 221 139 49 122 250 163 135 199 123 106 145 195 164
4096A64oo3q1J69n9J1P0M3l8mL9m4j07l4M5n1Q6L3K10j40j83N5n3J42K9j9o0K4P2j28l8J14
$$ 164 158 95 14 183 124 135 205 248 210 206 245 201 94 60 105 54 140 173 383 243 60 115 62 204 233 214 154 178 250 122 84 198
3796A98p1l8M9o8P9L9j49N8KN4J7l7J17J7j52J11j62R5j37J48r9J49n8OO2j23j1L8n7J4N8
$$ 198 127 89 138 70 149 188 39 97 99 153 170 133 250 267 115 226 64 159 22 170 71 220 162 168 230 107 96 134 77 91 149
3504A49j29J19p6Q9m1m6O4JJ20Ml8j06N8j12N7N7p0p5P6N4Q5K4j19l8k5m4KL5O8o3Q7j07M0
$$ 149 20 139 63 152 111 65 129 130 250 254 216 110 168 56 113 170 100 25 101 155 240 264 145 107 82 38 40 75 143 80 167 60 100
3195A00j7p6O6k5N3N3j13K9k9oM2J6o9P7L7p5Q7J00Jm3J0j87R8R0M3p4p0m1j1K2K7m3J64L1
$$ 100 83 7 73 48 101 154 41 70 41 35 77 93 24 101 138 63 150 250 251 208 218 31 129 219 262 188 118 77 66 88 115 72 236 267
2875B67j69M2j0j2P5j56N5J18l6m5o2QL5m0J2L7o4J65j18l7K1J42k06J34L6o1o9P4j1r1K09
$$ 267 98 140 130 118 193 37 92 210 174 129 67 75 110 70 82 119 55 220 102 65 86 228 22 156 192 131 62 136 125 34 243
2584B43N8j26L3J37j16Nj21k1M1r8N7J05m0j4Q1j05k9O0lOp5R8p9j1M7q3l1Q9L2q6O6m8N3
$$ 243 301 175 208 345 229 234 113 92 133 35 92 197 157 143 224 119 90 150 147 153 78 176 97 86 133 50 19 108 140 54 120 72 125
2274A25J39k6l1j75K24j50L4K8M9p3MK5P4j33N8k1Loj03J27j58L9O2K04j19k5J3N1J16J8j73
$$ 125 264 238 207 32 256 106 140 168 217 144 148 173 247 114 172 151 154 148 45 172 14 53 115 319 200 175 188 239 355 373 200
1983B00j44O3J51j4k02P5L6M3k3m0p5K0R0k1n9p0L1L4k1J7j4M5l8l8j9O3OnQ5m4Qm2n6JL4
$$ 200 56 119 270 256 54 129 165 208 185 145 70 90 180 159 100 30 61 95 74 91 77 122 84 46 27 90 96 91 176 132 140 98 42 43 77
1655G7pmj2R7K5m4o6P5o8N3Q3k7Q3r3p2J02J48k74LJ55j6j53R5p9O5p3NL3K2M9j15Q4Kr6J17
$$ 77 70 66 54 151 176 132 66 141 73 126 209 182 265 172 100 202 350 76 79 234 218 65 160 81 146 73 78 111 133 182 67 151 153 57 174
1326A74J10j51j1k4K31M2q6q7j04%lM0j01P3l4R2J06q8j25M0J16lq5L8K6j36J28j9J14o5q8
$$ 174 284 133 122 98 329 371 285 198 94 94 91 131 30 103 69 161 267 179 54 94 210 207 122 160 186 50 178 159 273 208 120
1035A20J34j15k2j5j9oR2mJ55j91Q7j7R9j60J06J80j13K54j72N66J141R93j353r14l56k32
$$ 120 254 139 117 102 83 77 169 165 320 129 216 199 298 138 244 424 311 565 393 959 2100 3093 1740 826 470 238
791B38p5J03J68k05r4p1J59k7j01J30J6j57J52O3n5j81j4J95j51m2Q%P1j2o9K0o2P4P3q0N7
$$ 238 163 266 434 229 135 64 223 196 95 225 241 84 236 299 244 63 49 244 93 51 59 59 130 118 49 69 7 81 154 74 131
500A31O0m3r4j7M4Q0q5K3J37ok6j48O0R5n1m4l0L7nL6Ol4J27j43J31L5l7j48L9K4K4q3m8J01
$$ 131 191 148 54 37 81 161 76 99 236 230 204 56 116 211 160 116 86 123 118 154 160 126 253 110 241 276 239 91 130 154 178 95 47 148
180A48m8K3j00J45L0oo6n4M4K1J08n8p3J5o4k4Q4l2J62j4j04Rj22L1O3K1q6P3J26l4n4L1j
$$ 148 100 123 23 168 198 192 126 72 116 137 245 187 114 129 65 41 125 93 255 241 137 146 24 55 118 139 53 126 252 218 164 195 194
-129A94j24M0L8j34Q5l0k3J44l1q1O9M4q1k7p6R0N9l5K9n6l5J04oP1p2j22M0O5
$$ 194 70 110 148 14 99 69 46 190 159 78 147 191 110 83 7 97 156 121 150 94 59 163 157 228 156 34 74 139
-392A39
##PAGE=	F1=-13149.1
##FIRST=	19140.455529915001534,	4405.895418600002813,	0
##DATA TABLE=	(F2++(Y..Y)), PROFILE
4406A19k5jj8N5j6m2J52j6N3o3r8P3J21k45K45j99N7k3M9J02m8q1q9K2J34r8P2J5r5j7N8N2
$$ 119 94 93 75 130 114 72 224 208 261 198 100 173 294 49 294 95 152 129 178 280 232 151 62 84 218 120 192 207 112 95 153 205
4105B05k2Lp7p9J59o8N1L3K8j5%K6q5r4joj6J01N8K50j47k23Q6q9J17Q0n3n9K0P8j90N0K6
$$ 205 183 186 109 30 189 121 172 205 233 218 218 244 159 65 64 58 42 143 201 451 304 81 167 78 195 275 222 163 183 261 71 121 147
3796A47k0n5N4l1R1N3j93O0l7R1J0l1J13M0j62N9j24J20j67J34m2J21o9J0N4r3M6k5q8N0K2
$$ 147 127 72 126 95 186 239 46 106 69 160 170 139 252 292 130 189 65 185 18 152 110 231 162 172 226 133 179 154 66 116 138
3504A38j10J37n9M5k6n1Q4NO8qk7p9O8j49R3N3o3q1M3M0J29Qp1n7j0n7k1L3R3n8O6r0J0k8
$$ 138 28 165 106 151 125 74 158 163 231 223 196 117 185 36 129 182 119 38 81 121 250 258 187 130 120 63 42 75 168 110 176 86 96 68
3185F8j8j1k4Q1P0j33O6l5L4k5J2l2RK6nR6Q0j4k8j5j53J02R3M4j13p2lq5J03k3oJ70j8j95
$$ 68 50 39 15 96 166 33 99 64 98 73 85 53 62 88 83 179 259 245 217 202 49 151 244 288 175 103 100 15 118 95 89 259 241 46
2866D6J03p8P8K5j52Q4J24nj13l0j5M1o9K9J2k1J38j10k8O1J27k09N1R5p1l9R2%j15J41P4
$$ 46 149 71 149 174 22 106 230 225 112 82 67 108 39 68 80 59 197 87 59 120 247 38 89 184 113 74 166 166 51 192 266
2575B66r0N3J13p9lj24l9K6o2K6J38n6k6R0j02j0M7j6k4rN0r9J7N9j00k6R6J9j08J14n9M6
$$ 266 176 229 342 263 260 136 97 123 61 87 225 169 143 233 131 121 168 152 128 119 169 70 87 146 46 20 116 135 27 141 82 128
2274A28J57n6k2k03J98j37J33OJ4n8j4J1P2j40N1M8l2l7q1J01j19P9lK43q8n8n7J16R6Qj70
$$ 128 285 229 207 4 202 65 198 204 218 160 146 157 229 89 140 188 156 119 38 139 20 99 96 339 251 193 136 252 348 356 186
1983A86j34R0K01k5j99j8P1L2k2m5m0L7O9m3r3rj1j4QO3l6K4m0L2k4M5K0n5O4l2Q7m6n5l3
$$ 186 52 142 343 318 119 101 172 204 182 137 97 134 203 160 67 58 47 33 41 104 68 92 52 84 60 105 125 70 134 102 189 143 88 55
1664E5Q9n3j7j2P0O9m4m9J06j06k0J13K3N2r3q4N9J76k71j2J57o6j03J02o9R6j46R4j5L0L9
$$ 55 144 91 74 62 132 201 157 108 214 108 88 201 224 276 183 99 158 334 63 51 208 142 39 141 72 168 22 116 101 131 170
1373A70j23Q7Po9J36J08j62jp6K26J09j44n2q9l2j2N1r9Q3n2K9J65p1r0l4J47M8r2o7L3j03
$$ 170 47 134 141 72 208 316 154 153 77 303 412 268 216 127 95 83 134 35 118 66 95 260 189 99 65 212 260 168 101 134 31
1082C1J29L8J19j13p2J40j43l2M4J4k3P7L9J28j97O8k7R4j92J23J87o9L00j67N89J430J064
$$ 31 160 198 317 204 132 272 129 97 141 155 132 209 248 376 179 247 220 314 122 245 432 363 663 496 1085 2515 3579
828C579j540j094m02j86j45R6J29j72j33j19K18k1j17J44m0o8L2P1j0j28o2J81j81N0k4KM8
$$ 3579 2039 945 543 357 212 308 437 265 132 13 231 210 93 237 197 129 161 232 222 94 32 213 32 82 58 60 108
575A08k1k%p0M5J18r7N1P2o3j30L8P0R1q4p0J40J0l9j45R3Q0n4n7J1Pj9N9rk2P1n8J28Nk3
$$ 108 87 85 85 15 60 178 81 132 204 141 11 49 119 210 126 56 196 206 167 22 115 195 141 84 95 102 83 142 133 111 182 124 252 257 234
246B34j54L4M4L5o6r7J31l6mo4J08M3k9l6r9O0jQ7m3n3RJ3j00R7kJ14r6PKr8J3N5K3j21J18
$$ 234 80 114 158 193 127 30 161 125 121 57 165 208 179 143 44 104 103 190 147 94 103 116 16 113 111 225 129 136 138 40 53 108 131 10 128
-83A28J04nm4jk6j11O6M3j10N9k2l3J43k7o3K9K6l5l6l4Q1M2o2K5j17K3P7nJ09o0r9j6J15
$$ 128 232 227 183 182 156 45 111 154 44 103 81 48 191 164 101 130 156 121 85 51 132 174 112 137 20 43 120 115 224 164 65 49 164
-392A64
##PAGE=	F1=-13227.9
##FIRST=	19140.455529915001534,	4405.895418600002813,	0
##DATA TABLE=	(F2++(Y..Y)), PROFILE
4406A40k8J9r4O9nn7J79l3O2n0q8N6J33k40K52j94L9m0M8P9l7m9r4j0J05p2J47l3j11j8R8
$$ 140 112 131 37 106 101 44 223 190 252 202 114 170 303 63 315 121 160 120 168 247 210 161 67 57 162 90 237 204 93 75 173
4115A73M3k1K0q8p2J42p4P7oN%J0J1j17o7K9k3O0L9P5K75j48k54J39j12M7J35n9q3K6P5k30
$$ 173 216 195 215 127 55 197 123 200 194 199 199 209 220 103 36 65 42 102 141 216 491 343 89 228 116 163 298 239 156 182 257 27
3814B7J36n4N8j14P2k4J01O2j88M1o2J08lpJ02M9j48pp2J35j53P6L0P5q5J5L9n2P4o6r8P3
$$ 27 163 109 167 53 125 101 202 264 76 117 55 163 160 153 255 304 156 149 77 212 59 135 165 240 155 170 209 157 231 165 67 140
3514A40np3J38m7j5Jo8J06K0J0l2j3n2R3j78J04N8m2r4J9J6J53Lk8o2Ko4n1L6J13o4M6o6k0
$$ 140 135 62 200 153 138 139 71 177 197 207 175 162 110 203 25 129 187 145 51 70 86 239 242 214 152 154 90 39 75 188 124 170 104 84
3195H4m0M4n8pM7P9j28J05k7M9n0j6J1n2KP1R8O7n2m1l2q0Q6Q4N0j54m5J9n9Q8p9O4J48q7
$$ 84 44 88 30 23 70 149 21 126 99 148 98 82 93 41 43 114 212 279 227 186 154 74 160 244 294 140 95 114 55 143 64 128 276 189
2875A89j41J00j22J48l6r7P9J20L3j82J8k0K3p1L3JMR3j02JO9J10j97k6J44q5lJ24%j44O8
$$ 189 48 148 26 174 138 41 120 240 273 91 109 89 112 41 74 75 79 172 70 71 140 250 53 27 171 86 83 207 207 63 131
2584A31Q0m5N1R4l1lj18n7J0k7qJ59o1j2J07j08j3K6l4l7N3jr9M4P1j12l9Q4K2j23J39m7K6
$$ 131 211 166 217 311 280 277 159 102 112 85 77 236 175 163 270 162 149 175 141 104 157 156 57 101 172 60 21 105 127 4 143 96 122
2274A22J76p2l0j53J00n8J60j0k8l1k9k2O0j31M6J05l4o9j9Pn1J08m2K33m7r5j15J68O9j1
$$ 122 298 226 196 43 143 85 245 235 207 176 147 125 185 54 100 205 171 102 83 90 39 147 105 338 291 196 81 249 318 307
1993C07j49j13J18K28k9j91p5O0K0om1pL8N5n0j42N7l3J1NO3j6Jk3J9l0L0O1o7j1rJ56n3n0
$$ 307 158 45 163 391 362 171 96 156 176 170 129 122 160 215 165 23 80 47 58 63 126 110 111 88 107 77 107 168 101 90 81 237 184 134
1673A34o4J29r1k2j8M9R1k5n8J39j30j01J35P8K4q2p4PJ84k44l2J57j20oN3k7R5j19R0p6L8
$$ 134 70 199 108 86 68 117 208 183 125 264 134 33 168 246 270 188 114 121 305 61 29 186 66 60 113 86 181 62 152 76 114
1382A14K8j17P7J0l4J39R3j61J7j08K21J57j87j8o3p1k3O0r5Q0m0m8K10n6n4r8J66Q3p6j35
$$ 114 142 25 102 112 78 217 310 149 166 58 279 436 249 231 168 97 74 134 39 119 79 31 241 185 131 33 199 282 206 71
1101G1J6q0J23J03J12j58m3J34j73l0J14K1l9P5Q7R1k08L7k1P5j94J56J50k7L17j57N85J612
$$ 71 87 7 130 233 345 187 144 278 105 75 189 210 171 246 333 424 216 253 232 307 113 269 419 392 709 552 1137 2749
838B749J056j635j175m19j40k02J18N9j35j28q0J51j2j07J49r9K7r6Q6L1p9q6J41j19P7o5
$$ 2749 3805 2170 995 576 436 234 352 411 276 148 68 219 207 100 249 150 177 81 167 198 119 33 174 55 132 67
594F7LK1l0N7j4q2P9J14j36M2Q5p4q7L9Q0J02q3j72J52J7m5r0Q8M2m0n9J5J2n5O5l0QK3K3
$$ 67 70 91 61 118 104 22 101 215 79 121 206 132 45 84 164 266 183 11 163 180 135 45 133 175 135 76 91 103 48 113 83 91 114 137
274A37J05k0j6j23J5P4K9n9j11J33k8m1LP5M6n7j2j19P8m4O2l7k4J8O0r7O3%O0j44J27m4k3
$$ 137 242 222 206 83 98 172 201 142 31 164 136 95 98 173 219 162 150 31 109 65 127 90 66 84 144 47 110 110 170 26 153 109 86
-36H6m0N7N8j02O6R6%k7j7n3m6L5M2r8L6Lm0J27j1m4j0RK1o0K8O1jq9Q2p9k4J4j7J42m3o8
$$ 86 46 103 161 59 125 221 221 194 177 124 78 113 155 57 93 96 56 183 172 128 118 127 148 88 116 177 176 87 169 90 66 80 63 205 162 94
-374I4o5J56
$$ 94 29 185
-392A85
##PAGE=	F1=-13306.6
##FIRST=	19140.455529915001534,	4405.895418600002813,	0
##DATA TABLE=	(F2++(Y..Y)), PROFILE
4406A43l5O1j53P5L1JQ2l3O1l7r1N5J33k32K56j81K3l9M2L9m6Lr6J0L0j3J68o8j25j9J62K3
$$ 143 108 169 16 91 122 123 205 172 233 196 105 160 293 61 317 136 159 120 162 201 155 158 62 72 102 89 257 189 64 45 207 230
4105B30l3L9r3o8J29p1Q2l7j6kJ9%j32l2M2J8O6j8Q6K81j43k57J92j24l2J75l9j24L2O8j87
$$ 230 197 236 143 75 204 133 215 178 162 160 179 179 47 15 57 75 141 123 209 490 347 90 282 158 126 301 262 138 170 238 51
3814E1J45j01J16j76R8m6J11O2j57K6p0R7rL3Q1M0j26n7k3J37j31M0Q2K2j08J7K6k0Q3q1q8
$$ 51 196 95 211 35 133 87 198 260 103 129 59 156 147 180 261 301 175 118 95 232 101 141 223 245 137 154 180 160 243 162 74
3523G4P7k8l3J44l7q1L2q9J23M7l3o7Lm2J23j69O9O8j9r5mnJ54J5mn3Ro5o5L4J12p3K6m1m5
$$ 74 151 123 90 234 197 116 148 59 182 229 196 129 132 90 213 44 113 181 162 67 63 58 212 227 223 170 179 114 49 83 195 122 148 107 62
3195F2k8P8l7j6l0Q0q4J18rM2n7l8O0j14PJ21R4M6j07o6m0J3O2O1O0j87J6PqM5j14J36J13
$$ 62 34 112 75 59 29 109 25 143 134 176 119 81 141 27 34 155 249 295 188 122 82 95 157 218 278 91 107 114 106 151 37 173 286
2885B86j62oK1n0R8q6j5M5J04P2k19M6k2K3q3L1M4l0M3q7K7O5R3j73l4J24r9L5J50j1j63L
$$ 286 124 118 139 89 187 101 86 131 235 307 88 134 112 135 52 83 127 97 140 53 80 145 238 65 31 155 56 91 241 230 67 70
2584G0P7pL7Q9K4Mj15p4jjm2J74n9RJ29j20k8kn1j2R0m8q4N8Q2j15o1N3M8r6R7j7KJ82p0m8
$$ 70 147 140 177 266 290 294 179 105 104 103 61 235 176 185 314 194 166 164 113 101 191 143 59 117 199 84 23 76 124 28 125 108 110 292 222 174
2246A74r5K7M3J26k7o2Ml6o8L6j09M5J43j1o2Nr9J5J22n0J91lj12j41J75M3m0j06q1J29K30
$$ 174 79 106 149 275 248 186 190 154 86 122 13 58 201 190 128 133 34 49 171 121 312 309 197 56 231 274 234 128 47 176 406
1955D06k9j77q3QQK3l6J8K4M3k8j52P2k2M1l0N4J1rpk9l7L1R9o6o4%K09o8l8r0J52j11k6k6
$$ 406 377 200 117 125 133 156 120 138 162 205 177 25 97 75 116 86 140 151 142 135 106 69 100 199 133 69 69 278 210 172 82 234 123 97 71
1626G1K9R5Nq6J65j32r1O0J26No4m3j6J43k00k6J31j27O0k5M3O0n7N5j25L2K0r7M8RQJ25O5
$$ 71 100 195 200 114 279 147 56 116 242 247 183 140 124 267 67 41 172 45 105 80 123 183 126 181 56 88 108 11 59 68 76 201 266
1317B66j46M1j16K07J79k05J4l6r5m7O8q9O6qo3J76m2k5j43J74R3m0j41l3l5P4J66R0j88r
$$ 266 120 161 45 252 431 226 240 204 109 62 130 41 107 99 36 212 170 145 2 176 269 229 88 55 20 94 260 350 162 153
1035A53J15j96j4J69Om7P8J40N2k16j3jM6j49J61R8J6K96j51N53J652R65j611j144m02r5k42
$$ 153 268 72 58 227 233 186 264 404 456 240 227 226 272 123 284 382 398 694 543 1096 2748 3713 2102 958 556 461 219
781B19J54j9r6q0m9N7po3J49j57J06j50P4L8m1r3R0LN1r9nmj5P7j8j07J26R3j68L6R2p0j2
$$ 219 373 354 258 178 129 186 179 116 265 108 214 64 138 176 135 42 132 135 186 87 82 78 63 140 122 15 141 234 66 102 194 124 112
471A12K1R2R6q4k06J17J0m9k4P5oj2m1k9O0l4k7m9M6JO5P5l4j3p1K2P7Nm8j05J12j7p4P9M6
$$ 112 133 225 321 237 31 148 158 109 85 160 154 142 101 72 132 98 71 22 68 69 134 209 175 162 91 113 190 195 147 42 154 137 63 142 188
143A88L8q2Kj07Q0p7N1o1J1L1P6n8J6j3J2k6P8j00N3o8N9Q8r3K1J01j7j4nq1jJ0L1r8L3L3
$$ 188 226 144 146 39 119 42 93 32 43 74 150 92 108 95 107 81 159 59 112 44 103 191 98 119 220 203 189 184 103 102 112 143 45 78 111
-186A11m7J05Rk8m2J0O2r4R5M4o2j13J78l8q5l5m3J56k4m1r4J74
$$ 111 64 169 178 150 108 118 180 86 181 225 163 50 228 190 105 70 27 183 159 118 24 198
-392A98
##PAGE=	F1=-13385.4
##FIRST=	19140.455529915001534,	4405.895418600002813,	0
##DATA TABLE=	(F2++(Y..Y)), PROFILE
4406A34m7J15j52M4O2L8k3k2N8k5j15R1J22k37K57j62J0k1O3qp5K6p7M1j5K9J41q0j46KK24
$$ 134 87 202 50 94 156 194 171 149 207 182 67 158 280 43 300 138 148 127 190 182 107 133 56 97 82 111 252 172 26 28 252
4115B52no0N8r3o7J18n4O8o1k2k6K2Jn8n0J7P3M3n9Q5K65j33k16K19j24q1J76mj65K8O5j32
$$ 252 247 187 245 152 85 203 149 217 156 134 108 130 131 73 23 40 113 156 97 182 447 314 98 317 193 112 288 284 119 147 212 80
3814H0J31j14J42k19J21p9J15N2j10J6o5O8LP2N7Rj02p8J4J29j05M1R7l4j33J2J6JP8o9o6
$$ 80 211 97 239 20 141 62 177 229 119 135 70 138 141 213 270 279 177 99 113 242 137 178 275 241 108 120 136 137 215 146 80
3523H0O4n0J5J49k8j41O3r6J25P8m2r9%n8J44j35J1Q1Kq1k7j5J34M6Jm0J2o5n0K6Q2p8Lj9
$$ 80 144 94 109 258 230 89 152 56 181 259 217 118 118 60 204 69 80 161 163 82 55 40 174 220 221 181 193 128 78 104 186 108 111 92
3204I2n4J7O2J6l7n2J0j2J06J1K1n3m1J10j66M0J31Q6Rj65p4n0J00L8K7P1j95P8k0L5mq4J63
$$ 92 38 55 117 133 96 44 54 42 148 159 180 127 86 196 30 70 201 287 296 131 57 7 107 145 172 243 48 126 106 141 137 53 216
2894B16O8k17J14n6K3L7r4L9PP9J05k09M3k7M4j06J6J05p8J5l0KN0P3j44j2P4j07O9J63l2
$$ 216 284 67 181 125 148 185 91 130 137 216 321 112 155 128 172 66 82 187 109 124 94 96 146 219 75 63 137 30 99 262 230
2603B30j67m2P2PL4R3P4J3j20r3LQo3J85n7RJ52j27m5l4o0N8R0q2o7N8Q7j09p6RR2o4L2J2
$$ 230 63 21 93 100 134 227 301 314 194 101 104 112 49 234 177 186 338 211 166 132 72 130 220 138 71 129 216 107 31 40 132 68 100 112
2284A12j3J68o1p0l3%J08P3m7q0L7l4j11K7l4j8J60K1k6oj44K0J14l5J35L7r1j28J18L2p4
$$ 112 99 267 206 136 103 103 211 284 237 157 194 160 49 76 42 24 184 205 179 173 29 49 163 128 263 300 209 81 199 231 157
1993A57m9l8J08K04k2j65o5m5J2N2m1L8MJ9J9j26M8JM5n2L0L4j9J1p8m2N1J17o5o3j1K39q7
$$ 157 108 70 178 382 360 195 130 85 97 149 108 146 150 169 188 62 110 111 156 104 134 168 149 160 82 40 91 208 143 80 69 308 221
1683B21k8j05J62j15k6l6MQ7M4j28J76j10k5o0J51km1pj4P6j50mR6o0M5r6J09J4%J9j24lJ1
$$ 221 193 88 250 135 109 73 77 164 208 80 256 146 121 61 212 210 169 162 148 224 74 70 166 106 151 55 164 178 178 197 73 70 81
1373H1o8NPM6R4K9j18O9r8J74J71j96M8k1r2q1P3p9M4K9m4J07l2qj10J16P7Rj14p0lJ7K11
$$ 81 13 18 25 71 165 194 76 145 47 221 392 196 244 223 131 50 123 44 88 117 73 180 148 140 30 146 223 232 118 48 45 62 273
1063B73N8j97J9Q9k00QJ88k3m1Q4J85K1k07q1K6J0o9J25N1O3K45j61M97J550Q11j469j016
$$ 273 331 134 153 242 42 50 238 215 174 258 443 464 257 176 202 212 143 268 319 382 627 466 963 2513 3324 1855 839
810H39l53n2k68J91q4o2kl5l5pJ5J38k06J52j07M1j2nr9M7J08L0j21k3j8J6O2j3j35J52O8
$$ 839 486 434 166 357 273 211 209 174 139 132 147 285 79 231 124 165 153 148 49 96 204 234 113 90 72 88 150 137 2 154 222
518B22j78L4R3m6O0nJ16O5q5k20Q6pm8L3N7m5J5j1r5J24J5j54J8LJ5N0M2l9oj4N8M9k6j8q1
$$ 222 44 78 171 125 185 180 296 361 276 56 142 135 87 120 177 132 147 136 41 165 180 26 44 47 62 112 154 115 109 95 153 202 176 158 77
190G7O1Jo7J13J5K7j02Nq2P8p6P5m1l6K0P3j1l4k3j8P3K8j50J06n6M4R7p7j3J11m7pL6j05
$$ 77 138 139 72 185 200 227 125 130 48 126 50 125 84 48 68 141 130 96 73 55 128 156 6 112 56 100 197 120 107 218 171 164 200 95
-129I5J0MLj02O5M5o0R2K7j7o3K5Q0j26J57L1j24j34K77qj32m9l6J08j2j9j08J72
$$ 95 105 109 112 10 75 120 60 152 179 162 99 124 204 78 235 266 142 8 285 277 145 96 60 168 156 137 29 201
-392B01
##PAGE=	F1=-13464.1
##FIRST=	19140.455529915001534,	4405.895418600002813,	0
##DATA TABLE=	(F2++(Y..Y)), PROFILE
4406A23o3J62j40K4P5O4j16j6O0oj61J64J05k59K51j42J1mJ13l0o6o1j7L5J4J4R7o0j48N8
$$ 123 60 222 82 106 181 245 129 113 173 167 6 170 275 16 267 125 136 132 245 215 149 88 71 106 120 134 231 171 23 81
4124H1K20l6j01P4q6o9J09k4L7q0rm4mK4M9j10qJ17Po5O0K33j15j37K00j10r0J36L6j87J1
$$ 81 301 265 164 238 152 83 192 168 205 125 116 72 68 92 141 31 23 140 147 82 142 375 260 123 323 213 123 259 295 108 119
3833A19P1j06J20j06J44k34J29r6J06L1n4J1n4L8K0J00M2l6q4p4M3J16q5P0R0r2j58kQK3N6
$$ 119 190 84 204 98 242 8 137 41 147 178 124 135 81 119 139 239 281 245 161 87 130 246 161 231 321 229 71 69 77 100 156
3542A56l6m5M1o9P1J48j8j83R1q3J10J04k1j17l4q9J45q4n0R1J9n6m1j6J02Q9j4k5Mo6j4K0
$$ 156 120 75 116 47 118 266 248 65 156 73 183 287 266 149 115 26 171 87 37 128 147 91 50 34 136 225 211 186 190 124 110 130
3242A30L4p5j9mk4L7K5Q6o2k3q7L9Q7K1lm2j9J50j84M4J36P5m5j98J6k6M2K0j7Q3j40Q5l8
$$ 130 164 89 70 66 42 79 104 190 128 105 18 57 144 165 162 120 101 251 67 111 247 322 277 79 95 69 111 131 114 197 57 142 104
2932A04N0m9j5J58K1j97J52j15P7j5o0N0k5N4J24j70L0l6O9j13k3J59j04L8J4m2K0M1j16p
$$ 104 154 105 90 248 269 72 224 109 186 171 111 161 136 190 314 144 174 138 207 94 71 230 126 164 178 136 156 197 81 74
2650G4M3j00Q7J66o1j56l3N5j4P5P6R7K3j33j07K4pl8J72o0k3J68j19o0p2k4J25O4j03m9M5
$$ 74 117 17 104 270 209 53 20 75 61 136 212 309 332 199 92 116 109 71 243 183 160 328 209 149 77 53 178 242 139 90 135
2359A35Q0q9q1j9J19l8j9J3oJ31n2r0K5%J46J9p2q2O3k6j16O8j7q3J58M1J7k7j25k1P4nP5
$$ 135 215 126 45 26 145 107 88 101 95 226 174 84 109 109 255 274 202 120 183 157 41 109 92 9 167 208 225 198 73 52 126 121 196
2049A96O6l6j11M2M7p8j7j1O6J56pj54m2o9N1N5o0N6rk9P7j03L2K0L5m7k2N6l4K8j14l4P9
$$ 196 262 226 115 157 204 126 109 98 164 320 313 159 117 48 99 154 94 150 141 112 189 86 118 138 173 126 104 160 126 154 40 6 85
1739H5J11o7l2k2K49j04k8r8J61j16j6m7k1O9Q3j69J66p6L9j33J33%j8K3j8K6r9J7O5kK8j35
$$ 85 196 129 97 75 324 220 192 94 255 139 123 76 55 124 207 38 204 128 167 34 167 167 149 172 154 180 81 98 163 161 189 54
1439E4J42k7M3qr8l2No3JL7J6M9j0o1P6n8J33J29j71Q5k3o5j16P8o5J9O0m1O3k8on7N0M5O0
$$ 54 196 169 212 204 106 74 79 16 17 54 70 119 109 48 124 66 199 328 157 242 219 154 38 116 51 70 130 89 152 124 118 61 111 156 216
1110B16q3q2J5k1K21K2j90M5N8j67J7J65m9k8Q8K18Jj77j57O4l7K3O0J0J20J87k02M25J339
$$ 216 133 51 66 45 266 288 98 143 201 34 51 216 167 139 227 445 446 269 112 176 139 162 222 232 352 539 337 762 2101
838B101O33j238q24k92j0k83K15j25l2Q3l1j00%R2J21k49J67n7M1q6L7j14K3J80J9j30n4j0
$$ 2101 2734 1496 672 380 370 87 302 177 145 228 197 97 97 189 310 61 228 171 212 126 163 49 72 252 271 141 87 77
575G7L4L4Kj24J14M1j64M4Q2j1J18l7J47J6r1k21P0k7j9N8K8n9K7K5j38J58P0k34P3n5L2R
$$ 77 111 145 147 23 137 178 14 58 140 129 247 210 357 373 282 61 131 104 85 143 171 112 139 164 26 184 254 20 93 38 70 79
274G9Rm0J7L1R4Qm3K8n5%K1l0J04k1J8j15jn1P7o0J10k1r2oP3J8q0k0k4J07L5r8J8j2J0Q2
$$ 79 88 48 65 96 190 198 155 183 128 128 149 119 223 202 220 105 104 53 130 70 180 159 67 61 134 152 72 52 28 135 170 72 90 78 88 170
-64A70m5m0J17p3qR4j15pJ6m4j5L9K7p5R6L5j4p0M1Q1j46K00K6j63r0K88J3j62m5k5N1pjj08
$$ 170 125 85 202 129 121 215 100 93 109 65 50 89 116 41 137 172 158 88 129 210 64 264 290 127 37 325 338 176 131 106 157 150 149 41
-383D1J57
$$ 41 198
-392A98
##PAGE=	F1=-13542.9
##FIRST=	19140.455529915001534,	4405.895418600002813,	0
##DATA TABLE=	(F2++(Y..Y)), PROFILE
4406A17p2J81j25PP4R2j75l4P6J7p3J00Q6k46J97j25L2%J65k9l1j82N9j6P0j6N2j3j15P4J97
$$ 117 45 226 101 108 182 274 99 65 141 158 85 185 271 25 222 97 129 129 294 265 234 52 111 95 165 149 201 188 73 147 344
4115C44o5j48Q6p7o7R9J2%r9K2qp2N5J14j67NJ17k9k6NJ93p6o0J40q2q4Q6P0j79j1Q1j19J14
$$ 344 279 131 217 140 73 172 184 184 85 107 99 27 82 196 29 34 151 122 96 101 294 218 158 298 216 132 218 288 109 98 179 60 174
3805A74q3J30k15J12p6P7MnRl4J9J9J16M4q2p3o1O6J09q0J13Q1j51j83%k0P0LRl4J8m9R9J33
$$ 174 91 221 6 118 42 119 123 118 127 93 112 131 247 291 209 136 75 141 250 170 283 364 213 30 30 10 80 83 92 58 76 27 126 259
3486B59j2j93J09o4R6J13J3j33p9j00J09k5p2O2L3k5l3k0P2J29m4j2j7o5L1K1ro5l2J2J9J5
$$ 259 247 54 163 99 195 308 321 188 109 9 118 93 21 83 116 91 58 38 110 239 195 183 166 101 132 153 144 79 47 59 78 93
3185I3j1J56r0J2r3%P7Pk2k6J5J82j90L6J41N8j06j53Q2m3j3Kn7R4n7N7l6L1p8N6J41k5j19
$$ 93 82 238 148 160 67 67 144 151 129 103 118 300 110 146 287 345 239 86 168 125 112 114 57 151 94 151 115 146 68 124 265 240 121
2875A21J18j47J07m0k5L9m5M0J22j20J7m6Q9r6p6J92r7Q1L5q0j6Nr3j7K8p2Q2J60r5j26oM7
$$ 121 239 92 199 159 134 173 128 168 290 170 187 141 230 134 58 250 153 234 269 189 173 178 85 68 96 24 106 266 171 45 39 86
2575H6l0J29K9R0L0j48j07O3m6K0J45o3q4J70r4o6r9P4J30K7j13l0K3N8n2p8j0J02k3k9l3
$$ 86 56 185 214 304 334 186 79 142 96 116 261 198 114 284 190 124 25 99 229 256 143 113 136 194 142 64 54 156 133 104 71
2284G1K5Q0n0j00O9QJ73k9r9p5Q1j7o9J06m0j23J47L9N3m3j04k4lK8K7P0L4r6l1R0l0l9rJ2
$$ 71 96 176 126 26 95 103 276 247 148 73 154 137 68 174 134 11 158 197 250 207 103 79 76 104 131 201 235 139 108 198 168 129 120 132
1964A32R4J6j42k3n9J18K8q7P6rj02J37q3K2L1K2j9q9P7n5L6j04M2K8Q4p0Lk2K41j07m5o3
$$ 132 226 242 100 77 18 136 164 77 153 144 42 179 96 118 149 171 152 63 140 85 121 17 59 87 171 101 104 82 323 216 171 108
1664A08J45j23Kn4k7L4J17j62R7m1Q5j28O7PLL5l2Mm7L3L5L6K2j44J43n6P2k7p3l9Ko4J0N6
$$ 108 253 130 132 78 51 85 202 40 137 96 181 53 120 127 130 165 133 137 90 123 158 194 216 72 215 159 231 204 131 92 94 30 40 96
1345I6k0ml2L6K8rJ07N7j46J23m1k7j39P7m5lP9n2N0l2j7Kj2J8R6o5q1L6l9J98j0j73O8K4
$$ 96 76 72 40 76 104 95 202 259 113 236 195 168 29 106 61 58 137 85 135 103 86 88 76 94 190 125 44 80 41 239 229 56 124 148
1025A48r3OJ10m3l0Q0K33mj37k12J12r9J02%m2J81J57k80L44J077M83r70o20k39L5k91K08
$$ 148 55 61 171 128 98 178 411 407 270 58 170 71 173 173 131 312 469 189 533 1610 2093 1123 503 264 299 8 216
772B16j32j0J56l4j00K3J12J02k81J60k0N3j47P9j33PK27J6j33q6J9K6RK3j09N5J6r5L4N8
$$ 216 84 74 230 196 96 119 231 333 52 212 192 245 98 177 44 51 278 294 161 75 94 120 129 152 43 98 114 19 53 111
490A11RJ57o1J70l4j03k03O3l9M3L2Kl7RN8j08J16J16k43O7p5J8j8k6J3L1L6J08l7k7O8l9
$$ 111 120 277 216 386 352 249 46 109 70 113 145 147 110 119 177 69 185 301 58 125 50 68 50 24 37 68 104 212 175 148 216 177
190A77n1K9J3Q4o1J4j20j2j6Q6n2J32rj33l1R1J6j19Mj7J01P9p3p9N0l2M3Lo7J21q1j5J45
$$ 177 126 155 168 252 191 205 85 73 57 143 91 223 214 81 50 141 157 38 42 25 126 205 132 53 103 71 114 117 50 171 90 75 220
-120B20j06l8L7q3Q4j0nn9R1K6k3o1N3O8j38K09K6j61n8K71K4j77k6j5qoJ7r8J35
$$ 220 114 76 113 30 114 104 99 40 131 157 134 73 126 194 56 265 291 130 72 343 367 190 164 149 141 135 152 54 189
-392A89
##PAGE=	F1=-13621.6
##FIRST=	19140.455529915001534,	4405.895418600002813,	0
##DATA TABLE=	(F2++(Y..Y)), PROFILE
4406A11o1J65j12j0O5J30j80q4J01L8J4J5O5k03J24j25Q0j6K03k0Lk01N5q6J28m7J4M1q6Q5
$$ 111 50 215 103 93 158 288 108 24 125 163 177 192 257 54 178 53 133 117 320 300 303 102 157 71 199 152 166 207 121 206
4124B06J65q7j91R6o5o0Q4M5l7j05O7M4q8K3J27k06L9Q8n5L2m5J44pl0O3m4p6M1R6j47rP0
$$ 206 371 284 93 189 124 64 148 193 156 51 118 162 74 97 224 18 57 145 90 122 77 221 214 184 247 203 127 168 264 117 108 178
3824A78j62J16m7R2j62P4l9M9k1K7PpJ4pJ21O4j09p2m6P0J18r0J56Q0k06j86N7mM6n8J4l1
$$ 178 16 132 85 177 15 89 50 99 78 105 112 105 119 112 233 297 188 116 70 140 258 168 324 404 198 12 69 65 111 53 67 36
3523C6K3K9N7R6j0j72J16n1R2R5N2j47j21n7J7L1k3k5M3Mj5k3P0J40r0Jm8o2P7K9k5n7k7L4
$$ 36 59 88 145 241 231 59 175 124 216 311 363 216 95 38 55 86 63 38 81 85 70 47 117 257 167 168 120 58 135 164 139 82 55 89
3204H9K8k2j9J94j19M6q4l9Q1k7l8j6N7K04j87J8J48L4j61n8Q8n8m8j9o4Q1J5K9k3j1n9Q8
$$ 89 117 95 76 270 151 197 113 74 155 128 90 74 131 335 148 166 314 348 187 129 217 159 111 92 28 109 124 153 130 119 60 148
2903A48J18o5l8O6j54J20l6j3K0m9M1R9p5J2n9J01o2j15J82n6J05N6j08n0k6p4l0K0m1O8J46
$$ 148 266 201 163 229 75 195 159 146 166 117 158 257 182 194 135 236 174 59 241 185 290 346 238 188 162 88 58 78 37 105 251
2612B51j26o9qM6j7J54j5O1L7j62p7J00q9P4J14n7j37J39n9n8j9P8J07oj19q%J8Pp3mQ4k4
$$ 251 125 56 48 94 77 231 216 277 314 152 75 175 86 160 274 217 80 219 160 102 83 161 268 262 143 135 135 153 160 87 83 167 143
2303A43nj06N9L3m8k2J0K3J87o5j23n5Q0j0%J24o4j44J37J7P7m5q9J2n8J6J4L8R1q0r0J47
$$ 143 138 32 91 124 76 54 64 87 274 209 86 31 111 101 101 225 161 17 154 171 248 203 114 126 68 84 98 136 227 147 57 204
2002B04K1o6l0l6K2M4j20j8pJ61qj08R5%j29J35o3PM1J1J4j09P8n9kk0M9j2N2o8K2j7K22q5
$$ 204 225 159 129 93 115 159 39 21 14 175 167 59 154 154 25 160 97 104 145 156 170 61 139 80 78 58 107 95 147 79 101 84 306 221
1683B21p9pJ08j39K1m7j0j5J39j14mk4J09r6K6RK2K5m6OJL6LN7K7j35J28o9Q9l8n8l4pm3p
$$ 221 142 135 243 104 125 78 68 53 192 78 74 50 159 63 89 98 120 145 99 105 106 142 145 202 229 94 222 153 242 204 146 112 105 62 55
1354E5O5l8m7L1N3l3M3J03k9j19J42o8J2j41O3j8k2Q3n5N3m7k4M5n7L5Q1o4p7O2n0J59l1j13
$$ 55 120 82 35 66 119 86 129 232 203 84 226 158 170 29 92 74 52 135 80 133 86 62 107 50 85 166 102 25 87 37 196 165 52
1044E2N3j5l%M9K2p9M3K28Oj05j95J35j52J38j6j29K35J75l32K11Q31M05p19m53k07P4j67
$$ 52 105 90 87 87 136 158 79 122 350 356 251 56 191 39 177 161 32 267 442 110 321 1152 1557 838 385 178 252 85
781H5L5n6l0J81l8m7L9R3Q1k94J46oO5j74J06j43j9K62J9j36j05N3%j3M9r5pRrJ5M1k0J77
$$ 85 120 64 34 215 177 130 169 262 343 49 195 189 254 80 186 43 24 286 305 169 64 117 117 104 153 58 51 60 51 66 107 87 264
471B64o7J74o0j30j43M2k4R1k3MJ7m3P4n7N6J39k28N4p2j3j2mO0OJ6R8q4K8P8l1q3K1O1O1
$$ 264 197 371 311 181 38 80 56 147 124 128 145 102 176 119 175 314 86 140 68 55 43 39 99 105 121 219 135 163 241 210 127 148 209 270
152B70r6J2j17l0K6J06n4J29nj61l9J19rj42M6jQ9R2o3j53J06o7j3N8r1J29m4k8J44q0p4N7
$$ 270 174 186 69 39 65 171 117 246 241 80 41 160 151 9 55 54 143 235 172 19 125 58 45 103 12 141 97 69 213 133 59 116
-148A16m1R6o2l8K5M1Km5l9N9M7j00J80K7j23n0K48K2j86Rko9pL6q6J15
$$ 116 75 171 109 71 96 137 139 94 55 114 161 61 241 268 145 95 343 365 179 188 186 117 110 146 60 175
-392A75
##PAGE=	F1=-13700.4
##FIRST=	19140.455529915001534,	4405.895418600002813,	0
##DATA TABLE=	(F2++(Y..Y)), PROFILE
4406I9m1J32j02k7O7J65j48q4P5M9P4p3M2j52Q3j43J25m4K21rK5j54J3j37J66p9j8Q2n0Q5
$$ 99 58 190 88 61 128 293 145 61 136 185 259 186 228 76 159 16 141 97 318 309 334 180 193 56 222 143 125 207 157 242
4124B42J31r4k22J03m9m6O2O4p1m2P6O9j11MJ01k02N5N5o7P7n4Q0P1m3j1Lo7KJ20j04K0K9
$$ 242 373 279 57 160 111 65 127 191 120 78 154 223 112 116 217 15 70 125 58 135 81 161 232 189 178 181 114 116 236 132 152 181
3824A81j44O2rK8r3L1j1M2l3L4KK1K4n4J16R4j02p5l3M3J40j07J90R1k50j47P0J5L3m6n8p
$$ 181 37 99 90 118 25 56 45 87 54 88 90 111 135 81 197 291 189 114 81 124 264 157 347 438 188 41 111 126 159 113 55 48
3523D8M7M8K9N0k0j27J18m0Q1N4R2j54j46j8n0N5L2m5QJ8qk4J03J19j42J1o7n9J07M5j0o3
$$ 48 95 143 172 222 202 75 193 153 234 288 380 226 80 62 12 67 99 54 62 80 72 48 151 270 128 139 72 13 120 165 155 92
3223I2k3N6K2n0JJ83j46P6o7o6J01n5o6k3J10K04j77mJ52Oj98L0P5o2o0n3nK1O7Qj2n5OP8
$$ 92 69 125 147 97 98 281 135 211 144 78 179 124 58 35 145 349 172 168 320 326 128 158 233 171 111 58 53 74 141 149 137 82 88 166
2903A66Q7r0K6J2j42J22j1k3%m5N8O6n0J8p3J08k5j26J30JR9Q5j18q2m2n8l8J4k5N6J25j47
$$ 166 253 163 189 201 59 181 170 147 147 102 160 226 176 194 121 229 204 78 208 209 308 393 275 193 151 93 55 69 44 100 225 78
2603G8Pk9K8JJ61l9K0M4j72rJ18j11R1P7l4j30N0k4l8O1O2P5k8j19J3j4l7P6p0mQ0m2L4j35
$$ 78 85 56 84 85 246 207 227 271 99 90 208 97 188 265 231 101 151 127 89 150 212 287 259 140 153 139 102 178 108 104 184 142 176 41
2284D1L4MlM0q5M0J82q8j25K1NnP1J16q0j28J04j0Q8l2q3O5n5n2M4k1J10o2j27J94N8p4o3
$$ 41 75 79 76 116 31 71 253 165 40 61 66 61 132 248 168 40 144 134 222 190 107 172 117 65 109 88 198 136 9 203 261 187 124
1974A24m0l4K3j8j9nJ64l6j21J16Rq5O5m6j1M7JL7o2P0m4o0RN7l6K6n4J4rJ92m1r9L4N4j59
$$ 124 84 50 73 55 36 31 195 159 38 154 163 78 143 97 86 133 134 171 109 179 135 75 84 141 105 131 77 91 82 274 233 134 168 222 63
1645F3L3k2J3o4J50o8n7k8Q7m8J6J0L3Ml0ML6J6k8O7M8j13J03p4R7m5m4k8k6ml7N8m1p0R1
$$ 63 96 74 87 23 173 105 48 20 107 59 75 85 118 122 92 96 132 148 120 187 235 122 225 151 248 203 159 131 105 101 64 122 81 11 102
1317A02M8q1R3J09r9p9J18r4M1j23M0J2m2Q1k9M2o9NM1p3P9L6n4p7O2o4J21l1Jj1o2Q1mK6
$$ 102 150 69 162 271 172 93 211 117 158 35 75 87 45 126 97 139 70 75 116 43 122 158 104 27 89 25 146 115 116 105 43 124 120 146
997A46P9j29k2J98L5r7j29J37j65J22J1j38J69K20k51qO42L99n28l55j74P5r2o3N1o0J15l7
$$ 146 225 96 74 272 307 210 81 218 53 175 186 48 217 437 186 178 820 1219 691 336 162 237 145 82 133 73 188 151
734A51OM9P3N5k83J35qN9j48R6j25l8K61K3j42r8P0l0l0P1p9l1M4kRM6j03J74m3J55m0j62
$$ 151 157 206 279 334 51 186 178 237 89 185 60 22 283 306 164 66 136 106 76 147 68 37 81 79 88 134 31 205 162 317 277 115
434A15l1l2K2R2p8N5N6r4N5lQJ30j94M4o0m3NK4P2njQ0j24R4O2k9r3JJ17K8j11Nj03n5O4J30
$$ 115 84 52 74 166 88 143 199 105 160 157 165 295 101 145 85 42 47 71 143 138 137 217 93 187 249 220 127 128 245 273 162 167 64 9 73 203
96B03o0J07j1j74k1J39l0j29O6J2Q5N0n0j54J10q0m1O8m5Q9J5m2R2m1j12O6J6Q3j10n2J18
$$ 203 143 250 239 65 44 183 153 24 90 102 187 237 187 33 143 63 22 90 45 134 149 107 199 158 46 112 128 211 101 49 167
-195A67j6k4q1j3O4K1m4J31K5p2n5K30J2k01N1J5j11k2N5p8R9
$$ 167 151 127 46 33 97 118 74 205 230 158 103 333 345 144 195 210 99 77 132 54 153
-392A53
##PAGE=	F1=-13779.2
##FIRST=	19140.455529915001534,	4405.895418600002813,	0
##DATA TABLE=	(F2++(Y..Y)), PROFILE
4406G8j5R6r8l2R9J64j08p7N2O1R9j50K3j07R6j11P8o9K11PK9p6l6j50J69j12m4J07j1P0J04
$$ 78 63 159 61 29 128 292 184 107 159 220 319 169 192 85 181 70 148 79 290 297 326 250 214 64 233 121 77 184 173 243 347
4115C47p9k32R7k4l2M1N8j00N7O7O7j46RM7j45L4L1p0R5k5MJ36o9o7N0m1l4J48p3N4k4r8J8
$$ 347 268 36 133 109 77 118 176 76 133 200 267 121 130 177 32 66 97 27 122 97 101 237 168 101 151 110 76 224 151 205 181 83 101
3805A01Rn8j8loN2l1K5j3M9M8j06R8J22p0p0k3rJ67j22K07J07k74j21O8L6K9k0j16K8N6L2
$$ 101 110 52 34 31 25 77 46 71 58 107 155 49 147 269 199 129 106 97 264 142 349 456 182 61 129 165 194 174 58 86 142 174
3504A74J7J6l9o7J13k8N8nJ26j46j48Qj9k2Q2j7k5Mk3k5J53Q3j87J4ll1L9N7J9p5k5P0J8n1
$$ 174 191 207 168 101 214 186 244 239 365 219 71 79 60 38 120 103 78 82 59 34 187 270 83 97 94 63 102 159 178 103 78 148 166 115
3185A15J4J44j68R5m2p4J17m9r9l8J51J75j60k7J49k5k08R3N5n4m9j05O6rQ7j0j3q9P7O1M9
$$ 115 129 273 105 200 158 84 201 152 53 15 166 341 181 154 303 278 70 163 218 164 115 10 76 67 154 144 131 42 119 180 229
2894B29q6N5l5j15J12J9l8j3m5Q1L9n0L8r1J14J0j21N2N8O5J23j03j08m0m7m6J0k8N2J00j41
$$ 229 143 198 163 48 160 179 141 128 83 164 203 153 191 100 214 224 103 155 213 278 401 298 190 150 103 57 67 39 91 191 50
2603E0O8m4j1OJ55l9k4N5j76P8J17j12P0L4Mr2m0lj5J09N1M3l8j14L2j5q5J28o8pR2o4O0j23
$$ 50 118 74 63 69 224 185 161 216 40 118 235 123 193 227 231 139 99 96 81 190 241 284 246 132 164 149 64 192 124 117 209 145 205 82
2284H2l6LQ3L4j18J7J49r3o8N4p3K5J00Q4q6q9N9l3Q5mq6J15l9j14P3n2Q0m3q0J57P8n7j00
$$ 82 46 49 132 166 48 65 214 121 53 107 34 59 159 243 157 68 127 94 179 175 89 204 165 51 124 72 152 109 29 186 264 207 107
1974A07K4J1j20Q3k3k7J36n2j23J35K3o4L2m3j3L5j1M9LP8m7q0k5P0m5Qm1kOJ50J0q7L9qj54
$$ 107 131 142 22 105 82 55 191 139 16 151 174 110 142 99 86 121 110 159 162 240 193 113 88 158 113 121 80 78 84 234 244 157 196 188 34
1645C4J7J8K7o8J15k7m9Nk3QPK5L1oJ3j2M8k9n2P6Q3p9O4p4R6m8k4k0o1M0o6M2l2o6R4N5j09
$$ 34 51 69 96 28 143 116 67 72 49 57 64 89 120 114 127 115 163 134 82 158 241 162 226 152 248 200 176 156 95 135 69 111 79 13 107 162 53
1298E3J39J16j46m5O8j06N8r8K4L6n3O7J7J5r0N1J2o9J04J7j9q6K5p0Q5qR4n7o9R6j4K9J00
$$ 53 192 308 162 117 185 79 137 39 63 99 46 113 130 145 55 106 118 49 153 170 151 65 90 20 105 97 191 134 65 161 147 176 276
988B76j60n4J24Q0j10o2J36j69J09M1j13O6K53j46j29N03L90m09l10j34N1n7l1N1p8L7j8K2
$$ 276 116 62 186 266 156 94 230 61 170 211 98 164 417 271 142 645 1035 626 316 182 233 176 145 196 118 155 137 159
725A59N7O9K5k57J23nK8q7O3q8j7K01K7j52o7O7n3m6R0o3oO4l2J3N8j27P9RJ12L0j35J3j12
$$ 159 216 285 310 53 176 171 199 112 175 87 70 271 298 146 79 146 93 47 137 74 68 132 100 113 171 44 123 132 244 274 139 152 40
415D0N2O5q8J13O4j26J1M2j8R5j48M1m8n6KL9P8jj9P2j26J18L5k2p5k0J58j9r7j0q3n5O1J49
$$ 40 92 157 69 182 246 120 131 173 155 250 102 143 95 39 41 80 158 157 138 210 84 202 237 215 140 120 278 259 162 152 69 14 75 224
96B24o4P9k2j75K0J45k8j45J00J7P3k1k7j17R4q3JJ4KO2N5o0M2Kj35M6O6O2j44k9J74n8m2
$$ 224 160 239 217 42 62 207 179 34 134 151 224 203 176 59 153 70 71 85 87 149 204 144 186 188 53 99 165 227 83 54 228 170 128
-214A28j21NO8mQQ8J6k6o0K18Pk34Q8L3j12n2O6p9Q4
$$ 128 7 12 80 76 84 172 188 162 102 320 327 93 181 214 102 50 116 37 121
-392A21
##PAGE=	F1=-13857.9
##FIRST=	19140.455529915001534,	4405.895418600002813,	0
##DATA TABLE=	(F2++(Y..Y)), PROFILE
4406E0J4O5r3J9J13J14o9p6L7Q2R2k04K4q5J42r3J8q0J75L2J2J0p5j51J57j38o3J13K3M1Q8
$$ 50 64 129 36 55 168 282 213 137 174 256 348 144 168 83 225 132 150 70 245 277 289 299 224 73 230 92 29 142 165 206 294
4115B94l6k10O0Mk1L0K6j00J33N6N0j81L7l1o1kJ8l9N8K4p2J77q7r5Q4Jn4J72n9P1p2o2J6
$$ 294 258 48 108 112 91 121 147 47 180 236 286 105 142 111 50 48 66 27 85 109 37 214 127 32 116 117 63 235 176 247 175 113 129
3805A29Qj14J6rk0O6k3%l4P2Q9j38N3J33k7m9j6o2J79j31K06J21k74j04M6N8L0J0j44M9N7
$$ 129 137 23 39 30 10 76 53 53 19 91 180 42 95 228 201 152 136 74 253 122 328 449 175 71 117 175 205 215 71 120 177
3514A77mJ8Jn6lJ03j9K6p2J51j24j30K0Mq0J13J4l2j8l7m3J96M8j99kJ16m9j1M5L8q1k3O6
$$ 177 173 191 192 136 133 236 217 243 171 322 198 68 88 92 12 125 139 107 89 52 9 205 253 54 52 168 119 108 153 191 110 87 153
3204A53K1k1LJ00j76R0j2o3J16k5j16j3J36J19j36m6J31n1j84J21L3m1lq4L6J9O6l2l0r3J21
$$ 153 174 153 156 256 80 170 158 95 211 186 70 57 193 312 176 130 261 210 26 147 180 139 136 52 88 107 173 141 111 18 139
2913A39N4Pn0M1o4p8Q6M0m2j6n9J02K5o8O6j07J25L3j11l0R9J4J63o0j27k0m2p1J2m1N8P0
$$ 139 193 200 150 191 127 49 135 175 133 117 58 160 185 117 183 76 201 234 123 93 192 206 369 309 182 162 120 49 61 20 78 148
2612A48q2Q2m6l9k4J35j5o6P3j00Q2J02j08L3j3N3n4q3qLJ23M7K0l6j03M2oq0J18o8nJ11p8
$$ 148 66 148 102 63 39 174 159 93 166 66 148 250 142 175 162 215 161 78 70 73 196 243 263 227 124 166 160 80 198 130 125 236 158
2303A58N7j07r6L1J46Qj17j8J00q3oO5j12P1Q2L6p5m7J0l7O2L2p8J36k5j51Q1n5L3l1j8R7
$$ 158 215 108 12 43 189 197 80 62 162 79 73 138 26 97 179 215 140 93 103 66 128 160 82 218 193 42 123 68 101 70 52 149
2002A49Q3j9j32J12M1j52O0l3k4P9m2j07J27M8o7L6n9J3Jk1N6O0Q7o6q4p7R0m8ql1oL2R9M4
$$ 149 232 213 81 193 234 82 142 109 85 164 122 15 142 190 123 159 100 113 114 93 149 209 296 230 146 69 159 111 103 72 66 98 197 241
1683B41n3K1o3p9k7K3L3k9M1Ol1M6n3lk8O1J3J5L3k0M4r3n9R6J15m0J4p3Q4m5Nqj04P1q8L9
$$ 241 188 209 146 67 40 63 96 67 108 114 83 129 76 73 45 106 119 134 167 147 191 98 39 135 250 210 224 151 235 190 195 187 83 154 66 105
1345A05k0n0N8N9j05J71J16j79k7J8r6O1o3K0L6l3L6M6lj03Q8j6p0J11L5J6j07j1n4N4RJ53
$$ 105 85 35 93 152 47 218 334 155 128 146 50 111 48 68 104 71 107 153 150 47 135 119 49 160 195 211 104 93 39 93 102 255
1044B55q0n5O9l0K7J05j69l7J6J30j13k5J31j65J05N9j08mK50n0j57M08L20l25k73r5K5l7
$$ 255 175 120 189 159 186 291 122 85 101 231 118 93 224 59 164 223 115 111 361 311 154 562 882 557 284 189 214 177
781A77L1L1q2l2K2j3O8Q7kk34J02J2j6k3K9m4OJ28L0j59k7N4o4o3J03m6J9P3n2K1O3q7j4L3
$$ 177 208 239 157 125 147 134 202 289 287 53 155 167 151 128 157 113 119 247 277 118 91 145 81 18 121 75 94 167 115 136 199 112 98 131
462A31N9J08p2mj71M4K4j7J13N6j41l7O7l0N7r7M4l7n7j4M3P2J6l9Q0q6R1J0%l8k7J57p8n8
$$ 131 190 298 226 222 51 95 119 102 215 271 130 93 160 130 187 90 134 97 40 26 69 141 157 118 198 112 203 213 213 175 148 305 227 169
143A69l3o3m3L8J56o3N1k4j57O1J37mj97J47RN4q9jo8P1q7K7kK7M6P9p9K1L5j29pJ01L8j58
$$ 169 136 73 30 68 224 161 212 188 31 92 229 225 28 175 184 238 149 148 80 151 64 91 89 116 162 241 162 183 218 89 82 183 221 63
-176F3RJ91p5m6j14j1M9j9M2O4MKo4K09K2k60Q1M8p4p3N6q7O2
$$ 63 72 263 188 142 28 17 66 47 89 153 157 159 95 304 326 66 147 195 121 48 104 17 79
-392G9
##PAGE=	F1=-13936.7
##FIRST=	19140.455529915001534,	4405.895418600002813,	0
##DATA TABLE=	(F2++(Y..Y)), PROFILE
4406B2M2M7p1O0J10M9l2q3K5J13O3k28N5r1J84p7l9p8J12P0j4Q6q6j75J47j52l3P2M0PQ3K5
$$ 22 64 111 40 100 210 259 227 144 169 282 345 117 172 81 265 188 149 71 183 253 239 325 239 64 211 59 26 98 138 145 228 253
4105B53j75JL2pK6k0k8J25M5K8j86O3j12J8l1J4J4j7O5p0J31q8l1K3M3m7J84n5O9j07m0L5
$$ 253 78 79 111 104 130 110 82 207 252 280 94 157 45 63 32 46 60 43 108 38 169 81 50 73 116 69 253 198 267 160 120 155
3805A55Pr5l0MjN4j3m5nL9J40j45nJ11J3j2j1q2J55j33J86J26k54q2NP4L3M3j43M9N2m9K4
$$ 155 162 67 37 41 40 94 81 36 31 70 210 65 60 171 184 172 161 79 234 101 287 413 159 77 82 156 189 232 89 138 190 141 165
3495A65Nn9N3R3k0jj33J57q9j06K1K0o5P6L5k1l4pm7J56K3j57l0K06p8k2J3L0o9j7M3L7J9
$$ 165 170 111 164 257 237 236 103 260 171 65 86 106 41 117 152 131 97 90 43 199 222 65 35 241 163 141 154 184 115 98 141 178 197
3185A97k1O8j59M5J9m0R6jj18OJ22N3j07n6R6o6r7Q4Rk7P8o1k6O9L8o2n5m9J10N7l4L%p2m1
$$ 197 176 244 85 130 149 109 205 204 86 92 214 267 160 104 200 134 37 121 130 103 181 120 94 163 201 139 84 35 145 202 168 171 171 99 58
2857E8M9M6k6or3J14K4r3R5j15J40M3j08r5J14l7J98Lj39J3m3j05J0l8N4L9kO9l1k8n9O9J7
$$ 58 107 153 127 121 28 142 166 73 168 53 193 236 128 33 147 110 308 311 172 185 142 37 47 9 63 102 100 169 138 110 51 120 137
2547A37q8R7pL8P3j06jo0J02k6q2k7K3R5N3Qk5q9M4Mm4P4o6MJ24q1K8r2q5J7J81j5j14l5M1
$$ 137 49 146 139 177 250 144 143 83 185 159 77 50 73 168 221 229 204 115 159 163 119 193 127 131 255 174 202 110 25 42 223 208 94 59 100
2218A00n7L0P7j07Q8N7j4m3k3k7rPO0l6J11j3j62O8n1J0l6L0L9P2K9j52K01M7j63L2m7KRn
$$ 100 43 73 150 43 131 188 174 131 108 81 72 79 139 103 214 201 39 107 56 66 30 60 99 171 200 48 249 296 133 165 118 120 129 124
1899A24q5Q9Q2q5N5q3M6l6qO1Q9P9r2p8j25J15n1k2k6J1N6O0M1j6%r3Jj5l5L3J1k2K9k5R3
$$ 124 39 128 210 125 180 97 143 107 99 160 249 328 236 158 33 148 97 75 49 60 116 176 217 201 201 108 109 94 59 92 103 81 110 85 178
1570A78l4n0p2J09j7N4K2j2K5j59KQ5J24jm1o7N9l5L8J5j40P2j03O6j4m1L3K3o0J77J07k02
$$ 178 144 94 22 131 114 168 190 178 203 44 46 131 255 254 213 146 205 170 208 223 83 155 52 118 104 63 96 119 59 236 343 141
1270A41k4k1k9J7kJ3NJ5LL4Pr7R2k7r3J07P7L5j21l3l8M4LJ91q7m0K9n0J4J07j58rq4J76p4
$$ 141 117 96 67 84 82 95 100 115 118 152 159 62 154 127 34 141 218 253 132 99 61 105 108 299 212 172 201 151 165 272 114 105 21 197 123
941A23l5J24j47R1P1j20m3K07L0j47L42K00k47k18o2Pk1Q5J6o4q7O0o6P7J22j5k27O3M1n7
$$ 123 88 212 65 156 227 107 64 271 301 154 496 696 449 231 169 176 155 240 256 192 105 165 99 176 298 283 56 119 160 103
659A03K7JKK5M8L0j52J5M1p0o1R2k6L4P2o0L0O0n2J1j1M0J27k3j9k16K1k5Q4P8M3j39q0O8
$$ 103 130 131 133 158 206 236 84 99 140 70 9 101 75 109 181 121 151 211 159 170 159 199 326 303 284 68 89 64 148 226 269 130 50 118
340A18l5L0m1M0k2o1OJ9M8M1n8R7m1M9OL7j1k6J20j39pn6m5k9J1J50n9L0j0j17Q0J23K3k43
$$ 118 83 113 72 112 90 29 35 54 102 143 85 182 141 190 196 233 222 196 316 177 170 114 69 40 51 201 142 172 162 45 125 248 271 28
21B8J73pM0j15Nk9M1j00M5J5L0K9R7r3K9N1j10o1J17J7j54L2J78n8l9j21NJ3j8N1N3oJ6o7
$$ 28 201 194 234 119 124 95 136 36 81 96 126 155 252 159 188 239 129 68 185 202 48 80 258 200 161 40 45 58 40 91 144 138 154 87
-299H7J95N9k37nN7k0p4L4q1K2
$$ 87 282 341 104 99 156 136 62 96 15 37
-392C7
##PAGE=	F1=-14015.4
##FIRST=	19140.455529915001534,	4405.895418600002813,	0
##DATA TABLE=	(F2++(Y..Y)), PROFILE
4406IN2M7n2P9R4j2Or0RJ47K6k23J08j12J97n3q2p2L1J15l1J36o1k37J43j42L3NL9LO1P7j36
$$ 9 61 108 56 135 229 217 223 133 142 289 315 92 200 88 285 232 150 78 109 224 193 329 268 31 174 32 65 70 109 112 173 250 114
4096A14o4N1J0K4o3O8P0L5Qj26M7j02Jk6PL5k9L5jK9n8L0o4P0k7J85m9N1j28k8O5J2q9o4K0
$$ 114 50 101 111 135 72 140 210 245 253 127 174 72 73 47 54 89 60 95 94 123 65 95 31 101 74 259 210 261 133 105 170 182 93 29 49
3767D9J6N9pr9O3j8J82j55k8M3M1M0qq0J22j25J37J17k15m8l3O6L1P4j16L4L8q9L0J8l9R1
$$ 49 65 124 117 18 81 63 245 90 62 105 146 186 178 98 220 95 232 349 134 86 53 119 150 224 108 142 180 91 121 139 100 191
3467A91Q3l3j4j52J18m9q3J2L1k8K4M6jl7M6o2P7J4r3k8K35j03k0oj5m0pPP0N0l7M9j34k1
$$ 191 274 241 227 75 193 144 61 73 104 76 100 146 145 108 154 92 169 183 90 62 297 194 174 168 153 113 106 113 183 233 196 245 111 90
3148I0M7j4N9J3j00J3J14rp5n4M5n2j6L7j9KJ58n6p8J08J7r2p9j1Q6O9o9N5m6n2k1J3L4NJ0
$$ 90 137 123 182 195 95 108 222 213 138 84 129 77 61 98 79 81 239 183 105 213 230 138 59 48 134 203 134 189 143 91 70 83 117 122 132
2819A32j12R3K8j07J11j15J62L7j15p7N3m7J88P2j45N5m5r2k5j0J5NP4M3nKp3oL2o0R6M4p
$$ 132 20 113 141 34 145 30 192 229 114 37 90 43 231 303 158 213 168 76 51 41 56 61 135 178 173 175 102 96 128 68 164 208 201
2509B01L7j11rr7J26j3n8m2N2L0O3J4j1p7L9J1pK6n6K1J17p6j3p9l7j9J92k2j14pm7j4L5R7
$$ 201 238 127 118 21 147 134 76 34 86 116 179 193 182 105 144 155 148 174 118 139 256 180 167 88 51 32 224 202 88 81 34 20 55 152
2190A52p1O7L6n3J2l2m4K9n6P0K7O9rj58N5n4L5n3M0J4J9P2j51K72L6j60J2o2M2l6K8q5N2
$$ 152 81 148 184 131 143 111 67 96 40 110 137 206 197 39 94 40 75 22 62 76 95 167 16 288 324 164 176 114 156 120 148 63 115
1880A15J09j00O5r8O8o2K6O0R4M9j14o2j36J14n0l1k6M1O6M0MJ3j4q8N2J0q7L3L1m2L0l2J36
$$ 115 224 124 189 91 159 97 123 183 277 326 212 150 14 128 78 47 21 62 128 168 172 185 171 83 135 145 58 91 122 80 110 78 214
1570B14j4r5p3J23n1R5oLnj54O0M2J05L4q8n8K5j5O8M9j65M9j11J10j2l9N2p2QJ61Q7k05k6
$$ 214 200 105 32 155 104 199 193 196 191 37 97 139 244 278 190 132 157 142 210 259 94 143 32 142 130 91 143 71 79 240 327 122 96
1260I6n0Q5n8O7jn4P8k2j8N2q2P1k5j33R7J26L4j16l2m0M7j3K12q7k3j4o6KJ03j37J4o4J14
$$ 96 46 131 73 140 139 85 163 141 123 175 93 164 139 6 103 229 263 147 115 75 122 109 321 234 211 197 131 133 236 99 113 49 163
950A63j1o0J31j35N9Q3j31o7J28Q6j05K91P0j83j53l7JrJ15J1k3j30P7q3P0J46nk29J9N8q1
$$ 163 152 92 223 88 147 230 99 32 160 246 141 432 502 319 166 129 130 121 236 247 224 94 171 88 158 304 299 70 89 147 66
659F6O5k9M2L6l3K7j31N9L6p7k4M4oM1N7n5L6M9k9O6n0P1Q8%k0k48J2l9J27L1L2j19j11M3
$$ 66 131 102 144 180 147 174 43 102 138 61 37 81 75 116 173 118 154 203 174 240 190 261 349 349 329 81 93 54 181 212 244 125 14 57
340E7Rl1L2J9kq0O2oJ7N0n7R9j5K3K4P1ql2P1j87M1p4l0ok0J34m8OJ6p7R4J06M6k50J52k3
$$ 57 66 35 67 86 84 4 66 60 77 127 70 169 154 177 201 272 264 232 303 116 157 83 53 47 27 161 113 119 135 58 152 258 304 54 206 183
2A83M9q6j7k7J3j07M4M9J7QJ07r1M8N4r0r5J19Lj37K4J43j6k1j33L9k5qN0L7j3L3p3J67J05
$$ 183 232 146 129 102 115 8 52 101 118 126 233 142 190 244 154 59 178 181 44 68 211 195 174 41 80 55 47 97 134 121 154 81 248 353
-317C53j99j02N6K9o8K5p0k
$$ 353 154 52 108 137 69 94 24 22
-392B2
##PAGE=	F1=-14094.2
##FIRST=	19140.455529915001534,	4405.895418600002813,	0
##DATA TABLE=	(F2++(Y..Y)), PROFILE
4406A5M3N0n0R1O9n9M4q9j6J75qj92J64j31J74k0j04p2n7J66l2J52j0k81J06j05P4l2M8N2
$$ 15 58 108 58 149 218 159 203 114 98 273 265 73 237 106 280 260 156 84 27 193 161 313 303 22 128 23 97 65 113 165
4124A65rQ5r2q9K3K8K2p9J36OK4nl3Pn5n2j1PK2Lk8N2l1j3L6p2L8j6J75m0K6j32k3R6K2j03
$$ 165 156 241 149 60 83 111 133 54 190 196 220 215 182 189 134 82 71 78 100 103 75 127 96 83 119 47 85 69 244 204 230 98 75 171 193 90
3786I0o1K3K3P2%j42J24m0J91j74l0k3M8R0lq0J16j03M8R6j65Jk3J0PJ02p3K1Mq5J2K6MJ06
$$ 90 29 52 75 147 147 5 129 89 280 106 76 53 101 191 188 108 224 121 169 265 100 101 78 88 95 197 124 145 149 64 76 102 106 212
3467B12P3n6oj28M0oo7j1M0J3k6N5J9k5R4q2j0J9l9k3K41j13k2Kr3LNl3J13O7l4L7j28p3P1
$$ 212 285 229 223 95 135 129 62 51 91 104 78 133 152 127 221 139 129 148 109 86 327 214 192 194 101 104 109 76 189 256 222 259 131 58 129
3138A29LJ7J1o4PJ10n0m5m2oJ3pJ4n4O9J88n9j13J25Lj12q7pO2Q5r0R6q3ok2j7PM0K4q7K5
$$ 129 132 149 160 96 103 213 163 118 76 70 83 76 90 36 105 293 234 121 246 249 137 50 43 105 190 100 196 113 107 85 68 75 115 139 52 77
2800G7L4p3Q2j07J76K0j28kj9M5N2J29j46R7m4m0n3l0lj9J15J1K6L7q9m1K3l2J00O6m4lj07
$$ 77 111 38 120 13 189 209 81 79 60 105 157 286 140 237 193 153 100 70 67 48 163 174 200 237 148 107 130 98 198 264 220 217 110
2490A10Mm7M3j3k3m7P4l4N9L4Np3L3J6J7j3m2M4R2o8n4o8J3n4J80Jj02N1j08qJ7J14k7K0J8
$$ 110 114 67 110 97 74 27 101 67 126 160 165 92 125 141 158 145 103 147 239 171 117 49 62 8 188 189 87 138 30 22 39 153 126 146 164
2162A64o0O3o2l9N4r3N2Q5M8k1j50N6n8O3n8K8M9o9O4q0K69J4j46Oo9P8m0K5r2K9J15j03N5
$$ 164 104 167 105 66 120 27 79 164 212 191 41 97 39 102 44 72 121 52 116 36 305 319 173 179 110 188 148 173 81 110 225 122 177
1852A77r6P1p0O2N6Q7Kj24k9q1N1k7k2l9M7O0L6m3K3j6n2O7M0j15K7K6k2K2m8J64%j36l3J04
$$ 177 81 152 82 144 200 287 289 165 136 55 106 79 57 18 65 125 161 118 141 125 73 140 180 65 92 118 96 118 70 234 234 98 65 169
1533A69q1J28l5J9m6n8M6%O8O4j20m6j0K0R0Q1j83K2j07J41ql7Q9j63N3J29N4j63k1m3J58
$$ 169 88 216 181 200 154 96 142 142 210 274 154 108 98 118 208 289 106 128 21 162 154 117 206 43 96 225 279 116 95 52 210
1241B10j15J11j1j34J43l9r1J16o9N0k3j05J2J64J8q7qo4N3k0K15q5on5o9K2P3j19K7j0K8
$$ 210 95 206 195 61 204 165 74 190 121 171 148 43 55 219 237 150 142 78 131 111 326 241 235 180 111 133 206 87 114 104 132
950A32M1o8J59j47J7R6j17q0M0R1k9K69oj74j22j4Rj1J17J5L2j55O2m2M4J35J9k25K0L3r3
$$ 132 173 105 264 117 134 230 113 33 73 164 135 404 398 224 102 88 97 86 203 218 250 95 157 115 159 294 313 88 108 141 48
659D8J04o3N7L7j04J4o5P6L8q9RKJ5M6K8m5L5L8k0J16p1J26L9j2qk67L0LP7j5K3q3q2K7Q5
$$ 48 152 89 146 183 79 93 28 104 142 53 62 64 79 125 153 108 143 181 161 277 206 332 371 359 351 84 114 117 194 179 202 119 37 64 149
331A49p9L1j2J3o5N6rJ9J6j7O4j7K9M5Q4k0m5K0k07P3p7k4K9n0J11k2m0M2m1J07Q9O2k30J07
$$ 149 70 101 89 102 37 93 84 103 119 102 166 149 178 223 307 287 242 262 55 128 51 27 56 6 117 95 55 97 56 163 252 314 84 191
11A91k8P9n9l0n3jm1k5O3kj4J11o9N6M9p4j02J16nj11j2R0M0Mj25P0o4MN1J2k7O2q0J21J46
$$ 191 163 242 183 153 100 99 58 33 96 94 80 191 122 178 227 153 51 167 162 51 39 129 169 173 48 118 54 58 109 121 94 156 76 197 343
-317C43j57j43K2N9o5L5o7Q
$$ 343 186 43 65 124 59 94 27 35
-392C5
##PAGE=	F1=-14172.9
##FIRST=	19140.455529915001534,	4405.895418600002813,	0
##DATA TABLE=	(F2++(Y..Y)), PROFILE
4406B6L1M1n9J02M3q6P6o7o1J89k5j36J91j42J29J7j05p8l1J11l1J46M0k38J9o4Q4o2Q9R4
$$ 26 57 98 39 141 184 98 174 107 46 235 210 74 265 123 252 269 164 86 55 166 135 281 321 83 102 38 122 60 149 243
4124B43p3M8m4p0l7L7K1o0J55m8J4qN1l3k1q6kJ1rM0p6Q0m7J3J9j9Mm2J51l3Mj26j9J25L3
$$ 243 170 218 174 104 67 104 125 65 220 172 186 178 229 196 175 89 87 98 89 129 53 133 86 99 118 99 103 61 212 179 183 57 38 163 196
3796A96j34qoJ7Q5J1j45J49l2J78j96l5j2QJ10Pr2J42p6n8O7j11M8Mk4m7J15l0L4n7j0l7R
$$ 196 62 54 48 65 150 161 16 165 133 311 115 80 68 76 186 193 101 243 167 109 176 65 113 117 93 46 161 131 165 108 98 61 70
3486G0N4J06O0q5J9j11j5M0o8m7N1M5o4P7J9%J24j00p3L2j3k0K31j03l9L6j91N2K8q3J57P4
$$ 70 124 230 290 205 224 113 98 138 70 23 74 119 55 132 151 151 275 175 102 134 121 101 332 229 190 226 35 87 115 32 189 263
3185B63j1K2j40j00R5Nj8j0j7pJ08n7k5k0j2M4l7K0q2J27J82o5j27J17oj07q1m3M2J00r6J26
$$ 263 252 274 134 34 129 134 116 106 89 82 190 133 108 88 76 120 83 103 21 148 330 265 138 255 249 142 61 18 60 160 64 190
2885A90j03M9k9m0k8O1L5n5m0M0j4L7p9J54lj43Q0j5O8n4J51j44J26l0K5p4p4lj7J10k6N7
$$ 190 87 136 107 67 39 100 135 80 40 80 66 103 24 178 175 32 112 97 165 111 262 118 244 214 239 165 91 88 71 181 155 212
2584B12P3j06o5K4k7J17P5p5m0o9Mj5k4j9J1l9O8m2RO4J8p9L7J4J9l6k9P1N7n9p6o5M7k7R3
$$ 212 285 179 114 138 111 228 303 228 188 119 123 108 84 65 76 37 105 63 72 136 154 75 112 126 145 109 80 151 208 149 73 8 55 28 121
2256A21N9n6Q5j23n1J5J01J0l2jk3Q2r4j9O0r2K4J10O1n1j44P1o3O9o3L8Q8q1m4K1K25j3j26
$$ 121 180 124 209 86 35 50 151 161 129 128 105 187 93 74 134 42 66 176 237 186 42 113 50 119 56 94 182 101 57 78 303 290 164
1946A64Ro3R9k5jr3K6R5j01L5p6N8o5Q5N1P6m8j17K2m2nK8k3o5L4M9L9p3J1j0j1O5P3j19N
$$ 164 173 110 209 184 183 90 116 211 110 145 69 127 62 147 198 274 226 109 131 89 84 112 89 24 58 107 146 73 84 74 63 128 201 82 87
1617H7PJ8J7o1J70Oj69K1P1r7J44n1L5p9J9L2m3K3Q7j27l7k8P7R4R3j99J1q5J34jl2J25j73
$$ 87 94 112 129 68 238 244 75 96 167 70 214 163 198 119 138 170 127 150 237 110 73 45 122 216 309 110 121 36 170 169 137 262 89
1307H9J0Q8J3m6k4k7J81j48J28j3k18J95n1j36J55n6L5l2n1n5J50ml5L0j05N5j1K05q5Pq7
$$ 89 99 187 200 154 130 103 284 136 264 251 33 228 177 41 196 140 175 143 92 37 187 183 148 178 73 128 117 322 237 244 157
1016A57n4O7K6j16L8K6l4O8o3J97j71k3J02q2r2O2j4N0K89K2k29j78K5K6m0R4K4Q9j59K4J3
$$ 157 103 170 196 80 118 144 110 178 115 312 141 118 220 138 46 108 94 144 433 455 226 48 73 99 59 153 177 266 107 131 144
725A44K6R1M3k05O0pj07J49q8L4L0j42OM8K8L3r4L3k6L2N4qm2K4L9qJ38q5J83Pn4J2k73O1
$$ 144 170 261 304 99 159 152 45 194 106 140 170 28 34 82 110 143 49 82 56 88 142 134 92 116 155 147 285 200 383 390 336 348 75 136
406A36M2J5n6J5m6l4P2J11r7Mk1J1p1K7jL3k0K2L3m1O3M5P8l7o1k0j64M6o0oN2n0O4K1q7K4
$$ 136 178 193 137 152 106 72 144 255 158 162 141 152 81 108 107 140 120 142 175 134 197 242 320 283 222 202 38 84 24 18 70 20 84 105 18 42
68D2jJ08P8P3j94N4qJ03n9k2q2P%l9J7j3l2J02k3M0L8o3p9J08rp6o6L6P9L7r4Q7r5J8M9rn6
$$ 42 41 149 227 300 106 160 152 255 196 174 92 99 99 60 77 64 32 134 111 151 189 126 47 155 146 70 4 40 119 156 62 149 54 72 121 112 56
-280E6R9p8N4J72j11j20k1M9o6O1o0J
$$ 56 155 77 131 303 192 72 51 100 34 95 35 36
-392C6
##PAGE=	F1=-14251.7
##FIRST=	19140.455529915001534,	4405.895418600002813,	0
##DATA TABLE=	(F2++(Y..Y)), PROFILE
4406D5J6J2o0J00L6q0P5k3j12J80j2q1J80j47P7N4r2q5L3L3m2J29P0j67j2o7P3r2J43J14j12
$$ 45 61 73 13 113 149 69 144 121 9 189 177 96 276 129 206 260 168 83 116 149 107 236 306 139 127 60 133 41 184 298 186
4115A86mkl3p6K5K0l8J47q2QKJ05o3nr9NJ2n1P7r7P8m0K9rN2kq6J15l3oj16mJ36L8j62O3m9
$$ 186 182 180 147 71 96 116 78 225 143 151 153 258 195 190 91 96 108 57 134 37 115 75 104 95 147 145 59 174 141 135 19 15 151 189 27 90 41
3767D1%R0L1j34J55nJ52k06m8L4k0Q1K2j10J81n2j47L4o5Q1K3j7n6P8j3P3j23N9o1k6Q6J06
$$ 41 41 131 162 28 183 178 330 124 76 110 90 171 193 83 264 212 65 99 34 115 138 121 65 143 130 203 80 139 78 52 138 244
3467B44M3j12N3j10k7P4q3p2M5O3q4J12kL2J32j12r1L8j5j0J95p4o7P9k16K8P9j24J63P9K0
$$ 244 287 175 228 118 91 165 82 10 55 118 34 146 144 176 308 196 105 143 128 118 313 239 172 251 35 63 142 18 181 260 280
3176B80jj61j02J22ql3m8L1j2R5l0j5mJ2K3o1M0q6J39J67p2j30R1rp7p4m8j5J07q8J41j05
$$ 280 279 118 16 138 130 97 49 80 68 163 133 118 114 126 149 88 128 42 181 348 276 146 237 228 151 77 29 14 121 33 174 69
2875F9R7k8n6m8M2M2k0q9M7K7J6n8J16k4j10J12RM9q3J26j36J28kR1r3j22JqQ7o0Q3J10j22
$$ 69 166 138 82 34 76 118 98 9 56 83 99 41 157 133 23 135 144 193 110 236 100 228 226 317 224 102 103 95 182 122 205 315 193
2565A93r5N0m2J37P9r9o9kk3Ko1rK4k5L7j5o0J09J8r6N8%kl7k3R9K3m9m8l8jL2j6J33JQ7j40
$$ 193 98 148 106 243 322 223 154 152 129 131 70 61 85 60 97 82 22 131 149 53 111 111 109 72 49 148 171 122 74 36 35 67 51 184 185 272 132
2218A32q4K1O8L4o6k9N2O4j13LN6q6L1Q8R7r1j31Q6p3O0o3O1J09p4j37J00J68k9j10J7m5R9
$$ 132 48 69 137 171 105 76 128 192 79 82 138 52 83 171 268 177 46 132 59 119 56 117 226 152 15 115 283 254 144 161 116 215
1918B15j3k8q3L6N9r9J6m5L5n4Q7M9O8q9r6P7k4m5Q6m0j02K6M2M5n8j2j6PO4J06j11l3rO3
$$ 215 202 174 91 127 186 87 103 58 93 39 126 175 243 154 58 135 111 66 152 112 10 36 78 123 65 53 37 44 108 214 103 70 61 124
1598A24J5o2J49Oj91Q3K4q3J32n3O2o6J0L1q6k3J03j10l2PJ16Q5P8k13J3o4J11Kj5J47j56
$$ 124 139 77 226 232 41 124 148 65 197 144 206 140 150 181 95 72 175 65 33 40 156 241 319 106 119 55 166 168 153 300 144
1307A44o3N0k6J22n2k7J92j66J27nk83K19n8q7J06m9L0n3J6o5O5qJ8O6j41M3NJ96q8J0j04
$$ 144 81 131 105 227 175 148 340 174 301 296 13 232 174 87 193 144 174 121 137 72 137 129 147 213 72 115 120 316 228 238 134
1016A34l3J02j1j21N9M0p1P2n9K32j89n4R2m2r9J21p1N5L29Q7k89k72P5L2p5N7L2J38j40j6
$$ 134 101 203 192 71 130 170 99 171 112 344 155 101 193 151 52 173 102 157 486 573 284 12 87 119 44 101 133 271 131 115
734A15M1K6K7N3j67J06k8j32J93r8j2K0q2M2M1j9Qq3M8m1M4O8m4n0LO1K3J20j13K28Jj10L3
$$ 115 156 182 209 262 95 201 173 41 234 136 124 144 62 104 145 126 134 51 99 58 102 170 126 76 79 140 163 283 170 398 399 289 322
425C22k62Q5P6l3r4Rk4K4J13J30j10ok3Pr3j2J9L2m1M4K1n8R2K6N9n1p4m0n9m1j9K9M2n8L8
$$ 322 60 145 221 188 94 103 79 103 216 346 236 230 207 214 121 109 128 160 119 163 184 126 218 244 303 252 178 138 79 38 19 48 90 32 70
96G0N9m1n8MP6P4Q1j43KK7J04p1jr1J5J1j9m9mj0M1L3KK2n5k4Q5j2l4m4M2l4P1o3J00j13L6
$$ 70 129 88 30 34 110 184 265 122 124 151 255 184 183 92 107 118 99 50 46 36 77 110 112 134 79 55 140 128 94 50 92 58 129 66 166 53 89
-252H9M0j3r7J29o1j7J69o5p8l0Mm4P2m4l1
$$ 89 129 116 19 148 87 70 239 174 96 66 70 26 98 54 23
-392B3
##PAGE=	F1=-14330.4
##FIRST=	19140.455529915001534,	4405.895418600002813,	0
##DATA TABLE=	(F2++(Y..Y)), PROFILE
4406F8nl1J9K2P0m7L1J6j02J09L7n9J32j43L9P9p3q8P5j3o5J12P0p4kr0M0j20J92J17j32m4
$$ 68 63 32 51 73 143 96 127 143 41 150 187 128 260 117 156 235 162 74 149 136 71 183 253 179 177 87 127 7 199 316 184 140
4105A40K6Op8jJ7l2J27r3RK3J24q0or6K4np7J03r9N7k0M1n6J30pj10P9m3%r1K5J10K6j23P4
$$ 140 166 172 94 93 110 78 205 112 121 144 268 188 182 86 110 105 28 131 32 89 69 110 54 184 177 67 146 103 103 12 37 147 173 50 124
3777A24q5mO1O4j25J45L5J16j91o7O2k2L5M2j25K06k8j95Jl6R1K9J2k8M4m0J24j49O4p2m4
$$ 124 39 35 96 160 35 180 215 331 140 73 135 113 148 190 65 271 243 48 49 13 104 133 145 117 161 121 245 96 160 88 44
3486D4R3J09K9j33Q8j01j7Q8j00o0oO7p6J37l3O4J25j16q4M1k9J3J33l4r2J08j62o0J56j19
$$ 44 137 246 275 142 230 129 112 200 100 40 34 101 25 162 129 193 318 202 118 159 130 143 276 242 150 258 96 36 192 73
3204G3R4Q9M3k9j81o8J32l4j9n7K7J4O3jLjK2oo6N5r6J34J58p6j34N2%l6o7kk7L8o0J20r1
$$ 73 167 256 299 270 89 21 153 119 100 43 70 84 147 146 149 148 170 164 98 153 57 191 349 273 139 191 191 155 88 86 59 97 37 157 66
2875F6J22j2o7n7kM7Or2M1L5J2m3P8l6k2P6K5J1n5P8j19R8L4J47j09j58LlO4q3R4J45j29j35
$$ 66 188 176 109 52 50 97 103 11 52 87 99 56 134 98 76 152 177 188 133 211 92 190 224 371 262 104 107 104 168 85 179 324 195 60
2556F0R6o9J53Q0j17q8P0n8J6p7J3J7j0Pj1o0J27%j10P7k6m0j0lJ11j1m0K0n7m5Q8j4J05M7
$$ 60 156 87 240 320 203 115 185 127 143 66 79 96 86 93 82 22 149 149 39 116 90 50 40 37 148 137 97 117 60 15 103 89 194 241
2237B41O9j43j02J4K7M5o6o9J41K1j14J9M8q2N4N1J33j32r7R4q7L9n7Q3J14o7j27R2J08j9
$$ 241 310 167 65 79 106 151 85 16 157 178 64 83 131 49 103 154 287 155 58 152 65 104 47 130 244 177 50 142 250 231
1955B31j08K5k3P9j2m6o1M6K7j04K2j4Nl8O3M7P1j20o2J12j9n8J18o4q6mK6M8k3jm1k1P5J32
$$ 231 123 148 125 204 192 146 85 131 158 54 76 62 67 29 92 139 210 90 28 140 121 63 181 117 31 27 53 101 78 77 36 15 90 222
1636B22j03q0jR4J6n4J07Kj83J28l0k8Q3m6J01k2p7N0j18m6Q5p3j4N2J33P4M6k17Ql3P5lK2
$$ 222 119 39 38 132 148 94 201 203 20 148 118 90 173 127 228 206 129 179 61 15 100 27 13 65 198 272 318 101 109 76 151 148 170
1326A70J46j34j37M4j0K29j01k7J87j72J13Rk87J85n9j1M8n6K7q0Q6o6k4L9L1Q7j56K1J1J87
$$ 170 316 182 45 89 79 308 207 180 367 195 308 317 30 215 156 145 193 137 164 84 170 104 80 119 150 237 81 102 113 300
1044C00q3Pj11k6J19l2j13Q7M1r2O3o5K52j87p5O5qr5J58n9J4L55J37l27k86O1L3r0J9L3J68
$$ 300 217 224 113 87 206 174 61 148 189 97 160 95 347 160 85 150 142 47 205 146 160 515 652 325 39 100 133 43 62 95 263
753B63j05l4K9L4l4L9j12J42l5j58K26r8n8J6qP0K4m9m2m9N6m8M9Q8q0o4j8J01N7Q7j57K35
$$ 263 158 124 153 187 153 192 80 222 187 29 255 157 99 115 107 177 201 152 110 61 117 69 118 206 126 62 44 145 202 289 132 367
453C67K0j57N0k29Q9J00n2j30Nk6R5J33J40j13kk6J0j23n5N3J1n8N5K6m6R1oL9n9q1j9Rn1
$$ 367 387 230 280 51 140 240 188 58 63 37 132 265 405 292 290 264 274 151 96 149 160 102 157 183 137 228 222 261 202 121 102 111 60
143F0k1L6L9p7K9Q2On1m6lP5R2p8n2N8Q6o6J8q1LmL7q4kJ5l1O6l4Jm5M4N4j7Rk6Q3j16N2n8
$$ 60 39 75 114 37 66 148 154 103 57 54 129 221 143 91 149 235 169 187 106 109 105 142 58 56 71 40 106 72 73 28 72 126 109 118 92 175 59 111 53
-223E3J10j11N2K2Qr3R4l3k0R0k8l3k9m3K5M2l1p2
$$ 53 163 52 104 126 134 41 135 102 82 172 144 111 82 39 64 106 75 3
-392C
##PAGE=	F1=-14409.2
##FIRST=	19140.455529915001534,	4405.895418600002813,	0
##DATA TABLE=	(F2++(Y..Y)), PROFILE
4406H2k3m1P8o3J26l4LL5j02P0R5o7O0j30K3R0n3q6Q7l5q1R8M6J9K8j05j0p5J58J05j38o1
$$ 82 59 18 96 33 159 125 128 163 61 131 226 159 219 89 112 202 149 63 150 115 34 132 178 197 225 120 110 35 193 298 160 99
4105I9L5L6m9k1Pm4J01q8K5M6J20r1j5q9O6m6l5Q6j00K7J8L8j20K01k3j01N0n2J5o8L1R9r
$$ 99 134 170 121 100 107 63 164 76 101 147 267 176 161 72 138 92 57 143 43 70 88 126 6 207 184 83 133 81 96 28 59 158 149
3796A49n9O1j02K2KR4j29J19P9P6j48q1N2j5LN7j27K02lj99j6l5Q4K2M3RL8q3J64j37J1p3
$$ 149 90 151 49 71 73 167 38 157 236 312 164 83 135 120 123 180 53 255 252 53 37 2 86 108 151 160 198 115 279 142 153 80
3495H0m6Q1J14K6j42J14o4j2Q0j11n0n7O3m0J37o6R4J06j13p4N1m8M6O0Mr7J09j05j26K41
$$ 80 34 115 229 255 113 227 163 151 231 120 70 13 76 36 173 107 201 307 194 120 171 123 169 229 233 136 245 140 14 255
3213B55j25K5J00M8n9j89j2J22o4Qk3k3N2L3KL6nK0l2n7N8j12J22J59p4j43kK9nm7M6l2J0
$$ 255 130 155 255 303 244 55 43 165 101 109 86 63 115 148 150 186 181 201 169 112 170 58 180 339 265 122 120 149 144 97 143 111 121
2903A21n8P7o3J22J3p2p3k2M4Rp9M2K3J1k1N0l6K8M9K5l4jL0q8M5O3J83j17j72lLM8q2P4J73
$$ 121 63 140 77 199 212 140 67 45 89 98 19 61 84 95 74 124 88 116 165 190 156 155 185 97 142 205 388 271 99 96 99 147 65 139 312
2575C12j22j58J27r7J60P7j30r3J27q1K6q0K4QRJn0NJ15l3r5O4n9j7k0O5P7m9k9Q2r9k5Q8
$$ 312 190 32 159 62 222 299 169 76 203 122 148 68 92 100 109 110 60 65 180 147 52 116 57 40 20 85 162 113 84 166 67 42 130
2265A30L4L7P6L7j22j01j3j2M3l0k1J22l2r7K7M2q2O8K3J52j62m0R2r7Pn1R9J07o3r7Q1N4
$$ 130 164 201 277 314 192 91 78 66 109 79 58 180 148 51 78 120 38 106 129 281 119 79 171 74 81 30 129 236 173 76 157 211
1964B11K3j26K9nM6k5m1l5M8Pj11O2Kj9j4L5J7R2j51j8J07j3l7J06q3k0j2k7L7pK1n8j6N5
$$ 211 234 108 137 132 178 153 112 77 125 132 21 83 85 66 52 87 104 196 45 27 134 121 84 190 107 87 75 48 85 78 99 41 25 80
1645H0J47j02j20L6R8J8m2N1nj11J18p4L7K4m4J39J4j76Q8j10L4n4l8L5L2J55O4J5k11pPK7
$$ 80 227 125 5 41 139 157 115 166 161 50 168 94 131 155 111 250 264 88 176 66 100 46 8 43 75 230 294 309 98 91 98 125
1345A25j5P9J22j17j90J12M0K15j51k7J69j74R8K6k66J38n5N8J8q2K0j04J47p0q3J17J0Q4
$$ 125 110 189 311 194 4 116 156 371 220 193 362 188 286 312 46 184 129 187 205 123 143 39 186 116 33 150 160 244
1082B44j48Qj3J76o6Nj12l9J25m7p5J04M1j03N4p9K50j67r1L3J2p9J63l0k0L44J72l32k59
$$ 244 96 104 91 267 201 206 94 55 180 133 58 162 203 100 154 75 325 158 67 100 112 33 196 166 146 490 662 330 71
810G1K8L1p9nK5J72o5l4NL7p6Jm1J49l4j74K38q9r1K9N0Q1J2o1j04jO9o0N4J06j20o8pJ17
$$ 71 99 130 51 46 71 243 178 144 149 186 110 111 70 219 185 11 249 160 69 98 148 229 241 180 76 75 144 84 138 244 124 56 49 166
490A66O8O4j72J68N7j75O3j84P5J07m7j56J6l5J40J29J39j05J3k9J7j47r8R5pr1N6M3j1N8
$$ 166 234 298 126 294 351 176 239 55 130 237 190 34 50 15 155 284 423 318 331 302 319 172 74 169 162 71 127 170 159 217
209B17l6K4n7q1L4K2lm6J7M6r7K0R6N2l8q5o1M7J11nj09O7O5k1J8p4k1m1J31q5l2J8m5M5n3
$$ 217 181 205 148 67 101 123 120 74 91 137 40 60 156 208 170 85 24 71 182 177 68 135 200 179 197 123 102 61 192 107 75 93 48 93 40
-120D0j9NN9L2k4M5j5J01j07Kq6J12r3O2mM3q0M8qK6j0j6Pk2q9R4J3k9p4
$$ 40 21 26 85 117 93 138 123 224 117 119 33 145 52 114 110 153 73 121 113 139 129 113 120 98 9 103 116 87 13
-392A3
##PAGE=	F1=-14487.9
##FIRST=	19140.455529915001534,	4405.895418600002813,	0
##DATA TABLE=	(F2++(Y..Y)), PROFILE
4406H1k0PN8j23J64l6RL9j08N7J35q1j9j09K4R0l7p7P2m4n7R0OP8O4j08m7k8R5Q7j44n6L6
$$ 81 61 68 126 3 167 131 140 179 71 128 263 182 163 54 78 168 131 54 126 82 25 115 121 199 263 155 108 80 175 262 118 62 98
4096I8M1jl0oo5P2o5M5O6J06r9k1r0J19r8K5P7j08oN9K5j01J74n6n2J7m9K0o7M2J06n4j0N2
$$ 98 139 138 108 102 37 109 44 89 155 261 162 141 51 170 72 97 174 66 60 119 144 43 217 161 109 126 77 97 30 72 178 124 114 166
3777A66j03M5k2R3j41Q1J20L7q9p9KlnO5j23J76K2j79rm1N7LO8M3M5j10J84j13o7p1k1N5J06
$$ 166 63 108 86 179 38 119 239 276 187 108 110 107 102 167 44 220 242 63 54 13 70 73 141 184 229 119 303 190 123 52 31 86 192
3467A92M0j35J21rj5N8j10m6m4J9j4J23r8J18Q1j06o9O4o4P5lL2p7Q6n7j40K97j36k4R4L6
$$ 192 232 97 218 209 194 252 142 96 52 71 57 180 82 200 281 175 106 170 106 181 178 210 133 219 162 22 319 183 159 253 289
3176B89q4j76L4J06r1L1Pn7P7K3k4Q0qJ1n6l3M4j25J12J62o3j41p6P5m%P6m1J8q4M1k5J00
$$ 289 205 29 63 169 78 109 116 59 136 159 135 215 207 218 162 129 173 48 160 322 259 118 42 117 113 113 189 148 166 82 123 98 198
2866A98M0p3r3nL4j7n9M4J3QML8l5M1L7J2p8N9j2m7%O0J96j13j65j2J2M7m7J1J85r7j15Q2
$$ 198 238 165 72 67 101 84 25 69 82 90 94 132 97 138 175 187 109 168 156 109 109 169 365 252 87 75 87 134 87 98 283 186 71 153
2547A53j13J56O4j38o4J48q7K6p3J8NK6J7q2N1J00o8n7K6p5R4j16J36M2q8j3J18j48K0O9O9
$$ 153 40 196 260 122 58 206 119 145 72 90 95 121 138 56 107 207 139 82 108 33 127 11 147 189 101 88 206 58 78 147 216
2256B16k1R0lp6q1n0j8J1K3L2P1p9p7L3M1p2M8J5J43j72K5Q6r5l2m4J09R3o8o0P7NQ2j45J9
$$ 216 195 285 282 206 125 75 57 68 91 123 194 115 38 71 112 40 88 103 246 74 99 185 90 58 14 123 216 148 88 165 170 252 107 126
1936A26NJ7n7jk0M3nr6Q5J7m1RN0m6J16j86L6O8oPO0r2N8j7p4J5mL2p0L2J0J52j04q7J0J03
$$ 126 131 148 91 90 70 113 108 12 97 114 73 82 132 86 202 16 52 120 114 121 181 89 147 130 56 71 67 99 29 61 71 223 119 32 42 145
1598A45K1l1rqk9R1q3P5k0m8J51L6k27J15p1O4r5n2L8LJ77N3lk02j6M3k4l2J47Q0j09j25J16
$$ 145 166 135 126 118 89 180 97 172 152 104 255 291 64 179 108 172 77 25 63 66 243 296 293 91 75 118 94 62 209 289 180 55 171
1288A71M9J82j90k4J43j78Q5M2k29R6m3J02J6j13Kq7J61p6q2J49jO1j26J6o9J60m3J5j12o4
$$ 171 220 402 212 188 331 153 238 280 51 147 104 206 222 109 111 24 185 109 27 176 175 236 110 126 57 217 174 189 77 13
1007A3J32p3kJ00L9j05N3p1K06j42j05K6Kn7J35Jk9K87J93k93k13j6K8m8rQJ54k9l2NJ7r2
$$ 13 145 72 70 170 209 104 157 86 292 150 45 71 73 16 151 152 123 410 603 310 97 81 109 61 52 60 214 185 153 158 175 83
706H3k9L4J16l8j54K10p5j01O0Q4P1%o3j46L7Q8q0O7J16j59o2K1J07N6N8j23J1J05j53P3j53
$$ 83 54 88 204 166 12 222 147 46 106 190 261 261 198 52 89 177 97 164 280 121 59 80 187 243 301 178 189 294 141 214 61
415F1O3R0k9j49K3kJ13J02J27q7L2k8L0j57j48J40Nj44N3N6K7J0o1K8m6p9P0J4N7n4k2O1j07
$$ 61 124 214 185 36 59 57 170 272 399 312 344 316 346 189 41 181 186 42 95 151 178 188 127 155 109 30 100 114 171 117 95 156 49
105D9LJ02R1k5j17l2l0J17N9j56N1N4M7Mq6k9r0K31q3p2J2l1Po3J0L4L4K1k2N9j1R2p3j9q7
$$ 49 52 154 245 220 103 71 41 158 217 61 112 166 213 217 131 102 12 243 160 88 100 69 76 13 23 57 91 112 90 149 138 230 157 138 51
-223E1P9p4N9l3P7o7J5QO7n9l3M1j1r9J06ll7p0
$$ 51 130 56 115 82 159 92 107 115 182 123 90 131 120 21 127 124 87 17
-392A7
##PAGE=	F1=-14566.7
##FIRST=	19140.455529915001534,	4405.895418600002813,	0
##DATA TABLE=	(F2++(Y..Y)), PROFILE
4406F3J9K7K4j19J38m0M1M2j12M2J54q7q6p3K1Q4k4o5M6n4J3R1nO4R0j07m8k0M3O7j65k6M4
$$ 63 82 109 133 14 152 112 153 195 83 125 279 192 106 33 54 138 114 49 95 41 54 145 140 204 294 187 139 119 162 229 64 38 82
4096H2J1N0l3k0p6L7ML1P6R1j07j1j06J66j41P0Q0j14l6Q5J5p7J35r7L0k7l9J2o8N6J17r2
$$ 82 93 143 110 90 14 51 55 86 162 253 146 135 29 195 54 124 204 90 54 139 154 77 212 115 145 118 79 91 23 79 196 104
3796A04J5M8r4N7j6O8j50M2J49Nk6o3p2J3J1O6j07J26M6j48J1n8L9k4P7O5N7j04J87r3j49
$$ 104 119 167 73 130 114 182 32 74 223 228 202 139 67 80 91 157 50 176 222 74 85 27 66 42 119 184 241 137 324 231 82
3504H2o8L8L8N9O3j16J05L9j0L0j01m2lrk2J02j28J34N7j01o5P2o8Q4m8N7l9O5m0j25L32j46
$$ 82 14 52 90 149 212 96 201 240 230 260 159 117 114 105 83 185 57 191 248 147 82 154 86 170 122 179 140 205 165 40 372 226
3204B26m2N9J4j00j30M7Q6j08M3K6o2Q0K7o3J24nkq2QJ6j23J09J47m4j03o0J8l0O5P1m5L1
$$ 226 184 243 257 157 27 74 160 52 95 121 59 139 166 103 227 222 220 138 146 162 39 148 295 251 148 88 106 76 141 212 167 198
2903A98j13J5K1O1O4p2j04J9L2n6j8K6J3MJ8L4m1L9M1pr9R5m8lqQJ89r4j42j9L2N6j7m8J66
$$ 198 85 100 121 182 246 174 70 89 121 65 47 73 86 90 108 142 101 140 181 174 75 170 122 119 111 119 308 214 72 53 85 141 124 76 242
2575B42n9o7K0j11J42M1j42J8J17q2J4n7MML6L7n9N1P0r6j1j4j5J33j97J84J1j16NJ30j92
$$ 242 183 116 136 25 167 208 66 84 201 119 133 76 80 84 120 157 98 149 219 123 112 98 83 216 19 203 214 98 103 233 41
2284D1O7M4Q8o6R6m6j7m6p8Rk3M2O8K0j03p1N0M4n3j5L3J02j41O2P9p7o1k4J00P6q1j6Q1n0
$$ 41 108 152 240 174 270 224 207 161 83 92 69 111 179 199 96 25 75 119 66 51 84 186 45 107 186 109 48 24 124 200 119 103 184 134
1964A34J30j50lPRj10P9k8L6j9n5O5L9o1L1Q0r1J18j57M1J6rO0kq3J17k1j15KJ0J3p6Q4l7
$$ 134 264 114 111 118 127 17 96 68 104 85 30 95 134 73 104 184 93 211 54 95 111 102 162 160 77 194 173 58 60 70 83 7 91 54
1645E4J53j08m1l4J28K4k3p0J0L8N0o0Q0l8m9J22M2j84R0l5P4j03p9L0k7J94M1j1j95JN4o4
$$ 54 207 99 58 24 152 176 153 83 93 131 181 121 201 163 114 236 278 94 184 149 223 120 41 71 44 238 279 268 73 74 128 64
1345F4l7J97K9j10m3J11L4J48k03k1J16j89P8N4j85P1j8J02L1j29k7j9J14p7n6J39J8L3j06
$$ 64 27 224 253 143 100 211 245 393 190 169 285 96 174 228 43 114 96 198 229 100 73 54 168 91 35 174 192 225 119
1072A19L6j36J41k3M1j14j4R1j15N9Q4L5j00O5l9J32j29q0L6l2k7N8K5jJ91K01k21j74n4J8
$$ 119 155 19 160 137 178 64 50 141 26 85 169 204 104 169 130 262 133 53 89 57 30 88 113 112 303 504 283 109 55 73
791G3Lj0qJ20jl0K7k2r8K4N0O2o0r2J48o1q1Q6J06M6j5o8j46M3J10j07R6J10j78n5L1R5L5
$$ 73 76 66 58 178 177 147 174 152 54 78 128 190 130 38 186 125 44 130 236 282 267 199 53 96 206 99 195 305 127 72 103 198 233
481B33O5m1j91J65j06P8j46O3N6rj07jL0Q7O2R6n9N0j7M3j45j89J59M9j65L2M3N1l7p7N6l1
$$ 233 298 257 66 231 125 203 57 120 176 167 60 59 89 176 238 334 275 325 308 351 206 17 176 225 60 92 135 186 149 72 128 97
180I7p0N0J0J17m8o2P0j01j1Q7J22j2j37j0l8Q0J05j79K2N6R9rj11nm3K05q6j08Qj4jn6J6
$$ 97 27 77 87 204 156 94 164 63 52 139 261 249 112 102 64 144 249 70 92 148 247 238 127 122 79 284 198 90 98 84 83 27 43
-129D3L7J1J7pM6qN6l4j6n8N3p7M2n9J01n1nJ5R1o8n9P7Kj02Q4om6p5
$$ 43 80 91 108 101 147 139 195 161 145 87 140 63 105 46 147 96 91 106 197 129 70 147 149 47 131 125 79 4
-392D
##PAGE=	F1=-14645.5
##FIRST=	19140.455529915001534,	4405.895418600002813,	0
##DATA TABLE=	(F2++(Y..Y)), PROFILE
4406D3P7J2j9j04J06m1R0M5j08K0J47p9j15l0J0N8j2n3K9n1N1J14%L8R2j09l5l5K2N4j93L2
$$ 43 120 132 113 9 115 74 164 209 101 121 268 189 74 44 54 112 100 47 76 25 76 190 190 228 320 211 176 141 163 217 24 56
4105E6L9k3O4l8k6n2lP9qP4P7j12J5j21J81j64R6Q3j10n1Q2J0n7J02j31J24p4l4jn3O1J17
$$ 56 95 72 136 98 72 20 17 96 88 162 239 127 142 21 202 38 134 217 107 56 138 148 91 193 62 186 112 78 77 24 85 202
3805B02j09J4N2q3N9nL5j45J2J59j5K7l6j41K4L8P2p7N6O6j20L8q3K2l9O6P1P3p1J83q6k09
$$ 202 93 107 159 76 135 130 165 20 32 191 176 203 167 26 50 88 160 83 139 205 85 123 40 62 23 89 160 233 162 345 259 50
3504E0k0N2N2lO8r7P3O3J1Kq4l4M9l0m5Q2j54J42L5j00n8P1n1O0p2Q5NO8o4j04L53j52k8k
$$ 50 30 82 134 131 199 102 175 238 249 251 167 133 182 152 107 189 35 177 212 112 54 125 74 134 62 147 152 220 156 52 405 253 225 223
3185B23j6j03o8L7O2j07M4K7l7O0M3r9J53Mj9j07O5k2r2J02J09k1l7k3p1k6R1L7m0L6j33J
$$ 223 207 104 36 73 135 28 72 99 62 122 165 66 219 223 204 97 162 140 48 150 259 238 201 178 107 81 172 209 169 205 72 73
2885G3O6J6P9o8j03L9L8r8M1pJ5MJ1L0m5L5N6k3p2P5p4L4Mo2J70o7j05j7N3O4mp5J16j9l5
$$ 73 139 155 234 166 63 102 140 42 83 76 91 95 106 136 91 126 182 159 87 162 88 122 126 64 234 167 62 45 98 162 158 83 199 180 145
2556A45l8r3J28Nj25J11O8p8mm0qJL3N0rL7K6j04L2l6N0J40k44J99k3j22K1J23k10R3K0R0
$$ 145 107 14 142 147 22 133 201 123 119 79 71 72 105 155 146 183 209 105 137 101 151 291 47 246 223 101 122 245 35 128 148 238
2256B38r9J02q0L4lq9J8k7L6Q7j9r7q7P5N1m6q8P9K4m6L2P6m2p4qQ6N9q4K7R0j17J50j37l1
$$ 238 139 241 161 195 192 103 121 94 130 217 198 101 14 89 140 94 6 85 109 63 95 171 129 55 47 133 192 108 135 225 108 258 121 90
1936I0JK9o4O0m8L4l4k3K8O3p0M6J06j07J00r9L4j9m1J08n7n8J44k6j50J4M4k6m9Q6q0J41
$$ 90 91 120 56 116 68 102 68 45 73 136 66 112 218 111 211 112 146 127 86 194 137 79 223 197 47 61 105 79 30 116 36 177
1636A77j05jn8J46K2j7j21O5P0pk8O8l7l7O3L1r9N3j0P5j07q9J5n1J99L2j5j92L7M2p9J2J73
$$ 177 72 71 13 159 181 164 43 108 178 171 143 211 174 137 200 231 132 185 175 250 143 54 69 18 217 249 234 42 79 121 42 54 227
1326B27j7j16L6R9NJ16j91j6R5j88N5O2j46O8J5O0N1j13n9K8O7o9m3J18N9K1r8N3j47R6l4
$$ 227 210 94 130 229 234 350 159 143 238 50 105 167 21 89 104 164 215 102 43 71 138 69 26 144 203 224 126 179 32 128 94
1035I4Q2j19M4P4r7J7O5K3q4Q7lN6j32lJ6m4j6kQN6J08J71j39j59o9jO6j4k2P6J7k7N5o4j05
$$ 94 176 57 101 175 78 95 160 183 99 186 183 239 107 104 120 76 60 58 66 122 230 401 262 103 34 33 99 85 63 139 156 129 184 120 15
706A5J08M9J4j01j5Q4n2n5J09J20K9l8q2j25L2J28j35J43Q8j72n2J6Q5K4Q2M1k83J25o6O8
$$ 15 123 172 186 85 70 154 102 47 156 276 305 267 185 60 92 220 85 228 316 144 92 108 193 217 299 340 57 182 116 184
425A84j46P2J6Qm5m5O9O2J5M4k5O6PN5j11j57Q4J01j54K0MN7o6q4R2k9o3J1PJ65l4q5O5q1
$$ 184 38 110 126 134 89 44 113 175 190 234 209 275 282 337 226 69 153 254 100 120 124 181 115 31 123 94 31 42 49 214 180 95 160 79
105G9j1M2J47Kj37k1j3L8J35j74KO0J13j5j30L3oJ62r3j28PLK6m7k2N7j2QJ2J4lLmNk4N6r3
$$ 79 68 110 257 259 122 101 88 126 261 87 89 149 262 247 117 150 144 306 213 85 92 95 121 74 52 109 97 105 117 131 128 131 127 132 108 164 71
-242G1J3p8J09j8k7K6R0n4q7J22J2j06M2Ll8n8
$$ 71 84 6 115 97 70 96 186 132 45 167 179 73 115 118 80 22
-392B2
##PAGE=	F1=-14724.2
##FIRST=	19140.455529915001534,	4405.895418600002813,	0
##DATA TABLE=	(F2++(Y..Y)), PROFILE
4406E4J04k4o2n7O4n3J47M2r7KJ12o0j03j8L0Q%m3K5j1K8J37oM9P6j18l4n2L0M7j52L6J3p
$$ 54 158 134 72 15 79 26 173 215 118 120 232 172 69 51 81 89 89 46 71 60 88 225 219 268 344 226 192 140 170 217 65 101 114 107
4087A07J3m6k1k4K2Q1l6O0O1j14M9j22J59j64J05P5r4m0M3J1m0P7j25J88j11l6j3k7N7J02
$$ 107 120 74 53 29 51 132 96 156 217 103 152 30 189 25 130 205 111 71 114 125 85 162 37 225 114 78 65 38 95 197
3805A97j08mO0p4N3Qnj21MJ40k3O1lj33j4N7Q2n0lP3j05O0j04Jl4M4O1R7l2J77r2k09PM4P0
$$ 197 89 85 145 71 124 132 127 6 10 150 127 188 185 52 38 95 177 127 124 197 92 152 48 49 15 59 120 217 185 362 270 61 68 112 182
3476A82k4L2q5L3N7N2j8o4k2J03n3o5O0j64J37J3r9m3N2j2J2n2Q9M7Q8j05r3L54j52J0p4n2
$$ 182 158 190 105 138 195 247 229 165 143 246 193 128 188 24 161 174 75 32 84 72 84 32 121 168 256 151 58 412 260 270 196 144
3176A44r0j3J8L8q3L7NJ3K4O1j09J58J0m4j19J21n9m4R0O3lL5nj42K4O7j8k0L0j42LR7k8Q1
$$ 144 54 41 59 97 14 51 56 69 93 154 45 203 213 169 50 171 112 68 158 221 218 253 248 106 130 197 179 159 189 47 50 147 119 200
2857B00n7q8N3N1j42J05l9RNj1K1l8L2P6k9l0K5p6M5J2j01J53n4n9j9P4P0mq9O8J3k1q1o0
$$ 200 143 55 108 159 17 122 83 92 97 86 107 69 101 177 148 118 143 67 112 124 23 176 122 63 44 118 188 184 95 163 176 155 74 14
2537A4J04l5j2J15K4q4j4l2j0lJ7M4M8K7k6p9N6l4R4J28k57J90o3j08L4J05j86P8%Q4j20J11
$$ 14 118 83 71 186 210 126 112 80 70 67 84 128 176 203 177 98 154 120 214 342 85 275 212 104 138 243 57 135 135 219 99 210
2237B10q3M9L7q4Jk2L1R7m2p8j00Q7O1n2p4O8p4N6k9Q3J2q2lP3L5o3O5J00j78J27j10n2j6
$$ 210 127 176 213 129 130 108 139 236 194 116 16 103 164 112 38 106 32 88 59 142 154 72 69 142 177 114 179 279 101 228 118 66 50
1927E0O7lK2o6L7m3rj7P9n1L6J22r5P5m1K5k2j02J46q8l4J48l2j77M6P3m1n1Q5p8P3q8K4j2
$$ 50 117 114 136 70 107 64 55 38 117 66 102 224 129 204 163 188 166 64 210 122 88 236 204 27 73 146 105 54 139 61 134 46 70 58
1608E8J13Qj4j47J30P7o9oN2k7j3oQj4K7PP1j08q2Ln4J77K6k3j68N2J7o2N1J30n2j20J05Q3
$$ 58 171 179 165 18 148 225 156 150 202 175 162 156 164 150 177 184 255 147 65 68 14 191 217 194 26 78 95 33 84 214 162 42 147 230
1288B30k7Q4j58j0P8j09k4L9r2O0M6rP5o6p5K9K7n0l3Q1J07L1j01O0j24P4r0J30j32R2P6q6
$$ 230 203 287 129 119 197 88 64 103 11 71 117 108 183 117 42 71 98 48 15 96 203 234 133 193 69 143 53 183 51 143 219 133
988A33l2M4Jn7J15K5j5j32Q6k7m0rJ0n4Q5R5R8q4j65l7KR0k6k8K2K5j3O6r5l0J07N4k4j18
$$ 133 101 145 146 89 204 229 214 82 168 141 101 92 102 48 133 228 326 242 77 40 42 132 106 78 100 125 112 178 83 53 160 214 190 72
669G2M0J9n0l7J33J23L6o2j04j22L8J26j59K05N0j47m8j7P7L9J03R4k40Kn8K5j13O5j2J2K1
$$ 72 112 131 81 44 177 300 336 274 170 48 86 212 53 258 308 161 113 96 173 212 315 409 169 171 113 138 25 90 78 90 111
378A11p0J08K6l5k8QQ2M3O0o3j10j4J39j27J5l3N3o1o9Q5m0m9K9n0J94k1q4M8n5jk4J69K2
$$ 111 41 149 175 140 112 120 202 245 305 242 132 118 257 130 145 112 165 104 35 120 80 31 60 10 204 183 99 147 92 91 67 236 258
68B58j17p0K4jJ54j46pO2R8j7j27O1J9J20j05j31J4K1N7l9n9Q1m0jK3l1Rm7%M3mP6j01k5k0
$$ 258 141 71 95 94 248 102 95 157 255 238 111 172 191 311 206 75 89 110 167 128 69 150 110 109 132 101 110 63 63 106 102 178 77 52 32
-261C2M3L2n9N0O1j8j30J77J6j07j1K1pm3
$$ 32 75 107 48 98 159 141 11 188 204 97 86 107 100 57
-392E7
##PAGE=	F1=-14803
##FIRST=	19140.455529915001534,	4405.895418600002813,	0
##DATA TABLE=	(F2++(Y..Y)), PROFILE
4406H4R9o7r5K8L6o4J59K5p9kM8k7p9k9P5l9Ql3J6L1oJ48k3R3N5j24n8o3N3M2j05M5l4L2n0
$$ 84 183 116 21 49 85 21 180 205 126 124 172 145 66 37 112 73 81 48 64 95 89 237 214 307 362 238 180 117 170 212 107 152 118 150 100
4077A00n7kj3N0P3m3L9L9j13Q4j22J26j37Q9N6o9j0j5J4pM0n7J87j29m2j5j9O2P8j04k2O9
$$ 100 43 41 28 78 151 108 147 186 73 157 35 161 24 113 169 100 90 75 89 82 122 65 252 123 81 66 47 109 187 83 61 130
3777A30o6M1K5m5m9rQ0k1P2L0r5m6O0R1l6l7P0r9O8j17k3LJ5M8J18oJ62j03j73RM4P9j6k1
$$ 130 64 105 130 85 36 27 107 86 158 188 93 47 107 198 162 125 195 96 164 47 24 27 42 90 208 202 364 261 88 97 141 220 204 183
3458A83q2mJ9J12l4l8j0J53q1p6M0j48J11j2r4j6J9K7l3M5J9Q5J03j31r8L31j43O1j33j04
$$ 183 101 97 116 228 194 156 146 299 218 142 182 34 145 133 39 23 42 69 36 81 100 185 288 157 59 390 247 308 175 71
3176G1n3K6qJ8m1L0k5O4j1O7r2J46%p8n4J09q4%P7L0%R7nj86P4L9q1J4J7j41K9R6o2O9l4o7
$$ 71 18 44 36 54 13 43 18 82 71 138 46 192 192 114 60 169 85 85 162 192 192 289 284 98 172 211 130 144 161 20 49 145 83 152 118 51
2838E1O7O8j77J46o3qQk9Kk1K9R2k0pk5m7K3J1n2J18q2j2l3J03P1oj09M6K6k3r5j0N0o9J03
$$ 51 118 186 9 155 92 84 92 63 65 44 73 165 145 138 113 66 89 100 48 166 84 72 39 142 213 207 98 144 170 147 52 42 92 23 126
2509A26J07j1r7ql1j3jKQR8K6p6j6N2k5J18J06k46J70j06q1M7Q3j43L9j3P3j29J23m7K2O4
$$ 126 233 222 125 117 86 73 72 74 82 180 206 130 114 166 141 259 365 119 289 183 102 149 232 89 128 115 188 59 182 135 157 221
2209B21o5l6qK1J06n2o3r5Q4O8o6m1O0p8M4p4R8O0r3kN0Jj9J00J04k08O1q0m7m3R5M7Kq1M7
$$ 221 156 120 112 133 239 187 124 29 113 181 115 74 134 56 100 26 124 184 91 89 139 140 121 221 325 117 178 98 51 8 103 150 152 71 118
1880A18n0ql5N8kmJ26o0N6rJ9Nj79J72r0j6J49l9j99O8R3l5p8J10n4l3m0K0L8Q9k1j4j21J53
$$ 118 68 60 25 83 81 77 203 143 199 190 209 214 35 207 117 101 250 211 12 80 173 138 60 170 116 83 43 63 101 190 169 155 34 187
1561A87P8j15j4L8j6K0o5j9M9J7J9O4j06o7Jm1J35K5l6q9J3k4k4O6Q9p2q8J28P5n4M8j18%
$$ 187 265 150 136 174 158 178 113 94 143 160 179 243 137 70 71 30 165 190 154 65 78 54 30 96 185 113 25 153 228 174 222 104 104
1251A04O0k2m8m2oJ1O8q3J07j2p9Prl2J4J4J36N4r8N0r2P3j48J70j58J34Q2q2o4J7k7k6J47
$$ 104 164 142 94 52 46 57 125 42 149 137 58 65 56 24 38 52 188 242 144 194 102 175 27 197 39 173 255 173 109 126 99 73 220
941B20M0q3q7J37q2k5LK4p2N1J17L1o2j73K0K9Q2m4k4l8K5J4N0r8N8P5O1n9o3L5n0n2oJ43
$$ 220 260 177 90 227 145 120 123 147 75 126 243 274 212 39 59 88 170 126 102 64 89 103 153 55 113 188 249 190 127 162 112 60 54 197
622A97J08O4p8j14j48O7Q7j47K44Kj16l4n5O3P9J18J11j89o5o9n8jJ1J0m4P8m0J22k6p7l6
$$ 197 305 369 291 177 29 96 183 36 280 282 166 132 77 140 219 337 448 259 194 125 67 66 77 87 43 121 81 203 177 100 64
331F4m8R8R0N3ro0r9J43q8Qn6M7l0n8N1n6j3P2q7J61j5o4K5k5Rr8J94N0q8j40N4l7J67j08
$$ 64 16 114 204 257 248 188 89 232 144 152 96 143 113 55 106 50 37 109 22 183 168 104 129 104 113 15 209 259 171 31 85 48 215 107
11A07j5O9P3k1j03P2L7Q9j20j23K3M5P2k9q0R8p1mK0p8K9l4l4O6j8R8r0o4N0j3Q2r9Q1J9K7
$$ 107 92 161 234 213 110 182 219 308 188 65 88 133 205 176 96 194 123 119 139 61 90 56 22 88 70 168 78 14 64 51 133 34 115 134 161
-317A61j33J76J2r8o9M9L5m1
$$ 161 28 204 216 118 49 98 133 92
-392I2
##PAGE=	F1=-14881.7
##FIRST=	19140.455529915001534,	4405.895418600002813,	0
##DATA TABLE=	(F2++(Y..Y)), PROFILE
4406A05Q0j02l7M0L2o0J25rn5Kk3J3n3m1J13o4J4k4rP1l4J43m7J45M3j13j03p4Q2L6o5P3r9
$$ 105 185 83 46 86 118 58 183 174 119 121 98 111 58 17 130 66 80 56 47 118 84 227 180 325 368 255 152 78 160 196 131 204 105
4096A05P1r3m7Nj2O0O1k6K0Or2R9j29J00q6M6L2m2K3o9J3O9k7OJ70j33m6j3l0Q2N5j08k9P4
$$ 105 176 83 36 41 29 89 150 124 144 150 58 157 28 128 42 88 120 78 101 32 45 114 87 93 263 130 84 71 41 123 178 70 41 115
3777A15n8K6N4n0j0l9L3j6O2N7n2o1N7R2l2n3O4r2N7j10k7L1MN9J00KJ34j18j23J0N8P5no7
$$ 115 57 83 137 87 77 38 71 55 117 174 122 61 118 210 178 125 189 97 154 44 17 48 52 111 211 213 347 229 106 116 174 249 244 177
3458A77q7j9n2J82n2Mj1J91j14p0K7j21P5l8q5J8J8K2l3R4m9J18J03j28j13K87j27J12j56
$$ 177 90 71 19 201 149 153 142 333 219 149 176 55 130 92 7 25 43 65 32 126 77 195 298 170 57 344 217 329 173
3185A73j65K9J7m1MjJ9K3M7l2M8q0J49l0j13O3M1q7K7P2J4j0J36j9j99J06K7j49O0Kj07M0
$$ 173 8 37 54 13 17 16 35 58 105 73 121 41 190 160 47 110 151 64 91 163 177 167 303 284 85 191 218 69 129 131 24 64
2885F4P0p5L8J7o4Q6Q1j84J40p6k8J5kl4j9J3J05O%p0j2j3LJ5J11j30K6l7J26O4pj24M1J3
$$ 64 134 59 97 114 50 136 217 33 173 97 69 84 82 48 29 42 147 153 153 83 71 58 61 76 187 57 83 46 172 236 229 105 146 159
2565A59l3o5J7rk7J22J00l4j16Qj2k5%Nn2J21L2j12O5L2k7J30Q3k23J51j45n1N9O1r9oj9N7
$$ 159 126 61 78 69 42 164 264 230 114 122 110 85 85 90 38 159 191 79 144 176 149 279 362 139 290 145 94 153 214 115 109 90 147
2256A47j20J28lj0P8m1p6K0oJ20n8n5q2Q1O2q1oN9m6j3k2P5O6j14LJ7l9M4J20J02k10k1o0
$$ 147 27 155 152 142 220 179 103 123 117 237 179 124 42 123 185 104 98 157 111 98 76 151 217 103 106 123 84 128 248 350 140 119 59
1946E9Jj1K5R1Kr6O3o9q%jM7n9J18oM5j6J7N3k53J92p4lJ62m5j99M0R9j4j15J61l1j41K9k
$$ 59 60 49 74 165 167 71 134 65 57 57 56 103 44 162 156 201 185 202 255 2 194 120 117 279 234 35 75 174 160 45 206 175 34 63 61
1617F1P0Q3n6k4p8J59P5j34n1K7qN3j04m0Q6J8K7N6r4n5Ml1R9K9m9j9nq8J5O3N2p7oR7P5p1
$$ 61 131 214 158 134 56 215 290 156 105 132 124 177 73 33 119 137 164 220 126 71 75 44 143 172 123 104 99 11 26 89 141 64 58 155 230 159
1279A59J1p9J5L1L7l5q8K4k8P9j02J05K1q4J0l0l1M7rJ04P7p9K7n3O6j67J81j84J69Q3q1p3
$$ 159 170 91 106 137 174 139 51 75 47 126 24 129 150 66 76 46 15 62 53 157 234 155 182 129 195 28 209 25 194 277 196 123
979A23j7n7NJ75M6j43JJ35j36NJ6J8o7j0J24jm5j27K9N6P3o1j0j02K4M7J3m8R7M2O6r3J8J6
$$ 123 106 49 54 229 275 132 133 268 132 137 153 171 104 94 218 217 172 45 74 130 203 142 132 30 54 101 114 66 163 205 271 178 196 212
659B12j20n2N0J26P6J00q3j02j43P1On2K03n0r2no4K2J22J21R9j26r6p3q0N5k2M9j37R9J6
$$ 212 92 40 90 216 292 392 309 207 64 135 141 89 292 242 150 145 81 103 225 346 445 319 223 150 70 125 103 152 15 114 130
368A30J28q1q6R3r5n7J32L5M0j3j38R6m1nn7L8Nn5J0o4L5R4j01J20j7l7LLJ3r3J50Q4o6j31
$$ 130 258 177 91 184 89 32 164 199 239 226 88 184 143 138 81 119 124 69 79 15 50 144 43 163 146 109 112 115 128 35 185 269 203 72
49G2qn4J59p1k4Q3N5l1p4Q0M8P8j37j17L5O7O4k0q3J06r9nJ1j16N2K7lLp3J12o5m8O3j7R2
$$ 72 64 10 169 98 74 157 212 181 107 187 235 313 176 59 94 161 225 205 122 228 129 124 135 19 71 98 95 98 25 137 72 24 87 70 162
-280A62j19R2j2O2j18J46Kq0j21Q3P2m6
$$ 162 43 135 123 185 67 213 215 135 14 97 169 123
-392A23
##PAGE=	F1=-14960.5
##FIRST=	19140.455529915001534,	4405.895418600002813,	0
##DATA TABLE=	(F2++(Y..Y)), PROFILE
4406A09N3j10M3K2K8n8R3n7k3Kq4N6j1oP1o7J9j5l9J00m7J18o6J83M3q4j41r3J07K4k9J20
$$ 109 162 52 95 117 145 87 180 123 100 102 18 74 63 57 128 61 80 65 26 126 79 197 131 314 357 273 132 39 146 170 141 261
4105B61j77J03j14lk3jM1M3J3Rl6k0O0j48R5m3KK2k3L5r3lJ70r5L2J50j29m2j6m9J09M2j24
$$ 261 84 187 73 70 47 46 87 130 143 152 116 96 156 8 103 60 62 84 61 96 3 0 170 75 107 257 128 86 70 21 130 172 48
3796D8j5O8m5RQ9k1j2p7Qk0M0P4j0o1M4Q3l1n0N2p7K8p1j0J9J5P8N7PR8j39o8K1Q0O7qr5r3
$$ 48 33 101 56 65 154 133 121 44 52 32 72 146 136 75 119 202 171 121 173 96 124 53 43 62 77 155 212 219 317 178 110 131 211 278 270 175 82
3448H2%PQ8p9P4m2K16j50m1J9r8L9n8l9K0M7nl8J01r4J45Q3j00j22K29j07J45j36j19nJ0m5
$$ 82 82 89 177 98 172 130 346 196 155 174 76 115 57 18 38 85 80 42 143 49 194 277 177 55 284 177 322 186 67 62 72 27
3148B7qJ7pP1L9n2J4q5J68p3p4J09l0o1L4P8jk1J48l5j86J11L8k09J02ro7L4M3n9mQ3q5J01
$$ 27 19 36 29 100 139 87 101 16 184 111 37 146 116 55 89 167 166 145 293 258 72 183 221 12 114 105 38 72 115 56 52 135 50 151
2828A51R1j90J19p8m5L9M5n2m9j8J13M4J2q8k9k2MM0J08j32L4j8J26M9kj12K7k3m4j2K5m6
$$ 151 242 52 171 93 48 87 132 80 31 13 126 170 182 94 65 43 47 87 195 63 97 79 205 254 252 140 167 144 100 88 113 67
2528F7K1Q8R3m1j36K4L6l7j3J1o3P3M1j24J36J1m8J34O6k03J41j69l0P1M0o1m5k0L2q2J09
$$ 67 88 176 269 228 92 116 152 115 102 113 50 123 164 40 176 187 139 273 339 136 277 108 78 149 189 128 83 63 95 13 122
2237A22L2k1Q0j9r9N5m3J31o9m9p1R1L5q8K6N7k6n2M5P6L0j43K0j9l2P1J17Q8j85p3o9O9Q
$$ 122 154 133 213 194 95 150 107 238 169 120 49 140 175 87 113 170 144 92 137 213 243 100 120 101 69 140 257 345 160 87 18 87 95
1927I5m4J16J4j15Q6j02oM1rM1r4R2N9L2n7J9J10k36J43o2J0J83m5k06KP9J6j38K16j5j85
$$ 95 51 167 181 66 152 50 44 85 76 117 23 115 174 206 149 168 278 42 185 123 133 316 271 65 67 146 162 24 240 225 40
1636D0M5j0O9R3q5m9l2J54P1j31j02K0kP3j07k6P0K6K8M9p6m5Jj3O3L5n4K2J0r4j9M1K1p0
$$ 40 85 75 144 237 152 103 71 225 296 165 63 83 81 154 47 21 91 117 145 194 118 73 74 61 124 159 105 127 137 43 24 65 86 16
1317A6O5P2P7q1j5m6L8j2O1j3q1Qm7Q0m3M2K6q8M5j9k5J3J0L5R0m4orM5j58J77j74J68Q0q3
$$ 16 81 153 230 149 134 88 126 114 175 162 81 89 42 122 79 121 147 59 104 85 60 73 83 118 208 164 158 149 194 36 213 39 207 287 204
988B04o7m8p1J1J98M8j70P5J03j79N3K4qn3p5R9pnl8j3P9O1p0Oj47K5O3k1L2Q6J1P0j24R5
$$ 204 137 89 18 29 227 275 105 180 283 104 157 181 173 120 45 144 137 132 94 81 160 221 151 157 10 35 98 77 109 195 206 276 152 247
669B47Nj79m0J03R7L3J34p9q3j13O4q9N8J33r8p7L4k8m3J39J14O3n0r8o8nRl2O8j74M5P7J27
$$ 247 252 73 33 136 233 266 400 321 238 125 189 100 158 291 193 116 150 122 79 218 332 395 345 247 179 174 183 151 219 45 90 167 294
$$ [...]
-392A00
##END NTUPLES=	nD NMR SPECTRUM
##END=	
##END=	
