##TITLE=	Jun21-2022.23.fid
TM-VI-212, CDCl3, new, 13C

##JCAMP-DX=	6.0	$$ MestReNova 14.3.0-30573
##DATA TYPE=	LINK
##BLOCK_ID=	1
##BLOCKS=	2    
##ORIGIN=	Mestrelab Research S.L.
##OWNER=	hrzepa
##$MNOVA/LINK_BLOCK_TYPE=	ITEM	$$ NMR Spectrum
##$MNOVA/ITEM/POLYGON=	(XY..XY)
5321,5835
8722,5835
8722,8208
5321,8208
5321,5835
##$MNOVA/ITEM/Z=	0
##$MNOVA/ITEM/ANGLE=	0
##TITLE=	Jun21-2022.23.fid
##JCAMP-DX=	6.0	$$ MestReNova 14.3.0-30573
##BLOCK_ID=	2
##DATA TYPE=	MNOVA NMR VIEW DATA
##DATA CLASS=	MNOVA VIEW DATA
##$MNOVA/ITEM/ZOOM/X=	-31.107771267257835035,	251.11459999734066173
##$MNOVA/ITEM/ZOOM/Y=	-285.74161720275878906,	2859.750244140625
##END=	
##TITLE=	Jun21-2022.23.fid
##JCAMP-DX=	6.0	$$ MestReNova 14.3.0-30573
##BLOCK_ID=	3
##DATA TYPE=	NMR SPECTRUM
##DATA CLASS=	XYDATA
##NUMDIM=	1
##ORIGIN=	Bruker BioSpin GmbH
##OWNER=	nmr
##.OBSERVE FREQUENCY=	100.67161678785400625
##.OBSERVE NUCLEUS=	^13C
##.SOLVENT NAME=	CDCl3
##.PULSE SEQUENCE=	zgpg30
##LONGDATE=	2022/06/21 20:35:00.000
##.ACQUISITIONMODE=	SIMULTANEOUS (DQD)
##$ORIGINAL FORMAT=	Bruker XWIN-NMR
##$MNOVA/SCALES_VERSION=	9
##$PARAMETER FILE=	(acqus, ASCII, /private/var/folders/f6/rjf_tdyn2v98c5c0wvkgn4s80000gn/T/vo3flHVqQFOTE701APkZqg/23/acqus, 0)
$$ ##TITLE= Parameter file, TOPSPIN		Version 3.2
$$ ##JCAMPDX= 5.0
$$ ##DATATYPE= Parameter Values
$$ ##NPOINTS= 11	$$ modification sequence number
$$ ##ORIGIN= Bruker BioSpin GmbH
$$ ##OWNER= nmr
$$ $$ 2022-06-21 20:35:55.343 +0100  nmr@CZC2524DW0
$$ $$ /opt/topspin/data/agmb/nmr/Jun21-2022/23/acqus
$$ $$ process /opt/topspin3.2/prog/mod/shimcntl
$$ ##$ACQT0= -1.94327731092437
$$ ##$AMP= (0..31)
$$ 100 100 100 100 100 100 100 100 100 100 100 100 100 100 100 100 100 100
$$ 100 100 100 100 100 100 100 100 100 100 100 100 100 100
$$ ##$AMPCOIL= (0..19)
$$ 0 0 0 0 0 0 0 0 0 0 0 0 0 0 0 0 0 0 0 0
$$ ##$ANAVPT= -1
$$ ##$AQSEQ= 0
$$ ##$AQ_mod= 3
$$ ##$AUNM= <au_zg>
$$ ##$AUTOPOS= <41 >
$$ ##$BF1= 100.660544
$$ ##$BF2= 400.32
$$ ##$BF3= 100.660544
$$ ##$BF4= 100.660544
$$ ##$BF5= 100.660544
$$ ##$BF6= 100.660544
$$ ##$BF7= 100.660544
$$ ##$BF8= 100.660544
$$ ##$BYTORDA= 0
$$ ##$CAGPARS= (0..11)
$$ 0 0 0 0 0 0 0 0 0 0 0 0
$$ ##$CFDGTYP= 0
$$ ##$CFRGTYP= 9
$$ ##$CHEMSTR= <none>
$$ ##$CNST= (0..63)
$$ 1 1 145 1 1 1 1 1 1 1 1 1 1 1 1 1 1 1 1 1 1 1 1 1 1 1 1 1 1 1 1 1 1 1 1
$$ 1 1 1 1 1 1 1 1 1 1 1 1 1 1 1 1 1 1 1 1 1 1 1 1 1 1 1 1 1
$$ ##$CPDPRG= (0..8)
$$ <waltz16> <> <waltz16> <> <mlev> <mlev> <mlev> <mlev> <mlev>
$$ ##$D= (0..63)
$$ 0 1 0.00345 0 0 0 0 0 0 0.06 0 0.03 2e-05 3e-06 0 0 0.0002 0 0 0 0 0 0
$$ 0 0 0 0 0 0 0 0 0 0 0 0 0 0 0 0 0 0 0 0 0 0 0 0 0 0 0 0 0 0 0 0 0 0 0 0
$$ 0 0 0 0 0
$$ ##$DATE= 1655840154
$$ ##$DE= 6.5
$$ ##$DECBNUC= <off>
$$ ##$DECIM= 704
$$ ##$DECNUC= <off>
$$ ##$DECSTAT= 4
$$ ##$DIGMOD= 1
$$ ##$DIGTYP= 12
$$ ##$DQDMODE= 0
$$ ##$DR= 21
$$ ##$DS= 4
$$ ##$DSPFIRM= 0
$$ ##$DSPFVS= 20
$$ ##$DTYPA= 0
$$ ##$EXP= <c13>
$$ ##$F1LIST= <111111111111111>
$$ ##$F2LIST= <222222222222222>
$$ ##$F3LIST= <333333333333333>
$$ ##$FCUCHAN= (0..9)
$$ [...]
$$ ##$Sgu3PowerLevels= (0..7)
$$ 0 0 0 0 0 0 0 0
$$ ##$Sgu4PowerLevels= (0..7)
$$ 0 0 0 0 0 0 0 0
$$ ##$Sgu5PowerLevels= (0..7)
$$ 0 0 0 0 0 0 0 0
$$ ##$Sgu6PowerLevels= (0..7)
$$ 0 0 0 0 0 0 0 0
$$ ##$Sgu7PowerLevels= (0..7)
$$ 0 0 0 0 0 0 0 0
$$ ##$Sgu8PowerLevels= (0..7)
$$ 0 0 0 0 0 0 0 0
$$ ##$SguType= 3
$$ ##$ShimPowMaxUA= (0..63)
$$ 130000 130000 130000 130000 130000 130000 130000 130000 130000 130000 130000
$$ 130000 130000 130000 130000 130000 130000 130000 130000 130000 0 0 0 0
$$ 0 0 0 0 0 0 0 0 0 0 0 0 0 0 0 0 0 0 0 0 0 0 0 0 0 0 0 0 0 0 0 0 0 0 0 0
$$ 0 0 0 0
$$ ##$ShimPowMaxUC= (0..63)
$$ 130000 130000 130000 130000 130000 130000 130000 130000 130000 130000 130000
$$ 130000 130000 130000 130000 130000 130000 130000 130000 130000 0 0 0 0
$$ 0 0 0 0 0 0 0 0 0 0 0 0 0 0 0 0 0 0 0 0 0 0 0 0 0 0 0 0 0 0 0 0 0 0 0 0
$$ 0 0 0 0
$$ ##$ShimPowMaxUG= (0..63)
$$ 524287 524287 524287 524287 524287 524287 524287 524287 524287 524287 524287
$$ 524287 524287 524287 524287 524287 524287 524287 524287 524287 0 0 0 0
$$ 0 0 0 0 0 0 0 0 0 0 0 0 0 0 0 0 0 0 0 0 0 0 0 0 0 0 0 0 0 0 0 0 0 0 0 0
$$ 0 0 0 0
$$ ##$ShimPowRcbType= 3
$$ ##$ShimPowRes= (0..63)
$$ 1e-20 1e-20 1e-20 1e-20 1e-20 1e-20 1e-20 1e-20 1e-20 1e-20 1e-20 1e-20
$$ 1e-20 1e-20 1e-20 1e-20 1e-20 1e-20 1e-20 1e-20 0 0 0 0 0 0 0 0 0 0 0 0
$$ 0 0 0 0 0 0 0 0 0 0 0 0 0 0 0 0 0 0 0 0 0 0 0 0 0 0 0 0 0 0 0 0
$$ ##$ShimPowRng0= (0..63)
$$ 1 1 1 1 1 1 1 1 1 1 1 1 1 1 1 1 1 1 1 1 0 0 0 0 0 0 0 0 0 0 0 0 0 0 0 0
$$ 0 0 0 0 0 0 0 0 0 0 0 0 0 0 0 0 0 0 0 0 0 0 0 0 0 0 0 0
$$ ##$ShimPowRng1= (0..63)
$$ 1 1 1 1 1 1 1 1 1 1 1 1 1 1 1 1 1 1 1 1 0 0 0 0 0 0 0 0 0 0 0 0 0 0 0 0
$$ 0 0 0 0 0 0 0 0 0 0 0 0 0 0 0 0 0 0 0 0 0 0 0 0 0 0 0 0
$$ ##$ShimPowRng2= (0..63)
$$ 1 1 1 1 1 1 1 1 1 1 1 1 1 1 1 1 1 1 1 1 0 0 0 0 0 0 0 0 0 0 0 0 0 0 0 0
$$ 0 0 0 0 0 0 0 0 0 0 0 0 0 0 0 0 0 0 0 0 0 0 0 0 0 0 0 0
$$ ##$ShimPowRng3= (0..63)
$$ 1 1 1 1 1 1 1 1 1 1 1 1 1 1 1 1 1 1 1 1 0 0 0 0 0 0 0 0 0 0 0 0 0 0 0 0
$$ 0 0 0 0 0 0 0 0 0 0 0 0 0 0 0 0 0 0 0 0 0 0 0 0 0 0 0 0
$$ ##$ShimSysFunc= (0..63)
$$ 1 2 3 4 5 7 9 11 15 16 8 10 12 14 6 17 13 18 19 20 0 0 0 0 0 0 0 0 0 0
$$ 0 0 0 0 0 0 0 0 0 0 0 0 0 0 0 0 0 0 0 0 0 0 0 0 0 0 0 0 0 0 0 0 0 0
$$ ##$ShimSysMatrix= 0
$$ ##$ShimSysType= 1
$$ ##$TFXNUM= 0
$$ ##$TRIPLO2= 0
$$ ##$VTU= 2
$$ ##$VTUETH= <149.236.99.20>
$$ ##$VTUTY= <no>
$$ ##$WBREFAM= (0..15)
$$ 132.2 106.2 100 100 100 100 100 100 100 100 100 100 100 100 100 100
$$ ##$WBREFLM= (0..15)
$$ 0 0 0 0 0 0 0 0 0 0 0 0 0 0 0 0
$$ ##$WBREFPH= (0..15)
$$ 77.55 -65.76 0 0 0 0 0 0 0 0 0 0 0 0 0 0
$$ ##$WBSGU= (0..15)
$$ 0 0 0 0 0 0 0 0 0 0 0 0 0 0 0 0
$$ ##$XFAC= 2
$$ ##END=
$$ 
##$DECIM=	704
##$DSPFVS=	20
##XUNITS=	HZ
##YUNITS=	ARBITRARY UNITS
##FIRSTX=	25277.332242342450627
##LASTX=	-3131.3251784229105397
##DELTAX=	-0.43348832563920591809
##XFACTOR=	1
##YFACTOR=	0.084659214518266454053
##FIRSTY=	12.991169929504394531
##MINY=	-25.764322280883789063
##MAXY=	2599.77294921875
##NPOINTS=	65536
##XYDATA=	(X++(Y..Y))
$$ [...]
$$ plain form
17620 -195 -182 -133 -78 -41 -29 -38 -55 -70 -78 -82 -79 -65 -40 -15 -1 5 11 14 3 -20 -39 -43 -40 -42 -45 -37 -20 -14 -31 -60 -79 -83 -90 -107 -122 -111 -70 -18 24 52 71 87
17602 87 97 96 85 64 43 27 19 19 26 39 47 41 27 22 31 37 22 -3 -15 -1 25 50 64 66 49 13 -20 -33 -27 -24 -40 -65 -77 -68 -49 -43 -64 -107 -147 -164 -154 -138
17583 -138 -139 -161 -186 -192 -174 -145 -118 -106 -113 -136 -165 -182 -181 -170 -165 -172 -184 -197 -209 -219 -222 -212 -191 -167 -146 -129 -117 -109 -95 -66 -23 21 52 63 59 53 50 48 46 48 58
17566 58 73 83 80 66 48 34 31 32 29 12 -11 -27 -31 -26 -23 -26 -42 -71 -102 -119 -119 -115 -117 -121 -120 -117 -116 -107 -80 -43 -7 19 39 41 20 -14 -38 -41 -36 -40 -53 -62 -60 -55 -59 -81 -117
17545 -117 -154 -175 -175 -155 -119 -83 -69 -86 -118 -136 -135 -131 -129 -115 -87 -64 -64 -76 -73 -53 -33 -20 -7 14 35 37 16 -7 -10 12 40 43 15 -17 -32 -32 -31 -26 -7 18
17528 18 32 21 -2 -23 -36 -41 -42 -44 -54 -69 -74 -62 -40 -20 -8 -1 1 0 -9 -28 -51 -63 -54 -36 -31 -45 -56 -46 -17 10 25 20 0 -30 -55 -66 -64 -53 -38 -22 -10
17510 -10 0 16 33 38 33 34 51 70 66 47 38 46 53 43 27 24 34 43 45 40 34 25 22 32 55 83 104 113 114 114 118 121 108 74 35 7 -7 -20 -41 -63 -70 -59 -34 -9 9
17491 9 16 15 10 8 16 34 56 65 55 37 30 28 11 -27 -60 -57 -25 0 -7 -33 -46 -36 -17 -12 -31 -66 -101 -119 -111 -79 -34 8 37 51 56 59 63 67 76 95 116 127 123 108
$$ packed form
17620a95J3M9N5L7J2rj7j5qmLJ4K5K5J4OOLj1k3j9mLklQJ7Oj7k9j9mpj7j5J1M1N2M2K8J9J6
17602H7J0jj1k1k1j6q%PJ3Qoj4nROj5k5j2J4K6K5J4Kj7l6l3j3OLj6k5j2RJ9Ok1m3m0j7J0J6
17583a38jk2k5oJ8K9K7J2pk3k9j7JJ1Npj2j3j2j0lJ0K1K4K1J7J2QJ4K9M3M4L1J1molkkKJ0
17566E8J5J0lj4j8j4lJlj7k3j6mNLlj6k9l1j7%MkmJLJRK7L7L6K6K0Kk1l4k4lNmj3rKNmk2l6
17545a17l7k1%K0L6L6J4j7l2j8JMKJ4K8K3%j2LK0K0J3J3K1K1Kk1k3lK2K8Lk8l2j5%JNJ9K5
17528A8J4j1k3k1j3njkj0j5nJ2K2K0J2PKjrj9k3j2RJ8Nj4j1J0K9K7J5nk0l0k5j1KJ1J5J6J2
17510a0J0J6J7NnJJ7J9mj9rQPj0j6lJ0RKnorlJ0K3K8K1RJ%MLj3l4l9k8j4j3k1k2pJ1K5K5J8
17491IPjnkQJ8K2Rj0j8pkj7l8l3LL2K5pk6j3J0J9Nj9l5l5j8QL2M5M2K9J4NLMMRJ9K1J1mj5
$$ plain form
17472 108 91 77 76 94 123 148 156 147 123 87 44 11 -5 -19 -45 -74 -85 -70 -45 -24 -12 -9 -15 -27 -37 -38 -28 -13 0 10 19 34 58 82 93 88 72 54
17455 54 34 14 -4 -27 -58 -84 -88 -64 -25 14 47 71 82 82 78 74 73 79 92 98 82 52 33 31 29 21 30 64 98 97 66 36 14 -13 -47 -58 -38 -13 -13 -38 -65
17437 -65 -79 -77 -65 -48 -34 -24 -14 -4 -2 -19 -46 -66 -68 -55 -40 -36 -44 -53 -48 -32 -20 -24 -36 -45 -55 -72 -88 -91 -75 -49 -27 -18 -18 -17 -7 5 7 -3 -15 -21 -21 -19 -14 -6
17418 -6 -5 -19 -33 -32 -21 -18 -27 -28 -8 24 49 56 41 8 -30 -53 -45 -12 23 47 57 58 54 50 48 44 30 7 -11 -7 18 43 50 47 59 99 144 161 137 83 20 -39 -86
17400 -86 -113 -120 -112 -96 -73 -49 -31 -23 -17 -6 10 24 32 35 40 48 55 62 69 72 60 33 9 14 51 92 109 96 69 38 6 -26 -49 -58 -62 -74 -102 -145 -189 -214 -202 -161
17381 -161 -113 -72 -33 6 35 44 42 47 61 76 89 102 103 80 39 4 -11 -18 -22 -21 -8 4 1 -21 -53 -79 -85 -72 -50 -40 -47 -59 -63 -58 -49 -36 -14 11 28 33 38 49
17363 49 59 58 42 12 -22 -53 -72 -83 -95 -107 -111 -102 -90 -84 -79 -70 -65 -78 -103 -113 -94 -57 -27 -18 -27 -41 -47 -36 -17 -4 0 4 15 20 12 2 5 19 24 17 9 8 8 2 -10
17344 -10 -23 -32 -33 -24 -10 1 11 24 29 8 -37 -77 -87 -77 -71 -72 -63 -37 -12 -4 -10 -22 -34 -41 -35 -20 -6 0 4 8 7 0 -13 -34 -60 -80 -75 -48 -22 -20 -35 -44 -39 -24 -6
$$ packed form
17472A08j7j4jJ8K9K5Qrk4l6m3l3j6j4k6k9j1J5K5K1J2Loj2j0jJ0J5J3J0RJ5K4K4J1nj6j8
17455E4k0k0j8k3l1k6mK4L9L9L3K4J1%mmjOJ3Oj6l0j9kkqRL4L4jl1l0k2k7l4j1K0K5%k5k7
17437f5j4KJ2J7J4J0J0J0Kj7k7k0kJ3J5MqrNJ6J2mj2rj0j7j6lJ6K6K2R%JJ0J2Kj0j2o%KNQ
17418fJj4j4JJ1LrjK0L2K5Pj5l3l8k3QL3L5K4J0Jmmkmj4k3j8MK5K5PlJ2M0M5J7k4n4o3n9m7
17400h6k7pQJ6K3K4J8QOJ1J6J4QLNQPPPLj2k7k4NL7M1J7j3k7l1l2l2k3rmj2k8m3m4k5J2M1
17381a61M8M1L9L9K9RkNJ4J5J3J3Jk3m1l5j5pmJJ3J2lk2l2k6oJ3K2J0pj2mNRJ3K2K5J7NNJ1
17363D9J0jj6l0l4l1j9j1j2j2mRJ2ONRNj3k5j0J9L7L0Rrj4oJ1J9J3MMJ1Nqj0LJ4Npqj%oj2
17344a0j3rjRJ4J1J0J3Nk1m5m0j0J0OjRK6K5Qoj2j2pOJ5J4OMMjpj3k1k6k0NK7K6Kj5rNJ5J8
$$ plain form
17324 -6 15 33 36 21 0 -10 -9 -2 8 19 27 31 28 18 2 -16 -42 -82 -134 -181 -201 -187 -154 -125 -114 -119 -124 -118 -104 -101 -119 -142 -144 -120 -83 -46 -13 8 7 -22 -71
17306 -71 -123 -159 -163 -126 -67 -21 -12 -27 -46 -70 -104 -139 -152 -137 -110 -86 -63 -37 -16 -6 -2 5 16 21 14 2 -7 -14 -18 -17 -7 11 31 46 54 59 58 48 27 -2 -34
17289 -34 -61 -68 -51 -26 -23 -50 -81 -80 -43 0 20 19 16 16 11 0 -9 -7 11 46 89 121 125 99 64 41 39 45 50 47 35 12 -17 -40 -47 -45 -48 -61 -70 -66 -60 -64 -72 -70 -55 -36
17269 -36 -20 -1 22 42 48 43 34 25 11 0 -5 -6 -8 -11 -11 -14 -31 -62 -90 -102 -100 -97 -100 -105 -106 -99 -84 -67 -54 -49 -51 -64 -84 -99 -92 -65 -33 -15 -11 -10 -3 4 8 2 -10 -23 -25 -18
17248 -18 -13 -23 -46 -69 -86 -100 -115 -126 -122 -104 -87 -90 -112 -135 -139 -119 -85 -46 -9 22 49 70 84 94 98 94 81 53 6 -51 -98 -116 -108 -94 -92 -98 -96 -71 -25 20
17230 20 40 27 0 -11 0 14 12 -5 -26 -44 -60 -78 -89 -86 -75 -67 -63 -53 -37 -21 -19 -32 -49 -61 -69 -79 -93 -107 -114 -115 -114 -109 -98 -81 -67 -63 -63 -59 -54 -62 -91 -130
17212 -130 -152 -143 -115 -91 -77 -62 -32 6 36 41 26 7 -3 -8 -18 -45 -83 -116 -124 -101 -60 -16 24 62 90 97 84 68 57 41 4 -49 -91 -98 -75 -48 -35
17196 -35 -31 -16 12 36 35 11 -12 -19 -13 -12 -18 -23 -19 -6 17 47 67 60 34 13 13 16 2 -20 -25 1 39 61 56 35 13 -4 -25 -55 -89 -115 -127 -128 -124 -113 -89 -53
$$ packed form
17324fK1J8Lj5k1j0JPJ0J1QMlj0j6j8k6m0n2m7k0J4L3K9J1nnOJ4Lj8k3kK4L7L7L3K1jk9m9
17306g1n2l6mL7N9M6Rj5j9k4l4l5j3J5K7K4K3K6K1J0MPJ1Npj2rpmJJ0J8K0J5QNjj0k1k9l2
17289c4k7pJ7K5Lk7l1JL7M3K0jl%nj1rKJ8L5M3L2Mk6l5k3kONlj2k3k9k3pKlj3rMOmqKJ5J9
17269c6J6J9K3K0Onrrj4j1njkl%lj7l1k8j2KLlnjPJ5J7J3Nkj3k0j5PK7L2J8MJPPMoj2j3kP
17248a8Nj0k3k3j7j4j5j1MJ8J7lk2k3mK0L4L9L7L1K7K1J4J0Mmj3k8m7n7m7j8QJ4KoKK5M6M5
17230B0K0j3k7j1J1J4kj7k1j8j6j8j1LJ1QMJ0J6J6Kj3j7j2qj0j4j4pjJNJ1J7J4M%MNqk9l9
17212a30k2RK8K4J4J5L0L8L0Nj5j9j0nj0k7l8l3qK3M1M4M0L8K8Pj3j6j1j6l7n3m2pK3K7J3
17196c5MJ5K8K4jk4k3pOJonMJ3K3L0K0pk6k1%Lj4k2nK6L8K2nk1k2j7k1l0l4k6j2jMJ1K4L6
$$ plain form
17178 -53 -15 21 55 83 100 102 94 86 82 83 89 97 100 89 62 29 6 1 10 16 11 2 -3 -8 -14 -21 -30 -44 -58 -67 -66 -70 -89 -117 -126 -102 -54 -6 25 39 43 42 44 50 59 63 52 19 -25
17157 -25 -60 -67 -49 -24 -3 19 52 88 117 138 152 154 138 114 97 89 77 49 13 -15 -31 -38 -41 -35 -20 1 19 25 16 -5 -34 -58 -65 -52 -29 -10 -5 -14 -34 -58
17139 -58 -80 -94 -101 -107 -117 -127 -133 -136 -137 -131 -116 -94 -72 -51 -30 -12 -8 -25 -56 -87 -101 -93 -64 -28 0 19 38 68 109 147 162 151 123 95 74 57 43 38 41 42
17122 42 31 17 15 28 43 51 53 47 22 -22 -66 -85 -76 -53 -32 -20 -14 -8 6 27 40 40 36 39 42 34 18 10 18 35 49 56 53 31 -11 -56 -85 -95 -95 -93 -89 -79 -68 -59 -56
17103 -56 -54 -50 -41 -29 -19 -13 -5 3 2 -18 -47 -64 -67 -74 -99 -131 -152 -161 -168 -178 -188 -190 -180 -162 -146 -144 -152 -153 -139 -121 -113 -105 -78 -32 11 37 44 32 4 -26 -45 -50 -56 -68 -76
17083 -76 -68 -45 -21 -5 -6 -22 -42 -48 -40 -33 -33 -31 -24 -28 -46 -54 -32 2 16 1 -23 -44 -60 -66 -56 -41 -37 -41 -33 -10 11 20 20 19 22 28 36 41 47 63 87 98 89 94 147 257
17063 257 443 760 1214 1649 1816 1611 1188 802 565 425 314 229 184 160 142 138 151 156 133 97 70 54 43 41 52 67 66 42 -1 -51 -91
17050 -91 -111 -117 -120 -116 -92 -57 -33 -20 3 42 70 65 33 -3 -28 -32 -14 3 -4 -35 -57 -57 -56 -73 -97 -105 -96 -78 -46 -2 29 32 17 2 -13 -40 -64 -73 -72 -77 -82 -77 -73
$$ packed form
17178e3L8L6L4K8J7KqqmJOQLj1k7l3k3nROnrnnoprj4j4rJmj9k8rK4M8M8L1J4MjKORMj1l3m4
17157b5l5pJ8K5K1K2L3L6K9K1J4Kj6k4j7qj2k8l6k8j6plOJ5K1J8Ork1k9k4pJ3K3J9Nrk0k4
17139e8k2j4poj0j0oljOJ5K2K2K1K1J8Mj7l1l1j4QK9L6K8J9J9L0M1L8J5j1k8k8k1j7j4nLJ
17122D2j1j4kJ3J5QKok5m4m4j9RK3K1J2OOJ4K1J3%mLLqj6qQJ7J4Plk2m2m5k9j0%KMJ0J1RL
17103e6KMRJ2J0OQQjk0k9j7lpk5l2k1rpj0j0kJ0J8J6KqjJ4J8QQK7M6M3K6Pj2k8l0j9noj2q
17083g6QK3K4J6jj6k0oQP%KPmj8qK2L4J4j5k4k1j6oJ0J5MmQK3K1R%jLOQNOJ6K4J1rNN3J10
17063B57J86L17M54M35J67k05m23l86k37j40j11q5m5k4j8mJ3Nk3l6k7j6j1kJ1J5jk4m3n0m0
17050i1k0olMK4L5K4J3K3L9K8nl2l6k5mJ8J7pl1k2%Jj7k4qRJ8L2M4L1Lj5j5j5k7k4rJnnNM
$$ plain form
17031 -73 -91 -120 -133 -122 -103 -86 -72 -63 -61 -48 -9 45 99 152 209 257 291 348 466 638 876 1267 1858 2468 2741 2477 1853 1234 832 600
17018 600 427 293 225 208 198 180 157 127 88 49 12 -29 -73 -91 -73 -47 -44 -57 -52 -20 17 40 53 71 96 117 119 97 57 10 -32 -66 -80 -77 -72 -81
17002 -81 -97 -102 -89 -73 -64 -50 -20 13 31 28 17 14 22 37 53 70 94 124 146 145 125 106 103 112 123 131 134 127 110 99 100 105 104 96 88 84 84 87 94 100 102 96 81 55 26 8
16983 8 5 9 11 14 22 22 9 -7 -16 -23 -39 -62 -77 -80 -78 -76 -67 -54 -45 -39 -33 -31 -38 -53 -63 -66 -65 -56 -34 -4 12 9 0 0 9 22 36 43 33 3 -26 -43 -52 -61 -67 -65 -69 -92 -127 -150
16961 -150 -142 -106 -52 6 53 74 74 69 70 67 50 21 -8 -28 -32 -19 1 19 28 27 17 -2 -25 -40 -40 -29 -17 -11 -8 -5 -2 0 1 -2 -10 -21 -24 -14 0 0 -20 -42 -42 -25
16942 -25 -18 -27 -31 -20 -14 -33 -63 -78 -76 -76 -88 -98 -100 -96 -88 -77 -66 -60 -47 -17 24 55 60 44 22 4 -6 -10 -13 -20 -23 -19 -20 -32 -45 -44 -33 -20 2 40 79 97 106 134
16923 134 174 211 261 360 513 726 1083 1662 2326 2721 2588 2041 1437 1008 724 491 307 206 154 103 67 78 106 107 93 98 111 104 99
16910 99 134 196 242 283 363 482 620 830 1190 1635 1925 1857 1482 1031 689 484 364 299 273 258 227 180 135 101 70 30 -20 -72 -108
$$ packed form
17031g3j8k9j3J1J9J7J4RKJ3L9N4N4N3N7M8L4N7J18J72K38L91N91O10K73k64o24o19m02k32
17018F00j73j34o8j7j0j8k3l0l9l9l7m1m4j8J8K6Lj3NL2L7K3J3J8K5K1Kk2m0m7m2l4j4LNr
17002h1j6nJ3J6RJ4L0L3J8lj1lQJ5J6J7K4L0K2jk0j9lRJ1QLpj7j1JNjqqm%LPOKoj5k6k9j8
16983HlMKLQ%j3j6rpj6k3j5lKKRJ3ROOKpj5j0lJRK2L0J6lr%RJ3J4Pj0l0k9j7rroKmk3l5k3
16961a50QL6N4N8M7K1%nJlj7k9k9k0mJ3K0J8Rjj0j9k3j5%J1J2OLLLKJlqj1lJ0J4%k0k2%J7
16942b5PrmJ1Oj9l0j5K%j2j0kMQJ1J1OJ3L0M1L1Nj6k2j8j0mlplMjj2j3JJ1J3K2L8L9J8RK8
16923A34M0L7N0R9J53K13L57N79O64L95j33n47o04m29k84k33j84j01n2n1l6J1K8Jj4NJ3pn
16910I9L5O2M6M1Q0J19J38K10L60M45K90o8l75m51l42k05j20o5k6j5l1m7m5l4l1m0n0n2l6
$$ plain form
16898 -108 -118 -110 -94 -72 -44 -18 -3 5 14 19 13 1 -1 5 4 -8 -15 -4 11 18 20 34 52 55 36 18 21 45 72 87 86 68 33 -11 -50 -73 -80 -85 -95 -101 -95 -85 -83 -88
16878 -88 -87 -76 -70 -78 -89 -88 -80 -77 -73 -53 -12 33 69 88 85 62 37 31 36 26 -2 -21 -14 -5 -26 -59 -63 -32 0 15 33 65 89 83 63 59 69 69 53 43 53 71 80
16860 80 73 53 26 4 2 22 48 65 67 62 57 62 75 83 70 32 -11 -42 -57 -67 -73 -70 -56 -40 -39 -60 -89 -101 -86 -59 -43 -40 -35 -24 -19 -30 -46 -49 -33 -7 22 51
16842 51 73 86 95 110 129 143 145 140 134 129 125 121 120 119 115 103 73 28 -14 -36 -35 -29 -34 -43 -46 -40 -27 -8 16 41 54 59 64 70 63 34 -4 -35 -52 -65 -74 -70 -51 -30 -16 -5
16822 -5 14 35 41 27 2 -19 -36 -48 -53 -55 -54 -51 -41 -30 -32 -53 -82 -108 -131 -149 -149 -128 -102 -89 -87 -76 -50 -23 -12 -15 -27 -42 -49 -35 -8 8 -2 -37 -77 -105
16804 -105 -112 -97 -72 -55 -52 -52 -41 -26 -19 -24 -41 -62 -74 -66 -34 9 51 86 107 103 73 38 24 32 39 34 31 44 62 58 25 -17 -47 -55 -46 -27 -6 7 10 7 7 10 6 -10
16785 -10 -33 -51 -61 -69 -79 -89 -99 -103 -92 -61 -24 -7 -17 -43 -69 -88 -99 -97 -85 -77 -82 -90 -88 -76 -67 -75 -97 -125 -152 -176 -195 -203 -196 -174 -150 -133 -123 -114 -105 -98 -82 -49
16767 -49 -11 5 0 -3 7 11 -10 -42 -55 -47 -38 -32 -21 -11 -15 -29 -29 -6 16 25 31 50 71 71 47 20 13 30 55 65 55 42 47 68 81 71 42 10 -19 -45 -60
$$ packed form
16898a08j0QJ6K2K8K6J5QRNoj2kOjj2pJ1J5PKJ4J8Lj9j8LK4K7J5jj8l5m4l9k3pnj0oOJ0Kn
16878h8JJ1Oqj1JQLMK0M1M5L6J9lk3k5oNj0k8j9PRk1l3mL1L2J5J8L2K4ok0mJ0%j6j0J0J8R
16860H0pk0k7k2kK0K6J7KnnNJ3Qj3l8m3l1j5j0oLJ4J6Jk1k9j2J5K7J6LNJ1Nj1j6lJ6K6K9K9
16842E1K2J3RJ5J9J4Knonmmjjmj2l0m5m2k2JOnrlOJ3J9K4K5J3NNOpk9l8l1j7j3rMJ9K1J4J1
16822eJ9K1Oj4k5k1j7j2nkJLJ0J1kk1k9k6k3j8%K1K6J3KJ1K6K7J1lj2j5pJ4K7J6j0l5m0k8
16804a05pJ5K5J7L%J1J5Pnj7k1j2QL2M3M2L5K1ml0l5j4QPnlJ3J8ml3m2l0qRJ9K1J3Ll%Lmj6
16785a0k3j8j0qj0j0j0mJ1L1L7J7j0k6k6j9j1KJ2QnqKJ2Rqk2k8k7k4j9qPK2K4J7J0RRPJ6L3
16767d9L8J6nlJ0Mk1l2j3QROJ1J0mj4%K3K2ROJ9K1%k4k7pJ7K5J0j0j3NK1J3j0k9l2k9k6j5
$$ plain form
16749 -60 -62 -55 -47 -37 -28 -24 -27 -34 -45 -56 -54 -27 16 49 54 41 26 7 -19 -42 -47 -41 -33 -17 10 32 23 -16 -64 -97 -107 -99 -81 -74 -89 -113 -121 -111 -101 -100 -95 -81 -66 -61
16730 -61 -58 -52 -49 -53 -48 -22 10 24 13 -4 -11 -12 -15 -23 -26 -15 10 40 55 46 27 14 8 -8 -43 -82 -108 -125 -148 -172 -169 -126 -64 -15 15 37 56 64 60 54 49 38 21
16712 21 9 6 -1 -22 -49 -70 -88 -108 -117 -97 -52 -9 10 7 -10 -28 -35 -26 -12 -5 -5 -8 -17 -41 -67 -66 -32 11 34 31 13 -7 -31 -55 -69 -69 -55 -33 -14 -7 -12 -23
16693 -23 -35 -47 -59 -70 -80 -91 -98 -98 -99 -109 -114 -95 -56 -23 -17 -26 -27 -16 -2 6 5 -7 -27 -42 -52 -70 -100 -124 -124 -110 -103 -100 -81 -47 -22 -22 -30 -22 3 25 35 42 56
16675 56 70 69 48 11 -37 -90 -135 -159 -157 -137 -113 -89 -67 -51 -44 -39 -22 7 32 38 29 17 14 27 51 70 69 54 43 47 57 59 52 32 2 -20 -15 15 42 52 63
16657 63 94 129 142 138 137 135 114 79 59 61 60 42 27 40 69 85 69 27 -22 -59 -66 -42 -7 20 36 42 36 10 -26 -53 -54 -37 -30 -50 -83 -95 -70 -28 0 8
16640 8 8 4 -11 -27 -28 -13 -3 -4 -5 -1 -10 -42 -77 -92 -90 -83 -74 -60 -49 -48 -48 -39 -30 -39 -68 -93 -93 -67 -29 2 19 16 1 -23 -56 -85 -93 -74 -45 -27 -19 -9 6 18 18
16620 18 8 -9 -35 -60 -73 -70 -60 -56 -67 -87 -105 -102 -75 -34 1 24 30 18 -10 -48 -88 -125 -146 -138 -103 -72 -71 -93 -112 -117 -116 -111 -90 -50 -11 4 -3 -28 -54 -72
$$ packed form
16749f0kPQJ0RMlpj1j1KK7M3L3Nj3j5j9k6k3nOQJ6K7K2rl9m8l3j0QJ8Pj5k4qJ0J0JNJ4J5N
16730f1LOLmNK6L2J4j1j7pjlqlJ1K5L0J5rj9j3oj6l5l9k6j7k3k4LM3O2M9L0K2J9Qmonj1j7
16712B1j2lpk1k7k1j8k0rK0M5M3J9lj7j8pRJ4P%lrk4k6JL4M3K3lj8k0k4k4j4%J4K2J9Pnj1
16693b3j2j2j2j1j0j1p%jj0nJ9L9L3OrjJ1J4Qjj2k0j5j0j8l0k4%J4PLJ9L4K5%qQK5K2J0PJ4
16675E6J4jk1l7m8n3m5k4KK0K4K4K2J6PNJ7K9K5Orj2lJ3K4J9jj5j1MJ0Kpk0l0k2NL0K7J0J1
16657F3L1L5J3mjkk1l5k0Kjj8j5J3K9J6j6m2m9l7pK4L5K7J6Ook6l6k7jJ7Pk0l3j2K5M2K8Q
16640H%mj5j6jJ5J0jjMrl2l5j5KPRJ4J1J%RRrk9k5%K6L8L1J7lj5k4l3k9qJ9K9J8QJ0J5J2%
16620A8j0j7k6k5j3LJ0Mj1k0j8LK7M1L5K3Oj2k8l8m0l7k1QL5L1Jk2j9nJNK1M0L9J5pk5k6j8
$$ plain form
16603 -72 -77 -74 -70 -67 -65 -64 -66 -65 -58 -54 -63 -82 -96 -99 -101 -110 -122 -135 -152 -174 -193 -203 -198 -179 -142 -96 -57 -37 -36 -45 -48 -30 13 59 83 83 78 73 55 18 -20 -43 -54 -64 -70 -64
16583 -64 -52 -45 -44 -47 -56 -67 -67 -49 -25 -12 -9 -5 -2 -9 -23 -33 -34 -30 -22 -4 20 39 48 53 55 43 10 -30 -56 -56 -46 -41 -45 -44 -31 -12 -2 -3 -2 6 20 39 71 112 144 148
16563 148 131 113 105 96 74 47 31 39 64 91 102 96 85 79 72 60 51 59 84 110 120 118 117 124 135 134 111 70 34 21 27 34 29 14 -5 -20 -17 8 47 76 82 70 40
16544 40 -2 -47 -67 -52 -26 -20 -42 -70 -80 -66 -38 -15 -11 -27 -54 -79 -93 -92 -77 -50 -18 8 21 19 6 -4 -8 -14 -34 -60 -68 -46 -10 16 23 15 5 1 6 19
16527 19 29 34 45 66 90 99 91 80 77 74 64 45 22 1 -20 -43 -64 -74 -67 -49 -37 -48 -84 -123 -141 -133 -113 -99 -92 -85 -71 -55 -43 -39 -44 -57 -72 -74 -53 -19 5
16509 5 7 -5 -16 -20 -22 -19 -6 13 25 19 -6 -41 -69 -81 -79 -72 -63 -45 -12 21 36 24 6 4 20 38 46 44 37 31 31 42 57 66 62 47 24 1 -9 0 26 53 72 80
16490 80 78 62 37 22 31 53 62 44 10 -18 -23 0 49 103 137 142 127 106 86 70 61 58 52 39 23 9 -10 -46 -94 -137 -160 -160 -143 -117 -97 -92 -102 -113 -109 -87
16473 -87 -55 -20 6 18 14 7 11 31 60 84 95 93 81 61 33 0 -35 -69 -105 -142 -165 -159 -132 -104 -84 -61 -32 -13 -22 -50 -72 -77 -71 -62 -50 -37 -33 -51 -92 -139
$$ packed form
16603g2nLMLKJkJPMrj9j4lkrj2j3j7k2j9j0NJ9L7M6L9K0JrlJ8M3M6K4%nnj8l7l8k3j1j0oO
16583f4J2PJlrj1%J8K4J3LMLpj4j0jMQJ8K4J9RNKj2l3m0k6%J0NmJJ3J9J0jJQJ4J9L2M1L2M
16563A48j7j8qrk2k7j6QK5K7J1oj1opj2rQK5K6J0kjPJ1jk3m1l6j3OPnj5j9j5LK5L9K9Oj2l0
16544D0m2m5k0J5K6Ok2k8j0J4K8K3Mj6k7k5j4JJ5K7L2K6J3kj3j0mok0k6qK2L6K6Pqj0mNJ3
16527A9J0NJ1K1K4Rqj1llj0j9k3k1k1k3k1j0PJ8J2j1l6l9j8QK0J4PPJ4J6J2Mnj3j5kK1L4K4
16509EKj2j1mkLJ3J9J2ok5l5k8j2KPRJ8L3L3J5j2j8kJ6J8Qkpo%J1J5Rmj5k3k3j0RK6K7J9Q
16490H0kj6k5j5RK2Rj8l4k8nK3M9N4L4Nj5k1k0j6rloj3j6j4j9l6m8m3k3%J7K6K0Nj0j1MK2
16473h7L2L5K6J2mpMK0K9K4J1kj2k0k8l3l5l4l6l7k3OK7K8K0K3K9J9rk8k2nORJ2J3Mj8m1m7
$$ plain form
16455 -139 -164 -147 -97 -48 -28 -31 -39 -41 -43 -47 -47 -44 -42 -40 -31 -15 -5 -12 -25 -37 -54 -78 -98 -96 -73 -47 -25 -1 27 56 80 103 121 125 115 110 127 157 177 176 164 155
16437 155 149 137 120 103 86 63 32 1 -23 -41 -51 -46 -20 18 47 50 39 37 53 71 68 44 15 -9 -35 -63 -84 -89 -84 -82 -86 -90 -95 -103 -114 -119 -108 -85 -59 -37 -22
16419 -22 -11 -1 11 20 21 18 26 48 67 64 34 -8 -49 -77 -91 -100 -111 -123 -131 -134 -139 -145 -139 -113 -81 -59 -48 -35 -21 -16 -29 -52 -69 -69 -48 -12 23 44 42 29 16 9
16401 9 4 3 11 29 49 67 85 104 113 99 65 35 30 44 54 55 63 89 116 115 85 48 23 12 12 25 48 61 48 17 -10 -18 -8 0 -6 -27 -44 -35 -4 23 26 10
16383 10 0 13 44 71 84 79 62 43 29 24 27 31 28 17 5 -3 -6 -7 -14 -32 -59 -82 -87 -71 -54 -59 -92 -142 -191 -220 -221 -193 -159 -141 -139 -131 -103 -62 -26 -3 13 24
16365 24 28 28 25 13 -6 -21 -16 8 33 44 31 -8 -75 -147 -194 -200 -177 -141 -100 -55 -15 4 3 -12 -37 -73 -113 -142 -149 -134 -105 -75 -55 -53 -58 -50 -21 8 20 16
16347 16 23 52 88 107 105 98 99 110 119 115 97 76 69 78 91 94 86 77 64 35 -8 -49 -65 -53 -29 -5 8 4 -18 -48 -67 -70 -69 -87 -131 -187 -227 -227 -189 -140 -110 -101 -96
16329 -96 -82 -65 -55 -47 -34 -19 -11 -11 -15 -23 -32 -31 -12 14 22 2 -25 -39 -39 -36 -28 -6 28 58 70 70 68 64 58 62 89 131 159 156 131 113 124 164 210 248 291 364 474
$$ packed form
16455a39k5J7N0M9K0lqkkm%LKKRJ6J0pj3j2j7k4k0KK3K6K2K4K8K9K4K3J8Mj0nJ7L0K0jj2r
16437A55oj2j7j7j7k3l1l1k4j8j0NK6L8K9Lj1kJ6J8lk4k9k4k6k8k1nNKmmnqj1nJ1K3K6K2J5
16419b2J1J0J2RJlQK2J9ll0m2m1k8j4rj1j2qlnoOK6L2K2J1J3J4Nj3k3j7%K1L6L5K1kj3j3p
16401InjQJ8K0J8J8J9Rj4l4l0nJ4J0JQK6K7jl0l7k5j1%J3K3J3j3l1k7qJ0Qok1j7RL1K7Lj6
16383A0j0J3L1K7J3nj7j9j4nLMlj1j2qljpj8k7k3nJ6J7nl3n0m9k9jK8L4J8KQK8M1L6K3J6J1
16365B4M%lj2j9j5NK4K5J1j3l9o7p2m7oK3L6M1M5M0J9jj5k5l6m0k9pJ5K9L0K0KnQK9K9J2m
16347A6PK9L6J9kpJJ1Rmj8k1pRJ3Lqrj3k9m3m1j6J2K4K4J3mk2l0j9lJj8m4n6m0%L8M9L0RN
16329i6J4J7J0QJ3J5Q%mqrJJ9K6Qk0k7j4%LQK2L4L0J2%kmoMK7M2K8lk5j8J1M0M6L8M3P3J10
$$ plain form
16310 474 607 764 969 1206 1378 1371 1169 879 630 470 365 274 184 101 29 -23 -51 -62 -69 -73 -64 -44 -24 -7 8 26 41 58 78 93 90 69
16296 69 54 62 89 117 135 144 152 156 145 106 49 1 -17 -17 -21 -35 -38 -21 4 19 19 10 -2 -16 -24 -21 -6 14 33 41 38 31 29 29 29 36 57 81 90 82 72 74 90 125 180
16277 180 245 308 377 470 590 748 998 1385 1835 2142 2131 1826 1403 1023 742 552 437 373 319 258 212 193 182 160 136 125 118 99 72
16264 72 53 41 30 29 46 65 61 38 21 26 37 37 27 19 27 54 92 123 128 112 93 80 70 58 44 33 26 25 30 32 21 -8 -46 -69 -63 -31 7 36 51 60 63 53
16246 53 28 3 -1 14 43 79 121 157 176 188 211 256 327 430 571 743 950 1222 1574 1929 2121 2033 1711 1319 992 763 601 477
16234 477 380 296 215 149 117 123 149 172 184 193 211 237 253 240 199 154 127 126 147 184 227 275 331 397 472 572 734 974 1221 1344 1267 1041 786
16220 786 580 423 294 198 141 112 95 84 79 67 43 14 -4 -17 -35 -62 -87 -100 -97 -81 -65 -60 -61 -52 -24 12 39 53 58 55 45 34 25 16 9 13 36 63
16203 63 69 46 14 -1 4 17 22 8 -21 -52 -68 -71 -77 -99 -129 -148 -144 -118 -85 -62 -58 -67 -80 -86 -83 -73 -63 -58 -56 -48 -24 11 38 39 10 -36 -88 -128 -144 -137 -121 -114 -117
$$ packed form
16310D74J33J57K05K37J72pk02k90k49j60j05r1r0q3p2n2k8j1pmRK0K0J7J5J8J5J7K0J5lk1
16296F9j5QK7K8J8RQMj1l9n7m8j8%mj4lJ7K5J5%rj2j4qLJ5K0J9Qlpk%%PK1K4Rqj0KJ6L5N5
16277A80O5O3O9R3J20J58K50L87M50L07j1l05m23l80k81j90j15o4n4o1m6j9j1k2k4j1pj9k7
16264G2j9j2j1jJ7J9mk3j7NJ1%j0qQK7L8L1Nj6j9j3j0j2j4j1pjNKj1k9l8k3OL2L8K9J5RLj0
16246E3k5k5mJ5K9L6M2L6J9J2K3M5P1J03J41J72K07K72L52L55J92q8l22l92l27k29j62j24
16234D77r7q4q1o6l2OK6K3J2RJ8K6J6j3m1m5k7jK1L7M3M8N6O6P5J00J62K40K47J23p7k26k55
16220G86k06j57j29r6n7k9j7j1nj2k4k9j8j3j8k7k5j3LJ6J6NjRK8L6K7J4Nlj0j1rrpMK3K7
16203F3Ok3l2j5NJ3Nj4k9l1j6lok2l0j9MK6L3K3Mrj3oLJ0J0NKQK4L5K7Jk9m6n2m0j6PJ6Pl
$$ plain form
16184 -117 -124 -132 -145 -157 -158 -136 -100 -67 -51 -57 -79 -102 -108 -83 -39 0 17 20 22 22 10 -5 -9 3 16 11 -7 -28 -44 -51 -43 -13 26 51 54 50 50 43 13 -34 -69 -71 -48
16166 -48 -25 -24 -38 -47 -32 1 30 40 33 21 5 -17 -47 -68 -69 -53 -35 -27 -31 -39 -42 -36 -26 -26 -38 -47 -38 -10 13 20 14 7 -3 -25 -53 -70 -73 -79 -105 -141 -167 -172 -155 -125
16147 -125 -91 -67 -59 -57 -54 -50 -50 -49 -40 -28 -22 -19 -16 -17 -29 -44 -39 -13 5 -6 -45 -87 -111 -110 -90 -67 -56 -61 -67 -63 -53 -53 -67 -83 -84 -66 -44 -32 -30 -24 -3 18 27 21 6
16127 6 -19 -56 -89 -97 -87 -81 -82 -69 -35 1 16 7 -13 -41 -71 -92 -95 -88 -77 -55 -24 0 11 25 55 86 95 95 117 158 180 164 122 72 23 -11 -15 7 26 25
16110 25 19 30 53 67 67 68 79 91 95 83 53 17 -1 15 64 113 136 122 81 32 -6 -33 -54 -74 -81 -61 -18 23 45 52 56 56 42 12 -11 -6 26 65 86
16093 86 81 57 22 -16 -49 -66 -65 -57 -47 -38 -30 -30 -49 -84 -118 -130 -117 -90 -60 -26 9 30 20 -12 -35 -30 -11 -3 -12 -32 -60 -100 -140 -163 -163 -151 -138 -115 -76 -28
16076 -28 6 17 8 -5 -14 -18 -20 -11 13 40 42 11 -27 -44 -37 -22 -10 -4 -6 -13 -11 5 28 42 49 62 73 65 38 17 19 33 42 38 24 7 -2 0 7 0 -22 -45 -56 -63 -78
16056 -78 -101 -122 -133 -126 -106 -87 -83 -92 -97 -89 -67 -34 5 40 62 73 80 72 45 15 6 19 39 69 110 139 128 97 86 94 84 59 60 103 157 204 268 356 444 533
$$ packed form
16184a17pqj3j2jK2L6L3J6ok2k3oK5M4L9J7LK%j2j5mJ2J3nj8k1j6pQL0L9K5Lm%pl0m7l5kK3
16166d8K3Jj4rJ5L3K9J0pj2j6k2l0k1jJ6J8QmqlOJ0%j2rRK8K3Popj0k2k8j7lok6l6k6nJ7L0
16147a25L4K4QKLM%JRJ2OLLjj2j5NK6J8j1l9m2k4JK0K3J1noMJ0%j4j6jJ8K2J2KOK1K1Roj5
16127Fk5l7l3qJ0OjJ3L4L6J5rk0k8l0k1lPJ1K2L1K4J1J4L0L1R%K2M1K2j6m2n0m9l4mK2J9j
16110B5oJ1K3J4%JJ1J2Mj2l0l6j8J6M9M9K3j4m1m9l8k7k1k0pK0M3M1K2PM%j4l0k3NL2L9K1
16093H6nk4l5l8l3j7JQJ0RQ%j9l5l4j2J3K7L0L4L5K1j0l2k3NJ9Qrk0k8m0m0k3%J2J3K3L9M8
16076b8L4J1rj3rmkRK4K7Kl1l8j7PJ5J2OkpKJ6K3J4PJ3J1qk7k1KJ4Rmj4j7rKPpk2k3j1pj5
16056g8k3k1j1PK0J9MrnQK2L3L9L5K2J1Pqk7l0rJ3K0L0M1K9j1l1j1Qj0k5JM3N4M7O4Q8Q8Q9
$$ plain form
16039 533 660 833 1050 1402 2022 2834 3447 3466 2906 2163 1601 1287 1107 987 929 940 1032 1230 1561 2063 2802 3754 4633 4969
16028 4969 4508 3494 2442 1683 1211 897 691 586 533 468 390 326 282 248 227 221 213 189 159 134 95 25 -49 -90 -89 -72 -51 -29 -10 -7 -17
16015 -17 -23 -16 -2 20 61 118 172 212 246 276 287 285 300 361 469 648 969 1450 1933 2141 1931 1450 989 705 553 443 368 342 335 303 261
16002 261 247 254 240 192 133 76 19 -26 -38 -20 -1 6 14 22 20 10 18 54 90 99 86 75 77 84 78 51 11 -21 -33 -26 -9 17 46 56 37 8 0 3 -11 -45 -63
15984 -63 -46 -27 -43 -87 -119 -123 -113 -107 -105 -101 -90 -72 -54 -48 -59 -71 -64 -40 -16 -9 -16 -19 -9 10 25 28 25 26 25 7 -25 -50 -46 -20 0 -1 -16 -24 -16 -2 4 8 25 59
15965 59 85 82 66 69 99 127 131 112 83 47 10 -10 -6 10 23 30 31 20 -7 -35 -41 -21 8 27 28 12 -7 -18 -20 -25 -37 -42 -30 -14 -15 -32 -43 -36 -19 -1 11
15947 11 16 14 11 14 20 19 11 0 -16 -42 -77 -109 -126 -127 -118 -110 -105 -94 -61 -7 45 75 80 72 56 27 -3 -17 -13 -6 -12 -30 -49 -64 -70 -66 -58 -57 -68 -82 -95 -111 -133 -147 -138
15927 -138 -114 -100 -109 -130 -138 -121 -88 -67 -74 -99 -115 -110 -96 -87 -82 -74 -67 -68 -75 -76 -62 -45 -36 -41 -54 -66 -75 -82 -88 -93 -97 -101 -107 -109 -106 -97 -88 -85 -92 -107 -119 -117 -93 -58 -30 -26 -47 -85
$$ packed form
16039E33J27J73K17L52O20Q12O13J9n60p43n62l14j80j20n8J1R2J98L31N02P39R52Q79L36
16028D969m61j014j052p59m72l14k06j05n3o5p8o4m4l4k1oqk4l0k5l9p0p4m1JJ7K1K2J9Lj0
16015a7oPJ4K2M1N7N4M0L4L0J1kJ5O1J08J79L21M81M83K08k10m81m61k84j52j10p5k6pl2m2
16002B61j4Pj4m8n9n7n7m5j2J8J9PQQkj0QL6L6Rj3j1KPok7m0l2j2PJ7K6K9J0j9k9qLj4l4j8
15984f3J7J9j6m4l2mJ0OKMJ1J8J8Oj1j2PK4K4PplJ0J9J5LlJjj8l2k5MK6K0jj5qQJ4OMJ7L4
15965E9K6lj6LL0K8Mj9k9l6l7k0MJ6J3PJj1k7k8oK0K9J9Jj6j9j1knj2nJ2J6jj7j1PJ7J8J2
15947A1NklLOjqj1j6k6l5l2j7jRQNJ1L3N4N2L0Nqj6k9l0j4MPoj8j9j5oMQJj1j4j3j6k2j4R
15927a38K4J4rk1qJ7L3K1pk5j6NJ4RNQPjpjJ4J7Rnj3j2rponmmokLRRLpj5j2KK4L5K8Mk1l8
$$ plain form
15907 -85 -123 -153 -173 -181 -174 -145 -104 -73 -63 -65 -63 -54 -47 -37 -12 30 77 108 116 101 74 53 50 57 50 17 -22 -39 -23 10 37 42 29 10 -4 -14 -26 -40 -52 -60 -63
15889 -63 -58 -43 -25 -24 -43 -64 -68 -60 -56 -59 -57 -43 -22 -2 13 24 26 20 12 7 6 8 11 12 10 5 0 0 8 23 30 11 -23 -49 -49 -41 -47 -58 -51 -22 -2 -17 -56 -92 -111 -119 -123 -121 -103
15868 -103 -71 -33 -4 5 -4 -17 -17 -3 13 26 38 51 62 63 49 27 12 15 34 47 41 19 -1 -12 -23 -41 -66 -82 -76 -47 -12 4 -7 -35 -52 -42 -17 3
15851 3 20 41 68 92 106 112 113 109 98 88 88 102 129 158 167 144 99 58 42 50 68 83 89 83 67 54 53 55 48 26 0 -23 -41 -60 -83 -100 -97 -67 -22 15 34
15833 34 40 43 38 18 -7 -24 -32 -45 -70 -96 -111 -114 -106 -80 -41 -8 3 0 1 6 3 -14 -33 -43 -50 -63 -73 -62 -31 -3 -1 -20 -41 -52 -56 -65 -81 -95 -102 -100 -92 -82 -69
15815 -69 -46 -14 15 26 17 1 -6 -7 -5 -6 -10 -20 -34 -44 -43 -40 -40 -38 -27 -17 -27 -59 -97 -121 -123 -100 -59 -12 22 39 44 44 42 45 52 56 41 8 -29 -63 -92 -111 -111 -96
15796 -96 -88 -94 -103 -100 -88 -76 -59 -31 -3 8 10 21 47 75 85 73 46 22 11 11 8 0 -2 1 5 1 -2 0 0 -4 -3 11 23 1 -52 -112 -159 -191 -206 -191 -144 -90 -59
15777 -59 -62 -95 -140 -169 -161 -128 -102 -95 -82 -50 -13 5 7 11 17 12 -4 -18 -15 -2 8 14 17 22 30 39 45 48 52 55 53 44 35 27 10 -22 -57 -71 -58 -35 -24 -29 -37 -32 -9 19 37
$$ packed form
15907h5l8l0k0qPK9M1L1J0kKRPJ0K5M2M7L1Qj5k7k1lPpl3l9j7J6L3K7Nj3j9j4j0j2j4j2ql
15889f3NJ5J8Jj9k1mQMlKJ4K1K0J5J1KoqnjKLJknn%QJ5Pj9l4k6%Qoj1PK9K0j5l9l6j9qmKJ8
15868a03L2L8K9Rrj3%J4J6J3J2J3J1Jj4k2j5LJ9J3ok2k0j1j1j8k5j6OK9L5J6j1k8j7J0K5K0
15851CJ7K1K7K4J4OJmj1j0%J4K7K9Rk3m5m1j6QJ8J5Ooj6j3jKpk2k6k3j8j9k3j7LL0M5L7J9
15833C4OLnk0k5j7qj3k5k6j5lQK6L9L3J1lJNlj7j9j0pj3j0J1L1K8Kj9k1j1mrj6j4pKQJ0J3
15815f9K3L2K9J1rj6pjKjmj0j4j0JL%KJ1J0j0l2l8k4kK3M1M7L4J7N%kLPMj5l3l7l4k9j9%J5
15796i6QorLJ2J2J7K8K8J1KJ1K6K8J0j2k7k4j1%lqkLMmlK%mJJ4J2k2n3o0m7l2j5J5M7N4L1
15777e9ll3m5k9QL3K6PJ3L2L7J8KMOnj6j4LJ3J0OLNQROLMLkrrqj7l2l5j4J3K3J1nqNK3K8J8
$$ plain form
15757 37 33 12 -7 -15 -13 -9 -10 -17 -32 -57 -86 -104 -97 -71 -46 -39 -45 -48 -44 -40 -40 -38 -32 -30 -36 -44 -42 -34 -35 -58 -97 -130 -138 -120 -93 -74 -61 -46 -30 -24 -28 -35 -39 -45 -50 -44 -28 -12 2
15735 2 30 70 98 97 81 76 82 77 51 18 -3 -3 8 14 -2 -36 -60 -56 -32 -13 -3 12 40 74 100 107 83 32 -16 -31 -15 0 -9 -34 -49 -43 -22 4 32 59
15718 59 77 75 51 14 -11 -11 6 10 -16 -71 -132 -175 -186 -166 -135 -113 -104 -98 -85 -65 -33 3 30 31 17 11 20 29 30 32 37 28 -4 -45 -76 -95 -112 -123 -115 -86 -51 -26
15700 -26 -20 -34 -53 -60 -49 -38 -42 -53 -54 -38 -11 15 31 24 -5 -38 -50 -35 -8 18 37 38 17 -14 -36 -38 -30 -21 -14 -4 7 18 28 34 31 21 8 -2 -12 -23 -39
15682 -39 -62 -90 -115 -133 -150 -166 -170 -147 -110 -93 -115 -164 -212 -240 -248 -245 -237 -230 -222 -204 -167 -114 -59 -22 -7 -1 11 28 32 13 -14 -34 -40 -39 -35 -21 -3 6 2 -8 -20
15664 -20 -36 -49 -47 -29 -12 -14 -30 -46 -58 -72 -85 -82 -59 -26 -3 3 -6 -28 -44 -37 0 46 77 82 71 57 46 38 37 44 53 54 44 24 0 -20 -18 13 60 97 117
15647 117 127 129 111 71 26 -3 -24 -49 -76 -86 -73 -52 -42 -47 -66 -90 -109 -112 -103 -90 -71 -43 -14 -5 -22 -45 -47 -26 -1 14 18 12 0 -9 -1 28 63 84 79 54
15629 54 28 16 16 16 8 5 17 43 69 83 82 66 46 32 27 21 0 -29 -49 -49 -45 -53 -73 -88 -85 -70 -55 -44 -40 -42 -53 -73 -102 -136 -170 -191 -189 -167 -139 -116 -99 -89
$$ packed form
15757C7mk1j9qKMjpj5k5k9j8PK6K5PolMM%KOKoqKQjk3l9l3qJ8K7J9J3J5J6OmpmonOJ6J6J4
15735BK8M0K8jj6nOnk6l3k1%J1Oj6l4k4MK4J9J0J5K8L4K6Pk4n1m8j5J6J5rk5j5OK1K6K8K7
15718E9J8kk4l7k5%J7Mk6n5o1m3j1K0L1K2ROJ3K0L2L6K7Jj4oRRJKNrl2m1l1j9j7j1QK9L5K5
15700b6Oj4j9pJ1J1mj1jJ6K7K6J6pk9l3j2J5K7K6J9Jk1l1k2kQRPJ0J1J1J0Olj0j3j0j0j1j6
15682c9k3k8k5j8j7j6mK3L7J7k2m9m8k8qLQPQJ8L7N3N5L7J5OJ2J7Mj9k7k0oJMJ4J8Rmj0j2
15664b0j6j3KJ8J7kj6j6j2j4j3LK3L3K3Ork2j6PL7M6L1Nj1j4j1qjPRJj0k0k4k0KL1M7L7K0
15647A17J0Kj8m0m5k9k1k5k7j0J3K1J0nj9k4j9lRJ3J9K8K9Rj7k3kK1K5J5Moj2rQK9L5K1nk5
15629E4k6j2%%qlJ2K6K6J4jj6k0j4nok1k9k0%Mqk0j5LJ5J5J1Mkj1k0k9l4l4k1KK2K8K3J7J0
$$ plain form
15611 -89 -97 -126 -158 -170 -153 -122 -91 -63 -40 -29 -31 -35 -34 -34 -41 -52 -66 -84 -101 -106 -97 -91 -98 -103 -86 -55 -31 -19 -7 5 5 -7 -14 3 35 62 78 86 83 67 45 24
15593 24 3 -9 -1 26 54 63 58 57 59 45 14 -11 -12 6 28 39 35 13 -22 -58 -77 -74 -54 -19 24 67 86 76 53 47 58 65 44 2 -36 -60 -71 -72 -66 -58 -56 -58
15575 -58 -56 -51 -50 -51 -46 -34 -31 -38 -41 -33 -33 -57 -85 -82 -46 -9 0 -14 -44 -81 -112 -113 -82 -54 -57 -84 -105 -107 -106 -115 -129 -141 -148 -145 -122 -81 -49 -45 -56 -48 -13 22 30 12 0 9
15555 9 26 29 17 4 -7 -32 -72 -114 -135 -131 -107 -76 -51 -44 -57 -74 -78 -70 -64 -70 -82 -85 -73 -55 -38 -26 -17 -15 -22 -33 -41 -45 -51 -64 -78 -77 -60 -41 -32 -28 -21 -14 -17 -33 -49
15535 -49 -52 -42 -28 -19 -18 -16 -4 19 40 38 7 -39 -80 -98 -92 -73 -54 -37 -13 7 6 -28 -80 -124 -152 -169 -171 -150 -113 -84 -75 -77 -74 -59 -27 19 66 90 84 66 56
15517 56 55 55 58 70 83 86 79 71 62 40 7 -20 -28 -20 -14 -18 -29 -34 -29 -22 -22 -25 -18 2 23 31 24 9 -6 -16 -16 -13 -24 -49 -73 -82 -82 -81 -73 -48 -15 4 9 13 22 29 35 47 63 63
15496 63 42 15 -3 -15 -37 -69 -98 -107 -93 -68 -52 -55 -67 -71 -64 -58 -59 -56 -45 -35 -36 -40 -25 10 49 65 54 35 32 53 83 95 75 34 -9 -38 -43 -25 4 38
15478 38 71 95 92 59 17 -5 -9 -27 -70 -111 -119 -97 -70 -53 -47 -59 -91 -132 -161 -173 -174 -169 -157 -141 -127 -115 -96 -68 -39 -18 -14 -35 -71 -95 -86 -54 -27 -18 -24 -43
$$ packed form
15611h9qk9l2j2J7L1L1K8K3J1kmJ%pj1j4j8j7nROpnJ7L1K4J2J2J2%j2pJ7L2K7J6Qlj6k2k1
15593B4k1j2QK7K8RnjKj4l1k5jJ8K2J1mk2l5l6j9LK0L5M3M3J9j0k3oJ1Pk1m2l8k4j1jOQKk
15575e8KNJjNJ2LplQ%k4k8LL6L7Rj4l0l7l1jL1K8lk7k1kJrj4j2pLK3M1L2Mj1QL5L5Qj8j2R
15555IJ7Lj2j3j1k5m0m2k1MK4L1K5Pj3j7mQOoj2lJ2J8J7J2RKpj1qmoj3j4JJ7J9RMPPlj6j6
15535d9lJ0J4RJKJ2K3K1kl1m6m1j8OJ9J9J7K4K0jl4n2m4k8j7kK1L7K9RkLJ5L2M6M7K4oj8j0
15517E6j%LJ2J3Lpqrk2l3k7qQOmj1nNP%lPK0K1Qpj5j5j0%Lj1k5k4r%JQK5L3J9NMRPOJ2J6%
15496F3k1k7j8j2k2l2k9rJ4K5J6lj2mPOjLJ1J0jmJ5L5L9J6j1j9lK1L0J2k0m1m3k9nJ8K9L4
15478C8L3K4ll3m2k2mj8m3m1qK2K7J7Oj2l2m1k9j2jNJ2J6J4J2J9K8K9K1Mk1l6k4RL2K7Roj9
$$ plain form
15461 -43 -75 -108 -128 -141 -162 -189 -195 -167 -127 -99 -84 -64 -31 2 19 11 -13 -38 -43 -28 -6 5 6 4 7 23 52 76 73 46 23 19 19 -5 -54 -97 -108 -86 -48
15444 -48 -10 15 31 49 73 93 96 80 49 9 -31 -62 -70 -54 -26 -2 6 -2 -22 -43 -58 -66 -61 -41 -15 3 14 31 58 78 78 64 52 42 25 3 -16 -38
15428 -38 -64 -85 -89 -78 -63 -43 -11 21 35 27 14 10 15 20 21 16 4 -4 3 21 28 19 10 10 15 15 14 11 -3 -31 -51 -43 -13 14 24 19 6 -11 -33 -61 -90 -106 -98 -73 -52
15408 -52 -44 -34 -12 6 0 -24 -42 -39 -22 -4 10 25 38 46 49 46 42 43 46 37 8 -26 -41 -32 -11 11 33 51 51 33 11 -1 -8 -17 -23 -15 1 18 27 27 18 4 -3 3 22
15389 22 39 41 29 12 -6 -22 -37 -50 -64 -73 -71 -56 -36 -20 -9 3 16 19 3 -24 -49 -67 -91 -125 -150 -144 -109 -75 -68 -86 -106 -114 -113 -115 -118 -117 -111 -105 -104 -105 -99 -86 -80
15370 -80 -92 -117 -130 -114 -88 -85 -111 -135 -125 -81 -33 -6 -5 -20 -43 -71 -100 -125 -136 -127 -100 -72 -67 -90 -124 -143 -136 -113 -83 -54 -34 -30 -37 -37 -23 -9 -17 -46 -76
15353 -76 -91 -83 -56 -21 4 4 -23 -57 -74 -71 -62 -63 -78 -100 -120 -128 -119 -98 -77 -61 -45 -18 13 33 35 33 43 67 88 91 74 52 42 51 66 70 58 47 51 55 37 1
15335 1 -28 -41 -53 -73 -84 -66 -28 4 17 17 7 -11 -33 -45 -46 -45 -44 -42 -39 -44 -59 -75 -80 -73 -61 -52 -52 -59 -60 -53 -54 -76 -106 -120 -120 -134 -165 -178 -154 -120 -113 -129 -133 -112
$$ packed form
15461d3l2l3k0j3k1k7oK8M0K8J5K0L3L3J7qk4k5nJ5K2J1JkLJ6K9K4lk7k3m%k4m9m3j1K2L8
15444d8L8K5J6J8K4K0Lj6l1m0m0l1qJ6K8K4Qqk0k1j5qNK0K6J8J1J7K7K0%j4j2j0j7k2j9k2
15428c8k6k1mJ1J5K0L2L2J4qj3mNNJnj2qPJ8Prr%N%jlj4k8k0QL0K7J0nj3j7k2k8k9j6QK5K1
15408e2QJ0K2J8ok4j8LJ7J8J4J5J3QLlmJLrk9l4j5RK1K2K2J8%j8k2j2proQJ6J7R%rj4pOJ9
15389B2J7Kj2j7j8j6j5j3j4rKJ5K0J6J1J2J3Lj6k7k5j8k4l4k5OL5L4Pj8k0qJklJOOJjOJ3O
15370h0j2k5j3J6K6Lk6k4J0M4M8K7Jj5k3k8k9k5j1RK7K8Nk3l4j9PK3L0K9K0Mp%J4J4qk9l0
15353g6j5QK7L5K5%k7l4j7LRjj5k2k0qRK1K1J6J6K7L1K0KkJ0K4K1Lj7k2j0RJ5Mj2j1MMj8l6
15335Ak9j3j2k0j1J8L8L2J3%j0j8k2j2jJJKLnj5j6nPJ2R%pjPjk2l0j4%j4l1j3K4L4Pj6mK1
$$ plain form
15316 -112 -84 -68 -54 -32 -1 25 42 41 28 22 39 69 84 78 77 100 126 127 106 94 101 107 89 49 9 -20 -40 -53 -62 -67 -65 -53 -30 -13 -23 -63 -105 -120 -108
15299 -108 -94 -98 -112 -117 -106 -90 -74 -59 -44 -32 -21 -9 1 7 4 -4 -14 -17 -11 -6 -18 -51 -87 -104 -104 -100 -93 -73 -44 -30 -38 -47 -32 -1 20 22 14 11 19 38 59 67 53
15280 53 25 -1 -23 -40 -40 -11 34 70 80 80 87 100 107 102 91 78 75 91 122 149 150 126 97 79 65 41 4 -34 -61 -73 -82 -96 -112 -115 -101 -81 -70 -70 -72 -70 -64
15262 -64 -60 -61 -65 -66 -63 -54 -42 -30 -23 -24 -25 -17 -1 2 -18 -49 -58 -37 -11 0 3 12 18 9 1 12 34 35 8 -17 -19 -4 3 0 -2 2 8 9 8 7 11 14 7 -19 -59 -92 -99 -88 -78 -74 -65
15240 -65 -40 -8 11 17 21 36 56 68 74 84 99 107 102 92 90 93 85 64 41 28 18 2 -21 -50 -80 -102 -104 -80 -35 8 26 4 -51 -118 -160 -166 -153 -151 -171 -198
15223 -198 -211 -200 -173 -143 -122 -109 -95 -72 -43 -18 0 20 46 71 78 55 17 -9 -9 3 2 -18 -42 -49 -37 -19 -3 4 -4 -29 -57 -81 -102 -121 -127 -111 -90 -89
15207 -89 -109 -121 -105 -66 -20 19 48 60 56 46 35 23 14 23 52 79 77 48 15 0 0 2 4 5 6 3 0 2 12 24 26 12 -5 -10 -8 -12 -29 -46 -56 -65 -78 -84 -71 -48
15187 -48 -32 -23 -9 9 21 17 11 13 18 17 10 -2 -29 -75 -124 -149 -139 -109 -82 -69 -66 -68 -77 -99 -124 -135 -122 -97 -79 -77 -81 -78 -62 -38 -15 3 18 26 16 -10 -33 -28
$$ packed form
15316a12K8J6J4K2L1K6J7jj3oJ7L0J5ojK3K6Jk1j2POj8m0m0k9k0j3rnKJ2K3J7j0m0m2j5J2
15299a08J4mj4nJ1J6J6J5J5J2J1J2J0Olqj0lONj2l3l6j7%MPK0K9J4qrJ5L1K1KqlQJ9K1Qj4
15280E3k8k6k2j7%K9M5L6J0%PJ3Pnj1j3lJ6L1K7Jk4k9j8j4k4l7l8k7j2rj4j6lJ4K0J1%kKO
15262f4MjmjLRJ2J2PjjQJ6Lk0l1rK1K6J1LROrqJ1K2Jk7k5kJ5PlkMOJjjMLpk6m0l3pJ1J0MR
15240f5K5L2J9OMJ5K0J2OJ0J5Qnj0kLqk1k3j3j0j6k3k9l0k2kK4M5M3J8k2n5o7m2oJ3Kk0k7
15223a98j3J1K7L0K1J3J4K3K9K5J8K0K6K5Pk3l8k6%J2jk0k4pJ2J8J6Pqk5k8k4k1j9oJ6K1J
15207h9k0j2J6L9M6L9K9J2mj0j1j2rRK9K7kk9l3j5%KKJJllKJ0J2Kj4j7nKmj7j7j0rj3oJ3K3
15187d8J6RJ4J8J2moKNjpj2k7m6m9k5J0L0K7J3Lkrk2k5j1J3K5J8KmLJ6K4K3J8J5Qj0k6k3N
$$ plain form
15169 -28 0 15 -2 -32 -42 -27 -16 -24 -42 -52 -52 -49 -51 -64 -94 -132 -162 -179 -193 -208 -208 -180 -134 -93 -68 -50 -31 -15 -10 -18 -32 -34 -16 12 29 19 -5 -20 -16
15152 -16 -8 -10 -25 -45 -60 -71 -83 -101 -117 -118 -95 -57 -21 5 35 71 109 142 167 180 169 133 86 45 18 12 27 52 65 55 39 48 87 127 135 105 58 22
15136 22 8 6 0 -23 -51 -65 -49 -14 15 23 12 4 9 20 27 31 44 70 92 88 60 23 -6 -29 -52 -71 -75 -65 -58 -67 -85 -93 -86 -82 -95 -119 -133 -133 -131 -135 -141 -140 -126 -100
15117 -100 -69 -46 -40 -53 -73 -95 -115 -126 -122 -109 -106 -119 -132 -131 -113 -89 -59 -26 -3 -4 -21 -38 -43 -42 -33 -9 19 28 4 -30 -48 -41 -22 -6 0 -7 -23 -29 -11 15 27
15099 27 21 21 41 71 88 83 60 23 -12 -29 -23 -14 -27 -57 -81 -84 -77 -80 -93 -111 -127 -139 -147 -148 -141 -132 -125 -118 -105 -79 -38 8 42 50 38 25 22 24 25 23 20 14 1 -10 -6 12
15079 12 30 30 13 -6 -20 -36 -62 -91 -106 -97 -71 -44 -29 -29 -44 -67 -80 -69 -29 21 68 102 121 122 108 93 97 119 142 149 143 135 132 132 128 120 106 90 80 72 56
15061 56 25 -5 -18 -13 -10 -18 -27 -19 -1 11 13 21 45 76 95 91 69 39 6 -21 -34 -27 -11 -4 -10 -15 -11 -3 -5 -15 -21 -21 -24 -31 -38 -45 -59 -76 -75 -48 -14 3 -2 -22 -46 -69
15041 -69 -83 -79 -57 -27 0 22 34 32 22 13 4 -7 -16 -13 2 17 25 26 21 6 -16 -36 -46 -50 -47 -27 12 57 95 123 144 152 144 125 98 57 5 -43 -69 -77 -77 -74 -63
$$ packed form
15169b8K8J5j7l0j0J5J1qj8j0%Lkj3l0l8l0j7j4j5%K8M6M1K5J8J9J6Nqj4kJ8K8J7j0k4j5M
15152a6Qkj5k0j5j1j2j8j6jK3L8L6K6L0L6L8L3K5J3j1l6m7m1k7oJ5K5J3j0j6RL9M0Ql0m7l6
15136B2j4kok3k8j4J6L5K9Qj1qNJ1PMJ3K6K2mk8l7k9k3k3j9mJ0Prj8qPMj3k4j4%KmoJJ4K6
15117a00L1K3Oj3k0k2k0j1MJ3Lj3j3JJ8K4L0L3K3jj7j7nJRK4K8Rk4l4j8PJ9J6Opj6oJ8K6J2
15099B7o%K0L0J7nk3l7l5j7ORj3l0k4lPlj3j8j6j2qjPRPPJ3K6M1M6L4Qj2j3lKJkloj3j1MJ8
15079A2J8%j7j9j4j6k6k9j5RK6K7J5%j5k3j3J1M0N0M7L4J9Jj4j5MK2K3Poql%mqj4j6j0qj6
15061E6l1l0j3NLqrQJ8J2KQK4L1J9mk2l0l3k7j3PJ6PonMQkj0o%lpppj4j7JK7L4J7nk0k4k3
15041f9j4MK2L0K7K2J2kj0rrj1rLJ5J5QJnj5k2k0j0mLK0L9M5L8K8K1Qqj9k7m1n2m8k6q%LJ1
$$ plain form
15023 -63 -53 -54 -57 -42 -6 25 34 26 18 13 10 12 22 31 29 23 22 26 23 12 7 24 56 87 102 101 94 93 100 106 99 79 58 45 40 40 47 59 64 47 15 -12 -23 -28 -43 -66 -80 -76
15002 -76 -60 -49 -54 -66 -70 -64 -59 -67 -89 -105 -106 -101 -102 -107 -103 -92 -90 -101 -110 -99 -76 -62 -66 -82 -104 -126 -139 -132 -114 -105 -108 -108 -94 -72 -58 -63 -84 -107 -113 -93 -56 -27 -18 -23 -28 -31
14982 -31 -34 -33 -28 -32 -51 -68 -62 -38 -19 -22 -42 -69 -105 -140 -152 -137 -118 -121 -137 -135 -108 -79 -68 -69 -68 -64 -59 -50 -33 -24 -40 -77 -107 -111 -94 -74 -59 -46 -36 -34 -38 -36 -21 4
14963 4 22 22 8 0 10 32 44 32 8 -8 -16 -21 -19 -1 32 62 66 42 6 -27 -51 -69 -88 -107 -121 -124 -119 -113 -108 -101 -95 -95 -100 -97 -79 -55 -43 -46 -50 -39 -14 9 20 22
14944 22 31 50 67 66 52 47 55 57 31 -6 -22 -4 25 36 19 -5 -17 -7 19 48 63 61 48 36 29 22 8 -10 -30 -49 -67 -83 -89 -82 -68 -52 -28 6 45 68
14926 68 67 50 31 6 -26 -54 -59 -37 -1 38 73 94 91 65 29 -3 -33 -63 -90 -110 -126 -144 -160 -166 -156 -127 -84 -40 -6 5 -4 -29 -62 -89 -103 -101 -93 -82
14910 -82 -68 -50 -37 -41 -60 -86 -105 -114 -115 -111 -103 -82 -46 -2 29 35 20 5 2 6 0 -26 -66 -104 -125 -121 -95 -60 -33 -21 -14 -5 1 -7 -34 -65 -81 -79 -74 -78 -86 -89 -84 -74 -65
14891 -65 -58 -48 -32 -8 11 17 5 -12 -25 -24 -9 19 50 70 69 58 52 58 69 79 90 108 129 143 141 123 93 59 29 11 7 6 0 0 22 65 102 110 94 76 68
$$ packed form
15023f3J0jlJ5L6L1RqqnlKJ0RkojMlj1nJ7L2L1J5jpjPOpk0k1j3n%PJ2Nj7l2k7j1nj5k3j4M
15002g6J6J1nj2mONqk2j6jNjnMJ1Kj1rJ1K3J4mj6k2k2j3PJ8Rl%J4K2J4nk1k3oK0L7K9Rnnl
14982c1lJNmj9j7OK4J9lk0k7l6l5j2J5J9lj6KK7K9J1jJMNRJ7Rj6l7l0mJ7K0J5J3J0KmKJ5K5
14963DJ8%j4qJ0K2J2j2k4j6qnKJ8L3L0Mk4l6l3k4j8j9j9j4lNONPO%nLJ8K4J2lmJ1K5K3J1K
14944B2RJ9J7jj4nQKk6l7j6J8K9J1j7k4j2J0K6K9J5kj3j2ppj4j8k0j9j8j6oPJ4J6K4L4L9K3
14926F8jj7j9k5l2k8nK2L6L9L5K1lk6l6l2l0l0k7k0j6j8j6oJ0K9M3M4L4J1rk5l3k7j4KQJ1
14910h2J4J8J3mj9k6j9rjMQK1L6M4L1Oj5j5lMok6m0l8k1MK6L5K7J2PROqk7l1j6KNmqlNJ0R
14891f5PJ0J6K4J9Oj2j7j3JJ5K8L1K0jj1oOJ1J0J1J8K1J4kj8l0l4l0j8mjo%K2M3L7Qj6j8q
$$ plain form
14873 68 68 67 65 67 71 72 65 39 -6 -53 -78 -75 -57 -44 -39 -32 -15 13 50 85 109 126 146 164 158 122 76 42 24 13 14 33 59 71 64 53 46 40 30 26 36 52 61
14854 61 67 74 83 84 68 33 -14 -64 -99 -114 -112 -103 -96 -90 -81 -58 -22 15 39 46 44 37 21 0 -9 1 29 59 82 95 98 90 74 48 14 -19 -41 -45 -43 -41 -37 -23 -11 -10 -16
14835 -16 -9 14 41 52 41 12 -26 -69 -107 -132 -136 -114 -75 -34 -1 22 36 31 -2 -53 -93 -103 -87 -64 -43 -24 1 34 65 78 71 58 56 60 52 35 34 61 100
14818 100 117 105 84 73 74 79 80 75 65 57 55 48 25 -16 -62 -98 -121 -132 -122 -90 -48 -20 -11 -13 -16 -29 -58 -87 -91 -64 -30 -19 -36 -61 -72 -64 -52 -53 -71 -93 -91
14800 -91 -53 5 49 55 30 0 -20 -34 -36 -24 -7 -7 -29 -51 -43 -7 27 38 24 0 -23 -41 -54 -65 -77 -87 -88 -80 -71 -67 -68 -71 -81 -95 -108 -114 -123 -142 -165 -176 -168
14782 -168 -144 -110 -78 -59 -58 -62 -48 -13 23 47 60 68 71 61 39 13 -15 -47 -78 -101 -114 -116 -100 -60 -4 39 54 45 33 30 32 27 14 0 -13 -20 -13 7 36 54
14765 54 50 32 24 39 70 96 101 81 42 -3 -42 -70 -86 -85 -65 -34 -14 -20 -38 -42 -22 5 25 34 39 46 54 65 73 67 41 5 -23 -40 -47 -45 -31 -11 -5 -21 -43 -49 -38
14746 -38 -28 -36 -54 -68 -66 -50 -28 -8 3 6 7 14 31 56 80 94 88 56 15 -12 -19 -19 -28 -40 -37 -10 25 54 73 77 59 20 -19 -37 -35 -34 -41 -38 -10 28 48 39 10
$$ packed form
14873F8%jkKMJpk6m5m7k5LJ8J3NPJ7K8L7L5K4J7K0J8ol6m6l4j8j1JJ9K6J2pj1poj0mJ0J6R
14854F1OPRJj6l5m7n0l5j5KRPORK3L6L7K4Pkpj6k1rJ0K8L0K3J3Lqj6k6l4l3k2mKKMJ4J2Jo
14835a6PK3K7J1j1k9l8m3l8k5mK2L9M1L3K3J4nl3n1m0j0J6K3K1J9K5L3L1J3pj3kMqj7jK7L9
14818A00J7j2k1j1JNJnj0qkpk3m1m6l6k3j1J0L2M2K8Rklj3k9k9mK7L4J1j7k5j1QJ2jj8k2K
14800i1L8N8M4Ok5l0k0j4kJ2J7%k2k2QL6L4J1j4k4k3j8j3j1j2j0jQRMjlj0j4j3orj9k3j1Q
14782a68K4L4L2J9JmJ4L5L6K4J3QLj0k2k6k8l2l1k3j3kJ6M0N6M3J5rj2lKnj3j4j3pPK0K9J8
14765E4mj8qJ5L1K6Nk0l9m5l9k8j6JK0L1K0oj8mK0K7K0RNPQJ1Qok6l6k8j7pKJ4K0Oj6k2oJ1
14746c8J0qj8j4KJ6K2K0J1LJPJ7K5K4J4ol2m1k7p%rj2LK7L5K9J9Mj8l9l9j8KJpLK8L8K0rk9
$$ plain form
14728 10 -22 -57 -89 -109 -112 -109 -111 -119 -126 -134 -142 -142 -121 -89 -76 -97 -129 -139 -120 -96 -86 -85 -78 -70 -80 -116 -155 -170 -159 -144 -141 -137 -119 -85 -52 -26 -5 11 19 25 40 62
14709 62 70 47 2 -38 -59 -61 -54 -44 -32 -18 -8 -10 -24 -37 -30 -7 12 15 7 0 0 2 5 5 -3 -12 -1 33 67 81 84 94 106 97 68 41 21 0 -24 -30 -18 -10 -22 -43
14690 -43 -57 -67 -68 -48 -5 29 26 1 -16 -24 -42 -71 -83 -62 -26 -5 -7 -18 -19 -9 0 -3 -10 -3 19 35 31 23 28 34 16 -20 -39 -23 8 32 47 64 82 101 124
14672 124 145 142 100 39 -6 -28 -46 -68 -89 -100 -110 -120 -116 -87 -52 -37 -45 -53 -46 -35 -36 -46 -51 -52 -62 -83 -105 -123 -139 -142 -117 -69 -33 -33 -53 -59 -49 -45 -54 -58 -45
14655 -45 -30 -30 -44 -54 -56 -58 -69 -85 -98 -96 -79 -62 -62 -73 -67 -34 6 25 15 -10 -37 -55 -63 -62 -60 -57 -47 -34 -32 -49 -66 -66 -51 -39 -31 -24 -21 -29 -38 -33 -16 -14 -35 -54
14636 -54 -43 -6 24 32 27 29 49 76 93 87 54 0 -59 -106 -117 -83 -21 41 89 121 137 135 119 99 82 68 58 57 65 64 46 26 27 44 51 34 4 -19 -36 -61
14618 -61 -93 -119 -125 -116 -103 -84 -55 -21 -1 -2 -5 5 26 38 35 27 23 15 -4 -27 -46 -66 -105 -161 -211 -233 -226 -206 -183 -161 -139 -122 -112 -102 -83 -49 -12 13 16 3
14601 3 -15 -31 -44 -56 -72 -87 -96 -90 -72 -57 -59 -78 -97 -98 -71 -28 12 36 40 22 -11 -49 -71 -72 -65 -67 -74 -64 -28 20 58 74 70 46 6 -34 -62 -73 -74 -68 -51
$$ packed form
14728A0l2l5l2k0lLkqpqq%K1L2J3k1l2j0J9K4J0JPQj0l6l9j5J1J5LMJ8L4L3K6K1J6QOJ5K2
14709F2Qk3m5m0k1kPJ0J2J4J0kj4j3PK3J9Lqp%KL%qrJ1L4L4J4LJ0J2rk9k7k0k1k4oJ2Qj2k1
14690d3j4j0jK0M3L4lk5j7qj8k9j2K1L6K1kj1jJ0RlpPK2J6mqNOj8l6j9J6L1K4J5J7J8J9K3
14672A24K1lm2o1m5k2j8k2k1j1j0j0MK9L5J5qqPJ1jj0njj0k1k2j8j6lK5M8L6%k0oJ0MrmJ3
14655d5J5%j4j0kkj1j6j3KJ7J7%j1OL3M0J9j0k5k7j8qJKLJ0J3Kj7j7%J5J2QPLqrNJ7Kk1j9
14636e4J1L7L0QnKK0K7J7ol3n4n9m7j1L4O2O2M8L2J6kj6k0j7j4j0jQjj8k0JJ7Pj7l0k3j7k5
14618f1l2k6oRJ3J9K9L4K0jlJ0K1J2lqmqj9k3j9k0l9n6n0k2PK0K3K2K2J7J0J0J9L4L7K5Lj3
14601Cj8j6j3j2j6j5rOJ8J5kj9j9jK7M3M0K4Mj8l3l8k2jPkpJ0L6M8L8J6mk4m0m0k8j1jOJ7
$$ plain form
14583 -51 -21 12 36 43 40 31 18 2 -9 -13 -16 -30 -53 -66 -56 -37 -28 -34 -37 -27 -11 3 24 58 91 101 91 85 92 96 79 46 14 -11 -43 -82 -111 -114 -96 -79 -81
14565 -81 -95 -99 -86 -71 -73 -92 -107 -100 -76 -55 -49 -56 -67 -78 -85 -89 -88 -82 -74 -69 -66 -59 -48 -36 -28 -18 -2 19 35 39 27 -2 -48 -94 -119 -112 -88 -71 -72 -79 -78 -69 -60 -57 -48 -26
14545 -26 2 17 10 -7 -21 -27 -34 -38 -30 -12 -3 -9 -16 -7 19 46 55 42 21 12 24 48 63 61 54 51 50 42 30 26 28 19 -10 -45 -66 -65 -56 -54 -60 -67 -64 -50 -36 -25 -10 9 21
14525 21 17 3 -2 3 13 18 21 27 40 57 73 82 83 81 84 84 67 30 -9 -40 -57 -64 -59 -41 -22 -9 0 10 17 12 -2 -16 -25 -33 -39 -36 -22 -11 -14 -26 -33 -28 -15 0 20 38
14505 38 45 38 30 36 52 58 41 16 7 15 22 17 6 2 1 -3 -11 -9 2 11 7 -6 -18 -19 -5 21 50 63 56 42 39 49 60 63 65 75 91 97 83 59 46 50 54 42 19 3 6
14485 6 21 39 57 74 83 79 64 47 32 22 19 21 24 22 15 0 -23 -51 -74 -90 -102 -112 -111 -91 -57 -25 -6 -6 -21 -46 -60 -43 1 48 72 72 62 49 31 0
14467 0 -39 -79 -107 -119 -117 -114 -115 -118 -114 -102 -85 -72 -67 -65 -59 -52 -51 -58 -67 -66 -54 -44 -41 -37 -21 0 11 8 0 -7 -17 -30 -40 -41 -34 -32 -46 -67 -80 -70 -38 4 46 76 88 75
14447 75 35 -17 -57 -65 -50 -36 -34 -35 -23 0 18 24 22 16 8 5 17 47 78 85 56 5 -38 -52 -34 -6 12 20 34 61 83 77 44 8 -4 7 33 67 106 142
$$ packed form
14583e1L0L3K4Plrj3j6j1mlj4k3j3J0J9RolJ0J6J4K1L4L3J0j0oPMj7l3l2k5l2l9k9lJ8J7k
14565h1j4mJ3J5kj9j5PK4K1Opj1j1pmJOQNLPJ1J2QJ0J6K1J6Mj2k9m6m6k5PK4J7jpJRRLRK2
14545b6K8J5pj7j4opmQJ8RopRK6K7Rj3k1rJ2K4J5kpljqj2mKrk9l5k1JRKopLJ4J4J1J5J9J2
14525B1mj4nNJ0NLOJ3J7J6RJkL%j7l7l9l1j7pNJ8J9J3RJ0Pnj4j4rqoLJ4J1lj2pNJ3J5K0J8
14505C8PpqOJ6Oj7k5rQPnj1mjmqKJ1Rmj3j2jJ4K6K9J3pj4lJ0J1LKJ0J6Oj4k4j3MMj2k3j6L
14485FJ5J8J8J7Rmj5j7j5j0lKLkpj5k3k8k3j6j2j0JK0L4L2J9%j5k5j4J7M4M7K4%j0j3j8l1
14467@l9m0k8j2KLjlMJ2J7J3NKOPJprJJ2J0LMJ6K1J1lqpj0j3j0jPKj4k1j3J0L2M2M2L0J2j3
14447G5m0n2m0qJ5J4KjJ2K3J8OkoqlJ2L0L1Pk9n1m3j4J8K8J8QJ4K7K2ol3l6j2J1K6L4L9L6
$$ plain form
14430 142 161 154 125 81 25 -34 -83 -106 -99 -70 -32 4 28 33 24 14 11 17 28 39 46 42 29 24 37 61 73 59 31 8 3 13 21 12 -16 -48 -63 -52 -37 -38 -54
14412 -54 -70 -82 -92 -100 -94 -72 -46 -33 -36 -52 -74 -92 -89 -60 -16 21 52 81 108 123 125 123 119 107 82 50 17 -17 -51 -78 -96 -110 -127 -144 -151 -139 -111 -73 -35
14395 -35 -4 12 16 9 0 -6 -9 -17 -37 -63 -72 -54 -20 5 9 -6 -36 -75 -112 -132 -136 -146 -173 -203 -215 -206 -194 -186 -171 -139 -96 -56 -29 -17 -19 -25 -20 5 44 74 81 71
14377 71 52 28 -2 -38 -70 -87 -88 -82 -78 -76 -72 -67 -62 -55 -40 -17 0 -6 -34 -57 -50 -15 17 21 0 -18 -18 -4 13 28 35 31 16 2 -1 0 -5 -9 -3 9 9 -12 -43 -65 -73
14358 -73 -65 -39 -1 27 28 14 10 14 4 -22 -41 -34 -18 -16 -29 -37 -31 -24 -27 -31 -23 -4 4 -10 -43 -68 -69 -57 -53 -58 -56 -36 -11 0 -2 -9 -23 -45 -63 -60 -41 -30 -43 -70 -94
14338 -94 -108 -117 -126 -135 -135 -115 -69 -13 25 29 9 -15 -37 -49 -44 -20 11 32 34 22 2 -23 -49 -63 -55 -33 -8 6 10 6 0 -3 -2 1 2 -4 -22 -47 -68 -74 -70 -72 -86 -101
14319 -101 -97 -73 -44 -25 -14 -1 13 27 35 45 63 92 128 157 161 134 94 66 53 38 17 12 43 99 143 147 115 67 23 -12 -40 -61 -73 -71 -57 -45 -45 -53
14303 -53 -56 -50 -40 -39 -54 -88 -135 -175 -180 -147 -99 -64 -45 -25 -3 6 -7 -26 -25 2 31 37 16 -14 -37 -46 -42 -29 -19 -30 -62 -95 -111 -111 -112 -117 -114 -97 -72 -43 -8
$$ packed form
14430A42J9pk9m4n6n9m9k3PK9L8L6K4Nrj0lOJ1J1Pmj3nJ3K4J2j4k8k3nJ0Qrk8l2j5J1J5jj6
14412e4j6j2j0qOK2K6J3lj6k2j8LK9M4L7L1K9K7J5Kkmj2k5l2l3l4l4k7j8j4j7j7pJ2K8L8L8
14395c5L1J6Mprolqk0k6rJ8L4K5Mj5l0l9l7k0mj0k7l0j2RJ2QJ5L2M3M0K7J2koNK5L9L0Pj0
14377G1j9k4l0l6l2j7jOMKMNNPJ5K3J7ok8k3PL5L2Mk1j8%J4J7J5Pmj5j4lJnmOJ2%k1l1k2q
14358g3QK6L8K8Jj4mMj0k6j9PJ6Kj3qOPlmQJ9Qj4l3k5jJ2MnKK0K5J1kpj4k2j8LJ9J1j3k7k4
14338i4j4rrr%K0M6N6L8Mk0k4k2j2NK4L1K1Kj2k0k5k6j4QK2K5J4MmolJLJoj8k5k1oMkj4j5
14319a01MK4K9J9J1J3J4J4QJ0J8K9L6K9Mk7m0k8j3j5k1nL1N6M4Ml2m8m4l5k8k1j2KJ4J2%q
14303e3lOJ0Jj5l4m7m0nL3M8L5J9K0K2Rj3j9JK7K9Ok1l0k3rMJ3J0j1l2l3j6%jnLJ7K5K9L5
$$ plain form
14285 -8 32 64 77 76 71 63 54 50 59 70 64 37 2 -27 -47 -53 -43 -24 -14 -22 -34 -28 0 30 40 25 -2 -28 -44 -54 -59 -60 -59 -59 -61 -58 -43 -26 -21 -32 -48 -60 -66 -71 -79
14265 -79 -92 -113 -143 -167 -176 -177 -186 -199 -197 -163 -113 -80 -74 -77 -71 -64 -76 -106 -133 -141 -137 -136 -138 -136 -122 -92 -45 10 52 58 34 5 -6 -5 -6 -16 -32 -47 -60 -73 -87 -90 -69
14247 -69 -27 7 21 24 32 36 13 -35 -83 -109 -112 -93 -46 9 37 18 -20 -41 -43 -47 -52 -44 -22 -12 -27 -55 -81 -103 -121 -126 -116 -105 -101 -96 -73 -31 11 42 62 67 54
14229 54 21 -15 -37 -32 -6 30 71 106 117 96 59 34 29 26 8 -16 -26 -21 -18 -25 -25 -9 12 25 24 10 -13 -37 -43 -21 14 42 52 50 47 41 33 21 7 -6 -14 -21
14211 -21 -37 -73 -117 -150 -157 -144 -123 -104 -100 -112 -124 -113 -73 -24 6 14 19 34 53 58 45 23 7 2 2 7 21 46 72 85 80 65 46 27 13 10 14 15 8 0 -5 -13 -29
14192 -29 -44 -44 -28 -14 -15 -28 -45 -65 -93 -120 -132 -117 -88 -66 -60 -55 -31 5 28 23 7 6 21 35 43 60 91 121 129 115 88 57 24 -8 -35 -57 -76 -85 -75
14175 -75 -51 -31 -30 -43 -55 -53 -33 -6 12 21 26 29 19 -12 -53 -75 -62 -24 18 49 62 62 62 61 48 13 -30 -60 -72 -79 -92 -106 -113 -108 -91 -63 -38 -26 -26 -23 -12
14157 -12 -8 -23 -47 -59 -57 -49 -48 -59 -78 -91 -83 -66 -62 -77 -95 -101 -100 -100 -93 -69 -42 -28 -27 -25 -20 -22 -31 -39 -45 -46 -34 -7 14 11 -14 -34 -43 -56 -82 -103 -105 -97 -88 -72 -41 0
$$ packed form
14285hM0L2J3jnqrmRJ1ok7l5k9k0oJ0J9J0qj2OK8L0J0j5k7k6j6j0njJ%kLJ5J7Nj1j6j2onq
14265g9j3k1l0k4rjrj3KL4N0L3OlOPj2l0k7qMJkKJ4L0M7N5M2Ok4k9j1Jjj0j6j5j3j3j4lK1
14247f9M2L4J4LQMk3m8m8k6lJ9M7N5K8j9l8k1kmnQK2J0j5k8k6k2j8nJ0J1MNK3M2M2L1K0Nj3
14229E4l3l6k2NK6L6M1L5J1k1l7k5nlj8k4j0NLp%J6K1J3jj4k3k4oK2L5K8J0kloqj2j4j3qp
14211b1j6l6m4l3pJ3K1J9Mj2j2J1M0M9L0QNJ5J9Nj3k2j6n%NJ4K5K6J3nj5j9j9j4lMJpqnqj6
14192b9j5%J6J4jj3j7k0k8k7j2J5K9K2ONK4L6K3nj6jJ5J4QJ7L1L0Qj4k7l1l3l2k7k2j9rJ0
14175g5K4K0Jj3j2KK0K7J8RNLj0l1m1k2J3L8M2L1J3%%jj3l5m3l0j2pj3j4pNJ7K8K5J2%LJ1
14157a2Mj5k4j2KQJj1j9j3QJ7Mj5j8oJ%PK4K7J4JKNkrqojJ2K7K1lk5k0rj3k6k1kQRJ6L1M1
$$ plain form
14138 0 39 67 83 86 86 99 123 134 119 88 61 38 15 -1 1 17 30 42 64 94 115 113 89 46 -8 -58 -79 -67 -41 -21 -11 -7 -18 -49 -89 -111 -101 -69
14121 -69 -37 -17 -9 -6 -7 -14 -19 -11 10 32 32 10 -11 -11 6 16 1 -24 -33 -17 6 17 16 22 41 58 55 32 2 -22 -40 -46 -41 -32 -24 -20 -23 -43 -79 -111 -121 -121 -126 -128 -98
14102 -98 -37 15 30 17 6 6 3 -2 0 17 31 24 -2 -30 -39 -23 11 41 45 22 -7 -22 -20 -9 5 22 43 65 83 92 87 75 69 71 67 49 26 9 -1 -18 -40
14084 -40 -56 -65 -81 -110 -140 -156 -150 -125 -83 -30 14 40 54 71 91 98 85 66 57 57 53 43 36 38 41 32 7 -25 -50 -63 -70 -74 -74 -69 -68 -76 -89 -94 -75 -32 16 44 33
14065 33 -2 -37 -57 -71 -85 -83 -52 -12 1 -21 -49 -56 -45 -31 -10 26 65 81 69 46 25 5 -14 -28 -31 -32 -44 -67 -92 -113 -137 -168 -202 -225 -221 -192 -154
14049 -154 -127 -119 -121 -117 -92 -52 -20 -15 -37 -69 -96 -119 -138 -149 -142 -117 -78 -31 20 69 110 137 139 116 80 55 48 37 5 -35 -59 -57 -43 -28 -14 -8 -20 -44 -64
14032 -64 -65 -54 -41 -33 -34 -48 -68 -80 -77 -64 -50 -35 -23 -20 -29 -44 -53 -55 -52 -47 -40 -31 -24 -24 -33 -40 -32 -2 31 48 40 22 4 -13 -35 -57 -85 -120 -151 -161 -152 -141 -136 -122 -87
14013 -87 -45 -16 -5 -4 -9 -22 -40 -55 -67 -73 -62 -38 -23 -32 -47 -38 0 40 63 64 42 7 -21 -20 5 30 34 21 0 -31 -63 -79 -75 -67 -69 -81 -96 -114 -130 -131 -115
$$ packed form
14138@L9K8J6L%J3K4J1j5l1k7k3k3j6KJ6J3J2K2L0K1kk4m3n4n0k1J2K6K0J0Mj1l1m0k2J0L2
14121f9L2K0QLjpnQK1K2%k2k1%J7J0j5k5rJ6K3J1jOJ9J7lk3l0k4j8oNRQMlk0l6l2j0%nkL0
14102i8O1N2J5j3j1%lnKJ7J4pk6k8rJ6L4L0Mk3k9j5KJ1J4J7K1K2J8Rnj2oKmj8k3j7j0j7k2
14084d0j6rj6k9l0j6OK5M2N3M4K6J4J7K0Pj3j9r%mj0pKLrk5l2k5j3pm%NJqj3nJ9M3M8K8j1
14065C3l5l5k0j4j4KL1M0J3k2k8pJ1J4K1L6L9J6j2k3k1k0j9j4ljj2k3k5k1k4l1l4k3MK9L8
14049a54K7QkMK5M0L2Nk2l2k7k3j9j1PK5L9M7N1M9M1K7Kk3l6k5pj1l2m0k4KJ4J5J4Oj2k4k0
14032f4jJ1J3Qjj4k0j2LJ3J4J5J2Lrj5rkLNPRP%rpQL0L3J7qj8j8j7k2k2k8l5l1j0RJ1NJ4L5
14013h7M2K9J1Jnj3j8j5j2oJ1K4J5rj5RL8M0K3Jk2l5k8JK5K5Mj3k1l1l2j6MQkj2j5j8j6jJ6
$$ plain form
13995 -115 -100 -101 -107 -97 -72 -46 -24 -3 11 8 -11 -28 -29 -23 -24 -33 -34 -16 18 53 75 76 61 40 25 20 25 37 54 74 86 80 60 44 53 86 117 127 118 111 121 135
13977 135 133 110 87 87 111 137 153 163 168 150 97 30 -12 -19 -13 -20 -35 -45 -44 -39 -30 -15 0 3 -7 -27 -49 -67 -69 -53 -34 -31 -48 -69 -81 -82 -75 -62 -45 -26 1
13959 1 41 83 106 108 105 105 97 71 38 13 -9 -46 -91 -121 -124 -110 -100 -101 -112 -126 -128 -104 -59 -22 -10 -12 -6 9 18 9 -6 -8 8 33 49 46 28 8 -1 -4 -7 -6 8 33
13940 33 49 45 35 39 57 75 80 76 69 63 61 61 54 29 -13 -56 -79 -76 -55 -33 -19 -17 -23 -38 -59 -83 -94 -82 -53 -27 -15 -7 2 6 -10 -41 -68 -77 -75 -75 -80 -83 -84 -84 -84 -85 -92
13920 -92 -105 -118 -123 -111 -81 -38 6 39 50 43 28 12 -9 -42 -77 -94 -79 -40 10 60 100 121 127 134 153 175 176 145 101 69 62 69 73 66 49 24 -7 -42 -65
13903 -65 -64 -42 -18 -4 2 9 16 19 19 19 14 0 -19 -30 -30 -22 -11 3 20 35 49 69 83 75 47 28 37 67 88 88 75 67 76 101 122 119 96 81 96 124 144 150 155 157
13884 157 146 126 111 109 111 115 125 135 136 138 162 203 227 222 210 216 227 222 204 196 207 225 239 252 264 280 313 367 428 480 530 592 667 750 865 1049 1310
13867 1310 1650 2104 2703 3336 3734 3670 3173 2510 1935 1518 1201 937 729 574 453 358 300 279 275 275 274 268 247 224 223 246 270 273 263 257
$$ packed form
13995a15J5joJ0K5K6K2K1J4lj9j7jOjrjJ8L4L5K2Jj5k1j5nNJ2J7K0J2ok0j6RL3L1J0rpJ0J4
13977A35kk3k3%K4K6J6J0Nj8n3o7m2pOpj5j0JNRJ5J5Lj0k0k2j8kJ6J9Lj7k1j2jPJ3J7J9K7
13959AM0M2K3Kl%qk6l3k5k2l7m5l0lJ4J0jj1j4kK4M5L7J2kOJ5Rrj5kJ6K5J6lj8k0rllJJ4K5
13940C3J6mj0MJ8J8Nmpok%pk5m2m3k3LK1K2J4Koj5k1k4j1J2K9K6J2QRMj6l1k7rK%nlj%%jp
13920i2j3j3nJ2L0M3M4L3J1pj5j6k1l3l5j7J5L9N0N0M0K1OPJ9K2Jl1m4l2pPMpj7k5l1l5k3
13903f5JK2K4J4OPPL%%nj4j9j1%QJ1J4J7J5J4K0J4qk8j9RL0K1%j3qRK5K1lk3j5J5K8K0ONK
13884A57j1k0j5kKMJ0J0JKK4M1K4nj2OJ1nj8qJ1J8J4J3J2J6L3N4O1N2N0O2P5Q3J15J84K61
13867A310L40M54N99O33L98o4m97o63n75m17l17k64k08j55j21r5n8k1m%jok1k3jK3K4Lj0o
$$ plain form
13854 257 260 269 284 310 345 380 415 453 494 533 569 609 665 749 875 1056 1293 1583 1937 2400 2999 3659 4160 4265 3923 3339 2803 2455
13842 2455 2257 2152 2158 2307 2592 3037 3731 4666 5566 5992 5699 4851 3855 3018 2402 1943 1605 1386 1258 1169 1104 1087 1131 1215 1324
13832 1324 1488 1747 2119 2637 3371 4320 5255 5767 5570 4760 3727 2825 2163 1680 1314 1047 857 711 602 539 505 461 397 337
13821 337 305 290 274 258 249 247 249 259 281 300 288 233 159 103 88 101 110 103 88 75 61 44 35 46 70 91 104 124 161 204 231 232 217 192 155 102 47 15
13805 15 15 33 49 54 52 51 57 70 84 81 58 33 25 28 19 0 -5 10 30 38 49 72 92 85 63 61 91 131 154 156 142 114 78 50 39 36 30 25 30 45 57 59 58 59 55 36
13785 36 6 -13 -9 8 15 5 -10 -20 -17 -2 17 30 22 -2 -19 -7 22 43 38 17 -3 -16 -26 -35 -40 -31 -7 12 9 -18 -47 -51 -30 -5 7 1 -20 -49 -74 -89
13767 -89 -100 -114 -126 -128 -121 -108 -88 -67 -55 -60 -74 -82 -84 -93 -106 -102 -67 -16 25 48 58 68 82 96 100 90 73 61 56 54 59 73 87 90 80 66 49 26 5 5 29
13750 29 51 49 23 -3 -20 -29 -34 -31 -13 13 30 27 13 9 23 37 33 10 -17 -39 -54 -57 -40 -1 42 73 85 82 74 63 52 44 44 52 61 56 36 16 15 25 25 9 -10
$$ packed form
13854B57LRJ5K6L5L5L5L8M1L9L6M0N6Q4J26J81K37K90L54M63N99O60N01J05l42n84n36l48
13842B455j98j05OJ49K85M45O94R35R00M26k93q48r96q37o16m59l38k19j28q9o5j7M4Q4J09
13832A324J64K59L72N18P34R49R35N12j97q10j033r02o62m83l66k67j90j46j09o3l4m4o4o0
13821C37l2j5j6j6rkKJ0K2J9j2n5p4n6j5J3Rpj5j3j4j7rJ1K4K1J3K0L7M3K7Jj5k5l7n3n5l2
13805A5%J8J6NkjOJ3J4lk3k5qLrj9nJ5K0QJ1K3K0pk2kL0M0K3Kj4k8l6k8j1lonNJ5J2KjJmj9
13785C6l0j9MJ7Pj0j5j0LJ5J9J3qk4j7J2K9K1nk1k0j3j0rnRK4J9lk7k9mK1K5J2ok1k9k5j5
13767h9j1j4j2kPJ3K0K1J2nj4qkrj3ML5N1M1K3J0J0J4J4Mj0j7j2nkNJ4J4Lj0j4j7k3k1%K4
13750B9K2kk6k6j7rnLJ8K6J7lj4mJ4J4mk3k7k2j5lJ7L9M3L1J2lqj1j1q%QRnk0k0jJ0%j6j9
$$ plain form
13731 -10 -16 -7 3 6 -4 -21 -29 -30 -38 -66 -92 -92 -76 -73 -84 -74 -26 26 44 26 6 8 21 33 43 53 59 52 23 -23 -71 -102 -109 -101 -84 -63 -49 -59 -92 -120 -123 -110
13713 -110 -100 -92 -65 -20 22 46 56 67 82 89 73 32 -17 -59 -96 -142 -198 -236 -239 -217 -199 -193 -188 -180 -176 -175 -164 -137 -104 -76 -57 -46 -39 -31 -19 -6 0 1 1 -4 -17
13695 -17 -35 -57 -88 -130 -167 -172 -141 -90 -49 -34 -46 -72 -87 -75 -42 -4 31 66 96 102 77 38 11 10 22 25 10 -13 -28 -32 -39 -59 -83 -95 -92 -79 -56 -22
13678 -22 10 26 21 6 -14 -46 -91 -133 -154 -148 -122 -90 -65 -52 -42 -25 -7 -1 -9 -21 -29 -25 -7 22 46 42 14 -13 -25 -28 -31 -30 -15 7 29 49 63 60 39 16
13661 16 7 4 -11 -46 -80 -97 -95 -86 -73 -49 -8 39 78 101 110 105 81 44 16 15 35 48 49 54 71 84 75 45 12 -6 3 46 107 149 147 113 78 61 62 71 74 58
13643 58 25 0 8 41 61 43 8 -7 6 28 31 10 -20 -44 -54 -53 -47 -39 -32 -22 -10 0 2 -4 -12 -13 -8 -1 2 0 -14 -32 -38 -25 -8 0 13 43 79 93 76 49 26
13624 26 1 -27 -45 -42 -33 -26 -12 16 48 57 42 19 1 -8 -5 10 27 34 37 47 61 62 41 1 -46 -88 -107 -101 -84 -66 -39 6 60 92 86 53 18 -7 -21 -29 -36
13607 -36 -43 -47 -45 -39 -28 -6 19 35 34 30 33 34 23 11 8 10 4 -5 -6 -2 -9 -25 -29 -17 -2 2 -1 -10 -23 -33 -32 -22 -14 -7 8 27 26 -3 -43 -74 -90 -90 -66 -30 -8 -15 -31
$$ packed form
13731a0oRJ0Lj0j7qjqk8k6%J6Lj1J0M8N2J8j8k0KJ3J2J0J0Opk9m6m8l1pQJ7K1J4j0l3k8lJ3
13713a10J0QK7M5M2K4J0J1J5Pj6m1m9m2l7m6n6l8lK2J8ONQMJJ1K7L3K8J9J1PQJ2J3OJ%nj3
13695a7j8k2l1m2l7nL1N1M1J5j2k6j5J2L3L8L5L5L0Ok5l9k7jJ2Lj5k3j5mpk0k4j2LJ3K3L4
13678b2L2J6nj5k0l2m5m2k1OK6L2K5J3J0J7J8Oqj2qMJ8K9K4mk8k7j2llJJ5K2K2K0J4lk1k3
13661A6rlj5l5l4j7KRJ3K4M1M7L9K3Rnk4l7k8jK0J3JNJ7J3rl0l3j8RM3O1M2kl4l5j7JRLj6
13643E8l3k5QL3K0j8l5j5J3K2Lk1l0k4j0JOQPJ0J2J0KoqjNPLkj4j8oJ3J7QJ3L0L6J4j7k7k3
13624B6k5k8j8LRPJ4K8L2Rj5k3j8rLJ5J7PLJ0J4Jk1m0m7m2j9OJ7J8K7M5N4L2ol3l5k5j4qp
13607c6pmKOJ1K2K5J6jmLJj1j2lKorjMpj6mJ2J5Mlrj3j0JJ0QPJ5J9jk9m0l1j6%K4L6K2pj6
$$ plain form
13586 -31 -31 -16 -3 2 10 23 28 14 -10 -29 -33 -28 -31 -54 -88 -111 -111 -97 -81 -66 -52 -44 -45 -52 -53 -40 -18 5 24 41 59 78 84 67 35 9 0 2 8 14 23 38 60 82
13567 82 87 57 0 -52 -81 -91 -92 -80 -53 -26 -20 -29 -38 -37 -33 -28 -21 -10 -3 -1 5 23 48 62 51 20 -13 -29 -27 -23 -32 -50 -69 -87 -102 -103 -81 -44 -18 -19 -43 -70 -80
13548 -80 -79 -85 -114 -155 -184 -198 -212 -230 -234 -211 -180 -170 -182 -191 -173 -125 -63 -6 21 13 -20 -56 -79 -86 -79 -59 -37 -22 -22 -35 -63 -106 -152 -181 -181 -157 -124 -96 -77
13532 -77 -59 -31 5 36 49 47 39 25 3 -20 -36 -43 -46 -43 -21 21 63 79 60 17 -27 -54 -60 -52 -39 -19 8 27 22 0 -16 -15 -6 -6 -17 -29 -35 -32 -19 4 37
13514 37 67 82 77 66 62 60 38 -10 -60 -80 -73 -63 -61 -55 -43 -32 -21 0 25 33 13 -11 -20 -21 -33 -51 -50 -29 -7 4 17 38 57 69 85 118 159 190 211 229
13496 229 244 243 223 196 168 134 89 47 23 15 4 -15 -31 -33 -28 -27 -29 -28 -27 -35 -49 -61 -69 -77 -87 -94 -95 -87 -63 -19 27 57 60 44 14 -23 -56 -70 -63 -53 -52 -56 -53 -39
13477 -39 -15 14 39 44 26 0 -16 -15 -1 19 41 52 47 35 31 40 52 57 54 48 43 41 38 24 -7 -52 -95 -124 -141 -155 -166 -162 -140 -104 -66 -36 -14 0 3 0 -8 -23
13459 -23 -45 -71 -89 -93 -88 -78 -68 -65 -77 -96 -103 -89 -72 -72 -90 -110 -126 -143 -153 -143 -116 -85 -59 -30 0 20 25 28 42 62 75 79 77 72 69 81 102 110 88 51 31
$$ packed form
13586c1%J5J3NQJ3Nj4k4j9mNlk3l4k3%J4J6J5J4QjpjJ3K2K3J9J7J8J9Oj7l2k6rKOORJ5K2K2
13567H2Nl0n7n2k9j0jJ2K7K7OrrJMNPJ1PKOJ8K5J4j1l1l3j6KMrj8j9j8j5jK2L7K6jk4k7j0
13548h0Jok9m1k9j4j4j8mK3L1J0j2rJ8M8O2N7K7ql3l6k3pPK0K2J5%j3k8m3m6k9%K4L3K8J9
13532g7J8K8L6L1J3kqj4k2k3j6plLK2M2M2J6j9m3m4k7oQJ3K0K7J9nk2j6JR%j1j2oLJ3K3L3
13514C7L0J5nj1mkk2m8n0k0PJ0KOJ2J1J1K1K5Qk0k4rjj2j8JK1K2J1J3K1J9J2J6L3M1L1K1J8
13496B29J5jk0k7k8l4m5m2k4qj1j9j6kNJkJJqj4j2qqj0pjQK4M4M6L0Lj6l0l7l3j4PJ0JmLJ4
13477c9K4K9K5Nj8k6j6JJ4K0K2J1nj2mRJ2Nlonklj4l1m5m3k9j7j4j1MK2L6L8L0K2J4Llqj5
13459b3k2k6j8mNJ0J0Lj2j9pJ4J7%j8k0j6j7j0J0K7L1K6K9L0K0NLJ4K0J3MknlJ2K1Qk2l7k0
$$ plain form
13441 31 37 53 61 59 55 54 62 74 76 63 46 38 36 25 -4 -40 -63 -68 -58 -40 -20 -7 -5 -13 -31 -55 -79 -94 -96 -90 -82 -78 -75 -71 -58 -33 -4 12 10 0 -7 -5 -2 -3 -5 -4 1 3
13421 3 -5 -26 -49 -64 -68 -70 -76 -82 -76 -48 -9 16 11 -22 -66 -105 -130 -142 -144 -145 -152 -161 -160 -146 -133 -130 -129 -114 -83 -50 -35 -44 -62 -69 -55 -32 -21 -32 -53 -61 -42 4 60 102
13401 102 119 119 117 116 112 108 114 123 112 77 36 16 26 56 90 104 87 52 23 12 0 -30 -67 -88 -87 -73 -52 -29 -15 -23 -56 -95 -121 -124 -108 -86 -68 -52 -31
13385 -31 -8 1 -2 -2 20 54 75 80 78 75 65 47 33 28 33 44 56 59 49 42 56 84 102 99 85 66 43 24 28 54 85 107 128 154 173 170 148 121 93 64 37
13367 37 22 18 20 25 29 34 37 41 45 48 49 49 46 39 33 31 29 15 -17 -64 -118 -166 -192 -192 -177 -160 -140 -105 -66 -46 -54 -67 -65 -49 -33 -26 -25 -23 -14 3 14 1 -33 -65 -71 -50 -19
13346 -19 7 18 14 4 5 18 26 20 9 6 15 33 53 56 24 -33 -75 -64 -8 49 77 73 54 38 37 48 61 67 67 68 65 55 49 59 79 84 67 38 9 -17 -36 -34 -6
13328 -6 25 38 28 16 16 22 22 11 -6 -26 -47 -65 -69 -59 -47 -45 -47 -45 -39 -37 -37 -33 -21 -9 -4 -1 2 0 -14 -39 -61 -70 -56 -24 12 35 42 49 62 73 73 62 51 48 50 49
13308 49 30 -12 -68 -114 -134 -134 -128 -122 -114 -105 -95 -73 -35 4 26 15 -26 -82 -123 -127 -100 -68 -47 -27 0 20 12 -16 -42 -51 -47 -36 -17 -1 0 -16 -42 -65 -72 -56
$$ packed form
13441C1OJ6QkmjQJ2Kj3j7qkj1k9l6k3nJ0J8K0J3Kqj8k4k4j5kOQMLMJ3K5K9J6kj0pKLjkJNK
13421Cqk1k3j5mkooOK8L9K5nl3m4l9k5j2kjprJJ4J3LJJ5L1L3J5rj8pJ4K3J1j1k1qJ9M6N6M2
13401A02J7%kjmmORj1l5m1k0J0L0L4J4j7l5k9j1j2l0l7k1JJ4K1K3J4ql3l9k6lJ6K2J8J6K1
13385c1K3Rl%K2L4K1Nklj0j8j4nNJ1J2Lj0pJ4K8J8lj4j9k3j9MK6L1K2K1K6J9lk2k7k8k9k7
13367C7j5mKNMNLMMLJ%lpokkj4l2m7n4m8k6%J5J7K0L5L9K0qj3KJ6J6PJKRJ7J1j3l4l2oK1L1
13346a9K6J1mj0JJ3Qoj1lRJ8K0Ll2n7m2J1N6N7K8mj9j6jJ1J3O%Jlj0oJ0K0Nj7k9k9k6j9KK8
13328fL1J3j0j2%O%j1j7k0k1j8mJ0J2KkKOK%MJ2J2NLLkj4k5k2rJ4L2L6K3PPJ3J1%j1j1lKj
13308D9j9m2n6m6k0%OOQRJ0K2L8L9K2j1m1n6m1mK7L2K1K0K7K0qk8k6rMJ1J9J6Jj6k6k3pJ6
$$ plain form
13291 -56 -29 -17 -29 -50 -58 -54 -55 -67 -82 -91 -90 -79 -60 -41 -34 -40 -52 -64 -74 -76 -72 -73 -81 -81 -60 -24 4 22 37 54 61 55 39 21 8 5 10 14 8 -4 -22 -47 -80 -105
13271 -105 -107 -93 -81 -76 -67 -49 -28 -7 14 26 17 -5 -18 -12 -2 -1 -10 -23 -38 -48 -45 -33 -28 -32 -31 -18 0 20 37 44 30 3 -19 -31 -41 -56 -65 -57 -36 -11 10
13254 10 17 0 -30 -38 -13 17 23 3 -20 -36 -43 -42 -37 -39 -53 -70 -81 -87 -91 -92 -88 -85 -80 -64 -34 -2 20 37 51 58 56 55 66 85 102 111 112 105 91 75 55 26 -4 -17
13235 -17 -4 19 39 53 66 71 63 52 54 68 78 81 80 78 68 46 10 -33 -76 -106 -120 -125 -123 -106 -82 -71 -78 -84 -72 -44 -11 20 45 45 11 -36 -65 -63 -42 -12 18
13217 18 42 55 63 73 76 62 36 13 -1 -11 -18 -16 -7 8 33 69 102 111 96 68 33 -6 -43 -61 -57 -37 -13 11 36 54 57 36 -2 -35 -43 -26 -8 -1 0 7 23
13199 23 44 67 86 86 65 37 18 5 -5 -5 8 23 21 -1 -37 -79 -115 -131 -131 -135 -148 -152 -135 -117 -118 -126 -120 -98 -76 -61 -49 -46 -49 -42 -16 14 31 34 34 28 10 -5
13181 -5 -6 -2 -5 -6 12 38 56 68 83 90 77 64 76 105 125 141 167 189 183 168 176 199 194 154 111 84 62 47 59 91 116 130 156 191 200 171 142 135 133 122 115
13163 115 120 119 113 125 158 178 163 133 108 84 61 57 74 84 77 83 114 142 151 160 183 203 212 228 249 239 196 169 184 212 229 256 308 354 382 431 517 596 647
$$ packed form
13291e6K7J2j2k1qMjj2j5rJJ1J9J9Poj2j2j0kMjq%K1L6K8J8J5J7Poj6j8j3lNMoj2j8k5l3k5
13271a05kJ4J2NRJ8K1K1K1J2rk2j3OJ0Jrj3j5j0LJ2NmJJ3J8K0J7Pj4k7k2j2j0j5rQK1K5K1
13254A0Pj7l0qK5L0Ok0k3j6pJNkj4j7j1omjMLNJ6L0L2K2J7J4PkjJ1J9J7RJpj4j6k0k9l0j3
13235a7J3K3K0J4J3Nqj1KJ4J0Ljkj0k2l6m3m3l0j4nKJ7K4J1poJ2K8L3L1K5%l4m7k9KK1L0L0
13217A8K4J3QJ0Lj4k6k3j4j0pKRJ5K5L6L3Rj5k8l5l9l7j8MK0K4K4K5J8Lk1l8l3qJ7J8PJPJ6
13199B3K1K3J9%k1k8j9j3j0%J3J5kk2l6m2l6j6%mj3mJ7J8jqOK2K2J5J2LlPK6L0J7L%oj8j5
13181ejMljJ8K6J8J2J5Pj3j3J2K9K0J6K6K2oj5QK3nm0m3k7k2j5J2L2K5J4K6L5Rk9k9pkj1p
13163A15NjoJ2L3K0j5l0k5k4k3mJ7J0pOL1K8RRK3K0RJ6K1j0m3k7J5K8J7K7N2M6K8M9Q6P9N1
$$ plain form
13146 647 714 831 960 1075 1221 1419 1630 1876 2294 2976 3910 5218 7206 9817 12122 12814 11426 8817 6312 4568 3432
13137 3432 2594 1987 1616 1374 1159 988 897 839 757 662 585 514 442 395 385 373 328 272 233 203 165 128 108 95 82 78 86 82 55 29 25 29 20 9
13122 9 18 45 71 84 80 46 -13 -64 -69 -32 16 57 87 99 89 74 79 104 128 143 166 201 229 231 211 188 174 176 199 238 268 266 230 180 138 117 116 121 122 115 107
13105 107 100 88 70 51 38 29 26 35 52 63 53 26 4 1 13 27 35 33 25 18 21 34 56 80 100 104 90 77 82 100 106 91 65 46 35 25 9 -14 -39 -50 -44
13087 -44 -38 -54 -85 -102 -97 -83 -72 -45 10 73 102 82 30 -17 -41 -34 -4 26 44 48 49 60 82 107 118 109 87 71 65 56 34 4 -28 -62 -91 -107 -113 -119 -127 -124 -114
13069 -114 -115 -127 -128 -101 -64 -40 -27 -17 -18 -37 -58 -61 -46 -31 -27 -32 -39 -39 -22 6 20 5 -18 -26 -22 -26 -34 -31 -18 -3 22 73 140 189 206 202 194 188 184 175 149 107 75
13050 75 69 72 65 55 58 68 65 57 51 33 -8 -46 -39 2 32 33 28 25 3 -40 -73 -74 -55 -31 -6 14 19 15 17 28 37 49 74 97 91 61 39 33 22 0 -10 1 24 48
13031 48 77 98 91 68 59 66 65 61 80 119 135 123 122 146 160 141 114 105 106 109 128 158 166 140 110 92 75 60 70 102 120 126 151 192 205 189 195 228 229 179 134
$$ packed form
13146F47O7J17J29J15J46J98K11K46M18O82R34J308J988K611K305O92j388k609k505j744j136
13137C432q38o07l71k42k15j71r1n8q2r5p7p1p2m7j0j2m5n6l9l0l8l7k0j3j3mQmk7k6mMrj1
13122IRK7K6J3ml4n9n1nL7M8M1L0J2j0j5NK5K4J5K3L5K8Kk0k3j4KK3L9L0kl6n0m2k1jNJpq
13105A07pj2j8j9j3rlRJ7J1j0k7k2lJ2J4QkqpLJ3K2K4K0Mj4j3NJ8Oj5k6j9j1j0j6k3k5j1O
13087d4Oj6l1j7NJ4J1K7N5O3K9k0n2m7k4PL0L0J8MJJ1K2K5J1rk2j6ork2l0l2l4k9j6ooqLJ0
13069a14jj2jK7L7K4J3J0jj9k1lJ5J5Mnp%J7K8J4j5k3qMmqLJ3J5K5N1O7M9J7mqomrk6m2l2
13050G5oLpj0LJ0lqoj8m1l8PM1L0Jnlk2m3l3jJ9K4K5K0NmKJ1RJ2K5K3ol0k2oj1k2j0J1K3K4
13031D8K9K1pk3rPjmJ9L9J6j2jK4J4j9k7rJLJ9L0Qk6l0j8j7j5J0L2J8OK5M1J3j6OL3Jn0m5
$$ plain form
13014 134 131 130 105 99 135 167 164 177 238 301 329 363 430 483 489 505 562 598 584 599 698 808 884 1014 1256 1519 1762 2156 2844 3755 4950 6885
13000 6885 9787 12752 14086 12892 10019 7162 5291 4248 3569 3149 3066 3258 3634 4264 5157 5947 6113 5592 4967 4859
12991 4859 5286 5884 6666 8106 10267 12296 13255 13251 13146 13185 12571 10651 7965 5664 4237 3331 2584 2047 1786 1620 1405
12982 1405 1234 1187 1147 1024 922 933 966 924 884 948 1076 1234 1552 2119 2704 2907 2587 1983 1429 1063 842 697 604 560 550 548 524
12970 524 475 434 427 441 454 461 466 453 409 349 297 258 222 195 184 178 158 124 96 82 83 94 109 116 116 120 138 161 175 182 195 223 255 273 276 282 308 348 405 509
12953 509 689 936 1277 1840 2717 3694 4253 4014 3135 2157 1478 1095 829 611 472 401 348 302 280 264 222 170 154 184 229 257 255
12941 255 230 201 202 250 338 456 609 841 1231 1815 2448 2805 2637 2050 1414 994 760 580 439 388 396 379 320 264 215 153 98 92 114
12929 114 118 110 129 167 178 160 152 160 161 158 170 178 138 68 30 43 69 80 88 103 111 117 140 170 174 155 149 164 168 149 131 129 133 141 163 184 173 145 146 178 198 224 344
$$ packed form
13014A34ljk5oL6L2lJ3O1O3K8L4O7N3OJ6N7L6j4J5R9J10P6J30K42K63K43L94O88R11J195J935
13000F885K902K965J334j194k873k857j871j043o79m20q3J92L76O30Q93P90J66n21o25j08
12991D859M27N98P82J440K161K029R59mj05L9o14j920k686k301j427r06p47n37k61j66k15
12982A405j71m7m0j23j02J1L3m2m0O4J28J58L18N67N85K03l20o04n54l66k21j45r3m4j0kk4
12970E24m9m1pJ4J3PNj3m4o0n2l9l6k7j1ok0l4k8j4JJ1J5P%MJ8K3J4PJ3K8L2J8LOK6M0N7J04
12953E09J80K47L41N63Q77R77N59k39q79r78o79l83k66k18j39p1n3m6k2j6m2n2j6L0M5K8k
12941B55k5k9JM8Q8J18J53K32L90N84O33L57j68n87o36m20k34j80j41n1Qj7n9n6m9o2n5oK2
12929A14MqJ9L8J1j8qQJlJ2Qm0p0l8J3K6J1QJ5QOK3L0Mj9oJ5Mj9j8kMQK2K1j1k8JL2K0K6J20
$$ plain form
12910 344 585 826 905 785 568 374 250 186 158 151 153 163 173 170 147 112 71 30 0 -3 17 43 59 68 70 59 32 4 -10 -9 11 46 72 64 29
12895 29 -1 -12 -14 -19 -20 -19 -30 -59 -95 -127 -160 -185 -175 -121 -53 -7 6 5 2 7 24 37 22 -17 -48 -52 -45 -47 -50 -39 -25 -21 -21 -2 34 70 87 86 68 41 17 9
12877 9 23 49 60 35 -25 -86 -115 -119 -127 -144 -145 -118 -72 -15 57 136 185 186 160 136 113 83 56 52 68 90 107 113 99 72 52 52 59 55 48 50 55 54 54 62 67 57 38
12858 38 22 4 -19 -37 -39 -34 -42 -61 -76 -81 -77 -58 -24 2 5 -1 1 11 12 17 44 81 92 71 43 29 20 17 32 64 86 85 73 62 39 -3 -51 -76 -72 -63 -69 -92 -121
12839 -121 -145 -157 -155 -143 -121 -93 -61 -26 8 37 47 34 5 -23 -49 -67 -63 -30 13 34 17 -17 -39 -36 -16 -4 -14 -38 -55 -55 -44 -30 -11 11 27 23 7
12823 7 -6 -15 -28 -41 -46 -41 -34 -32 -32 -30 -21 -2 17 22 8 -1 0 0 -14 -30 -23 -6 -7 -24 -26 -1 25 34 30 28 26 14 -6 -25 -38 -48 -56 -65 -71 -67 -50 -32 -19 -2 34 81 110
12803 110 105 74 29 -23 -70 -87 -69 -42 -33 -41 -50 -48 -39 -29 -22 -16 -2 14 18 -3 -35 -45 -25 0 11 12 15 20 25 36 60 92 117 124 112 93 84 94 105 93 61 39
12785 39 43 60 62 43 12 -12 -19 -7 3 -4 -24 -32 -22 -14 -19 -18 2 27 33 18 1 -9 -15 -18 -18 -20 -33 -53 -73 -87 -89 -73 -50 -41 -48 -45 -8 45 83 97 97 91 78 65
$$ packed form
12910C44K41K41P9j20k17j94j24o4k8pKJ0J0lk3l5m1m1l0lK0K6J6RKj1k7k8j4JK0L5K6ql5
12895B9l0j1knjJj1k9l6l2l3k5J0N4O8M6J3jlNJ7J3j5l9l1mPklJ1J4M%J9L6L6J7jj8k7k4q
12877IJ4K6J1k5o0o1k9mqj7jK7M6N7P2P9M9Jk6k4k3l0k7mJ6K2J7Oj4k7k0%PmpKNj%QNj0j9
12858C8j6j8k3j8kNqj9j5nMJ9L4K6LoKJ0JNK7L7J1k1k8j4rlJ5L2K2jj2j1k3m2m8k5MRok3k9
12839a21k4j2KJ2K2K8L2L5L4K9J0j3k9k8k6j8ML3M3K1j7l4k2LK0J2j0k4j7%J1J4J9K2J6mj6
12823Gj3rj3j3nNPK%KRJ9J9Nj4rJ%j4j6PJ7jj7kK5K6Rmkkj2k0j9j3j0qroMJ7J8J3J7L6M7K9
12803A10nl1m5n2m7j7J8K7RqrKRJ0POJ4J6Mk1l2j0K0K5J1JLNNJ1K4L2K5Pj2j9rJ0J1j2l2k2
12785C9MJ7Kj9l1k4pJ2J0pk0qJ0QnJK0K5Oj5j7j0ol%kj3k0k0j4kJ6K3RpLL7N3L8J4%oj3j3
$$ plain form
12766 65 64 71 67 44 20 12 16 21 22 21 20 18 17 21 24 16 -1 -17 -13 6 20 8 -20 -37 -36 -33 -41 -52 -52 -47 -51 -61 -65 -65 -65 -62 -44 -19 -8 -24 -57 -93 -124 -143 -141 -118 -93 -85
12745 -85 -92 -101 -100 -92 -85 -80 -79 -88 -114 -152 -179 -179 -161 -145 -139 -132 -127 -133 -147 -145 -113 -74 -52 -43 -30 -10 0 -3 -8 -18 -41 -80 -117 -137 -138 -124 -103 -80 -59 -32 2 31 31 4
12726 4 -27 -45 -44 -32 -14 2 3 -11 -32 -45 -43 -26 0 23 30 29 35 54 69 67 52 33 20 17 28 43 43 27 12 11 16 17 26 55 97 127 130 104 57 1 -43 -59
12707 -59 -44 -16 2 6 3 8 25 51 81 110 135 144 132 109 99 106 116 112 100 91 88 82 69 55 54 72 101 118 103 57 5 -34 -63 -87 -107 -115 -116 -115 -112 -102 -85 -69
12689 -69 -53 -33 -8 11 20 24 30 38 43 41 31 18 7 6 8 4 -9 -22 -18 8 52 96 129 140 125 90 49 14 -10 -25 -26 -11 13 38 56 65 60 39 13 -1 -2 -4
12671 -4 -18 -39 -59 -80 -105 -119 -112 -91 -76 -70 -60 -42 -28 -23 -21 -17 -15 -14 5 52 111 155 169 157 129 98 77 70 64 48 23 -1 -18 -26 -25 -13 6 30 47 45 13
12653 13 -39 -92 -127 -144 -151 -151 -143 -134 -128 -125 -121 -114 -105 -100 -97 -95 -89 -76 -61 -53 -51 -46 -37 -35 -47 -60 -55 -27 12 48 71 81 83 81 70 50 30 24 32 38 35 33 43 58 68 71 76 80 77 64
12632 64 45 19 -11 -33 -37 -36 -48 -68 -70 -49 -23 -10 -10 -14 -19 -21 -17 -13 -19 -34 -47 -53 -63 -79 -88 -83 -76 -77 -75 -53 -21 0 4 8 24 55 118 232 375 472 460 351
$$ packed form
12766F5jPmk3k4qMNJjjkjMLqj7j6MJ9J4j2k8j7JLqj1%Nmj0m%%LJ8K5J1j6l3l6l1j9KK3K5Q
12745h5prJQPNJrk6l8k7%J8J6OPNoj4KL2L9K2RJ3K0J0lnj0k3l9l7k0jJ4K1K3K1K7L4K9%k7
12726Dl1j8JJ2J8J6Jj4k1j3KJ7K6K3PjOJ9J5kj5j9j3lJ1J5%j6j5jNJRK9M2L0Lk6m7n6m4j6
12707e9J5K8J8MlNJ7K6L0K9K5Rj2k3j0PJ0mj2rloj3j4jJ8K9J7j5m6n2l9k9k4k0qjJLJ0J7J6
12689f9J6K0K5J9RMOQNkj0j3j1jKmj3j3MK6M4M4L3J1j5l5m1l5k4j5jJ5K4K5J8Rnk1k6j4jk
12671dj4k1k0k1k5j4PK1J5OJ0J8J4NKMKJJ9M7N9M4J4j2k8l1k1poj6k5k4j7qJJ2J9K4J7kl2
12653A3n2n3l5j7p%QROLMPRNLKOJ3J5QKNRKj2j3NK8L9L6K3J0Kkj1k0k0oQOlkJ0J5J0LNMlj3
12632F4j9k6l0k2mJj2k0kK1K6J3%mnkMMoj5j3oj0j6rNPjKK2L2K1MMJ6L1O3J14J43R7j2j09
$$ plain form
12613 351 220 126 69 23 -14 -26 -12 7 20 28 34 30 14 -1 -3 5 10 0 -22 -42 -47 -37 -26 -31 -54 -76 -86 -93 -111 -137 -149 -129 -82 -28 10 32 46 62
12597 62 80 92 95 88 71 45 21 14 31 68 113 153 168 150 110 70 41 17 -1 -3 13 30 28 9 -7 -9 4 22 30 20 0 -12 -6 7 13 10 5 -7 -32 -60
12580 -60 -74 -70 -59 -53 -55 -66 -79 -79 -57 -23 0 9 15 20 12 -18 -61 -94 -100 -85 -68 -70 -87 -97 -89 -81 -98 -133 -156 -153 -139 -126 -110 -85 -62 -54 -57 -67 -85 -114 -141 -146 -129
12561 -129 -103 -79 -61 -55 -64 -81 -87 -70 -41 -17 -7 -4 -1 -5 -23 -51 -69 -65 -48 -34 -30 -30 -25 -16 -4 6 9 2 -3 1 14 21 16 6 -1 -6 -6 -1 7 13 18 21 11 -22 -73 -115 -127
12541 -127 -112 -85 -59 -37 -19 -3 11 18 14 11 21 36 27 -11 -55 -78 -84 -84 -83 -77 -73 -76 -79 -64 -36 -21 -31 -51 -52 -26 2 3 -27 -64 -76 -59 -35 -18 0 29 67
12523 67 101 122 124 108 82 64 66 77 76 57 28 3 -10 -14 -13 -11 -2 17 38 42 30 24 39 64 79 80 73 64 57 58 65 58 28 -6 -24 -24 -20 -12 1 13 13 9 20 42 50 25
12503 25 -22 -73 -110 -120 -103 -76 -59 -60 -69 -76 -81 -76 -53 -19 0 -11 -44 -73 -80 -68 -59 -74 -109 -139 -144 -136 -140 -152 -146 -111 -70 -50 -52 -60 -67 -76 -83 -85 -86 -85 -75 -52 -33 -41 -75
12483 -75 -108 -117 -99 -69 -40 -17 -4 -3 -6 -3 2 -2 -27 -59 -73 -63 -44 -35 -34 -36 -40 -48 -51 -39 -23 -21 -38 -60 -75 -81 -85 -88 -91 -90 -75 -44 -13 -6 -27 -60 -92 -120 -134 -116
$$ packed form
12613C51j31r4n7m6l7j2J4J9J3QOmj6j5kQNj0k2k0nJ0J1nk3k2j0pj8k6j2K0M7N4L8K2J4J6
12597F2J8J2Lpj7k6k4pJ7L7M5M0J5j8m0m0k9k4j8kJ6J7kj9j6kJ3J8Qj0k0j2OJ3Olnj2k5k8
12580f0j4MJ1Okj1j3%K2L4K3RONql0m3l3oJ5J7kj7j0QQj7l5k3LJ4J3J6K5K3Qlj0j8k9k7nJ7
12561a29K6K4J8Orj7oJ7K9K4J0LLmj8k8j8MJ7J4M%NRJ2J0LpnMJ3Pnj0pn%NQONLj0l3n1m2j2
12541a27J5K7K6K2J8J6J4PmlJ0J5rl8m4k3o%JOMllJ5K8J5j0k0jK6K8Jl0l7j2J7K4J7J8K9L8
12523F7L4K1Kj6k6j8KJ1jj9k9k5j3mJKRJ9K1Mj2oJ5K5J5JprpJPpl0l4j8%MQJ3J2%mJ1K2Qk5
12503B5m7n1l7j0J7K7J7jrpnNK3L4J9j1l3k9pJ2Rj5l5l0nQmj2OL5M1K0kqprpkjJJ0K3J9ql4
12483g5l3rJ8L0K9K3J3JlLNmk5l2j4J0J9RJkmqlJ2J6Kj7k2j5omllJJ5L1L1Pk1l3l2k8j4J8
$$ plain form
12464 -116 -67 -13 16 21 16 10 4 3 14 28 32 27 25 32 36 30 14 -3 -18 -24 -21 -14 -9 -8 -7 -6 -4 0 19 53 88 109 116 117 120 123 121 115 109 99 81 58 42 41 48 54 51 40 21 -5
12443 -5 -30 -42 -41 -35 -35 -47 -67 -87 -94 -86 -68 -47 -22 5 29 39 42 46 49 42 28 20 23 34 48 63 66 39 -11 -56 -83 -105 -129 -142 -128 -97 -70 -50 -29 -8 7
12425 7 15 15 2 -24 -50 -60 -53 -38 -18 7 26 24 1 -24 -39 -43 -40 -34 -27 -18 -5 7 11 0 -22 -42 -59 -74 -83 -81 -74 -68 -58 -42 -33 -37 -41 -28 -8 -6 -22 -30 -20 -19 -47
12405 -47 -85 -99 -82 -58 -54 -69 -83 -71 -28 26 64 74 63 43 17 -5 -12 -4 0 -10 -18 -3 20 22 -5 -37 -49 -46 -46 -56 -72 -91 -114 -130 -123 -86 -37 -3 1 -13
12388 -13 -28 -27 -10 17 46 65 67 54 34 15 -1 -18 -36 -53 -71 -88 -101 -103 -87 -60 -31 -7 17 43 60 53 23 -19 -63 -101 -123 -120 -99 -84 -88 -100 -104 -101 -98
12371 -98 -94 -79 -52 -34 -40 -67 -91 -90 -62 -34 -32 -54 -70 -64 -53 -60 -83 -100 -106 -109 -109 -101 -91 -96 -119 -141 -146 -135 -111 -81 -58 -53 -59 -55 -31 -3 20 40 51 42 18 0 -3
12352 -3 -10 -32 -58 -73 -83 -101 -124 -142 -151 -150 -131 -93 -59 -51 -63 -74 -73 -65 -52 -30 -2 24 51 78 102 115 118 118 113 104 100 109 123 127 114 87 52 20 11 33 63 72 59
12334 59 51 65 90 109 111 101 88 84 90 97 98 98 105 113 104 81 55 33 8 -14 -26 -29 -38 -59 -76 -81 -77 -63 -32 12 43 41 12 -22 -56 -82 -84 -55 -13 7 -2 -24 -39
$$ packed form
12464a16M9N4K9NnoojJ1J4MnkPMoj6j7j5oLPNJJJKMJ9L4L5K1PJLLkooj0j8k3j6jPOlj1j9k6
12443ek5j2JO%j2k0k0pQJ8K1K5K7K4J0LMLpj4qLJ1J4J5Lk7n0m5k7k2k4j3J4L1K7K0K1K1J5
12425GQ%j3k6k6j0PJ5K0K5J9kk3k5j5mLOPRJ3J2Mj1k2k0j7j5rKPOJ0J6RmmJ3K0Kj6qJ0Jk8
12405d7l8j4J7K4Mj5j4J2M3N4L8J0j1k0k6k2pQMj0qJ5K3Kk7l2j2L%j0j6j9k3j6PL7M9L4Mj4
12388a3j5JJ7K7K9J9Kj3k0j9j6j7j8j7j8j7j3kJ6K7K9K4K4K6J7pl0m2m4l8k2LK1J5mj2mLL
12371i8MJ5K7J8ok7k4JK8K8Kk2j6OJ1pk3j7ol%QJ0nk3k2nJ1K4L0K3NoMK4K8K3K0J1rk4j8l
12352cpk2k6j5j0j8k3j8rJJ9L8L4Qj2j1JQJ3K2K8K6K7K7K4J3L%nrmRJ4Mj3k7l5l2rK2L0Rj3
12334E9qJ4K5J9Kj0j3mOPJ%PQrk3k6k2k5k2j2lrk1j7nMJ4L1M4L1kk9l4l4k6kK9M2K0rk2j5
$$ plain form
12315 -39 -43 -42 -37 -33 -35 -49 -60 -53 -24 6 20 17 11 10 0 -34 -78 -108 -106 -84 -61 -49 -51 -66 -86 -97 -93 -79 -73 -86 -111 -131 -131 -107 -73 -48 -40 -47 -58 -61 -48 -18 9
12297 9 10 -16 -53 -79 -97 -113 -124 -115 -85 -50 -24 -10 1 11 6 -30 -96 -166 -200 -181 -121 -47 15 50 55 40 18 -1 -18 -30 -34 -32 -35 -43 -45 -34 -19 -15 -24 -43 -64
12279 -64 -78 -77 -56 -29 -9 1 2 -7 -30 -55 -69 -69 -59 -41 -21 -7 -7 -11 -9 -1 2 4 11 24 31 29 30 44 61 69 71 71 63 35 -7 -38 -32 10 59 87 82 56 22 -14 -52
12259 -52 -84 -103 -109 -103 -84 -56 -29 -14 -17 -33 -54 -74 -83 -77 -58 -36 -15 1 4 -16 -54 -88 -107 -121 -138 -149 -148 -140 -137 -139 -137 -127 -108 -76 -35 -6 -6 -28 -47 -45 -25
12241 -25 -3 8 2 -18 -36 -36 -19 1 24 54 83 87 61 26 1 -17 -42 -65 -64 -42 -25 -29 -39 -26 12 51 59 32 -2 -18 -10 8 28 46 58 53 30 2 -24
12225 -24 -51 -80 -95 -83 -57 -45 -57 -75 -76 -52 -12 21 28 0 -37 -48 -23 11 28 28 24 21 20 23 32 40 40 36 36 38 38 37 36 23 -11 -51 -72 -72 -69 -70 -66 -52 -35 -25 -23
12205 -23 -28 -42 -57 -62 -52 -41 -37 -32 -20 -9 -6 -8 -9 -14 -22 -24 -20 -19 -32 -44 -39 -24 -20 -32 -45 -44 -37 -29 -23 -19 -28 -56 -91 -112 -108 -91 -80 -88 -104 -109 -90 -57 -23 1 15 15 -1
12185 -1 -23 -32 -27 -27 -49 -85 -114 -124 -117 -100 -77 -56 -50 -62 -76 -76 -57 -26 6 31 36 16 -15 -34 -34 -30 -33 -34 -16 8 16 6 0 0 -7 -33 -59 -70 -77 -97 -119 -115 -83 -48
$$ packed form
12315c9mJNMkj4j1PK9L0J4lojj0l4m4l0KK2K3J2kj5k0j1MJ4Oj3k5k0%K4L4K5Qpj1lJ3L0K7
12297IJk6l7k6j8j6j1RL0L5K6J4J1J0nl6o6p0l4J9O0P4O2L5Nj5k2j9j7j2mKlqkJ1J5Mrj9k1
12279f4j4JK1K7K0J0Jrk3k5j4%J0J8K0J4%mKQLKPJ3PkJJ4J7QK%qk8m2l1OM2M9K8nk6l4l6l8
12259e2l2j9oOJ9K8K7J5lj6k1k0rOJ9K2K1J6Lk0l8l4j9j4j7j1JQLkKJ0J9L2M1K9%k2j9KK0
12241b5K2J1ok0j8%J7K0K3L0K9Mk6l5k5j8k5k3JK2J7mj0J3L8L9Qk7l4j6QJ8K0J8J2nk3k8k6
12225b4k7k9j5J2K6J2j2j8jK4M0L3Pk8l7j1K5L4J7%mljLRQ%m%K%jjj3l4m0k1%LjMJ4J7J0K
12205b3nj4j5nJ0J1MNJ2J1LkjnqkMJj3j2NJ5Mj2j3JPQOMrk8l5k1MJ7J1qj6nJ9L3L4K4J4%j6
12185ak2rN%k2l6k9j0PJ7K3K1Oj2j4%J9L1L2K5Nk0l1j9%MljJ8K4Qj0o%pk6k6j1pk0k2ML2L5
$$ plain form
12166 -48 -29 -22 -16 -13 -15 -21 -26 -27 -23 -9 16 50 80 92 76 39 8 9 34 55 50 28 5 -9 -9 14 51 70 52 15 -9 -16 -18 -15 4 41 69 65 33 -5 -31 -44
12147 -44 -53 -62 -64 -55 -37 -23 -15 -4 11 16 0 -21 -22 -1 12 -1 -33 -61 -80 -92 -93 -77 -50 -32 -29 -29 -19 -2 9 11 7 7 14 24 28 17 -4 -19 -15 8 38 59 59
12129 59 38 6 -23 -45 -57 -62 -59 -54 -54 -62 -70 -72 -65 -47 -15 30 73 91 76 43 16 7 13 20 14 -9 -37 -46 -23 19 51 54 34 18 16 18 5 -15 -24 -14 -5 -17 -48 -76
12110 -76 -85 -80 -79 -92 -116 -134 -128 -99 -69 -53 -47 -34 -20 -18 -27 -30 -21 -24 -58 -104 -116 -74 0 62 86 69 29 -10 -30 -28 -11 12 43 73 89 81 58 42 49 76 97
12092 97 93 69 39 14 -10 -32 -40 -28 -7 6 11 11 3 -14 -30 -29 -15 -8 -17 -31 -35 -27 -11 10 40 76 113 145 163 158 130 94 76 88 120 143 137 104 65 35 14
12074 14 0 2 25 56 72 74 80 98 116 118 110 96 77 48 21 8 14 29 44 53 50 34 7 -25 -51 -57 -43 -27 -30 -50 -67 -67 -61 -60 -67 -79 -92 -104 -105 -89 -63 -40
12056 -40 -22 -5 10 17 10 -11 -42 -69 -82 -84 -89 -100 -112 -123 -133 -140 -132 -115 -107 -116 -125 -115 -86 -54 -30 -18 -20 -28 -23 1 23 17 -4 -10 6 22 18 3 -7 -13 -19 -24 -24 -19 -14
12036 -14 -8 0 5 -6 -41 -87 -120 -124 -102 -76 -64 -63 -63 -57 -43 -24 -5 0 -13 -27 -31 -30 -45 -75 -104 -125 -141 -152 -143 -115 -89 -76 -69 -60 -61 -81 -107 -119 -112 -101 -95 -90 -82 -74
$$ packed form
12166d8J9POLkonjMJ4K5L4L0J2j6l7l1JK5K1nk2k3j4%K3L7J9j8l7k4pkLJ9L7K8ml2l8k6j3
12147d4rrkRJ8J4QJ1J5Nj6k1jK1J3j3l2k8j9j2jJ6K7J8L%J0J7J1Km%PJ0Mj1k1j5MK3L0K1%
12129E9k1l2k9k2j2nLN%qqkPJ8L2M5M3J8j5l3k7rOPok3k8rK3M2L2Lk0j6kKj3k0rJ0Rj2l1k8
12110g6rNJj3k4j8OK9L0J6OJ3J4KrlRll4m6j2M2P4O2K4j7m0l9k0KJ7K3L1L0J6qk3j6PK7K1
12092I7mk4l0k5k4k2qJ2K1J3N%qj7j6JJ4Prj4mQJ6K1L0L6L7L2J8nk8l6j8J2L2K3ol3l9l0k1
12074A4j4KK3L1J6KOJ8J8Kqj4j9k9k7j3OJ5J5Rlj6k7l2k6oJ4J6lk0j7%OJpj2j3j2jJ6K6K3
12056d0J8J7J5Ppk1l1k7j3knj1j2j1j0pQJ7QrrJ0K9L2K4J2kqNK4K2ok1oJ6J6mj5j0oon%NN
12036a4OQNj1l5m6l3mK2K6J2J%OJ4J9J9Nj3j4mJj5l0k9k1j6j1RK8K6J3PRjk0k6j2PJ1ONQQ
$$ plain form
12017 -74 -73 -76 -77 -70 -57 -47 -43 -41 -35 -28 -27 -34 -39 -38 -33 -34 -46 -59 -66 -65 -65 -74 -93 -106 -103 -83 -55 -27 0 23 37 36 24 3 -20 -36 -32 -4 36 72 89 81 54 20 -5 -22
11997 -22 -39 -64 -90 -104 -101 -88 -73 -56 -32 0 30 43 37 27 30 42 48 42 38 41 47 50 56 69 80 78 67 59 57 57 56 53 48 39 29 24 34 55 71 68 48 29 26 29 25 15
11977 15 7 7 14 33 65 97 105 86 62 53 57 64 75 94 109 105 82 64 74 108 139 143 121 91 65 34 -8 -47 -59 -42 -17 0 9 15 9 -6 -17 -16 -10 -9 -1 28 71
11959 71 107 125 130 122 97 63 44 53 77 88 76 57 47 46 40 25 12 7 5 6 18 40 49 26 -8 -27 -27 -32 -47 -49 -28 -1 6 -3 -12 -10 -4 3 9 7 -5 -18 -19 -7 10
11939 10 31 48 57 53 46 44 49 62 81 99 98 78 55 41 27 6 -6 8 50 91 106 90 58 36 39 58 72 71 68 79 100 122 142 160 170 166 154 147 147 144 129
11922 129 102 69 44 32 34 41 52 63 67 57 38 27 30 39 49 58 61 62 79 125 181 220 248 289 336 355 333 304 299 315 335 356 383 407 419 412 385 354 350 391
11904 391 453 504 545 592 628 630 625 649 693 729 779 875 984 1054 1108 1198 1304 1396 1551 1853 2243 2652 3216 4134 5425 7185 9962 14125
11892 14125 18597 20965 19608 15466 11082 8084 6255 4830 3690 3024 2644 2239 1881 1770 1776 1664 1511 1513 1598 1590 1556 1651
$$ packed form
12017g4JljPJ3J0MKOPJpnJNjj2j3pJ%rj9j3LK0K8K8K7K3J4jj2k1k3j6MK8M0L6J7qk7l4k5j7
11997b2j7k5k6j4LJ3J5J7K4L2L0J3oj0LJ2OomLOLOJ3J1kj1qk%jlnrj0nJ0K1J6lk0j9lLmj0
11977A5q%PJ9L2L2Qj9k4rMPJ1J9J5mk3j8J0L4L1Mk2l0k6l1m2l9j2J7K5J7ROoj5j1JOJQK9M3
11959G1L6J8Nqk5l4j9RK4J1j2j9j0joj5j3nkJJ2K2Rk3l4j9%nj5kK1K7PrrKOPOkj2j3jJ2J7
11939A0K1J7RmpkNJ3J9J8jk0k3j4j4k1j2J4M2M1J5j6l2k2LJ9J4jlJ1K1K2K0J8J0mj2p%lj5
11922A29k7l3k5j2KPJ1J1Mj0j9j1LRJ0RLJJ7M6N6L9K8M1M7J9k2k9nJ6K0K1K7K4J2pk7l1mM1
11904C91O2N1M1M7L6KnK4M4L6N0R6J09P0N4R0J06R2J55L02L90M09N64R18J291J760K777M163
11892A4125M472K368j357m142m384k998j829j425j140o66l80m05l58j11Oj12j53KQ5ql4R5
$$ plain form
11883 1651 1777 1776 1758 1906 2117 2224 2371 2771 3301 3800 4550 5936 7897 10443 14421 20502 27129 30708 28841 22868 16410
11873 16410 11854 9042 6941 5257 4185 3576 3059 2569 2240 2029 1783 1526 1380 1315 1216 1097 1046 1034 968 857 783 754 716
11863 716 685 713 772 777 706 607 509 408 324 291 288 270 242 241 265 274 254 226 191 140 91 72 71 52 12 -14 -13 -4 -6 -18 -39 -63 -71 -41 12 60 88 108
11847 108 119 111 93 85 94 103 97 82 67 60 62 66 58 28 -10 -38 -51 -55 -49 -28 -1 16 27 41 56 59 51 49 59 76 93 111 129 138 137 131 125 120 117 116 112 100 85 79 80 82 83
11827 83 88 95 95 84 68 54 46 44 46 49 50 57 71 89 99 91 70 46 29 24 23 12 -8 -22 -20 -14 -23 -55 -94 -122 -131 -126 -117 -109 -96 -67 -24 13 27 21 11 2 -2 0 11 21
11807 21 22 20 28 45 57 57 48 33 22 25 44 58 40 -5 -46 -63 -64 -66 -67 -58 -40 -16 9 35 53 53 43 43 66 112 160 190 188 156 107 60 30 27 45 61 54 26
11788 26 1 -5 3 15 25 39 60 80 81 54 10 -19 -14 16 51 80 104 119 114 97 92 112 135 136 113 82 52 20 -8 -17 0 33 62 78 83 79 65 42 13 -9
11771 -9 -18 -15 -12 -11 -3 18 46 62 67 74 93 112 119 110 97 91 96 107 117 123 128 131 124 109 99 106 124 135 134 130 133 134 121 93 59 29 14 15 26 38 46 51 49 30 -5 -42 -67
$$ packed form
11883A651J26jj8J48K11J07J47M00N30M99P50J386J961K546L978O081O627L579j867n973o458
11873A6410m556k812k101j684j072o09n17m90l29k11k46k57j46o5r9j19n1j2o6j11p4k9l8
11863G16l1K8N9Np1r9r8j01q4l3lj8k8jK4Rk0k8l5n1m9j9jj9m0k6JRkj2k1k4qL0N3M8K8K0
11847A08J1qj8qRRoj5j5pKMql0l8k8j3mOK1K7J7J1J4J5LqkJ0J7J7J8J8Rjoonljmj2j5oJKJ
11827H3NP%j1j6j4qkKLJPJ4J8J0qk1k4j7njj1k0j4KOrl2l9k8rNRQJ3K9M3L7J4oj0rmKJ1J0
11807B1JkQJ7J2%rj5j1LJ9J4j8m5m1j7jkjRJ8K4K5K6J8%j0%K3M6M8L0kl2m9m7l0lJ8J6pk8
11788B6k5oQJ2J0J4K1K0Jk7m4k9NL0L5K9K4J5nj7nK0K3Jk3l1l0l2k8rJ7L3K9J6Nmj4k3k9k2
11771irLLJQK1K8J6NPJ9J9Prj3oNJ1J0ONLpj5j0PJ8J1jmLJj3k8l4l0j5JJ1J2QNkj9l5l7k5
$$ plain form
11751 -67 -74 -70 -59 -49 -46 -50 -52 -51 -59 -83 -114 -135 -137 -126 -111 -104 -111 -124 -125 -106 -78 -61 -58 -58 -49 -35 -23 -18 -17 -16 -4 22 54 78 90 97 98 91 82 85 92 83 53 25 27 56 85
11730 85 87 57 9 -39 -73 -91 -98 -98 -90 -72 -45 -11 22 45 42 17 -8 -21 -28 -37 -38 -21 7 26 21 0 -26 -46 -58 -63 -65 -59 -38 -5 19 25 21 22 26 18 -2 -20 -22 -16
11711 -16 -11 -11 -15 -27 -48 -69 -74 -58 -29 -4 1 -15 -43 -62 -58 -33 -1 20 24 7 -20 -47 -62 -61 -44 -18 6 25 42 62 83 96 97 86 70 51 33 17 3
11694 3 -12 -29 -39 -31 -7 18 32 35 32 28 18 0 -17 -22 -14 -5 -5 -11 -17 -22 -29 -37 -39 -41 -46 -53 -53 -46 -43 -51 -64 -72 -72 -69 -73 -88 -106 -111 -102 -91 -86 -82 -74 -72 -87 -106 -103 -74 -39 -15 -5
11672 -5 -2 1 13 33 48 43 20 1 0 7 9 8 8 4 -11 -26 -20 7 37 47 39 29 35 51 57 35 -7 -46 -64 -57 -34 0 38 64 70 59 37 6 -27 -51 -57 -50 -44 -45 -50
11653 -50 -59 -71 -85 -91 -88 -79 -67 -47 -16 24 59 69 46 5 -25 -31 -21 -15 -18 -17 -5 5 -3 -31 -59 -70 -66 -59 -57 -52 -42 -35 -39 -51 -64 -82 -101 -106 -86 -56 -34 -16 15
11634 15 56 81 79 71 77 88 84 61 31 3 -19 -33 -38 -38 -32 -10 26 52 46 17 -5 -10 -5 -5 -6 -1 19 52 83 92 70 36 15 18 39 68 94 100 80 43 10 -13 -38
11616 -38 -69 -100 -126 -142 -146 -129 -95 -62 -45 -42 -35 -7 37 83 117 135 139 130 111 92 80 62 28 -14 -37 -31 -16 -12 -24 -50 -85 -119 -133 -124 -115 -124 -142 -146 -127 -93
$$ packed form
11751f7pMJ1J0LmkJqk4l1k1kJ1J5Ppj3jJ9K8J7L%RJ4J2NJJJ2K6L2K4J2PJprLPrl0k8KK9K9
11730H5Kl0m8m8l4j8p%QJ8K7L4L3K3lk5k5j3prjJ7K8J9nk1k6k0j2nkOK1L3K4OmJMqk0j8kO
11711a6N%mj2k1k1nJ6K9K5Nj6k8j9MK5L2K1Mj7k7k7j5JJ7K6K4J9J7K0K1J3Jj1j6j9j8j6j4
11694Cj5j7j0QK4K5J4Llmj0j8j7nQR%oonpqkknp%PLqj3q%Lmj5j8nRJ1NMQKj5j9LK9L5K4J0
11672eLLJ2K0J5nk3j9jPKj%mj5j5OK7L0J0qj0OJ6Ok2m2l9j8PK3L4L8K6Oj1k2l1l3k4oPOjn
11653e0rj2j4oLRJ2K0L1M0L5J0k3m1l0oJ0OlJJ2J0qk8k8j1MPKNJ0Pmj2j3j8j9nK0L0K2J8L1
11634A5M1K5kqOJ1mk3l0k8k2j4n%OK2L6K6ok9k2nN%jNK0L3L1Rk2l4k1LK1K9K6Ok0l7l3k3k5
11616c8l1l1k6j6mJ7L4L3J7LPK8M4M6L4J8Mrj9j9j2j8l4m2k3OJ5Mj2k6l5l4j4RRrj8mJ9L4
$$ plain form
11598 -93 -55 -29 -21 -21 -10 10 14 -12 -49 -66 -67 -69 -66 -41 1 29 28 10 -3 -9 -7 -1 4 12 23 35 32 10 -14 -21 -15 -11 -9 -2 6 4 -2 0 11 16 9 5 14 29 42 56 72 91
11577 91 117 149 176 180 155 110 60 25 15 24 27 19 22 47 65 48 8 -19 -32 -46 -58 -43 -6 15 6 -13 -26 -38 -51 -55 -48 -45 -49 -49 -43 -45 -56 -63 -61 -62 -70 -77 -79 -84 -86
11558 -86 -73 -59 -67 -88 -92 -73 -66 -80 -79 -38 18 51 56 53 52 53 59 62 47 17 3 20 53 83 111 142 166 174 171 164 150 135 138 162 183 182 164 142 116 89 73 64 48
11539 48 29 30 53 67 62 59 65 53 13 -17 -7 28 57 78 100 111 101 88 93 106 106 94 79 53 12 -23 -41 -49 -55 -49 -26 -8 -13 -30 -45 -61 -69 -48 -4 15
11522 15 -6 -32 -26 -3 10 28 56 63 32 2 11 31 19 -7 -5 25 58 93 146 194 212 218 248 286 291 264 239 225 210 198 197 192 176 173 195 208 189 166 162 154
11505 154 121 100 126 159 155 133 128 117 78 57 95 144 144 133 173 241 276 288 322 354 343 322 346 382 387 406 494 604 680 779 960 1173 1391 1736
11490 1736 2293 2982 3859 5283 7340 9213 9683 8410 6312 4535 3439 2752 2245 1889 1629 1392 1225 1184 1196 1197 1258 1416
11480 1416 1573 1685 1869 2173 2491 2843 3441 4349 5470 7050 9619 12917 15406 15597 13707 11388 10006 9871 10852 12687
$$ packed form
11598i3L8K6Q%J1K0Mk6l7j7jkLK5M2K8jj8j3oKONQJ1J2lk2k4pOMKPQkoKJ1NpmRJ5J3J4J6J9
11577I1K6L2K7Mk5m5n0l5j0RLqLK5J8j7m0k7j3j4j2J5L7K1rj9j3j2j3mPLm%Okj1pKjqpknk
11558h6J3J4qk1mJ9Pj4JM1N6L3NljJOLj5l0j4J7L3L0K8L1K4Qlpj4j5LK4K1jj8k2k6k7j6rj6
11539D8j9JK3J4nlOj2m0l0J0L5K9K1K2J1j0j3NJ3%j2j5k6m1l5j8qoOK3J8nj7j5j6qK1M4J9
11522A5k1k6OK3J3J8K8Pl1l0RK0j2k6KL0L3L5N3M8J8OL0L8Nk7k5j4j5j2jnj6lK2J3j9k3mq
11505A54l3k1K6L3mk2nj1l9k1L8M9%j1M0O8L5J2L4L2j1k1K4L6NJ9Q8J10P6R9J81K13K18L45
11490A736N57O89Q77J424K057J873M70j273k098j777j096o87n07l56k60k37j67m1J2JO1J58
11480A416J57J12J84L04L18L52N98R08J121J580K569L298K489J91j890k319j382j35R81J835
$$ plain form
11472 12687 14459 14750 12975 10096 7538 5819 4608 3642 2981 2596 2296 2032 1894 1859 1818 1778 1822 1927 2065 2337 2837 3557
11462 3557 4606 6205 8117 9354 8996 7234 5196 3747 2869 2207 1680 1363 1178 996 844 787 756 673 592 585 598 560 512
11452 512 517 541 520 468 424 369 290 231 224 230 212 197 211 221 205 197 215 218 185 160 173 180 146 108 103 104 89 93 141 182 167 124 107 114 110 97 90 77 52 41
11435 41 56 64 41 19 27 38 27 23 65 136 195 236 263 256 210 164 153 152 124 88 84 108 126 131 129 119 97 89 106 117 98 69 58 48 16 -14 -9 18 35 45
11417 45 72 105 117 116 127 145 136 101 70 57 54 57 63 64 59 72 115 149 131 75 36 32 37 40 57 93 118 111 77 38 10 3 19 41 51 50 43 29 15 28 77 131
11399 131 153 151 151 151 131 98 83 93 111 131 160 186 178 134 86 59 46 38 35 44 58 72 79 75 68 76 104 126 120 96 82 74 50 6 -30 -46 -51 -55 -56 -53 -48 -31 1
11381 1 33 37 13 -12 -28 -34 -28 -10 3 -9 -39 -58 -58 -57 -64 -72 -78 -88 -96 -94 -89 -94 -97 -78 -43 -22 -21 -17 0 16 16 4 -12 -39 -69 -83 -75 -64 -60 -52 -36 -31 -46 -60 -52 -25
11361 -25 2 17 16 0 -23 -32 -23 -13 -10 -5 7 18 17 8 0 -7 -8 4 29 49 52 41 24 9 1 5 10 0 -25 -49 -55 -42 -10 33 70 84 81 81 88 84 65 45 26 -3
$$ packed form
11472A2687J772K91j775k879k558j719j211r66o61l85l00k64j38l5m1m0M4J05J38K72N00P20
11462C557J049J599J912J237l58j762k038j449q78o62n27l17j85j82j52n7l1q3q1pJ3l8m8
11452E12NK4k1n2m4n5p9n9pOj8j5J4J0j6qJ8Ll3k5J3Pl4l8nJj5MM8M1j5m3j7Pmj3pj3k5j1
11435D1J5Qk3k2QJ1j1mM2P1N9M1K7pm6m6j1jk8l6mK4J8Nkj0k2qJ7J1j9k9j1j0l2l0NK7J7J0
11417D5K7L3J2jJ1J8rl5l1j3lLOJnJ3M3L4j8n6l9mNLJ7L6K5pl4l9k8pJ6K2J0jpj4j4J3M9N4
11399A31K2k%%k0l3j5J0J8K0K9K6qm4m8k7j3qlRJ4J4PmpQK8K2ok4j4qk4m4l6j6nmjLNJ7L2
11381AL2Mk4k5j6oOJ8J3j2l0j9%Jpqoj0qKNnlJ9L5K1JMJ7J6%j2j6k7l0j4QJ1MQJ6Nj5j4QK7
11361b5K7J5jj6k3rRJ0LNJ2J1jrqpjJ2K5K0Lj1j7j5qMNj0k5k4oJ3L2M3L7J4l%Pmj9k0j9k9
$$ plain form
11342 -3 -48 -87 -109 -118 -118 -101 -74 -64 -80 -99 -93 -62 -29 -3 18 37 57 78 85 66 30 10 16 26 22 16 25 46 64 79 86 76 51 37 47 57 42 12 -9 -17
11324 -17 -23 -23 -12 0 4 9 32 69 97 111 119 117 94 53 21 17 32 41 33 9 -14 -25 -24 -19 -10 12 48 75 73 46 10 -25 -54 -64 -52 -37 -39 -49 -45 -26 -12 -12 -18
11306 -18 -19 -10 13 51 85 93 75 44 16 5 19 49 70 61 40 31 33 20 -8 -25 -18 -7 -12 -29 -35 -22 0 24 39 39 28 13 2 1 10 17 9 -15 -33 -24 1 19
11287 19 23 26 32 28 13 3 5 9 1 -15 -34 -54 -72 -74 -56 -33 -22 -28 -40 -45 -40 -25 -11 -8 -21 -44 -69 -99 -134 -170 -193 -190 -156 -101 -43 3 30 32 1 -54 -109 -144
11269 -144 -156 -150 -127 -94 -73 -77 -89 -87 -77 -81 -95 -99 -79 -49 -18 17 52 70 66 53 46 44 44 47 48 30 -6 -46 -74 -92 -101 -95 -82 -80 -94 -108 -109 -109 -115 -112 -82 -37 -5
11251 -5 9 21 32 32 20 8 4 -6 -32 -64 -86 -92 -90 -92 -97 -94 -75 -51 -36 -32 -24 -7 2 -8 -30 -43 -41 -39 -51 -70 -79 -76 -75 -85 -98 -94 -70 -45 -36 -33 -15 19 52 69
11231 69 71 68 61 49 34 14 -13 -42 -60 -62 -59 -64 -78 -92 -99 -94 -77 -56 -39 -26 -10 0 -10 -44 -82 -109 -134 -168 -200 -209 -191 -161 -133 -112 -93 -65 -23 22 47
11215 47 41 23 16 24 31 29 16 -3 -25 -34 -22 4 30 42 40 26 8 0 2 9 16 29 49 61 53 34 25 31 39 43 42 35 12 -24 -62 -82 -74 -47 -21 -13 -17 -17 -5 6 10 18 39
$$ packed form
11342cm5l9k2r%J7K7J0j6j9OL1L3K6K1J9K0K1Pj9l6k0OJ0moRK1J8J5Pj0k5j4J0J0j5l0k1q
11324a7o%J1J2MNK3L7K8J4Qkk3m1l2mJ5Rqk4k3j1JNRK2L6K7kk7l6l5k9j0J2J5kj0MJ9J4%o
11306a8jRK3L8L4Qj8l1k8j1J4L0K1rk1rKj3k8j7PJ1nj7oJ3K2K4J5%j1j5j1jRPqk4j8RK5J8
11287A9MLOmj5j0KMqj6j9k0j8kJ8K3J1oj2nNJ5J4Lj3k3k5l0l5l6k3LL4N5N8M6K7Kl1n5n5l5
11269a44j2OK3L3K1mj2KJ0mj4mK0L0L1L5L5J8mj3pk%LJj8l6m0k8j8rOJ3Kj4j4j%oLL0M5L2
11251eJ4J2J1%j2j2mj0k6l2k2oKknLJ9K4J5MQJ7Rj0k2j3KKj2j9rLJj0j3MK4K5RLJ8L4L3J7
11231F9Klpj2j5k0k7k9j8kLnj4j4pNJ7K1J7J3J6J0j0l4l8k7k5l4l2rJ8L0K8K1J9K8M2M5K5
11215D7oj8pQPkj3j9k2rJ2K6K6J2kj4j8qKPPJ3K0J2qj9rOQMjpk3l6l8k0QK7K6Qm%J2J1MQK1
$$ plain form
11194 39 63 76 75 68 52 23 -3 -10 5 23 32 37 42 43 42 39 27 0 -19 -5 36 71 77 70 66 59 29 -13 -46 -53 -40 -15 17 55 90 110 108 81 41 6 -10 -9 -3
11176 -3 1 -3 -15 -28 -35 -41 -53 -67 -71 -62 -54 -58 -66 -64 -56 -52 -48 -32 -1 22 22 0 -27 -43 -49 -48 -43 -35 -28 -25 -25 -20 -17 -29 -60 -91 -103 -103 -115 -141 -161 -155 -121 -74 -35 -17 -22 -31 -30
11154 -30 -21 -21 -28 -26 -10 3 0 -16 -38 -59 -78 -85 -80 -74 -77 -79 -65 -39 -12 11 37 66 92 110 113 93 52 12 -5 -1 9 17 23 30 37 50 71 90 91 78 65 54 33
11136 33 5 -8 1 16 15 2 -5 -4 -2 5 26 48 42 3 -43 -68 -66 -50 -30 -10 6 18 34 61 88 100 90 67 44 21 2 -5 0 10 12 5 -8 -25 -36 -39 -47 -76
11117 -76 -120 -146 -135 -106 -92 -96 -88 -52 -10 7 2 -5 -3 2 2 4 17 38 48 35 11 2 16 36 42 34 26 24 20 14 8 3 -8 -30 -52 -69 -71 -48 0 53 80 72 49 33
11098 33 25 26 41 68 85 70 29 -17 -50 -65 -63 -51 -45 -52 -65 -71 -64 -41 0 54 102 127 131 119 93 56 28 19 12 -9 -38 -45 -22 9 25 19 -2 -30 -56 -73 -81
11081 -81 -79 -64 -37 -19 -27 -53 -68 -68 -79 -122 -179 -217 -227 -217 -192 -150 -97 -46 -9 10 19 17 3 -17 -30 -21 14 55 75 62 23 -26 -82 -136 -171 -175 -155 -134
11064 -134 -126 -124 -112 -84 -55 -40 -41 -50 -60 -72 -89 -101 -98 -79 -60 -54 -61 -70 -66 -46 -20 0 10 18 29 36 34 31 37 44 30 -10 -56 -79 -71 -51 -42 -54 -81 -102 -103 -86 -62
$$ packed form
11194C9K4J3jpj6k9k6pJ5J8RNNJjlj2k7j9J4M1L5Opmpl0m2l3pJ3K5L2L8L5K0kk7m0l5j6JO
11176cMmj2j3poj2j4mRQmqKQMMJ6L1K3%k2k7j6oJNQPL%NLj2l1l1j2%j2k6k0OL4M7L9J8nrJ
11154c0R%pKJ6J3lj6k2k1j9pNOlkJ4K6K7K3K6K9K6J8Lk0m1m0j7MJ0QOPPJ3K1J9Jj3j3j1k1
11136C3k8j3RJ5jj3pJKPK1K2ol9m6k5KJ6K0K0J6J2J6K7K7J2j0k3k3k3j9pNJ0Kpj3j7j1lqk9
11117g6m4k6J1K9J4mQL6M2J7npKN%KJ3K1J0j3k4rJ4K0Oqqkmoonj1k2k2j7kK3M8N3K7qk3j6
11098C3qJJ5K7J7j5m1m6l3j5KJ2Opj3oPK3M1N4M8K5Mj2k6l7k8rpk1k9pK3L1J6ok1k8k6j7q
11081h1KJ5K7J8qk6j5%j1m3n7l8j0J0K5M2N3N1L7J9Rkj4k0j3RL5M1K0j3l9m9n6n4l5mK0K1
11064a34QKJ2K8K9J5jrj0j2j7j2LJ9J9OprMK0K6K0J0QJ1PklOPj4m0m6k3QK0Rj2k7k1jJ7K4
$$ plain form
11045 -62 -36 -13 0 0 -8 -18 -30 -47 -61 -54 -26 7 29 38 32 12 -12 -24 -12 7 21 25 28 39 54 65 53 6 -64 -129 -165 -175 -172 -158 -133 -104 -83 -71 -60
11029 -60 -47 -35 -28 -29 -38 -48 -48 -36 -30 -44 -65 -67 -45 -19 -5 -4 -7 -13 -17 -18 -19 -23 -26 -16 6 27 35 32 22 4 -19 -42 -59 -72 -75 -59 -21 17 38 40 33 16 -16 -62
11009 -62 -107 -140 -162 -170 -156 -124 -93 -82 -86 -95 -104 -114 -117 -103 -77 -55 -47 -43 -31 -18 -19 -38 -64 -77 -72 -55 -40 -38 -50 -72 -97 -116 -114 -81 -34 0 5 -1 -2 0 -16 -49
10991 -49 -74 -74 -60 -48 -38 -21 -2 1 -11 -30 -37 -28 -13 -5 -7 -8 0 24 52 74 86 85 69 40 14 4 7 9 3 -7 -10 -4 5 8 0 -17 -36 -53 -66 -66 -49 -26 -17 -31
10972 -31 -50 -55 -40 -21 -9 -3 0 0 -11 -30 -45 -45 -30 -14 -2 11 35 61 68 46 11 -22 -58 -96 -123 -121 -90 -51 -20 4 32 63 89 97 86 68 59 57 45 18
10955 18 -11 -34 -58 -89 -116 -123 -110 -86 -58 -24 2 13 10 5 5 3 -2 -12 -33 -64 -80 -61 -17 14 15 0 -16 -31 -47 -57 -56 -54 -55 -51 -38 -29 -37 -52 -59 -61 -70 -80 -73
10936 -73 -53 -41 -52 -76 -93 -87 -58 -22 5 19 24 24 15 -9 -43 -71 -90 -105 -120 -129 -128 -118 -99 -73 -42 -13 11 31 44 45 37 27 23 20 9 -6 -15 -11 -2 -2 -13 -25
10918 -25 -24 -11 0 -6 -32 -68 -98 -114 -117 -114 -108 -98 -88 -86 -95 -101 -95 -86 -87 -91 -78 -40 2 32 53 68 73 63 52 55 65 61 39 8 -23 -59 -88 -91 -64 -26 -6 -8 -20
$$ packed form
11045f2K6K3J3%qj0j2j7j4PK8L3K2Rok0k4j2J2J9J4MLJ1J5J1j2m7p0o5l6j0LJ4K5K9K1J2J1
11029f0J3J2Pjrj0%J2Oj4k1kK2K6J4JlomjjmlJ0K2K1Qlj0j8k3k3j7j3lJ6L8L8K1Kpj7l2m6
11009f2m5l3k2qJ4L2L1J1mrrj0lJ4K6K2QMJ2J3jj9k6j3NJ7J5Kj2k2k5j9KL3M7L4NojKj6l3
10991d9k5%J4J2J0J7J9Lj2j9pRJ5QkjQK4K8K2J2jj6k9k6j0LKoj0lORLqj7j9j7j3%J7K3Rj4
10972c1j9nJ5J9J2OL%j1j9j5%J5J6J2J3K4K6Pk2l5l3l6l8k7KL1L9L1K4K8L1K6Qj1j8rkj2k7
10955A8k9k3k4l1k7pJ3K4K8L4K6J1ln%knj0k1l1j6J9M4L1Jj5j6j5j6j0JKjMJ3Rqj5pkrj0P
10936g3K0J2j1k4j7OK9L6K7J4N%rk4l4k8j9j5j5rJJ0J9K6L1K9K4K0J3Jqj0mlj1j5rMR%j1j2
10918b5JJ3J1ok6l6l0j6lLOJ0J0KroORjmJ3L8M2L0K1J5Nj0j1LJ0mk2l1l1l6k9lK7L8K0kj2
$$ plain form
10899 -20 -25 -17 -10 -17 -38 -55 -58 -58 -71 -93 -99 -80 -53 -38 -38 -46 -56 -67 -69 -57 -41 -37 -46 -56 -58 -53 -41 -17 14 39 48 45 39 26 0 -38 -73 -92 -93 -79 -56 -35 -29 -37 -44
10880 -44 -41 -32 -29 -35 -52 -80 -114 -137 -141 -135 -132 -128 -111 -93 -100 -138 -176 -185 -170 -157 -155 -148 -128 -97 -65 -35 -12 0 2 0 0 4 14 20 11 -10 -24 -19 -7 -9 -21 -23 -5 17 29
10860 29 26 21 21 34 56 77 85 85 86 90 89 81 71 63 54 43 35 28 13 -11 -33 -41 -30 -6 24 54 73 73 55 30 9 -4 -13 -22 -33 -44 -50 -56 -67 -77 -78 -64 -43 -25 -16
10841 -16 -24 -48 -75 -88 -85 -80 -85 -95 -94 -75 -40 -2 22 21 2 -16 -26 -33 -40 -39 -28 -15 -9 -9 -8 -6 -9 -15 -27 -49 -80 -107 -118 -117 -115 -117 -112 -96 -73 -51 -41 -45 -60 -79 -96
10821 -96 -108 -111 -105 -97 -98 -100 -85 -50 -20 -10 -11 -8 -12 -36 -70 -83 -66 -41 -34 -51 -83 -113 -120 -95 -54 -29 -32 -43 -43 -37 -38 -45 -47 -45 -52 -78 -119 -162 -190 -193 -176 -151 -129 -107
10802 -107 -78 -48 -28 -20 -14 -3 11 22 21 10 -6 -28 -53 -72 -76 -70 -71 -88 -107 -106 -81 -47 -15 14 37 41 21 -6 -26 -32 -34 -34 -30 -20 -6 12 42 76 95 85
10785 85 51 16 0 4 14 18 7 -19 -54 -85 -103 -113 -129 -152 -159 -136 -101 -80 -79 -82 -77 -69 -63 -57 -47 -34 -14 15 47 64 65 70 92 116 118 101 84 75 62 35 4
10767 4 -18 -29 -33 -36 -40 -47 -58 -73 -87 -98 -104 -110 -121 -129 -123 -100 -68 -40 -22 -14 -11 -6 6 19 25 29 42 64 74 60 40 37 52 58 41 12 -11 -21 -14 8 38 55 48 25
$$ packed form
10899b0nQPpk1j7l%j3k2oJ9K7J5%qj0j1kJ2J6Mrj0kNJ2K4L1K5Rloj3k6l8l5j9jJ4K3K1Oqp
10880d4LRLoj7k8l4k3mOLMJ7J8pl8l8rJ5J3KPK0L1L2L0K3J2Kk%MJ0Ork1j4NJ2kj2kJ8K2J2
10860B9ln%J3K2K1Q%JMjqj0qrj1qpj5k4k2qJ1K4L0L0J9%j8k5k1j3rrj1j1ooj1j0jJ4K1J8R
10841a6qk4k7j3LNnj0JJ9L5L8K4jj9j8j0ppJJ1J3O%JKloj2k2l1k7j1JKkNJ6K3K2J0mj5j9j7
10821i6j2lOQjkJ5L5L0J0jLmk4l4j3J7K5Pj7l2l0pK5M1K5lj1%OjpkKpk6m1m3k8lJ7K5K2K2
10802a07K9L0K0QOJ1J4J1jj1j6k2k5j9mOjj7j9JK5L4L2K9K3Mk0k7k0ok%MJ0J4J8L0L4J9j0
10785H5l4l5j6MJ0Mj1k6l5l1j8j0j6k3pK3L5K1JlNQOOJ0J3K0K9L2J7JNK2K4Kj7j7rj3k7l1
10767Dk2j1mlmpj1j5j4j1ooj1qOK3L2K8J8QLNJ2J3OMJ3K2J0j4k0lJ5Oj7k9k3j0PK2L0J7pk3
$$ plain form
10748 25 1 -13 -20 -23 -29 -39 -53 -69 -92 -125 -158 -175 -174 -165 -154 -129 -90 -58 -53 -66 -66 -44 -21 -10 2 30 67 93 105 111 103 68 14 -29 -38 -22 -8 -7 -12 -18 -29
10730 -29 -43 -56 -64 -67 -61 -39 -2 30 40 30 15 -2 -32 -69 -88 -72 -30 11 35 40 29 12 3 16 46 70 71 58 51 55 58 53 49 53 55 39 11 -7 -5 5 9 5 2
10712 2 2 -1 -11 -21 -25 -26 -29 -33 -28 -10 13 31 35 31 28 27 20 10 9 28 60 83 83 65 42 28 27 39 52 49 28 9 9 24 33 33 42 67 89 84 53 23 14 16 14 0 -15
10691 -15 -24 -25 -15 5 38 78 117 153 180 191 178 143 96 50 12 -16 -40 -57 -64 -68 -79 -102 -125 -133 -119 -86 -40 3 19 -11 -74 -127 -143 -128 -108 -94 -77
10675 -77 -47 -13 9 12 6 3 7 11 12 16 25 35 36 28 18 11 3 -4 -10 -13 -24 -50 -90 -132 -160 -160 -131 -93 -71 -73 -78 -70 -54 -47 -50 -51 -39 -15 14 46 73 89 89 79 66 53
10655 53 43 40 43 45 52 71 105 142 164 164 148 127 110 99 91 84 84 95 110 113 95 62 32 14 14 26 45 64 76 75 61 38 18 5 -7 -22 -29 -15 10 27 27
10638 27 24 32 47 57 62 70 86 106 123 130 126 113 101 94 89 81 72 65 55 36 11 -12 -33 -51 -64 -65 -53 -36 -17 6 33 54 62 56 34 -3 -45 -67 -62 -50 -56 -78 -88
10619 -88 -74 -54 -49 -57 -62 -57 -59 -79 -108 -127 -122 -97 -67 -45 -36 -32 -27 -23 -30 -47 -61 -60 -48 -36 -30 -26 -26 -38 -62 -85 -91 -80 -64 -57 -62 -66 -52 -22 0 -2 -25 -43 -42 -30 -20
$$ packed form
10748B5k4j4ploj0j4j6k3l3l3j7JRJ1K5L9L2Nj3%K2K3J1J2K8L7K6J2Oql5n4m3rJ6J4Jnoj1
10730b9j4j3qlOK2L7L2J0j0j5j7l0l7j9J6M2M1K4Nj1j7rJ3L0K4Jj3pMLnmMKj6k8j8KJ0Mml
10712B%lj0j0mjlmNJ8K3J8Mmljpj0jJ9L2K3%j8k3j4jJ2J3lk1j9%J5R%RK5K2nl1l0rKkj4j5
10691a5rjJ0K0L3M0L9L6K7J1j3l5m7m6l8k8k4j7pmj1k3k3qJ4L3M6M3J6l0o3n3j6J5K0J4J7
10675g7L0L4K2LolMMJMRJ0Jqj0pqpolj1k6m0m2k8%K9L8K2knQJ6PljJ2K4K9L2K7J6%j0j3j3
10655E3j0lLKPJ9L4L7K2%j6k1j7j1qp%J1J5Lj8l3l0j8%J2J9J9J2jj4k3k0j3j2j5pJ4K5J7%
10638B7lQJ5J0NQJ6K0J7Pmj3j2pnqrpj0j9k5k3k1j8j3jJ2J7J9K3K7K1Qok2l7m2k2NJ2ok2j0
10619h8J4K0NqnNkk0k9j9NK5L0K2RMNMpj7j4JJ2J2OM%j2k4k3oJ1J6PnmJ4L0K2kk3j8JJ2J0
$$ plain form
10599 -20 -18 -19 -17 -7 14 35 36 12 -21 -49 -69 -87 -95 -80 -42 -1 21 16 -14 -58 -93 -104 -99 -97 -105 -114 -114 -105 -91 -75 -61 -55 -50 -35 -11 1 -10 -30 -32 -10 21 45
10581 45 52 41 14 -12 -26 -28 -37 -65 -103 -129 -137 -137 -139 -136 -117 -80 -45 -32 -50 -82 -98 -83 -46 -14 0 8 28 55 73 75 67 57 43 22 1 -6 1 12 15 9 4 12 37
10563 37 70 97 109 111 105 90 62 32 17 24 42 50 42 24 9 0 -4 -11 -16 -13 -4 0 -5 -19 -33 -45 -60 -80 -103 -123 -138 -144 -139 -122 -92 -56 -25 -11 -14 -18 -17 -19 -36 -64
10543 -64 -91 -108 -117 -117 -102 -75 -51 -37 -26 -12 -2 -3 -10 -10 3 22 37 34 5 -36 -64 -58 -30 -7 -5 -15 -29 -45 -61 -72 -71 -61 -44 -24 -9 -6 -15 -24 -19 1 25
10526 25 29 4 -38 -78 -99 -104 -97 -78 -51 -31 -28 -32 -24 -4 8 6 1 3 -1 -23 -53 -68 -60 -42 -27 -17 -14 -18 -21 -21 -21 -28 -35 -33 -25 -27 -45 -67 -75 -61 -26 19 56 68 61 50
10506 50 34 -2 -62 -117 -132 -109 -79 -54 -24 18 58 76 75 68 63 59 55 48 38 29 31 43 54 50 33 19 15 18 21 25 35 48 58 58 45 23 0 -12 -12 -5 1 6 11 12 4
10486 4 -15 -38 -46 -33 -10 5 11 21 46 74 84 72 52 44 54 74 90 94 85 67 42 14 -12 -30 -45 -66 -89 -95 -73 -36 -12 -11 -16 -15 -11 -13 -20 -20 -1 34 71 86
10468 86 68 31 7 7 13 0 -31 -64 -85 -101 -120 -140 -148 -141 -125 -108 -93 -74 -49 -25 -16 -24 -43 -64 -81 -89 -82 -67 -65 -91 -124 -128 -90 -34 2 6 -9 -23 -28 -26 -25 -23
$$ packed form
10599b0KjKJ0K1K1Jk4l3k8k0j8qJ5L8M1K2nl0m4l5j1NKqr%RJ4J6J4ONJ5K4J2j1k0kK2L1K4
10581D5Pj1k7k6j4krk8l8k6q%kLJ9L7L5J3j8l2j6J5L7L2J4QK0K7J8Kqj0j4k1k1pPJ1LonQK5
10563C7L3K7J2Koj5k8l0j5PJ8Qqj8j5rmpnLRMnj4j4j2j5k0k3k0j5oNJ7L0L6L1J4lmJkj7k8
10543f4k7j7r%J5K7K4J4J1J4J0jp%J3J9J5lk9m1k8OK8K3Kj0j4j6j6j1JJ0J7K0J5LrrNK0K4
10526B5Mk5m2m0k1nPJ9K7K0LmQK0J2knKmk2l0j5QJ8J5J0Lml%%ppKQkj8k2qJ4L5M5L7J2pj1
10506E0j6l6o0n5j5K3L0K5L0M2M0J8jpnmmpj0rKJ2J1mj7j4mLLMJ0J3J0%j3k2k3j2%PONNJq
10486Dj9k3qJ3K3J5OJ0K5K8J0j2k0qJ0K0J6Mrj8k5k8k6j8j5k1k3oK2L7K4JnJMkp%J9L5L7J5
10468H6j8l7k4%Oj3l1l3k1j6j9k0qPJ6J7J5J9K5K4Rqj9k1j7qPJ5Kk6l3mL8N6L6Mj5j4nKJK
$$ plain form
10450 -23 -10 16 42 44 22 -3 -8 14 47 65 56 32 22 43 80 104 105 99 100 105 99 80 55 36 29 30 37 45 50 47 26 -11 -50 -73 -77 -73 -66 -51 -27 0 32 71 112
10431 112 131 115 86 78 103 141 167 166 138 93 47 15 -2 -10 -12 -8 -6 -10 -8 16 62 98 98 65 26 0 -12 -23 -40 -59 -66 -50 -13 28 64 89 100 89 56
10414 56 21 4 6 5 -10 -27 -33 -26 -19 -18 -23 -29 -33 -32 -24 -17 -18 -22 -17 0 23 39 41 28 3 -17 -19 -4 8 2 -16 -28 -27 -23 -27 -32 -27 -17 -6 5 24 47 60 58 50 43 33 8
10394 8 -27 -54 -60 -47 -32 -20 -14 -13 -16 -17 -8 8 21 26 29 35 36 23 7 6 21 34 32 17 3 -4 -1 16 51 86 103 97 83 74 70 62 49 37 30 23 4 -18 -26 -4 35 69
10374 69 79 70 57 52 63 86 113 136 153 161 150 113 57 4 -29 -40 -36 -24 -16 -17 -28 -38 -37 -17 20 62 78 48 -12 -59 -67 -53 -49 -64 -84 -100 -109 -110 -101 -93 -101 -116
10355 -116 -115 -90 -64 -60 -79 -99 -102 -84 -62 -58 -86 -132 -166 -169 -149 -121 -93 -66 -48 -49 -62 -67 -50 -17 13 28 24 7 -10 -23 -30 -31 -22 -4 17 33 36 23 -8 -50
10338 -50 -85 -97 -88 -71 -57 -46 -30 -12 -1 -7 -24 -40 -43 -38 -38 -53 -77 -96 -100 -91 -84 -88 -101 -105 -81 -31 20 48 50 40 31 31 37 46 49 40 27 22 22 15 -4 -21 -21 -15 -23 -51
10318 -51 -79 -85 -68 -43 -12 25 65 85 74 46 31 40 61 84 110 143 174 188 184 175 171 174 175 168 154 136 121 103 72 28 -12 -33 -31 -16 -2 -1 -23 -62 -95 -93
$$ packed form
10450b3J3K6K6Kk2k5nK2L3J8rk4j0K1L7K4JoJNoj9k5j9pJPQNlk1l7l9k3mMPJ5K4K7L2L9M1
10431A12J9j6k9qK5L8K6jk8m5m6l2j7qkMKmKK4M6L6%l3l9k6j2j1j7j9pJ6L7M1L6K5J1j1l3
10414E6l5j7Kjj5j7oPPJnomJQPjmNJ7K3J6Kj3k5k0kJ5J2oj8j2JMmnNJ0J1J1J9K3J3kqpj0k5
10394Hl5k7oJ3J5J2OJljRJ6J3NLOJj3j6jJ5J3kj5j4pLJ7L5L5J7oj4rmqj3j2ppj9k2qK2L9L4
10374F9J0rj3nJ1K3K7K3J7Qj1l7n6n3l3j1MJ2Qjj1j0JK0L7M2J6l0o0m7qJ4Mj5k0j6rjRQqj5
10355a16JK5K6Mj9k0lJ8K2Mk8m6l4lK0K8K8K7J8jj3nJ7L3L0J5mj7j7j3pjRJ8K1J6Lj3l1m2
10338e0l5j2RJ7J4J1J6J8J1oj7j6lN%j5k4j9mRPmj3mK4N0N1K8Kj0r%ORLrj3n%pj9j7%Oqk8
10318e1k8oJ7K5L1L7M0K0j1k8j5RK1K3K6L3L1J4mrmLJpj4j8j5j8l1m4m0k1KJ5J4Jk2l9l3K
$$ plain form
10301 -93 -57 -14 6 4 -2 -2 0 -6 -17 -20 -3 27 57 66 50 13 -27 -55 -60 -48 -33 -29 -31 -27 -13 3 17 23 18 1 -19 -27 -17 -3 -7 -31 -60 -77 -79 -75 -78 -93 -117 -136
10282 -136 -136 -113 -80 -51 -23 14 62 101 107 78 37 12 10 22 37 44 37 16 -7 -14 -3 14 26 34 41 43 33 17 1 -12 -26 -35 -36 -34 -41 -57 -62 -50 -37 -41 -54 -52
10263 -52 -32 -15 -20 -33 -34 -21 -18 -38 -73 -110 -140 -158 -158 -133 -86 -26 27 54 50 31 19 15 2 -22 -38 -29 -17 -32 -74 -115 -133 -131 -118 -97 -73 -61 -68 -83 -83 -70
10246 -70 -58 -58 -67 -70 -61 -40 -11 16 34 32 12 -14 -32 -29 -10 11 24 28 24 16 7 -2 -14 -32 -46 -45 -27 -4 21 52 86 101 81 40 7 0 8 10 -1 -17 -19 -5 8
10227 8 3 -13 -23 -13 0 3 -4 -19 -45 -91 -136 -148 -120 -79 -61 -70 -87 -98 -102 -106 -110 -109 -95 -70 -40 -19 -19 -43 -82 -122 -151 -163 -156 -127 -81 -35 -7 -4 -16 -35 -58
10210 -58 -79 -79 -45 7 50 70 76 76 73 72 83 104 115 108 95 90 93 95 93 90 82 66 45 25 10 3 9 32 60 77 75 58 38 29 38 53 58 50 47 58 75 85 87 86 74 39
10190 39 -10 -55 -80 -88 -85 -72 -50 -21 5 21 19 2 -14 -18 -10 0 4 0 -22 -67 -113 -135 -125 -94 -51 2 59 98 111 110 107 97 72 35 0 -25 -39 -37 -22 -16
10172 -16 -34 -70 -101 -121 -137 -155 -169 -172 -166 -151 -127 -97 -77 -79 -98 -120 -131 -127 -109 -82 -52 -31 -30 -47 -67 -74 -70 -59 -39 -3 38 59 36 -17 -75 -110 -115 -91 -56
$$ packed form
10301i3L6M3K0ko%Koj1lJ7L0L0Rj6l7m0k8nJ2J5MkMJ4J6J4Onj7k0qJ0J4mk4k9j7kMlj5k4j9
10282a36%K3L3K9K8L7M8L9Ok9m1k5kJ2J5Ppk1k3pJ1J7J2QPKj0j6j6j3j4rjKpj6nJ2J3mj3K
10263e2K0J7nj3jJ3Lk0l5l7l0j8%K5M7O0N3K7mj9j2mj3k4j6RJ2j5m2m1j8KJ3K1K4J2pj5%J3
10246g0J2%rlRK1K9K7J8kk0k6j8LJ9K1J3Mmqrrj2j8j4JJ8K3K5L1L4J5k0m1l3pQKj1j6kJ4J3
10227Hnj6j0J0J3Lpj5k6m6m5j2K8M1J8rj7j1mmmJJ4K5L0K1%k4l9m0k9j2PK9M6M6K8Lj2j9k3
10210e8k1%L4N2M3K0O%ljJ1K1J1pj3nLKklqj6k1k0j5pOK3K8J7kj7k0rRJ5NqlJ1J7J0Kjj2l5
10190C9m9m5k5qLJ3K2K9K6J6kj7j6mQJ0Mmk2m5m6k2J0L1M3N3N7L9J3jlj0k5l7l5k5j4KJ5O
10172a6j8l6l1k0j6j8j4lOJ5K4L0K0kj9k2j1MJ8K7L0K1Jj7k0pMJ1K0L6M1K1k3n3n8l5nK4L5
$$ plain form
10156 -56 -30 -25 -30 -29 -18 -10 -12 -28 -52 -77 -85 -68 -44 -40 -63 -88 -88 -61 -26 -4 3 6 8 4 -13 -43 -75 -97 -104 -86 -40 17 47 26 -20 -43 -29 -6 2 10 34 64
10137 64 81 88 104 129 139 122 98 90 98 106 99 78 54 38 37 48 58 55 38 13 -10 -25 -28 -18 0 21 28 11 -14 -25 -10 13 24 17 7 -2 -18 -47 -79 -102
10120 -102 -110 -104 -85 -62 -47 -45 -43 -30 -8 2 -9 -35 -59 -78 -92 -101 -92 -60 -20 6 11 -3 -25 -44 -45 -24 7 25 19 6 4 10 7 -9 -29 -37 -30 -16 -9 -25 -70 -121
10102 -121 -147 -128 -78 -25 13 40 60 71 62 27 -24 -71 -96 -99 -92 -77 -49 -12 19 34 34 30 27 29 37 46 46 32 11 -9 -30 -50 -62 -59 -48 -38 -29 -12 15 46
10084 46 64 61 40 11 -11 -18 -17 -22 -37 -49 -41 -9 33 67 83 77 49 0 -63 -124 -165 -175 -150 -98 -35 6 1 -42 -88 -110 -120 -137 -152 -143 -111 -83 -78 -85 -84 -74
10067 -74 -61 -43 -12 19 33 31 37 64 85 68 12 -44 -66 -50 -20 3 14 15 11 4 -6 -23 -49 -74 -86 -80 -62 -40 -25 -31 -65 -111 -144 -152 -152 -160 -167 -150 -105 -49
10050 -49 0 36 61 64 46 28 33 53 66 59 38 15 -7 -28 -39 -34 -13 10 29 36 34 30 28 31 33 26 2 -32 -64 -80 -78 -70 -67 -67 -65 -62 -58 -52 -37 -12 12 26 25 20 21 28
10030 28 33 27 13 0 -11 -22 -37 -53 -52 -22 27 67 74 53 30 20 17 9 -11 -39 -69 -86 -79 -52 -29 -28 -47 -72 -96 -115 -116 -91 -50 -20 -10 -11 -12 -15 -24 -34 -48
$$ packed form
10156e6K6NnJJ1Qkj6k4k5qJ7K4Mk3k5%K7L5K2PLKmj7l0l2k2pJ8M6N7L0k1m6k3J4K3QQK4L0
10137F4J7PJ6K5J0j7k4qQQpk1k4j6jJ1J0lj7k5k3j5lJ0J8K1Pj7k5j1J5K3J1pj0rj6k9l2k3
10120a02qOJ9K3J5KKJ3K2J0j1k6k4j9j4rRL2M0K6Nj4k2j9jK1L1J8oj3kOlj6k0qPJ4Pj6m5n1
10102a21k6J9N0N3L8K7K0J1rl5n1m7k5lPJ5K8L7L1J5%mlKQR%j4k1k0k1k0j2LJ1J0RJ7K7L1
10084D6J8lk1k9k2pJnj5j2QL2M2L4J6ok8m9o3o1m1j0K5N2O3M1nm3m6k2j0j7j5RL2K8NpJJ0
10067g4J3J8L1L1J4kOK7K1j7n6n6k2J6L0K3J1Jmpj0j7k6k5j2OJ8K2J5ol4m6l3q%qpJ7M5N6
10050d9M9L6K5Lj8j8NK0J3pk1k3k2k1j1NK1K3J9PkmkLKpk4l4l2j6KQL%KLMOJ5K5K4J4jnJP
10030B8Noj4j3j1j1j5j6JL0M9M0Pk1k3j0lqk0k8l0j7PK7K3Jj9k5k4j9jK5M1L0J0jjlrj0j4
$$ plain form
10012 -48 -76 -117 -152 -161 -146 -120 -97 -78 -67 -65 -69 -76 -85 -92 -84 -65 -57 -78 -113 -132 -128 -117 -115 -115 -106 -91 -78 -71 -70 -76 -79 -67 -35 1 25 34 37 43 47 44 34 19 -2 -35 -71
9993 -71 -97 -101 -85 -59 -30 -5 9 9 -1 -17 -37 -69 -109 -141 -147 -128 -99 -68 -33 2 29 35 21 -3 -25 -34 -25 -8 0 -10 -29 -47 -57 -62 -67 -76 -87 -90 -69 -25 18
9975 18 33 12 -23 -45 -43 -32 -38 -64 -92 -105 -107 -106 -93 -57 -8 22 25 15 14 18 16 11 18 35 47 48 38 24 2 -23 -44 -48 -26 19 71 98 84 48 22 18 12 -14
9957 -14 -55 -87 -99 -98 -91 -80 -62 -37 -6 21 33 20 -8 -33 -39 -26 -7 1 -6 -26 -44 -50 -51 -62 -84 -97 -84 -51 -27 -33 -64 -96 -111 -104 -80 -50 -28 -26 -45 -77
9939 -77 -110 -138 -150 -140 -111 -77 -54 -42 -30 -15 0 11 15 14 9 7 13 23 20 -4 -39 -61 -59 -43 -27 -18 -14 -14 -17 -20 -27 -39 -53 -61 -62 -67 -88 -121 -148 -156 -144 -120 -89 -59
9920 -59 -35 -22 -14 -4 8 20 33 48 61 59 39 7 -31 -76 -121 -153 -159 -142 -118 -102 -101 -109 -117 -118 -116 -119 -132 -139 -122 -75 -11 44 76 80 61 33 13 13 33 66 95
9902 95 108 100 80 65 65 79 91 85 52 4 -33 -49 -50 -49 -46 -30 -8 1 -10 -28 -34 -29 -31 -43 -59 -73 -90 -110 -123 -118 -98 -75 -52 -31 -14 -6 -9 -15 -17 -14 -10 -8 -11 -17 -20 -11
9882 -11 8 27 40 50 58 57 45 29 19 12 -1 -23 -45 -61 -73 -78 -68 -43 -16 2 9 3 -15 -34 -35 -15 5 7 -3 -10 -8 -6 -11 -25 -47 -72 -86 -82 -72 -83 -116 -151
$$ packed form
10012d8k8m1l5rJ5K6K3J9J1KmprpQJ9Qk1l5j9MJ1K%RJ5J3PJolJ2L2L6K4RLOMlj0j5k1l3l6
9993g1k6mJ6K6K9K5J4%j0j6k0l2m0l2oJ9K9L1L5L5K7Oj4k4k2rRJ7Qj0j9j8j0nnrj1lK1M4M3
9975A8J5k1l5k2KJ1ok6k8j3kJJ3L6M9L0Lj0jMknPJ7J2Jj0j4k2k5k1mK2M5N2K7j4l6k6mok6
9957a4m1l2j2JPJ1J8K5L1K7J2j3k8k5oJ3J9Qpk0j8ojj1k2j3J3L3K4ol1l2j5PK4L0K2Kj9l2
9939g7l3k8j2J0K9L4K3J2J2J5J5J1MjnkOJ0lk4l5k2KJ6J6RM%llpj2j4qjnk1l3k7qJ2K4L1L0
9920e9K4J3QJ0J2J2J3J5J3kk0l2l8m5m5l2oJ7K4J6JqqjKlj3pJ7M7O4N5L2Mj9k8k0%K0L3K9
9902I5J3qk0j5%J4J2ol3m8l7j6jJLJ6K2Rj1j8oNkj2j6j4j7k0j3NK0K3K3K1J7QlokLMKlolR
9882a1J9J9J3J0Qjj2j6j0pj3k2k2j6j2nJ0K5K7J8Poj8j9jK0K0Kj0pKKnj4k2k5j4MJ0j1l3l5
$$ plain form
9864 -151 -170 -167 -144 -109 -76 -60 -59 -54 -34 -10 4 10 11 3 -12 -29 -38 -42 -50 -64 -77 -82 -81 -80 -83 -85 -76 -54 -37 -42 -64 -76 -63 -30 10 50 80 91 82 70 66 63 54 41 30
9845 30 17 -5 -32 -55 -80 -116 -152 -164 -143 -103 -65 -35 -6 29 74 119 144 143 131 128 128 106 55 2 -24 -18 6 32 46 42 18 -9 -30 -47 -73 -112 -148 -163
9828 -163 -152 -125 -103 -96 -92 -80 -58 -38 -30 -35 -50 -70 -88 -93 -84 -72 -66 -71 -87 -110 -131 -140 -131 -106 -69 -34 -24 -48 -87 -115 -128 -139 -153 -160 -163 -170 -170 -135 -66 -5 13 1
9810 1 -9 -13 -29 -60 -85 -92 -92 -103 -124 -136 -125 -89 -46 -18 -11 -15 -11 2 17 27 27 13 -9 -26 -28 -21 -13 -2 16 30 20 -14 -50 -71 -77 -71 -59 -53 -65 -88 -98 -88
9792 -88 -73 -59 -37 -5 18 22 18 26 42 48 39 21 -1 -31 -65 -94 -120 -149 -176 -188 -184 -178 -174 -165 -140 -100 -55 -14 18 43 65 86 98 88 53 13 -9 -16 -27 -53
9774 -53 -83 -98 -92 -85 -90 -101 -99 -74 -37 -6 6 2 -10 -20 -18 -6 11 24 26 14 -10 -37 -55 -66 -76 -85 -88 -84 -82 -88 -97 -99 -94 -87 -82 -79 -76 -72 -68 -70 -77 -79 -59 -21 16 40 57
9754 57 76 87 72 36 1 -17 -17 -5 8 9 -12 -41 -58 -60 -61 -61 -47 -14 15 27 25 16 -5 -45 -84 -101 -101 -114 -152 -183 -170 -113 -47 -13 -16 -30 -32 -29 -43 -78 -105
9736 -105 -98 -59 -20 0 2 1 -2 -6 -6 -1 -2 -16 -32 -32 -14 1 -8 -46 -92 -124 -136 -127 -102 -69 -44 -39 -55 -75 -83 -80 -71 -54 -30 -12 -20 -52 -86 -106 -116 -127 -135 -129 -110 -95
$$ packed form
9864a51j9LK3L5L3J6JNK0K4J4OJqj5j7rmqj4j3nJJlkRK2J7nk2j2J3L3M0M0L0J1rj2mlrj3j1
9845C0j3k2k7k3k5l6l6j2K1M0L8L0K9L5M5M5K5jj2l%k2n1n3k6OK4K6J4mk4k7k1j7k6l9l6j5
9828a63J1K7K2PMJ2K2K0Qnj5k0j8nRJ2Onj6k3k1rRK5L7L5J0k4l9k8j3j1j4plp%L5O9O1J8j2
9810Aj0mj6l1k5p%j1k1j2J1L6M3K8PmMJ3J5J0%j4k2j7kPQJ1J8J4j0l4l6k1oOJ2Oj2k3j0J0
9792h8J5J4K2L2K3MmQJ6Orj8k2l0l4k9k6k9k7j2MOMRK5M0M5M1L2K5K2K1J2j0l5m0k2pj1k6
9774e3l0j5OPnj1KK5L7L1J2mj2j0KJ2J7J3Kj2k4k7j8j1j0rlMKorkNPNLLMMkpkK0L8L7K4J7
9754E7J9J1j5l6l5j8%J2J3Jk1k9j7kj%J4L3K9J2krk1m0l9j7%j3l8l1J3N7O6L4lj4kLj4l5k7
9736a05PL9L9K0Kjlm%Njj4j6%J8J5rl8m6l2j2RK5L3K5Nj6k0qLRJ7K4J8ql2l4k0j0j1qOJ9J5
$$ plain form
9717 -95 -101 -116 -120 -108 -100 -106 -118 -118 -107 -97 -91 -72 -27 26 64 77 83 93 101 90 58 19 -15 -34 -32 -12 6 2 -17 -22 9 56 71 35 -24 -65 -78 -81 -90 -94 -78 -47
9699 -47 -20 -9 -11 -15 -13 -8 -12 -37 -72 -98 -102 -94 -83 -63 -36 -21 -36 -67 -77 -54 -21 -10 -29 -65 -104 -127 -118 -87 -65 -72 -89 -83 -49 -14 0 -10 -34 -66 -101 -130
9682 -130 -146 -146 -135 -121 -108 -95 -71 -33 9 44 62 60 44 24 18 30 44 40 16 -12 -32 -38 -33 -20 -8 -4 -4 3 20 28 17 -5 -24 -32 -36 -42 -48 -50 -47 -38 -24 -4 20
9663 20 46 64 67 57 48 57 88 128 148 129 82 36 8 -6 -18 -26 -21 -11 -9 -14 -14 -7 -7 -30 -62 -80 -74 -55 -41 -42 -55 -65 -58 -38 -23 -29 -43 -46 -31 -15 -6 2 23 52
9644 52 69 65 49 38 40 45 40 29 26 34 31 0 -42 -67 -63 -51 -52 -62 -63 -51 -39 -36 -30 -12 6 4 -22 -48 -46 -21 -2 -8 -28 -46 -59 -75 -95 -111 -120 -123 -118 -98 -66 -30
9625 -30 2 27 36 19 -20 -67 -101 -119 -127 -138 -151 -155 -137 -102 -75 -76 -104 -136 -150 -139 -112 -82 -65 -62 -57 -31 7 34 30 4 -26 -55 -78 -83 -60 -20 9 18 13 6 1
9607 1 1 11 29 43 44 36 29 28 23 6 -22 -50 -66 -58 -32 -3 10 11 16 39 71 94 96 76 38 -4 -29 -26 -7 8 13 17 20 16 7 2 6 8 -2 -26 -54 -78 -84 -60 -12 32
9587 32 55 57 51 41 31 28 33 29 4 -31 -56 -62 -55 -29 15 59 70 52 38 50 68 70 55 33 9 -9 -10 2 3 -23 -58 -69 -50 -17 17 49 68 68 61 60 56 34
$$ packed form
9717i5oj5mJ2Qoj2%J1J0OJ9M5N3L8J3OJ0Qj1l2l9l4j9KK0J8mj9nL1M7J5l6n9m1j3lrmJ6L1
9699d7K7J1kmKNmk5l5k6mQJ1K0K7J5j5l1j0K3L3J1j9l6l9k3RL1K2pj7OL4L5J4j0k4l2l5k9
9682a30j6%J1J4J3J3K4L8M2L5J8kj6k0oJ2J4mk4k8k0oNJ3J2M%PJ7Qj1k2j9qmookLRJ4K0K4
9663B0K6J8Lj0rRL1M0K0j9m7m6k8j4j2qNJ0Kn%P%k3l2j8OJ9J4jj3j0PK0J5oj4lJ5J6RQK1K9
9644E2J7mj6j1KNnj1lQll1m2k5MJ2jj0jJ2J2LOJ8J8kk6k6KK5J9ok0j8j3j6k0j6rlNK0L2L6
9625c0L2K5Rj7l9m7l4j8qj1j3mJ8L5K7jk8l2j4J1K7L0J7LNK6L8K7mk6l0k9k3nK3M0K9Rnpn
9607A%J0J8J4Jqpjnj7k8k8j6QK6K9J3JNK3L2K3Kk0l8m2k5LJ9J5NMLmrnMKj0k4k8k4oK4M8M4
9587C2K3Koj0j0lNmk5l5k5oPK6M4M4J1j8j4J2J8Kj5k2k4j8jJ2Jk6l5j1J9L3L4L2J9%pjmk2
$$ plain form
9569 34 3 -9 -1 3 -4 -9 7 35 55 61 55 40 20 5 9 30 54 70 69 48 9 -36 -77 -101 -110 -105 -91 -75 -65 -67 -83 -100 -104 -87 -58 -31 -12 -2 4 16 35 52
9551 52 54 38 26 30 42 50 56 72 95 102 86 57 29 3 -14 -14 6 34 58 79 100 115 120 120 119 114 98 75 57 54 63 71 66 39 0 -36 -61 -76 -79 -56 -7 44 68
9532 68 57 30 9 -2 -14 -28 -31 -13 20 50 65 64 52 31 5 -16 -29 -38 -49 -55 -45 -22 1 20 39 59 73 81 79 58 16 -25 -41 -37 -34 -36 -27 -1 22 37
9515 37 53 70 74 72 95 152 205 232 257 317 424 604 913 1335 1692 1761 1494 1073 715 489 344 234 159 117 82 44 11 -18 -53 -81 -72
9501 -72 -26 23 51 66 91 120 129 109 78 60 64 77 86 85 74 58 43 33 29 24 9 -8 -16 -6 14 34 52 64 69 69 74 85 87 67 27 -16 -51 -70 -66 -42 -12
9484 -12 8 18 22 21 13 0 -4 8 37 66 76 61 35 19 16 11 -7 -33 -53 -66 -74 -76 -74 -75 -82 -91 -96 -103 -113 -117 -112 -99 -79 -44 6 53 80 95 112 129 136 135 139 151 162
9464 162 170 179 180 164 139 123 123 130 139 151 166 178 190 202 203 193 195 231 290 346 406 504 645 841 1159 1661 2236 2594 2509 2056 1517 1105 833 629
9449 629 473 378 322 267 213 177 158 140 124 123 132 137 135 130 113 80 53 53 71 79 72 69 71 55 11 -45 -92 -123 -135 -124 -91 -58 -37 -26 -19 -11 2 30 61 69 44
$$ packed form
9569C4l1j2QMpnJ6K8K0Ooj5k0j5MK1K4J6jk1l9m5m1k4rNJ4J6J0kj6j7mJ7K9K7J9J0OJ2J9J7
9551E2Kj6j2MJ2QOJ6K3Pj6k9k8k6j7%K0K8K4K1K1J5N%jnj6k3j8lRQnk7l9l6k5j5lK3M9N1K4
9532F8j1k7k1j1j2j4lJ8L3L0J5jj2k1k6k1j3rj1oJ0K3K3J9J9K0J4Qkk1m2m1j6MLkRK6K3J5
9515C7J6J7MkK3N7N3K7K5O0J07J80L09M22L57O9k67m21l58k26j45j10p5m2l5l8l3k9l5k8R
9501g2M6M9K8J5K5K9Rk0l1j8MJ3Rjj1j6j5j0mnj5j7qJ0K0K0J8J2N%NJ1Kk0m0m3l5j9MK4L0
9484a2K0J0Mjqj3mJ2K9K9J0j5k6j6lnj8k6k0j3qkKjprnpj0mNJ3K0L5N0M7K7J5J7J7PjMJ2J1
9464A62QRJj6k5j6%PRJ2J5J2J2J2Jj0KL6N9N6O0R8J41J96L18N02N75L58q5m53n39m12k72k04
9449F29j56r5n6n5n4l6j9j8j6jRNknj7l3k7%J8QplKj6m4n6m7l1j2J1L3L3K1J1PQJ3K8L1Qk5
$$ plain form
9432 44 7 -16 -24 -32 -36 -24 5 41 70 94 112 118 110 102 107 117 115 89 49 11 -11 -22 -25 -23 -18 -18 -31 -48 -56 -53 -52 -62 -68 -59 -47 -53 -77 -95 -96 -90 -87 -86 -80 -70 -62 -55 -48 -44 -43
9410 -43 -43 -40 -33 -19 4 31 50 59 65 73 73 62 47 36 24 0 -34 -62 -66 -48 -20 -2 -4 -19 -24 -10 11 25 30 31 31 26 19 14 16 28 46 51 20 -42 -106 -143 -159 -172
9391 -172 -185 -185 -166 -135 -101 -73 -60 -65 -71 -60 -32 -6 7 9 4 -8 -27 -49 -72 -87 -77 -41 0 28 44 62 77 77 70 74 91 107 119 132 147 164 186 217 247
9374 247 273 321 412 536 693 946 1343 1778 2007 1877 1483 1059 759 583 480 422 396 379 361 347 334 314 287 266 262 278 324 397 473
9362 473 541 621 737 905 1184 1658 2289 2803 2871 2425 1739 1154 792 577 430 338 295 269 246 240 245 233 204 183 173 152 119 103 108 96
9349 96 46 -8 -33 -26 -13 -2 12 24 24 21 33 58 84 103 123 140 144 133 123 120 121 113 97 77 57 33 4 -24 -46 -61 -70 -77 -80 -81 -88 -101 -112 -109 -93 -76 -66 -63
9331 -63 -63 -65 -61 -44 -16 7 20 26 34 44 54 64 73 71 45 5 -27 -31 -8 23 49 62 60 41 6 -34 -69 -85 -78 -54 -26 -11 -16 -28 -23 4 42 64 66 58 51 49 47 40
9312 40 22 -1 -18 -19 -10 1 13 28 36 27 3 -17 -31 -46 -65 -73 -56 -25 0 8 9 6 -10 -45 -84 -107 -109 -101 -94 -87 -74 -55 -38 -27 -17 0 20 39 49 51 45 24
$$ packed form
9432D4l7k3qqmJ2K9L6K9K4J8OqqNJ0kk6m0l8k2j1lKN%j3j7qLJj0oRJ2ok4j8jOLJOJ0QPPMJ
9410d3%LPJ4K3K7J9ROQ%j1j5j1j2k4l4k8mJ8K8J8kj5nJ4K1J4NJ%npnKJ2J8Nl1o2o4l7j6j3
9391a72j3%J9L1L4K8J3noJ1K8K6J3Knj2j9k2k3j5J0L6M1K8J6J8J5%pMJ7J6J2J3J5J7K2L1L0
9374B47K6M8R1J24J57K53L97M35K29j30l94m24l00j76j03n8k6j7j8j4j3k0k7k1mJ6M6P3P6
9362D73O8Q0J16J68K79M74O31N14O8m46o86n85l62k15j47r2m3k6k3oNj2k9k1j0k1l3j6Nj2
9349I6n0n4k5PJ3J1J4J2%lJ2K5K6J9K0J7Mj1j0lJqj6k0k0k4k9k8k2j5rpljpj3j1LJ6J7J0L
9331f3%kMJ7K8K3J3OQJ0J0J0Rkk6m0l2mK3L1K6J3kj9l5m0l5j6PK4K8J5nj2NK7L8K2Kqpkkp
9312D0j8k3j7jRJ1J2J5Qrk4k0j4j5j9qJ7L1K5QJlj6l5l9k3kQPPJ3J9J7J1J0J7K0J9J0Kok1
$$ plain form
9293 24 -11 -56 -102 -140 -160 -154 -128 -96 -72 -61 -58 -55 -44 -20 3 8 -10 -37 -60 -83 -113 -143 -158 -159 -160 -170 -174 -159 -124 -86 -55 -36 -33 -49 -84 -121 -143 -139 -120 -107
9276 -107 -112 -133 -161 -183 -189 -170 -124 -66 -18 2 -1 -19 -34 -37 -33 -34 -48 -73 -96 -108 -111 -111 -115 -121 -120 -105 -76 -46 -32 -38 -47 -46 -39 -46 -81 -126 -152 -147 -119 -87 -62 -53 -67 -100
9257 -100 -128 -128 -106 -82 -68 -60 -54 -49 -39 -17 15 39 43 31 15 -2 -22 -41 -58 -76 -97 -114 -121 -126 -130 -120 -88 -55 -51 -82 -121 -140 -136 -122 -107 -95 -90 -85 -66 -27 21
9239 21 60 76 76 72 77 88 89 63 20 -14 -32 -44 -64 -84 -89 -79 -72 -77 -86 -89 -87 -85 -80 -65 -44 -25 -12 0 12 11 -10 -44 -65 -63 -52 -53 -68 -77 -64 -36 -13 -10 -21 -24
9220 -24 0 42 79 96 101 106 107 92 66 44 33 26 22 27 36 34 19 3 -6 -20 -42 -51 -33 -6 -1 -19 -35 -34 -27 -24 -24 -17 -6 8 24 32 26 11 -1 -8 -18 -36 -52 -51 -39
9201 -39 -34 -52 -83 -107 -110 -101 -96 -94 -78 -40 0 19 10 -14 -49 -90 -123 -133 -126 -129 -152 -178 -189 -184 -169 -144 -110 -85 -80 -85 -82 -66 -50 -38 -25 -7 19 54 91 109 96
9183 96 57 9 -40 -98 -154 -191 -196 -180 -160 -144 -132 -123 -117 -110 -102 -102 -116 -138 -153 -155 -149 -145 -142 -131 -111 -94 -87 -81 -70 -60 -67 -83 -84 -62 -39 -38 -46 -35 -2 31 52 67 77
9164 77 75 62 55 57 49 16 -29 -57 -57 -42 -31 -31 -44 -62 -72 -60 -32 -11 -13 -29 -37 -26 -3 18 35 44 43 30 9 -15 -43 -75 -95 -86 -46 0 26 29 17 1 -11
$$ packed form
9293B4l5m5m6l8k0OK6L2K4J1LLJ1K4K3Nj8k7k3k3l0l0j5jjj0mJ5L5L8L1J9Lj6l5l7k2MJ9J3
9276a07nk1k8k2oJ9M6N8M8K0lj8j5lMjj4k5k3j2l%moJJ5K9L0J4orJPpl5m5k6NK8L2K5Rj4l3
9257a00k8%K2K4J4QONJ0K2L2K4Mj2j6j7k0j9j7j8k1j7pnmJ0L2L3Ml1l9j9MJ4J5J2NNJ9L9M8
9239B1L9J6%mNJ1Jk6m3l4j8j2k0k0nJ0PnrlKKNJ5K1J9J3J2J2jk1l4k1KJ1jj5rJ3K8K3Lj1l
9220b4K4M2L7J7NNJj5k6k2j1pmNRkj5j6rj4k2rJ8K7Nj8j6JPL%PJ1J4J6Qoj5j2pj0j8j6JJ2
9201c9Nj8l1k4lRNKJ6L8M0J9rk4l5m1l3j0Plk3k6j1NJ5K5L4K5NnLJ6J6J2J3J8K6L5L7J8j3
9183I6l9m8m9n8n6l7nJ6K0J6J2ROPQ%j4k2j5kOMLJ1K0J7POJ1J0pj6jK2K3JqJ1L3L3K1J5J0
9164G7kj3pKql3m5k8%J5J1%j3j8j0J2K8K1kj6qJ1K3K1J7Rjj3k1k4k8l2k0RM0M6K6Lj2j6j2
$$ plain form
9146 -11 -11 8 36 50 43 29 22 21 19 7 -17 -53 -90 -112 -119 -119 -113 -99 -77 -59 -50 -46 -44 -51 -69 -87 -102 -117 -136 -144 -129 -98 -71 -54 -40 -20 3 28 46 48 27 -2
9128 -2 -17 -8 12 28 34 30 26 30 38 34 9 -11 -2 29 48 36 15 8 5 -13 -48 -76 -95 -119 -152 -171 -153 -107 -69 -68 -100 -138 -163 -175 -178 -166 -130 -83 -53 -55 -69 -71 -54
9110 -54 -27 8 51 89 102 80 35 -10 -43 -61 -71 -83 -91 -81 -46 0 25 17 -17 -60 -89 -95 -84 -71 -65 -61 -48 -36 -45 -81 -130 -169 -187 -185 -168 -144 -118 -90 -60
9093 -60 -41 -50 -82 -109 -109 -86 -53 -15 24 49 42 6 -31 -53 -60 -58 -50 -42 -37 -32 -22 -10 -11 -31 -55 -61 -44 -17 1 1 -14 -31 -38 -32 -20 -11 -6 1 12 28 47 63 74 77
9074 77 74 67 53 26 -12 -52 -74 -67 -38 -4 20 36 47 51 49 49 58 66 57 36 23 24 20 -8 -52 -83 -88 -72 -40 -1 26 23 -8 -40 -49 -37 -23 -17 -16 -12 -1 15 32 44
9054 44 51 55 52 33 3 -24 -35 -34 -30 -28 -23 -16 -7 -2 -7 -27 -59 -87 -92 -70 -32 2 27 36 29 14 9 26 54 69 58 28 -5 -33 -54 -70 -79 -83 -89 -97 -100 -90 -68 -41 -16
9035 -16 2 12 15 17 24 30 29 18 1 -17 -40 -65 -79 -75 -59 -42 -30 -25 -28 -32 -23 0 22 20 -1 -21 -25 -22 -23 -26 -27 -26 -26 -22 -15 -15 -26 -37 -41 -35 -27 -22 -26 -41 -58 -55 -28 -3 -9
9014 -9 -44 -76 -87 -83 -77 -68 -49 -22 0 14 21 25 23 12 -2 -12 -9 3 6 -11 -44 -71 -76 -64 -52 -52 -56 -57 -54 -60 -82 -111 -128 -121 -98 -72 -53 -40 -34 -30 -24 -14 -6 -2 0 12
$$ packed form
9146a1%J9K8J4pj4pjkj2k4l6l7k2p%OJ4K2J8RMKpj8j8j5j5j9qJ5L1K7J7J4K0K3K5J8Kk1k9
9128bj5RK0J6OmmMQmk5k0RL1J9j2k1plj8l5k8j9k4l3j9J8M6L8Jl2l8k5j2lJ2L6M7L0kj4kJ7
9110e4K7L5M3L8J3k2m5m5l3j8j0j2qJ0L5M6K5ql4m3k9oJ1J3OMJ3J2rl6m9l9j8KJ7K4K6K8L0
9093f0J9rl2k7%K3L3L8L9K5pl6l7k2pKQQNNJ0J2jk0k4oJ7K7J8%j5j7pOJ2RNPJ1J6J9J6J1L
9074G7lpj4k7l8m0k2PK9L4K4J6J1Mk%RQrk1j3Jmk8m4l1nJ6L2L9K7ll1l2rJ2J4OJMJ1J6J7J2
9054D4PMlj9l0k7j1JMKNPRNnk0l2k8nK2L8L4K5Rpj5nJ7K8J5j1l0l3k8k1j6rmoqlJ0K2K7K5
9035a6J8J0LKPOjj1j7j8k3k5j4MJ6J7J2NlmRK3K2kk1k0mLjljJ%MP%j1j1mOQNmj5j7LK7K5o
9014il5l2j1MORJ9K7K2J4PMkj1j4j0LJ2Lj7l3k7nJ2J2%mjLok2k9j7PK3K6J9J3OMOJ0QMKJ2
$$ plain form
8994 12 29 42 50 55 56 50 48 68 103 129 125 101 78 62 43 18 -6 -19 -16 -1 11 12 6 4 13 22 22 15 7 -3 -17 -22 -4 28 54 59 45 27 15 18 33 45 39 18 0
8974 0 -9 -12 -12 -4 9 20 22 24 30 31 25 24 41 67 84 90 93 91 72 37 7 -4 -2 4 16 32 42 29 -3 -38 -59 -66 -74 -93 -117 -128 -117 -96 -86 -91 -97 -96 -104 -141 -193 -222
8954 -222 -204 -153 -97 -48 -8 16 16 -4 -29 -45 -53 -59 -66 -67 -56 -33 -4 20 34 38 34 26 19 16 13 0 -22 -38 -32 -11 6 12 11 8 -2 -31 -67 -90 -84 -54 -21 -9 -26
8936 -26 -59 -82 -83 -72 -62 -58 -60 -68 -76 -71 -45 -9 19 29 27 24 30 47 70 88 100 106 107 98 76 51 24 -10 -52 -75 -53 0 42 55 55 68 85 83 53 19 3 10 25
8917 25 32 17 -15 -55 -87 -103 -102 -85 -56 -24 3 17 12 -10 -39 -56 -61 -69 -85 -102 -109 -103 -85 -54 -22 -19 -60 -125 -176 -198 -202 -195 -174 -140 -113 -104 -103 -101 -98 -98 -92 -74 -51
8898 -51 -44 -55 -71 -75 -68 -55 -47 -48 -57 -69 -73 -64 -41 -11 8 1 -31 -72 -104 -126 -147 -162 -157 -124 -76 -39 -29 -44 -62 -66 -51 -33 -26 -28 -25 -9 8 12 2 -8 -10 -4 -3 -17
8879 -17 -41 -59 -60 -43 -21 -6 2 10 13 9 0 -6 -14 -34 -66 -92 -87 -51 -3 34 55 62 60 49 35 26 30 48 74 98 111 115 116 118 117 112 101 84 62 35 10 -1 -3 -4 -11 -21
8859 -21 -29 -34 -48 -72 -95 -106 -111 -132 -173 -204 -192 -141 -94 -78 -80 -71 -49 -27 -9 9 22 11 -22 -51 -60 -61 -71 -82 -76 -51 -25 -16 -29 -58 -88 -108 -113 -113 -115 -111 -95 -72
$$ packed form
8994A2J7J3QNJokK0L5K6mk4k3j6j9k5k4j3LJ5J2JokRR%pqj0j4nJ8L2K6Nj4j8j2LJ5J2ok1j8
8974@rl%QJ3J1KKOJojJ7K6J7OLkj9l5l0j1KOJ2J6J0j3l2l5k1pqj9k4j1J1K1J0noJql7n2k9
8954b22J8N1N6M9M0K4%k0k5j6qopjJ1K3K9K4J4Mmqpllj3k2j6OK1J7Ojlj0k9l6k3OL0L3J2j7
8936b6l3k3jJ1J0MkqqNK6L6K8J0klOJ7K3J8J2OJrk2k5k7l4m2k3K2N3M2J3%J3J7kl0l4j6PJ5
8917B5Pj5l2m0l2j6JJ7K9L2K7J4nk2k9j7nqj6j7pOJ8L1L2Lm1o5n1k2mPK1L4K7RJKL%OJ8K3
8898e1Pj1j6mPJ3Qjrj2mRK3L0J9pl2m1l2k2k1j5NL3M8L7J0j5j8mJ5J8PkLJ6J7Mj0j0kOJj4
8879a7k4j8jJ7K2J5QQLmroqk0l2k6NL6M8L7K1Pkj1j4rMJ8K6K4J3MJKjnj1j7k2k7k5j1kjpj0
8859b1qnj4k4k3j1nk1m1l1J2N1M7J6kRK2K2J8J8J3j1l3k9rjj0j1OK5K6Rj3k9l0k0n%kMJ6K3
$$ plain form
8841 -72 -51 -29 -3 14 10 -14 -48 -88 -136 -182 -207 -207 -197 -188 -180 -176 -191 -223 -252 -258 -244 -226 -208 -191 -181 -184 -189 -175 -141 -101 -72 -63 -71 -80 -68 -32 5 27 40 62 88
8823 88 95 75 44 10 -26 -60 -69 -43 -5 14 5 -24 -60 -87 -91 -71 -43 -20 1 23 34 28 25 48 89 117 118 110 109 112 107 93 75 54 26 -11 -59 -113 -154 -160 -134
8806 -134 -107 -105 -120 -127 -117 -99 -78 -42 9 59 80 59 17 -11 -1 36 64 49 0 -45 -63 -56 -37 -15 1 3 -19 -60 -101 -127 -135 -126 -105 -85 -74 -70 -63 -46 -21
8789 -21 7 36 56 55 37 24 34 57 69 59 40 27 19 12 10 22 37 34 7 -23 -29 -10 4 -4 -27 -34 -19 -8 -22 -45 -46 -20 9 22 17 4 -15 -32 -29 -1 29
8771 29 31 -3 -48 -80 -92 -89 -80 -70 -67 -67 -66 -66 -74 -86 -94 -92 -81 -62 -38 -16 -12 -22 -30 -22 -11 -16 -41 -68 -84 -87 -83 -72 -63 -62 -71 -86 -99 -105 -105 -101 -103 -115 -133 -147 -152 -146 -131 -109
8750 -109 -85 -64 -50 -45 -49 -60 -70 -78 -81 -70 -35 14 52 59 50 46 49 45 32 22 14 -5 -35 -49 -32 -4 3 -12 -32 -46 -61 -82 -100 -109 -112 -116 -126 -140 -155 -159 -136 -88
8732 -88 -32 9 32 40 40 33 20 7 2 10 25 38 47 53 59 55 25 -33 -102 -154 -183 -202 -219 -224 -203 -161 -123 -106 -102 -94 -80 -72 -74 -81 -82 -73 -61 -53 -52 -54 -52 -45 -39 -38 -37 -29 -13 3
8711 3 21 40 52 53 45 39 32 14 -17 -43 -42 -18 5 8 -5 -15 -2 35 79 111 131 146 153 143 120 99 80 43 -14 -63 -78 -70 -64 -68 -70 -72 -88 -116 -133 -125 -98 -71
$$ packed form
8841g2K1K2K6J7mk4l4m0m8m6k5%J0RQMj5l2k9oJ4J8J8J7J0lnJ4L4M0K9RqrJ2L6L7K2J3K2K6
8823H8Pk0l1l4l6l4rK6L8J9rk9l6k7mK0K8K3K1K2J1olK3M1K8JqjLnj4j8k1k8l7m8n4m1oK6
8806a34K7Kj5pJ0J8K1L6N1N0K1k1m2k8J0L7K8j5m9m5j8PJ9K2J6Kk2m1m1k6qRK1K0J1MPJ7K5
8789b1K8K9K0jj8j3J0K3J2j0j9j3qpkJ2J5lk7l0oJ9J4qk3pJ5J1j4k3jK6K9J3nj3j9j7LK8L0
8771B9Kl4m5l2j2LRJ0L%J%qj2qKJ1J9K4K2Mj0qQJ1nk5k7j6lMJ1RJrj5j3o%Mkj2j8j4nOJ5K2
8750a09K4K1J4Nmj1j0qlJ1L5M9L8PrmLmj3j0qj9l0j4J7K8Pj5k0j4j5k1j8rlmj0j4j5mK3M8
8732h8N6M1K3Q%pj3j3nQJ5J3ROOml0n8o9n2k9j9j7nK1M2L8J7MQJ4QkpjRJ2QJkKPOJJQJ6J6
8711CJ8J9J2Jqopj8l1k6JK4K3Lj3j0J3L7M4L2K0J5Pj0k3k1j9l7n7m9j5QOmkkj6k8j7QK7K7
$$ plain form
8693 -71 -56 -62 -94 -135 -156 -150 -131 -117 -104 -81 -47 -10 19 26 4 -32 -54 -49 -31 -13 0 8 9 6 14 36 61 77 88 99 97 73 35 -3 -39 -72 -94 -99 -97 -100 -104 -92
8675 -92 -66 -43 -31 -22 -8 11 37 63 75 64 40 24 20 12 -7 -28 -40 -47 -59 -80 -108 -135 -155 -160 -155 -152 -152 -151 -151 -154 -155 -141 -114 -86 -63 -38 -16 -14 -35 -50 -34 -1
8657 -1 18 16 10 10 6 -11 -38 -67 -90 -96 -79 -49 -23 -3 19 49 72 73 54 24 -13 -57 -91 -99 -79 -52 -40 -50 -73 -96 -112 -113 -91 -47 -3 11 -9 -41 -50 -36
8639 -36 -25 -36 -59 -74 -80 -87 -94 -90 -77 -71 -82 -104 -123 -134 -144 -149 -139 -110 -78 -63 -74 -97 -113 -113 -110 -116 -129 -132 -120 -98 -75 -49 -21 0 0 -15 -32 -41 -45 -50 -54 -50 -41 -29
8620 -29 -15 -1 6 6 4 13 29 32 9 -32 -64 -68 -53 -43 -52 -66 -64 -41 -11 12 32 51 57 38 0 -42 -75 -102 -118 -112 -84 -63 -73 -106 -132 -138 -137 -139 -137 -114 -73 -27
8602 -27 12 50 91 127 148 145 125 100 82 77 78 75 66 56 48 38 28 26 30 31 27 34 62 94 100 75 36 -1 -40 -86 -128 -151 -149 -128 -95 -61 -43 -51 -75 -94 -99 -87 -62
8583 -62 -38 -34 -60 -95 -115 -116 -114 -116 -110 -88 -61 -37 -16 -1 -1 -19 -39 -43 -38 -46 -82 -137 -186 -207 -191 -153 -114 -87 -73 -70 -80 -99 -122 -148 -178 -201 -198 -169 -140 -131 -135 -131
8565 -131 -121 -121 -135 -141 -119 -70 -14 24 36 27 20 26 32 17 -27 -82 -125 -146 -153 -158 -164 -158 -134 -102 -85 -88 -91 -75 -48 -27 -19 -22 -37 -69 -103 -112 -88 -53 -31 -32 -44 -48 -34
$$ packed form
8693g1J5ol2m1k1OJ9J4J3K3L4L7K9Pk2l6k2NJ8J8J3QJlQK2K5J6J1J1kk4l8l8l6l3k2nKlmJ2
8675i2K6K3J2RJ4J9K6K6J2j1k4j6mqj9k1j2pj2k1k8k7k0nNL%J%ljJ4K7K8K3K5K2Kk1j5J6L3
8657aJ9ko%mj7k7k9k3oJ7L0K6K0K2L0K3Jj9l0l7m4l4qK0K7J2j0k3k3j6jK2M4M4J4k0l2rJ4
8639c6J1j1k3j5oppMJ3Oj1k2j9j1j0nJ0K9L2J5j1k3j6%Loj3lJ2K2K3K6K8K1%j5j7rmnmMRJ2
8620b9J4J4P%kRJ6Lk3m1l2mJ5J0rj4KK3L0K3K0J9Oj9l8m2l3k7j6OK8K1j0l3k6oJkKK3M1M6
8602b7L9L8M1L6K1lk0k5j8nJlrj0qj0j0kMJmPK8L2Ok5l9l7l9m6m2k3KK1L3L4J8qk4j9nJ2K5
8583f2K4Mk6l5k0jKkOK2K7K4K1J5%j8k0mNql6n5m9k1J6L8L9K7J4Lj0j9k3k6l0k3LK9K9RmM
8565a31J0%j4oK2M9N6L8J2rpOOj5m4n5m3k1pnoOK4L2J7llJ6K7K1Qlj5l2l4rK4L5K2jj2mJ4
$$ plain form
8546 -34 -13 -9 -35 -72 -84 -57 -13 13 10 -14 -47 -76 -97 -112 -123 -125 -107 -75 -51 -45 -46 -44 -41 -48 -64 -76 -79 -72 -63 -57 -58 -67 -80 -97 -121 -145 -155 -153 -152 -161 -171 -175 -176 -177 -167
8527 -167 -140 -106 -84 -82 -95 -114 -129 -138 -142 -141 -128 -98 -62 -48 -69 -105 -122 -108 -80 -57 -42 -33 -29 -27 -30 -38 -48 -51 -43 -37 -46 -66 -75 -63 -38 -14 0 1 0 5 17 9 -33 -93
8508 -93 -128 -129 -125 -140 -160 -161 -137 -106 -83 -67 -52 -38 -22 -8 0 2 2 1 -9 -36 -72 -106 -134 -161 -186 -199 -190 -164 -137 -128 -138 -150 -149 -135 -122 -113 -102 -87 -70 -56 -36
8490 -36 -11 5 3 -14 -25 -19 0 20 38 44 27 -13 -63 -94 -96 -83 -77 -81 -82 -72 -64 -77 -102 -111 -93 -64 -41 -24 -3 14 18 10 7 16 25 19 5 1 18 47 67 67 51 29
8471 29 4 -19 -36 -45 -53 -67 -80 -84 -85 -99 -129 -155 -153 -128 -99 -85 -87 -100 -114 -121 -123 -131 -150 -167 -165 -149 -144 -162 -184 -185 -166 -151 -152 -151 -132 -98 -72 -61 -56 -49 -48 -66 -89 -91
8452 -91 -66 -37 -23 -21 -20 -21 -30 -41 -42 -32 -22 -12 5 31 54 66 69 63 44 16 -1 3 24 44 58 73 93 102 78 21 -45 -86 -87 -63 -44 -43 -50 -52 -45 -43 -57 -87 -115
8433 -115 -120 -94 -52 -20 -14 -23 -24 -4 28 54 61 55 54 70 92 99 87 65 42 18 -3 -8 5 21 22 9 -1 -4 -1 3 10 17 16 10 13 27 43 47 40 25 4 -19 -37 -40 -37 -39
8413 -39 -50 -64 -73 -80 -88 -93 -95 -92 -86 -76 -64 -55 -46 -33 -20 -16 -21 -26 -17 1 14 12 -2 -21 -34 -36 -26 -10 6 20 29 30 25 16 1 -24 -50 -53 -25 4 1 -31 -63 -77 -90 -118
$$ packed form
8546c4K1Mk6l7j2K7M4K6lk4l3k9k1j5j1kJ8L2K4OjKLpj6j2lPROjrj3j7k4k4j0KJrj0mjjJ0
8527a67K7L4K2Kj3j9j5rmJJ3L0L6J4k1l6j7J4K8K3J5RMKlqj0lQOrk0rJ2K5K4J4JjNJ2qm2o0
8508i3l5jMj5k0jK4L1K3J6J5J4J6J4QK%jj0k7l6l4k8k7k5j3RK6K7Rj0j2JJ4J3RJ1J5J7J4K0
8490c6K5J6kj7j1OJ9K0J8Oj7m0n0l1kJ3OmjJ0Qj3k5rJ8K9K3J7K1J7MqlRRoj4mJ7K9K0%j6k2
8471B9k5k3j7rqj4j3mjj4l0k6KK5K9J4kj3j4pkqj9j7KJ6Nj8k2jJ9J5jJJ9L4K6J1NPJj8k3k
8452i1K5K9J4KJjrj1jJ0J0J0J7K6K3J2Loj9k8j7MK1K0J4J5K0Rk4n7o6m1jK4J9JpkPKj4l0k8
8433a15nK6M2L2OrjK0L2K6PojJ6K2Pj2k2k3k4k1nJ3J6Jj3j0lLMPPjoLJ4J6Mpj5k1k3j8lLk
8413c9j1j4rpqnkLOJ0J2RRJ3J3MnnRJ8J3kj4j9j3kJ0J6J6J4RJnrj5k5k6lK8K9ll2l2j4j3k8
$$ plain form
8393 -118 -154 -183 -202 -211 -206 -181 -147 -118 -93 -63 -35 -22 -22 -18 -5 9 25 48 70 73 49 15 -8 -19 -22 -8 20 51 67 77 97 122 134 127 119 120 116 86 35 -8
8376 -8 -26 -26 -27 -35 -37 -27 -16 -21 -41 -52 -36 -5 12 8 2 16 47 65 53 22 -1 -3 16 49 87 118 132 122 90 45 4 -12 0 27 37 15 -18 -38 -42 -44 -54
8358 -54 -65 -65 -58 -53 -55 -55 -44 -20 7 27 33 28 15 -10 -47 -76 -82 -67 -47 -22 13 48 53 22 -14 -24 -11 -4 -11 -16 -6 7 13 10 6 1 -8 -26 -46 -58 -63 -69 -82 -103 -121
8339 -121 -135 -146 -155 -157 -150 -140 -128 -114 -96 -80 -68 -55 -39 -27 -33 -56 -85 -104 -103 -82 -54 -43 -55 -75 -81 -69 -52 -48 -62 -89 -111 -108 -75 -30 5 29 45 44 13
8322 13 -37 -80 -98 -94 -80 -64 -51 -46 -41 -17 28 77 104 104 87 70 68 87 120 151 170 177 169 144 112 96 103 113 111 104 101 99 85 60 43 40 42 39 30 20 10 1 -6 -9 -6
8302 -6 3 8 0 -16 -22 -20 -29 -60 -87 -80 -51 -39 -64 -100 -114 -102 -79 -59 -47 -45 -55 -77 -107 -136 -157 -160 -148 -130 -117 -117 -136 -169 -199 -204 -176 -125 -70 -23 18 61 103
8285 103 128 116 70 21 0 9 28 41 46 43 36 26 15 5 0 7 27 46 48 46 63 95 113 97 61 29 5 -19 -46 -68 -86 -100 -98 -68 -22 16 36 50 63
8268 63 67 57 44 35 22 -3 -36 -54 -50 -40 -42 -57 -72 -76 -73 -67 -61 -54 -48 -44 -38 -24 0 30 59 78 86 81 72 66 60 47 25 4 -2 7 23 39 55 70 73 57 28 0 -23
$$ packed form
8393a18l6k9j9rNK5L4K9K5L0K8J3%MJ3J4J6K3K2Lk4l4k3j1lJ4K8L1J6J0K0K5J2pqJml0n1m3
8376hj8%jqkJ0J1nk0j1J6L1J7moJ4L1J8j2l1k3kJ9L3L8L1J4j0l2m5m1j6J2K7J0k2l3k0mkj0
8358e4j1%PNk%J1K4K7K0Onj3k5l7k9oJ5K0K5L5L5Nl1l6j0J3PpnJ0J3Olmnrj8k0j2noj3k1j8
8339a21j4j1rkPJ0J2J4J8J6J2J3J6J2ok3k9j9JK1K8J1j2k0oJ2J7Mj4k7k2LL3M5L5K4J6jl1
8322A3n0m3j8MJ4J6J3NNK4M5M9K7%j7j7kJ9L3L1J9Pqk5l2j6PJ0kplkj4k5j7lKlrj0j0rplL
8302fRNqj6oKrl1k7PK9J2k5l6j4J2K3K0J2Kj0k2l0k9k1lJ2J8J3%j9l3l0nK8N1N5M7M1M3M2
8285A03K5j2m6m9k1RJ9J3Nlpj0j1j0nPK0J9KkJ7L2J8j6l6l2k4k4k7k2j8j4KL0M6L8K0J4J3
8268F3Mj0j3rj3k5l3j8MJ0kj5j5mLOOPOMOJ4K4L0K9J9Qnrooj3k2k1oRJ6J6J6J5Lj6k9k8k3
$$ plain form
8248 -23 -43 -62 -70 -62 -46 -42 -56 -72 -76 -72 -74 -87 -107 -131 -161 -192 -208 -195 -161 -128 -103 -83 -61 -48 -58 -90 -126 -138 -117 -78 -46 -35 -42 -54 -64 -69 -76 -97 -138 -181
8231 -181 -195 -170 -126 -96 -96 -115 -132 -134 -119 -100 -88 -84 -72 -46 -24 -22 -30 -23 5 31 26 -7 -50 -82 -95 -96 -97 -104 -109 -103 -88 -81 -93 -119 -144 -154 -137 -92 -36 2 8 -17
8213 -17 -53 -79 -79 -44 9 53 66 59 50 47 40 27 19 24 41 63 84 101 111 113 104 77 35 -4 -25 -30 -36 -52 -69 -76 -72 -60 -33 7 49 72 73 59 38 17 0 -11
8194 -11 -26 -51 -77 -87 -79 -66 -66 -82 -105 -121 -126 -120 -106 -86 -67 -59 -67 -83 -86 -71 -54 -55 -71 -81 -73 -52 -30 -12 -1 -5 -25 -45 -49 -40 -35 -42 -49 -37 -5 30 49 52 57 74
8175 74 90 84 60 43 48 65 75 80 91 100 89 52 10 -14 -13 12 55 90 88 47 -1 -25 -26 -26 -39 -51 -42 -14 20 51 70 71 45 -6 -62 -99 -105 -87 -65 -47 -34
8158 -34 -21 -7 0 -11 -45 -91 -124 -123 -94 -57 -29 -6 10 15 2 -14 -17 -13 -20 -37 -38 -9 33 58 56 43 42 54 66 58 26 -16 -55 -76 -78 -63 -31 8 43 62 68
8140 68 68 58 33 1 -20 -24 -14 -4 -3 -13 -33 -54 -65 -57 -31 1 26 32 19 -2 -24 -39 -46 -50 -57 -72 -90 -99 -95 -84 -76 -77 -88 -109 -129 -135 -119 -91 -61 -31 0 24
8122 24 29 21 16 23 33 35 29 17 -6 -34 -42 -13 32 55 42 20 19 38 55 60 63 73 82 79 68 63 69 72 61 37 16 11 18 35 63 99 123 111 60 -3 -45 -55 -52 -56 -68
$$ packed form
8248b3k0j9qQJ6Mj4j6mMkj3k0k4l0l1j6J3L4L3K5K0K2J3j0l2l6j2K1L9L2J1pj2j0npk1m1m3
8231a81j4K5M4L0%j9j7kJ5J9J2MJ2K6K2KqPK8K6nl3m3l2j3jjpnOJ5Pj2k6k5j0J7M5N6L8Ok5
8213a7l6k6%L5N3M4J3prlpj3qNJ7K2K1J7J0Krk7m2l9k1noj6j7pMJ2K7M0M2K3Jj4k1k1j7j1
8194a1j5k5k6j0QJ3%j6k3j6nOJ4K0J9Qqj6lJ5J7jj6j0QK1K2J8J1mk0k0mRNppJ2L2L5J9LNJ7
8175G4J6ok4j7NJ7J0NJ1Rj1l7m2k4JK5M3L5km1m8k4j%j3j2RK8L4L1J9Jk6n1n6l7oJ8K2J8J3
8158c4J3J4Pj1l4m6l3JK9L7K8K3J6Nj3j6lMpj7jK9M2K5kj3jJ2J2ql2m2l9k1kJ5L2L9L5J9O
8140F8%j0k5l2k1mJ0J0Jj0k0k1j1QK6L2K5Oj3k1k2j5pmpj5j8rMJ1Qjj1k1k0oJ6K8L0L0L1K4
8122B4NqnPJ0Koj2k3k8qK9M5K3j3k2jJ9J7NLJ0Rlj1nOLj1k4k1nPJ7K8L6K4j2n1o3m2j0Lmj2
$$ plain form
8102 -68 -75 -72 -67 -70 -80 -86 -82 -80 -93 -123 -156 -175 -178 -171 -158 -143 -131 -127 -130 -132 -129 -118 -96 -57 0 60 103 117 109 90 68 42 13 -16 -40 -52 -50 -36 -12 20 58 88 94
8083 94 74 46 33 42 65 88 101 99 81 57 45 53 67 66 41 1 -37 -63 -69 -59 -46 -38 -36 -29 -19 -13 -17 -25 -29 -30 -33 -36 -40 -43 -46 -48 -49 -55 -67 -71 -57 -31 -8 5 16 26
8064 26 27 13 -2 -9 -9 -11 -18 -17 -1 22 41 44 29 4 -19 -34 -39 -40 -38 -36 -35 -38 -43 -45 -52 -70 -97 -118 -124 -119 -115 -114 -107 -87 -56 -23 3 20 27 28 25 12 -19 -67 -116 -144 -147 -137
8043 -137 -137 -154 -173 -172 -144 -105 -72 -49 -34 -30 -38 -57 -75 -83 -84 -82 -81 -82 -84 -85 -81 -73 -69 -77 -95 -113 -123 -129 -135 -145 -152 -150 -135 -110 -84 -70 -74 -89 -92 -70 -32 -1 15 29 53
8023 53 82 107 124 129 120 93 59 33 24 31 53 83 103 97 71 46 32 24 13 0 -9 -20 -35 -50 -63 -78 -101 -126 -134 -117 -85 -55 -44 -61 -102 -146 -171 -162 -129 -92
8006 -92 -63 -38 -5 39 85 116 128 130 131 133 134 128 111 81 42 6 -16 -31 -46 -61 -72 -72 -63 -53 -46 -49 -64 -88 -113 -129 -132 -128 -122 -122 -128 -132 -128 -117 -99 -72 -35 -4 7
7987 7 5 7 27 53 73 84 86 75 47 12 -16 -42 -73 -102 -108 -91 -70 -60 -52 -29 3 31 51 78 114 143 152 144 135 137 144 152 155 146 121 90 67 60 55 36 0 -34 -53
7969 -53 -53 -47 -44 -43 -40 -34 -32 -41 -61 -82 -91 -82 -63 -46 -42 -50 -67 -84 -97 -103 -103 -94 -76 -50 -31 -35 -70 -117 -146 -142 -117 -98 -97 -100 -88 -53 -9 24 34 17 -7 -15 8 54 97
$$ packed form
8102f8pLNlj0oMKj3l0l3j9lPJ3J5J2MlkLJ1K2L9N7O0M3J4qj9k2k6k9k9k4j2KJ4K4L2L8L0O
8083I4k0k8j3RK3K3J3kj8k4j2QJ4jk5m0l8k6oJ0J3QKPJ0Omqmjllmllkjoj2mJ4K6K3J3J1J0
8064B6Jj4j5p%kpJJ6K3J9Lj5k5k3j5njKKJlnkpj8k7k1oNMJPK0L1L3K6J7PJlj3l1m8m9k8lJ0
8043a37%j7j9JK8L9L3K3J5Mqj9j8qjKJjkjMQMqj8j8j0ooj0pKJ5K5K6J4mj5lK2L8L1J6J4K4
8023E3K9K5J7Nrk7l4k6rPK2L0K0ok6k5j4qj1j3rj1j5j5j3j5k3k5qJ7L2L0J1j7m1m4k5RL3L7
8006i2K9K5L3M4M6L1J2KJKJoj7l0l9l6k2j5j5j5j1%RJ0Plj5k4k5j6lMO%omMJ1J8K7L7L1J1
7987GkKK0K6K0J1Kj1k8l5k8k6l1k9oJ7K1J0QK3L2K8K0K7L6K9RqrKPQLrk5l1k3pnj9l6l4j9
7969e3%OLJLOKrk0k1rRJ9J7Mqj7j7j3o%RJ8K6J9ml5m7k9MK5J9JlJ2L5M4L3J0j7k4qK3M6M3
$$ plain form
7949 97 124 133 129 114 94 81 77 77 76 75 75 67 45 21 9 7 0 -9 -5 17 42 46 30 14 10 14 18 22 22 16 7 8 18 21 9 -4 -7 -4 -8 -15 -7 19 50 69 72 62 39 10 -4
7928 -4 11 47 73 71 48 22 0 -19 -40 -62 -86 -109 -123 -120 -105 -85 -67 -49 -35 -34 -50 -72 -80 -68 -42 -16 0 5 6 12 26 42 52 57 61 63 55 35 16 13 19 20 12
7909 12 7 15 27 30 20 4 -14 -34 -47 -44 -34 -30 -40 -52 -57 -53 -47 -36 -18 7 34 57 67 58 29 -7 -40 -68 -95 -116 -127 -129 -133 -144 -159 -170 -174 -169 -154 -124 -79 -24
7891 -24 19 35 22 2 -2 4 1 -23 -53 -64 -53 -36 -22 -12 0 9 15 19 24 28 25 12 -7 -23 -24 -10 8 27 54 92 128 140 117 72 32 5 -14 -27 -29 -19 -14
7873 -14 -30 -66 -107 -141 -165 -171 -154 -117 -83 -64 -51 -26 6 30 33 20 0 -31 -65 -84 -71 -33 8 39 63 85 102 109 110 115 130 144 144 127 105 86 66 37
7857 37 5 -11 -10 -5 -8 -10 2 29 55 73 88 102 105 85 53 31 36 65 98 117 108 77 42 23 27 39 43 34 25 28 39 45 43 39 42 53 67 83 89 72 28 -21 -50 -52
7838 -52 -44 -39 -35 -29 -18 -3 8 6 -17 -50 -65 -58 -46 -42 -36 -17 2 8 6 16 39 61 81 102 116 106 76 55 62 84 103 114 118 105 73 39 29 44 69 94 118
7820 118 133 124 95 71 67 80 92 91 77 63 65 89 116 125 121 127 146 159 156 152 159 172 180 195 226 262 284 296 322 367 420 472 525 578 628 683 754 833 901 959
$$ packed form
7949I7K7Rmj5k0j3m%jj%qk2k4j2kprMK2K5Mj6j6mMMM%orJJ0Lj2j3lLmpQK6L1J9Lj0k3k9j4
7928dJ5L6K6kk3k6k2j9k1k2k4k3j4LJ5K0J8J8J4Jj6k2qJ2K6K6J6NJOJ4J6J0NMKqk0j9lOJq
7909A2nQJ2Lj0j6j8k0j3LJ0Mj0j2nMOJ1J8K5K7K3J0rk9l6l3k8k7k1j1kmj1j5j1mNJ5L0M5N5
7891b4M3J6j3k0mOlk4l0j1J1J7J4J0J2ROMNMlj3j9j6jJ4J8J9K7L8L6J2k3m5m0k7j9j3kJ0N
7873a4j6l6m1l4k4oJ7L7L4J9J3K5L2K4Lj3k0l1l4j9J3L8M1L1K4K2J7PJNJ5J4%j7k2j9k0k9
7857C7l2j6JNlkJ2K7K6J8J5J4Lk0l2k2NK9L3J9rl1l5j9MJ2MrrLJ1OkmLJ1J4J6Oj7m4m9k9k
7838e2QNMOJ1J5J1kk3l3j5PJ2MOJ9J9OkJ0K3K2K0K1J4j0l0k1PK2J9J1Mj3l2l4j0J5K5K5K4
7820A18J5rk9k4mJ3J2jj4j4KK4K7RmOJ9J3lmPJ3QJ5L1L6K2J2K6M5N3N2N3N3N0N5P1P9O8N8
$$ plain form
7803 959 1022 1092 1156 1224 1328 1485 1687 1935 2255 2660 3148 3763 4601 5759 7324 9414 12094 15076 17550 18539 17600 15168
7793 15168 12190 9456 7280 5642 4446 3595 2980 2505 2122 1822 1592 1412 1262 1129 1012 930 894 883 866 847 864 931 1008 1038
7783 1038 999 905 789 690 634 616 610 600 593 588 575 555 547 561 577 574 557 546 542 535 529 540 569 609 652 693 731 783 870 994 1133 1272 1419 1589 1790
7767 1790 2038 2353 2741 3209 3822 4693 5929 7623 9903 12786 15855 18165 18748 17344 14608 11563 8911 6839 5271
7759 5271 4106 3260 2644 2190 1853 1592 1374 1200 1088 1022 962 902 863 841 795 707 613 549 509 476 450 437 431 423 419 420 418 408 400 406 416 423 428 437
7744 437 447 463 496 542 577 589 597 629 683 732 762 778 800 840 898 971 1066 1201 1389 1618 1873 2158 2496 2909 3426 4117 5069 6363 8107
7732 8107 10439 13316 16216 18177 18363 16702 13925 10993 8495 6551 5074 3977 3187 2609 2167 1833 1588 1393 1209
7724 1209 1032 881 768 681 598 509 419 338 276 237 218 214 218 217 204 181 159 138 118 101 90 82 68 45 23 9 1 1 13 40 71 91 95 84 68 56
$$ packed form
7803I59O3P0O4O8J04J57K02K48L20M05M88O15Q38J158J565K090K680K982K474R89r39k432
7793A5168k978k734k176j638j196q51o15m75l83l00k30j80j50j33j17q2l6j1j7j9J7O7P7L0
7783A038l9r4j16r9n6j8oj0pnj3k0qJ4J6lj7j1mpoJ1K9M0M3M1L8N2Q7J24J39J39J47J70K01
7767A790K48L15L88M68O13Q71J236J694K280K883L069K310N83j404k736l045k652k072j568
7759E271j165q46o16m54l37k61k18j74j12o6o0o0l9k2m6q8r4o4m0l3k6j3oqmJkj0qOJ0PNR
7744D37J0J6L3M6L5J2QL2N4M9L0J6K2M0N8P3R5J35J88K29K55K85L38M13N17O91R52J294J744
7732H107K332K877K900J961J86j661k777k932k498j944j477j097p90n78m42l34k45j95j84
7724A209j77j51j13q7q3q9r0q1o2l9j9mMjj3k3k2k1k0j7j1qj4k3k2j4q%J2K7L1K0Mj1j6j2
$$ plain form
7708 56 63 93 128 140 115 72 45 49 74 100 115 117 107 93 82 74 58 28 -6 -26 -19 8 43 70 80 71 47 19 -6 -28 -46 -59 -59 -43 -19 -4 -10 -27 -35 -28
7691 -28 -19 -20 -30 -39 -45 -49 -47 -28 -1 12 6 -3 1 23 51 76 98 116 118 97 57 16 -14 -37 -55 -67 -67 -66 -89 -136 -176 -174 -136 -98 -86 -88 -79 -53 -19 17 57 91 104
7672 104 90 63 39 28 30 39 49 57 62 62 47 11 -41 -92 -119 -112 -82 -45 -10 21 45 49 29 3 -5 0 0 -12 -13 9 36 39 16 -9 -24 -33 -44 -52 -51 -42 -29 -12 2
7653 2 5 -12 -40 -59 -55 -33 -7 14 31 48 64 75 77 73 63 47 30 16 2 -17 -43 -68 -92 -114 -135 -149 -152 -152 -152 -153 -153 -150 -137 -108 -76 -67 -83 -96 -77 -32 8
7636 8 26 22 5 -19 -43 -54 -56 -54 -51 -40 -27 -21 -25 -26 -15 3 18 18 2 -19 -35 -39 -44 -62 -89 -107 -111 -109 -105 -96 -83 -73 -66 -56 -46 -49 -67 -82 -82 -73 -67 -59 -46 -35 -36 -48
7616 -48 -66 -86 -99 -97 -85 -79 -80 -68 -30 4 0 -37 -73 -85 -87 -90 -88 -68 -44 -37 -50 -59 -45 -9 28 50 48 31 10 -4 -2 15 41 58 60 56 53 46 25 0 -16 -18 -21 -40
7597 -40 -71 -99 -106 -86 -47 -11 6 12 14 11 -4 -30 -53 -65 -71 -76 -82 -85 -85 -79 -64 -49 -47 -61 -83 -104 -122 -137 -144 -146 -149 -146 -128 -99 -78 -73 -72 -64 -54 -53 -59 -67 -77 -90 -95 -81
7577 -81 -51 -19 1 2 -17 -48 -71 -72 -59 -49 -50 -60 -71 -74 -55 -18 18 37 43 57 80 95 82 48 14 -3 -1 11 25 40 56 59 30 -28 -81 -95 -77 -60 -56
$$ packed form
7708E6PL0L5J2k5m3k7MK5K6J5Kj0j4j1qj6l0l4k0PK7L5K7J0rk4k8k5k2j8j3%J6K4J5oj7qP
7691b8Rjj0romKJ9K7J3orMK2K8K5K2J8Kk1m0m1l0k3j8j2%Jk3m7m0KL8L8J2kRK6L4L6M0L4J3
7672A04j4k7k4j1KRJ0QN%j5l6n2n1k7PL0L7L5L1K4Mk0k6qN%j2jK2K7Lk3k5j5rj1qJRJ3J7J4
7653BLj7k8j9MK2K6K1J7J7J6J1Kmj0j6j7j4j4j9k6k5k4k2k1j4l%%j%LJ3K9L2Rj6j3J9M5M0
7636HJ8mj7k4k4j1kKLJ1J3OmjJ1J8J5%j6k1j6mnj8k7j8mKMRJ3J0PJ0J0lj8j5%ROQJ3J1jj2
7616d8j8k0j3KJ2OjJ2L8L4ml7l6j2klKK0K4Pj3rJ4L6L7K2kj7k1j4KJ7K6J7Kmlpk1k5j6klj9
7597d0l1k8pK0L9L6J7OKlj5k6k3j2onol%OJ5J5Kj4k2k1j8j5pklLJ8K9K1NJQJ0Joqj0j3nJ4
7577h1L0L2K0Jj9l1k3jJ3J0jj0j1lJ9L7L6J9OJ4K3J5j3l4l4j7KJ2J4J5J6Lk9n8n3j4J8J7M
$$ plain form
7560 -56 -55 -49 -43 -39 -26 -2 18 28 31 22 -9 -58 -91 -83 -56 -46 -61 -74 -68 -49 -29 -11 1 3 -2 -12 -26 -47 -67 -72 -65 -63 -73 -82 -78 -62 -48 -35 -22 -12 -12 -21 -30 -33 -24
7540 -24 -2 24 42 42 28 13 -1 -20 -42 -59 -63 -50 -25 0 12 12 7 7 5 -12 -43 -70 -72 -52 -25 -6 -4 -20 -47 -66 -59 -28 5 26 35 44 56 63 56 32 -2 -40
7522 -40 -70 -87 -94 -98 -97 -82 -53 -32 -38 -67 -90 -94 -93 -98 -103 -92 -72 -58 -50 -39 -26 -26 -46 -72 -91 -100 -100 -89 -72 -62 -63 -65 -48 -13 23 40 32 2 -34 -60 -62 -36 3
7503 3 43 68 73 65 50 23 -18 -60 -82 -80 -75 -83 -97 -100 -92 -84 -80 -83 -95 -110 -114 -101 -90 -96 -109 -109 -108 -131 -173 -201 -193 -165 -142 -129 -118 -108 -96 -72 -35 0 22 30 27 7
7484 7 -25 -60 -87 -110 -134 -145 -132 -101 -71 -42 -12 12 26 33 43 47 27 -6 -27 -19 2 12 1 -25 -59 -83 -89 -80 -69 -63 -59 -56 -58 -58 -39 1 45 69 74 71 65 49
7466 49 21 -5 -9 17 62 100 114 106 85 52 11 -25 -43 -45 -43 -44 -41 -31 -18 -5 4 0 -25 -68 -111 -141 -154 -141 -106 -68 -53 -60 -71 -74 -79 -83 -75 -58 -55 -76 -95 -85
7448 -85 -50 -12 21 54 71 54 15 -16 -33 -56 -93 -122 -122 -96 -62 -38 -35 -56 -89 -116 -128 -126 -119 -105 -84 -57 -34 -22 -27 -41 -50 -48 -37 -24 2 49 100 127 125
7431 125 117 120 123 113 95 83 72 51 22 2 0 10 22 21 2 -19 -22 8 57 88 80 45 6 -19 -26 -20 -9 -4 -9 -12 -4 8 2 -31 -71 -82 -50 0 34 34 8 -26
$$ packed form
7560e6JOOMJ3K4K0J0Lrl1m9l3QK7J0j5j3OJ9K0J8J2Knj0j4k1k0nPKj0rMJ6J4J3J3J0%rrlR
7540b4K2K6J8%j4j5j4j9k2j7mJ3K5K5J2%n%kj7l1k7kK0K7J9Kj6k7j9PL1L3K1RRJ2Ppk4l4l8
7522d0l0j7pmJJ5K9K1ok9k3mJnnJ1K0J4QJ1J3%k0k6j9r%J1J7J0jkJ7L5L6J7ql0l6k6kK6L9
7503CM0K5Nqj5k7m1m2k2KNqj4lQQMlj2j5mJ3J1oj3%Jk3m2k8QK8K3J3J1J0J2K4L7L5K2Qlk0
7484Gl2l5k7k3k4j1J3L1L0K9L0K4J4PJ0Mk0l3k1QK1J0j1k6l4k4oRJ1OMLk%J9M0M4K4Nloj6
7466D9k8k6mK6M5L8J4qk1l3m1l6j8kKjLJ0J3J3Rmk5m3m3l0j3J3L5L8J5pj1lnmQJ7Lk1j9J0
7448h5L5L8L3L3J7j7l9l1j7k3l7k9%K6L4K4Lk1l3k7j2KPJ4K1K7K3J2nj4rKJ1J3K6M7N1K7k
7431A25qLLj0j8j2j1k1k9k0kJ0J2jj9k1lL0M9L1ql5l9k5pOJ1NnlQJ2ol3m0j1L2N0L4%k6l4
$$ plain form
7413 -26 -61 -93 -116 -121 -103 -69 -35 -9 10 33 54 61 46 18 -7 -25 -40 -50 -62 -84 -112 -129 -124 -107 -103 -110 -108 -84 -50 -17 15 54 87 93 63 2 -68 -120 -135
7396 -135 -123 -110 -110 -109 -96 -80 -82 -102 -122 -130 -126 -118 -109 -94 -71 -47 -37 -45 -61 -72 -80 -95 -111 -106 -77 -42 -18 -6 -5 -23 -56 -78 -69 -37 -15 -17 -32 -45 -49 -43 -37 -47 -70
7377 -70 -79 -53 -3 40 60 62 50 28 13 20 41 53 47 36 23 0 -27 -34 -15 2 -3 -24 -37 -34 -23 -9 5 16 22 28 35 30 4 -30 -53 -54 -31 8 56 92 104
7360 104 96 73 34 -16 -59 -73 -64 -59 -68 -81 -88 -89 -90 -88 -87 -93 -102 -98 -79 -62 -61 -72 -81 -81 -73 -56 -32 -17 -22 -35 -35 -23 -19 -33 -42 -24 16 51 64 63 63 64 61 56 55 54 46 29 6
7338 6 -20 -47 -65 -68 -66 -74 -85 -79 -48 -16 -17 -49 -81 -89 -75 -53 -32 -16 -9 -10 -15 -22 -31 -35 -31 -26 -33 -53 -69 -70 -62 -56 -49 -30 0 24 33 35 40 43 35 20 14 21 26 18 4 2 15 31
7317 31 38 39 42 48 50 42 31 29 42 59 58 29 -14 -51 -71 -77 -73 -52 -16 16 24 6 -22 -45 -52 -49 -45 -49 -55 -53 -40 -28 -27 -34 -38 -40 -42 -41 -29 -12 -7 -14 -16 3 40 74 93 90 66
7295 66 25 -15 -43 -53 -56 -55 -47 -33 -22 -25 -40 -57 -70 -80 -90 -97 -98 -95 -95 -104 -124 -142 -149 -141 -128 -127 -144 -168 -180 -169 -137 -91 -45 -13 -10 -32 -53 -54 -30 0 21 21 0
7277 0 -32 -50 -40 -11 13 24 29 33 30 19 14 25 37 23 -19 -69 -100 -104 -90 -73 -64 -68 -74 -71 -59 -53 -62 -72 -66 -46 -33 -39 -55 -62 -51 -25 4 28 32 16 -7 -19 -23 -36
$$ packed form
7413b6l5l2k3nJ8L4L4K6J9K3K1Pj5k8k5j8j5j0j2k2k8j7NJ7MpKK4L4L3L2L9L3Ol0o1p0n2j5
7396a35J2J3%JJ3J6kk0k0qMQRJ5K3K4J0qj6j1qj5j6NK9L5K4J2Jj8l3k2RL2K2kj5j3mOOj0k3
7377g0rK6N0M3K0Kj2k2j5PK1J2oj1j3k3k7pJ9J7nk1j3LJ1J4J4J1OOPnk6l4k3jK3L9M8L6J2
7360A04qk3l9n0m3j4RNrj3pjjKJorMJ9J7Jj1r%QJ7K4J5nj3%J2Mj4rJ8M0L5J3j%Jlnjjqj7k3
7338Fk6k7j8lKqj1OL1L2jl2l2qJ4K2K1J6PjnprmMNpk0j6jQOPJ9L0K4RKNLqj5oPNqj4kJ3J6
7317C1PJLOKqj1kJ3J7jk9m3l7k0oMK1L6L2Qj8k8k3pLMmoKJ3J2JpmkkJJ2J7NpkJ9L7L4J9lk4
7295F6m1m0k8j0lJQJ4J1lj5j7j3j0j0pjL%rk0j8pQJ3Jj7k4j2J1L2M6M6L2Lk2k1jK4L0K1%k1
7277@l2j8J0K9K4J1NMlj1nJ1J2j4m2n0l1mJ4J7RmoLJ2Orj0OK0J3oj6pJ1K6K9K4Mj6k3j2mj3
$$ plain form
7258 -36 -63 -89 -99 -101 -109 -112 -95 -68 -59 -76 -97 -99 -83 -62 -49 -52 -82 -133 -176 -187 -169 -145 -124 -103 -77 -50 -22 2 17 17 7 4 15 30 40 41 39 36 33 31 24 8
7239 8 -19 -52 -79 -90 -81 -59 -35 -17 -11 -19 -37 -56 -65 -67 -72 -83 -88 -76 -52 -32 -22 -22 -35 -61 -89 -105 -103 -93 -77 -51 -16 8 7 -11 -30 -45 -65 -89 -102 -87 -44
7222 -44 7 47 62 52 21 -22 -63 -86 -83 -65 -46 -36 -29 -22 -20 -28 -43 -50 -41 -24 -19 -31 -40 -25 1 11 -6 -30 -35 -18 3 19 25 22 16 21 35 40 17 -21 -46 -47 -36
7203 -36 -23 -6 13 18 0 -23 -38 -46 -57 -69 -69 -56 -36 -18 -6 -6 -22 -46 -59 -52 -28 0 22 28 21 10 -2 -16 -26 -20 2 32 56 73 84 80 52 9 -32 -62
7186 -62 -78 -78 -63 -45 -33 -30 -28 -28 -34 -41 -43 -46 -56 -68 -68 -56 -39 -19 2 18 16 -3 -26 -43 -60 -81 -96 -100 -97 -92 -83 -65 -43 -25 -16 -14 -19 -26 -30 -28 -24 -23 -20 -11 0 1 -4 -13 -16
7164 -16 -11 -4 -5 -21 -47 -67 -75 -73 -67 -64 -69 -84 -109 -137 -164 -184 -191 -181 -164 -162 -176 -184 -162 -116 -75 -62 -77 -101 -114 -106 -80 -48 -18 4 12 -1 -33 -56 -52 -29 -7 5
7146 5 18 34 39 24 0 -18 -27 -30 -27 -12 13 34 38 30 18 2 -25 -65 -103 -121 -118 -103 -82 -54 -28 -16 -23 -40 -57 -67 -62 -36 0 22 16 -4 -23 -50 -93 -136 -143
7128 -143 -109 -62 -33 -25 -28 -41 -67 -99 -121 -126 -118 -98 -68 -36 -14 -4 1 6 4 -13 -37 -56 -66 -78 -100 -124 -139 -139 -129 -114 -98 -85 -79 -77 -69 -48 -18 6 10 -3 -19
$$ packed form
7258c6k7k6j0kqlJ7K7Rj7k1kJ6K1J3ll0n1m3j1J8K4K1K1K6K7K8K4J5%j0lJ1J5J0Jkllkpj6
7239Hk7l3k7j1RK2K4J8Oqj8j9rknj1nJ2K4K0J0%j3k6k8j6KJ0J6K6L5K4jj8j9j5k0k4j3J5M3
7222d4N1M0J5j0l1m3m1k3LJ8J9J0PPKqj5pRJ7Nj2rJ5K6J0j7k4nJ7K1J6OloNJ4Nk3l8k5jJ1
7203c6J3J7J9Nj8k3j5qj1j2%J3K0J8J2%j6k4j3PK4K8K2Opj1j2j4j0OK2L0K4J7J1mk8m3m1l0
7186f2j6%J5J8J2LK%opklj0j2%J2J7K0K1J6kj9k3j7j7k1j5mLNRJ8K2J8RKnpmKMJLRJ1Jnrl
7164a6NPjj6k6k0qKOLnj5k5k8k7k0pJ0J7Kj4qK2M6M1J3j5k4j3QK6L2L0K2Qj3l2k3MK3K2J2
7146EJ3J6Nj5k4j8rlLJ5K5K1Mqj2j6k7m0l8j8LJ5K1K8K6J2pj7j7j0NK6L6K2ok0j9k7m3m3p
7128a43L4M7K9Qlj3k6l2k2nQK0L0L2K2J0NNkj7k4j9j0j2k2k4j5%J0J5J6J3OKQK1L0K4Mj3j6
$$ plain form
7111 -19 -18 3 26 32 18 -9 -43 -78 -101 -95 -64 -33 -28 -53 -91 -117 -116 -89 -55 -39 -43 -45 -28 -2 6 -5 -24 -41 -57 -73 -81 -81 -79 -77 -62 -32 0 24 42 56 58 46
7092 46 32 23 8 -23 -54 -62 -55 -68 -111 -152 -159 -143 -130 -119 -92 -45 -7 -2 -21 -38 -42 -53 -90 -143 -185 -203 -208 -210 -198 -154 -81 -9 36 53 50 38 30 38 60 79 81
7075 81 75 82 102 111 89 46 7 -9 -9 -4 -2 -6 -14 -25 -30 -22 1 32 56 66 66 62 51 31 6 -9 -12 -12 -22 -41 -59 -66 -59 -43 -25 -14 -9 1 23 43 45 26 7 3 12
7055 12 20 23 22 15 0 -25 -53 -76 -87 -86 -76 -60 -39 -15 0 2 -1 -1 1 -1 -10 -7 15 45 66 83 112 147 169 166 144 117 89 66 55 55 54 42 19 -9 -37 -54 -57
7037 -57 -50 -43 -32 -5 32 55 45 12 -17 -34 -42 -51 -67 -87 -102 -96 -71 -44 -31 -28 -28 -34 -55 -79 -86 -70 -47 -31 -25 -21 -18 -12 -3 4 10 12 9 -3 -26 -42 -37 -18 -4 -1 2 13
7017 13 20 16 12 16 20 12 0 1 22 49 65 64 46 21 6 9 26 42 47 42 35 32 39 50 53 40 17 0 -4 -5 -16 -42 -70 -91 -104 -112 -115 -104 -81 -57 -45 -39 -27 -7 8
6997 8 12 11 17 24 18 0 -10 0 28 51 49 20 -22 -68 -109 -138 -150 -144 -129 -111 -85 -48 -10 9 0 -30 -63 -85 -91 -87 -79 -67 -45 -16 6 9 -12 -51 -89 -106 -91 -60
6979 -60 -46 -60 -76 -68 -47 -48 -72 -81 -58 -31 -37 -65 -80 -70 -56 -52 -52 -55 -70 -95 -112 -102 -72 -43 -31 -31 -33 -27 -18 -22 -44 -68 -78 -75 -79 -98 -120 -128 -118 -95 -63 -35 -23
$$ packed form
7111a9JK1K3Oj4k7l4l5k3OL1L1Nk5l8k6JK7L4J6mkJ7K6Qj1j9j7j6j6q%KKJ5L0L2K4J8J4Kj2
7092D6j4rj5l1l1qPj3m3m1pJ6J3J1K7M7L8Nj9j7mj1l7n3m2j8nkJ2M4P3P2M5J7lj2qQK2J9K
7075H1oPK0Rk2m3l9j6%NKmqj1nQK3L1K4J0%mj1k0k5j5l%j0j9j8pPJ6J8J1NJ0K2K0Kj9j9mR
7055A2QLjpj5k5k8k3j1JJ0J6K1K4J5Kl%KkrLK2L0K1J7K9L5K2lk2k7k8k3j1%jj2k3k8k8j7l
7037e7PPJ1K7L7K3j0l3k9j7qrj6k0j5OK5K7J3L%ok1k4pJ6K3J6OMLORPOKlj2k3j6NJ9J4LLJ1
7017A3PmmMMqj2JK1K7J6jj8k5j5LJ7J6NnplPJ1Lj3k3j7mjj1k6k8k1j3qlJ1K3K4J2OJ2K0J5
6997HMjOPoj8j0J0K8K3kk9m2m6m1k9j2OJ5J8K6L7L8J9rl0l3k2oMQJ2K2K9K2Lk1l9l8j7J5L1
6979f0J4j4j6QK1jk4rK3K7ok8j5J0J4M%lj5k5j7J0L0K9J2%kORmk2k4j0Lmj9k2qJ0K3L2K8J2
$$ plain form
6960 -23 -32 -52 -68 -71 -62 -47 -40 -49 -70 -89 -99 -95 -78 -51 -28 -26 -38 -45 -37 -29 -36 -49 -54 -55 -67 -92 -116 -121 -101 -68 -35 -16 -10 -7 -4 -8 -19 -28 -31 -38 -53 -68 -72 -70 -72 -82 -95
6940 -95 -109 -125 -135 -127 -105 -82 -62 -38 -12 1 -4 -23 -39 -44 -43 -36 -24 -5 18 39 45 24 -15 -54 -77 -84 -77 -63 -53 -61 -78 -84 -71 -51 -37 -27 -18 -22 -50 -84 -100
6922 -100 -92 -76 -67 -63 -60 -55 -43 -21 7 34 50 53 43 22 4 3 17 28 22 5 -16 -35 -48 -52 -54 -71 -101 -123 -119 -98 -79 -67 -59 -55 -61 -77 -90 -90 -75 -44 0 43
6904 43 66 61 38 14 0 -3 -4 -11 -30 -51 -61 -57 -45 -33 -23 -12 -2 0 -6 -17 -27 -33 -35 -44 -71 -113 -150 -159 -142 -110 -74 -32 11 44 54 47 39 34 27 14 -4 -26 -45
6885 -45 -58 -62 -63 -63 -59 -42 -8 32 67 85 80 65 59 74 102 123 122 105 87 69 48 20 -13 -52 -95 -130 -144 -136 -122 -119 -127 -136 -138 -130 -108 -73 -38 -12 0 3 -3 -18 -40
6867 -40 -63 -90 -120 -139 -128 -82 -26 13 29 31 30 32 42 62 84 92 79 59 49 50 48 28 -7 -47 -78 -95 -100 -93 -77 -58 -45 -52 -83 -128 -165 -171 -148 -113 -81 -55
6849 -55 -32 -26 -50 -102 -153 -176 -171 -155 -140 -130 -126 -132 -143 -150 -144 -122 -86 -39 7 38 49 52 56 59 51 29 2 -17 -22 -10 9 25 30 21 3 -19 -38 -42 -36 -36 -52 -73 -82 -77
6830 -77 -68 -61 -53 -46 -48 -52 -44 -26 -18 -35 -67 -91 -96 -89 -77 -63 -50 -43 -45 -49 -51 -56 -67 -84 -97 -102 -99 -90 -73 -46 -13 7 3 -22 -48 -51 -25 9 26 11 -20 -38 -22 15 46
$$ packed form
6960b3rk0j6lRJ5Prk1j9j0MJ7K7K3Kj2pQQpj3njj2k5k4nK0L3L3J9OLLmj1rlpj5j5mKkj0j3
6940i5j4j6j0QK2K3K0K4K6J3nj9j6nJPJ2J9K3K1Ok1l9l9k3pPJ4J0qj7oJ3K0J4J0Rmk8l4j6
6922a00QJ6RMLNJ2K2K8K7J6Lj0k1j8jJ4J1oj7k1j9j3mkj7l0k2MK1J9J2QMoj6j3%J5L1M4M3
6904D3K3nk3k4j4ljpj9k1j0MJ2J2J0J1J0Koj1j0okrk7m2l7rJ7L2L6M2M3L3J0pqnpj3j8k2j9
6885d5j3mj%MJ7L4M0L5J8nj5oJ5K8K1jj7j8j8k1k8l3l9m3l5j4QJ4LqrkQK2L5L5K6J2Loj5k2
6867d0k3k7l0j9J1M6N6L9J6KjKJ0K0K2Qj3k0j0Jkk0l5m0l1j7nPJ6J9J3pl1m5l7oK3L5L2K6
6849e5K3Ok4n2n1k3NJ6J5J0Moj1pOK2L6M7M6L1J1LMLqk2k7j9nJ2J9J6Nrj8k2j9mO%j6k1rN
6830g7RPQPkmQJ8Qj7l2k4nPJ2J4J3Pkmknj1j7j3nLRJ7K7L3K0mk5k6lK6L4J7j5l1j8J6L7L1
$$ plain form
6811 46 52 39 19 -5 -37 -65 -74 -61 -40 -20 -3 10 15 11 3 0 7 24 52 85 110 122 123 121 120 110 87 55 31 25 36 48 46 33 20 9 -11 -45 -77 -91 -81
6793 -81 -58 -34 -16 -7 -4 0 10 19 19 16 22 39 53 47 24 0 -5 15 54 90 105 99 85 75 70 68 65 55 33 6 -12 -13 4 28 47 56 58 64 72 65 30 -11 -25 -2 26
6773 26 29 10 -7 -19 -39 -71 -99 -113 -120 -128 -134 -128 -109 -93 -93 -113 -136 -139 -114 -79 -56 -42 -23 1 8 -19 -64 -98 -107 -98 -84 -71 -71 -89 -118 -139 -142 -138 -137 -136 -127 -110 -91
6755 -91 -73 -51 -26 -5 1 -15 -56 -113 -168 -202 -207 -195 -181 -165 -137 -98 -63 -46 -41 -41 -53 -76 -85 -51 14 63 64 31 -2 -28 -56 -79 -78 -50 -18 -2 4 14 30
6738 30 43 55 67 78 81 77 70 61 45 18 -20 -66 -111 -143 -159 -163 -160 -149 -131 -111 -91 -64 -23 25 71 104 117 107 77 40 12 -2 -10 -13 -7 1 -4 -37 -88 -138 -174
6720 -174 -195 -199 -182 -150 -124 -127 -162 -207 -234 -225 -183 -126 -76 -46 -38 -43 -50 -59 -72 -94 -115 -123 -111 -87 -66 -52 -39 -22 -10 -20 -54 -93 -111 -97 -63 -32 -16 -14 -16 -23
6703 -23 -43 -71 -85 -68 -34 -10 -7 -8 1 15 24 29 38 43 36 22 11 5 -4 -23 -41 -55 -71 -97 -130 -159 -169 -154 -115 -69 -42 -43 -56 -58 -44 -31 -29 -30 -17 13 47 65
6685 65 64 60 70 96 125 138 123 80 24 -20 -37 -31 -24 -33 -55 -81 -110 -140 -163 -168 -156 -138 -121 -109 -102 -97 -90 -79 -70 -71 -76 -76 -69 -58 -46 -31 -15 2 28 61 81 65
$$ packed form
6811D6Oj3k0k4l2k8rJ3K1K0J7J3NmqlPJ7K8L3K5J2Jkjj0k3l2k4oJ1J2kj3j3j1k0l4l2j4J0
6793h1K3K4J8RLMJ0R%lOJ7J4ok3k4nK0L9L6J5oj4j0nklj0k2k7j8jJ7K4J9RKOQpl5m1j4K3K8
6773B6Lj9j7j2k0l2k8j4pqoOJ9J6%k0k3lK5L5K3J4J9K4Pk7m5l4rRJ4J3%j8k9k1lMJJRJ7J9
6755i1J8K2K5K1Oj6m1n7n5l4nJ2J4J6K8L9L5J7N%j2k3rL4O5M9Jl3l3k6k8k3JK8L2J6OJ0J6
6738C0J3J2J2J1Lmprj6k7l8m6m5l2j6mLJ1J8K0K0K7M1M8M6L3J3j0l0l7k8j4qlOQnl3n1n0l6
6720a74k1mJ7L2K6ll5m5k7RM2N7N0L0Qnprj3k2k1qJ2K4K1J4J3J7J2j0l4l9j8J4L4L1J6Kkp
6703b3k0k8j4J7L4K4LjRJ4RNRNpj4j1orj9j8j4j6k6l3k9j0J5L9M6K7jj3kJ4J3KjJ3L0L4J8
6685F5jmJ0K6K9J3j5m3n6m4j7OPrk2k6k9l0k3nJ2J8J7J2PNPJ1Rjn%PJ1J2J5J6J7K6L3K0j6
$$ plain form
6666 65 23 -7 -7 7 11 3 0 0 -2 -10 -10 0 3 -14 -41 -51 -30 8 43 62 70 69 57 33 16 24 58 88 90 68 43 28 21 23 37 59 69 57 35 16 0 -19 -29
6648 -29 -17 9 31 40 46 58 63 43 6 -28 -49 -55 -53 -46 -39 -44 -61 -81 -83 -57 -12 24 26 0 -16 5 44 57 30 -5 -16 -1 19 32 31 14 -17 -49 -65 -65 -59 -56
6630 -56 -54 -51 -47 -34 -7 26 62 101 142 168 156 105 47 18 22 44 66 72 59 41 46 84 128 141 114 71 33 7 -12 -24 -27 -20 -6 13 34 48 54 60 72 90
6612 90 110 132 154 171 173 157 137 129 138 151 151 132 105 80 61 46 33 21 3 -21 -44 -48 -27 7 38 54 51 30 0 -24 -25 -4 16 20 14 15 18 6 -27 -58 -61
6594 -61 -40 -17 -4 -1 -3 -9 -15 -18 -26 -46 -74 -99 -117 -132 -145 -147 -139 -126 -106 -67 -19 3 -11 -41 -51 -36 -17 -5 2 8 11 17 32 48 54 50 53 72 98 115 113 94 71
6576 71 61 66 69 57 38 29 25 7 -24 -40 -30 -12 -9 -15 -14 -5 4 18 42 72 97 110 116 122 132 147 155 141 99 48 8 -18 -38 -48 -38 -16 -6 -19 -45 -69 -87
6558 -87 -106 -124 -137 -144 -149 -148 -135 -105 -68 -38 -26 -30 -41 -53 -63 -70 -73 -76 -82 -85 -80 -69 -63 -67 -79 -91 -95 -88 -74 -67 -76 -97 -115 -123 -129 -135 -133 -117 -95 -77 -64 -51 -39 -35 -41 -55
6538 -55 -75 -90 -83 -54 -30 -34 -54 -55 -28 0 8 1 -4 -15 -37 -59 -62 -43 -29 -41 -74 -103 -107 -83 -47 -17 -5 -7 -12 -14 -14 -18 -31 -60 -97 -127 -135 -120 -96 -83 -89 -104 -113
$$ packed form
6666F5m2l0%J4Mql%kq%J0Lj7k7j0K1L8L5J9Qjj2k4j7QL4L0Kk2k5j5pKJ4K2J0j2k2j9j6j9j0
6648b9J2K6K2ROJ2Nk0l7l4k1oKPPnj7k0kK6M5L6Kk6j6K1L9J3k7l5j1J5K0J3jj7l1l2j6%OL
6630e6KLMJ3K7L3L6L9M1K6j2n1n8k9MK2K2Oj3j8NL8M4J3k7m3l8k6j9j2lPJ4J9K1J4OOJ2J8
6612I0K0K2K2J7Kj6k0qRJ3%j9k7k5j9j5j3j2j8k4k3mK1L4L1J6lk1l0k4jK1K0MoJLj2l3l1l
6594f1K1K3J3Lkoolqk0k8k5j8j5j3kQJ3K0L9M8K2j4l0j0J5J9J2POLOJ5J6OmLJ9K6J7kj9k3
6576G1j0NLj2j9rmj8l1j6J0J8LoJRRJ4K4L0K5J3OOJ0J5Qj4m2n1m0k6k0j0J0K2J0j3k6k4j8
6558h7j9j8j3pnJJ3L0L7L0J2mj1j2j0pllolNJ1Omj2j2mPJ4Prk1j8qooKJ6K2J8J3J3J2Moj4
6538e5k0j5PK9K4mk0jK7K8Qpnj1k2k2lJ9J4j2l3k9mK4L6L0J2knk%mj3k9l7l0qJ5K4J3oj5r
$$ plain form
6519 -113 -107 -91 -77 -68 -63 -61 -63 -60 -43 -15 1 -10 -42 -68 -73 -66 -59 -54 -41 -19 5 30 52 73 88 93 88 69 38 4 -13 -7 10 21 21 27 48 67 64 42 18 2 -9
6501 -9 -13 6 48 85 85 50 11 -6 -5 -6 -14 -21 -9 18 40 38 16 2 10 29 38 38 45 58 56 25 -29 -89 -140 -166 -157 -112 -54 -5 28 48 48 20 -23 -57 -70 -73 -72 -57
6482 -57 -22 11 25 25 23 15 -10 -42 -50 -27 -1 4 -9 -30 -52 -63 -49 -11 25 33 20 9 2 -14 -45 -77 -100 -118 -132 -138 -139 -141 -146 -144 -132 -119 -111 -108 -104 -103 -104 -103 -101 -104 -116
6462 -116 -132 -149 -166 -172 -151 -104 -51 -15 -3 -9 -23 -37 -46 -60 -87 -119 -131 -111 -80 -69 -81 -96 -96 -82 -64 -52 -50 -56 -67 -85 -116 -150 -161 -130 -73 -21 9 20
6446 20 16 0 -25 -45 -57 -71 -90 -105 -104 -90 -74 -60 -45 -23 2 18 9 -21 -54 -68 -63 -54 -51 -50 -50 -52 -59 -60 -55 -57 -83 -128 -163 -161 -128 -85 -49 -23 -7 -8 -28 -51 -54
6427 -54 -38 -24 -21 -17 -2 10 6 -11 -27 -38 -52 -66 -69 -53 -19 23 63 85 83 72 67 71 72 67 62 57 45 28 18 25 46 71 87 86 68 49 45 57 71 82 96 114
6409 114 123 114 96 83 77 67 51 38 40 61 91 118 137 159 187 217 238 254 272 292 306 314 326 357 413 487 562 638 747 929 1199 1566 2081 2797
6394 2797 3616 4223 4283 3743 2890 2087 1509 1126 865 693 581 488 395 321 271 223 156 83 29 1 -10 -17 -27 -41 -54 -62 -68 -77 -82 -76 -67 -72 -88
$$ packed form
6519a13OJ6J4RNKkLJ7K8J6j1l2k6nPPNJ3K2K4K5K2K1J5Nnj9l1l4j7OJ7J1%OK1J9lk2k4j6j1
6501imJ9M2L7%l5l9j7JjqpJ2K7K2kk2j4QJ9R%PJ3kl1n4o0n1k6RM5N8M9L3K0%k8m3l4j3lJJ5
6482e7L5L3J4%kqk5l2qK3K6Nj3k1k2j1J4L8L6Qj3j1pj6l1l2k3j8j4ojknKJ2J3QLMJjJKlj2
6462a16j6j7j7oK1M7N3L6J2oj4j4rj4k7l2j2K0L1J1j2j5%J4J8J2Koj1j8l1l4j1L1N7N2L0J1
6446B0mj6k5k0j2j4j9j5JJ4J6J4J5K2K5J6rl0l3j4NRLJ%kpjNkk6m5l5KL3M3L6K6J6jk0k3l
6427e4J6J4LMJ5J2mj7j6j1j4j4lJ6L4M2M0K2kj1nMJnnnj2j7j0PK1K5J6jj8j9mJ2J4J1J4J8
6409A14Rrj8j3oj0j6j3KK1L0K7J9K2K8L0K1J6J8K0J4QJ2L1N6P4P5P6J09J82K70L67N15P16
6394B797Q19O07O0n40q53q03n78l83k61j72j12r3r3p4n0m8o7p3n4k8j1pj0j4j3qornORnj6
$$ plain form
6380 -88 -95 -88 -77 -68 -58 -52 -60 -76 -75 -48 -16 -3 -9 -30 -61 -90 -97 -78 -58 -64 -88 -104 -101 -90 -77 -64 -52 -50 -52 -49 -41 -36 -34 -20 2 18 12 -5 -15 -12 -2 6 8 -3 -30
6360 -30 -63 -87 -99 -108 -111 -98 -71 -46 -41 -47 -47 -35 -23 -19 -18 -20 -33 -59 -85 -99 -103 -109 -122 -134 -142 -141 -124 -93 -64 -54 -60 -60 -47 -35 -37 -47 -55 -60 -67 -78 -87 -88 -80 -65 -44 -15
6340 -15 12 21 1 -34 -55 -51 -36 -21 5 57 109 128 114 106 124 148 152 134 108 75 34 0 -11 -7 -6 -14 -17 -1 27 52 61 52 37 29 31 33 23 0 -23 -36 -39 -33 -16
6322 -16 17 61 98 103 76 39 11 -7 -22 -28 -11 19 41 42 32 24 19 19 27 36 33 20 17 35 56 63 56 43 25 6 -1 4 6 -3 -7 12 38 41 24 14 19 24 18 4 -10 -22
6302 -22 -25 -19 -14 -17 -5 42 108 158 193 242 316 398 492 613 760 924 1141 1463 1911 2506 3333 4440 5602 6304 6131 5165 3912 2842
6290 2842 2087 1556 1173 921 767 649 548 479 442 413 384 365 343 299 239 189 159 138 129 150 192 223 225 210 187 149 102 65 46 33 22 28
6276 28 62 114 169 219 257 270 264 257 256 249 236 244 277 307 310 301 301 304 295 293 318 369 439 547 706 903 1132 1433 1849 2395 3126 4127 5308 6237
6261 6237 6388 5642 4436 3339 2586 2085 1729 1512 1422 1395 1418 1546 1814 2222 2805 3559 4270 4555 4198 3383 2504 1817 1333
$$ packed form
6380h8pPJ1RJ0Oqj6JK7L2J3ok1l1k9pJ9K0ok4j6LJ1J3J3J2KkLQNKJ4K2J6oj7j0LJ0QKj1k7
6360c0l3k4j2rlJ3K7K5No%J2J2MJkj3k6k6j4moj3j2qJJ7L1K9J0o%J3J2kj0qnpj1rjQJ5K1K9
6340a5K7Rk0l5k1MJ5J5K6N2N2J9j4qJ8K4Mj8k6l3m1l4j1MJqlJ6K8K5Rrj5qKKj0k3k3j3lOJ7
6322a6L3M4L7Nk7l7k8j8j5oJ7L0K2Jj0qn%QRlj3lJ8K1Ppj3j8j9pNKrmJ9K6Lj7j0NNoj4j4j2
6302b2lONlJ2M7O6N0L5M9P4Q2R4J21J47J64K17L22M48N95Q27J107J162P02j73r66j253j070
6290B842p55n31l83k52j54j18j01o9l7k9k9j9k2m4o0n0l0k1rK1M2L1Kj5k3l8m7l7j9j3j1O
6276B8L4N2N5N0L8J3opjpj3QL3L0Lr%LrkK5N1P0J08J59J97K29L01M16N46P31J001J181R29
6261F237J51p46j206j097p53n01l56k17r0k7K3J28K68M08N83P54P11K85l57q15q79o87m84
$$ plain form
6251 1333 987 749 599 489 392 317 270 230 187 152 129 105 83 88 125 167 191 202 215 227 233 232 228 220 210 199 179 134 71 18 -1 12 38 56 55
6236 55 37 21 24 40 54 62 68 67 47 12 -15 -23 -22 -16 4 40 69 74 63 53 50 47 47 47 37 8 -23 -38 -37 -40 -49 -55 -55 -69 -107 -151 -175 -165 -132 -97 -72 -58 -47 -36
6217 -36 -24 -12 4 24 36 28 6 -8 1 27 42 27 -7 -37 -49 -57 -72 -85 -78 -48 -12 17 38 50 53 51 54 59 52 30 6 -4 -3 3 13 20 9 -26 -73 -106 -117
6199 -117 -116 -110 -101 -93 -88 -81 -62 -32 -1 19 33 46 55 58 49 25 -10 -45 -62 -60 -49 -40 -35 -28 -20 -7 11 29 28 0 -40 -71 -91 -117 -155 -189 -203 -203 -197 -176 -132 -71 -15
6180 -15 30 66 80 47 -24 -92 -118 -104 -79 -49 -6 39 62 55 37 28 24 16 11 16 21 17 9 11 16 8 -18 -47 -64 -76 -93 -115 -134 -144 -143 -129 -107 -81 -54 -26 -2 10
6162 10 9 5 4 2 -9 -31 -50 -58 -60 -67 -83 -94 -88 -63 -40 -40 -70 -116 -157 -179 -180 -159 -121 -77 -44 -33 -41 -54 -63 -71 -81 -97 -111 -117 -110 -95 -87 -101 -131 -151 -139 -98 -43
6144 -43 8 47 65 61 46 37 31 20 7 13 42 73 87 83 66 34 -8 -47 -68 -73 -68 -48 -15 11 12 0 -8 -6 -4 1 22 54 73 66 41 6 -33 -70 -85 -79 -73 -86 -106
6125 -106 -114 -103 -79 -48 -11 26 64 102 139 170 183 170 124 52 -13 -39 -19 17 41 55 71 84 84 72 59 45 26 6 0 2 2 -4 -8 -1 15 42 72 90 81
$$ packed form
6251A333l46k38j50j10r7p5m7m0m3l5k3k4k2NL7M2K4J1J3J2Ojmqj0j1k0m5o3n3j9J3K6J8j
6236E5j8j6LJ6J4QOjk0l5k7qJOK0L6K9Nj1j0ll%%j0k9l1j5Jlro%j4l8m4k4J0L3L5K5J4J1J1
6217c6J2J2J6K0J2qk2j4RK6J5j5l4l0j2qj5j3PL0L6K9K1J2LkLNpk2k4j0JOJ0Pj1l5m7l3j1
6199a17JORQNPJ9L0L1K0J4J3RLrk4l5l5j7KJ1RNPQJ3J8J8jk8m0l1k0k6l8l4j4%OK1M4O1N6
6180a5M5L6J4l3p1o8k6J4K5L0M3M5K3pj8rmqnNNmqKNqk6k9j7j2j7k2j9j0JJ4K2K6K7K8K4J2
6162A0jmjkj1k2j9qkpj6j1OK5K3%l0m6m1k2jK1L8M4L3J1qj3rqj0j6j4oPJ5Qj4l0k0J2M1N5
6144d3N1L9J8mj5roj1j3OK9L1J4mj7l2m2l9k1nNK0L3K6Jj2qKKNK1L2J9pk5l5l9l7j5OOj3k0
6125a06qJ1K4L1L7L7L8L8L7L1J3j3m6p2o5k6K0L6K4J4J6J3%j2j3j4j9k0oK%omPJ6K7L0J8r
$$ plain form
6108 81 51 25 22 33 39 36 35 42 50 45 22 -6 -19 -8 6 -5 -48 -96 -124 -134 -139 -141 -140 -141 -149 -155 -143 -118 -102 -106 -118 -116 -99 -74 -39 3 39 48 32 20 31 54 61 45
6089 45 18 -5 -28 -54 -76 -85 -78 -60 -40 -18 6 26 30 19 14 35 76 103 97 75 64 59 39 5 -10 7 37 50 50 55 64 59 37 16 2 -11 -32 -43 -31 -5
6072 -5 14 18 10 0 -4 0 12 16 2 -26 -57 -80 -89 -84 -71 -54 -30 3 38 54 44 28 30 44 44 18 -19 -49 -63 -64 -55 -40 -25 -22 -29 -38 -38 -25 -6 9 17 19 18 17 12 0
$$ packed form
6108H1l0k6lJ1OljPQnk3k8j3J1J4j1m3m8k8j0nkJjqoJ2K5J6mj2KJ7K5L5M2L6Rj6j2J1K3Pj6
6089D5k7k3k3k6k2rPJ8K0K2K4K0Mj1nK1M1K7ok2j1nk0l4j5J7L0J3%NRnk2k1j4j3k1j1J2K6
6072eJ9Mqj0mMJ2Mj4k8l1k3rNJ3J7K4L3L5J6j0j6KJ4%k6l7l0j4jRJ5J5Lpr%J3J9J5QKjjnj2
$$ [...]
-3131H
##END=	
##END=	
