##TITLE=	Dec16-2021.50.fid
TM-VI-212, CDCl3, Cp2ZrCl + Ph-pyr.

##JCAMP-DX=	6.0	$$ MestReNova 14.3.0-30573
##DATA TYPE=	LINK
##BLOCK_ID=	1
##BLOCKS=	2    
##ORIGIN=	Mestrelab Research S.L.
##OWNER=	hrzepa
##$MNOVA/LINK_BLOCK_TYPE=	ITEM	$$ NMR Spectrum
##$MNOVA/ITEM/POLYGON=	(XY..XY)
5321,5835
8722,5835
8722,8208
5321,8208
5321,5835
##$MNOVA/ITEM/Z=	0
##$MNOVA/ITEM/ANGLE=	0
##TITLE=	Dec16-2021.50.fid
##JCAMP-DX=	6.0	$$ MestReNova 14.3.0-30573
##BLOCK_ID=	2
##DATA TYPE=	MNOVA NMR VIEW DATA
##DATA CLASS=	MNOVA VIEW DATA
##$MNOVA/ITEM/ZOOM/X=	-4.005464102252559222,	16.005770000004368114
##$MNOVA/ITEM/ZOOM/Y=	-945.01046562194824219,	10388.2646484375
##END=	
##TITLE=	Dec16-2021.50.fid
##JCAMP-DX=	6.0	$$ MestReNova 14.3.0-30573
##BLOCK_ID=	3
##DATA TYPE=	NMR SPECTRUM
##DATA CLASS=	XYDATA
##NUMDIM=	1
##ORIGIN=	Bruker BioSpin GmbH
##OWNER=	nmr
##.OBSERVE FREQUENCY=	400.4124024600000098
##.OBSERVE NUCLEUS=	^1H
##.SOLVENT NAME=	CDCl3
##.PULSE SEQUENCE=	zg30
##LONGDATE=	2021/12/16 12:01:00.000
##.ACQUISITIONMODE=	SIMULTANEOUS (DQD)
##$ORIGINAL FORMAT=	Bruker XWIN-NMR
##$MNOVA/SCALES_VERSION=	9
##$PARAMETER FILE=	(acqus, ASCII, /private/var/folders/f6/rjf_tdyn2v98c5c0wvkgn4s80000gn/T/9A8o$0RaQbKBppDqJNsyXw/50/acqus, 0)
$$ ##TITLE= Parameter file, TOPSPIN		Version 3.2
$$ ##JCAMPDX= 5.0
$$ ##DATATYPE= Parameter Values
$$ ##NPOINTS= 11	$$ modification sequence number
$$ ##ORIGIN= Bruker BioSpin GmbH
$$ ##OWNER= nmr
$$ $$ 2021-12-16 12:01:46.606 +0000  nmr@CZC10666PP
$$ $$ /opt/topspin/data/agmb/nmr/Dec16-2021/50/acqus
$$ $$ process /opt/topspin3.2/prog/mod/shimcntl
$$ ##$ACQT0= -2.36344537815126
$$ ##$AMP= (0..31)
$$ 100 100 100 100 100 100 100 100 100 100 100 100 100 100 100 100 100 100
$$ 100 100 100 100 100 100 100 100 100 100 100 100 100 100
$$ ##$AMPCOIL= (0..19)
$$ 0 0 0 0 0 0 0 0 0 0 0 0 0 0 0 0 0 0 0 0
$$ ##$ANAVPT= -1
$$ ##$AQSEQ= 0
$$ ##$AQ_mod= 3
$$ ##$AUNM= <au_zg>
$$ ##$AUTOPOS= <52 >
$$ ##$BF1= 400.41
$$ ##$BF2= 400.41
$$ ##$BF3= 400.41
$$ ##$BF4= 400.41
$$ ##$BF5= 400.41
$$ ##$BF6= 400.41
$$ ##$BF7= 400.41
$$ ##$BF8= 400.41
$$ ##$BYTORDA= 0
$$ ##$CAGPARS= (0..11)
$$ 0 0 0 0 0 0 0 0 0 0 0 0
$$ ##$CFDGTYP= 0
$$ ##$CFRGTYP= 9
$$ ##$CHEMSTR= <none>
$$ ##$CNST= (0..63)
$$ 1 1 145 1 1 1 1 1 1 1 1 1 1 1 1 1 1 1 1 1 1 1 1 1 1 1 1 1 1 1 1 1 1 1 1
$$ 1 1 1 1 1 1 1 1 1 1 1 1 1 1 1 1 1 1 1 1 1 1 1 1 1 1 1 1 1
$$ ##$CPDPRG= (0..8)
$$ <> <> <> <> <mlev> <mlev> <mlev> <mlev> <mlev>
$$ ##$D= (0..63)
$$ 0 1 0 0 0 0 0 0 0 0.06 0 0 0 0 0 0 0.0002 0 0 0 0 0 0 0 0 0 0 0 0 0 0 0
$$ 0 0 0 0 0 0 0 0 0 0 0 0 0 0 0 0 0 0 0 0 0 0 0 0 0 0 0 0 0 0 0 0
$$ ##$DATE= 1639656105
$$ ##$DE= 6.5
$$ ##$DECBNUC= <off>
$$ ##$DECIM= 2496
$$ ##$DECNUC= <off>
$$ ##$DECSTAT= 4
$$ ##$DIGMOD= 1
$$ ##$DIGTYP= 12
$$ ##$DQDMODE= 0
$$ ##$DR= 22
$$ ##$DS= 2
$$ ##$DSPFIRM= 0
$$ ##$DSPFVS= 20
$$ ##$DTYPA= 0
$$ ##$EXP= <proton>
$$ ##$F1LIST= <111111111111111>
$$ ##$F2LIST= <222222222222222>
$$ ##$F3LIST= <333333333333333>
$$ ##$FCUCHAN= (0..9)
$$ 0 2 0 0 0 0 0 0 0 0
$$ ##$FL1= 90
$$ ##$FL2= 90
$$ [...]
$$ 90 74 58 42 26 10 0 0
$$ ##$Sgu3PowerLevels= (0..7)
$$ 0 0 0 0 0 0 0 0
$$ ##$Sgu4PowerLevels= (0..7)
$$ 0 0 0 0 0 0 0 0
$$ ##$Sgu5PowerLevels= (0..7)
$$ 0 0 0 0 0 0 0 0
$$ ##$Sgu6PowerLevels= (0..7)
$$ 0 0 0 0 0 0 0 0
$$ ##$Sgu7PowerLevels= (0..7)
$$ 0 0 0 0 0 0 0 0
$$ ##$Sgu8PowerLevels= (0..7)
$$ 0 0 0 0 0 0 0 0
$$ ##$SguType= 3
$$ ##$ShimPowMaxUA= (0..63)
$$ 130000 130000 130000 130000 130000 130000 130000 130000 130000 130000 130000
$$ 130000 130000 130000 130000 130000 130000 130000 130000 130000 0 0 0 0
$$ 0 0 0 0 0 0 0 0 0 0 0 0 0 0 0 0 0 0 0 0 0 0 0 0 0 0 0 0 0 0 0 0 0 0 0 0
$$ 0 0 0 0
$$ ##$ShimPowMaxUC= (0..63)
$$ 130000 130000 130000 130000 130000 130000 130000 130000 130000 130000 130000
$$ 130000 130000 130000 130000 130000 130000 130000 130000 130000 0 0 0 0
$$ 0 0 0 0 0 0 0 0 0 0 0 0 0 0 0 0 0 0 0 0 0 0 0 0 0 0 0 0 0 0 0 0 0 0 0 0
$$ 0 0 0 0
$$ ##$ShimPowMaxUG= (0..63)
$$ 524287 524287 524287 524287 524287 524287 524287 524287 524287 524287 524287
$$ 524287 524287 524287 524287 524287 524287 524287 524287 524287 0 0 0 0
$$ 0 0 0 0 0 0 0 0 0 0 0 0 0 0 0 0 0 0 0 0 0 0 0 0 0 0 0 0 0 0 0 0 0 0 0 0
$$ 0 0 0 0
$$ ##$ShimPowRcbType= 3
$$ ##$ShimPowRes= (0..63)
$$ 1e-20 1e-20 1e-20 1e-20 1e-20 1e-20 1e-20 1e-20 1e-20 1e-20 1e-20 1e-20
$$ 1e-20 1e-20 1e-20 1e-20 1e-20 1e-20 1e-20 1e-20 0 0 0 0 0 0 0 0 0 0 0 0
$$ 0 0 0 0 0 0 0 0 0 0 0 0 0 0 0 0 0 0 0 0 0 0 0 0 0 0 0 0 0 0 0 0
$$ ##$ShimPowRng0= (0..63)
$$ 1 1 1 1 1 1 1 1 1 1 1 1 1 1 1 1 1 1 1 1 0 0 0 0 0 0 0 0 0 0 0 0 0 0 0 0
$$ 0 0 0 0 0 0 0 0 0 0 0 0 0 0 0 0 0 0 0 0 0 0 0 0 0 0 0 0
$$ ##$ShimPowRng1= (0..63)
$$ 1 1 1 1 1 1 1 1 1 1 1 1 1 1 1 1 1 1 1 1 0 0 0 0 0 0 0 0 0 0 0 0 0 0 0 0
$$ 0 0 0 0 0 0 0 0 0 0 0 0 0 0 0 0 0 0 0 0 0 0 0 0 0 0 0 0
$$ ##$ShimPowRng2= (0..63)
$$ 1 1 1 1 1 1 1 1 1 1 1 1 1 1 1 1 1 1 1 1 0 0 0 0 0 0 0 0 0 0 0 0 0 0 0 0
$$ 0 0 0 0 0 0 0 0 0 0 0 0 0 0 0 0 0 0 0 0 0 0 0 0 0 0 0 0
$$ ##$ShimPowRng3= (0..63)
$$ 1 1 1 1 1 1 1 1 1 1 1 1 1 1 1 1 1 1 1 1 0 0 0 0 0 0 0 0 0 0 0 0 0 0 0 0
$$ 0 0 0 0 0 0 0 0 0 0 0 0 0 0 0 0 0 0 0 0 0 0 0 0 0 0 0 0
$$ ##$ShimSysFunc= (0..63)
$$ 1 2 3 4 5 7 9 11 15 16 8 10 12 14 6 17 13 18 19 20 0 0 0 0 0 0 0 0 0 0
$$ 0 0 0 0 0 0 0 0 0 0 0 0 0 0 0 0 0 0 0 0 0 0 0 0 0 0 0 0 0 0 0 0 0 0
$$ ##$ShimSysMatrix= 0
$$ ##$ShimSysType= 1
$$ ##$TFXNUM= 0
$$ ##$TRIPLO2= 0
$$ ##$VTU= 2
$$ ##$VTUETH= <149.236.99.20>
$$ ##$VTUTY= <no>
$$ ##$WBREFAM= (0..15)
$$ 135 116 100 100 100 100 100 100 100 100 100 100 100 100 100 100
$$ ##$WBREFLM= (0..15)
$$ 0 0 0 0 0 0 0 0 0 0 0 0 0 0 0 0
$$ ##$WBREFPH= (0..15)
$$ 71.66 -68.25 0 0 0 0 0 0 0 0 0 0 0 0 0 0
$$ ##$WBSGU= (0..15)
$$ 0 0 0 0 0 0 0 0 0 0 0 0 0 0 0 0
$$ ##$XFAC= 2
$$ ##END=
$$ 
##$DECIM=	2496
##$DSPFVS=	20
##XUNITS=	HZ
##YUNITS=	ARBITRARY UNITS
##FIRSTX=	6408.8703656999996383
##LASTX=	-1603.8278811825093726
##DELTAX=	-0.12226593800080123864
##XFACTOR=	1
##YFACTOR=	0.0091966821651439586982
##FIRSTY=	8.1653594970703125
##MINY=	-0.6227703094482421875
##MAXY=	9443.876953125
##NPOINTS=	65536
##XYDATA=	(X++(Y..Y))
$$ [...]
4713 161 146 141 150 165 174 170 159 146 135 124 120 121 119 112 110 130 169 205 219 213 202 196 196 206 222 235 231 210 189 182 187 189 184 178 179 187 193 195 193 188 181 174 169 170 175 180 178 173 172 180 186 179 163
4706 163 160 182 219 249 264 273 281 288 290 288 283 279 275 266 247 222 208 217 240 250 230 194 168 164 170 175 177 183 191 192 185 177 175 177 173 164 160 173 196 216 222 212 190 162 142 142 159 174
4700 174 167 143 118 110 121 142 162 178 188 195 194 177 143 108 89 93 108 120 123 126 137 159 189 213 220 209 192 182 174 157 126 96 82 86 95 102 104 105 104 99 95 100 118 140
4695 140 145 127 99 86 98 124 146 162 179 200 222 242 258 264 259 249 249 263 279 287 289 289 285 267 234 194 165 153 153 155 150 145 151 169 183 185 180 181 185 173 142 111 97
4690 97 101 113 126 142 156 158 148 138 140 156 177 195 206 209 199 179 155 140 138 146 156 163 166 162 147 127 113 115 130 148 161 164 157 143 125 113 110 111 107 94 83 87 104
4685 104 120 127 133 147 164 175 185 210 246 279 293 296 297 291 273 247 224 211 202 190 178 170 172 182 193 193 182 167 157 149 139 129 129 138 148 147 133 115 101 98 106 118
4679 118 126 127 121 118 129 152 172 172 155 144 156 180 192 186 176 179 202 233 256 252 221 184 158 144 133 131 149 183 210 217 212 208 203 193 190 206 231 242 229 206 192 184
4674 184 171 150 129 119 119 119 112 104 102 105 111 119 131 149 174 203 231 244 235 213 201 206 214 205 177 148 130 125 128 136 141 135 120 103 89 80 78 87 102 114 113 105 97 98 111 135 161
4669 161 180 188 186 179 173 173 179 182 175 160 146 134 125 119 122 127 121 98 73 63 72 91 116 149 189 224 245 251 246 233 214 195 184 182 183 175 162 151 147 143 132 123 132 155 171 163 140
4663 140 125 129 144 159 168 169 165 162 165 177 196 216 225 212 177 139 118 117 126 139 154 165 157 130 106 104 124 147 160 164 164 159 148 137 135 147 171 195 204 196 190 200 216 215
4657 215 191 158 136 129 130 126 112 87 66 65 96 146 196 230 238 221 188 152 122 93 66 51 51 60 67 78 106 146 176 183 175 172 183 205 226 240 248 253 256 253 242 228
4652 228 219 211 198 180 168 169 175 178 177 176 173 166 162 169 185 200 205 200 187 165 142 129 132 146 164 181 192 200 207 214 212 192 161 136 127 128 132 142 158 170 168 158 154 158 166 176 192
4647 192 210 218 210 199 200 214 222 212 191 175 168 162 149 135 131 146 171 190 189 170 146 134 138 150 162 175 193 209 215 211 206 206 201 183 157 136 127 123 120 121 133 157 188 215
4641 215 231 238 248 272 299 310 296 274 262 265 270 267 259 254 254 252 235 204 173 155 154 160 160 153 142 129 112 96 86 83 83 87 99 116 133 142 147 150 150 140 121 103 96 101 114
4636 114 131 145 149 142 131 126 129 138 149 163 179 192 198 197 197 198 199 200 202 198 176 139 109 109 139 180 207 211 200 186 182 189 199 203 200 195 185 165 144 140 158 183 195 192 183 170
4630 170 150 133 137 160 172 156 126 106 106 115 126 141 158 170 172 171 173 179 192 214 233 234 211 179 154 135 119 114 129 153 167 162 154 156 166 175 183 195 211 223 231 238 245
4625 245 243 228 210 199 203 222 253 288 310 305 279 249 228 210 188 168 163 173 185 189 193 204 218 220 209 200 200 206 211 218 232 246 248 237 224 219 222 223 221 217 212 205 195 180 160
4619 160 145 144 158 174 181 181 182 184 178 166 161 167 179 191 202 209 203 179 147 125 121 132 148 159 156 138 118 112 124 145 172 201 222 219 200 183 179 176 162 144 137 139 135 126 120
4614 120 125 139 161 188 211 220 218 220 224 217 193 169 163 170 178 183 192 204 211 208 202 193 179 159 144 140 142 138 129 122 127 135 134 117 98 95 106 118 127 143 173 204 216 210 197 185 173 162
4608 162 154 146 129 114 117 145 175 188 183 177 178 186 199 212 217 207 191 189 207 230 241 239 236 233 221 199 183 191 215 234 237 233 233 230 214 189 168 155 141 129 133 154 181 201
4603 201 217 233 244 243 242 252 269 275 265 251 242 227 193 149 117 113 132 160 182 195 206 221 240 255 259 253 239 219 192 163 145 145 160 180 191 187 172 157 150 150
4598 150 149 142 131 121 117 124 144 170 189 192 180 161 143 135 144 165 184 190 186 180 171 154 130 110 99 89 75 64 70 85 92 86 78 83 99 112 114 112 118 133 150 158 155 145 139 143
4592 143 158 179 203 232 265 299 319 312 276 230 197 191 204 215 213 198 183 179 184 187 176 151 120 93 80 85 104 125 139 147 154 159 148 118 78 45 24 12 14 34
4587 34 68 103 129 147 157 157 151 153 169 188 194 188 186 191 191 175 153 138 135 141 155 174 188 190 187 191 207 224 224 204 173 144 127 123 125 121 111 106 118 146 175 197 209 215 219
4582 219 227 237 245 250 254 258 254 237 222 227 256 288 302 294 272 243 215 200 204 221 240 252 253 244 231 232 252 281 299 302 297 286 268 250 243 250 257 252 237 223 217 222 239 259 268
4576 268 260 247 241 244 250 261 278 293 294 273 237 200 175 166 172 190 215 244 274 297 309 308 297 276 252 230 219 219 222 224 220 209 194 181 176 176 182 198 220 236 233 219 213
4571 213 229 260 287 297 287 269 261 273 293 299 281 255 237 235 239 241 241 244 251 258 260 256 253 256 258 245 217 188 170 165 162 157 152 152 156 157 150 135 122 116 111 100 87 87 108 141 166
4565 166 177 182 193 204 197 169 140 137 165 204 232 239 230 206 175 155 161 184 199 195 186 186 193 197 194 194 198 195 179 156 134 113 93 78 74 83 99 116 127 134 145 171 206 238
4560 238 256 259 250 230 205 182 168 162 158 155 151 142 125 104 94 103 125 148 166 179 190 198 202 204 202 196 184 169 152 133 114 111 134 174 208 226 236 245 242 219 188 169 168
4554 168 167 158 149 146 145 143 145 153 159 156 150 153 164 174 181 194 219 244 251 237 217 209 206 194 174 161 164 163 136 91 56 45 43 38 40 64 101 128 140 147 151 142 118 97 94 99 96 84
4549 84 79 90 109 121 119 105 90 85 95 117 143 166 180 186 192 199 205 207 210 223 244 250 229 189 154 140 142 151 160 166 165 160 154 149 143 131 119 114 116 116 109 98 90 90 95 104 116 132 148
4543 148 157 155 149 150 155 155 149 152 177 214 237 231 207 182 168 173 201 241 268 259 222 182 151 130 123 142 183 222 239 232 215 195 174 165 176 197 206 195 179 174 180 186 189 192 192
4537 192 188 186 192 200 191 162 136 142 181 228 256 261 255 244 228 211 207 220 240 251 252 249 241 227 213 206 206 205 202 201 196 175 140 104 81 68 57 51 53 64 80 106 142 177 194
4532 194 186 159 134 127 138 152 152 144 151 189 238 267 263 243 222 205 190 179 174 173 172 168 163 158 159 171 189 204 210 215 231 255 273 276 268 263 265 262 249 232 227 231 231 213 191 184 195
4526 195 208 211 205 201 200 201 202 203 201 198 201 212 229 239 240 233 228 231 238 246 256 271 292 306 299 271 237 215 206 205 209 212 206 189 167 152 146 142 130 112 99 107 139 180 210 221 222 231
4520 231 250 270 277 264 238 215 208 218 238 256 262 249 221 196 192 206 218 218 219 233 248 247 230 210 198 192 187 183 180 174 166 162 162 159 154 155 162 167 163 156 155 164 176 187 193 193 187 173
4514 173 151 127 115 117 128 140 157 184 213 224 220 225 254 287 296 276 246 225 212 200 190 187 194 210 229 239 232 213 193 173 145 105 72 66 91 133 173 194 191
4509 191 174 165 179 205 221 213 190 168 149 129 115 118 136 153 155 143 129 120 117 125 151 188 215 223 220 219 221 223 225 233 246 258 262 257 251 250 260 279 296 302 300 302 313 323 324 317
4504 317 315 325 342 348 330 290 252 230 214 186 145 115 109 122 132 134 134 136 139 149 172 201 211 188 145 109 91 85 81 82 92 106 114 113 113 115 114 105 99 109 134 160 172
4498 172 169 156 139 123 119 132 154 173 184 194 209 229 253 281 308 323 317 294 275 274 284 282 254 210 169 143 134 140 156 172 178 170 154 141 138 146 161 177 191 200 207
4493 207 203 180 144 116 114 129 148 165 184 201 209 206 202 197 185 161 142 142 160 182 197 199 185 157 126 107 104 110 117 126 139 151 155 150 144 146 160 185 209 222 214 189 165
4488 165 157 163 165 153 137 131 140 153 165 174 180 179 171 162 159 162 165 161 148 126 98 77 76 103 155 218 268 288 286 279 275 262 233 201 185 185 189 194 207 224 231 222 206 201 210 220 217 191
4482 191 151 116 105 115 136 159 184 210 229 243 255 268 272 266 263 272 283 278 255 229 209 194 182 173 172 173 168 154 133 118 120 138 165 195 225 253 270 279 289 304
4477 304 313 305 291 282 273 251 226 218 228 229 209 188 188 199 197 177 156 144 135 124 121 131 153 175 193 199 189 169 155 155 163 162 154 147 148 157 172 199 235 267 279 270 257 254 258
4472 258 256 246 234 219 200 179 173 189 215 235 246 256 266 270 265 257 250 241 229 216 203 185 164 150 147 152 154 153 157 172 189 194 183 163 148 140 136 136 148 176 201 199 168
4467 168 134 128 147 165 163 147 137 143 160 179 195 207 216 224 232 234 224 205 188 181 180 173 154 135 129 136 142 140 138 146 161 169 164 154 152 164 184 204 217 220 217 216 218 220 221 222 220 211 197
4461 197 186 178 166 149 137 143 161 178 186 193 206 220 228 226 215 193 160 121 90 74 76 92 119 148 168 174 168 158 148 142 140 141 142 143 144 145 146 149 160 174 181 175 165 161 160 151
4455 151 135 129 146 178 204 216 218 220 222 221 213 201 189 184 183 178 167 159 163 172 179 188 204 218 218 209 204 201 184 151 127 132 161 186 194 183 158 127 106 101 105 105 106 122 154 181 188
4449 188 178 164 153 143 129 112 99 90 84 78 79 95 129 168 201 232 267 302 325 332 329 317 294 269 256 257 258 255 259 273 276 252 209 172 151 142 143 148 151 148 152 178 215
4444 215 238 232 211 190 172 155 144 143 147 153 160 170 173 161 140 126 126 136 150 165 179 189 189 175 152 132 128 143 172 203 228 236 227 214 224 262 306 327 319 300 281
4439 281 257 226 193 168 155 142 119 84 49 37 60 109 162 208 243 270 286 287 274 249 211 164 125 108 116 143 179 210 228 232 234 246 263 270 254 222 192
4435 192 185 200 221 229 221 210 211 222 234 238 234 221 204 191 191 204 216 215 204 192 181 168 148 126 108 93 77 65 61 70 85 100 116 136 155 167 173 182 196 207 207
4430 207 197 181 157 125 94 78 84 103 121 126 118 104 101 120 157 191 211 220 224 223 212 196 184 181 181 184 193 215 248 284 319 349 369 374 363 343 322 304 289 270 246
4424 246 219 200 195 205 223 244 263 270 257 226 193 173 167 173 189 211 224 214 186 166 169 187 205 217 228 241 253 266 277 283 279 269 259 250 237 223 220 230 247
4420 247 259 268 279 284 274 253 239 244 265 287 301 303 296 286 280 275 262 233 201 186 194 209 219 224 228 228 219 205 200 207 222 233 238 235 222 206 198 206 227 250 265 260 233 197
4414 197 176 183 207 229 241 250 253 242 215 187 179 194 221 247 265 274 271 250 213 174 156 164 183 188 179 169 174 189 208 225 235 231 214 194 188 197 210 216 218 226 246 271 287
4409 287 288 280 275 276 274 260 233 202 177 163 159 155 146 141 147 162 174 182 195 215 234 241 236 224 206 180 155 137 125 113 101 98 107 126 151 179 200 204 192 173 155 143 139
4404 139 146 158 166 166 162 162 167 173 182 195 211 223 223 206 177 151 137 136 137 133 130 132 144 162 178 185 179 173 184 213 243 255 243 223 212 216 229 243 254 261 265 261 251 239 221
4398 221 195 161 133 119 114 109 111 129 157 173 167 151 144 149 159 165 164 159 154 151 144 131 123 134 165 195 206 204 205 212 216 212 210 216 223 223 213 201 193 195 207 219 221 208 187 174 177 192
4392 192 206 210 206 196 181 162 151 161 186 202 192 167 149 148 155 157 153 146 139 135 139 152 168 183 198 210 215 207 186 164 153 159 176 193 201 201 200 200 198 194 189 188 193 202 209 207 195
4387 195 178 161 145 139 149 174 198 204 192 178 170 165 158 145 131 120 114 113 111 108 111 127 145 152 143 131 126 131 147 173 200 211 200 179 163 156 157 164 177 190 198 204 209 210 205 202
4381 202 206 219 231 235 230 218 210 213 224 231 231 235 252 277 297 302 295 280 265 255 250 245 242 247 260 271 268 259 253 249 239 224 208 194 181 172 169 169 168 174 197 227 244 242 237 242 246 236
4375 236 216 197 181 164 142 124 119 128 149 168 170 160 156 172 197 208 200 184 175 177 193 226 270 302 300 262 211 175 167 181 204 219 219 208 199 207 223 227 211 189 180 185
4370 185 193 203 219 233 230 209 189 187 198 202 191 173 162 169 190 211 218 207 192 182 178 175 179 188 192 187 184 196 209 205 176 137 107 88 81 88 105 124 137 143 142 138 141 160 189
4365 189 213 222 223 227 235 241 242 239 231 216 199 194 204 225 245 257 259 252 244 242 250 263 271 267 254 244 251 273 294 297 281 258 241 227 202 165 133 125 145 177 205 224 234 233 218
4359 218 195 179 176 185 201 212 211 194 168 145 128 114 109 122 152 179 184 172 166 175 190 194 187 180 181 189 191 184 169 151 136 126 123 127 137 149 158 158 141 111 82 72 77 87
4354 87 94 106 127 149 162 168 175 185 195 202 212 229 254 281 304 311 297 272 252 244 243 244 251 261 257 227 183 146 123 107 91 77 67 57 46 45 57 74 85 88 87 83
4349 83 80 84 99 116 120 107 84 59 37 30 43 65 75 64 47 42 47 55 65 88 121 154 175 184 183 177 175 180 190 199 211 228 239 230 207 193 198 212 222 226 226 215 194 174
4343 174 173 190 207 214 213 212 208 198 185 171 154 132 115 111 123 137 143 145 161 194 225 231 214 197 198 210 217 214 208 205 203 201 197 188 170 144 121 106 98 96 100 102 94 80 77 93 120
4337 120 139 144 141 137 132 127 123 124 126 128 130 129 128 127 131 139 156 184 218 246 258 257 254 251 249 251 257 258 245 223 209 206 204 194 186 187 189 178 159 150 152 154 151 156 173 190 194 187 180 175 170 168 171 169 151
4331 151 127 114 116 118 115 118 133 153 164 164 162 164 170 182 199 209 203 186 176 185 204 219 226 225 220 209 196 185 177 174 178 196 224 252 267 265 248 226 212 211 223 237 243 239 229
4325 229 218 206 192 178 169 169 173 170 156 133 113 100 96 101 119 149 180 198 196 188 189 205 225 238 238 224 200 174 155 143 135 126 119 120 132 150 170 189 209 229 247 257
4320 257 265 277 288 279 246 211 193 186 172 155 156 174 184 170 153 154 163 162 156 169 198 216 208 194 196 217 243 267 287 302 312 320 330 336 338 336 328 310 282 255 231 201
4315 201 161 126 114 122 132 134 130 126 129 142 162 176 178 173 172 178 181 176 171 170 175 180 183 183 178 173 173 180 192 205 218 225 225 221 217 214 211 210 211 210 205 200 199 201 202 203 213 228 234 231 231 242 255 252 236
4308 236 222 218 218 212 205 201 203 205 205 200 194 186 179 178 186 204 223 230 223 213 211 218 227 235 252 279 303 308 290 259 224 193 172 166 175 188 193 188 178 168 162 160 165 177 184 173 141 100 72
4302 72 68 87 110 116 101 80 73 90 121 157 191 223 244 244 223 196 179 176 185 196 201 200 194 186 181 186 204 222 224 208 192 193 210 226 233 236 243 254 262 263 257 248 248 260 275 279 265
4296 265 241 220 208 209 226 250 263 256 240 233 239 246 242 230 215 200 188 177 162 135 100 73 68 78 89 102 127 164 196 207 204 207 223 246 266 281 285 271 246 227
4292 227 222 216 197 169 151 149 152 155 165 183 198 204 206 211 214 205 187 170 163 160 154 144 134 127 128 136 149 162 174 189 208 225 232 234 240 259 280 286 271 246 227 214 201 182 165
4286 165 158 160 164 164 162 160 157 149 134 118 108 112 131 159 181 180 151 101 53 25 20 32 56 87 113 118 99 78 80 109 145 164 158 136 115 102 96 96 101 109 113 110 109 115 124 126 123
4280 123 129 152 184 213 233 243 241 230 224 228 237 239 228 210 185 158 137 133 140 145 144 145 150 151 146 142 151 172 196 214 228 246 269 293 307 304 286 262 243 237 244 253 246 221 195
4275 195 183 182 178 167 161 164 167 165 158 149 139 139 162 201 236 249 251 261 283 300 302 291 273 256 248 252 261 261 242 209 176 153 142 140 141 141 141 138 128 117 114 123 137 151 166 184
4269 184 200 213 225 234 233 213 185 164 155 155 159 161 150 127 108 113 137 159 163 157 154 162 178 198 211 213 210 209 208 204 206 225 249 250 222 190 178 176 160 136 126 141 172 203
4264 203 228 237 229 213 205 208 210 207 208 224 247 261 253 226 200 192 204 221 224 210 190 177 175 181 191 201 212 225 236 233 212 186 168 160 155 153 160 174 182 183 182 177 153 115 94
4258 94 111 153 186 200 207 217 222 219 223 238 250 243 219 197 187 184 180 174 168 164 161 162 165 169 175 183 188 192 203 231 267 291 288 273 264 266 265 252 235 224 222 226 235 245 248 246 249 259 260 238
4252 238 204 184 189 202 212 221 236 247 243 235 243 265 281 276 263 260 271 285 296 305 308 300 280 264 262 266 264 248 231 221 216 212 208 204 194 174 160 168 200 229 233 216 197 189 189
4247 189 192 199 211 222 226 223 218 217 215 210 201 194 193 196 195 194 199 209 215 214 216 227 239 238 225 211 205 209 220 235 246 246 236 227 221 213 202 197 204 213 211 202 202 213 226 230 230 240 260 276 274 255
4240 255 223 185 149 126 123 134 146 153 162 183 208 225 234 239 238 217 174 121 82 70 87 124 163 190 205 218 234 242 231 205 182 171 170 166 159 152 157 175 196 209 210
4235 210 209 215 229 245 265 286 300 291 261 227 206 195 182 166 158 161 172 187 207 230 243 232 203 176 164 168 179 200 230 252 250 221 187 169 173 187 203 221 239
4231 239 253 255 239 209 186 186 201 209 203 200 222 263 296 304 291 267 240 215 200 193 186 174 166 166 164 151 134 127 135 152 170 189 203 203 192 183 182 187 193 197 197 192 191 207 236 255
4225 255 248 230 230 250 264 255 235 225 226 220 203 186 182 192 211 233 244 237 216 200 194 192 183 172 173 185 196 193 183 178 183 192 200 203 203 198 183 156 127 110 111 123 135 143 148 150
4219 150 149 146 149 163 183 197 196 184 179 192 212 223 218 210 209 210 207 208 226 255 276 280 274 267 256 239 220 209 211 223 237 239 222 189 156 137 133 142 156 166 162 149 144 156 174
4214 174 185 193 208 228 237 229 217 211 211 211 208 202 195 189 191 199 206 204 198 195 195 194 193 198 205 196 163 117 82 72 88 115 139 152 154 153 161 183 213 241 258 259 252 245 243 244 237 220 199 182
4208 182 167 147 124 110 119 149 181 201 207 210 218 231 238 233 217 200 188 185 191 201 205 200 188 183 188 194 192 189 196 215 232 235 225 207 184 161 148 146 150 151 149 156 174 192 200 198 193
4202 193 186 177 171 178 194 203 193 171 154 151 154 155 156 159 162 164 168 183 212 245 271 284 280 268 261 271 290 297 280 252 236 241 255 260 249 227 205 194 199 213 218 205 177 150 141
4196 141 152 174 190 194 196 214 252 290 300 274 232 206 212 237 258 266 270 279 292 303 310 313 309 298 287 282 283 279 267 258 263 280 294 295 280 253 220 186 154 125 99 80
4191 80 75 83 89 85 81 93 124 155 165 150 125 110 116 139 161 172 172 172 170 160 142 126 123 128 132 138 155 183 205 207 195 179 171 176 196 221 237 237 226 211 196 188 197 222 244
4186 244 247 237 231 239 250 254 251 246 238 225 212 201 196 194 198 206 220 241 269 296 310 313 312 308 294 270 242 223 209 199 197 206 220 225 218 207 200 201 210 223 230 224 207 196 196 192 172
4180 172 139 114 106 109 106 95 82 72 67 66 77 105 144 181 204 214 218 224 233 239 235 222 214 222 237 242 227 201 181 173 175 185 201 216 222 221 218 215 206 188 169 157 160 176 192
4175 192 190 166 135 114 98 72 44 38 64 98 113 113 120 140 157 159 154 152 158 175 209 253 286 287 261 231 218 224 232 227 202 165 132 119 132 157 179 191 198 209 222
4170 222 231 230 220 207 197 195 200 205 204 192 175 158 147 148 164 187 204 213 222 234 243 239 221 203 191 184 170 146 120 105 107 119 130 136 142 153 168 178 184 186 184 181 182 188 194 196
4164 196 197 210 234 256 263 256 239 217 190 164 144 138 145 160 175 179 177 177 184 194 195 188 180 173 161 133 98 82 107 163 214 232 225 215 210 200 182 169 167 166 159 158 172 187
4159 187 186 172 164 167 171 176 191 219 245 259 264 271 285 301 314 319 315 304 294 287 282 278 276 278 279 275 266 258 259 270 288 300 300 288 267 236 195 155 131 130 145 169 197 215 207 175
4153 175 140 124 129 145 163 182 197 202 199 194 190 191 200 214 225 224 214 205 202 200 192 182 178 188 210 232 237 216 191 189 213 239 240 220 198 185 178 173 178 197 228 261 285 295
4148 295 285 260 238 231 233 234 235 248 268 279 268 246 232 234 243 251 256 256 248 236 222 209 197 191 192 191 180 162 153 158 171 186 208 232 249 253 253 254 249 237 230 236 252 266 280
4142 280 298 315 318 309 297 284 261 227 202 200 213 222 223 229 245 264 276 283 292 307 321 319 292 248 202 171 154 144 132 127 143 179 217 237 241 241 242 238 233 237 252 264 260
4137 260 252 251 253 248 234 219 201 177 158 166 199 235 256 268 283 295 291 267 233 200 181 185 207 230 243 252 265 283 299 308 307 293 267 242 228 223 221 220 226 242 263 276
4132 276 275 258 237 220 211 206 210 230 262 286 290 281 272 263 252 247 259 282 292 281 266 268 282 286 265 227 192 172 163 155 149 157 179 204 223 235 239 226 192 155 138 143 153
4126 153 159 164 174 185 195 206 220 233 242 246 245 237 224 210 194 172 151 143 146 146 144 153 176 197 199 187 169 142 110 89 98 134 174 203 216 217 208 202 209 230 256 281 294
4121 294 286 262 242 246 263 267 254 245 256 275 282 272 256 243 234 231 233 230 221 209 199 185 163 141 135 147 164 176 184 196 212 220 218 214 221 234 242 241 238 241 239 217 178 145 137 147
4116 147 151 140 125 126 147 183 225 268 302 317 310 289 266 249 236 226 214 199 182 168 163 168 172 170 165 167 177 188 194 196 201 215 236 260 276 275 256 231 218 228 253
4111 253 279 290 282 261 239 223 211 204 203 211 222 230 229 220 208 196 190 191 198 200 196 192 196 203 205 198 192 190 187 181 179 192 217 241 253 256 256 253 243 223 198 175 159 158 179 218 261 291
4105 291 296 278 252 232 222 217 219 228 242 251 249 238 223 204 186 177 187 210 228 233 231 231 238 249 263 276 286 290 285 272 256 244 237 227 202 169 146 146 167 200 240 279
4100 279 309 322 326 327 325 319 312 313 322 332 340 344 332 299 262 247 260 274 266 243 226 220 213 200 188 187 197 208 211 200 181 170 175 188 193 186 177 175 172 159 142 134 141 155 163 159 151
4094 151 149 159 173 176 166 151 137 121 104 92 91 90 81 71 79 110 149 180 196 199 192 188 198 215 222 214 214 236 265 273 260 244 239 243 250 263 280 289 278 251 222 201 191
4089 191 190 198 214 238 265 286 292 282 262 235 202 169 149 151 169 184 183 164 140 130 141 162 177 180 180 187 204 226 243 244 225 191 163 156 171 198 220 225 211 193
4084 193 193 217 243 246 222 196 190 206 224 226 215 208 215 226 224 206 188 186 201 225 246 251 236 207 184 177 178 178 177 180 184 190 202 224 240 236 219 205 201 198 190 186 192 200 203 206 218
4078 218 235 249 261 276 289 287 269 249 243 253 266 268 256 237 217 199 186 183 191 204 214 215 205 190 176 173 183 196 204 213 232 255 269 270 275 294 318 333 335 331 319
4073 319 294 258 220 184 149 114 89 85 104 131 146 138 115 97 101 131 173 216 255 287 307 309 292 266 248 242 242 240 236 241 260 283 298 305 311 317 318 306 284 259 240
4068 240 234 242 261 284 307 322 323 310 288 264 244 229 216 205 194 189 197 217 237 244 234 213 186 165 160 176 203 229 250 275 307 333 344 339 327 316 309 306 309 314 316
4063 316 316 314 308 288 259 234 224 220 207 188 180 191 211 222 227 238 257 268 260 238 218 210 215 226 240 254 257 244 218 188 166 153 147 145 150 161 170 169 160 159 174 193 202 202
4057 202 201 202 195 177 166 178 207 236 251 253 246 229 205 185 181 196 217 229 227 218 213 213 213 201 179 159 155 170 190 200 204 214 234 251 259 267 286 309 315 294 260 235 227
4052 227 222 209 189 170 159 158 165 176 187 194 198 202 206 209 212 221 241 266 283 282 264 241 221 208 198 187 177 174 188 214 236 242 238 239 250 256 239 203 165 143 138 139 139 139 148
4047 148 171 197 205 190 166 153 153 156 156 153 148 140 134 141 166 199 223 236 246 261 274 277 267 253 249 257 267 269 263 258 262 267 266 264 271 285 292 287 284 296 315 324 316 304 298 291 275 256
4041 256 248 258 281 307 328 335 329 317 310 307 299 283 260 233 204 179 169 177 190 198 204 216 230 237 236 241 257 271 269 254 243 245 256 266 269 263 245 212 173 143 139 165 205
4036 205 239 258 270 288 312 326 324 313 303 297 289 278 269 260 244 223 212 220 236 249 260 274 285 281 268 266 280 292 287 272 267 280 299 306 300 286 273 260 243 225 219
4031 219 230 251 264 261 255 266 295 323 337 338 333 326 316 306 299 292 282 272 268 271 277 281 283 283 280 273 261 245 225 208 201 206 224 248 272 286 285 271 253 235 218 202 193 192 193
4025 193 196 209 243 291 332 348 338 314 290 273 266 265 264 261 261 263 255 229 196 178 183 203 221 228 224 212 199 193 192 188 177 167 164 169 177 182 185 184 180 181 188 198 207 216 229 245 254 251
4019 251 238 224 219 223 225 217 200 185 184 201 229 263 294 312 310 291 266 246 231 217 203 191 187 188 191 189 183 180 185 196 209 220 232 244 255 260 256 241 224 220 239 266 280
4014 280 274 260 248 239 233 230 232 236 241 249 257 260 258 257 253 238 212 199 211 237 253 256 261 273 283 283 282 288 298 298 283 258 232 212 203 200 199 201 210 219 217 200 180 171 177 193 213 234 250
4008 250 257 258 261 266 267 265 265 271 285 305 328 345 349 343 343 350 352 332 295 262 249 255 266 269 259 242 230 232 247 264 274 277 278 279 281 282 274 257 235 220 214 211 202 190 181 179 186 200 217
4002 217 230 241 255 273 285 280 259 236 217 202 186 175 175 186 197 199 193 187 190 202 217 230 239 246 251 261 281 312 343 358 352 335 321 316 317 316 314 314 318 324 329 331 330 322 303
3996 303 277 256 249 251 250 244 238 232 220 204 192 190 198 211 228 243 249 253 264 282 294 292 282 274 266 253 236 222 209 191 173 164 168 179 188 192 186 175 168 173 179 174 165 166 183 200 208
3991 208 211 218 231 243 256 273 296 318 328 322 300 273 250 232 210 181 151 130 121 120 124 127 131 134 136 137 137 142 154 166 168 166 172 190 206 200 177 161 175 218 269 305 316
3985 316 308 294 283 275 266 254 241 229 218 207 195 185 181 182 183 182 187 200 211 207 197 204 235 275 305 319 316 299 279 273 289 311 317 307 296 288 274 250 225 207 199 198 202
3980 202 213 224 235 249 265 274 268 249 230 219 213 209 212 223 233 229 214 207 219 241 254 256 256 260 259 247 235 233 237 235 227 222 226 234 240 242 245 252 264 275 278 264 243 229 230 244 271
3974 271 305 334 342 324 297 280 274 272 268 267 268 265 253 238 233 242 257 270 273 262 240 215 207 221 245 257 250 236 231 232 226 207 180 161 164 193 239 279 300 306 308 315 323 329 328 316
3969 316 298 288 298 313 311 289 266 259 264 271 273 266 241 204 172 159 158 154 147 148 159 172 178 186 207 241 277 298 295 275 254 245 250 264 281 290 278 243 208 202 229 272 310
3964 310 335 342 334 323 317 310 288 249 210 188 184 200 233 267 282 273 255 245 236 221 207 208 219 222 206 187 182 198 228 260 284 295 302 308 307 290 264 258 282 320 338 325
3958 325 293 262 239 226 225 238 258 275 283 278 262 243 228 222 223 225 224 218 207 192 173 155 150 163 188 212 227 234 236 229 211 187 173 171 172 164 149 137 131 129 131 135 136 129 115
3953 115 106 114 140 171 197 211 216 215 212 205 192 175 160 160 180 208 228 230 221 214 217 225 233 239 244 252 268 289 304 299 275 240 207 185 177 187 210 232 238 224 203 190 188 190 195 208
3947 208 234 265 289 303 311 311 299 277 259 253 253 239 206 165 135 122 126 138 158 184 212 234 240 230 216 209 211 211 207 204 212 229 242 248 252 266 290 317 338 350 352 346 332
3942 332 311 288 269 258 255 255 257 254 245 230 219 220 232 245 254 257 256 253 250 250 253 257 258 252 238 226 227 249 281 308 322 325 321 312 302 298 297 294 288 286 284 275 250 217 188 165 150 147 159
3936 159 184 211 228 227 212 197 196 212 234 250 258 264 268 264 254 243 235 230 229 235 251 275 301 320 321 306 286 271 257 234 212 210 226 237 232 224 235 258 273 270 260 251 247
3931 247 252 270 297 316 317 310 308 315 322 323 321 318 312 301 287 271 254 244 251 274 303 326 340 349 353 348 339 333 335 336 325 303 282 270 266 266 267 267 262 247 220 190 164 147 144 154 173
3925 173 191 201 204 206 210 215 219 228 251 289 326 343 334 312 290 269 246 225 220 237 266 291 303 305 298 281 258 234 218 208 197 184 174 164 149 129 115 115 124 133 142 160
3920 160 192 232 268 296 318 333 341 342 340 333 321 301 275 256 255 270 287 287 273 258 252 253 253 253 252 250 248 253 271 299 328 349 361 363 351 323 291 275 280 290 280 246 210
3915 210 202 223 251 262 255 244 242 255 272 270 234 182 146 145 160 164 153 145 153 169 182 191 198 201 199 199 205 208 199 182 168 162 165 174 187 198 201 198 195 195 199 208 229 269 319 360 373
3909 373 356 326 305 301 309 319 327 333 337 336 326 303 262 215 185 190 221 251 257 242 220 202 196 201 210 210 192 172 172 198 235 262 271 271 273 283 300 311 305 279 245 218 205
3904 205 205 216 231 241 238 226 211 193 174 156 144 137 134 140 157 176 188 195 203 211 214 217 228 241 241 230 226 237 248 246 241 248 263 268 256 236 219 213 223 240 249 250 260 290
3898 290 317 318 300 289 290 283 266 260 280 307 317 309 293 276 263 264 281 298 301 293 296 313 332 337 320 285 247 229 239 258 266 261 258 265 273 271 256 236 222 230 258 285 289 273
3893 273 257 251 244 234 231 240 242 222 190 167 159 156 151 152 169 194 213 217 208 192 175 168 177 197 216 230 242 252 257 254 251 255 259 254 235 211 189 169 153 148 165 194 218 228 234
3887 234 246 264 278 283 280 271 258 251 259 280 304 317 316 310 309 309 302 280 248 218 200 196 206 226 247 256 245 220 199 195 208 227 238 235 223 206 187 171 163 171 192 212 219
3882 219 216 218 234 254 259 243 220 203 194 186 179 181 191 198 195 195 212 242 267 274 261 238 219 222 249 277 275 240 201 186 189 184 163 144 146 171 202 219 214 200 203 237 285 321
3877 321 335 338 339 327 294 254 225 210 199 188 188 207 234 251 255 255 262 271 270 260 251 250 255 258 260 267 279 292 301 300 287 265 245 242 261 293 320 332 328 316 302 294 291 290 284 270
3871 270 252 238 231 225 215 202 201 215 235 245 243 239 239 237 223 204 193 192 190 171 140 112 102 112 132 154 178 203 219 223 221 225 241 260 268 264 257 255 259 269 280 286 274 244
3866 244 211 196 208 234 257 269 276 279 281 282 282 276 257 228 207 210 234 257 261 249 237 237 244 250 252 253 255 261 269 280 292 302 306 300 280 250 220 205 213 240 268 279 270 251 237
3860 237 236 241 240 233 228 232 245 252 245 230 222 227 238 239 223 199 184 186 201 216 227 234 239 244 251 264 276 281 273 254 229 198 160 122 95 88 101 128 157 179 190 191 191 197 210 226
3855 226 243 265 291 305 291 249 202 172 159 156 167 199 241 267 265 250 240 232 222 214 220 234 243 246 257 282 308 318 314 312 316 319 314 300 279 259 243 237 241 250 260 263 255
3849 255 240 225 219 223 226 216 194 176 172 177 180 185 204 239 269 279 280 295 329 357 358 341 330 337 351 353 335 305 274 252 244 248 258 260 247 224 203 192 193 208 241 284
3844 284 316 321 303 286 286 300 308 293 257 220 206 222 249 269 278 284 290 288 280 275 283 296 301 288 266 251 256 280 311 334 341 332 313 295 292 306 321 322 307 287 272 265 271 285
3839 285 294 284 262 248 252 261 263 260 260 263 260 253 250 254 262 276 295 310 316 316 318 325 330 331 329 322 313 306 302 300 296 297 305 309 296 272 255 254 251 232 202 180 175 180 183 182 183 199 231 266 289 297 297
3832 297 297 294 287 283 280 274 258 233 209 196 198 214 234 247 256 269 284 285 267 249 249 259 255 228 199 190 195 196 185 174 176 190 204 215 231 257 281 288 274 256 250 255 259 255 247
3827 247 243 247 255 257 247 231 223 226 231 225 209 198 197 202 208 214 218 214 208 211 228 245 248 242 236 234 230 229 242 272 299 307 295 275 252 228 205 188 181 180 183 187 190 191 194 207 237 277 314 336
3821 336 339 329 318 314 316 316 304 279 246 213 186 167 157 159 171 189 204 209 199 181 168 168 184 212 248 284 309 315 308 301 294 282 265 258 273 299 310 295 263 235 220
3816 220 215 209 199 184 172 171 184 203 219 230 238 242 242 238 226 199 161 131 130 154 184 201 209 218 231 241 244 238 221 199 178 166 160 158 163 177 190 188 173 155 147 150 164 182
3810 182 196 201 204 210 213 203 189 191 215 242 254 255 258 266 270 263 245 213 173 143 141 163 189 207 225 249 276 295 296 278 246 217 205 213 231 246 251 242 221 200 188 188 191
3805 191 191 192 204 227 250 264 267 265 264 266 271 275 280 289 298 297 280 256 244 250 260 260 252 249 256 261 248 218 188 181 197 222 236 229 212 202 209 225 236 238 239 252 272 287 290 285 282 281
3799 281 275 260 238 223 226 245 263 268 264 265 279 301 313 309 293 268 240 208 180 170 188 230 277 306 309 296 287 293 307 315 312 302 291 283 276 272 277 292 307 313 314 321 337 350
3794 350 351 345 338 333 326 316 302 287 278 280 290 298 298 297 305 322 339 350 353 348 336 325 322 324 325 329 341 352 348 323 296 291 309 334 346 337 312 286 269 264 261 249 233 226 230 235 232 230
3788 230 237 249 249 239 237 250 262 252 223 196 188 199 220 244 268 289 304 308 297 274 250 237 232 221 195 160 138 142 163 184 193 200 222 259 295 316 324 332 344 352 357
3783 357 365 378 378 355 320 293 276 257 233 221 234 262 281 275 252 230 225 234 252 270 282 280 256 213 170 150 161 194 227 249 260 264 267 267 263 256 246 231 216 209 214
3778 214 218 200 160 123 117 135 149 140 125 130 159 198 229 249 258 263 265 266 261 250 241 242 252 256 250 245 256 281 305 313 301 283 273 273 274 266 258 265 288 314 326 323 309 292 274
3772 274 262 260 264 265 265 268 276 281 275 263 253 251 260 276 288 287 277 266 255 233 202 178 182 216 264 302 313 294 258 223 202 194 200 220 246 263 266 270 284 293 282 262 257 275
3767 275 301 329 359 381 373 335 301 298 312 315 307 306 313 309 291 276 279 291 303 319 340 355 352 340 333 336 339 339 342 348 346 325 292 268 263 271 272 260 245 240 247 254 254 255 263 280 300
3761 300 318 333 347 356 352 329 293 259 240 232 225 217 213 210 200 185 172 166 166 167 174 191 210 218 207 182 161 154 154 148 136 135 156 187 205 206 204 208 214 210 198 182 164 154 166
3756 166 201 242 271 284 288 289 279 257 228 203 187 188 201 217 220 207 183 161 153 165 191 219 241 259 278 297 316 338 360 375 377 370 360 346 327 307 291 271
3751 271 239 199 163 138 123 124 148 193 238 271 294 310 311 291 264 250 256 278 304 325 329 313 288 272 270 274 275 272 271 275 284 291 293 286 273 262 259 266 277 276 260 235 217
3746 217 209 205 201 199 202 208 219 237 258 273 273 260 247 247 264 290 307 302 285 273 277 283 280 274 275 280 274 252 224 202 194 201 221 245 261 269 273 274 264 246 238 257 295 330 345 347
3740 347 344 342 339 335 336 340 338 322 296 270 253 244 243 254 279 307 329 344 358 371 374 370 369 376 381 369 342 319 312 319 331 339 339 330 314 300 292 291 290 285 275 267 266 270 270 260 249 253 276
3734 276 304 322 331 338 345 346 337 326 321 320 318 314 313 319 327 330 325 310 291 276 269 270 271 266 258 245 227 213 218 250 301 347 377 390 392 385 371 351 324 287 247 221 219 234 250 261
3729 261 269 274 277 286 306 329 340 334 323 317 314 307 292 270 243 219 207 212 227 242 259 280 304 325 338 336 316 279 243 225 225 228 227 227 229 224 213 210 224 246 262 279 309
3723 309 347 372 374 363 351 343 337 339 348 351 337 316 309 322 343 359 368 379 392 403 410 414 412 399 379 359 347 341 339 337 333 325 310 288 260 235 222 229 248 266 276 282 289 296 299
3718 299 302 308 307 288 254 221 203 193 182 170 166 175 188 198 202 207 219 238 255 256 236 212 202 212 232 253 272 284 288 289 302 328 349 351 336 321 316 316 316 313 311 311 310 304
3713 304 290 271 252 236 222 210 203 204 203 191 171 156 159 178 202 212 204 192 195 218 243 252 245 234 229 230 240 258 277 284 274 256 248 262 297 333 348 334 300 267 248
3708 248 243 248 260 272 279 281 285 293 302 311 320 327 328 322 313 303 295 294 303 311 305 286 267 254 238 215 198 202 223 248 274 304 336 361 373 371 357 338 321 307 291 276 270 272 268 246
3702 246 221 213 223 232 228 221 220 214 196 172 154 144 139 147 178 224 265 288 303 319 334 336 322 302 283 269 262 262 266 269 276 289 307 320 324 321 322 323 317 303 289 278 262 237
3697 237 217 218 237 259 275 285 291 286 264 236 220 224 244 268 287 301 310 316 320 327 341 354 347 316 279 258 253 247 227 200 174 152 140 142 156 169 170 169 179 202 225 236
3691 236 237 235 237 242 246 241 230 221 224 233 240 243 247 251 248 238 228 229 245 269 291 301 296 284 279 289 306 319 322 318 314 310 302 288 273 266 268 270 270 272 287 310 335 356 377 397 407 403 389
3685 389 369 341 310 281 258 242 238 250 274 293 291 269 242 228 237 271 318 352 354 332 309 295 287 281 274 261 242 227 233 252 264 262 259 268 277 272 261 263 282 302 315 325
3680 325 332 334 330 334 350 369 381 384 384 378 366 358 358 360 351 332 310 291 272 253 243 241 245 250 255 257 250 239 235 244 261 278 291 302 314 326 330 326 316 313 323 334 329 307 284 272
3675 272 266 256 247 245 252 261 269 279 291 301 305 309 316 324 321 300 263 229 218 236 271 303 324 339 353 365 369 357 324 279 234 204 191 194 205 212 204 186 181 200 231 251 261
3669 261 279 313 344 352 337 315 298 288 283 276 258 236 229 245 267 275 268 260 256 251 245 246 260 278 290 295 296 294 290 285 284 290 306 328 350 359 356 345 331 314 293 271 248 226 209
3664 209 202 205 209 212 220 235 244 237 225 226 244 263 271 270 269 270 271 270 268 267 266 260 241 213 191 188 204 223 238 251 259 251 226 201 194 204 220 235 250 256 245 222 209 216 234 250 260
3658 260 266 267 266 270 284 305 320 321 313 310 318 334 348 357 361 358 347 334 328 332 337 338 336 336 332 319 303 301 310 314 308 303 308 316 314 304 295 287 273 248 218 190 173 176 196 221 234 232 226 224 224
3652 224 220 217 224 242 266 290 310 329 345 355 352 340 326 316 312 314 327 346 358 354 349 361 394 431 458 473 471 449 413 378 349 318 281 255 257 280 298 298 284 264
3647 264 245 235 242 261 284 302 311 310 299 281 263 244 221 198 193 213 247 279 303 322 335 331 300 250 207 199 231 275 301 306 306 310 311 297 268 237 213 203 209 220
3642 220 217 193 167 169 201 237 253 250 248 261 286 309 317 307 282 256 240 236 241 249 257 260 257 254 261 287 324 356 367 355 331 305 283 262 238 212 190 178 179 198 232 276
3637 276 321 356 376 380 375 368 366 373 382 385 378 370 371 377 376 363 340 314 293 285 290 303 312 304 282 259 243 232 220 211 222 258 300 321 312 294 289 292 279 240 193 162 155 161 177 202
3631 202 237 272 301 320 330 328 312 290 274 274 286 294 285 263 244 241 252 265 273 282 297 311 312 299 282 280 293 312 326 334 337 330 310 284 268 264 262 259 258 262 260 249 242 254
3626 254 281 304 316 329 349 369 378 380 381 376 358 331 306 293 290 288 285 283 284 287 285 274 262 257 260 264 263 261 262 267 273 276 274 265 251 238 231 225 215 204 201 213 235 257 269 270 264 251
3620 251 236 226 231 250 271 279 274 265 261 256 246 229 212 199 195 206 230 258 276 278 268 251 234 228 242 274 308 333 349 362 372 371 352 321 288 269 266 266 251 225 210
3615 210 223 259 290 297 281 256 239 234 234 229 220 224 247 278 297 295 282 269 262 266 284 309 334 350 353 342 317 291 280 285 292 290 287 294 308 314 307 294 277 245 196 144 111
3610 111 100 105 120 142 164 175 177 180 198 231 265 292 311 326 338 349 364 379 386 379 367 361 363 362 349 327 309 303 306 309 307 301 301 309 313 298 265 230 213 217 232 248 262
3605 262 272 274 270 266 272 291 318 342 351 345 338 347 371 398 409 395 368 345 336 332 313 277 248 250 274 296 302 304 309 311 298 279 266 263 265 276 297 315 311 281 245 221 208 204
3599 204 216 246 277 287 280 281 300 323 334 333 327 322 317 312 311 310 303 295 297 308 316 310 295 285 284 288 287 284 284 289 296 300 308 327 360 392 408 405 392 379 368 361 361 370 375 363 335 312 308
3593 308 320 333 337 332 323 317 318 326 334 337 335 329 322 316 311 311 317 329 344 352 341 313 285 280 296 313 314 300 286 285 294 299 291 269 245 231 235 251 271 283 285 280 272 270 276 285 291 292 291 300 318
3587 318 336 341 331 315 304 297 287 277 275 281 287 288 292 308 329 343 344 343 352 366 373 369 362 357 347 324 293 272 272 286 302 314 316 305 285 273 283 306 321 316 304 295 287 282 289
3581 289 314 342 353 345 337 341 347 346 341 341 346 354 368 386 397 383 351 320 306 303 294 276 261 257 262 266 264 252 234 218 219 241 270 286 288 289 294 291 268 233 208 203 215 229 231 212
3576 212 181 160 167 196 223 244 272 314 356 380 382 372 359 340 319 301 291 288 291 295 289 266 234 208 200 206 217 224 220 206 190 182 187 199 209 220 237 263 295 320 329
3571 329 325 315 305 289 264 239 226 227 233 243 269 313 357 377 367 346 331 324 316 303 290 284 287 291 291 286 280 280 290 310 336 356 360 343 314 287 275 280 294 299 288 272
3566 272 269 285 308 325 334 337 333 325 321 322 320 304 284 274 275 276 271 273 294 323 337 328 312 305 306 306 295 280 275 284 297 299 291 287 299 320 332 329 317 307 304 304 306 306 302 293 284 280 284 292 301
3559 301 306 305 304 316 335 343 322 282 254 255 275 296 313 335 361 375 365 336 310 304 311 314 305 292 284 280 275 273 283 301 317 325 331 339 341 334 326 316 296 267 255 278 316 335
3554 335 328 321 330 331 306 269 251 258 276 294 311 319 310 293 286 286 274 245 220 217 227 236 240 246 254 267 289 319 346 356 352 344 340 340 348 368 398 428 448 451 437 416 399 390 388 391
3548 391 399 409 414 408 405 411 421 422 412 403 394 381 362 348 344 342 335 325 319 322 335 352 360 350 330 316 310 303 289 275 269 267 264 266 280 298 308 308 304 302 303 308 317 322 311 287 269 274 298
3542 298 321 330 335 349 372 390 387 364 334 312 306 316 329 333 324 312 310 314 311 294 276 273 292 323 351 367 373 373 372 371 370 371 374 372 361 347 347 363 380 382 371 362 365 380 401 420
3537 420 432 436 434 428 421 414 407 400 389 375 360 340 316 303 316 350 375 375 366 367 373 368 354 351 366 384 394 399 408 419 426 422 408 394 391 396 388 358 321 303 303 301 293 300 329 364 386
3531 386 399 411 414 401 380 370 372 377 385 402 424 434 429 413 393 374 361 362 374 389 399 403 392 366 343 341 357 372 380 393 419 446 464 483 509 529 531 523 521 523 518 504
3526 504 494 490 479 454 426 417 431 452 466 465 452 433 418 420 441 471 491 489 470 450 437 429 418 406 403 419 451 486 512 527 532 530 521 514 510 507 496 476 456 446 449 460
3521 460 475 488 496 502 508 513 509 492 468 453 457 473 486 484 472 459 453 448 440 432 431 431 421 401 383 373 366 357 352 363 385 404 415 426 443 459 467 465 455 444 434 430 427 416 400
3515 400 391 392 400 413 439 481 521 534 519 502 505 532 569 602 618 618 614 614 618 614 600 584 571 556 538 523 521 531 545 563 583 603 618 629 637 636 620 591 561 540 530
3510 530 525 520 517 523 544 576 595 586 559 539 538 549 561 581 612 639 649 647 651 665 678 683 688 696 702 702 702 706 715 723 729 735 738 734 728 733 752 771 772 754 731 718 717 718 718 718 721 723 720 718 723
3504 723 738 756 769 771 763 749 737 730 718 691 657 642 653 671 675 668 666 667 657 638 628 637 655 672 687 702 716 730 747 765 771 760 743 731 725 723 723 725 717 698 685 698
3499 698 726 741 732 719 726 752 773 773 758 740 723 708 694 687 687 695 711 735 766 792 797 776 746 723 704 677 643 621 623 644 667 679 683 684 683 681 675 660 643 636 652 686
3494 686 722 746 753 754 755 763 774 783 787 785 776 760 741 721 703 687 675 678 698 727 747 750 739 721 697 671 647 627 606 578 555 551 570 600 630 652 668 675 679 687 700 707
3489 707 697 672 641 611 583 566 568 584 598 600 594 587 577 558 529 496 468 460 481 522 558 570 561 548 544 544 544 546 554 566 572 565 545 518 497 488 492 508 532 554 562 552 537
3483 537 529 525 513 493 476 472 476 482 488 494 495 488 477 468 466 471 483 502 519 525 515 496 479 471 474 483 492 494 483 462 442 434 439 447 453 459 469 479 484 481 478 475 473 475 475 467 450 434 425 413 390
3477 390 367 367 390 410 411 404 404 411 414 409 397 382 368 363 366 368 364 361 361 360 355 351 351 348 340 342 360 385 401 409 416 418 410 401 411 437 460 470 476 480 474 452 420 394 382 387 402 416 416 405
3471 405 397 394 387 372 359 354 351 347 348 359 376 388 394 393 385 370 354 341 326 308 295 299 316 339 365 394 418 432 435 431 414 381 351 344 359 376 383 385 386 378 354 325 309 312
3466 312 328 347 361 372 384 403 426 441 438 415 379 340 309 292 290 298 312 331 347 351 340 326 320 326 342 367 396 418 419 399 370 350 348 365 390 408 410 398 378
3461 378 359 345 337 337 347 367 389 407 418 425 427 415 385 348 328 335 348 342 317 289 277 278 288 307 332 350 346 326 311 312 320 323 318 315 320 332 343 348 338 309 271 239
3456 239 228 239 264 282 278 250 222 223 260 309 349 381 413 440 444 421 387 357 334 319 319 336 361 380 389 391 386 377 367 353 333 315 313 337 368 382 370 350 342 350
3451 350 366 378 381 373 365 367 378 385 376 351 322 304 301 312 331 355 384 412 428 422 406 391 376 355 326 301 286 275 262 255 257 269 290 326 369 396 389 363 343 335 331
3446 331 333 349 374 388 385 378 378 373 349 310 274 253 241 230 223 228 250 280 296 289 275 278 297 314 316 314 321 331 332 324 322 331 347 365 383 395 394 382 369 359 353 358 376 397
3440 397 407 404 398 394 393 403 426 450 453 436 422 422 419 395 359 333 317 300 281 271 272 274 269 261 254 251 252 258 264 259 246 237 242 256 268 272 270 267 269 278 290 299 302 298 288 275 273 294 330
3435 330 366 387 394 393 385 371 360 362 378 397 407 399 380 364 361 357 338 302 267 249 246 248 254 264 274 281 288 301 316 324 324 322 322 320 314 306 301 297 291 282 269 251 231 218 219 234 256
3429 256 280 302 317 324 327 336 356 379 394 393 380 364 350 340 335 334 332 318 291 265 259 275 300 319 332 343 359 378 394 402 400 393 388 385 378 365 349 337 337 347 357 356 339
3424 339 314 297 297 312 327 333 333 336 349 363 367 355 338 331 338 347 348 338 325 317 317 320 321 317 308 300 294 288 282 279 282 285 283 278 278 289 303 314 319 323 329 334 335 328 316 300 282 267 265 277 298
3417 298 316 322 317 304 288 272 260 256 257 256 250 244 245 251 250 237 219 211 222 244 259 264 269 285 310 325 318 295 278 282 305 327 335 330 324 329 342 353 356 357 363 375 385 386 376 362
3412 362 351 350 358 367 362 338 309 293 295 302 300 290 283 285 290 293 298 307 314 305 278 244 220 215 227 246 262 270 272 277 288 297 295 283 276 280 287 283 267 251 248 263 287 307 308 292 272 263 263
3406 263 257 241 226 228 250 277 291 288 274 261 253 247 243 245 261 292 328 354 360 347 332 328 336 343 337 322 316 330 357 380 388 383 373 370 375 375 359 329 301 285 276 261 236 210
3400 210 191 184 191 213 243 264 263 240 215 208 217 226 227 224 223 223 224 231 249 267 275 275 280 282 270 246 232 235 241 239 237 247 262 271 284 315 356 382 381 364 342 317 290 272 273 287
3395 287 302 312 318 322 326 328 327 323 320 322 320 308 292 286 293 300 294 280 271 271 274 272 263 254 251 255 263 276 303 344 379 389 374 357 359 377 392 390 371 346 327 314 301 285 277 285 307 326
3389 326 332 328 322 321 332 355 375 377 369 374 398 424 427 406 378 360 362 377 386 369 330 293 275 270 268 275 294 318 335 345 352 352 345 343 355 367 363 348 340 337 320 288 260 247 240
3383 240 232 233 248 266 273 270 269 275 287 303 315 307 275 240 226 229 229 215 198 195 207 220 220 203 182 174 179 186 195 212 240 269 288 301 312 319 315 301 283 265 252 253 267 277
3378 277 270 258 264 292 316 316 299 288 292 301 307 310 318 333 355 371 370 351 328 315 310 301 284 265 254 253 254 255 266 292 327 357 370 371 367 363 361 357 349 335 320 309 304 303 306 312 321
3372 321 329 337 351 371 389 395 388 375 361 344 321 295 276 277 297 321 325 311 298 298 303 303 305 320 337 341 331 327 335 343 341 332 323 311 299 301 324 353 368 362 344 323 303 288
3367 288 283 280 270 256 252 265 282 288 289 298 319 338 339 319 290 266 256 257 263 271 274 272 273 285 310 335 356 383 419 450 455 429 391 360 342 335 338 341 333 312 295 295 310 327
3361 327 342 359 372 371 357 345 343 344 332 305 276 258 255 260 266 269 271 274 279 288 303 325 342 348 343 333 325 322 330 346 355 345 330 331 352 366 356 337 334 342 342 328 315 319 336 353
3356 353 363 358 337 305 277 266 273 291 312 324 325 320 315 311 304 294 289 292 302 316 339 365 383 393 408 432 452 453 436 407 373 345 337 350 361 349 323 312 328 355
3351 355 375 383 385 381 373 368 366 359 342 324 316 321 336 357 375 382 370 346 326 318 321 325 320 303 280 261 253 258 269 282 293 300 304 306 302 293 286 293 316 340 354 355 347 334 321 314 316 320 318
3345 318 315 323 339 356 367 375 378 375 366 360 361 367 372 381 400 417 412 380 344 329 333 336 331 335 351 360 343 308 283 274 271 269 270 275 274 269 276 290 291 268 245 249 269 279 269 257 255 259 260 261
3339 261 271 292 318 343 362 373 385 404 420 422 411 403 409 419 422 416 405 388 365 340 321 306 293 283 277 275 281 300 324 331 308 269 240 231 232 235 241 251 262 271 275 274 267
3334 267 262 272 294 314 320 319 321 331 338 337 325 308 293 285 285 289 297 305 308 298 279 265 266 278 297 320 348 371 379 376 369 364 353 337 321 313 308 299 289 285 294 312 331 344 349 351 356
3328 356 364 374 382 387 383 364 340 328 339 357 359 339 313 291 271 248 232 234 247 254 245 234 235 247 255 250 241 240 250 264 275 281 285 288 295 314 350 391 422 433 428 415 407 408 419
3322 419 432 441 443 434 409 372 347 352 380 397 388 367 360 368 374 369 353 337 327 332 348 361 360 352 352 360 365 365 364 358 338 309 291 294 305 307 299 289 278 270 274 293 317 331 340 356 380
3317 380 399 406 400 385 364 343 335 341 350 349 336 315 297 286 283 284 280 273 268 267 268 276 299 326 337 325 309 314 332 338 326 314 321 340 357 368 374 372 354 326 301 286 278 280 298
3311 298 330 356 365 368 383 407 425 427 417 400 380 364 364 378 392 398 396 387 365 327 285 256 247 253 269 292 316 329 332 327 322 322 333 352 364 358 347 347 354 346 314 281 268
3306 268 270 272 275 283 291 285 270 268 288 313 323 315 302 292 288 288 291 294 294 292 288 285 289 302 323 343 359 371 380 388 393 396 390 371 349 338 347 367 384 396 403 399 378 348 331 332 341 344 346
3300 346 358 373 370 344 315 309 331 365 388 389 370 335 293 259 244 248 254 247 228 212 206 212 224 242 267 300 338 375 409 433 444 442 433 422 409 391 368 342 311 276
3295 276 245 227 223 225 224 221 227 243 262 274 277 274 274 277 284 297 316 336 348 344 322 288 256 237 239 261 292 318 330 335 346 367 389 397 386 357 318 284 265 269 290 312
3290 312 319 305 279 258 257 276 310 343 365 371 366 360 361 369 376 376 366 344 314 286 271 276 295 320 343 361 369 364 348 330 317 314 319 328 336 337 336 337 338 335 332 338 354 368 371 365 359 357
3284 357 355 356 360 365 366 362 355 347 338 327 322 323 322 309 287 268 259 260 266 280 300 316 317 304 285 268 258 258 273 296 319 339 362 393 418 421 407 397 402 409 399 371 336 307 286
3278 286 274 272 282 304 334 367 392 404 406 399 381 356 344 355 377 388 379 363 351 335 306 271 246 238 237 238 246 272 309 341 353 345 337 341 357 373 383 393 413 445
3273 445 480 502 499 477 453 442 444 451 457 459 453 436 421 424 445 465 473 478 483 478 453 423 411 416 416 405 395 396 407 421 438 450 441 408 371 350 349 356 361 360 353 341 335 342 358 372
3268 372 379 379 375 372 375 385 393 391 387 400 429 455 465 462 459 458 456 455 458 463 466 473 491 516 534 539 538 535 530 520 509 505 509 521 543 569 584 574 543 517 511 521 536 550 567 593 629
3262 629 664 681 674 653 643 654 672 681 676 665 653 640 625 615 611 609 607 604 605 618 644 677 702 712 721 745 780 806 805 783 754 730 716 708 702 695 692 702 725 762 805 840
3257 840 847 821 787 772 772 760 729 700 693 696 694 688 693 710 722 722 711 701 702 721 756 792 813 819 813 796 768 746 750 776 798 801 794 795 805 808 790 753 707 668 645 638 641 651
3252 651 669 693 715 725 723 714 710 719 738 757 766 768 768 765 757 750 746 738 717 699 704 729 745 739 726 725 730 727 721 725 736 734 707 669 644 641 650 660 660 648 628 610 606 612 619 617 607 591
3246 591 572 549 525 510 512 526 542 554 562 567 567 568 570 571 568 562 556 552 547 544 540 527 499 464 439 431 433 440 452 467 474 468 455 443 430 410 389 381 391 410 423 428 433 449 477 504
3240 504 516 514 505 493 477 466 467 480 486 481 480 499 530 554 565 568 561 540 508 482 470 459 437 406 383 377 393 426 466 503 536 567 591 599 587 568 554 547 533 505
3235 505 471 444 430 423 411 393 381 388 408 423 419 401 387 387 396 406 417 430 440 443 447 465 492 503 484 452 438 449 462 460 446 432 419 405 396 395 399 401 406 420 433
3230 433 432 418 406 407 413 410 399 389 388 391 390 378 358 338 325 319 320 330 351 377 397 404 403 397 387 375 369 377 397 421 436 434 417 395 376 362 355 355 363 379 394 406 414 421 424
3225 424 424 423 421 418 407 384 354 330 330 352 379 393 395 393 388 379 369 364 363 357 344 330 323 328 344 367 387 392 389 391 403 417 423 420 410 395 382 382 393 401 397 391 390 390 382 372 373 390
3219 390 412 428 433 429 418 403 391 389 396 409 418 416 404 389 374 352 322 295 290 311 342 368 384 397 408 414 409 398 388 381 378 379 386 392 386 359 315 267 224 195 182 183 188
3214 188 189 193 214 257 310 353 373 363 336 316 319 335 347 351 355 363 364 353 341 338 342 342 335 325 317 319 336 363 377 373 372 401 452 496 516 514 493 458 422 408 414 419 405 379
3208 379 358 357 373 396 406 391 357 329 321 326 332 335 338 341 345 348 347 337 322 311 310 317 328 341 353 357 353 353 364 378 379 358 324 287 259 246 248 259 276 296 309 305 283 259
3203 259 249 255 271 289 307 323 339 356 373 382 379 368 354 335 315 304 302 299 285 268 261 260 248 218 189 183 203 237 271 298 315 326 338 358 389 424 456 477 483
3198 483 472 453 439 437 441 438 421 399 390 398 409 409 399 396 408 423 423 412 407 415 418 399 361 330 323 332 344 354 370 395 417 427 424 417 409 397 385 378 374 370 361 348 338 333 333 338
3192 338 350 363 368 361 347 341 351 371 383 375 357 347 357 374 378 364 346 340 344 351 359 370 381 380 366 348 336 332 335 345 363 377 378 368 363 369 379 386 389 393 402 411 418 417 411 402 395
3187 395 387 373 358 352 354 352 337 314 296 291 297 308 318 320 312 303 306 324 349 369 381 387 388 382 369 356 350 343 323 290 263 255 256 252 248 262 291 309 305 298 308 324 325 311 301 308
3181 308 325 344 365 385 394 392 387 389 393 393 392 396 408 424 436 437 429 423 424 424 410 380 347 331 338 354 362 353 341 342 358 367 359 347 350 364 371 364 353 348 351 359 373 385 378 342 286 232
3175 232 202 200 216 229 232 234 251 277 297 307 319 333 339 334 329 327 321 309 307 322 342 351 348 333 303 261 229 227 250 276 294 308 322 334 342 343 331 304 276 263 261 252 234
3170 234 223 231 247 259 272 294 323 347 360 363 361 361 365 370 370 366 369 381 387 372 338 299 267 251 261 299 351 393 407 389 349 310 292 297 310 312 301 283 265 246 232
3165 232 234 256 291 323 342 348 351 358 368 379 391 409 428 432 416 389 369 364 369 377 384 385 376 363 356 355 352 341 330 325 323 326 344 383 425 446 440 423 412 403 393 390 399 407 403 391
3159 391 387 392 394 383 366 348 329 310 307 329 359 370 358 345 348 355 353 348 357 379 389 374 351 342 349 352 345 345 363 389 396 381 360 346 334 322 320 339 368 385 381 368 353
3154 353 333 303 271 252 247 247 251 263 287 315 336 348 352 355 361 374 391 398 389 369 353 346 343 337 332 334 345 357 368 381 402 428 448 455 451 442 431 419 403 382 356 332 321
3149 321 326 342 362 386 412 435 439 419 388 366 364 372 382 391 402 406 397 383 376 381 389 388 379 372 370 372 376 389 413 442 462 468 458 433 400 371 363 376 392 389 371 355 357 365 364 353
3143 353 345 348 353 351 347 349 358 367 373 381 394 408 410 391 359 339 348 381 416 442 462 479 481 461 431 406 389 377 368 368 371 371 369 377 392 404 405 402 404 411 420 430 439 440 432 424 424 430 434 433 427
3137 427 421 417 415 410 399 386 380 384 392 403 423 456 491 517 526 526 525 528 533 534 528 521 527 547 566 568 554 537 519 499 486 496 533 581 621 647 670 698 730 766 804 836 853
3132 853 855 855 859 858 841 810 777 743 700 646 599 572 562 551 531 509 489 464 430 397 379 379 392 409 419 421 422 434 458 480 486 475 464 468 485 500 497 473 447 439
3127 439 451 465 462 438 402 367 345 337 336 334 330 333 346 360 369 381 402 424 437 443 449 459 466 465 456 435 395 345 305 290 300 322 351 385 417 435 434 422 415 421 432 437 440
3122 440 455 491 531 546 526 488 460 451 453 458 461 457 440 410 380 361 353 345 336 334 348 368 374 362 346 341 351 370 390 408 416 409 389 370 363 371 386 397 397 395 392 380 355 330
3116 330 329 349 362 353 339 344 364 377 376 373 378 386 394 403 415 426 436 445 449 442 423 406 402 410 422 426 420 405 388 374 361 349 340 341 347 350 348 349 360 382 411 443 473 497 514 518
3111 518 501 470 446 450 471 483 479 476 489 511 527 533 533 531 527 524 521 514 502 486 470 457 455 463 469 459 440 437 454 473 480 484 496 506 502 488 483 493 509 522 528 522 510 509 530
3105 530 562 579 578 574 581 595 602 596 586 588 611 644 666 666 659 661 662 649 629 627 649 676 697 721 757 800 841 889 954 1035 1115 1182 1229 1257 1271 1276 1272 1254 1219 1172 1118
3100 1118 1057 990 927 881 856 842 827 810 797 784 757 709 661 649 686 736 756 739 714 706 705 697 679 662 647 634 624 619 621 621 617 609 600 600 616 642 661 668 670 673 673
3095 673 671 677 692 698 674 631 605 612 632 640 631 626 640 670 701 716 714 703 698 706 723 740 751 750 741 733 735 751 773 799 829 858 879 891 899 911 927 942 958 982 1013 1046
3090 1046 1077 1114 1172 1253 1339 1403 1433 1431 1407 1368 1322 1281 1252 1225 1191 1148 1106 1078 1073 1091 1127 1164 1196 1227 1270 1323 1380 1433 1485 1535 1581 1625 1670 1709 1723
3086 1723 1696 1633 1555 1477 1408 1353 1315 1288 1264 1235 1200 1166 1137 1115 1102 1095 1094 1094 1091 1081 1071 1071 1084 1098 1095 1073 1044 1020 1003 996 999 1006 1006 995 987 995 1009 1008 990 976 983
3081 983 1002 1016 1018 1013 1005 995 989 994 1007 1021 1034 1047 1054 1045 1025 1014 1022 1035 1035 1021 1006 996 989 982 979 983 989 995 1000 1007 1015 1028 1042 1053 1053 1044 1031 1019 1007 1003 1014 1037 1055 1055 1040 1022
3075 1022 1008 999 994 992 983 966 949 946 957 970 973 968 962 961 965 977 996 1016 1031 1040 1046 1046 1035 1010 979 950 925 903 885 877 882 900 925 948 960 954 934 907 882 866 859 858 862 874
3070 874 888 894 878 849 825 821 837 862 880 882 864 834 812 813 836 872 908 931 935 921 906 903 915 925 920 893 850 811 790 790 797 802 809 829 856 875 876 871 872 873 867 851 833
3064 833 819 805 793 783 779 782 796 823 852 867 864 851 844 851 866 876 872 858 845 840 844 856 874 894 914 928 934 929 915 904 907 925 944 950 942 924 904 896 913 953 994 1021
3059 1021 1034 1042 1048 1049 1057 1083 1117 1143 1159 1183 1224 1267 1291 1298 1302 1312 1330 1355 1390 1429 1461 1484 1507 1539 1576 1610 1644 1681 1724 1766 1804 1845 1901 1971 2034 2068 2067 2051
3055 2051 2041 2042 2044 2035 2013 1987 1966 1954 1949 1946 1938 1921 1901 1890 1893 1901 1898 1882 1869 1874 1892 1915 1942 1981 2028 2063 2078 2084 2102 2137 2178 2219 2260 2301 2339 2371 2407 2454 2505 2543
3050 2543 2552 2539 2525 2529 2555 2598 2650 2704 2750 2783 2813 2852 2908 2977 3055 3136 3216 3285 3339 3378 3407 3436 3476 3528 3580 3617 3635 3648 3666 3691 3720 3750 3786 3833 3892
3045 3892 3959 4026 4089 4154 4229 4310 4388 4460 4533 4619 4727 4858 5010 5169 5316 5448 5583 5738 5910 6084 6254 6426 6609 6804 7009 7219
3042 7219 7429 7632 7820 7990 8142 8285 8439 8623 8845 9097 9369 9656 9964 10305 10689 11126 11628 12202 12850 13570 14368 15267 16296
3039 16296 17483 18861 20494 22469 24887 27873 31601 36279 42091 49152 57510 67152 77974 89707 101766 113023
3037 113023 121697 125735 123708 115689 103371 89256 75571 63634 53882 46211 40273 35666 32043 29147 26795 24839
3035 24839 23164 21692 20377 19188 18114 17149 16282 15492 14761 14094 13504 12988 12529 12107 11710 11333 10982 10670 10405 10185 10003
3033 10003 9854 9740 9654 9583 9508 9415 9295 9137 8929 8662 8345 8007 7678 7373 7095 6844 6629 6452 6297 6146 5987 5825 5662 5497
3030 5497 5333 5183 5061 4964 4878 4785 4685 4586 4491 4396 4296 4191 4091 4005 3932 3870 3810 3752 3703 3667 3635 3595 3542 3486 3435 3385 3334 3292 3270 3269 3276 3285
3026 3285 3297 3312 3321 3314 3291 3247 3180 3099 3025 2970 2926 2881 2844 2830 2834 2835 2820 2800 2793 2808 2842 2892 2944 2983 3006 3028 3068 3135 3227 3336 3436 3492 3482 3420 3337 3256
3022 3256 3181 3117 3070 3042 3029 3032 3058 3106 3163 3211 3244 3267 3284 3302 3324 3354 3393 3447 3514 3583 3645 3701 3760 3818 3859 3877 3883 3894 3914 3938 3963 3990 4017 4040 4064
3017 4064 4095 4145 4214 4292 4362 4416 4460 4511 4575 4653 4743 4843 4941 5024 5093 5169 5264 5368 5467 5567 5679 5806 5938 6073 6218 6373 6532 6691 6859
3014 6859 7042 7242 7452 7669 7892 8121 8356 8597 8849 9117 9410 9725 10047 10359 10655 10945 11244 11559 11894 12242 12593 12942 13285
3011 13285 13617 13927 14218 14517 14856 15252 15696 16170 16666 17193 17772 18420 19140 19932 20808 21794 22912 24170 25574 27147 28928
3008 28928 30994 33460 36469 40178 44785 50546 57743 66612 77310 89921 104436 120667 138134 155881 172187
3007 172187 184468 189845 186422 174456 156421 135853 115881 98395 84064 72754 63961 57115 51735 47454 43981
3005 43981 41093 38644 36539 34693 33030 31507 30111 28835 27673 26627 25704 24896 24188 23569 23036 22569 22147 21764 21427
3002 21427 21136 20883 20657 20452 20257 20071 19898 19734 19560 19369 19177 19008 18861 18733 18638 18595 18592 18606 18638 18707 18818 18951 19092 19238 19390
2999 19390 19540 19689 19847 20019 20206 20413 20653 20928 21235 21575 21951 22356 22789 23275 23845 24504 25229 26010 26864 27816 28887 30101
2997 30101 31500 33142 35101 37466 40345 43863 48175 53465 59914 67645 76701 87038 98511 110783 123134 134220
2995 134220 142086 144748 141205 132157 119762 106591 94605 84787 77343 72057 68578 66608 65990 66665 68619 71918 76726
2993 76726 83246 91628 101948 114211 128296 143877 160287 176262 189663 197667 197778 189177 173362 153496 132976
2991 132976 114249 98459 85747 75735 67882 61670 56681 52595 49175 46245 43668 41351 39242 37317 35557 33949
2989 33949 32482 31159 29973 28911 27958 27098 26310 25575 24887 24252 23668 23128 22631 22182 21781 21416 21075 20747 20409 20032 19607
2986 19607 19158 18722 18328 17985 17693 17436 17196 16970 16767 16599 16464 16348 16235 16113 15983 15858 15748 15646 15543 15445 15368 15315 15279 15258
2983 15258 15259 15286 15334 15398 15484 15596 15732 15895 16091 16322 16579 16849 17125 17399 17670 17951 18260 18598 18960 19355 19819 20386 21075 21890 22820
2980 22820 23833 24889 25958 27010 27994 28838 29492 29959 30281 30528 30794 31190 31799 32684 33909 35568 37757 40555 44045 48347
2978 48347 53582 59833 67127 75432 84621 94411 104333 113719 121728 127456 130178 129615 126040 120154 112819 104854 96935
2976 96935 89581 83152 77853 73734 70722 68658 67327 66467 65784 64977 63790 62050 59714 56884 53774 50619 47608 44861
2974 44861 42453 40421 38755 37408 36330 35474 34796 34262 33854 33563 33375 33272 33255 33347 33587 34014 34674 35608 36836 38367 40208
2971 40208 42369 44845 47602 50579 53670 56719 59539 61960 63882 65317 66409 67431 68731 70658 73499 77457 82628
2969 82628 88989 96393 104559 113064 121357 128808 134762 138537 139458 137014 131125 122304 111546 100020 88756 78471
2967 78471 69541 62060 55942 51014 47076 43929 41398 39358 37730 36455 35473 34720 34128 33630 33149 32599 31889 30952 29771
2965 29771 28393 26903 25392 23935 22579 21352 20262 19301 18451 17685 16982 16333 15734 15176 14637 14104 13578 13073 12604 12185
2962 12185 11816 11484 11170 10866 10579 10313 10056 9799 9544 9296 9049 8798 8547 8310 8094 7899 7721 7560 7406 7249 7084 6913 6739
2959 6739 6563 6387 6226 6092 5981 5875 5754 5617 5473 5334 5198 5062 4932 4819 4730 4661 4602 4544 4476 4392 4298 4209 4135 4069 4002 3929 3856
2956 3856 3792 3740 3702 3667 3625 3572 3516 3467 3428 3396 3368 3337 3288 3219 3151 3105 3081 3054 3011 2962 2922 2895 2876 2861 2842 2820 2803 2803 2817 2831 2835 2832 2827 2814 2789 2764
2952 2764 2757 2772 2792 2804 2817 2837 2862 2874 2867 2850 2843 2855 2881 2907 2925 2943 2974 3023 3080 3131 3176 3221 3269 3314 3349 3379 3413 3452 3493 3526 3547 3558 3567 3584 3610 3637
2947 3637 3662 3695 3744 3802 3856 3898 3936 3972 4005 4036 4074 4122 4169 4205 4234 4271 4324 4390 4456 4512 4558 4599 4642 4688 4737 4794 4864 4945 5025 5103 5184 5279 5384 5493
2943 5493 5602 5713 5827 5954 6110 6301 6519 6746 6973 7192 7402 7613 7840 8082 8317 8527 8712 8881 9027 9132 9198 9241 9277 9314
2940 9314 9364 9436 9526 9619 9714 9832 9987 10170 10363 10553 10742 10935 11140 11362 11599 11851 12123 12424 12752 13094 13446 13817 14218 14641 15078
2937 15078 15531 16013 16525 17061 17620 18216 18869 19594 20396 21275 22242 23305 24463 25693 26960 28232 29477 30653 31719 32655
2935 32655 33473 34219 34965 35799 36796 38009 39496 41349 43683 46596 50164 54475 59632 65710 72721 80591 89164 98177
2932 98177 107252 115908 123577 129627 133480 134810 133675 130474 125770 120137 114102 108123 102566 97693 93660 90522 88239
2930 88239 86705 85773 85266 84992 84791 84578 84360 84217 84289 84769 85864 87728 90409 93839 97851 102191 106538 110503 113641 115527
2928 115527 115887 114709 112230 108817 104859 100720 96726 93164 90263 88179 86972 86612 87019 88090 89683 91593 93593 95485
2926 95485 97123 98395 99235 99661 99786 99797 99940 100513 101818 104096 107488 112050 117756 124475 131950 139800 147526 154566 160368
2923 160368 164432 166299 165579 162116 156163 148379 139610 130671 122227 114758 108527 103602 99934 97393 95769 94805 94295 94124
2921 94124 94232 94622 95398 96740 98798 101635 105297 109841 115279 121566 128684 136664 145472 154949 164886 175072 185254
2919 185254 195201 204770 213449 219454 219636 211166 193879 170939 147013 125716 108523 95352 85535 78292 72891 68789
2917 68789 65667 63289 61416 59862 58530 57327 56124 54829 53436 51973 50448 48886 47351 45882 44456 43036 41621
2915 41621 40221 38835 37464 36126 34820 33518 32203 30895 29611 28350 27123 25972 24921 23963 23089 22308 21629 21031
2913 21031 20501 20044 19657 19304 18955 18608 18266 17913 17544 17181 16846 16540 16259 16025 15857 15750 15685 15657 15659 15662 15640 15588 15495 15331 15086 14805
2910 14805 14560 14395 14331 14389 14592 14927 15363 15871 16420 16955 17406 17720 17863 17804 17531 17071 16474 15777 14996 14163 13324 12521 11781 11129
2907 11129 10580 10118 9706 9321 8967 8645 8347 8061 7789 7533 7293 7077 6893 6741 6619 6531 6478 6443 6404 6355 6305 6258 6214 6180 6161 6140
2904 6140 6090 6007 5903 5778 5628 5457 5277 5087 4878 4664 4482 4349 4254 4186 4143 4115 4078 4025 3976 3949 3941 3947 3963 3982 3989 3986 3999 4046 4110 4165 4202
2900 4202 4219 4208 4172 4128 4098 4080 4063 4047 4044 4052 4062 4066 4060 4042 4021 4009 4007 3994 3965 3939 3934 3933 3901 3834 3764 3724 3716 3722 3726 3730 3751 3798 3858 3905 3926 3937 3949 3947 3915 3867
2895 3867 3825 3788 3737 3670 3608 3563 3524 3490 3477 3494 3521 3541 3557 3583 3620 3656 3685 3712 3739 3762 3776 3796 3838 3913 4010 4108 4199 4292 4399 4513 4616 4700 4772
2891 4772 4843 4916 4989 5063 5146 5250 5385 5559 5774 6029 6328 6670 7043 7437 7853 8299 8777 9273 9778 10297 10831 11376 11918 12445 12957
2888 12957 13468 13994 14544 15098 15616 16064 16431 16725 16943 17066 17066 16917 16619 16199 15707 15187 14658 14118 13564 13012 12499 12062 11727
2885 11727 11495 11350 11270 11234 11219 11199 11150 11065 10952 10818 10660 10462 10217 9938 9652 9384 9141 8921 8726 8562 8438 8351 8296 8275 8297 8367
2882 8367 8475 8596 8715 8841 8990 9160 9333 9501 9676 9871 10087 10319 10570 10841 11108 11333 11498 11618 11722 11826 11920 11972 11958 11886
2879 11886 11798 11717 11622 11473 11263 11024 10785 10543 10288 10024 9766 9525 9309 9132 9004 8923 8875 8856 8867 8902 8941 8958 8937 8866 8741 8560 8333
2876 8333 8072 7779 7449 7081 6692 6309 5945 5601 5285 5010 4785 4597 4429 4281 4158 4058 3967 3873 3769 3649 3511 3366 3233 3114
2873 3114 2998 2882 2777 2692 2620 2561 2521 2507 2507 2512 2525 2554 2588 2613 2632 2663 2713 2774 2829 2869 2897 2921 2951 2991 3038 3084 3129 3180 3239 3294 3330 3339 3321 3282
2869 3282 3227 3148 3041 2915 2793 2697 2627 2566 2506 2449 2393 2327 2243 2144 2044 1952 1871 1802 1744 1694 1647 1602 1559 1526 1506 1501 1510 1528 1541 1537 1520 1506 1507 1516 1516
2864 1516 1503 1490 1482 1473 1456 1436 1417 1397 1368 1337 1317 1311 1306 1289 1265 1248 1245 1251 1255 1250 1238 1218 1197 1185 1191 1208 1214 1195 1159 1125 1100 1075 1051 1033 1017 993 961 938 934 945
2859 945 957 964 961 941 908 882 875 880 883 887 902 925 948 967 982 993 1001 1016 1038 1052 1050 1049 1069 1103 1131 1149 1175 1214 1247 1260 1265 1274 1278 1268 1249 1244 1262 1300 1341 1371 1383
2854 1383 1383 1388 1404 1423 1437 1446 1454 1461 1464 1463 1456 1442 1424 1411 1412 1426 1441 1442 1422 1383 1341 1311 1297 1291 1284 1272 1256 1239 1227 1226 1231 1231 1222 1210 1204 1203 1208 1222 1249 1289 1332 1369 1392 1402
2849 1402 1408 1416 1425 1431 1441 1464 1498 1532 1564 1598 1630 1642 1626 1603 1592 1593 1583 1557 1529 1518 1526 1540 1552 1567 1592 1632 1679 1723 1761 1795 1825 1852 1880 1913 1942 1952 1939
2844 1939 1919 1906 1893 1869 1835 1801 1769 1735 1701 1674 1661 1665 1680 1700 1714 1718 1720 1725 1734 1742 1751 1767 1789 1801 1791 1757 1712 1672 1644 1625 1610 1591 1562 1516 1460 1415 1396 1400
2840 1400 1404 1396 1381 1374 1377 1387 1406 1433 1462 1480 1482 1467 1437 1398 1362 1337 1322 1312 1303 1298 1300 1309 1318 1315 1297 1281 1289 1323 1362 1384 1388 1388 1393 1401 1408 1411 1407 1400 1396 1395 1383 1351 1309 1278 1266
2834 1266 1263 1257 1247 1232 1206 1169 1132 1108 1102 1105 1111 1121 1137 1157 1168 1166 1158 1157 1166 1171 1163 1157 1168 1196 1223 1241 1257 1278 1293 1286 1259 1241 1251 1279 1299 1299 1302 1327 1364 1393 1415 1455
2829 1455 1516 1569 1592 1591 1588 1589 1592 1610 1647 1690 1717 1727 1740 1767 1804 1853 1915 1980 2030 2064 2095 2119 2123 2099 2063 2027 1989 1947 1910 1879 1842 1783 1711 1645 1594 1556 1530
2825 1530 1516 1514 1515 1512 1500 1477 1443 1405 1369 1335 1305 1286 1285 1300 1321 1339 1350 1355 1363 1384 1420 1458 1486 1500 1508 1511 1508 1498 1482 1466 1450 1441 1443 1457 1480 1504 1524 1544 1570 1608
2820 1608 1655 1704 1746 1780 1802 1812 1815 1821 1835 1859 1892 1936 1987 2042 2093 2132 2146 2128 2088 2039 1988 1923 1831 1723 1618 1533 1470 1422 1386 1356 1328 1301 1275 1252
2816 1252 1225 1190 1147 1114 1104 1109 1108 1087 1059 1042 1037 1038 1051 1090 1152 1211 1255 1298 1364 1456 1546 1603 1606 1553 1459 1352 1254 1178 1122 1088 1074 1076 1085 1093 1095 1084 1055 1014
2811 1014 972 941 922 906 888 875 876 888 896 898 906 927 948 949 929 902 881 871 877 895 913 916 915 929 962 992 1000 988 970 963 975 1003 1030 1041 1039 1044 1064 1081 1087 1097 1123
2806 1123 1153 1172 1179 1186 1192 1194 1197 1209 1223 1220 1197 1170 1152 1146 1150 1161 1180 1203 1230 1255 1270 1269 1261 1259 1266 1277 1290 1307 1327 1349 1376 1417 1466 1512 1541 1553 1549 1534 1518 1511 1515 1524
2801 1524 1535 1548 1564 1582 1598 1607 1605 1602 1620 1664 1715 1753 1781 1816 1857 1891 1913 1928 1935 1928 1921 1935 1971 2009 2035 2058 2088 2121 2147 2171 2205 2251 2301 2351 2402 2457 2518
2796 2518 2588 2667 2749 2824 2881 2918 2941 2973 3026 3089 3140 3172 3201 3245 3309 3388 3472 3553 3623 3686 3754 3830 3904 3968 4028 4097 4184 4292 4417 4543 4656 4758
2792 4758 4862 4973 5079 5176 5279 5404 5552 5717 5898 6096 6307 6525 6749 6974 7193 7408 7634 7890 8172 8468 8773 9094 9440
2790 9440 9814 10225 10681 11190 11761 12402 13113 13875 14657 15431 16169 16844 17429 17914 18302 18619 18908 19231 19653 20230 21018 22068 23431
2787 23431 25158 27312 29965 33186 37018 41485 46581 52243 58320 64571 70660 76152 80534 83318 84200 83166 80486
2785 80486 76605 72011 67149 62388 58022 54253 51182 48817 47097 45916 45127 44554 44009 43323 42367 41074 39457 37605
2782 37605 35646 33703 31877 30238 28821 27625 26632 25828 25202 24735 24401 24178 24050 24006 24039 24144 24326 24592 24962 25458 26104
2780 26104 26919 27930 29158 30613 32283 34147 36172 38296 40423 42448 44281 45858 47154 48216 49181 50247 51626 53503
2778 53503 56033 59313 63373 68163 73550 79299 85066 90439 94998 98330 100025 99728 97267 92776 86701 79691 72417
2776 72417 65435 59109 53631 49052 45323 42332 39965 38135 36769 35776 35049 34510 34123 33869 33713 33608 33508 33357 33099 32702
2773 32702 32176 31571 30947 30366 29877 29506 29254 29117 29097 29201 29431 29782 30249 30828 31511 32289 33154 34098 35114 36204 37374 38611
2770 38611 39860 41034 42044 42826 43374 43746 44056 44438 45011 45865 47077 48719 50870 53623 57100 61444 66800 73305 81075
2768 81075 90177 100585 112133 124456 136911 148517 158038 164250 166337 164189 158430 150162 140601 130817 121620 113576
2766 113576 107032 102139 98878 97104 96609 97160 98500 100356 102470 104657 106865 109193 111852 115088 119067 123738 128732
2764 128732 133363 136761 138103 136894 133156 127413 120477 113155 106084 99705 94303 90019 86858 84738 83536 83106 83267
2762 83267 83819 84576 85377 86093 86651 87075 87484 88021 88759 89656 90570 91318 91753 91861 91798 91875 92457 93875 96375 100111 105148 111434
2759 111434 118788 126904 135365 143646 151100 156960 160400 160706 157532 151140 142429 132688 123185 114817 107982 102661 98583
2757 98583 95392 92774 90553 88720 87397 86764 86986 88192 90458 93782 98059 103072 108509 113971 118984 123024 125565 126117
2755 126117 124314 120062 113688 105932 97729 89918 83073 77463 73108 69854 67482 65788 64593 63712 62964 62221 61444 60666
2753 60666 59974 59481 59291 59457 59982 60862 62114 63775 65919 68701 72333 77026 82923 90107 98600 108322 119006 130110
2751 130110 140747 149694 155611 157485 155043 148866 140111 130078 119867 110258 101735 94562 88842 84536 81485 79454
2749 79454 78162 77305 76557 75581 74077 71852 68884 65336 61491 57656 54071 50889 48172 45903 44021 42464 41186 40140
2747 40140 39269 38536 37931 37453 37100 36879 36812 36907 37155 37549 38117 38896 39912 41179 42729 44597 46807 49354 52197 55227 58253
2744 58253 61046 63397 65176 66368 67127 67771 68698 70281 72810 76491 81425 87575 94771 102730 111067 119285 126770 132790
2742 132790 136485 136968 133623 126470 116304 104458 92358 81129 71409 63374 56895 51723 47611 44333 41683 39501
2740 39501 37685 36185 34969 34009 33275 32719 32269 31851 31389 30793 29978 28905 27611 26187 24732 23330 22040 20882 19841
2737 19841 18902 18072 17365 16764 16229 15732 15266 14832 14423 14029 13642 13251 12851 12444 12044 11664 11310 10989 10703 10447 10207 9972 9735
2735 9735 9498 9269 9058 8867 8688 8513 8339 8165 7990 7812 7636 7463 7290 7107 6914 6718 6533 6368 6217 6066 5907 5754 5622
2732 5622 5506 5389 5262 5137 5028 4931 4836 4743 4656 4570 4476 4377 4282 4197 4121 4050 3987 3933 3884 3835 3778 3719 3667 3625 3581 3525 3462 3405 3351 3289 3219 3167
2728 3167 3148 3148 3143 3122 3093 3070 3058 3056 3054 3043 3026 3019 3032 3053 3069 3082 3098 3110 3111 3100 3084 3066 3037 2998 2959 2927 2893 2844 2773 2695 2634 2595 2565 2527 2484 2452 2433
2723 2433 2414 2384 2342 2294 2246 2211 2205 2224 2245 2258 2268 2280 2282 2271 2258 2255 2249 2224 2183 2143 2108 2073 2040 2018 2004 1987 1963 1937 1910 1876 1839 1809 1787 1763 1736 1711
2719 1711 1695 1689 1692 1705 1721 1734 1744 1761 1783 1812 1849 1896 1936 1953 1949 1945 1945 1936 1910 1880 1866 1867 1873 1880 1890 1900 1900 1887 1872 1862 1851 1832 1808 1790 1784 1784 1789 1807 1845 1890 1921
2714 1921 1935 1950 1971 1982 1968 1937 1912 1897 1883 1868 1856 1837 1802 1753 1707 1678 1662 1648 1633 1621 1619 1630 1653 1674 1680 1671 1656 1638 1616 1586 1555 1534 1531 1546 1573 1601
2710 1601 1622 1640 1656 1667 1669 1669 1678 1702 1742 1795 1848 1888 1917 1952 2003 2059 2110 2157 2206 2245 2265 2278 2301 2332 2355 2362 2365 2374 2393 2423 2468 2516 2555 2589 2630 2683 2739
2705 2739 2799 2872 2950 3010 3038 3041 3032 3014 2982 2935 2878 2825 2791 2779 2772 2755 2739 2748 2791 2857 2942 3055 3190 3323 3434 3529 3622 3708 3766 3774 3724 3625 3503 3393
2701 3393 3310 3257 3230 3233 3262 3303 3349 3402 3462 3523 3591 3680 3786 3885 3951 3976 3967 3930 3870 3793 3704 3608 3518 3456 3429 3428 3441 3465 3493 3506 3490 3443 3368 3272 3169
2697 3169 3080 3014 2967 2928 2891 2854 2815 2781 2760 2748 2740 2744 2772 2813 2837 2832 2808 2774 2720 2642 2552 2458 2356 2255 2173 2121 2085 2050 2025 2017 2018 2016 2011 2007 1997 1979 1965
2692 1965 1961 1948 1917 1886 1877 1874 1849 1795 1733 1681 1635 1591 1554 1526 1503 1480 1461 1445 1435 1433 1435 1432 1425 1428 1452 1488 1518 1542 1571 1606 1636 1648 1639 1619 1607 1621 1654 1680 1685
2687 1685 1678 1674 1671 1666 1666 1672 1672 1662 1663 1695 1739 1764 1764 1762 1770 1780 1788 1795 1802 1805 1806 1811 1812 1802 1782 1760 1738 1709 1681 1657 1631 1594 1558 1541 1541 1547 1556 1565 1559 1527 1492 1481 1487 1481 1454 1431 1427
2682 1427 1433 1439 1452 1477 1510 1545 1580 1608 1624 1634 1652 1670 1670 1645 1611 1580 1552 1523 1494 1463 1424 1390 1382 1402 1427 1437 1441 1456 1491 1544 1605 1655 1680 1689 1700 1719 1738
2677 1738 1758 1787 1824 1850 1849 1822 1779 1728 1680 1645 1620 1597 1577 1562 1537 1488 1425 1374 1345 1329 1318 1319 1331 1343 1350 1363 1384 1409 1441 1482 1517 1526 1519 1523 1539 1537 1502 1454
2672 1454 1422 1410 1416 1439 1473 1501 1514 1524 1541 1560 1579 1607 1639 1655 1649 1639 1645 1661 1672 1682 1706 1738 1766 1783 1792 1794 1791 1785 1773 1752 1732 1726 1722 1692 1628 1551 1486 1434 1387
2668 1387 1351 1331 1323 1322 1330 1340 1341 1342 1367 1416 1460 1479 1487 1500 1509 1500 1484 1481 1492 1503 1508 1513 1527 1560 1620 1697 1777 1859 1958 2073 2179 2273 2378 2511 2650 2771 2877
2663 2877 2973 3047 3083 3088 3069 3022 2950 2881 2837 2804 2759 2704 2648 2592 2534 2490 2477 2486 2498 2509 2521 2525 2521 2527 2558 2596 2616 2619 2616 2609 2590 2565 2539 2505 2462 2436 2440 2453 2447
2658 2447 2429 2422 2428 2439 2463 2511 2573 2634 2701 2777 2843 2881 2911 2967 3044 3118 3181 3246 3312 3372 3442 3533 3624 3694 3766 3875 4013 4138 4236 4326 4418 4497 4566 4639
2654 4639 4707 4734 4716 4680 4645 4603 4551 4511 4494 4498 4525 4584 4667 4747 4819 4897 4986 5068 5141 5223 5326 5438 5550 5667 5785 5900 6018 6157 6318 6483
2651 6483 6645 6812 6980 7143 7312 7506 7722 7938 8160 8414 8710 9035 9390 9792 10249 10749 11293 11897 12570 13315 14139 15045 16006
2648 16006 16977 17922 18804 19549 20086 20407 20576 20674 20781 20998 21423 22106 23054 24302 25929 28017 30638 33879 37840 42588 48153
2645 48153 54558 61786 69676 77857 85748 92567 97407 99498 98551 94903 89321 82687 75784 69210 63351 58402 54451
2643 54451 51517 49516 48261 47535 47143 46881 46495 45747 44492 42708 40479 37991 35478 33126 31026 29207 27687 26460
2641 26460 25480 24692 24060 23558 23154 22841 22632 22525 22486 22503 22605 22818 23140 23580 24176 24956 25915 27060 28435 30062 31910 33928
2638 33928 36072 38258 40328 42109 43507 44525 45261 45914 46769 48102 50117 52961 56729 61424 66934 73067 79556 85994
2636 85994 91797 96291 98840 98933 96304 91103 83950 75755 67425 59671 52934 47366 42892 39343 36556 34372 32625 31201
2634 31201 30057 29155 28421 27804 27326 27009 26794 26596 26372 26098 25715 25175 24501 23757 22993 22261 21635 21146 20740 20356 20010 19749
2631 19749 19571 19456 19428 19519 19701 19935 20248 20694 21274 21954 22730 23592 24439 25095 25385 25195 24515 23488 22379 21408 20624 19984 19479
2628 19479 19118 18863 18672 18565 18564 18617 18655 18698 18794 18924 19033 19140 19293 19476 19646 19824 20046 20278 20472 20667 20935 21255 21558 21846 22169
2625 22169 22509 22816 23112 23451 23803 24103 24384 24729 25128 25507 25873 26297 26780 27275 27805 28434 29128 29805 30484 31250 32092 32922 33745
2622 33745 34643 35607 36550 37478 38483 39577 40696 41855 43136 44522 45916 47329 48864 50534 52271 54096 56104 58259
2620 58259 60412 62511 64571 66480 68047 69286 70417 71582 72796 74153 75830 77839 80062 82541 85457 88828 92520
2618 92520 96573 101202 106445 112183 118537 125877 134420 144231 155684 169515 186415 207169 233285 266903 309813
2616 309813 363033 427257 502925 589710 686486 790785 895088 982075 1026878 1009961 931387 812588 683503
2615 683503 567130 473378 402403 350203 311973 283559 262094 245786 233283 223487 215721 209634 204920 201333
2613 201333 198846 197584 197722 199563 203578 210313 220506 235302 256051 283776 319029 362134 413171 471787 537058
2611 537058 606192 671266 717401 727685 693799 623111 534662 447771 373686 315300 271103 238141 213236 193855
2609 193855 178530 166340 156328 147697 140148 133572 127649 122061 116804 111972 107436 103001 98676 94553 90595 86779
2608 86779 83252 80131 77328 74737 72420 70437 68654 66923 65287 63823 62433 60956 59362 57663 55772 53644 51435
2605 51435 49359 47457 45674 44028 42567 41240 39967 38769 37689 36668 35628 34601 33654 32762 31870 31010 30228 29476 28694
2603 28694 27918 27203 26499 25733 24943 24206 23496 22751 21998 21314 20690 20069 19456 18894 18372 17859 17381 16976 16604 16213 15827 15492 15169
2600 15169 14796 14394 14024 13675 13304 12937 12636 12385 12121 11839 11574 11314 11014 10694 10411 10167 9921 9664 9413 9147 8837 8521 8262
2597 8262 8057 7860 7669 7515 7386 7247 7110 7011 6930 6823 6696 6589 6492 6371 6241 6144 6062 5948 5806 5679 5560 5416 5260 5143 5062
2594 5062 4977 4895 4854 4845 4818 4769 4733 4698 4616 4492 4387 4318 4245 4151 4074 4025 3971 3910 3877 3875 3870 3849 3842 3855 3854 3829 3812 3807 3781 3730 3692 3676 3639 3570 3511 3493
2590 3493 3492 3484 3472 3462 3438 3411 3413 3442 3454 3429 3402 3399 3402 3392 3386 3401 3425 3445 3475 3516 3556 3594 3645 3695 3702 3659 3598 3539 3466 3378 3303 3251 3198 3140 3115 3137 3160 3143
2585 3143 3098 3051 2998 2931 2873 2839 2809 2763 2714 2678 2643 2591 2529 2472 2413 2348 2293 2260 2241 2234 2247 2276 2297 2300 2303 2315 2322 2317 2312 2304 2271 2217 2180 2177 2177 2158 2137 2130 2117
2581 2117 2080 2035 1996 1950 1890 1842 1827 1826 1816 1807 1811 1812 1797 1780 1771 1744 1687 1637 1635 1670 1702 1719 1731 1735 1722 1708 1705 1695 1657 1614 1602 1613 1610 1581 1544 1516 1499 1494 1497 1491
2576 1491 1463 1427 1408 1409 1417 1432 1447 1440 1404 1368 1357 1358 1348 1337 1348 1373 1382 1372 1370 1386 1408 1427 1439 1429 1388 1338 1305 1291 1274 1254 1244 1241 1226 1198 1172 1149 1121 1096
2571 1096 1090 1094 1086 1067 1060 1063 1053 1028 1016 1040 1086 1121 1131 1121 1109 1110 1123 1128 1114 1095 1089 1097 1107 1120 1146 1179 1203 1213 1220 1231 1241 1255 1278 1299 1304 1294 1278 1262 1244 1234
2566 1234 1237 1252 1273 1311 1366 1413 1431 1432 1443 1457 1452 1426 1401 1385 1370 1354 1344 1338 1325 1312 1317 1338 1353 1351 1342 1338 1344 1367 1404 1432 1434 1420 1415 1416 1402 1373 1347 1326 1299 1277
2561 1277 1282 1310 1326 1318 1309 1309 1298 1267 1233 1214 1206 1204 1218 1244 1255 1241 1223 1221 1225 1221 1217 1228 1250 1269 1282 1296 1315 1345 1383 1410 1406 1379 1362 1372 1385 1379 1363 1355 1348 1327 1296
2556 1296 1272 1260 1252 1242 1229 1215 1205 1204 1205 1195 1176 1163 1161 1157 1151 1157 1180 1199 1200 1191 1179 1158 1122 1088 1067 1049 1027 1015 1023 1034 1027 1006 995 1002 1020 1041 1054 1048 1018 980 956
2551 956 947 945 951 973 1001 1017 1018 1013 1013 1021 1036 1054 1065 1063 1051 1032 1006 975 948 933 930 942 973 1014 1045 1057 1061 1069 1071 1048 1002 949 906 883 882 899 920 932 929 912 890 880
2546 880 895 918 917 889 868 874 887 884 871 871 884 894 896 899 902 900 902 916 932 929 915 909 915 911 886 850 821 806 809 832 863 889 904 907 898 879 863 859 862 863 867 879 890 891 885 886
2540 886 888 884 878 888 910 933 954 977 994 996 989 987 995 1000 1005 1020 1046 1067 1079 1086 1090 1084 1066 1050 1039 1021 991 962 945 937 932 932 939 950 963 984 1008 1019 1008 988 973 968 974 996
2535 996 1030 1063 1082 1091 1104 1125 1147 1162 1169 1174 1190 1221 1255 1276 1281 1277 1272 1273 1286 1317 1360 1395 1412 1412 1403 1389 1376 1370 1374 1390 1418 1463 1524 1595 1671 1747 1821 1897 1987 2094
2530 2094 2203 2289 2329 2313 2248 2158 2076 2022 1989 1964 1950 1959 1989 2033 2096 2194 2327 2475 2623 2763 2889 2988 3055 3097 3115 3094 3022 2900 2752 2614
2527 2614 2515 2462 2437 2432 2463 2549 2680 2821 2946 3042 3089 3069 2997 2917 2854 2800 2745 2698 2664 2629 2580 2528 2491 2466 2444 2429 2438 2481 2554 2640 2717 2760 2756 2707
2522 2707 2623 2518 2409 2310 2221 2137 2063 2014 1988 1965 1939 1923 1932 1956 1978 1996 2011 2015 2002 1977 1942 1895 1834 1772 1720 1674 1634 1610 1610 1619 1620 1607 1589 1568 1539 1507
2518 1507 1485 1484 1510 1551 1585 1596 1594 1616 1689 1802 1932 2068 2213 2362 2501 2608 2653 2606 2467 2272 2072 1893 1739 1611 1509 1421 1339 1277
2515 1277 1248 1247 1251 1245 1228 1206 1184 1167 1156 1141 1118 1090 1069 1058 1060 1077 1099 1107 1089 1057 1028 1006 985 969 967 970 960 934 907 893 891 896 898 889 870 855 854 859 856 852 863 880
2509 880 883 863 839 828 825 822 819 822 831 848 871 896 908 907 900 900 908 924 943 960 972 985 1003 1016 1011 990 969 958 947 925 892 856 821 789 760 731 704 693 710 746
2505 746 773 782 786 798 812 811 793 771 757 747 734 719 713 721 741 764 784 800 807 798 781 770 768 764 751 741 738 731 713 701 716 749 774 780 775 771 765 765 777 799 816 828 842
2499 842 862 875 874 867 859 850 845 850 857 850 826 798 776 760 753 763 788 813 831 848 870 891 904 908 901 884 871 872 874 854 816 790 786 778 748 711 690 686 689 701 726 748 753 743
2494 743 734 727 718 711 712 717 719 722 731 736 723 698 682 683 697 718 738 743 726 699 680 669 656 642 636 632 614 582 555 543 539 534 529 527 529 538 562 598 632 654 659 651 633 616 603 583
2488 583 547 505 481 488 511 534 554 577 607 638 666 683 688 680 665 646 626 608 592 574 559 558 572 585 581 567 556 550 541 533 530 518 486 441 409 396 386 370 355
2484 355 351 349 347 352 371 392 403 411 427 451 471 486 503 527 553 572 576 561 535 514 508 513 518 523 535 552 571 589 606 614 599 554 496 451 436 446 461 467 466 469 483 504
2478 504 525 543 556 565 575 591 614 634 642 638 631 631 640 649 649 636 615 594 578 571 571 574 572 564 554 540 519 493 477 487 515 542 553 550 539 526 520 524 531 527 521 535 571 607
2473 607 617 601 581 568 559 543 522 499 484 480 481 476 461 439 416 399 392 399 419 447 476 504 525 530 519 506 498 490 478 469 472 481 485 477 466 461 468 489 519 542 546 532 515
2468 515 509 516 526 526 512 492 477 474 482 495 509 520 530 541 551 555 547 527 504 486 473 455 428 400 387 404 447 494 521 524 515 507 499 483 463 448 451 473 504 527 529
2463 529 515 496 476 456 441 445 472 511 540 548 539 529 528 535 539 534 526 525 535 549 560 562 547 513 469 436 423 426 437 456 481 505 520 529 533 530 519 512 522 546 567 574 570
2457 570 563 555 544 523 489 452 431 441 474 509 526 521 508 497 494 492 485 474 464 457 458 466 478 483 471 450 435 429 426 425 431 444 451 445 439 447 469 489 499 498 490 478 472 478 495 520
2452 520 547 574 597 613 618 602 561 509 472 467 485 508 524 529 526 517 515 522 527 520 511 515 534 556 570 578 587 598 610 617 613 597 575 550 525 505 504 521 532 520 496 478 476
2447 476 482 494 513 529 530 518 509 512 521 534 546 547 529 502 486 486 488 486 482 476 461 447 453 481 505 506 494 486 484 484 486 494 495 480 460 452 458 466 474 492 521 551 570 577 580 585 592 595 581
2441 581 550 514 493 489 491 487 473 455 440 432 433 446 476 520 559 569 547 515 498 504 522 535 532 512 491 489 508 527 530 528 541 567 586 583 568 552 537 522 513 512 514 512
2435 512 508 508 512 512 501 481 462 451 453 455 446 426 406 398 401 409 419 432 451 473 495 511 515 507 498 500 515 529 526 503 472 450 445 456 476 498 514 515 508 503 508 517 518 507 496 497
2430 497 511 527 530 522 511 506 502 495 484 469 450 435 439 471 513 536 533 521 517 520 521 521 522 525 528 528 522 506 489 487 503 518 512 494 485 490 491 470 437 407 391 387 390 395 400 406 419 442
2424 442 471 491 491 474 459 461 473 479 478 482 498 515 519 513 505 493 468 434 410 404 406 405 404 408 421 441 459 467 469 472 478 473 452 430 424 433 438 436 441 461 477 474 456 448 461 481 492
2418 492 484 469 462 473 493 508 513 520 534 545 541 520 496 479 476 479 484 490 500 516 529 531 523 520 528 538 538 528 524 532 541 532 509 489 490 504 518 526 538 557 576 586 588 587 582 571
2413 571 562 559 554 533 500 475 467 467 461 454 464 492 521 535 538 541 548 555 555 545 528 507 489 485 497 507 497 465 428 401 384 375 380 400 419 426 426 435 454 472 489 510 536 551
2407 551 548 535 521 509 500 496 496 492 482 471 466 461 452 443 440 439 437 439 451 468 479 481 484 496 509 509 493 475 467 466 457 442 434 447 469 487 497 508 524 539 546 545 541 538 537 535 522 496
2401 496 468 451 448 450 453 457 461 459 457 468 496 532 561 579 583 570 548 531 522 512 498 485 478 464 440 418 418 439 468 497 533 574 608 620 611 588 565 548 532 506 473
2396 473 449 450 470 496 518 533 535 517 486 460 452 457 467 473 472 463 452 440 429 420 422 439 462 478 488 503 520 529 521 500 480 470 464 451 425 397 387 400 421 436 448
2391 448 459 465 464 467 489 526 559 581 596 602 600 594 589 580 559 532 511 497 478 458 453 465 480 482 476 469 467 477 499 518 516 492 468 460 462 465 468 468 458 434 410 399 397 394 390 391
2386 391 400 418 443 467 472 453 425 405 393 378 357 340 327 313 300 292 291 297 314 346 387 424 445 447 438 425 417 417 421 422 426 438 456 471 484 498 514 525 529 528 530 540
2381 540 559 578 587 583 576 572 570 567 572 591 614 624 611 586 562 544 537 543 555 560 550 529 508 496 494 495 485 458 424 402 401 415 434 451 462 469 472 472 465 450 436 436 450 463
2375 463 464 453 443 440 445 457 467 464 444 421 413 425 447 462 462 449 431 410 393 384 387 397 406 409 411 418 431 444 454 463 472 479 484 491 499 505 504 499 489 476 463 458 464 473 476 476 486 511
2369 511 538 550 546 539 541 547 543 527 504 486 473 463 454 453 467 496 530 553 557 549 541 539 535 524 511 505 509 517 526 539 550 552 544 531 522 524 538 562 582 581 556 519 485 464 456 457
2364 457 462 463 454 436 422 424 448 480 500 501 495 496 501 498 487 481 483 481 468 454 453 464 474 474 468 461 455 454 469 500 540 574 594 600 595 587 577 570 575 594 617 623 604 580 573 581 579 559
2358 559 541 542 552 549 526 501 488 483 477 475 481 487 483 469 459 457 460 459 453 448 450 461 480 495 490 461 425 404 398 394 383 372 376 400 434 467 489 500 500 496 492 487 480 470 459 452 450
2352 450 451 447 428 393 356 338 346 371 399 424 445 458 457 445 435 436 443 449 457 467 468 448 414 387 381 392 408 422 435 447 461 478 493 498 491 481 475 471 463 456 452 449 445 442 441
2347 441 432 414 404 416 440 452 442 427 422 428 431 429 426 426 431 443 464 486 498 499 498 505 519 525 511 485 465 461 472 494 522 546 555 543 522 505 487 460 427 411 424 454
2341 454 479 485 471 451 442 449 460 457 439 423 420 429 444 459 466 459 443 429 424 423 423 424 425 427 436 462 496 517 517 508 499 487 462 430 403 384 376 386 413 443 465 479 496 519
2336 519 538 543 528 495 457 429 418 417 421 431 446 457 464 479 500 507 485 454 432 414 387 367 383 430 468 469 450 438 442 451 458 461 457 447 433 422 418 424 437 446 442 434 440
2331 440 456 465 459 456 467 485 500 513 527 536 527 505 484 470 457 441 424 412 402 395 393 394 393 390 388 389 387 378 362 349 347 362 389 415 430 439 451 472 495 507 496 470 448
2326 448 445 457 472 482 490 499 504 501 496 488 473 446 419 407 414 435 464 496 519 526 519 509 498 485 469 456 447 436 425 419 421 426 424 421 422 429 436 440 447 461 479 489 485 474 466 465 463
2320 463 457 447 439 431 417 394 368 351 353 372 399 427 450 461 454 431 411 411 431 455 472 486 503 521 532 536 534 528 519 506 485 455 425 403 389 368 339 316 317 340
2315 340 373 410 445 472 486 488 490 495 500 498 490 479 472 476 487 493 488 484 491 505 514 519 529 543 548 538 518 490 450 402 370 373 405 444 474 494 513 532 549 562 565 559 550 549 554
2309 554 556 549 535 517 498 482 470 463 461 469 485 505 521 530 534 536 534 528 523 521 521 518 510 499 495 503 518 526 513 486 466 462 466 469 472 481 489 484 469 459 463 476 485 491 500 507 500 479 453 434
2303 434 429 442 473 511 535 535 515 486 454 421 397 387 386 387 386 392 408 429 452 476 495 504 507 512 523 532 538 547 562 570 561 542 529 530 532 528 523 523 526 521 502 477 462 467 484 498
2298 498 493 470 447 442 462 495 523 535 531 519 508 500 491 476 455 439 439 457 481 497 500 492 486 490 502 509 495 462 426 410 419 441 462 476 479 474 463 451 438 422 404 389
2293 389 382 383 387 393 396 396 395 398 408 423 441 463 486 503 510 514 525 538 542 537 529 523 508 483 466 474 498 512 503 486 480 485 486 480 476 481 490 497 504 509 510 503 492 485 487 500 515 521 509 486
2286 486 467 455 443 426 418 428 445 452 447 440 433 419 400 393 413 448 476 485 476 461 445 432 416 395 376 366 362 353 335 319 317 326 339 351 366 382 391 394 397 406 418 428 434
2281 434 439 450 464 472 462 430 385 344 319 314 324 338 353 369 389 410 423 423 418 424 443 467 476 465 443 425 423 436 455 470 475 468 451 427 401 375 354 347 354 364 363
2276 363 357 364 391 422 438 445 456 467 461 434 405 394 403 421 441 460 474 480 482 485 485 476 462 454 458 460 448 425 409 411 424 439 452 473 496 506 491 463 442 439 439 428 404
2271 404 376 363 371 398 432 460 471 463 439 407 382 373 374 372 362 355 361 380 404 428 450 470 490 508 524 527 513 486 461 446 440 440 443 445 443 435 425 417 414 419 433 453 470
2266 470 473 461 448 446 456 472 492 510 520 515 493 464 438 421 412 414 427 449 464 465 448 421 390 368 367 396 438 468 475 473 485 514 546 566 576 583 589 587 570 539 502
2261 502 474 468 483 511 538 560 576 583 578 568 561 555 541 523 516 532 562 589 601 599 591 580 568 552 532 517 519 533 537 514 476 446 435 436 442 452 461 459 448 438 437 439 440
2255 440 444 456 475 493 504 505 497 482 471 472 485 497 501 498 493 491 491 489 486 486 492 496 492 477 456 434 410 390 381 384 390 394 395 402 414 428 433 429 426 438 468 498 512 508 497 484 465
2250 465 446 442 453 458 450 447 469 503 518 503 475 456 445 435 425 419 414 401 378 354 345 355 375 395 417 455 509 558 577 567 546 524 499 469 441 421 408 395
2245 395 391 404 437 477 508 518 506 484 469 465 464 458 453 453 457 456 449 445 451 465 478 484 481 471 461 455 449 441 431 425 429 440 450 452 444 431 413 393 379 381 404 439 468 477 475 474 476
2239 476 470 451 426 406 397 391 386 384 388 396 399 398 399 408 425 439 442 437 432 436 445 450 446 440 440 446 449 447 445 450 459 464 464 469 486 508 517 498 460 424 412 426 456 483 501 508 511 514 517 515 506 495 489
2233 489 486 475 449 414 388 381 390 404 417 426 435 444 453 459 457 442 416 391 378 377 377 375 382 408 447 478 488 481 471 464 457 449 437 428 431 451 481 506 519 522 521 512 494 471 450 431
2227 431 417 410 411 413 406 392 379 372 367 365 369 380 395 415 442 469 485 482 463 443 433 438 450 458 455 447 442 442 443 446 452 449 430 399 374 366 370 380 398 418 426 418 401 386 378 383 408
2221 408 444 463 452 428 418 420 412 386 367 371 389 403 409 419 432 443 449 456 463 462 455 453 466 484 489 475 448 419 393 373 363 365 376 395 420 449 473 481 471 449 427
2216 427 411 407 420 435 433 408 379 369 380 400 422 447 468 472 455 436 430 438 450 467 491 516 522 500 460 426 407 400 401 411 434 462 482 486 482 481 485 490 492 489 481 468 452
2211 452 440 436 441 454 476 499 514 517 517 520 523 512 481 436 395 373 376 398 428 458 489 518 536 536 522 507 501 497 485 469 460 462 466 464 455 443 432 426 430 436 431 416 410 431 466
2206 466 487 480 468 477 508 539 551 533 488 429 374 337 324 328 346 373 399 413 412 400 388 381 377 376 375 374 375 382 391 394 388 382 386 402 416 416 405 394 396 413 437 456 458 443
2200 443 422 411 413 418 413 397 376 354 330 312 310 327 355 385 411 426 422 408 404 425 462 498 521 524 505 474 448 434 420 396 373 371 392 414 428 443 470 501 519
2195 519 518 509 506 516 532 540 535 524 515 505 490 481 493 519 530 511 476 453 444 434 411 381 358 350 356 370 382 389 392 397 407 421 433 437 433 430 438 455 474 486 484 459 410 354
2190 354 319 319 342 367 386 397 399 386 362 337 321 320 333 351 358 351 342 342 346 344 341 350 369 385 386 377 373 381 400 422 438 448 457 467 471 466 463 478 508 530 528 507 488 483 482 473
2184 473 452 427 410 405 403 395 382 372 371 371 367 364 367 380 395 403 408 415 432 451 456 442 417 401 403 421 444 461 470 469 462 456 456 460 465 471 482 496 507 503 484 461 447 445 445 443 439 433
2179 433 416 392 376 384 408 428 433 428 421 409 390 368 353 352 364 383 402 413 417 420 428 444 461 470 464 449 436 434 433 418 390 367 363 368 367 356 347 347 351 356 367 382 394 394 384
2173 384 376 379 385 385 378 374 379 380 364 344 345 372 404 426 446 476 508 520 506 480 458 441 428 423 428 432 429 423 429 450 474 483 475 459 449 450 452 446 435 427 427 425 413 393 378 375 383
2167 383 401 425 446 451 440 427 425 435 440 428 404 382 371 372 384 405 432 460 481 488 482 472 467 468 470 472 476 482 483 473 454 436 429 437 457 482 504 525 551 573 574 547 512
2162 512 495 500 515 526 530 529 518 501 480 460 447 448 461 474 472 463 463 472 477 470 460 454 447 433 422 420 418 409 404 419 446 461 455 443 441 446 445 436 425 419 424 442 467 488 496 492 484 474
2156 474 455 430 408 397 394 387 375 366 371 387 404 414 417 419 423 430 435 431 421 412 408 410 416 429 451 473 482 478 472 471 471 466 459 454 451 453 457 453 433 399 368 353 354 369 396 426 437 425
2150 425 409 413 437 463 480 492 503 513 518 515 502 479 453 435 425 419 412 408 405 398 388 380 379 391 420 458 487 489 470 449 438 436 438 445 453 457 458 460 456 436 406 382 375 377 381 395
2145 395 421 450 467 471 467 459 450 448 459 478 488 480 458 433 417 417 430 448 463 474 473 454 424 404 412 440 471 493 503 501 489 474 461 448 430 414 411 427 452 478
2140 478 499 509 501 477 453 442 444 455 470 487 504 516 513 491 451 410 387 383 388 393 401 414 429 445 460 472 469 447 423 416 423 422 405 386 386 406 440 483 526 555 560
2135 560 554 557 573 585 581 564 545 531 527 536 548 544 518 486 469 468 468 466 476 508 550 586 613 633 640 626 587 541 508 506 530 561 575 567 551 540 533 523 507 492 481
2130 481 477 483 494 499 487 460 433 418 416 421 431 448 468 483 493 499 507 517 529 545 567 589 597 584 554 530 526 542 566 590 607 613 605 595 600 628 666 697 705 688 654
2125 654 613 575 547 533 533 540 540 527 504 481 464 455 455 468 490 514 535 552 567 575 574 563 543 522 506 500 507 525 548 568 579 583 584 585 586 587 589 592 596 611 645 698 754
2120 754 801 836 865 891 912 927 943 961 976 981 970 946 918 899 891 881 860 832 808 794 788 794 812 828 822 797 774 763 754 734 707 690 687 691 691 688 683 676 658 626 590
2115 590 569 574 598 618 627 632 642 648 643 632 628 633 639 645 662 698 740 771 779 775 772 778 791 806 824 843 863 877 889 907 934 960 974 971 952 918 871 822 789 778 780 781 779
2109 779 776 767 744 716 703 710 717 702 674 661 673 692 697 686 668 651 639 641 659 686 708 725 737 739 731 727 736 747 742 725 718 730 747 760 775 802 837 873 908 938 952
2104 952 951 952 970 995 1003 983 949 918 900 892 886 881 881 888 895 893 883 876 872 862 846 835 841 855 871 889 914 938 955 972 992 1004 994 965 941 932 934 933 919 888 840 790 753
2099 753 730 712 698 689 682 665 640 623 628 651 679 698 696 673 636 606 593 598 611 627 638 643 647 654 665 671 676 684 692 693 684 678 680 680 672 665 671 680 674 653 635 639 663 690 706 706 697
2093 697 689 688 691 691 687 684 680 673 659 646 643 656 677 691 690 680 672 674 678 671 651 631 630 654 689 718 733 737 731 713 691 680 688 708 724 730 725 713 708 726 767 809 835 853 882
2088 882 917 938 941 944 961 983 991 985 971 957 955 982 1040 1103 1140 1148 1150 1165 1185 1191 1178 1152 1125 1103 1093 1099 1121 1157 1195 1223 1235 1232 1226 1228 1243 1264 1281 1292 1306 1333 1368
2083 1368 1400 1424 1444 1460 1468 1462 1446 1424 1399 1373 1348 1322 1288 1246 1207 1179 1156 1133 1115 1107 1101 1089 1081 1091 1116 1136 1141 1135 1130 1128 1127 1135 1156 1185 1208 1216 1220 1239 1277 1315 1328
2078 1328 1313 1296 1302 1334 1374 1404 1422 1431 1433 1434 1441 1453 1464 1471 1476 1480 1483 1485 1490 1497 1506 1518 1538 1568 1601 1625 1635 1637 1649 1679 1715 1738 1742 1748 1775 1820 1869 1908 1937 1966 2007 2071
2073 2071 2149 2220 2263 2289 2322 2371 2421 2456 2478 2504 2548 2613 2687 2751 2797 2835 2888 2961 3043 3114 3165 3204 3251 3326 3431 3543 3641 3725 3811 3902 3990 4078 4182
2069 4182 4303 4424 4534 4641 4759 4887 5028 5191 5380 5573 5753 5928 6126 6358 6616 6901 7225 7597 8014 8472 8977 9550 10222
2066 10222 11019 11959 13046 14283 15685 17259 18984 20807 22664 24486 26193 27679 28839 29592 29890 29722 29108 28101 26785
2063 26785 25258 23619 21964 20372 18901 17584 16434 15454 14645 13999 13490 13077 12728 12433 12192 11994 11826 11686 11588 11544 11551 11598
2061 11598 11674 11772 11889 12024 12184 12375 12606 12883 13211 13584 13994 14442 14940 15500 16133 16862 17721 18744 19949 21349 22967 24840
2058 24840 27007 29485 32264 35302 38527 41832 45073 48076 50652 52629 53876 54319 53944 52789 50945 48548 45775 42814
2056 42814 39841 36998 34387 32074 30080 28399 27002 25863 24952 24239 23685 23254 22923 22676 22499 22382 22326 22338 22420 22569 22782
2053 22782 23067 23435 23891 24437 25071 25798 26626 27569 28647 29876 31278 32884 34748 36927 39476 42437 45859 49799 54310
2051 54310 59418 65109 71325 77959 84849 91779 98496 104729 110203 114673 117945 119897 120489 119752 117777 114696 110667 105870
2049 105870 100493 94721 88732 82702 76793 71149 65876 61053 56732 52942 49670 46862 44446 42355 40539 38961 37589
2047 37589 36385 35324 34391 33581 32880 32265 31719 31246 30862 30583 30411 30341 30359 30453 30621 30877 31242 31724 32325 33059 33954 35044 36356
2044 36356 37919 39774 41965 44543 47568 51106 55188 59799 64882 70340 76027 81727 87175 92084 96170 99156 100819
2042 100819 101033 99792 97188 93393 88660 83302 77642 71965 66502 61429 56864 52857 49393 46424 43891 41734 39898
2040 39898 38332 36994 35853 34886 34079 33415 32876 32447 32125 31915 31820 31841 31974 32231 32627 33182 33910 34821 35945 37325 39015
2037 39015 41064 43519 46431 49841 53761 58165 62983 68100 73335 78436 83100 87018 89917 91592 91920 90876 88544
2035 88544 85118 80878 76143 71225 66396 61879 57834 54347 51440 49092 47266 45923 45032 44574 44535 44902 45670 46847 48457
2033 48457 50511 52997 55876 59083 62516 66023 69422 72528 75165 77164 78375 78683 78028 76416 73923 70685 66879 62701
2031 62701 58350 54015 49853 45963 42398 39192 36367 33914 31788 29931 28298 26860 25591 24454 23420 22468 21589 20778
2028 20778 20032 19346 18711 18123 17589 17113 16694 16320 15983 15677 15396 15134 14889 14666 14468 14282 14087 13881 13677 13490 13317 13144 12964
2026 12964 12781 12601 12412 12201 11963 11713 11475 11266 11082 10912 10744 10580 10425 10275 10127 9987 9866 9763 9665 9563 9460 9368 9296 9236
2023 9236 9181 9129 9085 9053 9040 9046 9068 9101 9144 9199 9266 9341 9425 9522 9631 9746 9855 9962 10079 10224 10403 10606 10825 11062 11329 11629 11947 12271
2019 12271 12611 12988 13412 13878 14388 14961 15620 16377 17239 18224 19356 20653 22121 23765 25587 27569 29656 31772 33829 35741
2017 35741 37433 38843 39926 40649 41005 41029 40799 40413 39961 39532 39231 39180 39487 40228 41457 43223 45568 48510 52039 56121
2014 56121 60691 65641 70805 75974 80906 85349 89062 91825 93457 93828 92889 90692 87387 83189 78343 73094 67670 62282
2012 62282 57121 52341 48027 44195 40809 37828 35213 32915 30881 29060 27421 25936 24578 23330 22188 21156 20227
2010 20227 19386 18613 17892 17216 16587 16008 15476 14974 14490 14028 13599 13211 12862 12545 12253 11973 11697 11433 11189 10960 10736 10511 10290
2007 10290 10078 9882 9705 9554 9420 9290 9159 9030 8910 8802 8707 8626 8552 8475 8398 8330 8279 8238 8202 8176 8157 8129 8077 8013 7960 7927 7903 7874 7841
2004 7841 7806 7766 7726 7699 7697 7717 7752 7800 7857 7919 7986 8070 8187 8332 8491 8659 8850 9074 9331 9617 9941 10315 10740 11217 11759 12389 13126
2000 13126 13985 14994 16193 17618 19285 21202 23381 25831 28530 31417 34392 37328 40090 42538 44535 45953 46697 46722
1998 46722 46037 44690 42762 40364 37639 34743 31819 28982 26321 23900 21755 19892 18296 16931 15756 14738 13847 13061
1996 13061 12357 11720 11141 10608 10110 9651 9236 8863 8513 8175 7854 7560 7289 7037 6804 6596 6407 6228 6056 5898 5748 5594 5435
1993 5435 5282 5143 5014 4897 4800 4721 4650 4578 4509 4448 4387 4312 4222 4121 4020 3930 3861 3807 3750 3681 3609 3551 3508 3468 3428 3389 3347 3292 3224 3152 3090
1989 3090 3042 3003 2967 2927 2882 2830 2774 2719 2672 2639 2612 2578 2534 2495 2471 2454 2428 2390 2353 2327 2313 2305 2297 2281 2258 2232 2207 2184 2153 2113 2069 2029 2000 1983 1974 1966
1985 1966 1951 1926 1893 1861 1840 1833 1837 1842 1838 1823 1795 1758 1726 1712 1709 1698 1674 1653 1651 1662 1671 1674 1677 1678 1670 1663 1676 1717 1773 1821 1844 1839 1817 1800 1802 1816 1828 1836 1846 1853 1849 1844 1867
1980 1867 1921 1980 2023 2057 2098 2144 2183 2213 2245 2278 2299 2301 2288 2263 2227 2182 2135 2091 2046 1997 1946 1899 1856 1811 1761 1708 1667 1647 1647 1650 1654 1670 1703 1742 1766 1770 1767
1975 1767 1768 1774 1785 1803 1825 1844 1852 1847 1835 1822 1819 1833 1863 1899 1932 1963 1994 2026 2056 2091 2134 2185 2234 2271 2293 2304 2309 2309 2301 2287 2272 2258 2249 2240 2218 2179 2130 2088 2062
1970 2062 2044 2020 1984 1942 1898 1859 1833 1831 1856 1897 1934 1960 1974 1980 1982 1993 2022 2062 2092 2098 2084 2070 2068 2079 2096 2116 2140 2167 2193 2225 2268 2320 2369 2413 2465 2534 2605
1966 2605 2658 2697 2751 2837 2941 3037 3114 3176 3226 3265 3293 3317 3342 3374 3416 3466 3512 3548 3579 3610 3630 3623 3592 3553 3517 3479 3433 3387 3360 3360 3370 3367 3345 3322 3323 3351
1961 3351 3389 3423 3456 3498 3545 3588 3629 3676 3729 3777 3812 3840 3870 3903 3942 3989 4042 4094 4137 4173 4204 4231 4262 4307 4372 4456 4554 4660 4763 4852 4931 5021 5137
1957 5137 5268 5395 5506 5610 5717 5830 5947 6068 6191 6317 6453 6606 6773 6948 7121 7292 7464 7644 7841 8061 8304 8563 8833
1955 8833 9112 9403 9711 10044 10408 10804 11227 11676 12159 12684 13252 13856 14496 15182 15945 16822 17850 19048 20429 22009 23816
1952 23816 25880 28209 30783 33561 36495 39517 42538 45445 48120 50456 52369 53809 54775 55336 55626 55819 56106 56674 57700
1950 57700 59327 61644 64667 68335 72507 76962 81394 85424 88637 90643 91164 90085 87458 83470 78411 72656 66621
1948 66621 60690 55143 50135 45724 41900 38618 35811 33412 31363 29601 28062 26690 25458 24357 23368 22460 21606 20799
1945 20799 20043 19341 18688 18080 17518 17006 16544 16127 15749 15406 15093 14806 14540 14292 14063 13857 13675 13516 13376 13250 13130 13009 12890
1943 12890 12786 12704 12642 12594 12561 12539 12515 12485 12459 12452 12466 12500 12559 12648 12754 12854 12942 13041 13170 13329 13505 13693 13903 14148 14434 14760 15115 15495
1939 15495 15911 16378 16904 17490 18145 18891 19745 20712 21803 23046 24479 26128 28018 30183 32668 35503 38701 42262 46150
1937 46150 50280 54518 58719 62734 66397 69524 71960 73627 74536 74764 74443 73763 72959 72272 71908 72022 72696 73921 75570
1935 75570 77413 79151 80460 81022 80572 78953 76160 72339 67745 62689 57485 52404 47653 43363 39596 36353 33578 31189
1932 31189 29111 27292 25691 24271 23001 21856 20814 19851 18952 18112 17324 16576 15865 15201 14590 14022 13488 12994 12542 12115
1930 12115 11695 11291 10930 10617 10324 10034 9763 9526 9315 9107 8897 8692 8493 8296 8102 7917 7737 7552 7366 7191 7031 6876 6720
1927 6720 6568 6424 6283 6133 5973 5809 5649 5502 5375 5267 5163 5052 4938 4838 4759 4683 4584 4454 4314 4189 4093 4017 3944 3864 3781 3702
1924 3702 3628 3558 3490 3419 3345 3269 3194 3121 3054 2993 2938 2889 2850 2823 2805 2788 2765 2737 2703 2661 2605 2538 2473 2427 2402 2389 2370 2333 2284 2238 2203 2176 2150 2123
1920 2123 2097 2072 2048 2027 2015 2013 2014 2004 1979 1939 1895 1856 1825 1799 1773 1749 1733 1724 1718 1708 1691 1671 1655 1653 1662 1669 1657 1628 1596 1573 1554 1524 1482 1446 1436 1458 1499 1538
1915 1538 1563 1575 1575 1563 1543 1527 1532 1559 1594 1627 1653 1678 1702 1724 1744 1763 1782 1798 1811 1825 1843 1869 1903 1944 1990 2039 2092 2149 2212 2272 2320 2348 2356 2345 2322 2290
1911 2290 2250 2205 2160 2122 2091 2063 2033 2004 1981 1972 1978 1990 1992 1974 1941 1906 1882 1868 1859 1853 1852 1860 1881 1915 1959 2007 2049 2087 2127 2176 2223 2252 2255 2238 2215 2199 2198 2214 2245
1906 2245 2283 2317 2334 2333 2326 2334 2367 2414 2455 2486 2518 2560 2606 2650 2693 2747 2807 2852 2873 2883 2906 2952 3009 3068 3135 3220 3326 3435 3527 3593 3644 3698 3770 3863 3969
1902 3969 4074 4171 4265 4363 4467 4567 4661 4763 4891 5045 5200 5340 5471 5611 5769 5944 6134 6342 6573 6829 7114 7426 7758 8108
1899 8108 8487 8916 9406 9953 10551 11203 11919 12707 13582 14570 15709 17032 18564 20336 22385 24746 27440 30474 33837 37479
1896 37479 41301 45153 48856 52210 55012 57073 58240 58426 57614 55871 53327 50163 46584 42802 39019 35407 32089 29140
1894 29140 26583 24393 22509 20870 19439 18192 17098 16109 15195 14352 13591 12908 12282 11702 11172 10698 10273 9878 9500 9139
1892 9139 8801 8493 8220 7981 7767 7564 7367 7179 7007 6857 6730 6618 6508 6388 6258 6132 6024 5935 5852 5767 5689 5630 5594 5567 5529 5466
1888 5466 5383 5305 5259 5245 5235 5204 5156 5115 5092 5078 5061 5042 5024 5008 4994 4986 4991 5002 5010 5013 5016 5022 5030 5039 5054 5075 5102 5135 5181 5245 5329 5433 5554 5689 5833 5990
1884 5990 6166 6365 6587 6833 7112 7433 7798 8202 8647 9147 9725 10407 11216 12171 13289 14590 16095 17818 19766 21930 24265
1881 24265 26689 29087 31324 33259 34755 35707 36046 35750 34830 33348 31420 29194 26825 24443 22156 20046 18160 16510
1879 16510 15087 13883 12883 12049 11331 10686 10101 9579 9110 8677 8272 7900 7564 7246 6928 6611 6316 6060 5838 5637 5448 5265
1877 5265 5085 4917 4778 4677 4600 4522 4430 4329 4227 4129 4034 3939 3840 3739 3647 3571 3499 3412 3306 3196 3098 3022 2966 2923 2882 2832 2778 2734 2706 2684
1873 2684 2658 2621 2577 2532 2497 2474 2455 2422 2372 2316 2268 2231 2201 2176 2154 2131 2106 2077 2038 1983 1924 1882 1859 1840 1811 1783 1771 1770 1763 1744 1727 1720 1714 1700 1684 1677 1686
1868 1686 1701 1709 1701 1686 1674 1673 1675 1669 1651 1622 1586 1543 1502 1471 1455 1449 1452 1461 1473 1486 1497 1509 1520 1525 1517 1494 1462 1432 1408 1388 1370 1355 1349 1350 1355 1360 1371 1388 1400 1392 1371 1352
1863 1352 1349 1358 1368 1365 1341 1297 1250 1218 1206 1199 1185 1168 1158 1160 1163 1160 1153 1151 1162 1175 1175 1150 1103 1046 988 936 899 891 912 943 961 955 930 903 891 900 921 936 933 914 895
1858 895 891 899 906 893 862 830 819 836 870 904 924 926 914 901 900 907 911 904 894 884 873 860 845 832 816 796 776 767 776 797 816 819 806 786 772 767 770 780 797 823 853
1853 853 877 888 882 862 841 831 833 837 831 814 788 761 745 745 752 749 732 715 713 721 727 726 721 718 718 723 731 737 742 746 745 734 717 714 738 778 811 827 835 842 845 841 833 831 838 851 863 871 872 868
1847 868 857 841 827 828 856 902 943 965 967 954 934 920 922 928 920 896 874 870 875 872 861 854 849 832 805 785 784 790 787 776 777 794 811 810 792 774 770 774 776 771 759 747 735 722
1842 722 704 686 677 681 690 690 679 662 652 656 673 696 709 707 700 702 715 726 731 734 738 740 741 751 769 778 763 735 713 701 692 690 707 740 761 755 730 712 712 727 752 780 806 826
1836 826 845 865 881 887 883 883 894 905 897 863 816 780 765 762 758 753 752 755 751 742 735 738 743 739 730 722 719 718 720 734 762 792 805 796 772 746 731 733 753 785 821 853 877 894 908 920
1831 920 932 939 935 918 898 889 891 891 885 883 894 913 931 951 979 1007 1023 1032 1051 1086 1119 1136 1140 1141 1145 1153 1167 1183 1190 1183 1176 1179 1188 1194 1204 1230 1269 1305 1331 1348 1361 1366 1365 1360 1353 1345
1825 1345 1344 1361 1392 1420 1442 1463 1484 1495 1490 1487 1508 1556 1610 1653 1684 1712 1742 1767 1778 1772 1756 1741 1740 1761 1803 1857 1908 1954 2006 2081 2186 2303 2410 2508 2621
1821 2621 2776 2979 3221 3489 3788 4128 4518 4958 5442 5950 6448 6884 7194 7321 7237 6958 6546 6077 5614 5195 4838 4548 4316
1818 4316 4136 4001 3909 3841 3773 3701 3640 3602 3572 3532 3486 3458 3451 3446 3431 3420 3431 3464 3505 3556 3626 3718 3816 3904 3988 4084 4204 4340 4482 4637 4823 5057
1814 5057 5342 5668 6026 6431 6925 7561 8368 9339 10455 11712 13121 14670 16302 17907 19321 20322 20684 20274 19143 17522
1812 17522 15730 14041 12606 11459 10565 9883 9383 9028 8770 8572 8425 8337 8308 8333 8422 8585 8822 9124 9499 9967 10532 11167 11828
1809 11828 12468 13029 13437 13619 13534 13193 12651 12006 11363 10803 10357 10021 9778 9618 9542 9561 9680 9892 10189 10578 11092 11760 12596 13605
1806 13605 14794 16155 17648 19204 20726 22059 22973 23230 22718 21531 19925 18200 16592 15228 14141 13304 12674 12222 11933
1804 11933 11788 11762 11830 11991 12261 12662 13215 13945 14883 16059 17483 19152 21054 23158 25389 27607 29591 31046 31659 31219
1801 31219 29741 27490 24872 22263 19910 17920 16310 15045 14066 13310 12719 12249 11873 11581 11370 11231 11156 11156 11248 11436 11698
1799 11698 12001 12316 12619 12870 13008 12974 12739 12330 11815 11270 10759 10324 9986 9746 9593 9522 9530 9609 9747 9943 10221 10605 11118 11780
1796 11780 12624 13671 14927 16392 18085 20015 22146 24391 26625 28654 30173 30817 30330 28730 26318 23533 20780 18317
1793 18317 16249 14565 13203 12091 11169 10399 9768 9263 8852 8490 8150 7839 7563 7313 7076 6859 6671 6503 6340 6185 6050
1791 6050 5934 5819 5701 5592 5501 5423 5356 5304 5264 5223 5184 5167 5188 5237 5296 5368 5464 5594 5761 5986 6289 6677 7142 7675 8273 8917 9574
1788 9574 10200 10747 11141 11284 11099 10585 9824 8947 8075 7284 6609 6052 5599 5233 4937 4693 4484 4294 4116 3952 3804 3671 3544
1785 3544 3425 3325 3247 3183 3112 3029 2940 2854 2772 2693 2622 2566 2523 2482 2436 2388 2344 2309 2279 2250 2214 2161 2087 2005 1932 1875 1822 1759 1695 1645 1620 1613 1611 1607 1600
1780 1600 1593 1591 1594 1593 1573 1533 1493 1475 1488 1519 1553 1587 1619 1646 1661 1666 1663 1653 1632 1604 1581 1575 1589 1613 1633 1636 1630 1628 1641 1659 1667 1658 1639 1618 1599 1585 1582 1588 1591 1591 1598 1626 1668
1775 1668 1702 1718 1724 1732 1744 1755 1763 1770 1778 1784 1792 1807 1830 1857 1886 1914 1936 1953 1970 1995 2027 2058 2086 2117 2164 2231 2313 2407 2509 2616 2727 2839 2946 3043 3137
1771 3137 3253 3406 3594 3808 4060 4383 4794 5283 5835 6446 7121 7848 8590 9302 9920 10350 10493 10301 9819 9159 8441 7747 7121
1768 7121 6582 6130 5758 5460 5229 5055 4920 4813 4727 4660 4608 4566 4534 4516 4511 4511 4507 4502 4508 4539 4600 4677 4744 4790 4827 4880 4966 5086 5237 5416 5618
1764 5618 5844 6099 6393 6736 7130 7586 8130 8795 9602 10562 11698 13049 14659 16537 18652 20940 23317 25654 27734 29235
1762 29235 29817 29283 27698 25385 22778 20251 18023 16173 14687 13516 12598 11875 11298 10836 10472 10196 10000 9867 9781 9734 9731
1759 9731 9789 9922 10133 10412 10742 11104 11474 11810 12051 12139 12046 11791 11432 11038 10672 10377 10167 10043 9997 10029 10143 10348 10649 11054 11575
1756 11575 12233 13058 14084 15340 16835 18565 20517 22665 24944 27221 29272 30794 31471 31093 29674 27475 24900 22332
1754 22332 20026 18095 16549 15349 14433 13737 13211 12823 12557 12399 12335 12352 12455 12671 13041 13599 14362 15320 16444 17706 19075
1752 19075 20489 21810 22811 23243 22952 21959 20447 18688 16933 15349 14007 12911 12044 11385 10904 10560 10317 10148 10048 10015
1749 10015 10052 10163 10350 10613 10957 11387 11895 12445 12988 13466 13811 13942 13797 13372 12735 11992 11233 10523 9904 9400 9014 8728 8524
1746 8524 8399 8347 8355 8416 8538 8748 9061 9480 10008 10668 11497 12515 13714 15066 16535 18066 19541 20756 21456 21430 20611 19123
1744 19123 17239 15274 13474 11962 10741 9762 8970 8332 7820 7401 7037 6705 6399 6119 5862 5624 5406 5205 5018 4840 4673
1741 4673 4522 4391 4282 4193 4117 4043 3962 3880 3811 3764 3732 3704 3676 3659 3665 3692 3729 3763 3800 3848 3914 3998 4109 4266 4483 4759 5090 5478 5918 6391
1737 6391 6862 7295 7644 7846 7844 7620 7207 6661 6052 5455 4939 4525 4188 3898 3653 3464 3315 3171 3020 2882 2775 2693 2614 2527 2432
1734 2432 2337 2245 2163 2090 2025 1974 1945 1931 1914 1885 1854 1828 1802 1770 1744 1744 1768 1787 1785 1770 1763 1768 1772 1756 1724 1695 1690 1705 1715 1706 1692 1698 1729 1760 1762 1730 1675 1616 1570
1730 1570 1541 1524 1502 1462 1408 1349 1299 1262 1238 1219 1197 1176 1166 1166 1161 1141 1120 1116 1127 1135 1133 1127 1123 1115 1105 1102 1111 1120 1125 1129 1138 1146 1149 1152 1169 1202 1235 1252 1250 1229 1193 1154 1124
1724 1124 1115 1125 1144 1163 1179 1195 1216 1244 1276 1306 1325 1326 1304 1262 1211 1161 1118 1082 1051 1021 989 958 931 907 883 859 841 830 826 828 832 836 835 832 831 833 836 841 849 862 873
1719 873 877 878 882 891 901 912 925 936 937 926 900 852 783 716 683 692 716 726 718 707 702 701 703 712 730 753 775 795 802 785 746 705 681 680 694 715 735 743 733 708 684 671
1714 671 668 665 652 632 614 606 606 605 598 593 599 614 625 621 604 586 580 590 609 624 628 623 616 611 604 598 601 620 648 669 679 685 697 707 704 684 658 639 627 613 591 569 560 565 576
1709 576 585 588 583 569 551 544 552 569 582 586 579 560 536 524 537 569 597 604 594 584 588 605 625 637 634 621 609 605 607 611 613 613 614 617 624 631 635 639 649 665 678 682 683 686 687 678 656 627
1703 627 596 572 562 571 587 601 608 614 618 608 576 530 491 473 474 482 492 499 504 507 513 525 543 563 580 592 604 620 638 654 664 669 665 651 631 616 614 622 630 630 621 613 612 615 614
1697 614 605 590 576 562 546 534 530 530 526 515 510 525 552 572 576 569 561 552 537 519 510 517 532 544 548 547 545 543 548 564 589 615 630 631 622 615 620 636 650 652 640 626 620 620 619 616 608 594
1691 594 573 555 551 558 566 572 579 586 590 589 586 589 595 592 572 544 524 520 518 501 473 460 479 516 544 551 547 546 550 551 544 533 528 540 568 599 627 652 677 697 705 714 733 755 755 726 691
1686 691 672 668 666 664 665 669 666 647 615 581 556 546 547 547 544 541 540 537 536 545 555 547 520 505 529 581 624 639 640 641 645 647 650 650 637 612 590 586 598 611 613 606 598 597 606 622 639 659
1680 659 687 720 743 748 740 728 716 701 682 658 637 629 638 653 655 637 614 601 597 593 585 573 561 552 547 546 544 543 551 571 596 618 634 647 655 653 640 616 580 536 493 463 450
1674 450 451 464 483 499 507 508 513 526 546 564 571 563 544 524 512 511 522 545 576 602 620 644 688 750 804 827 821 798 773 761 763 771 766 744 719 705 697 678 643 601 565
1669 565 545 541 556 587 626 660 683 694 697 696 688 671 645 621 611 620 638 650 648 637 629 628 629 624 616 614 622 631 633 629 623 616 613 621 641 661 669 664 663 683 719 752 769 773 777 786 791 784 762
1663 762 730 695 664 644 637 633 625 613 610 621 639 651 655 660 671 689 710 734 762 789 805 812 819 831 839 833 820 816 824 823 799 761 734 727 730 730 725 716 701 686 680 688 698 696 682
1658 682 669 662 661 664 676 696 712 712 701 691 694 706 715 710 689 661 640 637 648 658 663 674 707 755 792 803 797 789 787 780 764 741 722 713 716 731 754 777 794 801 794 778 763
1653 763 757 756 747 720 684 653 638 646 671 693 694 674 652 649 663 675 676 671 669 666 656 640 624 612 604 599 592 583 573 569 575 590 610 628 644 654 656 648 637 633 635 644 656 670 679 675
1647 675 658 641 637 641 644 642 638 632 627 626 635 646 645 628 607 599 604 612 618 631 654 681 701 709 707 698 685 676 680 701 728 748 751 746 746 757 770 774 765 755 758 778 803 813 801 776 759
1641 759 757 757 744 712 674 644 628 619 610 605 612 635 663 679 676 663 653 651 648 629 597 566 551 551 554 556 566 585 605 617 628 647 668 675 663 645 632 628 628 632 645 668 697
1636 697 720 731 727 720 722 733 745 752 755 760 769 777 782 781 767 740 711 690 681 678 679 682 685 686 686 687 689 692 692 686 676 665 660 660 655 643 628 616 611 612 612 605 591 582 598 632 658 655 628 602
1630 602 595 598 596 579 554 536 537 557 580 602 627 656 680 693 700 706 706 696 689 696 711 711 695 680 681 692 702 711 723 736 747 755 763 773 788 806 819 819 812 806 800 788 772 759
1625 759 744 712 668 633 619 619 622 631 648 661 658 648 643 642 641 649 670 689 686 670 666 678 685 674 658 656 666 677 681 683 690 705 725 736 733 723 727 752 784 811 836 872 919
1619 919 961 988 1000 1003 994 975 947 918 889 861 840 832 838 851 862 874 892 908 908 887 856 827 803 778 751 729 715 705 697 693 688 679 666 657 661 680 707 737 760 767 758
1614 758 740 726 717 707 697 696 708 728 740 730 704 682 681 701 733 762 785 807 838 876 904 910 903 904 920 932 920 892 872 867 865 850 827 805 796 808 837 863 863 839
1609 839 815 810 822 834 838 833 823 814 820 851 900 944 967 970 960 939 907 871 839 817 798 780 771 779 804 831 851 868 889 910 926 941 967 1003 1042 1083 1130 1186 1237
1605 1237 1274 1300 1327 1365 1426 1522 1660 1836 2043 2277 2531 2791 3044 3274 3450 3528 3474 3291 3016 2703 2398 2133 1917 1744 1606 1503
1601 1503 1433 1383 1342 1314 1304 1304 1298 1281 1262 1238 1201 1151 1105 1073 1047 1020 1000 988 967 927 885 861 856 849 831 811 795 780 763 749 741 732 723 716 713 709 700 693 697 708 714
1596 714 703 676 647 638 656 689 715 724 725 722 711 696 696 728 781 831 868 896 920 938 951 960 963 954 935 918 914 920 924 921 914 911 916 924 926 916 899 889 890 895 896 896 896 898 900 914 947
1591 947 995 1040 1072 1094 1110 1118 1115 1104 1096 1093 1096 1102 1117 1147 1189 1231 1258 1265 1264 1272 1297 1341 1395 1456 1517 1572 1620 1666 1715 1772 1840 1922 2018 2133 2273 2443 2645
1586 2645 2877 3136 3423 3729 4031 4297 4494 4594 4584 4471 4283 4060 3840 3655 3522 3450 3438 3482 3574 3704 3860 4041 4250 4476 4681
1583 4681 4813 4843 4768 4611 4406 4186 3980 3806 3669 3577 3536 3541 3577 3631 3700 3786 3889 4007 4139 4283 4438 4612 4816 5067 5371 5730
1580 5730 6145 6612 7129 7695 8307 8942 9543 10035 10350 10464 10395 10208 9990 9826 9772 9848 10062 10418 10906 11493 12123 12731 13233 13535
1577 13535 13555 13275 12752 12084 11365 10671 10057 9552 9157 8853 8622 8452 8325 8223 8142 8097 8098 8136 8201 8286 8394 8521 8670 8850 9074
1574 9074 9343 9659 10031 10479 11016 11645 12380 13254 14296 15524 16944 18554 20342 22277 24288 26233 27881 28967 29310 28930
1572 28930 28061 27043 26193 25726 25748 26284 27311 28772 30588 32643 34760 36679 38062 38578 38057 36584 34489 32197 30076
1569 30076 28346 27083 26257 25777 25528 25389 25248 25008 24615 24079 23465 22875 22405 22129 22079 22253 22627 23177 23883 24720 25641 26559
1567 26559 27360 27942 28257 28343 28308 28291 28418 28775 29412 30347 31565 33001 34519 35902 36887 37261 36967 36158 35136 34233 33696 33658
1564 33658 34162 35196 36704 38582 40695 42880 44932 46591 47570 47668 46891 45498 43915 42564 41732 41530 41934 42834 44060
1562 44060 45381 46488 47038 46772 45659 43939 42026 40330 39140 38596 38737 39533 40921 42814 45098 47605 50086 52195
1559 52195 53516 53661 52442 50001 46776 43310 40042 37221 34930 33151 31811 30811 30043 29388 28738 28023 27243 26452 25722
1557 25722 25114 24673 24432 24401 24570 24919 25422 26038 26719 27405 28026 28519 28876 29165 29510 30032 30818 31936 33414 35216 37224 39258
1554 39258 41070 42344 42770 42212 40835 39038 37269 35872 35056 34923 35491 36708 38477 40681 43179 45774 48173 49962
1552 49962 50670 49940 47730 44366 40409 36416 32773 29655 27076 24962 23223 21791 20608 19624 18791 18073 17442 16871 16346
1550 16346 15875 15474 15139 14844 14568 14318 14117 13976 13895 13864 13881 13955 14103 14336 14654 15047 15508 16038 16642 17314 18021 18689 19212 19494
1547 19494 19499 19260 18866 18419 18019 17751 17672 17800 18122 18613 19239 19963 20736 21485 22100 22444 22402 21942 21124 20074 18931 17820 16827
1544 16827 15988 15300 14745 14313 13987 13736 13530 13365 13242 13146 13056 12975 12931 12933 12959 12987 13027 13103 13215 13346 13476 13597 13708 13818 13939 14073
1541 14073 14208 14339 14481 14652 14847 15059 15301 15597 15945 16314 16678 17045 17431 17842 18266 18691 19108 19522 19957 20431 20942 21474 22029
1538 22029 22617 23240 23875 24515 25168 25839 26524 27225 27965 28757 29595 30469 31395 32397 33487 34670 35946 37315 38773 40313
1536 40313 41929 43611 45351 47163 49086 51159 53442 56028 59017 62467 66406 70886 76000 81841 88523 96262 105403
1534 105403 116384 129773 146363 167148 193117 225038 263388 308283 359344 415471 474300 531091 577810 604266
1532 604266 602148 569788 513820 446099 378323 318194 268789 229971 200055 176977 158943 144633 133080 123526
1530 123526 115409 108355 102093 96396 91132 86284 81863 77838 74168 70844 67843 65105 62576 60253 58139 56202 54412
1528 54412 52777 51309 49976 48729 47542 46403 45300 44234 43229 42304 41446 40639 39885 39187 38535 37929 37398 36952 36558 36186
1526 36186 35839 35527 35228 34911 34580 34261 33969 33707 33496 33355 33274 33228 33209 33215 33231 33237 33225 33194 33130 33025 32902 32789 32697 32630 32612 32663 32774 32928
1522 32928 33133 33408 33739 34089 34432 34771 35112 35462 35847 36296 36819 37413 38091 38862 39699 40559 41422 42300 43195 44087 44963 45829 46693
1519 46693 47563 48468 49448 50524 51698 52978 54394 55971 57723 59656 61774 64080 66596 69368 72445 75850 79589 83680
1517 83680 88131 92906 97939 103184 108647 114413 120713 127972 136753 147664 161370 178664 200435 227505 260502 299795
1515 299795 345410 396886 453039 511353 566949 612011 637254 635737 606872 557440 498607 441180 392371 355373
1513 355373 330663 317424 314417 320442 334488 355615 382748 414416 448129 479435 501692 507783 493461 459995
1512 459995 413858 363606 316346 275983 243532 218315 199015 184298 173098 164639 158330 153688 150326 147924 146143
1510 146143 144556 142659 139923 135922 130527 124020 116997 110083 103706 98050 93154 88974 85423 82390 79768 77469 75426
1508 75426 73595 71944 70442 69082 67882 66878 66088 65511 65149 65011 65095 65379 65846 66471 67204 67979 68759 69552 70388 71277 72185
1505 72185 72987 73437 73221 72111 70114 67497 64668 62022 59823 58176 57081 56514 56460 56906 57830 59211 61027 63230 65717
1503 65717 68326 70823 72877 74082 74083 72762 70323 67215 63930 60823 58051 55625 53494 51602 49916 48426 47155 46134
1501 46134 45385 44914 44728 44840 45268 46021 47101 48516 50278 52397 54859 57614 60564 63543 66309 68570 70090 70828 70978
1498 70978 70856 70722 70656 70527 70058 68961 67121 64695 62033 59501 57342 55669 54497 53785 53492 53598 54086 54908 55997 57324
1496 57324 58893 60695 62681 64783 66941 69112 71296 73570 76058 78854 81979 85392 88990 92626 96245 100050 104539
1494 104539 110375 118267 128948 143130 161395 184104 211389 243142 278926 317752 357591 394617 422960 436095
1492 436095 429808 404768 366486 322600 279653 241495 209521 183624 162987 146579 133437 122747 113810 106078
1490 106078 99212 93050 87484 82411 77775 73565 69770 66352 63281 60548 58131 55994 54123 52530 51213 50136 49285
1488 49285 48688 48378 48349 48566 48995 49599 50309 50998 51461 51439 50696 49152 46944 44380 41796 39441 37426 35756 34397 33320
1486 33320 32498 31890 31448 31143 30974 30940 31018 31167 31324 31405 31314 30974 30345 29434 28295 27019 25707 24439 23261 22200 21267 20452
1483 20452 19732 19089 18517 18006 17539 17107 16709 16345 16007 15684 15385 15133 14948 14839 14795 14803 14856 14965 15144 15395 15701 16037 16379 16698
1480 16698 16948 17064 16973 16632 16053 15306 14481 13656 12885 12203 11625 11137 10721 10368 10078 9828 9590 9356 9144 8960 8793 8629 8475
1478 8475 8339 8216 8101 7999 7912 7829 7741 7655 7586 7534 7487 7433 7367 7287 7201 7116 7036 6950 6858 6771 6696 6616 6511 6379 6241 6112 5989 5865 5746
1474 5746 5638 5544 5456 5368 5276 5190 5123 5072 5013 4933 4848 4784 4746 4709 4657 4596 4539 4483 4424 4372 4342 4336 4336 4327 4302 4270 4234 4196 4154 4109 4063 4015 3966 3920 3879
1470 3879 3837 3784 3722 3666 3633 3621 3617 3606 3581 3549 3525 3526 3548 3569 3566 3547 3533 3536 3548 3558 3559 3549 3531 3515 3509 3508 3502 3492 3488 3493 3501 3503 3498 3490 3477 3467 3467 3481 3503 3529 3562 3595
1465 3595 3609 3590 3546 3499 3462 3433 3406 3376 3346 3319 3300 3287 3275 3259 3237 3208 3173 3138 3113 3100 3095 3092 3093 3098 3099 3098 3105 3127 3153 3174 3201 3251 3325 3413 3513 3639 3798
1460 3798 3986 4196 4427 4683 4960 5261 5579 5878 6093 6165 6078 5864 5579 5282 5013 4791 4610 4460 4333 4215 4091 3956 3828 3727
1457 3727 3650 3576 3490 3396 3307 3228 3157 3089 3021 2958 2907 2871 2840 2805 2762 2714 2670 2634 2613 2607 2599 2572 2526 2479 2447 2425 2403 2382 2371 2370 2366 2348 2315 2272 2221 2173
1453 2173 2141 2132 2130 2118 2091 2061 2037 2022 2017 2024 2039 2052 2055 2053 2055 2063 2067 2065 2065 2069 2075 2074 2062 2038 2003 1962 1925 1902 1897 1907 1921 1928 1926 1925 1938 1961 1984 2002 2020 2038 2048 2052 2066 2093
1447 2093 2115 2107 2071 2031 1999 1966 1930 1910 1917 1937 1951 1959 1973 1996 2015 2023 2030 2047 2067 2076 2069 2055 2047 2049 2056 2068 2088 2121 2159 2194 2224 2256 2297 2351 2418 2503 2606 2720
1443 2720 2847 2999 3190 3419 3676 3952 4238 4505 4712 4823 4824 4721 4530 4280 4013 3774 3593 3480 3431 3432 3474 3548 3648 3764 3883
1440 3883 3997 4099 4172 4193 4134 3989 3774 3522 3272 3048 2858 2703 2585 2506 2455 2421 2394 2370 2338 2293 2247 2223 2227 2237 2229 2202 2169 2137 2106 2077
1436 2077 2048 2011 1958 1902 1864 1856 1869 1886 1901 1909 1904 1886 1863 1843 1827 1812 1801 1793 1783 1767 1750 1739 1736 1741 1749 1751 1740 1717 1698 1688 1680 1665 1651 1649 1661 1673 1674 1662 1648 1639
1431 1639 1643 1657 1673 1677 1660 1628 1596 1584 1605 1651 1696 1719 1726 1739 1761 1777 1767 1732 1689 1653 1631 1626 1635 1647 1653 1654 1650 1642 1631 1624 1624 1623 1614 1603 1608 1630 1651 1649 1623 1589 1561 1542
1426 1542 1535 1540 1549 1546 1522 1492 1472 1468 1464 1450 1434 1431 1446 1472 1503 1539 1578 1609 1622 1620 1620 1632 1648 1658 1662 1671 1685 1696 1694 1680 1663 1650 1647 1654 1667 1683 1702 1726 1754 1785 1822
1421 1822 1874 1947 2036 2132 2239 2361 2503 2662 2835 3013 3175 3295 3349 3325 3218 3042 2826 2606 2405 2233 2094 1994 1926 1873 1821 1769
1418 1769 1721 1681 1649 1623 1600 1579 1566 1575 1605 1631 1632 1610 1585 1566 1543 1516 1497 1490 1474 1433 1382 1349 1339 1339 1341 1353 1380 1407 1421 1428 1436 1443 1443 1436 1429 1420 1404 1385 1374 1373 1372
1413 1372 1363 1350 1340 1334 1327 1319 1311 1303 1292 1287 1299 1323 1342 1344 1329 1315 1310 1315 1318 1311 1294 1275 1263 1261 1260 1253 1248 1254 1270 1286 1297 1306 1316 1322 1326 1337 1353 1362 1358 1357 1373 1395 1397 1377 1358 1364 1393
1407 1393 1426 1444 1441 1419 1386 1357 1330 1295 1242 1180 1129 1101 1094 1103 1120 1143 1168 1191 1202 1189 1153 1114 1097 1103 1118 1125 1123 1115 1103 1093 1092 1099 1107 1110 1113 1120 1121 1105 1082 1076 1100 1140
1402 1140 1174 1193 1199 1196 1185 1165 1142 1128 1131 1152 1185 1224 1263 1303 1342 1375 1399 1417 1432 1438 1423 1384 1331 1279 1237 1206 1183 1168 1159 1151 1143 1140 1140 1141 1142 1147 1154 1158 1153 1145 1144 1149 1151 1143
1396 1143 1124 1104 1097 1108 1127 1140 1147 1160 1187 1214 1221 1205 1184 1167 1151 1131 1106 1087 1083 1101 1139 1182 1216 1238 1257 1273 1278 1273 1275 1294 1317 1332 1345 1370 1402 1421 1417 1403
1392 1403 1392 1388 1386 1378 1359 1336 1326 1343 1378 1414 1443 1471 1499 1511 1502 1486 1486 1510 1543 1567 1575 1567 1550 1532 1519 1510 1501 1488 1474 1462 1458 1464 1480 1503 1526 1541 1546 1548 1568 1615 1676
1387 1676 1721 1739 1747 1761 1783 1806 1834 1876 1923 1959 1978 1995 2017 2036 2044 2048 2060 2090 2135 2189 2243 2288 2329 2380 2449 2520 2577 2617 2659 2716 2786 2865 2957 3066 3192
1383 3192 3327 3478 3659 3884 4152 4458 4805 5211 5691 6253 6894 7605 8365 9135 9862 10476 10892 11026 10837 10365 9715 9002 8306
1380 8306 7672 7123 6674 6316 6030 5800 5617 5474 5354 5246 5154 5091 5059 5049 5051 5062 5078 5100 5130 5168 5217 5273 5334 5404 5490 5593 5716 5859
1376 5859 6016 6180 6349 6533 6749 7003 7296 7635 8039 8530 9115 9796 10588 11533 12682 14076 15732 17643 19785 22121 24595
1374 24595 27100 29431 31273 32260 32124 30836 28649 25993 23295 20845 18770 17090 15773 14769 14013 13442 13011 12693 12474
1371 12474 12345 12302 12357 12521 12801 13191 13685 14287 14997 15799 16650 17484 18216 18749 18993 18900 18485 17828 17045 16250 15527 14917 14437 14090
1368 14090 13879 13793 13818 13949 14194 14572 15095 15787 16682 17816 19200 20825 22685 24782 27086 29505 31870 33937 35389 35907
1366 35907 35302 33652 31284 28635 26075 23825 21973 20528 19446 18661 18109 17749 17566 17557 17723 18064 18592 19331 20320 21602
1364 21602 23214 25171 27462 30046 32857 35792 38660 41147 42832 43315 42390 40170 37055 33570 30171 27137 24578 22496
1361 22496 20839 19531 18493 17662 16999 16474 16066 15760 15557 15462 15480 15615 15864 16213 16644 17133 17646 18120 18472 18619 18517 18167
1359 18167 17617 16943 16232 15558 14965 14472 14089 13826 13682 13648 13721 13903 14199 14612 15160 15884 16831 18039 19530 21327 23460 25941
1356 25941 28734 31750 34842 37780 40204 41647 41705 40239 37488 33960 30218 26694 23629 21090 19033 17366 15995 14852
1354 14852 13884 13051 12321 11676 11102 10587 10124 9710 9343 9022 8745 8505 8286 8074 7873 7697 7549 7416 7294 7191 7113 7051 6992 6937
1351 6937 6894 6865 6846 6836 6839 6862 6913 7007 7155 7360 7623 7959 8383 8895 9487 10159 10918 11756 12624 13456 14177 14692 14892 14700 14118 13232
1348 13232 12169 11055 9998 9071 8295 7649 7099 6623 6214 5860 5543 5252 4987 4750 4542 4357 4194 4051 3919 3790 3666 3556
1345 3556 3465 3386 3313 3241 3174 3107 3038 2960 2874 2789 2723 2693 2687 2674 2633 2578 2532 2490 2429 2348 2271 2218 2183 2147 2106 2063 2019 1978 1954 1950 1950 1934 1905 1883 1873 1865
1341 1865 1853 1845 1843 1832 1809 1790 1788 1794 1789 1769 1747 1732 1721 1709 1696 1679 1656 1629 1605 1587 1569 1544 1514 1488 1470 1458 1449 1437 1422 1400 1368 1336 1323 1336 1356 1357 1335 1310
1336 1310 1303 1308 1308 1297 1287 1284 1288 1296 1309 1318 1315 1297 1274 1250 1222 1186 1154 1142 1157 1186 1214 1229 1233 1228 1217 1201 1183 1168 1165 1182 1214 1243 1251 1230 1194 1165 1153 1153 1156 1164 1179 1196
1331 1196 1205 1203 1197 1189 1173 1145 1119 1111 1118 1126 1126 1122 1126 1135 1143 1145 1144 1139 1130 1119 1110 1105 1095 1076 1049 1023 1007 1013 1041 1081 1115 1134 1144 1152 1159 1167 1180 1196 1206 1202 1193 1191 1191 1176 1143 1113 1102
1325 1102 1102 1095 1080 1065 1051 1026 995 977 980 989 987 981 991 1028 1075 1113 1132 1136 1130 1120 1116 1126 1148 1168 1174 1166 1151 1133 1112 1089 1066 1053 1058 1079 1102 1112 1105 1094 1096 1113 1133
1320 1133 1144 1144 1136 1129 1134 1155 1187 1220 1254 1294 1339 1375 1390 1383 1360 1329 1294 1261 1234 1210 1185 1162 1147 1142 1141 1138 1136 1135 1129 1118 1107 1103 1104 1100 1093 1095 1115 1145 1169 1182 1191 1197 1192 1176
1315 1176 1161 1154 1145 1122 1090 1070 1073 1090 1108 1128 1145 1154 1157 1165 1183 1199 1202 1204 1222 1256 1289 1319 1354 1394 1427 1446 1457 1463 1459 1442 1423 1410 1400 1395 1401 1419 1431 1425 1411 1408 1419
1310 1419 1431 1434 1431 1431 1441 1463 1490 1510 1518 1521 1532 1554 1579 1596 1603 1597 1581 1563 1558 1576 1609 1636 1642 1635 1635 1659 1699 1737 1764 1785 1802 1810 1814 1832 1875 1930 1970 1992 2018 2062 2118
1305 2118 2168 2210 2251 2297 2339 2367 2374 2371 2374 2395 2432 2475 2521 2570 2623 2673 2717 2760 2809 2869 2943 3027 3115 3203 3294 3394 3506 3631 3773 3940 4138 4371
1301 4371 4641 4952 5314 5738 6240 6829 7509 8282 9142 10070 11024 11950 12774 13408 13744 13704 13288 12585 11723 10819 9959 9200 8566
1298 8566 8050 7628 7280 6996 6766 6576 6418 6288 6183 6104 6049 6014 5995 5991 6005 6033 6068 6106 6153 6219 6307 6412 6523 6641 6775 6935 7124
1295 7124 7336 7574 7855 8195 8587 9025 9528 10133 10866 11729 12731 13920 15359 17084 19106 21435 24075 26998 30119 33288
1292 33288 36266 38696 40147 40256 38916 36357 33065 29580 26323 23523 21241 19439 18028 16911 16009 15276 14687 14219
1290 14219 13857 13594 13430 13360 13380 13500 13735 14086 14535 15055 15629 16234 16827 17333 17670 17768 17601 17194 16625 16002 15423 14953 14614 14410
1287 14410 14347 14432 14663 15025 15518 16163 16986 18007 19244 20732 22516 24627 27067 29801 32751 35775 38655 41078 42645
1285 42645 42980 41900 39559 36406 32983 29729 26889 24538 22647 21145 19965 19062 18398 17929 17624 17471 17470 17626 17960 18515
1282 18515 19329 20420 21787 23424 25310 27393 29596 31799 33791 35250 35816 35265 33643 31250 28504 25786 23350 21312
1280 21312 19684 18411 17417 16631 16015 15552 15229 15021 14915 14919 15042 15285 15640 16106 16682 17341 18029 18676 19199 19512 19535 19228 18610
1277 18610 17761 16795 15833 14967 14235 13635 13158 12801 12558 12409 12335 12344 12458 12702 13090 13638 14361 15283 16424 17805 19438 21321
1275 21321 23438 25735 28096 30313 32083 33057 32946 31666 29411 26591 23653 20919 18547 16574 14978 13704 12678 11836
1272 11836 11130 10526 9991 9497 9036 8615 8243 7921 7640 7385 7141 6911 6705 6528 6372 6226 6090 5969 5866 5776 5693 5622 5572 5549
1269 5549 5539 5523 5493 5465 5462 5496 5561 5650 5766 5930 6155 6447 6807 7231 7719 8274 8900 9583 10278 10915 11416 11705 11714 11404 10801 10001 9130
1266 9130 8287 7525 6869 6327 5884 5513 5187 4891 4622 4378 4156 3957 3780 3625 3498 3404 3333 3260 3168 3071 2993 2937 2883 2818 2751 2694 2647
1263 2647 2602 2553 2500 2445 2391 2348 2318 2289 2255 2216 2181 2149 2111 2065 2016 1971 1929 1885 1836 1788 1747 1717 1695 1674 1653 1634 1623 1619 1615 1606 1596 1587 1576 1558 1539 1530 1539
1258 1539 1561 1581 1590 1587 1574 1554 1529 1497 1456 1409 1369 1351 1354 1360 1351 1333 1321 1317 1308 1288 1266 1255 1255 1256 1247 1227 1204 1190 1191 1198 1191 1164 1135 1123 1129 1142 1152 1153 1137 1103 1065 1040
1253 1040 1036 1038 1041 1048 1064 1080 1087 1094 1119 1154 1173 1163 1135 1110 1099 1102 1118 1140 1157 1164 1168 1176 1176 1155 1118 1086 1065 1042 1015 1007 1030 1068 1088 1081 1062 1048 1045 1054 1075 1099 1107 1096
1248 1096 1080 1072 1069 1065 1060 1061 1071 1082 1084 1068 1039 1010 995 996 1001 1005 1011 1021 1027 1020 1001 980 964 955 957 969 980 980 975 974 983 1000 1024 1053 1073 1070 1044 1014 1000 1006 1019 1022 1009 987 968
1243 968 955 945 933 924 920 915 909 911 930 955 975 985 994 999 994 977 963 961 966 972 982 991 989 970 948 941 943 940 931 931 950 976 990 985 976 980 990 980 940 897 883 901 924 931 926 920 908
1237 908 885 860 841 826 811 802 803 805 800 800 820 850 866 860 848 840 831 823 829 850 871 878 879 880 877 867 857 855 848 829 814 823 849 866 866 865 872 869 847 820 806 805 806 812 834 871 906
1231 906 922 915 895 869 845 826 814 809 814 833 857 871 867 854 844 840 837 830 821 816 818 822 822 811 796 793 808 831 846 853 866 890 916 936 953 968 969 952 927 907 887 863
1226 863 850 872 915 938 918 878 856 856 854 843 841 865 904 936 953 965 976 978 966 950 951 973 991 977 931 879 845 835 839 849 855 852 843 839 843 849 857 874 901 921 916 901
1221 901 904 935 971 986 976 955 932 910 894 889 888 883 876 876 883 890 890 882 870 855 835 811 787 773 778 803 839 875 909 940 964 972 966 965 985 1016 1030 1009 966 930 920 928
1216 928 937 934 921 907 906 919 936 944 938 923 908 894 885 884 891 902 906 904 902 902 903 900 897 901 915 936 959 973 966 943 921 918 935 956 961 945 910 868 830 811 821 857 904 937
1210 937 945 938 938 953 974 993 1012 1036 1058 1064 1051 1037 1038 1055 1075 1086 1089 1086 1083 1080 1077 1073 1065 1050 1036 1032 1042 1057 1068 1076 1086 1095 1094 1073 1044 1030 1046 1084 1126 1154 1166 1171 1173 1166
1205 1166 1141 1099 1061 1046 1050 1056 1046 1024 1001 982 968 954 941 929 920 913 907 901 899 906 923 944 960 960 944 921 906 908 916 916 905 891 876 855 839 844 874 905 913 904 901 911
1200 911 920 919 912 908 903 898 900 917 944 974 1000 1017 1018 1008 996 983 960 922 882 855 842 833 827 831 840 842 832 811 788 768 757 758 762 760 756 763 788 820 841 841 819 782 743 718
1194 718 712 718 726 739 760 782 792 790 785 778 766 751 753 781 819 838 825 796 772 760 752 741 735 744 768 796 821 843 863 870 858 836 822 824 832 830 818 805 796 790 785 783 787 796 809
1189 809 820 826 822 809 793 776 763 759 771 794 817 833 846 865 886 899 900 899 898 891 876 861 859 869 883 893 890 866 817 757 714 703 714 733 755 781 803 805 786 762
1184 762 745 736 727 722 729 749 768 778 787 806 828 837 825 807 800 800 794 784 785 800 809 795 765 737 719 702 680 663 663 680 703 723 737 746 751 748 736 717 697 676 652 630
1179 630 623 640 670 698 718 729 731 721 706 695 694 704 722 742 747 728 700 689 702 722 740 762 790 815 829 833 828 808 772 741 735 752 771 784 797 807 803 787 778
1174 778 787 807 827 844 860 866 857 836 811 784 755 727 704 692 695 714 742 763 772 773 771 763 747 731 725 727 727 721 719 730 750 771 780 771 746 721 712 717 723 719 708 696 681 661
1169 661 639 622 616 622 645 684 727 756 758 748 752 776 796 787 750 711 687 662 621 579 573 615 677 721 742 752 754 742 717 700 705 723 738 748 762 780 787 780 772 778 798
1164 798 817 827 826 810 775 726 682 659 661 678 702 722 728 714 689 671 671 682 692 696 695 693 690 682 673 673 687 710 732 747 757 764 765 757 747 742 749 762 774 779 771 755 740 731
1158 731 725 726 740 767 790 786 754 722 712 720 724 709 685 670 675 699 733 765 780 769 734 694 672 676 699 720 724 711 692 680 683 701 725 746 759 771 785 799 808 812
1153 812 808 797 779 764 756 755 757 765 780 793 793 782 772 769 764 745 718 698 695 703 713 723 731 736 738 746 761 773 769 754 742 740 743 744 743 735 715 684 659 658 679 698 700 688 676 671
1148 671 669 667 663 656 647 638 634 635 639 636 622 601 588 591 607 629 656 690 723 738 733 722 722 735 751 764 774 783 794 805 811 803 782 758 743 734 724 714 713 722 723 703 667 634 615
1142 615 606 597 591 599 625 660 687 700 707 709 699 674 645 626 621 622 629 638 643 635 624 629 648 664 666 664 672 685 693 695 694 690 684 681 687 701 718 735 748 744 719 691 681 695 717 733 743
1137 743 747 735 705 667 640 632 637 649 667 686 702 707 699 683 668 661 657 651 645 645 652 656 652 645 645 659 689 730 772 799 801 780 745 713 701 721 757 779 766 729 689 656 629
1131 629 614 619 642 670 689 699 701 705 720 750 778 787 780 774 776 769 740 706 689 689 683 663 640 632 640 655 671 685 700 718 742 766 784 791 790 782 765 740 721 711 707 705 712 737
1126 737 768 790 798 803 811 814 804 793 798 813 820 809 792 781 776 768 759 760 771 785 794 801 815 836 854 859 852 838 821 803 785 766 747 730 720 722 731 739 742 742 743 744 741 736 736 738 733 717
1120 717 692 666 643 626 614 607 605 612 626 644 661 676 692 706 715 722 736 756 775 785 782 766 743 722 710 709 711 708 701 693 683 675 675 687 705 724 746 771 789 786 765 748
1115 748 752 770 777 760 734 718 719 723 718 702 684 668 652 639 635 640 648 651 652 660 675 694 712 726 734 739 751 773 790 788 768 745 731 723 716 713 716 721 724 727 738 756 774 783 780 770
1109 770 762 759 753 738 713 686 660 635 616 614 635 666 692 710 726 739 744 744 745 751 754 753 751 757 766 772 771 762 742 712 684 673 684 708 726 732 732 728 718 703 693 695 703 700 686 674
1104 674 671 673 673 677 690 706 712 705 695 683 666 646 641 661 692 710 704 684 661 647 651 675 704 707 675 630 601 594 589 580 581 601 620 620 611 616 638 656 648 624 604 598 599 600 600 606
1098 606 621 639 649 645 635 631 635 643 660 695 740 773 783 781 782 782 769 746 730 727 728 720 701 676 650 640 655 691 725 740 732 714 694 686 696 721 742 749 746 744 747 752 752 745
1093 745 735 734 751 776 788 778 758 742 730 713 691 681 697 735 772 792 793 782 767 752 743 741 741 734 718 703 697 693 684 676 677 684 678 659 646 654 673 686 694 702 703 689 665
1087 665 651 656 673 693 717 746 777 801 815 815 800 775 753 738 724 706 688 676 668 660 655 662 682 700 700 678 652 639 644 656 660 651 635 624 623 630 635 634 633 642 663 687 706
1082 706 715 718 715 711 707 697 671 638 617 623 643 660 668 674 682 691 701 711 715 707 692 686 691 699 705 709 706 695 686 693 710 715 703 692 694 702 703 702 704 703 692 677 671 671 662 650 645 649 645 630 616
1076 616 612 615 616 620 634 650 658 658 659 660 653 634 615 604 601 599 597 604 624 651 673 682 680 666 641 610 583 566 558 559 571 595 627 656 674 676 664 644 629 626 632 643 656 667 666
1070 666 650 631 626 636 649 659 666 675 681 683 681 676 662 640 616 598 587 580 582 599 629 661 686 701 709 713 713 707 699 691 682 665 644 629 631 651 680 710 729 731 716 699 697 710
1065 710 719 708 678 644 619 607 609 624 649 674 689 688 676 666 662 654 640 630 634 650 661 666 670 671 660 643 638 648 654 645 634 645 672 694 700 694 680 654 626 609 607 609 613
1060 613 623 632 628 616 615 632 646 634 606 589 594 606 608 606 614 638 668 694 711 716 710 693 672 662 675 709 745 761 748 722 706 713 733 748 747 729 704 679 664 656 648
1055 648 632 615 607 612 622 629 639 655 668 671 673 686 700 697 671 644 638 656 689 730 769 801 819 821 806 775 744 730 733 739 738 740 753 764 762 754 750 744 724 698 690 696 696 680
1049 680 666 674 695 710 715 716 719 719 715 708 698 684 671 663 657 652 651 657 663 661 657 668 692 710 703 674 644 628 624 623 620 614 613 622 636 644 643 641 647 659 663 651 634 629 642 667 692 708 707
1043 707 693 676 669 675 685 688 683 677 677 684 696 712 730 745 751 753 757 766 775 772 754 728 706 694 692 696 704 707 698 678 659 650 646 638 628 623 625 622 610 599 598 610 632 661 689 709 714 710
1037 710 705 702 701 697 689 678 668 668 677 685 686 683 689 705 720 719 703 682 669 665 662 652 639 634 643 663 687 708 718 711 688 662 648 652 673 699 717 715 696 675 668 672 679 682 681 672 654
1032 654 633 615 601 592 593 613 641 661 667 672 682 689 684 671 663 662 662 662 663 664 662 662 676 699 716 713 699 691 691 686 667 646 648 681 729 765 775 761 732 699 671 658 656 648 626
1026 626 594 568 552 544 541 550 576 609 636 647 648 651 658 660 648 629 616 618 629 638 638 629 618 611 610 609 605 604 618 640 652 648 642 647 653 650 646 657 671 660 622 588 586 611 638 657
1021 657 670 682 693 705 719 729 733 736 746 765 786 798 799 791 777 759 739 718 705 705 714 722 716 695 663 632 613 618 643 673 708 754 807 850 870 878 893 908 911 905 910
1016 910 927 937 927 903 880 859 836 815 796 776 756 746 754 770 780 783 785 789 793 794 793 794 795 794 791 787 787 792 802 811 812 799 773 742 723 729 747 753 738 721 728 756 780 785 777
1010 777 758 722 667 613 583 577 578 576 574 579 584 582 572 562 554 550 554 568 582 584 576 571 580 602 629 652 665 661 646 638 648 667 677 672 665 666 676 690 704 709 692 654 619 608 622
1005 622 641 654 664 674 679 674 666 665 674 682 675 653 622 596 588 599 624 652 680 704 718 713 690 662 643 634 629 626 630 642 655 656 649 646 655 673 693 717 745 766 768 753 734 720
999 720 708 693 680 675 681 693 705 714 717 712 700 681 656 630 615 618 630 636 633 635 652 673 685 691 704 723 733 722 698 675 657 642 636 644 664 685 694 684 660 633 622 636
994 636 670 703 721 723 721 721 725 723 711 697 691 695 699 698 701 715 726 713 682 660 659 660 642 615 607 629 664 692 703 701 687 661 633 615 613 617 612 592 571 572 605 651 683 691 680
989 680 658 633 614 613 632 655 669 673 675 680 682 677 671 674 686 697 699 692 683 674 661 648 645 657 673 684 689 699 719 740 749 743 729 716 705 694 678 658 641 628 615 601 598 618
983 618 656 689 701 693 675 659 652 664 694 727 743 733 706 681 671 674 680 681 684 699 730 762 783 788 780 767 751 730 702 667 629 602 592 598 613 629 645 658 667 667 650
978 650 619 584 563 562 575 595 616 628 624 610 605 620 647 675 703 737 771 786 774 746 716 691 676 676 688 706 724 737 739 730 723 738 775 811 823 808 782 760 748
973 748 751 766 785 796 799 801 806 816 828 840 849 852 849 846 845 848 851 854 858 867 881 901 921 933 940 947 957 961 947 915 878 861 875 915 956 978 981 976 975 978 985 1002 1031 1061 1081 1087 1090
968 1090 1092 1088 1075 1064 1067 1080 1090 1091 1089 1092 1101 1111 1123 1138 1154 1170 1182 1188 1184 1172 1160 1160 1175 1203 1240 1282 1324 1359 1390 1421 1452 1481 1503 1517 1524 1522 1519 1523 1543 1572 1598 1611
963 1611 1613 1621 1647 1696 1756 1811 1853 1883 1902 1912 1921 1938 1963 1990 2015 2047 2092 2145 2198 2253 2322 2408 2497 2567 2617 2665 2731 2813 2891 2954 3009 3074 3149 3224 3294 3368
958 3368 3456 3555 3661 3777 3905 4035 4163 4297 4449 4621 4807 5008 5230 5475 5731 6000 6294 6628 6999 7402 7846 8353 8954 9690
955 9690 10602 11730 13111 14786 16802 19198 21978 25102 28493 32048 35653 39195 42551 45568 48067 49880 50901 51106
953 51106 50530 49230 47266 44716 41689 38334 34839 31387 28117 25098 22357 19909 17779 15984 14512 13318 12350 11556
951 11556 10889 10311 9798 9339 8926 8541 8162 7788 7431 7103 6801 6520 6262 6034 5838 5661 5491 5321 5151 4984 4825 4678 4539
948 4539 4407 4283 4171 4068 3969 3872 3778 3683 3587 3498 3422 3361 3309 3267 3239 3216 3177 3111 3030 2951 2881 2819 2763 2714 2664 2608 2550 2501 2461 2419 2368 2310 2243
944 2243 2165 2089 2037 2013 1999 1972 1933 1900 1874 1848 1815 1782 1759 1744 1738 1737 1735 1719 1683 1638 1601 1575 1547 1509 1470 1448 1443 1437 1414 1379 1346 1321 1298 1279 1267 1254 1225
939 1225 1176 1130 1107 1104 1106 1107 1109 1109 1103 1094 1088 1082 1070 1053 1047 1060 1087 1113 1132 1139 1126 1095 1060 1031 1015 1009 1011 1012 1001 977 950 924 889 846 817 826 867 915 953 985 1012 1025
934 1025 1019 1001 982 964 946 929 913 897 878 864 862 871 889 909 926 938 949 960 964 957 952 961 978 977 951 922 910 913 919 932 960 994 1015 1022 1022 1014 989 953 924 907 887
929 887 861 843 846 857 864 878 914 960 987 987 972 954 932 910 896 899 912 930 949 962 960 939 906 875 858 861 883 909 915 895 868 855 855 854 848 845 843 835 824 826 846 870
924 870 877 873 872 881 887 885 878 870 861 857 868 897 927 940 938 937 943 948 948 948 959 977 990 984 958 922 893 883 895 917 936 945 947 946 942 938 937 941 948 956 962 968 966 946 909 869 842 828 820 810
918 810 805 812 835 863 877 872 853 838 834 836 834 825 818 818 820 822 830 849 871 878 865 851 851 862 870 868 863 861 858 855 855 861 866 861 848 836 827 815 798 785 784 793 803 805 799 786 774 771 777 781 771
912 771 752 741 752 782 818 847 862 860 845 830 825 831 843 857 868 872 866 850 830 809 788 768 750 742 744 748 747 741 741 752 764 763 749 731 718 708 702 701 711 732 756 778
907 778 796 810 820 826 824 813 796 781 773 768 765 767 778 787 784 771 765 774 785 788 787 794 808 816 816 817 829 847 861 861 850 832 809 781 751 725 717 727 741 738 720 709 717 733 738 731
901 731 727 730 731 724 719 727 746 764 776 779 768 746 723 707 695 677 662 668 701 750 798 840 875 890 875 840 801 771 750 740 741 745 740 728 720 721 722 716 710 718 733 741 740 749 780
896 780 818 836 819 780 740 713 703 707 722 738 743 733 705 664 620 593 591 608 622 622 614 608 610 622 645 674 695 704 712 734 766 791 798 790 773 754 741 746 772 806 841
891 841 880 923 967 1004 1031 1042 1034 1012 994 988 985 973 955 938 917 883 847 828 829 835 835 835 842 850 856 867 887 906 913 911 911 913 907 890 875 872 880 887 886 876 859 837 816 798 782
885 782 766 748 732 724 728 740 752 760 769 787 807 819 820 819 826 841 855 864 868 870 872 870 859 844 832 833 848 863 865 852 838 837 848 856 850 834 822 820 825 833 844 861 880 890 887 878
879 878 875 873 861 836 811 808 830 869 908 936 946 929 888 841 811 805 815 824 819 803 785 774 772 776 785 801 816 814 794 780 794 830 854 849 825 802 789 787 797 816 831
874 831 833 823 808 788 770 768 784 799 787 748 711 692 692 705 739 790 836 851 836 810 784 754 722 700 695 706 724 748 774 797 807 804 789 766 744 728 722 719 719
870 719 732 761 798 826 831 818 800 788 784 785 786 789 795 803 811 821 841 872 901 912 903 886 875 869 860 844 829 821 822 821 812 792 764 740 735 756 792 821 829 821 814 811 807 799 800 811 822
864 822 821 818 831 860 884 885 865 841 821 807 798 796 800 809 820 832 842 851 859 864 861 853 848 851 856 852 840 827 820 818 821 821 809 787 776 798 847 889 901 887 869 859 856 856 855 851 845 838
858 838 827 807 784 774 779 784 772 751 747 775 822 863 885 888 881 871 860 847 832 821 823 833 835 822 800 784 780 786 803 830 857 872 871 862 859 864 874 884 890 889 885 883 887 892 885
852 885 863 837 820 819 829 848 865 868 851 835 845 885 926 941 932 914 895 866 834 816 818 828 829 823 823 837 864 901 940 967 971 951 918 885 863 853 850 848 844 846 858
847 858 879 901 916 926 935 945 954 953 939 922 912 910 905 890 874 873 890 914 931 937 932 917 896 878 869 866 855 831 810 807 824 844 854 858 858 847 822 796 788 802 827 852
842 852 873 888 886 870 847 829 817 813 822 847 879 903 913 913 916 925 936 937 924 906 891 881 878 884 904 922 924 912 905 909 909 891 864 841 827 821 827 845 862 868 869 874 878 869 852
837 852 844 854 874 892 905 905 890 867 853 854 859 857 852 852 861 875 892 910 930 949 962 959 936 910 898 902 914 927 943 956 961 964 979 1002 1003 969 926 909 922 941 949 956 969
832 969 981 979 971 971 982 991 986 979 991 1027 1073 1110 1130 1130 1114 1097 1101 1131 1160 1159 1129 1099 1090 1096 1102 1104 1102 1092 1071 1051 1041 1040 1040 1036 1035 1041 1058 1084 1115 1146 1176 1207 1234 1245 1238
826 1238 1224 1215 1204 1180 1143 1102 1067 1044 1038 1045 1056 1068 1080 1091 1090 1071 1052 1052 1067 1073 1063 1047 1034 1018 993 965 945 938 947 968 991 1003 1003 998 995 991 988 991 998 999 985 964 953
821 953 961 986 1013 1026 1016 998 991 1000 1016 1030 1039 1040 1025 997 978 985 1009 1026 1027 1020 1014 1015 1025 1039 1050 1048 1038 1030 1030 1035 1038 1042 1050 1063 1080 1099 1113 1119 1120 1118 1118 1120 1130 1146 1165 1182
815 1182 1198 1210 1210 1191 1157 1124 1105 1100 1095 1081 1063 1052 1055 1067 1077 1085 1101 1124 1137 1122 1082 1044 1031 1040 1055 1064 1061 1045 1017 983 959 956 972 990 999 998 996 992 984 975 976 989 1004
810 1004 1013 1022 1043 1068 1084 1089 1099 1125 1157 1174 1166 1142 1111 1080 1055 1046 1059 1084 1104 1107 1102 1100 1103 1100 1086 1073 1076 1097 1122 1137 1134 1115 1096 1093 1112 1137 1149 1139 1118 1095 1083
805 1083 1091 1117 1142 1146 1127 1105 1093 1089 1090 1096 1104 1102 1087 1069 1061 1057 1047 1034 1033 1050 1076 1099 1117 1128 1127 1116 1114 1129 1152 1167 1171 1176 1187 1196 1197 1198 1206 1219 1227 1224 1212 1190 1165 1146 1145
799 1145 1159 1178 1189 1193 1196 1199 1200 1200 1204 1213 1224 1231 1231 1226 1220 1216 1213 1211 1212 1214 1213 1201 1182 1171 1175 1189 1206 1224 1238 1243 1236 1227 1226 1224 1207 1177 1153 1147 1152 1159 1172 1199 1233 1260 1274 1285 1302 1327
794 1327 1351 1364 1365 1353 1334 1320 1320 1332 1347 1356 1358 1358 1354 1340 1314 1285 1263 1249 1242 1242 1249 1253 1247 1241 1249 1272 1291 1289 1273 1262 1267 1280 1288 1287 1283 1283 1288 1287 1271 1246 1229 1229 1240 1252 1263 1276
788 1276 1294 1316 1338 1353 1355 1341 1321 1307 1307 1318 1338 1362 1385 1401 1409 1413 1418 1425 1434 1437 1432 1429 1444 1482 1527 1559 1577 1583 1576 1545 1498 1452 1422 1404 1390 1378 1379 1401 1442 1482 1496
783 1496 1477 1439 1402 1380 1376 1387 1404 1413 1407 1402 1413 1436 1449 1443 1427 1417 1415 1418 1422 1421 1411 1396 1393 1404 1416 1415 1406 1405 1427 1470 1520 1555 1562 1550 1540 1542 1549 1555 1566 1583 1591 1580 1567 1577
778 1577 1609 1631 1621 1590 1564 1556 1559 1562 1559 1548 1529 1508 1498 1509 1538 1572 1597 1608 1607 1597 1581 1568 1563 1568 1578 1591 1615 1648 1680 1694 1692 1685 1684 1692 1702 1712 1722 1734 1754 1775
773 1775 1788 1785 1774 1768 1773 1776 1766 1741 1712 1693 1692 1705 1715 1715 1708 1708 1722 1739 1743 1733 1724 1731 1754 1783 1803 1804 1786 1761 1742 1735 1737 1748 1768 1797 1825 1847 1866 1885 1903 1912 1913 1910 1905 1890
767 1890 1863 1840 1834 1848 1871 1897 1925 1951 1961 1957 1948 1941 1930 1917 1912 1928 1954 1976 1991 2002 2013 2025 2045 2073 2092 2085 2059 2033 2022 2022 2036 2071 2126 2183 2230 2263 2281 2274 2244
763 2244 2208 2188 2186 2186 2174 2147 2116 2094 2086 2085 2085 2086 2099 2118 2131 2133 2138 2153 2171 2178 2176 2175 2178 2183 2192 2211 2236 2262 2280 2288 2285 2276 2269 2272 2281 2288 2296 2310 2325 2328 2319 2312 2319 2334 2346 2356 2372 2398
757 2398 2425 2446 2462 2476 2480 2469 2445 2421 2409 2406 2408 2415 2433 2455 2459 2435 2399 2385 2406 2442 2466 2472 2474 2480 2488 2496 2511 2538 2567 2582 2579 2572 2577 2599 2634 2676 2721 2763 2790 2798 2794 2792 2798
751 2798 2814 2839 2863 2874 2870 2862 2863 2874 2880 2876 2866 2863 2871 2888 2907 2920 2920 2910 2903 2907 2920 2930 2930 2927 2930 2943 2956 2959 2953 2947 2949 2958 2968 2972 2973 2977 2990 3014 3038 3057 3071 3088 3109 3129 3146
746 3146 3158 3164 3162 3156 3151 3144 3125 3103 3103 3137 3186 3220 3239 3253 3266 3269 3270 3291 3337 3383 3403 3402 3400 3409 3427 3450 3478 3504 3523 3537 3553 3573 3591 3601 3600 3593 3586 3594 3620 3655 3684 3700
741 3700 3709 3712 3704 3684 3664 3663 3691 3738 3787 3826 3856 3885 3911 3924 3929 3941 3973 4012 4038 4048 4057 4078 4106 4135 4165 4200 4232 4251 4255 4249 4245 4247 4257 4278 4306 4336 4357 4364 4364 4373 4396
$$ [...]
-1604F85
##END=	
##END=	
