##TITLE=	4j6BdcTFS1CD$LieLc+ATg.21.ser
TM-VI-212, CDCl3, new, cosy

##JCAMP-DX=	6.0	$$ MestReNova 14.3.0-30573
##DATA TYPE=	LINK
##BLOCK_ID=	1
##BLOCKS=	2    
##ORIGIN=	Mestrelab Research S.L.
##OWNER=	hrzepa
##$MNOVA/LINK_BLOCK_TYPE=	ITEM	$$ NMR Spectrum
##$MNOVA/ITEM/POLYGON=	(XY..XY)
5321,5835
8722,5835
8722,8208
5321,8208
5321,5835
##$MNOVA/ITEM/Z=	0
##$MNOVA/ITEM/ANGLE=	0
##TITLE=	4j6BdcTFS1CD$LieLc+ATg.21.ser
##JCAMP-DX=	6.0	$$ MestReNova 14.3.0-30573
##BLOCK_ID=	2
##DATA TYPE=	MNOVA NMR VIEW DATA
##DATA CLASS=	MNOVA VIEW DATA
##$MNOVA/2D/THRESHOLD=	112.54044342041015625
##$MNOVA/ITEM/ZOOM/X=	-0.98135677571250334861,	11.004809999983093505
##$MNOVA/ITEM/ZOOM/Y=	-0.98135677571250334861,	11.004809999983093505
##END=	
##TITLE=	4j6BdcTFS1CD$LieLc+ATg.21.ser
##JCAMP-DX=	6.0	$$ MestReNova 14.3.0-30573
##BLOCK_ID=	3
##DATA TYPE=	nD NMR SPECTRUM
##DATA CLASS=	NTUPLES
##NUMDIM=	2
##ORIGIN=	Bruker BioSpin GmbH
##OWNER=	nmr
##.OBSERVE FREQUENCY=	400.32200160000002143
##.OBSERVE NUCLEUS=	^1H
##.SOLVENT NAME=	CDCl3
##.PULSE SEQUENCE=	cosygpqf
##LONGDATE=	2022/06/21 16:02:22.000
##.ACQUISITIONMODE=	SIMULTANEOUS (DQD)
##$ORIGINAL FORMAT=	Bruker XWIN-NMR
##$MNOVA/SCALES_VERSION=	9
##$PARAMETER FILE=	(acqu2s, ASCII, /private/var/folders/f6/rjf_tdyn2v98c5c0wvkgn4s80000gn/T/4j6BdcTFS1CD$LieLc+ATg/21/acqu2s, 0)
$$ ##TITLE= Parameter file, TOPSPIN		Version 3.2
$$ ##JCAMPDX= 5.0
$$ ##DATATYPE= Parameter Values
$$ ##NPOINTS= 129	$$ modification sequence number
$$ ##ORIGIN= Bruker BioSpin GmbH
$$ ##OWNER= nmr
$$ $$ 2022-06-21 16:11:53.656 +0100  nmr@CZC2524DW0
$$ $$ /opt/topspin/data/agmb/nmr/Jun21-2022/21/acqu2s
$$ $$ process /opt/topspin3.2/prog/mod/go
$$ ##$ACQT0= 0
$$ ##$BF1= 400.32
$$ ##$FnMODE= 1
$$ ##$NUC1= <1H>
$$ ##$NusJSP= 0
$$ ##$NusT2= 1
$$ ##$NusTD= 128
$$ ##$O1= 2001.60000002825
$$ ##$SFO1= 400.3220016
$$ ##$SW= 12.009563022959
$$ ##$SW_h= 4807.69230769231
$$ ##$TD= 128
$$ ##END=
$$ 
##$PARAMETER FILE=	(acqus, ASCII, /private/var/folders/f6/rjf_tdyn2v98c5c0wvkgn4s80000gn/T/4j6BdcTFS1CD$LieLc+ATg/21/acqus, 0)
$$ ##TITLE= Parameter file, TOPSPIN		Version 3.2
$$ ##JCAMPDX= 5.0
$$ ##DATATYPE= Parameter Values
$$ ##NPOINTS= 12	$$ modification sequence number
$$ ##ORIGIN= Bruker BioSpin GmbH
$$ ##OWNER= nmr
$$ $$ 2022-06-21 16:11:57.094 +0100  nmr@CZC2524DW0
$$ $$ /opt/topspin/data/agmb/nmr/Jun21-2022/21/acqus
$$ $$ process /opt/topspin3.2/prog/mod/shimcntl
$$ ##$ACQT0= 1000000
$$ ##$AMP= (0..31)
$$ 100 100 100 100 100 100 100 100 100 100 100 100 100 100 100 100 100 100
$$ 100 100 100 100 100 100 100 100 100 100 100 100 100 100
$$ ##$AMPCOIL= (0..19)
$$ 0 0 0 0 0 0 0 0 0 0 0 0 0 0 0 0 0 0 0 0
$$ ##$ANAVPT= -1
$$ ##$AQSEQ= 0
$$ ##$AQ_mod= 3
$$ ##$AUNM= <au_zg>
$$ ##$AUTOPOS= <41 >
$$ ##$BF1= 400.32
$$ ##$BF2= 400.32
$$ ##$BF3= 400.32
$$ ##$BF4= 400.32
$$ ##$BF5= 400.32
$$ ##$BF6= 400.32
$$ ##$BF7= 400.32
$$ ##$BF8= 400.32
$$ ##$BYTORDA= 0
$$ ##$CAGPARS= (0..11)
$$ 0 0 0 0 0 0 0 0 0 0 0 0
$$ ##$CFDGTYP= 0
$$ ##$CFRGTYP= 9
$$ ##$CHEMSTR= <none>
$$ [...]
$$ 0 0 0 0
$$ ##$ShimPowMaxUC= (0..63)
$$ 130000 130000 130000 130000 130000 130000 130000 130000 130000 130000 130000
$$ 130000 130000 130000 130000 130000 130000 130000 130000 130000 0 0 0 0
$$ 0 0 0 0 0 0 0 0 0 0 0 0 0 0 0 0 0 0 0 0 0 0 0 0 0 0 0 0 0 0 0 0 0 0 0 0
$$ 0 0 0 0
$$ ##$ShimPowMaxUG= (0..63)
$$ 524287 524287 524287 524287 524287 524287 524287 524287 524287 524287 524287
$$ 524287 524287 524287 524287 524287 524287 524287 524287 524287 0 0 0 0
$$ 0 0 0 0 0 0 0 0 0 0 0 0 0 0 0 0 0 0 0 0 0 0 0 0 0 0 0 0 0 0 0 0 0 0 0 0
$$ 0 0 0 0
$$ ##$ShimPowRcbType= 3
$$ ##$ShimPowRes= (0..63)
$$ 1e-20 1e-20 1e-20 1e-20 1e-20 1e-20 1e-20 1e-20 1e-20 1e-20 1e-20 1e-20
$$ 1e-20 1e-20 1e-20 1e-20 1e-20 1e-20 1e-20 1e-20 0 0 0 0 0 0 0 0 0 0 0 0
$$ 0 0 0 0 0 0 0 0 0 0 0 0 0 0 0 0 0 0 0 0 0 0 0 0 0 0 0 0 0 0 0 0
$$ ##$ShimPowRng0= (0..63)
$$ 1 1 1 1 1 1 1 1 1 1 1 1 1 1 1 1 1 1 1 1 0 0 0 0 0 0 0 0 0 0 0 0 0 0 0 0
$$ 0 0 0 0 0 0 0 0 0 0 0 0 0 0 0 0 0 0 0 0 0 0 0 0 0 0 0 0
$$ ##$ShimPowRng1= (0..63)
$$ 1 1 1 1 1 1 1 1 1 1 1 1 1 1 1 1 1 1 1 1 0 0 0 0 0 0 0 0 0 0 0 0 0 0 0 0
$$ 0 0 0 0 0 0 0 0 0 0 0 0 0 0 0 0 0 0 0 0 0 0 0 0 0 0 0 0
$$ ##$ShimPowRng2= (0..63)
$$ 1 1 1 1 1 1 1 1 1 1 1 1 1 1 1 1 1 1 1 1 0 0 0 0 0 0 0 0 0 0 0 0 0 0 0 0
$$ 0 0 0 0 0 0 0 0 0 0 0 0 0 0 0 0 0 0 0 0 0 0 0 0 0 0 0 0
$$ ##$ShimPowRng3= (0..63)
$$ 1 1 1 1 1 1 1 1 1 1 1 1 1 1 1 1 1 1 1 1 0 0 0 0 0 0 0 0 0 0 0 0 0 0 0 0
$$ 0 0 0 0 0 0 0 0 0 0 0 0 0 0 0 0 0 0 0 0 0 0 0 0 0 0 0 0
$$ ##$ShimSysFunc= (0..63)
$$ 1 2 3 4 5 7 9 11 15 16 8 10 12 14 6 17 13 18 19 20 0 0 0 0 0 0 0 0 0 0
$$ 0 0 0 0 0 0 0 0 0 0 0 0 0 0 0 0 0 0 0 0 0 0 0 0 0 0 0 0 0 0 0 0 0 0
$$ ##$ShimSysMatrix= 0
$$ ##$ShimSysType= 1
$$ ##$TFXNUM= 0
$$ ##$TRIPLO2= 0
$$ ##$VTU= 2
$$ ##$VTUETH= <149.236.99.20>
$$ ##$VTUTY= <no>
$$ ##$WBREFAM= (0..15)
$$ 132.2 106.2 100 100 100 100 100 100 100 100 100 100 100 100 100 100
$$ ##$WBREFLM= (0..15)
$$ 0 0 0 0 0 0 0 0 0 0 0 0 0 0 0 0
$$ ##$WBREFPH= (0..15)
$$ 77.55 -65.76 0 0 0 0 0 0 0 0 0 0 0 0 0 0
$$ ##$WBSGU= (0..15)
$$ 0 0 0 0 0 0 0 0 0 0 0 0 0 0 0 0
$$ ##$XFAC= 2
$$ ##END=
$$ 
##$DECIM=	4160
##$DSPFVS=	20
##.ACQUISITIONSCHEME=	NOT PHASESENSITIVE
##NTUPLES=	nD NMR SPECTRUM
##VAR_NAME=	FREQUENCY1,	FREQUENCY2,	SPECTRUM
##SYMBOL=	F1,	F2,	Y
##.NUCLEUS=	1H,	1H
##.OBSERVE FREQUENCY=	400.32200160000002143,	400.32200160000002143
##VAR_TYPE=	INDEPENDENT,	INDEPENDENT,	DEPENDENT
##VAR_FORM=	AFFN,	AFFN,	ASDF
##VAR_DIM=	512,	512,	262144
##UNITS=	HZ,	HZ,	ARBITRARY UNITS
##FIRST=	4405.4455391999963467,	4405.4455391999963467,	0.011880133301019668579
##LAST=	-392.85674445383250486,	-392.85674445383250486,	0.30324837565422058105
##MIN=	-392.85674445383250486,	-392.85674445383250486,	0.0022179663646966218948
##MAX=	4405.4455391999963467,	4405.4455391999963467,	19408.416015625
##FACTOR=	1,	1,	0.0073872290212534819781
##PAGE=	F1=4405.45
##FIRST=	4405.4455391999963467,	4405.4455391999963467,	0.011880133301019668579
##DATA TABLE=	(F2++(Y..Y)), PROFILE
$$ [...]
##PAGE=	F1=-1003.21
##FIRST=	4405.4455391999963467,	4405.4455391999963467,	0
##DATA TABLE=	(F2++(Y..Y)), PROFILE
3720C2oK7JP3j04L0l3R5q1J6Lqk6R9n5rk7N3Oo5K7K7mm3L7mK1J4m0k6NO4m2N4m2N1o8j8P5
$$ 32 26 53 54 127 23 53 20 115 34 50 53 45 19 118 63 54 27 80 86 21 48 75 71 28 65 61 82 96 56 30 35 99 57 111 69 120 52 34 109
3354A09p5M3m5J1NORn4L9M3o7M0pRj3O3n3l7N9l5M8o4M9j7rr%P7o7L4j2k2J96MM5m2j57Q73
$$ 109 34 77 32 43 48 54 63 9 48 91 24 64 57 66 53 116 63 26 85 50 98 34 83 66 57 48 48 125 58 92 80 58 254 258 303 261 104 977
2997I77q50J188j168K95j97K82J35k63O50o65j92m7m1Jp1L8l7J2J11j48P0%J17m3J64R05n1
$$ 977 127 1315 147 442 245 527 662 399 1049 384 192 145 104 105 34 72 35 47 158 10 80 80 197 154 318 1223 1172
2743A172l78m03k63rn8j3l1J43J39J28j47K07J022K130j662j611L25n59P3j63L5J44qj28l1
$$ 1172 794 391 128 119 61 48 17 160 299 427 280 487 1509 3639 1977 366 691 132 205 42 77 221 213 85 54
2509E4J3n1J1M4l1J3J5k3L3Qp7K5K3M6k4K3p4P3J4r2P4k6L0m6M7Ql9jjj9oJK4J0L5L2q3k1
$$ 54 67 16 27 71 40 53 68 45 78 86 9 34 57 103 79 102 28 101 115 23 97 71 101 55 102 110 71 70 69 50 44 45 69 79 114 146 63 42
2152D2J42o2l3N2o2J05j31N1L30K34J533Q83J445k642o64J79K46j398j1R4J774o6j624J468
$$ 42 184 122 89 141 79 184 53 104 434 668 2201 3084 4529 1887 1223 1402 1648 250 239 333 2107 2041 417 1885
1926A885r69m84J260Q59j42q38j521J53L6J43P38K742K616M09k316l37J950J950k90j063l463
$$ 1885 916 432 1692 2551 2409 1571 50 203 239 382 1120 3862 6478 6887 4571 4234 6184 8134 7844 6781 3318
1729C318j232o60p00r8j00k19j30o4J03M6q1r6K28j6R3J37O20M80m37P6Q373o63J5517j330
$$ 3318 2086 1426 726 628 528 309 179 115 218 264 183 87 315 299 392 529 1149 1629 1192 1268 9641 8978 24495 23165
1504B3165k0721K095l250q0n82k92lk08j00J85o7J0q4J06q0k9k3O9o8Q2p5ml2N7j9m3J07p7
$$ 23165 2444 4539 1289 1209 627 335 332 124 24 209 142 152 68 174 94 65 42 111 43 125 50 46 14 71 52 9 116 39
1241C9M7m3ooM6J8l0om2J4kJ1L9l9k5K8k0K0J2Mlk7Mj4L8O0n6Q1k1k7JK4l6Pn2K1k1j3J18
$$ 39 86 43 37 31 77 95 65 59 17 31 29 40 79 40 15 43 23 43 55 59 56 29 33 19 57 117 61 142 121 94 95 119 83 90 38 59 38 25 143
875A43r9R8j19N7J7k7OM1p2Q9L7j49J04k1M7JJ1nN0n0O4l6O9K0N0J26n2J2K72N57P543P611
$$ 143 44 142 23 80 97 70 76 117 45 134 171 22 126 105 152 153 164 159 209 159 223 187 256 276 326 452 400 412 684 1241 8784 16395
574A6395L07n268j0671j02j42L8j8k60J76k81M61k54L16n77J6Q24k80o15O21K96o44j46K3
$$ 16395 16702 11434 763 661 519 557 539 279 455 174 635 381 697 120 136 960 680 65 686 982 338 192 215
358B15j59N08q1J17k98j49K5l5l7l1J29j31L5kj5n5J28n6%m5R1n3Nj8L9m0O2p0o6Q7q4K8Q
$$ 215 56 564 483 600 302 153 178 143 106 75 204 73 108 106 91 36 164 108 108 63 154 101 106 88 127 87 149 79 13 100 16 44 52
48E2R5o0M3m0L5l0PJ8k5m5N1j3k8j8JJ31q2O8j36P6r4M2L3K2l0R7r8%J07o4L1K8m4k3kn7J0
$$ 52 147 87 130 90 125 95 102 120 95 50 101 88 60 42 43 174 92 160 24 100 6 48 81 103 73 170 72 72 179 115 146 174 130 107 105 48 58
-299E8K3O6j7J5J6mq0oJ16p8
$$ 58 81 147 130 145 161 157 77 71 187 109
-393A09
##PAGE=	F1=-1021.99
##FIRST=	4405.4455391999963467,	4405.4455391999963467,	0
##DATA TABLE=	(F2++(Y..Y)), PROFILE
4405A19n7R9j20L4K8j7l9R7l6n6N5r0O2J6n4L1KP4q9M3p2J7N1Qm5k2J02m6j1j7l3P5m0l0k4
$$ 119 62 161 41 75 103 86 47 144 108 52 107 17 79 95 41 72 74 148 59 102 30 47 98 106 61 39 141 95 84 67 34 109 69 39 15
4077A5L5L6k4J1Jo1nK7N9m7K4m1M7j0L7m0Ql5K8K0j1lm8j5J3J2R5j14M2k3k3J2lmP9j7M6o6
$$ 15 50 86 62 73 74 13 8 35 94 47 71 30 77 67 104 64 72 37 65 85 74 71 23 8 21 33 128 14 56 33 10 22 19 15 94 77 123 57
3720E7j8oM9L6q7pqQ1m2l4L7rm0Q9o6RRJ1L8o3rJ4Kl7O9l1O1l2j7l0LM0mM8o3O0n2J8J3m9
$$ 57 39 33 82 118 31 24 16 97 55 21 58 49 9 98 32 41 50 61 99 36 27 41 43 6 75 44 105 73 56 26 29 69 65 113 50 110 58 76 89 40
3344D0N1m6rK0k1Pj1NM2m8L9j3k9K6M9j6p0Q3o7N0k5K8j7Ok2MP5n9JK1p6K33P1Pk4j61P25
$$ 40 91 45 36 56 35 42 31 36 78 30 69 56 27 53 102 86 16 99 32 82 57 85 68 74 52 56 131 72 73 94 18 251 322 329 305 144 869
2997H69o51J031j130K21o7M41L49q02O57n44k38J0l8j6o3M0m9L3R6j41O7J64J38p3N58L10
$$ 869 218 1249 119 340 273 714 1063 261 918 374 136 146 108 92 29 69 20 53 149 8 75 239 377 304 862 1172
2753A172P1p17j36k91mm4J7k5P1J40K02j85L32J315L003k475k118K94n00L9r5RJ22J3j20o2
$$ 1172 1243 526 390 99 95 51 68 43 114 254 456 271 603 1918 4921 2446 328 622 122 161 66 75 197 210 90 28
2509B8L6m2j2P5n8K5MJ0j6J8m5%L7K2k3J2n5O4K7p0M6rJk9N4nk7jPl9K3j8QM0lM4n9m0J55
$$ 28 64 22 10 85 27 52 56 66 50 68 23 23 60 82 59 71 16 80 107 37 83 74 75 46 100 95 68 67 74 35 58 40 48 88 85 129 70 30 185
2142A85n4n4O3q3J19r6n7P95m46R36J604J566k252j646J105n11r72O4p3J000q97J987j309
$$ 185 131 77 140 57 176 80 23 818 372 1308 2912 4478 2226 580 1685 1174 202 266 193 1193 296 2283 974
1926I74p8o46J762O07j563n43k98P1L5n4j27L06Q54R02n09J80R57J036k41p85j766m93K97
$$ 974 896 250 2012 2619 1056 513 215 286 321 267 140 446 1300 2202 1693 1873 2830 3866 3625 2840 1074 581 878
1711H78k01m5q1J39L4k56k58K60j33k29J16J42L00K64N02q91J134Q7L541J38K1834K19k4160
$$ 878 677 632 551 690 724 468 210 470 337 108 224 366 666 930 1432 541 1675 1762 5303 5441 27275 27494 3334
1495C334k24j455m86n29j48j19j69m5J49J7n4j41J15o9J8j15R7r6J25j21N4rn9J5LQ5q6P4
$$ 3334 3110 1655 1169 640 492 373 204 159 308 325 271 130 245 176 194 79 176 80 205 84 138 129 70 85 88 173 87 161
1232A61q3k2K7P1o3N%o5K9J8k0Q3j08M1k2k6M1OK0j2On1nK0K6L5j4j6M8p1m4L4mL0l5Mj8M1
$$ 161 78 56 83 154 91 96 96 31 60 78 58 141 33 74 52 26 67 73 93 81 87 36 31 51 77 112 98 82 130 59 15 49 45 75 40 44 26 67
875F7L2m9L4n2N7m7l3N5j2MlN1p0qL6K0o6K5L7m5pM2NpL6n1K9JR8J89J832K341Kj377k961
$$ 67 99 50 84 32 89 42 9 64 52 56 53 104 34 26 62 82 16 41 78 33 26 68 73 66 102 51 80 81 179 368 2200 4541 4543 3166 205
546B05R4j44L3J53k66K78k59P53j36J32p20O95L68k60l97K25M85n79n82N8o9N40r5J87o39
$$ 205 299 155 188 341 75 353 94 847 711 843 123 818 1186 926 529 754 1239 660 78 136 67 607 512 699 60
311F0O7K9q7J4l0J07j28M1k2j1OJ04o7l3j6N8l5J4K6K3n9L9q0L9j0llpN9o3L6O4q6L5J8j2
$$ 60 127 156 69 83 53 160 32 73 51 40 46 150 83 50 34 92 57 71 97 120 61 100 20 59 49 46 43 36 95 32 68 132 46 81 99 87
-27H7k0n8L9l0N1J3m9R3l2j0m9J4J6Qk2M0o4P7n5K4Q0j5l0L9p9oj0j7K5M3J6m4RJ3l8J1kJ10
$$ 87 67 9 48 18 69 82 33 126 94 84 35 49 65 73 51 91 27 104 49 73 153 138 108 147 68 62 52 35 60 103 119 75 84 97 59 70 68 178
-383A78q9
$$ 178 89
-393H9
##PAGE=	F1=-1040.77
##FIRST=	4405.4455391999963467,	4405.4455391999963467,	0
##DATA TABLE=	(F2++(Y..Y)), PROFILE
4405A20o9Q2k4qQkm3Q3p5L2o3M4L0k5l5k1O1j8N1j2o9K9j4M2q6P5J8Jmn1Jj0kK4k9j9Q2l4
$$ 120 51 133 109 101 109 107 64 147 72 104 41 85 115 90 55 34 95 77 128 116 47 76 62 104 18 93 111 112 108 57 58 48 46 70 41 22 104 70
4049G0j1lk6LJP7p2M7o2L3m2J02r9O5n7M1k1N6n3J2l8ML0N3o6k2jNNJ5j7L7K9jkl4l6P0%o6
$$ 70 59 56 30 33 34 111 39 86 24 57 15 117 18 83 26 67 46 102 49 61 23 27 57 110 44 22 21 26 31 46 29 66 95 94 92 58 22 92 92 26
3673B6K4j2M2j0m8K2Ol2O3o5L3J8k4N5m4n1J3J5ML4l8P5o0KL2n5J9J6L2o9P1l1N3n0k7N0l1
$$ 26 50 38 80 70 22 44 50 18 81 16 49 67 43 98 54 3 16 31 35 69 31 106 46 48 80 25 44 60 92 23 94 63 116 66 39 89 58
3326E8J2k0k8MK2JlKJ5j2l0K4M7jo3P5p9L1K0Rj0J2m5J7O7l5l3L7n7K02J60p4J9j41O90o57
$$ 58 70 50 22 26 48 49 46 48 63 51 21 45 92 91 28 103 24 55 75 84 74 86 41 58 125 90 57 94 37 239 399 325 344 203 893 236
2988B36R30j089J40R3N94O05q32pl20k55N0l8j6p2L8n3N6O9j06L7K56J50K32P06n39M08j051
$$ 236 1166 77 217 310 904 1509 677 670 350 95 145 107 91 19 57 4 60 129 23 60 316 466 698 1404 865 1273 222
2734B22J97l80L3l2O4m6K6R7L00k62L74J346L521k597k566J84l50K6p7j0J02Lr0o8M1k1j3
$$ 222 419 39 72 40 104 58 84 181 481 219 593 1939 5460 2863 297 481 131 157 80 70 172 175 85 17 58 37 24
2480B4N8n5RNM8l6j6pj2K6Rl1K7m2M3K7l2J5Jk6J9L0rk2J1%l4L8l7J1M0l6N4l1OP8m1p5P2
$$ 24 82 27 36 41 89 53 37 30 18 44 53 22 49 7 50 77 45 60 61 35 54 84 75 53 64 64 30 68 31 42 82 46 100 69 75 153 112 37 109
2114A09n9J17l6o9Q23m56J528M99Q53j629K98m46j095j8o2l5N56J948P11k091o80n68J186
$$ 109 50 167 131 62 885 429 1957 2456 3309 1680 1978 1532 437 419 357 322 878 2826 3537 1446 766 198 1384
1898A384ro35km35m5N1j55M26Q95J49q52k87N33R43J179L65j031r77r87O6k4NK8M23J32k84
$$ 1384 1375 740 738 303 258 309 154 580 1475 1624 772 485 1018 1961 3140 3505 2474 1497 510 576 552 557 585 1008 1140 856
1654H56l99J05j40m04L82K00N63M06j0N08J035n45J5660P62m981K186q225K909q071j785o45
$$ 856 457 562 422 18 400 600 1163 1569 1559 2067 3102 2557 18217 18979 13998 16184 7959 10868 2797 1012 367
1457C67J28k31q0K7Q5P1j25j93K85j81j6K3L0p4P5j38J95L0j67O4n1J4n9R6q2m0L8Q2q7ql
$$ 367 495 264 184 211 296 367 242 49 334 153 137 160 190 116 191 53 248 278 111 175 124 138 79 175 93 53 91 173 86 78 75
1166G5l0N0j5MO7j09O4n2k5P5j5J5j9Nl2k3L3J7L6k6n9R0q2LkL4J9j8k3k1k5J03o8Q8o6M2
$$ 75 45 95 80 84 151 42 106 54 29 104 89 104 85 90 58 35 68 85 121 95 36 126 44 47 45 79 98 80 57 36 11 114 46 134 68 110
828A10n0j9J2M9J0r7J33j13N2j9J5j8Q0k7k4j6K2n4J11j34J48n0L7qm5J298N24N1n26j246
$$ 110 60 41 53 102 112 15 148 35 87 68 83 65 145 118 94 78 100 46 157 23 171 121 158 150 105 1403 1927 1978 1452 206
546B06J2j04q0L40k22K29r8Q54o0j2p91J418R2k47n75L78K47n46r39K9k8N44J88J41m21l55
$$ 206 218 114 34 374 152 381 283 1137 1077 1065 274 1692 1784 1537 962 1340 1587 1041 102 131 103 647 835 976 555 200
302B00o2r8L1l3P6Opl2o1M0O0n6Lj9M2pm2M1K0j9m1M0K9p5K7l6j0K2J8j4J08r6J3J5m9K8j3
$$ 200 138 40 71 38 114 120 113 81 20 60 120 64 67 48 90 83 41 82 102 83 42 82 111 36 63 27 17 39 57 43 151 55 68 83 34 62 49
-45D9k1PL7M5p1J6M1q4N9m8Q1l7l2K2J9k3kL8K0L7r6O7j21N8J5kK4JrK9r1O7j2L1j8O7q4
$$ 49 28 35 72 117 46 62 103 19 78 30 111 74 42 64 83 60 58 96 116 153 57 124 3 61 76 74 98 99 90 119 28 95 83 114 96 163 79
-393G9
##PAGE=	F1=-1059.55
##FIRST=	4405.4455391999963467,	4405.4455391999963467,	0
##DATA TABLE=	(F2++(Y..Y)), PROFILE
4405A47l5J8L5m6j5nKL6o2P8j31J08k1m6KJ0L6r7J47o5k1J0n6O5l7O3m2M9k2p1L7n2M3J9k5
$$ 147 112 130 165 119 104 99 101 137 75 153 22 130 109 63 65 75 111 14 161 96 75 85 29 94 57 120 78 127 105 34 71 19 62 81 56
4077E6k3N5j1l9M8k9qNM9n1L4k5k7nQ1j00O1n6P2o2R1q3N1n2k2O3JLk5k7KK3Jrj3Q5m2L5l9
$$ 56 33 88 77 38 86 57 49 54 103 52 86 61 34 29 110 10 71 15 87 25 116 33 84 32 10 73 74 77 52 25 27 50 51 42 29 114 72 107 68
3711F8m3N5k4m0O9l5K6ln6kK8RK0m1K7J4k1K9j3l2jJ6Nj6nM6m3nR2j02J1ORk0M4kP3q8l6N2
$$ 68 25 80 56 16 85 50 76 73 17 15 43 52 72 31 58 72 51 80 67 35 34 50 55 39 34 80 37 32 124 22 33 39 48 28 72 70 143 55 19 71
3335G1KL2p1nnL1ql5N9j9j2J9k0M1ok5M1m2j7N0qJJ1o5M5M3lo2K4pJ59K43j78Q6p5O84q88
$$ 71 73 105 34 29 24 55 47 12 71 52 40 59 39 80 74 49 90 48 31 81 73 74 85 20 65 108 105 43 67 60 219 462 284 370 295 979 91
2988I1J074j041L5J75P17P90o31p52j47k45P5k6j6q7L2l5M7N0o8MK82J21O25P15j283P82q64
$$ 91 1165 124 159 334 1051 1841 1210 458 311 66 141 115 99 12 44 9 56 106 38 42 324 445 1070 1785 502 1284 420
2734D20L5m08Rk3J22j02K7J3L95l65L48J142L384k091k651L3j21K6j16%P9m3m1rj3nrL0j7
$$ 420 455 47 56 33 155 53 80 93 488 123 471 1613 4997 2906 255 288 167 193 77 77 156 113 72 63 50 45 36 66 49
2462D9l8K2P7k9p1L0lk2J4J6Nl2%LK2J6j7k1N7k5lk1M2l5L1Kj1J1j6j2J6rR4m8l2oRK7O5k0
$$ 49 11 33 110 81 10 40 37 15 29 45 50 18 18 21 43 59 42 21 78 53 50 29 71 36 67 69 58 69 53 41 57 48 142 94 62 56 65 92 157 137
2086A37l7N23K82J396l95nj155J652j053o55j48j58J4J564K483j255j883p12k43N26K15Q52
$$ 137 100 623 905 2301 1906 1901 746 2398 1345 690 542 384 398 1962 4445 3190 1307 595 352 878 1093 1945
1880A945o55j027j13M1j73N05J059P68m67o62q0O76Q93J70o57p05r29k98L1R4K31N56J25j34
$$ 1945 1290 263 150 191 18 523 1582 2350 1883 1221 1141 1817 2710 2880 2223 1518 589 291 322 416 647 1203 1328 1194
1654A194k41k88k32j43L63K04M14K63M04J419K43l41J9392l46j0929q60q04M135j0764k175
$$ 1194 953 665 433 290 653 857 1271 1534 1938 3357 3600 3259 22651 22305 11376 10516 9712 13847 3083 908
1466I08m98K30o08Q9rLJ50j02P2J38j00j79J13j01J0ll3K10Q6j4j25j30m2%N7n3n6J6R5q0
$$ 908 410 640 32 121 112 115 265 163 235 373 273 94 207 106 116 113 80 290 376 362 237 107 65 65 122 69 13 29 124 44
1185D4j3k7K5L2k2J0M9p1O0m4pM7k0Kj3MJ5o3M3L1j0%j5L6o0K0k4M0rK2n3j7OP1m7Q4p4L8
$$ 44 31 4 29 61 39 49 98 27 87 43 36 83 63 65 52 56 71 8 51 82 72 72 57 93 33 53 29 69 60 82 29 12 18 89 42 126 52 90
828I0l4J7l2N2K8j11J06r1O4K8m5MQ8m3l1PMk7J07j39J75p0K0K0L7K219J415j18j164k198
$$ 90 56 73 41 93 121 10 116 25 89 117 72 76 164 121 90 97 101 74 181 42 217 147 167 187 224 2443 3858 3740 2576 378
546C78j61n6j9K96k00K04J0R58l6j06r24J668N4l19p98L97L9k40j083J05n7N26M80J25k39
$$ 378 217 161 142 438 238 442 452 1410 1374 1268 344 2012 2066 1747 949 1346 1385 1145 62 167 110 636 1116 1241 1002
311A002p88j34n3P6o2M8Q5m7k7o1QK4J3K5n4N6qq2L4J4N7j08R3K4q5Ok2%JO7l5P5l4m6mqK5
$$ 1002 214 80 27 103 41 89 174 127 100 39 47 71 84 109 55 111 103 21 55 69 126 18 111 135 50 56 34 34 35 102 67 142 108 62 58 50 75
-36G5Ol8J3%Q4n8p0J02p1N2o0R5p5K5m5J08q7J2J8k0Q8j17P6n7QL9j9L4n9K3R2j09O3Lj7j2
$$ 75 81 43 56 56 140 82 12 114 43 95 35 130 55 80 35 143 56 68 86 66 154 37 113 56 64 103 84 118 59 82 174 65 128 131 114 102
-374A02M4p9
$$ 102 146 67
-393F7
##PAGE=	F1=-1078.33
##FIRST=	4405.4455391999963467,	4405.4455391999963467,	0
##DATA TABLE=	(F2++(Y..Y)), PROFILE
4405A68l1j7M5p8qPM2j6j2O2j32R8o5k5M5M0k2n7J05r3K6jk2L3j0K7m3N1m2l9M7k0K3k2k6
$$ 168 137 120 165 87 79 86 128 112 100 162 30 128 63 38 83 123 101 44 149 56 82 81 59 92 82 109 66 117 75 36 83 63 86 64 38
4077C8J7j1M0o5J19p9k3K5J3K0k5K4p0K8K9p6L8j8R1o6O4p3M6o5J2M9m7O6m0l5j4O4m0J1l5
$$ 38 55 44 84 19 138 59 36 61 74 94 69 93 23 51 80 4 42 24 115 49 113 40 86 21 33 82 35 101 61 26 12 76 36 47 12
3748A2J12n5L0l4k4J8m1LP9m4K8k0n0J3KN6j9k6J7OK7m0K1rj5J9jn2K8nJ1l5J35j28J6j6J2
$$ 12 124 69 99 65 41 59 18 21 100 56 84 64 14 27 29 85 66 40 57 63 90 50 71 62 47 66 65 13 41 36 47 12 147 19 35 19 31
3401C1K3nK9O7q2l5J6M6L3r2%KJ5j6K2L8m8j9N9m2K2k1K6mJ2m0L4j9J6J3o0O1OJ5p1OL6J29
$$ 31 54 49 78 145 63 28 44 90 123 31 31 33 48 32 54 92 44 25 84 42 64 43 69 65 77 37 71 52 68 81 21 82 88 103 32 38 74 203
3044B03K94k69J51N0N77q07J081j053p1J75P85Q21l07j074k91j75M6ok4r6K3nJ4N2m9j1K59
$$ 203 497 228 379 429 1006 199 1280 227 156 331 1116 1937 1630 556 265 90 136 130 106 10 33 28 42 94 45 34 293
2790B93N4R65O53j451P86n83k44l47o4k6J70j80O5m0M11l66K31Q40K506j161k312j20J24L1
$$ 293 347 1312 1965 514 1300 717 473 126 62 36 206 26 91 51 462 96 327 1167 3673 2512 200 80 204 235
2565B35j68K9N7j15J8M8o0NlJ5J5m2PQ0j5o6K5nj1mN1k9k2k0K3%M1l5J9L2r1J3K0M7o2P6m4
$$ 235 67 96 153 38 56 104 44 49 46 61 76 34 41 121 106 40 65 60 49 45 96 67 45 25 48 48 89 54 73 105 14 27 47 94 32 108 64
2218F4L5J0j00O3m1j8J89j54k6J03q0J06k3k9J02Q2Q43N53l87k68o43J511o08l75m25j58P1
$$ 64 99 109 9 72 31 13 202 48 22 125 45 151 128 99 201 283 1126 1679 1292 1024 381 1892 1284 909 484 326 397
1964C97J923K220k773p72n42JQ30O97M1q72r71J2j53P2J40N68P87j5m58p4L06M36j18k76n00
$$ 397 2320 4540 1767 995 453 454 1284 1981 2022 1150 179 191 38 110 250 818 1605 1590 1132 1058 1364 1800 1682 1406 906
1729I06m90l28kK06M23N38J5K08J02o07n04J89J51J31r3j97J769M73l33Q49R376k221K4705
$$ 906 416 88 86 292 715 1253 1268 1476 1578 971 467 656 807 938 845 648 2417 2890 2557 3406 12782 10561 35266
1513C5266k469k6162K559p151r61k12O9p32K6l0k3P1R3J40j61K07j66j85l6O9l6J6L7J41J96
$$ 35266 32797 6635 9194 2043 1082 870 939 207 233 203 180 251 344 484 323 530 364 179 143 212 176 192 229 370 566
1279E66l50r6O7l2j01J2K6j1m0L8J8Pm6l2N8n3NN8n0K3K6p0M1l8M8J5%j4k9K7m2J8Q3m6l1
$$ 566 216 120 187 155 54 66 92 81 41 79 97 104 58 26 84 31 36 94 44 67 93 23 64 26 74 89 89 75 46 73 31 49 132 86 55
950E5m4J5j0J6O0m2oj2RLM0p3N7JM5p8KL9k7j1J5lJ16j17JO0l9pJ0lK0L2o9Q0m9kN5O2J735
$$ 55 11 26 16 32 92 50 44 32 41 44 84 11 68 69 114 36 38 77 50 39 54 51 167 50 51 111 72 65 75 72 92 124 55 135 86 84 139 201 1936
584A936J145m19q44j401k43k9M1K74j57J50J30J005m3j46j240J401K63m22n53k77R4K25p75
$$ 1936 3081 2662 1818 417 174 145 186 460 303 453 583 1588 1545 1399 159 1560 1823 1401 848 571 665 890 115
368A15J21j56M66N97J77j14r80j78m2J38r0L0R4r3Klm3j2Q8kq6P9k1m3K4k6J06r8M5L1m9m1
$$ 115 236 80 546 1143 1320 1206 226 48 6 144 54 84 178 85 87 84 41 29 117 115 29 108 87 44 68 42 148 50 95 126 77 36
67C6L7pj1O0l9M7J3o4k7O7l5Om2LK5P5j5p4N4m8K0l8Q7p5N8q8J47j26Qj4l7J38o5L2k2n4O8
$$ 36 73 66 55 115 76 123 136 72 45 112 77 83 41 44 69 144 129 55 109 61 81 43 130 55 113 25 172 46 54 40 3 141 76 108 86 32 100
-280A00k1L0p2O0Q7p0J8nn9K7L8o2
$$ 100 79 109 37 97 184 114 132 127 68 95 133 71
-393G1
##PAGE=	F1=-1097.11
##FIRST=	4405.4455391999963467,	4405.4455391999963467,	0
##DATA TABLE=	(F2++(Y..Y)), PROFILE
4405A65m8k3K1p4M4K5L4n9J1L8q4L4k8J4L0L5o3j0L1k3RJJ0Lk5j2M3j4n4L4L5k7J3o6rO6n9
$$ 165 117 94 115 41 85 110 144 85 96 134 50 84 56 70 100 135 72 62 93 70 79 80 90 93 68 56 99 85 31 65 100 73 86 20 11 77 18
4058A8O7l3J16j36j8N1k6J00r6N5p4K7k1lj1K9Q0o1K4k0km1N3Rp3R1p2k0PQ5q6K4oP4l4nj4
$$ 18 85 52 168 32 14 65 39 139 43 98 24 51 30 27 16 45 125 64 88 68 66 25 78 87 14 105 33 13 20 105 19 43 37 111 77 72 58
3711E8Mom2J5N4j6K6l9Jmm6R5m9k1L2j3Q2j02L1J1l4L4%jl1k5K8l6J36j10J3%L3j3k1L6L8
$$ 58 62 56 14 29 83 67 93 54 55 51 5 100 51 30 62 49 131 29 60 71 37 71 71 70 39 14 42 6 142 32 45 45 78 65 44 80 118
3363A18m2kn7Q3J4p2k4K5rKN7Oo0l6Q0k9lj1L5l6N0k6j2k0L6J7m9N7j4kn0O2mJ26K95l20J80
$$ 118 76 74 17 100 114 42 18 43 34 36 93 99 39 3 83 54 51 40 75 39 89 63 51 31 67 84 35 92 78 76 26 88 84 210 505 185 365
3016C65J96L67l89Q51j068r0N9P91O85O2j063n25q5l2J9l8r0K0K3l0O8n2RJ98k2J141O43j221
$$ 365 561 928 539 1390 322 232 291 1082 1767 1829 766 241 156 124 143 105 15 35 58 28 96 44 53 251 229 1370 2013 792
2753G92N52n03l86k74r5m2J90k08O7nL21j66R2P51Q23j02j666k1R9L7j86L6M6j20QQ0q1J7
$$ 792 1344 841 455 181 86 44 234 26 93 88 409 243 335 1086 1909 1807 141 120 219 256 70 106 152 32 40 120 39 56
2490E6mK9Pk9j1O5jn4L5k5K2l5O9n1mk5O1m3M4l0K9J4j01J5M8L2m9O1p3O6J8j00M9l1l5K11
$$ 56 52 81 88 59 48 113 112 58 93 68 90 55 124 73 69 44 105 62 106 76 105 119 18 33 81 113 64 125 52 118 136 36 85 54 19 230
2152B30j64j4J16j14J41j15KK49M6O32k76j34k37lP38J8l12n18o9J22J443J606k436Q25j398
$$ 230 66 52 168 54 195 80 82 331 377 1009 733 599 362 359 1097 1115 803 285 216 338 1781 3387 951 1776 378
1917C78P7Q30N12o61o04l25R9k41Q9QK02L7K27j4K11M6L93O7n14n24J78j64j24R6M41M32j13
$$ 378 455 1285 1797 1136 532 207 306 65 154 162 364 401 628 614 825 871 1264 1331 817 293 471 307 183 279 720 1152 1039
1664A039O24M54p38p17M11k34k86L72N33J166j407J704J42O316O785K6568k681l9449L061
$$ 1039 1663 2117 1379 662 1073 839 553 925 1458 2624 1217 2921 3063 9379 16164 42732 40051 602 3663
1485C663j740n61l91L7p10OJ39k1l2J19P2l82M64j63l85J85Pk3m0j62J82L25m71M1J39p2j47
$$ 3663 1923 1362 971 1008 298 304 443 422 390 509 581 199 663 500 115 300 307 284 244 82 264 589 118 159 298 226 79
1232G9K8N8J7j18P7J2K7q2K0M4n3j6O3j17O3M1o9N4m4M8J1m2L1l0qJ9k4R2p6Om7J2k3N7K1
$$ 79 107 165 182 64 141 153 180 98 118 162 109 93 156 39 102 143 74 128 84 132 143 101 132 102 94 113 89 181 105 111 64 76 53 110 131
903A31l4j9l6%O3l3oL7pN2q2k7k9J07m8K7p1J76j17Po0M4K6j9k2O5o4P3j13P4k5J04Q3Q17
$$ 131 97 78 42 42 105 72 66 103 96 148 66 39 10 117 69 96 25 201 84 91 31 75 101 82 60 125 61 134 21 95 70 174 257 1074
584A074O81o74m97k32k28k0R5K23n7K1K72R90q7q3j182J548L42l26r4k61L00j060l58n0l21
$$ 1074 1755 1081 584 352 124 104 199 422 365 386 658 1648 1561 1478 296 1844 2186 1860 1766 1505 1805 745 387 337 16
349A6L80M58L03o7p80j69q4R5r9NP3j18N0P0n6m1Q8n3l9L9k8K3M4p0Q7p5RK9K7p9O1k0m0M9
$$ 16 396 854 1157 1090 310 141 57 152 53 58 131 13 63 133 77 36 124 71 32 71 43 66 110 40 127 52 61 90 117 38 99 79 39 88
30H8l5Q6jm9n0J08r8kk9J2R2QL2r5Rk0lK2N5m1K9j01J38j51J6K1J8N7j9j3lm0M0K1k2J5J3
$$ 88 53 139 138 89 39 147 49 47 18 30 122 130 162 67 76 56 53 75 130 89 118 17 155 4 20 41 59 116 97 84 81 41 81 102 80 95 108
-318A08K6Om4qpK6K5k8
$$ 108 134 140 96 88 81 107 132 104
-393A04
##PAGE=	F1=-1115.89
##FIRST=	4405.4455391999963467,	4405.4455391999963467,	0
##DATA TABLE=	(F2++(Y..Y)), PROFILE
4405A46m1Rj8J0K8J2ln5k6N7np7Q3j4rLk1nn8J14n1jRln2mJ11p9l7N1L7o3J0j8L1K1m4J8M2
$$ 146 105 114 96 106 134 146 143 88 62 119 114 37 120 106 97 100 79 74 16 130 79 78 87 84 32 28 139 60 23 74 111 48 58 40 71 92 48 66 108
4039A08N0j21L4Mm1J28j36L9l4K6l0L9m5L4M5l5k4O4o9J8N5k8n4N6n7MJ3Q2j05ML2J3J8l2
$$ 108 158 37 71 75 34 162 26 65 31 57 27 66 21 55 100 65 41 105 36 54 109 81 27 83 26 30 43 125 20 24 56 69 87 55
3720E5MJ6j4l7J6oN7Qn1M0m1j7N7m7l2P5m1J05j11nL5n0N7KM1r8K4l1K2P5n2nJ2M1l8Rn%J0
$$ 55 59 75 61 24 40 34 91 99 48 88 47 30 87 40 8 83 42 147 36 31 66 16 73 75 116 18 42 11 33 108 56 51 63 104 66 75 70 70 80
3354H0K9j02Q2j3l8PRk3K5M8k1l3k1K8J0j9J7pm1N7K4m5l0N2J2n2M5J0o5LJ21n4J31K70l28
$$ 80 109 7 89 76 38 45 54 31 56 104 83 50 29 57 67 48 65 58 17 74 98 53 23 75 87 35 80 90 25 28 149 95 226 496 168
3025A68J55L25J29L2N38r50L4k12P46M40L99r37n95o6j01L6n0n3QL6o1P4o1O5J19o5J102P76
$$ 168 323 648 777 809 1347 397 431 219 965 1405 1804 867 272 206 105 141 91 38 46 82 21 95 34 99 218 153 1255 2031
2762B031j075M77o69l69j99q9o1J74j32j6K0K50O2R1R50j111P74j024J76o1M2j61J7L6o0k7
$$ 2031 956 1433 764 395 196 107 46 220 88 72 92 342 404 495 1445 334 1108 84 260 199 241 80 97 133 73 46
2518D6N3p2K9j5N1k1j2k0M0J4m6N4n5N9p4Q3n9K0l4Q3o2K4rK4Np9K8L3J5l1K8p9P9L3p4Jk
$$ 46 99 27 56 41 92 71 59 39 79 93 47 101 46 105 31 114 55 75 41 124 62 86 77 101 106 27 55 88 103 72 100 21 100 133 59 60 58
2171E8l9J88j33k6J13j19J59j68O9K96R4K01L44m55N61r33N11J53O0q55N1Q7N54J021j81Q61
$$ 58 19 207 74 48 161 42 201 33 102 398 492 693 1037 582 1143 210 721 874 934 79 130 217 771 1792 1611 2472
1926B472k080oL38j51l68p4Q9Q5k33L2J50M88j20l04O6K54J21N95J59p09k90M3k03j26O3K97
$$ 2472 392 386 724 573 205 131 220 305 72 104 254 742 622 318 384 638 759 1354 1513 804 514 557 354 228 291 588
1682E88L13j20Q87O66o48n72M43n49l80J392J079MJ497J689k398K8985P777j5693l281j3209
$$ 588 901 781 1668 2334 1686 1114 1557 1008 628 2020 3099 3103 4600 6289 3891 32876 40653 24960 21679 8470
1495H470O404j0753k571r77O3m93M0L41p8p8Q5l6l52M70j49k47K01o5or2r1O0K42k65%J62
$$ 8470 14874 4121 1550 573 636 143 183 524 446 368 453 417 65 535 386 139 340 275 269 177 86 146 388 123 123 285
1250B85q3j22K7O3M2j37O0lN2r7P8J8n0k7M9j25O6M9k5L6n7M1lo0O5ml2M6m2N9o5N4k9k6j0
$$ 285 202 80 107 170 212 75 135 132 184 87 165 183 133 106 155 30 96 145 120 156 99 140 137 77 142 138 106 152 110 169 104 158 129 103 93
922I3N0Lm6k4l6K9P9o1kM2l2N2o1Nn4J16l5k0n4J55p5K1r6O8Rk9m1Q5m7R5p7M6k7Q9J25N41
$$ 93 143 146 100 76 40 69 148 87 85 127 95 147 86 91 37 153 118 98 44 199 124 145 49 117 126 97 56 141 94 189 112 158 131 220 345 886
584H86P16n8p43n73j28k6J13J52O7j38L92R51j85J09p11K820j17k09n98L41J99k070n57k16
$$ 886 1602 1544 801 228 100 74 187 339 406 268 660 1611 1426 1535 824 3644 3527 3318 2720 3061 3260 1190 633 417
358D17l37J78J03M67m5l69k07r6km9l4L9O3n5Q7l8q0M9n3Q1j01K3J5P4j01K8k3P5n9R9r7L7
$$ 417 80 258 361 828 783 414 207 111 109 60 26 65 128 73 160 122 42 91 38 119 18 41 56 130 29 57 34 109 50 149 52 89
58H9k7j0k5KJ59o5l6p6J32j29P%N1Q9n9N7j20j0M5LL9J5k0j6p5P5l4nM8nj7kl3K9N9n2N7r3
$$ 89 62 52 27 29 188 123 87 11 143 14 21 21 72 161 102 159 39 29 74 77 116 131 111 95 20 95 61 56 104 99 82 80 47 76 135 83 140 47
-299D7Q9j9p1J16q6K5O4m0J5L
$$ 47 136 117 46 162 76 101 165 125 140 143
-393A43
##PAGE=	F1=-1134.67
##FIRST=	4405.4455391999963467,	4405.4455391999963467,	0
##DATA TABLE=	(F2++(Y..Y)), PROFILE
4405A54J4J2k6OLj6j5Pn5Q1J0j28J02l5l6j1P2k8o8J21r9JrJ9OK3N0j00j4J4N4m5k4N2K2k9
$$ 154 168 180 154 160 163 147 132 139 84 165 175 47 149 114 78 67 139 111 43 164 65 66 57 76 82 105 155 55 41 55 109 64 40 92 114 85
4067H5m2k3J49o0j6L2m7k6R5q7l9L3L7k0J9q2M1j1L8m3J06j18M4M2n2K0k8N2l8j2P3j04KO3
$$ 85 43 20 169 109 93 125 78 52 147 60 21 54 91 71 90 8 49 38 76 33 139 21 65 107 55 75 47 99 61 49 122 18 20 83
3748H3o2Q1l9NJk5qL6l2P9k0o5O0q3O9k8J3l4P1n1P5p1rK4k3L6qN8j04L1pJ2mJ1l0J2L7lL2
$$ 83 21 102 63 68 69 44 36 72 40 119 99 34 94 11 80 52 65 31 102 51 126 55 46 70 47 83 75 133 29 60 53 65 61 72 42 54 91 88 120
3382A20o8l2M8M5q3K3k6j0Q4l9k0J6K2l5N1k7m7M5j5J6l4j9K0J08n8o6N4Pk7lP5r0NJ39o4
$$ 120 52 20 68 113 30 53 27 17 101 62 42 58 80 45 96 69 22 67 52 68 34 15 35 143 85 19 73 80 53 50 125 35 40 179 115
3053A15J12K53l14R5M11n4K97J74o17J88n10O53J94O71q04n25j30j12K6n5jj9L5m1L5o2J46
$$ 115 227 480 166 261 672 618 915 1089 472 660 150 803 997 1668 864 339 209 97 123 68 67 48 83 42 77 15 161
2800A61N2n3Q63J011j120O43j004k53j29n6o4J06Qj34J7K14K62J46J110p07j41q81K90j93
$$ 161 213 160 1023 2034 914 1557 553 300 171 115 51 157 165 31 48 262 524 670 1780 1073 932 51 341 148
2574A48M2j13MMkJ2n1l7L2k3O3m4JQj8K4m2O9n3O5n9L9m8L2m2P9n8mM1mNn7O7k7J3k5mLJ4
$$ 148 190 77 81 85 83 95 44 7 39 16 79 35 36 44 26 50 8 77 24 89 30 69 21 53 11 90 32 28 69 65 70 13 80 53 66 41 37 40 54
2208E4L9m6l9L4rJ00p3n3R4m8J03j10M3K65J46j00Q67K6J165j455o57O73J20r85K0j22O4N38
$$ 54 93 47 8 42 33 133 60 7 101 53 156 46 89 354 500 400 1267 1293 2458 1003 346 1019 1139 154 174 52 116 654
1945F54R69P50j870j95M97K04r1n19l06O1l0q3J98L91K35m4l60P3L25L61K8m68k24j93j83
$$ 654 1623 2373 503 308 805 1009 918 399 93 154 124 41 239 630 865 821 461 534 859 1220 1248 780 556 363 180
1711A80j8J09K8K20J20Q01O39k66oL09n87J293j12P37R73L546L88k254L6452O051k9778N59
$$ 180 162 271 299 519 639 1440 2079 1813 1807 2116 1529 2822 2710 3447 4420 7966 8354 6100 42552 48603 18825 19384
1504A9384o501P175j4960l286r05m66j57j33J83j77k7J00j51mP9q1O4M8j05J9r0K18r6o6J29
$$ 19384 12883 20058 5098 1812 907 441 284 151 334 157 130 230 79 75 154 73 137 185 80 99 9 227 131 65 194
1269A94j58R3o7l0J6K9N9j04M8m4O5r4J21j0m7l8L8l0JL5K0J3o0K5k7k3O1K8m8N2m6J3L7N8
$$ 194 36 129 62 32 48 77 136 32 80 36 101 7 128 118 71 33 71 41 42 77 97 110 50 75 48 25 86 114 66 118 72 85 122 180
950A80k7p1j1K9Lo2J8l2L3O8p1k0O6m2L5k1J3o2R8k6k2j8R1k8K4r3N0j6k1n2R8pO4l8K1k5
$$ 180 153 82 71 100 103 41 59 27 60 128 57 37 103 61 96 75 88 26 124 98 76 58 149 121 145 52 102 86 65 13 111 104 168 130 151 126
612A26M2J76N09P58J80p14r88k5LO4J22J25j90L91R10k74K52m40L482o82j44j219P56N6j986
$$ 126 168 344 853 1611 1791 1077 89 64 67 131 253 378 188 579 1489 1215 1467 1027 4509 3827 3683 2464 3220 3276 1290
377A290o16k80k22O7lK58Q0j04k76m0j26P7ol4J58j42O0J9j01l0R7P3j77O3p1R7r6K8K0J21
$$ 1290 674 394 172 239 236 494 574 470 194 154 28 105 99 65 223 81 141 160 59 29 126 199 22 85 14 111 15 43 63 184
95A84j35R6j08Nk3J25q9NJ55j10m6rO5l2J6n8O4M6o4K5o0L4L2JJ8k2qj7rj5N4k0K7l6nm7N8
$$ 184 49 145 37 42 19 144 55 60 215 105 59 50 115 83 99 41 105 151 87 112 52 86 118 119 137 115 107 90 81 66 120 100 127 91 86 39 97
-252I7K1R4j22N4j13J12J0m3Q0p0L2N6j02N6J8
$$ 97 118 212 90 144 31 143 153 110 190 120 152 208 106 162 180
-393A80
##PAGE=	F1=-1153.45
##FIRST=	4405.4455391999963467,	4405.4455391999963467,	0
##DATA TABLE=	(F2++(Y..Y)), PROFILE
4405A93L7k7k7l3J6l4L2M2m4M3j3j33N9O%QN1l1r6R5r2L4qJ5N3ok1q7L9PK7K2o7M6Mo8j4L3
$$ 193 230 203 176 143 159 125 157 199 155 198 185 52 111 117 117 125 176 145 49 144 52 86 78 93 146 140 119 32 71 78 105 127 60 106 110 42 28 61
4049F1J59j72P8J8r6L6PK8m0lL9l7kl0J2j4N7j8O2j09K0J7n4J22j00J11q6m0O0l8K4M6m7L8
$$ 61 220 48 126 144 48 84 91 119 79 76 115 78 76 46 58 44 101 83 145 36 56 73 19 141 41 152 66 26 86 48 72 118 71 109
3729A09m9J5j3k9L9L5qK9l7q8P1j7P5r1N1m4M9j8j0K0J3rj8J8j3L5k2rL3k9n9L7n3J6K1Q7
$$ 109 60 75 62 33 72 107 99 128 91 3 74 57 132 41 92 48 97 79 69 89 102 93 75 93 80 115 93 84 117 88 29 66 13 29 50 137
3391A37J7j10j9J5M2j0l9K9l9J22q6moj2QJ09n3o5QK7l2M7m0k4J60p0j11N0L0K9n6J09q2k1
$$ 137 154 44 25 40 82 72 33 62 23 145 59 55 49 37 45 154 101 36 44 71 39 86 46 22 182 112 1 51 81 110 54 163 81 60
3072F0J07j2N9K46k81K4M39j53L52j74j13K73o52M78J7Q85o98m58k38l6k8n1M3n9L0L6l8l7
$$ 60 167 155 214 460 179 203 642 489 841 667 554 827 175 653 670 1555 857 399 161 125 97 46 89 30 60 96 58 21
2809B1K02L2m6N26J198j272J011j340j25p4k2j8k7J81k22QJ32M00K60J083k57m51j080K68
$$ 21 223 255 209 735 1933 661 1672 332 207 133 111 93 66 247 25 33 165 565 825 1908 1651 1200 120 388
2584C88l08M6o5M6r0O0P7j04k9jM2J0Nl2M0n1k9N1l5Q1l8M7o4lk5L0k9K0L4K7m4onP3q2N4
$$ 388 80 126 61 107 17 77 154 50 21 20 62 72 77 45 85 34 5 56 21 102 64 111 47 44 19 49 20 40 74 101 57 51 46 119 37 91
2246I1p2N4L8k6m0m2R9k3L2n0L7mq4J30p2N3m4J50M55l89N03J044J337j691r63Q91n15p17
$$ 91 19 73 111 85 45 3 102 79 111 61 98 94 10 140 68 121 77 227 682 293 796 1840 3177 1486 523 1414 899 182
1983A82P1j41L18L67K83M84r32l88J155O74j050p90o9p1K01j23k0j8M30K47n39K77K56j15
$$ 182 253 112 430 797 1080 1564 632 244 1399 2073 1023 233 164 93 294 171 151 133 563 810 271 548 804 689
1757F89K02k49m24j28J90L2K8j70N4M63M31K59M74P12M8n14L932l615r98L837K201q26Q34
$$ 689 891 642 218 90 280 312 340 170 224 687 1118 1377 1851 2563 2611 2097 6029 2414 1416 5253 7454 6628 7462
1541G462J8738Q18L2497L198n1369J685r394j285l83p11n22j85l89K34J10J9l4k45J13K9l34
$$ 7462 26200 27018 59515 62713 11344 13029 3635 2350 1967 1256 734 549 160 394 504 523 489 244 357 386 52
1344E2R4J31p3L8J21j95J79k16J41j18nJ4j8m2o1J54J0k9j12P3j27P3KM8n4O8m3m6k5J4P3
$$ 52 146 277 204 242 363 168 347 131 272 154 149 163 145 103 42 196 206 177 65 138 11 84 86 134 80 148 105 59 34 48 121
1053A21n2L6J4r6J1J3M1m1K9J39j3q0o0m4M5m0M4N4m6kk8OK8K0mq6O1k9J5lj5J13m7m1LJ3
$$ 121 69 105 119 23 34 47 88 47 76 215 202 122 62 18 63 23 67 121 75 73 45 51 79 99 95 9 70 41 56 53 38 151 104 63 66 79
715G9n6K3K1k0L3l0j1J1j0O9Mj01K24J74N92P4k50p67J9K4n6J76jJ9K32P59q2j17n00J689
$$ 79 23 46 67 47 80 50 39 50 40 109 113 12 236 410 1002 1076 826 59 78 102 46 222 221 240 472 1231 1149 1032 532 2221
433B221p57n15j90O61P07j693%k37P4K4K09j95J48J8l99J06q5M5Qr1J76j98K2J33p2q8J51
$$ 2221 1464 949 759 1420 2127 434 434 197 271 295 504 309 457 475 76 182 97 142 150 59 235 37 59 192 120 32 183
180A83M2k15R0Lk5j3P0m0J12j46K1o5M8k0J81j28l3J09o8l2N5k2K8J0j10N4j0M3o2N9K5j4
$$ 183 225 10 100 103 78 65 135 95 207 61 82 17 65 45 226 98 65 174 106 74 129 107 135 145 35 89 79 122 60 119 144 130
-121A30j6K1n5K7M0oj7Pk3k0o1J47j01J01k3P2j80N7%N1N7mj3n6J4L0r4J34M
$$ 130 114 135 80 107 147 141 124 131 108 88 27 174 73 174 151 223 43 100 100 151 208 204 191 135 149 179 85 219 223
-393B23
##PAGE=	F1=-1172.23
##FIRST=	4405.4455391999963467,	4405.4455391999963467,	0
##DATA TABLE=	(F2++(Y..Y)), PROFILE
4405B14J1o6Mk3Q0m1N6lk8n9nj0n8J01L1k4l9Kq9L4M7K3j1m4O6p1o8K0R5J3n6N5j00MqJN1
$$ 214 225 159 163 140 220 179 235 232 204 145 140 130 72 173 204 180 141 143 54 88 135 158 147 103 169 98 30 50 145 158 102 157 57 61 53 54 105
4058A05L0R8j89O9j3p0J21j38J59n2n3K3m2k6J02k1J3j2oNk5J1k8j4J47j43J01j23K7l5Q0
$$ 105 135 233 44 113 100 30 151 13 172 120 67 90 48 22 124 103 116 104 98 103 78 89 61 47 194 51 152 29 56 21 101
3767A01J9J2k7k3n9P0J4k0K0J0jj5k2j4LN0M5j02K0m9L4N9r7R8J0l8l8L3K4m1Q3n0M7q0m7
$$ 101 120 132 105 82 23 93 107 87 107 117 116 101 79 65 68 118 163 61 81 32 66 125 28 126 136 98 60 93 117 76 159 109 156 76 29
3438B9NJ0K4j7J26k7j16rjK2P2m4L0o8J09j05M3kk9L7J01q1o7k8R3r3J38q5k0J38o4q5oP9
$$ 29 34 44 68 51 177 150 34 25 24 46 118 74 104 36 145 40 83 81 52 89 190 109 42 14 107 14 152 67 47 185 121 36 30 109
3119A09N4p8Q9q4kL2Q4K1K04k29l6M17j93K94m67M01K75o23K98j35J045n85m67l37O8p2l9
$$ 109 163 85 174 90 88 120 204 225 429 200 164 581 388 682 215 616 891 268 566 431 1476 891 424 87 155 83 44
2865D4M6p6M1J00q6k4K13P5p2J77J220j415J464j469n8m9l3N9j18K66k52L0M8L86M49R20j84
$$ 44 90 14 55 155 69 45 258 333 261 438 1658 243 1707 238 180 131 98 157 39 305 53 83 131 517 966 1886 1702
2612A702l34j125K04m14Q8m3Q7j07J6J13o8q6L3N9j6K7n4L6n1j1N8o7J34j08J02q4j9j8N3
$$ 1702 1368 243 447 33 121 78 165 58 74 187 119 33 66 125 109 136 82 118 67 56 114 47 181 73 175 91 72 54 107
2340A07j6ON1lm8k0J5P1n3N9r2O5K0%q0k3J31o1N8q5N1J7q0J41j97J63p3J2Q10n29N53J157
$$ 107 91 97 148 145 97 77 92 163 110 169 77 142 162 162 82 59 190 129 187 102 153 170 90 231 34 197 124 136 946 417 970 2127
2039B127P76j602K15J30j408j63K23r0J36R21k04rl92n10J337O61j282l57q5j11J15j53j46
$$ 2127 2903 1301 1516 1646 238 75 298 208 344 1265 1061 1052 660 150 1487 2148 866 509 424 313 428 275 129
1823A29M13j42M6r6K66r9p4N91n95j35K84M5r1p8O8J3L42K31o69J431J178l00m82P634p537
$$ 129 542 400 446 350 616 517 443 1034 439 304 588 633 542 464 532 545 887 1118 449 1880 3058 2758 2276 9910 2373
1588B373K572j11k065L210J573R324O880N3058N270p5626m15j962j211l30q37p34j18j80L15
$$ 2373 4945 4834 2769 5979 7552 16876 23756 76814 82084 6458 6043 4081 2870 2540 1703 969 851 671 986
1410I86Oo5j31l14K44p6l07J63Q2j34m5J34k47K62m13L64j27m8l7NOo9J44Jm1j40Q0j41J07
$$ 986 992 927 796 482 726 650 343 506 588 454 409 543 296 558 145 509 382 334 297 302 308 239 383 384 343 203 283 142 249
1138B49RM2p1J8k7j8m9L9Q1p1O0l5p8k7N6L5n8P1R2n9j97J08k0O2q3N8K5o0J6l8N9M1k9j2
$$ 249 258 300 229 247 220 202 153 192 273 202 262 227 149 122 178 213 155 226 318 259 62 170 150 212 129 187 212 152 168 130 189 230 201 189
818A89q1L3nN7l4nJ30j00r7NK6M7QM5m8L1o1j1K1RQ2Nl5r0K67j83L28j15j74M2m8J1R2j81
$$ 189 108 141 136 193 159 154 284 184 87 92 118 165 173 218 170 201 140 129 150 159 241 246 211 121 388 205 533 418 244 286 238 249 341 160
499A60L09J44J35P99j304J630L373K515j084q73J327P84n225j706o19J34j61L23l28p1K91
$$ 160 469 613 748 1547 243 1873 5246 7761 6677 5804 7131 7915 2690 984 365 499 338 661 333 262 553
302E53l87P4j6o5l4n6N2Pl7J31l8j40J06Jn2J1J27j21j4O0q3N5k5o4N9M0p5J71j76m9L4J01
$$ 553 166 240 224 159 125 69 121 128 91 222 184 44 150 151 99 110 237 116 102 162 79 134 109 45 104 144 69 240 64 15 49 150
2A50J1K9p6J1oj1j05N0J26q1M7rp3l3J40n7L6M7k6k6o9M5o6L3J86j52Q2q4J7m7M5P7j5M3j6
$$ 150 161 190 114 125 119 108 3 53 179 98 145 136 63 30 170 113 149 196 170 144 75 120 54 87 273 121 203 119 136 89 134 211 196 239 223
-327B23q8pj1O7K7R6m0
$$ 223 135 128 117 184 211 307 267
-393B67
##PAGE=	F1=-1191.01
##FIRST=	4405.4455391999963467,	4405.4455391999963467,	0
##DATA TABLE=	(F2++(Y..Y)), PROFILE
4405B34JK4N5J5N7q8J6p9K5j67J23R0j07N1J9r2j36J26M9o3J01l4k6j25J04j20R2J2P6j2j47
$$ 234 235 259 314 329 386 298 314 235 260 93 216 306 199 250 269 177 41 167 216 153 254 220 194 69 173 53 145 157 233 221 74
4114G4M9j7k1J7N6L0j5Pq2J6j02J28R4j73J24q1n3m8J08m2J32o1jq8K2l9J24K1p0l8J27j61
$$ 74 123 106 85 102 158 188 173 180 98 114 12 140 234 61 185 104 51 3 111 69 201 140 139 51 73 34 158 179 109 71 198 37
3814C7L7QO4q2P6lm4np6Q1M2M3m7k4j9k3J2K6L5l4L8Lr9l0K3L4J01r6N9j9o6l7P9Q8j28J43
$$ 37 74 82 146 64 140 137 93 88 12 93 135 178 131 107 88 65 77 103 138 104 142 145 46 16 39 73 174 78 137 118 52 15 94 182 54 197
3476A97r2L5j21M0pM9J4l1Q8q7p3M5K1J4M8n3J3p6N8l1P6On3J4Q0p5q8Q2N0p9J17j29k5J01
$$ 197 105 140 19 59 52 101 115 84 172 85 12 57 78 92 140 87 100 24 82 51 127 133 80 94 174 99 11 93 143 64 181 52 27 128
3157A28Jm2k2O4M4r7N2o4O7n0J50M6J03j78q3L94j56K83m61M35K76n49K17l59J121m26m96
$$ 128 129 87 65 129 173 76 128 64 131 81 231 277 380 202 119 513 357 640 179 614 890 341 558 199 1320 894 398
2903C98l54R9l9j1l1jK7R5j06mJ69J78j07j23J052r23J283j305r5k3r4J25j20K15k62K6J27
$$ 398 44 143 104 93 62 61 88 183 77 73 242 420 313 190 1242 319 1602 297 202 179 85 210 90 305 43 69 196
2650A96K32O55P71m64o5r27J51m98J37o4R1j23l2J01qj06P7M1k1Lo7L5o9N1M5m4J19j43J05
$$ 196 428 1083 1854 1390 1325 398 549 51 188 124 215 92 60 161 153 47 124 165 144 147 80 115 46 97 142 98 217 74 179
2377A79p2m3L2M5J6l8M7k4l2k2K6P5l4N1j05M3J4M9p5k4J18j05Q8q8L1M2m3J30j72J13r5R
$$ 179 107 64 96 141 157 119 166 142 110 88 114 189 155 206 101 144 158 207 132 108 226 121 209 121 152 194 151 281 109 222 127 136
2077A36R03l83J267K65l44j365J607m70q13o38J45q0N24P88j85L90j248m66J047K00m0k17
$$ 136 1039 656 1923 2188 1844 479 2086 1616 803 165 310 230 754 1542 1357 1747 499 33 1080 1280 1240 1023
1870A023m72j64L0j17n6O53k57n50O10j78m47P85K23r83O23J53j01j97j42L20Q4K65L31j091
$$ 1023 551 387 417 300 244 897 640 90 700 522 75 860 1083 100 723 876 775 578 436 756 840 1105 1436 345
1645C45J396J196o43n46J2066q477Q981m117P485J780o618N6473J3407l3190P484n0322K1529
$$ 345 1741 2937 2294 1748 13814 5337 14318 10201 17686 19466 12848 69321 82728 49538 57022 6700 28229
1485B8229j7983p157r19r22m84J60Q4L03j54j70k79n5R9j42O2L3lj86j19L03k38R5j28J98
$$ 28229 10246 3089 2170 1248 764 924 1008 1311 1157 987 708 653 752 610 672 705 702 516 397 700 462 557 429 627
1260F27j69p6n0N7N7p6J14j9o3j38J01j09J25kJ4r0l2RK4l4M8N9r5P1p4m3J2M2M9j10J06K6
$$ 627 458 382 332 389 446 370 484 465 402 264 365 256 381 379 393 303 271 280 304 270 318 377 282 353 279 236 248 290 339 229 335 361
959C61m2k14J89k0Q2j28M1kn1N5J5L9M2n7n2o0L8N1N5k8j8R7j31p0L8O6L9J7L0q2K3k8L5O6
$$ 361 319 105 294 274 356 228 269 267 216 271 286 325 367 310 258 198 236 287 342 314 296 393 262 192 230 296 335 352 382 300 323 295 330 396
640C96LO1k3Mj69P54n28J015j376L71P7r6J00Q0pK48K05q45K123n09L634J3393L260j964n939
$$ 396 399 460 437 441 272 1026 498 1513 137 508 585 489 589 669 662 910 1115 270 2393 1884 5518 18911 22171 20207 14268
405A4268M159M00j1551m697j444j26n11P62p32M11p6l47r2k7j07r8J52j69K01p0l4l8j16n
$$ 14268 18427 18827 7276 2579 1135 1009 498 1260 528 939 863 516 424 397 290 192 344 175 376 306 272 234 118 113
180A13k9K18q1J61j77p7n3P3o3J70l0k4j9j60J27p1Q8PN6J5n7j17k4K2K13j34M9J6q6m3l3
$$ 113 84 302 221 382 205 128 75 148 85 255 225 201 182 22 149 78 166 173 229 244 187 70 46 68 281 147 196 212 126 83 50
-111E0N3L8J47q5j9j0J1p6M1R7n0MJ20k08N9l9m1K00MK2q0j0m2K1Q3j7R1J9Jp5
$$ 50 103 141 288 203 184 174 185 109 150 247 197 201 321 113 172 133 92 292 296 318 238 228 186 207 290 273 364 383 384 309
-393C09
##PAGE=	F1=-1209.79
##FIRST=	4405.4455391999963467,	4405.4455391999963467,	0
##DATA TABLE=	(F2++(Y..Y)), PROFILE
4405C80Q0J06L8l0k1j70k7o0J15o5J04N7j76n0j0r3P0P4J07j36M8j25kr5J55j7O8o2K3p1j60
$$ 380 460 566 604 574 553 383 356 296 411 346 450 507 331 281 271 178 248 322 429 293 341 216 214 119 274 257 325 263 286 215 55
4114E5Q0J35j9%nk5p9r4J64M1p9Q5L3k07M9l4O8j0R6r6P9j09k1k9O3K2R6J0j32p6Q2k6l1J37
$$ 55 135 270 251 251 246 221 142 48 212 253 174 259 292 85 134 100 168 158 254 158 237 128 107 78 141 163 259 269 137 61 143 117 86 223
3795B23J9j16Pk3p2M6M6R2m2M9j03o6O7o2J12%K2p9k2k1j2N2K5RN2j18Rl3jR0j8J15j93J22
$$ 223 242 126 133 110 38 84 130 222 180 229 126 60 127 65 177 177 199 120 98 77 65 117 142 151 203 85 94 61 60 150 132 247 54 176
3476A76j10ON7J9j3J0k2n7L3l7L2O8k3J3l9p7K8L0l6O5N2j7r7k8O1N5m8Q6k6p9O2r5OMJ22
$$ 176 66 72 129 148 135 145 123 66 99 62 94 162 139 152 113 36 64 94 58 123 175 158 61 33 94 149 101 187 161 82 144 49 55 59 181
3147A81l5m3jJ3j02LR7Q2q3R6J33j2j49j25L94J1L38m97K48L68n51K51m42Q35k16m69k82L3
$$ 181 146 103 102 115 13 16 113 195 112 208 341 329 180 55 449 460 798 301 549 917 366 617 175 1010 794 325 43 76
2884G6J01J8j37N5j7N3p7P5J4L38j32k00O33K1N29r05k41N6j42J13j08R9j37m1J55K06P41
$$ 76 177 195 58 113 96 149 72 147 161 499 367 167 800 821 1350 445 204 260 118 231 123 222 85 44 199 405 1146
2631A146P67j002L11o36Q6n86J77j10R6j89JJR2k9N4j2k8m7n3Q4p5J06j8j2N5j17L3J2mL4
$$ 1146 1913 911 1222 586 672 86 263 153 249 60 61 62 154 125 179 167 139 92 39 123 48 154 136 124 179 62 95 107 103 137
2349A37jK6q2K7m0N5MqO4l6J2l8p7O3J17n8j2L1j56J21l9l3Q8J2R3j17J4j12NQ55j05J587
$$ 137 136 162 80 107 67 122 126 118 182 146 158 120 43 106 223 165 153 184 28 149 110 77 165 177 270 153 167 55 60 915 810 2397
2049B397m01r80m28J336n29J8r84j19q0R61K09k50J063k084J73L56o09J510l80p26j96k3O2
$$ 2397 1996 1016 588 1924 1395 1413 429 310 230 1191 1400 1150 2213 129 302 658 49 1559 1179 453 257 234 296
1833B96M9M78k86j24K97n61K46N25l01k73M53m9k13k35o6N49J17K76L55q70M95Q16n63q13
$$ 296 345 823 537 413 710 149 395 920 619 346 799 750 537 302 236 785 902 1178 1533 663 1158 1974 1411 598
1607E98J6302p298J6877j439J7739l518j2136P2344J4286q4465J972k2649L3531k5904j2343
$$ 598 16900 9602 26479 25040 42779 39261 27125 99469 113755 29290 31262 8613 42144 16240 3897
1466C897k071j249m7L61PK04l18k11m28M35k36M4M25k41p5k01j29N27j87l8J33n2k60o7LJ05
$$ 3897 1826 577 530 891 898 1102 784 573 145 580 344 388 813 572 497 296 167 694 507 469 602 550 290 223 226 331
1222C31J03r2P5m3q2j06J45p0J27j8k6j02o4O1O8oM7K2j06O4q9JO8J7N6j66J45m7Rj42J85
$$ 331 434 342 417 374 292 186 331 261 388 370 344 242 178 239 307 301 348 370 264 328 239 240 308 325 381 215 360 313 322 180 365
931C65k8R0j68J9k3j7R5O7QL6p9r6k7O5J06M1k3l5M4j30m2J00J02J6K3nj01J9K6Q9R7%L4n2
$$ 365 337 427 259 278 255 238 333 400 408 444 365 269 242 307 413 454 431 396 440 310 268 368 470 486 509 504 403 422 448 537 634 634 668 616
612F16J8j36Q97r22J629j906O37R8r4J82J49J37K26K66n88K303Q47O387K7848M030l162j4480
$$ 616 634 498 1395 473 2102 196 833 931 837 1019 1168 1305 1531 1797 1209 3512 4359 10746 38594 42624 39462 24982
405B4982Q366m90j9509q603k570l40q45J340j416J067o04m26j85r1m8q3K16j83J26j30j69
$$ 24982 33348 32858 13349 4746 2176 1836 991 2331 915 1982 1378 952 767 676 628 545 761 578 704 574 405
208D05o8K6L8NJ79j57R3k04o5j07K55l2J06m8j35j11m7J3J82P6K8j21j3j98J2R6O7K30j69
$$ 405 337 363 401 406 585 428 521 317 252 145 400 368 474 426 291 180 133 146 328 404 432 311 298 100 112 208 275 505 336
-64C36k0j09j26K2J07J43J3O6j71j09j04K52p9J68N3r9q0Oj59J19J45k7J73p1q6j37M1M6J87
$$ 336 316 207 81 103 210 353 366 432 261 152 48 300 221 389 442 343 263 269 110 229 374 347 520 449 363 226 267 313 500
-337E00P4n4N8p6r7k7
$$ 500 574 520 578 502 405 378
-393C78
##PAGE=	F1=-1228.57
##FIRST=	4405.4455391999963467,	4405.4455391999963467,	0
##DATA TABLE=	(F2++(Y..Y)), PROFILE
4405F39J53J02k1j35j27k41jJ19J57JL7l2k77j50MJ03K00LQ3k25n2k29J60M2J55J6rj59o1
$$ 639 792 894 873 738 611 370 369 488 645 646 683 651 374 224 228 331 531 534 617 392 340 111 271 313 468 484 475 316 255
4133B55j41Q9J25J47n1m4j03j10j02Q9K34N6j05Nn3k49L0J82Q6lO1j86j1j43Q2J18M8J9K1
$$ 255 114 203 328 475 424 380 277 167 65 154 388 444 339 344 291 42 72 254 340 337 398 212 201 58 140 258 306 325 346
3861C46k6j92j9L5J28QR3n7j69p3M1R0J0P1O4j46L5j65M2J71n0Q8o3l1j59l2Q9P2P6j6l1k9
$$ 346 320 128 109 144 272 280 373 316 147 74 115 205 215 286 350 204 239 74 116 287 237 325 262 231 72 40 129 201 277 261 230 201
3560B01j68j2J45M8J03j16R2k68O2M8JJ61k5n2m9r1n7K8J91l2Q2j01Jj46M2O5P4mj2%o7q3
$$ 201 33 21 166 214 317 201 293 25 87 135 136 297 272 220 171 80 23 51 242 210 292 191 192 46 88 153 227 223 211 211 144 61
3260F1M7rJ74l9M1j12q9l9J38J6J3P2o4p9j14K2R6J3R4L1r8l9K59p6r2o8K32K18M01q26L40
$$ 61 108 99 273 234 275 163 74 35 173 189 202 274 210 131 17 39 135 148 242 273 175 136 395 319 227 159 391 609 1010 184 524
2969E24M92o42L46k84J45J2l22j87M3J67M0j86K3r6l8J21J23k17N06j60j27K04P03j52l91
$$ 524 1016 374 720 436 581 593 271 84 127 294 334 148 171 75 37 158 281 64 570 410 283 487 1190 1038 647
2734F47m17J39j48Rnj15J22Rj68L93O78Q99j069L88n60k6o05J58j70J44k35J19n7O7O1k0o3
$$ 647 230 369 221 230 225 110 232 241 73 466 1144 2043 974 1362 802 776 171 329 159 303 68 187 130 197 258 238 175
2480A75l2j1K7Q7l9M9r4J0p5R8r5J06M5l5n8nl4K8rJ11J2o5rk3o6J56r5L2R2m4K0j16N6o5
$$ 175 143 132 159 246 207 256 162 172 97 195 100 206 251 216 158 153 119 147 138 249 261 196 187 164 98 254 159 191 283 239 259 143 199 134
2161A34J30q6M8J4J8mp5Q6n2N47j6J469p63Pq8Nk44L27p76l38n2Q41k24k54J318j581K41r6
$$ 134 264 178 226 240 258 254 179 265 213 760 744 2213 1450 1457 1369 1374 1130 1457 681 343 291 1132 908 654 1972 391 632 536
1898E36O39J72m84n59m0P2J43m9K2m03N78l79K37K74k62k37M77k89k71oL28K09K00m4K08K3
$$ 536 1175 1347 863 304 264 336 479 430 452 49 627 248 485 759 497 260 737 448 177 171 499 708 908 864 1072 1095
1654A095o15J10k61J744l24J6612m913K6209O950K6897j2232j4496K4823K451L8121k13q6376
$$ 1095 480 590 329 2073 1749 18361 13448 39657 46607 73504 61272 46776 71599 74050 112171 111958 25582
1495B5582J3685k0240j2450k812j143j128l45q48L1J55K02N9m51J27K23p3l81Q0J3L5J52r8
$$ 25582 39267 19027 6577 3765 2622 1494 1149 301 332 487 689 748 297 424 647 574 193 273 286 321 473 375
1288C75J92q7r0k85J8P2q1J25j13P0n5j07K8J26n6J16m1k9j15LL0R4J8N8k1m2Kr5L6J19qO6
$$ 375 567 480 390 105 123 195 114 239 126 196 141 34 62 188 132 248 207 178 63 66 96 190 208 266 245 203 205 110 146 265 257 323
987C23j83J82j23L7l6J53l7R5j90Nm2K8J15J11k4L7r7j24QR7J45K1j9m6j3r4k1J69J21j3L1
$$ 323 140 322 199 236 200 353 316 411 221 226 184 212 327 438 414 451 354 230 238 335 480 501 482 436 423 329 308 477 598 585 616
696F16m9r5K4Q3J36J07lMo7K4o8P28j316J955j338M25J14l2K51K63K21K53K88o7K307K502
$$ 616 567 472 496 579 715 822 819 823 756 780 712 1440 124 2079 741 1166 1280 1248 1499 1762 1983 2236 2524 2457 4764 7266
452G266R792M5429M774m411k6165J3396j926k7996j2963l820m54j121J680j882J320r22n63
$$ 7266 17058 62487 67261 62850 36685 50081 48155 20159 7196 3376 2922 1801 3481 1599 2919 1997 1434
293A434j92j59K9o6K11k01Rj83k15q5J47Q6jQ1k13k0j72K9m1K58l0J4j07k20j10J03P1J83
$$ 1434 1242 1083 1112 1046 1257 1056 1065 882 667 582 729 815 814 895 682 662 490 519 478 736 706 720 613 393 283 386 457 640
30F40L2J5l16j4j68J66J34O9J66k05j34j47q4K17J22J39m3n0k89j88J20L55o3J69k0j99k01
$$ 640 672 687 371 357 189 355 489 558 724 519 385 238 154 371 493 632 589 539 250 62 182 537 474 643 623 424 223
-224B23j29J93J77K18p8Q9j83k20r2K62J43K30J2j32k5k03j22J54
$$ 223 94 287 464 682 604 693 510 290 198 460 603 833 845 713 688 485 363 517
-393E17
##PAGE=	F1=-1247.35
##FIRST=	4405.4455391999963467,	4405.4455391999963467,	0
##DATA TABLE=	(F2++(Y..Y)), PROFILE
4405H86J70L2j08k67k33k17J67K93J26Rn9j40l84j24J34K67K20p7Ll03j70j23L09J17J18%
$$ 886 1056 1088 980 713 480 263 430 723 849 858 799 659 275 151 285 552 772 695 698 395 225 102 411 528 646 646
4161F46j06k61j44m3L10J51Q7j05r5k05j82J45J79J94K6j45r0j22j13J03K23M2j4J6k78j10
$$ 646 540 279 135 92 402 553 640 535 440 235 53 198 377 571 597 452 362 240 127 230 453 495 481 497 219 109
3917A09K5J72J43J7j9o0p2j24O6M6J30K3K8j31k00j4J05J61l4M7K1k29K6r1J38J84o2M4j17
$$ 109 134 306 449 466 447 387 315 191 257 303 433 456 484 353 153 139 244 405 371 418 439 210 236 145 283 467 405 449 332
3645C32q1j96J61Q6N7O2o3q2o1p4L3J73K0J03k05N4k33J2K03kJ57o8j03p9q3N4M0K11j06Q4
$$ 332 251 55 216 302 359 421 358 276 215 141 174 347 367 470 265 319 86 98 301 299 456 388 285 206 123 177 217 428 322 406
3363D06j79J1q2J03N2N8J5r5m7r0N1Q8k6J37l7k5j48m7mJ92ML9pq7r7l0M6R7K6M5k3j00j11
$$ 406 227 238 156 259 311 369 384 289 242 152 203 291 265 402 365 340 192 145 141 333 337 376 369 282 185 155 201 298 324 369 346 246 135
3053A35K99n0Ll8k4L68M83j003M81M68o88L89j91l81R1J6j40R3J16N1k16j0r4oJ63J27k50
$$ 135 434 384 387 349 325 693 1176 173 654 1122 434 823 632 251 342 358 218 311 427 478 262 252 158 152 315 442 192
2800A92M48k14j6L2Q94m68m0m66J23j28q6J37j37J35P2k43K52O35R94l91P3p60k17n11P5j82
$$ 192 640 426 410 442 1336 868 828 362 485 357 271 408 271 406 478 235 487 1122 2116 1725 1798 1038 821 310 385 203
2556B03K06j60J19k9j7Q9r5l0j8P3PP9k9pr5Mq8K01q8N2N8r2m7j2L0N6j4R1Jq3o9M0l2J66
$$ 203 409 249 368 339 322 411 316 286 268 341 348 427 398 391 296 300 212 413 325 377 435 343 296 284 314 370 356 447 448 365 296 336 304 470
2236D70n5j9L2l9N6j22J50j23J71j00J3l8j5Q3l8J60m4K45l32J375j273J157k08O5m71kk30
$$ 470 415 396 428 389 445 323 473 350 521 421 434 396 381 464 426 586 542 787 455 1830 557 1714 1506 1571 1100 1098 868
1983H68l91MK5K44K4N88m28K6o32J360p13m20J34L1J10J8j91M8L4O8k03N67j33l48N02k23
$$ 868 477 481 506 750 774 1362 934 960 328 1688 975 555 689 720 830 848 657 705 739 807 604 1171 1038 690 1192 969
1739I69m81K71L01L21J81j04k67l2r02Q83R02K8K039l28J3883k086L6016J9948L3381k2891
$$ 969 488 759 1060 1381 1562 1458 1191 1159 257 1140 2042 2070 4109 3781 17664 15578 51594 71542 104923 82032
1551H2032j4506R560o575Q1788L573r3941k9539j5021p212m079j548k016q33o37P2N59P6j18
$$ 82032 67526 77086 70511 152299 155872 61931 32392 17371 10159 6080 4532 2516 1683 1046 1118 1677 1753 1635
1382A635q19M43j72r79P21P8k1q3l46qL60p40N58k7n3n2k40j14J15P7RMj2j60qQm5J64m7O2
$$ 1635 816 1259 1087 108 829 907 886 803 457 449 809 69 627 600 547 495 255 141 256 333 342 346 334 174 166 174 129 293 246 308
1100C08j88r3J0J90o3J43j22j07k8P6K3J06l6R7j50n4M0J38m4J22j83Pp2M1J18J39m9N8j12
$$ 308 120 27 37 227 164 307 185 78 50 126 149 255 219 316 166 112 152 290 246 368 185 192 120 161 279 418 369 427 315
828C15j23L1J05J64jj0m5n1l7j3K21J12m1M5q7n6L6J23J61R3lj7n5L4J6L69k76O53k99R5J45
$$ 315 192 223 328 492 491 481 436 385 348 335 556 668 627 672 585 529 565 688 849 942 939 922 867 901 917 1286 1010 1663 1364 1459 1604
537A604Q3K96L70K39L19K88N43K276M220J3440O3872N496n399l9654J8386l731l5880j7180
$$ 1604 1687 1983 2353 2592 2911 3199 3742 6018 10238 23678 87550 93046 87647 47993 66379 62648 26768 9588
368I588n000m54j333J569j798Q87q40p08j20k15P7p1J48k20j07j91j75r3K01R3k8m6k19j03
$$ 9588 4588 4134 2801 4370 2572 3459 2619 1911 1791 1576 1653 1582 1730 1510 1403 1212 1037 944 1145 1238 1210 1164 945 842
142H42r3J20j5K13n9o9j70k12nJ47J05J29l4j6m59Q9k1J59J22M0O0k14k23j5j4K67R1R4j16
$$ 842 749 869 854 1067 1008 939 769 557 552 699 804 933 899 883 424 513 492 651 773 813 873 659 436 421 407 674 765 859 743
-130G43j69l33J6K15L29q0R8j00l08l10J02L35J86K12j79k4l00l65K68L74J66J90r1k36j39
$$ 743 574 241 257 472 801 721 819 719 411 101 203 538 724 936 757 733 433 68 336 710 876 1066 975 739 600
-365F00l15O8L47
$$ 600 285 353 700
-393G00
##PAGE=	F1=-1266.13
##FIRST=	4405.4455391999963467,	4405.4455391999963467,	0
##DATA TABLE=	(F2++(Y..Y)), PROFILE
4405I87J11q3j90l80k74J58K56K96J6l7j50j98l55K00J22K32J54j52r3k83j53K04J80J08K7
$$ 987 1098 1015 825 445 171 329 585 881 897 860 710 512 157 357 479 711 865 713 620 337 184 388 568 676 703
4171G03l9j55k94j1J30K42J25j6j53j04k05L4J52J44J26l9j68j42n9N3J04J75m3l2Jk85m2
$$ 703 664 509 215 204 334 576 701 685 532 428 223 257 409 553 679 640 472 330 271 324 428 603 560 528 529 244 202
3917B02J22J52J06l5o7j05p2P4N2M2O3J1k6j38j31Q0P0J62r4Npk07N7JJ31J43q5lj24o1q1
$$ 202 324 476 582 547 480 375 303 377 429 471 534 545 519 381 250 330 400 562 468 473 466 259 316 317 448 591 506 503 379 318 237
3626B37J79M1J8J8q9j12K8J1PJ61m2R9k45N1j28M9J81l4J14q7j27l3mO3RJ89j68Q2k04P0L
$$ 237 416 457 475 493 404 292 320 331 338 499 457 556 311 362 234 283 464 430 544 457 330 297 293 356 365 554 386 468 264 334 337
3335C37R4J6J9J9j42m7k8J03R6n9O6k0p5q9PK6J47k8N2o0o6p5M9L1O0J9qm8n4n3J62M2P5k3
$$ 337 431 447 466 485 343 296 268 371 467 408 474 454 379 290 297 323 470 442 494 434 368 293 342 373 433 452 444 396 342 289 451 493 568 545
3016E45l17M52N79o91K68L10n85L07j66k35l63M39j59R8M9N0k15pk9L4J03J10k31L45k63J90
$$ 545 228 680 1259 568 836 1146 561 868 702 467 104 543 384 482 531 581 366 359 330 364 467 577 346 691 428 618
2772F18m8O77l15k2l73L2q5q7K04q7K9J32q3k06P62Q30K99l4r65n01l07m5r3K13q9Q1j4o7
$$ 618 570 1247 932 910 537 569 484 397 601 514 543 675 592 386 1148 1978 2277 2243 1278 777 470 425 332 545 456 537 523 456
2509D56R0j32N5j3J05l4N6j5m6m3on0K15r9rO6j12RJ0K9O4l2O5j2n6q4Q9KJ07k4n9Kk4R3q3
$$ 456 546 414 469 456 561 527 583 568 522 479 473 423 638 539 530 596 484 493 503 532 596 564 629 617 561 477 566 568 675 651 592 594 570 663 580
2180E80J56j43J68j12J9p3JJ19mJ67k5k0p34J831j121O73m81J245q51j88k33k51P2l54M97
$$ 580 736 593 761 649 668 595 596 715 711 878 853 833 99 1930 809 1482 1001 2246 1395 1207 974 723 795 441 938
1945I38j0N61j23j49k82N60j65k09Q6l7J38o4j76L03J9k60L70K03l26K43K37o40J76L27K61
$$ 938 928 1489 1366 1217 935 1495 1330 1121 1207 1170 1308 1244 1068 1371 1390 1130 1500 1703 1377 1620 1857 1217 1393 1720 1981
1711A981K70J30j90k85o2m92J172J255L61J772n88R414M49M4804L5052L6471l2657j4137K11565
$$ 1981 2251 2381 2191 1906 1844 1352 2524 3779 4140 5912 5324 14738 15187 59991 95043 131514 98857 84720 296285
1532B96285K7378k44647P190J9146n2216m0858K58n704j871k096n55R5P1L33k67m26m69J85
$$ 296285 323663 79016 86206 105352 53136 12278 12536 6832 4961 2865 2310 2405 2476 2809 2542 2116 1647 1832
1363A832m79k63N19q0j74j89j72j39K13l64L55o3j13r9j41j05J18N4k0m3n2j89P0rm4J65j07
$$ 1832 1353 1090 1609 1529 1355 1166 994 855 1068 704 1059 996 883 784 643 538 656 710 690 647 595 406 476 467 423 588 481
1110D81N4k12k9qJ30o7J33j32j08Rq8R4Q5M5oj01n0p6J62p1J43j55Qp3J7J07J24p3Q3j20p3
$$ 481 535 323 294 286 416 349 482 350 242 251 163 257 342 387 381 280 230 154 316 245 388 233 241 168 185 292 416 343 426 306 233
818B33L8P1J53j7j0l5m8L3j6K33P1p1O2r6J9M8J30J50N6Lj5kN4Q9J4O80n42N93j83K06K22
$$ 233 271 342 495 478 468 433 385 418 402 635 706 635 697 601 620 668 798 948 1004 1007 992 990 1044 1133 1147 1827 1285 1878 1695 1901 2123
527B123L07M19K00M09L02J155K239N743J6846Q0564O223n844n2877K2370n568m2294k0719
$$ 2123 2430 2849 3049 3458 3760 4915 7154 12897 29743 110307 116530 110686 57809 80179 74611 32317 11598
368A1598n943l67j504J023j218o3l79q10Lk71P0j12M5k26j73j31q7j23J81M3o2j60j42j10
$$ 11598 5655 5288 3784 4807 3589 3526 3147 2337 2340 2069 2139 2027 2072 1846 1673 1542 1455 1332 1513 1556 1494 1334 1192 1082
142A082k0J55m4J20j00r9j86j04Q0J08P7M2r0k1m59K38M6Q4N8j9m5j48j85J34j3K25RK5j54
$$ 1082 1062 1217 1173 1293 1193 1094 908 804 884 992 1069 1111 1021 1000 541 779 825 909 967 948 903 755 570 704 691 916 925 950 796
-130G96k21j45J34J81K39j35j1j31l08r1K44K04J21J45k90j19k87l6L07K93R7Q2k06l16k58
$$ 796 575 430 564 745 984 849 838 707 399 308 552 756 877 1022 732 613 326 290 597 890 987 1069 863 547 289
-365B89j08L45L16
$$ 289 181 526 842
-393H42
##PAGE=	F1=-1284.91
##FIRST=	4405.4455391999963467,	4405.4455391999963467,	0
##DATA TABLE=	(F2++(Y..Y)), PROFILE
4405H48m5j88j57j37J83J91Q5R0j80j06j39jO1J77nL3J5j77r9J2M1J80k5J5j04o6nj06J16
$$ 848 803 615 458 321 504 695 780 870 690 584 445 444 505 682 677 710 725 548 449 461 502 682 657 672 568 502 497 391 507
4133E07O0Q5L5j34j20J9l2J19M2K9K4q9j09m9R3N0L8O1j52k9R3j38M1N9O3K5r3p6m1J8K02
$$ 507 567 652 687 553 433 452 420 539 581 610 634 545 436 387 480 530 568 629 477 448 541 403 444 503 566 591 498 422 381 399 601
3842F01m0ql9j5j1j4l1P8j5J02j60k4M7o9Q5j5P5M7j03j5l5K5l0J35m6l6k7m9p8J59K0o1J05
$$ 601 561 553 514 499 488 474 443 521 506 608 448 424 471 402 487 472 547 594 491 476 441 466 436 571 525 489 462 413 335 494 514 453 558
3532E58j26J17j81J00o4M7J05r4N6n2o9M5L3K8p1J29j83R9j32J30K5M0l9l4L4j05ML2P3O9
$$ 558 432 549 368 468 404 451 556 462 518 466 397 442 475 503 432 561 378 477 345 475 500 540 501 467 501 396 400 432 505 574
3250E74j11j3L3n7NK9jO9p5N6l7Mm7P9k8%Nl7j4L9j4l1J64J07J7o49O04N47k94j8J37l60J30
$$ 574 463 450 483 426 431 460 459 528 453 509 472 476 429 508 480 480 485 448 434 473 459 428 592 699 716 67 671 1218 924 906 1043 683 813
2941H13j48Q4o17N80k01N5LL8j52K6K6M0lQ7j92K44k15M35k11L05J7j70j80p6j5j4J74l9j17
$$ 813 665 749 132 712 511 566 569 607 455 481 507 547 544 631 439 683 468 903 692 997 1014 844 664 588 573 559 733 694 577
2668E77J81J74p12R80L55O14K62r34q65j0j81N9J58l1Jnq6R8j11J22k5Q9q2K2K6n3L1k3l9
$$ 577 758 932 220 1200 1555 2169 2431 1497 632 622 441 500 658 627 628 623 537 635 524 646 621 710 628 650 676 623 654 631 592
2396E92K06j37n3Q6q6P5J7nL9m1M0j6J7p5J00J8J1Lp2JRJ15n1J09j47J43j07O2p6J1J31nJ21
$$ 592 798 661 608 694 608 683 700 695 734 693 733 717 734 659 759 777 788 791 719 720 729 844 793 902 755 898 791 853 777 788 919 914 1035
2086A035J6l72m50K054l47n21j144K236q48J64p69l8J30J39o39l0J587n96k49N92j125R93
$$ 1035 1051 679 229 2283 1936 1415 271 2507 1659 1823 1054 1016 1146 1285 646 616 2203 1607 1358 1950 825 1818
1880A818j31j44j06J90p5l9L19q7j83N54j85j02M79j84l90M67K27J83K16R3j03j43J19r8J101
$$ 1818 1687 1543 1437 1627 1552 1513 1832 1745 1562 2116 1931 1829 2308 2124 1734 2201 2428 2611 2827 2920 2817 2674 2793 2695 3796
1645C796J232M28J332q84M160K159N0784M8747L6893l8156j6152N06519N8296m98271p474
$$ 3796 5028 5456 6788 5904 10064 12223 63007 111754 148647 110491 94339 600858 659154 160883 153409
1504A53409j7203o7535o2713N394o739j619l34O89K87k36j72o91n19K68l93j47L12j7k71l07
$$ 153409 136206 68671 5958 11352 4613 2994 2660 3349 3636 3400 3228 2537 2018 2286 1893 1746 2058 2041 1770 1463
1316A463j23K01l92K51m9m7j64j08n0L4j02N1j7o5r4rj26J34k3j23J32j82J01j82O5j0N7j05
$$ 1463 1340 1541 1149 1400 1351 1304 1140 1032 982 1016 914 965 948 883 789 780 654 788 765 642 774 592 693 511 576 566 623 518
1053E18M4o7r2Q6o0L4K5j4j9l8O0j17J31j47J08j32K4j6L2Q6M8j18Q7r6K6M9J7R6m4l1l%J12
$$ 518 562 495 403 489 429 463 488 474 455 417 477 360 491 344 452 320 344 328 360 446 494 376 463 367 393 442 459 555 511 480 477 477 589
743E89k7J90%j03P8m6J17M6R4R7LJ8K7R9P1J27j89J116j054R57l10K94L39K77L81J27N14L65
$$ 589 562 752 752 649 727 681 798 844 938 1035 1038 1056 1083 1182 1253 1380 1191 2307 1253 2210 1900 2194 2533 2810 3191 3318 3832 4197
480D197J691K195O868J9596R3374O986n607o3678K4569p054m6869k3258o561k57j684K89n36
$$ 4197 5888 8083 14951 34547 127921 134907 129300 65622 90191 83137 36268 13010 6449 6192 4508 4797 4261
321D261r62K06q22J22l45%j96n8j95j45k3%k01Q5n2p7k03K3n4qJ11j35kj04l5j16J6Q7lk4
$$ 4261 3299 3505 2683 2805 2460 2460 2264 2206 2011 1866 1843 1843 1642 1727 1675 1598 1395 1418 1364 1356 1467 1332 1330 1226 1191 1075 1091 1178 1175 1151
39A151m7q0M7l02L10J6n9m9q1o8K9l7J60q0Q9j08k4o1j26Q0J03M8Q0k14r3Pp8O5J97k6l0M1
$$ 1151 1104 1024 1071 769 1079 1095 1036 987 906 838 867 830 990 910 999 891 867 806 680 760 863 911 991 777 684 691 613 678 875 849 819 860
-261H60k90o8Q8J38J23N1p7o9k31q5l9L01J22M9
$$ 860 570 502 590 728 851 902 825 756 525 440 401 702 824 873
-393H73
##PAGE=	F1=-1303.69
##FIRST=	4405.4455391999963467,	4405.4455391999963467,	0
##DATA TABLE=	(F2++(Y..Y)), PROFILE
4405E16l69K69L21K84J59m4j77k72m96P1L16K78J35kj93k93j81Q8J91K40N0J6k87j58j89N9
$$ 516 147 416 737 1021 1180 1136 959 687 191 262 578 856 991 989 796 503 322 410 601 841 891 907 620 462 273 332
4161C32M02PP9j02j42j12j69J76K02M5P3j45j50j01L0J10R0J19o4r4j03k36Q0L33JK1p5r2
$$ 332 734 741 820 718 576 464 295 471 673 718 791 646 496 395 425 535 625 744 680 586 483 247 327 660 661 682 607 515
3898E15q2p3N6J13P3J83j89j07j39J7J45J54j0pj44qj92M3K16L7P1j25k2q3n4O6J21P6n4K9
$$ 515 433 360 416 529 602 785 596 489 350 367 512 666 656 649 505 497 305 348 564 601 672 547 525 442 388 454 575 651 597 626
3617F26j66p7jR9rK00l9j67J5j89K02QJ28p5j2j8j58K3R0N4O6J0m6j81M3o8J45j1J25k2n9
$$ 626 460 383 382 481 472 672 633 466 481 292 494 502 630 555 543 525 367 390 480 534 600 610 564 383 426 358 503 492 617 595 536
3326E36r4p8J21J9M3K7k1Pj57m2J42K8M5Mq2k9j05P4R9O9n0M9j27o8J5J6O7J24m6k34K87J15
$$ 536 442 364 485 504 547 574 553 560 403 361 503 531 576 580 498 469 364 438 537 606 556 605 478 410 425 441 508 632 586 352 639 754
3025G54J09o76O77J37J19l51M4p6n5r4L61o86N35k60k2L2J9j0M2L4J3j49Q7j09J30l3O25m84
$$ 754 863 187 864 1001 1120 769 813 737 682 588 949 263 798 538 516 548 567 557 599 633 646 497 584 475 605 572 1197 713
2762G13JK25l11Q3j44N8P9N1qk74K31M69p85P92j17K44R18n57j237L24k96K00M8Lj16K4n5
$$ 713 714 939 628 711 567 625 704 755 747 473 704 1173 388 1180 1063 1307 2225 1668 431 755 459 659 707 710 594 618 563
2509E63J36n0J19o0K9j15nJ14k7Q9n6p4J84j93l9J34l0J08j4n2k8qL4mJ12n8M7J6j03M7k4
$$ 563 699 649 768 708 737 622 617 731 704 793 737 663 847 654 615 749 719 827 813 761 733 725 759 755 867 809 856 872 769 816 792
2218G92K1L6R5l6J3j24J21p2J35n5k1J13m0L3J18p31j50K088M14r54j275J870p35N03r14M4
$$ 792 813 849 944 908 921 797 918 846 981 926 905 1018 978 1011 1129 398 248 2336 2750 1796 521 2391 1656 2159 1245 1289
1973A289J17K71j092N29J354p53l08J277k537J760n6k39j06K69j9R6J06j24R2L26l28L59K45
$$ 1289 1406 1677 585 1114 2468 1715 1407 2684 147 1907 1851 1612 1506 1775 1756 1852 1958 1834 1926 2252 1924 2283 2528
1757B528k98J58K54O5R7K21J28J43N4K94K2Q14R09L42R12r61q10K626N2208N7601L6508l6696
$$ 2528 2230 2388 2642 2707 2804 3025 3153 3296 3350 3644 3666 4480 5389 5731 6643 5682 4872 7498 59706 117307 153815 117119
1551A17119k2766Q37507Q4873m39972l16m45161q8013l8341N8l573K061J017P55o85j020q90
$$ 117119 94353 931860 1016733 576761 576445 131284 43271 4930 4988 1415 3476 4493 5248 4563 3543 2653
1401B653p98L05O68j041R24m3p17l36k20K42L48o08M67j57m06j27L8Q0J45j67r9j50m5o4J40
$$ 2653 1855 2160 2828 1787 2711 2668 1951 1615 1395 1637 1985 1377 1844 1687 1281 1154 1192 1272 1417 1250 1151 1001 956 892 1032
1166A032m8J13r7k61J01j59K33j19R8o4p4j21m9J16j5J05o2q0m1j16J14N7J38j37N5k51N0
$$ 1032 984 1097 1000 739 840 681 914 795 893 829 755 634 585 701 686 791 729 649 608 492 606 663 801 664 719 468 518
912E18k0Q0N5J8L0n6j76J21j3J47L8n0nr8l1Q4O8J70n7R8r1j26J15Q0J97J6J1Jm8O5J19K18
$$ 518 498 578 633 651 681 625 449 570 557 704 742 692 687 589 558 642 710 880 823 921 830 704 819 899 1096 1112 1123 1124 1076 1141 1260 1478
612A478O7J12k29R45r64R95k77L83L91K05K59N2O43M78K095K129P508K1494J01367P815m785
$$ 1478 1545 1657 1428 2373 1409 2404 2127 2510 2901 3106 3365 3417 4060 4538 6633 8762 16270 37764 139131 146946 142161
415A42161p0602K4657p920m9763k4758o876j89j938k43k62j156N62p26J72m54j29l01j11r2
$$ 142161 71559 96216 88296 38533 13775 6899 6710 4772 4529 4267 3111 3673 2947 3119 2665 2536 2235 2124 2032
236B032j7P3L2l37o6j61k4j14K16jq5j1k70j07OJ28PM5Kj75j74q5Q4J85j15K54j03k59j62
$$ 2032 2015 2088 2120 1783 1717 1556 1532 1418 1634 1633 1548 1537 1267 1160 1166 1294 1301 1346 1348 1173 999 914 998 1183 1068 1322 1219 960 798
-36G98o5J09K28P1N3k11j26k13M9K61QJ39k9j71j38k43N1L30J16K6M5l34k61oJ89J51K71N9
$$ 798 733 842 1070 1141 1194 983 857 644 693 954 962 1101 1072 901 763 520 571 901 1017 1043 1088 754 493 487 676 827 1098 1157
-299A157j33l04l70r4L85L91O9J99j55l25
$$ 1157 1024 720 350 256 641 1032 1101 1300 1145 820
-393H20
##PAGE=	F1=-1322.47
##FIRST=	4405.4455391999963467,	4405.4455391999963467,	0
##DATA TABLE=	(F2++(Y..Y)), PROFILE
4405G22J11N14L01K18j4l13m12m83o8L67L30J93j4k48l81n35K9N21K92J63o7k23n20l92L94
$$ 722 833 1347 1648 1866 1852 1539 1127 644 576 943 1273 1466 1452 1204 823 288 317 838 1130 1293 1226 1003 483 91 485
4171D85K07M75o4m6l18l76k58L80L51J96l2n4l78l59q5N10K29P8K4k42k65k77J43J83M26l
$$ 485 692 1167 1103 1057 739 363 105 485 836 1032 1000 946 568 209 124 634 863 941 965 723 458 181 324 507 933 930
3927I30q0k58k88j85L34K10J37J9N1l67k42n8K59K62J80p8j57k99j31N1K14K94kOk97j44j71
$$ 930 850 592 304 119 453 663 800 819 870 503 261 203 462 724 904 826 669 370 239 290 504 798 796 802 505 361 190
3673A90K36J85J73K9j42j24k78J4K03J99qJ24j56k94n6JK62J65P8j50j32j58j22J30K56J09
$$ 190 426 611 784 813 671 547 269 283 486 685 677 801 645 351 295 296 558 723 801 651 519 361 239 369 625 734
3429G34mp2j51k40k7K55J50L7L5j28j91q0pK81R9J2n0j64p0j04J05J99Q6qp7j97j08J2J24
$$ 734 730 658 507 267 240 495 645 682 717 589 398 318 311 592 691 703 653 489 419 315 420 619 705 697 620 423 315 327 451
3157D51K42N7j05l7k42p9J25J50J03J31j50l80L38J75K34m74P13o63N06o79O9K28p8p8N65
$$ 451 693 750 645 608 366 287 412 562 665 796 646 266 604 779 1013 539 1252 589 1095 416 485 713 635 557 1122
2922A122q15M67l19j04K23pJ48j1k6m4k90J68M4mJ45P58q59m8K03m30M24j26P1J15j30ol56
$$ 1122 307 774 455 351 574 567 715 704 678 634 344 512 556 552 697 1455 596 548 751 321 745 619 690 805 675 669 313
2668C13L00O93n34K56K55q70J213J49j361M85l48K35q8Pk37J26M3J75nJ2j04o1q4K9K25KP8
$$ 313 613 1306 772 1028 1283 413 1626 1775 414 899 551 786 698 705 468 594 637 812 807 819 715 654 570 599 824 826 904
2415I04j07j58J65k19R8J80NO3r9p6j09J09O1PJ70n6p5J0j76J41Q6L7J3Ql5r7m3J38rJ84l9
$$ 904 797 639 804 585 683 863 868 931 832 756 647 756 817 824 994 938 863 873 697 838 924 961 974 982 947 850 807 945 936 1120 1081
2124A081j05O0p3m4L05o05m86J866J071r62j514J854q55M59m23j06k6OK40O25m33l5l92J332
$$ 1081 976 1036 963 919 1224 619 133 1999 3070 2108 594 2448 1593 2052 1629 1523 1497 1503 1743 2368 1935 1900 1508 2840
1898B840k075J148k48o0J7L20N2R0j86O4J65m1MN95j86J54K76k04l1J02L83K76M38J30K49
$$ 2840 765 1913 1665 1605 1622 1942 1994 2084 1898 1962 2127 2086 2090 2685 2499 2653 2929 2725 2694 2796 3179 3455 3893 4023 4272
1664D272j48L55N46M79R12m59j994o82M7092N9474L7281k7355l4055J133242J00651j95666
$$ 4272 4124 4479 5025 5504 6416 5957 3963 3281 50373 109847 147128 119773 85718 1218960 1319611 1123945
1513A123945J6198j065993K4404p6584j1561P61J03k056j340k521k168r93O86J074J33j155
$$ 1123945 1140143 74150 98554 21970 10409 11170 11273 9217 7877 5356 3188 2195 2881 3955 4088 2933
1363B933J086j187r99O6K30M35Qm02J54n39l42K06J91J05K9l11k74k32J33P8K17o3l6k22l50
$$ 2933 4019 2832 1833 1899 2129 2564 2572 2170 2324 1785 1443 1649 1840 1945 1974 1663 1389 1157 1290 1368 1585 1522 1486 1264 914
1128I14J44M7L05j17J0j80k20j2j0K73L0J9j41k09m4r3K84J15J30k27n5l08M4J75J42P4n8
$$ 914 1058 1105 1410 1293 1303 1123 903 891 881 1154 1184 1203 1062 853 809 716 1000 1115 1245 1018 963 655 699 874 1016 1090 1032
875A032p5j71j82K41Q2K37j9j47j36j52O2K05J24J70j14l4j82j00J97K30K27m4j13j24o7J67
$$ 1032 957 786 604 845 927 1164 1145 998 862 710 772 977 1101 1271 1157 1123 941 841 1038 1268 1495 1451 1338 1214 1147 1314
631A314K39L05L9M0j81L71n08R25j32M32L59R7R7J5Q09N96K341K025P701K2616J05102Q706
$$ 1314 1553 1858 1897 1937 1756 2127 1619 2544 2412 2844 3203 3300 3397 3412 4221 4817 7158 9183 16884 39500 144602 153308
424A53308l709p3426K2857q121n1483k5421o994k16k285k27o87l28M34n51R5o02k88l77m2
$$ 153308 149599 76173 99030 90909 39426 14005 7011 6795 4510 4283 3596 3268 3702 3151 3246 2644 2356 1979 1937
246A937R3J46P8k3n22k33k04J61J04L08j8k47j91m05p8K93K83Q0o0j66l84k94P7M02K59m2
$$ 1937 2030 2176 2254 2231 1709 1476 1272 1433 1537 1845 1827 1580 1389 984 906 1199 1482 1562 1502 1336 952 658 735 1137 1396 1354
2A354Q4k91m86j60K23L88K50M2j51l90l84p3L70N52mL3k32m22l96K08M15M15J02j35j76o34
$$ 1354 1438 1147 661 501 724 1112 1362 1404 1253 863 479 406 776 1328 1324 1357 1125 703 307 515 930 1345 1447 1312 1136 502
-243E02m19M99O72J72J86j24l88n40j15M69N64L94l6Nl99n18
$$ 502 83 582 1254 1426 1612 1488 1100 560 445 914 1478 1872 1836 1841 1442 924
-393I24
##PAGE=	F1=-1341.25
##FIRST=	4405.4455391999963467,	4405.4455391999963467,	0
##DATA TABLE=	(F2++(Y..Y)), PROFILE
4405A567L74M99J62L0k47n42m96k06L25L79J99j2k44m92m49j14L34M49J93k5k51m77m78O4
$$ 1567 1941 2440 2602 2632 2385 1843 1347 1141 1466 1845 2044 2032 1788 1296 847 733 1067 1516 1709 1684 1433 956 478 542
4180E42N73J63L41k38k19n25l05K29M87K67P7k01k23n98j06L59M74J74m7j40m43l78M8N07
$$ 542 1115 1278 1619 1381 1162 637 332 561 1048 1315 1392 1191 968 370 264 623 1097 1271 1224 1084 641 263 311 818
3955H18J02L42j22k35m55l70K68N13J89L4j09j51n36j87M34L22J92O7k09l42m50J40L89K21
$$ 818 920 1262 1140 905 450 80 348 861 1050 1084 975 824 288 101 535 857 1049 1116 907 565 115 255 644 865
3729H65K24j51j02m95k69L09L68J74Q8j04k71k95j22K96L05J45p9l6l09m10J64L54J68J57
$$ 865 1089 938 836 341 72 381 749 923 1011 907 636 341 219 515 820 965 886 850 541 131 295 649 817 974
3504I74m2k61k93k17K77K27K31N0j41j99k66K7O0L71Q7j5j19k62l24K07J93L00N2q3j78l21
$$ 974 932 671 378 161 438 665 896 946 805 606 340 367 427 798 885 870 751 489 165 372 565 865 917 834 656 335
3260C35p5K01K61J32N0j26k03k92J8K71J31K18l5j98j54k82J50K31J94N3O1k93l26J64L90
$$ 335 260 461 722 854 904 778 575 283 301 572 703 921 886 688 534 252 402 633 827 880 941 648 322 486 876
3025H76L06k15P14j399N66p58J27M62J58k02O98j054L71k75o2M51l1J92j29j44j16k06K84
$$ 876 1182 967 1681 282 848 90 217 679 837 635 1333 279 650 375 313 764 733 925 796 652 536 330 614
2809F14J66r6J14Q71j298K97O4m07N68p2LM0k72k1j06K71O69k68l27J268l72r61J070j086
$$ 614 780 684 798 1669 371 668 732 325 893 821 824 864 592 571 465 736 1405 1137 810 2078 1706 745 1815 729
2584G29L59l40J39j98Pk22K62J33J54j9j68j24j08O3J27K52j5j4j42k48J73j17K69J64k4n7
$$ 729 1088 748 887 689 696 474 736 869 1023 1004 836 712 604 667 794 1046 1031 1017 875 627 800 683 952 1116 1092 1035
2340A035k08j7j01K49R3j7J36q0k15M3j02K39J61K1p2j19k2j19Q8J93K7J44n7j93kl0oM36
$$ 1035 827 810 709 958 1051 1034 1170 1090 875 918 816 1055 1216 1237 1165 1046 1024 905 993 1186 1213 1357 1300 1107 1105 1075 1069 1505
2077A505l30n16R00J410p17j897K442p79j65K80l71k58m50J654P24k749J653n08P37j239J059
$$ 1505 1175 659 1559 2969 2252 355 2797 2018 1853 2133 1762 1504 1054 2708 3432 683 2336 1828 2565 1326 2385
1880B385q20L88J66K60P1p1l20L51r4lM76L79k82N78j51m68Q6L16O62M29N46k1q1m51M5O95
$$ 2385 1565 1953 2119 2379 2450 2379 2059 2410 2316 2313 2789 3168 2886 3464 3313 2845 2931 3247 3909 4338 4884 4863 4782 4331 4376 5071
1635E071J238J433K68n0k994L1756N4410L9838j1373m6972J322866J01066K09114M1903j678385
$$ 5071 6309 7742 8010 7960 4966 36722 91132 130970 119597 72625 1395491 1496557 1705671 1747574 69189
1495F9189K29170k46323k1807o434k981n567m595m279k579O62J564P38k99j168r9k117k12
$$ 69189 298359 52036 30229 23795 20814 15247 10652 6373 3794 4456 6020 6758 6459 5291 5192 3075 2863
1335B863M86M37K48m71O1q60m90J18L78J93j3k31m58l45j24L05J67J46j64k41l21k70K53K15
$$ 2863 3349 3786 4034 3563 3624 2764 2274 2392 2770 2963 2950 2719 2261 1916 1792 2097 2264 2410 2246 2005 1684 1414 1667 1882
1110A882K65j91j45l06k64J74J16K94%j23k71k83O3M8L43J09O5l91j56k59J18L23J78L8j75
$$ 1882 2147 1956 1811 1505 1241 1415 1531 1825 1825 1702 1431 1148 1211 1259 1602 1711 1776 1385 1229 970 1088 1411 1589 1627 1452
875A452k05k52r3L89J37K73j16k64k67j51K28L04J55J04j90j83k42oL05L47K02j24k61k50
$$ 1452 1247 995 902 1291 1428 1701 1585 1321 1054 903 1131 1435 1590 1694 1504 1321 1079 1073 1378 1725 1927 1803 1542 1292
649A292k3L09L44L33j0p7j27k77J73P35O4M14K52k7m2M4J016O38K438J876P581K3216J06137
$$ 1292 1269 1578 1922 2255 2245 2168 2041 1764 1937 2672 2736 3150 3402 3375 3333 3377 4393 5031 7469 9345 16926 40142 146279
433A46279R582k795p3014J9816p843n2564k5565p050l36k668M27j542J125j68l70j24p72m20
$$ 146279 155861 153066 80052 99868 92025 39461 13896 6846 6510 3842 4269 2727 3852 3684 3314 3190 2418 1998
264A998l18J81K92K16m4j68p20l31k7M42K91K19j29m63l88m05K84N41K82L8k75l80n87n5M70
$$ 1998 1680 1861 2153 2369 2325 2157 1437 1106 1079 1521 1812 2031 1902 1439 1051 646 930 1471 1753 1791 1516 1136 549 494 964
30I64N33J68j15j62n08o86M20N14M32J01j16m04n79m49O84M46N51j53j77m63n67r8P59M53
$$ 964 1497 1665 1550 1388 880 194 614 1128 1560 1661 1545 1141 562 113 797 1243 1794 1641 1464 1001 434 336 1095 1548
-196A548K87n1l64l91n75L69N07O26O3j8l39n14k15M33N55M92K59k28k11n16l32
$$ 1548 1835 1784 1420 1029 454 823 1330 1956 2019 2001 1662 1148 933 1366 1921 2413 2672 2444 2233 1717 1385
-393A385
$$ 1385
##PAGE=	F1=-1360.03
##FIRST=	4405.4455391999963467,	4405.4455391999963467,	0
##DATA TABLE=	(F2++(Y..Y)), PROFILE
4405B481N00M19l1k02m79o61l75J95M75L41J8k61m78o59k85L74M20L66Qk41m52o52l0L53N91
$$ 2481 2981 3400 3369 3167 2688 2027 1652 1847 2322 2663 2681 2420 1942 1283 998 1372 1792 2158 2166 1925 1473 821 791 1144 1735
4171A735Q6J42m50l94o14K19M28M49J35q6m02l91n97M88M39L73O1k18l31o05q6M00N47MK04
$$ 1735 1821 1963 1513 1119 505 724 1152 1601 1736 1650 1248 857 260 748 1187 1560 1621 1403 1072 467 381 781 1328 1332 1536
3936A536k95m02n97K24L56M88J07j18k70l76n65M33M59L09O6j12l63n22j41M61L86J78R3l40
$$ 1536 1241 839 242 466 822 1310 1417 1299 1029 653 88 521 980 1289 1355 1243 880 358 217 678 1064 1242 1335 995
3711I95k30o73J93N28L28J04n5k81m05m48M97L44K93L2j84k26m62j25M00M36P3N1j97l66m55
$$ 995 765 92 285 813 1141 1245 1190 909 504 56 553 897 1190 1222 1038 812 350 225 625 1061 1134 1185 988 622 167
3476A67J95M48K39J33p1k95l33l17N16J33L13oj12k92l64j12M14K82K35n7k04l10l79J87L70
$$ 167 362 810 1049 1182 1111 816 483 166 682 815 1128 1122 1010 718 354 242 656 938 1173 1116 912 602 223 410 780
3241G80L00L7m9k52l43j70K79L47J17J00j64k90k40o3L39K42J49l1m5m17j12j70P32K70O7
$$ 780 1080 1117 1068 816 473 303 582 929 1046 1146 982 692 452 389 728 970 1119 1088 1043 626 514 344 1076 1346 1413
3006A413O23j139m54J44p5K30M08l20P62j269J52N1P9M48n0J29k65k51j65J80K74J76j48o1
$$ 1413 2036 897 443 587 512 742 1150 830 1592 323 475 526 605 1053 1003 1132 867 616 451 631 905 1081 933 872
2781H72R74j671R01p1k63M05o1p5j12k40NJ90K19M77j54o70K026J1k455J483o77J95l30%k27
$$ 872 1846 175 1076 1005 742 1147 1086 1011 899 659 664 854 1073 1550 1396 726 2752 2763 308 1791 1114 1309 979 979 752
2546G52N1l7K87J47Q3p7l27q1k7J95J87K02p6j34j27k55K07M3L25J06q7j87k70J20J7K81R6
$$ 752 803 766 1053 1200 1283 1206 879 798 771 966 1153 1355 1279 1145 1018 763 970 1013 1338 1444 1357 1170 900 1020 1037 1318 1414
2293A414p0M8j15k68J21N2K72J49j6j71k04K3j6J67K29J2M4r7k18j3P9J10L98k64l26L03J049
$$ 1414 1344 1392 1277 1009 1130 1182 1454 1603 1587 1416 1212 1235 1219 1386 1615 1627 1671 1574 1356 1343 1422 1532 1930 1666 1340 1643 2692
2039B692k01j436J920j63q01O07n68l88m83J844R34k933J903o03J54p53J319j018O72K02J55
$$ 2692 2491 1055 2975 2812 2011 2618 2050 1662 1179 3023 3957 1024 2927 2324 2478 1725 3044 2026 2698 2900 3055
1842C055M1k21k35M09k64M34N59Q6NM24n88k58L22O14Q48M62M37k87m97n26L54J439K044J821
$$ 3055 3096 2875 2640 3049 2785 3219 3778 3864 3869 4293 3705 3447 3769 4383 5231 5693 6130 5843 5346 4820 5174 6613 8657 10478
1617A0478M87J80l301J4505M4902M1794Q350n5918J357109Q5473O93727P3641k034345L34496
$$ 10478 10965 11145 7844 22349 67251 109045 117395 61477 1418586 1504059 2197786 2271427 237082 571578
1485E71578m78245l9224j6447p712q829q208n270j676J916J650J09l87j432j907j800N34N81
$$ 571578 93333 54109 37662 29950 21121 12913 7643 5967 7883 9533 9642 9255 7823 5916 4116 4650 5231
1326E231M27m1q14L27j954J96L82L06J21j84m90n46l02N2L80J76Nk83m16l47j07L48K79J68
$$ 5231 5658 5617 4803 5130 3176 3372 3754 4060 4181 3997 3507 2961 2659 2711 3091 3267 3272 2989 2573 2226 2119 2467 2746 2914
1100B914k95k95l83j95L18K24K39p4k64l95k77K17J79L32O0l2n65k12j30K18L95J81l8k97
$$ 2914 2619 2324 1941 1746 2064 2288 2527 2453 2189 1794 1517 1734 1913 2245 2305 2273 1708 1496 1366 1584 1979 2160 2122 1825
875A825l16k62L9N07J51K54k35l71l57p6L87L57J60qk68l14k49J31L99M08J32k11m02l40Q5
$$ 1825 1509 1247 1286 1793 1944 2198 1963 1592 1235 1159 1546 1903 2063 2055 1787 1473 1224 1355 1754 2162 2294 2083 1681 1341 1426
640A426M47M03K95o8k13j24o99Q36M81K42L21J06j44r5J32J230N51K407J694P298K3496J05829
$$ 1426 1873 2276 2571 2503 2290 2166 1467 2303 2784 3026 3347 3453 3309 3214 3346 4576 5127 7534 9228 16526 40022 145851
433A45851J0265k289p0461J6317p331n3286k5451p119n05k936J392k059K272r90k54m28r12
$$ 145851 156116 153827 83366 99683 92352 39066 13615 6496 5991 3055 4447 2388 4660 3670 3416 2988 2076
274B076m35k3M28L69J36k58l66q58j92M01N59L12kl02o82n16P1O31N23J49r8n38n90n78P10
$$ 2076 1641 1618 2046 2415 2551 2293 1927 1069 877 1278 1837 2149 2147 1845 1163 647 718 1349 1872 2021 1923 1385 795 217 927
39I27N54M39k9k86m21p11o0P40N12L25j19l42o48o61N08O88L71L99l61m25o60k06M74P61L61
$$ 927 1481 1920 1891 1605 1184 473 413 1153 1665 1990 1871 1529 881 220 728 1416 1787 2186 1825 1400 740 534 1008 1769 2130
-196B130Q2k60o00m85L6O79N21M52j06k64n10m03L15O92N66L50O3m45l82m52M7
$$ 2130 2212 1952 1352 867 903 1582 2103 2555 2449 2185 1675 1272 1587 2279 2845 3195 3258 2813 2431 1979 2026
-393B026
$$ 2026
##PAGE=	F1=-1378.81
##FIRST=	4405.4455391999963467,	4405.4455391999963467,	0
##DATA TABLE=	(F2++(Y..Y)), PROFILE
4405C219N28K87k35m17o49o33j15M88M99K55j74m98o46o88M6O63M14K69k14m28o12o37M62
$$ 3219 3747 4034 3799 3382 2733 2100 1985 2473 2972 3227 3053 2555 1909 1221 1267 1930 2344 2613 2399 1971 1359 722 1184
4189A184M76N37np4o41n19m28O17N00L54mk49n79n12j51O85M53K45o7l83n02o33M13M75N33
$$ 1184 1660 2197 2192 2118 1477 958 530 1147 1647 2001 1997 1748 1169 657 506 1191 1644 1889 1822 1439 937 304 717 1192 1725
3955A725r9N0m63n40m22N97L81M27Qk73m20n74m3N52M50K54n8k98m98o56M42N27L33J16n2
$$ 1725 1626 1676 1213 673 251 848 1229 1656 1664 1391 971 397 354 906 1356 1610 1552 1254 756 100 542 1069 1402 1518 1466
3720A466n12l39m34M49N60K61J9j99m49n05o1O39L39K34r0k81l93n30L52M38M28j1q4l40m25
$$ 1466 954 615 181 630 1190 1451 1470 1271 822 317 256 895 1234 1468 1378 1097 704 174 526 964 1392 1381 1297 957 532
3485E32l44M83M74K19K0j98m19m04o4O90J65K27j08k05m29l24K25M10L11J37j66l13l84j80
$$ 532 188 671 1145 1364 1384 1186 767 363 299 989 1154 1381 1273 1068 639 315 540 950 1261 1398 1232 919 535 355
3260C55L51L74K83m9j63l46m23J38L70L47R2l6k83l38k19J82M08K23P4j19j41m71R9l82R74
$$ 355 706 1080 1363 1314 1151 805 382 520 890 1237 1329 1293 1010 672 453 635 1043 1266 1340 1221 1080 609 708 326 1300
3025A300J52L47M67o43j375P00nm3M93l10P70j344j77M79J20L76p1L1l64k73j36M69K44J32
$$ 1300 1452 1799 2266 1623 248 948 943 900 1393 1083 1853 509 332 811 931 1307 1236 1267 903 630 494 963 1207 1339
2800A339k24j71J028j680J313l09j25J93p3j14k62o7P3K89J91L13k11o64K201P0j896M81k72
$$ 1339 1115 944 1972 292 1605 1296 1171 1364 1291 1177 915 848 921 1210 1401 1714 1503 839 3040 3110 1214 1695 1423
2584A423P6l48r0j85J31J12K59J18oj37l91JR8K38J91J37j48k24o3j96K44J34L08L3j38k72
$$ 1423 1499 1151 1061 876 1007 1119 1378 1496 1490 1353 962 963 1061 1299 1490 1627 1479 1255 1192 996 1240 1374 1682 1715 1577 1305
2340A305k53K42J34K44P1j25l0j36k20J96J48K70R0n2k45k09Q2J02J83K31k2n7j29j86L7J62
$$ 1305 1052 1294 1428 1672 1743 1618 1588 1452 1232 1428 1576 1846 1936 1884 1639 1430 1512 1614 1797 2028 2006 1949 1820 1634 1671 1833
2095A833K07K66l20j9M03Q6M39j036R24O42j065N96o20k99k23Q52J259j309Q26o59J15q81
$$ 1833 2040 2306 1986 1967 2370 2456 2895 1859 2783 3425 2360 2956 2336 2037 1814 2666 3925 2616 3442 2783 2898 2017
1889B017J336n54O62J56P2Qk61j14K61o1O86M22%K41n3o22J45M74Q26R04L89K46n08p37k14
$$ 2017 3353 2799 3461 3617 3689 3697 3436 3322 3583 3522 4208 4630 4630 4871 4818 4196 4341 4815 5641 6545 6934 7180 6672 5935 5721
1654E721J051K050K412J827K98p52l682O280L4290L5836K8120n6543J225804N7563J144522
$$ 5721 6772 8822 11234 13061 13359 12607 8925 15205 49495 85331 113451 56908 1282712 1340275 2484797
1513B484797J05749k157801M36632p29985o1497k7114j4089j1274j1228n456k79K529J432
$$ 2484797 2590546 432745 869377 139392 77895 50781 36692 25418 14190 8734 8455 10984 12416
1391A2416m75m41j853l491n63O62N82L40k92r91J48k403Q02N22J47K7l53o75n59k11K05L85
$$ 12416 11941 11500 9647 6156 5593 6255 6837 7177 6885 5894 6042 3639 4441 4963 5110 5137 4784 4109 3550 3339 3544 3929
1185C929J38j48l71n25l13N5L99K76M5l85l97l96p9L96K89J48j60l69m68k16L57K60K83nj58
$$ 3929 4067 3919 3548 3023 2710 2765 3164 3440 3485 3100 2703 2307 2228 2624 2913 3061 2901 2532 2064 1848 2205 2465 2748 2743 2585
950B585o63k19J7L00M08J50j33l87l79k05J62N68J36J86l44m42l81M1M97L57J42j40l26l96
$$ 2585 1922 1703 1720 2020 2428 2578 2445 2058 1679 1474 1636 2204 2340 2526 2182 1740 1359 1400 1897 2254 2396 2256 1930 1534
725A534j99K64M53M06L6k85n03l66K24N38M01K13j24l36j90p30J192L26L32J65l5k27m0K46
$$ 1534 1335 1599 2052 2458 2494 2209 1706 1340 1564 2102 2503 2716 2592 2256 2066 1336 2528 2854 3186 3351 3316 3089 3049 3295
499C295J387L45K276J487O943K3402J04213J0527k104o6183J3001o715n3506k5160p166o43
$$ 3295 4682 5027 7303 8790 15733 39135 143348 153875 151771 85588 98589 91874 38368 13208 6042 5399
349E399k931K155k251K937j701k08p14r34k52L57N10L08l6m79n51q01K38O49M91K16k53m80
$$ 5399 2468 4623 2372 5309 3608 3400 2686 1752 1500 1857 2367 2675 2639 2160 1609 808 1046 1695 2186 2402 2149 1669
142A669q23l40O50O66L83k3k64p70p30J94Q35N14K76k49m82o29q56R29P28M16J75l41n66q25
$$ 1669 846 506 1156 1822 2205 2182 1918 1148 418 612 1447 1961 2237 1988 1506 877 21 950 1678 2094 2269 1928 1362 537
-83E37q4Q50O35K62J90n57o41p29M75O59P09K11j32m61p83l12N84P93M82K24k86m82n70q8
$$ 537 453 1303 1938 2200 2390 1833 1192 463 938 1597 2306 2517 2385 1924 1141 829 1413 2206 2688 2912 2626 2144 1574 1486
-308A486P02Q11M96J70j45o22m57k32M03
$$ 1486 2188 2999 3495 3665 3520 2898 2441 2209 2612
-393B612
$$ 2612
##PAGE=	F1=-1397.59
##FIRST=	4405.4455391999963467,	4405.4455391999963467,	0
##DATA TABLE=	(F2++(Y..Y)), PROFILE
4405C629M73J34l99n70p12m78J57O21M39J42l32o69p04n73L63P55L43J71m15n44o88l90P30
$$ 3629 4102 4236 3837 3267 2555 2077 2234 2855 3294 3436 3104 2435 1731 1158 1521 2276 2619 2790 2375 1831 1143 753 1483
4189A483M97M29q4k66p60n54l8P36N01K24j21l75o85n42L43P04M06J15j79m97o20l90O67M58
$$ 1483 1980 2409 2325 2059 1299 745 707 1443 1944 2168 2047 1672 987 445 788 1492 1898 2013 1834 1337 717 327 994 1452
3964A452M77j88r0n81o15K4O36L67L35q1l92n20p03M84N64M09J67j48m52n74m22O39N36K54
$$ 1452 1929 1741 1651 1070 455 479 1115 1482 1817 1736 1344 824 121 605 1169 1578 1745 1597 1145 571 149 788 1324 1578
3739A578N0j74o26l94k4M76N37J78o0l10n62n12L48O24L05J50j87l44m94l23N23M33L71p5
$$ 1578 1628 1454 828 434 410 886 1423 1601 1541 1231 669 157 505 1129 1434 1584 1397 1053 559 236 759 1192 1563 1488
3513A488k04m38m10l1M87M57J81q7k92m77l38J76O71J72J33j95k64m90j32L60L77L02K9k42
$$ 1488 1284 846 436 405 892 1349 1530 1443 1151 674 336 512 1183 1355 1488 1293 1029 539 407 767 1144 1446 1475 1233
3288A233l82l60M3L99L27K38j11k58l83l91L68L77L10O0j53l62l21j11K94M28J89pj86k02
$$ 1233 851 491 534 933 1260 1498 1387 1129 746 355 723 1100 1410 1470 1317 955 634 523 817 1245 1434 1427 1241 1039
3063A039m39K33l99J017J0N91L11j49j514L52K64k74M37j74P41j358l97P56R6K92r1o1m03
$$ 1039 600 833 434 1451 1461 2052 2363 2214 700 1052 1316 1042 1479 1305 2046 688 291 1047 1143 1435 1344 1283 880
2847H80j99p3N74K11P1l45r4R87j527J585o18N8r1n6j10l57J10J43K65J66K13l42n06J966
$$ 880 681 608 1182 1393 1464 1119 1025 2012 485 2070 1452 1510 1419 1363 1253 896 1006 1149 1414 1580 1793 1451 945 2911
2621B911j85q44l77P9ll82j01j24K03J93K09O9q6j71l58O4J92K32J55Q2k05k61J8j31K71J53
$$ 2911 2726 1882 1505 1584 1581 1199 1098 974 1177 1370 1579 1648 1562 1391 1033 1097 1289 1521 1676 1758 1553 1292 1310 1179 1450 1603
2377A603K61l9j53k97k01L12K09J81L3j63p8j29j32K42J73K49K6q0k81j57J33J73J68K06n5
$$ 1603 1864 1825 1672 1375 1174 1486 1695 1876 1909 1746 1668 1539 1407 1649 1822 2071 2097 2017 1736 1579 1712 1885 2053 2259 2204
2142B204j30j36j32J16J85K66J00l66K81P26q39R82j033K23J095j015N22n56j08j37k54J565
$$ 2204 2074 1938 1806 1922 2107 2373 2473 2107 2388 3114 2275 3257 2224 2447 3542 2527 3049 2493 2385 2248 1994 3559
1936C559J62k3o97L08r82Q01L29M59Q2K2j4k18n0P7L49N97K90Q4K44m85l01M07N25R13Q52
$$ 3559 3721 3698 3001 3309 2327 3128 3457 3916 3998 4020 4006 3788 3738 3815 4164 4761 5051 5135 5379 4894 4593 5000 5525 6438 7290
1701G290K57O1o05p20K64J625K252K378J520n7j894m147J1966K8334J4919M3979n0490R64439
$$ 7290 7547 7608 7003 6283 6547 8172 10424 12802 14322 14265 12371 8224 20190 48524 63443 107422 56932 1021371
1532A021371K4249J450200J31473k016611N18776r48884q3570l5842k1554j2574j2647n225
$$ 1021371 1045620 2495820 2627293 610682 1129458 180574 97004 61162 39608 27034 14387 9162
1419I162J059K686J077p77p64k347l987N47M31O16K46m41j001n51j763P20O87M2o5m85p58
$$ 9162 10221 12907 13984 13207 12443 10096 6109 6656 7087 7703 7949 7508 6507 5956 4193 4913 5600 5642 5577 5092 4334
1222D334n13j14L07L45Q1k76m02n64k46J84M00K33p1m38m30l54L1M14L08M5k31m12m78j35
$$ 4334 3821 3707 4014 4359 4440 4164 3762 3198 2952 3136 3536 3769 3698 3260 2830 2476 2507 2921 3229 3274 3043 2631 2153 2018
997B018M47K90K17o7k99o39j93J41L39L82R1k19m22l88j08K47N64J05Q8m21m55l42J58N38
$$ 2018 2465 2755 2972 2905 2606 1967 1774 1915 2254 2636 2727 2508 2086 1698 1590 1837 2401 2506 2594 2173 1718 1376 1534 2072
772B072L10J13k61l48m15j13L60M55L49o1l29n42l25L47N65L41J12j65m17k88m04J119L44
$$ 2072 2382 2495 2234 1886 1471 1358 1718 2173 2522 2461 2132 1590 1265 1612 2177 2518 2630 2465 2048 1760 1356 2475 2819
556B819L12k1j36k55R9L39J432Q0K065J267O514K2641J00017J0192j958n9817J0227n978n2693
$$ 2819 3131 3110 2974 2719 2818 3157 4589 4669 6734 8001 14515 37156 137173 147365 145407 85590 95817 89839 37146
377C7146k4547p068o84k623K496k683L432k059j98q90p74L6N57M61J79k12o36o47m56N31O63
$$ 37146 12599 5531 4847 2224 4720 2037 5469 3410 3212 2322 1548 1584 2141 2602 2781 2569 1933 1286 830 1361 2024
180B024L62Q5m58o01p98J43P84N85K19j72m01r01o10P64P78M40J09m33o42p36j57R65O71K75
$$ 2024 2386 2471 2013 1412 614 757 1541 2126 2345 2173 1772 871 261 1025 1803 2243 2352 1919 1277 541 384 1349 2020 2295
-45B295L5n15p28q79O28Q64N31J51k5o85p70m85Q63P05N97N0l06o04q51R0Q15P97L95km32
$$ 2295 2330 1815 1087 208 836 1700 2231 2382 2357 1672 902 417 1280 1985 2582 2632 2326 1722 871 961 1776 2573 2968 2966 2534
-280B534o16m86K53Q83Q22L69rl16p08m18M4O23
$$ 2534 1918 1432 1685 2568 3390 3759 3750 3434 2726 2308 2352 2975
-393B975
$$ 2975
##PAGE=	F1=-1416.37
##FIRST=	4405.4455391999963467,	4405.4455391999963467,	0
##DATA TABLE=	(F2++(Y..Y)), PROFILE
4405C644L65mm81o37o58k67L40O13L30L5m21p42o38l86N50P04K40Q7n46n70o64n5P64M45L00
$$ 3644 4009 4005 3524 2887 2229 1962 2302 2915 3245 3280 2859 2117 1479 1093 1643 2347 2587 2674 2128 1558 894 839 1603 2048 2348
4171B348j30m04p77m85L08O85M52R1j93m39o99m45O47O37L12J4k52n36o68k5O83L97L91k46
$$ 2348 2218 1814 1037 552 860 1545 1997 2088 1895 1456 757 312 959 1596 1908 1922 1670 1134 466 441 1124 1521 1912 1666
3945A666j92o19o15M12N59L25K40j47m47n54n16O34N12L52O6j85n48n70m6N72M97J69qk47
$$ 1666 1474 855 240 652 1211 1536 1776 1629 1182 628 112 746 1258 1610 1676 1491 943 373 327 899 1396 1565 1557 1310
3720A310o60l67K58M60M71R4j17l65n97l32M90N61K52O0k37l60n13m4N03L96K80j07k85m70
$$ 1310 650 283 541 1001 1472 1566 1449 1084 487 155 645 1206 1458 1518 1281 921 408 364 867 1263 1543 1436 1151 681
3495F81l22J91M21M12J39j76l28m62j74K56N79J66M5k46k77m66N0L75L29K61o6k66l99k59
$$ 681 359 550 971 1383 1522 1346 1018 556 382 638 1217 1383 1428 1182 905 439 489 864 1193 1454 1388 1122 723 464
3269D64J67L91K59J80j39l13l69k76M62L31K57K7k28l89k49kL06M13J46p3k22k17l54K94l69
$$ 464 631 1022 1281 1461 1322 1009 640 364 826 1157 1414 1441 1213 824 575 573 879 1292 1438 1365 1143 926 572 866 497
3035D97R84j16P69K09K15j424k70O98m81L23J2O84j361m39Q52L4K13j06j26l76q8l1N60J78
$$ 497 1481 1365 2134 2343 2558 1134 864 1562 1081 1404 1416 2100 739 300 1152 1186 1399 1293 1167 791 703 672 1232 1410
2809A410J0m95J66Q54j324J691q07J92m35K1p7l81K18J95J80J39J50m37l59J585o26K58r24
$$ 1410 1420 925 1091 1945 621 2312 1505 1697 1262 1283 1206 825 1043 1238 1418 1557 1707 1270 911 2496 1870 2128 1204
2593A204L67o3m10m4p7K36K29J46J8j42j70k71R1K40K04R4M8k33k47Q3q3K78J26K04r6j31
$$ 1204 1571 1508 1098 1054 977 1213 1442 1588 1606 1464 1294 1023 1114 1354 1558 1652 1700 1467 1220 1303 1220 1498 1624 1828 1732 1601
2349A601k79j48L33K42J07mj73r6r9n1K51J51K17k2r8k81q1J64J91J37J67q0j64j18q7J95
$$ 1601 1322 1174 1507 1749 1856 1852 1679 1583 1484 1433 1684 1835 2052 2030 1932 1651 1570 1734 1925 2062 2229 2149 1985 1867 1780 1975
2105A975J52L00o9l13M71Q71j286J274j319K42Q47p34M44m45N1k14p97J719R00m62p38M27
$$ 1975 2127 2427 2358 2045 2516 3387 2101 3375 2056 2298 3145 2411 2855 2410 2461 2247 1450 3169 4069 3607 2869 3296
1898C296n96j98J241J63J0%k8j55l5k2O88L09K39K01P1o70R1M69N16Q69P21J02p2n81n29O65
$$ 3296 2700 2502 3743 3906 3916 3916 3888 3733 3698 3676 4364 4673 4912 5113 5184 4514 4605 5074 5590 6459 7180 7282 7210 6629 6100 6765
1654F765J878K070K042J029m01k573m358J9445L0268r709N1933m2244O40151o527J537613
$$ 6765 8643 10713 12755 13784 13383 10810 6452 25897 56165 46456 98389 56145 696296 689769 2227382
1513B227382J44926j641794N60952j084469r9520m0311k8919j2709j1729n059J946K536P11
$$ 2227382 2372308 730514 1291466 206997 107477 67166 38247 25538 13809 8750 10696 13232 13943
1391A3943o89j384k924k934P66J24P30J79m86q25j610j94m1Q01Q0j34n55p43m34l7L56K75
$$ 13943 13254 11870 8946 6012 6778 6902 7632 7811 7325 6500 4890 4696 4655 5456 5536 5402 4847 4104 3670 3633 3989 4264
1185D264L1l50l74n47j70K65L58J74j54m43l98k81J05L88K89m7k68l90m38n9M74K76J50j06
$$ 4264 4295 3945 3571 3024 2854 3119 3477 3651 3497 3054 2656 2375 2480 2868 3157 3110 2842 2452 2014 1955 2429 2705 2855 2749
959B749m34m92j61K21L30L36J4k71l96l55nK82N04P1j5m46m11k63K40N15K31Q3l43l31l76
$$ 2749 2315 1823 1662 1883 2213 2549 2563 2292 1896 1541 1536 1818 2322 2393 2378 1932 1521 1258 1498 2013 2244 2327 1984 1653 1277
725A277k3M06M07K55j35l34n14k35M16N32K38K3j84m43l52P8P25M65K24j97j77k20K59L82
$$ 1277 1254 1660 2067 2322 2187 1853 1339 1104 1520 2052 2290 2313 2129 1686 1334 1412 2137 2602 2826 2629 2452 2232 2491 2873
499B873J342j66J788J047N945K0912R1783R200j642n0967Q092n065n0160k3324o688o07k096
$$ 2873 4215 4049 5837 6884 12829 33741 125524 134724 133082 82115 90207 85142 34982 11658 4970 4363 2267
340B267K559k709K927j980k17r20m81K31N81L57M7l35o90o13m6N76N71K31l1n72o34n73M51
$$ 2267 4826 2117 5044 3064 2847 1927 1446 1677 2258 2615 2662 2327 1637 1024 978 1554 2125 2356 2325 1753 1119 546 997
124I97P24M56P5k64m69q95j89Q22O60L51k8n41p27p13L93Q84N73J24n7o17p87o11R21P68L99
$$ 997 1721 2177 2252 1988 1519 624 435 1257 1917 2268 2240 1699 972 259 652 1536 2109 2233 2176 1559 772 161 1082 1850 2249
-111B249O4k05p18p81l6Q65O75M41p9m06o61p69M64Q06P19K84j80n11o35k92M63Q94P49K20
$$ 2249 2313 2108 1390 609 573 1438 2113 2554 2475 2069 1408 639 1103 1909 2628 2912 2732 2221 1586 1294 1757 2651 3400 3620
-337C620j49m15o79k99K67O82
$$ 3620 3471 3056 2377 2078 2345 3027
-393C027
$$ 3027
##PAGE=	F1=-1435.15
##FIRST=	4405.4455391999963467,	4405.4455391999963467,	0
##DATA TABLE=	(F2++(Y..Y)), PROFILE
4405C295K46j03m64o24n15q5M00N15K11m1m27p11m87k21N97N66J45K3n79n10n61J88O69L52
$$ 3295 3541 3438 2974 2350 1835 1750 2150 2665 2876 2835 2408 1697 1210 989 1586 2152 2297 2320 1741 1231 670 858 1527 1879
4180A879J80j30m78o85l47M77N50L78j6k12m31o27k52O93N19K04m2k75m98o47K50N92L27K95
$$ 1879 2059 1929 1451 766 419 896 1446 1824 1808 1596 1165 538 286 979 1498 1702 1660 1385 887 240 490 1082 1409 1704
3955A704k65k43n73n51O33M28K68J67j89m23n23j78N01M14K95k0j70n79m91J99M57M31R9n4
$$ 1704 1439 1196 623 72 705 1133 1401 1568 1379 956 433 255 756 1170 1465 1445 1275 696 205 404 861 1292 1391 1337
3729A337k58o15k57L49M11L81K6j45l61n55j07M54M66J92j4k32l36m60J36M25L46J71j03l08
$$ 1337 1079 464 207 556 967 1348 1374 1229 868 313 206 660 1126 1318 1304 1072 736 276 412 837 1183 1354 1251 943
3504I43m46j99K86L21L50J08k36l04l90k6K38M48J60k7k48k50l82J45L37K75J94j23k46l61
$$ 943 497 298 584 905 1255 1363 1127 823 433 407 645 1093 1253 1226 978 728 346 491 828 1103 1297 1174 928 567
3279E67j43J95L44J92J23j30l28l22j53M63K53K04Lk57l66j53O3K62L74J03j15k24j94k54
$$ 567 424 619 963 1155 1278 1148 820 498 345 808 1061 1265 1268 1011 645 492 555 817 1191 1294 1179 955 761 507
3053E07L07l74R57k00Q62J56M01j195r69J194o56K40J48N97j361l33Q28m1J48j05j66k97N
$$ 507 814 440 1397 1197 2059 2215 2616 1421 452 1646 990 1230 1378 1975 614 281 1109 1068 1216 1111 945 648 653
2837F53j6M77J51l7o31N04O73j125J590o55J10p66J57l8l44K40K18P8J19R6m30k71J308p89
$$ 653 637 1114 1265 1228 597 1101 1774 649 2239 1584 1694 928 1085 1047 703 943 1161 1239 1358 1454 1024 753 2061 1272
2612A272N84j026N75j24m02L7n0K20K45P8k8j62j38j73Q1K52J69J7M2k31j97J11n5K68P5J47
$$ 1272 1856 830 1405 1281 879 916 866 1086 1331 1409 1381 1219 1081 908 989 1241 1410 1427 1469 1238 1041 1152 1097 1365 1440 1587
2368A587j23q6k40j12L16K41L6l0j51r3n9kK28J10J78m1j10k56mJ67J67R9J30r6j60q5o9K59
$$ 1587 1464 1378 1138 1026 1342 1583 1619 1589 1438 1345 1286 1284 1512 1622 1800 1759 1649 1393 1389 1556 1723 1822 1952 1856 1696 1611 1542 1801
2105A801P8L17k11j52N24O09r62J108j481P52N7l78L40l38J16l59p41J890O63m45p93M96O1
$$ 1801 1879 2196 1985 1833 2357 2966 2004 3112 1631 2383 2440 2062 2402 2064 2180 1821 1080 2970 3633 3188 2395 2891 2952
1889B952j185J775j02m1lm3j08n0RP84J2K56K51j37o04L37L94M75P18N46l5j44m78k93Q68
$$ 2952 1767 3542 3440 3399 3396 3353 3245 3195 3204 3988 4000 4256 4507 4370 3766 4103 4497 4972 5690 6236 6201 6057 5579 5286 6154
1654F154J803J622J536N05o26k528l980K2524L2407k3167M9154l3734L26484k8272J394780
$$ 6154 7957 9579 11115 11620 10994 8466 4486 27010 59417 36250 85404 51670 378154 349882 1744662
1513A744662J42912j122833N50571j103592j04637l9287l4524j1785q509n230K007K265M34
$$ 1744662 1887574 764741 1315312 211720 107083 67796 33272 21487 12978 7748 9755 12020 12454
1391A2454l03j942l628o61L4j22Q87J47m70n21k515J437p57N44K62j57n53o52l53J0L55J94
$$ 12454 12151 10209 6581 5920 5954 5832 6719 6866 6396 5875 3360 4797 4040 4584 4846 4689 4136 3484 3131 3141 3496 3690
1185C690Pl56l10m91j07K99K88J15j85m06l19k07J33L35K49j11k66l15l75kM40K34R6j18n18
$$ 3690 3697 3341 3031 2540 2433 2732 3020 3135 2950 2544 2225 2018 2151 2486 2735 2624 2358 2043 1668 1666 2106 2340 2436 2318 1800
950A800k81j37K48K78K89o8k74l19l01P3K71M12M1j00m17l26j75K69M44J44O5l70k85l04M3
$$ 1800 1519 1382 1630 1908 2197 2129 1855 1536 1235 1308 1579 1991 2032 1932 1515 1189 1014 1283 1727 1871 1936 1566 1281 977 1020
715A020M06L23J47j68l00m35j29M18M56J15l4j76m14l15M55K58N43J27l21j58j32L77L69J131
$$ 1020 1426 1749 1896 1728 1428 993 864 1282 1738 1853 1819 1643 1229 914 1369 1627 2170 2297 1976 1818 1686 2063 2432 3563
490C563l34J461Q41N178J8132P9028P636j164l9940O497l986m5400k1222n957m42j403K327
$$ 3563 3229 4690 5531 10709 28841 107869 115505 114341 74401 80898 76912 31512 10290 4333 3891 2488 4815
330D815j522Q16j447k86q38j87K73N23K38m9l82o45m71K10M96M38J31j11n88n82k83N34N89
$$ 4815 3293 4109 2662 2376 1538 1351 1624 2147 2385 2336 1954 1309 838 1048 1544 1982 2113 2002 1414 832 549 1083 1672
114A672L16k5k90m59p56J02P20N17K61j13n65p22n31O27P46M55mq8o40p42j90Q53O05K73J7
$$ 1672 1988 1963 1673 1214 458 560 1280 1797 2058 1945 1380 658 127 754 1500 1955 1951 1863 1223 481 291 1144 1749 2022 2039
-121B039l22o62o75K95P16N99K71j45m23o37n46O17O75N93J81k85n06n52q6N01P96O27Q8k31
$$ 2039 1717 1055 380 675 1391 1990 2261 2116 1693 1056 510 1127 1802 2395 2576 2291 1785 1233 1147 1648 2444 3071 3159 2928
-346B928m29n53j69L77O14
$$ 2928 2499 1946 1777 2154 2768
-393B768
$$ 2768
##PAGE=	F1=-1453.93
##FIRST=	4405.4455391999963467,	4405.4455391999963467,	0
##DATA TABLE=	(F2++(Y..Y)), PROFILE
4405B697J48j52l64n60l48K7L59L87J11p1l63o01l23j28N50L96Q8k4n12l99m32K80N30K47
$$ 2697 2845 2693 2329 1769 1421 1448 1807 2194 2305 2234 1871 1270 947 819 1369 1765 1853 1829 1317 918 486 766 1296 1543
4180A543R5r4m90n06k30M85L93L02p8j86l65n06q3N82L87J13n4k50m06n77L67M55K79K03k50
$$ 1543 1638 1544 1054 548 318 803 1196 1498 1420 1234 869 363 280 862 1249 1362 1308 1058 652 75 442 897 1176 1379 1129
3945A129k41m63l98O10K89K08J39k18l27m50J9L63K95K43n8j35n50l62K89L22L65N3q9k08
$$ 1129 888 425 27 637 926 1134 1273 1055 728 278 297 660 955 1198 1140 1005 455 93 382 704 1069 1122 1033 825
3720H25n11j28K87L45K88j4j45l11m56K1L69L68J30n4j84k89l69J96L34K99N9o9k74l88q7
$$ 825 314 186 473 818 1106 1092 947 636 180 201 570 938 1068 1014 830 541 172 368 702 1001 1060 991 717 329 242
3485B42K73K25K79R6k70k30k94N2J76L17J56p7k00j99k86J48K89K21J13j26k03k78p1J72K68
$$ 242 515 740 1019 1115 845 615 321 373 549 866 1022 945 745 546 260 408 697 918 1031 905 702 424 353 525 793
3250G93J43P7r4l11k63n9M08J62J67j0k42l10o1P1J99L20O6j35j90j47j71K89m33R74k41Q82
$$ 793 936 1013 919 608 345 286 694 856 1023 1013 771 461 400 471 670 990 1056 921 731 584 413 702 269 1243 1002 1884
3006A884J00M49r09j309J356p76K58J53M70j351r1P20j01R4q4j87j89N0k0L68J30o5o28P06
$$ 1884 1984 2433 1524 215 1571 795 1053 1206 1676 325 234 954 853 947 863 676 487 537 517 885 1015 950 322 1028
2781A028M97j011J351j27k38r75L13j8k61J85K13oJ05M9l08k18J331J14r33n49O03k00l18
$$ 1028 1525 514 1865 1738 1500 525 838 820 559 744 957 951 1056 1105 797 579 1910 2024 1091 542 1145 945 627
2565F27Q3m1J67K52J3n9j45q8r7M6K40J36n9O1k04j28Q9m0K47J7J00j10m6j96r3K73K14j9
$$ 627 710 669 836 1088 1101 1042 897 809 712 758 998 1134 1075 1136 932 804 893 853 1100 1117 1217 1107 1061 865 772 1045 1259 1240
2302A240l6j03p7l0J1J85P2J38l4j21k12N9J37J21O3J10j08j28n1p5K95j6L23l09O6M97p0
$$ 1240 1204 1101 1024 994 1005 1190 1262 1400 1366 1245 1033 1092 1229 1350 1413 1523 1415 1287 1236 1161 1456 1440 1763 1454 1520 2017 1947
2049A947Q3L52r76J148q48j77K79k63P9n15k65K145l74o8q44P04M29j566J614k20n9Po1q0
$$ 1947 2030 2382 1406 2554 1706 1529 1808 1545 1624 1109 844 2989 2615 2547 1703 2407 2836 1270 2884 2664 2605 2612 2551 2471
1823B471r3J51O19j67K92K18k72m16L98K50M17N06L80j28j62l55j19Q60J492J076J005P6o86
$$ 2471 2378 2529 3148 2981 3273 3491 3219 2803 3201 3451 3868 4374 4754 4626 4464 4109 3990 4850 6342 7418 8423 8499 7813
1607G813j903k984K0376L1018k2799L6840k4555Q2079l7952J072750J26002n79801M87125
$$ 7813 5910 2926 23302 54320 31521 68361 43806 125885 87933 1160683 1286685 706884 1194009
1485A194009j000959r7071l3067l6657r537m417n620R93K086K97J15j958m284J727j020l20
$$ 1194009 193050 95979 62912 26255 16718 12301 6681 7674 9760 10057 10172 8214 3930 5657 4637 4317
1335D317R86J29m27l16k333J720m77l08M82j19m78n14k93K5L21J07J7k99k41m11p3K93K10
$$ 4317 5303 5432 5005 4689 2356 4076 3599 3291 3773 3654 3176 2662 2369 2394 2715 2822 2839 2540 2299 1888 1815 2108 2318
1119B318O5j58l43k19j56J20K71K05j40k30k10l21L6L55J87O1j13n00r8j28K32J95K55j40
$$ 2318 2383 2225 1882 1663 1507 1627 1898 2103 1963 1733 1523 1202 1238 1593 1780 1841 1728 1228 1130 1002 1234 1429 1684 1544
894A544k21k20k48J11K19L20J6j48l40k26j11K46L47P3O4l37k35k28P2L72K24N3j58k36l35
$$ 1544 1323 1103 855 966 1185 1505 1521 1373 1033 807 696 942 1289 1362 1426 1089 854 626 698 1070 1294 1347 1189 953 618
659F18l7L56L63km9j48l45j37N24m2M78M7l60r5rM03L13Q37l93J108O66M209J4523O2680N712
$$ 618 581 937 1300 1298 1249 1101 756 619 1143 1101 1579 1626 1266 1171 1162 1565 1878 2715 2322 3430 4096 8305 22828 85508 91220
424I1220o81k7897N231k821l8408j8157m904k50o91J475P3j590l07l76p08jK09M47J19r5l60
$$ 91220 90539 62642 67873 65052 26644 8487 3583 3333 2642 4117 4190 2600 2293 1917 1209 1208 1417 1864 1983 1888 1528
227A528n32k94K97L61K99Q0j53n25m75o4N00M26J89p3k58l87n48J96N67L82J75j38n20o41
$$ 1528 996 702 999 1360 1659 1739 1586 1061 586 522 1022 1448 1637 1564 1306 919 371 567 1134 1516 1691 1553 1033 392
2C92k45N62N81L41q5p3n92o16N9P17M19J81J3l72n45n07M23N28N07J09j32l76n63k84N63N14
$$ 392 147 709 1290 1631 1546 1473 881 265 324 1041 1460 1641 1654 1282 737 230 653 1181 1688 1797 1665 1289 726 442 1005 1519
-243A519M44J12l17m30m12M0M21O54M84Jk54l76l78r2L80M83
$$ 1519 1963 2075 1758 1328 916 956 1377 2031 2515 2516 2262 1886 1508 1416 1796 2279
-393B279
$$ 2279
##PAGE=	F1=-1472.71
##FIRST=	4405.4455391999963467,	4405.4455391999963467,	0
##DATA TABLE=	(F2++(Y..Y)), PROFILE
4405B005R0j60k28m78k20Q5K68K71M6n7k73m52k12q1M59K36P8o3l73k87l27K65L98J57M6m0
$$ 2005 2095 1935 1707 1229 1009 1094 1362 1633 1679 1622 1349 897 685 604 1063 1299 1377 1314 941 654 327 592 990 1147 1193 1153
4161A153m58k93j91M11K64K34r0j42k69l89J5M20K64O7m7j91l00m35L05L11K68J20k17j97
$$ 1153 695 402 211 622 886 1120 1030 888 619 230 245 665 929 996 949 758 458 23 328 639 907 1027 810 613
3936F13l26k23M25J81J52J54k49j82l70Q2K56J85J82k2j22m70k25K55J97L13L3j15j21l80
$$ 613 287 64 489 670 822 976 727 545 175 257 513 698 880 858 736 266 41 296 493 806 839 724 603 223
3711B23n5J77K77J97j9j22k46l25M1K85K83O7n0j22k41k66J62K61K62m6j7j97l25j7J97J62
$$ 223 168 345 622 819 800 678 432 107 148 433 716 783 733 611 370 104 266 527 789 743 726 529 204 187 384 546
3466E46K04R9k80j28k04N7J02K22J43r7j20j45k13R2K60J65L0p5j66j63o6J47J67J24M0n1
$$ 546 750 849 569 441 237 294 396 618 761 664 544 399 186 278 538 703 733 658 492 329 263 410 577 701 741 690
3222F90k74k05J1L15P9J50j7j96k39PL8J46K52L4j34j26r4j11K33m93J004k47Q61k1M51o56
$$ 690 416 211 222 537 616 766 749 553 314 321 359 505 757 791 657 531 437 326 559 66 1070 823 1684 1663 2114 1458
2978A458q16P38q19L81K1L02j199J43N42j21M1m2k03p4L8k6K66J10p7k67M78L50j028J098
$$ 1458 642 1380 561 942 963 1265 66 209 751 630 671 629 426 352 390 364 630 740 663 396 874 1224 196 1294
2753A294N64o97q75L27k5j46P9J81l8Q3J6j16j42J574J250l150M09K78k90j09L3m8J03K44
$$ 1294 1858 1161 286 613 588 442 521 702 664 747 763 647 505 2079 3329 179 588 866 576 467 500 452 555 799
2527G99l6p5r2l9n3rK25J03j21R9j64n9K1k4K22l5O6n2m5j51p8K16J70m7k2m1n0l9NJ36N6
$$ 799 763 688 596 557 504 495 720 823 702 801 637 578 599 575 797 762 828 776 731 580 502 718 888 841 819 778 728 689 694 830 886
2236H86R5j6j31j51J02P2P3L8J12j20p9k9r0K95j09L20l44K49M82p56J120p63J12J292j513
$$ 886 981 965 834 683 785 857 930 968 1080 960 881 852 762 1057 948 1268 924 1173 1655 899 2019 1256 1368 2660 1147
2002A147k92M15k43k9o44Q92J852j727M71q29J107J66j035O85j31l6K1p4n5j70L41L18k06
$$ 1147 855 1270 1027 998 354 1246 3098 1371 1842 1013 2120 2286 1251 1936 1805 1769 1790 1716 1661 1491 1832 2150 1944
1786A944L03J48l00k65L71P8L50K97K66j53j49k63n7O99J085O01N78j80n89j088j788J4483
$$ 1944 2247 2395 2095 1830 2201 2279 2629 2926 3192 3039 2890 2627 2570 3269 4354 4955 5533 5353 4764 3676 1888 16371
1579A6371K6023j4239K0420j4249k060L2820N36067R8573j26464L82819q00921p8481k3358
$$ 16371 42394 28155 48575 34326 32266 65086 601153 699726 573262 956081 155160 76679 53321
1457E3321l4107m834k514n931q68K113L14K56j507m113K864j647m27R21J00l40n66m55k63
$$ 53321 19214 14380 11866 5935 5067 7180 7494 7750 6243 2130 4994 3347 2920 3841 3941 3601 3035 2580 2317
1279B317R20j152N22k0l48l57k60J6K66K1N6j99k03l07p9K65J33L0q7k71j25j44Q9K01J74
$$ 2317 3237 2085 2607 2587 2239 1882 1622 1638 1904 1925 1981 1782 1579 1272 1193 1458 1591 1621 1534 1263 1138 994 1083 1284 1458
1044A458j40j70j08k95O6K35J53M7j09l36m3j26J85J04K29j77j24j30k10R9J40K60j5j38k36
$$ 1458 1318 1148 1040 745 811 1046 1199 1246 1137 801 758 632 817 921 1150 973 849 719 509 608 748 1008 993 855 619
809F19j43r0J82K48M3O7k40k17j75O7L20J35j0j10j52k59J9K55K75q7l3j08k58J60K33p3K84
$$ 619 476 386 568 816 859 926 686 469 294 361 681 816 806 696 544 285 304 559 834 747 714 606 348 508 741 668 952
556I52j7l11nJ13L26K33N21l50P59N32L102J0545M4789L724l62j6454M054j680k9790j4316
$$ 952 935 624 619 732 1058 1291 1812 1462 2221 2753 5855 16400 61189 64913 64551 48097 52151 50471 20681 6365
368F365l649j08k00k55J785l687J665l53n77N6J02L72Pr5k96l94j46K89K04J78P6j72m16l53
$$ 6365 2716 2608 2408 2153 3938 251 1916 1563 986 1042 1144 1516 1523 1428 1132 738 592 881 1085 1263 1339 1167 751 398
142C98P3M06K70Q5p6j98k82l54J71M14K70R1j15m30n20m7M24M15K46j12m3m96m51J48N52K46
$$ 398 471 877 1147 1232 1156 958 676 322 493 907 1177 1268 1153 723 203 156 580 995 1241 1129 1086 590 139 287 839 1085
-102A085J41L1l67m12l59M20L59M13k3n9l02m77r2M24L87K88Q4l03l10k85O8L11N19L35k9
$$ 1085 1226 1257 890 478 119 539 898 1311 1288 1229 927 450 358 782 1169 1457 1541 1238 928 643 711 1022 1541 1876 1847
-337A847k40k89k21p5L18L55
$$ 1847 1607 1318 1097 1022 1340 1695
-393A695
$$ 1695
##PAGE=	F1=-1491.49
##FIRST=	4405.4455391999963467,	4405.4455391999963467,	0
##DATA TABLE=	(F2++(Y..Y)), PROFILE
4405A374N8j45j15l97j57J34J82J82J6k5k06l08j66k0L56J07R2r7k16k16k47K27K87R2J7J
$$ 1374 1432 1287 1172 775 618 752 934 1116 1132 1107 901 593 427 407 763 870 962 865 649 433 186 413 700 792 809 810
4161H10m02j07j86L05J89J70o2j15j77l00Q0K55J63P4n3j24k17k56J66J82K82M2j82j31k11
$$ 810 408 301 115 420 609 779 717 602 425 125 205 460 623 697 644 520 303 47 213 395 677 719 537 406 195
3927A95j34K64J31R7J77k81l7l02P4J92J21Q0Q3j63l45j15J64J17K59K3j26l9k65k4R3K16
$$ 195 61 325 456 553 730 449 412 110 184 376 497 577 660 497 152 37 201 318 577 600 474 435 170 146 239 455
3682D55J01jp9k01j90J8K15K14onq0k06j55Q1K26K21j36L1j09k68J9J11J38J23J01k69l2j29
$$ 455 556 555 476 275 85 103 318 532 526 521 441 235 80 161 387 608 472 503 394 126 145 256 394 517 618 349 317 188
3419A88J1N1J86R3p7m6j10j66L9K46R9l6lj49m5j05J63M8J24J1k5k27j42P0J93K7J41k7j39
$$ 188 199 250 436 529 452 406 296 130 169 415 514 478 475 326 281 176 339 387 511 522 497 270 128 198 391 418 559 532 393
3147C93j65L8JJ12J72Lj12n4m5o5J23j76O75k23Q27k14M93n03l18J89p80N25j44J05l73k56
$$ 393 228 266 267 379 551 554 442 388 343 278 401 225 900 677 1504 1290 1783 1280 962 1151 371 896 752 857 484 228
2903B28L33q8k8Pj99R%j3J73Q7q2J19J19K35o33M05J139j040l66M1m4k4k6J28rL0J8J6k0J761
$$ 228 561 473 445 452 253 262 262 249 422 509 427 546 665 900 267 672 1811 771 405 446 402 378 352 480 471 501 519 535 515 2276
2621B276K209l229m91j33l76J94q2p4P3J86n9o8k0j4k8p1K11O3j48J36j25mo9QJ88o5M0L5
$$ 2276 4485 1256 765 632 256 450 368 294 367 553 494 426 406 392 364 293 504 567 419 555 430 426 357 365 553 488 528 563
2358E63r7r0m5J41J09k6oJ2j3r7QR7N9M8j1j28o5J15j5L7L6J20j28l2k1o9K32j69L00k84K89
$$ 563 466 376 331 472 581 555 549 561 548 451 459 556 615 663 652 524 459 574 559 596 632 752 624 592 571 502 734 565 865 581 870
2067H70M88j79O02j228N74J367j661o68Q12k69j27m8J353J230k701Q23o03J341m65n4n11J57
$$ 870 1358 1179 1781 553 1127 2494 833 165 977 708 581 533 1886 3116 415 1238 635 1976 1511 1457 946 1103
1861A103K5K7n7k7k53M58J07j83K70Q5k39k09L44p1K67J58K24j09j23k06p0M60P17L27L29
$$ 1103 1128 1155 1098 1071 818 1276 1383 1200 1470 1555 1316 1107 1451 1380 1647 1805 2029 1920 1797 1591 1521 1981 2698 3025 3354
1626C354k30l65n33q35P113J8902m172N398l709O4141K3916N5064O8978J60495K59088n49817
$$ 3354 3124 2759 2226 1391 8504 27406 23234 28632 24923 89064 112980 168044 237022 397517 656605 106788
1476A06788n3453j2654k6752K029m363o143k397J905M74M9j532j979K105j944q2O82L4j29
$$ 106788 53335 40681 13929 15958 11595 5452 3055 4960 5434 5483 3951 1972 4077 2133 2051 2733 2767 2638
1307B638j464K117l055K222q86R6Q6k09k14k30MJ99n4R6r7k08j62j17K24O1J3j3k03m9j63
$$ 2638 1174 3291 236 2458 1572 1668 1754 1545 1331 1101 1105 1304 1250 1346 1249 1041 879 762 986 1047 1060 1047 844 795 632
1072F32Q7J02J59j24r9n1k57R0R2J41M7j16o7j45j01J19L1J81j32k2q9j59L7L9K56p1n0j38
$$ 632 719 821 980 856 757 706 449 539 631 772 819 703 636 491 390 509 540 721 589 567 478 319 356 395 651 580 530 392
809C92r7j06R1J59P2M2q9k54j25K4K45Q2k1m3n9k56M5J33J97r0k9o1j35L89k36J16N3j00j82
$$ 392 295 189 280 439 511 553 464 210 85 109 354 436 415 372 313 57 102 235 432 342 313 252 117 506 270 386 439 339 157
537A57J14J74J70J45K37k34M52M32J977O742K7819J976k82p094K806o66k0638j0139k364o6
$$ 157 271 445 615 760 997 763 1215 1647 3624 10366 38185 40161 39879 32785 35591 34925 14287 4148 1784 1718
349A718mn86K291m86j481j34m59M2J0K84r0p7k16k68l7K55M8Q7R1j78l01k35J69K73J53pn2
$$ 1718 1714 1128 3419 2933 1452 1318 859 901 911 1195 1105 1028 812 544 507 762 810 897 988 810 509 274 443 716 869 862 810
95H10j40j78k06J16K94J70Qo8l23l91N9K97K62J75j02l6l76k94J77L65J17J41L3l28k96k73
$$ 810 670 492 286 402 696 866 874 806 483 92 151 448 710 885 783 747 371 77 254 619 736 877 910 582 286 13
-149A3L95K29L21j22L4k37l98J1K95L19J26R0k72j95k11O2K30M10J80j4k14k05j23p3K35K77
$$ 13 408 637 958 836 870 633 235 246 541 860 986 1076 804 609 398 460 690 1100 1280 1266 1052 847 724 651 886 1163
-393A163
$$ 1163
##PAGE=	F1=-1510.27
##FIRST=	4405.4455391999963467,	4405.4455391999963467,	0
##DATA TABLE=	(F2++(Y..Y)), PROFILE
4405I00K5j26o4l04j41K09J23J06Moj92j88j40R1K45J2Q4j11r8j88j43K09J80M4j4J3l35J4
$$ 900 925 799 735 431 290 499 622 728 732 726 534 346 206 297 542 554 638 527 429 241 98 307 487 531 517 530 195 209
4143B09p9J34J59R7j4j30j09j99J17J20Q7R8p7p3j72j23J16Q9K62l2j53o4j43p7J75J20L9
$$ 209 130 264 423 520 506 376 267 68 185 305 392 490 413 340 168 45 161 250 512 480 327 263 120 43 218 338 377
3889C77J58k91N8k36P6J38J20p2J95k29j88m9R8R2J65lr9mj88J1O3J68rJ6k1j94q1M3J51J43
$$ 377 535 244 302 66 142 280 400 328 523 294 106 57 155 247 412 409 310 306 118 129 192 360 351 367 346 152 71 114 265 408
3607D08p8M9p0j76n4M0J94J61j91N3n0k07L5P2J17M8Q6k40L1o9m0N8J75kk7j6r2j29O1J95
$$ 408 330 379 309 133 79 119 313 474 283 336 286 79 114 186 303 351 437 197 228 159 119 177 352 350 323 307 215 86 147 342
3326C42K5o1L8j41L9j31K04n2J14j1k6j73p0J06Q5J5J17n5q9r6M2qR1Q5k3p2lnk8k5J63L24
$$ 342 367 306 344 203 242 111 315 263 377 366 340 167 97 203 288 303 420 365 276 180 222 214 305 390 367 295 292 287 259 234 397 721
3025G21j62P80m18O12m62Mr5o87N83j81r2K54o00J51l3r5L7j46K6j6K9P1O2p6K96j19J53J42
$$ 721 559 1339 921 1533 1071 1075 980 293 876 695 603 857 257 408 375 280 317 171 197 181 210 281 343 267 563 444 597 739
2762G39n66J377j090N7j94m9O4p2O6L2l1N8j6J45J723K918k906j444l43l99L87j21r9Q8O7
$$ 739 173 1550 460 517 323 274 338 266 332 364 333 391 375 520 2243 5161 2255 811 468 69 456 335 236 324 391
2527C91n4k2J3k1Qj03J73J4j09J27j00K3j09M6J29n7K3P6j48mmO1M3M1k1L2J4j54M2P3N2K
$$ 391 337 315 328 307 315 212 385 399 290 417 317 340 231 277 406 349 372 448 300 296 292 353 396 437 416 448 462 308 350 423 475 477
2227D77k9r3J8R9p0J3N1J03j18pj9NJ10j47K40j33J62M00O82m34J70q38J253j141l62M79k77
$$ 477 448 355 373 472 402 415 466 569 451 444 425 430 540 393 633 500 662 1062 1744 1310 1480 642 1895 754 392 871 594
1973E94o4M57J182P26k161R9j69J122q55N93j375N76O8Rkk3j84L18J29j66J88K0j23j18K29
$$ 594 530 987 2169 2895 734 833 664 1786 931 1524 149 725 793 802 800 777 593 911 1040 874 1062 1082 959 841 1070
1739A070p0J60J27J90m4q6j28k0K41M71K40K25j32j40m15j48K93J1527L152m937M913N9471
$$ 1070 1000 1160 1287 1477 1433 1347 1219 1199 1440 1911 2151 2376 2244 2104 1689 1541 1834 13361 16513 11576 16489 75960
1532G5960J0791N001j4913J43085J40208l01597k7960l368j6266P694p203o330j733M0O94
$$ 75960 86751 91752 76839 219924 360132 58535 30575 27207 10941 18635 11432 5102 3369 3409 4103
1391D103n0k944K285N59k914O89L50n7J19j463L163j079j240J57m72O0j45j22j67QJ31q2R6
$$ 4103 4053 1109 3394 3953 1039 1728 2078 2021 2140 677 3840 2761 1521 1678 1206 1266 1121 999 832 840 971 889 985
1175I85n2k12j1j33J69PJ6Kj41kj63J36k1J39j06m3n4j43P7qJ26M1j10R0k48l4O0J5O9J5J
$$ 985 933 721 710 577 746 753 769 771 630 628 465 601 580 719 613 570 516 373 450 442 568 609 499 589 341 307 367 382 451 466 467
884D67r9p5j3l4K47j37P7j06p9p0K7P7J05l4L1k52K7kJ7R8J6j6pj74K4k7P2J04j34K0M2L23
$$ 467 368 293 280 246 493 356 433 327 248 178 205 282 387 353 384 132 159 157 174 272 288 272 265 91 115 88 160 264 130 150 192 515
584E15k41J55j74j73N7Q2P2mO3K2q2K23L34R75L574J3909O81l78p04J475J30j2192o186j219
$$ 515 274 429 255 82 139 221 293 289 352 374 292 515 849 1824 5398 19307 19988 19610 18906 20381 20511 8319 2133 914
358I14j20L62L324J46J379m958P3l63J4l9J80j55o4j37j69M8K23q4L1R1j73k01j31K47J24
$$ 914 794 1156 4480 4626 6005 1047 1120 757 771 732 912 757 693 556 387 435 658 574 605 696 523 322 191 438 562
124E62R4r7k0j06q6r6Q1K10P1o3l0k13k33P7K00J41J23q9o1k57j60K05J91M1J40kk76k04m5
$$ 562 656 559 539 433 347 251 332 542 613 550 520 307 74 151 351 492 615 526 465 208 48 253 444 485 625 623 347 143 98
-149I8K33J19K27j81R0j85k92M4K16K72k2R4k32j27j70J03J86L06J5K3j82j47q3kJ30K49
$$ 98 331 450 677 496 586 401 109 153 369 641 619 713 481 354 184 287 473 779 794 817 635 488 405 403 533 782
-393G82
##PAGE=	F1=-1529.05
##FIRST=	4405.4455391999963467,	4405.4455391999963467,	0
##DATA TABLE=	(F2++(Y..Y)), PROFILE
4405E89l1r7p0j50r4K20P2L2jj9k11q6k5J26J43l7J5p3m7j70K3J59P4%m3J2k72Q7N9nJ24K1
$$ 589 558 461 391 241 147 367 439 471 470 451 240 154 129 255 398 361 376 303 256 86 109 268 342 342 299 311 39 126 185 180 304 325
4105C25L9j77n8k9O9L8M2Q1r1m2j47LR4O7J68r1j18j3q6n6J69Q9%Q3k48Q3j39Q8O1J47k10
$$ 325 364 187 129 100 169 207 249 330 239 197 50 53 147 214 382 291 173 160 74 18 187 276 276 359 111 194 55 143 204 351 141
3814A41K45k63l3j4P3Q1N2m4k4k2j30M9N1J46j09J3L7k03MQ1J08O7j18P2o8j22oO5J27J03
$$ 141 386 123 90 76 149 230 282 238 214 192 62 111 162 308 199 212 249 46 50 131 239 306 188 260 192 70 64 129 256 359
3532C59j93M0l0j22K4Q9O3RM9j86M6j9o9J14J28r2K2k0p8r3J19J17l3m2J7j09P7j24K20j00
$$ 359 166 206 176 54 78 167 230 239 288 102 148 129 60 174 302 210 232 212 134 41 160 277 244 202 219 110 187 63 283 183
3250A83Q2k4l8j18rJ11K2K7P9r5n0l5L0RO7J4l6j8PK6kj70M24L0n5P00n51P75m94J28r8o24
$$ 183 265 241 203 85 76 187 209 236 315 220 170 135 165 174 241 255 219 201 208 234 232 62 486 516 461 1161 610 1385 891 1019 921 297
2950B97N66l1k15N25q48j4pj32M5n5lMO3l3M7k9K67j87J15P25o66P05p80J52k99l4J03p5K4
$$ 297 863 832 617 1142 294 280 273 141 186 131 128 132 195 162 209 180 447 260 375 1100 434 1139 359 511 212 178 281 206 230
2678B30K6l4R9j61L42J397L268k345k136l30k49K87p6j10J00k2n1M1j3l3N3j02J16k3l5Q3
$$ 230 256 222 321 160 502 1899 5167 2822 686 356 107 394 318 208 308 286 235 276 263 230 283 181 297 274 239 322
2434C22r5L5q1N5N9j2QM3j28N4MJ8MR2n9L3J4j60P8O0K1k8m1m5N3P8n9j4N9O6r6lj3O1J6q0
$$ 322 227 262 181 236 295 283 291 334 206 260 264 282 286 378 319 352 366 206 284 344 365 337 296 251 304 382 323 309 368 434 338 335 322 383 399 319
2095C19J77l5N8J89J043r07J212j553M68j85j94J27k43O8O02P54M80j364m37J11Q27p76N81
$$ 319 496 461 519 708 1751 844 2056 503 971 786 592 719 476 544 1146 1900 2380 1016 579 690 1517 741 1322
1880A322r96K57K8k1M5o1NO7J90j11R1p8K8K8jP1P4J41J04l3m8m3P4J65L50J49J50r0q0l25
$$ 1322 326 583 611 590 635 574 579 646 836 725 816 738 766 794 793 864 938 1079 1183 1150 1102 1059 1133 1298 1648 1797 1947 1857 1777 1452
1598A452L35N40J117O057q107P978K0653j038J46554m047r6115M6328j01642p713K901o107
$$ 1452 1787 2327 3444 9501 1394 9372 30025 28987 175541 171494 75379 121707 20065 12352 15253 9146
1448I146J0618q499o151j72k627P98L51j859L692k83l221p0q9j52J22k47K236M23k406M0n91
$$ 9146 19764 11265 5114 4942 2315 3113 3464 1605 5297 5014 1793 1723 1634 1482 1604 1357 3593 4016 1610 1650 1059
1250A059q4j71p6j00J8Q7o4O6o4j69P1j11J16j0K7l6r2L0j36J84j06J06r3j3p7j3L7j7R0K3
$$ 1059 975 804 728 628 646 733 669 735 671 502 573 462 578 568 595 559 467 497 361 545 439 545 452 439 362 349 386 369 459 482
969D82p0Q9k76L1L8L8m6J36l3j13j1jk5J75j53J24j27n9j3M0N5O0r1N3j85Q3J6p2J17K6m8
$$ 482 412 501 225 256 294 332 286 422 389 276 265 264 239 414 261 385 258 199 186 226 281 341 250 303 118 201 217 145 262 288 240
678B40pj25N7j3q0K56k04N5O2K55R6R0l16o3q7K4l8p6k3q4P2J15J41K23J299M309p6m82K622
$$ 240 233 108 165 152 72 328 124 179 241 496 592 682 366 303 216 240 202 126 103 19 91 206 347 570 1869 6178 6102 5620 8242
405H242J72O39n475k936l56j84J220M684n84J670o121q6k89k2o3J07j88m4o0r7J10J86j71
$$ 8242 8414 9053 3578 642 286 102 1322 6006 5422 7092 971 885 596 574 511 618 430 386 326 229 339 525 354
189C54J3O3j50j16m8K82j0R0j75J0q6ok3O6J43j3j04j3j07n3J7J24P9P4q9r2j55k5J87P9R
$$ 354 367 430 280 164 116 398 388 478 303 313 227 221 198 264 407 394 290 277 170 117 134 258 337 411 322 230 75 50 237 316 325
-102C25J06n9k13j24J34J21K4J39j94Q3j17q2j3J47J91j04O2j49j31q0J76J21J87j26O1j26
$$ 325 431 372 159 35 169 290 314 453 259 342 225 143 130 277 468 364 426 277 146 66 242 363 550 424 485 359
-346C59j06o2J44PK01
$$ 359 253 191 335 342 543
-393E43
##PAGE=	F1=-1547.83
##FIRST=	4405.4455391999963467,	4405.4455391999963467,	0
##DATA TABLE=	(F2++(Y..Y)), PROFILE
4405C85q5l4j03O6j3P0J4jMn8j61k7J20J8Q1l6q0L5o3m0K4J00Ll4m0K8r4j0J22o7P9m1R8k34
$$ 385 300 266 163 229 216 286 300 299 303 245 84 57 177 195 276 240 160 195 132 92 116 216 219 185 145 173 79 69 191 124 203 162 260 26
4086B6NR3LKL8J0o9j2m1J2L7J00N1j27n4K0No2J30M2j1j2j19K9k8P1k0J64k21J63k06O6mN3
$$ 26 31 124 127 129 167 177 108 96 55 67 104 204 255 128 74 94 99 37 167 209 198 186 67 96 68 139 119 283 62 225 19 85 81 134
3767A34N0l0p9P7o4m4L6K3J49j74RP0q9m2R1P6kj06N4m9j0m8R9L8O7j23k2k6kl7J13KJ7no9
$$ 134 184 154 75 152 88 44 80 103 252 78 87 157 68 26 117 193 191 85 139 90 80 32 131 169 236 113 91 65 63 26 139 141 158 153 84
3438H4j1K0p9J64N0j26L3k0l7o7J29N3o7ll5k1N6j06J98j05M0k3m6n5K0Q9pL8M4j34pJ4J0
$$ 84 73 93 14 178 228 102 135 115 78 11 140 193 126 123 88 67 123 17 215 110 150 127 81 26 46 135 128 166 210 76 69 83 93
3128I3K9M0l3k9L3j2M7Qo3L87k08Q3N88n75R14n43J42M6o35N25K20k55N19r56k07j6j30M2
$$ 93 122 162 129 100 133 121 168 176 113 500 292 375 963 388 1302 759 901 947 312 837 1057 802 1321 365 158 142 12 54
2865E4N1k4LP0q6J1Q2J11j18J30R74m33r0k70l8l11j0R8q3Pk1P2Q8J8K28Q09L190j665k362
$$ 54 105 81 84 154 68 79 161 272 154 284 1258 825 735 465 427 116 106 204 121 128 107 179 267 285 513 1322 4512 2847 485
2593D85k14j53J53j0j10Q6m2p7J05o1l5Q7r0N6l6L9L5j02M6m7N3mN8k1j9l1M5j3KkR8r1L5
$$ 485 271 118 271 261 151 237 195 118 223 162 127 214 124 180 144 183 218 116 162 115 168 164 222 201 182 151 196 183 185 183 281 190 225
2283B25kj29Q9M7j4m3j2k3N0O4k3n0O1L2q1PrP4k9l5J41j9N6J31P68m94J143j090j12N0l16
$$ 225 223 94 183 230 216 173 161 138 188 252 229 179 240 272 191 198 189 263 234 199 340 321 377 508 1276 782 1925 835 723 773 457
1992D57j5j78K01N55J73M24o71n90K07P13p49L98m39l5o2k5N3j07J50n4J00RMj86K04J06k22
$$ 457 442 264 465 1020 1193 1617 946 356 563 1276 527 925 486 451 389 364 417 310 460 406 506 515 519 333 537 643 421
1739D21K04J6J43Ln6j1J3J11J35K56MP5j13p5r9O07K020k36J269J587k061J4068M289J15567
$$ 421 625 641 784 787 731 720 733 844 979 1235 1239 1314 1201 1126 1027 1634 3654 3418 4687 6274 4213 18281 22570 138137
1513A38137Q191j29210J1807k0005n773L980K18J1171p708n174O29m891O05O34J86L034l30
$$ 138137 146328 17118 28925 8920 3147 7127 7345 18516 10808 5634 6263 1372 1977 2611 2797 5831 5501
1354E501k718j064n38k51j76r5R96J105j330l48k64j58j90l6m9J4O0m1M2q2r3R0q1O8NK9p8
$$ 5501 2783 1719 1181 930 754 659 1655 2760 1430 1082 818 660 470 434 385 399 459 418 460 378 285 375 294 362 367 396 318
1100C18n1O3j09K01j48P0p9J3q6P4nRN1kj7P0k70O1L4M6q6J57n3j04K4K7lR7j32J07j42k4
$$ 318 267 330 221 422 274 344 265 278 192 266 261 270 321 319 302 372 102 163 197 243 157 314 261 157 181 208 205 302 170 277 135 111
800A11L1N0O4j3r7K8j00R6K8p3J02J4q1j1r4J07Lp7K27k33O7O8K21L39J04m33r5j80L1q1L8
$$ 111 142 192 256 243 146 174 74 170 198 125 227 241 160 149 55 162 165 88 315 82 149 217 438 777 881 448 353 173 204 123 161
509A61n7J13q0Q8j31J78o0Q78O66M69J08j239Q80j333k59l01J82P29K221q19J550l061m17
$$ 161 104 217 137 225 94 272 212 1090 1756 2225 2333 1094 1974 641 382 81 263 992 3213 2394 3944 883 466
293D66j66o3p7J28j96nJ3n2J37J39k10O0Kj12l4mK65j21J20j92J5n9N8nN9P8n4j02Ql3P7o4
$$ 466 300 237 160 288 92 87 100 48 185 324 114 174 176 64 30 26 291 170 290 98 113 54 112 107 166 244 190 88 96 63 140 76
-8G6N8Q5K0q6j11j0J8J18L8oN4j08q7k5J51L3k8O3j24Rj5O9o9P1R0o0m0K8j65P3J01M7P9j53
$$ 76 134 219 239 153 42 32 50 168 206 200 254 146 59 34 185 218 190 253 129 138 123 192 123 194 284 224 184 212 47 120 221 268 347 194
-327A94P1l5n2k8J65m2Q6
$$ 194 265 230 178 150 315 273 359
-393C59
##PAGE=	F1=-1566.61
##FIRST=	4405.4455391999963467,	4405.4455391999963467,	0
##DATA TABLE=	(F2++(Y..Y)), PROFILE
4405B91p1L8j12R7On6kM3J4q9L6j10R1n4M6J8n1P1j23P4q5N7j1jK7J6j4r8J02q4Q5o9J16j00
$$ 291 220 258 146 243 249 193 191 234 248 159 195 85 176 122 168 186 135 206 83 157 72 129 118 117 144 160 146 48 150 66 151 82 198 98
4086I8k4L1m8M1M5l3n0J5L5l4n5J80n5r3K4MM9l2K4L1j2j07O4m9J6N0o3J48o0p6L8k2j1M1
$$ 98 74 105 57 98 143 110 60 75 110 76 21 201 146 53 77 81 130 98 122 153 141 34 98 49 65 115 52 200 140 64 102 80 69 110
3767A10Jo6M2K8r9M8k8k0J76j39M8k4O5j20O5M3n8jkl7P2q7J13p0N0K9j30J7N6m3N2k7O6q4
$$ 110 111 45 87 115 16 64 36 16 192 53 101 77 142 22 87 130 72 71 69 32 104 17 130 60 110 139 9 26 82 39 91 64 130 46
3448D6Q3j16M9j1J28m5l9n7lN7l0K7K0p8M0k5M7j8m5R1m6l7M1o1L9l5N2j9N1Kn1Nk3j2N1J
$$ 46 129 13 62 51 179 134 95 38 35 92 62 89 109 31 71 46 93 75 30 121 75 38 79 18 57 22 74 55 106 108 57 62 39 27 78 79
3110G9j4QJ9m4N1KJ58K19l98K21M77n17R59n45J74J45o73M55M90k28L67r40m13j8Q4m4L3M
$$ 79 65 73 92 48 99 101 259 478 80 301 778 261 1220 675 849 994 321 776 1266 1038 1405 465 52 34 118 74 107 111
2847A11p2O5M3j01J30k0l6J41R49o4o12J54l60k47L4J5p8MK0J33J6L60J6J43K724j047j989
$$ 111 39 104 147 46 176 156 120 261 1210 1146 534 688 328 81 115 130 52 56 76 209 225 585 601 744 3468 2421 432
2593D32k21j12L8L1r9O3or3J34j15l2J00n4k3J7Q8k9j17O2l9P6p7J61p3q8J19l4l9J8L0L5
$$ 432 211 99 137 168 69 132 126 33 167 52 20 120 66 43 60 148 119 2 64 25 101 24 185 112 24 143 109 70 88 118 153
2302A53r2K4j6m7L6M3m6m8J06m2lM6Mr1R0j4p3M8l6O0k1m2J16n5J68M11l9K76K69k82N09o57
$$ 153 61 85 69 22 58 101 55 7 113 71 68 114 118 27 117 103 30 78 42 102 81 39 155 100 268 679 640 916 1185 903 1412 755
2002G55k92l47q5L21L81k91K97k5n77K24Q27p67J82j46j55j75M8j4j38K15N4j84J49j7j05
$$ 755 463 116 31 352 733 442 739 714 137 361 1188 421 603 457 302 127 175 161 23 238 292 108 257 240 135
1767A35J59J18l37K12j7J60j14p1J1L3Q0J03J36j14M8j53o7J39N77J791J774l86K460l572
$$ 135 294 412 75 287 270 430 316 245 256 289 369 472 608 494 542 389 322 461 1038 2829 4603 4217 6677 3105
1541C105L6651O536J443J3492q345L4180p0224j0616j312M59R846n483l542Q12n973O5O49
$$ 3105 39756 46292 47735 61227 52882 87062 16838 6222 4910 5369 15215 9732 6190 7002 1029 1094 1743
1382A743Q44J863M12j503j500r95l22L97J193N79o93r34q40R0q9j17J8J0j2L5j9J4o3k3Q0
$$ 1743 2587 4450 4862 3359 1859 864 542 939 2132 2711 2018 1084 244 334 245 128 146 156 144 179 160 174 111 88 168
1147A68o5K0N6J1j19JP9q2J86j62L4n8O1r8J21m5L9J3k7K5J08j29o9K2K2k4O2m4m5J5N5kL3
$$ 168 103 123 179 190 71 72 151 69 255 93 127 69 130 32 153 108 147 160 133 158 266 137 68 90 112 88 150 106 61 76 131 129 162
837A62j06P0j17N6J2M6O6q0q0J0KN7M8o7O6Lj08J3oQ9J4p6J60j62j5J09J73N17P9m53j80k34
$$ 162 56 126 9 65 77 123 189 109 29 39 41 98 146 79 145 148 40 53 47 136 150 74 234 72 57 166 339 856 935 482 302 68
537F8J26p6J48q3J10q9M4m3M03N11K306P90J63j312j07K3k198l78J1L58J669M161O91o89n562
$$ 68 194 118 266 183 293 204 248 205 608 1119 3425 4215 4378 3066 2959 2982 784 406 417 775 2444 6605 7296 6607 1045
302A045o84mo1P6k16J86j40p2M5j31R7J0O9j01nk6J2M5m4K0P3j05J1n3j9L7L5K5nM3j34Q7
$$ 1045 361 357 296 372 156 342 202 130 175 44 141 151 220 119 114 88 100 145 101 121 194 89 100 47 28 65 100 125 120 163 29 116
2A16r4R0Q0o1j1l5Qp7M8J02m8L2r0O6p5R0m3O1n2Q6p3j4P6j02K3K7J11j63J50r7kK6K9nR6
$$ 116 22 112 192 131 120 85 93 16 64 166 118 150 60 126 51 141 98 159 107 193 120 106 182 80 103 130 241 78 228 131 129 155 184 179 275
-327B75n4qk2k4P3L1m1
$$ 275 221 213 191 167 240 271 230
-393B30
##PAGE=	F1=-1585.39
##FIRST=	4405.4455391999963467,	4405.4455391999963467,	0
##DATA TABLE=	(F2++(Y..Y)), PROFILE
4405C53l7J9j35J2M9j13J17M6mq2M5j74J8O6LM2L7j4j67R1j51J02K2O6J4l7k1j28R0l8J16
$$ 353 316 335 200 212 261 148 265 311 307 225 270 96 114 180 183 225 262 248 81 172 21 123 145 211 225 188 167 39 129 91 207
4114B07l6J2j1p5n0k2J50kL7j12j7L9l1j1J49r6Ol2k4M6L2p8Q7k5n6L0n1l1O6LN5L9j22N8
$$ 207 171 183 172 97 47 25 175 173 210 98 81 120 89 78 227 131 137 105 81 127 159 81 168 143 87 117 66 35 101 104 159 198 76 134
3795A34o7k5P3k6LR9r3n6J9k9M4Q7l4M2j23J31j40N0Mj7M0J0p3M4n2J05p9m9J61j09LQJ4l4
$$ 134 67 42 115 89 92 191 98 42 61 32 76 163 129 171 48 179 39 89 93 76 116 126 53 97 45 150 71 22 183 74 77 85 99 65
3476F5L0O0r2R3j35J9O0R4j44J03r8k4Q4j4n1L8qPM3j5n4Pj9P3p8Q9n8J0o4N5kM2q8J29m5
$$ 65 95 155 63 156 21 40 100 194 50 153 55 31 115 101 50 88 80 87 130 115 61 68 49 122 44 133 75 85 21 76 74 116 28 157 112
3147A12r3K0N2m8Q5Mn1o2K5j3L30R1l68J63M22m44Q70m61K66J23o88L29P31j34J66q73m82
$$ 112 19 39 91 43 128 132 81 19 44 31 361 452 84 247 669 225 1095 634 900 1023 335 664 1395 1261 1427 554 72
2894G2M5Q4o2k4L6j26P3J47j08M2Pm7R8Q08K95q18M40p02j50O3r9M7kP3M8m2O03m6j76K103
$$ 72 117 201 139 115 151 25 98 245 137 179 186 139 237 1045 1340 522 962 260 110 173 74 121 119 192 240 198 801 755 579 2682
2612B682p13j399l83p9m7Pm0K0O6K5%p7kk6M7rO3K8q9J1m9K6M8j2R1r4NN8j23pO0N9j02M0
$$ 2682 1969 570 187 108 61 68 28 48 114 139 139 62 60 34 81 72 135 163 74 85 36 62 110 98 189 95 100 158 35 28 88 147 45 85
2293H5n2M5K7n0M3jM0K9l8l8%l6N2L3n2L5ol7m6J13m8%K8J65N13n91O11o12L99J066p71J6
$$ 85 33 78 105 55 98 97 137 166 128 90 90 54 106 139 87 122 116 79 33 146 98 98 126 291 804 213 824 212 611 1677 906 922
1992I22p45kJ05K52L05p54M87m06P6J016l68k64k39j42j08Q5j25R0j63L48j39j10J76J09k87
$$ 922 177 175 280 532 837 83 570 164 240 1256 888 624 385 243 135 220 95 185 22 370 231 121 297 406 119
1757A19K26l5k74K04Q6j36M8p6o8L4J24m9J55Q1m8k9j05OQ00K411J004o23K16L1716M039n693
$$ 119 345 310 36 240 326 190 238 162 94 128 252 203 358 439 391 362 257 263 1063 3474 4478 3855 4071 35787 39826 34133
1513C4133j725J4759L0078o2336q503j325j374P059k847j774J014n266O86K593K905K021p94
$$ 34133 32408 47167 77245 14909 6406 5081 3707 10766 7919 6145 7159 1893 2579 5172 8077 10098 9304
1354I304j918l655k499l85J413M012L163J74l652l593j954j40j8j25k3n7jJ06m9O9n2J8r0
$$ 9304 7386 3731 1232 847 2260 6272 9435 9609 5957 2364 410 270 252 127 104 47 46 152 103 172 120 138 48
1138D8J4N4MQnj18M2O3n6LN5kk6L1p8J7l0M2m9K23K9j75m6k6Q9p9J3P8o2K9l7J5nJ0O7Pq4
$$ 48 62 116 120 128 123 5 47 110 54 57 112 110 84 115 37 54 24 66 17 240 269 94 48 22 111 32 45 123 61 90 53 68 63 73 140 147 63
790F3M0Mlj8L4j1l1N0n6lmK9M5K6j5K9j34R5P3j29J00L1O77n1l51k22j75K14n6J62j38O8j5
$$ 63 103 107 104 86 120 109 78 128 72 69 65 94 139 165 150 179 45 140 213 84 184 215 892 841 490 268 93 307 251 413 275 343 328
480C28k5Q9L58N66J409J160m86K38n27O81l247l44J114R27N238J6086M61m41k0591j320m46
$$ 328 303 392 750 1316 2725 3885 3399 3637 3110 3791 544 200 1314 2241 7479 23565 24026 23585 2994 1674 1228
283A228k38N3n31K72k98r3N6j08M1L7Mj20n1n0N2p6J89j64J56j53k8o7Q0j3M0N2m8M6k21K5
$$ 1228 990 1043 512 784 486 393 449 341 382 419 423 303 252 202 254 178 367 203 359 206 178 111 191 178 218 270 222 268 47 72
2G2O8J42Lr8J3o1l4m8O1J46r3L6k8k3j45N9J6J91j07J20p6j20K6n6J00O1J03j26J9n7q1N1
$$ 72 140 282 285 187 200 139 105 57 118 264 171 207 179 156 11 70 86 277 170 290 214 94 120 64 164 225 328 202 221 164 83 134
-299A34J03j5K22j59p5k5j0NJ69m9
$$ 134 237 222 444 285 210 185 175 180 349 300
-393C00
##PAGE=	F1=-1604.17
##FIRST=	4405.4455391999963467,	4405.4455391999963467,	0
##DATA TABLE=	(F2++(Y..Y)), PROFILE
4405D59o2j7j60m1J50r1J94k4l4q8j2j52m0K28k6NM5p4j89Q6m4J18JO8l5q6k4j06J51l5J18
$$ 459 397 380 220 179 329 238 432 408 374 286 274 122 82 310 284 289 334 260 71 157 113 231 232 300 265 179 155 49 200 165 283
4114B83l9o5J1j14l3N9J69o8R3j88n4L3L4M7R8q3%q7l8L0J16r8J12m5l1l9l3l8R6L3K1L1o7
$$ 283 244 179 190 76 43 102 271 203 296 108 54 87 121 168 266 183 183 96 58 88 204 106 218 173 142 103 70 32 128 161 182 213 146
3804A46l4m9o2J54j7J1Q8j55l5j7M0P8K7lK3j25J01j07O8j9L4j6L9j04j2jJ32l4p4J22r7j6
$$ 146 112 63 1 155 138 149 237 82 47 30 70 148 175 172 195 70 171 64 132 113 147 131 170 66 54 53 185 151 77 199 102 86
3504H6j4P3n3N2L0p6M4j21rJ20Q7k11J74q3n7N8K0n0N6nj1N5n6n7M1j2Q1q2R0p9j0m8Q2NL0
$$ 86 72 145 92 144 174 98 142 21 12 132 219 8 182 99 42 100 120 70 126 121 110 165 109 52 93 81 162 80 170 91 81 33 115 120 150
3175A50j29J84q1j03M3O4o3J06nr6n7RK2L62K5k64P2M32m26P01l50L80L0o40J45R14lJ0q35
$$ 150 21 205 124 21 64 128 65 171 166 70 13 22 44 406 431 167 239 671 245 946 596 976 1006 366 511 1425 1422 1432 597
2903E97m58K5O2q1m7O1j36J07J56j07k1P6lL6O59M20q73P14r48r9O9j85J66j0N2qRO48M6j50
$$ 597 139 164 226 145 98 159 23 130 286 179 158 234 231 267 926 1346 473 1187 239 140 209 24 190 180 232 224 233 881 927 777
2621G77K088p20j461m88o6p1m0M8l2Q5Q4q1k1k0o0Q0K4N9j5j01M7o8N9L4QL4o9L3Lj43P3L6
$$ 777 2865 2145 684 196 130 59 19 67 35 120 204 123 102 82 22 102 126 185 170 69 116 48 107 141 149 183 114 147 150 7 80 116
2321A16N6j35Q1k5L8Jl4O3qL9j0l4l0J7p9J13J6l5L4l7k7l3J24n7M2Q8L7L38m98L10M71o34
$$ 116 172 37 118 93 131 132 98 161 153 192 182 148 118 135 56 169 185 150 184 147 120 87 211 154 196 284 321 659 161 471 942 308
2020C08J018j66J31r81p5N2L64Q64q84p9k58l3J065o8n42l92p8OK0r3P3j19K91o5j64K05P7
$$ 308 1326 1160 1291 310 235 287 651 1515 631 552 294 261 1326 1258 716 324 246 252 272 179 252 133 424 359 195 400 477
1767D77m32L75j8k36K48kn7N2q9m8J07J06j3K07L4l7o3j20qL47J039J542k927L343J1420j11
$$ 477 45 420 402 166 414 412 355 407 318 270 377 483 470 677 711 674 611 491 483 830 1869 3411 484 3827 15247 15136
1523A5136N6804J41n1506J3153k6070l307l05j239L424o52l76J645l746J943N884P891N472
$$ 15136 71940 72081 20575 33728 7658 4351 4046 2807 6231 5579 5203 6848 3102 5045 10929 18820 24292
1363B4292l173m877q649n449q09K082P909O476J358o132p914l935l92j99j77j69j15l2J60
$$ 24292 21119 16242 7593 2144 1335 3417 11326 17802 19160 13028 5114 1179 787 588 411 242 127 95 255
1185B55lN3n0J2j13ml3O4R0l1j19J4m2N2K6N1n0LM2r3r0M3R6m2J71O6j92p8L5LM3KM3p3j8
$$ 255 252 305 255 267 154 150 117 181 271 240 121 135 93 145 171 222 172 175 217 124 34 77 173 131 302 368 176 98 133 136 179 181 224 151 133
856A33l2M3L9L3L7mr7K1q9J48l3M0j2l0j2k3l3K1Q7O2J1o9K4j49M7K34j31N0j49P82l05j32
$$ 133 101 144 183 216 253 249 152 173 84 232 199 239 227 197 185 162 129 150 237 299 310 241 265 116 163 397 266 316 167 949 644 512
556E12j44r1K20n1J60j95L8P6p4J65K13M22l45J996j153J491j607J459k548P09J389J835J0322
$$ 512 368 277 497 446 606 411 449 525 451 616 829 1251 906 2902 1749 3240 1633 3092 544 1253 2642 4477 14799
340A4799L2201j18m9m0611k746j055n85rr19L69m72q5O1r4O0p1m6j62q8k7Q8o5K43k39R8j91
$$ 14799 47000 46882 46833 6222 3476 2421 1836 1827 908 1277 805 720 781 687 747 676 630 468 380 353 441 376 619 380 478 287
95B87n5mJ37j2L5J2j36N1k56J02R8J89n4j17l7j13j9N1R2J41j34K0m9j01m2K4J24J66j39P1
$$ 287 232 228 365 353 388 400 264 315 59 161 259 448 394 277 240 127 108 159 251 392 258 278 229 128 86 110 234 400 261 332
-186C32r2j59LP7J40P4J0j15j07nm8J35J26j2J89k33j28j1O9K8J94j4
$$ 332 240 81 84 161 301 375 385 270 163 158 110 245 371 359 548 315 187 176 245 273 467 453
-393D53
##PAGE=	F1=-1622.95
##FIRST=	4405.4455391999963467,	4405.4455391999963467,	0
##DATA TABLE=	(F2++(Y..Y)), PROFILE
4405E22j12l9j36j8K26r1K16j10o1j03o5l1j6K36n4m1J2j01j46P5L8J33m2M4q7j15J1n1K07
$$ 522 410 371 235 217 443 352 568 458 397 294 229 198 182 418 364 323 335 234 88 163 201 334 292 336 249 134 145 94 301
4133C01p7R7n8j01Mj14P7L5J79j40J23k45p0K5J29P3N2p3l9j23k9L2J66n8Q2o5l9q2NL2Q0
$$ 301 224 321 263 162 166 52 129 164 343 203 326 81 11 36 165 238 290 217 178 55 26 58 224 166 248 183 144 62 67 99 179
3842A79QJ9j8l1j04M3m0J42k3pN8j76j5K7M1Q7Pk3lq4M0k8Q1l5L7p2N9q6m5nJ86k7q3P3r0
$$ 179 187 206 188 157 53 96 56 198 175 168 226 50 35 62 103 190 197 174 171 87 127 99 180 145 182 110 169 83 38 33 219 192 109 182 92
3513I2j0j4J08n0L8Lp7%q6L0J12R0k06J41o9p4K0Q2l3O0l5k0M9o0n5P7J0M6r9R6q7k9L1N2
$$ 92 82 68 176 126 164 167 90 90 4 34 146 236 30 171 102 28 48 130 97 157 122 102 151 91 36 113 123 169 70 166 79 50 81 133
3194A33J1J4j36J77r2o1L8P1p8Q9kj19k5J0N9L05Nk33J06M56m35N76l40M53o5m90p9J024J29
$$ 133 144 158 22 199 107 46 84 155 77 166 164 45 20 30 89 394 399 166 272 728 293 869 529 982 917 427 348 1372 1501
2922A501n2q65l93m1M7r5m9Q3j21J41J10r3m2J54Q0PO21J60q32R59j018r5M2j51J68j0l7j1
$$ 1501 1449 584 191 150 197 102 53 136 15 156 266 173 131 285 365 372 993 1153 321 1280 262 167 209 58 226 216 179 168
2659A68J94M89K14j11K573p49k080m80p4r0RJ9n2P4J02j16%m0j4O7OO7l8r8N0o8Q3M2j7J1
$$ 168 362 851 1065 954 3527 2778 698 218 144 54 63 82 30 104 206 90 90 50 36 103 109 176 138 40 90 22 105 147 130 141
2377A41m2J9Kr5O3J5M5j17N1J6J0Rm5J07m8L0j8m6k4O0q9J15%j6J8n0k2m2J50p6J11J02o2
$$ 141 99 118 120 25 88 103 148 31 82 98 108 117 72 179 131 161 143 97 73 133 44 159 159 143 161 111 89 47 197 121 232 334 272
2067B72R7k90L09J346j025j26P24L5j041j36K21M76J068j133l20j37o8R75Jn82m23n7N2l4
$$ 272 369 79 388 1734 709 583 1307 1342 301 165 386 862 1930 797 477 340 272 1247 1248 666 243 186 238 204
1842B04n0K5k2K07p5q6J35J1l14L45q7j60K74n0l9L6j00m0J66J11NJ39Jo2j03JK98P74q7K53
$$ 204 154 179 157 364 289 203 338 349 35 380 293 133 407 357 318 354 254 214 380 491 496 635 636 574 471 472 770 1544 1457 1710
1560A710O60J20O715J887N0245M894n9601N388q701l91o80K08L9O98L03K742j880L353R728
$$ 1710 2370 2490 9205 11092 61337 66231 6630 12018 3317 2926 2246 2454 2493 3191 3494 6236 4356 7709 17437
1382A7437J4562J0501n504q753j5625r380j550K488J2271J0116K140p947j2753o129o12l37
$$ 17437 31999 42500 36996 28243 12618 3238 1688 4176 16447 26563 28703 20756 8003 1874 1262 925
1232I25j79k75k10j42J72O9N5MOj39r4o8J08J59l3r7%o8L4K5N0m3L4O4j41r3N0R1J2J34K1
$$ 925 746 471 261 119 291 360 415 419 425 286 192 124 232 391 358 261 261 193 227 252 302 259 293 357 216 123 173 264 276 410 431
941D31j57r1N6m6J14MK4p8k9kK8N4N0Njp6j3p9J62l6L6K0k4o2Nn0N5Q6Q6Jr3Oj26N6K77j21
$$ 431 274 183 239 193 307 311 335 257 228 226 254 308 358 363 362 286 273 194 356 320 356 376 352 290 295 245 300 386 472 473 380 386 260 316 593 472
602D72J8j68P61o81K14p6n3K23m2J57k33M2J36j02K16N7K81K7J325m02N20j089L41j01O37
$$ 472 490 322 1083 402 616 540 487 710 668 825 592 634 770 668 884 941 1222 1249 2574 2172 2692 1603 1944 1843 2480
368B480J677K930J6170N0434j076M37o2954m554j760j028j01j327M81o26p5M5j00O2j92q4
$$ 2480 4157 7087 23257 73691 72615 73052 10098 5544 3784 2756 2655 1328 1809 1183 1108 1153 1053 1115 923 839
180H39k03q6JJ01p1K59l00L2k01m4M7J55mJl1k13M4j92J87M7K09j00j32j03j37Q4Q4R7J23
$$ 839 636 550 551 652 581 840 540 572 371 327 374 529 525 526 495 282 326 134 321 368 577 477 345 242 105 189 273 370 493
-92D93j70k3p9j06R6J8J34J23j88J5j18o2M6R4J40N6p5j28j98J02N7J45J13l9J23k87j17N1
$$ 493 323 300 221 115 211 229 363 486 298 313 195 133 179 273 413 469 394 266 68 170 227 372 485 446 569 282 165 216
-355B16J51M8J53n
$$ 216 367 415 568 563
-393E63
##PAGE=	F1=-1641.73
##FIRST=	4405.4455391999963467,	4405.4455391999963467,	0
##DATA TABLE=	(F2++(Y..Y)), PROFILE
4405E31j63m5o0L2K50j05K10j88p8j28q6J12J4J89p7p9l9j06m6P3O1J33q1Oj34j15P9j0K35
$$ 531 368 323 263 295 545 440 650 462 384 256 170 282 296 485 408 329 290 184 138 211 272 405 324 330 196 81 160 150 385
4133C85j16N6q1j02j5l6J15QJ78k06J24k77L4NJ37Q4Lp0q5j03K1N9J11lL0q9n1j04Q4P0O8
$$ 385 269 325 244 142 127 91 206 214 392 186 310 33 67 72 209 293 296 226 141 38 59 118 229 226 256 167 116 12 96 166 234
3842B34l6J3o7j0j15J25j6J03l9j7Mj68M7Q0mP9Mo8k0k8k7P0P7m7J8j15O3k2or6K32m6q1L1
$$ 234 198 211 144 134 19 144 128 231 192 175 179 11 58 138 134 213 217 149 129 101 74 144 221 174 192 77 140 118 112 16 248 202 121 152
3523A52r6N5j3J02m3J3k4r6k5J2N8O1Q7j72P0o8l6j1J26l6O5p9k7L0j0k6P1J4Lj18R1n4m4
$$ 152 56 111 98 200 157 170 146 50 25 37 95 156 243 71 141 73 37 26 152 116 181 102 75 105 95 69 140 154 157 39 130 76 32
3213C2J18j7K5j4j33J43n1j9L9N2q0L2J9r8K6k2Q3K09nk29J93M64m00N66m19L62j26k38l02
$$ 32 150 133 158 144 11 154 103 84 123 175 95 127 146 48 74 52 135 344 339 110 303 767 367 933 514 876 750 512 210
2941B10J072K35l8r45k97j43M6j03kO9m3J17L9p8k3K75J03rP19l73o96J092r20j11j2l6R3
$$ 210 1282 1517 1479 534 237 94 140 37 35 104 61 178 217 139 116 391 494 485 1204 831 135 1227 307 196 184 148 241
2687B41J8j98N4M02K92L23M8K645o35k537m20p0o3k0J4j1kP7r7k1j9L9O9q9Q7l6n9oL5K2P4
$$ 241 259 61 115 517 809 1132 1180 3825 3190 653 233 163 100 80 94 83 81 158 61 40 21 60 129 40 127 91 32 26 61 83 157
2396A57o8nk9j5P9m2K4LNr1j3O6l8R4j06J55j02kK8r7L6Q2k7K2m1K1j5J3j7j1J00r6J40P0
$$ 157 89 84 55 40 119 77 101 104 109 18 5 71 33 127 21 176 74 72 100 3 39 121 94 116 75 96 81 94 77 66 166 70 210 280
2077B80R3J84l42O57J338j058n58O70k06q34j93M80M33R91j373k60J5r5P50r0l89l57p2N8
$$ 280 373 557 215 872 2210 1152 594 1264 1058 224 31 511 944 1935 562 302 317 222 972 882 493 136 64 122
1851A22o7O0p7N3J19q0nK7Rl4O2j19l7K12q5K1K3j51l4J60R0lN2L9p0j89J15M13O87J84o07
$$ 122 55 115 38 91 210 130 125 152 161 127 189 70 33 245 160 181 204 53 19 179 269 266 318 357 287 98 213 626 1313 1497 890
1560H90K021j792K0556L648l913Q618q681J4324k9518l146j957J048j855J182L2M040M4M637
$$ 890 2911 1119 21675 25323 21410 30028 21347 35671 6153 3007 1050 2098 243 1425 1457 5497 5541 10178
1391A0178J3256K1244J6108p146j2635k3237j3475k416K756J6353J3489J906r103j6896q039
$$ 10178 23434 44678 60786 53640 41005 17768 4293 1877 4633 20986 34475 36381 27278 10382 2343
1250B343p29l93j46l28k62k17P0J22Q1O4mj41j72n2O8K06k2p5J2j13K2NL5%O5N3j63q4L5P2
$$ 2343 1614 1221 1075 747 485 268 338 460 541 605 601 460 288 236 304 510 488 413 425 312 334 339 374 374 439 492 329 245 280 352
969C52O7R8m0r2r4N0m7J12K3J6p6l1K2kO5N3qRm5n9m3J32k8L2N8k1r1K1p7R3P1J08Jj03j2
$$ 352 419 517 477 385 291 341 294 406 429 445 369 338 360 358 423 476 468 477 432 373 330 462 434 466 524 503 412 433 356 449 520 628 629 526 514
640E14r8O7K82r8j4j18P53j128O54j18j4K22k4J50k42O2J62j07K54m4J94R14J48N82q05Q57
$$ 514 416 483 765 667 653 535 1288 160 814 696 682 904 880 1030 788 850 1012 905 1159 1115 1309 2223 2371 2953 2148 3005
396C005j813J709P00J952M004K1711O7734k362J016q3777o355k432j462k09j670N81p50p9
$$ 3005 1192 2901 3601 5553 9557 31268 99002 96640 97656 13879 7524 5092 3630 3421 1751 2332 1582 1503
227A503J2j20N1k86j09k27o4KJ01r4K56l40rj85j7N2J42J5m3o7k27Nj06K35j0K00j33j29j47
$$ 1503 1515 1395 1446 1160 1051 824 760 762 863 769 1025 685 676 491 474 526 668 683 640 573 346 351 245 480 470 670 537 408 261
-45B61j00J57O1R6Q5j78q6r7rJ49PJ15Q4k43l9j54J04P7Q7J10K4j36j56j83J86J19J28R4q3
$$ 261 161 318 379 475 560 382 296 199 190 339 346 461 545 302 263 109 213 290 377 487 511 375 219 36 222 341 469 563 480
-318D80N1l22m4J21J99M2J07j9
$$ 480 531 209 165 286 485 527 634 615
-393F15
##PAGE=	F1=-1660.51
##FIRST=	4405.4455391999963467,	4405.4455391999963467,	0
##DATA TABLE=	(F2++(Y..Y)), PROFILE
4405E17k04m8K7O9K47j03J89k43q2j75o9K19M6J31r0r6r4j08N2Q2O0J25j02l8j75q2J29K1
$$ 517 313 265 292 361 608 505 694 451 369 194 125 344 390 521 431 335 241 133 185 267 327 452 350 312 137 55 184 205
4143B05K33j26Qj03q0l3L9J21pJ68k39Q9k58R5L0J01R9m4o7j28j6J4R7L7M2j2j20n2o2J10
$$ 205 438 312 320 217 137 104 143 264 257 425 186 275 17 112 142 243 342 298 231 103 87 101 198 235 277 265 145 93 31 141
3861A41P5O7o6j0r1Kl7J00K2M9m6op0j00O8J06m0O4Rj07j7jm6J20O8m7j0j31N1L6K8j15K05
$$ 141 216 283 217 207 116 118 81 181 203 252 206 200 130 30 98 204 164 228 237 130 113 112 66 186 254 207 197 66 117 153 181 66 271
3551B71o6p1jj13J35j9Q7l4kn5j16L2J8R0J9O7j18Kr3L5L0R1n4P0j05l2j3O4MN0J3k4j20M4
$$ 271 205 134 133 20 155 136 223 189 187 132 16 48 66 156 175 242 124 126 33 68 98 189 135 205 100 68 55 119 123 173 186 162 42 86
3232H6J2k7J46q3M7m6r4N7L1j2N2K8o7n0O1m9L3m4J04J01m2j31J86M55k87N94l74Kj36M2m77
$$ 86 98 71 217 134 181 135 41 98 129 117 169 197 130 80 141 92 125 81 185 286 244 113 299 754 467 1061 687 689 553 595 118
2941A18J083K90lj009k01k52Q4q6O6PJ7R3j8p8rM45L5k2Q68q82m33R77p47j25n8P4J9P0k23
$$ 118 1201 1491 1488 479 278 26 110 24 90 97 114 207 189 111 102 547 582 560 1428 546 113 1090 343 218 160 234 253 323 100
2668A00L8M93K02K85M35J883l96k405m07l6k1r7N9L3r0J0no3P5K0P2j26K4J0om1Q4l0R2n6
$$ 100 138 631 833 1118 1553 3436 3040 635 228 192 171 74 133 166 76 86 81 18 93 113 185 59 83 93 87 46 130 100 192 136
2387A36o3l1J3J07k5J0J3l4m4J1m2RJ30q0Q0q4n8P5j1L7KL0o0p3L7l9J27j2K9K1o9M1k0N33
$$ 136 73 42 55 162 137 147 160 126 82 93 51 60 190 110 190 106 48 123 112 149 151 181 121 48 85 46 173 161 190 211 142 183 163 696
2067F96K74o52R16J094q95j38j91n21l82l6M14K53O31j200M2m4j20M31j92o5j81J4j01Q0P0
$$ 696 970 318 1234 2328 1433 1295 1104 583 201 165 579 832 1463 263 305 261 141 572 380 315 134 148 47 127 197
1833A97n8l4o6J15q8L5J14J6j31N0P8j64J3J71J4o8P1j39p7R4M4J85k7k6j42N5K51O99L8O37
$$ 197 139 105 39 154 66 101 215 231 100 150 228 64 77 248 262 194 265 126 49 143 187 372 345 319 177 232 483 1182 1220 1857
1551A857o39J9432L172l308k127K098J4148k8512l604j487N03l67j8o18M231J728N568J5676
$$ 1857 1218 20650 23822 20514 18387 20485 34633 6121 2517 1030 1533 1166 1148 530 4761 6489 12057 27733
1382B7733K6173K0957p603j5624k9761j6767l157L114J9507J6068M93j0029j9408r206p22
$$ 27733 53906 74863 67260 51636 21875 5108 1951 5065 24572 40640 41133 31104 11696 2490 1768
1241A768l72r2l32k74k63j3J19J08J02pj33j99n0K6K12pn9L5j62K2j0MN2Q6K4j54q0J1O2J03
$$ 1768 1396 1304 972 698 435 422 541 649 751 744 611 412 362 388 600 593 534 569 407 429 419 423 475 561 585 431 351 362 424 527
959E27M9n7m0j00L7k8P6N0J1o9l2M3l5P0N0rK2j5j05oR4k0L3Q6j7j01K2j00J23N3J21J3j05
$$ 527 576 519 479 379 416 388 464 514 525 456 424 467 432 502 552 543 565 550 445 439 533 513 546 632 615 514 536 436 559 612 733 746 641
649F41k5p9P7K59o1m1m2P31j411R72k36K8K30JJ26k21Q2J57q1K70o2J69J024o97J214j420
$$ 641 616 537 614 873 812 771 729 1460 49 1021 785 813 1043 1044 1170 949 1031 1188 1107 1377 1315 1484 2508 1811 3025 1605
405A605K091k070J872R04K139M833K5814Q0829l805J614r9049p751k935j782l14j889O42q36
$$ 1605 3696 1626 3498 4402 6541 11374 37188 118017 114212 115826 16777 9026 6091 4309 3995 2106 2748 1912
236A912r4j9j38L7l39j25k36m3j8J00j12K37l52k7j61%L5J09M4p5r7j83n5n1K53m1J71j48
$$ 1912 1818 1799 1661 1698 1359 1234 998 955 937 1037 925 1162 810 783 622 622 657 766 810 735 638 455 400 349 602 561 732 584
-27E84j08j57p5J95K1J06L6j52j45r7P1J64LQ8O1k80q3j78K20R7R4P3j1j63j83o8J64J50J06
$$ 584 476 319 244 439 460 566 602 450 305 208 279 443 446 534 595 315 232 54 274 371 465 538 527 364 181 113 277 427 533
-299E33Q5j25j7l42L8J72K22L6P2l5
$$ 533 618 493 476 134 172 344 566 602 674 639
-393F39
##PAGE=	F1=-1679.29
##FIRST=	4405.4455391999963467,	4405.4455391999963467,	0
##DATA TABLE=	(F2++(Y..Y)), PROFILE
4405E12k29n8Q2R2K28p3J63k65p9k39k9K68Q1P8q6q9j37j18J07R1O8J10j00p7j97n8J47N6
$$ 512 283 225 307 399 627 554 717 452 373 134 105 373 454 532 446 357 220 102 209 300 368 478 378 301 104 46 193 249
4143B49K07j02l1j16o7l9P3J25j5J62k35K9j95P9P2O5J20q3n7j46K8lJ42j7O6l0j46l8m7J25
$$ 249 456 354 323 207 140 101 174 299 284 446 211 240 45 124 196 261 381 298 241 95 123 120 262 245 311 281 135 97 50 175
3861A75O4P4o8l8q7MqP9P2ol7J1j32m9P2J19o0N4J4j14j0j7j2J14N9l4l6j25M0M9N6j11J70
$$ 175 239 313 245 207 120 124 116 195 267 261 224 235 103 54 126 245 185 239 253 139 129 112 100 214 273 239 203 78 118 167 223 112 282
3551B82p0n9k6r0J42j8Q0k8Jq9o5K7rJ19LL5p1k5j17O4O2P3o8P0j01l0n6R8K8L3K3l0j23o
$$ 282 212 153 127 37 179 161 241 213 214 125 60 87 78 197 200 235 164 139 22 86 148 221 153 223 122 92 36 134 162 195 218 188 65 59
3232E9N8j0J53j18O6o6p9LQ7k1O7K0n9j04J00k7K6n1J22K1j09P1M2M38j22N66j77m03p5J62
$$ 59 117 107 260 142 208 142 63 66 153 132 199 219 160 56 156 129 155 104 226 247 138 209 251 689 567 1133 956 553 478 640
2950F40n65J068K76Qr85j37k78J06q6Q3j7M0Q0l1q5m8O36r9j0R62j079l03P99o23j30o9J36
$$ 640 75 1143 1419 1427 442 305 27 133 47 130 113 153 233 202 117 69 705 606 596 1558 479 176 975 352 222 153 289
2696B89k8J28j58l0M61K25J50R10N15j23j654m93K4jj64J27N3j51o3Q7m1P8K0P1r8n1M5nk3
$$ 289 261 389 231 201 662 887 1037 1947 2462 2339 685 192 216 215 51 178 231 80 17 104 63 141 161 232 134 83 128 123 100
2424A00P6l2Q0pj25j9N1P4k1J2K3m3m1K5j00P3J22o2K7l8n4L4L8M1m7N7q2m0pmJ28rM8jo7
$$ 100 176 144 224 217 92 73 124 198 177 189 212 169 128 153 53 126 248 186 213 175 121 155 193 234 187 244 162 122 115 111 239 230 278 277 210
2095B10k2p8Q81K15r66J064P68m85J64p28o17j79O0K60jJ23O6j59l91j21J25NK81j71l0j15
$$ 210 188 110 991 1206 240 1304 2072 1587 1751 1023 406 227 287 547 546 669 735 576 185 64 189 194 475 304 274 159
1851A59P6L3l0k9o8Q7p2Q7O5jJ5m4Q8j98P2J38J1n5J10j04m1P9O5J29l1K3r9o4J45M91NJ8
$$ 159 235 268 238 209 141 228 156 243 308 307 322 278 366 168 240 378 389 334 444 340 299 378 443 572 541 564 465 401 546 1037 1042 1060
1551A060M33Q175J571L1745k576l1445P461j3201k205l24J36M75Q4L65K351K904N995J6540
$$ 1060 1493 9668 11239 42984 40408 8963 16424 3223 1018 694 830 1305 1389 1754 4105 7009 13004 29544
1382B9544K8111K3570o842j6920l3529j8408l535L517K1296J7620j389j1216k0054r467o13
$$ 29544 57655 81225 74383 57463 23934 5526 1991 5508 26804 44424 43035 31819 11765 2298 1685
1241A685k95k7k98k53k85n5Q7J22J20jj20j97o4J4J88Mm2N7k01K5j2k8R6R3oj29p9j7O5J25
$$ 1685 1390 1363 1065 812 527 472 559 681 801 800 680 483 419 433 621 625 583 640 439 464 452 424 520 613 607 478 399 382 447 572
959E72j5j0k2j14K4lL7P9Jn7l6N8o3P0N3qL4Oj41K2O7k0M3R9j4r5Qj11J40M0J23K9r9l7p0
$$ 572 557 547 525 411 435 432 469 548 549 492 456 514 451 521 574 566 600 606 465 487 554 534 577 676 662 567 575 464 604 644 767 796 697 660 590
631E90Q6K17j2n2L2O14j282R44l54O8K52K5Q0j79R2J30l0K60jJ94P97j130J398j194K048r95
$$ 590 676 893 881 829 861 1475 193 1137 783 851 1103 1128 1208 1029 1121 1251 1221 1481 1480 1674 2471 1341 2739 1545 3593 2598
387B598J036J123K166N244K7617Q7121n141K050j05655q422l170j916l98j949O49q69j07l2
$$ 2598 3634 4757 6923 12167 39784 126905 121764 123814 18159 9737 6567 4651 4253 2304 2953 2084 1977 1945
217A945j46K3l52j41k27l1m3J07j12K03l39l6j39MK3O8P6q7j26j23j09k1K48l6J31j48q6j55
$$ 1945 1799 1822 1470 1329 1102 1071 1028 1135 1023 1226 887 851 712 716 739 807 883 796 670 547 438 417 665 629 760 612 526 371
-45C71p6K23j6J27qj09j83r3R5J72J0O6N4k91j05j38J98J13J17M6m3j61j93k6J57J70R2Q9
$$ 371 295 518 502 629 621 512 329 236 331 503 513 579 633 342 237 99 297 410 527 573 530 369 176 150 307 477 569 658
-308F58j47p4l47P9K08K28M2N3m2
$$ 658 511 437 90 169 377 605 647 700 658
-393F58
##PAGE=	F1=-1698.07
##FIRST=	4405.4455391999963467,	4405.4455391999963467,	0
##DATA TABLE=	(F2++(Y..Y)), PROFILE
4405E17k34o1R1R7J96k3J35k62o7k96J2K69J07L7o9o7j63j24J18Q6R1R0q3j06j92p4J53R6
$$ 517 283 222 313 410 606 583 718 456 389 93 105 374 481 518 449 382 219 95 213 299 390 480 397 291 99 25 178 274
4143B74J65n9n4j17p7l2P7J31k4J62k13k2j67N8J22L2J38j06m0j39K1j8J83n0P5l2j52k9o8
$$ 274 439 380 326 209 132 100 177 308 284 446 233 211 44 102 224 256 394 288 248 109 130 112 295 245 320 288 136 107 39
3870C9J43N2Q0m8o0p0j0oO4J19m7k4K1j60l6P4J19o8N7J7r6k5l7K2R5N7j7n8j12L7L2P7r3
$$ 39 182 234 314 266 206 136 126 120 184 303 256 232 253 93 57 131 250 182 239 256 160 135 98 120 215 272 255 197 85 122 154 231 138
3560A38J35n9m8m9n9J11oQ3l0J5j24j4Kk4J37OLm5j3j22M6Q4O3p3O4q0l0o1P2N0K5L8k7j43
$$ 138 273 214 166 117 58 169 163 246 216 231 107 93 95 71 208 214 217 172 159 37 83 167 230 157 221 141 111 50 122 172 197 235 208 65
3241F5qN8QJ44j22P6p7q0JQ7k8P3L1o4j11J18l2J6m4J27j1p8J39j19M25L7M59P9n72QJ7n48
$$ 65 57 115 123 267 145 221 144 64 65 152 124 197 228 164 53 171 139 155 111 238 227 149 288 169 594 631 1090 1169 597 605 622 74
2941G4J001K10k9q43j03k56J03j21J01rM1P1k1p0j09P84k60N3R21j069k81P48o07j23n9J54
$$ 74 1075 1285 1256 413 310 54 157 36 137 128 169 240 219 149 40 824 564 617 1538 469 188 936 329 206 147 301
2696C01m7J79j19n7L52K92J2J252p96Q9o99o35R4qj94J87N4j88l8O1j1O7L6O0p6p6N0j6nO0
$$ 301 254 433 314 257 609 901 913 2165 1369 1458 759 124 218 210 16 203 257 69 31 92 81 148 184 244 168 92 142 126 121 181
2415A81j0N6L8j82PO0N1k1J9K4m3m1K3j15R8J26n6kro1LP7M3p9P0q5k3l6K1J10%N3qp3k5Q
$$ 181 171 227 265 83 90 150 201 180 199 223 180 139 162 47 145 271 215 213 204 143 146 223 266 187 257 172 149 113 134 244 244 297 289 216 191 199
2077A99Q92J28j177J041M92J20K54p99l64n69J18R2k54N45M52l61p29o3O2K42N40l70j81j08
$$ 199 1091 1219 42 1083 1575 1695 1949 1150 786 217 335 427 173 718 1170 809 80 17 79 321 861 491 310 202
1851B02M6J2Kom0j8K6M9PN3R5j41J07j80O3J14Mo0J48p1j6O5M7P7m2M0mJ15L39Q8o46J587
$$ 202 248 260 262 256 216 198 224 273 280 333 428 287 394 214 277 391 395 335 483 412 396 461 508 585 543 583 579 694 1033 1121 475 2062
1551B062r17M180j721L5918m53l3977J668o177K00j49l83O83L29J017J280L409N860J5895
$$ 2062 1145 5325 3604 39522 39069 5092 6760 583 783 634 251 934 1263 2280 3560 6969 12829 28724
1382B8724K6855K2795n428j6101l3443j7917l409L453K1401J8175k269j2452j9401r107m80
$$ 28724 55579 78374 72946 56845 23402 5485 2076 5529 26930 45105 42836 30384 10983 1876 1396
1241A396j90M9k44k23k80p9O0J21J31Pj04j83q3L4J50J0k5P4k27K2Nn0J23Q9k8j04p5m5P5
$$ 1396 1206 1255 1011 788 508 429 489 610 741 748 644 461 378 412 562 572 547 621 394 416 421 371 494 583 555 451 376 331 406
969D06J47j00R6l8j33J3K7MJ08j7m6m4P0q1P0O0j1M7J3j64L8O2l0O0R5j3q1j6j03J45L3J13
$$ 406 553 453 549 511 378 391 418 422 530 513 467 423 493 412 482 542 531 578 591 427 465 527 497 557 652 639 558 542 439 584 617 730
668G30M4r3m7o7R7J62M0m0Q1L68j005Q22l95J01K81L8J5j27Q9R1L6K22J03K40N85r24R47m01
$$ 730 774 681 634 567 664 826 866 826 907 1275 270 1092 697 798 1079 1117 1132 1005 1094 1185 1221 1443 1546 1786 2371 1447 2394 1993
405A993R98L60M5J244J999N165K6793Q5452o085K074j02316q208l095j845m43j850O03q36
$$ 1993 2991 3351 3396 4640 6639 11804 38597 124049 117964 120038 17722 9514 6419 4574 4131 2281 2884 2048
236B048j15j4j45J4l36j58j97l1n3J20r8J61l11m2j17%K6K6J02q5j49p2j47PK24nQ6j38o8
$$ 2048 1933 1919 1774 1788 1452 1294 1097 1066 1013 1133 1035 1196 885 843 726 726 752 778 880 795 646 574 427 434 658 653 739 601 533
-36E33j53q7K40l5J44l6o7k05r0Q8J77K5N3N2k86j12j13J55J22J44L3o7j46j90l4J58J86Q5
$$ 533 380 293 533 498 642 606 539 334 244 332 509 534 587 639 353 241 128 283 405 549 582 515 369 179 145 303 489 574
-299E74R9j48j14l25Q2K18K16N9M2l7
$$ 574 673 525 411 86 168 386 602 661 703 666
-393F66
##PAGE=	F1=-1716.85
##FIRST=	4405.4455391999963467,	4405.4455391999963467,	0
##DATA TABLE=	(F2++(Y..Y)), PROFILE
4405E20k22m4O2Q0J54K8J10k42m2l16L0K35J15Mm1l5j79j11J00N7J23O2n1j23j76n0R6J29
$$ 520 298 254 316 396 550 578 688 446 404 88 118 353 468 472 431 396 217 106 206 263 386 448 397 274 98 48 144 273
4143B73J19j2o6j03j00k0O9J32m0J66j81n1j66L4J70NJ45j13j6j16k0k9K16p5Q4l4j29l7r7
$$ 273 392 380 314 211 111 91 160 292 252 418 237 186 20 54 224 229 374 261 245 129 109 80 296 221 305 271 142 105 8
3870HJ53M2Q0j2p6m8m1j1O1J49o4k5K8j56m6P3J08p3P5J9p3n5l9L9P3O1np6p1J6MR0p1J08
$$ 8 161 203 283 271 195 147 106 95 156 305 241 216 244 88 42 115 223 150 225 244 171 116 77 116 189 250 245 169 98 114 118 208 137 245
3551B45m4l7o3l9O4K0Q5m1M2j50K1k4l0J37K4k2l9K2j34K6R0N6o4N2n4k9n3K5O1L5M9l1j52
$$ 245 201 164 101 62 126 146 231 190 232 82 103 79 49 186 210 188 149 171 37 63 153 209 145 197 143 114 61 86 147 182 231 200 48
3241D8J8K6K5J20j07Q0q4q1K2N8k6O7N3p7r2J25n4Ok7J13j2P1M0k06L86J33K97L40n52M7k24
$$ 48 66 92 117 237 130 210 126 45 67 125 99 166 219 142 50 175 121 127 100 213 201 272 312 106 492 625 922 1262 710 757 533
2950E33m05Q46J17j24n95q1k20Q0j40J00K1L2N3lk6j11P98m00J78P16j089l6O84o56r7n1J51
$$ 533 128 974 1091 967 372 291 71 151 11 111 132 164 217 214 188 77 875 475 653 1369 280 244 928 272 175 124 275
2696B75m9K20j13m1K12L59r7J305r94K57n19p53J35l9j23J61N1j86lj3L0M2O3M0o6o9M7l4
$$ 275 226 446 333 292 504 863 766 2071 1077 1334 815 62 197 158 35 196 247 61 58 45 75 117 180 220 154 85 132 98
2434I8J1L5K7K5O8k09M0L9L6k5L1J3l5l7Mj00R1J46o5q%p4j2R9M3r4P3q5j2n5L9P6K3M0j8
$$ 98 109 144 171 196 264 55 95 134 170 145 176 189 154 117 121 21 112 258 193 185 185 111 99 198 241 147 220 135 123 68 107 183 206 246 228
2105B28o4lJ06O63J77r83N76O44M55J55n82k84r11J42l4j25J300j97l55q16l5N6K57P86n50
$$ 228 164 161 267 930 1107 124 700 1344 1799 1954 1372 1088 177 319 285 160 1460 1263 908 92 57 113 370 1156 606
1870F06l66p4PMN3j7j1r5J21l9l3J40R4j76R5j69O4Q2mo4J77o3lM1KL9m1M6P6K04K69m5n69
$$ 606 240 166 173 177 230 213 202 107 228 189 156 296 390 214 309 140 204 286 282 218 395 332 329 370 372 411 370 416 492 696 965 920 351
1560C51K049j714J1970p35N893J351n533O412j7103q78n70r35j0M17J192R35L260N217J4252
$$ 351 2400 686 12656 11921 17814 19165 13632 20044 2941 2063 1493 558 548 965 2157 3092 6352 11569 25821
1382B5821K3383J8352m416j3389k9384j5335k759K354J9489J7783q40j2378j8362q664n41
$$ 25821 49204 67556 63140 49751 20367 5032 2273 4627 24116 41899 41059 28681 10319 1655 1114
1241A114j46R8k07k13k51j11P6J12J31J2r1j69j00Q4J12J1j4Q3k40J3M0m8J16P9l7r1o5o0
$$ 1114 968 1066 859 646 395 284 360 472 603 615 524 355 255 339 451 462 448 531 291 304 344 296 412 491 454 363 298 238
978B38Q1J80j95K24p8j52MO3j8J30m1m0n2P5q4P4O6k1N8Oj71M1Q0m7Q0P8k0o4m2p7J41L1R2
$$ 238 319 499 304 528 450 298 302 365 347 477 436 396 344 419 335 409 475 454 512 518 347 388 468 421 501 579 559 495 453 376 517 548 640
668F40N3q8n7o2J08J03Q4qR9K7n64N45l22J28K94L8n3p7P6N1R6J65K08K73L52m50K46M09j51
$$ 640 693 605 548 486 594 697 781 773 872 899 335 880 558 686 980 1018 965 888 964 1015 1111 1276 1484 1757 2109 1659 1905 2314 2163
396B163J393o90J244J680M652K3673P6617o394J427r0165p163k739j604m35j620N10p36j17
$$ 2163 3556 2866 4110 5790 10442 34115 110732 104338 105765 15600 8437 5698 4094 3659 2039 2549 1813 1696
227A696L2j38J1l01j69j47m8m2J37q3J25k77m1r7rM5j4J21q0j54l9j70M2J84L5M6j21n4j55
$$ 1696 1728 1590 1601 1300 1131 984 936 894 1031 948 1073 796 755 658 649 694 680 801 721 567 528 358 400 584 619 665 544 490 335
-45C35r4K42l3J46m5k8k20q2O6J74M0M8N1k72j04j10J27J20J62L0p9j24j76o2J58J91Q1J11
$$ 335 241 483 450 596 551 523 303 221 287 461 501 549 600 328 224 114 241 361 523 553 474 350 174 112 270 461 542 653
-308F53j33j39k65P2J87J89P0M0k8
$$ 653 520 381 116 188 375 564 634 674 646
-393F46
##PAGE=	F1=-1735.63
##FIRST=	4405.4455391999963467,	4405.4455391999963467,	0
##DATA TABLE=	(F2++(Y..Y)), PROFILE
4405E24j99k0J3L8J12P3R7k08qk98J0J80J06j3oLj88q6O6OJ57K8kj24j58J2j5J46Q0L1o7p5
$$ 524 325 305 318 356 468 541 638 430 422 124 134 314 420 407 401 404 216 130 196 202 359 387 385 261 103 115 100 246 326 357 290 215
4105B15j18j9N2J23n3J69j30o8j29k3J79j2J43j01J1q3q9l1K30r1J03m1q1n7n5P2L6Q2L0q4
$$ 215 97 78 130 253 200 369 239 171 42 19 198 186 329 228 239 156 67 36 266 175 278 237 156 99 44 116 152 234 264 180
3823A80k3q4k0O5J56m4m9M0j19q6O7R0p7J07K7o0r1rJ9N3P4lq5J1m0l0R2n0J02l1k8n2m6N
$$ 180 157 73 53 118 274 230 181 221 102 16 83 173 96 203 230 170 79 70 89 142 216 213 128 139 99 69 161 111 213 182 154 102 56 61
3504F1N7Q0m9P2j27kl0l4J15M9m0k6N5j59J9P7M8l8L4k7k4l9l6N7P1M8m8j03K5k9L8Q5q0Q2
$$ 61 118 198 149 221 94 92 62 28 143 192 152 126 181 22 41 118 166 128 162 135 111 72 36 93 164 212 164 61 86 57 95 180 100 182
3185A82q3o6M2J1j1N4O7p9m9J06r1moP8MK18r3j16K56J11J28O06n14N2m12j56O78n8k48k93
$$ 182 99 33 75 86 75 129 196 117 68 174 83 79 73 151 155 373 280 164 420 531 659 1265 751 803 391 235 913 855 607 314
2903C14o4j44J2n6jP1J6J9K2L6r6P13m65L44M10r76K26N14p21l7m9J44m7K52j43J1J00L89
$$ 314 250 106 118 62 61 132 148 167 189 225 129 842 377 721 1131 155 381 895 174 137 88 232 185 437 294 305 405 794
2640G94j91J034r8M96j187p02J6p5nP8O0j21k7m7L7KR6J6o7k9L7o4K3LP7mP4j49L9k5L0l6
$$ 794 603 1637 1539 2035 848 146 162 87 82 160 220 99 72 25 62 64 160 176 109 80 117 53 76 79 156 152 226 77 116 91 121 85
2340H5N4j1j1l4l4k9K6J86j02K5j9q1LP7M1p8N5q0om4K4L5N5J8m2mnJ68K77M34q35K44J292
$$ 85 139 128 117 83 49 20 46 232 130 155 136 55 58 135 176 98 153 73 67 23 47 82 137 155 113 109 104 272 549 983 148 392 1684
2030A684J82p7k57l69r85R2m3J23J422p96q2o65j11p9M72O62n98m87j1j7lJ25q4N7m8P2j06
$$ 1684 1866 1789 1532 1163 178 270 227 350 1772 976 894 229 118 39 511 1173 575 88 77 60 57 182 98 155 107 179 73
1776G3o6K00O5j41K2q8P4j4j0l9J79p8QK5m3L2o1L0J03J78Q2k0PJ196o83J0946r33l701p25
$$ 73 7 207 272 131 153 65 139 125 115 76 255 177 185 210 167 199 138 168 271 449 531 511 518 1714 1031 11977 11044 7343 6618
1504F618P504O710j7385j084l68j126m49L49Q88R59K648M214J2372J9537J1456n005r914k2389
$$ 6618 14122 20832 3447 2363 1995 869 420 769 1657 2616 5264 9478 21850 41387 52843 47838 37924 15535
1335A5535j1222j690P38J5515J6184K951r683j7481q439j009m07m6k47k53j92j38J77P1R8
$$ 15535 4313 2623 3361 18876 35060 38011 28328 10847 2408 1399 992 946 699 446 254 116 293 364 462
1156D62nq4j67j09J62Q9Ok4Q5k43nR4pN9O6l3r5m7m7O5K26k46K89j20j63nJ00l2J43o3m4n4
$$ 462 457 373 206 97 259 348 354 330 415 172 167 261 254 313 379 346 251 204 157 222 448 202 491 371 208 203 303 271 414 351 307 253
856B53P1p5Q6N9l4O9j2j62L3J06n8R2O3m0m7o3m2J28L6O2N7q9n8n4J13M8J09L2J09l37j0J04
$$ 253 324 249 335 394 360 429 417 255 288 394 336 428 491 451 404 341 299 427 463 525 582 493 435 381 494 542 651 683 792 455 445 549
556E49j31J42K71L5j05m0N5K4J26J07K81K86l6R5m44J033r35J852j017J180J323L909J9325
$$ 549 418 560 831 866 761 721 776 800 926 1033 1314 1600 1564 1659 1215 2248 1313 3165 2148 3328 4651 8560 27885
340B7885O3730n831p6p3253n603k206j278l72j330L94o01j15R2j34K2k56j69q5r0j1J52p5
$$ 27885 91615 85784 85708 12455 6852 4646 3368 2996 1666 2060 1459 1344 1436 1302 1324 1068 899 814 724 713 865 790
133G90J10k46k2r2k8P0m9J38o6j34l2j90Q3J35P0J9r0l6j72j02K26j3J39m0J6k23p5K8J58
$$ 790 900 654 632 540 512 582 533 671 605 471 439 249 332 467 537 556 466 430 258 156 382 369 508 468 484 261 186 214 372
-139C72N1N2N7k43q5j40J17J11J64L4o4r9j44j04J36J81Q5J27j06j50j73M6J19J54P1N1j9
$$ 372 423 475 532 289 204 64 181 292 456 490 426 327 183 79 215 396 481 608 502 352 179 225 344 498 569 620 601
-393F01
$$ [...]
-393D1
##END NTUPLES=	nD NMR SPECTRUM
##END=	
##END=	
