##TITLE=	fQZJv42FTkKe+c0wXPTp1A.24.ser
TM-VI-212, CDCl3, new, hmbc

##JCAMP-DX=	6.0	$$ MestReNova 14.3.0-30573
##DATA TYPE=	LINK
##BLOCK_ID=	1
##BLOCKS=	2    
##ORIGIN=	Mestrelab Research S.L.
##OWNER=	hrzepa
##$MNOVA/LINK_BLOCK_TYPE=	ITEM	$$ NMR Spectrum
##$MNOVA/ITEM/POLYGON=	(XY..XY)
5321,5835
8722,5835
8722,8208
5321,8208
5321,5835
##$MNOVA/ITEM/Z=	0
##$MNOVA/ITEM/ANGLE=	0
##TITLE=	fQZJv42FTkKe+c0wXPTp1A.24.ser
##JCAMP-DX=	6.0	$$ MestReNova 14.3.0-30573
##BLOCK_ID=	2
##DATA TYPE=	MNOVA NMR VIEW DATA
##DATA CLASS=	MNOVA VIEW DATA
##$MNOVA/2D/THRESHOLD=	16.08769989013671875
##$MNOVA/ITEM/ZOOM/X=	-0.97513570095656798564,	15.006420000069319087
##$MNOVA/ITEM/ZOOM/Y=	-9.5219447936452610293,	250.03239999719292541
##END=	
##TITLE=	fQZJv42FTkKe+c0wXPTp1A.24.ser
##JCAMP-DX=	6.0	$$ MestReNova 14.3.0-30573
##BLOCK_ID=	3
##DATA TYPE=	nD NMR SPECTRUM
##DATA CLASS=	NTUPLES
##NUMDIM=	2
##ORIGIN=	Bruker BioSpin GmbH
##OWNER=	nmr
##.OBSERVE FREQUENCY=	400.32280223999998725
##.OBSERVE NUCLEUS=	^1H
##.SOLVENT NAME=	CDCl3
##.PULSE SEQUENCE=	hmbcgplpndqf
##LONGDATE=	2022/06/21 20:36:58.000
##.ACQUISITIONMODE=	SIMULTANEOUS (DQD)
##$ORIGINAL FORMAT=	Bruker XWIN-NMR
##$MNOVA/SCALES_VERSION=	9
##$PARAMETER FILE=	(acqu2s, ASCII, /private/var/folders/f6/rjf_tdyn2v98c5c0wvkgn4s80000gn/T/fQZJv42FTkKe+c0wXPTp1A/24/acqu2s, 0)
$$ ##TITLE= Parameter file, TOPSPIN		Version 3.2
$$ ##JCAMPDX= 5.0
$$ ##DATATYPE= Parameter Values
$$ ##NPOINTS= 201	$$ modification sequence number
$$ ##ORIGIN= Bruker BioSpin GmbH
$$ ##OWNER= nmr
$$ $$ 2022-06-21 21:07:35.195 +0100  nmr@CZC2524DW0
$$ $$ /opt/topspin/data/agmb/nmr/Jun21-2022/24/acqu2s
$$ $$ process /opt/topspin3.2/prog/mod/go
$$ ##$ACQT0= 0
$$ ##$BF1= 100.660544
$$ ##$FnMODE= 1
$$ ##$NUC1= <13C>
$$ ##$NusJSP= 0
$$ ##$NusT2= 1
$$ ##$NusTD= 200
$$ ##$O1= 12079.3932956644
$$ ##$SFO1= 100.672623393296
$$ ##$SW= 260.03107487261
$$ ##$SW_h= 26178.0104712042
$$ ##$TD= 200
$$ ##END=
$$ 
##$PARAMETER FILE=	(acqus, ASCII, /private/var/folders/f6/rjf_tdyn2v98c5c0wvkgn4s80000gn/T/fQZJv42FTkKe+c0wXPTp1A/24/acqus, 0)
$$ ##TITLE= Parameter file, TOPSPIN		Version 3.2
$$ ##JCAMPDX= 5.0
$$ ##DATATYPE= Parameter Values
$$ ##NPOINTS= 12	$$ modification sequence number
$$ ##ORIGIN= Bruker BioSpin GmbH
$$ ##OWNER= nmr
$$ $$ 2022-06-21 21:07:38.680 +0100  nmr@CZC2524DW0
$$ $$ /opt/topspin/data/agmb/nmr/Jun21-2022/24/acqus
$$ $$ process /opt/topspin3.2/prog/mod/shimcntl
$$ ##$ACQT0= 1000000
$$ ##$AMP= (0..31)
$$ 100 100 100 100 100 100 100 100 100 100 100 100 100 100 100 100 100 100
$$ 100 100 100 100 100 100 100 100 100 100 100 100 100 100
$$ ##$AMPCOIL= (0..19)
$$ 0 0 0 0 0 0 0 0 0 0 0 0 0 0 0 0 0 0 0 0
$$ ##$ANAVPT= -1
$$ ##$AQSEQ= 0
$$ ##$AQ_mod= 3
$$ ##$AUNM= <au_zgonly>
$$ ##$AUTOPOS= <41 >
$$ ##$BF1= 400.32
$$ ##$BF2= 100.660544
$$ ##$BF3= 400.32
$$ ##$BF4= 400.32
$$ ##$BF5= 400.32
$$ ##$BF6= 400.32
$$ ##$BF7= 400.32
$$ ##$BF8= 400.32
$$ ##$BYTORDA= 0
$$ ##$CAGPARS= (0..11)
$$ 0 0 0 0 0 0 0 0 0 0 0 0
$$ ##$CFDGTYP= 0
$$ ##$CFRGTYP= 9
$$ [...]
$$ 0 0 0 0
$$ ##$ShimPowMaxUC= (0..63)
$$ 130000 130000 130000 130000 130000 130000 130000 130000 130000 130000 130000
$$ 130000 130000 130000 130000 130000 130000 130000 130000 130000 0 0 0 0
$$ 0 0 0 0 0 0 0 0 0 0 0 0 0 0 0 0 0 0 0 0 0 0 0 0 0 0 0 0 0 0 0 0 0 0 0 0
$$ 0 0 0 0
$$ ##$ShimPowMaxUG= (0..63)
$$ 524287 524287 524287 524287 524287 524287 524287 524287 524287 524287 524287
$$ 524287 524287 524287 524287 524287 524287 524287 524287 524287 0 0 0 0
$$ 0 0 0 0 0 0 0 0 0 0 0 0 0 0 0 0 0 0 0 0 0 0 0 0 0 0 0 0 0 0 0 0 0 0 0 0
$$ 0 0 0 0
$$ ##$ShimPowRcbType= 3
$$ ##$ShimPowRes= (0..63)
$$ 1e-20 1e-20 1e-20 1e-20 1e-20 1e-20 1e-20 1e-20 1e-20 1e-20 1e-20 1e-20
$$ 1e-20 1e-20 1e-20 1e-20 1e-20 1e-20 1e-20 1e-20 0 0 0 0 0 0 0 0 0 0 0 0
$$ 0 0 0 0 0 0 0 0 0 0 0 0 0 0 0 0 0 0 0 0 0 0 0 0 0 0 0 0 0 0 0 0
$$ ##$ShimPowRng0= (0..63)
$$ 1 1 1 1 1 1 1 1 1 1 1 1 1 1 1 1 1 1 1 1 0 0 0 0 0 0 0 0 0 0 0 0 0 0 0 0
$$ 0 0 0 0 0 0 0 0 0 0 0 0 0 0 0 0 0 0 0 0 0 0 0 0 0 0 0 0
$$ ##$ShimPowRng1= (0..63)
$$ 1 1 1 1 1 1 1 1 1 1 1 1 1 1 1 1 1 1 1 1 0 0 0 0 0 0 0 0 0 0 0 0 0 0 0 0
$$ 0 0 0 0 0 0 0 0 0 0 0 0 0 0 0 0 0 0 0 0 0 0 0 0 0 0 0 0
$$ ##$ShimPowRng2= (0..63)
$$ 1 1 1 1 1 1 1 1 1 1 1 1 1 1 1 1 1 1 1 1 0 0 0 0 0 0 0 0 0 0 0 0 0 0 0 0
$$ 0 0 0 0 0 0 0 0 0 0 0 0 0 0 0 0 0 0 0 0 0 0 0 0 0 0 0 0
$$ ##$ShimPowRng3= (0..63)
$$ 1 1 1 1 1 1 1 1 1 1 1 1 1 1 1 1 1 1 1 1 0 0 0 0 0 0 0 0 0 0 0 0 0 0 0 0
$$ 0 0 0 0 0 0 0 0 0 0 0 0 0 0 0 0 0 0 0 0 0 0 0 0 0 0 0 0
$$ ##$ShimSysFunc= (0..63)
$$ 1 2 3 4 5 7 9 11 15 16 8 10 12 14 6 17 13 18 19 20 0 0 0 0 0 0 0 0 0 0
$$ 0 0 0 0 0 0 0 0 0 0 0 0 0 0 0 0 0 0 0 0 0 0 0 0 0 0 0 0 0 0 0 0 0 0
$$ ##$ShimSysMatrix= 0
$$ ##$ShimSysType= 1
$$ ##$TFXNUM= 0
$$ ##$TRIPLO2= 0
$$ ##$VTU= 2
$$ ##$VTUETH= <149.236.99.20>
$$ ##$VTUTY= <no>
$$ ##$WBREFAM= (0..15)
$$ 132.2 106.2 100 100 100 100 100 100 100 100 100 100 100 100 100 100
$$ ##$WBREFLM= (0..15)
$$ 0 0 0 0 0 0 0 0 0 0 0 0 0 0 0 0
$$ ##$WBREFPH= (0..15)
$$ 77.55 -65.76 0 0 0 0 0 0 0 0 0 0 0 0 0 0
$$ ##$WBSGU= (0..15)
$$ 0 0 0 0 0 0 0 0 0 0 0 0 0 0 0 0
$$ ##$XFAC= 2
$$ ##END=
$$ 
##$DECIM=	3120
##$DSPFVS=	20
##.ACQUISITIONSCHEME=	NOT PHASESENSITIVE
##NTUPLES=	nD NMR SPECTRUM
##VAR_NAME=	FREQUENCY1,	FREQUENCY2,	SPECTRUM
##SYMBOL=	F1,	F2,	Y
##.NUCLEUS=	13C,	1H
##.OBSERVE FREQUENCY=	100.67262339329600707,	400.32280223999998725
##VAR_TYPE=	INDEPENDENT,	INDEPENDENT,	DEPENDENT
##VAR_FORM=	AFFN,	AFFN,	ASDF
##VAR_DIM=	512,	512,	262144
##UNITS=	HZ,	HZ,	ARBITRARY UNITS
##FIRST=	25168.397401625570637,	6007.3700543999984802,	0.26921787858009338379
##LAST=	-958.48414287705929837,	-390.36632380512997997,	1.0600458383560180664
##MIN=	-958.48414287705929837,	-390.36632380512997997,	0.0014141885330900549889
##MAX=	25168.397401625570637,	6007.3700543999984802,	541.5909423828125
##FACTOR=	1,	1,	0.004591760332299714073
##PAGE=	F1=25168.4
##FIRST=	25168.397401625570637,	6007.3700543999984802,	0.26921787858009338379
##DATA TABLE=	(F2++(Y..Y)), PROFILE
$$ [...]
##PAGE=	F1=1035.54
##FIRST=	25168.397401625570637,	6007.3700543999984802,	0.19430603086948394775
##DATA TABLE=	(F2++(Y..Y)), PROFILE
4755B03mo0K8N5k0q8j8J11j30J37m7k4o4J9kJ3RJ01r6nn8K22m7Q8j3j44q6P8k3q4M0l3K15
4342B73j11P4k20J01p6O0J00r7P5j52Q0M7ml8P9J5j53O3K21j8j29j18j9J47j17J43k0j18L
3979I1J2J02l0q4Jk4J40j70R8l2J02n2R5j69O6P1K4j92J98k28J01P5j37J77j85J27j53J19
3629A43k6j1N7j54P2Q2m4RK9R7j87J59Q8l3j59m6J15j59J24J7p2o0QJ6J86n0k7j5j21Q4m1
3240H1k8J63l6j28P2kR4j02L1j6m6O3j3J36J683l3j744L18M28J274P125K338q480o92O414
2927H900k023m670J67j040j092Q93O4n57p2n9J983J572M844n84o524P54j726M32n60r8o2K11
2652G53P44n51k68n21L67l42K02J44k36N5O2l02K91n7K1pj13j8J40Q1k00J63m1J53k43J33
2326D10o3J22p6p5K94k06J50K8K87k84P4pJ62p0K56J20N36J21O43J677P634J4361N683j2842
$$ y = [203, 199, 139, 167, 222, 202, 114, 96, 207, 77, 214, 167, 143, 79, 98, 96, 109, 118, 219, 123, 118, 60, 282, 235, 323, 310, 166, 80, 158, 135, 51, 91, 58, 273, 162, 236, 16, 117, 41, 101, 201, 104, 179, 27, 107, 154, 150, 112, 191, 206, 53, 116, 337, 319, 190, 72, 53, 200, 83, 226, 206, 88, 91, 103, 205, 175, 91, 92, 68, 208, 38, 136, 104, 206, 154, 249, 80, 146, 217, 241, 49, 247, 19, 120, 195, 58, 235, 50, 177, 24, 143, 117, 106, 163, 9, 81, 163, 119, 128, 157, 254, 67, 226, 314, 281, 122, 76, 191, 32, 156, 173, 101, 41, 49, 65, 251, 201, 174, 159, 38, 122, 81, 53, 216, 180, 52, 124, 122, 216, 114, 145, 129, 83, 146, 133, 269, 1952, 1919, 175, 493, 921, 2195, 9320, 11658, 3178, 2486, 8900, 6877, 2207, 2374, 1334, 242, 1135, 1199, 642, 570, 511, 2494, 4066, 8910, 8326, 1802, 2556, 830, 1262, 702, 604, 542, 753, 1497, 946, 678, 157, 524, 182, 384, 528, 292, 347, 409, 107, 398, 341, 362, 355, 242, 224, 364, 445, 245, 408, 367, 520, 277, 410, 347, 469, 393, 318, 612, 406, 556, 584, 871, 587, 661, 654, 816, 746, 1002, 1122, 1658, 1779, 2422, 4099, 11733, 26094, 31777, 18935]
2026A8935j690M89r503n355K577J2085j117j529j0546j276K535m23l883o30k28J78m56J56
1801C19P7J5j43JJ60j64J00l1j80J89k02K83j34k56K62k04J83j55J37l8mJ64r1o0J65l28J05
1463A70j33K17k12J51KJ9j08M7m5K5R9j66J58l3j2j18J50q7J34l7j48N0J63k61O6j6P7r5R2
1100A49qJ18j21o6K10n0r7om3N5K93L57l01m06K22j14m7L8K0j20o9J41J20j39o1L5M8K8p5
736A11QJ4N5k4M6K0p9O1m6q5L4J2M0r6l0J35j37O9j8Qm7O1j1k8K40o2j75J28j35j7O2P4n4
323A34O8j32k2l4N2RJ41l5pJ28j5k12j9L5L7j16R0M4P9O3j07K5j6j2qJ20j72o7J18K03j31
-65B41j02Mp4n6J55j33jJ40l3J2O0Oj14J49j25o9J32j6j08J25Jq2m7J7n1N0
$$ y = [18935, 17245, 17734, 8231, 2876, 5453, 17538, 16421, 14892, 4346, 3070, 5605, 5182, 1299, 669, 441, 619, 163, 319, 396, 411, 268, 269, 429, 265, 365, 334, 154, 343, 141, 424, 290, 34, 296, 92, 275, 120, 257, 219, 215, 379, 288, 228, 393, 65, 170, 37, 254, 42, 193, 195, 214, 106, 153, 108, 133, 232, 66, 224, 191, 179, 61, 211, 124, 258, 221, 73, 123, 286, 25, 91, 75, 152, 57, 149, 141, 259, 138, 72, 282, 232, 135, 129, 86, 141, 434, 791, 490, 84, 306, 192, 145, 183, 203, 83, 14, 155, 275, 136, 75, 110, 158, 186, 111, 119, 133, 188, 164, 210, 230, 151, 212, 166, 81, 115, 127, 167, 71, 41, 176, 39, 108, 90, 98, 51, 112, 101, 73, 313, 251, 76, 204, 69, 52, 114, 188, 134, 202, 70, 48, 14, 66, 75, 216, 181, 174, 302, 287, 75, 56, 91, 128, 12, 102, 146, 225, 288, 181, 206, 190, 178, 170, 290, 118, 51, 169, 372, 241, 139, 143, 69, 13, 168, 35, 34, 174, 141, 153, 213, 219, 105, 254, 129, 60, 192, 176, 68, 193, 194, 112, 65, 82, 31, 81]
-390H1
##PAGE=	F1=933.286
##FIRST=	25168.397401625570637,	6007.3700543999984802,	0.3570518791675567627
##DATA TABLE=	(F2++(Y..Y)), PROFILE
6007C5J07L0o4k8l7QM6k1N0j01M8Q3P3j30%N5K3j54j0M5R4p2J2K9Jo4L2J02l3o3p6J09J64
5594B93j20j16L9j5P7m1m0L1n8J10j14Q4m1J10o8L0O2j96K41L8k71J31j2k2l4NO8j07R5j24
5219C5K42j78M1m3q2J25K1o3J96Or6j71J09M8Qm3k1J54m8k2r5j5J6j2J25k4n2K0J4o4LJ43
4818B77m9j15k5pQ0om4R2L3o9o2j6L7n5J18Mj15Rj7J0M4J1Q9j79O5K0K6N6J01L1j23q9k9K9
4392A32q6J0QJ25j05N4r8J16j32K3J47r7K9p6J19q9R5j9M6j26m1L3K61K7j14k28J09Q8n3R5
4017B53p1j69N1Q6k3l7K2O6j18K0k9MP2Q4l1l4j1N9P2J2k22K00k09Q4J12j09J22j91J05r3
3641G7J16j04O4N3j40K1nM3n1M8J23j44J65J42j86o4n5J8l2R2J4l7j44O5qK13jj31p1nR7q1
3240I2n7J03J04j05L6r7k0J26l5J2M3j46J82N3Q61K26j014L30J514j3M175K029o497K762J0229
$$ y = [35, 142, 172, 108, 80, 43, 51, 97, 76, 126, 25, 73, 156, 229, 99, 99, 154, 177, 23, 13, 58, 152, 80, 92, 121, 122, 58, 90, 192, 159, 96, 20, 129, 293, 173, 57, 96, 81, 158, 117, 77, 108, 50, 160, 46, 130, 89, 199, 131, 161, 223, 27, 268, 306, 35, 166, 154, 132, 98, 103, 171, 64, 159, 35, 277, 99, 140, 97, 15, 140, 161, 98, 294, 300, 204, 33, 142, 190, 198, 155, 134, 288, 240, 218, 123, 108, 124, 112, 237, 213, 161, 181, 195, 131, 134, 277, 228, 113, 88, 81, 161, 155, 111, 203, 236, 167, 105, 89, 126, 71, 189, 193, 78, 87, 70, 80, 124, 135, 224, 45, 110, 130, 156, 212, 313, 344, 221, 132, 103, 132, 46, 56, 64, 189, 84, 138, 40, 156, 24, 47, 194, 97, 126, 50, 169, 80, 175, 156, 202, 76, 35, 68, 329, 356, 242, 14, 123, 211, 158, 253, 182, 13, 64, 150, 127, 90, 112, 178, 60, 80, 51, 55, 127, 211, 180, 146, 135, 194, 266, 278, 56, 256, 47, 131, 243, 134, 256, 65, 170, 77, 193, 89, 153, 206, 66, 87, 82, 125, 74, 122, 245, 101, 266, 408, 222, 158, 103, 121, 89, 181, 195, 158, 14, 79, 71, 284, 283, 152, 81, 76, 173, 92, 35, 138, 242, 137, 173, 76, 56, 182, 147, 159, 202, 56, 238, 291, 1152, 1378, 364, 694, 2208, 2195, 6370, 8399, 1902, 4664, 14893]
2927A4893l071q906j555l67m26J352K70j044j68L8L779K511Q116l211o562K59m098N28p42
2690A596l63j73J501K913j880k372j063N10k98J7L31k49j6M2k10K20Kn0o5Pj1J9K02k30K02
2377E82j53K72l49J94lP1l1j26K96k00J38Q2L28l28K13j25J72P0J33K69M76L46P30K556J1448
2064A7061J6034R955k1544O716j136j4489r812K664J2162j480k902j0086J673L156l87n059
1863B526j576l15O4m04O9j8M2j20R9No8L9N0j67P6j7J8J8j77J48j54J74k57J96j06J66l2L6
1513C15j69K51l80J83j27J47q1o3P7J17j55J1j06J10M2p1Q6k4N8j70J35o8J63j5k32J12J77
1175C23k63R9j00J80j35K1J15K7j41k2J23m2N4q8M9o8O33O86o39p15J15j18N0O6m0o6j5M7
824A36J82j42j29rJ47Q3j12n7J8P1r3P4j9JR8m5j97J28J3opp1J12q0m5J0N0p4J24K0j7J87
$$ y = [14893, 11822, 2916, 1361, 994, 568, 1920, 2190, 1146, 978, 1016, 4795, 7306, 15422, 12211, 5649, 5908, 1810, 2338, 1596, 1233, 1060, 2561, 5474, 3594, 1222, 159, 669, 371, 388, 719, 470, 454, 496, 286, 506, 508, 458, 393, 400, 389, 408, 610, 380, 582, 429, 701, 352, 546, 543, 614, 583, 457, 753, 553, 691, 773, 1101, 773, 986, 861, 1033, 1103, 1236, 1505, 1981, 2327, 3057, 5613, 17061, 33095, 43050, 21506, 28222, 27086, 12597, 2785, 5449, 17611, 16131, 13229, 3143, 4816, 7972, 7585, 2526, 950, 635, 699, 295, 364, 346, 388, 268, 367, 372, 304, 343, 393, 226, 302, 285, 303, 321, 144, 292, 138, 312, 55, 251, 145, 311, 279, 315, 146, 397, 17, 200, 73, 220, 139, 76, 153, 270, 115, 126, 20, 130, 172, 101, 187, 163, 221, 51, 186, 118, 281, 266, 34, 146, 323, 60, 159, 59, 239, 104, 125, 240, 267, 126, 104, 227, 185, 239, 151, 200, 132, 765, 1451, 812, 97, 212, 94, 144, 210, 170, 104, 89, 136, 318, 176, 47, 38, 185, 268, 156, 99, 117, 188, 95, 169, 150, 151, 249, 204, 7, 135, 148, 142, 135, 64, 176, 96, 51, 61, 111, 37, 161, 181, 164, 351]
423C51j19k01K16j41q4R9M1k5P6j49L9m1n3O6J01p4R3J39rk09j14P5K7n3N4J8Q9lj7j7m6o
23A23L7M0r7mO2J60q9j39M2j16J7K03j70N5O4l7J4k1J35j53J32j22p2J16J0j39J01J05p1r3
-353I3o7L4K7
$$ y = [351, 232, 31, 247, 106, 22, 121, 162, 137, 213, 64, 103, 62, 9, 75, 176, 102, 195, 334, 325, 116, 2, 77, 104, 51, 105, 123, 212, 209, 192, 175, 129, 123, 160, 200, 103, 99, 161, 321, 232, 93, 135, 19, 36, 239, 69, 124, 188, 151, 165, 144, 279, 126, 258, 136, 64, 180, 190, 51, 152, 257, 186, 93, 26, 60, 87]
-390H7
##PAGE=	F1=831.028
##FIRST=	25168.397401625570637,	6007.3700543999984802,	0.2970867156982421875
##DATA TABLE=	(F2++(Y..Y)), PROFILE
6007B3J59M1p3j16K1k6Q1o1Q2q5J01ppo5P2qO1q6l5L6J05o8o8M7j1o9K3J29o0j2j01J01J89
5594C13j52n7J3n8Q8jr9M7k0R8j09J32j07P0j01N6P0j51K49M1k62Q0k0L3j10J6J39p0K0j11
5219C7J67j49K6j8lQ8K2q0K36pj25j26J94j14L7Rq0J59l6lj37J0J12n1n8j7mJ00L2o1l8J66
4818B88jj28o5j9J02l4n8J46n0q6l4k6mM3J22Rj37R4r8KN4L7P3j76K5J35j90J09J50M0r5p9
4417A49l1jk9JPK3q9O6m8P8m6m1J72j21J5k8J19j79J39J3j4r9pk6K03P8o3j35Q9m5O2K6j07
4004A31q8k9J47m9Pj4J90k03n5K1j5N6M4O4j51J62pM8J9j76Q0j08N6J07m3N4j86P5k0J24j22
3616A19Q6Pj31rn0J25r1N5J17o0O2J79k75Q3j05P7n4L5k5N8j46O6p3K67j5j78j7N6Q1r9o3
3228H2MJ89r3J6j8o7P9L8P2O9k23J39K1%M47k71K70K245j105Q11J508l310N063J1837l655
$$ y = [23, 182, 223, 150, 34, 55, 29, 110, 49, 131, 46, 147, 140, 133, 68, 140, 132, 193, 107, 72, 108, 213, 145, 77, 124, 113, 44, 67, 196, 136, 124, 23, 124, 313, 161, 104, 117, 59, 147, 146, 47, 94, 74, 172, 63, 195, 88, 158, 57, 113, 183, 32, 281, 322, 60, 140, 120, 153, 43, 59, 198, 128, 148, 37, 204, 55, 81, 63, 60, 148, 170, 90, 326, 319, 194, 68, 262, 148, 185, 194, 114, 273, 237, 234, 97, 107, 219, 168, 110, 93, 89, 189, 221, 160, 122, 288, 287, 159, 94, 75, 177, 143, 85, 231, 181, 95, 61, 35, 31, 74, 196, 205, 68, 162, 64, 66, 120, 157, 230, 54, 79, 214, 24, 133, 283, 323, 228, 149, 118, 117, 88, 89, 96, 119, 30, 96, 48, 126, 80, 39, 211, 90, 105, 77, 196, 17, 156, 169, 155, 56, 49, 23, 226, 304, 241, 106, 195, 150, 212, 238, 131, 43, 14, 161, 112, 119, 105, 295, 92, 37, 58, 43, 99, 143, 207, 56, 218, 211, 259, 278, 102, 182, 74, 130, 237, 194, 248, 62, 137, 117, 241, 119, 205, 212, 81, 72, 22, 147, 56, 111, 228, 168, 230, 409, 134, 217, 112, 189, 135, 170, 145, 203, 57, 123, 50, 317, 302, 124, 107, 163, 244, 145, 82, 86, 275, 182, 198, 180, 113, 192, 230, 302, 371, 148, 287, 308, 308, 755, 484, 754, 2999, 1894, 2705, 4213, 903, 5966, 17803, 14148]
2915A4148j1133k676K63K12J491M08j243k71J90M852K849R751o279k201j629o206N67q76n19
2677A698j83K895N438l168m855j410K50k08n6L95k33q8J3o5R4P7j21j28J31rk9K09k06J80
2377F21j42K50l71K33J5L8J9k02L25j94J15J16L10l74L97k65J87J50J3M23K63N22P02L092
2076F243J2963J4609J2181k4757J2457k963j6534j1873K318J1298j184l948q578L886K668
1888H786m92n173k012l31j04k98R7j41P2j94K17j33J12j02J06j67j6J34j74P7k1K5j13J93
1588C48k90J54j66K92j66P1m1J47k96J59j48O6J61k20L1K22k6k43M5rk7J00m2M2P8j63O0p
1237A32J71m8j45K7J61j89Q6r1J80j46K8J31p5j62J34J8j04K31k39J67j21Q02R03q62q51j7
912A21nK5P0l0p1P8j32K12j09j30MJ65J64j70j29QO9j14R1pK6J58p0j45P7jl9M5n4K3Km4p4
$$ y = [14148, 3015, 339, 602, 814, 2305, 2713, 1470, 1199, 1389, 6241, 9090, 18841, 12562, 10361, 8732, 2526, 3093, 2217, 1698, 1515, 4410, 9848, 6680, 1825, 415, 665, 457, 401, 796, 563, 475, 488, 423, 517, 594, 473, 345, 476, 467, 438, 647, 441, 621, 479, 729, 358, 591, 606, 644, 663, 461, 786, 592, 707, 823, 1133, 759, 1156, 891, 1078, 1228, 1241, 1664, 1927, 2449, 3151, 6243, 19206, 33815, 45996, 21239, 33696, 30733, 14199, 2326, 4644, 15942, 14758, 10810, 2232, 6118, 8786, 8294, 3121, 1109, 778, 674, 376, 473, 332, 404, 210, 427, 294, 406, 304, 410, 243, 227, 361, 187, 264, 243, 268, 155, 348, 58, 212, 46, 338, 172, 243, 202, 349, 53, 212, 64, 130, 291, 71, 102, 324, 298, 55, 100, 91, 64, 164, 122, 164, 242, 79, 139, 132, 303, 255, 110, 137, 298, 109, 195, 104, 284, 138, 166, 297, 222, 60, 194, 212, 108, 339, 100, 267, 146, 948, 1851, 989, 138, 121, 116, 141, 211, 181, 110, 188, 56, 268, 159, 29, 33, 198, 362, 192, 63, 71, 140, 26, 117, 110, 136, 294, 224, 79, 156, 155, 116, 161, 107, 130, 132, 88, 14]
499A4R6q7J37R7m1N6j30p2J79j72l3R5k8j8J15j35P5n6j5j0L4l6J65N3Oj33r6pN7j8j3N7M5
85A81n5K0q6R1Nl4j3k0N5k2J46n8j79J07p9pK58j43L0N6j03lj23K70j49P2j05l2J08Jj57L4
-315F6J96m2j19k2Mn
$$ y = [14, 110, 23, 160, 257, 216, 272, 142, 70, 249, 77, 44, 139, 111, 93, 208, 73, 148, 92, 77, 67, 101, 65, 230, 283, 289, 156, 60, 53, 110, 92, 79, 136, 181, 126, 146, 60, 151, 156, 122, 109, 89, 144, 122, 268, 210, 31, 138, 59, 52, 310, 167, 197, 253, 150, 147, 24, 294, 145, 217, 112, 80, 188, 189, 32, 66, 262, 220, 101, 79, 83, 78]
-390G8
##PAGE=	F1=728.77
##FIRST=	25168.397401625570637,	6007.3700543999984802,	0.51018756628036499023
##DATA TABLE=	(F2++(Y..Y)), PROFILE
6007B9J23P4n8j16Nj2P4r0Q5m0J16q1q3K8J24j04J20Pq5M0Q2m9j43N5l2k4L7R1o2pq6J07J33
5594B58j45N6K1j03J1K0J2l0j9O5m4J54q5n0l2K9K7m5J57J8j72Lj9R3j27K6R4n1Kj05J20o1
5194G8J0q3O6N1J9o7K59pj59r3K41r4k0rm6N7Lk2j08K5J68l0k15J7J7J27Mk3k9J04O2j09r8
4780I6k1J20m1KQ9j53n2N7l4j9N1J16l3n0R7j15j6J2M2M0j20k2K22r4j46K07L0q8m2J7n8O1
4380A55K0m3m8j1O9L0j42Q5p0J82r1j5k9J03j70J05K5n5M3j11O5j6J01Ql2O6j45J61p0j09
4004F1mJ3O6J1N1j41K71k15j6k5Kn0J6J43j04J97r3J2O2j12m6j7M9L2J3L0j19L8%J58r4Mo
3591A87j01Ml4J05K1l2M9k0l8J86k59J58j19J71j32rp4J23j14N3p1K85r6j04J4O3M1j03l1
3228A23rJ41r4J5N9l8l6J27N1J30k20j1M8J28M2L0J39K229j479j237R57j89M699J0332l370
$$ y = [29, 152, 226, 168, 52, 57, 45, 119, 29, 114, 74, 190, 109, 26, 54, 178, 74, 194, 201, 116, 156, 238, 189, 46, 101, 69, 45, 82, 173, 111, 104, 18, 125, 258, 113, 169, 190, 87, 98, 118, 130, 100, 81, 146, 102, 256, 171, 121, 89, 118, 145, 100, 257, 275, 103, 106, 87, 180, 53, 79, 173, 122, 124, 19, 139, 78, 88, 5, 71, 122, 141, 74, 333, 326, 167, 74, 315, 221, 201, 192, 146, 203, 206, 184, 76, 101, 269, 239, 24, 41, 58, 185, 189, 166, 137, 241, 303, 194, 96, 75, 195, 154, 156, 245, 92, 40, 97, 63, 44, 95, 211, 178, 128, 225, 110, 94, 106, 148, 188, 68, 46, 268, 174, 28, 235, 265, 177, 135, 152, 94, 155, 175, 132, 84, 73, 142, 172, 30, 115, 45, 227, 136, 121, 92, 195, 25, 130, 155, 100, 143, 32, 97, 81, 182, 190, 158, 224, 79, 240, 170, 61, 57, 70, 136, 147, 198, 57, 328, 113, 97, 72, 74, 24, 40, 183, 79, 276, 183, 195, 257, 145, 99, 82, 131, 163, 176, 206, 87, 125, 125, 283, 189, 193, 187, 86, 90, 56, 161, 182, 150, 199, 179, 141, 327, 68, 226, 107, 278, 146, 137, 63, 186, 72, 125, 54, 339, 243, 139, 153, 216, 257, 154, 123, 114, 255, 161, 176, 235, 197, 161, 288, 339, 469, 249, 238, 286, 414, 456, 486, 625, 2854, 1375, 138, 1095, 906, 5605, 15937, 12567]
2915A2567j0134k164P8M82J258M16j053l50L02M611K390Q811q164M073l646o873M94q65m73
2677A760r2L689O983l734o188j713j52j64K8K94j85j56M7pJJ25j56j62K18k8J5J09j63J41
2377E10n7J48l42K45j2L6N2k69L75k14J17J00K61m12N10l60K16J56j15N39k4N92N68K972J1063
2064A6655J0836J1174k0593J2327l889j4482j0464J981J0015o84l978o733L861J627o24m246
1863B783j798l37j57j88J24j31M1k16K64k16K23j25R4j90k3J86j63j4O0K3j33K15k37N1q1
1550E5K16j41%J26J1j19L9j44kL33k09j20K83M6l12L2j4LJ30o6M6M5j32lJ9J49p9p4k1J07
1175B04o1M1l3R4o6J1J08j69p9J60J6j44K69k72J70j05P46Q83q41p28p2Q5r2P7Jj06J79j79
824I7O1o2o3M2J20J93j88j61M2l7J1M3M5n2K24p3o5Ln1M8k1mr2P8J4n7no1P6J68p2n1o8L4
$$ y = [12567, 2433, 269, 347, 829, 2087, 2503, 1450, 1100, 1402, 6013, 8403, 17214, 9050, 13123, 9477, 2604, 3098, 2233, 1760, 1668, 5357, 12340, 8606, 2418, 705, 553, 389, 417, 711, 526, 370, 417, 410, 411, 536, 380, 218, 436, 408, 423, 532, 369, 510, 453, 601, 259, 504, 492, 528, 580, 311, 686, 472, 589, 689, 950, 538, 1048, 688, 904, 1060, 945, 1484, 1460, 2052, 2620, 5592, 16655, 27491, 38665, 18072, 30399, 26510, 12028, 1564, 3545, 13560, 12876, 8898, 2165, 6026, 7653, 7029, 2783, 985, 648, 491, 303, 427, 296, 337, 121, 385, 169, 392, 267, 361, 171, 148, 334, 171, 157, 217, 240, 107, 322, 85, 136, 55, 271, 130, 130, 256, 267, 148, 187, 43, 41, 374, 165, 45, 328, 374, 62, 94, 80, 83, 213, 147, 193, 238, 106, 103, 122, 271, 192, 118, 97, 204, 143, 184, 151, 245, 179, 190, 298, 129, 50, 210, 226, 82, 351, 79, 249, 144, 890, 1773, 932, 204, 132, 217, 125, 202, 203, 97, 276, 97, 158, 96, 33, 75, 195, 388, 200, 39, 81, 44, 55, 98, 143, 91, 315, 242, 177, 180, 129, 177, 156, 152, 60, 138, 152, 95, 90, 29, 105, 273, 201, 150, 82, 116]
398A16R6j96Q5L5r8rJ61r9O2o9M7q3k1Q6J31m2Ln0o1k4Q3m1MM5op7J4NJ24m5r0l2R9K1r5J43
-52B22l6j44R5m6m5K97j31j1O5j30k6k2J48j31M7p5K2J20j8j48K3J31j1j02k3K7l2
$$ y = [116, 212, 16, 101, 136, 38, 29, 190, 91, 153, 84, 131, 48, 27, 113, 244, 202, 205, 155, 94, 70, 153, 112, 116, 161, 155, 78, 92, 97, 221, 176, 86, 54, 153, 174, 79, 222, 186, 42, 137, 91, 46, 343, 212, 201, 266, 136, 110, 88, 236, 105, 152, 77, 99, 219, 201, 53, 76, 207, 196, 94, 71, 98, 66]
-390F6
##PAGE=	F1=626.513
##FIRST=	25168.397401625570637,	6007.3700543999984802,	0.56583303213119506836
##DATA TABLE=	(F2++(Y..Y)), PROFILE
6007B7M2J07l3p9K1N7k5m6j2LJ23j10J3qJ20j54J69N2j34K8N0k5j35Qn5P6J2M6l9k1m5J04
5607A37L4j21J24M4p3j22P2N3m9nj0L5J66j5j40R3q1oL7L6j1n4o8O7J9p4L4J2l5pjM0n5j2
5181F4jrM3k2JK59j7j86q3K33J6p4n8Qr3O3o1j6K7J81j9j68L3n7Q1m0M6%j6J33p3r6l8R4o
4743A49O2L2k21P7N6o9nK5R4q7L9R0r4kl8lom4j2K36j1j89J12Mj02K0N3r1J42L1j01j02K8
4330G3J13J00k00J0n7J97k8o4n0R3j47J00J0J4L4j96J34m9m9P8L6L3j29J83j51m9M0Q8p7L2
3954A22R8j69K03j47j5Jk3pM1oj4K00j56j8J21r5J5q2L3j8J4O3LJ6o5J86l2r0j6q2L0l8Q0
3541A53Q7k0m9k4p9J24j55J50j10K40j86nq9N5l0K0K3K14j68J6qM1l0n8L1JM6q8%J10k5j8
3140A69R4J7J45j73j06P0K82j29Qj3J536j109K4m91L84L081O547k280o606j104r8L67P83L19
$$ y = [27, 69, 176, 143, 64, 85, 142, 117, 71, 59, 62, 185, 75, 88, 80, 200, 46, 215, 267, 133, 161, 211, 186, 51, 59, 4, 80, 92, 138, 99, 78, 33, 137, 171, 50, 174, 218, 145, 23, 95, 148, 99, 94, 84, 119, 285, 270, 130, 223, 142, 136, 173, 209, 198, 144, 76, 143, 162, 88, 122, 134, 99, 92, 91, 131, 76, 64, 63, 54, 97, 75, 76, 335, 318, 132, 49, 282, 298, 224, 166, 174, 81, 144, 83, 67, 94, 275, 256, 88, 121, 64, 145, 105, 151, 151, 135, 268, 195, 99, 61, 155, 149, 211, 243, 22, 99, 155, 86, 81, 106, 200, 113, 152, 242, 148, 146, 108, 105, 99, 55, 43, 279, 268, 79, 191, 195, 93, 113, 166, 75, 217, 248, 147, 45, 73, 186, 286, 86, 96, 39, 236, 208, 144, 94, 187, 40, 140, 150, 164, 198, 2, 136, 87, 38, 116, 152, 185, 56, 239, 88, 39, 79, 167, 90, 122, 220, 51, 254, 107, 92, 93, 70, 63, 104, 98, 84, 284, 128, 110, 231, 136, 151, 69, 102, 84, 98, 161, 164, 180, 115, 301, 269, 179, 163, 81, 111, 73, 153, 240, 220, 171, 147, 68, 192, 37, 187, 77, 317, 131, 126, 37, 92, 62, 82, 105, 319, 151, 167, 159, 200, 170, 112, 143, 144, 190, 102, 102, 212, 187, 169, 263, 280, 425, 252, 146, 216, 498, 369, 377, 364, 1900, 791, 815, 324, 708, 3789, 10336, 8056, 1450, 346, 248, 615, 1398, 1717]
2840A717o12l66L07L209J405N809p747Q529m539n686L09o68k67L1L459O639l312n933j777
2602E07m1k41J80J04j24k05J40o4k7J47j66j35K33n6J03l2j16J06L6N1l02K22n4M7O1j86L19
2264E07k50J78j2K29m28M69l32K18J26k26N59k78N62L74K190O687O391P594j1761P286l418
2001A6665r385o494J839Q005m94l114n103K593P20n44k890j135l37j03p3R3o5Nr9K01k47K12
1726B50JL2k39M1J34k8m1n3R5j18J50j15p1Q8L3PoJ05m5M2j29l0o9L40j36k12K25N8j14r2
1350A03k6P8P8n7K5po4n6J0J05o5o1j9L9O1oKK7N5p3Q7j68Q1K8K5p3J51p5k0m9M94O51n93
937F88m45p6P0j35J22nj41K38j47j10j5rM0J06J51j57j23J06o2K2Pjj06K73m6%n3j02J30q1
561A39L1j64J26N7l7r3p%J81n3j5N8o9qk4L4j8p6K5P4n9M7m1N2j19KJ05O2o0qm4k4O3O9n8
$$ y = [1717, 1105, 739, 1046, 4255, 5660, 11469, 3722, 12251, 7712, 2026, 2335, 1667, 1400, 1431, 4890, 11529, 8217, 2284, 507, 466, 225, 405, 509, 385, 180, 320, 256, 229, 376, 210, 75, 308, 252, 355, 323, 207, 313, 349, 400, 98, 320, 266, 313, 374, 188, 507, 257, 435, 423, 652, 224, 693, 361, 579, 705, 479, 1038, 760, 1322, 1696, 3886, 10573, 16964, 24558, 12797, 20083, 16665, 7280, 786, 2625, 10630, 10136, 7022, 1919, 4512, 5232, 4688, 1798, 663, 326, 223, 150, 243, 178, 183, 84, 285, 38, 250, 251, 283, 44, 85, 219, 191, 150, 97, 192, 74, 224, 109, 38, 126, 159, 166, 160, 265, 220, 262, 133, 103, 34, 374, 238, 26, 251, 309, 195, 103, 77, 155, 233, 176, 201, 194, 130, 74, 84, 189, 124, 63, 44, 83, 144, 138, 140, 167, 222, 149, 236, 68, 149, 177, 202, 129, 280, 205, 185, 136, 630, 1281, 688, 243, 167, 237, 102, 224, 219, 78, 316, 169, 59, 44, 35, 75, 181, 332, 175, 52, 158, 96, 118, 125, 124, 18, 291, 245, 245, 192, 90, 220, 139, 170, 6, 132, 189, 152, 59, 52, 52, 233, 180, 165, 223, 154, 146, 122, 156, 138, 62, 87, 161, 102, 149, 108, 160, 41, 43, 148, 210, 150, 142, 98, 74, 137, 206, 148]
123A48Q8m5m1l5k1J30K4j33m5QJ17j5j08J10j9j11O1Rj00L02j30n6O9r5m7P7lp9K5k4Q9J06
-278B56j7p0M3r0PRr6O8m4
$$ y = [148, 236, 191, 150, 115, 94, 224, 248, 115, 70, 78, 195, 180, 72, 182, 163, 52, 113, 122, 22, 324, 194, 138, 207, 112, 65, 142, 139, 60, 85, 61, 150, 256, 239, 169, 212, 122, 129, 138, 42, 110, 66]
-390F6
##PAGE=	F1=524.255
##FIRST=	25168.397401625570637,	6007.3700543999984802,	0.58899855613708496094
##DATA TABLE=	(F2++(Y..Y)), PROFILE
6007C0j5Q5j1m8J65K2j08k1p5nJ16p3M3j2J05j27J58N9j55K5Lk4r4mL5N2l6K6Pk7RM8l6p2
5582D5O9P1J4j43J10o6lM2j25P8J75O9j60J34j17k5N5n6rL1p5P6r4j6M9%l4j5R8j8j07rO9
5169A13o6R9q3K9K40o4j84o9J78J15p4q5M3j06pl4J4K6J70k5j53O8j16O1L0M0j2r7J65n8o3
4780I5o1M8M5O0L6k10J29K4j22L3J7P6j10P5Q6n4Km5p1J4j6J0J74K6j30M1k8p0L0N0q3J79
4380B50K0j39o1MJ08J29j54j11P6J15J1r9n1Q6j16Q8K7O2j9j99R4K8o5l8O4rm7J61j34KN3
3992A36J14j94NJ14p4K2m8l0O4nj0O6j17J8J94j44n5J59j22J06j61M3L6r3J70N9l1j20J75
3629B77M6n1r8j50O5K2LJ02M4j13l7k5Kl1Q2j14K79j79J8m3m3j2j6P7J31j16M3l3J1j19O3
3240H5O8lj4q9M3O1kP0k1mR3r9r1K1J85q9Nj27O20l74J48k85l8J397K468r15k594l48O6P3
$$ y = [30, 15, 100, 89, 41, 206, 228, 120, 99, 24, 19, 135, 62, 105, 93, 198, 71, 229, 288, 133, 158, 161, 137, 43, 39, 74, 126, 90, 116, 123, 96, 105, 153, 117, 45, 114, 185, 199, 56, 166, 100, 97, 139, 14, 92, 267, 336, 176, 310, 193, 168, 223, 167, 158, 189, 114, 190, 96, 80, 129, 129, 95, 80, 178, 160, 53, 44, 113, 47, 146, 63, 92, 332, 268, 84, 15, 193, 308, 234, 149, 192, 86, 79, 45, 59, 85, 255, 230, 77, 145, 29, 90, 120, 160, 148, 51, 216, 158, 95, 34, 82, 127, 187, 223, 13, 142, 166, 44, 77, 94, 170, 60, 135, 221, 167, 169, 124, 53, 67, 51, 61, 235, 261, 131, 172, 144, 74, 104, 154, 71, 250, 270, 131, 70, 74, 182, 311, 157, 46, 122, 237, 248, 149, 98, 184, 68, 156, 183, 245, 226, 27, 121, 149, 84, 46, 110, 101, 54, 215, 81, 83, 136, 250, 56, 61, 175, 101, 123, 75, 45, 109, 104, 94, 160, 43, 61, 255, 111, 56, 215, 93, 199, 38, 81, 117, 24, 194, 253, 222, 102, 277, 323, 272, 174, 24, 89, 111, 114, 216, 260, 147, 110, 85, 87, 56, 138, 24, 303, 124, 142, 99, 56, 44, 28, 105, 236, 120, 163, 130, 141, 22, 85, 153, 150, 136, 47, 90, 151, 149, 219, 198, 194, 287, 188, 97, 118, 303, 214, 219, 92, 712, 338, 486, 201, 163, 1560, 4028, 3113, 519, 171, 237, 310]
2865C10L09J87j81l05K00J445M24K340m123P631l804l306R5l53n5J05K371M601k177m405j175
2602A34L09l22K25n2p5j76J85j61J0J64j88J8J06p2J41j21n0O2Q7Oj04Jp1N4L7J12O2k01K48
2239C68k31K40k98J88j14J00R9k55M20l32M22J89J073K136K982L396l475J310j947l787k077
1976D07J460N098n38j906l317J198L62j44j819l94l20J7J8o7l6J55q4J14j33P1J19k4j43m2
1675E2M4N5N4j30M9k5kM3l2N8p9J54L5j8j5J06k29Nr7K88m0k00L5L9J51r3j64J02Q9j02L9
1287A72l0Nj17J2O5Lj02J5O4L5m3j5R3Q3j71O3j1Q9p8K4J5J3J46j12o8J68L40k62j86n7K2
899A75q2J54k1j51K30j40j00nKj4J06R8j28k3R4lj8Mj22LJ72l6L9o6p4J00q6M7j19J00N5k5
499A66j28M0NR2J9N7R4j31j31J10k9k3k5N0l6k1N4JLj12J1Q8k5k2J4m3m7J81K6k6J08j23m4
$$ y = [310, 619, 806, 625, 320, 520, 1965, 2389, 4729, 606, 8237, 4433, 1127, 1222, 869, 814, 919, 3290, 7891, 5714, 1309, 134, 443, 121, 346, 294, 219, 43, 228, 67, 77, 241, 53, 71, 177, 105, 246, 125, 75, 137, 224, 230, 126, 127, 56, 110, 147, 259, 321, 120, 368, 137, 377, 79, 267, 153, 253, 352, 97, 517, 185, 607, 796, 1869, 4005, 6987, 10383, 6908, 8218, 6271, 2484, 407, 1867, 6965, 6427, 4521, 1204, 2402, 2764, 2620, 801, 407, 87, 104, 122, 55, 19, 174, 90, 204, 71, 142, 261, 237, 94, 52, 96, 151, 205, 75, 124, 99, 97, 140, 108, 166, 87, 241, 276, 258, 243, 349, 120, 125, 28, 316, 276, 76, 111, 150, 301, 208, 44, 146, 235, 133, 172, 142, 147, 30, 42, 107, 110, 8, 23, 87, 122, 79, 64, 157, 240, 69, 132, 121, 210, 132, 156, 171, 184, 330, 218, 150, 318, 658, 396, 210, 153, 175, 93, 247, 226, 75, 305, 165, 65, 60, 62, 48, 154, 252, 124, 101, 195, 192, 174, 178, 56, 59, 231, 195, 234, 168, 94, 194, 108, 155, 36, 136, 191, 166, 38, 78, 83, 175, 194, 251, 345, 214, 83, 193, 164, 141, 116, 166, 130, 109, 163, 164, 167, 55, 66, 154, 129, 107, 121, 78, 31, 212, 238, 212, 320, 197, 153]
85A53M9p3J47m3j99M0M1M8mo3P3k3j14K3P6j16K56j26o7M7m5m9J10m9ln8N7J42N2moL3k04
-328A01m4J43r7Rl0
$$ y = [153, 202, 129, 276, 233, 34, 74, 115, 163, 159, 96, 169, 146, 32, 55, 131, 15, 271, 145, 78, 125, 80, 31, 141, 92, 89, 31, 88, 230, 282, 278, 272, 305, 101, 57, 200, 103, 112, 82]
-390H2
##PAGE=	F1=421.997
##FIRST=	25168.397401625570637,	6007.3700543999984802,	0.58976709842681884766
##DATA TABLE=	(F2++(Y..Y)), PROFILE
6007E3Kk5J5l9K64Nj41m7K2p8K7J4rRJ00j00J28O7j24L6m8n0o1M3M4M0n5L0M6l3M2j2m6m6
5582G3n4R2J23j44J05j73J00O4p1l3J24J34j29J00q9k2L0q5J8P5p6J1p2Jj0K1m8K6J32m8r5
5194H0K0M5r9J63p8m8K27j49j33mQ6J40l7n3M1nq9Ko1K7J56m4j56J35j25K6J38Rp6J7L5r0
4793A00op7O2L3j8J07j52R3nr2mJ9R0p5K5Q8pl9j5j10Q6n9J8P4K3l8K3j8j1j1J4j4J45j5j40
4355I4K3J0JJ07o4j00J50J0Rj18j8P7o8L2N6N8l0j87M0M8K2j04J5J4J0R4q9RQ4R8k02l0L3
3942H4K9k2o8rQ9N2p9O7j4pJ05p8p6J39m7J2j19R0J2j36K49M2j05j30J33R8M0j47j33RQ2r9
3541F3Q4P9j18l3J2O2k3k6k4J71j13K1J4qj33j7L3P2L4rm6K1J0l6R3l1mj18J57o5K2Q8p3k1
3115A38K5m4kq1O0j9K2mJ4P8N5J06o2j89L63l1j97j66J82j37MP9L9j36K7J84r4L78J534J229
$$ y = [53, 55, 30, 45, 6, 270, 275, 134, 87, 109, 31, 58, 72, 63, 72, 172, 72, 200, 267, 143, 179, 131, 81, 20, 63, 107, 147, 92, 122, 168, 135, 177, 165, 119, 73, 19, 111, 234, 90, 195, 22, 122, 186, 115, 82, 206, 340, 211, 311, 222, 200, 230, 145, 163, 238, 162, 173, 101, 102, 92, 113, 65, 91, 223, 175, 80, 100, 145, 46, 209, 131, 83, 310, 161, 28, 24, 110, 250, 213, 160, 201, 196, 107, 109, 48, 75, 231, 187, 31, 166, 41, 67, 205, 214, 138, 155, 190, 100, 94, 17, 79, 112, 94, 201, 49, 142, 137, 45, 41, 60, 150, 75, 100, 188, 181, 142, 127, 17, 103, 44, 62, 136, 159, 121, 144, 126, 115, 104, 118, 104, 249, 234, 94, 117, 127, 128, 235, 171, 71, 221, 231, 240, 122, 104, 181, 113, 145, 201, 259, 229, 42, 82, 130, 152, 48, 63, 77, 87, 181, 92, 101, 185, 283, 81, 51, 84, 113, 91, 23, 14, 103, 155, 76, 143, 129, 122, 227, 149, 73, 212, 165, 177, 58, 148, 160, 24, 273, 315, 210, 80, 213, 311, 351, 204, 71, 80, 162, 63, 147, 226, 108, 75, 87, 149, 126, 100, 76, 247, 134, 155, 169, 161, 28, 11, 44, 116, 150, 141, 95, 116, 126, 90, 183, 152, 148, 30, 187, 122, 144, 232, 159, 138, 163, 119, 117, 36, 96, 77, 99, 95, 109, 187, 242, 348, 286, 97, 460, 429, 232, 66, 248, 111, 115, 194, 233, 97, 124, 308, 214, 592, 2126, 3355]
2740C355k014r98nq5K1J01J037K019q94k086Q6j53k77J35r1n0m5J13m7LP6j11MJ5o0P2p8O7
2389A10m5P1L2L3j09l4OnJ96j00K2J71k49J06oj03P2p4M3j1l3K40j13R2L0K15J497N24m30
2026B148j930K45K48m16Q08K068n18p84j415L04M50K11j105Mj30mn1r8R3J87k76J28r6R2J15
1713B78o9n6j37R2m8J32n3p4J4m5J33K1j4r0K31J4o6M3O3k27n0p4K18K7j82k8L9K58p2k03
1337G5QJ32j55P6j5K6r4j2M4M5q1K2O7m3m9MJ22M8k11M6Q0Q3j19O8M8p3K68q7j44l4O4m0m8
924A21j9k6K1J21k0r8J84j85j9j2J7j4L7R6j32Q6J5O8j5pj55M2O0p8M7k9MJ2o2O8n9Q9J5k9
499A44j00O4mL5R3O0Q9j23j90J22p6j0J3R5j06J4Q3kl8q4j4P7j10PO3Q2p4J26k0M5N3j70n
85A39J21r5Q1k5j23j2N1l2K0k0R6o1j03j0P4o4J82j08j2Kn3%O4l3K0o6R4J54pQK9Rj53r5J38
$$ y = [3355, 1341, 343, 338, 253, 274, 375, 1412, 3431, 2537, 451, 537, 384, 107, 242, 151, 101, 56, 169, 122, 125, 201, 90, 94, 109, 49, 121, 43, 110, 65, 136, 168, 201, 92, 58, 64, 59, 255, 155, 177, 348, 99, 205, 199, 96, 168, 94, 137, 126, 93, 333, 220, 312, 342, 557, 2054, 2578, 2148, 218, 463, 711, 295, 1103, 3171, 2653, 1869, 454, 758, 1208, 1419, 314, 318, 188, 184, 133, 35, 128, 315, 39, 167, 71, 163, 278, 209, 153, 16, 108, 60, 192, 139, 65, 79, 34, 167, 188, 174, 84, 315, 329, 263, 306, 369, 142, 92, 18, 236, 263, 81, 53, 92, 350, 278, 75, 83, 215, 60, 136, 121, 147, 53, 41, 85, 130, 49, 71, 138, 95, 46, 50, 172, 220, 9, 55, 135, 218, 99, 167, 215, 142, 410, 323, 179, 145, 209, 169, 121, 102, 76, 97, 218, 198, 100, 284, 99, 80, 68, 85, 71, 108, 204, 72, 158, 173, 241, 226, 219, 64, 106, 166, 88, 135, 106, 110, 122, 60, 128, 69, 158, 173, 144, 44, 108, 104, 139, 232, 292, 381, 258, 68, 190, 114, 104, 117, 212, 106, 120, 203, 201, 163, 79, 65, 142, 32, 39, 102, 184, 110, 236, 216, 261, 314, 144, 139, 260, 165, 246, 221, 98, 86, 137, 105, 125, 105, 201, 140, 37, 27, 101, 37, 219, 111, 99, 101, 48, 48, 112, 79, 99, 33, 127, 281, 274, 282, 311, 320, 167, 72, 210]
-353B10p2l7J3
$$ y = [210, 138, 101, 114]
-390A14
##PAGE=	F1=319.739
##FIRST=	25168.397401625570637,	6007.3700543999984802,	0.41736152768135070801
##DATA TABLE=	(F2++(Y..Y)), PROFILE
6007I5n6k7K0J7J84M1j28r3J13j08k5L0onP4q9R1Q4l6K6o0m2Lm2L1M4k6M9M3m1N2l8l5q2P
5569F5J8J69j64L4n7P8O2rp8PJ56q5L3l0Pj6n4L6J02j26m3M5Lj14J4J6L2J09n3n9L6K3j22
5156C5J81o2p1J97j87k1j9L6O8OJ6J0N5p4n6o2K3J35n5o3Q8r7J8J27L8j22Q7n4j29N9o9O4
4755A02mp5J51n4j0JK5j13qJ06l4j2Q7J4j03K1l5K8n5J0KN4k1J2K8jql3J06N3n6j23P0M1j14
4317E2O5M5l8J50n3j3j19PP3j7n3P4K3Qj54L7l2J04m0j00J49qmp9K2J04N7j20q6l6P4N6j07
3904D1J7QP7o7KJ04J7L2m5p6R5Q5j54l7R0j9j28K62K4j77r6Q2J02Q1j04o2mL6j59N2M4q3k
3491C8NJ60j1j07O0J5Mj6Q6m5j49j8O8QO4k0n4L9O7r7J39o1lj28K12j14rM4l9l5J2m3O0j02
3065C0J4N3j4O7J76j49J22O0L5M5R38m01o36k32Q1j14j4k3L1N5M9K15K70R56k18q90m3l91
$$ y = [95, 39, 12, 32, 49, 233, 274, 146, 53, 166, 58, 33, 63, 57, 52, 126, 37, 128, 212, 176, 202, 142, 100, 103, 61, 92, 136, 110, 159, 202, 161, 213, 175, 140, 58, 65, 83, 252, 88, 122, 65, 143, 205, 196, 118, 125, 281, 196, 229, 199, 206, 190, 136, 172, 274, 148, 105, 150, 153, 39, 53, 69, 101, 210, 157, 98, 134, 157, 35, 216, 154, 83, 280, 93, 72, 53, 89, 157, 163, 179, 189, 244, 170, 114, 52, 75, 210, 155, 92, 180, 83, 101, 228, 266, 144, 231, 177, 48, 107, 38, 102, 98, 23, 174, 120, 110, 111, 136, 23, 15, 121, 87, 75, 162, 176, 73, 94, 59, 87, 32, 42, 44, 98, 77, 89, 117, 116, 108, 75, 181, 234, 178, 55, 125, 166, 52, 117, 162, 124, 274, 221, 208, 89, 96, 169, 152, 99, 173, 196, 204, 50, 87, 55, 159, 119, 19, 168, 160, 156, 77, 99, 203, 260, 140, 54, 18, 92, 148, 41, 58, 66, 143, 76, 78, 182, 199, 231, 186, 110, 205, 290, 136, 99, 189, 170, 42, 304, 328, 151, 55, 137, 239, 320, 216, 154, 150, 186, 27, 79, 123, 40, 38, 43, 203, 192, 85, 145, 160, 164, 148, 234, 189, 40, 22, 90, 98, 162, 142, 88, 127, 194, 97, 236, 175, 172, 44, 256, 142, 133, 177, 138, 103, 115, 72, 132, 30, 44, 97, 83, 150, 326, 177, 299, 359, 394, 439, 1377, 976, 340, 108, 189, 75, 61, 38, 69, 124, 173, 388, 658, 1614, 1396, 506, 463, 72]
2715G2J37j67J13r2J9J66Nj6P9m3j79K7lo6pR4L9j0j5m9m7ml7mM1O7k2OR3nl1j04J6M0M1m1
2264A13R9R3q3j08J01or6k0m7L5Q8K04k36R5J35J177N07O23j848J592m07r32j018M28km06
1938H1n4M1L42J64P4m42j9K7k8j22j6J77J44l16R2j34J09J49j11k4p2R5r7O9rq5k5P6Q1L6
1563B03m2p0K67o6j4J10n4k05p3m1J46L0j49J15L9J44p0j59nN0q8M8j9M5k2n3J8N7q3P3j8
1175A14m4K7N9rK6j02%J4R9q3Q1P3r1K75n7j99m8k3m2PnQRM6rJ3J30k46N9k3M7L5p1J12j38
736D4J41o0J20J6m5j24J6K0r0K2L2K8o1k1Q5nO3j2o8l4P1m3N2J30nM9r3j41M0o2l8O8J14j18
311I1L8J27n1m1n4n7P1n2l8M8J78q7J1m7J28m0j53M2J37o6j2O6p9p0M3k0k2oJ70j11r2M2m3
-102E1rJ48q2J7lp9K5jQP7q5P8J13m7K8M1j4l7j04K1k3l6O6
$$ y = [72, 209, 42, 155, 63, 82, 248, 253, 237, 316, 273, 94, 121, 118, 52, 45, 139, 178, 168, 153, 104, 57, 53, 16, 12, 53, 120, 98, 104, 197, 192, 161, 57, 73, 113, 154, 113, 212, 305, 222, 114, 215, 209, 113, 93, 46, 81, 169, 373, 137, 232, 367, 1544, 2051, 2674, 826, 2418, 2011, 1079, 61, 489, 487, 81, 27, 68, 410, 574, 648, 206, 187, 214, 186, 64, 48, 225, 369, 53, 145, 11, 120, 269, 158, 134, 62, 157, 60, 129, 120, 35, 10, 86, 167, 203, 161, 91, 358, 292, 278, 388, 334, 129, 56, 15, 161, 191, 42, 157, 196, 340, 270, 111, 106, 156, 68, 116, 97, 142, 120, 67, 85, 142, 59, 132, 114, 70, 97, 156, 147, 173, 71, 71, 85, 184, 101, 182, 255, 164, 439, 382, 183, 135, 112, 70, 77, 72, 80, 89, 135, 126, 139, 269, 23, 82, 59, 106, 141, 70, 182, 44, 185, 125, 245, 261, 216, 92, 108, 128, 38, 60, 92, 120, 59, 38, 123, 118, 181, 169, 101, 67, 138, 95, 147, 277, 272, 321, 228, 87, 127, 65, 27, 95, 209, 91, 129, 256, 205, 164, 110, 53, 124, 72, 34, 82, 260, 173, 184, 137, 265, 225, 72, 114, 251, 185, 173, 239, 160, 90, 133, 113, 91, 85, 255, 144, 52, 94, 51, 42, 190, 108, 125, 122, 43, 68, 67, 75, 152, 67, 145, 258, 211, 239, 280, 266, 229, 125, 146, 123, 87, 153]
-390A53
##PAGE=	F1=217.481
##FIRST=	25168.397401625570637,	6007.3700543999984802,	0.28752654790878295898
##DATA TABLE=	(F2++(Y..Y)), PROFILE
6007A48j25J2K8K4M0J11p3q2J05j19J4p0Q0%l0l5J6J00N9Ol8j7J7j44K5P3PO3K0p8O2j2j0
5594A77j58Q1PJ41j04j20P0M3M8K4q9n7J38n7l5N8L1p3J1M2J08k26l1J09K7j11k4Q5j0N5n3
5206A07m0N5J8j08J23l7JJ44p6n7l1J6k8K7O4l4Q8k7j27nK8Q1l5Npp1J02%R9j10Q6r3j09P2
4780A21p2L3j4K8K6N7q9J9Q0j34J2jL3k6P0j3j12J2Q0q5L5j7J08N5r1nk2j3L4l5K04m7o3j39
4355B9Q3N1j24M2Q1j6J13n6k6q5l5R6J4j40R6l1O2r8Q0q6O0Q2j47K15l5o9p3J8R1K3oj30J6
3942I5mN9o8lk6KN1r3J74M4L2n1q4M3K01k24m7N7K7o9J40L2k10l3M1J02oRj1K2k9j53O5l8
3516D7K6j2l0J57L2j42R8j14J62j06J47j26n1o6J43J4j5Rp3mQ9m4J51p5m6q9J78r2o2l2M7
3128A21m7O0r9P5r6Q7kkJ9K7j3J17k11K24j09M42k08j49j6n6j22M9K6j9K2K1K3K72N27o99
$$ y = [148, 23, 35, 63, 87, 127, 238, 165, 83, 188, 69, 83, 13, 93, 93, 63, 28, 44, 144, 203, 209, 171, 154, 171, 27, 52, 125, 132, 195, 215, 137, 199, 187, 177, 19, 100, 107, 248, 144, 24, 94, 137, 185, 209, 120, 63, 201, 144, 109, 167, 198, 125, 136, 178, 286, 60, 29, 138, 165, 54, 30, 115, 105, 160, 107, 67, 122, 140, 32, 155, 118, 119, 263, 187, 130, 99, 115, 87, 114, 178, 144, 232, 205, 78, 73, 101, 182, 147, 152, 145, 74, 176, 176, 275, 165, 251, 158, 49, 121, 49, 82, 68, 96, 122, 179, 90, 109, 189, 55, 67, 66, 99, 73, 143, 130, 18, 30, 110, 25, 60, 43, 151, 206, 115, 110, 88, 75, 109, 74, 278, 231, 168, 29, 112, 163, 39, 81, 162, 146, 259, 203, 177, 92, 57, 153, 167, 27, 123, 92, 154, 56, 136, 50, 110, 192, 45, 260, 225, 156, 83, 101, 192, 215, 209, 79, 95, 91, 150, 82, 79, 53, 55, 106, 13, 187, 231, 263, 212, 128, 171, 372, 148, 101, 158, 185, 116, 256, 288, 78, 45, 86, 188, 182, 191, 180, 202, 173, 20, 85, 47, 73, 61, 31, 188, 220, 78, 176, 62, 224, 118, 265, 139, 88, 22, 165, 179, 164, 173, 100, 96, 185, 141, 292, 217, 171, 82, 260, 168, 106, 74, 121, 74, 134, 35, 110, 14, 101, 99, 97, 116, 143, 130, 247, 36, 260, 151, 593, 385, 236, 220, 164, 42, 91, 117, 98, 120, 141, 164, 436, 963, 264]
2752B64R55n65m93K4j07J76j49K99M61l01L75k48m96k3j18J02j08J36q5P8k0q5j9k4J5KJ5
2414F1nJ4J10p7J17n3K6j69L4O8P7K7j4O2mk16J20K4j51pJN1J84n1j64M8L10L28K55L56j79
2026A183N5m71m49j29R9N11O5j93o32L76L6q6j80j70J79l1j39J06J33M1j90j2j9j6J52j13
1700A06l1N3M0l6l0n4J6K6K3L3KMl9K44j34Q1J66j76j95l7k2P8k9k7J31L4N7q5j13Q0j05K2
1300H3Rk4Q5mn9k9P9o8J25j57K7R1O1p5j5M2p7p6J10kPJ21n8K34n5k49m7J2J0jK0M7j03j9
874D5oJ34N6j99N5l6P8P2o7P2j49J16p6J16M0p7r2K2QK1N6j3m6r0K7P0K9K1Jj36M2M9m6Q3
448A80J11r8Mp7K1n3Mk4N5M3q6M0J69r7po2p8O7J3o3KJ93q1q9m1J81j10M5l3N0ro1J52m2j30
10H9LL1p1J0K17j44j08P8q6J8J46o3J9np9K0m6J37Q9j56L2L1n7O2M7j8O7j10j06N0j8J05
$$ y = [264, 1219, 654, 161, 185, 78, 254, 105, 404, 865, 564, 939, 691, 195, 172, 54, 156, 48, 184, 99, 177, 157, 72, 53, 29, 44, 46, 61, 56, 70, 180, 103, 220, 167, 193, 24, 58, 126, 203, 230, 216, 278, 274, 58, 178, 202, 51, 44, 45, 96, 280, 229, 65, 113, 423, 751, 1006, 1362, 1183, 1238, 767, 318, 189, 288, 799, 864, 671, 39, 415, 451, 365, 185, 15, 194, 163, 24, 130, 263, 304, 114, 102, 83, 67, 219, 106, 75, 128, 168, 132, 102, 48, 64, 90, 113, 146, 148, 152, 113, 357, 223, 304, 470, 294, 99, 62, 40, 118, 89, 62, 193, 227, 284, 199, 86, 166, 61, 83, 92, 68, 153, 149, 90, 61, 140, 72, 197, 40, 67, 158, 219, 144, 129, 171, 94, 18, 128, 126, 133, 254, 196, 430, 375, 126, 79, 91, 101, 100, 120, 167, 64, 45, 39, 173, 229, 30, 85, 49, 127, 199, 132, 204, 55, 171, 95, 211, 251, 174, 82, 104, 112, 133, 189, 176, 130, 40, 67, 137, 166, 187, 188, 52, 94, 143, 97, 180, 291, 193, 197, 120, 141, 88, 92, 68, 123, 166, 80, 120, 289, 192, 185, 123, 45, 112, 125, 62, 64, 257, 176, 87, 46, 227, 117, 162, 129, 179, 170, 109, 261, 219, 89, 92, 123, 52, 62, 279, 135, 27, 105, 19, 37, 183, 120, 139, 134, 55, 75, 29, 166, 255, 99, 131, 162, 105, 167, 214, 196, 263, 153, 47, 97, 79, 184]
-390A84
##PAGE=	F1=115.223
##FIRST=	25168.397401625570637,	6007.3700543999984802,	0.18504695594310760498
##DATA TABLE=	(F2++(Y..Y)), PROFILE
6007A93j31J9N1k2r0J64Nn3N1j03K4m5L1L5j11N7j2M5Q6%rKlj10n8J26qQ3j4j42Q9M6K3j36
5582H3K7l8J26L6r0o9K7M4K4l7r7J24n6o5J46K3j24M4O3P9j94l1N3M2n5rL4lRq9nM1K4p8P9
5143H8J8L6J07kr1llo2JN3o3J20Oj48L4M0lJ9L3q1l4J90j61J36o0N9o6o6L2q9Nj1Q9p3J41
4705A91p7jP7j25N8l1L7m2K9m4L9o1O8n7J3jJ55M5o8pj27m9P5lK64j09o4j50O6L6p1L2O2j4
4280A46N0j2n7m5j2R3qr7L7p0P5m1J02m9q9K15j54K23n9o8o6k3P2K9P6j17k8j7J3k3k1L6j2
3866I9J8j04J41O4P4o1j23mK82k24j08O5J06k6n4O3j75J7J6J72j40L0K1O6o1r4J25o1N2o0
3491A16k1K7P7j19Q6j44K53j93J56j90P1j15J66N3l8J2p3j00J09M5J39n6r3m8O4mo9q5J04
3128A30o0J04n8o3rP8p5O0m5J12r9L02j44p1O6J67J5l09K23jr3o3O2j10J1q8J77J65j43L99
$$ y = [193, 62, 81, 132, 110, 20, 184, 189, 136, 187, 84, 108, 63, 94, 129, 18, 75, 63, 108, 194, 194, 185, 187, 184, 74, 16, 142, 134, 217, 203, 61, 150, 196, 219, 83, 110, 72, 198, 234, 144, 75, 102, 146, 170, 133, 36, 160, 104, 39, 185, 208, 84, 128, 191, 270, 76, 45, 98, 140, 85, 76, 110, 107, 116, 27, 22, 63, 87, 9, 88, 106, 142, 249, 247, 156, 153, 150, 88, 89, 142, 79, 199, 205, 57, 91, 131, 128, 147, 180, 99, 65, 255, 94, 230, 170, 229, 163, 97, 129, 40, 45, 34, 123, 50, 191, 114, 113, 190, 65, 123, 92, 129, 87, 116, 72, 111, 50, 118, 61, 74, 73, 228, 273, 205, 198, 71, 22, 97, 94, 358, 249, 185, 35, 101, 137, 66, 98, 160, 146, 196, 184, 127, 82, 70, 163, 155, 58, 95, 25, 100, 59, 161, 112, 23, 238, 84, 307, 248, 180, 114, 91, 163, 192, 268, 151, 123, 106, 119, 96, 75, 111, 99, 117, 13, 154, 218, 292, 231, 108, 104, 386, 162, 54, 119, 225, 199, 145, 208, 33, 50, 66, 238, 98, 128, 149, 215, 154, 60, 185, 124, 176, 116, 95, 122, 199, 80, 166, 22, 275, 82, 238, 48, 119, 4, 170, 223, 185, 197, 124, 24, 133, 178, 317, 261, 168, 120, 184, 180, 111, 26, 130, 70, 174, 116, 53, 44, 122, 47, 107, 62, 174, 75, 377, 233, 162, 228, 395, 410, 101, 324, 323, 230, 167, 229, 119, 130, 42, 219, 384, 241, 640]
2752F40m4m08j7KJ0M6j40K13J83n7P02l43n96%j43J39j51K33k23J10m1r9O8k8N4l7J%m7K10
2377B37j23Q1n5O5j92R4L8J69l2o3P3l1k31R4N9j03o1M6J17R2j96M5p7K90j04L67L16l40n2
2013E23J08k09j85k9M05o1r5k93J22K27j13j81m1ll1r2J34L8p3m7o2J20j2Qn9l2R2kJ9k1j12
1625D3N0O4l7K6r3J09j6J82j25J24J85k42j65n5P3J2o7L2O6K3J2r3k2J03j50L0j8K9Q5m6j7
1237A02p2R3l4J52j85K7J08M5m7q2J78j46r3J7Q9m7R5J6J78p2k86L4j9K3J8R4M6j82N5l9J20
849A86k2p8rm3Q2R9LN2j86N2o3P9K9n2o1O9j9N8R7n5j13q1Q5O3L2k7K6j70Q8j1J7N2N5j45
423H9%J1J41j19m2J3O6m2l9K0J73q6L1j19m4O6Pq1N3Q9n4p5K8Q3o7J54r7q2M2l3J63Kj55o5
-2C1Q3p1J7J85j48j9j5m6L9J22n4L4j4q6L5m0J91Q3j99l4o3M0N3L4lJ04j14o9K8l7J20
$$ y = [640, 596, 188, 171, 173, 183, 229, 89, 302, 485, 428, 1130, 787, 191, 191, 48, 187, 36, 269, 46, 156, 115, 16, 84, 56, 110, 73, 74, 74, 27, 237, 114, 195, 140, 205, 13, 107, 145, 314, 282, 219, 292, 261, 30, 124, 183, 80, 19, 65, 182, 274, 78, 123, 46, 336, 232, 599, 915, 575, 523, 631, 422, 237, 208, 613, 552, 457, 164, 286, 513, 400, 219, 178, 175, 144, 52, 186, 224, 151, 104, 42, 162, 150, 158, 99, 67, 159, 157, 176, 155, 43, 93, 157, 120, 146, 53, 162, 146, 328, 203, 327, 512, 270, 105, 50, 123, 135, 68, 100, 166, 189, 201, 108, 86, 189, 39, 69, 51, 80, 165, 119, 102, 30, 123, 89, 241, 56, 83, 191, 236, 189, 107, 285, 139, 46, 63, 152, 105, 200, 216, 394, 322, 36, 70, 51, 74, 92, 186, 232, 50, 105, 66, 186, 164, 86, 77, 34, 116, 215, 218, 270, 84, 136, 73, 152, 181, 129, 68, 137, 118, 176, 273, 218, 105, 24, 109, 172, 204, 177, 203, 33, 121, 110, 127, 179, 234, 89, 89, 100, 241, 122, 80, 93, 159, 117, 78, 98, 271, 185, 216, 97, 53, 119, 126, 45, 98, 187, 133, 58, 86, 169, 102, 256, 159, 77, 119, 86, 249, 251, 96, 31, 114, 43, 60, 245, 97, 78, 63, 17, 56, 178, 124, 158, 144, 58, 93, 53, 244, 327, 128, 94, 31, 71, 124, 158, 155, 259, 145, 76, 104, 67, 187]
-390A87
##PAGE=	F1=12.9655
##FIRST=	25168.397401625570637,	6007.3700543999984802,	0.074800498783588409424
##DATA TABLE=	(F2++(Y..Y)), PROFILE
6007B13j36N7O1m8j00P9O1m8L1p9J9Rl6M6l1NNK5J1QQK8m4k1p1J23o6J28p1j28N6R0N0r9J0
5569A45q5M0J66p6j35j8Q5O5K1j99J54p3j1J47J5j35jJ16J2l8j18PM1l3j3j8N4pm0J%n9N8
5156F8L1P3l4O6L5q2L7k6p5j7K1p3J47Nj12M2J4p7R8N3n5j5J73j72L4k2M4L8n3k1o5pm0O9
4730A02n2R3%l4M1r6Q5J0Jn9rL6P0q9l3O0p5M4J41K9KKj17j25L0L6K82j10r3j00kM0l8J6N7
4292A45K6m8O0j38K4J01L4q3rl4pJ0k5P8mm9J50j51K11o7j5m1j23P9O9J08q9j04j2PJ0o1R8
3879A50N0r9r7R4J02J05p2j78k9L14k09q0J14J01k3k08P9p3J9mK36n6j48M6R9p0o5J87j19
3516A66R5q2j9j02R8J9m0o6K06k07J16j21M5p0P8R9Pk7k8o5k5Q9J13kr8m6p6J26jr9N2k6Q7
3103A96M0j46K6m0M0Kp5K17k02K13n1q8J41K58j14l41K68J21p1k80J00j01k3P5J51M3N7o3
$$ y = [213, 77, 134, 195, 147, 47, 126, 187, 139, 170, 91, 110, 119, 83, 129, 98, 103, 108, 133, 144, 152, 160, 188, 144, 123, 52, 175, 109, 237, 166, 38, 94, 184, 234, 135, 145, 60, 100, 266, 190, 55, 37, 122, 187, 208, 9, 163, 90, 79, 226, 241, 106, 105, 221, 233, 195, 77, 84, 125, 92, 79, 61, 115, 108, 68, 69, 69, 10, 68, 99, 172, 138, 204, 239, 157, 194, 168, 93, 76, 97, 24, 171, 176, 64, 106, 120, 43, 141, 194, 139, 124, 297, 125, 159, 137, 181, 219, 166, 145, 80, 73, 33, 102, 50, 143, 143, 109, 150, 54, 139, 149, 150, 91, 82, 118, 188, 99, 66, 126, 51, 95, 236, 265, 267, 269, 152, 27, 57, 93, 375, 265, 172, 72, 70, 110, 72, 88, 145, 171, 123, 183, 45, 69, 170, 204, 121, 112, 78, 71, 81, 56, 134, 130, 81, 231, 80, 291, 224, 209, 168, 45, 124, 193, 301, 212, 108, 96, 103, 113, 52, 150, 200, 101, 4, 98, 200, 305, 233, 55, 26, 340, 131, 51, 165, 266, 243, 35, 114, 41, 60, 56, 292, 236, 88, 134, 233, 163, 98, 285, 166, 261, 179, 160, 58, 156, 175, 135, 69, 275, 68, 184, 63, 108, 38, 116, 215, 222, 195, 167, 102, 77, 166, 279, 277, 179, 133, 57, 183, 182, 83, 135, 109, 196, 236, 90, 116, 76, 116, 118, 43, 260, 58, 271, 220, 132, 273, 531, 417, 76, 344, 465, 394, 114, 214, 113, 90, 165, 316, 359, 416, 353]
2752C53j07J5m7L0Mq3P3j50R4o0J02k11J95j02j4J27j77J94k01P4k4p2J59r5M8pq0O8m7J68
2377B27j00J1o0J31j56J15K9J42j04nP3j12j42J1J11j15k0K1J13L0j62J06k1J34J32K05M10
2039A004p18N55l6l38l61k6J14m5j13K24j26K19j97N5L8n8q7k1Q5n4p4N0j3J36l4l7mj5K1
1675A44MM6K2r6m1J00p9O6j00J14%J18q3J03J45k31j15n4J37k2o8j6J6J5kl8P3N0j08m0KN3
1275A15L5j09N7n4N2kJ34j48oR9N2rj08K50j81j15l3J37jm2R5J17r6j00J1o2n4Q4J19K8k00
887F5R7m9N5j7Nq7n8O6J15O9N0j99ko9M6NJ9l6J02l8M1J03j10j22K1R6O6Jo4K2j51R1p9R7
461A51l6nj3L3Q2J22k12r1J6J12n6j3mJ11qL7j73K8P8q4m0J51o3mj2K2j3RJ38j10j34M4K4
48H7J16J9j16m6P6or1J41j24J12p5j8J7P7n1O7j8j07O9o1J81R1j84r4J8P7k8jQP6r8J3Po4
$$ y = [353, 246, 261, 214, 244, 248, 165, 238, 88, 182, 122, 224, 13, 208, 106, 92, 219, 42, 236, 35, 109, 85, 13, 172, 77, 125, 118, 38, 106, 59, 227, 127, 138, 78, 209, 53, 168, 197, 339, 235, 230, 303, 191, 49, 60, 171, 56, 36, 57, 170, 200, 38, 144, 123, 257, 389, 594, 1004, 286, 841, 805, 467, 106, 80, 194, 149, 36, 260, 134, 353, 156, 211, 249, 191, 104, 83, 168, 114, 40, 90, 77, 213, 179, 142, 138, 123, 144, 148, 194, 216, 120, 79, 179, 100, 166, 66, 180, 180, 298, 215, 318, 463, 232, 117, 63, 200, 178, 110, 94, 110, 125, 123, 85, 158, 208, 100, 60, 62, 115, 150, 41, 98, 44, 96, 94, 228, 80, 74, 173, 225, 216, 108, 358, 177, 62, 29, 166, 165, 123, 218, 335, 239, 139, 150, 88, 34, 118, 237, 265, 65, 162, 113, 168, 151, 156, 69, 11, 77, 192, 261, 311, 112, 110, 41, 87, 92, 111, 75, 177, 139, 180, 283, 173, 51, 72, 168, 234, 235, 171, 193, 42, 133, 54, 151, 115, 110, 97, 130, 212, 334, 122, 31, 47, 159, 103, 90, 86, 197, 189, 226, 53, 81, 159, 75, 35, 186, 123, 119, 107, 129, 116, 125, 263, 153, 19, 63, 87, 203, 222, 106, 60, 136, 130, 39, 180, 56, 168, 93, 75, 92, 169, 118, 185, 167, 60, 129, 68, 249, 340, 156, 62, 80, 157, 129, 128, 136, 212, 114, 127, 134, 70]
-378G0R2
$$ y = [70, 162]
-390A62
##PAGE=	F1=-89.2924
##FIRST=	25168.397401625570637,	6007.3700543999984802,	0.12866960465908050537
##DATA TABLE=	(F2++(Y..Y)), PROFILE
6007B04j31Q0P6oj47kQ0p9O0n7J0K4l8L0N1m1PM6r2K8kO9q4K6J8P1j37J92j40k5l2Q4P2p9
5582A36M6lj21J55n9q3k0P5J43k1j88J07r4J7J61K2j31l0J44o6P5j71m4P2k6l1jO0J9J3m4
5194A12N3j03J14p8J15q7NP3m4N2o6q4K8J7q8J09jn1P6q4j7P8Q6l6k0J22p9r9j7L1J72m2n6
4780A91l0m3q7LN7l2R2n5Mm8N0M1%p9J3J11L0j15k1Q2j18P5P5J3N6N6o6k18oM2K32o5j06j6
4355A18q6M9pN4nJ01j65J23j09P0R7j5j50M3p1L2J6m9K1M4N0K1j48K06o3N0Oj84K9J07J12
3967B97p1j46j1O0K5j30J18P3j61k4L1J24J12p9j59j6K09j72N5P8N4m9j40m5M3Ml6K34M5j79
3591A44M5R0j07n1K10j69J46p6j3j42O4J38j74j9J38j36J22n5q3K2%O9Q8q6M8j7j45Q8M1O7
3215B47p5k7J0L4Q7j66j3P2J5J30j26j5n7R9q3q5J62p3o8lj1K1J5l6K2K27K05n4m14P3j5j7
$$ y = [204, 73, 153, 229, 223, 76, 74, 154, 75, 135, 78, 88, 112, 74, 104, 155, 114, 121, 167, 75, 103, 101, 170, 86, 112, 130, 201, 64, 256, 116, 91, 59, 143, 215, 136, 182, 179, 58, 213, 154, 71, 51, 126, 269, 248, 60, 167, 73, 90, 251, 273, 142, 112, 256, 190, 265, 94, 50, 122, 96, 65, 64, 124, 143, 156, 112, 165, 62, 176, 98, 213, 126, 131, 204, 160, 212, 146, 62, 90, 107, 19, 128, 127, 76, 152, 68, 51, 129, 215, 179, 159, 281, 202, 103, 86, 117, 289, 247, 191, 161, 118, 31, 34, 91, 59, 151, 96, 100, 52, 102, 143, 143, 64, 77, 188, 218, 103, 82, 164, 46, 121, 196, 209, 265, 321, 255, 37, 31, 73, 305, 240, 134, 118, 32, 81, 74, 128, 123, 224, 59, 182, 73, 143, 240, 225, 75, 118, 47, 79, 95, 46, 67, 111, 161, 182, 34, 240, 177, 227, 233, 49, 78, 185, 297, 226, 80, 69, 129, 154, 24, 142, 215, 54, 30, 61, 185, 297, 218, 59, 43, 252, 80, 135, 213, 267, 218, 78, 33, 76, 80, 44, 278, 323, 144, 189, 279, 172, 121, 331, 162, 308, 232, 219, 77, 141, 279, 105, 86, 224, 88, 210, 155, 72, 94, 94, 163, 251, 165, 213, 196, 51, 139, 180, 247, 172, 145, 155, 189, 276, 110, 97, 169, 184, 314, 188, 173, 116, 215, 132, 47, 209, 136, 68, 65, 54, 75, 90, 54, 76, 303, 508, 454, 40, 113, 98, 81]
2815H1J76j27k7J05n7K88k28k0J12l3j47K11k99L62j97P00j30n83j70J77N9k00N8q1J8O1p6
2477C3J97j11k4Q9j61J12r0J18m1l4J8J01j23J22N7L8j65J01L8j57m1k5N2q1J8K4K9L3j03
2114B4J05rql1K33J19j72o9L5q8p2k5J78R8j49R6k00KO9R0J1m6j42P8k6K3Q5m5k9Q2q7K1K8
1700A79j3p1N0L1O4n2j49J24j27J22m1P7J8O5p3O4M3j48n5L0R2m3p5k7k0RK9L2M1M1r1o2O4
1287A28J4l8n2M7j7KM4J8r4k5P3J04mq2K41j92p8k2Q7L0j13J33N4j24R7m7l6MJ9Q5J1j85Q0
874A62l6MM6L2j41l1P0O7O1N8j48n1p3J8M5K4k8J25n5K3P8j84M9M2O2O3j6p8k6j35Q8m1Q4
461A58j21kJ33J3Q5J09l02M5n6Q8k1j6l2K2R1Jj29M6R6j61M6J64j20L2l2j8m1J5J02o8m0k7
60F0L6N3jn0j2O8O7j40L8n6J42m2l2j3N0m4P7j6j07Q7r5J16J30j22j13N1O2p5j0lK8n2M3L4
$$ y = [81, 257, 130, 103, 208, 151, 439, 211, 191, 303, 270, 123, 334, 35, 397, 200, 900, 770, 187, 17, 194, 253, 53, 111, 30, 48, 109, 33, 230, 119, 95, 184, 23, 135, 45, 163, 122, 88, 106, 207, 84, 206, 263, 301, 136, 237, 275, 118, 77, 52, 104, 23, 41, 65, 94, 127, 24, 129, 120, 112, 81, 314, 433, 261, 192, 227, 139, 67, 42, 220, 318, 169, 265, 65, 67, 136, 226, 237, 191, 49, 127, 101, 124, 209, 164, 135, 217, 130, 151, 179, 166, 95, 145, 176, 240, 188, 39, 163, 36, 158, 117, 194, 212, 277, 204, 268, 311, 163, 108, 138, 230, 187, 112, 85, 65, 74, 103, 135, 176, 217, 126, 64, 128, 142, 104, 52, 99, 82, 84, 128, 146, 52, 27, 100, 204, 200, 118, 359, 167, 89, 67, 154, 184, 71, 204, 258, 134, 231, 184, 148, 152, 171, 256, 267, 82, 162, 126, 130, 176, 208, 67, 36, 106, 173, 234, 292, 144, 93, 20, 38, 83, 107, 79, 204, 149, 172, 250, 66, 115, 157, 219, 282, 266, 188, 162, 27, 115, 74, 158, 37, 35, 168, 181, 266, 375, 73, 118, 62, 150, 129, 113, 81, 103, 194, 195, 66, 112, 208, 47, 93, 257, 137, 169, 137, 119, 78, 93, 195, 127, 87, 60, 96, 149, 148, 98, 86, 154, 221, 81, 119, 63, 205, 163, 131, 118, 168, 124, 201, 185, 78, 165, 70, 186, 316, 194, 81, 132, 194, 119, 109, 106, 134, 82, 125, 159]
-365A59p9M4
$$ y = [159, 80, 124]
-390A24
##PAGE=	F1=-191.55
##FIRST=	25168.397401625570637,	6007.3700543999984802,	0.39224615693092346191
##DATA TABLE=	(F2++(Y..Y)), PROFILE
6007A74r5L8J11O4k04j1N7r4L9k1k5L1mK3Q3o0K1N9j64P2o4J24j03MJ27Rj70K27j35J6o5K2
5607H6Q9q9R0Q6j20k7k1KJ7M2J68j20r4N0r6J9J67J9j00k0J10r3J16j76n6M9Oo1N0L3P5J5
5206B16q7Q9j26J78k14J57q7j1P6j1K8j23l6O8J1l8l2K9K6J18j01j8pJ36q6k2Q3%j41J5j8
4818G2K45mp2j4q1j23O3J1l1P5o7PNn1M6L5q5P5J17l4j19J15k2p3P1Kk2O2J57l8k91P6m8J10
4392A69j3k2J2o4k6N3R5j12J63k47J43J0P2Nm1j61M8n6K4L9n6L8J6J01l7j10J44n2R1L0j36
4004A20q1J23Q7p6j01j5J17J8j72Q4L5p8k1L5O8J13o5q4k8O7n3J04K1qr0k3o2Q6j4q6J79J10
3604C10j14M4O8j50j1J49j71J83p0Oj20L5J61k23oO7l4J71p9j60R4J0n5J41j33J39j0j78Q1
3240A45m8P6n1Q2P7q0J18j66j17J76o8J60m8m8l4O6q7j04R5O5Nj17qRJ74Kk21K00K05o5k47
$$ y = [174, 79, 117, 228, 292, 88, 77, 134, 40, 79, 58, 33, 64, 60, 83, 166, 106, 127, 186, 22, 94, 30, 154, 51, 55, 182, 191, 21, 248, 113, 129, 64, 86, 175, 86, 176, 262, 142, 115, 94, 96, 113, 155, 323, 203, 109, 159, 63, 82, 249, 268, 168, 148, 258, 165, 281, 105, 49, 98, 104, 43, 93, 126, 201, 216, 129, 218, 92, 270, 56, 213, 126, 115, 191, 180, 208, 85, 49, 117, 128, 90, 58, 87, 113, 231, 130, 112, 105, 241, 155, 133, 216, 216, 75, 90, 72, 317, 313, 241, 227, 146, 23, 86, 97, 66, 141, 74, 81, 86, 35, 81, 116, 31, 106, 223, 189, 70, 185, 163, 90, 161, 163, 141, 203, 360, 322, 31, 107, 59, 169, 156, 134, 146, 82, 56, 109, 204, 92, 255, 8, 151, 161, 233, 238, 197, 36, 84, 28, 52, 91, 35, 73, 89, 190, 153, 43, 187, 135, 226, 256, 120, 39, 162, 249, 173, 72, 57, 174, 192, 20, 104, 139, 61, 40, 75, 143, 256, 191, 107, 79, 146, 93, 197, 218, 210, 120, 97, 35, 121, 107, 21, 200, 310, 196, 240, 308, 158, 147, 296, 125, 308, 238, 244, 124, 159, 320, 97, 91, 158, 124, 295, 216, 56, 150, 160, 105, 246, 113, 252, 242, 64, 145, 97, 173, 122, 204, 281, 201, 319, 153, 36, 212, 144, 304, 256, 208, 174, 240, 153, 49, 144, 209, 214, 97, 89, 98, 272, 274, 53, 253, 458, 393, 146]
2852A46km1J14N5j92K3K65j32o7j06L9K30q1j10J60j62P5j19M10j75k57l4K13j4k15QO3l0
2502F4P4j13K48r6j20J54j23N6j03M4Rn0J39Rj27J54J01p3j33J00Kj07k5Rj9J%j9l3O5k8O7
2101A27p7J03K07J26Q2n06N03l32j00Lj8m3Q3n0J28n8n8Q2j2k0n4p9P7m4J78O1r4n2Pj11Q4
1713A43N6k5j34R9j3P2J8j68P1n0N4rQ8L7J4j13M9n5o3K7R8Oo1j5j3o4%J05K3k6K9m0o7Q7
1287A60k4r1O5Pkj1J04r5l2k1J0J09k4k4J68j87Ml3L5K3o6J05J2j69K31q8JM2l6Q5kj65L2
874A23k3kN1P0j65K8P9L5n6P9k9r8n7J5P8j7o7J58o2J8N1j22R7J6J9N4J7m7r3j30M4N5L7l9
448A17QO0jO8R7k70J03m3K3jk7q4L5J17p5m7M5R8q8J9J25j16O0q2o3k9j2J16k2j5j8K5j3l1
23G9j1JQ9J24r7j41J6R1K9l1l1O2j6K0%q4R0r4OJ81m0j37QN7r3rj1J3jK1N8r0M0
$$ y = [146, 144, 103, 217, 272, 80, 103, 368, 236, 169, 63, 102, 332, 251, 141, 301, 139, 214, 95, 505, 330, 73, 39, 252, 238, 23, 31, 94, 64, 138, 25, 273, 177, 57, 211, 88, 144, 41, 85, 94, 44, 183, 192, 65, 219, 320, 247, 114, 214, 216, 109, 84, 93, 74, 75, 75, 56, 23, 88, 60, 127, 50, 153, 360, 486, 568, 62, 565, 233, 133, 136, 118, 75, 158, 108, 236, 178, 120, 202, 190, 170, 116, 37, 114, 70, 248, 309, 215, 163, 170, 59, 143, 199, 174, 40, 139, 126, 198, 216, 48, 119, 69, 123, 114, 202, 239, 253, 140, 189, 134, 71, 98, 196, 202, 141, 126, 113, 49, 49, 154, 177, 151, 180, 140, 73, 160, 136, 45, 110, 117, 115, 104, 208, 113, 81, 60, 70, 179, 155, 131, 299, 112, 116, 83, 118, 141, 75, 180, 192, 23, 254, 166, 167, 209, 173, 258, 256, 91, 123, 100, 98, 149, 219, 54, 82, 161, 196, 140, 219, 190, 92, 35, 50, 128, 111, 44, 202, 140, 158, 209, 87, 184, 200, 219, 273, 290, 243, 150, 20, 64, 119, 156, 117, 125, 185, 184, 252, 349, 79, 182, 139, 162, 161, 134, 50, 85, 202, 127, 80, 125, 223, 135, 154, 279, 163, 223, 141, 78, 49, 37, 153, 131, 116, 98, 123, 110, 79, 68, 69, 158, 282, 185, 44, 60, 151, 180, 149, 118, 180, 164, 184, 184, 100, 190, 96, 102, 283, 243, 106, 114, 171, 78, 69, 58, 71, 70, 91, 149, 59, 99]
-390I9
##PAGE=	F1=-293.808
##FIRST=	25168.397401625570637,	6007.3700543999984802,	0.28704684972763061523
##DATA TABLE=	(F2++(Y..Y)), PROFILE
6007A40m7m9J58J13k27P7l5K5r8j3RO6rl7O1n6O5N2j69J10j07J29n0n1J11l6r4J62n8L3j00
5619G5l7R8j21J06J52r5j15L0K8kQ5J28k19QJ9o2J4J36k1l6j3N9o2J05j61jm1M6p6N5L5J35
5219B52j0j24R4j36K33k27J33p0K5L3Kj7j67J07mj5Q4j21L0N1J50o7j17m5J88j75k0P9K5j29
4843D2Q5%J55M8p7qj00q7J22j01N7k6o1L3O8r9l9Q1rM0R6q8q0J82j12lQ2l2r5N8K36l8k89
4430D1J25r3M2l8J06m9ql5R5O2j89J91j81L6J10P1j05n3q4M0l3m7Q0l8R0n0P8nq7N0j2R4L
4017B07m0j44J18J7r0K8l3J35Lj68O9q2J03q7N0rR7j8l7j4l8O1Q8j9q5l1k4M8N0j7o0O5Q0
3604B23k7M3N5j66L7L4j31J99r1M5o9J7J20j82j6J8M8J77j04j52J23K4j63J27r1J88n9j57
3253G0P0Pp0l4K20N3j03N6o9j32J40j08J04P8n4p9L8j5j11Q7R1m5r2P8q1J13mj65J68J39q4
$$ y = [140, 93, 44, 202, 315, 88, 165, 130, 155, 57, 44, 53, 119, 110, 73, 134, 78, 143, 195, 26, 136, 29, 158, 108, 57, 168, 132, 38, 200, 142, 175, 75, 38, 136, 15, 121, 273, 178, 63, 93, 121, 119, 204, 332, 113, 121, 140, 78, 92, 228, 207, 171, 158, 217, 155, 260, 99, 98, 57, 103, 27, 82, 117, 252, 242, 118, 212, 76, 309, 82, 215, 145, 170, 203, 205, 188, 21, 128, 124, 109, 193, 72, 102, 153, 303, 236, 119, 74, 262, 87, 67, 146, 171, 42, 127, 127, 282, 330, 253, 245, 145, 58, 180, 79, 136, 110, 49, 82, 150, 51, 12, 93, 84, 124, 220, 132, 52, 234, 122, 119, 201, 169, 74, 132, 368, 330, 41, 166, 73, 115, 77, 183, 134, 126, 91, 186, 248, 59, 250, 69, 105, 215, 286, 181, 128, 44, 84, 51, 4, 84, 46, 136, 86, 164, 159, 72, 122, 110, 204, 207, 167, 23, 141, 158, 68, 96, 63, 198, 201, 33, 102, 20, 123, 36, 86, 77, 174, 156, 119, 105, 67, 128, 216, 197, 112, 81, 57, 105, 155, 138, 78, 143, 223, 196, 239, 294, 128, 165, 199, 68, 267, 176, 221, 152, 169, 289, 107, 91, 109, 157, 334, 230, 78, 201, 225, 62, 189, 98, 286, 227, 70, 140, 147, 77, 43, 263, 316, 213, 269, 200, 68, 208, 100, 204, 282, 228, 149, 187, 172, 61, 148, 239, 194, 102, 180, 99, 212, 208, 43, 211, 350, 266]
2865B66r4M9r3J77p3r5K1J54k15K43j54j70K41q2jJ9L7k15L43R38k53r35J9J15m9j04L3O9
2514A91q4M4o7K45r4j94J46m5K3m7o5J3j7J58o0m4J12J36j62k0rOn1m6N2P7o4m9j6PoN1Jo6
2089E6J42L9mJ09j03K48m11N4m3J12K1j70l4J99r2K5n9J1k5o9Q2k7K7J99K5j13k5q9pM3O7
1700A88n3o1N2n0K8Q3j26mJ09l4m6J11M4n4j74R4L4j21R1R2p1k6P8o2q3RJ61j0lr8N2n6M3
1287A37n0n3Q8j2ORJ54m6r5k5O2j9n6N2O6j70O9k6Pj0J7M4J7r7J59j12J3M9o0J65j7j68Nm8
862E5M9m3J40j61R1L4M7j83J01R9j10o3N1O4k9q6Q8k4J3L5pJ5k0j0N8Q0Nj02j55k3J19J4K5
448A67l8K6PL9O8j39N1j6rok0j11J27O6j59j2O5P8K1oN9r3P9j24o7l1J07P0m2n2J1N0p7k3
23F6LK7J02J05l7k13nk1J09ql3R6L2q3L0p1R1o9n4J84J9j69m7O9r2J1l1N5J5j5L2m1M2
$$ y = [266, 172, 221, 128, 305, 232, 137, 158, 312, 97, 340, 186, 16, 257, 175, 174, 193, 230, 15, 358, 1296, 1043, 108, 127, 242, 193, 89, 122, 191, 107, 151, 84, 329, 235, 41, 187, 142, 165, 118, 53, 66, 49, 207, 147, 103, 215, 351, 189, 169, 160, 166, 115, 69, 121, 198, 134, 85, 69, 76, 70, 121, 122, 56, 198, 237, 233, 342, 239, 487, 76, 130, 87, 199, 220, 50, 16, 215, 123, 148, 89, 100, 75, 6, 88, 61, 88, 287, 312, 199, 174, 85, 78, 121, 188, 135, 74, 126, 76, 104, 187, 61, 57, 166, 132, 86, 197, 241, 187, 13, 107, 141, 20, 111, 203, 132, 106, 184, 122, 39, 48, 209, 199, 196, 98, 150, 94, 137, 87, 34, 122, 110, 116, 125, 279, 233, 138, 113, 175, 156, 100, 152, 218, 48, 117, 91, 98, 88, 105, 149, 166, 69, 228, 116, 129, 178, 118, 283, 266, 98, 103, 55, 104, 61, 201, 40, 131, 165, 212, 29, 130, 229, 119, 56, 107, 171, 142, 56, 144, 120, 133, 168, 161, 176, 156, 146, 204, 284, 289, 187, 32, 9, 128, 142, 167, 129, 155, 162, 201, 269, 130, 181, 165, 156, 150, 130, 19, 146, 212, 53, 41, 106, 184, 205, 199, 258, 165, 244, 120, 53, 22, 129, 199, 157, 105, 116, 166, 89, 66, 69, 96, 198, 303, 266, 53, 48, 27, 136, 128, 95, 191, 223, 140, 170, 99, 190, 121, 67, 251, 270, 101, 54, 123, 31, 42, 11, 66, 81, 66, 98, 57, 99]
-390I9
##PAGE=	F1=-396.066
##FIRST=	25168.397401625570637,	6007.3700543999984802,	0.43468275666236877441
##DATA TABLE=	(F2++(Y..Y)), PROFILE
6007A12on7J16J29k09J81j75J29j06p4O6N9Kj12M3l8Q7N6j66J42j27J20K7j30K3l2oP7rM8
5632A70j09m2Q7m7j5J78p3p1Q6k4m9J56O0k33K5J8j2PQ3q8L3j0K9l4R5j56L7o2P4l8l8P6J58
5219B71l1j50R4j25K28j55J05o7K5K5j8m4j00J53r3j0J65j38OL0J61n3j89j8K02k21j0Q2j0
4856A15q0R7O6K7O2q0Pr5k7J23j64J24j28J9rJ50r8p6N2M2pO5p8m1J43j23M3R9l7j72R3K13
4455C25l7k38J30p6J04n8P5j39M6K6R9k6j67J66r4n6J54N1j53p8J1R0o9k8O7l9R5r5L0J8q4
4067E0pN4O6n0P7j28O4p2L0N0n9J07j0j39J26p6N1o7jJ8j1L7J3No7O9O1j9j35J70j88J41K
3654A62KpK1n5L3L1N3j58O6k2n3J29j23Q2j2JP9j24j6QO9J29r0p3J09K1k42P4O1J58j40r1
3253H2M7R6j58K7J72rk8q2Q0j37Q1n1m2J90m0j59L8P2q8J14J6r8M8N4k09L1l0P1O6O9o0lP4
$$ y = [112, 106, 49, 165, 294, 85, 266, 91, 220, 114, 40, 106, 165, 167, 55, 98, 60, 147, 203, 37, 179, 52, 172, 199, 69, 92, 60, 54, 131, 122, 170, 61, 19, 106, 59, 44, 222, 149, 78, 164, 140, 91, 247, 307, 74, 99, 117, 105, 112, 195, 107, 140, 130, 159, 125, 220, 64, 101, 39, 113, 75, 37, 113, 271, 240, 90, 184, 59, 287, 132, 237, 170, 195, 220, 202, 158, 58, 211, 118, 108, 273, 135, 141, 171, 332, 279, 90, 72, 274, 53, 43, 125, 115, 35, 132, 198, 225, 287, 207, 214, 119, 92, 215, 51, 175, 47, 66, 57, 207, 109, 33, 85, 127, 120, 185, 107, 66, 209, 86, 129, 228, 191, 19, 112, 325, 288, 50, 180, 104, 208, 150, 225, 86, 132, 158, 257, 231, 64, 230, 136, 80, 234, 285, 132, 54, 65, 155, 86, 58, 125, 86, 181, 86, 116, 134, 50, 43, 97, 163, 113, 190, 62, 126, 54, 84, 134, 75, 182, 172, 33, 159, 83, 134, 67, 66, 84, 73, 110, 123, 128, 61, 130, 191, 172, 37, 207, 19, 160, 162, 164, 157, 178, 123, 156, 187, 240, 82, 148, 126, 73, 202, 79, 161, 149, 150, 229, 105, 89, 97, 166, 295, 205, 132, 241, 262, 20, 94, 155, 313, 173, 82, 129, 225, 67, 94, 266, 257, 229, 147, 227, 90, 171, 120, 78, 268, 228, 69, 107, 179, 91, 205, 221, 123, 171, 225, 16, 47, 17, 88, 154, 223, 163, 160, 234]
2840B34q5J39j03j02J02j23K60N4k57q1R3qK4l4M0p3N20J316m88j339Q1RJ5n9L3O5j12K5K8
2477A74J87p1k38R4M0J1m0p6pN0O1j19J30j2J60k15P0o5k8J4o0O1J49q5j02N6j7l7P0l9j0
2089A06R5m6P7q1M7J71R2l21o9J09J0j12N9P2j96R5o8K5j4K1Q4m4l9J50mo3K8j53Q0j6M4q4
1688E5P3k4l8MR5r6k8J66m5q8R7L4j44P6m3P8r2N4K8j09J07O3j32n4K5J66k6O0k20R5j1j6
1287A10o3J2M4m5J3O3J56K8j67m2J28p5q5Q8j4j43J07Pj2k9L5kM7m2P8j30LJ8m5K81l2j90
887A02J3n2P9q5J24j10J02o2P0m7l7J35j01n9J04L0l5j4j09N0J7jN5p7n5j7J00J02M1m6j82
499C5L1N5j3M9r4P4O%J7l0OJ0l7l1J7k0J21K3j62j7J9N0J17Mnp2Q3j32k8k8J84j0n6r6K1J09
48B00j26K8NQ9O4L4j0j60l6J5k3L0l6J08P1j53N2q4Q2m5rJ11L8j69l0P6j01J18n4oK5k5MM3
$$ y = [234, 149, 288, 185, 83, 185, 62, 322, 376, 119, 38, 131, 123, 147, 113, 153, 80, 600, 1916, 1428, 89, 170, 179, 194, 135, 168, 233, 121, 146, 174, 361, 290, 52, 146, 186, 197, 157, 81, 74, 124, 185, 66, 196, 184, 344, 129, 199, 134, 106, 120, 60, 121, 270, 185, 83, 139, 122, 85, 155, 116, 106, 201, 155, 232, 151, 198, 369, 461, 140, 71, 180, 190, 78, 137, 209, 13, 108, 40, 65, 51, 72, 156, 112, 73, 223, 219, 156, 184, 31, 111, 95, 139, 55, 128, 104, 66, 70, 165, 69, 41, 207, 162, 74, 171, 205, 61, 137, 94, 172, 80, 134, 162, 53, 160, 223, 91, 37, 62, 228, 202, 262, 42, 137, 126, 110, 47, 59, 103, 58, 71, 134, 290, 318, 151, 109, 237, 162, 77, 165, 151, 8, 115, 122, 110, 81, 116, 114, 161, 119, 197, 67, 70, 88, 43, 324, 292, 102, 115, 63, 142, 57, 181, 71, 173, 111, 181, 134, 97, 232, 131, 72, 176, 206, 171, 157, 48, 98, 115, 114, 169, 92, 37, 20, 120, 222, 263, 217, 35, 66, 121, 108, 157, 63, 137, 143, 143, 160, 130, 136, 146, 109, 78, 95, 75, 196, 219, 57, 40, 59, 109, 226, 230, 225, 153, 236, 104, 76, 48, 232, 222, 166, 70, 91, 200, 74, 102, 107, 196, 260, 294, 284, 124, 88, 103, 80, 110, 74, 182, 253, 100, 152, 68, 150, 105, 96, 207, 245, 76, 46, 122, 21, 139, 85, 79, 104, 79, 83, 126]
-378A26j8
$$ y = [126, 108]
-390A08
##PAGE=	F1=-498.324
##FIRST=	25168.397401625570637,	6007.3700543999984802,	0.88403517007827758789
##DATA TABLE=	(F2++(Y..Y)), PROFILE
6007I9K5l2M5J07j61K38l03J88n8r9O2K0L1j22O5l6N0R7j47J21j23R8P9k23J5O1o1N7n6N2
5632H9n3j3P9Lo5J04n9PJ61j02m0J49k4j75J4J7K1QL8j07K5NL2m4R9j26Q6o1Q0n5n4P7J33
5219B49l6j44R7r3J57q5J10o9ML3p3k3n3J91j38L0J20j35K9j5J59p1j75J3J95j89j9O1m2n
4843H3K3J12j6Rq4K8n0j1Q9j55J52j17P4j10J87q3j03M6M9j2K6%m5R2l1k2J08l6j92Q5J42
4455B38j1j93J20j4J09n4L2j87P6Q9O6j08o6J31m2r7J30Pj27r0N7J55q6j2M9n3J06j20j4l1
4079F0k0K7L4Mp1J58l5n0m5J03j0n5M0k0r8J94p0m3pn9J06m6m3J00l2p3O2K7Qp9K12k02Q0
3666A57k3K4L7Lj36M9J1L5j34R1O7o4J8j09O9K2mN6q7J5K5J5N8m2M6N7Qj69p2J62J28j84k8
3253A01R2R7j34K6N1q6R9k27K04j63Q8O5j09J06k0j38K7J08n0R4o2k6J02l3j26M2j2L4r2N7
$$ y = [99, 124, 92, 137, 244, 83, 321, 18, 206, 148, 49, 111, 131, 162, 40, 105, 69, 119, 216, 69, 190, 67, 165, 244, 21, 36, 97, 36, 93, 37, 89, 36, 23, 102, 105, 40, 144, 85, 92, 253, 151, 111, 260, 236, 61, 75, 92, 113, 121, 159, 52, 77, 82, 114, 70, 169, 43, 129, 68, 148, 93, 39, 116, 249, 213, 69, 166, 73, 230, 145, 255, 186, 190, 223, 150, 127, 74, 265, 127, 157, 277, 142, 171, 156, 315, 244, 69, 82, 277, 88, 69, 130, 88, 83, 106, 218, 202, 211, 127, 155, 105, 94, 183, 28, 180, 63, 137, 27, 214, 131, 28, 74, 123, 111, 137, 137, 92, 184, 153, 131, 239, 203, 11, 96, 238, 227, 34, 154, 140, 249, 195, 227, 40, 116, 205, 271, 163, 97, 228, 186, 89, 219, 226, 99, 9, 66, 221, 135, 123, 172, 119, 225, 105, 91, 60, 40, 67, 101, 105, 34, 192, 157, 107, 62, 165, 155, 100, 140, 120, 22, 216, 146, 103, 96, 37, 143, 97, 54, 154, 122, 49, 111, 138, 146, 67, 279, 77, 157, 134, 158, 195, 198, 62, 111, 122, 157, 23, 114, 181, 117, 135, 26, 95, 117, 113, 169, 82, 97, 122, 137, 195, 153, 199, 256, 264, 95, 23, 185, 313, 129, 101, 193, 290, 156, 182, 233, 147, 246, 19, 223, 60, 148, 213, 104, 210, 190, 52, 79, 187, 137, 231, 169, 143, 245, 212, 86, 128, 116, 150, 58, 115]
2877A15JL5M7m9L8l3n2K7m5K20Lk06J6j8L8l1k4k8J75n0N5J52k11n6L2N6r1O8J9j02M7P1J01
2464C20J1k67N3J08l5n2l5PM6k1j13K09j08J68k21J48m1j24R3k7j1J54o1o3M4m8l7K4k7j1
2089H3J91M5J03j19j54L21M7m34P9r8n2K1K12l5j17k6R1r5N4l3J11k9j38J33p7P2M6q4j3k2
1713H3l6j4J22p9NM2Q1r8j2P7k7o2L7M4p7J60r3o1KM6l8o2J41L9j36l8L4J18j5P3j72QN3j9
1287A26m8j9K2kn7J22Q7Q5j98o6J55j7q4L8k9q8J03K2n1K2m9J1O3j4N7j23j7k8J3K91l7j97
887I3K0m4R8k6L1p6R9j58P2J12n7L6r7nJ47l0o5N7j08j4M7q3Q3j13P3Rk9L4M9M3j39L0M7n9
461G7M1r3J20k2k9m8L3J7K2n5pMN1J03pj00K1j13L4J60M5o1o2R7j01Qm0J92j02l5j08mJ68
48B06j43O3oJ64J5l1l1j13j4O5r5K3k7P3O0j40N1j10P4l7P5K3K9r0J0O3p5J51q4k5Mk6L6L0
$$ y = [115, 116, 151, 198, 149, 187, 154, 102, 129, 84, 304, 307, 101, 117, 99, 137, 106, 82, 54, 229, 179, 234, 386, 175, 119, 151, 207, 116, 184, 203, 101, 148, 219, 320, 331, 64, 117, 225, 190, 138, 103, 110, 156, 135, 22, 231, 123, 291, 70, 218, 177, 53, 146, 119, 108, 262, 201, 138, 182, 134, 97, 121, 94, 83, 274, 319, 422, 303, 149, 470, 517, 83, 162, 64, 12, 33, 245, 210, 93, 67, 158, 63, 117, 84, 195, 166, 28, 161, 84, 156, 202, 118, 105, 83, 47, 33, 155, 76, 81, 123, 204, 106, 94, 171, 144, 82, 119, 163, 86, 246, 153, 92, 94, 140, 102, 40, 181, 220, 84, 46, 80, 198, 183, 256, 84, 92, 145, 126, 78, 59, 81, 79, 22, 144, 231, 316, 118, 52, 207, 190, 106, 144, 115, 27, 130, 152, 101, 123, 74, 85, 148, 134, 191, 68, 51, 23, 36, 327, 290, 93, 113, 69, 167, 141, 172, 96, 195, 37, 109, 221, 164, 200, 103, 98, 245, 215, 150, 207, 99, 85, 132, 49, 132, 19, 92, 101, 72, 106, 155, 198, 59, 89, 136, 77, 118, 25, 145, 123, 94, 46, 79, 96, 118, 63, 56, 60, 111, 214, 207, 107, 128, 15, 49, 209, 254, 193, 131, 228, 127, 135, 95, 287, 185, 150, 42, 38, 206, 63, 126, 120, 284, 299, 268, 237, 124, 110, 175, 80, 103, 76, 149, 209, 69, 120, 10, 84, 47, 122, 145, 174, 84, 94, 157, 82, 233, 149, 124, 128, 102, 138, 168]
-378A68o3
$$ y = [168, 105]
-390A05
##PAGE=	F1=-600.582
##FIRST=	25168.397401625570637,	6007.3700543999984802,	0.91258156299591064453
##DATA TABLE=	(F2++(Y..Y)), PROFILE
6007I8M2m5L3L9j01K21k09O2j4n9N6J7n4oM0m4MJ44j08M2m2pR3j24NN4q2N8l3R1p1p8J19k5
5582A16o4J9kL5J98j29k2R9j23l3j8oON3Pm4q4N8K1j0L0j7J35q4J0n6L7j9P6l0r5P1o2R8k7
5143A44J14o1J7rj44M3n8K31j25K6J6j01R6p8J68j02j36J6K08j67l3N0k3K6l2Q2L1n2p1K3
4768I9L1q1R7q4J18k0L6j17P9o2p6L8K5L9NM4m0Q4J2j00J07m2j73M9P1L4j51R8O4L6o7J9j49
4355B3Q3R9Oj33L8J33m6q9N2l1q9rJ5J87o4mQn8J55j16n5n2M9J4J1q3k3J42Q7j12m1P8k8k6
3929A21j2l1n4K23p5o0j2l3J02%j14J18j01n7P7qL0l5J90j42l7%K7M9j0j23L7L3k9MN1J21
3528B50j42m3j4kK4M0J7p1O1M1q3j0K5J45qjo6j20J02J19j42l4J80N4j13J0Oj58J58j64J20
3140A81j69J63J07j47p%m5NJ09k2J3n5JJ25p0q7p6L9J91j75j4J9N1K9k0o7P6L7j71J5J42J21
$$ y = [98, 140, 95, 128, 167, 66, 287, 78, 140, 126, 67, 123, 140, 86, 80, 120, 76, 80, 224, 116, 158, 116, 109, 202, 78, 83, 137, 55, 113, 80, 171, 100, 22, 141, 116, 52, 71, 69, 104, 302, 173, 151, 250, 127, 94, 76, 70, 76, 129, 136, 92, 8, 66, 87, 77, 107, 90, 225, 141, 151, 95, 132, 113, 189, 159, 64, 135, 73, 171, 144, 258, 197, 214, 205, 61, 104, 46, 277, 152, 178, 194, 93, 189, 111, 279, 177, 41, 57, 265, 98, 65, 115, 92, 118, 86, 168, 199, 147, 76, 99, 130, 49, 146, 62, 180, 160, 196, 79, 158, 96, 20, 58, 83, 122, 127, 171, 131, 215, 227, 127, 234, 192, 19, 68, 139, 173, 22, 120, 184, 220, 153, 172, 23, 106, 205, 211, 78, 116, 249, 203, 114, 166, 135, 46, 37, 52, 239, 175, 171, 179, 121, 276, 160, 105, 53, 102, 116, 127, 44, 21, 163, 250, 138, 97, 175, 147, 121, 109, 78, 24, 247, 172, 112, 100, 67, 169, 169, 55, 173, 72, 15, 92, 84, 114, 79, 269, 127, 90, 90, 117, 166, 156, 33, 70, 103, 74, 78, 129, 250, 108, 65, 51, 49, 73, 113, 130, 59, 120, 161, 78, 68, 93, 238, 230, 229, 163, 43, 145, 264, 122, 88, 268, 322, 209, 219, 225, 67, 225, 61, 181, 12, 175, 282, 135, 128, 128, 83, 88, 197, 175, 188, 133, 134, 259, 189, 102, 26, 65, 256, 81, 67, 86, 137, 166, 146, 79, 155, 192, 21, 36, 178, 299]
2740B99j70N0q5L3Qm7J19J33M39K459m96k286l09J02m7n3K8j0r3J24J3RJ10k64M0J42j03m7
2389I8NM3k5n1%J30j13J13j69K14j5l1m0K7m3P8m2J1om9m8n1pL0K70r4L8k14J08O8n5n9Q4
1976B05j40J7PJ42m9j04N5J55j91L8l4O6jj04J77j06M3N0o1p6K2m2J4O5r9L8L5R6r1k3j6J3
1575A01J6o7R8K0J02p1j15KL3n6qO2Q2l9j16M6O7j0L5p7n6R1k8j6j8k5R6q9R5j5J02j85M0
1162I7%R2n9l9K2k8M5L1j09J23j40M5M9%P7j01l5J2k8K19m8j59M0o9J18L6k3r2J12j44M1J49
761B34Pq4j05R1J55j10q1Q1m6n1Q2j51P6OO4qj22j0K0R0n4MR3r1kPK7l2l6krN6Nj4N3o2K4
298A05P7j1l4M4j46mJ57Q3j18n2J19o1J9n8J62j62%p0J1J08p4K1k8K24rq0p1r0L0P7q0j3J9
-115I5K2k8o6N1j6ml2J02m1J2L3J1K7k3J44r9ql3l7M6np5
$$ y = [299, 129, 179, 94, 127, 135, 88, 207, 340, 779, 3238, 2742, 456, 147, 249, 202, 149, 177, 167, 74, 198, 211, 220, 330, 66, 106, 248, 145, 98, 103, 146, 121, 70, 70, 200, 87, 200, 31, 245, 230, 199, 159, 186, 143, 221, 179, 190, 184, 135, 87, 36, 29, 59, 329, 235, 273, 59, 167, 235, 180, 121, 205, 65, 82, 89, 231, 182, 78, 133, 288, 97, 135, 101, 167, 166, 62, 239, 133, 176, 226, 165, 89, 111, 69, 83, 148, 49, 87, 122, 218, 127, 104, 88, 101, 117, 50, 148, 168, 270, 199, 84, 86, 119, 63, 55, 117, 199, 160, 44, 90, 157, 147, 182, 105, 49, 140, 112, 96, 78, 53, 149, 60, 155, 140, 242, 57, 97, 97, 189, 130, 91, 113, 85, 130, 161, 52, 175, 35, 80, 129, 129, 206, 105, 70, 82, 54, 273, 225, 66, 106, 37, 155, 191, 168, 76, 188, 44, 85, 234, 241, 157, 52, 143, 298, 188, 107, 188, 142, 91, 173, 22, 98, 104, 168, 160, 38, 28, 48, 138, 84, 88, 181, 90, 88, 95, 122, 90, 54, 52, 43, 99, 104, 90, 143, 81, 105, 182, 171, 137, 181, 35, 31, 188, 271, 153, 101, 220, 159, 178, 120, 282, 120, 120, 50, 61, 169, 95, 116, 88, 312, 303, 223, 152, 62, 92, 169, 89, 76, 95, 117, 89, 23, 74, 58, 54, 22, 124, 83, 95, 128, 139, 166, 143, 287, 188, 180, 147, 110, 156, 151, 76]
-390G6
##PAGE=	F1=-702.84
##FIRST=	25168.397401625570637,	6007.3700543999984802,	0.54781013727188110352
##DATA TABLE=	(F2++(Y..Y)), PROFILE
6007A04L8o7N1m8m9J61o4Nn7M6P7O1k02N6Qm9K5J12n1o1O9j11L3N3l1J5J0oM3J57j36j86J89
5594A95r8o7J0P1pJ62o2n6Q8j34R3r4l5n9J39qm8n3O1j9N1q5P7J78o9j45J00M3j33J6l0k7
5194E5K3k6P2K3R6l4N6j01q5J9r1K37o1l8p2J9J20j51J80j06p8m7K26j56l4M1K9Lk7k4J41
4805B09p8l3j9N7r0J15m6Q8lPr2m9m5L9j5mJ10J0Mj7O9J5j17J04n6j22N6k8P6q1N9J02o3r8
4380F4Mn3R3N6l3q7N4J49n7p7l1j6j9J7j7J49k3Rm4l9K09j05p2RKqJ9j17L0L5J74q9j01M8
3954A33j2lo%p7K20q2l9m0J3M4K7n7M2j27M5J4l2K4j4J59k8j11RJ8k5j4m8O3L0n6N2L2J14
3528B68k19L0L2o9j1J46j1j04P4N6j44jL8J42o4jNj26K2J18o3p8K39J8r7pK7j14K7m5K5q6
3128B7J86N5j85jL4n4J6R8Jm6Kk0P1Lo4P7j07K80j80j17K8N8K1n2q4J33P9j29K4Q4m2j58Q4
$$ y = [104, 142, 75, 126, 78, 29, 190, 126, 131, 74, 120, 197, 258, 56, 112, 120, 71, 96, 208, 157, 96, 165, 54, 87, 140, 109, 124, 134, 128, 171, 328, 192, 6, 195, 97, 30, 40, 111, 104, 266, 204, 148, 236, 102, 195, 101, 66, 7, 146, 138, 90, 37, 98, 79, 130, 45, 122, 300, 231, 86, 186, 229, 96, 112, 82, 55, 78, 52, 124, 147, 243, 209, 265, 164, 79, 98, 7, 244, 183, 145, 73, 92, 212, 61, 241, 135, 57, 10, 236, 80, 46, 87, 116, 119, 92, 68, 209, 131, 98, 79, 136, 46, 161, 115, 203, 200, 207, 115, 66, 21, 60, 45, 41, 151, 161, 165, 148, 217, 232, 115, 219, 163, 41, 97, 69, 145, 64, 123, 225, 162, 64, 68, 15, 108, 164, 131, 44, 98, 247, 190, 113, 82, 66, 47, 64, 47, 196, 173, 182, 138, 99, 308, 203, 131, 140, 142, 134, 153, 36, 66, 101, 275, 186, 85, 133, 121, 118, 112, 112, 35, 255, 173, 134, 94, 107, 151, 178, 121, 163, 36, 81, 95, 63, 87, 73, 232, 204, 93, 102, 120, 95, 81, 33, 96, 126, 70, 122, 154, 268, 49, 79, 111, 42, 31, 177, 166, 62, 136, 192, 48, 47, 85, 227, 163, 162, 167, 41, 63, 181, 118, 40, 279, 297, 200, 193, 220, 106, 133, 88, 113, 27, 213, 268, 83, 82, 116, 62, 78, 176, 177, 131, 133, 113, 184, 187, 123, 200, 93, 373, 193, 76, 104, 162, 183, 131, 47, 180, 259, 130, 154, 238, 196, 38, 122]
2715A22l2J3n2MP5J03M04J870m14j708l25J92m0k9l9L5r3J23k7n8J26j79K0J37j18%j8M2p5
2352E9pRQ4n9Oj8J75K3L8j75P0k6J3n7M0kl5o5Oj8K3K20k33N4J39q0m5M3M8kj05j00K6K6L2
1913A07m0J29J10j72m1O8m6J9l1K27p7r7Q9j04l5N9or4N2r2N0oR3n6n6oP1N2j46J26L0M0k
1500B15or3k7m5J0m2J72L4j76O9O1p0nPlN3j07L8L9r0J29j09R2m4M4j20J73j64J02j4q4R4
1100A33K5n9N0j36J80n6k3%PQ7p7l7J8n5J18p6o3O2k1N2R8o3j56J50r3R7OJ00j44j13J77J31
699C19j83OL7p5J1R5j44K5M6M4l3o1M1l3rPL3J13j19m8P8q8j0mN2m3N7j6J7O2p3m2M4J2J1
261A29N3j18K4Q1J06j65l6J03j6kn9J33j70K9l1L9j4O1m5m7K06J1j19r1m0L7O1n2l7P7Oo5
-140D9PJ4M1n2j7N7n6QJ19J4n1L1J37j01pl9o3K1j6o3
$$ y = [122, 90, 103, 51, 55, 130, 233, 637, 2507, 2093, 385, 60, 252, 212, 183, 144, 179, 86, 209, 182, 124, 250, 71, 91, 228, 110, 110, 92, 134, 59, 52, 61, 145, 86, 92, 74, 249, 272, 310, 135, 205, 179, 192, 135, 175, 173, 138, 73, 79, 61, 84, 304, 71, 125, 264, 184, 139, 182, 230, 228, 123, 23, 49, 75, 107, 67, 196, 306, 134, 93, 161, 115, 134, 103, 330, 253, 156, 245, 141, 106, 165, 159, 65, 117, 25, 75, 69, 162, 106, 50, 44, 115, 167, 21, 147, 177, 217, 215, 209, 116, 89, 44, 54, 12, 184, 218, 42, 111, 172, 102, 97, 104, 101, 154, 47, 85, 124, 34, 163, 54, 146, 102, 146, 26, 199, 35, 137, 123, 39, 133, 158, 99, 149, 13, 193, 137, 114, 114, 121, 208, 131, 94, 112, 57, 175, 99, 36, 98, 77, 129, 227, 164, 8, 158, 65, 162, 168, 268, 124, 11, 188, 319, 136, 142, 179, 104, 115, 210, 66, 91, 137, 181, 148, 87, 128, 95, 86, 93, 126, 239, 120, 72, 150, 62, 52, 48, 100, 57, 114, 98, 115, 177, 104, 62, 106, 118, 129, 182, 64, 88, 169, 275, 110, 74, 177, 161, 159, 100, 233, 63, 92, 61, 100, 86, 147, 102, 55, 261, 272, 153, 62, 22, 59, 120, 68, 31, 108, 114, 49, 56, 70, 111, 59, 42, 99, 43, 51, 170, 184, 133, 164, 301, 200, 193, 154, 91, 112, 96, 33]
-390C3
##PAGE=	F1=-805.097
##FIRST=	25168.397401625570637,	6007.3700543999984802,	0.72286576032638549805
##DATA TABLE=	(F2++(Y..Y)), PROFILE
6007A09K3p5N6k2p5J36k2O0j13J17M6Q3j82l9K7q3J11K3Jj41J29k2j09J06km4J10r1P7K04
5632C98j31k39J97j22k6NM8%K2O7j08J03o6R7j09o5j9R9k6n0j5O2m6O4p9Q0J76k0k60K49P
5244B93k11Ql2nl4QN8N3N9K2O3j81N8n2m3J08L5j17l3J24P0j63J02m6lr8J53j52k1P6J8l5
4843H2J7m5J82q8k8l1K0K9L6k5N4n5K3o3p7L5K7o5k5J74Op1J3K9J0n6J08q1n1M2p1R1l3L8
4417A51R1j49k8K2j3L4M3nm8o6J46j3p1m1pK0JOM3NL0q1L2J91r8p5Q5o2j7J4q0N8q5J69l6
3979A66j04M8nj4O3N9j82K21j04l8j6L5j8K9N1l5m9M1J0n7k0j7J74P1j15p0N5j36MJ5J25m9
3578A38k4nK5R5j59J19Jj33l5K34j2j67M9O7p7Pj1O4r1JJ9pq0J44n7m8J56Po0j9L6m2j29R5
3153A01j7m4J86m0j67R8M4m4m0K0L6J6Ol1p1J08NM7j29L41k07q0pO2J5j05r9J68N9p9J00K5
$$ y = [109, 132, 57, 113, 91, 16, 152, 130, 190, 77, 194, 240, 323, 141, 102, 129, 46, 157, 180, 181, 40, 169, 147, 38, 144, 142, 98, 208, 117, 194, 398, 267, 28, 225, 103, 77, 82, 130, 130, 152, 219, 111, 214, 148, 245, 136, 71, 52, 151, 125, 75, 60, 122, 76, 140, 61, 141, 317, 297, 37, 286, 293, 82, 90, 58, 53, 19, 27, 85, 138, 197, 219, 282, 101, 159, 107, 64, 172, 207, 90, 57, 181, 251, 88, 190, 144, 141, 43, 196, 44, 23, 99, 117, 82, 99, 54, 236, 148, 120, 89, 109, 138, 174, 149, 203, 148, 171, 108, 31, 66, 93, 28, 3, 177, 183, 112, 125, 154, 164, 108, 216, 135, 84, 126, 55, 146, 113, 151, 242, 93, 65, 87, 74, 108, 151, 146, 98, 32, 178, 165, 94, 53, 46, 66, 67, 73, 116, 121, 151, 70, 102, 293, 195, 120, 205, 143, 126, 140, 60, 118, 33, 202, 166, 62, 110, 105, 91, 154, 213, 31, 252, 148, 110, 94, 129, 111, 140, 191, 156, 107, 148, 158, 101, 81, 64, 238, 309, 194, 124, 179, 43, 47, 62, 187, 138, 114, 109, 134, 229, 70, 189, 190, 57, 22, 256, 244, 77, 126, 193, 116, 123, 112, 176, 85, 86, 105, 98, 18, 162, 105, 57, 213, 220, 160, 141, 177, 135, 6, 101, 84, 40, 226, 186, 19, 117, 161, 117, 77, 97, 133, 149, 155, 124, 53, 161, 166, 213, 84, 425, 218, 138, 131, 193, 208, 103, 4, 172, 231, 152, 252, 277]
2752B77j92Q6J1l8l6N8NK6oR05K622r42k555O0k01K03j33r4J48o5l1N5o9J5rLQ0n6O6r4l8
2364F1OJ1mJ9m7rQ4R8Q2jk11R0l7K0m7k4N9l7l6L1K1n0J55j57M6J18l6k9N6l7P7j53P2j79
1938A2Q7q0Q0P5J4o4r1J69n7n8L4K34l4k24J40j55N6Q2l7j64N8m5J0l4O9j6oK0M6O8j20J25
1538A94L5p7N7O1j13n6j0N9k6M6K9j53J20L7j49J3M5L8L3r6k8Q1p3N9r8Q7Nl2L1J43j42m7
1137G3J6p7J44N6j53N7n9J03L5l4n7J8N2m5j0%m7pj2j3L8L8J9J30j12p1M7o9J64j66J51j12
736I7q3J96P9k11J02L1j22N8P2j21mM0N0o6N4nn7Qj7Q5J02j44q3J37j63j8O8Nm7N7j2K3L9
323A50n6p3M5pJ7Q1o8J04o9J36j80j3L3J7j6o2J29j42M2jM4p0J32p4QN8O4j61m8L5j6O7p3
-90C3JN8K5J0m0LL4n0l7L3qkJ38J1j34O1J58r5n1j1r3pK6k7
$$ y = [277, 85, 171, 182, 144, 108, 166, 171, 197, 191, 1096, 3718, 2776, 221, 281, 80, 283, 150, 56, 204, 139, 108, 163, 94, 109, 100, 103, 183, 127, 193, 99, 61, 67, 78, 74, 93, 46, 37, 121, 219, 301, 300, 89, 179, 142, 162, 115, 91, 150, 113, 77, 108, 129, 79, 234, 77, 123, 241, 205, 176, 232, 195, 272, 119, 191, 12, 99, 19, 99, 174, 188, 124, 33, 202, 145, 87, 121, 355, 321, 97, 237, 82, 138, 220, 183, 19, 77, 32, 42, 8, 77, 61, 55, 75, 121, 189, 69, 194, 229, 152, 209, 270, 157, 101, 91, 150, 124, 170, 199, 46, 166, 203, 54, 67, 112, 150, 183, 87, 59, 140, 67, 126, 28, 115, 120, 88, 119, 262, 120, 73, 89, 12, 156, 212, 59, 116, 57, 160, 195, 161, 104, 122, 174, 129, 119, 119, 72, 65, 53, 40, 78, 116, 135, 265, 153, 82, 129, 60, 224, 58, 209, 97, 14, 210, 289, 78, 180, 211, 89, 147, 219, 98, 94, 134, 184, 118, 172, 167, 110, 118, 101, 186, 288, 144, 61, 198, 35, 17, 85, 90, 43, 100, 88, 111, 150, 94, 21, 66, 59, 76, 157, 89, 193, 124, 260, 80, 67, 100, 117, 101, 39, 168, 26, 68, 67, 111, 41, 173, 99, 107, 165, 229, 68, 20, 55, 39, 106, 33, 34, 92, 117, 127, 87, 90, 124, 74, 37, 70, 62, 60, 198, 209, 75, 136, 294, 199, 148, 137, 44, 37, 63, 36]
-390C6
##PAGE=	F1=-907.355
##FIRST=	25168.397401625570637,	6007.3700543999984802,	0.83689951896667480469
##DATA TABLE=	(F2++(Y..Y)), PROFILE
6007A03K4p1L1P7j15J50q2R9j01J13l0R3j00j05P1j33J95l9Jj65J01Q9j05J2P8o0J18j36L6
5644A49K14o1k52J63p6j3pJO5j29J52j13Q5n8Q5n3r0J5M9k8M6l0J2o5M6RN3J24J3j76J77j4
5244B93k05N1j0n8m7j1L5M9K2R4L4k26J73q2Kj1Q9j27J7J62L4j30l1N7K1j36J02j29M4P0p2
4856G4n7P5J2J15p2l2k5K2Q5m1Kl0r4Q9n2jLL6r4M0J21j0j17M6j6j3N0J16j11Mqo5J11rJ4
4417A68M6k11J00P4o6rQ7Qm5p9k4R2%k1j03J6K8M8k4l3M5n8J07Q2j03p3J93j28k0j9%M6j11
4004A3O4qj7P3j3n5J57Q9k81K04j15m7M6M9m9RJ16p5rL6N7r3q6k5K16J21j33j52R9j54J7L2
3604H6J56j11K4r5J8P7k9J39k2j57nK21j0j85pN3K0j9m5Mo6jl2J25n0J25j18QPJ4K5j2J3k2
3178A29k0K5J7j02J49q7j7Q1K3L6j03q2J6J41K3j04k9J4Q7j01m7L11k10P2q3M3Jk2q7L2K9
$$ y = [103, 127, 56, 87, 164, 49, 199, 117, 216, 115, 228, 198, 291, 191, 86, 157, 24, 219, 180, 181, 16, 117, 206, 101, 113, 191, 131, 249, 113, 149, 363, 302, 50, 213, 137, 124, 117, 118, 183, 54, 206, 93, 178, 120, 205, 152, 62, 77, 126, 98, 144, 114, 126, 61, 107, 116, 169, 293, 306, 130, 307, 293, 88, 139, 129, 71, 24, 13, 48, 97, 119, 213, 247, 21, 194, 112, 114, 103, 192, 65, 82, 244, 278, 148, 117, 174, 195, 59, 161, 32, 76, 146, 74, 17, 92, 104, 219, 147, 115, 90, 112, 197, 156, 158, 128, 34, 123, 71, 70, 73, 109, 15, 55, 176, 166, 49, 95, 79, 66, 116, 232, 121, 125, 117, 52, 163, 154, 168, 214, 3, 103, 177, 111, 102, 189, 197, 152, 73, 49, 141, 141, 120, 17, 33, 61, 109, 85, 52, 97, 39, 146, 228, 125, 52, 245, 117, 97, 78, 78, 124, 13, 77, 69, 52, 125, 112, 57, 214, 303, 22, 226, 111, 64, 110, 159, 110, 119, 235, 160, 151, 187, 244, 151, 65, 40, 256, 377, 244, 92, 191, 37, 54, 86, 242, 131, 155, 60, 78, 155, 126, 265, 243, 86, 81, 302, 292, 107, 100, 153, 173, 154, 109, 113, 47, 46, 14, 139, 89, 214, 96, 104, 111, 125, 150, 138, 151, 129, 109, 134, 151, 49, 198, 111, 94, 175, 198, 234, 131, 49, 65, 206, 229, 125, 96, 110, 197, 96, 49, 360, 150, 222, 139, 182, 183, 161, 74, 106, 135]
2790A35O5M8j1j50J87R3j43j1Q6KJ50J35K231O444k534o190N3m69K14j44o9OK5j01Q5kp8Q4
2439A41K4J5j3J20j81p0L0J6J7n3j0N2M8N7R6j05j46J08r8O5M4j06M1l3M1l1O7l5Q2mn3p7
2039D9P4k0l8O4J41j45J36k29J34j35P7Pn6N0PP6j6j27R7J71J7k73J29n8J4J14j20k6p4L3
1663G3k7rK5l3R5l7k7J06r4K12O1j86M0P3j12jK0Q4o6n9k9q1J82j8j69N9M0K8J8j3j19Q5l3
1250H8PKj5K1j0R1Q6j25r3rj3J46M5j68J9k3N0O0J0q1M5k6kK4j6k7n0J45j32M7oM9J48j51
824A36J2j6o9J65j46oj3j4J53Nj57J14M4o9QM9q3k4M5P8r8Q3l3p6R9p7R5R0j41q1J51j61m7
411A6R1m7oOjM4j2l1nO2r1J3J19p7K03k29J73j39oK7q0J26j21O5k4k8M2K4M2J5j05R8k3P5
-15B16j74L3k0nP3j05N9l1M9Nm3J4J7M9j6m3O3l1R6j2j39L3J91q1q8J0q4L4kj3
$$ y = [135, 200, 248, 237, 87, 274, 367, 224, 213, 299, 301, 451, 586, 2817, 9261, 6727, 537, 590, 121, 335, 191, 122, 128, 153, 52, 137, 135, 57, 141, 165, 180, 167, 287, 106, 36, 66, 82, 99, 46, 36, 88, 136, 193, 289, 184, 38, 146, 48, 113, 157, 51, 92, 59, 100, 69, 136, 101, 183, 179, 126, 49, 123, 103, 65, 129, 270, 125, 261, 32, 166, 31, 108, 115, 59, 109, 116, 192, 176, 49, 146, 317, 334, 61, 190, 132, 146, 260, 140, 114, 40, 73, 46, 37, 62, 29, 124, 87, 60, 166, 72, 284, 345, 159, 199, 272, 160, 159, 179, 263, 197, 138, 109, 28, 210, 192, 23, 82, 122, 150, 168, 155, 36, 121, 88, 95, 97, 82, 103, 93, 184, 270, 145, 52, 43, 30, 176, 221, 53, 72, 49, 99, 159, 169, 88, 133, 107, 105, 129, 113, 86, 36, 181, 49, 96, 90, 139, 287, 136, 148, 132, 63, 228, 82, 76, 63, 49, 202, 207, 50, 164, 208, 139, 147, 196, 113, 89, 134, 212, 114, 197, 164, 88, 187, 110, 205, 295, 154, 73, 224, 63, 16, 107, 60, 54, 60, 59, 103, 91, 60, 55, 117, 26, 39, 158, 81, 284, 55, 228, 89, 83, 110, 30, 156, 35, 100, 76, 48, 90, 114, 156, 171, 66, 164, 141, 216, 42, 75, 55, 50, 123, 18, 77, 46, 95, 100, 57, 71, 88, 137, 121, 78, 141, 110, 206, 194, 55, 88, 279, 198, 110, 120, 36, 70, 68, 55]
-390E5
##PAGE=	F1=-1009.61
##FIRST=	25168.397401625570637,	6007.3700543999984802,	0
##DATA TABLE=	(F2++(Y..Y)), PROFILE
6007H0N7o0nJ30j45J40p2O3o2N5q5J10qn6N1j18J86o1m4j37J8J28p1K8J04l8O2j24n4K06J1
5619B89k41J16m0Oll8J06r3P2o8L3r1Q7qp4L8j1N4J16n7n6q9L9N6L5Q1rq8O9nj08M8jp4n6
5181C5j6nJ9RJ57J9j50J22q8N5l4nk5l0J73K7n7j36J06J4j12O9m1R7l6j21OJ6J5M7k6k1j1
4768G2O6O7p1K8j45R4j6n1M3o7J25j09Q1J6k3q1M3qn6J17J17j35L4n1o8J52rkj2n9JJ04r1
4355A06j5J08Pk9J0p4J3O5l4j22L9L4K4j1q8J8O1Q5l9j33K9K11j79j4L5Qm5k2L0L2o2Q2Kr0
3929D2K14P3k98J23p0l5R7O4n5m2J13p7j0L8J17j17j52qK19J11j20j77P7o1k5N7J25r2M7r0
3553H8l7N3L6J23J2j56L7J17J1j02r8L1Q7m6q9rk6j0O6K0N2M4j05Np0LJ19M0n7qk2P4L5j84
3128C4J06k2J6K3P6M4o5n5j37K03R6k34K0j9J11j42P4M9r7J51m9Jk4M4r7p9L2J06mqr8K12
$$ y = [80, 137, 77, 72, 202, 57, 197, 125, 188, 126, 181, 96, 206, 198, 142, 193, 75, 261, 200, 156, 19, 37, 165, 94, 122, 226, 188, 250, 126, 72, 278, 289, 48, 164, 124, 130, 127, 89, 195, 102, 174, 106, 139, 48, 135, 127, 53, 91, 80, 134, 250, 193, 137, 48, 87, 143, 178, 259, 250, 162, 231, 226, 118, 166, 165, 91, 35, 19, 14, 33, 42, 199, 218, 68, 190, 102, 157, 123, 118, 93, 63, 236, 263, 206, 70, 176, 190, 78, 147, 106, 203, 167, 46, 52, 68, 83, 130, 104, 83, 72, 138, 205, 134, 162, 17, 111, 95, 44, 87, 20, 145, 36, 117, 133, 110, 29, 72, 64, 8, 125, 242, 107, 141, 90, 22, 174, 165, 163, 151, 92, 93, 197, 106, 91, 199, 206, 177, 187, 113, 126, 191, 157, 35, 74, 108, 132, 121, 33, 51, 112, 197, 158, 25, 54, 265, 86, 72, 107, 115, 70, 48, 78, 110, 48, 130, 132, 42, 256, 329, 31, 154, 84, 49, 146, 210, 155, 113, 226, 149, 139, 177, 294, 177, 25, 17, 236, 347, 227, 50, 127, 66, 41, 98, 223, 131, 178, 88, 51, 104, 140, 263, 275, 119, 156, 273, 284, 182, 84, 115, 202, 156, 67, 58, 32, 22, 88, 108, 160, 204, 99, 104, 34, 37, 156, 196, 139, 131, 109, 183, 218, 34, 140, 118, 134, 157, 233, 277, 212, 157, 20, 223, 319, 85, 105, 86, 197, 55, 129, 178, 81, 232, 183, 184, 160, 204, 107, 28, 60, 166, 162, 154, 56, 268]
2727B68o2N0K12j65j61R9pQ85J256j644m33J16l36M0o2K09J47k36q7j9N9m4J07n4P4m2J36
2389C06j80r3k7L0j2L9j2K5K9R1Lj22l1L5qk4J21m4n6k9J09j29P3O5j5M1l3O5j67J41r4%O0
1976A57pM0n2mr7R9k4m7Q6N0m1J8q2O9P6P0k47M8J15r8J44k08J05j07N3k3l5kl3R7pp6J09
1563A46j14L22O0k29K5N7j49P5M0P9j04j20l5j3J40l8l7j9K2Jj0N9r9P1k5k6N6o9k4N2Q3O5
1162B42n7j45PM1J04Mj36k2pL4l5Q0l8O4j02N0K2k0K1j2J45k07J20r8P6J53j68L0Jp6R8j2
761A57q1n6P5Q0p8p0J54J9o6l0P4p6l0P2R0j10J2K5p6J47j30N5R4j07m7J08j16l1O6l1Rq2
361B0KR1o4j5L9N2k9K2O7j49K82k53J28o5l9J19j33J61j53J5O7j11O8j7J32q5j26J58K3J8
-15B25j27kl6M6J6p6O8n4J6o6J9Mj3J76J2j02J08m3Qm1k3m7J83n5n5K3q7L3o4L
$$ y = [268, 206, 256, 468, 303, 142, 241, 234, 1119, 2375, 731, 298, 414, 78, 118, 56, 265, 412, 176, 89, 70, 129, 85, 192, 138, 212, 170, 306, 126, 33, 6, 36, 24, 63, 51, 76, 105, 196, 199, 77, 46, 81, 73, 49, 170, 126, 70, 41, 150, 21, 94, 159, 144, 185, 152, 217, 50, 191, 97, 97, 157, 150, 190, 138, 134, 37, 136, 112, 65, 151, 201, 160, 178, 96, 165, 241, 311, 64, 112, 227, 129, 273, 65, 170, 63, 116, 93, 58, 56, 23, 120, 113, 37, 146, 32, 354, 414, 185, 210, 267, 118, 193, 233, 312, 208, 88, 53, 40, 180, 142, 105, 86, 108, 109, 99, 158, 59, 130, 105, 79, 135, 66, 42, 94, 177, 242, 185, 40, 47, 88, 192, 196, 60, 38, 31, 65, 30, 110, 72, 136, 34, 84, 106, 86, 107, 95, 240, 33, 153, 55, 131, 284, 116, 146, 147, 71, 169, 157, 76, 20, 95, 175, 97, 27, 181, 200, 134, 104, 178, 102, 72, 144, 234, 124, 136, 161, 85, 232, 102, 157, 251, 144, 97, 205, 89, 58, 124, 93, 102, 20, 22, 113, 49, 34, 73, 125, 96, 118, 185, 36, 318, 65, 193, 128, 89, 208, 75, 236, 83, 98, 165, 54, 122, 105, 237, 152, 26, 184, 207, 225, 98, 96, 60, 106, 122, 46, 114, 60, 76, 10, 29, 33, 20, 196, 208, 106, 214, 171, 179, 138, 115, 68, 251, 196, 141, 164, 77, 110, 46, 49]
-390D9
##PAGE=	F1=-1111.87
##FIRST=	25168.397401625570637,	6007.3700543999984802,	0
##DATA TABLE=	(F2++(Y..Y)), PROFILE
6007C6J17m4QQ2j53R4J5k8k3On4Q8M1L3nj13J69p1q5l0j8J1O9L8N3j8jj02o7J56L1k06Q1o5
5582D5O7Qo8R4n4M3k9KK2K8r4J1M4q4J45J60q8q3q6M3L4lP9q9lm4K5K6Kk0l1n3lj2J9m2J96
5118B07M5j14M6j01J16m5p1O1r8J10O5M2j83M9Ql2M6L5J47j99l8Pm9K3qk0nJ0O1R3p8L2k2
4705A40O0j34%L7K4Q6j51Q8q8k6L7l6J5l5J00J09j61M8j2o9J24k6J4k7M9q7P5l1n9J08Nk1
4305A56J18o0j08N7mr9R9J3n3L4j45K3J54L9n0l0k9J46j76nJ48p4q2K6J8J03j26J9M9j09K12
3917B64K6k66L2L1l1J33M3m6j05Q8n1m4L7J78j25j35K6J30K7m5l9p5O4r0N6O8K6qk5p7M2J3
3516A22O9J20j60O1m8Q7K4k13P5J04r5q4m5kK1J40j10J33j03J9o4mJ7J31O3j68R5j09J28L1
3140B35j88J10R1j14j26K83j03J24q1j05L8K19j22q0n1J33j38L7k3RK1J44NPj65j0P5l6P0
$$ y = [36, 153, 109, 117, 199, 46, 140, 155, 127, 104, 110, 56, 144, 185, 218, 213, 100, 269, 198, 113, 83, 65, 76, 145, 183, 236, 218, 217, 115, 48, 204, 235, 29, 110, 45, 112, 120, 52, 146, 92, 135, 106, 108, 130, 158, 64, 75, 119, 35, 180, 340, 252, 169, 83, 126, 160, 157, 236, 147, 144, 100, 125, 151, 153, 133, 102, 49, 46, 34, 53, 11, 207, 252, 138, 184, 83, 199, 154, 83, 144, 46, 156, 221, 263, 80, 129, 137, 105, 151, 186, 333, 134, 96, 103, 54, 77, 69, 49, 44, 54, 115, 208, 130, 162, 140, 200, 66, 66, 103, 127, 213, 62, 150, 62, 36, 73, 37, 52, 17, 117, 226, 65, 113, 101, 32, 156, 130, 144, 117, 166, 79, 154, 123, 64, 172, 177, 156, 274, 214, 106, 163, 159, 60, 159, 172, 119, 153, 8, 31, 185, 224, 174, 144, 115, 261, 85, 80, 228, 154, 72, 98, 116, 219, 93, 112, 161, 52, 264, 290, 24, 56, 87, 56, 189, 232, 186, 81, 169, 118, 74, 111, 289, 164, 29, 55, 185, 212, 167, 128, 53, 117, 27, 83, 151, 177, 169, 144, 67, 109, 122, 191, 311, 151, 212, 164, 251, 275, 62, 137, 241, 146, 62, 17, 15, 36, 176, 66, 199, 96, 115, 51, 47, 64, 195, 258, 90, 185, 76, 204, 235, 47, 157, 248, 134, 8, 291, 188, 312, 231, 126, 164, 383, 261, 181, 130, 263, 125, 162, 139, 148, 169, 313, 318, 325, 160, 150, 225, 189, 259]
2777B59j60R0K11K3R3J10K92J03l71L3Q00N063J8470m079j8354j536k10l06N8k52R21o25l48
2489B85M3q5L5Q3j91J82j43k1J03j26j8l4O3m0o5pM2J33j74NR5m3k7N4o1P8K4j32J75j68P1
2101A36R8j64j6R2K9n0L2l5r1J7J09k8J02j43K1J52j37n8J79Lq7Q5j21NL5J10k50N4K28j95
1726A12J42k19J15l3O4q3k1j0poJ20q8R4j15L05K3k35P5N7k35J02P8K6j04j01M3Ol8K0J20
1350B07j38K3nm4N5J8N6j0j04O2n6L7k4K5J04O0j91QO4N8k8j37j1Q6m2P7j25Q3Qn9K7k6NJ00
924A63m4J00k12J75n6K5J27j73k1M7o7J0J05j4j35R9L3j45L9K08l7j18j4J14j25l0Q5O8n0
561A57j14J26o8J34j69lJ08k2m4K8Nk7L9l5J7q7l5J21o2k0L2JR0LJ4q4J84j97Q8k4p4K02j36
148A48Q4j44J13N1j67N5p9J88j29l5P9O6j5r0n5L1N7m7k2N0k2lJjq3N8J27K7j29J21j4j11
$$ y = [259, 99, 189, 400, 423, 516, 626, 918, 1021, 650, 683, 1483, 6546, 25016, 20937, 2583, 1047, 837, 531, 589, 337, 1258, 633, 285, 328, 243, 278, 361, 170, 352, 209, 188, 291, 165, 147, 113, 176, 136, 71, 64, 106, 239, 65, 70, 165, 122, 95, 149, 88, 166, 190, 58, 233, 65, 136, 234, 70, 54, 146, 175, 125, 157, 122, 31, 48, 157, 129, 231, 88, 109, 261, 124, 66, 245, 248, 161, 246, 125, 130, 165, 275, 25, 79, 307, 112, 254, 35, 150, 117, 181, 98, 77, 67, 60, 54, 174, 86, 180, 65, 370, 393, 158, 233, 290, 55, 157, 235, 261, 157, 56, 99, 105, 67, 87, 207, 69, 92, 87, 43, 98, 116, 172, 162, 58, 120, 64, 101, 77, 102, 206, 266, 75, 83, 147, 205, 177, 40, 29, 115, 73, 150, 25, 108, 116, 57, 84, 58, 63, 163, 119, 219, 7, 182, 126, 151, 278, 105, 84, 131, 64, 74, 179, 165, 30, 129, 162, 17, 56, 264, 227, 109, 95, 209, 84, 54, 139, 207, 157, 43, 169, 101, 235, 66, 63, 171, 149, 105, 133, 138, 111, 150, 115, 132, 45, 10, 131, 69, 49, 81, 82, 172, 175, 189, 105, 289, 92, 180, 156, 82, 284, 148, 232, 88, 201, 252, 85, 140, 61, 249, 120, 85, 164, 230, 215, 125, 70, 101, 158, 111, 89, 139, 117, 114, 115, 114, 31, 89, 216, 243, 114, 235, 221, 110]
-253A10m5J25p6Q2j1k2P3j52J4o2J9
$$ y = [110, 65, 190, 114, 196, 185, 163, 236, 84, 98, 36, 55]
-390E5
##PAGE=	F1=-1214.13
##FIRST=	25168.397401625570637,	6007.3700543999984802,	0
##DATA TABLE=	(F2++(Y..Y)), PROFILE
6007B6J32m1O7j3j30O6P6j22MJ40j21O9L2R1p8j23J62p6p5Q2n4N4R1k4j4j4m5o8j8O2K1j26
5607C3J20r7N0J3q2P6r4P3Mj1J28k6j65Q2K0j07J41K25j22o8n8M4M7n0N8j77R6j13J5J12l9
5219A28o6L7rK0m0O4m7J54M6j22L4j35J71j27N5K4j69K1J55J06k20j2JK8M7J06J60l36O8j4
4843A28PM7l8q7nK0rJ86j14qO5P4k05M6K4P3N1j64N9j16nJ20pj22L8K6R6j29L2O9o0J9j9M9
4417A41kQ1j15j1J04j73J48l5l8K03p2j80NR3j00J74j2j34J19j32K0J68l6K1M6j78J16r9m3
4054G9K28j35j0k7k3J48j10n0J00j23J68Jk34R4K1l4J50n4qq2L6m8l7kK18j43q3J07j6p9O7
3666A19R9q7J2r4M0JJ72j01kj00R2n9L2K20j69M8j27J89M0k78J08J57j80L6p3j4K7J48r5N1
3291B12p9J4r4N9M7J45k9o7P7n9o3O3l7R5J76l54J79Q4l51L98j33J0k26L47R2j43j08K08k00
$$ y = [26, 158, 117, 184, 171, 41, 107, 183, 61, 65, 205, 84, 153, 185, 276, 198, 75, 237, 161, 86, 168, 114, 168, 259, 235, 221, 207, 162, 94, 76, 138, 159, 33, 153, 56, 106, 119, 37, 113, 19, 92, 96, 85, 213, 187, 22, 104, 124, 17, 158, 383, 261, 193, 135, 179, 226, 176, 234, 57, 153, 40, 55, 167, 128, 62, 99, 90, 110, 70, 134, 87, 241, 287, 165, 199, 64, 235, 108, 163, 187, 18, 39, 194, 300, 80, 68, 69, 97, 144, 250, 410, 74, 142, 128, 135, 182, 144, 57, 52, 72, 63, 249, 135, 127, 192, 266, 61, 107, 131, 204, 255, 91, 150, 34, 29, 149, 142, 20, 58, 84, 180, 51, 83, 152, 92, 111, 92, 141, 139, 220, 105, 94, 198, 25, 173, 138, 100, 303, 231, 51, 56, 149, 49, 223, 211, 77, 196, 64, 84, 252, 216, 237, 283, 105, 221, 122, 79, 307, 172, 162, 135, 112, 260, 150, 100, 200, 77, 245, 246, 12, 106, 127, 93, 243, 189, 181, 99, 135, 87, 50, 48, 266, 123, 40, 147, 131, 52, 119, 218, 131, 143, 49, 89, 90, 262, 161, 159, 59, 151, 92, 124, 344, 175, 223, 96, 285, 325, 47, 155, 312, 132, 168, 95, 81, 108, 256, 161, 212, 133, 147, 53, 112, 159, 304, 275, 208, 285, 226, 163, 226, 189, 284, 460, 106, 285, 369, 18, 416, 283, 293, 67, 414, 506, 363, 255, 463, 263]
2927B63j03K51j13J5J97PL6k32Q7P0NJ73k16kM17l8Q33k18R0N94m48M41K193J4439M8356j3694
2602E3403m7509l081p97n35J45j001J650r67m99o3j09Lj1r4R1j99k80L81p1j32L4O7j60k4
2301B42k5J6J10j24q8J63M3k39K19k32J24J24k20K04j65J26N9k39O3R1k15J12n4O5p7J68j02
1963A49P0O1k39J42K23l02j0K62q5j03J82k29k8K8J14j05J6K28k51Q4j33oJ11Q6j95L8R7r2
1613A13J0J16j89J74j00K24l8j76Q8R0k81K7J71q7p9K8PM7l8k2J99k05O6l8n0K2J06mM3j14
1237A10Jk9J35j40J7P0J53j83l1Q8K7m6j34MJ47j17K43j88O1j18K9Jq5J13R7j02J6q8J11J1
862A73j7J18j54J1m8Pl6J11Pj31R4L1p4Q8J26r9n4mJ02j12j01P7nQ4q9Q3p2R9k02P2LJ27j16
448I9p1J67l0k5n9P7rj40J35m7j3K3k2J33m6JK4K4j51J01jo6K06j53j9p8K29J9k08L0p8J32
$$ y = [263, 160, 411, 298, 313, 510, 517, 553, 321, 408, 478, 483, 656, 440, 438, 855, 817, 1650, 1432, 1522, 2116, 1668, 2109, 4302, 18741, 67097, 53403, 5894, 2813, 2016, 1481, 1626, 625, 2275, 1308, 809, 746, 637, 640, 629, 535, 626, 427, 147, 528, 457, 325, 359, 426, 266, 242, 217, 233, 343, 219, 131, 294, 337, 98, 317, 85, 209, 333, 113, 317, 152, 278, 337, 98, 161, 252, 37, 149, 95, 160, 83, 251, 149, 219, 280, 41, 183, 406, 104, 94, 356, 271, 168, 350, 121, 93, 121, 235, 130, 146, 374, 123, 207, 74, 68, 179, 265, 70, 108, 205, 113, 123, 239, 50, 224, 124, 348, 310, 134, 222, 312, 31, 58, 229, 142, 63, 91, 98, 145, 107, 85, 284, 79, 145, 107, 57, 79, 185, 181, 224, 110, 111, 82, 217, 77, 94, 164, 317, 134, 103, 191, 218, 172, 38, 42, 189, 72, 315, 127, 188, 70, 99, 100, 15, 128, 225, 123, 139, 51, 162, 173, 156, 274, 120, 131, 83, 90, 54, 165, 172, 41, 135, 166, 92, 180, 306, 207, 153, 149, 251, 139, 38, 115, 110, 194, 105, 188, 116, 215, 13, 85, 88, 215, 99, 28, 195, 165, 140, 81, 158, 149, 9, 144, 97, 84, 107, 85, 218, 172, 173, 197, 221, 70, 171, 170, 104, 310, 157, 138, 60, 289, 308, 100, 130, 52, 184]
48A84r3N8k5M9Rp3r7J54Mn2K2JrJ9%J9j25J51JK4j27J00O2j81n8K42o0q8N7j3J15k20jN7k6
$$ y = [184, 91, 149, 124, 173, 182, 109, 12, 166, 170, 118, 140, 141, 132, 151, 151, 170, 45, 196, 197, 221, 94, 194, 256, 75, 17, 259, 199, 111, 168, 155, 270, 50, 49, 106, 80]
-390H0
##PAGE=	F1=-1316.39
##FIRST=	25168.397401625570637,	6007.3700543999984802,	0
##DATA TABLE=	(F2++(Y..Y)), PROFILE
6007I3M2o1J45p1j06R1O6j31lK39k26J38LR2j60r9J37q3JJ38j16J26Q0j01n0k5n9M7p0j7K5
5619H5l5K07j48J5Qq1J11r6j8M3J0J32q7n8L1l5m3K4K95j52j8j5L8J13q1Jj26P9q1l5Q6m0
5219A29k7j6O2M0r3J05PN1Jj07O4j63K02k02J22L1j58K4J09J09j88kn6L4L3J80J16k99O8l8
4843A38R8L6j00j11M0Oj5J81j23o0P8J59k02J4K1L3M5j13K5r9RJ36O7k25Q6p4N7O4kJ2m5m5
4442I1N8Lj3J33j48n7J89k46J81p4l1J78q8q9j3P7r4K00l6j30J37r1J8J51j08P1J13l36J09
4079A55Lj10K66j44M4q1lJ12o6o5J12j32J21M2j92J03J6m0J62k05N6Rpq0N4K9R8j73j3K02
3704B73j88O7OJ11p7m1m8M9q7K80j42p3m2J29j51R7K01j93K3PJ72r0j69M3K11k48J40p6n3
3341A31J5J67p8L5L9j23m6L7O4J47j62J55Kl0k71J83P7N9K41n86M90j15k40K92j50J11l03
$$ y = [93, 135, 74, 219, 148, 42, 133, 199, 68, 65, 304, 78, 216, 219, 311, 151, 52, 189, 106, 107, 245, 129, 255, 335, 234, 184, 159, 100, 147, 77, 60, 85, 50, 257, 109, 124, 132, 51, 162, 66, 48, 91, 101, 233, 146, 88, 119, 84, 41, 65, 360, 208, 190, 175, 213, 326, 245, 246, 120, 199, 118, 83, 169, 129, 102, 86, 148, 188, 95, 200, 207, 258, 259, 152, 216, 53, 255, 53, 175, 206, 48, 72, 181, 290, 102, 100, 44, 78, 111, 291, 407, 108, 176, 138, 236, 272, 172, 61, 101, 107, 92, 273, 150, 90, 168, 327, 125, 139, 160, 193, 238, 125, 150, 51, 60, 196, 263, 38, 124, 50, 107, 171, 169, 181, 136, 91, 149, 152, 139, 272, 124, 67, 256, 10, 191, 117, 86, 264, 176, 87, 74, 151, 57, 257, 221, 91, 228, 137, 155, 306, 198, 269, 382, 46, 155, 158, 48, 314, 170, 214, 133, 130, 242, 176, 111, 223, 91, 212, 254, 62, 165, 181, 141, 303, 98, 154, 163, 156, 76, 130, 159, 257, 84, 71, 273, 85, 152, 158, 269, 192, 151, 103, 152, 65, 345, 203, 130, 88, 217, 66, 163, 364, 171, 194, 201, 373, 283, 114, 157, 368, 120, 260, 184, 131, 146, 313, 235, 270, 309, 186, 140, 177, 241, 388, 226, 381, 383, 353, 82, 265, 342, 401, 642, 56, 546, 431, 191, 483, 333, 444, 141]
3003A41K55K50j43j07K53k73j16L65j54P8J27j6O0j07Q6LM6K30l8j37M17m2J525m34k07R11
2677B973m65Q79L631K3075P4854k3168p3190m229j318p27L30j446J820j131n59k35n1q8j17
2439H38N3k9k07k45K87M5k74J38Jk13J3m4k6J07n9q9P4J42l12K37j75OJ76k32J51j25J80l
2089D15k24P9M9q5n8j2J21j85K82k42J67Kj92Q2K78m02J16K45j34j23K21k09op5Q2R6j00K29
1738D17k57oj7j05K18O7j90K0K04k04O7N9k22J87j02K21j37K7j00J46k28K2J43j64j1N9l3
1400H1O2O7o1J51j85J08r2p3J42L8p7Q5p5j8m6J82j93P8p4K13j66l0R2J6p9k5n5J47j41L25
1024C97j92N1k36J00j1q9J90L6j35m6K2K5N3m6J17q6Q3j76J00n3N8Qj36P7N1nJ33l0j39N5
649A76pR0l3j91N8n6J66p3Q5q0Q0j65J21j39K59j90k9J59j4j46m6J80O0k07R9n3RN%R1j03
$$ y = [141, 396, 646, 503, 396, 649, 376, 260, 625, 471, 549, 676, 660, 720, 613, 699, 702, 748, 978, 940, 803, 1220, 1178, 2703, 2269, 2062, 2973, 2508, 3387, 7018, 30093, 104947, 81779, 8589, 4360, 3042, 2315, 2645, 1199, 3019, 1888, 1329, 1094, 1043, 955, 838, 891, 862, 655, 410, 697, 742, 468, 606, 607, 394, 407, 363, 337, 444, 385, 296, 370, 512, 200, 437, 262, 268, 444, 212, 363, 238, 418, 415, 191, 270, 319, 234, 176, 164, 285, 100, 382, 140, 307, 309, 117, 199, 477, 75, 191, 436, 302, 179, 400, 191, 185, 110, 192, 288, 188, 417, 160, 154, 137, 32, 250, 317, 127, 147, 351, 147, 214, 273, 51, 238, 136, 357, 220, 247, 147, 293, 65, 87, 230, 66, 55, 114, 81, 143, 210, 149, 300, 115, 223, 131, 58, 200, 238, 161, 246, 171, 153, 107, 289, 96, 174, 100, 313, 147, 117, 209, 225, 146, 121, 66, 213, 72, 397, 205, 256, 20, 120, 109, 20, 210, 246, 111, 65, 87, 112, 165, 119, 236, 150, 233, 57, 157, 104, 162, 170, 34, 111, 162, 157, 290, 260, 121, 176, 169, 259, 226, 35, 93, 37, 203, 130, 215, 135, 215, 50, 171, 32, 291, 101, 72, 231, 217, 71, 25, 205, 265, 58, 157, 104, 113, 118, 118, 209, 106]
261A06O9N6p6n0L9N3l9J17j71p3K8K47Pk28J4N3q0L8Q9r4m3J05j07L0J38r8KN2o4l1N3m7R8
-152A93p7J78j37J4p8M8J30j19j12K62l1k49J40j0R9k41nJ58p7
$$ y = [106, 175, 231, 155, 105, 144, 197, 158, 275, 104, 31, 59, 306, 313, 85, 99, 152, 72, 110, 199, 105, 62, 167, 60, 90, 228, 130, 132, 184, 120, 89, 142, 95, 193, 116, 294, 157, 171, 93, 141, 271, 152, 40, 302, 271, 22, 162, 152, 251, 10, 5, 163, 86]
-390H6
##PAGE=	F1=-1418.64
##FIRST=	25168.397401625570637,	6007.3700543999984802,	0
##DATA TABLE=	(F2++(Y..Y)), PROFILE
6007A42n4p7J90n8j12J20M9n0o2K12j89J65j4O3k17j2O8j00N7J68j56J16R5j76l5l2l2J28
5657A97j46K1m3J9K73k34N2J7r8J43r2p5L7Q8L7j29N5pp8M8l1K19j65N8L1K4J63r9l4p1N4
5269B34q6j9M4l5J7p2J19L5j43J31N7n5n5n1Q3j48J91n5r5J10r1J6QQ6o9Jr9P9o6K27L6j69
4868A66K6l7J33J9j66l6P7n4OR6n4ol4K06j56m2J8l0M9k7Rj22L0J07J40k64J14o1o5K33j0
4480B65j01Ko0J23r2l6J97j93j4J70k52J52l1J7K0o3Q8k6jm9J42m5p1O0m1L8J15j27O5J60
4104D12l68M8P5j37K39j07M3j06M8N1l0o5R6j33R7J13j77M1Q2n8J58k35M3N9l3p1R1Q3l9j62
3729E8Q0K29l18J69ML0o0j5k0J7j45L53j34j70Q3Q0j86J55J58k38L8Q0J69k59OK5J70k46J71
3366B84m0j16kJ89q0J08O4k09k4J2J07P4k10K77j8l7k80K23J02J8K41o49O22k19j74K15j38
$$ y = [142, 88, 11, 201, 143, 31, 151, 200, 150, 88, 300, 111, 276, 262, 325, 108, 96, 164, 64, 121, 289, 133, 249, 344, 168, 133, 101, 69, 197, 51, 72, 29, 48, 321, 87, 139, 156, 58, 201, 109, 34, 71, 159, 196, 67, 122, 115, 37, 85, 54, 273, 108, 166, 197, 221, 384, 285, 251, 180, 234, 148, 129, 173, 138, 155, 83, 202, 237, 94, 225, 282, 227, 172, 121, 204, 56, 247, 192, 97, 207, 116, 132, 140, 226, 157, 158, 59, 138, 72, 299, 335, 166, 192, 155, 288, 307, 141, 105, 182, 128, 134, 230, 176, 170, 136, 342, 186, 144, 162, 132, 181, 154, 163, 41, 71, 178, 318, 54, 168, 107, 42, 275, 265, 164, 166, 106, 229, 137, 101, 298, 105, 91, 261, 9, 161, 130, 147, 167, 104, 192, 166, 165, 116, 258, 213, 142, 202, 161, 199, 314, 187, 252, 412, 44, 92, 167, 30, 269, 162, 205, 99, 147, 198, 168, 103, 199, 66, 163, 276, 99, 140, 222, 164, 322, 87, 130, 189, 156, 85, 176, 259, 220, 58, 138, 367, 49, 218, 222, 252, 192, 177, 157, 174, 29, 382, 248, 78, 161, 241, 55, 210, 368, 130, 168, 248, 417, 158, 164, 189, 359, 113, 284, 244, 128, 126, 315, 235, 343, 407, 198, 174, 186, 293, 367, 157, 434, 416, 379, 99, 322, 424, 442, 683, 34, 656, 437, 263, 478, 340]
3028C40J44k44O5L16o3j05K34k94KL02j33R0N1m2R3OM9j4J5K33J81j50K54j0J831m51m54R06
2677C152m63J129M323K6330Q3477k7463q1352m337j458p50N22j416J416j036n48l38L9j90
2452A037j92J80j32j62j47J12J83l85K30r6j91K2m3p7J22l0kq8K21k76J59o9r7K01j91O3r9
2114B53K45q7j95M6L3R0j93J13J19l18L01k92K29m9j10k9K90l56J91J57j15j19J74o9l9j75
1788I5M8K60k31K26k00n4N8j18K11lr4j0K36k84R2J5j03P7j06K96k30J95l56K00j33R9%q4
1438A02J6k7PM6N8K3L2j43J51j12p3K26n6r9P7n3Lm8J45j72R6j73K68j95L9N3K8j10Q6r5Q5
1049A85q0K58j36M8k18Q0n0n1K10l8j36J3L7l9N0RjK9Q7j89J37j00R0K5j36j2O7Q0J12j85
674A46k1QK6P4L5j86J5N7M0j10J51n2N1j55J13j80L01k05K5J00L4j70l7J83Q4k14O5r1J9k3
$$ y = [340, 484, 240, 305, 621, 558, 453, 687, 393, 395, 697, 564, 654, 705, 663, 756, 762, 811, 797, 812, 1045, 1226, 1076, 1330, 1320, 3151, 2700, 2246, 3152, 2689, 3818, 8141, 34471, 117948, 90485, 9133, 4796, 3338, 2588, 3110, 1694, 3110, 2074, 1526, 1188, 1227, 1037, 845, 1025, 893, 731, 584, 696, 879, 494, 724, 628, 437, 459, 416, 339, 461, 431, 429, 341, 562, 286, 445, 376, 279, 480, 289, 352, 253, 498, 411, 216, 262, 295, 385, 192, 305, 424, 106, 407, 115, 344, 295, 185, 156, 446, 90, 281, 438, 323, 204, 378, 309, 270, 95, 143, 403, 172, 398, 198, 144, 202, 84, 295, 292, 198, 188, 424, 140, 232, 247, 144, 221, 115, 411, 181, 376, 20, 220, 87, 186, 186, 102, 118, 91, 98, 144, 202, 225, 257, 114, 265, 153, 80, 306, 250, 151, 228, 175, 178, 130, 275, 103, 199, 26, 294, 99, 138, 191, 219, 109, 195, 100, 185, 105, 363, 227, 275, 57, 137, 87, 36, 246, 208, 72, 85, 122, 83, 133, 142, 141, 170, 257, 68, 205, 105, 195, 220, 84, 72, 139, 219, 331, 146, 125, 133, 159, 233, 268, 82, 97, 154, 194, 84, 235, 183, 234, 79, 192, 12, 313, 108, 133, 233, 267, 97, 60, 243, 327, 113, 178, 87, 106, 83]
298H3J9M7j18J61Kp4O6o2J10l7j5j60J01k6J40L6k18RJ58j84J10O6j05j6Q4j65J46R8k07Q0
-77A29P0q6j08Q1k7J51j4J64k46J8J1J3R5m6j39K36j1k20Q1J4M2j54m2J70j23
$$ y = [83, 102, 149, 31, 192, 194, 120, 186, 124, 234, 197, 182, 22, 123, 97, 237, 273, 55, 64, 222, 38, 148, 214, 109, 93, 177, 12, 158, 256, 49, 129, 199, 113, 5, 86, 59, 210, 196, 360, 114, 132, 143, 156, 251, 205, 66, 302, 291, 71, 152, 166, 208, 54, 12, 182, 59]
-390E9
##PAGE=	F1=-1520.9
##FIRST=	25168.397401625570637,	6007.3700543999984802,	0
##DATA TABLE=	(F2++(Y..Y)), PROFILE
6007A57j17N3M7J4r5Q4L8M7j47J20n0J28j4M2j93JM6r7L3J92j42N5J00k23K7k5%R3j62J24
5632A36j21K0K74k29M2O6j24J59o5p8n2J94r0o9P1l9l9O0K4Lj27J15P6MJ46q8m6l9O6j28L2
5244A54Qm0Ql0J23Kj69J47M0r8p4K7N4q9J35R5k57J59o0Jp0O7N6jj08J19j24J81l2n3qOQ5
4830B54L1j94J14O4j51K8j1O5N0j07J33p4q2J3J1l1M1kp2j0N5J57k35J29J9r3J97j1j44N9
4455B03j10J78j50m6J86j88L3J16j80N0O5M0j53L2J61m9j4j5O3k6n1l8J6P4M8r1N1J66l03
4092F8j4R9q7J39o4Qq9P3rK3q9P6j07O7J67j54l6J55p6J16j08m1N3m1l4P9J29j80q4J42J88
3704C69l11J44K8o5j3N5l1o2p3L10r9k07J52j7j38J52J47k49N9L8J96l72J38O4O7j80J36K3
3353B61j89mJ72o0J73L5k24l4KJ70n0r5J55M1l7j67J76N1J9J46m27M58j88k09K33j36J04j03
$$ y = [157, 40, 93, 140, 154, 59, 143, 181, 228, 81, 201, 151, 279, 265, 307, 114, 115, 161, 64, 97, 289, 147, 202, 302, 79, 106, 81, 81, 174, 12, 136, 15, 35, 309, 80, 122, 188, 64, 223, 158, 80, 28, 222, 132, 63, 134, 95, 56, 116, 140, 143, 16, 131, 207, 211, 357, 269, 223, 184, 250, 122, 154, 162, 122, 130, 100, 223, 225, 56, 203, 243, 145, 71, 98, 152, 63, 198, 293, 36, 195, 135, 136, 66, 133, 189, 188, 80, 199, 75, 256, 224, 171, 163, 169, 254, 285, 91, 205, 269, 118, 146, 135, 200, 250, 143, 276, 202, 120, 133, 144, 113, 154, 152, 80, 70, 125, 282, 47, 176, 195, 102, 299, 288, 144, 203, 93, 271, 121, 75, 261, 73, 106, 222, 42, 92, 157, 197, 44, 76, 237, 188, 174, 159, 222, 196, 145, 107, 123, 197, 245, 154, 205, 371, 68, 54, 153, 66, 205, 141, 149, 60, 133, 124, 147, 58, 134, 27, 94, 261, 107, 71, 226, 150, 266, 158, 117, 170, 129, 95, 174, 303, 123, 39, 181, 369, 58, 202, 230, 165, 152, 207, 176, 114, 41, 351, 252, 45, 197, 180, 42, 194, 341, 92, 151, 189, 385, 13, 151, 215, 282, 102, 238, 261, 72, 68, 240, 180, 353, 388, 164, 130, 132, 302, 252, 157, 312, 353, 316, 149, 325, 376, 395, 541, 114, 572, 384, 175, 408, 272, 376, 273]
3003B73j03L08L7j48J84k61J25J88r8O2%m7Q9M3j6Q4j01K07R0J24J27L2J602l24n48O70m83
2665B116J032L799K2451O9220k4165o7285l298j136n98O20r63O94p38m83k83J00k47k11K36
2427H61j81p2l5n9K98m45K81j60j27Qk0j01J17k6R9k38K87k07N6N1j87K30j30Rj25K98j51
2089C31j69M2L0J63k15J67R0l17K31k78K56j18l8p5K58k41J57P3o0j05J41N6j00j80j1L30
1763D18k98J64p5l4N5j38J89p4oL2J48k90R7l2J3K1o5K95k40K43l08jj1J27j39L9K6j11N9
1400A04Q3q5J79q7j34J96r6o3K42j10r0N1p5M0nK5q8R6j45K45k62J25lN3o2Q4p8lmJ00k4L0
999B39j41N6r4PJ43q8r4P2O7p3K4Q8j85J47J4j11J29j17J52Rj18q0N5J64M6k89J78j16O8L6
624A88M5r4OL4J0o2J12plj47N8j15K43j78N9N3J00q9j27J40P1j50N3j41om6R5pJ6O4n6pJ07
$$ y = [273, 170, 478, 515, 367, 551, 290, 415, 603, 505, 567, 567, 520, 609, 652, 636, 720, 619, 826, 916, 1040, 1167, 1199, 2801, 2477, 1929, 2599, 2116, 3148, 6947, 29398, 98618, 74453, 7168, 3870, 2734, 2136, 2756, 1793, 2487, 1749, 1266, 983, 1083, 836, 625, 861, 680, 608, 573, 514, 812, 367, 648, 488, 361, 369, 349, 248, 365, 339, 438, 200, 487, 280, 336, 387, 200, 430, 300, 309, 184, 482, 331, 162, 204, 234, 397, 182, 349, 439, 122, 353, 75, 331, 213, 175, 100, 358, 117, 274, 347, 287, 182, 323, 379, 279, 99, 88, 418, 120, 284, 209, 175, 230, 92, 281, 207, 201, 233, 381, 91, 188, 156, 169, 190, 125, 420, 180, 423, 115, 114, 103, 230, 91, 130, 156, 45, 104, 187, 102, 281, 194, 60, 256, 160, 97, 339, 229, 139, 190, 115, 155, 150, 175, 87, 183, 38, 283, 21, 146, 143, 196, 134, 218, 140, 137, 133, 233, 209, 239, 98, 154, 60, 67, 210, 122, 28, 100, 167, 94, 118, 206, 21, 168, 182, 71, 200, 83, 235, 244, 126, 46, 101, 265, 311, 22, 200, 84, 152, 188, 233, 139, 145, 179, 189, 127, 239, 232, 229, 82, 140, 25, 268, 90, 149, 202, 302, 213, 86, 226, 297, 147, 200, 59, 53, 7, 102, 95, 111, 175, 119, 112, 219]
211B19j02J37n4j28qJ22n9j8J03j83K0J65j28Q6J1q6Q4pj45J46N6j82N2P3qq8k6R3Q8QJ30
-178C71k85K6O1J1J0J0j13J65nj41j8Q7j0q1o7J38j23
$$ y = [219, 117, 254, 200, 72, 64, 186, 127, 109, 212, 29, 49, 214, 86, 172, 183, 97, 181, 174, 29, 175, 231, 49, 101, 174, 166, 78, 52, 145, 233, 241, 371, 86, 112, 173, 184, 194, 204, 91, 256, 251, 110, 92, 179, 169, 88, 21, 159, 36]
-390C6
##PAGE=	F1=-1623.16
##FIRST=	25168.397401625570637,	6007.3700543999984802,	0
##DATA TABLE=	(F2++(Y..Y)), PROFILE
6007A35j09R2m1R7m7pJ8J38k13J2P8O2j2N0j02p6P1o3j7J85q3K9M3j86P7k9j7No0J41j25K7
5607G3J62q0r3J75j52J62k6q9j19K51j70LN1p3rM7M9j36R0k8J26j3N1l8m3l0J04j92R9m1j8
5219I3l7P4N5l6j16J24n3j9j6K1j9J9J9J89j88L7n4J0q2M5J15J9m9N5j27Q9n8J6j7N1rP3j60
4805F4K10K7k20O6r2J50M4q0j5J5q2K2P7j48P5nJ4q4O2Q8j31J06R3r6O2Jm7O2j97K20j00n4
4405A07O4q5j9J04q5pJ03K9j35LJ12l7L%Qko6p7L8J05m2j8N7J31k16k6Q5m8N3l5j2n0P7j15
3979DJ37n6jJ4l6J37j02L3P1r9O5J8p7K4J0n2O4J49k26k9J31J07j70M4J1j19O1R5n3j35M2
3591F2J99m4j38J12p9p5Q7J53j63Km5K29k02j7J05oq6P2Q1j29r1J02J7J64k9j83n2N0J74j41
3215A29M1q4J66k9q4J21n2Q2j1q4J75o9k64K86j68K8M9j61K25R2k10J50k35K14Q5o4K9k5l4
$$ y = [135, 26, 118, 77, 174, 127, 120, 138, 276, 63, 75, 153, 215, 203, 253, 151, 75, 146, 83, 66, 251, 168, 197, 240, 54, 131, 102, 85, 90, 30, 171, 46, 73, 235, 155, 62, 237, 85, 247, 221, 132, 13, 264, 94, 97, 148, 75, 66, 113, 162, 26, 116, 88, 214, 201, 252, 214, 171, 141, 245, 53, 152, 111, 93, 56, 130, 185, 149, 33, 157, 104, 85, 69, 90, 71, 90, 109, 298, 110, 147, 93, 103, 21, 66, 181, 200, 151, 206, 79, 168, 110, 126, 109, 160, 151, 224, 64, 274, 301, 81, 147, 55, 205, 249, 169, 154, 169, 87, 109, 186, 38, 113, 108, 122, 38, 100, 188, 57, 163, 256, 160, 222, 223, 176, 238, 41, 261, 161, 107, 171, 86, 67, 171, 86, 79, 182, 211, 76, 79, 191, 154, 157, 157, 165, 163, 97, 20, 58, 163, 121, 103, 160, 291, 75, 49, 134, 86, 139, 104, 92, 42, 119, 4, 141, 85, 84, 98, 62, 199, 97, 130, 201, 102, 167, 185, 108, 132, 142, 90, 154, 303, 77, 48, 179, 286, 116, 160, 171, 52, 113, 208, 155, 20, 62, 261, 217, 79, 191, 112, 37, 124, 277, 114, 116, 71, 300, 98, 81, 186, 180, 94, 166, 247, 118, 27, 129, 146, 310, 281, 98, 46, 96, 270, 129, 170, 86, 252, 223, 139, 260, 208, 290, 279, 195, 370, 301, 37, 323, 155, 183, 232, 71, 296, 388, 178, 328, 93, 307, 392, 328, 357, 332, 298]
2852B98J1N2p6K38k47J65k24O09O6OJ000j95m67L91m86O39K288J3793M0289j5246l9114j655
2577B135n48l74N70l62K4l76l69r3R1k34j75K10j57K4N4j86L60m54K88j55o9lLo4O3l7J61
2239C27k53K87j71k6J48k53K54o1J9j44K49j45j38P5oJ04j29Q8P4k19J90j81J88j54M2p2J75
1901B68j33K5L7qj00K05P7j38p7j08K76k22nQ2NJ9j03J12l6l0J24k9j84J06j31J10K3pJ78
1538C36j68J95j61j37M8R6j25Q7M3j53L0J33j00J77j32j34J84r3n0K09q3j17N7j18Q9M7j04
1200E6j0J42j32K00j92N8l2P1K5j2j9m8J2m2J06on2L2k4k7J7j02K8J6J37j05M3P3j15M3q6
812E5L8N0m3J43m3r1o1J0K30K2k15J18j07K4oJ9L1N8j24O4N3nPl2j02l6kJ44j64R8K0J34k0
398B67j75N0M3l7N3j72pO1Q0o5N7m2l8L8P4j03J60p7n9jQ9o0j14J21j03K9N4n1J19o4n4J33
$$ y = [298, 309, 361, 285, 523, 276, 441, 217, 826, 892, 898, 1898, 1703, 1236, 1627, 1141, 1780, 4068, 17861, 58150, 42904, 3790, 2135, 1587, 1213, 1783, 1421, 1445, 1069, 700, 607, 698, 464, 289, 499, 342, 366, 420, 234, 594, 140, 428, 273, 204, 201, 204, 140, 203, 166, 327, 74, 361, 190, 164, 312, 59, 313, 252, 271, 127, 376, 231, 93, 168, 162, 266, 137, 225, 299, 80, 270, 89, 277, 123, 165, 93, 268, 135, 160, 197, 189, 89, 294, 371, 233, 156, 48, 324, 102, 97, 179, 184, 203, 100, 212, 176, 146, 270, 241, 57, 163, 32, 142, 165, 158, 336, 168, 363, 202, 65, 113, 209, 84, 171, 214, 61, 91, 224, 124, 301, 169, 35, 219, 126, 76, 285, 202, 85, 142, 24, 113, 160, 56, 46, 188, 56, 256, 64, 122, 90, 161, 186, 174, 155, 107, 119, 77, 183, 177, 125, 157, 133, 106, 123, 21, 49, 65, 202, 97, 140, 213, 98, 141, 55, 93, 143, 100, 243, 200, 109, 48, 58, 288, 310, 95, 213, 106, 130, 124, 143, 174, 232, 108, 172, 225, 220, 227, 195, 93, 57, 55, 199, 35, 133, 153, 287, 267, 92, 142, 185, 148, 201, 29, 22, 83, 163, 98, 155, 113, 75, 113, 187, 84, 244, 167, 108, 107, 196, 136, 22, 143, 40, 69, 123, 72, 191, 127, 73, 206]
-2B06n9j23J12K5l3n8L8J08j04J4O0N4J6O5k38J3M7J0qL7p6P5qm7r5J63o5mn2L5m3
$$ y = [206, 147, 24, 136, 161, 128, 70, 108, 216, 112, 126, 186, 240, 256, 321, 83, 96, 143, 153, 145, 182, 106, 181, 173, 126, 31, 194, 129, 125, 73, 108, 65]
-390F5
##PAGE=	F1=-1725.42
##FIRST=	25168.397401625570637,	6007.3700543999984802,	0
##DATA TABLE=	(F2++(Y..Y)), PROFILE
6007A10q4M4k2J27J1r6qJ94j93l7R1k9qQ0rj55Q9j1k1J23j7J4j7j12Q6l5m8m1L0J26j12O6
5607A36J3M7j43K37j80J28Oq2j50K49j23l8N7o3m6M4M0k8O4j22J83k8q1L3K0q0J19j78J28
5244A62j28P4lM2m5m5N4J7n5O9k4l0p0J14j23K17p2j03k1L3jJ0P8N9J5o2j21M6k6N4M4k9l3
4830I7P6j08J94k3j39M8q0J24rJ6j38Q7j2k0N8r4l3J5N7q4O7RpL6J20q6p0QJ03L4k20J73j7
4417A82l6n6J6k1O1n0K0Q0ll3r5K7NK2n%J8j4Rj04J04q1N5M0O9j29JM2n4jpK9m1Q8oK1mo3
3942H6O8%l5k6J09k5j12P2L1p0NR6j29Q3J52j07j21P9M2l9k6m6n7O9Q1o0l0m1R8K1m2R0j5
3528B01j24OJ10o0j5m6J25q0q4Q8%qKR9K6j94R5N0P4j11j06L2N7P4j05M2M5K9p2m5M7j24J57
3115A85j00J67n9L0K4J5k15N1N0j07P5J44j50K4o5Q9Nk8K9n3K4r3P2M2J64k62J61L98m2Q7
$$ y = [110, 26, 70, 48, 175, 186, 90, 82, 276, 83, 46, 137, 108, 100, 180, 171, 16, 105, 94, 73, 196, 179, 193, 176, 64, 150, 115, 67, 26, 56, 182, 70, 136, 149, 196, 53, 290, 110, 238, 244, 162, 12, 261, 138, 100, 157, 94, 48, 92, 132, 104, 168, 46, 229, 201, 120, 153, 173, 93, 212, 34, 162, 34, 108, 105, 147, 102, 57, 111, 128, 73, 142, 118, 88, 18, 132, 9, 226, 154, 51, 30, 63, 62, 72, 150, 209, 224, 162, 41, 87, 61, 115, 159, 130, 97, 173, 65, 259, 236, 97, 145, 65, 189, 180, 196, 58, 145, 133, 113, 171, 77, 44, 59, 116, 32, 99, 108, 101, 137, 257, 171, 101, 109, 212, 246, 26, 199, 182, 146, 90, 106, 85, 146, 96, 116, 196, 193, 160, 65, 92, 97, 119, 114, 114, 132, 118, 127, 23, 127, 46, 101, 141, 210, 81, 82, 124, 70, 69, 62, 91, 50, 138, 132, 153, 149, 86, 154, 154, 119, 93, 202, 177, 65, 137, 168, 98, 103, 199, 70, 153, 305, 198, 77, 156, 198, 159, 133, 87, 30, 99, 180, 120, 90, 49, 147, 168, 126, 216, 201, 77, 83, 193, 133, 118, 72, 197, 117, 33, 121, 121, 113, 115, 214, 240, 46, 141, 191, 265, 154, 48, 80, 137, 211, 106, 148, 193, 222, 150, 105, 152, 28, 185, 85, 252, 193, 223, 247, 262, 47, 98, 148, 41, 116, 260, 110, 134, 69, 158, 163, 135, 164, 111, 135, 42, 114, 156, 320, 58, 219, 617, 575, 662]
2740F62j62L90j30k92J63l22J71O34M917J2026n560j1761k11l2j73M03N8l40p9k11J12K9j66
2452A26j03J13J2mJ21k29L04k62J15r7m6K1J1J0l2k9J66O6j0j63m1J47j26R9K2M6q3Q3o3n8
2076A16M7qK2j06N7N1j61J88o4N5n2O1q0P2n1j01K6k%K29Oj26K6j36R7l4n1N2Pmj2jJ10j30
1650A03J63j93M4Q0j13P7nML6o4R3j9r7mL0j5Q8N9j74kJ36kO2j11q7J06j33K4R9pj46J00n4
1237G8L0L7n9p1J80j10J18r8l4j3O5P2r5K8l0l6lJ01j7%JO3o8k0l6k2j4J54j14R0nk0n5k1
812G6L4m4O8O6p6q0NkK53L9j93M5o9l4m2J9J16J39k26K7J38p0l6jo1m1K4J02j36O7kJ06L0
398B41j37l3l0P2O2j64P0O2M3r8L6p9M2K1J8j02J92j02O2o4O3m7l3l1N0jj00L5J58r3m4J09
-2A78o4r5N4j1R6o6o5J75j25J08j1L3O0l1j46Ql0J2J03ro3j2j2N4J8N4j38J00n6p5O3
$$ y = [662, 500, 890, 760, 468, 631, 309, 480, 1114, 6031, 18057, 12497, 736, 525, 493, 320, 723, 781, 441, 362, 151, 263, 292, 126, 23, 136, 148, 144, 265, 36, 340, 78, 193, 96, 50, 71, 82, 92, 60, 31, 197, 263, 253, 90, 49, 196, 70, 169, 191, 237, 154, 237, 174, 116, 163, 155, 177, 71, 128, 179, 18, 206, 142, 197, 145, 206, 126, 198, 147, 46, 72, 70, 70, 299, 305, 179, 205, 69, 166, 132, 81, 133, 140, 136, 124, 123, 233, 103, 266, 73, 117, 197, 84, 161, 156, 160, 196, 132, 225, 206, 109, 105, 135, 120, 208, 267, 93, 91, 227, 225, 287, 176, 89, 195, 62, 86, 185, 178, 32, 132, 78, 108, 145, 86, 15, 195, 85, 203, 105, 71, 58, 123, 195, 100, 128, 98, 62, 59, 160, 143, 143, 144, 207, 139, 119, 83, 61, 47, 201, 87, 177, 172, 152, 97, 76, 110, 66, 134, 200, 124, 44, 49, 47, 300, 339, 146, 191, 122, 88, 46, 65, 181, 320, 94, 121, 259, 189, 153, 152, 91, 50, 74, 176, 40, 107, 105, 211, 241, 104, 71, 41, 113, 175, 11, 81, 143, 186, 88, 124, 45, 87, 108, 126, 24, 216, 114, 176, 112, 175, 128, 95, 64, 114, 113, 13, 48, 206, 113, 69, 178, 114, 19, 73, 62, 158, 92, 27, 202, 77, 185, 174, 207, 267, 236, 90, 98, 68, 80, 183, 174, 111, 99, 87, 141, 159, 213, 75, 175, 119, 44, 107]
-390A07
##PAGE=	F1=-1827.68
##FIRST=	25168.397401625570637,	6007.3700543999984802,	0
##DATA TABLE=	(F2++(Y..Y)), PROFILE
6007A38j13L7k4R8O3j42j1J86j06m9M9p0%N8L1m8l7K9J2N0K8m7j6l9N2k4m8qJ4J18r8R7q3
5594I7R0o9J89j85M6L8m9q6J44lj25N4Qj23O1%O1Kp4J75n7j60O8J09j21P6q1J17j45R2J1l5
5194A25p1O3P0m6j1M4n6m0j9Q3n5O8L5j23Nl8L0J2L9J08K2j48p6M8M2P1O3j46N6J6r3R2p7
4780I3Q6l9n4Q0k3M4q2O7O0r5k6Mq8L5PM6j3JL2l2R6n7m2p3J91Nj62M1M4J9r6L5R6n6q2N3
4330A15P1k1L3j62K6j5M1j6J6N3O3k8j49Q9l4M1K3j0n6M4lj02MJ1N5k0J22L4o9Np2P3Q3j44
3904A01j0J16l2m7N1m3k7l1J66j79J03J66m9j68L1Plm7l0k0L4N3n0L1m1j9O4L0J13oj54K8
3503A38k8NN4m9k6j7mkL4K1l1P6J34k22J21N1m4j43k7N8M9kl8J5J84p3j08j9p2J13k2N3R8
3090B77j20J0K01j52j61R9o4L0L5o8N6p1k2O0o1k0P0n1K03R6k29o3J54k8r1M3M03o8l29n4
$$ y = [138, 25, 62, 38, 136, 199, 57, 46, 232, 126, 77, 126, 56, 56, 114, 145, 97, 60, 89, 101, 151, 179, 132, 116, 77, 129, 105, 57, 49, 63, 181, 83, 180, 97, 187, 118, 307, 122, 168, 206, 157, 71, 215, 212, 87, 141, 149, 26, 87, 87, 148, 150, 76, 251, 194, 34, 102, 211, 90, 166, 85, 202, 57, 149, 160, 125, 54, 117, 187, 141, 130, 174, 118, 78, 59, 142, 87, 155, 190, 67, 72, 34, 64, 76, 115, 223, 245, 97, 21, 69, 111, 182, 245, 99, 155, 171, 78, 170, 93, 179, 140, 86, 166, 143, 187, 105, 172, 232, 137, 111, 115, 27, 62, 69, 115, 102, 103, 135, 103, 199, 142, 100, 27, 218, 223, 61, 102, 146, 165, 69, 104, 200, 144, 62, 115, 186, 165, 198, 36, 62, 47, 88, 72, 88, 141, 204, 176, 27, 116, 82, 123, 146, 136, 80, 124, 121, 19, 23, 34, 89, 69, 191, 225, 156, 161, 89, 162, 245, 101, 91, 207, 175, 128, 179, 136, 109, 78, 244, 65, 168, 334, 285, 117, 148, 155, 152, 105, 75, 55, 89, 142, 92, 123, 82, 63, 127, 157, 270, 264, 110, 138, 110, 115, 169, 120, 94, 77, 73, 71, 105, 126, 95, 171, 305, 83, 204, 255, 211, 68, 41, 99, 148, 146, 108, 123, 307, 234, 126, 107, 35, 148, 126, 179, 277, 157, 167, 368, 216, 55, 154, 90, 120, 155, 87, 143, 72, 50, 110, 49, 29, 99, 48, 251, 347, 118, 55, 209, 181, 90, 133, 536, 468, 139, 85]
2715H5k5J46J02Jj22J91R38L661o04l559n07r1p0q0J36Kj0l3p5l0O7J8n8J12j58J76m4j8K1
2352A72o9p4K3j4P8kq8M7J55J81k35p6J9l4N2r7J12M3m8J2J7l1OO4M5j65R4J0j16R4j7k9N2
1938A81K1n6Nk0k3l6m1R4J72p8q3O1j06o3J27Lm7k3mO5j05K06j65J20j50J03N6p5O6l5m2l9
1538H9K1l1N1rn2K6MJ03O6j68LJ12L9jq5p4P9j15O2LL1o5R4m4j8j9k0j1Q3j4J8n6q4K6M1O1
1087A46n6j6L5r1O9M7J4ml1J07o1N3o7n9L9L6p6J03k9oj02O0j9l9R3k5j9k1k7K4K17J4j56
674A53K8p8pm5kJ25J94j82j32J76oj54L1l1j6J5J09p3J9m2P3K2p1K3l0l9P0p1M0O5k4r1nk
248D2O7j3k6k5J59j40J11p6N7l5m0lJ09k7o6j0J03j7q6N9m7n0K9j6P8J1o6L9q5J57n2j7J34
-165B58j05n6M0q1L2J70q8m8q8j6J20R2j9j82J86q6j01J27
$$ y = [85, 60, 206, 308, 309, 187, 378, 1316, 4977, 4373, 814, 307, 216, 146, 66, 202, 204, 194, 161, 86, 56, 123, 141, 83, 195, 37, 213, 169, 151, 172, 103, 29, 52, 38, 116, 114, 26, 73, 228, 409, 174, 98, 117, 83, 135, 38, 150, 193, 145, 157, 174, 143, 149, 213, 258, 93, 187, 197, 81, 175, 158, 129, 181, 202, 146, 151, 131, 108, 72, 31, 125, 297, 219, 136, 197, 91, 28, 155, 158, 111, 88, 84, 149, 44, 250, 85, 205, 55, 158, 214, 139, 205, 170, 128, 89, 110, 79, 130, 121, 69, 95, 99, 202, 268, 100, 103, 215, 254, 253, 168, 94, 173, 58, 120, 123, 154, 89, 183, 139, 121, 102, 82, 71, 154, 140, 158, 102, 18, 44, 85, 146, 90, 74, 109, 18, 87, 134, 148, 144, 113, 220, 159, 212, 145, 86, 125, 161, 85, 188, 159, 153, 51, 111, 92, 53, 146, 121, 102, 81, 54, 78, 295, 309, 153, 181, 103, 96, 51, 49, 174, 368, 186, 54, 230, 224, 70, 101, 70, 54, 69, 178, 105, 124, 82, 155, 177, 106, 129, 99, 60, 130, 59, 99, 164, 140, 49, 44, 42, 109, 96, 70, 45, 204, 64, 175, 99, 156, 121, 81, 78, 187, 160, 94, 84, 187, 170, 84, 143, 96, 46, 75, 59, 137, 148, 82, 121, 36, 193, 141, 124, 258, 153, 97, 137, 56, 88, 258, 170, 122, 34, 18, 138, 230, 211, 29, 215, 129, 28, 155]
-390A55
##PAGE=	F1=-1929.93
##FIRST=	25168.397401625570637,	6007.3700543999984802,	0
##DATA TABLE=	(F2++(Y..Y)), PROFILE
6007A77j37R6j18M1R4j09J8J04%r4K6L5k8Om1P0n8j7J00k1L5j30K9L1k0j5j0k0K3J06q3Q9
5607A79j01Q4k9J32j55l9O2nJ4L6Q1j79K7R6j74N5l5Q4m3O5R5j02r4J3J18p5K8m6J35j30N5
5219A52j6o6J9R3M9m8j06O5q3j0M2kN1LO5m6k3j09J8pM3J53k9j55J4k3R9P5M3k00J14j3q0
4805H2nk0J75j08rM1J9l9K3RJ21j03j13j0J7J4l4J11n2lJ8n2O4m4L5q6J59j5j42L3M5L0j34
4392B7Q4J57j43p5K1P8%L9j73O3n6O5j5K3P0P7p8r9O8n8M5K9q2J9R4p4j4j6k5nL4J48J1j05
3967A34k2l7N7J42j48n4R6J3J9%q7M8j24K10j53P9J78m3j48nl2k4l1L6n5J9L8m2Q4oo3J9O8
3553A66J06m5j08O6j02J3P8p4l9K9k8j7K1K7j2N0J38j64J02R3j55j03k4L5N5j9mK4J55o1p0
3165A33j3n0J23o5O6Q2j13l0K26j88m4jj9J27J94p2k39J07L91n6m09j21M7K9L37O53o98R9
$$ y = [177, 40, 136, 18, 59, 153, 44, 62, 166, 166, 72, 98, 133, 105, 111, 70, 140, 82, 65, 165, 144, 179, 49, 78, 109, 89, 74, 64, 44, 67, 173, 90, 179, 78, 162, 133, 265, 110, 71, 133, 128, 142, 178, 259, 80, 107, 203, 29, 84, 49, 133, 90, 155, 250, 148, 54, 67, 185, 110, 138, 92, 227, 97, 152, 136, 70, 89, 182, 231, 183, 77, 142, 59, 49, 91, 89, 140, 143, 208, 162, 139, 30, 48, 41, 84, 237, 208, 53, 67, 44, 143, 218, 261, 61, 175, 162, 82, 77, 57, 232, 124, 115, 156, 175, 136, 159, 168, 289, 186, 73, 63, 80, 94, 60, 171, 119, 116, 134, 82, 146, 102, 137, 51, 210, 195, 53, 86, 131, 161, 27, 111, 268, 125, 50, 71, 149, 149, 188, 15, 78, 22, 87, 72, 95, 165, 242, 164, 65, 133, 75, 120, 149, 67, 86, 180, 106, 92, 76, 51, 46, 80, 228, 239, 134, 112, 75, 132, 274, 126, 72, 168, 181, 200, 200, 113, 161, 37, 247, 94, 173, 351, 308, 160, 155, 123, 99, 68, 104, 49, 68, 106, 64, 148, 142, 79, 98, 166, 272, 227, 119, 185, 83, 96, 174, 100, 61, 90, 62, 45, 66, 93, 81, 131, 269, 105, 207, 300, 145, 42, 18, 53, 108, 89, 85, 109, 264, 203, 133, 120, 70, 193, 128, 194, 276, 163, 133, 359, 171, 127, 126, 107, 234, 428, 356, 117, 224, 615, 559, 150, 29, 76, 105, 442, 1095, 397, 496]
2815D96l24R5L28K167J66j193r12k12l89N64M61o38l68P8K688N619k193n557n53J13j05k48
2539H3J02K34j05j56j16%R9Njj3q9J39pj09P1j4j04N9l8J21Mj19L8K47J14l26NJ1j27J63p8
2151I3L9L7n3O2K1p9oJ63N4k19Q7pp8M5k9l8N7k1Qqm0N9q7K3K1J61j29m1K9n4K1P2n4jJ8j8
1700A08Q9j75J86q8j3J9J3L4m6P3j6q3NN6p8oM8j02J62q0N1P2j23j0J17J8rq1q5O4m6K5L5
1287A34Qm3J03l7n6l7o3J04k9Q8m3n9k7J0rM4M2p9R2j01KO8N4m8n9J10j0J06j03k9M6o5l1
874H3O3L3m1r6K5PM1J8o4O1Pn2L8J34o9m3K1q4L8j7q1J49J89j41j35J29J10k23n9R6n6j2P0
461A39j2N1r2J42p4n3N0L5j10%RjR0q4n4pL6P0n5o5O9J35j78Q1l3Q1l5j25J39P6l3p7%JR6
23B12j06K5k9jM6K1m5O1m4r9N8M5l3j01J93j00K8M8p5L7J54j29j8j29M3K8J17k7j08J54j27
$$ y = [496, 172, 267, 595, 2762, 2928, 1735, 823, 611, 222, 786, 1247, 609, 241, 319, 3007, 8626, 6433, 876, 323, 436, 331, 83, 185, 419, 314, 158, 42, 42, 141, 146, 145, 132, 43, 182, 175, 66, 137, 123, 19, 78, 40, 161, 165, 46, 84, 331, 445, 119, 124, 135, 8, 171, 93, 132, 169, 116, 178, 199, 120, 114, 277, 331, 112, 199, 192, 114, 159, 130, 92, 149, 128, 136, 128, 88, 147, 60, 83, 104, 265, 136, 95, 124, 70, 91, 163, 109, 108, 126, 108, 197, 22, 208, 120, 107, 126, 139, 173, 127, 200, 184, 101, 106, 162, 84, 78, 126, 24, 186, 106, 157, 229, 106, 96, 213, 231, 222, 141, 56, 120, 74, 99, 134, 142, 99, 202, 165, 109, 72, 9, 113, 84, 172, 129, 70, 43, 53, 44, 88, 130, 51, 143, 42, 44, 112, 166, 118, 59, 169, 159, 265, 162, 133, 179, 114, 83, 146, 179, 138, 42, 67, 74, 115, 133, 69, 130, 137, 85, 123, 257, 188, 145, 166, 82, 120, 103, 22, 171, 360, 219, 84, 213, 323, 100, 41, 137, 81, 69, 139, 127, 178, 86, 228, 154, 101, 151, 186, 76, 76, 85, 84, 174, 90, 36, 29, 65, 135, 80, 15, 84, 219, 41, 122, 89, 170, 135, 10, 149, 225, 192, 115, 115, 116, 212, 106, 131, 102, 101, 147, 168, 123, 184, 140, 41, 99, 144, 111, 10, 203, 103, 131, 179, 104, 141, 295, 166, 148, 19, 62, 90, 207, 180, 72, 226, 99]
-365I9qR4
$$ y = [99, 91, 185]
-390A85
##PAGE=	F1=-2032.19
##FIRST=	25168.397401625570637,	6007.3700543999984802,	0
##DATA TABLE=	(F2++(Y..Y)), PROFILE
6007A70j15J05j28J4K9j6L8RP7j47M3Q5J7nj46Q7K5j05J93o4J5j15N7%m8k0nL6RO4o6L4n5
5594G2Q1p3R8r9J4l0L6O2J2P3j73L5J26j63mn0Q2M6R1m3j41J6J3J2K6L0l7J05j16ql2L4kQ3
5169A76L9Lp3rr7rJ08j02J30kK2Lkj11ll3J1J87q4r8J2nQ4K6K3j80J39n3l8J1O0Q0j29P5J3
4730A74Rq2P9q6J69m1j03n2N0J0oN2o5lNj3P1q8L0m2J42k2j75J39L9n0o9O8J16j82K1q6J02
4317A11M1oj25L6pL2j4P3K6L9r4JL6m8K0Kj10O5J57j53J00o6j3Qk4J13qq6p7K6L5J40j21n5
3891E4Q0N1N6l9j14J27j78J56o7L1J58l7r6l3l2o7nO1l8rJ9m9J73l1p5k2Q9L7p1k8Q9n6j8
3478A16pm4M3K3r8kj7P8m1N9M8o9Q6J39j53j26qN4l7kO4j7K9K6j4j1L0N9k7l6J20j30l5J69
3053B69j43P8j06J1J85M62K20o28J15J068l38r37j88l1O5N29J508j327M63j106L68J161M878
$$ y = [170, 55, 160, 32, 46, 75, 59, 97, 106, 183, 36, 79, 164, 181, 176, 30, 117, 142, 37, 230, 166, 181, 66, 123, 123, 75, 55, 50, 86, 95, 159, 93, 127, 72, 153, 80, 178, 79, 93, 63, 99, 161, 173, 246, 73, 108, 234, 71, 67, 17, 99, 145, 236, 193, 52, 68, 81, 93, 119, 149, 112, 217, 101, 93, 61, 95, 93, 176, 215, 218, 145, 136, 39, 30, 138, 36, 166, 164, 186, 189, 187, 76, 73, 40, 51, 238, 154, 56, 68, 63, 147, 173, 196, 16, 155, 102, 64, 75, 135, 215, 86, 161, 174, 183, 101, 180, 94, 263, 222, 119, 67, 117, 127, 121, 173, 108, 105, 110, 97, 168, 80, 110, 68, 210, 188, 13, 152, 191, 141, 72, 140, 256, 74, 95, 9, 111, 152, 146, 21, 57, 50, 82, 68, 141, 167, 206, 112, 113, 149, 101, 121, 123, 13, 78, 235, 82, 182, 116, 103, 111, 87, 200, 192, 106, 29, 55, 90, 230, 109, 54, 134, 185, 241, 202, 88, 215, 37, 193, 126, 157, 315, 278, 182, 149, 117, 50, 45, 106, 68, 59, 78, 29, 202, 171, 96, 74, 163, 200, 129, 101, 190, 134, 116, 109, 65, 108, 131, 33, 31, 14, 92, 51, 110, 158, 89, 175, 314, 161, 35, 27, 81, 44, 42, 106, 89, 118, 144, 130, 119, 149, 208, 181, 145, 265, 135, 100, 269, 126, 204, 98, 109, 294, 756, 976, 348, 463, 1531, 1193, 256, 68, 37, 102, 631, 2139, 812, 1275, 169, 537, 1698, 6576]
2765F576n15k129k222m37j124J236R09j270n08J601K30J08j058j089k75N03K36o43J70R2j46
2502B45k23P2K7n5O5K9j22P6J1j0q5L9N6l9k9K9J02kp6N6J86K2k95L1j5m7J88p0l2O1n6Q0
2101B19J4j68qK87N4k89J22m5m6Kn7nmk2N5Lm0Q3o8J0o0J78j38k7l4JJ08M6r2L9O1m6J17j72
1675G8J27K2j96J33q0Qj9P6K0o0L7J23j61M1Mr5J89j03l2P9m3r5J60j3Pp4j07O0n4L8R3k6
1275A37r2J11J4p2j4K4J8q6J29q7m8L0Pn3J00J3n6J00j46KQ5Q2j31l4P4K6J23j17K2K4p6k6
874H3k0J22m4p4j6O0O4o7j0N8k1qM2M3j54Q9J4n7KNp8J41J35j16m1Q2J47k35l1J11o6o1l9
461F0M3Q7r2J99j30pk7Q7p1j35O5j7J36n9j05L3N8K7q0l2P1J14j71M3l1J27l7n3P2N1k7q8
60A11Pm9J21m9l9J5O2K4K6q2K8k7p6O2o2L7L9on3R3J5q5K4J28r4mj24Q2r6J16J9m4R3j36N1
$$ y = [6576, 6061, 3932, 1710, 1273, 149, 1385, 2294, 1024, 516, 2117, 2347, 2455, 1397, 308, 33, 536, 772, 129, 299, 391, 245, 22, 94, 121, 66, 131, 160, 38, 114, 125, 115, 30, 69, 125, 86, 57, 86, 188, 186, 110, 166, 352, 374, 79, 110, 95, 48, 236, 166, 134, 195, 139, 219, 233, 65, 57, 344, 398, 109, 231, 186, 140, 142, 85, 80, 76, 54, 109, 112, 72, 155, 87, 97, 37, 215, 77, 50, 16, 17, 125, 171, 79, 118, 179, 133, 250, 78, 205, 227, 31, 164, 84, 92, 73, 149, 169, 109, 146, 269, 108, 149, 153, 58, 247, 144, 112, 191, 148, 53, 213, 200, 207, 133, 26, 86, 32, 70, 163, 137, 45, 156, 170, 98, 84, 108, 126, 40, 169, 82, 34, 64, 71, 18, 118, 131, 75, 175, 29, 31, 116, 198, 67, 33, 107, 133, 256, 139, 161, 185, 109, 83, 63, 185, 141, 67, 51, 111, 175, 108, 98, 156, 135, 127, 169, 212, 58, 147, 161, 104, 106, 111, 33, 174, 309, 193, 152, 234, 381, 146, 115, 226, 160, 99, 60, 103, 190, 98, 297, 167, 160, 133, 220, 149, 14, 79, 62, 198, 139, 34, 67, 125, 152, 72, 40, 111, 225, 54, 97, 66, 193, 156, 103, 175, 226, 199, 111, 118, 69, 190, 141, 102, 117, 179, 203, 229, 147, 175, 148, 72, 134, 72, 109, 148, 142, 89, 182, 197, 112, 136, 264, 170, 166, 42, 124, 28, 144, 163, 119, 212, 76, 127]
-378A27L7
$$ y = [127, 164]
-390A64
##PAGE=	F1=-2134.45
##FIRST=	25168.397401625570637,	6007.3700543999984802,	0
##DATA TABLE=	(F2++(Y..Y)), PROFILE
6007A07l7N9m9M8o4J4M1m1R0j10P5pJ53o4r5p0J44j63K01o0Lq5J04p0n9K1q0J22%Nl6m0L9
5594I6P9j36M9n4J14j22M6L8L0L7j15R6Q2j17q2k1R8J57K3k03l8J1O4j5kP5j7J4r3p5Q2O6
5194A67q2K2J1J08O5q5q7o0J07n2O1J2m5%L4o5j9L8r0J77j01n5k1J10J0j01M8kM3q9j2M1K1
4780A09K3p7J37Nk5q0P6j36J50L1n7K8n1K7K7n2q3K2RJ2Q2r6l0M2J27j5j58J16N3r1N0j6L3
4367A92j53O3n2M0Q2o1r0P6Nm5j1J42k7l1q2R3j5K2k5n9Qk8K09j91J63j11N9O7j41K6kk3k8
3954G2jj0R5n3j6K0R0O7n8j54J81j03l1M7l6J10rl5o7Ro0j3M9Nj3jl2J84p1r2k6J07o5m5K0
3516F5Q1J6k8r7L7L8kj5q5J10O6j45M5NK7L0J27p8j49J5Q6j28k0J53o6ppL9J4Q0N5k4o5Q2
3090B55j64k7J39j28J84p9j00K07P43N02r34J02J691o55j400k04r0L0O90K195j860Q10j726
$$ y = [107, 70, 129, 80, 128, 64, 78, 119, 78, 168, 58, 133, 126, 279, 215, 120, 50, 194, 31, 232, 172, 175, 90, 194, 124, 65, 86, 6, 128, 128, 133, 97, 57, 96, 175, 39, 88, 34, 148, 26, 72, 110, 140, 177, 62, 158, 240, 123, 41, 20, 118, 275, 298, 95, 57, 68, 132, 117, 115, 190, 173, 187, 94, 19, 101, 167, 85, 107, 118, 226, 291, 206, 119, 59, 166, 114, 175, 187, 142, 142, 176, 111, 92, 130, 40, 217, 116, 61, 40, 150, 160, 59, 107, 105, 148, 59, 47, 88, 109, 132, 55, 192, 197, 172, 92, 168, 32, 182, 213, 156, 184, 133, 160, 187, 135, 52, 74, 83, 95, 177, 81, 51, 93, 220, 205, 47, 163, 216, 125, 175, 159, 192, 39, 102, 50, 90, 172, 111, 21, 97, 102, 57, 46, 188, 161, 130, 48, 141, 126, 148, 123, 64, 72, 44, 253, 62, 225, 114, 173, 240, 99, 125, 123, 100, 72, 71, 61, 156, 103, 87, 107, 197, 264, 206, 52, 233, 130, 99, 146, 110, 220, 211, 176, 109, 118, 58, 45, 94, 99, 86, 85, 53, 237, 166, 74, 48, 155, 90, 45, 65, 146, 162, 134, 37, 74, 112, 110, 95, 10, 120, 186, 41, 86, 91, 118, 148, 275, 197, 48, 63, 149, 21, 1, 154, 88, 81, 74, 113, 127, 207, 262, 238, 173, 255, 91, 64, 203, 75, 259, 180, 80, 287, 1030, 1532, 598, 700, 2391, 1736, 336, 132, 42, 72, 762, 2957, 1097, 1907, 181]
2802A81O50J899P021j307k499l514n51j812J757J263j622n60L131j343j60j69k260J66M35
2564G06N11r12Lj8q8j14P8J0j44J02M8k5Kp3O8j22O2L3K8j41P7J28n7j4J03lnk13P3p5N4J97
2164B79q5l4N9q2J23lj74NK95Q3l50J58o6k6o0p4L3j1MK9j7QO2L4j05o8J58j16k9P7k7N2L7
1751A69jj7L6p9J60j48J47K9k25J07r3k4n1Q2M9k0M3K17k70O8j3p2J29p9m5O1N8j96J78m5
1375A55L5k4j49J26r5R3O4q9k1L8M5m5o9P9l5p2J32j50pO3jj9J15q8L0P3j72Q1M3Q0j99N2
974F9M5KQ9r3N1J3m0m2n0J24j8p7L1N3O1j30K7O4q6O4M0Op7L4M8n4p0npR2Q2q6L1L6J21j72
524A76M4L5o6o7n0JN8k1J84j34R3r8M8%j49N8l5J40k4j53N2R9n0m5j6O9N1q7K1j23J72l2L
110A54MO3l3n9j8K1j0M6j18O2J31l1mo4k5rl7O9m4O8J10j26n8J16j8j00PO8Mj8q3J08q7Q2
$$ y = [181, 831, 2730, 9751, 8444, 5945, 2431, 1880, 68, 1825, 3088, 1466, 906, 4037, 2694, 2534, 2365, 105, 271, 706, 1217, 305, 308, 290, 202, 88, 166, 176, 32, 134, 182, 157, 159, 86, 154, 32, 94, 127, 155, 14, 91, 219, 162, 148, 251, 248, 243, 30, 103, 28, 82, 279, 194, 160, 219, 137, 260, 257, 83, 88, 383, 466, 116, 274, 208, 182, 122, 48, 81, 70, 74, 103, 86, 94, 156, 190, 85, 17, 175, 59, 30, 107, 80, 132, 169, 168, 151, 187, 108, 268, 120, 267, 296, 71, 178, 85, 61, 10, 92, 141, 121, 164, 381, 111, 179, 166, 94, 223, 144, 99, 160, 218, 22, 200, 155, 190, 166, 17, 143, 48, 141, 205, 116, 95, 133, 178, 133, 64, 143, 108, 36, 168, 18, 11, 74, 73, 54, 169, 81, 111, 184, 12, 93, 136, 216, 17, 69, 114, 116, 205, 112, 163, 176, 136, 94, 44, 168, 150, 73, 104, 157, 218, 88, 115, 179, 93, 157, 197, 203, 126, 160, 208, 154, 84, 79, 72, 164, 246, 160, 191, 227, 348, 176, 220, 255, 189, 122, 72, 73, 131, 110, 294, 160, 253, 155, 203, 203, 54, 112, 77, 217, 193, 40, 92, 191, 141, 96, 80, 149, 200, 113, 134, 11, 183, 151, 154, 158, 221, 188, 129, 111, 132, 122, 168, 50, 112, 243, 212, 208, 144, 119, 110, 73, 142, 98, 166, 276, 150, 92, 208, 190, 90, 97, 165, 169, 151, 68, 176, 89, 171]
-315A71J4l8M7q5J3k9
$$ y = [171, 185, 147, 194, 109, 122, 93]
-390I3
##PAGE=	F1=-2236.71
##FIRST=	25168.397401625570637,	6007.3700543999984802,	0
##DATA TABLE=	(F2++(Y..Y)), PROFILE
6007B7O1LK3N7o8jJ0J2J9j2N9j21K67j54kj57J94j71J05j3K2o8J26q9r4R8q6P3J0l4J0n9Q8
5594A35R5o9j13JJ07j14j1K8J9J0l2J61J1p6j36M7J05J99n1k55N4o8J25L1j06J16no8k8J4
5219A26M4J8j00o8K8J75J40j03j23o4O5ORM5p9m6J6J8l6J37j13P9q7n0L2J29Rj36RJ00j5o2
4818A03j1J2p0L7J9R5Kk3j12R3n4M9L8l3Q6j20P0N5j28p7%M1l2Q2l1q0Q9J17Qj37L0N2n0J04
4392B24o1l9n1j1K2PJ12p7j14J49j9j01J1J39k3n5r6J37r6Q7n1m4R2j5J02j83J52j26J63J00
4017C35k29J2q0O3N1l7k1N1L7n2o6J53P2o4k06J82K0j03M5p9L2NK5j08K2j9JN8K5J3j6j4J20
3604B28o2j28K0Q5j25J3N2k5P8k3m4jPn4J06n6J42L3j66m5J01P7p5N5l8o7rQ2p5n3J42p3R1
3190A93j49O5L9R2N7m5kJj89J0J24j76K48k8j76J93Q56O12j030J10J914q23j565j71j03K3
$$ y = [27, 88, 91, 114, 171, 103, 102, 112, 124, 143, 131, 190, 69, 336, 182, 180, 23, 217, 46, 151, 138, 160, 92, 218, 129, 35, 133, 47, 120, 130, 96, 106, 47, 135, 230, 161, 48, 49, 156, 42, 31, 59, 78, 88, 56, 217, 228, 152, 16, 63, 168, 367, 316, 61, 115, 47, 172, 203, 97, 213, 208, 140, 112, 126, 170, 188, 88, 20, 48, 223, 363, 260, 137, 73, 138, 144, 153, 198, 119, 73, 89, 107, 71, 208, 95, 174, 87, 37, 69, 198, 207, 71, 80, 180, 165, 103, 92, 104, 34, 71, 90, 185, 187, 164, 52, 145, 91, 140, 178, 145, 231, 111, 181, 236, 108, 31, 31, 72, 40, 122, 91, 11, 100, 217, 225, 88, 118, 170, 120, 224, 163, 124, 73, 62, 84, 91, 203, 126, 12, 161, 142, 41, 52, 191, 168, 113, 17, 154, 58, 145, 94, 50, 142, 127, 229, 46, 198, 72, 235, 335, 106, 118, 38, 101, 152, 115, 94, 145, 182, 130, 64, 217, 289, 225, 19, 201, 221, 118, 163, 84, 116, 121, 146, 38, 60, 41, 42, 100, 125, 138, 122, 108, 228, 166, 38, 58, 143, 18, 31, 83, 58, 136, 113, 69, 68, 75, 21, 127, 71, 213, 246, 80, 35, 136, 213, 138, 193, 155, 88, 79, 161, 86, 33, 175, 102, 193, 44, 109, 148, 240, 297, 252, 250, 251, 62, 72, 196, 20, 268, 240, 64, 257, 1113, 1725, 695, 805, 2719, 1896, 331, 160, 57, 80]
2865H0O79K296j970R69j886P71K170P417j782k067m066m41j950J667J309j490n95L775j615
2627C271j180k41j800K33N81M80j031p6q7P0j16R1n1n6K4Q4K0p7n1J23j12lL8P5j38J5J61
2289B47j05k2J37j61M8j23R1p3R0J20p0K0Qj34K29m8n7l0K07R7l89K10q1rj09j5j9Q5p5P5
1913A44p6M2N0R2j78m8J23r1K7R6o0LJ4M6j6Mj21J98j04J39j7j63O6l5k3n0K8L9j3M5K83k94
1513A50pRl5L6k4k5K2J48j72Q4j12P2O0j82J58p8J01L5j33R8j5Pl1j55P0J3o0J46j52LO1l
1112H9RQ6j08R1Kj44Q3L0M7j69N0Q8Rj0k1K9J6j8p4QM6J0j12O7Q0N7j56JR8j30J14K7Jl6M
674A64Q7o3r8k2J6L0O8k9M5k5O7n5J00o6q7j6K4n6k5O1J14j02J67j27k2O9j15Q1m6O7pj46
273E3N9R4j00L5m8J10m8L0k3p5N8m1K7LJ04m9o7J0J1n7Q1n4k2J66q0o5j5m8N5j8Q6nO9J14
$$ y = [80, 759, 3055, 1085, 2054, 168, 939, 3109, 10526, 8744, 6677, 2611, 2170, 220, 1887, 3196, 1706, 1111, 4886, 3271, 2091, 1850, 50, 283, 864, 1344, 313, 237, 150, 220, 104, 195, 144, 88, 112, 196, 216, 139, 88, 211, 99, 96, 134, 209, 71, 86, 247, 142, 120, 257, 96, 144, 21, 112, 39, 129, 249, 179, 199, 207, 73, 302, 254, 197, 167, 374, 471, 82, 292, 211, 202, 93, 78, 59, 144, 69, 144, 68, 110, 160, 252, 74, 26, 149, 58, 85, 181, 121, 124, 138, 184, 168, 172, 51, 249, 145, 284, 267, 104, 170, 135, 112, 62, 90, 129, 116, 161, 444, 150, 143, 152, 117, 153, 129, 104, 126, 274, 102, 186, 74, 146, 206, 24, 182, 104, 205, 240, 107, 205, 190, 197, 166, 11, 81, 94, 34, 180, 28, 31, 92, 89, 98, 184, 76, 167, 169, 25, 108, 138, 185, 16, 66, 154, 163, 153, 132, 161, 177, 159, 85, 93, 139, 149, 37, 104, 184, 241, 85, 86, 184, 54, 168, 195, 196, 160, 164, 251, 188, 90, 68, 84, 114, 182, 153, 198, 173, 240, 185, 285, 219, 132, 116, 140, 84, 59, 120, 234, 132, 299, 172, 150, 219, 104, 185, 139, 206, 199, 53, 112, 206, 106, 141, 93, 203, 155, 185, 162, 87, 145, 104, 131, 134, 238, 189, 122, 132, 143, 86, 167, 113, 91, 257, 177, 112, 97, 49, 104, 86, 172, 167, 236, 350]
-152C50j78r9J15j8r4L0k3P4n3jJ02o3O7j3m2J7n4l2m6
$$ y = [350, 172, 73, 188, 170, 76, 106, 83, 157, 104, 103, 205, 142, 209, 196, 154, 171, 117, 85, 39]
-390C9
##PAGE=	F1=-2338.97
##FIRST=	25168.397401625570637,	6007.3700543999984802,	0
##DATA TABLE=	(F2++(Y..Y)), PROFILE
6007D8N3qL9L7o2J1k1J03o0K2N6p9J65k13J14j76J61j24l5O2M9m8P7n1m6J05r9j2K3k4M1m6
5607F2R3J36l1k00M9L8q8j0Q7l0r4O5K10q3p2j04P5R4J80j01j77j5p6J75L8j59J21rj10Q6
5231A50M5j9k1p0j8J65oJ24q1j83oj1M7k4R9m1m5n1P0r0K01r2lp5m8R4O5O4q0q3J17k3m7K3
4805A47pl9L7j4Qkqr2J08m9O4J1o0R8j45J29N8j49Oq9O9j2k4N9n9L4J04L5j13m3K2K8Q4k3
4380A73j00J2j0J4K4J06m2j67J93n0q5nQ7K4oj15J16p8ll6N1R6M8n0j44P2j07K28J06k65Q4
3992A71p2jJ22r0J2L4P7j06n9J42Q2o6k37J27J46m2o0j4n6m7M8o3Lk1mR6K4M1m8%N0Jj39O0
3566A11K6n3n8J25j11O3n1K5n6K8M8LO7Q2k1j36o1J05J28j26L2q4M9m2M3Rq9R7n0J49r2k7
3165A33K4Q4K7p6P1k6j80M0Q8j60J96Rj55J47P15N11q41R2J617p45j358r2o3K5N13J743j533
$$ y = [48, 101, 93, 132, 169, 107, 118, 97, 200, 140, 162, 218, 139, 304, 91, 205, 29, 190, 66, 31, 93, 142, 94, 171, 120, 74, 179, 80, 68, 91, 67, 108, 62, 155, 291, 260, 60, 109, 147, 59, 49, 136, 106, 12, 77, 287, 204, 132, 28, 103, 197, 377, 276, 99, 84, 8, 183, 221, 62, 183, 174, 64, 150, 195, 176, 155, 85, 67, 232, 226, 350, 269, 86, 80, 69, 116, 92, 191, 150, 105, 54, 124, 34, 235, 143, 140, 65, 17, 111, 176, 240, 160, 77, 194, 171, 124, 147, 140, 101, 138, 124, 132, 130, 122, 30, 138, 89, 153, 164, 104, 202, 57, 186, 244, 95, 101, 12, 81, 69, 45, 104, 45, 79, 183, 218, 105, 62, 84, 112, 196, 173, 73, 85, 75, 89, 113, 219, 177, 10, 203, 153, 68, 63, 150, 174, 168, 53, 169, 91, 88, 52, 103, 199, 247, 197, 53, 125, 18, 246, 352, 87, 171, 99, 98, 220, 130, 142, 176, 253, 147, 88, 230, 312, 246, 9, 136, 282, 240, 180, 166, 110, 63, 111, 48, 51, 30, 26, 122, 146, 187, 139, 139, 189, 190, 51, 111, 137, 84, 26, 151, 40, 103, 52, 77, 21, 49, 97, 100, 167, 249, 228, 92, 31, 136, 264, 138, 170, 86, 135, 93, 136, 145, 56, 153, 103, 252, 160, 133, 157, 241, 268, 192, 263, 237, 57, 97, 185, 25, 221, 230, 75, 222, 937, 1448, 607, 699, 2316, 1571, 213, 121, 58, 83, 596, 2339, 806]
2827H06Q48j535O66J824N847j682j118l549j78j638J229R82r33m82L250j076k203k58o73R7
2577B24O03K73q93q4p8J40j17Q8o3L0m1J15K0j29K0P1l8n9P8R7r9k2J23j02j00J21K1l3j22
2214D4M1j1Q9%k6P8l5j03K46q7N5j19J40M1l42K43q3oj10J01r7J28j55J79j38M7K3Q1j30o1
1838C3Q1p5P4Q4r4j8kN5J6L8r6J35p9O0n4l3L2kj2lpl0rN2K73k86m3N0NJpk2k1J78j15K2j52
1375B9M6J51j41P1m2J34qq9J24n7j2m7p8kM7o0J01j44O2J2M5KK9lL6o0j11L8L3Lr3L5J37L5
949B23p6L8j5qLj30O3K6K9j18J9J34O1j54o0J16r6J04Rk8j0J8Q7n3r2K7rq3J01N0L3q4pK7
524A45J40j14j35O3O6p3K3QM8o0J50j18j7P8p5R0k1k3j1j26M3P3p4J03r8J73j46J13o9J7n4
135A19p7K9L7J68n0j50Q3q5j4Q9L9r3J17q2j18M5j1J11j9P8j4N4Q8k05j24J23J5n5K8K4J2
$$ y = [806, 1654, 119, 785, 2609, 8456, 6774, 5656, 2107, 1929, 291, 1520, 2502, 1569, 1087, 4337, 3261, 1058, 800, 127, 224, 827, 1100, 207, 123, 45, 185, 68, 156, 93, 123, 82, 197, 217, 88, 108, 179, 141, 82, 160, 257, 158, 136, 259, 157, 57, 178, 199, 166, 44, 85, 74, 163, 163, 137, 215, 180, 77, 323, 236, 291, 172, 312, 353, 11, 254, 171, 165, 55, 156, 59, 187, 32, 211, 73, 120, 143, 224, 94, 33, 114, 39, 113, 197, 103, 85, 83, 138, 154, 192, 96, 231, 152, 212, 158, 125, 157, 155, 143, 140, 133, 103, 94, 146, 419, 133, 90, 140, 145, 146, 139, 117, 96, 274, 159, 181, 29, 75, 226, 85, 156, 114, 248, 240, 151, 275, 218, 206, 159, 81, 79, 126, 66, 167, 23, 85, 97, 142, 144, 173, 170, 206, 146, 35, 73, 106, 109, 16, 51, 188, 223, 147, 185, 170, 162, 165, 35, 98, 124, 153, 35, 54, 188, 249, 95, 35, 151, 55, 159, 168, 140, 130, 148, 235, 182, 90, 117, 108, 25, 126, 176, 209, 125, 118, 145, 285, 171, 36, 99, 165, 92, 115, 123, 171, 111, 261, 143, 126, 204, 129, 219, 198, 175, 164, 38, 81, 154, 80, 183, 85, 258, 112, 225, 156, 173, 119, 42, 71, 108, 276, 226, 76, 159, 74, 60, 149, 188, 95, 212, 130, 12, 57, 46, 157, 138, 216, 202, 256, 344, 139, 15, 138, 153, 98, 126, 150, 162]
-253A62q7O9O1l9Pj5j6j2o5L7j4
$$ y = [162, 75, 144, 205, 166, 173, 158, 142, 130, 65, 102, 88]
-390H8
##PAGE=	F1=-2441.22
##FIRST=	25168.397401625570637,	6007.3700543999984802,	0
##DATA TABLE=	(F2++(Y..Y)), PROFILE
6007E6L8J3L9jn7K6j0J42q0m5J07J3n0j65J70j47O0m1J1J9M1o9J0J0M1O7j17o8J4L7J6m3J12
5594A49J75k7k24P1J0p8N5P6l9j04P6K16j95r0j0O6O1J13j11r2n2j0J39Oj58Q2k9l5J49Rp5
5206A24j0Jj9K68j54R3n1k24J07j18O2o0J49J1m9M1L1j60J52l9Pp7NK8j0J02k5j43J03Qk5
4818A28L9j6j3M0m7p1k4kL1P8o3M9M1r7P5j05J40K7j28O2j15N5Q4j01N3m4k4P6M8q3n8k7Q5
4405I3N8L1j53L0R3p5N9N2K6j85J93p8m8n8R3L5M0j35J09Kj31L6L5J08R3j47p5oo1J51J00
4017B85k47J62or0J68j80P6QQ4j16K2M8R0o2k06K8K44J3j37O6r5l2%k2N5k3j10J10J6M8p4
3629A23NJ4N4j16Q0j1k6r5J65p8K6j06K9%lJ21j45J79rl9j10J8KJ58j15J07q3L2m5NM1j14
3228F4L1%J68j9o7m8R0k5j14R1L1j03%O9j18Q2L0n9P7L99K81m38K0R75m75r12K0JK1K67Q49
$$ y = [56, 94, 107, 146, 145, 88, 114, 104, 246, 166, 121, 228, 241, 191, 26, 196, 49, 109, 68, 79, 98, 139, 70, 80, 90, 131, 198, 81, 13, 27, 64, 80, 37, 149, 324, 297, 73, 144, 154, 76, 131, 207, 168, 64, 140, 356, 161, 71, 61, 127, 188, 301, 190, 98, 46, 36, 175, 181, 23, 105, 76, 41, 190, 199, 124, 114, 115, 96, 364, 210, 303, 252, 28, 135, 17, 79, 19, 168, 179, 130, 171, 202, 42, 194, 155, 162, 85, 90, 118, 108, 210, 185, 42, 145, 153, 128, 167, 151, 138, 178, 131, 60, 36, 34, 65, 143, 80, 129, 170, 73, 148, 43, 183, 210, 82, 144, 29, 84, 168, 67, 120, 76, 52, 128, 176, 93, 35, 8, 93, 151, 182, 29, 59, 152, 77, 136, 188, 214, 29, 222, 144, 96, 38, 131, 166, 206, 71, 180, 182, 51, 87, 122, 230, 323, 176, 101, 95, 34, 185, 285, 38, 200, 194, 104, 272, 92, 168, 176, 260, 144, 166, 214, 304, 242, 36, 64, 308, 321, 184, 250, 155, 123, 123, 101, 156, 133, 23, 133, 149, 197, 123, 128, 142, 196, 80, 160, 149, 123, 28, 193, 115, 141, 35, 64, 64, 61, 182, 37, 216, 207, 168, 58, 76, 78, 236, 121, 228, 145, 177, 132, 137, 178, 64, 95, 95, 263, 244, 177, 129, 219, 194, 80, 171, 202, 99, 99, 168, 50, 132, 162, 103, 180, 579, 860, 422, 442, 1417, 942, 30, 50, 51, 72, 339, 1188]
2840A188p49N03q73L92J075L207j089k41k245O9r45N99M63k74k29K015m38m5o28j624O9L46
2564E46J04n07l1P5n0j29O7O2Jo4P6M3m7j4o8P6l1R4J01p0p8R0n9j31jK44j07j20n0M0Q8n7
2164I3JQ9k1rJ51o6P6k11Q8j5j14J09K9r9o5J58q4N1j30K22j68M4m4L6Op1krM5Q4q8n5K8N4
1738A13J6J07p3O4p2p2m1J26Rl0KN3n5j10J9P2J86k90N3N6M1J9l3k0q0J50l9Kp0p3J84q1m4
1325H9L9J70r3j6R8r0j6m3k0O9k3n8J5q9J07p8J18RPL7n9n7m8k2J0L3m3N1J12M0o7M4n4n3
899A19M0j14L0O6L9o4q0J28Q3j29m7K8kK8J1q1O5K2K2k8o2R3k2o9L0J13K7j01q3%J58o0o1
486I9JN1p1N5k7M2l3M6j8L6%l9M7K6o8k7k6q7O2L2J11j41K14j96J16r0J08j04p9M9k0K38m6
73B61j99R1m4n8R0O0q1Rl2Mm1oJ23l7R4k6nN4k03J6O1J7%n8R6j6n2O1J2k6q1rL3m2k9J55o6
$$ y = [1188, 439, 942, 69, 461, 1536, 4743, 3654, 3413, 1168, 1237, 292, 891, 1354, 1080, 851, 2866, 2428, 2383, 1755, 131, 200, 546, 650, 143, 112, 187, 137, 8, 75, 137, 138, 74, 150, 193, 146, 132, 64, 140, 109, 203, 304, 234, 156, 246, 187, 56, 55, 299, 192, 72, 22, 62, 150, 93, 94, 183, 162, 153, 304, 238, 314, 103, 191, 176, 62, 171, 200, 101, 36, 194, 110, 161, 31, 253, 85, 129, 85, 121, 127, 56, 54, 45, 90, 174, 86, 31, 59, 113, 129, 236, 163, 227, 155, 83, 42, 168, 177, 147, 149, 202, 147, 37, 56, 128, 314, 24, 77, 133, 174, 193, 160, 140, 60, 210, 171, 173, 103, 30, 214, 133, 89, 128, 298, 205, 189, 287, 197, 181, 138, 118, 187, 164, 106, 121, 32, 139, 61, 179, 188, 195, 232, 173, 116, 68, 46, 56, 89, 46, 97, 209, 249, 182, 226, 172, 119, 159, 45, 75, 141, 180, 116, 36, 164, 247, 118, 71, 99, 97, 125, 136, 55, 120, 142, 164, 136, 74, 167, 145, 76, 106, 219, 246, 145, 62, 62, 220, 160, 99, 100, 151, 80, 135, 108, 150, 117, 163, 145, 181, 181, 142, 189, 215, 147, 120, 94, 7, 69, 101, 212, 71, 285, 89, 205, 115, 223, 119, 40, 89, 69, 307, 261, 62, 153, 109, 51, 141, 201, 120, 129, 97, 101, 60, 54, 177, 140, 234, 208, 203, 257, 54, 70, 131, 148, 148, 90, 186, 170, 118, 179, 191, 165, 84, 75, 108, 66, 37, 192, 126]
-390A26
##PAGE=	F1=-2543.48
##FIRST=	25168.397401625570637,	6007.3700543999984802,	0
##DATA TABLE=	(F2++(Y..Y)), PROFILE
6007A6N5L6M0k4m7K3j0J39j1j92K11P4k56K1Q1l2o2k4O7J8L3j44K4L9P9Lp4n5KN7j3m8J09
5594A35J82m6j80N9J2p2J07M6n9p4J05J59k75l1K5L8PK8p5KM9q6J07l3p3J6k7J02O8o7j01
5206D8L8Q7r4L16k40J06l9j45J25j74K9k4Q8K1o5J45L5k22R0K1P1r2L5p2J1L6L9j34O3MK0
4818A27J6k6j6N8l7m2j2M5l6N2Pp5J07r6P6o2Q3j3n0M8j24L3J54j32M7n6l0M5L5o7k3K3J8
4405G7J13j4j70RJ92j38P2k4Q9j26J16n3l0q4J18J6N0j30R1L7j13N2k9J17R4j69j6j5q3K7
4029G6R3j27J68Kp4J57k58J63o0P3o6O0m4Q9l8j25n2K69J9j70J06r9K0qo1J08Qj61N6MK9m6
3629A11j2J3M6o2R2k1k7q9J40k9L6r4l3M9o7J49j78J45o1O9j07jl9J28q0J60m0J6k5k4J2j21
3228E6l0N5J50J4k3j74J37o9%p1J12K5r7R1j12k1K5N3L7N4R7m1m5K94j64j80n6p2P2j0O9j4
$$ y = [16, 71, 107, 147, 123, 76, 99, 89, 228, 217, 25, 236, 310, 54, 75, 156, 124, 62, 38, 105, 123, 156, 12, 36, 75, 154, 157, 83, 28, 30, 87, 74, 26, 135, 317, 271, 91, 150, 162, 90, 197, 243, 184, 110, 215, 374, 99, 68, 93, 131, 138, 166, 91, 93, 142, 56, 163, 130, 57, 73, 46, 148, 216, 149, 48, 86, 173, 79, 395, 155, 261, 222, 77, 202, 28, 57, 33, 121, 142, 77, 222, 257, 35, 125, 146, 217, 125, 160, 88, 99, 135, 174, 40, 103, 107, 127, 143, 117, 101, 159, 122, 80, 68, 113, 77, 129, 136, 61, 168, 72, 148, 86, 169, 156, 106, 154, 30, 63, 217, 85, 132, 76, 46, 91, 126, 59, 36, 59, 77, 190, 176, 6, 15, 207, 69, 141, 117, 206, 80, 196, 143, 113, 29, 147, 163, 213, 83, 174, 211, 98, 150, 121, 238, 332, 163, 147, 132, 49, 76, 169, 42, 210, 212, 138, 295, 37, 200, 140, 213, 147, 207, 163, 252, 214, 89, 37, 306, 325, 155, 261, 162, 182, 174, 113, 221, 229, 68, 124, 128, 157, 111, 99, 112, 158, 96, 188, 167, 140, 51, 191, 162, 198, 104, 71, 120, 53, 202, 24, 169, 108, 177, 70, 69, 30, 158, 78, 238, 198, 214, 189, 165, 177, 56, 26, 81, 231, 245, 222, 48, 185, 116, 116, 45, 157, 182, 85, 176, 64, 43, 68, 121, 158, 212, 309, 268, 223, 517, 353, 173, 117, 45, 117, 107, 176, 162]
2827A62J16k14R7L35Q56l36J06q09J39k19M7O3J52M7P68k86O2l54o67P1L2P4j12jJ29j17k7
2489A14K6K7l9n6l6J09Q6q6p4N3%J03J08n6j74J01qr2m2K08j25Lo6n8P1K0m1L2K4L9Q2qK4
2076B69k37J8J21m3J0J42j92l5J01j6m4n4J83j28M0r5J7P8o7n5J00m3R4k1p4K4NJ8J47q9K9
1688B03k8j34nJ97J6j01j8P9r2o3l1Q7P2j7m1oO5L2k2k0j55J00K4J6l5l5Q6k5q8J18J44j61
1287A62LQ6p8m7K3k1J02p1j9m2J4N3j07J01N9N1k7j70OK3J1r3J45m6K8N6L8l1J7q5o5P9m5
874A10nP2M3m9j20Q2R4p9l5k9O6q9N9l4O9J5r9lQJ17m5%m3J59J5j04j06MM5N2k5l7J4p2J8
436F8J5R6l4p8J41K8o2j7qL5n2l3O6o0k4N6R5j47J77j65L5p9J71j05q0R4m9K15m7j69N9J21
35B63n1q0J2k4n4J6O3o7o3J13n8J49j3j05L0q4J03M8l8M0j90J53l9K0M5j6m5j21K1K8l4R9
$$ y = [162, 278, 64, 161, 496, 1352, 1016, 1122, 313, 452, 233, 280, 343, 495, 542, 1310, 1024, 1086, 732, 65, 136, 168, 242, 130, 129, 258, 141, 114, 140, 167, 128, 72, 36, 145, 231, 145, 71, 124, 124, 227, 335, 279, 105, 206, 198, 106, 64, 272, 147, 150, 84, 26, 97, 117, 76, 108, 132, 171, 253, 245, 269, 32, 50, 171, 128, 138, 280, 88, 53, 154, 138, 94, 40, 223, 95, 135, 40, 57, 135, 68, 13, 113, 70, 164, 143, 69, 93, 98, 116, 263, 174, 203, 175, 41, 36, 233, 249, 148, 130, 209, 117, 54, 23, 110, 182, 165, 124, 118, 183, 215, 193, 173, 18, 118, 142, 158, 123, 88, 174, 149, 61, 179, 323, 162, 165, 251, 173, 126, 149, 128, 230, 159, 140, 98, 112, 165, 58, 159, 218, 269, 242, 72, 78, 101, 112, 19, 164, 118, 146, 202, 240, 209, 226, 141, 76, 155, 110, 105, 177, 220, 171, 51, 133, 227, 148, 113, 84, 150, 61, 120, 86, 155, 170, 71, 68, 76, 193, 148, 148, 105, 264, 279, 175, 69, 73, 118, 170, 145, 108, 122, 50, 68, 83, 179, 145, 67, 208, 236, 174, 157, 149, 184, 132, 99, 165, 105, 81, 137, 232, 85, 262, 97, 132, 53, 224, 119, 39, 133, 84, 299, 252, 83, 142, 263, 212, 132, 144, 120, 66, 82, 145, 78, 15, 128, 70, 219, 206, 101, 131, 47, 150, 198, 160, 200, 10, 163, 124, 144, 189, 173, 128, 7, 28, 56, 22, 121]
-365A21J45j27
$$ y = [121, 266, 139]
-390A39
##PAGE=	F1=-2645.74
##FIRST=	25168.397401625570637,	6007.3700543999984802,	0
##DATA TABLE=	(F2++(Y..Y)), PROFILE
6007D2J4L4L6k9k4J6p3J40J01j77J48J06k41J0kN6mr2MP9M1j26k9O3M8p1O0j10M0M7N9p4L9
5594A31J50n5r3L0j7k8R4L3j01l4J46N8k75P2R%o2j5k1Q1Q9j45J07n3J2LL2P9j3j28n8K5J78
5181B31j93K91k48J35l8p6J33j86k8K9J1jk5J57M8k12J14mJ11q4N5j87J16k2M5j01O6q6M0
4818I1Ql8j6O2lK8J8P0j41nJ02j28J08o2J16r6J1j4L6j7j05KJ72j37N6p8M4ORo1PQ6m7J50
4392B34p8j42K6J90j45L7k0N8km5L2l3l5N2N3K2j00M1J2j5O5m7P8M6r2%m3r9J2ML0J05n4O5
3967B12O5j57J42j65O3RK0p5N9J7n5m8J93k5j70R4n6Q1jj04J46L3j53k9K1j8J7oOk1J2R8l4
3553A71k8p8J05L1L1q5p8P0j26J52q7l0L3J64q6j42M9J3m1J42NN5Oo8l0j03j3K6R5J3Q3j71
3153G8O1n1J34m6n1J25j79J20j05l0k3O2N1j05K09o3jn7l8J70p9j36J19j24K90k58M8n6KO5
$$ y = [42, 56, 90, 126, 97, 73, 89, 16, 156, 257, 80, 228, 334, 93, 103, 101, 157, 153, 61, 65, 144, 185, 59, 30, 93, 141, 70, 130, 20, 60, 107, 166, 92, 131, 281, 226, 133, 163, 146, 118, 212, 245, 144, 110, 256, 314, 39, 111, 120, 120, 58, 43, 22, 103, 192, 47, 154, 101, 113, 116, 148, 227, 214, 86, 28, 53, 231, 38, 329, 81, 216, 178, 102, 235, 49, 21, 50, 61, 60, 35, 192, 240, 28, 142, 138, 249, 165, 220, 33, 149, 127, 172, 71, 137, 51, 91, 99, 61, 45, 107, 104, 132, 150, 220, 79, 74, 176, 48, 156, 94, 210, 114, 125, 111, 147, 130, 25, 27, 199, 62, 118, 40, 84, 90, 99, 38, 45, 131, 84, 234, 156, 14, 40, 230, 85, 122, 102, 160, 158, 113, 145, 112, 77, 129, 182, 204, 104, 145, 157, 142, 207, 160, 238, 284, 192, 192, 149, 50, 62, 66, 96, 201, 147, 212, 277, 120, 262, 97, 160, 169, 189, 114, 173, 190, 135, 87, 280, 255, 85, 179, 123, 204, 203, 99, 245, 278, 125, 96, 117, 99, 116, 110, 116, 95, 107, 205, 171, 143, 65, 170, 201, 232, 147, 69, 139, 13, 165, 78, 48, 81, 245, 159, 17, 66, 79, 38, 180, 185, 240, 246, 178, 148, 45, 32, 58, 153, 166, 249, 78, 139, 88, 222, 176, 125, 250, 71, 191, 86, 56, 33, 95, 146, 41, 250, 187, 186, 129, 91, 261, 182, 46, 165, 41, 331, 73, 121, 65, 67, 132]
2777A32L29L3j91kk37P9oQ4LJ48l5N4M52k10m39j34M1N1m8k0J56j06P0K1q7m0m4O0m3J73j04
2389A40K4l1l1J12J09m0k33R8J4K8m6Or0J65q7p6K2P3p3l5J7N6P4K2k6j66P4J06lo7J36j62
1988A10k2J2J8J2m9L4l0O0j09R8m5k3j1J08m9P8rp2%o5R1J37j48J9N5q4o4K32M7j72p4O5q1
1575F9N7n9L0j9K25j26o7O1K8J5pj38jN6M7q4M8j6K3l4J02R2j46p6J09j4p3N0j8O8j01P0m0
1162A31O2l8K0q1J14J22r0j55RL2L9j54J91pj5k1O1j6k9r7K4O3l2O7K9J4o3j27J02L0rm5l2
749I9P3j40J49j5JJ9j40pO6R2j02O5q0K09k6r7j13O2r1J49k5n3Rq9M5RJ61n5j53K18ln7j9
336A61J6n4K1n5Q7l4K4k1R3j11N5o7p2lJ48p3r9J32rJ07m8j04P8K18k0k67m9L1q%P6l5o2m
-90E2MJ28K1j42J6M5P9M9p2M3j32J07j72Q6N2k3q7j9Q1l2PP4J16j52
$$ y = [132, 461, 494, 303, 301, 64, 143, 137, 221, 224, 372, 337, 391, 843, 633, 194, 60, 101, 152, 104, 84, 240, 134, 204, 225, 138, 98, 54, 114, 71, 244, 140, 164, 133, 102, 214, 323, 283, 50, 148, 162, 190, 144, 150, 60, 225, 138, 62, 84, 157, 84, 49, 66, 122, 196, 218, 192, 26, 100, 206, 203, 136, 272, 110, 88, 100, 118, 130, 81, 115, 85, 145, 36, 134, 89, 66, 55, 163, 114, 192, 183, 111, 111, 46, 137, 274, 126, 145, 200, 116, 52, 284, 331, 159, 85, 150, 69, 126, 67, 97, 78, 303, 177, 110, 171, 199, 214, 207, 69, 68, 124, 171, 87, 135, 119, 142, 108, 210, 302, 156, 80, 189, 175, 102, 152, 134, 202, 101, 171, 131, 193, 155, 175, 94, 208, 330, 240, 85, 94, 126, 165, 11, 202, 195, 180, 159, 220, 204, 175, 78, 102, 165, 133, 200, 229, 243, 180, 53, 155, 185, 176, 131, 99, 172, 32, 181, 166, 167, 186, 46, 39, 105, 197, 95, 160, 80, 289, 263, 166, 53, 115, 24, 173, 148, 95, 104, 15, 60, 69, 230, 175, 22, 240, 237, 180, 161, 177, 123, 144, 89, 176, 142, 166, 145, 238, 127, 182, 115, 43, 40, 188, 115, 16, 148, 139, 246, 198, 94, 172, 390, 370, 103, 54, 85, 77, 77, 153, 118, 56, 52, 56, 184, 205, 63, 79, 124, 203, 252, 180, 223, 91, 198, 26, 112, 164, 141, 54, 35, 116, 84, 91, 165, 281, 129]
-390A29
##PAGE=	F1=-2748
##FIRST=	25168.397401625570637,	6007.3700543999984802,	0
##DATA TABLE=	(F2++(Y..Y)), PROFILE
6007G3j1NL3l3nL4j0K4J30r3M7J20j75k7l8M2Q6o0j01J44K8j14j2M4pj9P2j29J6J9J73j14
5607A42oJ00k3l0J6r1N8mM1j36J7J58k9k00R4L3k1q7P1p4O3R0j53J12m8O2l4P6N4r0j23J7
5206E5L9K06k28J43j83J23l1oJ09j29o3J7pP5J5k6N8p0J03p9J12l4P4k32J12J2op0J07r8p3
4818B5N3n3P0rrO2M9J02k10m8J44o5J9j4J40j26p1K3R1q7m5k1J19r8K7m4R1k7J2k3m4J66q8
4405A11R5r2r2L8J74j03m9N8j6J20k04R4m5JJ4J21l9p2j2n8J36P3l3K1k7K9kj16o7O4o9N9
4004A12M9n5J81o9j7J01k32O3N8n7ok3Q7m8MP7q0j27M1pJ45jr5J51Rq0j31R5o3QL5K6r6P2
3578A27R0n7l4p3J19N9Rq4j01Q8p7M8K4k3N6J17p2j72M5p4J3Q5K1J13L6j07o9n6J6l4J2K3
3178F8J79m3j21L9J36j1j51J73k08J32p2n0M9p6O9%J82j77O0j2j23J98m7j46J24j14K86k41
$$ y = [73, 62, 67, 100, 67, 62, 96, 86, 110, 240, 147, 194, 314, 139, 112, 74, 116, 202, 142, 41, 185, 213, 99, 87, 131, 124, 105, 177, 48, 64, 83, 256, 142, 136, 236, 213, 183, 199, 108, 166, 162, 203, 67, 84, 242, 213, 13, 107, 140, 119, 32, 103, 29, 92, 182, 29, 141, 93, 155, 121, 197, 251, 161, 38, 55, 94, 300, 72, 215, 32, 155, 124, 118, 227, 98, 35, 52, 45, 120, 135, 109, 167, 97, 200, 121, 233, 199, 273, 41, 153, 165, 159, 89, 196, 98, 25, 78, 25, 95, 86, 77, 139, 188, 290, 80, 32, 176, 111, 130, 116, 256, 130, 59, 82, 173, 86, 41, 20, 139, 41, 68, 24, 115, 88, 100, 77, 33, 199, 111, 206, 114, 22, 60, 234, 131, 82, 140, 124, 244, 40, 134, 89, 90, 104, 225, 186, 114, 102, 44, 180, 253, 220, 241, 214, 243, 241, 125, 58, 122, 53, 112, 161, 106, 287, 218, 201, 302, 70, 133, 191, 134, 128, 105, 192, 144, 148, 225, 145, 18, 59, 52, 197, 196, 101, 252, 261, 181, 50, 145, 82, 90, 125, 151, 55, 127, 217, 160, 126, 53, 172, 231, 240, 156, 55, 143, 66, 114, 138, 115, 171, 288, 216, 44, 89, 15, 28, 113, 134, 247, 283, 176, 107, 51, 67, 33, 45, 68, 247, 204, 83, 122, 258, 247, 96, 269, 61, 193, 121, 71, 120, 44, 113, 113, 295, 118, 178, 166, 43, 241, 194, 48, 172, 58, 344, 103]
2827A03R0j44Q8L3L63r8R6k18j55p8J59l1N2P5j89M23N16k95o37j21J33M8j26m4J38q9J34
2489B26Kj58K0n9J87j35J03n2P3o1q9J10Q2kj13l9J7J78j08j67P6J62j01m5J9L8p1k0l3%R5
2101A35K1m2l6P7OQ2r3L3n3qM3j15J55n0j10J1J17j61J59j49O5m4J11j4Q0l4n8k7q1J60R0
1713B70k10J1J23o2l5J93P2k15j08N4o0J09l4k5m9L14j70m4J7RL2K2r8m3P7P9k00J34r8P1
1337A36J7L7O8q5j33R5N6m3l4pM7j40J88p0J12j18J59j69J9J85o6j07k0%M3j14J22O5k7j15
962A01J08l0p9J9O5Mo4J74k3n1q1l5J00p1N6k7n7L6m0J89p1r0N4n4m0L5N6j19M9o1K23r6o0
549A20q7N0k7R3K6j20N5nN8q6J98q8j59J84k7Km5O9j53J25j12N6m1J42j24J18p1q8N7r5L7
161F2P0l4l5R4KJ0l3pP8K45Ol57k1k7K7rO8Kj7mJ6RM4q2K0K0P3L9o8Qm0J39j99n1O5j2l7l5
$$ y = [103, 193, 49, 137, 170, 533, 435, 531, 313, 158, 80, 239, 208, 260, 335, 146, 569, 1085, 790, 153, 32, 165, 213, 87, 43, 181, 92, 226, 228, 70, 90, 31, 218, 83, 186, 134, 207, 146, 57, 167, 249, 247, 134, 95, 112, 290, 182, 15, 91, 253, 152, 107, 126, 164, 93, 73, 40, 40, 135, 156, 114, 78, 155, 161, 243, 150, 183, 130, 122, 165, 50, 205, 155, 45, 56, 173, 12, 171, 22, 87, 43, 154, 140, 220, 186, 128, 101, 20, 180, 270, 60, 71, 194, 132, 97, 290, 362, 147, 39, 93, 33, 142, 108, 83, 34, 348, 178, 134, 151, 160, 192, 214, 116, 73, 150, 229, 29, 163, 65, 136, 153, 190, 258, 173, 40, 135, 191, 148, 114, 107, 154, 14, 202, 132, 244, 126, 285, 116, 135, 320, 254, 147, 127, 127, 170, 56, 178, 243, 216, 101, 209, 179, 100, 119, 184, 188, 124, 298, 275, 224, 143, 108, 208, 137, 193, 166, 109, 145, 105, 294, 223, 133, 187, 133, 93, 128, 184, 65, 114, 53, 276, 180, 120, 33, 83, 56, 149, 175, 55, 110, 105, 163, 77, 275, 187, 28, 212, 185, 187, 142, 211, 58, 183, 71, 127, 86, 228, 104, 222, 151, 63, 120, 25, 62, 132, 98, 63, 157, 159, 169, 136, 129, 207, 452, 458, 101, 80, 53, 80, 71, 139, 141, 124, 120, 136, 145, 189, 107, 127, 147, 220, 259, 191, 199, 159, 298, 99, 48, 113, 101, 64, 29]
-315B9J22Pk1K7P3j34
$$ y = [29, 151, 158, 137, 164, 237, 103]
-390A03
##PAGE=	F1=-2850.25
##FIRST=	25168.397401625570637,	6007.3700543999984802,	0
##DATA TABLE=	(F2++(Y..Y)), PROFILE
6007F8Kj4J8j4PM4M2jQrnJ20j65j3J6m0J19K2j07J23Mj22J03l7k8K7J1r4l8J9K31j49%N7J9
5569B24mPj79J47j14L7j02Q1Q9n4r7K4R3ln5N2r7NJ09q3M1k7Q1p0P9K8j57l6K5R1K37k11m8
5156A13o8O5l5P9N1p5q0L9qR5qj41J00K8O2j31Q8M3R8k09pL6l4K3J52r9q3Pp1J14l1n9N1O9
4730A74J46k28QO6k2n1J6J28r3p7L0J03j52N8n8L1j3m2L8L7j1N7l6r3K02r6mq0J3jJ79m0j11
4317G8M3K4J65j74k9n9J1R5J21j23n7l6K6J17O8k7qp2R4Mj94J4O3o7PK0N9J52j70Q4M4j99
3917G4L2Q2j11Q5r0J17q1Q7l2j05L3M8j13J41ll7J32n4J4j36Q1q5m8P2R6j36R1N8p6m7n4J64
3516A99L4j4q0q2J15m6l6Q7K3L0N2p2j30L1Lm6J8OJ42N4j10q8k0J7l8L4QJ29O6k44J11O3l
3103B13j38J67j69J14j6q1P4j32M4L8J19j93J56j64P0P1J7j28Q3p7P6l9J4r5K37j14q4J6J14
$$ y = [68, 70, 56, 74, 60, 67, 111, 153, 152, 160, 151, 146, 266, 101, 88, 104, 64, 183, 205, 98, 221, 225, 103, 206, 169, 141, 168, 179, 85, 47, 66, 297, 148, 148, 205, 224, 220, 227, 48, 195, 81, 118, 16, 97, 186, 132, 35, 59, 152, 149, 94, 146, 49, 54, 163, 80, 121, 94, 175, 105, 184, 212, 55, 19, 44, 135, 372, 161, 113, 45, 110, 75, 154, 205, 130, 50, 89, 81, 176, 168, 27, 127, 155, 217, 86, 174, 217, 315, 106, 99, 135, 101, 124, 276, 177, 94, 101, 30, 144, 113, 54, 105, 174, 320, 92, 100, 166, 144, 93, 109, 237, 144, 67, 97, 200, 48, 106, 48, 79, 66, 24, 62, 99, 88, 145, 109, 16, 218, 122, 118, 38, 51, 50, 229, 189, 78, 121, 145, 310, 136, 107, 48, 59, 154, 275, 152, 95, 59, 85, 202, 270, 243, 235, 163, 257, 261, 67, 81, 144, 77, 84, 104, 163, 315, 145, 229, 273, 74, 106, 188, 77, 162, 72, 189, 108, 195, 163, 58, 91, 139, 26, 167, 164, 127, 259, 205, 219, 83, 164, 79, 31, 103, 199, 63, 154, 212, 136, 89, 35, 199, 233, 219, 139, 57, 172, 126, 90, 177, 200, 230, 282, 210, 80, 111, 114, 68, 86, 92, 234, 288, 178, 90, 70, 87, 49, 83, 91, 220, 286, 42, 153, 216, 213, 75, 242, 73, 187, 171, 90, 164, 32, 76, 114, 233, 40, 196, 32, 102, 173, 190, 62, 145, 68, 144, 105, 119, 24, 261, 147, 63, 79, 193]
2740A93n1j3n5R4j00J18J23j62J9mK0j78M4O2J03n3q2P2o4J05l2j22O1o0J84p3J5J3M5p5j28
2352A9Q9J8O4J9j23N9K10j63j29O8R6q0j2PLn5pL6n2NL2p0R5Rl6J14m7n5J8j0J03j77J93k1
1926B20m3r8J21j19Q2l4J6j04M3M9Q9k5o4l8l4J45J5j77rJ15l5L4R0P7k06n9R4j24O3L2Lj9
1525A00K14j87M3k5j1K0K2l8l1N4J06k48J59j47J13M4m7O1m8n5M1P1k1r7m3O2k8J49j62J74
1150B45j32K34j43j89K13L4j44j2k7M5j4K2J13J0j93J56n6p3J22K4k7p9K30p8j20q7J01N4
799B29j21R2K4j07rK6K33j13j88J57j2q3oM1qr9PJ46j61L0Np4Q1J1J29j99R4M8L3r9J87j20
398A74j41J14k9P3q8R2j30J39j61M7n8K13k28J61m1p1N8p9J8J0k3M0Q8m9l9K0N9L5K26J5l10
10A35J4q1nrN3J7M5L0m1n0M6m8L7k7R4K1m3n6O9J50k03p8j3L4M1j19J02P0m5nL3r0
$$ y = [193, 142, 129, 74, 168, 68, 186, 309, 147, 166, 162, 182, 4, 48, 110, 213, 160, 78, 150, 86, 191, 159, 37, 98, 38, 222, 149, 164, 177, 222, 147, 19, 108, 126, 190, 209, 86, 145, 355, 192, 63, 131, 227, 147, 135, 142, 145, 90, 83, 119, 67, 72, 104, 34, 129, 138, 102, 216, 169, 114, 132, 122, 225, 48, 241, 220, 177, 79, 200, 81, 163, 129, 145, 41, 84, 133, 222, 197, 133, 95, 61, 206, 221, 44, 35, 150, 115, 149, 239, 316, 110, 51, 145, 21, 84, 116, 119, 100, 314, 127, 170, 145, 134, 154, 176, 138, 107, 161, 267, 19, 178, 31, 144, 188, 141, 202, 154, 99, 140, 211, 190, 93, 50, 112, 84, 233, 71, 245, 113, 347, 204, 15, 228, 262, 118, 106, 79, 124, 110, 132, 245, 255, 62, 218, 162, 89, 211, 235, 208, 129, 359, 281, 161, 74, 175, 229, 108, 200, 224, 117, 108, 134, 367, 254, 66, 223, 211, 128, 122, 163, 155, 56, 63, 209, 48, 78, 83, 9, 90, 101, 230, 31, 125, 173, 206, 107, 294, 174, 33, 147, 118, 191, 103, 195, 65, 204, 43, 90, 32, 245, 17, 178, 137, 66, 124, 45, 63, 73, 50, 90, 178, 129, 90, 110, 169, 204, 430, 445, 135, 149, 68, 63, 54, 107, 124, 169, 199, 158, 108, 154, 106, 143, 116, 210, 231, 188, 132, 201, 351, 148, 70, 57, 91, 132, 13, 115, 185, 140, 135, 168, 78]
-390G8
##PAGE=	F1=-2952.51
##FIRST=	25168.397401625570637,	6007.3700543999984802,	0
##DATA TABLE=	(F2++(Y..Y)), PROFILE
6007G3K0l0KJ9K9J0RL7o8lJ5R7j91P6L8k1J7J05p7O2j0j05J65r7pj9on0o9J33J42j94N5L8
5582A95N0jj2j90J54j01p4N3L8Rk0k2p5J47M2q1J7p5l6J51np0LQ4m8j2Ml9K8j09J22K80j55
5169B52k01J0M9n0J34Pp0j05J29n3M1k4m9J11J0Qj43M6J04J11j69j15Kk8J45J83j14m3l3j29
4793A6J39k3r0L0M7J94j83J9L0m5m3j1Q1j2l5M1P1j89J43j14k2O6l7Qj9O7Q6j07m6J00p6m4
4392D2L2K8p6J91J8r2r4J45J36j18j32n2qJ78R0j89mm8J15J4O5k8j3m6P6lk08R9M5p4n3K4
3992F0J30Q4j68R5k6o5l6Q8j29J31j08R4q7J41l7j36J21M6j27M8%L4J29j23O2o3rr8j1K2J59
3604B21j27P6%p7k6l2J79j4l3p0k6J31o8k8N7M4L5Ko7q5L9P3q0o3J3J36N2o8p7l4K5l1R2m2
3178A27N9J22k72J24k7J6mO7j10P6M5o5kq5j1L2J17j80K11j40P5m8P5j23K0rq2P8l2m5K97
$$ y = [73, 93, 63, 65, 84, 113, 123, 132, 169, 101, 98, 113, 210, 19, 95, 133, 112, 129, 234, 157, 219, 209, 104, 269, 172, 165, 146, 140, 90, 21, 154, 296, 102, 157, 195, 245, 244, 232, 42, 196, 95, 21, 74, 112, 121, 101, 79, 4, 151, 193, 112, 129, 54, 18, 169, 164, 94, 97, 181, 133, 121, 125, 86, 114, 5, 127, 407, 252, 51, 61, 110, 60, 194, 201, 131, 26, 155, 102, 143, 119, 70, 181, 191, 199, 56, 102, 206, 317, 148, 33, 35, 7, 152, 335, 221, 178, 145, 16, 155, 132, 42, 72, 119, 313, 130, 149, 179, 134, 91, 80, 161, 149, 114, 155, 226, 37, 180, 66, 44, 110, 73, 81, 62, 129, 215, 108, 62, 162, 86, 42, 74, 102, 26, 217, 235, 143, 49, 194, 330, 212, 80, 28, 20, 198, 288, 99, 95, 47, 162, 176, 241, 213, 200, 154, 230, 227, 19, 118, 163, 89, 36, 60, 190, 274, 106, 201, 175, 110, 74, 162, 33, 164, 56, 150, 63, 204, 167, 31, 152, 198, 71, 119, 119, 153, 282, 159, 221, 158, 149, 51, 40, 62, 221, 94, 170, 170, 93, 67, 35, 214, 200, 167, 97, 71, 202, 134, 106, 163, 207, 242, 244, 177, 92, 131, 204, 124, 61, 74, 210, 262, 194, 117, 83, 108, 77, 169, 127, 186, 308, 36, 160, 133, 149, 145, 212, 102, 178, 223, 158, 156, 71, 60, 92, 209, 29, 240, 100, 175, 127, 202, 79, 99, 90, 8, 86, 54, 9, 306]
2790C06q8J88j56j29r2J90j10k7O5o8J59k4O9O36k32n86k6k9J50M4j31M1l3L5n5ono0Q9M3
2414A58P7K1n4n2q8K0n9J08J06j30Q6J71j77j22K6P6j8J1k4j1n5j4R6k4k1L2q7Q2o6k4J09
2026A53m8Oj4j5J27j06J40kJ5j07M1n6QM1rl4k1K1N2L3q2j9n3J50r6o0j5O7k6P5j7P2j17m8
1600E6J30r0n1N4J22k9O4j59P8k3k1K5n1L0L2n2J21k29J77j12Q3N8j26K8l7J2J10K8l2o8k6
1212A02n0Q0J28j70J21p5K17j05j36j6J50j74K0q4M4R5k2R2O0k27J97q7j7J10n3J3n6K09j22
849B44j60k6J59j1r3R0P3j40ok2K40r1k52K72k5j22m3O3P3j18m0L8rk2R4q5K8j5J68j70L0
461A22M8J3m6J44j40j31Q6KR4j27R1l2M5j51R4L5O6j31M8l2N2kj11L1k0j7N5J17j26l8R3N5
60A87k5J67Qk01K3p1k7LPJ6J05L3q3p4M3l6N7p0J21J8k6j34J81R6k05J6j10O7O2j22M1P5l7
$$ y = [306, 218, 406, 250, 121, 29, 219, 109, 82, 147, 79, 238, 214, 283, 919, 687, 101, 75, 46, 196, 240, 109, 150, 117, 152, 97, 91, 86, 26, 115, 158, 235, 256, 202, 150, 62, 82, 23, 131, 237, 107, 193, 364, 187, 65, 91, 167, 149, 160, 136, 125, 70, 56, 152, 128, 107, 139, 52, 134, 68, 44, 153, 105, 111, 97, 82, 209, 103, 243, 241, 256, 149, 190, 134, 142, 183, 174, 140, 119, 140, 192, 225, 143, 124, 71, 221, 125, 65, 50, 117, 91, 166, 149, 221, 104, 56, 186, 96, 45, 99, 221, 192, 256, 97, 175, 152, 131, 156, 105, 135, 167, 115, 236, 7, 184, 72, 155, 213, 87, 115, 78, 90, 200, 228, 196, 128, 102, 52, 132, 260, 90, 211, 136, 353, 248, 112, 96, 246, 72, 92, 8, 52, 147, 125, 217, 277, 50, 247, 160, 143, 253, 200, 213, 157, 366, 244, 84, 58, 217, 206, 113, 203, 276, 136, 130, 108, 348, 257, 5, 277, 252, 130, 87, 150, 223, 105, 65, 103, 94, 72, 166, 81, 109, 94, 262, 92, 122, 170, 183, 137, 281, 141, 10, 96, 98, 192, 65, 156, 124, 169, 18, 112, 147, 213, 82, 130, 98, 150, 148, 37, 68, 48, 31, 86, 203, 77, 39, 132, 187, 162, 329, 337, 136, 159, 88, 61, 64, 71, 87, 192, 225, 142, 68, 111, 75, 132, 62, 183, 201, 175, 41, 222, 318, 113, 129, 19, 86, 148, 26, 67, 142, 105]
-353A05j2J1l9
$$ y = [105, 93, 104, 65]
-390F5
##PAGE=	F1=-3054.77
##FIRST=	25168.397401625570637,	6007.3700543999984802,	0
##DATA TABLE=	(F2++(Y..Y)), PROFILE
6007A10L6o4K5MM9k9j02Q4L6q9N3M9j16J31l4k4k4J31k2j9qn8J03q7K5j02O0l5j6J44P1k47
5607C5J21L4P0J7m2q3M8n1q2K8j6kM4j0n1R0P3j28k5m4PJ53N3j57J9Q6jj16l5J69J8j76J10
5194A56K27o5l07N5M1l0J46pr6m1J33j28k9j2O5J18j2k5j01k0R8R8j12p4KnN4J72p8J1l7j21
4793G6O6j3j01N2l5K29r7kK9j16L5l7OM3j2Q4K7j64J59j71k2J13m8k5JQ1R3j76J9n2rL7J10
4380A80k3j36J80N1n6j19J56O1l2j55m6j6J34N3j12L4j00J18p0O5j2j9L1L0m4p1Q3L5j21l3
4004D6MJ15J7o7L2n7O6r0Q2j34J17r2L1M2N7N2j96J70m1j01J5kJ06J53j75L7J4o9q2KNJ36
3604A93o9M0p1l8K1l9J65n1n9o1L4J26j09O6m5O4M7Nk4p9MJ06p4j16L8J15K9rp3n8N5n1J13
3190A95q3N2J32k37Q6q8J01Q7l9r2M3J00l8q8%m0K7J00j60J79q8J0n1R9j33l1L5m0L0j4J3
$$ y = [110, 146, 82, 107, 111, 160, 131, 29, 113, 149, 60, 113, 162, 46, 177, 143, 119, 95, 226, 204, 185, 177, 119, 222, 135, 160, 58, 118, 83, 67, 211, 282, 35, 156, 190, 260, 277, 235, 152, 200, 149, 67, 95, 79, 77, 121, 111, 60, 150, 223, 95, 70, 26, 33, 186, 239, 82, 101, 187, 186, 70, 35, 204, 222, 46, 156, 383, 318, 11, 66, 107, 77, 223, 216, 120, 79, 212, 84, 55, 43, 108, 226, 214, 189, 88, 68, 166, 264, 152, 78, 80, 75, 129, 301, 223, 234, 197, 76, 142, 129, 28, 80, 45, 274, 177, 175, 204, 88, 123, 86, 92, 135, 123, 207, 234, 70, 229, 58, 36, 149, 101, 76, 77, 158, 251, 75, 94, 42, 33, 70, 180, 157, 21, 201, 252, 196, 77, 233, 294, 262, 107, 61, 45, 179, 232, 120, 154, 54, 172, 102, 167, 155, 136, 167, 197, 153, 82, 165, 200, 79, 46, 50, 165, 182, 115, 147, 90, 156, 66, 148, 14, 131, 39, 70, 112, 169, 221, 25, 195, 154, 53, 68, 66, 172, 325, 150, 187, 201, 132, 50, 52, 57, 193, 124, 164, 93, 55, 76, 37, 202, 151, 92, 31, 65, 191, 82, 148, 103, 167, 214, 219, 195, 116, 120, 226, 152, 36, 74, 189, 218, 209, 136, 78, 133, 82, 195, 112, 164, 296, 59, 145, 57, 158, 245, 206, 114, 157, 257, 219, 131, 131, 91, 118, 218, 58, 237, 149, 159, 108, 207, 74, 43, 78, 38, 68, 54, 67]
2802F7J43n8R2j34k6l6J67p2mlj11N3M9J91L66k71k99%o8J40N4j20J9qJ4k2Qn9j9J3N3J59
2402B78L3j81K1m1Lj6j7J39j19Q4J43j57j23PM4P9J3l7k5r6k3J18L1QK9q1k2o9qJ09r2J00
2001A32r2LR4k2J09j9O4o4o6J5KqnR6L0r3m1Q4n2mr7J92j58j5k2R1p8P9j02P7J0j02J24lJ5
1563A74n1J77n0l3q3MJ2n2P5q0OJ14j69R6j03J42l4LP3j85O5m6K8J70j7n3m4J7j03O8J53p1
1162B03J5m1J44r2n3j56J72m1J6q5o9J42j4N6P3k09K23j08QO0j52J20k6J38j33j25M3J14n9
799A64j1N6R2j31j2r7J94k4j68K32m7j31n9R1P8o0q9o4J70j16J71j34K2J2J12j09m6JL4J3
423A44R8j35o5N6RQ2j14P4pn9L4OP5m9qpp1J02Rj27L5K1K3l1J30j37nQ8Rp9Q1j1q6K0j0l4
-27F1Q4o9kJ26Np3j11N6k3N3o3J07L4k9j11J57K1j47Q8j28QO8n3P3q0J9k2LJ3
$$ y = [67, 210, 152, 244, 110, 84, 48, 215, 143, 139, 136, 25, 78, 127, 318, 684, 413, 114, 114, 46, 186, 240, 120, 139, 131, 145, 123, 131, 72, 53, 66, 119, 278, 311, 130, 151, 110, 113, 97, 80, 219, 100, 184, 327, 170, 47, 54, 98, 177, 190, 153, 128, 32, 9, 127, 158, 166, 195, 114, 92, 23, 15, 124, 32, 132, 40, 43, 137, 115, 224, 205, 269, 205, 139, 154, 156, 148, 143, 239, 269, 176, 135, 219, 167, 163, 66, 258, 100, 85, 63, 154, 76, 155, 53, 130, 140, 38, 162, 159, 174, 123, 300, 250, 217, 134, 138, 150, 98, 173, 93, 99, 213, 44, 140, 37, 179, 145, 148, 221, 36, 101, 55, 83, 253, 236, 183, 139, 156, 53, 121, 274, 203, 218, 177, 321, 229, 176, 20, 192, 151, 167, 82, 13, 155, 141, 197, 270, 61, 284, 176, 184, 244, 92, 212, 186, 324, 191, 66, 109, 223, 164, 153, 209, 301, 170, 158, 61, 255, 231, 63, 295, 248, 117, 58, 149, 227, 167, 78, 14, 184, 68, 239, 105, 127, 139, 251, 142, 96, 97, 131, 144, 242, 107, 42, 98, 107, 189, 75, 149, 142, 83, 117, 123, 198, 149, 141, 134, 63, 165, 174, 47, 82, 103, 126, 95, 225, 88, 83, 171, 180, 101, 182, 171, 85, 105, 95, 61, 145, 76, 74, 200, 205, 132, 21, 77, 54, 107, 44, 151, 185, 156, 45, 202, 223, 76, 164, 36, 44, 112, 59, 132, 52, 71, 49, 52, 65]
-390F5
##PAGE=	F1=-3157.03
##FIRST=	25168.397401625570637,	6007.3700543999984802,	0
##DATA TABLE=	(F2++(Y..Y)), PROFILE
6007A32O3q8K0nN2m6l7m2J21l2ljr6J96r4p6J6J06M0p6K2m0l2J0K5q0O8k8N1K9Q6k04R2K0
5582A69O2Q4m4k2l9o3n1np6N2P6k2oN0N2j31n2N2l6J38Q0j58k5J08K9j16m3J88M4k12J54Q0
5181C17K0l04L3K2J1J29nj19N5P4j96L1JL9J09jk0n5n7L9N4m9j5L2m1n6J13M6M6j5n9m9j1
4768A19j03Q1n3J82l1k3K9j27O0Kn2J6lJ26Oj22J34j76%J07p8m3K6M9R7j87N6J0L1n0J60n2
4367A91j37J31N7l2p6R2kQ7j28q8m2O3J3R5j8j54R2o1j6M6l9Q8op4L5Q6M3j72J8k6N6m0M2
3954A24l7N8M1j11O2j11O0m5nJ58q0J28j23J07j42o1J7j7J63J73k03k3P1m2q1k0J9O9j0lo1
3566G5N9l0k3R4o3q4J9pR4m3J08j46Q0K6O8Oq8p7J17l8j17N2J07k0K7q1o0Q4o6P6p4P1J23
3153B69j65M0q1J28J19j20r2K0J39j9j12M4o7L7P0j70J42k1k9l0P6j36Qj1k1J3P7M8r8k9R8
$$ y = [132, 195, 107, 127, 122, 174, 128, 91, 49, 170, 138, 135, 134, 38, 234, 140, 64, 80, 186, 226, 150, 172, 132, 100, 110, 135, 55, 123, 95, 146, 175, 261, 57, 149, 169, 231, 315, 271, 249, 210, 147, 96, 91, 15, 67, 143, 121, 115, 165, 217, 86, 34, 86, 50, 188, 268, 110, 85, 193, 222, 106, 63, 251, 295, 83, 237, 317, 337, 33, 66, 88, 99, 228, 223, 104, 159, 233, 37, 68, 69, 108, 217, 216, 196, 141, 84, 123, 177, 128, 113, 145, 104, 48, 161, 207, 253, 238, 179, 130, 119, 16, 97, 44, 226, 195, 172, 201, 74, 134, 136, 84, 100, 97, 223, 229, 107, 241, 65, 65, 172, 94, 51, 77, 126, 223, 36, 92, 102, 133, 83, 243, 191, 54, 185, 242, 210, 134, 226, 224, 311, 183, 95, 53, 116, 129, 224, 206, 52, 144, 83, 67, 113, 74, 162, 156, 82, 117, 203, 246, 74, 92, 66, 122, 82, 124, 87, 145, 186, 75, 137, 26, 86, 41, 36, 194, 114, 242, 119, 226, 84, 23, 40, 23, 186, 359, 156, 133, 204, 162, 81, 61, 80, 149, 139, 136, 75, 134, 104, 81, 175, 112, 28, 47, 40, 134, 91, 199, 53, 133, 159, 227, 233, 145, 68, 185, 147, 30, 82, 189, 169, 196, 115, 55, 139, 73, 149, 75, 146, 269, 104, 144, 63, 191, 310, 190, 98, 118, 257, 238, 126, 170, 103, 140, 210, 40, 182, 161, 132, 102, 178, 42, 50, 39, 18, 31, 108, 156, 58, 29, 127]
2765A27O5n6m1P2j9M9m9j32J07l5N5q1J31p8M1j0KK2l6j3J0M3l3J4o4O6Q9j29J33M7k38Q0
2364A39lrj8o4J13j06P2J37j21p2O8p5J55qnm3j40M2K8O8lM5p6r0P1l5Q7nk1q7J9L1L7O9n1
1926A49Q8j2j63J00O2j02mJ83P9j83j32J00J5K8j27J93j30m5k4J19j19O7j20N4P1j34Q5Q0
1575A78R2o5R3m7m9k4k5mj29J49Mj29J84j12q0L8P2P9j02P3j25J35m1oJ00k2n4p0L9k3o3J91
1175B57J0nn6P0j10oj03M6J28rj29l4Q0nO0M1j35K06r6j2J5q8J01k8N2r2p4L5Q3o7P0QP5r7
749A91n6r2J22K6r1J66m7j10k4N7L0J8o2q8J59j39K05j99P8RM8m5r3LK9L8M8q4j7J3rQ9m6
336A27K5n6j6J40j02N1q6L9K9j06P1N9r8K7O0M2p7R8j02J7M7m3p8K5o4j3KN7j0J64j11l2J12
-77A98m0m6n8jj4L1j7O9N2n0k0K6J3k8M8q1l1NK9R8j20J2l3PJ8
$$ y = [127, 192, 136, 95, 167, 148, 197, 148, 16, 123, 88, 143, 62, 193, 115, 156, 146, 148, 170, 134, 121, 131, 174, 141, 155, 91, 157, 246, 117, 250, 297, 59, 139, 136, 127, 109, 45, 158, 52, 124, 261, 140, 68, 136, 61, 216, 208, 203, 160, 20, 62, 90, 158, 155, 200, 124, 34, 105, 70, 157, 152, 131, 44, 63, 94, 131, 200, 149, 237, 225, 62, 162, 224, 122, 118, 301, 380, 197, 65, 165, 180, 208, 81, 274, 144, 99, 75, 194, 75, 142, 22, 76, 147, 13, 98, 178, 270, 205, 298, 251, 202, 178, 153, 149, 20, 169, 173, 44, 228, 116, 36, 74, 146, 225, 123, 196, 71, 206, 165, 159, 259, 237, 183, 113, 152, 129, 66, 257, 267, 262, 206, 276, 166, 160, 57, 103, 231, 222, 93, 59, 139, 134, 194, 235, 100, 306, 210, 198, 213, 125, 226, 198, 250, 158, 84, 119, 202, 135, 205, 213, 288, 191, 135, 43, 165, 191, 100, 266, 219, 109, 85, 142, 172, 190, 128, 40, 199, 60, 265, 66, 144, 153, 201, 156, 63, 66, 95, 133, 181, 97, 80, 93, 84, 173, 127, 152, 96, 80, 220, 118, 169, 83, 122, 151, 45, 116, 175, 77, 104, 164, 206, 129, 227, 125, 142, 189, 146, 68, 93, 29, 16, 18, 75, 65, 229, 118, 86, 198, 158, 112, 54, 53, 39, 70, 53, 122, 174, 124, 104, 130, 143, 115, 163, 82, 51, 56, 85, 183, 63, 75, 42, 49, 67]
-390F7
##PAGE=	F1=-3259.29
##FIRST=	25168.397401625570637,	6007.3700543999984802,	0
##DATA TABLE=	(F2++(Y..Y)), PROFILE
6007A37P2p9m2L2L3n6M8pj4Q0l8k0j14K00j14m1j5O5J02p0N4p6n7O1j3l2K6m1J36j44J42j43
5607G2P5l0K0J91Jl5j06q4j7jl7N7J7QK2J6qo3J4P9j09O9Q4p9j20J53L5j00m9J32Q6j97J69
5194B65k8O1k32%mN7P5Nj27J39Mj38L3k3j3R2J2%j3p2K5o%JK8p3j6M9R9J8K9K1j43Nj05Q3
4743A08k1R3k4m5M6kKK4n5m1l2J48K9j11J14j04KO3j24j8j6K7Q9j00LJ57J1j43J56m3p7P7
4342A93M0m3m4J4K7J60j06j20p7J1M0J97p9j29O6J1j00L8l4N6k7o5P7J06P1j70Qm2J6m6O4
3954A13p6J59k3r0Mn7L1pN0J49j49J05pM9j29j4j4j1R7J71j92p5J06K9j22K0j3M2Jm8N2R2
3553B43q5l3K1n3m6N7l5j4J33M9j89P9m0J40jr1p3J46l7j03J1J13p0K4p3m7P6j5l1jP5P5p0
3140A35N9q5Q2J29j80n9oJ48rj02M1j02L4J13j20L0P3k4n4J6q3P5q0%K3J08P9q9j11K32k3
$$ y = [137, 209, 130, 88, 120, 153, 97, 145, 138, 124, 204, 166, 146, 32, 232, 118, 77, 62, 127, 229, 159, 213, 137, 80, 141, 128, 96, 122, 81, 217, 73, 215, 72, 147, 117, 137, 328, 329, 294, 188, 104, 87, 86, 49, 106, 123, 131, 153, 169, 161, 98, 112, 191, 82, 151, 235, 156, 36, 189, 224, 124, 75, 207, 293, 96, 265, 237, 298, 66, 66, 62, 119, 194, 199, 72, 211, 215, 77, 110, 87, 74, 166, 178, 178, 165, 93, 118, 112, 112, 113, 141, 68, 52, 101, 200, 218, 247, 268, 125, 130, 25, 108, 87, 180, 156, 111, 157, 155, 157, 181, 126, 85, 53, 201, 230, 119, 233, 129, 131, 194, 70, 52, 36, 63, 152, 52, 55, 212, 223, 80, 236, 193, 116, 193, 233, 190, 146, 160, 187, 347, 241, 121, 44, 55, 95, 292, 213, 84, 150, 161, 61, 99, 65, 121, 94, 29, 106, 212, 283, 113, 121, 79, 95, 49, 113, 37, 196, 173, 83, 87, 30, 61, 54, 104, 253, 104, 209, 202, 251, 122, 108, 94, 83, 180, 351, 159, 84, 190, 219, 97, 117, 104, 146, 147, 99, 151, 243, 158, 125, 146, 93, 47, 104, 69, 55, 188, 237, 48, 127, 87, 227, 226, 135, 62, 208, 171, 68, 79, 192, 122, 146, 73, 26, 102, 87, 56, 55, 130, 205, 135, 194, 109, 191, 320, 140, 81, 75, 223, 214, 112, 153, 51, 85, 198, 78, 108, 181, 157, 103, 119, 36, 111, 31, 31, 54, 162, 241, 152, 41, 273, 250]
2752B50m8j31O2qP5l9j22J64L4n1L3J07k15Q1mj17O7L5m8jQ7j02N8j3J00J01j90NL0o4lql8
2339H7l4PKlJ8R7q0k9J15o5J11k1N8o9j27M4j5K8n5Q6p1k8J12k1M7Nr7k6pO5K5K2m6O7J0j95
1888A7J50J10p1k7J26R1k22j57P2O4J10j31P8j05lm0J28r6L4n5k4M9o5QJ11J45j4m8Lo3L3
1500B08M7o5q0N0Q1j58J49k7j24%PK03j96L8J5J28l3m8J6L1m0j14QO0j27J70N0Qo3L5j35L8
1100A32q9l1K71n0j74L8J3%O9rl9J57n2o0oN5J3n8k4%p9K5O9m9J06k8L0m9j07RP4Lm8J11k4
661A99q5qJ0k3P6qj22J33j02J55j88J22m0K0lr4P4k6M8j4j4l7k9k0J07L7n4q1J30J11j67k0
261H7k7kN7n3qR7m6L1O1M2r5N3q7P6j5r0MM3j8n7Om2J00J50j16n0Q0p7l4L4p6J1K2j8N6N0
-190A49p6N5j01J29m3MK1rq3O4O5o2m1mJ8j3
$$ y = [250, 202, 71, 133, 125, 200, 161, 39, 203, 237, 186, 219, 326, 111, 192, 188, 71, 138, 173, 125, 124, 211, 109, 167, 154, 254, 355, 165, 170, 200, 136, 133, 125, 87, 53, 60, 62, 59, 77, 174, 94, 65, 180, 115, 226, 205, 263, 194, 67, 111, 96, 124, 69, 155, 84, 56, 168, 147, 194, 199, 102, 76, 69, 134, 159, 181, 135, 202, 212, 17, 167, 277, 206, 179, 305, 396, 174, 17, 89, 153, 263, 132, 210, 105, 102, 62, 190, 94, 128, 73, 49, 98, 33, 41, 152, 297, 283, 235, 238, 175, 208, 255, 190, 110, 160, 241, 83, 232, 205, 81, 81, 88, 291, 95, 133, 148, 276, 243, 195, 211, 242, 202, 88, 96, 156, 29, 199, 249, 257, 194, 229, 94, 132, 43, 12, 283, 233, 59, 97, 110, 110, 179, 170, 131, 288, 236, 176, 170, 225, 238, 180, 156, 156, 77, 102, 171, 122, 228, 200, 230, 181, 74, 83, 157, 160, 112, 223, 199, 114, 106, 116, 93, 169, 161, 39, 172, 70, 225, 37, 159, 119, 139, 136, 42, 116, 90, 138, 124, 110, 73, 44, 24, 131, 168, 114, 33, 163, 274, 107, 87, 60, 58, 115, 62, 54, 151, 105, 136, 197, 239, 144, 197, 110, 186, 171, 81, 85, 128, 110, 53, 59, 17, 117, 267, 151, 101, 181, 104, 70, 104, 28, 39, 61, 43, 99, 149, 73, 128, 27, 156, 113, 117, 138, 129, 46, 110, 175, 113, 72, 68, 86, 73]
-390G3
##PAGE=	F1=-3361.54
##FIRST=	25168.397401625570637,	6007.3700543999984802,	0
##DATA TABLE=	(F2++(Y..Y)), PROFILE
6007A55K5m1j14R6Lo2K9J13j49J56j7J0r6Q6j15N4q6L1J59k3M8j20k2M7l0o1Q9j25J99j38
5632A01P2j22R2j07J5K42N8q6j38m7NMk0R8r2O6K8l6p2L7O1R9j02k7L2L0j51J33J0j00m7O2
5231I8J14j20J24n2M9j31j1n7J17JJ8j02J69m9n4k8k7j7O0jLM1o7P2l1J6k8or2R8J25n4n0
4818A28Q9Q3j86N0j20P3l2M5n2o0J09J03nk8ro9r0J35O1j22J23l2J4K4j91N2n7O9j5Np5K30
4417B50kj49O6OK6N0J1j03k3o1J49J13j02r7o4m5J25J28j06l3N4J7q1m6j2MK9n5J2J34Q6j53
4017A28j8k9Oj3J6KJ03r3j5l6L7k9j6P6J64j11j1O8L9j36QJ8j6mJ51j32j06J29Q7j66M0j6
3616A25L2mq3J14J16j08p1kk9k6N0k9o3K11Qk07J01q2J38j4j02P7J69o6j28o8J01p1j0On4
3228C1K1N3l1l6R7m1L2J31j21J9J42k17L0n3J03Pj09L8n3N1J21m0j32J33ro1l6NQ4r1OL4R0
$$ y = [155, 180, 139, 25, 121, 124, 62, 91, 204, 55, 211, 194, 204, 108, 194, 79, 133, 47, 78, 237, 214, 262, 142, 120, 167, 137, 76, 165, 40, 239, 101, 173, 51, 143, 36, 51, 293, 351, 265, 127, 80, 85, 89, 69, 167, 75, 141, 169, 133, 61, 98, 159, 258, 156, 129, 161, 191, 40, 173, 183, 83, 36, 98, 212, 92, 216, 164, 213, 82, 71, 14, 131, 132, 150, 48, 217, 168, 114, 86, 59, 42, 102, 101, 104, 145, 78, 150, 119, 135, 107, 101, 9, 107, 232, 178, 128, 217, 300, 114, 164, 44, 117, 85, 130, 78, 18, 127, 230, 225, 197, 188, 119, 29, 164, 225, 103, 226, 194, 208, 232, 41, 93, 36, 105, 90, 95, 20, 250, 248, 99, 165, 171, 197, 247, 258, 155, 132, 71, 220, 333, 231, 134, 70, 25, 150, 278, 172, 139, 193, 210, 129, 83, 71, 75, 104, 49, 61, 195, 281, 128, 110, 81, 87, 74, 90, 92, 195, 102, 87, 51, 88, 59, 43, 119, 283, 172, 161, 229, 268, 132, 140, 158, 142, 138, 289, 157, 51, 180, 267, 101, 141, 125, 157, 153, 70, 184, 300, 192, 121, 119, 90, 64, 114, 85, 22, 233, 241, 34, 135, 53, 191, 177, 75, 152, 321, 255, 127, 59, 160, 89, 79, 85, 31, 52, 105, 74, 38, 135, 94, 126, 257, 136, 155, 297, 80, 110, 57, 160, 167, 58, 96, 43, 94, 215, 175, 43, 176, 167, 106, 70, 75, 159, 68, 74, 108, 198]
2815A98O5n4j64J45n8l3n0QK7O5l3k5N0J11J38R6l19q7J48p5m0N8M8o1o1J23j46Q2P4Q1M3
2427C54j56q9l9J46p7n4n5J2L9k4O2Mn3l4M7J13j9J5j8J33j17q3J7l2l6L1M6o2M0J11Jl9q
2013A76o9k6l4J21j3Lj0L9%j09Q8R5j1k9L3O4j99j06K2P4J91j28r5K0M5j04J21m4j7Lp1K3
1613E3N8o6O7J49N3j26Q1j68J04J23q0n3m7J12j27J08Pj34j5rK27k43j0J46P9k6j18nJ16m7
1237B09j17o2Q8o2N2M3K6m7M6j32J28j09k1K57o8j41L4l6J1L3m8M0J02Nj06%J07k6o5q0J01
849A62p9K3J7j6R7m3j7J2j00R9N8n0p1J01J0m4o6j5m6Q2J9n8J02p3L2m7P4r4L0ln1N2PO6m1
411A29K5j09j4K0J2J04j10L4J02N1j53o4M6O8j10R1m6M7RK0L7J5q5L4r6J49p8q8M7M0j9m6
10F2L4nR2O0q2o0M1q6j0P4j10O3mnJ7K7q9J04n8J15j08j7J27oj03R2j6m2n3K9K2K3
$$ y = [198, 263, 209, 45, 190, 132, 99, 49, 57, 84, 149, 116, 91, 141, 252, 390, 486, 167, 80, 228, 153, 113, 171, 219, 158, 97, 220, 74, 156, 230, 311, 354, 198, 109, 70, 216, 139, 85, 30, 42, 81, 57, 119, 123, 70, 36, 83, 196, 177, 192, 174, 307, 190, 107, 124, 92, 56, 87, 133, 71, 111, 222, 223, 184, 176, 107, 81, 47, 168, 155, 158, 148, 187, 187, 78, 166, 261, 250, 221, 254, 318, 119, 13, 35, 109, 300, 172, 77, 97, 142, 38, 159, 115, 98, 101, 30, 53, 111, 45, 112, 261, 314, 188, 269, 101, 205, 328, 248, 195, 148, 260, 133, 241, 248, 114, 99, 90, 317, 74, 64, 210, 289, 263, 145, 140, 256, 209, 92, 30, 118, 56, 108, 151, 177, 130, 176, 44, 172, 63, 42, 299, 231, 90, 124, 88, 99, 132, 84, 124, 226, 231, 125, 125, 232, 206, 141, 61, 162, 83, 106, 123, 107, 204, 161, 144, 156, 56, 155, 213, 163, 92, 193, 203, 159, 93, 78, 32, 114, 133, 75, 177, 104, 136, 89, 163, 69, 99, 96, 45, 97, 104, 170, 129, 154, 45, 31, 51, 63, 167, 57, 91, 193, 244, 91, 27, 73, 141, 31, 122, 76, 123, 132, 152, 189, 204, 119, 153, 57, 206, 128, 40, 87, 127, 108, 62, 96, 91, 183, 243, 161, 101, 142, 56, 46, 120, 10, 73, 69, 64, 81, 108, 19, 123, 65, 180, 72, 55, 182, 176, 73, 165, 149, 107, 54, 83, 105, 128]
-390A28
##PAGE=	F1=-3463.8
##FIRST=	25168.397401625570637,	6007.3700543999984802,	0
##DATA TABLE=	(F2++(Y..Y)), PROFILE
6007A82l9j3n3O1j7Jq0J57j06O6N6O2j38K1p7N7r5K8J62K3L1j43o7P5j8q4J77j05P0l0j6j03
5607D5P4n0Q6O5P6j25r1KJ3qk0J50j80R0M4j11pN3L8J06j1l3j12J04j07N9l9j01O1K3j2JN9
5194A42j8j6j3Rm1O4n4L2l0J01o3l1o8M5J1Nn1kQ2k2J05k0J9p4l7nL8J62j37j24J57J02j86
4780H2J02j23N4n2K5L9J4K2Q6J8r2M1q3o3N5P5j22J49ML0mk38R9p9J03q0Q0m7J19j4p6n2P2
4367A44J31N1k9j75j8m2J83Qj18lk7p7J37L2j00O9N4j4o5q0RK7M9m2n0J20O2j47l2L6k4KJ6
3954H7O8K1j04QL4M6j04k7P1J91m7r6M6N9j73J1Q0j1r3J16l9q1J04J17j81oK9K0kj01J00J16
3553B59j02q3L0nm0K5m5K8J29%j68J17l6J8ql7J48J61o6j72j25O6pk9N7j4L3n0O3r0Q9j17
3153B9M9J99j48l2J77j99P3p8J4K6q0M8OQ4R0j3j97P5J3k5m0N0P0q3J0J0Q5j5j2j41J2k4N1
$$ y = [182, 143, 130, 77, 138, 121, 122, 42, 199, 93, 159, 215, 277, 139, 160, 83, 140, 45, 73, 235, 258, 289, 146, 79, 154, 136, 52, 229, 124, 194, 164, 148, 45, 119, 69, 155, 220, 296, 171, 80, 82, 95, 87, 67, 217, 37, 127, 171, 60, 53, 106, 144, 250, 239, 206, 94, 198, 91, 150, 111, 10, 71, 94, 82, 83, 142, 124, 108, 95, 104, 63, 127, 73, 105, 75, 176, 113, 82, 14, 59, 70, 75, 24, 22, 104, 82, 187, 167, 186, 112, 75, 70, 108, 270, 133, 9, 166, 268, 82, 184, 61, 115, 63, 88, 127, 141, 163, 249, 267, 175, 216, 133, 70, 125, 200, 78, 227, 231, 261, 257, 19, 118, 39, 142, 62, 142, 95, 214, 200, 124, 72, 144, 275, 326, 297, 122, 104, 62, 245, 253, 135, 132, 105, 28, 165, 197, 97, 166, 220, 206, 141, 61, 70, 97, 146, 104, 54, 174, 236, 89, 57, 93, 69, 71, 87, 155, 176, 72, 80, 114, 160, 56, 29, 100, 291, 244, 148, 194, 253, 80, 91, 171, 160, 67, 183, 144, 63, 167, 284, 103, 97, 126, 146, 144, 43, 143, 259, 157, 74, 104, 99, 59, 84, 39, 67, 196, 196, 28, 145, 109, 127, 119, 82, 230, 391, 325, 153, 28, 94, 87, 58, 115, 101, 134, 84, 147, 57, 146, 29, 78, 277, 129, 97, 274, 75, 148, 70, 84, 110, 30, 78, 84, 168, 258, 245, 48, 123, 136, 111, 71, 121, 191, 108, 118, 128, 213, 198, 186, 45, 57, 33, 84]
2740H4L0n5k8M8j5N6p6J46L40L82m30m06J61j34J05l2P4m5j63J39q9K2J54O4n7o9p2l1J44
2377B47j18q1M8L1l1O4l1N8j09%Q4O9k9o4j8J93j73L1p4OmQ3m8j4L9J03k0j37K8Ln4m0J29
1963A71m4MJ4L4j1o9P2K7Moj5K6j32l2rQ2J68j20r3J46Mj10L6m6n4M9n8J01M2j04K0J01R6
1550B94j31J42k39R3J64o4n0r1J07r5J04qj23M5j8J72k52kJ87K5l3j84N0J63p6o8L1r9K0k5
1175C9K8j0j8P8r6J78q4r9K47m5j01Ml4L1k9p9P4N8N5j23N6J2rRo3Q7o3pn2P2L6m9m6Q9m6
736A00J11P7r3j52J22N0Pj59rL0m4jO0J11q3p9O3L9r4L3l8J4l2J02O4k2M5j19mOp8Q9m0M0
311A16M1qq1J0k5J66j62J39q7pN6j5Om4m2Q6n9J07j19J4l0J6n7JR3O2L2k7l9q1K0m5RM8l5
-127E9L9n7O7m7J0m5O1K8L6q1l1J53j2r1J38p1q7nJ9J3J07
$$ y = [84, 114, 59, 31, 79, 64, 120, 44, 190, 530, 912, 482, 76, 237, 103, 208, 176, 250, 205, 42, 181, 92, 114, 268, 332, 275, 206, 134, 103, 247, 129, 48, 96, 127, 96, 160, 129, 187, 78, 78, 162, 231, 202, 138, 120, 313, 140, 171, 97, 103, 99, 182, 134, 120, 159, 262, 242, 105, 133, 136, 82, 42, 171, 127, 131, 145, 179, 168, 99, 171, 198, 202, 196, 181, 207, 75, 43, 34, 116, 284, 164, 71, 217, 221, 111, 147, 101, 47, 96, 38, 139, 181, 77, 97, 198, 294, 163, 305, 66, 159, 323, 259, 209, 118, 225, 130, 234, 226, 103, 148, 130, 302, 50, 48, 235, 260, 227, 43, 93, 256, 180, 112, 143, 44, 64, 39, 67, 57, 39, 117, 21, 199, 115, 16, 263, 218, 117, 121, 87, 118, 89, 10, 84, 142, 197, 74, 130, 142, 133, 142, 79, 166, 103, 96, 44, 116, 152, 103, 57, 146, 100, 211, 288, 195, 43, 165, 215, 222, 63, 54, 84, 40, 39, 99, 210, 127, 48, 111, 150, 56, 89, 51, 65, 33, 135, 199, 177, 222, 103, 99, 105, 27, 116, 76, 116, 157, 149, 68, 78, 53, 219, 57, 196, 109, 102, 158, 143, 149, 105, 63, 149, 90, 197, 78, 92, 62, 78, 21, 22, 115, 177, 209, 182, 143, 62, 82, 37, 46, 94, 59, 98, 41, 108, 61, 71, 26, 87, 115, 151, 70, 39, 192, 180, 89, 227, 156, 69, 64, 83, 96, 203]
-390B03
##PAGE=	F1=-3566.06
##FIRST=	25168.397401625570637,	6007.3700543999984802,	0
##DATA TABLE=	(F2++(Y..Y)), PROFILE
$$ [...]
-390B30
##END NTUPLES=	nD NMR SPECTRUM
##END=	
##END=	
