##TITLE=	IgV8LArTQi+$buCI1FrzAw.22.ser
TM-VI-212, CDCl3, new, hmqc

##JCAMP-DX=	6.0	$$ MestReNova 14.3.0-30573
##DATA TYPE=	LINK
##BLOCK_ID=	1
##BLOCKS=	2    
##ORIGIN=	Mestrelab Research S.L.
##OWNER=	hrzepa
##$MNOVA/LINK_BLOCK_TYPE=	ITEM	$$ NMR Spectrum
##$MNOVA/ITEM/POLYGON=	(XY..XY)
5321,5835
8722,5835
8722,8208
5321,8208
5321,5835
##$MNOVA/ITEM/Z=	0
##$MNOVA/ITEM/ANGLE=	0
##TITLE=	IgV8LArTQi+$buCI1FrzAw.22.ser
##JCAMP-DX=	6.0	$$ MestReNova 14.3.0-30573
##BLOCK_ID=	2
##DATA TYPE=	MNOVA NMR VIEW DATA
##DATA CLASS=	MNOVA VIEW DATA
##$MNOVA/2D/THRESHOLD=	8.9540205001831054688
##$MNOVA/ITEM/ZOOM/X=	-0.97513570095656798564,	15.006420000069319087
##$MNOVA/ITEM/ZOOM/Y=	-9.5117732152681622182,	229.98039999462537253
##END=	
##TITLE=	IgV8LArTQi+$buCI1FrzAw.22.ser
##JCAMP-DX=	6.0	$$ MestReNova 14.3.0-30573
##BLOCK_ID=	3
##DATA TYPE=	nD NMR SPECTRUM
##DATA CLASS=	NTUPLES
##NUMDIM=	2
##ORIGIN=	Bruker BioSpin GmbH
##OWNER=	nmr
##.OBSERVE FREQUENCY=	400.32280223999998725
##.OBSERVE NUCLEUS=	^1H
##.SOLVENT NAME=	CDCl3
##.PULSE SEQUENCE=	hmqcgpqf
##LONGDATE=	2022/06/21 16:41:49.000
##.ACQUISITIONMODE=	SIMULTANEOUS (DQD)
##$ORIGINAL FORMAT=	Bruker XWIN-NMR
##$MNOVA/SCALES_VERSION=	9
##$PARAMETER FILE=	(acqu2s, ASCII, /private/var/folders/f6/rjf_tdyn2v98c5c0wvkgn4s80000gn/T/IgV8LArTQi+$buCI1FrzAw/22/acqu2s, 0)
$$ ##TITLE= Parameter file, TOPSPIN		Version 3.2
$$ ##JCAMPDX= 5.0
$$ ##DATATYPE= Parameter Values
$$ ##NPOINTS= 201	$$ modification sequence number
$$ ##ORIGIN= Bruker BioSpin GmbH
$$ ##OWNER= nmr
$$ $$ 2022-06-21 16:56:21.977 +0100  nmr@CZC2524DW0
$$ $$ /opt/topspin/data/agmb/nmr/Jun21-2022/22/acqu2s
$$ $$ process /opt/topspin3.2/prog/mod/go
$$ ##$ACQT0= 0
$$ ##$BF1= 100.660544
$$ ##$FnMODE= 1
$$ ##$NUC1= <13C>
$$ ##$NusJSP= 0
$$ ##$NusT2= 1
$$ ##$NusTD= 200
$$ ##$O1= 11072.65984
$$ ##$SFO1= 100.67161665984
$$ ##$SW= 239.934453954353
$$ ##$SW_h= 24154.5893719807
$$ ##$TD= 200
$$ ##END=
$$ 
##$PARAMETER FILE=	(acqus, ASCII, /private/var/folders/f6/rjf_tdyn2v98c5c0wvkgn4s80000gn/T/IgV8LArTQi+$buCI1FrzAw/22/acqus, 0)
$$ ##TITLE= Parameter file, TOPSPIN		Version 3.2
$$ ##JCAMPDX= 5.0
$$ ##DATATYPE= Parameter Values
$$ ##NPOINTS= 12	$$ modification sequence number
$$ ##ORIGIN= Bruker BioSpin GmbH
$$ ##OWNER= nmr
$$ $$ 2022-06-21 16:56:25.123 +0100  nmr@CZC2524DW0
$$ $$ /opt/topspin/data/agmb/nmr/Jun21-2022/22/acqus
$$ $$ process /opt/topspin3.2/prog/mod/shimcntl
$$ ##$ACQT0= 1000000
$$ ##$AMP= (0..31)
$$ 100 100 100 100 100 100 100 100 100 100 100 100 100 100 100 100 100 100
$$ 100 100 100 100 100 100 100 100 100 100 100 100 100 100
$$ ##$AMPCOIL= (0..19)
$$ 0 0 0 0 0 0 0 0 0 0 0 0 0 0 0 0 0 0 0 0
$$ ##$ANAVPT= -1
$$ ##$AQSEQ= 0
$$ ##$AQ_mod= 3
$$ ##$AUNM= <au_zgonly>
$$ ##$AUTOPOS= <41 >
$$ ##$BF1= 400.32
$$ ##$BF2= 100.660544
$$ ##$BF3= 400.32
$$ ##$BF4= 400.32
$$ ##$BF5= 400.32
$$ ##$BF6= 400.32
$$ ##$BF7= 400.32
$$ ##$BF8= 400.32
$$ ##$BYTORDA= 0
$$ ##$CAGPARS= (0..11)
$$ 0 0 0 0 0 0 0 0 0 0 0 0
$$ ##$CFDGTYP= 0
$$ ##$CFRGTYP= 9
$$ ##$CHEMSTR= <none>
$$ [...]
$$ 0 0 0 0
$$ ##$ShimPowMaxUC= (0..63)
$$ 130000 130000 130000 130000 130000 130000 130000 130000 130000 130000 130000
$$ 130000 130000 130000 130000 130000 130000 130000 130000 130000 0 0 0 0
$$ 0 0 0 0 0 0 0 0 0 0 0 0 0 0 0 0 0 0 0 0 0 0 0 0 0 0 0 0 0 0 0 0 0 0 0 0
$$ 0 0 0 0
$$ ##$ShimPowMaxUG= (0..63)
$$ 524287 524287 524287 524287 524287 524287 524287 524287 524287 524287 524287
$$ 524287 524287 524287 524287 524287 524287 524287 524287 524287 0 0 0 0
$$ 0 0 0 0 0 0 0 0 0 0 0 0 0 0 0 0 0 0 0 0 0 0 0 0 0 0 0 0 0 0 0 0 0 0 0 0
$$ 0 0 0 0
$$ ##$ShimPowRcbType= 3
$$ ##$ShimPowRes= (0..63)
$$ 1e-20 1e-20 1e-20 1e-20 1e-20 1e-20 1e-20 1e-20 1e-20 1e-20 1e-20 1e-20
$$ 1e-20 1e-20 1e-20 1e-20 1e-20 1e-20 1e-20 1e-20 0 0 0 0 0 0 0 0 0 0 0 0
$$ 0 0 0 0 0 0 0 0 0 0 0 0 0 0 0 0 0 0 0 0 0 0 0 0 0 0 0 0 0 0 0 0
$$ ##$ShimPowRng0= (0..63)
$$ 1 1 1 1 1 1 1 1 1 1 1 1 1 1 1 1 1 1 1 1 0 0 0 0 0 0 0 0 0 0 0 0 0 0 0 0
$$ 0 0 0 0 0 0 0 0 0 0 0 0 0 0 0 0 0 0 0 0 0 0 0 0 0 0 0 0
$$ ##$ShimPowRng1= (0..63)
$$ 1 1 1 1 1 1 1 1 1 1 1 1 1 1 1 1 1 1 1 1 0 0 0 0 0 0 0 0 0 0 0 0 0 0 0 0
$$ 0 0 0 0 0 0 0 0 0 0 0 0 0 0 0 0 0 0 0 0 0 0 0 0 0 0 0 0
$$ ##$ShimPowRng2= (0..63)
$$ 1 1 1 1 1 1 1 1 1 1 1 1 1 1 1 1 1 1 1 1 0 0 0 0 0 0 0 0 0 0 0 0 0 0 0 0
$$ 0 0 0 0 0 0 0 0 0 0 0 0 0 0 0 0 0 0 0 0 0 0 0 0 0 0 0 0
$$ ##$ShimPowRng3= (0..63)
$$ 1 1 1 1 1 1 1 1 1 1 1 1 1 1 1 1 1 1 1 1 0 0 0 0 0 0 0 0 0 0 0 0 0 0 0 0
$$ 0 0 0 0 0 0 0 0 0 0 0 0 0 0 0 0 0 0 0 0 0 0 0 0 0 0 0 0
$$ ##$ShimSysFunc= (0..63)
$$ 1 2 3 4 5 7 9 11 15 16 8 10 12 14 6 17 13 18 19 20 0 0 0 0 0 0 0 0 0 0
$$ 0 0 0 0 0 0 0 0 0 0 0 0 0 0 0 0 0 0 0 0 0 0 0 0 0 0 0 0 0 0 0 0 0 0
$$ ##$ShimSysMatrix= 0
$$ ##$ShimSysType= 1
$$ ##$TFXNUM= 0
$$ ##$TRIPLO2= 0
$$ ##$VTU= 2
$$ ##$VTUETH= <149.236.99.20>
$$ ##$VTUTY= <no>
$$ ##$WBREFAM= (0..15)
$$ 132.2 106.2 100 100 100 100 100 100 100 100 100 100 100 100 100 100
$$ ##$WBREFLM= (0..15)
$$ 0 0 0 0 0 0 0 0 0 0 0 0 0 0 0 0
$$ ##$WBREFPH= (0..15)
$$ 77.55 -65.76 0 0 0 0 0 0 0 0 0 0 0 0 0 0
$$ ##$WBSGU= (0..15)
$$ 0 0 0 0 0 0 0 0 0 0 0 0 0 0 0 0
$$ ##$XFAC= 2
$$ ##END=
$$ 
##$DECIM=	3120
##$DSPFVS=	20
##.ACQUISITIONSCHEME=	NOT PHASESENSITIVE
##NTUPLES=	nD NMR SPECTRUM
##VAR_NAME=	FREQUENCY1,	FREQUENCY2,	SPECTRUM
##SYMBOL=	F1,	F2,	Y
##.NUCLEUS=	13C,	1H
##.OBSERVE FREQUENCY=	100.67161665983999796,	400.32280223999998725
##VAR_TYPE=	INDEPENDENT,	INDEPENDENT,	DEPENDENT
##VAR_FORM=	AFFN,	AFFN,	ASDF
##VAR_DIM=	512,	512,	262144
##UNITS=	HZ,	HZ,	ARBITRARY UNITS
##FIRST=	23149.952173337649583,	6007.3700543999984802,	0.45265495777130126953
##LAST=	-957.46026627590026692,	-390.36632380512997997,	0.36042729020118713379
##MIN=	-957.46026627590026692,	-390.36632380512997997,	0.00056678697001188993454
##MAX=	23149.952173337649583,	6007.3700543999984802,	238.98614501953125
##FACTOR=	1,	1,	0.0029314437916977999221
##PAGE=	F1=23150
##FIRST=	23149.952173337649583,	6007.3700543999984802,	0.45265495777130126953
##DATA TABLE=	(F2++(Y..Y)), PROFILE
$$ [...]
##PAGE=	F1=2863.87
##FIRST=	23149.952173337649583,	6007.3700543999984802,	0.5264002680778503418
##DATA TABLE=	(F2++(Y..Y)), PROFILE
4743A38M0q7J26J1J16k58K03N4pj22J2P4m7m2m6R6o6j3J30n4J21k04K3n8J52q5P5k0km7k1
$$ 138 178 91 217 228 344 86 289 343 336 214 226 300 253 211 165 261 195 182 312 258 379 175 198 140 292 207 282 262 260 213 192
4355A92p7K09p1Lk6Q8lj33mlJ53m7m7r5Q8p9J3J30K6j38N5P8n3j00J35O4j06J89j48Q8j06
$$ 192 115 324 253 256 230 318 315 182 178 175 328 281 234 139 227 148 161 291 317 179 234 312 259 159 294 358 252 441 293 381 275
3967B75J11K8lq7q4L7M7Lj72O6Q5k02K31L0P2k26K28O2j23k2r7L2J26l3l5j9J16KJM8J35J77
$$ 275 386 414 411 324 240 277 324 327 155 221 306 104 335 365 437 211 439 501 378 356 259 291 417 384 349 330 446 448 449 497 632 809
3566H09l28K03q2k77J16J11k9K5j58M5J82j15N3P4J36k16K10R9j57j1J12q3O5j7O7J34j21
$$ 809 481 684 602 325 441 552 523 548 390 435 617 502 555 629 765 549 759 858 701 690 802 719 784 767 834 968 847
3228H47m1J43P0N0r1L9J26Q9kL6P9K88J7j94M25N43n72Q09O77m28M637M534P155J3222l616
$$ 847 806 949 1019 1069 978 1017 1143 1232 1230 1266 1345 1633 1650 1456 1881 2424 1852 2661 3338 2910 7547 12081 19236 32458 28842
2915B8842j6811o574j951q71j051r15m05O83J488O452M953l919m888p86r60o26m26k19k72
$$ 28842 12031 5457 3506 2635 1584 669 264 947 2435 8887 13840 9921 5033 4247 3287 2661 2235 2016 1744
2677A744l56l14m90M26P13J459j092l46j77j49k34j51j4N3j97J49j38j00K5K9n9m5j91K85
$$ 1744 1388 1074 584 1010 1723 3182 2090 1744 1567 1418 1184 1033 1019 1072 875 1024 886 786 811 840 781 736 545 830
2377H30rn1j73P8j62j5k4N0J53m3n9K6k00J0L9j03R3J03m0k01K25Jq3p5N3J0p4M9j10R4Q3
$$ 830 821 770 597 675 513 498 474 524 677 634 575 601 401 411 450 347 440 543 503 302 527 528 445 370 423 433 359 408 298 392 475
1988D75q1Lk7P1J59j74m4L9K6k08J36r3m9O6m3K09j37j38R3R2o8J4j76K80o1j74R7Qj8R7m2
$$ 475 394 397 370 441 600 426 382 421 447 239 375 282 233 299 256 465 328 190 283 375 307 321 145 425 364 190 287 295 277 374 332
1600C32L8q1L1j93K15LJ13O5n2l41j00J27NP8r3J34Q5q5L4k04l1J72L1j98lJ36K7j55M9J06
$$ 332 370 289 320 127 342 345 458 523 471 130 30 157 162 240 147 281 366 281 315 111 80 252 283 85 82 218 245 90 139 245
1225B45j06J2O7K1k1n7l4Q5l4J9J1J70Mj13q3l1j07K01j48M8J52p7mM8q3r5j4J01P9j74R5
$$ 245 139 151 218 239 218 161 127 212 178 197 208 378 382 269 186 155 48 249 101 149 301 224 220 268 185 90 76 177 256 82 177
837A77m8L7L0j40O1J58l4J20j60O9L0j81J9o2L8J19p8o4K48j18n2K02p0j71J5J02j72J19J71
$$ 177 129 166 196 56 117 275 241 361 201 270 300 119 138 76 114 233 155 91 339 221 169 371 301 130 145 247 75 194 365
474C65j53M0P1l3j77J96l1j88O1l8k8o2O3k6N2k1R5n9J05N5k11N2O1J10J6J11j80r0J22r1
$$ 365 212 252 323 290 113 309 278 90 151 113 85 23 86 60 112 91 186 127 232 287 76 128 189 299 315 426 246 156 278 187
98A87o3N9j07J93J2j31oM3N1r9J42p4K6q0K8n8nJj7M5p0j5J55m9k2j8O9l5l4Oq0O4P3o1n0
$$ 187 124 183 76 269 281 150 144 187 238 139 281 207 233 153 181 123 118 119 102 147 77 62 217 168 146 128 197 162 128 134 54 118 191 130 80
-340H0Q3qr8k7
$$ 80 163 155 57 30
-390C0
##PAGE=	F1=2769.52
##FIRST=	23149.952173337649583,	6007.3700543999984802,	0.65863668918609619141
##DATA TABLE=	(F2++(Y..Y)), PROFILE
6007D2M4n0N6l7J34J92l2j10j74Q1N1j47J00P4j3o2M8p9J12N7m5j77N3jk8oj2OJ04j09P2P6
$$ 42 86 36 92 55 189 381 349 239 65 146 197 50 150 224 211 149 197 118 230 287 242 65 118 117 89 83 71 77 181 72 144 220
5607B20p5o6k9M4m6R5J33k12P7n4K9L0j26K48l6j52Q5R0l5j72k6J53Ll7K5o8qJ06k1m6k5K3
$$ 220 145 79 50 94 48 143 276 64 141 87 116 146 20 268 232 80 165 255 220 48 22 175 178 141 166 98 90 196 175 129 104 127
5206A27J21j04lRQ4J6j79N3J52q6R8j15j2KR1mj43J03j61J3N8K9J9P8j20J17O8j47k5J35j8
$$ 127 248 144 141 150 234 250 71 124 276 190 288 173 161 163 254 250 107 210 49 62 120 149 168 246 126 243 311 164 139 274 256
4818B56j01N6q4l2l3J11J6j12K01j9Q4k10K29j8L0j46K7L7l6q1j0K9kr6J26N1J28k39Rj8J05
$$ 256 155 211 127 95 62 173 189 77 278 259 343 133 362 344 374 228 255 292 256 175 165 194 192 96 222 273 401 162 171 153 258
4430B58m7N8%n2l4jp0J99o6J3K4%l0r4J3L2J10l3o2p8M4M9j6N4K8j88J14P4q5o8J65J21j83
$$ 258 211 269 269 217 183 182 112 311 245 258 282 282 252 158 171 203 313 280 218 140 184 233 217 271 299 111 225 299 214 146 311 432 249
4017B49J78j17N4j37J92l2l7p7k4J03m3J1k34N7J36k69L79m7O8j89J86j5r1J3q2J64L0k9L6
$$ 249 427 310 364 227 419 387 350 273 249 352 309 320 86 143 279 10 389 342 410 221 407 392 301 314 232 396 426 397 433
3654D33q9J11Q8o0M5J48Q3l00K03j59j48Q1J45j81P1r8Q9J97j45J12L3J03j87K04O1k16P0
$$ 433 344 455 543 483 528 676 759 459 662 503 355 436 581 400 471 373 462 659 514 626 659 762 575 779 840 624 694
3316F94Q0q3Q1q0J65J02k00P2Q9N3N4o4P3N5J42k7J17LK06R8r7Q39j50k38Q81R6q95O412K989
$$ 694 774 691 772 692 857 959 759 831 920 973 1027 963 1036 1091 1233 1206 1323 1326 1532 1630 1533 2372 2222 1984 2865 2961 2066 8478 11467
2952A1467O972J3543m199j6378o287j678r00j098p57q1N67J455O584N012m026m446j122j316
$$ 11467 18439 31982 27783 11405 5118 3440 2540 1442 685 604 1171 2626 9210 14222 10196 5750 4628 3312
2727C312p15m31j32l74l13k54l5M1J733P97j493m64j23j37k38j34L9M5k92J73j19o5J0n1k1
$$ 3312 2597 2166 2034 1660 1347 1093 1058 1099 2832 3629 2136 1672 1549 1412 1174 1040 1079 1124 832 1005 886 821 831 780 759
2414G59m1j77K67n8k9j70R4j98O1n9N6J50l7l8n4j36kP5r0J43R4j06j85K56j9j24m9K1n0N
$$ 759 718 541 808 750 721 551 645 447 508 449 505 655 618 580 526 390 388 463 373 516 610 504 319 575 556 432 383 404 354 359
2039C59PnN5P0p7o9L3R8J66k20j5Nm7o1J0o0N7M1r9K19j85p5J36M6r4N5k14K73p2j85J53j8
$$ 359 366 361 416 486 409 340 373 471 637 417 402 407 360 299 309 249 306 347 248 467 282 207 343 389 295 350 136 409 337 152 305 287
1638B87l2J44r3J7oJ5k00K73j79J33k1N3l47M6P9M9K0l1J01Qq1Q5j89q4J47J7j59M4N4k7N2
$$ 287 255 399 306 323 317 332 132 405 226 359 338 391 44 90 169 218 238 207 308 316 235 320 131 47 194 211 52 96 150 123 175
1250A75Q2Q5k23L4Q4Qm3n8kJ43r9J0j1J64j6lj36k4j26K43j45J0R7k3lj7p5r5P1N1P3j67K09
$$ 175 257 342 119 153 237 245 202 144 142 285 186 196 185 349 333 330 194 170 44 287 142 152 249 226 223 206 131 36 107 158 231 64 273
837B73j23j2L8o2J1J75n0O5j70J67jk71J09o6J03O4j01j7K70j44r2J59l4j15k7R1j70J45J48
$$ 273 150 138 176 114 125 300 250 315 145 312 311 40 149 83 186 250 149 132 402 258 166 325 291 176 149 240 70 215 363
474C63j65%L4l9o3J30n9j05Q1n2m5J8Qk3L4QJ13n1rJ18k31J42J1M8O4J01j76j58J21n1m2L1
$$ 363 198 198 232 193 130 260 201 96 177 125 80 98 106 83 117 125 238 187 178 296 65 207 218 266 330 431 255 97 218 167 125 156
73A56l3J57Q1k46k9J09M8n6O0q6Kp1J15j47qKK4M5n1J0J11o8J2o8P9K7k3Qo6J3Q6k3j04M4
$$ 156 123 280 361 115 86 195 243 187 247 161 163 92 207 60 52 54 78 123 72 82 193 125 137 69 148 175 152 160 94 107 193 170 66 110
-353A10k3o0J2
$$ 110 87 27 39
-390C9
##PAGE=	F1=2675.16
##FIRST=	23149.952173337649583,	6007.3700543999984802,	0.49551689624786376953
##DATA TABLE=	(F2++(Y..Y)), PROFILE
6007B8P5j9Lm8J46J68l7j21r3M8O3j75J26J00J2j63O5j14O1J23J7j48j7k2k8K8l4j3J23o6
$$ 28 103 84 87 39 185 353 316 195 102 150 213 38 164 264 276 113 178 64 125 248 265 117 100 78 50 78 44 31 154 88
5632H8N8N8m8p9J9J0j02J45Q7k14R9n0LOl2J93l8m2Q4K1j00q2k1Q1Mk2K8o2l7R5j8j5j4O1
$$ 88 146 204 156 77 96 106 4 149 236 22 121 71 74 80 48 241 203 161 245 266 166 84 63 144 148 126 154 92 55 150 132 117 103 164
5206A64R7j48M0J9M7m4j14L3J52o2Pp8PK3L6J8j84K07j64lM8J24l8Q5j59O8O7r3p9O7P4j43
$$ 164 261 113 153 172 219 175 61 94 246 184 191 113 120 143 179 197 13 220 56 53 101 225 187 272 113 181 248 155 76 143 217 74
4805G4P4j09J2rJ14Mr0J76j6L4j07K04p8K7j26M1L9j2j25k8j8P5j40O7J74Q2k00m0MN7JM3
$$ 74 148 39 51 42 156 160 70 246 230 264 157 361 283 310 184 225 264 252 127 99 81 156 16 83 257 339 139 99 103 160 161 204
4405B04J1p9J0pn7J58k9%O6r5n6NQL9P1n4m5k8QR3mk7M8j96J28N4p9m9J33J85j89J00p1L5
$$ 204 215 136 146 139 82 240 211 211 277 182 126 131 139 178 249 195 150 122 130 223 219 192 240 44 172 226 147 98 231 416 227 327 256 291
3979B91j57K17n1m5p0K4J50j01M1j83n1J22p8K27q7M4j01R2q3j5L9m5J97l9JO1j15Q2J28q2
$$ 291 134 351 300 255 185 209 359 258 299 116 65 187 109 336 249 293 192 284 201 186 225 180 377 338 339 400 285 367 495 413
3604D13M1J13%k10J90j70j12N5J80l12J29m4R0J89j39J52k5O1j23J29Pj81J10O8r2N4j29K56
$$ 413 454 567 567 357 547 377 265 320 500 188 317 273 363 552 413 565 540 601 478 607 614 433 543 611 519 573 444 700
3253G00L3k29J66K1N1L1qP1k4J63j4J55p5J01J73%Q61o10K46N54k22J423M316Q07M918J0680
$$ 700 733 504 670 691 742 773 765 836 812 975 961 1116 1041 1142 1315 1315 2176 1566 1812 2366 2144 3567 7883 8690 13608 24288
2927B4288l547j2267m722j082p01q61l89m0L31J072N238M098l069l304j125j383n77l30K3
$$ 24288 20741 8474 3752 2670 1969 1108 719 679 1010 2082 7320 11418 8349 5045 3920 2537 1960 1630 1653
2690A653l48j27l9J64o8K464j92j776n17o9o9j80j28J02M3l50J89n1o9K2p4m3K1j82K35j08
$$ 1653 1305 1178 1139 1303 1235 3699 3507 1731 1214 1145 1076 896 768 870 913 563 752 701 632 654 580 537 558 376 611 503
2364E03J5j56J16j96R5q1K5J46j1j1j25k8m9J08o3J68Q8j46j29K16%j65j8Jj12J06m2O8k6
$$ 503 518 362 478 282 377 296 321 467 456 445 320 292 243 351 288 456 544 398 269 485 485 320 302 303 191 297 255 323 297
2001B97R0n0j46P0J29J60k34K1j0j17Q5j41K4J00K8j49J79j77nJ88j5j20Q6j84K02o1j68J58
$$ 297 387 337 191 261 390 550 316 337 327 210 295 154 178 278 306 157 336 159 154 342 327 207 293 109 311 250 82 240
1650B40k2n0J63j43%O3K9j76K70k84R5NR0k42P6K2J15l4l9J04m8p8J02j44q5N0jNM5q2M9J27
$$ 240 218 168 331 188 188 251 280 104 374 90 185 190 280 38 114 136 251 217 178 282 234 156 258 114 29 79 78 83 128 46 95 222
1250B22Q4O9l13Q2L8kj3p5K6J49j18J3l2J03j5J24j31n8j21K19q6j2pO0l4Nj18k1J14o4O3
$$ 222 306 375 62 144 182 180 167 92 118 267 149 162 130 233 218 342 211 153 32 251 165 153 146 206 172 177 59 38 152 88 151
862A51n7K02j35p6N6J1k8J24n0K7j28J92J4k57J08j7R9L6j22k7K39j11j12O8K9m5q7J02j38
$$ 151 94 296 161 85 141 152 124 248 198 225 97 289 303 46 154 137 236 272 150 123 362 251 139 207 236 191 104 206 68
499F8J06J08j25j9l2n9O5O2o4l2Q0l1p2O6l3pMN5R4j4j26J30j73J72J0k1R6P0j31j54L9ln
$$ 68 174 282 157 138 106 47 112 174 110 78 158 127 55 121 88 81 85 140 234 220 94 224 51 223 233 212 308 378 247 93 132 129 124
85A24l5N0R1J69k62j10J72NK1Rr6m2m7J45j27n8J5Q6ql5K4O3n4Np1L4O4jok2n5J14Rn0N3j32
$$ 124 89 139 230 399 137 27 199 204 225 234 138 96 49 194 67 9 24 110 102 67 91 154 100 105 34 68 132 131 125 103 48 162 171 121 174 42
-365D2k7K5
$$ 42 15 40
-390D0
##PAGE=	F1=2580.81
##FIRST=	23149.952173337649583,	6007.3700543999984802,	0.25182461738586425781
##DATA TABLE=	(F2++(Y..Y)), PROFILE
6007A6P9J7j6q4J49J16m0j11nL7O4j74J01J29N5k30O9j22nJ47M4r4o1k3nM3k6m4Q5k1M3N1
$$ 16 95 112 96 12 161 277 237 126 121 158 222 48 149 278 333 103 172 50 45 192 236 142 81 58 53 96 70 26 111 90 133 184
5607A84l5p6L1l6kP5L9j32L7j6M1p6L6J05K5JL4J8j01m3k4MQmkk1m2M9j8L0J7Q5M0j35M4l
$$ 184 149 73 104 68 66 141 180 48 85 69 110 34 70 175 200 201 235 253 152 109 85 89 97 93 91 70 28 77 59 89 106 191 231 96 140 137
5156A37O2r6m2L3O1J2m1o3RL8l5N6rP4j52k8M8J43l7P7q0n5Q1nj22m7J35j03P0n3j8k1P0J8
$$ 137 199 103 61 94 155 167 126 63 72 110 75 131 122 196 44 16 64 207 170 247 167 112 193 188 66 19 154 51 121 68 50 29 99 117
4730A17o8Q9QRK1J39n9n6m1j9J09Rp1j19k9M5m7RJ55L4j10j10K4J2K9M0K2j00O5k4m4J14K5
$$ 117 49 138 146 155 176 315 256 200 159 140 249 258 187 68 39 84 37 46 201 235 125 15 39 51 80 120 142 42 107 83 39 153 178
4317A78j0P9q9j24M9rN8O0q9m8M2RL6M7q8N8j09M8M1n5j7L8K24j31L5n1K0j05J37j9l3l8j9
$$ 178 168 247 158 34 83 74 132 192 103 55 97 106 142 189 101 159 50 98 139 84 67 105 329 198 233 182 202 97 234 215 182 144 125
3904A25J96r3Q5r5j10KP6M1p8J0j9N5j61N4L7k5J53m4J7N7o7PJ20m0MJ00o3j19J75r3j69L8
$$ 125 321 228 313 218 108 110 186 227 149 159 140 195 34 88 125 100 253 209 226 283 216 223 343 303 307 407 344 225 400 307 138 176
3503A76K13k52J4l5Q1J73j30J83p0O3p3N8n6j12J03N8o0J2j75K78jk34K03nK1NM8N0m8J14
$$ 176 389 137 151 116 197 370 240 423 353 416 343 401 345 233 336 394 334 346 171 449 448 214 417 412 433 438 486 536 488 602
3128F02J0J62q5rJ60K9P29p24M00K96l59J854K563l64K549O751k191p295k910m90m20n45j13
$$ 602 612 774 689 680 840 869 1598 874 1274 1570 1211 3065 5628 5264 7813 14564 12373 5078 2168 1678 1258 713 600
2840F00m7J43M89L328K817j724k033q45j191l81k23J55k39P6J19K28q4K821o63j941n96j08
$$ 600 553 696 1185 4513 7330 5606 3573 2728 1537 1156 933 1088 849 925 1044 1272 1188 4009 3346 1405 809 701
2564G01%j21j11J14N4k79O1N6o8K3Pj40J17k34K64j64K9j57J27j39Q8n4q1J31K9M7k09J02
$$ 701 701 580 469 583 637 358 419 475 407 430 437 297 414 180 444 280 309 152 279 140 228 174 93 224 253 300 91 193
2214A93j39J13k3J50R6j39n9J49M5k00K3J8k01K00p4J01j19J22Rj55j6J52J56k16M1J7j57
$$ 193 54 167 144 294 390 251 192 341 386 186 209 227 26 226 152 253 134 256 265 110 94 246 402 186 227 244 87
1876H7J89k01J1R9M2j57J42j63N3K00m2j61R5j11J19l4r7P1Kp0J58j05r6R8O3j38K27j38m4
$$ 87 276 75 86 185 227 70 212 49 102 302 260 99 194 83 202 168 71 142 144 74 232 127 31 129 192 54 281 143 99
1513I9J33o1j62Q3k1J82n3j10J36l7r0J19j14p4J7K2P0J5n8N5O8P2P5l08P2k3rK4q5L4J02
$$ 99 232 171 9 92 71 253 200 90 226 189 99 218 104 30 47 69 139 154 96 151 219 291 366 58 130 107 98 122 37 71 173
1125A73q5ON6l9l2K24p3j11j02J43Plj19J33p6P9j11K3J07j36J8L2J24q6o6J3K3K3M2n4j2
$$ 173 88 94 150 111 79 303 230 119 17 160 167 164 45 178 102 181 70 93 200 64 82 114 238 152 86 99 122 145 187 133 121
736A21o7J49O7j72L7L7M7N5j04q0J85p7o7mL5Rj10Q4j12Q1R8j12N5k6l0l8K7m5jO9%r1Q6n6
$$ 121 54 203 270 98 135 172 219 274 170 90 275 198 131 127 162 171 61 145 33 114 212 100 155 129 99 61 88 43 42 111 111 20 106 50
311E0J5J8O6L1K2j34L2o9J68K1n5J07L1p9p7p5J0M9j07J10L1K22j95j71J86l0O9K9q5j21j5
$$ 50 65 83 149 180 202 68 100 31 199 220 165 272 303 224 147 72 82 131 24 134 165 387 192 21 207 177 246 275 190 69 54
-77E4J25p8n5L8K6m9PL2J8JRk5q4L9M2l4L1n2O5K6L9Q4j82l5K
$$ 54 179 101 46 84 110 61 68 100 118 119 128 103 19 58 100 66 97 45 110 136 175 259 77 42 44
-390D4
##PAGE=	F1=2486.46
##FIRST=	23149.952173337649583,	6007.3700543999984802,	0.10181158781051635742
##DATA TABLE=	(F2++(Y..Y)), PROFILE
6007BO3M9j1m4O1O8l5q2N5L8O4j60M7J38J05k27L1l8l4N0J6n5n1L5K9J2l2p4L7QM0M7m5o9
$$ 2 65 114 103 59 120 188 153 71 126 164 228 68 115 253 358 131 162 124 90 140 156 101 50 85 114 126 94 20 57 65 105 152 107 38
5582C8P2j04J04K7J2o9j6lP4j23N0K4J04rqN2n4p2k1m3J4L9o5J0j8N6n4K2M9Q5J0p6Nm1J15
$$ 38 110 6 110 137 149 80 64 61 135 12 62 86 190 181 173 225 171 99 78 35 49 88 23 33 15 71 17 39 88 173 183 107 112 71 186
5143A86p1p8R4n0Q6j1q4l5M0J3PR5n7j13J6jQ4j5P4j2o7O8O9q8k3m9oO2ro0k2LM2o6N6l9Q1
$$ 186 115 37 131 81 167 156 72 37 77 90 97 192 135 22 38 37 121 106 180 168 101 169 238 150 127 78 72 134 125 65 43 46 88 22 78 39 120
4680A20Q0O0Or3J9j56K19J6kj20m4n4J9N0PPk0o1J7m6j7M6L9l8K0l9j6N9R0OP0j9r3p1m3P4
$$ 120 200 260 266 173 192 36 255 271 269 149 105 51 70 120 127 134 114 53 70 24 7 53 92 54 74 35 19 78 168 174 244 225 132 61 18 92
4230I2L7k2l9kK0l5J11p9ok2j6M5l6M5p0J91o5O4o0j2l1K9M1l8L4j38K32p5J12n0j19m4J12
$$ 92 129 107 68 66 86 51 162 83 77 55 39 84 48 93 23 214 149 213 153 141 110 139 180 142 176 38 270 195 307 257 138 94 206
3816B06l9o7j1NR7r0n4Q1r2O3M1l5L4M5q9Q9L4n0J18o3r7J35L8j71l0K17o0k21K6j7J76j37
$$ 206 167 100 89 94 191 101 47 128 36 99 140 105 139 184 95 184 218 168 286 223 126 261 299 128 98 315 255 34 60 43 219 82
3416H2K04j15J45q6R8o0j56J26LK3J5q7M9P4j77N6P3o7J1O3J2K0L5M4R1Ol1O4M6N79n54K06
$$ 82 286 171 316 230 328 268 112 238 241 264 279 192 241 315 138 194 267 200 211 274 286 306 341 385 476 482 451 515 561 1140 586 792
3015G92K70l04J553J816n36J150M096j185m493j865k26k65k87m7j3J35N1K009J924p76j180
$$ 792 1062 758 2311 4127 3591 4741 8837 7652 3159 1294 1068 803 516 469 456 591 642 2651 4575 3799 2619
2752B619o59q94l71j79J28j45K14J76K85q6K996o62j994o11k94J0p4n1J7P2n9k48J11mlQ6
$$ 2619 1960 1066 695 516 644 499 713 889 1174 1088 4084 3422 1428 817 523 533 459 408 425 497 438 190 301 297 294 380
2427C80j33J03k02L01j18l8q5l2o9O3M6l9j33J06R9j21M0q9l0k7Q9J00r3K2P9R3k08P8J3q6
$$ 380 247 350 148 449 331 293 208 176 107 170 216 177 44 150 249 128 168 79 49 22 111 211 118 140 219 312 104 182 195 109
2051A09N9j6Q8r3N4R3l0k02N1J58j46j0O2q2J69j07j12O2P1j03J60n4m6J17m6j46N7r2J26
$$ 109 168 152 240 147 201 294 264 62 113 271 125 115 177 95 264 157 45 107 178 75 235 181 135 252 206 60 117 25 151
1688A51j9l6j7N1n1Q6K1r4o7R4q4J73k4J4O9j48m6%m0J89l3j23P8K5r7J95j16j19J09L4mk7
$$ 151 132 96 79 130 79 165 186 92 25 119 35 208 184 198 267 119 73 73 33 222 189 66 144 169 72 267 151 32 141 175 171 144
1287A44RJ3J2O0R7k14j5m7J9jm9M4O8p9k3J70r8q1J96J3j34l5MP5Mj21J18q1R0l1j6J28j37
$$ 144 153 166 178 238 335 121 106 59 78 77 28 72 140 61 38 208 110 29 225 238 104 69 73 148 152 31 149 68 158 127 111 239 102
874A02k4K1L1pk9k0l7J07J3k1j18K5O8R1j03%Q4k8O4m3r4J75j04l2L9k9pj9n0jJ24O0j44P5
$$ 102 78 99 130 123 94 74 37 144 157 136 18 43 111 202 99 99 183 155 219 176 82 257 153 121 160 131 124 105 55 54 178 238 94 169
448A69K2j7j50O3o1J3L5Mj7M2qk5P5K3p0L5l7o0PJ26J9n8R4%m9J3p3q4R4q0P5MJ98j24j71
$$ 169 191 174 24 87 26 39 74 78 61 103 95 70 145 168 98 133 96 36 43 169 188 130 224 224 175 188 115 31 125 45 120 124 322 198 27
10B7J60k0P5O5n9j83J6Q0o5l9N9m2n2N9Pl8J21Lk5j13K3K4j7N5k3l8K9J18J08k02m6j0
$$ 27 187 167 242 307 248 65 81 161 96 57 116 74 22 81 88 50 171 174 149 36 59 83 66 121 98 60 89 207 315 113 67 57
-390E7
##PAGE=	F1=2392.1
##FIRST=	23149.952173337649583,	6007.3700543999984802,	0.14748626947402954102
##DATA TABLE=	(F2++(Y..Y)), PROFILE
6007B0K2M9MJ3l6K8M1Jk6M1N8j32RJ16J38j86k1L6k4m2L6j35pR8O5j4n8p8K1NK5L2n3MP5p3
$$ 20 42 91 95 108 72 100 141 142 116 157 215 83 92 208 346 160 139 175 151 109 145 10 3 101 166 152 94 16 37 42 67 99 46 50 125 52
5557E2N8L1j2j2k6n2Q1q0lmJ08%M2L4m0j02j3l0j2R4j9r2PO9rl3lQ3L3n3kp6J29j7j16J20
$$ 52 110 141 129 117 91 39 120 40 37 33 141 141 183 217 177 75 62 32 20 114 95 3 10 79 70 37 34 117 150 97 95 19 148 131 15 135
5106A35n4Q6qr0m1L0R7o1J07j38l0K1J6k5J3K5L0l8P0J14p1l0j34M3O1J1o7j7NJ5l0R8q6J29
$$ 135 81 167 159 69 28 58 155 94 201 63 33 54 70 45 58 83 113 75 145 259 188 158 24 67 128 139 72 55 60 75 45 143 57 186
4680A86L0j2K8rOj73J89L4K5j00r8K6k4L1p1qL7k3N8p1j5j3K1M7m7l7J1K0J28J2P5j2q5o7
$$ 186 216 204 232 223 229 56 245 279 304 204 106 132 108 139 68 60 97 74 132 61 46 33 54 101 54 17 28 48 176 188 263 251 166 99
4255I9k6J5n6Q3Qp3j8k9J40j6r0Mj8N8k9O4l0L6m7J36o5j5m2J3R7p8O9j16J48p2R5rj10m0
$$ 99 73 88 32 115 123 50 32 3 143 127 37 41 23 81 52 116 86 122 75 211 146 131 89 102 199 121 190 74 222 150 245 236 126 86
3829H6Q4M0r2o3K4R0m0o0J02r1o3J38j28j0J41j29R3L6k0P1J7j38O7J32r2j39K10K8k50M7
$$ 86 170 210 118 55 79 169 129 69 171 80 17 155 27 17 158 29 122 158 138 209 226 88 155 287 195 56 266 294 44 91
3453I1m2J01j08J88j73K09j59J82%k37J93k3K9L6j8j09J69j09j50J61o7N0l3k7M4N8R3m5O3
$$ 91 49 150 42 230 57 266 107 289 289 52 245 222 251 287 269 160 329 220 70 231 164 214 181 154 198 256 349 304 367
3090C67jN8Q5M50m44Q3K28j85J337J554m10R29L142r66l675j417k18l05j20n1%J66N4J453
$$ 367 366 424 509 959 515 598 826 641 1978 3532 3122 4051 7193 6227 2552 1135 917 612 492 441 441 607 661 2114
2790B114J584m48p79p79o93m03j21J4j35K53K18L03k1L034o54j999n34m55m8m3J9q4J08J5
$$ 2114 3698 3250 2471 1692 999 596 475 489 354 607 825 1128 1107 4141 3487 1488 954 499 451 408 427 343 451 466
2489D66k42l9L7j6Q5n3Nq3K80k7q2j8r2j14J9R4O0k21Q2O7j6Nr1K8j03J8J0k3P7J0J22j83
$$ 466 224 185 222 206 291 238 243 160 440 413 331 313 221 107 126 220 280 59 141 208 192 197 106 134 31 49 59 36 113 123 245 62
2089F2J24m5J5n6Q0M6m6J5J39M1k04p4Q0m8m2MNJ33m9j15N7N9r7J89J6r4J9m9r3M7n1N4l5
$$ 62 186 141 156 100 180 226 180 195 334 375 171 97 177 129 87 91 96 229 180 65 122 181 84 273 289 195 214 165 72 119 68 122 87
1675H7Qm1P3j9K5N7n4q7O0n3J81n9Q6k2j07Qo1j2J06J3m7q9P1q7K58r3j58J39L1m7p6Q5k6
$$ 87 95 54 127 108 133 190 136 49 109 56 237 178 264 242 135 143 82 70 176 189 142 53 124 37 295 202 44 183 214 167 91 176 150
1262A50k6N0J05j11q6o6O1k4J5O2J10j35J4R9q6o1O3R0j18JqK2j9o6O8j3PO8p2J66j42l1l5
$$ 150 124 174 279 168 82 16 77 53 68 130 240 105 119 218 132 71 134 224 106 107 99 121 102 36 104 91 98 166 94 260 118 87 52
849E2k2N0k6N1m8N0MM1r1M7J5j4m0J2J06m0j3K2n7K02j15j04P9Mm8N7p7N6J20nj40J3N1j5
$$ 52 30 80 54 105 57 107 111 152 61 108 123 109 69 81 187 147 134 156 99 301 186 82 161 165 117 174 97 153 273 268 128 141 192 177
423A77j09R7p5jk6k0O4J1L5l8P7pj55J4O3K3n0P7rm4N4j8l6R9l4j53Q4QqlJ37o9j39J04jO7
$$ 177 68 165 90 89 63 43 107 118 153 115 192 185 30 44 107 130 80 157 148 104 158 140 104 203 169 16 100 108 100 97 234 165 26 130 129 196
-27A96Q9k3k01L3N4p8k7O9n7lO3p3K8J57m3l5j09O9m1rR9m0q3J4J62J04j98l1j3
$$ 196 285 262 61 94 148 70 43 112 55 52 115 42 70 227 184 149 40 109 68 59 158 118 35 49 211 315 117 86 73
-390G3
##PAGE=	F1=2297.75
##FIRST=	23149.952173337649583,	6007.3700543999984802,	0.30650055408477783203
##DATA TABLE=	(F2++(Y..Y)), PROFILE
6007D5J0LJ9O3q6LJ39M9j39K3M8r1lR3J30j32n0O8jq9J19j14n3L4Q5j1q1n5M4l0%K1kN5J7
$$ 45 55 58 77 140 54 57 196 245 106 129 177 86 83 176 306 174 124 192 191 102 221 107 54 88 173 162 81 26 70 40 40 61 59 114 131
5569A31l4j4N6l2M1l5q6O6kp5O9j2O9R3j2o7r6j0Mm4J16J3j12KK4L1rk5J9O3p2M2p4N6L0o2
$$ 131 97 83 139 107 148 113 27 93 91 16 85 73 142 235 223 156 60 50 54 10 126 139 27 29 53 84 75 50 69 132 60 102 28 84 114 52
5118E2N8k8P2k9r5PJ6J08q6P3o3k4j9O0J0L7n8k3l6J03J05n5o5n0l0O1J2m5MK1j6jQ3o1J29
$$ 52 110 82 154 125 30 37 53 161 75 148 85 61 42 102 112 149 91 68 32 135 240 185 120 70 40 101 113 68 72 93 77 76 159 98 227
4680B27j8o8PQ3J4j36Q9O7L3o8j85J26m1no8J1K8k7J08o8k6k4k9Q3n9k7NK4J26mR0l1j06m
$$ 227 209 141 148 231 245 109 198 265 298 230 45 171 130 125 57 68 96 69 177 109 83 59 30 113 54 27 32 56 182 178 268 237 131 127
4255A27m6K9l7KN0m4m0l5J04L5r4rk3P0nM9qnm9J12k8k0n5J2J36r8M1l8O3l9M0Op2m5K8J38
$$ 127 81 110 73 75 125 81 41 6 110 145 51 42 19 89 84 133 125 120 71 183 155 135 80 92 228 130 171 133 196 157 197 203 131 86 114 252
3804B52r4j44P7J2K1j1N2m7l2O7j09M8J2p5R9k1N7lP1j32M0J22Pk58K00Q0j68r1K9P8r9J80
$$ 252 158 14 91 103 124 113 165 118 86 153 44 92 104 29 128 107 164 161 232 100 140 262 269 11 211 291 123 32 61 139 40 220
3403B20o9O5j66J48M8j65J29K2jN7j4j54K15r7j56J24oJ00j44O6j69J27J58o0J8n3R0J20M31
$$ 220 151 216 50 198 246 81 210 232 231 288 274 120 335 238 82 206 200 300 156 222 53 180 338 278 296 243 333 453 884
3040H84m57J09R4j34J214J299m36Q10K545q63l046j025j49l65o9J4k0J84J29J022J429l46
$$ 884 427 536 630 496 1710 3009 2573 3383 5928 5065 2019 994 845 480 411 425 405 589 718 1740 3169 2823
2765B823m32q91o33l78n6L1j29J78K92K75N8L076p27k029m06m86j01j69R8j26J57n3r7o4j0
$$ 2823 2391 1500 867 489 433 464 335 513 805 1080 1138 4214 3487 1458 1052 566 465 296 394 268 425 372 275 211 201
2452B01r0Q8Mj22J4K33Q0j05K0l8j65k4N1J48j48m1J5L9R1j60P7j11L4l6M2k6l0J42j53J22
$$ 201 111 199 203 81 95 328 408 303 323 285 120 96 147 295 147 106 121 160 251 91 168 57 91 55 97 71 41 183 30 152
2076A52n7N5r6J33km6J9J49Q5j63p9m1J3N0j13pJ21j1r6Q7L2r4J64Q7r6m4l2j04O9J1p3n2
$$ 152 95 150 54 187 185 139 158 307 392 229 150 109 122 172 59 52 173 162 66 153 185 91 255 342 246 202 170 66 135 146 73 21
1675B1M9m2O3J4JM2j6r3P9n8K38j07J05n5j21L3r4J2O6N8or9Kn2K01k4j40J07Mn6j07J98p2
$$ 21 70 28 91 105 106 148 132 39 118 60 298 191 296 241 120 153 59 71 137 195 189 90 92 40 241 217 77 184 188 132 25 223 151
1262A51p1L6P8rj09l1lJ7P3M9J18j64N7j1m9p9jJ25o8J8J9m7l1j0k2Q7r3J67j13J74j29j7
$$ 151 80 116 194 185 76 45 42 59 132 181 299 135 192 181 132 53 52 177 109 127 146 99 68 58 36 123 30 197 84 258 129 112
862A12p5pQrJ26m1m6k6P8m9N5M0j13QM0R2pq0K4k5K06p0k10N7J02k2M6l3L8P7o0j16l5O7j2
$$ 112 37 30 38 29 155 114 68 42 120 71 126 166 53 61 101 193 186 106 130 105 311 241 31 88 190 168 214 181 219 296 236 120 85 152 140
423A40n2J36o7j4q7l3J13rL9k2N3j7j12l5P9O5q8P4m9l1J9m3j8J56j4j30M0P8r2pR2l4j17
$$ 140 88 224 157 143 56 23 136 127 166 144 197 180 68 33 112 177 89 163 114 83 102 59 41 197 183 53 93 171 79 72 164 130 13
10A3R7l5M1J10Mj59K8N8r9l3N8jk4Q8j25J66P1j01n3o5Q8m1p4J50m1q0j7J62P1j71Lj1
$$ 13 110 75 116 226 230 71 99 157 58 25 83 82 58 146 21 187 258 157 104 39 127 86 12 162 121 41 24 186 257 86 89 78
-390G8
##PAGE=	F1=2203.39
##FIRST=	23149.952173337649583,	6007.3700543999984802,	0.38469827175140380859
##DATA TABLE=	(F2++(Y..Y)), PROFILE
6007F6Pk9K2P4o8N8J10P2j90l7M4n1j8R7Q8q2m0N6K4j01J59p3r2l5P8J4q0m0L1l3pL5L9N8
$$ 66 73 44 66 140 72 130 240 312 122 85 129 78 60 157 245 163 123 179 203 102 261 188 96 61 139 153 73 33 64 31 24 59 98 156
5582A56l3Kl8M2l2O1n8n7M0P4p6K3l2Q4P2l4p0q6LJ1m5J02L0p3J4k1PJ3N1n4M3q8P4q1L8M7
$$ 156 123 125 87 129 97 158 100 43 83 157 81 104 72 156 228 194 124 38 41 52 7 109 139 66 80 59 66 79 130 76 119 31 105 24 62 109
5131A09k8Qk4Q1J4p7l5j4P3n7MQ0n9n2R9N7N5o0j03M0N0K4j0n8l1p7Q1l0rM2K9l6NK3k6J26
$$ 109 81 89 65 146 160 83 48 34 107 50 54 134 75 23 122 179 234 174 71 111 161 185 175 117 86 9 90 60 51 93 122 86 91 114 88 214
4680B14l7j04kJ10M5r9QR6L4mk16J04nm4k5J5J5j7Q7l0m7jj1L7m9m5QJ3J31l0R2j8j41N4o8
$$ 214 177 73 71 181 226 127 135 231 265 261 45 149 144 100 75 90 105 88 175 145 98 97 86 123 74 29 37 50 181 151 243 225 84 138 70
4242G0K9M0j09N3J8j1o3L6O4n9j6k1M3O0K6qJ9l1j8P6o5l4jJ31q8MPK1J2L9l2j8o6k3J65q0
$$ 70 99 139 30 83 101 90 27 63 127 68 52 31 74 134 160 152 171 140 122 198 133 99 98 229 141 145 152 173 185 224 192 174 108 85 250 170
3791A70r3L1n7P1K2k3%kJp4J01j15j0R3pM8k3N6o7N1P2P9k56Q1J27j00r8o2J54j30J35K5l9
$$ 170 77 108 51 122 144 121 121 119 120 46 147 32 22 115 108 156 133 189 122 173 245 324 68 149 276 176 78 16 170 40 175 200 161
3378A61k1J9L7m0l1N6J1J10Mk63K53j00r9J09j0J82k16J68j82m0J84L4K9j31J6J27M90m20
$$ 161 140 159 196 156 125 181 192 302 306 43 296 196 97 206 196 378 162 330 148 108 292 326 355 224 240 367 857 437
3028D37Q8O3j73J035J189l86O68K213p70k666q45m0k79k17M7j5K00J93P81J306l16j90q62
$$ 437 525 588 415 1450 2639 2253 2921 5134 4364 1698 853 813 534 317 364 349 549 742 1523 2829 2513 2323 1461
2740A461o97l87rQ9p2O6L55K73L5L272p88k190l07l93j32k86P8j13J77q8q9KL8j89N5O2n5
$$ 1461 764 377 368 457 385 451 806 1079 1114 4386 3598 1408 1101 708 576 290 368 255 432 344 255 257 295 106 161 223 168
2402A68j36J36J82p8J8K9j60m5j6J65k2j90L8k0K12j33L4o6l3J0P3j48MJ36p7pM2M1q2J18
$$ 168 32 168 350 272 290 319 159 114 98 263 241 51 89 69 281 148 182 116 83 93 166 18 22 158 81 74 116 157 75 193
2026A93j8q7OJ45R8r0p4j01L7J37o9n9jK5m7L7J7n5J04J53o0q5l1j07L1O4j32O9p7qK8K9M
$$ 193 175 88 94 239 337 247 173 72 109 246 177 118 117 142 95 132 149 94 198 351 291 206 175 68 99 163 31 100 23 15 43 72 76
1613G6N5jj01P5o5K60q9O3kk21N5p6%P2P3Rm6ko2N1O7p1M6l9l6j9K13j19j03K2J2Q2q0k5m4
$$ 76 131 130 29 104 39 299 210 273 271 50 105 29 29 101 174 183 137 135 73 124 191 120 166 127 91 72 285 166 63 85 97 179 99 74 30
1175C0L7J24J3P0j48J07j02Oj08NO2K5J1L3r0J2Ln2J15j16J81j15J36q9Mo1k8n3O9J05p3n2
$$ 30 67 191 204 274 126 233 131 137 29 34 96 121 132 165 75 87 90 38 153 37 218 103 239 150 154 93 65 12 81 186 113 61
774F1m1M3l7O3J02q7l6M7O7mn8qk0J78j1k07j8J38K0J7j0K4J4q5o6o7P1K0m3J64l9j2j02o3
$$ 61 20 63 26 89 191 104 68 115 182 178 120 112 92 270 259 52 34 172 192 209 199 223 237 152 86 19 90 110 67 231 192 180 78 15
348A5J33j2pMK6j4k6k4K2P1j29J02o4l0K6q0OJ56k1p6L3R6j31j2M8k6m7J28q6J2P7Nq6RO9
$$ 15 148 136 129 133 159 145 119 95 117 188 59 161 97 67 93 13 19 175 154 78 111 207 76 64 112 86 39 167 81 93 170 175 89 98 167
-90A67j10k7J8N9p4J15r4J93Jj23p1j9Q5J5o2N0qn3m1J19K6j35M0l
$$ 167 57 30 48 107 33 148 54 247 248 125 54 35 120 135 73 123 115 62 21 140 166 31 71 68
-390F8
##PAGE=	F1=2109.04
##FIRST=	23149.952173337649583,	6007.3700543999984802,	0.25566577911376953125
##DATA TABLE=	(F2++(Y..Y)), PROFILE
6007H1%l4K7L4l6J01P2P4j68j03M0k1m6J05M0m3oJ5O0j01J51k1j06p1O0L3n9n9nJ4k3K9O4
$$ 81 81 47 74 108 72 173 245 319 151 48 88 67 21 126 166 123 117 132 192 91 242 221 115 44 104 137 78 19 14 28 5 34 98
5594I8P2n4J8j5Mk1N3q5RK2J14p2o0K2L3K5l2k7p6L6on2Q3L4j0Ok4m5J4J32q4J0j03P0p2O0
$$ 98 170 116 134 119 123 102 155 70 79 101 215 143 83 105 138 163 131 104 28 64 58 6 89 123 113 119 95 50 64 196 112 122 19 89 17 77
5143G7N1m0j8k6R9Q3p2j00rj1P7o3R4p4m7J11O1Q0p3j40R6J2m8M3K4j22m4R2n4l0P8L1m7J0
$$ 77 128 88 70 44 143 226 154 54 45 34 111 48 142 68 21 132 193 273 200 60 156 168 120 163 187 65 21 113 59 29 107 138 91 101
4718A01m3nJ09l6j26O9N1N1n6nJ05QO0j77%P0r7%PPM8j6J3o4M3OL4m9m5l8M1J30o1O3J8j14
$$ 101 58 53 162 126 0 69 120 171 115 110 215 223 283 106 106 176 79 79 86 93 141 125 138 74 117 123 157 108 63 25 66 196 135 198 216 102
4267A02M8n1m8R6j06oM7J8o1NL0%j3lMJ21J7k1K2j7j32J64p9n9L5R5p9Qmj5M0Q8m6J2o8m4
$$ 102 150 99 51 147 41 35 82 100 39 44 74 74 61 58 62 183 200 179 201 184 52 216 137 78 113 208 129 137 133 118 158 246 200 212 144 100
3816A00J14q2j6j1j5N4mp4K8J9k1o0J12j08j1M4N2Lj3j2J2O1N8J06k64M0J19o5kj14J59j00
$$ 100 214 132 116 105 90 144 140 66 94 113 92 32 144 36 25 69 121 124 111 99 111 172 230 336 72 112 231 166 164 50 209 109
3416A09j1Q4p5L5K5L2j9j41N7J4J60Q4l00J82j23k2Q9l8K50k22J67q3j43R9J06J22j74rK9
$$ 109 98 182 107 142 167 199 180 39 96 110 270 354 54 236 113 91 180 142 392 170 337 254 111 210 316 438 264 255 284
3053B84N45l45L9J27j98P59J079k40M97K090o79k375q39L5r5l36l8K7J40J78Q01J163k00j48
$$ 284 829 484 523 650 452 1211 2290 2050 2547 4637 3958 1583 744 779 684 348 310 337 477 655 1456 2619 2419 2271
2752B271p46q15m01pJ30LQ0L36L30n1L573q32k460l09k55k18j97m1j13J52Oj64l4J38j55j23
$$ 2271 1525 710 309 302 432 435 515 851 1181 1130 4703 3871 1411 1102 847 629 432 391 278 430 436 272 238 376 221 98
2427I8J35O1j46j16K19OJ5R9j12j97N1R6P7k10O8j08K20n1%k7j02K7J05j50L2M5rp5J19O5
$$ 98 233 294 148 32 251 257 272 371 259 62 113 209 286 76 144 36 256 205 205 178 76 103 208 58 90 135 126 51 170 235
2051B35j26J01m0j19j1J39Q9j4q8j00K1J92k2l2j45N2Rq2K0j1N2K05mj15p7m1l2O3p5J21j09
$$ 235 109 210 170 51 40 179 268 254 166 66 87 279 257 225 80 132 141 59 79 68 120 325 321 206 129 88 56 119 44 165 56
1663E6k2k4LL1O4J4o6L0q4K47np8J07k24K6J5n2K6M6J4j3O3q5n6J11J2k2p0J5M5J85j47r5
$$ 56 34 10 13 44 108 122 56 86 2 249 244 166 273 49 75 90 38 64 110 124 111 174 89 33 144 156 134 64 79 124 309 162 67
1250F7L0l4J25m7j01QK3J48k5Nj04J46j63N0r2Q8l8O0j4L5j09L2JmP6q1J39r4Q9n3J7m9j9
$$ 67 97 63 188 141 40 48 71 219 194 199 95 241 78 128 36 124 86 146 132 167 58 90 91 87 163 82 221 127 216 163 180 131 112
837A12q3O7Q6j10J2n3N9M0M3O2q6r7M6L7k1j2j4k1J32L1j58N7j4N1J2j6J2l6o3K4m2m9J03
$$ 112 29 96 182 72 84 31 90 130 173 235 149 52 98 135 114 102 88 67 199 230 72 129 115 166 178 162 174 138 75 99 57 8 111
423A11r9J81mjp2o3R1Kq2K7J2j4P2Kn1Q4j61J04m0m2N2l3m5J11k3j6J4P9q8j9l9J3L1J10j04
$$ 111 12 193 189 188 116 53 144 146 64 91 103 89 161 163 112 196 35 139 99 57 109 76 31 142 119 103 117 196 108 89 50 63 94 204 100
-15A00P0k9j6l4rQ5j11j6rQ4j04J02n2J62j8r4l6mL5O5l8o3K4j7m1N0Ro6NJ6
$$ 100 170 141 125 91 82 167 56 40 31 115 11 113 61 223 205 111 75 71 106 171 133 70 94 77 36 86 95 29 34 50
-390E0
##PAGE=	F1=2014.69
##FIRST=	23149.952173337649583,	6007.3700543999984802,	0.12054620683193206787
##DATA TABLE=	(F2++(Y..Y)), PROFILE
6007I3j0m1M7l2oR8O0O2j06r1j6J7l5L1Rj3K7l2J00j01J10L1r3o1M1L5l8o1M7j1k6j2N1R3
$$ 93 83 42 89 57 51 149 209 271 165 74 58 75 40 71 80 67 94 62 162 61 171 202 109 48 89 124 86 25 72 61 35 23 74 167
5582A67n5J4Nk1QL5r9N3K5J13o8j16M4j4J9qrj5L3k2n7P2K0J3j3k0m4J4J75j03Kj07K5k6J4
$$ 167 112 126 131 110 118 153 54 107 132 245 177 61 105 91 110 102 93 78 111 89 32 104 124 137 124 104 60 74 249 146 148 41 66 40 54
5143E4P1m7m1rR8J14n4j36O6m1J12n6mp1j8R0J1J08q6q2N2j4k3L8Q0j77QR6k1p9O9L0n6M3
$$ 54 125 78 37 28 126 240 186 50 116 75 187 131 127 56 38 128 139 247 161 79 131 117 94 132 212 35 43 139 118 39 108 138 82 125
4718A25q0j1M9k5J5J7J6Nk4N5Q6l0P9j68j2J10j32oJ8k1J28r7jp3Q4K0N8l3k0j02M8J50q0
$$ 125 45 34 83 58 73 90 106 111 87 142 228 198 277 109 97 207 75 69 87 66 194 97 96 23 107 127 185 152 132 30 78 228 148
4305A48KL2n6L6n3p1P4n6k1KN6l0qm9M4K0JRJ24L0k8j6mr0P7l2j33J02Q3r0M7k9o2J2J48j9
$$ 148 150 182 126 162 109 38 112 56 35 37 93 63 55 6 50 70 71 80 204 234 206 190 186 96 173 141 8 110 193 103 150 121 59 71 219 200
3854B00J5l7m8M2j18N8l9L7O7n6q3J7J7Rm1P6l1ok2L2K0J3j12N0P1P2J13k87P7O8q1R6r8J33
$$ 200 215 178 130 172 54 112 73 110 177 121 38 55 72 81 40 116 85 79 57 89 109 122 10 60 131 203 316 29 106 174 93 189 91 224
3428B24n8q4J09o8k4K4J09p2j44Q6p2J35J73k21J05j44N6k9k8K55j42M2M1j60KJ01K31k04
$$ 224 166 82 191 123 99 123 232 160 16 102 30 165 338 117 222 78 134 105 77 332 190 232 273 113 115 216 447 243
3078B43M8p3N17k60K5J53j80O07R15j36L04J845n53k024p94L9N8k82r5M5M8O7Q06J033m3j52
$$ 243 291 218 735 475 500 653 473 1080 1995 1859 2163 4008 3455 1431 637 676 734 452 357 402 450 517 1323 2356 2313 2161
2752B161n66r15l92m5R0Q7J87K78L86q7L772q60k665l91r8l04j07q3j28O8J04j51j05J73n0
$$ 2161 1595 680 288 243 333 420 607 885 1271 1184 4956 4096 1431 1040 942 638 531 448 320 388 492 341 236 409 359
2439C59l10J27J68j08j26J4P0L9K00o8k96L8K6J13j00jm4R1L4kLj60P6O5j14O8q8N3m3J55
$$ 359 49 176 344 236 110 124 194 233 433 365 69 107 133 246 146 145 101 192 226 224 227 67 143 208 94 162 74 127 84 239
2064B39R0j72N9q9j8q4J10Q5N4r6q5l2J99OJ7k04M3L9j18k6L2nK20N4j30j43O1J6m8K7O5m4
$$ 239 329 157 216 127 109 25 135 220 274 178 93 61 260 266 283 79 122 161 43 17 49 44 264 318 188 45 106 122 74 101 166 122
1663A22m7o1N2rj6O6k8J6o2J77Q1j94J60j30k0J8m2j6l7L2k1J32p9L1J4L5q8q2Q7O1J26j47
$$ 122 75 14 66 57 41 107 79 95 33 210 291 97 257 127 107 125 83 67 30 62 41 173 94 125 139 174 86 4 91 152 278 131
1262A31n9N0oJ15n2j31jK4J35m3l7n8J44j84J12q7J48nk1k7J4q0k3NL3K6k1R9n5M9m2K1l5
$$ 131 72 122 116 231 179 48 47 71 206 163 126 68 212 28 140 53 201 196 175 148 162 82 59 64 97 123 102 201 146 195 153 174 139
849A39J0j06K8P3j09P0o2R6P4R5k3j13j48L8K0o0L4Mj5P5N9j21R6j12Q1N6l9k3m4M6K9m7k8
$$ 139 149 43 71 144 35 105 43 139 213 308 285 172 24 62 82 22 56 60 45 120 179 58 154 42 123 179 140 117 73 119 148 101 73
436G3Q4p8R7oom2m4N0K2j11QMk8J64K5j17J08j52P6j0n9N6kn7N2K5kk9M2Pj7r5P9J9N5j02
$$ 73 157 79 176 170 164 122 78 128 150 39 47 51 23 187 212 95 203 51 127 117 58 114 112 55 107 132 130 101 143 150 133 38 117 136 191 89
-15H9J28o5k3n8j8J11q2l1PN3m8j4L2P9nl8j3J0k3R4mj17M9l6qj4K8lo0K2
$$ 89 217 152 129 71 53 164 82 51 58 111 63 49 81 160 155 117 104 114 91 185 181 64 113 77 69 55 83 80 20 42
-390D2
##PAGE=	F1=1920.33
##FIRST=	23149.952173337649583,	6007.3700543999984802,	0.063085585832595825195
##DATA TABLE=	(F2++(Y..Y)), PROFILE
6007A03k4n5O4p1K9L2P8L9l7l3p4M7j8n7K1l5O1n0R6r8N6O0n5lj7M6ol2N4l4l6%J3R4n0lJ4
$$ 103 79 24 88 17 46 78 156 195 158 125 51 98 80 23 44 9 70 20 116 18 74 134 79 76 59 105 99 67 121 87 51 51 64 158 108 105 119
5544A19m7M9K2n0L9K3Q9o3j09Oj9O5kn2M0M1l7m8N4J6kl5j1j5M1J65j26J4p6m0J0k2O0k2o3
$$ 119 72 121 143 93 132 155 244 181 72 78 59 124 122 70 110 151 114 66 120 136 134 99 88 73 114 279 153 167 91 51 61 39 99 77 14
5106A4J6O2J02k2j27J37o1J05m2n2m3j8L8n2R1p4N2n1K1Kj3Q3j38L8Q5j3p9L5K7p7R6r3ok8
$$ 14 30 92 194 172 45 182 121 226 184 132 89 71 109 57 148 74 126 75 96 98 85 168 30 68 153 140 61 96 123 46 142 49 43 15
4680A5J0R9j3J7l4jQ6M3m7O8j82K7J15j35rL2j9J44p5q0oK3M8N4J4Nj14m7J97n6o4LOM3r3
$$ 15 25 124 111 128 94 93 179 222 175 243 61 88 203 68 59 91 72 216 141 61 55 78 126 180 194 199 85 38 235 179 115 118 124 167 74
4242G4k2J6nk5j2O2J8n8L6o3M4PK8Q6N5j7q1qKm5N4m9J4R4j22P0l3k9n4J17J6NJ2k7j1j12
$$ 74 52 68 63 38 26 88 106 48 84 21 65 72 100 186 241 224 143 135 137 92 146 97 111 205 83 153 120 91 37 154 170 175 187 160 149 37
3791C7L4k3K5J17l3q3j8k2L6j5P0j8MJ8o6M5J7o9j4L2Q6J15k33K9O5j27J47p1J27l8n4J26
$$ 37 71 48 73 190 157 74 56 34 70 55 125 107 111 129 63 108 125 56 42 74 160 275 42 71 136 9 156 85 212 174 120 246
3391B46p4n6nJ50j00j12J03m5o1K02j30J18j00N5j18QJ70j1j49J51j50l2L4K67j58M8l2L55
$$ 246 172 116 111 261 161 49 152 107 46 248 118 236 136 191 73 81 251 240 91 242 92 60 94 361 203 251 219 574
3040E74j66M9J26j66O67P58j18K46J546m84j760o67n1J09j32r5N5K4K6O50J043M3k00m16r43
$$ 574 408 457 583 417 1084 1842 1724 1970 3516 3032 1272 605 554 663 531 436 491 515 541 1191 2234 2277 2077 1661 718
2727G18m20l1o5J39K89K85L92m9L898r00k790n57L0k59j54jj72j9J51j11j20J63M1k86r1K60
$$ 718 298 267 202 341 630 915 1307 1258 5156 4256 1466 909 939 680 526 525 353 334 485 374 254 417 458 172 81 341
2402C41p0p0j12K1M6K60m0j73q7n8Q1L9q1OK2R2K1J9k39J76k3p1J02j51N7n4K42R5j79k2j07
$$ 341 271 201 89 110 156 416 376 203 116 58 139 178 97 103 125 217 238 257 18 194 171 100 202 51 108 54 296 391 212 190 83
2013H3J26j61M8P5J14o4o0o6J06L4M2j73oN7n9k3pk8J45R0j23j10N7Q0j03J01o5N3n2q9R8
$$ 83 209 48 96 171 285 221 161 95 201 235 277 104 98 155 96 73 66 38 183 273 150 40 97 177 74 175 110 163 111 22 120
1625A20j9n9R0Kjp2R2J40q8Q0j22l3j6k8%j8K7m2Q8m5Q3%qj20J3K2P6N1j26j9O1K2J10o8m8
$$ 120 101 42 132 134 133 61 153 293 205 285 163 130 114 86 86 68 95 53 141 96 179 179 171 51 64 86 162 213 87 68 129 151 261 193 145
1187A45n5k3R7k5n9l2J10j42J61q3J27N3p9k2j8m1q6J7M8m1M6M9ML1n3J4k1L4j04J4K1k8L2
$$ 145 90 67 164 139 80 48 158 16 177 94 221 274 195 173 155 114 28 45 93 52 98 147 151 182 129 143 122 156 52 66 87 59 91
774I1l0Q6N9J67p0j23j66L5Q5k5j04M5qQR4q5L5p2P8J14l2p5k0R9J2q2J4R1n4O2o3n2l2j7
$$ 91 61 147 206 373 303 180 14 49 134 109 5 50 42 50 144 59 94 22 100 214 182 107 87 186 198 116 130 221 167 229 166 114 82 65
348F5L7K4l2j1o8K9J44K2j37J04j48J09j1o1L2Ml1K9O7k6o9kR7pp6O6mjq1J39l2mq8n0J21
$$ 65 102 126 94 83 15 44 188 210 73 177 29 138 127 66 98 102 71 100 167 141 72 70 167 160 84 150 146 145 64 203 171 167 79 29 150
-90A50k5n4J2K7J8j03R2K5j0pj8J7n6J20K8j27R5q5Nk2K6J0n0j7
$$ 150 125 71 83 110 128 25 117 142 132 125 107 124 68 188 216 89 184 99 104 82 108 118 68 51
-390E1
##PAGE=	F1=1825.98
##FIRST=	23149.952173337649583,	6007.3700543999984802,	0.17851328849792480469
##DATA TABLE=	(F2++(Y..Y)), PROFILE
6007A11m3o5N7m0M2n0J02kK4L5r7L1jl9M9p4O0l2J5n3P8n6kN4q4O1M3l8M0m3m2L0j0P5l0k7
$$ 111 68 3 60 20 62 12 114 112 136 171 74 105 104 65 114 40 100 68 83 30 108 52 50 104 20 81 124 86 126 83 41 71 61 136 106 79
5557G9J0o5O0K6O9Qj2N9o6p9m4L1O5j8p4N2P3m6l9J7L0rn6PQO5J14j40K5l4o4MM6Jlo0NJ6
$$ 79 89 24 84 110 179 187 175 234 168 89 45 76 141 123 49 101 174 128 89 106 136 127 71 78 86 151 265 125 150 116 52 56 102 103 100 40 45 61
5081F1O0J5p3J68n7O5k4n5pn2k2J5q8O4O1n1R8r0n2Q9q4N1O0l6m9J1L0r2J07o3j5K6QO3j7
$$ 61 121 136 63 231 174 239 215 160 153 101 79 94 6 70 131 80 178 88 36 125 41 92 152 116 67 78 108 16 123 60 45 71 79 142 125
4643A25M3n7M0M2k2n7N4j63M2J08r8jJ4K3R5j1j37M9l4P6J3P2L3j27n8J24Rr6l5M9N4j42J
$$ 125 168 111 151 193 171 114 168 5 47 155 57 56 70 93 188 177 40 89 55 131 144 216 249 122 64 188 197 101 66 115 169 27 28
4230B8J9K1m0M6NM7q9Q6p0oL2N9K2O3Qj33l9O3j01J53Ql2Q6j51M1m3L1lk6N4j0K5K2l7k6p4
$$ 28 47 68 28 74 79 126 37 123 53 47 79 138 160 223 231 98 59 122 21 174 182 150 236 85 126 83 114 111 85 139 129 154 176 139 113 39
3779C9K4l9J57M9j20jp4J7K3O3m5qP6n3mk3l4K0k5O7J14j48l7M9RJ5p5J49n3j3J41o6p1M0
$$ 39 63 24 181 230 110 109 35 52 75 138 93 85 161 108 104 81 47 67 42 109 223 75 38 87 96 111 36 185 132 119 260 194 123 163
3353A63J01p0j35J18kj10R7p9J23n6O4j03jQ8R3j92J46j32m0M1J22Lo9M0K21q3jJ46j73P79
$$ 163 264 194 59 177 175 65 162 83 206 150 214 111 110 198 291 99 245 113 73 114 236 239 170 210 431 348 347 493 320 1099
2978A099O03j51K66J301m71j560m79j20N9Oj10R9M9O2M69J058J63k54m43q60n10J8o1K0L37
$$ 1099 1702 1551 1817 3118 2647 1087 608 488 547 553 443 542 591 653 1122 2180 2343 2089 1646 786 276 294 233 253 590
2665E90L53L71M4M177r68k936p53n2o9k83J36k45m8J46q5j22J61Q8j97k83K97k8m8o6j1MJ18
$$ 590 943 1314 1358 5535 4567 1631 878 826 757 474 610 365 317 463 378 256 417 505 308 25 322 294 246 180 169 173 291
2326B91k4j0r9o0j2P2k6m2j6J00Q1J0j84J10n7n5J10q3K6o6K48R5j50r3r0J84k01J9J8J58
$$ 291 267 257 158 98 86 158 132 90 74 174 255 265 81 191 134 79 189 106 132 66 314 409 259 166 76 260 59 78 96 254
1951B54j9j7q9L2P3Jj03o2P7n2L3n9j7N8R5j04Pn8J28j24J61j30R1n5p9R5kn3Q4K7k0q3m0
$$ 254 235 218 129 161 234 235 132 70 147 95 128 69 52 110 205 101 108 50 178 54 215 85 176 121 42 137 135 82 166 193 173 90 50
1538E0K11KO6j70l0m9k5J6M5J0n1K8j1R0Nm3r0O3o3J04j5r4K6L1M6Q8o2J7l8j08Q0Mq1j5J02
$$ 50 261 263 329 159 129 80 55 71 116 126 75 103 92 182 187 144 54 117 54 158 143 49 75 106 152 240 178 195 157 49 129 133 52 37 139
1100A39j06J36m8N4J02p8j7k6m1n7KM9n7M2l6P1N5p5jk2N4n4K7p6O0n5K0O6j2K26n9j00j40
$$ 139 33 169 121 175 277 199 182 156 115 58 60 109 52 94 58 129 184 109 108 86 140 86 113 37 97 42 62 128 116 342 283 183 43
686D3J8J49J3j49l1MpP9k5p2M4J6J43nq6k4R9J7q9J5R9j2M9j19j16poL2j6O1L5r8N4O4j3j10
$$ 43 61 210 223 74 43 47 40 119 94 22 66 82 225 220 134 110 209 226 137 152 251 239 288 169 53 46 40 72 56 117 152 54 108 172 159 49
236D9P9r4R5j8m6%J4RM3M4n3p7k9J32Ko2L6ll1m1R2J3J4l0q8R5K4n8l4N4M4r3N4J7l0j1k7
$$ 49 128 34 129 111 65 65 79 88 131 175 122 45 16 148 150 88 124 121 90 49 141 154 168 138 50 145 169 111 77 131 175 82 136 153 123 112 85
-228H5J0n1J37L9j24J36p9l0j5K2J3m1l1
$$ 85 95 44 181 220 96 232 153 123 108 130 143 102 71
-390G1
##PAGE=	F1=1731.62
##FIRST=	23149.952173337649583,	6007.3700543999984802,	0.4159075617790222168
##DATA TABLE=	(F2++(Y..Y)), PROFILE
6007A11n6m2J9%L2j2K9l9O8R3q9j9J5j0O6q9N9l1pl7J33o7l9K6q0M2P3p9P1q4m5J20r3O3R
$$ 111 55 13 32 32 64 52 81 42 110 203 114 95 110 100 166 77 136 105 98 61 194 127 88 114 34 76 149 70 141 57 12 132 39 102 111
5569A11n7j2K7o0R2J55j1m8L2q3n9o7P6L8j8l3j8J18l8o1j2N2K2p5K0RN2O7j36J4%k9l2J02
$$ 111 54 42 69 9 101 256 245 197 229 146 87 20 96 134 116 83 65 183 145 84 72 124 146 71 91 100 152 219 83 97 97 68 36 138
5143A38j3pn3j4j4J8M5OJ54MJ2k1o9J7q9o8J06k9O4r5kJ28j30p4J41p9M0L3o0j4j1K9k2lJ0
$$ 138 125 118 65 51 37 55 100 106 260 264 276 255 186 203 114 46 152 123 187 92 90 218 88 14 155 76 116 149 89 75 64 93 71 68 78
4705G8j8J1PO2j5P4p5P7k2q5o1N1k8k7M3k0nnM9K6O1j42O9m7N7j5J00Q0j56L9l8N7o6l3N3
$$ 78 60 71 78 140 125 199 124 201 179 94 33 84 56 29 72 52 47 42 91 117 178 36 105 58 115 100 200 280 124 163 125 182 116 83 136
4267A36M6j51j2N1Nn3R1k5J7m7O8n5k6M0Q9j4N4K0j23%j7n5J58K4m0P7j39j8n3L4L4o8Q5J0
$$ 136 182 31 19 70 75 22 113 88 105 58 126 71 45 85 174 160 214 234 111 111 94 39 197 221 181 258 119 101 48 82 116 48 133 143
3841A43n6P9l8L7o9l8QJ04R3j41L5j27lP3L4n6l3P6%k5n5k2L0lJ6J18j04M3j15J43j3j02J19
$$ 143 87 166 128 165 96 58 66 170 263 122 157 30 27 100 134 78 45 121 121 96 41 19 49 46 62 180 76 119 4 147 134 32 151
3428A51p3KJ16Mj36R4P5k3j75J41M5j35P1n7M8k2N8n9k7O8J37j62J19j02m3L0O2J15j18k1
$$ 151 78 80 196 200 64 158 233 210 35 176 221 86 157 100 148 126 184 125 98 166 303 141 260 158 115 145 207 322 204 183
3053A83K42m9j34K45j19O88N16j83K81J137m33j455l45q7J8M8j58J49J08N1M68R17L46k22
$$ 183 425 376 242 487 368 1056 1572 1389 1670 2807 2374 919 574 487 505 553 395 544 652 703 1171 2088 2434 2212
2752B212o10p48n96RP4o2K97L66L54J36M507r80l119p67l92J17l17J67k24o4R0p8p0Q7J49
$$ 2212 1602 854 258 267 341 279 576 942 1296 1432 5939 4959 1840 1073 681 798 481 648 424 360 450 372 302 389 538
2439E38j01k74J24P0j16J1J6Pj61OQ7l0k6Nk9Q5o6p7N2J37Rq2o4Ro5P0k4O0lJ16R9r9p3j55
$$ 538 437 163 287 357 241 252 268 275 114 120 207 177 151 156 127 212 146 69 121 258 267 185 121 130 65 135 111 171 168 284 383 284 211 56
2013E6J98j91QnJ03J5K8j05Q1P8p1m3p9P5r2J07q9j9J5O9r0J04j31J30p2R9o7N1o1m3P0J9
$$ 56 254 63 71 66 169 184 212 107 188 266 195 152 73 148 56 163 74 55 70 139 49 153 22 152 80 179 112 163 102 59 129 148
1613A48p8Q3N5k7p4N1J05K8M4k00k2o8k0J4J00j8o6K4RO6j5l8n7P2j03J28n7qM0k8M3N3m2
$$ 148 70 153 208 181 107 158 263 291 335 135 113 45 25 39 139 121 55 79 88 154 139 101 44 116 13 141 84 76 116 88 131 184 142
1200A42L5K3j77Q8J6r0L4J11j00J5J0QJ04l4rj1q2j1J9L2n6K3m3L6J02q2j7m6R0J1Lj10Q0
$$ 142 177 200 23 111 127 37 71 182 82 97 107 115 219 185 176 165 83 72 91 123 67 90 47 83 185 103 86 40 130 141 144 34 114
787A14p6K8M0r8K47ko9p1n8J84N8j66r6J3L4nL7kk7m3J52K1o9l8P3J8l7nO9N5K4j42j29M7
$$ 114 38 66 106 8 255 253 184 113 55 239 297 131 35 48 82 77 114 112 85 42 194 215 146 108 181 199 162 157 226 281 305 163 34 81
361H1prj9O4P8q9N9Op3o4P4j1j6Kk3j7N4J9M7j3o6n8LQ8Np0NJ7k0j6M6K8J0O5r9R2L7m4j20
$$ 81 74 65 46 110 188 99 158 164 91 27 101 90 74 76 53 36 90 109 156 143 77 19 22 110 115 45 50 67 47 31 77 105 115 180 81 173 210 166 46
-127D6J01L5q6L1jl4qm9NK4J00K8j15J47l1p2k6K2L2m1k5
$$ 46 147 182 96 127 126 92 84 35 40 64 164 192 77 224 193 121 95 117 149 108 83
-390H3
##PAGE=	F1=1637.27
##FIRST=	23149.952173337649583,	6007.3700543999984802,	0.44981124997138977051
##DATA TABLE=	(F2++(Y..Y)), PROFILE
6007I9m5l1M4k0NK3l7j0O0J33o3o3J3NO2p1J6J0Jn3J42jq4k1q5O0P0j19J58j29m6J73j59N4
$$ 99 54 23 67 47 52 75 38 28 88 221 158 95 108 113 175 104 120 130 131 78 220 219 135 114 29 89 159 40 198 69 23 196 37 91
5582I1K5p2k0Q3m6Q6J31k7o1J8r5m8n6R5PJ0%p7J39j2j22pO7Q8j02K6j9K0O8j36rKM4J3J7
$$ 91 116 44 24 107 61 147 278 251 190 208 113 65 9 104 111 121 121 44 183 171 49 42 109 197 95 121 102 122 190 54 45 47 91 104 121
5143A21Mj2k2o3j3M2K1Q0R5Q1j3j6r1Oj11q2J38K6O2j53NO8o7o9J29n6L9K7p4Nn0ML4q5Q4
$$ 121 125 113 91 28 15 57 78 158 253 334 321 305 214 220 109 27 165 191 253 100 105 173 106 37 166 110 149 176 102 107 57 61 95 10 94
4705I4Lm8l2J21l2Q3p2Q9o7j12O4P3n2l0m4J9m1L4J9l4J12o8M6m2j7JQ0J33j65J01n7k4Ql2
$$ 94 97 49 17 138 106 189 117 206 139 27 91 164 112 82 38 57 16 50 69 35 147 79 125 83 66 67 147 280 115 216 159 135 143 111
4280A11Q5J2j06m8P4l5n9J01j3m0lO3l8k3kQ2j3O4K7r2M0r0m1J30J6l8Q2r1n5On7J4k6P4P6
$$ 111 196 208 102 54 128 93 34 135 122 82 79 142 104 81 79 161 148 212 239 147 187 97 56 186 202 164 246 155 100 106 49 63 37 111 187
3841A87j73J09%P3l3j39O6O3Q9j40P8j63oJ16K9k9no7M2j1J8n8Kkj3J30p6P9q6P5M6r9J9m2
$$ 187 14 123 123 196 163 24 90 153 242 102 180 17 11 127 156 127 122 55 97 86 104 46 48 46 33 163 87 166 80 155 201 102 121 79
3416G9l9L6J10j55M8R4L9j52Q4R3j35P0k2j4L2p3M2j04J21J36j30L9l5k4k3Q3J40p7n6K61
$$ 79 40 76 186 31 79 173 212 60 144 237 102 172 150 136 168 95 137 33 154 290 160 199 164 140 117 200 340 263 207 468
3040D68n7r6K59j1L47N53j70K61J018l54j389k95l5L4O5j89J28J72ON44P87M72j51p25p73
$$ 468 411 315 574 563 910 1463 1293 1554 2572 2218 829 534 499 533 598 409 537 709 715 1259 2046 2518 2367 1642 869
2727H69n82m7J38M1K28L76L44J82M806r62l393o80o12N1k01N7j04o7L1j35M9p2K45k9j98j37
$$ 869 287 240 378 419 647 1023 1367 1549 6355 5393 2000 1320 708 759 558 615 511 444 475 340 389 317 562 533 335 198
2402A98K15k04R1L9Rl04J20n2N4mK7o3J23n4j04L4R9M8j9j49Q6o0n4MJ12N9l4R4k7j5k20J96
$$ 198 413 209 300 339 348 44 164 112 166 162 189 126 249 195 91 125 224 272 253 104 190 130 76 80 192 251 217 311 284 269 49 245
2001B45j04j05Q7m0kN8j09J88P2j14j5m9M5j47J72o6j9m2M6q6J51r2O5L7r9J3K7m1k1P5J2
$$ 245 141 36 123 83 81 139 30 218 290 176 161 112 157 10 182 116 97 55 101 15 166 74 139 176 77 90 117 76 55 130 142
1613A42r9P4N6j3p1J51L8O7k9j93j3q6jL9R2n9n2M0J0K5n6omll9J03n5R6J0n5J2J4l6J0Q4
$$ 142 43 117 173 160 89 240 278 345 316 123 110 24 23 62 154 95 43 83 93 118 62 56 52 49 10 113 58 154 164 109 121 135 99 109 193
1175A93j55M8L1q1R5R3q3r6K1N2N8j8J3jj18qN9J3l5J3L1j00J26m6k4p6J35M3m4q1M1j4rM
$$ 193 38 86 117 36 131 224 141 45 66 118 176 158 171 170 52 44 103 116 81 94 125 25 151 105 81 5 140 183 139 58 99 85 76 80
749H0JP9P9n7jj47J79R3j53j03NN7p7P8M3o8q3J31L4n0n1N8oM5kOJ21j6j31q0M2Qk7L4rO7
$$ 80 81 160 239 182 181 34 213 306 153 50 55 112 35 113 156 88 5 136 170 120 69 127 121 166 164 170 291 275 144 64 106 114 87 121 112 179
298A79o1O5k1j38J5N6J4p9QJ6k0M8K9L1n1l8k7K3K7Rm2Om2M1l2N3Ol9J35p5R9L9k6j57Q0K7
$$ 179 118 183 162 24 39 95 109 30 38 54 34 82 111 142 91 53 26 49 76 85 43 49 7 48 16 69 75 36 171 96 195 234 208 51 131 158
-152A58q2K4l4RN3m5n7P4O0jj26J40J8r5m2QP4m6j4
$$ 158 76 100 66 75 128 83 26 100 160 159 33 173 191 96 54 62 136 90 76
-390G6
##PAGE=	F1=1542.92
##FIRST=	23149.952173337649583,	6007.3700543999984802,	0.36529615521430969238
##DATA TABLE=	(F2++(Y..Y)), PROFILE
6007G7j5l2P3l5k7M4p5KN8J57l9q3kRL5j7m7N3K5p9J06P0j05j5n5J8O0j25K08j21o7J54j46
$$ 77 62 30 103 68 41 85 10 12 70 227 188 105 103 112 147 130 83 136 161 82 188 258 153 138 83 101 161 36 244 123 56 210 64
5594F4N7qm6j5P2m3R0O0l3o5K1q1k5j7P8k6L9Rp8J13K3j86L4N8J48j29L4o9N0O5j59K8jN2
$$ 64 121 113 67 52 124 81 171 231 198 133 154 73 48 31 109 83 122 131 53 166 189 3 37 95 243 114 148 79 129 194 35 63 62 114
5169A14Q1j17L8j2J4r3j1R0l2J21QJ22j5J6p0n1j09o0R9M5M8q8K8p7L0o4P0oO0N1j21K6q1
$$ 114 195 78 116 104 118 25 14 104 72 193 201 323 308 324 254 203 94 34 133 178 226 138 166 89 119 55 125 119 179 230 109 135 54
4755E4l8P6o8J04Rn1j9O3o1O4n2P2p3o6J32J13q7n7K1l3o0LMJ2L1K1K5k5j01L1L5J58j18Q1
$$ 54 16 92 24 128 137 86 67 130 69 133 81 153 80 14 146 259 172 115 136 103 43 46 50 62 93 114 139 114 13 44 79 237 119 200
4330B00K9j29N3l5J30j3m2j04R4n9o5Q1Qj4n2O7Lk6m4J8pP6P2p9N4j11n2R3mm5R6k9o7L3k6
$$ 200 229 100 153 118 248 235 193 89 183 124 59 140 148 134 82 149 152 126 82 100 93 169 241 162 216 105 53 146 142 97 193 164 97 130 104
3891A04n0lnJ68j23l3P2P8Qj54M7J7Q7j47J06j24k3J38L9l1Lq3J6j8N3p2J5j6m5J40n5O4n2
$$ 104 54 51 46 214 91 58 130 208 216 62 109 126 213 66 172 48 25 163 202 171 174 91 107 89 142 70 85 69 24 164 109 173 121
3478A21K1R9q0n7j2n9J9J07n3q1O4J09n9m4J25p9L6KoQ0k24J46q6P3J47n2j36J4qJ8k2J50
$$ 121 142 241 161 104 92 33 52 159 106 25 89 198 139 95 220 141 177 179 173 253 29 175 89 162 309 257 121 135 127 145 123 273
3078B73l4k0K21o6LK09R2L8O47j12K23Q80l42j286k07l4K3J47j43L5K06J7N40P45N10j07p10
$$ 273 239 219 440 374 377 586 678 716 1363 1251 1474 2354 2012 726 519 485 508 655 512 547 753 770 1310 2055 2565 2458 1748
2740A748r27m98p1R5J75J86M78L86J58N106j011l704o57n57k30p0l0l1n3L0k24J36j60K48
$$ 1748 821 323 252 347 522 708 1186 1572 1730 6836 5825 2121 1464 907 677 607 577 546 493 523 299 435 275 523
2439E23M4r3l93L11k20J35O2%k13J11j68N8K5J7r0J45o6r0N8JP7J1o8R4n8j23k1J15R9j36
$$ 523 567 474 81 392 172 307 369 369 156 267 99 157 182 199 109 254 188 98 156 157 234 245 177 271 213 90 69 184 283 147
2064A47O2O9Kj56J34j4k00Q7qq3P1l5J37Q7j15k4jJ8j22J42l7J3j19O5m9O7m5L0J13j66pq
$$ 147 209 278 280 124 258 244 44 131 123 40 111 76 213 300 185 161 160 178 56 198 161 174 55 120 71 138 93 123 236 70 63 55
1663E5K8n7J26rr4P9J8Kj02J62N3J22o2j95nn1k2L5Q2r4k0N1Jk1n4QO0m1m4P1K4J31m4o8n
$$ 55 83 26 152 143 49 128 146 148 46 208 261 383 321 126 121 70 48 83 165 71 51 102 103 82 28 36 96 55 11 82 106 237 193 125 120
1225A20rm3l1R7p7j4O7p1J45N3n4p9m7P9M9m0K3mq2o3P1J2J4K3K2j31M7K4k6o9J42M7p9l9
$$ 120 111 68 37 134 57 43 110 39 184 237 183 104 57 136 185 145 168 164 82 19 90 102 116 139 161 30 77 101 75 6 148 195 116 77
799G7J9L7k6o7P2k9J55o1L1j70J18R9j24n8jN5r8R0M2p8n0N0K9l6o3P6k1Q3J7m5J52o9r2l6
$$ 77 96 133 107 40 112 83 238 177 208 38 156 255 131 73 72 127 29 119 161 83 33 83 112 76 13 89 68 151 168 123 275 206 114 78
373G8K4L0l7M4j8K1m4P6m3r0L3K3Ono1K6j7j8O3Rm4L9l0L9n3K0M3Qn5J1j7K1Rm8O9k9Q9N5
$$ 78 102 132 95 139 121 142 98 174 131 41 74 97 103 98 37 63 46 28 91 100 56 95 65 104 51 71 114 122 67 78 61 82 91 43 112 83 172 227
-102B27k0j17lM6n5j1OO2R5l8j00J9P1l7j10Q0L7q2L8r3J06m1k7
$$ 227 207 90 87 133 78 67 73 135 230 192 92 111 182 145 35 115 152 70 108 15 121 80 53
-390E3
##PAGE=	F1=1448.56
##FIRST=	23149.952173337649583,	6007.3700543999984802,	0.70512181520462036133
##DATA TABLE=	(F2++(Y..Y)), PROFILE
6007E7Ok5P2j8m8L1k0LK9J45l5r9j5K4J2K9l1KN3r5N7J10r1J8jm9L1j12K03q3p9R0j05P8m0
$$ 57 63 38 110 92 44 75 55 58 87 232 197 98 83 107 119 148 117 119 172 77 134 244 153 171 170 121 152 40 243 160 81 171 66 144 104
5569A04Pm7R7j30J09%j2p9K9m3J3J9M5n7O3pm2O0M5j43J7J8J75j31M6j23J34J6j70Q0L3J5
$$ 104 111 64 161 31 140 140 128 49 78 35 48 67 112 55 118 111 69 129 174 31 48 66 241 110 156 33 167 183 13 93 126 141
5169A41J17j79M3rK3o7m8J09o6J21p0J22k1O4Lj11r4n2M6K2K6NP1j20N3n5lL4P9Q2j73M2q4
$$ 141 258 79 122 113 136 69 21 130 64 185 115 237 216 280 283 172 78 26 72 94 120 125 196 76 129 74 71 105 184 266 93 135 51
4755E1k6O9o6J65Lq8J6k0q1L6j1K0n2kJ39J33o3r8Q3l7n3j12N5M0o6Q6RNq7J0j9J31n1J9J11
$$ 51 25 94 28 193 196 108 124 104 23 59 48 68 16 14 153 286 223 125 208 171 118 6 61 101 35 121 130 135 48 58 39 170 119 138 249
4317B49j23Rl1J49j6K0j10O5m5r3O3J5M7j24K4P5ro8j6j9J3J51n5L1j05n6N8J3j07J11K2l6
$$ 249 126 135 104 253 237 257 147 212 167 74 137 152 199 75 99 174 165 97 81 62 75 226 171 202 97 41 99 112 5 116 138 102
3917A02j4M7m7J3n1J66m9j21P8O7N4j27L8n1Q8j32Q9k7j17J88L5o9j1l1K1k7J4Qo1L1r4J39
$$ 102 88 135 88 101 50 216 167 46 124 191 245 118 156 105 193 61 150 123 6 194 229 160 149 118 139 112 126 134 73 104 10 149
3516A49n3P8o6L3Q9k8j08Km2M8N5j6m5OL1O4j49J28k8M0jJJ03j50P6no8J77L2j33o3p6J12
$$ 149 96 174 108 141 230 202 94 96 54 102 157 141 96 102 133 197 48 176 148 188 187 188 291 141 217 212 144 321 353 220 157 81 193
3103A93o5J03k1nJ70o2L9J27J68m8O73n2K25Q32m24j221j39mq8K40l4m1K07O0N46P07N07r3
$$ 193 128 231 210 205 375 313 352 479 647 599 1272 1220 1445 2277 1853 632 493 489 401 641 607 566 773 833 1379 2086 2593 2500
2752B500o77j043m42m6N2K21J97N46N23K10N496j148m096p36m60l73j17k2l2m9M0k36J00p6
$$ 2500 1823 780 338 292 344 565 762 1308 1831 2041 7537 6389 2293 1557 1097 724 607 585 553 504 544 308 408 332
2452C32R1J31ql80J37j47J03Q5k4j05J26k00OQ5J2j34J76j21n2M0n3J9K6L9J11m1r2o5L1J24
$$ 332 423 554 546 166 303 156 259 344 320 215 341 141 147 232 244 110 286 165 113 153 100 119 145 184 295 254 162 97 128 252
2076B52j38K1J35j5o2P2L7j56q4Q6k2M2ONJ22r2o5M4Ln8N6j6P6j67P1n6LJj9J39o5j1o4M8
$$ 252 114 135 270 255 193 265 302 146 62 148 126 168 174 179 301 209 144 188 191 133 189 173 249 82 153 97 100 101 82 221 156 145 81 129
1650A29p4J00K1j50J28K6j0j26J14O6J36j8k44OLj7k7J10r1k9O1pp5O6rK7L1q9j3J07J50j01
$$ 129 55 155 176 26 154 180 170 44 158 224 360 342 98 104 107 90 63 173 82 53 114 107 32 98 89 116 147 58 45 152 302 201
1250B01q0j7j7j3NKmk3O8o9J50K2k2o6n0K3N4j0Nj8oo0L7rJ6O2k0j00m3O6j5l8R4O2q1j2L4
$$ 201 121 104 87 74 79 81 77 54 122 53 203 225 203 137 87 110 164 154 159 141 135 75 112 103 119 181 161 61 18 84 69 31 125 187 106 94 128
787A28M8Pj25O3n4J65n1jj25N5O5r2J2kL1q0J00J4q0l2J2RQl4L8J4M0K9n6J35j24k8pNL6m6
$$ 128 176 183 58 121 67 232 181 180 55 110 175 83 95 93 124 44 144 158 78 46 58 67 75 41 79 93 133 162 106 241 117 89 82 87 123 77
336G7L3lqm8Q7p7K8NK9kJ7o8j6noL1j3J6N9l8N0j05J6R8j2l5Mrk6K2l6l7K4N2Q4m0l6o3M7
$$ 77 110 107 99 51 138 61 89 94 123 121 138 70 54 49 43 74 61 77 136 98 148 43 59 157 145 110 114 105 79 101 65 28 52 104 188 148 112 49 96
-152I6ko2R3O3J10k6j31m6J04m9m4l5L9j2R9j27M4k2o2
$$ 96 94 32 125 188 298 272 141 95 199 150 106 71 110 98 197 70 114 92 30
-390C0
##PAGE=	F1=1354.21
##FIRST=	23149.952173337649583,	6007.3700543999984802,	0.63568019866943359375
##DATA TABLE=	(F2++(Y..Y)), PROFILE
6007C9MMN0J0n8qN5M5J0Q7m3j01m6N1J2L6Kp0P0p2J3J03k6J1M6q9j5p2J53m0p1K5p3Q7l3M8
$$ 39 43 47 97 107 49 41 96 141 151 238 195 94 48 99 111 147 149 79 149 77 90 193 167 178 224 135 120 48 201 161 90 115 42 129 96 144
5557A44p2J43j52K3l1K8o2rKK6O0Qp8Q3n0L1mL1p8Ok8J58r9O5j05J37k8j45J02N7NJ06j66
$$ 144 72 215 63 86 55 83 21 12 14 40 100 108 30 113 63 94 90 121 43 49 21 179 80 145 40 177 149 4 106 163 168 274 108
5143A08K1j3J9m8p0J05p4Q2j02J23k9O2R0j14q3o4oK0kM8R6p7M0k3q5N3Q3R2j72M1o3k4N7
$$ 108 129 116 135 87 17 122 48 130 28 151 122 184 274 160 77 13 7 27 25 73 169 92 132 109 24 77 160 252 80 121 58 34 91
4730I1o3K31kj31J7p5n4J0N1j2k1lP8J48j0j21J04j0m2j18J9J3r4R6OK3o2M4p1Q5k1j5J23
$$ 91 28 259 257 126 143 68 14 24 75 63 42 39 117 265 255 134 238 228 186 68 87 100 6 102 108 131 69 113 42 127 106 91 214
4317B14o8k1k8J19pO4p5L3j3j39N6lQ3j54j9J24K3q2J5J3j6O8Nl6j02qJ3R2p1l4M6M2r0P0
$$ 214 146 125 97 216 209 273 198 231 218 79 135 132 215 61 42 166 189 107 122 135 119 187 192 156 54 46 59 151 80 46 92 134 44 114
3891A14k8M2K2L7J9j16J3N1R2q4N6r2J7p0N9P4j57J48K3j17m6K0N8j7l5J17j88J22j03O7j7
$$ 114 86 128 150 187 206 90 103 154 246 162 218 126 143 73 132 206 49 197 220 103 57 77 135 118 83 200 12 134 31 98 81
3503H1P1p0N5N3K4j35N6Ln9O8j1l1R4j71J94j85O3JP2K4m8J11o6M2O4j90J43R3l8p5j18N2
$$ 81 152 82 137 190 214 79 135 138 79 147 136 105 199 28 222 37 100 101 173 197 149 260 194 236 300 110 253 346 308 233 115 167
3103A67K7Q7j9mJ07p5Q4Q3J32m4O49k7K66Q62m60j154k42R9k01K27P4m0J86P6N97P23M85q5
$$ 167 194 281 262 258 365 290 374 457 589 545 1194 1167 1433 2295 1835 681 439 538 337 564 638 598 784 860 1457 2180 2665 2580
2752B580p35j077m56K7P3J96K93N24O42M92O354j462m756r18n11k73l07n7k1l0Mj75m5K2l
$$ 2580 1845 768 312 339 412 608 901 1425 2067 2559 8913 7451 2695 1777 1266 993 686 629 608 578 582 407 362 384 381
2439C81J45N1k69n3k9j3J27r1l0J67j87o2R5O1j00J72j27n9n8l0n6LP5J24Oj0o1j37J33o7
$$ 381 526 577 308 255 226 213 340 249 219 386 199 137 232 293 193 365 238 179 121 91 35 38 113 237 243 233 172 35 168 101
2064A01M5R8nrM7J4n5j83L8O8K2N7j09J55m2j10M2ML0o9K2J31j47Mq2N3K2n3P0K3L8q4O1n7
$$ 101 146 244 239 230 277 291 236 53 91 159 181 238 129 284 242 132 174 178 208 139 161 292 145 149 67 120 142 89 159 182 220 136 197 140
1638A40l0J04j54O7Q7J3j59J21RR0O4k91J9L4Rj05J67p2k4J0pm3J23j5n3Q7o9r3J19J80j26
$$ 140 110 214 60 127 214 227 68 189 198 288 352 61 80 114 123 18 185 113 89 99 92 49 172 157 104 191 122 29 148 328 202
1250B02q5l5k6L4O0k9rJ1N7p9Q6LJ5o5k9n7K2O9%l8O1m0M5n2NO5m1j03NJ1OJOJ08o1j7L1M5
$$ 202 117 82 56 90 150 121 112 123 180 101 187 190 205 140 111 54 76 145 145 107 168 128 173 121 126 191 150 47 52 63 69 70 76 184 123 106 137 182
774A82P2j23J5pP4k3o0q1M6K1q1P4nlj9R5l4p6JJj4K2m2K6L2L8K0n3R9j39K2J1oNk3J6ml4
$$ 182 254 131 146 139 213 190 130 49 95 116 35 109 104 101 82 177 143 67 68 69 55 77 35 61 93 131 151 98 197 58 80 91 85 90 67 83 79 45
298D5m2R3o8O7rM5OMm3o8RN2%pL7L3m1M4r3pJ08m6JL0k1o2K3m0KNm0J15q5N7m7k7L5n6J23
$$ 45 3 96 28 95 86 131 137 141 98 30 39 91 91 84 121 154 113 157 64 57 165 119 120 150 129 67 90 50 52 57 17 132 47 104 57 30 65 9 132
-190A32N1R6Nj24q6J09k8Lj21M1O3J00j44Qj5o9
$$ 132 183 279 284 160 74 183 155 158 37 78 141 241 97 105 90 21
-390B1
##PAGE=	F1=1259.86
##FIRST=	23149.952173337649583,	6007.3700543999984802,	0.44291353225708007813
##DATA TABLE=	(F2++(Y..Y)), PROFILE
6007B1j8N2K9K7o3k2R5O7K1K8n3p3q7N9K1K4nr3Q6k1rL8O7m0O3r8m1nO7kl9l3m4P1mO0o7J66
$$ 21 3 55 84 111 48 26 121 188 209 237 184 111 24 83 104 128 123 30 116 95 86 124 191 151 214 116 75 70 137 135 96 63 19 90 86 146 79 245
5532B45r7m3l7J1k5k0j8RQ9jr9P9m5Q7n8k3j5j5j2P3m4P2k3P4k6j17Q1N3M0N1j43J5l3L1m1
$$ 245 148 105 68 79 54 34 16 25 114 113 14 93 48 135 77 54 39 24 12 85 41 113 90 164 138 21 102 155 195 246 103 118 85 116 75
5093G5n3N5n7L2K2M9L8q2J39m7q5j8k9Q9k1o9J19q0N1M5j11l4R1P2j10K8mq5O8o1K64k5j12
$$ 75 22 77 20 52 74 123 161 79 218 171 86 68 39 128 107 38 157 77 128 173 62 28 119 191 81 109 105 20 88 27 291 266 154
4680A54oj15o%P0Nl5J4k4J71K3q6N8L0k4r3k4m6k6K7K5J2m6J04j17N6%pO2m2K3k9P4mQ3n2
$$ 154 148 33 27 27 97 102 67 81 57 228 251 165 223 253 229 136 112 66 40 67 92 104 58 162 45 101 101 94 156 114 137 108 182 178 261 209
4230B09N3Mj48L0n3O9j37O0N1M8o9J3N9N1p7N1j22o3K5l0J43m1j15M4R3m5k5K3PJ27j04O2
$$ 209 262 266 118 148 95 164 27 87 138 186 117 130 189 240 163 214 92 29 54 24 167 126 11 55 148 103 78 101 108 235 131 193
3829A93q1k2L6Q6k3O6q9j08mO2J36j39O6lj24K8m5O8k9JJ35j44R7j09O5L9o6K2j5N8N6j48
$$ 193 112 90 126 212 189 255 166 58 54 116 252 113 179 176 52 80 35 103 74 75 210 66 163 54 119 158 92 114 99 157 213 65
3428F5J23L6j05l7K4n1J66j16J15j03n0L3j0J06j27J20rL0J10j99J8R6O1l9p0q5Q1J20pK5
$$ 65 188 224 119 82 106 55 221 105 220 117 67 100 90 196 69 189 180 210 320 121 139 235 296 257 187 102 183 303 296 321
3053C21R4j19J26J51O2j77O73k9L51Q41m49j062l44J32j39J06J03k4J73J11N68Q52M87o0q32
$$ 321 415 296 422 573 635 458 1131 1102 1453 2294 1845 783 439 571 432 538 641 617 790 901 1469 2321 2808 2748 1916
2740A916j115n38J29J10J66L80N10O77P67P405j832n428j083o67j23l93j70l7J0j6j28j75
$$ 1916 801 263 392 502 668 1048 1558 2235 3002 10407 8575 3147 2064 1397 1274 881 711 674 684 668 540 365
2464C65J0N3L9J06j80j36N4p6J73r7q9J63r9p3r0J40j3J59n5r4r3j01N9K8o2K9P3O3Kj53m0
$$ 365 375 428 467 573 393 257 311 235 408 311 222 385 286 213 123 263 250 409 354 260 167 66 125 153 91 120 193 256 258 105 65
2076F5RJ00L3M1rN5m2K3j17j04R5J9Q2j70J58L3r5l3J1Q5r6J5J51p6j24j0N3K6n6K3RR2r2
$$ 65 74 174 207 248 239 294 252 275 158 54 149 168 250 80 238 271 176 143 154 239 143 158 309 233 109 99 152 178 122 145 154 246 154
1663A54Q9k8j55K01q4j39J59R4j67N7M4j8J39k21J6n1L4r9J70n5Nj03JO4J25k1j22R6j8q1
$$ 154 243 215 60 261 177 38 197 291 124 181 225 207 346 125 141 90 124 25 195 140 145 42 43 107 232 211 89 185 167 86
1287H6OK04r2p2m9m8M2J16l3k6M7R3j10K7n6N9p8op1K9K1K3j5N3J5L2n7M8Lk8r3k3J0j0M0
$$ 86 92 296 204 132 83 35 77 193 160 134 181 274 164 191 135 194 116 110 39 68 89 112 97 150 165 197 140 188 191 163 70 47 57 47 87
849H7n6J42j9m2KK6J23p3j8M0l4Qn6r2L8K8r7R1kk6L7Q4q8n9L7K1j3o0kJ7L1R8k2p0O8q1Q
$$ 87 31 173 154 112 114 140 263 190 172 212 178 186 130 38 76 104 7 98 96 70 107 191 103 44 81 102 89 29 27 44 75 173 151 81 149 68 76
386G6L6Mm9K3Jk8l9K2K4Oj8nM1NJ7k1q6K7P4M6Rj6jl4K4n0rQ2n2pO7m5o6J3l6O9Jk6KOk0K3
$$ 76 112 116 67 90 91 63 24 46 70 76 58 53 94 99 116 95 9 36 110 156 165 149 148 114 138 88 79 161 109 102 169 124 58 71 35 104 105 79 81 87 67 90
-140I0L2q0PM7K4N7M4o5q2N4JL6j52K6J07P7j22k3j8k8
$$ 90 122 42 49 96 120 177 221 156 74 128 129 165 13 39 146 223 101 78 60 32
-390C2
##PAGE=	F1=1165.5
##FIRST=	23149.952173337649583,	6007.3700543999984802,	0.40194794535636901855
##DATA TABLE=	(F2++(Y..Y)), PROFILE
6007A6K5K1J1L9l2j9O8N0M5Ko0m3r8M4J3K7m0k8R1j9Ro4J33q9N2r2oL5j5L0J2o7k3M0MN4n0
$$ 16 41 62 73 112 80 61 129 179 224 226 166 123 25 69 82 109 69 41 132 113 122 58 191 102 154 62 56 91 76 106 118 51 28 68 72 126 76
5544G6J77n1m1m8Lm1m2OMO3K5r4J9O5N2j09rJj6mj4nL4O8K8Qr2K9K7R3l2j21L0o8P4l6j5l8
$$ 76 253 202 161 113 116 75 33 39 43 106 131 37 56 121 173 64 55 56 40 36 22 17 51 119 147 155 63 92 119 212 180 59 89 21 95 59 44 6
5068FL6nR6m7J04j84J22L2o9K2m3R0k2j08J74q6J5J28p0j37J7L0j4kQ7j40J05p8K18o6q2J1
$$ 6 42 37 133 86 190 6 128 160 91 113 70 160 138 30 204 118 133 261 191 54 71 101 87 85 172 32 137 59 277 211 129 140
4668A40j37K2J2M8Kl3N4q8J65K0lk5O2Ko1n0j19P6o5O3J4p4J64j31J3K5J7j2j5K6k4Q8j6Q4
$$ 140 3 25 37 85 87 54 108 20 185 205 202 177 239 241 180 130 11 87 22 85 99 25 189 58 71 96 113 101 86 112 88 176 160 244
4242B44n3R4Kj15J0q8l0m1P2rO4l4JR0J07p3%j66M8n0mN5Pn0n7Q4K1m4P2q4K36j95L7pl5L4
$$ 244 191 285 287 172 182 94 64 23 95 86 150 116 117 207 314 241 241 75 123 73 69 124 131 81 24 108 129 85 157 73 309 114 151 144 109 143
3791A43JM9N1o9j52k2R6J43r2K6n2q8J35m4l0m9L5Q2p0R8j28J41K8j09N7q4K9J22j73J40O0
$$ 143 144 193 244 175 23 1 97 240 148 174 122 34 169 125 95 46 81 163 93 191 63 204 232 123 180 96 125 247 74 214 274
3403B74n2j64O2m3N1J2O8l7j5N1j43Q2p5P6rL0J24j50k7P0O7j9l9q7M6J19K5J7J44j02J5K48
$$ 274 222 58 120 77 128 140 208 171 156 207 64 146 71 147 138 168 292 142 115 185 252 233 194 107 153 272 297 314 458 356 371 619
3003F19P3l96P48m8M48Q20m72r88k83P9k2M7J23r5J85J68M71R68O03q6q97j215o09K44K03
$$ 619 692 296 1044 996 1444 2264 1792 804 521 600 578 625 748 653 838 1006 1477 2445 3048 2962 2065 850 241 485 688
2690F88J52M48N44P49J072Q871k293o506j251q77p7l68k24j20Pkj10k18n2O8m0J16j32j82
$$ 688 840 1288 1832 2581 3653 12524 10231 3725 2474 1597 1520 1152 928 808 815 813 703 485 433 501 461 577 445 263
2389B63N8m0J79j4j36O8kok19JR5J10P3j26jj98L5P1l2j27P5R1R3j03j32m1J32RQ8k8O8m8
$$ 263 321 281 460 446 310 378 376 370 151 152 247 357 430 304 303 105 140 211 179 52 127 218 311 208 76 35 167 176 264 236 304 256
1988B56%m1p9LQ8j4j15P5R8l7o0j8M9L8o5J35mj89J18p4qn9P6n6J09p5P6J5j35K27m6k11N7
$$ 256 256 215 136 139 227 213 98 173 271 234 174 156 205 243 178 313 309 120 238 164 156 97 173 117 226 151 227 242 107 334 288 77 134
1575A34J84j09m4J58j40J53j52K3j51L6n7J37JJ2j40lQ1J31pj44M6K4l4p9J62k9l4m0j07L6
$$ 134 318 209 165 323 183 336 184 207 56 92 35 172 173 185 45 42 123 254 247 103 149 173 139 60 222 193 159 119 12 48
1200D8J44k1m7P7J60j28L6j95R2j03J2j0J21j61M7O9o4R8rj6O7j7pj3o8l5n5N9l7Q5M9m7l7
$$ 48 192 171 124 201 361 233 269 74 166 63 75 65 186 25 72 141 77 175 166 150 217 200 193 180 112 77 22 81 44 129 178 131 94
787I4j5J19Nm2Q0j07M5J6j10l2N5n4JK0j4L6P0j10m4M5O6J2n4J4m3K6J41l9j27N2m1OO2K7
$$ 94 79 198 203 161 241 134 179 195 85 53 108 54 55 75 61 97 167 57 13 58 124 136 82 96 53 79 220 181 54 106 65 71 133 160
361A60m5Rj4l9Pjj2Qo1OK4J1K5l0k5L4N3J17J3j03j5oj0ojO1Lr1R8n4o9Mj8R6J3%n2J03j74
$$ 160 115 124 110 71 78 77 65 73 12 18 42 53 78 48 23 57 110 227 240 137 122 116 106 100 99 160 163 72 170 116 47 51 33 129 142 142 90 193 19
-127A9R4J20p5p8nk1J5L9L9n1m4J7N3r8RQ1O9p9o6k3L5
$$ 19 113 233 158 80 75 54 69 108 147 96 52 69 122 24 33 114 183 104 38 15 50
-390E0
##PAGE=	F1=1071.15
##FIRST=	23149.952173337649583,	6007.3700543999984802,	0.311084747314453125
##DATA TABLE=	(F2++(Y..Y)), PROFILE
6007B7M1lj7O5K4o8O0J4M9J8n9k2r3L9k5N4p6L2Q8m4N3j42J44j01M0m4kN3q4N5N8k4n7K6j6
$$ 27 68 65 48 113 137 69 129 143 192 210 151 129 36 75 50 104 28 60 148 104 157 15 159 58 98 54 52 105 21 76 134 110 53 79 63
5569F3M9m0J84l5l6n2K1m7q7O8KJ1M0o8m6J43J2j48N7QORm3l6J6P5pK6l5Nj3R4j00p4L1j0
$$ 63 112 72 256 221 185 133 154 107 20 88 90 101 141 73 27 170 182 34 91 99 105 114 71 35 51 126 119 145 110 115 102 196 96 22 53 43
5118D3L8rj4K8K5k4O6j30R8j01L0N8j9K8l6L4M2j08J79k3o9J98k1j76q0n2R3n5J74j40J24
$$ 43 81 72 58 86 111 87 153 23 121 20 50 108 89 117 81 115 157 49 228 205 136 334 313 137 57 5 98 43 217 77 201
4730B01r4J28q3j05O8p4k7N8ql3j6R3p0J21j2P8r0N6K9k8o1r0R3j07O5L0q9J71j18J8k0N3
$$ 201 107 235 152 47 115 41 14 72 64 31 15 108 38 159 147 225 135 191 220 192 131 41 134 27 92 122 33 204 86 104 84 137
4330A37q0Q3r5k9J52m0P8j7Q8pp5J7p9r4K3Lk3O3j2J4J11J23J0q7j42N9o9N9j14P7J7p3K1
$$ 137 57 140 45 16 168 128 206 189 277 270 195 212 133 39 62 65 42 105 93 107 218 341 351 264 122 181 112 171 57 134 151 78 99
3917I9RJ8Q9j22K79j69o9O4m0M2r8Q3J6m1q9lK5R3n2N2q8m5J31Jq1L4p2O9p7J45j10J38J1
$$ 99 108 126 215 93 372 203 134 198 158 200 102 185 201 160 71 68 93 186 134 186 98 53 184 185 104 138 66 135 58 203 93 231 242
3503B42j6J1o6p0J94j88R4Q8Qj43L4j0o7j4J04j7J6Q2n6p5Qjl0O5R5j03o1J61Qpp8p8N7O9
$$ 242 226 237 171 101 295 107 201 289 297 154 188 178 111 97 201 184 200 282 226 151 159 158 128 193 288 185 124 285 293 286 208 130 187 256
3078B56P2l1J81l8j26K96L8n06Q76j13M61Q57n20r62j62Q9PK4K20j26J77J80M67R32Q10j77
$$ 256 328 297 478 440 314 610 648 142 1018 905 1366 2223 1703 741 579 668 675 699 919 793 970 1150 1617 2549 3359 3182
2752C182r60j326o74L40L55J74N59O56P83J549J1070l014q140j532j078j74l49k14j71j2k1
$$ 3182 2222 896 222 562 917 1091 1650 2306 3089 4638 15708 12694 4554 3022 1944 1770 1421 1207 1036 1024 1003
2489A003j07k09p8j4K0Q0j50j76p2oJ80M2j01%J9P4j25j74K0L3J85j63J13j65n8M1L1q1n7
$$ 1003 896 687 609 595 615 695 545 369 297 291 471 513 412 412 431 505 380 206 226 259 444 281 394 229 171 212 243 162 105
2126A05J10J10m6j03j09P2J3J17l6J03k8r5J3j9q0J88j34l4J6R0mkn9m1J66p6M2M9j47J63
$$ 105 215 325 279 176 67 139 152 269 233 336 308 213 226 207 127 315 181 147 163 253 249 247 188 147 313 237 279 328 181 344
1751C44j37j34j5Q7k5P7k5k1O2q6K51k3j99n3J80j6K0J51j90Q7j32L9j60om8P9R5j7o9Jk6
$$ 344 207 73 58 145 120 197 172 151 213 127 378 355 156 103 283 267 287 438 248 335 203 242 82 76 28 107 202 185 116 117 91
1362I1J48K5j19n7N2K4m3N9k6J7%j17j4J25K0q0O7K20q7N9l08O1l1l5J0J91j34j3P5j52J66
$$ 91 239 264 145 88 140 164 121 180 154 171 171 54 40 165 185 105 172 392 305 364 56 117 86 51 61 252 118 105 180 28 194
974A94m9L0J0K1qP4p0q8mk5Ol1J35k7o0o3N1P6o0J04j28J13P9j37m2j4J3q0L9J8j4M3m4j5
$$ 194 145 175 185 206 198 272 202 114 110 85 91 60 195 168 108 45 96 172 112 216 88 201 280 143 101 87 100 20 59 77 63 106 62 47
549D7k0P9M7J4k9r2K7J47%j89L9j2J7O2M7pj0n0l4L9l9J0l6k1J4j5R3n7k0J9J1QJ64Pj72j1
$$ 47 27 106 153 167 138 46 73 220 220 31 70 58 75 137 184 177 167 117 83 122 83 93 57 36 50 35 128 71 51 70 81 89 253 260 88 77
98G7M5m3K6J0L0P6j72J10kj20mj0J06J6NjJ15k28R5J70j8j89J9j1J3p3R3j9r4M6km4O3mJ03
$$ 77 122 79 105 115 145 221 49 159 157 37 33 23 129 145 150 149 264 36 131 301 283 94 113 102 115 42 135 116 22 68 66 22 85 81 184
-340A84p1n6k6K7
$$ 184 113 57 31 58
-390E8
##PAGE=	F1=976.794
##FIRST=	23149.952173337649583,	6007.3700543999984802,	0.23753431439399719238
##DATA TABLE=	(F2++(Y..Y)), PROFILE
6007C3L9pl9P8P7j19O3lQN6o2J0o2J5o6R3o5k7P1m0J07j17P8q2M5Lm6P9o5j1J04K1n4Jn5L9
$$ 33 72 65 26 104 181 62 125 122 130 186 124 134 72 87 21 114 49 22 93 53 160 43 121 39 84 87 41 120 55 44 148 169 115 116 61 100
5557A00m6J76k7l6l5L4j6p1M7qpJ8j9q1J42j7j33Q1L1K5O1q7o2P9j6k9oM8L3q3L6q2K5m8M9
$$ 100 54 230 203 167 132 166 150 79 126 118 111 129 110 29 171 154 21 102 133 158 219 132 70 149 133 104 98 146 179 96 132 50 75 27 76
5118G6l3M3m3Q7L0m3J8l7m4m4Q2q%j6l4L9J15j10J18N8j51K36L2j76j04K3j5k7J42q6J24j12
$$ 76 43 86 43 130 160 117 135 98 54 10 92 84 84 68 34 73 188 78 196 254 103 339 371 195 91 114 99 72 214 128 252 140
4718A40O5p6j8Qm0n1O4n3rMM8m4J09k8J16j00%K7Rn6n5R4r3O6kr0J66j00N8o4N7j24J38q1
$$ 140 205 129 111 119 79 28 92 39 30 34 82 38 147 119 235 135 135 162 171 115 60 154 61 127 125 35 201 101 159 95 152 28 166 85
4292H5ON1n4L8Q1M7po6M0n7m7l0m3K5M0k1k5J60J27O9j54j11Qk9J29k09J12J0j2O9j05L8J02
$$ 85 91 142 88 126 207 254 247 181 221 164 117 87 44 69 109 88 63 223 350 419 265 154 162 133 262 53 165 175 163 232 127 165 267
3879B67j31K65r2j31O3l6O3r9M3n4K3m7RPm4j3Q4n4J7l9Q2j30J45j07O2q6J10l4M2J3P6Oo9
$$ 267 136 401 309 178 241 205 268 169 212 158 181 134 143 150 106 93 177 123 140 101 183 53 198 91 153 67 177 143 185 198 274 280 211
3466B11k7J18j44k2J33N5r6mJ0N0j12KL4j1P1M8k4l1n5q5J07Q5l3j70K19K1L9k7k11O3M6Q1
$$ 211 184 302 158 136 269 324 228 224 234 284 172 174 208 197 268 316 292 261 206 121 228 313 280 110 329 350 389 362 151 214 260 341
3065C41J7J29l7o2K80r5l78Q86j67L94R13n16r97p7J23J0p9K99j0J45J74N12Q64R87k17j034
$$ 341 358 487 450 388 668 573 195 1081 914 1308 2221 1705 708 631 754 764 685 984 974 1119 1293 1805 2669 3656 3439 2405
2740B405j420o87K93N20K17O46Q89Q32J903J3433l614j0000j894j191l67l07k63j80Pp9p3
$$ 2405 985 298 591 1111 1328 1974 2863 3695 5598 19031 15417 5417 3523 2332 1965 1658 1395 1215 1222 1143 1070
2477A070j85j05j20R0J09j14k13j04j46J68N7n0j6jJ04Nj32j80PJ89j78J08m5p1k8O5o2q2
$$ 1070 885 780 660 750 859 745 532 428 282 450 507 457 441 440 544 549 417 237 244 433 255 363 318 247 219 284 222 140
2126A40J25P8j5p0j01n0J2J25m7J78k2j52jO3j46K11j01o9M2N3m7P8p3m3J24K6j12O8p6J50
$$ 140 265 343 328 258 157 107 119 244 197 375 353 201 200 263 117 328 227 158 200 253 206 284 211 168 292 318 206 274 198 348
1751C48p5j80N8j13R1O5K2j09O2q3K67L6j78o5N8N5J66J14j53l4j08Rj50ko6k1J63k3m4M0
$$ 348 273 93 151 38 129 194 216 107 169 86 353 389 211 146 204 259 425 539 386 352 244 253 103 101 35 14 177 154 110 150
1375A50r8J34N4n9j56M9P2PN5q5J4O5o9q7P6N9p4qK23J5Q0k98p3J20p0m6K00o0k2J7j00J52
$$ 150 52 186 240 181 25 74 146 153 208 123 137 202 133 46 122 181 107 99 322 337 417 119 46 166 96 50 250 190 168 185 85 237
974B37l7K0k8K4l8J28n3r9L3n8Lr2J68j0o1o4l9J16m7O9j05J53J29j57k6j39R8k0k3J3q0R
$$ 237 200 220 192 216 178 306 253 154 187 129 132 40 208 198 137 73 34 150 103 172 67 220 349 192 166 27 125 105 82 95 15 24
574B4N4J2jm9P5R2o9r7j0J18R7j39p6L7K9J8M3L5Or6m0R4j09O8l1n8N3m7J31o1MJ0j2m4J52
$$ 24 78 90 89 40 115 207 138 41 31 149 246 107 31 68 97 115 158 193 199 103 63 157 48 116 85 27 80 33 164 103 107 117 105 61 213
135B13Qj74k4R6m5L5K1k8J36j75O3R3j48mm0Q0mj5R9R0k21R7J58O2k78P2j3Po1J8Mn2O9j1
$$ 213 221 47 23 119 74 109 130 102 238 63 126 219 71 67 27 107 103 88 187 277 56 153 311 373 95 167 154 161 100 118 122 70 139 128
-290A28r7Q1n2J47p7k2n2j2
$$ 128 31 112 60 207 130 108 56 44
-390D4
##PAGE=	F1=882.44
##FIRST=	23149.952173337649583,	6007.3700543999984802,	0.15471214056015014648
##DATA TABLE=	(F2++(Y..Y)), PROFILE
6007C9L2j0PK6R9r9L9J5o4O3q9R5k9l5l6O3K6o2m3K9N5l7M5q9K0K1j6P7lm8J12L5m0j8r3j7
$$ 39 71 61 68 94 193 94 133 148 84 147 58 153 124 89 53 116 142 80 37 66 121 84 129 40 60 81 65 142 139 91 203 238 198 180 87 70
5557G0n0J34K3m6j3L5O1p3k2k7J8j0M3q8Q9j7j08P2M3M7J21q4j12J18o0k6k9P7N8j86K7j4
$$ 70 20 154 177 131 118 153 214 141 119 92 110 100 143 55 144 127 19 91 134 181 302 218 106 224 164 138 109 186 244 58 85 71
5156G1M9m4K7o2N1q4J00N1k4l6O4N9j47P8J2p5m3L9J4R4q2J8R8j82K26Q9j18j58J16j19Q0
$$ 71 120 76 103 41 92 8 108 159 135 99 163 222 75 153 165 90 47 86 100 194 112 130 228 46 272 361 243 85 201 82 162
4768A62L4l1J38j23M4j52J21k2o7j8J5q5P1mk4L4L1K7J00p2n3o4N4Nm5Q1q3J15m1p3J08q2
$$ 162 196 165 303 180 224 72 193 171 104 86 101 16 87 83 59 93 124 151 251 179 126 62 116 121 76 157 74 189 148 75 183 101
4367A01R0n1K5r5O9J2K1k3Ql8Q9P3J7r1L0k9j6m3r4N5M3Rr6J11J95J13j82j25q3K3K12k25
$$ 101 191 140 165 70 139 151 172 149 157 119 208 281 298 207 237 208 192 149 55 110 153 162 66 177 372 485 303 178 95 118 330 105
3967A05J15o6N1J88j45m3J32j12J83j3r2j3m1Q2p4K7r7O3nj2K4k03J09K3J0O7j91J41j06J04
$$ 105 220 154 205 393 248 205 337 225 408 395 303 290 249 331 257 284 187 250 245 233 257 54 163 186 196 263 72 213 107 211
3591B11kl2J2K1J9p9R4L5J00j27R7j0p3k23K12Q1j2l7J0J20l1j62J11k9lM4J19l7l8j72N2
$$ 211 209 177 189 210 229 150 244 279 379 252 349 339 266 43 255 336 324 287 297 417 386 224 335 306 303 347 466 429 391 219 271
3203B71J12M2j35J25L8Q6R3k63m0O0K8J13J29j04J0L09m9o16J008j31L68R53m79j067L4J25
$$ 271 383 425 290 415 453 539 632 369 329 389 417 530 659 555 565 874 825 209 1217 1086 1454 2407 1928 861 895 1020
2877A020Q0j74K35J29J65K38N41R06J025l59j326j652K0K77P09M10Q23J395J500L545K0649
$$ 1020 1100 926 1161 1290 1455 1693 2234 3140 4165 3806 2480 828 848 1125 1834 2244 3067 4462 5962 9507 30156
2614C0156n442j6029l245j673q13m07m37k69j2j96r0j67j47k02QJ23J0k79l3k48K3Q4r3K2
$$ 30156 24714 8685 5440 3767 2954 2547 2110 1841 1829 1633 1543 1376 1229 1027 1035 1158 1168 889 856 608 631 715 622 644
2314F44k2J4J14l3k53LJ10r1j11O9o2qP6j03n7K6J61Nq4q9r0j2Q7p3K23J4j41l7N7o0L0O8
$$ 644 622 636 750 717 464 467 577 486 375 444 382 374 450 347 290 316 477 482 398 309 219 207 294 221 444 458 317 280 337 277 307 375
1913C75j92J12N3r6Q3o9M3n7J55r7n5k1M9L2q8O6j56JJ16J8o5Mr8K34J13j04j24j0oL06J08
$$ 375 183 295 348 252 335 266 309 252 407 310 255 234 283 315 227 293 137 138 254 272 207 211 113 347 460 356 232 222 216 522 630
1525F30o9k02n6r5j54M2PJ9o4J28j40R8n1j6J06Nr1nK4K7J12n4q8R4J3r1r9R7%p1J02J30J33
$$ 630 561 359 303 208 54 96 103 122 58 186 46 144 93 77 183 188 97 92 116 143 255 201 113 207 220 129 30 127 127 56 158 288 421
1112D21k14j51J45n4p8J47Oj2Jj07J54K2l1N3n4l3J06l4q1L3j7m7q3J38%o4k4r1J60j7j6p8
$$ 421 207 56 201 147 69 216 222 210 211 104 258 280 249 302 248 215 321 287 206 239 222 175 92 230 230 166 142 51 211 194 178 100
711A00R9J87j39l9j40O5O2n0l4m6J1oO4L6j08jJ45r4j1J1o0K31n7j89N2L5n7RO4P1j29p3J86
$$ 100 199 386 247 208 68 133 195 145 111 65 76 70 134 170 62 61 206 112 101 112 52 283 226 37 89 124 67 76 140 211 82 9 195
298A95j22N7j4q3N1L7nJ3j2L4j9m7L8O1j33K4L7jj2K9p3J56j07k6J76r7j6r6L8k4k7J50M1
$$ 195 73 130 116 33 84 121 116 129 117 151 132 85 123 184 51 75 112 111 99 128 55 211 104 78 254 157 141 45 83 59 32 182 223
-115B23j51P9J12J40k97J15k0K0q3l3K2k7R8L9j44J5n5J49n1nr3l2
$$ 223 72 151 263 403 106 221 201 221 138 105 127 100 198 237 93 108 53 202 151 146 53 21
-390B1
##PAGE=	F1=788.086
##FIRST=	23149.952173337649583,	6007.3700543999984802,	0.24022693932056427002
##DATA TABLE=	(F2++(Y..Y)), PROFILE
6007E0L5l1O3KO4l7L0M2r6j9n4J76n1p7J6k3J40k4j8j1j27Q4M9j47pN7J3O9L8m8J15N2o0m0
$$ 50 85 54 117 119 183 146 176 218 122 103 49 225 174 97 113 90 230 206 188 177 50 134 183 36 29 86 99 168 206 158 273 325 265 225
5582B25q6p9K6M0R7q3l7M1J29r9j13m3Q6j9R8m7Q%j25O8L4O1J68l0j71J15o8j8QP2K4k22R8
$$ 225 139 60 86 126 223 140 103 144 273 174 61 18 104 85 183 136 144 144 19 87 121 182 350 320 149 264 196 178 186 258 282 60 158
5169A58q8R0J6J5m2%p1J8L6Rr1J37J81k23N8M8j30K7R2j50J22j2j36R5o1J42J23m2l02K24
$$ 158 70 160 176 191 149 149 78 96 132 141 50 187 368 145 203 251 121 148 240 90 212 200 64 159 98 240 363 321 19 243
4793B43j69J75Lp0J67j06M7k02J51rj21M3l2l0N6mj4N5oN6N6n1o5j09j0J25pJ8q4J66l0l2
$$ 243 74 249 252 182 349 243 290 88 239 230 109 152 120 90 146 142 128 183 177 233 289 238 173 64 54 179 172 190 106 272 242 210
4392B10J1q6P8nJ7n1kM8oK3N1j8p3J77M1j01j4j5om3q3N2ON6o3r8L13J82j99j91j8o1K79j86
$$ 210 221 135 213 208 225 174 172 220 214 237 288 270 197 374 415 314 300 285 279 236 153 205 211 267 204 106 419 601 402 211 193 132 411 225
3967B25Q6r5l2L50j46j07J57q0J10j8J8q1n7N9n5J8omK2k7K6j71J18jj4J03j08R3o7q7J48
$$ 225 311 216 184 534 388 281 438 358 468 450 468 387 330 389 334 352 346 342 364 337 363 192 310 309 295 398 290 383 316 229 377
3578C77j13O2P1l1q3J49o0J85j49J29m7p3k04J73L6M9Pj4P5P4j68J16k7Jm8J83j4kj83k8J01
$$ 377 264 326 397 366 283 432 372 557 408 537 490 417 213 386 422 471 478 464 539 613 445 561 534 535 487 670 656 654 471 443 544
3190E44Q5n1J34NR1J56k47j05J22J0Q2K59j59J9L05P2q20J125j49M24Q62o08j069K09K01J39
$$ 544 629 578 712 717 808 964 717 612 734 744 826 1085 926 945 1250 1322 502 1627 1478 1902 2764 2156 1087 1296 1497 1636
2865A636j09J77J44K32L35O57R17P75r23j961j212J263M01R89P35J284K073K596P414L5104
$$ 1636 1527 1704 1848 2080 2415 3072 3989 4764 3841 1880 668 1931 2332 3321 4056 5340 7413 10009 17423 52527
2614E2527j0141k7233n802k800j441q35o46m27j01l72k32k17k13k26j19L2K8k84m6k60nL6
$$ 52527 42386 15153 9351 6551 5110 4275 3629 3202 3101 2729 2497 2280 2067 1841 1722 1754 1782 1498 1452 1192 1187 1223
2339A223j89P6m4q0J14jk47J5N6o3j97L8p2M9Q5r7j00p4K34N4j37j11k6k1K5j6J64K9j53N
$$ 1223 1034 1110 1066 986 1100 1099 852 867 923 860 663 701 629 678 763 666 566 492 726 780 643 532 506 485 510 494 658 687 534 539
1963E39m5L5p5J23k54J80M3p8K9p7R4j16J24M1j69oo4J9RR2j17r5J68m2k4Kj10K48J06k4j88
$$ 539 494 529 454 577 323 503 546 468 497 420 514 398 522 563 394 388 324 343 352 444 327 232 400 358 334 336 226 474 580 556 368
1575C68Oj08L56N9Jl91K3j69K6j08J69N4j40J61j05l0L8r1Q4Lk0N2j7m2J48J4r8QO2o4j20
$$ 368 374 266 622 681 682 291 314 145 171 63 232 286 146 307 202 172 210 119 203 206 186 238 221 179 327 341 243 251 313 249 129
1187A29l6Q0Op0R4J91j03j57Q3Rq5J20Nk1N1j33R3J15j16J69j31K2O8l9p6K4L9q6j11J40J5
$$ 129 93 173 179 109 203 394 291 134 217 226 141 261 266 245 296 163 256 371 255 424 293 315 383 344 268 292 331 245 134 274 289
799B89j00L6j34K27qp8q1L9K04r0p6n8j7J16o5p5M5Rj22J32P2q7l1M6j07P8P6o0J60j5j89
$$ 289 189 225 91 318 310 232 151 190 394 304 228 170 153 269 204 129 174 183 61 193 265 178 147 193 86 164 240 180 340 325 136
411A36J3j1n7Rk4J69j67L6J46q0lk3l1k7J57j46O9o5P3j7k0j10J66j36R6l1N8j18P3k3Q8n6
$$ 136 149 138 81 90 66 235 68 104 250 170 167 144 113 86 243 97 166 101 174 157 137 27 193 57 153 122 180 62 135 112 200 144
10A44%J15%m6j40L8L5J8nl9k0J1Q2J89k37J13K0O4j43r7N2k6J14Q1j61m7rN8Lrj28L2
$$ 144 144 259 259 213 73 111 146 164 159 120 100 111 193 382 145 258 278 342 199 102 154 128 242 323 162 115 106 164 167 158 30 62
-390F2
##PAGE=	F1=693.732
##FIRST=	23149.952173337649583,	6007.3700543999984802,	0.26407709717750549316
##DATA TABLE=	(F2++(Y..Y)), PROFILE
6007F6L6n7J03K1KNM1N2j10q0N5J68j10p2M5j26K33L1j0m3k05J48M6k10N0N5k6P4N2n3J19
$$ 66 102 45 148 169 171 176 217 269 159 79 134 302 192 120 165 39 272 303 293 250 45 193 239 29 79 134 108 182 234 181 300
5619C00Q1j02o7l8p8N0O7P5j09o4N0J17j14j44M0M5pJ20J4n4k3p8J3N4L9J86K6j99O6p6JL9
$$ 300 381 279 212 174 96 146 213 288 179 115 165 282 168 24 64 109 102 222 236 182 159 81 94 148 187 373 399 200 266 190 191 230
5219B30J02n1j57Q4j47J30Q2Pn4jq5J2k4jp2J37K52k64O0N7j37P9J13k49J97qk48R7L7J41
$$ 230 332 281 124 208 61 191 273 280 226 225 140 152 128 127 55 192 444 180 240 297 160 239 352 103 300 292 44 141 178 319
4843C19Q7k0k98J54j38J90M2j53J67o8P9j55P3pj82J00n7J0M3J3K2K9L4KM5p0m8n2q6J69L4
$$ 319 406 386 88 242 104 294 336 183 350 282 361 206 279 272 90 190 133 143 186 199 221 250 284 286 331 261 213 161 75 244 278
4455B78l3p2J71qQl7r9RN0L8k6k0M4o0Q4P4%k15K49O9j01m4j2j0n9k2N6m7P6m5j40K97K21
$$ 278 245 173 344 336 344 307 208 217 267 305 279 259 303 243 327 401 401 186 435 504 403 359 347 337 278 256 312 265 341 296 156 453 674
4042F74k18k14R4j21K85j44M4n4k00M71j56r5J53p9J05r7J19r2n9ml2j7J42q6Rnpr6R6L0q7
$$ 674 456 242 336 215 500 356 400 346 146 617 461 366 519 440 545 448 567 475 416 412 380 363 505 419 428 423 416 320 416 446 359
3654C59J32k2Q5p1k19K37j34O2J50j03k7J50p1J65j26J01o3q2j42J86j1K5Q3m2L6J01j09J06
$$ 359 491 469 554 483 264 501 367 429 579 476 449 599 528 693 567 668 605 523 381 567 556 581 664 622 658 759 650 756
3303G56m2J8m4J46oj1j21p1M6J34J3J82k8P8J57k13j28J94K4lL63k16J25J98P1o21J095l19
$$ 756 714 732 688 834 828 817 696 625 671 805 818 1000 972 1050 1207 994 866 1060 1084 1081 1444 1228 1353 1551 1622 1001 2096 1777
2952A777M94N62q78q04L64L12J44LJ66J22K43L63P33P16J34j772k557K087J073L98J165R79
$$ 1777 2271 2833 1955 1151 1515 1827 1971 1974 2140 2262 2505 2868 3601 4317 4451 2679 122 2209 3282 3680 4845 5824
2677E824J705K529L518J1636M8792j5556l7391q156l854j975j286q03n18k00n42l65k84k93
$$ 5824 7529 10058 13576 25212 74004 58448 21057 12901 9047 7072 5786 4983 4465 4265 3723 3358 3074 2781
2452B781k18j86o7m1k48j04k52P2q3k37J00o9j06P4l7k31N4K1j00j86jq3Q3R3m7j66p5J77
$$ 2781 2563 2377 2310 2269 2021 1917 1665 1737 1654 1417 1517 1448 1342 1416 1379 1148 1202 1223 1123 937 936 853 936 1029 982 816 741 918
2101I18J12j73j20M0oo9J03Q9pj91P2j00N3p5O3k28K07J9o7J9q9Q8n9J7J28k26J3q2q6O1J13
$$ 918 1030 857 737 777 771 702 805 894 887 696 768 668 721 646 709 481 688 707 640 659 570 658 599 616 744 518 531 449 363 424 537
1713E37p5j20J97r8l5K9j36L11M3J8j89Qj24L35q0M3n39J65j3R2k64K44Q1q7N9l4j33J09m1
$$ 537 462 342 539 441 406 435 299 610 653 671 482 490 366 701 621 664 125 290 277 369 105 349 430 343 402 368 235 344 303
1350C03Om4jJ01J4j10J15N5n4n3N5n7k4j50O7P2l5l6J13kj64J14M1q4J31k2o9Q0j10K2J77
$$ 303 309 265 264 365 379 269 384 439 385 332 387 330 306 156 223 295 260 224 337 335 171 285 326 242 373 351 282 362 252 274 451
962D51j81K23j71N8O4n1q5L9M5r3j51J56M0j46Q5j24K39pj27p3O6J09m3r1J1o8J34q7o5J06
$$ 451 270 493 322 380 444 393 308 347 392 299 148 304 344 198 283 159 398 391 264 191 257 366 323 232 243 175 309 222 157 263
586B63Pk00J80R7p3k8p0j05J25J31nM3j1j13k4q6L1L5p6J60k09J15J13o7l4l3J6m8J95j50
$$ 263 270 70 250 347 274 246 176 71 196 327 322 365 354 241 217 131 162 197 121 281 72 187 300 233 199 166 182 134 329 179
211A79J9r4Q2j4Nj13J33j14J20p0J05j93J43kN4p8Q7lQ7r6j36O8P3J9j06j04N7J4R2J50j73
$$ 179 198 104 186 172 177 64 197 83 203 133 238 45 188 186 240 162 249 246 333 237 101 169 242 261 155 51 108 122 214 364 191
-178A91P4Q8R3j85j69Q7k5J07R1j52l4Oo3N5k5j13Q9
$$ 191 265 353 446 261 92 179 154 261 352 200 166 172 109 164 139 26 115
-390A15
##PAGE=	F1=599.379
##FIRST=	23149.952173337649583,	6007.3700543999984802,	0.19152538478374481201
##DATA TABLE=	(F2++(Y..Y)), PROFILE
6007G9L2p4J08N2l2nM8M5j24m6Q5J40j52k4M9j69K42P0j4p6j51J53K6k11N6M5o4P8O0q5J20
$$ 79 111 37 145 197 165 160 208 253 129 83 168 308 156 132 181 12 254 324 310 234 83 236 262 51 107 152 88 166 226 141 261
5619B61J07j39q3J3m7N1J03J9r4n8N0M3q7o6L7KKJ12P4q6p8kn3J15kJ60N2j74Pj01L3M2J47
$$ 261 368 229 146 159 112 163 266 285 191 133 183 226 139 73 110 112 114 226 300 214 136 134 81 196 194 354 406 232 239 138 171 213 360
5206C60j14r5K8j17J30J27k0p6K9q3qm1kL3N5K30k75Q8L5j02J07P5j83J97o6k49J12M1J66
$$ 360 246 151 179 62 192 319 299 223 252 169 161 120 118 151 206 436 161 249 284 182 289 364 181 378 312 63 175 216 382
4843C82J9l5k08N7p2J30Q3j88J14k9J32j23K6k2k08J16n6K1L9M9L8j0Q5r2R1j32qLj04J81
$$ 382 401 366 158 215 143 273 356 168 282 253 385 262 288 266 58 174 118 139 178 227 265 255 340 248 339 207 199 202 98 279
4467B79M3n1n1J37J4L4o2q1r3J13M8%m3M8p5Q7J03nk77K24J03r6n1jj6r4N5N7p4P1o8n0J93
$$ 279 322 271 220 357 371 405 343 262 169 282 330 330 287 335 260 347 450 445 168 392 495 399 348 347 331 237 292 349 275 346 278 228 421
4054D21J87k13j53J36r7K42j11MMk86M69j84l9J37j19J24j59J57m8m1p2Jp0K56j23l4O2o1
$$ 421 608 395 242 378 281 523 412 416 420 134 603 419 380 517 398 522 363 520 472 431 359 360 290 546 423 389 451 390
3704C90m3O7P0j43J43M5P8r5k58K38j05O0J93j64L1J24k7O6q7Q3j11m7p6J94k3m9J43o6M8
$$ 390 347 414 484 341 484 529 607 512 254 492 387 447 640 476 507 631 604 670 583 666 555 508 432 626 603 554 697 631 679
3341F79O7n1R3o0j6L7P5Jo8lj06k5J97O1J78n2N9J26j64j22K31M2r2L55k56K91J9k1j56Q37
$$ 679 746 695 788 728 712 749 824 825 757 754 648 623 820 881 1059 1007 1066 1192 1028 906 1137 1179 1087 1442 1186 1477 1496 1475 1319 2156
2965B156n13M97J38j070k39L89L52J18P4J17R8J65K78N99L35n58j689J217J582K69K11J048
$$ 2156 1643 2140 2278 1208 969 1358 1710 1828 1902 2019 2117 2282 2560 3159 3494 2936 1247 2464 4046 4315 4526 5574
2690E574R81J741K404L942J3841N3042j8569m0290q885m118k131j450q14m67k75o17l85k99
$$ 5574 6555 8296 10700 14642 28483 81525 62956 22666 13781 9663 7532 6082 5268 4801 4526 3909 3524 3225
2464C225l41j81j88j26p9k01j39k19J63k14k09R5q9r3M1q2j99R7J3j52j60%q0R0J02Kj92k5
$$ 3225 2884 2703 2515 2389 2310 2109 1970 1751 1914 1700 1491 1586 1497 1404 1445 1363 1164 1261 1274 1122 962 962 882 972 1074 1076 884 859
2114H59M5J50j65q2N6L3j83K43j0o0k03J21r1L0q0Lj25J58ko9N2q2K8L2o6J55k56M9n4j58
$$ 859 904 1054 889 807 863 896 713 956 946 886 683 804 713 743 663 666 541 699 697 628 680 598 626 658 592 747 491 540 486 328
1738C28O9J07j9j16J91j05p6N2j49L37j4K0j34oj07K79k35Q2m03K01J28N6l36K27J05m5l6
$$ 328 397 504 485 369 560 455 379 431 282 619 605 625 491 485 378 657 422 504 101 302 430 486 150 377 482 437 401
1400D01L5j86J71j4l7o7JJ10N7j53L0Q1lp1L7p0R2k35N8J05k7l6l9O8j58K02L0o8J20k3j22
$$ 401 436 250 421 407 370 303 304 414 471 318 348 429 426 355 392 322 414 179 237 342 315 279 240 308 150 352 382 314 434 411 289
1012B89N5n8pJ82j84J95j66N2O4m3q7O8lp2j72J55P6j61J00q4K01j2j53k8J07l2qn9M3j03
$$ 289 344 286 279 461 277 472 306 358 422 379 292 360 357 285 113 268 344 183 283 199 400 388 235 207 314 282 274 215 258 155
636A55J40j08nJ00J4k22J93J03n9l2j34p1J18J38N7o6k5J9p0j33R4K6o5J34k17J33Q6p3n0
$$ 155 295 187 182 282 296 74 267 370 311 279 145 74 192 330 387 321 296 315 245 112 206 232 167 301 84 217 303 230 180
273A80k1L8j5J61j38l3q4Q7j3K7p9N6m1Q4q3J26j62J39k1N1j19J55r1J40j53r6J13P0Pj33
$$ 180 159 197 182 343 205 172 88 175 162 189 110 166 125 209 126 252 90 229 208 259 140 295 204 344 191 95 208 278 285 152
-102A52n1k2J13J06P6j55K1J27R7k02k10J22k2P8P4j18L5qj61Q6m3n0R8
$$ 152 101 79 192 298 374 219 240 367 464 262 52 174 152 230 304 186 221 213 52 138 95 45 143
-390A43
##PAGE=	F1=505.025
##FIRST=	23149.952173337649583,	6007.3700543999984802,	0.18081612884998321533
##DATA TABLE=	(F2++(Y..Y)), PROFILE
6007H4K6p9P4P5k3n4M2L1j44Q4M2P7j51L0M0j10J52P0oj35n1J62pj49KK8o7O9P1j20J15J12
$$ 84 110 31 105 180 157 103 145 176 32 116 158 235 84 114 154 44 196 266 260 125 74 236 229 80 82 110 43 112 183 63 178 290
5607B90j57o4L0nO2R3l7m4n0L7k1k3k7K9poP4J19q8j10O2j14J69k3P3O3j05k8j03K8L7J73
$$ 290 133 69 99 94 156 249 212 168 118 155 134 111 84 113 106 100 174 293 205 95 157 43 212 189 262 325 220 192 89 117 154 327
5206C27j26p2l7m1J12J33n5j01O4m8n3l6Q7O9MJ28k56J23nm1J15qo6J52j35j72J12L4J63o2
$$ 327 201 129 92 51 163 296 241 140 204 156 103 67 154 223 227 355 99 222 217 176 291 283 217 369 234 62 174 208 371 309
4830C09n3r5NrN4Q6j59L4j1J79j04ll3j60O8k0pM4Q7K1l7J15j85J72k09M3N3q9J83Ok9m5Q5
$$ 309 256 161 166 157 211 297 138 172 161 340 236 233 200 40 108 88 81 125 212 233 196 311 126 298 89 132 185 96 279 285 256 211 296
4417B96L7L9q0k6j93J70L5L2p3K9m5O2J29j4k44J01J21q6l5J7J0j48J06N8q0O4j13O4Q7J04
$$ 296 333 372 292 266 73 243 278 310 237 266 221 283 412 398 154 255 376 290 255 272 282 134 240 298 218 282 169 233 320 424
4042D24j78n2R2oJ66q9j7N7k73L67j98kJ32j82J26j56J25K1lj16K6j05K87j10q0J50j02l5
$$ 424 246 194 286 280 446 357 340 397 124 491 293 291 423 241 367 211 336 357 354 238 264 159 446 336 256 406 304 269
3691B69K8J06j61J28Q0O7j27k12J68m1N9J93j78K9J04L9n3p1R9j80K1k6J69%j21J54p7Q1K7
$$ 269 297 403 242 370 450 517 390 178 346 305 364 557 379 408 512 551 498 427 526 346 367 341 510 510 389 543 466 547 574
3328E74j8P2n5j04J36qK1j25J18j35p8K28J06J17p1L8Q6j13q8K01O7j61K45k46L99j48j11
$$ 574 556 628 573 469 605 597 618 493 611 476 398 626 732 849 778 816 902 789 701 902 969 808 1053 807 1206 1058 947
2990I47L12M31n98M21j57j084L73K41K75Q8P0K4O2L8J22L17R9M14J061J200L96n93m1O76P44
$$ 947 1259 1690 1092 1513 1356 272 645 886 1161 1249 1319 1343 1405 1443 1565 1882 1981 2395 3456 4656 5052 4459 4418 5094 5838
2677E838J341J729L807J2684M5083j7397l4154p537l408j816j233o45k91l02n57k83k43l19
$$ 5838 7179 8908 12715 25399 70482 53085 18931 11394 7986 6170 4937 4292 4001 3699 3142 2859 2616 2297
2452B297j30j41j42l3j59j35j43K00k94j31Q4j00o6K7r3j47J19L6j70j62K4o4P5J13J4j53
$$ 2297 2167 2026 1884 1851 1692 1557 1414 1614 1320 1189 1273 1173 1107 1134 1041 894 1013 1049 879 717 741 677 752 865 879 726
2126G26L2q6J49j07j8J0Q0k57L46j08j06j68J28m9Oj13j8K0M7j6p5J09n1o2J07j01J57k72
$$ 726 758 672 821 714 696 706 786 529 875 767 661 493 621 572 578 465 447 467 514 498 423 532 481 419 526 425 582 310
1776C10R7j3j66L5Q4M8j01J38n9j00N0j46K94k4%n8k1q7J72l09J37m6R2J45jl46J65J22k8
$$ 310 407 394 228 263 347 395 294 432 373 273 323 177 471 447 447 389 368 281 453 144 281 235 327 472 471 125 290 412 384
1413C84q5Q4j92K11k3l6o4mR5Q9j51q8Q4L4o6L5q1J70k65Q4R2m3j4j30J01j10K25J7l6P6n
$$ 384 299 383 191 402 379 343 279 275 370 459 308 220 304 338 272 307 226 396 131 215 307 264 250 120 221 111 336 353 317 393 388
1024C88j43Mj3j7J47j36J32j28K2M9po6Q2p2j6j62J02J17j42P6l4J36k8j42M8J02j44RJ5L6
$$ 388 245 249 236 219 366 230 362 234 256 305 298 232 314 242 226 64 166 283 141 217 183 319 291 149 197 299 155 164 179 215
649B15j29J48j10O0L9K6j85J58R9n6l6j34j6Q5R4R8j28l6J42j13j30R5j1k8J24j79R1O6p3
$$ 215 86 234 124 184 223 249 64 222 321 265 229 95 79 164 258 356 228 192 334 221 91 186 175 147 271 92 183 249 176
286A76o1J8J1L6J16j25r5m0J01k0M7m1OJ7K9o9J16j09R9l8M6j41J72j28J69j71p5J64L5j0
$$ 176 115 133 144 180 296 171 76 36 137 117 164 123 129 146 175 106 222 113 212 174 220 79 251 123 292 121 46 210 245 235
-90B35j09%q3J70J04L8j35k1J13Q4j69j94J07k8L0M5n6J10k8k00Q6n1jQ3
$$ 235 126 126 43 213 317 355 220 199 312 396 227 33 140 112 142 187 131 241 213 13 99 48 47 130
-390A30
##PAGE=	F1=410.671
##FIRST=	23149.952173337649583,	6007.3700543999984802,	0.096208490431308746338
##DATA TABLE=	(F2++(Y..Y)), PROFILE
6007G8K5p7K1P8K0q5mK3RP6j4Mj22O0J2l7N3N2L9j74JJ48l4p0n8MPOO9m0M7O3j37k4L5QJ06
$$ 78 103 26 47 125 145 60 56 79 88 164 150 154 32 92 104 67 120 172 211 37 38 186 152 82 24 28 35 41 110 70 117 180 43 19 54 62 168
5544A68K5o4Ko4J0mL1k9K2Ok4NJ40p5p2P0j25J57jn2O4k8k6k6n6L9J59q7p9n0KQ4J11m9j56
$$ 168 193 129 131 67 77 73 104 75 97 103 79 84 224 149 77 147 22 179 178 126 190 162 136 110 54 93 252 165 86 36 38 122 233 184 28
5106B8Q4om0n1J85L5%Mk11J40m0J8J06o7qJ04j64o4P3M8J43j30m4k8k3M0L4M1j00j3k5J79
$$ 28 112 106 66 15 200 235 235 239 28 168 128 146 252 185 177 281 117 53 126 174 317 187 143 115 92 132 166 207 107 94 69 248
4705B48o9m0k9o8j0L2l2M2R0k5l4J22j97J99j88O6L4k9J49n6K1o7M0N2L2r1L0j83J40LO8p5
$$ 248 179 139 110 42 32 64 32 74 164 139 105 227 30 229 41 107 141 112 261 205 226 159 199 251 283 192 222 39 179 182 250 175
4305A75n3j1O8J16Jj44k2P9q4J1K3O6j65P6P2q2N2j03J12J6L0j39K1RR6R2q6rQ7j98K34j47
$$ 175 122 111 179 295 296 152 130 209 125 136 159 225 60 136 208 126 178 75 187 203 233 94 115 124 220 312 226 217 304 106 340 193
3904A93m8J43k03Q3j17N8P7L6j15K4r0K34o5j14K21j18k7m3J37j55J02P9O0j32j60Q5L6M8
$$ 193 145 288 85 168 51 109 186 222 107 131 41 275 210 96 317 199 172 129 266 111 213 292 352 220 60 145 181 229
3553B29J58j22n3R6J17j07j28J34k07N5J0J03N7j14O0p3J06K0j6N0rk14K02q0K6j26J79j15
$$ 229 387 265 212 308 425 318 190 324 117 172 182 285 342 228 288 215 321 341 325 375 366 152 354 274 300 174 353 238
3203B38j22J98J32M9o9KP0p8m5J13J11j88R5j95L98k27j44N56J43n52L32Q3l18j99k0J05P0
$$ 238 116 314 446 495 426 428 498 420 375 488 599 411 506 311 709 482 338 894 1037 485 817 900 582 383 363 468 538
2865E38lo7J0m2RM08Q03K414J495J50p85j192k47K41M10P44Q90L273Q932K9702j2818k2763
$$ 538 535 468 478 436 445 853 1656 4070 5565 5715 4930 3738 3491 3732 4142 4886 5776 9049 17981 47683 34865 12102
2589A2102m937k156j209q07l54q1k74l99j34j51k28p4q8j35N8j15j11l7J76k98o7Q2r1n3K3
$$ 12102 7165 5009 3800 2993 2639 2558 2284 1885 1751 1600 1372 1298 1210 1075 1133 1018 907 870 1046 748 681 763 672 619 642
2276F42n6q7J24P3j12k19L8m0M4J18j4p1O9j54J04j8L0n7J03k49L71j38j39j18R8Lj9j14n1
$$ 642 586 499 623 696 584 365 403 363 407 525 511 440 509 355 459 441 471 414 517 268 639 501 362 244 342 345 326 212 161
1913A61J44m9m2p9J60j2j20J20r1J67k82J36K6j02m5O7R0p9N5jp6L0j42J97J8pKm2m5J5k5
$$ 161 305 256 214 135 295 283 163 283 192 359 77 213 239 137 92 159 249 170 225 224 148 178 36 233 251 244 246 204 159 174 149
1525A49o4J57O4J12l2l40Q7J35l0q3J08j67K12n4Kl6m3Q9J07q6j50rN7o8O0q2J73j67R0K7
$$ 149 85 242 306 418 386 46 133 268 238 155 263 96 308 254 256 220 177 266 373 287 137 128 185 117 177 95 268 101 191 218
1150B18n1qj35J01j8J28K4%J8J7j17m4Pj5P9p3R8o9k9J4L8j0P2j16O5q8j5J09j09K3J4P8n6
$$ 218 167 159 24 125 107 235 259 259 277 294 177 133 140 125 204 131 229 160 131 145 183 173 245 129 194 106 91 200 91 114 128 206 150
736A50p6R5M8j47l3J05rj03J28q5Q9k9K1j05Q7R9p7l5q6K9N0N0Q6j06k4J82j37q1M9n1QJ13
$$ 150 74 169 217 70 37 142 133 30 158 73 162 133 154 49 136 235 158 123 37 66 116 166 252 146 122 304 167 86 135 84 92 205
336B05q9j4O7o6n6O8o4P5J03o4r7J2Rk7N4lJ6J3j4m0Q7p6M8k5N3j33J00j16J85o8r2J25j2
$$ 205 116 102 169 103 47 115 51 126 229 165 68 80 89 62 116 113 129 142 128 88 175 99 147 122 175 42 142 26 211 143 51 176 164
-77A64k8m9K9o7J13Q4J7n9l8O5O0o7q5l3n1k2J7L5J29m4j49L8k8QM7
$$ 164 136 87 116 49 162 246 263 204 166 231 291 224 139 106 55 33 50 85 214 170 21 59 31 39 86
-390H6
##PAGE=	F1=316.317
##FIRST=	23149.952173337649583,	6007.3700543999984802,	0.082073003053665161133
##DATA TABLE=	(F2++(Y..Y)), PROFILE
6007G1K4o7k2O5O6m1o9j2J49L0m3l4p2N7l0K4m8O1P6k2j05N5k9l6j3J4M5l1k6J02J4q7J6n9
$$ 71 95 28 6 71 137 96 27 15 164 194 151 117 45 102 72 96 48 109 185 163 58 113 84 48 35 49 94 63 37 139 153 66 82 23
5582B3P2n1J43n6k7Pq1j0J09j2l3j5K5Po9J05m6rL6r6R0N1m4m4J7j3N1p9J4J01l5q0L1l4N2
$$ 23 95 44 187 131 104 111 30 20 129 117 84 69 94 101 32 137 91 82 118 22 112 163 119 75 92 79 130 51 65 166 131 51 82 48 100
5143A00Q7J4j12m8nO4k7J39k5K9p2j15O7m7N8R1k2q6J15o9n8j5P7J15j22M0o8q1R9Rkn8No
$$ 100 187 201 89 41 36 100 73 212 187 216 144 29 96 49 107 198 176 90 205 136 78 63 140 255 133 173 105 24 123 132 130 72 77 71
4718G1P9j5n9J1m1j9J8J8J7L4q5NJ11MKk5N7o6K8R1j01O5q1J6M1L5p1J6o5L8k7R3k4j20j6
$$ 71 150 135 76 87 46 27 45 63 80 114 29 34 145 149 151 126 183 117 145 236 135 200 119 135 176 211 140 156 91 129 102 195 171 51 35
4280C5N8N0L6m4pQn2j8M4N3q5m0R6j1n4K3N4pqq4NM1N0L9n7pP5j24J58m9j24J17o5L2p7K5
$$ 35 93 143 179 135 128 136 84 66 110 163 78 38 134 123 69 92 146 139 131 47 52 93 143 182 125 118 193 69 227 178 54 171 106 138 61 86
3829H6L8m9n3jN4N7j9m0J60j21L4o9P3j30P3O9M1rj29j0O2mR8m1j13O7J73m1j86P8l7r2M3
$$ 86 124 75 22 21 75 132 113 73 233 112 146 77 150 20 93 162 203 194 65 55 117 113 211 170 57 124 297 256 70 148 111 19 62
3416F2QJ30N4j82n1Q4N3k0M3Q6j21K1J2j05K8NP9r4L5K3kno0Q7l6lKJ62n0q5q9K41m9l0K38
$$ 62 70 200 254 72 21 105 158 138 181 267 146 167 179 74 102 107 186 92 127 150 148 143 83 170 134 131 133 295 245 160 71 312 263 233 471
2978D71K80l26J92N26k27n98o9n6M0j26J33N5K83J89P78J367L016J349p84j752j678m79j00
$$ 471 751 425 617 1143 916 318 249 193 233 107 240 295 578 767 1545 2912 5928 7277 6493 4741 3063 2584 2484
2690B484Q7K57K59K725N389J5838p906j2949k674j097o53m95q8R1k20k10n8o1j28J1p8j05
$$ 2484 2571 2828 3087 5812 11201 27039 19133 6184 3510 2413 1760 1265 1177 1268 1048 838 780 719 591 602 524 419
2414D19Q2n7q6M6J60k28q3O3k2j04J6j1k2J14J17lk53jj8jJ15j8m7R5j30MP1M2o2O2j26K62
$$ 419 501 444 358 404 564 336 253 316 294 190 206 195 173 287 404 401 148 147 129 128 243 225 178 273 143 147 218 260 198 260 134 396
2013C96n9r7j34M0Q4n6Q8j94P4Pj9k5j6orj1LJ34o7o3L9J0m7N5jn0j7J5k3K1JJ7JM6ko3N0
$$ 396 337 240 106 146 230 174 262 68 142 149 130 105 89 83 74 63 66 200 133 70 109 119 72 127 126 76 59 74 51 72 73 90 91 137 135 72 122
1550A22J1J97k06P1M6J02pk70m6J12j3m8Q7j07J48n9K5J0j22R6J11Qq0j55N5l6K1n9J14M5
$$ 122 133 330 124 195 241 343 336 66 20 132 119 71 158 51 199 140 165 175 53 149 260 268 188 33 88 52 73 14 128 173
1175A73K2o5m4L0m1rL1J5M2L6l2L4l4j11QM2j4n2J30J9m8j13P4N0M6o7O0l5%lq6l3N8M9o2
$$ 173 195 130 86 116 75 66 97 112 154 190 158 192 158 47 55 97 83 31 161 180 132 19 93 143 189 122 182 147 147 144 58 25 83 132 70
736G0L1L6k2k8oM4o9M0L1n3O7n0k0l6K7R6p5o7nK3J9O0J5k5K7J15j30k2L9k8l0N7K2j43J03
$$ 70 101 137 115 87 81 125 56 96 127 74 141 91 71 35 62 158 83 16 11 34 53 113 128 103 130 245 115 93 132 104 74 131 153 10 113
298A13p1jN0m2LJ12J4l1j8p4L1%J2M6j9j9j7L7n9QJ5P7q6rJ9L9M1p5K6m6l1K2K5n8M1N1j1
$$ 113 42 41 91 49 52 164 178 147 129 55 86 86 98 144 125 106 89 126 67 75 90 167 81 72 91 130 171 96 122 76 45 67 92 34 75 126 115
-165A15P1l7L0K0J9J0j25q1M6L0rO6o4p2PK4Nq
$$ 115 186 149 179 199 218 228 103 22 68 98 89 155 91 19 26 50 55 47
-390D7
##PAGE=	F1=221.963
##FIRST=	23149.952173337649583,	6007.3700543999984802,	0.24641416966915130615
##DATA TABLE=	(F2++(Y..Y)), PROFILE
6007G1J6n1j9M0Q5k1m2KP8K6m7p8K3M0m1L3r1O4M9O8j02m2K8n7J5K0O4j9j11J73J5j55R1o9
$$ 71 87 36 17 57 142 121 79 81 159 185 138 60 83 123 82 115 24 88 137 205 103 61 89 32 47 67 131 112 1 174 189 34 125 56
5582E6O3o2J22q5M9j7l9J6J21p7m2o4O2M4p8J2MmOp1M0P1N8j05k4j5P3m8qK9nn2O1m6P1P8
$$ 56 119 57 179 94 143 126 87 103 224 147 105 41 103 147 69 81 85 81 87 16 56 127 185 80 56 41 114 66 58 87 82 30 91 45 116 194
5131A94K9q1j20lR0j5R0p4O2o1p7j0J5N4O7N0j84K04j0j15o1P4P8o3J06q0q7J14j03j5m5K3
$$ 194 223 142 22 19 109 94 184 110 172 111 34 24 39 93 160 210 26 230 220 105 44 118 196 133 239 159 72 186 83 68 23 46
4730D6L5oJ1k1K2j6nk7K6L3J1l4l4P0J03j38P1R9j09M9J8j03Q5n5j4L4L5l5l5j1Ol7Q9K7o7
$$ 46 81 75 86 65 87 71 66 39 65 98 109 75 41 111 214 76 147 246 137 186 204 101 186 131 117 151 186 151 116 105 111 74 163 190 123
4292A23K7q8lJ5L1J9M7J3j24J12o7m6l6N2R4q5nP0k7m7j3k0R3l9j2O0l9J0r5J45j0p9L3k1
$$ 123 150 62 59 74 105 124 171 184 60 172 105 59 23 75 169 84 79 149 122 75 62 42 135 96 84 144 105 115 20 165 155 76 109 88
3866H8R7q4M9M4j39M3n6R1n5j4N5P0j08L1K0m6m5mQ5j5J13p1k9J9o0K6l2J0j8J18K6q7o2N0
$$ 88 185 101 150 194 55 98 42 133 78 64 119 189 81 112 132 86 41 37 122 107 220 149 120 139 79 105 73 83 65 183 209 122 60 110
3441A10p7rJ7P2J75j78ko3NK7jJ72%j41J27l7l6o5J00m2P4j27J0n3Q7r2L1J2N6N7J74j07q
$$ 110 33 24 41 113 288 110 108 45 50 77 76 248 248 107 234 197 161 96 196 154 228 101 111 58 145 53 84 96 152 209 383 276 268
3028B68MJ82mk73O10j64Q9O23l21o63K2P0M9n8J98R0L04L27P96J789L442J271j149k340k090
$$ 268 272 454 450 177 787 623 712 1335 1014 351 373 443 492 434 632 722 1026 1353 2149 3938 7380 8651 7502 5162 3072
2715C072o83k62k07L5j03K603M348R738n739q895j854o93l90m34j03K11k17k3j32L0j21J14
$$ 3072 2389 2127 1920 1955 1852 4455 8803 18541 12802 3907 2053 1360 970 536 433 644 427 404 272 302 181 295
2439B95q7M6r6M4o8J1J93j07q3m4J18j21k2k4L0K0J55Qj65j7j0k2P2Q9j70J25n1j09R8M9j5
$$ 295 208 254 158 202 134 145 338 231 148 104 222 101 79 55 85 105 260 268 103 86 76 54 126 215 45 170 119 10 108 157 142
2051A42KJ3O6K4lj48j1J18l5J84j84j13J15O3j0j39J9L6o7J25q7R8p4q7L7nJ02j03nm8OJ4
$$ 142 144 157 223 247 244 96 85 203 168 352 168 55 170 233 223 84 103 139 72 197 110 208 134 47 84 79 181 78 73 25 31 45
1650D5NO6P7q7M4q0lL0J48J53j55qp1R6L6j90J6m7J7oK2m6O0j3RK5r2KQ3P4j7j02k3M9r5K6
$$ 45 50 116 193 106 150 70 67 97 245 398 243 235 164 260 296 106 122 75 92 86 108 62 122 109 118 143 51 53 136 210 193 91 68 117 22 48
1200D8J13Q3j9j43m2J07lp5jJJ8O7n3K1O2j64nR0K2r2R6P5J5r9l3M6jmRj0O6o5o9j2L8J4j6
$$ 48 161 244 225 82 40 147 144 69 68 69 87 154 101 122 184 20 15 105 127 35 131 206 221 122 89 135 134 130 139 129 195 130 61 49 87 101 85
736H5L2Ok7k3N0jm0P0K2m4K1n9m4J1lN3Mo8m0K3L9M2m1%O6M5r5J3P6no8k5Q2p9L3j9oj5L1
$$ 85 117 123 96 73 123 122 82 152 174 130 151 92 48 59 56 109 113 45 5 28 67 109 68 68 134 179 84 97 173 168 100 75 157 78 111 92 86 71 102
248A02o8N9N6J6l7r9R8k6mK2j7K7j2m9Pl1K4Q1o7O1K8j10O8m4k1j1L8KLo8L6l5PJ38m5L8j3
$$ 102 34 93 149 165 128 29 127 101 97 119 102 129 117 68 75 44 68 149 82 143 171 61 129 85 64 53 91 93 96 28 64 29 36 174 129 167 154
-215A54j2J17j27q8M4O3n9J3r9L1kM3Rm8
$$ 154 142 259 132 44 88 151 92 105 6 37 35 78 87 39
-390C9
##PAGE=	F1=127.609
##FIRST=	23149.952173337649583,	6007.3700543999984802,	0.23622813820838928223
##DATA TABLE=	(F2++(Y..Y)), PROFILE
6007G3ok1l9O5R7o4k3M0m6P1j4p0J01l1j6j4o8K3pQ7pp6L8mo9j3J24Pr6J34l0p8M3k5Jk8R2
$$ 73 67 46 7 72 169 105 82 122 76 147 133 63 164 133 117 103 35 58 51 138 131 55 93 89 20 7 131 138 42 176 146 68 111 86 87 59 151
5544A51o5J04k6l1RJ57j06o2n8R4J8j21K6k7K2rk4M8k6J05m6n8o8P2l2j2Jj6KL2l2J30P9l1
$$ 151 86 190 164 133 142 299 193 131 73 167 185 64 90 63 85 76 52 100 74 179 133 75 7 79 47 35 36 20 22 54 22 152 231 200
5118B00m8j10j5M9J1N3r1P8l7p8M5M2L1L0M2j41K02Mj53q5Q4L4m1J36m3j05J52j48Ko3K3K6
$$ 200 152 42 27 76 87 140 49 127 90 12 57 99 130 160 202 61 263 267 114 29 113 147 106 242 199 94 246 98 100 37 60 86
4718H6o5K2K0k6N6M2o4m0Q7M7l8m5NJ21j68Q3J55j10P1o4n7P4k9p2Q2rm7j3J1J4q5J16K5m6
$$ 86 21 43 63 37 93 135 71 31 118 165 127 82 87 208 40 123 278 168 239 175 118 192 163 91 173 164 117 104 115 129 44 160 185 139
4292A39N4j09N2q1Q2o4P6O0j52J64j08q6k1N6Q1Pm9J04j01r4K6LK3nPP0Mp4M8j4Qn8N1k2M1
$$ 139 193 84 136 55 137 73 149 209 57 221 113 27 6 62 143 150 101 205 104 10 36 39 62 57 64 134 138 64 112 98 106 48 99 77 118
3854A18m8O7O5o2N4j24J30q2qK2N3j07n3J31k7q9N0K6r8J18JJ7j0Pn6p0Q2K3n7O4JQk5m9j4
$$ 118 70 137 202 140 194 70 200 118 110 132 185 78 25 156 129 40 90 116 18 136 137 154 144 151 95 25 107 130 73 137 138 146 121 72 58
3416E8rK3J31l9n5J7k8l6J1O3J55k84J62N2l6Oj20L2J21k3O8o5K6L3j9j31MN7K41Mk4j52L33
$$ 58 49 72 203 164 109 126 98 62 73 136 291 7 169 221 185 191 71 103 224 201 269 204 230 263 244 113 117 174 415 419 395 243 576
3003E76K8m51P39n6l8P00k80o46k2K01Q1p8K53J66L27N76P52K488M651J452j852l179k748
$$ 576 604 153 892 836 798 1498 1218 572 550 751 832 754 1007 1173 1500 2076 2828 5316 9967 11419 9567 6388 3640
2715C640q82l46m76j32k47L064M016P299n650p297j539n57k91k78k47K89k37nj22N7N1ll3
$$ 3640 2758 2412 1936 1804 1557 4621 8637 15936 10286 2989 1450 893 602 324 77 366 129 124 2 59 110 107 74
2427G4K4j0rJR8j6o4n7rJ22K9l9R0k6LO4j77o4j1O8n7R5L5l7k0j6NM3l5o4MO2j2pO5j14l1
$$ 74 98 88 79 80 178 162 98 41 32 154 183 144 234 208 211 275 98 34 23 91 34 129 164 127 107 91 96 139 104 40 44 106 94 87 152 38 7
1963GO7K4J71j16j15O9Q8J6j27J01j5l9J65k70J97J9j30pn3J77j08Jn6n4R1J5L2L6l3Pj17
$$ 7 74 98 269 153 38 107 195 211 84 185 170 131 296 26 223 242 112 105 52 229 121 122 66 12 103 118 150 186 153 160 43
1575D3M6o6K09J40q3lj75M4L7j20Q5m6j2L7l7o6P4m5P5m0l1k8k1R0Ql9lK6m2PJ52O0jk14J5
$$ 43 89 23 232 372 289 286 111 155 192 72 157 111 99 136 99 33 107 62 137 97 66 38 17 107 115 76 73 99 57 64 216 276 275 61 76
1137G6O9N3o0%l6k9P6o3l3J11j32J5L3Q1p2l9J01R9n9r2M9q2K6KlJ19n2n3n3O8m3k8L7O4k7
$$ 76 145 198 138 138 102 73 149 86 53 164 32 47 80 161 89 50 151 250 191 99 148 66 92 94 91 210 158 105 52 120 77 49 86 150 123
699A23m2J1L9k7Q0O6k8l6j03n6R9p8M9K1o7LJ9M3J6n7l3N3L6o3L2J02Jq1o0M4qJ2K6k5Rnn1
$$ 123 81 92 131 104 184 250 222 186 83 27 126 48 97 118 51 54 73 116 132 75 42 95 131 68 100 202 203 122 62 106 98 110 136 111 120 115 64
236F4j8O5O2m8j12J12n%q8M6Q5J4j45R7p9KN0p1J33L7j31Nn7LO0N6j5Lk0K3o9O1M8o5O1Pj37
$$ 64 46 111 173 125 13 125 120 120 32 78 163 177 32 129 50 52 102 31 164 201 70 75 18 21 81 137 122 125 105 128 59 120 168 103 164 171 34
-228C4J91o0p4o2R0m7L1pj2k6L3K5q6
$$ 34 225 165 91 29 119 72 103 96 84 58 91 116 30
-390C0
##PAGE=	F1=33.2553
##FIRST=	23149.952173337649583,	6007.3700543999984802,	0.16015407443046569824
##DATA TABLE=	(F2++(Y..Y)), PROFILE
6007F5l5K5m5J02J06j50l2R4p9N9L2K7P9j12J1q9n4M0K3n9J47q5K2M3p7N7J6K7l8P0j61mL1
$$ 65 30 55 10 112 218 68 36 130 51 110 142 169 248 136 147 58 4 44 67 8 155 70 92 135 58 115 131 158 120 190 29 25 56
5594E6O6p0k6J32r1J40mp1MJ85p3p8n6J47n5j95J35j24J16l4j1O9j25R5Q5p9m5J3k6j4j3o
$$ 56 122 52 26 158 67 207 203 132 136 321 248 170 114 261 206 11 146 22 138 104 93 162 37 132 217 138 93 106 80 66 53 47
5194D7L4l6j3J71P5j40Pj8j03oO5M9p9O9p8L0j3Q8L1Nm9p3J56Q4j36j08O3j4m2J05L6j12J84
$$ 47 81 45 32 203 278 138 145 127 24 18 83 132 53 122 44 74 61 149 180 185 136 63 219 303 167 59 122 108 66 171 207 95 279
4780B79j15M6r9PK8j01R3Nj6m9J41q5r7J50N4j12L0p6Q8r5M7J82q5P8j27NM4k6j19J50j16
$$ 279 164 210 111 118 146 45 138 143 127 78 219 134 37 187 241 129 159 83 171 76 123 305 220 298 171 176 220 194 75 225 109
4392A09r3L2J08K8r0R8m9k0O3n6J02p3O6j08m4J22l2R7n4r0k6L0q4J55J9J09j96Mq9N7K8l6
$$ 109 16 48 156 184 94 192 143 123 186 130 232 159 225 117 73 195 163 260 206 116 90 120 36 191 210 319 123 127 38 95 123 87
3992H7R2j54J77j54J54n8N4j28N0J46j77RM7O1K4O4j29J39p0kj1j3j44L5J49K1j07O8k4l3
$$ 87 179 25 202 48 202 144 198 70 120 266 89 98 145 206 230 294 165 304 234 232 221 208 64 99 248 269 162 230 206 173
3616A73q0j2J78p4J05o5j00L0J37k28K02O1mL9j00j9Ml5p2J72n8j4L7k5O6j88L26j89O1M8
$$ 173 93 81 259 185 290 225 125 155 292 64 266 327 323 362 262 243 247 212 140 312 254 240 277 252 318 130 456 267 328 376
3240C76M9m5k0p8JR7R3L3l7J23P5j89m9J7J22K41p8k23M08P5m57R56k0j32P25m69m41L3L86
$$ 376 425 380 360 282 283 380 473 506 469 592 667 478 429 446 568 809 731 508 916 991 534 1490 1470 1338 2063 1594 1153 1186 1572
2877A572R8N5L41L72N90J027J395M073Q397K887l944o021n082j614o89q62n46k52M745L764
$$ 1572 1670 1725 2066 2438 3028 4055 5450 9523 17920 20807 16863 10842 5760 4146 3457 2595 2049 1797 6542 10306
2627A0306L594o804n801r93k11J79K16J22l76L32q2l3j8J44l0nj81Q0j67M0J70j77J7l4l9
$$ 10306 13900 7096 1295 302 91 270 486 608 232 564 482 449 431 575 545 540 359 439 272 312 482 305 322 288 249
2314B49q4J94LJ18On1L0k92J09j8L4r3Q7k22K50j93Q7R5K7k42J00L5p8j7N6NK1l9%Mq3R5j13
$$ 249 165 359 362 480 486 435 465 173 282 264 298 205 292 70 320 127 214 309 336 94 194 229 151 134 190 195 216 177 177 181 98 193 80
1901H0P2o2J02q4Q8J4k8J82k52J69O9j11M9l9J14j17j4lj11P1N2L0k32J47L4r8%l7J37J51
$$ 80 152 90 192 108 196 210 182 364 112 281 350 239 288 249 363 246 232 229 118 189 241 271 39 186 220 122 122 85 222 373
1525C73p3k1j52m3n0L3N2O3rP1q1q1O7j00J70j63l7O0J0Pon8J57k1K9m6K5J06N9k36Q4j14
$$ 373 300 279 127 84 34 67 119 182 173 244 163 82 149 49 219 56 19 79 89 96 90 32 189 168 197 151 176 282 341 105 189 75
1125G5J72j5K6j02N%j19L9k0rP9j9J9M3r3n9J91K0j15N9j25N3L7J0P5On7j63J65o8l8PJ22
$$ 75 247 232 258 156 161 161 42 81 61 52 131 112 131 174 81 22 213 233 118 177 52 105 142 152 227 233 176 13 178 110 72 79 201
711B01j19P4j34J54j20J38J26J2r9j37o6J87j77Q0k4NM6m1J4M8j36N5m0P3m2L4P1J8o3n1o1
$$ 201 82 156 22 176 56 194 320 332 233 96 30 217 40 120 96 101 147 106 120 168 32 87 47 120 78 112 183 201 138 87 26
323B6L0K1O0l5P7q8j3J6L1Q8l6j05M6K8%k3k2R8P8k33J47j34jpJ1N0N9m5J8o6o4O8O7j3OK4
$$ 26 56 77 137 102 179 91 78 94 125 213 177 72 118 146 146 123 101 199 277 44 191 57 56 49 60 110 169 124 142 76 12 80 147 134 140 164
-127A64K3j01N8K8o7M1L9o8M6K4l4o4j7K2K0M7k5n6JM7j05
$$ 164 187 86 144 172 105 146 185 117 163 187 153 89 72 94 114 161 136 80 81 128 23
-390B3
##PAGE=	F1=-61.0986
##FIRST=	23149.952173337649583,	6007.3700543999984802,	0.44890385866165161133
##DATA TABLE=	(F2++(Y..Y)), PROFILE
6007D8l3N3l7J19J16k14K4O0J7o9P6P7O0j53J2j30N1K7N8kL7q4K7L2n8J21n5lK0M8j12k1j1
$$ 48 15 68 31 150 266 52 76 136 153 84 160 237 297 144 156 26 77 104 162 160 197 113 140 172 114 235 180 177 197 245 133 112 101
5594A01N6po7J21j04R2L6j43N5J50Lp2n9J91j46j28J26o9O9n1k2O2j88J52J51j00jJl9k1n5
$$ 101 157 150 83 204 100 192 228 85 140 290 293 221 162 353 207 79 205 136 205 154 132 194 6 158 309 209 208 209 170 149 94
5206I4K5O1l9m6J77M8k61J00N0j05K4j7N1p4P9p7M9j00J61OQj82K9O7K27r1r8j1l0j0L3Q7
$$ 94 119 180 141 95 272 320 59 159 209 104 128 111 162 88 167 90 139 39 200 206 214 32 61 128 355 264 166 155 125 115 148 235
4805B35q5J72p5R2j25m3N3j11J49J0j3j86K18p5j12J84J4j91J57r1M6q0P9J39m9M4j74P0J
$$ 235 150 322 247 339 214 171 224 113 262 272 259 73 291 216 104 288 302 111 268 177 223 143 222 361 312 356 182 252 253
4442B53l3q8J50j96N7n3J44K2k1J2j63N5R5n2J77o4J8o0j11J35P9k8J6j19Kj9j00J79M5J34
$$ 253 220 132 282 86 143 90 234 256 235 247 84 139 234 182 359 295 313 253 142 277 356 328 344 225 227 208 108 287 332 466
4067D66k45L8j25N7J43j07J22j72J29j00R3M3P3j93JK54j63o9j9R5Q6J9j07J23l8l9Qj23p9
$$ 466 221 259 134 191 334 227 349 177 306 206 299 342 415 222 223 477 314 245 226 321 407 426 319 442 404 365 373 250 171
3704A71Q1J46L7j00O8j9Nn5o4J89j14J12J0j29o7K39k53K74J10p4P6j42nO3j14k3J85n9r0
$$ 171 252 398 435 335 403 384 389 334 270 459 345 457 467 338 271 510 257 531 641 567 643 501 496 559 445 422 607 548 458
3341D58L9O4O0j29K80j51N8Q0J1p3Q4j63mJ18J38L9NJ10J65k06K5J4J14K88j75q0L65N3l78
$$ 458 497 561 621 492 772 621 679 759 770 697 781 618 614 732 870 909 914 1024 1189 983 1008 1022 1136 1424 1249 1169 1534 1587 1209
2978A209J210o5r4O34j039O8J90O07J11K62N07O23J003J606K429O198J3477M863o383j0128
$$ 1209 2419 2354 2260 2894 1855 1923 2113 2720 2831 3093 3600 4223 5226 6832 9261 15459 28936 33799 27416 17288
2727A7288q510k695j298j380j098M30P266L553j417q409k437K49K1K6N3Kn61L55r6k06oJ45
$$ 17288 8778 6083 4785 3405 2307 2737 10003 13556 12139 3730 1293 1542 1563 1589 1642 1644 1083 1438 1342 1136 1130 1275
2452A275p3l0j78k4j51k7J29j35L8p9q5j03J58P2M4M5j36Pk49J06j4Qj24P2j14J46j81J12
$$ 1275 1202 1172 994 970 819 792 921 786 824 745 660 557 715 787 831 876 740 747 498 604 590 598 474 546 432 578 397 509
2101E09J14j8k74J69O9j43l6J47n9J9r8P8k7q6M1j85J77q5N4o9qQ8q6J59k12J59N8q6J31k3
$$ 509 623 605 331 500 569 426 390 537 478 497 399 477 450 364 405 220 397 312 366 297 289 377 291 450 238 397 455 369 500 477
1726D77Q2j71NPj17L4P3M2k43J39K6q9l7j1J70N9j06j34J3m5KL8j04J83KP6j02p5K3l8J45
$$ 477 559 388 393 400 283 317 390 432 189 328 354 265 228 217 387 446 340 206 219 174 176 214 110 293 295 371 269 194 217 179 324
1337C24j77K5J0L1L1J3j36K20J8Jr1j72K18R2j88J13k78K66QL3j24O8j18j17J50j02K3J02
$$ 324 147 172 182 213 244 257 121 341 359 360 269 97 315 407 219 332 54 320 328 361 237 305 187 70 220 118 141 243
987B43Kj51J91n9q4R4Q2j42L4o3O2M1mK7M5p0j62J60o2L5q3J08k12J99j26J53j34Q9J63M3
$$ 243 245 94 285 226 142 236 318 176 210 147 209 250 246 273 318 248 86 246 184 219 136 244 32 231 105 258 124 213 376 419
611D19j47j08p4K10j69N4q3R0L7r3m0J15j46R7m6L3Mk7j2R4n0j6k5J6LK7n3J06j85O8P1J5
$$ 419 272 164 90 300 131 185 102 192 229 136 96 211 65 162 116 149 153 126 114 208 158 142 117 133 136 163 110 216 31 99 170 185
211A85N7j8q2N1K2n1R8o6M0J49l47K05j04m4p4J12k3rP1O4r5r7Q2O8k2nK1N4j39O3K0k8n4
$$ 185 242 224 142 193 215 164 262 196 236 385 38 243 139 95 21 133 110 101 172 236 141 44 126 194 172 167 188 242 103 166 186 158 104
-203A04Q0J1n2O0LMl0op3Q7j3n5l0L1q8
$$ 104 184 195 143 203 206 210 180 174 101 188 175 120 90 121 33
-390C3
##PAGE=	F1=-155.452
##FIRST=	23149.952173337649583,	6007.3700543999984802,	0.46521836519241333008
##DATA TABLE=	(F2++(Y..Y)), PROFILE
6007D2kM6j6P2J34k14Q9J3K3j11J29O1L0j39qo9Q0KO4L5k5p3J9K8o1J43n9n5O4M1m1mn8j5
$$ 42 40 86 70 142 276 62 151 164 187 76 205 266 296 157 149 80 160 162 226 261 236 163 182 210 149 292 233 178 242 283 242 238 180 165
5582A65P1p0N7n3j4P7j42R7M1P4m9l9J92k20k5P5k5J2k1m3K2r9J78J03j13K8J4n7l0r0O7Q5
$$ 165 236 166 223 170 156 233 91 188 229 303 254 215 407 187 162 237 212 224 203 160 182 83 261 364 251 279 293 236 206 116 183 268
5181B68m5o1J47J9k86J56N2q9O5q4K8m2J04o7J0o7J54p1L6j53M2L0K45o7q9l4J2j9P0N3r1
$$ 268 223 162 309 328 42 198 250 161 226 142 170 128 232 165 175 108 262 191 227 74 116 146 391 324 235 201 213 194 264 317 226
4793B26J35k9J18j38r5N4j18J96K7n6j69J69m5j14J98m0j75K19q7M3j03J36P9m2kk03J45o2
$$ 226 361 332 450 312 217 271 153 349 376 320 151 320 275 161 359 319 144 363 276 319 216 352 431 389 387 184 329 267
4442B67m4oR1j37P8k3Q2LL2n3k14J32J18r4K40o4n4J7j25J54J27j33O2j46M4m8q5K03MJ48
$$ 267 223 217 308 171 249 226 308 311 343 290 76 208 326 232 472 408 354 371 246 400 527 394 456 310 354 306 221 424 428 576
4067E76k59K1j15N9K15j44J51j31J1l0N0J26O7k35j6K78j38j22q0J54J57m2j02J01j1q7K6
$$ 576 317 338 223 282 497 353 504 373 384 354 404 530 597 362 346 624 486 364 284 438 595 553 451 552 541 454 480
3729D80j95J9J03J03L8q1O5J1J6l9n5J68j37R4Q1j23j26K52k24L12J50j43N7j51L1J15j66
$$ 480 285 304 407 510 548 467 532 543 559 520 465 633 496 590 671 548 422 674 450 762 912 769 826 675 706 821 655
3391F55M3J89q8j39PJ62M0q0K65j39M0J28o9m0R6k04O2J24K11k5N0R6J69j79J13M5J74K05
$$ 655 698 887 799 660 667 829 869 789 1054 915 955 1083 1014 974 1070 866 928 1052 1263 1238 1288 1384 1553 1374 1487 1532 1706 1911
3040A911k90J33K53jr0J146j55PL85j525P65L21P50R6M42O30P85J286K014L111P632J6964
$$ 1911 1621 1754 2007 2006 1916 3062 2907 2914 3299 1774 2539 2860 3610 3706 4148 4778 5563 6849 8863 11974 19606 36570
2765C6570O015p809j3127j0995l447j808j805j438K071Q875K201p060m354r4m25l56j46r5
$$ 36570 42585 34776 21649 10654 7207 5399 3594 2156 4227 13102 15303 8243 3889 3795 3370 3014 2868 2773
2539B773j43o49K96j59l20n0J71j48p1j76q8j13o5O0r2K9j30r6q9J18J12m1M6j75m1j52Q7
$$ 2773 2630 1981 2277 2118 1798 1748 1919 1771 1700 1524 1436 1323 1258 1318 1226 1255 1125 1029 940 1058 1170 1129 1175 1000 959 807 894
2201H94l7j0j40N6K4Oj20J26J06p8k31J94O6j97OJ75j27J2j36J32o4l2l9k22K50p8Op4j3J39
$$ 894 857 847 707 763 787 793 673 799 905 827 596 790 856 659 665 840 713 725 589 721 657 625 586 364 614 536 542 468 455 594
1826E94j58J07k15J74J1n6J94qP1k44N1j8j12J7R8L7j54J12o0m5o8OK01j00j14j96K17k9M4
$$ 594 436 543 328 502 513 457 651 643 714 470 521 503 391 408 506 543 389 501 441 396 328 334 535 435 321 125 342 313 357
1463C57rj10J79PM0j21n9nk1J32j18N5j6L9L1K2j97K61M7l8j32j39J68N7j00J23k81K18J1
$$ 357 348 238 417 424 464 343 284 279 258 390 272 327 311 350 381 403 206 467 514 476 344 205 373 430 330 453 172 390 401
1100D01lr2J16k12n0J80o8l9J08M4k37K34m1q8R3R5k26J9J5M0L9l8K5L4o8j05J05n1J18j73
$$ 401 398 306 422 210 160 340 272 233 341 385 148 382 341 253 346 441 215 234 249 289 328 290 315 349 281 176 281 230 348 175
724A75O9p8J19j24J71o3k5J65K7j59l4j19K02r5L3j37J22J2p6q5J38q5P1k0j5M5r6k5J69j11
$$ 175 244 166 285 161 332 269 244 409 436 277 243 124 326 231 264 127 249 261 185 100 238 153 224 204 189 234 138 113 282 171
348A71K1K1N4j5l2p8Q4j74J00R4J2j4l4%P5J4j10J46m4m7J92l56J83j8r6j03J15L9j23J35
$$ 171 192 213 267 252 220 142 226 52 152 246 258 244 210 210 285 299 189 335 291 244 436 80 263 245 149 46 161 200 77 212
-27B12Q1j50k1J10N9m5k0m6J05j55R4k1J8j55J47J6n2L9J0M9jm6j58J05J1k1l5k1p3
$$ 212 293 143 122 232 291 246 226 180 285 130 224 203 221 66 213 229 177 216 226 275 274 228 70 175 186 165 130 109 36
-390C6
##PAGE=	F1=-249.806
##FIRST=	23149.952173337649583,	6007.3700543999984802,	0.37153390049934387207
##DATA TABLE=	(F2++(Y..Y)), PROFILE
6007E9rN4J5l6J42j65J09J1m4k8J37L3k7q3pm2Q1j8O0K8m1n0j1P1p2R6k3q7R2J3jM4r6p4J27
$$ 59 50 104 119 83 225 60 169 180 136 108 245 278 251 168 161 119 200 182 242 270 229 179 168 239 167 263 240 153 245 258 257 301 205 131 258
5569B58n8j7Rr6J23n5N7n9J00k6nJ58k40N6J7j2m0M8n2k9N7J68Nj18J4M3o4l9j03J11Q4n4
$$ 258 200 183 192 96 219 164 221 162 262 236 231 389 149 205 222 210 170 218 166 137 194 362 367 249 263 306 242 203 100 211 295 241
5169B41m2O5J4j98J40K0q4R3j14pK2J23q7j7j3J46j60O1n2J1N2J55p3p5KN6n3J18M8j30P2
$$ 241 199 264 278 80 220 240 156 249 135 128 150 273 186 169 156 302 142 203 151 162 214 369 296 221 223 279 226 344 392 262 334
4780C34K7J17j25j22L2j32K22M8j29m6M9qq6J73p5q7J99q2M0r9J82L1p3m0j78K01j12q0R8
$$ 334 361 478 353 231 263 131 353 401 272 226 275 267 181 354 279 192 391 309 349 250 432 463 390 350 172 373 261 181 279
4417B79Lm4J7M5K4kK6o5k03J69J10j01K41o6j16R8j46J65J37j77P7j40P9n8r5K48n0J27k44
$$ 279 282 238 255 300 324 322 348 283 80 249 359 258 499 433 317 415 269 434 571 394 471 331 410 352 257 505 455 582 338
4054C38k6m2N9K20j50J55o3j25L9M5J69K0k23j8K42j15j36j34J97K20p9j08Q2j1j07K5j97
$$ 338 312 270 329 549 399 554 491 366 405 450 619 639 416 398 640 525 389 255 452 672 593 485 567 556 449 474 277
3716B77Q5J33K7K3n6N1M9J3m3k5J35j43J01R0j01j10J85j55K98J68j94Oj25O5J31j50O7J88
$$ 277 362 495 522 545 489 540 589 602 559 534 669 526 627 717 616 506 691 536 834 1002 808 814 689 754 885 735 802 990
3366I90j15j64k7K21L0o9K53j28J6J32j36M2K8j96J30J20K61p8M7R9R7j20J63P9K16P4l78
$$ 990 875 711 684 905 935 866 1119 991 1007 1139 1003 1045 1073 877 1007 1127 1388 1310 1357 1456 1553 1433 1596 1675 1891 1965 1587
3028A587L09R1m2L22P31k52R6K7j445J258L31P19M1N30O12P55J263J988L026P474J6756N586
$$ 1587 1896 1987 1945 2267 2998 2746 2842 2869 1424 2682 3013 3732 3773 4303 4915 5670 6933 8921 11947 19421 36177 41763
2752D1763p398j3211j1020l413j888j863j219L539Q659Rj1431M649j856r39o42k77j98k40
$$ 41763 34365 21154 10134 6721 4833 2970 1751 5290 13949 13958 2527 7176 5320 4381 3739 3462 3264 3024
2527C024n97J99k29l25j31K03j93j04j83q4p9n3nm9j2j51r2l7P6J02r4J0j58q6j4Q2j04j0
$$ 3024 2427 2626 2397 2072 1941 2144 1951 1847 1664 1580 1501 1448 1443 1394 1382 1231 1139 1102 1178 1280 1186 1196 1038 952 938 1020 916 906
2176I06j44N4J48j21m5J26Q7j33j42J91J9k40J02J48j80oj29J58j11mq3j70K58p6m5m8J4J55
$$ 906 762 816 964 843 798 924 1011 878 736 927 946 706 808 956 776 770 641 799 688 684 601 431 689 613 568 520 534 689
1826F89j74L0k13J97o0mK10qP3k93Q9l6j19KJ42K2p9J06j70L8r5K2J44k43j17J35J53l6N2
$$ 689 515 545 332 529 469 465 675 667 740 447 536 500 381 383 525 547 468 574 404 442 347 369 513 270 153 288 441 405 457
1463D57n7o3J47J1%j64k7pn8J29j5N4k7N1J8Ok34K85L7o0j60KN5qRJ23k74J68K0p7k4J35k58
$$ 457 400 337 484 495 495 331 304 297 239 368 353 407 380 431 449 455 221 506 543 483 323 325 380 372 381 504 230 398 418 341 317 452 194
1049A94KJ85m1p7J12Q5k70K20j8j22J25J16l13K4R3j6K5o6L7km7j9K5n0J99k27J2O4N2j61
$$ 194 196 381 340 263 375 460 190 410 392 270 395 511 198 222 315 299 324 258 295 293 246 227 252 202 401 174 186 250 302 141
674A41K09%j00J34k0j23M2j67J51J8J0j69J07JKj04Q4k7N7J8o6O5j15M4J52j92N0N4Q7k4r9
$$ 141 350 350 250 384 364 241 283 116 267 285 295 126 233 234 236 132 216 189 246 264 198 263 148 192 344 152 202 256 343 319 220
286B20q9O8p6Q2P9J3o3j02J29N8K5j10R0Oj34J88k47J04O1j15j09M9J11j40J16P7j96J09J07
$$ 220 131 199 123 205 284 297 234 132 261 319 344 234 324 330 196 384 137 241 302 187 78 127 238 98 214 291 95 204 311
-77C11M4o1k8j24J53j33R9n5M3j85J78k4j3J3kK8M1p4j61Q3K4L1l6m9o8
$$ 311 355 294 266 142 295 162 261 206 249 64 242 218 205 218 216 244 285 211 50 133 157 188 152 103 35
-390C5
##PAGE=	F1=-344.16
##FIRST=	23149.952173337649583,	6007.3700543999984802,	0.29035827517509460449
##DATA TABLE=	(F2++(Y..Y)), PROFILE
6007H1l4O7M7r1P4j00P5N0j36J09Q5M5r0pL7q5M7j9N0j1k4l0l7J29n9PJ7q4R1k2LQ2r1q5J53
$$ 81 47 114 161 70 144 44 119 169 33 142 227 272 182 175 212 127 174 155 205 194 170 140 103 232 173 180 197 113 204 182 185 267 176 91 244
5569B44p5o4N1j06J36J0J4r2N9j9L2J04j89R3l7j3p9J06j4p5J99J50p6j44l9P7n9m0r9J36
$$ 244 169 105 156 50 186 196 210 118 177 158 190 294 105 198 161 148 69 175 161 86 285 435 359 215 176 253 194 154 55 191
5194A91O5o5lm5L1r7J16Qj05J02j12l0P9J26j19qkJ45j76L2N5j8M5Q3j11l8N9O0p1J31P9j59
$$ 191 256 191 188 143 174 77 193 201 96 198 86 56 135 261 142 134 132 277 101 133 188 170 215 298 187 149 208 268 197 328 407 248
4793B48qO2R4p7j16Nj23J83P3j88J03q8J6k8J14o7rJ40p7L2o8K06Lj13p8q3K09r7j67J81o6
$$ 248 240 302 396 319 203 208 85 268 341 153 256 168 184 156 270 203 194 334 257 289 221 427 430 317 239 156 365 268 101 282 216
4405B16L2p0Q9oL5m1m0j64J56Q2m4J80o9j45J59j60J31J13j47O5r2R3o7r6K68p4P3k13o4O9
$$ 216 248 178 267 261 296 255 215 51 207 289 245 425 356 211 370 210 341 454 307 372 280 373 306 210 478 404 477 264 200 269
4029B69M2J76j32J09L1k35O9M9K04m9j78qJ74r2j10j58J94K39p9j08P3m0r0J9j54R8J53l7
$$ 269 311 487 355 464 495 260 329 378 582 533 355 347 521 429 319 161 355 594 515 407 480 440 350 369 215 313 466 429
3679D29Lk9J0P9J5m8%Q8j29J37L8r1m6R6q0K37J74k18m1q5O6J11o4M5J70j15j54p3K23L5q5
$$ 429 432 403 413 492 507 459 459 547 418 555 593 502 456 552 472 709 883 665 624 539 605 716 652 697 867 752 598 525 748 783 698
3291F98K25j01lR7j79J36o7j53J52R5K62q3J3R8jn0J58Q6K06k1m05L51m7m6O41K04l03J14
$$ 698 923 822 819 916 737 873 806 653 805 900 1162 1079 1092 1190 1189 1139 1297 1383 1589 1568 1163 1514 1467 1421 2062 2266 1963 2077
2940B077k72p21J187K23N27m2N10M66N32R63J516K249N798J2976L810n396j0336q578k627
$$ 2077 1805 1084 2271 2494 3021 2979 3489 3955 4487 5450 6966 9215 15013 27989 31799 26403 16067 7489 4862
2702D862j491j486n04L705O824j709p685N910l271j066o90l12k00k69m25J13k57k39k05K15
$$ 4862 3371 1885 1381 5086 11910 10201 2516 8426 5155 4089 3399 3087 2887 2618 2193 2306 2049 1810 1605 1820
2452A820j77r8j99j3o4qm3oo7j22r5M1M5M5r4m3j10j07J16J10j96Oj50P0K23j87J0J05Q1j73
$$ 1820 1643 1545 1346 1333 1269 1261 1218 1212 1145 1023 928 969 1014 1059 965 922 812 705 821 931 735 741 591 661 884 697 707 812 893 720
2076G20m2J69l5k56J75J04j70n1q4J48j39j5q3n8K16o9r9J2L7J14j24n2j74K17j45O8J85l0
$$ 720 678 847 812 556 731 835 665 614 530 678 539 524 441 383 599 530 431 443 480 594 470 418 244 461 316 384 569 539
1726E39P2k75Q7k1j31k7J89J1m0R9k35J14r7J5K0k72P7L68j2p1L6j02qJ21%J3k34NL1j28J17
$$ 539 611 336 423 402 271 244 433 444 404 503 268 382 285 300 320 48 125 493 481 410 446 344 336 457 457 470 236 241 272 144 261
1337B61R7L4m8N8K1nk42K52J1o4j59J28m6n8J06J23k57J24M6j66L6J40k51J7J65k3q9J17J06
$$ 261 358 392 344 402 423 418 176 428 439 375 216 344 298 240 346 469 212 336 382 216 252 392 141 158 323 300 211 328 434
974D34k60J71K7j61J12J45l09KJ59n5j2q5M6m8j5O8k6r6K56k02o5J58L1k13K37K3q9M8m4n4
$$ 434 174 345 372 211 323 468 159 161 320 265 253 168 214 166 151 219 193 97 353 151 86 244 275 62 299 322 233 281 237 183
599A83P8j75N7J28k6j54N6K2P9q3k2J7O7O8j14M4q1Q1R7k23O4P0R7jj82p1O2J1O6L9J7o0j59
$$ 183 261 86 143 271 245 91 147 169 248 165 143 160 227 295 181 225 144 225 322 99 163 233 330 329 147 76 138 149 215 254 271 211 52
186E2K30lM2m8JK8j58R7q9L7Q6q0r9n1J46q9N8Q5j22J25P0J8n5k8j77J79q5P4n6M5j72J66
$$ 52 282 279 321 273 274 302 144 241 152 189 275 195 96 45 191 102 160 245 123 248 318 336 281 253 76 255 170 244 188 233 61 227
-215B27o7M3NKo2P9p2r6J8K2P9m6l6m7
$$ 227 160 203 208 210 148 227 155 59 77 99 178 132 96 49
-390D9
##PAGE=	F1=-438.514
##FIRST=	23149.952173337649583,	6007.3700543999984802,	0.26897287368774414063
##DATA TABLE=	(F2++(Y..Y)), PROFILE
6007I4n6O9P2l7j9r1K1R5p0O2J1Q4j29Q1P0j51j1NM3m1jm2k7J47j9n1K7m1L7j1m1Q0k6j9J37
$$ 94 38 107 179 142 123 32 53 148 78 140 151 235 106 187 257 106 95 100 143 102 101 59 32 179 160 109 136 95 132 121 80 160 134 115 252
5569B52j41o6M7kM5L1nn4k2l4O7M0q6J06r6Om5M4Q8j08K57J50j03j94p4R2m3n3m9R3P0r4M0
$$ 252 111 45 92 90 135 166 161 107 85 51 118 158 72 178 82 88 43 87 175 67 324 474 371 177 103 195 152 99 50 143 213 119 159
5156A59j23K1kO9L2j18R4j07PN9J17j26K3n5J41r1o2J46k0OR1j76M0M9J7o7J21J17j43m1J3
$$ 159 36 57 55 124 156 38 132 25 32 91 208 82 105 50 191 100 38 184 164 170 261 85 125 174 191 124 245 362 219 178 191
4768A91O8j0p7l8J4kQ6j15J27j03n7J7M8k2K0P9o2J5k5J99Oj28j33M5J81l4j86J14q0Q7o8
$$ 191 259 249 172 134 148 146 232 117 244 141 84 101 149 127 147 226 164 179 154 353 359 231 98 143 324 290 104 218 138 225 157
4380A57p%J14p1p3k8MN3N4J04p6j20J60j14J5P2p8M2j3Q2p1r7K47m6L5k16k8J33PJ19q8K4
$$ 157 150 150 264 193 120 92 96 149 203 307 231 111 271 157 172 244 166 208 195 277 206 109 356 310 345 129 101 234 241 360 272 296
3979B96J15k40J0K2K55q1j49lJ27q6o4o5P0K10m0j05P5o3o8L7j28P7J37n6kMn6P4K8j5mN0
$$ 296 411 171 181 203 458 377 228 225 352 266 202 137 207 417 377 272 347 284 216 253 125 202 339 283 281 285 229 303 331 316 312 362
3578C62j16J88oj08j5L1j1J44J97k08o2m8%P3N4KJ55r8q2j47J67M3q2J56k9l9R8k35J98j05
$$ 362 246 434 428 320 305 336 325 469 666 458 396 348 348 421 475 477 632 534 452 305 472 515 433 589 560 521 619 384 582 477
3203D77j23J16L3K50o8J7O4o7j3J43O0J36ll67K39r9p1P58j49k83O7l73J02P07Q8L02j47M27
$$ 477 354 470 503 753 685 702 766 699 686 829 889 1025 1022 655 894 795 724 1482 1333 1050 1117 744 846 1553 1641 1943 1796 2223
2852B223L17K27N97Q57J264L563P959J750l028o268n201j596q97r01J31K731M341k183j001
$$ 2223 2540 2767 3364 4221 5485 9048 17007 18757 15729 9461 4260 2664 1767 866 997 3728 8069 5886 4885
2614D885K544l591r00n40k87r7k49k48J00k42j30k25J76j26m0k25O3l8K5m2L1j19n2j13R4
$$ 4885 7429 3838 2938 2398 2111 2014 1765 1517 1617 1375 1245 1020 1196 1070 1030 805 868 830 855 813 844 725 673 560 654
2301F54N1j3o7q5n7j36J96J75k55K1j69O7K40j62J2P3J02j85J2J42m4k10J24Q4q5j03k9R5
$$ 654 705 692 625 540 483 347 543 718 463 484 315 382 622 460 472 545 647 462 474 616 572 362 486 570 485 382 353 448
1951D48j04o9m1J0J62l3j33N9P8K1n2j15j07K32j96R2J54n7M9j81L3J6j20o3J89K6m1Q5k03
$$ 448 344 275 234 244 406 373 240 299 377 398 346 231 124 356 160 252 406 349 398 217 250 266 146 83 272 298 257 342 139
1588A39J13n5rp4N0K02K45j48j01K3j49NJ30l6P3k66j5J13j34K3J71L3j00M9M1K7j76J20j
$$ 139 252 197 188 114 164 366 611 463 362 385 236 241 371 335 408 142 127 240 106 129 300 333 233 282 323 350 174 294 293
1225B93p1j06J51q4r6J54J32k05P3J02k09%J59j72m1J23lq6J23R4j91R8O6j07k1J59j78q8
$$ 293 222 116 267 183 87 241 373 168 241 343 134 134 293 121 80 203 200 114 237 331 140 238 304 197 176 335 157 69
874F9J94k5m4j01O0j15OJ18J6j32J87j13r9J39N9j82J63J3J9r9JJN5j07j7J41o2r0j4O8R4
$$ 69 263 238 194 93 153 38 44 162 178 46 233 120 21 160 219 37 200 213 232 133 134 135 190 83 66 207 145 55 41 109 203
486B03j4j28K9R5J17j16l9k1Q8M2j73J3P1Q7O6k13l8J9L8M4%J5j2q4J78o8M3L0j6po5j16N2
$$ 203 189 61 90 185 302 186 147 126 214 256 83 96 167 254 320 107 69 88 126 170 170 185 173 89 267 199 242 272 256 249 184 68 120
73A20PO3j1q2k7J7LqJ16lL8K6nl5jj93J49m1O2m0M3j60J44j07R8J9L8j02N1k2p2n7J6R6n6
$$ 120 127 190 179 97 70 87 90 82 198 195 233 259 254 219 218 25 174 133 195 155 198 38 182 75 173 192 230 128 179 157 85 28 44 140 84
-365H4qo
$$ 84 76 70
-390G0
##PAGE=	F1=-532.868
##FIRST=	23149.952173337649583,	6007.3700543999984802,	0.4459361732006072998
##DATA TABLE=	(F2++(Y..Y)), PROFILE
6007H9o8O2Q5Mk9j17O1M5kl2j7P8j21J58M6j73n9M9N0M3m6n9j2N7K8m9J5J3j1M1m9k3O9M8
$$ 89 21 83 168 172 143 26 87 132 130 98 81 159 38 196 242 69 10 59 109 152 106 47 35 92 120 71 86 99 88 129 80 57 126 174
5582A74R4j62l1l5P0k7J2J4k7k0qJ4l6K6J22r8l3L9NJ18j15K14J52j03k21m8P9j0r4%L7J04
$$ 174 268 106 75 40 110 83 95 109 82 62 54 68 32 58 180 82 49 88 93 211 96 310 462 359 138 90 169 159 65 65 102 206
5181B06j11N6n3k6j0j9O8o6N4q4M7kR7p2K8p0N5Ll6P7J7k5J46j57N5l8l2o2J07J44r5Kq4R9
$$ 206 95 151 98 72 62 43 111 45 99 15 62 60 157 85 113 43 98 101 65 142 159 134 280 123 178 140 108 46 153 297 202 204 120 219
4755B19j4j8j23J47j21M2M9L1K7j05r0J4J9KM8pl9J5J65M7j19j74J19J44jp9p7n4J30J9j46
$$ 219 205 187 64 211 90 132 181 212 239 134 44 58 77 79 127 120 81 96 261 308 189 15 134 278 277 198 121 67 197 216 70
4367G0JJ66J5k10J20q9QP0O5q2j6N3K3j48M4n1J2P0P3k1j68J96J8Q4k03K7N5l2P5k2l0J32
$$ 70 71 237 252 42 162 73 81 151 216 134 118 171 194 46 90 39 51 121 194 173 5 201 219 303 100 127 182 150 225 203 173 305
3967C05j25q5q5K89j0j62l8J42q4n7Q6r5J46M5r1K9j1o3O1j40O7O3j9j4N5p7J0KP2k7M2j18
$$ 305 180 95 10 299 289 127 89 231 147 90 176 81 227 272 181 210 199 136 197 57 124 187 168 154 209 132 142 144 216 189 231 113
3566A13K17K9r3q0l8O8K6K55j66o6L8j54L7J27k3J65q7J2j34N6K0l0K4J08j32J96k75J64k6
$$ 113 330 359 266 186 148 216 242 497 331 265 303 149 186 313 290 455 368 380 246 302 322 292 316 424 292 488 213 377 351
3203C51j62J07j48L03j31J53Ln5j03K03N4J8Q6k66J20p6k51P75k11k16L4k21K58L29M9K09
$$ 351 189 296 148 451 320 473 476 421 318 521 575 593 679 413 533 457 206 981 770 554 588 367 625 954 1003 1212
2877A212k57K95L03L9L98L86O57J968M709P23j742l429k975r47n27n30L02J636K429j844K323
$$ 1212 955 1250 1553 1592 1990 2376 3033 5001 9710 10433 8691 5262 2287 1340 813 283 585 2221 4650 2806 5129
2614E129R44l311p77l73k89J6k06j96J66k05r3j08K5p1L8k28%N0J8j7Q5j60%q1MJ21j2o8p1
$$ 5129 6073 2762 1985 1612 1323 1339 1133 937 1103 898 805 697 722 651 689 461 461 511 529 512 597 437 437 356 360 481 469 401 330
2251C30lk43J88K30j63qj21o2K09o4k0M9J12j17m2J26k4p1o7Q7J8r1J5J1lj10J2r3J10M9q2
$$ 330 327 84 272 502 339 331 210 148 357 293 273 322 434 317 275 401 377 306 239 326 344 253 268 279 276 166 178 85 195 244 162
1863A62jJ61m3l3j27o3K29j14l2J56m6Np1l1K7q7KJ2P3l8Q1p4l9J5QP5K3K38J71k26j01M0
$$ 162 161 322 279 246 119 56 285 171 139 295 249 254 183 152 179 92 94 106 179 141 222 148 109 124 132 207 230 468 639 413 312 352
1463C52j37j06J74m3Q5j91r8J72o0q3J50Q4j43jL3Q0m3K3Jj07jN3m4q2M6J33q5j3J82j52j63
$$ 352 215 109 283 240 325 134 36 208 148 65 215 299 156 155 188 268 225 248 249 142 141 194 150 68 114 247 162 149 331 179 16
1074A6J89m4j25N6J8o8J19M8q8N5M3N4j51O6l4j13J33N1m8o5O7r8l1L5Q9m1k5k8Ml1J22o6
$$ 16 205 161 36 92 110 42 161 209 121 176 219 273 122 188 154 41 174 225 177 112 179 81 50 85 174 133 108 80 84 53 175 109
674A09j8jJ43j55K6J1j2JL5j3p7J8JJ2L6P2j08n5J18J42p3j29K0J12L4j20n8K5N9J31j29o3
$$ 109 91 90 233 78 104 115 103 104 139 126 49 67 68 80 116 188 80 25 143 285 212 83 103 215 249 129 71 96 155 286 157 94
273I4k2K5oJ3j3M4pJ02q7JP3M0l6J9j64noO9L1p8N1j10L9pR7M7l1kJ1l4N7j31J3k6Q1k1N0
$$ 94 72 97 91 104 91 135 128 230 143 144 217 257 221 240 76 71 65 134 165 87 138 28 67 60 157 204 173 171 182 148 205 74 87 61 142 121 171
-190A71j62J33j07Q5M3O6m5j4J3p5r7L1N2m9pL8
$$ 171 9 142 35 120 163 229 184 170 183 108 11 42 94 45 38 76
-390G6
##PAGE=	F1=-627.222
##FIRST=	23149.952173337649583,	6007.3700543999984802,	0.35637184977531433105
##DATA TABLE=	(F2++(Y..Y)), PROFILE
6007G2n5K9R1J6l2r3R5JNr0Q6o0j7J33k6r7lJ5L0J31p9m5n8j7M8m6K2L2K0L2nkK3N9L2j16
$$ 72 17 46 137 153 121 28 123 124 129 39 125 65 48 181 155 58 55 70 100 231 152 107 49 32 80 34 56 88 108 140 135 133 156 215 247 131
5557A31k5j4J2m2l3P4p5N1K3m4m%J36l4j05L0J05N5j09J23J24r8j96l2P3K6q7k3M1J04r6N5
$$ 131 106 92 104 62 29 103 28 79 102 58 54 54 190 156 51 81 186 241 132 255 379 281 85 53 126 152 65 42 83 187 91 146
5156A46n0J2l2l4K9m1L8m4M6j3Q2l8L2k5l9J4M0m3M8l0J71j21N7q6m5m4O5J48m2kr3J76p6
$$ 146 96 108 76 42 71 30 68 24 70 57 139 101 133 108 69 83 123 80 128 98 269 148 205 119 74 30 95 243 201 199 106 282 206
4743B06J8j60J39j08PJ01l4J30o9j79N6m7m5N6O0l4k3J17R9r1j27M4J12k3M9j83n6J46N7p3
$$ 206 224 64 203 95 102 203 169 299 230 51 107 60 15 71 131 97 74 191 290 199 72 116 228 205 254 71 15 161 218 145
4367A45l6R8Q1k56J60k9%n4L1p0N8k3J28j42rk4nJ4J07M3j55L5N6J71r6m6n7o5M8L2MJ08o3
$$ 145 109 207 288 32 192 163 163 109 140 70 128 105 233 91 82 58 53 67 174 217 62 97 153 324 228 182 125 60 108 140 144 252 189
3954A89m1J4k5J11j56n4J08K2r7P5j27N3J53m0r7N5k6N2j05M5j3O3j15J20m5J0r8J08j4K1
$$ 189 148 162 137 248 92 38 146 168 71 146 19 72 225 185 88 143 117 169 64 109 96 159 44 164 119 129 31 139 125 146
3578A46o0J59Q6l7j08r8Q7p3K79j03j08J57j58l7O7RJ42l9j3j5K5Rn1m0J73j86K25k15J15
$$ 146 86 245 331 294 186 88 175 102 381 278 170 327 169 132 199 208 350 311 298 283 308 317 266 226 399 213 438 223 338
3215C38M6k47K02k17K39k62K77L6j9k36K14J18LM1k19J85r0k51O52j48k30R7j44J12J80J04
$$ 338 384 137 339 122 361 99 376 412 393 157 371 489 492 533 314 499 409 158 810 662 432 529 385 497 677 781
2890G81K37k47J05L15Q6L21K65N25J422L715P42j516k572k345p71l90m86K36J120J702j504
$$ 781 1018 771 876 1191 1277 1598 1863 2388 3810 7525 8267 6751 4179 1834 1063 673 187 423 1543 3245 1741
2627A741K963O58k910p91k83k48k1j50k00J37j31j31O0j28j7O9j56j84J05M1p2J91j69j1J5
$$ 1741 4704 5362 2452 1661 1378 1130 1109 959 759 896 765 634 694 566 549 618 462 278 383 424 352 543 374 363 378
2314C78j79K01Rq9qL9k07j2J73lm0j3j24J26m2J5N6M1Kj07J26q4L5j08J7M3m4N3oK4o3k5j27
$$ 378 199 400 409 320 312 351 144 132 305 302 262 249 125 251 209 224 280 321 323 216 342 258 293 185 202 245 201 254 248 272 209 184 57
1901E7n0J49K4j10K13j1n1j05o4J81m4q4J52k6K1m4m5Rq6K9p1P7K1Q5l0j66K3N8J61k9J70
$$ 57 7 156 180 70 283 272 221 116 52 233 189 105 257 231 252 208 163 172 86 115 44 121 142 227 197 31 54 112 273 244 414
1513D14J80k23j07N6n6j67J10L9Rr6r4R5jr4O5J43j01m2n3O2R7N0nj34J4O1n2n2p7Q9L8r5
$$ 414 594 371 264 320 264 97 207 246 255 159 65 160 159 65 130 273 172 130 77 139 236 286 281 147 161 222 170 118 41 130 168 73
1112G3K43r4j40O8L7j11qnQL9Kk2N6j5J90j20n9m5JJ1J06p2lO9r2l5o8J14J8j02mM9o9J48
$$ 73 316 222 82 150 187 76 68 63 71 110 112 90 146 131 321 201 142 97 98 109 215 143 140 209 117 82 14 128 146 44 40 89 20 168
686A68j7j15N9J06k5p4Kp2Q1O4j33oM1J3l1l4J28m2n2M6J29k3j54K0J48N5j38l2p3K7J36l1
$$ 168 151 36 95 201 176 102 104 32 113 177 44 38 79 92 61 27 155 113 61 107 236 213 59 79 227 282 144 112 39 66 202 171
286A71q1l7O5q3P6j1J4M0M7o4o6N0J08l0M9r1j15l2J41K8j06Q5l9p3L1L3N3n1j5P1n3Q4j07
$$ 171 90 53 118 35 111 100 114 154 201 137 71 121 229 199 248 157 42 10 151 179 73 158 119 46 77 110 163 112 97 168 115 199 92
-127I2o7K2L9J0N4j33Q7l8j2N7N9Qm1K0m4r7L3QJm6M5
$$ 92 25 47 86 96 150 17 104 66 54 111 170 178 137 157 113 16 49 57 58 12 57
-390E7
##PAGE=	F1=-721.576
##FIRST=	23149.952173337649583,	6007.3700543999984802,	0.23319824039936065674
##DATA TABLE=	(F2++(Y..Y)), PROFILE
6007F2l1qP9L5n0l9P1kj1o0J48p1qJ9p3L6j7K1l3J75o4n1o9MM0m0j3RN8JJ8P4j7K8l2o6j7
$$ 62 31 23 102 137 87 48 119 117 106 46 194 123 115 134 61 97 80 101 68 243 179 128 59 63 103 63 50 59 117 118 136 210 193 221 189 123 106
5544A06N5m8n5LN2q2N1M5q0N6n2J30K2o8q5J96Kj07L2P2m0j82J8KN5Ro6L6N3p6N7q8O1jj3
$$ 106 161 113 58 61 113 31 82 127 47 103 51 181 203 135 50 246 248 141 173 245 205 23 41 43 98 107 41 77 130 54 111 23 84 83 70
5106G0jm4mML9j7Q2m2M9mo9oQ3j07L8k7J54q4O0p6l7qK5J22J8q6n2K20r0L9j21Np7O6O7p2
$$ 70 69 25 21 25 64 47 129 87 136 132 63 57 140 33 71 44 198 114 174 98 61 53 78 200 218 132 80 300 210 249 128 133 56 122 189 117
4655A17J85j3j93R2j22J5l2O7M2p4N6J21l0j37j2Q0o1J55j54q2J07L0L3l2J8Q4j91J15L5k9
$$ 117 302 289 96 188 66 81 49 116 158 84 140 261 231 94 82 162 101 256 102 20 127 157 190 158 176 260 69 184 219 190
4280A90j09Jk2K7j7J66r8r9K1L3m4J27N5j52L4NJ91%j00j40jJ0j6M0J49p9J4P4j81J20j24
$$ 190 81 82 60 87 70 236 138 39 60 93 49 176 231 79 113 118 309 309 209 69 68 78 62 102 251 172 186 260 79 199 75
3891G5K0l4J29m6r9mK8J19K2n9o1JM2k8k7J8R9r7L1m5N6j2o5M1o6N5N5J14J5q2n1jj7J37J
$$ 75 95 61 190 144 45 41 69 188 210 151 90 91 133 105 78 96 195 98 129 84 140 128 63 104 38 93 148 262 277 195 144 143 126 263 264
3453B64k05K10l9r3m0P9N9P2j32P4M6N6j21pJ41j34J16j41J20J09l53K71j24P5j05K0J81m8
$$ 264 59 269 230 137 97 176 235 307 175 249 295 351 230 223 364 230 346 205 325 434 81 352 228 303 198 218 399 351
3103C51j36j9J74J05jk95K39j38j10N73q7l33J74q8O6L4J02K74j92RK20J71K49K05L77J220
$$ 351 215 196 370 475 474 179 418 280 170 743 656 323 497 409 475 509 611 885 693 702 922 1093 1342 1547 1924 3144
2777C144L015N69j279k096j849p05k11m44K96Q88J374j279L071L39k594p95k31j50n9j24j47
$$ 3144 6159 6728 5449 3353 1504 799 588 144 440 1328 2702 1423 4494 4833 2239 1444 1213 1063 1004 880 733
2514G33jl3j69J29j88K3Q0r5j82k4J40k48L12j45l1O9k27K02J4j17J1J13j65r5N4L5m3L2p3
$$ 733 732 699 530 659 471 494 574 479 297 273 413 165 477 332 301 370 143 345 359 242 253 366 201 106 160 195 152 184 111
2151A11J35j34Q1O9k3M9o5J37j62J6K8n0j1o2P6L2Lk0o4m2M1n5P6j23J70M1j4j19o6R9k5l1
$$ 111 246 112 193 262 239 288 223 360 198 214 242 192 181 119 195 227 230 210 146 104 145 90 166 43 213 254 240 121 55 154 129 98
1751I8J27n4N3pp7J5q0qL5jO5P0m8n8l6PJ37J9K6J84j25j28L5J6r2j5J00l7nj59P3M2j04j2
$$ 98 225 171 224 217 140 155 75 67 102 101 166 236 188 130 94 101 238 257 283 467 342 214 249 265 173 158 258 221 216 57 130 172 68 56
1325E6J54l4ro3p3J67P4Oj60J9J20q6p5pmO1j27K54m2j06K5K3m8k5m3O0o3Mj6M4l1K43o6l5
$$ 56 210 176 167 104 31 198 272 278 118 137 257 171 96 89 85 146 19 273 231 125 150 173 125 100 57 117 54 58 42 86 55 298 232 197
899A97j93J16k1J21j29N3P3j00l6m9O5K1n6l8K7j5J31rn8R3m4R8j13l1m3M5N8j34P3k9j3l1
$$ 197 4 120 99 220 91 144 217 117 81 32 97 118 62 24 51 36 167 158 100 193 149 247 134 103 60 105 163 29 102 73 60 29
499B9L6L9kj2j8R0K8j43J7J59P8j71j3o2J2J9N3k4k4P3q1K4L9l4O6J7m6q9kJ27k1N1k0j29
$$ 29 65 104 102 90 72 162 190 47 64 223 301 130 117 55 67 86 139 115 91 164 83 107 146 112 178 195 149 60 58 185 164 215 195 66
73F6kR1M3j35P1K4j13O2J0M4n8n0J15m4N7r2q3Q8l8K2M9r0N4k8m0K3L5M8o4L1Mp8K1mL9j7
$$ 66 64 155 198 63 134 158 45 107 117 161 103 53 168 124 181 89 6 94 56 78 127 37 91 63 23 46 81 129 65 96 100 22 43 39 78 61
-378F1l1
$$ 61 30
-390C0
##PAGE=	F1=-815.929
##FIRST=	23149.952173337649583,	6007.3700543999984802,	0.14748612046241760254
##DATA TABLE=	(F2++(Y..Y)), PROFILE
6007F5l3OM0Q8l7m9J5%j1PJ53k2m4j08O3J1n3L0n6J35oo1l8l7P6k7o8lN9mj4J53k3j4o0n1
$$ 65 32 38 78 166 129 80 95 95 84 91 244 222 178 70 133 144 91 121 65 200 194 133 95 58 134 107 39 36 95 91 77 230 207 193 133 82
5557H2j1J02o0n8O4l8k3N8N3j42J08r1J00M5jj62K46j9j31l5M2R2j54K9m3oJ03m9j4k1j3L4
$$ 82 71 173 113 55 119 81 58 116 169 27 135 44 144 189 188 26 272 253 122 87 129 221 67 96 53 47 150 101 87 66 53 87
5156H7Kn0O3m1J8mk3j1LMO0o1P2Rj05L2P7j17J8L1L7k8K5m3j0J0K5P7Q8j65j1J73o3O2p4j08
$$ 87 89 39 102 61 79 75 52 41 44 48 108 47 119 128 23 55 132 15 33 64 101 73 98 55 45 55 80 157 245 80 69 242 179 241 167 59
4705E9j1O6L5n2J82J9j74J22j71Q2q0j0J25q5j2J01L8j34o1O0q3K13p9r1O3l1J01Jl9N6j05
$$ 59 48 114 149 97 279 298 124 246 75 157 77 67 192 107 95 196 234 100 39 99 16 229 150 59 122 91 192 193 154 210 105
4317A05O0P7q4j02N7ln2mJ68j4q3r1M5j2R9L7j44P3j9J37O2j31j47J15mj18K6J78p3K3J12
$$ 105 165 242 158 56 113 110 58 54 222 208 125 34 79 67 166 203 59 132 113 250 312 181 34 149 145 27 53 231 158 181 293
3929B93j22J0j00K4jL6M6j10J2N4%O3M3r8q4K7N0p0L7R1%r6K7JM6j13L2k2mj8J16N5n7Rp5
$$ 293 171 181 81 105 104 140 186 76 88 142 142 205 248 150 66 93 143 73 110 201 201 105 132 133 179 66 98 76 72 54 170 225 168 177 102
3491A02Q1JR6j28MQ8n2j76J25j1J77j20j6O0J14j33OR6n4L9q2M1K04l33J93mq0O1k24L01q1
$$ 102 183 184 280 152 156 244 192 16 141 130 307 187 171 231 345 212 218 314 260 299 217 258 462 129 322 318 238 299 75 376 295
3103B95j4r3N8J73Q1l04J48j51o4N72l7l86K01l5j4k0k2L40j29j9J12K14K45J74J67J112K518
$$ 295 281 188 246 419 500 196 344 193 129 701 664 278 479 444 430 410 388 728 599 580 692 906 1151 1325 1492 2604 5122
2765E122M26j126j791j378o98q7l77L00P54R94j120L359K9k414p66j80j44Pq6j09j02L7j62
$$ 5122 5548 4422 2631 1253 555 468 91 391 1145 2139 1019 4378 4407 1993 1227 1047 903 910 824 715 613 650 488
2477D88J10j84K6O0l6j04j16J70k36J91o7o9R6j46J05P4j39p2J99j07j44J22m7m6J6j16J91
$$ 488 598 414 440 500 464 360 244 414 178 369 302 233 329 183 288 362 223 151 350 243 99 221 174 128 144 28 219
2139B19j16RP7pNJ3J32j30j06J65l4o0k5m4O6L4l2l7l3J37j22J5q0R1P7O4j18j07K1K3l1J08
$$ 219 103 112 189 182 187 200 332 202 96 261 227 167 142 98 164 198 166 129 96 233 111 126 46 137 214 278 160 53 74 97 66 174
1738A74n2LP3j04kk9m0R4m6R1K3p1Q2j8l1J8O7kJ01m5j14j2N6k2l6P4m7R9k30Q7M7p8r4J08
$$ 174 122 125 198 94 92 63 23 117 71 162 185 114 196 178 147 165 232 230 331 286 172 160 216 194 158 232 185 284 54 141 188 110 16 124
1312A24K5K6l6K6oK6L8j82O8J20l4j68Q2qJ7p5J52J2q2N4o4L6l4n1Q1j16M5m4%J7J79l6L5
$$ 124 149 175 139 165 159 185 223 41 109 229 195 27 109 101 118 43 195 207 125 179 115 151 117 66 147 31 76 32 32 49 228 192 227
899B27j27J2k9J22j40O2Q0r3m8j6O3J8lp5m0K7J02k6L9J07j56J68r2p1oj9K5m2Q2p8l8KN5
$$ 227 100 112 83 205 65 127 207 114 66 50 113 131 128 53 13 40 142 116 155 262 106 274 182 111 105 86 111 69 151 73 35 37 92
486I2l3OJ3l3O2N6j16J2J46J04j68o9J9K2j03Q9N8KM0m9o7O4k3O3J0m4p9L4M9rRL8o6j0%O9
$$ 92 59 65 78 45 107 163 47 59 205 309 141 72 91 113 10 99 157 159 199 150 83 147 124 187 197 153 74 108 157 148 157 195 129 119 119 188
35A88j29K1N0r8J17J8K2n1j08J24l4M7m1r9O7j8j4L3m9Q8q7J4l1N3M7r9K6K6l3qlL4Rm3
$$ 188 59 80 130 32 149 167 189 138 30 154 120 167 126 27 94 76 62 95 46 134 47 61 30 83 130 31 57 83 50 42 39 73 82 39
-390C9
##PAGE=	F1=-910.283
##FIRST=	23149.952173337649583,	6007.3700543999984802,	0.30171108245849609375
##DATA TABLE=	(F2++(Y..Y)), PROFILE
6007E9k8J3QJ32j7o3k0k6MN1J43Jm0k08J82j9o4J4J2M0O0p8j2j09Q8jj17K6K6L6p5J78j4k4
$$ 59 31 44 52 184 167 104 84 58 62 113 256 257 217 9 191 172 108 122 134 174 234 156 144 35 123 122 5 31 57 93 18 196 182 158
5582A58m0p9j5Q8m5J5R1j16K0R3M0j71J15j24N6L4M1j34K52j2j45m6M2J28j29mJ3l4R3l4l7
$$ 158 118 39 24 112 67 82 173 57 77 170 210 39 154 30 86 120 161 27 279 267 122 76 118 246 117 113 126 92 185 151 114
5194A14q3P5K3P7j05K9q9K0N5ol8o2M3K6o9R5J9q3N4J7r4PQ2p2K5J6k0k2K0K8K7J49r5n6M0
$$ 114 31 106 129 206 101 130 41 61 116 110 72 10 53 79 10 105 124 41 95 112 18 25 107 35 60 76 56 34 54 82 109 258 163 107 147
4755A47l7Q3l2m3L8q6J9M5J24oj29J33j74J13q3r0J72p9n1M8R2j11o6O4l0J35J1q6Lo1J15
$$ 147 110 193 161 118 156 70 89 134 258 252 123 256 82 195 112 22 194 115 64 112 204 93 27 91 61 196 207 121 124 63 178
4367A78L5p0L0l4J8P0r8r7R5ol3l8J43O9l0j19q4M5P3J3j15P1nP2O8j37l3J17j2j14J6Q5k6
$$ 178 213 143 173 139 157 227 129 32 127 121 88 50 193 262 232 113 29 74 147 160 45 116 111 183 251 114 81 198 186 72 88 173 147
3954A47JJ11n3jj06PM6p9J07%l5Pm9N8R2o1j16k1J02j1l2N6Q7j94J34m2N0j04j6P3j20l3P8
$$ 147 148 259 206 205 99 106 152 73 180 180 145 152 103 161 253 192 76 55 157 146 114 170 257 63 197 155 205 101 85 158 38 5 83
3541H3P9n2M7j16J11lQ9k4q7Q3L0j40j8LJ92jj55M3J61r8l9O1j4O3m8j08K57k24P5J21j43
$$ 83 162 110 157 41 152 149 238 214 127 210 240 100 82 85 277 276 121 164 325 227 188 249 235 298 250 142 399 175 250 371 228
3153B28N0j13J53k8o2M4o6J28J43k39P9j16q2N80n8l69J61n0mO2j81L34l9n1O6J79K82K24
$$ 228 278 165 318 290 228 272 206 334 477 238 317 201 119 699 641 272 433 383 379 441 260 594 555 504 570 749 1031 1255
2802A255L5R41K300M39j020j717j097o34j35k81K48P28P97j105L399n2k323p20j06k49P4m
$$ 1255 1290 2231 4531 4970 3950 2233 1136 502 367 86 334 1062 1859 754 4153 4101 1778 1058 952 703 777 773
2527G73j03j31L1r2P4j37pJ5Rp9n4O6k6p8K7j02Q2n2L4J27j01j09J10nj88J82mr2O7j38N8
$$ 773 670 539 570 478 552 415 408 423 432 353 299 365 339 261 288 186 268 216 250 377 276 167 277 272 84 266 262 170 237 99 157
2139A57K1j35N7P1m8K6J12n5j67J64Mo7O7j51L0R3n5j3m2J87r4p0n2N4P8J23p6j38mN0r9R2
$$ 157 178 43 100 171 123 149 261 206 39 203 207 140 207 56 86 179 124 111 69 256 162 92 40 94 172 295 219 81 77 127 28 120
1738A20L2j26J47l3q3L0j4K3o5J11pr3J63J3j4k0L3Q7Q4j60n3r3P0J9j1M3o9J69j55j9M0k5
$$ 120 152 26 173 140 57 87 73 96 31 142 135 42 205 218 204 184 217 304 388 228 175 82 152 171 160 203 134 303 148 129 169 144
1337A44j25L6P8J5k9J04r0l0O1r5K6O9Q8j62%kL4k7qO5n7R8j27P5l1m4Q9n8K6J8j24Q7L9m5
$$ 144 19 55 133 148 119 223 133 103 164 69 95 164 252 90 90 88 122 95 87 152 95 193 66 141 110 66 155 97 123 141 17 104 143 98
912I8R1l4o4l5R1q2J8R5n9n0qL0P1N1r7j02O5K3o8J54P9j94J77m8r2K0o0k6J4J07q3k6J7N
$$ 98 189 155 91 56 147 65 83 178 119 69 61 91 162 213 116 14 79 102 34 188 267 73 250 202 110 130 70 44 58 165 82 56 73 78
486G8m4lnL7N6Ro6j7J23J11j17q9J4K8o1RJ02L3J5j4r0J0J3N9om3p3O6KK1p4O7L3k3q3Q0q9
$$ 78 34 31 26 63 119 128 62 45 168 279 162 73 87 115 54 63 165 198 213 199 109 119 132 191 185 142 69 135 137 158 84 151 184 161 78 158 69
23F9m6J5rJ30L4j1k5j35R8k4O4Rj10mRj4QkJ19q6nj3O4L7o1m9NK9m4j2jK4j4
$$ 69 23 38 29 159 193 182 157 22 120 96 160 169 59 55 64 50 58 56 175 89 84 71 135 172 111 62 67 96 52 40 39 63 49
-390D9
##PAGE=	F1=-1004.64
##FIRST=	23149.952173337649583,	6007.3700543999984802,	0
##DATA TABLE=	(F2++(Y..Y)), PROFILE
6007D1J7j6k4J39j7m0jo3J1N8J14mMj57J26j6n1j3Q5mR3r9j1q9nL5m8m3LN9J9L2J4J4m2r7
$$ 41 58 42 18 157 140 100 99 36 47 105 219 215 219 62 188 172 121 108 193 189 282 183 172 83 78 113 65 22 25 84 103 135 149 163 121 24
5557B4LlKR4Q0j04J7R4Oj50R2j13L2k7RM3J65qj17j9N8N4j01l7P0k8Q3l7l0j03Q2L2J28j18
$$ 24 27 24 26 120 200 96 113 207 213 63 155 42 74 47 56 99 264 256 139 120 178 232 131 94 164 136 219 182 152 49 131 163 291 173
5131A73k4j01k4J25j9l5o7pK9OO3K7l8K1m2m0j0P2k1n5Q6qp6K9KnJ84J2r7q7l5R2j7P7M1j52
$$ 173 149 48 24 149 130 95 28 21 50 56 119 146 108 129 87 47 37 109 88 33 119 111 35 64 66 61 245 257 160 73 38 130 113 190 231 79
4680G9K8N9Q0p3p1J12j33J03n3o0J06p5o4J4J37r6n4P2k6P4Q2o1p4n7J09O4q4K0jMJ4l7j11
$$ 79 107 166 246 173 102 214 81 184 131 71 177 102 38 52 189 93 39 111 85 159 241 180 106 49 158 222 138 158 157 161 175 138 27
4267B7N9jJ9n5J07J18jr7j15N5J9k0n7L2J3L4K7n3L2O5k6r2L0lK1pO5j9N7j20M1qk5L4Q6m9
$$ 27 86 85 104 49 156 274 273 176 61 116 135 115 58 90 103 137 164 111 143 208 182 90 120 117 138 131 196 177 234 114 155 147 122 156 242 193
3816A93r3j5J8P0k4o7l4R6O0r1JJ42k18J60j4M0j10j8J05j36m3pR5n4N9q8L6J8L4O0r%N7q0
$$ 193 100 85 103 173 149 82 48 144 204 113 114 256 38 198 184 224 114 96 201 65 22 15 110 56 115 27 63 81 115 175 166 166 223 143
3391A43r8L4J34Q8j72QJ78l8r5J1nQ0ok20K11p7n2K24q5q1L6K8Q2k04J49j10J20R7j52L8o9
$$ 143 45 79 213 301 129 137 315 277 182 193 188 268 262 42 253 176 124 348 263 182 218 246 328 124 273 163 283 380 228 266 197
3003A97k4M92j02k86O7O4J9M5j46J54L3m2KJ11K56L37J0O21K033M28q31j637q23n20k03j58
$$ 197 173 665 563 277 344 408 427 472 326 480 513 471 473 584 840 1177 1187 1808 3841 4269 3438 1801 978 458 255 97
2677I7K61N77P63j040L190j7k216o79q8k75K6P5m8j37q2oQ9p2n5oL1r2M3n7J40j92L0q7mQ
$$ 97 358 935 1698 658 3848 3831 1615 936 848 573 599 674 626 489 407 401 490 418 363 357 388 296 339 282 422 230 260 173 169 177
2301A77O3J04n9lj35J27j89J33Q5j79J42r3o1R6r4m0Q2k5J6Q6kj19j5J4j7J00r6m3O1J3q3
$$ 177 240 344 285 282 147 274 85 218 303 124 266 173 112 208 114 74 156 131 147 233 231 112 97 111 94 194 98 55 116 129 46
1913D6J4J87n5j02n6M4M3J43j6r3m7j0o7L8Q0j18J24L3q9K5j8m4l8J12M1q9P0N7K9L5oQ9J70
$$ 46 60 247 192 90 34 78 121 264 248 155 108 98 31 69 149 31 155 188 99 124 106 62 24 136 177 88 158 215 244 279 273 362 532
1500E32k89J4j59k6O5kO0r8J67k9j60P0mj41J4J23jq1J34j01O2K7m7m9Q0J31j38r8J5O3J2
$$ 532 243 257 98 72 137 135 195 97 264 235 75 145 141 0 14 137 136 55 189 88 150 177 130 81 161 292 154 56 71 134 146
1112A46j17P7m0J14o4Ok5l7Q8J4OQ0k15J19q4J3M1O0j04k6M6l2l8J03Nk8pm7J12J12j07j28
$$ 146 29 106 66 180 116 122 97 60 148 162 168 248 33 152 68 81 122 182 78 52 98 66 28 131 136 108 101 54 166 278 171 43
711D3Q3n8JJ31Mj54J29Jr3N0p4lm0J37n5n1M3m1l2mK6O1L1m9j5n1Q6Q6n4jq8K5Nn3J10O4m
$$ 43 126 68 69 200 204 50 179 180 87 137 63 60 20 157 102 51 94 53 21 17 43 104 135 86 71 20 106 192 138 137 49 74 79 26 136 200 196
248A96On5o0K7P3k7l6p9Q1rO6j36K9J24j6j04M8l6pJ4l1N3O7l3j2j12M6K6M1K3q8l7rJ3RL3
$$ 196 202 147 87 114 187 160 124 45 126 117 183 47 76 200 184 80 128 92 85 99 68 121 188 155 143 31 77 103 144 167 79 42 33 46 55 88
-203H8Q9m9l1PN5M7l6p4k8Q0q4l5j6K6J3
$$ 88 177 128 97 104 159 206 170 96 68 148 64 29 13 39 52
-390E2
##PAGE=	F1=-1098.99
##FIRST=	23149.952173337649583,	6007.3700543999984802,	0
##DATA TABLE=	(F2++(Y..Y)), PROFILE
6007D0M3l9kM9m1K0M9q2K0J4P9k1O7p1L9k4k5k6J24l7J09r4l4k0p2M1K6p7l0J5R7n6O6M2r1
$$ 40 83 44 42 91 50 70 119 37 57 71 150 129 196 125 164 140 115 89 213 176 285 191 157 137 65 106 132 55 25 40 137 81 147 189 98
5569I8q1K0N9L7J2M1q8N4O3l7j11Q1n5L0l7OJ02J8k3o6J2R1l0q6m9J07k4R3m2Qj15K5L9J60
$$ 98 17 37 96 133 145 186 98 152 215 178 67 148 93 123 86 92 194 212 189 123 135 226 196 110 61 168 144 237 195 203 88 113 152 312
5143C12j06n7r8l3J62p4j8m0OPJR0K8j2l3n3rJ5nO2o7L7Qo3K3m1qJ77Q9q7j52m5Q4m9J50K2
$$ 312 206 149 51 18 180 106 88 48 54 61 62 152 180 168 135 82 73 88 83 145 78 115 123 60 83 42 34 211 300 213 61 16 100 51 201 223
4693B23j04O2j8O9j37j5N9q4Q9Jj9K8p4n5J7J53r1p7Q0l4O3R1j5j36l1J03Q6r4RoJ5m6K3j07
$$ 223 119 181 163 232 95 80 139 55 144 145 126 154 80 25 42 195 104 27 107 73 136 227 212 76 45 148 234 140 149 143 158 112 135 28
4267B8J7J2N1m6O6J55j4r0n7P2n1o9k0L0K5kk4R7NPn5m8L3m1N1ON9p5J23j05Q5o8J8k7J06
$$ 28 45 57 108 62 128 283 269 179 122 194 143 74 54 84 109 107 83 180 185 192 137 89 122 81 132 138 197 122 245 140 225 157 175 148 254
3829B54l7j94N4lpj8PJ8L8R3j08n8J61j20O1M4K2j07J8R0j20n8L6L7j2K9n3M8r7K5M2N4J1
$$ 254 217 23 77 74 67 49 56 74 112 205 97 39 200 80 141 185 207 100 118 208 88 30 66 103 91 120 67 115 18 43 85 139 150
3416A50J7m9k9oN8J15j15J7J29M1q5k6k2N4L5j99O3mm5J64Oj14M6K1J24j58Q5j33J58K7o3
$$ 150 167 118 89 83 141 256 141 158 287 328 243 217 195 249 284 85 148 144 99 263 269 155 201 222 346 188 273 140 298 325 262
3028B62j3lJ3L20j24j70j6K89K5j32m0K6L0L9o6N2J36M40Q4M36J768M07o50j557p40m06k39
$$ 262 249 246 259 579 455 285 269 558 583 451 411 437 467 506 440 492 628 1068 1152 1588 3356 3763 3113 1556 816 410 171
2690A71o8L69L72P37q98K923N4k088o27k22j44j02Q9O6p7k58k7J21K5r8k9M2q1Q3q0J97r8
$$ 171 103 472 844 1581 683 3606 3660 1572 945 723 579 477 566 632 555 297 270 391 416 318 289 331 250 333 253 450 352
2352C52o5j07n9k1J21Q1p2J09l05K21j62Q9J42k35J10j1p2Q1k3k6j3k0Q4N4M8j46j4o9L3K0
$$ 352 287 180 121 100 221 302 230 339 34 255 93 182 324 89 199 188 116 197 174 148 135 115 199 253 301 155 141 72 105 125
1976A25Qn3m1P7q3L7J52j1r3r1N0NJ10K1Pr7r6llO2p3J15M2n2%lq0j7J47N9j40NJ17M4N9p
$$ 125 133 80 39 116 33 70 222 211 118 27 77 82 192 213 220 123 27 24 21 83 10 125 167 115 115 112 32 15 162 221 81 86 203 247 306 299
1525B99O6K56l25L1j42j58P5L5L8j17J35P2k33J23k9r3JR1P6j53M7m7J45K2q0p3J49Q0j41
$$ 299 365 621 296 327 185 27 102 137 175 58 193 265 32 155 126 33 34 125 201 48 95 48 193 215 135 62 211 291 150
1162A50j17N2M2M8p0Kl8P8jl0ro8Q7P6j5J06j96P2j56J56k5P7j40m7P1m1PlQ2jNm6M7J47j18
$$ 150 33 85 127 175 105 107 69 147 146 116 107 39 126 202 187 293 97 169 13 169 144 221 81 34 105 64 71 68 150 149 154 108 155 302 184
724A84p8P9j35J00N2q6k0pL9q6Q9p3K5rQ9k4j11Q0n7k4jO1M7op2J7o3R0K8o4J10j62NQ2o4
$$ 184 106 185 50 150 202 116 96 89 128 42 131 58 83 74 163 139 28 108 51 27 26 87 134 128 56 73 10 100 128 64 174 12 17 99 35
286C5N5Q6k2kLj14K6Q7j8j1q4R5j6J08j18r2J65Op8k4K5L1O0j15k0J12k1l4o9L6M5k0Ol9k0
$$ 35 90 176 154 152 155 41 67 154 136 125 41 136 120 228 110 18 183 189 111 87 112 143 203 88 68 180 159 125 56 92 137 117 123 84 64
-152F4QpNN7J8k8j5K9M3N3l4o5k6R6j27n2L6J9m
$$ 64 72 65 70 127 145 117 102 131 174 227 193 128 102 198 71 19 55 74 70
-390G0
##PAGE=	F1=-1193.34
##FIRST=	23149.952173337649583,	6007.3700543999984802,	0
##DATA TABLE=	(F2++(Y..Y)), PROFILE
6007F6J4l7L4n2L3NO7q9N4m3N1m6J14J1lr6KqJ14p1J06n3p6Q1n9J3M7n4o3M6J7o7Q5M1j07
$$ 66 80 43 77 25 58 63 130 41 95 52 103 57 171 182 179 83 85 77 191 120 226 173 97 178 119 132 179 125 62 108 125 58 143 184 77
5569G7l0nJ13P2p3j0m6Q4On8p7R6pNj5R3M5j45m2j9N5R7q2o7k1J03l9J03l3O7j25n3M6J60
$$ 77 47 42 155 227 154 144 98 182 188 130 53 149 142 147 132 225 270 125 83 64 119 216 134 67 46 149 110 213 180 247 122 69 115 275
5143B75p6m6j14nJ73q1o8pQ1pj05J61J2J2p6l2qM1o5R3jr5L8l1K8pl9J13J11l9j34o3O4m1
$$ 275 199 153 39 34 207 126 58 51 132 125 20 181 193 205 129 97 89 130 65 158 157 62 100 69 97 90 51 164 275 236 102 39 103 62
4718F2Q7j1k8R3o9P1j57K2om9J00L2Rl2o7nj9J43o3j06P6m4J15J4L7j53mJ12Q6j06k4k8M0
$$ 62 149 138 110 203 134 205 48 70 64 15 115 147 156 124 57 52 33 176 113 7 83 39 154 168 205 52 48 160 246 140 116 88 128
4305A28n1J9q0M6j1P3l3J4K04l0j41J1J01r6r6l7O2M3m4k7J75m2l6p8RL6p3O0J2J20j69J56
$$ 128 77 96 16 62 51 124 91 105 309 279 138 149 250 154 58 21 83 126 82 55 230 188 152 74 83 119 46 106 118 238 69 225
3904B25o3J28p9k9l6Q1j7j13mQq8L9j9O9l1P8r7J6M7k4j2Q2lq5L5O4r8k7M8K1K3J7p2Q7q8
$$ 225 162 290 211 182 146 227 210 97 93 101 13 52 33 102 71 149 52 68 115 91 79 161 158 73 108 172 74 47 95 116 139 156 84 171 83
3466H3O1j14J9Q7J6j01N7m4L5O8m9N4M2R4j8j4p2O5N6k19J03j28J47l1L6l1m1N0J07n5L9o1
$$ 83 144 30 49 136 152 51 108 64 99 167 118 172 214 308 290 276 204 269 325 106 209 81 228 197 233 202 161 211 318 263 302 241
3065B41O3M8l0k3J9%J60o3j47RL83N6l00kJ0J3O0Nl0oM17J72M56J547L48n23j357q84k50k56
$$ 241 304 352 322 299 318 318 478 415 268 277 660 716 416 414 424 437 497 502 472 466 883 1055 1511 3058 3406 2883 1526 642 392 136
2690A36m5M41L45O38p55K786rj990n38l78l1j70L3J48K6k31j96M9J23q6o9J8n3O0j2J92M0
$$ 136 91 532 877 1515 760 3546 3537 1547 1009 631 600 430 463 611 637 406 210 259 382 296 227 245 192 252 240 432 472
2352D72r3k07J4p1M8J06r0J27k30J48j27R1J42j70l0M2n3N2J6K3o4NN2M9P8j65Q6o5n3k8P7
$$ 472 379 172 186 115 163 269 179 306 76 224 97 188 330 160 130 172 119 171 187 210 146 151 203 252 330 165 251 186 133 105 182
1963A82l8n0j3LJR0L6o8j03L7K0J9J0J12j02l8p9KK7J5NJ9K7o8M9p0O2J10Lj86O1J22lK9L5
$$ 182 144 94 81 84 85 175 211 143 40 77 97 116 126 238 136 98 19 21 48 63 68 87 114 46 95 25 87 197 200 14 75 197 194 223 258
1525B58R3L15l00m1q7j27l7J34l4j04M2J18j67R0j6q0M1kJ91j32j40P6Q5M0j04m5J62M1j63
$$ 258 351 666 366 325 238 111 74 208 174 70 112 230 63 153 137 57 98 96 287 155 15 91 176 216 112 67 229 270 107
1162A07r1O1L3O9m7rm3L5Nj5L6j22O7J15m0Q2j10Mj21J80lO0j62m2M3l8P3r4J13L5J3m6rJ44
$$ 107 16 77 110 179 132 123 80 115 120 105 141 19 86 201 161 243 133 137 16 196 193 253 91 49 92 54 127 33 146 181 194 148 139 283
736B83j31PQ6k02J51Jj07P8p7on0P9m1k6P1O3mj25O9m6ml5N3N2k7o7L5m2J33J7j50J40j65
$$ 283 152 159 245 43 194 195 88 166 89 83 33 112 71 45 116 179 175 50 119 73 69 34 87 139 112 45 80 38 171 188 38 178 13
323A3K7N6m0j2R5k2l4P1j13j2P6J6L5q1J06m9J27j01j22J33J4l7r4O4L9Q1j62K0J15k6m8n1
$$ 13 40 96 56 44 139 117 83 154 41 29 105 121 156 75 181 132 259 158 36 169 183 146 52 116 155 236 74 94 209 183 135 84
-77H4N2K4m9j9%l5L6jl8R9n0m2M2M5L0N5n5n9K6J02j59m5K4J8l
$$ 84 136 160 111 92 92 57 93 92 54 153 103 61 103 148 178 233 178 119 145 247 88 43 67 85 82
-390H2
##PAGE=	F1=-1287.7
##FIRST=	23149.952173337649583,	6007.3700543999984802,	0
##DATA TABLE=	(F2++(Y..Y)), PROFILE
6007H6m1k1P3q2J12l3L7p8P9n0J2n3J28N7qj88OL7P6o5M9J2r5J59l6MJ5jq1R6r3k8K9L1j5
$$ 86 45 24 97 15 127 94 131 53 132 82 94 41 169 226 218 30 36 73 149 84 133 145 50 209 173 177 192 191 110 206 113 85 114 145 130
5569A30l5l6J16J00j18m7N1L7p5m1m0J15Mk7J4J46qk47J6l7P5P5p2p3O6L3p8R9rJ21j19j03
$$ 130 95 59 175 275 157 110 161 198 123 82 42 157 161 134 148 294 286 39 55 18 93 168 96 23 89 122 44 143 134 255 136 33
5169C3N4J47n1Jj52PJ74l1j37jJ37%j38J44j2K4p7k0rP5q5M1Q6j98R3o5N1O4r1M7Q1J0o0n2
$$ 33 87 234 183 184 32 39 213 182 45 44 181 181 43 187 175 199 122 102 93 168 83 124 210 12 105 40 91 155 64 111 192 202 142 90
4743I0J0lj0J8l1Q1o0P3j41N0n5L5O0J0J9o7m1L4n7J18oq6J8k5J46q6O8j24J9J03P1j08p7
$$ 90 100 97 87 105 74 155 95 168 27 77 22 57 117 127 146 79 38 72 15 133 127 41 59 34 180 94 162 38 57 160 231 123 46
4330D6l9N4J4k4k2N7n1J07l0m1K27j2j92M6J04j13n0n1L5N7n8L7J38q7n5j1lL6o5OMJ72k04
$$ 46 7 61 75 51 29 86 35 142 112 71 298 286 94 140 244 131 81 30 65 122 64 101 239 152 97 86 83 119 54 60 64 236 32
$$ [...]
-390A22
##END NTUPLES=	nD NMR SPECTRUM
##END=	
##END=	
