##TITLE=	Jun21-2022.43.fid
TM-VI-391, CDCl3, 13C

##JCAMP-DX=	6.0	$$ MestReNova 14.3.0-30573
##DATA TYPE=	LINK
##BLOCK_ID=	1
##BLOCKS=	2    
##ORIGIN=	Mestrelab Research S.L.
##OWNER=	hrzepa
##$MNOVA/LINK_BLOCK_TYPE=	ITEM	$$ NMR Spectrum
##$MNOVA/ITEM/POLYGON=	(XY..XY)
5321,5835
8722,5835
8722,8208
5321,8208
5321,5835
##$MNOVA/ITEM/Z=	0
##$MNOVA/ITEM/ANGLE=	0
##TITLE=	Jun21-2022.43.fid
##JCAMP-DX=	6.0	$$ MestReNova 14.3.0-30573
##BLOCK_ID=	2
##DATA TYPE=	MNOVA NMR VIEW DATA
##DATA CLASS=	MNOVA VIEW DATA
##$MNOVA/ITEM/ZOOM/X=	-20.698776542268014111,	240.66949999422217843
##$MNOVA/ITEM/ZOOM/Y=	-98.858091354370117188,	1040.4072494506835938
##END=	
##TITLE=	Jun21-2022.43.fid
##JCAMP-DX=	6.0	$$ MestReNova 14.3.0-30573
##BLOCK_ID=	3
##DATA TYPE=	NMR SPECTRUM
##DATA CLASS=	XYDATA
##NUMDIM=	1
##ORIGIN=	Bruker BioSpin GmbH
##OWNER=	nmr
##.OBSERVE FREQUENCY=	100.69424847706599735
##.OBSERVE NUCLEUS=	^13C
##.SOLVENT NAME=	CDCl3
##.PULSE SEQUENCE=	zgpg30
##LONGDATE=	2022/06/22 02:54:00.000
##.ACQUISITIONMODE=	SIMULTANEOUS (DQD)
##$ORIGINAL FORMAT=	Bruker XWIN-NMR
##$MNOVA/SCALES_VERSION=	9
##$PARAMETER FILE=	(acqus, ASCII, /private/var/folders/f6/rjf_tdyn2v98c5c0wvkgn4s80000gn/T/ZXQAVGTqSlOawYJsDnBYBA/43/acqus, 0)
$$ ##TITLE= Parameter file, TOPSPIN		Version 3.2
$$ ##JCAMPDX= 5.0
$$ ##DATATYPE= Parameter Values
$$ ##NPOINTS= 11	$$ modification sequence number
$$ ##ORIGIN= Bruker BioSpin GmbH
$$ ##OWNER= nmr
$$ $$ 2022-06-22 02:54:37.106 +0100  nmr@CZC10666PP
$$ $$ /opt/topspin/data/agmb/nmr/Jun21-2022/43/acqus
$$ $$ process /opt/topspin3.2/prog/mod/shimcntl
$$ ##$ACQT0= -2.01680680282977
$$ ##$AMP= (0..31)
$$ 100 100 100 100 100 100 100 100 100 100 100 100 100 100 100 100 100 100
$$ 100 100 100 100 100 100 100 100 100 100 100 100 100 100
$$ ##$AMPCOIL= (0..19)
$$ 0 0 0 0 0 0 0 0 0 0 0 0 0 0 0 0 0 0 0 0
$$ ##$ANAVPT= -1
$$ ##$AQSEQ= 0
$$ ##$AQ_mod= 3
$$ ##$AUNM= <au_zgonly>
$$ ##$AUTOPOS= <42 >
$$ ##$BF1= 100.683175
$$ ##$BF2= 400.41
$$ ##$BF3= 100.683175
$$ ##$BF4= 100.683175
$$ ##$BF5= 100.683175
$$ ##$BF6= 100.683175
$$ ##$BF7= 100.683175
$$ ##$BF8= 100.683175
$$ ##$BYTORDA= 0
$$ ##$CAGPARS= (0..11)
$$ 0 0 0 0 0 0 0 0 0 0 0 0
$$ ##$CFDGTYP= 0
$$ ##$CFRGTYP= 9
$$ ##$CHEMSTR= <none>
$$ ##$CNST= (0..63)
$$ 1 1 145 1 1 1 1 1 1 1 1 1 1 1 1 1 1 1 1 1 1 1 1 1 1 1 1 1 1 1 1 1 1 1 1
$$ 1 1 1 1 1 1 1 1 1 1 1 1 1 1 1 1 1 1 1 1 1 1 1 1 1 1 1 1 1
$$ ##$CPDPRG= (0..8)
$$ <waltz16> <> <waltz16> <> <mlev> <mlev> <mlev> <mlev> <mlev>
$$ ##$D= (0..63)
$$ 0 1 0.00345 0 0 0 0 0 0 0.06 0 0.03 2e-05 3e-06 0 0 0.0002 0 0 0 0 0 0
$$ 0 0 0 0 0 0 0 0 0 0 0 0 0 0 0 0 0 0 0 0 0 0 0 0 0 0 0 0 0 0 0 0 0 0 0 0
$$ 0 0 0 0 0
$$ ##$DATE= 1655862876
$$ ##$DE= 6.5
$$ ##$DECBNUC= <off>
$$ ##$DECIM= 760
$$ ##$DECNUC= <off>
$$ ##$DECSTAT= 4
$$ ##$DIGMOD= 1
$$ ##$DIGTYP= 12
$$ ##$DQDMODE= 0
$$ ##$DR= 21
$$ ##$DS= 4
$$ ##$DSPFIRM= 0
$$ ##$DSPFVS= 20
$$ ##$DTYPA= 0
$$ ##$EXP= <c13q>
$$ ##$F1LIST= <111111111111111>
$$ ##$F2LIST= <222222222222222>
$$ ##$F3LIST= <333333333333333>
$$ [...]
$$ ##$Sgu3PowerLevels= (0..7)
$$ 0 0 0 0 0 0 0 0
$$ ##$Sgu4PowerLevels= (0..7)
$$ 0 0 0 0 0 0 0 0
$$ ##$Sgu5PowerLevels= (0..7)
$$ 0 0 0 0 0 0 0 0
$$ ##$Sgu6PowerLevels= (0..7)
$$ 0 0 0 0 0 0 0 0
$$ ##$Sgu7PowerLevels= (0..7)
$$ 0 0 0 0 0 0 0 0
$$ ##$Sgu8PowerLevels= (0..7)
$$ 0 0 0 0 0 0 0 0
$$ ##$SguType= 3
$$ ##$ShimPowMaxUA= (0..63)
$$ 130000 130000 130000 130000 130000 130000 130000 130000 130000 130000 130000
$$ 130000 130000 130000 130000 130000 130000 130000 130000 130000 0 0 0 0
$$ 0 0 0 0 0 0 0 0 0 0 0 0 0 0 0 0 0 0 0 0 0 0 0 0 0 0 0 0 0 0 0 0 0 0 0 0
$$ 0 0 0 0
$$ ##$ShimPowMaxUC= (0..63)
$$ 130000 130000 130000 130000 130000 130000 130000 130000 130000 130000 130000
$$ 130000 130000 130000 130000 130000 130000 130000 130000 130000 0 0 0 0
$$ 0 0 0 0 0 0 0 0 0 0 0 0 0 0 0 0 0 0 0 0 0 0 0 0 0 0 0 0 0 0 0 0 0 0 0 0
$$ 0 0 0 0
$$ ##$ShimPowMaxUG= (0..63)
$$ 524287 524287 524287 524287 524287 524287 524287 524287 524287 524287 524287
$$ 524287 524287 524287 524287 524287 524287 524287 524287 524287 0 0 0 0
$$ 0 0 0 0 0 0 0 0 0 0 0 0 0 0 0 0 0 0 0 0 0 0 0 0 0 0 0 0 0 0 0 0 0 0 0 0
$$ 0 0 0 0
$$ ##$ShimPowRcbType= 3
$$ ##$ShimPowRes= (0..63)
$$ 1e-20 1e-20 1e-20 1e-20 1e-20 1e-20 1e-20 1e-20 1e-20 1e-20 1e-20 1e-20
$$ 1e-20 1e-20 1e-20 1e-20 1e-20 1e-20 1e-20 1e-20 0 0 0 0 0 0 0 0 0 0 0 0
$$ 0 0 0 0 0 0 0 0 0 0 0 0 0 0 0 0 0 0 0 0 0 0 0 0 0 0 0 0 0 0 0 0
$$ ##$ShimPowRng0= (0..63)
$$ 1 1 1 1 1 1 1 1 1 1 1 1 1 1 1 1 1 1 1 1 0 0 0 0 0 0 0 0 0 0 0 0 0 0 0 0
$$ 0 0 0 0 0 0 0 0 0 0 0 0 0 0 0 0 0 0 0 0 0 0 0 0 0 0 0 0
$$ ##$ShimPowRng1= (0..63)
$$ 1 1 1 1 1 1 1 1 1 1 1 1 1 1 1 1 1 1 1 1 0 0 0 0 0 0 0 0 0 0 0 0 0 0 0 0
$$ 0 0 0 0 0 0 0 0 0 0 0 0 0 0 0 0 0 0 0 0 0 0 0 0 0 0 0 0
$$ ##$ShimPowRng2= (0..63)
$$ 1 1 1 1 1 1 1 1 1 1 1 1 1 1 1 1 1 1 1 1 0 0 0 0 0 0 0 0 0 0 0 0 0 0 0 0
$$ 0 0 0 0 0 0 0 0 0 0 0 0 0 0 0 0 0 0 0 0 0 0 0 0 0 0 0 0
$$ ##$ShimPowRng3= (0..63)
$$ 1 1 1 1 1 1 1 1 1 1 1 1 1 1 1 1 1 1 1 1 0 0 0 0 0 0 0 0 0 0 0 0 0 0 0 0
$$ 0 0 0 0 0 0 0 0 0 0 0 0 0 0 0 0 0 0 0 0 0 0 0 0 0 0 0 0
$$ ##$ShimSysFunc= (0..63)
$$ 1 2 3 4 5 7 9 11 15 16 8 10 12 14 6 17 13 18 19 20 0 0 0 0 0 0 0 0 0 0
$$ 0 0 0 0 0 0 0 0 0 0 0 0 0 0 0 0 0 0 0 0 0 0 0 0 0 0 0 0 0 0 0 0 0 0
$$ ##$ShimSysMatrix= 0
$$ ##$ShimSysType= 1
$$ ##$TFXNUM= 0
$$ ##$TRIPLO2= 0
$$ ##$VTU= 2
$$ ##$VTUETH= <149.236.99.20>
$$ ##$VTUTY= <no>
$$ ##$WBREFAM= (0..15)
$$ 135 116 100 100 100 100 100 100 100 100 100 100 100 100 100 100
$$ ##$WBREFLM= (0..15)
$$ 0 0 0 0 0 0 0 0 0 0 0 0 0 0 0 0
$$ ##$WBREFPH= (0..15)
$$ 71.66 -68.25 0 0 0 0 0 0 0 0 0 0 0 0 0 0
$$ ##$WBSGU= (0..15)
$$ 0 0 0 0 0 0 0 0 0 0 0 0 0 0 0 0
$$ ##$XFAC= 2
$$ ##END=
$$ 
##$DECIM=	760
##$DSPFVS=	20
##XUNITS=	HZ
##YUNITS=	ARBITRARY UNITS
##FIRSTX=	24231.369385662510467
##LASTX=	-2084.0185409410978536
##DELTAX=	-0.40154708059210514337
##XFACTOR=	1
##YFACTOR=	0.045723551974548297394
##FIRSTY=	11.664560317993164063
##MINY=	-4.2756099700927734375
##MAXY=	945.82476806640625
##NPOINTS=	65536
##XYDATA=	(X++(Y..Y))
$$ [...]
16963A084j45j12r1p7o8n2k9pLLjlLJ3J4nl3n3n3l7j4QJ6J0jnpj2j9k0j0JRJ8K5L0L4L9M3
16947D99M2M0M8P3J18J75K11J81O6q3j84j98j59j19r9q5p8p7p4n5k2QK6L1K2Qlk%rk2k3j1
16934B45%KJMQN%%KPJ1J5J2%j3j7j3pjQJ7J7J3PMlj7k8l2k7j8j0lJNQJ5J9J3kj6k0j9j3kJ2
16915A90K4K3J5Moj2j6j2jOKj1j9j5kJ3J9J8J3J1J3J5J2NJMN%j2k1k8l3m0m3l2j1RJ5J0%j1
16899A02k2k7k0kJ2J5Mqj6j3jJ1J4J0Klrj6j4%K3L7L3J8KpnQJ7J8J1QJ4K0J6Kj2j7j7j0nj
16882A72jkj%Jlnok%LOOLnrj0qJJ6L2M3L8K4J7J9K2J6%j2j6j1mJMLLMKjpj0j2j5k0j9j1KJ0
16862B58J1J0PNjpj3j4rkNPMkj0j2j1lQK0L1L3K4PmlJ2L1M1L2Ml1n0m4k7j2omKOMmj8k8l1
16844B16k1pQJ9K4K3J6J0Npk3l8l9k4mJ0J4J2NJLJ3J7Qnj3j0%QO%qj0j3j7k3k6k6k5k0j0Q
$$ plain form
16963 1084 939 827 736 659 591 539 510 503 506 509 508 505 508 521 535 530 497 444 391 354 340 348 364 374 373 368 361 349 330 310 300 301 310 328 353 383 417 456 499
16947 499 541 581 629 702 820 995 1206 1387 1453 1370 1186 988 829 710 611 526 448 371 297 242 220 228 254 285 307 315 312 310 310 301 279 256 245
16934 245 245 247 248 252 260 265 265 265 267 274 285 300 312 312 299 282 269 262 261 269 286 303 316 323 327 324 307 279 247 220 202 192 189 190 195 203 218 237 250 248 232 212 193 180 178 190
16915 190 214 237 252 256 250 238 222 210 209 215 217 206 187 172 170 183 202 220 233 244 257 272 284 289 290 294 299 299 287 266 238 205 165 122 90 79 88 103 113 113 102
16899 102 80 53 33 31 43 58 62 54 38 25 24 35 49 59 61 58 49 33 19 19 42 79 112 130 132 125 120 128 145 163 174 182 196 216 232 234 222 205 188 178 173 172
16882 172 171 169 168 168 169 166 161 155 153 153 156 162 168 171 166 157 147 139 140 156 188 231 269 293 310 329 351 367 367 355 339 328 324 325 329 332 335 339 341 340 333 323 311 296 276 257 246 248 258
16862 258 269 279 286 291 290 283 270 256 247 245 250 257 261 259 249 237 226 223 231 251 282 315 339 346 342 339 351 382 423 455 459 428 378 334 307 295 289 285 287 293 297 293 275 247 216
16844 216 195 188 196 215 239 262 278 288 293 286 263 225 186 162 158 168 182 194 199 200 203 216 233 241 236 223 213 213 221 227 227 219 209 196 179 156 130 104 79 59 49 57
16827E7K6L7M5N2N2M0K4J4Pkj0j0ooj3j3kJ6K1J5Njrk0l0l6l4k9k5k2j7j1nllJJ0J5R%lMJ5
16810A55K0K0J6J0KljOJ3J7J3LmqnlLJ2K2K9K2Nj5k5k3j4nLOOJoj1j4j9k5k6j2J0K5K1J0K
16793B33JMJoj2j6j9j6nJ0K4K8K7K4K3J9Roj9k0j2%RJ3J1Jj3j7pQJ0kj4j5j0j2j6k0j7pKJ0
16776A86J0QMLNPOKnoKJ8K9K9J7N%MJ0J3R%noj2k8m5m5k1J2L4M0L6K7J6J0ROlk0l1l0k1j3
16758B66qoorj2j1nkknmKJ3J9J7J3J0PKmonoqkRJ3Qkpnk%lorj0j0j0j6k0j8rjJlnlLRJ5K5
16737A92L5M0L3J7Llnj1j5j0KOKorj2j7k4k9l1l1k2nJ0J2OKRJ9K4K4K1J8J1Koj2j2j3j9k3
16721A73k0j4j0j2j2JJ5K2J5QQJ5K0J8J2M%KMlj2rLJ5J6J1Mmj6k4j8lOMkrj8k2j8mJ0J5J6
16704A87J1Mmo%NL%LJ1J5J1LKMQQMnj3j3nOJ4J5J4J0PPQPjrj2j6k6l8l6k2mKKMJ4K2J8Qoj5
$$ plain form
16827 57 83 120 165 217 269 309 333 347 354 352 342 332 326 320 307 294 292 308 329 344 349 348 339 319 289 253 219 190 165 143 126 115 110 107 104 105 115 130 139 139 136 140 155
16810 155 175 195 211 221 223 220 219 225 238 255 268 271 267 259 254 251 254 266 288 317 339 344 329 304 281 267 262 265 271 277 278 272 261 247 228 203 177 165 175 200 221 231 233
16793 233 234 238 239 233 221 205 186 170 165 175 199 227 254 278 301 320 329 323 304 284 272 272 281 294 305 306 293 276 269 277 287 285 271 256 246 234 218 198 181 174 176 186
16776 186 196 204 208 211 216 223 229 231 226 220 222 240 269 298 315 320 320 324 334 347 356 356 351 345 333 305 260 215 194 206 240 280 316 343 359 369 378 384 381 361 330 300 279 266
16758 266 258 252 246 237 225 214 209 207 205 200 196 198 211 230 247 260 270 277 279 275 269 264 258 250 248 257 270 278 276 269 264 262 262 259 253 244 234 224 214 198 178 160 151 150 151 148 143 140 143 152 167 192
16737 192 227 267 300 317 320 317 312 301 286 276 278 284 286 280 271 259 242 218 189 158 127 105 100 110 122 128 130 139 158 182 206 227 245 256 258 252 240 228 215 196 173
16721 173 153 139 129 117 105 106 121 143 158 166 174 189 209 227 239 243 243 245 249 246 234 225 228 243 259 270 274 270 254 230 212 209 215 219 217 208 190 168 150 146 156 171 187
16704 187 198 202 198 192 192 197 200 200 203 214 229 240 243 245 249 257 265 269 264 251 238 233 239 253 268 282 292 299 306 314 321 320 311 299 283 257 219 183 161 157 159 161 165 179 201 219 227 221 206
16684B06j5nNJ1J0J0RQONMjrj3pJLlj1j5j7j8j4lJ3K0J8J4J4J7J8J0kj4j9j6mRK1K0Pj1k4
16667B38k2j3m%LJ0K0K1J1kokM%oqlLPNLMNNmj6k5k2j3nlJJ1K6L1K1MqnJmj9k9k1oJnj4j8
16647A52j3mMJ1J2J1PJprpmkjJJJMJ5L1L8L0J6kj5k3k0qJ%jjMKqk1k9k6j2PJ9K3J7Qkj6k2
16628A63j7lPJ3J3J5J7J9K0K4K0J2kj3j7j1mJjmlKJoj4j9j4mMJqj6j2kPPMJKRJ6K1K0J5J4
16610B78J3RJmprj3j5j7j7j5p%OPJ3K4L2L5L1K2Rj0k1k2j4ojMQQQN%j1k3l1l0k6k0j6r%RJ5
16592A93J5RMMKoj1okj0k4l2k6j5q%J0K1K5K5K2J4KonJMjj4k1j7KK0K5J5LKPJ1J2QLmpmMP
16573B51OJmon%PJ0J1QNOORJ0J4J6J6PkojLMlj2k1k2j6kNMklnj1j9j6jJ5K2J5Kj1k0j9j6j5
16554B15k0k0rLPKKJ0J8K1K0J8J8J2Jrj6j8j6j4j2j4j9k1j3%RJ5J9K8L3K9J7LprnLRJ2J2J1
$$ plain form
16684 206 191 186 191 202 212 222 231 239 245 250 254 253 244 231 224 225 228 225 214 199 182 164 150 147 160 180 198 212 226 243 261 271 269 255 236 220 216 225 246 266 273 262 238
16667 238 216 203 199 199 202 212 232 253 264 262 256 254 258 258 252 244 241 244 251 256 259 263 268 273 269 253 228 206 193 188 185 186 197 223 254 275 279 271 266 267 263 244 215 194 188 189 184 170 152
16647 152 139 135 139 150 162 173 180 181 174 165 158 154 152 151 152 153 154 158 173 204 242 272 288 286 271 248 228 220 221 221 220 219 223 225 217 196 167 141 129 136 155 178 195 203 201 185 163
16628 163 146 143 150 163 176 191 208 227 247 271 291 303 301 288 271 260 256 257 256 252 249 251 252 246 232 213 199 195 199 200 192 176 164 162 169 176 180 181 183 192 208 229 249 264 278
16610 278 291 300 301 297 290 281 268 253 236 219 204 197 197 203 210 223 247 279 314 345 367 376 366 345 323 309 303 302 306 314 322 330 335 335 324 301 270 240 214 194 178 169 169 178 193
16592 193 208 217 221 225 227 221 210 204 202 192 168 136 110 95 87 87 97 118 143 168 190 204 206 200 195 196 200 199 185 164 147 149 169 194 209 212 214 221 232 244 252 255 251 244 240 244 251
16573 251 257 258 254 248 243 243 250 260 271 279 284 290 296 305 315 329 345 361 368 366 360 359 362 366 363 351 330 308 292 290 295 299 297 294 289 278 259 243 242 257 279 294 296 285 265 246 230 215
16554 215 195 175 166 169 176 178 180 190 208 229 249 267 285 297 298 289 273 255 239 225 213 199 180 159 146 146 155 170 189 217 250 279 296 299 292 283 278 281 290 302 314 325
16537C25RMj0k7l7l5k4rJRK3L6M0K9J6J2J6J5Q%KNOkj3k4k9j9kJ2J3Mmj1j5j6j0jLJjJJoj4
16519B82j8k0k3k4j6nK%qj2j2rmKQJ0QQJ5K8L8L8K9J7NlokL%j0k0k4k4j9j0JOMlj0j6k0k0
16501A66j6pMK0L3L9L0J4Jnj0k1k7k2oQJ2J0OKJMJ3K5L0K2Ooj3j7k2k1j2kJmppopj0j3j5r
16484A62%PMnpmjqj3j0%PJ1J2J4J2QKjoj2j5j2poj1j5j5j0kOJ3J6J7J4QKnmKQQOMPPkj6k9
16464A41l0k4j7j4j0lQK0L1L6K9J5jonjKRJ9K3K2J7J7J5Oj1k3k3j2kNJ1J7J9J8J2%j6k8l1
16448B35k1j1oj2j7j3nORNkn%J1K2K5J6JqlORLrj3qjKjnlMJ5J7Nj6k7k1oMM%kjLMnk6m4m5
16428G0k3OK4K7K1J6J6J4J1Lnj1j4j6k1k6k6k1qJ1L0L7L1J9J0J0RJ0RJ2J4J4J6K4K9K5J4Q
16412C69PQKqj2j1j2j3j4j2j4k0k9l4l4k9j9oJ3K7L0K2Q%MJ1J7K0K2J5mk8m2l8k2rkMQJ2J3
$$ plain form
16537 325 334 338 328 301 264 229 205 196 197 206 229 265 305 334 350 362 378 393 401 401 403 408 414 412 399 375 346 327 325 337 350 354 350 339 324 308 298 297 300 301 300 301 302 296 282
16519 282 264 244 221 197 181 176 178 178 170 158 146 137 133 135 143 153 161 169 184 212 250 288 317 334 339 336 330 328 331 331 321 301 277 253 234 224 225 231 235 232 222 206 186 166
16501 166 150 143 147 167 200 239 269 283 284 279 269 248 221 199 193 201 213 223 229 231 232 236 249 274 304 326 332 326 313 296 274 253 241 239 240 236 229 222 216 209 199 186 171 162
16484 162 162 169 173 168 161 157 156 148 135 125 125 132 143 155 169 181 189 191 190 184 172 157 145 138 132 121 106 91 81 79 85 98 114 131 145 153 155 150 146 148 156 164 170 174 181 188 186 170 141
16464 141 111 87 70 56 46 43 51 71 102 138 167 182 181 175 170 169 171 180 199 222 244 261 278 293 299 288 265 242 230 228 233 244 261 280 298 310 310 294 266 235
16448 235 214 203 197 185 168 155 150 156 165 170 168 163 163 174 196 221 237 238 230 227 233 242 245 236 223 215 214 216 215 210 207 211 226 243 248 232 205 184 178 182 186 186 184 183 186 190 185 159 115 70
16428 70 47 53 77 104 125 141 157 171 182 185 180 169 155 139 118 92 66 45 37 48 78 115 146 165 175 185 194 204 213 225 239 253 269 293 322 347 361 369
16412 369 376 384 386 378 366 355 343 330 316 304 290 270 241 207 173 144 125 119 132 159 189 211 219 219 223 234 251 271 293 308 304 276 234 196 174 165 163 167 175 187 200
16396B00Omj4rRL1M1L4K2J2RP%pj0njK%JNJ1Qkj4k3k4k2k0j6j3j5k0k4k1j3qqj1oQJ8J9J0
16378A43QJ4K0J8QNJ0K0K2J3%j5k9l8m1l5k6j4MK5M2M2K6jj9k3j3%QRPMlrj3oJ1K7L0J9J0
16362B60O%prKK2L4K8Pk0l9m9n3n5n4m6k8jK3M3M8M2L0K0J2N%JQJ5J9J5J0Jnnoj3k5l1k0M
16345A89K5L2K8K0J6J3Oj0k5l1k3rLJ1J6J3lj8k0qNJ0PQQLnj1oPK1K8K4J8J4J5J3RJ0J6K2
16329D41J7J1QJ0J5J6J9L5P0J12J31R7J3p6j22j16r1p8q1q1o4m1j9pkJLNOJ1J9K7K7K0RK%
16314C47NJ0J1PklQL5O6R5J27J75K20K19J30k4j66k26k01j42r4o5m5k9k2k0k0k5l4m0l2j9
16301B46rmJRJ6J5J0ONLjmpj0j3rjJ2K1K2K0J8J5J2Okj0j5j3olqk1k6j9kJ3K1J8J2Knqpmk
16282B94JMNOPQPLpj7k2j3KJ3J2PPRMpj6j4rnkLRRRJ2J9J9J2Klkll%MKqj9j9j2opoKJ6K8L1
$$ plain form
16396 200 206 202 188 179 188 219 260 294 316 328 337 344 344 337 327 322 321 323 323 324 329 340 348 346 332 309 285 263 243 227 214 199 179 155 134 121 113 105 94 88 96 114 133 143
16378 143 151 165 185 203 211 216 226 246 268 281 281 266 237 199 158 123 97 83 87 112 154 196 222 221 202 179 166 166 174 183 190 194 191 182 169 163 174 201 231 250 260
16362 260 266 266 259 250 252 274 308 336 343 323 284 235 182 127 73 27 -1 -2 21 64 112 154 184 204 216 221 221 222 230 245 264 279 289 290 285 280 274 261 236 205 185 189
16345 189 214 246 274 294 310 323 329 319 294 263 240 231 234 245 261 274 271 253 233 225 230 240 247 255 263 266 261 250 244 251 272 300 324 342 356 371 384 393 403 419 441
16329 441 458 469 477 487 502 518 537 572 642 754 885 982 995 919 797 681 590 512 431 350 286 245 226 219 217 218 221 226 232 243 262 289 316 336 345 347 347
16314 347 352 362 373 380 378 375 383 418 484 579 706 881 1101 1320 1450 1426 1260 1034 833 691 597 532 487 458 436 416 396 371 337 297 265 246
16301 246 237 233 234 243 259 274 284 290 295 298 297 293 286 276 263 254 253 265 286 308 328 346 361 373 379 377 367 352 339 333 330 322 301 275 256 254 267 288 306 318 320 315 307 300 296 294
16282 294 295 299 304 310 317 325 332 335 328 311 289 276 278 291 303 310 317 326 330 323 307 293 284 279 277 280 289 298 307 319 338 357 369 371 368 366 363 360 360 364 366 358 339 320 308 302 295 289 291 307 335 366
16261C66K6J3qk2k5j7pjMJ4L0N0P3R9J16J32J61J94J88J04l6j54j90j61j21j02r1p7o0m8m1
16249D09l3k9l7m4l9k1ojKKK%%MPNlj0pMJ9K6J7ok4k5j3qj4k1j7%J8K8K3J1lj1j7k6l1l0j5
16232H6JJ5K7L5L9L3J7lj9k9k5j2JNOJ3K7L3L0K0J2KnnQJ9K2J5RQJ3K2L8N0N8P4J00J13Q1
16216I34%q4j23j12q1n4m3l7l2k5j4nmj2j9k1j6rkOQJ0J6K5L0K5J3jqqm%mqjJ4K3J7kj9k7
16200C46k9k6j5OK3K2Qkllj4l1m1l7k2rLQPjpj1pkMRJ0KnoJMJnnLJ4J9J8J0jlLJ1J6J2Jol
16180B67RJ5J1krqnmqj0j0oJJ0J2RKkmqqokNJ3K0J7Kj9l7m4l9k3lJ1J2J1J1RKpj5k1k8l4l2
16161E5j9qLJ3K2K5K1J7J7K0K3K2J5kj8k4j4LJ5K2K6K5J7OkjLLlj7l1l2j8lPJ1J1J3J4J5J7
16145B69J6Qjnoprj0nJRJ5J1jj6k5k6k5k3j6kQPmj1j0pnjPJ6K1J6QOPRPKLQJ4J3Plj6k4k2
$$ plain form
16261 366 392 405 397 375 350 333 326 325 329 343 373 423 496 595 711 843 1004 1198 1386 1490 1454 1300 1110 949 828 726 635 558 498 450 409
16249 409 376 347 310 266 227 206 200 199 201 203 205 205 205 209 216 221 218 208 201 205 224 250 267 261 237 212 199 191 177 156 139 139 157 185 208 219 216 205 188 162 131 101 86
16232 86 87 102 129 164 203 236 253 250 231 202 177 165 166 171 177 190 217 250 280 300 312 314 309 304 312 331 353 368 377 385 398 420 458 508 566 640 740 853 934
16216 934 934 850 727 615 534 480 437 400 368 343 329 324 320 308 289 268 252 243 241 247 255 265 281 306 336 361 374 373 365 357 353 353 349 341 340 354 377 394 392 373 346
16200 346 317 291 276 282 305 327 335 333 330 327 313 282 241 204 182 173 176 184 191 190 183 172 165 163 167 176 186 188 183 177 178 182 183 178 173 176 190 209 227 237 236 233 236 247 263 275 276 270 267
16180 267 276 291 302 300 291 283 278 274 266 256 246 240 241 251 263 272 274 272 268 260 252 246 244 249 262 282 299 301 282 245 201 162 139 136 147 159 170 181 190 192 185 170 149 121 87 55
16161 55 36 28 31 44 66 91 112 129 146 166 189 211 226 224 206 182 168 171 186 208 234 259 276 282 280 279 282 285 282 265 234 202 184 181 188 199 210 223 237 252 269
16145 269 285 293 292 287 281 274 265 255 250 251 260 275 286 285 269 244 218 193 170 154 152 160 167 163 152 142 135 130 129 136 152 173 189 197 203 210 219 226 228 231 239 253 266 273 270 254 230 208
16126B08j4noj1j2p%N%j0k0k3j8pOJ3J7J9K2K2J7QMNLlj1j0lKMJknkPJ8K2J8J1Nkrj2qJMP
16106B49RRJj6k4j9kJ1J1OlooKRJ5J2Krj7j3LJ8J9Nj3j8qOJ6K0J4Jj7l0l2k9k5k5k0pRK1K2
16089A51J4JmMJ3J6RKjkmkOJ7K6L0K8K0Plrrj1j5j8j9j7qKQJ3J7K3K2J6Lqj5j7j3kRJ5J5J6
16071C26J3QLjrj5j3lPNnj3j4j5j6j6j1n%JKLLNJ0J2RJj0j5j4lRJ3Npj6j6j1lNLoj8k1j7p
16052A43NROnj4j5j2j3j6j7qLJ4K1K4K2J6QKLRJ2Qnj7j9j0MJ4J8K2J9J1lrjJ5K4J9%j5k1j9
16035B32j2pon%OJ2J4Qlj4j9j7mJ1K3K8L0L3L4K9J8Mrk3l4m0l7k9j9nRJ7J1lj6k2k1j4kJ3
16018A71K5K1Mj3j7j1kKNJ0J5K0J9J2jj4j2JJ3J5Plqj0j0j0rppm%J%j%QJ8K4K1J0JJJjnom
15999B70oj2j3qjJkoj0j2j3j4j8k1j4kQRLJNJ2J7K0K6K7K2J3QJ2J2Onj1q%PJ7K3J9Nj3k3k4
$$ plain form
16126 208 194 189 183 172 160 153 153 158 158 148 128 105 87 80 86 99 116 135 157 179 196 204 208 213 216 213 202 192 189 191 195 196 194 189 187 194 212 234 252 263 268 266 257 245 237 238 242 249
16106 249 258 267 268 252 228 209 207 218 229 235 232 226 220 222 231 246 258 260 251 234 221 224 242 261 266 253 235 227 233 249 269 283 284 267 237 205 176 151 126 106 99 108 129 151
16089 151 165 166 162 166 179 195 204 206 205 203 199 197 203 220 246 276 304 324 331 328 319 310 299 284 266 247 230 222 224 232 245 262 285 307 323 326 318 303 286 273 271 280 295 310 326
16071 326 339 347 350 349 340 325 312 309 316 321 316 303 289 274 258 242 231 226 226 227 229 232 235 240 250 262 271 272 262 247 233 230 239 252 257 250 234 218 207 204 209 212 206 188 167 150 143
16052 143 148 157 163 158 144 129 117 104 88 71 63 66 80 101 125 147 163 171 173 176 185 197 205 200 183 164 154 158 172 190 212 231 242 239 230 229 244 268 287 287 272 251 232
16035 232 220 213 207 202 202 208 220 234 242 239 225 206 189 185 196 219 247 277 310 344 373 391 395 386 363 329 289 252 223 204 199 208 225 236 233 217 195 174 160 158 171
16018 171 196 217 221 208 191 180 178 180 185 195 210 230 249 261 260 246 234 235 248 263 270 267 259 249 239 229 220 213 206 202 202 203 203 202 202 210 228 252 273 283 284 285 286 285 280 274 270
15999 270 264 252 239 231 230 231 229 223 213 201 188 174 156 135 121 119 127 136 139 140 145 157 174 194 220 247 269 282 290 302 314 320 315 304 296 296 303 320 343 362 367 354 331 307
15982C07k4k8l2k5rMPLMJ0J8J8J2Lrj8k6k4j5mKNJ3K5K9J9jj8k1j2JRJ0NkqnMJ2J1Kj0j6j2
15964B14nkknj0j3j4rmj%MJ2J9K2J4kk1k8k1kJ7K6K7K4K3K1J3jj2j7j5romlmmMJ7K3J7Nlo
15946B79nnnnjJKlj0j5j4j3j7k0j3MK1L0L1K7K2J2Kqj7k3k4k0j7j4r%J2J7J5Qlj8l2l5k8j5
15929I4nLJ3J9J8J2Loj1j0p%NJ4K4K7J8mk1k4j7nJ1K4L1K6J2lj4j4mJ0J8J5OklKJ1K0K5J6
15912C27lk2l1k9k5k0j5qKJ5K7L2K8J8Noj1j4j6j2lMJj0j8j0OJ6J2LkkLOJ3K2K7K7J9J0Lm
15895C65rj2oMJ1J1Lnrj0ojLkj0j4rnrk1k9k2nOMj1k3k2j0PK3L4L5K4Mj8l2l8l3k1r%NLoj5
15877A20j4jJ3J6J4J8L0L4K2LlOJ9K4J6%j0pJNkj0j2j2j5j7j3pmon%MLLNJ4K1K3J7PMONlj4
15858B98j7rlrk0k4j8nNRN%%OJ3J3RMJK%mj0rmJlj1j1lOJ1J4J7K2K0J8J1Lpj5j8j8j6j1mJ
$$ plain form
15982 307 283 255 223 198 189 193 200 203 207 217 235 253 265 268 259 241 215 191 176 172 174 179 192 217 246 265 264 246 225 213 214 223 233 238 236 228 223 227 239 250 252 242 226 214
15964 214 209 207 205 200 190 177 163 154 150 149 149 153 165 184 206 220 218 197 169 148 146 163 189 216 240 263 284 297 296 284 267 252 243 237 233 230 226 222 226 243 266 283 288 285 279
15946 279 274 269 264 259 258 259 261 258 248 233 219 206 189 169 156 160 181 211 242 269 291 303 305 297 280 257 233 213 196 182 173 173 185 202 217 225 222 204 172 137 109 94
15929 94 89 92 105 124 142 154 157 151 140 130 123 123 128 142 166 193 211 207 186 162 145 140 151 175 206 232 244 241 227 213 209 219 237 252 258 256 253 255 266 286 311 327
15912 327 324 302 271 242 217 197 182 174 176 191 218 250 278 296 301 295 284 270 254 242 239 243 244 234 216 206 212 228 240 243 241 239 242 248 261 283 310 337 356 366 369 365
15895 365 356 344 338 342 353 364 367 362 353 343 337 336 339 337 327 313 304 299 290 269 240 218 213 219 223 212 189 167 157 164 187 221 256 280 284 266 234 196 163 142 133 133 138 141 135 120
15877 120 106 105 118 134 148 166 196 230 252 255 252 258 277 301 317 317 307 300 301 306 304 294 282 270 255 238 225 218 214 208 203 203 207 210 213 218 232 253 276 293 300 304 310 315 312 298
15858 298 281 272 269 260 240 216 198 193 198 207 212 212 212 218 231 244 253 257 258 260 260 256 246 237 233 234 231 220 209 206 212 223 237 254 276 296 314 325 328 321 306 288 270 254 243 239 240
15839B40km%OJ0RQPQJ2J2Mj0j8j1RK6K9K1PmoJQKj3k9l2k6j7qJQJ7K1J7Poj3j2rqqpmkkoj1
15820B22j1oKJ0J3J2J0QNjj1j7j0MJ1Kj3k1j8j1mKJ0J2Lj1k3k6k6k1j5oLJ1J7J9J7Qkrj0j1
15803A18j1j1qokJ0K5L8L1Rj4k2j6qkNJ0PlrlPJ6J6J1KnokLNRK0K8K6J5J0QLpj7j9j8j6j2
15785B15oJJmrj3j7j5jJ7K9K8K1J3J5K0K1J2lj7k0k0k3l0l4k6j0NJ0QNOJ2J4J2Ooj5k1k2j9
15768A40j8j4kJ4K7L2L3L1K8J9Ork2l3l5k9k0pOJ9L0L4K8J6jj4k1k0j3jRJ6J5J0QJ1J6J7J0
15753C16Koj2j7j9k2k9l7l9l2k5k0j4kJ3K5L2L8M0L1J1rj8j7j4j4j6j5j0lQJ4J5J1J0J0QJ0
15737B04J6J8Qj2k8k6j2lKPJ1J1PNOQLnrqkPJ4J2Jj1j3lJ6L3L6K5Poj5k2k6k4j7j2j4j1MK4
15720B06L4K9J4Lkkkoj3k3l0l1k3j3%J1J6J3OjlNJ5K2J8Lj1k2k1j3mKJoj2qNK4L6L3J9Kj4
$$ plain form
15839 240 238 234 234 240 250 259 267 274 282 294 306 310 300 282 271 280 306 335 356 363 359 353 354 362 364 351 322 290 264 247 239 240 248 265 286 303 310 304 291 279 270 262 254 247 243 241 239 233 222
15820 222 211 205 207 217 230 242 252 260 265 264 253 236 226 230 241 243 230 209 191 180 176 178 188 200 203 192 169 143 117 96 81 75 78 89 106 125 142 150 148 139 129 118
15803 118 107 96 88 82 80 90 115 153 184 193 179 157 141 133 131 136 146 153 150 141 138 145 161 177 188 190 185 179 177 180 185 194 214 242 268 283 293 301 304 297 280 261 243 227 215
15785 215 209 210 211 207 198 185 168 153 152 169 198 226 247 260 275 295 316 328 325 308 288 268 245 215 181 155 145 150 160 168 173 179 191 205 217 223 217 202 181 159 140
15768 140 122 108 106 120 147 179 212 243 271 290 296 287 265 232 197 168 148 141 147 166 196 230 258 274 273 259 238 218 205 204 213 229 244 254 262 273 289 306 316
15753 316 318 312 300 283 264 242 213 176 137 105 80 60 46 44 57 82 114 152 192 223 234 225 207 190 176 162 146 131 121 118 126 140 155 166 176 186 194 204
15737 204 220 238 246 234 206 180 168 165 167 174 185 196 203 208 214 222 225 220 211 203 201 208 222 234 235 224 211 208 224 257 293 318 325 319 304 282 256 232 215 203 189 178 182 206
15720 206 240 269 283 286 284 282 280 274 261 238 208 177 154 141 141 152 168 181 187 186 183 188 203 225 243 246 235 213 192 179 175 177 178 172 160 152 157 181 217 250 269 271 257
15703B57k7l6m0l4k1nJ4L3M3L7K1OLJ2K0J9J0qk8m1m3l6l0k2j6rJRJ9K3J8O%NJ6J6QJNJ1R
15686B26jj0j3j0pomk%KPJ1J3RLnoprj4j6j1lKLMONJJRJ8K0Rjj2j9k7k9k5j2RL3N5O2N2L0
15667C41Pnqrj3j6j1onj0pMJ3Pnj0nloroKOOPJ0J0Nlpplkj4l0l4k1KK0K2J2lj5j6lJ4K4K2
15648B42J6J3Qjj1j3nPJ7K5K9K9K4J2Lqj7k3k2j5nMQJ1J4J3J2J1J1Qpk5l8m2l7k9j7qjjnp
15631A80pj1j7j9j3jJ0J3J5J2Pkp%J5K9L3K9K5J8Pnj1lJ0J6Ppj9k5k5k4k2j6rJQJ2J1RONO
15614B41QJ0J4J6J4Pknonqj7k6k8k0pOJ1J0RJ3J8K0J7J3Olj4j7rJ1K5K0jk3l8l8k8rQJ9K2
15597B34J9J5QkoJJ1J5J1Mklj%oj9k7k4j5j4k0j9j0RK3L4L6K8J3qk4k9k2pRJ4Noj1j1pkOJ3
15579B13J1jj5k3k4j5lKkrj0jJ0J6J7J6J4RPKoj3j2lMMKJMMLJNJ1J6J6J3Nnj4j7j1%RJ0OL
$$ plain form
15703 257 230 194 154 120 99 94 108 141 184 221 242 248 251 263 283 302 312 304 276 235 192 156 126 104 88 79 80 89 108 131 149 155 155 160 176 192 200 201 206 217 226
15686 226 225 215 202 192 185 179 175 173 173 175 182 193 206 215 218 213 207 200 191 177 161 150 147 149 152 156 162 167 168 169 178 196 216 225 224 212 193 166 137 112 100 109 142 197 259 311 341
15667 341 348 343 335 326 313 297 286 280 275 265 258 262 275 282 277 267 262 259 253 244 238 240 246 252 259 269 279 284 281 274 267 264 262 248 218 184 163 165 185 207 219 216 201 185 182 196 220 242
15648 242 258 271 279 278 267 254 249 256 273 298 327 356 380 392 395 387 370 347 325 310 305 309 317 328 342 355 367 378 389 397 390 365 327 285 248 219 202 194 193 192 187 180
15631 180 173 162 145 126 113 112 122 135 150 162 169 167 160 160 175 204 237 266 291 309 316 311 300 297 307 323 330 323 304 279 254 230 208 192 183 184 192 204 215 224 230 235 241
15614 241 249 259 273 289 303 310 308 303 297 292 284 267 241 213 193 186 192 203 213 222 235 253 273 290 303 309 306 292 275 266 277 302 322 321 298 260 222 194 185 193 212 234
15597 234 253 268 276 274 268 269 280 295 306 310 308 305 304 304 298 279 252 228 213 199 179 160 150 159 182 216 252 280 293 285 261 232 210 203 212 226 231 225 214 203 196 194 200 213
15579 213 224 223 208 185 161 146 143 145 143 134 124 123 133 149 166 182 196 205 212 214 208 195 183 180 184 188 190 191 195 199 202 203 208 219 235 251 264 269 264 250 233 222 222 231 241 247 250
15560B50M%rj5j5qmqj5j6mJ9M1N1M1K1Lqj2rljmj4j9j8j1oj%%%OJ8K7K5J0pj4j2j0j4k0k7
15543B12k8k7k4j8rOJ7K3J7Kj0j4qJO%j0j7j8j5j1lJ%oj4j4oOJ8K6L1K6J1oj4j0jMPQJ1QJ
15525A59pj2j4j1j1j2k0k9k9j5KJ6J7J2J1J1J0OMOJ7K9L6L2K0RLKLNOPKnj1j4j2mLNNRJ3J3
15507B67J3K0L1L3J8lj7k3l2l9m0l3k6k3j8oNPPJ1K3K9K4J2%rj1j1j2j2oPJ8J6NonLJ0J0P
15491B44OJpj2j3j0j1j3j1njlnkNJ2J7K1J9J2ONRJ2RQJ2J7J7J5J5J2kk2l3k3kJ0Nqj9k2j8
15474B47qLJ1J5J4J2Pok4m0m0k6j1pqnOJ4J7J7K0K5K3K1J9K0J8J5J5J5J5Plj3j8k0j9j4j3
15458C01j2j1p%NJ0J2J4J5J8K3K6J9Lj4k3k5k5l0l9n0n3m7l0j0RK2K9L1L1K6J4jj1j0%Mkr
15442B03j2rolkKNQJ2J5J7J1KnkRJ8J5NmkKKlj1j7k1j9j2kJlnkNQMkrj4j6j5j1pJJ4K2K1J2
$$ plain form
15560 250 254 254 245 230 215 207 203 195 180 164 160 179 220 271 312 333 336 328 316 307 304 303 299 285 266 248 237 231 230 230 230 230 236 254 281 306 316 309 295 283 273 259 239 212
15543 212 184 157 133 115 106 112 129 152 169 171 161 147 139 140 146 146 136 119 101 86 75 72 73 73 67 53 39 33 39 57 83 114 140 151 145 131 121 120 124 131 139 150 158 159
15525 159 152 140 126 115 104 92 72 43 14 -1 1 17 34 46 57 68 78 84 88 94 111 140 176 208 228 237 240 242 245 250 256 263 265 260 249 235 223 219 222 227 232 241 254 267
15507 267 280 300 331 364 382 379 362 339 307 268 228 195 169 146 128 122 127 134 141 152 175 204 228 240 240 231 220 209 197 185 179 186 204 220 225 219 214 217 227 237 244
15491 244 250 251 244 232 219 209 198 185 174 169 168 165 160 158 163 175 192 213 232 244 250 255 264 276 285 293 305 322 339 354 369 381 379 357 324 301 299 309 314 306 287 265 247
15474 247 239 242 253 268 282 294 301 295 271 231 191 165 154 147 139 134 140 154 171 188 208 233 256 277 296 316 334 349 364 379 394 401 398 385 367 347 328 314 301
15458 301 289 278 271 271 276 286 298 312 327 345 368 394 413 416 402 379 354 329 299 260 210 157 110 80 70 79 101 130 161 192 218 232 231 220 210 210 214 212 203
15442 203 191 182 176 173 171 173 178 186 198 213 230 241 243 238 236 245 263 278 283 279 277 279 281 278 267 250 229 210 198 196 197 194 189 187 192 200 204 202 193 179 163 148 137 130 131 145 167 188 200
15423B00MKjqj7j9j2jJ1J8K2K3K4K4K4J8J0jj0j7j8j5j4k0k9l0k2j1nmnnjNJ3J9K2K5K0Rp
15406B21k1k3j4JJ4K2K0Mj3k1j4jQJ1J3J9K4K6J9QknJLmj6j8lJ4J8J1%prj5j9j8oOPkj0j3
15389B16j6j8j5r%%lkLPMkprj0nLRROL%j%LLjmJJ4K5L0K6J1pk1k4k2j9j8j6j2j4j5qMJ0J0
15370A19QRROKOJ5K4K7K3J6J3J4J9J9Pj1k6l0k7k2k0j7j3lPJ0Njlpj0qjLkj2rOK3K9K4J2j
15352B32pokmj2j3kRPnj4j6j0jOJ0Nmj3j5j2oKNJrj1KJ3J2MKQJ1PKNJ1J1QJ0J3Qnj7j5nLP
15332B10J0QJpj2pJJ0J6J8J0jj3k1k4j9jJ5K0J5J1J2Qkj1qLJ2J6J2OjkLOlk5l7k9j0KL%kl
15314A90nkNJ7K4K3J2mj7k0pJ3K4K1J3OLjlMJ6K1Mk2l7l7k9k6k6k5k0qPK5L6L8K8J5OOJ4K2
15297C04K1J0jpqppnprrrpqokLKlpmKJnj2j4rkNMnj7k6k5rJ4K9L0J9J0RJ2J3P%j0j2j0lNJ1
$$ plain form
15423 200 204 206 205 197 180 161 149 148 159 177 199 222 246 270 294 312 322 321 311 294 276 261 247 227 198 168 146 135 130 126 121 116 115 120 133 152 174 199 219 228 221
15406 221 200 177 163 164 178 200 220 224 211 190 176 175 183 194 207 226 250 276 295 303 301 296 297 300 296 280 262 259 273 291 302 302 295 286 271 252 234 228 234 241 239 229 216
15389 216 200 182 167 158 158 158 155 153 156 163 167 165 158 149 139 134 137 146 155 161 164 164 163 163 166 169 168 164 165 179 204 234 260 271 264 243 219 197 178 160 144 132 118 103 95 99 109 119
15370 119 127 136 145 151 153 159 174 198 225 248 264 277 291 310 329 336 325 299 269 242 220 200 183 170 167 174 184 189 188 185 178 168 160 159 162 160 148 139 145 168 197 221 233 232
15352 232 225 219 217 213 201 188 186 195 202 197 183 167 157 156 162 172 177 173 160 145 133 127 129 134 135 126 115 117 130 142 146 148 156 167 174 176 181 192 203 211 221 234 242 237 220 205 200 203 210
15332 210 220 228 229 222 210 203 204 214 230 248 258 257 244 223 199 180 179 194 214 229 240 252 260 258 247 239 242 254 270 282 288 287 285 288 294 291 266 229 200 190 192 195 195 193 190
15314 190 185 183 188 205 229 252 264 260 243 223 216 229 253 274 287 293 296 295 292 296 312 333 337 315 278 241 212 186 160 135 115 107 114 139 175 213 241 256 262 268 282 304
15297 304 325 335 334 327 319 312 305 300 293 284 275 266 259 251 245 243 246 248 245 238 234 236 237 232 220 206 197 195 200 204 199 182 156 131 122 136 165 195 214 224 233 245 258 265 265 255 243 233 230 235 246
15277B46J3J0L%joj5k4k4j5lRJ5J7Rmj2j5j3j0nKOkj2j7j8j6nJ4L4M2L1J3MNQOlj5j7j0QK1
15259B54K4J6Kj1j6j4qqj1j0nmplMJ0QJKPJ3J5J5J1Jqj3j0nmlKOP%j4l3m1l6k1qOK1L5L8K6
15241B31J3QOK%LJ1J4QJlqj1j4j0jOOlj5k5k5k2j6rMJ4J4NlKJ2J9K2K6K8K1QkjNNnj9k6k5
15222B51k0j6j3jJ2J8J4Kpj5k3k3j5ljpj2j1kQK0L0K7Pj8l0k8j9j3oOJ9K3J3kj4j9j6qKJ0
15206A20RO%nrj3q%PRJ0PKlojJ4K6L4L2K3J1jj1j7k3k1j2OJ9J8Noqlqk1l0k4qJjnjPQM%OJ2
15186A51J4J2J1QMJOK0L4L2J6jj3j5rLJ7K9L1K3Ppj4j5j6j8j9j5j0olj%oj7k5k7k4k1j7j5
15169A05j1pkPJ2J5J7K0K3J7QjlKPJ4K0K3J7Pjlnj0j3j0nmnnllrj1rooj0qopj3j5r%LPJ2K1
15150A57K6K3J2JnlJJrj8j6lJ0J4J0JmmMJ4J6J4J5J7J6J0ORQok2k5j9j1kPJ8J8Rkrj3k0k1
$$ plain form
15277 246 259 269 272 272 271 265 250 226 202 187 184 193 208 225 234 230 218 203 190 180 175 177 183 181 169 152 134 118 113 127 161 203 234 247 251 256 264 270 267 252 235 225 233 254
15259 254 278 294 296 285 269 255 247 239 228 218 213 209 202 199 203 213 221 222 224 231 244 259 274 285 286 278 265 255 250 246 243 245 251 258 258 244 211 170 134 113 105 111 132 167 205 231
15241 231 244 252 258 260 260 263 274 288 296 297 294 286 275 261 251 250 256 262 259 244 219 194 172 156 147 151 165 179 184 181 183 195 214 236 262 290 311 319 317 316 321 326 321 302 276 251
15222 251 231 215 202 201 213 231 245 247 240 225 202 179 164 161 160 153 141 130 128 136 156 186 213 220 202 172 144 125 112 106 112 131 154 167 165 151 132 116 108 110 120
15206 120 129 135 135 130 121 108 100 100 107 116 126 133 135 132 126 125 139 165 199 231 254 265 264 253 236 213 192 180 186 205 223 228 222 214 211 203 182 152 128 120 121 120 115 114 121 129 133 133 139 151
15186 151 165 177 188 196 200 201 207 227 261 293 309 308 295 280 271 274 291 320 351 374 381 374 360 345 329 311 292 277 267 261 258 257 257 251 234 209 182 158 137 120 105
15169 105 94 87 85 92 104 119 136 156 179 196 204 203 200 202 209 223 243 266 283 290 289 286 281 271 258 248 243 239 234 229 226 223 214 203 194 188 182 172 164 158 151 138 123 114 114 117 124 136 157
15150 157 183 206 218 219 214 211 212 213 204 186 170 167 177 191 201 202 198 194 198 212 228 242 257 274 290 300 306 315 323 317 295 270 251 240 238 245 263 281 290 288 279 266 246 225
15132B25j5kNLkj0j5j4r%OPOMLKnj9l4l9l3j9j1nKJ3K2K8K8K8K6K3J7J2NLPJ1J1%j5k2k2k2
15114A84k5k6j8%J1J3RQMjpj0rmJ1K9M1L8K0Lqj5k4k8k2pRJ5J0lj3j1%M%mLJ3J2NJNJ0QNK
15096B38lj5k6k9k1qPJ6J7J3QQJ1J3J0Krk0k0j2jOQQPLmj1j1pLJ2J2Lm%J4K7L5L3K3J0%jO
15078C51J1J2QNJnqnlrk3l7l9k5qJkj0j2rkQJ6J9J3Jj1j7j5pJRJ5K2K3K0J2Korroqj1rnJJ
15058B42LJ0J8K1J3%rj5j7j6j2rj0rolljNJ1J2NJLPPNMMKlpnLJ0Qlj1j0%QJ3J4J1Nnj3j9k4
15039B35l2l7l4k4j4qpnlmo%J3K7K8J7N%MPNKLJlrj4j4rmmj2j4nJ4K6K4J3MQJ9K9L1J8%j4
15020B57j9j5j2rnKJ3J9K0J3%qqlMM%%QJ7J9Oj5l5m1m2l9l8k9j6jJ0K3L6M2L2Rj2k4k1j1J
15003A32RQL%NJ5K2K2J7J1Kmqpm%MOJoj1pJJoj3j3j2j7k4k2pJ0J5PjkRK4L9M2L7K7J5Mnj0
$$ plain form
15132 225 210 208 213 216 214 204 189 175 166 166 172 179 185 189 192 194 189 170 136 97 64 45 34 29 31 44 66 94 122 150 176 199 216 228 233 236 243 254 265 265 250 228 206 184
15114 184 159 133 115 115 126 139 148 156 160 159 152 142 133 129 140 169 210 248 268 271 263 248 224 196 174 167 176 191 201 198 185 174 174 178 178 174 177 190 202 207 208 213 223 231 236 238
15096 238 235 220 194 165 144 136 143 159 176 189 197 205 216 229 239 241 232 212 192 180 179 185 193 201 208 211 207 196 185 178 181 193 205 208 204 204 218 245 280 313 336 346 346 345 351
15078 351 362 374 382 387 388 383 375 370 367 358 335 298 259 234 226 227 225 215 203 194 192 200 216 235 248 249 238 221 206 199 200 209 224 246 269 289 301 303 297 288 279 273 265 254 245 240 241 242
15058 242 245 255 273 294 307 307 298 283 266 250 238 229 219 210 204 201 198 197 202 213 225 230 231 234 241 248 253 257 261 263 260 253 248 251 261 269 266 255 245 245 253 266 280 291 296 291 278 259 235
15039 235 203 166 132 108 94 86 79 74 71 67 61 61 74 101 129 146 151 151 155 162 167 169 172 173 170 161 147 133 124 120 116 104 90 85 99 125 149 162 166 174 193 222 253 271 271 257
15020 257 238 223 211 202 197 199 212 231 251 264 264 256 248 245 249 253 253 253 261 278 297 303 288 253 212 170 131 93 64 48 47 57 80 116 158 190 199 187 163 142 131 132
15003 132 141 149 152 152 157 172 194 216 233 244 246 242 234 227 223 223 227 233 234 228 217 210 211 212 206 193 180 168 151 127 105 98 108 123 130 129 127 136 160 199 241 278 305 320 324 319 309
14985C09pLJ0Q%j0j4j3j3j0nMJ3J5Pj0k5k6j6nJmj3k4l5l7k8j4omKJ8L5L8L1K0Rkj2j2mML
14967A81lpnkmrj1p%KMRK1L0L1K5J7Poj9k3k0j5j5j5j1pkloj0j1q%MPJ4J9J6MnnllnjLPOR
14947A75J3J5RL%jJJjnpkJ0J7J3Kpj2j3j3j4pMJ1QlrkJ2K0K1J6J0Mlppoqj3j8j7qPJ7J5Mm
14928B21rj5k1j7nRJ3J2J3J5Rnj8k2j8oPK1K9K9K5J7Qmj6k6l4l6l3k4j2%PJ1J5J9K1J4LJJ3
14911B11K9L5K6J3%j0j7j6pLJ0J3J1LkmjMOPQLpj2j0nkmqj9k8l0j9pJMQJ2Pnj1pLJ0J2J3Q
14893B29mk5m1m8m0k3nOJ2J9K8L7L7K7J5OKNJ2J6J5Pjqj1j4j3pkKMOQJ0J0PJoj5k0j9j4j2
14875A93j7k4k7k0nJ1K3K6J6Jq%J4K1J5QONJrj4j2nJMPQMjm%J1J8J9J1%qj2j2j0nlj0k6m4
14857A47n4m6k0J5M1M4L1J5M%l%PJ1Jj7k9k6j7oKJ2K0K1J4Jj1j5oJ3K8K8J6MJMPJ1J4J0jj2
$$ plain form
14985 309 302 305 315 323 323 313 299 286 273 263 258 262 275 290 297 287 262 236 220 215 216 212 199 175 140 103 75 61 55 51 53 71 106 144 175 195 204 202 190 178 174 178 181
14967 181 178 171 166 164 160 151 140 133 133 135 139 148 169 199 230 255 272 279 273 254 231 211 196 181 166 155 148 146 143 137 127 116 108 108 112 119 133 152 168 172 167 162 159 156 151 150 153 160 166 175
14947 175 188 203 212 215 215 214 215 216 215 210 203 201 211 228 241 243 236 224 211 198 184 177 181 192 200 197 188 186 198 218 239 255 265 269 266 259 252 246 238 225 207 190 182 189 206 221 225 221
14928 221 212 197 176 159 154 163 176 188 201 216 225 220 202 180 162 156 163 184 213 242 267 284 292 288 272 246 212 176 143 119 107 107 114 125 140 159 180 194 197 198 211
14911 211 240 275 301 314 314 304 287 271 264 267 277 290 301 304 302 298 297 301 307 314 322 325 318 306 296 291 289 285 277 258 230 200 181 174 175 179 187 199 206 201 190 183 186 196 208 221 229
14893 229 225 200 159 111 71 48 43 49 61 80 108 145 182 209 224 230 232 237 249 265 280 287 286 278 267 253 240 233 231 233 237 243 251 261 271 278 279 273 258 238 219 205 193
14875 193 176 152 125 105 100 111 134 160 176 177 169 169 183 204 219 227 233 238 239 230 216 204 199 200 204 211 219 223 222 218 218 229 247 266 277 277 269 257 245 235 230 227 217 191 147
14857 147 93 47 27 42 83 127 158 173 177 177 174 174 181 192 193 176 147 121 104 98 100 112 132 153 167 168 157 142 136 149 177 205 221 225 226 230 237 248 262 272 271 259
14840B59k0k1k6l0k9j6JJ4J6J0OQJ6K1J6Lj1k0k5k7k2j2%ONNJ4K5K5J5Lmpj1j4j0LJ8K3K3
14824B30K1J8J1Mknrk1l5l7k6j1mrj3qjjpmJ2K9L5L3L6L9L3J4mj1j4j8k0j1LJ1Ooj4j7j2p
14807B08moqoMJ7K5K3J2Kk%MMM%rk3l3l3k6j8j1jPRMLJ4K2K1J4RRMpk0l3l8l6k2mPQOLLjn
14788A00okRK1L0L3K9K2J5QNM%pj6k1j7j0jQJ0Kj6l5m0l0j4OK2K3J1oj3nOJ3J6J7J3P%k%J
14770A90jorj1qopj0pNJ6J7QJ%joj1j2oOJ6K7L4L4K8J1j0k6k7j9rkjkrk0k2j4lJLNJ2J4R%
14751A72nlJKjpj1j4j6j5nJ2K6L1K8K3J9J7K0J9J4KoppoojLL%jkj3l3m7m7l6j8JJ0Lj0j4m
14733G1QJ5J8J9J5Morrj4j4oKkj3j6oQJ9K8L0J9LpkNOMQJ6J9J4OJkkJJkjPJ4J4OKLJ1J5J1
14713C12Kpj5k1k9l4l6l3k2oJ8L9M9L9J6rk4k3j1KQNknlQJ7K1Rqk0k2j5pllj1j7j9j4romN
$$ plain form
14840 259 239 218 192 162 133 117 118 132 148 158 164 172 188 209 225 228 217 197 172 145 123 111 111 117 122 127 141 166 191 206 209 205 198 187 173 163 166 184 207 230
14824 230 251 269 280 284 282 277 268 247 212 175 149 138 134 125 112 104 103 102 95 91 103 132 167 200 236 275 308 322 318 307 293 275 255 244 247 258 264 258 244 227 215 208
14807 208 204 198 190 184 188 205 230 253 265 267 265 265 269 273 277 277 268 245 212 179 153 135 124 123 130 139 143 146 160 182 203 217 226 235 239 232 212 179 141 105 83 79 86 94 100 103 106 105 100
14788 100 94 92 101 122 152 185 214 236 251 259 264 268 268 261 245 224 207 197 196 204 214 216 200 165 125 95 81 87 109 132 143 137 124 119 125 138 154 171 184 191 191 189 189 190
14770 190 189 183 174 163 155 149 142 132 125 130 146 163 171 172 172 171 165 154 142 136 142 158 185 219 253 281 292 282 256 229 210 201 199 198 196 187 167 145 131 128 129 132 137 149 163 172 172
14751 172 167 164 165 167 166 159 148 134 118 103 98 110 136 167 195 218 237 254 274 293 307 309 303 296 289 283 277 276 279 282 282 281 279 266 233 186 139 103 85 86 96 99 89 75 71
14733 71 79 94 112 131 146 150 144 135 126 112 98 92 94 92 79 63 57 65 84 112 142 161 164 157 155 160 166 170 178 194 213 227 233 234 232 230 231 232 230 229 236 250 264 270 272 275 286 301 312
14713 312 314 307 292 271 242 208 172 139 117 111 129 168 217 256 272 263 239 216 205 207 215 220 218 213 210 218 235 256 265 257 237 215 200 193 190 187 176 159 140 126 117 111 107 112
14696A12J8L1M3M7M3L0J8J2J1J1J0Njj0j5j5j5j3qjKpk0k7k5k4k6k8k4j6r%QJ1J3J8K7L2K6
14680B44J2K%OR%j5k2j9qkpj8k9l6l4k4j2JJ2K4L1L2K7K0J4PjkLMlj0j2rj1j5j1kRJ4J8J9
14663B06J6J2QOMLOJ0Mj2k7l0k3j6j0rn%OJ2J5J3RL%kmqrnNJ1R%j0j7j5oJ2K8L5L2K5J6Nq
14644B95j9k4k8k9k3pJ2K6K9K2J3Llj2k3l9n2m7k5QL0L0J4kpkNQQNlqnPK0K7K7J9OopMJ3J0
14627B70kj2j6j5j4j4j7k0j9rRK4L4L4K5J6J1J4J6J1NKjj0k4k9j9nlj1k4l1l0j7lPPL%MPO
14610A60KJLOQRJ0J3J6J2POJ4K5K9K3J4RP%j4k6k6j5%NMjjkmpplklpj0j1mNRKj1j6j2mjJR
14590B22J5J1kj5j8j1lJLJmroJ2L1L4K2QQJ4J3Koljoj3j5j3j6k5k8k2j4oMJ5J9J3KoqjRJ7
14572B25K1J7Mj2k7l5k7j3lmrj0nLJ1J4J1NJLQOJJORNjqj4k2k4k0j1nKJ1K0K2J5J3J5K0K3
$$ plain form
14696 112 130 161 204 251 294 324 342 354 365 376 386 391 390 380 365 350 335 322 314 313 315 308 288 261 236 212 186 158 134 118 109 109 117 128 141 159 186 218 244
14680 244 256 258 258 264 273 273 258 236 217 209 207 200 182 153 117 83 59 47 48 60 84 115 147 174 194 208 215 214 212 215 219 216 206 194 185 174 159 148 146 155 169 187 206
14663 206 222 234 242 248 252 255 261 271 275 263 236 206 183 167 157 148 143 143 149 161 176 189 198 201 201 199 195 187 178 173 178 189 198 198 188 171 156 150 162 190 225 257 282 298 303 295
14644 295 276 252 224 195 172 165 177 203 232 254 267 270 267 255 232 193 141 94 69 77 107 137 151 149 142 140 145 153 161 166 163 155 150 157 177 204 231 250 256 250 243 247 260 270
14627 270 268 256 240 225 211 197 180 160 141 132 141 165 199 233 258 274 285 299 315 326 331 333 332 322 298 269 250 245 242 231 207 176 146 129 126 133 140 143 143 147 154 160
14610 160 162 163 166 172 180 189 199 212 228 240 247 253 267 292 321 344 358 367 374 374 360 334 308 293 293 298 302 301 300 298 294 287 280 277 275 272 265 255 244 240 245 254 256 245 229 217 213 212 213 222
14590 222 237 248 246 231 213 202 199 200 203 204 200 191 185 197 228 262 284 292 300 314 327 329 323 320 319 313 300 285 272 256 231 203 181 167 161 165 180 199 212 214 208 200 199 208 225
14572 225 246 263 267 255 228 193 166 153 150 146 137 127 122 125 136 150 161 166 167 170 178 184 185 186 192 201 206 205 197 183 161 137 117 106 101 103 114 134 156 171 184 199 219 242
14554B42J8J0jj0j5j4rmjjoj5k7l4k7j3kmj1j0JJ3J6J1POMnj4j1JNjj7k8k7k0j2jJ2K6L0J8
14537H0mk0k0mJ3K0J7J3J1RNMQJ3J1jj3j8j5j0mNJ6K3K1J1NRJ8K2J8J2OKMOJ0J1Lrj8k3k3
14520B24j9j9k1k1j8pLJ2J8K5K5J2j0k5k5j3kjnpmJQJ6K2J7P%LJ2J0jj5j7rMJ7K9L1K1Kj3
14503B67k0k0j8j3%J4K1J8Qlpnk%mrj2j1nMJ8K9K9J8nk6l5l0j6pqj3j1mLNKmqj0j0pmkJKJ
14484A11JLRJ4Pqk7l5k7j0PJ6K1K7L0K7K0J3Qjj8l5m2l4j3J0K4L0K6K1J4OJJM%qj2qkLMQJ4
14466B00J8J9J5Ooj5k1k1j9j1l%kmjK%jPJ4J1kj1pJMmj2j4pNJ7K2K1J4QLJkoj2qLJ1Opj3o
14447A93RK2L1L3K3Ploloqommoprj6j6lJ7K8K3Rkmlorj1qpppKJ1Rkj3j0oqk1k7j8nNRJ0J2
14427A82J1QJnj1rJJ5K6L3L0J7Jj2j4j2j4k0k2j6jJ5K6K8K4J8J3RPOROnj9k8l0k7k1j0JPK
$$ plain form
14554 242 260 270 269 259 244 230 221 217 216 215 209 194 167 133 106 93 91 87 76 66 67 80 96 107 114 120 124 119 105 94 95 100 99 82 54 27 7 -5 -6 6 32 62 80
14537 80 76 56 36 32 45 65 82 95 106 115 120 124 132 145 156 155 142 124 109 99 95 100 116 139 160 171 176 185 203 225 243 255 261 263 267 273 283 294 297 288 270 247 224
14520 224 205 186 165 144 126 119 122 134 152 177 202 214 204 179 154 141 139 138 133 126 122 123 131 147 169 186 193 193 196 208 218 217 202 185 176 180 197 226 257 278 280 267
14503 267 247 227 209 196 196 210 231 249 257 254 247 242 240 240 236 227 215 204 199 203 221 250 279 297 292 266 231 201 185 178 170 157 146 142 145 150 152 148 140 130 120 113 109 107 108 110 111
14484 111 112 115 124 138 145 137 110 75 48 38 45 61 82 109 139 166 186 199 207 206 188 153 111 77 64 74 98 128 154 175 189 195 196 197 201 201 193 181 173 171 174 178 186 200
14466 200 218 237 252 258 252 237 216 195 176 165 162 162 160 156 155 157 157 156 163 177 188 186 175 168 169 173 169 157 143 136 141 158 180 201 215 223 226 227 225 219 207 199 202 213 219 212 199 193
14447 193 202 224 255 288 311 318 315 309 306 300 292 286 282 278 272 265 256 240 224 221 238 266 289 298 296 292 289 283 274 263 255 248 241 234 236 247 256 254 241 231 225 217 196 169 151 146 151 160 170 182
14427 182 193 201 202 197 186 177 178 193 219 252 282 299 300 288 274 262 248 228 206 190 189 204 230 258 282 300 313 322 329 335 344 350 345 326 298 268 241 220 210 211 218 220
14410B20pj0lPJ4J2J3J8K6K8J8%j5j7rlj0k1k5j6qoqj0j4j8j6jJ7K0RjLJ4J9J4Lj1k2k6k0
14393A58j1rj5k2k7k8k4j1J0K7L7L5K9K6K5K6K3J3MJL%mqj3j9k4k2j0KONPRRMJLKLNQRMMJ1
14375B62J8K0J2MjjlmkOJ5K0K0J6J0Koj7l0m3n0m3k6nJ1K3L0K7J5mj7j8rLJ0J1Moj9k4j9j1
14358A81oj2k0k0j3mNJ4J6J1LKJ2K7L4K8J4ok2l1l0j8KJ8K5K2J4Loj3j4pJPRJ5K1K3J7RJp
14341C05j7k2j8oRJ9K0J1oj7j8j4j3j2oKNJjLRJ1Ojpj4k0k3k6k7l0l4l3k6j2jPJ6K2J9J0m
14324F7rmPK3L3L0J4nj3j0KJ4K0J6MqpMJ5J8J7J2OKQJ9K3J3jollqj1rorj6k1k4k5k2j2okk
14306A25LQOlj2j5j2lRJ6J1jpjJ1J4QLLLmj7k5k1rNJ8K9M0M7M4L2J3jrj0rl%mj4k0j8rmkj
14287B14KNPKqk0k5j7%J0QkmLJ4K0K0J2LprnPJ5J8J3OKNPLqj7j7j2pnoprj5j8j6oMPQJ5K7
$$ plain form
14410 220 213 203 200 207 221 233 246 264 290 318 336 336 321 304 295 292 282 261 236 220 212 206 198 188 174 156 140 139 156 176 185 184 187 201 220 234 237 226 204 178 158
14393 158 147 138 123 101 74 46 22 11 21 48 85 120 149 175 200 226 249 262 266 267 270 270 266 258 245 226 202 180 170 172 178 183 190 199 208 212 213 216 218 221 226 234 243 247 251 262
14375 262 280 300 312 316 315 314 311 307 305 311 326 346 366 382 392 394 388 371 341 298 248 205 179 174 185 208 238 265 280 276 259 241 232 235 245 256 260 254 235 211 192 181
14358 181 175 163 143 123 110 106 111 125 141 152 155 157 169 196 230 258 272 266 244 213 183 165 167 185 210 232 246 249 243 230 216 209 210 217 226 241 262 285 302 311 312 305
14341 305 288 266 248 242 251 270 290 301 295 278 260 246 233 221 215 217 222 223 222 225 234 245 251 250 243 229 209 186 160 133 103 69 36 10 -2 -3 4 20 42 61 71 67
14324 67 58 54 61 84 117 147 161 156 143 133 135 149 169 185 189 181 174 178 193 211 228 240 246 248 256 275 298 311 310 304 301 298 290 279 270 264 255 239 218 194 169 147 135 129 127 125
14306 125 128 136 142 139 127 112 100 97 106 122 133 132 125 124 135 149 157 160 163 166 162 145 120 99 90 95 113 142 182 229 273 305 318 317 308 298 289 286 286 282 268 248 230 221 217 215 214
14287 214 216 221 228 230 222 202 177 160 160 170 178 176 172 175 189 209 229 241 244 237 228 223 230 245 263 276 282 284 289 296 299 291 274 257 245 238 233 227 220 211 196 178 162 156 160 167 175 190 217
14267B17L6L3K3J2LmroKOLoj3j3qLJ5J9J4Nnj6k6l2k9j9qjMJ0J4J8K2K2J9RJjknj1j2j2j2
14250B60j4j0n%KJjmmKQMj2k3k0oPRKqj6j7qkkonJMLLJjqqlMJ0K1L1L3J9Jrrj1j3j2onrj3
14229A56j0lJjLJ1K1K6K1J1JkMQQjqokmj3k0j7j3j3j8j1J0L2L9L0K0J4Qnj3j4j2j2j5j6j2
14212A83kJ1J7J3OMNOKjLLmj4j8j7j8k1k2j4jJ1J4J2OKOJ6K0J2LJQJ7J6Orj8j7oLNNQJ2J0
14193B64lj7k8l3l1k5j3kQJ7K8L1K4J1%kkjJNN%qj2j5j6k0k3k0j2ok%PJ8K8L1K5J4ONJj0k2
14176B06k7k0jJ7K9L0K4J4J0J3J6Oj5k9j9KJ4Nj1j9j7j3ojJnqnKNOJ5K6K8J3qk0j9pQJ7K2
14159B79K3J8Qj2k7k2kJ0NnmRJ5RKJLJJPJ7K4K4J4kj6k4k4k4k0pOQJopqj5j9j7j3j1j1pj%
14140A81lpppjRK2L1L4K8J3rl1l7k8j2loj1j0LJ9L1K8J7N%llk%j%PJ7K0J4OJkoj3j2mJlrj0
$$ plain form
14267 217 253 286 309 321 324 320 311 305 307 313 316 310 297 284 276 279 294 313 327 332 327 311 285 253 224 205 197 196 200 210 224 242 264 286 305 314 315 314 312 307 296 284 272 260
14250 260 246 236 231 231 233 234 233 229 225 227 235 239 227 204 184 178 185 194 196 188 172 155 147 145 143 137 132 133 137 140 143 144 143 135 127 124 128 138 159 190 223 242 243 234 225 214 201 189 183 178 169 156
14229 156 146 143 144 143 146 157 178 204 225 236 237 235 239 247 255 254 246 240 238 234 221 201 184 171 158 140 129 139 171 210 240 260 274 282 277 264 250 238 226 211 195 183
14212 183 181 192 209 222 228 232 237 243 245 244 247 250 246 232 214 197 179 158 136 122 121 132 146 158 164 166 172 188 208 220 223 224 232 249 265 271 262 244 227 221 224 229 234 242 254 264
14193 264 261 244 216 183 152 127 114 112 120 137 165 196 220 231 231 229 227 226 227 232 237 237 229 217 202 186 166 143 123 111 105 103 103 110 128 156 187 212 226 232 237 238 228 206
14176 206 179 159 158 175 204 234 258 272 282 295 311 317 302 273 254 256 270 275 264 245 228 215 209 208 209 204 196 191 193 198 204 219 245 273 286 278 258 239 232 240 257 279
14159 279 302 320 328 316 289 267 265 275 280 275 271 280 295 304 306 307 310 311 312 319 336 360 384 398 396 380 356 332 308 288 281 287 295 296 290 283 275 260 241 224 211 200 189 182 181 181
14140 181 178 171 164 157 156 165 187 218 252 280 293 284 253 216 188 176 173 167 156 146 149 168 199 227 244 249 249 246 243 241 241 240 240 247 264 284 298 304 305 303 297 284 272 268 269 266 257 247
14121B47omlmlmjJKMNNJpj0lPJ1Pjoj0j3j3j4j4j4qmkmmk%kmmonkRJ6J4PMOJ0Ojj1j3mJ5K8
14100A99K5J1MPRLormKOMqk4l4l0j7lJkj4k4k5rJ7L4L8L5L1K1Qj0k2k3j5lQJ2J1RJ1J3J7K0
14082B74J8Nj3k3j6LJ2QKOJ5J4Jj5k1k1j6j0%J1J6J2Olrj5j8j4ojKmj2j9j4LK0K8K5J6Ooj4
14065B33j6j4okJJOJ1J8K2K0J3jroNJ7J5OknjMQMj0k3k5j5nkpj2j4j3qmkjQK4L0J9mk0k4j7
14046A97j2j0j0plLRQKjLRJ5J0nk1k6j5LJ5J9K2K4K1J3MJJkqj3j8k2k1j2jPJ0QLnj3j8j7j1
14028A36n%MJ4K6L2K7J4kj7l0l3k2oKK%NJ5K1K1J9J6J2N%lmmkjlookMMKKKmj6k5k0%K0K4J8
14008B36J3J5J6QkmLJ3J4J0NLPJ4J5J1MJ%KLKkmkkmppJQQjrqjNLnj1oOJ7K0J7RQJ3K2K6K2
13988E05J8J9K3K1J7J9K7M2N6O3N6L7J8J1J1J1J1J8L4N0O6Q6J22J74K40L27M24M81M29K36
$$ plain form
14121 247 241 237 234 230 227 223 222 223 225 229 234 239 240 233 223 220 227 238 245 244 238 228 215 202 188 174 160 152 148 146 142 138 136 136 134 130 126 120 115 113 122 138 152 159 163 169 179 185 184 173 160 156 171 199
14100 199 224 235 239 246 255 258 252 243 239 241 247 251 243 219 185 155 138 135 136 134 120 96 71 62 79 113 151 186 217 238 246 236 214 191 176 173 181 193 204 213 224 237 254 274
14082 274 292 297 284 261 245 248 260 268 270 276 291 305 306 291 270 249 233 223 223 234 250 262 268 265 256 241 223 209 203 202 204 200 188 169 155 158 178 206 231 247 253 247 233
14065 233 217 203 197 195 196 197 203 214 232 254 274 287 286 277 271 276 293 308 314 312 307 306 310 318 322 312 289 264 249 244 242 235 223 209 196 188 184 182 181 189 213 243 262 258 238 214 197
14046 197 185 175 165 158 155 158 167 175 177 176 179 188 203 213 208 187 161 146 149 164 183 205 229 250 263 267 268 269 267 259 246 228 206 185 173 172 179 189 197 200 195 182 164 147 136
14028 136 131 131 135 149 175 207 234 248 246 229 199 166 144 138 140 142 142 147 162 183 204 223 239 251 256 256 253 249 245 243 242 239 233 227 225 229 233 235 237 239 235 219 194 174 174 194 218 236
14008 236 249 264 280 288 286 282 285 298 312 322 327 330 337 351 366 377 381 382 382 384 387 389 387 383 381 379 375 368 361 362 370 378 377 368 360 359 364 367 362 351 345 351 368 388 405 414 422 435 457 483 505
13988 505 523 542 565 586 603 622 649 691 747 810 866 903 921 932 943 954 965 983 1017 1067 1133 1219 1341 1515 1755 2082 2506 2987 3416 3652
13976C652m3k87m06l96l31k64k09j51j02o7l9MN6J08J62K33L14M04N00N76N42L11o4m07n64
13966C532n40m47l54k72j96j43j16r2o5m1k1ML4N6P6J14J70K27K86L63M24L94K31Jj81k45
13955C199j99r1L8J70L10M45M98L67L9l44n94o31n32m13l23k59k12j82j58j26q6n4l5k7k5
13945G75l1m0m6m7m4l7l1k2j5nNO%j0j5j3qlmqj7j9j0OJ8J5NjjKKMJ2K6L8M6N4O0O2O0O0N8
13928H87M7L1K9N3J02J72K61L30L10J60o8k52l14k79k21j82j50j11p0m7l5k3j1kPK6N3P4R3
13917H70J32J82J95J18k5j51j93j65j18p6l6ML3N7Q5J22J70K33K92K99K24J28J03J42J29j7
13906B737k34l77l87l19k43j82j29q9o9n7m6l4k8k2j3j0j5k0j9k1k4k6k2j3pjOJ2RLjkkj%
13892C54%kkMPLlkMQNJ%%lprm%Jjnj1j7k5l0k8k0pKQJ1J4J6J4Jj7k9k5j4lMRJ3J5RMMQJ5J8
$$ plain form
13976 3652 3609 3322 2916 2520 2189 1925 1716 1565 1463 1396 1357 1361 1417 1525 1687 1920 2234 2638 3138 3714 4256 4567 4503 4096 3532
13966 3532 2992 2545 2191 1919 1723 1580 1464 1372 1307 1266 1245 1249 1283 1339 1415 1529 1699 1926 2212 2575 2999 3393 3624 3625 3444 3199
13955 3199 3000 2909 2947 3117 3427 3872 4370 4737 4776 4432 3838 3207 2675 2262 1939 1680 1468 1286 1128 1002 916 862 827 800 775
13945 775 744 704 658 611 567 530 499 477 462 457 462 468 468 458 443 430 422 419 415 407 390 371 361 367 385 400 405 404 403 405 407 411 423 449 487 533 587 647 709 769 829 887
13928 887 934 965 994 1047 1149 1321 1582 1912 2222 2382 2314 2062 1748 1469 1248 1066 916 805 735 688 653 630 619 617 624 650 703 777 870
13917 870 1002 1184 1379 1497 1472 1321 1128 963 845 769 733 737 770 827 912 1034 1204 1437 1729 2028 2252 2380 2483 2625 2754 2737
13906 2737 2503 2126 1739 1420 1177 995 866 777 708 651 605 571 543 521 508 498 483 463 444 423 399 373 351 338 331 330 336 348 357 360 359 357 355 354 354
13892 354 354 352 350 354 361 364 361 359 363 371 376 377 377 377 374 367 358 354 354 355 354 349 338 321 296 266 238 218 211 213 221 232 246 262 276 277 260 231 206 192 189 193 202 215 230 239 243 247 255 270 288
13872B88J7J0Jll%LJ1J9K4K0J3P%rj6j9k2k6l0l2k8k1qPJ6J2kj2j3pKJ0J5J3OJ%JOJ2J7J5
13855B95Qmj2j3j0mjmj1j7j5rmpj1j5j4j0qqjJ3K4K5J5RJ6L0M3M2L0J4Jrj5k0k5k5k1j4j3
13838B45j6k1k0j7j4j6j8j7j1lLMJlqj2oOJ9K8L0K5K0J3Pjj1j5j2jRJ5J3Mmj0j3j7k1j6%K1
13821A60L3K9K0J2Lrj9j9j0%OJ0J2J4J4J5J3J1J0J4J5Ork3k3j4pqj6k4k6k1j0l%lj0j7k3j9
13805H4qKJ0J7K5L0K8J9J1OKkjlj1k6l2k1%J3J4RRJ5J7J3Jj3j8j3nJMRJ2J1NJJJKMJ0J7J8
13787B68J3PLkrj2j0llqj1j2j2j5j7j3nLQJ6K9L3K0kj8j9j4j0pllmqrj0rlOJ1Pmj3j5j2nK
13769A26ONJOJ2J1LlMJ3J3MjMJ4J7J2LkllmpokNOLj%Ljj2k1k1j4mJNJ0J6J5P%%J3K5K8K1J1
13749C18PMnk0l1l3k6k2k4k9k4j1KNLMJ0J4RMJLNPOMkj1k1k7k6j9qPK4L2K9J4mj2r%J0J6J3
$$ plain form
13872 288 305 315 316 313 310 310 313 324 343 367 387 400 407 407 398 382 363 341 315 285 253 225 204 196 203 219 231 229 217 204 197 199 209 224 237 243 244 244 245 251 263 280 295
13855 295 303 299 287 274 264 260 259 255 244 227 212 203 199 192 181 166 152 142 134 126 125 138 162 187 202 211 227 257 300 342 372 386 387 378 363 343 318 293 272 258 245
13838 245 229 208 188 171 157 141 123 106 95 92 95 99 100 97 89 77 71 77 96 124 154 179 199 212 219 218 207 192 180 179 188 203 216 220 216 206 193 176 155 139 139 160
13821 160 193 222 242 254 257 248 229 210 200 200 206 216 228 242 256 271 284 295 305 319 334 340 331 308 285 271 264 256 240 216 190 169 159 156 156 153 143 126 103 84
13805 84 76 78 88 105 130 160 188 207 218 224 226 224 223 220 209 183 151 130 130 143 157 166 175 190 207 220 221 208 190 177 172 173 177 186 198 209 214 215 216 217 219 223 233 250 268
13787 268 281 288 291 289 280 268 258 255 252 244 233 221 209 194 177 164 159 162 170 186 215 248 268 266 248 229 215 205 198 195 192 188 180 171 161 152 149 155 166 173 169 156 141 129 124 126
13769 126 132 137 138 144 156 167 170 167 171 184 197 201 200 204 218 235 247 250 248 245 242 238 231 225 223 228 234 237 236 236 239 238 226 205 184 170 166 167 172 182 198 213 220 220 220 233 258 286 307 318
13749 318 325 329 324 304 273 240 214 192 168 139 115 104 106 111 114 118 128 142 151 155 156 159 164 171 177 181 179 168 147 120 94 75 67 74 98 130 159 173 169 157 148 148 158 174 187
13731A87LlljjrrkRJ2QLmj5k4k2pQJ3J0Mjqj2j0mMJ0J4J1Mnrrj1j6k1k0j3ojlrj3qRK7L6L5
13711A28L1K8K8K2Qpj4j2kOQLnj0j5j4j1nJQJ3J3RjomPJ7K4K1J3Mjlmqj5j8j3kOKj0k1k1j5
13692A63okoj1j5j3pnj1j6j4lJ4K6K6J2mj1nMRQONPJ2J8K0J4KnnMJ5J9J2%olKKlqqlloqnO
13672B14J4J5Lj3k1j9j2pppjQK0K5K0Ppj2oMJ3J4Oqj8j6mNKnooj2k4l0k7j2LJ8K6K9K8K4J7
13655B35RKKRJ8J7Opj5j4rllk%NKqj7j7j4rqmNJ2J5R%oro%NPNMJ0J7K0J7J2PNMNQRMmj0j0
13634C10j1j5j5j2n%LOJ0RPjj3k4l1k6j3lLRJ6J8Rkj2j3oNJ5J4Kj1j4j1pmLJ0RM%QJ7K1J9
13616B78J3RMkoqqlkpj6j7j1mmpnlj0k5l7l4k1j2qmPJ9K5K1J4RQQJ4K0K1J1ok1k3j8qJJ2J7
13597A81J2JpoLJ2J6J0Ll%NQOMNN%qj5j7j4rJJ8K9L1J9RPRLj0k1k3j4mNNpk7m2m1k1NK7L5
$$ plain form
13731 187 190 187 184 183 182 173 164 162 171 183 191 194 190 175 151 129 122 130 143 153 157 156 148 136 126 122 126 136 150 161 165 160 151 142 131 115 94 74 61 55 54 51 42 29 21 30 57 93 128
13711 128 159 187 215 237 245 238 224 212 210 216 224 227 222 212 197 183 172 167 168 176 189 202 211 210 204 200 207 224 248 269 282 286 285 282 278 270 255 237 224 222 228 230 220 199 178 163
13692 163 157 155 149 138 123 110 103 98 87 71 57 54 68 94 120 132 128 117 112 116 125 133 139 144 151 163 181 201 215 217 212 207 211 226 245 257 257 251 248 250 252 249 241 233 230 227 221 213 208 214
13672 214 228 243 246 233 212 193 181 174 167 160 159 167 187 212 232 239 232 220 214 218 231 245 251 243 225 209 205 210 212 207 201 195 183 159 129 102 90 93 111 137 166 194 218 235
13655 235 244 246 248 257 275 292 298 291 276 262 253 250 247 245 245 250 252 244 227 210 196 187 179 175 180 192 207 216 216 210 201 195 195 200 207 212 216 226 243 263 280 292 299 304 308 313 321 330 334 330 320 310
13634 310 299 284 269 257 252 252 255 261 271 280 287 286 273 249 218 192 179 176 179 188 204 222 231 229 217 204 198 203 218 232 234 223 209 198 191 187 190 200 209 213 213 221 238 259 278
13616 278 291 300 304 302 296 288 280 277 275 268 252 235 224 220 216 209 204 201 191 166 129 95 74 62 54 50 57 76 101 122 136 145 153 161 175 195 216 227 221 200 177 159 151 152 164 181
13597 181 193 194 187 181 184 196 212 222 225 222 222 227 235 241 245 250 255 255 247 232 215 201 192 193 211 240 271 290 299 306 315 318 308 287 264 250 246 251 256 249 222 180 139 118 123 150 185
13578A85K8J1jl%oj2j3lLLLQJ6J8J7J3QKlkmj1j9k2k4k5k7k0lQRKKRJ4J4J3J4J6J2Lpj3j5
13560A98j7k2k7k1oPJ0JljPJ3J4J4J0OMRJ2J1MJMJ2J3Q%pqkMLpk2k9k7j5kRJ5J2LjLJ2J4N
13541B21qj9k1j2LJ6K0J2%m%LKnj2j7j6j3j1j0qJJ2J6J5J1J2J5J2LoqlNJ2J3%j7k8k6j7mL
13524A42RJ2J7K1J9J2OLjj0k2k5j6mNJ2J8K2J7Onj2j5k0k4k4j7mJ1K3K9L2L0K4J5ROKmj2k1
13508B66l0l5l0j7njlkOJ1RJj2k3k5j1RJ7Mj4j9pJ5L1L8L2K6K1K1J7Nj2k6l0k2oJ2K7L0K4
13492B92J2Jrj3qLJ4J3Lj5l2l8k9rJ3K0J3jj2j9j9j3mRK3L4L5K7J7J3J3J1jj7k4k6k7k8k5
13476A97j6j0qpJJ1K2K8L2K8J2nj3j0qj1j7j7j4j2pKJ1J5J2OORJ3J5J2NLPJ8K3J5Kqj0j0j4
13459C08j7j7j2rqnLJ7K7K9J7Jj3j3jJ3J8J1%norj6j8j3kJqj8j8p%ok2l2k6j3mnqo%RJ4J6
$$ plain form
13578 185 213 224 223 220 220 214 202 189 186 189 192 195 203 219 237 254 267 275 277 274 272 268 257 238 216 192 167 140 120 117 125 134 136 138 147 161 175 188 202 218 230 233 226 213 198
13560 198 181 159 132 111 105 112 122 123 120 119 126 139 153 167 177 183 187 196 208 219 223 224 228 240 253 261 261 254 246 244 248 251 244 222 193 166 151 149 158 173 185 188 187 190 202 216 221
13541 221 213 194 173 161 164 180 200 212 212 208 208 211 213 208 196 179 163 150 139 129 121 122 134 150 165 176 188 203 215 218 212 204 201 206 218 231 231 214 186 160 143 139 142
13524 142 151 163 180 201 220 232 238 241 240 230 208 183 167 163 168 180 198 220 237 243 238 226 211 191 167 143 126 122 133 156 185 217 247 271 286 295 301 303 299 287 266
13508 266 236 201 171 154 149 148 145 143 149 160 169 170 158 135 110 99 108 125 129 115 96 89 104 135 173 205 231 252 273 290 295 283 257 227 205 199 211 238 268 292
13492 292 304 305 296 283 275 278 292 305 308 293 261 223 194 185 198 218 231 230 218 199 180 167 163 172 195 229 264 291 308 321 334 345 344 327 303 277 250 222 197
13476 197 181 171 163 156 157 168 190 218 250 278 290 285 272 262 254 243 226 209 195 183 176 178 189 204 216 222 228 237 250 265 277 282 285 292 310 333 348 350 342 332 322 308
13459 308 291 274 262 253 245 240 243 260 287 316 333 334 321 308 307 320 338 349 349 344 338 329 313 295 282 280 281 273 255 237 230 230 224 202 170 144 131 127 122 114 108 108 117 131 147
13441A47J4J2J2J3J2Nkon%%mrpk%oj2j0mMNLKNM%lnjPJ8K5K3J5RRJ3J3J1PLnj6k6k7k1j5j1
13421A94pnoppomlKRJ2QJjLLlqpmjnj2j1%J2K0J8J1Jrj6j7rJQRRQLjJQJ5J4RNJqj5j4jJ1J2
13400B21Nlk%kpj1plkkk%LQJ3J4PnqkJ2K2K6K3J6P%lnpj1j2j0j1j2j5j3oLJ5K7L7L8K9J7P
13381C89%nj2j8j8j7j6j5pORmk2l3l0k1j2pk%KLMjj2j5oQJ8J8K1K9L2J9rl0k8j2LMpj8k1j2
13363A55%J1J4PkpoljoqpKRJ2Qnk2l6l9k8j3nkOK4M1M7M0L1K5K5K3J5kk0l0l0j9nQJ7J9J6
13345B59Oj2l1m2m0k8j2%QJ1O%l%OQM%lljNJ6K9L9L7K5Nqj5j4qmpj9k8k7j9j4j4oJ3L4L8K8
13327B19J8J4J0LJQJ7J8Qmj3j5j4k0k7k7j4PJ7J2MNJ3J8J4Kqk0k7k3nJ1J3lk2k9k6j9j4j1
13311I1pJJ3K4K5J5pk3k5j1RK4L0L0K5J7RPQJ1Q%j1j5j7k0k5k8k7k5k9l0k4j5qmMJ9L0K6J1
$$ plain form
13441 147 161 173 185 198 210 215 213 207 202 202 202 198 189 182 180 180 174 162 152 148 152 157 160 162 167 171 171 168 163 162 169 187 212 235 250 259 268 281 294 305 312 315 310 294 268 241 220 205 194
13421 194 187 182 176 169 162 156 152 149 151 160 172 180 181 180 183 186 183 175 168 164 163 158 146 135 135 147 167 185 196 197 188 172 155 146 147 155 164 173 181 184 183 184 192 207 221 230 235 236 228 213 199 198 209 221
13400 221 226 223 221 221 219 212 201 194 191 189 187 185 185 188 196 209 223 230 225 217 215 227 249 275 298 314 321 321 318 313 306 295 283 273 262 250 235 222 216 219 234 261 298 336 365 382 389
13381 389 389 384 372 354 336 319 303 288 281 287 296 292 270 237 207 186 174 167 165 165 167 170 174 173 161 146 140 148 166 184 205 234 266 285 276 246 218 206 209 213 206 188 167 155
13363 155 155 166 180 187 185 178 172 169 168 162 154 147 149 158 170 178 173 151 115 76 48 35 30 28 34 58 99 146 186 217 242 267 290 305 303 283 253 223 204 199 207 224 243 259
13345 259 265 253 222 180 140 112 100 100 108 119 125 125 122 122 128 136 140 140 137 134 133 138 154 183 222 259 284 289 281 266 252 244 240 233 214 186 159 140 126 112 106 119 153 191 219
13327 219 237 251 261 264 265 273 290 308 316 312 299 284 270 250 223 196 182 189 206 218 222 227 240 258 272 274 266 246 219 196 191 202 215 212 190 161 135 116 102 91
13311 91 84 85 98 122 147 162 155 132 107 96 105 129 159 189 214 231 240 247 255 266 274 274 263 248 231 211 186 158 131 106 77 47 23 8 0 -4 0 19 49 75 86
13295H6loKJ0J3J0PPQQPQJ3K2L2L3K6J0nj5j8j8j2KJ6K1J8RLnj5k5k9k2j2%QJ3J6J4J2RJ0
13278B68J1QJnj0j6k2k4j7lNLmpojMRJ1J0J4K0J9Oj0k1k2k0j9j8j4olmokOJ0Mj1k3k4k0j1
13260F0KJ4K0J7J8K4K8K4J1jpnJJ0J7J6PlqqjJ1K0K3J9J3J3J3Mrk1k4j7j2rj1j3j2pjLOJ1
13243B36J8J8QklOJ4J0Jpj0j0rpqj0j3j1j2j6j9j3mmj0j1%J4K0K0J7J3Loq%QJ0Pjj1j4j0m
13225A90kNK0L1K7Qoqj1k4l2k7j4n%MPQOPQOLLPMlj1j3j2mJ1K8L6L4K5J8Nj1k6k9j8oj%km
13206B32j3k2k6k0j1lLPJ0J1J3Oj3l3l5j5QJ4RRJ8K1J1kqrj0j4j3qnl%OQJ0J2J4J5J4J4J4
13189B16J2Plj3j5rklpnNJ5J8J8K4L2L2K1Nqj5j5pKOKmonpj2j6j3nmj0k0k3j6j1j0pOK1K3
13171A94J0mqlJ%nj0j0mRK0K4J8RJlorj2j2pjRJ4J5J0QN%j0j8j6kJ3J9J8Prk2k3j7j2j1j1
$$ plain form
13295 86 83 77 79 89 102 112 119 126 134 142 149 157 170 192 224 257 283 293 288 273 255 237 225 227 243 264 282 291 294 289 274 249 220 198 186 186 194 207 223 237 249 258 268
13278 268 279 287 288 283 273 257 235 211 194 191 196 199 195 188 182 181 185 194 205 215 229 249 268 274 264 243 221 201 182 164 150 144 141 137 131 129 135 145 149 138 115 91 71 60
13260 60 62 76 96 113 131 155 183 207 218 217 210 205 206 216 233 249 256 253 245 237 236 247 267 290 309 322 335 348 352 343 322 298 281 269 260 249 236 224 217 216 219 225 236
13243 236 254 272 280 278 275 281 295 305 306 299 289 279 270 263 255 245 232 221 209 193 174 161 157 153 143 132 132 146 166 186 203 216 219 213 205 205 213 223 230 229 218 204 194 190
13225 190 188 193 213 244 271 279 273 265 254 230 198 171 157 152 152 156 163 171 177 184 192 198 201 204 211 215 212 201 188 176 172 183 211 247 281 306 324 329 318 292 263 245 239 238 238 236 232
13206 232 219 197 171 151 140 137 140 147 157 168 181 187 174 141 106 91 99 113 122 131 149 170 181 179 171 162 152 138 125 117 112 109 109 115 123 133 145 159 174 188 202 216
13189 216 228 235 232 219 204 195 193 190 183 178 183 198 216 234 258 290 322 343 348 340 325 310 303 305 311 313 309 303 298 291 279 263 250 245 241 231 211 188 172 161 151 144 150 171 194
13171 194 204 200 192 189 190 190 185 175 165 161 170 190 214 232 241 242 239 233 224 212 200 193 192 201 215 230 240 248 253 253 243 225 209 207 220 239 257 264 255 233 210 193 181 170 159
13153A59pljMJ3K2K0RJ%QJ6K2K3J6Nqk3l4l9l6k8j9r%RJ0PJlqqolkLJ2K3K7K4K0J8J2Lj0j6
13135B24j4nPJ3J1PQRLkKJ5K1J2krrj1j8k6k6j6jRJ2J1J6K2K1Rkoqj4k1j8oPJ1QJmkMNkj4
13116B32k0j4lPJ0RRRPL%MJ3K2J9Oqj3r%QJ3J7J9K2K0J7J2Mnj8k7l0k9l0l1l5l7l5k5j2KJ1
13098A14J8K5K6J8OlppkLJ0J4J3QKJNQPLJkrj6j8j1ljkljJok2m1m7l1jK5L5L4L0K2J2RJ7K4
13080B58K0J3J4K4K4Qj6l2l1j7mjnj2j2j1j4j3mRJ6J9J7J4Nqj5j1oknqpkPRkj6k2j6lOJ3K3
13062B04L3M1M0L2J7Mj%LNNMmj3j9j6j3j3j4rmjpj4k2k0j0LJ0J3J3J3J4J3RLrk5l9m1l4k3
13045A28j4j2j2nOJ1RQJ7L0L3K4J1kj0j1qLJ1J8J8J3LmmKOMLPJ6K0J3jj2j1mkqj2j0n%MM%
13027B75mLJ8K4J1lqqqkJ1K7L2K5J6LrqJ5M4N0M1L3L5L0J7ONPRJ7K4K6L3N3P2P3O3N9O6P7
$$ plain form
13153 159 152 149 148 152 165 187 207 216 217 217 225 241 263 286 302 307 299 276 242 203 167 139 120 111 111 120 130 137 138 135 127 119 113 110 108 111 123 146 173 197 217 235 247 250 240 224
13135 224 210 205 212 225 236 243 251 260 263 261 263 278 299 311 309 300 291 280 262 236 210 194 193 202 214 225 241 263 284 293 291 285 277 263 242 224 218 225 236 244 245 241 239 243 248 246 232
13116 232 212 198 195 202 212 221 230 239 246 249 249 253 266 288 307 313 305 292 283 283 291 304 321 340 362 382 399 411 415 410 392 365 335 306 276 245 210 173 138 113 101 103 114
13098 114 132 157 183 201 207 204 197 190 188 191 201 215 228 236 238 239 244 252 259 262 263 261 252 236 218 207 204 203 201 198 197 198 192 170 129 82 51 50 75 110 144 174 196 208 217 234 258
13080 258 278 291 305 329 353 361 345 313 282 265 261 260 255 243 231 220 206 193 189 198 214 233 250 264 269 261 246 235 229 227 222 214 207 205 212 221 219 203 181 165 162 168 181 204
13062 204 237 278 318 350 367 371 370 370 373 378 383 387 383 370 351 335 322 309 295 286 282 281 274 260 238 218 208 211 221 234 247 260 274 287 296 299 290 265 226 185 151 128
13045 128 114 102 90 85 91 102 111 119 136 166 199 223 234 232 222 211 203 206 217 235 253 266 269 265 261 263 269 273 276 283 299 319 332 331 319 308 304 302 294 282 272 267 267 271 275 275
13027 275 271 274 292 316 327 324 316 308 300 298 309 336 368 393 409 412 403 395 410 454 504 545 578 613 643 660 666 671 678 687 704 728 754 787 840 912 985 1048 1107 1173 1250
13010A250J02J52K13K67L35M49O07P91J029J294J377J005J68p54j297j335j089q26o25m62
13002B651l25k31j63r6l2K0O5R1O7j0r2j28j21r4n0J2O8Q1M8Kj5J1O2J11J43J73K33L31M47
12990C259N87P90J038J182J005M62j91n49m16L7N33J029J635K177K098J022o79k085k567k263
12982H104j720j285r61o89n02m16l57k73j92j49j28r7p1o4n7m1l4m5n4m5k9k6l0k4j8k4l5
12972G38m2m3m0k4jJ3J0LLLmj0rqj3j7j1kknJOJ0J7L2L8K9J1PJ6K0J8J9L1N0P0R1J15J31J18
12956A369O1l3j21j63j49j18r2p3m6k0j1j5k2k2k5k5j9j5j6k2j9mJ0K4L8M9M5K9Pj2k4k7k1
12942E18j2nMJ2J4Kj9l1l1k8k3k2k2k9l4l0j6okkMJ0ROMMORRLj1k0j6qmk%NQPLLQJ8J9Rnj3
12923C03j1qj0j3nJ3L1L7K3jk6l6l1j2PK2K6K9K9L2M2O0P5O3J2n3r1q1m8k7k9l3k7j5j2j5
$$ plain form
13010 1250 1352 1504 1717 1984 2319 2768 3375 4166 5195 6489 7866 8871 9039 8285 6988 5653 4564 3738 3113 2651
13002 2651 2326 2095 1932 1836 1804 1824 1889 1980 2047 2037 1945 1817 1696 1602 1552 1564 1632 1713 1761 1763 1748 1759 1821 1932 2075 2248 2481 2812 3259
12990 3259 3846 4636 5674 6856 7861 8323 8132 7583 7167 7204 7737 8766 10401 12578 14676 15698 15019 12934 10367 8104
12982 8104 6384 5099 4138 3449 2947 2531 2174 1901 1709 1560 1432 1335 1264 1200 1143 1102 1068 1023 969 924 895 869 839 815 797 773 738
12972 738 696 653 613 589 588 601 611 614 617 620 616 606 597 589 576 559 548 546 544 539 540 546 556 573 605 643 672 683 690 706 726 744 763 794 844 914 1005 1120 1251 1369
12956 1369 1430 1397 1276 1113 964 846 754 681 635 615 604 589 567 545 520 495 476 461 445 423 404 400 410 434 472 521 566 595 602 590 566 539 518
12942 518 506 501 505 517 531 533 514 483 452 424 401 379 357 328 294 264 248 242 240 238 242 252 261 267 271 275 281 290 299 302 291 271 255 247 243 241 241 246 254 261 264 267 275 293 312 321 316 303
12923 303 292 284 274 261 256 269 300 337 360 359 333 297 266 254 261 283 309 338 367 399 441 501 576 639 651 598 507 426 378 351 322 289 262 247 235 220
12909B20k1j7nJ1K2K0Q%jPJ3J5J1Olj2k4l7m0k7lJ3J6J6K0L0L3K5Oj1j8j2nnj2j8j9j8j8k0
12892A46k3k5j6KK1K5J7RQJ0Kpj0JJ7K7K4QolPJ8J9J8J6J0Jopj1k1k5k1j6j5j4mLlj2j0PK3
12875A84L0K7K3J5PjmomKQPjj0j5j1qnpqpjJKJ%lpmQJ9J7jk2l5l4k1kJ0J3QKjmnk%lj1rLJ2
12854A47J1LJK%qj0mMJ3K1K7L1K9K5K0J3QOMJpj3j1pmnmNJ1Pnj4j1jON%npommlKNPJ3K6L9
12834C59L6J9Knqj5k8l3k9k0j1lK%%KMJqj4j6j1jJ5K7K6J9J4J1Kj5k5k4j7j3j2j1mMJ1J5J5
12817B61J2J1J2J5J3J0Nmj6k8l3k7j0J3L0L2J8Jrj0o%%pj8k2j8j0mjKNK%JRJ8K6K6J6ql1l7
12800B39k3%Pkj6k0j0%Jqj2pOJ6J7J1OQJ8K4J8LoqpqpMJ3J1%j5k0j6nOJ1J0J0J2J3NkkJMk
12781B78j1k5l1k5j0NJ1J1J2J0kj9l1k9k2j2jRJ3J4J5J6J7J7K0J8J2J2K6M4N2M3L2K4J8J5
$$ plain form
12909 220 199 182 177 188 210 230 238 238 237 244 257 272 283 289 286 274 250 213 173 146 143 156 172 188 208 238 271 296 302 291 273 261 256 251 239 221 202 184 166 146
12892 146 123 98 82 84 105 130 147 156 164 174 176 169 159 160 177 204 228 236 230 227 234 252 271 289 305 315 316 310 303 292 271 246 225 209 194 180 176 179 176 164 154 161 184
12875 184 214 241 264 279 286 285 281 275 271 273 281 288 287 277 262 251 243 238 231 223 216 215 216 218 219 219 216 209 205 213 232 249 248 226 191 157 136 134 144 157 165 167 166 162 157 155 155 152 141 132 135 147
12854 147 158 161 162 164 164 156 146 142 146 159 180 207 238 267 292 312 325 333 339 343 344 337 324 313 306 302 297 293 298 309 316 311 297 286 285 291 296 296 291 284 278 274 270 267 269 274 281 294 320 359
12834 359 395 414 416 411 403 388 360 327 298 278 267 264 266 266 266 268 272 273 265 251 235 224 223 238 265 291 310 324 335 337 322 297 273 256 243 231 220 216 220 231 246 261
12817 261 273 284 296 311 324 334 339 335 319 291 258 231 221 234 264 296 314 315 306 296 290 290 290 283 265 243 225 215 211 210 212 217 219 219 220 229 247 273 299 315 307 276 239
12800 239 216 216 223 221 205 185 175 175 176 168 156 149 155 171 188 199 205 213 231 255 273 276 270 262 255 247 240 244 257 268 268 253 233 217 212 218 229 239 249 261 274 279 277 275 276 280 278
12781 278 267 242 211 186 176 181 192 203 215 225 223 204 173 144 122 110 109 118 131 145 160 176 193 210 230 248 260 272 298 342 394 437 469 493 511 526
12767E26K5M4O6Q8J24J77K43L16L90M27L58J54j18l29l99l55k78k20j78j38r9p3o0n4m3k6
12756E68rKJj0k0j7kRQ%mkllLJ7L7O1R0J15J33J60K13K90L74M68N64O03M88J81k07n02o01
12743C005n44m33l33k57j93j45j15j01r5r1q3p2n8m3k4pMjj3k2k1j0JMkj0j1oJMRJ4J3OJK
12729C74QJ1QKklKQJ2J6K3K7L0L8N4P3P9P8Q0R7J26J67K23K97L89N02N95N72L47l7m01n84
12716C211n68m60l59k83k12j49j04q2o8n6m4k9j1L%j3k6l0k3j2orj0oJNJ1K2K9K5K1K6M7P4
12702I15J08J52K02K63L39M10M07K62kk60l97m01l35k58j81j11n9l1k3k5m1o6q7r2q1o3m1
12691E04k3k0k9l6l1k0j1rjJ0J8J7Nj0j8j9j0%QJ2J0Mnj3j5j1%OMlpnjkljKKkm%NOLlrj0p
12672B78LJ1J5J6RJmJJ0J7J7J6J5J1Mkmmnrj3j4rkKlj1j1%J3K1K1J2kj4k1j9j1lORJ1J3K8
$$ plain form
12767 526 551 595 661 749 873 1050 1293 1609 1999 2426 2784 2938 2820 2491 2092 1737 1459 1239 1061 923 824 751 691 637 594 568
12756 568 559 561 562 552 532 515 513 522 530 530 526 524 521 518 521 538 575 636 726 841 974 1134 1347 1637 2011 2479 3043 3646 4134 4315 4108 3606 3005
12743 3005 2461 2028 1695 1438 1245 1100 985 884 789 698 615 543 485 442 418 411 415 414 401 379 358 348 349 353 351 341 330 324 325 329 338 352 365 371 372 374
12729 374 382 393 401 403 401 398 400 408 420 436 459 486 516 554 608 681 760 838 918 1015 1141 1308 1531 1828 2217 2719 3314 3886 4233 4196 3795 3211
12716 3211 2643 2183 1824 1541 1329 1180 1076 994 926 870 826 797 786 789 789 776 750 720 697 685 679 670 660 654 655 660 671 693 722 747 768 794 841 915
12702 915 1023 1175 1377 1640 1979 2389 2796 3058 3056 2796 2399 1998 1663 1405 1224 1113 1054 1023 1000 975 934 868 781 689 608 545 504
12691 504 481 461 432 396 365 345 334 325 324 334 352 369 374 364 346 327 317 317 325 337 347 351 346 333 318 307 307 313 317 314 307 302 301 299 296 295 297 299 297 293 293 298 304 307 304 295 285 278
12672 278 281 292 307 323 332 333 329 330 340 357 374 390 405 416 420 418 414 410 405 396 383 369 360 358 360 357 346 335 335 348 369 390 402 400 386 365 346 335 332 338 347 358 371 399
12654C99N2P4Q0O9M4J0k1m1m4m0l6l2k4k1l1n0n5m0j3PJ4J2Lnqplnqo%Jnj3j3mRJ1NnrnPJ7
12637B70K0J3Mrk1l0l2k5j1%NJnpJJ6K9K9J7Mmnqj2j6j5j3j3j6j6mJ5L3L8L3K2J3Mnj4j6q
12620B62J0K8L4J8nk2k2j4rroJM%j0k0k3j9j0%MLjqj3j7j8k1k6l1k9k1j3j3j0kRJ8J9J6J4
12603D8J6K5L5L7L3K1J1%j3k6l2l2k1rMJ2J2QKlj%KKNQQPQJ1J1RRJ2J8K6L2L1K1Mrj5k1k8
12586B78k9j5NJ6J5Pjj0k2l0k6j6JJ4J8J0kj0j2j4j7j8j3pjPJ6J7J1PJ3K0J4MJQJ3Noj4j7
12569B20j8j8j8j7j3pNJ3J7J1kj4j7mJ4K4J8J0PJ3J6J5J2J3J1MljLKpj7k0j8j7j5j2pnjJ0
12553A87K1K3J4Mj%jlknj3k2k7k0pJ0K6L5L0J4%pponmmj0j7k4k3j6jJ7L1L2J8%rnLKj1k4k5
12535A68j5mMLkorn%OJ2K0K3J6LnkPJ3J4Qlj8k8k9k5k1j5jJ6L1L4K7J2lpNK5M0M0K7Qrk2k7
$$ plain form
12654 399 451 525 605 674 718 728 707 666 622 582 546 514 490 469 438 388 333 293 280 287 301 313 316 311 303 296 293 288 280 274 274 275 270 257 244 240 249 260 265 260 251 246 253 270
12637 270 290 303 307 298 277 247 215 190 179 179 184 185 180 173 174 190 219 248 265 269 265 260 252 240 224 209 196 183 167 151 147 162 195 233 266 288 301 305 300 286 270 262
12620 262 272 300 334 352 347 325 303 289 280 271 265 266 270 270 260 240 217 198 188 188 192 195 194 186 173 156 138 117 91 60 31 10 -3 -16 -26 -28 -19 -1 18 34 48
12603 48 64 89 124 161 194 215 226 226 213 187 155 123 102 93 97 109 121 129 131 128 127 127 129 131 136 144 152 159 167 178 189 198 207 219 237 263 295 326 347 351 342 327 306 278
12586 278 249 234 239 255 270 277 276 266 244 214 188 172 173 187 205 215 213 203 191 177 160 142 129 122 121 128 144 161 172 179 192 212 226 230 231 239 252 257 251 237 220
12569 220 202 184 166 149 136 129 134 147 164 175 173 159 142 138 152 176 194 204 211 224 240 255 267 280 291 295 292 291 294 296 289 272 252 234 217 202 190 183 178 177 187
12553 187 208 231 245 249 248 248 247 244 242 237 224 202 175 155 148 158 184 219 249 263 263 256 249 243 238 234 230 220 203 179 156 140 139 156 187 219 237 237 228 223 226 228 217 193 168
12535 168 153 149 153 156 154 148 139 134 134 140 152 172 195 211 214 209 207 214 227 241 249 246 228 200 171 146 125 110 109 125 156 190 217 229 226 219 224 249 289 329 356 364 355 333 306
12517C06k9k6k4j6lRJ4J3POQJ2J2PjkLJ1Rjj4j6q%LKKJnj4k1k2k0j9j7j5pLJ4J6J0KlMJ4K2
12498B27K0Pqj7j7j3nOJ7K0Rpk2k9k5j2LJ3J2QOKnj5j8j1mLRJ5K0J9J3Nlrj2j2j1j0j1j6k2
12481A20k2j1MJ8K7L2L3K5J7K0K7K3Mj7k6k4k4k5k2j0JMNKkkNJ7K8L3L0K5K3K6K8J9jk1k9
12465C60k3rLQLj3k7l2k4j4qJJ5K1J6Mpj1j4j5j6j2lQJ5J2LoojJ%mj0rmLOQRJ2Qmj8k4j6K
12446A88J9K4J6jj2j4j3j0roqj2j3qjJlomLJ3K6L5L1K4J8K0K3K2J3Jj2k2k8k7j7nNPOJ0J3
12429B87J2Koppj0j6j6qKJ1K1K8K9J4ok3l0k7j9j1olk%kj2k6l3k9pJ6K8J8kj4j0JOOMLmj1
12412A41nJ0K2K1Q%%NQJ0J2J3J3J2J2J1Nnj4j2jJ0J2Lqj5j6j8j7qJ0K7K8J4lj3j3oKJ1J8J3
12395B97Kqqnoj2j6j4pKQRKnmLN%nJJ7K5J9Lj1j3kJ1J4Kj6l1l3k5rOJ2Ooj4j1kOJ1J2J5J5
$$ plain form
12517 306 277 251 227 211 208 217 231 244 251 257 265 277 289 296 295 293 296 307 316 315 301 285 277 277 280 282 284 285 280 266 245 223 203 184 167 152 145 148 162 178 188 190 187 191 205 227
12498 227 247 254 246 229 212 199 194 200 217 237 246 239 217 188 163 151 154 167 179 187 193 195 190 175 157 146 142 145 154 169 189 208 221 226 223 214 202 190 179 169 158 142 120
12481 120 98 87 91 109 136 168 201 226 243 263 290 313 317 300 274 250 226 201 179 169 170 174 179 181 179 177 182 199 227 260 290 315 338 364 392 411 410 389 360
12465 360 337 328 331 339 342 329 302 270 246 232 224 225 240 261 277 281 274 263 249 234 218 206 203 211 226 238 241 235 229 228 229 229 225 215 206 202 205 211 219 228 240 248 244 226 202 186 188
12446 188 207 231 247 246 234 220 207 197 188 182 174 162 149 141 140 141 138 132 128 131 144 170 205 236 260 278 298 321 343 356 357 345 323 295 268 251 246 251 258 264 274 287
12429 287 299 301 295 288 281 271 255 239 231 233 244 265 293 322 336 330 307 277 250 231 220 214 211 209 209 207 195 169 136 107 100 116 144 162 160 146 136 137 143 149 153 156 152 141
12412 141 136 146 168 189 197 197 197 202 210 220 232 245 258 270 282 293 298 293 279 267 266 276 288 291 283 268 252 234 217 209 219 246 274 288 285 272 259 253 255 266 284 297
12395 297 299 291 283 278 272 260 244 230 223 225 233 242 244 239 235 238 243 243 238 239 256 281 300 303 292 279 277 288 302 304 288 257 224 199 190 196 208 214 208 194 183 181 187 198 210 225 240
12376B40Ppk1k3j1JOOOJ2J9J8Qnj6j5nkqj5j1KJ3J1Nmj2j6j6pMJ1J9K7L0K5J9J6J6J5Qmj5
12359C31k1j5mMMmj2j4j2lPQjpojqk0k7k2j1lLPQLkqqkOJ3J4Pjqj2j6j8k1k0rJ2L1M0L9L9
12340B60L9L3J9Kj1j8k2j9j2qqnKQQLjmmkPJ8K1J5%j2j6qKNJlLQP%nmKPQQJ0J3J6J5J0Kqk2
12320C60l7m4m4l9k6pJ4K4K0Rloonoj2j9j7mJ1K2K6K8K6J7Noj6k0k2j8j1JJ2Rmj8j9j0oj0
12303A49j4j6j6j7j0J0K9L4K9K2J5QJmj3k3k5j5MJ3J2Q%j1j8j1LJ0%j3j9j2%J5K6L5L8L9L4
12288B97K2Npj2j4j4j4j0oJQJ6K2K8K7J3rk6k7j5mknpmLJ1J1PLLkrpJ0K5K2QMRQkj5k3k8k3
12269B78nJ2J7J3J1J0%j0mJ6K4K0J7K1K8L8O2Q8R3Q2Q6J05J22J47K15L25M48O08Q38J037R47
12257E689M23l27q79j001q22o00m50l39k38j68j39j16q5o3o1o1m7k6j1MJ0%k5m1m4m1m5m0
$$ plain form
12376 240 247 240 219 196 185 186 192 198 204 216 235 253 261 256 240 225 220 218 210 195 184 186 199 210 215 211 199 183 167 160 164 175 194 221 251 276 295 311 327 342 350 346 331
12359 331 310 295 291 295 299 295 283 269 257 254 261 269 268 261 255 254 246 226 199 177 166 163 166 173 181 184 182 174 166 164 170 183 197 204 203 195 183 167 149 128 108 99 111 142 182 221 260
12340 260 299 332 351 353 342 324 302 283 271 263 255 250 252 260 268 271 270 266 262 260 267 285 306 321 321 309 293 285 287 292 293 290 293 301 308 308 303 299 301 308 316 324 334 347 363 378 388 390 382 360
12320 360 323 279 235 196 170 163 177 201 221 230 227 221 215 210 204 192 173 156 152 163 185 211 239 265 282 287 281 265 245 223 205 194 195 207 216 212 194 175 165 159 149
12303 149 135 119 103 86 76 86 115 149 178 200 215 223 224 220 207 184 159 144 148 161 173 181 181 170 152 141 144 154 154 141 122 110 110 125 151 186 224 263 297
12288 297 319 324 317 305 291 277 263 253 247 248 256 272 294 322 349 362 353 327 300 285 281 279 274 267 263 266 277 288 295 298 301 299 290 283 293 318 340 348 352 361 369 367 352 329 301 278
12269 278 273 285 302 315 326 336 336 326 322 338 362 382 399 420 448 486 548 636 729 811 897 1002 1124 1271 1486 1811 2259 2867 3705 4742 5689
12257 5689 6112 5785 4906 3905 3083 2483 2033 1694 1456 1288 1149 1033 948 885 824 763 716 690 679 683 693 693 668 627 583 542 497 457
12246D57k2KOrk8m0m2l6k5j4j4j5pQJ9J7J3J5K3K6K2J7Pqk2k4j4JJ4K0J9R%k%jkMMnj2%K1
12228C82K8K7L0M0L8L0L2M8N6N8P2J00J20J25J47J83K10K40L28M88O78R07J222J515J437P32
12218I273l70j271j561j350j008p52n65m05k96k43k01j42r7p9p2o1o1p0o4m1k3k2j8nLKNJ3
12207E19J0qj7nMjj4j8j8j5j0oj7l4m2k9j1lmmj0j5pJ2K5K4J6J0Jrj1lOKjNJ3PormQJ7K3J9
12189C90Mj5k6k6k1j0JRJ1J4J4Prk3k5j7r%PQMLPPKLJ6L0K8J5%j6k9l3k5j2nlNJ5J9J4Plp
12171C26kJ2K4K4K6L8N9P5Q5R6J12J25J31J09M6m7j26j56j45j23j04p9n0l0k0j3n%LJ6L1L3
12158D71K4J6J6Nj9l5l2j6n%ORRQJ2J1%j3j7j4j1qpj1k1k5k2j5j0kJ3K8L4L5L3K7J3%ljjL
12141D85J6K7K5J9K5L9N4P1R5J25J42J28Q1J0n9r0p6m2j4RL9O7Q1R4J27J70K05K59L76N43
$$ plain form
12246 457 435 437 443 434 406 366 324 288 263 249 235 220 213 221 240 257 270 285 308 334 356 373 380 372 350 326 312 313 327 347 366 375 375 373 373 372 370 374 378 373 361 361 382
12228 382 410 437 467 507 545 575 607 655 711 769 841 941 1061 1186 1333 1516 1726 1966 2294 2782 3460 4367 5589 7104 8541 9273
12218 9273 8903 7632 6071 4721 3713 2961 2396 1991 1695 1452 1251 1109 1012 933 861 800 739 669 605 564 541 519 501 496 499 501 506 519
12207 519 529 521 504 499 503 502 488 470 452 437 427 421 404 370 328 299 288 285 281 277 267 252 245 257 282 306 322 332 333 324 313 310 316 318 317 322 335 342 336 327 323 331 348 371 390
12189 390 394 379 353 327 306 296 297 306 317 331 345 352 343 320 295 278 269 269 276 284 288 291 298 305 307 310 326 356 384 399 399 383 354 321 296 284 279 276 281 296 315 329 336 333 326
12171 326 324 336 360 384 410 448 507 582 667 763 875 1000 1131 1240 1286 1239 1113 957 812 689 585 506 456 426 406 393 388 388 391 407 438 471
12158 471 495 511 527 532 513 478 446 430 425 425 431 440 449 457 469 480 480 467 450 436 425 417 410 399 378 353 331 316 306 304 317 345 379 414 447 474 487 487 484 483 482 485
12141 485 501 528 553 572 597 636 690 761 856 981 1123 1251 1332 1342 1283 1193 1117 1075 1061 1070 1109 1176 1257 1351 1478 1648 1853 2112 2488 3031
12129C031P22R31J200J402J239N43m35j193j417j227r31p03n29l77k75k32k14j85j53j29r9
12120I69o5m6n4n9m2k2k1k7k3j0j2k8l7l5k7j7lQJ0Koj2j9j8nJ3J9J1Kmj0j2JK1L1K7K8L7
12105E65M6M9N2N9O1O1P5J05J38J67K18K99M01N31P21R21R35N88m9o51r24q62o65n03l93k99
12095A646k21j76j47j10p1m6m0l8m2n3o8o6n5m2l2j5MJ0OKjpj5j2KROnqqrj0qqj2j4pkqk0
12079C09k1qPJ3J0Klqj3j6j5j3j0plPK0K7K2J2Jqj6j6kJ3J6PJMOJnjJ1J7J2%nnjKMNJmj0q
12059C32oj0j7j8oPJ1J0J1J1Nmpprj4j6j0jRJ7J9J1kqlKkj0j1j1j5j9j5mQJ9K1J1rk7l4l2
12042A77k9k4j3KJ4J7K0K3K4K0J8K2K6K4J6Nrk5l5l1j3KNkrpjOJ0J1J3J6K1K0J2mj9l1l4l1
12026B07j9mRJ4K1L2M0L7K7J5Onj0oJjj4k6k3j3lNJ4J8J5PLjrj6j3%J2J3QOJ2J6J0nj8k6k6
$$ plain form
12129 3031 3753 4684 5884 7286 8525 9068 8633 7440 6023 4796 3865 3162 2633 2256 1981 1749 1535 1350 1197 1068 969
12120 969 904 858 804 745 703 681 660 633 610 600 588 560 523 488 461 444 441 449 459 461 455 443 424 406 401 414 433 444 446 442 432 420 421 442 473 500 528 565
12105 565 611 660 712 771 832 893 968 1073 1211 1378 1596 1895 2296 2827 3548 4469 5404 5992 5943 5292 4368 3506 2841 2338 1945 1646
12095 1646 1425 1249 1102 992 921 875 835 797 755 702 634 568 513 471 439 424 428 438 444 446 445 438 423 411 413 422 428 423 415 407 398 388 380 372 360 346 339 337 329 309
12079 309 288 280 287 300 310 312 309 301 288 272 257 244 234 227 224 231 251 278 300 312 313 305 289 273 271 284 300 307 308 312 318 319 314 313 324 341 353 353 348 343 342 344 348 353 354 350 340 332
12059 332 326 316 299 281 275 282 293 303 314 325 330 326 319 312 303 289 273 263 262 271 288 307 318 316 308 305 307 305 295 284 273 258 239 224 220 228 247 268 279 270 243 209 177
12042 177 148 124 111 113 127 144 164 187 211 231 249 271 297 321 337 342 333 308 273 242 229 231 236 234 225 218 217 223 233 244 257 273 294 314 326 322 303 272 238 207
12026 207 188 184 193 207 228 260 300 337 364 379 385 380 370 364 365 364 350 324 301 288 285 290 304 322 337 344 347 346 337 321 308 308 320 333 341 347 359 375 385 380 362 336 310
12009C10k6k7k4j6qjOJ2J4Lj3k3k2j5JK0L2K8J1qk1j8kJ9K9K0Lj0j4j6j6qLRKpqkJmj2j8k1
11991A63j6nLNLJOJ9L1L6K8J4Kmrj4k0j8j1%J2J6J1ONNLKNOKjNJ7K1Qj0k6l1l0k7k5k3j8j1
11973A36lJLORJ1J0J1J1Lpj0kJ6L0L1K0Mrj2lRJ5J6J0MRJ9K1J2KJLmj8k5k2j7j8j7j2mkjL
11955B40Klj1j2j0rj4k0k1j2lkkQL1M6M0K0M%krj3j5j6j5pQJ6Rpj8j6kJ3K1J7J4J3J4J2RP
11938C05Nmj4j7j1oppnonlJLOJ1J3Nm%RJ3J0PMpk5l5k9j8qKJ2J6J8K0J7On%RJ1%njMJ0K1L3
11918C49L3K7L1L9L6K6K5L4L9M4N6O8O2M8M5N0N1O6J09J58J76J84K23K88L58M73O78R45J246
11907E967J658K156K340J659J20j481k279k150j647j244r72p08m82l61k90k08j46j43j44r8
11899A547m9m4m5j9nk4l0LK4MkL8O6N5O8J41K08K26K63L65M67N63P60J113J529K012K703L419
$$ plain form
12009 310 284 257 233 217 209 208 214 226 240 243 230 207 185 170 171 191 223 251 262 254 233 215 213 232 261 281 284 274 260 244 228 220 223 232 234 227 219 217 218 214 202 184 163
11991 163 147 142 145 150 153 154 160 179 210 246 274 288 290 286 277 263 243 225 214 214 226 242 253 259 264 269 272 274 279 285 287 286 291 308 329 337 327 301 270 240 213 188 165 147 136
11973 136 133 134 137 143 152 163 173 184 195 198 191 181 179 195 225 256 276 280 271 259 256 265 280 296 306 310 319 338 359 371 373 374 377 373 355 330 308 291 273 256 244 240 238 237 240
11955 240 242 239 228 216 206 197 183 163 142 130 127 125 123 131 162 208 248 268 272 272 270 261 248 233 217 202 195 203 219 228 221 203 187 185 198 219 236 250 263 277 289 298 305
11938 305 310 306 292 275 264 258 251 244 239 233 228 225 226 229 235 246 259 264 260 260 269 282 292 299 303 296 271 236 207 189 181 183 195 211 229 249 266 272 267 267 276 287 287 282 281 285 295 316 349
11918 349 382 409 440 479 515 541 566 600 639 683 739 807 869 917 962 1012 1063 1129 1238 1396 1572 1756 1979 2267 2625 3098 3776 4721 5967
11907 5967 7625 9781 12121 13780 13900 12419 10140 7990 6343 5099 4127 3419 2937 2576 2286 2078 1932 1789 1645 1547
11899 1547 1498 1454 1409 1390 1385 1361 1331 1334 1358 1362 1360 1398 1464 1519 1587 1728 1936 2162 2425 2790 3257 3820 4580 5693 7222 9234 11937 15356
11887A5356L364J863o50k776l492l014k236j692j320r79p16n71m68l46k58k27j99j43j01r4
11879A301q6o0m8n8o1m0l4n1n9m2k6k8l1k6k8m1m0k4j8l4m8l9k5j7pJ2K1J4K%jooOJ4J3J3
11865D12J8J5%j2pKKkmqj4k0j9j7k0j6p%jjOJ3J5J5K0K3J9J1Nkqpljpj0onrj2oMPKlj0j3j0
11845C29JJ1J3J0PLjjOJ1Qjrj3j2j0qj0j5k2l0l7l6j6J8L7L0J1klkmonJJ0J5J1jqoJlrj3j1
11827B39pkQK0K5K5K3K1J3jj3k0j8j4j2j6k1j8pNJ3J9K2J8Olmnrj4j3lMMlj2j9j9j0LJ3K2
11810B40K9K5Pj2k4k5k4k2j9j5j3qj%nj4j4plmlRK7M3M8L7J6jkQJ7J1mk0l0k3pPO%jPJ4J0
11792B60jj5k3k0qLOQJ5K5K1Lj2j4j3j6k0j7lJ1K4K9K5J1OJ1J7J0koLJ0J0PQPJj0j7k0j9j9
11775B76j8j1JJ9L6M7M7L5J4nj3j0pqplkqj2j4ropqj2j2roj0k0k6k4j6j1pMJ3J4OJLPJ0J3
$$ plain form
11887 15356 18720 20583 19933 17157 13665 10651 8415 6723 5403 4424 3708 3137 2669 2323 2065 1838 1639 1496 1395 1301
11879 1301 1215 1155 1107 1049 988 948 914 863 804 762 736 708 677 651 623 582 542 518 500 466 418 379 354 337 330 342 363 377 379 379 378 372 366 372 386 399 412
11865 412 430 445 445 433 426 428 430 428 424 416 402 382 363 346 326 310 303 303 302 301 307 320 335 350 370 393 412 423 428 426 418 411 408 407 400 390 384 379 370 358 352 356 363 365 362 352 339 329
11845 329 330 341 354 364 371 374 373 372 378 389 397 396 387 374 362 352 344 334 319 297 267 230 194 178 196 233 263 274 272 269 267 263 257 252 253 263 278 289 288 280 274 275 272 263 250 239
11827 239 232 230 238 258 283 308 331 352 365 364 351 331 313 299 287 271 250 232 225 230 243 262 284 302 308 305 301 296 287 273 260 257 261 265 262 250 231 212 202 205 218 240
11810 240 269 294 301 289 265 240 216 194 175 160 147 139 138 138 133 119 105 98 95 91 88 97 124 167 215 252 268 267 265 273 290 301 297 277 247 224 217 224 230 230 229 236 250 260
11792 260 259 244 221 201 193 196 202 210 225 250 271 274 262 248 235 219 199 182 179 190 214 243 268 279 285 296 313 323 321 315 318 328 338 345 353 360 361 351 334 314 295 276
11775 276 258 247 248 267 303 350 397 432 446 441 428 418 411 403 396 393 391 383 371 357 348 342 335 327 315 303 294 288 278 258 232 208 192 181 174 178 191 205 211 212 215 222 232 245
11758B45J4Rkqqrj5k1j8oKOJ1J2RLKMJprpl%JMNKkklj0j5j2KJ7K6K5K4K0J2Moj5j9j8rNJ2
11738B53J1KljK%j2k2k3k0j8j7j4mPJ2J6K2K9K9K4J8J2NmpjRJ2OJNJ2Mj8m0m1k3jOJnqqqm
11720A96QK3L5M0L6K4Pqj5j1mNRNkrj4k0k6l0k8k1j3lNQQNLLMJkm%OJ0J1RRMmj4j4mMLpj8
11700B10k5k2j3lMRK1L9N1M4K6Mj3k4k8k8k6k5k1j0kmj1j0QK3K4J0oj6j9j9j6j3j5j8j6mJ4
11684H0K7L0K6J9J2NLPJ1Pmj6j9j2%MLKOJ3J3LpoNJ4J4PKjmj1j1nMOKoj7k4k2pJ4L0L2K0%
11665B49j5k2k2j6j2rpolkloqpJPNlj2rjL%nnLJ2J8K1J5PmpolJNOjj0j2nkoj5j6mRJ4J1PO
11644A36KlplPK1K8K5J2lj3j7j7j2pk%lj2k1k5k3j2kNN%klkljLRJ6K1K0J6J2J5K1K4J5LkO
11626B27J8K1J6Lqj8k0j7j2j0kJ2K2J8Jj3k0k6l1k7j5KJ2J7J8J5NnmLN%nkNJ0RLnnMJ6J8P
$$ plain form
11758 245 259 268 266 258 250 241 226 205 187 181 183 189 200 212 221 224 226 230 231 224 215 208 205 205 206 210 215 217 215 213 210 200 185 173 175 192 218 243 267 287 299 303 297 282 263 245 236 241 253
11738 253 264 266 263 262 264 264 252 230 207 187 169 152 138 134 141 153 169 191 220 249 273 291 303 308 304 297 296 305 317 323 324 329 341 345 327 287 246 223 222 228 229 224 216 208 200 196
11720 196 204 227 262 302 338 362 369 361 346 335 331 336 345 350 348 339 325 305 279 249 221 200 187 184 189 197 205 210 213 216 220 221 219 215 215 221 231 242 251 260 264 260 246 232 228 232 235 228 210
11700 210 185 163 150 147 151 160 181 220 271 315 341 345 332 308 280 252 226 201 180 170 168 164 153 143 151 174 198 208 202 186 167 148 132 119 104 86 70 66 80
11684 80 107 137 163 182 194 199 202 209 220 227 223 207 188 176 176 180 183 185 191 204 217 220 213 207 212 226 240 247 249 248 244 233 222 217 221 227 229 223 206 182 160 153 167 197 229 249 249
11665 249 234 212 190 174 162 153 146 140 137 135 132 126 118 111 112 119 124 121 109 100 99 102 102 97 92 95 107 125 146 161 168 164 157 151 148 149 154 160 159 149 137 132 130 124 109 93 89 98 112 123 130 136
11644 136 138 135 128 125 132 153 181 206 218 215 202 185 168 156 149 147 147 144 132 111 86 63 51 49 54 59 59 57 54 52 49 48 51 60 76 97 117 133 145 160 181 205 220 223 221 227
11626 227 245 266 282 285 277 259 239 222 210 200 198 210 232 250 251 238 218 192 161 134 119 121 133 150 168 183 188 183 179 182 187 187 182 180 185 195 204 207 202 197 201 217 235 242
11608B42mmMLpj9k0j3kNQOLMJ2K2K8K1Pk%ONrk2k4j9j7j8j7pNOkj0qm%NJ6K8K9K2J4J6K8L7
11589C54L3J3j5l4m0l3j8jJ3J7Oj3k8m0m6m7l5j1J0J9K0K3K7K9K4J5RJrk0k2j6pKJ0J8J7K
11574B27j6k5j8o%kqj4j5qknk0l4l5k3qNJ3K1K4K8L1L2K7J8QMMRJ6K3K5K3K1J7J1MKjmqoK
11557C37QRJ2J4J4ROPJ3K7M1M6M6N3Q2J27J80K49L25L53K60M3j90l22l24k61k01j53j08p5
11544F27o2o4o1m8l6k6j7qk%Jjnpm%lnjOPjrqlJMQJ5K1K3K0J0mj8k8l2l3k8j5jRJ4J5J9K3
11526B93K1J0kj1j4j6j6j8k0k4k0pPJ5J7J8J9J8J4J1J5K1K3K4K4K0Mk3m9o1n3k9pMLlqolk
11510A89jJMN%mqrj1j3pLJ0J3J8K8L0K5K1K9L7L1Oj3j8j7j5j2plnj2j3j4j8k1j5olpj1mLO
11492A92Mjoq%J3K3J8Krj4j0mNJ4J8J4Knpj1j6j8rQJ4Mj1k1j9rjMOMPJ2J8K3K6K6J6lk4l6
$$ plain form
11608 242 238 234 238 241 234 215 195 182 180 185 193 199 202 206 218 240 268 289 296 294 294 300 305 296 274 250 231 214 196 179 172 177 183 181 171 163 159 159 164 180 208 237 259 273 289 317 354
11589 354 387 400 385 351 311 278 260 259 272 289 295 282 254 214 168 121 86 75 85 104 124 147 174 203 227 242 251 252 243 223 201 185 178 180 190 208 225 227
11574 227 211 186 168 162 162 160 152 138 123 115 113 108 88 54 19 -4 -12 -7 6 27 51 79 110 142 169 187 195 199 203 212 228 251 276 299 320 337 348 352 354 353 349 341 335 337
11557 337 345 354 366 380 394 403 409 416 429 456 497 543 589 642 724 851 1031 1280 1605 1958 2218 2261 2071 1749 1425 1164 963 810 702 627
11544 627 565 501 440 392 356 330 313 305 303 303 304 303 298 291 287 287 284 279 278 284 291 290 281 273 270 271 275 283 298 319 342 362 372 368 350 322 290 257 229 214 213 222 236 251 270 293
11526 293 314 324 322 311 297 281 265 247 227 203 183 176 183 198 215 233 252 270 284 295 310 331 354 378 402 422 426 403 354 293 240 211 204 208 211 208 200 194 191 189
11510 189 188 189 193 198 198 194 186 177 166 153 146 149 159 172 190 218 248 273 294 323 360 391 397 384 366 349 334 322 315 312 307 295 282 268 250 229 214 208 205 198 187 183 186 192
11492 192 196 195 189 181 181 194 217 235 237 228 214 204 200 205 219 237 251 253 248 241 230 214 196 187 195 209 213 202 181 162 153 152 156 162 166 173 185 203 226 252 278 294 291 267 231
11474B31l7l0j2J2L4L5J2k0m2m7l9k5j2mkJPJ7K8L1K6J0lmKJ1J4J6K2K7K2Rnj4k1k6k1pJ3
11459B09K0J3lj1oLMjppoj3k1j9qJ%rj6j7j7j3mNJ1QNRJ6K0J6Ooj6j9j8j5j0jJ1J9J9J2Nk
11440A47j0j6j1OK3K6J8J3J8K4K6K4J7Kj6k8k4j0MOKopJJ0J6J2PLLNJ0J4J1Jj0j6j8j8j8k0
11424B21k1k2k0j6j2qjJ5L1M0L8K6J3Krj7k1j6lQQkpmKjj1j7j5j2j1j2pOJ9K7K5J8J0kj6k5
11407B01k2rJjrj0mKJllJQJ2J3J1J1J2J0MjkKkj3k5k8k3j4rn%J1K5L4L0J3nj6k2k3j7pLRJ3
11389A54J7J5Jj5k0j1jLjpj1oNJ6K3K1J9J4Nj0k4k7k0rLJ2K1K3K3K3K1J7Qnj6k6k8j8lJ0R
11372B05kj8k9l1k0jK0L3L3K6J8J5J5J3Ppk1k5j6kKJKJ0J3Nj0j6j2kJNQJ0QKlpj2j9j9qRJ8
11355A99J8Poj5k0k0j8j8j6j5j2j2j1oOK0K7K8K0J1KJNRQNRJ6K1J9J4Noj5j4rkJJjj2k4k8
$$ plain form
11474 231 194 164 152 164 198 233 245 225 183 136 97 72 60 56 54 55 62 79 107 138 164 174 171 167 169 180 194 210 232 259 281 290 285 271 250 224 203 196 209
11459 209 229 242 239 228 222 225 229 228 221 214 208 195 174 155 147 148 148 139 123 106 89 76 72 77 88 96 101 110 126 146 162 168 162 146 127 109 94 84 83 94 113 132 144 149 147
11440 147 137 121 110 116 139 165 183 196 214 238 264 288 305 307 291 263 239 229 233 239 241 235 228 229 239 255 267 274 277 280 285 295 309 320 321 311 295 277 259 241 221
11424 221 200 178 158 142 130 122 121 136 167 207 245 271 284 286 277 260 239 223 220 228 236 234 227 223 225 224 213 196 181 169 158 146 139 145 164 191 216 234 244 242 226 201
11407 201 179 170 171 170 161 151 147 149 150 147 144 145 153 165 178 189 200 212 222 226 225 223 225 223 210 185 157 134 120 111 106 106 117 142 176 206 219 214 198 176 153 136 129 132 141 154
11389 154 171 186 187 172 152 141 140 143 142 135 124 118 123 139 162 183 202 216 221 211 187 160 140 131 134 146 167 190 213 236 257 274 282 277 261 235 207 189 186 196 205
11372 205 203 185 156 125 105 104 124 157 190 216 234 249 264 277 284 277 256 231 215 213 215 216 218 228 241 246 236 220 208 206 207 212 220 230 238 240 237 230 218 199 180 172 181 199
11355 199 217 224 218 203 183 163 145 127 111 96 84 72 61 55 61 81 108 136 156 167 169 170 175 184 192 197 206 222 243 262 276 281 275 260 246 237 235 236 237 236 224 200 172
11337A72k1j3j0oKJ1J4J3J6J9J8J0NOJ0J2RLrk3k8k1pJNPJ2J3J1P%rj6k3k2j3jRJ1Qkj0j4
11320A56qkKjlMJ9L0L2K4J1pj8k1j7rkPJ4J5J5K0L3L9L0J0qk1l2m1m4m0l0k0j0onnjRJ8K2
11303A59K3K1J7J0lk2l9m8m3l0j6kJ2J9J9Qoj6j6oJ2K2K0RJpj3j6pJ0K3L2L4L2K1NnoproL
11286A89Qkj8k3j7rjOJ2QjjRJ8K2K2J7Nj0j4mONnrplmoqj0j1oJQJ3J6J6J0JnoJJ3K1J9J0M
11267B80QRjj6k2j6qm%RJ6J4J0J0RMmqj0j3j8k5k9l4l1j9jJ5K1J8J1Mlrj5j5j1pjMOPJ0J9
11249A64K3K0Nrj4oLJ1J2PkplKLj%OJ1Oqk4l2k9qJ8L5L2J7NLNMjpj7k8l5l3k4j1%OMljQJ9
11230A26K2J3M%%KKLkj1k5l3k6rRJ4J3J7K7L3L1K6K8L4L6K2Jj8k4k3k1k0j8j2m%J%llj%kq
11212B01j1mOROjnn%PJ5J6J2J0J4J7J5QOM%qj7k3k6k1qOJ2Kj4k4k7k0qOJ7J9J4RQJ0RMjnn
$$ plain form
11337 172 151 138 128 122 124 135 149 162 178 197 215 225 230 236 246 258 267 270 261 238 210 189 182 183 188 195 207 220 231 238 238 229 213 190 168 155 154 163 174 182 180 170 156
11320 156 148 146 148 147 144 148 167 197 229 253 264 257 239 218 201 192 190 197 211 226 241 261 294 333 363 373 365 344 312 271 227 187 157 137 127 121 116 111 110 119 137 159
11303 159 182 203 220 230 227 205 166 118 75 45 29 27 39 58 77 85 79 63 47 41 53 75 95 104 105 98 85 69 62 72 95 127 161 193 214 219 214 208 201 192 186 189
11286 189 197 195 177 154 137 128 127 133 145 153 152 151 160 178 200 222 239 244 234 220 216 222 227 222 213 206 203 199 193 185 175 164 158 159 167 180 196 212 222 223 218 212 213 226 247 266 276 280
11267 280 288 297 296 280 258 242 234 230 230 239 255 269 279 289 298 302 298 290 280 267 249 224 195 161 130 111 110 125 146 164 175 179 176 167 152 137 126 119 118 122 128 135 145 164
11249 164 187 207 212 203 189 183 186 197 209 216 214 207 204 206 209 208 208 214 225 231 223 199 167 138 130 148 183 215 232 237 240 245 249 248 241 224 196 161 128 104 93 93 99 103 100 99 107 126
11230 126 148 161 165 165 165 167 169 172 170 159 134 101 75 66 75 89 102 119 146 179 210 236 264 298 334 356 357 339 315 292 271 251 233 221 217 217 218 218 215 212 211 211 209 201
11212 201 190 186 192 201 207 206 201 196 196 203 218 234 246 256 270 287 302 310 316 320 320 312 295 272 246 225 217 223 235 237 223 199 172 152 144 150 167 186 200 209 217 227 236 240 239 234 229
11194B29nopojKL%lnrj6j4kJ4J7R%JRRjj3k2k0qJ1K5K4J0mpokjlj0j9k2j2jLMORKrj4qJJ0
11173A42J8K4J4qk3j8kPMKLNNQJ6K3K1J1jqqlOOlj9k6j9lJ3K5K8K2J0jl%Kpk6m2m5l3j4%N
11155A08NOQQRJ0Mpj7j6rmorj0qj0r%J2J6J4RLjmjMNJ%JKKKOOjm%POjojQJ8J9J1JkLROkqq
11132A85qj4k0k0j7pRK4L2K9J9J0Jrj7j9k0j9j6pNRPQJ7K3K2J2Jmm%LJmj1j0nLPJ3K0K4J8
11114B71Lj8l0k6lK3L5L5K6J3mk1k8k1rlk%MKkn%Llj8k8k1lJ5K1K0J7K0K0J7J0NKjprqmLJ5
11096C06L0L2K1Mrj2qjKlk0l4l8k9j6lPJ5J7J3J2J3J4Lj4k8l1k0lJ7K8K2Mj5k1j5n%krj6j7
11079A91j3nMPJ0J1J7K2K5K2J0j1l2m3l4j6lJmnnkNJ1J1%j6k9l5l9l8l1j5MK0L1L4L1K6K6
11063A43K7K5J0loJON%%krj6k0j9j7j3mMOKkjmj1j5pJ1K7L4K9J7NknpqmLQO%op%J3K9L2K1
$$ plain form
11194 229 224 218 211 205 204 206 209 209 206 201 192 176 162 160 174 191 200 200 201 210 219 218 205 183 163 155 166 191 215 225 221 214 208 206 205 202 192 173 151 139 138 141 145 151 160 162 153 139 131 132 142
11173 142 160 184 198 190 167 149 147 154 158 160 163 168 173 181 197 220 241 252 251 243 235 232 238 244 241 222 196 177 174 187 212 240 262 272 271 268 268 270 263 237 195 150 117 103 103 108
11155 108 113 119 127 135 144 154 158 151 134 118 109 105 99 90 80 72 62 53 53 65 81 95 104 107 106 102 101 105 110 111 111 112 114 116 118 124 130 129 125 125 132 138 137 131 130 138 156 175 186 187 185 188 197 203 201 193 185
11132 185 177 163 143 123 106 99 108 132 164 193 212 222 223 214 197 178 158 139 123 116 121 130 137 145 162 185 207 219 220 216 212 212 215 216 212 201 191 186 189 196 209 229 253 271
11114 271 274 256 226 200 197 220 255 290 316 329 325 304 276 255 246 243 241 241 245 247 245 240 240 243 240 222 194 173 170 185 206 226 243 263 283 300 310 315 317 316 309 300 292 288 291 306
11096 306 336 368 389 393 384 372 364 363 365 362 342 308 270 241 225 222 229 244 261 274 286 299 313 316 302 274 243 223 220 237 265 287 291 276 255 240 235 235 233 224 208 191
11079 191 178 173 177 184 194 205 222 244 269 291 301 290 258 215 181 165 162 163 159 154 149 147 152 163 174 174 158 129 94 55 17 -14 -29 -25 -5 26 60 91 117 143
11063 143 170 195 205 202 196 197 203 208 208 208 206 197 181 161 142 125 112 108 112 118 120 118 117 113 102 87 80 91 118 152 181 198 203 201 196 189 181 177 180 188 194 194 188 181 181 194 223 255 276
11043B76jj7j8pOJ6K0K0J5Lj2k2k1j0JNLJKLL%k%J%qk0l1l4k6j4JJ5K2K1J7J4J1Mj1k3k3j9
11025A61j7k0j4jJ2J4PLJMNQJ4K1K3J7Lj5k7k7j7mORPMLQJ2J0NkjKN%rj7j7j0kMNNOQQMkj1
11005A91j6j5pLJ1J5J4J7K2L4M1L9K0ok6l2k7k1j4okoj3j4nOJ2QJknrj1j1%J3K2K0QJLJ2J7
10988B82J2%rj3rkLMmj3k1k0rNJ4J3OkmmprrokKOOMNOKrk6l1j8PK4K7K0J4J4J2QLjmrj3j6
10968B29j7j8k0j9j2NK5M5N1M2K4Opj4j3lJ5K8L1K3J0lj0j7k0k1j9k1l2m1l6j6J%j5k1rJ1
10953A42K4K7K3J9J4QM%rj9k4k0j4qkQJ8K4K1J1LlJPJ4J2Lorppj1j3pLNlj5k4k4k6k8k9k4
10935E9j6nOJ5K3K9L2L2K8K0J1%j3k0j6lNLor%J4K7K8J6%qrmKOJ2J4J5K0K1J4nk8m0m0k8j8
10918A84j0pmJJ1K5L1L0J8OjKJ0J5J1NLNJnrj0qmNJ5J6Porlknqnjmpj0j1j6k1k1j3mKJlpq
$$ plain form
11043 276 275 258 240 233 239 255 275 295 310 313 301 279 258 248 249 254 257 258 260 263 266 266 264 264 265 265 257 237 206 172 146 132 133 148 170 191 208 222 233 237 226 203 180 161
11025 161 144 124 110 109 121 135 142 145 146 150 155 163 177 198 221 238 241 226 199 172 155 151 157 166 173 177 180 188 200 210 215 213 212 214 219 219 210 193 176 166 164 168 173 178 184 192 200 204 202 191
11005 191 175 160 153 156 167 182 196 213 235 269 310 349 369 363 337 305 278 257 243 237 235 229 216 202 197 203 215 223 224 222 217 208 197 186 186 199 221 241 249 250 253 265 282
10988 282 294 294 285 272 263 261 264 268 264 251 230 210 201 206 220 233 239 237 233 229 222 213 204 198 196 198 204 210 214 219 225 227 218 192 161 143 150 174 201 221 235 249 261 269 272 271 267 258 245 229
10968 229 212 194 174 155 143 148 173 218 269 311 335 341 334 320 307 304 319 347 378 401 411 408 398 381 361 340 321 300 268 227 191 175 176 176 161 140 131 142
10953 142 166 193 216 235 249 257 261 261 252 233 209 189 175 167 165 173 191 215 236 247 250 247 248 255 269 281 284 278 269 262 255 244 231 224 227 232 229 214 190 166 140 112 83 59
10935 59 43 38 44 59 82 111 143 175 203 223 234 234 221 201 185 182 187 190 184 175 175 189 216 244 260 260 252 243 239 241 247 259 273 288 308 329 343 338 310 270 230 202 184
10918 184 174 167 163 164 175 200 231 261 279 285 284 286 296 311 322 327 330 335 336 331 322 312 304 300 305 320 336 343 337 328 325 323 318 310 305 304 300 293 283 272 256 235 214 201 197 199 200 197 190 182
10898A82rj1j4j5rJJ3K2K4K1J3Jj0j5j8j6j1mMJ1J5J7J8J6J3J3J5J8J6P%%MJ0QJoqnJlj7l9
10880B54n2m8l2j3LJ4K6L5L7K9J3nrjJ4K4K2J3%rj6j8j8j9k4l0l1k7j0J2K9L3K1QMPJ1J1N
10865B63lqoLPKj0k1k5j7lJ0J2Lj0j3lJ2J7J2MjJMRJ4J8J8Rqk0k2k0k3l2l7k7mJ7L1L4L2K7
10847B46K2J9J7J0mk0k6j9kPRKnj1j7j6j1qrrqjKkrj2rmKQJ6K5L0K4J3LkoqqjMJqj0nJjoj1
10827A93j3j2j0j0j2j4j2pnolQK4L5L1J9Noj3j6j7j1lNPPNJkpqplKOJ0QMNQRlj8k7k3j3kR
10808A18K1K9L1K3J0mj1pQK3K9J9Lponj5k7l1k2j2j2j9k3j8j2ojPJ2J0PJ4K4L0K2J1NNRRR
10791B50ONNJok0l7m4l5j4RK1K0Rmj0j0rqpoppjJ1K4L1L2K8K2J4Lnj2j7k2k7k6k0rJNKjkm
10773A29qj2j0lMQQMjlkNJ3K1K7L2L0J9RL%jjPJ6J5Jj8l1l0j8pmrj6k0j3JJ9K8K3PolQJ3J1
$$ plain form
10898 182 173 162 148 133 124 125 138 160 184 205 218 219 209 194 176 160 149 145 149 160 175 192 210 226 239 252 267 285 301 308 308 308 312 322 330 331 325 317 312 313 310 293 254
10880 254 202 154 122 109 112 126 152 187 224 253 266 261 252 251 265 289 311 324 324 315 299 281 263 244 220 190 159 132 122 134 163 196 217 225 229 236 247 258 263
10865 263 260 252 246 249 256 258 248 227 202 185 182 192 204 207 197 184 181 193 210 222 226 225 226 230 239 253 271 289 298 290 270 248 228 205 173 136 109 105 122 153 187 219 246
10847 246 268 287 304 314 310 290 264 245 243 250 259 261 256 245 228 212 201 193 184 175 167 166 168 166 157 145 136 132 134 142 158 183 213 237 250 253 251 245 237 229 228 232 233 225 215 210 211 210 204 193
10827 193 180 168 158 148 136 122 110 103 98 92 89 97 121 156 187 206 211 205 192 176 159 148 145 150 157 164 169 170 168 161 153 146 143 145 151 161 169 173 178 186 195 192 174 147 124 111 109 118
10808 118 139 168 199 222 232 228 217 210 218 241 270 289 292 285 279 274 259 232 201 179 167 155 136 113 95 83 77 76 83 95 105 112 126 150 180 202 213 218 223 232 241 250
10791 250 256 261 266 267 261 241 204 160 125 111 120 141 161 170 166 156 146 137 129 122 116 109 102 101 112 136 167 199 227 249 263 266 261 249 232 210 183 157 137 128 129 134 136 135 133 129
10773 129 121 109 99 96 100 108 116 120 119 116 114 119 132 153 180 212 242 261 270 273 273 272 271 278 294 309 310 292 261 231 213 206 202 193 177 157 144 145 164 192 215 222 216 213 221 234 245
10754B45OQRLrj5j4rpqpJQJ0PPMjlPK3K6Qj6k6k3j3kPJ3R%rj5j8j5pKLjkkqk3l2k9j6jJ4K8
10734A17M0M5M3L0J5LkJKjmJOJ0QQQJ2K0K4J7jj8l0m2n4n7m8l1j6nJNPJ1J9K5K1Prk0k6k4
10716A18j6mOJ7K7L5L1J4nj9k1j7mJ2K1J9RLMJ1J7J7J6J7J5Nj2k6l0k8k2j4kNNmqj0nKJ3J9
10700B11J5J0RJ1Qjonjmqj0j4k2k7k6k1j8j7j1kL%nqpmmpj0j0mMJ1J8K5K8K8K5J6Lrj3okk
10681A41lLJ1J3Mpj2qKJ1J6Pqk2k6j9oRJ9K3K0J4Olrj0roonlnj3j9k1j3JJ3J3LlMJ8K8K3J2
10663A78KJLQJ0RNkj3j7j1JRQOPJ2J3PJl%PJ2Qqk2k2j3qj0rjJ1J7J9K0J9J2Njpj2j1jJ1J2
10644B62%j3k2k1j2jJ0J8K3K3J8Poj2j0j0j5j8j9j7j6j3qpj2j4nJ2J7Oj0j1KJ5J8J2OJJJJ
10627A81jmmLJ4K1J5LopkMRJ4J7J7J5J3J0Lj0j9j7rkoj3j6j2kMPRJ5K4K7J8Opj5k3k4j4MJ8
$$ plain form
10754 245 251 259 268 271 262 247 233 224 217 209 202 203 211 221 228 235 239 238 235 242 265 291 299 283 257 234 221 219 226 239 248 248 239 224 206 191 184 186 189 188 186 184 176 153 121 92 76 75 89 117
10734 117 157 202 245 275 290 293 291 292 294 293 289 290 296 306 314 322 330 342 362 386 403 402 384 354 312 258 201 153 122 106 101 102 107 114 125 144 169 190 197 188 168 142 118
10716 118 102 98 104 121 148 183 214 228 223 204 183 166 162 174 195 214 223 226 230 241 258 275 291 308 323 328 316 290 260 232 210 196 194 199 204 200 192 182 177 179 192 211
10700 211 226 236 245 256 264 263 257 252 251 247 239 229 215 193 166 140 119 101 84 73 71 74 74 69 61 54 50 46 39 29 19 15 19 30 48 73 101 129 154 170 173 164 151 145 143 141
10681 141 138 141 152 165 169 162 150 142 144 155 171 178 170 148 122 103 97 106 125 148 168 182 188 185 176 166 157 151 145 140 137 132 119 100 79 66 67 80 93 96 93 97 115 143 166 178
10663 178 180 181 184 192 202 211 216 214 201 184 173 174 183 191 197 204 216 229 236 237 234 234 241 253 261 253 231 209 196 188 178 169 168 179 196 215 235 254 266 271 270 263 251 240 239 250 262
10644 262 262 249 227 206 194 193 203 221 244 267 285 292 286 274 264 254 239 221 202 185 169 156 148 141 129 115 110 122 139 145 135 124 126 141 159 171 177 178 179 180 181
10627 181 180 176 172 175 189 210 225 228 222 215 213 217 226 240 257 274 289 302 312 315 305 286 269 260 258 252 239 223 211 209 213 220 229 244 268 295 313 319 312 297 274 250 236 240 258
10609B58K2K3K1J5Kj1j8k0k1j7j1mklKRJ1J1J0J1QMmj5k7l3l0k6l3m2l9j9kLLJ3K3K1J1L%
10593A07mj3j3qKJ3L0M8N0K9lk6k9j8nPJ6K4K3J4%qpjlqqjKkprmKPJ0J0ROMnj7k2j1PJ7J1
10574B16lrmPJ5J7J4Q%pj1qkLRJ5J6Rok1k9l2l0j7MK3L2K8J8Moj4j3nNJ1J1Moj0j0pnmoqn
10555A91LJ2J9K2K4K1J3Jj2j8k2k2k2j6j1j0qlMJ0J5J2Mpj4j0ljoqlLMOJ2K0K0J4J1J4K0K0
10538B99J1pk2k9k8k5k2j8nJ5L4M1L7K4Oj2k5k9k2j1moqlMQPOQRQOQPLnqqlNJ4J7Qj6m1n3
10520A75m7l3k3j8j3mRK0K0J3QNJlokOJ1J1N%kjlj0k1k4j0J0K4K6K2K2K8L2K9K1J3NknjRJ6
10502C13J7R%qj2j8k3k5k2j4kJ0J6J6Plrrqqpm%LlqnKNmj4j6nRK1K8L2K9J9Mj0j7j5j0oqj7
10483B30k4k6k5k3j7pNJ4J5RLjLRJ4J0%rj4j7k0k2k1j7qNK4L7L7K5J3OPNjj2j6j2JJ2J9K4
$$ plain form
10609 258 280 303 324 339 341 330 312 292 271 254 243 239 237 234 236 245 256 267 277 288 296 300 296 281 254 221 191 165 132 90 51 32 30 33 36 49 72 93 104 107 107
10593 107 103 90 77 69 71 84 114 162 212 241 238 212 183 165 160 167 183 207 230 244 244 236 229 228 225 217 209 208 210 208 201 192 188 190 197 207 217 226 232 236 231 214 192 181 188 205 216
10574 216 213 204 200 207 222 239 253 261 261 254 243 235 233 236 245 260 276 285 279 258 229 197 167 150 154 177 209 237 255 259 253 239 226 221 226 237 248 252 246 236 226 219 214 210 204 196 191
10555 191 194 206 225 247 271 292 305 306 294 276 254 232 210 194 183 173 165 162 166 176 191 203 207 200 186 176 173 172 166 158 155 158 162 168 180 200 220 234 245 259 279 299
10538 299 310 303 281 252 224 199 177 159 154 169 203 244 281 305 311 299 274 245 223 212 208 202 194 191 195 203 210 216 224 233 241 247 255 262 265 260 252 244 241 246 260 277 285 269 228 175
10520 175 128 95 72 54 41 37 46 66 86 99 107 112 113 110 104 102 108 119 130 135 135 133 132 129 119 98 74 64 74 98 124 146 168 196 228 257 278 291 296 294 289 288 297 313
10502 313 330 339 339 331 319 301 278 253 231 217 215 225 241 257 264 261 252 243 235 227 220 216 216 219 216 208 203 205 210 206 192 176 171 180 201 229 261 290 309 313 303 286 271 261 255 247 230
10483 230 206 180 155 132 115 108 113 127 142 151 154 153 156 165 179 189 189 180 166 149 129 107 86 69 61 66 90 127 164 189 202 208 215 220 219 207 191 179 180 192 211 235
10466B35K9K7J6LMJ8L1K7Oj8m0m9m3k3JJ0Noj2j3j3j3rlJMJ1K0K4K1J6Qnk1l2k8j5jRJ6K0
10450B18J6NkNJ8K5K0QjlkKOQPkj2k2k4k3j9j5j1lMJ1J2Nmj0rj0j0qkL%opJJ0J3J3J6K5L0
10431B76K7J2j3l6m2k5jJ4J5J3J2J1MmlLJ0J4J4Ooj9k5k3k0j6rm%JNQROMKkpnQK1K5J7Jj4
10413B64k4j9mJ2J2mk4l8m4m3l3k1qjJlrj4j1JJ5K5K6K2K2K4K7K2J0k%PNrk3k0%J8K4K1J5
10397B19J2RNLLOQOJnj0rmllqj6k1j9nJ3J8Rpj6j5rkLJ2K1J8Omp%OJ1J6J8J4%j5k2j9j6j6
10378A86j5qOJ8J8J0kqrpnjLjrj5j5j0j0j5k2k6k3j6mLJnnLJ0NmpjNQJ1J5J7J3O%jKONnj6
10358H6j9j0OK0K5K5J8Pj%MNNOJ1J7J6J4J2J2Mpj9k4j7nJ1J9J5Lrj1o%%lorj4j8j6pLOLJL
10339A56ONON%qqKJ8K6K0J1PRJ5J9J9J1JJORjj4j7pMNmj5j8j2kNRRLqk1k6k6k3k4k2j3ojK
$$ plain form
10466 235 264 291 307 310 314 332 363 390 396 378 338 289 246 223 224 234 239 233 221 208 195 182 173 170 171 175 186 206 230 251 267 275 270 249 217 189 174 173 182 198 218
10450 218 234 239 237 242 260 285 305 313 312 309 307 309 315 323 330 328 316 294 270 247 228 213 202 199 203 214 226 231 227 217 208 198 188 180 178 181 181 175 168 169 179 192 205 221 246 276
10431 276 303 315 302 266 224 199 198 212 227 240 252 263 267 263 260 263 273 287 301 307 301 282 257 234 214 198 189 185 185 186 191 199 208 214 218 220 218 211 206 214 235 260 277 278 264
10413 264 240 221 217 229 241 237 213 175 131 88 55 34 26 25 26 23 14 0 -11 -10 5 30 56 78 100 124 151 173 183 181 181 188 193 184 161 141 141 159 183 204 219
10397 219 231 240 245 248 251 257 265 271 272 267 257 248 244 241 238 230 214 193 174 169 182 200 209 202 186 171 162 160 163 175 196 214 220 216 209 209 215 226 242 260 274 274 259 237 218 202 186
10378 186 171 163 169 187 205 215 213 205 196 189 184 183 186 185 176 161 146 136 126 111 89 63 40 24 20 23 24 19 14 17 27 32 28 21 20 25 33 44 59 76 89 95 95 94 96 102 107 102 86
10358 86 67 57 63 83 108 133 151 158 157 157 161 166 171 177 188 205 221 235 247 259 263 256 237 213 196 191 202 221 236 239 230 219 213 213 213 210 204 195 181 163 147 140 143 149 152 153 156
10339 156 162 167 173 178 178 170 162 164 182 208 228 239 246 255 270 289 308 319 320 321 327 336 335 321 304 297 301 306 302 287 269 257 255 260 269 278 281 273 252 226 200 177 153 131 118 112 111 113
10320A13J4L2M3L9K3Olrj2j6j8j7j4j0pJJ5K8K6J2kjQJ5J1NLNPjj2j8j4l%qj9k2j9j3j0j2
10303A46j6j2LK3L3K9J9J2RJj3k3j8jJ2J5J0NLMLkpqmjjlnpj1j1o%NQOK%LJ1K0K5K6K3J6M
10284C27pj1rnmj1j7j8j4j0j0j2j0kL%pj0jJ1J9K0J6Ooj5j7j2j0j2j5j7j8k4l1k5oJ4K0J6
10268H6QJ1J9K6K7J7Lj0j2KK0K9K3J1jqj0j5k1k4k0rMJ4J8J7J2%j4k4k7j9mRJ3QJJOP%j2j9
10251A43j8r%ONKjprq%PJ2J7J9J8J1kj4k0k1j2kJkqjJ4L0L8L7K6Nj9m0m8m7l4j2RJ8Qpj2o
10233F7PJ7K5K7K4K1J8J9J6J0PJ0J4J5Plj2j1jJ4K1K1J2Lnj1j3q%QJ2Rok1k5j4kKJNJ4J4N
10216C13prkQJ2J1Lrj6k1k7l3l3k0%J6K0J5RMNJ0J2Oj0k4l0k2oJ2K7L2K5J8J1jj6k7k4j2o
10199B14rj6k2k6k5j8rkjJQK3L2L2K1J0OJ2J8J5QPJ1J5J2RLpk0k3j4kKoj6k3k5k2j2JRQLj
$$ plain form
10320 113 127 159 202 241 264 270 267 258 246 230 212 195 181 171 164 165 180 208 234 246 244 243 251 266 277 282 285 290 297 296 284 266 252 249 249 241 222 200 181 168 158 146
10303 146 130 118 121 144 177 206 225 237 246 247 234 211 193 192 204 219 229 234 237 241 244 242 235 227 223 222 221 218 213 206 195 184 178 178 183 191 197 199 199 202 213 233 258 284 307 323 327
10284 327 320 309 300 295 291 280 263 245 231 221 211 199 189 187 190 190 183 173 172 183 202 222 238 244 238 223 206 194 184 172 157 140 122 98 67 42 36 50 70 86
10268 86 94 105 124 150 177 194 197 187 175 177 197 226 249 260 259 251 241 226 205 181 161 152 156 170 188 205 217 217 203 179 152 133 129 138 151 159 160 161 167 174 174 162 143
10251 143 125 116 116 122 127 129 128 121 112 104 104 111 123 140 159 177 188 186 172 152 131 119 117 118 116 108 107 121 151 189 226 252 257 238 198 150 103 69 57 66 84 92 85 73 67
10233 67 74 91 116 143 167 188 206 225 241 251 258 268 282 297 304 301 289 278 277 291 312 333 345 348 343 332 319 311 311 319 331 340 334 313 288 274 272 274 275 280 294 308 313
10216 313 306 297 295 303 315 326 329 320 304 283 256 223 190 170 170 186 206 221 230 234 239 249 261 267 257 233 203 181 175 187 214 246 271 289 300 299 283 256 232 220 214
10199 214 205 189 167 141 116 98 89 87 86 87 95 118 150 182 203 213 219 231 249 264 272 279 290 305 317 326 329 322 302 279 265 263 265 259 243 220 195 173 161 162 171 179 182 181
10182A81kjmpo%PJ2J2QL%lJJ3K2K2J0knkLPJ2J8J6Onj0pmorj3j3j0nlopkRJ4QJ%OJ1RQROn
10160B97j9k7k4j7qLJ2J2Njnpo%J2K1K1J7J5J0Kl%OJrj5rNJ1J2QLnrmLNLMPKj6l4l4j8lNR
10141B38J9K8K8K0Rkqj0j0j1j6j5j1mjJOJ3J1OOJ6K4K3Qqj6j4pKMjj6l4m2l6j7NJ9K4K1J3
10124B65nk4l7l8l3k7k2j9j2%J4K4K6K1J8J2MmqmLQJ0J0RJ1J7K3K7K4K1J2lk2l2k5j4j0j2
10108B08j0lML%llnkPJ7J5jj9l1l2k6j7oJ1K4K2J1JOJ9K7K8K0Roj7k2k0k1k4k0qOJ6K5L4L7
10091B54K8Rj2k4k6j9j0pj3j9j8j1qj4k0j8j2qj3j9j9pOJ6K2K6L2L9M8N0M4K8RlnJOMok1l4
10074B56l5k1oNRQOmj5k0j6nMQLrj6j4qJRJ6J8Qrk0j2PK1K3J8J9K2K0Qpj7j8rjNMMNJ1J4R
10056B79lj2j1mMNKlkKPOlj6k3k0j5j2j3j4j3kJ2K3K2J0jonnnpppqmLQJ1PjolPJ3J0M%jlk
$$ plain form
10182 181 179 178 174 167 161 161 168 180 192 200 203 203 200 201 214 236 258 268 266 261 259 262 269 281 299 315 321 316 306 299 295 289 280 267 254 244 239 236 230 223 221 230 244 252 253 253 259 270 279 287 296 302 297
10160 297 278 251 227 210 202 205 217 229 234 233 228 221 215 215 227 248 269 286 301 311 313 310 310 316 317 308 293 284 289 300 312 320 323 318 309 305 308 313 316 320 327 329 313 279 245 227 224 229 238
10141 238 257 285 313 333 342 340 332 322 312 301 285 270 259 255 254 255 261 274 285 291 297 313 337 360 368 360 344 330 323 325 329 328 312 278 236 200 183 188 207 231 252 265
10124 265 260 236 199 161 128 101 79 60 48 48 62 86 112 133 151 163 167 163 155 151 154 162 172 182 191 202 219 242 269 293 314 326 323 301 269 244 230 220 208
10108 208 198 195 199 202 202 199 196 191 189 196 213 228 227 208 177 145 119 102 96 107 131 153 164 165 171 190 217 245 265 274 268 251 229 209 188 164 144 136 142 158 183 217 254
10091 254 282 291 279 255 229 210 200 193 180 161 143 132 124 110 90 72 60 52 39 20 1 -6 0 16 38 64 96 135 183 233 277 305 314 311 306 307 313 317 311 290 256
10074 256 221 200 194 199 208 216 222 218 203 183 167 162 166 174 177 168 152 138 130 131 140 156 174 182 173 153 141 148 169 192 210 229 251 271 279 272 255 237 228 227 232 236 240 245 256 270 279
10056 279 276 264 253 249 253 258 260 257 255 257 264 270 267 251 228 208 193 181 168 154 141 139 151 174 196 206 205 199 194 189 184 177 170 163 155 151 154 162 173 180 179 173 170 177 190 200 204 204 203 200 198
10035A98QK3L2K7J3K%NQQJmmjmj3j9j6nNJ0RMlpqnjjKNRJ1MlnMJ0Q%nonnlkrj9k2j2PK0K0
10014B66J0mk1l3l3k1qmj1j4nPJ0Jm%OPKLPJ2RKlokLNkj2j1%J1J5J7J5J1JrqjMORJ5J1krl
9994B39J0J8J1nk1k7k3j6j5k1k6k4j5jJ6L0L8L8K8J4nj8j8lJ3J6PLNQJprpj3k5l1j7PK4L1
9977B10K8K1RlrjJ1J7J1jpqmmprqmKLJklj%lj1j9j7oQK0K6K8K2J0oj8k4k2j5lPRKml%K%LJ2
9956B40J9K2J6jk5m2l4qJ9K5J8Nkqj3j1j1j2j8j9j4romJPJ0Pjj3k5l5l4k2lJ4K2K2J9J6J4
9940A26J3J7J9J9J3J2J5J7J4Lj0k1k5k3j6j0ojMRRONRJ2J3J3J3J4J4J3Olj2j8j3mNQLjkMP
9922B70Lqj6j5j0rj3j5j4qnkjmj2k0k0pJ0J9K2K4K4J7kk6l6l0j0J0K3K4J8OjljKKJoj3k0k1
9905A27k2k1j3JJ5J9J1L%NRJ2J1J0Omj5k3k0rNJ1RNLPJ4K0K3K5K0J0lqjQQ%orj1j4j4j1qj1
$$ plain form
10035 198 206 229 261 288 301 303 303 308 316 324 325 321 317 316 312 299 280 264 259 264 274 283 287 284 277 269 264 263 262 264 269 278 289 293 290 285 289 299 307 307 302 296 291 286 283 281 272 253 231 219 226 246 266
10014 266 276 272 251 218 185 164 156 152 141 127 122 129 139 140 136 136 142 149 151 154 161 173 182 184 181 175 173 176 181 179 167 156 156 167 182 199 214 225 226 217 209 208 212 218 227 242 253 251 242 239
9994 239 249 267 278 273 252 225 202 186 171 150 124 100 85 84 100 130 168 206 234 248 243 225 207 204 217 233 240 243 248 256 257 250 241 234 221 196 165 148 155 179 210
9977 210 238 259 268 265 256 255 266 283 294 293 286 278 274 270 263 254 246 242 244 247 248 246 243 242 242 239 228 209 192 186 194 214 240 268 290 300 294 276 252 230 215 212 219 228 230 226 223 223 225 225 228 240
9956 240 259 281 297 296 271 229 195 187 206 231 249 254 252 244 231 220 209 197 179 160 146 137 131 127 128 135 145 152 151 138 113 78 44 22 19 33 55 77 96 112 126
9940 126 139 156 175 194 207 219 234 251 265 268 258 237 212 189 173 163 157 156 160 169 178 184 189 198 210 223 236 249 263 277 290 296 293 281 263 250 246 251 259 262 261 259 263 270
9922 270 273 265 249 234 224 215 202 187 173 165 160 158 157 153 141 121 101 94 104 123 145 169 193 210 208 182 146 116 106 116 139 163 181 187 186 183 182 184 186 187 181 168 148 127
9905 127 105 84 71 72 87 106 117 120 120 125 134 146 157 167 173 169 154 131 111 102 107 118 127 132 135 142 156 176 199 224 244 254 251 243 242 250 258 258 252 243 232 218 204 193 185 174
9886A74j9k4j8nJ3K9L5L2K3J2jj5k8l4l1k3qJ2L1M2L7K0Jj5k1j8qlpj6k0j4jJ0J2J2J4J6J2
9870B08lj7k4k2j5j2q%J0J8J8J1M%LPJ0J1J3J8K1K2J7J2OM%qk1l6l9l1j8qmmlljMOONMLKN
9852A71PPNKJJOJ0J4Ppj8j6mQJ2J3J2J2RMLNJ1K0K6K6K3J8J1kj9l4m0l3j9lPPjrj2j4j2j2
9833B03j2j4j6j0KJ5K3K4K6K7K0Mj3k2k3k2k5k9l2k8k2j9j7j3lJ2K4K3J6J1J4J9K4K3J9J4
9819B23Nmj5k6l0k5j5qpn%NPPJ3K2K5K0J3J1J3J2PLJKKjoqprj2j5qLJ1J0NNPPjoj0j4k0k2
9800A65j2OK1K7K6J7Kj6k6j9pKMLKjrj5j0%NJjKPLrk0k0j4omorpOK3L3K8J1rj9j9pJ1K4K4
9781A88J4MJLRJ4J3Olj0j1qKJ4K3K4J3%j2j4j2j1j7k6k8j8jJ7K5K2J0pj8k0j7j5j5j1JJ3J7
9764A59J0jj1j8k3k1j6j3j0mJ1K3K4J4MMJ2K0K3K1K0J7J3ROLLPQKj1k2k4k2j7j0LK0L2L0K4
$$ plain form
9886 174 155 131 113 108 121 150 185 217 240 252 251 236 208 174 143 120 112 124 155 197 234 254 255 240 219 201 193 190 183 167 147 133 132 142 154 166 180 196 208
9870 208 205 188 164 142 127 115 107 107 117 135 153 164 168 168 171 178 188 199 212 230 251 273 290 302 308 312 312 304 283 247 208 177 159 151 147 143 140 137 136 140 146 152 157 161 164 166 171
9852 171 178 185 190 192 193 194 200 210 224 231 224 206 190 186 194 206 219 231 243 252 256 259 264 275 295 321 347 370 388 399 397 378 344 304 271 252 249 256 263 262 253 241 227 215 203
9833 203 191 177 161 151 153 168 191 215 241 268 288 292 279 257 234 212 187 158 126 98 76 57 40 27 24 36 60 83 99 110 124 143 167 190 209 223
9819 223 228 224 209 183 153 128 113 105 98 93 93 98 105 112 125 147 172 192 205 216 229 241 248 251 252 254 256 255 249 241 234 225 213 198 190 193 204 214 219 224 231 238 237 231 221 207 187 165
9800 165 153 159 180 207 233 250 252 236 210 191 184 186 190 193 195 194 185 170 160 160 165 166 165 167 174 177 168 148 128 114 108 104 98 89 82 88 111 144 172 183 174 155 136 129 140 164 188
9781 188 202 206 207 210 219 233 246 252 249 239 228 220 222 236 259 283 296 296 284 270 258 247 230 204 176 158 157 174 199 221 231 224 206 186 169 154 139 128 129 142 159
9764 159 169 168 157 139 116 95 79 66 56 52 63 86 110 124 128 132 144 164 187 208 228 245 258 267 273 276 279 286 294 296 285 263 239 217 200 190 193 213 245 275 299
9748B99J9J5Poj5j2mLNJjjJMMmj5k1j3MJ5J2Jj1j5j7j7j3rk%KQJ9K8L0K5J8J4RKnj4j7j9j9
9729B95k3l1l7k9rJ5K8K8K1J2J2J5J6Ork1j9j4j4j9k0j5rrrppoo%OJ2K0K7K7J4%nljjLJ1J3
9712B58Jj7k5k2j8j2nMJ4K2K7K5J3kj2j4j0j1j1pKJ1J5J1OKnj5j9j1KOkrnOJ2OjmkJNJ0J2
9694B32J3RJqj1nPJ3J1RJ4K2K2J0JlKLMJjqj3oPJ8J6Nllkkoj3j4oQJ7J7Nj0k2k8k8k4j7j4
9675B20j4j2o%JjlLOOJmk%krj6j9k3k5k2j0RK3K5J8Lj2k0j4PK7L1K0PmpnJN%j2j5nJ2K2K1
9656B06J6J0RJ1J7J9J1mj3j4rmmpj0j0rj0j4j3mOJ0PNPPLLRJ4J3RJ1J4Nj5l1k9j4KJ3K2K8
9638B73K7J5lj3j1oprqljnj5k1k6k6j9nRJ4QKJNJ2K1L0L0J8jj4j7j3rpmnrj5k0j8pNQPJ0K4
9619B02L5L3J9NkNK4M4N4M6L9M5O2Q2J17J69J97J40%j44k06j79j25r1p8p2o5o0n1l6k2j3j
$$ plain form
9748 299 318 333 340 334 319 307 303 306 311 312 311 310 311 315 319 315 300 279 266 270 285 297 298 287 272 255 238 225 216 214 214 216 224 243 271 301 326 344 358 367 369 364 350 333 314 295
9729 295 272 241 204 175 166 181 209 237 258 270 282 297 313 319 310 289 270 256 242 223 203 188 179 170 161 154 147 141 135 135 141 153 173 200 227 241 241 236 233 232 231 234 245 258
9712 258 259 242 217 195 177 165 160 164 178 200 227 252 265 263 251 237 227 216 205 198 200 211 226 237 243 245 240 225 206 195 197 203 201 192 187 193 205 211 210 206 204 205 210 220 232
9694 232 245 254 255 247 236 231 238 251 262 271 285 307 329 339 340 337 339 342 346 347 346 338 325 319 326 344 360 365 362 359 357 355 349 336 322 316 324 341 358 363 353 331 303 275 251 234 220
9675 220 206 194 188 188 189 188 185 188 194 200 201 197 195 195 193 184 168 149 126 101 79 69 78 101 126 144 147 135 115 101 108 135 166 186 193 189 182 177 178 183 183 171 156 151 163 185 206
9656 206 222 232 241 252 269 288 299 295 282 268 259 255 251 244 234 224 215 205 191 178 174 180 190 197 202 209 216 219 222 231 245 258 267 278 292 297 282 251 222 208 210 223 245 273
9638 273 300 315 312 299 288 282 275 266 258 255 254 249 234 213 187 161 142 137 146 160 168 170 171 176 188 209 239 269 287 286 272 255 242 233 226 222 217 208 193 173 155 148 153 161 168 178 202
9619 202 237 270 289 294 292 297 321 365 419 465 504 549 611 693 810 979 1176 1316 1316 1172 966 787 662 571 493 421 356 296 245 209 187 174 173
9606A73J6K5K2J5J2J1Pkqj4k2k0rKJppMJ6K2K4K3J5N%jLPRMj2k7l1k2j2j3j9k1j7j2ojLMN
9588A45J0J5J9J8Rmj6k1k2k7k9k3j3lkJRK0K5K4K2J9J2RJ5K9M1M0L0J2lrpknj2j8j8j3nNR
9571B86OKMJ0J4J8K4L5M9O5Q4J04J39K05K81K91J75l6k23k92k53j82j29r2n6k8j8j4rnj3k7
9558D15l6l9l9l8l2j5J0K9L1J7jj2k0k3k1qOJ8K6L3L1K1J0RJ5J2lj8k3j9j3qoj1k2k5j3LR
9543B50Kpj4k1l1l4l0j6%RJ0L%MJ1J5J6K0K8K8J9PJOJ1J2Pnk2l5m0l1j6KJ0J0PQRLqk1k6k5
9525A26j7mOJ3J2QMkljLLKMJ1J6J3Omrj0lLQJ3J4J1jj3j7j1kLJ0J7J7Nj1j7qLNjo%J2J6Nj1
9505B18k6k9k6j7lJ1J9J8J6J4J4J9K5K5J2pj5j4j4k0k5j7mNJ3K2K7K5K1K4K4J3kmJ0K2L1L9
9490D44M6N0O1R1J30J70K17K79L08K21J0k17l36l19k39j69j19p6m8m3m5l9k8k0j9j3n%%Jj
$$ plain form
9606 173 189 214 236 251 263 274 281 279 271 257 235 215 206 208 209 202 195 199 215 237 261 284 299 304 304 303 306 313 322 326 314 287 256 234 222 209 190 169 152 140 134 133 136 140 145
9588 145 155 170 189 207 216 212 196 175 153 126 97 74 61 58 56 57 66 86 111 135 157 176 188 197 212 241 282 322 352 364 361 352 345 343 338 326 308 290 277 272 277 286
9571 286 292 294 298 308 322 340 364 399 448 513 597 701 840 1045 1326 1617 1792 1756 1533 1241 988 806 677 585 529 501 483 469 460 455 442 415
9558 415 379 340 301 263 231 216 226 255 286 303 302 290 270 247 226 218 224 242 268 301 332 353 363 372 387 399 396 378 355 336 323 315 309 298 276 251 238 241 250
9543 250 252 245 231 210 179 145 115 99 99 108 118 121 121 125 136 151 167 187 215 243 262 269 270 276 287 299 306 301 279 244 204 173 157 159 169 179 186 194 203 206 198 177 151 126
9525 126 109 105 111 124 136 144 148 146 143 142 145 148 150 154 165 181 194 200 196 187 177 174 177 185 198 212 223 222 209 192 181 179 182 192 209 226 231 220 203 195 198 203 202 196 196 208 224 229 218
9505 218 192 163 137 120 117 128 147 165 181 195 209 228 253 278 290 283 268 254 240 220 195 178 174 179 192 214 241 266 287 311 335 348 346 342 352 374 405 444
9490 444 490 540 601 692 822 992 1209 1488 1796 2017 2027 1810 1474 1155 916 747 628 552 504 461 416 377 349 329 310 297 292 292 292 293 292
9478B92ornJLMQJ6J2KmkLLloqj5k6l1k7j2LRMmpokLJ0J8K0J5Mkqj2j3pLPOPJ1J4J4J3J2RR
9457C20K0L7M9N0N1O4Q1J09J53K04K09J25k4j52j97j78j45j22r7o0j9J7M1M9L3Pj2k2l4n1
9445E06o1n4l8k5j9j8k0k2j7mJ0J8J9J9J3%j8l2m1m4l9k6j2%QJ4J7J6J8K3K6K1RLKLjrk0l1
9429A94l8l1j4OK5L6M0L5K7J6Lj3k4k4j7j2j2qQK4L3K8J5kj4k0k1k4k6k2j0%NNJ0J3J4J2Q
9413B25Nmj4j7rknj1j3j0okPJ4J5Lj2j9j6oJMLkjMJ1J6J1%rrlMOJkmnkJLL%JLLkj0j4j0mM
9392A25QROjnj0j7k2j7lJ3J9J0mj3j3mQJ4J3L%NJ5K1K6K7K6J8Nlqj1j5j4j1njkmmkLQRPNN
9373B19J2J9K2J8Oqj6j5oJLJJNJ2J3Jj6l1l0j8qrj6j8j2mNJ5K6K9K2PjjKkj3j8j6oNJ0Npk1
9354A67k4k1j4j1omkljMOJkMJ7K1J5RJ5K6L3L1K8K0Oj3k5k6k7k7k5k0j3rlRK2K7K7K6K2J0
$$ plain form
9478 292 286 277 272 273 276 280 288 304 316 318 314 312 315 318 315 309 301 286 260 229 202 190 193 202 206 202 195 189 187 190 200 218 238 253 257 255 247 235 222 215 218 225 231 238 249 263 277 290 302 311 320
9457 320 340 377 426 476 527 591 672 781 934 1138 1347 1472 1448 1296 1099 921 776 654 557 497 478 495 536 585 618 625 613 591 557 506
9445 506 445 391 353 328 309 291 271 249 232 228 238 256 275 294 307 307 289 257 216 172 133 107 95 95 103 117 134 150 168 191 217 238 247 250 252 255 254 245 225 194
9429 194 156 125 111 117 142 178 218 253 280 296 299 286 262 238 221 209 197 189 197 221 254 282 297 295 281 261 240 216 190 168 158 158 163 168 178 191 205 217 225
9413 225 230 226 212 195 186 184 179 168 155 145 139 137 144 158 173 176 164 145 129 123 124 128 131 129 128 132 143 159 170 170 161 152 149 153 159 160 158 154 149 147 148 151 154 154 155 158 161 159 149 135 125 121 125
9392 125 133 142 148 147 142 132 115 93 76 73 86 105 115 111 98 85 81 89 103 116 119 119 124 139 160 186 213 239 257 262 259 251 240 225 211 200 195 194 192 188 184 182 185 193 202 209 214 219
9373 219 231 250 272 290 296 288 272 257 251 252 255 256 257 262 274 287 288 272 241 211 193 185 176 160 142 130 126 131 146 172 201 223 230 229 228 230 228 215 197 181 175 180 190 195 188 167
9354 167 143 122 108 97 91 87 85 82 81 85 91 92 90 94 111 132 147 156 171 197 230 261 289 309 315 302 277 251 224 197 172 152 139 130 127 136 158 185 212 238 260 270
9338B70nj6j5rpqpkK%rj4j2jOjj5k4k4k2k1j8oJ0K2K5K6K8L0L4L5K7J5jj1j7k0j8j1LJ5J8
9321B52J3KomJMlj3j5j4j0qLJ9L0K7J4OPRPkj4k4k7k8k6k6k6k2rNJ8K2K2J5Onj7k7l6l2j8
9303G0JJ3J8J8J5RLJLMJjOJ4J2%j0j0onrj7k0j7pLNMNJ1J3J1RJ4K3K8K1Nj5k9k7rJ0J2Krq
9285A65JJ0K1L6M7M3K2kj8k4k6k4k1j8j9j9j9j5pOJ9K9L1K6J4lk0l4m2m2l3j9oLJ3K3K6K0
9269A44J1NJ1J6J2jj1j1kOOLjkjLMLlnljjKJ2K7L4K7J2krj0rpnrj5k1k6k5k1j2m%JkmmjKK
9249A15jnkKMlrj0kPJ4K0K5L4M1L9K8J0moKRPjj4j9j7j4j2j4j6j8k0k0j4lJ1J7J4Nnj1j2j3
9231A39j7j5mJ3K7K0Kj6k2k3k8l1k4pPRRJ1J5J4MnnKJ2J9K4K4J9RjooJJ0J8K2J7RMMOOMNR
9213B84J5J6J3O%omJ0K6L5L1J6Konj%j1l1m4m3l4k8k8k5j6okjKNQRQOJk%OJ1J0KprlPMqj6
$$ plain form
9338 270 265 249 234 225 218 210 203 201 203 203 194 180 168 167 173 172 157 133 109 87 66 48 42 52 74 99 125 153 183 217 252 279 294 293 282 265 245 227 216 219 234 252
9321 252 265 267 261 257 258 262 259 246 231 217 207 199 202 221 251 278 292 298 305 314 321 319 305 281 254 226 200 174 148 126 117 122 140 162 184 199 205 200 183 156 120 88 70
9303 70 71 84 102 120 135 144 147 148 151 155 156 155 161 175 187 187 177 167 161 156 147 130 110 93 86 89 94 98 103 114 127 138 147 161 184 212 233 238 223 194 167 158 168 180 182 173 165
9285 165 166 176 197 233 280 323 345 343 325 301 275 251 230 212 193 174 155 140 133 139 158 187 218 244 258 255 235 201 159 117 84 65 59 62 75 98 124 144
9269 144 155 160 171 187 199 198 187 176 174 180 186 189 188 186 185 188 192 195 192 187 184 183 182 184 196 223 257 284 296 294 285 275 266 259 254 245 230 209 183 158 137 125 121 121 122 120 116 112 111 113 115
9249 115 114 109 107 109 113 110 101 91 89 96 110 130 155 189 230 269 297 307 303 297 299 308 315 314 300 281 264 250 238 224 208 190 170 150 136 133 144 161 175 180 175 164 152 139
9231 139 122 107 103 116 143 163 165 149 127 104 76 45 21 14 21 30 39 50 65 79 83 78 73 75 87 106 130 154 173 182 181 175 169 170 180 198 220 237 246 250 254 260 266 270 275 284
9213 284 299 315 328 334 334 328 324 334 360 395 426 442 444 438 433 432 432 421 390 346 303 269 241 213 188 172 166 164 163 165 170 178 187 195 201 202 200 200 206 217 227 229 222 213 210 217 221 213 197
9193A97j1ljnnkjnn%RJ7K5L6M0L2J8RRJ2J4J2Nrk6l6l5k8k4k6k3j2%O%j0j2qlnqrlMQPKpj6
9173A24k2k1j6ql%MQJ3K1K9L3L0K4K1J9J4QMNOLlpj2j7k0j3jRJ0Jj0k0k3k3k2k1j9j0JPJ0
9156A13J3K3L4L8L5K8K0J1Jqj0qnk%NJ0Qjj5k2j4%PJj3k4k8k6j9nNNpj6j5nQK2L1L0J7kj7
9138B03k5k6k2j0LPJkLRRM%%JPK1L3L4K7J9J4Mj1k1k2j9k0j5kQRLNQMj1k2k1j2nKJ3K0J5J
9120B21j1j7j6j3qNJ5K0J8J2QOKlqj1j3j2rj0j1j3mJ1K3K4J8J3J1Ojn%Mlj4j2MJ7K2J8J5J2
9103C11Mqj7j9j1kNLnj3j6j6j2nJMjoolkj1k1k4j9oRK2K1Rnj1j1rqmLJ2J9K0J4Jo%J4K2J7
9084B34J0RJ8K1J3kj4j9j8j7j6j6j3pKPPNNKoj3rOK0K6K0J0kj1qQK3K5J3KjK%rj8k6k8k8j9
9066A88oQJ3Q%no%NOKkl%LK%JOJ4J9J5QKKKjmlMNoj9k2j4lLJnqj0rpjNOM%mqj4j5qRK5L1K4
$$ plain form
9193 197 186 183 182 177 172 170 169 164 159 159 168 185 210 246 286 318 336 345 354 366 380 392 397 388 362 326 291 263 239 213 190 178 178 184 184 174 162 154 151 146 138 129 126 130 138 145 147 140 124
9173 124 102 81 65 57 54 54 58 66 79 100 129 162 192 216 237 256 270 278 282 287 293 296 293 286 274 257 237 224 223 232 242 243 233 213 190 167 145 124 105 95 96 103 113
9156 113 126 149 183 221 256 284 304 315 316 308 298 290 285 283 283 288 298 306 305 290 268 254 254 261 262 249 225 197 171 152 147 152 157 150 134 119 114 122 144 175 205 222 220 203
9138 203 178 152 130 120 123 130 131 129 132 141 150 154 154 154 155 162 183 216 250 277 296 310 314 303 282 260 241 221 206 204 212 221 224 229 237 241 230 208 187 175 170 172 185 205 220 221
9120 221 210 193 177 164 156 161 176 196 214 226 234 240 242 239 231 220 207 195 186 176 165 152 148 159 182 206 224 237 248 254 253 248 248 252 249 235 223 227 244 266 284 299 311
9103 311 315 307 290 271 260 258 263 266 261 248 232 216 204 199 200 204 203 197 191 188 186 175 154 130 111 105 114 136 157 166 161 150 139 130 122 118 121 133 152 172 186 187 181 181 195 217 234
9084 234 244 253 271 292 305 303 289 270 252 235 219 203 190 183 185 192 199 204 209 211 205 192 183 189 209 235 255 265 263 252 244 252 275 300 313 315 314 316 316 307 289 263 235 207 188
9066 188 182 190 203 211 211 206 200 200 205 211 213 211 208 208 211 213 213 214 220 234 253 268 276 278 280 282 281 277 274 278 283 277 258 236 222 219 222 223 218 210 200 191 184 183 188 194 198 198 194 186 172 157 149 158 183 214 238
9043B38QmmKLoj7j9rNJ4J4J0lj6k3j8mNNmrrl%%nj0j1pJQJ3J8J9J4jj6k3k4k3j6oOQLkLJ1
9023A16J6J1Jqj5j3pJJ0J4J5J3RKorj0nloj2j5j2kNQQQJ2J4J3MmplJ%opnjLMJpr%J1J1jj2
9003A26j0kOQJ3J8K0J9J7J5J2Pkj4k6k8k0pNJ1J7K5L8M1L2J2oj1nlj3k6k7j6okLJ4K2J4qk5
8986B38k1mJ0J2Njmmlklqj3j7k2k7k7k2j2n%NJ4J7J5J4J8K1J5Nl%OPRJ3J9J5Kj0j0%RNqj9
8967B29j8rkMJ0J6K0J7Opj1mLLkjQJ5Rrk8l6l4k6j2LRNJJ0K2K4Qj0j8j2jM%qj1nJ2K9L6L3
8949B72K2Rlj3j9k2k0j6j1rpnorj5k0j9j1%RRPJkorj1o%QJ0J1J2J1J3J1Nqk1k4j6kRJ0Mnq
8930A10lNJ0J0J1J2J0jj2j6j1KJ1J7J5Prk3k9k4j1OK3L5L6K4Kk0l1k3qKJmlLRJ2J3J2J0QR
8913A97J1Rjj4k2k2j5qjkoj0qLJ7L0L2K3RklJM%rj6j5qkNRJ4J2Pjl%L%qj1qlKORJ1QNlpj2
$$ plain form
9043 238 246 242 238 240 243 237 220 201 192 197 211 225 235 232 216 193 175 171 176 181 177 168 159 156 156 156 151 141 130 123 124 132 145 163 182 196 195 179 156 132 109 93 87 93 101 104 102 105 116
9023 116 132 143 144 136 121 108 101 102 112 126 141 154 163 165 159 150 140 135 132 126 114 99 87 85 90 98 106 114 126 140 153 157 153 146 143 144 144 138 131 126 125 128 132 133 126 117 117 128 139 138 126
9003 126 116 114 120 128 141 159 179 198 215 230 242 249 247 233 207 179 159 152 157 168 185 210 248 289 321 333 327 316 311 308 295 269 242 226 220 218 221 235 257 271 263 238
8986 238 217 213 223 235 240 239 235 231 228 226 223 215 202 185 163 136 109 87 75 70 70 75 89 106 121 135 153 174 189 194 191 191 197 204 213 226 245 260 262 252 242 242 251 256 248 229
8967 229 211 202 200 204 214 230 250 267 273 266 255 251 254 257 255 254 262 277 286 277 249 213 179 153 141 144 153 158 159 169 191 215 223 213 195 183 182 186 186 178 167 162 174 203 239 272
8949 272 294 303 300 287 268 246 226 210 199 190 183 178 172 163 148 128 109 98 98 107 116 123 124 122 116 107 96 90 90 98 108 119 131 142 155 166 171 163 142 118 102 100 109 119 123 118 110
8930 110 107 112 122 132 143 155 165 164 152 136 125 127 138 155 170 177 168 145 116 92 81 87 110 145 181 205 207 187 156 133 125 127 128 124 121 124 133 145 158 170 180 188 197
8913 197 208 217 216 202 180 158 143 135 134 132 126 116 108 111 128 158 190 213 222 220 217 218 222 222 213 197 182 174 172 177 186 200 212 219 218 215 215 218 218 210 199 191 188 190 196 205 216 224 229 226 219 207
8892B07j4j8k2j8qOJ2Opj6j9j4mQJ9K3K3J9J4R%j3k5k5j5jRJ4J8K1J7MooMJ3J5J2J1J5J5R
8875B92nj5j9j9j9j6j0mmrj1mPJ4J2J0OK%LQN%mklqj0o%JLOLpj7j7nNOKkjjkjJJmlMJ8K2J1
8853B14oj4oRJ5RK%KK%knj2j4j0k%qk2k8j8MK4L0K0Poj4k0k2j6rnolJJjjNJ0J4J7J3Kj1j6
8834A24mJ1J9J3%j2j8j2JJ1J3J1J1J1Kj1j6kJ6K3J7OkljQJ9K0J3LJOJ4J5J2MmrokJjrj2oN
8816B80J1J1ONNKnj3j5j7j8j7j5j4j9k5k8k8k3j4nMJ3K1K5K6K1K0K5L1K9J5ql1m7m6l3j3L
8800A19J1J4Qrk2k2pQRORK3L4L9L6K7J6PKjoj7k3k1j6j1oPK5L6K8Mk7m8n2m1k3oJlj1j4j1
8783G2lKMPJ4K3K9K4J3Llj%LJ0J7J7Nrj2p%LOROmj7k6k8k6k3j8rKJ1J6J4ROKkmkLRJ2RJj4
8763A53k6k5j5%QJ0J2J5J5Prk5l1k4nJ7K7K7J6J2J8K8K8J7LmnqmJ2L1L6K2jj9k9l6l5k4j1
$$ plain form
8892 207 193 175 153 135 127 133 145 151 144 128 109 95 91 99 118 141 164 183 197 206 206 193 168 143 128 127 136 150 168 189 206 210 204 198 202 215 230 242 253 268 283 292
8875 292 287 272 253 234 215 199 189 185 181 172 161 157 164 178 190 200 206 208 208 211 219 224 224 220 218 215 207 197 191 191 192 195 201 204 197 180 163 158 163 169 171 169 168 167 165 164 165 166 162 159 163 181 203 214
8853 214 208 194 188 197 212 221 223 223 225 227 227 225 220 208 194 184 182 182 174 152 124 106 110 134 164 184 191 185 171 151 129 113 104 99 93 90 91 92 91 90 95 105 119 136 149 151 140 124
8834 124 120 131 150 163 163 151 133 121 122 133 146 157 168 179 181 170 154 152 168 191 208 214 212 209 208 216 235 255 268 271 272 278 292 307 319 323 319 310 304 302 303 302 293 281 275 280
8816 280 291 302 308 313 318 320 315 302 287 270 252 235 220 206 187 162 134 106 83 69 64 68 81 102 127 153 174 194 219 250 279 294 286 255 208 162 129 116 119
8800 119 130 144 152 143 121 99 92 100 109 115 124 147 181 220 256 283 299 306 308 307 301 284 261 240 224 213 207 214 239 275 303 307 280 232 180 139 116 110 111 108 97 83 72
8783 72 69 71 75 82 96 119 148 172 185 188 185 184 184 187 197 214 231 236 227 215 208 208 211 217 226 232 228 211 185 157 131 108 90 81 83 94 110 124 133 139 141 139 135 133 136 145 157 166 167 153
8763 153 127 102 87 87 95 105 117 132 147 154 145 120 89 65 60 77 104 131 147 159 177 205 233 250 253 249 244 236 232 244 275 311 333 332 313 284 248 213 189 178
8747A78%MJ0J1Kj1j5rLJ0J2J0Krj6j5j1j1j6j7j0JJ0J8K0J9J6RM%KQJ6J7Roj6j5lJ1J0mk0
8729B08k8k7k2j7j1JJ3K1K1J7J8K0J8Ppj5j8j8j6r%MNJ0J7J9J4OLKjj4l1m6n1m6l2j3QK6L3
8713F9K9K2K0K7L2L7M1M4L5J5pj8j7j6j5j3j1j2qKJ1J4RRRLj2k8l1k7k0j1%Ljj2k0k3j9mJ9
8696A25L6L7K8J7J1Kj2k3k3j1j%mmNJ8K5K7K2J4Jj2j9j9j6rNK2K8J8Lmmkl%MKlrplLRJ4J6
8678C04J4J3Qjj4k6l1l1k6j9j1mJKRJ7K1J9J4J0J0QKpj4k1l0l6l4k4j3rj1rkJJNJ4K4K5J4
8661A63JnKJ4K1J5lk1l0l0k2j2jNMNJ2J9K2J4Nloj0j2j0omkKJ2J9J6MljQJ4J4J2Pmj4j6j3
8643A82j2j6k1j8pJM%nj2j4j1KJ3J7J5PMOJ0J1RNJjlkLJ0J2J1RONjqj3j0%J3J8J8J1Kqj4j0
8624B19jNNLKK%nj0j3j4j2mPJ7J8J4J3J1Nj1k3k5j7j1j1j3rmmpppm%J0K5L4K9J1qk0k1j3K
$$ plain form
8747 178 178 182 192 203 205 194 179 170 173 183 195 205 207 198 182 167 156 145 129 112 102 103 113 131 151 170 186 195 199 199 201 209 225 242 251 245 229 214 211 222 232 228 208
8729 208 180 153 131 114 103 104 117 138 159 176 194 214 232 239 232 217 199 181 165 156 156 160 165 175 192 211 225 231 234 236 235 221 190 144 93 47 15 2 10 36 69
8713 69 98 120 140 167 199 236 277 321 356 371 364 346 329 313 298 285 274 262 254 256 267 281 290 299 308 311 299 271 240 213 193 182 182 185 184 172 152 129 110 106 125
8696 125 161 198 226 243 254 256 244 221 198 187 186 186 182 178 183 201 226 253 275 289 290 278 259 240 224 215 220 242 270 288 291 287 283 281 278 278 282 284 281 272 265 262 265 274 288 304
8678 304 318 331 339 338 324 298 267 236 210 191 180 176 177 179 188 205 226 245 259 269 279 287 289 282 268 247 217 181 147 123 110 101 90 81 79 80 81 86 100 124 149 163
8661 163 164 159 161 175 196 211 208 187 157 127 105 93 92 97 101 106 118 137 159 173 178 175 169 159 147 137 131 127 125 127 139 158 174 178 175 174 182 196 210 222 229 225 211 195 182
8643 182 170 154 133 115 108 109 113 113 108 96 82 71 73 86 103 118 125 129 135 145 156 165 170 171 170 167 165 168 178 190 201 210 216 221 220 212 199 189 189 202 220 238 249 251 243 229 219
8624 219 218 223 228 231 233 235 235 230 220 207 193 181 177 184 201 219 233 246 257 262 251 228 203 186 175 164 151 142 138 134 127 120 113 109 109 119 144 178 207 218 210 190 169 156 158
8606A58J7K5K5J9J0NKLLKLNPPONNLmj0j4j2rqrrnJL%nj0j1lJ2K4K0Jj6k2j7j1pmmpj0oLQJ
8585A70j1k0k0j2JJ3J9J4LqpOK2L1L0K9L0K7J5%j0j6k4l5l6k4r%LPJ3J8J4PJoj2j8k1j4JJ3
8569A84J7J6J2Loj2pKQPJlj0j8k2j1PJ7J6NjLJ3J9J5Mpj3j4rjOKrk2k6k2j2kQRLnrj1j6k2
8550H7k1pJ3K7K5J5POJ1J5J3Pjrj8k5k3j4kOQNjopJJ4J9J2nj8j9j4j4k2k6k2j0JPRMljRJ8
8531E1J7J1PJ1J8K3K4J5%j9l1l5l4k6qJ6L4L7K8J6J2J8K0J2nj7j8j3pLJ6K4J4kj2j0lJ0K1
8516B18K7K0Kj3j7j5j1j0j2k0l1l4k2oMLKNJ0K1L4M4M1K8J9J8K0J7J0PO%j0k1k4k2j4j0j1
8500B53j5j5j3pJRJ4J8J8J5Npj4mRJ3Jj4j8j0JOOOO%rj9k5k3j5m%llLJ3J7J3RQJ0Nj%MJj1
8481B34k4k8j8mOJ0J0Njj0j5j6j0KJ8L1M0M2L4K3J4Qjj8l7m0k7oP%k0l3l0j2PRkj6k0j7j1
$$ plain form
8606 158 175 200 225 244 254 259 261 264 267 269 272 277 284 291 297 302 307 310 306 296 282 270 261 253 244 235 230 231 234 234 229 219 208 205 217 241 261 262 246 224 207 196 189 185 181 174 164 158 161 169 170
8585 170 159 139 119 107 108 121 140 154 157 149 142 148 170 201 231 260 290 317 332 332 322 306 282 247 211 187 178 178 181 188 201 219 233 240 241 235 223 205 184 170 171 184
8569 184 201 217 229 232 226 214 207 209 217 224 225 222 212 194 172 161 168 185 201 206 205 208 221 240 255 259 252 239 225 216 215 221 223 214 192 166 144 132 130 138 147 150 145 136 125 109 87
8550 87 66 59 72 99 124 139 146 152 163 178 191 198 197 188 170 145 122 108 106 112 120 125 124 118 111 112 126 145 157 152 134 115 101 87 65 39 17 7 8 15 24 28 25 24 33 51
8531 51 68 79 86 97 115 138 162 177 177 158 127 92 58 32 24 40 74 111 139 155 167 185 205 217 212 195 177 164 157 160 176 200 214 212 200 190 187 197 218
8516 218 245 265 267 254 237 222 211 201 189 169 138 104 82 76 80 83 85 90 100 121 155 199 240 268 287 305 325 342 352 359 365 365 355 334 310 288 274 264 253
8500 253 238 223 210 203 204 213 227 245 263 278 283 276 262 258 267 280 281 267 249 239 240 246 252 258 264 264 255 236 211 188 173 169 169 166 163 166 179 196 209 218 226 236 241 240 240 244 245 234
8481 234 210 182 164 160 166 176 186 191 190 180 165 149 139 141 159 190 230 272 306 329 343 351 350 332 295 255 228 222 229 229 209 176 146 134 141 150 148 132 112 95 84
8464H4j1j4j3oKPJ0J7K3K2J0mj1j1j0pjMOOQJ1J0RJ2J4J0NKMNQJ7K9L4K7J4MLQQ%j5k3k2j3
8446B72rnKJ1J2Nnj3j8j9j3nlopjOPLmj7l4m2l8k0%J7K8K7J7RJ3K0J6MnmJOQOJkKQOlj4j2
8426B08%J3K0K1J9J7J0jj8k7k8k2j8j8j4pJPJ0PjrnJ0K1J7Kj7k5k2j2JJ7K7L2K7J8J0OMKm
8409B79qqjJ0J8J6Kj4k6l2l5k6rMMjjRJ2%j5k1j2JJ1J6J8J6J4J0OJnj1j8k0j6qmlkKJlqnK
8390A40OQJ2J4J3Kj0j5oRK0J9J6J8K0J7Nlmmqj4j5j1pon%PJ3K2K6K4J8J0Nmj5k2k3j6p%nj6
8372B28k4k4j3mLPJ4J7J1jo%J1K0K0J4Nnj4j2kPKj7l9m5l5j5KJ1J5J7K2L2L8L4J8%j2j2%J2
8355B80J3Kj5k2k0j4j1nNJ2QKnolLJ0Rok6m0l9k5pJ0K3K8K9K7K1J3Lpj6k2k3j8j1lJkj1j9
8338A23j6pOJ2J4J7J9K0J6J2J1Noj3qKPKolJ1K3K1QLRJ8J4kj9k5k2j3lPJ4J1JqrlORRNkok
$$ plain form
8464 84 73 59 46 40 42 49 59 76 99 121 131 127 116 105 95 88 87 91 97 103 111 122 132 141 153 167 177 182 184 188 193 201 218 247 281 308 322 326 329 337 345 345 330 307 285 272
8446 272 263 258 260 271 283 288 283 270 252 233 220 215 212 206 199 198 204 211 214 210 193 159 117 79 59 59 76 104 131 148 157 170 190 206 210 205 201 202 208 216 222 223 221 223 231 237 234 220 208
8426 208 208 221 241 262 281 298 308 307 289 262 234 212 194 176 162 155 156 163 173 180 179 170 165 175 196 213 215 198 173 151 139 140 157 184 216 243 261 271 277 281 283 279
8409 279 271 263 262 272 290 306 308 294 268 236 201 175 166 170 174 173 172 181 193 193 178 157 145 146 157 173 191 207 221 231 237 238 233 222 204 184 168 160 156 153 151 153 154 151 143 138 140
8390 140 146 154 166 180 193 195 185 170 164 173 193 212 228 246 266 283 288 285 281 277 269 255 240 229 222 216 211 211 218 231 253 279 303 321 331 336 332 317 295 272 256 249 249 244 228
8372 228 204 180 167 163 166 173 187 204 215 214 208 208 219 239 259 273 278 273 259 247 245 252 254 237 198 153 118 103 105 116 131 148 170 202 240 274 292 292 280 268 268 280
8355 280 293 295 280 258 238 224 213 208 213 225 233 235 230 224 221 224 234 243 237 211 171 132 107 100 110 133 161 190 217 238 251 254 247 231 209 186 168 157 154 155 153 142 123
8338 123 107 100 106 118 132 149 168 188 204 216 227 232 226 213 205 207 214 216 210 207 218 241 262 270 273 282 300 314 312 293 268 246 233 230 237 251 262 263 255 246 243 249 258 267 272 270 264 262
8319B62J1K6L5L3K0Jj8k7k8k1j0kJknmMJ4K3K5J8Opj7k1j8j1mpj5k4k3j5j0j4j9j3MJ7K1J7
8302B03J2QKqj7j9rQJ8J5%j3j7qNK1L1L5L2K6J5%j3k1k4k2j8j2j0qpLJ4J9J5PMkj2k6k9j9
8286A79roj1j4j2mNJ3J6J2M%jKMLLK%mj1j5j3mMNLJLJ1J8J9J1Mloqq%J5K9L1K1Nj0k0k1j7
8266B26j4j3r%J1J8K0J6J0NJ%%NNlj4j7rJKklMRMj0k3l2l6l1j6jOLJJ1K5L2K4J1KjjjKOQK
8247B34qj1qkJJOJ3K3K3J4kj7k1j5KJ5J8Mj7k8k3qMQJ1J5K1K5K3Qj5l5l8k6j2nmmoplJ0K5
8229A89K7J6N%mj0j5j4j2j1oPJ9J8Lqj0qj0j6j8j5j0pmKJ1K0K6K3J9J5J8K4K5J8Noj5k1k5
8212B45k2j3kOPKOJ5K1J4oj9j2MJ2Opj7j7qNJ8K5K5J8J2N%j%jrj4j5rooqj0j3j5j4rKJ6K9
8194B40L2J8nk4l1l0k4j4JJ6J5Lj1j3n%mpkJ4K7L0K1Ooj4j6j1kJ0J8K0J8J3Mnj4j6j4j5j7
$$ plain form
8319 262 273 299 334 367 387 388 370 343 315 294 284 282 283 281 276 272 276 290 313 338 356 362 355 338 317 299 288 284 277 262 238 215 200 190 176 157 144 148 165 186 203
8302 203 215 223 225 217 200 181 172 180 198 213 213 200 183 175 180 201 232 267 299 325 340 340 327 306 282 260 242 230 220 212 205 208 222 241 256 263 267 265 253 227 198 179
8286 179 170 164 153 139 127 123 128 141 157 169 173 173 172 174 178 181 184 186 186 182 171 156 143 139 143 148 151 152 155 166 184 203 214 218 215 209 201 193 193 208 237 268 289 294 284 264 243 226
8266 226 212 199 190 190 201 219 239 255 265 270 271 271 271 276 281 278 264 247 238 239 241 239 236 240 249 253 243 220 188 152 121 105 104 110 113 114 125 150 182 206 217 219 218 217 216 218 224 232 234
8247 234 226 215 207 205 206 207 213 226 249 272 286 284 267 246 231 233 248 266 270 253 225 202 194 198 206 217 232 253 278 301 309 294 259 221 195 183 178 174 170 164 157 154 164 189
8229 189 216 232 237 237 233 223 208 194 182 171 165 172 191 209 212 204 194 186 176 160 142 127 117 110 106 108 119 139 165 188 207 222 240 264 289 307 312 306 291 270 245
8212 245 223 210 208 214 221 223 229 244 265 279 273 254 242 246 258 264 257 240 223 215 220 238 263 288 306 318 323 323 322 322 321 312 298 283 274 268 262 254 244 231 216 202 193 195 211 240
8194 240 272 290 285 261 230 200 176 162 163 179 194 197 186 173 168 168 164 157 155 169 196 226 247 253 247 233 217 206 204 214 232 252 270 283 287 282 268 252 238 223 206
8178B06j9j6rmKLMKNJ3J9J9J3QRJ1J0N%j%Jmrj1j1j5k1k5k3j7j1kJ8L7M3K8PppjMPQMnj5j9
8158B34j2%QNoj4j8j6j1pKJ5K3K3J6RNLklLJ8K4J6kj3j2nmj0j8k3j9lJ3K1J8J1PM%oplkll
8139B56kmj2k3l0k7j5kLMKjnnKJ3J7J2MLRJ3Nnj1j5j7j7j3qqrp%LMKmrj4j3lJ3K7L5L4K9K4
8120B35J7Rkj1j3mOPkj3j7j2rj4k4k9k4j0NJ7K7L2L0K0Ol%OQMkkMJ1J3RMkqj4j0NJ8J9Q%K
8101B97N%j2j7j3pkJ0K4L1K3Nrj7k3k3j5j0j5k5k8j5LJ1Poj7k0j1LJ5K0J6J3PNMMKpj7k0j3
8084A63jJ4K6K9K3J0lpmjlj2k0j7oMOOQJ7K6K9J8%j5j9j9k9m5m8l2j0NJ3K5L5L3K1J0QQLo
8067B43j5k1j9j1kQJ2J5J5RJmnJOJ2J7J6J2ROKlpj5k6l9m1l3k3j4kJ1K0K0J6J1MmmRK1K1Q
8049B37lmkmonoomMQOLPJ0OlmQK0J6Lj2k0k7l6m5m5l0nK3M0M2L0J7J2J0NkmPK0K4J6Mmqrq
$$ plain form
8178 206 187 171 162 158 160 163 167 169 174 187 206 225 238 246 255 266 276 281 281 280 280 281 277 268 257 246 231 210 185 162 145 134 132 150 187 230 258 265 258 251 250 254 261 269 273 268 253 234
8158 234 222 222 230 235 229 215 197 181 170 163 165 180 203 226 242 251 256 259 257 254 257 275 299 315 313 300 288 283 279 269 251 228 209 206 219 240 258 269 276 280 280 274 267 264 262 259 256
8139 256 254 250 238 215 185 158 143 141 144 148 150 149 144 139 141 154 171 183 187 190 199 212 217 212 201 186 169 152 139 131 123 114 107 107 110 114 116 112 103 89 76 73 86 113 148 182 211 235
8120 235 252 261 259 248 235 231 237 244 242 229 212 200 191 177 153 124 100 90 95 112 139 171 201 221 227 224 224 230 238 242 240 238 242 253 266 275 279 277 269 255 245 250 268 287 295 295 297
8101 297 302 302 290 273 260 253 251 261 285 316 339 344 335 318 295 272 257 247 232 207 179 164 167 178 185 179 162 142 131 134 149 169 185 198 205 210 214 218 220 213 196 176 163
8084 163 162 176 202 231 254 264 261 254 250 249 246 234 214 197 191 195 201 207 215 232 258 287 305 305 290 271 252 223 178 130 98 88 93 106 131 166 199 220 230 238 246 249 243
8067 243 228 207 188 177 175 183 195 210 225 234 235 231 226 227 233 245 262 278 290 299 305 307 304 297 282 256 217 176 143 120 106 104 115 135 155 171 182 186 182 178 187 208 229 237
8049 237 234 230 228 224 218 213 207 201 197 201 209 215 218 225 235 241 238 234 242 262 278 281 269 249 222 186 141 96 66 61 84 124 166 196 213 225 235 240 238 234 241 261 285 301 305 301 293 284 276
8029B76nmno%NJ0Omj7k9k7j2PJ7J3Jj0pKPMMJ1K1J9Kj6k1j7j8k3k3j5nmpqonrj6j8j5nRK2
8010G9K9K7J9Q%lmjJ0J7J8P%NJ8K8K7J7QNLLLKKPJ5J5Lj6k9l3k6j4lKMQJ1Qkj0pPK0K1Rj1
7991C06k8l4k8k3k1j6lJ7K8K5J5MorkJ2K4K5K0Qlj2j6j7k1k7k6j6nmppl%JMNLKPK0L0K5J4
7974B61PQRJj0j5rljmonnpqqpojQJ0Mnoklj0j6qQK1K3J4Kqj0j0p%J1J8J2ok1k5k0rKJ0J7J7
7953B02J4PJLRJ1QJkmqj0pJNPOLoj6j4kJ3J8J9J6J3OjmlNJ0J0MopkPJ2J7J9J6Mj4k7l3l4l1
7933B36k3j5oKJ2K1K2J3Kqj3j2rmnqj1j1pOK1L0K7J6NklJPRMpj8k3k1j1PJ9K0J5J0J3J5Pl
7915C20mOJ8J8Mj3k0j8j4j6j6pMOKoj3k2k9l0k6k2j7rQK2K6K1J0Jl%QJ3J0Kqj6k3l1l5l3k4
7898D4pJ3L1L8L1J5KmllmlJNONPOMPJ7K1Qj8l8l7k4pQK4L4L4K8K5K5K3J4jj3k0j7nRJ5J1J
$$ plain form
8029 276 271 267 262 256 256 261 271 277 273 256 227 200 188 195 212 225 226 216 209 211 218 222 226 237 258 277 279 263 242 225 207 184 161 146 141 137 130 122 116 111 102 86 68 53 48 57 79
8010 79 108 135 154 162 162 159 155 154 164 181 199 206 206 211 229 257 284 301 309 314 317 320 323 325 327 334 349 364 367 351 322 289 263 249 246 248 252 260 271 279 277 267 260 267 287 308 317 306
7991 306 278 244 216 193 172 156 153 170 198 223 238 242 236 227 225 237 261 286 306 314 311 299 283 266 245 218 192 176 171 167 160 153 150 150 151 155 160 163 165 172 192 222 247 261
7974 261 268 276 285 286 276 261 252 249 248 244 238 233 228 221 213 205 198 192 191 199 209 213 208 202 200 197 187 171 163 171 192 215 229 231 223 213 203 196 196 207 225 237 231 210 185 165 156 158 168 185 202
7953 202 216 223 224 227 236 247 255 256 254 250 242 232 225 226 231 238 244 247 241 225 211 209 222 240 259 275 288 294 293 289 286 291 301 311 315 309 302 300 307 319 336 355 371 375 361 334 301 267 236
7933 236 213 198 192 194 206 227 249 262 264 256 243 231 222 218 213 205 194 183 176 182 203 233 260 276 281 279 276 277 284 293 297 290 272 249 228 217 224 243 263 278 288 301 316 323 320
7915 320 316 322 340 358 362 349 329 311 297 281 265 258 262 268 270 264 251 229 200 170 144 122 105 96 104 126 152 173 183 184 181 181 189 202 212 214 206 190 167 136 101 68 44
7898 44 37 50 81 119 150 165 167 163 160 157 153 150 151 156 162 167 174 180 184 191 208 229 237 219 181 144 120 113 121 145 179 213 241 266 291 314 328 327 314 294 277 272 281 296 307 308
7880C08pj0j1j5j9j9nJ1J8RjmJPN%oj3j6j3rmKJ0J4J2OKnj3k4l1l7l8k8j1OJ7K2K3J9QJPK2
7861A91L1L0K5J6Pjopqj1pJJ0J4J5J2Mnj0rkMJ0R%j1k0k2k2k0rPJ9J7Rjrj5j3%J3J9K3K7K8
7843C33J5rk7l0k2j1%J0J6K1K4K4K0J0Jnn%%j1k4k7j6m%nlQJ6Qpk1j9pLQJ1J7K7L1K7J9J4
7826D10J1J0Nlj0j6j8j7j4j3j2rpoonrj3qJ0L5M9M8L5K0J0PPRJ0J7K8L6L6K6J8RLlrj2rNK3
7808F78L0K4J5K2L6M8M9M7M7M8N5O9Q4R2R5R9J05J15J39J79K30K82L45M35N53O97Q72J107
7797F597J408J772K169K512K586K135J082l09j556k289k459k259j914j556j242r88p97o52
7790D240n40m56l85l16k48j94j60j38j16r1p1n2k7mPKj2l0m9o8q0q0o9n4l6j8mkpj3j5j6j6
7777H82j1kQJ7K2K9L4L7M1M8N8O7P4Q0R1J07J22J35J50J81K24K73L23L83M62N63P01R03J183
$$ plain form
7880 308 301 291 280 265 246 227 222 233 251 260 259 255 256 263 268 268 262 249 233 220 211 207 209 219 233 245 251 253 248 235 211 180 143 105 77 66 72 89 111 134 153 161 162 169 191
7861 191 222 252 277 293 300 299 293 286 278 267 260 261 271 285 300 312 316 311 301 292 290 294 304 313 313 302 282 260 238 218 209 216 235 252 261 260 251 236 223 223 236 255 278 305 333
7843 333 348 339 312 282 260 249 249 259 275 296 320 344 364 374 375 370 365 365 365 354 330 303 287 283 283 278 275 283 299 307 300 279 260 253 256 264 275 292 319 350 377 396 410
7826 410 421 431 436 433 423 407 389 372 358 345 333 324 317 311 305 300 291 278 270 280 315 364 412 447 467 477 484 491 500 510 527 555 591 627 653 671 680 683 680 671 659 650 655 678
7808 678 708 732 747 769 805 853 902 949 996 1044 1099 1168 1252 1344 1439 1538 1643 1758 1897 2076 2306 2588 2933 3368 3921 4618 5490 6597
7797 6597 8005 9777 11946 14458 17044 19179 20261 19952 18396 16107 13648 11389 9475 7919 6677 5689 4892 4240
7790 4240 3700 3244 2859 2543 2295 2101 1941 1803 1687 1596 1525 1473 1446 1442 1449 1451 1439 1409 1360 1292 1212 1132 1063 1009 973 955 951 949 942 929 914 898 882
7777 882 871 869 877 894 916 945 979 1016 1057 1105 1163 1230 1304 1384 1475 1582 1704 1839 1989 2170 2394 2667 2990 3373 3835 4398 5099 6002 7185
7765G185J530J931K356K662K580J867N74q83j994k499k482k191j824j469j165r27p47o08m93
7757C403m04l35k75k24j84j50j22j00q7p9p1o7o8o7n3l0j4j2j3j0l%kpj9l4m4m0k8k1k0j6
7745H04mJ1K6L4L9L9M2M8N2M9M2M3N3O9Q0R3J10J33J62K06K63L26L89M56N42O60Q21J037J315
7733G940J656K048K428K602K299J369mj351k230k512k367k044j691j360j077q56o86n53m45
7725C166l59k96k48k14j89j64j36j09r4q9q7q8r0q8p7n8m1k9k4k8k9k1pmj7l8m6m4l8l1k0
7713C63nKkmjJnj3j5qJ%pj4j6j4j0pJQJ5J5J0LllOK1K8K0Lj0rjMMLjlml%Jkj0j6j3lKrk6l6
7692B38l5l0k2j7ronml%Jkoj1j4j0JJ2J7J9K2K2J7Qjqj4j8j8j3pk%kpj0j0j0oKJ1J7J7J5J4
7674A33J4Rkj8k7l0k4j4jJ2K2K9L0K7J9J0MMRJ8K4K7K1J1kj3j6j3nNJ0Ooj6j9j3mKLlj0j6
$$ plain form
7765 7185 8715 10646 13002 15664 18244 20111 20685 19802 17808 15309 12827 10636 8812 7343 6178 5251 4504 3896 3403
7757 3403 2999 2664 2389 2165 1981 1831 1709 1609 1522 1443 1372 1305 1237 1170 1117 1087 1073 1061 1048 1038 1035 1035 1033 1026 1007 973 929 889 861 840 820 804
7745 804 800 811 837 871 910 949 991 1039 1091 1140 1182 1225 1278 1347 1427 1520 1630 1763 1925 2131 2394 2720 3109 3565 4107 4767 5588 6625 7940
7733 7940 9596 11644 14072 16674 18973 20342 20338 18987 16757 14245 11878 9834 8143 6783 5706 4850 4164 3611 3166
7725 3166 2807 2511 2263 2049 1860 1696 1560 1451 1357 1268 1181 1093 1003 915 838 780 739 710 686 658 629 608 601 597 580 542 496 452 414 383 363
7713 363 358 360 358 354 353 354 349 336 321 313 314 314 307 293 277 263 253 246 247 255 270 285 295 298 295 292 298 319 347 367 370 360 351 350 354 358 361 360 357 353 350 350 351 349 339 323 310 307 309 300 274 238
7692 238 203 173 151 134 125 119 114 110 107 107 108 106 100 89 75 65 66 78 95 114 136 158 175 183 182 174 160 142 124 111 104 102 102 100 93 83 73 63 57 59 70 87 104 119 133
7674 133 147 156 154 136 109 79 55 41 40 52 74 103 133 160 179 189 193 197 206 224 248 275 296 307 305 292 276 263 258 263 273 279 273 257 238 225 221 223 226 223 213 197
7657A97j8j4j0mOJ8K4K0Qlj0r%RJ5J3Mrk6l7l7k3lJ0J9K7L3L4K6J3Kj0j5j7j4j0%J2K5K9J7
7641B92kj9k7k5j6j0rj4k3l1l1k3oQJ6J9K2J8Ppj3nLKoqJJ4K5K9K1Mj5k3k0j2mjJjmpjRJ6
7623A44J3Plj2j5qPJ6J2Jnmoj5k8l6l7k9j6kOJ0J4K0K3J7Omp%J2K5L2K9J9RPPMkj0j5j6j1
7605A59opplMJ2J5J5J1OLOJ3J6J1%nlKL%lJNNnj3j5rlknm%QJ6K1J8OnqjRJ3Poj6k2j9j3qo
7584A91on%NROjnnMJ7K6K7K3J6J0Loj3j3rpnklrk2l1l1k8j8mJ5K4K2J5J6K3K5J5lj4j3pKM
7566B38KknqpkMRPKkkmn%J0J7J5RORJ0Kj4k9l7l3k3j0k%kmkJjqj2oQK2K5K1J2Mkqj0rpqj0
7545A59j0qlKPJ2J3J0Knpnjmj0j6j1MK0K8K3J7J0%j4k9l7l7l0k0oRJ6J2JpqjRK0K6K4J4Ko
7527A65ojjpj3j2okln%OOLJNJ3J8J6J0Jqj3j2j0qplNJ4K0K1J6J0LKLKlqqjNKnj3j9j8j0JJ0
$$ plain form
7657 197 179 165 155 151 157 175 199 219 227 224 214 205 205 214 229 242 246 237 211 174 137 114 111 121 140 167 200 234 260 273 275 265 250 233 219 209 209 221 246 275 292
7641 292 290 271 244 219 203 193 184 170 147 116 85 62 56 64 80 99 121 139 146 139 126 121 124 126 120 112 113 127 152 181 202 206 191 168 148 136 132 131 132 131 127 120 119 128 144
7623 144 157 164 161 149 134 126 133 149 161 162 157 153 147 132 104 68 31 2 -14 -16 -10 0 14 34 57 74 80 76 69 69 81 106 138 167 186 195 202 209 213 211 201 186 170 159
7605 159 153 146 139 136 140 152 167 182 193 199 202 208 221 237 248 248 243 240 242 245 245 242 243 248 253 248 235 220 211 208 206 201 197 197 205 221 242 260 266 261 253 252 261 274 281 275 259 237 218 205 197 191
7584 191 185 180 180 185 194 200 199 194 189 193 210 236 263 286 302 312 315 309 296 283 274 267 262 260 257 248 226 195 164 136 118 114 129 153 175 190 206 229 254 269 266 252 239 232 234 238
7566 238 240 238 233 225 218 216 220 229 236 238 236 234 230 225 225 235 252 267 276 282 291 301 303 289 260 223 190 167 157 155 155 153 149 147 148 147 139 127 121 129 151 176 197 209 213 211 203 193 184 177 169 159
7545 159 149 141 138 140 147 159 172 182 184 179 172 167 166 162 152 136 125 129 149 177 200 217 227 227 213 184 147 110 80 60 54 63 79 91 92 85 77 76 85 105 131 155 169 171 165
7527 165 159 158 157 150 137 125 119 117 114 109 109 115 121 124 125 130 143 161 177 187 188 180 167 155 145 137 130 127 132 146 166 187 203 213 216 218 221 223 220 212 204 203 208 210 205 192 173 155 145 146 156
7506A56J5J7J9J5MnmNRKooJJ0J7K2J8Mj0j3mQJ4J3J0OKjoj3j3mRJ3jk1l5l4k0lJ0J1Mmqrj1
7487A83j5j6j7j6j3pJNLknjOJ4J5J0NMMJKJ0K1K3J2K%K%mlNJ1QLjMJ5K5K6J2j3l5m6m2l2j7
7468A47jJ2J6J1NK%nnKOKmlJ1K0J6Kj1j8k1k4k2j8j0nKPRRJ2J8K0J9J7J7J6Mj9l5l5k1rrj5
7450A12j4nNPKMJ1J9J6Q%lpj7k4k1j3lMJ1J8J8J2LljNJ4J8J3KolKmj9l3k9j3MJ5K2K8L3L6
7432B24L1J6kj7k1j9k0k0j6nLLNQJ1QJoj2j5j3oknoOK0K0Orj4j2rj0kRK1K8L1L0K4J4Nkrj7
7414B55k1k4k2j9j2n%NJ2J9J9QmokMMJmpmJRJ1RKlmkqk2k9k0%J4J2jj3j4nOJ3J0kj3j6qJP
7394A32PJomQK2L4L6L1J8Mlopj4j8j0JQLknorj0qnjKMMJornJNJqj6j6pJNLJLKmj1j5j1jPJ1
7372A33J4J5J7J6J2Nkrj0mOJ4J4Qkj6k4k2mJ6K3K0J2O%nm%%oj3j0jPPNMQQOKkmprlPJ6J4L
$$ plain form
7506 156 171 188 207 222 226 221 217 222 231 233 227 221 222 232 249 271 289 293 283 270 266 274 288 301 311 317 319 318 312 299 286 282 291 304 303 282 247 213 193 190 200 211 215 211 203 194 183
7487 183 168 152 135 119 106 99 100 105 108 106 101 100 106 120 135 145 150 154 158 159 161 171 192 215 227 229 229 231 231 227 224 229 240 248 251 250 254 269 294 320 332 319 284 238 196 164 147
7468 147 146 158 174 185 190 192 192 187 182 184 190 192 188 185 196 216 232 234 223 205 184 160 138 120 110 105 107 114 123 132 144 162 182 201 218 235 251 255 236 201 166 145 136 127 112
7450 112 98 93 98 105 107 111 122 141 157 165 165 162 155 138 114 93 80 77 81 92 110 128 140 143 140 139 144 158 176 189 191 185 182 184 180 161 128 99 86 90 105 127 155 188 224
7432 224 255 271 269 252 231 212 192 172 156 151 154 157 162 170 181 189 190 184 172 157 144 138 136 131 125 131 151 171 177 168 154 142 133 123 121 130 151 179 210 240 264 278 283 281 272 255
7414 255 234 210 188 169 157 152 152 157 169 188 207 215 211 205 203 207 211 212 208 201 197 198 207 218 227 229 226 222 220 212 190 161 141 141 155 167 166 153 139 134 140 153 163 161 148 132 124 125 132
7394 132 139 140 134 130 138 160 194 230 261 279 283 280 274 267 253 235 225 226 234 237 235 230 224 215 205 197 192 191 193 197 201 202 196 187 182 183 188 189 181 165 149 142 143 148 151 152 155 157 153 142 127 116 115 122 133
7372 133 147 162 179 195 207 212 210 201 191 187 193 207 221 229 227 211 187 165 161 177 200 220 232 238 238 233 229 229 229 223 210 200 199 206 213 218 222 230 238 244 246 244 240 233 224 221 228 244 258 261
7352B61j0j5qMJ0RNMOPOPPO%pp%J0J0LlkNQNlrj4j9k0j3llrj3lJ2K3K4K3J8Nj4l0l3k9k6j6
7332A69%J9K8K5J7J1Omj1pLJ1Plj2j6j4j5j7j4j1rj0rlNJ3J5K0K3K0PmmJ0K2K0Oj1k2k8k5
7315B08j9rlLNQJ1Opk2k7k2pNJ1J1J1J3J8K0J8Roj8j8oQJ6J1Lj%PJ2J0LpoLJ7K0Qj0k3k2j4
7297B28rj0j8k6l0k7k0j2qmklmnMJ7K8K7J8RNMPJ0J5J7J4ROMjqj5j9j8j0lJkj1j9j8j1kKK
7278A12LORJ2J4J7J4Lj0j7j5rKRQlj4j4JJ9K6K5J6jk1l7l5k2j2nKJ1J6J1NNROlj4j8j4o%P
7260I8J5K6K9J9kj9k5k1j5j1rmNJ3K0K8L1L0K5K1J9J4Ooj5j4pLJ1J3Qmj6k6l0k9k2j3ojjK
7244A40PJ1J0J1J4J4Kj4k3j6jJ1K3L0K9J4lj0%J4K0J5PONJj0k1k2j1MJ1OklMJ1J2Mnj2j1p
7226B65mqj7l0l8l4j9mOJ0J1J0Lrj7j8j1npqnMJ2J6J4J1RJ1J2QKoj1j2oNJ6K1J8J5J7J8J5
$$ plain form
7352 261 251 236 228 232 242 251 256 260 266 273 279 286 293 299 299 292 285 285 295 305 308 305 303 308 316 321 318 309 295 276 256 243 240 237 228 215 212 224 247 271 294 312 317 303 273 240 211 185 169
7332 169 169 188 216 241 258 269 275 271 260 253 256 267 274 271 259 243 229 214 197 183 172 163 153 144 141 146 159 174 194 217 237 244 240 236 246 268 288 294 283 261 233 208
7315 208 189 180 177 180 185 193 204 210 203 181 154 132 125 130 141 152 163 176 194 214 232 241 235 217 199 193 201 217 228 231 230 230 237 249 259 262 255 249 252 269 289 297 287 264 242 228
7297 228 219 209 191 165 135 108 88 76 68 64 62 59 55 50 54 71 99 126 144 153 158 162 169 179 194 211 225 234 240 244 243 235 220 201 183 173 170 171 169 158 139 121 110 108 110 112
7278 112 115 121 130 142 156 173 187 190 180 163 148 139 141 150 158 155 141 127 128 147 173 198 214 213 192 155 120 98 86 81 83 94 110 121 126 131 140 146 143 129 111 97 91 91 98
7260 98 113 139 168 187 185 166 141 120 105 94 85 81 86 99 119 147 178 208 233 254 273 287 293 287 272 258 251 254 265 278 286 282 266 240 210 181 159 146 140 139 138 140
7244 140 147 158 168 179 193 207 209 195 172 156 155 166 189 219 248 262 259 249 249 263 283 298 305 311 316 317 307 286 264 253 257 268 274 272 269 273 284 296 300 295 283 272 265
7226 265 261 253 236 206 168 134 115 111 117 127 138 148 151 142 125 107 96 91 84 76 71 75 87 103 117 128 137 148 160 168 170 164 153 141 135 140 156 177 195 210 227 245 260
7209B60Okj1j8k4k3j2OK1L2L2K6J4Kj2k3k7k0oLjj0j1lNMjmJJ4L0M2M6M4M1L4K3Nj7l4m7n1
7192C34m9m1k9j3kONjonJRJ6J9J8J2Koqnoj1j8k1j8j0%PP%pj2j5j4j1j2j6j8j6rnmKJ6K9L0
7174A25K1J3RRQQNkrj0kQJ2J1J0J0RPOQRQJj3k4j8kJ4J1mk0k5j9pOJ7K1K2J6Nj2k2k2j1MJ7
7155B08K3K4K1J5J2Olj3j7j1jPJ0J1J2Rjj9l6m1l5k5k1k0k0j5j3j0oKPRRNlj2j4j1nJQJ5K2
7138H4K2J4OJPK1L4L7K7J6J1QMLNOMlnljlmjJkj0j5j1jM%j0rLJ5J2mj8j8mJ5K7K9K1Rkj4k1
7118B87k2j5j1j2j7k1k4k5k1j0KJ3K0K2J8Mj1k0j9j7j5j1mKLKLMLMJ2J9J8J2M%lj1j8j9j0
7102A16JMmj2j2lMJ0J6K1J4MJJ4K9L1K3Qnj9l0k7j3mjKJ5L1L5K2Jj3j7j0jRJ1QKnj4k4k9k5
7084A64j5kRJ8K7L0K7J8Nj2k6k7j6nmj1j7j6j3qjOJ1J4J4J6J5J0Njj3k7l1k2rpj0j2oKJ1J8
$$ plain form
7209 260 266 264 253 235 211 188 176 182 203 235 267 293 307 309 297 274 247 227 221 224 223 213 202 199 204 208 207 203 204 218 248 290 336 380 421 455 478 483 466 432 385 334
7192 334 285 244 215 202 200 206 211 210 204 199 200 209 225 244 262 274 276 270 262 257 251 240 222 201 183 173 173 180 187 187 180 168 153 139 128 116 100 82 66 57 52 48 50 66 95 125
7174 125 146 159 168 177 185 193 198 196 187 177 175 183 195 206 216 226 235 242 248 256 265 273 274 261 237 219 217 231 242 238 218 193 174 167 173 190 211 233 249 254 242 220 198 187 191 208
7155 208 231 255 276 291 303 309 306 293 276 265 264 271 281 292 304 313 312 293 257 216 181 156 135 115 95 80 67 57 51 53 60 69 78 83 80 68 54 43 38 39 47 62 84
7138 84 106 120 126 127 134 155 189 226 253 269 280 288 292 295 300 306 310 307 302 299 298 295 291 290 291 289 279 264 253 252 256 256 246 237 240 255 267 263 245 227 223 238 265 294 315 324 322 308 287
7118 287 265 250 239 227 210 189 165 140 119 109 111 124 144 166 184 188 177 157 138 121 106 95 91 93 96 98 101 105 108 112 124 143 161 173 177 177 174 163 145 126 116
7102 116 117 121 117 105 93 90 94 104 120 141 155 159 160 174 203 234 257 265 260 241 211 184 171 167 166 168 183 214 249 271 272 259 242 232 231 240 251 259 261 256 242 218 189 164
7084 164 149 147 156 174 201 231 258 276 281 269 243 216 200 195 191 180 163 147 134 126 125 131 142 156 170 186 201 211 216 215 202 175 144 122 113 106 96 84 78 80 91 109
7067A09K0J4MkllmJJ5L2M0L9L0K0J2Kj0k3k6j7kJ0J2Mpj6j8pPJ7J1kj3j6qKJ0J3J0Lmj2j7
7050B27j7j3qkNRKj3k6k1mJ7K7K6J6NkjLO%j0k1k5k1j2%NNORQjj5k4k2j6j0nklnnMJ7K5K6
7031A44K3K1J3LppLJ6K3K1J3PMOPQOOM%mnlnj0j4j5j1pkMOO%oj1j4j0kJnj3j6j1okjkqj8k3
7011A07k0j1jRJ7K1J6PLPJ0PMKLLlj1j5j4qJJ1J9K8L2K6J1qk5k8j5MJ8K1K2L0M0M1K5Ploj2
6993C72k1k3j4lJj%LON%j2k3k8k2r%KMPNlqolmj1j2nK%j2k2k4j5KJ4J6RKmqj0nOPlj4j2JO
6972A33kj4j4rrj7j5JK6M3M2L0J4JoplNJ3J6J1Jpj1j0qoorj0j1j2j5k1k5k1qNJ6K1K4K1J4
6955A61OOJ5K6L0K2Pj2k8l9l8l1j7%J8L0L0J8%j4k0k2j9j1lKLJPJ6K4K5J8R%jNQ%j3k4k5k3
6938A47j6lJ7L1K7J2mj0rpplRK4L0K2Kj7k8l0k5j2MJ6J6J0OJoj1pPJ9K2J7O%lkjllKQQLjj
$$ plain form
7067 109 129 143 147 145 142 139 135 136 151 183 223 262 292 312 324 326 316 293 267 250 248 258 270 274 267 251 233 226 233 250 261 259 246 230 222 224 234 247 257 260 256 244 227
7050 227 210 197 189 187 192 201 203 190 164 143 139 156 183 209 225 230 228 227 230 236 236 226 205 180 159 147 147 152 157 163 172 180 179 164 140 118 102 92 87 85 82 77 72 76 93 118 144
7031 144 167 188 201 204 197 190 193 209 232 253 266 273 277 283 290 298 304 310 314 314 310 305 302 297 287 273 258 247 240 238 242 248 254 254 248 237 223 213 211 212 207 194 178 167 161 159 158 156 148 130 107
7011 107 87 76 75 84 101 122 138 145 148 155 165 172 176 178 181 184 181 170 155 141 133 134 145 164 192 224 250 261 253 228 200 185 189 207 228 250 280 320 361 386 393 390 384 372
6993 372 351 328 314 311 312 311 311 314 320 325 325 313 290 262 240 231 231 233 237 244 249 246 238 232 229 225 214 202 197 199 199 187 165 141 126 128 142 158 167 169 165 157 147 142 148 155 152 138 126 127 133
6972 133 131 117 103 94 85 68 53 54 80 123 165 195 209 210 204 197 194 199 212 228 239 240 233 222 212 204 198 192 183 173 162 150 135 114 89 68 60 65 81 102 126 147 161
6955 161 167 173 188 214 244 266 273 261 233 194 156 125 108 108 126 156 186 204 204 190 170 148 129 118 115 117 120 121 128 144 168 193 211 220 220 219 224 232 232 219 195 170 147
6938 147 131 128 145 176 203 215 211 201 192 185 178 175 184 208 238 260 262 245 217 187 162 150 154 170 186 196 202 203 197 186 179 186 205 227 244 250 250 247 245 244 241 238 240 248 256 259 258 257
6919B57lrj5j9k4k6j8kJ2J8K0K1J9RJ%kj1j6j0OJ6J0kqkJ3K4K7K5J8J1Jrj3qmj1k4l0k3j2
6902B07qpkNLlj0j1j1j1j1j1pJJ4K6L0K6J8J4Rlj4j9j3jMKoj5k3k3rJ2K8K7J4%rj4k1k7k2
6885A29mJ9L4L1J8OLLLJJNRRjj4k3k0pLKmnLPmj7k1j3%QRJ2J6K0J7Pkj0j6j7j0RK6L2K1Mj0
6865B69j8k6k9k7k1j2JJ7L0L1J9Lj1k2k6k0pOJ4J4Oqj9k6k4j9qMJ7J9J1kpJJ4K0J5Lnoqj2
6848A51rkOQLlrj1j0%J1J6J5J2J0RJ1K0L3L0Pk4m2l7j8%QRJ1J8K5K9K5J6Mqj8k1j8j1ojJj
6831B39nqj1j3rjJ4K1J1pk0k2j6j1lRK3L3L1J7NKJ1J7J2%j0j3j4j8k5k9l0k6j9mJ1K0J9J0
6815A91NJmqpLJ5J4jj5j5nNQJ1J3Qkj4j6j1oorj2j2pKJ0J2POJ3K0K1J8J4J6K3K7K4J2nj5j6
6797C13pJOJ1J0Lqj6j6j5j5j5rjMQJ4J6Ppj9k4k7k7k6k0j3rpj0j9k9k7j2OK3L4M3M3K7Nj2
$$ plain form
6919 257 254 245 230 211 187 161 143 141 153 171 191 212 231 240 241 241 239 228 212 202 208 224 234 232 224 222 235 259 286 311 329 340 341 332 319 311 307 296 272 242 219 207
6902 207 199 192 190 195 198 195 185 174 163 152 141 130 123 124 138 164 194 220 238 252 261 258 244 225 212 211 215 217 211 196 173 150 141 153 181 208 222 222 213 199 178 151 129
6885 129 125 144 178 209 227 233 236 239 242 243 244 249 258 267 266 252 229 209 202 205 207 203 198 201 208 204 187 166 153 153 161 170 182 198 218 235 242 240 230 214 197 187 196 222 254 275 279 269
6865 269 251 225 196 169 148 136 137 154 184 215 234 237 226 204 178 158 151 157 171 185 191 183 164 138 114 95 87 91 108 127 138 136 129 130 144 164 179 182 177 171 163 151
6848 151 142 140 146 154 157 154 145 134 124 124 135 151 166 178 188 197 208 228 261 291 298 274 232 195 177 177 185 194 205 223 248 277 302 318 322 314 296 275 257 246 240 239 240 239
6831 239 234 226 215 202 193 192 206 227 238 231 211 189 173 162 159 168 191 224 255 272 277 279 290 307 319 319 309 296 282 264 239 210 180 154 135 131 142 162 181 191
6815 191 196 197 193 185 178 181 196 210 209 194 179 174 179 187 198 211 219 217 203 187 176 170 164 155 143 131 124 126 136 148 155 161 174 194 215 233 247 263 286 313 337 349 344 329 313
6797 313 306 307 313 324 334 337 329 313 297 282 267 252 243 242 246 254 268 284 291 284 265 241 214 187 161 141 128 119 112 102 83 54 27 15 21 44 78 121 164 191 196 184
6780A84j2oJOPOORJ0OLNJ6K8K9J9Npj4k1k5k0j2nrj6j8qRJ8J5Lrj6j7j6j2okmpJJ6L1L1K0
6761B22Moj4j8j5oLJ3K3K7J9%j9k8k8k2j2lmj1j3KK4L7L5K5Rrk6l4l0k4k1k0j6j0%J5K6K7
6745A22K0J1OJ%NJ8K6K0J0NMjj7k9k5rJ0J6J1jj0j2j3j2oOJ4J4Lpj5k1k3k1j1%J1J6J9J5O
6728A56qk1l1l6k7j0J1K0J8J1PMJnj2k0k7k5j5jPQJ1J7K0J4MjKJ0J2Plj0rkJ0J8K4K3J7J1
6711A80RRNkqmNJ1J2J4J5J0KmkLPJ0QJprjPJ1J4J7J5Kj4k2k1j7j1rqj1j4j2okj%%LPJ3J5R
6692B29mj4j7rNJ5J1kj0nMOJLJ1J7J5Qkj3k4k6j8rnqqrrj0j0j1j6j9j9pRK7L6L7K8J7Lqj3
6674A77r%M%rj4k0k3k2j1MJ5K2K6K7K2J5QOOOJnj2rLJ9L2L5L3K3J1LNJ3J6Qmj6j9j4kMkj5
6656C38k0j6pjJ%lj1j9k4j9rjLkj0j5j4q%PQMnj0roJJ4K9L8L2J2pj9k3k3j7pRK4L5L5K9J9
$$ plain form
6780 184 172 166 167 173 180 186 192 201 211 217 220 225 241 269 298 317 322 315 301 280 255 235 223 218 209 193 175 167 176 194 209 212 203 187 170 154 142 136 134 130 123 124 140 171 202 222
6761 222 226 220 206 188 173 167 170 183 206 233 252 252 233 205 177 155 143 140 136 125 112 114 138 175 210 235 244 235 209 175 145 121 100 80 64 54 54 69 95 122
6745 122 142 153 159 160 160 165 183 209 229 239 244 248 247 230 201 176 167 177 193 204 203 193 181 168 156 150 156 170 184 187 180 165 144 121 100 89 89 100 116 135 150 156
6728 156 148 127 96 60 33 23 34 54 72 83 90 94 95 90 78 58 31 6 -9 -10 -3 5 16 33 53 67 71 70 72 82 94 101 98 88 79 77 87 105 129 152 169 180
6711 180 189 198 203 201 193 189 194 205 217 231 246 256 258 254 252 255 262 272 280 281 274 265 264 271 282 296 313 328 330 316 294 273 256 245 236 228 217 203 191 185 183 182 182 182 185 192 205 220 229
6692 229 225 211 194 185 190 205 216 214 204 199 203 209 210 213 224 241 256 264 262 249 225 199 181 172 167 159 151 142 133 123 113 102 86 67 48 41 50 77 113 150 178 195 198 190 177
6674 177 168 168 172 172 163 149 129 106 84 73 77 92 114 140 167 189 204 212 218 224 230 231 226 214 205 208 227 259 294 327 350 361 364 369 382 398 406 402 386 367 353 351 355 353 338
6656 338 318 302 295 294 295 295 292 281 262 238 219 210 209 212 210 200 185 171 163 163 170 178 182 177 167 158 152 153 167 196 234 266 278 271 252 229 206 189 182 191 215 250 285 314 333
6638C33J5K1L0L9M4M7M9M5K8jk9m5m6l9l1k6k4k0j9j8j6j0omnm%K%lKQPlj2j4j2oJPQOJ0J9
$$ plain form
6638 333 348 369 399 438 482 529 578 623 651 650 621 576 530 491 460 434 410 390 371 353 337 327 321 317 312 308 308 310 310 307 309 317 324 321 309 295 283 277 278 285 293 299 309 328
$$ [...]
-2084A50
##END=	
##END=	
