##TITLE=	Jun21-2022.40.fid
TM-VI-391, CDCl3

##JCAMP-DX=	6.0	$$ MestReNova 14.3.0-30573
##DATA TYPE=	LINK
##BLOCK_ID=	1
##BLOCKS=	2    
##ORIGIN=	Mestrelab Research S.L.
##OWNER=	hrzepa
##$MNOVA/LINK_BLOCK_TYPE=	ITEM	$$ NMR Spectrum
##$MNOVA/ITEM/POLYGON=	(XY..XY)
5321,5835
8722,5835
8722,8208
5321,8208
5321,5835
##$MNOVA/ITEM/Z=	0
##$MNOVA/ITEM/ANGLE=	0
##TITLE=	Jun21-2022.40.fid
##JCAMP-DX=	6.0	$$ MestReNova 14.3.0-30573
##BLOCK_ID=	2
##DATA TYPE=	MNOVA NMR VIEW DATA
##DATA CLASS=	MNOVA VIEW DATA
##$MNOVA/ITEM/ZOOM/X=	-4.005464102252559222,	16.005770000004368114
##$MNOVA/ITEM/ZOOM/Y=	-1058.895648717880249,	11608.5491943359375
##END=	
##TITLE=	Jun21-2022.40.fid
##JCAMP-DX=	6.0	$$ MestReNova 14.3.0-30573
##BLOCK_ID=	3
##DATA TYPE=	NMR SPECTRUM
##DATA CLASS=	XYDATA
##NUMDIM=	1
##ORIGIN=	Bruker BioSpin GmbH
##OWNER=	nmr
##.OBSERVE FREQUENCY=	400.4124024600000098
##.OBSERVE NUCLEUS=	^1H
##.SOLVENT NAME=	CDCl3
##.PULSE SEQUENCE=	zg30
##LONGDATE=	2022/06/21 17:21:00.000
##.ACQUISITIONMODE=	SIMULTANEOUS (DQD)
##$ORIGINAL FORMAT=	Bruker XWIN-NMR
##$MNOVA/SCALES_VERSION=	9
##$PARAMETER FILE=	(acqus, ASCII, /private/var/folders/f6/rjf_tdyn2v98c5c0wvkgn4s80000gn/T/urX2xDEYSy65+u67021aeA/40/acqus, 0)
$$ ##TITLE= Parameter file, TOPSPIN		Version 3.2
$$ ##JCAMPDX= 5.0
$$ ##DATATYPE= Parameter Values
$$ ##NPOINTS= 11	$$ modification sequence number
$$ ##ORIGIN= Bruker BioSpin GmbH
$$ ##OWNER= nmr
$$ $$ 2022-06-21 17:21:24.262 +0100  nmr@CZC10666PP
$$ $$ /opt/topspin/data/agmb/nmr/Jun21-2022/40/acqus
$$ $$ process /opt/topspin3.2/prog/mod/shimcntl
$$ ##$ACQT0= -2.36344537815126
$$ ##$AMP= (0..31)
$$ 100 100 100 100 100 100 100 100 100 100 100 100 100 100 100 100 100 100
$$ 100 100 100 100 100 100 100 100 100 100 100 100 100 100
$$ ##$AMPCOIL= (0..19)
$$ 0 0 0 0 0 0 0 0 0 0 0 0 0 0 0 0 0 0 0 0
$$ ##$ANAVPT= -1
$$ ##$AQSEQ= 0
$$ ##$AQ_mod= 3
$$ ##$AUNM= <au_zg>
$$ ##$AUTOPOS= <42 >
$$ ##$BF1= 400.41
$$ ##$BF2= 400.41
$$ ##$BF3= 400.41
$$ ##$BF4= 400.41
$$ ##$BF5= 400.41
$$ ##$BF6= 400.41
$$ ##$BF7= 400.41
$$ ##$BF8= 400.41
$$ ##$BYTORDA= 0
$$ ##$CAGPARS= (0..11)
$$ 0 0 0 0 0 0 0 0 0 0 0 0
$$ ##$CFDGTYP= 0
$$ ##$CFRGTYP= 9
$$ ##$CHEMSTR= <none>
$$ ##$CNST= (0..63)
$$ 1 1 145 1 1 1 1 1 1 1 1 1 1 1 1 1 1 1 1 1 1 1 1 1 1 1 1 1 1 1 1 1 1 1 1
$$ 1 1 1 1 1 1 1 1 1 1 1 1 1 1 1 1 1 1 1 1 1 1 1 1 1 1 1 1 1
$$ ##$CPDPRG= (0..8)
$$ <> <> <> <> <mlev> <mlev> <mlev> <mlev> <mlev>
$$ ##$D= (0..63)
$$ 0 1 0 0 0 0 0 0 0 0.06 0 0 0 0 0 0 0.0002 0 0 0 0 0 0 0 0 0 0 0 0 0 0 0
$$ 0 0 0 0 0 0 0 0 0 0 0 0 0 0 0 0 0 0 0 0 0 0 0 0 0 0 0 0 0 0 0 0
$$ ##$DATE= 1655828483
$$ ##$DE= 6.5
$$ ##$DECBNUC= <off>
$$ ##$DECIM= 2496
$$ ##$DECNUC= <off>
$$ ##$DECSTAT= 4
$$ ##$DIGMOD= 1
$$ ##$DIGTYP= 12
$$ ##$DQDMODE= 0
$$ ##$DR= 22
$$ ##$DS= 2
$$ ##$DSPFIRM= 0
$$ ##$DSPFVS= 20
$$ ##$DTYPA= 0
$$ ##$EXP= <proton>
$$ ##$F1LIST= <111111111111111>
$$ ##$F2LIST= <222222222222222>
$$ ##$F3LIST= <333333333333333>
$$ ##$FCUCHAN= (0..9)
$$ 0 2 0 0 0 0 0 0 0 0
$$ ##$FL1= 90
$$ ##$FL2= 90
$$ ##$FL3= 90
$$ [...]
$$ 90 74 58 42 26 10 0 0
$$ ##$Sgu3PowerLevels= (0..7)
$$ 0 0 0 0 0 0 0 0
$$ ##$Sgu4PowerLevels= (0..7)
$$ 0 0 0 0 0 0 0 0
$$ ##$Sgu5PowerLevels= (0..7)
$$ 0 0 0 0 0 0 0 0
$$ ##$Sgu6PowerLevels= (0..7)
$$ 0 0 0 0 0 0 0 0
$$ ##$Sgu7PowerLevels= (0..7)
$$ 0 0 0 0 0 0 0 0
$$ ##$Sgu8PowerLevels= (0..7)
$$ 0 0 0 0 0 0 0 0
$$ ##$SguType= 3
$$ ##$ShimPowMaxUA= (0..63)
$$ 130000 130000 130000 130000 130000 130000 130000 130000 130000 130000 130000
$$ 130000 130000 130000 130000 130000 130000 130000 130000 130000 0 0 0 0
$$ 0 0 0 0 0 0 0 0 0 0 0 0 0 0 0 0 0 0 0 0 0 0 0 0 0 0 0 0 0 0 0 0 0 0 0 0
$$ 0 0 0 0
$$ ##$ShimPowMaxUC= (0..63)
$$ 130000 130000 130000 130000 130000 130000 130000 130000 130000 130000 130000
$$ 130000 130000 130000 130000 130000 130000 130000 130000 130000 0 0 0 0
$$ 0 0 0 0 0 0 0 0 0 0 0 0 0 0 0 0 0 0 0 0 0 0 0 0 0 0 0 0 0 0 0 0 0 0 0 0
$$ 0 0 0 0
$$ ##$ShimPowMaxUG= (0..63)
$$ 524287 524287 524287 524287 524287 524287 524287 524287 524287 524287 524287
$$ 524287 524287 524287 524287 524287 524287 524287 524287 524287 0 0 0 0
$$ 0 0 0 0 0 0 0 0 0 0 0 0 0 0 0 0 0 0 0 0 0 0 0 0 0 0 0 0 0 0 0 0 0 0 0 0
$$ 0 0 0 0
$$ ##$ShimPowRcbType= 3
$$ ##$ShimPowRes= (0..63)
$$ 1e-20 1e-20 1e-20 1e-20 1e-20 1e-20 1e-20 1e-20 1e-20 1e-20 1e-20 1e-20
$$ 1e-20 1e-20 1e-20 1e-20 1e-20 1e-20 1e-20 1e-20 0 0 0 0 0 0 0 0 0 0 0 0
$$ 0 0 0 0 0 0 0 0 0 0 0 0 0 0 0 0 0 0 0 0 0 0 0 0 0 0 0 0 0 0 0 0
$$ ##$ShimPowRng0= (0..63)
$$ 1 1 1 1 1 1 1 1 1 1 1 1 1 1 1 1 1 1 1 1 0 0 0 0 0 0 0 0 0 0 0 0 0 0 0 0
$$ 0 0 0 0 0 0 0 0 0 0 0 0 0 0 0 0 0 0 0 0 0 0 0 0 0 0 0 0
$$ ##$ShimPowRng1= (0..63)
$$ 1 1 1 1 1 1 1 1 1 1 1 1 1 1 1 1 1 1 1 1 0 0 0 0 0 0 0 0 0 0 0 0 0 0 0 0
$$ 0 0 0 0 0 0 0 0 0 0 0 0 0 0 0 0 0 0 0 0 0 0 0 0 0 0 0 0
$$ ##$ShimPowRng2= (0..63)
$$ 1 1 1 1 1 1 1 1 1 1 1 1 1 1 1 1 1 1 1 1 0 0 0 0 0 0 0 0 0 0 0 0 0 0 0 0
$$ 0 0 0 0 0 0 0 0 0 0 0 0 0 0 0 0 0 0 0 0 0 0 0 0 0 0 0 0
$$ ##$ShimPowRng3= (0..63)
$$ 1 1 1 1 1 1 1 1 1 1 1 1 1 1 1 1 1 1 1 1 0 0 0 0 0 0 0 0 0 0 0 0 0 0 0 0
$$ 0 0 0 0 0 0 0 0 0 0 0 0 0 0 0 0 0 0 0 0 0 0 0 0 0 0 0 0
$$ ##$ShimSysFunc= (0..63)
$$ 1 2 3 4 5 7 9 11 15 16 8 10 12 14 6 17 13 18 19 20 0 0 0 0 0 0 0 0 0 0
$$ 0 0 0 0 0 0 0 0 0 0 0 0 0 0 0 0 0 0 0 0 0 0 0 0 0 0 0 0 0 0 0 0 0 0
$$ ##$ShimSysMatrix= 0
$$ ##$ShimSysType= 1
$$ ##$TFXNUM= 0
$$ ##$TRIPLO2= 0
$$ ##$VTU= 2
$$ ##$VTUETH= <149.236.99.20>
$$ ##$VTUTY= <no>
$$ ##$WBREFAM= (0..15)
$$ 135 116 100 100 100 100 100 100 100 100 100 100 100 100 100 100
$$ ##$WBREFLM= (0..15)
$$ 0 0 0 0 0 0 0 0 0 0 0 0 0 0 0 0
$$ ##$WBREFPH= (0..15)
$$ 71.66 -68.25 0 0 0 0 0 0 0 0 0 0 0 0 0 0
$$ ##$WBSGU= (0..15)
$$ 0 0 0 0 0 0 0 0 0 0 0 0 0 0 0 0
$$ ##$XFAC= 2
$$ ##END=
$$ 
##$DECIM=	2496
##$DSPFVS=	20
##XUNITS=	HZ
##YUNITS=	ARBITRARY UNITS
##FIRSTX=	6408.8703656999996383
##LASTX=	-1603.8278811825093726
##DELTAX=	-0.12226593800080123864
##XFACTOR=	1
##YFACTOR=	0.0070893556640658408202
##FIRSTY=	7.5485749244689941406
##MINY=	-3.5730168819427490234
##MAXY=	10553.2265625
##NPOINTS=	65536
##XYDATA=	(X++(Y..Y))
$$ [...]
4540 -178 -202 -232 -255 -264 -266 -268 -261 -242 -232 -243 -256 -245 -215 -193 -187 -184 -180 -190 -221 -259 -285 -296 -293 -281 -265 -258 -258 -255 -246 -238 -236 -231 -219 -210 -216 -233 -248 -254 -253 -246 -233 -217 -202 -193 -186 -177
4535 -177 -162 -137 -116 -112 -129 -151 -160 -159 -158 -163 -170 -176 -177 -173 -165 -158 -159 -163 -167 -173 -182 -190 -188 -179 -172 -172 -177 -182 -188 -197 -208 -216 -215 -204 -187 -172 -163 -158 -154 -150 -144 -133 -112 -87 -66 -56 -64 -85 -108 -118 -118 -127
4528 -127 -156 -190 -204 -194 -182 -184 -197 -208 -210 -208 -208 -215 -226 -232 -226 -209 -189 -178 -179 -190 -208 -226 -239 -247 -253 -255 -251 -238 -224 -217 -225 -251 -288 -317 -322 -300 -269 -247 -239 -235 -225 -212 -208 -220
4523 -220 -244 -263 -266 -260 -259 -271 -286 -294 -292 -278 -254 -231 -227 -249 -283 -305 -311 -311 -315 -321 -321 -308 -283 -260 -247 -245 -239 -223 -205 -199 -206 -211 -202 -185 -173 -172 -178 -186 -196 -207 -221 -236 -251 -257 -251 -231
4517 -231 -204 -182 -171 -175 -188 -204 -216 -217 -206 -189 -179 -188 -214 -243 -266 -282 -293 -299 -297 -286 -270 -253 -242 -238 -236 -231 -222 -214 -213 -215 -215 -212 -211 -214 -217 -214 -207 -207 -219 -233 -234 -217 -197 -189 -188 -178
4512 -178 -153 -129 -127 -145 -167 -182 -197 -223 -257 -289 -311 -315 -299 -271 -254 -264 -289 -299 -286 -268 -268 -277 -277 -264 -252 -251 -249 -234 -212 -201 -204 -210 -213 -214 -221 -230 -240 -250 -258 -265 -271 -282 -300
4506 -300 -311 -301 -271 -237 -216 -207 -200 -185 -167 -149 -134 -121 -111 -108 -117 -140 -172 -202 -218 -223 -226 -228 -223 -206 -188 -180 -183 -190 -195 -203 -211 -213 -206 -190 -169 -150 -146 -167 -206 -239 -248 -243 -237 -238 -242 -251
4501 -251 -264 -271 -260 -236 -218 -214 -208 -187 -156 -140 -148 -168 -173 -153 -126 -118 -133 -156 -169 -173 -180 -188 -180 -152 -120 -108 -123 -150 -173 -186 -190 -189 -187 -190 -200 -215 -227 -227 -220 -217 -223 -225 -212 -190
4495 -190 -175 -175 -177 -170 -159 -154 -151 -140 -128 -127 -146 -177 -211 -243 -262 -261 -245 -230 -226 -233 -243 -252 -254 -248 -237 -226 -216 -206 -200 -201 -212 -223 -230 -232 -228 -210 -177 -140 -117 -109 -111 -115 -116 -116 -121 -132
4490 -132 -146 -152 -150 -149 -153 -157 -154 -154 -164 -175 -172 -155 -135 -121 -109 -102 -105 -120 -133 -140 -149 -161 -166 -156 -139 -129 -124 -113 -97 -88 -93 -105 -114 -121 -125 -126 -124 -125 -140 -169 -201 -217 -211 -197 -194 -211 -230
4484 -230 -232 -216 -201 -199 -210 -221 -226 -224 -214 -201 -193 -194 -196 -189 -177 -173 -187 -212 -232 -241 -241 -238 -233 -230 -227 -221 -206 -189 -179 -176 -166 -145 -126 -134 -168 -206 -225 -224 -213 -199 -181 -164 -155 -158 -173
4478 -173 -196 -219 -231 -219 -185 -148 -122 -108 -105 -115 -138 -162 -173 -171 -165 -164 -165 -166 -170 -181 -199 -217 -223 -213 -191 -171 -166 -178 -201 -226 -240 -232 -199 -156 -127 -119 -123 -129 -139 -152 -158 -151
4473 -151 -140 -141 -160 -189 -217 -235 -240 -230 -211 -189 -167 -153 -154 -168 -184 -192 -196 -198 -193 -175 -153 -146 -156 -170 -178 -184 -188 -188 -181 -173 -167 -155 -133 -112 -106 -117 -133 -149 -168 -193 -218 -238 -252
4468 -252 -261 -263 -258 -252 -253 -259 -262 -255 -243 -241 -251 -261 -258 -244 -233 -229 -227 -224 -223 -221 -211 -190 -174 -175 -185 -189 -184 -180 -182 -183 -180 -177 -174 -165 -146 -124 -104 -89 -77 -77 -97 -138 -184 -216 -224 -213 -201 -196 -192
4462 -192 -185 -178 -176 -177 -174 -170 -175 -193 -216 -241 -271 -295 -300 -286 -272 -270 -266 -246 -219 -203 -205 -211 -216 -224 -234 -237 -229 -215 -201 -189 -184 -194 -219 -243 -252 -244 -225 -201 -181 -176 -185 -190 -176 -151 -133 -130
4456 -130 -136 -143 -154 -168 -180 -182 -178 -172 -160 -135 -100 -69 -57 -64 -77 -90 -107 -126 -137 -137 -140 -162 -201 -234 -244 -237 -221 -200 -170 -137 -110 -94 -95 -118 -161 -201 -215 -200 -176 -165
4452 -165 -172 -183 -188 -184 -171 -156 -143 -140 -145 -151 -152 -154 -160 -172 -182 -189 -195 -204 -218 -231 -242 -247 -241 -225 -208 -204 -218 -240 -254 -249 -226 -199 -182 -181 -188 -191 -191 -191 -190 -180 -163 -148 -139 -132 -124 -118 -122 -132
4446 -132 -141 -154 -172 -192 -205 -209 -209 -206 -197 -186 -174 -159 -142 -129 -129 -136 -138 -136 -141 -157 -168 -157 -131 -112 -109 -116 -127 -138 -146 -149 -147 -149 -165 -192 -219 -233 -237 -240 -247 -253 -251 -239 -221 -197 -171
4440 -171 -149 -137 -136 -140 -145 -144 -133 -116 -108 -120 -140 -146 -130 -112 -115 -146 -187 -215 -219 -210 -205 -213 -227 -235 -239 -248 -261 -268 -265 -261 -256 -242 -223 -212 -213 -209 -193 -186 -206 -243 -268 -270 -258 -240 -214 -188
4435 -188 -177 -179 -176 -158 -139 -134 -144 -157 -168 -176 -183 -187 -189 -188 -179 -164 -150 -147 -157 -180 -209 -234 -243 -234 -219 -217 -236 -265 -285 -287 -275 -262 -254 -247 -235 -220 -206 -192 -178 -173 -178 -186 -190 -189 -188 -186
4429 -186 -184 -192 -219 -251 -265 -261 -256 -260 -262 -255 -245 -239 -229 -218 -223 -251 -278 -281 -268 -257 -249 -229 -201 -181 -170 -157 -144 -146 -160 -165 -156 -150 -153 -149 -124 -96 -89 -103 -113 -110 -109 -126 -156 -186 -207
4423 -207 -221 -236 -257 -279 -287 -277 -259 -251 -256 -264 -264 -252 -228 -202 -187 -189 -196 -195 -195 -211 -240 -258 -251 -234 -230 -242 -254 -255 -251 -251 -252 -248 -244 -245 -249 -245 -231 -219 -222 -238 -249 -242 -227 -218 -218 -221 -215 -202
4418 -202 -189 -185 -191 -199 -201 -200 -206 -223 -241 -244 -233 -218 -211 -211 -212 -213 -211 -201 -183 -169 -174 -195 -218 -229 -232 -234 -236 -236 -238 -246 -256 -255 -233 -196 -164 -152 -159 -172 -186 -201 -218 -229 -227 -217 -210 -208 -205
4412 -205 -199 -194 -194 -195 -187 -174 -160 -144 -120 -90 -65 -55 -56 -64 -77 -95 -111 -122 -135 -159 -183 -192 -187 -187 -199 -205 -185 -148 -122 -125 -143 -155 -156 -154 -156 -163 -173 -180 -179 -163 -140 -122 -120 -131
4406 -131 -147 -164 -179 -189 -192 -189 -183 -175 -166 -156 -151 -151 -151 -148 -145 -147 -147 -134 -105 -78 -75 -102 -143 -176 -192 -193 -191 -197 -209 -214 -200 -170 -145 -141 -156 -175 -184 -180 -171 -165 -162 -155 -139 -121 -110 -107 -108 -108
4401 -108 -111 -122 -140 -159 -170 -167 -148 -128 -125 -148 -181 -205 -208 -196 -176 -152 -132 -132 -159 -198 -226 -232 -222 -210 -203 -198 -192 -184 -179 -182 -190 -192 -178 -156 -144 -154 -175 -186 -181 -174 -181 -199 -217
4395 -217 -225 -217 -198 -178 -168 -171 -182 -188 -179 -146 -96 -51 -36 -52 -77 -93 -105 -126 -154 -177 -194 -212 -231 -240 -231 -216 -208 -213 -220 -224 -223 -219 -213 -210 -214 -230 -256 -283 -296 -287 -262 -238 -222
4390 -222 -211 -199 -187 -180 -172 -157 -138 -129 -139 -158 -174 -180 -181 -185 -192 -199 -205 -213 -221 -230 -236 -241 -245 -246 -243 -238 -235 -232 -231 -236 -254 -275 -284 -272 -242 -206 -175 -152 -138 -129 -126 -129 -135 -133 -125 -122 -137 -154 -153 -132
4384 -132 -115 -120 -139 -160 -181 -202 -211 -201 -188 -187 -190 -179 -163 -163 -177 -181 -165 -153 -167 -196 -209 -193 -162 -134 -121 -124 -130 -121 -95 -68 -60 -69 -79 -82 -85 -95 -110 -130 -158 -189 -211
4379 -211 -216 -211 -210 -219 -230 -238 -239 -232 -220 -206 -192 -181 -175 -175 -178 -181 -180 -175 -170 -168 -171 -177 -181 -182 -183 -181 -171 -152 -133 -121 -119 -131 -151 -169 -173 -162 -152 -154 -157 -148 -132 -124 -134 -156 -182 -209 -236 -256
4373 -256 -264 -261 -250 -234 -212 -184 -147 -111 -95 -113 -154 -188 -201 -200 -195 -188 -181 -181 -195 -215 -225 -216 -193 -169 -159 -174 -207 -239 -257 -266 -278 -297 -314 -323 -322 -317 -303 -274 -228 -178 -141
4368 -141 -127 -128 -129 -125 -123 -129 -140 -152 -168 -188 -206 -210 -201 -190 -187 -191 -194 -185 -165 -141 -121 -108 -97 -91 -98 -119 -135 -134 -125 -130 -152 -176 -190 -200 -216 -237 -251 -252 -241 -226 -220 -227 -240 -242 -221
4363 -221 -187 -158 -140 -136 -147 -167 -183 -182 -166 -151 -146 -150 -157 -165 -175 -185 -189 -181 -166 -154 -152 -159 -169 -176 -181 -185 -189 -190 -187 -181 -171 -160 -156 -163 -177 -193 -206 -220 -233 -239 -237 -226 -213 -204 -203 -207 -208
4357 -208 -206 -206 -216 -228 -225 -203 -174 -153 -144 -150 -170 -195 -209 -201 -185 -178 -185 -190 -184 -169 -156 -157 -173 -199 -218 -218 -205 -191 -177 -158 -137 -135 -164 -211 -252 -271 -266 -241 -204 -170 -152 -153
4352 -153 -165 -177 -182 -177 -161 -141 -132 -131 -124 -99 -65 -43 -42 -57 -83 -121 -165 -199 -209 -200 -192 -193 -200 -201 -200 -206 -217 -222 -210 -189 -179 -188 -208 -224 -227 -219 -208 -198 -187 -172 -153 -142 -146 -156
4346 -156 -156 -144 -137 -149 -172 -181 -175 -172 -186 -207 -214 -204 -191 -183 -177 -166 -151 -138 -126 -110 -87 -68 -70 -100 -142 -169 -172 -171 -183 -200 -205 -194 -185 -187 -192 -192 -197 -214 -239 -254 -254 -245 -232 -207
4341 -207 -171 -135 -118 -127 -154 -181 -190 -178 -159 -155 -169 -180 -171 -145 -120 -114 -130 -163 -196 -209 -190 -150 -114 -98 -100 -113 -129 -149 -170 -186 -194 -195 -190 -182 -171 -156 -143 -140 -153 -173
4336 -173 -184 -182 -180 -191 -209 -224 -231 -238 -249 -258 -257 -241 -213 -175 -140 -122 -120 -123 -120 -118 -129 -157 -191 -222 -244 -255 -257 -257 -257 -255 -245 -232 -229 -241 -257 -263 -256 -242 -228 -221 -223 -229 -230 -219 -198
4330 -198 -176 -161 -162 -181 -212 -241 -257 -262 -264 -265 -257 -240 -223 -215 -214 -208 -191 -172 -168 -181 -196 -201 -203 -218 -245 -265 -255 -221 -185 -161 -148 -137 -126 -116 -106 -101 -108 -128 -157 -188 -218
4325 -218 -237 -236 -214 -187 -171 -167 -171 -183 -208 -239 -260 -266 -265 -262 -257 -247 -238 -236 -236 -229 -212 -194 -184 -185 -190 -195 -199 -196 -180 -151 -124 -112 -117 -126 -130 -135 -147 -162 -167 -155 -135 -116 -103 -102 -117 -142
4320 -142 -168 -189 -208 -223 -227 -213 -191 -177 -179 -190 -200 -202 -200 -201 -203 -203 -202 -202 -203 -202 -196 -185 -174 -164 -156 -150 -140 -122 -103 -98 -117 -148 -166 -159 -133 -101 -74 -65 -81 -112 -135 -144 -148 -151 -147
4314 -147 -136 -132 -142 -149 -138 -119 -116 -135 -162 -185 -201 -209 -208 -204 -207 -217 -230 -241 -246 -236 -206 -175 -163 -166 -162 -146 -136 -147 -165 -170 -167 -170 -178 -177 -169 -169 -181 -197 -206 -208 -204 -191 -171 -154 -151
4309 -151 -162 -177 -188 -197 -210 -227 -241 -243 -233 -218 -202 -185 -171 -163 -157 -150 -148 -165 -193 -200 -172 -134 -119 -130 -148 -167 -198 -239 -270 -275 -265 -249 -224 -191 -164 -160 -172 -182 -183 -187
4304 -187 -200 -217 -229 -228 -216 -197 -179 -165 -153 -140 -128 -120 -112 -101 -95 -100 -110 -115 -113 -114 -119 -119 -110 -96 -87 -85 -80 -71 -63 -66 -83 -107 -126 -134 -133 -132 -133 -135 -140 -152 -164 -162 -147 -132 -129 -137 -147 -155
4298 -155 -172 -202 -237 -262 -268 -255 -232 -208 -184 -159 -135 -120 -121 -134 -152 -170 -179 -173 -154 -133 -119 -111 -103 -99 -103 -110 -113 -110 -110 -114 -113 -96 -70 -48 -43 -52 -68 -86 -101 -116 -133 -155 -180
4293 -180 -201 -211 -206 -189 -165 -147 -142 -150 -160 -163 -158 -152 -151 -152 -146 -128 -99 -72 -61 -70 -91 -111 -130 -154 -185 -213 -230 -240 -246 -249 -246 -242 -240 -237 -225 -206 -195 -200 -207 -193 -157 -119 -98 -97
4287 -97 -107 -121 -135 -144 -144 -142 -152 -175 -197 -204 -199 -191 -184 -179 -181 -193 -207 -204 -180 -152 -138 -136 -129 -111 -92 -87 -103 -134 -168 -188 -189 -177 -169 -175 -194 -214 -229 -238 -238 -227 -211 -196 -185 -173
4282 -173 -159 -144 -134 -128 -121 -114 -107 -101 -98 -101 -112 -127 -135 -138 -143 -158 -183 -214 -242 -261 -258 -233 -199 -170 -146 -122 -100 -91 -94 -98 -99 -107 -127 -144 -143 -133 -130 -130 -121 -101 -87 -91 -104 -111 -111 -113 -120
4276 -120 -130 -140 -146 -142 -134 -135 -151 -171 -179 -173 -167 -171 -180 -184 -181 -175 -166 -150 -126 -102 -88 -82 -73 -59 -52 -61 -81 -98 -109 -121 -136 -140 -127 -109 -106 -119 -133 -138 -139 -149 -169 -190 -201 -199 -192 -189 -191
4271 -191 -191 -184 -177 -179 -190 -204 -212 -211 -200 -179 -158 -147 -146 -143 -135 -128 -129 -136 -148 -165 -186 -195 -186 -168 -159 -160 -155 -133 -99 -69 -50 -42 -46 -65 -100 -135 -153 -148 -138 -140 -152 -155 -137 -108 -87 -81
4265 -81 -83 -89 -104 -130 -161 -188 -205 -214 -217 -219 -223 -226 -224 -213 -199 -186 -168 -138 -102 -78 -76 -89 -105 -121 -138 -148 -140 -116 -91 -82 -95 -126 -166 -197 -201 -179 -152 -143 -151 -162 -169 -177 -180 -170
4260 -170 -149 -132 -127 -126 -118 -111 -116 -129 -137 -141 -155 -179 -192 -180 -152 -128 -109 -88 -67 -62 -82 -112 -130 -135 -134 -131 -124 -113 -108 -111 -113 -107 -102 -104 -110 -110 -99 -85 -75 -70 -73 -85 -104 -123 -141 -162
4254 -162 -186 -204 -204 -189 -173 -166 -164 -162 -155 -142 -128 -118 -117 -124 -137 -146 -141 -122 -107 -112 -138 -166 -180 -184 -189 -200 -218 -247 -281 -298 -287 -263 -247 -243 -239 -228 -223 -235 -257 -272 -269 -250 -225
4249 -225 -205 -198 -198 -193 -184 -182 -189 -192 -187 -176 -165 -150 -128 -106 -94 -91 -92 -101 -122 -150 -172 -179 -173 -162 -159 -165 -168 -154 -129 -115 -125 -143 -154 -156 -156 -154 -144 -123 -88 -41 2 19 0 -25
4243 -25 -29 -17 -22 -60 -108 -140 -157 -169 -179 -182 -180 -173 -161 -145 -132 -127 -126 -126 -132 -145 -159 -165 -167 -169 -174 -176 -174 -170 -163 -154 -150 -160 -177 -194 -206 -216 -221 -212 -188 -166 -156 -159 -163 -167 -176 -192 -209 -221
4237 -221 -227 -230 -228 -216 -196 -181 -179 -183 -180 -169 -160 -160 -164 -162 -149 -129 -115 -112 -120 -130 -137 -146 -164 -183 -187 -172 -149 -134 -128 -123 -116 -108 -102 -98 -102 -110 -119 -125 -135 -151 -162 -157 -144 -145 -171 -210 -239 -251
4232 -251 -246 -229 -207 -188 -173 -158 -138 -116 -103 -100 -104 -113 -131 -153 -164 -157 -140 -132 -136 -141 -139 -143 -160 -180 -180 -155 -125 -111 -120 -142 -167 -187 -196 -190 -180 -180 -192 -209 -224 -244 -271 -295
4226 -295 -303 -289 -261 -230 -207 -192 -183 -181 -188 -200 -212 -219 -222 -227 -239 -253 -259 -250 -229 -207 -196 -194 -194 -193 -196 -206 -216 -216 -204 -186 -171 -168 -181 -201 -209 -189 -145 -100 -74 -72 -83 -99 -113
4221 -113 -124 -134 -146 -160 -170 -179 -191 -203 -204 -183 -152 -128 -125 -133 -139 -135 -125 -115 -110 -111 -114 -114 -106 -96 -98 -116 -142 -166 -185 -205 -231 -254 -267 -273 -281 -290 -295 -293 -289 -290 -297 -308 -317 -318 -304 -277
4216 -277 -252 -241 -247 -259 -267 -263 -246 -220 -191 -160 -134 -123 -134 -160 -184 -199 -208 -218 -224 -223 -218 -216 -216 -214 -213 -221 -236 -248 -246 -231 -210 -191 -176 -165 -160 -162 -173 -189 -207 -227 -251 -272
4210 -272 -281 -274 -264 -259 -261 -264 -264 -258 -240 -212 -185 -173 -177 -187 -193 -188 -171 -154 -148 -158 -168 -165 -151 -139 -134 -127 -113 -98 -86 -74 -69 -86 -128 -170 -185 -174 -156 -147 -141 -128 -111 -104 -110 -120
4205 -120 -125 -124 -123 -128 -139 -155 -171 -184 -191 -191 -186 -175 -154 -132 -125 -139 -156 -151 -127 -112 -122 -144 -155 -152 -145 -144 -149 -156 -158 -152 -139 -132 -140 -159 -179 -195 -202 -196 -180 -170 -176 -192 -207 -219 -234
4200 -234 -249 -248 -226 -197 -173 -154 -136 -128 -136 -149 -145 -126 -113 -118 -136 -152 -163 -175 -183 -179 -165 -155 -159 -172 -181 -183 -183 -184 -185 -185 -184 -179 -170 -160 -157 -166 -180 -192 -200 -209 -218 -224 -227 -229 -237 -246 -246 -227 -195
4194 -195 -170 -169 -185 -198 -192 -176 -168 -177 -191 -199 -198 -191 -182 -168 -154 -153 -170 -197 -219 -227 -226 -221 -213 -203 -197 -200 -208 -212 -208 -199 -189 -184 -189 -209 -233 -243 -232 -212 -198 -191 -187 -186 -190 -196 -202 -212 -231 -248
4188 -248 -246 -226 -204 -195 -195 -189 -176 -168 -176 -195 -214 -223 -220 -211 -202 -192 -176 -152 -128 -111 -105 -109 -126 -160 -206 -246 -263 -255 -231 -202 -170 -134 -106 -102 -133 -185 -233 -258 -255 -232 -203 -180
4183 -180 -165 -154 -145 -142 -146 -148 -137 -118 -105 -108 -122 -139 -156 -172 -185 -198 -212 -223 -221 -204 -187 -182 -187 -189 -185 -188 -207 -233 -244 -220 -167 -112 -88 -99 -123 -133 -126 -117 -116 -119 -117 -110 -105 -108
4177 -108 -118 -135 -158 -175 -174 -153 -127 -116 -119 -125 -122 -113 -112 -129 -160 -190 -207 -208 -199 -191 -187 -183 -176 -168 -163 -161 -159 -160 -169 -179 -173 -149 -124 -120 -138 -159 -170 -173 -174 -175 -174 -176 -181 -182 -172 -156 -145 -143 -150
4171 -150 -164 -185 -199 -190 -155 -118 -101 -100 -97 -88 -87 -103 -124 -136 -135 -129 -122 -113 -111 -119 -128 -124 -109 -99 -101 -104 -95 -77 -64 -66 -84 -110 -132 -144 -147 -147 -148 -150 -153 -160 -167 -170 -172 -179 -191 -197 -191 -181 -174 -168
4165 -168 -159 -153 -157 -167 -176 -184 -194 -203 -201 -189 -178 -175 -176 -174 -172 -176 -185 -191 -186 -178 -176 -180 -181 -171 -156 -146 -145 -144 -139 -133 -135 -148 -166 -183 -196 -208 -223 -235 -233 -209 -178 -156 -149 -143 -135 -134 -144 -152 -145 -125
4159 -125 -110 -101 -97 -96 -100 -100 -92 -84 -91 -111 -132 -148 -164 -177 -177 -162 -146 -134 -116 -96 -91 -108 -130 -133 -121 -113 -113 -109 -95 -87 -96 -117 -136 -144 -144 -139 -133 -129 -128 -127 -126 -127 -132 -137 -137 -131 -121 -114 -115 -125
4153 -125 -142 -165 -193 -221 -241 -252 -263 -275 -280 -265 -234 -205 -189 -185 -181 -171 -162 -165 -181 -195 -198 -188 -173 -156 -138 -126 -127 -141 -153 -153 -153 -167 -199 -238 -273 -297 -306 -301 -289 -277
4148 -277 -266 -253 -239 -229 -226 -228 -230 -229 -225 -225 -230 -232 -221 -202 -189 -185 -180 -163 -141 -123 -107 -92 -87 -101 -125 -140 -140 -133 -131 -136 -147 -157 -159 -149 -137 -129 -114 -83 -47 -32 -46 -78 -113
4143 -113 -144 -164 -162 -144 -131 -136 -149 -154 -153 -156 -167 -179 -184 -183 -180 -181 -190 -203 -213 -215 -210 -198 -174 -140 -106 -85 -80 -87 -98 -103 -97 -87 -79 -72 -56 -36 -31 -45 -64 -65 -55 -54 -72 -99 -121
4137 -121 -137 -146 -149 -144 -140 -146 -161 -173 -170 -147 -112 -76 -50 -37 -39 -57 -81 -97 -100 -97 -98 -104 -113 -123 -132 -129 -114 -99 -100 -112 -117 -106 -88 -76 -71 -63 -50 -42 -49 -74 -105 -131 -148 -155 -150 -131
4132 -131 -109 -98 -97 -93 -83 -77 -82 -88 -87 -88 -107 -135 -152 -150 -143 -140 -137 -129 -123 -122 -122 -120 -119 -122 -120 -111 -107 -118 -135 -144 -144 -145 -152 -154 -148 -139 -143 -160 -183 -202 -214 -221 -219 -204 -182 -163 -153 -149 -145 -138 -131 -130 -139
4125 -139 -160 -186 -199 -193 -177 -170 -171 -170 -160 -147 -139 -131 -119 -110 -114 -126 -139 -146 -150 -152 -156 -167 -187 -203 -203 -188 -172 -162 -156 -153 -154 -161 -166 -166 -160 -150 -135 -110 -78 -53 -43 -46 -54 -61 -68 -73 -72 -65
4119 -65 -57 -57 -62 -65 -67 -80 -108 -140 -163 -180 -198 -211 -211 -199 -189 -188 -186 -178 -167 -164 -165 -158 -141 -125 -120 -126 -132 -136 -141 -148 -147 -123 -78 -33 -7 -6 -20 -36 -45 -46 -46 -48 -55 -64 -74 -85 -97 -112
4113 -112 -132 -157 -178 -185 -178 -167 -154 -141 -128 -124 -130 -135 -129 -114 -98 -86 -79 -80 -90 -107 -121 -127 -120 -103 -83 -76 -87 -105 -116 -114 -103 -91 -78 -63 -44 -22 -5 -7 -28 -55 -72
4108 -72 -81 -90 -105 -121 -136 -144 -136 -110 -77 -56 -47 -40 -31 -29 -37 -42 -39 -38 -54 -89 -130 -166 -187 -190 -184 -177 -174 -174 -179 -193 -210 -214 -197 -175 -166 -172 -178 -179 -176 -175 -176 -179 -179 -169 -142 -112 -95 -100 -118 -139
4102 -139 -158 -174 -179 -172 -161 -159 -166 -169 -154 -122 -82 -41 -2 28 39 24 -4 -31 -50 -65 -83 -101 -111 -104 -77 -39 -9 -2 -13 -27 -37 -51 -70 -89 -107 -128 -152 -166
4098 -166 -164 -153 -143 -133 -116 -97 -92 -102 -117 -129 -146 -171 -193 -193 -168 -134 -114 -111 -112 -107 -99 -101 -119 -140 -148 -139 -121 -106 -106 -131 -175 -217 -238 -238 -232 -227 -219 -204 -190 -181 -172 -155 -129
4092 -129 -103 -85 -76 -70 -60 -49 -46 -54 -59 -41 -5 25 29 11 -10 -25 -39 -54 -67 -75 -81 -90 -100 -105 -101 -95 -99 -113 -127 -132 -136 -147 -163 -178 -191 -205 -217 -216 -200 -177 -160 -145 -130
4087 -130 -111 -93 -79 -74 -82 -98 -112 -121 -130 -146 -162 -171 -176 -183 -186 -174 -146 -122 -122 -144 -168 -177 -171 -164 -164 -170 -173 -167 -159 -160 -173 -189 -193 -180 -164 -165 -184 -203 -204 -188 -176 -182 -199 -212 -213 -204 -192
4081 -192 -179 -164 -142 -112 -82 -65 -60 -60 -61 -65 -73 -74 -60 -45 -50 -81 -119 -136 -124 -95 -71 -66 -80 -97 -102 -102 -107 -123 -141 -156 -167 -176 -174 -162 -146 -132 -117 -96 -74 -63 -64 -71
4076 -71 -80 -90 -97 -100 -102 -107 -114 -115 -110 -111 -123 -139 -145 -140 -128 -119 -118 -131 -153 -174 -189 -202 -215 -219 -206 -188 -181 -188 -191 -176 -150 -129 -120 -125 -141 -161 -170 -164 -154 -155 -167 -181 -194 -209 -226 -235 -227
4070 -227 -207 -180 -156 -141 -134 -129 -112 -87 -68 -72 -99 -136 -173 -202 -217 -217 -205 -187 -171 -162 -163 -168 -167 -163 -166 -180 -192 -191 -184 -179 -177 -169 -159 -155 -159 -160 -156 -154 -161 -167 -162 -144 -126 -115 -108 -99 -89
4065 -89 -89 -103 -124 -134 -131 -123 -118 -106 -80 -51 -41 -58 -85 -105 -117 -129 -138 -138 -133 -131 -137 -144 -145 -141 -140 -148 -168 -187 -187 -161 -123 -94 -79 -73 -70 -74 -86 -97 -101 -101 -101 -104 -111 -127 -155 -183 -194
4059 -194 -181 -161 -150 -150 -152 -149 -143 -141 -143 -153 -173 -193 -197 -180 -157 -150 -158 -167 -172 -182 -205 -229 -238 -232 -216 -198 -176 -156 -144 -142 -146 -153 -158 -158 -152 -143 -140 -142 -143 -141 -133 -119 -99 -83 -79 -93 -119 -148
4053 -148 -168 -170 -150 -124 -110 -112 -121 -129 -139 -158 -181 -199 -207 -206 -202 -194 -185 -171 -155 -139 -129 -124 -119 -118 -127 -145 -157 -156 -147 -139 -133 -127 -123 -125 -128 -121 -106 -95 -94 -95 -87 -73 -65 -66 -72 -73 -67 -58 -58 -73 -90
4047 -90 -92 -74 -49 -23 6 38 54 39 5 -23 -35 -42 -62 -96 -133 -157 -163 -158 -152 -150 -148 -141 -131 -128 -133 -140 -146 -150 -147 -137 -124 -119 -126 -135 -138 -133 -123 -112 -107 -115 -135 -155 -171 -189 -210 -226
4041 -226 -225 -206 -177 -148 -124 -111 -115 -131 -145 -150 -150 -143 -126 -98 -79 -87 -119 -148 -156 -152 -155 -169 -177 -171 -161 -158 -157 -146 -124 -104 -93 -89 -89 -94 -104 -113 -118 -125 -135 -139 -129 -112 -103 -102 -94 -73
4036 -73 -51 -43 -51 -69 -96 -129 -162 -185 -194 -194 -188 -172 -140 -98 -66 -63 -83 -106 -119 -136 -166 -195 -199 -180 -166 -170 -178 -172 -164 -170 -179 -169 -141 -116 -104 -90 -65 -44 -41 -59 -85 -110
4030 -110 -127 -131 -126 -129 -145 -161 -165 -158 -158 -163 -158 -130 -90 -62 -60 -81 -112 -136 -147 -148 -146 -143 -135 -121 -107 -103 -115 -137 -157 -167 -169 -170 -173 -175 -177 -183 -190 -183 -153 -110 -77 -60 -47 -27 -6 1
4025 1 -6 -20 -30 -34 -39 -51 -71 -95 -115 -124 -122 -120 -122 -125 -122 -107 -87 -77 -84 -102 -114 -110 -100 -93 -87 -75 -64 -69 -92 -115 -123 -122 -124 -129 -134 -142 -158 -175 -182 -180 -186 -201 -211 -204 -191 -187 -193 -198 -197 -192
4019 -192 -189 -189 -196 -208 -215 -212 -206 -207 -215 -223 -229 -238 -245 -239 -219 -194 -174 -163 -162 -167 -172 -168 -162 -165 -183 -205 -218 -220 -216 -209 -207 -215 -226 -225 -211 -198 -193 -185 -168 -149 -145 -153 -164 -177 -192 -205 -207 -201 -200 -202 -196 -176
4012 -176 -150 -130 -123 -129 -140 -145 -132 -105 -74 -48 -27 -20 -34 -61 -79 -77 -66 -67 -82 -101 -121 -141 -160 -170 -173 -168 -149 -115 -82 -75 -105 -153 -193 -214 -222 -225 -221 -203 -178 -156 -152
4007 -152 -169 -200 -225 -224 -189 -137 -99 -92 -106 -123 -132 -132 -128 -120 -112 -111 -116 -122 -125 -127 -127 -123 -118 -115 -113 -109 -103 -102 -106 -110 -113 -120 -127 -120 -96 -70 -58 -62 -76 -93 -107 -113 -108 -96 -82 -71 -69 -85 -117 -149
4001 -149 -162 -158 -149 -146 -153 -168 -188 -201 -197 -178 -158 -144 -139 -142 -150 -152 -147 -144 -156 -172 -172 -152 -131 -125 -128 -126 -118 -112 -117 -135 -162 -188 -195 -180 -156 -138 -127 -119 -113 -104 -83 -57 -47 -65 -93 -109
3996 -109 -115 -128 -149 -165 -169 -175 -188 -198 -192 -173 -152 -135 -121 -107 -90 -72 -59 -54 -56 -56 -48 -33 -20 -17 -29 -51 -70 -73 -65 -55 -51 -52 -56 -64 -66 -57 -46 -47 -61 -66 -53 -41 -48 -70 -88
3990 -88 -101 -122 -155 -183 -189 -174 -154 -141 -137 -141 -146 -147 -145 -142 -136 -126 -115 -107 -101 -93 -88 -92 -107 -128 -152 -176 -196 -207 -211 -214 -217 -211 -200 -195 -200 -205 -202 -189 -170 -151 -140 -145 -165 -188 -204 -213 -222
3984 -222 -229 -228 -217 -201 -184 -172 -171 -188 -214 -231 -226 -203 -175 -150 -129 -109 -92 -82 -81 -80 -72 -64 -71 -95 -121 -135 -138 -145 -161 -180 -191 -188 -180 -175 -176 -171 -153 -133 -132 -148 -162 -157 -144 -142
3979 -142 -150 -150 -135 -115 -100 -86 -67 -54 -59 -79 -102 -125 -150 -176 -196 -204 -199 -185 -169 -160 -164 -173 -177 -172 -165 -164 -165 -161 -147 -132 -126 -131 -143 -157 -164 -160 -144 -125 -114 -112 -103 -75 -42 -31 -45
3973 -45 -63 -70 -70 -74 -81 -77 -64 -53 -51 -57 -69 -88 -112 -138 -164 -186 -197 -192 -177 -167 -171 -188 -212 -230 -225 -190 -141 -107 -103 -111 -110 -96 -82 -83 -105 -138 -168 -179 -171 -152 -135 -128 -130 -134
3968 -134 -127 -107 -80 -60 -54 -53 -50 -44 -37 -31 -30 -39 -58 -79 -92 -91 -78 -57 -38 -35 -49 -71 -90 -104 -111 -105 -83 -59 -47 -45 -42 -30 -14 0 19 39 45 26 -9 -38 -45 -39 -36 -45 -62
3963 -62 -77 -87 -91 -91 -85 -78 -76 -80 -81 -72 -51 -31 -21 -23 -34 -49 -64 -77 -84 -84 -83 -86 -98 -117 -133 -138 -133 -128 -135 -156 -179 -190 -185 -174 -170 -174 -177 -178 -189 -212 -230 -220 -188 -160 -151 -148 -135
3957 -135 -118 -118 -138 -157 -155 -132 -109 -98 -101 -111 -119 -120 -114 -101 -79 -52 -33 -35 -56 -78 -84 -74 -64 -62 -66 -73 -81 -85 -78 -62 -52 -65 -97 -128 -138 -129 -111 -92 -74 -66 -75 -97 -115
3952 -115 -122 -124 -133 -144 -144 -129 -112 -106 -109 -111 -104 -93 -81 -68 -52 -40 -39 -51 -70 -84 -88 -78 -61 -41 -22 -4 10 18 17 14 16 18 11 -10 -36 -49 -42 -24 -5 9 21 28 24 6
3946 6 -27 -72 -116 -144 -146 -130 -108 -89 -70 -47 -27 -16 -10 -2 1 -9 -40 -71 -83 -74 -62 -62 -75 -96 -118 -137 -147 -150 -153 -158 -161 -161 -165 -173 -172 -152 -121 -97 -89 -92 -102 -119 -136 -140
3941 -140 -125 -103 -89 -90 -102 -122 -145 -157 -150 -134 -128 -131 -122 -88 -42 -12 -12 -31 -51 -68 -86 -108 -126 -136 -145 -157 -164 -150 -115 -77 -53 -41 -31 -24 -28 -41 -48 -44 -35 -29 -23 -14 -6
3936 -6 -11 -34 -62 -87 -109 -134 -159 -173 -174 -173 -179 -185 -172 -135 -94 -71 -68 -74 -83 -99 -115 -114 -96 -75 -65 -58 -39 -9 11 10 -2 -13 -18 -28 -51 -79 -96 -95 -86 -88 -106 -129 -146
3930 -146 -153 -154 -148 -138 -129 -124 -120 -111 -97 -87 -86 -94 -106 -121 -136 -149 -155 -152 -139 -122 -112 -117 -128 -132 -126 -125 -137 -154 -164 -168 -180 -202 -220 -216 -190 -157 -129 -112 -104 -104 -112 -124 -134 -140 -145 -148
3925 -148 -146 -137 -127 -123 -122 -112 -93 -80 -86 -110 -133 -141 -133 -115 -91 -64 -42 -34 -43 -61 -70 -64 -52 -48 -49 -47 -47 -64 -101 -136 -146 -137 -133 -143 -154 -152 -136 -115 -98 -93 -106 -124 -131 -121 -111
3919 -111 -114 -127 -133 -133 -136 -148 -154 -141 -109 -74 -50 -43 -46 -52 -58 -66 -75 -79 -72 -61 -51 -43 -34 -29 -34 -50 -73 -93 -106 -112 -115 -125 -144 -160 -158 -139 -121 -117 -121 -121 -113 -107 -111 -122 -131 -133 -132 -134 -135 -121
3913 -121 -87 -53 -48 -79 -119 -142 -148 -151 -155 -149 -135 -123 -121 -117 -98 -73 -59 -66 -82 -90 -89 -90 -105 -126 -134 -120 -94 -75 -71 -77 -80 -73 -66 -70 -87 -101 -99 -79 -58 -47 -43 -39 -37 -46 -64 -79
3907 -79 -87 -91 -88 -71 -42 -19 -16 -33 -54 -70 -80 -86 -88 -85 -76 -65 -54 -48 -47 -44 -36 -21 -4 8 14 12 7 2 4 12 22 30 33 33 32 27 17 8 1 -3 -16 -36 -56 -69 -76 -83 -84 -73 -50 -22
3901 -22 -1 8 8 4 0 -2 -14 -36 -64 -89 -109 -129 -145 -157 -163 -162 -150 -124 -101 -98 -116 -130 -127 -117 -116 -127 -136 -134 -120 -98 -72 -56 -59 -79 -102 -121 -139 -158 -170 -168 -154 -141
3896 -141 -134 -126 -115 -106 -103 -96 -73 -36 -7 -4 -22 -46 -65 -80 -88 -88 -84 -86 -94 -99 -96 -97 -106 -117 -128 -146 -172 -193 -192 -174 -158 -150 -145 -138 -131 -127 -121 -112 -104 -97 -87 -72 -61 -62 -78 -105 -135 -152
3890 -152 -148 -130 -113 -103 -96 -88 -78 -71 -68 -76 -95 -116 -127 -127 -123 -116 -99 -73 -53 -47 -43 -29 -13 -14 -28 -39 -40 -42 -52 -68 -80 -82 -73 -59 -55 -67 -84 -82 -55 -23 -14 -35 -70 -100
3885 -100 -113 -114 -115 -123 -127 -113 -85 -60 -52 -53 -50 -44 -39 -30 -13 5 5 -19 -50 -71 -85 -104 -123 -122 -98 -70 -59 -62 -66 -66 -62 -57 -57 -71 -105 -144 -163 -153 -132 -118 -112 -105 -93 -77 -54
3879 -54 -27 -8 -8 -25 -45 -58 -61 -60 -58 -62 -71 -74 -66 -53 -45 -43 -39 -30 -17 -8 -8 -21 -43 -59 -56 -44 -42 -52 -58 -51 -42 -45 -58 -69 -72 -74 -77 -83 -93 -101 -100 -89 -82 -81 -81 -74 -71 -80 -90 -86 -70 -66
3873 -66 -83 -105 -115 -108 -94 -81 -73 -75 -89 -106 -117 -120 -118 -117 -123 -139 -163 -181 -186 -183 -182 -186 -184 -160 -117 -72 -44 -36 -33 -25 -14 -12 -19 -25 -27 -32 -48 -62 -60 -44 -28 -21 -18 -14 -13 -21 -40 -64
3867 -64 -90 -118 -140 -150 -151 -156 -172 -190 -197 -195 -196 -204 -209 -204 -192 -180 -173 -167 -165 -168 -174 -174 -166 -156 -148 -142 -132 -116 -97 -78 -64 -58 -55 -53 -52 -62 -83 -103 -105 -90 -73 -72 -81 -85 -77 -65 -54 -46 -36
3861 -36 -31 -41 -58 -60 -33 4 24 19 5 2 9 14 14 14 10 -6 -37 -65 -76 -69 -57 -53 -60 -74 -91 -104 -110 -110 -111 -116 -116 -106 -93 -93 -114 -141 -150 -137 -115 -100 -96 -98 -100 -101 -100 -92 -80 -75
3855 -75 -80 -85 -81 -71 -68 -74 -79 -82 -88 -100 -107 -107 -107 -115 -122 -121 -118 -124 -134 -132 -119 -113 -119 -124 -115 -104 -106 -122 -148 -184 -222 -238 -219 -181 -151 -134 -116 -96 -90 -107 -134 -156 -170 -178 -180 -173 -167 -168 -171 -168
3849 -168 -154 -128 -94 -65 -61 -87 -122 -139 -134 -121 -113 -112 -115 -122 -127 -122 -111 -105 -109 -119 -124 -121 -114 -109 -113 -128 -149 -165 -171 -168 -152 -120 -73 -25 3 2 -26 -69 -105 -121 -123 -128 -146 -169 -187
3844 -187 -198 -204 -206 -206 -202 -191 -169 -139 -107 -81 -60 -44 -37 -42 -49 -47 -37 -24 -12 0 15 25 23 12 4 8 12 3 -22 -44 -46 -35 -33 -49 -69 -76 -69 -62 -59 -61 -69 -87 -111 -124 -120 -111
3838 -111 -110 -118 -127 -127 -116 -99 -81 -69 -67 -74 -82 -86 -85 -84 -85 -81 -68 -53 -46 -45 -42 -34 -34 -49 -66 -66 -53 -45 -53 -71 -90 -114 -143 -166 -175 -173 -169 -163 -150 -131 -119 -118 -121 -126 -133 -146 -160 -167 -163 -148
3832 -148 -123 -95 -72 -61 -63 -71 -77 -76 -69 -62 -58 -59 -62 -63 -59 -51 -41 -34 -29 -22 -14 -17 -40 -78 -111 -134 -149 -156 -144 -112 -77 -57 -45 -25 3 21 18 6 3 10 18 16 4 -12 -27 -36 -47
3826 -47 -69 -95 -109 -104 -97 -106 -125 -134 -124 -110 -107 -112 -114 -111 -114 -123 -135 -143 -146 -147 -145 -145 -151 -161 -164 -150 -115 -71 -35 -18 -20 -28 -32 -34 -43 -64 -87 -100 -103 -106 -113 -120 -119 -106 -91 -85 -90 -96 -95 -90 -92 -105
3820 -105 -121 -130 -124 -106 -83 -64 -52 -51 -56 -61 -63 -65 -77 -100 -128 -151 -161 -154 -129 -90 -52 -27 -17 -7 12 33 37 17 -10 -29 -34 -31 -28 -29 -42 -69 -102 -124 -127 -112 -90 -67
3815 -67 -53 -50 -53 -51 -43 -49 -78 -116 -132 -116 -90 -77 -80 -92 -103 -106 -92 -70 -58 -70 -94 -108 -107 -102 -96 -82 -56 -33 -27 -37 -54 -69 -80 -85 -86 -86 -82 -63 -29 0 7 -4 -21
3809 -21 -29 -26 -19 -14 -18 -36 -54 -56 -40 -17 0 9 12 8 0 -10 -21 -38 -60 -81 -98 -111 -119 -120 -113 -108 -110 -110 -97 -72 -46 -32 -32 -40 -50 -63 -80 -99 -105 -89 -56 -24 -7 -5 -5 -1
3804 -1 4 5 -4 -20 -36 -54 -77 -106 -132 -139 -127 -112 -106 -105 -96 -77 -59 -48 -44 -43 -45 -56 -80 -115 -146 -163 -163 -155 -142 -124 -105 -96 -99 -103 -101 -103 -113 -120 -110 -84 -62 -50 -42 -33 -27 -29 -31
3798 -31 -22 -1 17 20 1 -35 -75 -105 -121 -125 -121 -110 -97 -90 -94 -104 -113 -124 -132 -132 -119 -102 -99 -109 -116 -101 -70 -47 -47 -64 -80 -83 -80 -76 -78 -86 -101 -121 -137 -142 -139 -139 -140 -139 -135 -130 -122 -112
3792 -112 -107 -114 -129 -136 -128 -111 -95 -85 -81 -82 -87 -88 -87 -90 -94 -84 -51 -16 -3 -12 -24 -31 -42 -62 -78 -78 -66 -56 -58 -72 -92 -110 -118 -119 -119 -123 -128 -132 -137 -142 -138 -120 -95 -81 -82 -88 -85 -75
3786 -75 -65 -60 -55 -44 -26 0 27 47 51 39 19 0 -21 -45 -63 -65 -50 -36 -39 -56 -77 -95 -107 -111 -104 -93 -86 -80 -70 -64 -75 -107 -140 -156 -153 -144 -138 -132 -124 -111 -91 -68 -48
3781 -48 -32 -13 10 28 24 1 -20 -30 -31 -34 -40 -40 -33 -28 -36 -54 -71 -79 -75 -62 -43 -26 -20 -32 -54 -69 -66 -58 -62 -84 -110 -120 -109 -87 -66 -48 -28 -6 5 -4 -39 -77 -94
3776 -94 -84 -63 -47 -42 -40 -34 -30 -35 -51 -76 -104 -124 -126 -108 -78 -60 -61 -69 -65 -46 -33 -44 -69 -89 -93 -87 -79 -69 -53 -35 -24 -29 -51 -77 -95 -102 -104 -108 -109 -105 -103 -108 -116 -116 -112 -110 -112 -108
3770 -108 -98 -97 -114 -134 -136 -121 -105 -94 -78 -52 -26 -8 10 39 69 79 59 23 -3 -15 -17 -19 -29 -47 -66 -79 -88 -98 -116 -136 -140 -118 -83 -58 -64 -100 -143 -167
3765 -167 -163 -144 -126 -113 -99 -79 -63 -58 -65 -80 -106 -136 -161 -169 -167 -161 -154 -140 -122 -111 -116 -128 -132 -121 -102 -91 -97 -117 -137 -154 -171 -191 -205 -202 -187 -172 -157 -134 -105 -90
3760 -90 -102 -128 -143 -139 -129 -128 -131 -121 -98 -76 -75 -94 -112 -118 -118 -127 -143 -149 -138 -118 -101 -93 -93 -98 -104 -108 -110 -114 -119 -119 -113 -110 -118 -133 -146 -150 -142 -124 -100 -81 -75 -76 -73 -60 -51 -61 -96 -145
3755 -145 -191 -216 -212 -190 -166 -150 -138 -129 -122 -124 -133 -143 -142 -125 -100 -84 -85 -94 -94 -83 -73 -72 -79 -92 -114 -145 -171 -176 -160 -141 -132 -125 -109 -80 -53 -41 -49 -70 -95 -117 -131 -136 -136
3749 -136 -140 -149 -156 -147 -115 -75 -49 -53 -78 -100 -103 -98 -102 -117 -127 -122 -113 -108 -101 -77 -44 -27 -40 -71 -95 -103 -102 -103 -105 -105 -101 -97 -96 -95 -88 -77 -68 -62 -53 -36 -16 -11 -28 -56 -80 -91 -94 -98 -107
3743 -107 -119 -123 -109 -81 -51 -36 -40 -57 -72 -82 -94 -114 -134 -140 -128 -111 -106 -110 -114 -113 -116 -127 -141 -153 -163 -169 -162 -146 -128 -117 -110 -103 -97 -95 -96 -100 -109 -125 -140 -147 -147 -147 -145 -139 -129 -118
3738 -118 -109 -106 -105 -103 -100 -102 -110 -114 -101 -72 -47 -35 -31 -28 -32 -52 -80 -102 -113 -118 -111 -82 -40 -9 -1 -7 -8 -5 -6 -17 -31 -41 -45 -46 -49 -51 -52 -55 -64 -78 -88 -90 -95 -109 -120 -110 -85 -66
3732 -66 -64 -62 -46 -27 -29 -50 -71 -82 -95 -121 -143 -138 -105 -70 -57 -63 -66 -55 -40 -34 -40 -50 -60 -72 -87 -103 -117 -125 -124 -118 -116 -129 -148 -163 -172 -183 -203 -220 -224 -219 -215 -212 -205 -189
3726 -189 -172 -162 -164 -171 -170 -149 -111 -75 -56 -56 -64 -68 -65 -60 -55 -54 -55 -56 -53 -49 -51 -67 -94 -123 -141 -145 -140 -131 -123 -119 -120 -125 -134 -139 -133 -119 -105 -102 -113 -129 -138 -134 -123 -118 -121 -127 -123 -110 -97 -96 -110
3720 -110 -132 -153 -172 -186 -186 -173 -158 -158 -171 -182 -188 -199 -218 -223 -197 -160 -144 -155 -163 -150 -133 -129 -135 -140 -147 -166 -184 -183 -159 -130 -108 -92 -80 -74 -71 -64 -49 -32 -25 -36 -66 -105
3715 -105 -131 -132 -113 -92 -80 -76 -84 -106 -137 -163 -181 -197 -208 -204 -176 -134 -90 -50 -24 -20 -39 -65 -80 -81 -78 -82 -94 -104 -102 -92 -87 -102 -130 -153 -158 -148 -131 -114 -99 -89
3710 -89 -85 -87 -97 -121 -151 -176 -190 -193 -188 -170 -145 -135 -147 -166 -170 -160 -150 -141 -120 -83 -42 -17 -13 -28 -57 -89 -118 -138 -142 -123 -84 -44 -25 -28 -40 -44 -41 -35 -32 -35 -46 -60
3705 -60 -66 -58 -42 -22 -1 14 14 0 -16 -29 -44 -64 -85 -102 -114 -122 -125 -120 -113 -106 -96 -80 -63 -55 -56 -63 -75 -91 -102 -97 -79 -58 -47 -49 -59 -68 -63 -42 -17 0 8 12 6 -19
3700 -19 -58 -90 -99 -93 -85 -80 -75 -70 -65 -57 -42 -19 1 15 24 32 38 40 35 25 8 -13 -40 -68 -90 -101 -100 -82 -48 -4 33 44 24 -14 -49 -62 -56 -47 -44 -45 -40 -22 -2 5 -3 -21
3694 -21 -38 -49 -55 -55 -47 -32 -11 11 28 29 10 -26 -66 -94 -100 -88 -74 -73 -84 -95 -93 -86 -90 -106 -120 -118 -98 -71 -48 -40 -55 -90 -134 -169 -185 -180 -158 -129 -108 -112 -134 -150
3689 -150 -141 -115 -100 -106 -116 -109 -87 -66 -55 -48 -41 -36 -36 -42 -53 -70 -84 -84 -66 -44 -34 -39 -54 -69 -76 -69 -51 -33 -26 -31 -43 -57 -74 -87 -89 -84 -79 -81 -86 -92 -105 -123 -134 -124 -98
3683 -98 -69 -49 -38 -33 -34 -41 -48 -48 -39 -27 -20 -20 -25 -36 -52 -65 -61 -33 4 29 23 -6 -35 -47 -43 -39 -43 -50 -50 -48 -57 -78 -95 -93 -74 -54 -43 -38 -30 -19 -14 -23 -48 -78 -100 -107 -106 -107
3678 -107 -117 -132 -146 -157 -163 -156 -135 -105 -80 -66 -61 -57 -53 -49 -50 -60 -78 -104 -130 -144 -134 -101 -62 -39 -39 -45 -41 -32 -36 -57 -77 -81 -72 -69 -75 -80 -73 -55 -34 -15 0 11 16 14 4
3672 4 -13 -38 -65 -91 -113 -128 -125 -100 -62 -31 -17 -14 -11 -12 -25 -53 -85 -109 -121 -116 -92 -59 -33 -23 -22 -23 -24 -30 -45 -69 -100 -127 -137 -128 -115 -107 -103 -100 -105 -124 -146 -155 -151 -147
3667 -147 -148 -145 -137 -133 -134 -127 -106 -84 -80 -94 -112 -123 -126 -121 -105 -81 -59 -52 -55 -55 -41 -16 3 6 -4 -22 -37 -49 -51 -39 -18 -2 0 -5 -4 0 6 16 36 55 56 33 1 -23 -35
3661 -35 -42 -53 -64 -66 -46 -13 8 0 -31 -55 -58 -50 -48 -53 -56 -56 -55 -54 -58 -73 -100 -127 -140 -139 -137 -138 -132 -111 -82 -57 -45 -47 -59 -72 -74 -61 -45 -41 -52 -65 -70 -68 -68 -68 -69 -72 -84 -101
3655 -101 -113 -115 -114 -113 -103 -78 -51 -35 -28 -22 -19 -23 -31 -28 -14 -2 -1 -6 -13 -23 -35 -37 -28 -26 -45 -76 -97 -103 -106 -112 -110 -88 -46 3 43 57 42 18 5 6 5 -7 -23 -37 -57
3650 -57 -89 -121 -135 -130 -122 -124 -134 -146 -154 -154 -143 -120 -90 -57 -25 -1 6 -8 -48 -102 -146 -162 -151 -131 -120 -118 -121 -128 -139 -141 -120 -79 -39 -17 -11 -11 -16 -34 -61 -78 -65 -24
3645 -24 20 43 42 33 30 29 20 1 -21 -37 -40 -36 -39 -52 -68 -73 -68 -64 -65 -61 -51 -46 -61 -87 -109 -121 -130 -134 -123 -95 -68 -59 -64 -70 -69 -65 -65 -70 -75 -78 -76 -74 -74 -68 -46 -13 7 -1 -34 -67
3639 -67 -81 -77 -66 -63 -73 -86 -92 -82 -61 -35 -6 23 44 49 42 37 41 43 29 -1 -31 -41 -28 -12 -16 -37 -52 -46 -28 -20 -26 -32 -25 -12 -1 9 23 32 25 0 -32 -58 -66 -52
3633 -52 -26 -8 -14 -38 -62 -80 -95 -110 -118 -114 -105 -95 -87 -77 -67 -58 -43 -24 -9 -11 -25 -38 -41 -37 -36 -40 -48 -60 -71 -75 -66 -48 -31 -20 -14 -9 -7 -12 -22 -32 -37 -37 -34 -32 -33 -41 -55
3627 -55 -63 -57 -44 -40 -51 -68 -77 -77 -74 -66 -52 -40 -43 -60 -72 -66 -50 -41 -45 -54 -67 -81 -89 -81 -56 -21 12 35 38 15 -21 -50 -52 -34 -13 -1 0 -6 -20 -38 -50 -51 -45 -38 -37 -36 -28
3622 -28 -7 16 30 23 0 -22 -31 -24 -11 -2 0 -1 -1 -5 -16 -29 -39 -44 -44 -35 -14 8 16 8 -2 -4 -3 -9 -26 -48 -73 -100 -121 -123 -104 -76 -51 -33 -23 -25 -37 -44 -35 -16 -2
3616 -2 -2 -15 -33 -49 -55 -46 -26 -10 -9 -25 -49 -73 -93 -109 -114 -106 -85 -63 -54 -67 -91 -105 -94 -68 -50 -54 -71 -84 -82 -67 -43 -19 -6 -16 -49 -91 -125 -141 -143 -137 -123
3611 -123 -105 -91 -84 -89 -106 -132 -157 -171 -175 -184 -208 -236 -246 -229 -193 -154 -125 -109 -99 -82 -53 -26 -21 -39 -61 -71 -71 -63 -43 -4 35 54 47 35 31 31 24 13 6 1 -7 -19
3606 -19 -28 -36 -50 -74 -105 -137 -161 -175 -182 -186 -184 -164 -127 -92 -79 -85 -94 -99 -102 -99 -76 -36 -1 14 21 32 38 21 -11 -37 -44 -42 -41 -35 -20 -5 -4 -12 -19 -22 -31 -50 -69 -78 -77 -71 -66 -64
3600 -64 -66 -69 -70 -66 -55 -42 -28 -12 2 10 10 7 5 1 -15 -40 -58 -58 -46 -38 -39 -42 -44 -50 -63 -72 -70 -59 -51 -51 -59 -67 -66 -50 -25 -4 3 3 5 8 8 9 20 40 62 76 80 74 56 29
3594 29 8 5 16 21 10 -11 -32 -47 -63 -81 -96 -101 -94 -88 -91 -101 -109 -106 -93 -75 -63 -64 -76 -94 -106 -109 -104 -92 -76 -57 -37 -17 4 29 53 73 86 83 62 29 -1
3589 -1 -26 -42 -47 -34 -8 8 6 -4 -4 7 16 21 32 55 76 85 85 83 80 78 81 88 87 71 47 28 11 -7 -21 -21 -14 -18 -37 -56 -62 -56 -39 -5 39 73 83 75 70 72 70 52 21
3583 21 -8 -24 -24 -16 -7 0 12 29 43 46 40 33 28 25 19 11 -4 -28 -56 -76 -85 -92 -100 -104 -98 -78 -46 -13 6 8 0 -1 7 17 19 13 0 -19 -42 -57 -56 -43 -33 -36 -49 -64 -71 -66
3577 -66 -56 -48 -46 -43 -32 -20 -14 -9 2 21 32 31 29 40 61 76 73 55 29 -1 -33 -61 -84 -105 -130 -150 -156 -148 -140 -140 -139 -125 -93 -55 -25 -10 -11 -21 -28 -24 -8 7 13 4
3572 4 -11 -22 -20 -6 12 26 34 38 42 45 44 41 35 31 33 43 59 71 71 64 64 78 99 107 92 64 44 45 66 91 106 103 87 67 50 36 15 -15 -47 -62 -51 -28 -14 -21
3567 -21 -39 -50 -47 -35 -21 -12 -9 -7 -2 9 25 39 54 69 81 80 69 64 75 90 91 80 78 86 84 56 16 -9 -18 -24 -35 -44 -47 -49 -51 -45 -33 -30 -43 -60 -64 -53 -45 -45 -46 -41 -33 -30
3561 -30 -33 -37 -41 -44 -53 -69 -84 -86 -65 -28 11 36 35 7 -29 -54 -56 -43 -32 -22 -8 8 11 -3 -20 -25 -19 -14 -16 -18 -20 -23 -26 -18 2 29 50 63 72 77 77 69 60 57 60 62 57 52 53 52
3555 52 39 21 16 32 52 55 42 25 19 19 18 11 1 -12 -30 -50 -66 -68 -52 -29 -15 -14 -15 -7 6 18 28 35 31 16 -2 -10 -7 -1 6 22 34 25 -1 -25 -30 -25 -23 -18 3 39
3549 39 66 73 69 63 53 34 13 8 22 42 45 26 0 -15 -13 -3 4 10 17 16 6 -3 3 23 41 50 55 61 57 37 8 -10 -7 8 26 34 34 33 35 41 42 35 27 21 14 -2 -21 -26 -15
3543 -15 1 10 11 15 29 52 72 83 85 86 89 91 81 64 52 53 59 60 53 49 51 54 53 47 37 22 4 -13 -26 -33 -40 -55 -76 -94 -96 -82 -60 -41 -26 -11 8 34 61 83 94
3538 94 95 97 106 115 114 102 89 78 67 52 37 31 39 52 55 36 0 -32 -41 -31 -21 -21 -23 -17 -4 6 17 31 44 50 51 54 58 57 50 48 56 64 61 54 58 79 111 143 170 187 188 173
3532 173 151 130 113 97 83 76 81 94 109 122 127 119 99 73 52 36 20 4 -6 -4 7 22 39 58 78 90 86 72 57 52 58 72 86 92 92 93 100 107 101 77 45 20
3527 20 10 10 14 25 49 84 114 127 127 127 137 152 162 167 171 172 165 150 137 127 116 99 83 81 92 106 114 116 111 99 84 77 84 92 88 71 56 50 58 88 142 200 229 210
3521 210 163 121 100 93 95 107 121 125 117 106 97 85 72 72 95 130 149 143 127 123 133 146 159 177 201 222 229 226 224 220 207 185 165 159 162 165 164 158 146 129 119 119 120 110
3516 110 96 95 106 108 92 75 78 102 125 137 144 155 170 181 188 190 187 178 165 155 153 161 169 164 145 125 118 125 138 147 153 158 159 154 143 132 127 128 134 146 163 184 203 217 226 233 236
3510 236 237 241 252 267 278 282 285 287 281 270 267 273 276 272 273 293 321 329 312 294 295 310 320 317 310 307 306 296 276 255 250 264 279 281 269 258 253 254 265 298 344 373 369 346 329 325
3504 325 325 328 339 352 355 348 347 362 380 388 385 380 373 363 353 352 359 367 373 378 384 387 385 382 380 378 371 360 352 355 366 379 389 396 400 399 395 392 391 390 391 399 419 447 473 491 500 502 498 491 485 480 476 482 502
3498 502 529 544 541 530 524 522 514 497 476 462 462 480 509 529 532 527 527 531 524 502 481 473 475 478 487 508 534 548 542 525 514 513 521 532 545 553 553 542 522 500 479 461 445 431
3492 431 425 435 461 492 507 500 486 486 507 534 546 536 513 494 486 484 484 485 488 495 498 495 487 481 482 483 478 469 464 472 491 510 518 505 470 427 398 394 408 416 408 390 373 363 357 356 368
3487 368 393 418 432 429 418 410 410 425 453 484 505 506 490 469 451 441 436 431 427 428 444 467 471 442 390 346 329 338 363 392 415 423 418 415 422 430 427 411 400 400 408 414 417 417 410 395
3481 395 371 339 308 290 295 318 341 351 350 348 344 335 324 319 321 320 313 308 313 321 321 313 305 301 295 283 268 256 244 228 213 213 233 255 264 262 262 265 260 246 237 245 260 262 250 238 236 241 239
3475 239 224 199 171 147 128 114 106 106 117 139 171 204 227 240 253 272 291 299 295 285 276 258 231 202 182 166 151 143 152 176 195 202 202 204 205 203 206 219 236 247 250 246
3470 246 229 190 141 106 100 110 113 101 86 85 101 124 144 158 164 161 144 122 109 109 118 126 130 129 121 106 91 81 77 75 76 83 93 100 100 105 121 143 157 162 169 187 204 200 172
3464 172 138 119 118 125 130 131 127 120 112 105 101 102 111 129 143 147 144 144 143 123 75 16 -24 -36 -34 -34 -41 -44 -38 -24 -8 5 19 37 58 76 87 93 100 115 135 154 163 163 167 179 190
3459 190 184 164 151 153 159 153 138 126 118 111 104 101 99 95 94 106 122 127 116 101 95 93 89 87 97 123 155 183 199 200 193 185 179 170 154 137 124 114 104 95 93 99 107 106 92 71 56 53
3453 53 53 51 51 66 91 106 99 78 66 76 102 124 134 139 152 173 181 160 121 93 90 102 110 108 98 81 59 42 35 35 35 41 62 97 134 160 169 163 146 127 116 115 124 134
3447 134 134 111 72 46 48 67 74 62 49 49 57 64 63 52 32 12 9 23 38 38 29 20 14 4 -10 -27 -43 -56 -58 -42 -13 15 35 44 47 45 36 19 0 -8 -5 0 -4 -13 -13 4
3442 4 30 46 44 31 18 12 10 5 -9 -26 -29 -15 -3 -8 -24 -28 -14 1 6 4 12 32 57 78 91 99 106 115 118 110 91 75 74 85 97 100 95 86 78 75 81 95 110 117 115 107 99 91 81
3436 81 70 61 54 46 38 35 37 37 24 2 -21 -38 -44 -39 -23 -1 19 33 41 48 54 58 62 67 75 80 77 63 43 28 24 25 21 6 -10 -15 -2 20 40 53 63 74 80 76 67 64 73 83 87
3430 87 87 88 82 60 25 -12 -38 -47 -36 -7 29 59 76 83 82 71 53 43 50 73 99 121 133 131 115 92 70 55 50 55 67 72 65 57 60 69 70 62 57 64 78 93 109 127 141
3424 141 144 139 125 99 58 14 -18 -37 -49 -56 -51 -31 -6 12 27 41 54 65 70 65 45 20 14 39 78 106 110 105 104 104 94 76 59 51 52 59 63 55 33 8 -9 -20 -37
3419 -37 -64 -87 -92 -82 -71 -62 -49 -26 -3 7 4 0 2 18 42 67 82 81 71 65 72 85 94 96 99 101 94 75 58 55 66 72 60 30 -2 -24 -23 -2 22 31 21 6 4 20
3414 20 39 50 52 50 50 54 63 73 79 76 69 63 57 50 41 39 48 59 66 72 85 100 103 88 75 82 107 124 110 76 42 19 -3 -32 -59 -70 -62 -46 -35 -32 -35 -33 -19 10 43 67
3408 67 79 87 94 92 80 67 61 59 56 50 47 49 60 83 118 145 146 125 105 95 85 66 50 53 66 67 54 47 55 67 71 70 74 85 98 103 99 88 75 62 47 26 3 -12 -16
3402 -16 -8 7 26 34 25 3 -16 -23 -15 -3 1 -9 -30 -45 -40 -21 -7 -6 -8 -3 12 36 67 97 112 112 107 99 76 33 -12 -40 -52 -65 -79 -79 -57 -23 8 33 53 65
3397 65 66 61 62 73 91 102 96 74 50 44 53 62 59 49 47 61 80 89 88 85 90 100 103 98 95 104 117 121 113 107 115 132 142 132 105 77 61 60 62 61 58 62 69 73 69 62 54 46 35 26 21 23 31
3391 31 40 44 37 27 24 33 44 50 48 42 34 30 35 48 59 65 73 93 120 140 144 130 101 64 30 6 -16 -47 -75 -81 -60 -33 -15 -2 18 44 61 66 67 69 66 57 42 30 20
3385 20 14 8 3 -4 -9 -4 15 45 74 98 121 145 163 167 155 136 117 101 91 86 87 88 87 82 78 82 94 107 123 145 169 180 167 136 107 87 64 33 5 -7 -13 -25 -44
3380 -44 -47 -21 19 53 69 70 66 65 71 80 81 73 65 70 90 112 123 115 93 67 47 40 44 51 56 60 67 80 94 97 92 90 99 106 91 58 34 40 72 108 134 148 153 150 146 144 144 145 146 143 134
3374 134 123 123 135 145 140 127 115 108 99 93 98 105 101 86 73 69 69 74 91 116 133 131 116 96 73 53 47 55 61 47 23 7 7 7 -1 -10 -4 17 45 68 77 76 68 58 45 27
3368 27 9 -2 -6 -8 -11 -16 -18 -15 -7 6 24 45 66 87 107 131 159 179 176 150 119 100 101 112 127 136 130 106 78 64 69 79 81 76 76 85 100 116 128 135 137 142 149 156 156 151 150
3362 150 155 157 146 120 91 72 68 72 80 88 101 117 131 141 148 156 164 166 161 159 160 156 133 91 51 35 49 78 101 107 96 75 53 39 37 40 39 34 35 45 56 60 55 48 44 46 49 47
3357 47 34 14 0 0 4 7 15 37 68 88 91 86 78 63 43 33 45 67 77 76 81 102 120 118 101 90 93 102 103 91 71 50 37 32 36 46 60 67 58 38 24 26 38 48
3351 48 51 51 47 31 6 -17 -29 -29 -16 6 37 69 94 106 101 87 82 93 111 121 124 126 127 120 108 102 109 124 142 166 189 200 191 172 156 150 156 176 196 192 158 122 113 130
3346 130 147 151 147 143 137 127 114 103 98 104 123 145 158 161 159 157 152 146 151 167 187 208 229 245 247 232 215 205 200 196 195 196 188 172 163 171 186 187 170 147 132 132 151 180 199 196
3340 196 187 192 209 214 197 171 152 136 117 101 98 109 124 141 159 174 186 197 212 229 239 237 229 221 216 208 191 170 158 160 162 148 118 92 88 101 112 114 111 113 121 133 141
3335 141 141 142 158 191 220 224 204 184 180 182 174 154 135 126 120 113 104 94 80 63 55 68 97 119 121 113 112 125 136 136 128 117 98 64 26 2 0 10 22 41 69 102 129
3330 129 141 137 118 90 66 55 49 40 35 46 71 93 101 103 113 123 127 132 150 181 206 216 219 228 245 265 285 296 289 263 231 207 195 191 194 200 205 204 199 193 185 174 160 144
3324 144 125 105 93 97 114 132 147 158 164 160 150 144 145 149 149 147 148 153 164 184 212 236 247 241 225 202 179 163 161 175 195 206 198 171 137 113 107 114 127 145 170 199
3319 199 225 242 248 245 239 233 228 222 217 222 237 253 263 268 270 260 232 198 182 193 220 246 266 278 283 283 287 297 309 313 315 327 347 361 359 350 345 346 346 349 359 379 401 416 424 429
3314 429 442 466 497 523 534 530 526 532 543 553 565 593 635 671 682 676 673 674 664 635 606 601 619 643 659 671 685 698 697 676 641 602 573 567 589 629 665 681 676 663
3309 663 653 644 628 601 563 516 465 418 386 373 376 389 403 415 424 441 468 496 511 517 529 550 562 549 518 495 491 501 524 558 593 620 644 676 714 741 750 754
3304 754 766 781 788 791 797 802 795 780 773 783 804 829 849 858 855 848 848 858 866 864 853 835 810 783 762 758 772 796 815 821 814 807 804 802 792 782 791 825 865 886 879 858 838 826 821
3299 821 817 810 801 794 792 793 797 802 807 809 811 814 816 808 790 773 766 765 760 749 735 719 701 682 670 667 675 692 712 724 719 702 684 665 636 598 562 541 535 534 533 538 554 580 608 629 642
3293 642 652 666 683 696 703 702 700 702 716 751 799 844 879 912 955 996 1009 989 955 933 929 932 929 923 916 908 894 873 852 836 823 806 775 736 707 699 706 708 695 676 660
3288 660 648 636 629 628 628 623 623 645 680 705 707 702 709 722 724 714 704 701 697 694 697 703 700 681 659 645 639 641 658 690 717 721 705 690 688 693 700 706 709 704 696 702 729 763 788 792 780 759
3282 759 740 726 710 682 647 623 622 634 640 631 617 607 606 622 656 697 727 738 743 754 773 792 810 825 831 827 821 825 840 853 854 846 836 824 816 820 843 877 904 914 915 919
3277 919 938 970 1003 1020 1019 1014 1018 1032 1048 1065 1087 1114 1139 1165 1202 1247 1283 1297 1299 1306 1320 1329 1327 1326 1339 1367 1403 1440 1476 1514 1559 1607 1649 1682 1715 1760 1813 1865 1912
3272 1912 1958 2008 2067 2136 2210 2276 2331 2396 2492 2616 2738 2846 2954 3082 3229 3384 3544 3710 3880 4060 4266 4509 4775 5044 5318 5622
3269 5622 5969 6349 6753 7182 7640 8125 8639 9190 9778 10385 10996 11623 12292 13005 13740 14472 15191 15890 16554 17167 17719 18211 18641
3266 18641 19016 19350 19641 19867 20000 20028 19961 19804 19544 19173 18706 18179 17625 17064 16502 15937 15368 14799 14237 13697 13186 12711 12278
3263 12278 11889 11536 11202 10869 10536 10219 9938 9698 9499 9343 9240 9194 9193 9220 9269 9348 9460 9593 9739 9905 10107 10352 10639 10969 11344
3260 11344 11756 12194 12657 13154 13691 14258 14845 15455 16097 16772 17466 18161 18844 19507 20138 20728 21277 21785 22250 22657 22983 23215 23353
3257 23353 23399 23345 23184 22923 22582 22172 21689 21125 20488 19794 19059 18295 17517 16752 16026 15359 14753 14196 13674 13180 12708 12244 11780
3255 11780 11323 10893 10496 10120 9749 9386 9045 8734 8451 8188 7936 7687 7441 7209 6996 6795 6604 6436 6303 6195 6096 6000 5920 5863
3252 5863 5819 5779 5739 5695 5646 5600 5570 5561 5560 5553 5542 5536 5538 5545 5562 5589 5616 5630 5631 5635 5655 5692 5738 5782 5818 5850 5890 5941 5991 6021 6025 6014 5995 5969 5929 5874 5813 5756 5706
3247 5706 5655 5592 5506 5400 5278 5147 5009 4872 4739 4610 4485 4364 4253 4150 4049 3950 3861 3788 3727 3666 3598 3526 3458 3403 3357 3315 3273 3240
3243 3240 3225 3226 3227 3217 3194 3169 3149 3144 3160 3195 3226 3234 3220 3205 3206 3218 3222 3208 3180 3152 3138 3139 3143 3142 3135 3125 3109 3078 3035 2988 2939 2877 2796 2706 2629 2578 2548 2527 2505
3239 2505 2472 2429 2383 2345 2313 2275 2226 2173 2127 2092 2061 2029 1996 1965 1945 1933 1922 1904 1885 1870 1857 1840 1820 1804 1790 1773 1758 1752 1755 1751 1728 1696 1678 1683 1705 1727
3234 1727 1742 1750 1756 1756 1745 1727 1715 1722 1738 1740 1716 1683 1660 1657 1667 1683 1703 1728 1750 1761 1754 1731 1704 1693 1705 1730 1755 1773 1784 1785 1777 1769 1768 1763 1741 1707 1679 1673 1686 1701 1704
3229 1704 1686 1658 1641 1649 1669 1682 1687 1692 1699 1698 1690 1686 1699 1726 1763 1802 1828 1823 1793 1761 1745 1748 1770 1822 1897 1965 1996 1996 1995 2011 2038 2062 2077 2087 2097 2114 2134 2142 2133 2125 2138
3224 2138 2171 2207 2240 2279 2325 2371 2413 2450 2481 2499 2514 2542 2588 2635 2665 2687 2712 2737 2741 2714 2668 2628 2609 2607 2605 2591 2562 2523 2481 2442 2406 2364 2310 2249 2200 2177
3220 2177 2174 2181 2194 2213 2230 2236 2235 2241 2256 2271 2284 2303 2328 2352 2370 2385 2404 2423 2446 2488 2551 2616 2661 2687 2710 2741 2774 2805 2839 2883 2936 2997 3063 3132 3198 3264 3334
3215 3334 3411 3492 3568 3636 3689 3724 3745 3763 3784 3800 3796 3771 3739 3710 3681 3639 3572 3480 3374 3272 3188 3123 3065 3005 2948 2904 2876 2856 2837 2825 2823 2827 2829 2827 2817 2798
3211 2798 2774 2759 2767 2795 2827 2861 2898 2929 2940 2929 2915 2913 2916 2911 2902 2903 2921 2945 2965 2982 3001 3022 3040 3054 3064 3080 3107 3143 3180 3209 3226 3233 3237 3250 3281 3327 3370 3400
3206 3400 3422 3441 3456 3466 3480 3508 3550 3599 3651 3707 3759 3799 3825 3843 3858 3872 3890 3914 3943 3971 3996 4025 4058 4090 4118 4144 4168 4188 4198 4195 4176 4154 4150 4179 4233
3202 4233 4285 4320 4339 4352 4370 4402 4449 4498 4529 4538 4545 4566 4597 4627 4652 4678 4710 4745 4788 4843 4911 4981 5044 5100 5153 5201 5247 5299 5367 5448 5524 5582 5632 5690 5760
3198 5760 5828 5888 5949 6020 6094 6159 6211 6256 6304 6360 6429 6513 6604 6690 6759 6810 6851 6896 6953 7020 7084 7139 7194 7255 7317 7370 7426 7495 7571 7637 7695 7761 7844 7931
3194 7931 8016 8105 8201 8299 8402 8524 8676 8841 8998 9142 9280 9408 9524 9634 9757 9896 10043 10191 10344 10503 10664 10825 10997 11190
3191 11190 11402 11632 11876 12130 12387 12641 12893 13150 13420 13709 14020 14348 14685 15019 15346 15674 16018 16380 16746 17109 17476 17870 18296
3188 18296 18743 19194 19655 20143 20676 21262 21909 22614 23362 24142 24954 25808 26711 27670 28693 29787 30949 32175 33482 34897 36437
3185 36437 38100 39882 41796 43865 46107 48531 51145 53953 56969 60213 63713 67489 71545 75866 80442 85282 90410
3183 90410 95846 101595 107640 113961 120528 127287 134155 141031 147812 154397 160680 166563 171969 176855 181200 184998 188241
3181 188241 190903 192934 194253 194764 194374 193027 190734 187576 183679 179196 174303 169189 164033 158975 154118 149549 145330
3179 145330 141491 138026 134928 132193 129812 127769 126063 124722 123789 123302 123299 123815 124870 126471 128625 131355 134679 138603
3177 138603 143127 148268 154052 160498 167613 175396 183842 192928 202613 212830 223480 234438 245564 256727 267807
3175 267807 278688 289265 299471 309279 318666 327594 335998 343793 350856 357033 362152 366064 368679 369963 369929 368612 366071
3173 366071 362397 357706 352127 345787 338801 331270 323272 314856 306060 296947 287616 278213 268919 259943 251497 243766 236894
3171 236894 230988 226114 222293 219510 217740 216957 217120 218167 220017 222587 225790 229529 233710 238253 243083 248122 253297
3169 253297 258553 263861 269191 274503 279733 284806 289620 294067 298044 301482 304346 306634 308370 309601 310385 310763 310752 310355
3166 310355 309555 308306 306526 304117 301007 297155 292550 287191 281090 274275 266794 258701 250057 240942 231484 221861 212285
3164 212285 202959 194057 185716 178039 171098 164933 159550 154929 151031 147812 145241 143291 141918 141060 140656 140673 141095 141898
3162 141898 143043 144496 146239 148256 150527 153022 155709 158546 161481 164453 167392 170220 172860 175238 177283 178902 179989
3160 179989 180444 180213 179280 177646 175322 172327 168696 164456 159624 154221 148307 141986 135390 128658 121918 115297 108911 102854
3158 102854 97180 91909 87041 82565 78459 74678 71174 67912 64870 62027 59352 56822 54429 52171 50039 48018 46102
3156 46102 44298 42616 41055 39602 38235 36938 35701 34523 33407 32355 31361 30411 29498 28625 27802 27029 26294 25585 24902
3154 24902 24246 23616 23014 22441 21891 21358 20844 20358 19902 19462 19031 18622 18254 17925 17619 17326 17047 16776 16501 16220 15950 15703 15475
3151 15475 15262 15064 14880 14701 14521 14349 14200 14081 13980 13886 13791 13695 13603 13520 13449 13381 13306 13223 13141 13069 13007 12951 12890 12818 12732 12634 12530 12422
3147 12422 12311 12195 12071 11939 11808 11684 11557 11409 11236 11055 10883 10722 10566 10414 10271 10140 10014 9894 9784 9689 9611 9546 9485 9420
3144 9420 9344 9265 9189 9118 9048 8983 8933 8900 8870 8831 8786 8748 8721 8695 8658 8612 8563 8512 8458 8405 8368 8354 8354 8349 8328 8298 8268 8242 8215 8195 8192 8211 8241 8268 8285 8297
3140 8297 8311 8331 8359 8391 8423 8447 8460 8464 8462 8455 8447 8440 8443 8458 8481 8503 8523 8543 8569 8604 8642 8676 8702 8724 8756 8810 8883 8964 9048 9139 9242 9357 9476 9590 9695
3136 9695 9798 9918 10069 10243 10415 10576 10734 10907 11101 11314 11544 11791 12047 12301 12553 12816 13099 13406 13737 14090 14461 14851 15277
3133 15277 15759 16292 16853 17425 18014 18638 19304 20006 20743 21527 22371 23280 24250 25282 26394 27610 28944 30401 31987 33717
3130 33717 35615 37700 39996 42539 45367 48516 52015 55904 60234 65061 70434 76407 83025 90315 98266 106819 115848
3128 115848 125143 134405 143278 151369 158278 163617 167039 168286 167230 163917 158588 151664 143662 135094 126390 117874 109767
3126 109767 102202 95244 88908 83186 78066 73526 69537 66063 63063 60501 58332 56511 54996 53760 52788 52060 51549 51238
3124 51238 51126 51221 51527 52039 52748 53653 54764 56105 57703 59579 61750 64237 67069 70284 73923 78046 82724 88035 94050
3122 94050 100839 108475 117028 126561 137115 148687 161186 174407 188028 201609 214599 226379 236324 243858 248467
3120 248467 249737 247447 241680 232849 221621 208775 195077 181196 167634 154715 142610 131385 121057 111616 103045
3118 103045 95307 88346 82095 76490 71477 66998 62979 59354 56077 53115 50439 48013 45807 43790 41939 40239 38684
3116 38684 37269 35975 34774 33647 32586 31591 30658 29778 28935 28117 27328 26576 25865 25182 24514 23866 23253 22678 22127 21588 21072
3113 21072 20594 20149 19713 19272 18833 18416 18031 17666 17306 16945 16590 16254 15941 15649 15375 15117 14882 14671 14473 14273 14064 13849 13638
3111 13638 13442 13267 13114 12977 12849 12733 12631 12540 12454 12370 12292 12217 12139 12059 11985 11918 11845 11753 11648 11545 11447 11346 11240 11142 11061 10990 10914 10823
3107 10823 10727 10643 10583 10549 10532 10519 10502 10478 10450 10416 10383 10361 10356 10370 10396 10427 10457 10488 10524 10565 10602 10628 10645 10670 10709 10756 10799 10843 10895 10962 11041 11132 11234 11343
3103 11343 11452 11561 11678 11813 11966 12134 12314 12503 12698 12898 13106 13324 13553 13786 14019 14249 14480 14715 14958 15219 15505 15820 16159
3100 16159 16517 16900 17318 17773 18267 18809 19417 20101 20847 21637 22472 23361 24307 25301 26336 27416 28544 29716 30934 32215 33584
3098 33584 35059 36649 38363 40220 42239 44436 46823 49422 52265 55390 58834 62627 66807 71433 76576 82318 88739
3096 88739 95921 103936 112850 122719 133591 145474 158275 171772 185608 199314 212334 224072 233932 241361 245866
3094 245866 247052 244720 238966 230223 219177 206615 193288 179827 166706 154238 142583 131795 121879 112824 104610
3092 104610 97194 90515 84510 79125 74301 69975 66096 62626 59534 56781 54329 52157 50246 48568 47087 45787 44672
3090 44672 43743 42987 42392 41956 41679 41562 41603 41802 42146 42613 43183 43838 44550 45264 45914 46440 46786 46890 46695 46175 45335 44193 42778
3087 42778 41147 39383 37573 35785 34061 32429 30897 29465 28138 26923 25819 24813 23891 23049 22286 21593 20962 20390 19878
3085 19878 19420 19007 18632 18288 17969 17668 17388 17134 16903 16687 16478 16270 16061 15850 15642 15439 15238 15040 14857 14702 14571 14444 14314
3082 14314 14187 14066 13942 13808 13672 13548 13437 13330 13220 13114 13017 12928 12842 12755 12672 12606 12568 12554 12548 12537 12524 12515 12511 12506 12506 12518 12549 12596 12651 12707 12762
3078 12762 12816 12878 12958 13058 13173 13299 13435 13580 13730 13886 14056 14246 14457 14683 14923 15178 15448 15736 16047 16389 16771 17195 17655 18140
3075 18140 18648 19188 19769 20388 21032 21701 22416 23200 24063 24999 26008 27101 28293 29599 31032 32613 34363 36304 38458 40854
3073 40854 43527 46510 49842 53564 57724 62371 67558 73342 79775 86893 94687 103097 111998 121189 130388 139242 147356
3071 147356 154319 159739 163265 164621 163648 160365 154999 147968 139796 130994 121990 113113 104600 96598 89172 82336 76086
3069 76086 70413 65291 60677 56527 52809 49492 46529 43876 41496 39364 37442 35698 34114 32689 31413 30262 29210
3066 29210 28243 27358 26549 25804 25112 24460 23839 23248 22689 22162 21658 21167 20684 20211 19750 19302 18871 18465 18084 17722 17373 17038 16724
3064 16724 16436 16175 15932 15697 15466 15250 15060 14889 14715 14531 14358 14226 14141 14080 14010 13920 13819 13727 13657 13613 13578 13538 13493 13460 13445 13433 13410
3060 13410 13382 13369 13382 13416 13459 13506 13553 13594 13633 13681 13746 13824 13906 13993 14093 14205 14325 14448 14574 14707 14850 15005 15173 15348 15527 15722 15947
3057 15947 16199 16464 16734 17025 17352 17719 18117 18549 19018 19523 20057 20620 21225 21880 22581 23330 24148 25057 26055 27120 28253 29482
3054 29482 30837 32323 33932 35669 37552 39588 41771 44109 46620 49321 52208 55276 58527 61965 65582 69354 73264
3052 73264 77302 81447 85665 89906 94118 98247 102241 106056 109652 112992 116047 118811 121296 123512 125439 127027 128201
3050 128201 128872 128947 128354 127065 125105 122549 119504 116107 112511 108864 105286 101857 98630 95652 92959 90559 88422 86503
3048 86503 84777 83245 81917 80792 79870 79169 78721 78556 78688 79126 79879 80954 82352 84071 86121 88518 91281 94433 97994
3046 97994 101980 106399 111241 116478 122063 127922 133963 140074 146129 151998 157559 162712 167387 171553 175227 178468 181362
3044 181362 183996 186445 188776 191030 193222 195323 197282 199032 200495 201583 202213 202318 201867 200853 199293 197223 194693 191759
3041 191759 188492 184977 181319 177639 174077 170788 167934 165642 164001 163061 162861 163425 164754 166811 169531 172822 176560 180591
3039 180591 184738 188823 192683 196182 199224 201766 203820 205455 206774 207890 208911 209935 211033 212227 213484 214738 215901
3037 215901 216872 217528 217748 217433 216516 214960 212766 209978 206673 202929 198811 194378 189701 184849 179893 174908 169985 165214
3035 165214 160672 156421 152529 149068 146095 143639 141705 140290 139401 139049 139243 139987 141274 143107 145505 148494 152091 156294
3033 156294 161091 166479 172448 178958 185931 193258 200818 208473 216064 223412 230340 236688 242321 247130 251037 254010 256058
3031 256058 257214 257511 256981 255664 253612 250889 247567 243725 239463 234891 230111 225196 220192 215114 209953 204690 199297
3029 199297 193751 188021 182074 175889 169485 162933 156332 149791 143422 137334 131623 126344 121522 117169 113294 109892 106947
3027 106947 104434 102332 100624 99292 98329 97738 97525 97683 98199 99063 100257 101751 103501 105473 107645 109997 112504 115141
3024 115141 117896 120765 123749 126842 130011 133196 136310 139252 141901 144117 145751 146682 146826 146132 144575 142167 138979 135145
3022 135145 130838 126241 121518 116797 112171 107697 103415 99346 95483 91804 88282 84895 81626 78459 75379 72383 69481
3020 69481 66693 64031 61510 59142 56934 54881 52974 51211 49594 48119 46763 45504 44327 43236 42240 41343 40541 39810
3018 39810 39130 38498 37931 37441 37018 36647 36333 36090 35913 35780 35680 35637 35677 35798 35979 36211 36498 36841 37233 37670 38160 38710 39314
3015 39314 39970 40688 41485 42367 43326 44352 45446 46618 47877 49219 50629 52092 53606 55183 56827 58532 60286 62087
3013 62087 63955 65919 68012 70266 72704 75348 78222 81354 84762 88440 92347 96417 100562 104674 108614 112228 115364
3011 115364 117892 119711 120749 120976 120420 119168 117348 115097 112546 109814 107014 104228 101506 98874 96351 93953 91678
3009 91678 89498 87385 85326 83324 81383 79511 77727 76069 74576 73271 72167 71281 70638 70259 70149 70304 70717 71385 72308
3006 72308 73490 74938 76661 78665 80956 83538 86412 89577 93040 96818 100927 105382 110208 115434 121086 127162 133635
3004 133635 140462 147587 154928 162373 169782 176994 183842 190152 195757 200517 204329 207138 208927 209711 209523 208409 206424
3002 206424 203623 200051 195751 190768 185174 179072 172593 165872 159022 152136 145307 138641 132234 126149 120417 115061 110099
3000 110099 105529 101334 97490 93988 90821 87979 85448 83221 81299 79686 78386 77398 76708 76296 76151 76290 76733 77479 78499
2998 78499 79763 81249 82935 84796 86803 88938 91186 93523 95913 98323 100731 103134 105538 107954 110390 112855 115356
2996 115356 117897 120453 122970 125370 127551 129380 130700 131366 131267 130340 128549 125896 122443 118309 113660 108679 103553 98454
2993 98454 93516 88821 84412 80315 76545 73103 69968 67105 64476 62049 59803 57722 55794 54013 52382 50910 49600
2991 49600 48442 47422 46538 45797 45198 44725 44358 44081 43879 43735 43630 43546 43471 43381 43252 43063 42800 42450 42000 41453 40821 40118 39347
2989 39347 38508 37602 36639 35637 34608 33559 32492 31412 30336 29282 28266 27294 26371 25501 24683 23908 23173 22483 21838 21234
2986 21234 20665 20138 19662 19234 18841 18482 18167 17903 17678 17477 17299 17151 17030 16928 16840 16774 16742 16753 16807 16902 17026 17172 17335 17518 17718
2983 17718 17928 18147 18379 18629 18900 19186 19480 19772 20055 20320 20559 20760 20909 20995 21011 20952 20819 20619 20356 20023 19612 19136 18625 18108
2980 18108 17596 17093 16606 16146 15712 15297 14901 14532 14194 13881 13586 13310 13058 12827 12611 12406 12217 12052 11913 11800 11705 11619 11532 11447
2977 11447 11372 11316 11284 11275 11291 11324 11365 11406 11450 11505 11576 11661 11751 11843 11942 12058 12198 12370 12579 12825 13097 13378 13659 13946 14252 14589 14957 15360
2974 15360 15803 16286 16801 17343 17921 18548 19232 19974 20781 21668 22648 23717 24875 26133 27503 28980 30531 32119 33718 35318
2971 35318 36912 38487 40026 41507 42909 44216 45412 46479 47392 48127 48664 48991 49099 48986 48666 48163 47504 46709 45805 44825
2969 44825 43800 42745 41664 40562 39457 38373 37332 36360 35485 34739 34137 33686 33375 33189 33120 33170 33349 33663 34104 34660 35337
2966 35337 36156 37133 38268 39556 41007 42650 44516 46625 48986 51615 54523 57713 61171 64880 68827 72996 77358 81872
2964 81872 86489 91161 95835 100466 105014 109437 113678 117654 121283 124488 127188 129285 130685 131328 131201 130323 128726 126471
2962 126471 123657 120405 116834 113041 109096 105040 100902 96705 92488 88303 84212 80282 76575 73134 69975 67103 64526
2960 64526 62259 60300 58635 57248 56134 55283 54675 54292 54129 54191 54479 54994 55742 56739 57998 59524 61321 63395 65754 68402
2957 68402 71341 74564 78052 81775 85695 89766 93933 98142 102355 106551 110695 114729 118587 122206 125521 128443 130863
2955 130863 132680 133810 134183 133750 132511 130517 127856 124625 120931 116892 112625 108208 103687 99098 94488 89913 85417
2953 85417 81036 76806 72771 68970 65418 62110 59039 56217 53666 51393 49368 47545 45897 44425 43134 42013 41037
2951 41037 40197 39500 38953 38553 38290 38161 38166 38301 38563 38952 39474 40134 40923 41825 42826 43908 45050 46228 47412 48583 49722
2949 49722 50808 51813 52720 53516 54190 54716 55063 55208 55137 54841 54310 53543 52562 51408 50127 48746 47276 45724 44102 42435
2946 42435 40741 39036 37336 35657 34014 32426 30924 29537 28275 27118 26044 25053 24158 23355 22627 21962 21361 20825 20343
2944 20343 19907 19520 19187 18896 18632 18394 18187 18011 17861 17733 17625 17531 17449 17391 17367 17375 17401 17445 17518 17622 17748 17888 18051 18245 18467 18716
2941 18716 18997 19317 19666 20035 20422 20840 21303 21824 22413 23067 23773 24524 25337 26237 27238 28333 29520 30811 32229 33796 35522
2938 35522 37401 39417 41557 43809 46162 48595 51080 53590 56092 58545 60907 63161 65302 67315 69160 70786 72148
2936 72148 73212 73947 74335 74365 74049 73416 72522 71420 70148 68730 67196 65576 63890 62157 60408 58697 57062 55528 54125
2934 54125 52897 51874 51060 50450 50054 49890 49956 50231 50709 51399 52308 53440 54809 56431 58305 60417 62764 65366 68237 71383
2931 71383 74821 78580 82684 87127 91887 96951 102312 107952 113834 119902 126076 132256 138341 144240 149868 155122 159888
2929 159888 164057 167549 170306 172265 173370 173587 172921 171421 169165 166254 162806 158955 154830 150532 146129 141666 137182
2927 137182 132700 128237 123823 119499 115304 111269 107432 103852 100588 97672 95108 92904 91075 89628 88540 87784 87349
2925 87349 87242 87469 88020 88874 90017 91443 93166 95207 97584 100302 103368 106800 110632 114896 119608 124765 130352 136336
2923 136336 142660 149245 155994 162802 169550 176112 182359 188170 193433 198053 201965 205148 207608 209364 210451 210931 210902 210466
2921 210466 209713 208732 207623 206471 205308 204093 202740 201152 199222 196835 193879 190261 185899 180731 174755 168072 160899
2919 160899 153499 146123 138973 132199 125901 120117 114849 110091 105836 102063 98734 95817 93298 91169 89406 87972 86843
2916 86843 86014 85480 85231 85263 85580 86182 87045 88135 89425 90901 92556 94390 96396 98563 100886 103377 106050 108890 111839
2914 111839 114825 117788 120657 123328 125674 127591 129007 129852 130055 129569 128396 126566 124120 121112 117620 113737 109551 105158
2912 105158 100664 96179 91794 87574 83568 79809 76303 73036 69993 67165 64538 62086 59785 57616 55559 53587 51670
2910 51670 49802 47995 46265 44604 42989 41400 39846 38353 36944 35625 34394 33247 32178 31180 30247 29377 28578 27854
2908 27854 27202 26615 26091 25632 25235 24896 24612 24380 24189 24018 23839 23641 23425 23196 22947 22659 22320 21934 21516 21082 20641 20201 19762
2905 19762 19315 18851 18372 17890 17422 16971 16540 16128 15730 15334 14934 14537 14158 13804 13468 13140 12824 12530 12258 11996 11740 11496 11269
2902 11269 11055 10850 10657 10481 10317 10156 9993 9834 9688 9551 9424 9305 9192 9078 8960 8848 8750 8663 8579 8496 8419 8349 8281 8217 8163 8122
2899 8122 8093 8071 8050 8028 8004 7979 7953 7923 7884 7837 7787 7744 7720 7715 7718 7718 7712 7713 7732 7765 7798 7825 7844 7852 7849 7845 7857 7892 7939 7983 8023 8071 8133 8207 8285 8364 8446 8531
2894 8531 8618 8709 8813 8939 9087 9247 9418 9606 9822 10066 10330 10617 10936 11294 11683 12096 12535 13010 13531 14106 14734 15403 16101 16829
2891 16829 17603 18438 19337 20292 21295 22342 23433 24579 25800 27105 28493 29951 31475 33059 34694 36384 38152 40014
2889 40014 41956 43930 45898 47839 49740 51571 53296 54896 56373 57735 58983 60104 61081 61901 62553 63030 63316 63385 63204
2887 63204 62763 62076 61177 60107 58905 57607 56233 54785 53248 51618 49918 48190 46475 44802 43192 41669 40258 38980
2885 38980 37855 36893 36096 35451 34947 34583 34358 34264 34296 34454 34746 35174 35730 36414 37227 38170 39238 40431 41750 43191 44734
2882 44734 46359 48053 49803 51584 53374 55175 57009 58896 60843 62839 64870 66922 68967 70965 72854 74555 75974
2880 75974 77025 77642 77787 77451 76644 75396 73754 71782 69558 67161 64674 62174 59727 57370 55110 52939 50851 48843
2878 48843 46905 45015 43157 41323 39523 37770 36088 34501 33030 31672 30417 29254 28185 27221 26371 25638 25019 24502
2876 24502 24069 23707 23418 23211 23093 23059 23099 23209 23390 23647 23984 24402 24898 25456 26047 26646 27240 27824 28396 28948 29476 29977 30432
2873 30432 30811 31086 31248 31298 31229 31026 30686 30221 29655 29007 28286 27496 26641 25735 24798 23846 22883 21909 20936 19983 19061 18162 17280
2870 17280 16428 15627 14886 14199 13560 12972 12436 11942 11476 11035 10618 10223 9850 9503 9185 8892 8622 8368 8126 7889 7661 7450 7256
2867 7256 7066 6868 6672 6498 6350 6217 6089 5969 5858 5749 5636 5520 5402 5283 5169 5072 4996 4930 4861 4787 4712 4638 4563 4495 4440 4394 4345
2864 4345 4286 4229 4181 4144 4113 4090 4071 4042 3994 3941 3906 3895 3890 3868 3828 3786 3752 3725 3692 3647 3596 3554 3531 3525 3525 3521 3513 3501 3487 3468 3445 3418 3392 3366 3336 3299 3264
2859 3264 3243 3242 3253 3259 3257 3254 3261 3277 3292 3302 3308 3311 3308 3297 3277 3252 3231 3226 3245 3283 3321 3347 3369 3405 3459 3517 3562 3593 3622 3654 3683 3701 3712 3727 3749 3771 3784 3794 3810
2854 3810 3833 3852 3859 3857 3852 3846 3840 3837 3835 3823 3792 3749 3708 3676 3646 3613 3585 3568 3560 3549 3536 3525 3520 3516 3510 3498 3479 3457 3440 3439 3452 3470 3487 3508 3531 3548 3552 3554 3578 3633 3699
2849 3699 3748 3777 3804 3844 3895 3942 3985 4037 4105 4180 4252 4328 4420 4531 4648 4759 4863 4961 5047 5109 5141 5151 5151 5153 5158 5162 5159 5140 5099 5035 4962 4895 4837 4777 4704
2845 4704 4619 4531 4446 4370 4303 4237 4159 4067 3978 3909 3856 3802 3737 3672 3617 3568 3521 3484 3466 3459 3448 3426 3396 3364 3334 3312 3302 3299 3296 3299 3315 3345 3379 3415 3459 3508
2841 3508 3550 3581 3613 3658 3712 3760 3799 3843 3901 3964 4017 4052 4076 4098 4115 4117 4105 4089 4082 4077 4060 4024 3976 3926 3877 3825 3766 3698 3617 3529 3446 3374 3306 3231 3149 3067
2836 3067 2990 2915 2847 2791 2747 2707 2663 2617 2569 2519 2464 2410 2363 2320 2283 2257 2248 2252 2253 2246 2229 2203 2166 2128 2102 2091 2086 2082 2089 2111 2130 2126 2107 2099 2112 2125 2121 2104 2093
2832 2093 2093 2099 2103 2101 2088 2061 2033 2023 2036 2061 2086 2100 2099 2085 2071 2073 2089 2100 2089 2060 2030 2014 2010 2006 1987 1948 1904 1876 1873 1885 1899 1913 1930 1945 1947 1935 1915 1896 1886
2827 1886 1897 1927 1960 1980 1986 1997 2020 2043 2056 2066 2092 2134 2174 2198 2208 2210 2205 2187 2156 2124 2102 2088 2069 2038 2001 1967 1933 1894 1852 1821 1802 1785 1761 1737 1726 1729
2822 1729 1736 1740 1747 1763 1790 1817 1841 1861 1878 1890 1893 1890 1885 1884 1888 1894 1900 1908 1924 1953 1992 2030 2056 2070 2079 2092 2110 2133 2164 2202 2243 2277 2304 2323 2335 2336 2332 2331 2333 2332 2327 2326 2337 2355
2817 2355 2369 2373 2368 2354 2329 2294 2255 2215 2176 2141 2113 2096 2083 2070 2056 2043 2033 2029 2039 2061 2086 2102 2105 2104 2109 2124 2146 2171 2202 2238 2270 2290 2298 2303 2310 2311 2304 2298 2308 2334
2812 2334 2365 2389 2413 2444 2483 2524 2559 2588 2614 2638 2667 2707 2763 2828 2888 2929 2947 2949 2939 2918 2886 2853 2831 2821 2805 2772 2727 2683 2648 2619 2592 2567 2542 2515 2482
2808 2482 2449 2425 2416 2425 2439 2444 2431 2403 2367 2330 2300 2284 2285 2296 2302 2304 2308 2319 2330 2340 2354 2375 2392 2394 2386 2387 2407 2442 2481 2522 2565 2610 2649 2682 2716 2757 2801 2838 2867
2803 2867 2889 2908 2928 2955 2993 3041 3093 3143 3196 3251 3302 3343 3372 3387 3380 3346 3301 3271 3263 3259 3235 3190 3137 3092 3059 3035 3017 2999 2977 2950 2917 2878 2838 2807 2792 2790
2799 2790 2791 2790 2782 2768 2752 2741 2736 2734 2730 2733 2756 2802 2857 2908 2951 2997 3059 3139 3226 3303 3363 3408 3444 3480 3524 3582 3655 3730 3796 3851 3903 3953 3998 4039 4085 4140 4199 4253
2794 4253 4288 4299 4283 4248 4208 4167 4121 4061 3985 3902 3815 3726 3635 3544 3458 3375 3293 3205 3114 3034 2973 2923 2866 2798 2731 2679 2638 2601 2564 2523 2474 2416 2357 2309
2790 2309 2265 2211 2148 2092 2058 2050 2064 2091 2116 2121 2103 2079 2070 2078 2090 2089 2068 2039 2016 2009 2009 2001 1974 1937 1903 1879 1859 1834 1803 1770 1747 1739 1742 1735 1706 1655 1603 1565 1543 1527
2785 1527 1507 1482 1453 1423 1393 1365 1339 1315 1293 1274 1255 1232 1203 1172 1150 1142 1143 1145 1145 1142 1136 1126 1115 1113 1121 1130 1131 1123 1111 1093 1067 1041 1029 1036 1049 1052 1049 1045 1039 1021 994 971
2780 971 960 955 949 946 955 968 973 962 948 945 954 966 966 952 935 927 928 928 920 909 904 903 891 863 830 805 788 777 772 779 792 797 787 773 767 770 778 784 788 784 773 758 745 732 718 706
2774 706 703 709 721 737 750 748 726 699 692 716 753 778 782 769 753 742 739 736 720 691 663 650 653 663 680 711 747 770 773 764 747 715 675 650 659 692 718 720 703 679 655
2769 655 638 639 656 672 674 660 641 625 618 621 628 639 659 686 706 698 660 616 591 586 592 603 615 617 602 578 560 556 561 566 570 572 571 568 565 564 570 590 631 685 738 783 817 832
2764 832 819 785 750 722 694 667 657 674 700 706 686 663 653 647 632 611 597 596 602 607 611 617 627 636 639 633 626 623 623 620 611 603 604 612 620 621 614 599 577 557 550 557 566 566 561 562 571 576 568 556
2758 556 556 568 580 582 575 571 581 604 631 647 645 633 626 628 628 620 609 608 618 632 640 637 625 606 584 565 557 560 575 601 626 641 640 628 615 611 616 622 618 601 584 581 594 614 631
2752 631 640 637 619 595 580 581 583 565 529 494 476 476 488 511 536 548 534 505 482 478 487 499 511 521 528 534 547 572 600 614 611 600 595 598 603 606 606 607 615 633 656 674 678 672
2747 672 667 674 695 717 720 700 668 642 632 640 670 716 762 790 792 777 756 731 707 700 716 741 757 761 764 771 773 767 764 772 782 777 759 745 746 762 783 808 841 879 914 942
2742 942 973 1018 1078 1138 1185 1219 1248 1278 1310 1345 1385 1429 1479 1538 1605 1671 1732 1799 1880 1963 2028 2074 2125 2196 2274 2345 2415 2503 2605 2702 2784 2865 2960 3066
2738 3066 3172 3269 3357 3437 3511 3589 3673 3755 3826 3888 3951 4023 4104 4185 4256 4315 4374 4451 4556 4679 4801 4915 5027 5134 5221 5276 5301 5306 5298 5278 5246 5210
2734 5210 5178 5153 5138 5137 5148 5164 5181 5200 5217 5222 5206 5171 5127 5086 5050 5010 4955 4873 4769 4661 4563 4471 4370 4257 4148 4061 3992 3928 3860 3791 3723 3649 3565
2730 3565 3474 3381 3287 3189 3090 2995 2903 2814 2725 2641 2562 2488 2414 2342 2275 2213 2150 2081 2008 1936 1866 1796 1728 1668 1623 1588 1555 1516 1469 1419 1375 1348 1336 1327 1311
2725 1311 1295 1282 1261 1222 1171 1130 1114 1109 1097 1072 1046 1026 1015 1012 1015 1020 1022 1022 1029 1044 1057 1055 1042 1035 1042 1051 1046 1029 1015 1010 1001 983 965 955 955 959 966 974 975 968 961 960 951 925 894 881
2720 881 893 913 933 955 982 1003 1007 992 961 921 882 861 858 853 836 820 819 827 827 818 811 810 804 790 784 798 825 846 850 845 841 839 838 839 845 858 870 874 872 873 876 873 865 863 873 885 887 875
2714 875 863 859 857 850 837 823 811 796 776 760 757 773 799 824 838 838 825 803 787 791 812 831 839 842 846 848 840 833 840 859 874 877 873 873 877 886 899 912 920 923 926 927 922 913 910 916 926 935
2708 935 947 965 982 992 1000 1013 1030 1045 1054 1057 1052 1038 1020 1008 1005 1009 1015 1023 1035 1044 1047 1044 1049 1075 1117 1154 1167 1166 1172 1192 1215 1229 1236 1245 1256 1263 1266 1271 1280 1292 1300 1298 1287 1278 1282 1300 1314
2702 1314 1316 1308 1306 1313 1330 1356 1387 1414 1433 1450 1470 1491 1510 1534 1566 1597 1616 1629 1652 1682 1702 1710 1720 1742 1764 1776 1786 1798 1802 1790 1770 1761 1768 1775 1775 1772 1776 1785 1788 1780 1768 1765
2697 1765 1777 1797 1812 1814 1809 1807 1813 1821 1824 1815 1800 1785 1772 1753 1724 1692 1669 1661 1666 1686 1721 1749 1743 1704 1664 1652 1659 1664 1661 1663 1674 1682 1683 1681 1678 1669 1650 1635 1631 1633 1632 1629 1628 1624 1609 1585 1560
2691 1560 1544 1544 1561 1587 1607 1619 1639 1677 1727 1772 1799 1806 1796 1772 1745 1728 1724 1733 1757 1802 1860 1913 1951 1976 1994 2004 2009 2014 2022 2026 2021 2013 2011 2012 2009 2012 2038 2086 2134 2166 2180
2686 2180 2181 2169 2149 2137 2148 2187 2239 2286 2319 2344 2371 2401 2424 2433 2437 2452 2484 2524 2560 2596 2635 2668 2686 2696 2714 2750 2795 2838 2871 2891 2899 2899 2897 2894 2895 2911 2948 2991
2682 2991 3014 3013 3005 3012 3026 3030 3019 3009 3018 3046 3084 3123 3161 3201 3243 3291 3343 3398 3448 3485 3513 3544 3581 3617 3644 3668 3704 3755 3808 3856 3902 3947 3983 4009 4042 4095 4159
2677 4159 4214 4254 4283 4305 4317 4321 4327 4342 4368 4406 4457 4515 4564 4595 4602 4593 4580 4580 4595 4616 4631 4646 4678 4726 4774 4817 4863 4915 4962 5003 5058 5145 5256 5364 5456 5540
2673 5540 5626 5717 5816 5925 6045 6168 6287 6396 6489 6565 6637 6724 6834 6964 7111 7274 7445 7610 7763 7909 8054 8201 8350 8501 8637
2670 8637 8740 8810 8864 8915 8958 8987 9000 9002 8988 8960 8940 8953 8998 9057 9117 9177 9234 9276 9299 9319 9359 9425 9503 9578 9645 9713 9796 9898 10011 10125 10245 10383
2666 10383 10548 10726 10901 11068 11234 11408 11590 11787 12006 12248 12508 12785 13085 13406 13738 14074 14414 14761 15109 15450 15777 16093 16402
2663 16402 16698 16970 17212 17424 17611 17778 17935 18088 18243 18401 18563 18734 18930 19167 19445 19750 20063 20383 20716 21070 21443 21837 22252
2660 22252 22688 23131 23571 24002 24430 24867 25325 25813 26331 26861 27389 27914 28446 28997 29567 30159 30778 31425 32084 32747 33417 34101 34800
2657 34800 35505 36224 36978 37777 38612 39470 40359 41298 42295 43339 44418 45542 46724 47968 49273 50637 52068 53579 55181
2655 55181 56882 58693 60623 62688 64908 67303 69885 72664 75657 78886 82367 86110 90125 94427 99019 103888 109021
2653 109021 114417 120079 126003 132186 138642 145414 152551 160105 168142 176753 186042 196112 207051 218948 231891 245974
2651 245974 261309 278036 296332 316407 338491 362842 389756 419581 452727 489658 530858 576798 627916 684586
2649 684586 747045 815274 888859 966841 1047619 1128935 1208044 1282032 1348111 1403744 1446688 1475206 1488601 1487770
2648 1487770 1475307 1454954 1430669 1405807 1382645 1362187 1344177 1327347 1309866 1289768 1265172 1234370 1196046
2646 1196046 1149696 1095932 1036401 973343 909082 845676 784730 727302 673928 624751 579706 538633 501333
2644 501333 467580 437142 409767 385176 363073 343171 325216 308973 294221 280752 268377 256930 246268 236283
2643 236283 226896 218040 209649 201671 194082 186867 179991 173399 167055 160947 155068 149392 143882 138524 133340 128356 123578
2641 123578 118985 114554 110282 106187 102291 98604 95124 91836 88722 85760 82931 80214 77593 75067 72653 70367 68199
2639 68199 66121 64108 62168 60320 58566 56885 55263 53705 52219 50800 49437 48130 46877 45664 44480 43337 42262
2636 42262 41265 40324 39413 38530 37690 36901 36155 35438 34746 34078 33429 32787 32142 31496 30866 30266 29697 29149 28619 28116 27649 27215 26798
2634 26798 26384 25972 25573 25194 24832 24475 24117 23761 23415 23074 22726 22374 22033 21718 21428 21155 20898 20656 20424 20199 19981 19771 19567
2631 19567 19369 19178 18991 18790 18571 18347 18136 17936 17733 17522 17319 17135 16962 16783 16593 16396 16198 16007 15829 15658 15480 15288 15094
2628 15094 14915 14745 14569 14385 14214 14065 13926 13775 13608 13440 13283 13133 12977 12810 12637 12473 12322 12183 12048 11909 11762 11611 11468
2625 11468 11344 11236 11135 11034 10928 10810 10679 10544 10426 10336 10269 10216 10171 10131 10087 10041 10000 9961 9911 9848 9787 9745 9711 9660 9587 9512 9457 9427 9413
2622 9413 9397 9359 9288 9203 9133 9087 9047 8993 8927 8859 8789 8716 8641 8566 8489 8409 8337 8281 8237 8195 8156 8122 8091 8058 8024 7988 7939 7869 7788 7715 7657 7601 7540 7477
2618 7477 7412 7338 7256 7179 7118 7076 7044 7022 7014 7018 7022 7006 6957 6886 6821 6786 6773 6758 6732 6709 6703 6710 6715 6711 6701 6687 6670 6655 6646 6641 6629 6606 6573 6538 6508 6480 6443 6390 6317
2613 6317 6224 6118 6009 5910 5830 5761 5691 5619 5555 5502 5457 5417 5388 5371 5353 5320 5280 5252 5246 5261 5289 5316 5325 5309 5277 5244 5215 5186 5157 5139 5132 5115 5073 5013 4959
2608 4959 4918 4876 4820 4759 4713 4689 4669 4631 4570 4509 4470 4453 4435 4400 4351 4301 4257 4219 4187 4168 4155 4138 4113 4093 4090 4098 4097 4079 4056 4043 4042 4043 4043 4049 4060 4066 4062 4055 4059 4076
2604 4076 4098 4118 4133 4131 4108 4070 4035 4011 3995 3983 3976 3973 3964 3943 3917 3893 3876 3863 3852 3837 3813 3777 3729 3672 3614 3564 3533 3521 3520 3518 3507 3484 3456 3432 3416 3404 3388
2599 3388 3366 3345 3324 3300 3271 3245 3230 3216 3195 3163 3129 3098 3070 3042 3014 2985 2952 2927 2928 2957 2994 3015 3017 3014 3021 3039 3062 3092 3129 3164 3188 3202 3214 3228 3235 3235 3241 3266
2594 3266 3300 3320 3309 3281 3260 3257 3261 3261 3251 3234 3216 3201 3191 3179 3157 3123 3090 3072 3073 3083 3088 3084 3074 3065 3064 3069 3071 3058 3032 3013 3019 3045 3075 3095 3106 3116 3126 3137 3158 3196
2590 3196 3250 3308 3357 3390 3406 3416 3436 3477 3533 3591 3646 3699 3749 3790 3821 3860 3924 4009 4090 4151 4203 4270 4362 4468 4572 4672 4778 4906 5056 5226 5413
2586 5413 5618 5845 6099 6380 6691 7036 7425 7874 8383 8943 9540 10174 10847 11542 12231 12890 13504 14049 14488 14790 14941 14936 14765 14424
2583 14424 13935 13348 12712 12060 11410 10774 10162 9585 9047 8545 8070 7623 7213 6853 6542 6271 6031 5815 5610 5406 5206 5027 4876
2580 4876 4752 4651 4570 4497 4414 4323 4246 4201 4182 4161 4124 4081 4047 4027 4013 3995 3970 3949 3944 3955 3965 3963 3951 3945 3949 3949 3930 3895 3860 3838 3828 3817 3797 3765 3726 3684
2576 3684 3643 3608 3582 3559 3533 3500 3464 3432 3404 3381 3365 3358 3361 3372 3387 3405 3423 3440 3458 3479 3500 3519 3542 3581 3638 3704 3769 3836 3910 3992 4080 4172 4273 4377
2571 4377 4471 4546 4610 4675 4741 4798 4837 4858 4861 4844 4811 4770 4726 4682 4638 4603 4579 4557 4521 4465 4398 4328 4260 4200 4149 4099 4043 3980 3920 3866 3815 3768 3735 3718 3703
2567 3703 3677 3646 3632 3646 3679 3714 3744 3772 3807 3858 3925 4001 4076 4140 4182 4207 4236 4292 4381 4479 4564 4638 4714 4796 4881 4975 5089 5218 5338 5434 5521 5629
2563 5629 5769 5926 6078 6219 6352 6478 6591 6691 6790 6901 7018 7126 7216 7303 7411 7557 7734 7936 8155 8392 8642 8898 9157 9418
2560 9418 9684 9951 10213 10460 10686 10890 11076 11244 11385 11494 11564 11601 11613 11605 11570 11497 11388 11255 11113 10961 10796 10623 10447 10268 10085
2557 10085 9908 9747 9599 9444 9280 9130 9013 8931 8869 8812 8757 8705 8659 8629 8618 8622 8636 8662 8700 8748 8803 8867 8943 9028 9118 9218 9344 9504 9699
2554 9699 9921 10163 10423 10708 11028 11385 11768 12165 12568 12980 13410 13878 14398 14971 15578 16211 16885 17621 18430 19311 20280 21364 22580
2551 22580 23933 25431 27093 28937 30977 33242 35774 38614 41783 45303 49216 53574 58419 63770 69635 76002 82811
2549 82811 89931 97161 104249 110905 116823 121689 125206 127117 127241 125516 122038 117076 111021 104291 97253 90191 83328
2547 83328 76832 70794 65229 60119 55453 51218 47387 43914 40769 37939 35408 33139 31088 29230 27554 26043 24673
2545 24673 23417 22262 21208 20258 19404 18629 17909 17229 16583 15977 15411 14883 14376 13875 13378 12904 12474 12090 11732 11381 11030 10683
2542 10683 10344 10015 9698 9390 9083 8774 8475 8204 7962 7737 7521 7321 7145 6980 6805 6614 6425 6256 6115 5993 5882 5778 5682
2539 5682 5595 5518 5450 5388 5324 5253 5172 5087 5009 4945 4898 4872 4866 4868 4858 4826 4785 4759 4757 4770 4788 4820 4878 4961 5054 5142 5230 5333 5468 5642 5850 6081 6322
2535 6322 6565 6813 7082 7400 7784 8237 8743 9293 9887 10517 11165 11807 12431 13023 13556 13992 14297 14450 14442 14264 13923 13438 12845 12184
2532 12184 11496 10808 10130 9471 8845 8268 7745 7268 6838 6458 6127 5828 5547 5285 5044 4819 4607 4417 4255 4112 3981 3860 3756
2529 3756 3666 3583 3502 3422 3336 3241 3147 3067 3004 2949 2896 2844 2794 2747 2715 2704 2698 2675 2630 2582 2543 2505 2459 2417 2392 2377 2362 2343 2330 2321 2312 2307 2313 2326 2340 2354 2376
2525 2376 2397 2402 2386 2365 2349 2338 2329 2327 2327 2313 2282 2255 2251 2263 2272 2270 2262 2245 2210 2157 2102 2052 2006 1965 1935 1920 1912 1903 1891 1870 1842 1817 1805 1797 1768 1717 1671 1656 1667 1683
2520 1683 1703 1731 1760 1774 1779 1799 1841 1889 1924 1949 1973 1992 2001 2001 1997 1989 1973 1952 1929 1903 1868 1830 1795 1759 1715 1667 1627 1596 1568 1537 1499 1454 1408 1378 1379 1408 1442
2515 1442 1462 1467 1466 1467 1474 1486 1495 1495 1482 1461 1438 1422 1421 1443 1482 1528 1575 1632 1700 1768 1817 1846 1866 1890 1920 1960 2019 2107 2222 2352 2487 2626 2771 2922 3069
2511 3069 3209 3348 3500 3665 3827 3970 4091 4195 4280 4330 4332 4287 4208 4099 3955 3782 3603 3445 3309 3175 3032 2889 2757 2634 2514
2508 2514 2402 2307 2224 2139 2050 1968 1897 1829 1760 1703 1671 1653 1632 1598 1559 1521 1485 1452 1425 1401 1378 1360 1350 1340 1318 1284 1255 1250 1266 1289 1306 1313 1311 1301 1283
2504 1283 1257 1231 1211 1201 1189 1167 1139 1121 1120 1125 1116 1091 1061 1038 1025 1014 1006 1001 998 994 986 975 963 954 955 964 973 967 938 899 872 870 885 897 893 875 858 847 842 835 829 829 845 879
2498 879 923 964 990 995 988 986 994 1002 1002 1005 1033 1091 1157 1201 1216 1219 1229 1250 1269 1277 1270 1255 1235 1208 1173 1137 1107 1083 1059 1031 1003 980 961 947 945 957 969 970 961 951 940
2493 940 922 901 889 894 905 911 907 894 876 855 840 839 847 850 840 816 789 766 748 732 716 702 698 711 742 779 799 789 757 724 704 693 683 672 661 653 654 668 688
2489 688 701 700 698 709 725 727 707 679 659 651 648 647 644 638 632 634 643 648 646 648 658 666 662 653 650 654 655 648 633 615 594 579 571 565 558 559 580 610 627 625 620 619 616 607 599 600 603 597 582 568 561 559 561
2482 561 564 561 548 531 520 515 513 517 531 552 565 559 540 522 509 498 485 474 473 487 515 549 575 586 582 575 570 561 543 522 509 510 522 537 549 553 545 529 518 520 536 559
2477 559 585 615 644 667 685 708 742 784 826 864 892 905 903 898 900 904 898 875 838 798 765 748 746 745 725 685 650 640 649 652 636 608 580 559 542 527 515 507 502 498 491
2472 491 478 464 457 464 481 502 522 544 566 583 594 598 596 591 587 590 597 603 604 604 604 605 604 597 579 546 508 482 472 469 463 456 457 467 481 498 520 544 562 567 560 540 511 489 491 514
2466 514 537 548 554 569 586 592 583 567 549 530 521 527 542 550 553 563 584 598 590 566 546 535 529 532 555 603 656 689 693 680 666 659 663 677 690 692 683 677 689 720 754 774 771
2461 771 748 720 698 686 673 656 648 660 682 691 679 658 641 630 624 626 636 641 631 615 607 611 620 632 649 660 650 619 588 573 574 581 586 578 552 516 487 476 478 477 471 468 470
2456 470 471 463 445 420 397 389 399 422 445 459 464 460 453 445 441 440 442 450 462 470 463 445 431 430 435 434 423 409 403 410 417 410 388 366 359 366 374 378 385 406 440 477 507 524 522 505 484 473
2450 473 472 467 448 417 388 372 368 370 370 364 346 317 288 276 281 289 289 292 313 347 373 383 387 396 404 404 404 415 428 424 402 381 379 392 405 405 391 374 366 370 376 373 368 381 414 448
2444 448 464 463 458 456 456 458 464 469 465 456 450 453 454 448 439 437 446 461 471 470 459 447 434 416 396 381 380 387 396 406 423 444 457 464 469 464 437 395 371 390 438 483 515 547 584 609
2439 609 609 590 572 563 554 533 503 478 470 480 497 511 522 534 545 551 551 547 540 529 521 524 535 539 528 509 496 493 494 496 497 499 499 488 462 423 388 371 373 386 407 432 454 460
2433 460 449 431 415 403 393 390 400 426 461 495 516 516 495 470 463 480 515 548 570 575 572 566 562 555 544 527 505 480 464 465 482 502 523 553 598 651 700 741 777
2429 777 806 825 836 850 870 901 948 1014 1083 1139 1185 1242 1319 1401 1467 1524 1597 1708 1859 2035 2217 2392 2561 2731 2902 3056 3173 3242 3272 3276
2425 3276 3258 3208 3111 2962 2776 2577 2384 2200 2028 1873 1739 1621 1512 1409 1314 1230 1168 1130 1102 1058 987 910 852 823 808 793 777 761 746
2421 746 732 726 731 741 740 717 675 631 602 588 578 562 549 548 558 566 564 558 552 545 531 513 496 485 480 478 483 497 519 544 564 572 566 548 521 487 453 422 392 359 326 301
2416 301 288 286 297 323 362 401 424 429 425 423 426 434 443 445 436 415 396 388 393 396 386 367 354 355 361 355 331 302 286 289 304 325 347 365 371 371 374 386 396 392 373 350 336 327 321 315
2411 315 313 314 314 313 310 305 297 295 304 322 334 329 315 306 307 306 294 276 266 270 283 302 326 357 382 393 390 384 383 381 372 357 346 341 336 327 318 314 309 295 280 279 293 303 298 285 283 291 294 287
2405 287 287 300 315 315 305 304 318 334 335 319 293 272 268 287 316 337 338 328 319 313 306 303 307 316 317 310 299 292 285 281 285 294 291 269 242 235 254 280 298 308 316 318 308 292 288 300 316
2399 316 325 328 330 323 301 275 268 286 313 331 339 344 347 345 340 339 346 356 364 369 367 362 369 396 429 446 436 415 398 394 399 410 422 428 426 418 406 393 387 391 397 391 374 362 364 375 383 386 383 371
2393 371 352 340 343 349 344 339 349 369 380 373 357 342 328 314 301 289 270 247 238 251 278 301 312 309 299 291 294 306 311 307 302 298 286 260 236 233 254 291 338 386 422 439
2388 439 449 463 478 480 468 457 451 447 445 454 471 477 463 434 406 383 365 354 347 336 320 304 291 275 250 223 204 194 189 189 191 190 183 174 165 158 157 173 204 233 243 245 260
2382 260 293 322 329 317 309 312 317 310 298 298 322 357 378 365 325 282 255 253 266 282 292 297 300 298 287 269 252 240 230 218 212 217 224 219 199 174 157 151 159 179 208 233 245
2377 245 242 235 235 242 246 244 245 255 267 267 259 258 270 283 286 291 307 322 322 307 297 297 294 277 255 244 246 255 258 247 222 193 178 186 212 240 261 267 260 249 242 241 238 233 231 234 236 238 248
2371 248 265 277 276 269 269 274 277 276 275 277 279 282 286 287 276 257 236 217 199 183 175 172 165 149 130 127 147 182 216 237 247 262 285 304 313 317 326 335 329 309 287 271 258 247 241 238
2365 238 231 219 209 204 202 205 221 246 267 272 262 246 228 214 215 233 248 245 236 248 283 317 327 318 309 307 311 322 338 357 368 366 351 332 317 309 304 302 303 310 322 335 348 354
2360 354 345 324 301 285 271 255 239 233 243 268 304 341 362 356 323 276 230 198 186 185 179 162 144 142 150 153 142 129 128 148 183 220 240 238 226 223 231 236 233 230 230 228 217
2355 217 199 180 163 155 166 193 219 227 220 214 225 255 295 326 331 316 302 297 291 273 254 253 272 295 308 307 290 260 225 201 196 209 234 262 281 287 285 282 272 250 224
2350 224 211 213 215 208 196 182 167 156 155 163 171 175 180 190 201 209 216 223 222 214 204 193 185 187 215 264 307 322 316 307 302 295 285 279 278 276 273 272 267 255 239 230 231 236 240 240 237 234 240 255 263 250
2343 250 227 217 223 227 223 225 243 266 278 280 282 289 294 299 304 307 305 301 301 302 296 279 254 227 203 187 176 167 166 181 206 220 209 186 180 197 219 228 227 229 233 233 226 219 216 212 196 169 145
2337 145 134 135 134 130 130 143 161 176 189 204 214 215 212 222 245 259 246 214 183 169 172 185 201 213 215 206 191 183 192 217 245 263 273 282 289 284 261 230 206 197 207 233
2332 233 267 289 289 280 279 283 271 235 196 179 188 209 231 251 265 266 249 222 196 185 193 217 239 243 230 217 216 217 205 183 173 190 225 253 262 266 275 281 265 226 185 162
2327 162 160 168 179 192 211 235 260 278 277 258 234 223 225 224 213 201 200 211 230 255 283 301 297 275 255 250 258 269 278 287 291 282 260 241 234 238 243 246 248 249 242 226 207 192 178
2322 178 157 133 118 122 137 153 166 180 198 213 220 213 202 197 207 222 228 222 215 217 226 232 234 238 241 227 191 142 104 89 93 106 123 145 171 190 191 181 180 198 222 230 221 212
2316 212 215 223 224 215 201 191 186 188 189 186 179 177 188 205 219 225 229 237 252 270 283 281 264 244 235 242 255 266 267 253 227 203 193 197 208 221 239 253 252 236 219 214 217 218 214 217 232
2311 232 252 262 255 239 228 230 239 242 237 231 233 240 242 234 221 209 204 209 221 233 238 237 237 242 255 276 302 325 342 355 372 387 385 360 323 294 283 287 298 315 340 369 394 408
2305 408 405 393 376 356 332 305 286 284 301 327 351 363 358 340 322 319 331 345 347 340 335 337 338 333 320 303 277 237 193 165 164 184 206 221 228 229 225 215 208 205 199 179 148
2300 148 119 105 105 113 129 149 170 187 201 213 219 215 208 205 206 208 211 214 211 203 206 231 267 286 279 263 253 241 219 199 195 201 197 182 178 196 224 246 256 260 258 250 235 216 196
2294 196 176 158 142 126 118 126 149 176 198 218 239 251 250 238 222 203 180 162 157 168 182 194 201 202 197 190 187 193 210 234 253 255 241 231 238 259 279 295 313 329 334
2289 334 323 309 300 289 268 237 212 202 208 222 232 232 222 207 191 176 159 135 104 72 53 59 91 136 184 227 258 273 267 247 225 210 204 205 206 197 176 152 144 163
2284 163 199 228 235 223 210 204 203 200 197 194 191 185 178 168 159 152 153 163 175 180 177 173 172 173 179 194 212 224 223 208 185 157 131 117 120 138 166 197 222 233 231 230 232 231 223 218 230 249
2279 249 254 234 203 180 177 192 218 239 244 231 210 196 197 213 234 246 244 232 218 207 199 201 215 239 261 272 274 271 268 265 261 253 238 222 210 202 190 170 150 139 139 147 160
2273 160 175 188 192 185 175 170 172 182 198 221 240 245 233 217 207 200 182 158 149 172 211 237 237 223 213 204 188 170 166 181 197 197 186 178 179 178 165 147 136 136 144 154 166
2268 166 177 180 171 150 127 117 123 136 143 139 129 120 115 117 130 154 183 203 207 198 181 160 136 117 109 112 123 133 136 127 113 104 109 131 164 202 231 241 233 221 217 227 247 269
2263 269 284 279 251 217 197 199 211 226 244 266 286 293 285 267 247 228 211 196 188 188 192 193 193 201 220 235 235 227 229 240 246 243 246 265 285 285 264 238 217 199 185 177 173 168 165
2257 165 169 168 152 134 135 160 188 207 227 260 293 298 273 238 212 196 184 176 172 167 158 148 137 122 104 89 85 90 99 109 119 129 137 144 150 158 171 188 204 207 197 183 182
2252 182 197 218 229 220 197 173 162 158 145 120 100 103 123 140 145 146 148 150 149 147 146 142 139 140 145 145 141 143 150 153 146 144 160 185 205 223 244 258 250 228 216 217 211 184 151 133 130
2246 130 131 133 138 137 123 106 98 95 88 81 93 124 158 177 183 185 186 192 207 227 236 227 206 189 185 186 183 167 139 112 105 119 139 142 129 120 126 139 147 148 151 162 178 192 195 181 159
2240 159 145 151 170 184 185 182 189 210 236 258 268 265 256 251 259 276 292 299 294 279 257 234 218 212 213 215 211 197 176 156 146 143 139 132 127 128 132 136 144 156 165 169 176 193 215 233 247
2235 247 253 246 223 196 183 185 192 195 193 186 173 161 158 159 150 131 123 136 161 178 182 175 158 140 134 147 165 165 148 130 122 121 121 124 136 148 155 161 171 185 198 209 214 208 187 160
2229 160 142 137 142 152 172 201 227 234 225 212 212 224 236 242 243 247 252 249 234 217 206 200 188 165 136 114 102 100 106 122 146 177 210 233 231 200 154 118 105 108 116 126 142
2224 142 163 178 183 181 174 161 149 152 176 209 224 213 189 178 189 208 218 210 190 173 164 164 170 175 176 175 178 185 191 189 181 171 163 160 162 172 189 208 222 223 209 186 169 165 166 166
2218 166 165 170 178 180 171 161 157 160 161 158 155 160 176 193 200 192 179 175 179 183 183 186 192 194 189 182 178 173 167 171 186 200 196 173 145 131 137 158 178 185 183 190 214 243 262 276 295 314 319 309 296
2212 296 291 292 300 316 335 338 317 283 251 227 206 186 166 150 141 143 152 163 178 201 226 237 230 216 208 203 195 188 190 203 216 222 225 233 249 271 290 296 285 259 227 199 183
2207 183 179 184 190 189 181 169 157 149 147 150 150 143 127 106 86 75 74 79 84 87 96 110 120 123 125 138 167 200 224 232 226 214 208 213 222 227 223 219 223 233 236 224 197 169 149 137 126 115
2201 115 116 132 157 176 182 179 176 183 203 227 240 232 208 181 161 153 157 172 195 219 236 237 222 202 190 190 195 195 191 187 180 169 165 180 209 228 223 204 190 190 194 189 173 157 149
2195 149 146 141 138 147 170 193 205 203 195 183 169 162 164 165 156 146 142 141 134 125 125 135 140 139 142 157 178 197 211 214 206 194 194 208 223 232 242 259 277 288 296 309 318 313 293 268 245
2190 245 227 221 231 253 273 280 275 264 257 259 260 243 204 168 152 150 142 129 120 114 105 98 109 135 158 164 153 135 121 122 142 172 193 199 198 199 194 184 182 193 202 191 164 138 126
2184 126 128 141 159 175 183 187 192 203 218 232 240 238 229 220 213 203 194 194 208 225 226 209 183 157 133 118 118 131 145 155 166 184 204 216 213 197 177 164 167 178 183 173 155
2179 155 142 139 140 140 136 130 120 111 110 123 145 168 186 201 218 238 254 258 251 243 239 233 215 188 167 158 155 152 150 153 159 160 154 146 139 133 125 121 119 115 112 118 138 160 169 161 146 130 124 134 157
2173 157 180 196 216 249 285 303 293 269 249 237 236 246 257 253 231 208 197 196 195 192 194 204 218 232 239 228 197 162 144 149 169 194 219 234 230 213 198 187 171
2168 171 146 125 120 129 138 142 144 151 164 179 189 190 187 189 195 199 199 198 196 190 175 152 126 101 87 93 114 139 163 189 219 244 260 271 281 286 284 275 263 246 228 218 225 249 280
2162 280 306 314 298 266 237 221 213 201 183 165 152 144 139 132 121 110 102 93 77 59 56 77 112 139 149 147 139 126 112 102 99 104 112 115 107 94 91 109 138 164 183 195 195
2157 195 180 169 182 214 239 239 222 204 191 184 184 186 180 163 146 144 153 161 166 174 186 196 197 184 162 139 122 115 115 124 141 152 141 112 88 86 92 91 89 109 145 169 163 142
2152 142 132 140 150 150 141 130 124 123 124 126 133 147 162 163 146 120 102 101 117 139 155 163 166 170 172 165 153 149 158 170 174 169 164 162 159 149 131 111 101 103 111 118 129 151 180 199 201 195
2146 195 186 172 154 142 149 163 169 169 174 187 190 174 151 137 135 137 135 129 123 121 127 137 141 134 122 114 113 120 133 147 160 173 191 210 219 210 194 180 171 157 138 119 102 82 60
2140 60 43 41 53 68 82 100 130 166 195 206 202 196 200 215 231 236 232 224 216 210 203 201 211 230 247 247 231 210 196 187 182 183 191 196 187 175 177 198 223 236 242 250 265 278 286 289 285
2135 285 270 247 224 203 177 153 144 154 166 167 164 176 197 207 201 194 202 222 238 245 244 235 217 196 181 179 194 229 272 301 300 282 276 299 334 363 385 412 444 473 493
2130 493 506 513 514 508 500 497 499 502 499 486 463 430 394 364 350 355 369 377 374 360 340 318 298 284 279 278 277 270 254 225 193 177 190 219 236 232 220 214 217 218 212 198 180 163 153
2124 153 155 166 180 195 210 219 218 209 200 195 192 190 189 186 176 163 154 156 163 163 155 145 146 159 179 202 226 246 251 241 231 237 255 262 248 227 221 234 250 260 267 269 261 245 229 220 220
2118 220 231 260 302 339 350 341 324 308 293 280 271 260 242 227 227 240 248 239 219 201 189 184 190 202 213 214 212 213 214 214 219 233 247 248 238 235 245 257 260 257 253 245 226 203
2113 203 193 204 220 224 214 206 208 218 228 233 234 231 222 210 204 210 227 246 260 264 259 248 238 229 219 208 200 191 177 157 142 143 158 169 164 146 125 112 111 125 146 165 173 176
2108 176 178 184 193 206 218 219 206 186 169 153 139 133 145 167 185 191 195 209 227 240 239 218 184 149 129 129 136 139 136 133 136 144 158 182 216 254 287 301 289 254 213 181
2102 181 160 146 136 127 123 122 126 128 118 92 62 47 55 83 124 168 199 208 199 187 182 180 182 192 213 237 251 252 240 219 194 178 180 194 205 203 190 174 164 163 167 170 170 172
2097 172 182 191 192 185 181 181 179 171 162 158 153 143 134 131 132 129 120 117 129 152 176 194 207 213 214 210 204 199 190 177 165 163 173 183 181 165 147 140 150 169 182 181 171 166 176 204 239 271
2091 271 289 291 275 244 206 171 147 133 128 130 135 139 137 131 133 152 183 209 219 216 212 209 198 179 165 167 179 188 190 193 202 211 210 196 178 166 163 166 167 162 158 166 189 213 222 213 197 182
2085 182 167 155 151 164 187 212 230 246 259 266 257 237 219 219 233 244 243 238 241 255 263 249 218 187 170 167 167 165 159 154 150 144 131 115 112 128 148 155 146 139 144 154 154 143 132
2080 132 130 134 139 144 148 150 158 179 209 229 227 208 184 161 141 136 155 186 205 200 190 196 218 239 253 266 279 285 279 267 258 251 241 223 201 179 157 142 138 149 169 185 185
2075 185 171 153 140 130 117 108 114 135 160 180 199 219 230 220 191 162 150 153 160 161 151 132 115 109 117 129 137 141 151 170 193 207 199 173 143 122 114 113 116 126 136
2070 136 135 116 94 92 111 138 161 181 202 220 231 238 248 258 263 263 259 250 234 218 212 214 212 203 196 201 214 224 229 237 250 262 269 275 283 289 291 293 295 290 273 252 233 217 205 208 234
2064 234 272 296 291 268 250 247 257 268 277 277 262 229 194 177 184 195 192 181 180 195 213 216 205 192 186 186 189 197 206 213 214 210 206 205 209 212 210 201 194 195 200 200 195 190 184 173 162 163 174 179
2058 179 166 147 145 164 187 198 191 174 160 159 169 178 171 147 118 92 74 72 90 125 159 179 185 186 185 180 172 168 171 173 168 153 136 134 151 172 174 153 130 124 134 146 150 150 147
2052 147 141 136 142 158 173 172 161 155 166 192 226 253 262 250 223 194 176 178 203 242 276 295 299 297 293 285 273 258 241 226 220 224 233 235 230 226 230 238 248 266 291 309 305 286 267
2047 267 251 228 194 162 145 143 148 160 184 217 245 254 243 224 207 195 184 171 156 146 147 155 161 157 148 145 154 167 173 172 173 178 183 183 182 184 186 182 178 183 196 206 207 201 190 174 163
2041 163 174 210 246 255 233 200 173 155 139 123 111 109 121 142 157 157 148 145 153 168 185 204 222 230 224 210 193 177 169 178 202 225 227 210 188 173 161 145 126 118 125
2036 125 142 156 163 165 159 143 118 104 115 146 177 193 202 216 233 243 242 234 222 208 199 204 219 232 239 245 250 249 238 223 213 206 196 183 182 198 220 236 238 236 239 250 264
2031 264 272 265 242 210 183 176 191 215 237 249 252 245 230 214 203 204 217 235 245 245 238 236 244 257 265 258 238 207 172 143 134 153 193 237 270 286 288 283 275 266 253 236 218
2025 218 205 201 203 206 208 212 224 243 256 258 256 256 259 256 251 255 264 262 240 218 219 246 278 295 294 282 264 245 229 217 213 217 225 228 214 192 181 196 226 244 235 207 185 182 188 188 177
2020 177 170 178 194 203 201 197 194 190 181 175 182 199 217 231 235 230 218 209 211 215 210 192 172 156 139 119 100 89 86 88 98 115 130 128 112 95 90 95 108 130 162 193 210 207 193 181
2014 181 177 182 191 194 180 150 117 96 86 78 71 76 102 139 168 177 166 142 117 101 93 82 63 43 41 61 90 106 107 102 100 94 77 55 43 47 58 61 54 53 66 90 119 149
2009 149 178 199 198 170 127 96 93 114 139 152 152 155 167 182 190 189 182 172 159 142 123 101 78 63 62 71 75 65 48 41 58 99 147 178 177 153 129 118 115 109 105 114 140
2003 140 176 213 243 259 258 243 223 202 183 168 160 160 166 179 196 202 184 143 97 65 53 59 79 112 151 183 200 197 177 155 145 157 180 200 209 213 219 220 210 190
1998 190 173 167 173 183 196 212 234 260 287 303 300 271 229 193 178 181 188 189 185 182 179 176 172 169 171 176 183 189 195 200 204 205 200 194 194 195 188 171 158 162 178 190 187 176 167 170 185 208 226
1993 226 227 219 219 231 241 234 211 191 181 172 153 122 89 58 30 9 -4 -7 1 20 46 76 104 128 142 142 133 129 138 149 146 128 116 125 149 167 172 170 170 174 178 178 174 168 167 175
1987 175 191 203 203 189 161 127 97 84 91 110 127 135 140 148 163 189 220 240 238 222 212 218 231 237 239 246 252 241 207 165 137 130 131 121 99 83 87 107 123 129 139 165
1982 165 195 207 193 166 144 129 123 131 149 169 178 178 176 175 170 161 157 163 179 200 223 243 251 236 201 163 138 125 114 100 98 114 140 154 146 124 97 78 74 86 106 123
1977 123 135 146 156 162 161 156 148 138 133 136 140 132 115 110 127 153 166 160 141 120 104 98 100 94 69 34 12 15 34 57 75 92 109 130 154 180 206 233 256 264 253 237
1971 237 229 228 221 206 195 196 197 187 173 169 174 172 155 135 129 142 163 174 171 158 147 145 158 187 226 260 275 270 253 231 211 198 190 178 156 138 135 142 141 130 126 142 166
1966 166 181 186 191 193 183 164 148 141 143 156 183 211 221 209 194 187 184 176 167 159 151 144 150 172 198 215 221 221 216 208 201 198 192 174 152 147 166 196 223 241 253 261 268 274 269 249 221
1960 221 203 203 211 213 207 199 193 189 188 189 187 186 191 204 216 221 226 236 238 219 184 156 150 158 166 171 178 187 197 208 223 235 243 247 254 263 273 280 284 278 260 238 223 221 227 233 230 209 173 135 115
1954 115 118 130 135 136 138 143 147 150 160 177 195 213 229 235 224 199 178 173 183 200 222 244 261 271 285 303 313 305 287 275 271 263 250 247 257 266 262 251 240 220 184 142
1949 142 119 123 144 167 181 183 180 177 178 176 165 152 146 147 146 144 146 150 147 135 121 110 108 124 162 206 232 234 229 231 239 242 239 234 221 200 178 161 150 147 158 180 192 183 172 186
1943 186 218 236 229 215 211 210 196 176 166 178 205 233 251 257 258 263 275 283 279 261 237 218 211 216 221 212 191 176 180 194 201 199 203 219 231 221 191 164 164 189 213 218 207 195
1938 195 190 190 198 219 248 271 281 282 274 254 224 198 183 177 172 172 181 192 194 190 187 185 185 193 220 255 279 280 260 226 188 158 145 143 144 147 159 179 198 211 219 216 196 168 151
1933 151 151 155 153 153 169 199 232 264 291 302 292 273 261 257 246 221 193 182 191 214 232 231 214 198 202 226 257 284 307 329 344 349 349 351 353 341 308 266 237 231 236 235
1927 235 229 233 251 274 285 281 273 266 260 251 239 229 228 240 259 277 291 297 290 272 261 278 324 373 399 404 404 409 414 421 432 439 427 397 371 362 363 356 333 302 272 256 257 268 275
1922 275 273 269 274 280 281 279 283 286 278 259 247 250 261 269 275 284 296 308 315 317 316 314 312 312 311 302 285 271 265 266 271 282 306 341 373 396 412 425 434 434 428 430 439 443 431 407 382 366 359 362 370
1916 370 372 364 350 338 330 325 324 329 337 337 331 328 332 339 344 351 363 378 381 366 342 327 330 344 348 327 295 277 285 309 330 338 337 328 313 295 287 296 318 334 339 344 363 396 423 433 433 438
1910 438 450 463 472 479 479 457 413 371 350 343 336 325 325 340 361 378 395 412 423 425 429 445 469 489 497 492 481 475 483 503 524 538 550 567 582 591 599 612 629 634 627 611 590
1905 590 567 544 529 515 492 465 459 481 510 521 516 518 534 548 547 539 539 549 559 563 564 568 580 599 616 620 608 589 572 560 548 538 540 557 577 584 579 578 592 618 639 644
1899 644 639 637 650 675 698 705 693 675 663 656 651 653 673 707 731 726 703 683 674 674 677 686 697 701 701 707 723 739 742 733 722 713 709 705 697 690 695 714 736 748 752 765 788 809 825 849
1894 849 885 915 927 938 976 1039 1100 1138 1160 1178 1193 1208 1239 1294 1360 1413 1439 1439 1429 1425 1435 1447 1443 1411 1365 1328 1306 1288 1268 1249 1233 1214 1180 1130 1075 1027
1889 1027 1001 1000 1010 1014 1001 987 991 1018 1054 1079 1090 1097 1108 1123 1137 1147 1158 1176 1204 1240 1280 1323 1370 1421 1469 1506 1534 1560 1592 1634 1687 1753 1826 1890 1935 1962
1885 1962 1981 1999 2016 2031 2042 2041 2027 2003 1971 1927 1864 1789 1720 1666 1620 1570 1515 1461 1414 1373 1334 1298 1267 1246 1232 1214 1188 1160 1143 1141 1139 1127 1110 1104 1111 1120 1118 1108
1880 1108 1103 1113 1136 1161 1179 1187 1193 1207 1235 1279 1330 1376 1412 1449 1494 1541 1573 1587 1592 1599 1604 1602 1595 1589 1572 1531 1468 1406 1356 1315 1279 1251 1239 1237 1235 1227 1209 1184 1158 1143
1875 1143 1143 1153 1166 1184 1207 1227 1232 1216 1190 1172 1166 1161 1147 1129 1115 1106 1088 1056 1020 994 981 973 970 982 1009 1040 1069 1096 1123 1142 1150 1148 1139 1121 1100 1087 1092 1107 1120 1128
1871 1128 1134 1137 1135 1132 1136 1146 1154 1158 1164 1170 1169 1161 1156 1152 1140 1119 1106 1113 1143 1186 1231 1266 1281 1277 1276 1298 1341 1387 1423 1445 1454 1452 1445 1438 1432 1421 1401 1373 1345 1330 1340 1374 1406 1410 1382
1865 1382 1344 1319 1312 1323 1349 1384 1410 1416 1407 1404 1417 1436 1450 1462 1489 1541 1608 1668 1708 1735 1763 1795 1828 1857 1885 1917 1950 1985 2023 2069 2124 2187 2260 2343 2436 2534
1861 2534 2643 2766 2897 3021 3125 3216 3309 3418 3550 3716 3915 4135 4358 4578 4813 5084 5395 5737 6101 6487 6894 7315 7739 8155
1858 8155 8547 8901 9207 9456 9631 9714 9698 9592 9415 9181 8905 8610 8321 8047 7779 7506 7233 6979 6760 6579 6434 6322 6239 6180
1855 6180 6135 6099 6072 6064 6083 6129 6198 6287 6396 6522 6663 6824 7022 7271 7565 7890 8241 8632 9070 9555 10081 10657 11301 12028 12838 13724
1852 13724 14682 15715 16828 18015 19264 20551 21847 23115 24318 25413 26352 27089 27581 27797 27729 27389 26813 26053 25164 24199
1849 24199 23213 22255 21363 20559 19848 19230 18699 18258 17917 17694 17597 17611 17706 17867 18097 18391 18731 19092 19461 19829 20177 20482 20726 20899
1846 20899 20987 20987 20916 20804 20679 20556 20452 20389 20386 20458 20621 20895 21288 21795 22408 23132 23968 24909 25936 27029 28162 29301 30398 31400
1843 31400 32247 32886 33282 33426 33327 33002 32483 31819 31068 30283 29515 28812 28201 27696 27315 27088 27041 27169 27454 27897 28526 29352 30353
1841 30353 31488 32736 34090 35521 36967 38353 39608 40674 41487 41981 42109 41855 41243 40317 39125 37720 36170 34553 32937
1838 32937 31372 29896 28544 27339 26282 25357 24552 23867 23307 22867 22536 22299 22139 22032 21959 21909 21870 21821 21737 21607 21441 21258 21070
1835 21070 20882 20707 20564 20475 20455 20512 20653 20882 21204 21639 22206 22915 23757 24722 25808 27023 28371 29844 31415 33039 34648
1833 34648 36163 37511 38626 39446 39918 40001 39677 38958 37881 36509 34915 33176 31365 29547 27769 26054 24422 22890 21477
1831 21477 20184 19005 17933 16962 16078 15272 14543 13898 13329 12813 12334 11897 11513 11183 10899 10652 10442 10271 10141 10048 9981 9932 9906
1828 9906 9915 9963 10050 10177 10355 10584 10847 11134 11449 11810 12221 12674 13160 13667 14174 14663 15122 15538 15881 16124 16254 16267 16152 15907 15550
1825 15550 15113 14613 14057 13466 12877 12308 11749 11192 10648 10139 9667 9223 8802 8411 8052 7725 7424 7145 6878 6618 6376 6161 5965
1822 5965 5779 5598 5429 5272 5120 4971 4829 4699 4581 4478 4398 4343 4298 4246 4182 4122 4078 4049 4023 3994 3968 3951 3943 3941 3942 3948 3955 3960 3965 3976 3994 4013 4032
1818 4032 4054 4080 4105 4130 4156 4183 4197 4191 4173 4152 4123 4079 4028 3986 3955 3921 3870 3810 3756 3710 3661 3598 3523 3445 3372 3307 3251 3205 3172 3143 3107 3059 3011 2973 2944
1814 2944 2916 2884 2857 2838 2827 2820 2817 2818 2820 2819 2821 2824 2824 2820 2816 2819 2828 2838 2842 2832 2807 2780 2773 2797 2836 2867 2881 2882 2878 2874 2872 2871 2871 2876 2884 2891 2885 2859 2819 2781 2756 2752 2770 2799 2821 2816 2789
1808 2789 2760 2748 2757 2774 2790 2801 2807 2810 2810 2812 2820 2839 2872 2910 2945 2968 2987 3012 3046 3081 3113 3152 3209 3278 3340 3386 3428 3484 3556 3626 3683 3737 3805 3902 4024 4162
1803 4162 4301 4438 4580 4737 4917 5116 5332 5565 5815 6084 6373 6690 7042 7437 7878 8364 8887 9434 9996 10572 11157 11735 12289
1801 12289 12800 13253 13622 13879 14000 13984 13843 13607 13304 12950 12549 12107 11643 11179 10734 10321 9958 9653 9398 9176 8982 8820 8689
1798 8689 8579 8485 8415 8381 8396 8458 8556 8677 8819 8992 9204 9451 9728 10046 10418 10843 11304 11804 12366 13007 13724 14516 15394 16371 17441
1795 17441 18594 19843 21212 22707 24319 26035 27835 29672 31480 33199 34776 36152 37250 38000 38360 38315 37873 37074 35988
1792 35988 34698 33271 31764 30232 28732 27310 26003 24831 23796 22882 22075 21379 20804 20352 20012 19777 19643 19603 19643 19744
1790 19744 19886 20051 20220 20379 20522 20642 20728 20776 20796 20813 20852 20928 21055 21245 21515 21882 22358 22947 23648 24468 25419 26518 27768 29159
1787 29159 30672 32275 33925 35568 37152 38629 39943 41021 41792 42207 42249 41922 41243 40257 39038 37682 36274 34874 33522
1785 33522 32253 31099 30087 29240 28566 28066 27734 27571 27576 27744 28066 28531 29131 29840 30615 31400 32142 32794 33303 33617 33701 33544 33149
1782 33149 32528 31703 30719 29635 28510 27394 26323 25324 24413 23606 22910 22329 21864 21522 21301 21187 21153 21178 21262 21407 21591 21775
1779 21775 21922 22017 22055 22025 21913 21717 21448 21122 20757 20372 19993 19644 19343 19105 18934 18837 18818 18885 19048 19317 19695 20182 20779 21486 22297
1776 22297 23197 24158 25148 26130 27056 27876 28533 28979 29173 29098 28750 28136 27274 26199 24980 23698 22416 21155 19921 18733 17620
1774 17620 16594 15640 14740 13891 13099 12373 11727 11174 10708 10297 9914 9551 9214 8904 8610 8337 8101 7909 7757 7633 7539 7478 7440
1771 7440 7416 7402 7402 7419 7455 7515 7601 7713 7851 8022 8228 8462 8710 8970 9249 9549 9860 10170 10467 10740 10971 11137 11225 11228 11148 10985 10739
1767 10739 10414 10025 9597 9160 8726 8297 7871 7461 7079 6731 6411 6113 5834 5568 5312 5068 4848 4660 4496 4344 4198 4063 3946
1765 3946 3843 3745 3649 3560 3485 3425 3373 3316 3251 3182 3124 3080 3043 3005 2960 2909 2851 2791 2737 2690 2640 2581 2520 2476 2456 2447 2432 2409 2387 2367 2343 2312 2281 2260
1760 2260 2252 2256 2275 2303 2322 2312 2273 2230 2202 2188 2168 2130 2082 2040 2016 2013 2020 2016 1991 1950 1912 1887 1871 1862 1860 1864 1860 1839 1811 1793 1786 1780 1768 1754 1734 1698 1642 1585 1545 1527
1756 1527 1515 1503 1490 1486 1497 1527 1568 1608 1632 1639 1629 1604 1564 1522 1494 1484 1483 1486 1489 1483 1461 1435 1428 1449 1479 1495 1493 1483 1464 1427 1371 1311 1270 1257 1267 1284 1294 1288 1274
1751 1274 1270 1283 1309 1333 1343 1337 1325 1321 1335 1359 1377 1379 1370 1363 1365 1375 1385 1385 1375 1361 1351 1341 1319 1280 1236 1206 1194 1193 1192 1186 1166 1130 1082 1044 1034 1051 1069 1068 1052 1046 1070
1746 1070 1117 1157 1171 1160 1145 1138 1137 1132 1119 1106 1102 1112 1127 1136 1136 1135 1139 1150 1166 1183 1201 1220 1238 1261 1296 1337 1368 1375 1362 1350 1355 1377 1404 1424 1426 1410 1385 1370 1371 1374 1361
1741 1361 1325 1278 1234 1204 1189 1190 1200 1209 1210 1200 1187 1178 1177 1187 1204 1223 1234 1228 1206 1175 1149 1135 1133 1136 1136 1132 1123 1112 1100 1089 1085 1096 1122 1152 1173 1178 1172 1165 1166 1180 1213 1263
1736 1263 1320 1367 1394 1410 1430 1463 1504 1546 1575 1587 1581 1569 1561 1557 1549 1534 1512 1491 1474 1457 1437 1412 1382 1353 1331 1320 1317 1314 1307 1297 1296 1310 1336 1369 1399 1422 1436 1445 1453
1731 1453 1461 1462 1457 1458 1472 1486 1481 1456 1431 1423 1426 1423 1408 1388 1361 1330 1307 1310 1341 1381 1407 1420 1428 1435 1435 1428 1423 1424 1431 1442 1458 1478 1493 1498 1498 1505 1519 1531 1539 1548 1569 1601 1631 1654 1674
1725 1674 1700 1729 1751 1766 1779 1794 1809 1828 1853 1883 1905 1914 1921 1936 1953 1959 1952 1942 1934 1920 1892 1861 1841 1837 1842 1850 1855 1854 1849 1843 1842 1842 1841 1840 1844 1853 1861 1864 1868 1880 1910 1958 2014 2066 2104
1720 2104 2131 2156 2189 2233 2280 2320 2347 2366 2391 2432 2486 2544 2591 2625 2653 2689 2738 2795 2845 2884 2916 2946 2971 2985 2991 3008 3054 3124 3196 3249 3286 3325 3374 3423 3461
1716 3461 3493 3530 3566 3590 3606 3643 3717 3811 3893 3954 4020 4118 4254 4411 4569 4723 4876 5040 5226 5433 5655 5889 6144 6434 6758 7105 7468
1712 7468 7856 8280 8746 9249 9784 10348 10927 11500 12044 12541 12984 13363 13664 13869 13958 13922 13764 13505 13176 12804 12415 12025 11647 11287
1709 11287 10949 10635 10349 10099 9892 9733 9608 9499 9398 9322 9298 9332 9406 9501 9610 9736 9878 10034 10212 10427 10690 10999 11350 11739
1706 11739 12158 12606 13086 13619 14220 14897 15648 16485 17421 18463 19606 20845 22185 23629 25171 26795 28479 30199 31908
1704 31908 33537 35005 36244 37205 37853 38155 38095 37693 37005 36096 35029 33865 32678 31534 30481 29543 28733 28070 27569 27233
1702 27233 27050 27002 27077 27274 27593 28026 28554 29152 29787 30425 31027 31560 31997 32314 32494 32530 32431 32211 31894 31518 31127 30759 30438 30181
1699 30181 30010 29944 29997 30185 30533 31059 31759 32616 33625 34786 36088 37497 38979 40500 42010 43436 44699 45741 46524 47012
1696 47012 47190 47072 46700 46126 45410 44626 43851 43151 42576 42172 41981 42029 42320 42856 43648 44713 46061 47683 49561 51665 53949
1694 53949 56347 58773 61128 63313 65228 66765 67815 68294 68165 67433 66128 64312 62086 59591 56960 54291 51657 49127
1691 49127 46760 44579 42588 40789 39201 37835 36679 35708 34908 34273 33795 33453 33223 33081 33007 32978 32972 32964 32934 32870 32776 32666 32560
1689 32560 32484 32458 32498 32613 32821 33155 33654 34342 35220 36277 37515 38959 40636 42548 44672 46976 49428 51986 54591 57170
1686 57170 59635 61877 63761 65154 65954 66108 65601 64455 62722 60491 57880 55025 52058 49094 46211 43455 40853 38418
1684 38418 36155 34061 32125 30344 28724 27267 25970 24817 23791 22878 22077 21383 20779 20244 19764 19343 18985 18688 18450 18271
1682 18271 18157 18102 18100 18149 18259 18439 18688 18993 19341 19738 20201 20745 21366 22052 22800 23622 24520 25475 26456 27442 28416 29344 30179 30882
1679 30882 31431 31812 32017 32047 31922 31669 31317 30905 30484 30102 29794 29584 29493 29538 29723 30041 30487 31060 31748 32525 33359 34220 35077 35883
1676 35883 36582 37122 37463 37581 37465 37127 36591 35881 35019 34026 32941 31815 30697 29616 28584 27612 26715 25906 25188 24559 24018
1673 24018 23573 23224 22966 22790 22692 22668 22711 22814 22981 23220 23538 23940 24428 25003 25662 26408 27261 28255 29406 30708 32148 33732
1670 33732 35491 37455 39647 42079 44759 47689 50870 54294 57945 61789 65774 69827 73855 77740 81344 84524 87146
1668 87146 89100 90304 90712 90324 89181 87360 84969 82139 79012 75729 72420 69194 66136 63298 60708 58384 56346 54610
1666 54610 53176 52030 51158 50544 50168 50007 50037 50232 50553 50950 51377 51803 52206 52560 52834 53014 53115 53174 53232 53329 53515 53841 54348
1663 54348 55065 56013 57217 58706 60499 62605 65028 67762 70785 74060 77531 81124 84735 88240 91513 94438 96899 98771
1661 98771 99951 100391 100100 99122 97528 95422 92938 90218 87389 84559 81829 79287 77005 75040 73441 72244 71463 71101
1659 71101 71161 71640 72518 73746 75265 77004 78882 80805 82668 84364 85777 86785 87283 87206 86534 85289 83526 81333 78820
1657 78820 76103 73291 70488 67782 65244 62922 60847 59038 57505 56248 55266 54548 54068 53792 53686 53718 53845 54013 54169 54270
1654 54270 54286 54188 53958 53596 53119 52548 51901 51201 50489 49814 49225 48756 48440 48302 48369 48659 49186 49959 50990 52293 53873 55719
1652 55719 57801 60082 62514 65024 67509 69855 71960 73735 75076 75875 76047 75559 74425 72686 70407 67679 64621 61360
1649 61360 58020 54702 51474 48374 45425 42659 40105 37771 35635 33669 31859 30209 28719 27376 26161 25061 24073
1647 24073 23195 22419 21725 21106 20565 20106 19725 19409 19151 18952 18810 18726 18706 18753 18862 19018 19218 19473 19803 20220 20729 21327 22000 22716
1644 22716 23454 24208 24982 25758 26497 27153 27693 28087 28308 28332 28155 27785 27242 26540 25692 24725 23677 22591 21498 20411 19347
1642 19347 18325 17361 16452 15595 14799 14081 13438 12848 12291 11764 11273 10819 10394 9992 9614 9266 8958 8690 8454 8237 8032 7838
1639 7838 7654 7475 7299 7128 6969 6824 6694 6576 6468 6370 6284 6208 6132 6044 5946 5850 5758 5663 5557 5444 5329 5223 5135 5069 5021 4974 4918 4855
1636 4855 4790 4724 4669 4642 4643 4650 4641 4620 4603 4587 4558 4511 4457 4408 4365 4327 4294 4259 4216 4168 4127 4095 4060 4013 3958 3904 3854 3803 3754 3710 3671 3636 3603 3574 3543 3509
1631 3509 3474 3443 3419 3398 3373 3337 3292 3250 3232 3247 3283 3314 3324 3312 3281 3240 3198 3167 3149 3138 3123 3110 3110 3122 3133 3126 3101 3075 3063 3061 3059 3052 3044 3037 3031 3029 3031 3026 3002 2961
1626 2961 2923 2905 2908 2922 2940 2954 2955 2937 2912 2892 2879 2868 2861 2867 2881 2892 2897 2903 2911 2914 2905 2893 2887 2885 2884 2885 2888 2890 2880 2854 2818 2786 2767 2769 2788 2818 2848 2872 2887 2892 2891 2890 2894 2905
1621 2905 2915 2923 2926 2927 2930 2937 2943 2947 2945 2946 2956 2977 2998 3007 2995 2973 2961 2971 2996 3019 3034 3047 3067 3093 3124 3159 3195 3228 3258 3291 3328 3357 3365 3357 3356 3376 3410 3441 3461 3469 3475 3486
1616 3486 3506 3534 3562 3585 3602 3621 3642 3662 3673 3675 3677 3686 3701 3713 3722 3733 3751 3779 3816 3868 3933 4003 4063 4104 4127 4143 4161 4187 4218 4256 4301 4361 4433 4507 4571 4625
1611 4625 4676 4734 4806 4895 5000 5113 5221 5319 5413 5514 5631 5763 5899 6027 6147 6264 6378 6478 6552 6602 6645 6701 6772 6851 6930 7009 7097 7206
1608 7206 7339 7485 7627 7760 7894 8042 8212 8404 8618 8857 9127 9435 9781 10163 10575 11014 11484 11993 12553 13177 13875 14651 15498
1605 15498 16399 17349 18353 19417 20533 21682 22845 24007 25148 26232 27221 28091 28825 29408 29824 30071 30166 30127 29968 29701 29339
1603 29339 28888 28351 27733 27062 26371 25683 25006 24351 23735 23176 22677 22234 21855 21558 21362 21266 21250 21294 21391 21549 21777 22080 22477 22989
1600 22989 23618 24336 25124 26000 27002 28140 29392 30751 32246 33910 35752 37767 39963 42364 44975 47787 50792 53974
1597 53974 57284 60638 63949 67145 70158 72909 75314 77303 78817 79813 80283 80268 79832 79027 77880 76414 74664 72685 70558
1595 70558 68376 66235 64208 62340 60657 59186 57955 56977 56248 55747 55453 55346 55393 55553 55776 56028 56281 56506 56672 56771 56819
1593 56819 56842 56849 56841 56834 56865 56971 57175 57490 57936 58537 59314 60283 61462 62867 64507 66383 68498 70838 73368 76025 78733 81415
1590 81415 83997 86398 88535 90324 91707 92654 93170 93280 93023 92440 91573 90463 89149 87691 86173 84707 83406 82352 81600
1588 81600 81191 81168 81565 82389 83617 85194 87047 89079 91186 93267 95218 96936 98304 99211 99573 99354 98573 97288 95570
1585 95570 93484 91090 88456 85665 82798 79919 77084 74350 71773 69392 67218 65249 63488 61949 60647 59584 58745
1583 58745 58099 57615 57259 56999 56803 56645 56512 56392 56262 56097 55891 55661 55434 55228 55061 54952 54923 55003 55223 55623 56235 57080 58182
1580 58182 59573 61275 63285 65574 68098 70804 73615 76431 79143 81643 83826 85583 86812 87434 87406 86734 85463 83660
1578 83660 81397 78748 75788 72592 69230 65769 62290 58872 55576 52432 49457 46671 44096 41733 39564 37564 35720
1576 35720 34033 32503 31123 29882 28769 27774 26887 26097 25395 24774 24233 23776 23406 23123 22914 22771 22694 22696 22791 22981 23260 23630
1573 23630 24094 24651 25292 26009 26798 27651 28551 29478 30407 31312 32158 32906 33517 33959 34203 34233 34051 33668 33094 32346 31452 30447 29352
1571 29352 28176 26938 25677 24434 23229 22056 20920 19847 18863 17974 17160 16403 15701 15058 14467 13919 13413 12955 12545 12172
1568 12172 11829 11513 11225 10955 10696 10450 10227 10028 9848 9685 9552 9456 9388 9328 9267 9219 9203 9225 9276 9350 9450 9575 9709 9843 9980 10133
1565 10133 10305 10486 10667 10845 11013 11157 11263 11321 11322 11251 11106 10903 10666 10407 10129 9840 9550 9263 8984 8716 8466 8236 8026 7840
1562 7840 7684 7553 7440 7339 7252 7179 7123 7088 7070 7051 7022 6997 7001 7028 7048 7038 7008 6980 6956 6927 6901 6892 6910 6952 7012 7093 7193 7311 7445 7598 7766
1558 7766 7946 8139 8350 8578 8813 9045 9264 9456 9605 9708 9767 9779 9731 9620 9465 9287 9097 8889 8664 8432 8207 7997 7807 7642
1555 7642 7502 7382 7273 7175 7102 7066 7068 7095 7135 7183 7245 7329 7431 7530 7603 7638 7640 7621 7581 7510 7411 7298 7181 7052 6900 6731 6562 6404 6263
1552 6263 6144 6052 5984 5929 5879 5836 5806 5792 5804 5846 5900 5942 5961 5964 5958 5937 5894 5842 5796 5759 5724 5689 5649 5599 5539 5481 5437 5403 5371 5347 5345 5364 5391 5423 5476
1547 5476 5561 5666 5778 5892 6014 6139 6257 6362 6454 6526 6569 6579 6554 6490 6391 6269 6140 6014 5885 5747 5596 5437 5283 5147 5036 4939
1544 4939 4845 4751 4664 4587 4516 4448 4388 4344 4319 4303 4292 4284 4284 4293 4303 4300 4281 4261 4251 4251 4247 4236 4233 4248 4280 4318 4351 4376 4393 4407 4432 4476 4538 4615 4711 4826 4948
1540 4948 5061 5156 5244 5329 5409 5479 5539 5594 5642 5681 5716 5752 5794 5847 5911 5981 6048 6113 6193 6308 6461 6640 6834 7041 7266 7512 7785 8088 8428
1536 8428 8810 9238 9719 10253 10839 11476 12158 12878 13633 14428 15267 16145 17040 17925 18765 19520 20144 20601 20879 20976 20895 20644 20244 19722
1533 19722 19112 18453 17781 17127 16501 15907 15354 14852 14407 14016 13674 13381 13136 12932 12761 12623 12530 12495 12524 12610 12742 12913 13124 13384
1530 13384 13701 14071 14492 14965 15504 16119 16815 17593 18457 19416 20483 21667 22974 24415 26008 27769 29712 31839 34147 36618
1528 36618 39230 41946 44712 47444 50038 52386 54396 55987 57074 57586 57492 56810 55603 53958 51983 49808 47558 45331
1526 45331 43179 41138 39244 37542 36058 34789 33709 32798 32056 31490 31096 30856 30746 30743 30829 30979 31164 31358 31536 31683 31784
1523 31784 31831 31831 31799 31752 31708 31692 31741 31893 32173 32597 33183 33950 34910 36061 37406 38956 40721 42701 44882 47241 49746 52341
1520 52341 54948 57472 59813 61874 63558 64780 65467 65577 65111 64116 62673 60891 58893 56802 54723 52733 50889 49249
1518 49249 47855 46727 45864 45268 44948 44906 45132 45606 46310 47225 48312 49509 50728 51870 52852 53612 54095 54239 53988 53328 52294
1516 52294 50951 49370 47630 45822 44037 42344 40780 39369 38126 37062 36188 35510 35027 34724 34580 34578 34714 34981 35367 35848
1513 35848 36388 36945 37471 37925 38275 38499 38572 38478 38208 37773 37210 36578 35940 35340 34800 34335 33976 33760 33712 33839 34138 34621 35306 36207
1510 36207 37314 38602 40041 41592 43203 44808 46329 47686 48800 49597 50003 49958 49433 48443 47050 45338 43397 41316 39183
1508 39183 37067 35013 33047 31196 29485 27929 26523 25256 24125 23127 22255 21496 20838 20273 19794 19398 19079 18824 18614 18426
1506 18426 18243 18058 17871 17684 17498 17313 17135 16976 16844 16739 16658 16607 16604 16656 16762 16924 17158 17474 17865 18320 18842 19437 20088 20763
1503 20763 21432 22076 22671 23176 23552 23776 23835 23713 23401 22909 22267 21508 20659 19743 18791 17842 16929 16067 15255 14488 13764 13087 12464
1500 12464 11906 11414 10984 10602 10265 9975 9729 9520 9333 9157 8983 8806 8627 8456 8300 8151 8002 7859 7740 7652 7580 7506 7422 7338
1497 7338 7268 7230 7230 7261 7309 7363 7424 7500 7595 7711 7847 8000 8151 8286 8398 8493 8575 8636 8662 8638 8553 8406 8206 7976 7734 7485 7225 6952
1493 6952 6678 6414 6167 5931 5706 5496 5305 5130 4965 4806 4652 4507 4379 4275 4195 4126 4056 3985 3915 3847 3776 3702 3630 3565 3509 3464 3431
1490 3431 3406 3384 3370 3367 3363 3340 3304 3280 3291 3331 3381 3432 3482 3531 3581 3637 3695 3749 3794 3837 3873 3881 3844 3775 3700 3627 3546 3449 3346 3246 3147 3045 2944 2856
1486 2856 2783 2729 2696 2682 2672 2646 2598 2538 2477 2422 2368 2313 2260 2215 2182 2158 2139 2123 2111 2097 2077 2046 2008 1967 1931 1906 1893 1884 1872 1859 1853 1855 1856 1846 1832 1824 1825
1481 1825 1826 1816 1796 1775 1758 1746 1739 1738 1740 1736 1719 1695 1686 1698 1715 1712 1691 1669 1660 1661 1666 1678 1696 1705 1695 1672 1652 1639 1630 1623 1629 1644 1650 1630 1592 1564 1562 1577 1592 1601 1609 1615 1610 1589
1476 1589 1554 1516 1482 1456 1439 1435 1440 1449 1461 1475 1491 1507 1518 1518 1506 1490 1483 1489 1500 1504 1501 1502 1512 1529 1542 1546 1543 1536 1528 1516 1497 1478 1464 1454 1442 1437 1456 1499 1542 1563 1568 1577
1471 1577 1588 1581 1549 1513 1489 1472 1451 1429 1412 1398 1382 1367 1359 1349 1327 1297 1274 1267 1270 1276 1287 1305 1324 1340 1349 1355 1357 1354 1345 1333 1322 1315 1308 1298 1288 1281 1273 1261 1248 1245 1252 1252 1238
1466 1238 1225 1226 1236 1235 1224 1219 1221 1210 1175 1133 1114 1125 1149 1169 1180 1184 1183 1179 1175 1171 1163 1153 1144 1132 1110 1083 1067 1073 1092 1110 1120 1123 1121 1111 1097 1082 1066 1045 1022 1004 992
1461 992 975 949 930 932 955 978 984 976 965 959 965 984 1010 1029 1035 1030 1020 1007 1001 1015 1047 1078 1086 1071 1056 1052 1049 1031 1002 977 970 982 1005 1032 1053 1054 1034 1006 989 985 977 954
1456 954 926 912 910 906 893 881 877 877 876 878 885 884 866 840 832 845 862 865 861 864 878 898 919 941 969 998 1018 1028 1037 1055 1082 1099 1093 1073 1058 1052 1047 1039 1034 1036 1037 1033 1026 1018 1008 996
1450 996 988 986 986 986 987 991 995 996 997 994 980 956 931 915 905 897 898 915 943 964 970 963 957 962 976 986 976 945 910 891 888 889 888 893 914 950 983 994 981 960 949 953 962 967 971 978 994
1444 994 1021 1056 1091 1110 1111 1098 1084 1071 1063 1065 1071 1068 1049 1027 1021 1031 1047 1062 1076 1084 1079 1069 1070 1086 1105 1114 1118 1127 1139 1148 1155 1165 1174 1174 1159 1135 1111 1095 1092 1098 1099 1078 1030 973
1439 973 929 911 909 907 899 889 884 885 887 889 895 906 917 925 929 940 964 1000 1030 1037 1019 995 981 976 979 995 1030 1069 1086 1075 1056 1051 1067 1091 1110 1122 1132 1150 1178 1208 1224 1226
1434 1226 1230 1241 1248 1236 1211 1190 1177 1161 1136 1106 1080 1057 1038 1028 1030 1036 1043 1051 1064 1078 1085 1079 1058 1033 1019 1021 1025 1015 991 969 959 956 955 956 965 974 974 968 965 968 965 950 931 923 924
1428 924 926 923 926 943 967 981 979 977 989 1011 1029 1035 1032 1029 1025 1025 1038 1064 1092 1107 1113 1122 1143 1172 1200 1216 1216 1202 1186 1180 1181 1177 1169 1165 1174 1194 1212 1221 1215 1198 1181 1184 1210 1241 1255 1252
1422 1252 1248 1255 1270 1286 1294 1289 1270 1251 1248 1268 1299 1330 1361 1396 1431 1458 1480 1506 1541 1575 1600 1617 1634 1659 1699 1760 1834 1912 1988 2069 2159 2256 2358 2470 2598
1418 2598 2741 2895 3062 3245 3445 3660 3899 4180 4508 4869 5246 5637 6057 6511 6981 7441 7863 8223 8504 8696 8799 8811 8720 8524
1415 8524 8237 7892 7512 7113 6710 6322 5963 5637 5344 5087 4869 4692 4556 4458 4382 4314 4252 4214 4205 4211 4215 4224 4254 4312 4394 4505 4655 4837
1412 4837 5032 5233 5457 5721 6023 6360 6739 7172 7663 8218 8854 9580 10389 11273 12242 13318 14501 15772 17112 18498 19885
1409 19885 21206 22391 23379 24115 24547 24634 24360 23734 22800 21636 20347 19018 17702 16429 15223 14107 13097 12200 11407 10692
1407 10692 10031 9422 8889 8447 8080 7758 7461 7196 6980 6820 6713 6651 6621 6618 6639 6685 6750 6834 6947 7104 7309 7558 7851 8194 8597
1404 8597 9071 9630 10282 11027 11858 12770 13775 14887 16107 17416 18778 20146 21467 22686 23743 24573 25112 25305 25122 24567
1401 24567 23684 22547 21244 19858 18457 17096 15810 14615 13509 12488 11556 10715 9965 9293 8686 8137 7651 7241 6905 6622
1399 6622 6356 6086 5821 5583 5385 5222 5084 4964 4858 4764 4690 4646 4631 4638 4660 4703 4782 4902 5052 5220 5402 5609 5858 6153 6488 6853
1396 6853 7240 7646 8064 8474 8851 9170 9415 9576 9645 9611 9467 9212 8856 8422 7938 7434 6926 6424 5943 5506 5125 4798 4508 4241
1393 4241 3997 3779 3579 3386 3197 3024 2878 2758 2649 2537 2422 2311 2211 2122 2044 1977 1923 1882 1848 1819 1795 1779 1766 1748 1719 1687 1657 1626
1389 1626 1589 1551 1524 1503 1474 1431 1391 1369 1365 1365 1362 1358 1351 1332 1298 1256 1219 1188 1165 1147 1132 1125 1128 1137 1133 1112 1085 1072 1073 1073 1062 1048 1037 1026 1017 1015 1019 1013 986 950 923 911
1384 911 909 911 913 909 896 882 875 870 860 845 833 826 819 814 813 818 827 841 857 859 834 787 743 720 714 717 726 738 746 751 754 759 760 754 746 738 734 739 762 796 819 813 783 750 728 714 697 675
1378 675 650 633 637 659 685 697 696 689 681 673 673 682 691 689 676 660 645 628 613 610 616 621 622 627 639 651 659 669 682 689 683 667 653 641 626 612 614 639 675 704 721 726 722 715 711 712
1373 712 712 702 683 666 662 668 672 664 652 647 649 646 632 615 607 608 610 614 624 638 645 640 636 644 662 671 662 640 619 605 596 588 586 599 623 643 646 636 623 612 597 581 575 587 609 628
1367 628 643 655 658 646 628 621 633 647 651 649 650 655 654 650 654 675 706 730 741 742 734 715 689 667 661 672 687 696 696 686 662 628 599 595 615 640 653 652 644 634 624 621 628 644
1362 644 660 672 673 657 626 597 584 590 600 611 623 637 650 659 670 680 683 683 687 698 705 705 707 723 745 761 771 779 785 784 777 775 783 797 814 839 869 893 906 913 927 953 983
1356 983 1001 1003 991 977 971 978 993 1005 1004 985 960 943 939 941 942 944 951 959 960 958 964 984 1012 1039 1056 1062 1062 1066 1084 1114 1145 1167 1178 1182 1182 1186 1199 1222 1245 1266 1287 1313 1340 1365
1351 1365 1387 1410 1438 1475 1524 1585 1662 1755 1867 1990 2108 2209 2300 2396 2504 2616 2720 2811 2891 2957 2996 3000 2976 2948 2931 2916 2882 2821 2750 2690 2645
1347 2645 2607 2575 2552 2537 2529 2527 2539 2562 2586 2600 2606 2606 2599 2582 2560 2542 2533 2528 2525 2525 2537 2565 2601 2634 2662 2700 2763 2849 2944 3037 3136 3252 3390 3543 3707 3881
1343 3881 4071 4278 4500 4731 4967 5209 5460 5716 5968 6202 6409 6585 6717 6791 6800 6748 6655 6537 6401 6247 6071 5874 5665 5462 5285
1340 5285 5152 5061 4999 4951 4911 4884 4873 4872 4873 4873 4876 4882 4884 4871 4844 4817 4801 4791 4768 4724 4670 4626 4594 4568 4542 4526 4524 4536 4558 4595 4651 4727 4822 4937 5079 5251
1335 5251 5450 5663 5879 6089 6294 6504 6722 6933 7108 7229 7297 7322 7310 7265 7186 7080 6951 6806 6656 6509 6373 6245 6131 6033 5960
1332 5960 5917 5914 5956 6039 6148 6267 6389 6515 6647 6783 6913 7027 7107 7139 7118 7052 6951 6814 6640 6441 6235 6030 5819 5601 5391 5207
1329 5207 5047 4900 4761 4638 4534 4449 4385 4346 4332 4327 4324 4327 4343 4361 4360 4342 4322 4309 4301 4292 4289 4291 4284 4255 4216 4188 4182 4184 4186 4189 4203 4230 4273 4338 4425 4529 4640
1325 4640 4759 4891 5039 5194 5346 5488 5616 5728 5821 5886 5911 5887 5805 5665 5471 5236 4977 4710 4452 4212 3996 3806 3637 3482 3331
1322 3331 3181 3038 2909 2790 2669 2539 2413 2311 2238 2179 2122 2063 2010 1960 1911 1865 1833 1820 1819 1820 1814 1797 1773 1758 1763 1783 1805 1821 1836 1856 1878 1895
1318 1895 1907 1922 1950 1997 2056 2120 2177 2224 2260 2287 2306 2318 2318 2297 2247 2177 2098 2021 1944 1866 1789 1717 1654 1600 1554 1508 1458 1405 1355 1314 1282 1256 1231 1204 1173
1313 1173 1137 1099 1062 1027 994 963 932 903 889 892 900 893 865 829 798 770 745 725 712 703 692 684 684 689 696 708 728 744 741 719 695 678 666 661 669 684 684 658 618 591
1309 591 590 604 619 624 616 592 554 513 480 458 447 444 443 446 456 474 496 512 517 513 511 519 536 560 585 608 629 648 662 660 634 591 559 555 572 587 582 566 551 544 544 542 534
1303 534 518 499 485 472 457 440 438 456 479 483 461 431 408 400 405 423 451 480 498 506 509 506 493 467 439 425 434 457 481 498 517 540 560 561 543 518 498 485 484 495
1298 495 512 520 512 498 492 498 513 533 558 578 586 581 564 533 490 445 415 411 427 455 484 507 514 501 471 441 423 419 422 425 428 431 429 418 408 412 427 437 437 436 441 445 442 436 435 435
1293 435 424 405 392 391 396 398 398 400 406 419 435 449 456 458 459 457 442 417 396 382 370 355 345 344 352 366 386 412 435 445 443 438 443 457 470 468 453 440 437 437 427 417 430 470
1287 470 512 528 519 499 477 449 419 400 398 410 430 451 465 472 477 483 482 467 451 449 461 476 484 489 492 491 485 479 475 463 441 419 402 387 371 364 380 413 447 467 473 469 457
1282 457 442 431 430 437 439 430 412 398 393 392 395 406 423 438 443 439 435 430 419 406 397 395 393 391 396 410 427 437 439 440 444 458 480 500 506 496 486 485 495 513 542 580 612 622 618 618
1277 618 623 620 600 575 556 544 535 528 530 543 559 568 566 551 528 505 489 484 486 487 484 487 507 538 556 549 524 500 484 471 454 436 425 428 444 461 467 455 438 429 431 438 451 476
1271 476 509 535 544 542 540 538 532 524 520 521 525 530 533 531 523 514 512 519 527 532 533 533 535 544 564 583 588 576 560 557 571 593 612 622 622 612 599 588 582 578 576 577 587 602 607 589 555 525 514 517
1265 517 521 516 505 494 487 487 493 498 496 488 481 481 486 488 483 475 467 464 463 459 451 446 450 460 468 470 471 470 462 443 421 409 417 443 473 492 492 479 468 467 475 489 502 513 519 522 526 528 522 509 501 507 521
1259 521 532 539 545 553 561 569 582 597 607 607 598 582 555 519 484 458 438 418 397 389 399 421 439 448 453 461 473 484 493 498 497 492 482 465 437 403 378 375 391 405 406 402 402 402 389
1253 389 366 344 334 330 325 316 309 306 304 306 316 332 351 368 383 390 386 372 358 353 360 376 397 421 443 457 458 453 449 446 435 415 400 403 420 435 440 441 442 440 431 416 404 398 400 408 417
1247 417 420 414 403 394 388 386 383 377 366 353 345 343 339 329 323 332 351 365 374 386 404 412 402 381 363 350 335 317 310 318 333 343 345 347 357 380 410 437 451 453 452 449 440 423 402 388
1242 388 383 382 382 384 390 400 410 411 401 383 362 344 335 338 346 350 345 339 343 356 367 368 364 366 372 373 368 360 356 359 372 390 400 394 375 357 351 353 358 361 360 355 351 360 380 401 412 414 412 406 395 381
1235 381 369 359 352 349 353 358 359 360 364 366 359 351 356 379 406 422 421 410 395 381 373 371 368 360 345 329 312 294 281 277 283 290 292 291 301 329 367 396 404 401 402 414 430 451 476 494 486
1230 486 442 384 339 314 296 286 291 311 327 326 315 312 315 309 288 260 235 217 203 198 206 227 253 275 296 321 349 372 380 377 367 353 333 312 299 298 302 295 271 242 224
1225 224 224 236 249 259 271 290 308 321 328 328 322 314 317 337 362 373 367 350 327 299 273 261 269 288 305 319 331 336 333 327 324 322 319 321 333 349 359 362 362 359 347 322 295 272
1219 272 257 248 247 256 273 295 314 329 343 364 393 418 424 417 409 407 397 374 353 349 359 362 350 338 335 337 332 321 316 319 323 320 312 313 325 337 346 357 373 382 367 335 313 319 338
1214 338 350 346 337 331 321 308 303 315 340 361 366 351 324 298 285 288 298 308 320 332 335 320 291 264 248 242 245 255 267 267 253 235 230 248 283 319 341 346 341 339 342 341 327
1208 327 309 298 299 310 328 347 359 353 337 331 345 371 389 395 395 393 385 371 360 358 362 363 355 345 340 339 337 323 300 278 272 288 315 336 340 331 319 318 331 352 372 379 373 362 357
1203 357 363 377 387 388 382 373 369 369 371 366 353 334 310 285 263 250 251 263 280 301 322 342 356 364 370 373 369 357 343 330 317 303 293 288 285 279 277 287 307 323 324 308 285 268
1198 268 261 259 254 251 264 293 319 322 303 275 250 235 237 254 270 271 260 253 257 265 274 292 325 362 380 372 344 310 283 273 283 305 329 347 357 357 349 340 341 352 367 377 382
1192 382 377 357 326 294 273 265 263 261 260 264 277 300 327 347 352 346 343 350 364 375 379 380 374 352 315 282 270 274 280 283 291 309 327 339 342 333 306 269 246 252 274 288 288 288 294 301 304
1187 304 309 316 320 320 321 325 329 327 324 327 332 334 329 320 310 306 318 341 365 379 384 385 387 386 376 357 336 330 353 395 431 442 435 419 399 374 352 339 333 325 313 308 309 308 300 293 298 310 314 303
1180 303 284 273 281 298 311 316 325 344 359 355 339 330 334 333 316 294 288 297 305 306 306 310 314 314 314 318 324 326 326 329 335 336 327 310 294 285 280 278 277 277 274 264 254 256 272 289 295 294 298 311 324 327
1174 327 319 303 287 282 295 314 324 320 314 314 318 320 318 320 328 342 360 375 382 374 357 340 324 312 310 322 339 344 332 315 307 311 322 328 324 305 281 273 290 323 351 363 359 348 336
1169 336 331 335 339 335 324 313 305 294 282 279 293 315 327 321 302 286 286 303 323 328 317 300 293 300 315 328 332 327 325 337 359 378 386 389 391 390 381 368 360 355 350 354 371 389 387 364 345
1163 345 350 368 376 369 360 359 364 370 372 370 359 338 315 299 300 317 340 360 370 371 358 331 302 287 289 299 306 317 333 347 348 338 328 322 318 319 325 331 328 314 297 281 271 271 282
1157 282 291 289 279 278 286 289 281 268 259 248 230 216 219 239 265 286 300 302 296 291 294 297 291 282 286 304 322 325 316 298 273 242 219 216 229 249 269 288 301 302 295 294 306 323 330 329 331
1152 331 344 362 368 359 344 338 346 356 356 337 302 259 222 201 201 219 247 273 286 283 274 274 283 292 290 281 273 270 269 270 278 291 305 317 326 327 318 307 306 315 320 316 305 293 279 264 253
1146 253 252 260 272 288 310 325 322 308 301 311 321 315 299 293 307 329 345 350 347 338 326 313 301 292 292 305 327 352 376 398 412 412 396 374 354 330 296 257 227 215 218
1141 218 231 244 252 258 265 276 284 285 287 303 330 355 369 374 380 386 388 383 371 352 334 325 328 331 320 290 253 224 218 237 273 308 326 321 301 279 269 276 294 316 338 360 378
1136 378 389 392 390 379 355 324 300 288 277 263 259 274 297 311 310 307 309 316 323 331 332 321 304 297 303 309 302 285 271 264 263 267 276 284 284 274 259 248 250 268 296 320 333 336 333 316
1130 316 272 206 145 120 137 171 197 207 211 221 237 251 257 257 257 262 276 295 316 331 338 338 339 348 361 366 357 346 348 365 377 374 364 364 366 349 310 269 247 244 251 267 286
1125 286 299 297 290 290 298 304 305 305 303 291 270 251 244 248 262 280 294 294 283 270 263 263 272 293 322 338 326 294 265 258 276 308 338 351 338 306 268 238 229 249 288 323 336
1119 336 338 343 352 354 343 326 310 295 282 276 279 286 293 298 303 301 292 283 281 292 315 344 363 357 333 313 312 319 320 315 316 317 307 286 271 273 290 310 325 327 310 283 264 258 257 252 255 281
1114 281 324 357 369 371 377 386 386 374 355 337 325 323 325 322 310 301 307 326 345 351 348 340 331 322 320 325 334 340 341 338 332 326 327 340 360 375 386 397 411 418 410 390 372 363 362 365 369 371 365 348
1107 348 327 315 315 320 319 313 305 301 301 303 308 316 317 304 278 255 251 267 285 287 270 244 227 229 243 250 240 220 212 226 251 270 277 274 269 265 267 280 299 318 334 351 368 377 373 360
1102 360 339 309 271 241 233 247 268 283 290 293 297 304 312 319 323 332 348 360 351 315 269 231 215 219 237 264 292 317 340 358 365 361 357 363 376 383 378 368 362 359 352 345 347 363 381 387
1096 387 378 360 344 332 325 324 332 346 354 347 324 299 282 278 285 301 325 351 368 364 344 324 320 328 330 317 295 282 283 293 300 301 305 318 340 361 369 357 329 296 265 240 223
1091 223 217 222 235 251 262 267 276 296 331 370 392 390 370 340 306 272 249 247 266 291 307 310 303 289 272 258 254 255 255 252 255 267 280 286 290 301 317 330 335 340 348 352 342 323
1086 323 311 317 338 360 368 361 350 348 356 365 367 361 350 342 349 369 385 381 361 346 347 347 333 313 302 295 281 265 266 288 313 328 338 352 367 376 383 392 394 382 370 377 403 430 446
1080 446 464 500 552 610 663 714 766 814 839 824 772 712 669 646 626 608 600 602 599 582 564 561 565 554 515 461 411 372 348 338 336 333 327 328 340 358 372 380 379 368
1075 368 349 338 346 364 368 350 322 299 286 285 295 313 330 342 351 356 353 340 325 317 315 313 311 313 317 313 298 285 281 285 288 286 281 282 293 313 327 325 311 307 321 342 356 365 377 392
1070 392 406 423 445 464 466 454 443 436 419 387 350 321 309 314 332 349 351 334 318 322 344 370 392 405 407 399 389 387 391 393 397 404 411 406 397 396 408 421 422 418 420 425 421 409 400 400
1064 400 404 403 403 411 428 441 443 432 417 407 401 398 397 402 414 428 431 420 400 385 383 390 398 401 392 373 351 342 356 384 409 419 418 416 415 413 413 422 439 453 450 429 396 360 328 302
1058 302 283 272 271 279 290 298 301 305 314 329 343 350 352 349 339 324 311 311 325 344 360 366 364 356 346 334 321 310 313 338 375 406 420 424 428 423 401 367 340 331 334 341 346 348 344 333
1053 333 321 313 309 309 313 320 322 320 317 318 319 316 304 289 283 295 318 334 331 319 318 328 336 337 345 366 378 358 315 280 271 276 279 278 281 293 308 323 337 347 350 342 325 311 308 318 327 323
1047 323 309 301 304 307 301 291 292 303 317 326 332 335 332 322 309 304 315 342 373 394 395 379 356 342 350 376 402 413 408 401 402 406 406 400 386 366 348 341 345 354 362 370 377 377 368 361 363 366 360 349
1041 349 342 340 333 320 307 295 278 254 234 228 238 263 293 319 338 356 379 400 405 388 364 347 337 333 337 350 364 370 378 399 428 441 423 390 367 369 387 405 413 412 412
1036 412 425 451 473 474 456 439 436 441 436 420 401 389 383 377 368 358 346 334 329 332 336 329 309 285 271 276 294 312 320 321 323 333 345 345 329 309 298 299 301 296 286 286 303 331 356
1030 356 365 360 349 338 327 320 321 328 336 343 357 376 389 378 345 310 292 291 288 268 235 209 211 242 283 307 310 305 305 311 317 317 308 291 272 262 266 280 292 295 291 287 289 299 320 346
1025 346 369 378 375 370 369 369 360 342 329 333 354 374 374 360 349 355 371 382 385 385 387 393 402 418 436 439 418 385 365 369 387 404 415 420 415 402 397 415 451 482 487 472 454 446 449 459
1019 459 468 473 478 496 531 571 595 598 595 602 622 647 671 688 693 684 663 639 617 592 561 530 514 516 523 516 492 464 443 430 417 397 375 356 340 324 311 310 324 346 366
1014 366 382 399 414 418 411 405 410 421 424 419 412 404 392 379 378 394 414 425 429 435 437 418 382 349 339 348 365 389 418 439 432 399 361 341 340 341 331 318 315 328 344 352 353 356 360
1008 360 358 355 363 384 403 406 401 404 416 422 421 421 425 423 410 392 374 356 343 344 361 377 379 372 369 366 355 344 345 359 374 387 399 408 401 378 361 364 381 392 392 391 394 401 411 424 436
1003 436 439 429 416 410 411 409 397 376 355 346 347 349 344 330 313 300 301 321 358 402 444 476 491 479 440 387 344 324 324 332 340 345 346 343 336 335 347 369 386 385 368 350 345 349 351
997 351 344 332 328 341 368 389 387 367 351 352 365 373 367 348 323 300 290 294 303 308 314 328 347 360 367 375 388 399 400 393 387 386 392 404 416 420 415 404 387 368 361 379 416 447 458
992 458 460 476 505 527 527 514 506 511 523 533 533 522 504 486 475 475 478 473 456 430 407 391 386 388 395 399 395 384 375 375 378 376 364 348 338 337 348 367 384 385 368 346 330 325 327 332
986 332 338 345 348 342 330 321 326 345 368 383 391 401 413 415 398 373 360 361 365 366 375 397 420 428 422 416 419 424 421 416 412 411 411 416 431 448 456 452 445 444 453 465 472 469 457 439 422 413 416 436 469
980 469 500 513 499 468 438 417 411 418 436 453 457 450 441 441 446 455 472 505 551 589 601 581 541 498 461 437 424 420 421 427 440 459 474 481 479 474 465 455 451 461 487 519 550
975 550 585 628 673 701 701 679 649 622 595 569 546 538 547 566 578 574 559 545 537 533 533 548 581 621 641 632 608 588 578 571 564 562 566 571 571 572 583 601 619 630 634 633 635 646
969 646 670 701 733 763 792 815 830 840 855 877 895 902 905 913 924 933 939 953 982 1018 1049 1069 1082 1096 1111 1117 1104 1077 1051 1042 1051 1070 1094 1127 1164 1187 1186 1175 1180 1213
964 1213 1257 1289 1304 1320 1346 1374 1399 1431 1482 1536 1567 1564 1550 1553 1584 1638 1700 1757 1798 1830 1875 1947 2039 2134 2227 2324 2427 2526 2624 2729 2842 2952 3058
960 3058 3174 3321 3500 3696 3892 4088 4295 4536 4823 5150 5501 5866 6245 6645 7073 7538 8052 8625 9260 9961 10739 11605 12572
957 12572 13651 14855 16187 17646 19239 20985 22899 24971 27180 29508 31942 34450 36970 39426 41749 43884 45780
955 45780 47381 48621 49430 49767 49627 49033 48019 46622 44890 42889 40687 38347 35930 33492 31090 28766 26550 24467
953 24467 22537 20776 19191 17765 16473 15294 14220 13250 12370 11565 10835 10186 9611 9084 8583 8109 7676 7288 6941 6630 6350
951 6350 6092 5848 5613 5387 5170 4967 4786 4625 4472 4308 4136 3974 3836 3721 3619 3526 3442 3365 3281 3179 3058 2933 2823 2736 2665
947 2665 2600 2536 2478 2430 2389 2344 2289 2222 2151 2086 2038 2008 1990 1975 1952 1913 1856 1795 1749 1721 1691 1646 1597 1559 1528 1486 1433 1386 1359 1345 1331 1318 1312 1310 1303 1289
943 1289 1277 1276 1282 1282 1264 1229 1193 1173 1167 1161 1146 1126 1111 1104 1100 1092 1079 1060 1042 1029 1024 1023 1024 1033 1049 1061 1057 1043 1031 1024 1015 1002 995 993 981 954 926 915 919 919 904 883 870 875 900
938 900 938 976 1002 1013 1014 1004 980 943 907 880 860 839 815 792 774 762 755 757 765 776 780 775 766 757 752 751 758 771 783 783 776 773 778 777 754 718 689 682 692 710 732 750 753 736
932 736 708 683 668 665 670 678 681 673 658 643 635 638 648 657 663 666 669 670 660 641 622 614 618 629 640 642 629 605 588 592 616 643 662 670 670 662 644 617 586 563 559 574 592 594 582 569
927 569 563 558 548 545 562 595 622 627 618 610 611 617 620 619 623 639 668 700 722 726 723 730 754 785 808 819 823 821 813 801 789 779 762 737 712 694 681 664 640 616 597 583 580 591
921 591 608 614 598 572 551 542 536 528 517 503 491 490 511 546 571 569 543 512 492 486 488 491 491 486 486 497 516 530 528 518 512 517 532 547 557 557 550 546 551 556 558 560 573 596 618 632
916 632 643 648 640 615 590 583 592 604 613 620 624 616 597 583 585 592 590 578 566 554 534 505 482 482 506 538 567 589 611 634 649 650 644 643 648 649 635 611 588 569 552 539 534 536 537
910 537 531 525 527 535 544 548 546 535 520 511 513 516 509 494 488 502 529 553 563 561 550 537 527 520 509 495 483 483 494 510 523 529 527 515 502 500 510 522 527 529 538 555 570 578 573 556 527
904 527 497 479 474 467 451 434 430 441 454 455 444 433 431 435 440 448 459 474 487 493 490 480 467 458 461 478 503 529 554 578 601 622 636 638 626 607 592 586 581 569 550 533 523
899 523 523 529 532 527 513 498 493 497 503 505 506 512 530 561 591 607 606 598 590 579 564 552 549 559 576 593 606 609 606 607 619 631 633 627 631 651 679 700 707 696 670 650 657 687 716 729
893 729 732 739 747 750 755 772 796 812 816 815 815 820 832 853 878 899 913 920 917 902 883 878 889 903 907 902 890 871 845 820 806 803 805 808 804 787 762 738 724 716 708 699 695 691 683 675 673 676 671
887 671 653 635 631 648 674 695 703 703 705 715 726 734 737 742 747 750 753 767 794 830 867 902 936 968 994 1010 1016 1012 1004 1000 1006 1023 1048 1076 1108 1143 1188 1247 1320 1400 1476 1550 1630
882 1630 1722 1822 1926 2039 2171 2324 2495 2685 2899 3139 3396 3662 3942 4232 4516 4766 4965 5105 5175 5154 5038 4849 4621 4372
879 4372 4107 3831 3561 3309 3078 2864 2669 2496 2338 2189 2054 1945 1861 1783 1697 1608 1533 1481 1442 1404 1363 1321 1280 1239 1193 1138 1075 1017 978
876 978 960 954 951 944 925 894 865 859 872 885 883 875 873 868 848 820 802 800 802 800 799 802 802 799 806 828 844 834 801 772 764 769 767 748 719 696 690 700 714 724 733 745 759 768 768 768 770 767
870 767 754 731 713 708 712 718 722 732 750 765 762 743 721 708 706 713 730 748 752 738 721 719 727 727 718 712 721 739 753 758 753 742 731 728 740 767 797 815 814 799 785 776 766 745 712
864 712 678 653 641 643 650 652 644 632 628 639 657 674 685 693 700 703 701 694 686 682 681 681 680 678 669 652 630 613 604 596 584 570 559 557 570 601 634 652 653 655 673 691 693 688 701 729 748
859 748 740 716 691 669 650 643 648 652 643 628 623 632 642 646 645 639 637 647 672 699 712 709 702 700 698 691 684 682 688 700 709 712 718 737 760 763 734 695 676 680 692 705 728 759 779 778 768 766
853 766 768 762 749 741 742 747 751 751 746 735 724 718 713 704 701 714 743 769 777 771 763 757 750 748 754 761 754 730 706 698 707 727 748 766 775 773 764 757 756 756 755 757 770 787 799 799 789 781 780 782 781 776 774 780 788
846 788 786 774 765 765 765 755 744 750 777 808 828 833 834 840 852 869 881 881 863 831 792 756 730 720 719 719 715 716 731 759 787 804 808 799 783 766 759 766 787 814 838 850 851 846 843
841 843 845 855 876 904 932 949 952 948 947 951 953 942 918 897 892 902 915 921 926 933 937 933 923 917 915 912 903 894 892 891 886 881 889 916 948 963 957 944 938 942 953 968 989 1017 1045 1063 1065 1056 1049
835 1049 1062 1092 1119 1125 1119 1124 1149 1182 1208 1226 1235 1222 1181 1131 1102 1105 1123 1139 1148 1153 1160 1173 1193 1213 1221 1218 1220 1236 1264 1288 1304 1312 1314 1315 1320 1334 1352 1364 1361 1350 1344 1349 1359 1362
829 1362 1355 1340 1325 1312 1295 1272 1244 1214 1184 1159 1144 1141 1150 1168 1190 1202 1198 1179 1154 1133 1122 1128 1148 1167 1170 1157 1142 1130 1115 1099 1098 1117 1139 1138 1115 1095 1094 1109 1127
824 1127 1140 1147 1151 1156 1160 1152 1128 1101 1084 1077 1067 1050 1039 1043 1055 1070 1090 1117 1148 1177 1201 1215 1208 1184 1156 1135 1117 1097 1077 1061 1043 1025 1018 1028 1042 1045 1040 1042 1051 1054 1048 1046 1054
819 1054 1059 1057 1059 1075 1094 1105 1111 1131 1167 1198 1208 1197 1178 1158 1140 1130 1129 1133 1134 1125 1109 1094 1087 1091 1106 1130 1153 1169 1173 1170 1166 1162 1157 1156 1165 1184 1198 1196 1179 1163 1162 1179 1204 1224
814 1224 1231 1227 1215 1199 1180 1165 1170 1197 1230 1250 1251 1249 1255 1268 1282 1292 1296 1293 1283 1264 1235 1194 1156 1138 1149 1175 1196 1204 1204 1206 1209 1210 1211 1217 1232 1254 1272 1279 1273 1263 1256 1255 1258 1263 1274
808 1274 1292 1317 1345 1372 1398 1418 1429 1423 1408 1404 1424 1458 1479 1469 1435 1397 1370 1354 1344 1335 1324 1315 1312 1311 1306 1294 1283 1283 1289 1294 1299 1312 1340 1375 1402 1413 1409 1397 1386 1386 1393 1397
803 1397 1387 1364 1340 1328 1329 1338 1350 1363 1375 1384 1390 1397 1410 1425 1435 1430 1411 1389 1376 1373 1379 1386 1394 1409 1432 1453 1458 1449 1447 1463 1486 1497 1495 1492 1496 1497 1491 1486 1489 1492 1487 1475 1467 1464 1458 1447 1440 1449
797 1449 1471 1500 1529 1556 1578 1588 1583 1569 1559 1561 1572 1582 1579 1565 1549 1539 1539 1550 1567 1585 1602 1620 1635 1642 1638 1630 1630 1640 1656 1668 1669 1664 1662 1672 1687 1699 1703 1707 1716 1722 1713 1688 1664
792 1664 1658 1668 1679 1682 1678 1678 1683 1696 1715 1734 1737 1717 1685 1663 1669 1694 1718 1735 1750 1774 1803 1827 1838 1836 1826 1817 1819 1833 1854 1871 1880 1883 1887 1898 1912 1916 1902 1881 1872 1880 1890 1895 1905
787 1905 1929 1954 1960 1947 1924 1894 1860 1834 1834 1855 1872 1871 1866 1873 1891 1911 1932 1955 1976 1984 1981 1980 1989 2009 2032 2043 2029 2000 1982 1987 2005 2014 2013 2014 2022 2024 2015 1999 1991 1995 2009 2024 2027 2020 2020
781 2020 2042 2079 2109 2114 2099 2075 2052 2041 2049 2070 2084 2086 2090 2113 2144 2164 2170 2177 2196 2215 2217 2199 2176 2161 2160 2173 2197 2225 2248 2260 2262 2259 2258 2263 2273 2282 2284 2282 2286 2307 2338 2363 2372
776 2372 2367 2356 2347 2343 2345 2350 2351 2351 2357 2373 2389 2398 2404 2417 2432 2439 2437 2445 2470 2501 2525 2538 2543 2539 2532 2536 2553 2566 2557 2536 2527 2536 2548 2551 2547 2544 2538 2527 2518 2518 2527 2539 2550 2559 2559 2549 2541 2546 2563 2583
770 2583 2603 2624 2643 2652 2650 2650 2661 2680 2697 2702 2697 2691 2694 2701 2702 2692 2685 2696 2724 2752 2773 2794 2825 2860 2882 2882 2870 2859 2854 2854 2853 2852 2856 2868 2890 2919 2954 2989 3016 3024 3012 2993 2982
765 2982 2984 2992 3001 3012 3024 3040 3056 3069 3075 3070 3059 3048 3041 3034 3026 3022 3027 3041 3060 3085 3123 3170 3210 3231 3228 3212 3191 3175 3169 3170 3172 3169 3161 3151 3142 3141 3158 3190 3225 3250 3266 3274 3270 3250 3223
759 3223 3209 3211 3217 3221 3229 3248 3269 3281 3284 3286 3285 3280 3278 3285 3298 3304 3305 3314 3337 3369 3400 3425 3437 3430 3413 3407 3421 3442 3457 3468 3482 3496 3504 3516 3537 3560 3575 3586 3604 3628 3646 3653 3661 3671
754 3671 3677 3675 3676 3684 3691 3698 3719 3756 3791 3799 3783 3766 3763 3771 3789 3817 3839 3834 3802 3769 3763 3779 3798 3809 3817 3828 3844 3861 3876 3882 3878 3875 3891 3924 3955 3966 3954 3933 3920 3918 3927 3940 3947 3946
748 3946 3942 3947 3963 3981 3995 4004 4009 4003 3982 3954 3940 3948 3972 4001 4030 4052 4063 4066 4069 4078 4091 4104 4122 4143 4150 4132 4101 4083 4093 4115 4128 4127 4121 4116 4114 4122 4141 4166 4186 4197 4200 4196 4190 4192
743 4192 4212 4244 4271 4289 4305 4319 4326 4323 4321 4332 4347 4346 4324 4296 4287 4308 4346 4379 4391 4385 4375 4370 4375 4385 4395 4397 4389 4373 4363 4374 4407 4447 4479 4497 4501 4498 4493 4491 4489 4478 4458 4438
738 4438 4424 4416 4408 4406 4423 4457 4494 4522 4544 4572 4604 4627 4629 4611 4584 4564 4555 4549 4538 4520 4504 4495 4494 4492 4485 4475 4469 4470 4475 4479 4477 4467 4459 4462 4480 4503 4518 4524 4531 4547 4568 4580 4576 4568 4574 4598
$$ [...]
-1604H49
##END=	
##END=	
