##TITLE=	INyV6ylNQGeoHFULDHyX4w.41.ser
TM-VI-391, CDCl3, cosy

##JCAMP-DX=	6.0	$$ MestReNova 14.3.0-30573
##DATA TYPE=	LINK
##BLOCK_ID=	1
##BLOCKS=	2    
##ORIGIN=	Mestrelab Research S.L.
##OWNER=	hrzepa
##$MNOVA/LINK_BLOCK_TYPE=	ITEM	$$ NMR Spectrum
##$MNOVA/ITEM/POLYGON=	(XY..XY)
5321,5835
8722,5835
8722,8208
5321,8208
5321,5835
##$MNOVA/ITEM/Z=	0
##$MNOVA/ITEM/ANGLE=	0
##TITLE=	INyV6ylNQGeoHFULDHyX4w.41.ser
##JCAMP-DX=	6.0	$$ MestReNova 14.3.0-30573
##BLOCK_ID=	2
##DATA TYPE=	MNOVA NMR VIEW DATA
##DATA CLASS=	MNOVA VIEW DATA
##$MNOVA/2D/THRESHOLD=	130.0057373046875
##$MNOVA/ITEM/ZOOM/X=	-0.98001264966690615488,	11.003459999979801509
##$MNOVA/ITEM/ZOOM/Y=	-0.98001264966690615488,	11.003459999979801509
##END=	
##TITLE=	INyV6ylNQGeoHFULDHyX4w.41.ser
##JCAMP-DX=	6.0	$$ MestReNova 14.3.0-30573
##BLOCK_ID=	3
##DATA TYPE=	nD NMR SPECTRUM
##DATA CLASS=	NTUPLES
##NUMDIM=	2
##ORIGIN=	Bruker BioSpin GmbH
##OWNER=	nmr
##.OBSERVE FREQUENCY=	400.41200205000001233
##.OBSERVE NUCLEUS=	^1H
##.SOLVENT NAME=	CDCl3
##.PULSE SEQUENCE=	cosygpqf
##LONGDATE=	2022/06/22 02:22:04.000
##.ACQUISITIONMODE=	SIMULTANEOUS (DQD)
##$ORIGINAL FORMAT=	Bruker XWIN-NMR
##$MNOVA/SCALES_VERSION=	9
##$PARAMETER FILE=	(acqu2s, ASCII, /private/var/folders/f6/rjf_tdyn2v98c5c0wvkgn4s80000gn/T/INyV6ylNQGeoHFULDHyX4w/41/acqu2s, 0)
$$ ##TITLE= Parameter file, TOPSPIN		Version 3.2
$$ ##JCAMPDX= 5.0
$$ ##DATATYPE= Parameter Values
$$ ##NPOINTS= 121	$$ modification sequence number
$$ ##ORIGIN= Bruker BioSpin GmbH
$$ ##OWNER= nmr
$$ $$ 2022-06-22 02:30:59.603 +0100  nmr@CZC10666PP
$$ $$ /opt/topspin/data/agmb/nmr/Jun21-2022/41/acqu2s
$$ $$ process /opt/topspin3.2/prog/mod/go
$$ ##$ACQT0= 0
$$ ##$BF1= 400.41
$$ ##$FnMODE= 1
$$ ##$NUC1= <1H>
$$ ##$NusJSP= 0
$$ ##$NusT2= 1
$$ ##$NusTD= 120
$$ ##$O1= 2002.04999998732
$$ ##$SFO1= 400.41200205
$$ ##$SW= 12.0068636381483
$$ ##$SW_h= 4807.69230769231
$$ ##$TD= 120
$$ ##END=
$$ 
##$PARAMETER FILE=	(acqus, ASCII, /private/var/folders/f6/rjf_tdyn2v98c5c0wvkgn4s80000gn/T/INyV6ylNQGeoHFULDHyX4w/41/acqus, 0)
$$ ##TITLE= Parameter file, TOPSPIN		Version 3.2
$$ ##JCAMPDX= 5.0
$$ ##DATATYPE= Parameter Values
$$ ##NPOINTS= 12	$$ modification sequence number
$$ ##ORIGIN= Bruker BioSpin GmbH
$$ ##OWNER= nmr
$$ $$ 2022-06-22 02:31:03.983 +0100  nmr@CZC10666PP
$$ $$ /opt/topspin/data/agmb/nmr/Jun21-2022/41/acqus
$$ $$ process /opt/topspin3.2/prog/mod/shimcntl
$$ ##$ACQT0= 1000000
$$ ##$AMP= (0..31)
$$ 100 100 100 100 100 100 100 100 100 100 100 100 100 100 100 100 100 100
$$ 100 100 100 100 100 100 100 100 100 100 100 100 100 100
$$ ##$AMPCOIL= (0..19)
$$ 0 0 0 0 0 0 0 0 0 0 0 0 0 0 0 0 0 0 0 0
$$ ##$ANAVPT= -1
$$ ##$AQSEQ= 0
$$ ##$AQ_mod= 3
$$ ##$AUNM= <au_zg>
$$ ##$AUTOPOS= <42 >
$$ ##$BF1= 400.41
$$ ##$BF2= 400.41
$$ ##$BF3= 400.41
$$ ##$BF4= 400.41
$$ ##$BF5= 400.41
$$ ##$BF6= 400.41
$$ ##$BF7= 400.41
$$ ##$BF8= 400.41
$$ ##$BYTORDA= 0
$$ ##$CAGPARS= (0..11)
$$ 0 0 0 0 0 0 0 0 0 0 0 0
$$ ##$CFDGTYP= 0
$$ ##$CFRGTYP= 9
$$ ##$CHEMSTR= <none>
$$ ##$CNST= (0..63)
$$ [...]
$$ 0 0 0 0
$$ ##$ShimPowMaxUC= (0..63)
$$ 130000 130000 130000 130000 130000 130000 130000 130000 130000 130000 130000
$$ 130000 130000 130000 130000 130000 130000 130000 130000 130000 0 0 0 0
$$ 0 0 0 0 0 0 0 0 0 0 0 0 0 0 0 0 0 0 0 0 0 0 0 0 0 0 0 0 0 0 0 0 0 0 0 0
$$ 0 0 0 0
$$ ##$ShimPowMaxUG= (0..63)
$$ 524287 524287 524287 524287 524287 524287 524287 524287 524287 524287 524287
$$ 524287 524287 524287 524287 524287 524287 524287 524287 524287 0 0 0 0
$$ 0 0 0 0 0 0 0 0 0 0 0 0 0 0 0 0 0 0 0 0 0 0 0 0 0 0 0 0 0 0 0 0 0 0 0 0
$$ 0 0 0 0
$$ ##$ShimPowRcbType= 3
$$ ##$ShimPowRes= (0..63)
$$ 1e-20 1e-20 1e-20 1e-20 1e-20 1e-20 1e-20 1e-20 1e-20 1e-20 1e-20 1e-20
$$ 1e-20 1e-20 1e-20 1e-20 1e-20 1e-20 1e-20 1e-20 0 0 0 0 0 0 0 0 0 0 0 0
$$ 0 0 0 0 0 0 0 0 0 0 0 0 0 0 0 0 0 0 0 0 0 0 0 0 0 0 0 0 0 0 0 0
$$ ##$ShimPowRng0= (0..63)
$$ 1 1 1 1 1 1 1 1 1 1 1 1 1 1 1 1 1 1 1 1 0 0 0 0 0 0 0 0 0 0 0 0 0 0 0 0
$$ 0 0 0 0 0 0 0 0 0 0 0 0 0 0 0 0 0 0 0 0 0 0 0 0 0 0 0 0
$$ ##$ShimPowRng1= (0..63)
$$ 1 1 1 1 1 1 1 1 1 1 1 1 1 1 1 1 1 1 1 1 0 0 0 0 0 0 0 0 0 0 0 0 0 0 0 0
$$ 0 0 0 0 0 0 0 0 0 0 0 0 0 0 0 0 0 0 0 0 0 0 0 0 0 0 0 0
$$ ##$ShimPowRng2= (0..63)
$$ 1 1 1 1 1 1 1 1 1 1 1 1 1 1 1 1 1 1 1 1 0 0 0 0 0 0 0 0 0 0 0 0 0 0 0 0
$$ 0 0 0 0 0 0 0 0 0 0 0 0 0 0 0 0 0 0 0 0 0 0 0 0 0 0 0 0
$$ ##$ShimPowRng3= (0..63)
$$ 1 1 1 1 1 1 1 1 1 1 1 1 1 1 1 1 1 1 1 1 0 0 0 0 0 0 0 0 0 0 0 0 0 0 0 0
$$ 0 0 0 0 0 0 0 0 0 0 0 0 0 0 0 0 0 0 0 0 0 0 0 0 0 0 0 0
$$ ##$ShimSysFunc= (0..63)
$$ 1 2 3 4 5 7 9 11 15 16 8 10 12 14 6 17 13 18 19 20 0 0 0 0 0 0 0 0 0 0
$$ 0 0 0 0 0 0 0 0 0 0 0 0 0 0 0 0 0 0 0 0 0 0 0 0 0 0 0 0 0 0 0 0 0 0
$$ ##$ShimSysMatrix= 0
$$ ##$ShimSysType= 1
$$ ##$TFXNUM= 0
$$ ##$TRIPLO2= 0
$$ ##$VTU= 2
$$ ##$VTUETH= <149.236.99.20>
$$ ##$VTUTY= <no>
$$ ##$WBREFAM= (0..15)
$$ 135 116 100 100 100 100 100 100 100 100 100 100 100 100 100 100
$$ ##$WBREFLM= (0..15)
$$ 0 0 0 0 0 0 0 0 0 0 0 0 0 0 0 0
$$ ##$WBREFPH= (0..15)
$$ 71.66 -68.25 0 0 0 0 0 0 0 0 0 0 0 0 0 0
$$ ##$WBSGU= (0..15)
$$ 0 0 0 0 0 0 0 0 0 0 0 0 0 0 0 0
$$ ##$XFAC= 2
$$ ##END=
$$ 
##$DECIM=	4160
##$DSPFVS=	20
##.ACQUISITIONSCHEME=	NOT PHASESENSITIVE
##NTUPLES=	nD NMR SPECTRUM
##VAR_NAME=	FREQUENCY1,	FREQUENCY2,	SPECTRUM
##SYMBOL=	F1,	F2,	Y
##.NUCLEUS=	1H,	1H
##.OBSERVE FREQUENCY=	400.41200205000001233,	400.41200205000001233
##VAR_TYPE=	INDEPENDENT,	INDEPENDENT,	DEPENDENT
##VAR_FORM=	AFFN,	AFFN,	ASDF
##VAR_DIM=	512,	512,	262144
##UNITS=	HZ,	HZ,	ARBITRARY UNITS
##FIRST=	4405.895418600002813,	4405.895418600002813,	0.082440681755542755127
##LAST=	-392.40686505384644533,	-392.40686505384644533,	0.19622084498405456543
##MIN=	-392.40686505384644533,	-392.40686505384644533,	0.0018473722739145159721
##MAX=	4405.895418600002813,	4405.895418600002813,	19605.740234375
##FACTOR=	1,	1,	0.0059611350088952718904
##PAGE=	F1=4405.9
##FIRST=	4405.895418600002813,	4405.895418600002813,	0.082440681755542755127
##DATA TABLE=	(F2++(Y..Y)), PROFILE
$$ [...]
##PAGE=	F1=2208.63
##FIRST=	4405.895418600002813,	4405.895418600002813,	0.40368404984474182129
##DATA TABLE=	(F2++(Y..Y)), PROFILE
4406A06L8k3l7O0n8m4J48j03L9j2m6l5O7mrN2Kk9p3R0o7k1O2m7k1J53j61lJ3R1o3J16q8k3
4087G0K0mk9N4m4j2R2k1o4qQ2m3n2J0m4Q9o1M6k1NJ09j16N0o8N2n7j4mR7r8M8O2p7O3j1M3
3749A44j13M9Rk1rj3M2l2j6J03m1k5J1K7p4RK9L7k5K5o4J3M2l9N4j4n7J0pl5J9J12mLRl4N1
3401A75j21N0P0K2j13J82O0k16Q56J008Q57j076r8R046j293O27r222l37P8K66N04M64M161
3185E950K46j65m963o04l28J716J516k108m75J503j803J453m78l54J723p13p78R75j604K010
2997B719j015j442P04Q8J79r44L49M03m05k43k27O0p9J49j38ol7%n9J63j98R3k8J8N0J1j01
2744F4J20j4k9Q4K67k08L5P04L34P572l918l539p83m68J27l44J61K1Q6p1L53k03k42o9J36
2509A76k1r0L4m2j8qL5J01r0K7r5J13q2O1J0k3l9k9M8m6MJ4K2km2N4n7Q9Nr2M5l5N8n8K2P2
$$ plain form
4406 106 144 121 84 144 86 42 190 87 126 114 68 33 100 96 87 139 141 112 39 129 62 41 103 56 35 188 27 24 37 128 65 181 93 70
4087 70 90 86 57 111 67 55 147 126 62 54 136 93 41 51 7 96 35 81 60 65 174 58 108 40 92 35 21 17 114 16 64 126 49 112 101 144
3749 144 31 80 89 68 59 46 88 56 40 143 102 77 88 115 41 50 79 116 91 116 52 65 107 68 122 108 51 61 54 19 38 150 146 149 158 124 175
3401 175 54 104 174 196 83 265 325 109 965 1973 2830 1754 1656 10702 9409 10036 814 477 555 821 1325 1789 5950
3185 5950 6196 6031 1068 464 136 1852 3368 1260 785 2288 485 1938 1460 1106 2829 2116 1338 2313 709 2719
2997 2719 1704 262 966 1054 1233 289 638 1041 636 393 166 226 147 296 158 152 115 115 56 219 21 114 86 104 154 165 64
2744 64 184 170 141 225 492 284 319 1023 1357 8929 5011 1472 689 221 348 4 165 186 272 201 554 351 109 40 176
2509 176 155 65 99 57 39 31 66 167 77 104 9 122 40 101 111 88 49 20 68 22 26 40 62 60 18 72 15 104 109 17 62 27 85 27 49 121
2171A21j02jP2j4l4Q7q4N8m1lKK0mO3j28N6m7Q3K6q4J8M5m9Ok2PJ8L1k0M9n8n1M8L2o5J43
1833A78j68M9L9N0p6P4q1J7P4l9oj9K9j0L5m1n0Qk0J3l4NL9K6o4j1M3P4m3m6J9O7n1J0j1K9
1495A08j8K7m9kql4P4q1J01rJ9p0J7K2j1L1m4l0K0l2M4K8m2m9N4n6P3j7L3p0O4j7K2k6k7j3
1157C2Q6o6j4L1M2M5j33M1J8N7p4k5M7kk6J0J5j1K0Lm1J2j9J1M5L4q3O4o1M6oJ4m7L4l9k6
819C4L1pj4L8n5nJ1O1j4m6lK2j4J7J0k0jj8J8J01P3K08K7N9m50J0M5r5J06k3J48K48J40m60
500A82L4K99k27J12R2O9Nl14k22J01n2n1J31n8K5j6q4R4o0l1K9k6N9m1J1jO3o9K3P0l5q6%
190B6P9l1lll0J1L9Q8Jp4j4M8r4k0O3p4J6K29l2j45J9j8L3m9k4M2n2Ql0J30p6J3p2J11p0M2
-148H7l4oN2j4j5j6j7M3n6J09k8K8m2n2N3o3J63j71R8k2J01j22K5m3K3L5
$$ plain form
2171 121 19 18 90 76 42 129 45 103 62 59 61 81 77 140 12 68 21 104 130 46 64 109 60 66 44 51 69 100 80 129 71 20 68 100 35 178
1833 178 10 59 98 148 72 146 65 82 156 117 111 92 121 111 146 105 55 63 43 56 22 27 66 92 28 17 60 134 91 45 64 131 80 90 79 108
1495 108 90 117 68 66 58 24 98 17 118 109 128 58 75 97 86 117 73 43 63 31 75 103 61 12 66 10 83 66 99 29 93 76 98 72 45 32
1157 32 118 52 38 69 111 156 23 64 82 139 65 40 87 85 59 69 84 73 93 96 55 67 48 59 104 138 55 119 58 104 98 112 65 99 60 34
819 34 65 58 44 82 27 22 33 94 80 34 31 53 39 56 66 46 45 27 45 146 219 427 454 513 63 73 118 23 129 106 254 502 642 182
500 182 216 515 288 400 492 561 566 252 30 131 79 28 159 101 126 110 26 120 60 29 58 32 91 50 61 60 123 54 77 147 112 26 26
190 26 105 74 71 68 38 49 88 176 177 103 89 137 43 23 86 12 28 257 225 80 99 81 114 65 41 83 31 39 9 139 63 76 4 115 45 87
-148 87 53 47 99 85 70 54 37 80 24 133 105 133 91 39 92 29 192 21 119 97 198 76 101 58 81 116
-392A16
##PAGE=	F1=2189.85
##FIRST=	4405.895418600002813,	4405.895418600002813,	0.46696823835372924805
##DATA TABLE=	(F2++(Y..Y)), PROFILE
4406B15rj2k6M4j27kJ84j07l6N4k9j09Q6j7J7Q6o3j2q0J24j64P4K6Mq5J68j54j5PR8p6J81
4105B45j99M8jj2l4Q0l4o7J55p2n8pP6nk6k2QM8r0Q1p5O5P7j04K0k5M4q3kM2Q7j02J9P7r3
3777F1N6L3pm6L0l3pk6m1R5Mn8J07p7lNL4j09J22j6K3m8K6r5O6R4o6M9j1j10J4NL0J7J23o3
3439A78M7n6q3J61m4L3J10k7j27J2R3M8K20J643J424q85P10J7508j878J037j7153j614J69
3223A526k50J053Q90Q308M225J439p915o950o44K73K50j603K027J766l456Q25j300l60J683
3044A787J785L32P52l084J219l60j948l6k6J59R3K18M36p84m55J78L4j06Onn0Rl8q4J74j71
2800C5R1j4K5K3M1j28Q5k6rJ15K10j88J44O11O81P995l958m617l56n46J18k59P5O4N2mK72
2547E32j75k55m8J49o2m6J0n2mjJ5J17j31R3j33P0n8N0O0o9lk6M2l0j3J8J6J0n6N9o5Q5J0
$$ plain form
4406 215 206 194 168 212 85 83 267 160 124 178 149 40 126 109 126 212 149 137 57 181 17 91 117 121 36 204 50 35 42 140 64 245
4105 245 46 94 93 81 47 127 93 26 181 109 51 44 120 115 89 67 75 123 33 114 39 104 181 77 97 72 116 33 31 73 160 58 77 154 61
3777 61 117 150 143 97 127 94 87 61 20 115 119 61 168 91 88 93 127 18 140 124 147 99 125 30 96 190 124 173 162 52 66 71 101 118 241 178
3439 178 225 169 86 247 203 236 346 319 192 204 297 345 565 2208 3632 2747 3457 20965 19087 20124 2971 1357 1526
3223 1526 1276 2329 3219 11527 15752 17191 9276 2326 1682 1955 2205 602 2629 4395 939 1764 464 104 1787
3044 1787 3572 3904 4656 1572 2791 2431 483 447 421 580 673 891 1327 543 88 266 300 194 200 195 145 154 116 32 206 35
2800 35 126 112 137 160 201 73 158 132 123 238 448 260 404 1015 1696 9691 5733 1116 760 214 332 73 148 212 264 260 532
2547 532 357 102 54 203 141 95 105 53 49 48 63 180 49 142 9 79 21 71 131 62 59 33 75 45 32 50 66 76 20 79 14 99 109
2237A09r7O9k5QjmM8p4oQ1n2jQ9j17O0m0NPM2k2Q1j24L1n9J10Oo4K0J7p%n6L6kM0o0P8n5l3
1871C8N1m5J9J36j64J7N1M7r3J12j03N2L5l9k2PQl5O5l3m5J6j4k6j2L6l3O7o2j6M9J00k7q4
1551E3K3P4p1K6rJ1j0N0r1J3k3mL7m0N2M9j3m0k8J8j1M7k5o9O0o2M4N0k3n8M0l9M9j4J7k2
1213F1O5q3Q4o1j3j2O6l4l8L4P6j5j00L4M1J7j5o0mM8j5K5qj7K3j8k6kj2RP2j1m0K5n0P9k4
866A01L2n0O2p1k0oK2m4O3n3K3k4P3l6l8J3JK9l0J3k0oj2MJ18R9K97L8L1n71K3L4n7J18m0
537A16J23K06J42m04J21L26k27K0R4o5O3k51k50J16oq0J51p9pj7k2Q3j21M6k1lL8l8L9o0J01
246A34q9N4N4l4r3j4J17j2k2lo2L3j5J65k9m8p6P0p7k7M7Lj5J85j15j3Qn2Q9r2K0K4o6m6K0
-83B3J36k8p1MP8j09P3k4l3R3n9M8l8j3N3p9O8N2pj1p0P6j16J77j04P5j3J03j57JK5%K4
$$ plain form
2237 109 12 81 56 64 63 59 107 33 27 108 56 55 144 27 87 47 52 59 101 79 160 36 67 8 118 124 60 80 97 90 90 34 70 68 108 48 126 71 38
1871 38 89 44 63 199 35 52 103 150 57 169 66 118 153 114 92 99 107 72 137 104 59 75 61 35 23 59 26 93 31 15 64 164 137 53
1551 53 76 150 79 105 96 107 97 147 56 69 46 42 79 39 91 140 127 87 59 77 66 113 88 19 79 17 61 111 88 30 70 31 80 66 83 61
1213 61 126 43 127 66 53 41 107 73 35 69 145 130 30 64 105 122 107 47 43 91 76 101 93 76 99 81 55 53 41 50 122 111 71 96 46 125 101
866 101 133 83 145 74 54 48 70 26 89 36 59 35 108 72 34 47 48 77 47 60 40 34 22 26 144 243 540 578 609 38 61 95 38 156 116
537 116 239 445 587 183 304 630 403 423 517 452 515 264 14 130 124 44 195 116 109 92 70 153 32 78 57 54 92 54 93 33 134
246 134 45 99 153 119 26 12 129 117 95 92 30 63 48 213 184 136 60 130 53 26 73 76 61 246 131 118 126 74 163 71 91 115 49 3 23
-83 23 159 131 60 64 142 33 106 82 49 142 83 131 93 80 133 54 122 174 167 156 86 162 46 223 119 194 181 284 127 128 153 153 177
-392A77
##PAGE=	F1=2171.07
##FIRST=	4405.895418600002813,	4405.895418600002813,	0.31524309515953063965
##DATA TABLE=	(F2++(Y..Y)), PROFILE
4406B94j5k7k5L9j46L3J61r9k8L0oj22M2mL7J13j27K9q6J09j77J01J9L4j11J30j14m6L7O9
4124A44n4J98k48N9Rk3m6J31l5o8J22q1n9%N3L6On7L9Qj05J08j22J28M5q3j8K4J8j06N5M8
3824A26P0q9k4Q8q8K4Q5n3J6Mn1j8km5R7L8n4N7j05J3K1N3j06J62o5L2r3M7j02J04J24q5L7
3514B18rj34J5K1Q0L6R5r3M5o8j44K78K7OJ39o5j23j14J44K57m74K272J855m98J650K6689
3270C2105k206J499k5492l668J27o57J055Q96Q543O951K969o919j1093j036M08J535l236J521
3101C302J239l278n09N56j03m00M416J945Q70l978k444O25j643L9R2K2N57M8M80p73n11q6
2894D66m9K8k31J4r9M9o2q9J32r3O0mK8nQ1j71N0j5L5J00J53j31K16N33Q95P909l908n051
2631H41p3m86Nj36k0J04JM3J57j04k38k2J40q2j6mn0oK4lJ02j30J27j50J7k5K4J06q9OKJ6
$$ plain form
4406 294 279 252 227 266 120 153 314 215 187 217 211 89 131 127 164 277 150 179 93 202 25 126 145 179 68 198 84 38 75 144
4124 144 90 288 40 99 108 85 39 170 135 67 189 108 49 49 102 138 144 87 126 134 29 137 15 143 188 105 87 111 129 23 78 126
3824 126 196 107 83 171 83 107 192 139 155 159 108 90 88 43 140 178 124 181 76 89 110 163 57 219 154 186 93 140 38 142 266 181 218
3514 218 209 75 90 111 191 227 322 229 274 206 62 340 367 373 512 447 324 210 354 611 137 2409 4264 3766 5416 32105
3270 32105 29899 31398 5906 2238 2365 1708 2763 3659 12202 19153 22122 15203 4110 3074 3482 5017 1781 3302
3101 3302 4541 1263 754 1310 1207 807 5223 7168 8038 4060 1616 2241 598 637 729 751 1308 1356 1836 1063 552 466
2894 466 417 445 214 228 129 178 116 27 159 66 126 122 150 145 226 55 105 90 125 225 378 247 463 996 1891 9800 5892 841
2631 841 768 282 287 151 131 235 236 279 436 332 94 72 212 130 114 110 60 54 78 75 177 47 174 24 41 16 40 146 57 63 65 81
2331H1j7j9K9nK8m6K7m3N5J2p3P0jn9M8l1L5n5OP6q5K9R6j23L9m6J4K0N0l9J03j21J8p0J18
2002A21j6k6O%L0Jq5N5j3L1q4R9m1j6N1m0J0J21j37k0N6M0j10J50j16Q0Ko0k5L9j3m1N6J4
1683A19m4j1Qm5RP0r5P7l0l5M7J18j4j18L4O8q5K4J3k0KQ5j29J4k0J5jJ0OR2m0k2o4J4NM7
1345A04pq4P4o7K9O6mo2K2k2K1jqL8N0j40J30q0j1lM6lm6K2J07o9p2L6N8k9M5q7l3P0J3K5
1007A28k5k4M0n4Pk4j6QR5m7jj0l3Q4k4L1m6R2j07Nm4M5o4O7j1J8n3Q0m8j4joN8p3O6p0%R
650C8j3J10J08M00Pj3o31M0QJ3J15p0J09J45J57l42K03L12j99l2J81j84n2j62k25J04K3o8
387H2J30q3m0pK6O6j65J05m2Lj0NN0p7Q6q1O5L1Mq0o1J58j1l8Jm9%J9J46m7m0r0N4m3njO7
40A28l7J31j39O2jr0J43j05M0jo4l3J3J24Rr4J7N7j16P6J7o2J02p2P1n6kN1o5M5P8l6K7j04
$$ plain form
2331 81 64 45 74 69 97 51 78 35 90 102 29 99 98 39 87 56 91 36 42 118 33 62 158 35 74 28 42 62 112 73 176 55 73 3 121
2002 121 105 79 85 85 115 116 31 86 73 104 20 119 78 62 113 73 83 204 67 47 103 143 33 183 67 147 149 89 64 103 90 49 105 119
1683 119 75 64 72 27 36 106 11 88 58 23 70 188 174 56 90 158 73 97 110 90 92 177 48 62 42 57 56 66 72 164 124 102 38 52 57 104
1345 104 97 13 87 20 49 115 111 49 71 49 70 69 61 99 149 9 139 59 48 45 91 88 42 64 171 102 30 66 124 95 140 53 20 90 103 128
1007 128 103 79 119 65 72 48 32 40 135 88 87 77 44 128 104 135 89 181 74 79 35 80 16 83 72 90 37 117 69 55 54 48 106 33 99 29 29 38
650 38 25 135 243 643 650 637 6 46 54 67 182 112 221 366 523 181 384 696 497 465 646 462 410 248 23 127 150 82
387 82 212 129 89 82 108 174 9 114 72 75 65 70 120 43 129 48 113 144 148 68 7 165 154 116 117 68 68 87 233 186 146 56 110 67 62 61 128
40 128 91 222 83 145 144 54 197 92 132 131 67 34 47 171 180 86 103 160 44 120 137 75 177 105 176 120 118 169 104 149 227 191 218 114
-280A14R5j02J41m3M5j8J17j69nM6%K9
$$ plain form
-280 114 209 107 248 205 250 232 349 180 175 221 221 250
-392B50
##PAGE=	F1=2152.29
##FIRST=	4405.895418600002813,	4405.895418600002813,	0.22302924096584320068
##DATA TABLE=	(F2++(Y..Y)), PROFILE
4406C06j4n0k8M5j46N5J28p9Nj9Oj13JK5L9J36j63O3j11R3j28P7K5M8j12O4o7o8P1L4nJ75
4105B93k39K2K7k5l0J51l6p5P6o2n4J4J6O9K6p8L7lq9R9j10J39J0o1m2O5j9q8P3N6M2o7o0
3796G7J07r2rJ35q1M6j4m9l5N3o6P8O7n4J9j15J9N0O5j01J73j13N4j26Q0p6R2J35r6J8J1j33
3495A19J4K8J07M3O7j01J8k6j56L14P7j7J51q1j14j77J96L90k57J976K034k1K549L4945k173
3260C9905J996l2664o349j18o60J85J19K925O243L888j123r996j155L42L198m609L2L02j246
3082A215l60J505o22N73M237L595J575m351m911j327p79O59J86J24K11j44N20p37l87k83j13
2885C86J10k27l5j33Q8r7pJnL6rL4l4J25k15J3J4J08L3J15j02L15L97R01O968l603m470J1
2622G18l45j54qq9J16m5O1P3l7j98JJ04o9rrm1j9O4j8N9p5J08j53j0pnJ42p7j3J6Jj0mL2l2
$$ plain form
4406 306 292 242 214 259 113 168 296 217 222 203 209 96 97 122 161 297 134 197 86 179 51 128 153 201 89 153 86 18 89 123 118 293
4105 293 54 76 103 78 48 199 163 88 164 102 48 62 78 147 173 95 132 129 40 139 29 168 178 117 75 140 121 33 106 162 204 137 77
3796 77 184 92 83 218 137 183 169 120 85 138 72 150 217 163 182 67 86 136 201 100 273 160 214 88 168 92 184 319 223 241 252 119
3495 119 133 161 268 311 378 277 295 269 113 427 504 487 638 557 443 266 462 852 595 2571 4605 4584 7133 42078 39905
3260 39905 41901 9237 2888 2770 2110 2295 2414 5339 11582 15470 14347 4351 3196 3538 6736 2127 2159 2461 1215
3082 1215 855 2360 1738 2311 6548 10143 11718 7367 2456 1129 350 1009 1195 1319 1530 1386 1906 1169 782 499 386
2885 386 496 269 234 101 189 92 85 86 81 117 108 142 108 233 18 31 45 153 186 301 199 514 911 1812 8780 5177 707 718
2622 718 373 219 211 122 238 193 254 327 290 92 93 197 128 119 110 69 50 114 96 155 80 188 35 25 18 13 155 78 65 81 82 72 68 100 68
2293F8N2n6Kj8L6J4m0M9K0j09P7n8M0m1K2O0j01M4J06j22K7m1PK9N0n4J12j07J6p4J04l1R
1983I2j7NM8J3j05O0k2J3n7P5j2k1N5J4m4J00j11m0M6M6j29J76j27J05j7r8j1O7l7J0k6J00
1683A51o5n2M1m5J7R2j02M4J1n6L4J18Kj38M7N6r0PN2o4K2J11j46NmJ8l4O1k5J03m6k7q0J0
1364B8L8K3Jo4N7m4NO6J4o6J1j4mJ9k9R1K3j36J13p4k8J2L4J3l9%J30j00m8L7O0o5R1j00k0
1035C5N3L9J8l6k6N2q3K2j1l7NJ04o2K9l2rM4kJ5l5J13j36L7o4N2o3M1M3no6Q0m1qk0J9M8
697A13r2J09j02oK7j7Q6J00M92o3p0n12m1oO9J01r8J16Q1J71k86K75K67j90k7L05j76k96j34
425A96j76J09J7l8R2n8p2J5M4M8j70J21m0Jq1P3M8o5L8o7P4J9M3p9q9J72%m7Qk6m6O3R6l9
105A84o0n1Mj0J0k9J07o6R1q8N9j2j09J73j06M6k6n6Lj8J16K6p8qM5j00O8N0q4J04q8Q0n6
$$ plain form
2293 68 120 64 66 48 84 98 58 107 127 18 95 37 77 36 58 118 17 61 167 45 72 31 38 67 117 63 175 68 84 10 114 83 92
1983 92 75 80 128 141 36 96 74 87 30 105 93 72 127 141 97 197 86 46 92 138 9 185 58 163 146 48 37 104 67 77 51 151
1683 151 86 34 75 30 47 139 37 81 92 36 70 188 190 52 99 155 65 72 124 60 82 193 47 52 48 66 32 93 68 171 125 98 18 28
1364 28 66 89 90 26 83 39 44 110 124 58 69 55 51 70 41 132 155 19 132 58 30 42 76 89 50 50 180 80 32 69 129 64 155 55 35
1035 35 88 127 145 109 83 135 52 74 63 26 31 135 73 102 70 61 105 103 118 83 196 60 97 33 85 22 63 106 101 35 115 74 66 46 65 113
697 113 21 130 28 22 49 32 118 218 710 647 577 65 24 18 87 188 90 206 287 458 172 447 714 524 497 802 626 330 196
425 196 20 129 146 108 200 142 70 85 129 177 7 128 88 89 8 81 129 64 102 35 109 128 171 92 3 175 175 128 136 110 64 127 223 184
105 184 124 73 77 67 77 48 155 89 180 92 151 139 30 203 97 143 117 61 64 46 162 188 110 102 147 47 115 165 81 185 97 177 121
-205A21oN4l2K1P9o1N6j39J10p9J12jPk6J34j85LN0J4K8
$$ plain form
-205 121 115 169 137 158 237 176 232 93 203 124 236 235 242 216 350 165 168 218 232 260
-392B60
##PAGE=	F1=2133.51
##FIRST=	4405.895418600002813,	4405.895418600002813,	0.2866992652416229248
##DATA TABLE=	(F2++(Y..Y)), PROFILE
4406B46k6n1m4M6j17O2Q6m8M6o2Lr2l1N9K8J49j41O7j52R2n1K0L3N6q7j5j2j1K3jM7J32j72
4096H2m8N1l1L2J07k6r0M8m2j3Ql2Q9K5o5JK8m6M3n9J08k3l7m3J03p7k4L6O8Mk8n8J18j28
3777H1k8J70r0M6j4k2n0J08j21N8R0n3Op2pO0N9r5J72j43P9j04P1m9N5J32q4j4O0j19OJ4J13
3467C15L8N7q9pL4j58K92J01k3J51o8q8k04K12M49O8J569J954M39L216M0608j770K485l7186
3242A2395r218m90r7j505o56P947q88J272m282j952p56pL492m319l80J598j142Q24O27j039
3054A424K125L576M947K730m391n104l557j414N30K87J71j44k97M93o98m5l05p6P0r6j3j45
2847F8J56j89J18j50P0L0k4M3m3J49j43k4m6J72n1J19j43M71J43Q18N367l129l103n3j71l17
2603A38R6r5P7o6N6M7j3j46J8M2k9rj1k7m3J18l7l%P4j45ok0J1J32o1k9J0LlK0J9n7P5q0o
$$ plain form
4406 246 220 169 125 171 54 116 202 154 200 138 141 49 18 77 105 254 113 180 28 120 69 89 122 178 91 76 64 53 76 75 122 254 82
4096 82 34 85 54 86 193 167 77 125 83 70 78 46 135 160 95 96 124 78 121 62 170 147 110 67 170 93 69 105 173 177 149 91 209 81
3777 81 53 223 133 179 165 143 93 201 80 138 228 175 181 109 102 162 221 126 298 155 234 130 201 152 207 339 255 241 301 182 188 202 315
3467 315 353 410 321 314 348 190 482 583 560 711 643 555 351 563 1012 1080 2649 4603 5042 8258 48866 47096 49581 12395
3242 12395 3177 2687 2590 1085 429 8376 7488 8760 4478 2526 1770 1763 5255 936 556 2154 1012 1836 2463 1424
3054 1424 3549 7125 12072 14802 10411 5307 1750 336 866 1153 1324 1180 883 1376 678 633 328 252 322 226 213 68
2847 68 224 35 153 3 73 103 79 122 79 228 85 61 15 187 136 255 112 583 726 1544 6911 3782 679 626 455 138
2603 138 234 139 216 150 206 253 240 94 112 154 125 116 105 78 35 153 116 113 113 187 42 36 16 27 159 98 69 79 82 79 99 118 61 136 56 50
2265E0J4J9K7k2RM2j23Q0q4N7k3J9M2q9M3J11j30M4k9j7K9N5p5J07p3Po9Q0l7L9m5K7M4L4
1946A63j19N3l1okL1K3m4N5P2q5P9r6m8K6O4j08J47j36J25j6j17j3Q5o8Q4j01J71j08l9L2
1655G3l1QR7r4K8M5p1jJ03K2j34N5M4q7j5R4j16M9J24j41LlJ3l8Q6m0Q6k8n5o8K7M2okl8M8
1317G9k6K2J8L5p5J1ql2M4l5J23j3j07P4m4l9OL2Rk1j3J29j03j4J9M4o9J00q7j1N1M1J2m2
997A10k3N3p9lL2o5J5Q1n3N0n1K0l1L8kk3J13j44O9o3M2m3nQ7l5n7O9j6k8l6P5%q0J18q6l
659D6JoN6P7N54j60j12l18j07J7M7O8q8J12M4J54k39L40K08k11K4M11j08m31k71q2J10k6N
387A15M6jr7L1L1L6j35R6j8ml0PL8m9j0l1O2L6M7p7p6J31L4m7K0j4q1P2N2oj02J8m8JJ8l6
49B9J23r4O1l2M8k4o9J38j09N0k8o0N2n9R9K7m8l3K6l3K2O5q8R5j08P8j6m8O8J0k2P6n4N0
$$ plain form
2265 50 64 83 110 88 97 139 16 96 12 69 46 65 107 18 61 172 42 86 57 40 69 124 49 156 83 90 21 101 64 103 58 85 129 163
1946 163 44 97 66 60 58 89 112 68 123 195 110 189 93 45 71 135 27 174 38 163 147 30 17 102 34 118 17 188 80 41 73
1655 73 42 50 147 53 81 126 55 54 157 179 45 100 144 57 42 136 20 69 193 52 55 52 65 27 113 73 159 131 76 8 35 77 71 69 31 79
1317 79 53 75 93 128 53 64 56 24 68 33 156 143 36 110 66 27 33 65 74 53 40 169 66 52 71 115 46 146 59 48 99 140 152 110
997 110 87 140 61 58 90 25 40 121 68 118 67 87 56 94 92 69 182 38 107 44 86 43 38 125 90 33 102 86 58 22 97 97 17 135 49 46
659 46 47 41 97 174 728 568 456 138 31 48 95 163 75 187 231 385 146 486 694 483 507 918 810 379 108 26 136 110 115
387 115 161 160 63 94 125 161 26 122 104 100 70 77 115 66 56 25 87 123 170 93 17 148 182 135 155 141 60 132 184 178 76 94 46 47 65 29
49 29 152 58 119 87 135 111 42 180 71 121 93 33 85 26 125 152 104 71 97 64 86 151 63 158 50 128 112 64 132 142 120 196 142 192
-270A92j73J16m8Q5K2l3l4J52k05J1M7L0J8
$$ plain form
-270 192 19 135 87 172 194 161 127 279 74 85 132 162 180
-392A80
##PAGE=	F1=2114.73
##FIRST=	4405.895418600002813,	4405.895418600002813,	0.13899178802967071533
##DATA TABLE=	(F2++(Y..Y)), PROFILE
4406A75p7O3o2m6N9n7PKQ4l4k2n9N6q2K1J37l2K3r3J5K8q3M1O9m6oRM2q2%N1Q2m5o9L2m9Q3
4058A35J8kj01P6m7M3k5n5O5Lj2k9P4j5m0K1M2m8%k0J28j39L4l3Q9l6L0j5J07j92j1J64q2
3749A27L0J8Qo7J44j96M3J10m2J5j3l3L9L2q4J71j35Q5m8K1k0lJ26m1n6J24j10nj9J05K9O8
3448D23n8pO3j69K39J03kJ46l4n3k10J76M39L38J201J689P98L505M2440j095K894l8088j1581
3232C157m80N59k148K695J9935Q081J411k0323j0668k47J901j028j187J964J654m067N64l41
3063A432m39K612L208N661L837m441m800l669k345m49L97j43m36l13N93n20M9n4J35r5j48
2866G2J16j23K16k42J78j47k8M5k1M3JJ22o0l2q3J49r9J46j43N53j77Q13L797k717j664k03
2622E12pm45J51l5Jo7M7P1m2r2L1l2J9%j3rn8J58o5o5P5M2j40K5m4L6J07n7l0j0K4J1K7lp4
$$ plain form
4406 175 98 161 99 53 112 55 62 64 148 114 92 33 89 7 28 165 133 156 63 78 106 23 64 133 87 81 90 132 50 50 101 183 138 69 101 52 135
4058 135 153 151 50 126 79 122 97 42 107 110 98 69 143 128 88 109 151 103 103 83 211 72 106 73 162 126 156 141 248 56 45 209 127
3749 127 157 175 183 116 260 64 107 217 175 190 177 144 183 215 131 302 167 252 204 225 205 202 328 287 231 355 245 240 221 326 355 423
3448 423 365 358 421 252 491 594 592 738 704 651 441 617 1056 1394 2595 4284 5082 8587 51027 49932 52826 14738 3157
3232 3157 2677 3236 1088 3783 23718 31799 33210 12887 2219 1972 3873 2845 1658 3622 5276 1209 1773 1432
3063 1432 993 3605 6813 12474 16311 11870 7070 3401 1056 607 1004 861 425 112 705 185 234 180 315 220 72
2866 72 188 65 281 39 217 70 42 87 66 109 110 232 172 140 57 206 107 253 110 663 486 1299 5096 2379 715 512
2622 512 505 60 211 176 177 110 157 228 186 94 125 93 112 112 99 90 32 190 125 60 135 177 37 62 18 54 161 104 74 64 88 99 126 123 49
2293D9R2j05LN2nN2l2m0O7j15Q7p4L2Mj0L1n9L8J11j50Q1k9m0L1O5j04R9k9j9m2M4l5O4n7
1974E7L8K3N8j20L2l4j9N0oM7o8L6J30j01O0q5o1K6O1o9R3j31J37qq6l8P9r2J41q3J44j52
1673E9L3k3j8qQ7o4K5O6p0p0P8M9j02N2M0o8l7J11j18L2J26j20J1k0KlP3m1N0Mr1l3N1J4k6
1345E1noM6k6O5o2O1q3J5J2m6M3l3J37n5p1M2nj8l7L5j6J0NQ2q7K9j0J0l7O8m2j2O4J4J4m3
997A09j9M8m9n4Q6r9M6K4k5O7p1N1j05O4J1l4R1j22R5m6J7j1k8P8o0k5N5Mo1j9J12n3n7R7
678A17m6K1n5J7K5N5N68k55p4j70j23lJ7J8NL3P2Q7k03L80J60k47R4M75m5m18m79M0P9q4M8
387A09MO6j00K4mL8q5O1J6j1L5r0K0k7l1M5pP5Op0l6N4R4m4M0k8q0K8K6M7j36Q3o3j6mmR1
40A26p0J1oM5k0MN6j24O6L5o9M5k7kK0j7Oj8N4m8L8l6N4q1K9O8r0N1L3q7Q7L4k8m8n3L0K6
$$ plain form
2293 49 141 36 39 91 86 138 106 66 133 18 105 31 63 67 57 88 29 67 178 28 109 80 40 71 136 32 131 102 83 41 85 50 114 57
1974 57 95 118 176 56 88 54 35 85 79 126 58 94 224 123 183 98 37 63 124 55 148 17 154 146 60 22 101 9 150 67 211 59
1673 59 92 69 51 43 130 66 91 157 87 17 95 144 42 94 134 66 29 140 22 54 180 60 71 51 53 50 123 82 132 136 45 12 63 77 51
1345 51 46 40 86 60 125 63 124 41 56 68 22 65 32 169 114 43 85 80 62 25 60 44 54 59 141 54 83 73 83 46 114 72 60 124 138 152 109
997 109 90 138 89 35 121 22 68 92 67 134 63 114 9 73 84 50 141 19 114 68 85 74 46 124 64 39 94 98 37 18 130 77 20 117
678 117 71 92 37 54 79 134 702 447 373 203 80 77 94 112 117 150 222 309 106 486 646 399 493 968 923 505 26 66 145 61 109
387 109 113 179 79 103 99 137 52 113 129 118 153 63 83 56 25 70 63 138 144 74 38 92 186 142 182 154 74 102 128 175 39 122 59 43 39 35 126
40 126 56 67 61 106 86 90 146 22 88 123 54 99 72 70 90 73 79 61 115 67 105 69 123 42 71 139 49 100 133 46 133 167 139 91 38 68 94
-308I4Nj9j6J32q6m6m8J8l
$$ plain form
-308 94 99 80 64 196 110 64 16 34 31
-392C1
##PAGE=	F1=2095.95
##FIRST=	4405.895418600002813,	4405.895418600002813,	0.06741072237491607666
##DATA TABLE=	(F2++(Y..Y)), PROFILE
4406B02j21J91o0o2P2r1l2PL1N4k2o1P7j13K9l2J05qk6k2L7r8j6O7pN0JM9j46N3l6M0P8o7
4087A23J7m5P5o7L2q7J14n5O2n9l2jk8N5PN6jj17J17l8o5M8j1J52j62L6r0J04o2R0J9R1k37
3777D1L1J18o8J5O4J7q6J60k46J9J37k5K1K5l9J4j3o2J70j03P3jl7J6o9J24Rq0J65j11pn8
3476B14R3K2Q7k4J4N2j83J77Q9M6J35%k2k08J12L72N24Q97J339J010L368L9979l09L124l5199
3242A5709j2677O33N81k359L866K5786J7085L904k2477k4007j343L355j11l388P94P21m571
3082A501p47k63J328M60L601N188M444m723m056l135k127l3J08l80p41P8M78m1m02j19K8L9
2875D86l55M4o7K08k11J61j50o3K8mK6N8Q4ql5j11J13q3J31l8M96l95Q94K553k241p54l78
2622C89J17m32O9O8o9p7P1J26j16o4M2o2K9J4k5J7k7J47j02r3J21J5j46Q0o6N4Q6p3k6j6M4
$$ plain form
4406 202 81 272 212 150 222 131 99 106 137 191 169 108 185 72 101 69 174 166 140 118 155 57 41 108 101 151 152 201 55 108 72 112 190 123
4087 123 140 95 170 103 135 48 162 107 169 110 78 77 49 104 111 167 166 49 166 128 63 111 100 252 90 126 36 140 78 168 187 278 41
3777 41 72 190 122 137 201 218 132 292 46 65 202 177 198 223 184 198 185 123 293 190 263 262 225 241 172 296 305 225 390 279 272 214
3476 214 307 329 416 392 406 458 275 452 541 587 722 722 700 492 604 976 1500 2397 3736 4746 8114 48093 47784 50908 15709
3242 15709 3032 3665 4246 1887 5753 31539 48624 52528 30051 6044 4701 8056 7945 4557 5351 6072 1501
3082 1501 754 491 1819 2279 5880 11068 15512 10789 6733 3598 1471 1438 1546 1166 425 503 981 940 538 419 447 486
2875 486 131 175 108 316 105 266 116 53 81 77 103 161 245 237 202 91 204 121 252 214 710 315 1209 3762 1521 767 389
2622 389 506 74 143 211 142 65 136 262 146 82 124 62 91 105 80 97 70 217 115 22 143 158 12 92 26 80 166 93 67 51 95
2331I5L7Mk4p1R2j15K3P2k8Q1o0p8Q8j01J02p1J2L4o0L5j9K3J15j73J11l3n6M1O7j22R3Ko1
2021E5J2Ll2Q6n2K4J4O4r5qk6rO7k1M2o4j4J84j01M1o0q3O2Mj3K8q6J24qo3l5O5m7J13q0J14
1683B05j47Q9q3j3j9O6j7J6Q1m4r0k6P6m8L5M6l1n6Q9p1k0J25j03J6j5l0M7M5l2RL0j08lO6
1364H5j9l1MK4K9j5R2j41Q8q2J8L4m4K5l9J44r6k8K3K1kn2K3m5M0L4J9p7P8l8k9OK3J1kO3
1025A44k3L0m3k1N6l1p7J12j24P6m3J7P2q3P0o4k8O3p5N7p0J03k4j5K7l1L5o8mO2lp0L2R6
706A55o8o1O7j6N4r2K8PM7N31l01P6j98r7l9ml6J29r6J88l1j80L71J31k57J41N10j8l45m68
425A28j9M1j10P1k0R6r0J5m7N3m9M5M4%N8j51j2JLN3m2R0m5o1kmJ42n1P3o1n0m6K5R4j06R0
86A56p8Pl7J5L6Kk6K0j3J5L6mj04O5R0p2nL8r3jJ5O9j9N1o7k8M1J9k5lQ4m9%lq6P5J06p0K9
$$ plain form
2331 95 132 136 112 41 133 18 41 113 85 166 106 28 116 15 117 46 58 92 32 67 48 71 186 13 124 91 35 76 143 21 114 116 55
2021 55 67 70 38 124 72 96 110 174 79 71 45 36 103 82 124 60 46 230 129 170 110 27 89 93 80 108 22 146 138 75 40 105 58 171 91 205
1683 205 58 147 64 51 32 98 81 97 178 134 44 18 94 46 81 127 96 40 129 58 38 163 60 76 61 31 78 123 91 100 130 22 19 85
1364 85 66 35 39 63 92 77 169 28 116 34 52 86 42 67 28 172 76 48 71 92 90 38 61 16 56 90 109 32 110 72 43 49 72 83 81 144
1025 144 121 151 108 87 143 112 35 147 23 99 56 73 145 62 132 68 40 103 28 85 15 118 94 79 106 75 110 42 38 100 97 27 59 155
706 155 87 26 93 77 131 39 67 74 121 652 351 427 229 132 93 89 53 182 86 274 243 63 434 565 308 449 959 941 596 128
425 128 109 150 40 111 91 187 97 112 65 118 69 114 158 158 216 65 53 54 57 110 68 158 113 52 50 46 188 137 210 149 99 53 78 172 66 156
86 156 78 85 48 63 99 101 75 95 82 97 133 129 25 90 180 108 103 141 48 47 62 131 112 163 96 68 109 128 103 100 184 135 135 132 46 121 227 157 186
-280A86q5M1k9q3J32RL5M3n5l3o3K2
$$ plain form
-280 186 101 142 113 30 162 171 206 249 194 161 98 120
-392A20
##PAGE=	F1=2077.17
##FIRST=	4405.895418600002813,	4405.895418600002813,	0.087464980781078338623
##DATA TABLE=	(F2++(Y..Y)), PROFILE
4406B54j36K21q3j4J6q8Jj8J3P1k1p0P1j14N7j30J47J6l4oK9r2l4O2J3K4M2K8j38N8q0J4J25
4096B04o7PqL3r2O3r2J23m5N4p2ql2k7P0L4J3K0j73K10r4q7Q6k3J72j53pm6O4o8J29LP8k00
3777F9L4P4n5J1Q9qr1J57k12l9J71k9K1K4k2J0o5k2J65j00P6J5p5N4j27J39K2n4J51j25J1
3486B69q3Q7J9R3j1L9J8j77J21P9J03J06J2nj98M8K76O30O71R74J079K882L3665M11L080k9201
3242A4987j1994K457P70n322L239J6841K0057O158j1150k8144k173M385K411o337j865j241
3091C079j833P81%N19j167M552K438M699m275p17m954k008J203k18r7j247k19P08j51k14l18
2894E61j91K41l11j56L9J33j63J40j63%m1KKJ05N4Qk1j42R5n3P5O1M04l63R09R38j278r6n37
2622B52J98k91r3J63q4r0J21J21j16j04K9J1m4J9o5P4K8R4j39k0Q1k6o0O5q6P3O0j03l1K0
$$ plain form
4406 254 118 339 256 242 258 170 171 153 166 237 216 146 217 103 160 30 177 193 159 153 182 90 56 118 131 155 197 225 87 145 65 79 204
4096 204 137 144 136 169 77 140 48 171 126 180 108 100 68 41 111 145 158 178 5 215 121 34 120 97 269 116 109 63 127 59 188 191 269 69
3777 69 103 177 122 133 222 214 123 280 68 29 200 171 192 216 194 204 139 117 282 182 258 273 198 252 125 264 286 232 383 258 269
3486 269 186 273 292 385 374 413 431 254 375 454 557 663 675 670 472 520 796 1426 2097 3071 4150 7032 40697 41108 44188 14987
3242 14987 2993 5450 6220 898 4137 20978 41035 47193 36043 7899 5726 10111 12522 6185 4320 3079
3091 3079 1246 2027 2027 2546 1379 5931 8369 13068 8793 8076 3122 1114 2317 2099 2002 755 536 1244 1093 879 561
2894 561 370 611 300 144 183 316 153 293 130 130 89 91 93 198 252 260 239 97 192 139 214 275 679 316 1225 2163 885 789 252
2622 252 450 159 66 229 145 55 176 297 181 77 106 117 73 92 27 101 129 223 84 64 145 119 59 124 38 111 171 68 37 57
2340E7M2P0n0l1l6O4j03M9N4l4R8r7k0L2m8O6q4K8O1j17N0K8j9J32j66Q7k6m8M5M6q5O8lr4
2021A6P8l5k0Q3m3oN0K9m2n8j6K4M8j4Ok7n7K03j00K2j7o9O4p2N2m2k5J13k9o2LN1nQ2r4P0
1683A61o9J12j39j9j8L6L4pQ4J3p9n3j2RK5K7K2p1M2k0n6J24j05J1M2q2Q4K1k4k2K9n1j5N9
1364I3m5j8QN0j4M6O6j53O8o0J8L0l7K0m9J44j26J7J3J9Jj8rl1K4N2k6n8R8o1l3J0kM2L5K6
1025A40n6P7n9k5Q4m3o9J04r9O4q3N3N5p9P3l2j03J17j12L0k9J05%n2O4l5Mn4k4R4l8k4M6
716I4O8n2o4L6k0Q0p7POM1M81k42J84l52k0o7j7o4K01j27K77j30k12K94J12k08J36N42pk99
434F01l84q3J2j03J00k7N1p4J4n8N8n1P2L8N4J3j49l5K0pN9k9O7o2m3j8J7J26q6J27r9mj00
124A7L3J02p3J03j30O5m5mK7K5m2J05j10L6L4pr6Q4P2m8p8J14j14k9N6M9RJ9n7l3L1L6l3K1
$$ plain form
2340 57 99 169 119 88 52 116 13 62 116 82 180 83 63 95 47 113 29 57 118 1 51 79 60 192 26 113 87 39 84 130 45 113 110 16
2021 16 94 59 39 122 79 73 123 152 110 52 36 60 108 94 100 73 16 219 119 141 124 55 119 47 99 57 32 145 116 54 57 108 103 185 91 161
1683 161 92 204 65 46 28 64 98 91 175 188 109 56 44 53 78 105 127 56 98 78 22 146 41 52 94 12 96 117 93 71 100 49 34 93
1364 93 48 30 38 88 74 120 186 33 101 41 59 89 52 72 23 167 41 58 71 90 91 73 64 33 57 109 83 25 123 62 29 39 37 79 114 140
1025 140 84 161 102 77 161 118 49 153 54 118 35 88 143 64 137 105 2 119 7 37 8 113 113 61 125 90 94 40 16 110 72 48 94
716 94 162 110 46 82 62 142 65 72 78 119 600 358 542 190 170 103 86 22 223 96 373 243 31 325 437 229 365 907 900 601
434 601 217 134 146 43 143 116 167 93 107 49 107 56 128 166 220 233 84 49 69 62 121 92 159 97 54 36 53 179 93 220 121 117 17
124 17 50 152 79 182 52 117 72 68 95 120 78 183 73 109 143 136 40 124 196 148 70 184 70 41 97 146 155 174 117 84 115 151 118 139
-195A39N7j0no8l0P8O4k2J1m3J0l5o6J42j2M6M7m7k3p2K9
$$ plain form
-195 139 196 186 181 113 83 161 225 203 214 171 181 146 80 222 210 256 303 256 233 161 190
-392A90
##PAGE=	F1=2058.39
##FIRST=	4405.895418600002813,	4405.895418600002813,	0.41201215982437133789
##DATA TABLE=	(F2++(Y..Y)), PROFILE
4406C26j14J64r2N1r2o9%JR2qk9%n1o6O3p8P6O8q0L9oj35m4J41M1j09J66n8m5l6j0J2Q4n9
4087A43rM5l3r0J30j30J13j3J7n9k5Pm6J27k4k7O2j04J48q2j03J06JJ18j37q4M7M2l3J31o9
3796A69N7q9rM0k7L4O9m8n0O9j18o9K02o0M6l0JK2j20M4J68j68J64m7n6L7j49J79k4P6N3j51
3495B15K4p9Q9L7R5l0N5l7j41N9R7J65O4Pqj91l7J89O94N37O37J013K215K4717R32K705k1438
3242A2585r430M272K392o819J038J2939r521M743O229j3126j920M834L924p053m747L001k906
3082D35L305j291R7K629N117j97M376l57L710r357q159K249n88K97j861j00P02m82K41l04
2894D62k80K72o3k69J85N0j19P7j75P2j04K3J3J06J4klj89J20m7O2M9L02j90J005j60K37o41
2631H07p19K68j09j48J24l3n2J23l1O0j63m4R4r5J7k6O3O6Lj71O8N5j11J13Qq9P9J0j30j4
$$ plain form
4406 326 212 376 284 335 243 174 174 175 267 259 230 230 179 113 176 98 174 242 162 201 195 60 16 157 198 89 255 197 152 116 106 118 202 143
4087 143 134 179 146 56 186 56 169 156 173 114 89 96 50 177 153 126 188 84 232 150 47 153 154 272 135 51 98 140 107 238 169
3796 169 226 137 128 168 141 175 244 196 146 215 97 28 230 170 216 186 187 209 89 133 301 133 297 250 194 231 82 261 237 313 366 215
3495 215 239 160 249 286 381 351 406 369 228 287 384 549 613 620 612 421 384 573 1267 1804 2441 3454 5669 30386 31318 34023 12585
3242 12585 3155 7427 9819 3000 4038 16977 7456 12199 18428 5302 3382 8216 12140 5087 340 3341 435
3082 435 3740 2449 2546 5175 10292 10095 14471 14114 17824 8467 308 2557 1969 2266 405 305 1007 525 766 462
2894 462 182 454 391 122 307 357 238 315 140 212 108 131 144 250 264 262 259 70 190 143 205 254 556 366 1371 1211 1448 807
2631 807 88 356 247 99 223 190 138 261 230 290 127 83 177 82 99 73 136 202 205 34 102 157 46 159 167 78 157 167 37 23
2349B3P9K9P8j23k3QL4q5R7j3LP0j29P2l4K5k0n4M6O5j14NQ4p4J49j25nQk0L4KOL9o6J4K5
2011A10n9MN6l2m6J36n5K5r8j0P1OJ1m6Pj5J39j11K2K4j4%p8O1j06M5J04n6q3O7J9L3O1p4
1692A18l0K4J45j64m4k4K6O8k6M7R3n9o9r3N4O0p8R5o5k9K6n3J12j15MJ17q6L9J7k8j0l3O7
1382A06l9J9n4J3k9R6p1J43k3r1J1k3K8j0lJ2l8J07j28N7J1j7j3O4p4qJ4N0l1J8K9q5J1k1
1063C1OJ8J12o3p7J55j02j0J17p2n3P8k7Jn4N2K1n2O8m3m6M7p0mJ8O6Qo1N8l9J0m8J1N3m5
734F4J8L4L0l4j8j4jM6j6m7K4KM77j25J75n43J15o4k9o3J87M4K31p6l65J20Q7j03Q7N71N7
443H71l56k62j16kj31K13m4o1n4J2j7O4q3J42n4J79j14r2k2L7p7R1OK5p5J9p7M1J08j28J72
152B15j46O2j20O6M2k5J15j53O0m0k3Q7m2k0K06j65k4lP7j19J47m9N2j72J53r1j3J01n4O3
$$ plain form
2349 23 102 131 209 86 63 71 105 20 117 104 107 177 48 120 86 111 91 37 83 148 34 39 123 49 198 73 68 76 56 90 92 98 137 71 85 110
2011 110 51 55 111 79 33 169 114 139 41 31 102 108 119 73 80 65 204 93 115 139 125 125 47 108 2 47 151 95 12 79 98 131 192 118
1692 118 88 112 257 93 49 25 51 119 93 140 233 174 105 12 66 126 48 143 78 49 75 22 134 19 23 140 54 93 110 82 72 39 106
1382 106 67 86 32 45 16 112 41 184 161 70 81 58 86 76 73 85 47 154 26 83 94 77 64 128 54 46 60 110 79 97 126 41 52 31
1063 31 37 55 167 104 27 182 80 70 187 115 62 140 113 114 60 112 133 81 149 106 60 107 37 33 51 117 125 64 122 83 93 45 56 109 64
734 64 82 116 146 112 94 80 79 125 109 62 86 88 565 440 615 72 187 123 94 31 218 262 493 417 52 172 259 156 243 814 871
443 871 515 253 137 135 4 217 173 112 58 70 53 117 34 176 122 301 187 95 73 110 33 124 130 155 80 99 22 63 171 43 215
152 215 69 131 11 77 119 94 209 56 116 76 53 140 98 78 284 119 95 92 169 50 197 148 200 28 181 90 77 178 124 187
-129A87mo9K9r4J13k0M4K8qJ5j73O9J15q6J22n7L3p9lK5N8m5J57o1Qm4m3m9
$$ plain form
-129 187 183 114 143 49 162 142 186 214 206 221 48 117 232 146 268 211 244 165 162 187 245 200 357 296 304 260 217 168
-392A68
##PAGE=	F1=2039.61
##FIRST=	4405.895418600002813,	4405.895418600002813,	0.54301893711090087891
##DATA TABLE=	(F2++(Y..Y)), PROFILE
4406F30k1N3k7J4j49o2p2N2J35p3k4N2k08j3kQO4N8m3K4q7j60RJ32O5r3J65j78N3k25J33L7
4105B47Q6m3rJo5j83K57j03J14mj9o9r1N0r2K67j01nN8p5j5J8o7J27N7J0j45q7j3Q5M8J23
3805C62r1k1J1q9j9N6R4L7l2j3j48m1m5K49m4R5n9m2j8k03J43K12j82K67j62oj28j21K52l1
3523B83K41m2j52o6r1Q4J23J48k1N0j17j30r6J87K61J02L5l5k04k75J02P87N37M33P70J504
3279D418J4773J181K022j3494n037N615N635m984P414O8026J9463j899p0915k4272k662j540
3129C744M659n891L188M604q883K514k769J374Q203Q757J549M142K260O408j5722j5395p65
2969A977p02M07r02N61r8q0p57j35K95l49K33k09K46M7j17l1j83P0j46R7O6Q9l0k4m4k69J96
2716B08n4K11j70K00K1J284K105o91k213p92J77M6j63J8N0JJ11l00L72k00j19J03q7M6M9J9
$$ plain form
4406 630 609 662 635 649 500 438 366 418 553 480 456 508 300 287 285 293 357 415 372 396 309 149 158 290 355 262 427 249 302 77 210 247
4105 247 333 290 281 282 217 34 291 188 302 298 279 210 119 169 77 344 243 238 296 221 206 224 157 284 341 351 206 119 106 191 239 362
3805 362 271 250 261 172 153 209 303 340 308 295 147 106 61 310 266 361 302 260 242 39 182 394 212 479 317 311 183 62 314 283
3523 283 524 482 330 264 173 257 380 528 507 557 440 310 214 401 662 764 799 764 560 285 387 1174 1711 2144 2914 4418
3279 4418 19191 20372 22394 8900 3863 9478 15113 10129 17543 85569 105032 103133 32218 7946 5284 3744
3129 3744 8403 2512 5700 10304 1421 3935 1166 2540 10743 19500 21049 25191 27451 33859 18137 2742 1977
2969 1977 1275 1682 780 1341 1243 1163 406 271 566 217 450 241 487 534 417 386 203 273 127 224 290 379 349 325 281 12 208
2716 208 154 365 195 395 416 1700 3805 3114 901 109 286 332 169 187 237 238 349 49 421 221 102 205 118 164 213 232
2472B32N8j06j42P3P7j30K25m7q0O1q1j27Q8Q2M0M2j47l7jL7m7J37p0N2j3j14R6n7R4p7K5
2180A43OM4j39k6J46p6J25p2q8K7j4J5k6J06K6j50J43q0p2L9M9nl0J50j31M6j10J1J10k6L2
1889A73m5m8K4R2j11O2K6N3j25J0j0m5L4R1m7l7K8o0O7N7J1q3j7J98j42j00m2O8P5j3k5J41
1589B60k8j15j08R2J26j73R2k8p4jJ2Q8m4K5O9p6n3M5l5M9n2J18o3l9n9M8k8R7l1J50j76J6
1288A04l5K1M6k5L2j1k5K6q3P8K7n2oJ06j83J8M5K7J4Q2n0q9N%q%J82j56j5J38j83O6J19o3
969A52m8N6L8j15L1L4lrP6j20M7p2K4m4Q3N9l0j2l5l5M0m0Q1l5L8j2j2k4k8Q9o4P4l4L2j18
640F4N5j06N40k9Q8m79P0l8l8n5J13K93J10J22n94m8N4m5J00M88K40n23j55p9nm8K40n8j63
368A14l0m7L5J16m3J44k62L78l26L0K4P3p1Q5M%j85J44n2NJ02j8L6j60J01j30J22qM4P1n9
$$ plain form
2472 232 290 184 42 115 192 62 287 240 160 221 140 13 101 183 223 265 118 81 80 117 70 207 137 189 176 62 158 101 195 118 143
2180 143 149 193 54 28 174 98 223 151 63 90 76 91 65 171 197 47 190 110 38 77 126 121 91 241 110 156 46 57 167 141 173
1889 173 128 80 104 196 85 147 173 226 101 111 101 56 90 181 134 97 125 65 132 189 200 117 100 298 156 56 14 82 157 144 119 260
1589 260 232 117 9 101 227 54 146 118 44 43 55 143 99 124 193 117 64 109 74 123 71 189 126 87 28 76 48 145 114 264 88 104
1288 104 69 90 136 111 143 132 107 133 50 128 155 103 97 203 20 38 83 110 124 206 156 67 72 72 64 64 246 90 75 213 30 96 215 152
969 152 104 160 198 83 114 148 145 136 212 92 139 67 91 47 130 189 159 147 112 77 117 77 158 123 161 149 137 113 85 174 110 184 150 182 64
640 64 119 13 553 524 612 133 203 165 127 72 185 478 588 710 116 68 122 77 177 665 905 382 227 148 143 95 335 277 114
368 114 84 37 72 188 145 289 27 405 79 109 133 206 135 220 224 224 39 183 131 136 238 220 256 96 197 67 189 181 225 296 237
77B37j04j4K2J17j08R3J63j48r2j30K36q9J76j68J54j37j1j2M8J08r4Q7Mj19O5j36J08R0L0
-195C76L1n9Oj46J03J12j01J67n7M7j56P3Q0J1kK21j43N5q2kj23
$$ plain form
77 237 133 119 141 258 150 243 406 258 166 36 272 183 359 191 345 208 197 185 233 341 247 334 338 219 284 148 256 346 376
-195 376 407 348 354 208 311 423 322 489 432 479 323 396 476 487 485 706 563 618 536 534 411
-392D11
##PAGE=	F1=2020.83
##FIRST=	4405.895418600002813,	4405.895418600002813,	0.38223555684089660645
##DATA TABLE=	(F2++(Y..Y)), PROFILE
4406A190M6K3K1n7j70j02j36O6J26p4qK8k75n7m5K9J01K9K5k4j57j75RJ14P7RJ23k39M2k74
4124B65J11Q3J57m8Nr4n5k53K79m8J70j8k7j30j27J9r2L81j11L3J7j07k35J66k2J83J06m3
3861E65j95o5j89J61J55J28l5q2%j75j19J79J71M3L0l9k83j30kL20L4J38l5j09j26l13K30
3608B57L04r6L19k31k1l63j15L65Q2L37n0j63j98j84N0K78K64M4N2j88k26l52L41M24K63J11
3364A304o0k69n69r6R64P00N50M00P61N453J096J156o574P46O342R644j539J6764J43234P0222
3176B50229K493j34427r2852r140p732P417p604K525L209j1478o24L19J230J4699J4727M136
3026C7127M620K671R230k4161k3590m915O02p53J224K77k83M81j460n48M37l78m2j19K78R2
2838G90j24j21k21k8j54K03J38R7m9m2j60k68J64j4M05l43J06J62J554L797j568l272p28K
$$ plain form
4406 1190 1236 1259 1280 1223 1053 951 815 881 1007 933 925 953 678 621 576 605 706 735 760 736 579 404 413 527 604 613 736 497 539 265
4124 265 376 459 616 568 573 479 424 171 450 402 572 554 527 397 270 289 197 578 467 500 517 410 175 341 319 502 608 565
3861 565 370 305 116 277 432 560 525 443 443 268 149 328 499 542 572 533 250 120 118 438 472 610 575 466 340 27 257
3608 257 561 465 784 553 532 169 54 419 501 838 788 625 427 243 293 571 835 879 931 743 517 165 506 930 1193 1304
3364 1304 1244 975 406 310 1274 1974 2524 2924 3685 9138 10234 11390 4816 5562 11904 21548 20009 36773 180007 250229
3176 250229 252722 118295 25443 16303 8571 15988 8384 10909 14118 2640 2016 2335 3565 18264 32991 37127
3026 37127 41747 44418 53648 29487 5897 982 1584 831 2055 2332 2049 2530 1070 522 959 581 539 420 698 790
2838 790 666 545 324 296 142 345 483 580 531 489 329 61 225 211 616 273 379 541 2095 5892 4324 1052 324 326
2612C26J00k13q9J32O7R2l7J67k16j47Nk8R5J22rK6j76q9k8J41n4K38p4p4K7k21p9J81J00
2340B85P1rj10q6q1P3JJ73p1O5r3q3K8k5J49o5O1l6J2j99j7J82m1J06l3p4l3n4pM4J23L5j38
2030A53J54j94r8Q8Q5K9rJ20j40k8r7M7J39k5L8j7j44L1O9n9Q4J8J03k41P4j02L0M6R5j5k6
1739B08lj62O0P8J13l9j31J98q3j80j1J02O9J0k0O5J2j88q1J42J93j60l0K0o1j07Q9Q8J9M7
1457B57jo1j54P7mR0oR5q1p3q6O7J0P2M2J13l33J15l8L6O8J6L0l2k6p9rQ0O1m7J6P9k51KQ6
1129A31J8N9J28r7q3n5M0k9L8J99j61MO6k08J06R3kn5P2L9k36J24PJ2J8J03j84R8j61P7q2
838G9J48J00q8L9j28j4K9j5J39q5J05n1o7p9k0J83p5J33n3Rj63O8q1M53J3l4j71j09k7n1j4
547A73L8M94j09M04q07Q1N8k88K97J20N24o46j86O2j8N0K44n8j66m8o1k2J82qJ51k78L50m03
$$ plain form
2612 326 426 213 124 256 323 415 378 545 329 182 187 159 254 376 367 393 217 128 100 241 187 425 351 277 304 83 4 185 285
2340 285 356 347 237 151 70 143 144 317 246 311 218 135 163 138 287 222 283 247 259 60 43 225 184 290 257 183 150 96 89 133 256 291 153
2030 153 307 113 15 103 188 217 208 328 188 160 63 110 249 224 262 245 101 132 201 142 226 244 347 106 180 78 108 154 249 234 208
1739 208 205 43 103 181 294 255 124 322 239 59 48 150 219 229 209 274 286 98 17 159 352 192 162 182 121 14 103 191 210 257
1457 257 256 195 41 118 114 204 198 293 212 139 53 120 130 202 244 357 24 139 101 137 205 221 251 219 193 114 105 185 246 199 215 294 43 45 131
1129 131 149 208 336 239 156 101 141 112 150 349 188 192 258 50 156 249 247 192 264 303 67 191 198 210 228 331 147 245 84 161 79
838 79 227 327 239 278 150 136 165 150 289 204 309 258 191 112 92 275 200 333 280 289 126 194 113 566 579 545 374 265 238 187 173
547 173 211 705 596 1000 193 274 332 44 341 461 985 339 153 215 197 247 491 433 267 219 158 136 318 310 461 183 533 130
284A30M9N8J19l7R0k4Rk85J96j9J1J06O8o9j50Q9j53J74MQ0K6J5k24nO1J19j00J82N5j03j08
-7C64j31K20n2K06j60J48j31j01J8R5J13n4R2J5j73N3j03P5J95K4N7r5m2j09J25J09oJ44j0
-280H86J5j79J22Q8N9N0K64j42N3j07j1j36
$$ plain form
284 130 179 237 356 319 409 385 394 109 305 286 297 403 471 402 252 341 188 362 366 446 472 487 263 258 319 438 338 520 575 472 364
-7 364 233 453 401 607 447 595 464 363 381 476 589 535 627 642 469 522 419 494 689 713 770 675 633 524 649 758 752 896 886
-280 886 901 722 844 932 991 1041 1305 1163 1216 1109 1098 962
-392I62
##PAGE=	F1=2002.05
##FIRST=	4405.895418600002813,	4405.895418600002813,	0.33138996362686157227
##DATA TABLE=	(F2++(Y..Y)), PROFILE
4406A879R7K5N4j23j97j51k00O8Q9n1J5k7l17j25p3J7J40J3Q7p5k11k06%Q8Q6J13J01k78j3
4134H25k88M4J37K42o1K3j87m8l15K61K2K36k7k7k10j47m1o8M61p9O2k3j65l79K35K0K55J43
3871I01m5k67o4l35J93K67J42M4j18n7k55k16K80K49P9R2q1l48k66%L94J32J77Lj59k49l98
3617I5K51M09J8L57k63p3n26k33N10K37M08pk02l07l26j2M63M06J35P2k61l79o49N18O36M80
3373A757K02q0l69q37l60J222R83Q95K09Q9j185j53M79K60N025O808J3195L096K7563K28249
3185B87048J39470R284k03061j83432k0186j3029J2183j2214l212j504q564n52L720m23K2865
3044B8393K1858N099N145J870J2449l4530l0983q052J331j184J639l14m75R86j336r91J34
2885A039j21l14m3L36J30j06j61k84j87j33K98K19J28m9n7k76k84Q6Q3N57l73R0J74J677L859
$$ plain form
4406 1879 1976 2001 2055 1932 1735 1584 1384 1452 1541 1490 1505 1478 1161 1036 963 980 1120 1133 1220 1145 934 728 728 816 902 1015 1116 838 825
4134 825 537 581 718 960 899 922 735 687 372 633 655 891 864 837 627 480 439 371 832 753 815 792 627 248 483 503 758 901
3871 901 856 589 525 190 383 650 792 836 718 661 406 190 470 719 798 890 809 461 195 195 589 721 898 901 742 493 95
3617 95 346 755 773 1130 867 794 268 35 545 782 1190 1183 981 674 348 336 799 1205 1340 1412 1151 772 123 641 1277 1757
3373 1757 1959 1879 1510 673 313 1535 2518 3413 3622 3711 2526 2373 2852 3112 8137 14945 28140 31236 58799 287048
3185 287048 426518 435802 232741 49309 29123 16094 28277 16063 12851 11347 2783 2231 5951 5528 28393
3044 28393 50251 55350 60495 62365 74814 40284 9301 1249 2580 1396 3035 2721 2246 3232 1896 905 1039
2885 1039 918 604 561 897 1027 921 760 476 289 156 454 673 801 752 695 419 135 221 304 861 488 578 752 2429 6288
2650F288j973l180n99q9R8k79j51J17J43P4L44j41k19j42j57N7J42K01k5mj74j03j65K23K4
2415C10K38o4p5j0l49m0K45J33J12n1o7j38k02J27N6K01m0O0j33r5q7N0J90k2Q3p1j7k71J9
2143I2J73RJ14j3m3r9j08k6J31J08O1j07J29k66j36J15J35O5JQ6j18j37p4P8J61JL9Nk15O
1861A67M9J6P5L5J28k71M1j81R6O9J24Ml2j2j93o0J26J85K8j38P8pk47L5J22N4K3M5n8L3k31
1570A03n3J80K46j34j30N6n6j25O9J09O5O4o4n1j68K7N2J00M4P1r1q6j31P2N2N9J02P3k98
1298A57K6j7K5R1Q0Pl8l8j81P2O2R9j7K5L9k61k3Q0M1Q1J58j14q5j14O2l7P9J99j29p%j69
997A53P3O4P6n9J06Kk80J48k7N0K8J42k12J03j78M9q8J75J64j38P7j82prJ8J77r2J36p5j11
716B83j00JJ97n1J64l9l8j92O9l7L47Pj50J59k34m9p8N2K7N73m45P08r01K67P6m95M68k77
$$ plain form
2650 6288 4315 1135 536 447 545 266 115 232 375 449 793 652 433 291 134 191 333 534 509 505 331 228 63 286 310
2415 310 548 484 409 399 50 10 255 388 500 449 382 244 42 169 225 426 386 446 313 218 131 181 371 349 432 361 344 73 92
2143 92 265 274 388 375 332 233 125 99 230 338 399 292 421 155 19 134 269 334 335 421 303 166 92 170 331 332 371 376 161 167
1861 167 216 232 307 342 470 199 240 59 155 224 348 352 320 308 115 55 181 366 394 256 334 327 80 115 237 291 314 359 301 334 103
1570 103 50 230 476 342 212 268 212 87 156 265 330 394 330 279 111 138 190 290 334 405 314 228 97 169 221 280 382 455 157
1298 157 183 166 191 282 362 369 331 293 112 184 246 345 328 353 392 131 108 188 229 310 468 354 269 155 217 180 259 458 329 322 322 153
997 153 226 290 366 307 413 415 135 283 256 306 334 476 264 367 189 238 150 325 489 351 428 246 239 230 248 425 333 469 394 283
716 283 183 184 381 330 494 455 417 225 294 257 604 611 461 620 386 337 259 311 338 911 466 1174 273 540 616 121 589 312
453C12P52n72l58J92m4J42K38m5j50q4o5p7K34J7J67k53K69l40l0O3J68nJ01m9K9l44J78J9
190D65L6J09J37j36j62Q3j79K11L1J08JO2l01j4Q4J12p4K70n0o7j09j40J96j0K35j22J23j38
-73G61j28mJ32J23JJ08J8k23L2p5O6K77L1Q5j06r9q9J47J13R2J37L9j4j92J65P7J44R3L17
-345B028j17L8j21m0j38
-392A650
$$ plain form
453 312 1064 492 134 326 282 424 662 617 467 383 318 241 475 492 659 406 675 335 305 368 536 531 632 583 612 268 446 465
190 465 501 610 747 611 449 532 353 564 595 703 704 766 465 451 535 647 573 843 793 726 617 477 673 663 898 776 899 761
-73 761 633 629 761 884 885 993 1011 788 820 745 811 1088 1119 1204 1098 999 910 1057 1170 1262 1399 1438 1424 1232 1397 1474 1618 1711 2028
-345 2028 1911 1949 1828 1788 1650
-392 1650
##PAGE=	F1=1983.27
##FIRST=	4405.895418600002813,	4405.895418600002813,	0.23388208448886871338
##DATA TABLE=	(F2++(Y..Y)), PROFILE
4406B545J34L5P9j71k29j88k62O5L6k2M3q8l43j86r8j4J74RJ34j21k44k35j3M9J01J92J03
4152A485l11p4k88k9J86L11o8L9k58n6l46K08J00K84k0k9k83j59j02l8N02k2Q3o1k22m27K13
3899F18N6L21J66j7l35p6m26J78L64J58J21j38j21l16k81L31L15J25J41j17l93l57l8M50K25
3664I54K05M5j88l58m86K60M95J38L75k69j28o23l99O40L80M69N2k48l85m72q5O35N42K27
3439A776R9l33n32r16O70Q44O92K90r8m68j076o24J513J305J250K38l33m6j689Q93K221N339
3232A1015P304J5378Q082L7875L07943K18294J7630k64244k84077l5390j5794P584j1060r145
3101A1395q778j348M775K440P78L2086K8917K939N364L35J5680m5969l6068j0249M71r74J638
2941C432p83j264J355m52j064m67J92m06P6M23J38o0j51l39l43j17L52K96J69l7p6l37l45
$$ plain form
4406 2545 2679 2714 2793 2622 2393 2205 1943 2008 2044 2022 2065 1977 1634 1448 1350 1336 1510 1519 1653 1532 1288 1053 1040 1089 1190 1382 1485
4152 1485 1174 1100 812 783 969 1280 1212 1251 993 937 591 799 899 1183 1163 1134 851 692 590 552 1054 1032 1115 1054 832 405 618
3899 618 674 995 1161 1144 809 733 307 485 849 1007 1128 990 869 553 272 603 918 1043 1184 1067 674 317 279 729 954
3664 954 1159 1204 1016 658 172 432 927 1065 1440 1171 1043 420 21 661 1041 1510 1562 1314 929 457 372 1007 1549 1776
3439 1776 1875 1542 1010 94 764 1608 2300 2590 2492 2024 948 324 1837 3142 4392 4630 4297 4251 2562 3455 5676 11015
3232 11015 18319 33697 41779 79654 387597 605891 623521 359277 75200 39810 24016 31600 20540 11395
3101 11395 2617 1269 6044 8484 9262 41348 70265 73204 78568 78903 94583 48614 12546 2297 2768 1794 3432
2941 3432 2649 1385 2740 2288 1224 757 949 543 619 1042 1180 1120 969 630 287 170 522 818 987 950 874 537 192
2725A92nK19O32l21R6J67J717K476k163j945l49j34J07l18j44n2K18O7O66l80k20j25k86R3
2500B08J74K78l1j8j36j47k60K43R7K27k0q4l9l52j00K59J76J50p4l2j80k89J37J09K20JN2
2246E69j42j37k09J39K13K7J04r4l8l20M2J31O4J40oqj56j54m3J94Q7R3o6Q1k77j74J10J68
1983C38J04NN7r2k21o4R8J71L7M5J5k56k4J8R2M0P8J33k54l1j91R8Q7J67Qm4lk03j63J58J96
1692C99J01o9q1M9k70O1J34K9K4J26j39Qk05p7K07K76r8j95Q2o2j39M3J34R8P2j01n3j48m2
1420A64J07R2R0N1r2q9j77P1Q7N7J37M8k60n2%QJ09J50l3k6n4k55J39K4J32L0J6Qk53m3N2
1129B38Q0Q7J73j10q4j58N6k7J09J87q8k0m8j35L0M2J42m9J33m4k82J41o3R1K9J81k23R9j83
856C04No6J59K35j71J04k12j2m9N1J89o7J40q5j36j10J9J71mJ71j4q1k10O3JK56j7k09L97
$$ plain form
2725 192 187 406 1038 717 813 980 2697 5173 3010 1065 716 582 689 371 227 175 393 460 1126 746 526 401 115 208
2500 208 382 660 629 611 475 328 68 311 408 635 615 531 492 140 40 299 475 625 551 519 339 50 187 296 516 517 569
2246 569 427 290 81 220 433 460 564 470 432 112 154 285 349 489 483 475 319 165 122 316 403 496 430 511 234 60 170 338
1983 338 442 447 504 412 191 127 225 396 433 478 493 237 213 231 323 363 441 574 320 289 98 196 283 450 458 414 411 208 45 203 399
1692 399 500 431 350 399 129 190 324 353 377 503 364 372 167 90 297 573 475 280 362 300 161 204 338 436 508 407 354 206 164
1420 164 271 363 453 504 412 323 146 217 304 361 498 546 286 234 234 242 351 501 468 442 388 133 272 296 428 458 474 482 229 186 238
1129 238 318 405 578 468 384 226 282 255 364 551 463 443 395 260 290 332 474 425 558 514 232 373 310 401 430 611 388 487 304
856 304 309 243 402 637 466 570 358 346 297 348 537 470 610 525 389 279 298 469 465 636 622 541 331 394 395 651 634 425 822
584H22k93q2j21J26L8N78q58R46p94M55N2o77O33m05O94l96m70J87o8K24K27k6j33j20o3j17
340C59K64L1J87k14J79k69r0N1K12K0J06o4N1l76J30N8O3J06J93j80j72P6j96K28N9J29pQ4
77A018l41k5R3R7m8L51j18n7j07j41J53M2K53p8J01j48j28m4J54J42M9J27K1k63J1n1O4L31
-186A458M7J10j00j51p4J58J21J73J47P8l3j98K02N0K40J23L67q3K2j26p4j32
-392B325
$$ plain form
584 822 529 447 326 452 490 1068 210 1156 362 817 869 192 825 420 1114 718 248 435 367 591 818 792 659 539 476 359
340 359 623 654 841 627 806 537 447 498 710 730 836 772 823 447 577 635 698 804 997 817 645 721 525 753 812 941 934 1018
77 1018 677 652 745 842 794 1145 1027 970 863 722 875 917 1170 1092 1193 1045 917 873 1027 1169 1218 1345 1366 1103 1114 1063 1127 1458
-186 1458 1505 1615 1515 1364 1290 1448 1569 1742 1889 1967 1934 1736 1938 1988 2228 2351 2718 2635 2657 2531 2457 2325
-392 2325
##PAGE=	F1=1964.49
##FIRST=	4405.895418600002813,	4405.895418600002813,	0.1184118613600730896
##DATA TABLE=	(F2++(Y..Y)), PROFILE
4406C040J53M5R6j98k58k05l11O5k1MP3j41l55k23j20n2K04J1J58j54k55k52k4OJ23K29J24
4152A762l40j22k75q8K23L50p0M8k96p7l39J33J78K96Pm1l33j63j50nN03M2R4r3k66m23J57
3899G12Q6L72J63K7l86r1m68J45M29J73J76j41j79l52l13L48L55J65J71j38m24l98q0M77K95
3664A124K17P8j94m42n49K68N39K45L59k49j74o73n08P02M80N13J04k89m30n85j37P56O43
3448A798K96J21l92o55j054P42R98Q49L51j14n44j249q00J749J576J479L63n13Q75j193J240
3251E923K265N334P747J5826J2385M5605L66329K93172K6828l05823l77621n3649j063k6570
3119A6688J789n104J672j3253O017M73P223M0577L4987k449M666j723J8259n6473l7971j1975
2969C403r09j444K645m56k004j01J063o53q80Nl19K53N09J18lj10l63m29j42L61L50K10k4
$$ plain form
4406 3040 3193 3238 3334 3136 2878 2673 2362 2427 2406 2410 2483 2342 1987 1764 1644 1592 1796 1807 1965 1811 1556 1304 1280 1286 1409 1638 1762
4152 1762 1422 1300 1025 937 1160 1510 1440 1488 1192 1115 776 909 1087 1383 1390 1349 1016 853 703 698 1201 1243 1337 1244 978 555 712
3899 712 798 1170 1333 1360 974 883 415 560 989 1162 1338 1197 1018 666 353 701 1056 1221 1392 1254 830 432 352 829 1124
3664 1124 1341 1419 1225 783 234 502 1041 1286 1645 1396 1222 549 41 743 1223 1736 1840 1551 1121 536 399 1155 1798
3448 1798 2094 2215 1823 1168 114 856 1854 2703 3054 2940 2396 1147 347 2096 3672 5151 5514 5001 5876 4683 5923
3251 5923 8188 13522 21269 37095 49480 95085 461414 754586 781414 475591 97970 44321 43258 16688
3119 16688 18477 13373 15045 1792 7809 8282 15505 56082 91069 88620 93286 91563 109822 53349 15378 3403
2969 3403 2494 1050 3695 3239 1235 1134 2197 1544 664 669 350 603 1112 1230 1227 1117 754 325 183 544 894 1104 1080
2753A080r8l38m22q8L63O14k13Q0J70J758J252l024k82kj58J34l28j57k24K75O9Q14m48k30
2528E97j14k92K0J86L43l6j6r0j91k82J91J55K06M1j03n3l29j55K36K18J75p7j4k04l08R1
2284A95J51K26M3L8j31j88k61J76K17P0J19j02n4l43N7P2J13J68nJ9j97j79n5K25O8J19k1
2030E40J8k47k16J10J76J39OL8p7k58p0J05J70P1N4J2k69m7j8J64j6J34J17k15j02j52O2R1
1767C20K11kn6J4k03j90J48J52J61M1k22O6k59P6J36mJ7J98j55o1j44j22K28K76n9k33J09
1514D43p1j54K2J52J19O5j06p1j09j04J52P1J24L9r0q4k14P1J07O4J42M5k28j07OoJ22K11
1251F11q5Ko9l02J94k4J47R3j8mk29o4J5J25Q0J74r6p5j85L0%J23J66n0l1p1j10j6L1J84k3
960E23J38q2k62J18q5J21K2K14k25R9j89l6k2J12K92j83J17k24k2p9Q2J74k1J22q3j47j13
$$ plain form
2753 1080 982 644 222 134 497 1111 898 978 1148 2906 4158 1134 852 850 692 826 498 341 117 392 461 1275 827 597
2528 597 483 191 211 397 740 704 688 598 407 125 316 471 677 718 615 562 233 78 314 532 707 630 616 412 104 195
2284 195 346 572 615 653 522 334 73 249 466 536 655 553 499 156 213 285 398 566 561 580 383 204 149 374 442 561 540
2030 540 558 311 95 205 381 520 526 564 487 229 159 264 434 505 559 571 302 255 237 401 385 519 636 421 319 167 229 320
1767 320 531 529 473 487 284 94 242 394 555 596 374 440 181 257 393 389 406 604 449 388 244 122 350 626 567 334 443
1514 443 372 218 240 392 511 576 470 399 290 186 338 409 533 572 482 398 184 255 362 426 568 613 385 278 284 278 400 611
1251 611 526 528 459 157 351 327 474 567 549 545 316 252 267 392 472 646 550 475 290 320 320 443 609 559 528 457 347 331 362 546 523
960 523 661 579 317 435 350 471 493 707 482 581 392 356 334 446 738 555 672 448 426 347 429 603 582 704 621 474 361
706C61L2J30N3J56Pj07k14N1L3J76k3j92M80k91j12j67J94M6N50q55O31m80N85lq00P56l84
453F13N18k12n44J33q1K88K11qj15j55n1j36K71K9K09j72R7k05j30L6K49L1J00o8O9l75O3
199F65R9P8J04K25k07j65O2j96K26Q1J40lQ1l47l2R1P8k6M09j41p5j04j25R2J02K53m1Q4j53
-73A255j16q5J65J62Q2J38K6k88jl5O9L50O5J24q4j88n7J52J31K27J63R9m1j95K29J2L28J35
-336B822M01n0Oj20j02j22
-392B835
$$ plain form
706 361 393 523 576 732 739 632 418 469 502 678 655 463 943 652 540 373 567 613 1163 308 939 459 1044 1041 241 997 613
453 613 1131 919 375 508 427 715 926 918 803 648 597 461 732 761 970 798 895 690 560 596 845 876 976 908 977 602 665
199 665 764 842 946 1171 964 799 861 665 891 972 1112 1109 1190 843 811 902 980 954 1363 1222 1147 1043 918 1010 1112 1365 1324 1408 1255
-73 1255 1139 1054 1219 1381 1463 1601 1627 1339 1338 1303 1372 1722 1787 1911 1827 1639 1582 1734 1865 2092 2255 2354 2313 2118 2347 2359 2687 2822
-336 2822 3223 3173 3179 3059 2957 2835
-392 2835
##PAGE=	F1=1945.71
##FIRST=	4405.895418600002813,	4405.895418600002813,	0.16194698214530944824
##DATA TABLE=	(F2++(Y..Y)), PROFILE
4406C259J54M8J04k09k77k01l34P6o9K3R7j77l59k25j37q3K36J3J52j74k46k52k6k7J50K20
4162A736J51l65j50k48j19K51L49o7M4l02j09k93N9K50K67M7o7l55j64j65L1M68J00Q7j20
3927A316k91l87J01J21L94J33P1m19j05m60J17M58J83J93j32k28l58l08L48L71J81J74j46
3711A327m39l94r2M72L32K04R7j88m96n69K96N35L18L03k12k06o85n58P43N17N26J29l18m46
3486A196o49j17P97O93L19J17m28p29j067P92J058R12L65j39n91j329p70J843J719J522M65
3288E979n24J74r00J388L417N543P874J4610J5059M9061L90953L48936L6200l19044m46122
3148A12604p2999M2972n1066j9212R723N927k2600L98j049J8274M6899L9508r299K132m344
3007I7868J9543o3204l6637j2653q15k543K977M8j389k238J135k04o59q76j01L18N52P8L8
$$ plain form
4406 3259 3413 3461 3565 3356 3079 2878 2544 2620 2551 2574 2671 2494 2135 1910 1773 1690 1926 1939 2091 1917 1671 1419 1393 1366 1516 1736
4162 1736 1887 1522 1372 1124 1005 1256 1605 1538 1582 1280 1171 878 937 1187 1454 1501 1434 1079 915 750 781 1249 1349 1436 1316
3927 1316 1025 638 739 860 1254 1387 1458 1039 934 474 591 1049 1232 1425 1293 1065 707 399 747 1118 1299 1473 1327
3711 1327 888 494 402 874 1206 1410 1507 1319 823 254 550 1085 1403 1706 1494 1288 603 45 788 1305 1831 1960 1642 1196
3486 1196 547 430 1227 1920 2239 2356 1928 1199 132 924 1982 2894 3259 3120 2529 1200 430 2273 3992 5514 5979
3288 5979 5455 5629 4729 6117 9534 15077 22951 37561 52620 101681 492634 841570 877770 558726 112604
3148 112604 39605 82577 31511 12299 22022 27949 5349 5747 4698 22972 69871 109379 100080 102212 97868
3007 97868 117411 54207 17570 4917 4102 1559 4536 4584 3195 957 2092 1888 1229 353 252 570 1122 1200 1238
2828A238o8l52m52j79L49L68K39j8j29l00m79j30M80N12p7L0J59J741J275l459j58L56j90
2612G56J52l28j95k94L04Q0P38l27k51j28k42n8J85L85n1rn8k22k73J45J95J71R9j32n9k97
2368B86j79K02K50J80p2j5k15k92M3J87K17P2J8j14k38k15J52K06R6J20r7o9l49P9J8J50J83
2115F04rL0k19j87n1K32N4J29K1n5j95k44J23J60J63LK7p5k62p2J10J58R0O1%k63o4m2K31
1842D58q0J80Q5j72j45j00K4Q3K42k1o8L0j96j92J55Q6J91J53l21N0k31Q6J36m1J1K41j25
1589E19j53p0j59K46K46k5k52J36p9j66J7J57J29L7q0j05n8j44J86M2J37L6r6o8k35P9J11
1335C88P6J18N7k06j39QoJ24K57j48M3q5l25K38o5J42J59p5Oj98q6j5J70O3J61q3n9j95oM4
1054C63J24J34k3l7p6r4m8K8J98J5J14j08k26Q7q4J37J1K32k23J00j94o5L8M8L23j74J13k26
$$ plain form
2828 1238 1170 818 366 187 536 904 1143 1125 996 696 217 87 567 1079 1002 1032 1191 2932 4207 748 590 946 756
2612 756 908 580 385 91 395 475 1213 886 635 507 265 207 392 777 726 717 659 437 164 309 504 675 774 642 583 286
2368 286 107 309 559 739 667 652 437 145 188 375 592 664 682 568 330 115 267 473 569 689 592 523 174 253 271 421 604
2115 604 595 625 406 219 168 400 454 583 604 549 354 110 233 393 556 559 586 511 249 177 287 445 535 596 596 333 269 227 458
1842 458 378 558 643 471 326 226 250 333 575 554 486 516 320 128 283 369 560 713 392 442 211 297 433 392 403 644 519
1589 519 366 296 137 383 629 604 352 488 409 243 260 417 546 583 503 398 340 196 382 424 561 597 501 433 198 277 388
1335 388 464 582 639 433 294 302 296 420 677 529 572 487 162 400 335 477 636 561 567 369 283 268 438 501 662 579 520 325 319 363
1054 363 487 621 598 561 485 391 343 371 569 584 698 590 364 451 367 504 515 747 524 624 430 365 403 451 774 600 713 487
791D87l0r0J11J34L5Q7q1j41j10M6Q5J07J25J6j17j99L4O4R6kj24M29k42j32j99K42M8N14
528A193m60j32n8O07m0q32Q05l60L97p3n88O6p7L27J91Kj00j86l3j28K62J4K23j38L3j55j48
274F12K5K82K4Q3p0Q1l43qJ40P7J07K26k20j42M0j80K18R2J38QN0l21l1Q4O3j5M31j24j15
2A212j00r1K5J64K36k2P3j53j03j13J70J82R3J29L8l07Kk2P8L36Q1J20p1k01l8J31J44K55
-261B248J71R3m1j85K44k5L95J26M09l0j0j10j14j05
-392C066
$$ plain form
791 487 457 367 478 612 647 734 653 512 402 448 533 640 765 781 664 465 499 563 659 657 533 962 720 588 389 631 679 1193
528 1193 733 601 543 1150 1110 278 1083 723 1120 1047 459 525 448 775 966 968 868 682 649 521 783 797 1020 882 915 760 612
274 612 637 919 943 1026 956 1037 694 686 826 903 1010 1236 1016 874 914 734 952 1044 1182 1190 1240 919 888 972 1035 1020 1451 1327 1212
2 1212 1112 1021 1046 1210 1446 1424 1497 1344 1241 1128 1298 1480 1573 1702 1740 1433 1435 1413 1491 1827 1908 2028 1957 1756 1718 1849 1993 2248
-261 2248 2419 2512 2471 2286 2530 2505 2900 3026 3435 3405 3395 3285 3171 3066
-392 3066
##PAGE=	F1=1926.93
##FIRST=	4405.895418600002813,	4405.895418600002813,	0.49001494050025939941
##DATA TABLE=	(F2++(Y..Y)), PROFILE
4406C163J42M2J02k14k87j78l25J08r3L2J07j96l63j92j42r3K75J0J15j86k27k35j0l3J76
4171A498J73J68l90j59k09j09K75L15o4J7k82j47k19J5L11K01Q8j11l52j66j38P6M12J38N5
3936A396j44k98l35P0J73L86P5R6m34j23m06J19M59J85J62j17k77l38k63L61L62J66J47j54
3711A268m38l63m2M45L35J56R9j85n27n41L76M89L47K02j72k32o69m78P35M92M99J13l38m49
3486A122o65K4P56O82K83P3m42p56r78Q88J012Q65L16j84o18j318m65J776J684J373M63m65
3279E426j043p87J430M661N658P436J2097J5522M7426L76529L72706M4898l00813m75569r0835
3138B4742J14770l7414p6262K330O22k1209k832l385K7537M9793M1984j4601k751p551J9207
2997A14980o3666l2587j2183K31k686J382j55q89k108L6k62m54j156j16J93N49M5L7o9l24
$$ plain form
4406 3163 3305 3347 3449 3235 2948 2770 2445 2553 2460 2492 2599 2403 2040 1848 1706 1613 1888 1898 2013 1827 1600 1365 1355 1322 1498
4171 1498 1671 1839 1449 1290 1081 972 1247 1562 1498 1515 1233 1086 867 882 1193 1394 1482 1371 1019 853 715 791 1203 1341 1396
3936 1396 1252 954 619 689 862 1248 1323 1419 985 862 456 575 1034 1219 1381 1264 987 649 386 747 1109 1275 1422 1268
3711 1268 830 467 425 870 1205 1361 1460 1275 748 207 583 1072 1419 1621 1449 1217 548 70 805 1297 1796 1909 1571 1122
3486 1122 457 481 1237 1919 2202 2275 1833 1077 99 987 1999 2864 3180 2996 2378 1060 595 2371 4055 5428 5891 5426
3279 5426 4383 3596 5026 9687 15345 22781 34878 50400 97826 474355 847061 891959 591146 115577 24742
3138 24742 139512 102098 25836 28166 28788 7579 4747 1362 28899 78692 120676 106075 103324 95773 114980
2997 114980 51314 18727 6544 6775 4089 5471 5316 4427 2319 2355 2093 1639 483 367 560 1109 1154 1191 1122 798
2810G98m55j60L49L49K46l5j64k66m91r0N38L56N0n4J11J529Q00k551m72O48k69J39l40k51
2584C15k00L05J04M84j08k73j74j80o1J81L93q1j6n1k40k50J61K13J23J34j71o5k70j58J88
2349C03K64J59o3m7k18k50J9K23J98Q3j7j03k83j36J44J89J06R9q8r1l45J15kJ71J72j8J7
2096F01k24j84j1K22M4J16N3j36j42k49J62J32J70nJ5q6k51o1J30J42Q6O0k0k42q5m2K99j35
1833C59J99L8j40j47n7NP0K52m7p8L3j85j74J88K8J90K30l84K6k06J04J41p4NK49q3k45Qj69
1561A36K64J90Kk64J55q8j64L5J52J26j5l3j54lj47K09J1J26M0j21m3k37J02J07Q4P6O7j91
1298D22j53J0K1J14K81k16Q5j03l27K73q3J16K20j52L4j68j09j9K07L8J38p7m5j91m4J05J19
1044D96R4j0m9o7q7n4L3J91N6O2j26j79M8n1J41jK29k19R7k00p6J10j0L17j49Q3k17l6p7J40
$$ plain form
2810 798 343 183 532 881 1127 1092 928 662 171 81 619 975 1025 971 1082 2611 3411 860 388 1036 767 906 566 315
2584 315 115 420 524 1008 900 627 453 273 212 393 786 705 689 638 398 148 309 522 645 779 608 543 273 115 303
2349 303 567 726 663 616 398 148 167 390 588 671 654 551 268 132 276 465 571 670 582 491 146 261 259 430 602 584 601
2096 601 377 193 182 404 448 564 617 481 339 90 252 384 554 549 564 478 227 166 296 438 524 584 564 322 237 195 494 359
1833 359 558 596 456 309 252 257 327 579 532 454 487 302 128 316 344 534 764 380 406 200 304 445 371 376 625 542 297 305 136
1561 136 400 590 592 328 483 395 231 266 418 544 529 496 342 339 192 401 412 538 578 457 414 177 279 386 470 546 613 422
1298 422 269 279 300 414 695 479 564 461 134 407 324 440 660 508 542 374 265 246 453 491 629 552 507 316 272 377 496
1044 496 590 580 531 464 377 323 356 547 603 665 539 360 408 357 498 497 726 507 604 404 328 438 428 745 596 679 462 426 349 489
763D89P9R1M0q9j21j04P0M8J49Q3Pj18j70J9J02J4K4j7K89j71j46j96K67M7M78o3p20K06M98
490A085lp59P65l58L61j5o02Rn8L44J68lr1k16j1r2K47j0K23j17j0j26j49K7L16LN5p9Q3k88
209F99o8J80O2J21J91k26j09J0j43K13R5J19J9nk76j9P7O1j2M14r0j69r4m0l4K22K07k6O0
-64A439j49r9j14J76J99Q3R5N1l24K2qR8K95Q8R4p1j93j6J07J59K60J64N6m3j71K50n2M37
-327B833J02L83l2k8j01j07q0
-392B970
$$ plain form
763 489 568 659 699 610 489 385 455 503 652 735 742 624 454 473 575 589 613 596 885 714 568 372 639 686 1164 1101 381 587 1085
490 1085 1082 323 1088 730 1091 1076 474 483 425 769 937 934 843 627 616 524 771 761 984 867 857 731 582 609 925 928 983 904 987 699
209 699 631 811 873 994 1185 959 850 860 717 930 1025 1144 1163 1158 882 863 940 1001 989 1403 1313 1144 1050 1010 976 1198 1405 1379 1439
-64 1439 1290 1191 1077 1253 1452 1535 1630 1681 1357 1379 1371 1469 1764 1852 1946 1875 1682 1666 1773 1932 2192 2356 2412 2369 2198 2448 2396 2833
-327 2833 2935 3318 3286 3258 3157 3050 2970
-392 2970
##PAGE=	F1=1908.15
##FIRST=	4405.895418600002813,	4405.895418600002813,	0.90378046035766601563
##DATA TABLE=	(F2++(Y..Y)), PROFILE
4406B791J27K8Q7k21k89j53k79J64q4L2R9k01l79j34j29o8L20JN3j98k13k05K8jK01J02J62
4152A641m21j56j61n7L06K58o6l2k51j94j30K8L56J15J19j72l39j76o4J40L47J56mj71k98
3918G74k88Q9K48L56nR0m32j65l12J69M46J78Q7j08l31l07j73M02L41J18R8j80m24l37J07
3683D41M00L10P6Q1j97n49m81N42M11L29O8j43k65o38j78O10M21M34N1l47m59o49L12O40O18
3448A838J95k4m30p42o70R05Q78P18K03k52o45j233J08J565J480J070L19m30j879r65J694
3251C703N243N367O331Q816J3716M1010L26576L57648N1675k54468m59723j01243K01083j0801
3119A94933j39832l1903j4553k317P416o488K3084M8150M1684j5683r158j0903J7455n7147
2988D4738k6435j0966R76k227p53q87m93j716K09m73m54r41k39K46N27M9j2j35l08m76%L35
$$ plain form
4406 2791 2918 2946 3033 2812 2523 2370 2091 2255 2171 2203 2302 2101 1722 1588 1459 1391 1711 1712 1765 1567 1354 1149 1177 1176 1377 1479 1641
4152 1641 1220 1064 903 846 1152 1410 1344 1312 1061 867 737 765 1121 1236 1355 1183 844 668 604 744 1091 1247 1243 1072 774
3918 774 486 575 823 1179 1174 1264 832 667 355 524 970 1148 1235 1127 796 489 316 718 1059 1177 1275 1095 671 334 441
3683 441 841 1151 1227 1308 1111 562 81 623 1034 1363 1431 1288 1023 385 207 817 1238 1672 1723 1376 917 268 580 1220 1838
3448 1838 2033 2009 1579 837 167 1072 1950 2668 2871 2619 1974 741 849 2414 3894 4964 5283 4853 2974 2009 3703
3251 3703 8946 14313 20644 29460 43176 84186 410762 768410 820085 565617 105894 4651 205734 194933
3119 194933 55101 23198 8645 6328 13744 7256 30340 78490 120174 104491 95333 84430 101885 44738
2988 44738 18303 7337 8313 6086 5333 4446 3953 2237 2446 1973 1519 578 339 585 1112 1161 1149 1014 706 230 230 565
2781E65L05K28p6k06k74m63O9N20J90J29j47J2J128l75L5j312Q18m00R4l71l47J16K38J22
2556E98K13N1k80k47j49P8J61L66j18m8q1k49k36K75K13O8J31k11q0k59p3J92K57J20n8j11
2312E23k19j96N3K44J70Q3o8j06l24o6J96J67J03N4p5j29l34J62L0J72J34l0k4k16j83Q7J91
2058C99M1Q0P3k20j11k32K40R9J58j1j0r8k59k4J78J27O0M2m5k07j26j7L76j66J81j3j30j05
1795B80m6K4N7K37p2q7J5j79j44K54oJ70K51m25K2k10J43J57j02MK22n9l10O8j33K78J16K4
1533E49k77J64j13j34P8J39J13q9K4k14M3j04K24j3R1M3j68j6k20J42J06Q6K6O0j83j55J2
1279B14Q8Q5K87k78J17j24l15K94o4P9K64k40O7j42j32K0K22J4J07q1m3j82p3J79J17N2j2
1025E20p2n3r4j8M2J70R1qj44j29KJ8J41j2K04k17Q5k08p0J91m5K74j14K5k03l9m1J73K1J35
$$ plain form
2781 565 870 1098 1022 816 542 79 148 668 858 987 840 852 1980 1605 1640 328 1146 746 840 469 122 238 476 598
2556 598 811 862 582 335 186 264 425 791 673 625 544 295 59 334 547 615 746 535 455 196 123 315 572 692 634 523
2312 523 304 108 161 405 575 658 590 484 160 94 290 457 560 614 539 410 76 238 268 440 574 544 520 304 121 208 399
2058 399 440 520 593 373 262 30 270 369 527 516 506 408 149 125 303 430 490 532 487 280 154 137 513 347 528 515 385 280
1795 280 234 258 315 552 480 393 408 229 85 339 333 503 754 329 351 141 284 441 339 343 565 506 196 264 131 409 525 549
1533 549 272 436 323 189 267 406 519 430 454 240 283 179 403 390 481 524 356 340 120 262 368 454 480 540 357 202 214
1279 214 302 387 674 396 513 389 74 368 304 383 647 407 474 332 200 220 442 456 563 482 439 257 184 363 480 532 520
1025 520 448 395 301 283 325 495 586 578 434 305 307 325 466 454 658 441 526 318 248 439 394 668 554 579 376 337 296 469 490 625
744F25qj18r3r8J11L0J72L5k0j20j34J0J54o1K4J45Q3j05j59j47K73M8M35K20p57K3K80J52
481A000o13O56l56L68n9n78j8l5L48J40k2r0k47Ql6K43l3K02j11l3j24j40M9L58l0K1j02P2
218H38k28r9K16M5J47J20k30p7k7r1K27R3Q4K5q0k25%P7Q3j5L62o4k26q6K0p0K74J74n3L8
-64A252j50j06q4J94K10O1L5N7l47N8J2J31K40Q7M4r6j69PR4J79K51J38j2n8j57K51n5M58
-327B525O7L26o0n2j01q0m6
-392B579
$$ plain form
744 625 617 499 406 308 419 449 621 656 636 516 382 392 546 485 509 654 737 632 473 326 599 647 1082 1302 545 568 848 1000
481 1000 387 1043 687 1055 996 418 400 365 713 853 831 741 494 502 466 709 676 878 767 734 610 470 519 877 847 868 766 838
218 838 610 511 727 772 919 1039 809 732 705 614 841 934 1018 1043 963 738 738 815 898 883 1245 1181 955 869 889 819 1093 1267 1214 1252
-64 1252 1102 996 912 1106 1316 1377 1412 1469 1122 1180 1192 1323 1563 1650 1694 1598 1429 1436 1530 1709 1960 2098 2086 2028 1871 2122 2067 2525
-327 2525 2592 2918 2858 2806 2705 2625 2579
-392 2579
##PAGE=	F1=1889.37
##FIRST=	4405.895418600002813,	4405.895418600002813,	1.0450451374053955078
##DATA TABLE=	(F2++(Y..Y)), PROFILE
4406B241J16J2O5k44k87j38k05K43l7K9P3k02m12p1r8ML62rk0k14k22j76R1P5K19L1J28m55
4143H99j57j13L2L49J92p1r3k30k54l8J12L75L1J35k41l25k13O2K20K81J58p7k07k99k73J93
3899D48L26L11q7M6m02k61j82K74M22J64rj12l84l00j0M48L10N5M3k31l79l86L87L25K69j8
3655A067N4k23n65k11N80L06K76o5j36l00n41J87M21L28L46l6l34m65m89N45M75N20Q5j58
3429A667l74o35k11P58O89N13N9l27o72r79P12J240J157O97N8m72k079j269K400M805M544
3232A2281M649N331J0107L1180K52459L05385N4800j88819m01897n7352K41378K5901k07699
3110H7704q2224L6643m1330K1617j2663J5924M1441L7534j1610j4836j3217J5017m5390j8663
2979A5947r365J009j031l105j528m9N4j24l01l97p19J2L42M17J08r5k36k96l93J63K59K42
$$ plain form
4406 2241 2357 2369 2434 2190 1903 1765 1560 1803 1766 1795 1868 1666 1254 1183 1085 1089 1451 1442 1422 1208 986 810 901 976 1195 1226 1354 899
4143 899 742 629 661 1010 1202 1131 1038 808 554 516 628 1003 1034 1169 928 603 390 452 672 953 1111 1034 827 528 255 448
3899 448 774 1085 998 1044 642 381 199 473 895 1059 1050 938 554 254 244 692 1002 1057 1100 869 490 104 491 816 1085 1067
3655 1067 1121 898 333 122 702 1008 1284 1219 1083 783 242 429 850 1178 1524 1488 1154 689 200 745 1220 1740 1825 1667
3429 1667 1293 658 447 1205 1894 2407 2466 2139 1467 488 1200 2440 3597 4294 4352 3880 1801 532 2932 7737 12281
3232 12281 16930 22261 32368 63548 316007 621392 676192 487373 85476 28124 269502 295403 87704
3110 87704 5480 42123 793 22410 9747 25671 67112 104646 93036 78200 64983 80000 34610 15947
2979 15947 6582 7591 6560 3455 1927 1878 1932 1808 1507 1110 391 403 745 1162 1270 1175 939 643 250 413 672 914
2772I14J90j30k35l09k83J65M31M8J40k25j27R08L656o05m035P71n31N7l79k50K80J10J01
2556F62J50rk43k75k76L82J12L09j40r0j39k27j11K96J96J3J00k27r3k45N1J72K23P8n2j93
2312D24j84j38J39J94J36Q7j26j13k89j04L02J38R3kn7j71k07R5R6J52P5l6p6j88j69K03J28
2058D02M2L4Q3k83j18p7K21O1J32rn1q1l35Q0K17J18K4Qo8j48k05L8M36j60J26m9j41l6p7
1786A84Q9L7K02q4q6l2j94r3L35j9J49K18m47N4k56K06J77j25J8J63p6k42Ml6K74L8N0k99
1523B09J73j84m1J18J21R6j70P3k60M5kK21k7M4M4k26pj71J79J18P5j2K3j74j45OJ88L7K80
1251F31l12J23j43k27K25rL7K89l21R0j21j41R7J97jP7q8o4j85p6K58J20J3k1j10l8j24P1
988B47M5J44J14q2j70q6n0J21J43k0J61k12N8k25l8K62m4K05p8n7j78n7K5K05k9J65n3j68
$$ plain form
2772 914 1104 974 739 430 147 312 743 791 931 706 579 1487 5143 4538 503 1274 743 800 421 171 451 561 662
2556 662 812 803 560 285 9 391 503 812 672 582 443 216 105 401 597 610 710 483 390 145 196 368 591 669 617 424
2312 424 240 102 241 435 571 658 532 419 130 26 328 466 559 557 500 329 122 217 313 465 540 504 428 240 71 274 402
2058 402 444 478 561 278 160 83 304 365 497 488 437 356 21 101 318 436 460 468 400 252 47 85 521 361 487 438 297 261 184
1786 184 273 310 512 428 342 310 116 23 358 339 488 706 259 313 57 263 440 315 333 496 420 178 182 146 420 458 508 209
1523 209 382 198 157 275 396 492 322 395 135 180 178 399 372 416 460 234 227 56 235 353 428 416 439 265 120 126 314 351 631
1251 631 319 442 299 72 297 288 325 614 293 383 262 121 218 415 414 491 403 339 154 78 336 456 469 448 338 300 176 247
988 247 292 436 550 468 298 212 162 283 426 406 567 355 413 188 150 412 368 573 495 438 260 203 228 433 404 569 516 348
725C48o3j06J80L5J73oo1j33j10J1K24j08l2L60j46p0j80m6K67M9L73L33n12k86K0L96m50
471D60N29l31L50j90n13J0k6L43J11n1r7k79J6L0K58m8J62j15m3j52j28R4M07o4j5j38N0j84
209D46q6K42L0J83K6k29o5p2k2K62Q7M0L0j65j93K4R0J29j8K95o9k74q3Q0p1L12J49r4kj59
-73H23j28k0K24K15M0m3N0l87J04M3J79J86P7k1j49j42K6J07K00K40R8j00r5j50K49k7M62
-327B061L4K47j10q3j19l9k
-392A989
$$ plain form
725 348 285 179 359 394 567 561 500 367 257 268 492 384 352 712 566 496 316 270 537 586 959 1292 780 494 514 910 460
471 460 989 658 1008 818 305 315 289 632 743 692 595 316 332 362 620 572 734 619 576 424 296 390 797 733 718 580 630 446
209 446 360 602 632 815 841 612 547 475 453 715 802 842 872 707 514 538 628 757 739 1034 965 691 608 688 617 929 1078 984 982 823
-73 823 695 675 899 1114 1154 1111 1161 774 878 921 1100 1286 1363 1342 1193 1051 1077 1184 1384 1624 1722 1622 1527 1377 1626 1599 2061
-327 2061 2095 2342 2232 2149 2030 1991 1989
-392 1989
##PAGE=	F1=1870.59
##FIRST=	4405.895418600002813,	4405.895418600002813,	1.3864612579345703125
##DATA TABLE=	(F2++(Y..Y)), PROFILE
4406A634J16%M6k86k80j57j09L35L7K8M1j99m65l4m3J32L76j7p8k28k67j70J85J83K19j9Q1
4152A061m75j80q1J62L75J29p1j37k26l40P3K40L43k7J39k90k99l17K66K76K05J57j36k39
3927F08k85k52L40L30K62j47j8k98m42P4L04L65J44q4j20l67k52J48L86K73mJ5k83k36k66
3692A95M09K15K18q3L8k30m21L4M61J81K10j43j42k72k23K55K19K35K66r5k71l66j56M39K89
3458A262M15Qk67k33l40j4N58M89L12m7l30o00l45P57Q55P99L59k09n30k056O97J428L497
3242F465L294K684K133N510J9997J70111K26132N2367j15851l13997l341K62607O7105k69139
3110A16077p3949P6404j05817J1467j5629P519L0498K7962l515j7269j2861J3032l2074r892
2979A1953p237R93j90m977J613k19K577l456j37O84j366Q04J02J59J74j78k87k29j71J10J61
$$ plain form
4406 1634 1750 1750 1796 1510 1230 1073 964 1299 1336 1364 1405 1206 741 707 664 796 1172 1155 1077 849 582 412 597 780 999 980 1061
4152 1061 586 406 325 487 862 991 920 783 557 217 290 530 873 846 985 695 396 79 345 621 826 983 847 608
3927 608 323 71 411 741 1003 856 838 540 98 172 476 841 985 901 781 414 162 310 696 969 965 980 697 461 195
3692 195 604 819 1037 954 992 762 341 375 836 1017 1227 1084 942 670 447 702 921 1156 1422 1327 1056 690 534 973 1262
3458 1262 1677 1685 1418 1185 845 831 1389 1878 2190 2143 1813 1213 868 1625 2480 3279 3638 3429 2899 843 1540 2968 6465
3242 6465 9759 12443 14576 20086 40083 210194 436326 488693 372842 58845 55504 318111 385216 116077
3110 116077 42128 118532 12715 24182 8553 16072 46570 74532 71017 53748 40887 53919 21845 11953
2979 11953 4716 5709 5519 542 2155 1936 4513 1057 920 1604 238 1042 1144 1303 1477 1299 1012 783 612 722 883
2781H83J55J35j62k17k51j34J63L01n4Q5l08k80J284P916k082o584N38n91Q4l00q1K03l4R
2556F78M12l02j45j83k14L27N1K32j26j10j65j16j7J91J59k5O0j93o5j63N0J37J56N3l7k38
2312D07o0j20J72Q5J04J04j63r7j44j30K45R4Q0m0k9j74m5k6J32J14J2k4r6j17r0J84M4M7
2049D69lQ8k64r9L1J41J9J01Mr0rk50M7J61J18j0k3q0n9j47J1L65j16M9m9j35J8j22J54OJ50
1758D76o6o8q1j95N9K60k7J33J64m27J09k20J58J82j49O1P4j19Mk27R1K48l5R1l17J98l40
1504C7J62R7J00Q4k20Q7j78j07J52J87l4JM4k21n7j7R8J39N3k6l4j46p0k0K33k8K70k96R4
1232C84j35o6M9N9mK90l57Q6q8o6J01J32lN4p1j13k26Q5K07J19j6k4j47j7j98K09K9J17J18
960E08j29j93o2j08K32J48k5J14j99L2k57O7K47j0J24n0j29j17j39J38K08o6J78p9k11m5j16
$$ plain form
2781 883 1038 1173 1011 794 543 409 572 873 819 904 596 316 1600 9516 7434 850 1388 797 881 581 500 703 669 678
2556 678 1090 788 643 460 246 573 624 856 730 620 455 339 322 513 672 647 707 514 449 286 336 473 629 682 645 407
2312 407 347 227 399 484 588 692 529 432 288 158 403 497 577 537 508 334 289 263 395 509 521 497 401 284 194 378 422 469
2049 469 466 554 290 191 222 363 382 483 487 397 388 138 185 346 464 454 431 351 292 145 156 521 405 454 405 270 288 166 320 326 476
1758 476 410 342 261 66 125 385 358 491 655 228 337 117 275 457 308 369 443 324 328 101 192 440 405 496 179 377 37
1504 37 199 296 396 480 260 347 169 62 214 401 367 368 412 191 134 117 215 354 407 381 347 201 131 111 344 316 586 290 384
1232 384 249 183 232 291 287 577 220 306 218 152 253 385 382 436 365 252 26 111 318 437 421 397 250 233 35 244 273 390 508
960 508 379 186 124 16 248 396 371 485 286 318 61 128 375 365 489 439 310 193 54 192 400 334 512 433 222 177 61
706F1K43N7J48k7j00j47j25K2K98j07j14N53l27q9k25J16K41N0K77K80j54n32q1N11l10M31
462I50l13K96l48m14J09m1L12Q5q0r9k73k8Q9K89n7J12j15m4k06j19J69M37r2m6j72L2j93
209B40RK25J8K19p0k04r4j33P7L02P6lM1k34k09N3J14J88k1K35j10k87j01J28l6L29J34j30
-54G56n8j82j67Q0K60K05L5j20K5m50J45R8K33J39O4q2k25j35L9J63K09K32N5j85j60j62K50
-308A062L5M53J0J60j64j24j60%N7
-392A329
$$ plain form
706 61 304 361 509 482 382 235 110 132 430 323 209 762 435 346 121 237 478 528 805 1085 931 399 318 829 519 950
462 950 637 933 585 171 280 239 551 636 556 457 184 156 245 534 477 589 474 430 224 105 274 711 619 573 401 433 240
209 240 249 474 492 711 641 437 343 210 287 589 665 662 703 469 260 313 427 615 594 829 719 432 331 459 423 752 886 756
-54 756 698 516 349 429 689 894 929 809 834 384 529 627 860 999 1063 981 756 621 660 823 1032 1264 1319 1134 974 812 1062
-308 1062 1097 1550 1560 1720 1556 1432 1272 1272 1329
-392 1329
##PAGE=	F1=1851.81
##FIRST=	4405.895418600002813,	4405.895418600002813,	2.1604175567626953125
##DATA TABLE=	(F2++(Y..Y)), PROFILE
4406A084J18nM9l39k44k49K4M07J15K8K1j81m95r2N5L14L13j9r2k04l25k47L44K64J86l8M5
4152H37m03j63q9K50L11P2n9j12k13k29J02K16K36m8J44k73j91j25J26K38J06J58j43k25j70
3918C53NJ62K17K11j66o1j15k88N2J90K64J16j01j07k01j09Q0K34K33m5L4k73m7j29K51R6
3673H56J61q5M4j72j84K2L67N4J46j41j23j36j4J84N2J50K14p9j66j72n2L02J21L18ok60n1
3420A350p8k6L61L05J69n2j86l54J3N60M80M81J58l02l68j631K193L57J979J907R26l51P29
3204H620R700R5428J36339M3021m7799k12628M4096K64277J05337l12562l4242J14465j83932
3082C0120j4141K391j0868J8882R251N973j5492q765J3080k1524j318l452L228k944n47J399
2932E273j445L221m758j681K068k087J232j42j22J76k26k64j18n4L8O6N6O8j49j56j42j12
$$ plain form
4406 1084 1202 1197 1246 907 663 414 438 845 960 988 1009 828 333 241 296 610 923 904 812 608 283 36 380 644 830 792 837
4152 837 434 271 182 432 743 815 756 644 431 202 304 520 756 708 852 579 388 263 389 627 733 891 748 523 353
3918 353 358 520 737 948 782 721 606 318 370 560 824 940 839 732 531 422 502 736 969 924 958 685 638 509 760 856
3673 856 1017 932 976 804 620 642 1009 1063 1209 1068 945 809 795 979 1031 1181 1395 1316 1150 978 926 1228 1349 1667 1661 1401 1350
3420 1350 1272 1246 1607 1912 2081 2029 1843 1489 1502 2062 2542 3023 3181 2879 2511 880 3073 3430 5409 7316 8242 7891 8620
3204 8620 18320 113748 250087 293108 245309 32681 76777 341054 446391 133829 99587 214052 30120
3082 30120 15979 18370 7502 26384 35635 41608 26116 17351 30431 8907 7589 4137 7365 4421 3874 5273
2932 5273 3828 7049 2291 610 2678 591 1823 1681 1559 1735 1509 1245 1127 1073 1111 1177 1233 1301 1152 996 854 742
2725G42J56J59j04j2m38m08J652R903k849p586K37n53J56k15l8J32j49j48R04o96k2j06k01
2509E16K54jJ43q2r9j33m0lR4J14m3K8j30j0j17RJ12O9N0j8k16M9j54J92l7P9J23j62n3o4
2227D70j46J79M4O4m5Lj30K6q9J21O7m1Qo0n4o8J48l5M7j5Q5j81m5J9O9k1P2K3j04P4j83K0
1927C22O1J29m0k8p1Qq0pK23m6l2j6q3K5j30J62l3Q9j5m7q3j18O7J68m2J25J21l62J53j73
1645B47P8J70j76J27k4j47K32l56J06K12r5J44l18K36l06J69L0Q1P3k06N6l9j66J56J31l7
1401C78l0N4j20r8M6nJ51K0j4p5p9Nj2J68r9K61k38N2q3K5p7Q4l8K69l13N2k8J3L9N5NM3k6
1091C85j45j26J25R4R7l2j8j32Rj14J39jQ8J02j28j56m2K7P1J45l4P7j67L9j61Q5J23L7M6
819D33l2j25j7j51J24J53r3J76p9j56o0J2R9P9R6k0j12j07j11J0K68p2j4M79l79j51j73J75
$$ plain form
2725 742 898 1057 953 941 503 95 1747 11650 8801 1215 1452 899 1055 840 802 934 785 637 1541 845 823 717 516
2509 516 770 769 912 830 731 598 558 555 649 763 720 748 618 608 491 500 612 681 731 713 497 546 392 584 547 626 749 587 534 470
2227 470 324 503 547 611 566 569 439 465 376 497 564 523 531 471 417 349 497 462 509 494 579 398 353 372 441 420 492 515 411 485 302 322
1927 322 383 512 472 444 373 381 301 294 517 471 439 423 340 365 235 397 364 453 438 391 308 190 257 425 383 508 629 267 420 247
1645 247 325 495 319 446 422 275 507 151 257 469 374 518 200 436 130 299 329 410 483 277 333 294 128 284 415 378
1401 378 348 402 282 184 230 225 376 396 382 307 228 233 221 389 290 551 313 365 282 307 230 314 276 545 232 284 256 269 308 363 368 411 385
1091 385 240 114 239 333 430 398 380 248 257 143 282 281 369 471 343 187 145 172 243 388 354 431 264 303 142 227 350 387 433
819 433 401 276 259 108 232 385 292 468 389 233 173 185 284 363 459 439 327 220 109 119 387 315 301 780 401 250 77 252
556B52J89M5J51J12K54o65J51K51k00L87l48K43m09k72J71n2K25O4r3q0j25j03M0K84o1O3
312D74r0m0k04%J15L82j12o3j62M1k80K14J14qK40j35j17j67j57J87K65M8l3P0k23k79J04
58A84R8K21k7J99j74j72j56J15J9K92J21j32j12k12j82J93K54J74M5j70Jm85R6K14K56R5N0
-195H05j06k88j83K9K97J65K25K5k27k46k13K50J37M19qQ3j84j75k34K4J44
$$ plain form
556 252 441 486 637 749 1003 338 489 740 540 927 579 822 413 141 312 260 485 549 456 376 251 148 188 472 411 474
312 474 384 344 140 140 255 637 525 462 300 341 61 275 389 381 621 486 369 202 45 232 497 545 512 582 359 80 184
58 184 282 503 476 675 501 329 173 288 307 599 720 588 476 264 82 275 529 703 748 578 579 94 190 404 660 755 805
-195 805 699 411 228 257 554 719 944 969 742 496 283 533 670 1089 1081 1164 980 805 571 595 739
-392G39
##PAGE=	F1=1833.03
##FIRST=	4405.895418600002813,	4405.895418600002813,	2.3873021602630615234
##DATA TABLE=	(F2++(Y..Y)), PROFILE
4406F80R5oR4l58o7k89J57K34J48J7L4j20k72j91R3L24J56j8n1j07k09l8Q3K01J13k9M1k15
4143E00m8r1J63J41K0l2j6j51k1M7O7Q7m2J57j88n9j0%J55lJ57r6j59m8R8N0P4J64j54n4L9
3852G47j57j6J10J52P7o5o9m0n8K5Q8J94o9Q4k11N9o3J24kJ01l4O3q7n6j7K95n2R1r2p1LN6
3551A110R6n2P7J88qq1j1n0J89pK36K3j56P0O1p4K01J56R5K7J9j44J06L54J77K48J16j54K7
3279B839p25K231n38Q65P39O3j161k347K339L7932N4210K7033N372j10680O9651K45054J33140
3119D66017l29099K7402J49075k63466k4084J6457l4500J5701j3642N557j0385m294J6323
2997A7062j2448M46p8O156o858K223R2l501L769l202k704K399k207J262k41k87R2k09k09k7
2810A530j7Ll2k3lr9q7q1r6J37K6r9j19n02o2Q80Q996k530o344k7m45K20j63l6O3j98l17J442
$$ plain form
4406 680 775 769 863 505 438 149 306 540 688 705 739 619 347 156 249 573 729 711 660 553 344 306 389 590 703 674 715 500
4143 500 452 361 524 665 685 653 637 486 465 512 579 666 624 781 593 534 524 524 679 676 833 737 578 530 628 678 752 916 762 708 747
3852 747 590 574 684 836 913 848 779 739 681 706 794 988 919 1003 792 851 788 912 910 1011 977 1040 953 897 880 1175 1123 1214 1122 1051 1054 1110
3551 1110 1206 1154 1231 1419 1411 1330 1319 1269 1458 1451 1687 1710 1554 1624 1685 1611 1812 1968 2063 2090 2109 1965 2071 2425 2602 2850 2966 2812 2839
3279 2839 2114 4345 3807 4672 5411 5474 4313 1966 4305 42237 96447 123480 128852 18172 87823 332877 466017
3119 466017 136918 164320 313395 49929 25845 42302 7802 23503 9861 15418 5033 739 17062
2997 17062 4614 5060 4982 11138 4280 6503 6595 3094 6863 3661 957 3356 1149 2411 2170 1883 1975 1766 1557 1530
2810 1530 1513 1516 1484 1461 1458 1359 1272 1191 1095 1232 1258 1159 1040 538 476 1356 10352 7822 1478 1451 1006 1226 1063 1027 1090 892 575 2017
2547B017j089Q4p3j84J84l6N6k7q2q7nOJ1P1m0kp0L5r4k6J05k4O5oj70J13j83K01j43O3J32
2256H02j34j2l7j40J20MM6k8K7q4M9j08R0K2q3N0ok6p0J22r2M0oP1j03Lj0Qm6M8L6r5J24j40
1936D42J4l9J50p0on8L8l2j1Q4K9j03K1j8J9j28J51p3L1M9m1n2q7P3Q9o7J21J08l12J92j50
1645C64K4J51k02J94j03j35L52l71M2J87j44J91l02K65k36J27m0O7O3j64J9N3j44J02P7l8
1401C99n4Q1l5r2L6p3J48j9J5q1j4J9J3R0j53K48j77L0k6O2j29N7n8K33k33K9K7L4j9kQM5
1101D09K0j37n2J14K3N4l9qp0J9n8N7j8N7O5q4q8k4P2m3J28m5N4j26P9r5O9J6P2j9k3l6K8
791C71j41Q3P6j10J58o1m1q6Q9l6R1K6Mq6l5n2rJ42l9K15J97l15j72k4N1J26M1J7j12O55o77
500C46L16k7j27M10m08J98k31k10R4l3J12M7q9l1K0j12k9J89n8K2l6l1q1M8L6K44j25o2q7
$$ plain form
2547 2017 928 1012 939 755 939 903 959 932 850 763 758 764 775 846 806 804 734 769 675 649 754 730 795 789 619 732 549 750 607 670 802
2256 802 668 656 619 479 599 603 649 621 648 564 613 505 595 617 534 584 578 552 482 604 512 552 546 617 514 517 507 515 469 517 553 458 582 442
1936 442 456 417 567 497 491 433 471 439 428 512 541 438 459 441 460 332 483 410 441 490 449 397 310 383 472 405 526 634 322 514 364
1645 364 388 539 337 531 428 293 645 274 316 503 359 550 248 513 277 404 364 431 494 330 349 402 258 360 437 399
1401 399 345 426 391 299 335 262 410 391 406 325 311 330 343 433 280 528 351 381 355 417 288 345 287 520 287 316 343 377 358 356 364 409
1101 409 429 292 240 354 377 431 392 384 314 333 275 332 314 371 436 352 264 240 312 269 397 352 406 280 359 264 333 349 421 402 379 343 371
791 371 230 313 389 279 437 376 335 249 338 302 393 419 423 337 302 250 241 383 344 559 756 441 269 245 296 422 463 480 368 1023 346
500 346 662 635 508 918 510 708 477 267 361 328 440 487 398 367 387 275 246 435 377 399 363 332 251 299 335 579 454 392 305
227C05P3j83J82j1n7K36j47Rj78K6P1J24Lm4J13j20j81O2rJ58l9J82k13P0j42nK6J79J00r0
-54E00j11j62O2J1J55J08O3j73K0j48k29K60J80M4L2o2k07j55o8L51K6J96J8j66k31j03j6
-308A95K41L03k8K9j03j89k70m8K79
$$ plain form
227 305 378 195 377 366 309 545 398 407 229 255 326 450 453 409 522 402 221 283 274 432 393 575 362 432 290 285 311 490 590 500
-54 500 389 227 289 300 455 563 626 453 473 325 96 356 536 580 612 550 343 188 120 471 497 693 711 545 314 211 195
-308 195 436 739 711 740 637 448 178 130 409
-392D09
##PAGE=	F1=1814.25
##FIRST=	4405.895418600002813,	4405.895418600002813,	2.0323736667633056641
##DATA TABLE=	(F2++(Y..Y)), PROFILE
4406D64J5nJ99k44J63o5J0r6P4jQ7j2l1j10j1J60j2j1K6Op6Ok5O9L2mO1n2K4j09J09l1j8K
4087E94R0q4O6J8m3m7j7J76j01K0L2o2Q7q8J49l0r1J6J38k7l7J28j29j5J20q2o1O9O1L3qk5
3786H50N1l0j2k6J65q1J38j50J00j9K9o7N0L5P8k2jl9K33j17M4l9oR2P2Pq7J9J78O7l9J00
3486A573p3J05q2J70N8l4J21J31j12R1M7P7J12J76l1J21J85k1J19J51P3L23J29J684j302M08
3242D199K9M08L24J524L743J97q063J0896K9106j9950O4646K07696J45077l15123R9399J73903
3091C98011l29567Q73L491o3711J3392O730j2154o56q205M854m392l921j263Q771q981L265
2941F537j488l036K56K208k316J107j155N03j70k77l1j15j56J8m4K1j47n8n9k6k8q3n8J01
2716A504r0m2k09l34J86o05N771j320l284j82l03K43j36m2j5j70m04J800j392J66o3j56J21
$$ plain form
4406 464 479 474 673 429 592 527 537 441 515 514 601 589 558 448 437 597 585 574 600 606 530 536 511 580 612 608 669 617 641 532 641 610 592 594
4087 594 684 600 666 684 641 594 577 753 652 672 704 642 729 641 790 760 669 685 823 796 759 887 758 743 863 781 720 789 850 883 875 850
3786 850 901 871 859 833 998 917 1055 905 1005 986 1015 948 998 1033 1111 1089 1088 1049 1282 1165 1209 1170 1164 1256 1328 1335 1248 1267 1445 1512 1473 1573
3486 1573 1500 1605 1523 1693 1751 1717 1838 1969 1857 1948 1995 2072 2184 2360 2329 2450 2635 2614 2733 2884 2957 3280 3409 5093 3791 4199
3242 4199 4228 4636 4960 6484 10227 10424 2361 13257 42363 22413 87059 294755 439832 124709 224108 398011
3091 398011 68444 69317 72808 9097 22489 29219 17065 16409 8204 13058 8666 4745 3482 12253 3272 6537
2941 6537 5049 2013 2269 4477 2161 3268 2113 2616 2446 2169 2138 2023 1867 1885 1841 1862 1715 1657 1598 1572 1544 1461 1403 1504
2716 1504 1414 1372 1163 829 1015 410 6181 4861 1577 1395 1092 1335 1199 1157 1142 972 568 2368 976 1142 1079 923 1044
2500A044m9k0L1p8m8J7J5n7M3k3l2k4O0p7n1J09j02Q7lj27J47j95J93k15N9J21r1J1l3j20
2218E92P3k1L1lL9n3N3j04N4j1j10R2L3k0p3J05j22K6J6M7m9M6l6m3n3L1M4q1J37j03K0j25
1918D32J76r7K7m8M3Pk1qP7j45M3L6J9j38J53j14j4J10n2j3p9Q5K8r3J20J24l06K28j29j4
1636D37J31k16K41j44j20L80l20l8J78j79K17k64K67j87J04j02O0N5j27JR3j03N6L3l7p1J20
1382D65jp2K0j09J36n4N0p1K7kM7K4j74K21j31L3OQ0j50K1o0J91j61K9O1J9o1k8NN2N1j17
1082C47mR1j5J0m0jjJ2l3%j8L8J2k3m3mQ2j08J05n3M1r0J19o9M9m1Q5o5j9O5L4j53P4Rj13
753B80J28l3N4j13J37j24R9m6L2m2Qj3j6O1l3M58j53j96j45J9l3P5M3q5l16R58n95K82j36
481E55j33N02m09J32K2k65k2OJ4L7p0K4J00j26l4P1l8j0K5j9lN1QJ09j26m5jQ8r4J13r1j01
$$ plain form
2500 1044 995 975 1006 928 880 897 912 855 898 875 843 819 879 802 751 860 758 845 842 715 862 667 860 645 704 825 734 745 712 592
2218 592 665 644 675 672 711 658 711 607 661 650 540 632 665 645 572 677 555 581 597 644 595 641 605 562 509 540 584 503 640 537 557 432
1918 432 608 511 538 490 533 540 519 511 588 443 486 522 541 403 556 442 428 538 486 473 394 479 507 414 534 658 352 580 451 437
1636 437 568 352 593 449 329 709 389 351 529 350 567 303 570 383 487 385 445 500 373 374 467 364 420 453 416 345 465
1382 465 464 392 412 303 439 385 435 364 391 389 436 460 286 507 376 409 415 495 345 366 306 497 336 365 426 445 384 356 361 413 464 347
1082 347 343 434 419 429 389 388 387 399 366 366 348 386 398 375 332 328 410 302 407 354 395 305 424 355 404 363 448 383 364 429 463 310 384 393 280
753 280 408 375 429 316 453 329 428 382 414 372 380 367 351 412 379 837 684 488 343 362 329 404 447 362 46 1004 409 691 555
481 555 422 924 515 647 669 404 382 388 402 439 369 393 493 367 333 404 366 356 381 362 359 410 418 527 401 356 355 443 349 462 371 270
180B70K05j06J01j51Q2L1pm2l4J53k3j18N0p0M7n0J71j82K36j33n7rN3P3k2m4p8J30j00O5
-101D41L1P5j38R2L0k25J16N4pJ2L8m9n9n4J44j21J28M4j5p0N1j87R2R4o3K5J05q5j7q2O8
$$ plain form
180 270 475 369 470 319 401 432 425 383 349 502 479 361 411 341 388 338 509 327 563 430 373 364 417 490 468 424 346 476 376 441
-101 441 472 547 409 501 531 306 422 476 469 481 519 470 411 357 501 380 508 552 537 467 518 331 423 517 454 479 584 499 482 400 468
-392D68
##PAGE=	F1=1795.47
##FIRST=	4405.895418600002813,	4405.895418600002813,	1.7716197967529296875
##DATA TABLE=	(F2++(Y..Y)), PROFILE
4406C61r7M6L47q9K21k3p3k62n5K1J74Q6N5p6p6J5j16K0J16P9j1Mp5m9j4M4Q8M1O1j32O6j57
4105E40k8N1J66l6R6l0j07j35K4K02l9N4L9r7K6j29J44L6l8M5J38r0j05J09r1L3J49m7r3M1
3824H28LlN9J5Q4j0n1j03J42o9J84j09J05Nm2j04K1J02R2J5Qm7J68j38J0J3N5J31O3q7o8k1
3523A251J80J28l1J70j07M2j11J24Q9O4J31J55j44K7k2J01J65K59J2J08N7j18R4J81K54L94
3279C453R40N60j534M17k22R52J393K564M839N590K1034J7335n2706K1783M9253J58597J39173
3119C73421k73284J66380J84234l68985M4636k3265p2120j8880J7424j5719L466r097K07j559
2988F859j842n36O775m367l476k760R595k694j482k019j568Q93q61r3j17j04L4j13Pj26O9
2791B074k72l9q5N8J6j33j9M9j78M1k65k7K83p50J603k99n21k32j56K30j31l8j16q7l48J833
$$ plain form
4406 361 264 310 657 568 789 766 693 431 376 397 571 657 712 636 560 575 459 479 595 674 663 667 592 543 529 573 661 702 763 631 697 540
4105 540 512 563 729 693 789 759 652 517 541 743 704 758 797 700 726 597 741 777 739 784 922 832 727 836 745 778 927 880 787 828
3824 828 831 828 887 902 986 976 925 822 964 895 1079 970 1075 1080 1038 934 955 1057 1149 1164 1172 1125 1293 1155 1165 1178 1233 1364 1427 1340 1272 1251
3523 1251 1431 1559 1528 1698 1591 1633 1522 1646 1735 1799 1930 2085 1941 1968 1946 2047 2212 2471 2483 2591 2648 2530 2624 2805 3059 3453
3279 3453 4393 4953 3419 3836 3614 4566 5959 8523 13362 18952 39986 57321 4615 26398 75651 234248 373421
3119 373421 100137 266517 450751 81766 126402 103137 31017 12137 29561 13842 17308 8211 8418 6859
2988 6859 5017 4481 11256 6889 3413 653 10248 7554 6072 4053 2485 3378 2517 2424 2307 2203 2237 2124 2131 2005 2074
2791 2074 1802 1763 1678 1736 1752 1619 1600 1649 1471 1512 1247 1220 1503 753 2356 2057 1536 1304 1148 1378 1247 1209 1093 1006 658 2491
2547B491j517K13n9j25O7n2p3R2q7j6L0J7j14L5Ko1J9O1o0p3J13j52J08jr1J55j90J59k49
2274F42O7R8l6J4l8j00L6l1K2K8M0l6M4r2K0l2j18J33M7k5p3R3j33J1M8J9j3P9o3q5m5K7M9
1964E97p1J22o7K7j91K00j14O2m2L8L4n6k7P1j34M5P6J9j63J63j53l0J57o9K6q3R5k2j07J15
1683E18J65l23K37r7m1J01k11K70j44j29L43k13j26J82k00K26k02K44j61R5j55N7N6r9%R5
1439D88n6K0nl0q1J63om7Qj30J19p5Q7o0N6m5Q1l2j62J87r7N1J3Q7j68pm2J52j03M3P3j9q8
1129C75k6kO5O5r9L8N8m3k1l1PN8j2k5l6qL3m5M4k1J9O6j40Q0n0L7n8J41o0J7n5P5q0j7J44
800D93K6j76P8m4r8R5KJ15j37J64j85J12j04N6PK2J8k8K8o8O99n48k6r4J2r2M1N2j23LO47
509I47m46Q4l4k59O48l55O1J76l05j61N2n4M5m5O9J32j54j0m0J0l0P4kK0L9m%j05j2O7P3k0
$$ plain form
2547 2491 974 1187 1128 1003 1070 1018 945 1037 950 934 964 981 867 902 904 843 862 923 863 790 903 751 859 858 767 922 732 891 642
2274 642 709 807 771 785 747 647 683 652 674 702 742 706 750 658 678 646 528 661 708 683 610 703 570 581 629 648 635 714 651 566 521 548 597
1964 597 526 648 581 608 417 617 503 565 523 561 595 539 512 583 449 494 570 589 426 589 436 406 563 494 520 437 532 510 403 518
1683 518 683 360 597 500 459 560 349 619 475 346 689 476 350 532 332 558 356 600 439 534 379 436 492 393 393 488
1439 488 432 452 447 417 336 499 493 446 454 324 443 368 455 395 451 406 487 455 293 480 383 434 447 534 366 359 317 469 366 409 482 463 375
1129 375 349 347 412 477 378 416 474 431 410 379 386 444 432 407 371 363 396 351 395 374 393 459 319 399 349 386 328 469 409 426 371 446 366 349 493
800 493 519 343 421 377 279 374 376 491 354 518 333 445 341 397 404 426 444 416 444 376 1075 527 501 407 419 327 368 420 297 300 947
509 947 501 585 551 292 940 585 646 822 517 356 408 354 399 354 423 555 401 391 351 361 331 405 403 423 462 458 458 353 341 408 481 461
209D61L4j41j17J70l1J43j32R3Rj08o2%J81L3q2L3j01n0m1J66q2K76j32q9m4m0O0N9L7n3J31
-83E81j79J8k9J06q6J68P5k13K0m3k6J4J43M0k2n8j0j83M9J18J30K0R0k26n0q6o1J07K90j6
-364F81O1j12m8
$$ plain form
209 461 495 354 237 407 376 519 387 480 489 381 319 319 500 533 451 484 383 333 292 458 376 652 520 431 387 347 407 466 503 450 581
-83 581 402 420 391 497 411 579 654 441 461 418 392 406 549 589 567 509 499 316 365 483 613 633 723 497 447 361 300 407 697 681
-364 681 742 630 582
-392E82
##PAGE=	F1=1776.69
##FIRST=	4405.895418600002813,	4405.895418600002813,	1.7842553853988647461
##DATA TABLE=	(F2++(Y..Y)), PROFILE
4406B65j37K13M44j2K05o1j57l79j95J81K65J46M7p0j47j43j53J11K16J11Lk7j24j64j2J38
4162E64J16Q5P0j63j1k41OJ29K11kR1j16j52j75Q6K47LN1K5j30n1j23J61J02ON3Q7j52j45
3889F32J17l0Q2J52m9j24Kk9j4J39N2P8jj11j52J20j7K24q4Q9kr9j27J8J69J18K9j5n7Q6j24
3598A072kP5J04J38K6j83k4m5K02J79l8K00j54j6j11J06J23J39J24J36j85j0n9J64J93K83
3354B437J4O1m2j39J58J84L87K76J553j436k46K41j38R40J762K062L777P506O846L2237m4948
3157A3492R624L3874J06311J17353k11796K13379J78262l73644R9392o0100m9809j0288k2894
3035D3156k4472q816J786j617o221N150P546L414q81j6448M936J3571Kj1373l620m585K911
2875D439j950l57J01l8J77p4n1k34Q6l80K5p2J44M4k00j1j7k33J19k84K92K37r1K559j163
$$ plain form
4406 265 128 341 785 773 978 917 760 381 186 367 632 778 825 755 608 465 312 423 639 750 753 726 602 438 426 564
4162 564 680 765 835 672 661 420 426 555 766 764 855 739 587 412 498 745 748 799 824 694 643 520 681 783 789 842 929 777 632
3889 632 749 719 801 953 904 780 782 753 739 878 930 1008 1007 896 744 864 847 1071 987 1076 1074 975 848 866 1035 1153 1182 1167 1110 1196 1072
3598 1072 1070 1145 1249 1387 1413 1230 1206 1161 1363 1542 1504 1704 1550 1534 1423 1529 1652 1791 1915 2051 1866 1856 1797 1961 2154 2437
3354 2437 2451 2512 2470 2331 2489 2673 3060 3336 4889 3453 3207 3448 3310 4250 6012 8074 11851 19357 26203 58440 13492
3157 13492 23116 56990 163301 280654 68858 282237 460499 86855 186247 126147 76338 66050 43156
3035 43156 18684 9868 11654 10037 3816 8966 16512 19926 19045 2597 7533 21104 21106 9733 6113 1528 4439
2875 4439 2489 2132 2233 2195 2372 2298 2247 2013 2099 1719 1744 1672 1816 1860 1660 1649 1632 1399 1518 1234 1526 1763 1672 4231 3068
2641C068j641k28l1K12j51j7k40Rj98J595j436K19n7j02J8n3r9J56j03J4L5%j61M3L2p7O3
2387H70M3m7j01J06j66J23J4o0J36j72R3k48Q8P1L1Jm2r9J1l1J7O8L9k9K4q8j3l8j04J71M0
2096G08l5o8P7j39%R0lJ3R7j00j18k8L9N8o4R2l8K6k38K16j13J00l8K8M8j37M5k2l9L0J05
1805E92J3k00J61j86j0J89p6N9j01R7o9j00J02K23l19J83m4o0M9j80K88j12j52K55p3k19J92
1551E02k08K33j25K15j64Q4j97N5P0o8QP4j5j1m4j6p8K08l2k7pj39R2p1J20m6P7j04J10q1
1270D15j30J57o5P8JP9j93k5qJ27n5O5O2p0j06j3mQ5P4q7P4J3p7l2oK2J04n0l0n6pM6q9J12
950D11j0L4K5j52N0l2N0k4J41n7l6m6M8n5j5J97J6k05P6r1o5P4M7J44j53J61k31J21j36Q5
669C72N8J8L5n5J9j16R18j043K70k9k1j37J5O3j00K80L18k63j90J81m47Q02l39L6K39k82l21
$$ plain form
2641 3068 1427 1199 1168 1380 1229 1212 972 981 783 2378 942 1161 1104 1002 1020 967 868 1024 921 935 970 970 809 852 884 807 870
2387 870 913 866 765 871 705 828 842 782 918 746 839 591 679 750 781 782 740 641 652 621 638 706 745 716 740 652 639 601 497 668 708
2096 708 673 605 682 543 543 633 630 643 740 640 522 494 533 591 527 619 581 607 369 585 472 572 534 562 610 473 518 496 457 487 592
1805 592 605 405 566 380 370 559 483 542 441 538 469 369 471 694 375 558 514 454 503 323 611 499 347 602 529 310 502
1551 502 294 527 402 617 453 537 340 395 465 397 405 479 464 453 409 393 315 523 491 464 457 318 410 339 459 413 490 386 496 415
1270 415 285 442 377 455 456 535 342 317 309 436 381 446 508 438 332 319 315 400 474 387 461 474 397 365 359 381 485 435 405 349 342 388 299 411
950 411 401 435 460 308 358 326 376 352 493 436 400 354 402 347 332 529 545 340 416 325 260 334 381 525 372 533 302 423 287 372
669 372 430 448 483 428 447 331 1249 206 476 447 426 289 304 367 267 547 865 602 412 593 146 948 609 645 884 602 281
415B81R4r6Q9j9J06J35k06K7j51Q0j6J08K4%Qk4q5n1M2J16L5M1o4j81j10J57O8J49j23P2j7
124D89j97n2P7J95N9n6j7j27j32JJ79N9K22j32j27q3j07Q3J52J14o7R3k48l2o9J97k2K22M5
-148G19j90r6j17OP8K21P1j6q9j65j95L9K45K18M6Q4k62j76k53J36K29L46pP3j77j36
$$ plain form
415 281 375 279 368 349 455 590 384 411 260 340 324 432 456 456 464 440 355 304 346 462 497 538 474 293 183 340 408 557 434 506 489
124 489 292 240 317 512 571 515 498 371 239 240 419 478 700 568 441 358 251 334 486 600 533 626 378 346 277 474 452 674 719
-148 719 529 433 316 322 400 621 692 676 587 422 227 266 511 729 775 859 597 421 168 304 533 879 872 945 768 632
-392F32
##PAGE=	F1=1757.91
##FIRST=	4405.895418600002813,	4405.895418600002813,	1.8981097936630249023
##DATA TABLE=	(F2++(Y..Y)), PROFILE
4406C64K6K02M46OJ65j41k24m74k64L87K86J71Nr3k21l37j31K74K93J16j5p1j92l04L8K88
4162F00J35J02O0k01j51l04J10K32K27K5O2k34k13j82J92L03L9K3Mj83j68p3K20J66M8M6j5
3908H70k16j79J56N9J30J50q1j59p2m4J5K28R6M7rj99j86R6Q4K58o0N8l9j51j58M3K40J64
3645A141L2o2q4j5r3J9J55J43J26l5k78Pn5K49K33m5J97k13q2j08J21J73J99J19Q1k48m4p0
3382A563K53K24K76Nl4j20j26K70J95N07Q1K072m788L442q16J94N88J862R78K087J1732N933
3176B6378r304n197J912K1817N9619Q4637j42098K29953J57548l42874J55034j01579K932
3054A38778J8081l6382l6758m2777k2200k353n027N341J6407P172m124k6838R338J4342L422
2913C6422k2129o630n988L033j942j056K42K26K31l1j33l07j8m24J10k1K18O0k52n7r1k54
$$ plain form
4406 364 390 592 1038 1044 1209 1068 844 370 106 493 779 950 955 862 641 304 173 447 740 856 841 770 578 274 312 600
4162 600 735 837 897 696 545 241 351 583 810 835 897 663 450 268 460 763 802 825 829 646 478 405 625 791 839 885 870
3908 870 654 475 631 690 820 970 889 730 658 614 629 857 953 1000 991 792 606 702 786 1044 984 1042 1003 852 694 737 977 1141
3645 1141 1173 1111 1027 1012 919 938 1093 1236 1362 1327 1049 1056 1001 1250 1483 1438 1635 1422 1340 1232 1353 1526 1725 1844 1925 1677 1633 1563
3382 1563 1816 2040 2316 2321 2287 2167 2041 2311 2506 3013 3094 5166 378 3820 3004 3198 3786 5648 6626 8713 20445 26378
3176 26378 17074 11877 13789 35606 95225 179862 37764 267717 425265 82391 237425 135846 138778
3054 138778 156859 120477 83719 40942 18742 16389 11362 16703 33110 40282 36158 9320 18658 33000 36422
2913 36422 14293 7663 1675 4708 2766 1710 1952 2178 2409 2378 2245 1938 1920 1496 1606 1585 1803 1863 1611 1554 1463 1209
2706A209J61k69N43N7L07K484j129k031k37M8K23j95J7l64O6l3J253j196J92o2r6l2o3r3K21
2472I81j15M5L0m2k03O2O3p3J12J4m2j39P9j47J35M7l1R8j50jk22J17N3J03j7m4j24ol1J7
2190E69J23L7k6kj05m4l2o8K07K1m4o3N3j52jJ39j0L3R9j52j40j5O9P7n6N6k0J1k70K23r4
1899D23J42l3J9M8k74K24k39J66pJ34J0k32J10k15M6K08o4Q4j35R4j20o9P9K86k69O1K7p1
1636D33l2j28L12o8j70J38O3k99J90k05K54n4K03j99O4k26M7J02k6J5M6J0m1r1Po2K54n9j7
1364D61l0j42N1l9J47k3Q8j65J28j33r0J49l3J05k2N7k29l4L3J21j0R0L0j22j25mOJ19Q1p3
1082C92R5m1j25k7M0M4J37r4m4n8l6P5j05J79nL6l8j51J1JQ5J3J20n6j08l4RJ5j0K24J0k32
781C22N5j38j7P4R8J49j56J30k69J09j33J26J06RL3j05J5MJ030j076O0M7p3j63k5Q1n9N25
$$ plain form
2706 1209 1370 1101 1644 1701 2008 4492 3363 1332 1095 1143 1366 1171 1188 824 890 857 2110 914 1106 1044 948 916 853 760 981
2472 981 866 911 941 899 696 758 821 748 860 874 832 693 772 625 760 807 776 874 724 723 501 618 671 774 757 713 589 583 552 569
2190 569 692 729 703 701 596 552 520 452 659 680 636 573 626 474 473 612 602 635 734 582 442 427 496 573 517 573 553 564 294 517 423
1899 423 565 532 551 599 325 549 310 476 469 603 613 381 491 276 322 530 466 550 415 509 389 320 399 685 416 477 504 433
1636 433 401 273 585 517 347 485 548 249 439 234 488 434 637 438 502 276 323 425 399 414 460 470 429 338 345 283 537 478 461
1364 461 431 289 340 301 448 425 513 348 476 343 253 402 369 474 452 509 280 246 279 400 390 480 510 388 263 259 265 384 465 392
1082 392 487 446 321 294 334 378 515 421 377 319 283 358 253 432 427 463 425 274 285 286 371 384 504 448 340 306 315 330 320 544 554 322
781 322 377 239 222 296 394 543 387 517 248 357 224 350 456 465 498 393 408 412 1442 366 426 473 400 237 212 293 234 759
518G59K8r7m07L25n22Q49m03Q9K43k05m77J11j19J86JJ36J19k73O3k71J57M8J31N5m2m3o6
265C75j59M4J20J49j3Q0j73k25q7J78J75J35j18K6n0k99j4K09J94O9l4r7j64k16J01K02K14
11F22J07j24j69j33j66J56K41J85j00L0k80j48j11L88M6K46j9j54k39j79R7J93K51P4k6j42
-233F46k84k37K10L07K54M6N3k78k62l35M03K84L26j8O9k56j92
$$ plain form
518 759 787 690 283 608 86 935 532 621 864 659 182 293 174 360 361 497 616 343 406 135 292 340 471 526 484 441 375
265 375 216 260 380 529 516 596 423 198 111 289 464 599 481 507 457 158 144 353 547 616 582 485 321 105 206 408 622
11 622 729 605 436 303 137 293 534 719 619 649 369 221 110 498 544 790 771 617 378 199 296 489 740 814 788 646
-233 646 362 125 335 642 896 942 995 717 455 120 523 807 1133 1115 1184 928 736
-392G36
##PAGE=	F1=1739.13
##FIRST=	4405.895418600002813,	4405.895418600002813,	2.1231684684753417969
##DATA TABLE=	(F2++(Y..Y)), PROFILE
4406G33Q0J63M13nJ23k22k44m62j18L03K35J72l6j34k62m31k2L03L10J05n0j07k57l89R5M06
4162G02J32J01M3k35l35l72L27L00K12M5K5l41l23j75L65L36P3k0pk61l28L1L17K02R1K6j42
3908G89k73k38K44J59J68J54j32j92j85n4J02K99J47Pl5l03k18P7K23K80l3K5r7k03k11R5
3664E95L17K26K7j15j32j30o2Q2K41J68J13j15l51j3m3L15K96m6J70k74j61j20J70K41K50
3429A649J26Ll28r7o0L50K81K59Rj75j83j07L77K55O19m4L287j029N8k622O37M42J890K47
3204E844J919J6103O3935l8678l793m2829J3424K6267M6821p4793K11970J26529k83547K00401
3073B69573j40462P9727O0314l5157n8675q5621p0883o354L861Q685K6272J4254j0402l9564
2941A5568J8146J1984N417l3330r620n063P61q19j686J66P00J27J7k12k71l23l54J88N3K65
$$ plain form
4406 733 813 976 1389 1384 1507 1285 1041 579 461 764 999 1171 1135 1001 739 308 286 589 899 1004 954 847 590 201 296 702
4162 702 834 935 978 743 408 36 363 663 875 920 945 604 281 106 471 807 880 860 853 592 264 295 612 814 905 931 789
3908 789 516 278 522 681 849 1003 871 679 494 440 542 841 988 995 960 657 439 516 739 1019 986 1011 914 711 500 595
3664 595 912 1138 1165 1050 918 788 726 808 1049 1217 1330 1215 864 851 808 1123 1419 1373 1543 1269 1108 988 1158 1399 1649
3429 1649 1775 1778 1450 1353 1293 1643 1924 2183 2192 2017 1834 1727 2104 2359 2978 2934 6221 5192 5250 2628 3265 3707 5597 5844
3204 5844 7763 23866 87801 49123 45330 2501 15925 42192 89013 14220 226190 352719 69172 269573
3073 269573 129111 208838 269152 233995 175320 89699 18816 12462 16323 25008 51280 65534 55132 15568
2941 15568 33714 45698 51115 17785 8165 3102 3863 3044 1358 1524 2224 2351 2368 2156 1885 1562 1208 1396 1449 1714
2753A714P3k63j58j67k45J52k20O84j88L55K60m81k25k73O1K68k51M1m54N9P8R79q89J48p9
2519I79j13p8q5n2K73j14P2J7j03k38Q4R6m8J55j5m5j88L2r9J45R8rM8j30j09j84J55M7J70
2246G61l1m3j72j8l6K7J83L8k2l2j46o9j9j2K34lm2o6J9j73NJ93%M9Q6k15j49j2J15J06m6
1955E10K3j5j6k97K24n5J83l0J2N0m77N39n79M43o6J70L1k10k1k53J05K19l2R7j79Q7j73j1
1692B79L9L37j83r6J04p4j34o0L48l2j74K8J53l37J53j90K99j2K17k51K9k40K9J53K3J8K1
1439D47J4o8j49M4l6K91p2k0o0j37rK0J68OQ7k12J36j96n4J75pJ24m5K7k69l9O9J38K7J14
1157E14j4j63j45j7M0J66P9n4R2r3j84j3J12O4J58j34o1m3j09J26r7K40mK3j09j35m9N9J32
885C81M9Q0n2j84l9l3J26qK29J2k43Lj89N2R3J46J28j36P6k89N4q6J74J39NJ9j72jM44J100
$$ plain form
2753 1714 1787 1524 1366 1199 954 1106 886 1570 1382 1737 1997 1516 1291 1018 1079 1347 1096 1137 683 742 820 1799 910 1058 979
2519 979 866 788 703 651 924 810 882 899 796 558 642 738 690 845 830 785 597 629 530 675 773 764 812 682 573 389 544 591 761
2246 761 730 687 515 497 461 488 671 709 687 655 509 440 421 409 643 640 598 532 551 378 383 576 576 625 711 496 347 335 450 556 510
1955 510 533 518 502 205 429 374 557 527 539 589 112 651 72 515 449 619 650 440 419 166 271 490 458 555 376 463 290 279
1692 279 318 655 472 376 480 406 272 212 560 528 354 382 535 198 351 161 460 448 665 414 443 203 232 385 408 426 447
1439 447 461 393 244 288 252 543 471 451 391 254 245 265 433 439 526 314 450 254 200 375 368 492 447 474 205 166 235 373 400 514
1157 514 500 337 192 175 215 381 460 406 498 405 221 208 320 384 542 408 347 304 195 321 224 464 460 483 374 239 190 249 381
885 381 430 510 458 274 235 202 328 320 549 561 318 321 132 184 277 423 551 415 491 202 256 170 344 483 488 507 335 334 778 1878
603A878o71q32J20j29j60j03J40n9P64k09Lm44K65l71P06n00K39J67j13n49M0j13L22MJ57
368E52R7l26P7l76K08J57J37R0q8j03j27k33J85J97J64n1Q5k64k48rJ73K48J09j05l4p5l96
115D4Q4L08J75P1j4j76k08j81J58J85L48l5r9j94j65j28J69K72K48j33m1k33k92n8M83J02
-129F90K35p6j09l42j41J49K54K44P0m0j91k47k35L25K73K58M3J9k52k45j85L72L11K78k7
-364A431P3l09j82
-392A013
$$ plain form
603 1878 1207 375 495 366 206 103 243 184 948 739 742 298 563 192 898 398 637 804 691 142 182 69 391 395 552
368 552 649 323 400 24 232 389 526 616 528 425 298 65 250 447 611 560 645 381 133 124 297 545 654 549 515 440 44
115 44 128 436 611 682 668 492 284 103 261 446 794 759 660 466 301 173 342 614 862 729 688 455 163 105 588 690
-129 690 925 849 740 398 257 406 660 904 974 934 743 496 261 586 859 1117 1160 1179 927 682 497 869 1180 1458 1431
-364 1431 1504 1195 1013
-392 1013
##PAGE=	F1=1720.35
##FIRST=	4405.895418600002813,	4405.895418600002813,	3.4410352706909179688
##DATA TABLE=	(F2++(Y..Y)), PROFILE
4406A168R7J43L70l4Q6k84k30m07p6K63J56J61p1j82k59l71J1K64K85Q7r7j23k90l00Q1M10
4162H58J06Q5K4k64m56j42K81K98J69N3j2l90m27n9M33L23J00p1j2l43m81K19L81J82J28n
3918I78k55l01l39M05K22J82J61j89k11l13n3K46L13J96l8p5l89k60R8L59K77ppj56k53k76
3673C15J78L85K80J4j66j90k38l5J88L06J78R7j99l85r3RL85L50m0J23l22k47j45K53L17K78
3429A596J44q3m08j72k1M38L59K41K8l34k32q8M59L71O81k4N891L307m929m665R27O86J892
3213F064J79L140K2677J20675l3270l9118o9167q120J5689L284j1016J55721R1279k08114
3082D9903K26107j69308J67129J10598k2809q2481j35617j19526r620M304J2134L6950K2672
2960I0436j7979n1445L1595P688L314m4955j1160k540k746P75j739k06J346j64O7k86r0q28
$$ plain form
4406 1168 1265 1408 1778 1744 1830 1546 1316 909 833 1096 1252 1413 1342 1160 901 530 541 805 1090 1177 1080 957 667 367 448 858
4162 858 964 1049 1073 809 353 211 492 790 959 1012 1000 610 183 124 557 880 980 909 897 554 73 292 673 855 983 978
3918 978 723 422 83 488 710 892 1053 864 653 340 287 533 846 1042 1004 929 540 280 378 737 1014 1007 1000 844 591 315
3673 315 493 878 1158 1172 1006 816 578 543 731 1037 1215 1312 1113 728 635 644 1029 1379 1339 1462 1140 893 748 1001 1318 1596
3429 1596 1740 1657 1249 1077 1056 1494 1853 2094 2122 1788 1556 1468 1927 2298 2979 2955 8846 12153 7224 2559 3486 4172 6064
3213 6064 6243 9383 32060 152735 119465 80347 11180 3060 18749 22033 11017 166738 258017 49903
3082 49903 276010 106702 273831 384429 361620 279139 143522 23996 14376 18680 30814 67764 90436
2960 90436 72457 21012 52607 60295 63609 18654 7494 4954 2208 2983 1244 1038 2384 2220 2287 2001 1911 1083
2791A083j40K40J34K71Q6k35k80k36k09R6j37P17l43J35L724j847j775k83j0L35l03L1m86
2575E68pJ01Q57n78R3j07j50j18j06K4K97j00Q2Kj75k63J12J34j4J81m2n1k43k5k8J57J51
2321G52Lmj19k07j46K04M8K20l8m6k29k7m4N8K32L8k3n9k02q5PN7K40k6l1q2k2j86J6K41K1
2030E61O1N7k76j42k3J74J37l5ok0m7l22K28JK08l2OO4m59P17m88K14j44K11Q6j02j61k78
1767A90M2K20J4R0k23P8k12P5k7L65q2k48J72q4k24J1L93j5j67l8J67l11O9j41L40qK45k96
1504C95j8k39QK18O6J2Mmr2j99R4jL02o7l9r0j25p9J00J86K7P0k30J27k59k8K39OJ24o2mk96
1204A46m1R5J64N3J31o2j86j55o3J13K02O6l1O3j32k35RJ92P6J60j60p3k5k06K02q5K93j6
941D95kj68j02j28J49J66P5K9m6k41o5o2K53j2K08K2k33o6k22J31J14J72Q2r4J6k70m7J3J98
$$ plain form
2791 1083 943 1183 1317 1588 1674 1439 1159 923 714 810 673 1390 1047 1182 4906 3059 1284 1001 991 1326 1023 1054 568
2575 568 561 662 1519 941 1034 927 777 659 553 577 874 774 856 858 683 420 532 666 652 833 791 740 497 472 444 601 752
2321 752 755 751 632 425 279 483 531 751 713 667 438 411 367 425 657 695 672 613 411 326 333 390 630 604 573 491 469 283 299 540 561
2030 561 622 679 403 261 238 412 549 514 508 488 441 119 347 348 556 524 530 594 135 852 364 578 434 645 731 629 468 190
1767 190 232 452 466 556 333 411 199 274 247 612 530 282 454 370 146 157 550 535 368 330 497 186 255 114 454 446 691 395
1504 395 377 138 146 364 430 442 446 442 350 151 245 244 546 479 440 350 225 146 246 432 459 529 299 426 167 139 378 384 508 446 442 146
1204 146 105 200 364 417 548 486 300 145 82 195 397 463 432 495 363 128 137 329 405 565 405 332 307 101 303 218 511 495
941 495 493 325 223 95 244 410 485 514 468 227 162 100 353 341 549 571 338 272 50 181 295 467 549 455 471 201 154 167 365
669C65J44KMk26m3J061J394m41j904J66j86j26j94K61j38R73l85K5l71R5j88N64n13M15No3
425F96m76j41M2L36jJ59P1l35N3k62P1K55J21J23j23j66j63j36J75K38J65p6N8l03j93N9J38
171C85K55P9q4r7p0k96Q6K94J42O8Jk26k30m2J33J36M34j72o3j96j44m3J28K39K96j61j03
-83G49j47l01K9M01J35J96j11p0l55o8J57K54K23N9n0k23j32k29L73K24K47M1qk09j79j06
-327I00L53L32K23k9Q0l32j42
-392A385
$$ plain form
669 365 509 511 515 289 246 1307 2701 2260 356 522 336 210 16 277 139 1112 727 752 381 476 288 852 339 754 759 696
425 696 220 79 121 457 456 615 686 351 404 142 213 468 589 712 589 423 260 124 299 537 702 626 684 381 188 247 385
171 385 640 719 635 538 468 172 258 552 694 762 763 537 307 265 398 534 968 796 733 537 393 350 478 717 1013 852 749
-83 749 602 301 330 731 866 1062 951 881 526 458 615 869 1092 1151 1101 878 746 517 890 1114 1361 1402 1394 1185 1006 900
-327 900 1253 1585 1808 1779 1859 1527 1385
-392 1385
##PAGE=	F1=1701.57
##FIRST=	4405.895418600002813,	4405.895418600002813,	4.6636648178100585938
##DATA TABLE=	(F2++(Y..Y)), PROFILE
4406A530J19J46L23p5M9l29k14l51n8K60Q5J37j07k36k30l05L2K46K47O4j57j31k99k02J01
4171F45L81P2N0lk96m54MK57K78J10M1n1l91m11M5M06K82J16j30k6m12l54K48L82J19J48n4
3918A002l29k98k55M34K24J64J62k52k23l93J3L57K75K27r7j24m34l04K22M24K41Nm3k16k90
3683D92k81K83M04L02j5k20k41l15L2L01L32J59P0k79l87j86J31M30L70m1N2l52l26j40L69
3448I44L75K64J53j69m70k44P6N00M33K09L8m75k72l9N55M96O50R5R488P333j0307o702Q90
3232C821J046J903K50L933M6103J61508l7414p6662q3926j1368J3631k163n370Q6435N7875
3091A59602j31143K27070j82370K47699J60409j498j03918j83174j26796n463k1844o818M8192
2969G9948L0984k5535n7920M5958L757l724n7136j0264N67n036J013j213q31K095o05J01l75
$$ plain form
4406 1530 1649 1795 2118 2043 2092 1763 1549 1198 1140 1400 1485 1622 1515 1279 1049 744 776 1022 1269 1333 1176 1045 746 544 645
4171 645 1026 1098 1148 1145 849 395 399 656 934 1044 1085 1034 643 232 277 683 965 1081 951 925 513 159 407 789 908 1056 1002
3918 1002 673 375 120 554 778 942 1104 852 629 236 249 606 881 1108 1011 887 453 149 371 795 1036 1041 998 782 492
3683 492 211 494 898 1200 1185 965 724 409 441 742 1074 1233 1303 1024 637 451 582 1012 1382 1341 1393 1041 715 575 944
3448 944 1319 1583 1736 1567 1097 853 929 1429 1862 2071 2109 1634 1362 1323 1878 2374 3024 3119 12607 19940 9633 2931 3821
3232 3821 4867 6770 7020 10953 57056 218564 181150 104488 20562 9194 22825 20662 15292 101727 159602
3091 159602 28459 255529 73159 320858 481267 479769 375851 192677 65881 60418 38574 31756 79948
2969 79948 110932 85397 27477 73435 77192 73468 16332 6068 6635 1599 2612 1399 568 2663 2058 2159 1784
2810A784J97j413K00K64K04K27J01k12l71k84j29J1l0O80k98j41Q332k827n055j97j43L97
2603A297l32l1m54r3M4Q88l12J7j38k02j41j03J25K77q0O9j9k39k76J62J71J7J77o8n7k98
2359D01p2O6J68J86kn1j25k66j13K69M7K38m1o2k73l9l5J17K44L3l7p4k66p6M9J23K17m6k0
2087E60j12o6j61L8K54M6O3J5l16j28k8K34J57k8l6l0p7l41K52P1K00m7kR0k23P31l52j02
1824F62k35K53J48P6k58l03j19K06O0N8k57O3k21J77j02L57J5l62K14j17k68Q7M21j3j60n5
1579C27J08k44j5l5L36m2K67l18o7k32K6K61R0krm1j16k05J52L5K68m6p4j11j15j08J63K00
1317D53K6M3k21R2k96OL08OR8p3l1k91l8J21J75O2J32j03j95j51p8J82K00M6j4J2j53k37M1
1044A22K42P2J44j69q6k8k49K77r6L35m2l7k00o6j67K28J74Q3l0l9k63r4mK91j9J67L0k17
$$ plain form
2810 1784 1981 568 768 1032 1236 1463 1564 1352 981 697 568 579 549 1229 931 790 9122 6295 1240 1043 900 1297
2603 1297 965 934 480 387 431 1319 1007 1024 886 684 543 440 565 842 762 831 812 573 297 459 630 647 824 756 699 401
2359 401 329 395 563 749 747 696 571 305 192 461 508 746 705 643 370 331 296 413 657 690 653 579 313 237 286 409 626 580 560
2087 560 448 382 221 259 513 559 622 637 321 193 165 399 556 528 492 462 385 44 296 367 567 520 518 608 385 1116 764 662
1824 662 427 680 828 904 646 343 224 430 490 548 291 354 133 310 208 565 580 218 432 315 47 134 555 542 382 327
1579 327 435 191 176 141 477 435 702 384 317 85 111 372 462 460 451 410 294 89 241 276 544 498 424 313 198 90 253 453
1317 453 479 522 301 393 97 103 411 417 515 442 411 120 82 203 378 440 572 469 274 123 45 227 427 473 459 471 318 81 122
1044 122 364 436 580 411 325 297 48 325 229 564 522 485 285 219 52 280 454 537 507 468 205 111 107 398 379 546 576 359
781C59j25j37J20J24J78J4m3m0k28r1Q9J83J25pok28j02J681J934m15k998J64k42j00j09K69
537C69j87J053n26J8k95m6m8M77m25N25j57q6l70k24J47L11kJ36L8l07Kj71L7K94Q1J48j50
284F42k26j50j0J28K43J54r0Qk99j32J06J37K17M8o3j59m3k32J30K63J06N7%k51k29L9J56
30E50R9M57k80l2j97r3J7J12J84L24j87j55p8k64O9L59J48J37j28n7l20k9J95K28K04L6o1
-223A238k47l5j99M01J86K31L1l4j80j11l7L44L48J71l5P2l38j05
-392A701
$$ plain form
781 359 234 97 217 341 519 533 490 450 222 131 220 403 528 521 515 287 185 1866 3800 3385 387 551 309 209 100 369
537 369 182 1235 709 727 432 386 338 815 390 915 758 672 302 78 225 536 534 670 708 401 403 232 269 563 644 792 642
284 642 416 266 256 384 627 781 691 699 400 268 374 511 728 776 713 554 511 279 409 672 778 835 835 584 355 394 550
30 550 649 1106 826 794 597 504 521 633 817 1141 954 799 721 457 526 885 1033 1170 1042 985 665 636 831 1059 1263 1299 1238
-223 1238 991 956 757 1158 1344 1575 1606 1572 1392 1281 1244 1588 1936 2107 2072 2144 1806 1701
-392 1701
##PAGE=	F1=1682.79
##FIRST=	4405.895418600002813,	4405.895418600002813,	5.162017822265625
##DATA TABLE=	(F2++(Y..Y)), PROFILE
4406A723J64J64K73j28J1l64k08k90k2K81L5J04j57k92j95k42Q3K40K11L4k31j43k96j14J62
4171H03L59L7om7l33l85R8K66K63M9Lr8l83l38J19L93K39J14j98o6m56j72K89L65L9J42j18
3918I78l75k92m7M03J93J21J43l18k40m07J78L76K21K30j73j80m48l34M34M34J77nr2k85l12
3683C80j26L47L68K80o3k86k77l47J98L55L26J06K1l55l79j83K89M29L45o3m9l70l71l9M80
3448A016L92K00J35k56n06k57K42N22M65J55J2n72k93P9O97N86N01K30J3234J0737j5057q613
3242C649O03J330J920K14L953Q5115J91252o1298j14060q6570j3468Q553J1830j9355K9893
3101D3561L0793o5421K03752j76999L04562K00422K5086j19679k16994r5530o429m5812n4508
2979B6804N9781L8409l1726n6469N5675J579j3322o9217o803K608m675m41m53j563K834j118
$$ plain form
4406 1723 1887 2051 2324 2196 2207 1843 1635 1345 1323 1604 1639 1743 1586 1294 1099 857 940 1180 1391 1425 1194 1051 755 641 803
4171 803 1162 1199 1193 1146 813 428 526 792 1055 1104 1107 1009 626 288 407 800 1039 1153 955 889 433 261 550 915 954 1096 978
3918 978 603 311 264 667 860 981 1124 806 566 159 337 713 934 1164 991 811 363 29 463 897 1074 1069 977 692 380
3683 380 254 601 969 1249 1186 900 623 276 474 829 1155 1261 1282 927 548 365 654 1083 1428 1365 1316 946 575 536 1016
3448 1016 1408 1608 1743 1487 981 724 966 1488 1953 2108 2120 1548 1255 1334 2031 2617 3118 3348 16582 27319 12262 3649
3242 3649 4252 5582 7502 7716 11669 96784 288036 226738 112678 26108 12640 21193 33023 13668 43561
3101 43561 74354 8933 212685 35686 340248 540670 565756 446077 229083 133553 127124 81312 26804
2979 26804 86585 124994 93268 36799 92474 94053 80731 11514 4711 7319 2644 2203 1750 187 3021 1903
2828A903J04n10N60j901N73K59K49J28J11k51l89l12M6p2N7O08k37k88R377k591o329J1k94
2612H12M36l34j31l64j27j1R67j63p3j68k52j42n1K10K21o4L2m5k84k73K50J90L3J43j03n4
2368F55l39q6J73J60J95k3r1j51k74n9L26L4K21m7r1k91m8J3J74K20K1p3o6l38j4R6J64J65
2105F26n9k7j45j07p0P7K02O9M9l4l22j29K4K62J53k3p2m6r9k80K44J30J63p6j5J08MP61k24
1833A144l94l28K91J86L01l57l29k60J71R0Pk76L9k10K82j42L13Q9m28K20j81j95J26M06j7
1598E48j59n3J6j83k2N5L19j03K63l07j18k28J17K59R0k4k1q9j47j24J88N8J97j5j28j19j15
1345A55k7J58K01OOj99K9k71O7L35nN3q1n8k70l0J84J53N4J16j38j99j46L2J62J66L1j1n5
1072D18j59j86Q7K50O0J07j65j08n6j62K93j31L58p7q0k07m5r7K37J65O6q4m1k65p6P4K73
$$ plain form
2828 1903 2007 1497 2057 156 729 988 1237 1365 1476 1225 836 524 570 498 555 1163 926 638 10015 7424 1095 1106 812
2612 812 1248 914 783 419 292 281 1248 1085 1012 844 592 450 399 609 830 766 798 753 469 196 446 636 669 812 709 655
2368 655 316 230 403 563 758 735 644 493 219 160 486 520 741 694 603 312 264 277 451 671 692 619 553 215 201 297 461 626
2105 626 567 540 395 288 218 295 497 566 615 581 259 130 154 416 569 546 474 428 329 49 293 423 586 510 495 603 607 1368 1144
1833 1144 750 422 713 899 1200 843 514 254 425 515 522 246 285 75 357 215 528 617 189 409 228 33 159 565 548
1598 548 389 336 352 169 147 202 521 418 681 374 256 28 145 404 494 470 449 360 213 89 277 335 532 517 389 270 155
1345 155 128 286 487 493 499 300 329 58 125 460 455 508 427 369 99 69 253 406 460 576 438 239 93 125 287 453 484 473 418
1072 418 259 73 160 410 470 577 412 304 248 86 379 248 606 529 449 242 197 100 337 502 568 484 443 178 102 176 449
819D49l0J16K5k08j60l6J09J28J73p1Nr2j84k9R2J52R2k9j1j77j30K153K597n37l937J10k97
565B73j07RK88j47R82o81O1k65q5J1M56l75O05k46j66k82j95J62L11NQ4ok66n7j00R1K92J6
302F68J64j69k92j06Q4J19K26J32r8n8k83q4J68J60J54J7m7k26j5j95K18K29O9L8k2k69k14
49C68R3K16Q3M09l42k2k13k8P9J18J24L27k15k03m4k00J12L45J40O5j38p3k68%K56J96J87
-205A372mq1k72K6j15M04J60K10Mo8j77m4M3L44L46J25n4L8l36p6
-392A845
$$ plain form
819 449 419 535 560 352 192 156 265 393 566 495 500 408 224 195 287 439 531 502 491 314 184 2337 4934 4397 460 570 273
565 273 166 175 463 316 1298 617 678 413 328 339 795 420 1025 779 613 331 136 298 609 614 698 692 426 369 269 360 652 668
302 668 832 663 371 265 349 468 694 826 728 670 387 303 471 631 785 802 755 529 514 319 537 766 835 873 851 582 368
49 368 461 677 760 1169 827 805 592 564 643 761 885 1212 997 794 750 550 662 1007 1147 1212 1074 1001 733 733 989 1185 1372
-205 1372 1368 1287 1015 1041 926 1330 1490 1700 1704 1636 1459 1415 1458 1802 2148 2273 2219 2257 1921 1845
-392 1845
##PAGE=	F1=1664.01
##FIRST=	4405.895418600002813,	4405.895418600002813,	5.6640534400939941406
##DATA TABLE=	(F2++(Y..Y)), PROFILE
4406A711K35J85K15j95k7l91k06k12N3L02J1N3k23l44j56j54J62K32J72pl13j64k79mK39L44
4162A239nq1j03l77k74K02K74K48j0o2j52l86k10K13L64J96R2k74j35m71K8L65L31m1J08j91
3918H88m10l00K24L75J52O2R8l82k69l35L73L40J68K02k66k35m50q8M38M23R9l8j54l64k90
3683B61J28L74K97K19j25l59k85k70L73L44K98K4n0m15l48qL66L86K83j10j64l65l25J34N22
3448A185L69R3R1l31m86j53L95M92M39Q1m5n98k47K45Q16O54K37L55J6321J3058j8306j0117
3242D548K29J522J906J62L371J29834K16834j04409j48031p8191j5547J101J3904j8126j623
3101G484O129p160J50032j49948L21642K23100N1861j27488k27438l3902r880o6893j20937
2979A6602P1069M5402l5127n0060N7520J010k1512p8884j722J978l548r52M09j908L120j630
$$ plain form
4406 1711 1946 2131 2346 2151 2124 1733 1527 1315 1368 1670 1681 1734 1511 1167 1011 857 1019 1251 1423 1416 1103 939 660 656 895 1239
4162 1239 1234 1153 1050 673 399 601 875 1123 1113 1051 899 513 303 516 880 1076 1168 894 759 288 316 681 1012 971 1079 888
3918 888 478 178 402 777 929 991 1089 707 438 103 476 816 984 1186 920 685 235 147 585 1008 1107 1069 915 551 261
3683 261 389 763 1060 1279 1154 795 510 240 613 957 1255 1279 1229 814 466 458 824 1210 1493 1383 1219 854 529 663 1185
3448 1185 1554 1647 1738 1407 921 768 1163 1655 2094 2175 2130 1532 1285 1530 2346 3000 3237 3592 19913 32971 14665 4548
3242 4548 4777 6299 8205 8367 11738 141572 358406 253997 105966 27775 12228 13329 27233 9107 7484
3101 7484 13613 6453 156485 6537 328179 551279 603140 475652 248214 214312 204432 137539 16602
2979 16602 87671 133073 97946 47886 105406 106416 84904 6020 4298 6276 2728 1776 2185 277 3397 1767
2828A767Q0p00J020j793M82J96K67k2J13l72l00l24L21j30J12M87k99J32N853j237m783K74
2622A144m18M36l04k38k27n6L3Q90j28j51j94k73j04K7K46J42n5k1p5k88k26L33J79L1Q5j50
2378F38l2l35l8K25J29J79n6j20j90k25M1L32OJ73n9j27k67l7Q1J99J70Oj38j9m21J27J08
2124C50J76R6o4o1j61j31N2J30R6Q8K1q2k88j44J35K40J24k1j10p0j00j38J95J61J10j20l2
1871D52J02K26P53q6o25m16L25J79N46m83l01l63J20R9n4k83K1k01L83j36K50J19m52J94k50
1636A19j5J09L56j9j67n8p1j50P3Q2L13j71K19k62j74j15J28K48P0n2l3j41j84J6K14O2J09
1382E06J9j97j11j35J18J30J87k9l0j80n2j38R4L25k2lr1q9k49J0K64J06L8Q0j67j97j50J72
1119B09J43J06K8k2j33j56j03J36K47L8N6j53j43j05k0L12j71L53j14j27k00m3K2K30J50K6
$$ plain form
2828 1767 1847 1147 2167 374 856 1052 1319 1297 1410 1038 738 414 735 605 717 1204 905 1037 6890 5653 870 1144
2622 1144 726 1162 858 620 393 337 370 1260 1132 981 787 514 410 437 683 825 770 749 674 386 160 493 672 703 788 638
2378 638 606 271 233 458 587 766 710 590 400 175 216 548 554 727 668 541 274 237 318 517 687 693 555 536 115 242 350
2124 350 526 622 558 497 336 205 257 387 483 571 592 510 222 78 213 453 577 556 446 376 276 138 333 494 604 484 452
1871 452 554 780 1533 1447 822 406 731 910 1456 973 672 309 429 528 474 191 212 11 394 258 508 627 175 369 119
1636 119 104 213 569 550 383 325 254 104 177 259 572 401 620 358 184 69 197 445 515 463 430 289 105 121 335 397 506
1382 506 525 328 217 82 200 330 517 488 458 278 226 88 182 507 485 482 391 302 53 63 327 433 471 551 384 187 37 209
1119 209 352 458 486 464 331 175 72 208 455 493 549 396 253 148 128 440 269 622 508 381 181 138 160 390 540 566
875E66j25o0k59J3R7K57m2O6mk09j64N7J18J19J62j62L8j39j30O3Q2J14N3o4j7r0j21K402
612B621L217p23m565J4l43j50J69K94n8Q22q94K09l02jqM80m09O58k49k66k27r5J46L22J2
378F74J0o0k29j06k0J77K70o6J62j79l62m6J83J21J92R7j05j28k75k3K43J90P5j8l9k95Nj49
115B99L32J86K6J2o5k88j79J45K94Q2K92l58l6k48N3J61J29O3K99k46k42m5r9J64L39J06j1
-139A165j51j16j97M3L21J56J64o1j12k96O1L0L72J40J78m7j09j95L0J35L52L10Q1r2k2l21
-383A819n0
-392A769
$$ plain form
875 566 441 381 122 135 232 489 447 513 509 300 136 193 311 430 592 430 468 329 199 262 344 458 511 447 430 340 219 2621
612 2621 5838 5115 550 564 221 71 240 534 476 1298 404 613 311 310 302 782 373 1031 782 516 289 194 340 662 674
378 674 684 624 395 289 269 446 716 650 812 633 271 225 408 529 721 818 713 585 310 287 530 720 795 777 738 443 448 299
115 299 631 817 843 855 790 502 323 468 762 844 1136 778 742 494 547 708 837 900 1199 953 711 666 567 731 1070 1176 1165
-139 1165 1014 898 701 744 1065 1221 1385 1324 1212 916 977 1007 1379 1519 1697 1650 1541 1346 1376 1511 1863 2173 2254 2162 2140 1819
-383 1819 1769
-392 1769
##PAGE=	F1=1645.23
##FIRST=	4405.895418600002813,	4405.895418600002813,	5.6761889457702636719
##DATA TABLE=	(F2++(Y..Y)), PROFILE
4406A538L24J79J41k76o1m05j89r8J65K88jj6l05l78j07LK37J96J21o5l91j87k21J55K76L25
4162A248o1j67j63m24p7L03K50K16p1j40k12l89K9K77K99J44M5l46k20m53K99M07K65j14M8
3927I93k59m43k67N29L10J00qK8m17l08l7M13K61J08J49l56k70l86K15L60L77K0q9k16m14
3692C93j14K85L65K07J28j85m08k29l9L92K93K46p2j22m26k23J86L56L06K03j74k56l00j41
3467F71K24M90L15l6L6l55l70J7M53M20L53Qj04n26r3L74Q24P25j08M70J8149J3913j9560
3251A6290j0819j30J645J801J39K281J71054K36246j55227j73541o3260j6643J84L022n342
3110G700J7117n521m629Q3218p3172K62872K25073P3213j26301k09658M3581j4592q2752j92798
2979C351Q0298N3904l4665m5493N1786J056k5325q2283K684j892j074j367J600k079L244k103
$$ plain form
4406 1538 1862 2041 2182 1906 1845 1440 1251 1153 1318 1606 1605 1589 1284 906 799 802 1039 1235 1356 1291 900 713 492 647 923 1248
4162 1248 1187 1020 857 433 356 659 909 1125 1054 914 702 313 342 619 918 1062 1107 761 541 88 387 794 1059 945 993
3927 993 734 291 24 553 863 963 955 983 566 258 221 634 895 1003 1152 796 526 140 355 715 1092 1112 1023 807 393
3692 393 279 564 929 1136 1264 1079 671 442 403 795 1088 1334 1262 1140 714 491 677 1033 1339 1542 1368 1112 812 671
3467 671 895 1385 1700 1664 1700 1345 975 992 1445 1865 2218 2226 2122 1596 1503 1877 2701 3426 3318 3788 21937 35850 16290
3251 16290 5471 5341 6986 8787 8926 11207 182261 418507 263280 89739 26479 9836 10020 13042 7700
3110 7700 24817 19296 14667 97885 24713 287585 512658 585871 459570 249912 293493 278901 196149 3351
2979 3351 83649 137553 102888 57395 109181 110237 84912 2629 5313 3421 2347 980 2580 501 3745 1642
2828A642N6r10J585j721M64P6K61k01J03n17q5k66N21j67J65L10k82R85K568k214j646M17
2622A144m95L88k48l10n7M6K4P19r2j96k14k29k8P5K33N3n1p3j04k19j26L31J46J2K2k11J7
2368E57k47K8J99P8J43r3j28k15j19J25K94l5J09q0j48j85OJ06J89J08pk27P1m33K38Q8J62
2115E84J9n8j18j32r4J14J81l0R6j7j13k03r7J69J97P3k4j34j08m7j1J44J65N3j72m6O3M35
1852H89O65P4p74m79L48J27P68o25j89m35O4Q2j07k63K5m8K97j08J95R0m36J42j95R5P3K86
1608E61j9j82p4j07j53K03P8L05k26J34j82k27O9O6K38L0q3l7j77j73J25K28M7J9M7k68p5
1354A67j45K54R8J56o9o3j72j16N1Q8K91m9n2j10j23j62P2K84M8J8K8j92j69o2K17J20L1L1
1091D70m0k13j46M3J40K31J1pj33j84j57J48L30k07L18j47j74j81m6J70K02J27l1j45r8k49
$$ plain form
2828 1642 1698 788 2373 652 1116 1192 1453 1252 1355 838 753 487 1008 841 1006 1316 1034 2019 4587 2373 727 1144
2622 1144 649 1037 789 479 422 468 492 1211 1119 923 709 480 452 527 760 813 762 689 585 366 240 571 717 729 751 540 557
2368 557 310 338 537 615 758 665 537 322 203 328 622 587 696 616 468 283 289 395 584 692 685 458 529 96 334 422 584
2115 584 603 545 427 295 201 315 496 466 562 545 432 229 132 301 498 571 547 413 305 258 247 391 556 609 437 391 454 889
1852 889 1554 1628 854 375 723 850 1618 993 804 369 433 515 408 145 170 122 419 311 506 596 160 302 107 202 275 561
1608 561 542 360 286 179 26 229 307 612 386 520 338 111 180 246 484 514 431 394 217 44 169 397 444 463 510 242 167
1354 167 22 276 374 530 461 398 226 110 161 249 540 491 439 329 206 44 116 400 448 466 494 302 133 71 288 408 439 470
1091 470 430 217 71 114 254 485 496 489 356 172 15 163 493 286 604 457 283 102 56 226 428 555 524 379 281 32
847C2J63P9K39o2K4n4k19r5J21J30Q4J45k43M7j80k4J26O9P0J6j11k7K9j03K405L633q81m781
584F32j05l71r0K45K64M5O47j179M37l85J70m6M89m66O45j93l53k02Q7R9L17J1p6j17k05j15
340A85R3K37K24j52J39j74m28M5K86J06J45M5j14j92k75Q5L09K01j0o1l9l56K2n1M25J23k5
86G93k2j21k98j00K01L47Q2J22l33o6k94J59K62J28jK34k76k65o6N4K14L12M4q5j67j73r3
-167E92J23L47J08J25j33j51l02R5K13L05J11J27j22j49k10J28K30L54K22L6j48j00k80r
-392A512
$$ plain form
847 32 195 274 513 451 475 421 202 107 228 358 442 587 344 391 211 187 313 382 452 468 357 330 359 256 2661 6294 5413 632
584 632 527 156 66 311 575 620 1267 88 525 140 310 264 753 287 932 739 386 184 271 370 687 698 622 505 300 185
340 185 278 515 739 587 726 552 124 169 455 561 706 751 637 445 170 255 564 765 755 694 655 299 321 270 695 818 793
86 793 771 650 352 252 453 800 882 1004 671 605 311 470 732 860 859 1093 817 552 486 540 754 1066 1110 1025 858 685 592
-167 592 715 1062 1170 1295 1162 1011 709 804 1017 1322 1433 1560 1438 1289 1079 1207 1437 1791 2013 2049 1901 1801 1521 1512
-392 1512
##PAGE=	F1=1626.45
##FIRST=	4405.895418600002813,	4405.895418600002813,	4.9168982505798339844
##DATA TABLE=	(F2++(Y..Y)), PROFILE
4406A319L89J27M7l67q6l98j22O9K70K05j8j02l92l76k6K44K50J19N3j38m47k10m4L23K19
4171I08K85j33k52k11m67K81L15J81J55j34k17k65l29L41K58K03P2j8m00k96j32L65L71J67
3946A048j78k8k96m76J89M48K06L6q1n2l83k89K82L63J46L8Q5m21k42j12K93K60K84m7j42
3711I31k57l27J25K72L16J05K2k26l75q5J42L24K17J70j57j73l43k8K64L10J91J20k37k79
3486A022j50O0K10M06K40j65mk94j76J37M27L26K21m6j35l57J15M21P08P93m79N73J8411J3192
3260C5456j8750j0470m28J674J562O8P25K01944K42628j98858j84535m7467j6310O760r726
3119D273N388K0591k598j0833L0091j0669J90791K08520Q4137j16344j65784J18092j9051
2997C36604r1785k34071O4449O6484l0810m8871M1725O79k4342p7031M414o500L620l903K208
$$ plain form
4406 1319 1708 1835 1882 1515 1429 1031 909 978 1248 1453 1435 1333 941 565 539 783 1033 1152 1205 1067 620 410 366 689 908
4171 908 1193 1060 808 597 130 411 726 907 1062 928 711 446 117 458 716 919 991 973 573 277 145 510 881 1048
3946 1048 870 842 546 70 259 707 913 949 868 816 433 144 426 789 935 973 1058 637 395 283 576 836 1120 1073 931
3711 931 674 347 472 744 1060 1165 1187 961 586 501 643 967 1184 1354 1197 1024 681 653 917 1227 1418 1538 1301 1022
3486 1022 872 932 1142 1548 1788 1623 1619 1325 1149 1286 1713 2039 2260 2214 2079 1722 1837 2258 2966 3759 3280 3853 22264 35456
3260 35456 16706 6236 5808 7482 9044 9112 9837 211781 454409 255551 71016 23549 7239 13999 4273
3119 4273 9661 30252 27654 16821 46912 36243 227034 435554 519691 403347 237563 355655 336604
2997 336604 244819 10748 75197 141681 110871 62000 103725 104404 80062 3031 7445 945 4565 662 2870
2857B870k297L479k521O3j040K110j832N86o5K37l70P6n47J50j65N56j93K03J10j06J563O551
2650I418n571l052L25n25K85j59l07J03J13p3M81Rk06k16j07M6P5J83l9m9j00j19p7o6K80
2415F52J04k1l0k74R2j08O3J37J9R2j21j08j79k7J63K32q1M4j09j28o3M7Q0J59L9ol26J92
2152E34l19K25N3J27n4m0j78m7nP8K19j53R5n6j17p7k9J32J48Ql1j28j46N9O2Q2J52Kk22m4
1871C30j3O18M77K54q36n01L56M6R23p58%m80J3M4j34j84M3N1J85q2J59J1l80P6J5Q2J4K08
1608E37k1j94q3l2p5J41P6K75k47J7o5k04J75j3K22k3j11l2j52j6O0K09K2o1O7l25K1k8K04
1335C44N9J15j05q3j81j4J07P3K37q7q1j34j41K8O4K53j1jk9k10p3M5J84R0n4L7n1k75l7J31
1054B00R5J96j4p5j03k09N9N4L24k32K58j73k08r9L8J86J48R2q8j39j46q0J85M4K04q9qj09
$$ plain form
2857 2870 573 4052 1531 1594 554 2664 832 1418 1353 1590 1220 1296 749 899 734 1290 1097 1300 1410 1304 2867 9418
2650 9418 3847 795 1120 595 880 721 414 517 630 557 1038 1047 841 625 518 564 639 822 783 734 634 515 438 372 652
2415 652 756 735 705 431 523 415 478 615 634 726 605 497 318 291 454 686 605 649 540 412 349 396 476 635 674 668 342 534
2152 534 215 440 493 620 566 526 348 301 296 374 593 440 535 479 362 285 256 388 536 544 513 385 239 298 360 442 594 596 374 330
1871 330 317 935 1412 1666 830 329 685 731 1654 896 896 416 429 473 339 155 198 249 434 352 511 522 142 218 233 315 329 537
1608 537 516 322 239 207 132 273 349 624 377 394 329 125 300 287 509 486 375 343 191 175 235 444 466 405 472 147 168 140 344
1335 344 403 518 413 330 149 135 242 315 552 465 384 250 109 137 201 454 443 442 413 203 130 175 359 449 395 432 381 106 69 200
1054 200 295 491 477 402 299 90 149 203 527 295 553 380 172 73 111 297 445 537 449 310 164 84 269 313 517 428 420 311
791C11k34J02R6J34J7J22k97K7k08J70J15M4K6j7j64m1J81r6K167L722r26m567k21l64J13
556B12J78J97J30N23r75J28k51J63k8M08m35N08j18m01j97L27L6K75%j59j70j96lJ81K26J58
312G17k26Q9j47l50J08L17N8Q6k1j20k41k24K24L19J72q6j16m2l85O9J01M34L8q7n5j76k62
58A94O0K08L34O5o1k89r2l09K80L55R4o9J38l00k50o4K33K34K41l5j55j84k24Q4K28K91M7
-195A054O2k09j88k48J61L62K12O0N1k12j73j71K67K82L31Q2j9k11j72j90O5
-392A196
$$ plain form
791 311 77 179 275 409 426 548 251 278 70 240 355 399 425 408 244 203 384 288 2455 6177 5251 684 463 99 212
556 212 390 587 717 1240 265 393 142 305 277 685 250 758 640 239 42 369 405 680 680 521 351 155 152 333 559 717
312 717 491 580 433 83 191 508 566 652 631 511 270 46 270 589 761 675 559 517 132 201 302 736 774 687 632 456 194
58 194 254 462 796 861 800 511 419 110 390 745 839 770 908 608 358 294 527 761 1002 967 812 628 404 488 716 1007 1054
-195 1054 1116 907 719 471 632 994 1206 1266 1317 1105 932 761 1028 1310 1641 1723 1704 1493 1321 1131 1196
-392 1196
##PAGE=	F1=1607.67
##FIRST=	4405.895418600002813,	4405.895418600002813,	4.4994177818298339844
##DATA TABLE=	(F2++(Y..Y)), PROFILE
4406A185L70K5n9m53q6l46M4K46K77O2n5j95m68k79J30M42J78Rl1k14m57k30L35L54P9K19
4162A082k08l20k36j37L73K34Q6P2j96k70k90Q0L34J82R9j5q3m15k14J96K90K80N4k25j02
3927F51k66k11L03L55Q3l2j43j26k23j03L32K81K3l6K4m22j06J02K77J56J56r1j77k46q6K04
3683F79K05K39Op6k32k28N6K07K26J30Q3k10j79j72J10K63K44O1N1k79k13K8J83J48K88J58
3439A776k68rj59J4J77L45K34O5o6j21j40K93L95N10Q29q06O45J7114J1138j6212r092o66
3232E996J574J190j05j123K18220K30791k24396j76628l5360j4383R448m515p86J3642l117
3091B0448o124l980K5205J22412J80964Q1386r8925j05440J72498k1573r4207k50010M2849
2969F5503Q3400k6322o2803L2999o88k1530o6305N213n666L718n422R89k640L864k857J05
$$ plain form
4406 1185 1555 1580 1521 1068 982 636 680 926 1203 1265 1210 1015 547 268 398 840 1018 1027 996 782 325 95 430 784 863 1082
4162 1082 874 554 318 181 554 788 874 946 750 480 190 270 604 786 885 870 787 372 158 354 644 924 978 753 651
3927 651 385 174 477 832 915 883 740 614 391 288 620 901 924 888 912 490 384 486 763 919 1075 984 807 561 475 679
3683 679 884 1123 1129 1053 821 593 649 856 1082 1212 1295 1085 906 734 844 1107 1351 1412 1463 1184 971 999 1182 1330 1618 1776
3439 1776 1508 1499 1340 1354 1531 1876 2110 2175 2109 1988 1848 2141 2536 3046 3875 3069 3714 20828 31966 15754 6662 5996
3232 5996 7570 8760 8655 7532 225752 456543 232147 55519 20159 5776 15224 10709 9923 23565 20448
3091 20448 14324 10344 35549 157961 338925 420311 321386 215946 388444 366871 272664 22654 65503
2969 65503 148903 122581 59778 92777 92089 70559 4254 9467 3801 7519 2097 3086 446 4310 1453 1558
2819A558r60K331j995P41j96J98m92L6l85K47p9M81k21K03j06P9J565R548o644m976J62n21
2612E74J39l1k10J85J40j85K60P1j82j92M7Q0N2J13j23m7p8j12O2o1K10O5o0n0l13J63J2P6
2349F05O9l8L5j28o3q1oJ73J55j22rj37n6M3O5L3J21k7J2l98K95j92J77K2P7j13rk04N1O0
2068D10J1K34k49Q9q7r1M8J8P1J01n6l9q5j51J44R2NJ35l7k54j3j08P34K09M37q21m67L42
1805F22l7R71q46K23m93k7nj17o8M4R0Q5o7J29q1k97M9J76O5n0J34l4j91m6Q0o1M6Q8K16k20
1523C78j16Q5j26J82q9J98p5j33j4n5O5PJ54lj21Q1l30J41K4J40J7P0j24q7j98J88N2N9J69
1251E39j31p7j51o0J12M8J95n8j7p4k00O0Q2J44N5j33M0m1k17O3J08L5J47l1j38o0j25J76
988B91m5K85k41J86j85k00O2P7J28Q2M3j28j04j42Q5J40J4J52j22k4j41j34K07L8J28o8R3
$$ plain form
2819 1558 598 2929 934 1675 1479 1677 1185 1221 836 1083 1004 1485 1264 1467 1361 1440 3005 12553 5909 933 1095 574
2612 574 713 682 472 657 797 612 872 943 761 569 616 696 748 861 738 691 613 501 563 502 712 777 717 667 354 517 529 605
2349 605 674 636 671 543 480 399 393 566 721 599 590 453 397 440 505 538 659 632 644 246 541 349 526 548 625 512 503 299 350 410
2068 410 421 655 406 495 408 317 365 383 454 555 499 460 375 224 368 460 465 600 563 309 296 188 922 1131 1568 747 280 622
1805 622 585 1556 710 933 440 413 408 291 223 267 357 442 375 504 423 126 175 351 416 366 500 466 275 229 309 248 294 382 598 378
1523 378 262 347 221 403 314 512 437 304 290 235 300 307 461 458 337 418 88 229 253 393 410 480 356 269 71 259 311 370 539
1251 539 408 331 180 120 232 280 475 417 400 326 126 186 268 412 467 334 374 333 116 179 287 322 469 438 300 240 115 291
988 291 246 531 290 476 291 91 153 230 358 440 483 355 251 109 194 334 348 500 378 354 213 79 286 324 452 384 477
734D77l00k4o7K40O5jqm0k18l6L37j09J748L434q17l990l00k89K38J21J08J78M49o71l22J87
490C90q8M7K20k59K47o2l73j7L58k4J97j6k20k06j84K33J62J70P9k77K0r6o0N3K63j1K2q9
227D79j19k74J17J30K73J02j37j78m0k31J10J50L67n3j54q0k10l6J33J54K50K7k12k46q9k1
-17B12J60L88K2j30K3l11j34N0K72K11J28j12k17j92k17L35K79J62k5k1k75k06l0K21L72J17
-261A082j8m6l00j57K4L78K40K66r0p9k60j98qJ62
$$ plain form
734 477 177 153 86 326 391 390 382 342 124 88 425 316 2064 5498 4681 691 391 102 340 461 569 747 1196 525 203 390
490 390 302 349 569 310 557 495 122 105 463 439 636 620 400 194 10 243 405 575 654 377 397 301 241 294 557 546 568 479
227 479 360 86 203 333 606 708 571 393 353 122 232 382 749 696 542 462 252 216 349 503 753 780 568 322 233 212
-17 212 372 760 782 652 675 364 230 280 552 763 891 779 562 370 153 488 767 929 904 883 608 402 372 593 965 1082
-261 1082 1064 1018 718 561 585 963 1203 1469 1379 1300 1040 842 834 996
-392I96
##PAGE=	F1=1588.89
##FIRST=	4405.895418600002813,	4405.895418600002813,	4.29694366455078125
##DATA TABLE=	(F2++(Y..Y)), PROFILE
4406A160K57r3j54m94m2j79K31L04J71q2j12k73n07J21J70M31O9j02j12k76l35L3L90K90p7
4171G89J37k66l56k18L59K38J25kj0k48k71j25L22K35R4J0j02j22l62J18J60K28J73m8k44
3936F14j57j25K7K72K62l3r1j77j70K1J1K96J92q6j00j5l31N6J73K36O1K1j03j77j72J21J93
3683H19J28J53p5j43j97k4J23J99J28M5Nk18j37OJ58K28J72n9Qk84q7J58K27P3J61Q5l28K9
3420A353j0J48J55K34J62q4m6p5O1L97L17K83Q16j025O65J4521Q287j2569o963q66J348P36
3213G845l45k888K17864K01129k27861j50455k8380j1199O182k72m119M227k296l4N95J5792
3063B5785O5552J53305O4328p6037m3975J97020k0828r1960k41635L3137R7676k5013q6869
2941E0486L3030k695k4291m9681K728n212M182n660M23l109M267l059J59p86K264k055Q40
$$ plain form
4406 1160 1417 1324 1170 676 634 455 686 990 1161 1079 967 694 187 308 478 909 978 876 764 488 153 186 576 866 789
4171 789 926 660 304 86 445 683 808 806 796 548 277 152 474 709 803 813 711 589 227 345 505 733 906 858 614
3936 614 457 332 359 631 893 860 769 592 422 443 454 750 942 856 756 741 410 466 639 875 936 957 854 677 505 626 819
3683 819 947 1100 1025 882 685 661 784 983 1111 1156 1161 943 806 812 970 1198 1370 1311 1319 1035 948 1106 1333 1406 1567 1652 1324 1353
3420 1353 1343 1491 1646 1880 2042 1958 1912 1837 1898 2295 2612 2895 3711 2686 3351 17872 26159 13590 6627 5761 7109 7845
3213 7845 7500 4612 222476 423605 195744 45289 16909 5710 11892 11620 7501 11728 9432 9398 9993 25785
3063 25785 91337 244642 308970 232933 188958 385978 365150 273190 31555 64692 162368 137355 50486
2941 50486 83516 80821 56530 6849 9577 4365 8547 2887 3310 201 4468 1409 1568 782 3046 991 1831
2781A831l01J47n48kj46K37j8L32k57J63l39K19R10Q526n890l817K9m76j8J23p6J70J34k37
2556F96K01o0j27j41J58P7L0L6j88m1qr1J37p5J30L7r5l0k93J81P7Q0J1q4j9j04j3J8k7J65
2274F38Q0j51l5j52L7R7O7j3Q1p9M4l87L08p5J10NK2j48L0j72R6R4n5K26l02Q8j02n3J36M7
1993D82JO6j06m4j9j12J55J05p9J21n6k52L7j31O94r2N94p42l81L01q9Q91q53M10m64n3m9
1739C35n5J3L8Q5K8o4Q4j27k24J25J86N6j00P5o2j67M6J25o3m7J16J32j52k33K32p3J57j45
1476C21J67j10j45J2N3R4k8P8j8j52Q8k39J76M1P3k0L0j17o8j54K72kM9J02j77l4j39O3Q8
1204C04K6J26q5k6q5j25J07Q5J14J6j94M4j1r2O2Q0j7R0l2j86JjJ89j13K25k27J15j83q5J13
922B35R1O8J6j3j37m6k8R2R3%R1j50k8j02J2J78j6J16j48O4k42p0J34J82K3n9k5m8k65J07
$$ plain form
2781 1831 1530 1677 1129 1127 981 1218 1200 1532 1275 1438 1099 1318 2228 10754 4864 1047 1076 600 582 705 629 799 933 696
2556 696 897 837 710 569 727 804 834 870 682 641 633 542 679 604 734 771 676 646 353 534 611 691 702 618 599 495 482 500 473 638
2274 638 718 567 532 380 417 514 581 568 649 570 614 227 535 460 570 575 597 449 479 307 403 497 442 668 366 454 352 299 435 482
1993 482 483 549 443 399 380 268 423 528 449 570 514 262 299 168 862 770 1364 622 241 542 453 1344 491 901 437 384 335
1739 335 280 293 331 416 444 380 464 337 113 238 424 480 380 455 393 226 272 397 334 287 403 535 383 150 382 309 466 321
1476 321 488 378 233 245 298 392 364 442 424 272 360 121 297 338 411 391 421 304 236 82 354 352 401 503 326 292 153 216 304
1204 304 330 456 371 345 260 135 242 327 441 457 263 307 296 204 266 346 329 419 387 201 202 201 390 277 502 275 390 207 122 235
922 235 326 394 410 397 260 214 186 278 371 371 462 312 284 182 194 372 356 472 324 388 146 76 210 392 415 356 331 283 18 125
640A25L46j37J262K801n69l178l21j78K73Q3J4J90L48m59n33N70k88Q6j6Mm6n4j82Q4L00p1
396D54J02k6k43j87O4J77J07J10Kk96n1l1J84K3J90p9l7j43r6j48K70M5K11J3j59k31k5N5
133B55R1R9K81j31k14r1j43K13Q5R0J39k4k91k25JK61J4L54p3j72q5l03J45J45J62J65%j63
-129E85k65j75P7L44K52J8r1j07l13j45K94J90K57M9j03j48l48n1L34L50J23J72k44j31k62
-364F62q7K07J97
$$ plain form
640 125 471 334 1596 4397 3828 650 329 151 424 507 521 711 1059 600 67 637 349 435 419 423 377 323 141 225 525 454
396 454 556 530 287 100 164 341 448 558 560 264 213 182 366 389 579 500 463 320 224 76 346 391 602 615 456 225 200 255
133 255 346 445 726 595 381 290 147 360 445 535 674 650 359 134 135 396 410 764 691 519 434 131 276 421 583 748 748 585
-129 585 320 145 222 566 818 836 745 638 325 180 474 664 921 970 867 719 371 320 654 1004 1127 1299 1055 924 662
-364 662 575 782 979
-392I79
##PAGE=	F1=1570.11
##FIRST=	4405.895418600002813,	4405.895418600002813,	3.3575417995452880859
##DATA TABLE=	(F2++(Y..Y)), PROFILE
4406A150J17j83k06m33M9L7K43K70L2j66j72l18k67L31J11L22k4j80j73l03K0J10L00K17k02
4171F82O0k89l52K8M91J18K5o1o8k81j77J20K99J41K0n0j68j15k17K95P3J72P7j17k30j75
3927C01O7J00K28J76j19j28j74j63K11N3K39J07j61j39k6j72J34J74J83j3r3q2j39o9K11J55
3683H61N5Q1j28j66j35J44J31J57M8k7m7j85o7J25J41J83J05j47mk50L6K17K19OM7L3l37R9
3420A195Q9K17R9J15J24j97Ok5K00M18K12P5P49j094O29J1075N313q576m502j056J043K89
3213F398n62m078K00941J59814k11368j12408k4954p803K8K057m376j051P387n765J1342l713
3063A1889K4569J35313L5153n0005J955J91585j6389q7899k08442M4925J00464k9086j19137
2941C4895M9830k804m3591k7596m436k061K327l991J004l117L964l075J97n96K002j918Q30
$$ plain form
4406 1150 1267 1084 878 445 494 531 774 1044 1076 910 738 420 153 484 595 917 893 713 540 237 257 367 667 884 682
4171 682 742 453 101 129 620 738 763 702 634 353 176 296 595 736 756 706 538 423 206 501 574 746 823 706 476 301
3927 301 368 468 696 872 753 625 451 288 499 552 791 898 737 598 572 400 534 708 891 878 785 703 564 495 706 861
3683 861 916 997 869 703 568 712 843 1000 1048 1021 974 789 722 847 988 1171 1276 1129 1125 875 911 1128 1347 1353 1400 1433 1096 1195
3420 1195 1284 1501 1600 1715 1839 1642 1648 1623 1823 2241 2453 2528 3277 2183 2812 13887 19200 10624 6122 5066 6109 6398
3213 6398 5836 1758 202699 362513 151145 38737 13783 5980 6008 8065 3689 2638 10025 4260 15602 11889
3063 11889 36458 171771 206924 156919 158874 350459 334070 246171 37729 82654 183118 154032 34895
2941 34895 84725 81921 38330 10734 6298 4237 6564 2573 3577 460 4424 1349 1546 950 2952 1034 1864
2781A864l78Q5n41qM0K02J6J47l03J11n62M46k80M144l370m34j33l77j30K37L3Q2J02k32K01
2547I62k11n5r1K00M8K0k8k24l2P5p3J53q8N5K2j16J7k35J47R0Q1k7j09o0o1K1Q5n6J44K3
2265F77j64l4j45J00J12N6m3M8j12Q0l10K39K2L5Qk9j55O9j13Q6J07j04K00l09J01j06l0J87
2002D73O0o4M6j33l3L1o1J16J15j52J10n4k12O7p5N33l59O87o11k66K33p6O87p45M87l91o6
1749C47p8J6M8L8L9L7o9Op9k03K29J07N7j24L2j01j16J38J09n6j25J54L5o3k91L23n3J21j70
1476C08J33j20j42K9J28J01m6mj9j46Q6j40J68M4J5m6jq1l7q3K45l3M4M6k15L6j05J29M3M
1195C41N9q9k7n6m3Q4P0J03k4k24N0K6pM8N3n2L5j5k02N7P7J66j44J54j84N9j76L9J05R5K1
903C99l9o6j14J4P7N0M8KL4j60k6j2O6J42n9J05k05M0j53k7J79J16Pj17k1l4j88J61K79j67
$$ plain form
2781 1864 1486 1571 1030 1022 1062 1264 1280 1427 1124 1235 673 1119 839 4983 1613 1179 1046 669 539 776 809 891 993 761 962
2547 962 751 696 605 805 853 873 845 621 589 664 591 744 656 711 733 617 634 399 546 636 717 690 581 521 460 481 566 510 654 677
2265 677 513 479 334 434 546 602 559 607 495 575 265 504 526 561 569 540 385 454 341 427 534 430 630 321 422 316 286 473
2002 473 533 469 515 382 349 380 319 435 550 398 508 454 242 309 234 767 408 1095 484 218 451 375 1062 317 804 413 347
1749 347 269 285 333 371 410 447 378 384 305 102 331 438 495 371 403 302 186 324 433 377 252 406 441 378 87 410 357 478 308
1476 308 441 321 179 208 336 437 391 387 368 222 308 168 336 380 395 349 348 267 230 147 392 359 403 449 234 270 165 294 337 341
1195 341 400 311 284 228 185 269 339 442 418 194 244 270 263 311 364 312 347 332 130 187 264 430 286 440 256 315 139 178 283 378 399
903 399 360 294 180 194 271 321 369 371 405 245 219 207 273 415 356 461 256 296 143 116 295 411 418 301 280 246 58 219 498 331
622C31Q51J928k55k283k91q8K58O6p2J79J49l15j56N38l84M0k20K78k72j30O5P9K41j02J3
387D48k3k22o7J42J15M4P4o1k78n3k4L30J2J20j22q1j73l8N1K32j9J60p3j49k62K7K34P5L6
115D55K08j79k53q1O8K48K1M0M0p3k84j78J45L27o3K97j64j84j66j68L09J61N1J22j13j69
-129D17k87k2K64K53J92q8j37j72k83J07L39J34J27J5j61k30k48J19M37K55J3Q2l33j43j83
-364D67J44K52J52
-392A015
$$ plain form
622 331 1182 3110 2855 572 281 193 451 517 445 624 773 458 302 840 456 496 276 554 282 152 217 296 537 435 448
387 448 425 203 136 278 393 437 511 450 172 119 95 425 437 557 435 354 181 143 194 426 407 567 494 345 83 110 344 419 455
115 455 663 484 231 150 218 466 487 527 567 494 210 32 177 504 441 738 574 390 224 56 365 526 577 699 586 417
-129 417 130 108 372 625 817 729 592 420 137 244 583 717 844 859 698 468 220 339 776 1031 1044 1126 793 650 467
-364 467 611 863 1015
-392 1015
##PAGE=	F1=1551.33
##FIRST=	4405.895418600002813,	4405.895418600002813,	1.8650282621383666992
##DATA TABLE=	(F2++(Y..Y)), PROFILE
4406A083J1k24k04k63R8J16J78K21q2j70k15l15Q2K54O7K10p9k14j97k92K86R1K25J60k74
4171E53Mk77k52J85M78J8m9q7r3k85j4J93K43O6k3q0k08n4q9L34lJ25Qj47j86j58J90R8J85
3899F75J04j67j39j40j07K70P4J71M3j96j50j6l0J41J56J31n8j75l6q8J2K13J16%L7j57j48
3645E36p2K31J11J07%p9o8j36kJ76R0J44N4j90Mj94J12K14J87l8l3Ll07J71J12K39L7J1J14
3373A534k53O7JK62L73J07q2O41j010N58P317K823m961k122j246P29n8o66k948J68372J16033
3176B85471j80451p1435k3020m954n198N506m065M447O876j1759J0314j0491K5897J06004
3044A33142k177k4463K1214J63714r064q4565j55817P0645R5277l7523j56089Q8624L475p1606
2913C4787j6378j2752O839n389k202j001k891L053k848K02l40J582j573O91m29J0m86K8J38
$$ plain form
4406 1083 1094 870 666 403 501 617 795 1016 934 764 549 234 316 570 637 847 768 554 357 65 351 442 667 827 553
4171 553 557 280 28 213 691 709 660 573 480 195 181 374 617 683 660 580 372 318 229 563 560 685 693 546 360 202 392 490 675
3899 675 779 612 473 333 226 496 570 741 784 588 438 422 392 533 689 820 762 587 551 463 475 688 804 804 841 684 536
3645 536 464 695 806 913 913 834 766 630 628 804 894 1038 1092 902 906 712 824 1038 1225 1187 1154 1157 850 1021 1133 1372 1409 1420 1534
3373 1534 1281 1348 1349 1611 1984 2091 2009 2650 1640 2198 9515 12338 7377 5255 4009 4738 4680 4014 1066 169438 285471
3176 285471 105020 33585 10565 5611 413 5919 1854 6301 13177 1418 11732 1241 27138 133142
3044 133142 130965 106502 127716 291430 282366 197801 41984 112629 207906 170383 14294 102918 106393 34787
2913 34787 18409 5657 12496 7107 4905 3904 1013 4066 1218 1420 1080 2662 1089 1780 1351 1361 875 903 1041
2734A041J77K8k9l53Q7p10Q76o66L470N95l237l14k34j72K66J12n1N4j91J00j55no7J93J2
2500H27K0o7k32k1J36o5J38q9nJ8j21O4j79J03O7Q3m1j09q9k3L6J21p8J15pj66j2j21J11J08
2218E22M0m8K2j23J02k31J55R8l8L1p3j36R3o1N4J06j24J58k74J24j17k5K09O5j14L9j30j1
1955C13M0j6O4J22j96R3l3j57O4k0L77n33O90m42j66J53qM16n06M04k86p0q6N9N3N2l8J09
1692D52p7j07O1k23K80J2O6j26Pj38m6J88N7l2j76J90n5J7k79L37n1Q1j58R6j07j21K1J64
1429C33J01n1p4j1j11P2p5J48M4k5o3j7l1j6l4J80l6L9J3k38J04q2J60%j5Np4k2rnM8M5J13
1119D16n8k22N9M2L5L7K8n9j4J5j77P0J14J24j41Q7j14K6j81J15Q6R1jp9j07o7M8J41NJ1J8
828C48j1j47k9O0Q1J09q8R7k26K0q6K5J78M8J7j63Mqj30J78K13j90O34R80Lj436k51j7K17
$$ plain form
2734 1041 1218 1246 1217 864 951 241 1117 451 3921 4516 1279 965 731 559 825 937 886 940 749 849 694 689 622 815 827
2500 827 847 780 548 527 663 598 736 647 642 660 539 603 424 527 594 677 636 527 438 415 451 572 494 609 602 436 424 303 414 522
2218 522 562 514 536 413 515 284 439 537 499 530 457 321 414 353 407 513 389 547 273 397 280 255 464 529 415 454 324 313
1955 313 353 337 401 523 327 420 387 230 294 274 651 118 808 366 200 353 345 761 255 659 373 303 217 276 329 381 343 452
1692 452 375 268 329 106 386 398 464 338 345 207 161 349 406 374 198 388 333 350 71 408 357 438 280 376 269 148 169 333
1429 333 434 383 309 298 187 259 184 332 376 351 288 271 240 224 190 370 334 373 386 148 252 170 330 330 315 320 246 224 215 210 258 303 416
1119 416 358 136 195 237 272 309 337 278 264 279 102 172 286 410 269 356 242 268 87 202 288 379 378 299 192 125 173 314 319 330 348
828 348 337 190 161 221 302 411 323 420 194 214 128 153 331 379 396 233 237 229 99 277 490 300 934 1914 1917 481 230 213 430
556D30O2j35J48j34j89L27M55l99m6l16M75l55k71K06N8J80j14n1qj74K9J60N4j7O6r8k27
302A16Q0j48L68J2O5j31j07j64K8J40J78o2J29j37j17k37R3K63N4pJ53j89k65m0K09K17l7
49D64J1k6j05k05j7R7L02q8K42k29j69k00Q9K35J46k6R9j93j28k30J23K43J86J32j44j50k00
-205B59j09J99K60Q5M1Kj70k68%J18L99J58m4K0l38j03p3K66J94R2
$$ plain form
556 430 492 357 505 371 182 509 964 565 519 203 678 323 52 258 316 496 382 331 323 149 178 338 392 375 441 343 116
302 116 196 48 416 428 493 362 255 91 119 259 437 375 504 367 250 13 106 369 423 416 569 380 115 75 284 501 464
49 464 475 449 344 139 122 219 521 433 675 446 277 77 166 401 547 521 620 427 299 69 192 435 621 753 609 459 259
-205 259 150 349 609 694 735 737 567 299 299 417 816 974 930 950 612 509 436 702 896 988
-392I88
##PAGE=	F1=1532.55
##FIRST=	4405.895418600002813,	4405.895418600002813,	1.3582630157470703125
##DATA TABLE=	(F2++(Y..Y)), PROFILE
4406I70m3k19j61j14Q4J11J11J79j50j10k31k62K23J71M4J24r5k07j80j83L12N5J66J31k98
4171D28k4k44o9J37M42m9r2p9r5k56P9J94J86J8l2q5k20J0l6L21m8R3l4j37j44j29K24P8J56
3899E93M9j76j28j10m4K40J00J04Mj97j43pM9J27J40Q7p1k23J6n8N7J75R0l3K3j67j20l1K54
3627F00Q7O9j9j04p4j02M2J87L4J15K4j95J0j37J34J80J55n4p9j3k57K14P7K36j0o0J21k57
3364I24J06pK65K91K9j75N09q12M76L809J242k322j15j428M73k37o07j94J25518P8078j41103
3166F4720l6005k1447k955j357M749m071L195L579p705J447N790N0193P3309m2333q200J6538
3016I9447J23471q49q2872r4870R7386Q7903m7039j66072J22458J7874p9750m2169j6754P532
2885B5696r237m673p413k715J700k337J40L2J062j080M49m67p9m12Q6J85J55L4j47l98J08
$$ plain form
4406 970 927 708 547 433 517 628 739 918 768 658 427 165 388 559 603 727 632 425 245 62 374 429 595 726 428
4171 428 404 160 91 228 670 621 529 450 355 99 178 372 558 576 544 459 239 249 213 534 486 579 545 408 264 135 359 437 593
3899 593 642 466 338 228 184 424 524 628 632 435 292 285 334 461 601 688 617 394 410 352 409 584 674 641 664 497 377 346 600
3627 600 687 756 737 633 559 457 499 686 720 835 859 664 674 537 671 851 1006 952 873 860 603 817 894 1130 1120 1060 1181 924
3364 924 1030 1023 1288 1579 1608 1433 1942 1130 1606 5415 6657 4335 4220 2792 3265 3028 2421 2227 127745 205823 64720
3166 64720 28715 7268 4313 2956 7705 3634 6829 10408 2703 4150 9940 60133 133442 91109 82909 99447
3016 99447 222918 222069 139197 44327 141713 229616 182577 16505 138963 156837 77087 34918 18164 25696
2885 25696 16459 11786 4373 1658 3358 1021 1161 1193 2255 1175 1624 1157 1078 666 752 937 1092 1126 979 581 689
2688F89n67R97k63O543j8o225l58r5j73K38J81j90Pj02l2J8jp4J66j9K6p8k22j4J64n9J11
2434F50p3m1J3j14Q9j34P3K8Q8l5r4j06j0M6J35q6Q2rj68J9r5Q4J02K3k5%j18R5j65Q8J53
2143D95r8O6j06j08R3k4K6R9j17J09k10J38j42k2K10O7j44M1j06RJ4J8J9J29k02O4qj10M0
1871B40J8K70m69M85k56j16P2P2J74k31K40j81o5q4O6M6P9j18J99p5k21K10k27K53o2Q3j19
1617B83%j65K7J85kRj99K13j24O0k35L18n3M1j16O1r0r2mJ74J00m5j22lo4M8l8J22M3m0p4
1326B18j9Pj3PJ01j2K9Jk43J46p8J76k9k9l0n2rJ9J0J5J8J38q4j93O2K9M8L6Rm3n2M6j40M8
1007A37J30P7j10L0k1lk04J52O6Q6Kj02j33rL8J71k6j3M1l9j19m1Q4Q9Q4j00R3k17Jn7N9J79
706C25j5M3j88M5Oj07J76J63k03N99K26O6p36k37N0J65O8j70Q6j22j4M05L42l62j08k78N57
$$ plain form
2688 689 122 1119 856 7399 7381 1156 798 703 530 768 949 759 766 664 632 650 649 575 741 722 748 670 448 434 598 539 650
2434 650 577 536 549 435 524 390 463 491 579 544 450 344 334 380 515 429 511 502 334 353 258 342 444 467 442 442 324 419 254 342 495
2143 495 397 463 357 249 342 318 344 443 326 435 225 363 221 199 409 476 332 373 267 276 290 308 327 456 254 318 310 200 240
1871 240 258 528 59 544 288 172 244 316 490 259 499 318 253 169 235 281 360 242 441 366 145 355 128 381 319 402 283
1617 283 283 118 145 330 328 337 138 351 227 287 52 370 317 358 242 303 213 121 117 291 391 346 224 221 157 205 167 289 332 292 218
1326 218 199 206 193 200 301 289 318 319 76 222 144 320 291 262 232 180 171 190 200 215 233 371 287 94 156 185 233 269 278 235 183 229 89 137
1007 137 267 344 234 264 243 240 36 188 254 340 342 240 107 98 136 307 281 268 309 270 151 110 194 283 367 267 360 143 144 87 146 325
706 325 310 353 165 210 216 109 285 448 245 844 1070 1136 400 163 213 378 446 276 362 240 226 631 973 611 503 225 782
453G82l30l06J08M2J23j07q7J0j39Q4J67Mo7Q2j12j56J81k45L20K5K5j08j16r8J2J80J19p8
190C15J14j73p4j18M6K31K8j8J14j67k26J8J98J90q2Nn7j08j11L1O4K45p1J96k56j40j30J42
-73B06J74J19o3R9k39n4j20R8K00J42R1j56j30j88K4J81J76N6Ljj31k58J36O8L41P1m0rk80
-345E16m5k6K76J26M9
$$ plain form
453 782 452 146 254 296 419 312 225 235 96 180 347 351 284 366 254 98 279 34 354 379 404 296 180 82 94 274 393 315
190 315 429 256 182 64 110 341 369 351 465 298 72 90 288 478 396 401 344 236 125 156 220 465 394 590 334 194 64 206
-73 206 380 499 436 535 296 242 122 220 420 562 653 497 367 179 203 384 560 616 619 618 487 229 365 433 774 845 805 796 516
-345 516 471 445 721 847 896
-392H96
##PAGE=	F1=1513.77
##FIRST=	4405.895418600002813,	4405.895418600002813,	1.9651006460189819336
##DATA TABLE=	(F2++(Y..Y)), PROFILE
4406H66m7j86r9n2M8P3O2J43j72j9k23j96K12Q8M1P0q5j67j23r9K24J4J24J25k80l4j77J0
4143A41P6L75p2j14m2q8j44LJ87J36jj7p2j81k2OK79o3Q1n6r0j59r1K07O1J51Oj54j01j32
3861A10QJ93J35M6j7j66j40k4P7J22J38N3o1k42N0o7Q4J30Q4m5K8j60j28pK48P0N3j8j04q8
3580C62j04P1J92rR7J6j83j1r1J31J37J39n1r8l0k11K18K8K26l0r6J30k42J07k8K37K06j0
3317A103k07L57n72M13J063R06j225J378j564L05k16l65J127Q1567N0383r7615j3150j9428
3148D260j909R15M714l710o17L6n47n30J0355P7667P3587p8934r133M240P8866N658q0539
2988H4379m0728J16540Q0002n4097j37771J39809L9318q4012q1896k6660M481j1924o484j5934
2857E023k630K1j580k0M98N21n34J82m84j96l56J17K29J43M0j74l97J26l88O73l30N155Q78
$$ plain form
4406 866 819 633 534 482 530 603 665 808 636 617 394 198 410 498 539 609 524 357 234 135 359 373 497 622 342 308 131 141
4143 141 217 592 520 406 364 276 132 135 322 458 457 440 368 187 165 171 450 387 468 412 322 163 72 279 340 491 497 343 242 110
3861 110 118 311 446 492 475 309 169 145 222 344 482 535 474 232 282 215 299 429 513 468 496 336 208 201 449 519 572 554 450 362
3580 362 258 329 521 512 609 625 442 431 340 471 608 747 696 598 568 357 575 603 829 799 703 833 591 698 670 907 1113 1103
3317 1103 896 1253 681 1094 2157 3063 1838 3216 1652 1957 1741 1376 2503 84070 134453 36838 23688 4260
3148 4260 2351 3266 7980 4270 3653 3689 3142 2612 12967 90634 164221 85287 76154 80394 159260 164918 84379
2988 84379 43651 160191 240193 186096 48325 188134 227452 143440 61544 34884 39365 27441 20957 5023
2857 5023 2393 2414 834 814 1312 1833 1299 1481 997 801 445 562 791 934 974 800 403 529 141 814 484 5639 6517
2641F517n807j74nj50J86K54k98j5L9J60j38k5r5J39l0K9o8k01j7J61m7Q9m7m7pr4P7q5N6
2368C57pR4j4q4j14k4O4J38q1N2Pj79N1p2L9J05PK1k5j06N7j12N1J89j39J02j23q7O4J0J1
2077B52Q8q7O0j23J18j79KJ92O6j54M7p3J2k6M4mJ31j80L2Oq3J2M2K18l14K32q4j25NJ28K5
1786B80l5J11j08l9r7M9M3J07j63K29l2k54K35j83J75r3J05j24K2j85P3J53l7M9j91K10j62
1533A38O1j72K80n1Qo8L4q1p0k8J74R9l1j47Pl4J7rR1M8l1q5oRk1M9K8L0PQk37J55p6J78l6
1204B38m0m5l2J6NK7j6lJ67r5j51M1J0M1M3%j1p8P4j25J4J39L7o3pP1n5j67J15M4Q4K3j02
894A99j60N8j2J75l5k3O2m4j10l5N4J03P0r6Q9j94k0n6P8J89o6P3j77Q5j8p5J34J34k01O15
612G96p1j41k39k48J07J17P3j73j4L31j44K85J73k91r9j97N99k58l73j6M3O9q1r3J5j32J08
$$ plain form
2641 6517 710 536 531 381 567 821 523 508 547 707 569 544 449 588 558 587 519 318 301 462 415 504 457 410 403 309 386 301 357
2368 357 350 444 430 346 232 208 272 410 329 381 388 209 260 188 227 332 339 360 335 229 286 174 225 414 275 377 254 167 231 241 252
2077 252 340 253 313 190 308 129 131 323 389 235 282 209 221 195 239 235 366 186 218 224 141 153 195 413 99 331 247 122 127 255 280
1786 280 245 356 248 209 112 161 204 311 148 377 345 91 326 143 318 225 330 206 228 43 116 269 232 281 90 300 138
1533 138 199 27 307 256 264 196 230 149 79 51 225 324 293 146 153 119 136 127 218 266 235 150 144 153 132 181 209 239 246 254 17 172 96 274 238
1204 238 198 153 121 137 142 169 153 150 317 222 71 112 122 163 206 206 195 117 191 66 80 219 256 193 186 257 202 35 150 194 278 301 199
894 199 39 97 85 260 225 202 264 220 110 75 129 232 302 206 295 101 81 25 103 292 226 299 122 207 189 114 248 382 181 796
612 796 725 584 345 97 204 321 394 221 207 538 394 679 852 561 462 265 864 606 233 217 260 329 248 155 170 38 146
359A46J80l3r9J10j08q8K17k75K20M7%n8j30ro9K06P1p6J16j94j9o0J3J82kNQ9j36j33K8R4
68B35J95j15J8n3p8o3J6M6J76k9J63k50j09k0O9J32R3p4J24k50K6p5L7J54J17P4j40q6j35
-205A98L4J39J15M9Lon7k28J48K0K93mJ5j4j91j3k8K29P0L3
$$ plain form
359 146 326 293 194 304 196 108 325 50 270 317 317 259 129 120 51 257 328 252 368 174 155 95 108 290 288 293 382 246 113 141 235
68 235 430 315 333 280 202 139 155 201 377 348 511 261 152 132 201 333 426 352 476 226 252 177 214 368 485 559 419 333 198
-205 198 232 371 486 535 538 532 475 247 395 415 708 704 719 705 514 501 473 702 772 805
-392H05
##PAGE=	F1=1494.99
##FIRST=	4405.895418600002813,	4405.895418600002813,	1.9610728025436401367
##DATA TABLE=	(F2++(Y..Y)), PROFILE
4406H32j8j40m2l9KK2K2J08j62P3k00j57J57%L8M1o1r9n3q2J22k7Q1J39k34l2o7QJ5K51n1
4115D47j28K3o6k5j36J63Q4KPl8p7k01J29J73n8Q7n9j6k39M4Q2M3J64l2r4n5j85NJ67J56O
3824C73l2q5j23p9M2J28J46K7l1k02K8j12J05Q8R0m2M2j04k39J8K42O4O6j6p3j38j42J04K09
3551C54l6Q9L6j74p5o7J41R3J46m0j02n3j87J85NK11k1j00J44k63P3j9J94J34mj88J77l66
3288B87L75k1J619k083K196j605K05j7l8J117M3138L2855n3861n939j6017j545O30M219j832
3110C683k708L636k098L244N411J04730R2046j10550j9612l654L6460Q669o9052j1427J23709
2969A62487P1312n6169r3690J57055O5564q8364j22874m2945l402j4192m562k4569k503j564
2838A584q67k13R34O9n8%m45l11l45L4K62K00L7j13k60Q2k75K88J816K941k678k137l30J0
$$ plain form
4406 832 814 674 632 593 595 617 639 747 585 658 458 301 458 458 496 537 476 377 324 242 364 337 418 557 323 291 224 232 247 498 447
4115 447 319 342 276 251 115 278 362 364 371 333 256 55 184 357 299 386 327 311 72 116 198 241 405 373 279 224 39 44 211 367 373
3824 373 341 256 133 54 96 224 370 397 366 164 192 80 185 273 363 321 363 259 20 38 280 344 410 394 321 183 41 145 354
3551 354 318 407 443 269 194 127 268 361 507 467 365 312 125 310 315 526 505 405 549 286 359 340 534 668 664 476 653 287
3288 287 662 641 2260 177 2373 768 973 956 918 2035 45173 78028 24167 18228 2211 666 1296 5515 3683
3110 3683 975 4611 2513 5757 11168 115898 207944 97394 77782 74128 110588 119257 50205 38778 162487
2969 162487 233799 177630 83940 240995 306559 218195 95321 52376 48974 34782 30220 5651 3148 1584
2838 1584 717 504 1438 1507 1449 1449 1004 693 348 382 644 844 881 768 508 590 315 603 2419 5360 2682 545 215 225
2612B25o5J07L24l57L1J39N62n60l5j06J22j4K6m6j66l9J29k5Q0j6j8n6n3J4nL5k7R8K6r8
2331B32j16o4R6J36o5L8J8j62N1n5j4J18LQ3o4q0k9m6K6K12j54J24j06q5pM9J2Q4n2K9k0L6
2030B28k12P5J37O3j49O3l8k6m3N1mJ31j54L2nq5jM7K11k83J54M8j87j5J22j5O2M6q1K0j49
1739D3L0M7J25j46J38P2j57O3r0R5q0J25j47Q3j71L9J03j2O1j31J60j82M7k6J51m2pm5L2p8
1457A00q0MJ30R5j4j34L7n1k9K5N8N5mo6nl2l7R1k5Q3l0L0j40M4k7J30k0m8m4NM7p0O8n6j4
1129G6J91p8j08k6L5PM5%K9q1R4j25m3J44Rj2nJ29j52k4J1J2Q8M6p3j56R3q3J46j6k1P3k0
819B05j41K6k7J09O3p5Q1j51k8j4K6J79j00R4j03Q9q8mM1J31j90N90q2l42K1j93P9Q0P7j51
537B02n0M95l08L84j01k08Kj33O37j72m53j24N6K7m5o0rm4KK03n5j16J45r2l9K06k66J14P1
$$ plain form
2612 225 160 267 591 234 265 404 966 406 371 265 387 373 399 353 187 148 277 252 332 316 298 242 189 203 198 233 206 304 330 232
2331 232 116 52 148 284 219 257 275 113 164 109 95 213 216 299 235 155 126 80 106 318 164 288 182 97 90 139 151 235 183 212 192 228
2030 228 16 91 228 291 142 205 167 141 98 149 145 276 122 154 149 64 63 110 321 38 192 240 53 38 160 145 207 253 172 192 43
1739 43 73 120 245 99 237 309 152 215 125 220 140 265 118 201 30 69 172 160 221 90 250 68 115 89 240 198 191 146 178 100
1457 100 20 24 154 249 235 101 138 87 58 83 141 196 192 126 121 89 52 143 118 201 171 201 61 105 78 208 188 140 96 101 148 78 146 90 76
1129 76 267 189 81 55 90 97 142 142 171 90 184 59 16 160 169 157 152 281 129 105 116 128 216 262 189 33 126 43 189 173 152 225 205
819 205 64 90 63 172 235 160 241 90 62 48 74 253 153 247 144 233 145 141 182 313 123 713 631 289 310 117 196 276 353 202
537 202 152 647 339 723 622 414 416 283 920 748 295 171 227 254 209 149 140 96 98 301 246 130 275 183 144 350 84 198 269
265B69j2J0j63P3j04J63L8o3J29j99L7k9KR8l4N1Q3j18m5K4n8K36j33L8j6l3o9J8MJ03K4J36
-36D60k11p1M7k0R6P3p2J65k30Q6o5k9J03R9P4j04l3o7j4P6Q4M9K6j5L0k02J18k6K57o9R8
-327G13qr3mm2J59J7M3
$$ plain form
265 269 257 267 104 177 73 236 274 211 340 141 178 149 151 249 215 266 349 231 186 210 152 388 255 293 277 244 175 193 197 300 324 460
-36 460 249 178 225 205 301 374 302 467 237 323 258 229 332 431 505 401 368 301 287 363 447 496 522 507 537 335 453 427 684 615 713
-327 713 705 612 608 566 725 742 785
-392G85
##PAGE=	F1=1476.21
##FIRST=	4405.895418600002813,	4405.895418600002813,	1.3746131658554077148
##DATA TABLE=	(F2++(Y..Y)), PROFILE
4406H87L1r6km5n0j9k1P7j26J36j75j37R9p9K2K6l0j9lr9L3n5L1J64j70k0J0k3k3J00pj26
4105B91R6k7L2k04R1K5J4L4K3Mk57J43L1n1J07k9M7j96O0o2MJ76n6J5j1j00j06J01J12ql7
3814B62N1p3n7n5K4J40J0L7q9l3p0NOJ02j6P2Pj53m9J9N6J13nmj54K4q4J38n1J08R4j30q9
3504A56p7O8J4J80k1m6m3q7p0L9J58K7m2J71k88q7J32M2Q4N7o4o8j50K37J018J084j301N93
3242A716j530J07K27J36N75J6357K2126k0551o727j0602j52k23J284R4O65N819p585L986J785
3063G507J27520J12312j34605l0462p253M298R346m1701j7292J17854O1314n2153l8664J67168
2932B85189R3119r1069j56746o2539j7335j6356K844l1274k114k290q24k09J145j82K25m9
$$ plain form
4406 887 918 822 820 775 725 706 685 762 636 772 597 460 559 480 502 528 498 479 476 377 410 355 386 550 380 360 370 347 324 424 417 291
4105 291 387 360 392 188 279 304 318 352 375 379 122 265 296 245 352 323 370 174 234 172 176 352 296 311 300 200 94 195 307 299 262
3814 262 313 240 183 128 152 292 302 339 250 217 147 152 158 260 244 316 323 170 121 140 196 309 304 300 146 170 86 224 173 281 375 245 156
3504 156 79 147 161 341 320 274 231 144 74 113 271 298 256 427 139 52 184 226 310 367 303 235 85 322 1340 2424 1123 1716
3242 1716 186 293 520 656 1231 17588 39714 19163 12436 1834 1682 1459 2743 2837 3502 9321 1736 5722 7507
3063 7507 135027 247339 112734 82272 75019 79317 88663 46962 29670 147524 208838 156685 118021 285189
2932 285189 378308 287239 130493 67954 50619 34263 37107 5833 3719 1429 605 396 1541 1359 1584 1535
$$ [...]
-392C2
##END NTUPLES=	nD NMR SPECTRUM
##END=	
##END=	
