##TITLE=	8ZcN$A7yQnuDmiGRyCxEAQ.44.ser
TM-VI-391, CDCl3, hmbc

##JCAMP-DX=	6.0	$$ MestReNova 14.3.0-30573
##DATA TYPE=	LINK
##BLOCK_ID=	1
##BLOCKS=	2    
##ORIGIN=	Mestrelab Research S.L.
##OWNER=	hrzepa
##$MNOVA/LINK_BLOCK_TYPE=	ITEM	$$ NMR Spectrum
##$MNOVA/ITEM/POLYGON=	(XY..XY)
5321,5835
8722,5835
8722,8208
5321,8208
5321,5835
##$MNOVA/ITEM/Z=	0
##$MNOVA/ITEM/ANGLE=	0
##TITLE=	8ZcN$A7yQnuDmiGRyCxEAQ.44.ser
##JCAMP-DX=	6.0	$$ MestReNova 14.3.0-30573
##BLOCK_ID=	2
##DATA TYPE=	MNOVA NMR VIEW DATA
##DATA CLASS=	MNOVA VIEW DATA
##$MNOVA/2D/THRESHOLD=	10.652363777160644531
##$MNOVA/ITEM/ZOOM/X=	-0.47501081208716700033,	14.504330000039219684
##$MNOVA/ITEM/ZOOM/Y=	-9.5107036222489718114,	249.98529999918474687
##END=	
##TITLE=	8ZcN$A7yQnuDmiGRyCxEAQ.44.ser
##JCAMP-DX=	6.0	$$ MestReNova 14.3.0-30573
##BLOCK_ID=	3
##DATA TYPE=	nD NMR SPECTRUM
##DATA CLASS=	NTUPLES
##NUMDIM=	2
##ORIGIN=	Bruker BioSpin GmbH
##OWNER=	nmr
##.OBSERVE FREQUENCY=	400.41280287000000726
##.OBSERVE NUCLEUS=	^1H
##.SOLVENT NAME=	CDCl3
##.PULSE SEQUENCE=	hmbcgplpndqf
##LONGDATE=	2022/06/22 02:55:14.000
##.ACQUISITIONMODE=	SIMULTANEOUS (DQD)
##$ORIGINAL FORMAT=	Bruker XWIN-NMR
##$MNOVA/SCALES_VERSION=	9
##$PARAMETER FILE=	(acqu2s, ASCII, /private/var/folders/f6/rjf_tdyn2v98c5c0wvkgn4s80000gn/T/8ZcN$A7yQnuDmiGRyCxEAQ/44/acqu2s, 0)
$$ ##TITLE= Parameter file, TOPSPIN		Version 3.2
$$ ##JCAMPDX= 5.0
$$ ##DATATYPE= Parameter Values
$$ ##NPOINTS= 129	$$ modification sequence number
$$ ##ORIGIN= Bruker BioSpin GmbH
$$ ##OWNER= nmr
$$ $$ 2022-06-22 03:14:51.339 +0100  nmr@CZC10666PP
$$ $$ /opt/topspin/data/agmb/nmr/Jun21-2022/44/acqu2s
$$ $$ process /opt/topspin3.2/prog/mod/go
$$ ##$ACQT0= 0
$$ ##$BF1= 100.683175
$$ ##$FnMODE= 1
$$ ##$NUC1= <13C>
$$ ##$NusJSP= 0
$$ ##$NusT2= 1
$$ ##$NusTD= 128
$$ ##$O1= 12080.308799824
$$ ##$SFO1= 100.6952553088
$$ ##$SW= 259.972631192251
$$ ##$SW_h= 26178.0104712042
$$ ##$TD= 128
$$ ##END=
$$ 
##$PARAMETER FILE=	(acqus, ASCII, /private/var/folders/f6/rjf_tdyn2v98c5c0wvkgn4s80000gn/T/8ZcN$A7yQnuDmiGRyCxEAQ/44/acqus, 0)
$$ ##TITLE= Parameter file, TOPSPIN		Version 3.2
$$ ##JCAMPDX= 5.0
$$ ##DATATYPE= Parameter Values
$$ ##NPOINTS= 12	$$ modification sequence number
$$ ##ORIGIN= Bruker BioSpin GmbH
$$ ##OWNER= nmr
$$ $$ 2022-06-22 03:14:55.846 +0100  nmr@CZC10666PP
$$ $$ /opt/topspin/data/agmb/nmr/Jun21-2022/44/acqus
$$ $$ process /opt/topspin3.2/prog/mod/shimcntl
$$ ##$ACQT0= 1000000
$$ ##$AMP= (0..31)
$$ 100 100 100 100 100 100 100 100 100 100 100 100 100 100 100 100 100 100
$$ 100 100 100 100 100 100 100 100 100 100 100 100 100 100
$$ ##$AMPCOIL= (0..19)
$$ 0 0 0 0 0 0 0 0 0 0 0 0 0 0 0 0 0 0 0 0
$$ ##$ANAVPT= -1
$$ ##$AQSEQ= 0
$$ ##$AQ_mod= 3
$$ ##$AUNM= <au_zg>
$$ ##$AUTOPOS= <42 >
$$ ##$BF1= 400.41
$$ ##$BF2= 100.683175
$$ ##$BF3= 400.41
$$ ##$BF4= 400.41
$$ ##$BF5= 400.41
$$ ##$BF6= 400.41
$$ ##$BF7= 400.41
$$ ##$BF8= 400.41
$$ ##$BYTORDA= 0
$$ ##$CAGPARS= (0..11)
$$ 0 0 0 0 0 0 0 0 0 0 0 0
$$ ##$CFDGTYP= 0
$$ ##$CFRGTYP= 9
$$ ##$CHEMSTR= <none>
$$ [...]
$$ 0 0 0 0
$$ ##$ShimPowMaxUC= (0..63)
$$ 130000 130000 130000 130000 130000 130000 130000 130000 130000 130000 130000
$$ 130000 130000 130000 130000 130000 130000 130000 130000 130000 0 0 0 0
$$ 0 0 0 0 0 0 0 0 0 0 0 0 0 0 0 0 0 0 0 0 0 0 0 0 0 0 0 0 0 0 0 0 0 0 0 0
$$ 0 0 0 0
$$ ##$ShimPowMaxUG= (0..63)
$$ 524287 524287 524287 524287 524287 524287 524287 524287 524287 524287 524287
$$ 524287 524287 524287 524287 524287 524287 524287 524287 524287 0 0 0 0
$$ 0 0 0 0 0 0 0 0 0 0 0 0 0 0 0 0 0 0 0 0 0 0 0 0 0 0 0 0 0 0 0 0 0 0 0 0
$$ 0 0 0 0
$$ ##$ShimPowRcbType= 3
$$ ##$ShimPowRes= (0..63)
$$ 1e-20 1e-20 1e-20 1e-20 1e-20 1e-20 1e-20 1e-20 1e-20 1e-20 1e-20 1e-20
$$ 1e-20 1e-20 1e-20 1e-20 1e-20 1e-20 1e-20 1e-20 0 0 0 0 0 0 0 0 0 0 0 0
$$ 0 0 0 0 0 0 0 0 0 0 0 0 0 0 0 0 0 0 0 0 0 0 0 0 0 0 0 0 0 0 0 0
$$ ##$ShimPowRng0= (0..63)
$$ 1 1 1 1 1 1 1 1 1 1 1 1 1 1 1 1 1 1 1 1 0 0 0 0 0 0 0 0 0 0 0 0 0 0 0 0
$$ 0 0 0 0 0 0 0 0 0 0 0 0 0 0 0 0 0 0 0 0 0 0 0 0 0 0 0 0
$$ ##$ShimPowRng1= (0..63)
$$ 1 1 1 1 1 1 1 1 1 1 1 1 1 1 1 1 1 1 1 1 0 0 0 0 0 0 0 0 0 0 0 0 0 0 0 0
$$ 0 0 0 0 0 0 0 0 0 0 0 0 0 0 0 0 0 0 0 0 0 0 0 0 0 0 0 0
$$ ##$ShimPowRng2= (0..63)
$$ 1 1 1 1 1 1 1 1 1 1 1 1 1 1 1 1 1 1 1 1 0 0 0 0 0 0 0 0 0 0 0 0 0 0 0 0
$$ 0 0 0 0 0 0 0 0 0 0 0 0 0 0 0 0 0 0 0 0 0 0 0 0 0 0 0 0
$$ ##$ShimPowRng3= (0..63)
$$ 1 1 1 1 1 1 1 1 1 1 1 1 1 1 1 1 1 1 1 1 0 0 0 0 0 0 0 0 0 0 0 0 0 0 0 0
$$ 0 0 0 0 0 0 0 0 0 0 0 0 0 0 0 0 0 0 0 0 0 0 0 0 0 0 0 0
$$ ##$ShimSysFunc= (0..63)
$$ 1 2 3 4 5 7 9 11 15 16 8 10 12 14 6 17 13 18 19 20 0 0 0 0 0 0 0 0 0 0
$$ 0 0 0 0 0 0 0 0 0 0 0 0 0 0 0 0 0 0 0 0 0 0 0 0 0 0 0 0 0 0 0 0 0 0
$$ ##$ShimSysMatrix= 0
$$ ##$ShimSysType= 1
$$ ##$TFXNUM= 0
$$ ##$TRIPLO2= 0
$$ ##$VTU= 2
$$ ##$VTUETH= <149.236.99.20>
$$ ##$VTUTY= <no>
$$ ##$WBREFAM= (0..15)
$$ 135 116 100 100 100 100 100 100 100 100 100 100 100 100 100 100
$$ ##$WBREFLM= (0..15)
$$ 0 0 0 0 0 0 0 0 0 0 0 0 0 0 0 0
$$ ##$WBREFPH= (0..15)
$$ 71.66 -68.25 0 0 0 0 0 0 0 0 0 0 0 0 0 0
$$ ##$WBSGU= (0..15)
$$ 0 0 0 0 0 0 0 0 0 0 0 0 0 0 0 0
$$ ##$XFAC= 2
$$ ##END=
$$ 
##$DECIM=	3328
##$DSPFVS=	20
##.ACQUISITIONSCHEME=	NOT PHASESENSITIVE
##NTUPLES=	nD NMR SPECTRUM
##VAR_NAME=	FREQUENCY1,	FREQUENCY2,	SPECTRUM
##SYMBOL=	F1,	F2,	Y
##.NUCLEUS=	13C,	1H
##.OBSERVE FREQUENCY=	100.69525530880000019,	400.41280287000000726
##VAR_TYPE=	INDEPENDENT,	INDEPENDENT,	DEPENDENT
##VAR_FORM=	AFFN,	AFFN,	ASDF
##VAR_DIM=	512,	512,	262144
##UNITS=	HZ,	HZ,	ARBITRARY UNITS
##FIRST=	25169.313707327481097,	5807.6787752999953227,	0.11575043201446533203
##LAST=	-957.56783717514929322,	-190.19907926730809322,	0.10545439273118972778
##MIN=	-957.56783717514929322,	-190.19907926730809322,	0.00071328133344650268555
##MAX=	25169.313707327481097,	5807.6787752999953227,	369.891265869140625
##FACTOR=	1,	1,	0.0030814493574573792282
##PAGE=	F1=25169.3
##FIRST=	25169.313707327481097,	5807.6787752999953227,	0.11575043201446533203
##DATA TABLE=	(F2++(Y..Y)), PROFILE
$$ [...]
##PAGE=	F1=5024.52
##FIRST=	25169.313707327481097,	5807.6787752999953227,	0.13252241909503936768
##DATA TABLE=	(F2++(Y..Y)), PROFILE
1007C5P3P1j27JR8N0o6J3q0J07J0j08m1M1N4K5R2j10pL6J9p8j4PQ5p0JK8o8R3m3M1P3j17R9
596B23j84J98m6j04M8o1m4L12l8j09j17M5k2L4k4k0kN5j3l3K41j78O1K6k4j87J30k0J33j70
244A10m9ml2N8n8J42j0j27J10r8M2N6KM9J45J1j20j63O4l7L5o2J46r7o6J09k0NK2K3j74O8
-132H0M4P8j18o0%
$$ plain form
1007 35 108 179 52 53 151 201 135 148 68 175 185 77 36 77 131 156 248 138 131 167 186 108 94 101 186 116 117 145 77 170 127 168 241 124 223
596 223 39 237 191 87 135 74 30 342 304 195 78 123 101 135 111 91 89 144 131 98 339 161 222 248 224 37 167 147 280 110
244 110 61 57 25 83 25 167 157 30 140 42 84 140 142 191 336 347 227 64 128 91 126 64 210 113 47 156 136 141 163 186 12 80
-132 80 124 202 84 24 24
-190B4
##PAGE=	F1=4922.26
##FIRST=	25169.313707327481097,	5807.6787752999953227,	0.03256260603666305542
##DATA TABLE=	(F2++(Y..Y)), PROFILE
5808A28K8L5q0N3q4k1kK2M0M4j6J12j54J33l9j13K2kO5k1j01J9o1N1J80J12k60M3n8Q5J60
5444C20j19mj82K5J46J9j2n9r5M2m5J20rr1J26m1%K6M7o1nl7o9N3m9L0J12r1R2lp5l3M8jJ75
5033C00j72Ko3J00n4M1L7j14OoO7qrJ50k57J78j51M4p2LL2P6j3K6NK0po5K06nj69j23P8Kl8
4622D7R7l7O3k9j04J78o5m7J86J57k58N8j07MM0j01J40r7m8M0Q0j5K0J5p9q9L9J53Kj20P2
4258A95r7J26k5p8l7P7k0R5Mj05R2j70J50j85J69j45J39j2j4p2M0mm6n0L8J02j17J27r6o3
3906A8J52Q2j22q6J00k8n9J64k2K9j21J26j63Qk2J09J6l5l7O4k6J5j4J7j16J49j43m3N4O3
3554A29k4L8q1J7O8J00R6k52Q8J2q4m4lk5M6M5N8K5l9Nl1l0j2Kk4J7%%Q9J65j94n9R8Q1j71
3143A06l8Q4r9J26l7J4m8N7JJ5P5o0o2N6k1j27J66r2J69k68O2kJ11o6o6P8j02K56m7k02M3
$$ plain form
5808 128 156 191 111 164 80 59 57 79 119 163 147 259 105 238 199 86 108 106 171 150 49 68 7 58 238 350 90 133 75 160 320
5444 320 201 197 15 40 186 205 193 134 39 81 36 156 147 56 182 141 141 167 214 153 148 111 42 95 46 76 188 97 189 186 111 78 126 125 300
5033 300 128 130 67 167 113 154 191 77 83 77 144 136 127 277 20 198 47 91 19 22 54 130 117 143 148 168 161 96 302 297 128 5 83 85 47
4622 47 144 107 170 141 37 215 150 103 289 446 188 246 139 143 183 82 222 125 77 117 197 182 202 217 138 49 88 241 243 123 195
4258 195 98 224 199 121 84 161 141 236 240 135 227 57 207 22 191 46 185 173 159 87 127 123 77 27 65 167 50 177 81 18
3906 18 170 252 130 44 144 116 57 221 199 228 107 233 70 78 56 165 181 146 109 173 147 162 148 165 49 198 55 12 66 129
3554 129 105 143 62 79 147 247 343 91 179 191 107 63 60 35 81 126 184 209 170 175 144 114 102 104 80 97 97 97 186 351 157 98 196 277 106
3143 106 68 152 53 179 142 156 108 165 166 181 256 196 134 190 169 42 208 116 285 17 79 77 188 122 56 134 32 288 241 39 82
2779H2O5J45j51o4J03L2lq3J1L23K73k70k61m6o5Q4Qp0l6N0l1N5M4k8J24j32L7r4N9m8k8J26
2404B11j51J58q8J17j67l3K04Q3r5r9q0k2J3Q8j9k6N4q4Q6n5p0N1J19N1j41k8J4j7o0M9R5
2040A58K0n7M8k7k3M3J04j15P5Q0q9j70J00R4k22J31r0J52o2j35J14j3q3J34j4j9P1n3o4K23
1688C11r2L6j9j81O0k6o8J14j20M8J52j05KJ16m6l1j07N1P0K3l0q9NJ54k1j82L6oM3L7J81
1324C16q9j52N7N2n9p9L7P6P7j24N8p0JL6Qj00J28J7k0R9q1j03m7J71J04j44j01O9Mj03j4
960B4J08M8r1M6j4Q7J2j08q9P2O5k8O5p9J3jM9j01M3mJ00m1j00P3m4P6k5K0M5j05N4j31K03
573B42j1j16J06j98j8L68n6j52p7O8m7j4j5J9K2k0L7l9K25j45kN7l6j50P0K0J75j79o1l3M
209D4M2p5J54j4q8O4o0L7O4K6l2J45K7j47j55P8l2K8l4J14o9p1N9m3M5J09Jj70N2K2J04j02
$$ plain form
2779 82 147 292 141 77 180 212 209 126 137 460 733 463 202 156 91 175 183 113 77 127 96 151 195 167 291 159 196 102 161 113 85 211
2404 211 60 218 130 247 80 47 251 334 239 140 60 38 51 139 120 94 148 64 150 95 25 76 195 246 105 77 91 74 14 63 158
2040 158 178 121 169 142 119 162 266 151 226 306 217 47 147 241 19 150 60 212 150 15 129 116 33 167 153 134 205 152 88 311
1688 311 219 255 236 55 115 89 21 135 15 63 215 110 112 228 182 151 44 95 165 188 158 69 74 228 207 25 61 55 98 135 316
1324 316 227 75 132 184 125 46 83 159 236 112 170 100 101 137 145 45 173 190 170 269 188 85 38 209 313 169 68 137 141 38 24
960 24 132 180 89 135 121 208 220 112 23 95 160 132 197 118 131 130 179 78 121 117 217 176 76 149 105 181 156 176 221 116 170 39 242
573 242 231 115 221 23 5 373 317 165 88 156 109 95 80 99 121 101 138 99 324 179 177 234 198 48 118 138 313 134 73 40 44
209 44 86 11 165 151 63 127 67 104 168 194 162 307 334 187 32 110 78 106 72 186 117 46 105 62 107 216 217 47 99 121 225 123
-167A23j03J3
$$ plain form
-167 123 20 33
-190C3
##PAGE=	F1=4820
##FIRST=	25169.313707327481097,	5807.6787752999953227,	0.077645212411880493164
##DATA TABLE=	(F2++(Y..Y)), PROFILE
5808A06N1K6p9O1o3l5Pk0P8O9p3J33j21Q8J8j21k4k3Q8J4j21lm1RK19J47k91L7n7J33J29j23
5432B18Kj78JJ16O4K0q0m3ml4P7k7r9J58ll9m6O2l0L8kj00lK1mJ11j31J09K3q2o0J12p0J33
5033B30m5j1o9J19r0j8O0j26QLJ32J6r1J50k15J30j80J06k7k5K9J07o9J4L4k7nmJ14M1j35
4669A56j43O7j4j4J00k0pop3J42n8j9K02J25k73J09j26m0M3n1J35j22l6J1Q2j5L1M3p4p2j9
4305F4J32L0j08J00j59J63j6o9qM0m6J08j8r0N6j11J43j61J38l7P0p3pr8qR4j2j02MJ24r6
3941D7J36j18n7J67O4j54k6P4n9mJ51OK4j99J75j57j0k1J01P1j3n4M0nNm3Mj16J38q9j9n5
3566DO8J9L1o7NQ8P5J36k65J19J0j03m8k1j1K8P8N5%k7km5j5k4J9l5J4j7L9J32J21k35L6P8
3167B40j0j70RR6j36J87p4k1L0L6q4K04n2j6l7O4o7j33J75j59J58j57N0k9K3j1l6J8k9K15
$$ plain form
5808 106 157 183 104 165 102 67 74 54 132 201 128 261 140 228 246 125 101 78 166 180 59 56 15 24 243 390 99 136 79 212 341 218
5432 218 220 42 43 159 223 243 163 120 116 82 159 132 33 191 188 149 103 165 135 173 171 71 68 89 85 196 65 174 197 115 55 167 97 230
5033 230 185 174 105 224 134 116 176 50 58 61 193 209 118 268 53 183 3 109 82 57 86 193 124 138 172 145 140 136 250 291 156
4669 156 13 80 66 52 152 132 125 119 46 188 130 111 313 438 165 274 148 108 151 100 235 113 77 88 170 155 186 229 155 83 64
4305 64 196 226 118 218 59 222 206 137 129 169 123 231 213 123 179 68 211 50 188 151 221 148 141 43 35 129 117 15 19 143 47
3941 47 183 65 8 175 239 85 59 133 74 70 221 227 251 52 227 70 60 39 140 211 198 144 184 179 184 141 145 29 167 78 59 4
3566 4 72 91 122 55 60 148 223 359 94 213 223 120 72 51 40 68 146 201 201 174 172 127 112 88 107 72 86 69 108 240 361 126 162 240
3167 240 230 60 69 165 29 216 142 121 151 187 103 307 255 239 202 266 199 66 241 82 240 83 133 104 127 116 80 98 69 284
2815B84j2j87m5R8J60j27j09R7N6j4r5K3L12K15k51k04l3q4R6K6j13L1K5k3K0L3pJ05j68J34
2462B43j33O7m4j5P0j26J53j21J75k30QJ95P5q7q3r3l9O8O3l9n0Q9k7ko5j2O2Q3N0p0j18L3
2087H0JnNQ8K9m4J5k8J2k1J19r9J9J80q7j25P1K7k23J08m9J02n8r6J21J2p2Q2j2p7Q7p2jK37
1688C26r5rmj03m5K1n9J08j26O1J27r5nP6qj1q8M4N4K3j6q1oJ40k9j62L4NK0K3J68r8j00p
1289H3N9k1j15J50j3J25j84N4o1N8%pm2J18QqQ5q5j51k4J66J10j90l2N6l9p1k2J03M8r7N3
913A14M4P1J6j01j29J26O5q1pqM9n9M9p5O3qJ00j0j88J23k5N3%oJ3j04K1n5J74J6q7J26k31
526D9j5L26n5j56m8P5o3o0rO4N2j09R1m8J79p7q4J06n9q2oO4J84j85m2m8J4K4n3J26j7n7J7
138I8KK2O4L9q5J28M5j68j15N0k9L8j0P9n1m0j9jM4J61lj80M2oJ24p5j35L5
$$ plain form
2815 284 272 85 40 138 298 171 62 159 215 201 106 129 441 656 405 201 168 84 180 206 93 124 149 126 146 179 172 277 109 243
2462 243 110 177 133 118 188 62 215 94 269 39 47 242 317 230 147 54 15 83 146 107 57 146 119 117 52 40 102 185 235 165 47 80
2087 80 81 76 81 169 198 154 169 141 153 132 251 152 171 351 264 139 210 237 14 122 73 175 117 21 142 154 82 164 152 75 162 90 89 326
1688 326 231 222 218 115 70 91 32 140 14 75 202 107 102 178 170 159 71 115 169 192 176 95 89 229 200 38 72 77 97 120 288 190 90 83
1289 83 142 121 6 156 143 268 84 138 77 135 135 128 86 204 212 204 289 204 53 29 195 305 115 83 139 100 29 7 110 158 61 114
913 114 158 229 245 144 15 141 206 125 118 110 159 100 149 74 137 129 229 219 31 154 129 182 182 176 189 85 106 51 225 241 154 280 49
526 49 34 360 305 149 101 176 113 53 44 108 160 51 142 94 273 196 112 218 159 77 71 135 319 134 92 44 58 82 29 155 138 81 98
138 98 100 122 186 225 140 268 313 145 30 80 51 89 79 158 107 67 48 47 91 252 249 69 111 105 229 154 19 54
-190E4
##PAGE=	F1=4717.74
##FIRST=	25169.313707327481097,	5807.6787752999953227,	0.22456248104572296143
##DATA TABLE=	(F2++(Y..Y)), PROFILE
5808G7P0Pp4N7l9l3J7l7R1R8j30J47q5L7Q3j11p1o4J11M1j24k0k5QK03J62k95M4n2J48R3j16
5432B18J7j63l2R2J13J8p8jk8k4Nk1j08J80K7o1p7L5j2R3L4j16p4J18l6P3j82J23P5q4r1J69
5056B02m7k2Q2%r0J43j13p6P5j39P4n6J88M8j20Q4j45J06j33N4Nm1L6J26j12oP8n4m2Q1K1
4693B07O3j04j64N5k3J1J05j4n3K0m3R6m9RK05Q3k65J48j34p7N0NQ7j22l0j6O6JL3N9n7l1
4317A21o2N8O8p2J11j98J94pp0J7Nn0R9l4q5K5l4J23j48J34M7rj16Jj04N2O1J5j00L6L5m4
3941F9Q7j16jJ30M6j81N2M0r7M6J21M2M2k38J87j12m6k1N6J24jm7jK8Oj08J6o4P4m0Pn3k5
3554B2O3J6m0lQ6L2J71k32J13Jj12n2l2L5j8J25L6k8j3mn0km2M4n4K0l9O6J38R5k19M5O1n0
3155A79j50M9R2j17J79j09k9Q2J8n0J89j19M4j1O1j12j22J62j30J07n8J8k1q3J9Pk7K0J62
$$ plain form
5808 77 147 154 80 137 98 65 82 45 136 234 104 251 166 203 286 175 104 40 151 192 68 48 23 31 234 396 101 145 93 241 334 218
5432 218 235 72 40 132 245 263 185 184 156 132 137 116 8 188 215 154 77 112 100 193 227 111 37 155 119 192 10 133 208 124 33 202
5056 202 155 133 215 215 125 268 155 79 154 15 89 33 221 269 149 233 88 194 61 115 120 79 115 241 129 123 201 147 105 186 207
4693 207 270 166 2 57 34 45 150 136 83 103 60 156 107 116 321 404 139 287 153 76 126 131 218 96 66 50 116 117 150 209 152 121
4317 121 59 117 185 113 224 26 220 213 143 160 165 115 214 180 95 120 86 209 61 195 242 233 117 118 14 66 127 142 42 78 113 69
3941 69 156 40 39 169 215 34 86 126 29 75 196 238 280 42 229 117 71 50 106 230 229 182 181 209 215 107 123 59 133 93 100 47 22
3554 22 85 101 61 58 144 176 347 115 228 229 117 65 33 68 50 175 211 183 170 166 116 114 72 116 62 82 43 109 247 342 123 168 229 179
3155 179 29 78 170 53 232 123 94 176 194 144 333 214 258 247 308 196 74 236 106 213 155 173 152 69 88 95 68 88 250
2815B50K5j44j26J22J54r1j28P8P7k9j06L6K95J47k39j23k7r5R3M1j18N9J6k2NJ5OO8j75K07
2462B71j64P1k6%lq9J20j25K38j41o5J41N5p0o9o4l0O9M2p6n9J40%r7m0K8O7M2N5k3j66M3
2087G5K5M9n4R0K4n0J5l0K1n3J22p6j9K28p0o5K6l6j96O0J7L2n2m9J01K8m5O7l1j33J06q4
1711D3K5K42r2m9J7j9j19M6l3Q3j05M7R9q6LK7L5j4n4M5L4J5Kq2j2J33m1j23L2oNmJ39r0l3
1300A10p3R0j1o6J68q9J52k27O1o3J09l5k1J4J20kk3P3p2j71j3J54R3k31L4L5n1m6QO2M9o2
925G6L3O5O2J4q6j22J61M6j23r5J08N8j23K8J7K5j2R4Rk01J04PL3K6l1j8j22J3K2J19L1l4
549A84J10k04rK26m5j10l0N5o6o3m7J20P4j29Q2o0J08J6j50J37q5kp1J01J51j79pl2j0Oj4
185E7P4k0k7j6M4J9N7L5r5R7N9j68k7j1m4N2JN1m0pm5O0OJ57kj94M4l7J35m3j46N1
$$ plain form
2815 250 275 131 5 127 281 190 62 140 217 188 82 118 413 560 321 198 171 76 169 210 92 151 167 145 150 165 171 239 64 271
2462 271 107 178 152 152 149 60 180 55 293 152 87 228 283 213 144 80 50 119 161 85 26 166 166 69 29 57 124 166 221 198 32 75
2087 75 100 149 95 185 209 159 174 144 165 112 234 158 139 367 297 232 258 222 26 86 103 135 83 34 135 163 118 185 154 21 127 43
1711 43 68 310 218 169 186 167 48 94 61 144 39 86 185 99 102 129 164 150 96 141 175 190 192 110 98 231 190 67 99 93 98 94 233 143 110
1300 110 37 127 116 50 218 129 281 54 115 52 161 126 105 119 239 237 214 287 215 44 31 185 278 47 81 116 65 19 27 89 138 76
925 76 109 174 236 250 164 42 203 249 126 31 139 197 74 102 119 144 132 226 235 34 138 145 178 204 173 155 33 46 68 187 218 184
549 184 294 90 81 307 262 152 122 177 111 48 1 121 195 66 148 88 196 212 62 199 114 112 41 142 293 114 107 75 65 71 57
185 57 131 111 84 68 112 131 188 223 128 225 284 116 89 78 34 86 87 138 98 91 46 106 112 269 267 73 117 80 215 172 26 77
-190G7
##PAGE=	F1=4615.49
##FIRST=	25169.313707327481097,	5807.6787752999953227,	0.34337759017944335938
##DATA TABLE=	(F2++(Y..Y)), PROFILE
5808D5Q5k0n6L4j1j8K4l3Q1J29j82J52n9oJ44r6j06q9J15M9j06j8k7M7J41J49k72N9m0J33
5456B48N2r0K6j35n5R0J22j2n3K6k8j0q4J0p9J42M3o6o9mk1J49O3j16j36J77m9L8j22K2J33
5092B12q1j09K06qj94J87K8j12J62j13j29Q0r9J05j19K13Q7j11l1p4J39j23pJ5l8M9J27j24
4763A38m1J28n5j05J53k9N1q5j27j3J5L0Q2j5q1N4k0L9l4M0J93M0k43J72j38r1O8K0K2r4k6
4399D8j1J9J9L1O1l7K4n2q0J09j9R7k04K04Nq3N1l7m8Q6m5p4J7K0R3j42J46J02q3j19%m9Q1
4012A30qL3r1O4n2oK9r5O9Q4L6j57Q0J7p3RQ6P9O5k30J70p1q1lj2J65mk6m2O3Rj76M1klLK3
3578A23m5n6P1kj7K3M5j5J89j66O8j1j10m8k2O9n3J61J1n9pNm2Pm5N8p8J3l0N3J09R4j78L
3178A18L6j7r0L6P4p6J49j39j3R9Ll8N4m6N4O2M2j57p6J23o4N7mLjr2n2N0m6M2J09N6r5j25
$$ plain form
5808 45 130 110 54 88 77 59 83 50 131 260 78 230 171 165 309 213 107 18 133 182 76 58 31 78 219 368 96 155 115 248
5456 248 300 210 236 101 46 136 258 246 193 219 191 181 97 107 28 170 213 147 78 74 53 202 265 149 13 190 141 179 57 79 212
5092 212 131 22 228 220 26 213 241 129 291 178 49 129 30 135 16 229 316 205 174 100 239 116 109 124 86 135 262 138
4763 138 97 225 170 65 218 189 240 155 28 15 30 60 142 127 46 100 80 119 85 125 318 358 115 287 149 58 126 146 168 74 48
4399 48 37 56 75 106 167 130 154 102 22 131 112 209 5 209 214 131 182 145 97 183 138 64 81 101 194 52 198 300 217 98 98 49 130
4012 130 122 155 64 128 76 70 99 4 73 157 193 36 116 133 60 69 155 234 299 69 239 168 87 84 72 237 233 207 165 228 237 61 102 100 97 100 123
3578 123 78 22 93 91 74 97 142 127 316 150 218 207 97 49 27 96 43 204 215 156 149 154 112 119 74 132 54 67 37 90 199 293 115 118
3178 118 154 137 47 83 157 81 230 91 78 177 180 142 196 150 204 266 308 151 75 198 134 191 187 190 189 97 45 95 49 91 200 256 161 36
2779C6Q3J31n5j27O5Q3m1j10M5K60R4k33l2l3j01Q5M5j11P0K6l2PJ3jJ4j23K13j82P3PJ2o6
2404A15m5N4r7K65n8j00P0L5m5o4j3j8N5K5j21m6J70J4j74O3mN8KO8j0j55K3O0Q1j12J19l
2028B12p6M8l2Nn0J16o1k7K19l9j2k4q7j39L8O7l6n7l3Q8J3JR1o7j32Q6q3LK38q8p8M2M7j28
1629F5K9oO5p3J4P4o2Pk6P3k6k6O6J2rK6r1j1J31n7q5M0k4ql1R8o5L7p1J01n2j4J57j44J59
1218B73k26P1r1J33n0k5O6J12rm6M5l5j58k3J46M9j97L7Mk1n1L0L6N2j8L0L5O2%o3r4J89J2
831B75j55o1J23M6j79K0J16m0k0Q7Pj39J5O0K0M6n0l8r2mM9M4L8K0O9j43J3R9l3k3k2Rn2j5
432I0m4R5P6q9L1p0J7J16j36Q8j07P2q8J07Q3j38J6j0m3J3MJ0k4J7l3M4L1M7J4o6O2O5j44
45A06M5k8o7M0KL7k9lqO3rJ22Jk06O3o5J22j2j41O7
$$ plain form
2779 36 119 250 195 68 133 216 175 65 110 370 464 231 199 166 65 150 195 84 154 180 148 155 168 167 181 58 271 89 162 169 181 115
2404 115 70 124 27 292 234 134 204 239 194 130 117 99 154 179 58 12 182 196 22 85 81 139 141 209 199 44 67 127 208 96 215 212
2028 212 136 184 152 157 107 223 162 135 354 315 303 279 192 53 91 158 122 65 32 120 133 134 225 158 26 112 29 32 270 182 104 146 193 65
1629 65 94 88 153 80 94 168 106 113 87 160 134 108 174 186 177 203 112 101 232 175 90 130 106 98 67 165 100 137 66 167 115 101 258 114 273
1218 273 47 118 27 160 110 85 151 263 254 208 253 218 60 37 183 232 35 72 76 55 4 34 70 122 104 134 169 231 231 168 74 263 275
831 275 120 59 182 228 49 69 185 145 125 212 219 80 95 155 175 221 171 133 41 37 86 130 168 188 257 114 127 226 193 170 148 157 105 90
432 90 46 141 217 128 159 89 106 222 86 174 67 139 51 158 241 103 119 109 66 79 83 93 69 86 53 97 128 175 189 123 185 250 106
45 106 151 123 56 96 98 135 106 103 95 158 149 271 272 66 129 64 186 174 33 100
-190A00
##PAGE=	F1=4513.23
##FIRST=	25169.313707327481097,	5807.6787752999953227,	0.35039722919464111328
##DATA TABLE=	(F2++(Y..Y)), PROFILE
5808A9Q9n5J7k8J0KK8k3O1J56k22J45m4k9J85q7j20n4O4L6p0mm4Q8Q9J01k29Q3j8R8Lm7J9
5420B19r1l7R8O6n7rL6lJj76O9n6Q4M1n4n9Jo8J89Q2j03j46J55m6K3m0p7J58o7j05K15J7j86
5033G4J15N6j10J56q9j73P7l5R9j36J86J27q7j53j4J97j32o3KkM9J12j05r2J80m0j67J89l7
4693A84K1p7o3k4K9L4L2k5q5Q1%l0RN8J61Ok08J71j39o9Q3j8l9m4k2M5Om3L0N9k5P3j0o0k3
4282G8L9N9j67J77J5r9R5p4n6Q5o2n0M7J6N9j27J59J24j43p6k1oQ0l9N3q7Q2j09nk4J9O5L9
3894A46L5j08N9K5l1p3N1J15Q0k16J69m3j16K4o9J82k1Kp0R2Nj82K3N7p2M0K1m1m8P5Kl4O2
3507A41Nm6J79r7Kk3q5m7LQ6n4J59j0q6j6K6k1Rj8M2r3j7QL7M2R7p4k7n2O8o4jN7l2J24j68
3085E4K6P8lQ3p6o6Q4J46n1j97J5N6j6J5L5jK4l6j30M1m1M4O5P3n0j06N0J04k8j08N5P1m3
$$ plain form
5808 19 108 53 70 42 52 54 82 59 120 276 54 199 155 126 311 224 104 50 114 150 80 76 32 120 209 310 81 164 146 244 247 200 219
5420 219 128 91 189 255 198 189 225 222 223 47 116 60 144 185 131 72 73 5 194 276 173 27 182 136 159 119 42 200 133 28 243 260 74
5033 74 189 245 135 291 202 29 106 71 170 34 220 347 260 107 93 290 158 95 97 95 144 256 151 59 239 199 32 221 184
4693 184 205 128 65 41 70 104 136 111 26 107 107 77 86 144 305 311 103 274 135 66 149 131 92 48 26 71 77 34 64 123 98 171 161 101 78
4282 78 117 176 9 186 201 102 197 123 67 152 90 40 87 103 162 35 194 318 175 99 78 72 152 113 166 79 161 52 47 23 42 107 146
3894 146 181 73 132 157 126 53 104 219 299 83 252 209 93 117 48 230 209 211 141 233 238 56 79 136 64 104 125 84 36 111 113 79 141
3507 141 146 100 279 182 184 161 76 29 32 118 64 223 213 127 111 137 116 125 107 149 56 39 47 84 126 223 149 122 70 138 74 73 130 98 222 54
3085 54 80 158 155 238 162 96 180 326 275 78 93 149 133 148 183 182 206 170 40 81 40 84 149 222 172 66 116 220 192 84 139 210 167
2697A67j07M9K03Q1k25L2m0j03P9L8j11Q1L9m9J6L6j6n7l3J64j82P2M5K0r2j5%o0K25J3j01
2333A69LK0j5p8M4rM3J3j56j3J50L1j80J16l1L6k6Q8l1j21PR4Q8j60J76n2j14J04k8l4j2R8
1958B20o6JJ65lK2o9j23o2P4O8p9q4m4R2l9P7J28j10j06M3o2nJ77q1r3O4P7j02RJ4O1m0k5
1570I9N9j6j3p5J03l2k4J10on4N4j04lJ30p8n2O1l9k5n0O3l4Q9m6J03r8J4J39j79J51j83P6
1195A40j19J07l6nR8Q5j5m8j8K1j38l3J38qo2l6m0M5n0NK1N4K0M1j5O5k9l1n7K08l1j70J6
807A23Q9L0k11N9J59j01l9Q2j5n2q5J22J8N3o1l4k4m8L5k7L6M9J8n8M9l7j4Q0k3m8k9L7m0
420I3O8O0m3jp6p5J99j00J3j08J18o6R3jm8kJ3p3M9rn7j6O6l2JM7M4k4qK8N6r9R2k6q5K2j
-14A12K8j1l3L4N7j0Q2J4k04R1p9O5J1j25Q5
$$ plain form
2697 167 60 109 312 393 168 200 160 57 136 174 63 144 183 134 150 186 170 113 80 244 62 134 179 199 107 92 92 32 257 270 169
2333 169 172 192 177 99 143 134 177 190 34 21 171 202 22 138 107 143 117 205 174 53 60 154 242 82 258 206 92 196 168 134 122 220
1958 220 154 155 320 317 339 270 147 85 159 227 148 64 20 112 73 150 278 168 62 105 43 38 215 134 41 105 182 80 89 103 164 124 99
1570 99 158 142 129 54 157 125 101 211 205 151 205 101 98 228 150 98 159 120 95 45 108 74 163 117 220 122 136 275 96 247 64 140
1195 140 21 128 92 87 185 270 255 207 189 210 72 39 177 169 107 71 31 76 26 31 52 106 126 167 152 217 188 157 100 308 277 107 123
807 123 212 242 31 90 249 148 109 191 176 124 39 161 179 232 171 137 113 65 100 73 109 158 176 118 167 130 116 196 173 125 96 133 93
420 93 161 221 178 177 101 26 225 125 138 30 148 82 175 174 126 124 137 64 113 104 47 31 97 65 66 113 157 133 125 153 209 110 202 176 91 113 112
-14 112 140 129 96 130 187 177 259 273 69 160 81 146 157 32 117
-190A17
##PAGE=	F1=4410.97
##FIRST=	25169.313707327481097,	5807.6787752999953227,	0.2386929243803024292
##DATA TABLE=	(F2++(Y..Y)), PROFILE
5808A7O4p1J05o7nRK6j2M2J68k40J30l5l0J97r6j08j2J5Qk9J5o7J25N8K2j74J17J5O2o1Nj0
5420A83l5J1J02k5j03M5L4M0Lk39J20m7K6K2k2o0L7n9J36Q6p7j34Q8k3K8K6j03J12m3p2J97
5056B54K4j27PO5o9J15n0j96O5J9P4j38J60J57o6k19KK44j42r2j9N6K6Q1o7j51K29k1j93J68
4704A96k3op3NL%N0j9m2l8O2K2j07Q9N1J15j7j60J48j43j8Q3r1p6RkQ5M0j31K3P4m5J01M9
4305B14j3j55P8Nj07J31J7r3J32q7p7J05q6l1Q2k7K8p2J39J13j85ln3J7N4l0Q4q6R1j05o1
3941A9L9L6L8J0L7q4L2O5nj40MJ47P8j95J78k3j51N1r7J75n1L0p4J11j2j17m8J07j04N1Mm3
3566F8l3R3K9q2R7j9m8J41m7o6l3j4p2J4J05l8J32k3r9m4O1KMK2Mq5m3K5O1k2O1O1kj12O9
3155A67o7n3N3PJ11j95P6L0RK73j1l21K34J14j93k06J05kk4qO4oM3K6j29l9k2L3M0P4k1p1
$$ plain form
5808 17 81 10 115 48 43 52 78 66 108 276 36 166 131 101 298 202 94 82 97 105 76 91 24 149 207 229 55 172 187 249 188 193 183
5420 183 148 159 261 236 133 178 212 252 255 16 136 89 115 137 115 55 92 33 169 255 178 44 132 109 137 163 60 172 129 57 254
5056 254 278 151 158 223 154 269 219 23 88 107 181 43 203 360 294 75 77 321 179 87 68 124 150 231 164 13 242 221 28 196
4704 196 173 167 94 99 102 102 152 133 91 53 115 137 30 119 170 285 268 108 256 113 95 178 87 11 20 18 103 143 12 35 109 64 165 214
4305 214 201 46 124 129 22 153 170 77 209 122 45 150 64 33 115 88 116 44 183 296 111 108 55 72 126 96 180 94 185 80 19
3941 19 58 94 132 142 179 95 127 192 187 47 51 198 276 81 259 236 85 136 39 214 163 193 119 230 218 101 53 160 56 107 111 68
3566 68 35 128 157 75 172 153 105 246 199 133 100 86 14 28 133 95 227 204 105 61 122 124 128 150 154 69 26 51 112 90 151 212 210 98 167
3155 167 100 47 100 107 218 23 99 129 138 411 400 79 313 427 234 28 133 131 107 99 163 157 200 226 97 58 36 69 109 183 162 91
2779I1K7Q6j6p8L3N2l8q6M4J33J26j92J5m0j04Q9J6j04Q4L9p3L0O5j4j35M2J05j60O3Q2K5
2416B07r3%J8r1J55O1p4n0J2J9j11J00qL1J5j44NP7N6j37J23m2Ol5J10p1q8J7J05P2j84K39
2040C00j08j40J53j7q3M9P2r4N5Q5L1L1r9j44K5J27N4j10j26m1R9j15J79J53j45r6Kj3%P5
1688A59n8m8K0O3o1MK1P0qo2O1L3m8j18J25k6n1J64j3j11Q0j15J1J23r7k6R2m5m8n8O2k8J11
1300A78k8J03j17J3J22j99J39j35Q5j03J2J4L4J06L2k4j6j11R0j23m1J25o2P4q5p4R8m9j1
960D7mM3M9M9n3O4o0Nk7K15p4j57O6N7J8j83P3J70j39o9P7n1M3r5R5K1N3o2oJ7j04L0k9OJ1
549I6l0L6R3j60M4J44l7r6j1Q1k6M0K9knp8m8J50q2m2o5J04k4P4p8N3l8L3r1Q5l3q8RP2k5
138H4k5L5M7o9O9oK6m6J13j4q8OlQJ4q0O7N3pN3M3j90J11q4rJ7j01J02
$$ plain form
2779 91 118 204 188 110 143 195 157 71 115 248 374 182 197 157 53 142 158 54 138 177 104 134 199 185 50 92 197 37 100 182 207
2416 207 114 114 132 41 196 257 183 133 145 164 53 153 145 176 191 47 52 129 185 48 171 129 135 100 210 139 51 68 173 245 61 300
2040 300 192 52 205 188 105 154 226 132 187 272 303 334 235 91 116 243 297 187 61 20 119 4 183 336 191 95 97 84 84 159
1688 159 101 53 73 136 75 79 100 170 162 100 161 194 146 28 153 127 76 240 227 116 196 81 92 215 118 92 184 139 91 33 95 67 178
1300 178 150 253 136 149 271 72 211 76 161 58 70 84 118 224 256 232 216 105 195 72 31 156 94 168 83 9 107 58 47
960 47 43 86 135 184 131 195 135 140 113 328 254 97 163 220 238 55 128 298 159 90 167 116 159 64 159 180 233 171 165 182 78 108 79 85 96
549 96 66 102 195 35 79 223 186 90 79 160 134 174 203 201 196 118 70 220 138 96 31 135 111 185 107 160 122 155 64 149 116 28 37 109 84
138 84 59 94 141 72 141 135 161 115 228 214 126 132 129 137 151 71 138 191 184 237 280 90 201 117 108 125 24 126
-190A26
##PAGE=	F1=4308.71
##FIRST=	25169.313707327481097,	5807.6787752999953227,	0.081717520952224731445
##DATA TABLE=	(F2++(Y..Y)), PROFILE
5808C2J8K0Q3p7noMkK9J59k27J10k2j9J79j24o9K7k5k7OL0o7J38N0p1j12J48N4L7j35N3n9
5420A30K8O8R5j12j30Q9K4R0qk18J00m5j9lK5p7O9n1P7P6m7j10J6L4J1P5q9M1j8k1J69K0q9
5033B00o3M2mM9nj86M6N2L5j21J41J65m9j91m8K56j40q4NO3KL8k6j26J82lj76J01mk3p1O5
4657A22L6m8P6o0n3K7J3N0j45J49K8O6k8j07J13j47M4O1j71N6o8J5R2P4j58j4J06r1R9J12
4305B49K7k29Q3n3m3P8Pk6J19o8q4J15q1n3J05p9rK2Q8P6k02O9p7J7J2LJ28p2P8p4p2P6J3
3918A43kMM0q0pJ26Oj62l8J43N9j59J84j2j82P5j00J55q5N6n1J14l1n6j05J30q5L2k1m8lR4
3542A34O4j30J13k6l5J01k4j20l5Q1q2j1J14k8R6k6q6o7Q6J5j4O6m9n1l0j4R8o2K1J35J3j44
3167A03O7l4r8L8L1J17k22J25k9K7L45Kl80L09P0k61j46J12j9p7J0N1k0N0P8r4j13KOL3O3
$$ plain form
5808 32 50 70 153 76 71 65 69 67 96 255 28 138 116 97 276 152 83 110 85 58 64 94 27 165 215 144 32 180 234 271 136 189 130
5420 130 158 226 321 209 79 168 192 282 274 56 156 111 92 89 114 37 106 55 132 208 161 51 67 101 112 187 98 139 121 100 269 289 200
5033 200 137 179 175 224 219 33 79 131 166 45 186 351 302 111 63 319 179 95 100 163 165 203 177 51 233 230 54 155 151 128 57 122
4657 122 158 110 186 126 73 100 113 163 18 167 195 261 233 126 239 92 136 197 26 82 14 29 121 195 37 23 129 38 137 249
4305 249 276 47 130 77 34 112 119 93 212 144 60 175 94 41 146 67 58 80 168 244 42 111 34 51 63 66 194 122 200 126 54 130 143
3918 143 141 145 185 105 98 224 230 68 30 173 232 73 257 245 63 138 38 193 108 164 113 227 196 140 35 165 80 112 91 43 40 134
3542 134 198 68 181 155 120 221 197 77 42 123 41 30 144 116 212 186 100 33 119 134 120 186 137 86 56 42 140 78 99 234 247 103
3167 103 170 136 38 76 107 224 2 127 98 125 470 472 92 401 471 210 64 176 157 80 90 141 121 171 249 155 42 44 50 83 146
2803A46j2j8QP9j5n4KL3l1m0K3O6K32j39r3l3r8J15j7p4O0K5j02O4P0Nj87P3N7j02K5J11K9
2416B08r0J7N8j52Q8P8l3q3J0N3j23J26k2J1L7r7J0j2O8q7J17m1k4k1J20r7p4L9R4M3j65K69
2040C25j48j12J40Kj24J10M1j35J18JN8J8r9j66J11J81L9j38j76nR1n4J42J71j58j05k0M2
1711A50l0nj1rk7Pk4K0OQ6K5r0P3O7q3j37J28j5r1K10j1j51Q2j15K6J11j00j1J22l9o9o1Q1
1324A15m2R9j9J02j00j5J11k10J32j01R8o6r7R2O5R6l3m6M7k02J57j11o2J08r7J90j18n5R7
984A35m6ml2QP2L9n9N3o9L8k5K06j06j07P9L1J1j23N3J64j41j01O8q2J20n0J7K2M9m8L3L1
608B36j63L5L0k3q9L4J8J31j57P5J21o7j20rJ14%J2j6L1J9p9mQ5q6o3j5N7K6N1j27J23p1N0
221A59q9R6n4m6j5N8r%j1M1j13J53m4j9PJ05J1p5lrk9M7j24Q0N3oM3Q6j78J21q7n8mp4J11
$$ plain form
2803 146 134 116 124 203 188 134 136 169 138 98 121 187 419 280 187 154 56 171 154 80 140 165 63 127 197 202 15 88 145 43 68 179 208
2416 208 118 135 193 41 129 207 174 91 101 154 31 157 135 146 183 86 96 84 152 65 182 141 117 96 216 119 45 84 178 221 56 325
2040 325 177 65 205 207 83 193 234 99 217 218 276 294 195 29 140 321 360 222 46 41 132 78 220 391 233 128 108 150
1711 150 120 115 104 95 68 75 51 71 77 163 188 98 171 238 155 18 146 131 40 250 239 88 170 55 81 192 92 81 203 164 95 34 115
1324 115 73 172 153 255 155 140 251 41 173 72 170 104 7 99 164 260 227 181 228 26 183 72 10 118 21 211 93 38 135
984 135 89 85 53 61 133 172 113 166 97 135 110 316 210 103 182 213 224 101 154 318 177 76 144 62 182 132 149 171 220 172 205 236
608 236 73 108 138 115 26 60 78 209 52 127 248 181 61 52 166 166 178 162 193 212 133 129 214 128 65 50 107 133 184 57 180 109 159
221 159 70 166 112 66 51 109 100 100 89 130 17 170 126 107 114 219 230 155 152 143 114 161 37 117 170 164 207 293 115 236 149 91 87 13 124
-190A24
##PAGE=	F1=4206.45
##FIRST=	25169.313707327481097,	5807.6787752999953227,	0.038240212947130203247
##DATA TABLE=	(F2++(Y..Y)), PROFILE
5808E3j8Q8M5p5K8k1m4J1J3J32j87R1Pk1J50j68rN6n1m4PL9k9J20N2j31m0J34Q7J9j92Q4j18
5420F8R0J17P5j67j09Q5J6J30k8j87Q2m9m4nM9q4O8n4M4N1k1q2L5P2o8J14n4j6j1K7J44J7
5045C05q3r0j2O3k3L1j37K7O4j5m9R6J45m0j24j11K39j23n3N0L3lrJ9q1R8Oj33K7J8l4p8J07
4657A30P0j09J08q7m1Q2n7Q1j13J44OK3l2n8P6j44R9K1j42Q8j08NQ6R5j70l7J34j22Q1J55
4305B64N2k60P3r1jL2j1P2P5l8q3J11n1q2J19j04p0J07L9K2j27N5p2LLqJ74m7M5m6o0Q6jn2
3906A28K4M5q1o5J89Nj52k5P3L4j06J77j0j98Q8q9J40j07P6j9R9k8m3j08J04l5jl8l5J8O7
3542A27Q9j48J03k6j9P3j9j56J0J23p3j8Q9l4N8j5o1m0O4J8m5J03j11J2j7n6J32r3PJ22qj85
3167FJ20N8j00k0L3J34k20J44p6J0K14m6j16J72O9j72j28J23k1j07K9lk1M4J09l5j53J8k2
$$ plain form
5808 53 35 123 168 93 121 100 56 67 80 212 25 116 123 102 252 84 75 131 80 36 43 82 53 173 225 94 54 188 275 294 102 186 68
5420 68 158 275 350 183 74 159 175 305 277 90 172 123 79 74 123 39 107 53 97 148 127 45 80 152 84 198 144 128 117 144 288 305
5045 305 222 132 120 183 160 191 54 81 145 130 81 177 322 282 158 47 286 163 110 160 193 190 181 200 119 217 223 90 117 135 101 23 130
4657 130 200 91 199 112 71 153 96 177 64 208 214 237 205 147 223 79 178 199 57 145 37 42 128 223 53 16 150 28 109 264
4305 264 316 56 129 38 37 69 58 130 205 167 84 195 144 62 181 77 7 114 153 175 48 103 31 34 37 29 203 156 201 155 95 181 180 128
3906 128 152 197 116 51 240 245 93 68 141 175 69 246 236 38 126 37 177 70 146 127 226 198 155 47 151 116 115 77 42 60 127
3542 127 216 68 171 145 126 199 180 24 34 157 84 66 155 121 179 164 103 63 127 145 100 203 92 104 87 31 163 70 77 199 191 6
3167 6 126 184 84 64 97 231 11 155 79 89 303 257 141 313 382 210 82 205 184 77 106 103 82 126 235 200 47 65 43
2826D3L1M3k3N2j7Q3k4m0k7J3k7K0oJ6L68q8k42l1p8J37m7m4L1J4j31J20L1L2j69L8L3m0k1
2439E0J21L7r8M4Q3j89L8O3jr2J4Q1n8P7m3l1Q3n1J3l8J2l6R4l0m5RJ09r8p2M8P3J4j06K48
2040C23j60o5R4K4j42J49J4j61J53o6P6rn6j47J29K20K9j57k23L6P5KJ03J90j37j33kO4r1
1700A32m3K5jl2j5m9N1l1J10N4j02P9Q0j08j13R8qj19K25nj43M1q8K8R4p3j3J39k5p4o9Q9
1324A34n2O4k0J04n1o2J06k14J33q9J12j9p6N4Q1Q0q9q8J19j70J23q7o7N5kJ54j41l8J03m3
972A14J1o0k7Q4Rl2K6k0M8n9J83j21m0P4K1Ko5J7J41j09j17M5o9J30jn3J8M1j4O5K6k13M5
584A00Q8m2n7Q0j05J43q9P9P2j13j16k5J44L1j6o8N3O2q1K5N3r3o3JJ2P0K3j19J33j00P0p3
209G9P5o3Qn8M9K5K8l7J9p8J56q9o1N5O7N4n8pj4q0Q5j27M7N6rN3J29j76J21q1o5m8m4J03
$$ plain form
2826 43 74 117 94 146 129 212 188 148 121 134 107 127 121 137 505 417 175 144 66 203 156 112 143 157 26 146 177 209 40 78 111 71 50
2439 50 171 208 110 154 237 48 86 149 148 56 70 151 93 170 127 96 179 128 141 103 115 79 173 143 98 107 216 118 46 94 167 181 75 323
2040 323 163 98 192 216 74 223 237 76 229 163 239 230 174 27 156 376 405 248 25 61 136 138 241 431 294 161 159 223 132
1700 132 89 114 113 81 66 17 68 37 147 201 99 178 258 150 37 135 127 8 233 228 85 126 38 66 160 87 74 213 188 114 45 134
1324 134 82 146 126 230 179 117 223 9 142 53 165 146 70 124 205 285 196 108 227 57 180 93 26 81 79 233 92 54 157 114
972 114 125 65 38 122 131 99 125 105 153 94 277 156 116 190 211 213 148 165 306 197 80 125 56 186 185 132 150 191 177 242 268 55 100
584 100 188 146 89 169 64 207 118 197 269 156 40 15 159 190 174 106 159 221 140 165 218 125 62 63 75 145 168 49 182 82 152 79
209 79 154 91 99 41 90 115 143 106 125 47 203 114 53 108 175 229 171 164 150 70 155 28 75 131 122 175 304 128 249 168 103 55 11 114
-190A14
##PAGE=	F1=4104.2
##FIRST=	25169.313707327481097,	5807.6787752999953227,	0.0821477547287940979
##DATA TABLE=	(F2++(Y..Y)), PROFILE
5808G9j6R8mn9Q3l4r8K3j0R2j31P4N1m0J16k04N4P2o6k8k3K7K3R7M9j08k5J03J04%k12R0j58
5420A9J34J38M7j79o3M8K0J43m2j58P3n3n2K4L0o2L5p4N4K0k0n3J21P3j72J62j4n2k5N4J19
5056B95K3r3r3p1J12r0N2n2RN8n4N0L1J00l6n1j72K13q6k6Q7JRm2O3m6J2kp3k5M9m7q3J05
4657A27R4j69J39j01nJ22j43J11p7J33pql3k2L7j16J29k8p1O4j22KP7R3j73m9J53j21P1J51
4305B58N9k58O4q4j0J8JJ12K7j2p6Q9Jr9J20q8m9O6jl4lj5m8M0L7o7J55j9ok2l7Q6pj02O2
3894A58N2p8j27K27oj23nKJ4m0J50j3j88Q3o2J25q3O4oQ0Jq2p1N0K7l7l5oJ2K7R6j37P9k9
3495A19kN5j8j36M3J11m4j5N0m0QRm2qM7K2p3J14j73R8j9n6J51m8q0J32n8K2j22J86q8n9j5
3108G1J60k08J52q8j8J3J43l1j23J15M0j37J18k6n9L2j16J5K3J13L9j66L3l6K5K0m4J15m7
$$ plain form
5808 79 63 161 157 98 181 147 49 72 62 154 23 97 148 108 224 20 74 146 80 52 29 56 79 176 225 117 92 195 299 299 87 177 19
5420 19 153 291 338 159 96 144 164 307 265 107 180 127 75 99 129 67 102 28 82 102 82 29 150 223 51 213 199 147 122 176 295
5056 295 318 225 132 61 173 83 135 83 92 150 96 146 177 277 241 190 18 231 145 119 206 207 216 174 237 191 203 201 128 103 152 105 22 127
4657 127 221 52 191 90 85 207 64 175 98 231 224 216 183 161 198 82 211 183 112 176 54 56 133 226 53 4 157 36 107 258
4305 258 317 59 123 39 29 47 48 160 187 175 99 188 189 90 210 122 73 139 138 104 101 86 38 78 115 48 203 184 178 156 119 205 198 96 158
3894 158 210 132 5 232 226 103 98 100 114 74 224 211 23 106 44 169 86 150 144 224 225 143 72 122 149 112 77 71 83 110 206 69 148 119
3495 119 117 172 154 18 61 172 128 113 163 123 131 140 98 90 137 159 86 200 27 125 106 50 201 153 73 205 147 169 47 233 145 86 71
3108 71 231 23 175 87 69 82 225 194 71 186 226 89 207 181 122 154 38 53 76 189 228 62 95 59 84 104 60 175 128
2768A28R2l9k9m3j5k8Q0l6j8M81l7l69m3l7J35o7k2QJ8j29J49l6N6j43K1L1j2l6J00M8j13
2404I5P3Q3j82J4M3mp3L2P8%L9n6q6J33k1Opo6qO2j5n3L8Q1q9o5L7N2lm3J93j42l2M8M9j36
1981G5J58pj36J32j11Q6l8J8j07R4K34K6j61k20L1N0N3N5K11q5j63L5N6j67l9K1kj0K9r3N0
1617G5m7J13O2r4O5O7j09p1N8pq8J59Lq4l1j3qP5k7k5J37oo3p7P3n4K3l4J25Lj06J00j58Q5
1218A21r5J24K1n1K4Q6O1j12j56J85j11R2n2o6QO8Q9j58j7J09m3K6q9l9Q2l8J7j3O3M3j10
854F9J49j06J4O6L3j1l2j0Q8n0j11J6l6Q8M6r7PL2L4P9Rk35M3J26n6J6P8j72J17l2J02K0j68
467A16r7QJ35M3m4j15O6J11q6L8N9p9q3oj1R5j1o7R7j26Q7l8K4m0L7j00N1O7L8m2oj8J25j37
68I1n8O4NJ17n1j3rj31J25p7j1L0lP6J51j81J09o4m6p9k9Q2
$$ plain form
2768 128 220 181 152 109 94 66 146 110 92 573 536 167 124 87 222 155 133 141 159 30 179 143 199 56 77 108 96 60 160 208 95
2404 95 168 251 69 83 126 122 49 81 159 159 198 142 56 189 168 174 167 101 93 155 140 87 125 206 117 52 89 141 138 95 288 146 114 162 211 75
1981 75 233 226 90 222 111 197 159 177 70 164 398 424 263 43 74 124 177 232 443 358 195 230 286 119 80 101 99 89 118 25 75
1617 75 28 141 203 109 174 241 132 61 119 112 24 183 186 102 71 58 50 125 98 73 210 204 141 64 137 83 106 72 197 200 94 194 36 121
1218 121 26 150 171 120 144 230 291 179 23 208 97 189 137 71 79 147 236 78 61 170 127 153 64 25 107 69 86 73 136 179 69
854 69 218 112 126 192 225 214 182 172 260 210 99 115 79 167 213 116 123 155 189 268 277 42 85 211 155 171 249 77 194 162 264 284 116
467 116 19 27 162 205 161 46 112 223 137 175 234 155 72 66 55 150 139 72 169 43 130 92 116 76 113 13 64 131 169 127 121 103 228 91
68 91 33 97 102 219 168 155 146 15 140 63 52 82 79 155 306 125 234 170 124 45 16 98
-190I8
##PAGE=	F1=4001.94
##FIRST=	25169.313707327481097,	5807.6787752999953227,	0.081516683101654052734
##DATA TABLE=	(F2++(Y..Y)), PROFILE
5808A05nQ1o1k2J41m8j42L9k4N6r7N3J06n8O2j41L4P4p2rk7nN0Q7L0n3l4P6R9k1j90P3j08
5420D9R7J24J8j55k6PL8J30m2j34P9o1m5N1nqj9p8P2J3o6j6J79P7k64K26J2q0l5M9R2L4r4
5033B19r1q2J09j39L8O4qM3n2J11l0M2l5J8j76J39m0j1J05k0K4m9R8k1n7k9rm7Q8n6q4N7J00
4646B19j61J16j08L6J54k21J22m4J15%l7k9Jj1m9J25p4j3L3j12J4P1O4j79j5J33j07Q2J13
4305B38M4k19N4o6l7O5K4O7j0Oo0M5P5j06J03n4l0J6l0q7R4p0k0J01L6p6Q9Ko4knQ5j2j42
3906E4J09N3p6q8J48k4q9J5n2QJ9J13j3j54N8j9J06m1L8j8O8L4j43j8kQ6p2j5J8lqP8j11N8
3507A17l5J3L9oq4K1R9%j2J3k1n9K6l2K5L5L4o1O6j16Q9l9k2J32lj52K19rO2k94K21o1n9j16
3108C0J91j83J46p5M0L61J89n05J10j38P6j37P4l7N3N2j95pjQ5J07j60N3m6K8ml6J24q0J03
$$ plain form
5808 105 100 181 120 98 239 191 49 88 64 120 23 76 182 124 186 45 79 153 81 72 45 40 90 177 207 154 120 196 295 274 84 157 49
5420 49 146 270 288 133 107 114 152 282 240 106 185 124 79 130 125 117 98 20 92 105 39 23 202 279 15 241 253 173 138 187 279 313 219
5033 219 128 46 155 16 54 118 110 153 101 212 182 224 189 207 31 170 130 119 224 204 228 179 277 256 199 170 161 114 202 146 62 119 219
4646 219 58 174 66 102 256 35 157 113 228 228 191 162 163 152 103 228 154 141 174 62 76 147 211 32 17 150 43 125 238
4305 238 282 63 117 51 14 79 103 170 160 166 106 151 226 120 223 169 139 155 125 38 132 62 42 143 179 103 192 194 130 128 123 208 196 54
3906 54 163 216 140 52 200 176 87 102 50 58 77 190 177 23 81 62 168 127 165 147 215 249 106 88 86 172 100 85 103 100 92 170 59 117
3507 117 82 95 134 128 44 65 164 164 152 165 144 85 111 79 104 139 173 112 178 62 151 112 90 222 219 67 286 277 339 45 266 205 146 30
3108 30 221 38 184 109 149 510 699 194 304 166 242 105 179 142 195 247 52 45 44 129 236 76 129 83 111 107 71 195 115 218
2756B18n0k0l9n5j5J05n3m2N03K7m16o3J2J05o7ppL1j19J54r9O7j13L6K6qk4N9O2j35J01O3
2380B37j48jN5l3m1N4N6L3J6n7r9J35pj3L9r6k0K9ln0N1M9q4m7J5L4KoJ24j02j1PP2j18J41
1970B13j6p2P7j32Q3n9R0r0P3K14K5j40j81pK0R5OK24j6j84O8L4k36pk5KK4P0r3L1j7Q8L8
1582B00p2K6L5p9k5J5j0m9O5RJp0N0n8N7J0l2J19J3m0p8M3n4j5m7J70K6j29Q9j00L7j02J27
1195A32L9k9QQ0M6r6j16J06o3J02j7p5j0Q2L5j57oJ14m8L6j18k3P2p4N1k9J19L9j59J09m0
831A10J5O2N4k4k0j3NK1r0jl3M0Q6j03qL4P2P0j3k12J7J32o3R0O3j92P4J0J36k7k24n3N1J23
432A89K1p3j18N7J41r3L8R1n7j27j1j0J07m8oN2j26O8J0m4M1Mn4K2P9J9l7k0M5P6j73J3Lm3
33C6J71o3k3J1q7P6j9Pp6N0P9J30j83Q7m0k0q7l2O0
$$ plain form
2756 218 168 148 109 54 39 144 91 49 552 579 163 100 112 217 150 143 136 167 48 202 103 170 57 93 119 111 87 146 208 73 174 237
2380 237 89 88 143 110 69 123 179 212 228 171 72 207 200 187 226 130 110 139 136 86 137 186 102 55 70 104 106 100 224 122 111 118 190 72 213
1970 213 197 125 202 70 153 94 184 94 167 381 406 266 85 78 98 193 199 423 407 223 291 325 89 82 57 59 83 153 60 91 74 162 200
1582 200 128 154 189 110 85 100 90 41 106 115 116 46 96 38 95 105 73 192 205 165 87 130 76 61 14 184 210 81 170 70 107 5 132
1195 132 171 142 150 230 276 180 64 170 107 209 192 117 107 189 224 67 61 175 127 163 45 22 94 20 71 42 161 200 41 150 110
831 110 125 187 241 217 197 184 189 210 120 119 86 126 212 109 101 135 207 277 264 52 69 201 138 228 291 99 173 183 319 292 68 15 66 189
432 189 210 137 19 76 217 124 162 253 196 69 58 48 155 107 101 153 27 95 105 61 102 106 52 74 153 172 135 115 160 236 63 76 79 36
33 36 207 144 121 132 45 121 102 109 33 83 162 292 109 196 156 136 49 17 77
-190G7
##PAGE=	F1=3899.68
##FIRST=	25169.313707327481097,	5807.6787752999953227,	0.076124258339405059814
##DATA TABLE=	(F2++(Y..Y)), PROFILE
5808A22RN0j15K5J91o3j76P5k1N9j21K4J61o9j8o2J7O3p1Oj2LKR8j2jl4N8P2l9j34L9m8O3
5409A41P4lj07Mm4O7R6k3j15R6p1k8P0m8O6p2l2L4L2j15J9J86P8k80K43J9r8l1J7O0M4p0r1
5021A18m4P4o9l7J15k8K9k0J19p0j0l7P6j31L3Nj2R9k2L4l3J14Jr8p2M6n1J30n7r7NQ3o6L9
4622A66j19O6J80k40P6k5J00K5p0j8Po4N9Q3j12K5J3r2M1O6K1j78L8Q7r2Q8P8J0j45M0o0k2
4247C2Q8K7J9l7J9l4j5J54j03O1j3%l4m6r2J07r2J5J51On8J6Rj12J4K8Q7k0j48J36M3p9m2
3859H7P0n2n7K9o6ON4P5nj21L3L7Q0j0J3m3P3M6j94L3l0J23j04K1L5k3l0M2q3M9j6j1K5K1
3460A07n2j3J02M3j5j4K8r8j7j2N6J5M9j7k6jM4p1K0M1j1j06K44Q3J7l18J90j6l6j76J65j50
3085E5J30o5Q6N23J60p64L65k25l2j26K1m7J66N8k11m6J0J7J48j32P0o1M2k2rQ5j08J11m6
$$ plain form
5808 122 131 181 66 91 282 219 43 118 97 156 35 59 220 151 133 71 88 151 80 86 74 77 79 177 165 164 130 188 260 221 87 126 78 141
5409 141 215 212 105 109 65 132 228 205 90 186 115 87 157 109 175 103 71 105 137 22 41 227 305 25 268 287 189 158 175 235 279 209 118
5021 118 74 148 79 42 157 129 158 138 257 187 177 140 216 85 118 123 111 210 188 222 189 303 304 206 134 180 129 259 202 105 110 193 127 166
4622 166 47 113 293 53 129 104 204 229 159 141 148 84 143 226 114 139 152 60 101 167 188 10 48 135 43 131 209 219 74 114 54 32
4247 32 120 147 166 129 148 114 99 253 150 211 198 198 164 118 26 133 41 56 207 213 155 171 180 68 82 110 197 177 29 165 208 129 87
3859 87 157 105 48 77 11 17 71 146 141 20 53 90 170 160 173 130 203 249 55 88 58 181 77 98 133 110 80 122 39 88 72 61 86 107
3460 107 55 42 144 187 172 158 186 88 71 59 115 130 179 162 136 135 179 108 128 169 158 52 296 379 396 78 268 252 216 40 205 55
3085 55 185 120 206 729 889 125 490 265 233 107 128 81 247 305 94 48 58 75 223 91 161 100 142 120 111 196 88 199 153
2744A53j0k6j01M7O1n4qL32J15l47q2N2N8m2Kj8M0j24J51j28N6p5O4Mj1LK1P3j60J21L3j06
2369I4j6P9m9j8P4M2L8Pn7j02J27Km5R0q3n0Jnm3M9K5q5j9%QK3JN5n4J0l3Q8r4J02j5QL2j45
1923D2O5o1J34q3P2J58K1r2j29n1pJ24l2K09N2j80P9J4k72K2o9OM3R0o7K8kQ4mm5k9pj6J1
1523A08k7j4rk5KP9j6L2r3L8K7l3R0K9ro8Qm3n5M6J30Qj30P9o2Lq5J06K6nKO7M3o3m7j8l4
1089H7J49J1r4k8P1Pj18k4J12n4M1j36LO4j9k3M9P1L8j73N7M9k5N6O7l3j2Kq6Q3o0%o2KJ18
678A90p9j3M9Q1M2l4j67rJ05n9J46L8j78L8L1J75o6k66J7M7J36k0j07m7K4J30r8K9J26m6j65
315E0j1JJ23o5L4Kn5k9O7q2J12o6K3J7O0k8l0k4J08J5j53N6p0M9R1q5m4M3j8J7L4M5j69J08
-85A26O5P4j74N2j4Nq3k9L0
$$ plain form
2744 153 143 117 16 63 124 70 62 394 509 162 80 132 190 148 150 132 172 48 199 71 127 52 116 120 109 112 133 206 46 167 200 94
2369 94 78 157 108 90 164 206 244 251 194 92 219 221 176 266 183 133 134 129 86 135 160 75 56 56 64 87 88 143 89 99 66 154 60 162 147 155 187 42
1923 42 107 46 180 97 169 327 348 256 127 76 69 193 161 370 422 242 321 335 63 85 16 22 65 155 88 116 114 198 194 149 120 113 97 108
1523 108 81 67 58 33 35 114 98 130 37 75 102 69 159 188 179 111 119 76 21 67 197 205 75 154 92 95 10 116 142 137 139 206 249 186 139 121 87
1089 87 236 247 153 125 196 203 85 61 173 119 160 24 27 91 72 49 98 169 207 34 91 140 115 171 238 205 193 195 109 192 132 132 70 72 190
678 190 111 98 147 228 270 236 69 60 165 106 252 290 112 150 181 356 290 24 41 88 224 204 97 50 74 204 106 135 261 215 50
315 50 39 40 163 98 132 134 79 50 117 35 147 81 104 121 181 153 123 99 207 222 69 125 55 104 195 110 66 109 91 108 142 187 18 126
-85 126 191 265 91 143 129 134 51 22 52
-190E2
##PAGE=	F1=3797.42
##FIRST=	25169.313707327481097,	5807.6787752999953227,	0.12128644436597824097
##DATA TABLE=	(F2++(Y..Y)), PROFILE
5808A24K3J6j52N8K32p7j98J32k4R0j72MJ92p3j07%L2M3o1J2QL0q5J24p1M4k3M5L6n0n5l%
5420I4M0Pj2n2M0r6P6N4J6j00J16q0j0R2r4J33j13Pj4N4j20J9J70P4k47K20J7j02j5l0L4M0
5045B18k0r8j3P8k4j0O3n4K2RR6q1l7m0J11q5n3M5k6P0oL3kJ08K5j14j15P7m1J70m7j16m7
4657I6O0M2k3j28P3J92k27J3k6R8O4j12Jlp8J53J3j40M5K8r2P5O5k6j08L3L1p6P1O3l4n1K3
4270A15n8QQ0K1qm0J6rm4J90r3%K4M3p8m6n0L5n3L8J64l9k5m9jj09J8L7R7l3j03J14K3q5Q
3859A08K1q0k5QK6m3L9N1Pr2KJ05M6Mpp4R6L1k14O2j2J17j24O3M7m4m4J0m4M2M1r5K1M2l8
3448E3m3J23O7l0k6Q1q9j05N0N2k1N5L8j29J17J5j13O1k5n6n0J17J89m6k46J93M3lj73Q7j17
3085F9J17p9N7L39M6l97J89j70Rj10ll4J99J0j91lL7l4J43q4P4p9N9l3J4L1j08R3k0lmj00
$$ plain form
5808 124 147 163 11 69 301 224 26 158 134 224 52 56 248 175 68 68 100 143 82 94 102 132 47 171 100 144 121 166 202 152 97 94 94
5420 94 134 141 129 77 117 21 97 151 167 67 183 103 93 185 91 224 111 118 104 158 38 57 227 301 54 274 291 189 174 144 178 218
5045 218 198 100 87 165 141 131 194 140 162 171 267 186 149 109 220 135 82 127 101 171 165 198 196 304 329 215 100 177 136 306 259 143 96
4657 96 156 198 175 47 120 312 85 98 72 170 234 122 123 120 42 195 208 68 113 141 49 124 189 163 55 88 119 43 114 177 143 92 115
4270 115 57 65 145 166 158 118 134 125 81 271 178 178 202 245 167 121 71 106 53 91 255 216 191 142 141 32 50 87 184 151 48 162 185 100 108
3859 108 129 49 24 32 58 15 54 105 112 20 22 127 173 177 170 96 192 223 9 71 59 176 52 115 162 118 74 84 40 82 123 28 49 91 53
3448 53 10 133 200 170 144 225 136 31 81 133 112 167 205 76 193 208 95 156 131 75 25 142 331 285 39 232 275 272 99 186 69
3085 69 186 107 164 503 549 152 341 171 180 70 67 33 232 242 51 48 85 51 194 110 184 105 164 131 145 176 68 161 141 138 134 34
2709C4O3Km4Q7l3K24j72q4O0J1OJ0l4M0j40J37j11K2k4P8k6j8L3MP3j81J30Ko9k1Q9m8LQ4
2310A87M2K4Qn5j24J32J3q0J44n0p9k1k5l9L8J7n3j6Ol9M4rkrM4n7O9o9M5pR6J9j65M0j6J15
1887A68q5Q7P5Rj1q1r0rJ16l5J47J02j48O7Lk41KPk1%O6k1L6mQ5l6k5q6l7N4L9o6j5L2J6j7
1465H3J2N6or6J9K9l0M9M1K5n1j8rq1R6R7l4j10O9m4j6o6R1j1K4jM6O0m3J4j28j9K15K6j19
1054A70m9M8Pn2n9J02n7M1j11J8M5J1q4J34%L7j37MJ02o7L8O1l2RJ6j51J12k7J8j06NJ13m6
667A13lO2P0Rn0j24j9N5l4J59J6j44J6L2K15r6k51M3J9J53n7j37J8K6R6r3J3J41m9j72j3J2
291B6J44m2M0n8K5j14J06n1R8j32J00K3M4q7k8k1J58m5o5M9j42J63rr7p6P2L9j6P8P7k09J18
-85A68N4Pj50J1OK4o7j6j1
$$ plain form
2709 34 97 99 55 142 109 333 161 77 137 148 154 164 130 170 30 167 56 78 54 132 106 88 121 125 198 17 147 149 80 59 148 100 103 187
2310 187 229 253 261 206 82 214 227 147 291 241 162 141 116 77 115 132 79 63 69 30 74 65 63 54 98 41 110 41 86 79 175 194 29 69 53 168
1887 168 83 170 245 254 243 162 72 63 179 144 291 393 245 312 315 74 76 83 62 62 128 107 143 139 224 188 163 77 40 94 133 67 52 84 100 83
1465 83 95 151 145 49 68 97 67 116 157 182 131 113 104 23 119 216 182 72 141 97 81 15 106 95 119 118 164 224 181 195 67 48 263 289 170
1054 170 121 169 176 124 65 167 110 151 40 58 103 114 30 164 164 201 64 68 170 103 141 202 170 179 195 44 156 129 147 41 46 159 113
667 113 110 172 242 251 201 77 58 113 79 238 254 110 126 158 373 277 26 69 88 241 184 47 65 91 187 94 107 248 199 27 14 26
291 26 170 128 168 110 135 21 127 76 174 42 142 165 209 122 94 73 231 186 121 170 28 191 182 85 9 81 120 104 182 259 50 168
-85 168 222 229 79 90 96 120 53 37 26
-190B6
##PAGE=	F1=3695.16
##FIRST=	25169.313707327481097,	5807.6787752999953227,	0.15912979841232299805
##DATA TABLE=	(F2++(Y..Y)), PROFILE
5808A10L7j4p9k4K62q9j71J72m9J20k10jJ92p6j77M7O0K6m7LL2N6j79J58j41J03k1L2Pn5K6
5444A10l3K6K0o0oMP3n9k7J9O6p5J15p9LJ19j27J57j34L2n7O8j11J6J54O1k04J75J6q4Mp6
5068A06M0%M3j15KJ19rJ3K6q5J7K9N3n8l8l9J16n3j01P5m9K8J5L1K5Q5N2j10j44Q1k4K02l0
4681C03j33r4M6J32o3j21O0J82k10k8m6J21R3j49J9l1L9J29o7j56N9P5j25J09O6p0m0L1k5
4340A06m1K2N8p7M2Mm2K3M9J5Jnj5nj8J61p1o7M4Q9j09l2k6m8L2M5J43q6J4r9k1j8mRJ05n3
3918A25o7R4%n5K6J2n3ml2N4p1PN9Lo0j4J49Mjj3r0J15oj41jL5Q2j08R0M7o1n9RKL4P8j52
3484C7L1Ql3K8Q2N8o2k1J11n8j12O2K9p3N0Q5k12K21jj56R7J87P2l95J54k0O0j39P7J04K9
3120C00j53J6q7J17j19K0J27J03k1n7J31k71p1k3L5J21j3l8o6N8o2J08k6O2r6P5l6K9k7l7
$$ plain form
5808 110 147 133 54 30 292 203 32 204 155 275 65 64 256 180 3 50 110 136 89 92 124 180 1 159 18 121 100 132 139 84 110
5444 110 77 103 123 63 57 61 134 75 48 67 133 58 173 94 97 216 89 246 112 144 87 155 44 60 214 275 71 246 262 178 182 106
5068 106 146 146 189 74 76 195 186 199 225 140 157 186 239 181 143 104 220 167 66 141 92 120 135 166 191 276 328 218 74 155 131 333 303
4681 303 170 76 122 254 191 70 130 312 102 74 28 149 242 93 112 81 120 249 182 26 85 160 35 144 210 140 100 131 106
4340 106 65 87 145 68 110 114 72 95 144 159 160 155 140 135 117 278 207 140 184 273 164 132 106 58 90 135 278 192 206 107 86 68 64 73 178 125
3918 125 58 152 152 97 123 135 82 78 46 100 29 36 95 98 38 24 173 177 176 163 73 188 182 41 40 75 157 49 139 186 125 66 75 77 111 189 37
3484 37 68 76 43 71 153 211 149 128 239 181 69 131 160 87 137 222 10 231 230 74 171 358 430 35 189 169 229 90 167 271 300
3120 300 147 163 76 193 74 94 221 324 303 246 377 106 35 12 47 168 155 117 51 109 47 155 129 191 95 170 134 163 136 99
2768I9RK6mL1q0L8l3l6J78Lj26O0p8L7k1O2K0n0K5j40R5o4rL8N6n6k5N2J9N7j54Q8k3m2nP1
2345A18m0K5Q2N3%J9m3j71J48K6j05J92j6r2m1n8l0J5K4K7m4Oo8M1l0Pj2Q3l5ml7l6mJ90K8
1934B18j89N0K1O9j02J00j0j7R9n3j11RO9kM7J22r0M0Pj70n7Q7l5qPJ7N2k2Q0m7k0j16K7J6
1535H8P1r9j5O8O6j5r6J12m4o4kL6k9pM9N6l1l5L4p4Q0P2p7o7M6m0j5l0O1l2N5k2J8R5n6P1
1113B28j77k3K54K4j44o5K0K6K0q8Q3n2L4p1L7J7Qr1J73o2L5q3j8R9r1J1L1j8M6J4j28O2%
725A11M3j17M8N5l3J3O5N9j6o0r6j3LJ4J14Pj06QK4K48j18k00M3l3J63p6r6PM0O8o9mJ23p0
326A49j13j8J8J33OL2j29J01j23P6k2N8j54J41L5M4j39l8j7J85r3M8L1j77K24r1q6j7j4Q2
-26A32k6J11R5k41J24M8m4j22k9J3L9l6on5
$$ plain form
2768 99 108 134 130 161 81 119 86 50 228 231 105 165 87 124 103 165 185 135 160 20 115 51 42 80 136 80 55 107 126 183 29 117 94 52 47 118
2345 118 78 103 185 238 238 257 214 43 191 217 112 304 288 196 155 97 67 82 106 133 89 95 27 68 38 45 33 116 81 77 40 4 0 190 218
1934 218 29 79 100 169 67 167 157 140 239 186 75 84 153 151 198 320 230 270 277 107 50 137 102 94 101 118 170 148 228 181 161 45 72 88
1535 88 159 60 45 113 179 164 68 180 136 72 70 106 77 70 119 175 144 109 143 69 149 221 144 77 123 83 68 38 99 67 122 100 118 213 157 228
1113 228 51 28 282 306 162 97 117 143 163 75 158 106 140 69 106 123 131 40 213 151 186 103 85 184 93 104 135 117 163 177 49 111 111
725 111 154 37 85 140 107 120 185 244 228 168 72 59 62 76 190 197 91 99 123 371 253 53 96 63 226 150 54 61 101 169 100 96 219 149
326 149 36 18 36 169 175 207 78 179 56 132 110 168 14 155 190 234 95 57 40 225 132 180 211 34 258 167 81 64 50 132
-26 132 106 217 312 71 195 243 199 77 48 61 100 64 58 3
-190C
##PAGE=	F1=3592.91
##FIRST=	25169.313707327481097,	5807.6787752999953227,	0.20069327950477600098
##DATA TABLE=	(F2++(Y..Y)), PROFILE
5808H3M7l2%n7K17r6q8J74r8J39k22KJ69q1r1kN0K2l3k2N9P0j59Q8o3P0o1RJ5q0R0m4L6or8
5397G%N6R1j8q4nO1l3P9o1J1J42j36J20j28M0q4P0r5K2J47L7j69J12K4m6J9j04R3o7Q2j39
5021D4J3J69j6K4Rj19J8M1%ll2l7J00m2j10R5o4k0L2M0K9N7P7r4j53O4mK18j4j44j27O4J69
4634B84q7r2M0J51j99l4k4J16R4j59J6o8J61R4j35j24L9J13j62J36O6j10J8L2o6%j3K9r2R6
4282A20j1j8K3JJ9M5M1n7k2J5J19m2j18L7J28j26qj5j26J21M6R6j12M0j24l4N7j2MR7q2n8
3906D4R0j4L3j1Rk7Nk6K6r3J3P6k6m0MJ59m2k0jo2Q9l9q5m4P0L9m9Q8L5p4p9M4J9M1R1j73
3484G0L6m9k1J06N3L4j04qJ02j3o9M0Rj20L4J08j27J78k2j93J30M23J44o70M52k20K19k99
3155B23j21J40N6j28l7o3J33j55K78Q81J64j022O70j21q00k1n1K8K00K15j20k80N8r1Q0K4
$$ plain form
5808 83 130 98 98 41 258 162 74 248 150 289 67 69 238 157 66 64 114 136 103 81 140 210 51 139 76 146 85 94 109 29 119 75 111 105 7
5397 7 7 63 154 136 52 47 108 75 154 93 104 246 110 230 102 142 58 128 33 55 202 239 70 182 206 160 179 75 168 101 183 44
5021 44 57 226 210 234 243 124 142 183 183 180 148 111 211 169 59 154 90 70 102 142 171 228 305 211 58 122 118 336 322 178 51 115 284
4634 284 197 105 145 296 97 63 39 155 249 90 106 38 199 293 158 34 73 186 24 160 226 116 134 166 100 100 87 116 24 120
4282 120 109 91 114 115 134 179 220 163 141 156 275 233 115 152 280 154 146 131 5 126 172 268 156 196 72 38 95 83 87 184 102 44
3906 44 134 120 153 142 151 124 129 103 129 36 49 125 99 59 63 222 180 160 159 97 186 147 62 18 88 127 78 166 201 127 48 92 111 152 243 70
3484 70 106 57 36 142 195 229 125 117 219 206 137 177 186 66 100 208 81 259 237 44 174 597 741 71 523 303 522 223
3155 223 102 242 298 170 133 70 203 48 326 1207 1371 349 1019 898 98 77 26 54 254 469 349 69 127 36 116 140
2850A40M3j07Q8l4L3p7P1j04P5j2P7o5ll4l9K36K27m19P7p9Nl0J01L2m9j0r0Rk4K4O3jo3k8
2451C3L3O4L9j08J9l3j3K9K1l7M0O7P1j9L3j7j95J32L5j08K22Pq7n8r3lk4L5J17o5k4p5M4
2063H2n7O6o1J12j3n2j4K4oJ31L3k08Q6K8M5j26Q7m6m6J89n4j10J5J3M0n4J15k3J2K1r2j19
1688A8J40l6J6k8J2P0m4N9l3l2q1O6n9J18j26j9R4R4j2j65J25p5mk5N5l0o5N0P6j5m7P4m8
1300A23L6M1j01j0Ol2mJ6J7J2N0n4j9J30r8J26j35k7K08Nj60o1j3N0Q5r9N7l8K1l7O6j5j6
913A30o7J70r1K8k7l6P4r4j9j6PR2j1p3K0%N8q2N8K4m7J5O2N8k5o5q7J3k3M0L3K4q2OK7K62
491C56j37j50N1r1J47o6Lo7N4N2k8j1P7j11k5j5L1Q3O6L1k00J50j16M9j1Lo9Q6N0N8j52p0
115B8rJ71j19J56K0j78K30j51o6K7p6J03l0J29J03k56J28M4o5j05n7MN0lkn7
$$ plain form
2850 140 183 76 164 130 163 86 157 53 128 116 193 128 125 91 52 288 515 96 173 94 99 69 170 202 153 143 53 62 38 62 125 124 61 33
2451 33 66 130 169 61 80 47 34 63 84 47 87 154 225 206 239 222 27 159 194 86 308 315 228 170 77 74 50 85 202 137 113 38 82
2063 82 25 91 30 142 129 77 63 87 81 212 245 37 123 151 196 70 157 111 65 254 200 90 105 118 158 104 219 196 208 229 137 18
1688 18 158 122 138 110 122 192 148 207 174 142 61 127 68 186 60 41 135 229 217 52 177 102 98 73 128 98 33 83 159 144 97 171 123
1300 123 159 200 99 89 95 63 59 75 92 104 154 100 81 211 113 239 104 77 285 290 130 69 56 106 191 92 149 111 132 95 161 146 130
913 130 63 233 142 170 143 107 181 87 68 52 59 151 140 67 87 87 145 63 121 145 98 113 175 233 208 143 56 69 46 86 119 143 61 67 94 356
491 356 219 69 120 29 176 110 113 46 100 152 124 113 190 79 54 39 70 153 219 250 50 200 84 133 122 125 56 142 192 250 98 28
115 28 19 190 71 227 247 69 299 148 82 109 33 136 106 235 338 82 210 254 189 84 27 31 81 78 76 19
-190A9
##PAGE=	F1=3490.65
##FIRST=	25169.313707327481097,	5807.6787752999953227,	0.33431538939476013184
##DATA TABLE=	(F2++(Y..Y)), PROFILE
5808E4M5l3N8j5R9j00PJ69j63J41k05RJ30q7OqJM0k2o1Q4O6j21J9M8N6j16j0N0j36J08m5M8
5420A16l2m0j3N9P6J5n3j0k7RK8k8J9J49j31M0r0K3p4O0p4M2J34J0j54L8M6mL4j09J50r2O3
5033A80j39L8J73l4J3J2j46K2N0n4P7m2l5P6n0r1J00n5n3K7O7%L7R5p5j36M3JK16oj46j36
4657B9J03J55j01m2K0J06j95rK3Q5P3j43j0p8K34P1j77q2OJ25j70J46O3j43O2L5r0L3j2k1
4305I6m3O7j7LJ7n5L3J09P4r8m4L3Q6rj46RJ50j24J8j1r4R3L9L8r6M5j11J3K9k6M8P7j19p3
3906A1J01j4J28o3j1k0K4rjj03L6Q1n4l7L1J68r2l7J8j8L9m8p1pL9kK5P4J2q6p7Q0J0N5R2
3495B74j78L4j01K2J53L4J2j36lN5M1j2QMj35K7P0k0J41p1j99J51M66J30o70N59j69J94m00
3155B81j91J13P2j13o5l7J39j47N02J374Pj773J459m05j094n3l4KL91L76k48m62M3j15O7M6
$$ plain form
5808 54 99 66 124 109 208 108 115 284 121 262 57 66 196 109 115 107 108 148 126 65 149 215 94 113 161 217 101 91 141 5 113 68 116
5420 116 84 44 31 90 166 181 128 118 91 100 128 100 119 268 137 177 87 110 36 96 22 64 198 208 54 92 138 134 168 59 209 117 180
5033 180 41 79 252 218 231 243 97 119 169 115 192 150 115 191 141 50 150 95 42 69 136 136 173 268 193 57 100 101 317 311 165 29
4657 29 132 287 186 144 164 270 75 66 89 174 247 104 94 16 250 321 144 62 68 193 23 169 232 89 151 186 96 129 117 96
4305 96 53 120 103 106 123 68 101 210 284 186 142 175 261 252 106 115 265 141 159 148 54 147 186 224 128 173 62 75 104 78 126 203 84 11
3906 11 112 98 226 163 152 132 156 147 146 43 79 160 106 69 100 268 176 139 157 139 178 130 59 52 91 89 114 188 200 114 37 117 127 182 274
3495 274 96 130 29 51 204 238 250 114 111 166 207 195 203 207 72 99 169 149 290 219 20 171 637 767 97 656 487 681 281
3155 281 90 203 275 162 97 60 199 52 554 1928 1935 162 1621 1216 122 69 35 37 428 804 556 94 137 22 89 135
2850A35L7j21J10l8K3j08J69j70Q4k4J18m8m7k1m0K39L52m47k3q8j9j7J02M5l2m7l8k6k7P1
2498A04O9p3l3nn7J21L8p9l8oJ6M1l8l1K6M7Q8k8M8J5j47N1L1q6K26J2o0p3j16L9m5K0J85
2110B62o3q1p8P9p6Q1j02J46mo0k0P5kQ6J8k17J13L8L7j39M3Mj3J50p3r0jk8O5j25Q6L9KL1
1711A83k3r8P6k1N7k9k7Q7o4K8pn6mN4j03J60j51k5J04J03j5j68Q7q2N3m9P7k6j05L6Q2jo4
1324F9J02Oj2pj04M2l5k%N1k7P1L5p3o1J51j47J77o8l8J38l1j56rm7M3J36r0K6j9Rj1R5m0
925A74n0m5J50q6J9J9n8M5q6l9J4k0J04n0l4N5m0M7m1N2L7o3k3O4P0j3p3r0N5j4Nm1P9p6j7
514C0P0K32j58j00O8q2M0j2P0j28N9N3J1%L4j69L9j1O0J2J35L6k44J51j04L7j5n3L9J0O6Q1
138B57j29j15L1R8j17K25K3j70K08j85n6N9p8R2m5J32J03k41J25M4o1j04p2j4N7K0%n0
$$ plain form
2850 135 172 51 161 123 146 38 207 37 121 97 215 167 120 99 59 298 650 203 180 92 73 56 158 203 171 124 86 60 33 104
2498 104 173 100 67 62 5 126 164 85 47 41 57 98 60 29 55 102 190 162 210 225 78 129 160 74 300 312 252 179 63 102 57 77 262
2110 262 199 118 40 119 43 124 22 168 164 104 84 159 157 243 261 44 157 195 232 93 136 140 127 277 204 114 113 85 150 25 111 150 152 183
1711 183 160 62 138 117 174 145 118 205 141 169 162 106 102 156 53 213 62 37 141 244 229 61 148 66 119 70 147 121 16 52 134 133 69
1324 69 171 177 165 158 54 96 61 59 59 110 83 154 189 116 55 206 59 236 168 130 268 237 81 72 25 68 204 114 140 121 130 119 214 174
925 174 124 79 229 143 162 181 123 168 82 43 57 37 141 91 57 112 72 119 78 130 167 104 81 145 215 202 129 39 94 80 85 44 123 47 30
514 30 100 332 174 74 142 60 100 88 158 30 89 142 153 153 187 18 57 46 106 118 253 289 45 196 92 129 114 61 100 110 176 257
138 257 128 13 44 142 25 250 273 103 311 126 70 129 51 143 98 230 333 92 217 261 200 96 24 10 67 87 87 37
-190C7
##PAGE=	F1=3388.39
##FIRST=	25169.313707327481097,	5807.6787752999953227,	0.40400964021682739258
##DATA TABLE=	(F2++(Y..Y)), PROFILE
5808E6Mk4R7M3j9j07R1J62k22J16j54J7Q4r3R2lm9P6j6r5R7M2p5l9J44O7j48%M6j72O9j9N3
5420A21n9kK1N5L3L8kk2j06M1k0J0L4J31j21n3j1l1NM0m9M6J08j8j57j4P1J3N0r9J82q1K0
5033A74r1M3J40n3k2L4j62L6N4r5J56p2l0N0p3o1Q9j2m7j0Q9m4L5J00n8r6M0k9J96j0j39r5
4657C7J18J10j06K2PN7j94K8M8N7N3j26l9k7K17O8j88o5k4J19j41J35N5j61R2L8j04N6jn1
4305I0j2L5pJ2Np2L1J60Q3j28n7L2O7K2j61j2J46j00L6ro4N3K2k4j6K3o1L9j9o5J23O5j65
3918G2k5N6j4J92j04m9k3N0J2j2j00M3Q4p1m6O0J75j46k4J6K3j2l3q4M9kl9R8N1j9j01qP0
3531A39k2P7Q6j69K4j04N6J60K2jj51j0j3R7L7k2J4j12M2l0O4J49j66j16J25J29j4j25J71
3190C37J0L2j73j03P2P1j23n8KR7j18N17J133m65q21J068n72p08K8k02J7M16L95k69m78K6
$$ plain form
5808 56 60 36 133 176 157 50 141 303 81 197 43 60 144 51 143 140 91 167 151 56 153 195 120 81 225 292 144 144 190 18 87 68 121
5420 121 62 60 81 136 169 207 205 183 77 118 98 108 142 273 152 99 88 57 62 102 53 99 207 189 32 18 89 102 152 53 235 154 174
5033 174 83 126 266 213 191 225 63 99 153 58 214 142 112 162 89 28 117 105 58 48 137 93 128 228 170 74 114 85 281 271 132 37
4657 37 155 265 159 181 188 245 51 79 127 184 237 111 72 45 262 330 142 77 53 172 31 166 221 60 152 190 86 142 141 90
4305 90 78 113 106 118 123 51 82 242 325 197 140 172 239 261 100 88 234 134 170 161 97 150 172 148 132 155 94 133 114 49 172 237 72
3918 72 47 103 89 281 177 128 105 155 167 155 55 98 182 111 65 125 300 154 130 146 169 157 124 40 89 87 48 146 197 178 77 69 139
3531 139 117 194 280 111 135 31 87 247 269 268 117 107 94 191 228 206 220 108 150 120 184 333 167 51 176 305 291 166 337
3190 337 347 379 206 103 175 246 123 65 67 164 46 563 1696 1231 410 1478 906 198 226 24 41 457 852 583 105 131
2885A31j08O3K3O6j46J40n5jp7J98j68M7m0J41k3p3j4l2J83L46l95k9r3k2MN5O2j1o3kjl5
2509G1O9P3j41J3Qk7L9O9p6m7J2K9M7r3Ml0K1R7k4O5L7j03nJ1n8K14Kj5q3j21P5l9KK06m3
2099B59j41q5J28r4P0j23J83j2n3l9J16QN5j0k16J20N8L2j41qP5J4R3q8o0l6k8M7q4JO0K0
1723A21K2L2m8m5J2J01j9p3J01p2pJ6q0Q2J7p9J54j73k8R5J01l3j25N0l6L8o5Q9j1j15LQ0
1347A05Pr0J18P7l5o9r5P1n5M2j0O6n2J03K0o9r8J56j74K05%m9N7p5r9M6l5k4J60o2pqKOJ21
937B56m9q1m5J31n3J2M4q1K0q0m2J00o2O5r7MJ17q7J6j7L9Q1n1j13R6Q3Rq8j03J01ln7j5Q9
538A39o3n3J07J65j77n0R3m2q6P2O7j57O0O4L8K5J7j57j5j1R6o4K11L9k64J14r1M1k1l3P2
174A36o7R5R2r7j48O6M6o5J88L7j55J69j92n2P5m9P7p2J16J01j88J09M7n1j11q2qM5K5Jl3
$$ plain form
2885 131 23 86 109 175 29 169 114 113 36 234 66 113 73 214 191 118 104 72 255 601 206 177 84 62 66 121 183 172 109 107 106 71
2509 71 140 213 72 85 93 66 105 174 98 51 63 92 139 46 50 20 41 138 114 179 216 113 108 119 61 275 277 262 179 58 133 94 96 302 259
2099 259 118 33 161 67 137 14 197 185 132 93 209 217 272 262 46 166 224 256 115 107 182 196 289 201 141 105 77 124 40 41 101 121
1723 121 143 175 127 82 94 195 176 103 204 132 125 141 61 143 160 81 235 62 34 129 230 197 72 122 86 124 59 148 137 22 25 105
1347 105 112 22 140 217 182 113 18 89 34 76 66 132 80 183 203 134 36 192 18 223 223 174 231 156 57 103 68 44 204 142 135 127 129 135 256
937 256 207 126 81 212 159 171 215 134 154 74 32 132 70 135 38 42 159 72 88 71 110 191 140 27 123 206 215 127 24 125 122 65 50 139
538 139 76 23 130 295 118 68 161 119 33 105 172 15 75 139 177 202 219 62 47 36 132 68 279 318 54 168 77 118 97 64 136
174 136 69 164 256 159 11 77 123 58 246 283 128 297 105 53 128 79 156 84 200 301 113 222 269 218 107 25 17 62 87 88 55
-190E5
##PAGE=	F1=3286.13
##FIRST=	25169.313707327481097,	5807.6787752999953227,	0.43900480866432189941
##DATA TABLE=	(F2++(Y..Y)), PROFILE
5808H4o7mJ15R9j05j08J28J58k42N6n9MM2o5J14jq2J20j5j11R0Nl0q1K13Q5j49K1J2k06K2
5444D3O7J9q8J4Q8M5k1N4M3k8j76O2n2M1N5R0j15j02P7r4R0M1n0M4P5l8j63P8jl4P3q8J92
5056B41o0k3l0L5R7o0p4O8j62N9N5j08J96j15j4K7j00k2M7N2k3l6P8p3N8Q2m6m3M5p9J66k5
4681B13j24k2J10M8j00Q1RJ3j74M6M7L0M3j15o1L0J63Q5j72o6l6P9q5J07L9j52J08M1j17O9
4329A37Pm6nJ1K3Qj5j9qJ72O9j42n1J4O2M2j74JJ06m6L6rm9J4qq0J11jk1L7l2j14J76P1k11
3918F6L3K3l7K17j29q5l3P5L6pq3J9R3p1o8Q5J76k00L1k4O0n1qp0O8l4o3J52J8n1j10Q8L3
3531A49o2R7Q4j54J3m3M6J29K5j1j56j4o9J30O8m1L2o8N5j30R3K12k87j0J32L20L98n89K90
3190F39k59K17j59l63J10K9j46k8O2k0l3J72J82J014j91j108M09J1J15n80PR6J73o7j84kq0
$$ plain form
5808 84 17 13 128 227 122 14 142 300 58 114 55 59 101 36 150 149 67 187 172 61 151 156 126 45 258 343 194 215 227 21 43
5444 43 110 129 41 55 143 188 167 221 264 236 60 122 70 111 166 256 141 39 116 22 112 153 103 147 222 184 21 99 98 64 137 49 241
5056 241 181 158 128 163 260 200 126 194 32 91 146 38 234 119 105 132 32 10 57 109 86 50 128 55 113 195 149 106 151 72 238 213
4681 213 89 67 177 225 125 206 215 228 54 100 147 177 220 105 44 74 237 322 150 84 48 127 42 149 188 36 144 185 68 137
4329 137 144 98 93 104 127 135 120 101 93 265 334 192 141 155 217 259 85 86 192 146 182 173 124 138 130 50 161 160 139 176 144 30 206 277 66
3918 66 99 122 85 302 173 88 55 130 166 159 76 95 188 117 49 134 310 110 141 117 177 126 118 48 116 82 19 171 189 138 28 116 149
3531 149 87 184 268 114 127 84 130 259 284 273 117 103 34 164 232 191 223 155 210 80 173 385 98 88 220 540 938 349 639
3190 639 380 597 438 75 185 214 68 40 102 82 49 221 403 1417 1226 118 527 538 653 73 80 176 349 282 98 96 16
2873A6P6k4J32j83J75r4l0%J65j44J6n2J29J3o3j6k6Q9K46k50k3p2jOk6Q6ml9J2L8k9M1O7
2486B31j69L5RK2n7J20q8j6j2N2M7j28L3j8m3P1j9Q9L6p6l1j1l8J91j5M4r1j08R2k3J0J80
2110C19j7j76q7J58j08M7q3J77l8m2o7J53K1K7l5k05J02Q8K0j29m8J20L4M6q7k6q0J8j0k0
1758G2oj0N7JO6Qj29%J39qj17J12o4l6K3q3J51k5j8J15j94j6O5R7p1o0P1%l0m5O8Rr8k8O7
1347H3Pm7L6J51k5r8p7L6l1N4j3N8l6Q9jm2j14J41j17J54N5o2j6j19L9K6k5m7J35j8m2j3j6
960A05J8J61m4j08o2J27j5J2M8j00Lq2l3J58r1M0j00N2J12j28J4m2K5J36j2j34Q5O9K5j03
608A36j25J41Pj27O9N6m2n3R0Q6j81kJ19mp9M4J6j37M4Q5M7N9J9j57o1k9J22j02K57L1k80
244D9P7p1M8j3M7K6j28J39Q2q3j12N1M4o0J19N7j31J20j63l4N5k1O8j02R1R4r9P4N6m9j20
$$ plain form
2873 16 92 68 200 17 192 98 68 68 233 89 105 53 182 195 132 116 90 179 425 175 152 80 79 85 59 145 141 102 114 152 123 164 231
2486 231 62 97 106 128 71 191 103 87 75 127 174 46 79 61 18 89 70 159 195 119 88 77 39 230 215 259 168 60 152 129 139 319
2110 319 302 126 39 197 89 136 53 230 192 150 83 236 257 284 249 44 146 234 254 125 77 197 231 277 190 164 84 102 92 72
1758 72 66 56 113 114 180 188 59 59 198 190 73 185 121 85 108 25 176 151 133 248 54 38 103 200 129 69 140 140 110 65 133 142 44 16 83
1347 83 90 43 79 230 205 107 30 66 35 89 76 134 98 187 186 144 30 171 54 208 263 201 185 66 105 131 106 59 194 176 134 121 105
960 105 123 284 240 132 70 197 182 194 242 142 145 63 30 188 97 137 37 89 201 73 87 45 70 206 194 60 145 214 239 136
608 136 11 152 159 32 101 157 115 62 152 238 57 55 174 170 91 135 151 14 58 143 190 249 268 111 50 21 143 41 298 329 49
244 49 126 55 103 90 137 163 35 174 256 173 61 112 156 96 215 272 141 261 98 64 119 98 166 64 155 249 150 224 280 231 111
-120A11p9%L4J4Kr
$$ plain form
-120 111 32 32 66 80 82 73
-190G3
##PAGE=	F1=3183.88
##FIRST=	25169.313707327481097,	5807.6787752999953227,	0.56160360574722290039
##DATA TABLE=	(F2++(Y..Y)), PROFILE
5808A13q7JQ9J37j34o6O7J53k04j0K8j9J3j5P6j5p2J46j6j23Q2l7Nj04K47J02j19M4m0k19
5456B3J9J37m0j13K5J51L3p1P0O1j8k41P3n7N2Q1L2j16j9P1p8R1M5n6M2L8m8j59J32k0j12
5092B8R8p7J86l8o5K8J1O1n3j26J17j57P9N5j03J98j60J8J3p4K0l1P0Rn0M2m9P9M9m4PM8j28
4704F1J34m2j01M7J00k2q6J23K0j4j48N3J9J0N2j16o9P6Q8J17j43o3qj2j9O4J4r1Q9N1j16
4340F8N9Mj4j1oO2%m3L4l6J54L9j31j7k8O9M5j86M7L9K4K2j4m7mn8j7J34j4JK1qj11J40R6
3930C13k51P7J6p5K05j33j04NM2N7Pn6l7J15n4r7R1J78k50J09r0J04o7Rj9L2m2l9J43k4p6
3566H9MO1j8q0J00R5j44J2K3L1O5M2j5j58nl6O6Q7n5M9j6N5j98O0L26l06k1K07J502R00k099
3202F23J625n88O36j138j137K12n7j11l1J24j06J05O72L037K222l899P02L7j809J55j097m8
$$ plain form
5808 113 26 27 116 253 119 53 120 273 69 59 87 68 81 66 142 127 55 201 185 62 144 107 112 8 255 357 238 282 242 23
5456 23 42 179 139 26 51 202 235 164 234 295 277 36 109 52 104 185 217 101 82 153 75 166 211 155 197 235 187 28 160 140 28
5092 28 126 49 235 197 132 160 171 232 179 53 170 13 92 147 44 242 82 100 113 39 59 28 98 107 57 99 50 129 178 134 141 189 61
4704 61 195 153 52 99 199 177 91 214 234 220 72 125 144 154 206 90 21 97 185 302 159 96 88 76 57 121 135 44 133 184 68
4340 68 127 131 117 106 100 162 162 119 153 117 271 310 179 162 134 203 248 62 109 148 172 194 180 133 129 71 54 188 174 175 196 188 77 217 313
3930 313 62 139 155 80 285 152 48 53 95 152 159 103 66 181 127 30 121 299 49 158 68 172 105 114 95 127 85 46 189 165 89
3566 89 93 154 136 56 156 251 107 119 142 173 238 280 265 107 102 66 132 219 164 213 197 252 54 114 440 134 113 320 1822 2722 623
3202 623 2248 1660 2296 1158 21 233 176 65 34 158 52 157 829 3866 6088 2189 2891 2928 1119 1274 177 129
2944A29M43K95m19l41q5NO1pJ56k19K39j93l7O5J25j17%l4O0N7k3j9k3qJ36m2j05qK2pp7P4
2568A03k5L5lP9k5ON0j45K0MO7j27J67r0Lm9R2L1j16K8J9o7K0l2J24Np2l7k7%J32k5R9r7q3
2157F4Q4NL1J26Oj69p9J50j13K1k7J63p3l5r9J84L3km4j84O1J22jj04n1J14N4Kp1J3j24Q3
1782A40o9J0ll9P3j2O8P1r7j19J63Lj62J22m6n1J1k3J55n1L8O7k08QK3J03j12mJ32j0r1K0
1406A10J0J7n8l3L7pL2j05K10No9r2k5J8L4%L1J8L6l0Or3R7o3J06R3p2p1q8J13k3j3m0Q8K8
995B07o8m5m2K8K13k9j38p3J30K1J7L8j10or2j5J83j09L4n3O7P3j66O8j12JJ86M0j06N4L8
631B34K6j13j31J48J9j61J04L0j3m7N6J0j25KJ39K8m5j1m8o1LJ04M2R1L3j65o9l0Q6n9K32
268C09Rk92O2l2L0K0Q8j4j48J69O0r7l3K1N2q3M2P5r9P1j03j3K2j0N9j23P6P0NK9O6n7j24
$$ plain form
2944 129 572 867 448 107 22 27 88 81 237 18 257 64 27 92 217 100 100 66 126 183 160 141 118 110 246 204 99 91 113 106 29 103
2568 103 78 113 110 189 164 170 220 75 95 99 166 39 206 116 119 70 162 193 77 105 124 57 77 45 169 174 102 65 38 38 170 145 244 147 64
2157 64 148 153 184 310 316 147 68 218 105 126 99 262 189 154 55 239 272 270 226 42 103 225 224 120 69 183 237 239 168 181 57 140
1782 140 71 81 78 39 112 100 168 239 142 23 186 189 27 149 103 52 63 40 195 144 182 249 41 49 72 175 63 59 191 181 90 110
1406 110 120 137 79 46 83 76 108 3 213 218 149 57 32 50 84 84 115 133 169 139 145 52 149 86 192 285 213 142 54 167 144 131 91 179 207
995 207 139 94 52 80 293 264 126 53 183 204 221 259 149 143 51 36 219 110 144 91 158 231 65 133 21 22 208 248 142 196 234
631 234 260 147 16 164 183 22 126 156 143 96 152 162 37 39 178 206 161 150 102 41 44 148 190 281 314 149 80 50 136 77 309
268 309 318 26 88 56 86 106 194 180 32 201 261 164 131 152 204 121 163 238 139 210 107 94 116 106 165 42 118 188 193 222 288 231 107
-120A07o1JL3plJ9
$$ plain form
-120 107 46 47 80 73 70 89
-190H9
##PAGE=	F1=3081.62
##FIRST=	25169.313707327481097,	5807.6787752999953227,	0.60343474149703979492
##DATA TABLE=	(F2++(Y..Y)), PROFILE
5808A30o4j5N1J48j12n5jJ45j48K2J4k4lj3N2m5pJ34k0j40Q3p2K3n3J87J10n9O7r9k01P9J27
5432B41j00j10L9J70K7j00Q5M8Qk91O1l0M1J07l1j13P4N2n8R6L7n3M1Jm8j49J39qj56R9o7
5068E2J82k3j08O7k4L8l7j05J28j62Q1N9j04J91j98O1J4m3L9j1k5M3o2oK7Q7J8m9L8M7j63
4704E2J05m9n9Q0R5r7o5J40L3j7j38P3l2JP8j26n5R5J1J53j17l9J5q3K2K3l1LM9P2q5K0j3
4317A14K8k2k5J05j4o8O6m3J16Nr4M1r3Q7L0j93J00k9Q3Ok2n2J7j11J15M7j8J5KL7r8O7J32
3930C31k76J03K1j10J69j15q8P1k2N5J5k5r6J34k4j24O9J83k52J47j52J54m1qK5k3k4j0J10
3589A97p0q5J53k5p0l7N4J27j52K4P5J7k2P4rj58J6KJJ03q6O1L4M3k39K3M38k13j56L40K932
3225C392J483l941L386q68J092k416j980J54j59Op9J69qQ3J935O901L224r316M157q98m473
$$ plain form
5808 130 66 51 102 250 138 83 82 227 79 101 115 91 88 75 127 82 75 209 189 49 132 60 83 30 217 327 268 335 236 35 114 241
5432 241 141 31 70 240 267 167 252 300 308 17 78 48 89 196 165 52 126 178 120 216 253 200 241 242 194 45 184 176 20 119 52
5068 52 234 211 103 170 146 184 147 42 170 8 89 148 44 235 37 98 112 69 108 97 72 115 53 47 74 161 179 130 168 215 52
4704 52 157 108 49 129 224 127 62 202 235 218 80 153 121 122 200 74 19 114 125 278 161 122 137 54 76 99 68 71 120 192 107 127 114
4317 114 142 120 95 200 186 118 184 141 257 262 168 209 116 203 233 40 140 111 194 200 178 126 143 32 147 194 176 191 193 230 132 199 331
3930 331 55 158 179 69 238 123 35 106 84 139 154 129 33 167 143 19 88 271 19 166 14 168 127 119 144 121 97 87 197
3589 197 127 42 195 170 100 63 117 244 92 116 191 208 186 260 251 93 109 111 112 215 129 190 224 267 28 51 489 276 120 460 3392
3225 3392 4875 934 4320 3452 4544 2128 148 302 143 149 70 239 231 314 2249 9150 12374 3058 7215 6317 1844
2979A844J42j667j07J509J049j200j378r5Jl3J11J06k52L64l83N5M4J00j01lJ0l8Q4K8j4j9
2674A57o1Q1P1k10P7L4k7rk8l7R4m2J18m1j8J9q6j1J2P5j28J77p0j3p8J37oo0KN0j05K3m3
2286E4J50m0q3k8k8N1L0J4J02j04n3N5M2N3O3K1j25p1J16j06kK6J47j02l8j30K05M4l3l3j61
1923C6J8J50l1p2oN2Q0m6m9N6j59J50r8mk3J8M2j1L1J40m1k03J32J5j48P3k9l7j5M5J24m7
1547A43P8J5j89J7k1J20n1l5J61m4r1O7l2rj2k9J6k7Q3q6R8L5j0j18o6M7KK3kQ5k3p1O7n8
1148H3M2k4P4J17q1j01QR7p3lk2M3O8p7j05R9k0J52qj70o2J24N6K5J8j08pj07PJ81j11L1J
761A47O9L2j96J37j48j7J73R1p3K4J0K0j21j06J15K9j36O8J5J6l4J3n4J0n4J43N4j7o7p0N
397G8m0J12K6J10N6j68o1j7J5JJ94j9k62M4J1rO0Q8l5j24J62N0j41P5j0M1j07l0Q6o2K9k8
$$ plain form
2979 1844 1986 319 212 1721 2770 1570 192 97 98 65 176 282 30 394 11 66 110 210 109 106 116 78 162 190 176 157
2674 157 96 177 248 38 115 149 122 113 85 48 142 100 218 177 159 178 92 81 93 168 40 217 147 134 56 193 187 127 129 179 74 97 54
2286 54 204 164 81 53 25 76 106 120 222 118 65 120 162 215 278 299 174 103 219 113 111 137 284 182 144 14 219 263 230 197 36
1923 36 54 204 173 101 95 147 227 181 132 188 29 179 81 77 54 72 114 103 134 274 233 30 162 177 29 102 73 36 21 66 190 143
1547 143 221 236 47 64 43 163 112 77 238 194 103 170 138 129 117 88 104 77 160 74 172 207 197 79 13 60 62 85 83 168 145 74 141 83
1148 83 125 101 175 292 211 110 118 215 142 139 117 160 228 151 46 145 125 277 269 99 37 161 217 242 260 152 145 38 45 226 115 146 147
761 147 216 248 52 189 41 24 197 288 215 239 249 269 148 42 157 186 50 118 133 149 115 128 74 84 30 173 227 210 143 73 78
397 78 38 150 176 286 342 174 113 96 111 112 306 287 25 69 80 71 131 219 184 60 222 272 131 206 196 237 130 100 186 124 153 125
21A25j0J1k4M8j29R1K0R9k1P6p1j22k2j3L8k1j6L8
$$ plain form
21 125 115 126 102 150 21 112 132 231 210 286 215 93 71 58 96 75 59 97
-190I7
##PAGE=	F1=2979.36
##FIRST=	25169.313707327481097,	5807.6787752999953227,	0.59452331066131591797
##DATA TABLE=	(F2++(Y..Y)), PROFILE
5808A32l4k8J9J36n9p0m7J21j01Q0k4Lro4N8p6P3J02k3j64R6r2K3J1R2J02K0R0j50j58J27
5444A86R1j48q0N3J43L5j05R7K0L4k78j6K4J3J28q5l0N9M2m0J13J7m3M0k7m1j23R0K3j54P3
5080A11n2J90j9j31N5n8K9k3%R1j92P5O3r5J72k05Q7L1n7P2jj02O6p1j1P1R7Ln9L9M9j80Q4
4693A29l6l3R3R8j67m1J30L8Qj49J12j04J5J14j41m2R8m3J74j01jJ9j02L1Or0Q0J0R8m6j9
4329A38l7O6l6m6J45l8p2P0l0O6k2m3J10j68J14Mj90J37q1J08nk7n3P3j00J27l5k3L0j3Q9
3965B58q5j7J69k73J03K3j19J16o4n8R4l5K4PKp3P7Qj32J5J97j57Q0r7J09Lm7N5q0LK1O6j05
3578H8o1K63j30j14N2k5J78j75L6J08Rj10J06J8j50L7NJJ06j57Q5O1K2k00R1L76r1l20N01
3237F10M338K027n766N269j016J502l804k865Q4k19Q5j24K26Q7M6L503J1260L958j5623Q716
$$ plain form
5808 132 98 70 89 225 166 96 49 170 69 149 125 128 119 55 113 37 110 212 189 25 121 29 52 63 155 257 277 367 217 59 186
5444 186 277 129 49 102 245 280 175 272 292 326 48 32 56 69 197 112 82 141 183 143 256 273 230 270 243 202 79 169 192 38 111
5080 111 59 249 230 99 154 96 125 102 102 193 1 76 139 44 216 11 98 129 72 144 143 41 107 36 25 96 193 196 137 176 225 45 129
4693 129 93 60 153 251 84 43 173 211 219 70 182 78 93 207 66 24 122 79 253 152 151 170 68 99 105 15 95 105 203 157 138
4329 138 101 167 131 85 230 192 120 190 160 226 204 161 271 103 217 221 31 168 87 195 190 163 110 183 83 210 175 152 182 169 258
3965 258 173 156 325 52 155 178 59 175 111 53 147 112 136 143 145 72 149 157 25 40 237 80 160 63 172 175 128 183 103 106 127 193 88
3578 88 27 290 160 46 98 73 251 76 112 220 229 119 225 243 93 130 135 136 242 85 170 231 253 53 144 520 429 109 610
3237 610 4948 6975 1209 6478 5462 6964 3160 295 379 160 245 121 347 434 480 3983 15243 19201 3578 12294
3002A2294k183p535O4k156j36K816J949k172k615p7n3j61K54M4k83N34n15N6KR9r4oN2q1M7
2709A44P0Jj2o7L3J00j84N7L5m9O3r1L2M7r4J55q4k3j9j6l7O1Pp9J72l5o2p2J61n8J9k3O3
2322B15j46M0l5J76q6q6oj7O1l0P8L0j10k4J5Q2O4PK8n6p0P1r3j2O0J28j07n4o2J18N4o1q
1934A64j34oJ53n8m6O1k9J09r6l3R9j73K04j03k8n0Q4PNm7K11Ok42O7L0p0k4k5J2NK9P5j5
1547A42J06l6j29pn8J39M2o8J31q4l0P5m1n6K4j4om9J06m9j6N1N3j32n4K3k0L7l2J39n6r2
1171C9R7k5j0kN5J30q4j16P2Q8j13mKJ1R2o7j24L08n4n7J1j94k9J04Q5L3mr3Kj26K3J66r9
784A17K5O1M5Kk00J81j68j0J19J32l8pj1J0j25o8O8L1r8J5J6L3j7k2n2Q2q8J27P8lj18Lmp1
385D5J02%J12Q3j61n0Ro3M3J61l7j78%L3k8P8O0l1p6J20N5j98J87l1J1j20r2Q9k5JM2k6K7
$$ plain form
3002 12294 10111 2576 2640 484 348 3164 5113 2941 326 249 196 35 289 333 50 584 69 125 127 226 132 126 178 97 144
2709 144 214 215 203 136 169 269 85 142 177 128 191 100 132 179 85 240 156 133 114 98 61 122 129 50 222 187 125 53 214 156 175 152 215
2322 215 69 109 74 250 164 78 72 55 116 86 164 194 84 60 75 157 221 228 256 200 130 201 108 96 156 284 177 123 61 179 233 172 164
1934 164 30 24 177 119 73 134 105 214 118 85 184 11 215 112 84 34 118 125 130 83 294 300 58 125 155 85 61 36 48 53 82 157 142
1547 142 248 212 83 76 18 157 199 131 262 178 148 223 182 126 150 136 130 81 187 138 122 173 226 94 40 63 43 80 48 187 131 39
1171 39 136 111 101 99 154 284 200 84 156 244 131 127 129 140 232 165 41 349 295 238 249 55 26 130 215 248 244 151 153 27 50 216 117
784 117 142 203 248 250 50 231 63 53 172 304 266 259 248 258 133 65 133 164 66 81 97 130 113 91 39 121 33 160 238 235 117 120 116 45
385 45 147 147 259 342 181 131 140 77 120 281 244 66 66 99 71 149 209 178 102 222 277 79 266 235 246 126 34 123 98 99 141 115 142
-2A42n0L4j04J08l1J54o8Q4q5j15L7m1M0k3k7L5
$$ plain form
-2 142 92 126 22 130 99 253 185 269 184 69 106 65 105 82 55 90
-190I0
##PAGE=	F1=2877.1
##FIRST=	25169.313707327481097,	5807.6787752999953227,	0.6449992060661315918
##DATA TABLE=	(F2++(Y..Y)), PROFILE
5808A20kl7oJ14Mj03l0N2o9J28n6N8qj42P9m1Q2P1k3j49P5q2OM6jP4J08J09j83j00J50L1j64
5420A11m8O8Q7O2r7J00MM3k38p1M6j6J33j06P6k5L8k6J36ok7L6l2l4r0KO0j41N0k0K07k5j22
5033A35j8o2K4k5J00O0j93L6N6m7J24j39M4O3j11J10qj06M2p6Q9QJ07Po6RN4j71O4mm9J07
4657A64J14k27k0J08K5N7j74J63j81N8J35j54m6R5m6J56r2L8Nj02M8No3M6k4J16j2m6n8J00
4305A88n2o8J73o9m6M7LJ1k9pJ78k32J39k1j70J43j06Q4mk5n1J45r3R2r7k1L9j9J34p2r1J88
3930B91k29P2J5p2L5J7m8Q3j5rj2J9j4mL2j06l4J86q7L2l2N6M0q1P2j16J5N4J5j07k7L15k32
3542A24r3J01j04K39j97L3J23J3j60J00P0j39N2k1N5Q9k45J40L5Mr2J37K60L2m70O47N414
3225F147K405p171O882r66J769n028l621L3k14R0j62K98J67j4N084J5240M219k1584J3585
$$ plain form
5808 120 118 81 75 189 193 90 60 112 43 171 115 173 165 23 102 61 143 214 191 42 117 35 41 87 86 160 268 377 194 94 244 275 111
5420 111 63 131 218 280 183 283 287 330 92 21 67 51 184 78 154 129 167 141 277 271 244 280 248 214 124 126 186 45 95 75 282 257 135
5033 135 117 55 79 54 154 214 21 57 113 66 190 51 95 158 47 157 149 43 85 9 98 106 213 220 154 163 217 46 110 106 57 164
4657 164 278 51 31 139 164 221 47 210 29 87 222 68 22 117 71 227 135 173 178 76 124 129 66 112 88 204 192 146 88 188
4305 188 136 68 241 172 126 173 176 187 158 151 329 97 236 215 45 188 82 166 162 137 86 231 138 230 133 112 151 132 266 194 103 291
3930 291 62 134 149 77 112 129 81 164 149 140 128 147 133 129 161 55 21 207 120 152 120 176 216 135 207 91 106 160 175 68 41 356 124
3542 124 31 132 28 267 70 103 226 239 79 179 249 110 162 141 196 285 40 180 215 219 127 264 524 556 86 733 6147
3225 6147 8552 1381 8263 7297 9066 4038 417 450 236 326 164 462 629 615 5699 20939 25158 3574 17159
3002A7159l608j0398p5k427j31M121K821l157l836o1j08k31L20ql11P09o26K0k0J00p7k1Q3
2732B38r2j1R4J9lm0K5Q2j55RK1o4J27j30Q9Jj49J92j48pl2K7n1J39j25j8J84lj23k1J43j13
2357A05J02l3M8j72N0rK05j30q0J8j2N0mQ1n3j18KK1P1N7k8K8K0p6K4q0kP0J05q3p6L6qN5
1958A84o7J2p9k5J25o1n0J31r7J32j41j6J20j30K09r6l5k6O9j7L5j23K46L1k58KN0Op9NJ1
1594F8L1oMM2J24q6n4m2p6J40J19p2O7j08L9O3l1r3M5J1l4p3J06oq3K7J06j28m0MqJ2m1J55
1195A82m8m5M0On5RM2J32q1j25J05R3j38k6L1jR3m2n5M69q5l13J8j65j9Q4R5L5k4o7K2j47
819B0K6J49p9L1J09j3pj81J93j74lO4J58mm0k3Kj32k1K5K0n9l3M2K1Lj3K2L4r4R9J00mj54
420H4R9l2r0P8l3R7J10j47l4M2j10L3J34l5r4l9M4j2N7K1j1j3N3O4k50K80l4l1j17q8M0Lq
$$ plain form
3002 17159 13551 3153 3078 651 520 4641 7462 4305 469 408 300 69 389 381 70 779 153 173 153 253 176 155 238
2732 238 146 135 229 248 245 205 230 312 157 166 187 123 250 120 209 210 61 253 105 98 66 93 42 181 56 38 222 219 96 75 218 105
2357 105 207 174 222 50 100 91 296 166 86 104 92 142 138 219 166 48 50 71 142 199 171 199 219 143 167 87 85 155 260 177 101 137 129 184
1958 184 117 129 50 25 150 89 39 170 73 205 64 48 168 38 247 151 116 90 159 142 177 54 300 331 73 75 125 131 52 57 68
1594 68 99 93 97 139 263 177 123 81 5 145 264 192 259 151 190 253 222 129 174 185 151 78 184 178 95 122 228 100 60 64 56 68 27 182
1195 182 134 89 129 135 80 89 131 263 182 57 162 255 117 91 122 121 214 172 117 586 501 188 206 41 22 106 201 236 212 145 167 20
819 20 46 195 116 147 256 243 236 55 248 74 71 135 293 289 249 226 228 96 75 100 120 61 28 70 91 94 81 103 137 43 142 242 238 84
420 84 183 151 61 139 106 203 313 166 132 174 64 97 231 196 102 63 107 95 152 173 162 149 202 266 16 296 262 231 114 26 66 69 61
33F1R5o2O7q0K0n4R6m6J58j07Q7q8j02J03q2L8j8k5Q
$$ plain form
33 61 156 94 161 81 101 47 143 97 255 148 235 147 45 148 66 104 86 61 69
-190F9
##PAGE=	F1=2774.84
##FIRST=	25169.313707327481097,	5807.6787752999953227,	0.57426786422729492188
##DATA TABLE=	(F2++(Y..Y)), PROFILE
5808I9K4l9j9R2N8j50K6k8l0J37p4J21j0j70N2J7O6M5k1j10L8p5jM9l8JJ86J21j92m3J48m0
5432B40j31m1P9K2J00q3R2J5K4j84n9Ml4J15p8J28j08L7j9J55j9j3K5ll6o6r4R0j23L4L3K24
5056C26l9j00j15J3j2j1J31K5j70LK7K6O1q8J3R9j40J01l6m3j3l9J46o2J15K1o1m6O1j38M3
4693I8L3p4J01J39k61j3R1qJ17j78J89j62M4J22j64n8P9j0J13p6O1j7j00P9Jl5J1m0J10Qn4
4329A46p9J35o4q4J75j05J2QM4l8Kk4K39k71J53m3j38J32r5J6J4k9m8K14r2K2j17lK2j5J65
3965B54o2j15J56j55L1j1L5o7R0m0M1K0l5k9K2M5p6M7m7l0J12n6K6NNO1q4P2j07j6Q6l5o1
3578H2m0L35l04J2P6j45K68k03J8J14L0j35J8J36j32O5o5J27N4k40J53m6JK7J51J37J38n76
3249E6P44N906K525p830P862p05J821n822m076K3j81N5j92L69K30j00O334J7949L914k5861
$$ plain form
5808 99 123 84 65 157 215 65 91 63 33 170 96 217 207 37 89 106 172 217 196 86 124 49 48 97 59 60 246 367 175 132 280 240
5432 240 109 68 147 169 269 186 278 293 317 133 74 78 44 159 81 209 101 138 119 274 255 242 267 264 228 162 68 158 35 69 102 326
5056 326 287 187 72 85 73 62 193 218 48 51 78 104 165 77 90 189 49 150 114 71 58 19 165 103 218 239 178 132 193 55 98
4693 98 131 57 158 297 36 23 114 106 223 45 234 72 116 238 74 16 95 85 198 122 183 166 66 145 146 111 122 82 192 200 146
4329 146 67 202 138 54 229 124 136 144 188 150 152 128 367 96 249 206 68 200 105 121 135 106 58 272 180 202 85 82 104 89 254
3965 254 192 77 233 78 109 98 133 66 156 116 157 177 142 113 135 180 104 151 104 74 186 130 156 161 166 227 143 215 108 92 178 143 82
3578 82 42 377 73 85 161 16 284 81 99 213 243 108 126 262 130 195 130 257 311 71 224 178 179 206 357 494 632 56
3249 56 800 6706 9231 1401 9263 8558 10379 4557 481 504 323 378 186 555 785 685 7019 24968 28882 3021
3014C021J7730m885j2432k45k402r6N147L474l946m779m5j54k48L13m3l23Q38o97k8j4P5k7
2756B34n8J11j09m4J01K8OJ5P0J8j78j0pp0J74j55J20k4j89K20j82qL9j0o1K10k04l4K13J2
2404B28j54K9R7j50J65k1Lj69M6L0K34j73q0M9oK0N0N5j08j32L1R0j1L1k8J9Q4r0j7p4L8N0
2028A36P4l1q3J21j10J8l2kJp6J15l2q5J82j26J29j65L7P0o7J96q0k9pL2k8P4j26J86K8k48
1664G2n4O9O9q7N4m0N0k8p7J07J31j29J4p2o0J05J71n6lq9O0M9j8j07N7M1o4j06R3L9p7m1
1289G3J29j03k7oJ0k1kR9j0rj7M4r2J1L1J19p4j09R4J14j49o9O2QO9j1K7O16j17n39pn3o8
901B3R2O5K5l2l7N3j66J7J32o3O2J29r6%j55J87j57J2jJ67K6o8k8kj42K5J2j4j8pL5l3K6N1
502A20L1j8o8N6J16j3j71J73n1r5M9p4P4J30j21j7P2r4m7J06ol1o8N5K2J0j6J9M7j2N4j78
$$ plain form
3014 3021 20751 15866 3434 3189 787 691 5838 9312 5366 587 542 388 140 453 410 87 925 228 200 186 261 234
2756 234 176 287 178 134 235 263 269 284 354 372 194 184 177 107 281 126 246 222 33 253 71 63 102 92 31 241 37 3 216 228
2404 228 74 103 200 50 215 194 197 28 74 104 338 165 85 134 128 148 198 253 145 13 44 134 123 154 126 145 229 139 122 48 86 136
2028 136 210 179 96 217 107 125 93 91 92 16 131 99 14 196 70 199 34 71 141 74 270 190 161 154 186 158 232 106 292 320 72
1664 72 18 87 156 69 123 83 133 105 28 135 266 137 151 79 19 124 295 239 236 147 207 256 238 131 188 229 165 59 152 191 114 73
1289 73 202 99 72 66 76 55 53 152 142 133 116 160 68 79 110 229 155 46 140 254 105 36 98 106 175 164 191 807 690 151 144 91 23
901 23 115 180 205 173 136 189 23 40 172 109 171 300 204 204 49 236 79 91 90 257 283 215 187 185 43 68 80 66 48 41 76 43 69 120
502 120 151 133 65 121 237 224 53 226 175 80 129 55 129 259 138 121 193 99 52 158 152 121 53 108 130 140 124 143 190 178 232 54
127E4K37k2o9j05k1j7J3j5J17j11J21j08Qj2P1k9J22j23P7p1n5J27j22K1pql6
$$ plain form
127 54 291 269 200 95 74 57 70 55 172 61 182 74 82 70 141 112 234 111 188 117 62 189 67 88 81 73 37
-190C7
##PAGE=	F1=2672.59
##FIRST=	25169.313707327481097,	5807.6787752999953227,	0.32748255133628845215
##DATA TABLE=	(F2++(Y..Y)), PROFILE
5808G6L7k7k5Q1Q2j99Q8q4L2J02o9J52j7j66QO3O2J9j5p6J5q3rM2Pn9J82J22j75%J24j02o2
5420A26o5Q6k8J31o8Q0L8j3j26m6k9l3O8k4J33j61L8j9J59j7kON0m3o2j48Q3j00K4R7K30n3
5045C12p7j87Q9m7K6J05k4j15j8QP5jo0kJ25j01L3q6L5l6j0J64j19J16L7m6j06O5q7K5O6o0
4669I9L1J73k57k9Q6m4J64j39J68r4OQ1j72n4L8L9O4l5N8l4j05J14j2qj2k7P3Ol4j01J66o8
4294A41q0J33j32Q8k8P2p2O2r5K90k82J49o0r8J21n6l0K1o0o0K74q8p9o3K8l8j0J78n6p0N9
3930A59o9jm5J59j48J16k2j1N5n5l5J7Q1j27N7K7m2N4n9O2Pm4O7l7M4o2q0J08p4Np9L18l26
3542B0J08N8j33K42j91J6P1N2j00o8J91j26P4j05J84Oj59J29j40K0J16J39L2K09o19P64N698
3225F488K359p585P979k89J642o008m114N9j50J0k06M12K77k01O954J8743L102k7383K0136
$$ plain form
5808 76 113 86 61 142 224 25 113 29 61 163 94 246 229 63 71 134 196 215 200 124 139 56 47 89 96 37 219 341 166 166 290 188 126
5420 126 61 147 119 250 182 262 300 287 161 115 86 53 121 97 230 69 107 88 247 230 228 234 284 241 179 31 114 14 38 135 365 312
5045 312 235 48 137 90 116 221 197 82 64 72 147 146 86 84 209 108 141 55 90 54 44 208 89 205 242 196 90 155 68 93 159 99
4669 99 130 303 46 17 103 59 223 84 252 158 164 245 73 19 57 96 160 125 183 149 44 158 146 138 126 99 172 178 144 43 209 141
4294 141 61 194 62 150 122 194 122 184 89 379 97 246 186 88 209 153 123 144 84 24 298 210 131 68 96 58 48 226 170 100 159
3930 159 90 89 44 203 55 171 149 138 193 138 103 120 201 74 131 158 116 170 111 173 180 136 203 166 210 148 68 176 102 107 28 346 20
3542 20 128 186 53 295 104 120 191 243 143 75 266 140 214 109 293 299 140 269 129 149 265 404 436 645 26 790 6488
3225 6488 8847 1262 9241 8952 10594 4586 472 531 381 391 185 597 874 673 7627 26370 29472 2089 22225
3002B2225n723j3155m10k080l8N658L750m353n220l4j82k29K55n9l06Q79p01p6J7J6N8j14
2744A78J44j38m1Q8J9J7P1R0n0j97Rm1o5J98j66J20k3j81K04j13p8J13m4q3K50j48q6J57Q
2404B12j10K5L6j07J46Ro6j30L1O7K57k05r0Q0Nk3R7K2j18j22L5J54j02JPoJ22j06m4o7R0
2040A00PL6L4o2J72j39p7L7n6P7j09R9Kq1J66j14J00j62Q3qOJ68n6j8nrk4J13j09R7Lk02k2
1653D7KJ09p9J08r6O3l4l9N2J24j61O8q5n2P3J88l1n4k4J0M6j1r8O8O5q6j45P5P8l1r6R9n6
1265I7j7rRl6N5OL7J0o0R6j22J1K0Q7o4m8L1J45j51o5L5K9K9J4J06P17j48o58p9O2j10J10
890A39J9Mj5k2Q7j81J2J06n6J12J25j90K5j42J80j17L0o9J57N1q5l2Jj15J9N6n5K6K4Qq5M3
514F0J04Qm3k8JJ19k5j68K11n0r1J6j09N7J31o8j6Q7m8j10L6M1Np8O8N2m2l8N0P8l7Kn8J43
$$ plain form
3002 22225 16502 3347 2937 857 819 6477 10227 5874 654 620 438 209 464 405 99 978 277 201 218 234 292 178
2744 178 322 184 143 231 250 267 338 428 378 181 190 149 84 282 116 236 213 32 236 123 45 158 114 31 281 133 47 204 212
2404 212 102 127 163 56 202 211 145 15 46 113 370 165 75 155 160 137 234 256 138 16 51 205 103 104 111 105 227 121 77 10 100
2040 100 107 143 177 115 287 148 71 108 52 129 20 119 121 40 206 92 192 30 113 105 111 279 223 205 200 191 167 280 171 268 271 69 47
1653 47 49 158 79 187 91 154 120 81 133 257 96 164 79 27 100 288 257 203 179 189 235 224 126 194 259 173 28 103 181 150 54 153 97
1265 97 80 71 80 44 99 105 142 152 92 188 66 77 97 184 120 72 103 248 97 32 67 96 125 139 245 962 814 156 77 139 29 139
890 139 158 162 147 125 212 31 43 149 93 205 330 140 165 23 203 86 116 47 204 255 170 138 139 24 43 99 44 70 94 102 17 60
514 60 164 172 129 101 102 221 196 28 239 189 98 114 5 62 193 125 109 196 148 38 74 115 120 42 110 162 120 82 132 210 173 175 117 260
115B60kr6q9K9pJ8m4J17j53J65j25j1K0M7jO8j02M3k9QJ07j53j0OJ5n7
$$ plain form
115 260 258 162 73 102 95 113 69 186 33 198 73 62 82 129 128 196 94 137 108 116 223 70 60 66 81 24
-190B4
##PAGE=	F1=2570.33
##FIRST=	25169.313707327481097,	5807.6787752999953227,	0.15094491839408874512
##DATA TABLE=	(F2++(Y..Y)), PROFILE
5808F0L1lk2P7P0j90R6o4L6P4m6J34l0j57j2Q8P1qj0m8Pr1k2K4P2n6J11J10j35K1Q8j32nr4
5409D5R0l9J24m6O7N4n2p5k9n0j8J1K2J07j59L1k1J40JMj7J06m6q5j06J7l7l2J58K21o3n5
5033B68k08J14p7O2P5p7l7m3L5O9m7n7NJ24l5k0j01M6j4k1J55j46J05M4k4j44O0l2J1R2j1
4669A71q2K00k16m4O3m6J75r0J28j2k9J5j74j9l2Q8J7J9M2k8j20J35k9J7k1J2Rj5J7j18J78
4305B11o2o8O2q3J02l6O2q4J15j67L10k66J25p3n1J20oj3rj08o5K88p4j97O4K3p8k8J72n0
3953A36rm4J4k0m6K36j84Q5Mn2P9p4k6J0Q4j46O2Q9o4J9q2J18j0r1O6N0j3mj43J08q9O1j00
3566B4K47k48J27N7j26K16j61K2J2O6q6j16K14j17P8j23K07n1m6R0j98M7J52J15l4K30n82
3249A6O84M848J950o499P207J72J276n542l717J31j32l2j97M09L08k96O780J7422J983k5567
$$ plain form
5808 60 91 88 66 143 213 23 119 55 91 165 119 253 223 66 54 142 213 205 195 147 154 63 41 65 137 81 192 302 167 188 276 144 139 45
5409 45 135 96 220 174 241 295 243 168 139 89 71 82 104 211 52 83 62 202 203 207 190 296 250 165 59 76 39 7 165 386 323 268
5033 268 60 174 97 159 234 157 120 77 112 181 134 77 82 206 171 151 50 96 82 61 216 70 175 219 195 51 111 79 90 182 171
4669 171 89 289 73 29 92 46 221 131 259 247 218 233 59 40 8 96 113 132 174 146 26 161 132 149 128 140 149 134 151 33 211
4305 211 149 81 143 60 162 126 188 104 219 52 362 96 221 148 97 217 211 198 189 81 16 304 230 33 97 120 42 14 186 136
3953 136 127 83 97 77 31 267 83 168 172 120 199 125 99 109 193 47 109 198 134 153 71 189 179 88 154 204 191 187 44 152 63 124 24
3566 24 271 23 150 207 81 297 136 158 170 236 150 34 248 131 209 86 293 242 196 286 88 135 287 402 368 598 16
3249 16 700 5548 7498 999 8206 8378 9654 4112 395 526 394 362 165 574 882 586 7366 24788 26771 1204
3014A204K0004n912j2388n24j551L9N525L578m276n047k7j85j80J60n7k61Q18o29j12O4o8
2768A75J62j77J82j65j6N8j7M0J04O7j07j85O1o4n8K00j63J03pj39J47pj34J28l5j14K50p6
2439B13j14Q1mk4j1l0JO8M3j41n2J2Q0K68k25r2R3J6o5J19lq9j07L3J88j76j4N3l6J27j10
2075A02n1RO1m6qJ01k5J91j26j39N9j17J35q9N9K1o1J22p2N3j47J04p2Q2J25k7nj8m4j2J39
1711C04q2Ml4r6Jp1J16o4J55j39O7k7K2k8J06j58R5o6q0N8J70j3o4M5q0O0j4p5P8P7r4j57
1336A6L9J04J9j04J9Pqj3k0k8J15r1P5J3q3J58j43J2PM1n1J9l5J71j49%l6L7j3K7J66P42j73
948H40o56j56J39j21J00nk3L1l5J13j92J6P5n6J60J09k67P2j06J20o2M1j24J35O7q4m3J2j9
608H1p0J33n3L5J0pq3K4J20j6k6nm9R9l0j40K03l6p7k1l3K4M5K2m5P9Nr7o6O1J3p1P9P3p8
$$ plain form
3014 1204 21208 15296 2908 2384 833 872 6397 9975 5699 652 625 440 260 420 363 102 920 291 179 243 175
2768 175 337 160 342 177 161 219 202 242 346 413 306 121 182 118 60 260 97 200 193 54 201 194 60 188 153 39 289 213
2439 213 99 180 176 152 141 111 112 180 223 82 30 42 122 390 165 73 166 182 117 236 233 144 37 70 258 82 68 121 85 212 102
2075 102 51 60 121 75 67 168 143 334 208 69 128 11 146 57 116 137 76 198 126 179 32 136 64 146 271 244 239 221 177 165 304
1711 304 222 226 192 96 97 26 142 78 233 94 161 134 156 128 234 76 171 105 25 83 253 240 176 221 141 201 187 112 190 267 173 16
1336 16 55 159 178 74 93 100 92 79 59 31 146 55 130 143 60 218 75 87 94 135 84 103 68 239 90 90 54 91 78 105 271 1013 840
948 840 184 28 167 46 146 141 118 149 114 227 35 51 126 70 230 339 72 144 38 158 96 137 13 148 215 131 88 100 81
608 81 11 144 91 126 136 129 46 70 190 174 148 143 94 193 163 23 226 190 113 92 59 83 128 150 105 184 189 92 26 87 100 29 108 181 103
197A03k9O0P0j8q0O3O3Mj12p3N8K2L3p8J03j58J73j24m8M5M8J6Pm4mJ1O1P2j68m4J5L5k5
$$ plain form
197 103 74 134 204 186 106 169 232 236 124 51 109 131 164 86 189 31 204 80 32 77 125 141 148 104 100 111 172 244 76 32 47 82 57
-190E7
##PAGE=	F1=2468.07
##FIRST=	25169.313707327481097,	5807.6787752999953227,	0.17070321738719940186
##DATA TABLE=	(F2++(Y..Y)), PROFILE
5808E3J3K1j6P6L2j03L0MLO1k7Q7m5j36NP7Q8l2j2k4Rq5j4l7J47r2P9R6p8J3N1j22Or9R1j7
5385A03P6j0N6M5p7m3qn7Oj7K2O2r5Mj3R8K4Ok9J36m1j27l4Pko6J56J95o5l4k12J26j04Q6
4986A74N7j23N2q1P8M0o8p3L2Q5M6l8p9nK1n3J20j32Q0L3Jj42M5J6jJ09N3j69J73j45l9Kj8
4599E1J63m4Q6P0o1o6j65L9k6L7k5O4L5oj23J28m5L5j9O4o3m5P5j21J73n4n8PK0L9j2J5p7
4211I1J46j87K72k18P3q4kJ32M3J5m8j42k7K28n0j62N2j2n8n1J28m1L7q8O7m7j9K61j81J8
3859A46L2o4Q4r1j1PN9j13M2J20q7Pr5J53k6j30Q7J23q7N6j68P7n9O6p1J13j21R9P0j20J88
3495B86j14J7l8O3q8r6J75j04P9j00J76j06P0M1j71M1J36R4n2J95m60N00L570J399m837N732
3190F408N47Q20m535k964K13j25p1j57L59L18l61N840J4297Q30k0301J6804n392j0310n57
$$ plain form
5808 53 66 87 71 147 179 76 106 110 113 174 147 234 189 53 58 135 223 191 179 155 164 79 65 28 175 83 162 258 180 193 244 122 128 29 120 103
5385 103 179 169 225 270 193 150 142 85 91 74 96 158 63 67 54 152 176 182 153 289 248 121 87 94 92 26 182 377 312 278 66 192 88 174
4986 174 231 108 160 79 157 197 129 56 88 173 219 181 102 97 118 65 185 53 133 166 167 25 70 86 85 194 247 78 251 106 67 69 51
4599 51 214 170 256 326 265 199 34 73 47 84 59 123 158 152 29 157 112 147 128 192 129 84 159 38 211 157 99 106 126 165 153 168 91
4211 91 237 50 322 104 177 93 91 223 266 281 233 91 64 292 242 80 132 120 62 11 139 98 135 47 114 67 48 309 128 146
3859 146 178 114 198 107 96 103 162 49 91 211 124 131 36 189 163 33 120 243 156 212 44 121 62 128 57 170 49 148 218 98 286
3495 286 172 189 151 214 126 30 205 101 180 80 256 150 220 261 90 131 267 361 309 504 44 544 4114 5513 676 6408
3190 6408 6955 7775 3240 276 489 364 293 136 495 813 452 6292 20589 21419 1118 17922 12530 2220 1663
2967A663r53J23M770L003l732m294j8j70j14N4m0k00O69m90j31J13j41K45k20K10j67OJ6q1
2685A21R0J01O7j48j82J10m9n2J75j59J17j3j17R5Q1j46Q9J1j45K12Lj26J0j2N5m5r3J16P
2345A73N3j82K2rP7K58k24p9P8K5r4J07j1m3j02M8J87k28JP5m8J01r3l6N0L5r5j9J27J1J84
1981C49j02j31K2j11J04m2K6L5l8O1qoj17R3r6J38P1lJ4l7p3kJ49m7q3o1M5k5r1Q6m9J80j51
1594A00N9j5O7r8Q5r2Q3l1j43O4J25j4k1P9j73Q9k7m5Q2P8q5j11j6R7N6r4l3M2Jj9o9j2J70
1207A79j49P4J1p2K00j54J9j5ll3O1o6J70j40M7o1J8k5J8J88O80j91n58j40J17j00N0Om6Q0
854A65o0J22j98K4M5m3J77R3k72J05o3K0j7M4j37R7O9o4n3L1M4j01J63n0M3j7j3r3K2J11k1
491A73J5np3N2k7p5J43k3o0n7M8L9p4J15q4N3N6o9n9j5no0Q4Q8p9mM7L0K4j49J55K6pj28o0
$$ plain form
2967 1663 710 833 5603 8606 4874 580 562 392 278 332 292 92 761 271 140 253 112 357 137 347 180 186 202 121
2685 121 211 312 379 231 49 159 110 58 233 74 191 178 61 156 237 91 180 191 46 258 261 135 145 133 188 143 50 166 173
2345 173 226 44 66 57 134 392 168 89 167 192 98 205 194 151 49 97 284 56 57 132 84 185 92 56 106 141 46 27 154 165 349
1981 349 247 116 138 27 131 89 115 150 112 173 165 159 42 135 39 177 248 245 259 222 149 147 296 249 166 105 150 125 34 120 71 251 100
1594 100 159 144 211 113 198 106 189 158 15 79 204 190 169 248 75 164 137 92 174 252 167 56 40 137 193 99 66 108 109 90 21 9 179
1207 179 30 104 115 43 243 89 108 93 90 57 118 52 222 82 129 68 86 61 79 267 947 756 198 58 175 75 125 131 85 165
854 165 105 227 29 53 98 55 232 325 53 158 95 115 98 142 5 102 171 107 54 85 129 28 191 141 184 167 154 61 83 194 173
491 173 188 183 110 162 135 60 203 180 120 63 111 150 76 191 107 160 216 147 88 73 68 8 92 180 101 97 144 174 198 49 204 230 223 95 35
80C5O3N4M9r6P1j31J51j01p5L8Q5Nm7J9l1K1J05L5j72l8qM5J3
$$ plain form
80 35 98 152 201 105 176 45 196 95 20 58 143 148 101 120 89 110 215 250 78 40 32 77 90
-190I0
##PAGE=	F1=2365.81
##FIRST=	25169.313707327481097,	5807.6787752999953227,	0.10908211022615432739
##DATA TABLE=	(F2++(Y..Y)), PROFILE
5808D8mL5nP0j9km4R0l4M1j8L5n2q2L3L3R8l2l2nJ1o6J4r6K03j78Q2Q9j5j5J8q7k2p2R4NJ5
5373A34L4M6J3q2l8K0n2L5ol1J6Kl6KN4M4%j7J19k1j72L3N5Kj00J27J58o4j5k09J40j23Q7
4986A55N5j45J31j26J11Oo2r5P0J2J32l7q1j9M4r1O3o7K8NK1j03M2M1j7J24J12j80O4n2k1
4622A20o6mJ51rN1J37q3j53j06P3j4l5l1N5M5J7j10J10m9M2j4J15j33o7J16j17J73n4n3J8
4270A25O2k9K5m5n9J47j57K00j42Jr5M4J48P4L3q1j44J2J46k1p0j3p0j5m7O2k5N6l2O5r8j8
3894C9K78j39o3N5n1P3j08KQK5m8MJ14j01K1n0J12l4r5J11J15j63J09j54N4j3J8k3l0KN9Q7
3519B14j11J59n7op2M6p4m6R1r0Q6l9R4j52J63j2o9RQ6Q2l3J17l17K82K163Q34k977L889P31
3178D991L86l210k015K76j11j21q7K81L01l76M346J0094j02j3158J1629m271p414n00m24J90
$$ plain form
5808 48 44 79 74 144 125 123 79 169 135 176 158 193 141 59 92 125 223 191 159 154 165 99 113 17 220 42 124 213 198 183 201 114 92 20 114 119 134
5373 134 168 214 227 145 107 127 75 110 104 73 89 91 55 57 111 155 155 138 257 236 64 97 152 154 54 181 339 275 260 51 191 68 155
4986 155 210 65 196 70 181 187 125 30 100 112 244 207 126 107 151 60 123 56 84 89 110 7 49 90 73 197 309 129 193 141 120
4622 120 54 50 201 192 243 380 297 144 38 111 97 62 31 86 131 148 38 148 99 141 127 242 109 42 158 41 214 160 107 125
4270 125 187 158 183 138 79 226 69 269 127 128 33 77 225 299 332 251 107 119 265 244 174 161 91 76 29 91 66 122 90 155 57 39
3894 39 317 178 115 170 119 192 84 86 94 119 71 75 189 88 109 59 171 137 42 153 268 105 214 60 114 101 119 96 66 68 127 214
3519 214 103 262 205 199 127 173 99 53 144 54 140 101 195 43 206 194 125 134 220 302 269 386 69 351 2514 3348 371 4260 4991
3178 4991 5377 2167 152 428 317 196 109 390 691 315 4661 14755 14653 1495 13124 8853 1439 939 515 705
2944G05L568K159k840l141Mj52m5l4j4j47M78l12j35J55j22K20k11J99j28kj5j69J79O5J26
2650C91j48j56L9Mm3J40j79J87o3j24P4J16j11J0P4j65J45P9j25m5oR9o1j05J81j6L4j56M5
2310A15m4P8K25k00o7N3K8r7O0j%r6P4J53k59L0Q6m3N7o1k4O6J7j32O8O1K8J52p9q7k6p3K4
1923H6J4J3N2k1qP2p1p4N9m3J23J3MM4n1r4kJ39kj63jJ17q2q3O5m4J78j28M1mQ9j52O7J2N5
1512B20%j84M7Q0l8N8O7k24J02l8k3P7P1o4o1l6O5P7p7j1RJ3k3o8j4J64j45K7Oj2J88j48L1
1124A36l8m1mN8n0J31j20O8n9JrPJ62N41k03l94q7P9o3l5M6n3R8o5J04j94K6K0J1J34Q4j97
749I4R1l7o7RL5j23P3N3l4l5L2O6j07J79n3N2m2j3j16L8Q9qN0j7o7Mj4k6Q7l4m2p1J06N8j63
338D7J76j21K6J00m1n3o3l7%K7J02n1J4K4j7N9j30J57K7j4j48n4M5Q1N8q5J5q2J17o5m7k1
$$ plain form
2944 705 4273 6432 3592 451 455 303 258 224 210 63 541 229 94 249 127 347 136 335 207 205 190 21 200 265 391
2650 391 243 87 126 130 87 227 48 235 172 48 122 238 127 137 211 46 191 270 145 100 94 193 132 27 208 192 226 70 115
2310 115 71 149 374 174 107 160 188 91 151 150 150 54 128 281 22 52 138 95 152 91 67 133 150 18 86 147 175 327 248 161 135 62 86
1923 86 100 113 165 144 136 208 137 63 122 79 202 215 219 263 212 118 116 255 253 90 89 206 124 41 106 62 240 112 153 149 238 86 153 165 220
1512 220 220 36 83 163 125 183 250 26 128 90 67 144 215 151 90 54 119 196 119 108 117 130 107 39 25 189 44 71 77 65 253 105 136
1124 136 98 57 53 111 61 192 72 140 81 82 73 80 242 783 580 186 99 178 115 80 126 73 171 106 210 16 42 62 73 207 291 94
749 94 185 148 81 90 125 2 75 128 94 59 91 157 50 229 176 228 186 173 57 95 184 176 226 209 142 146 132 106 193 159 117 46 152 210 47
338 47 223 102 128 228 187 134 71 34 34 61 163 112 126 150 133 192 62 219 246 232 84 30 75 156 214 129 144 62 179 114 67 46
-38D6J31k5p8N1l3QJ34Nj66kl5M1L6
$$ plain form
-38 46 177 152 74 125 92 100 234 239 73 71 36 77 113
-190A13
##PAGE=	F1=2263.55
##FIRST=	25169.313707327481097,	5807.6787752999953227,	0.19942510128021240234
##DATA TABLE=	(F2++(Y..Y)), PROFILE
5808C5nL6J0N5o4R1j16J73n3Kj4qm7PL3j4R1J1q0OOm3M3r1K09k41M1J04L5n3ln8n3l0J05R
5385A29l1O9L8l2o0o6N6m2O1J3r1RO5o6QL0N9k3J4O4Rj58L6J19Rj28P3J15o3%j91J48j26O6
4986A13O8j38J78j59J16k6l3j07J02n8J95l6j02J6N2j25MK6m5jj1qL3L7l7J42J49j56p0N1
4634A70Oq7l6J30J0L1J74r1k30PO3j5r8M0n0P1L0p8R6l9L3j2J55j93n6J10r5J73o3n0P4M7
4258B27q6O4r9l9J20j11J36n8n2o0K8J49P9L5r6j07M5N2MNm9j43L1l6J5qN1L6P6j47n6K86
3883B92p4j32P3k8M9j20LK0Nok8Q2q8M9%M7l6j3J20N8k15J39j29Q0%m6K9j10P8kR8r6J28k
3484B25l7r5L7pm9J6n4Q8J1jn0P3o1O3j4L4O5oL0j83P1R22L65j287K055O86O6j841j059K89
3132C52n5j78k8K10K50l19K620N740o56o347O294k804m348l63o5K09K192J241j800j855M6
$$ plain form
5808 35 30 66 76 131 67 158 42 215 162 164 150 142 95 102 135 121 212 223 143 149 155 112 155 64 273 32 73 177 212 159 156 98 45 15 120 129
5385 129 98 167 205 173 113 47 103 61 122 135 44 53 118 52 60 90 149 126 140 204 213 55 91 210 219 91 164 279 216 216 25 173 47 113
4986 113 181 43 221 62 178 152 119 12 114 56 251 215 113 129 181 56 60 86 41 40 29 21 54 91 54 196 345 189 119 170
4634 170 176 89 53 183 193 224 398 307 77 84 147 132 34 74 24 95 125 47 143 104 137 125 280 87 31 141 46 219 156 106 180 227
4258 227 141 205 106 67 187 76 212 154 102 42 70 219 298 333 237 130 175 227 231 236 187 44 75 39 54 46 97 133 209 62 6 292
3883 292 218 86 159 131 180 60 63 83 88 82 54 136 48 97 97 144 108 95 215 273 58 197 68 148 148 102 131 21 99 97 195 99 227 225
3484 225 188 93 130 123 74 90 36 124 135 134 84 157 96 159 145 179 244 238 268 85 156 1078 1443 156 2211 2897 2963 1122 63 352
3132 352 297 119 91 301 551 232 2852 8592 7936 1589 7883 5079 731 368 303 512 2704 3945 2145 290 336
2885C36j42Pp3Nj18K99j29j32J88m3J11j54J46o2l2j3j12J31K3J67j28j23n8O0k4J23k34K64
2556B83j19j23Q3P1l5p8J23j71P7J33j16o3mJ03n8k2J50j8J6j35P2q4Q3J68j57o4K9L4p9n
2204I4J5K8p2R4R3k35K3J04l4Ok2l1P1Rj33J29K2J0J01o1j7p0l8o3O6J8P4j3o8J47j17m5M7
1817A32RP6l3j7Q8n1j12j0J11M7k14J42Q0j48o6P8n6J53p3RRR0j83M9J19J7K5j93J3N6n4J15
1441B08K2j63K4l4j6O1O5m1j4m1K8R0n2K0l7K8j6l6k8J03j17j9NN0J55j26M9m8p8K5J8nO4
1054A44q3O2m5QnQJ27L47k10k02k0O2l3j35R9m5Q1m2O1j58Qj3Q9N6Q1j15P0j8j18K0J1o4M2
667G0K0j4MK2O5j10J93o0N5m9j8j40Q2N9MO4k9n0j6NrN7p4k6l3J05P0j93J85j55RJ39k2n4
268A56q0o7P0l6R7j6K3ll6O2o8J13L6Kj58o1K1R0N4m6m7k2Q3l5k0m3J38n4p0L5k8oJ41rj58
$$ plain form
2885 336 194 201 128 133 15 314 185 53 241 198 309 155 301 239 207 194 82 213 236 403 275 152 94 154 130 253 19 283
2556 283 164 41 124 195 160 82 205 34 111 244 128 65 61 164 106 84 234 216 232 97 169 85 168 336 179 115 144 178 99 94
2204 94 109 137 65 159 252 17 40 144 110 116 94 63 134 143 10 139 161 171 272 211 194 124 86 23 89 107 181 168 100 247 130 85 132
1817 132 141 217 184 167 255 204 92 82 193 240 26 168 248 100 34 112 56 209 136 145 154 244 61 110 229 246 271 78 91 147 93 208
1441 208 230 67 91 57 41 102 167 126 112 71 99 189 137 157 120 148 132 96 68 171 54 35 40 90 245 119 168 120 42 67 85 80 144
1054 144 61 123 78 86 81 89 216 563 353 151 131 193 160 25 124 79 160 118 179 21 29 16 105 161 242 127 197 179 61 81 92 28 70
667 70 90 76 80 102 167 57 250 190 245 196 178 38 120 179 183 247 218 168 152 157 148 205 131 105 72 177 247 54 239 84 93 232 210 156
268 156 76 9 79 43 140 124 147 144 108 170 102 215 251 253 95 34 55 145 199 153 106 84 167 132 112 69 207 153 83 118 90 84 225 216 58
-143E8L9n1M6L3
$$ plain form
-143 58 97 46 92 125
-190A25
##PAGE=	F1=2161.3
##FIRST=	25169.313707327481097,	5807.6787752999953227,	0.25035345554351806641
##DATA TABLE=	(F2++(Y..Y)), PROFILE
5808B0jK9L5L5n5J12j66K28m8m9rl1l5Q6K7n4O8P8j28Lj1k9O5o3K18k14r2J36N4q2pn2k5j5
5409B8J07on0Q6L1p7j5p2N0l9Q4J9j28Q4L1o6oK2P7o2M1JM3q5k0J74K8j41JP4o4Mj01Q5r8
4998D0M9P3j17J88j55O9m2Lr2J06j3J38m1j38Q2N5j38K4L4p7P3o0JJK5l9J50J48j18j81J41
4634A89L5q2p3Q9J3L3J73q5k72J08M4k3j42J10n5kL2l0Q9k2J2k1J77k31k0O8n0J61q1m7J34
4270B31J5j29R7j30k6P4n7Q2J2n5k5pJ20N5K3q0l6O5n0K2N7m4j72K0k4QlK4R1J01j76l0J91
3883B44nj68P9mJ7j21j6N3J6k5m2M6MK4K3jl9N4J25kj79R4j15J33lj07P6q2O5n8P9p9J02L8
3484B26n8j16P6N4r3kmO8J4m6N5q1o3J47j8J8K3Jk7q5n4K3O4j6N14M62j05o48k76K18M6j55
3108A62p7J75J71k12J032K103q02j239J965j314j710q1j0J45R22M39q26p17J07j29K3n3mj6
$$ plain form
5808 20 19 48 83 118 63 175 9 237 189 140 131 100 65 151 178 124 192 270 142 145 134 105 170 107 325 111 19 155 209 127 120 68 43 28
5409 28 135 129 79 165 196 119 104 32 82 43 127 146 18 102 133 67 61 83 160 98 139 140 183 98 78 252 280 139 140 214 150 154 53 138 40
4998 40 89 162 45 233 78 147 105 108 16 122 109 247 206 68 150 205 67 91 125 48 121 61 62 63 88 49 199 347 229 48 189
4634 189 224 142 69 158 171 204 377 292 20 128 172 149 7 117 62 60 92 62 151 129 141 120 297 66 46 114 64 225 144 97 231
4270 231 246 117 214 84 58 132 75 157 169 114 89 82 202 257 280 200 164 229 179 201 258 214 42 62 38 46 43 67 158 259 83 53 244
3883 244 239 71 150 146 163 42 26 79 95 70 28 74 78 102 125 124 85 139 264 262 83 177 62 195 192 85 161 79 144 86 165 86 188 226
3484 226 168 52 128 182 89 87 83 151 165 119 174 93 30 177 159 177 200 201 174 89 35 58 122 106 620 1082 977 329 53 271 317 162
3108 162 85 260 431 219 1251 3354 2552 1313 3278 1964 254 173 163 308 1230 1669 843 126 233 104 127 74 70 54
2826E4P9J9j20K12J0nq1P3Ro5K8m5O0J0K13j03j66r4P3J1J18k57K56j41o8O4k5O5j01Q9j42
2462C0P8R4j11j3n4Q2l9O7J07j8K9j42J12j18Q5R1j10n9J4M4m8n7J3L5k6R3K6j50k5J22l4
2099A18l6J7n6O9Rq7J43J9m0M1n1O5r9k0n2K7K9R7j1j00J92j21n2P8K1K0n3p3J46l6j26rN7
1711A26R4j31J59J8j95m6J13q8J22nk7K2P7j76L2J87l6N1j71k3M5j7J00k7r6n8rk1L6O2k1
1347I7K5k9k3J05k4L3o8M0Mj0l8K5p4n7PQ4J25r0O7l4j18L9l5N0j8l5L8k6M3l4J6J24J36k13
948A32k3M5O6j6j82J04l5M8lPr8Qk0R7k8Q7m7L9jj15J1j9J0K8k9j8M4J5N4j04J93o9N0m0k9
538A62j29J32K5pO0l4l4qK3j7N2j24j3K8P2O7j75J60j88J4J65j7o0p3o6J06m8N1PK8l4j4L1
150A42j5P1L2L8j51p4PP9L9Nq3J8O9l4jl8J16o5m7lk2nJ15j0j48P6o1O4J6
$$ plain form
2826 54 133 152 32 244 254 249 168 241 250 185 213 168 228 238 451 348 182 88 161 172 290 33 289 148 80 144 119 184 83 172 30
2462 30 108 202 91 78 24 106 67 134 241 223 252 110 222 104 189 280 170 111 125 169 121 64 77 112 86 179 205 55 30 152 118
2099 118 82 99 43 112 121 34 177 196 156 197 146 211 112 92 40 67 96 193 182 82 274 153 101 179 200 220 167 94 240 204 78 69 126
1711 126 220 89 248 266 71 25 138 50 172 167 140 162 239 63 95 282 246 297 126 103 148 131 231 204 108 50 41 20 56 118 97
1347 97 122 93 70 175 151 184 116 156 160 150 112 137 63 6 13 97 222 132 199 165 47 86 51 101 83 48 86 60 103 69 85 209 345 132
948 132 109 154 220 204 22 126 91 139 136 143 45 53 33 130 102 189 142 181 180 65 76 57 67 95 66 48 92 107 161 57 250 181 231 191 162
538 162 33 165 190 183 243 209 175 167 190 173 225 101 88 116 188 255 80 240 52 66 231 214 154 81 15 121 73 124 131 159 125 111 142
150 142 127 198 230 268 117 43 50 129 168 173 90 108 177 143 142 104 220 155 108 105 83 78 193 183 35 111 50 114 130
-190A30
##PAGE=	F1=2059.04
##FIRST=	25169.313707327481097,	5807.6787752999953227,	0.26122251152992248535
##DATA TABLE=	(F2++(Y..Y)), PROFILE
5808C1k3K3P0K0j1O3j47K10k8r7Kj4m5J36K7q9L4J43j54ql5l6P9pK14j80j17Q9M1r5Pp6M8
5420G5oQ6l7n6J04K1j14L3mk9n0J02Pj06J28k2l8k8J9R4j02N2n0P3k4o0K08N1j36p0M3n2k2
5033I0J1j4m3R0L6j16J78j21j1l0K1o7R5P4M6n3j75J48N7j25P0ko8J12n9l4m5J6%J29J04q1
4657B33j73J37N5p0j01M5J1N3J37p1k06J04K9l8j26J26nq9K5PR7j3j8l7J78k37J8J9kJ43j06
4294A25m3J81j8j55J19j37j9L8JJ6M7k3j6k2P9PJ2k9M5O8j51L2Q5oj51l8k3L7rj2J21J28j82
3906A07MQ5L5j55O7J5j8r1j9O0L3p4m7Q1O2k8K5k3m1R1J12m1r5L2j33J85%j56J12p9Q0p0J9
3519A35p3Q9O0m7j29J31O3j28J5MO4Jk4P4j96P8O3j3L5k9j0m1m2N2L68Q1m59K17p0L3lk39
3143F0J34J39r6j58J83R1j32q2L60M68j30p38J63l8L7j15N7k0j1q2o4J35n6j0j7l5P9o1P0
$$ plain form
5808 31 8 31 101 121 110 173 26 236 208 111 113 99 54 190 217 128 162 305 151 143 108 72 151 144 358 178 61 150 191 96 103 27 75
5420 75 69 155 118 62 166 187 73 106 102 73 23 125 132 26 154 132 94 66 85 179 77 129 79 152 128 68 276 327 191 121 164 112 90
5033 90 101 87 44 134 170 54 232 111 100 70 91 24 119 193 239 186 11 159 216 91 161 159 91 203 144 110 65 81 81 210 314 233
4657 233 60 197 252 182 81 126 137 190 327 256 50 154 183 145 19 145 140 51 76 83 180 167 149 112 290 53 71 90 88 231 125
4294 125 82 263 245 90 209 72 53 91 92 108 155 132 116 94 173 180 192 163 208 276 125 157 242 236 85 47 24 61 52 40 161 289 107
3906 107 111 196 231 76 143 158 140 49 30 90 123 49 2 83 145 117 142 119 78 169 281 240 145 177 44 229 229 73 185 106 186 116 135
3519 135 62 151 211 164 35 166 229 101 116 120 184 185 161 235 39 117 180 167 202 173 163 122 80 132 500 581 122 339 269 302 299 60
3143 60 194 333 237 79 262 353 221 139 499 967 837 99 262 224 261 146 203 183 172 90 26 161 105 95 78 43 122 61 131
2803A31r3K30Kr3k0jP3r4R9j0MK9L70j03l45o1K6N9J10k38J62r2j4J9q9J29n3j6n2J26j8j31
2427D6O3q0K2k0J36N7k1P5j57J47j42Q0Np5l8J5N5j5q1k2K8L3P2l5o6m2J12m2n7N6q5N6J4
2040I4l6J41L5r8k0l7J32j12j9Mj1J2J07nj03J99r5q0J26J2l9m1j43K04j6j33KrJ28m1J44
1676C02m3j96j0J24j36J05N0n9M1N7j56M4J92j05Q2j23n1K6L1P2n2o2j11K9j8j5O2j0N6mq8
1312C4J23JK5p4L8L6J2m8l1k6p9j0P8J14m5P7qj50M4q1R9r9MJ1oR1r2K3J60l6j10J3Q1P7m
901B42j87P7l5L6J9l9m8L4j8O0r8J02mlJ6n6k8k1N7L8p3n1O8K0M1p3J55q3L6j5m7n4J51rl6
491A74M4l0l4J9L7l2N9j61jQ3L4L7j27J29k19M3J69k4o4m9o4J25l8OJ9K6o3J7JK1M2J7P1j32
92A35p7lO5L2L3p2J3P8o1Nj6P8m8l3l6l%O0kj39J05o4Q0K
$$ plain form
2803 131 38 268 270 177 157 156 229 135 234 224 228 257 627 524 179 118 144 203 313 75 237 145 131 150 61 190 137 121 69 195 177 46
2427 46 109 29 51 31 167 224 203 278 121 268 126 206 211 136 98 113 168 153 72 50 78 111 183 148 82 40 152 110 53 109 24 80 94
2040 94 58 199 234 136 116 79 211 99 80 84 73 85 192 187 84 283 188 108 234 246 207 166 23 227 211 78 80 71 199 158 302
1676 302 259 63 53 177 41 146 196 137 178 235 79 123 315 210 292 169 118 144 175 247 195 133 22 51 33 18 80 70 126 122 34
1312 34 157 158 183 109 147 183 195 147 116 90 11 1 79 193 148 225 217 67 111 30 129 30 34 45 39 130 38 61 221 185 75 88 169 246 242
901 242 55 132 97 133 152 113 65 99 81 141 43 145 141 138 154 98 70 49 106 144 71 20 88 108 149 76 231 148 184 169 122 68 219 210 174
491 174 218 188 154 173 210 178 237 76 75 158 192 229 102 231 12 55 224 200 136 87 23 148 110 116 135 161 98 115 116 137 179 196 267 135
92 135 58 55 120 152 185 113 126 204 143 148 132 210 162 129 93 90 90 150 148 9 114 50 130 132
-190A32
##PAGE=	F1=1956.78
##FIRST=	25169.313707327481097,	5807.6787752999953227,	0.35216698050498962402
##DATA TABLE=	(F2++(Y..Y)), PROFILE
5808E4l3J2R5K4jJj16J83lj34K1L3q0J61L2j21pJ87j48j8n6o0P3P4J91j48r0K9J0r1L8q2N9
5420H9L6M7p3o7J44Oj39O3O1r1m9R6k8n0J40p2Ql9J2R8j21M1o6Q8ko6K14P1j17j14K1j0q0
5033E1Q5j04RJ58Kj36J57q1q7K2ml4O6J56l6o0j27J12N9r5J01l7m5J29n6n3r4J2O0R8K4n0
4657B02q9Q2O0n8j21J2K6P2Q6o1j32P6K8n8r2J23M0j23K9NJ16k0n2m9J62k16N1j1K8J19j31
4294A04m0K07l7j71J29j30j2N6L0p0M0K3rk9M4m8M2K6R9N6k40M5Q6L9j30n9l5O1j4l8J21J44
3918B90j62L1K4J4j01L3L9n4l3jK5M7o8n3J17N7p9K4k7k9R1P9n1j9J1j85K23J0j81J33r6J05
3542B14n2m8q7J08O1j4j23J41M6j40K5lO6kK3M6k30J54pj8N9n0k5l3m5J19M22Q5n83N53J16
3178G78L1l72l90Q0J71m6j91K19K7j12J90J350L77j712R69n11n73m4j06J07K62L52l68l69
$$ plain form
5808 54 21 33 128 152 151 152 36 219 216 82 103 136 56 217 249 128 121 308 160 142 86 26 99 173 364 216 126 155 165 74 112 30 89
5420 89 125 172 99 32 176 182 43 106 167 76 27 123 95 45 185 113 121 82 94 192 71 112 46 134 132 66 280 351 234 120 141 131 51
5033 51 136 32 41 199 201 65 222 141 54 76 72 38 104 260 224 164 37 149 208 113 214 177 132 261 205 152 58 70 130 228 252 202
4657 202 113 195 255 197 76 88 114 186 272 211 79 155 183 125 33 156 196 73 102 107 223 203 151 102 264 48 99 88 116 235 104
4294 104 64 271 234 63 192 62 50 106 136 66 106 129 120 91 135 87 129 155 254 310 70 115 201 240 110 51 16 77 63 25 146 290
3918 290 128 159 183 197 96 129 168 114 81 80 105 152 84 31 148 205 126 150 123 94 185 264 213 194 205 20 243 253 72 205 109 214
3542 214 162 114 27 135 196 182 59 200 246 106 131 128 194 192 215 261 31 185 178 160 219 169 144 111 66 185 607 692 109 662 778
3178 778 809 437 47 127 298 252 61 280 307 195 385 1735 2112 400 1369 858 285 241 135 242 504 856 488 119
2897A19%K9%l7l4R9j11N1o6K49n3j43K2n6J14j23J85nl2N1N32j11n23Mn6J10R2j92K1N1j2
2533A75n2jN7Lj07M5J58r1j66J00m8J5l0J19Oj9J34j54J61j59P1q0o6J2L5N4J7j09n4J5R2
2169A33M2q3Nm2Q3n8m5Q4o7J5J2JJ29N1j42o9K4J17j07k2L5J3l3J02J1j01J81n4j05J61lq9
1793A79rj02J55lj29Jn1J40K3J19q9j61L0J20j86J05O9q0O7L7j47P9J56j81J15n9o4rO2O7
1441B54m6o1r9L8k8k8L1j0Q2J5r9Q9J9jn1J1P6L9o3l9Lj21JK8J30lP6J5j68M9j03J28q7n1
1042B6j0K0J16j38J6J98j20N0n6P3P8J7j91O8n6O3Mo4k1P2k4J5j13R7J1m9M1K3r2J7O1O7r8
655A01o4L4M1L1l0Q7j05J5K7p0M8J53m6o4K3k0m7N0M2m2O9j76J9J15J3l2n9R8j81K8J49l4
279A73o4j3m8J06k5k0L5J3q7K8rM7L0PQ2j17o1j9O4N0J6m3j0R6j04KK3K5kl5n5L4moJ0j05
$$ plain form
2897 119 119 148 148 111 77 176 65 116 50 299 246 103 125 69 183 60 245 240 208 259 791 680 157 161 105 215 307 115 136 187 175
2533 175 123 122 179 182 75 120 278 187 21 121 73 88 58 177 183 164 298 144 305 146 217 137 71 83 118 172 189 80 26 41 133
2169 133 175 92 97 55 138 80 35 119 52 67 79 80 209 260 118 49 73 190 83 61 96 109 76 178 189 88 269 215 110 271 268 179
1793 179 170 68 223 220 91 92 41 181 204 323 234 73 103 223 37 142 211 131 198 235 88 167 323 142 257 198 134 125 187 254
1441 254 208 147 48 86 58 30 61 51 133 148 49 138 157 156 105 116 192 231 168 129 132 11 12 40 170 167 243 258 90 139 36 164 77 26
1042 26 16 36 152 14 30 228 108 158 102 175 253 270 79 147 91 154 158 94 73 145 121 136 23 120 131 82 123 146 54 71 132 199 101
655 101 37 71 112 143 113 200 95 110 137 67 115 268 222 158 181 161 114 164 206 164 233 57 76 191 204 172 113 211 30 58 207 173
279 173 109 96 48 154 129 109 144 157 70 98 89 136 166 173 255 138 77 58 122 172 188 145 135 231 127 129 152 177 175 140 85 119 115 109 119 14
-143A4R5n5P7%
$$ plain form
-143 14 109 54 131 131
-190A31
##PAGE=	F1=1854.52
##FIRST=	25169.313707327481097,	5807.6787752999953227,	0.28657335042953491211
##DATA TABLE=	(F2++(Y..Y)), PROFILE
5808F7k4K2R4M0k7n1r6J82J4j49K7Q1j12J67L8j54m8K02j14j7o5j1k9J59J45j20l9j9j9p5
5456F9O7n0oJ05rq2o7J64j1j50P2J15j30k3O4q3J2J34j06O3l8KQ1j17K5m9Q3j6n1K00P8r3
5080B53j21QK9j12R0j01k0K19j3j49J18m3j10M7l6NK7K10j01o1p7N9O0n7J16o6j2J24n0n7
4728A79j31QJ18P3p5k7JM1M4m9j28JP9N7M5o9q7N1M8p9n9J13O3j20M0pJ35m1q3n4J40j86Q1
4340A22pM0Q4j58l6K12l5j86J29j20JJ01M3j60nP5Ml4K5k2J03NJ14L4l05P6N4O4j12l3k0L5
3965H8k1l8Q8J46j20M8K7p8j8j5O7q7L5Nj5O1j9r8J43M6j20K9l3JO6L1l8L5K1k20K18K6j80
3578H1J37j16J16k1r0p2J22M2Kj25J31K3j27J8rO6J3P0jk30J83k6m7P9l4l7l7n1J27K52K3
3214D62l77M40J89l1l44l11M6J27j8j50K71j5j47K64J138J26j526J175o70l90j17m9J68L21
$$ plain form
5808 67 43 65 159 199 172 121 25 207 221 72 99 180 68 235 273 119 71 273 159 142 77 66 37 196 341 221 182 163 144 69
5456 69 136 86 80 185 176 94 27 191 180 30 102 217 87 64 128 45 57 191 85 148 110 112 193 76 101 52 135 119 68 268 346 253
5080 253 132 140 169 57 147 46 26 245 232 83 201 158 48 95 59 64 91 301 200 139 62 121 181 124 240 174 162 286 236 179
4728 179 48 56 174 247 172 145 146 187 231 182 54 55 134 191 236 167 80 131 179 100 41 154 217 97 137 130 265 224 141 87 227 41 122
4340 122 115 155 239 81 45 257 222 36 165 45 46 147 190 30 25 100 104 70 95 73 176 181 295 329 24 100 154 218 106 73 53 88
3965 88 67 29 117 263 143 191 218 140 122 107 174 87 122 127 112 173 154 56 199 245 125 154 121 122 188 219 181 216 237 17 235 261 81
3578 81 218 102 218 197 107 35 157 199 201 76 207 230 103 121 112 178 191 261 260 30 213 187 140 219 185 148 111 60 187 439 462
3214 462 85 525 714 683 339 28 74 201 183 33 304 289 142 406 1544 1670 144 1319 649 259 142 93 261 582
2932E82L41m77k69p4N9M7n2m3R1j70P0m6K58j15j66N3J4M8j13K04k4m4L3N52q5n42O7j41J45
2592B03P2j30p2J84n3j35J36n0M0j12Q2J59j14j77P2JM6m9N9m0J4J66j31J57j70N7j45l7M1
2251G4O7L5M9j50p2LJ46K2j29O1l5M4p9kQ6k9jmJ6J08N7j56p5Q0K5p9OQO6p0Q2L8j06J50j5
1840B21j10J64j0j29L1n3J10Kj18j6n9J27N5R8j16j26Q2J16k00Q2N2q5R9K5j48J10R9k46J52
1500B09%o3n1O5R0k2p1q3O0n6k2Nj3R6J5n4J6K8l2rl8J18O9q8j6K0j62K2k4J43M0N8K2j66
1101A06N4j17J60o4j08mL2J04r1l2J73j38R0l4M2O1N4j79O2j01J14l4p2j3J16l6k3o3N9lp0
737D5P6P3j54N6L8J06j09o6j8P6K7mJ6j11k6Q0p4J31J38q7o9Mro3O5L4l4P6j74M5J26K1j38
350I7J6O8j16%J17m4o0L3j6N0j9l3O8lj03%KQ1K2J6P3j19l3l7O6Q0k0k4k5J11j47pP7m3N9
$$ plain form
2932 582 923 446 177 103 162 209 157 114 205 35 105 59 317 202 36 89 103 151 38 242 218 174 207 759 674 132 199 58 203
2592 203 275 145 73 257 204 69 205 155 195 83 165 324 210 33 105 106 152 103 162 122 136 302 171 328 158 215 70 33 74
2251 74 141 176 225 75 3 6 152 174 45 106 71 115 36 34 120 91 90 86 102 210 267 111 36 116 141 62 68 76 142 72 154 192 86 236 221
1840 221 111 275 265 136 167 114 224 226 108 92 33 160 215 313 197 71 153 269 69 151 203 118 217 242 94 204 303 57 209
1500 209 209 146 95 160 250 228 157 74 134 78 56 61 48 144 159 105 121 149 117 108 70 188 257 169 153 173 11 33 9 152 192 250 272 106
1101 106 160 43 203 139 31 27 59 163 72 40 213 75 165 131 173 234 288 109 171 70 184 150 78 65 181 145 122 59 118 115 45
737 45 121 194 40 96 134 240 131 65 47 123 150 146 162 51 25 105 31 162 300 213 144 148 139 76 141 175 141 217 43 88 214 235 97
350 97 113 181 65 65 182 138 78 111 95 145 126 93 161 158 55 55 57 138 160 176 249 130 97 60 126 206 186 162 137 248 101 94 171 128 187
-61A87m8n7P3j1o5K5p2O8l2M6R
$$ plain form
-61 187 139 82 155 144 79 104 32 100 68 114 123
-190A23
##PAGE=	F1=1752.27
##FIRST=	25169.313707327481097,	5807.6787752999953227,	0.032512690871953964233
##DATA TABLE=	(F2++(Y..Y)), PROFILE
5808F0NL9Q3N7o2q8p6J90K1j20rJ16j32J62M3j87q4J90o2qn4N3p4J49Q5r8K1n3l1n4Q5k2r0
5420E5J79p4l3m0J13k4j48P3J46j41%L7j24L9J16j15J12k2j7M9r6J7m9R9m7m3J81O8p3r7O
5056A47M8j34P5m4o0K27j1j37N8j2q1K7m5L6J0K16j50o1m8K2O3k4J20r2K9R8m2n0j44LJ62
4693B06N5j72qO8K3J6m3j20L5J21J8K2q6q1M2P9r7k7R0O0q9M8qJ40p0j02n4J21j62J07L4M6
4317B12L3j83l4J98pk04J24j07LJ44O0k28O3k4K5j7L2O2J09m4J07Ml26J18LM7r4K1lLm2k3
3941C2N0J31n8O0O0k01P4o7R6j15J06kn9P7L2j41J49L6j46M1m6M2L0k4j2O4M1k22J78M9j54
3578A01J17j20J02J2j02j7J13J7k0j28J13Oj01jJ0N1L7J04n3k31J94J1q8Q4nn1m3m5Q7N6p2
3214A38p7J05Q5n2p0r9NL5J7n1K90k6k03J05K99l6l87K90l19J69j82O6R5J25K03l32J1r8L0
$$ plain form
5808 60 65 104 187 244 182 94 18 208 229 109 100 216 84 246 289 102 18 208 146 138 84 137 63 212 297 199 220 167 136 82 167 145 55
5420 55 234 160 127 87 200 176 28 101 247 106 106 143 19 58 174 59 171 149 132 181 85 102 53 152 105 62 243 311 238 141 147
5056 147 195 61 136 92 32 259 248 111 169 157 76 103 58 94 104 320 170 109 61 83 146 122 242 150 179 277 235 185 41 44 206
4693 206 261 89 81 149 172 188 145 25 60 181 199 221 135 54 96 175 78 51 141 201 112 160 152 292 222 120 66 187 25 132 166 212
4317 212 245 62 28 226 219 15 139 32 35 179 239 11 74 50 75 58 90 152 261 217 324 328 2 120 123 170 76 97 94 97 55 32
3941 32 82 213 155 215 275 74 148 81 177 62 168 166 107 184 216 75 224 260 114 155 109 151 181 157 145 209 250 28 206 255 101
3578 101 218 98 200 212 110 93 206 223 203 75 188 194 93 92 102 153 190 294 241 10 204 215 127 211 206 155 112 67 154 210 138
3214 138 61 166 251 199 129 30 35 70 87 36 326 300 97 202 501 465 78 368 49 218 36 102 197 322 525 193 204 106 136
2873A36J04m2o8P3j70O4l0K38j31j52O2J17k2m1R2o5l5l7L96k1l57J13j77J25N5o4J6J36j00
2533B15j57K08j33M4n4O8J36j08j85L4N0P5o1mn7Q3J29r3J42j74M0j42P2n3R3J4P6j87l1j5
2181B5J45K3j75J01l1J4m2j7O7J3Nl0K4Q3M5j28o4R0q3j3M5n5J16q8N6P3j08J01J0q6J32q
1805B40j56O8k5R5Oj03m3m7R6N8R1j28j01J39J16j77L2J1p4J31K8j44J09L8k21J30L0m9p6
1465G4K7J32Op5p9R7q8j0qj3Q7Mjm3L0o2M3r1J48R6j25J3L6j62K4pP6R8K0Nj45O1j15J87n8
1054A82j41PM2O8k7n8J03q2K0N0MK5J03j53N6j54J59p4p4j5J60n1m3k0L8k6k9Q0Q0j58M3p
678A08J45j03p0n1J10L0j1m0j6k2J2k1J30J01j23l7rj0m9L6J3LP0j69P4J25N4k42O9L8n9j2
303G4Q6n7n5Q1K3j5k9l9J18j2j19k7K7J01kL1P1j31j2m5N2J02m4k2j6J15j66k2J28j18J18
$$ plain form
2873 136 240 198 130 203 33 97 67 305 174 22 84 201 179 138 230 165 130 93 489 468 111 224 47 172 227 163 179 315 215
2533 215 58 266 133 177 123 191 327 219 34 68 118 193 132 128 71 154 283 190 332 158 198 56 128 75 168 182 258 71 40 25
2181 25 170 193 18 119 88 102 60 43 110 123 128 98 122 205 250 122 58 148 65 52 97 42 158 70 126 199 91 192 202 116 248 240
1805 240 84 152 127 222 228 125 82 35 131 189 280 152 51 190 306 129 161 172 98 229 257 113 222 260 39 169 199 150 74
1465 74 101 233 239 164 85 182 94 84 76 63 150 154 153 110 140 78 121 30 178 274 149 162 198 36 60 53 129 227 247 252 107 168 53 240 182
1054 182 41 48 90 158 131 73 176 94 114 164 168 193 296 143 199 45 204 130 56 41 201 150 107 87 125 99 70 150 230 72 115 108
678 108 253 150 80 29 139 169 158 118 102 80 92 71 201 302 179 142 133 123 74 110 123 126 196 27 101 226 280 38 107 145 86 74
303 74 160 103 48 129 152 137 108 69 187 175 56 29 56 157 155 186 257 126 114 69 121 223 179 157 141 256 90 68 196 78 196
-61A96o4n1J00j5j05M2o2M9qLK2
$$ plain form
-61 196 132 81 181 166 61 103 41 90 82 85 107
-190A07
##PAGE=	F1=1650.01
##FIRST=	25169.313707327481097,	5807.6787752999953227,	0.27905172109603881836
##DATA TABLE=	(F2++(Y..Y)), PROFILE
5808C2M9N8O7P2q4j12k4J55K6o6o0J21j32J44M9k20m6J05j2Mk3R5q6J08K3q2P5p2l4j8Q9k
5432A99j73K34j39O1l5M5k7j21O7J44j26J4K1j09oQ9r4J44Nm7J4o9J8p6J42p2o0J65M9p0n0
5068A37J7N2j61O4J0m4J63Qr9k0J2m2Ll5N4J7J94j81o5l1pQ3j9J20j09O2N8l1l8j33jJ82M2
4681B62k34K4P4K5j6l8p3P3J24k0%q9r5O5R1j08KN6L2l3M5MJ22r4j04n1J03j42J23J05M6l2
4305B47j94l3J65M1k06J08q0k5J74Q1k46J43j48J5N9M2P1J06p4R3k9k93J26l1op1P7J2j7q0
3953B7oL4J01QP5Q8l15J52j03J16j38J75j8j03Q5P4j61J31L1j53N5o8Q1jp4J7O8N1k01J32
3601A60Q2j18P9j00O9L0q9M0J05j0o4j19R8qp2j9O3K5M0J20r6j67J21Q7j12N5J2o2l0m1K8
3237A07P9q6n3J40J19M7k24q4j6P6O6j17K79k4j82J91O10j8o15M11qn04j53R0j1J18J63k4
$$ plain form
5808 32 81 139 206 278 194 82 58 213 239 173 113 234 102 246 295 75 29 134 122 126 103 198 112 220 243 161 236 164 130 112 201 199
5432 199 26 260 121 182 147 192 165 44 111 255 129 143 164 55 49 138 44 188 193 146 160 91 109 33 175 103 43 208 257 187 137
5068 137 154 206 45 109 119 75 238 246 147 127 139 97 100 65 119 136 330 149 84 53 46 129 110 230 121 183 241 210 172 39 38 220 262
4681 262 28 52 126 151 135 97 24 97 221 201 201 112 17 82 173 65 67 123 155 122 167 171 293 199 95 44 147 5 128 233 279 247
4305 247 53 20 185 226 20 128 48 23 197 278 32 175 27 42 101 143 214 320 246 339 310 17 143 112 106 35 112 124 107 27
3953 27 21 55 156 164 239 327 12 164 61 177 39 214 196 93 178 252 91 222 253 100 155 87 168 167 93 110 178 229 28 160
3601 160 242 124 203 103 172 202 113 153 258 248 184 65 163 155 83 64 127 152 192 312 216 49 170 257 145 200 212 150 120 79 107
3237 107 186 100 47 187 306 353 129 45 29 105 171 54 333 309 127 318 928 910 295 706 698 194 41 131 120 238 401 377
2909C77j60r9l0J47k1r2N3q5mj0J85p2j17L6J72m7lj6j18j1l1J88l7j06J34j52N1N0pJ10M7
2545C32j26o9J59j67MK0L5J06q5j93K2O7R8o9m3J5Q8M9n3J25j74L0p2J18j31R9QR3k03Kl8
2181D7J37L9k06J23l4PJ6q0N5L8K8p2M2N9J2n8q6R2j19M3L2o9J09q6L5J06r9M0J3l8P3Oj69
1793C6R4k6J03J9q9o5l0O0L1J01j36o4J71J19j30k9m0n3J59M6j36P7j9r6N2J7l3m8o5J74L5
1430B35p0q2J34j08Rj8j8O5oM2p4K9q6Q6p7J15J05j66L8M3j31K2qJ1J78l4l3j09O4p1J79o5
1054A99j56L3M3K2L8p7L2J5r8J42k9k4J51j24N5j68J57j05o7k9J90o6l2LK1l8J7P3O6j23K
690A23o2J69p5p5m5J18L5m9p4J15j7o7J6J13M5j44K4j0k7k0j5j2O9M2j68J00J21R2k53L1J2
326A12k4KO4p8m3J15N4n7n3n1J76j0j45L0J8Q4m9L4R3j25k3l9J7J04m3l3K3J10j43k8J33j74
$$ plain form
2909 377 217 118 88 235 214 122 175 90 86 76 261 189 72 108 280 233 230 214 96 85 54 242 205 99 233 81 132 182 175 285 332
2545 332 206 137 296 129 133 153 188 294 209 16 38 105 203 134 91 106 194 243 190 315 141 171 99 217 86 185 193 286 83 85 47
2181 47 184 223 17 140 106 113 129 49 104 142 170 98 140 199 211 153 67 159 40 83 115 46 155 69 104 210 111 151 164 126 199 205 36
1793 36 130 104 207 226 137 72 42 102 133 234 98 34 205 324 194 165 125 72 231 277 141 218 199 103 155 172 139 91 26 200 235
1430 235 165 83 217 109 118 100 82 147 141 183 109 138 52 138 61 176 281 115 153 196 65 87 79 90 268 234 201 92 156 85 264 199
1054 199 43 76 119 141 179 102 134 149 51 193 164 140 291 167 222 54 211 106 39 10 200 134 102 105 126 88 105 178 244 121 123
690 123 61 230 155 80 35 153 188 139 65 180 163 96 112 225 270 126 150 140 113 93 78 66 135 177 9 109 230 322 69 100 112
326 112 88 90 154 76 33 148 202 145 92 41 217 207 62 92 110 194 145 179 272 147 124 85 102 206 163 130 153 263 120 92 225 51
-49E1J47p1n2J12j0j34O3o3L7Pl3L0
$$ plain form
-49 51 198 127 75 187 177 43 106 43 80 87 54 84
-190H4
##PAGE=	F1=1547.75
##FIRST=	25169.313707327481097,	5807.6787752999953227,	0.39272111654281616211
##DATA TABLE=	(F2++(Y..Y)), PROFILE
5808A1Q0O8N5Q3p9j35J7J04L3Jj01R5j05J02N9k47K1J0J9RL1J11j10Q6k6o9J03p1l6L0Q5O
5432B40k34K50j73J48m0k8j7p1N5J14r9K1J8j01m8O2o1J58L8q2j4m3J7r9J90q9j04J62M2j04
5080A08QM0N4j56L3L4kP1M0m4r3K7j5mk9N7L3J77j86o8j6l6J14m8J14r2N8J1j7k7j00pJ78
4693B17K5j96K9J3L8m3l1j1R4J03n0l3o7l1N0O1j10K5J9pL7K7K5Q4j03q7l8O9q7R1J89L7j01
4305B38j83k4J08J00k06J08o7l5J68R6k53K07j79o6J54N2K2J01p6P5o0k29J02m7n5l0R6K0
3977A37j6q3oL3N5M8R3R9l24J29j08J18j51K32l4j44P8J01j53R9K8j41O2r0J07j9r8M4M2L7
3624A75j59Q6J27q9L1n6L4K2n5Q6R3l6r9r5Q8k0n4k0J02K0J1J26j28r5L5J70j18KRn9om6j9
3237F3J87q1p0K88K81j0m44j60K2J04P1k06K49m1o1K41J040m4j024P88k96p44p6K3R1K68J69
$$ plain form
5808 11 91 159 214 297 218 83 100 204 237 238 137 232 127 229 288 41 62 72 91 100 131 242 132 218 192 123 226 155 119 149 234 240
5432 240 6 256 83 231 191 163 146 75 130 244 145 166 184 83 35 97 36 194 232 150 136 93 110 11 201 112 8 170 212 108
5080 108 116 156 210 54 87 121 119 190 230 186 93 120 105 101 72 129 162 339 153 85 69 33 147 99 213 121 179 190 173 146 46 39 217
4693 217 242 46 75 88 126 83 52 41 135 238 188 155 88 57 107 168 58 83 102 95 132 159 184 268 165 78 40 109 22 113 302 339 238
4305 238 55 31 139 239 33 141 74 39 207 303 50 257 78 12 166 218 240 341 265 340 280 51 153 106 51 21 117 137
3977 137 121 38 32 65 120 168 261 360 36 165 57 175 24 256 222 78 156 257 104 203 231 90 152 62 169 150 52 96 138 175
3624 175 16 102 229 140 171 115 149 171 116 202 295 259 160 65 153 133 79 59 161 181 192 318 190 95 130 300 182 184 193 134 128 82 63
3237 63 250 169 99 387 668 658 214 54 76 180 251 45 294 253 192 433 1473 1429 405 1193 897 153 77 100 191 459 628
2920F28q5l23q4q0J44pq9L1qo0J9J09K6j04J5J93n9L1j02j51PJ16K69j61j71J22j21pN7L9
2568A94J46m6j18M0Q3j54o7Q5oQ8n5j68L3K2J05p9j3Q5M0k8j4R9j64M1pJ36j76Q2K6R4k00
2204A04K7p4J33M6k18J39m2J9N9j46Q1J9O2j24P1L9l6M2j39R3j7pk3l1O4o0J8J21q2j5pJ7
1829A33J1L2j43P5n4J25M2p0p4l0N3l8J22j50K5J34J24p3q4q5k6J76O4j31L5o6K1Rj9k7J4
1465A25o7R3O4o0p5J49j06L1k9l2M0NM9o8K5r2J03n2Q1R4j97N6K7p9K2k5m7K68q9q1o6N4J5
1077A36J34q0j59P4L4k1Q7p6j6M4j27J76m2p2J76j03O7j36J14j14l4l3J50q0J1O%k8M2N3M9
714B32p6l7r6J52k0q3k2J10L7j06q6K37k0j24L5R8k4j39R2ln0pn0kJ14jj47R4J18J23k46j3
338I0Kj8M0M4j00oJ14O7p1o5q1K32lj75Q7J1P2j08K1J23r0o4k1k3P6k0m3P8J03j05k7J11j90
$$ plain form
2920 628 543 220 136 56 200 193 104 135 127 67 86 195 221 117 132 325 266 297 195 44 51 167 436 275 104 226 105 98 155 194
2568 194 340 294 176 216 299 145 78 163 157 245 190 22 55 77 182 103 90 175 215 187 173 272 108 149 142 278 102 184 210 304 104
2204 104 131 57 190 236 18 157 115 134 193 47 128 147 209 85 156 195 159 201 62 155 138 131 108 77 141 81 99 220 138 123 116 133
1829 133 144 176 33 108 54 179 221 151 77 47 100 62 184 34 59 193 317 244 160 75 49 225 289 158 193 127 148 157 138 111 125
1465 125 58 151 215 155 80 229 123 154 125 93 133 138 187 119 144 52 155 103 184 278 81 137 164 85 107 82 35 303 214 133 67 121 136
1077 136 270 190 31 105 139 118 205 129 113 157 30 206 164 92 268 165 232 96 210 96 62 29 179 99 110 116 116 88 130 183 232
714 232 156 119 23 175 155 72 50 160 197 91 5 242 222 98 133 231 207 68 160 157 107 100 50 48 162 161 14 108 226 349 103 90
338 90 92 74 114 158 58 52 166 233 162 97 16 248 245 70 157 168 240 132 153 276 186 122 101 78 154 134 91 169 272 167 140 251 61
-49F1J32o4o9J13%j47Q4o3L1Jl4K4
$$ plain form
-49 61 193 129 60 173 173 26 110 47 78 79 45 69
-190F9
##PAGE=	F1=1445.49
##FIRST=	25169.313707327481097,	5807.6787752999953227,	0.37876823544502258301
##DATA TABLE=	(F2++(Y..Y)), PROFILE
5808F2K9O8N4R1n8j67M7M8M2O8j22N1n2L1P1k43O8m9K2JJ02J04j52R1n4o0R9m8m2Q1P9Jk44
5420A9K02j21J61n2r2Lj1M0O8p3K7K9j02m8L4o2J63P3j12l2k2Rn0J75j07p8J06O1j92O4O8
5056A48O6r9k4J5M3j9P7J1j09J6k4J1l2M1M7J76j70o6j5m8J32p8R8m0J8l5Jk5n2j5J53jj33
4669F8K4l6M9o5j1J0J26O0o7p4j3M2K6K7r9K5km2R3kM9L3r1m6k8K0l5N6K61J7j63j52qM0J56
4258B48k11J30p7j3J41R1k52K48j86j10K15O6o1R7n0N3q2j43M0n4k7k5P1K1J3n0mJ2K9L5J03
3894B68R5l00Q7q1J02j42K60m3j77N6J19j28O0K7j18N7j00J09k1n9M5j4mo7J0J76p1k0OJ2
3542A44j7qJ12P5n6j01o6P5k1m9j8J01M0k8J30j48l6j5K19j22n9Km5Nm1l9J99j31P7K09K51
3178F39n9m21j09Q8J8K5j24J11q2J55J3P09qp84M96k10l71N9p5K11R5lm3j27l8r7Q2nol2L2
$$ plain form
5808 62 91 159 213 304 246 79 126 174 216 284 162 213 161 192 263 20 88 39 61 62 164 268 116 207 153 93 192 144 102 183 262 263 19
5420 19 221 100 261 209 117 120 109 149 217 144 171 200 98 50 84 22 185 258 146 114 92 101 51 226 119 41 147 208 16 80 148
5056 148 214 115 91 106 149 130 207 218 109 125 101 112 80 121 168 344 174 108 93 45 177 99 197 157 175 140 141 116 64 49 202 201 68
4669 68 92 56 105 40 29 39 165 225 158 84 71 113 139 166 67 92 90 48 141 139 188 221 130 84 56 76 41 97 358 375 212 60 52 92 248
4258 248 37 167 90 77 218 309 57 305 119 9 224 290 229 326 276 329 247 104 144 90 63 38 109 130 143 93 89 101 130 165 268
3894 268 363 63 150 69 171 29 289 246 69 125 244 116 176 203 85 142 42 151 130 71 116 102 98 31 41 217 146 126 132 144
3542 144 127 119 231 306 250 149 83 158 137 88 70 171 211 183 313 165 129 114 333 211 152 154 109 114 73 34 233 102 179 388 639
3178 639 580 159 50 138 156 181 57 168 86 241 254 963 955 171 667 457 86 145 70 281 376 373 330 203 165 68 150 145 139 107 139
2815A39p2K9M1J00q4j0J90p7P0j58q6l7J44K66j41k01R4j05k2P1P8J08j31p7J41J1j17j38
2486B6J28n0R5k2j09Ql0R4r5Q3R3k1p5K0O4j43Q8J9J27j80M1O5Q3j89M7j11J19M1j90J30m3
2122A13K9R5j98J36l6R5j68J01K5q2J48k04R1P5n0r7J8L4rqJ13o3m5l7N7m0O9j00L4p5J17
1758A38P8m1o5n6Q4r4R0r5N9O1J23j6j21j09J7J59O5j29Pj00J21j9n1m0Q7l0l0Q3m9m1J23
1394B09p8N7m6n8L0M0J4l1K0p7Q7l6O1P0j80M6k2j5K6m5l5K74j26j10k9J9J29O5r4j60J20
1031A25J7m1J01m1m8m5K5R7k3r3J50q8Q8q6O9r3rm5Q1r0Q2rl3QN1J3L4l1o1m0L4O1q7j0R5
620A58L2j62K7K18k5j58M4Q4q2p5R8J0o0k1n7N5J06m8j10O2J21J35k45l8J3l0Q7J8j15L9J06
256A87N0o7n1j09K65kj95J29JO7j57OJ40m2j16Ml4KJ6l4J16R9p0k3Q1j87J03l9j01J07Rj10
$$ plain form
2815 139 67 96 137 237 153 143 333 256 326 168 82 45 189 455 314 113 207 102 80 151 229 337 206 129 270 281 164 26
2486 26 154 104 199 177 68 76 46 140 45 128 221 200 125 145 209 66 154 173 300 120 161 226 309 120 167 56 175 216 26 156 113
2122 113 142 237 39 175 139 234 66 167 192 110 258 54 145 220 170 73 91 125 116 108 221 158 113 76 133 93 162 62 96 21 138
1758 138 216 175 110 54 138 44 134 39 98 159 282 266 145 36 53 212 277 148 155 55 176 157 106 66 153 123 93 176 127 86 209
1394 209 131 188 142 84 114 154 168 137 157 80 167 131 192 262 82 128 106 91 117 72 37 311 185 75 46 65 194 259 165 5 125
1031 125 142 101 202 161 113 68 93 190 167 74 224 136 224 138 207 114 105 60 141 51 133 124 91 99 150 163 197 166 105 65 99 160 73 63 158
620 158 190 28 55 273 248 90 134 218 136 61 159 169 109 88 31 86 192 144 34 96 217 352 107 69 82 52 139 157 42 81 187
256 187 237 170 119 10 275 273 78 207 208 275 118 124 264 222 106 110 76 78 94 60 176 275 205 182 263 76 179 140 39 146 155 45
-120D5P4o3L3l1kK0
$$ plain form
-120 45 119 56 89 58 56 76
-190G6
##PAGE=	F1=1343.23
##FIRST=	25169.313707327481097,	5807.6787752999953227,	0.39295247197151184082
##DATA TABLE=	(F2++(Y..Y)), PROFILE
5808A08k7O2O5R6m0k00O1JM7J26j14NMn2P8j66O9q7Lj3J68Q5k02J12n9n5O6mn5J25P2j4k38
5420B7J33lJ09o7j33K7M4K4J9o1M0N1j04j2K8j20J61J03j26m1rpQJ55j25k1N8Q2j60m7R7Q9
5045B19l4o7k7O1p2J05N1p8Mp5M0k9JN1J84j45o4k3n3J42q7Q0J6k4o9J4k4j2k7J23l8p5J9
4657H7k8L9q9L0j7J63jp3n5L3P0lJ6o9j3Pm8R7l4O9j8o5Rm2Jj1L1L03j1k11j09J7k4J95k17
4247B9J62j05L4J09O3k40K60j71j20K40Q2j54R9lK5r2o1l5n9K8n7N9J8O3k7J2j9K5rQ9Q6k63
3871F8N7l4P3j21K65l7k03M7J23j11K3K8j03M9r0Q5rmM5p5l6K8l9J72n7p0P3No9M1J08N5o4
3484B23o8n5O1Mo4j9O8O7n2J38j62J0j5K15j34j12%l4j1pj8J32j45K28K1o3p1j5q4J61m4m2
3108A13N7r6J46M0J21L71P9k33L27l59m98K36r8J50j12L27k28j88N2j32L2M3J11j12nl2lJ8
$$ plain form
5808 108 81 143 208 304 264 64 125 126 173 299 185 190 194 142 220 54 123 36 39 26 194 279 77 189 130 75 141 137 82 207 279 265 27
5420 27 160 157 266 199 66 93 137 161 180 119 159 210 106 94 122 2 163 266 140 99 90 83 91 246 121 100 158 240 80 33 130 219
5045 219 185 118 91 152 80 185 236 158 162 87 127 98 99 150 334 189 125 102 49 191 104 184 200 176 107 121 97 85 58 181 143 68 87
4657 87 59 98 9 39 22 185 184 111 56 89 159 156 172 103 90 97 49 146 112 181 163 98 107 65 66 55 86 389 378 167 58 75 51 246 29
4247 29 191 86 120 229 292 52 312 141 21 261 343 189 288 285 310 218 157 122 63 91 34 93 111 174 147 159 140 165 156 245 331 68
3871 68 125 91 164 43 308 271 68 115 238 127 150 178 75 124 34 119 110 106 151 76 40 68 29 201 144 74 147 152 83 124 232 287 223
3484 223 155 100 161 165 101 82 150 217 165 303 141 151 136 351 217 105 105 71 60 53 35 167 22 250 271 208 137 122 38 199 155 113
3108 113 170 74 220 260 381 752 831 598 925 566 68 304 206 356 244 571 343 155 207 75 107 150 261 149 144 112 109 127
2779A27R8m6m2J80j13J09j87Po3N2ok4J2P1j00J0P7J16J0j95j8K14l7q1j49J19r8J20J3n8
2427A18l9n3P0o5J29O8q1o5L4J5p4J26QR3j49j2J08O3j70N9j30Q1K2j09Q5l2L0J25k25J88
2075B18j00J21j81J16J5r5K18k59Q2J31p9j69O5L5N0m6Q6m2m6n1N4p0J09q4J3j6J9J19Jm9
1723A65q4J02q2j5K7K0j7J09K7j27j08O6J14L6j28J4p8J62m8o9o1J42jj00N1l2J5O0k5Q0o9
1359A46r5M7P8l6J8J2m9N2l2M7M6j16Rr6N2L8l5RJ86j34q1j9l9K39j2r9j01R3mk8P5K4q4M8
960A59R9j20L5q5P0o1J02l2L3n4jo5J1o8J41l4p3O0O1n1J7Kn1Rq4J53q4j7P8J6j07M7J62k9
561B39j67M8O9p5lK9K6m2n8m5R8R5q9p7K5J33J25k38n7M3m1J18j2j05O8J07Rn9j8j30K78j3
185B81j92J47j8O9j82J0J22Jj60L6Oj13N0J6R3R9m6j6M9j67O9Lj32J05Km2M7p1M1p6K9L2
$$ plain form
2779 127 225 179 137 317 204 313 126 133 70 122 116 92 104 175 75 85 162 278 288 93 75 289 252 171 22 141 43 163 176 118
2427 118 79 26 96 31 160 228 147 82 116 131 57 183 191 284 135 123 231 294 124 183 53 134 156 47 132 100 130 255 30 218
2075 218 118 239 58 174 189 94 312 53 135 266 187 18 83 118 168 122 208 166 120 69 123 53 162 78 91 75 94 213 214 165
1723 165 81 183 101 86 113 133 116 225 252 125 17 83 197 233 105 119 41 203 155 86 25 167 166 66 117 85 100 160 135 215 146
1359 146 51 98 176 140 158 170 121 173 141 188 234 118 127 31 83 121 86 95 281 147 66 47 8 247 235 136 35 128 124 96 171 195 111 159
960 159 258 138 173 88 158 97 199 167 200 146 145 80 91 23 164 130 57 117 178 127 144 146 95 104 20 173 89 72 150 166 59 106 268 239
561 239 72 120 189 114 111 140 166 124 66 21 119 214 125 48 73 206 331 93 36 79 38 156 144 39 107 214 223 164 146 16 294 281
185 281 89 236 218 287 105 115 237 238 78 114 120 7 57 73 166 265 219 203 252 85 154 157 25 130 132 90 137 66 107 31 60 92
-190I2
##PAGE=	F1=1240.98
##FIRST=	25169.313707327481097,	5807.6787752999953227,	0.36469420790672302246
##DATA TABLE=	(F2++(Y..Y)), PROFILE
5808A39p6N4Q3R6l5k01L2j1M4J60p8l3L8j19O9o8Q2j05l0lJ76O0k39J34m4o0J7N6p2J51O7
5444B84l6k21O0J18M0q0j44M8Q4J0k0p0O6P5j04L1L1j50J12J21j12m9ml3O1J37j39M4L5Q1
5092B76j24j35Q8J15K2r1o0L6o0J01O5l5Qj42P5j0n0L3J89j14o4l2n0J38p0O4N1n0p2Rj8Q
4716A01l7R7p9l0J3J3J9q6M2j3J57p3o7P3OM9l3L4l2p9M3m9P7o4Q5n9m0O9q4L0j8J5L11m7
4317C44k32o8N2n9J94k21J93j43R8P7J7k16K44j39j20K53R5k37J10N2j2r2mr4o0O3r0O4K7
3977I6J13k2M0n5K1m6M2P2k06M5J4M3j03K55j9k18P1J07j14pK9j02L9o1N2PL6N2j25L1J6l6
3601F7J06l0j11J22J0j06P2P6L5n4k7n7N5M6r2j1J6P7m4J40j63N5mJ71j55j29Jn4K1jL2N0
3225A14j4J90NK38n1j96k36J88K13J45k69J05J80l55R94K049k31j231J446j370j797M15j75
$$ plain form
5808 139 63 117 200 296 261 60 92 81 125 285 207 174 212 93 162 94 176 71 41 38 214 274 35 169 125 65 82 138 66 217 284
5444 284 248 27 87 205 245 165 21 69 153 163 143 73 139 214 110 141 172 22 134 255 143 94 90 57 118 255 116 160 195 276
5092 276 152 17 105 220 242 151 91 127 67 168 233 198 206 64 139 129 79 112 301 187 123 91 41 179 109 173 224 174 102 111 93 101
4716 101 64 161 82 52 65 78 97 11 53 40 197 124 57 130 136 185 152 186 154 75 118 69 146 82 167 108 68 137 53 83 65 80 391 344
4317 344 112 44 96 37 231 10 203 60 158 235 252 36 280 141 21 274 369 132 242 294 282 190 186 92 32 95 5 69 96
3977 96 209 187 227 172 193 147 189 261 55 100 114 157 54 309 290 72 143 250 136 129 158 56 95 34 86 93 129 181 56 87 103 67
3601 67 173 143 32 154 164 58 130 206 241 187 160 103 158 204 112 101 117 194 150 290 127 182 178 349 194 65 66 12 33 32 64 114
3225 114 100 290 295 533 482 286 50 238 451 596 327 432 612 257 1251 3300 3069 1838 3284 1914 117 532 357
2955C57K22N88R58p14j332J86k04M1J69J76j94q5Jm4K8L6Lq0J79j65J37j90R1m7N4L50j61
2639C60k87N7r6P1P3J52j16j65j4K38n4n7j12Q5j00R2N3j5r5m5O9J1O0K8j01J0lm5M5J13j7
2275A95M7r9o6J41L9j42N9j17J1kNJ9JJ0J49k10K02j59J34j46J04Qp1K37k92O7J42r0j32K2
1923F6N7J02r5M8j1l0m3J1o0J20q6OL2o3J57M7l0j06Q7o6p2J06j6q4Q3N4j00r3R6P3l2j22
1547C6P1oJ37p5q9rJ01J8p2o3NN9j9N6Q6j03j23Q0R6o4N3Kj9J1l0K9K8m3k9p9K4O2LKP6j15
1124I7j5k9K9K04p8r6l4L3k2J8J2J03j00L57L4m51J22p9k5K5N5J8LqKq6n0L2J20n7j01J10
749A43P2j26pK0%J6n9J23p5k4N6qrJ6R3l0j52M7N2J1ln5M5Jj04k8J25Q9j18n6j2J51R9j93
350A00q5O5l9J14k1o7O0J16l3o6K4j55K87l9j57J43m7O7j76L0Q4K5j89P5P3j00k7M7K5R9k5
$$ plain form
2955 357 579 1167 2125 1411 79 265 61 102 271 447 253 168 169 125 153 189 192 112 291 126 263 73 164 117 171 521 360
2639 360 73 130 34 105 178 330 214 49 35 273 219 162 50 135 35 127 180 165 70 25 94 105 165 193 92 102 99 54 99 212 195
2275 195 242 143 77 218 257 115 174 57 68 66 71 90 91 101 250 40 242 83 217 71 175 183 112 349 57 124 266 176 44 66
1923 66 123 225 130 178 167 137 94 105 45 165 79 85 117 54 211 258 228 122 209 143 71 177 161 77 160 214 114 21 117 190 158 36
1547 36 107 101 238 163 74 65 166 184 112 49 54 113 94 150 236 133 10 90 186 122 175 177 158 169 139 168 196 153 124 45 69 131 134 136 212 97
1124 97 82 53 82 286 208 112 78 111 89 107 119 222 122 479 513 62 184 105 80 105 160 178 181 173 175 89 39 71 191 134 33 143
749 143 215 89 82 102 102 118 59 182 107 83 139 131 122 138 231 201 49 96 148 159 156 101 146 147 43 15 140 229 111 55 43 194 293 100
350 100 15 80 41 155 134 67 127 243 210 144 168 13 300 261 104 247 200 267 91 121 205 230 41 116 189 89 62 109 134 233 208
-14B08j4J9j20K5O1j50J08k5K9K3r5N4j02K7N1
$$ plain form
-14 208 194 213 93 118 179 29 137 112 141 164 69 123 21 48 99
-190I9
##PAGE=	F1=1138.72
##FIRST=	25169.313707327481097,	5807.6787752999953227,	0.20140917599201202393
##DATA TABLE=	(F2++(Y..Y)), PROFILE
5808A51r6M0R8Q5m2j30o9L1L8J47j9o5L5j24J7K6J12j07p1J0J56K8k27J25j6p3l6J26r4J61
5456B17N8o0j92K1J83k4q3j14M7J02Jm6r7J07R0j01O3L3j68P1J26p4n7po8J00J20j42J05K5
5103B36N6j02j35L5J27N7q8q5k1kP6N6JK9k01J08J9q7j7J83p5o9k4n2J18l3O3M9n9m9j0j0
4728I4Ql8P9r1k1QM7jo1M1K5J12j37m0J74j6On8O8Qj58Q7n6O0q8J00p6m1J32j51R0l5KK93
4329C66q4j98o3Q8o0J55j87J81j83J70M4l4j80K05r2j19K55J01k95J30J03n6r3K2j16l1M6
4012G5l3kN9J40l3P1q6J6o5l6N6j31N6M1J9q9K34Ok15R9P9j16k6K1j06J9qK2J4N4O3j62R9
3624A35ql9M4K3j01R6K2j03O1L0J7k7kn7P2P7j23P%K4jJ27j34R8j7J06j81o6l2J6Q2j04O1
3237A03J3j5J95J68P04k60n67k55J56O31L43p23L65J72p71K069L967n73k355K500k618l113
$$ plain form
5808 151 55 95 193 278 236 106 37 68 106 253 234 169 204 80 97 123 235 128 57 67 223 251 24 149 133 60 24 150 56 217
5456 217 275 215 23 44 227 203 120 6 53 155 156 110 13 120 210 109 172 205 37 108 234 160 103 96 28 128 248 106 211 236
5103 236 292 190 55 90 217 274 186 101 80 78 154 210 211 240 39 147 166 79 62 245 170 101 77 25 143 110 173 222 163 114 104 94
4728 94 102 64 143 52 31 39 86 85 24 65 90 202 65 25 199 183 189 131 199 207 49 136 80 140 52 152 76 35 167 16 106 71 73 366
4329 366 282 84 21 109 49 204 17 198 15 185 229 195 15 220 128 9 264 365 70 200 303 247 154 176 60 29 75
4012 75 42 40 99 239 206 277 191 207 142 106 162 31 87 128 147 58 292 298 83 182 261 145 119 140 34 53 45 67 81 135 198 36 135
3624 135 127 88 132 155 54 150 172 69 130 160 177 150 148 91 163 240 117 124 124 148 147 274 140 238 221 327 146 80 48 64 146 42 103
3237 103 116 101 296 464 1168 908 341 86 242 873 1216 493 858 1030 259 2328 6295 5722 3367 5867 3249 136
2979A36O38l16N44J366J653j339k627K96k54L3L12K28k91j70jo4K4k9N5j20J89k18J47j71
2697B1J44PJ54P37l08p08K5n3J08O5J77k29j5r2J97m0n4o3O7o4OJ00K3j41k3J07J4k8kMK0
2333A56o1n6J05P4l0Kn0j05J51J3j05M6o7l9JN4m7N5k9J60j64J79k07J39q3P9Nm6K28l05N2
1970A05J17p7n1k3O4J38j44OK9j0l4l8JQ5j00NO1r0J66Q3j4j20M9m9m0R9m0j27O4N8n0p9J00
1582A44N5j30k5Q5K3J19r1j23O1M1K0rr5J6K4o1J35O3j48l1RR2n3O0oNk1l1J2J6J6o0mm3R1
1171A56L0l5l3p5L7l3J01J57j20r9L2l6l2P7o4J71n5O74l8p24J10r4q9J43m6N0k1M2Oj02m4
807D6P6Q5p4p5J18P9j90l2J6P0j1ON8n8j6K8k8O4j6L3l4j18M1L1R9k0j29O9M9j43nJ33R0j35
408A07n2m6J73O1j00q9L1m0R0J3m4L7J24n4r3O2j75K84p6r0J21q0N5j40L8N8K5j82J02J46
$$ plain form
2979 136 774 458 1002 2368 4021 2682 55 351 97 130 442 670 379 209 208 144 168 139 194 74 263 45 192 21
2697 21 165 172 326 1063 755 47 72 19 127 192 369 140 125 33 230 190 136 73 140 76 82 182 205 64 41 148 162 134 132 136 156
2333 156 95 39 144 218 188 190 140 35 186 199 94 140 73 34 35 89 42 97 68 228 64 243 36 175 92 171 176 130 358 53 105
1970 105 222 145 94 71 135 273 129 135 164 154 120 82 83 168 68 73 134 44 210 293 279 159 208 159 119 218 178 51 115 173 123 44 144
1582 144 199 69 44 129 152 271 180 57 118 159 179 170 75 91 115 54 189 252 104 73 82 174 121 181 175 180 159 128 140 156 172 112 108 65 156
1171 156 186 151 118 43 80 47 148 305 185 86 118 82 50 127 63 234 179 853 815 91 201 107 18 161 115 165 144 186 192 90 46
807 46 122 207 133 58 176 255 65 33 49 119 108 114 172 114 98 126 98 162 146 179 145 27 68 99 198 178 49 118 167 24 19 152 242 107
408 107 55 9 182 243 143 54 85 45 135 148 104 141 265 211 118 180 5 289 213 123 244 164 219 79 117 175 200 18 120 266
56B66j05o8M3n2R9pk4kn6k0J28j75J25n4R1Oj36P3q9k2O8
$$ plain form
56 266 161 93 136 84 183 176 152 150 94 74 202 27 152 98 189 195 59 132 43 21 89
-190H9
##PAGE=	F1=1036.46
##FIRST=	25169.313707327481097,	5807.6787752999953227,	0.2052672654390335083
##DATA TABLE=	(F2++(Y..Y)), PROFILE
5808A47p0NJ06O1n0k0j27L6M4R1L7r8Oo5m3P2J44r1j11J0J44j6j87J02J3q6k9J41j06J54M0
5444B54p8j49O3J27o6o8p1L6J00ko0k8N7Q1r8Q0K9j66N0J20k2o6j7j01J17R9j32J57J9J6r2
5080A89j10J7J14O8n7j15p8N0O2K9K6N7k06J11M0j07p7J63k8p8J3o0P0K0P9Mn8j2l2qlk3O5
4693A25n0n0nN7k6j5M0O6N8j59PJ89k1m5p2J05M5k20J12n9M9j05J16n9p2J80j40P2n2nK56
4329C22j14q8q2P2n6J13j25J34j33J57J4q1j00J18m2q9K21R5l16J49J38j01j01J6q8K3NL1
4000I2q2J10J35n2R5j09J9o8j09J7j9N6L9Op3J99L3j90J06M7r6l4Jq8j6N8oRM7P1j66J17j5
3613A34m8JQ6p3L4L8p7K2nJLLm9J14P5j41K1L5p2M3J08o6J21n2L3k04L4o6Q6J02j51M9L3j34
3214C8K37K62Q07n73n46j12R4J099N34j205O35J16j102L128N737r18l383L217l814m146Q56
$$ plain form
5808 147 77 82 188 249 199 179 52 88 132 223 260 162 168 103 60 132 276 185 74 84 228 212 25 127 140 54 25 166 60 214 254
5444 254 176 27 90 217 151 83 12 48 148 146 86 58 115 196 98 178 207 41 91 211 189 123 106 5 122 221 89 246 265 281 189
5080 189 79 96 210 278 221 106 28 78 140 169 195 252 46 157 197 90 13 176 148 70 83 23 93 113 192 196 138 126 94 86 83 60 125
4693 125 75 25 20 77 51 36 76 142 200 41 48 237 216 171 99 204 249 29 141 82 131 26 142 83 11 191 51 123 71 66 322
4329 322 208 120 38 110 54 167 42 176 43 200 214 133 33 151 109 20 241 336 20 169 307 206 105 121 33 56 61 92
4000 92 10 120 255 203 298 189 208 140 31 48 29 85 124 130 57 256 289 99 205 252 156 122 123 35 19 77 71 80 127 198 32 149 134
3613 134 86 87 173 100 134 172 95 117 112 113 116 119 70 184 259 118 139 174 102 145 253 187 308 256 289 85 119 53 139 241 90 139 172 38
3214 38 275 537 1344 771 225 113 207 1306 1840 635 1270 1386 284 3412 9149 8231 4848 8065 4251 105 961
2967I61m73J002K071K309j975l757L31k60n3M62K78m06k43l8l9j5o6J02j59J98j90Q7q5R7
2685A39P4J97Q08l38q08o7N6P5O0J86l01R1j37J36ko8oN3m7o9J46N8j73PJ45k5j10K6J27k9
2333B04j05j1Q4K1k1k8j6j21J37ro9K7%J8J2k4q8J01p1J58j12J44j95R1k2N6J3m4K01k95L8
1970G4P6l9Rk7N7J55j81k9N7Pk1p7O6L8j09%P0n7J35J02kj26Kk5L0M2m2j45P4M4j3p5Q9O5
1570B24j87P8M6K5J05j02j62J29lOM8n1j0m4rJ46K3j98P4o6P1k0N2j2J5l0l5KNN0q1N9p1J11
1171A88L0p9q4m7O0m4J67J12j31j24J05q9l2J19j24J99L8R40j01q98K2j40j2J36j40N7l9R3
843A82J6j11J0O9M5q4l1J10P8k27Qk7R1m9O7j0l1J3ok9Q4l2jl7p1J5PJ50k9j52Q4P3j59K0
444C6J29R0j44o1l0J50J9Nj06Jm3N2P7m8K7J18n8j29R6j53K33j16mR2j05K2p2J5N4J1j01O9
$$ plain form
2967 961 488 1490 3561 5870 3895 138 469 209 156 618 896 490 247 209 170 155 89 191 32 230 40 127 42 139
2685 139 213 410 1218 880 72 5 61 136 196 382 81 172 35 171 169 101 95 148 101 32 178 236 63 70 215 190 80 106 233 204
2333 204 99 88 172 193 172 144 128 7 144 135 66 93 93 111 123 99 11 112 41 199 87 231 36 127 105 161 174 130 331 36 74
1970 74 150 111 120 93 150 305 124 95 152 159 138 61 127 165 56 56 126 69 204 306 304 178 180 155 185 227 185 40 114 158 145 70 159 224
1570 224 37 115 161 186 291 189 27 156 153 159 207 156 146 102 93 239 262 64 138 72 143 123 175 163 178 148 113 115 120 170 89 148 77 188
1171 188 218 139 55 8 68 24 191 303 172 48 153 64 32 151 27 226 264 1204 1103 205 227 87 75 211 71 128 89 182
843 182 198 87 97 166 211 127 96 206 284 57 65 38 129 80 147 137 106 119 113 84 168 136 135 98 27 42 49 199 170 18 102 175 16 36
444 36 165 255 111 50 20 170 189 194 88 89 46 98 175 127 154 272 214 85 181 28 261 145 141 233 128 150 78 93 147 158 57 126
68A26K13j18j08L1j16R6J1n0kJn2J87j98J36o3J30%j83R3o8m8N4
$$ plain form
68 126 339 221 113 144 28 124 135 85 83 84 32 219 21 157 94 224 224 41 134 66 18 72
-190G2
##PAGE=	F1=934.202
##FIRST=	25169.313707327481097,	5807.6787752999953227,	0.40033364295959472656
##DATA TABLE=	(F2++(Y..Y)), PROFILE
5808A35k1m0J09L6n7R4j30j9N9M1O9j35k4Pl2K5J69o0j32qJ51o9j64R7L5q8J3J17j04J41J4
5444B29r1r6R7M3p5l6n7L8Q7jo8N2MM5r4Q0J7j30L9J14K3p2l4q5Q4O5j13J94J8k8r8o7K8Q8
5045B00N7jj55o8L1O3pM0Q4j56Q6M1j24n5P4K0q0M9n7PP1J05o4m9K0n4j8j2NN0mo3j8L7l9
4634A6L4L6J00J1j36lJ81j2r0o8J31P5k20P7m9L8j07J26l5p5J70p3J2p7jK08j25L1r1Qn2Q8
4258A28o9P9l4J00qj12k0L4ql1J58P4k53J11J50j38j08Kj0L3J1L9j00J21J05p4J08j25L4o6
3906A31m3k6MJ6J9%m5J49N7j41Q0K0m5n1k0m8J6N1m3RK1O9j28P4kn8pJ26m4l1N6m4l4J1k2
3495G7J0kl8J63L9j33J7Q7j25K9J04K2J18r2l8k04J11o5J07Q5j09lQ6j89J84J79L98K6j01
3155G43o35M7J496O68j593Q47K8j261L958P014j179m217L446m660m658R94n86J428K596K798
$$ plain form
5808 135 114 74 183 219 162 256 126 107 166 207 276 141 117 124 92 117 286 226 94 86 237 168 4 101 136 48 61 178 74 215 229
5444 229 138 42 139 182 107 71 14 52 139 138 70 122 126 171 77 157 174 44 83 197 220 148 114 29 113 178 65 259 277 249 151 84 112 200
5045 200 257 256 101 33 64 127 120 160 244 88 174 215 91 36 110 130 50 99 42 49 120 225 161 112 132 78 60 48 53 103 99 36 18 55 16
4634 16 50 86 186 197 61 58 239 227 137 69 200 275 55 132 83 121 14 140 105 30 200 127 139 62 61 269 144 175 84 92 40 128
4258 128 59 138 104 204 196 84 64 98 90 59 217 291 38 149 299 161 53 55 45 78 89 128 28 149 254 180 288 163 197 131
3906 131 88 62 66 82 101 101 56 205 262 121 201 221 176 125 105 57 73 124 81 90 111 180 52 126 124 66 59 185 141 110 166 122 88 99 77
3495 77 87 85 47 210 249 116 133 220 95 124 228 250 368 276 238 34 145 80 187 272 163 160 246 57 241 420 818 844 743
3155 743 108 155 1651 2319 726 1573 1601 340 4298 11312 10133 5916 9362 4702 44 1038 452 1880 4476 7274
2920G274k492m583M05k46j94O07L11n27k92j03M8r6o0J37j72J68j09J9k3K1J29J93M38k34
2639F19n11n0N1J6O1J78l23J41j62R6M2q4M1L4m2q7J51Q5j90L5J68q6j21R7J57q3j30J3O2
2298A78l8J2l7nj03J08Lo6RM9P3mp8p0R1r3J37o2J23j30mJ1M3L4p0J61k38lM4J6K9rN4J49
1899C14j96m0M4K7lr0J01lr8k1O4JR0J01Mj23l2MR8m0k4j26P9L3jp1O9R2j56O5K2J5R3j16
1500A76j53J47j2k5P7Rl6j12O2J48j9k27J51j20L2J1M8j6J0nl4j3KM9r1J06o6J12J2j12mo1
1124D6L2o2J85P9j09j43J56r8m1J28j46J75J37J119j44j003n4k04P1J06j86K6l8J30L3j08
819H7N6O1Pq7kJ03O6k30N8m7N4p7J12p1lN7l9rM7k6J0k0n9j6j5J43k5q0O0N2j35K6J24Q7j58
408A11o9lJ18j9R1j24j9l2%J34o4M6R0o4j44J27j22J64j47P7O6j12l1J9l8O1Jj7K8K65j26
$$ plain form
2920 7274 4782 199 604 358 164 771 1082 555 263 160 208 112 52 189 17 185 76 95 72 93 222 415 853 619
2639 619 108 58 109 125 186 364 41 182 20 116 158 74 115 149 107 20 171 256 66 101 269 183 62 159 316 233 103 116 178
2298 178 140 152 115 110 7 115 118 52 61 110 183 179 101 31 122 29 166 104 227 97 93 104 147 181 111 272 34 31 75 91 120 111 165 314
1899 314 118 78 122 149 146 56 157 154 56 35 99 100 190 291 295 172 140 144 242 202 178 52 131 164 163 92 161 253 97 162 184 199 292 176
1500 176 23 170 158 133 210 219 183 71 133 281 262 35 186 66 98 109 157 141 151 146 112 99 101 150 59 165 99 211 223 111 107 46
1124 46 78 16 201 280 171 28 184 86 45 173 27 202 339 1458 1314 311 257 53 124 230 44 70 32 162 195 87
819 87 143 204 211 124 122 225 291 61 119 72 126 49 161 90 87 144 105 96 143 117 127 107 48 32 17 160 135 55 115 167 32 58 182 269 111
408 111 42 39 157 138 229 105 86 54 54 188 124 170 260 196 52 179 57 221 74 151 217 105 74 93 55 116 117 100 128 393 267
45B67j54J8p8K0L0q5P7l6l1J97j73R8n1J41Mk13J01m9k8J4
$$ plain form
45 267 113 131 53 73 103 18 95 59 28 225 52 150 99 240 244 31 132 83 55 69
-190F9
##PAGE=	F1=831.945
##FIRST=	25169.313707327481097,	5807.6787752999953227,	0.44933083653450012207
##DATA TABLE=	(F2++(Y..Y)), PROFILE
5808A23K4q2J11L0p0J85j34p5P1J9O9j62k8M7Qo0J83j6j22l9J75j21j01M8L7o3K7R3q5J25
5456B17j3r1n7J13l1m5j7k7MQ0Kp0J06k8qp5N8qm5J4J15M8p4n1o6O4Qp9K01K5o1j13j7L6P1
5045A86L9N9j91l6pO9m2N6Q8q8O2K2j40Jj0N1o2M6l8j1P1J33j19l1K2p5k1oJ1L7K8n8j6lM7
4634G4pK7J24k0j22k7J63Lj22m4J43R2j85J6k6K4q4J14k3p8J48J5m4j08QJ54j02J00q4p5k3
4270C1O1l0K9O8M4k2j21L0nj2L2R6M2j76O7J39j55o0O1l0KL8J1p5J18N2r0J06j39O7p1L7P
3883A52m7l6Jj2LQ5P9p5K5K3J4r5k8j6O3L5q6K1rM8p3%L2o4L1J11j0q3O8nj05Q2m5k0K1n8
3460B7J99j8r3mJ26j13m8J22J11R0j21r8j22J00l5O0K7M6r9J44k03J09J17J175J574j212j797
3143F4O4J698P06j780R43o6j128M339P529j275m795L173m947m435Q98o10J654K885L022k792
$$ plain form
5808 123 147 65 176 206 136 321 187 112 183 202 271 109 81 128 136 76 259 243 121 82 257 136 35 83 120 57 84 177 92 217
5456 217 204 113 56 169 138 93 76 49 53 133 135 65 171 143 135 60 118 110 65 79 194 242 168 117 51 115 123 44 245 270 209 96 79 115 186
5045 186 225 284 93 57 50 119 77 133 221 133 195 217 77 78 68 119 57 103 65 54 125 258 139 108 130 55 34 28 39 76 104 46 30 27 74
4634 74 67 94 218 198 76 49 212 215 93 49 192 284 99 115 89 113 29 143 120 42 190 205 161 53 61 215 113 213 129 54 31
4270 31 92 62 91 159 203 181 60 90 85 73 105 201 243 67 134 273 118 58 119 89 91 129 140 65 183 235 145 251 112 179 108 145 152
3883 152 105 69 70 58 61 146 225 150 175 198 212 117 89 73 136 171 85 106 97 145 72 72 104 40 71 182 172 89 157 152 47 129 84 64 85 27
3460 27 226 208 115 111 237 124 76 198 309 399 278 180 58 158 123 183 210 256 157 301 98 207 324 1499 3073 1861 64
3143 64 128 1826 2532 752 1695 1629 501 4840 12369 11094 6299 9472 4525 90 988 378 2032 4917 7939 5147
2909E147m931N10k12l54P18L11o36l03j86J96k14j0J48j45R4n2J7j4m5J54K72o3k94K6l0N5
2603A59n6N5J63l00J42j54Q9N9p3M1J4l8n5J13J04j74L5J73j47k3R8J32j18j33J1M7r2O3l1
2263A04pr5J29M4q8j6N1J05l4r1n8P5r8J15k3J30q7o9lM8O1j06J03j07m2J2L3J8J5N9J22j87
1887A13l2kM5K5q6R8l1o6m5M0O6M2Q0J3j08l7K2J36j25J0p0M7K9Kn7M7J18j44M6J2PQ0j28
1500A47o7Q3On8O2P2n2j55J09J53n2j91J49j29k8K6O2k6%M9k0m2MJ4p9J34n0R3j2j13O8r0
1124F7M5m8J12O4o1r1J23q7o9J33j67J48K07J185j60j015j03k13P9O1j65m3N3P7N3r3Q4N9
796B35k1q0kR0N0j88Q3p7K6p5J23p2j2R1o5J4k7PN3J3r5k5lN6j7j0O1J5r4K2J25P6j77o4J0
385D6R7m6J42j36l1ml5J39p7R6M0q7q2J21j00R8j29R7M3r4q9J03p7M9MN2j9K96j20k04QJ0
$$ plain form
2909 5147 216 726 514 160 878 1189 553 250 64 260 46 36 184 39 133 81 98 84 39 193 465 402 108 134 104 159
2603 159 103 158 321 21 163 9 98 157 84 125 139 101 46 159 263 89 124 297 150 127 225 357 239 106 117 164 72 135 104
2263 104 97 2 131 175 87 71 122 227 193 102 44 119 21 136 113 243 156 87 84 132 193 87 190 83 41 53 86 104 119 178 300 113
1887 113 81 79 124 149 63 161 130 64 19 59 125 167 247 260 152 115 137 273 148 158 88 135 164 166 109 156 274 130 176 188 195 275 147
1500 147 80 163 169 111 173 245 193 38 147 300 248 57 206 77 49 75 137 111 111 160 140 98 102 116 37 171 121 214 202 89 157 67
1124 67 112 64 176 240 179 88 211 124 55 188 21 169 376 1561 1401 386 283 70 149 210 45 2 55 132 185 92 176 235
796 235 214 134 132 222 272 84 167 90 116 41 164 92 80 171 106 120 93 100 153 166 71 46 43 99 82 72 133 148 54 76 201 277 100 36 46
385 46 143 97 239 103 72 68 33 172 95 191 231 144 62 183 83 181 52 149 192 98 9 112 35 84 88 140 121 417 297 93 101 111
9A11n2L5j0Q6j46L1J63j16M8l6J23J5k03Q5l8j0j
$$ plain form
9 111 59 94 84 170 24 55 218 102 150 114 237 252 49 134 96 86 85
-190H5
##PAGE=	F1=729.687
##FIRST=	25169.313707327481097,	5807.6787752999953227,	0.36887213587760925293
##DATA TABLE=	(F2++(Y..Y)), PROFILE
5808A16N0j12J09M9r3K43j40j14P5J7M5j68K4J8M3j38J78L3q2p2J97j52m8J6Kj7J7O6n3J07
5456B16l0p8m5J14p4Nk6J4n0Q3%n5J27m6o7j8J2m8O9k5J21M9p4o5m3O1o2oJ50M0p0r0%RO8
5045A66L0J04k11l4LN6m3O7N4k2M3oj43N3n7N1m3K1%LL1J53j32j3j2r1M3nl3J9M1m0%m3J27
4634A37n1J4J37l0j12l2J03K6j45mJ42R0j34m0%Ln1R2k7p4J16J09q3j21oJ02n2J13n7j47N6
4270G4nk1pJ57Lk6j25N5nm5R6M4J1j26M7J08j53K6J13q6m2N7k5k3J15j5q9Q6j53J08q5R7M1
3883B07p7q2K7m7M4J4J14j7m5Q2L6j65j3kJ13J6j26M2k9Qk2p3Q5n0N5O8K7j08O4L8j53J33
3507A64o9l3P3j23K13p8l1j6J24p4j34J52J78M7j30j41j7O2kk2K1J96k30J84k47J15O90L361
3178D233K207l126l288J23J641O31j705Q94j32o21M203P078j169n064K488m605l610O64n26
$$ plain form
5808 116 166 54 163 212 119 362 222 108 183 200 245 77 101 119 162 24 202 235 153 81 278 126 78 94 96 79 96 162 109 216
5456 216 186 108 63 177 103 108 82 96 46 129 129 74 201 155 88 70 82 34 103 78 199 248 174 109 66 127 65 59 209 249 179 89 89 98 166
5045 166 196 300 89 55 58 114 71 138 192 170 213 207 64 117 60 111 68 89 89 92 123 276 144 131 119 28 71 66 33 52 93 53 53 10 137
4634 137 86 100 237 207 95 63 166 192 47 43 185 275 141 101 101 104 53 145 118 44 160 269 186 65 59 161 109 222 165 18 74
4270 74 69 48 41 198 201 175 50 105 100 55 151 195 206 80 127 235 82 108 221 135 93 150 125 102 217 202 113 199 46 154 69 166 207
3883 207 130 48 75 28 72 86 200 183 138 220 256 91 78 76 189 205 79 121 92 100 78 5 90 40 95 163 190 82 146 184 31 164
3507 164 95 62 135 12 225 147 116 100 224 150 16 168 346 393 263 122 105 167 165 143 164 360 130 314 67 182 872 4233
3178 4233 6440 3314 26 149 1790 2421 716 1610 1478 857 5060 12138 10969 5905 8393 3788 178 842 316
2955C16J566K926K940k838m700N98j61m82P64K65p15k70p4J83k79kJ32j19M0l2M0j9o5J22
2674A36M48L47m51l27l0P8j04J9J51k53J07q6Q5M1m4%Lk9l7Q8J15j22JJ59j88Q8P1Q3j22j16
2322A11j9M0j07R9k1j2o5J47P2j05m7L9J03o2o7n6N2p3R4nJ53p0j06m1O9P4j14J9M2m6j1q
1946G9J9K9O2P8j68k8OJ6N8q2O8m1k8k6k6J20JN1L0q3j2RJ39j97N5kqK6Rk6K7J22j50L2J2
1535A71J2P1j20J0lL8p2lJ24m6j22P9J54p1j27J01r3r8L9Q1m7J5R0Jp4J1m3k4J30n1N8k4o8
1148I9P5j03P0k8QO8%m0P7o9j03J38j77J22K28J130j48r27j24j53J0Nj08K3L7j0P0o8R4O2
796B58l8o4l1P2L1j01P7j19K0m3J04kn6Q1p6K9j07N6R5M4j38l3LorRQ0mo4J9J27N6j94m2J8
385E2Q0n1J45j41l6L0k6P6n7J46k8j27N5P5r6O0o6M3K3o2n2Q4p0RPR7o6K97r7k44NR3q4L1
$$ plain form
2955 316 1882 4808 7748 4910 210 808 647 165 929 1194 479 209 135 318 39 37 169 50 90 58 98 79 14 136
2674 136 584 931 480 153 123 201 97 116 267 14 121 35 120 161 117 117 120 91 54 142 257 135 136 295 107 195 266 349 227 111
2322 111 92 132 25 124 103 91 26 173 245 140 93 132 235 173 106 50 102 29 123 118 271 201 95 54 123 197 83 102 144 98 87 79
1946 79 98 127 189 267 99 71 77 93 151 69 137 96 68 42 16 136 137 188 218 135 123 132 271 74 129 127 119 145 154 128 155 277 127 159 171
1535 171 183 254 134 144 141 179 107 104 228 182 60 139 293 222 95 196 103 5 44 125 78 93 183 184 110 121 78 54 184 133 191 167 99
1148 99 174 71 141 113 121 189 189 149 226 157 54 192 15 137 365 1495 1347 420 296 143 153 158 50 73 110 100 170 102 196 258
796 258 220 156 125 197 228 127 204 85 105 62 166 164 108 189 113 142 35 91 186 230 92 59 62 56 47 56 136 132 68 87 214 270 76 34 52
385 52 132 81 226 85 49 79 53 129 72 218 190 63 118 193 97 157 91 134 157 95 43 127 57 66 73 170 104 401 304 60 65 158 74 105
-14A05M3Q8k07M5J25m9K7m0Q4K4j73O9l5ko
$$ plain form
-14 105 148 236 29 74 199 150 177 137 221 245 72 141 106 104 98
-190I8
##PAGE=	F1=627.429
##FIRST=	25169.313707327481097,	5807.6787752999953227,	0.24809141457080841064
##DATA TABLE=	(F2++(Y..Y)), PROFILE
5808A16N1j19R1Q3j18K66j45j27P3L2Oj49Q5l5N4r1O5O7k6q8J99j72j1K4n4K2MK9oQ0l4n4
5432A18n5J03p2K8l0N2j14R0j2j5J15n3j17O7l3nP2o1J28K7p0p5j8O5r9O4N3O7m9j3k9o4P7
5045A42M0J18k16n6M7L1pO7JK5L1l3j10P1q8M2l3NL8J5j8J57j10on2q1J08l1j7l1L8k6J9n2
4646B8J55q0kJ40k0q3j9mN9j66L3J36P3p6p5J6k4j5O4m0m9P8J82j03j12m4N7rJ02j3j13N5
4270A31o8m0LJ88j5j8j36O6%p2J48Ppj09N4P0j41Q7J48j26q2N6n0M0J13q4m9L2j05Q0r8J30
3894A53P3r5j07R7m7J3n2J73Qj11J66K2k41K1pJ56kj59P3m3l2J3LK4l2M3K3O3j10M5Q6j47
3519G0J09q5nJ10j74J83j22L1J2O2l6p8O9K04Kj18j62P3L0J9KK34L8l73J96k48J45J536O012
3178G736K634n506m744N1J379M61j380P19j41J89L822N505q92m987J554l738k441M33l35J151
$$ plain form
5808 116 167 48 139 222 104 370 225 98 171 203 209 60 145 110 164 73 138 205 179 91 290 118 107 131 77 99 103 132 126 206 172 118
5432 118 63 166 94 122 92 144 30 120 108 93 208 155 38 105 72 67 139 78 206 233 163 88 70 135 36 100 153 220 171 158 129 65 142
5045 142 182 300 84 28 75 106 99 166 167 192 223 190 80 151 63 105 72 77 115 130 112 269 159 153 101 20 128 97 80 49 87 61 80 28
4646 28 183 103 101 241 221 138 119 115 174 8 41 177 250 174 99 115 91 76 140 100 51 129 311 208 96 52 109 100 202 189 76 131
4270 131 63 23 26 214 199 181 45 111 111 39 187 194 187 78 132 202 61 148 296 170 88 144 94 134 247 163 114 146 41 121 23 153
3894 153 226 131 24 121 74 87 35 208 216 105 271 293 52 73 66 222 220 61 134 91 59 72 75 99 67 110 133 196 86 131 217 70
3519 70 179 94 89 199 25 208 86 117 129 191 155 77 146 350 352 234 72 145 175 194 196 430 468 95 291 43 188 1724 7736
3178 7736 10370 4864 120 171 1550 2011 631 1350 1209 1398 5220 10725 9833 4846 6400 2662 221 654 319 1470
2944A470K740K574k648l879N94j14n40P30J70p46k02J86M0k49q2R0p5Rn1O4j2%J7N20O45n39
2639G12n42m3R1j01m2J38j68L5j9Q5J5j7n4J0ql3O4J15n3m5J25j80J56L2K3r2q2p4M0k9O1
2275A20j3k1k3J47Q1j02q4L5O6o1l5n2J9j3P1j4J73o8j26m0O4N9q0p2J65m8l7m1N0K6M9L0
1899B25j58l1J06p7Q9r0L0l0MJ5o2J09k8K7O9o6J2k4J20k17P5N8o8K5J6K2J7R2j59J8J8L2
1523A69P4p5L7r0O3n5r5J47jo4K2J34p5p0M6l8j01N2M6p5P2Q3J6r6J9j03N3J15q0J4mj0L3
1136A63r6Q0Qj04Q2O3rL3m0j31J34j28O4J93R73j18p56j23o7p7n5m5R0J4o8P1l6Q8P2n9m3
772A73o9M6K2MM9j57K7j0Q4P6q9L1p3M1j21O2J10P2j69n1LJ9J5q4J03J6o0K2J21L3j95j1M0
385H0M5k9J01j36m0N6rJ2L6J28r8j01J30K1j04O0k8j6Jj6k4O7o2%rJ23j11K70o1k58K0J44
$$ plain form
2944 1470 4210 6784 4136 257 851 737 197 927 1097 351 149 335 375 126 44 134 59 68 17 81 69 69 86 606 1251 712
2639 712 170 127 218 117 75 213 45 80 61 146 161 144 90 100 92 59 123 238 185 140 265 85 241 273 296 204 122 48 88 59 120
2275 120 107 86 63 210 291 189 105 140 206 145 110 58 77 64 135 121 294 226 100 60 124 183 103 31 196 148 111 70 120 146 195 225
1899 225 67 36 142 65 154 64 94 64 68 83 21 130 102 129 198 132 144 120 240 23 98 156 88 113 129 151 168 260 101 119 137 169
1523 169 243 168 205 115 178 123 28 175 174 110 132 266 191 121 167 129 28 80 126 51 123 206 222 126 145 42 95 210 130 144 140 130 163
1136 163 67 147 155 51 133 196 187 220 180 49 183 55 119 312 1285 1167 411 288 221 144 89 44 134 148 80 151 115 203 275 216 173
772 173 104 150 172 176 225 68 95 85 169 245 156 187 114 155 34 96 206 278 109 58 61 80 95 11 114 130 70 92 213 246 51 40 80
385 80 125 96 197 61 21 77 68 80 116 244 146 45 175 196 92 152 124 108 109 93 69 136 74 74 65 188 77 347 286 28 48 192
9A92j09L6O6Q9k12K3Q5J4L8n5L8J9j38O9l9rj2
$$ plain form
9 192 83 119 185 274 62 85 170 184 222 167 205 224 86 155 116 107 95
-190I5
##PAGE=	F1=525.171
##FIRST=	25169.313707327481097,	5807.6787752999953227,	0.20963059365749359131
##DATA TABLE=	(F2++(Y..Y)), PROFILE
5808A19L3r6M9J10j24K51j43j13P1O2l8j22J27p3L3Mm3N1L0p7J71j87J8N2r6L5Kj1M9M3l0
5444A57k6o1P2l8J6pO9j69Q8l1M4P9m9j00J03p0O2K3q0J24ro5p4LO2o0P9n3J01j4N7n3j25
5056E5O4O2J04k12o2O7J1L8O3m0M4K8m9o1O7j18L7l1K6M8K4p0J40o8j0p7l7J27o9N4r3M8l6
4669G4K9o1J61r1j8J37Jl4j7j01R8j55J8J19N1j9r0K6n5K3K4l9oO7J86j10r5q4J8J7R8L1o3
4282A40M0j14l6L1J41oJj29M4jp6J69j5oj19R1M4j40J10J60j40j11L5m2Q8J14j47L4n5Mk7
3918H2l9Q6R2j17r5J57m0k2p6K08Nj59K28lk87N3k5J81j7j62R9o7m4K3P4j2l1K3j5R1j06J8
3542A03J41j38O4p8K8J32j98J25j11M7N5j7j4OnJ77l2q8j56J37jK7J77M49k56m86J72r1P2
3202B41K404Q680K813p925n996m3R90K39q87M80o8J111L630K852n55m570N84k600j196K76
$$ plain form
5808 119 152 56 105 215 91 342 199 86 157 219 181 59 186 113 146 150 107 158 188 111 282 95 113 165 69 104 106 95 144 187 157
5444 157 131 70 142 104 120 113 182 13 101 70 114 193 144 44 147 77 139 162 82 206 197 132 58 61 123 63 142 89 190 176 233 180 55
5056 55 119 181 285 73 11 78 89 127 190 150 194 222 173 112 179 61 98 67 93 141 165 95 235 167 157 80 43 170 101 155 62 110 74
4669 74 103 42 203 112 94 231 232 198 181 80 178 23 41 160 211 192 102 128 73 96 120 81 75 142 328 218 123 39 57 74 172 203 140
4282 140 180 66 30 61 202 196 197 68 112 111 35 204 189 183 64 155 199 59 169 329 189 78 113 71 159 273 126 160 105 109 82
3918 82 43 129 221 104 9 166 126 104 28 236 241 82 310 307 20 73 48 229 212 50 149 82 38 61 135 123 92 115 100 191 85 103
3542 103 244 106 170 92 120 252 54 179 68 115 170 153 139 145 140 317 285 197 41 178 177 204 381 830 574 88 260 169 241
3202 241 2645 11325 14138 6213 217 174 1164 1403 516 996 928 2039 5669 8521 7966 3396 3980 1380 184 460
2967D60j27N95K374J992k284k623N16j18n46O50L6p09j29M62j29k10j51K7Kk7l0K6PO6l7L33
2662D26O38m14m63k7M2o5o2Q6o0J6l2P2l%r7L5K4k9K1J03J0q0Q1j24J62nm0l3m0j21K8L6L6
2275A21j1l6L1J20P6q1j13L6L%l3m8rN1N5l7J75p0j33J0K3J7k5o9J72m6n6m6P9J8K3j1j60
1887B6lJ88j63J10j10LoL1N1p9N9l7K4J12p8K6n8J01j03k6J00j06L1PO8J9M1j58NK5O1Q8k6
1500B23L1j59P0j6o5J9Q8m4jQ1n3m1NPr3R2oj00J31N0J7j02K7j37J19R8j38j8N4K1k1p5O5
1113A29N6j67O3J11mkPj46J11o0K2J14P52q3n36j08K1j48q7j8J45rq3M9lP3Q4r3j8r3J3L0
737A22R4J0j58J4K4O8J37j11m3n4N0q4M6Q4R6j74q5J9N2M9r0J1N9p4M0R3J1j55MO8jJL7j10
338E0m1N0J6J3R9P3j48J6Q6l5j06Q0j0o4k7L9j7P0p3K1l0J28j41K15k0k08L3J46j36N0O3R5
$$ plain form
2967 460 333 928 3302 5294 3010 387 903 785 239 889 925 216 87 549 420 210 59 86 88 61 31 57 64 130 93 426
2662 426 1064 650 187 160 202 137 75 161 101 117 85 157 154 154 57 92 116 87 108 211 221 141 222 98 260 255 215 182 142 21 49 85 121
2275 121 110 74 105 225 301 220 107 143 146 146 113 65 56 107 162 125 300 230 97 107 130 147 122 53 225 179 123 77 156 174 197 186 26
1887 26 23 211 48 158 48 51 45 76 127 48 107 70 94 206 128 154 96 197 94 68 168 62 93 100 168 187 228 70 75 100 161 249 223
1500 223 254 95 165 149 84 103 191 147 146 227 174 133 138 145 52 144 138 38 169 219 236 134 161 24 143 241 103 85 139 160 139 64 129
1113 129 185 18 81 192 188 186 193 47 158 98 120 234 986 903 367 259 280 132 45 27 172 163 80 129 126 199 283 190 172 79 92 122
737 122 216 226 68 82 106 174 311 200 157 103 153 69 115 199 295 121 36 55 107 156 66 77 136 62 102 195 206 51 55 123 122 123 160 50
338 50 9 59 75 88 187 260 112 128 214 179 73 153 143 79 52 91 74 144 71 92 62 190 49 264 244 36 69 215 79 129 192 287
-38B87k08J4M3N9O9o4Lmj09Q1m6l0k2
$$ plain form
-38 287 79 93 136 195 264 200 203 199 90 171 125 95 73
-190G3
##PAGE=	F1=422.913
##FIRST=	25169.313707327481097,	5807.6787752999953227,	0.28438264131546020508
##DATA TABLE=	(F2++(Y..Y)), PROFILE
5808A24Qo0PJ10j06J97j29q0P1R8p2j09J59r4nR7q8k9P4l9J18j95L8Q3r9J0J7m9J04Jk1%m4
5420I7J8%j1L7O4j71M0l9R8K4k1l8Q9j11J15k6p6J06n2n8n7RN1%Q4j42J32J6J07o5j31PQ7
5033A83P4j95j4J4KP7N4n7M0L1n1k3O4j41L1l0P0L7K6j10R8j9k6p5mJ25j05J57j66Q7o6K6
4657A14o3J43q6l0J32K1K6l5j35J11j56J0P6L5L1r2L0q5N9k5KK1J04J12j05q2j10OK8J14L8
4294B09k4K4j44%K8P0K7K3r7omn7J46k3J2j40J42L4j50J03J47j32j25J0J5Q8J16j91J17j38
3941H0Q6j18M4L9P8j48k8J60l3l9o8K05mj93K52k7k52M4l9J72k1j01Q1j09k6K5J09k7l3Nm4
3578G0J08j11rK02j40K2k5K0J42j92N7m8J2Q5o8j5P9l9J03m7n0j25J76l8K7M01O45n65n48
3237A29J13L9M4L120J0803K702r874o785j11N40K0l49K54J04J900L781k98l54l879o2j641
$$ plain form
5808 124 132 72 79 189 83 280 151 71 142 240 168 59 218 124 119 216 128 99 173 134 252 57 95 178 79 89 106 57 161 162 141 141 97
5420 97 115 115 104 141 205 34 74 35 133 157 136 98 187 76 191 165 89 195 143 85 28 37 88 88 172 30 162 178 285 220 89 96 183
5033 183 257 62 48 62 64 141 195 138 178 209 158 135 199 58 89 59 129 166 192 82 180 161 135 60 56 181 76 233 67 154 88 114
4657 114 51 194 108 78 210 231 257 222 87 198 42 52 128 163 194 102 132 47 106 81 83 104 208 320 215 133 23 29 57 171 209
4294 209 185 209 65 65 93 163 190 213 116 110 106 49 195 172 184 44 186 220 70 173 320 188 63 73 88 176 292 101 218 80
3941 80 166 48 92 131 209 61 33 193 160 121 53 258 254 61 313 286 34 78 39 211 190 89 170 61 35 60 169 142 109 114 70
3578 70 178 67 58 260 120 142 117 137 279 87 144 96 108 193 125 110 189 150 253 206 156 31 207 169 196 597 1242 677 129
3237 129 242 281 325 3445 14248 16950 7076 291 180 720 740 391 645 749 2649 6430 6132 5778 1899 1837 196
2991A96j06K38p0J83J872J305j828j247M65j94n47N63j13n38j08O67k88j70j93%M4o4Ok3J7
2697F7J21o6J01R96k39p81L1p2k0k5oM5L7q1M3j4Pp0K8N6l2k6Q0N0q9M2o3J34k7r8M1lr5R
2298H1QL0lo1R3O8N8m5j20K9p1J14o2n5lQ7L8n7J58p0j32O3k2l0L0l5J34l9m8l1P8J4rl0r0
1887G0K0J67k18J17j21OmP1O3j13J8j1K3J32j14M2q1J13k1j08J12r5L2k5R3K9lj38NK1Q3J05
1512B70pJ9j96N5K8j5j07J81o7J1QLn3%J9p8J32n1j09J57J9Lr3L4j23J52O9k06rJ09K6n8n0
1124G3J9J07j34k2J32k6k3O9j39O1J0RJ7N16n5l13q7R6j88m0o5J64k7o5J9K4N0R6j41J0q8
$$ plain form
2991 196 90 328 258 441 2313 3618 1790 543 1008 814 267 830 717 179 71 738 450 280 87 87 131 67 73 50 67
2697 67 188 122 223 1219 980 199 230 158 138 113 107 152 189 108 151 137 144 74 102 158 126 100 180 230 141 183 120 254 227 129 170 167 72 81
2298 81 89 119 116 55 148 216 274 229 109 138 67 181 119 64 61 148 186 129 287 217 85 148 126 96 126 91 225 186 138 107 185 199 190 160 70
1887 70 90 257 39 156 35 41 37 108 171 58 76 65 88 220 106 148 67 180 159 51 163 68 100 75 168 197 194 56 61 82 165 270
1512 270 263 282 86 141 169 154 47 228 161 172 180 183 130 130 149 71 203 152 43 200 219 222 129 163 40 192 261 55 46 155 181 123 73
1124 73 92 199 65 43 175 149 126 195 56 117 127 136 153 669 614 301 214 310 122 82 17 181 154 89 108 132 182 278 137 147 59
$$ [...]
-190C4
##END NTUPLES=	nD NMR SPECTRUM
##END=	
##END=	
