##TITLE=	CTIZ3uhYTWq$aPL9PxBMlQ.42.ser
TM-VI-391, CDCl3, hmqc

##JCAMP-DX=	6.0	$$ MestReNova 14.3.0-30573
##DATA TYPE=	LINK
##BLOCK_ID=	1
##BLOCKS=	2    
##ORIGIN=	Mestrelab Research S.L.
##OWNER=	hrzepa
##$MNOVA/LINK_BLOCK_TYPE=	ITEM	$$ NMR Spectrum
##$MNOVA/ITEM/POLYGON=	(XY..XY)
5321,5835
8722,5835
8722,8208
5321,8208
5321,5835
##$MNOVA/ITEM/Z=	0
##$MNOVA/ITEM/ANGLE=	0
##TITLE=	CTIZ3uhYTWq$aPL9PxBMlQ.42.ser
##JCAMP-DX=	6.0	$$ MestReNova 14.3.0-30573
##BLOCK_ID=	2
##DATA TYPE=	MNOVA NMR VIEW DATA
##DATA CLASS=	MNOVA VIEW DATA
##$MNOVA/2D/THRESHOLD=	6.61463165283203125
##$MNOVA/ITEM/ZOOM/X=	-0.97334353289575425983,	15.004620000063303209
##$MNOVA/ITEM/ZOOM/Y=	-9.4848415069764335783,	229.95350001038360688
##END=	
##TITLE=	CTIZ3uhYTWq$aPL9PxBMlQ.42.ser
##JCAMP-DX=	6.0	$$ MestReNova 14.3.0-30573
##BLOCK_ID=	3
##DATA TYPE=	nD NMR SPECTRUM
##DATA CLASS=	NTUPLES
##NUMDIM=	2
##ORIGIN=	Bruker BioSpin GmbH
##OWNER=	nmr
##.OBSERVE FREQUENCY=	400.41280287000000726
##.OBSERVE NUCLEUS=	^1H
##.SOLVENT NAME=	CDCl3
##.PULSE SEQUENCE=	hmqcgpqf
##LONGDATE=	2022/06/22 02:31:35.000
##.ACQUISITIONMODE=	SIMULTANEOUS (DQD)
##$ORIGINAL FORMAT=	Bruker XWIN-NMR
##$MNOVA/SCALES_VERSION=	9
##$PARAMETER FILE=	(acqu2s, ASCII, /private/var/folders/f6/rjf_tdyn2v98c5c0wvkgn4s80000gn/T/CTIZ3uhYTWq$aPL9PxBMlQ/42/acqu2s, 0)
$$ ##TITLE= Parameter file, TOPSPIN		Version 3.2
$$ ##JCAMPDX= 5.0
$$ ##DATATYPE= Parameter Values
$$ ##NPOINTS= 129	$$ modification sequence number
$$ ##ORIGIN= Bruker BioSpin GmbH
$$ ##OWNER= nmr
$$ $$ 2022-06-22 02:40:52.086 +0100  nmr@CZC10666PP
$$ $$ /opt/topspin/data/agmb/nmr/Jun21-2022/42/acqu2s
$$ $$ process /opt/topspin3.2/prog/mod/go
$$ ##$ACQT0= 0
$$ ##$BF1= 100.683175
$$ ##$FnMODE= 1
$$ ##$NUC1= <13C>
$$ ##$NusJSP= 0
$$ ##$NusT2= 1
$$ ##$NusTD= 128
$$ ##$O1= 11075.14925
$$ ##$SFO1= 100.69425014925
$$ ##$SW= 239.880522832024
$$ ##$SW_h= 24154.5893719807
$$ ##$TD= 128
$$ ##END=
$$ 
##$PARAMETER FILE=	(acqus, ASCII, /private/var/folders/f6/rjf_tdyn2v98c5c0wvkgn4s80000gn/T/CTIZ3uhYTWq$aPL9PxBMlQ/42/acqus, 0)
$$ ##TITLE= Parameter file, TOPSPIN		Version 3.2
$$ ##JCAMPDX= 5.0
$$ ##DATATYPE= Parameter Values
$$ ##NPOINTS= 12	$$ modification sequence number
$$ ##ORIGIN= Bruker BioSpin GmbH
$$ ##OWNER= nmr
$$ $$ 2022-06-22 02:40:55.682 +0100  nmr@CZC10666PP
$$ $$ /opt/topspin/data/agmb/nmr/Jun21-2022/42/acqus
$$ $$ process /opt/topspin3.2/prog/mod/shimcntl
$$ ##$ACQT0= 1000000
$$ ##$AMP= (0..31)
$$ 100 100 100 100 100 100 100 100 100 100 100 100 100 100 100 100 100 100
$$ 100 100 100 100 100 100 100 100 100 100 100 100 100 100
$$ ##$AMPCOIL= (0..19)
$$ 0 0 0 0 0 0 0 0 0 0 0 0 0 0 0 0 0 0 0 0
$$ ##$ANAVPT= -1
$$ ##$AQSEQ= 0
$$ ##$AQ_mod= 3
$$ ##$AUNM= <au_zg>
$$ ##$AUTOPOS= <42 >
$$ ##$BF1= 400.41
$$ ##$BF2= 100.683175
$$ ##$BF3= 400.41
$$ ##$BF4= 400.41
$$ ##$BF5= 400.41
$$ ##$BF6= 400.41
$$ ##$BF7= 400.41
$$ ##$BF8= 400.41
$$ ##$BYTORDA= 0
$$ ##$CAGPARS= (0..11)
$$ 0 0 0 0 0 0 0 0 0 0 0 0
$$ ##$CFDGTYP= 0
$$ ##$CFRGTYP= 9
$$ ##$CHEMSTR= <none>
$$ [...]
$$ 0 0 0 0
$$ ##$ShimPowMaxUC= (0..63)
$$ 130000 130000 130000 130000 130000 130000 130000 130000 130000 130000 130000
$$ 130000 130000 130000 130000 130000 130000 130000 130000 130000 0 0 0 0
$$ 0 0 0 0 0 0 0 0 0 0 0 0 0 0 0 0 0 0 0 0 0 0 0 0 0 0 0 0 0 0 0 0 0 0 0 0
$$ 0 0 0 0
$$ ##$ShimPowMaxUG= (0..63)
$$ 524287 524287 524287 524287 524287 524287 524287 524287 524287 524287 524287
$$ 524287 524287 524287 524287 524287 524287 524287 524287 524287 0 0 0 0
$$ 0 0 0 0 0 0 0 0 0 0 0 0 0 0 0 0 0 0 0 0 0 0 0 0 0 0 0 0 0 0 0 0 0 0 0 0
$$ 0 0 0 0
$$ ##$ShimPowRcbType= 3
$$ ##$ShimPowRes= (0..63)
$$ 1e-20 1e-20 1e-20 1e-20 1e-20 1e-20 1e-20 1e-20 1e-20 1e-20 1e-20 1e-20
$$ 1e-20 1e-20 1e-20 1e-20 1e-20 1e-20 1e-20 1e-20 0 0 0 0 0 0 0 0 0 0 0 0
$$ 0 0 0 0 0 0 0 0 0 0 0 0 0 0 0 0 0 0 0 0 0 0 0 0 0 0 0 0 0 0 0 0
$$ ##$ShimPowRng0= (0..63)
$$ 1 1 1 1 1 1 1 1 1 1 1 1 1 1 1 1 1 1 1 1 0 0 0 0 0 0 0 0 0 0 0 0 0 0 0 0
$$ 0 0 0 0 0 0 0 0 0 0 0 0 0 0 0 0 0 0 0 0 0 0 0 0 0 0 0 0
$$ ##$ShimPowRng1= (0..63)
$$ 1 1 1 1 1 1 1 1 1 1 1 1 1 1 1 1 1 1 1 1 0 0 0 0 0 0 0 0 0 0 0 0 0 0 0 0
$$ 0 0 0 0 0 0 0 0 0 0 0 0 0 0 0 0 0 0 0 0 0 0 0 0 0 0 0 0
$$ ##$ShimPowRng2= (0..63)
$$ 1 1 1 1 1 1 1 1 1 1 1 1 1 1 1 1 1 1 1 1 0 0 0 0 0 0 0 0 0 0 0 0 0 0 0 0
$$ 0 0 0 0 0 0 0 0 0 0 0 0 0 0 0 0 0 0 0 0 0 0 0 0 0 0 0 0
$$ ##$ShimPowRng3= (0..63)
$$ 1 1 1 1 1 1 1 1 1 1 1 1 1 1 1 1 1 1 1 1 0 0 0 0 0 0 0 0 0 0 0 0 0 0 0 0
$$ 0 0 0 0 0 0 0 0 0 0 0 0 0 0 0 0 0 0 0 0 0 0 0 0 0 0 0 0
$$ ##$ShimSysFunc= (0..63)
$$ 1 2 3 4 5 7 9 11 15 16 8 10 12 14 6 17 13 18 19 20 0 0 0 0 0 0 0 0 0 0
$$ 0 0 0 0 0 0 0 0 0 0 0 0 0 0 0 0 0 0 0 0 0 0 0 0 0 0 0 0 0 0 0 0 0 0
$$ ##$ShimSysMatrix= 0
$$ ##$ShimSysType= 1
$$ ##$TFXNUM= 0
$$ ##$TRIPLO2= 0
$$ ##$VTU= 2
$$ ##$VTUETH= <149.236.99.20>
$$ ##$VTUTY= <no>
$$ ##$WBREFAM= (0..15)
$$ 135 116 100 100 100 100 100 100 100 100 100 100 100 100 100 100
$$ ##$WBREFLM= (0..15)
$$ 0 0 0 0 0 0 0 0 0 0 0 0 0 0 0 0
$$ ##$WBREFPH= (0..15)
$$ 71.66 -68.25 0 0 0 0 0 0 0 0 0 0 0 0 0 0
$$ ##$WBSGU= (0..15)
$$ 0 0 0 0 0 0 0 0 0 0 0 0 0 0 0 0
$$ ##$XFAC= 2
$$ ##END=
$$ 
##$DECIM=	3120
##$DSPFVS=	20
##.ACQUISITIONSCHEME=	NOT PHASESENSITIVE
##NTUPLES=	nD NMR SPECTRUM
##VAR_NAME=	FREQUENCY1,	FREQUENCY2,	SPECTRUM
##SYMBOL=	F1,	F2,	Y
##.NUCLEUS=	13C,	1H
##.OBSERVE FREQUENCY=	100.69425014924999573,	400.41280287000000726
##VAR_TYPE=	INDEPENDENT,	INDEPENDENT,	DEPENDENT
##VAR_FORM=	AFFN,	AFFN,	ASDF
##VAR_DIM=	512,	512,	262144
##UNITS=	HZ,	HZ,	ARBITRARY UNITS
##FIRST=	23152.448482362498908,	6007.9998942000029274,	0.13679401576519012451
##LAST=	-954.96395725105026031,	-389.73648400514491641,	0.27909478545188903809
##MIN=	-954.96395725105026031,	-389.73648400514491641,	0.00021895488316658884287
##MAX=	23152.448482362498908,	6007.9998942000029274,	151.330902099609375
##FACTOR=	1,	1,	0.0021998145965513300586
##PAGE=	F1=23152.4
##FIRST=	23152.448482362498908,	6007.9998942000029274,	0.13679401576519012451
##DATA TABLE=	(F2++(Y..Y)), PROFILE
$$ [...]
##PAGE=	F1=2488.95
##FIRST=	23152.448482362498908,	6007.9998942000029274,	0.16337381303310394287
##DATA TABLE=	(F2++(Y..Y)), PROFILE
-390A5
##PAGE=	F1=2394.6
##FIRST=	23152.448482362498908,	6007.9998942000029274,	0.18109168112277984619
##DATA TABLE=	(F2++(Y..Y)), PROFILE
6008A07n9L6J9JM6j9K0K7j02R3qL2j30J52j44J86K1k40J51m8q3J08nJ3J35j04N4kq8K5R4L5
5607C23k47l7KN1J47J66%j73n4l5rJ39rj77m9J63J2n8k6M6p6N3o9R3n6j4J29m7n0R1N5j82
5207A02J60j14j18K30j20n6J69j12J90l6j06m2M9N9j16O9J2K5k6j36J57q1J32j18K2K3j15
4869A03O3l0J32K4j1J30k21K34j49O6Q8M1j93pO5k11J87l9j5j24Q1p0m3J4J00p6mQ4L1J73
4493D23k21PJ62Np7k18M7N3k8J38K00k83P2j7j2j04J76k9lp7R6k1j20J63n7k4k6O6N0j87J65
4105C19l5nj06J41QK1oo4k2qj9J23j4L2o2J7R7J1q1R5R9j08j32L9n0l6l8J97j88J89p4J35
3704D75Oj10L7J06k6r5Q4j2Q1j8J57l0p2o9o6J3N3J20o5k4N6L9k08K27M4M0k67J75R9J0J77
3316I37k11m6J08O6P8J02M7k68p2j18P14J221P72n43M49M07l20Q93j67J518K332L307k454
$$ plain form
6008 107 48 84 103 104 150 131 151 178 76 169 161 193 63 215 71 257 278 38 189 141 58 166 161 174 309 205 259 257 169 194 288 323
5607 323 76 39 41 92 239 405 405 232 178 143 134 273 264 87 38 201 213 155 129 175 99 152 83 176 120 106 235 188 138 229 284 102
5207 102 262 148 30 260 140 84 253 141 331 295 189 147 196 255 139 208 220 245 219 83 240 159 291 173 195 218 103
4869 103 166 136 268 292 281 411 190 424 275 341 429 470 277 270 335 124 311 272 257 133 214 144 101 115 215 139 135 219 250 423
4493 423 202 209 371 376 299 81 128 181 153 291 491 208 280 263 251 147 323 294 291 214 310 289 169 332 275 251 225 291 341 154 319
4105 319 284 279 173 314 322 343 337 273 251 243 224 347 333 365 303 320 417 428 347 442 541 433 301 340 290 254 216 413 225 414 340 475
3704 475 481 371 408 514 488 393 477 465 546 528 685 655 583 514 448 461 514 634 569 545 601 640 432 659 703 743 476 651 750 760 937
3316 937 726 680 788 854 932 1034 1081 813 741 623 1337 2558 3330 2787 3236 3643 3323 4216 4049 5567 7899 11206 8752
3028H752n062K452l479J943Q446K704l180M314j972p391j260K754k227k544p37n00l18l19
2803B376j67j92l62j48J8J11l86O6j28QL75M052j78l334m23k78k14l23R7j89J85k13J68pr
2490I05q4r6j41o5P8N0q8KL5o4j17K9J46Lk58K55j13N9mk40K36l2k01K08j28J54K0n9j70J0
2114C30P2J90j90o0O0L3j25O9Jp2k6J5J1J71l64K12o6p2j17J78p7J06k7N7Q2M1j24l1m9J95
1739D23j42p2J19o3n6M9j26L9Q3nl9j09J96k8P3o0J14j34j55J03j30K73N1o2j23p7J26o5J0
1376B13p2P0o0q4J48P8Pj03j9J19l9N4j11P7o1j16N3q4P6J19j47R0K9r1k2mJ69m1p5J0K8N
975B16j13L5L6J7l9m4J72k13R2j44J91No0J51j54R7J05j98j6J2j05K03j20O2q6Rk4J06J8j70
599D1Q7j2M5j6M3p8pm1O8j1P0j20J94n8O4m8m0p4J04r7p3j7P5r3J97n4K2k5j05Q9r6J42p0
$$ plain form
3028 8752 3690 6142 2663 4606 13052 15756 12576 16890 14918 7527 6267 9021 6794 4250 3513 3013 2695 2376
2803 2376 2209 2017 1655 1507 1525 1636 1250 1316 1188 1196 1571 5623 5445 2111 1688 1410 1196 873 970 781 966 753 921 914 905
2490 905 821 725 584 519 597 647 559 561 596 532 415 444 590 593 335 590 477 536 532 292 528 496 295 503 375 529 549 490 320 330
2114 330 402 592 402 342 402 435 310 379 380 308 282 297 308 479 115 327 261 189 72 250 173 279 252 309 391 432 308 277 228 423
1739 423 281 209 328 265 209 258 132 171 254 249 210 101 297 269 342 282 396 262 107 210 80 353 404 342 219 142 268 203 213
1376 213 141 211 151 67 215 293 300 197 178 297 258 312 201 278 217 101 154 70 146 265 118 208 237 146 124 120 289 248 173 183 211 216
975 216 103 138 174 191 152 108 280 67 159 15 206 211 151 302 148 245 350 152 136 148 43 246 126 188 102 111 87 193 211 41
599 41 128 116 161 145 188 110 103 62 130 119 189 69 263 205 269 221 181 107 211 114 41 24 99 6 203 149 171 146 41 130 34 176 106
186A06q3J66Lj62J08m6N7n2L7kL9p4O9m7m6Qk3O2RL9r6O2N5Rj50j6J50J01j64L5m3p8L0J71
-239B34j02RK5P0j25M1M9M9r2o9Oq4
$$ plain form
186 106 23 189 192 30 138 92 149 97 134 132 171 97 166 119 73 81 58 120 129 168 72 134 189 198 48 32 182 283 119 154 111 33 63 234
-239 234 132 141 166 236 111 152 201 250 158 89 95 11
-390A1
##PAGE=	F1=2300.24
##FIRST=	23152.448482362498908,	6007.9998942000029274,	0.3603947758674621582
##DATA TABLE=	(F2++(Y..Y)), PROFILE
6008A10o0O7JpkQJ7N4q3P9k3j1j21J78j54J81K8k23J34l1j01J28J1pJ62j08J2J9j02J2P7N8
5607C03j97p6M2m1K05J27kj67l9l0j1J37mj64m0R4J5j1n3M1m1M4m3N1j5o8J40j5p8O7Q6k09
5207D8J50o8o1J58j17n0J78j00J77o2j15mO0M4j05O4k6N2Nj86J42l4J29j03J7Oj13K5nJ40
4831B46KLJ09k24K46j16M9L1P1j71J7P4k27J81j0l6r8N0r6k0J7J09o0p2Q8M1J51j80j6J60
4456C19j3k8k05L3J2J5J43J71k63M4J0m5r2J94l1m4m0R5m0j51K21n5n6oQ5J9j73J37mj3j42
4067I7J34P3j9rj00J1K8j9R5O%n0K4O2M6r8J05R1o9j65M9j12J8n6J61j47J85j32K11J3j38
3679B95M7J20n2p3M9J5O1nJ65o2r2n3p5QQ9O0n1k1O9J3k00K48N0J7k47J92M2lJ44j93l6J27
3279F48N0N1O0N4l18L2L92P94J225M49q41L89J90l55P49l12J238J669J894k390l418J477l575
$$ plain form
6008 110 50 117 118 111 109 117 134 188 105 184 161 150 29 207 53 234 262 39 173 142 41 169 180 173 335 227 239 258 156 168 245 303
5607 303 106 30 72 31 236 363 361 194 155 125 114 251 247 83 43 137 152 141 88 129 88 132 89 140 125 57 197 182 104 171 257 48
5207 48 198 130 69 227 110 60 238 138 315 253 138 134 194 238 133 197 171 223 228 42 184 150 279 176 193 199 86 111 106 246
4831 246 248 251 360 136 382 266 315 346 417 246 263 337 110 291 281 245 147 197 101 81 98 207 147 75 163 204 355 175 159 319
4456 319 306 278 73 106 118 133 276 447 184 228 238 193 101 295 264 220 180 275 235 84 305 250 194 188 273 292 119 256 252 239 97
4067 97 231 304 285 276 176 187 215 196 291 297 297 247 271 333 379 281 386 477 408 243 292 180 198 142 303 156 341 209 420 433 295
3679 295 342 462 410 337 386 401 462 457 622 560 468 415 340 348 437 497 446 425 494 507 307 555 605 622 375 567 609 606 750 557 521 648
3279 648 698 749 809 863 545 577 969 1763 2988 3437 2596 2985 3175 2820 3569 3257 4495 6164 8058 5668 2250 3727 152
2991A52N648P438K311k735L944k578p647o94L029k130k579q16n16k19l61k07j53l38j44N4
2740A459J35l43M9j9Q1M60M235o48l644l20k99j19l46P2o1J35k02J60k6J3m8j00j38q0N3P7
2415E36j06j4Q8m5r3oJ32%k64L07j79N7O5k26K01j2k46K36j29J50N1n1j29p7O6K18j66j28
2064B36O9M2j03N4Ln6j2L1n8K02l08J43m4m0j03J46p4Q7QLP7M9j16m2j9J76j16p6J21n4n2
1676A74L0j11L0Q9%p1q9K63p1O2p2J16j15j21M6j20K48O3l7j67k7J01m2K5j13O0j5p0J19M8
1300B33L4o7n3J03n9J21j34P5k2j74P5o8O1J19j26O9L7m2n5l9J52m0p6K5O6k3r3j1O1L9p0
912A18k2J59j52M5j22J29j5l3J34j46J60N2j86l1P4j03J56p7J3o8J0m3J55Jj52N5m0P0mJ4
537A51q5K3k4M4MP4j42K06o6N9m4rr5Q7m4j07K2M3p5J67o5J5J2j28O5m5J11n1r1J94m0j45
$$ plain form
2991 152 5800 13238 15549 12814 16758 14180 6533 5839 8868 6738 4159 3343 2827 2608 2247 2040 1887 1549 1405 1459
2740 1459 1594 1251 1300 1281 1362 1822 6057 5409 1765 1445 1146 1027 681 753 692 827 625 785 759 772 724 624 486 406 459 536
2415 536 430 416 504 459 366 360 492 492 228 535 356 413 478 252 453 441 195 431 302 452 503 452 323 246 312 530 364 236
2064 236 305 347 244 298 301 245 233 264 206 408 100 243 199 159 56 202 128 215 223 226 303 352 236 194 175 351 235 159 280 226 174
1676 174 204 93 123 212 212 141 52 315 244 306 234 350 235 114 160 40 288 351 314 147 120 221 179 204 91 151 136 66 185 233
1300 233 267 200 147 250 191 312 178 253 231 57 132 64 125 244 118 187 224 182 127 88 240 200 124 149 215 192 99 88 149 188 118
912 118 96 255 103 148 26 155 140 107 241 95 255 307 121 90 164 61 217 140 153 85 95 52 207 208 56 111 71 141 137 151
537 151 66 89 65 109 113 187 45 251 185 244 200 191 96 183 139 32 54 97 22 189 124 139 151 23 88 43 154 103 12 206 166 21
136B1Q5l2M9l8M5%L9o6M3n2j8Mn7N8N8j6o4M4P7Nj27k3J34Q4j66P9m5o2k9J54q4oN2M1n9L4
-315A62N0M3j11o2L3q7
$$ plain form
136 21 106 74 123 85 130 130 169 103 146 94 76 80 23 81 139 123 59 103 180 185 58 35 169 253 87 166 121 59 30 184 100 94 146 187 128 162
-315 162 212 255 144 82 115 28
-390B8
##PAGE=	F1=2205.89
##FIRST=	23152.448482362498908,	6007.9998942000029274,	0.46502867341041564941
##DATA TABLE=	(F2++(Y..Y)), PROFILE
6008I9m2Q4qj4n2K3K8Q0o7O1m3l1p8J52j65J83L5k04J13j3j02J35K3l7J80r7l7L1j02NN1O8
5607B59j51r4J08p8J85J01lj64l7mk1J17lj51j5M5kL4p0L4j2L0j8KK5r2J30J2r0K8J01j88
5207A8J19k7j4R7j04m9J82q5J60r4j12L1P2J3r0P0m3M9L8j50M0K3J00p8L2j8r1k0JJ50j8J3
4806B15R2k27K45q2L4j7P7j40L6Q8k26J61J8m9p0L1r7l3L8R5m7r8P6N2J03j36k5J53m6K5j59
4418H7Ql0N7J40J33k41L1L9p7q2J84k3q4MQ0l0j78K55n5r0J5J06pj60J22J1l5j32J00J49m6
4030B51k6j34K9N6pP0J9l2l7L7J1P8j02J09Q7m4j73N2j58O7o7J07j09K00j94K87Nj60N6J29
3654D07q0k7MM5L9J1J57q6j13l9p4J1J20J2n5j5P5lj64K39N4j8k12K28k7lR6j54pJ39L3J2
3254F05L0O7l00K67P39Q25J194J76j127K91J3l75O21l84J046J377R72k357k634R16m68M531
$$ plain form
6008 99 57 141 133 119 67 90 118 198 131 192 149 118 40 192 27 210 245 41 154 141 39 174 197 160 340 243 206 237 135 140 191 259
5607 259 108 14 122 44 229 330 327 163 126 122 101 218 215 64 49 94 92 126 56 90 78 108 90 92 117 25 155 167 77 105 206 18
5207 18 137 110 96 193 89 40 222 137 297 203 91 122 194 207 117 187 144 193 231 81 121 144 244 166 198 180 89 69 70 220 202 215
4806 215 307 80 325 243 277 260 337 197 233 321 95 256 274 225 155 186 89 56 94 189 142 44 120 172 275 139 114 267 221 246 87
4418 87 95 65 122 262 395 154 185 224 147 65 249 226 142 146 226 196 18 273 218 128 143 249 242 82 204 215 180 48 148 297 251
4030 251 225 91 120 176 169 239 258 226 189 226 237 315 213 322 409 365 192 244 86 153 86 193 84 284 90 377 382 222 278 407
3654 407 327 300 304 349 388 399 556 470 357 318 244 255 375 387 332 317 392 389 225 464 518 500 288 516 489 486 582 428 421 560 593 605
3254 605 635 702 402 669 1408 2233 3427 3603 2476 2767 2780 2405 3026 2642 3688 5065 6037 3680 1046 1962 1494 6025
2978F025O091J848k152L550k674p260k99L046j895k399q20n10j14l66k14j27k99j37P5J36
2728A505k65K9Q8J48N31M395r64l987l11l07m5l19NQ9P9j98J63n4J7Lq5j32n7j4R4j06m2J28
2377C88k4n3l0J20j0k61L32k04PJ31j86J62Jk60K35j06J16P1k3q2j30M3K21j25j85P2K7o1
2027A86K1jl2NL9j24K22k15N1j9Lo0P8l4M5L8n8O5M9q3o8K4J37r6o7J14m1m2J8q0J3R8nq9
1601I2n7K76r5O2q5R6r6o7j2j01J99O8pj90LP5lJ2r2K3J4n0R9LN6m0m7O3p7J81j33M4L3j65
1175H2K4n3O1J03j09O2M5J0o4r4J21m8o3L1J06m4p2n3P5N7r3lJ35r4Oq6N9k9J4R4j46K33L
762B70j75n9J22p1J01l7j4n5km9J72qj33N7p3O7M%r9M5NRL3O5j32J75o4N0l7K6j07O1Kj01
336D8O8%p0J25q5J8K7j08K5K4N1l4m5J93r0j20M8j5L3j9N6j3M3n5J5m8L0l1o7N5Q9o1%k1J03
$$ plain form
2978 6025 12116 13964 11812 15362 12688 5428 5129 8175 6280 3881 3061 2551 2437 2071 1857 1730 1431 1294 1369 1505
2728 1505 1240 1269 1357 1505 2036 6431 5467 1480 1169 862 817 498 503 592 671 473 636 582 599 602 517 385 328 314 408 302 260 388
2377 388 364 311 281 401 391 130 462 258 265 396 210 372 373 113 348 242 358 429 406 324 194 237 458 333 148 220 247 186
2027 186 207 206 174 179 218 94 316 101 152 133 136 76 154 120 165 203 145 210 259 176 108 132 269 173 106 220 179 137 155 75 88 186 181 92
1601 92 35 311 216 278 193 289 193 126 114 13 212 280 273 83 86 161 158 170 78 101 115 65 164 167 223 183 136 199 122 303 170 214 247 82
1175 82 106 53 114 217 108 170 215 225 161 67 188 140 77 108 214 170 98 45 120 177 84 81 216 122 128 42 101 72 86 180 34 267 270
762 270 95 36 158 87 188 151 137 82 80 31 203 195 62 119 46 113 117 117 18 63 68 77 110 175 43 218 154 204 167 193 86 147 149 48
336 48 116 116 46 171 86 104 131 23 48 72 123 89 44 237 147 27 75 60 93 74 130 117 160 105 120 72 102 71 4 59 148 87 87 66 169
-102A69rq3m2J23M5j55J26n0m1kO3o3l3R0mLK8M8L9j34n4O3q6
$$ plain form
-102 169 160 77 35 158 203 48 174 124 83 81 144 81 48 138 134 137 165 213 252 118 64 127 41
-390D1
##PAGE=	F1=2111.54
##FIRST=	23152.448482362498908,	6007.9998942000029274,	0.45314046740531921387
##DATA TABLE=	(F2++(Y..Y)), PROFILE
6008G6j8R2rj5q2NN7R1n0M3o7k7m0J10j36J65L0j92R8Lq2J21K9o4J83p6q2L0r0OJ6P1j12n3
5582C1J48r2J37Q8j0j56n4L0k7R7j4j44QM5m7P1p2K3J2J3oj6K7p9R7K8p9j5R3j24P5oK5N5
5157A62q0n9J86p2J42j23j04N6Q5k0q3P6k6J8O5r3p4P8N1m2N5k8q2m0pJ48l3J9Q8k13K09n1
4756B08J8m2O3j12N2J02k03J19L9m8m1J9o4n8M8N7m8p1N2P2L0j02j2J39q4P5q9l0n5R0J23
4368B47R0k23L9N7r8o8J50j0j22M9M6Rj01J64m9j20M5J09k8j47J27J0o9q7O9K05o6m2j46K5
3992F5O1J8M7K5o2k9O4n5J02r5J05Q7l2j57M1j34P0p3L9o8K22k24L29k4j78P6J24j08M3m4
3617B35P4J2K7J31j01j32k3o6K9J32j5p0qP6j3p5J73N1n9j58K65j02J1L6q5M0J34Pm5L5R7
3229F13j84M46R10Q61J169o2j374J73j34l89N09m31R05J331O10k134k621Q20J244L161M577
$$ plain form
6008 76 58 150 141 126 44 49 106 197 147 190 123 96 56 166 30 195 225 33 131 134 52 173 202 138 321 245 163 193 103 109 125 196 84 31
5582 31 179 87 224 312 302 146 92 122 95 192 178 34 42 87 40 111 39 62 74 87 81 65 92 13 110 138 59 44 137 13 88 82 107 162
5157 162 82 23 209 137 279 156 52 108 193 173 90 166 140 158 223 130 56 134 185 143 198 170 88 48 41 189 156 175 263 50 259 208
4756 208 226 184 247 135 187 289 86 205 244 196 155 174 110 52 100 157 109 38 90 162 192 90 78 217 133 208 119 89 34 124 247
4368 247 337 114 153 210 112 44 194 184 62 111 157 166 65 229 180 60 105 214 186 39 166 176 107 20 89 294 228 186 40 65
3992 65 126 144 191 216 154 125 189 134 236 141 246 333 301 144 185 51 121 48 87 19 241 17 346 322 144 220 344 236 279 235
3617 235 309 321 348 479 378 246 223 157 186 318 303 233 225 301 288 213 386 437 378 220 485 383 394 430 345 385 519 526 481 516 613
3229 613 429 875 1785 2646 3815 3753 2379 2552 2418 2029 2538 2107 3012 4343 4953 2819 198 1018 2262 5423 10000
2966A0000J343j580L015k359o206m0K774j542k031p49m66pl41j89r6k53j16P4J19j70J2J76
2690A368K03O05M479j086m214m49k83m1k09j35K36M1k27J82p1nN2m2j37J4j06R7q5p3J42q
2365B48j4l3J16j6k26K95j84p7J84j38J34%k45K20p4O5P0J9m3j12j7K04r1k02P8j0j8nk2j5
1989I1M0L3j38J76r9m3lO6k9J9J2RN2j08M2M3l5p6N9P3q1l7Q2k2k4Lk3j4J06k2q1k9K37j05
1563A74Q4q2M8p9j5o0m7J13O1J7j75KN9M0k2m0LJ2l2Q7m7O8k6j7K6r6K30j18nR1j19m7l8O5
1138A15P6j08P0N3M9m6j47P4o2l4N8J08o1n2n9O1O1j04NJ13m3k5o1J0lN7K3r8K47k7j64n2
737C4J01m4P1pj6m5k7l1J46pj17Q6q0J9QJm5k0M4l4P3M3j06J26o0M3k9N4j00K2M1q6R7k5o2
299F8Q1j03M7ln3j8P7kmj2J87j31q1l%J5mO7l1M8m0loK6o5m7N7Q7j00P9p5J02l9lq7J40j5
$$ plain form
2966 10000 11343 9763 12778 10419 4213 4173 6947 5405 3374 2625 2159 2152 1811 1622 1526 1273 1157 1231 1350 1180 1192 1368
2690 1368 1571 2176 6655 5569 1355 906 623 582 373 238 474 515 288 470 399 394 446 404 267 281 175 272 187 114 256 248
2365 248 234 201 317 301 75 370 186 109 293 155 289 289 44 264 190 255 325 344 301 189 172 376 285 83 161 151 133 128 106 91
1989 91 131 164 26 202 103 60 57 123 94 113 125 134 186 78 120 163 128 52 111 184 103 66 148 126 102 105 82 68 174 152 71 42 279 174
1563 174 258 176 224 145 130 70 23 136 197 214 39 41 100 140 118 78 81 93 61 148 101 169 143 126 152 56 286 168 163 254 135 88 50 115
1138 115 191 83 153 206 255 209 62 136 74 40 98 206 145 93 34 95 156 52 57 170 127 102 41 51 48 105 128 30 277 250 86 34
737 34 135 91 162 155 139 94 67 36 182 175 58 144 64 83 91 92 47 27 71 37 110 153 47 173 113 156 127 181 81 103 144 58 155 130 68
299 68 149 46 93 90 37 19 96 94 90 78 265 134 53 50 50 65 61 128 97 145 105 102 96 122 57 10 67 154 54 133 58 160 121 118 31 171 156
-164A56j32J52n3l3K1K0l1o1R9n2N0K3M4M0j47n6Q7p8
$$ plain form
-164 156 24 176 123 90 111 131 100 39 138 86 136 159 203 243 96 40 127 49
-390D9
##PAGE=	F1=2017.18
##FIRST=	23152.448482362498908,	6007.9998942000029274,	0.39727243781089782715
##DATA TABLE=	(F2++(Y..Y)), PROFILE
6008D4J0Q8lop2n4Q9Q4l4L4r1rk4P4n6J17J1j84Q8J7n2R1L0p4J66m9j11K5o6ml0P9q9K7J64
5570B30j18J13Q0k2j42q0O0j7Q9l6j51L4O0n7N5o4J2L6%oL2m6m1L8M0m9k9L9l0L1j4N3L7m5
5144I2q1J90n5J19j36j01O3J02l9q7O6Rj9Q1m1j44R8rMP7j8r2l3qJ19m3J7J02j57J19k4ml4
4731A33M0r6O0J10j59N8M9l3j6J6k9o0M5No8j5L7R4m9q6K1J21j19J13j8o7m5R4R3M9k06O6
4330A38N6j05m6J11nj23N3mO3l5P3l4j39R9P4m5r6J10Kj08k9R1J95r2n4j06pL6N3K4K6q4l2
3917F0J08j29J14p7R2Q6k7j24K0k2J2p7l1P7J29j07K23o4j89J02J10j30J21q9R6j6M1Q9j07
3554B91j45Jm7N8J16k8q1nP8k6K6R2M3r5q4K76j67L2k1J8O6J22k2j13O6J51o2N16R83Q71J157
3166D067k24j562N0k17m35M46m80P70J393O24j775k169N68J384J904L081Q58j127K357j792
$$ plain form
6008 44 54 142 139 133 61 7 96 180 146 180 89 80 56 130 74 191 202 18 106 123 71 162 192 118 284 235 124 149 83 79 49 128 39 66 230
5570 230 112 225 305 283 141 61 121 104 193 157 6 40 100 43 98 34 46 82 82 76 108 62 21 59 99 50 21 60 30 61 47 100 137 92
5144 92 11 201 146 265 129 28 91 193 154 67 133 142 123 204 163 19 117 108 112 189 171 79 46 38 157 114 131 233 76 195 171 167 133
4731 133 173 77 137 247 88 146 195 162 146 162 133 73 118 123 55 40 77 171 122 36 57 178 59 172 154 87 42 136 229 278 72 138
4330 138 194 89 43 154 149 26 79 75 138 103 176 142 3 102 176 131 35 145 147 39 10 101 296 204 150 44 37 73 126 150 176 92 60
3917 60 168 39 153 76 168 254 227 103 123 101 113 36 5 82 211 104 327 263 74 176 286 156 277 188 284 268 309 398 291
3554 291 146 147 100 158 274 246 165 160 238 212 238 330 373 278 194 470 303 335 314 332 398 520 498 385 451 602 540 1056 2039 2910 4067
3166 4067 3843 2281 2331 2114 1679 2125 1645 2415 3808 4432 2657 488 1056 2440 4344 7425 8283 7156 9513 7721
2916G721m715P4K287j115j543o28l94R3k91j46n3k03p9N2R3q5OK39K39O92M530j042m296o80
2615G56k18j48k1l40L17Q0l37K03m7m8P2L1j68J05j60P9m3nK6nJ4k4J25%j30J55j29r6J48
2252A92j01J24j1j78J69m6QN2O4j9m0r1J75p7j74Q5k2k3J4l0n5Q2K7Rm5J9p7MQ8j9J0J6j1
1839A19M7j18mK9K0nL0ro7M1oJ7nl3N4m9J11m8m2m2J80j01J20n3j3o5K6r4%L8L4L4j21j6O8
1401G7N1o2OK2j8k2Q1p5N1k6J6J5p8K22r3n7J39p0p8l2N5N0j13P1O1O9j5j79K4p6RJ04O6q0
975A15l5k8L7L8r9lR4Jm7m2j1P0N3m8j0J99l7j54j7K7l0O5J4ml8m7rR6%r7J13p7k7MJ6J4o3
512C3M5p6J08J3p3P1n4M1j9P1p6l0P1o2J05m3m1L9r2P8n4J3m4Q1j9L7j6J71j44n3m9J4KLP3
74A24m6M9k4kM1j6p0l6P5O4j19J39p2N0q1R7j50J85m8j12J29n4m7M0J7Ko0O3p8O4J7M5M7j33
$$ plain form
2916 7721 3006 3080 5367 4252 2709 2081 1687 1780 1489 1343 1290 1087 1008 1060 1153 1068 1074 1313 1552 2244 6774 5732 1436 756
2615 756 538 390 369 29 346 426 89 292 245 197 269 300 132 237 77 156 113 108 134 129 143 119 244 244 114 269 140 44 192
2252 192 91 215 204 26 195 149 157 209 273 254 214 123 298 221 47 132 110 87 101 71 16 98 125 134 89 108 31 35 123 104 114 130 119
1839 119 166 48 44 73 93 88 118 109 42 83 77 94 89 56 110 61 172 124 82 40 220 119 239 186 173 108 134 40 40 78 112 146 25 9 77
1401 77 128 66 72 94 76 54 135 60 111 85 101 116 38 260 167 110 249 179 101 69 124 174 61 132 193 262 247 68 92 16 25 129 195 115
975 115 80 52 89 127 28 25 119 120 73 31 20 90 143 95 85 284 247 93 76 103 73 138 152 148 110 63 54 150 150 53 166 89 62 66 82 96 33
512 33 78 2 110 123 50 121 67 108 89 160 84 54 125 63 168 125 84 123 31 109 55 68 24 105 86 123 107 278 134 81 32 46 48 51 124
74 124 78 127 103 101 142 126 56 20 95 159 40 179 107 157 76 173 23 208 160 48 177 123 76 116 133 135 75 138 60 124 141 186 233 100
-352A00q3J01o6
$$ plain form
-352 100 17 118 52
-390E2
##PAGE=	F1=1922.83
##FIRST=	23152.448482362498908,	6007.9998942000029274,	0.25164824724197387695
##DATA TABLE=	(F2++(Y..Y)), PROFILE
6008A9K8P4QJ4n3m8M7N9k0L6r2Kl4M8K9P9j4j56O5J7j8M8K7n6J29j7j21L6l7m2l0N9o3P1J68
5570B62j45J11O9l4j31q1P0RQ7m3j38K9M6l4J5n1KN8rLO8j01l0k1N4j7Ll1M0kk7N0M2nj12
5132FJ95k5Q1j30j02M8J23l3q2J0M1l6Q8qj14L2o4N6Q9%j04k7LQ2n1J1J21j03L3Kk8pK6q6
4706D7N5J03j18KM6nlK6j1n8O1l4r4K8L7J06r5o6K8J01j04Q6M1q4m8J04N7J3j81R9M0j00k1
4293E8R1k6m7j7l6Q9oJ1mo8P9K7o4oO2qj02j9J34J51j24o5o2j6NQ7kK7r1m7J56j31M9n0P1
3855A06Q0k7q8%P0oq6K1P5M8k7J54j01j73J02R9j25J69j19J01l0M2M5j15j44L0nQ0P6l2q5
3466A35lQ0m8P9O3L0j07j8K64k01M1n2J22O4J21m1j80Q7K23K9N39J061R12J186l11j764j06
3128B205j98n54M44n05O07J545Q10j577j937N53R09Q96J819M88q41J683j165l169J2J727o85
$$ plain form
6008 19 47 121 129 143 90 42 89 148 128 164 72 74 40 88 117 196 182 26 91 108 90 138 165 109 238 221 100 136 99 57 27 86 23 94 262
5570 262 117 228 297 263 132 51 121 130 217 174 36 65 111 77 92 41 43 101 92 95 163 62 32 11 65 48 51 20 60 58 31 81 123 118 6
5132 6 201 176 257 127 25 73 196 163 81 91 132 96 184 176 62 94 30 86 175 175 71 44 47 129 78 89 210 107 140 142 114 107 133 47
4706 47 102 205 87 89 135 130 127 153 142 84 145 111 17 45 82 188 93 27 55 156 52 138 179 95 47 151 208 221 40 139 179 79 58
4293 58 149 123 76 59 23 112 106 117 113 45 124 151 87 81 143 135 33 14 148 299 175 110 48 32 37 124 122 149 58 11 167 36 85 35 106
3855 106 186 159 71 71 141 135 49 70 145 193 166 320 219 46 148 247 122 291 172 273 243 285 330 215 71 101 96 176 252 220 135
3466 135 132 212 164 243 306 336 229 211 475 274 315 263 385 449 570 529 349 436 659 688 1227 2288 3200 4386 4075 2311 2205
3128 2205 2007 1453 1897 1392 1999 3544 4354 2777 840 1393 2302 3198 5017 5505 4664 6347 5182 2013 2025 3752 3067
2865C067j028m93l20J69k20j06kj47l0K1P0l1J4K83K66Q06M744r41m444q70j70k78Q4k37J8
2552B25K23l34MN2m3l2J30k12J53j10K9NJ05j06l7LrJ37L9n4J5p1M2k1j00J32l1n9Q3l7l8
2164H3K7R9j7M1j32J37p9j20P5K6q6O2J5m7j5M6J01j56N6k4J5K3k0M2j3l5M0r3m8LO5O2Rq0
1739F2k5Q9j00R0kj00J31q7J15o8J0q7J23r0J56j6m4n5M5r6JJ5k6L9k9lN9J8r0K6N6n0k0P7
1313A24m8j5l8L9L0j9J57o3j00J66l0o6m1M0L1r5L8O2O8J8j87rj6j7J31K5j02j9%L6lp8nN2
887F6L5n6j3KR2N3r1L6J62m3j43%k7l1P2L1Ml3n1PM3Po8J22q3l7pM3M1n8J7n5P1j3m2K1n1
424B3M7kP6n3q3Q8k9R2n9ojm3P1m2K9p1O0RO1m4J44j22l9r2L3JkO8n0M6j5J1O7o3l2m2R4L5
-52A65r5J45m6nj25J87k09K31l4j39J07m7r0O1K3K6n3L8p4M0J0N2O0j04j10Q9m5
$$ plain form
2865 3067 2039 1546 1226 1395 1175 1069 1067 920 890 911 981 950 964 1247 1513 2319 7063 6122 1678 808 638 360 444 207 225
2552 225 448 114 118 170 127 95 225 13 166 56 85 90 195 89 52 55 46 183 222 168 183 112 154 133 33 165 134 75 158 121 83
2164 83 110 209 192 233 101 238 159 39 114 140 54 116 131 84 69 115 216 60 116 92 107 130 110 152 139 104 144 51 3 6 71 133 142 62
1739 62 37 126 26 116 114 14 145 58 173 105 115 28 151 61 217 201 157 102 147 51 52 67 41 80 51 48 107 125 35 61 117 67 47 124
1313 124 76 61 23 62 92 73 230 167 67 233 203 137 96 136 167 72 110 172 240 258 71 62 46 29 160 185 83 64 64 100 97 19 14 66
887 66 101 45 32 34 126 179 88 124 286 243 100 100 73 42 114 145 149 116 65 72 115 122 54 176 93 56 49 92 133 75 92 37 108 95 53 74 23
424 23 70 68 144 91 8 96 67 159 100 94 93 50 121 79 108 37 97 106 167 123 267 145 106 14 47 48 46 114 64 110 95 106 173 110 78 36 130 165
-52 165 70 215 169 164 39 226 17 248 214 75 182 135 45 106 129 155 102 140 66 106 116 168 228 124 14 103 58
-390E8
##PAGE=	F1=1828.48
##FIRST=	23152.448482362498908,	6007.9998942000029274,	0.047181528061628341675
##DATA TABLE=	(F2++(Y..Y)), PROFILE
6008D0LN0K3L9m3l7QK7KL8o0rn2L4Q5N1l2j13M6rJ6pK6j0Q0J2j17N4k1p9M6Qk1L1J59j60J19
5545B27N5m4j26m5O2L7P8l3j44L4J4j5ql5qP5j5J9O3j07m5J9J0j8K4K2Jk7nJN6L2j45K05J4
5107B28K4j19r7K3J43j3o8p2N0j0Q2%p1k0oKQ1J7r2l6%P3o9PJ24n4k7K5m9J8K4n4K8P8j00
4668G0k1L0K3j2N5%p6J05m5n7j4L9J07j02l3jP6n0J1Q6p7p5J18L0k1j35J19J9r0jQ9o9Mm9
4243E3L7J0k7j0K8j2O1J0q8O5L3k8q2l8J72J21j59p8l8K4j7R8k2K0q0rJ36j14j9nL2P1l5p6
3817C4JJ22J9j00K2Q6%J9J25j26j38O5J06r2J73j23Q1k4L4Lj33j01L5L6R9L8l5q3jQ2p6Q0
3416B28R0K2r6K0K46k03L9n9K00O8J25n1k42J14K93J58N77J233J171J429m72k170l53j66o99
3103A502M19m63M07J744R68j661j906N65M50L00J023L48o77J104o99k006j94J251l66n89l72
$$ plain form
6008 40 43 93 116 155 112 75 83 110 112 150 90 81 29 63 148 199 167 54 100 91 107 100 126 116 196 208 91 145 124 45 91 99 78 109 268 108 227
5545 227 282 238 112 67 129 166 244 211 67 101 115 100 92 57 49 124 109 128 191 84 39 58 68 50 74 96 97 70 65 66 122 154 9 214 228
5107 228 252 133 36 59 202 189 121 49 99 89 171 171 100 80 74 76 157 174 82 46 46 119 50 57 181 127 100 125 76 94 118 64 92 170 70
4668 70 49 79 102 90 145 145 69 174 129 72 58 97 204 102 69 68 144 94 105 191 114 39 157 187 166 31 150 169 79 78 167 98 102 53
4243 53 90 100 73 63 91 79 140 150 62 127 160 132 50 12 184 305 146 68 30 54 37 135 113 133 53 44 180 66 47 42 74 145 110 34
3817 34 35 157 176 76 98 184 184 203 328 202 64 129 235 143 316 193 274 250 284 287 154 53 88 124 223 261 226 143 142 224 148 228
3416 228 318 340 244 264 510 307 346 287 487 555 680 629 387 501 794 952 1529 2762 3933 5362 4890 2720 2367 2201 1502
3103 1502 1921 1458 1865 3609 4577 2916 1010 1575 2025 2325 3348 3696 3019 4123 3424 1418 1224 2475 2109 1520 1148
2840A148k64J96j43q6M3q1J5OO5j6L0L20L04R31N232r02m812r92j88l26M2j84k10L85k43k27
2515D3J42M1j52J22n9n3j8k7K7J68j03m2n3J1Q8P0kq3l5J48q9j19J20o0L0M6o7n1L1Q8l1R2
2114B23j15R0p5q1M3P8j28Q4N3k6j14P4J46j37RQL2k9k5Q4m1o8L7p5l9L1J4J03K3j21lJ03
1714A58j33J31%j35J55j24J22o8N6j36P9r3J82J0l5n9N8r0j8K3n4ON8j7O8j3j03J9Q7o4k2
1326D8O7mo6j2qN0J8J06l2j21J60lk9n6K8J7o6NM2M6M3j71j1K9m2J32Mj19%J1M7m2m6L1j4
887D2K5m2L3lQ5O3r9M2J36n8j30J1n2k5O2M9mk9m0J8mJ3k6J02j00j7nO9L6m0km8M1k3k4k2
437C4rK4J9P6m7n7K2J1O3p4M0l1j2N3RK7j02K6N8P3p6J08p8l2j14M0J3j7N0m0L8k1K9P0r6
-2G7K6m8J06J6o8J29j6m3j48K32k33K41%j78R7l6j40Q4J2L9m3L8n7PNN4P4p9j23O0j6
$$ plain form
2840 1148 884 1080 937 851 894 813 828 834 899 883 913 1233 1537 2468 7700 6798 1986 994 806 480 522 338 128 513 270 43
2515 43 185 226 74 196 137 84 66 39 66 234 131 89 36 47 135 205 203 120 85 233 144 25 145 85 115 161 94 43 74 162 131 223
2114 223 108 198 123 42 85 163 35 119 172 146 32 106 252 115 124 132 164 135 110 194 153 85 122 47 8 39 53 156 179 58 55 158
1714 158 25 156 156 21 176 52 174 106 162 26 105 12 194 204 169 110 168 78 60 83 29 35 93 76 144 131 28 47 134 70 48
1326 48 115 111 45 33 25 75 93 199 167 46 206 203 174 118 146 163 97 102 144 190 233 62 51 80 38 170 174 55 55 66 113 71 25 56 42
887 42 67 25 58 55 140 203 104 146 282 224 94 105 53 28 90 139 135 106 66 84 80 93 67 169 69 52 47 116 152 112 110 62 103 80 56 34
437 34 25 49 68 144 97 40 62 73 136 62 102 71 59 112 121 148 46 72 130 203 127 235 157 125 11 51 64 47 97 57 95 74 103 173 77
-2 77 103 55 161 177 109 238 222 179 31 263 30 271 271 93 190 154 14 98 110 149 106 144 87 94 99 153 227 148 25 85 69
-390F9
##PAGE=	F1=1734.12
##FIRST=	23152.448482362498908,	6007.9998942000029274,	0.26137816905975341797
##DATA TABLE=	(F2++(Y..Y)), PROFILE
6008G5k6J8L5O2m1l1j1JM2K3k9j8l8K6P7K8l5p7N0n6M7o6K4M7L6L3j17O5j5r5R8rKrJ33j56
5557I3J24M0n0j24RN1N9N7j8j45M1j8j4j3j3j9Q6k3K6L0q9n3O6pm0L3P5l3m2J4l5O4N4j73
5132A3K26N4m4j18p3qJ57Qn8j18QO3N9j8k5l5N3o5N9K5n3m4k9R2r8QJ05on6K5n0K4K2j1J4
4693A06L7r2j2K4J4m4J00L2j23J59m3l9m2M1R5j02pj4M0Km5J07n1q2R1J5n7n8J14Jp6KQ5j15
4268F3L3m2R4l3r8MM4M8L4K7j14J08J9o2q2k3J83J08j95n5l8Q0o2J10l2Pp3K4J23j46pK0J1
3855G8O3o5n2K0J21O1j08k9J09j6M3J27j47j17L3J22n8J57r6M0mJ8l3j48j1J4N5J16J0m4p2
3466A87lQ3p2N6J09K8p6M3K19j80M2o0K50R4J17q0l08K19L48L34O61J414J698K105q04k868
3141C556o86k79p78K91l91K44J871R54j914j852N12J61J74P78L95n02P12n69j513l03R35k72
$$ plain form
6008 75 49 67 102 164 123 92 81 82 124 147 118 100 62 88 165 193 158 81 131 75 122 56 80 127 163 196 79 144 129 34 132 123 125 116 249 93
5557 93 217 257 207 83 92 143 202 259 241 96 137 119 105 92 79 60 146 123 149 179 90 37 103 96 56 89 164 131 89 103 68 132 186 13
5132 13 239 293 249 131 58 50 207 215 157 39 47 110 169 151 126 91 144 79 138 163 110 66 37 129 31 39 144 138 82 107 57 81 103 92 106
4693 106 143 51 39 63 77 33 133 165 42 201 158 119 77 118 213 111 104 90 130 132 87 194 143 61 152 167 110 52 166 167 91 93 178 63
4268 63 96 54 148 115 17 21 65 113 147 174 60 168 187 125 43 20 203 311 116 61 23 103 41 151 119 126 53 77 200 54 47 67 78
3855 78 141 76 24 44 165 226 118 89 198 182 225 352 205 88 121 243 185 342 246 286 282 300 267 119 108 122 177 293 303 259 187
3466 187 184 267 195 251 360 388 312 355 574 394 436 376 626 720 837 757 449 668 1016 1350 2011 3425 5123 7228 6424 3556
3141 3556 2870 2591 1813 2104 1713 1957 3828 4782 2868 1016 1528 1689 1863 2641 3036 2534 3246 2677 1164 861 1796 1524
2865A524l22k75k23J63q3q4O1nL6J3P8j7L4L58L53J029N807r23n258j074k27l45k6j66l55
2552G3M80j73k08N6R4j21J1L0r5k6p7jJ75m6l4m0JJ7N5N6j55k6K32q0j40R6j03R9N5j49nN0
2152A01L5n2R9n0K9m1o7j3J07j21O3Q4Nj45L8J66r5k0L3M4o4k8J22o4r6L3p1j1L3k0J23O7
1751B24j48k2J18j46J57J5j42J39j48J24m4Q7j65O4r0J49K3pq2P8q2l5K3l2j4R4m6P6k6j20
1376B2J1J09o2k0N2K9p8J1k6L0J5P4lj09J17J2J6o8J8Lm3OlQN7j38J4L8m6J14Mj29K6MN1o0
925E6k4O5Rp3pO6k2N8Q1p5K1J12q2j09K5n4J7MO4k8k6j5K2l3K8J3N5j27K0J5Q8J0j5j3m9K0
474I7j5k2n0N3mK5O5n0k7l5M1L7r0Q3l2k9L5O6L4j20k2J03Q4r9N9k8k3r6J8L6l4J0j5K6m1
36D0M6N8j06Q1m6J11Rn2J08Qo3j53K32k18K11L5k00R2k4j23N0j4L4k7O7m8j2J8K8Q3o7j26
$$ plain form
2865 1524 1202 927 704 867 784 700 761 756 792 805 883 866 900 1258 1611 2640 8447 7524 2266 1192 965 620 594 428 73
2552 73 553 380 172 228 322 201 212 242 147 121 44 43 218 172 138 98 99 116 171 227 72 46 278 198 58 154 51 150 205 56 51 101
2152 101 136 84 183 133 162 121 54 41 148 27 90 174 179 34 72 238 143 123 156 200 136 108 230 166 70 103 32 21 54 34 157 224
1751 224 76 54 172 26 183 198 56 195 47 171 127 214 49 113 23 172 195 188 106 184 102 67 90 58 44 138 92 168 142 22
1376 22 33 142 80 60 112 141 63 74 48 78 93 167 164 55 172 184 200 132 150 153 110 116 113 121 178 40 54 92 46 160 164 35 61 65 116 56
925 56 32 97 106 33 26 92 70 128 209 134 155 267 185 76 101 47 64 68 132 104 78 63 85 52 80 93 148 21 41 56 144 154 139 126 77 97
474 97 82 60 10 63 59 84 149 99 72 37 78 115 25 108 76 47 82 148 182 62 40 143 227 128 187 159 136 40 58 94 60 70 55 81 40
36 40 86 144 38 119 73 184 193 141 249 257 194 41 273 55 266 301 101 193 169 46 96 82 116 89 156 108 96 114 142 225 158 32
-365C2L2J6
$$ plain form
-365 32 64 80
-390H0
##PAGE=	F1=1639.77
##FIRST=	23152.448482362498908,	6007.9998942000029274,	0.26965603232383728027
##DATA TABLE=	(F2++(Y..Y)), PROFILE
6008A05m0j5M1P2m2k8j2JP6ok0pj8L0L6Lk3n1O2j05P3j18K3R3MM5j19N7or4J30k1K3l0R5j34
5557H0J18K8n2j18N8M5O8K8oj25M6m4l1j0J3k5Q9l5J6j9n4m3J00j1n3L4J19o1m5J7n3P0O1
5144B05j83K47Q5j06j30l2m2J60K4m7j13k8J07K9n2J9k5P7j08L3K7j0l6o5J13j22NP6M2o8
4769H2Kj8lJ7L9J0pn0k7N4m8j1P0R6j29J45m0l5n1M4P3j09K4pj2M8m7Q7k1m9J4J1r0K5R7j6
4318A68n8j4P6j41L5qJ27m0r9j9J7J15NM5j23J20Rj06n0rJ55J12k29J3m2R8j25J33l3j3n0
3930F9L5J22k09O1K1J6N4j12K8OR8Q5j13r4J27j0O2J36j76p5kJ28k3J25m5nJ3jo6j17M1JP6
3517B56J20ro5n2j0Q1l7N7P3M4n6O1J79j40N5n8K74J30R7j44m04M15L92N02P50J407K284L212
3166I414j165l694j034n41p66J00l19J87J909P77k239j737M23P3L01P53L78l52N39o14j408
$$ plain form
6008 105 65 50 91 163 121 93 81 82 158 152 132 125 107 137 173 176 153 102 164 59 132 14 37 130 134 179 60 117 111 17 147 126 149 119 214 80
5557 80 198 226 174 56 114 159 227 255 249 124 170 126 95 85 98 73 162 127 143 124 70 27 127 116 63 97 216 155 110 127 74 144 205
5144 205 22 269 354 248 118 86 44 204 228 181 68 40 147 176 124 143 118 195 87 120 147 137 101 36 149 27 32 108 150 82
4769 82 84 66 63 80 119 129 122 72 45 99 51 40 110 206 77 222 182 147 96 140 213 104 128 121 109 157 110 197 176 127 141 152 62 87 184 168
4318 168 110 96 172 31 66 58 185 145 46 27 44 159 164 209 86 206 215 109 59 50 205 317 88 101 59 157 32 165 132 119 69
3930 69 104 226 17 78 99 115 169 57 85 91 189 274 161 67 194 184 246 382 206 131 129 257 234 359 314 309 322 321 255 138 179 180 256
3517 256 376 367 302 250 240 321 284 341 414 458 402 463 642 502 557 499 773 903 1000 856 452 867 1259 1761 2511 3918 6202 9414
3166 9414 8249 4555 3521 2980 2214 2314 1995 2182 4091 4868 2629 892 1315 1388 1689 2442 2820 2468 3007 2393 985
2903I85j95P62l39k18k01j79J13n7q6M0P6L6J6J08kQL90M13J089O306r22n648j128k55l67
2590G45n8j65m38M90j26j66lJ17q0n3N4l8n2q2k2N5L0k7k0rkj9J25k16PK47l1j78R5j25J27
2202A82R2k68Q9M1on9O1M2n6L1o8p1R2o5KJ10L3q7p9J73l9m5O7M4q7j4J48r2r3Rm8L6j3l0
1776C2J12J20j64o4J36j59J71M4j35J07j56J19j0J03j82O7j10J24K8J8j20J02o2l8OnLR7q5
1413I9Q1k6j13j0J10n1j4M2N1r0J6mJ8k6N3J7p5O1K1N7p6Qj1l5L1m1m7O4j03N4J9l2R6J4j30
975B8N0mL5n5j9R4N9j17k9P9m1J7J00l2rQ4j03p8M9n1N1n9P1n4l4K4J9m6O9K5Kq6j9M9R8k5
524A42J3k0n2J3jk0l4N7nJ4L8m4nm0K2L0p5P9j7q0L0J07N6j13o8J12J05j05lJ0qo7lO1m2n4
74C3J9J0m7M3M5p3R0l4J10J1m8R2K1o9j59K10j70J53O0j96Q2j0q9Ok4jJ6R6n5j4M6j6P7o3
$$ plain form
2903 985 790 1552 1213 995 794 615 728 671 585 625 701 737 753 861 859 867 1257 1670 2759 9065 8143 2495 1367 1112 745
2590 745 687 522 84 574 448 282 279 396 316 263 317 279 227 145 123 178 208 181 161 152 150 131 256 40 47 294 263 85 180 55 182
2202 182 274 6 95 136 130 71 132 174 118 149 81 10 102 37 39 149 182 95 16 189 150 105 172 216 129 115 263 171 78 87 39 75 62 32
1776 32 144 264 100 36 172 13 184 228 93 200 44 163 153 256 74 141 31 155 183 201 81 183 121 83 89 84 87 184 99
1413 99 180 154 41 31 141 90 76 118 169 79 95 91 109 83 136 153 78 139 160 217 141 149 138 103 134 93 46 110 7 61 80 48 144 158 28
975 28 78 74 109 54 35 129 188 71 42 121 80 97 197 165 156 240 137 59 108 57 108 49 120 66 32 56 75 29 98 123 125 39 20 69 167 142
524 142 155 135 83 96 95 75 41 98 93 107 145 101 96 56 78 108 33 112 95 15 45 152 208 95 27 139 244 139 136 146 138 71 68 129 87 33
74 33 52 62 15 58 103 30 120 86 196 207 159 251 272 203 44 254 84 237 297 101 183 173 84 90 66 65 81 177 122 108 154 138 215 152
-352A52j20J0M2
$$ plain form
-352 152 32 42 84
-390H4
##PAGE=	F1=1545.41
##FIRST=	23152.448482362498908,	6007.9998942000029274,	0.24903583526611328125
##DATA TABLE=	(F2++(Y..Y)), PROFILE
6008A27m5l7L7O7l7l1mJ7R4k9l1J6JM0ll3mk9O9j40R3j11k2J16j7N1j08K1Pp0J34l0L6k5N2
5570A72r8R5K7n3r6P9M1O6Kjq7N2o2o1qM0k7Q7n2ro8j2jR7pm6K4J47p9m1Ro4Q8M8j62K53J02
5107C95j45j51J3p8J53M0l6r5NQ0Mq7N6j3Q3j27RK7K0j7r0J21j33kN9P3p2k7L7o3J8Q5J0n0
4681A02Qo4Q6j05Q9l7J69r8Q6l9m6n0N6M8j16N0J6o4P4j4N0KKo9Nq8P2P5l5l8m4O5j00rK5
4243F4J33l3p3l3J0J45rM2j15J06kj46K3k6J09J21k54P7m6J01j68J47l2l6KK0J21j84O1LL9
3855A67M5j46P4nQ7Q0j14r9R4jQ4J38k16Lm3J14J9P5J2l0J1k0q8n8N3j2J10J15k1r3l2j9P5
3441C59MP7OO8l7O8J34r1P1m8K70J67Q4k02o03O61M23O11P81J085K606M576j319m370j320
3128D061q42o59q2k24K84K094O16k666j786L45J09L48O41K38k67M58n81j305r3O75l74j73
$$ plain form
6008 127 82 45 82 149 112 81 77 94 188 159 128 144 145 185 182 149 145 116 185 45 138 27 5 121 104 155 47 68 75 5 139 109 145 120 172
5570 172 74 169 196 143 47 126 167 233 235 234 147 199 137 76 68 108 81 168 116 107 39 27 26 123 116 70 94 241 162 121 130 66 154 202 40 293 395
5107 395 250 99 112 34 187 227 191 96 101 181 185 98 154 141 224 97 106 133 153 136 46 167 34 32 91 164 92 65 102 39 57 142 152 102
4681 102 110 46 132 27 116 79 248 150 236 197 151 101 157 205 89 139 155 91 165 151 201 203 205 136 141 53 125 200 165 127 83 148 48 39 64
4243 64 197 164 91 58 68 213 204 246 131 237 235 89 112 86 195 316 62 139 93 194 26 173 141 105 107 127 248 64 125 128 167
3855 167 212 66 140 135 222 302 188 89 183 182 266 404 188 191 148 262 281 356 368 338 349 329 241 183 236 224 334 449 428 335 303 284 359
3441 359 363 440 446 514 477 545 679 588 659 611 881 1048 1132 930 327 988 1411 2022 2803 3888 6494 11070 9751 5381 4061
3128 4061 3219 2560 2478 2254 2538 4632 5248 2582 796 1141 1250 1598 2239 2477 2210 2668 2087 782 689 1364 990 817
2853H17j39j38R8n1p7k4J56M0JJ45M4k5L90N02J169O936q91o173j210k78m12n7j74n06M76
2540F19j17j17n1J21l5q4K7J9m4q0l1m3O6k1j2j2Oq4J68k15M0J66L4k09R6j15J16J36k99J03
2164A48K6l6m1OJ20j51J20p9o2J7jk8R0L7j5r5R7K7j15J13M1j07K8J55j28o3l0j0O8m8j8N9
1764A25J59j52j25J56j27J20Q0j11O7j59J12K5J03j80O1j26J18K9L1j67J20k8k0pJ3K7Q6j23
1413A07P3j9p5l3Q0l8qM3O7j08QK8K4o4K0K6k9K4K3P8p9mk0m3N8m7n2L7l9L1k3oR3K5j19N4
962I3lQl5l4J20J11j19p7P2n3k5J07J6k9M9j04l8P4n6P0j19P3l9l7K4J3m8J13K6l9j6r3P3
549G8J04o2M2k9m9K0Qrk6M6O%jk1J4j8l6M3n0N4oq1J6R3R1q3r8P4J35r2n9K1Ql5j7Q0m0r6
74B5J6lK1l0O2k0L3j2R9K1m6Q3J9o4j63J71j01Q0P0j66O8Mn5l8Jm6Q7R0q2lP8n4N3o6j02q
$$ plain form
2853 817 678 540 638 587 510 486 642 682 683 828 872 847 1237 1739 2908 9844 8953 2780 1570 1292 880 823 649 143 619
2540 619 502 385 334 455 420 336 363 382 338 258 227 184 250 229 217 205 211 127 295 80 120 286 320 111 207 92 208 344 45 148
2164 148 174 138 97 103 223 72 192 113 51 68 67 39 129 166 151 56 153 180 65 178 219 112 140 295 167 104 74 64 132 84 66 125
1764 125 284 132 7 163 36 156 236 125 192 33 145 170 273 93 154 28 146 175 206 39 159 131 111 104 117 144 230 107
1413 107 180 161 86 53 133 95 87 130 197 89 97 125 149 85 105 131 102 126 149 227 148 144 124 81 139 92 40 77 38 69 46 40 133 158 39 93
962 93 90 98 63 29 149 260 141 64 136 83 58 165 181 152 201 97 59 133 77 147 28 101 62 25 49 62 14 127 153 114 98 5 78
549 78 182 120 162 133 84 104 112 103 77 123 129 129 128 107 121 103 67 110 60 114 108 27 43 136 227 144 46 120 255 163 104 125 133 98 81 161 121 25
74 25 41 38 59 29 91 71 104 92 191 212 166 249 268 204 41 212 111 191 261 95 163 167 112 74 75 29 116 206 124 121 199 145 198 132 30 22
-377B2N5
$$ plain form
-377 22 77
-390G7
##PAGE=	F1=1451.06
##FIRST=	23152.448482362498908,	6007.9998942000029274,	0.50947386026382446289
##DATA TABLE=	(F2++(Y..Y)), PROFILE
6008A36l9n1L0M8k2m4LL9J00l5n3L7J7N2k7p2MlO8j57J08q9j8O7l0N2o2l6J4rR2l2K8mK1n7
5557G6N4M0m9p2P2L9N8j3pl8O0p3q5j4N5k6Q8p2m1Nj1jM8Mj8kJ56p9l8mp8J25K2j17K39J03
5107D06j53j72N1j09J33O0k4p9L1N2qj07P9rP9j20nJ8K8Qj10J25j24rN3P3p2k0O9j33L1J13
4706A55J2q4M6q8R7j03J46j29K16m7K4m0p2m9P6L2j20N7N4q8N1K6K4J6O0j20j6o0Q5M6n1k2
4305A34p8N6l5k2J7J09k0n7pJ5J52j3K5r8P6mj79R2l9M3J33k58J12l7Q0j59J31l2o0O6oJ16
3905B53j25M6l5O9M8j49O5j7Q5O1j18m0K4MJ01J43k69R7q1Q1O7J7N8j9j5l8q6j7M7l2J54J07
3504D86k1j15k5k8O8K7J07o4Q9j7N8R7m4Q1k4K46K04J08j41j048Q94M38O40P39N68K226N938
3166A1487j060m645j469j068m75k07p3N33K756O76l285k154K42jJ86M79J02k14M34m23j151
$$ plain form
6008 136 97 46 76 124 102 58 61 100 200 165 112 149 166 218 191 119 123 120 188 31 139 50 32 99 69 121 59 23 37 28 120 88 116 112 133 76
5557 76 130 170 121 49 121 160 218 205 198 160 220 147 62 48 103 77 165 93 52 57 46 45 93 97 79 77 233 154 116 112 34 159 181 64 303 406
5107 406 253 81 132 23 156 216 192 113 144 196 188 81 160 151 230 110 105 123 151 159 49 174 50 41 94 167 95 75 144 11 42 155
4706 155 167 83 129 41 138 35 181 52 268 221 245 205 133 84 160 192 72 129 183 95 146 172 196 212 272 152 136 76 161 207 156 134
4305 134 56 112 77 55 72 181 161 104 97 112 264 251 276 178 254 250 71 163 124 167 300 42 154 117 197 38 169 137 77 143 137 253
3905 253 128 174 139 208 256 107 172 155 240 301 183 143 167 171 272 415 146 243 162 243 310 327 385 366 351 313 227 210 257 225 379 486
3504 486 465 350 325 297 365 392 499 435 524 507 565 662 618 699 675 921 1125 1233 1092 44 938 1376 2016 2755 3323 5549 11487
3166 11487 10427 5782 4313 3245 2770 2563 2490 3023 5779 6455 3170 1016 1258 1257 1443 1922 2024 1810 2244 1821 670
2903F70j41O35l21j40q6j16J29l8n9r0J93P8j2J56J08j1L35O36J324P991r30p099j367l26
2603A519m70o9j91n70M89j45p5j11J15J0q9k1K9po9m0o1M1kl6KJ7j04J69j99O4O9Q8k15Q0
2227B18r9R3J79l08J07J7o2j1l0J56k02J70q8o8K8Mj5N0PM0q3P6O9k07J22N5j28P6J51j63
1851A54k2p5K3Q9n9JkJ62j05j40J20o7K2J16p5L7j75J12N1Q7j52M7j07J05K0L9j85R4J4J1
1476A40JK0M8P0j58M8pk7m7K8k0rN6Q1j29rN9L7p7l0K6J7K2K1P2p9j5k1o1O9k6oJ7k9qo6L5
1013D3Q3L3r4L0Pj4ro7J42J53r8j16L5n2n3R5N0l3J7p5j1R4o0Q0j75P5J9j2l5Jm5J37L1n9
587A17K4j09M8J06r1O5m3l7L9J2J0l0K4J6j0l4PL7Nj13O7k3K7j0l4LL9J29m0j37K6J67o8p7
161A12LJ0j0k1Q7l3p2n7j1R3q0J02j1l8J4Q1L2l5P9J0n6j56J17k9J1O4j22N3J8k5p7L7k2J03
$$ plain form
2903 670 529 1164 843 703 617 501 630 592 533 443 636 714 702 858 966 955 1290 1926 3250 11241 10311 3212 1845 1519
2603 1519 1049 980 789 219 708 563 488 377 492 502 413 392 421 414 345 305 244 285 283 247 249 266 162 331 132 196 265 353 138 218
2227 218 119 212 391 83 190 207 145 134 104 260 58 228 140 72 100 104 89 139 146 186 103 179 248 41 163 218 90 166 317 154
1851 154 132 57 80 169 110 111 109 271 166 26 146 79 101 217 142 179 4 116 167 254 102 149 42 147 167 206 21 115 129 140
1476 140 141 161 209 279 121 169 162 135 88 116 96 87 143 224 95 86 145 182 105 75 101 118 140 161 233 154 139 118 57 126 100 94 111 82 74 8 43
1013 43 126 159 65 95 102 88 79 12 154 307 209 93 128 76 23 118 168 135 152 77 66 160 100 180 5 80 99 87 52 53 8 145 176 117
587 117 141 32 80 186 95 160 117 80 119 131 141 111 135 151 141 107 114 151 156 43 110 87 114 104 70 73 112 241 201 64 90 257 189 112
161 112 115 125 115 94 181 148 76 19 8 101 21 123 112 74 88 169 201 166 245 255 199 43 160 131 142 206 84 137 155 130 53 90 68 171
-265A71O6j21RJ09o8J6p7p5jL0
$$ plain form
-265 171 237 116 125 234 166 182 105 30 29 59
-390E9
##PAGE=	F1=1356.71
##FIRST=	23152.448482362498908,	6007.9998942000029274,	0.61422967910766601563
##DATA TABLE=	(F2++(Y..Y)), PROFILE
6008A30k4o2K9J9Po8JO0R5j5p3L8K6O9m4q9j5K9O0j54J17p0oPl6N1lk5k6J7O0rj1QNj4JO4
5532A49l9o0M2M4N5j3l1J2O7p2r7j0L4k2R3q1k7R9l2m3j3J4K0l5J39m9m3j3o3J31Jo6K00R3
5107C84j26j86P3j18R0Q2rp5L5K9Jj02Q0j0P0r6kqJ5L8j29J27q5j3L9M7p1K4O8j45NJ21J9
4693A72j03N4q3P1m3J51j69K05J7j9m3j09n0R0L9j28M3J01p5k0N6J5K5J17j29m6n0J09J0n4
4318A54j5j06M4J1pNN1On8N8jJ55j1J3p8L9J5k06J22k5n4J56k28J05oK2j11J06l6r0J26l1
3917A25J04n4M1r4R6P3j24J4l5Q4M9j41N1l9QQ9J75l04J47r5K4J19k8O9L5n1n3o0j8L3o1J90
3517C69J10qj12l8l5O0J7J42j11R8NL5P6j2P9K1K16K49J89J02j048K80M55O20O98N89K82O982
3166A0310k63m380j445j150k49k75J45Q70L890Q79m165k653P4l69o6M39J22j62M60k60j040
$$ plain form
6008 130 106 44 73 92 99 31 32 92 187 172 99 137 163 232 188 99 84 113 173 19 136 66 60 67 31 82 79 54 28 45 105 96 85 93 98 84 85 149
5532 149 110 50 92 136 191 178 147 159 226 154 57 47 81 59 152 71 44 143 111 68 55 69 89 54 193 144 101 88 25 156 157 91 291 384
5107 384 258 72 145 27 117 199 190 115 150 179 180 78 158 148 218 122 120 112 127 165 36 163 78 65 104 151 80 104 172 27 32 153 172
4693 172 69 123 40 111 68 219 50 255 272 253 210 101 51 141 180 52 95 196 121 101 157 172 197 314 185 139 89 198 208 154
4318 154 139 33 77 88 81 86 137 143 85 143 142 297 286 299 221 260 275 69 191 166 112 268 40 145 139 161 50 156 120 30 156 125
3917 125 229 175 216 122 218 291 167 181 146 230 279 138 189 150 158 247 422 118 265 170 194 313 285 354 389 338 285 225 207 240 179 369
3517 369 479 471 359 321 286 346 363 505 394 492 497 532 608 596 675 696 912 1161 1350 1452 404 684 1139 1759 2457 3046 3328 10310
3166 10310 10047 5667 4222 3072 2823 2548 2693 3563 7453 8332 4167 1514 1588 1219 1153 1592 1714 1552 2012 1752 712
2903G12k07N97k66j29n2j26J78j6m9q7J56J28J7J26J49N9K54P73J510R231j072q217j545l99
2603A725n03j14k12o05N11j81l6j85R2M2o0n3l0L9m1n9k7j6M7r9L2K8j06J60j95R6pJ13j85
2239A71M6j00N9K24k92R8J6p9K4p2J76j91J54p5r1O4Ok1M1k1O2q6J09J01k13QR4j16P5J49
1864C20j86J9j17M8Q6n2L9n9J27l3j29N9Mj04J49l1L7j27K5O5N9r6K9o7R1jN6j50%M6M5K6
1463A78K4O6O4j90KJ3K3m4m4Mj9P2J01j43l7P3N8o6q2J2N5L4K2N6p3k4rq8N9OK9J5k6m3lJ3
1013H8J9M4n3j8K3k8J9p1J21J79n8j37l2l2n7N1O5k3jl3pJ13n3R0j66J8P1J4o9k8l6J32N0
599A95p4L9j01J1J10j01P5p0j4O2J7L1m5pK1j5l5J5O5K7j85R9Oql4J6rkJ58Rj77k1J86l9o0
161A45j2j2mj2Q0k7l2q8j3J05r4J24j4q3J2N4M3pP4%m6j37O1K7m2M4p5M3K9%r8M9J2J13M8
$$ plain form
2903 712 505 1102 836 707 655 529 707 691 642 555 711 839 856 982 1131 1190 1444 2217 3727 12958 11886 3669 2124 1725
2603 1725 1222 1108 896 291 802 621 585 400 492 534 474 421 391 430 389 330 303 287 334 235 267 295 189 349 154 250 243 356 171
2239 171 217 117 176 400 108 206 222 143 167 95 271 80 234 159 68 132 138 117 158 137 199 113 222 323 110 118 212 96 171 320
1864 320 134 153 36 84 170 118 157 98 225 192 63 122 126 22 171 140 177 50 75 140 199 103 132 65 156 155 211 61 61 107 152 178
1463 178 202 268 332 142 144 157 180 136 92 96 77 149 250 107 70 143 201 135 53 65 120 154 176 232 159 135 126 38 97 103 132 147 121 78 75 88
1013 88 107 151 98 80 103 75 94 23 144 323 265 128 96 64 7 58 123 100 99 66 59 172 119 209 43 61 132 146 77 49 13 145 195
599 195 121 160 59 70 180 79 154 84 70 132 149 180 135 128 149 134 99 114 179 206 21 120 126 118 84 100 91 89 247 256 79 58 244 205 145
161 145 133 121 117 105 185 158 126 38 25 130 36 160 146 63 75 129 172 165 239 239 193 56 117 144 102 146 71 114 143 143 45 94 106 219 267
-277B67j57J0J33n9j8r5m0J0j7
$$ plain form
-277 267 110 120 253 194 176 81 41 51 34
-390C4
##PAGE=	F1=1262.35
##FIRST=	23152.448482362498908,	6007.9998942000029274,	0.46167790889739990234
##DATA TABLE=	(F2++(Y..Y)), PROFILE
6008A11kp5L7pM6p5nM3P9L2q8K0J9Q9o5m8q6O7O0j28J08m1nn3k4L8M0Ml6jM1L3k0k3j9L1n4
5545D3Q9k3n1j5N6O7np6O3O5n0j16J9k2j6J04n1J6J01l0p8l7J4K7k8O8J8n0rlN4Ll4J46P5
5107C34p4j85P7j07M2R7%q4J6J3L1p2O4j6N5o0J3m8qO8j19J00k0pJ0mp3Q2N1j16k9J05L7j07
4681F6N2n8oM3J25j57J45Q7l1n1j32j8L4P5j55K0J47l4q5M6J2L2J68r8p4o8J60k4m0j0j01
4293G0j4K7J3J4m3Q3n9R8m6J58nK3n8MO5k23Q2L0j84J96j75P9M0q2l3R5m2p2J03m3O9K8N6
3880B54j46Q3J27p4m8m9O9O4k07J41n6J6J8K49k61O9n8m4J53l4K2J27p0o1k6m6L1r5J63J43
3504D54J5o7o4k8M5k7J69r9P5M0J7O1nN7R0K00K93L06M22j022o11N39O39Q25J928l146O535
3166G641J096l602j270j095l0l22M11J221N158J002n149l015j77q65k21O33K75j41M31k34
$$ plain form
6008 111 109 34 71 64 110 35 30 73 152 184 96 116 135 224 159 111 25 92 152 24 132 91 86 33 9 47 87 91 55 54 95 128 108 85 66 97 43
5545 43 132 109 58 43 99 166 161 85 148 213 163 47 66 44 28 132 81 97 198 168 90 53 67 94 66 134 152 102 93 90 144 147 113 259 334
5107 334 260 75 152 45 87 184 184 100 116 129 160 88 152 136 191 131 144 96 88 156 37 137 117 110 120 116 43 125 176 60 31 136 173 66
4681 66 118 60 54 97 222 65 210 297 266 215 83 65 99 174 19 39 186 152 67 113 125 157 325 227 153 85 245 221 181 171 70
4293 70 56 83 96 110 67 150 91 189 143 301 296 319 261 265 330 107 189 219 35 231 56 135 175 93 60 155 113 41 144 101 170 198 254
3880 254 108 191 318 244 196 147 216 280 73 214 158 174 192 441 180 249 191 147 300 266 288 415 345 284 258 212 243 148 311 454
3504 454 469 402 338 310 355 328 497 398 473 513 530 591 586 643 733 933 1226 1532 1954 932 321 860 1499 2324 4252 1106 7641
3166 7641 8737 5135 3865 2770 2740 2418 2829 4050 9208 10210 5061 2046 1869 1004 783 1416 1691 1550 1981 1747
2916A747r78j23N26k85j33l4j42K08Pm9m3J02J60P3J02J57J49J83Q75J664J0311j210r228
2628D039j685m97m68j80k34o11N12k05J3k48M8L2Qm4j28N1Rr9L2q6J27j88N9N1j04J54k22
2290A36J43l9J11j31J7j29oK67k22O0J5p0L9j29K01j44R4l3j15N6M6m6L2qO1j08J33J44j70
1926B05j48J41m5j2J68j91M8j26M6N6m5J00r4O8L2r9pP6r9L0K1P8p9r9O3L3k7J8l8R6k5Q6
1526B31j41q0N0P7N5L3Q3Q0k18o1L6O8j3j17J9l1P4J34j46p2N6R6m3j06l4Q4L2K7N0o0l1K1
1125A53j33L9L2O3Koo8O8Oq7O1Lq3M9m9N0k7M7J91j0j32j18K6l0j7K2J7k0Rk8J29l0J08j42
700I5m7R6M9p0q3k0J09Q6r9M2o8m2J21q0O2j11J0Q7K6N5o9m6J7rolR0M7j80J03K6n8p4N5k3
261H8j8J67O0k02n9J75rk2j0m9j5MO3k6J9o9l4P6q7J29ro2n2J9M9L8O3ol3j17L1M6p1J8l3
$$ plain form
2916 1747 769 646 1172 887 754 720 578 786 793 744 701 803 963 1036 1138 1295 1444 1627 2502 4166 14477 13267 4039
2628 4039 2354 1857 1389 1209 975 364 876 671 684 436 484 516 524 480 352 403 412 313 345 259 386 198 257 308 204 358 136
2290 136 279 240 351 220 237 108 102 369 147 207 222 152 191 62 263 119 213 180 65 121 167 121 153 145 206 98 231 375 205
1926 205 57 198 153 141 309 118 166 40 86 142 97 197 103 171 203 104 97 173 74 104 125 203 124 25 88 121 94 112 74 170 145 231
1526 231 90 10 60 137 192 225 308 388 170 109 145 213 200 83 102 71 145 279 133 61 117 213 170 64 30 114 146 173 223 163 132 153
1125 153 20 59 91 154 156 150 82 150 156 69 130 133 50 99 50 100 73 120 311 301 169 51 77 47 30 52 69 49 58 30 159 129 237 95
700 95 48 144 193 123 40 20 129 215 116 158 90 48 169 89 151 40 50 137 163 218 149 103 120 111 105 102 192 239 59 162 188 130 56 111 88
261 88 70 237 297 95 36 211 202 180 170 121 106 110 173 147 166 97 63 139 52 181 172 110 58 77 126 164 227 221 188 71 102 148 77 95 62
-177F2L5M1J9j01K7L8J27M7j72j4J49l9m2j11lQo0
$$ plain form
-177 62 97 138 157 56 83 121 248 295 123 109 258 219 177 66 63 71 11
-390A1
##PAGE=	F1=1168
##FIRST=	23152.448482362498908,	6007.9998942000029274,	0.19729542732238769531
##DATA TABLE=	(F2++(Y..Y)), PROFILE
6008H3K5r0M8k0Q8n6Nl7O1Q9j03J8j6J03r8N6j10K0Q2j02Q4Kk3r0J2jM5M0k6k3J3P6J8n0o9
5570E4N8p2Q0ll3o3M0J04j1j41J27M1Mj66O3o7JR5J0J4P6mq8l5K5j8J8j0R0m6kJ7m3L7k5Q6
5119B13N7j1j75P5r6L2P9lj04mRN9j9L9k6K7j7L1q7k5Q9o0K6N2J5k5o7m1Q0K9o3k6N1P3j12
4681G5Q3n7n7P2Q2j22P2J51qp0j04K1r1J34j41pJ20K6m8k4l1L2K07m3r2j02K27m0k8Pj09p0
4280F5K8K1K7j16J83l8N5j14J63RO0l5k3J25k29nJ07j87J24j38Q4O5j77K6J17n3k5J5j2l5
3905H7J19R0j29rJ85op5l9L7Q7k32J17j0K2r8L35j85p2K3n5J22qn8K07m9o2j3m2N7j06K7K01
3504D68L5Lp9lJ8m3J39k5L9Q6K2L5j5J9J53K11L08L94O77r91r32M31P13J095L514k351J00
3166D021K970k548j040r90J42l80O85J530O157R11n944l070m92j336K9Q44L20j94L08l14q74
$$ plain form
6008 83 108 18 66 46 134 78 83 46 107 196 93 111 95 198 100 156 46 66 148 46 130 132 109 19 31 30 75 115 89 66 79 155 173 123 54
5570 54 112 40 120 117 84 21 61 165 154 13 140 181 185 19 82 15 16 111 121 135 211 207 119 84 109 91 109 99 189 143 141 158 115 152 127 213
5119 213 270 259 84 159 63 95 174 171 67 63 72 131 112 151 125 152 135 166 79 54 143 83 109 161 176 151 84 43 123 152 89 63 114 187 75
4681 75 158 101 44 116 198 76 148 299 291 221 117 138 47 181 40 33 153 179 131 107 76 108 315 272 180 78 305 265 237 244 135 65
4280 65 93 114 141 25 208 170 225 111 274 283 343 308 285 410 181 176 283 96 220 82 166 231 54 80 197 144 119 134 122 87
3905 87 206 296 167 158 343 337 262 223 260 347 115 232 222 244 146 481 296 224 247 192 314 306 248 455 406 344 331 289 346 240 267 468
3504 468 503 506 427 424 442 399 538 513 552 638 660 695 680 699 852 1063 1371 1765 2442 1451 519 950 1663 2758 6272 3921 4021
3166 4021 6991 4443 3403 2413 2555 2175 2860 4390 10547 11458 5514 2444 1952 616 645 1489 1809 1615 1923 1609 735
2903G35J5M62l26j37j4j37K09L6m4J5O2J87J22J41J68K61J81R91J953J2104j285j0930j959
2615B810p00m16k50k74o32M98k28N4k55pm6P1lj50k7N4j38O3j19J63k06J8P8p5J28k63J73
2277C21l7J18r3J2j36o5K10r2lJ7k7qj13J73q1M3j1j08o7J57o8j5N5O1q9M5K08j01j87O7M9
1889B35j63K43j80M5q9K4K2o5J56q8L9L1n5n7J24m4j22N9J35m1j62l1P0j6L5m4J26l5J19j72
1513I9p4nP2P6N4J04J18k37j02L1R7M4j53Jl0M2J78j41j04PJ57k4j09r5J15j5L8P3l4n6P2
1125A99j63OK2J08k7K3q1J40Kk09R0N6j18O6j02Q1M0n2K09L1j14j35O1k4j0l8N2q5O1m9P9
737A19J0J39j16j13J01Q8m4j66J3P8J31j37M9k5r7J28l5L7j25j2J08M3Q2j04r0PK3J4k3R9
361A82O4j36J19L5j12j11O0l2k0J55J07j94p2J20J8K6Jq8l9K2N0l1O6k2o6K9o2J24npj17j4
$$ plain form
2903 735 750 1212 886 749 735 598 807 843 799 814 876 1063 1185 1326 1494 1755 1936 2927 4880 16984 15699 4769 2810
2615 2810 2110 1694 1444 1170 538 1036 808 862 607 600 554 625 622 472 445 499 361 424 305 468 262 280 358 283 411 148 321
2277 321 284 402 309 321 185 120 330 238 235 252 225 217 104 277 196 239 228 120 53 210 142 127 182 243 154 199 407 306 119 186 235
1889 235 72 315 135 180 91 115 137 72 228 140 179 210 155 98 222 178 56 115 250 209 47 16 86 70 105 61 187 152 271 99
1513 99 25 20 92 168 222 326 444 207 105 136 233 277 124 125 95 137 315 174 70 77 234 210 101 6 121 106 144 217 183 127 199
1125 199 36 42 64 172 145 168 87 227 229 20 110 166 48 114 12 93 133 81 290 321 207 72 133 109 99 61 113 28 89 40 119
737 119 129 268 152 39 140 228 184 18 31 109 240 103 152 127 30 158 123 160 35 23 131 174 256 152 62 69 92 106 83 182
361 182 246 110 229 264 152 41 101 69 49 204 311 117 45 165 183 209 210 122 83 105 155 124 190 168 102 131 69 193 188 181 64 50
-39E0K0Q5N4j0j8r6K7L4q3MqK9N3L0j04mM7J49O4j68n2J53k0o1j14K7qo7
$$ plain form
-39 50 70 155 209 199 181 85 112 146 63 67 59 88 141 171 67 63 110 259 323 155 103 256 236 175 61 88 80 13
-390A3
##PAGE=	F1=1073.64
##FIRST=	23152.448482362498908,	6007.9998942000029274,	0.043514318764209747314
##DATA TABLE=	(F2++(Y..Y)), PROFILE
6008E2N4q9L8j0J21l9J2j20O0J23j24O2o0Q1j41J96r8n3J04r4N9M8o0p6pnQR0%l9l7J09P6
5595B41n1j01L5m6M5Qj0l1l3J29l3q7Q6j4Q7j94N8l1ML7O5k2M3M2o9m7N9q0N8j2J08l7lJ3
5169B17j42P6k2L6N0M0j63P3q6N7L4j8j33Q7RlM1K6n5k1L2N0j05nO5jl9J06M7n5j01K5k8K1
4743A15lKkJ12j36J43p8k4qM9p5J3J82L7r7n4M0j59J43q5mLR1K3l8q8LK00J0r6j15K62l2l4
4318C00L6j32j15N2J9J5n8J66j3k6j94J71M4J07mm5J69k20p4J53j31M0j48J27N6j60j6J60
3967B79p6nk0L4j41J46J32o9q5J78O2o0k2J8Q5k22L4N9J9j43L33j22j62Q1k4Q0op6K06qn7
3579D48k6LR4j29o2K25L5O1q0K1pkP1L8L1J30L7Qk1j2J81K33K84M16P96r19p96L52P95J292
3204C497M517j025o450M993j675q96r27K51m44R21J758O576N95o294k791q01j629P29P59K07
$$ plain form
6008 52 106 17 55 45 166 127 139 19 79 202 78 140 80 161 20 216 118 65 169 75 134 182 122 46 39 34 42 132 132 93 56 165 241
5595 241 190 89 124 78 123 131 121 90 57 186 153 66 152 138 225 31 89 58 62 99 164 142 185 227 158 111 170 90 148 136 244 207 204 217
5169 217 75 151 129 165 215 255 92 165 79 136 170 152 19 106 115 112 153 179 124 103 135 185 80 75 140 139 100 206 253 198 97 122 94 115
4743 115 112 114 112 224 88 231 153 129 121 170 95 108 290 327 230 176 216 57 200 115 111 114 205 228 190 102 105 305 315 219 104 366 334 300
4318 300 336 204 89 141 160 175 117 283 270 244 50 221 265 372 368 323 492 272 198 351 220 260 112 239 295 135 119 279
3967 279 203 198 178 212 71 217 349 280 195 373 435 375 353 371 456 234 268 327 346 203 536 414 252 333 309 389 383 307 513 505 448
3579 448 422 425 519 390 328 553 588 649 569 590 583 581 652 690 721 851 888 896 875 863 1044 1277 1561 1977 2773 1854 1058 1410 2205 3497
3204 3497 8014 6989 539 5532 3857 2961 2034 2285 1841 2762 4520 11096 11691 5397 2606 1805 176 905 1664 1871
2953A871k86J62m14p08J14M26l13j42K3j00J88P7pQ2N7K61J26K75K51M21L57J268K766J6735
2653B3490j543j5168k756j111n23l43l80p23N43k93K7k34m3j23M9J9r4j20M5j35K1q1R5j35
2352D84m8O7k6Q6k65J46m3J46r9J9j21m5N6J9m4L2lq5l2J16l7O0p2q7j58K23n4p5J08O1l0
1964B99j11K61l9j48n3J14k58L11j76J6n7K1L5q6J23m6O0l3j4p4J30Jj59QJ78pj77m8R4j38
1588B7J08p4J50k0J31k17o4O5p0P3Q7J31J73k44q7j8R2J16j61l1k0LK09j33j24k5K04k8j09
1225A44r6J11j04M4J37oj10J36j63nn1J65o1L9q6K06lk39O3P3r2N8j17K9J24j58K56M0r6q9
850A49O4k3j4j3L8j46J04n2l5N1J81r8j66J15J01ok21J6N3J72j73O9Jj00Q8J4J6r3n4P5P5
462A88J10j48j19lQ5k5kN8P9o9J49L7j59j25K2k8pJ03J47j54o2N4K5P6J2j28o4L8N7l2Q1M4
$$ plain form
2953 1871 1585 1747 1333 625 739 1165 852 710 733 633 821 898 891 973 1030 1291 1417 1692 1943 2364 2721 3989 6755 23490
2653 23490 21947 6779 4023 2912 2389 2046 1666 943 1486 1193 1220 986 943 820 869 888 794 674 719 584 605 524 619 484
2352 484 436 503 477 563 298 444 401 547 448 467 346 301 357 376 332 364 361 276 244 360 323 383 311 224 66 289 235 160 268 329 299
1964 299 188 449 410 262 209 323 65 376 200 216 159 180 215 129 252 206 266 233 219 145 275 276 117 125 303 296 119 71 165 27
1588 27 135 61 211 191 322 105 41 106 36 109 196 327 500 256 169 151 243 359 198 167 147 150 359 226 102 77 281 253 144
1225 144 48 159 55 99 236 230 120 256 93 88 37 202 141 180 94 300 297 58 121 194 102 160 43 72 196 38 294 334 238 149
850 149 213 190 176 163 201 55 159 107 72 123 304 206 40 155 256 250 29 45 98 270 97 166 167 67 155 169 185 92 38 113 188
462 188 298 150 31 28 113 88 86 144 223 154 303 340 181 56 78 50 43 146 293 139 77 131 156 232 244 116 52 90 147 115 196 240
61B40r9k5k1J17j4N6j49qn5R1N9k3Jp6L1J7q5J4rK1O7L0j09k7L4J81R0j60q1J48j3q2r1M4
-365A14l4n5
$$ plain form
61 240 141 116 95 212 198 254 105 97 42 133 192 169 170 94 125 142 57 71 62 83 150 180 71 44 78 259 349 189 108 256 243 161 70 114
-365 114 80 25
-390B5
##PAGE=	F1=979.29
##FIRST=	23152.448482362498908,	6007.9998942000029274,	0.059950735419988632202
##DATA TABLE=	(F2++(Y..Y)), PROFILE
6008C3O9o5QJ0J41k7J5j44O3R6j54J38o1Jn8K09r4q2J01r4L7Q5j04n4l8J5l5J43K6m6o3Q7
5607A58J37l6j20j4qL4oJ2mo7J25n4j4M1q0J72j79nJ1NlR0p4K1Q7k7o9J05j17N0K7J02k8r
5182B63qj84N8j1J5O1N5j54P6p9R3j6l2r2J63Jp8P7K8j03q6Q9O6r7J6L3L1o6J29Q2p8j11O7
4769B08j60N3L1M3l5J36j75J96r0Jr8O3l7%J49Q1j24qM4j59J06k9j1p1J18Q2k2j11j4J48M0
4380C55q9j08K57rn3O5j52j52Q9K6k0kJ36J1j12k09J37J01J33L2o9J87j92r5J45p2oj93J80
4017C21L0j25o0K04j04jLN4j53P5J62or7J03J16k3j3J2N8k09j9J12J1j22K65q7j57P6%P3m3
3629D56l6J62J9m8m7O1J26j67o0K08J6R4p3L2k3O0J1N6N5J70L8oj9l4J83K47K31L77P71p99
3254B061n53L50Q62J343M814P6n956J851j412q97r14L03m54J062J864O279J37o056k263j014
$$ plain form
6008 33 102 37 45 55 196 169 184 40 103 199 45 183 122 123 65 274 180 98 199 105 142 227 123 69 31 46 11 154 180 134 71 158
5607 158 295 259 139 125 117 151 145 157 153 86 211 157 143 184 104 276 97 92 103 108 105 195 121 142 229 202 133 238 121 171 198 300 272 263
5182 263 255 71 129 118 133 194 249 95 171 92 185 169 137 45 208 209 131 208 236 133 47 136 202 105 121 154 185 119 248 330 252 141 208
4769 208 48 101 132 175 140 276 101 297 207 208 110 173 136 136 285 366 242 234 278 119 225 196 185 114 232 314 292 181 167 315 355
4380 355 266 158 415 406 353 418 266 114 203 229 209 207 343 354 242 33 170 271 404 436 367 554 362 267 412 340 334 141 321
4017 321 351 226 166 370 266 265 268 322 169 244 406 400 303 406 522 499 486 498 556 347 328 440 451 329 594 507 350 426 426 499 456
3629 456 420 582 601 553 506 567 693 526 466 674 690 784 711 743 720 780 791 847 902 1072 1110 1104 1085 1051 1234 1481 1712 2089 2860 2061
3254 2061 1508 1858 2720 4063 8877 8953 2997 4848 3436 2539 1625 1928 1474 2536 4400 10679 10816 4760 2497 1483
3003A483j176Q58N76P7l40R4m77n49J39M57k32j44P7m6J85J04P3J43J05L92R5M41M28O35O87
2690D085J784M165K4684k251k2307m130j695q46m94n66q52O75m29o5k43p1j63k8Mm7j78lj11
2402I18m6l0mo2p3K8J5M5k62J22o4J62j27J8j00j8l3M9o3N9rj48M4P8j7J08j80o3j28J83k2
2014C80q9J07N5J8j91K53k0r6j34J19k12K94j99nm7L8O3r6M0PQ8r0J1q0J18K6j49n9J96K4
1639C70j73l8J05k26J67p8J26%J19k27r5J55j18j2R8J58K25k42n2o4N6J81j57n8j1lJ98j23
1288B81j27k0K16o1j09p3J05j17NJ86Rj79K00j53or9J94p6J5q3K63j6k36M9M6m6N3j20n4K03
912B50j83K75J4r9l1P3k1l2J8K5k07J57o1r5L3K22q9j82J45P2K8k36j2L9J94j82Q6%p3L5N1
524B14Ko4o6jJ24J37j95p7jR0j08P1l3R4nJ85L4j90j33j8%K5j3J80r7l9K8qJ16J4j66o7L1
$$ plain form
3003 1483 307 1165 1741 1818 1478 1572 1095 546 685 1142 910 766 843 797 982 1086 1159 1302 1407 1799 1894 2335 2763 3398 4085
2690 4085 5869 10034 34718 32467 10160 6030 4335 3489 2995 2429 1577 2252 1823 1758 1515 1444 1281 1253 1257 1210 1032 1029 918
2402 918 872 842 838 776 703 731 746 791 529 651 587 749 622 640 540 522 489 538 475 534 525 377 421 499 482 590 410 347 219 402 380
2014 380 291 398 453 471 280 533 513 417 283 402 190 484 285 280 233 271 334 238 278 285 373 283 294 214 332 358 209 150 346 370
1639 370 197 159 264 38 205 127 253 253 372 145 50 205 87 75 173 331 556 314 262 198 254 435 278 220 209 206 404 281
1288 281 154 134 350 289 180 107 212 95 100 286 295 116 316 163 157 58 252 176 191 108 371 355 119 168 214 168 221 101 47 250
912 250 67 342 356 257 226 299 278 246 264 289 82 239 178 83 116 338 249 67 212 284 312 76 64 103 297 115 201 201 128 163 214
524 214 216 152 86 85 209 346 151 74 73 163 55 126 93 187 182 367 401 211 78 60 60 85 72 252 155 116 144 136 252 266 100 33 64
111F4J02k5M9J16j26o9J8J21m3J07j54%p7J4R0m7J3n2K9Np2L0k2OQ2K7j12k7j1K16J17j60
-290B09q8J42k3j04l9L9o6l8
$$ plain form
111 64 166 141 190 306 180 111 129 250 207 314 160 160 83 97 187 140 153 101 130 135 63 93 71 77 159 186 74 47 36 252 369 209
-290 209 121 263 240 136 97 136 70 32
-390C2
##PAGE=	F1=884.936
##FIRST=	23152.448482362498908,	6007.9998942000029274,	0.081105373799800872803
##DATA TABLE=	(F2++(Y..Y)), PROFILE
6008D0N6m0j1K3J52k2J0j25O7M0j77K05l7q9M4J82r8q6Q6r0J8J09j48k7n9M1RJ10M3n1m2J3
5607A46J83j6j34o3L2M8m1K8K0r0J13o0L8J4j16K20j58n9L4Rj9Q3j33M9R2J8p8J40j12rO3
5219B42J06k6j1m3j30l9lL1Q1L1j50Q5p0J25o2k5k9J93k0j04Q4L9j65j20J22Q0q0J4J7L8p0
4831A41J44J09r4j20J00k16P5J2Q6n6J47k13K21q5J1j76J22k0MR7J10j46K3L8j42P4K0k1p9
4468A66R3J12jj17j8J08L9p2r2K21J8p4Q3j54j79J20M4n8M6Q4L4j80j09M9J47J24O5r6J76
4105E79j47q4J08k4k7k38K19kq6r0K34j27mN2N4j55K1J67M5p7J7J43K1j6J7J2j86l5J41Lq2
3717D53J87q1r3M1JR1j03K0J27J8l5o3J08J50k07j7J78j2J10n9K4l0J21l1L7R4K03J9jj0n7
3329A183J70K43J64K99O28o43k82L42Q64J230M457P78m534k85j606r60q66L04l27J041J819
$$ plain form
6008 40 96 56 45 68 220 198 208 83 150 190 13 218 181 92 136 318 220 134 220 130 148 257 109 82 23 64 73 183 226 175 133 146
5607 146 329 313 179 116 148 196 155 183 203 113 226 166 204 218 102 322 164 105 139 148 129 212 79 128 220 238 160 300 188 179 242
5219 242 348 322 311 268 138 99 96 127 208 239 89 174 104 229 167 142 113 306 286 182 266 305 140 20 142 222 142 156 173 211 141
4831 141 285 394 300 180 280 64 139 151 237 181 328 115 336 251 262 86 208 188 192 289 399 253 276 314 172 246 266 245 166
4468 166 259 371 370 253 235 343 382 310 218 439 457 383 466 312 133 253 297 239 285 369 403 223 114 163 310 434 499 403 579
4105 579 432 348 456 432 405 167 386 384 298 208 442 315 311 363 417 262 283 450 495 418 435 578 599 583 600 612 426 391 532 535 453
3717 453 640 559 466 507 508 599 496 516 643 661 626 563 671 821 614 597 775 763 873 814 838 808 929 898 935 1029 1232 1251 1250 1240 1183
3329 1183 1353 1596 1760 2059 2687 2044 1762 2104 2968 4198 8655 9433 4899 4614 3008 2048 1182 1486 1159 2200 4019
3066D019N332l27n249j629j058n28O88M32N6k93J27m98m60J53M97j66j17J34j4K36R5J59K00
2778A789J78N31Q1N71O46Q73J062K429N819L4143l286l0730n744k345j259o92p96r18Q17o17
2527B552j85k78j10j85j05l4l3k12o6p8j12J5r2j2o2j5L9%k49J11q0J40j51Nq1J6p0K1o8Q8
2152G09l2j79J06M1kJ47k94k7r1J45J3p9Q7M4M0k09K24l7m8j76P8j39K78k39mn4P1P3r9l2
1776C15M8R6j17K8q9J02K8j19j16J96N3j54l3J08k24J69p3R3RQ8j84j39K16j29k0M2J59K51
1426F04k34k1q8J6K17j50p3lK0J57j16j13j7K20j12j03k3P9p7j6J78J1k27K39j39jj21K08
1075C15p9l5o9L06l7k34N7K%N1j24j08K39j41K72k6j25K1R1j8o0M9J0k58K12p5r2k7K47q9
700B75j62J75K5M9k40l9K8K01j59Q6j9l1j2P3om1o9q2J84J58k35k4j1Q7j53J20j08J00K4K15
$$ plain form
3066 4019 9351 9024 3775 2146 1088 560 1248 1680 1736 1443 1570 1072 612 765 1262 1096 979 1113 1099 1335 1430 1589 1789
2778 1789 1967 2498 2579 3150 3796 4669 5731 8160 13979 48122 44836 14106 8362 6017 4758 4066 3270 2352 3169 2552
2527 2552 2367 2089 1979 1794 1689 1655 1622 1410 1344 1266 1154 1169 1077 1065 1003 988 1027 1027 778 889 809 949 798 803 722 738 668 689 621 709
2152 709 677 498 604 645 643 790 496 469 378 523 536 457 544 588 628 419 643 606 558 382 460 321 599 360 356 302 373 446 347 315
1776 315 363 459 342 370 281 383 411 292 176 372 425 271 238 346 122 291 218 311 320 408 224 85 301 172 152 194 353 604
1426 604 370 349 261 277 494 344 271 268 288 445 329 216 199 419 307 204 181 260 183 167 345 356 129 368 229 228 107 315
1075 315 236 201 132 438 401 167 224 226 226 277 153 45 284 143 415 389 264 285 376 358 298 347 357 99 311 236 144 117 364 275
700 275 113 288 313 362 122 83 111 312 153 239 220 189 177 250 244 203 134 52 236 394 159 135 124 211 58 178 70 170 194 409
324D09K7k00j42k3K2N3j00J70n4oL1n4J34Ok02j2k2J70k1KJ70j44r0M6J30p7J31j42jq3o8
-64F0J38p0Nk9J7Om3L8m0j3R7K5j06k1l1K05J38j66p5J39m3j23K7J5r1j7
$$ plain form
324 409 436 236 94 71 93 146 46 216 162 156 187 133 267 273 71 59 37 207 186 188 358 214 124 170 300 223 354 212 211 128 60
-64 60 198 128 133 104 121 127 84 122 82 69 166 191 85 64 33 238 376 210 135 274 231 108 135 150 59 42
-390D2
##PAGE=	F1=790.583
##FIRST=	23152.448482362498908,	6007.9998942000029274,	0.20067484676837921143
##DATA TABLE=	(F2++(Y..Y)), PROFILE
6008E7L2k2j1K4J54k6%q3O8j3j16J71nj52J00J61j06p6O4p6JJ19j81kk5L0N0P5M6n4ko0J99
5595C41Kj47r6O7P8q9L8M2j10R7m5N8%j17K26j29q7L3J4j9N7j83J29M3N0n8J49p5p7O3J21
5207C76k6pq7l3j20l6O6R5oj49R9n9J48j02J0NK04n6q4P7M9k29n2P0R2o4pJ0K7o5J66J21j01
4794C32j34J27j90N8l0J30p8J48k29K09o5Mk27J89j4JO3J21j56L8J9j13N4N5k9n3N2J11J2
4430D05j08j7Q5K4m9p4J70L4q4Q0j35j88J29O9q0Q2J1N7k15j1J9J56R5Q8j27J45r0o4O9Ml3
4042D47k58K29l1m6j05K40j34j1J09L4j52nJ50P8m3n2J40O4k9K2l9j49k8J47Nm3J20r7rPj7
3654E44J14j61O1J20rk1o6J36J56k37M0J46m2J11l6ok5J65n3lJ34K28j9K0Oq5J50K20R6K03
3279A887M20m80l7L05P90R85L624J013l100j208j786r61o98K37k0Q16J621L967o61m038j023
$$ plain form
6008 57 89 67 56 80 234 208 208 125 193 180 64 235 230 78 178 339 233 157 221 145 146 265 84 82 57 87 137 212 258 204 202 142 341
5595 341 343 196 100 167 245 156 194 236 126 223 178 236 236 119 345 216 129 162 176 157 214 31 160 203 253 195 344 269 192 255 376
5207 376 350 343 256 223 103 67 133 228 222 73 172 113 261 159 169 174 378 322 238 315 364 135 83 153 245 181 174 184 211 146 312 433 332
4794 332 198 325 135 193 163 293 215 363 134 343 278 282 55 244 230 231 294 415 259 297 316 203 257 312 283 230 282 393 405
4430 405 297 280 365 389 340 266 436 470 386 466 331 143 272 341 261 343 354 411 196 185 204 360 455 543 416 561 471 407 476 480 447
4042 447 189 418 387 341 236 476 342 331 440 474 322 317 467 545 502 450 590 654 625 647 608 459 431 578 583 540 660 563 554 561 544
3654 544 658 497 558 678 669 648 582 718 874 637 677 823 781 892 856 850 825 990 937 934 1068 1296 1277 1297 1303 1218 1368 1588 1684 1887
3279 1887 2307 1827 1790 2095 2885 3870 7494 8507 5407 4199 2413 1452 754 991 971 1787 3408 7375 6714 2676 1653
3016A653r19p9N71L95J52j87J37n59l85K25M63j65o0J90kL15O4K29K55K48O35R4O42Q48J087
2703E847J386L023P299M2632m347l8243p175k912j627q91j011q48Q75q08l03l18j52k03j60
2465B064p1n0k28j32m0j70N3j54J7k9m7M0m6k18J05p8P7j57j7o7N6q0l1o7J14n8j84J59lJ4
2089G72J55l86K5n2J07M4n7O4L2L3k04K01o4j3j89J7n7K52k74J2o3J10N6r5o7O5Q4j23M8j02
1714C31Q3J4p6j58J83P5j17l7J02j88J60p2O8OM6j01j73K35j39NQJ39K38k20pr1mK18j43p8
1338C07PN6J01j13q0k7K17j67q8M8K8l3j8J48Jk29K44j24Rj32K21q7q6m2L33o0k37P4m5M1
962B67M9j25j21K23p5K61n9j60N7J15j8r1P8qk86K55r2p8o7K47r3j15J92k5O4k39n6J3J98
599C11j14P0n0K2n0Q5j1k1o8j54K39J70k58J4l2Q4j27J09j14R1lK29J6j87j51mK8Q3r0J02
$$ plain form
3016 1653 734 655 1226 1621 1773 1586 1723 1164 779 1004 1467 1302 1242 1432 1430 1745 1809 2038 2293 2541 3176 3270 3912 4760 5847
2703 5847 7233 10256 17555 60187 55840 17597 10422 7510 5883 4992 3981 3133 4008 3200 2897 2579 2427 2224 2064
2465 2064 1993 1943 1715 1583 1543 1373 1426 1272 1289 1260 1213 1253 1207 989 1094 1016 1093 936 919 852 908 828 797 730 844 786 602 761 758 772
2089 772 927 541 566 514 621 665 608 672 704 737 533 734 670 657 468 485 428 680 406 418 355 465 521 426 359 424 508 385 433 331
1714 331 414 428 352 194 377 452 335 298 400 212 372 300 368 374 420 319 146 381 242 247 255 394 632 412 405 314 310 528 385 307
1338 307 314 370 471 358 278 251 468 301 213 261 289 256 238 386 387 158 402 278 287 155 376 289 203 161 494 434 197 271 226 267
962 267 316 191 70 293 218 479 420 260 317 432 414 323 401 393 107 362 270 192 125 372 279 164 356 331 395 156 100 113 311
599 311 197 267 217 239 189 274 263 242 174 20 259 429 171 185 153 237 110 219 105 196 193 422 438 251 100 96 124 207 117 219
224B19o1L2L5q8J37j0k28O7o3K15l0k4J90j50j00P0J34r8J22j20or0r6J57p8k3j1nK7nL6o4
-177I1k7J08K9j00k1qJ44J50j69n3J33o0j28Q1j8r5%
$$ plain form
224 219 158 190 225 137 274 264 36 103 40 255 225 201 391 241 141 211 345 247 369 249 243 153 57 214 136 113 102 97 124 119 155 91
-177 91 64 172 201 101 80 72 216 366 197 144 277 217 89 170 152 57 57
-390E7
##PAGE=	F1=696.229
##FIRST=	23152.448482362498908,	6007.9998942000029274,	0.20438934862613677979
##DATA TABLE=	(F2++(Y..Y)), PROFILE
6008F8J2j0mK2J48l5j6k3N9m5n7J14K9j78R9J48j11o0M1n4j3J16j96J8L2LQ2M1L9n8M6j10
5607A47J84J6j61r8Q7J08j33L8O3j26P8j6M4kr9K09r8q5J8J7j1K5j78J66j2O1j4J31j9j13
5232B27PJ45l0Mj33P9j46j17R5J03l8j51J19m3J58j35N8J6J97j06k7O2N1k81K9K3J00m8l8
4869A80%Qn8J95J14j00j46J43j35L3p4J72r7J34k13J68l8j5k45K33j3pM4J24j50M0j2p6M3
4506B52P2k8j7J4Q8J2q9j2O6J3k5n4J12L8q1N7j01j77J15R0p9J09p2P5k03O1J0J46O6R6j52
4117D02J00l3m7M6Rl1k40K04n4lj05K15j22j5J63pj45nJ16R2lr3J08J03n1K5q4j03qJ29K2
3729E85j4P5j27P2j4m4J28k00P8J37n0j4n2J45J41k47R0J16p0J02jn7j4J88n8m5J63K41o5
3366A189M6L6j23J30J82M5J04K04l33J44K49O62O82K592Q43j894j345j729q40l71L4L82M51
$$ plain form
6008 68 80 70 66 88 236 201 185 162 221 176 119 233 262 84 183 331 220 160 201 147 134 250 54 72 104 107 189 230 269 211 257 147
5607 147 331 347 186 88 175 283 150 188 251 125 203 187 231 229 130 339 241 156 174 191 180 205 27 193 181 242 228 359 340 227
5232 227 234 379 349 353 220 299 153 36 131 234 196 45 164 121 279 144 202 218 415 309 282 344 395 114 143 166 266 218 180
4869 180 180 188 130 325 439 339 193 336 201 234 160 332 235 369 156 324 286 271 26 259 246 239 283 407 257 297 285 209 252
4506 252 324 296 279 293 381 393 304 292 358 371 346 292 404 442 361 418 317 140 255 345 266 375 303 378 175 236 246 392 458 554 402
4117 402 502 469 422 468 477 446 206 410 356 353 248 463 341 326 489 482 337 332 448 540 537 444 552 655 604 629 545 442 434 563 585
3729 585 571 646 519 591 577 533 661 461 539 676 626 612 560 705 846 599 689 805 735 837 836 779 765 953 895 850 1013 1254 1189
3366 1189 1235 1271 1148 1278 1460 1505 1609 1813 1480 1624 1873 2535 3217 5809 6652 4758 3413 1684 844 473 507 889 1340
3078A340J301K521p62k697n11o74J82N90M40K11j40M4o75k26L07L57j89J7K40NL80K7K71L03
2778B662K95O72J26O52R83J224J581L400Q224M7925n134m2873q052l258j847j035j150o21
2552C774P67r41l95l40j87k14j85r3q7k26j89%k16Q3j87L5J4o0K1r5j67J01n6j3j42m2o3J00
2202I97p8q4o4J32p6j69K01m9L1J27m39R1j9O7P0l0M2K1Oj92J77p8J0j83m4K1K13k92L7o5
1826C81J43J8q6o3O7N1j20P4j13O1j0k4j80J62Q9p2m7R3j31J33p5N3jKKj94K24j56L2JJ20
1438D34J97j98j7p6kJ93j38p6K2Q7M8j10l9m2J98k12n9J24m2Mj6J10j5j83K20j11J9j29K31
1075D22j02j29lL38p8k41R2q6P0M6j21j15J81JK35q1j82P0J39j9j21J01k7k82K76j09o8p3
725A34K25r7n2J85p0Q3k38o1mJ88o0M6q9P7p7R2j1po6j87K56J71k58L2n5P7p1P8j00R3m6K15
$$ plain form
3078 1340 2641 5162 4400 1703 1192 518 700 1290 1730 1941 1801 1845 1170 944 1251 1608 1419 1436 1676 1681 2061 2088 2359 2662
2778 2662 2957 3629 3755 4407 5390 6614 8195 11595 19819 67744 62610 19737 11685 8427 6580 5545 4395 3774
2552 3774 4541 3600 3205 2865 2678 2464 2279 2186 2099 1873 1684 1684 1468 1551 1364 1399 1413 1353 1374 1279 1112 1213 1157 1144 1002 960 897 997
2202 997 919 835 771 903 827 658 859 810 841 968 529 620 601 668 738 708 750 771 777 585 762 684 694 511 467 488 701 409 446 381
1826 381 524 542 456 393 460 511 391 465 352 413 403 379 199 361 450 378 331 424 293 426 351 404 403 405 407 213 437 281 313 314 434
1438 434 631 433 416 340 338 531 393 317 339 426 474 364 325 283 481 269 210 334 292 296 280 390 375 192 412 301 320 191 422
1075 422 320 191 188 526 448 207 299 213 283 329 208 93 274 275 510 429 247 317 456 437 316 417 390 108 384 275 207 134
725 134 359 262 210 395 325 408 170 109 105 293 233 279 190 267 190 282 271 264 198 11 267 438 180 212 157 234 163 241 141 234 188 403
324D03Lj54j55J6L6J06p8Q2j14O6L0j07J35k7k11J13p3K25n1j7J77j50j09J01J23r8R0j00
-27B62rj00o4J32p7m7nl5P5K9K4r2k0J06L4r8k1QQ2J50j51l3J17o7j15J04m9p2N
$$ plain form
324 403 406 252 97 113 149 255 177 259 145 211 241 134 269 242 31 144 71 296 245 228 405 255 146 247 370 272 362 262
-27 262 253 153 89 221 144 97 92 57 132 161 185 93 73 179 213 115 94 102 184 334 183 150 267 200 85 189 140 68 73
-390G3
##PAGE=	F1=601.875
##FIRST=	23152.448482362498908,	6007.9998942000029274,	0.18367108702659606934
##DATA TABLE=	(F2++(Y..Y)), PROFILE
6008F9LmMJ8J35m5l3M0M4n5j3N4N9j73N4J39j09m0J9l1k5J07j85K4R0k9J02J2K5o3R4j36J50
5595C01K7j75o9Q8J31j66L0Q5j34N2J7OLp2J77o5n4oJ7kjj20J26m2N0M0R3M8j07r2J66l4K0
5182C38j69J82j45j97J07J04n8j56J45k2J55j63J06RJ83j68N4M1M4l09J08j0R9l0o1k4j2n7
4831I4K24R5r8j47J45o9Rj15K08j08J03j67J23k0l6k16K22j6j6L1J26j29L6n3l4L5P4j7K2
4468C06j7N5ko3j1M7J0jl3N6L1o4K0o3j50Q3R9n3J26j51Q9j41Q9JJ27M6R2j68N4J4m5M9pk8
4042C97j78J47o9L7q6J59r5j1K09o4j39J4P5Q7L3r8N4J33p3J9j14n3J5Q7N8jN3j65J36j9o5
3654D83J28k13P1J66q6k7k2J46J02k35J23R2r4Q9M3j15rJ92n7p4J77K42j04O0Q1j64J14J35
3304A244K3J7K2k18K51J93N17M20J666M56j057j026j434n51p1l42O97R3R37J359n69j536j09
$$ plain form
6008 69 72 68 72 90 225 180 147 187 231 176 163 217 276 103 157 296 187 147 166 135 110 217 32 56 146 117 219 231 256 193 287 151 301
5595 301 328 153 84 172 303 137 167 252 118 170 187 193 196 124 301 236 182 176 193 191 190 70 196 154 204 244 337 385 278 186 352 318 338
5182 338 169 351 206 9 116 220 162 6 151 129 284 121 227 236 419 251 305 346 390 81 189 179 278 248 187 163 151 94
4831 94 318 413 315 168 313 244 253 138 346 238 341 174 297 277 241 25 247 231 215 246 372 243 279 226 192 227 301 284 306
4468 306 289 344 342 279 268 315 325 324 291 347 378 314 334 271 121 204 303 250 376 225 314 173 262 263 390 436 528 360 414 428 383 432 425 397
4042 397 219 366 297 334 248 407 312 301 510 446 307 321 396 483 516 418 472 605 532 551 437 384 399 486 544 543 596 431 567 548 483
3654 483 611 398 469 635 549 522 500 646 748 513 636 728 634 723 766 651 642 834 777 703 880 1122 1018 1078 1159 995 1109 1244
3304 1244 1267 1284 1306 1088 1339 1532 2049 2469 4135 4591 3534 2508 1074 523 452 110 807 900 1837 3196 2627 1091 982
3016I82n03L62O52M49J36j77j10p73K7L38K06j90R4K72J0M08qK80L30L12O30J60O04J020J248
2703F759J601L457Q352M8623n428m3390q148l288j862j080j166k66M35r57m44l31k00k16j78
2465B273r2j31k05k31M1k45J03j94M8N7n4j2j38j03J01k3j08j12o2o9J42o8j27o1J38p8j47
2127F43K35q9M6O6m43J59QK6Q9mK3J0k5j83J47p1K1j58r2Q3J61k83O2n8J61l1p2k9O2Qj20
1739C52J06j20L3l3L2j84J44R0k7n7Q1p0R2q1M2ll2J04k01J94j77M9RJ10J41j64n1m9J5J57
1363E02j34p1M3J03Pj07%m7J57k34j8J83j15K9j7P0l6j00J79r8K4j12K31j16j64M6L15q4k37
1000A99J06j19Q7M0j09j03J31P2J89r0j78O4J53j8j44J13m3k44K71j21p3m7J87r7J6J59j12
662B89J10k36n4k1J72kK0j33J21q9R6mKo3j79K26J57k35L1p3O8oM8r4J01o7J69qj07j45K1
$$ plain form
3016 982 479 841 1493 1942 2078 1901 1791 1018 1045 1383 1589 1399 1493 1765 1775 2183 2175 2455 2785 3097 3727 3887 4491 5511 6759
2703 6759 8360 11817 20169 68792 63364 19974 11826 8538 6676 5596 4430 4164 4599 3642 3198 2867 2667 2451 2273
2465 2273 2181 2050 1845 1614 1655 1410 1513 1319 1367 1424 1370 1358 1220 1117 1218 1195 1087 975 913 844 986 918 791 730 868 790 643
2127 643 878 789 835 901 458 617 625 651 740 736 759 769 744 561 708 637 658 500 408 491 652 369 431 373 534 503 431 402 464 472 352
1739 352 458 338 371 338 370 186 330 420 393 336 417 347 439 358 400 397 365 469 268 462 285 334 343 453 594 430 379 330 345 502
1363 502 368 297 340 443 450 343 343 296 453 219 201 384 269 298 281 351 315 215 394 296 320 208 439 323 159 205 520 436 199
1000 199 305 186 273 313 204 101 232 304 493 403 225 289 442 424 280 393 350 106 377 256 183 136 323 226 242 401 289
662 289 399 163 109 88 260 258 278 145 266 177 273 269 271 208 29 255 412 177 208 135 203 197 245 151 252 185 354 346 239 94 115
274A15N2J16p2Q5j71R1J5j14J32k8j54J04p0K15p4J3J47j48j26J44R8q2N0r1pj10j7R7p4n3
-102H3mo7J40M6Pj20NR5L2r4j3RL7J28r9l1Q9o2r2R8p4k9L
$$ plain form
274 115 167 283 211 296 125 216 231 117 249 221 67 171 101 316 242 255 402 254 128 272 370 288 338 247 240 130 113 210 136 83
-102 83 79 12 152 198 205 85 90 185 217 123 110 119 156 284 185 154 243 181 89 187 113 84 87
-390H7
##PAGE=	F1=507.521
##FIRST=	23152.448482362498908,	6007.9998942000029274,	0.236904144287109375
##DATA TABLE=	(F2++(Y..Y)), PROFILE
6008E9NLPJ1J16n0m9J00K5m9J1LQ2j50mJ28j03j8jj3l5R5j38NJ33n9J04kOo8J34j40J06L9
5582B93j83k8Q2J37j79J2J07j23J0M5l3Mm0J38l6%l5J4Kj3o0N2m3K5R2M1J12o5k00J68l4L5
5182B97j86K61j34k17P0R9o0r1R5KJ42j84J45j1J68k32J40J7L0k99J59k2Q7qn9o5k8o8K46
4819B94O9r8j37J38qrj51K33j00N1j01R3j5m7j74J77k2k4J5J27r1K9r8QK3P0jN8l9K5k4l3
4418B38k1K2J8J9j1RK3m8j1l2j18M6Q8j1J31k06R6m9Q2j4R8M0P9j71J5M4n9P4l5l1p9P4q1
4005B19P3n0Q0o3MK46j21j45L9M1N9O3p3rJ57r0Mj24rL4K9J04mN3k04J71rp5J23k03M7J93
3604E60r8o8J2J55M5k04J35P3j10P4R4j56l4J89o1q3J75K34j18M0J42k00J03Q4L6m2j05j48
3254G24K93J66L87K79J092J57o07n50j006k59j68l56N05j45O37Q28j26q90P0m95N10O32L75
$$ plain form
6008 59 64 67 74 85 201 151 102 202 227 178 189 192 274 124 120 248 145 127 126 113 78 173 35 40 173 114 218 216 222 154 288 148 254 293
5582 293 110 82 164 301 122 134 241 118 128 173 140 144 104 242 206 206 171 185 187 174 114 166 123 148 240 281 393 328 128 296 262 297
5182 297 111 372 238 21 91 190 130 39 134 136 278 94 239 228 396 164 304 321 351 52 211 189 276 268 209 144 116 48 294
4819 294 363 265 128 266 258 249 98 331 231 282 181 274 259 212 38 215 193 169 184 311 220 249 151 159 182 252 251 309 270 295 271 238
4418 238 217 239 257 276 265 274 297 249 238 206 88 134 222 211 342 136 232 183 265 251 349 389 468 297 312 356 297 371 336 305 226 300 219
4005 219 292 242 322 259 263 509 388 243 282 323 382 445 372 363 520 430 434 310 301 335 364 468 464 517 313 484 475 400 523 320 367 560
3604 560 462 394 406 561 606 402 537 610 500 574 668 512 478 667 606 523 698 932 814 854 996 796 899 983 1019 977 872 724
3254 724 1017 1183 1570 1849 2941 3098 2491 1941 935 676 508 152 657 512 1149 1977 1851 961 1031 536 1046 1678 2053
2966B053j4k55k55p84L13K92N0j52J46K81PL91k9K51L29K95N19J85N11R53J151J443L177P647
2665A8505M4535n140l9645p438k992j668j017j030J91j55q38m45k89j85k02j47o0j73j69k51
2415A387P6k51J08j79N8Q9l1m7j67m3J06J5j86p6p4q2J75n2j53o1J34o3j25K52j11N9j2m07
2064C39K16K9j0R9J7J0pm4j76J05m9K8j22j20J22J03k42P5m0J57p8n7K0O5l7j30J37j16lm8
1689B43Q5j72J33P7J1o2O7j9M4r0L3Mm5J85j95J56j99N3K0J13Q1j15j05k0L7J22j26o3O3J02
1313D18k0j01L0l5R5k26K8K15j76M2k4L0n7kJ32q0J9q3K16j18j91R4K61p5k18J17j42R2L2
950B73q9r3Q8J22J32r3j47M4J54rj55J08n5j80K44j22r3JJ42r3P5J21j49J44k30m4l2J56M8
587B68Jj78J46q7J00J1%n7j63J91J25j91Oq2O4N0L2j03J00m8R9j5n3j15%Q1J05p3R2k04J01
$$ plain form
2966 2053 2039 1784 1529 745 1058 1350 1400 1248 1394 1675 1682 2073 2044 2295 2624 2919 3438 3623 4134 5087 6238 7681 10858 18505
2665 18505 63040 57900 18255 10817 7825 6157 5140 4110 4301 4146 3308 2863 2574 2389 2187 2040 1980 1807 1638 1387
2415 1387 1463 1212 1320 1141 1199 1288 1257 1210 1043 1000 1106 1121 935 859 785 703 878 826 673 612 746 683 558 810 699 758 746 339
2064 339 555 584 574 673 690 700 693 649 473 578 529 557 435 315 437 540 298 373 333 490 412 355 375 440 403 273 410 294 291 243
1689 243 328 156 289 366 377 315 382 363 407 317 350 354 309 494 299 455 256 309 329 442 523 408 303 283 320 442 316 253 316 418
1313 418 398 297 327 292 387 161 189 404 228 270 246 276 219 217 349 269 288 205 421 303 112 206 467 392 174 291 149 241 273
950 273 184 91 179 301 433 340 193 237 391 382 227 335 280 100 344 222 129 130 272 179 254 375 226 370 140 96 64 220 268
587 268 269 91 237 150 250 261 261 204 41 232 357 166 172 90 154 204 236 133 233 185 284 269 216 101 101 182 287 214 306 102 203
199B03Kj15J25kj13P8n8J89r2N0J22j48j54J95O3o0K2j02Nj18K6O3p0l9kj3J16N0j4j44L6
-189A01Q0K1p6NpK8P2k4m1N1m9p1P5q7K3q
$$ plain form
199 203 205 90 215 213 100 178 120 309 217 267 389 241 87 282 345 285 307 205 210 92 118 181 111 72 70 57 173 223 209 65 101
-189 101 181 202 126 131 124 152 224 200 159 210 161 90 165 78 101 93
-390I3
##PAGE=	F1=413.167
##FIRST=	23152.448482362498908,	6007.9998942000029274,	0.24897433817386627197
##DATA TABLE=	(F2++(Y..Y)), PROFILE
6008C9J5J8NnR4m9n4J44Ml2J4l0R8j20l4R9r6jj1j0m6R0q3k2J52p8Q7lqo6J52j24N4N9j70
5570H2rQ1J29j71j6J25q8n0N9l3k1rR5qO0o1NKj3Kl1l8oJ30j7J64mk51J11l1M8j68K94j23
5144B39j96K0Q7l8k7L5K2J22j95J70l4J48k73K04rJ5k35J52j3O7J3l2j03l0r9K45M9j00j23
4781H1J24M1j7j81K42p0j7k9Q4j8m3j58J38k5k8j8J27m0K6j30K9KP1J4Q8m9%l9%n2kK8L3J5
4355B27l2K8m3j9j6j00L8M1L4J17k16Q8M9N5k7N7M0O5j58j0N2r3J15o2m4L9Rj01J00jkl8K7
3942B19K70j50j69N3K3J3Q1l2o4J78r6j2j18J8M8l9J49j6O9k41J74Op0J20j72J5K08p5j36
3579B54L4J84j8j66J30O0j23O4J45j48j15J99q7p2J61K19r2k3K11k22R2L8P3m5j74j51K95
3241G23J76L01K64Q83J96l97k84p77k56l37k38J94k27N31R40Q8p52P1n12N96N23K47j54l32
$$ plain form
6008 39 54 72 77 72 166 117 63 207 211 179 193 163 261 141 107 206 110 109 98 88 42 132 49 27 179 101 188 185 177 111 263 139 193 252 82
5570 82 73 154 283 112 96 221 133 83 142 109 88 79 174 166 226 165 170 172 159 161 130 92 86 216 199 363 359 108 219 188 236 68 362 239
5144 239 43 63 150 112 85 120 142 264 69 239 205 353 80 284 275 290 55 207 194 261 274 242 139 109 10 255 304 204 81
4781 81 205 246 229 48 290 220 203 174 258 240 197 39 177 152 124 106 233 193 219 89 118 120 191 205 293 244 244 205 205 153 151 179 212 227
4355 227 195 223 180 161 145 45 83 124 158 275 59 147 196 251 224 281 321 386 228 218 270 177 292 230 186 225 234 133 233 232 230 192 219
3942 219 489 339 170 223 246 259 340 308 244 422 326 314 196 214 262 223 372 356 425 184 358 364 294 414 242 257 465 390 254
3579 254 288 472 454 288 418 478 355 419 564 416 301 500 413 341 502 721 629 606 817 595 687 725 798 753 579 428 723
3241 723 899 1200 1464 2347 2543 2146 1862 1085 829 492 254 448 221 752 1692 1780 1028 1099 587 1183 1706 1953 1799 1467
2941A467l44o76N27J92p9p9J57K62mL36k8J88K96K57L64J94L95Q01R60J151K631O294L6730
2653E1992m346l2610o110k441j314q69p60P84r51o73m16k28j47j74j00lj98j26k50R8k29R1
2377A020j47N6J12lp0j77lJ18N3k28m9p6r4J83k4j58p5J23l4j05K47j08P3q4l52K46M8m0J03
2014E55L0Pl2m1j64N1k4K8p2j32J35M6j75P4j7J36j14m4O7P8o6j50J53r6m4n9J34j55J35N3
1639B97L6n7N1J6pr4J6K0k8K29j76J19k17M3K5J26K9n3j58mN3R3j13n0P8Q8l1r5M2nK3j90
1238A06P2K18k17N6m6%q1Q7Q5n0Pn2J87r9k16J34J81n5j79J21j50Q6K0o0q9O2J44P8r7r9J9
850A73J39Rj46Q0n9j02J97j04j27N7R8p8J06Q3j77J77k15l7l7J42Q3j1k10J44p1J02L6j3n0
487A89j35J71P4j28n4q3O4Q5M0j22Q2JK9k6Lp0m5J16Q0p7R0k04R9Jj17J10M9j02M1l9J53r8
$$ plain form
2941 1467 1123 447 974 1166 1087 1008 1165 1427 1423 1759 1731 1919 2215 2472 2836 3030 3425 4226 5186 6337 8968 15262 51992
2653 51992 47646 15036 8926 6485 5171 4302 3542 4326 3375 2702 2286 2058 1911 1737 1637 1634 1436 1310 1060 1158 929 1020
2377 1020 873 929 1041 1038 968 791 788 906 959 731 682 606 512 695 671 513 438 561 527 422 669 561 634 550 198 444 492 452 555
2014 555 585 592 560 519 355 406 382 410 338 206 341 387 212 286 269 405 291 247 314 392 326 176 329 233 189 130 264 109 244 297
1639 297 333 276 327 343 336 242 258 278 250 479 303 422 205 248 273 399 428 375 217 213 266 359 246 196 274 362 331 236 278 273 296 106
1238 106 178 396 179 235 189 189 108 195 280 230 237 185 372 273 57 191 372 317 138 259 109 195 215 155 66 128 272 350 253 154 173
850 173 312 321 175 255 196 94 291 187 60 117 215 137 243 326 149 326 111 74 37 179 262 251 41 185 114 216 252 239 189
487 189 54 225 299 171 117 34 98 183 223 101 183 184 213 187 190 120 75 191 271 194 284 80 179 180 63 173 222 120 161 122 275 177
86A77Q0J15j49j91K43L0m6K1j35K7j22N2M2o5j5J6L0P5M6l5j52N4O2Rm4K7k8M9mM4n2J3l3
-327A41n7N2p7N7k3
$$ plain form
86 177 257 372 223 32 275 305 259 280 145 172 50 102 144 79 64 80 110 185 231 196 44 98 160 169 125 152 124 173 169 213 161 174 141
-327 141 84 136 59 116 93
-390I3
##PAGE=	F1=318.813
##FIRST=	23152.448482362498908,	6007.9998942000029274,	0.25975057482719421387
##DATA TABLE=	(F2++(Y..Y)), PROFILE
6008A4L0M1kl0P3m8l1J60j8j4Km6J08q8k8O2r4Onk0n8R2m8m2J44p2M7Rj7l2J24q7mQ3j22l1
5557E8Q5J12j45n0J33l7j17N7K7n6pN4J5J09p8j0MoO2o7o6l6J42p7J97O5k16k0k0N6r5K51
5157C24j10j51k5P1%J6j1L1R5j90J79m4J16k24J75l6Rj44R9J1M7K7Qj20j9r0J69M4j04j17
4781C6J07P3j5j95K25k0q6K8R1k1l3j59J20j5k4p4J11J6L2j07ql4Q4K4J06m6j8l0K8r6j4K2
4380A08L9M6o3M6n1Nmj25J04m7M4Q5j21K6J11K3k2%M3N4j27k2N1j44J45o6p6J50j8j37J10
3992A67M9o4k5M6K79j27j92K5K8m6Q7Oj03J98q7j6r2QN7r1J68k4R1k62J42Qn1J24j24k1K04
3604C62k0k03K0K32p0j30J16N4j40O5J84p8k48K42j47n3J37K03k7j20K77k15P3nJ14J7j63
3266D77k53K64K02K77K77Q10L51k55k53p65l16m07j68jj17N75J011k6o56K7m74O03L79J15
$$ plain form
6008 14 44 85 83 53 126 78 47 207 189 175 177 131 239 151 123 185 91 97 92 72 14 106 58 16 160 88 135 144 127 95 219 132 128 211 89 58
5557 58 143 255 110 60 193 156 39 96 123 67 60 114 129 238 160 150 154 148 210 143 77 41 183 106 303 368 152 132 112 168 73 324
5157 324 214 63 38 109 109 125 114 145 240 50 229 185 301 77 252 216 225 81 180 191 238 265 273 153 134 44 213 257 153 36
4781 36 143 216 201 6 231 211 125 153 244 223 190 31 151 136 112 38 149 165 197 90 82 48 132 156 262 216 198 168 196 100 86 108
4380 108 147 193 130 176 125 130 126 1 105 58 102 187 66 92 203 226 204 204 247 301 174 152 203 59 204 138 62 212 194 57 167
3992 167 216 152 127 173 452 325 133 158 186 140 227 233 130 328 241 225 133 141 198 107 275 251 342 80 222 230 179 303 179 158 362
3604 362 342 139 159 391 321 191 307 361 221 286 470 392 144 386 239 186 323 526 499 379 656 441 514 509 623 640 477
3266 477 224 488 690 967 1244 2054 2405 2150 1897 1132 816 409 241 240 123 698 1709 1683 1027 1054 580 1183 1562 1677
2966A677k26l75l59m63N55Q4j62KJ31K24k7K62%J08K32K17K01J82K88O02P29Q09J959M646
2665A1296K7242l271k4118m503j785q83o95m06J601j636p84m05j67j12j45n4O9j91r4k27R4
2402H26j75L8r0J9J32K0p0j68LJ32R7k22m9p0q6J42K6j40j18J16rq1K14p9R5j10l17K29O4
2039C69n2R8L9J7n7k7j26j8j0J4oj38J28Jj05O4PJ10j26n2J00J04o5j46J07n3p4q7J75j40
1664E1J47K4M7l9L5L1m8q6k1M1K0K23j39Q5k15J4J7J46j2J6j73k7N6P1r7k5Q1O8k4q9K8L9
1263B45m3j34R9K04k39Q4p0k2j05J32M6rmk9J48o0k31J55R3l9j25J17j39Q0mk5r2N9J40M4
887B76j14l6k0J12L4j11L1n6k5J34o3j23O6O0m4Q9N1j87J96j83m0l4J27J00j7j90Q8m6J03
524A78O7l3m9q9J84K9p3j29l3lR3O2j24L4O6j7m9N4k6r4J43M9p3P5j77R2K0j22Q5R2j08jj5
$$ plain form
2966 1677 1451 1076 717 254 809 893 731 733 864 1088 1061 1323 1323 1431 1663 1880 2081 2263 2551 3153 3882 4691 6650 11296
2665 11296 38538 35267 11149 6646 4861 3978 3283 2877 4478 2842 2058 1653 1486 1374 1229 1175 1244 1053 959 732 826
2402 826 651 689 599 618 750 770 700 532 535 667 764 542 493 423 337 479 505 365 247 363 354 273 487 408 503 393 76 305 369
2039 369 317 415 454 471 414 387 261 243 233 247 241 103 231 232 127 191 198 308 182 130 230 334 269 123 230 177 103 16 191 51
1664 51 198 222 269 230 265 296 248 162 141 182 202 425 286 371 156 170 187 333 321 337 164 137 193 264 167 142 223 291 267 178 206 245
1263 245 202 68 167 371 132 216 146 124 19 151 197 188 184 155 303 243 12 167 260 221 96 213 74 154 150 125 33 92 232 276
887 276 162 126 106 218 252 141 172 116 91 225 162 39 105 165 121 210 261 74 270 87 47 13 140 240 223 33 121 75 178
524 178 245 212 163 74 258 287 214 85 52 49 142 204 80 114 180 163 114 168 142 48 191 240 167 242 65 157 177 55 140 232 124 123 108
111A08J10q5R0J27j38j77K17J3n3N2j79M9j11M9M0m5j0M5N2L1M3n1j29L4M5J1j6M0m5P8n3
-277A42P0n4j4j9n5N3l8M5m2
$$ plain form
111 108 218 133 223 350 212 35 252 265 212 264 85 134 23 72 112 67 57 102 154 185 228 177 48 82 127 138 122 162 117 195 142
-277 142 212 158 144 125 70 123 85 130 88
-390H8
##PAGE=	F1=224.459
##FIRST=	23152.448482362498908,	6007.9998942000029274,	0.270397186279296875
##DATA TABLE=	(F2++(Y..Y)), PROFILE
6008A6L1N9j1o4O6o2K7J44m0Jk1n0J13n7j6M5r5mK0k8m4P4m1m5J01l8jJ9j8L7M8l4n9J02o4
5570A11o2Q2R3j05q8J29J3j71M6R8n0m2J9K9J33q0k9J5jJ16n4j06l7R3j35K11J26j48j47M
5194F3N7j7J65r9q6n3M7L0M7l7K2O6j64J69k6O2j09P8o1J9o6L5L7L2L2M4j12rq8J00N4j01
4794A31j26Q7Q5kj31J19L9j18M0R9j8k7j37J14pj8o4RO3M6n6o4l7N8L1J09l4l4%M6j22J0k1
4380G0K6P6p3N1m5K2K4j15J17n1m3M5J4JQ4pMn3M4M2q1k6O4r6K9j4n4J35%j57P2Q6q6j9M1
3942A27K72o5j73n0M5p7P1J0j19K06o5Kn1l5N0o0J04pR9j97O0n4QR9n5o5J81M3j91p1K77q8
3542B31j08J05N6j69Q0J91J8l33K75k04l2P6J85M8k02L27j74M2m7J31J05r4l46J78J80L19
3216H38K42P33L75j61k18p78l46l80j06o4M3N68Q51k00m75jm11N67K60L5k26l37l09k73L76
$$ plain form
6008 16 47 106 95 31 97 35 62 206 166 167 146 96 209 152 136 181 86 82 102 74 30 104 63 18 119 81 80 99 81 118 166 132 73 175 111
5570 111 49 131 224 119 31 160 173 2 48 146 96 54 73 102 235 155 126 141 140 256 202 96 59 152 17 228 354 206 59 63
5194 63 120 103 268 169 83 30 77 107 154 117 139 205 41 210 184 246 137 215 154 173 107 142 179 211 243 287 175 166 78 178 232 131
4794 131 5 92 177 175 44 163 202 84 124 223 205 178 41 155 148 130 66 75 138 184 128 64 27 85 116 225 191 157 157 203 81 91 70
4380 70 96 172 99 150 105 127 151 36 153 102 59 104 118 119 203 196 200 147 191 233 152 126 190 94 123 109 55 190 190 33 105 191 105 86 127
3942 127 399 334 161 111 156 79 150 160 41 247 182 184 133 98 148 88 192 185 284 87 147 93 101 200 145 80 261 304 113 42 319 231
3542 231 123 228 284 115 195 386 404 71 346 142 110 186 371 419 217 544 370 412 365 496 601 507 161 339 519 838
3216 838 1080 1813 2188 2027 1809 1031 685 305 199 135 178 746 1597 1397 922 921 510 1077 1337 1372 1146 809 500 227 603
2903F03K0k03O4R0J81o3J88N1M8J39J97O9J43K24M05N22N29J323L156J8546k257j6401l035
2615D539j203m68n73n6K642j702j460m69j26j32j53l4J29j20j01j70M4r4o6J4r5J65K6l6j52
2302C49k7J21J66j65q4n8k6RJ02r3k03J44m0k4J37l1J28n1k58O3Q2l5P8N4L9o0l2m9p5qn2
1914A01P9j50J14nq1N1L0J00q6j23J10J39k8p0n2K5l1l7L8j11J44qN0j4L1L4p1m9o8K1R0J71
1513C44q7O1j78m7mJ69l7P6j27q1K6N9q4J3P5M8mo6k8Q9q7q2J06J90k50J25o9l7l5J8J5L7
1113A48jk0J06j5j81J07L8m7p8J05j08Q7m5%q5O4J25M3j39K7q3P7N4n4k0m7M3N8pn9QL1LK4
687A59L0j61J79j40m4kQ5R8k3j20nj7J04J02n1p3k2K20J8n5j58nj00O9Q9r2k3J08k3q9R9m
286A53j20J42K8n3N1j44R1M9j33P6R3j18m3QO8m7O9J50j08j25J33J9q6J06j93M6p9KN5j2k7
$$ plain form
2903 603 623 420 484 574 755 692 880 931 979 1118 1315 1384 1527 1751 2156 2678 3207 4530 7686 26232 23975 7574 4539
2615 4539 3336 2868 2295 2239 4881 3179 1719 1250 1124 992 839 805 934 814 713 543 587 493 427 441 346 511 537 501 349
2302 349 322 443 609 444 360 302 276 285 387 294 91 235 195 171 308 277 405 354 96 159 241 206 284 338 377 317 285 236 161 153 101
1914 101 180 30 144 139 58 109 139 239 153 30 140 279 251 181 129 154 123 86 124 13 157 149 199 185 216 250 179 130 62 83 173 344
1513 344 257 318 140 93 89 258 221 297 170 89 115 174 90 103 178 226 222 156 128 217 130 48 154 344 94 219 150 113 78 96 111 148
1113 148 147 127 233 218 37 144 182 135 57 162 54 141 96 96 11 75 200 243 104 131 48 125 179 125 105 58 101 159 152 93 101 132 135 159
687 159 189 28 207 67 23 21 106 204 181 61 56 39 143 245 194 121 99 319 337 282 124 119 19 88 177 85 62 170 147 58 157 153
286 153 33 175 203 150 201 57 148 197 64 140 233 115 72 80 148 101 170 320 212 87 220 239 153 259 66 112 33 35 90 78 51
-102E1P1O0pN0m9r7j9M4L9k8L8n1R4n0M9m9k4j0o0Q4j3J6o0
$$ plain form
-102 51 122 182 175 225 176 79 60 104 143 115 153 102 196 146 195 146 122 112 52 136 123 139 79
-390G9
##PAGE=	F1=130.105
##FIRST=	23152.448482362498908,	6007.9998942000029274,	0.23510292172431945801
##DATA TABLE=	(F2++(Y..Y)), PROFILE
6008C8K9O3j7r5Q3q9P6J17o2Rm2n1J11k6j5M7r5k2N2k7l3O6m9j6J2J5j2j1j5J05l2J8p4Q6
5582A44j9o3N3P4n8j17J07N3j49L3R1k1p1lK8J33o7n1L8jJ60l5j30l7M0p4R3J70q5j68JM8
5182A17PQ2q7j6n7J8L5P1m8KL1j16J44J2joj1q2N1j8j0M1K0L2O7q6jq2M5P0r6j10N4O5K0q5
4731G2K3Q9r1jJ04j2l4p4J06j9j8l4p0P1O1k7p4J8l1L5R4j6m6K1N9j12K3m0j0R1n9K1rLO3
4293A77j20J27l6j11N3N8K9J9l2L9p6M6K4l9l8R8m1j05O8oK7L9j41LR5p3pNK51Pj32j00L9
3880A47l1M3m0n2J22m1K5k3o4J9J4J4L4Q2j16O3j31P2j9J9j14J47Q7j05p1J75o4j07R9O6j90
3491F0R5J52R3k76K21j86j4m1J63R1k01L24j17K1q3J08J55k4l26Q9P0L85J76O83K95j35j31
3153A647p51l58l23kn1L0N52O56l18l02J6l76N48J99K7k14k12k68k87K05L8k22R3O8J41q1
$$ plain form
6008 38 67 130 113 18 101 12 88 205 143 152 110 59 170 144 129 176 81 59 111 84 51 117 68 52 64 79 67 56 41 146 114 132 58 144
5582 144 125 62 115 189 131 14 121 174 25 58 149 128 57 54 82 215 148 97 135 134 294 259 129 92 132 58 151 321 236 68 69 117
5182 117 124 206 119 103 46 64 99 170 122 124 155 39 183 195 194 188 177 95 146 128 118 159 179 211 278 192 191 109 154 224 128 18 72 137 157 72
4731 72 95 184 93 92 196 184 150 76 182 163 145 111 41 112 173 146 72 90 59 94 188 172 126 147 206 94 117 77 67 158 99 120 111 114 177
4293 177 57 184 148 37 90 148 177 196 164 203 127 173 197 158 120 218 177 72 140 134 161 200 59 62 157 84 77 82 333 340 208 108 147
3880 147 116 159 119 67 189 148 173 150 86 105 119 133 167 249 133 196 65 137 118 137 23 170 257 152 81 256 192 85 184 250 60
3491 60 155 307 400 124 345 159 145 104 267 358 157 481 364 385 302 410 565 541 215 304 374 759 935 1618 1913 1778 1647
3153 1647 896 538 215 213 162 192 744 1400 1082 780 796 420 968 1167 1194 980 768 500 213 418 456 234 327 395 536 455
2828D55J12Q9O8K6K03NO9K30K55L87M15Q65K247J2834j685j1441k076q64j59n47K00L704j326
2540D066k248n61j18j98k13o0J23nj47r3j6l9j60J25k26J92LJ9j47m2K6K52r2j14m6M5j38
2202A88J52l7k06J53j52P0L0LJ56L6k28j29R8L2J5Q9N9k0q0K7q1Pj15R4j33R2M5j41L5M8J11
1814B18k7j45K0J77K0Pk32J28L0l1r4OM4l6N6PN4L2o1k0j4j05J23R1k0M6j11j22j0J55l5J06
1413B57o1j00m4O2o4L3O5K7J9j2j18J37r1p2J02J89k55J48l6o3ro3%N6J6lP0Mj37P1P0p0j02
1000B6Q8o6J09p7rl2L3J13O3j40N5j20K5L8Lm6l1Q9oL5j6k9J1M0n7J7o7R1r4l3K6L9Q1l3m3
562H3o0j1J04J34n1j35N9K54K8n9j66%j68K6J01m3j9P9j3j09J22oj14J08K4j3L5j36R4P2j49
174G1R9M8j19p6K1L2K3J4J62n7r4N9N2j35J59j59J5o2m6N8J8l6Q6O1l0O7k8r1p0Q3N4p9K1
$$ plain form
2828 455 567 656 724 750 953 958 1027 1257 1512 1899 2314 3179 5426 18260 16575 5134 3058 2194 2035 1488 1688 5392 4066
2540 4066 1818 1257 1139 941 728 668 791 786 639 546 530 491 331 456 230 422 425 444 297 255 281 533 441 327 281 326 188
2202 188 340 303 97 250 98 168 198 201 357 393 165 36 134 166 181 270 329 309 229 256 175 182 67 161 28 120 165 24 59 107 218
1814 218 191 46 66 243 263 270 38 166 196 165 71 77 121 85 141 148 202 234 173 153 139 34 157 248 228 274 163 41 31 186 151 257
1413 257 196 96 52 114 50 83 148 175 194 182 64 201 110 38 140 329 74 222 186 123 114 51 51 107 123 120 190 194 57 128 198 128 26
1000 26 114 48 157 80 71 39 72 185 248 108 163 43 68 106 109 63 32 121 115 150 134 105 116 156 99 116 49 140 46 13 39 78 159 126 83
562 83 23 12 116 250 199 64 123 377 405 346 180 180 12 38 139 96 77 156 143 34 156 150 36 144 168 155 190 54 148 220 71
174 71 170 218 99 23 44 76 99 113 275 218 124 183 235 100 259 100 115 53 7 65 83 47 133 194 164 231 203 112 42 125 179 100 121
-239A21m4R1rRm1j8pp0J25j1qp0
$$ plain form
-239 121 77 168 159 168 127 109 102 32 157 146 138 68
-390F8
##PAGE=	F1=35.7516
##FIRST=	23152.448482362498908,	6007.9998942000029274,	0.16059905290603637695
##DATA TABLE=	(F2++(Y..Y)), PROFILE
6008E0M1O0j9r3R3q5O2R2q2J3n2m8R5Jk8O1r1m1Q2k3k2O0m7K1n8L5K1o3j3J38q9N4m6L5J1
5570A25m1J1N6j4j21O5P5j13O6K2J2q4oJ2J19n0p0O4jJ92k8j37m1Qqk2J85m6j18k5M8rK4p8
5144G2N1n2jJ9Q3n0k3nn1J06O0n3O8q7r0R6%j7RLL2P3n0Qo1JP4r3j05P2J1M9o3n7J22m6m3
4681F2J02%n1%J02m3k6j4p1K5P0k0m7N0p1K5O5jm5J3P1q2Nk8l8Q4l0l2L6l4J03j22J33k7j43
4243B1J09J9P0l5n2O2p2N7Oj5n9J36l0j41R4Nm5P4j37j6O9m9Ol9K23O4q3j10J1J0N9q1qM9
3817A72k7L6j9o6l8O0j8O2O3p8J17j03L9j12M4j16Q1R6j5k5M8j8j18R3P5j61O9Q6J37k00J74
3429C38j38j1j19J37R0j41K84o9J5r5O0J45K5k61P8m9M01J27O66K29j45n8o77l76l18J12q0
3091A70j2N33N58l51k20P7l88N80J64N3k60j07k90l60J78R3k20J02P5J04l3M1L4J69l3J82
$$ plain form
6008 50 91 151 132 39 132 47 109 201 119 132 80 32 127 128 100 161 70 29 111 88 66 126 79 100 42 77 98 35 22 160 71 125 79 114 125
5570 125 84 95 151 137 16 81 156 43 109 131 143 59 53 65 184 134 64 128 127 319 291 154 113 121 113 91 276 230 112 87 135 126 150 72
5144 72 123 71 70 89 172 122 99 94 43 149 209 156 224 137 47 143 143 126 135 138 170 243 193 201 140 141 215 122 17 89 100 149 86 29 151 105 62
4681 62 164 164 113 113 215 172 146 132 61 86 156 136 89 139 68 93 158 157 112 125 196 114 119 91 53 137 107 75 111 77 180 58 191 164 21
4243 21 130 149 219 184 132 194 122 179 185 170 111 247 217 76 170 175 130 204 67 51 120 71 77 38 261 325 242 132 143 153 212 131 123 172
3817 172 145 181 162 96 58 118 100 162 225 147 264 161 200 88 132 16 97 193 178 153 201 183 65 158 233 72 141 227 364 164 338
3429 338 200 189 70 207 297 156 440 371 386 291 351 496 521 260 338 289 690 817 1483 1712 1567 1509 832 456 138 250 170
3091 170 158 691 1249 898 678 755 367 947 1111 1164 904 797 507 147 325 418 198 300 375 479 446 487 521 690 657 839
2765H39J9j6K65J77L18M42O31J980J0505j648r526j708p91j2n68L40M481r14k765o27j27k27
2490A068k77r7P1P3j91n1k4l9j88J72k38J71k2M8j67pj01K98n0j04l9O9j62J11lj71J63j97
2139A16P9Mk3J58P7k10j34RJ11p2J35N6L2j35O0p2L2q6J2j20J07P2j72NN4J18Pj42l8J97M4
1751B81N7l02J49O5l5j79R5m0n4O9J2R8L5m2l4N0j38N8LN3M2m8j37K6M0PQ6j1q3p7O2k0qN3
1326A33KL2N5j64J38o8r4R2J99k46J29J1j01qn3J9oK7M1N0k1j09O1J33o0j88P2k6J31q2m8
937E1J2K0J00P3j24O3j14J1m9M2m9nJ13k8L2Nm2%N8j31J5K0Ml2k4L2J3N1n3L4l9m0Q2J56l5
499B22k04J23K69L8o4j65Qj91KN6kJ9K6j1o7J06l2r3O3M0K8L7j58Q9Q8j60J42j8j09m2k9P
99A8R6l0J28Qp8QR0j58J79j23ln8m5oM1k0Q0O5l6Q7jj04r9J33L7j33q%M6M7j9l4nrp8J50j8
$$ plain form
2765 839 858 842 1107 1284 1602 2044 2675 4655 15160 13512 3986 2278 1487 1475 907 1247 5728 4814 2049 1422 1295 1068
2490 1068 791 694 765 838 647 596 572 533 345 517 279 450 428 476 309 302 201 499 449 345 306 375 213 324 321 150 313 116
2139 116 195 199 176 334 411 201 67 76 187 115 250 306 338 203 263 191 223 137 149 29 136 208 36 41 95 213 220 78 40 237 281
1751 281 338 36 185 250 215 36 131 91 37 106 118 216 251 209 175 225 87 145 148 201 243 195 58 84 124 131 217 206 123 46 108 88 80 133
1326 133 135 167 222 58 196 128 34 126 325 79 208 219 118 110 57 76 70 97 138 188 167 58 119 252 192 4 76 50 181 99 51
937 51 63 83 183 256 132 195 81 92 43 85 36 31 144 116 148 153 111 111 169 38 53 73 77 45 21 53 66 117 64 98 59 19 101 257 222
499 222 18 141 410 448 384 219 227 36 38 94 92 111 137 126 59 165 133 40 103 143 171 208 50 139 227 67 209 191 82 40 11 18
99 18 114 84 212 220 142 150 240 82 261 138 135 77 32 26 67 47 127 192 156 243 242 138 39 172 209 76 68 68 114 161 142 108 103 94 16 166 148
-365A48k4p0
$$ plain form
-365 148 124 54
-390E4
##PAGE=	F1=-58.6022
##FIRST=	23152.448482362498908,	6007.9998942000029274,	0.10115247964859008789
##DATA TABLE=	(F2++(Y..Y)), PROFILE
6008E2N6N4j4q2R9r2M7P0r4J2m5j6L5J9m3P6p5l2P4j9oM4k6O2m9k1L5p1j7J21j07O1j1j2L0
5570A15j1k7L2K1j09K1Q4p1R4m9L7q3Rj0J08m2p6O6OK13l1j37l8j3L9p9J60l4n9m7N1l0kp8
5144C0J10m8pJP9m8m7m2K2O4J09p4R6j52m6J11qNl8l0L7O2j0J9k5l9O7q9r6J01l5O8n9n1O5
4706A02ln8R0K7o9N0R8n6m3qm7j7O8l1KO4o4jL2Ok2k8Q6m1l1j2m2N0J0o4M4o9J36j21J42k5
4255A55j35J31l2J12o8o0O6o4P5mjq2J63m6j10Q2kp9R7j45PL0l1Po0J85R5l2j01j8K7R4r5
3842A61nM0k8L7k6o3r9O7LN2N8o9J66n9jj12rp2QO9O2J4m4K9j23P8P8j13K2L1J49j29J36q9
3416B19j3j54J16O9q6K38k8J3q1J3R6M6j89R9o5L23J11O25K18j30m2n72l80l83J90j23k6N12
3066F16N42l25k06J40m11O30J28O0l38p1l08l16J87R0k20J33P8P7L2K0r0K56mJ11M9o3K69
$$ plain form
6008 52 108 162 148 66 165 73 120 190 96 108 63 47 82 101 58 134 59 27 101 82 76 120 94 156 107 86 121 50 33 154 47 108 97 85 115
5570 115 104 77 109 130 21 42 126 55 149 100 137 54 63 53 161 119 43 109 115 328 297 160 122 109 148 69 229 195 136 89 140 110 108 30
5144 30 140 92 85 86 165 117 70 28 50 114 223 149 245 93 47 158 150 155 117 87 124 186 176 195 170 131 198 109 13 114 79 147 88 37 102
4706 102 99 41 131 158 89 139 237 181 138 130 83 66 134 103 105 169 105 104 136 142 120 92 178 137 106 94 52 102 112 48 92 23 159 38 180 155
4255 155 20 151 119 231 163 103 169 105 180 176 175 93 256 210 100 182 180 101 198 53 60 90 59 66 6 191 286 254 153 135 162 256 161
3842 161 156 196 168 205 179 116 17 84 87 139 197 128 294 235 234 122 113 41 49 118 180 194 150 179 56 134 212 99 121 152 301 172 308 219
3416 219 206 52 168 237 151 389 361 374 293 306 402 448 259 358 293 616 727 1352 1570 1440 1398 826 446 63 253 130 104 616
3066 616 1158 833 627 767 356 986 1114 1174 836 765 457 141 328 418 198 331 409 486 518 538 448 704 700 811 860 797 1066
2728A066J52K61M72N09J907R546j742q739j585q18Mn01M26M708o01k930o51j36k06l22j18
2465G02L9J01k18l8km3k02J91k04J51l4N9j96K4j57K72l1p0l4O7j20L9Rj50J80j72L0M5p0
2102A68J38O5j65q7m2J33j35J72L4O2j51M3o0M9m0n9j24J39P4j68oM7J01K6j34k9K05L5Q4
1739C75k87J03Q7m3k17J54j04l3N4MJ36M6l3p6J11j53Lo9J13M3Jj18K1m3O5M1J3n6o5N4Nm3
1338H9L6k5L0J16j57J09n1j01O8K09k20P1O0j23l8J6K9o5QJ02M3o4r8O7J68k6k37L0J0J38
962A94p6q2M1K9P3P1j07O8r9J9p2On1L6J09k2LJ0m0lO5j48ON8rJ1n5K6J4J8q6R8j3n7O7J57
512B59j2j70P3K58M3o5j47J9j77j1j9K0N4qj8JP9p0p0L5N4N7M7j91P1R6j50J80q0q6Lm0RQ3
86A27j9L1P6o4k4J14j43J61r4j1m8m8l0QJ5N3P0k2R7K3j15j04J57%j60m9J04m5Q6j4l5Nj7
$$ plain form
2728 1066 1218 1479 1951 2460 4367 13913 12171 3432 1847 1029 1033 532 958 5666 5065 2135 1484 1348 1142 820 702
2465 702 741 842 624 586 584 541 339 530 326 477 443 502 306 330 173 445 414 344 310 377 257 296 305 155 335 163 193 238 168
2102 168 306 371 206 119 77 210 75 247 281 343 192 235 175 224 184 125 1 140 214 46 40 87 188 214 80 51 256 291 375
1739 375 88 191 278 235 18 172 68 35 89 93 229 275 242 166 277 124 127 58 171 214 215 97 118 75 140 181 194 138 73 127 132 89
1338 89 125 100 130 246 89 198 147 46 114 323 103 174 234 111 73 89 118 53 61 163 206 142 44 111 279 253 16 46 56 194
962 194 118 36 77 106 179 250 143 211 112 131 59 65 14 50 159 137 140 150 110 107 172 24 30 88 79 90 35 61 75 93 7 105 92 35 102 259
512 259 247 77 150 408 451 386 239 258 81 70 51 71 125 117 99 100 179 109 39 74 128 185 232 41 112 208 58 238 158 72 75 35 44 127
86 127 108 139 215 151 127 241 98 259 165 154 106 58 28 36 51 104 174 152 249 272 157 53 210 210 50 1 105 60 146 132 97 102 85
-327H5p1J46l1l2n8
$$ plain form
-327 85 14 160 129 97 39
-390C9
##PAGE=	F1=-152.956
##FIRST=	23152.448482362498908,	6007.9998942000029274,	0.10085727274417877197
##DATA TABLE=	(F2++(Y..Y)), PROFILE
6008D8O4M8po3R5j01L5N5r5Pk8K4m1K3l2P2n0jL0j5J4J0J5J05l1o6Nn4k4Q9r0M4J7m4L9J6
5557A13m4nM6r3rQ9k8R5r6M5p5L7k4J18n0n9J8J9K24l6j38k9l0P6q0J10m3j6n8M6m1nn8J33
5132A52m7lj7P0m8o4rK3L2J54o7P4k07M7R6m0L5o4p2M1K9K7L4K0p5N4p4o3R3l6N3o8J8n6M5
4693H7n1O8P1p0M4R4m5n5k9j1m4N8m9M8O7l3l1kJ0Pp2R9Mn6j9k2oN5j9m0k0Q1j07J44j4r1
4243E1Q3o7J44p7n6N7o3R1pJ4r3J65p7n1O5k0p9J06j46K5J0k0j0LR0R0J5q0m5K5J32r5j7O6
3817B29l8M0k9o3p5l1N1J3O5o7J85Jm1p2r0k1k9K6J14M1j11O3j09O8P1o3m0MJ33p1J06m8j5
3404A97j59R5N3n1J89LJ3n2j9M5M3j37J13lK13J31N28K25r0n8m59l51m44J92j50j1M85N37
3053A078k91k10J89m22O53J12M4l79r0k55j83J05M3k18J68P4M6Q2L5k07K88O8J8P0q6K43J43
$$ plain form
6008 48 112 160 153 90 185 84 119 174 79 86 58 82 41 64 32 104 54 53 83 68 82 92 107 212 181 115 120 66 42 131 41 85 102 58 97 113
5557 113 69 64 110 17 8 97 69 164 68 113 38 75 51 169 119 60 78 97 321 285 147 118 88 164 84 194 151 135 77 123 82 77 19 152
5132 152 105 102 85 155 107 43 34 57 89 243 176 250 43 90 186 146 181 117 45 86 115 142 176 196 121 175 101 38 131 95 148 80 98 42 87
4693 87 36 104 175 105 149 243 198 143 114 103 59 117 68 116 183 150 119 117 127 134 62 161 165 109 90 68 62 117 98 58 38 119 12 156 142 51
4243 51 134 67 211 134 78 135 72 163 156 170 77 242 165 114 179 159 80 186 40 65 75 55 45 48 138 228 243 163 118 143 275 180 163 229
3817 229 191 231 202 139 64 33 84 97 162 95 280 281 240 168 78 57 28 54 168 209 98 161 52 120 191 128 88 92 225 154 260 212 197
3404 197 38 133 186 135 324 327 340 288 269 314 357 220 333 330 543 674 1202 1427 1337 1279 820 469 25 217 67 56 541 1078
3053 1078 787 577 766 344 997 1109 1153 774 684 429 246 351 394 176 344 418 464 546 581 374 662 730 748 818 732 975 1118
2715A118J92M58L96J733Q483j677p759j431q18r0k25M77M278l92k738o19j45j45l38j29L6
2452F65J07k25l9K0j9k28K00j56J35l8P1k01J7j37J70j4k8k3N7n9k1%j26J77j18k7R4j01J24
2089B77Nr1n6n0J27j63J92J1O3j17k0m3N3J0r6n9P8O2j37J7J6N8M5j13j9K32PR0k58O0J00
1701B81n1k17J81j40J2RnJ52O6l4j29J69j58l2q9J25L5M3q7j2p7J01J0J3k8m8M6J8n1J5m4
1313G4J2J56j33Q7m0q6M2K01j88J0R8j00j17R3L3p9l6J53L5q9j01Q0J60K2k48j1M0J25o9r6
937B8N2M9L8O3r0O6p8K1m4l7k5L9Q1j5k3Jl2PP0r5j1K7O3mr4J0K6kn0O7Oo9O9J36Qj29J8K26
462C73M7o5j06L3j43n0m7kQ4k4k0O4N1j07n0M1L7P5N3k19M0J04j08J89j25n2K2k8J2N0J9q3
61F5J42m3m7J14j16J32o6j9k8n4J1m0MJ2P3LJ00L8j11q6J40m6j38K9R3q0L6J9m1Nk5n2J21
$$ plain form
2715 1118 1310 1768 2164 3897 12380 10703 2944 1513 695 605 380 857 5135 4743 2005 1386 1241 1096 758 629 665
2452 665 772 547 508 528 509 281 481 325 460 422 493 292 309 172 342 328 300 277 334 275 254 254 128 305 187 160 254 153 277
2089 277 282 191 135 85 212 49 241 252 315 198 178 135 188 198 102 43 121 183 46 63 79 137 182 69 50 282 289 379 121 181 281
1701 281 230 13 194 54 66 75 70 222 288 254 125 294 136 104 15 140 175 218 131 119 42 143 153 166 138 90 136 154 103 118 74
1313 74 86 242 109 196 156 70 112 313 125 135 233 133 16 109 142 63 27 180 215 126 25 105 265 287 39 28 68 193 124 28
937 28 80 129 167 230 140 206 128 149 105 68 43 82 163 148 125 126 94 101 171 76 65 92 155 151 57 67 93 91 41 108 114 45 114 250 258 129 147 373
462 373 420 355 249 282 139 89 42 40 124 100 80 144 195 88 38 79 116 191 244 25 65 169 61 250 125 73 95 67 79 129 148 65
61 65 207 164 117 231 115 247 181 162 134 80 91 51 55 67 140 143 243 281 170 84 224 178 40 69 162 82 118 137 96 101 76 24 145
-352A45m1m4l6
$$ plain form
-352 145 104 60 24
-390B4
##PAGE=	F1=-247.31
##FIRST=	23152.448482362498908,	6007.9998942000029274,	0.081994280219078063965
##DATA TABLE=	(F2++(Y..Y)), PROFILE
6008D4N9L8Ll5Q2j10K5M8p6qj0N1q9KM8J2l6K1qmK7l6O4J48j4q9o0k5l4O2n5J8L2n6L8L6l8
5545G5n2N7p2J1O9JO2j04L9n7N9k3J41n8n6m7K9K24k9j45j8m8J06o1P6n0j4m5K1m3RRR2n0
5119A08J1m4P0n1n6M8k7L1J76n1K1k25J20Q6q6O0n3o8J7m6N7M7O7j03M9n1l8O8mJ1q2Q8j22
4706B8P0n1M2J20o7lQ9pm9p4L1o3M3m8O3O3Kn5l8J4L0q7R7M5m9m8j1k6N6M0j30O2j9k0P5J5
4255A40o1Np5J54n8m8N4o3Q0lL0q2J36j09J5N2l7o2R9j07NPj1l2N5L2M5N0m5p3J0J66q7l5
3830A47R5n1M5j7o3l5j03O3k6P0n0J60O8o2l2j75L7m9K7J05N6j64P8p8Q0O1k5p8k2Q9k5Q7
3429B13k9j0j30M6M9j5J43J1J7k5l3K5L4j35J14O6J43J81M17K39o9q2l63l08m33J07j42j1
3078B0M64N19k52k47K31m11O21J36K9l63j36j40j24Rqk03J84P3KJ15O8k85K66J60o9Q4r1J85
$$ plain form
6008 44 103 141 144 109 191 81 106 154 78 70 60 111 22 24 72 84 48 69 61 57 84 48 112 260 246 157 97 72 38 100 45 63 95 39 77 113 75
5545 75 23 80 8 19 88 89 151 47 86 29 88 65 206 148 92 45 74 298 269 124 106 58 164 103 179 129 115 70 91 48 57 66 158 108
5119 108 119 75 145 94 38 86 59 90 266 215 236 11 131 217 131 191 138 70 87 41 98 145 212 109 158 107 69 137 133 144 62 150 28
4706 28 98 47 89 209 142 139 228 221 172 98 129 66 109 61 124 187 189 134 96 110 140 53 150 195 146 98 87 61 117 157 27 89 70 50 125 140
4255 140 79 84 9 163 105 57 111 48 128 125 155 73 209 100 115 167 130 68 167 60 65 72 61 29 84 116 161 211 166 93 103 269 182 147
3830 147 242 191 236 219 156 121 18 81 55 125 75 235 303 241 209 34 71 22 49 154 210 46 124 46 126 187 162 84 62 151 126 213
3429 213 184 174 44 90 139 124 267 278 295 270 237 262 296 161 275 341 484 665 1082 1321 1252 1170 807 499 66 173 31 20
3078 20 484 1003 751 504 735 324 945 1081 1110 747 611 471 347 356 348 145 329 402 404 519 587 302 568 728 659 743 652 837
2728H37J55J11M24L10J457P405j437o693j228p46l37J70M30L357k59k257n22j57o2l21j38
2465D99M4J14k13m8J7L7k51J92j00J17l4Q6j67l3o0OJ2JqM8Qm9k8p1J16n1o6J21j11J40r2
2077A76nm1m8J06j57J97J3L3n1j18j3L8N4p8j7mM5q6N9k2KO3q3l0K67k1P5k17J7J12o0j91
1676A5J81j50M9k5k1J42R7l5j85K13j48n6k0N8RP9m9o0o4J00Nlql4L2K4l6Mm2j9J56j00P7
1263A86l0o7L1J64j52j2R8l5j39O9K9p0l0J38K6q7j11R8J19O5k31j1L7R4o4q6M1P1QN7p6N6
862A86n7J0j4m5LK8M8k0k9k5k4M1P0m8j9j6J51l0j26oL0j3k9M0K1p4Q3Q9J7q9j9J80O1o7n3
424B55N3j10j05k6n2J09k9pR1K9j33l3N7jR0M8k16J1R4l9J56j44j6J7oPK1N4j49J80k1o3R1
11B13q8R6l2l3kn7N2m6m6l0O6L2J00M7r1n8R0r2o2P0Q2p0n9O4m4nl0l1R5l9o9q
$$ plain form
2728 837 992 1103 1527 1837 3294 10699 9262 2569 1341 595 258 428 858 4215 3956 1699 1177 1020 958 637 499
2465 499 543 657 444 396 413 450 199 391 291 408 374 460 293 260 200 206 218 219 211 259 267 218 190 119 235 184 118 239 128 268 176
2077 176 171 130 82 188 31 228 241 274 223 105 92 130 184 106 89 85 130 44 103 81 83 146 63 33 300 279 354 137 154 266 206 15
1676 15 196 46 95 70 49 191 288 253 68 281 133 77 57 115 124 203 154 94 30 130 135 132 124 90 122 146 110 114 72 53 209 109 186
1263 186 156 89 120 284 132 120 218 183 44 113 142 72 42 180 206 119 8 106 225 290 59 48 85 179 115 29 70 141 149 206 130 186
862 186 129 139 125 80 83 111 159 139 110 85 61 102 172 124 105 89 240 210 84 78 108 95 66 106 127 53 136 225 242 153 134 314 375 308 255
424 255 308 198 93 67 15 124 95 88 179 208 75 42 99 98 188 236 20 31 125 86 242 98 82 99 93 100 121 175 26 206 185 122 213
11 213 125 221 189 156 154 97 149 103 57 27 93 125 225 272 181 123 213 121 59 129 211 141 82 146 102 97 67 36 131 92 23 15
-390A5
##PAGE=	F1=-341.664
##FIRST=	23152.448482362498908,	6007.9998942000029274,	0.061828814446926116943
##DATA TABLE=	(F2++(Y..Y)), PROFILE
6008D4M0K4J3kO6j15J6N0m6k7KO3q7lR3l2o7L2k6K1K1n4Q5J83jr8j36J1m1M0j0rK9m4K7M3
5557A05j6o3K2j9J0O1J3Lo6L3j5L7j2J54n7p1p4NK14j3j46j5o1J22m0O1l6m8nl2l4N2M9L6
5132A54m2K2q2Q8o1k4P1o7M8J75l8m3j44J02P7j24O5j0m3kr6L1N1J08j17N9l3l1M1L6l7r5
4731C9J45r8N0p1K5J54p0o0Q2M0k6j14O4p8K2l2N8N6K6o6o7J1M3p7Q8P2k5o2l2KQQ9j50P4
4305A20r5P0oN8n7p2L3M9rn3P9n2J9LM2n0Q5j22O5M3m2m3P4n5k3Qmk1P0J6l5O7Lr8j4J84o7
3842A70n4J13p3N1On0Nj13J5j8L9j1J01J29n1j7k31P0n4N2P0N7j59K7l9J09N6mo0q3L3J1R3
3429A90n0J0q6k5N0L3J28k4L8k3k7K3M3j78J19R7J15K40L45K80q4j06l10k77m20M8o4o6M27
3066D46N05j97l12K48l46N04J88L6l28j77l8j23o2m7j75J80Q4m9J24J06l12K03K47j09Q0p1
$$ plain form
6008 44 84 108 121 119 185 70 86 136 90 63 65 128 41 38 131 99 32 64 38 59 80 26 111 294 293 195 59 70 29 69 59 50 79 35 62 105
5557 105 89 26 48 29 39 100 113 116 50 83 68 105 93 247 190 119 45 50 264 251 105 90 29 151 111 172 136 88 83 51 17 69 118 154
5132 154 112 134 52 140 79 55 126 59 107 282 244 201 57 159 236 112 177 167 124 122 26 57 108 216 99 158 125 94 135 171 134 39
4731 39 184 86 136 65 90 244 174 114 196 236 210 96 160 82 104 72 130 186 212 146 79 90 133 56 144 216 191 129 97 99 107 196 46 120
4305 120 25 95 89 147 90 18 51 100 91 38 117 65 84 87 129 79 164 42 107 150 108 65 139 84 61 69 65 44 114 130 95 162 165 67 53 237 170
3842 170 116 229 156 207 213 163 168 55 70 52 91 80 181 310 259 242 11 81 27 79 149 206 47 74 35 144 200 196 136 53 86 97 190
3429 190 140 150 64 39 89 122 250 226 264 241 214 237 280 102 221 318 433 673 1018 1298 1214 1108 798 521 101 149 85 19 446
3066 446 951 754 442 690 344 848 1036 1072 744 567 529 406 344 297 122 302 386 337 461 567 255 458 705 596 676 605
2740F05J04J89L9L83K97J172O674j139n930j037o55m24K13L31K278j66j624l75j72K5k72j48
2465C68K4J40j70o6l1J06k38J54m6J01k5R9j10r3L1j52M7k0KM8O9l4o9K1mKo9J15j08J91j80
2077A03N5l0n0O5j25J92M7rQk19L8lP3j9kp7K9l1R7m3j5M9o8m9K84l7M6j72k0J22o8j50J59
1664A80j44Q0l2n2J13J40l1j96J92j14q3K7K0k4R4oj09k3Q0J3k9Mk4J2K1nJ3l6l4J09o8P6
1263A64j8n0L4J05j14J3O0L8j35KK2n6LR4J5o6j07J13P1Q2j98J7J6N4n9o1J1Q4mN1o1M3m1
850A22j8Ml1L4J5L1l9qp0k4J01N9j0j7o8K30n6j46j7K2k6k0L4K8o8R7K2J7n4l3J32R8p1j7
424B53Q4r2j61Pn2J05l7jR4J6j47k1O3l8J02L5j59K6K2J9R8j34J1mK5njP7j33J61j0o9O4n9
-2A39M2J0n7K5n1Q3m4r1k4K0M3J02N8o5l0K1j13J8Q4O9n4j41J00l8j6l0j3P4j8p7j2
$$ plain form
2740 605 709 898 937 1320 1617 2789 9463 8324 2394 1357 702 278 491 822 3100 2934 1310 935 763 788 516 368
2465 368 392 532 362 296 265 371 133 287 241 342 317 416 306 213 244 92 139 119 121 169 238 204 135 156 152 154 85 200 92 283 103
2077 103 158 128 78 143 18 210 257 248 256 37 75 72 145 126 124 47 76 45 142 99 84 133 65 16 300 263 309 137 117 239 171 21 180
1664 180 36 116 84 32 145 285 254 58 250 136 53 80 100 76 170 164 55 32 112 125 96 100 76 88 109 104 117 81 47 156 88 164
1263 164 146 96 130 235 121 134 194 232 97 99 121 65 68 162 177 111 4 117 188 270 72 89 105 159 100 39 50 134 130 181 120 163 122
850 122 104 108 77 111 126 157 118 110 40 16 117 176 166 149 81 311 255 109 92 114 88 68 102 130 62 159 181 198 144 111 243 341 270 253
424 253 337 245 84 91 39 144 107 106 200 216 69 48 111 73 175 210 51 77 99 118 216 82 93 89 114 109 108 185 52 213 203 134 198 139
-2 139 181 191 134 159 108 191 147 56 32 52 95 197 255 190 160 181 68 86 170 239 185 44 144 106 90 60 47 121 103 26 14
-390A4
##PAGE=	F1=-436.018
##FIRST=	23152.448482362498908,	6007.9998942000029274,	0.11188404262065887451
##DATA TABLE=	(F2++(Y..Y)), PROFILE
6008D2K2MJ8L7N2j14ON6k2m2J1N8p0K1J10m7j32L1k0M6jJ2L3J99Rr9j97M1k4J6L2m1J1j6J6
5570E8M1Lm5j9K2pO2K0o6NL6J6QnJ44m8r3o1l4J84Nj27k7l0Q4k1N0j2p5L8q9pR9N4k0j5J3
5107A41j04J02p6J3P7r2O5J55l2r8n8P4O5j34L8N9k7j1q4l6L4J39j18P8k0l6J7O7q1r8J78
4718A97o4M3q8K1J62q2j04O4Q3Mj27P6q6ok1O5M8L1o2p7kM5o9Q5Q9lm7q4M1m9J27j30M5r2
4293C3J01q2R7p0k2L1n1O4o7J10n1n0RL9pK9o1M0L6l2l3L4ol4OnPP2K7r8L8N7j06j1J39l4
3842A49o9J26j16N7L3k4M4j15l3K3JJ1N0J70j4k5k10K2l7O1N4M1j02o0lJ24N3Rk6j48%L1J21
3429A98r5L5n5o0RR5J36p7P1l7j0kP5k24J43Q3R0K80L15L30j06j17k87k61l87pK0q3L41M94
3053I07j33l38K10k30L33K24O8l02k07K2j28j05p1j46J72J04q4J02J29l02J38K94q8N5l5L3
$$ plain form
6008 42 64 68 86 123 175 61 67 123 101 59 70 128 58 79 189 142 10 41 21 67 66 78 111 310 319 220 23 64 40 56 88 47 58 42 58
5570 58 99 102 57 38 60 53 115 135 69 74 110 126 134 129 273 225 132 71 37 221 226 99 72 42 126 105 155 143 68 106 17 10 109 163 143 128 141
5107 141 37 139 63 76 153 61 126 281 249 151 93 167 232 98 136 195 168 157 73 37 71 210 92 170 150 114 131 198 117 19 197
4718 197 133 176 88 109 271 189 85 149 232 236 109 185 99 93 72 137 185 216 154 77 75 120 51 136 225 222 175 91 132 83 210 80 125 33
4293 33 134 52 149 79 57 88 37 101 34 144 93 43 52 91 84 113 52 92 128 96 63 97 91 57 63 58 65 137 164 66 104 161 55 44 183 149
3842 149 80 206 90 147 180 156 200 85 52 75 76 87 137 307 293 268 58 80 43 104 158 199 97 37 34 158 211 220 194 46 46 77 198
3429 198 103 138 83 23 32 127 263 186 257 220 210 208 283 59 202 285 375 655 970 1300 1194 1077 790 529 142 135 155 72 413 907
3053 907 774 436 646 416 749 973 1041 739 532 554 426 321 250 104 276 380 296 398 527 225 363 657 569 624 589 622
2728F22K20jL21L37R40O160r03n429q77o11l57O8K15J340r0j019k11j76R4j94j41p3J82q7
2427C30q6j34J64j68R4j8R6j9J04n6j22R6j42K2j22j5N4J12J0r6J03q7j3n0R0r6K44j90N1
2064A56j1n6op5J76R8l7L3k42O4n3M8M0J1j22K3nJ29m5QK1q7m1K56l7J4j32n1J23p0j01J22
1664A51j34J07j7p7P3J87k2j56J00n7j18O6j2j9N2L5j31lP4J7n0Nj6j2J0L6L6m3l5N1m3P4
1263A29ol3M0L9p3N2J7R6j28o3J8m6L4N3Ml8q5J16O0N6j68N4JJ0n6l0k8Q3OM2m6L7l3n5Jq
812E2O7MM3p0L3r0pJ09L6K4qj13K75p4j53k1Qm5k1N4K2n0J05n8J3k4k9R2J52o7k7J25q6k01
387G0L5l9J17m9j9R1J1j46k4O8n8R8J6q2M1k7M0L4r5K2l4N9j9j6Q8j18J56j5n9M7k5l1N5q7
-39A05M3l7R8l9j16PPj0J07P8m6qm8o0K7P8N4l9j88J15k3k5k3lN3J0o5l7
$$ plain form
2728 622 842 841 1162 1499 2439 8599 7696 2267 1390 779 422 490 705 2045 1955 936 725 549 643 449 308 235 417 330
2427 330 244 110 274 106 200 182 278 259 363 307 185 281 139 161 39 24 78 190 200 104 207 120 107 57 147 51 295 105 156
2064 156 145 89 83 8 184 282 245 278 36 100 47 95 135 146 24 47 42 171 126 134 155 68 27 283 246 260 128 77 200 130 29 151
1664 151 17 124 107 30 103 290 268 112 212 155 37 103 91 72 124 159 28 25 99 116 66 71 55 43 53 89 125 82 47 98 55 129
1263 129 123 90 130 169 96 148 165 261 133 70 88 42 76 129 133 95 10 126 186 242 74 128 129 139 83 53 25 108 114 156 110 147 114 59 60 52
812 52 119 123 166 96 129 39 32 141 177 201 193 80 355 281 128 107 115 70 49 103 125 75 180 122 135 111 82 174 326 259 232 357 271 70
387 70 105 66 183 134 115 206 217 71 47 115 57 155 171 89 130 103 143 177 82 104 70 129 110 94 182 64 220 205 146 193 168 137 192 105
-39 105 148 111 209 170 54 61 68 58 165 243 197 189 141 81 108 186 240 201 13 128 105 80 57 54 107 117 52 15
-390A5
##PAGE=	F1=-530.372
##FIRST=	23152.448482362498908,	6007.9998942000029274,	0.13066314160823822021
##DATA TABLE=	(F2++(Y..Y)), PROFILE
6008C4K5j8MP8M6j11QN2j5n0J8M0m8M5J30m7j48jl0N5k6Q1jJ88J1r6k01L2J0ON4p6j6J5K1
5570F9L5Ok6k1K6k8O0K6j12O9L5M4pj2J13l8j08m3m5J29J1q2m6J6K3lL0Po4N8j00J1J19L7
5144A89o4K9j5o9O7r1N0P4r7O4J21l1j35K3M1M5j05k0J40k0j6q0n3jJ50j03Q4jl7j0Q2j15
4743I6p9J72k7M1r1L2J40j03j19L7J05L5j16O8p6l7k2Q8L7K2m3p1j0L5q3R4R3J3j1j47P3r4
4343E2J48r2pl6R6j12Q7q6O3j4q0J01o2J12o4r0J3J5M0k3K4j1K6j1k9j4K4k0Oj0L2P6M6r9
3917A01n2J04q8L2J6Pp0J54j86N8M8J4P9j00p4M3%mK8J85K6l6j79m6pP1N3Rm5p3j0J00M3J9
3491B20Rj94L1PJ40j01L7m8j9n9J16J31j06J01m0Jo4J16k17J42P1M1K80L04L54j09j16k64
3141G64k35l36q7J27r4K36M70p7k93J28j04J96K00J07k74k33N6j28j31r0j11J59J22q1N8J32
$$ plain form
6008 34 59 41 45 123 169 58 66 118 103 53 71 111 63 108 238 191 43 42 12 67 41 122 121 309 320 224 23 55 65 71 125 49 33 48 69
5570 69 104 110 84 63 89 61 121 147 35 104 139 183 176 164 277 239 131 88 43 172 183 101 55 71 94 91 121 128 64 122 22 33 152 189
5144 189 125 154 139 70 137 46 96 170 73 137 258 227 92 115 156 201 96 76 216 196 180 100 47 46 196 93 177 176 139 129 211 96
4743 96 17 189 162 203 112 144 284 181 62 99 204 239 123 191 115 78 56 144 181 203 160 89 79 114 31 125 218 231 220 73 146 52
4343 52 200 108 101 65 161 49 136 50 113 99 19 120 58 170 106 16 29 44 84 61 85 74 100 89 60 46 70 50 56 46 78 154 200 101
3917 101 49 153 65 97 113 120 50 204 18 76 124 138 217 117 43 86 86 82 110 295 321 285 106 60 53 124 177 186 141 68 58 158 201 220
3491 220 229 35 66 73 213 112 149 101 82 23 139 270 164 265 225 226 162 278 61 203 274 315 595 899 1253 1144 1028 764
3141 764 529 193 106 233 139 375 845 768 475 603 499 695 895 1002 728 495 551 423 292 202 91 250 372 291 349 481
2815D81k92J03K87l1K7j0J1K23j0K34L75P68N598p46m961p25n74k92k0J15P53k3o36q4j57
2502D14J35j09j08k35K19J8r6k07J30p0P7n2J04k2J01k4j09J30p2jj26l0j8Q0O0r2J45o9r0
2139H3o5P3l0K20j64M6Ro3q5j3J39J43m9L6k16P2p3oP0L5j27J9k3J55l4L0J2j17l5K09k2q
1739B21j05o4J01o4n4Q4j06J03Qo9L3K12j0j27J0Nj48J16o6K3l3P8r5n0Q6J3m9j3J1j2k1N7
1338G5O0o9k8L3k5M3koL6j6l2P1qJ31j14j16J9l9N2K3lj4n0J04Q4J8j56Q6%l1n6pl4M2L4K7
887A32l4M5l2n7j3j1P4PO9j01P3p4oQ8NN8Lj40K79q0j46k2no7j4Q3jj9R9j20Qjk9O4K02m6
437B71q9J69q1k14N4k6J39n7n5R0J0j32m0Q4m5N1mmM6n3L9k1m2K3o7R0l0k4Q9j16J63l7l1
23A50M4J1r5Q4j16M7j8R7l7j14J9L6p9J00J13l6jj01K3mN7L9k6j59O7nk6j3mL0L8n2n4
$$ plain form
2815 481 189 292 579 548 575 565 576 799 789 1023 1398 2166 7764 7018 2057 1332 758 466 446 561 1314 1291 655 571 414
2502 414 549 440 332 97 316 334 238 31 161 91 168 116 220 198 299 275 166 296 224 223 97 67 49 129 189 97 242 173 83
2139 83 18 91 61 281 117 163 172 109 24 11 150 293 244 280 64 136 63 57 127 162 35 54 31 186 152 182 194 77 42 251 229 221
1739 221 116 52 153 89 35 119 13 116 124 55 88 300 290 163 173 178 30 146 80 103 70 148 53 3 89 102 53 40 51 39 18 75
1338 75 135 66 38 71 46 89 87 81 117 101 69 140 132 263 149 33 52 13 65 88 85 71 21 125 209 227 71 157 157 126 70 63 29 71 105 132
887 132 98 143 111 54 41 30 104 111 180 79 152 78 72 160 165 223 226 86 365 285 139 117 112 45 31 114 113 94 193 73 81 80 51 115 317 271
437 271 182 351 270 56 110 84 223 166 111 201 211 79 39 123 78 129 125 121 167 114 153 132 90 113 46 136 106 82 171 55 218 181 150
23 150 194 205 110 194 78 125 107 204 167 53 72 108 29 129 242 206 205 104 127 123 180 219 193 34 101 96 70 57 53 83 121 69 15
-390A5
##PAGE=	F1=-624.725
##FIRST=	23152.448482362498908,	6007.9998942000029274,	0.10613051056861877441
##DATA TABLE=	(F2++(Y..Y)), PROFILE
6008B1M9j0m8J08M6j09L0L1k4m9K5J4k7O0J52m0j45Qq5N2n3J37%J53Nr3j71QM0J0O2j06m1
5595A0M1L9L3j1qpJ2m4M9L3r6P6K4P6pk6O5l3j11k5l5O2Kk0o0M9k7J7KJ2k3N4p4RJ20J1q4
5132A05P1n1j3J9j03Q2O8q4M8P3l7j44Q9PJ9m7o7J92k0j6p6n0j3J25p4O2L0k1m1P6j33n2J43
4718A67NL6p5N3R5j34q4QQ5O0q5M1m8n1l2J10K3Oj5o6OJ5j13J05Q8J4L5j96R1j01J32m4p6
4305E5L2Q8q5J6p4J14o0m5Q8l9R5q1q6OjO0o2Q1m7J0J6k7j5j3J1K0jK9Q5N7q3j08J02o0O9
3867A47j09M9n4J99j35m3J3M6J02o0r1K2K1l7K5J78N8m4j36j25J9R4N9l1Jo0k0N6K1K9L5k01
3466B8P5k0J27n9K9n7K1p6Q7R0r8J16j1Lj46J53j68R5R7LK33L02L34r1j15k36j85k93j84K59
3091C13j04J43M19m9j98M3j2J47J30J12k20k63P8j23j51j12o5J25J35m9K6J19k92R3K36K9
$$ plain form
6008 21 70 60 12 120 166 57 87 118 94 45 70 84 57 117 269 229 84 92 7 59 6 143 143 296 301 208 37 45 85 95 157 51 10
5595 10 51 90 123 112 104 97 109 65 114 147 51 127 151 227 220 194 259 226 115 90 55 117 119 99 39 88 61 78 80 92 69 123 49 58 178 189 105
5132 105 176 125 112 131 28 110 178 94 142 215 178 34 123 130 149 102 35 227 207 191 115 65 52 177 103 165 195 174 133 209 76 24 167
4718 167 172 208 133 186 281 147 63 71 156 216 131 172 124 73 41 151 174 180 165 99 105 120 7 112 200 214 249 53 144 43 175 131 55
4305 55 87 175 90 106 32 146 86 41 129 90 185 104 18 24 23 83 21 102 55 65 81 54 39 26 37 57 56 85 170 227 144 36 138 78 147
3867 147 38 87 33 232 97 54 67 113 215 155 64 86 107 70 95 273 331 287 151 26 45 139 198 167 168 108 88 144 165 194 229 28
3466 28 103 83 210 151 180 123 144 68 155 245 147 263 252 255 109 262 94 189 286 289 522 824 1158 1067 952 716 531 238 54 313
3091 313 209 352 771 722 524 567 555 702 832 944 724 461 539 416 265 153 88 213 348 299 325 444 152 245 481 510
2765E10K1k3M4K11kJ46L85O56N020o25m519o10n18k58k4O5N62Qn52l7j24J50l6p9k64J23J16
2427C46r9j03p9pJ27j14R5l0Q7j5p2J51k0qr0l2k8m9J06o6J52j5j07r0J5O3J18j42Q2J5o5
2039A26q0j8Q2J71n5L1j90R3q1j7M6P3j22Ol6J65k1M8J4j33n2J63Jj6q9n2M7n5j0O5n7M8L6
1626A31l8MK08jj11n7N8j65J67j24N4r4J14n3n0K8Rk7m4O9J1j7NO5j03pN7j1k3j5M1Rj2j9
1200E9M8j1J39q9j28J3oJ8MLPk1P1J20Rj61R8J4o3o4Okk8O8J3k9N2l3j1J7m9J0L0Q6j32J08
750A66n4j9P0k4R0Pj47K53p1j23k4j8p7L4P1l8J7Q3j04Jon7M2K31j1j83K00o9j99O4j6J63
349B52o0r6R3Rj06o8J16k3j9j7O1M3p0L2n7LK8q3R5l0l9R2j20J69p0ON0M2j23Q4j27L0KQ4
-77A83m1q7NP4q4M1J58k8j1j35Q3k8L3K8j9j16K2Lj9kj6PO4m1n9
$$ plain form
2765 510 531 508 552 763 761 907 1292 1948 6968 6343 1824 1214 696 438 414 479 1041 1049 497 460 336 486 450 371 107 230 346
2427 346 247 144 65 58 185 71 166 136 223 208 136 287 267 259 169 137 109 60 166 100 252 237 130 40 55 118 236 94 176 191 126
2039 126 46 28 110 281 226 257 67 160 79 62 108 181 59 65 29 194 173 221 235 102 50 213 214 198 109 57 104 49 39 104 47 95 131
1626 131 93 97 305 304 193 136 194 29 196 72 126 32 146 93 43 71 80 53 9 78 89 72 77 142 39 32 89 78 55 40 81 90 78 59
1200 59 107 96 235 146 18 31 25 43 47 50 57 36 107 227 236 75 173 187 124 60 66 64 36 104 117 88 140 107 96 113 64 74 104 190 58 166
750 166 112 93 163 139 229 236 89 342 271 148 124 106 29 63 134 96 113 196 92 93 87 30 72 303 292 109 309 240 41 105 89 252
349 252 192 96 189 198 92 24 140 117 98 81 142 185 115 147 90 93 121 38 133 103 64 156 36 205 135 141 191 233 110 194 67 97 99 183
-77 183 142 55 60 134 50 91 249 221 210 75 158 130 163 191 172 56 78 81 62 60 44 51 115 74 15
-390A5
##PAGE=	F1=-719.079
##FIRST=	23152.448482362498908,	6007.9998942000029274,	0.11126465350389480591
##DATA TABLE=	(F2++(Y..Y)), PROFILE
6008A6O6J1n8Q2M3j03O1%m1m0L9j7mM7J71k5j31L0j44N2j8R9L4J13j3r5j31QM3J5O5j21m5
5595IM1O3L5m1RJ4j6n0L6L5n9O0MJ09Ol9J2l7j03j0j4mk0N4p0O2n3M1lk5L1L4l1MR4j5p9R6
5119A80p8L6j8j09J05O4o2K4J8n2q3R6k5rJ7j6J42k6pn9n3oP7l9RP2J5o9N2j41j0R4K6K9m9
4681A45Q3L9j74rJ3%P8m3jj0l7k7J00LlJ3p3M6j4r1O5P0MQ0k16R4o2P1Nj25P5P8m6o6nR1q1
4218G0l1Q3qP2r5o4mM7J5n3P2p0mM6l0M4n4j5M7K3OQ9N7p3j03N0l1R1j42L2l5K34q7q2l1K2
3767H8J08nr6oL8o5M0J38Q0m8q6j20m0J14P0o3L3m7k2RpL2N7j72R4k4Q2lL6o7O0j06O3K2o4
3329A23J18L8Pj95J50j19K5J44J6J67L02K84n3j23k27j21k76k32L58j18J07L45o6r0j6K8J77
2991G53O5O0j49k90Q3j12j61j47nO3J42rL2J00k82P3J67P3M7q2J08K11RQ7L68O14M575n15
$$ plain form
6008 16 82 93 35 117 160 57 118 118 77 37 76 59 55 102 273 248 117 147 3 55 37 136 170 283 270 175 44 52 95 110 175 54 9
5595 9 50 113 148 107 116 130 114 64 100 135 76 136 140 249 255 216 228 191 88 78 64 60 40 94 24 86 33 74 71 46 77 111 80 84 178 163 84 180
5119 180 102 138 120 11 116 180 118 142 160 108 25 121 96 87 104 88 230 204 197 138 85 79 156 117 126 198 213 144 196 55 45 139 165 194 145
4681 145 228 267 93 84 97 97 175 132 131 121 84 57 157 160 157 170 97 143 129 38 103 173 177 257 41 135 73 144 149 24 99 177 131 65 60 151 70
4218 70 39 122 114 186 91 27 23 70 85 32 104 34 30 76 46 90 36 21 68 91 97 186 243 170 67 117 86 177 35 67 32 266 179 97 66 88
3767 88 196 191 95 89 127 62 102 240 320 272 186 66 26 140 210 147 180 133 111 120 113 145 202 30 124 100 182 179 215 148 208 102 165 187 123
3329 123 241 279 286 91 241 122 147 291 307 474 776 1060 1007 884 657 536 260 28 386 268 375 720 654 564 548 576 753
2991 753 818 878 729 439 522 410 249 102 97 160 302 293 325 425 143 216 383 456 503 421 529 740 749 836 1204 1818 6393 5878
2640E878m191n85m32k73LQ0N17%n77m3j04J41K4o1j78l1J81j04k8j08r4J90j06J2j7N3k8k7
2290I2J65Lnl7l7k7j28J07k3J23M1p8q7m9J09Mj30J43Qo4l8m4K0J80o1L0j68J13p7pJ7J07
1889B02j13j6j1J41j6O6J5j33p7J18K4k0p2l9jm4J2P8l4j3O9%l3J91Oj02r6R4j61J97j58N4
1488A28p4J06k5m0n2RJl2R1K4k2k6N6j34L4O6Jo5m0Q6l4O2n7n%J26n3q4j7J6k9J4K6J5k6K9
1038G5J51K9j68R1L9q0q5RL9o2P0Rk8M1l3L2N4p2o1O4P5j66J42j9n0N1m7J15Mj39K16n2q8
624A56k4l8m4O1M1p4N0O3m6rk1q1J2K33L1k60J83m7j68P6j2J80n6j32R7Op5r0J45mq9k1J06
211A49L9q3K2o5K0M0o5O4j2p0R3r7J47j02L8N8O1j20O9j15kJ8O8m6n0l1J06m8k5J92rl6j54
-202E4J14l5J8K0j8r0J2j2qJ1l9J3O2l3n4
$$ plain form
2640 5878 1687 1102 670 397 400 480 997 997 420 377 273 414 438 377 199 168 349 245 217 109 15 205 99 111 94 147 119 92
2290 92 257 260 255 218 181 154 26 133 110 233 274 196 109 60 169 173 43 186 194 130 92 48 68 248 187 217 49 162 85 78 95 202
1889 202 89 73 62 203 187 253 268 135 58 176 200 180 108 69 68 24 36 114 80 67 136 136 103 294 300 198 102 196 35 232 74 128
1488 128 54 160 135 95 43 52 53 21 112 136 114 88 144 10 44 110 111 46 6 92 58 120 63 58 58 184 131 47 30 46 17 31 57 72 46 75
1038 75 226 255 87 178 217 137 52 61 100 38 108 117 89 130 97 129 183 111 50 114 189 23 165 146 96 147 100 215 219 80 296 244 156
624 156 132 94 50 111 152 78 128 191 145 136 115 34 46 279 310 50 233 186 18 94 82 262 206 74 171 177 102 12 157 153 64 43 149
211 149 188 105 127 62 82 122 57 121 109 39 132 35 182 80 118 176 237 117 186 71 69 87 155 109 59 28 134 86 61 253 244 208 54
-202 54 168 133 151 171 153 63 75 63 55 66 27 40 102 69 15
-390A5
##PAGE=	F1=-813.433
##FIRST=	23152.448482362498908,	6007.9998942000029274,	0.11168406158685684204
##DATA TABLE=	(F2++(Y..Y)), PROFILE
6008B9N7L0n7N5L3q0Q1l1n3k9N8l2J8j0J83oj13N5j70N3J1K3Q7R3m6j04p0K9OPO5j09m4L1
5582E0Q5L3p2K4L8n2m8K6L1k5L9k1J36K3l6l2n7q8PJ0o5L7N0o7M1m6M9K8q3P2LK3nM3l0n6
5132F5R7q8O7l8r3J03O6l6lm0p0M4L8m9l0O5M2Q5l4J3l1o4%K4oo1J10O4q1K1j41M4K9L2K7
4693A71k4J14j6k18R0K7q8Q3kn3K4oj4P2k0%L3r3R8m5o4L3M1j6J14j98Q7k1NM7p4J5O4j0j25
4255C1O1M5m7p0Q1K1N4r8m4j6R7k5m1N0p3mN5l9R8l7p7N5N0oQ2M5p4q7J0j0R6r6pl9K42m2
3804B41j13j7m5R5N6r8qL4q1P1O3R2m5m4n9r1O5Q6o4M3l3k6l0k7K0Q0j33R1j0J7M9N9p0J00
3379B68j29K2n0qR1R6K5j68Q3r5m6J73P5J23K90K34j1j31k40o5k85j58L45j31J28K72j23l
3028E82l2J7K41L8j8r3l04N5r2j53j81N1j1J39J9P3Q0k35RJ11J03R0j63J54K39J7N9L36O27
$$ plain form
6008 29 86 116 59 114 147 67 148 117 64 35 93 61 79 69 252 246 133 188 18 71 82 105 192 285 239 135 65 94 100 107 172 63 19 50
5582 50 135 168 96 120 158 106 58 84 115 90 129 108 244 267 231 199 142 54 61 71 6 43 93 26 67 21 70 98 15 87 90 113 108 151 121 65
5132 65 162 74 141 103 10 113 179 143 140 100 30 74 112 63 33 98 140 225 191 204 173 109 109 133 127 66 176 240 159 180 39 83 112 144 171
4693 171 147 261 245 27 117 144 56 139 137 84 108 102 88 160 140 140 173 80 178 133 69 102 143 127 241 43 130 109 114 161 87 102 166 156 31
4255 31 92 137 90 20 101 122 176 78 34 18 115 90 49 99 26 22 77 38 136 99 22 77 127 121 203 248 174 87 97 87 183 87 80 41 283 241
3804 241 128 111 66 161 217 119 111 145 64 135 198 290 245 201 142 51 116 202 138 181 148 122 92 65 85 165 32 123 113 130 179 238 168 268
3379 268 139 161 111 103 194 290 315 147 230 135 89 262 337 460 750 984 973 842 602 537 252 94 439 308 436 708 585 582
3028 582 550 567 808 846 828 735 431 486 394 241 60 111 100 239 258 331 411 176 185 296 399 489 326 480 719 736 795 1131 1758
2665A758M242m17l938o23l33l05j2J18M31pn45n1r1Q5Q0n5p8j18J95j12K3n7j26J34m7r9M0
2327I2Jm6lJ70ljL3m2l7q7J6L2O6Q1k5p5r7J17o9o6J32qo0%n8l3J76o1K2j44J16n0j4K0J22
1889B17r6l6K0J15k6Q6Oj22r5P8L8l4m6l9pj5j8J10l4o1J08K4p8J70J6j00j09J19j43J91j59
1501H0L2l1R6ml0r8mJ7pQ5L4l3m5M8j25M1N7J4p5qN5o0J21r7k8qR1mm8m1K9l6M7K1J4n2j3
1038C5J70O0j65P8O0p8j12KQ2o8N1J1k5J0k4N0R1q3q8P5N0j39J09L5q2J1n6J26oj21J79l2
637B06m2k5o4J8O0Oq9O3M6Ok6l2p7j9K15O7k22M4j5j03O4j3J84m5j62J00Nm3q4J37J5j40k1
224A4J33L7r3Qm2pO0l1K3K0j17R2m2R6r7L0O4O8j07N6q8l4K9N8m1k8m4R7Lm5J76J8o4j60J23
-214A65l5K1J2j9r3L2l7kL3p1N7K6l5m2
$$ plain form
2665 1758 6000 5583 1645 1022 689 384 372 490 921 914 369 318 227 312 392 337 259 141 336 224 247 190 64 198 151 52 92
2327 92 93 47 44 214 211 210 243 201 164 77 93 125 191 272 247 172 75 192 123 57 189 181 121 121 63 30 206 145 167 23 139 89 75 95 217
1889 217 121 85 105 220 194 280 286 164 69 147 185 151 105 66 59 44 26 136 102 41 149 173 95 265 281 181 72 191 48 239 80
1501 80 112 81 177 173 143 45 41 58 51 136 170 137 92 140 15 56 113 127 52 44 99 39 160 63 35 27 118 114 66 25 54 18 65 86 100 48 35
1038 35 205 265 100 178 238 160 48 50 132 64 115 126 101 111 87 137 228 145 57 132 182 43 152 187 105 116 60 186 180 59 238 206
637 206 164 139 75 93 153 159 70 133 179 185 159 127 50 31 246 313 91 135 120 17 81 68 252 207 45 145 150 107 23 160 175 35 14
224 14 147 184 91 99 57 50 110 79 102 122 5 97 55 151 54 84 148 216 109 165 77 43 72 130 89 61 17 114 117 72 248 266 202 42 165
-214 165 130 151 163 144 51 83 46 44 77 6 63 89 54 12
-390A2
##PAGE=	F1=-907.787
##FIRST=	23152.448482362498908,	6007.9998942000029274,	0.11586424708366394043
##DATA TABLE=	(F2++(Y..Y)), PROFILE
6008C9M2L9m9M1J3l9Q2n5m4j8N9l0M4q0J66J9r7P6j71O2K3o1J43J01q4j15MM1m1k4O6p4o1
5595A7L6J01K3r3L1O3q7m3K3K2NJ2m1J45L5j5n0q5p2J7L6l9P9j9n3oj3K6O6q3O0k9P4j9j8
5157A06k2l9Q4q0P0l4o2Q0P9j9k8r0KO9j7o2OM1Q3M7m5L8jp8Ok5J9r8J00J14p1oj27Q7l9K8
4706A16L7j0J40o1j81J12L0j02N7J5p9J5K8oM8m4J1M5j21J51o8m6K0Ll6J31j56Q4Qm9P0qn5
4293I9M1K1j19O6RJ7r6L4M0M9r2l1j9J26n4m2N2m7pL4m6J31j2j08L0P2MO6K9q8o9qPP6n0p
3842A08n6K27mj40J1r7P2J06r8K0J4r2J05k0Q6k6k7K3j11l3J04k8L1j8l7n5j8j5J03j04O9
3454A00J7m8Q2R0o4J39j29m3j08Q1J3J53N7j11J9j07p9J39J47J13K62K05J1j35k49l1l02p0
3103A52L12j41J77K14j81L0oj7K96L3o2p2k92k3o9j18j65N4o1J12K4J24O7j63q7P4J24J38
$$ plain form
6008 39 81 120 71 112 125 86 168 113 69 51 110 80 124 44 210 229 132 208 37 99 122 61 204 305 221 106 110 151 110 86 152 78 17
5595 17 53 154 177 84 115 178 91 48 71 93 98 110 69 214 249 234 184 99 27 44 80 41 120 101 48 42 29 55 121 38 98 69 143 124 106
5157 106 84 45 129 49 119 85 23 103 182 163 135 45 47 116 99 37 43 84 167 214 169 207 206 128 134 109 128 30 130 244 173 167 40 127 88 116
4706 116 153 143 283 222 41 153 183 81 138 153 74 89 117 111 159 115 126 171 50 201 133 87 107 110 74 205 49 133 141 92 162 154 99
4293 99 140 161 42 108 117 134 38 72 112 161 69 38 19 145 91 49 101 54 47 81 35 166 154 46 76 148 152 218 247 159 90 82 89 165 115 108
3842 108 52 279 275 135 146 49 121 227 129 149 163 71 176 156 242 216 189 212 101 68 172 144 175 157 120 65 47 32 135 31 100
3454 100 117 69 151 241 177 316 187 144 36 117 130 283 340 229 248 141 62 201 348 461 723 928 939 804 555 524 222 152
3103 152 464 323 500 714 533 563 557 540 836 869 807 735 443 420 351 233 68 122 61 173 197 321 388 225 138 212 336 474
2753D74k19J42K79L6L9K93O68L913l44l670o53k45l06q9J52L14%m49n4m6m9J31o0J8j43J79
2427C11j26M9Rj24M3K2j68Q7j9Om6J21k3qJ10l5p1k2o7Q8kJ00L4n5j35J03o6J1N5k8n4K6n8
2014F8o2J69m5rj04Q4nm3M3J19o9m2M3R5m5J02j2j10r3M1M0o0j2m7J6Pn5J40m8p3J36K9j21
1601G7J46L3j08r9J37j23J54j37JQR0J8k0r9k0K6nO9L9l9o4M6j08L2M2L2p8J7K7m7J28j25
1200E0K5l4J8M3l3n4L5nO3JJ3q1l8J68Q2j49P1P2o3j33j3J20o9L1J0j4l0MK9J24q1r1P7L4
775A82p5L5R0q8n9m5J06j2r0J36j9Mk6q1Q3L8l1o1M1M0K7m4l4n0l7J76Q4j48j06L4rOqJ67
349B26k3j87R7Qj4o1J00L8j49j8J25L4r4qqn8P2J2j2N6j02J7K8L2l7j9N6O2q7M4n0n1L5M3
-77A07j0l9OK8M6k5J22M6q7j44J05l2L2kj6j02M6m9pP2p4O1qm3k7
$$ plain form
2753 474 255 397 676 712 751 1044 1712 5625 5281 1611 958 713 407 318 470 784 784 335 281 235 186 317 257 275 132 311
2427 311 185 234 243 119 162 184 16 103 84 90 44 165 142 134 244 209 138 116 49 137 135 235 269 214 79 182 116 127 182 154 100 126 68
2014 68 6 175 130 121 17 101 96 53 96 215 146 104 147 242 197 299 287 177 84 125 165 105 93 46 62 69 14 154 106 33 169 198 77
1601 77 223 256 148 49 186 63 217 80 81 89 179 197 177 78 58 84 79 148 187 148 84 130 22 54 96 128 50 67 94 47 175 50
1200 50 75 41 59 102 69 15 50 45 108 109 122 41 3 171 253 104 175 247 184 51 38 158 89 120 130 116 86 90 119 243 162 71 148 182
775 182 107 142 232 144 85 40 146 134 44 180 161 165 139 58 141 179 148 87 128 168 195 151 117 67 30 206 290 142 36 70 61 67 59 226
349 226 203 16 113 121 107 46 146 184 35 17 142 176 82 74 66 8 80 92 80 136 34 51 79 111 74 55 111 173 86 130 80 29 64 107
-77 107 97 58 64 92 138 113 235 281 194 50 155 123 155 153 137 35 81 32 25 97 23 84 76 33 6
-390F
##PAGE=	F1=-1002.14
##FIRST=	23152.448482362498908,	6007.9998942000029274,	0
##DATA TABLE=	(F2++(Y..Y)), PROFILE
6008D2K9L4l3L7j1OO9o8j2j1L2k4Q0r9Q8M4q2Q3j50O7L0j28J83J26j11j13N7M1p9p7P6l1q6
5595IN7J02J0j05K9Q7j08m4K9NL6j7l5J12L5J9l4j03l5j3N9k0J01o4l6l9Oj8J01o2M1n0J08
5182A63l5o0Rm3P5p6N3j5m1O4R4j4m8j21J03L5o3o2N8j0J05K6o1O4K0q6J3o1L2k3k5J46m0
4769A76j5j08J08r4J8O7j4J58r4j05Q9K0p9M2Po7l5N5qL1o1J6N7j38J80p9l7K1l4n0J32j05
4368E4Q6K4q0O7N6j09%M7q0M5pO9r4l4M7N7q4k6rJ28p7m0P2j8k8J7m6J45J0j20j0Q7L3M7J6
3930B45j08n7lJ6L9j5Ro4J94K5j57L7j24N3J32r7O4oj04J28q7O1J4m3J06j13j22J05L1Ljn5
3529A06o6J5k0P3p9L7M6q3P6J15m8J65r6j21q7J25r6K01R4n1j3j34o0L7K05J23K28J93J2j55
3153G42k30k0k97qK69j40K32J67k03j0N1m8L17K8n3p7k49j29n8n4j11J1m6M4LJ58O8r7j69
$$ plain form
6008 42 71 105 72 109 98 104 173 105 93 82 114 90 170 71 159 203 121 204 54 121 151 23 206 332 221 108 165 206 127 50 126 95 9
5595 9 66 168 178 73 102 189 81 37 66 71 107 90 55 167 202 221 187 84 49 36 95 75 176 112 76 37 43 25 126 64 105 55 163
5182 163 128 68 77 34 109 33 86 71 30 94 188 174 126 5 108 143 80 18 76 66 171 197 136 200 220 134 147 86 118 95 70 216 176
4769 176 161 53 161 67 85 152 138 296 202 97 186 206 127 169 176 109 74 129 121 152 91 107 164 26 206 127 90 111 77 27 159 54
4368 54 140 164 84 151 207 98 98 145 65 110 103 172 78 44 91 148 64 38 29 157 80 40 112 94 66 83 37 182 192 72 62 149 182 229 245
3930 245 137 80 77 93 132 117 126 62 256 281 124 161 37 90 222 125 189 183 79 207 120 181 195 152 258 145 23 128 159 162 161 106
3529 106 40 55 35 108 29 66 112 29 105 220 172 337 241 120 33 158 62 263 357 306 293 159 99 136 341 464 692 885 897 742
3153 742 512 492 195 187 456 316 548 715 512 502 553 505 822 850 797 720 471 342 284 230 119 130 84 128 131 289 357 260 91
2790I1M4J27J85k06O2K94Q9J7K37P11L599l14l391o39j95k55j91J66K17J0l22p9L2k32J78
2477B35p7R8j38J60j30L7P8j05m7Q0j14L1j1N0o3L4k5m8J81j1j31M8j27J34o4R9Q8l5j53O9
2102A43j3N2j6m8m9L8m9m1J48j5n6p3L7M8q5O7J00l3k7N8P7o4J08l9r6p4PL2q1J5k8J2K6n4
1676B7J35o9n4J45K2j45J15N9j21q0J48j10J14j09l5L7Q0M3j2r0k6M5j9M9M1l3q8M6j00K2
1300C7L5N3q1L3J1k7J06j39Q1m0j1L2l4j8mL9P6k5J2j05KJ02Q2j17P1O8l9j42k8J48o9QOK
875A25o4N0l1J50o1r9R0L6k7k1J18o8j28j8N5om9P8j4L7k6o9J28lo2jqM9J6n9k3j2l2J12P6
437B39p7j12L5K2m9NJ26J1j51M0J0J0l7N8N3j26k2J03K7q6j6J1ql3O4l7Q4p2l6P3m5K4l4J9
11G3M6m5K3j6l1K8ML5p2N9oN3MO6O3r5j16P0l3M1j8j4n8J0m4j0J03p3L9k8m6p
$$ plain form
2790 91 135 262 447 241 303 597 686 703 940 1651 5250 4936 1545 906 711 456 265 431 648 658 336 257 289 57 235
2477 235 158 256 118 278 148 185 263 158 111 191 77 108 97 147 84 118 93 45 226 215 84 132 5 139 75 174 262 227 74 143
2102 143 130 182 166 118 69 107 58 17 165 150 94 21 58 106 21 88 188 155 128 186 263 199 307 268 172 98 105 137 56 71 43 55 81 27
1676 27 162 93 39 184 206 61 176 235 114 34 182 72 186 77 42 79 159 202 190 100 74 119 100 149 190 157 69 115 15 37
1300 37 72 125 44 77 88 61 167 28 109 69 58 90 56 38 34 73 149 124 136 31 33 135 217 100 171 239 200 58 30 178 109 117 123 125
875 125 61 111 80 230 169 70 160 196 169 148 266 198 70 52 107 101 52 130 116 153 127 58 186 183 121 120 112 161 177 118 95 83 51 163 239
437 239 162 50 85 107 58 63 189 200 49 89 99 109 72 130 183 57 35 138 165 79 63 74 66 33 97 60 144 72 36 109 64 88 54 73
11 73 119 74 97 81 50 78 82 117 45 104 98 151 155 221 284 189 73 143 110 151 133 119 61 71 27 17 120 47 86 58 12 5
-390E
##PAGE=	F1=-1096.49
##FIRST=	23152.448482362498908,	6007.9998942000029274,	0
##DATA TABLE=	(F2++(Y..Y)), PROFILE
6008C5K7J3j2L9l1L8M9o5L1lk1j8J25q9j1O8o7P7j20O1L8j32J67J51j18r3P4L2j04j13R1j2
5607A07q1O1R2mj08J7J08j05n6M0k6P2k5pK7K0N8Qj00qn0P3j9J10q9rn0Kl1R4l3J4n5J21m9
5169A19m8J6l9Q0r9M4ol8P1R2k1o0p7J10Mq9n7R8m9J20Qq4P8L5q9L2q4L1N8j20J24Npj00J15
4731A73j26J4J00k2J60j15m9P6Jm9M2rn3p9P9k6K3o0%P1r0J32p6l9L1n9k2Q4o0R4K4q3M2J10
4305B39j34o1P6m3K4mR4p9q4N1O6q3k9QJ09r6KP0Nn5Kl5J43K4j18m8Q7P4K8J3j23o2K4J3K
3867A00lK8n1J46L8j55N4j28N6J23r5J08j5j15J28j24J5P2q4J75j03r4J8Q0l2J3o9o8M5kR
3479G0l4J0N2n2J0J26k5J66m2j75m3J29j78K19J23%j7j47n8qJ95J45K01J85Qk06j88k2k48
3116A96mK25j24K84J23j75j11J17n5K95J2j9q1j85j96p3J3p4l6rloJ34Q5o5j70K1N3K31j34
$$ plain form
6008 35 62 75 63 102 71 109 158 93 124 121 100 82 207 118 107 175 108 185 65 126 164 32 199 350 232 139 213 245 141 28 119 107
5607 107 26 87 179 175 67 84 192 87 31 71 45 117 92 85 112 132 190 198 98 90 40 113 94 204 115 106 56 58 27 121 88 102 47 168 119
5169 119 71 87 48 128 29 73 67 29 100 192 171 111 34 144 148 59 2 100 51 171 179 95 173 208 119 151 67 98 156 36 160 165 158 58 173
4731 173 47 61 161 139 299 184 135 211 212 163 205 196 143 64 143 117 140 80 80 151 61 193 117 78 109 50 28 112 52 146 170 87 129 239
4305 239 105 44 120 77 101 97 191 112 28 79 145 62 33 41 150 54 56 126 131 76 78 43 186 210 92 44 131 205 233 246 123 61 85 98 100
3867 100 97 125 74 220 258 103 157 29 85 208 113 221 206 91 219 95 110 182 98 273 170 76 94 174 142 155 86 18 63 61 70
3479 70 36 46 98 46 56 182 157 323 281 106 63 192 14 233 356 356 339 192 134 126 321 466 667 852 860 654 466 444 196
3116 196 192 417 293 577 700 525 414 531 476 771 783 764 683 498 302 229 242 168 132 123 120 114 248 333 268 98 119 172 403 269
2740B69j6K40J69J2J74P27L376l20l169n93j97j69k49J39J51J1k01j21J10k88J19j00J44j20
2440I8J43r7l4J44p8j12J09m3j1j6P7o8l2L6n0J28K9j96R8q9R0j03Q4J27k1j41K5L4P5o3o4
2052G9m8L4k6j2J43Jp8p8RQ8r1M7P2MJ1P0N3p6J01p3q0m4k2J9m5j0M7n9M4k9J08r3k4J42J0
1613A94j35P7Q2j19p4J46j01J01r0o7M4O3O4%q0l1O9l6L5L9j3j02K7p9PL8P2p3L3J5l8P8j41
1200EJ15l3Ok5l0L5o2Q7Q6n0Qj13K2N4N8p1O9N6j7j36l2J63o8k1lK2q3R8j03J61k7j21J24
787A74M7qm6J10l4j74kJ4Qk1K5j4N2k8k4J40m9p8O5o4O3j9n4kJ8j8N4L6j3n6K3J8q5J5P7N2
336B02j01j4NK5k2L9M9j06k4Q3J1o8pQN2j05P2m9R3m1j6N9j02L3ml3L0L3j1rJ0J6n5Q1j10
-102B4J11rL0K9K7O0q5r3L2l5M0k0k7K6l1m0J1R0p6Pl5j1o
$$ plain form
2740 269 253 493 662 674 848 1575 4951 4631 1462 869 672 503 254 393 544 555 354 233 343 55 174 74 218 98
2440 98 241 144 110 254 176 64 173 130 119 103 180 112 80 116 66 194 223 27 125 36 126 23 107 234 213 72 97 131 206 143 79
2052 79 31 65 39 27 170 171 93 15 24 112 21 68 140 144 155 225 278 202 303 230 150 106 84 103 58 48 95 36 80 51 159 66 42 184 194
1613 194 59 136 218 99 25 171 70 171 81 14 58 121 185 185 105 74 143 107 142 181 168 66 93 14 21 59 131 58 91 106 68 146 5
1200 5 120 87 93 68 38 73 11 98 184 134 142 29 51 105 163 92 161 217 200 64 32 195 127 106 103 125 42 140 37 198 171 50 174
787 174 221 213 167 277 243 69 67 81 89 68 93 79 131 103 79 219 170 92 157 93 156 137 83 81 99 81 135 171 158 102 125 143 58 73 150 202
336 202 101 87 92 117 95 134 183 77 53 136 147 79 72 80 132 27 99 50 143 102 86 145 43 76 72 39 69 102 91 82 92 108 53 134 24
-102 24 135 126 156 185 212 272 187 94 126 91 131 111 84 110 79 39 50 140 64 71 36 25 19
-390A9
##PAGE=	F1=-1190.85
##FIRST=	23152.448482362498908,	6007.9998942000029274,	0
##DATA TABLE=	(F2++(Y..Y)), PROFILE
6008B4L9k7J0M6m1M4L2m8P4Mq4j9J72o6r9Q8n2O7r6M4M8j14J39J62j05o8O7J5j12q4P9k8n6
5595E5N4P5j4j06%J28q2p1M6o4R9jPo4rR0N9r1J4o4O4k9J05r8L0o5NLM5j2k2m4J16n6qj0p
5132G8Q5j23N8l0m9J03O5l7o4l3R8k4p6k9R7p2J48k8j20Q0M3q5O5r4K5J14j08lN4J0r5J04
4731A57j21K1J08k1J46j21j6P1j8k5M9k5m3j08J03n9K4l6l7Q3k2O5p7l9L5m7J0K0l8J08Po5
4330H9J3J44j27r6Q1j6%MR2n6j01O7N9r0l1K0Q0j05P3L0K6p9rj6J26L0j05n2M5J23J2J6j22
3917A25q5O0kj6k0M6j7Q3L3j29N8j14Q1Q7r7J50j4j20J05j35l7J29j22K07q5m1l4Q7n8J3p3
3529F5o2P2%m0J9QK0k4l7J18JJ34K2j86m2J32j63J58J40L3oj35p8J8J30J63J89J61K7k70j53
3141D14j8j67o0J88r5L25Q2j22k17J65l0K39j3po4j20j64r2K7o9p3K0k3K3P8J10r1j08M4j05
$$ plain form
6008 24 63 36 46 92 51 95 127 79 153 157 73 54 226 160 61 149 97 164 68 112 160 46 185 347 242 174 241 256 144 60 139 111 55
5595 55 109 184 170 64 64 192 110 39 85 21 120 119 126 62 53 143 202 111 125 61 125 96 201 103 133 68 73 76 121 109 87 43 159 103 95 85 78
5132 78 163 40 98 68 19 122 187 150 86 53 151 127 51 22 119 47 195 167 47 127 170 85 150 56 81 195 87 84 138 148 53 157
4731 157 36 57 165 144 290 169 153 224 206 181 230 205 162 54 157 98 122 86 49 132 110 175 98 59 94 47 57 77 39 147 154 89
4330 89 102 246 119 23 104 88 88 92 184 128 27 94 153 63 32 52 132 27 100 130 156 77 68 52 178 208 103 51 96 219 231 247 125
3917 125 40 100 98 82 62 108 91 174 207 78 136 22 103 190 93 243 229 109 214 79 42 171 49 256 171 130 96 183 125 138 65
3529 65 3 75 75 35 54 62 82 58 21 139 140 274 296 110 68 200 37 195 335 368 362 227 149 167 297 460 649 810 837 567 414
3141 414 396 229 169 357 262 587 669 547 330 495 465 704 691 684 620 500 336 244 271 202 129 149 126 149 227 337 246 138 182 77
2765G7K70n6qJ07K39M4J25O84L234l38l007n31k43p7k37O9J11lj03j54J67k44K2o7R8r8J20
2427B01l0j41J95m9j34R7K4j8m8R6p4o3J07k1J2P2j56K8k8K5p8L7J45nj18ML1Q8q6p1j5rL0
2014D8j6J41Jp0p0j9R5o9jM5L1O1Q7K1q2Q6j14n6qm9OL3n8J17j32M6nQ3j12mJ31Jr9M0Q7q7
1563A09o8J04q8J17q2n3%L6Q2K1o6n1Q0m3L4L2J0r2j8l3J0K8Q1o3L3L0q2N7j12R6k0K8q7R
1138C9O5q5R8R4o4jj10J9K8K0j8N9M1kj16k6J64o7n1j4M2q5J33j28J26J4j58J73N2j1n0P6
737B57Kj91PmJ1nQk3N0k4J7J31q1p1J01j08O8n7j6J0K8jL4k5L5l2L0Qr1J2L6Q9n4n9ML4k3
274A07M8L7j01k2O6j2m0MmJ05r7J3m8P5j4J7M6q5n3L9o6J8J12l1l1N4jj13J20j26J39oPM0
-152A97RM4o3q1ql0L1K3p8J08l5n5K8N9p6k7l2K9j0
$$ plain form
2765 77 347 291 283 390 629 673 798 1482 4716 4378 1371 840 597 520 283 352 463 460 357 203 370 126 148 81 179 81 201
2427 201 171 30 225 176 42 139 163 145 97 193 119 56 163 142 154 226 70 98 70 95 17 54 199 194 76 80 111 199 113 42 27 18 48
2014 48 32 173 174 104 34 15 110 41 40 85 116 177 264 285 203 289 175 119 111 62 68 101 43 160 28 74 69 152 40 36 167 168 69 109 196 109
1563 109 41 145 57 174 92 39 39 75 157 178 112 61 141 98 132 164 174 82 64 31 41 69 150 87 120 150 68 125 13 109 89 117 30 39
1138 39 104 19 117 211 147 146 36 55 83 103 85 144 185 183 67 41 205 138 87 73 115 30 163 35 161 175 17 190 242 231 181 257
737 257 259 68 75 71 82 77 85 62 112 88 105 236 155 84 185 77 145 88 72 82 110 109 143 118 153 121 151 159 68 80 116 205 151 92 96 130 107
274 107 155 192 91 69 135 123 83 87 83 188 91 104 56 131 117 134 180 95 42 81 15 33 145 114 83 137 136 23 143 17 156 150 157 197
-152 197 206 250 187 106 98 68 99 122 44 152 117 62 90 149 73 46 14 43 33
-390C3
##PAGE=	F1=-1285.2
##FIRST=	23152.448482362498908,	6007.9998942000029274,	0
##DATA TABLE=	(F2++(Y..Y)), PROFILE
6008A2O0n5PN2l9K5K8k3J05J0j23m0K05l1j74J12m8O9q9K3N4r2J17J56p7m4M5j0j04l7P4n6
5607A12k6L9N8j7j02j7J44n0q3M6n7O2M3J2j40J2N0J04q4L8n2L1m2Q9r5P9q4J6L6Pqn6k1R6
5182A40n7K6m8M4P9j17O6o5n4J33K1n4n8KP4m8j6k4R3q4J93p5j64O1O3r5J22j04K8J26o3j17
4781B8P4K2o9O4o6J5Q5pJ21j16NP1l2j3N7l7l7j27J28j00L3Jo9Q1L7J7r7k3K4mQmn4J23k4
4343A15l6JJ48r6n7L5Nl3LP1l3r0Q8M4r4k3J3N2o1R6k9M1r0j4QR3L3q4j9l6J74jK3j10j11
3905B6Q6k0j2n0N3L0OJ4p4M1p9J07M5j07J88pj14P0j35m0J24j05J71o7Rm5O7n8qo6k6O8j4
3491G8l%J0j2k2l5R1K3P5Q0j62o7J25j33J07J42M6Rj05r5M9P8J58K03J10O9l04j53Oj01j44
3103A23J68o2L47M9p8k68J68K0J84l7m4l2o9p2q8pq1r8L2l9N9O3J28j53o0R0k00K40mO0rK42
$$ plain form
6008 12 72 17 24 76 37 62 90 67 172 182 59 19 224 193 19 131 83 152 63 86 140 48 165 321 244 200 245 235 131 94 168 112
5607 112 86 125 183 166 64 47 191 141 58 104 47 109 152 164 24 36 86 190 106 144 92 123 81 170 75 154 70 86 122 129 121 65 44 140
5182 140 83 109 61 105 184 67 133 68 14 147 168 114 56 58 132 84 68 44 137 53 246 171 7 68 131 36 158 54 82 208 145 28
4781 28 102 124 55 119 53 68 153 146 267 151 156 227 195 182 239 202 165 38 166 66 99 100 31 112 149 166 69 46 70 66 74 70 16 139 115
4343 115 79 80 228 132 75 110 115 82 85 156 123 33 121 165 71 48 61 113 52 148 119 160 70 56 64 157 190 106 87 51 225 224 247 137 26
3905 26 112 92 80 30 83 113 119 133 59 100 21 128 173 66 254 247 133 203 68 28 152 47 218 151 160 115 182 124 116 50 24 92 78
3491 78 75 75 85 73 51 16 107 130 205 285 123 56 181 48 155 297 343 352 247 152 201 279 437 640 750 819 515 362 368 267 123
3103 123 291 229 576 625 547 279 447 467 651 614 570 538 469 397 309 302 221 123 155 116 175 238 366 213 153 243 43 283 279 339 330 572
2703E72J04J17N82L089l42k848m64l04j5j62l0R4j8m8j59J96k03k9pK8p8Q4L5j29J23k2j21
2365D5N2P3Mr5J21r1o0J43Lq2J07q8p6M0m9qJJ32K1j13K1k3Q7q7m2M1k1L2n1J27om4m4l7O7
1926A00n5l2M5K7J04J03j2q1P1j64j3K2p3MQ8p9J63j67K5jO9j11nJ10Jn5J3O5m1m6K7m6J14
1513A70p0m1l0J3R0N4l7q9N2l4L8K7K6o6p2J0K2J9Q8n6M0M0j30M8q9N9qN1j08M2O3p6Q2R9
1088B27o3j2j10NK2k1L4L8K8Mq6j7J58o6p3k6N1o8J49j08O2M7j50J80M4k7m3L0K9j66MnqK2
662H5L1n6N8j4K3J14q3n9J02j30N3q1L6LL1J0M6m9M8n8M9op5J0NJ08qj07QM8m0O8L7j11j3
224H3N1l8lNrJ33p2m2l3L7NM6M1n1j22M2o2OJ61l8n9R4k1j48J37r5J26j7kL9%K6m2p3m4pO
-239F0J11j07J15j8p5M1J8p4m7j7M5p
$$ plain form
2703 572 676 793 1375 4464 4122 1274 810 506 491 329 299 393 375 327 168 364 161 132 125 153 75 159 194 65 188 166 45
2365 45 97 170 174 79 200 109 49 192 195 113 220 132 56 96 47 39 40 172 193 80 101 78 165 78 36 77 56 88 37 164 158 114 70 33 100
1926 100 45 13 58 85 189 292 280 199 270 106 93 115 42 46 134 55 218 51 76 75 144 33 28 138 139 84 97 162 121 75 102 56 170
1513 170 100 59 29 42 132 186 149 60 112 78 116 143 169 103 31 41 63 82 170 114 154 194 64 112 23 82 74 125 17 59 122 46 128 227
1088 227 164 152 42 47 69 48 82 120 148 152 66 49 207 141 68 42 93 25 174 66 128 175 25 205 249 222 179 209 238 72 76 71 63 85
662 85 116 60 118 104 127 241 158 99 201 71 124 43 79 82 113 123 169 120 168 110 159 153 78 88 93 201 193 86 94 142 102 170 207 96 83
224 83 134 96 93 98 89 222 150 108 75 112 117 163 204 153 31 73 11 17 178 140 81 175 154 6 143 48 174 157 155 194 194 220 178 105 61 54 60
-239 60 171 64 179 161 86 127 145 71 24 7 52 45
-390D5
##PAGE=	F1=-1379.56
##FIRST=	23152.448482362498908,	6007.9998942000029274,	0
##DATA TABLE=	(F2++(Y..Y)), PROFILE
6008HP6l6m0N2l8nN7qJ10J3j08l4J57J7k01J07o6R2r9ON1o8R6J39m3k6J8m0q3OP8o6qJ4M9
5570A77j5r9k4J50j4r2L9k5j5R0K2j85Q3o0J27q0O4k1j6n4O9q1J28r8K7N7j4k0p5J0O1n2M5
5157A09q8J01N6p7N6r3k9J30k7p1l5K2N0o6N8l0Q6q3K40j18j43l0J20j12J50j14L6J02oj09
4781H5j5J6nPloM8J1R5j02K8O2l2k1O5l6l6j27J31j34M2L9o3M5P4Qj42J6JL3rPn1R0n6nJ1
4318G1J20n1k3QL1o0j2L7j8n9R4L5q7j1mK8JQ9r2M5q5lK3M6L7n5K1j09K05pL2r7j28R0l4M
3867H2m0K6O4o8j0J1j1k7J29Lj24K22lr7L9j26pN8n2J03m9M2m4M8k9l8n6jO0l8O0l5Ok1k8
3429D9l4Q0L1J1J19j21q0R0j05Q4J29M1K4p4q3N0P3J18K48M0J16k90j92M4p8k21J66l7L45
3066E43L1n6k60J33P4J64m7j19j6l1J2o5m1q8j15K9o4Q5Q8J42j82r1J43j63J16NJ42l2J61
$$ plain form
6008 8 84 48 8 60 22 17 74 66 176 189 81 47 204 221 20 127 61 153 54 60 111 43 139 278 235 209 227 187 104 110 188 122 114 128 177
5570 177 162 63 39 189 175 83 122 97 82 172 194 9 92 32 159 79 143 122 106 52 121 40 168 70 97 154 140 120 45 55 116 64 109
5157 109 21 122 178 101 157 64 35 165 138 67 32 54 104 38 96 66 152 69 309 191 48 18 138 26 176 62 98 200 194 85
4781 85 70 86 81 88 85 79 127 138 233 131 159 221 189 168 233 197 161 34 165 31 73 112 49 94 168 176 34 50 51 84 75 82 31 121 65 60 71
4318 71 191 140 117 125 156 96 84 121 103 44 138 173 86 75 71 99 100 189 97 142 57 54 77 123 160 105 126 17 222 215 247 150 22 112 78 82
3867 82 42 68 132 64 54 65 54 27 156 159 35 257 254 157 196 70 63 121 69 172 123 165 121 169 140 102 46 45 105 67 127 92 98 77 49
3429 49 15 95 126 137 256 135 55 145 40 124 253 294 318 244 161 211 284 402 650 690 806 516 324 368 290 69 235 198 543
3066 543 574 518 258 391 465 629 582 463 447 416 428 363 322 234 119 148 84 169 257 399 217 126 269 106 222 227 369 337 498
2703D98J57J51M69K911l35k667m07l43pn5j23R3k6m6j35J96j55p7M1Qo8M1P3o3K6mj02MR8
2340A53L6j37J52j15m0J48J9j39J28k9j66J06r5L8j1J07N9j33M2p5P3q2K1O8k4K3q4J00oj5
1964A22k3m1K7n3kN2mJ03J19l8p5O5k21O1L3r8K0R9q4J98j84K1k8P1r8j7Q6Pj4rK5%j7n0L8
1526I1N1l7m0m6J9P7R1kj22j5%K6L0K5l3r4J0L8J3R9n5N2M5j57L5p2K7rP7o2J5M8n8O7R9n2
1075A81k1j19j3L5l2N0J2J9Kn2j2J46n9p0j8J5l6J44q6J6O3j07J51K8m5l2j7M4r1k4lk4O7
662A12N4j10R2j5RR9n7p1R3j32K1p1N4lL7OO3l6M5j06P1k3n1K6k7J07L8j50KP0o8Q0O0j22
236I7nM0n4L0pmJ34l8q9pqJ4O8L6j5j22j4l7j0J84m1p6J25l9j42J15n0J05m1JL1j3J8l3o1
-202I2o9L8l3J99j07O5Oq9N0k6o5m5lM2m
$$ plain form
2703 498 655 806 1275 4186 3851 1184 777 434 427 372 249 342 316 270 135 331 176 99 140 148 80 121 194 131 157 153 51 55 153
2340 153 189 52 204 89 49 197 216 77 205 176 10 116 21 59 48 155 214 81 123 48 121 39 60 128 104 127 43 143 137 122
1964 122 99 58 85 32 30 82 78 181 300 262 187 252 31 92 125 27 47 146 62 260 76 97 69 140 42 25 111 118 104 95 120 120 103 53 91
1526 91 142 105 65 19 38 115 206 204 82 67 67 93 123 148 115 21 31 69 82 181 126 178 223 66 101 29 56 47 124 62 77 125 67 134 233 181
1075 181 160 41 28 63 31 81 93 112 114 62 50 196 137 67 49 64 28 172 86 102 165 58 209 237 192 160 143 187 96 72 69 45 112
662 112 166 56 148 133 142 241 184 113 206 74 95 24 78 75 112 118 181 145 190 84 155 132 81 107 80 187 225 75 77 147 79 159 219 97
236 97 92 132 78 108 101 97 231 193 104 97 89 103 171 207 192 70 56 19 9 193 152 76 201 162 20 135 85 190 149 150 181 168 186 153 92
-202 92 23 61 28 227 120 185 191 102 152 126 61 16 13 55 51
-390E1
##PAGE=	F1=-1473.91
##FIRST=	23152.448482362498908,	6007.9998942000029274,	0
##DATA TABLE=	(F2++(Y..Y)), PROFILE
6008HQ8k2m2J5l4J9O8k1Q5J3o5j9Q1P0j88Q0j05J27j13RK3l6P4J16j3j5kp6n4L3Q9l9j7k0
5582A17N5j6r4k1J39K3r2K4J1j04J27M0k00J18q3P1p9Q6J9n4o5M9l5J37r0K0O6k2l4o6K5K2
5182I4m3N3o7Q8K2j3L2j12QJ06o4p7J8%N1l9O4l7P6o5K72j48j37j4J28j15J12j18L8O6N2r2
4781A39p9j9P4j5J4l2J2K6P6q5N9L7j9m5P1j3m4r5R7j06kP2m1%Q2L2j65L1lL2l2L4k2J8k1
4343F8j5K5O3lJj0O8o5l8J2k5k1P8L4o9Nk5LN5P1j35K9p0L5J9pM6j9M6j00J53jM5r5j33P0
3892I5l8K4rnP4q9K4K4p1J2J46l9j18K23np3K2j08mj0JN7l6O1m6L0J7m9n3OL9o3J12n4Kj1
3441H8j7n2P6K6k3J22q0o2L3q5Q7J10K2L9o0m1K3J01O8L07j1J39k52k52P1r2k49J67l1L25
3066D97L1o0k24Q9J10J81l8j72n7kN0k8n6p3j33K3j00R8J20J60j48k05J94j02J8k7K13K0O0
$$ plain form
6008 8 96 74 32 47 13 32 100 79 164 177 112 93 174 244 56 136 31 158 45 54 77 41 115 231 218 203 201 125 71 104 193 154 137 117
5582 117 172 156 62 41 180 203 111 135 146 42 169 209 9 127 44 115 36 122 141 87 22 71 36 173 83 103 169 147 113 47 72 94
5182 94 51 104 37 125 147 134 166 54 62 168 104 27 45 45 96 57 121 84 160 95 367 219 82 68 196 81 193 75 113 179 231 139
4781 139 60 41 115 100 114 82 94 120 196 111 170 207 188 143 214 201 157 62 159 53 51 123 82 82 164 196 31 62 59 91 59 93 71 89 68
4343 68 53 78 141 138 139 129 197 132 94 106 81 60 138 172 103 108 83 86 141 212 77 106 36 71 90 83 129 110 156 56 209 208 253 158 25 95
3892 95 57 81 72 67 141 52 76 100 29 41 187 148 30 253 248 175 197 89 85 75 76 133 97 158 112 142 159 110 57 63 102 39 151 97 99 88
3441 88 71 19 95 121 98 220 140 78 111 26 113 223 245 284 224 183 206 307 375 682 671 810 558 306 377 285 36 203 172 497
3066 497 528 468 244 333 443 624 586 414 357 355 405 377 321 248 115 138 38 136 256 416 268 63 257 155 173 146 359 379 439
2703D39J60K08M00K733l36k489l69l43m4L8j59P1k2p9r6J71r1j43P1L5n5mP8Jk6j4q0l5R9
2340A19O3j61J75j23k3J34K6j61J35J5j62R2m5Om6R7R4j53M7r4N8q1O6R2l5J8j07O9J0Nj8
1952A12k9j2n9M6M7kM7J29n3n6P0j97O8K7j13L2Q8r0K25j86L4p5R0r0k5O9J1K0l2j6K1J1p8
1538C4J10n5L0m8n6K9N6J18K9j40m3K0j3L6NLo4m3N1RJ11o0O3N0j52Lm7J8l9J11l4nK9m1O3
1100A38Q8l6k2j34l2N8%K0qJ1jk6j1J28m3m1Jm8jJ21p4nO0o6J20J0n5k5n4N1Qp0nJ5Q7N7j71
637D5J35k9lR4l2r8R7j29rl3L9qM6j4O1j1M7j35Q2k7m4O1o0Q9Q2j48m9R5p7N2R9j18lL3n2
199G8M6k4LJ11Nj33K9m6J5P5L1J4j04n7j5j5J75m1p6J44m9j42R3NQ0o7PK8m6K7l7m2k8M2n1
-239C5K30j00PK6r5N8o4n1l5jM5m
$$ plain form
2703 439 599 807 1207 3940 3604 1115 746 403 359 397 238 309 287 208 112 283 192 49 120 155 100 96 174 175 149 135 55 20 119
2340 119 182 21 196 73 50 184 210 49 184 199 37 129 84 90 44 141 235 82 129 35 93 12 78 170 135 153 46 115 125 130 112
1952 112 83 71 12 58 105 103 150 279 226 170 240 43 111 138 25 57 145 55 280 94 128 53 143 53 28 97 108 128 96 80 101 112 34
1538 34 144 89 119 71 15 44 100 218 247 107 64 84 71 107 112 115 51 8 59 68 179 119 182 232 80 83 36 54 15 126 92 87 116 75 138
1100 138 226 190 168 34 2 60 60 80 72 83 82 56 45 173 130 89 90 42 41 162 88 83 143 77 197 207 152 127 73 124 132 62 57 72 159 216 45
637 45 180 151 148 242 210 112 209 80 71 38 77 69 115 101 162 151 198 63 145 118 74 135 75 164 246 98 49 144 67 119 218 100 97 130 78
199 78 124 100 103 214 219 86 115 69 84 159 190 204 100 43 28 13 188 147 71 215 166 24 117 122 202 135 142 170 124 151 114 72 44 86 35
-239 35 265 165 172 198 103 161 97 46 11 10 55 51
-390E1
##PAGE=	F1=-1568.26
##FIRST=	23152.448482362498908,	6007.9998942000029274,	0
##DATA TABLE=	(F2++(Y..Y)), PROFILE
6008DJ01j5l1j3j6L9O5l6M1J2j8oJ9J19j76O2j23J32j16K2k2oO2R7Mj6%j03l4L0J15J2n1o2
5582I2Q1k6q4j3J08O3q8PM4j73J29O2j95J31m5j6m7N6N7n1l6nJ5J04o1lO3j7l9m6K5j1l0N4
5157A05j9K7rN3Pj23M5P2q4l1K6l5P9j6M0l7N6k7K79j64j41J7J45j31O3j11L3L6R7q2r8l7
4756C5J04pnn2j0L6P2p2Q7%kp0P1K8n7o0N8m8o5R3j7m4O6P5j45lJ5Jm2N4J3o2Q2n1J4pM4J2
4280A41k9J12m9o8J7m3oM6M1m7K5m4l0R9M6j38on6Q9Mn2O0J1M8p6Q9K0O2j08j25L1l5M7J9
3855I5k6P1n1O4j2o0k4J60p9p2J76j7m3J3q6j0p3L8M1k9Q5n6kO5l5n1rPp1J27m6jRjn8N7J9
3391A15k2R0m7k9mp0Q3R8LN1p0QKJ19M3L51j7J25k19l13P3j20j96J33m0L06M1p6j83M7J18
3003D00K09j5j63j60K5L5J6m8m4j44K4j25Q8J26J82q4k91J90l2n2q2K56R9K2R0K55L89K585
$$ plain form
6008 4 105 90 59 46 30 69 134 98 139 151 133 127 146 265 89 151 28 160 44 66 44 38 100 197 201 185 185 82 48 78 193 205 154 92
5582 92 173 147 63 50 158 221 133 140 184 11 140 202 7 138 93 77 30 86 143 92 56 51 66 170 109 106 169 152 113 67 92 81 51 105
5157 105 86 113 104 157 164 41 86 158 74 43 69 34 113 97 137 100 156 129 408 244 103 120 265 134 197 86 119 155 252 170 72 35
4756 35 139 132 127 75 65 101 173 101 188 188 186 116 187 215 158 98 156 108 43 136 119 75 141 216 71 68 83 84 42 96 109 47 129 78 92 85 129 141
4280 141 112 224 175 107 124 81 75 121 162 115 140 96 66 165 211 73 67 11 100 104 52 112 123 171 95 184 204 266 158 33 64 29 76 95
3855 95 69 140 89 153 141 81 57 217 138 66 242 225 182 195 109 99 26 64 105 76 161 105 103 168 133 82 73 80 9 136 90 89 98 97 39 96 115
3391 115 93 183 136 107 103 33 116 214 217 268 198 206 208 327 370 721 704 829 610 297 370 250 54 187 147 453 494 418 235 282 400
3003 400 609 594 431 271 296 331 347 299 255 111 135 10 98 224 406 322 31 221 189 137 55 311 410 432 522 777 1166 3751
2653C751l51k334l49l30o5O2j22J2or8o6J31k5j43MQ6k7m3O4N0l5n6n2m5O8P6j19J29r8j6
2277E3J07K5j56J29M3j28N8J2j3j04R4J16j48L2q6P2n3K7J17m8J1j15M1L3K1l4ml9j8M0K1
1889A06K6l2J32o0k0Q3j25K2J6j12K8P9j08K48j74N0j28J24q2l7O1NM9n1n0K2K3l4J34j71
1513B4J24m6n7QK5J30N0j39n%m1K3k5L1k6k1MpJ11o6O5O4j21m4j0K3m2J04l4rNl1P3O3k0n
1063A78j48KK8L0j0oj0Pk0j4J09j9qJ0p1PQ3p3rM7l1Q7qn1k1o7O6P6j17j2R4Q5M1k23J69n3
612A48oJ02k6j20J20j34rj9M7k4M9l8K7J3N7j28P3lp4J03q3O2J21j00j20J01k3m0J21q8j4
224I5L1l3M0l4LP8M7j70O4o4J3O7K3K8p9o0qj4J40m3n2J49n1j50O8O9M9q2RL7r9M5l8k8M0
-214I0K6n5K13r0l9M0r8O6q8l4j2j0M8j1
$$ plain form
2653 3751 3400 1066 717 387 322 384 262 274 268 170 104 235 210 67 71 157 130 87 151 201 166 110 58 13 81 157 38 167 69 53
2277 53 160 185 29 158 201 73 131 143 130 26 120 236 88 120 34 106 53 80 197 149 160 45 86 119 140 106 102 63 45 85 106
1889 106 132 100 232 172 152 235 110 132 148 36 64 143 35 283 109 159 31 155 73 36 97 102 151 100 50 72 95 61 195 24
1513 24 148 102 45 53 78 208 258 119 114 114 73 96 71 102 76 55 59 52 163 97 162 226 105 61 51 74 32 136 102 93 98 67 140 203 183 178
1063 178 30 32 60 90 80 74 64 71 51 37 146 127 119 129 58 65 148 75 66 113 82 169 161 110 89 22 88 164 47 35 129 214 255 32 201 148
612 148 142 244 218 98 218 84 75 56 103 79 128 90 117 130 187 59 132 129 55 158 75 137 258 158 38 139 116 76 197 109 95
224 95 126 93 133 99 102 180 227 57 121 57 70 137 160 188 109 49 41 27 167 124 72 221 170 20 88 157 206 124 133 170 71 116 78 50 90
-214 90 116 61 274 184 145 185 87 153 65 31 19 9 57 46
-390D6
##PAGE=	F1=-1662.62
##FIRST=	23152.448482362498908,	6007.9998942000029274,	0
##DATA TABLE=	(F2++(Y..Y)), PROFILE
6008A4R8j5j2l0pM1O6m1qJ1K2Oj3J50j59L7j01R8j05K8o2J0P2P9Rk7K5r6m5nJ56O5r3j09J18
5570A77m3o7mN9R9p6j1O9j58M6P8j52J12Rn7jl4P7Jj6m3K3P4l1k7N5ml5l3K2k9qM1J1l2j5
5119G7R0j1j29P7L4q3J6J1n9J04j3L1l1K6K0K62j67j43M3J66j40Jr1K3K0J19p3r4nO3Ql2o2
4706E8nM3P3o2R4l8J3q2O0P2o6l4L7mj10J04Nq9N1J14j23m7L4l7KL9L2j27J80p5pp5Q5J0m9
4268G6J52j8r9M1n0j9QN5k8M9o1o9J30J7j02j9k7R6j5p7P6K2K9m9L7M5Q3j35j02k2j6O1L9
3855A08m3O8j5R3l4l6o7J65j12k7J22l4j1Ko3lo9kM2l3J27o2n7J04nm2m1l0J7K2qoL4Mm9L2
3404I1J9nL8k3J2po4N2J05lN4q7L5J6R8M8L63J3Q8j93l69N1j43j19J04n4L03O0j01j41JJ17
3003C59K08J6j16k61L4j2O2k5j8j45M3r1L1Q0K05k6k32P0L9j11o6J90J71O3j3K69M10K465
$$ plain form
6008 14 112 97 85 55 48 89 155 114 106 117 139 145 132 282 123 160 59 157 52 80 18 28 100 179 188 161 186 90 45 40 196 261 168 59 177
5570 177 134 67 63 122 221 145 134 203 45 91 169 17 129 138 81 80 46 123 124 108 65 88 162 131 104 159 155 120 87 109 80 72 113 124 92 77
5119 77 167 156 27 104 138 55 71 82 23 127 114 145 114 140 160 422 255 112 155 321 181 182 91 114 134 253 180 86 81 144 152 120 58
4706 58 53 96 169 107 201 163 176 94 154 226 160 126 163 159 49 153 158 69 120 234 111 64 98 61 63 102 134 7 187 112 105 30 115 125 76
4268 76 228 210 111 152 102 83 91 146 118 167 106 37 167 184 82 63 36 132 117 40 116 138 167 118 155 200 283 148 46 24 8 69 108
3855 108 65 133 118 211 177 141 74 239 127 100 222 188 177 179 116 113 44 42 84 51 178 116 59 163 158 116 75 45 62 84 76 70 104 108 59 91
3404 91 110 105 143 120 132 125 61 113 218 215 269 182 217 233 331 379 742 755 843 650 281 332 189 70 174 120 423 483 382 241 242 359
3003 359 567 583 467 206 240 228 290 265 247 102 145 54 85 165 370 344 112 182 221 110 44 234 405 468 455 724 1134 3599
2653C599l69k213l28l33l4J0m9n5K2p7o3Q7J7p3j36J36J2n9N1P4k3j17k7l1L2P2m4M0n1qP1
2265A33K1j33J07N6q8K3O3j2j66Q8J22j13Lp5J10m4k8J37n0kj10J9M6M4o2K4m8K7J7k5O3j07
1864D0J28o4L1J01p3k1Mj00K5Q1j44K68j43N3j62J46o7n5N1jO5m8p8J3LK9J49j95J41k2p1
1476H4j3j3J17N8j18M4k0l4j3m7L6QK6k2l1P5n5M2R3q5q1K8J9l1Q5n7Pk9k9R2K7oL5j55L3
1038G0j1N8l3J6m7L1l9j0Q9LJ6J3o5NM1q2kL0j1O0k4l8j4j4O6P0j34m3J93O9J4k52J82q5M
599A26J15l9j10J39j43Qk0P3n2N1l6m8L4P4j11N2L9j21J32q8L4J55m2j60P8N7r3N3l3l3L3
211A24j3K4l2j1M5Q2j86Q2n9J1M8J7K5n9l4ok0J00n3%J44n6j59M0J33J2q4PN6j41M5Jn2R9
-214A30J3n9J70p9o4N2j06P8r2j8J9k1L3j9
$$ plain form
2653 3599 3230 1017 689 356 322 332 283 228 250 173 110 197 214 141 5 141 153 94 145 219 196 79 52 21 53 125 81 121 70 62 133
2265 133 154 21 128 184 96 119 182 170 4 92 214 101 104 29 139 95 67 204 154 152 42 61 107 151 89 113 65 92 109 84 147 40
1864 40 168 104 135 236 163 142 146 46 71 152 8 276 133 186 24 170 103 48 99 98 163 115 37 50 53 82 231 36 177 155 84
1476 84 71 58 175 233 115 159 139 105 92 45 81 89 115 93 62 137 82 124 217 132 51 79 98 67 152 95 102 73 44 136 163 157 192 37 70
1038 70 59 117 84 100 53 84 45 35 124 127 143 156 91 96 137 55 53 83 72 132 108 70 56 42 108 178 44 1 194 263 277 25 207 122 126
599 126 241 202 92 231 88 96 76 149 97 148 112 64 98 172 61 113 152 31 163 75 109 264 222 62 140 197 104 157 124 91 124
211 124 111 135 103 92 137 219 33 115 56 67 115 132 157 98 64 58 38 138 85 85 229 173 14 54 187 199 115 122 178 37 82 83 31 130
-214 130 143 84 254 175 111 163 57 135 43 25 44 23 56 37
-390C7
##PAGE=	F1=-1756.97
##FIRST=	23152.448482362498908,	6007.9998942000029274,	0
##DATA TABLE=	(F2++(Y..Y)), PROFILE
6008C2Q3j7Pl8pK9O6l7m6J4M5J2qJ59j34kp3O7q8L2o6nQ1O0J4m2M8q0n5j4J69J00j30j48J51
5570A79o3m4MlJ30o2k1P9j27l7Q0p9P0O9o1Or6O0P0lo8RO2j7m1M6Pl0j9K0k8J5J3K7p9K0P7
5107A65j7j33R7Ko8L7no6J08j7M3k2j2O7K23j58j29N6J84j35p0o5J7J6J15n6q5L2QK3o2n0
$$ plain form
6008 32 115 98 105 67 60 89 155 118 72 86 131 143 135 294 160 158 85 152 64 96 30 25 106 166 180 138 186 106 51 37 206 306 176 28 179
5570 179 116 72 76 73 203 141 120 199 72 35 115 36 106 175 114 120 24 84 154 151 83 92 154 137 96 142 149 119 100 120 92 107 120 147 68 88 165
5107 165 148 15 112 114 46 83 78 12 120 103 146 124 112 179 402 244 115 171 355 220 150 85 102 118 233 177 92 124 132 155 93 43
$$ [...]
-390A26
##END NTUPLES=	nD NMR SPECTRUM
##END=	
##END=	
