##TITLE=	Nov10-2021.43.fid
TM-VI-156 13C

##JCAMP-DX=	6.0	$$ MestReNova 14.3.0-30573
##DATA TYPE=	LINK
##BLOCK_ID=	1
##BLOCKS=	2    
##ORIGIN=	Mestrelab Research S.L.
##OWNER=	hrzepa
##$MNOVA/LINK_BLOCK_TYPE=	ITEM	$$ NMR Spectrum
##$MNOVA/ITEM/POLYGON=	(XY..XY)
5321,5835
8722,5835
8722,8208
5321,8208
5321,5835
##$MNOVA/ITEM/Z=	0
##$MNOVA/ITEM/ANGLE=	0
##TITLE=	Nov10-2021.43.fid
##JCAMP-DX=	6.0	$$ MestReNova 14.3.0-30573
##BLOCK_ID=	2
##DATA TYPE=	MNOVA NMR VIEW DATA
##DATA CLASS=	MNOVA VIEW DATA
##$MNOVA/ITEM/ZOOM/X=	-20.698776542268014111,	240.66949999422217843
##$MNOVA/ITEM/ZOOM/Y=	-300.84112167358398438,	3074.453277587890625
##END=	
##TITLE=	Nov10-2021.43.fid
##JCAMP-DX=	6.0	$$ MestReNova 14.3.0-30573
##BLOCK_ID=	3
##DATA TYPE=	NMR SPECTRUM
##DATA CLASS=	XYDATA
##NUMDIM=	1
##ORIGIN=	Bruker BioSpin GmbH
##OWNER=	nmr
##.OBSERVE FREQUENCY=	100.69424847706599735
##.OBSERVE NUCLEUS=	^13C
##.SOLVENT NAME=	CD2Cl2
##.PULSE SEQUENCE=	zgpg30
##LONGDATE=	2021/11/11 01:38:00.000
##.ACQUISITIONMODE=	SIMULTANEOUS (DQD)
##$ORIGINAL FORMAT=	Bruker XWIN-NMR
##$MNOVA/SCALES_VERSION=	9
##$PARAMETER FILE=	(acqus, ASCII, /private/var/folders/f6/rjf_tdyn2v98c5c0wvkgn4s80000gn/T/YvJ+JCkQRoGsgKrVP1ENFw/43/acqus, 0)
$$ ##TITLE= Parameter file, TOPSPIN		Version 3.2
$$ ##JCAMPDX= 5.0
$$ ##DATATYPE= Parameter Values
$$ ##NPOINTS= 11	$$ modification sequence number
$$ ##ORIGIN= Bruker BioSpin GmbH
$$ ##OWNER= nmr
$$ $$ 2021-11-11 01:38:58.391 +0000  nmr@CZC10666PP
$$ $$ /opt/topspin/data/agmb/nmr/Nov10-2021/43/acqus
$$ $$ process /opt/topspin3.2/prog/mod/shimcntl
$$ ##$ACQT0= -2.01680680282977
$$ ##$AMP= (0..31)
$$ 100 100 100 100 100 100 100 100 100 100 100 100 100 100 100 100 100 100
$$ 100 100 100 100 100 100 100 100 100 100 100 100 100 100
$$ ##$AMPCOIL= (0..19)
$$ 0 0 0 0 0 0 0 0 0 0 0 0 0 0 0 0 0 0 0 0
$$ ##$ANAVPT= -1
$$ ##$AQSEQ= 0
$$ ##$AQ_mod= 3
$$ ##$AUNM= <au_zgonly>
$$ ##$AUTOPOS= <31 >
$$ ##$BF1= 100.683175
$$ ##$BF2= 400.41
$$ ##$BF3= 100.683175
$$ ##$BF4= 100.683175
$$ ##$BF5= 100.683175
$$ ##$BF6= 100.683175
$$ ##$BF7= 100.683175
$$ ##$BF8= 100.683175
$$ ##$BYTORDA= 0
$$ ##$CAGPARS= (0..11)
$$ 0 0 0 0 0 0 0 0 0 0 0 0
$$ ##$CFDGTYP= 0
$$ ##$CFRGTYP= 9
$$ ##$CHEMSTR= <none>
$$ ##$CNST= (0..63)
$$ 1 1 145 1 1 1 1 1 1 1 1 1 1 1 1 1 1 1 1 1 1 1 1 1 1 1 1 1 1 1 1 1 1 1 1
$$ 1 1 1 1 1 1 1 1 1 1 1 1 1 1 1 1 1 1 1 1 1 1 1 1 1 1 1 1 1
$$ ##$CPDPRG= (0..8)
$$ <waltz16> <> <waltz16> <> <mlev> <mlev> <mlev> <mlev> <mlev>
$$ ##$D= (0..63)
$$ 0 1 0.00345 0 0 0 0 0 0 0.06 0 0.03 2e-05 3e-06 0 0 0.0002 0 0 0 0 0 0
$$ 0 0 0 0 0 0 0 0 0 0 0 0 0 0 0 0 0 0 0 0 0 0 0 0 0 0 0 0 0 0 0 0 0 0 0 0
$$ 0 0 0 0 0
$$ ##$DATE= 1636594737
$$ ##$DE= 6.5
$$ ##$DECBNUC= <off>
$$ ##$DECIM= 760
$$ ##$DECNUC= <off>
$$ ##$DECSTAT= 4
$$ ##$DIGMOD= 1
$$ ##$DIGTYP= 12
$$ ##$DQDMODE= 0
$$ ##$DR= 21
$$ ##$DS= 4
$$ ##$DSPFIRM= 0
$$ ##$DSPFVS= 20
$$ ##$DTYPA= 0
$$ ##$EXP= <c13>
$$ ##$F1LIST= <111111111111111>
$$ ##$F2LIST= <222222222222222>
$$ ##$F3LIST= <333333333333333>
$$ ##$FCUCHAN= (0..9)
$$ [...]
$$ 90 74 58 42 26 10 0 0
$$ ##$Sgu3PowerLevels= (0..7)
$$ 0 0 0 0 0 0 0 0
$$ ##$Sgu4PowerLevels= (0..7)
$$ 0 0 0 0 0 0 0 0
$$ ##$Sgu5PowerLevels= (0..7)
$$ 0 0 0 0 0 0 0 0
$$ ##$Sgu6PowerLevels= (0..7)
$$ 0 0 0 0 0 0 0 0
$$ ##$Sgu7PowerLevels= (0..7)
$$ 0 0 0 0 0 0 0 0
$$ ##$Sgu8PowerLevels= (0..7)
$$ 0 0 0 0 0 0 0 0
$$ ##$SguType= 3
$$ ##$ShimPowMaxUA= (0..63)
$$ 130000 130000 130000 130000 130000 130000 130000 130000 130000 130000 130000
$$ 130000 130000 130000 130000 130000 130000 130000 130000 130000 0 0 0 0
$$ 0 0 0 0 0 0 0 0 0 0 0 0 0 0 0 0 0 0 0 0 0 0 0 0 0 0 0 0 0 0 0 0 0 0 0 0
$$ 0 0 0 0
$$ ##$ShimPowMaxUC= (0..63)
$$ 130000 130000 130000 130000 130000 130000 130000 130000 130000 130000 130000
$$ 130000 130000 130000 130000 130000 130000 130000 130000 130000 0 0 0 0
$$ 0 0 0 0 0 0 0 0 0 0 0 0 0 0 0 0 0 0 0 0 0 0 0 0 0 0 0 0 0 0 0 0 0 0 0 0
$$ 0 0 0 0
$$ ##$ShimPowMaxUG= (0..63)
$$ 524287 524287 524287 524287 524287 524287 524287 524287 524287 524287 524287
$$ 524287 524287 524287 524287 524287 524287 524287 524287 524287 0 0 0 0
$$ 0 0 0 0 0 0 0 0 0 0 0 0 0 0 0 0 0 0 0 0 0 0 0 0 0 0 0 0 0 0 0 0 0 0 0 0
$$ 0 0 0 0
$$ ##$ShimPowRcbType= 3
$$ ##$ShimPowRes= (0..63)
$$ 1e-20 1e-20 1e-20 1e-20 1e-20 1e-20 1e-20 1e-20 1e-20 1e-20 1e-20 1e-20
$$ 1e-20 1e-20 1e-20 1e-20 1e-20 1e-20 1e-20 1e-20 0 0 0 0 0 0 0 0 0 0 0 0
$$ 0 0 0 0 0 0 0 0 0 0 0 0 0 0 0 0 0 0 0 0 0 0 0 0 0 0 0 0 0 0 0 0
$$ ##$ShimPowRng0= (0..63)
$$ 1 1 1 1 1 1 1 1 1 1 1 1 1 1 1 1 1 1 1 1 0 0 0 0 0 0 0 0 0 0 0 0 0 0 0 0
$$ 0 0 0 0 0 0 0 0 0 0 0 0 0 0 0 0 0 0 0 0 0 0 0 0 0 0 0 0
$$ ##$ShimPowRng1= (0..63)
$$ 1 1 1 1 1 1 1 1 1 1 1 1 1 1 1 1 1 1 1 1 0 0 0 0 0 0 0 0 0 0 0 0 0 0 0 0
$$ 0 0 0 0 0 0 0 0 0 0 0 0 0 0 0 0 0 0 0 0 0 0 0 0 0 0 0 0
$$ ##$ShimPowRng2= (0..63)
$$ 1 1 1 1 1 1 1 1 1 1 1 1 1 1 1 1 1 1 1 1 0 0 0 0 0 0 0 0 0 0 0 0 0 0 0 0
$$ 0 0 0 0 0 0 0 0 0 0 0 0 0 0 0 0 0 0 0 0 0 0 0 0 0 0 0 0
$$ ##$ShimPowRng3= (0..63)
$$ 1 1 1 1 1 1 1 1 1 1 1 1 1 1 1 1 1 1 1 1 0 0 0 0 0 0 0 0 0 0 0 0 0 0 0 0
$$ 0 0 0 0 0 0 0 0 0 0 0 0 0 0 0 0 0 0 0 0 0 0 0 0 0 0 0 0
$$ ##$ShimSysFunc= (0..63)
$$ 1 2 3 4 5 7 9 11 15 16 8 10 12 14 6 17 13 18 19 20 0 0 0 0 0 0 0 0 0 0
$$ 0 0 0 0 0 0 0 0 0 0 0 0 0 0 0 0 0 0 0 0 0 0 0 0 0 0 0 0 0 0 0 0 0 0
$$ ##$ShimSysMatrix= 0
$$ ##$ShimSysType= 1
$$ ##$TFXNUM= 0
$$ ##$TRIPLO2= 0
$$ ##$VTU= 2
$$ ##$VTUETH= <149.236.99.20>
$$ ##$VTUTY= <no>
$$ ##$WBREFAM= (0..15)
$$ 135 116 100 100 100 100 100 100 100 100 100 100 100 100 100 100
$$ ##$WBREFLM= (0..15)
$$ 0 0 0 0 0 0 0 0 0 0 0 0 0 0 0 0
$$ ##$WBREFPH= (0..15)
$$ 71.66 -68.25 0 0 0 0 0 0 0 0 0 0 0 0 0 0
$$ ##$WBSGU= (0..15)
$$ 0 0 0 0 0 0 0 0 0 0 0 0 0 0 0 0
$$ ##$XFAC= 2
$$ ##END=
$$ 
##$DECIM=	760
##$DSPFVS=	20
##XUNITS=	HZ
##YUNITS=	ARBITRARY UNITS
##FIRSTX=	24231.369385662510467
##LASTX=	-2084.0185409410978536
##DELTAX=	-0.40154708059210514337
##XFACTOR=	1
##YFACTOR=	0.072458310512749521393
##FIRSTY=	18.974172592163085938
##MINY=	-21.345363616943359375
##MAXY=	2794.95751953125
##NPOINTS=	65536
##XYDATA=	(X++(Y..Y))
$$ [...]
11037A41J0Omj3j4oMJ4J9J8QlqqpmMJ2J5J3J0RO%jOJ3J2Jj0k0k5k7k5j8j8k2k4j2NK0K2K1
11020A20K1K1J5Mpj3j8k8l0j5J3L1L1J9J4J4J1Krj6j8j7j3nKNKJQK1L0L2K2R%nrj4j4pLJ5
11003B28J6Oqj4rJOMkorj5k1k6k5k4k4k4k4j6mRJ4J0POOJmmMJ3J7J5J4J6J7J0nj8k0j5j0q
10985H5ooqj2j3j1rj0qJRJ6K1K7K5J1qj6j0%LNRJ4J5J3J0QOQJ3K2K7K2J1%%OJ1Omj3j5j2j0
10967B33j0j1j3j4k1l0l7l7k4oPJ0J2K0K6K5J4PMkj5k6k9j8KK2L6L9L1J7PMMLJlnjQJ3J3O
10950B62Kjpj0oJLKKLJqj4j3rrj5j7j6j2pLJ4K0J4Nkqj0oQK1K2J1KLPKqj2pJOLkpj4j8j5n
10930A60OJ0Pkponpj3j2o%JKjrj7k3j5mJ0K2L3L3K1NjMLrk1k0j3rj4j7j6j0mj%orlJ1K1K1
10911I0J3RNkj3j8j3kPJ2J4J3Ooj7k4k6k4j8rjLJjl%MPJ2J3J1J2J5K0K3K0Prk4k4j3KJ1RL
$$ y = [141, 151, 157, 153, 140, 126, 120, 124, 138, 157, 175, 183, 180, 172, 164, 157, 153, 157, 169, 184, 197, 207, 216, 222, 222, 221, 227, 240, 252, 253, 243, 223, 198, 171, 146, 128, 110, 88, 64, 52, 57, 77, 99, 120, 141, 162, 177, 181, 174, 161, 143, 115, 85, 70, 83, 114, 145, 164, 178, 192, 203, 205, 196, 180, 162, 145, 132, 127, 129, 134, 136, 137, 145, 166, 196, 228, 250, 259, 259, 254, 245, 231, 217, 210, 213, 228, 244, 250, 242, 228, 219, 220, 226, 230, 228, 222, 213, 198, 177, 151, 126, 102, 78, 54, 30, 14, 10, 19, 33, 43, 50, 56, 62, 63, 59, 55, 59, 72, 89, 104, 118, 134, 151, 161, 156, 138, 118, 103, 93, 85, 79, 73, 65, 53, 40, 29, 20, 10, 2, 3, 12, 28, 49, 76, 101, 112, 104, 88, 78, 78, 81, 86, 95, 109, 124, 137, 147, 155, 161, 169, 182, 204, 231, 253, 264, 264, 264, 270, 281, 287, 283, 270, 255, 243, 233, 223, 212, 199, 185, 164, 134, 97, 60, 36, 30, 37, 47, 59, 79, 105, 130, 144, 151, 155, 153, 138, 112, 83, 65, 67, 89, 125, 164, 195, 212, 219, 223, 227, 230, 231, 228, 223, 222, 230, 243, 256, 262, 264, 263, 256, 246, 240, 241, 244, 246, 248, 251, 252, 244, 230, 217, 208, 199, 184, 167, 151, 139, 132, 135, 149, 169, 183, 188, 186, 178, 168, 162, 170, 191, 213, 224, 226, 229, 236, 238, 230, 218, 211, 212, 218, 221, 219, 212, 198, 180, 165, 160, 166, 176, 183, 181, 174, 168, 163, 156, 143, 131, 125, 125, 126, 128, 127, 118, 101, 78, 63, 59, 69, 91, 124, 157, 178, 183, 182, 186, 189, 180, 159, 139, 126, 117, 103, 86, 70, 60, 56, 55, 55, 49, 40, 37, 48, 69, 90, 103, 112, 117, 115, 102, 84, 71, 69, 76, 88, 102, 115, 121, 115, 98, 74, 48, 24, 6, -3, -4, -1, 0, -1, -4, -4, 0, 7, 19, 32, 43, 55, 70, 90, 113, 133, 140, 131, 107, 83, 70, 72, 83, 92, 95]
10893I5jpj2j2lJ1J8J1ok8m5m7l6j7KJ9L4M3M7M2L0J3pk3k5j1NJ0NjJOQJ3J9K6K7K2J7Mj5
10877B32l0k8qJ1J6J1OKknllpj1j0pnmLRMonQJ9J7J4J4J5Pj%RJ4J4RNJmqj0j7k2k1j6j2j5
10858A80j9j7j0jPNmj4j4nLMNOMlj4k2k0j3kL%jMJ5K5K9K7K3J4Kj0j2j3j5k0j8j1n%QJ3J8
10840A32J6Prk3l1k4rMJ2J6J6J0Lk%NJ5K5L4L4K7J6Pmk0l6m4l9k2%J6K1J3MJNJ5K2K4J8QL
10823B66MPOlj4k3l2m0m7m6l8k1roqj1pJJ2J9K2J8J3J2K0L0K9K1J0L%%j%lrj2qNJ7K6K8K4
10806B55J6Kj7l2l6k8j5qj0j5j5oMJ1J0Kpj4j5nJ3K7K9K0J0Mkj1j8j4kQQJl%PJ4J2OllKQJ1
10788B01P%mkMRROLKkqj5j3pMRRO%mj1j8k5k5j9j1j0j5j9j3KJ5K1K3K1J8J2OOJ2J9K3K2J6
10770B64ROPOkj4k1k2k0k2k4k3k0j6j0nmopjMNPJ1Rkj9k2j2%Jmqj1j2j2nNJ0QMKMNNlj3j3
$$ y = [95, 94, 87, 75, 63, 60, 71, 89, 100, 94, 66, 21, -26, -62, -79, -77, -58, -24, 19, 66, 108, 138, 151, 144, 121, 96, 85, 90, 100, 105, 104, 105, 111, 119, 132, 151, 177, 204, 226, 243, 247, 232, 202, 174, 166, 177, 193, 204, 210, 212, 210, 205, 202, 199, 192, 181, 171, 164, 159, 155, 158, 167, 171, 165, 160, 168, 187, 204, 218, 232, 247, 254, 253, 253, 262, 276, 290, 299, 304, 305, 301, 293, 283, 266, 244, 223, 207, 195, 180, 161, 144, 134, 133, 140, 145, 141, 127, 113, 108, 111, 115, 120, 126, 130, 127, 113, 91, 71, 58, 56, 59, 59, 58, 62, 77, 102, 131, 158, 181, 195, 197, 187, 175, 162, 147, 127, 109, 98, 93, 93, 101, 114, 132, 148, 155, 146, 123, 92, 68, 59, 63, 75, 91, 107, 117, 120, 118, 118, 123, 138, 163, 197, 231, 258, 274, 281, 277, 257, 221, 177, 138, 116, 116, 132, 153, 166, 170, 171, 176, 191, 213, 237, 255, 263, 266, 270, 277, 283, 280, 266, 243, 211, 171, 124, 78, 40, 19, 10, 4, -4, -15, -22, -21, -9, 10, 32, 50, 63, 75, 95, 125, 154, 175, 185, 188, 188, 188, 187, 187, 184, 175, 163, 155, 160, 177, 203, 231, 255, 271, 273, 256, 224, 188, 160, 145, 137, 127, 112, 97, 91, 95, 106, 116, 118, 111, 97, 82, 77, 90, 117, 146, 166, 176, 180, 178, 167, 149, 135, 133, 141, 149, 150, 147, 147, 154, 168, 180, 186, 183, 180, 182, 190, 201, 208, 208, 204, 202, 206, 215, 224, 230, 233, 235, 233, 225, 210, 197, 190, 194, 203, 212, 218, 218, 214, 203, 185, 160, 135, 116, 105, 95, 80, 61, 48, 50, 65, 86, 109, 130, 148, 160, 166, 172, 184, 203, 226, 248, 264, 273, 279, 286, 292, 290, 276, 255, 233, 213, 191, 167, 144, 124, 108, 98, 93, 89, 83, 76, 75, 79, 84, 91, 102, 111, 109, 90, 68, 56, 56, 57, 53, 45, 34, 22, 10, 5, 10, 20, 28, 32, 34, 38, 43, 48, 45, 32, 19]
10751A9jJ9K9K5J6J2Pkj4k1k2k2j5nLLnqkJ4K7K9K4J4PQJ0RMJjkjjmj0j3qLJ1J2RQPKml%%
10731A68lnpomMJ1J4J1OMMORJ3J4RKkmj1j8j5oKJmokOJ3J5PmrmNPkj5j9j5j2j6k0j7mPRJ0
10711A27J7L1M1M0K9J3lj2j1qj2k0k1j2k%j%PQMpj6k1j4njnj2j3j2j8k5k5j4kNQJ4K2K3J2
10694A09rk6l3k9k0j7j4qLJ7K6K9L0K6J6Olpj4k4k9k5qPK0K6L1L4L6K9J9RPRRjj3k2j9q%j
10677A68rj6j6qRK4K9J8MnmkkMJ5K6K7J5kj4k0j7j0mlmpopqqmLJ3J5J0L%MMkj6k7l2k9j7j
10658I1J1J6J6J9K4K7K1J4J1QQKoj8k7l1k5j2LJ4J6J8K0K1J2rk6k5oJ4K3J9J2Krj6j5j1op
10642A93j4k0j8qRJ8J4PLMLlrj3j8k3k4k1j6j1KK0K9K8K3K3K5J9Omqnpj3k2k5k0j0JRJ4J6
10625A54J5J2J2J7K2J8Oj0k2k5k7k5k5k0j1NJ5J2KjKLoqjRRMRK5L4K3Nprn%ONmj4k1j7rJJ4
$$ y = [19, 18, 37, 66, 91, 107, 119, 126, 124, 110, 89, 67, 45, 30, 25, 28, 31, 26, 18, 16, 30, 57, 86, 110, 124, 131, 139, 149, 158, 162, 163, 162, 160, 159, 158, 154, 144, 131, 123, 126, 137, 149, 158, 166, 173, 175, 171, 168, 168, 168, 165, 160, 153, 147, 143, 147, 158, 172, 183, 189, 193, 197, 203, 212, 225, 239, 248, 250, 248, 244, 233, 215, 200, 194, 196, 197, 193, 187, 185, 191, 204, 219, 226, 222, 213, 209, 214, 221, 219, 204, 185, 170, 158, 142, 122, 105, 101, 108, 117, 127, 144, 175, 216, 256, 285, 298, 295, 283, 272, 264, 252, 232, 211, 199, 197, 197, 196, 196, 203, 211, 215, 208, 192, 171, 157, 152, 151, 146, 134, 121, 109, 91, 66, 41, 27, 25, 30, 38, 52, 74, 97, 109, 100, 74, 41, 12, -8, -25, -39, -47, -44, -27, -1, 28, 58, 84, 100, 106, 103, 96, 82, 58, 29, 4, -4, 3, 23, 49, 80, 114, 150, 179, 198, 207, 214, 223, 232, 231, 218, 196, 177, 169, 169, 168, 159, 143, 127, 119, 128, 152, 181, 199, 203, 198, 194, 192, 190, 194, 209, 235, 262, 277, 275, 261, 241, 224, 214, 210, 207, 203, 196, 190, 183, 175, 167, 163, 166, 179, 194, 204, 207, 207, 211, 215, 213, 197, 170, 138, 109, 92, 91, 102, 118, 134, 153, 177, 204, 225, 239, 250, 258, 266, 268, 262, 244, 217, 186, 161, 149, 152, 166, 182, 200, 220, 241, 253, 244, 218, 193, 187, 201, 224, 243, 255, 257, 248, 232, 217, 206, 200, 193, 179, 159, 141, 133, 142, 160, 174, 181, 184, 188, 191, 188, 179, 166, 148, 125, 101, 80, 64, 53, 55, 75, 104, 132, 155, 178, 203, 222, 228, 224, 216, 211, 204, 191, 169, 144, 124, 114, 115, 124, 138, 154, 169, 181, 193, 210, 232, 250, 256, 246, 224, 199, 172, 147, 122, 102, 91, 96, 111, 123, 125, 124, 126, 129, 123, 115, 114, 123, 132, 136, 145, 170, 204, 227, 232, 225, 216, 211, 211, 217, 222, 218, 204, 183, 166, 157, 158, 172]
10607A72K1J9Oj1j8j2NK8L9L0J2kjLkj5l0m0m1l2j9qoj1j5k0k5l1l3k7j7mJ0J9K4K6K5K4J3
10591E6KjOJ4J8J5ROJjlpojMJpj3j0nmqqoKJ0K2K8K6J8J5J6J5R%%KKlj2k1k8k8k2j3nLJ2K1
10572A21K7K5J8J2J1J2J3J3RN%KKJpj0pMJ2J5J1%j4k6l2l5l3k6rRJ9J5PJlrj7k0j5j1j4j9
10555E7j7kJ5K5K6K2J8J5R%om%kqoKJ0Ooj5j6j3pNJ6J9J1jj6l3m2l1oJ7K1QjKJ3K3K6K4J9
10537A77J2Lrj9k3j8nQJ5J3NmpkNMmj1j0jPJ2J1J3J4J4QJrj8k6k4j5mKMjj0k0k6k5j8j5j3
10519ij0OK4L5L3K5K1J8J5RKkmpj2j3pKQQMjqj5j4nMLrk4l0k4pJ1K2K2J6J2QLlpnJNJ1J4J2
10500A38Mqj3oPJ3PmqnMPPKmj1j0mLLlpl%LMNNJmj0j2j1rmJNONkrmRK3K5J3nj9k1j5oJMNN
10478I8OPJ1J0OlmNK0L2L2K3R%kqj8k5k0p%qj7j4KJ4J2LnkLLqj9k4k2j9j7qJ1K4K3Rjlpj1
$$ y = [172, 193, 212, 218, 207, 189, 177, 182, 210, 249, 279, 291, 289, 288, 291, 289, 274, 244, 204, 163, 131, 112, 104, 98, 87, 72, 52, 27, -4, -37, -64, -81, -85, -75, -56, -32, -6, 19, 43, 56, 58, 57, 63, 77, 95, 110, 119, 125, 126, 125, 122, 115, 109, 108, 112, 113, 106, 93, 83, 78, 74, 66, 58, 52, 54, 64, 86, 114, 140, 158, 173, 189, 204, 213, 213, 213, 215, 217, 214, 202, 181, 153, 125, 103, 90, 85, 88, 100, 121, 148, 173, 191, 203, 214, 226, 239, 252, 261, 266, 266, 268, 270, 271, 264, 254, 247, 251, 263, 278, 289, 289, 275, 249, 217, 182, 149, 123, 114, 123, 142, 157, 164, 165, 162, 153, 136, 116, 101, 90, 76, 57, 40, 38, 53, 78, 104, 126, 144, 159, 168, 168, 162, 158, 158, 156, 148, 142, 144, 154, 160, 154, 139, 123, 110, 103, 108, 124, 143, 154, 153, 137, 104, 62, 31, 25, 42, 63, 71, 70, 72, 85, 108, 134, 158, 177, 189, 192, 183, 164, 141, 123, 118, 126, 141, 154, 159, 155, 148, 146, 151, 155, 151, 140, 130, 129, 136, 148, 159, 172, 186, 200, 208, 209, 200, 182, 156, 132, 117, 113, 115, 119, 118, 108, 88, 62, 37, 19, 4, -9, -19, -13, 11, 46, 79, 104, 125, 143, 158, 167, 169, 167, 163, 156, 144, 131, 124, 126, 134, 142, 146, 145, 137, 122, 108, 103, 107, 110, 101, 77, 47, 23, 16, 27, 49, 71, 87, 99, 107, 110, 107, 100, 95, 96, 101, 112, 126, 138, 142, 134, 121, 115, 122, 135, 142, 138, 130, 125, 129, 136, 143, 145, 141, 130, 120, 116, 119, 122, 119, 112, 109, 109, 112, 116, 121, 126, 127, 123, 113, 101, 90, 81, 77, 78, 83, 89, 94, 92, 83, 79, 88, 111, 136, 149, 144, 125, 104, 89, 83, 84, 88, 93, 98, 104, 111, 122, 132, 138, 135, 131, 136, 156, 188, 220, 243, 252, 252, 250, 242, 224, 199, 179, 172, 172, 164, 147, 133, 135, 149, 161, 164, 159, 157, 160, 163, 155, 136, 112, 90, 71, 54, 46, 57, 81, 104, 113, 112, 109, 102, 91]
10459I1qNK0K4K0J5J2RN%%KKlj6k2j4%QNMJ3J9J7QNJ2J7J9J3%j9l4l7k7j7j0%J6L2L8K8J2
10442B64joj0j8k6l3l3k9k2j2ooj2j6j3nOJ6K7L2L0K0J0MKkqj6k0j4nln%J4K8L1J8Jj2j9k1
10425A30j7j5j3qLJ0RMjmlMK1L5L6K1Nnj1j6j3plpj0oNRQQJ5K2K2Rj2l1l4k4j1LJ6K7K8J9
10407B18QQRNnj5k1k4k1rMQjj0j2rpqj1j0nNJ3J3Jj2j7j3nJNRJ2J1PORJ6K0K0J1%omMJ1J7
10388B26J6J1KormJMLK%mj6l0m1m1l0j4jMMLNLjljKLMJ0J9J9Rnj1rqrrokJKMRJ5J8K2K8K9
10368B18K2Pj0k3l2l4k9k2j7j5j5j4j7k1k4j7%K5M7O2N2K6lj7j7j4j2nQK2K7J8Jj7k4j8mO
10353A20OJmrj5j7j0LJ9L1L5K4Mj1j1jNKkonoj0j0lPJ2Mrj9k1j8j4r%RQLjKNO%qj3oPK0K7
10333A22K6J9Qoj6k0k0k0j7j1lLLLNRJ5K1K3J7QJ%oj5j8pRK0J8Orj6j5pJPJ2J9K1J2%oJJ9
$$ y = [91, 83, 88, 108, 132, 152, 167, 179, 188, 193, 193, 193, 195, 197, 194, 178, 156, 142, 142, 150, 155, 159, 172, 191, 208, 216, 221, 233, 250, 269, 282, 282, 263, 229, 192, 165, 148, 138, 138, 154, 186, 224, 252, 264, 263, 257, 247, 229, 203, 170, 137, 108, 86, 74, 68, 62, 50, 34, 21, 16, 22, 38, 65, 97, 127, 147, 157, 161, 163, 161, 153, 137, 117, 103, 98, 95, 90, 90, 104, 132, 163, 181, 182, 170, 151, 130, 113, 98, 85, 77, 80, 90, 99, 103, 102, 98, 95, 99, 120, 155, 191, 212, 217, 212, 201, 185, 172, 165, 162, 155, 145, 139, 144, 153, 161, 169, 184, 206, 228, 237, 225, 194, 160, 136, 125, 128, 144, 171, 199, 218, 226, 234, 243, 248, 243, 228, 207, 183, 162, 153, 157, 165, 164, 154, 142, 133, 126, 118, 107, 97, 92, 97, 110, 123, 124, 112, 95, 82, 77, 78, 83, 92, 104, 115, 122, 128, 137, 153, 173, 193, 204, 204, 198, 194, 198, 209, 226, 242, 253, 255, 249, 240, 236, 237, 241, 244, 246, 246, 242, 226, 196, 155, 114, 84, 70, 69, 73, 77, 80, 85, 88, 87, 84, 83, 85, 88, 92, 102, 121, 140, 149, 144, 133, 124, 116, 107, 98, 92, 90, 91, 93, 97, 106, 121, 139, 161, 189, 218, 240, 247, 237, 214, 182, 148, 119, 97, 80, 65, 50, 36, 19, -2, -26, -43, -43, -18, 29, 91, 143, 169, 166, 149, 132, 118, 106, 101, 109, 131, 158, 176, 177, 160, 136, 118, 114, 120, 126, 127, 123, 114, 99, 82, 72, 75, 94, 125, 160, 184, 188, 177, 166, 165, 170, 172, 170, 164, 159, 153, 143, 133, 130, 137, 149, 153, 144, 125, 104, 86, 72, 63, 63, 72, 80, 83, 82, 84, 89, 95, 95, 87, 74, 68, 75, 95, 122, 148, 167, 175, 169, 153, 133, 113, 93, 76, 65, 62, 65, 68, 71, 76, 85, 100, 121, 144, 161, 169, 170, 170, 164, 149, 131, 124, 133, 153, 171, 177, 168, 152, 137, 130, 131, 138, 150, 169, 190, 202, 202, 196, 197, 216]
10315B16L5M0L1J1j1k7k9k0j0nj1k5l5l7k7j4popkQJ2Rlj1j5j0nKQJ3J4J1OLOJ5K4K4J5OL
10298A95%oj0nMRRJ2K1K5J9RJjkmnl%KK%lqj2j2j1qrqn%JLMOJj0j7j6j3k0k6k3j0%MLMNRK2
10277A23L4L2J2j1k0j5j3j5j1%J2J2OKKKkpj0j0j0rpkNQQMJPK1L3L4J9nk6l7l4k6j6rmoj2
10260F0j1%J6K6K2J1NNONMNNjrj2qnj0j7k2j6nQK1L0K9J7Nmj0j8k7l1k5j0OJ5J4J3J6K5K9
10242A57K0MpoMJ3J4J3J0PJloqj1pJNkj6k4k2j7j3oQJ6J5OKORJ0RP%j1j4j0nqj5j9k2k3j8
10224D4nJ2J5MnjJ5K4K2J9J7J0nj9j3J1L0K7J2NJ0J6Rmj7k3k4j9j3nJOJ2J2%k3m2m3k6mQN
10207E5mj0qkNRJ3J3OLRK4L6L7K7J2jj0j6j8j6kJ5K8K0Jj9k7k3j4oKPQPPMmj5k4l1l1k2jK2
10189F6L4K7J7J6K1J7QJjkj1j8j8qKJ0J3J4J4J2Nqk1k2j0MQLjlk%LJ1J3Qkj3k0k1j2kMkqo
$$ y = [216, 251, 291, 322, 333, 322, 295, 266, 246, 236, 231, 220, 195, 160, 123, 96, 82, 75, 69, 62, 60, 68, 80, 89, 86, 75, 60, 50, 45, 47, 55, 68, 82, 93, 99, 102, 108, 123, 147, 171, 186, 192, 195, 195, 189, 179, 174, 178, 187, 196, 208, 229, 254, 273, 282, 283, 282, 280, 276, 271, 268, 268, 270, 272, 272, 269, 261, 249, 237, 226, 218, 209, 201, 196, 196, 197, 200, 204, 210, 211, 201, 184, 168, 155, 135, 109, 86, 76, 76, 80, 83, 87, 92, 101, 123, 157, 189, 201, 190, 170, 155, 142, 127, 116, 116, 128, 140, 146, 148, 150, 152, 150, 143, 133, 123, 113, 104, 97, 95, 100, 108, 116, 120, 121, 128, 149, 182, 216, 235, 230, 204, 167, 133, 107, 91, 82, 78, 72, 60, 49, 49, 65, 91, 113, 124, 129, 134, 140, 145, 149, 154, 159, 158, 149, 137, 129, 124, 114, 97, 75, 59, 54, 62, 83, 113, 142, 159, 164, 160, 150, 132, 105, 74, 49, 39, 45, 60, 74, 87, 103, 128, 157, 177, 181, 174, 168, 172, 185, 199, 212, 222, 229, 230, 227, 221, 213, 202, 195, 196, 201, 199, 183, 159, 137, 120, 107, 101, 109, 125, 140, 146, 148, 154, 163, 173, 182, 189, 189, 178, 164, 154, 149, 141, 126, 107, 85, 62, 44, 39, 51, 66, 70, 65, 64, 79, 103, 125, 144, 161, 171, 166, 147, 134, 145, 175, 202, 214, 219, 229, 245, 254, 250, 233, 210, 186, 167, 154, 149, 150, 156, 168, 180, 180, 157, 115, 72, 46, 42, 50, 55, 51, 41, 33, 31, 36, 45, 58, 71, 77, 80, 89, 113, 149, 186, 213, 225, 224, 214, 198, 180, 164, 162, 177, 205, 225, 226, 207, 180, 157, 143, 137, 139, 146, 154, 161, 168, 172, 168, 153, 129, 98, 67, 45, 44, 66, 100, 127, 144, 160, 181, 198, 206, 207, 206, 204, 193, 175, 157, 149, 151, 161, 174, 188, 202, 214, 219, 211, 190, 168, 158, 162, 170, 173, 172, 169, 167, 167, 170, 181, 194, 202, 200, 187, 167, 146, 134, 132, 136, 134, 126, 120]
10170A20kmj6k6k8k6k1j5mQJ7K6L2L1K4J2KolOJ5J5J0QPNlrokmj2j8j8j2pklnmKPNmj2j1m
10152F5NRQ%j2k1k5k7k5k0j3lNJ5K3K6K6K2K0K5L0K9K0Qklnrj4j6j5j7k3k8k3j2%J2K3K8K8
10135A14K0J5J2J0QRJ0P%ppjJlrj3j6j8j7j1ljmj0j7j9j5%K0L4L7K7J4QNLkrj5j3nRJ6J0m
10117A70j9k6k9k9k8k5j4%J8K0J0mj1j1rmLJ1J6J5J6K5L3L2J8Jj3k3k6j9kJ6K0Qj2k3j8mJ4
10101I7K3K4J9J8J8J7J1MLJ0J2Lj4k9l5l1k9l2m1m4k8mK0L0L2L2L0K3R%ljJKPJ4J6QjmJLJ
10084A92lmj0j6k0j3kJpj7j4jJ6K5K5J6Jj7k5k3j5j3j7j8j0MJ8K8L5L5K7J2jqqmmoj1j1%K1
10067A58L6L5K0Jqj0qkPJ0jk4m1m4l6k8k1j7j7j8k1j3lLmj2j3j0j0r%J6K7K8K2J9K0J6QLN
10051F4J3J8J4PJ%LLJoj0j0lQJ8K7K9K0Lj3j6nJ1K0K4K4K2J0qj9j5mKjpj5k2k7k4j7j3j6k0
$$ y = [120, 118, 114, 98, 72, 44, 18, -3, -18, -22, -14, 3, 29, 61, 92, 116, 128, 130, 124, 121, 127, 142, 157, 167, 175, 182, 187, 184, 175, 169, 167, 163, 151, 133, 115, 103, 96, 94, 91, 86, 82, 84, 91, 96, 92, 80, 69, 65, 70, 79, 87, 87, 75, 54, 29, 2, -23, -43, -56, -59, -54, -39, -16, 10, 36, 58, 78, 103, 133, 162, 182, 190, 188, 185, 180, 171, 157, 141, 126, 109, 86, 58, 35, 23, 23, 35, 58, 86, 114, 134, 149, 161, 171, 179, 188, 198, 205, 205, 198, 191, 190, 191, 188, 179, 166, 150, 132, 115, 104, 101, 100, 96, 86, 69, 50, 35, 35, 55, 89, 126, 153, 167, 175, 180, 183, 181, 172, 157, 144, 139, 148, 164, 174, 170, 151, 125, 96, 67, 39, 14, 0, 0, 18, 38, 48, 44, 33, 22, 13, 9, 12, 23, 39, 54, 70, 95, 128, 160, 178, 179, 166, 143, 117, 98, 96, 112, 132, 140, 128, 105, 87, 83, 97, 120, 144, 163, 181, 199, 216, 227, 231, 234, 244, 256, 259, 245, 216, 181, 150, 121, 89, 48, 4, -24, -28, -8, 22, 54, 86, 116, 139, 148, 148, 145, 144, 145, 147, 154, 168, 184, 192, 191, 187, 188, 191, 192, 189, 185, 175, 159, 139, 126, 124, 125, 118, 101, 87, 86, 102, 127, 152, 168, 169, 152, 127, 104, 89, 76, 59, 41, 31, 35, 53, 81, 116, 151, 178, 190, 189, 181, 173, 169, 165, 159, 148, 137, 137, 158, 194, 229, 249, 250, 242, 232, 224, 222, 229, 239, 238, 214, 173, 129, 93, 65, 44, 27, 10, -8, -29, -42, -45, -42, -46, -58, -71, -81, -91, -100, -100, -84, -57, -29, -7, 12, 32, 48, 56, 59, 64, 77, 95, 109, 116, 117, 117, 120, 123, 124, 118, 108, 98, 95, 103, 121, 148, 177, 197, 200, 187, 171, 166, 177, 197, 221, 245, 267, 277, 269, 250, 235, 231, 233, 232, 225, 210, 188, 161, 137, 120, 107, 91, 71]
10033G1k4j9j1jLMLPJ3J7J7J5J8K1K0J1kj2j9k5l1k9j9lJ1J7J8J8J6J0lj7k5k7k5j8q%QJ3
10017A3J6J4Onj0j1omqplQJ3NlOK3L3K7J2Jnqj0pqj3j6lJ7K5J5jojjqj8k3k5k4j7jJ8K9L5
9999F4L4K6J5Lrj3j0kNJ0J0PQJ2J4Rqk8l7k5jJ6K0J3N%LPPKj2k2k5j5nlnplKKJOJ4K1K2K7
9980A55L6M4M0K7Qj1k7l0j8mnk1l3k7qMRJ2J8K2J9Nrj9k3k4k2k3k5k8k7k0j3qj0j2j0qmjJ0
9964f1K5L8M1L3K4J7RJmpqoNJ8J9Lj9k8k3pNJ5K6L4L8L3K2J2PL%pj3qKJ3J4Mj1k4k8k6j7o
9946A58MO%j0j9k5k3rJ2K9L0J7NkmonJMkj4j9j8j2nOJ9K0Qqj3mQJ3J2NjnnmjRK1K7J6nj7j7
9927A77j2j2j7j8j1jLKmrj1j0j0j7k3k6j6%J7K9K8K1J4J1Nnj0pkoj9k4j4KQlj7k7l0k6j5K
9910h3J9K7L2L7M8N1L6J0j2k1j6mJJoj5k1k6k4j0J0K6K8K0J1Moj6j8j0%Koj0mORMklJPRPJ
$$ y = [71, 47, 28, 17, 16, 19, 23, 26, 33, 46, 63, 80, 95, 113, 134, 154, 165, 163, 151, 132, 107, 76, 47, 28, 25, 36, 53, 71, 89, 105, 115, 112, 95, 70, 43, 18, 0, -8, -8, 0, 13, 29, 43, 49, 44, 34, 23, 17, 13, 5, -2, -5, 3, 16, 21, 18, 24, 47, 80, 107, 119, 120, 115, 107, 97, 90, 82, 69, 53, 50, 67, 92, 107, 106, 100, 99, 98, 90, 72, 49, 24, 0, -17, -18, 0, 29, 64, 98, 124, 139, 142, 133, 120, 110, 108, 113, 123, 133, 140, 148, 160, 174, 183, 175, 147, 110, 85, 84, 100, 120, 133, 138, 138, 141, 148, 155, 157, 145, 123, 98, 83, 78, 75, 70, 63, 60, 62, 64, 65, 71, 85, 106, 128, 155, 191, 235, 275, 302, 310, 299, 272, 242, 224, 220, 215, 194, 161, 134, 126, 130, 139, 151, 169, 191, 210, 215, 206, 187, 164, 140, 118, 95, 70, 42, 15, -5, -18, -26, -36, -48, -58, -66, -70, -71, -61, -36, 2, 43, 76, 100, 117, 126, 127, 123, 116, 108, 102, 107, 125, 144, 147, 128, 100, 77, 70, 75, 90, 116, 150, 188, 221, 243, 255, 262, 265, 265, 258, 245, 237, 239, 252, 266, 270, 259, 235, 207, 181, 164, 158, 162, 168, 168, 158, 139, 114, 91, 82, 94, 123, 153, 170, 175, 173, 169, 163, 158, 159, 163, 161, 147, 128, 110, 98, 93, 99, 118, 138, 146, 138, 125, 121, 129, 142, 154, 159, 158, 153, 148, 144, 143, 152, 173, 200, 216, 211, 194, 177, 165, 153, 136, 118, 107, 106, 109, 111, 107, 98, 87, 77, 67, 50, 27, 1, -15, -15, 2, 31, 59, 80, 94, 105, 110, 105, 95, 88, 86, 80, 61, 37, 23, 25, 33, 30, 13, -14, -44, -70, -85, -83, -64, -37, -5, 32, 80, 131, 167, 177, 165, 144, 128, 124, 125, 126, 120, 105, 84, 58, 34, 24, 34, 60, 88, 108, 119, 123, 117, 101, 83, 73, 73, 75, 69, 59, 55, 61, 70, 74, 72, 69, 70, 77, 86, 93, 94]
9892I4nnjJMNKkl%NLmj1j2qjPQMnrj1j2j5j2kJ1J7J5Okm%MQRJ3J4Rkj3j2qkJQJ6K0J9J6J1
9871A69Jj1k0j8rJQJ0OKLJ1J6J8K1K6K9K2Pmj1j6k0k0j6j1om%LNNLpk1l2l3k7j9j0kMMnj2
9853D0j1mlrj7j8oOJ2QPJ5K9L6L1J5%qprj4j8j6j1j2j6j6nOJ2J6K0K1J5OlljKLKJJJLNQJ1
9833A25J0QOQJ4J2O%KJ0J5J3NJNJ3J5R%llkpj0j3j5j7j6j4j2j3j3qjNOJj0k0j9rlnqkJ3K3
9815A02K0RJJORMoj3j3rpj1j4j4pMJ5J5Mj0j3qljlmnlKJ0J2J3J2J4J2QLlj1j7j4KJ6K1K2K2
9796A70K2K1J7J9K1K1J9J5J0kj2j7k1k6l1k7j5nmool%%JK%lpj1j6k0k2j8j1lLLORJ4J0OQJ9
9778A30K5J3pj8j7j0j1j2q%PJ3J4J1Kqj0jPRKljNRJ3J5J3Okpj0j4j8k1j8j1j0j2j7j3JJ9K7
9760H2K2J0K%LJ0J4J2kj6j8qKKjkkpj4j5qj%klnrj0nOJ7K2K5K7K8K6K2J6J3RLjl%%kprro%
$$ y = [94, 89, 84, 83, 84, 88, 93, 95, 93, 90, 90, 95, 98, 94, 83, 71, 63, 62, 69, 77, 81, 76, 67, 56, 44, 29, 17, 15, 26, 43, 58, 64, 62, 58, 58, 62, 70, 79, 92, 106, 115, 113, 100, 88, 80, 78, 79, 87, 103, 123, 142, 158, 169, 170, 159, 139, 121, 112, 113, 121, 131, 137, 139, 142, 153, 169, 187, 208, 234, 263, 285, 292, 288, 277, 261, 241, 221, 205, 194, 188, 184, 184, 187, 192, 197, 200, 193, 172, 140, 107, 80, 61, 51, 49, 53, 57, 52, 40, 29, 25, 22, 13, -4, -22, -28, -22, -10, -2, 5, 20, 49, 85, 116, 131, 131, 123, 116, 107, 93, 75, 59, 48, 36, 20, 4, -1, 5, 17, 33, 53, 74, 89, 95, 92, 89, 88, 90, 93, 95, 96, 97, 98, 101, 106, 114, 125, 135, 143, 149, 157, 171, 183, 189, 189, 191, 201, 216, 229, 234, 235, 240, 253, 268, 277, 277, 274, 271, 269, 262, 252, 239, 224, 207, 191, 177, 165, 152, 139, 131, 130, 135, 141, 142, 132, 112, 93, 84, 81, 76, 68, 66, 79, 102, 122, 131, 132, 133, 139, 148, 152, 146, 133, 120, 111, 104, 93, 79, 65, 58, 62, 77, 92, 96, 86, 73, 65, 62, 61, 58, 54, 49, 46, 48, 58, 70, 83, 95, 109, 121, 129, 132, 129, 118, 101, 87, 89, 105, 126, 148, 170, 192, 213, 230, 249, 270, 291, 310, 325, 335, 333, 321, 304, 283, 257, 226, 199, 184, 179, 175, 169, 163, 160, 160, 160, 161, 163, 163, 160, 153, 142, 126, 106, 84, 66, 55, 52, 55, 58, 64, 73, 87, 97, 103, 111, 130, 155, 168, 161, 143, 126, 116, 105, 93, 85, 85, 92, 105, 119, 130, 132, 124, 114, 113, 120, 129, 131, 128, 127, 132, 141, 154, 169, 182, 188, 186, 179, 169, 155, 137, 116, 98, 87, 77, 65, 48, 35, 36, 55, 82, 104, 114, 116, 116, 119, 129, 143, 155, 153, 137, 119, 111, 113, 115, 114, 112, 110, 103, 89, 74, 66, 65, 65, 63, 60, 55, 46, 36, 31, 37, 54, 76, 101, 128, 156, 182, 204, 220, 233, 242, 245, 244, 241, 241, 241, 239, 232, 223, 214, 208, 208]
9740B08Klj2j4nLM%%K%lnJPRMmj3j3qkmrj3pKJ0J1Npj4j1lKkj0j6k2k6k5j6mJMRJ1Qmj1oP
9719A8J4J0J%RJ9K1J8J5J8J9J5Ojj0j8k1j7j1rj1j5j5j1pqj3k3k6j6KJ4J8J5J2J0J2J9K5K7
9703A05J8J0LJ%j%lmpj1j6j8j3kPOMORPkj3k0j9j5j0omJJ2K3K8K6K2J3Jj0j9k2k1j5p%MOQ
9684F2J1J4J1NkoojLLJKOPPRJ2J4RLlpj1j7k0j1KJ3J7J4Oknoopj4k1j9pQJ8J6J2J1J8K3K1
9664A87J2RRRLqj5j7k1k4k4j7oPK1K9L1K2J2Lmj0j5j7j8j7j4mLLjnonm%JknKJ6J9J1%mmj3
9646A29k4k8j8nNJ3J9J9J4NknjNJ1J3J2PJpqjOM%KJ3J5Jk0l2l4k8j9lJ4K3K3J8J6J4Omj2j7
9628A40j8j3mLNLPJ4J9J8J6J2Nmj4j7j7j3mMMoj6k0j3rrj2j3j3j1%J2J7QmmPJ9K6K8K7K2J3
9610A95QJ0J4J2jj6k7k7j8oRJ7K4L0M4O6Q4Q4O0J9k1m4n3m8l8k6j5j0j3j8k2k2k3k4k6k5j7
$$ y = [208, 210, 207, 195, 181, 176, 179, 183, 183, 183, 185, 185, 182, 177, 178, 185, 194, 198, 194, 181, 168, 160, 158, 154, 145, 132, 125, 127, 137, 148, 153, 146, 132, 121, 118, 120, 118, 108, 92, 70, 44, 19, 3, -1, 0, 4, 13, 24, 32, 28, 17, 11, 18, 32, 42, 43, 43, 52, 71, 92, 110, 125, 143, 162, 177, 183, 182, 172, 154, 133, 116, 105, 96, 85, 70, 55, 44, 37, 29, 16, -7, -33, -49, -47, -33, -15, 0, 12, 22, 34, 53, 78, 105, 123, 133, 136, 137, 137, 136, 136, 133, 129, 122, 111, 95, 77, 64, 62, 69, 75, 79, 85, 94, 101, 99, 86, 66, 47, 32, 22, 16, 12, 13, 25, 48, 76, 102, 124, 137, 138, 128, 109, 87, 66, 51, 44, 44, 48, 54, 62, 73, 87, 98, 103, 101, 95, 89, 88, 91, 94, 95, 97, 103, 110, 117, 126, 138, 152, 161, 164, 161, 154, 143, 126, 106, 95, 97, 110, 127, 141, 147, 145, 140, 134, 128, 121, 107, 86, 67, 60, 68, 86, 102, 114, 125, 143, 166, 187, 199, 208, 217, 226, 229, 221, 206, 189, 168, 144, 120, 103, 97, 104, 125, 154, 185, 207, 219, 222, 218, 208, 193, 176, 158, 141, 127, 123, 126, 129, 128, 123, 117, 112, 108, 108, 109, 107, 102, 104, 120, 139, 150, 150, 146, 142, 129, 105, 77, 59, 54, 59, 72, 91, 110, 124, 129, 127, 122, 121, 126, 137, 150, 162, 169, 170, 163, 155, 154, 160, 164, 164, 166, 179, 194, 195, 175, 143, 109, 81, 62, 59, 73, 96, 119, 137, 153, 167, 173, 169, 157, 140, 122, 109, 105, 108, 113, 116, 123, 137, 156, 174, 190, 202, 207, 203, 189, 172, 155, 142, 138, 142, 146, 140, 124, 104, 91, 82, 73, 61, 48, 35, 24, 24, 36, 53, 61, 57, 53, 60, 79, 105, 133, 160, 182, 195, 203, 213, 227, 239, 238, 222, 195, 168, 150, 144, 153, 170, 194, 224, 268, 334, 418, 502, 562, 581, 560, 516, 463, 415, 377, 351, 336, 326, 313, 295, 273, 251, 228, 204, 178, 153, 136]
9595A36oLMnj3j4p%JJPJ4J7J5J0Mqk1k5j1QK1K7K7K5K0J0Kqk0k8k4pJ1J8J4Mjoqj0qKJ1J1
9577A93lk6m2m2k8j6j0j0j3j0kJ3K7L4L5L4L2K7J8Q%lJLjj1j9j8rmlmnnm%MLjqj3j4j0mjm
9558H9j2j3nLLlpkJ0K3K7K1QkpponkkljLRQPJ1J9K3J8Lj8l4l2j7KQLnm%Jkrj2oKJqj5rLJ0
9537F7RRJ1J1RJ0J5K2K0J0J%LRJ1J2Rkj6k5k0kJ1J4RJ0J6J7Pqj5j5j7j9k2k2j9j2jJ0J4J1
9520A42Mkj1k2k9k7k0j2kQJ9K7K8K2J2Jj0j6j9k1j8j1jMNJJKNNMkj0j4j2j1j2j2qKPNLMJ2
9502B1K2K6K4J4NPJ6K1J6J0J1J4J0Knonnoqj1j7k2k8l5l5k8j4mKQJ6K3K3K0J9J8J2Lkkkpj5
9485A06k3k2j4mJJjjnrmPJ5J6J4J8K5K8K6K2K0J3POMqk9m1l7k5j5rkMMjomjj%LON%onLJ0R
9464A00LlnppkPJ1N%JQRONQJ2J2J0QLoj3j5j5j2nPJ4J3Nmrj8k4k8k5k4j8pRK1K3K1J4Qlrj2
$$ y = [136, 130, 133, 137, 132, 119, 105, 98, 98, 99, 100, 107, 121, 138, 153, 163, 167, 159, 138, 113, 102, 110, 131, 158, 185, 210, 230, 240, 242, 234, 214, 186, 162, 155, 166, 184, 198, 202, 201, 195, 187, 177, 169, 171, 182, 193, 190, 164, 122, 80, 52, 36, 26, 16, 3, -7, -9, 4, 31, 65, 100, 134, 166, 193, 211, 219, 219, 216, 217, 220, 219, 208, 189, 171, 162, 158, 155, 151, 146, 141, 137, 137, 141, 144, 143, 135, 122, 108, 98, 94, 93, 89, 77, 64, 59, 62, 65, 62, 55, 53, 63, 86, 113, 134, 142, 140, 133, 126, 120, 115, 113, 111, 108, 107, 110, 119, 127, 134, 145, 164, 187, 205, 208, 190, 156, 124, 107, 109, 117, 120, 115, 111, 111, 112, 110, 101, 89, 83, 85, 86, 78, 63, 54, 57, 67, 76, 85, 96, 107, 116, 126, 141, 163, 183, 193, 194, 194, 197, 206, 217, 229, 238, 236, 220, 195, 175, 173, 184, 198, 207, 217, 233, 250, 257, 249, 234, 219, 202, 183, 161, 139, 120, 108, 107, 117, 131, 142, 146, 144, 133, 111, 82, 55, 35, 23, 21, 29, 48, 75, 103, 125, 137, 138, 128, 112, 93, 72, 54, 43, 42, 46, 51, 52, 53, 55, 60, 65, 69, 67, 57, 43, 31, 20, 8, -4, -12, -10, -3, 2, 5, 9, 21, 43, 69, 93, 107, 112, 119, 135, 156, 172, 182, 193, 207, 217, 219, 214, 208, 203, 198, 192, 184, 173, 156, 134, 106, 71, 36, 8, -6, -10, -8, 0, 16, 39, 62, 82, 101, 119, 131, 134, 132, 130, 128, 121, 106, 83, 61, 47, 43, 44, 45, 44, 43, 38, 29, 25, 32, 47, 63, 77, 95, 120, 148, 174, 196, 216, 229, 236, 242, 246, 238, 209, 168, 131, 106, 91, 82, 80, 84, 88, 87, 81, 77, 76, 75, 75, 78, 84, 89, 89, 83, 78, 81, 91, 100, 103, 100, 95, 88, 81, 79, 86, 97, 102, 102, 103, 111, 120, 126, 131, 139, 151, 163, 173, 181, 184, 178, 165, 150, 135, 123, 118, 125, 139, 152, 157, 153, 144, 126, 102, 74, 49, 25, 7, 0, 9, 30, 53, 74, 88, 96, 93, 84, 72]
9445G2j4k0k3j9rKJ3K3L2L4L0K5K6K8K7J8Jj7l1l5k7j6qJOJ0J2J3J3Rkj1j7j9j8j4j0j1j7
9429E7j7pOJ5J7J8K0J8J2PKlrj1oLQNkj1j4rlmmLK0K7J2rj7pJ2K4K5J2rl0l5k5j1jMMLJJP
9410I9J6J7J4Nlj0j2q%PPMKQJ9K5K1Qjnoj0j5j8k0k2k5k0lJ5K2J3kj6k6l3l5k7j1NJ4J5J8
9393B6K2K0J6J2RLopKPKj1j3mJ0J7K2K6L0L0K9K8K0Pj0k4k7k3j1NJ2Qjoorj9k8l0k5k5k4j8
9375C6jJ8L0K9K3J5PKKOPJpoJQJ1NLOJ9K7K4Pj2k3k6k2j7j1rrojPJ0Loj2oOJ7K1J8Qlj3j9
9356A68j6rJKLQJ9K5J9Kj3j7j0LJ6K0J7Pkj1j2qLJ0J4J0OLKMPP%ppqj6k8l4k2kJ0J1LnpkJ0
9337A74J7J5NlqnlMQQLllKOPOPJ2K0K8K6J4pk6l8m4m3l4k0p%PJ7K4K4J7RPOLknnjOJ0J2J2
9317B59RLj0k7m2m7l6j5PK4K9K7K2J6J0POPMkoolmoqlLM%j0j8k6k4j3LJ2J2QJnroJQQMjom
$$ y = [72, 58, 38, 15, -4, -13, -11, 2, 25, 57, 91, 121, 146, 172, 200, 227, 245, 246, 229, 198, 163, 136, 120, 112, 113, 119, 129, 141, 154, 167, 176, 174, 163, 146, 127, 109, 95, 85, 74, 57, 40, 33, 39, 54, 71, 89, 109, 127, 139, 146, 148, 145, 136, 125, 119, 122, 130, 135, 133, 122, 108, 99, 96, 92, 88, 91, 111, 138, 150, 141, 124, 117, 129, 153, 178, 190, 181, 151, 116, 91, 80, 79, 83, 87, 90, 91, 92, 99, 115, 132, 146, 151, 148, 138, 126, 118, 118, 125, 132, 136, 138, 146, 165, 190, 211, 219, 218, 213, 207, 197, 182, 164, 144, 122, 97, 77, 74, 89, 111, 124, 122, 106, 80, 47, 12, -15, -26, -21, -7, 8, 26, 48, 68, 84, 96, 105, 108, 102, 95, 97, 104, 106, 95, 82, 78, 88, 105, 127, 153, 183, 213, 242, 270, 290, 297, 287, 263, 236, 213, 202, 207, 219, 227, 226, 220, 214, 205, 186, 158, 128, 103, 78, 54, 36, 35, 53, 83, 112, 135, 150, 157, 159, 161, 167, 174, 175, 168, 162, 163, 171, 182, 187, 190, 196, 215, 242, 266, 273, 261, 238, 212, 190, 173, 162, 153, 144, 138, 137, 144, 154, 157, 151, 139, 133, 139, 156, 177, 195, 203, 200, 187, 168, 152, 143, 144, 146, 149, 157, 176, 201, 220, 222, 209, 192, 182, 185, 201, 221, 238, 245, 243, 232, 220, 212, 215, 225, 239, 249, 255, 258, 260, 264, 271, 278, 278, 271, 264, 256, 240, 212, 178, 156, 154, 164, 175, 178, 173, 166, 164, 174, 191, 206, 211, 208, 200, 195, 192, 196, 204, 212, 215, 212, 209, 211, 217, 224, 230, 237, 249, 269, 297, 323, 337, 330, 304, 266, 222, 179, 145, 125, 118, 118, 125, 142, 166, 190, 207, 216, 223, 229, 232, 230, 225, 220, 219, 225, 235, 247, 259, 268, 271, 261, 234, 192, 145, 109, 94, 101, 125, 154, 181, 203, 219, 229, 236, 242, 249, 253, 251, 245, 239, 236, 232, 226, 218, 215, 218, 222, 222, 212, 194, 168, 144, 131, 134, 146, 158, 166, 167, 162, 153, 147, 148, 156, 164, 168, 167, 161, 157]
9297A57LJ4J8J4J0J1J5J3Mkoj2k2l1l7l3j9jRLj2k0j6mNJ1J5J1kj4j8j2%J1J7J6J0OOLnj5
9280A01j8j3jJ2K7L5L3J9Mnj1j3j3j0nLJ0J2Npj4j2nLLJjRK4L2J8ok0j8j1j4k2k6k3j9j1j
9263E2POkj3j9j8j2kRK6L8M0K7Qm%J3K0J8J1Jj1k0k3j9qLJ0Nqj6j0QJ8J1nk1l0l0k2mJ0J5
9246E9J0OJ0K3L2L4K5J3jrj1ojmj2j4j1j5k9l4j7QK3K3K3K6K1OnKJ8K8K2Qpj6j8j1%Lpk0k4
9229A51j6kJ3J9J7J1OJqj9k9k9j8%J8K5K2J2LJJLMMjorqokKNMNRJ5J7Qlj1j1j0rj0qmjKKK
9209A62lj1j5j2l%%KJ0J6J2Mj%JLPO%qp%MNPJ4J3Koooj2k1k2j2jJ%oj2j7j9j8j8k0j9j1RL0
9189B2M5M4L4K6J9J1jpmjnj4j7j1olmmoqmKOjpj0qj1j9k5k4j4mNQRJ3J7J8J4J3J9K9L2J9m
9171A83k7l4k2%J5J8J4J1Olj9k7j9kJ5K4K2J1jmLJ0Rkj1j3j4k0k7k9k2j0k%jmmkJMJkJJ1K4
$$ y = [157, 160, 174, 192, 206, 216, 227, 242, 255, 259, 257, 251, 239, 217, 186, 149, 116, 97, 96, 105, 108, 96, 76, 60, 56, 61, 72, 87, 98, 96, 82, 64, 52, 52, 63, 80, 96, 106, 112, 118, 121, 116, 101, 83, 70, 69, 81, 108, 143, 176, 195, 199, 194, 183, 170, 157, 147, 142, 145, 155, 167, 172, 165, 151, 139, 134, 137, 140, 141, 140, 149, 173, 205, 223, 217, 197, 179, 168, 154, 132, 106, 83, 64, 53, 52, 59, 65, 63, 50, 31, 13, 1, -1, 8, 34, 72, 112, 139, 147, 143, 143, 156, 176, 194, 205, 206, 195, 175, 152, 133, 125, 128, 138, 143, 135, 119, 109, 117, 135, 146, 141, 120, 90, 60, 38, 34, 44, 59, 69, 75, 85, 108, 140, 174, 199, 212, 211, 202, 191, 185, 184, 180, 168, 154, 143, 128, 99, 65, 48, 56, 79, 102, 125, 151, 172, 178, 173, 175, 193, 221, 243, 251, 244, 228, 210, 199, 199, 202, 195, 175, 151, 135, 133, 146, 165, 182, 193, 199, 200, 192, 173, 144, 115, 97, 97, 115, 140, 162, 174, 177, 178, 179, 182, 186, 190, 189, 183, 174, 166, 160, 158, 160, 165, 169, 174, 183, 198, 215, 223, 220, 209, 198, 188, 179, 169, 161, 157, 156, 158, 160, 162, 159, 148, 133, 121, 118, 118, 118, 120, 130, 146, 158, 162, 161, 161, 162, 165, 172, 178, 178, 170, 163, 163, 167, 172, 179, 193, 206, 208, 202, 196, 190, 178, 157, 135, 123, 122, 123, 123, 117, 105, 88, 69, 51, 33, 13, -6, -17, -8, 22, 67, 111, 145, 171, 190, 201, 200, 193, 189, 188, 183, 169, 152, 141, 135, 132, 128, 124, 118, 110, 106, 108, 114, 113, 106, 96, 88, 77, 58, 33, 9, -5, -9, -4, 4, 13, 26, 43, 61, 75, 88, 107, 136, 168, 187, 183, 156, 122, 100, 100, 115, 133, 147, 158, 164, 161, 142, 115, 96, 94, 109, 133, 155, 166, 165, 161, 164, 174, 183, 181, 170, 157, 143, 123, 96, 67, 45, 35, 33, 33, 32, 28, 24, 22, 23, 27, 28, 26, 27, 38, 62]
9152F2L2L1J8Jj3j2jQOnj7k1j9j2JJ6K7K7J9RJkKPROKjjKL%rj7j7j0%NLkj3k2k5j6nMQQPN
9132H9MORRONLLLLPQLnrn%LMNRJ1J1Nnj8l0k8j0J4K8K0Kj3j9k0j5lQJ3PKLQJ0J0PLj%PJ5J7
9111A99J2QM%qrjQJ1Jrj2o%MOOJpj3j0%RJ1N%jlrj3j7j8j7j2MK4L8L8K5Qpk3l5l7k9j4qrj3
9091H2j2pl%Jkoq%QJ0MjJJ4K5L0K3Lj5j7lJ0QlnPJ6J1oj9k0j2prj0rpqrkLJnq%OOQJ4K1K1
9071A20J2PMkj2k1j9j0NJ5J5Kj6k3j4jRJ4J7J5QOJ6L1L7K4kk5l6l3k3j4rj0qo%PJ1J0NLM%
9053A13rj6j3n%Jjjoj6k4k1j1kNMjnmMJ1K0K6L0K4Rpj0jJ0J5J4J1Lj2k8l4l1k2j0MJ8K9L1
9035I2K7K0J2Mknnpj1j7k0j9j0PK2K7K0Qlj1j3j0pmkKQRJj1j7j3olpj4k1k0rMJ5K3K4K0J5
9017I3J1J6K3K8K7K5K1J4MookMNLJmqj4j8j8j2lMKlnlmnqomljJjnm%kj2k5k7j8pKJ2J9K0J3
$$ y = [62, 94, 125, 143, 144, 131, 119, 118, 126, 132, 127, 110, 89, 70, 58, 59, 75, 102, 129, 148, 157, 158, 156, 158, 165, 174, 180, 182, 181, 180, 182, 185, 185, 176, 159, 142, 132, 132, 137, 140, 138, 125, 103, 78, 62, 57, 61, 69, 77, 84, 89, 93, 99, 108, 117, 123, 128, 131, 134, 137, 140, 147, 155, 158, 153, 144, 139, 139, 142, 146, 151, 160, 171, 182, 187, 182, 164, 134, 106, 96, 110, 138, 158, 160, 147, 128, 108, 93, 90, 98, 111, 118, 120, 123, 131, 141, 151, 158, 161, 160, 160, 167, 182, 199, 211, 219, 223, 223, 215, 206, 205, 213, 224, 225, 216, 204, 198, 198, 202, 208, 214, 215, 208, 195, 185, 185, 194, 205, 210, 210, 209, 206, 197, 184, 167, 149, 132, 120, 124, 148, 186, 224, 249, 257, 250, 227, 192, 155, 126, 112, 104, 95, 82, 70, 63, 60, 60, 61, 59, 53, 45, 45, 53, 63, 67, 66, 67, 81, 106, 136, 159, 162, 147, 130, 127, 137, 145, 142, 137, 144, 160, 171, 165, 146, 126, 114, 107, 98, 88, 79, 72, 64, 55, 53, 56, 57, 52, 44, 44, 50, 56, 64, 78, 99, 120, 132, 139, 143, 141, 129, 108, 89, 79, 84, 99, 114, 116, 100, 77, 63, 62, 71, 85, 102, 117, 125, 131, 147, 178, 215, 239, 237, 212, 176, 143, 120, 106, 97, 87, 79, 73, 73, 80, 91, 101, 106, 109, 113, 113, 104, 88, 75, 70, 70, 71, 70, 69, 63, 47, 23, 2, -9, -11, -6, -2, -3, -8, -12, -8, 3, 23, 49, 79, 103, 112, 105, 95, 94, 104, 119, 133, 144, 147, 135, 107, 73, 42, 20, 10, 14, 32, 61, 92, 119, 139, 151, 155, 153, 148, 143, 136, 125, 108, 88, 69, 59, 66, 88, 115, 135, 143, 140, 129, 116, 106, 99, 95, 93, 95, 103, 112, 113, 102, 85, 72, 66, 63, 56, 42, 21, 1, -8, -4, 11, 34, 58, 78, 93, 104, 120, 143, 171, 198, 223, 244, 258, 262, 256, 250, 248, 252, 257, 260, 261, 257, 249, 235, 217, 199, 187, 184, 188, 190, 187, 182, 179, 175, 170, 162, 156, 152, 149, 148, 149, 148, 143, 139, 139, 137, 125, 100, 73, 55, 48, 50, 62, 81, 101, 114]
8997A14Mkrk2l9m6l5j2J3K6K4J7J4J8K5K3J2jqKJ7K7K1Lqq%PRjj9l3l3k1n%J%MPQJ0J2J5K0
8979A51K7K6J8J2J1Plj7k5k5k6l0l1k5j2jJ0J6J8J2M%mj1j3q%J2K2L0K8J4jpnkmoqj0j2j1
8962A21rj1k2l2k9qJ8L3L3K6K3K1J7J3J4J9J9Qmrrj2j3nNPJjOJ5J5Okj2k2l0l1k6k1j2mNJ1
8944A12J8K2J8Pmol%MJ0J2Lj0j6j3j0j0j1pLJ2J6J1JomJmj4j7rPJ2Plp%OP%j1j7j7j6j2mP
8926F5J4K0K7L0K4J1kqj0j4j3oOQkj5k0j8j3j2j2qjMMJMJ3K2K7K6K4K0K1K4K7K2Nj7l0k9k0
8909A99j3j2j6j9j5lQJ5J5J3RKqj5j3pLNkj4k5k3j5rj2j9k1k1j6lJ3K5K7J7OMOJ2J4J0Jj2
8892I1k2k7k3j2%OOQJ4K5L1K8J9Nrj6j7j1nnqpJJ2J8J5Pjnrj2j3pNJ9K8L0K2J2L%lllmj0j9
8873A54k4k0j3pnnkNJ6K6K8J3j3l2l7l0j8qljJMNKmnNJ6J9J2%qrrqj0pkOJ1J1MkkLRJ4J6J6
$$ y = [114, 118, 116, 107, 85, 46, 0, -35, -47, -34, -8, 16, 33, 47, 65, 90, 113, 125, 124, 116, 118, 135, 162, 183, 186, 178, 170, 170, 177, 186, 185, 166, 133, 100, 79, 74, 74, 75, 75, 79, 86, 94, 104, 116, 131, 151, 178, 204, 222, 234, 245, 252, 249, 232, 207, 182, 156, 126, 95, 70, 58, 57, 67, 83, 101, 113, 117, 117, 113, 102, 89, 81, 81, 93, 115, 145, 173, 187, 186, 179, 174, 172, 168, 162, 154, 144, 132, 121, 112, 101, 79, 47, 18, 10, 28, 61, 94, 120, 143, 164, 181, 194, 208, 227, 246, 254, 250, 241, 232, 220, 207, 202, 207, 214, 215, 214, 220, 235, 250, 256, 254, 242, 220, 190, 159, 133, 112, 100, 96, 101, 112, 130, 152, 170, 177, 173, 167, 164, 164, 168, 178, 190, 193, 183, 167, 154, 144, 134, 123, 116, 119, 131, 147, 158, 159, 153, 149, 150, 146, 132, 115, 106, 113, 125, 132, 129, 122, 122, 128, 135, 135, 124, 107, 90, 74, 62, 58, 65, 79, 99, 126, 156, 180, 191, 189, 181, 171, 157, 144, 138, 144, 152, 150, 135, 115, 97, 84, 72, 60, 52, 51, 55, 59, 60, 64, 77, 99, 126, 152, 176, 196, 217, 241, 268, 290, 295, 278, 248, 219, 199, 186, 174, 158, 139, 124, 121, 129, 144, 159, 172, 181, 183, 175, 160, 147, 140, 143, 148, 146, 132, 107, 84, 69, 60, 48, 29, 8, -13, -29, -32, -19, 6, 33, 50, 56, 60, 66, 78, 92, 102, 103, 91, 69, 42, 19, 7, 7, 13, 19, 27, 41, 66, 97, 125, 144, 149, 140, 124, 107, 96, 91, 86, 78, 71, 72, 84, 102, 117, 124, 123, 118, 109, 97, 84, 77, 82, 101, 129, 159, 181, 193, 196, 196, 193, 190, 187, 183, 173, 154, 130, 110, 97, 90, 85, 80, 78, 83, 99, 125, 153, 166, 153, 121, 84, 54, 36, 28, 25, 24, 25, 29, 34, 36, 32, 27, 32, 48, 67, 79, 79, 71, 62, 53, 45, 35, 28, 26, 32, 43, 54, 58, 56, 54, 57, 66, 80, 96, 112]
8853A12J1%omNJ5J7J1OPJ3J0lk2l4l2k4j7j2rqqmLNjprLJ8K7K4Oj3k1j3KJ4J9K2K5K2J1%m
8835A57k%NQQO%oj7k8l3k7j7j2oJ1L0L5J8ok2l0l1k0%J6J4Jpmkpj4j0OJ8K3J9J5J0QONPRJ1
8817A45QLmpjJ0K0K1J3L%LQJ2J3Pnj6j7j1poqqpmjLJqj8k2j9j2lMQQQQLmrj2j5k5l6l8k8j0
8797e2PJ8K1J1jmMJ7K6K6K2J6Rjqj1j3j3j5j7k3k4k1j1jK%LJ4K7L7L1J9J2J0Plj4k2k2j7k
8780D4J5K7K7J7P%kmmj%J%jJLKlj4k2k4k2j1LJ6J9J1lj6k1k1j3JJ6K2K3J8J6J9K4K2J3mj6
8762A65j4m%oj3j1jRJ8K3K5K4K3K2J9J3OJj0k3l1k0lMql0m4m3k9j5nJKMMKPK0L4L6J9mj9k1
8745A27j4nLJ1J0Moj0mRJ5Rlj0j3j6k2j9lJ8K8J9NproLJ5J7Mj7l0k6j1jLLPRMnqlNQRQQQJ0
8724A31J1RJqj0n%lj2k1j7mJ2J9J3Krj9k6k3j4m%mopolKNRJ1J6K1K0J3Lmj2j0OK8L4J6j0j9
$$ y = [112, 123, 123, 117, 113, 118, 133, 150, 161, 167, 174, 187, 197, 194, 172, 138, 106, 82, 65, 53, 44, 36, 28, 24, 27, 32, 31, 24, 15, 18, 36, 63, 87, 93, 80, 59, 46, 48, 62, 81, 103, 128, 150, 161, 161, 157, 155, 155, 160, 168, 176, 182, 182, 176, 159, 131, 98, 71, 54, 42, 36, 47, 77, 112, 130, 124, 102, 72, 41, 21, 21, 37, 51, 52, 45, 41, 39, 32, 18, 8, 14, 32, 55, 74, 89, 99, 107, 113, 118, 125, 134, 145, 153, 156, 152, 145, 144, 154, 174, 195, 208, 211, 211, 214, 222, 234, 247, 254, 249, 233, 216, 205, 198, 192, 184, 176, 169, 165, 164, 167, 168, 160, 142, 120, 101, 89, 86, 90, 98, 106, 114, 122, 125, 121, 112, 100, 85, 60, 24, -14, -42, -52, -45, -27, -6, 5, 4, 0, 4, 21, 47, 73, 95, 111, 120, 119, 111, 100, 87, 74, 59, 42, 19, -5, -26, -37, -38, -36, -36, -33, -19, 8, 45, 76, 95, 107, 117, 124, 121, 107, 85, 63, 46, 44, 59, 86, 113, 130, 137, 137, 135, 131, 127, 126, 126, 127, 127, 126, 127, 130, 132, 129, 115, 93, 69, 47, 36, 39, 55, 74, 85, 82, 66, 45, 24, 11, 12, 28, 50, 73, 91, 107, 126, 150, 172, 185, 181, 165, 151, 147, 147, 141, 128, 117, 116, 125, 143, 166, 191, 215, 238, 260, 279, 292, 298, 299, 289, 266, 235, 215, 212, 216, 208, 178, 134, 91, 62, 47, 42, 43, 45, 49, 53, 55, 62, 82, 116, 152, 171, 167, 148, 127, 113, 108, 111, 122, 132, 136, 130, 120, 116, 125, 140, 149, 146, 136, 123, 107, 85, 66, 63, 81, 109, 128, 133, 126, 117, 111, 114, 129, 146, 150, 133, 103, 77, 66, 65, 68, 71, 78, 87, 91, 86, 78, 75, 80, 88, 97, 105, 113, 121, 131, 142, 151, 152, 144, 134, 129, 129, 126, 114, 93, 76, 72, 84, 103, 116, 118, 109, 90, 64, 41, 27, 23, 23, 19, 13, 6, 0, -3, -1, 4, 13, 24, 40, 61, 81, 94, 97, 93, 81, 71, 77, 105, 139, 155, 145, 126]
8706A26pJ0J9K0J6J6J5J4Mj7l6m0k6kJ2J5OjjRJ9J8J3RQMqj8j5kRJ1Nnj5k0k3k1j7j1o%MO
8688I7Ojj0j0KJ6K0J3%j0j6j6qNJ5J2kj3j5nORLJMQPNQJ7K4K1J0mj1j2oKOjj8l6m3l5j6RK8
8669F6L9L8K6J1LMMjrj2qmlqj9k7k8k2j1mJPJ7K4L0L1K9J8KrrmLNRRNpj8k5k2j5nMLjmJJ3
8650A27K0J4nk8m0l4j9qm%ORJ0J3K2K7K4J4PQQKj1k3k8k2nJ1J8J1mj6k2k2j5nRJ8K5K8K9K5
8633A74J5QNPNlj0j4j5j6j2mOJ0OMPRMpj3j2rprj1rkNJ1J7J7J2jj9k8k5oJ3K3J9QJlqj6k4
8614A03k1j2m%NJ3K2K2J1kj0rlMJ0J6J6J4Nnj6j9j8j3j2j7k6k6j4NJ8K4K5K3J3mk1k4j4l%
8598E6KRK0J9Qoj4j5rjONlj3j2JJ9L0L2K8J9Pqj9k2j5oJ%mmNJ2Qj0k2k3j3oplLPMjMJ6K6K8
8578A39K0RklMJ3J7J8J9K1K0J2Jj1j9k4k3j6mOJ0Nrk1k4j7rmjMJ1J7J9J3Lqj2nPJ2Mrk3l0
$$ y = [126, 119, 129, 148, 168, 184, 200, 215, 229, 233, 216, 180, 140, 114, 112, 124, 139, 145, 144, 143, 152, 171, 189, 202, 211, 219, 223, 215, 197, 182, 180, 189, 200, 205, 200, 185, 165, 142, 121, 104, 93, 87, 87, 91, 97, 103, 102, 92, 82, 84, 100, 120, 133, 133, 123, 107, 91, 83, 88, 103, 115, 113, 100, 85, 80, 86, 95, 98, 99, 103, 111, 118, 123, 131, 148, 172, 193, 203, 199, 188, 176, 170, 172, 178, 177, 159, 123, 80, 45, 29, 38, 66, 105, 143, 169, 180, 183, 187, 191, 190, 181, 169, 161, 157, 154, 146, 127, 100, 72, 50, 39, 35, 36, 43, 60, 84, 114, 145, 174, 192, 194, 185, 176, 172, 175, 180, 189, 198, 203, 196, 178, 153, 131, 116, 111, 115, 118, 117, 113, 114, 127, 147, 161, 156, 128, 88, 54, 35, 27, 23, 23, 29, 38, 48, 61, 83, 110, 134, 148, 155, 163, 171, 173, 162, 139, 111, 89, 84, 95, 113, 124, 120, 104, 82, 60, 45, 40, 49, 67, 92, 120, 149, 174, 189, 197, 202, 209, 214, 211, 201, 187, 172, 156, 144, 140, 146, 156, 162, 166, 173, 182, 186, 179, 166, 154, 145, 138, 129, 118, 109, 107, 112, 123, 140, 157, 169, 168, 149, 121, 96, 90, 103, 126, 145, 153, 154, 151, 143, 127, 103, 82, 70, 66, 66, 71, 84, 106, 128, 139, 137, 127, 118, 115, 119, 129, 145, 161, 175, 180, 175, 159, 140, 122, 109, 97, 80, 54, 28, 14, 19, 37, 61, 86, 109, 122, 118, 97, 73, 59, 56, 56, 58, 67, 87, 106, 114, 108, 94, 79, 70, 69, 75, 80, 77, 64, 52, 53, 72, 102, 134, 162, 181, 188, 180, 161, 139, 124, 118, 119, 119, 115, 111, 116, 128, 136, 126, 104, 81, 68, 62, 55, 52, 55, 62, 66, 65, 69, 85, 111, 139, 159, 168, 166, 163, 167, 180, 197, 215, 234, 255, 275, 287, 288, 277, 258, 234, 211, 195, 191, 197, 207, 212, 203, 182, 158, 141, 132, 128, 127, 131, 142, 159, 178, 191, 194, 186, 174, 169, 176, 188, 192, 183, 160, 130]
8560A30l4l5l1j9oMPQJ5K4K8K2J3Ojqj1JJ8K4J1j1k3k6k7k5j7mNM%%NQJ2J9K7L0K9K1J1lj6
8543A85k4k3j6lJ4K7L2K7J9Pok2l4l4k4j0LJ2J7J7J4J1J1J1J0Loj3j5qJJ3J7J6Pmj0j6k1k6
8527A59k9k5j5oJNNOPQLpj6k0j4oJQJ2J1MKOJ3J1KppKJ1J1J0J1J8K1J4lk3l3l3k5j7roorj0
8508C6mLJj0j7j0MJ6J7J6J9J7J0LMJ0QjmJMkj3k0k2j9j1JJ3K0J9J6J1MklOJ3J4Opj6j4lJ0
8490A24K0K2J6Q%%JMJj%Klj8l5m1l2j5KQNmj5j9j3NK1K5J7LmkQJ6J4%j3j7j0oj1j9k0j5j3
8472dj4j2jJ2K0K1J0lj0pkmrj4kJ6K9K8J4mpQK4L0K1J0RJ4J6J3J0Moj8k6k9k6j7nQJ3QJl%
8454A16OPNjnqmJRJ3Rjj0j0jRNqj7j2MK0K6K1J1lj0q%Kmj2j5j6j3qmlpqpljjlpqmPJ5Qoj2
8432E4okpj7j5%K0L2L1J9MonKO%j1j3pKPJ0J7K6K6J5Jpj3k2l2l0j6%NJprmPJ7K0K1K4K6J9
$$ y = [130, 96, 61, 30, 11, 5, 9, 16, 24, 39, 63, 91, 113, 126, 132, 131, 123, 112, 113, 131, 155, 166, 155, 132, 106, 79, 54, 37, 33, 38, 42, 42, 42, 47, 55, 67, 86, 113, 143, 172, 193, 204, 201, 185, 161, 138, 122, 119, 133, 160, 192, 219, 238, 245, 239, 217, 183, 149, 125, 115, 118, 130, 147, 164, 178, 189, 200, 211, 221, 224, 218, 205, 190, 182, 183, 196, 213, 229, 236, 232, 222, 206, 185, 159, 130, 105, 90, 84, 85, 90, 95, 101, 108, 116, 119, 112, 96, 76, 62, 56, 57, 65, 77, 88, 92, 94, 100, 113, 124, 126, 119, 112, 114, 125, 136, 146, 157, 175, 196, 210, 207, 184, 151, 118, 93, 76, 67, 61, 55, 46, 36, 32, 35, 36, 26, 9, -1, 3, 19, 36, 52, 71, 88, 98, 101, 105, 115, 123, 122, 118, 119, 123, 121, 108, 88, 66, 47, 36, 37, 50, 70, 89, 105, 116, 120, 118, 115, 121, 134, 148, 154, 147, 131, 117, 114, 124, 144, 166, 182, 190, 190, 190, 191, 195, 196, 195, 195, 197, 194, 176, 141, 100, 68, 53, 55, 63, 68, 64, 49, 30, 17, 22, 43, 68, 85, 88, 84, 82, 90, 106, 120, 120, 107, 90, 80, 74, 63, 44, 24, 9, -4, -18, -30, -31, -19, 1, 22, 32, 29, 19, 12, 10, 6, -3, -17, -19, -3, 26, 54, 68, 64, 57, 65, 89, 119, 140, 150, 159, 173, 189, 202, 212, 216, 210, 192, 166, 137, 111, 94, 89, 97, 110, 118, 119, 116, 116, 122, 129, 134, 133, 128, 120, 116, 117, 126, 139, 148, 147, 137, 127, 126, 135, 140, 132, 115, 103, 107, 127, 153, 174, 185, 182, 172, 164, 164, 166, 162, 150, 135, 119, 106, 98, 94, 91, 84, 76, 69, 66, 65, 64, 61, 54, 46, 42, 49, 64, 72, 66, 54, 48, 46, 39, 22, 7, 7, 27, 59, 90, 109, 113, 107, 102, 104, 110, 110, 99, 86, 79, 81, 88, 98, 115, 141, 167, 182, 183, 176, 163, 141, 109, 79, 63, 63, 68, 69, 62, 53, 49, 56, 73, 93, 114, 138, 164, 183]
8414A83Jj5k2k4k5k2qQJ6J7J1Nnj3j4nPJ3J5J0Kpqmmqj8k5k2j3LJ0Q%%NRQJ1J6J6J2RJ7K9
8396A79L2K6J7Nrk3k7j9nNLnj3j5j4j4j5j6j2pmj%K%kl%%jLNMjkJNNNPOjj0j1qopomjK%mq
8374C8j0rnopom%KPJ7K8L2K2Qkqj0qpj1j8k4k3j5%J5K4K8K3J9J1%j3k3k2j5j2j6j9j4jJ2K2
8357@K0J4MkmkMJ1J9K1J4RJ1J6J2%j3k2k3j8qOJ3J4J5J7K0K0J7J6J3NlqojJoj8k7l0k8k8k8
8339C7k3j2llqp%QJ7K9L6L4K2J4J6J8J2kj0j0pkLOKrj3oQJ7J3%j0j3j5j4j1m%koolMRJ0QK
8320A26pj6j9j0NJ2NmkJ0J9K3K2K0K0J7J2Noj7k2j6%J7K7K5J6Kj0j9k3k4k0j4rpqj3j9j9j0
8303F9KJ0J2J6K3K6K0J0KllJNJ0QM%koj4k4k9k5qJ4K4J8Kj2k1k3k2j5rj1j9k6k7k4j1OK4K8
8286@K2J8J9K1J7Q%llLJ2J8J5PLJlj0j5j1%PNlj0j0nLJ0J1Mnj3j0m%mj0j1mNJ6K1J4Kqqkm
$$ y = [183, 184, 169, 147, 123, 98, 76, 68, 76, 92, 109, 120, 125, 120, 107, 93, 88, 95, 108, 123, 133, 135, 128, 120, 116, 112, 104, 86, 61, 39, 26, 29, 39, 47, 47, 47, 52, 61, 69, 80, 96, 112, 124, 133, 150, 179, 211, 237, 254, 259, 250, 227, 200, 181, 176, 181, 184, 179, 166, 151, 137, 123, 108, 92, 80, 73, 69, 68, 68, 70, 70, 68, 65, 65, 65, 64, 67, 72, 76, 75, 73, 74, 79, 84, 89, 96, 102, 101, 91, 80, 72, 66, 59, 53, 49, 48, 50, 50, 46, 38, 28, 19, 14, 8, 1, -5, -9, -9, -7, 0, 17, 45, 77, 99, 107, 105, 97, 87, 79, 72, 61, 43, 19, -4, -19, -19, -4, 20, 48, 71, 90, 101, 101, 88, 65, 43, 28, 16, 0, -19, -33, -34, -22, 0, 20, 34, 38, 36, 32, 30, 34, 45, 64, 85, 99, 108, 119, 135, 147, 147, 134, 112, 89, 71, 63, 69, 82, 96, 111, 128, 148, 168, 185, 201, 214, 219, 216, 208, 202, 201, 202, 196, 178, 151, 121, 93, 65, 37, 14, 2, -1, -4, -12, -19, -19, -11, 6, 35, 71, 105, 127, 141, 157, 175, 187, 185, 175, 165, 158, 156, 159, 165, 167, 158, 145, 139, 147, 164, 177, 177, 167, 154, 139, 125, 114, 110, 110, 108, 102, 96, 93, 97, 106, 116, 124, 126, 119, 103, 84, 74, 79, 91, 96, 92, 90, 100, 119, 142, 164, 184, 204, 221, 233, 238, 232, 215, 193, 177, 177, 194, 221, 246, 262, 264, 254, 235, 212, 188, 168, 154, 145, 138, 130, 117, 98, 79, 69, 71, 81, 93, 109, 132, 158, 178, 188, 190, 187, 184, 185, 190, 200, 208, 212, 212, 210, 204, 190, 166, 137, 112, 104, 118, 142, 160, 162, 150, 129, 106, 84, 69, 60, 49, 30, 4, -23, -47, -58, -52, -28, 0, 22, 40, 59, 80, 97, 105, 105, 102, 99, 102, 114, 132, 147, 154, 157, 158, 155, 145, 130, 119, 119, 126, 131, 128, 118, 108, 103, 106, 116, 127, 131, 126, 113, 103, 99, 99, 95, 85, 74, 70, 75, 91, 112, 126, 128, 120, 112, 110, 106]
8266A06j3k4k4j6pqj7l1l7l2j9lJ4K6K7J8NKMMlpnJMQJ0J3J3J1Okrj0ooj1j8j6pmj3k1j7J
8248a13K0L3M1M0L3J9OKKnj4j5mQQnj8k4k1j3nKNQJ6K7L0K6J8J5Rjj5k0j1MJ1OlqjQJ1RMJ
8230A26jlrj5j6rLRMpj0nnj3k0j0J1L1L6L4K8K3J4O%j1k3k9k5j7j1rpmjKPJ1Poj6j8rKOJr
8211D3j2oMJ3J8K0K3J9Oj0j7j1NJ2Poj2oRK3K7K4J2jj5k1j9j3qnlmoj1j6j9j9j4rnrj0pjQ
8193b2J8K6L2L1K3J3NJNPLlj0j1j1j1j0lJLJ%MJ2J7J0nj9k0rOJ4J6J0%p%J4K0Oj4k4j9j3p
8175H0kPJ7J9J5Lj4k9k8j3PJ8J7Ooj0mNMln%NOMMNOJ1K0K0Oj4k3k1j8j7j6j2j1j5j1JJ4K3
8157E1K8K9K1J0MQJ4Ppj7k0k8l6l5k0jJ4K5L5L9L1J5K%NJ0PKmoKJ3K0J3kj6k4k2j8j5j2oM
8139A20QOMNJ3J5QKKMkj8l0k7j7pLJ8L0L2K5J8J8J6Nnpllrj5j8j8j7j4rpj8l3m2l8k9j5jQ
$$ y = [106, 93, 69, 45, 29, 22, 14, -3, -34, -71, -103, -122, -125, -111, -85, -58, -40, -35, -33, -29, -25, -28, -35, -40, -39, -35, -27, -17, -4, 9, 20, 26, 24, 15, 5, -1, -7, -18, -36, -52, -59, -63, -76, -97, -114, -113, -93, -60, -19, 21, 54, 73, 79, 81, 83, 78, 64, 49, 45, 53, 61, 56, 38, 14, -7, -20, -25, -23, -18, -10, 6, 33, 63, 89, 107, 122, 131, 130, 115, 95, 84, 88, 99, 105, 102, 94, 93, 101, 112, 121, 125, 126, 125, 122, 113, 98, 82, 73, 76, 85, 89, 82, 72, 67, 62, 49, 29, 19, 30, 61, 97, 131, 159, 182, 196, 202, 202, 191, 168, 139, 114, 97, 86, 77, 70, 66, 65, 67, 74, 85, 92, 86, 70, 52, 43, 45, 51, 52, 43, 31, 25, 29, 42, 60, 80, 103, 122, 128, 118, 101, 90, 95, 107, 114, 108, 96, 90, 99, 122, 149, 173, 185, 184, 169, 148, 129, 116, 108, 103, 100, 96, 90, 79, 63, 44, 25, 11, 2, -3, -12, -22, -29, -30, -22, -4, 22, 54, 85, 108, 121, 126, 127, 132, 139, 142, 139, 129, 118, 107, 96, 86, 83, 84, 87, 88, 88, 92, 104, 121, 131, 126, 107, 87, 78, 84, 98, 114, 124, 124, 117, 117, 131, 151, 157, 143, 119, 100, 87, 80, 78, 85, 102, 121, 136, 139, 125, 96, 68, 55, 62, 80, 97, 103, 97, 87, 83, 88, 92, 89, 84, 84, 89, 95, 99, 103, 108, 114, 125, 145, 165, 171, 157, 134, 113, 95, 78, 62, 50, 39, 24, 13, 14, 28, 51, 79, 108, 129, 139, 143, 151, 165, 172, 165, 148, 128, 100, 64, 29, 9, 8, 22, 47, 82, 121, 152, 167, 169, 169, 174, 184, 191, 193, 189, 183, 185, 198, 218, 231, 229, 213, 189, 167, 149, 134, 122, 116, 120, 128, 134, 138, 143, 156, 171, 179, 181, 183, 187, 185, 167, 137, 110, 93, 86, 89, 107, 137, 169, 194, 212, 230, 246, 251, 246, 239, 236, 233, 224, 209, 191, 173, 156, 142, 133, 126, 108, 75, 33, -5, -34, -49, -50, -42]
8121d2PKlonn%J2K6L1K8J9J0Koj2j1lQK1L1L9M3M3M0L8L2J7mj9k5k4k2k0j3o%L%mnJPOkpm
8102B18MMnj1pjmj4j9j8j4j3pKNjrj4j6k0k3j8qMJ4K4L3L5K8K2K1K3K2J2%j2k1k2j7qpppl
8085A45loojJnj2j1lRJ6J9J5J1QMkj0j6j1jPQJ0J5J5Pqj5j5j0pnJQRlj7k3j4PK4K9J8Kj0j3
8066A61qoomllqj2j3qmkKJ2K0K1J4JnpkMJ1J6J9J6J1PMLmj9l3l6k8j3%J1J3J1Joqqj3j5pJ0
8047H7K3K7K3J6Qkj0j2j2pLJ6K5J7ok6l7m1m3m3l8k7rJ3K9L6L7L4L1K6J7Pkqqnjlj0j8j9j4
8030G4pLJ2J2LqqLOmj6j4KJ4J4OOJ8L1L1J5mj6j0MJ7J8Ppj7k0j6j1qqj2j6j4lJ6L3L8K8J6
8012B08PLrk5l0j7NJ9J7R%pj0o%Kkrrpj0j7k2j9j1%QJ3J5J1OOQJ0QQRMok2l2l0k4j9k0j6j1
7993a4nmnlPJ7J8J2MMPJ0J4J7J8J2KljRJ9K8L2K6J8PLJmojJ0J8J4Kqj2j0j1j5k3k6k4j6j3
$$ y = [-42, -35, -33, -36, -42, -47, -52, -52, -40, -14, 17, 45, 64, 74, 76, 70, 58, 47, 44, 52, 73, 104, 143, 186, 229, 269, 307, 339, 356, 352, 333, 308, 284, 262, 242, 229, 223, 223, 226, 226, 222, 217, 218, 225, 231, 229, 222, 218, 222, 226, 221, 210, 203, 202, 198, 184, 165, 147, 133, 120, 113, 115, 120, 119, 110, 96, 80, 60, 37, 19, 11, 15, 29, 53, 86, 121, 149, 171, 192, 215, 237, 249, 249, 237, 216, 194, 177, 169, 162, 155, 148, 145, 142, 136, 130, 129, 130, 125, 113, 102, 99, 108, 124, 143, 158, 169, 177, 181, 179, 169, 153, 142, 141, 148, 156, 166, 181, 196, 203, 195, 180, 165, 155, 148, 143, 144, 152, 161, 158, 141, 118, 104, 111, 135, 164, 182, 184, 174, 161, 153, 147, 141, 137, 134, 131, 123, 111, 98, 90, 86, 84, 86, 98, 118, 139, 153, 154, 149, 142, 140, 144, 155, 171, 190, 206, 217, 224, 228, 231, 227, 208, 175, 139, 111, 98, 98, 109, 122, 133, 134, 128, 120, 112, 99, 84, 77, 87, 110, 137, 160, 176, 184, 182, 172, 160, 148, 141, 144, 160, 185, 202, 196, 170, 133, 92, 49, 6, -32, -59, -68, -55, -26, 10, 47, 81, 112, 138, 155, 162, 160, 152, 144, 139, 138, 135, 125, 107, 88, 74, 67, 70, 82, 94, 97, 89, 81, 84, 90, 86, 70, 56, 58, 72, 86, 92, 98, 116, 147, 178, 193, 189, 173, 163, 167, 184, 202, 209, 202, 185, 165, 149, 138, 130, 122, 110, 94, 80, 77, 93, 126, 164, 192, 208, 215, 218, 209, 184, 154, 137, 142, 161, 178, 187, 187, 180, 170, 164, 164, 166, 164, 155, 146, 139, 129, 112, 90, 71, 60, 60, 68, 81, 96, 107, 113, 119, 127, 137, 145, 153, 162, 166, 160, 138, 106, 76, 52, 33, 13, -3, -14, -19, -23, -28, -31, -24, -7, 11, 23, 27, 31, 38, 48, 62, 79, 97, 109, 111, 108, 107, 116, 135, 163, 195, 221, 239, 246, 249, 250, 246, 240, 239, 249, 267, 281, 283, 275, 263, 253, 242, 227, 204, 178, 154, 138, 125]
7975A25j9k6k9k1j1jOJ1J5J7J6J4J3J7K0J7Noj1j1nLJ1J2Mj1k0k1j6j1o%MOPRJ1J2RKj1k2
7958A08k6k0j3mQJ9K3J3LNJ5K0J1lnjLL%ok0l2l0qK2L8L6K5J4Olm%MONORQNLJlqj1j4j8k4
7939A66j9jJ6K1J3PORPLnj3j4qloj4j7rNJ2J1mk2l4l3j9JJ3J5J3J0RJ0J0PKmj6k6k8j0K2N0
7921A33N4L9J2j0k1k4k0j3mNP%j1j5j0pj0j6j5lQQjj0j0jRJ1PjorqmMJ1R%n%QJ3J5J4J1Jp
7902A38qjQJ5J7J0rl0l8k9j3mmkPJ6J7J1QJ2J3Mpj3o%%pj2j5j4j3mJ0K3L0L0K2J0mqJJ3J6
7885A90Poj7k5k9k7j9pNJ0RNJKPRMlpj2j7j8j4mNJ1J5K0K5K5K3J7Qjorj3j5j5qNJ5K0J5No
7866A80j3j2j1j0j1pMJ0Ork3k7j9pJMKJJMRJ2J4J5J3J0Lpj2r%J2K0J9J6J4J6J8J7J6J5Oqk1
7849B52k3j3m%MPQPLLPQLnj3j5j6k0k4k6k2j5j1rnLQNlj1j2rkNNok2l6l7l0j1NJ4J3RJ0J4
$$ y = [125, 106, 80, 51, 30, 19, 18, 24, 35, 50, 67, 83, 97, 110, 127, 147, 164, 169, 163, 152, 141, 136, 139, 150, 162, 166, 155, 135, 114, 98, 87, 81, 81, 85, 91, 98, 107, 118, 130, 139, 141, 130, 108, 82, 62, 49, 45, 53, 72, 95, 108, 111, 116, 131, 151, 162, 159, 154, 153, 156, 159, 159, 153, 133, 101, 71, 63, 85, 123, 159, 184, 198, 204, 201, 197, 197, 201, 207, 212, 218, 227, 235, 240, 243, 244, 241, 233, 222, 208, 190, 166, 147, 146, 162, 183, 196, 203, 209, 218, 225, 228, 223, 210, 196, 188, 185, 179, 165, 148, 139, 144, 156, 167, 163, 141, 107, 74, 55, 56, 69, 84, 97, 107, 116, 126, 136, 143, 145, 141, 125, 99, 71, 61, 83, 133, 187, 226, 238, 228, 207, 183, 163, 150, 146, 151, 158, 158, 147, 132, 122, 115, 105, 89, 74, 71, 79, 87, 86, 76, 66, 65, 74, 85, 92, 91, 85, 76, 68, 64, 68, 79, 88, 88, 83, 83, 91, 104, 119, 133, 144, 145, 138, 130, 129, 137, 152, 169, 179, 170, 140, 102, 73, 60, 56, 52, 50, 57, 73, 90, 101, 109, 121, 134, 138, 131, 118, 112, 112, 112, 105, 93, 78, 64, 51, 47, 57, 80, 110, 140, 162, 172, 168, 160, 161, 174, 190, 197, 191, 174, 149, 120, 93, 74, 67, 72, 82, 91, 96, 97, 99, 106, 115, 119, 116, 109, 97, 80, 62, 48, 44, 49, 60, 75, 95, 120, 145, 168, 185, 193, 192, 186, 177, 164, 149, 134, 126, 131, 146, 166, 181, 186, 180, 167, 155, 144, 134, 123, 116, 120, 130, 136, 127, 104, 77, 58, 51, 52, 56, 58, 59, 60, 64, 73, 85, 99, 114, 127, 137, 140, 133, 121, 112, 112, 124, 144, 163, 179, 193, 209, 227, 244, 260, 275, 281, 273, 252, 229, 216, 212, 212, 216, 223, 231, 238, 241, 244, 251, 259, 262, 257, 244, 229, 213, 193, 169, 143, 121, 106, 95, 86, 81, 84, 92, 97, 94, 83, 71, 62, 60, 65, 70, 64, 42, 6, -31, -61, -72, -67, -53, -40, -31, -21, -7]
7830gJ7J9J5RjrqMJ7K3J6KpqlMOPQPJqj4j1kJ1K1K4K1J7J5J0jj2j4o%jomj%nrpjPJ2J4J4J3
7809A89Pkj4k1j7j2qpmklj0j4j3lOROnj5j9j5pLQONPJ4K1K2J7ROMMjpj5j8j3lLQJ0J2ROPJ5
7789A65K0J4%qqoj1k1k9l1l3l0j7JJ9K6K3J7J4J6J8J3%j6k5k4j9j3qJRJ2Qko%J4K5L1K9K7
7773A95K6K4J5Lorj3k0k7k9k0j0ojOJ1Rlj3j9j6j4rLJ8L0L4L2K9K1Nj0j8j7j3rqqj2j4j3p
7756A17JPPjj2j5oNLqj9j8j3j4j5qRJ8J5PNRJ4J4J4Qlj4j7j2nloplLJ0J3J4J5J6J4J2J6K1
7738A88J7Kj4k1j8j7k0k3k0j1okKNM%mlKJ4K5L0K5J5NLQJ0Pkrj3j6k2k7k0JK4L4L0K0J2Lm
7720B14qmLPNJoj6k2k1j2okKJ5K6L0K1Qmj1j3j1j3j7k4k7k3j6rpqj0nMJ5K4K6K8L0K2J0km
7702A90klqj6k1k7k8k0qKJ0J7J7Qmporj8j9mJ5K5K2Roj7j6nOMlj0j2j5j8j7q%J0K3L4L3J7
$$ y = [-7, 10, 29, 44, 53, 52, 43, 35, 39, 56, 79, 95, 97, 90, 82, 79, 83, 89, 96, 104, 111, 112, 104, 90, 79, 77, 88, 109, 133, 154, 171, 186, 196, 195, 183, 169, 163, 163, 162, 156, 152, 151, 151, 146, 137, 130, 129, 136, 148, 162, 176, 189, 196, 194, 180, 159, 142, 130, 122, 115, 111, 109, 106, 96, 82, 69, 66, 72, 81, 87, 82, 67, 48, 33, 26, 29, 37, 43, 48, 55, 69, 90, 112, 129, 138, 144, 148, 152, 151, 144, 129, 111, 98, 95, 98, 106, 116, 128, 137, 143, 150, 165, 185, 199, 199, 191, 183, 177, 166, 145, 116, 85, 52, 22, 5, 6, 25, 51, 74, 91, 105, 121, 139, 152, 152, 136, 111, 87, 68, 55, 47, 48, 57, 69, 77, 75, 69, 69, 83, 108, 139, 168, 195, 221, 245, 260, 263, 257, 248, 235, 215, 188, 159, 139, 129, 123, 122, 128, 139, 148, 145, 132, 113, 97, 83, 74, 77, 95, 125, 159, 191, 220, 241, 246, 236, 218, 201, 188, 179, 171, 163, 151, 137, 124, 117, 118, 125, 132, 131, 119, 104, 98, 103, 106, 98, 79, 61, 48, 34, 19, 11, 20, 38, 53, 60, 65, 74, 88, 102, 116, 124, 121, 107, 90, 78, 73, 70, 64, 57, 54, 57, 67, 80, 94, 109, 125, 139, 151, 167, 188, 205, 207, 193, 172, 154, 137, 117, 94, 74, 63, 57, 55, 57, 62, 66, 66, 62, 59, 61, 75, 100, 130, 155, 170, 175, 178, 186, 196, 203, 201, 192, 179, 163, 141, 114, 94, 95, 119, 153, 183, 203, 215, 218, 214, 206, 202, 205, 212, 217, 218, 212, 196, 174, 153, 141, 135, 133, 135, 150, 176, 206, 227, 235, 231, 220, 207, 196, 183, 166, 142, 115, 92, 76, 67, 60, 52, 42, 37, 41, 56, 80, 106, 134, 164, 186, 196, 194, 190, 188, 185, 177, 161, 140, 113, 85, 65, 57, 59, 69, 86, 103, 111, 107, 100, 94, 85, 67, 48, 44, 59, 84, 106, 115, 109, 92, 76, 71, 77, 81, 78, 68, 56, 41, 23, 6, -2, -2, 8, 31, 65, 98, 115]
7685A15lj7k5k7k1j0jKkj0j5j0MJ6J2JkJ0K4K6J7J0QJ2J6J6Qpj9k2k4k8k6j2RJ3%j5j6plJ
7668bPJ7K1J5Krj0%J1J4RORJ5J5J0QJ0J4K0K0J6J1J2J8J6jk4l7l5k5j2%RJ1Lpj3j6j3rlnr
7650H9j3j3j2qkMJoj3j4j4j6j5q%PJ3J9J6OorJRPKKJ2K4K8K3J6J0Lpj2j2qrj4j7j5j5j3mJ2
7632B9K2J8QMNOOONJjKPMnj4j4pkmolNJ1Pmj6k2k6k6k3j2mmrj0n%JLJ8L4M0L5K4Qqj7j2JJ1
7611F7Oqj8j7p%L%kkLJ0J4J4J3J4J7K0K1K0J5Nnj0nJjqj3rkKlrj0qnoj2j1oMQNjlkMPRRRO
7590A23QJ3J6J1Jonjnj1j0lJnj5j6rmrj2qMJ2Qjj2k0k7k8k9k4k3k3j9nJ3K4K6L0L3L0J8Km
7572C9oj2k1k0oJ0J5RPQJ1RRJ5K4L3L5K6J4jj0j5j8j8j3rj3j7j9j0LJ4J6J4RNLJjkJJ0J7J7
7555A63J3QONJoj3j4j0qj0j6k0k2k4k3k0j6j5j5j4rJJ3K7L0K1PLRJ6J2jj1qLJ3J7J4J2J5J6
$$ y = [115, 112, 95, 70, 43, 22, 12, 11, 13, 11, 1, -14, -24, -20, -4, 8, 9, 7, 17, 41, 67, 84, 94, 102, 114, 130, 146, 154, 147, 128, 106, 82, 54, 28, 16, 25, 38, 38, 23, 7, 0, -3, -2, 5, 22, 43, 58, 60, 51, 41, 41, 52, 66, 75, 81, 90, 105, 120, 130, 138, 148, 162, 182, 202, 218, 229, 241, 259, 275, 274, 250, 213, 178, 153, 141, 141, 150, 161, 164, 157, 144, 128, 115, 106, 103, 98, 89, 76, 63, 51, 43, 41, 45, 46, 40, 27, 13, -1, -17, -32, -40, -40, -33, -20, -1, 15, 21, 15, 6, 7, 16, 23, 25, 27, 39, 63, 91, 114, 130, 140, 143, 136, 124, 112, 104, 95, 81, 64, 49, 34, 21, 17, 29, 51, 69, 77, 81, 86, 92, 98, 104, 109, 110, 109, 111, 118, 122, 117, 103, 89, 82, 80, 76, 70, 67, 72, 83, 90, 86, 70, 48, 22, -4, -27, -39, -43, -47, -56, -66, -71, -71, -70, -67, -49, -15, 25, 60, 84, 92, 84, 67, 55, 56, 67, 73, 65, 47, 30, 23, 23, 26, 26, 24, 22, 25, 35, 49, 63, 76, 90, 107, 127, 148, 168, 183, 188, 183, 173, 168, 169, 168, 160, 147, 138, 136, 138, 135, 126, 116, 108, 103, 97, 85, 74, 68, 72, 80, 85, 84, 81, 79, 83, 90, 99, 108, 117, 123, 131, 144, 160, 171, 172, 166, 161, 160, 155, 144, 134, 131, 132, 127, 112, 96, 87, 83, 74, 62, 54, 58, 70, 78, 77, 65, 45, 18, -10, -39, -63, -86, -109, -128, -133, -120, -96, -70, -40, -7, 23, 41, 43, 39, 33, 21, 0, -20, -26, -16, -1, 8, 15, 23, 34, 43, 52, 67, 91, 124, 159, 185, 199, 198, 188, 173, 155, 137, 124, 115, 102, 85, 66, 56, 59, 73, 89, 103, 112, 117, 120, 121, 120, 118, 119, 129, 146, 163, 176, 184, 190, 195, 196, 190, 177, 163, 153, 145, 135, 119, 99, 77, 53, 30, 10, -6, -21, -36, -50, -59, -58, -45, -18, 12, 33, 40, 43, 52, 68, 80, 79, 68, 60, 63, 76, 93, 107, 119, 134, 150]
7538A50J2J0J1J1Jj2j9j4j0j3j9j3njnpmkkmrj7k4k3j5jJ4K4L1K3Lj3j2jO%j1j8j4okjLRQ
7520A9nj9k2pJ2K1J5RPJ4K2K2J0mj1pKRJ2J6J9J1pk2k4j2jOQOJpj2rkMNJkllnqj2rLK0L3L5
7500A29K7J6RMlj2k3k4j6mLMMQRNkrj1p%QJ3RNKNOKkmj2k2k4j3LOoj9j8j2pqrmJJ0K0L1L0
7480I8J4qj7rNJ2J1QRJ3J9K0J4QKLlj3j9rJ1J9Rpj3pj%%MJ3J7J2kj9l3m0m1l2j2J0K6K8J9
7462A19OkkNJ5J4MprmMONkj2j6j1qj4k6l0k0oKKjkJQJ1RQJ2K1K7K0Pmj0j2rkNRPJ0J5K3K2
7443A88J7Q%oj5k4k6j9nKJk%PJ1Q%kLQOnj7j5jJ5K1J5Nlqj3j7j9k0j9j1%J0J4J5J4J4J0%p
7424A38j3j4j7k0k2j7lJ2K4K9K7K5K2J5Noj4j6rMJ2J2Krj1olmqnNJ7K0J5PMLKnk0l2l7l0j9
7407F0j1nlkqj3j1LJ9K6K1J5J2J0Kj1k0k0j3plMJ8K9L3L2L1L3K9J6nk0k4k2k2k8k9j8NK8L8
$$ y = [150, 162, 172, 183, 194, 195, 183, 164, 150, 140, 127, 108, 95, 90, 89, 84, 77, 73, 71, 69, 65, 56, 39, 15, -8, -23, -24, -10, 14, 45, 68, 71, 58, 46, 45, 51, 51, 40, 22, 8, 2, 0, -1, 2, 11, 19, 14, -5, -27, -34, -22, -1, 14, 23, 30, 44, 66, 88, 98, 94, 83, 76, 78, 87, 99, 115, 134, 145, 138, 116, 92, 80, 79, 85, 93, 99, 100, 93, 81, 72, 70, 74, 79, 80, 78, 75, 72, 67, 59, 47, 38, 41, 61, 94, 129, 156, 172, 181, 185, 182, 170, 147, 123, 107, 103, 106, 110, 114, 122, 131, 136, 134, 125, 114, 107, 107, 115, 128, 137, 142, 144, 149, 155, 157, 155, 151, 139, 117, 93, 80, 83, 89, 83, 64, 46, 34, 27, 19, 10, 6, 7, 17, 37, 68, 98, 112, 104, 87, 78, 83, 95, 106, 114, 123, 136, 155, 175, 189, 197, 199, 202, 199, 186, 167, 158, 169, 188, 197, 190, 177, 170, 169, 169, 169, 173, 186, 203, 215, 213, 194, 161, 121, 80, 48, 36, 46, 72, 100, 119, 125, 123, 121, 126, 141, 155, 159, 152, 143, 139, 143, 149, 154, 152, 140, 124, 113, 105, 91, 65, 35, 15, 9, 11, 13, 12, 10, 11, 19, 30, 39, 47, 59, 80, 107, 127, 134, 130, 120, 108, 99, 97, 102, 111, 118, 128, 143, 166, 188, 205, 213, 213, 207, 192, 168, 142, 123, 118, 120, 121, 119, 119, 126, 137, 145, 145, 143, 146, 154, 160, 155, 138, 123, 122, 137, 158, 173, 178, 175, 167, 154, 137, 118, 98, 79, 68, 68, 78, 92, 107, 121, 135, 145, 145, 138, 125, 111, 94, 74, 52, 35, 32, 44, 68, 97, 124, 149, 171, 186, 191, 185, 171, 155, 146, 150, 162, 174, 176, 167, 156, 150, 147, 143, 135, 130, 135, 152, 172, 187, 194, 198, 201, 203, 198, 178, 146, 109, 79, 60, 49, 44, 41, 39, 31, 18, 7, 10, 29, 55, 76, 91, 103, 113, 115, 104, 84, 64, 51, 44, 41, 45, 63, 92, 125, 157, 188, 221, 250, 266, 261, 241, 217, 195, 173, 145, 116, 98, 103, 131, 169]
7390A69L1J4jj1j5j5j5j7j2oJKlrj4j3ql%klLJ7K8K2Jk2l1k6j5nNJ8L4M3L8J8pk3l0k7k3k3
7373F5k5k6k1qPJ5J3Lnj1j3j8j9j2lMPJ3K4L1L0K6K1J7J2RJ4K4K9K1Jk3l7l9k7pJ0K0J6No
7356A37j1j4j6j4rmnj0j4j2rj0j2j2nKOPNKmqnLJ0J2J3J4J3J1PQJ5K0J7Mj0j1nmj3k4k4j5
7339B6mj%kjLQJ2Mrj6oJ0J7J3QRJ3J5J3J0PLLNOL%NJ4J8J1%kKMK%LRQLknqj6k4k5k1j4roj
7317I5KMJoj4j8k0j9j4rjOJ1J2J3J2PlrlQJ3Nopkmj4j6kK1K9J3j3k9k6j2JJ0J7K1K1J8J4Q
7299A15jj4k2j6jOmk3k8j6LJ3J4QKknnllkPK2L3L6K9K4J6Omj1j1rqj0j5k5l4l0j4JM%LJ5K6
7281F7K4J0oj4j3kRJ6J7J3PNPJ5K1K1J6Omk0l3l9l0j0J0K2K6J6jj8k3j9j2mMMJlKJ1J4J0P
7264A30J4J9J2lj5j3lPJ0Kj2k1k5k0j3nMJ2J8K1K4K3J7Opj9k7k7k1j5j0n%MPJ0J2J2O%jKJ0
$$ y = [169, 200, 214, 213, 202, 187, 172, 157, 140, 128, 122, 123, 125, 122, 113, 99, 86, 78, 75, 75, 73, 70, 73, 90, 118, 140, 141, 119, 88, 62, 47, 42, 47, 65, 99, 142, 180, 198, 191, 168, 138, 111, 88, 65, 40, 14, -7, -15, -8, 7, 20, 23, 18, 7, -6, -24, -43, -55, -58, -54, -47, -34, -10, 21, 51, 77, 98, 115, 127, 136, 150, 174, 203, 224, 225, 202, 165, 126, 99, 92, 102, 122, 138, 143, 137, 126, 112, 96, 82, 73, 69, 64, 54, 40, 28, 19, 9, -3, -15, -20, -18, -12, -5, 0, 2, -2, -10, -15, -12, -2, 10, 23, 37, 50, 61, 68, 76, 91, 111, 128, 132, 122, 111, 106, 102, 89, 65, 41, 26, 22, 21, 21, 19, 18, 21, 29, 41, 45, 36, 20, 14, 24, 41, 54, 62, 71, 84, 99, 112, 122, 129, 132, 135, 140, 146, 149, 149, 154, 168, 186, 197, 197, 195, 197, 201, 203, 203, 206, 215, 223, 226, 224, 219, 211, 195, 171, 146, 125, 111, 102, 96, 95, 97, 101, 102, 96, 82, 64, 44, 25, 11, 2, 1, 7, 18, 30, 43, 55, 62, 59, 50, 47, 55, 68, 73, 67, 60, 58, 54, 40, 24, 22, 43, 72, 85, 72, 43, 17, 5, 6, 16, 33, 54, 75, 93, 107, 115, 114, 100, 78, 62, 61, 67, 63, 40, 12, -4, -1, 12, 26, 34, 36, 34, 29, 24, 21, 18, 16, 23, 45, 78, 114, 143, 167, 183, 189, 185, 174, 163, 154, 146, 136, 121, 96, 62, 32, 18, 19, 23, 23, 26, 41, 67, 91, 101, 95, 81, 68, 66, 75, 91, 108, 121, 128, 133, 140, 155, 176, 197, 213, 219, 215, 195, 162, 123, 93, 83, 93, 115, 141, 157, 156, 138, 115, 96, 84, 80, 84, 88, 89, 86, 88, 99, 113, 123, 130, 144, 163, 175, 172, 157, 144, 141, 148, 158, 160, 148, 127, 102, 82, 69, 64, 68, 80, 98, 119, 143, 166, 183, 189, 182, 163, 136, 109, 88, 73, 63, 58, 58, 62, 69, 79, 91, 103, 109, 109, 108, 110, 120]
7246A20J6K1K2K0J7J6J5Poj3j4j6k1k1j0KOlj2j3q%PJ5K2K6J4qk9l4k3pQJ6J9J8J5Oj1l3m5
7230A01l9j5MRNNJ0J9K4K1J4Njlrk1l3l4k3j0ljmpj1j0nNQOKORNorjJ0Oj1k3k7j8nJ0K3K2
7211@J3%lKNK%OJ4J6J1MjmnppomklnmMJ4J9J2JoqnJPJ1J1QQJ2J6J4RNkqqkQJ2PLJjpj5j9k0
7189A04k0j2JJ5J6PjJJ1J9J9Rpk3l4k8j8j0qnNJ3J1OMRQlj6k0j0JPLnj1j1rqokRK1K8L1L0
7170A21K3Rj2k8l4l0j7oKJJLQJ1J0RQQPJ3K1K4J5Llnqj8k7k7k1j1jQJ5K2K5K4J9J1%j0k0k4
7152A19k0j1%OQQOLjj1k4l3l4k1pPJ3J6J0LjmmpqqnnmmjPJ6K2K2J9J6J4J3J0OKlnkNJ2J2J0
7133A62Krk2k6k0j1rj2j0LJ9K7K8K1J4RNMNQQLrk0k7k7k4j6rolLJ4K1J8QKKlj3k3k0oNQOL
7114H3MNPRJ0Ojj0j6j9j6j1kQJ3J2Moj1j1j0pKJ3J8J2kj4j5qLQPJorrkOQOLOJ6K9L3K7Rj1
$$ y = [120, 136, 157, 179, 199, 216, 232, 247, 254, 248, 235, 221, 205, 184, 163, 153, 155, 161, 158, 146, 133, 125, 125, 132, 147, 169, 195, 209, 201, 172, 138, 115, 108, 116, 132, 151, 169, 184, 190, 179, 146, 101, 62, 47, 51, 60, 65, 70, 80, 99, 123, 144, 158, 163, 162, 159, 150, 129, 96, 62, 39, 29, 26, 25, 21, 14, 3, -7, -12, -7, 1, 7, 9, 15, 24, 29, 23, 14, 13, 23, 29, 18, -5, -32, -50, -55, -45, -22, 0, 13, 13, 10, 12, 17, 19, 19, 25, 39, 55, 66, 70, 69, 65, 60, 53, 46, 40, 36, 34, 31, 26, 22, 26, 40, 59, 71, 72, 66, 58, 53, 54, 61, 72, 83, 91, 99, 111, 127, 141, 150, 155, 153, 145, 137, 135, 143, 155, 162, 165, 166, 165, 158, 143, 124, 104, 84, 72, 73, 88, 104, 111, 110, 111, 122, 141, 160, 169, 162, 139, 105, 77, 59, 49, 41, 36, 41, 54, 65, 71, 75, 84, 92, 89, 73, 53, 43, 44, 51, 54, 49, 38, 27, 18, 10, 4, 2, 11, 32, 60, 91, 121, 144, 153, 141, 113, 79, 49, 32, 26, 28, 29, 30, 33, 41, 52, 62, 71, 79, 87, 94, 107, 128, 152, 167, 170, 167, 162, 154, 136, 109, 82, 61, 50, 49, 57, 72, 94, 119, 143, 162, 173, 173, 163, 143, 119, 99, 88, 88, 94, 102, 110, 116, 119, 118, 107, 83, 50, 16, -5, -12, -5, 8, 24, 34, 37, 36, 32, 28, 21, 13, 5, 0, -5, -9, -13, -14, -7, 9, 31, 53, 72, 88, 102, 115, 125, 131, 133, 130, 125, 123, 128, 140, 152, 162, 164, 155, 133, 107, 87, 76, 67, 55, 45, 48, 67, 94, 122, 143, 157, 166, 171, 175, 180, 188, 196, 199, 190, 170, 143, 116, 92, 76, 67, 61, 58, 61, 75, 96, 114, 122, 124, 126, 123, 110, 87, 67, 61, 66, 74, 80, 83, 87, 92, 99, 108, 118, 124, 123, 113, 97, 78, 62, 51, 49, 57, 70, 82, 86, 80, 69, 58, 48, 41, 43, 56, 74, 86, 84, 70, 55, 47, 50, 58, 65, 66, 60, 51, 42, 40, 46, 54, 60, 63, 69, 85, 114, 147, 174, 183, 172]
7094A72k1k0j3porj5k2k8k2mJ3K3J9J1NLNPPJoj0rokJJjknoqrj2j9j9j2OK0K1J1krj1j0jO
7075FJ1J3J4J4J3PQJ5K1J4MjJkj3k5k7k0j2j0j0oQK2L0K4J1Kj%%jKMJqj8j9j3jRQKmlPJ8K6
7056A21K4J2LKRJ1Lqj9k9m0m2l2j0RJ9K3K4K4K3K0J5J0QQKrk1j9pJlqmLRRRJ0Lj0k2l0l6l9
7038B6l0j3NJ2OjkMJ2J9J5Pkmpj1j5j1JJ0J0Jn%J4K5K4J2%lJPJ1J3J4J3J1QJj1k3k7k2j3n
7019G7%MKlppj2k1k2pJ2J9J3Lnj0j0JJ7K7K4J4Npj7k4j7oJK%kmkQJ2Mrj2jJ3K3K9L3K8Pj7
7001A56l4l6l4l0k3j4kJ0K2L0K8J6Knppqj1j0njjjlKJ0J8K3K1J0JlJJmj3j4j0kMJ0RMLJ1K2
6982A36L0K9K2J2Moj0rpppokknj1j4j5j1pj0j8k9l1k6j3o%NJ5L3M6M5K9Rknl%kqk0l0l3k5
6964C5j2KJ8L0L8L1J4KJJ0J7J4Jj3k5l3l1j8kNNOJ6K4K2J1jnlk%LLjj4k6k9k0j1j0j4rNJ9
$$ y = [172, 151, 131, 118, 111, 105, 96, 81, 59, 31, 9, 5, 18, 41, 60, 71, 76, 79, 84, 91, 98, 99, 93, 83, 74, 68, 66, 67, 68, 67, 65, 60, 54, 46, 37, 25, 6, -13, -25, -19, 1, 22, 33, 31, 22, 11, 1, 0, 6, 17, 30, 44, 58, 71, 78, 86, 101, 122, 136, 140, 139, 140, 138, 125, 100, 73, 53, 41, 31, 21, 15, 23, 45, 75, 99, 110, 112, 111, 111, 111, 110, 112, 116, 117, 109, 91, 72, 59, 58, 67, 75, 77, 73, 70, 77, 95, 121, 145, 157, 160, 162, 171, 182, 185, 177, 158, 129, 89, 47, 15, 5, 14, 33, 56, 80, 104, 127, 147, 162, 172, 180, 188, 190, 181, 160, 141, 134, 135, 132, 124, 120, 123, 132, 141, 150, 160, 163, 153, 131, 101, 65, 26, -4, -17, -12, 0, 6, 5, 3, 7, 19, 38, 53, 60, 58, 54, 47, 36, 21, 10, 11, 21, 31, 32, 27, 27, 41, 66, 90, 102, 102, 99, 100, 107, 118, 131, 145, 158, 169, 177, 178, 167, 144, 117, 95, 82, 77, 77, 81, 83, 80, 73, 66, 54, 33, 11, 4, 16, 35, 48, 51, 46, 36, 26, 27, 44, 71, 95, 109, 114, 107, 90, 66, 49, 43, 44, 46, 46, 44, 40, 38, 46, 58, 62, 53, 41, 40, 53, 76, 105, 138, 166, 173, 156, 122, 86, 52, 22, -1, -15, -17, -7, 15, 45, 73, 89, 91, 86, 79, 72, 64, 53, 43, 38, 37, 36, 35, 32, 34, 44, 62, 85, 106, 116, 117, 114, 115, 116, 112, 99, 85, 75, 73, 77, 87, 96, 100, 103, 114, 136, 166, 195, 217, 229, 233, 227, 217, 208, 201, 194, 187, 181, 179, 177, 172, 161, 147, 132, 121, 114, 104, 86, 57, 26, 0, -13, -19, -19, -14, 1, 34, 80, 125, 154, 163, 161, 156, 153, 153, 151, 143, 123, 93, 60, 35, 23, 25, 43, 73, 111, 142, 156, 158, 159, 169, 186, 200, 201, 188, 163, 130, 99, 81, 79, 84, 89, 95, 111, 135, 157, 168, 167, 162, 159, 157, 157, 160, 163, 162, 148, 122, 93, 73, 62, 52, 38, 29, 34, 53]
6946E3K5K8K7K4J7Nkljlrj6j9j8j7k2k8l0k0nQJ3J9K4K4J2mj4j4qrj2rLJ5K0K1K0J5%j9l1
6930F0l0k0rjNOJoj1j1rnJMNOJ0J4J6J3J4J7J9J6J2PjppkKKjklprmKRJ4J6J4J2J1J4J6J3M
6910B10mj0j8k4k8k7k3j8j1oMJ8L0L3K3QLKJlqj1j6j9j5n%pj4j3kJ0J3J1POLjookOJ0J2J3
6892A26Rjj5k8l8m4m2k7kJ9K8K3J4PQJ1J0lj9k7k2j5pKJ5K9L5L5L0K3J0nj8k5k5j7lRJ4Rj
6875H2ppjQJ5J3LonMQLmp%PJ1J4J7J8J5Q%llnnljkoj3j7j8j4pjjnpmLRJ2Q%j1j8j5pjJkoo
6853D1lLRJ4J4RJkKRJ2J2J1J3J2QL%%mj0j8k4k6k1j4pmkOJ3J1kj1qOJ8K2J6O%jOJ4J8J7J2
6834A81Lqj5j5j1rj1j6j7j5j6j9j7j1l%km%MMJJMKj%OJ1Q%kJRJ7K5K9K6K0J4Lj3l0l8k6jJ9
6815H8K3J3kj7k4k1qPJ6J4Nnj2j6j4p%MJkljJkkjNJ1J4J5J0Mqk2l3k8j0OQJnkOJ1J1PMknj
$$ y = [53, 78, 106, 133, 157, 174, 179, 177, 174, 173, 170, 161, 145, 126, 108, 91, 69, 41, 11, -9, -14, -6, 7, 26, 50, 74, 86, 82, 68, 54, 46, 37, 25, 16, 19, 34, 54, 75, 95, 110, 110, 91, 60, 30, 10, 1, 0, 5, 11, 12, 6, -5, -16, -25, -30, -29, -25, -20, -14, -4, 10, 26, 39, 53, 70, 89, 105, 117, 124, 123, 116, 109, 107, 109, 111, 110, 108, 105, 98, 89, 85, 87, 96, 110, 126, 140, 152, 163, 177, 193, 206, 210, 206, 196, 178, 154, 126, 99, 76, 58, 47, 41, 45, 63, 93, 126, 149, 157, 160, 162, 163, 160, 152, 141, 125, 106, 91, 86, 86, 79, 65, 52, 50, 60, 73, 84, 91, 97, 100, 99, 93, 87, 85, 91, 101, 113, 126, 135, 134, 119, 91, 53, 9, -33, -60, -62, -43, -15, 8, 22, 29, 37, 48, 58, 55, 36, 9, -13, -28, -35, -33, -18, 11, 46, 81, 111, 134, 144, 139, 121, 96, 71, 54, 51, 60, 74, 83, 82, 75, 68, 67, 75, 90, 103, 106, 100, 95, 99, 107, 110, 106, 99, 99, 106, 117, 131, 148, 166, 181, 189, 189, 186, 183, 178, 173, 170, 169, 167, 161, 148, 131, 113, 99, 92, 91, 90, 85, 78, 74, 77, 86, 98, 106, 106, 95, 77, 62, 55, 54, 55, 53, 47, 41, 38, 41, 50, 64, 78, 87, 88, 86, 88, 97, 109, 121, 132, 145, 157, 165, 168, 168, 168, 164, 154, 136, 112, 86, 65, 51, 44, 40, 38, 44, 57, 68, 66, 55, 47, 53, 71, 93, 109, 115, 115, 114, 120, 134, 152, 169, 181, 184, 176, 161, 146, 135, 126, 115, 99, 82, 67, 51, 32, 15, 4, 1, 1, -1, -5, -5, -1, 3, 4, 5, 9, 11, 10, 10, 16, 27, 35, 35, 33, 34, 43, 60, 85, 114, 140, 160, 174, 177, 164, 134, 96, 70, 69, 88, 111, 124, 122, 105, 81, 60, 52, 59, 75, 89, 94, 89, 77, 61, 47, 40, 40, 44, 45, 43, 40, 39, 40, 38, 36, 35, 40, 51, 65, 80, 90, 94, 86, 64, 31, 3, -7, -1, 7, 8, 3, 1, 7, 18, 29, 36, 40, 38, 33, 32]
6795C2QJ6J3Jj1j5q%Jkn%MKml%NOOLkqrkPJ3J3J2PMMJ0J3Onj4j6j7j8j9j5oKQJ6K0J7J0PN
6775I2%j1k2k2j4ppnmlolLRPMLPPJlkPJ8K4K1J4MllJQJ2J4J8K1K0Rpj8j8j1lOJ4J7J0LNJ2
6755B19J7J6J0Jj3k7l4l0k1rMJ0NmolMOPJ1J0Njmoj2j7j4mOJ0Pjpp%N%j1j9j9j4j0rj0oNK0
6736F0K8L0K5J6Mqj8k1j7j2qqj6k2k0mJ4K5K2J9J8K3K0J2lj5k1k0j9j8j4o%knoknj3j7j6n
6719b5J0K3L0K4Oj4k8l2k7j6mKPJ8L1M0L6K8K3J6Nj0j7j3lNJ0Qnj9k9k9k6k3j7j3rrnJ0K5
6702a6L1K8J8Rlj5j9rLPM%PJ7K5K4J2nj8j9j1rj3j4%J7K3J7J1Nlj5k1j5mMPJ5K5K9K3Qj0k6
6685A24l4l4l3l2k8j1J0K2J8J0Jllk%%JNJ1J0OLLJrj8j8oNQNnj3j6j2pljlonlKLMQJ6K0K0
6665A1J7J1Jpj0pmJRJ5J3%j0nPQmk0k6k0j0LJ2J4RPRJ1QLJ%jjMJ3J7J1mj4j2onj1j8j8j0m
$$ y = [32, 40, 56, 69, 70, 59, 44, 36, 36, 37, 35, 30, 30, 34, 36, 32, 29, 29, 34, 40, 46, 49, 47, 39, 30, 28, 35, 48, 61, 73, 80, 84, 88, 98, 111, 117, 112, 98, 82, 65, 47, 28, 13, 7, 9, 17, 33, 53, 70, 80, 87, 92, 92, 81, 59, 37, 23, 16, 9, 4, 0, -3, -9, -12, -9, 0, 7, 11, 14, 21, 28, 29, 26, 24, 31, 49, 73, 94, 108, 112, 109, 106, 107, 115, 127, 141, 159, 180, 200, 209, 202, 184, 166, 155, 152, 158, 172, 189, 199, 202, 207, 219, 236, 252, 262, 263, 250, 223, 189, 159, 138, 129, 133, 143, 148, 144, 138, 135, 139, 145, 152, 163, 173, 178, 177, 173, 167, 155, 138, 124, 120, 126, 136, 143, 142, 135, 128, 128, 133, 133, 122, 103, 84, 70, 60, 51, 41, 35, 40, 60, 88, 118, 143, 159, 163, 155, 137, 116, 99, 87, 79, 71, 55, 33, 13, 9, 23, 48, 70, 89, 107, 130, 150, 162, 159, 144, 123, 103, 84, 66, 52, 46, 46, 44, 39, 33, 31, 26, 13, -4, -20, -25, -15, 8, 38, 62, 68, 54, 26, -6, -33, -49, -53, -51, -44, -26, 5, 45, 81, 109, 132, 148, 153, 143, 126, 113, 110, 115, 125, 133, 128, 109, 80, 51, 25, 2, -15, -28, -37, -46, -51, -41, -16, 15, 43, 61, 70, 67, 52, 33, 24, 27, 34, 38, 38, 45, 62, 87, 111, 123, 118, 100, 81, 70, 61, 48, 34, 34, 51, 74, 91, 102, 107, 104, 89, 68, 53, 49, 53, 60, 75, 100, 129, 152, 160, 150, 124, 90, 56, 23, -9, -37, -48, -38, -16, 2, 12, 13, 10, 7, 5, 5, 5, 6, 11, 22, 32, 38, 41, 44, 45, 36, 18, 0, -6, -1, 7, 12, 7, -6, -22, -34, -41, -44, -45, -48, -54, -59, -62, -60, -57, -53, -45, -29, -9, 11, 28, 39, 40, 33, 23, 16, 12, 13, 22, 37, 50, 50, 40, 35, 42, 50, 46, 26, 0, -20, -30, -27, -15, -1, 8, 15, 24, 35, 43, 46, 47, 47, 46, 45, 49, 62, 79, 90, 86, 72, 60, 54, 49, 38, 20, 2, -8, -12]
6646a2NJ4K4K5K2J4Pkj0j5j4j3j7k3k9l2k6j4lPJ5K4L3L5K8J0j0k3k0%J7K2Rpj5j1kLOJoj0
6629GnRJ8K2K0J4J0QPJj2k6l2k5j8j5j2oLJ1K2L3L2J7jpppj7k3k0oKNPNJKQJ9K7K3J5PJqj7
6610I2k3k1j7j6j5j4j0qpkMPKmnJJ1J6J1Jj1j7j3olkMJ3K1K1K3K4K1J4NJjoro%Lkj4k6l3l7
6591c3l7k8j2OJ7K0J8J7K0J7J1kj0pkLJoj2j1mOJ3J3J0QJ0J7K5L3L8L5K4J0kj1j5rOK3L0K2
6574B52Lj5k4k3j8j2okKOMnj5j8j1nrj9k6k2j3jQJ4J4Mj0k2k4j2NK5L3K9J4kj0j2j5j9k3k1
6557aj4kJ2K1K7J8%j5j9j5qJQJ3J4J3RNMJkqj5j3nKLklnj3k1k3j2KJ3K2K4J8%j4qRK2J8R%
6538G0lJJ1K3K5J8QMJmj2j3pjKKlqj0pkLRJ5J6Qlj0j2j5k4k9k1JJ9K6K5K1K0J3Kj0j5j4j1
6520A09rponoqj6k7l6l3j8kJ1J7K3K9L0K7K0J7J0%qoPJ9K0Rmqnkpj2j5j5j1kQJ4J1MjKMKm
$$ y = [-12, -7, 7, 31, 56, 78, 92, 99, 97, 87, 72, 58, 45, 28, 5, -24, -56, -82, -96, -99, -92, -77, -53, -20, 15, 43, 53, 43, 20, 0, 0, 17, 39, 48, 41, 26, 15, 13, 16, 22, 23, 17, 7, 2, 11, 29, 51, 71, 85, 95, 103, 110, 111, 99, 73, 41, 16, -2, -17, -29, -35, -32, -21, 1, 34, 66, 83, 82, 75, 68, 61, 44, 21, 1, -5, -3, 2, 9, 14, 15, 17, 25, 44, 71, 94, 109, 116, 117, 109, 92, 69, 48, 31, 15, 0, -14, -24, -32, -39, -41, -37, -30, -28, -32, -37, -36, -25, -9, 2, 3, -8, -25, -38, -44, -47, -49, -45, -32, -11, 10, 33, 57, 78, 92, 97, 98, 97, 91, 82, 76, 76, 79, 77, 63, 37, 4, -33, -70, -98, -110, -104, -87, -67, -49, -32, -12, 5, 16, 14, 4, -3, -5, -2, -1, -7, -19, -30, -34, -28, -15, -2, 8, 16, 26, 43, 68, 101, 139, 174, 198, 208, 206, 195, 180, 171, 177, 200, 230, 252, 255, 240, 216, 193, 175, 163, 157, 155, 157, 163, 167, 162, 147, 129, 118, 113, 104, 85, 59, 37, 24, 23, 31, 45, 59, 63, 53, 31, 7, -5, 0, 25, 58, 87, 101, 99, 89, 77, 62, 43, 20, -1, -15, -17, -5, 16, 43, 61, 61, 46, 27, 12, 4, 5, 13, 26, 40, 53, 62, 67, 71, 72, 70, 62, 47, 34, 29, 31, 34, 32, 29, 24, 11, -10, -33, -45, -43, -30, -8, 16, 34, 34, 20, 12, 21, 43, 61, 70, 70, 67, 68, 79, 102, 127, 145, 153, 157, 158, 154, 142, 129, 122, 121, 123, 125, 122, 114, 104, 97, 95, 98, 107, 122, 138, 146, 143, 133, 121, 106, 82, 53, 32, 33, 52, 78, 103, 124, 144, 157, 159, 149, 134, 120, 109, 100, 93, 87, 82, 76, 68, 52, 25, -11, -44, -62, -64, -53, -36, -13, 16, 46, 73, 93, 110, 120, 120, 112, 106, 113, 132, 152, 161, 157, 149, 144, 142, 135, 123, 108, 93, 82, 80, 88, 102, 113, 117, 116, 118, 122, 124, 120]
6501A20j0k0k7k4pJ7L2L2J9J0QJ1J2J0Mkpj0j2j0%J2K2K8K8K7J8Jj8l1l6k8j5nlornLJ2K0
6485A61K6K2Qpj9k6k9l0k5j6j1j2j1nKQJ1J2J2Onj1j1mOPM%MRNj3l2l7l4l0k7k3j0RK4L1L0
6468c1K5K0J6J0L%KQRMnrrmKMMJlqj2j0jJ2J3Kj6k3j4jJ1J8J7J1NMPJ1RNmj4k1k4k0j2pkN
6448a2J2K3K4J8Nqj4j0KJ4J9J7RKkmqj5j5r%POMORRJj1j6j4p%jqj7j7j1kJljRJ9K5J5Jj4k4
6428A4k6k1rNJ4J8J9J9J5QKloqpprj3j0kJ4K9L4K4Pmrj0j3j7j3ojKLNJ0J3J5J3PKNJ1J4On
6410A29j4j6j3oLJ4J6Poj7k5l4l9l0oJ7K1Rrj8j3LJ9L0L6L7L5L1J9Moj1j9l4m5m2k7j0lNJ3
6393EK1K1J5J1Plj6k2j6kMkj6k9l7l6k5rJ0K1K3J6RM%oqporj5j4nQK1K8K8K6K9L6L9K5Oo%
6375A24RMj4l0l2k3rMJ4J4Nj0j9k0j8j5oPJ4J2O%oj4k5k5j4LK0L3L4K4MpnLPLjjJLQQKj0j1
$$ y = [120, 110, 90, 63, 39, 32, 49, 81, 113, 132, 142, 150, 161, 173, 183, 187, 185, 178, 168, 156, 146, 146, 158, 180, 208, 236, 263, 281, 282, 264, 233, 197, 169, 154, 149, 146, 140, 131, 126, 129, 141, 161, 187, 209, 217, 210, 191, 165, 136, 106, 81, 65, 54, 42, 31, 26, 28, 36, 47, 59, 71, 77, 72, 61, 50, 46, 52, 59, 63, 63, 67, 76, 81, 68, 36, -1, -35, -65, -92, -115, -125, -116, -92, -61, -31, -6, 14, 30, 40, 43, 43, 45, 53, 62, 66, 61, 52, 43, 39, 41, 45, 49, 50, 47, 39, 27, 17, 16, 28, 41, 43, 27, 4, -10, -11, 0, 18, 35, 46, 51, 55, 62, 73, 82, 87, 83, 69, 48, 24, 4, -8, -15, -17, -12, 0, 23, 47, 65, 70, 62, 48, 38, 40, 54, 73, 90, 99, 101, 99, 95, 87, 72, 57, 48, 48, 55, 61, 65, 71, 80, 89, 90, 79, 63, 49, 42, 42, 41, 33, 16, -1, -12, -14, -13, -16, -17, -8, 11, 36, 51, 52, 38, 14, -12, -33, -42, -37, -23, -5, 14, 33, 48, 56, 58, 55, 49, 41, 34, 27, 18, 5, -5, -7, 7, 36, 70, 94, 101, 97, 88, 78, 65, 48, 35, 29, 28, 30, 33, 38, 48, 61, 76, 89, 96, 98, 103, 114, 128, 134, 129, 115, 99, 86, 80, 83, 97, 113, 120, 114, 97, 72, 38, -1, -31, -37, -20, 1, 10, 1, -17, -30, -27, -8, 22, 58, 95, 130, 161, 180, 184, 178, 167, 148, 114, 69, 27, 0, -10, -13, -8, 5, 26, 47, 62, 73, 80, 77, 61, 39, 23, 21, 25, 23, 7, -22, -59, -95, -120, -129, -119, -98, -75, -59, -50, -46, -46, -52, -60, -67, -73, -82, -97, -111, -116, -108, -87, -59, -31, -5, 24, 60, 99, 124, 130, 124, 124, 133, 137, 123, 93, 61, 38, 29, 33, 47, 61, 66, 56, 37, 17, -1, -16, -22, -15, -1, 11, 17, 17, 11, -3, -28, -53, -67, -64, -44, -11, 23, 47, 51, 44, 39, 42, 49, 52, 51, 50, 51, 54, 62, 70, 72, 62, 51]
6356E1%J2J5Qkrj1j2q%MKmpqlKN%mqj0j5k1j6LK5L5L6L0K6K4J7Mj2k2k0j4j1j5j9j8j1jPJ2
6338C7J4J4J0PKlkKJnj4j7rMJ7K1J5Ll%PJ2J2Qlj8k9k3oJ0J6J5K0K3J8Poj6k7l5l8l4k1pJ2
6320iK5L1K7J9J1NKKPJ0RMoj7k2k0pOJ3J2PLLMLlj4k6l2l3k4j1KPNNJ0J7J5OkkKJ1J4J0lj4
6300F2j7q%RJ5J6Rlpllrj2rkkqj1j1pmKJ0J4RLmpmLJ3J8K0K0K0J8J5Pjj2j3mPLj5l1k9j4K
6281D5J1J6J4OJLJ2J8J7J1Loj0rnqj4j9j6roorj1rlKNK%KLOQJ0J1RQPPNQJ3J9J6Olrj2j7k6
6260I7k9k2kJ7K1J2jkKMLNOMklJLMMNMlj1j4j5j6j8j2nKPRPKnrq%J1J4Mj0j2MK4L5L1K1J5
6240A79J1Mpj7k3k2j7j5j3qjOOlj3k1j9j0kjpj3j1okljJ%kLJ4K0J8J0OMKLNRJ2J6K2K3J4M
6221A55jNJ3J4J4J4J2P%qj2j2rmJjpj6k4k5k4k4k5k4j6lLlj6j9qJ1K1K1J9J6J5J0KmnmmLJ9
$$ y = [51, 51, 63, 78, 86, 84, 75, 64, 52, 44, 44, 48, 50, 46, 39, 31, 28, 30, 35, 35, 31, 23, 13, -2, -23, -39, -36, -11, 24, 60, 90, 116, 140, 157, 161, 149, 127, 107, 93, 82, 67, 48, 30, 19, 18, 25, 37, 51, 65, 75, 82, 84, 81, 79, 81, 82, 77, 63, 46, 37, 41, 58, 79, 94, 97, 94, 94, 101, 113, 125, 133, 130, 112, 83, 60, 54, 64, 80, 95, 115, 138, 156, 163, 157, 141, 114, 79, 41, 7, -14, -21, -9, 16, 47, 74, 93, 104, 109, 111, 113, 120, 130, 139, 143, 137, 120, 98, 78, 71, 77, 90, 102, 109, 112, 115, 119, 122, 119, 105, 79, 47, 14, -10, -21, -19, -12, -7, -2, 8, 25, 40, 46, 44, 42, 44, 55, 69, 79, 76, 62, 45, 37, 37, 46, 61, 77, 86, 83, 76, 73, 70, 61, 49, 40, 38, 36, 28, 17, 6, -1, -5, -3, 7, 21, 30, 33, 29, 22, 18, 21, 34, 52, 72, 92, 112, 130, 145, 152, 151, 139, 126, 122, 129, 132, 117, 86, 57, 43, 45, 56, 72, 86, 92, 93, 96, 108, 126, 143, 154, 157, 151, 141, 132, 127, 119, 105, 86, 70, 61, 55, 49, 40, 29, 20, 17, 19, 24, 26, 26, 28, 31, 37, 45, 55, 66, 75, 83, 90, 97, 102, 110, 123, 142, 158, 164, 161, 152, 140, 123, 97, 68, 46, 44, 61, 82, 94, 93, 91, 93, 97, 100, 105, 111, 115, 113, 110, 111, 114, 118, 122, 127, 131, 128, 117, 103, 88, 72, 54, 42, 37, 39, 46, 55, 62, 64, 59, 50, 42, 42, 53, 67, 71, 61, 49, 53, 77, 112, 143, 164, 179, 190, 194, 187, 170, 147, 125, 108, 93, 80, 72, 71, 77, 83, 80, 67, 46, 27, 17, 15, 14, 7, -6, -17, -23, -25, -28, -29, -28, -28, -30, -27, -13, 7, 25, 35, 41, 45, 47, 50, 55, 64, 76, 92, 114, 137, 151, 155, 154, 159, 172, 186, 200, 214, 226, 233, 233, 225, 213, 201, 192, 188, 189, 188, 181, 165, 141, 116, 92, 68, 43, 19, 3, 0, 3, 0, -16, -35, -43, -32, -11, 10, 29, 45, 60, 70, 72, 68, 63, 59, 55, 58, 77]
6203G7L3L3J3j7l4l3j7lkj2j7j3jRJ3J5J1jj4j9j2lLJ2K1K5J6Kmjlj2k2k2j5okLJ1J5J7J7
6186F1J6J3Omj3j6j4oJOMJlKJ6L2L8L1J8MjljJJJjnj7l0l5k9j7pMJ2J7J4J1J5K5L0K8J8Mj1
6168B17k4l2l1k7k1j2lJJ%JJlj1j2rkMJ1J4J1Koj5k1k9l0k6j0J3L2L4K0jj3j1j1j5k2k0j1
6151f6MJ4K4K6L1L4L5K9J3oj5j1%PLopJJ2J1joLJ8K5J9Qmj4k1k1j0LMnj2qPJ6J4ORK0K8K2
6133B33J2ORJ5J8J6J1J0K0M0N7O3O2O5P7R8J25J58J74J42M8p4j70k09j97j62j26r3o3l8k3
6121C04j4pJPQPLkj2k3k6k5k6k9l0k6j8j1j0rj0j1mRK0K3J4Knrj1j1j1j0oMJ3J8J5Nnj5k1
6104E6k0j1LJ6K3K1RmqmL%qj2rlMJ1J7J4kk0k5j8oOJ1J3J6J8J8J4Pjnmklpj1j7k3k2j1jjj0
6085A2j6j1kjoqlNJ0J0%j3k1j5LK2L1L1K7K7K9K3Lk6m4m1k4nJ%KOJ0RNLLLLMNNNOJ0K1K4J6
$$ y = [77, 110, 143, 156, 139, 105, 72, 55, 52, 50, 38, 21, 8, 7, 16, 29, 44, 55, 54, 40, 21, 9, 6, 9, 21, 42, 67, 83, 85, 81, 80, 77, 65, 43, 21, 6, 0, -2, 1, 12, 27, 44, 61, 77, 90, 96, 92, 79, 63, 49, 43, 44, 50, 54, 55, 52, 54, 70, 102, 140, 171, 189, 193, 192, 189, 188, 189, 190, 191, 190, 185, 168, 138, 103, 74, 57, 50, 54, 66, 83, 97, 108, 123, 148, 178, 206, 224, 228, 217, 193, 161, 130, 103, 82, 70, 67, 68, 69, 69, 70, 71, 68, 57, 45, 36, 34, 38, 49, 63, 74, 76, 70, 55, 34, 5, -25, -51, -61, -48, -16, 18, 38, 37, 24, 13, 2, -13, -35, -55, -66, -62, -48, -24, 2, 33, 67, 102, 131, 144, 138, 123, 112, 112, 119, 122, 116, 109, 110, 122, 133, 132, 126, 129, 147, 172, 191, 199, 195, 181, 160, 139, 129, 132, 136, 131, 119, 111, 118, 134, 148, 154, 163, 183, 211, 233, 245, 251, 260, 275, 293, 309, 320, 330, 350, 390, 447, 510, 572, 637, 714, 812, 937, 1095, 1269, 1411, 1459, 1385, 1215, 1006, 809, 647, 521, 428, 365, 327, 304, 290, 283, 284, 291, 299, 306, 309, 307, 295, 272, 246, 221, 195, 166, 136, 110, 92, 81, 71, 62, 52, 41, 37, 46, 66, 89, 103, 105, 100, 91, 80, 69, 58, 48, 42, 46, 59, 77, 92, 97, 92, 77, 56, 36, 25, 28, 44, 67, 88, 97, 93, 85, 81, 84, 84, 76, 64, 55, 52, 56, 67, 84, 98, 96, 76, 51, 33, 27, 33, 44, 57, 73, 91, 109, 123, 130, 129, 124, 120, 118, 115, 108, 97, 80, 57, 35, 24, 23, 22, 12, -4, -15, -17, -18, -24, -32, -35, -30, -20, -10, -10, -23, -44, -59, -56, -34, -3, 28, 55, 82, 111, 134, 137, 111, 67, 26, 2, -3, -2, -2, 0, 6, 16, 25, 30, 33, 36, 39, 42, 46, 51, 56, 61, 67, 77, 98, 122, 138]
6065A38mk1k4j6qlLQJ1RNMRJ2J4J2O%lj%joj0j1mJ%j0k1k6k2j0JJ0J8K3K1J1jnkJKLLkrj3
6046I2lQJ1N%MJ4J8J0lj3j7j1lLkj0j5j5j7j9j9j2JJ3J8K0J8J5J0N%momJRQjj4k0j7j2rpl
6027B7NJ2J4R%mqj3j5j2mL%lLJ0Qnj6j2mlppkMNOPRJ3J8J8J0%onjkmomk%j%knj2j8k1j7qk
6006e0jjKLPJ2J8J8Rmj3j7j4pKJ3J9J9J6J5J8K1K3K3K2K0J8J6J2Ojpj1j3j5j5pLJ1QKJOJ4
5988B01J5Plj3j9k4k4j5lMKkkLLJlnnnpolKMlj4k3j9oNQJ0QLnnRK6K9J6%j1k1k7k3j0%K%O
5967E8J8K9L1L0K5J3jj3k2k7k9k7k0j3p%RJ7J5J0MOQROkrk1l3m0k9j0QJ2Qjnon%NQ%rj6j4
5949c0lJ0K1K3J8MmjJ0J9J9J4QJj0j8k0j9k1k5k0kJ3J4OOJ2J6J0%moj1j9k0j6pJJ0J7J8J7
5932C1J1J0J5K3K4J6KmkMLoj4j4lRJ8J9J2jj6k2j9j0prj1nOJ2J1PQJ4J8J6J4J7J7Pj2k9k8
$$ y = [138, 134, 113, 89, 73, 65, 62, 65, 73, 84, 93, 98, 102, 111, 123, 137, 149, 155, 155, 152, 151, 151, 150, 144, 134, 123, 119, 120, 120, 110, 89, 63, 41, 31, 32, 42, 60, 83, 104, 115, 114, 109, 107, 108, 110, 113, 116, 114, 105, 92, 89, 97, 108, 113, 113, 117, 131, 149, 159, 156, 143, 126, 115, 112, 115, 113, 103, 88, 73, 56, 37, 18, 6, 7, 20, 38, 58, 76, 91, 101, 106, 106, 102, 96, 92, 93, 102, 110, 109, 95, 75, 58, 46, 37, 30, 27, 32, 44, 58, 67, 67, 63, 55, 42, 27, 15, 11, 14, 14, 11, 14, 24, 32, 27, 11, -1, -5, -8, -15, -22, -24, -20, -15, -9, -2, 7, 20, 38, 56, 66, 66, 60, 55, 54, 52, 48, 42, 38, 36, 36, 35, 35, 33, 28, 16, -2, -23, -40, -48, -50, -51, -52, -50, -47, -40, -28, -10, 8, 17, 13, 0, -17, -31, -38, -36, -23, -4, 15, 31, 46, 64, 85, 108, 131, 153, 173, 191, 207, 219, 225, 224, 217, 206, 193, 178, 163, 156, 159, 170, 178, 180, 181, 187, 201, 216, 223, 220, 207, 188, 164, 140, 125, 122, 126, 128, 126, 124, 127, 130, 131, 128, 123, 118, 113, 106, 100, 97, 99, 103, 100, 86, 63, 44, 38, 43, 51, 61, 69, 72, 67, 62, 71, 97, 126, 142, 142, 131, 110, 83, 60, 50, 50, 52, 52, 58, 76, 105, 136, 166, 191, 204, 203, 190, 168, 141, 112, 85, 65, 52, 45, 45, 54, 71, 86, 96, 100, 106, 114, 123, 129, 127, 118, 97, 64, 24, -5, -15, -7, 5, 13, 12, 7, 1, -4, -4, 1, 9, 9, 0, -16, -30, -33, -23, -2, 21, 39, 43, 39, 38, 48, 67, 86, 100, 108, 109, 99, 81, 61, 42, 21, -4, -24, -26, -13, 1, 7, 13, 25, 41, 51, 51, 47, 41, 30, 11, -9, -25, -32, -31, -21, -4, 14, 31, 42, 52, 67, 90, 114, 130, 132, 128, 126, 130, 133, 127, 113, 99, 96, 105, 123, 142, 154, 153, 137, 115, 96, 86, 79, 70, 59, 54, 60, 72, 83, 90, 98, 112, 130, 146, 160, 177, 194, 201, 189, 160, 132]
5915A32j3%KjJPOjqj1pm%MMMMRJ4J7J6J1jj5k6l2l3k4pJ1J8J1krpnmmklj0j9k3j8kJ3K2L0
5896D5L2K9J7ql0m0l2j6pproOK0L0L1K8K5J9Lj6k9k7k0j9k2k4j4KJ5K2K3K4K3K0J4J2J5K3
5880A52K9K9K1Pj0k4l2l4k9k1j4j1ojK%lKJ0K1K4K3K1J7J1Jnrj2j5j8j7j0kknj0j1j3j9j8
5863A9qJ1K3K3Oj5l4l2j1K1M2L6Pk2m2m2l0j4kLOJ7K9L3K7K4K2J4lk2k9k5k1j6j3pkmpj0j0
5847e8pjPJ8K7K9K4J1mj3j7j4o%%j1k5k2mK0L0K6J4Lpj0nNRMnj0p%QJ4J0lk0k3j5%J2J6K1
5829B1K9L4L0J9NllKLLKJmj6k6l0k8k4j5lQJ4J0MJKNJ1K5L5L8K9J8Mpj7k2k3k1j8j8j8j8j2
5811B7nJKLOQLkljLMKkj2k1k2j5mQJ3Rkj8k4j2PK3K6K2J8K1K7L0K2RknljKNJrk1k5j7mRJ4
5791I5J5RNjqj5j7j1jNOONOMKjoj2k0k2k0j5j7k6l0k2pPJ1POPJ0J1J5K0K8K7J9MnmRK2K3J0
$$ y = [132, 119, 119, 121, 120, 121, 128, 134, 133, 125, 114, 107, 103, 103, 107, 111, 115, 119, 128, 142, 159, 175, 186, 185, 170, 144, 112, 79, 55, 48, 59, 77, 88, 86, 77, 70, 65, 61, 57, 55, 52, 42, 23, 0, -18, -20, -7, 15, 45, 77, 106, 123, 115, 85, 45, 13, -3, -10, -17, -26, -32, -26, -6, 24, 55, 83, 108, 127, 130, 114, 85, 58, 38, 19, -3, -27, -41, -39, -24, -2, 21, 45, 68, 88, 102, 114, 129, 152, 181, 210, 231, 238, 228, 204, 172, 138, 109, 88, 74, 63, 57, 56, 58, 58, 55, 57, 67, 88, 112, 135, 156, 173, 184, 185, 180, 171, 159, 144, 126, 109, 99, 97, 95, 90, 80, 69, 56, 37, 19, 11, 22, 45, 68, 74, 59, 25, -7, -18, 3, 45, 81, 88, 66, 24, -18, -48, -62, -64, -61, -55, -38, -9, 24, 51, 75, 97, 111, 108, 86, 57, 32, 11, -5, -18, -25, -27, -31, -38, -48, -58, -65, -66, -59, -41, -14, 15, 39, 50, 46, 33, 16, 2, -4, -4, -4, -15, -40, -62, -66, -46, -16, 10, 24, 27, 20, 10, 5, 10, 19, 23, 18, 8, 1, 1, 9, 23, 33, 30, 10, -13, -28, -28, -16, 0, 21, 50, 84, 114, 133, 138, 135, 132, 134, 137, 140, 142, 143, 139, 123, 97, 67, 39, 15, 0, -3, 5, 19, 29, 33, 34, 36, 41, 52, 77, 112, 150, 179, 197, 201, 194, 177, 155, 132, 111, 93, 75, 57, 39, 27, 22, 23, 25, 28, 34, 42, 45, 43, 40, 39, 42, 46, 48, 46, 34, 13, -9, -24, -28, -20, -7, 2, 0, -18, -42, -54, -47, -24, 2, 24, 42, 63, 90, 120, 142, 151, 149, 144, 141, 140, 142, 147, 148, 139, 118, 93, 76, 72, 81, 95, 110, 119, 124, 123, 115, 100, 83, 72, 71, 76, 82, 88, 93, 99, 103, 105, 104, 98, 86, 66, 44, 24, 9, -8, -34, -64, -86, -93, -86, -75, -68, -62, -55, -45, -34, -19, 1, 29, 56, 75, 79, 74, 70, 79, 101, 124, 134]
5772A34qj7j4mNMmj2j6j7j1lNPNLNJ2K2K7K7K4K1K2J8%k4m2m4m0l9l5j8PK0K0J4J6K1J2rk2
5755G2j7JJ3J6J1Mnj3k0k4k6k0j0jMQJ4K2K3J6PNJ0J9K7L0K4J4NJlqj1pKRJ8L0L8L3Rj5k3
5738B82j6olopqoqj2k3l4l9l5k4j3mJJmo%J1J9J8J4PKk%MNjoj3k2l2l8l1j3PJ9K2K1J4Mqj4
5719A7j8k1k0j2jJ2K2K6K6K1J9J9J7Rlppnrj1nOJ4J7J9K1J6MprmKK%%mqrqpj0j6j7j4j3j4
5701C0j4j3j0rpk%jpokNJ4J9K1J8J0joolnj1j7j7j0%OLoj2j0JJ2J6J7J7J7Rmj1j1ol%PJ4J6
5682D2J6J6K1K4K4K1K2K2J9J1lj5k1j8j2qpmKKmj2j5j1rj1j6j9j6oQJ3Kj5k8k3j2opj3j4j2
5665g2qojKKjml%NQJ3J9K4K3K1J7J7J9J6J2PLjjMJ2J9J5Moo%KKjklmoj4k1j9nJ4K3K2J8J5
5645A74J2QOKoj6k1k0j8j9j9j1k%nj4j9k1j5mQJ7K0K0J6J0MLPJ3J6J5J2J0J0J4J6Oj4k8k7
$$ y = [134, 126, 109, 95, 91, 96, 100, 96, 84, 68, 51, 40, 37, 42, 49, 54, 57, 62, 74, 96, 123, 150, 174, 195, 217, 235, 235, 211, 169, 125, 85, 46, 11, -7, 0, 20, 40, 54, 70, 91, 103, 94, 72, 55, 56, 69, 85, 96, 100, 95, 82, 62, 38, 12, -8, -18, -19, -15, -7, 7, 29, 52, 68, 75, 80, 90, 109, 136, 166, 190, 204, 209, 210, 207, 199, 188, 181, 183, 192, 210, 240, 278, 311, 320, 305, 282, 266, 260, 257, 251, 244, 236, 230, 222, 210, 187, 153, 114, 79, 55, 42, 38, 39, 40, 36, 30, 30, 41, 60, 78, 92, 99, 101, 99, 99, 103, 108, 107, 101, 88, 66, 34, -4, -35, -48, -41, -22, 0, 21, 35, 39, 31, 17, -1, -22, -42, -54, -55, -43, -21, 5, 31, 52, 71, 90, 107, 116, 113, 106, 99, 94, 85, 74, 69, 75, 89, 106, 125, 146, 162, 166, 159, 150, 146, 148, 150, 150, 150, 146, 138, 129, 121, 114, 104, 88, 71, 57, 44, 30, 16, 3, -7, -16, -23, -25, -25, -26, -33, -39, -41, -36, -22, -3, 18, 36, 46, 45, 39, 33, 30, 25, 14, -3, -20, -30, -30, -24, -21, -27, -39, -49, -48, -36, -20, -3, 14, 31, 40, 36, 25, 14, 8, 5, 5, 12, 26, 42, 58, 74, 95, 119, 143, 164, 186, 208, 227, 238, 235, 220, 199, 181, 169, 161, 154, 150, 152, 154, 150, 138, 123, 112, 103, 92, 76, 57, 41, 35, 43, 56, 58, 43, 15, -8, -20, -26, -33, -46, -60, -72, -80, -86, -87, -85, -83, -84, -88, -91, -91, -86, -78, -65, -46, -22, 1, 22, 39, 56, 75, 91, 103, 110, 113, 112, 111, 115, 127, 146, 161, 165, 159, 153, 153, 155, 157, 156, 154, 151, 147, 141, 127, 106, 87, 82, 96, 119, 141, 159, 174, 186, 194, 200, 202, 196, 180, 159, 139, 121, 102, 83, 72, 70, 70, 65, 51, 32, 11, -4, -8, 0, 17, 37, 57, 73, 83, 87, 90, 97, 110, 126, 141, 153, 163, 173, 187, 203, 209, 195, 167, 140]
5628A40j7j1j6k1j8j3rrql%momj%mnKJ2K0J8J6J4J1Mj0k3l1k6j6jJ4K2K3J5PNNJj0k0k5k4
5611fk1j5oKOJ0J6J7J1M%lj4k4k0mJ2J5J6J8K2K0J5J4J4J2Olj1j2pjKjkjMNMKkqj2j5j7j2
5592C0kQQ%o%J1J5J1J0J1J4J2Njnm%Jloolnj1j7j4qjJNPQJj0j8j1MJ9K8K8K3J5RQJ0J2OKL
5572A94PPkj4j9j6qlnpmMJ2J8J9J5J1OPPLoqkNPPRJ9L4N9Q9J28J82K35K45J60mj61k31k13
5556G86j62j21r2o1l8k5k1j7j4j4j2olljMLoj9j8pLNmj1j4j1pprnkmmKJ4J6Ooj1j3j3qLJ1
5538H4Pkoopok%JMJ0J8J5QLMNJloqnKRQM%%LPQNlj6k2k5k6l0l2k6j1PJ5J2KJOJ1J4J8K4K5
5517I9J8QPJ3J9J5Lj4k6l2l1l0l0k1oJ2K7L4L9L6K6J1pk1k8k8k7l5m0l5j3LKj0j1KJ7K7L2
5501EL0J8NLRJ2MlkOJ1PJJJ0K8L6K4Kj3j3jJ3K5L0K2J0Jlqk2l4l9l5k6j4ollkJlj4k4k4j7
$$ y = [140, 123, 112, 96, 75, 57, 44, 35, 26, 18, 15, 15, 11, 5, 1, 0, 0, -4, -9, -7, 5, 25, 43, 59, 73, 84, 88, 78, 55, 24, -2, -18, -19, -5, 17, 40, 55, 62, 67, 72, 73, 63, 43, 18, -6, -27, -42, -48, -46, -40, -30, -14, 3, 14, 18, 18, 15, 1, -23, -43, -47, -35, -20, -4, 14, 36, 56, 71, 85, 99, 111, 117, 114, 103, 91, 84, 83, 85, 84, 82, 81, 85, 90, 94, 96, 94, 86, 74, 59, 42, 30, 28, 36, 44, 44, 38, 38, 49, 64, 75, 85, 96, 110, 122, 127, 126, 121, 117, 117, 118, 115, 109, 103, 100, 95, 84, 67, 53, 45, 44, 45, 50, 57, 65, 66, 56, 38, 27, 31, 50, 78, 106, 129, 144, 153, 161, 171, 183, 189, 191, 194, 201, 208, 206, 192, 173, 157, 149, 146, 141, 134, 130, 134, 146, 164, 183, 198, 209, 215, 222, 229, 232, 226, 218, 216, 221, 228, 235, 244, 263, 297, 356, 445, 573, 755, 990, 1235, 1395, 1391, 1230, 999, 786, 624, 503, 411, 350, 312, 287, 266, 249, 235, 221, 209, 203, 200, 197, 196, 200, 203, 197, 178, 160, 153, 156, 161, 157, 146, 132, 121, 114, 107, 98, 93, 91, 87, 83, 85, 99, 115, 121, 115, 104, 91, 78, 70, 73, 84, 91, 89, 83, 77, 70, 64, 62, 62, 63, 67, 77, 95, 110, 118, 121, 125, 130, 131, 128, 122, 114, 109, 111, 120, 128, 132, 132, 132, 135, 142, 150, 155, 152, 136, 114, 89, 63, 33, 1, -25, -36, -29, -14, -2, 0, 1, 7, 18, 32, 50, 74, 99, 117, 125, 132, 145, 164, 179, 182, 168, 142, 110, 79, 49, 19, -2, -8, 4, 31, 65, 104, 140, 166, 177, 170, 149, 121, 93, 66, 31, -9, -44, -57, -54, -52, -62, -73, -71, -54, -27, 5, 35, 53, 58, 61, 70, 82, 86, 83, 81, 87, 98, 105, 106, 107, 117, 145, 181, 205, 207, 194, 181, 180, 193, 218, 248, 270, 280, 281, 278, 270, 248, 214, 175, 140, 114, 100, 94, 91, 88, 86, 87, 84, 70, 46, 22, 5]
5483Eqk%%MQR%j0kK1M2M9M5L4J6ok2k4k0j4q%MJoj2j2nMRjk1l4k6mJ2J5J3J2J5J8J9J5RJ1
5464A53K0L0K9K2J8J8J1nk3l6l9l6l1k4j1OJ7J7J1QRQjqmLKknlllOK0K8K6K0J5J6K3L1L1K2
5447C86J6K1L1L4L1K7L0L4M5O1P6P7P3P9J03J35J69K15K75L49M47N85P74J006J286J589J802
5436I756J706J148K16p54j419j655j570j344j083q34o29m83l86l07k30j68j25j01r5j05j20
5428A418j23j15j06j00q3n3k5j0lOMj0k4k4j8j3oJ2L1L7L7M4N2N3N1N6O5P2Q6J13J44J62J78
5414A908K12K60L10L71M67N91P33R19J207J616K128K733L357L697L290J902j16j998l115l370
5406A7102l078k581k062j598j231r66p69o08m81l85l08k42k01j93j96j85j65j47j34j14r2
5398A366p9o7m5j8mpqNK1L4M1M5M5M0M3N4O3O1N9P0Q9J06J27J53J79K06K52L20L95M69N67
$$ y = [5, -3, -5, -5, -5, -1, 7, 16, 16, 6, 4, 25, 67, 116, 161, 195, 211, 205, 183, 159, 139, 125, 117, 117, 121, 122, 116, 104, 92, 87, 91, 100, 99, 78, 44, 18, 14, 26, 41, 54, 66, 81, 99, 118, 133, 142, 153, 173, 203, 232, 254, 272, 290, 301, 296, 273, 237, 198, 162, 131, 107, 96, 102, 119, 136, 147, 155, 164, 172, 171, 163, 159, 162, 164, 162, 157, 154, 151, 148, 154, 174, 202, 228, 248, 263, 279, 302, 333, 364, 386, 402, 423, 454, 488, 519, 546, 576, 610, 655, 716, 792, 869, 942, 1021, 1124, 1259, 1428, 1643, 1918, 2267, 2714, 3299, 4073, 5079, 6365, 7954, 9756, 11462, 12610, 12826, 12072, 10653, 8998, 7428, 6084, 5001, 4167, 3538, 3055, 2669, 2362, 2132, 1964, 1839, 1738, 1643, 1538, 1418, 1295, 1180, 1074, 974, 891, 838, 813, 803, 800, 806, 810, 800, 776, 752, 734, 721, 715, 727, 758, 795, 832, 876, 928, 981, 1032, 1088, 1153, 1225, 1311, 1424, 1568, 1730, 1908, 2120, 2380, 2690, 3061, 3528, 4119, 4852, 5771, 6978, 8594, 10722, 13455, 16812, 20509, 23799, 25701, 25585, 23587, 20472, 17102, 14024, 11443, 9381, 7783, 6552, 5586, 4817, 4209, 3728, 3343, 3035, 2793, 2592, 2399, 2203, 2018, 1853, 1706, 1572, 1458, 1366, 1287, 1220, 1175, 1157, 1153, 1146, 1138, 1143, 1164, 1198, 1239, 1284, 1329, 1369, 1412, 1466, 1529, 1590, 1649, 1719, 1808, 1914, 2041, 2194, 2373, 2579, 2831, 3151, 3546, 4015, 4582]
5386D582P10Q97J135J476J974K620L403M322N208N515M559K172r14l516m859m994m452l702
5378A6136k957k304j792j411j117q81p05n71m50l41k76k60k58k45k23j97j69j34j08r3p5n0
5369A519l3l2l6l5l4m0m2k8nJ1J4J6K6M5O3P5O6M1K5M0Q0J17J41J66K00K47L13M05N18O40
5357D483P94J038J402J867K423L055L599L638K758R81j088k667l357l303k887k381j890j463
5350G002j135r02p27n87m82m02l29k61k11j80j53j23j00q6p8p1o7o2m9l4k8k6j8KJ8K1J5M
5339I51j2k3j8jJ1OnlJ2K8L6L6L3L1M2P3J14J56J95K42K99L66M57N86P53R69J244J567J807
5327I952J730J175K34p51j427j671j598j388j146r14p16n71m65l75k95k34j86j44j07q4p5
5319I44o7n7n1n4n7n4n4n4m8l5k2j3nMRMqk0k9l3k5qMKrk0l0l7l7k9j6j0pjJ0J7J5OkmMJ4
$$ y = [4582, 5292, 6189, 7324, 8800, 10774, 13394, 16797, 21119, 26327, 31842, 36401, 38573, 37659, 34143, 29284, 24290, 19838, 16136, 13179, 10875, 9083, 7672, 6555, 5674, 4969, 4398, 3948, 3607, 3331, 3071, 2813, 2568, 2345, 2148, 1979, 1845, 1737, 1644, 1569, 1519, 1486, 1454, 1418, 1383, 1349, 1309, 1267, 1239, 1234, 1245, 1259, 1275, 1301, 1346, 1409, 1484, 1550, 1591, 1616, 1656, 1736, 1853, 1994, 2160, 2360, 2607, 2920, 3325, 3843, 4483, 5277, 6315, 7717, 9584, 12007, 15062, 18661, 22299, 25057, 26038, 24950, 22283, 18926, 15623, 12736, 10355, 8465, 7002, 5867, 4965, 4238, 3651, 3169, 2767, 2438, 2177, 1966, 1786, 1633, 1510, 1410, 1324, 1246, 1175, 1108, 1046, 997, 963, 935, 909, 891, 893, 911, 932, 947, 951, 939, 916, 898, 897, 908, 914, 909, 906, 918, 946, 982, 1018, 1051, 1082, 1124, 1197, 1311, 1467, 1662, 1904, 2203, 2569, 3026, 3612, 4365, 5334, 6578, 8145, 9952, 11682, 12857, 13091, 12340, 10913, 9242, 7644, 6256, 5110, 4196, 3480, 2909, 2444, 2069, 1774, 1540, 1354, 1210, 1103, 1019, 944, 877, 820, 769, 715, 658, 604, 550, 496, 448, 413, 391, 378, 373, 377, 386, 390, 382, 362, 333, 300, 275, 267, 271, 273, 264, 244, 214, 177, 140, 111, 95, 85, 78, 77, 87, 104, 119, 125, 123, 119, 123, 137]
5302A37K6L3L2K1NonJlj1j2%J1J2PMNKlj0j6j8j9j7j4rLJ7K4J6Kmjlj6l4m2l6j7LJ8K3J9J1
5284A36MKPJ1J1Mpj4j6j5j1plLNNmj0rjLlnOK2K5J3nj5j9j8rJRRNLKMRJ5J5Prk1k5k0j2j0
5265F8j1rlQJ4J5J2ROO%j2k9l6k8pQJ4J7J7J4ROJ1J7J8J2M%jJmj6l2l8k8j2MJ5K2K6K5K1K3
5247A56K4K3J4Knj1j4j8j8j6j5j7k0j6nMPOK%%lnnk%Jkqj0pjNJ1J2Mj0j7qRJ7J7J1PLlmnl
5227H7%PJ4J4RL%lj1j4qMJ2J8K5K9K9K3J4Krj7k0k4k9l1l2l3l4k5lJ7K9K6J9Qlpooj4k7l1
5210Bk4j2JRNoj2kJ3K0J5J3J4J3N%jKJKJ0K0K1J1kj2j6j3j0ppolmrj1j3j4j7j2LK3L0K8J9
5192F7J3OkokOJ2Ork3k1mJ9L0K4RjmJOJ1RN%qj9k9l1k9k6k4j8j1kLMQJ4J8K0J6J3QQRQPPL
5172A01lj2j5rjQJ5J8J3Jj3j8j7j2qprj5k0k3j9qRK6L3K9J5QRQjj4k0j6qkLOJ2J9K5K5J6j
$$ y = [137, 163, 196, 228, 249, 254, 248, 243, 244, 241, 230, 218, 218, 229, 241, 248, 252, 257, 259, 256, 246, 230, 212, 193, 176, 162, 153, 156, 173, 197, 213, 215, 211, 210, 207, 191, 157, 115, 79, 62, 65, 83, 106, 125, 136, 140, 142, 149, 160, 171, 175, 168, 154, 138, 123, 112, 105, 102, 105, 110, 115, 111, 101, 92, 91, 94, 91, 86, 92, 114, 139, 152, 147, 132, 113, 95, 86, 87, 96, 105, 110, 113, 115, 119, 128, 143, 158, 165, 156, 135, 110, 90, 78, 68, 57, 48, 45, 53, 67, 82, 94, 103, 109, 115, 115, 103, 74, 38, 10, 3, 11, 25, 42, 59, 73, 82, 88, 99, 116, 134, 146, 150, 150, 149, 150, 146, 130, 98, 60, 32, 20, 24, 39, 61, 87, 112, 133, 156, 180, 203, 217, 219, 214, 203, 189, 171, 153, 137, 122, 105, 85, 69, 64, 68, 75, 81, 83, 83, 83, 80, 75, 70, 68, 68, 69, 67, 59, 49, 42, 41, 46, 57, 69, 73, 63, 46, 38, 47, 64, 81, 92, 99, 102, 99, 95, 90, 87, 87, 94, 108, 122, 131, 134, 134, 131, 120, 106, 98, 102, 114, 132, 157, 186, 215, 238, 252, 254, 245, 228, 208, 184, 155, 124, 92, 59, 25, 0, -3, 14, 43, 69, 88, 96, 93, 86, 80, 74, 60, 33, 2, -22, -34, -33, -24, -19, -25, -37, -39, -26, -6, 9, 22, 36, 49, 54, 54, 53, 55, 56, 58, 68, 88, 109, 120, 118, 106, 90, 77, 67, 60, 53, 47, 44, 40, 31, 20, 7, -7, -24, -36, -33, -10, 20, 48, 67, 80, 86, 84, 78, 76, 82, 94, 100, 91, 68, 47, 43, 62, 92, 116, 125, 124, 120, 121, 127, 138, 147, 152, 152, 144, 125, 96, 65, 36, 10, -14, -32, -43, -45, -42, -38, -30, -16, 2, 22, 38, 51, 59, 67, 76, 84, 91, 98, 101, 98, 86, 71, 62, 61, 69, 84, 102, 115, 116, 103, 85, 68, 56, 48, 41, 32, 17, -3, -26, -45, -53, -44, -18, 15, 44, 59, 67, 76, 84, 83, 69, 49, 33, 25, 23, 26, 32, 44, 63, 88, 113, 129, 128]
5155A28j2j1olpj2k0k3k2j0NJ3Opj4j5j0JJ8L6M4M0K4Rkl%Jlj1j7j3oNJ2J2RKk%K%j1k4l0
5137G3k4j2jMJj%OQlk0l0k0nRJ1QJ0J2J3J2J7L0M3M8M0K4J0kj0j8k7l5l6k6j2lnj5j8qJ0K3
5119H1K3J2Jk%MLjlJMNOJ2K2K7J7jj9l0l2k4qPJ2Pkj0j1j0qqrqqqj0oMJ0Nj0j9j1QK4K2J0
5100F9j%OPmj6k2k0j8j3qLQNqk0k4j4JJ7K6K8L0K8J9Nrj7j9j6j0ljJKjlojOJ1J2J4J4Qkj0
5081E4oQJ5J0mj5j4kJ4K5K6J2j1l3m2l6k0j0onkMQRJ1J4K0K0J4Mnj2j5j2jJ8L1K8J3JJRJ5
5064A33J2LnqjJ3K4K7J9Oqj8j9j6j0rpJRJ2J2J5K2K7K7K6L1M0M9O5R4J32J67J82J64J05J3
5049A329q3j45j62j48j28j15j02q5o8n5m7l9k9k3j6r%ONmj5k5k6j6nKL%%mlJOOjj3k5k9k6
5033h8j4NK8M5M2K6Ln%RJ1Nkqj6k5k9k9k7k2j1MJ8K2K2J5QLMRPoj9j6%P%j1j3qomNJ5K1J9
$$ y = [128, 116, 105, 99, 96, 89, 77, 57, 34, 12, 2, 7, 20, 26, 19, 5, -10, -20, -19, -1, 35, 79, 119, 143, 152, 150, 147, 147, 148, 145, 134, 117, 104, 98, 103, 115, 127, 136, 138, 136, 136, 138, 138, 127, 103, 73, 49, 37, 36, 40, 41, 40, 40, 46, 54, 51, 31, 1, -19, -24, -15, -4, 4, 14, 26, 39, 51, 68, 98, 141, 189, 229, 253, 263, 261, 251, 233, 206, 171, 135, 109, 97, 94, 89, 74, 56, 48, 58, 81, 104, 116, 117, 115, 115, 119, 122, 121, 118, 119, 123, 128, 134, 146, 168, 195, 212, 211, 192, 162, 130, 106, 98, 105, 117, 124, 122, 112, 101, 91, 83, 75, 66, 58, 50, 42, 32, 26, 30, 40, 45, 35, 16, 5, 13, 37, 59, 69, 68, 68, 74, 81, 77, 61, 39, 19, 1, -12, -20, -17, -9, -4, -12, -32, -56, -70, -69, -52, -26, 2, 32, 60, 79, 84, 75, 58, 39, 23, 13, 10, 9, 10, 12, 11, 8, 2, 1, 7, 18, 30, 44, 58, 66, 64, 54, 48, 56, 71, 81, 77, 62, 48, 46, 60, 85, 111, 123, 112, 79, 37, 1, -19, -29, -35, -40, -42, -38, -30, -21, -10, 4, 24, 44, 58, 62, 57, 45, 30, 18, 17, 35, 66, 94, 107, 108, 109, 118, 133, 145, 148, 143, 135, 134, 147, 171, 198, 217, 223, 215, 197, 178, 162, 152, 143, 136, 137, 146, 158, 170, 185, 207, 234, 261, 287, 318, 358, 407, 472, 566, 698, 865, 1047, 1211, 1316, 1329, 1246, 1101, 939, 791, 663, 548, 446, 361, 293, 238, 191, 152, 123, 100, 84, 75, 75, 81, 86, 82, 67, 42, 16, 0, -5, -3, 0, 0, 0, -4, -7, -6, 0, 6, 5, -8, -33, -62, -88, -102, -97, -69, -24, 18, 44, 47, 42, 42, 51, 62, 67, 65, 57, 41, 16, -13, -42, -69, -91, -102, -98, -80, -58, -36, -21, -13, -10, -6, 3, 10, 4, -15, -31, -31, -24, -24, -35, -48, -56, -62, -66, -61, -46, -25, -6]
5015fJ6J5J1OMLMNMKKQK0K9L2K5J4Kqj2q%MjomLKrk2k6j8rqj2j3p%OQJ1J4J7J5J0Lk%OJ0O
4994A46jj0j8k3k2j6j0qrmPJ1OkjRK2L2K8K0J0Njj3k5k6j9j1j1oPK3K6J3lj2j1pjLLmj0qM
4976H3J9K4J6NmnllJRK1K2J3Jrrolklljkoj4k3k6k3j7rjJ0K0K6K4J1rk7l5k8qJ6L1L0J6kj6
4958A01k5k7k6j9rlJJJQK2K9K3J1OJ0K2L0K5Mk6m5m3k4%J9K7L0K6J6Jj0j4j2rrroNJ5J5Q%
4940A40loomPJ4Pj1k9l6l3k5j4jRK2L2L6K8J0j3k8l3k9k1j3j2j3j5j7j7j6qJRJ0J0RJ2J3J3
4924b1PMJlj1k0k4k1j0NJ2J3PQJ5K5K4J7ROKpj7j7pKRJ2J0OKLQJ4J5J3Ook1k9k7j4jOJ1J3
4905B9J3Pjrj3rl%%%KJ0J8J9Qnj1o%kqpJQJ3J7K2J9RlpkQJ8K1J2pk3l0k7k0j5j1j0j2j0lK
4886BMj%MLnj2rjN%mkQJ3J3OJkpj1qnKPJ6K6K9K2Oqj2nPJ2MnqJPLnj0j0j2j6j6j4j6j8j2P
$$ y = [-6, 10, 25, 36, 42, 46, 49, 53, 58, 62, 64, 66, 74, 94, 123, 155, 180, 194, 196, 188, 176, 168, 168, 172, 171, 165, 161, 164, 166, 157, 135, 109, 91, 82, 74, 62, 49, 42, 42, 48, 56, 67, 81, 98, 113, 123, 126, 124, 124, 130, 140, 146, 145, 135, 117, 94, 72, 56, 46, 38, 29, 25, 32, 43, 49, 47, 46, 55, 77, 109, 137, 157, 167, 172, 171, 158, 133, 107, 88, 77, 66, 60, 67, 90, 116, 129, 126, 114, 103, 96, 95, 98, 101, 97, 87, 79, 83, 102, 126, 142, 147, 143, 138, 135, 132, 133, 142, 163, 185, 198, 199, 190, 181, 175, 172, 170, 167, 164, 163, 161, 155, 141, 118, 92, 69, 52, 43, 42, 52, 72, 98, 122, 133, 124, 97, 62, 34, 26, 42, 73, 103, 119, 117, 101, 76, 49, 23, 4, -5, -8, -7, -6, -5, 3, 25, 54, 77, 88, 94, 104, 126, 156, 181, 185, 159, 114, 71, 47, 47, 66, 93, 123, 149, 165, 166, 156, 142, 130, 121, 112, 103, 97, 102, 117, 132, 140, 140, 137, 131, 125, 121, 128, 142, 149, 138, 109, 73, 40, 15, 1, 0, 9, 31, 63, 99, 127, 137, 124, 96, 63, 34, 13, 0, -12, -25, -40, -57, -74, -90, -98, -97, -88, -78, -68, -59, -47, -34, -21, -14, -10, -9, -12, -23, -43, -67, -88, -98, -93, -81, -68, -61, -53, -38, -13, 11, 28, 37, 43, 45, 38, 21, 4, -3, -1, 8, 20, 30, 36, 38, 41, 49, 63, 78, 91, 97, 91, 70, 41, 14, 0, -1, 5, 16, 29, 42, 49, 48, 39, 26, 17, 14, 14, 14, 14, 16, 26, 44, 63, 71, 66, 55, 49, 49, 47, 39, 32, 33, 41, 54, 71, 93, 112, 121, 118, 111, 109, 117, 135, 156, 168, 161, 138, 108, 81, 61, 46, 35, 25, 13, 3, 0, 2, 6, 5, 5, 9, 12, 7, -5, -14, -15, -10, -10, -14, -16, -8, 5, 18, 24, 25, 23, 16, 5, -3, -8, -6, 1, 17, 43, 72, 94, 100, 92, 80, 75, 82, 94, 98, 93, 85, 86, 93, 96, 91, 81, 71, 59, 43, 27, 13, -3, -21, -33, -26]
4865b6K5L3L0K6K5K5K1J4PJoj4j7j2qrj8l0l9l9k9qJ5K8K7K2J4PJnqj1j7k1j5kOJqqLJ4J5
4848A0QNJ4K7L1J7kj2j5k2l4l7k8j0LJ0J0KqrJJ2J4J1J2J5J2KjLN%j0j1JK0L0K5Qnj2j7k2
4831E3k5j9rmqj2j0%J0J6J7J7J5J3J1Lnj0j1rqn%NJ2J8J8J1nj3j0%RJ1P%oqollkjJKlj0j6
4811B8j3nLM%kNJ3J5J1Jpqpnpj3j1mKKkmm%OPQNJJkrj4j2mL%j0j7j6nJ0J6J4J2J3J5J5J3K0
4791F2K7K7J4lj4k0k2j8j3lPJ6K3K0J0krj0p%Ljj1j7j5ql%NRJ0J2J3J7J3Lrj1nJ%pj6k2k3
4773B3j7lRJ1Jj1j3jRJ8K5L1L4K9J7Olj2j7j6j3j1rjJ5K9L3K6J4jj7l3m0l6k0%J6K1J7RJj0
4756A10j7k0j5j0j0j0%J6K9L0K3J3MkKJ4K6K8J9J1NJnj0j2j3j8k1j8j3j2j0qkjlnprrnNJ3
4739H4J4J3J4J4Ooj8j9j5j0pmlqj6k4k5k3j8pJ0K5K7K0J0L%mqojPJ2J5J5J2RRQNORJ4J2Nr
$$ y = [-26, -1, 32, 62, 88, 113, 138, 159, 173, 180, 181, 175, 161, 144, 132, 124, 115, 97, 67, 28, -11, -40, -48, -33, -5, 22, 44, 58, 65, 66, 61, 53, 42, 25, 4, -11, -13, -7, -6, -14, -22, -19, -5, 10, 18, 23, 37, 64, 95, 112, 110, 98, 83, 61, 27, -10, -38, -48, -45, -35, -25, -23, -31, -40, -39, -27, -13, -2, 10, 25, 37, 39, 38, 41, 46, 46, 36, 25, 26, 46, 76, 101, 109, 104, 92, 75, 53, 28, 9, 0, -4, -12, -24, -34, -34, -24, -8, 9, 26, 41, 54, 65, 68, 63, 53, 42, 33, 25, 20, 20, 25, 37, 55, 73, 84, 79, 66, 56, 56, 65, 76, 83, 83, 77, 69, 63, 60, 57, 55, 54, 55, 57, 54, 44, 28, 15, 10, 13, 17, 17, 15, 20, 33, 48, 59, 60, 53, 45, 38, 33, 26, 13, 2, -2, 0, 2, 0, -4, -8, -8, -2, 5, 13, 18, 19, 20, 18, 9, -5, -17, -21, -18, -18, -28, -45, -61, -66, -56, -40, -26, -14, -1, 14, 29, 42, 62, 89, 116, 130, 127, 113, 93, 71, 53, 40, 37, 44, 60, 83, 103, 113, 111, 102, 92, 85, 85, 88, 87, 76, 59, 44, 36, 33, 33, 38, 47, 57, 69, 82, 99, 112, 115, 106, 95, 90, 91, 91, 84, 68, 46, 23, 6, 3, 12, 23, 24, 13, 0, -1, 8, 26, 51, 82, 116, 145, 162, 168, 165, 153, 136, 120, 107, 96, 87, 86, 101, 130, 163, 189, 203, 202, 185, 152, 112, 76, 56, 56, 72, 93, 110, 119, 120, 110, 93, 73, 58, 48, 38, 28, 28, 44, 73, 103, 126, 139, 143, 141, 143, 157, 183, 211, 230, 241, 246, 247, 242, 232, 220, 207, 189, 168, 150, 137, 125, 115, 107, 105, 104, 101, 96, 89, 80, 71, 66, 71, 84, 98, 111, 125, 139, 145, 139, 121, 102, 87, 77, 70, 66, 63, 55, 39, 15, -10, -33, -51, -58, -48, -23, 4, 24, 34, 37, 37, 33, 25, 19, 18, 25, 37, 52, 67, 79, 88, 97, 105, 110, 116, 125, 139, 151, 156, 147]
4720A47k2k6j7kQKj3k4k3j2%NKknkllMJ9L0K6Qj1k4l1l2k5rQK0K5L0K7K1J4Qmj6k3j9j4j2
4703C0j1nMOjj1j5j9k2k1j4jQJ3J6J9K4K9L2K7K0J5RLpj8k0j4jLnj5j6nPP%qrqmk%knj0j4
4684a1k0j8nQJ0jj3j8j7j0KK0L5M0L9L4K9K5J7Mj3l2m1l3j0J0J4Mqj4j3j2j7k3k3j4mJMNQ
4668f1J1J8K1J6J0OJ4K6K3%l0m7m0k2JJ5J7J6RLljJ0K3K4J0j1k5k8j8j0oj1j2oNJ1RMJNJ2
4651a1J5J4MkJQJ0JrrJJ0J4J5J4J2Mpj5j5rjLkj0j7k0k3k3j5%J7L1L0K0PKKJ%lJJmj0j5j7
4632Aj6j7j4rjPJ9L0L5L5L2K5J6Mqj5k1k4k3j4JJ3J7J2Mkk%Kjrj4j5j2poomKML%KRJ4J3On
4613F1rpkLNQJ7K8L8L7K8Rj7l8m7m4l8l5l4k9k2j5j1j0pkQJ6J9J5J2J5K1K4J5MprkNJ0PLj
4595B2nljLPRJ3J9K2J5OKMJ0J3J4Ppk5l4k8j3nnnMJ1J0kj5j9j6pkkmlMJ4J9J5Npk0k8k5rJ2
$$ y = [147, 125, 99, 82, 80, 88, 90, 77, 53, 30, 18, 18, 23, 25, 23, 18, 16, 13, 10, 14, 33, 63, 89, 97, 86, 62, 31, -1, -26, -35, -27, -7, 18, 48, 75, 96, 110, 118, 114, 98, 75, 56, 42, 30, 19, 14, 18, 24, 23, 12, -3, -22, -44, -65, -79, -80, -72, -59, -43, -24, 0, 29, 61, 88, 108, 123, 132, 135, 128, 110, 90, 76, 75, 78, 73, 58, 42, 37, 44, 51, 51, 43, 34, 26, 22, 20, 20, 18, 13, 3, -11, -31, -49, -54, -46, -36, -37, -50, -68, -85, -95, -93, -73, -38, 2, 41, 75, 104, 129, 146, 150, 137, 105, 64, 31, 21, 31, 45, 49, 41, 27, 14, 2, -15, -38, -61, -75, -79, -78, -74, -69, -61, -50, -32, -11, 5, 15, 21, 35, 61, 84, 84, 54, 7, -33, -55, -54, -39, -22, -6, 3, 6, 3, 2, 12, 35, 59, 69, 58, 33, 5, -13, -23, -29, -40, -52, -58, -53, -42, -33, -29, -28, -23, -11, 4, 18, 22, 20, 21, 29, 39, 40, 31, 22, 23, 33, 47, 62, 76, 88, 92, 85, 70, 55, 46, 45, 48, 46, 36, 19, -1, -24, -47, -62, -62, -45, -14, 16, 36, 43, 45, 47, 48, 48, 45, 46, 47, 43, 33, 18, 1, -15, -32, -46, -55, -56, -49, -30, 0, 35, 70, 102, 127, 143, 147, 139, 124, 103, 79, 56, 42, 43, 56, 73, 85, 89, 87, 85, 85, 87, 86, 77, 63, 48, 36, 29, 23, 17, 13, 15, 19, 22, 22, 24, 33, 47, 60, 66, 61, 52, 45, 43, 46, 51, 59, 76, 104, 142, 179, 207, 216, 199, 161, 114, 70, 32, -3, -37, -66, -88, -103, -114, -124, -131, -133, -125, -109, -90, -75, -63, -48, -27, -3, 12, 16, 9, 0, -2, 3, 13, 20, 23, 22, 17, 14, 13, 16, 23, 32, 45, 64, 86, 101, 107, 109, 113, 123, 136, 150, 157, 150, 125, 91, 63, 50, 45, 40, 35, 39, 50, 60, 58, 43, 24, 8, 1, -1, -3, -7, -10, -6, 8, 27, 42, 47, 40, 20, -8, -33, -42, -30]
4576c0K2J4JqrlLRRJj3k9l3k5qOJ2J1J1J7J7Nj5k9k3mJ3K3K7K4J5PLJmrqjKLlljLOPQQKoj3
4555A3j3nNJ2Ooj6j9j8j5j0%J0J2PMJ0K2K6K1OnojNJ0J5K0K1J5Pjqj4j5j0opj1j7k2j9j0k
4537ijpqjJ0J0KjNQLonJJ2J6J5J3RKlkKRJ6K3K4J7OjJLjrj1lMPOMKmj4k5l1l4l0j6kPPJJK
4516B4LOJ1J5J5J0Knj1k0k5k9k8k1oJ6L5M4M1K9J8J2J0Kj2k5k8k3j4rok%jopokknmLJ0J7J4
4498D0J1PKqj8j9j3nkknprnjMMJJOJ2J7J6PjmkLMJrj8k1k1j6rkPJ3Rkj3k1j9j0LQJpkJ2K2
4477f0J9J5J8J9J4Mnj0j3pKJ1J0Klkmj3k2k2j8j5j2nNRMnj1r%RJ4J5J0M%LJ4K6L4L8L5K6J1
4459A35lp%J3K2K4J7Pmj0j1rppj3j9k0j0KMJJNMoj2rKQPONlj6k1j4%QJ1J2J4J3Ojrk0k9l3
4440C4k0MK9L5J8nk1k4j8j1oJQJ1J0LorlJ0K0K4J9J0jrj4j7k2k4k3j7j0jRJ8K2J6RNKoj7k3
$$ y = [-30, -8, 6, 7, -1, -10, -13, -10, -1, 8, 9, -4, -33, -66, -91, -99, -93, -81, -70, -59, -42, -25, -20, -35, -64, -87, -91, -78, -55, -28, -4, 11, 18, 21, 22, 18, 9, 1, 0, 2, 5, 2, -1, -2, 1, 7, 14, 22, 30, 32, 26, 13, 0, -5, 0, 12, 18, 12, -4, -23, -41, -56, -66, -66, -56, -44, -37, -33, -23, -1, 25, 46, 52, 47, 41, 40, 45, 55, 70, 90, 111, 126, 133, 132, 124, 110, 95, 85, 79, 72, 61, 44, 22, 3, -7, -9, -10, -17, -25, -26, -16, -6, -4, -5, 0, 8, 11, 5, 0, 1, 13, 29, 44, 57, 66, 68, 65, 63, 65, 74, 90, 113, 137, 154, 160, 159, 160, 163, 162, 153, 142, 139, 143, 150, 156, 160, 162, 158, 144, 119, 88, 54, 24, 8, 6, 13, 20, 21, 22, 24, 27, 33, 44, 59, 74, 84, 86, 81, 70, 50, 25, -4, -32, -53, -59, -43, -8, 36, 77, 106, 124, 136, 146, 148, 136, 111, 83, 60, 46, 37, 31, 29, 29, 28, 22, 15, 9, 7, 5, 0, -4, -1, 9, 26, 40, 51, 58, 60, 52, 34, 15, 2, -3, -5, -7, -12, -19, -28, -33, -34, -30, -26, -25, -24, -18, -6, 11, 27, 34, 33, 29, 27, 30, 34, 35, 26, 8, -13, -34, -50, -59, -61, -54, -41, -32, -34, -47, -68, -87, -97, -94, -86, -85, -92, -94, -82, -60, -41, -26, -8, 11, 25, 29, 24, 14, 1, -6, -4, 7, 17, 19, 16, 14, 10, -3, -25, -47, -65, -80, -92, -97, -92, -83, -79, -84, -95, -104, -104, -95, -81, -66, -56, -52, -52, -49, -35, -9, 25, 63, 98, 124, 135, 132, 125, 125, 138, 160, 184, 201, 208, 204, 194, 183, 174, 167, 160, 147, 128, 108, 98, 100, 104, 105, 106, 111, 115, 109, 97, 88, 90, 98, 105, 111, 116, 113, 97, 76, 62, 62, 70, 81, 93, 107, 120, 126, 125, 116, 96, 67, 34, 14, 18, 47, 82, 100, 95, 74, 50, 32, 21, 15, 16, 24, 35, 45, 48, 42, 33, 30, 40, 60, 84, 103, 113, 112, 103, 89, 72, 50, 26, 3, -14, -24, -25, -16, 2, 24, 40, 49, 54, 56, 50, 33, 10]
4422A0k2j8j1nJ%LPJ0Kqj1jQPK%NJ0J0RJ5K0J9J3QPPPNNLmj1j5j6j7k0j9j1LJ2J0NJLOJ1J4
4402F9J1Kmn%Jlpqnpj0rpqj3k1j6nJ%lLJ3K1K1J4Jj4j9j7rpqlJ0K3K9K8K2QmrnJJJQJ5J0o
4382H1k2k4j5kOJ4J7J7J4J1RRP%j2k1k0qNOjlKJ1J4Npj2nPJ2Mrj6j6j0mmpj3j9j6oMMpj7j7
4362e4nPJ3J4J6K1K4K1J3QRJ0QKorrj0j0j1j4j6j5j0pmnJJ2J8J8RJlmqj1j4j0mPJ1Oj0k5l5
4344f0k9j7mNORJ6K5L2K5J1pj5j1MK3L5L2J2j2k7k6j7p%NJ3J9J9J2Kpj1nJ1L6N2M6K1pk6k7
4327A56k0j2j0j2j0mj%%QJ8K2J6OklKJ1J6J3OLONrk6l7l5k3j0LJ4J6J0lj3j6j1nJMOPNMjk
4308I3loj6k7k7j1J2K3J5ok3k4j4LJ5K5K6K4J9J0NJjjjKNKnj2j4p%Llj2j9j9j5rlj%JMRJ7
4289C5K5K9K5J1lj0oJjj3j9j2KJ2J1J2J9K8L2K3Pqj4j3rpqj3k4l3l4k6j2mpj3j4mJ0K2K7K4
$$ y = [10, -12, -30, -41, -46, -45, -45, -42, -35, -25, -23, -31, -42, -43, -35, -28, -26, -26, -21, -11, -1, 8, 23, 43, 62, 75, 83, 90, 97, 104, 109, 114, 117, 113, 102, 87, 71, 54, 34, 15, 4, 7, 19, 29, 34, 35, 38, 44, 55, 69, 80, 82, 78, 73, 73, 74, 71, 64, 56, 51, 44, 34, 25, 18, 10, -3, -24, -40, -45, -44, -44, -47, -44, -31, -10, 11, 25, 26, 12, -7, -24, -33, -40, -48, -51, -41, -18, 11, 39, 61, 69, 65, 56, 51, 52, 53, 54, 62, 77, 87, 81, 59, 35, 20, 18, 24, 38, 55, 72, 86, 97, 106, 115, 122, 122, 110, 89, 69, 61, 66, 72, 71, 68, 70, 81, 95, 100, 93, 81, 76, 83, 95, 99, 90, 74, 58, 48, 44, 40, 33, 20, 1, -15, -21, -17, -13, -20, -37, -54, -59, -52, -39, -25, -9, 12, 36, 57, 70, 78, 87, 97, 105, 107, 101, 92, 83, 73, 63, 52, 38, 22, 7, -3, -10, -14, -19, -18, -6, 12, 30, 39, 40, 37, 33, 25, 14, 0, -10, -14, -7, 4, 10, 0, -25, -60, -89, -106, -110, -105, -99, -90, -74, -49, -17, 8, 19, 12, -3, -14, -10, 13, 48, 80, 92, 80, 53, 27, 10, 3, 3, 8, 21, 40, 59, 71, 73, 66, 55, 50, 61, 97, 149, 195, 216, 209, 183, 156, 136, 124, 114, 102, 92, 88, 87, 87, 87, 95, 113, 135, 151, 157, 155, 152, 154, 165, 181, 194, 200, 203, 209, 214, 205, 179, 142, 107, 84, 74, 77, 91, 107, 117, 114, 101, 85, 74, 69, 70, 74, 80, 87, 92, 96, 95, 93, 90, 84, 68, 41, 14, 3, 15, 38, 53, 47, 24, 0, -14, -11, 4, 29, 55, 79, 98, 108, 113, 114, 113, 112, 111, 113, 118, 120, 115, 103, 89, 82, 82, 85, 82, 70, 51, 32, 17, 8, 5, 4, 4, 5, 9, 18, 35, 60, 89, 114, 125, 122, 112, 106, 107, 106, 93, 74, 62, 64, 76, 87, 99, 118, 146, 178, 201, 208, 200, 186, 173, 164, 157, 149, 136, 112, 79, 45, 19, 7, 3, -4, -17, -31, -35, -25, -3, 24, 48]
4272D8J2lj2j2qpqn%PQOJklqj7k7k9k6j6qMJ9L1L3K5J4MlkLJ0J0%j1j3pLRRJkKJ3J7J3%qj1
4252E4j1mLPKoo%MjrqkLJjJ%koqjJ2K2K4J7RKjl%NJ2J3J0PLlj1j3j1j2j7k5k9k8k3j4kNRJ5
4232a7K2L1L3L1L2L6L7L0J8Mqj9k7l1k9k2j4pmlmnj2k0k5j7KK0K5J9J5J4J4Lj4k3j8mNNlj0
4215F0j5j7k2k4k4j9rkQJ8K6K8K8K5K0J2Jpj3j4j0mNRQKlopmjLOMLMNMkrj5j8k1k3k5j8oJ
4195e8kprmLPQKqj5j2%J5K4K7K4J7J0NKJmpj1roKRJ4J3P%qj6k1k2k1j7j3qnlNJ9L1K6Pj4k5
4176d7k0rKJ0J4J6J2OKLJ0J3J3Nkm%QK1L1K9J6Jrj4j9k3k1j0JJ0J5J5J0QJ1J8J6Qkprj5k0
4158I3k1j6j7k1j8j1oj3k6l4l0k1j1kRJ8K5K6K3J6PQJ4K0K4K0K0K0J6Npj1pkLOJ0RPPRJ1P
4141A59Kpj8l2l7k5jK0K3Rj2k2k2j3pnnnllpj0rj0j1j2j2roMJ5K3J9J0MQJ6K2J8Opj8k3k3
$$ y = [48, 60, 57, 45, 33, 25, 18, 10, 5, 5, 12, 20, 26, 27, 25, 22, 14, -3, -30, -59, -85, -101, -109, -105, -86, -55, -22, 3, 17, 21, 18, 16, 19, 29, 39, 39, 28, 15, 8, 11, 20, 29, 30, 28, 30, 43, 60, 73, 73, 65, 54, 43, 39, 42, 49, 51, 45, 39, 39, 43, 42, 33, 25, 23, 26, 27, 26, 27, 27, 25, 19, 11, 10, 22, 44, 68, 85, 94, 96, 95, 92, 92, 97, 109, 122, 132, 139, 142, 139, 128, 115, 104, 92, 75, 50, 21, -7, -30, -44, -46, -41, -32, -17, 5, 36, 69, 100, 132, 168, 205, 235, 253, 257, 249, 230, 203, 172, 143, 121, 107, 100, 96, 93, 89, 84, 72, 52, 27, 10, 12, 32, 57, 76, 91, 105, 119, 122, 108, 85, 67, 63, 68, 73, 70, 60, 45, 28, 6, -18, -42, -61, -70, -72, -64, -46, -20, 8, 36, 61, 81, 93, 94, 87, 74, 60, 50, 46, 51, 60, 68, 70, 67, 61, 54, 50, 49, 52, 58, 62, 65, 69, 74, 78, 76, 67, 52, 34, 13, -10, -35, -53, -59, -58, -60, -67, -76, -80, -77, -70, -62, -60, -68, -83, -95, -95, -80, -56, -29, -5, 12, 22, 27, 29, 30, 26, 19, 8, -1, -7, -5, 4, 18, 31, 38, 38, 30, 14, -7, -29, -50, -67, -80, -88, -93, -96, -91, -72, -41, -15, -8, -22, -47, -67, -76, -74, -64, -50, -34, -22, -16, -14, -11, -1, 12, 25, 30, 28, 24, 24, 32, 53, 84, 113, 129, 130, 121, 107, 88, 65, 44, 34, 35, 45, 60, 75, 85, 93, 104, 122, 138, 146, 144, 137, 128, 113, 93, 72, 56, 39, 18, 0, -11, -17, -30, -56, -90, -120, -141, -152, -154, -145, -127, -102, -76, -53, -37, -30, -22, -8, 12, 36, 56, 76, 96, 112, 117, 110, 99, 92, 90, 93, 99, 109, 118, 125, 132, 141, 152, 159, 161, 154, 136, 104, 67, 42, 41, 61, 84, 93, 81, 59, 37, 24, 17, 12, 7, 2, -1, -4, -11, -21, -30, -40, -51, -63, -75, -84, -90, -86, -71, -48, -29, -19, -15, -7, 9, 31, 49, 55, 48, 30, 7, -16]
4123a6k0j2mNJ5K4K7K6J9Pkj0j7k4k7l0k9l0k6j6mPJ1J4J3J0OOJ2J9K2K4K3K4K4K2J5RPJ3
4107A37J5J1%pqj2k6m0m4l2j7lOJ1J1J1QJ2J6J9J6J2PjppjMMJkkKPJ2J4J5J2J1J3J4Pmj5j9
4089A61j5oNJ0Ooj9k2j6rpj3k3k9k8k3j3kOPjj6k9l1j8mQJ3J7K2K2J7RQJ3K2L0K9J9Jj6k1
4072E8j2KJ1J3J3RJoj1j0j2j3rlkj0j5j5j0j0oNJ9K1Rrk0k6k1oJ6L4L4K5J7J5J3J1QJ1Qkj5
4055A10j8r%jrj9k4k4k0j9j6j1kJ1K7L0K4Oj0j2lRJ8K3K7K5J6Njllrj3j1mOJ2Ooj8j5oMOO
4037H5QOlj3j5j1olj%krj4j3oOJ7K8L1K4J1qk7l9m0k8j2MJ3J5Q%lKOQNOLlrp%QJ2J0NkonK
4016C8J2K0K1J5Lopopj0pKJ3J5J2Nmj3j9j9j3j2j4j8j1jJ3K5K6J9Prj5j4j0j0j1j1j2j6k3
4000e2k5j6jJ1J4J3J1Pkj1j3nQK0K8L0K8K5K1J3jj3j3jJ3J5P%JNMknnjjqk2k9k3oRJ2QNJ2
$$ y = [-16, -36, -48, -52, -47, -32, -8, 19, 45, 64, 71, 69, 59, 42, 18, -9, -39, -68, -98, -124, -140, -144, -137, -126, -112, -99, -89, -83, -77, -65, -46, -24, 0, 23, 47, 71, 93, 108, 117, 124, 137, 152, 163, 163, 156, 148, 136, 110, 70, 26, -6, -23, -26, -20, -9, 2, 13, 21, 33, 49, 68, 84, 96, 103, 102, 95, 88, 87, 91, 95, 96, 94, 92, 94, 101, 113, 127, 142, 154, 165, 178, 192, 199, 195, 180, 161, 146, 140, 145, 155, 161, 155, 136, 114, 98, 89, 82, 69, 46, 17, -11, -34, -47, -49, -43, -36, -37, -53, -82, -113, -131, -135, -127, -114, -97, -75, -53, -36, -27, -19, -6, 16, 46, 75, 94, 95, 79, 58, 46, 48, 59, 72, 85, 94, 95, 89, 78, 68, 56, 43, 34, 31, 29, 19, 4, -11, -21, -31, -37, -32, -13, 8, 17, 8, -12, -38, -59, -65, -49, -15, 19, 44, 61, 76, 89, 100, 108, 119, 127, 125, 110, 92, 83, 83, 82, 73, 54, 30, 6, -14, -33, -49, -60, -62, -51, -24, 6, 30, 36, 26, 14, 11, 20, 38, 61, 88, 113, 129, 134, 133, 130, 127, 118, 105, 94, 90, 96, 108, 114, 108, 90, 75, 69, 73, 79, 85, 93, 99, 96, 83, 68, 57, 51, 48, 47, 47, 45, 36, 22, 9, 3, 9, 26, 54, 85, 109, 120, 112, 85, 46, 6, -22, -34, -30, -17, -2, 6, 6, 3, 5, 11, 19, 24, 30, 33, 30, 21, 14, 14, 22, 34, 44, 49, 47, 41, 36, 38, 50, 70, 91, 106, 109, 103, 96, 90, 83, 73, 66, 68, 81, 96, 108, 113, 109, 96, 77, 58, 45, 33, 19, 1, -10, -11, 2, 27, 53, 72, 79, 70, 55, 41, 31, 21, 10, -1, -13, -29, -52, -77, -93, -94, -83, -69, -56, -45, -38, -40, -51, -64, -69, -61, -41, -13, 17, 45, 70, 91, 104, 103, 90, 77, 76, 89, 104, 111, 111, 112, 117, 121, 119, 114, 109, 108, 107, 99, 77, 48, 25, 19, 28, 40, 48, 53, 65]
3981F5J8K3K2J5Kj1j5rnmmLJ3J3%j4k1j5mNRP%oj4k1k5j9pQK1L0L0J7lj9k1j4j1j1j0lJnj1
3963@j0LJ5K2K1J6Nj1k3k4j5qmjk%JPJ0J1OK%kpqjQJ0POQJ1J1J4K1K3J6KpkJ2K6K3Oj1j6j3
3944A58j8k8l5k8j6nKOJ3J4J0%pj1qJLJjjLPJ2J8K0Qj1k5k7k0j2mKKkj0j6k0j5mLLmomjj%
3925e4joj4j3%J5K0K0J8J5J1J5K0K7K8K5K1J8Rjj0j1j1j2j9k8l3k5lK2L2K4Rnj1j3j1mKML
3908G3kopppj0j3j0%J2J8J3Jj3k4k7k3j7j2j2j3j6j6j2lOJ5J8J6J5K0L2M3M8M2L1K0J7J7J4
3892B21Kj4k4k2j4rmJMKj0k5l6l7k4kJ4J5RQR%j9l2k4rKL%lj%NJ1J5J6J4J2J4J9K0J4lj9k8
3874G1l0k7k0oOPmj9j9qLOjqq%QJ1J0NJlkMJ2J6J7J6J2Mrk3l0l1k1lJ1J4J0PJ3J4PmlQJ7J1
3855D2pk6l1k9k5k0j3kQPJKJ5L0L4K8K3K4K7K6J7Pkrj4k1k7l0k8j9j3j1j6k4k6k0mJ3K8L1
$$ y = [65, 83, 106, 128, 143, 145, 134, 119, 110, 105, 101, 97, 100, 113, 126, 126, 112, 91, 76, 72, 77, 86, 93, 93, 87, 73, 52, 27, 8, 1, 9, 30, 60, 90, 107, 104, 85, 64, 50, 39, 28, 18, 15, 16, 11, 0, -10, -7, 8, 30, 51, 67, 72, 61, 38, 14, -1, -9, -13, -14, -16, -16, -15, -8, 2, 13, 19, 21, 21, 19, 12, 4, 3, 11, 21, 28, 34, 42, 53, 64, 78, 99, 122, 138, 140, 133, 131, 143, 169, 192, 198, 187, 171, 158, 140, 112, 77, 49, 33, 28, 30, 36, 49, 63, 73, 73, 66, 55, 47, 48, 51, 52, 51, 50, 53, 60, 72, 90, 110, 118, 107, 82, 55, 35, 23, 19, 21, 23, 21, 11, -5, -25, -40, -44, -41, -38, -42, -48, -52, -53, -54, -54, -55, -61, -75, -88, -88, -73, -53, -33, -15, 0, 11, 26, 46, 73, 101, 126, 147, 165, 174, 173, 163, 152, 141, 129, 110, 82, 49, 24, 21, 43, 75, 99, 108, 103, 92, 79, 68, 64, 66, 70, 73, 71, 65, 58, 51, 44, 34, 21, 11, 11, 23, 41, 54, 55, 42, 18, -9, -32, -49, -61, -73, -86, -102, -118, -130, -133, -127, -112, -94, -78, -63, -43, -11, 32, 80, 122, 153, 173, 190, 207, 221, 223, 209, 185, 163, 149, 140, 136, 137, 141, 143, 133, 108, 72, 35, 11, 9, 23, 38, 47, 55, 64, 64, 45, 13, -11, -20, -18, -15, -15, -18, -19, -19, -14, -3, 12, 28, 42, 54, 68, 87, 107, 121, 118, 99, 71, 41, 14, -6, -12, -6, 1, -3, -22, -41, -49, -46, -40, -41, -49, -57, -57, -49, -38, -28, -23, -22, -25, -27, -23, -11, 5, 22, 38, 50, 54, 45, 22, -8, -39, -60, -63, -52, -38, -28, -21, -8, 6, 13, 9, 6, 14, 31, 42, 35, 9, -22, -51, -76, -96, -109, -111, -103, -96, -95, -93, -78, -48, -14, 14, 37, 61, 88, 114, 131, 138, 136, 127, 113, 92, 65, 35, 7, -12, -25, -36, -52, -76, -102, -122, -126, -113, -85, -54]
3839e4K5J4MJOJ3K1K0J5Npj1pKJ0J2J2J3J4Rjrj2rqrj3j4j0kNOPJ1J5J5Noj1pKJ1J6J7J0J
3820A27ljPJ2Plj3j5j4j4j1mPJ1P%nol%OJ0J1O%jJLQRRLloqj1j5k1k2j8j5j4j9k6k5j9j1p
3801h9lLJ1J2Mnj4k1j9qQK0K3K3J8Qnj5j8j9j8j3lOJ0J4K3L0K8J8Pmj2j7rKMqj7j0MJ1ROJ4
3783a1K7L6L1J7NOJ3J8J3LkmJRJ5J7Orj9k0j4j2j7k8l5l0j4OK3L0K7J3lj5j1jPJ0RLnj2rL
3765G7J6J4P%knj0j3j3j1oJQNj0k7l2k1mOOLMQJ3J2Jj2j8j8j1pomOJ7K0Poj8j5mMRJ0J0QJ
3746@j0j6j4nQJ6J9J6J3J1J2J6J4RLmj1j5rNK0K7K3J4PNjj0k2k8k7k3k0j8j1polKPMnrkPR
3728iPLLKLOJ0J4J5J6J8J5Nnj1j2j4j8j5mJ2K3J8Jj5j9nJ3K3K1J2Lpj6k2j9qlnj3j2mMMjk
3709A2KMKoj4k2k2j7rKJ5K7L1L2K6J9J1Lrk6l9m2l4j7olmkOJ1J1QOM%pj2j3j5j5j5j4j3j4
$$ y = [-54, -29, -15, -11, -10, -4, 9, 30, 50, 65, 70, 63, 52, 45, 47, 57, 69, 81, 94, 108, 117, 116, 107, 95, 86, 78, 69, 56, 42, 32, 30, 35, 41, 48, 59, 74, 89, 94, 88, 77, 70, 72, 83, 99, 116, 126, 127, 124, 123, 130, 142, 149, 146, 133, 118, 104, 90, 79, 75, 82, 93, 100, 100, 95, 89, 86, 86, 92, 102, 113, 119, 119, 118, 119, 122, 130, 139, 148, 151, 148, 142, 134, 123, 108, 87, 65, 47, 32, 18, -1, -27, -52, -71, -82, -89, -92, -89, -78, -66, -62, -67, -81, -102, -121, -129, -121, -101, -78, -55, -37, -29, -34, -49, -67, -86, -104, -117, -120, -114, -104, -90, -67, -37, -9, 9, 16, 12, 0, -17, -26, -24, -20, -28, -45, -55, -51, -40, -31, -25, -11, 16, 52, 83, 100, 105, 111, 124, 142, 155, 158, 156, 152, 153, 162, 177, 194, 200, 191, 172, 152, 138, 126, 109, 81, 46, 16, 2, 8, 31, 61, 88, 101, 98, 83, 72, 71, 78, 88, 97, 100, 95, 83, 74, 77, 93, 107, 114, 114, 112, 107, 97, 84, 71, 60, 54, 55, 63, 68, 58, 31, -1, -22, -26, -20, -14, -11, -7, 1, 14, 26, 27, 15, -3, -21, -32, -39, -45, -49, -43, -26, -6, 1, -5, -23, -38, -42, -38, -29, -19, -9, -1, 0, -10, -26, -40, -45, -37, -21, -2, 14, 27, 38, 50, 66, 80, 89, 92, 88, 77, 62, 53, 58, 78, 105, 128, 142, 149, 154, 153, 143, 121, 93, 66, 43, 23, 5, -6, -13, -19, -22, -20, -13, -9, -14, -23, -25, -18, -9, -2, 1, 4, 6, 9, 15, 25, 39, 54, 70, 88, 103, 108, 103, 92, 80, 66, 48, 33, 29, 41, 64, 82, 83, 68, 49, 44, 57, 80, 101, 113, 116, 109, 93, 71, 52, 44, 41, 36, 23, 11, 7, 11, 15, 14, 12, 14, 18, 20, 14, 0, -22, -44, -61, -70, -68, -53, -26, 5, 37, 63, 82, 93, 96, 87, 61, 22, -20, -54, -71, -77, -80, -84, -86, -80, -69, -58, -50, -44, -40, -40, -47, -59, -72, -87, -102, -117, -131, -144, -158]
3691a58j5j4j1lMJ0J5J6J9J9J8J6J4J2QL%%jkkJPJ3J2J0RJ4J5J1Mkrk2l9n1m7l4j9oLRJ1J1
3674a51J1RM%KJ2K1K2J2LOJ6K2K3K2K1J6Npj9k8l6l6j8J1L0K9J9J0ONONlj5k2j5njlnllnn
3656c2lKOJ0J0Mpj6j7j0JJ8L7M7L6J8Jrk0k6k4j6j4k1k6j9oOJ3J4J2J1J1J1Mqj9j7lOOkj2
3638d3j7j3mPJ2J3J2J0QOPQQNOJ0J9K8L1K7J6Mpj7k8l2k2kJ5J8Npj3q%J0J6J5Rkj2k4l2k9
3621A3j8j5j9k0rOOpj8j3QL0M5M5L3J8J0J4J9J7J0Jpj5k0j4jPlk2l9m0k7j1lpj5j9j5mJ0K5
3604f4L2K3Mj0j1lKKJNJ1J3J7J9J5Nj2k7l1k6j1J0K8L5K9J5MMRNnj6k3k5k0j1jQQPPPQOKk
3585D3oo%MPPJ1J5J3Korppj0j1j1nKQRQKkKJ4K8L5K2jk2l0k5j8j3j6k0k3k0j2mJOJ2K0K9L8
3567E4L9K9J5RJ1J6J3Koj0j3j5j3rorj2j5j7k3k8k4j1PK1K8K5J8J5J9K3J6%j6k2k2j7j2po
$$ y = [-158, -173, -187, -198, -201, -197, -187, -172, -156, -137, -118, -100, -84, -70, -58, -50, -47, -47, -47, -48, -50, -52, -51, -44, -31, -19, -9, 0, 14, 29, 40, 44, 42, 33, 11, -28, -79, -126, -160, -179, -185, -182, -173, -162, -151, -140, -131, -127, -127, -125, -113, -92, -70, -58, -55, -49, -33, -11, 12, 34, 55, 71, 76, 69, 50, 22, -14, -50, -68, -57, -27, 2, 21, 31, 37, 42, 48, 53, 50, 35, 13, -2, -7, -8, -11, -16, -19, -22, -27, -32, -35, -33, -27, -17, -7, -3, -10, -26, -43, -53, -52, -34, 3, 50, 86, 104, 105, 96, 76, 50, 26, 10, -4, -25, -51, -70, -76, -70, -57, -43, -31, -20, -9, 2, 6, -2, -21, -38, -41, -35, -29, -31, -43, -60, -73, -77, -70, -58, -45, -33, -23, -15, -9, -2, 6, 14, 19, 25, 35, 54, 82, 113, 140, 156, 160, 153, 136, 108, 76, 54, 52, 67, 85, 90, 83, 70, 62, 62, 72, 88, 103, 112, 110, 98, 74, 42, 13, -5, -20, -39, -59, -68, -62, -56, -63, -81, -94, -86, -56, -11, 34, 67, 85, 95, 109, 128, 145, 155, 156, 149, 134, 114, 100, 99, 106, 103, 81, 42, 2, -25, -36, -39, -46, -61, -80, -95, -99, -89, -64, -32, -9, -5, -15, -26, -29, -27, -25, -24, -19, -8, 5, 22, 41, 56, 61, 49, 22, -9, -35, -46, -36, -8, 27, 56, 71, 75, 79, 88, 93, 88, 72, 49, 24, 4, -7, -8, 0, 8, 15, 22, 29, 37, 43, 45, 43, 37, 31, 31, 35, 42, 49, 60, 75, 88, 90, 84, 75, 68, 61, 51, 40, 29, 24, 26, 34, 43, 51, 53, 51, 53, 67, 95, 130, 152, 151, 129, 99, 74, 56, 43, 27, 7, -16, -36, -48, -52, -51, -45, -33, -13, 16, 54, 93, 122, 137, 146, 157, 173, 186, 188, 182, 172, 159, 144, 131, 122, 116, 107, 95, 80, 63, 40, 12, -12, -23, -16, 5, 33, 58, 76, 91, 110, 133, 149, 149, 133, 111, 89, 72, 60, 53, 47]
3550D7rj4j5nRJ1Jj2k0k3k7l1k9j6MK2L5L9L4K3Rlqj0j1j3j9k4k2j1JJ1J6J9J8RjlNJ5J6M
3534B2j7l3l5k3qJLRJ4J4MmlMJ2J6J3Q%nmJMMK%qj2rJJ0Qkj1j5j4rononKOONNPN%%J0K0K3
3512EK3K0J5Nj1k7l2k9k2k1k2j5kJ0J5J4J6J9K2K0K0J9J2Jpj0pkLLjmnl%LQJ1J0Mpj7k2j5
3495ckQJ1PLMMlj4k6l2l1k6j5mJ3K7L4K6Rnj0qJJ6K8K8J4JkJKklmrj3rKJ6K2K2J5Mqj5j7j7
3475D0j1%J3J8J6RPQQLrk0k4j6jQNqk0k6k7j7jRPjj0j4j5rLJ2J2NLJ0K5L3L7L4K8J5lj7k0
3457I9j0j%qj4j4mOJ4J6J6Pqk4l1l1k6k6k3j8mRJ7K2K5K6K3J5M%joj2j4oKNjqj1pjRJ6J5P
3439D4mj1j7j8j5mQQjj0oMRNpj7j9rJ3L3M0L2K2J4Rkj6k5k3k0j7k2k4k0j3mNJ3K0K5K7L2L4
3422G3L1J9Kj2k1k3k2j6rlllLJ8L0L2K3J1lj8l1l8l2j2OJ9K2K1K0J8Pj3l3l9l1j8qrj5k0j5
$$ y = [47, 38, 24, 9, 4, 13, 24, 25, 13, -7, -30, -57, -88, -117, -133, -129, -107, -72, -33, 1, 24, 33, 30, 22, 12, 1, -12, -31, -55, -77, -88, -87, -76, -60, -41, -23, -14, -15, -18, -13, 2, 18, 22, 5, -28, -63, -86, -94, -93, -90, -81, -67, -53, -49, -53, -56, -52, -40, -24, -11, -3, -3, -8, -12, -11, -7, -3, -1, -1, -9, -21, -30, -29, -19, -11, -13, -24, -39, -53, -62, -68, -73, -79, -84, -82, -76, -70, -65, -60, -53, -48, -48, -48, -38, -18, 5, 28, 48, 63, 68, 57, 30, -2, -31, -53, -74, -96, -111, -113, -103, -88, -74, -58, -39, -17, 3, 23, 42, 54, 55, 48, 38, 31, 29, 32, 35, 34, 30, 25, 22, 22, 25, 33, 44, 54, 58, 51, 34, 12, -3, -5, 3, 14, 21, 24, 28, 32, 29, 15, -11, -43, -74, -100, -115, -119, -106, -79, -45, -19, -10, -15, -25, -33, -32, -16, 12, 40, 54, 55, 53, 54, 56, 54, 51, 47, 38, 25, 16, 18, 34, 56, 78, 93, 97, 89, 74, 57, 40, 29, 29, 42, 60, 76, 85, 92, 100, 108, 111, 102, 82, 58, 42, 41, 49, 54, 46, 26, 0, -27, -44, -45, -36, -29, -30, -40, -54, -69, -78, -75, -63, -51, -46, -43, -33, -8, 25, 62, 96, 124, 139, 136, 119, 99, 89, 88, 88, 80, 66, 52, 48, 54, 68, 84, 100, 107, 99, 75, 44, 13, -13, -39, -62, -80, -84, -75, -58, -36, -11, 15, 38, 53, 57, 57, 56, 50, 38, 24, 18, 20, 25, 24, 16, 5, -2, -3, 6, 22, 37, 44, 40, 29, 12, -6, -21, -25, -17, -9, -10, -20, -26, -22, -13, -8, -15, -32, -51, -60, -47, -14, 26, 58, 80, 94, 103, 101, 85, 60, 37, 17, 0, -22, -46, -66, -79, -83, -78, -65, -45, -20, 7, 39, 73, 104, 123, 125, 113, 92, 69, 47, 31, 22, 19, 16, 13, 16, 34, 64, 96, 119, 130, 127, 109, 78, 40, 8, -4, 2, 21, 43, 64, 84, 102, 109, 96, 63, 24, -7, -25, -33, -42, -57, -77, -92]
3405i2oOJ9K8L1K5J8J1J0QPNMMNPOMLOJ2J5J3%j5k4j9kJ4K1J6Nlj3k1k9l2k9k2j5n%PJ4K4
3387B1L0K3Oj4k6k6qJ4K6J9NjJlj5k1j4MJ8K1K1J5J0NQRLj1k1k0j4j0n%QJ1OknmLJ0Qlj7k5
3369D0k3j5kJ3L1L8K9Qj1k4k3j3%J1Rjj5k4k3j8j2pokMJ5K1K4K6K7K2J0oj6j7j0qj2j6j8j7
3352a1k2k8k5j6omrj2j1rkQJ6J9J8K0K8L1K5J6QJlmjMKmj2j3rpnkNJ7L1L5K5J0%mol%NKnj0
3332H3nKOPJ0J8K3K1J0jnnloj0j5j5j4rkOJ1J3J4J4J0Jqj7k6l3l8l7k9j3J1L6N1M8L4K0Pm
3315A61rojoj2j6j4j2j4j5j5j5j6j1nLL%qj2j5qLJ7K0J2Jj0j4j3nMJ5K5L2L5K7J7Lj0k3k4
3298F9j4KJ5J5Qlj0j6j7j5rlJmj3j5mJ5K9K4J2MNPMLPJ6K3K1J1lj3k1k9l7m0l1j7onqkNRN
3280b5LMOONMOLlj0j4rKJ0Nqk1k3j7qMJ7K4J9Orj9k2j5OL0M3M4L4K2Nj0j7rNJ6K1K1K1J3%
$$ y = [-92, -98, -92, -73, -45, -14, 11, 29, 40, 50, 58, 65, 70, 74, 78, 83, 90, 96, 100, 103, 109, 121, 136, 149, 149, 134, 110, 91, 89, 103, 124, 140, 145, 142, 129, 108, 79, 47, 18, -4, -19, -24, -24, -17, -3, 21, 51, 74, 80, 66, 40, 14, 6, 20, 46, 65, 70, 69, 70, 67, 52, 31, 17, 21, 39, 60, 81, 96, 106, 111, 119, 128, 131, 120, 99, 79, 65, 55, 50, 50, 58, 69, 75, 73, 68, 64, 67, 77, 85, 82, 65, 40, 17, 2, 0, 13, 44, 82, 111, 119, 108, 84, 61, 48, 48, 59, 68, 67, 52, 28, 5, -13, -25, -32, -38, -40, -36, -21, 0, 24, 50, 77, 99, 109, 103, 87, 70, 60, 52, 40, 24, 6, -11, -33, -61, -86, -102, -108, -112, -121, -133, -144, -153, -155, -147, -131, -112, -94, -74, -46, -15, 10, 26, 34, 35, 32, 28, 27, 31, 33, 29, 17, 4, -5, -12, -17, -19, -14, 3, 34, 69, 94, 104, 104, 100, 94, 91, 91, 96, 98, 93, 83, 78, 80, 86, 93, 103, 121, 144, 165, 175, 174, 169, 164, 161, 155, 145, 130, 115, 101, 92, 90, 96, 107, 120, 134, 148, 158, 159, 151, 134, 108, 75, 37, 0, -29, -42, -31, 5, 56, 104, 138, 158, 165, 161, 152, 146, 145, 139, 127, 111, 97, 85, 71, 56, 41, 26, 10, -1, -6, -3, 0, 0, -8, -20, -35, -43, -40, -23, -3, 9, 10, 0, -14, -27, -32, -28, -13, 12, 44, 79, 106, 123, 126, 116, 93, 69, 55, 57, 72, 87, 95, 92, 82, 66, 49, 34, 25, 22, 23, 19, 6, -9, -13, 2, 31, 55, 67, 71, 76, 83, 87, 90, 97, 113, 136, 157, 168, 165, 152, 131, 102, 65, 25, -6, -23, -29, -34, -42, -44, -39, -30, -25, -22, -18, -12, -6, -1, 3, 9, 12, 9, -1, -15, -24, -22, -12, -7, -15, -36, -59, -76, -84, -80, -63, -39, -20, -14, -23, -42, -64, -79, -73, -43, 0, 44, 78, 100, 105, 95, 78, 69, 74, 90, 111, 132, 153, 166, 166]
3261A66j5k7l3l3k8k0pPJ7J8J1Kknrj4j3lOOjrj4j0rolMJ2J2J1QPL%j%K%lkjljMJ0J0lj3j4
3241A4pMJ4K0K2K2K4K5J5lj3pKJrj7j0JRJ3RLoj4j8j8j8j4qJQOjrj6k1k1j7oOJ2Ppk4l7l7
3223a20k3mRJ3J4J6J7J4J2J6K4K5J8MlkNMlpkJ0J6Pj2l0l5k7j5KJ5K7L1K9K0Onj3j3rllrj6
3205@j8j7j1jJ4K6K5J0oj1kOOKLPRPNNNPQPNMLJlnjQJ0%j3j7rJNOJ0J4J0mj8k0j6j0j0j4j5
3185Hj0mLM%npjOJ0J0OJlnl%J%jmopj0j0qnkljMJ1J6J5J2Mlj0j2j4j2mPK0K4K6K5K3J5jj9
3164H1k8k3oJ0J4%k0k8j8nOPKrj6j7pMJ1J1J5K4L3L4K3Ppj7j9j8j9k5k6k0mJ3J8J3OKOPML
3147B2LMjrj4j0rj0pJRRPORMj0k3k5j1RK2K4J6J0Nmj9l7m2l0pJ0J5J1Mjk%NJ1J2Okqqrrj1
3127h4j0rlJ%mrrol%%jjkLJ0J5J9K3L1L5K8J7PPROJmqj2j5j1JJ6K5K2J2Ljmrj6j6j2ppqo%
$$ y = [166, 151, 124, 91, 58, 30, 10, 3, 10, 27, 45, 56, 58, 56, 51, 42, 28, 15, 12, 18, 24, 23, 14, 0, -10, -19, -25, -28, -24, -12, 0, 11, 19, 26, 29, 29, 28, 28, 30, 30, 27, 25, 24, 21, 20, 24, 34, 44, 41, 28, 14, 7, 11, 25, 45, 67, 89, 113, 138, 153, 150, 137, 130, 132, 133, 124, 107, 97, 98, 107, 120, 129, 132, 126, 112, 94, 76, 58, 44, 36, 37, 45, 51, 50, 41, 25, 4, -17, -34, -40, -34, -22, -15, -22, -46, -83, -120, -143, -147, -138, -125, -111, -95, -78, -64, -52, -36, -12, 13, 31, 35, 32, 30, 35, 39, 36, 29, 27, 37, 53, 60, 48, 18, -17, -44, -59, -57, -42, -15, 16, 45, 65, 71, 66, 53, 40, 31, 28, 25, 16, 0, -18, -35, -46, -47, -33, -7, 18, 28, 22, 11, 9, 15, 21, 23, 26, 33, 42, 49, 54, 59, 64, 71, 79, 86, 91, 95, 98, 99, 96, 91, 90, 98, 108, 108, 95, 78, 69, 70, 75, 81, 91, 105, 115, 111, 93, 73, 57, 47, 37, 23, 8, -2, -6, -3, 1, 1, -4, -11, -12, -6, 4, 14, 20, 21, 18, 13, 10, 10, 11, 11, 10, 6, 0, -7, -17, -27, -35, -40, -42, -45, -46, -42, -31, -15, 0, 12, 16, 13, 3, -9, -23, -35, -39, -32, -12, 12, 38, 63, 86, 101, 100, 81, 53, 30, 24, 34, 48, 48, 28, 0, -18, -23, -17, -10, -8, -17, -33, -50, -57, -53, -42, -31, -16, 8, 41, 75, 98, 105, 98, 81, 62, 44, 25, 0, -26, -46, -50, -37, -19, -6, 0, 2, 8, 15, 19, 22, 25, 29, 28, 19, 5, -5, -14, -24, -31, -30, -21, -12, -5, 1, 10, 14, 4, -19, -44, -55, -46, -24, 0, 16, 26, 31, 27, 8, -29, -71, -101, -108, -98, -83, -72, -68, -69, -71, -71, -66, -55, -43, -37, -39, -47, -55, -64, -73, -84, -94, -103, -106, -105, -105, -109, -118, -127, -133, -136, -136, -136, -137, -138, -140, -137, -127, -112, -93, -70, -39, -4, 24, 41, 48, 55, 64, 70, 71, 67, 59, 47, 32, 21, 22, 38, 63, 85, 97, 100, 99, 95, 86, 70, 54, 42, 35, 28, 20, 14, 14]
3106A4PJ4J6J5QJpj2j5j4qnpj2j2rpj4k6l1k2nJ1J6J4J0J0RPLKMQJ2J2Plj2j2oMJ0J1OLNJ4
3088A4J3%j7k3j8j0lLQJ1J0J2J3J6J4RLknlMRJ3J5J7J4Lrj3j0oopj0j7k4k2j4%QJ1R%j2k1
3069b3k1j3pmkMJ2J9J8J2NMNPRQMjlnqj2qkKL%LNnk0l2l2k3j2%OROOJ2J7J7J6J8K2K5K2J1
3050G4kj6k2k3k1k1j7j2pm%OPMKMJ0J1QKprlPJ4J5RPOOJ3K4K8J9NnjPJ8K6L0K4J2kj8l1l9
3031A38l4k3j3lOJ1Mrk0j9j7j7j7j1lLRK1L4L9L3K6K1J3%j2j5j3qrj9l2l6k6j0JQJ7J8J1k
3014D5j2j3q%ONKmojLQJ3J7J5J0MKjqrmOJ0Loj0j3j9l1l8l8k4mJ2J6Qmj0qkPJ3J6J7J6J5J8
2995A4K5K4J6MLRJ3Qjmoj3k4k9k2q%JjklprnjkonJMnj9k6k1pKK%%NJ3K0K6L2L3L0K5K1J8R
2975A32%nkOJ2J2Qmk0l2l6k7j5lKkj3k1k0oQJ3Lj4k9l5l2k5j5jJ0J4J0NOJ1J5J8K2K7K4J5
$$ y = [14, 21, 35, 51, 66, 74, 75, 68, 56, 41, 27, 19, 14, 7, -5, -17, -26, -33, -47, -73, -104, -126, -131, -120, -104, -90, -80, -70, -61, -54, -51, -49, -45, -37, -25, -13, -6, -9, -21, -33, -39, -35, -25, -14, -8, -5, 0, 14, 27, 27, 10, -13, -31, -41, -44, -41, -33, -22, -12, 0, 13, 29, 43, 52, 55, 53, 48, 45, 49, 58, 71, 86, 103, 117, 120, 111, 98, 88, 82, 76, 69, 59, 42, 18, -4, -18, -18, -10, 1, 10, 10, -2, -23, -44, -57, -64, -68, -70, -66, -54, -35, -17, -5, 0, 4, 9, 16, 25, 33, 37, 36, 33, 28, 20, 8, 0, -2, 0, 3, 3, 6, 11, 6, -14, -46, -78, -101, -113, -113, -107, -98, -92, -86, -74, -57, -40, -24, -6, 16, 41, 63, 74, 72, 56, 34, 11, -10, -31, -48, -60, -67, -71, -71, -65, -58, -54, -52, -48, -38, -27, -19, -17, -24, -33, -36, -29, -15, 0, 9, 16, 22, 28, 41, 65, 93, 112, 117, 112, 111, 118, 136, 162, 192, 216, 228, 226, 208, 177, 138, 104, 81, 68, 65, 71, 82, 86, 77, 57, 38, 21, 4, -13, -24, -27, -24, -15, 6, 40, 79, 112, 138, 159, 172, 172, 160, 145, 132, 124, 115, 96, 64, 28, 2, -8, -7, 1, 18, 36, 47, 45, 33, 20, 12, 12, 18, 23, 25, 21, 15, 14, 17, 25, 38, 55, 70, 80, 84, 86, 85, 77, 68, 64, 70, 80, 83, 77, 67, 54, 35, 4, -34, -72, -96, -100, -88, -72, -64, -68, -78, -86, -88, -81, -68, -52, -35, -19, -4, 14, 39, 63, 79, 83, 86, 95, 108, 116, 115, 111, 105, 92, 68, 39, 17, 9, 9, 10, 9, 7, 4, -3, -12, -17, -18, -20, -26, -31, -30, -26, -31, -50, -76, -97, -104, -102, -100, -100, -100, -95, -82, -62, -36, -4, 29, 59, 84, 105, 123, 132, 132, 127, 125, 131, 143, 155, 163, 159, 139, 107, 71, 44, 29, 26, 28, 26, 13, -8, -28, -34, -26, -13, -10, -24, -53, -88, -120, -145, -160, -161, -151, -137, -127, -122, -116, -105, -90, -72, -50, -23, 1, 16]
2958A6jj2rKJ4K1J9J8J7J5QJ%Jjmk%nj6k6k7j8nRK2K7K7K1J1lj4j4nKmj3j7j7j5rPK1K2Qj0
2940F2k0k0j2oklpjQJ5J5Rkj1j8j8j3rlLJ2J5J0Koj1rlJLNJ3K1K1J1%oooj1j5j1%J1K2K5K6
2921H1K7K4J4Mjjpk2l6m0l0j3moj3j5rKN%nnjNJ4K6L4L3K4J0oj8j8pKLrk2k7l0k3j3lnk0k8
2902a29k1kJ5K6L0L1K5J5PQJ8J8J1joqrj2j4ojMJjlloj3k2j9kK0L3L3K8K2J1%j0j2j1j3j9
2885A3k2k2j7rjNOMKK%oj3j8j6qJPOOJ0J4J2J0QRRQMmj7k0j4lJMJ1K1K6K7J8Qmrp%jj1k5k7
2865b2k0pNJ6K3K3K2J5J2J5K0J6MomOJ5J6J5J1NJJMLnj1j8k7l3k6j0%kqpmrj4rMJ2R%mkmq
2846A3pJJ5K3K1J3PNJqj7j5mNQOKlj0j4j5j2qJRJ0Lmpn%RK1K7K2J2N%j0k2l3l3k6j5%J7K3
2827A1K0Pmj2j7j4q%krj7j4qmjOJ8K7K6K1J3RJ0J8K2J7Lj1k1k6k5j7kPjj6k4k2j3qnj%JQJ9
$$ y = [16, 15, 3, -6, -4, 10, 31, 50, 68, 85, 100, 108, 109, 109, 110, 109, 105, 103, 103, 98, 82, 56, 29, 11, 6, 15, 37, 64, 91, 112, 123, 120, 106, 92, 87, 89, 85, 72, 55, 38, 23, 14, 21, 42, 64, 72, 62, 42, 22, 10, 4, 2, -1, -8, -9, -1, 14, 29, 38, 36, 25, 7, -11, -24, -33, -36, -33, -21, -6, 4, 6, 0, -11, -20, -23, -22, -19, -14, -1, 20, 41, 52, 52, 46, 40, 34, 23, 8, -3, -3, 8, 30, 55, 81, 108, 132, 146, 150, 149, 148, 141, 119, 83, 43, 13, 0, -4, -10, -23, -38, -47, -45, -40, -40, -45, -50, -51, -46, -32, -6, 28, 61, 85, 95, 89, 71, 53, 46, 48, 51, 42, 20, -7, -37, -60, -73, -76, -81, -101, -129, -150, -152, -137, -111, -81, -50, -25, -10, -3, 5, 23, 41, 52, 51, 45, 37, 28, 16, 2, -4, -5, -1, 0, -1, -4, -7, -13, -26, -48, -67, -69, -49, -16, 17, 45, 67, 78, 78, 68, 56, 45, 32, 13, -9, -31, -48, -57, -58, -53, -47, -43, -41, -39, -39, -45, -58, -76, -92, -100, -99, -92, -86, -80, -70, -56, -44, -34, -26, -17, -8, 0, 4, 0, -17, -37, -51, -54, -53, -49, -38, -17, 9, 36, 54, 62, 58, 49, 42, 42, 41, 30, 5, -22, -42, -49, -44, -28, -5, 18, 40, 55, 67, 82, 102, 118, 122, 116, 112, 118, 133, 149, 164, 175, 180, 181, 182, 186, 189, 184, 173, 155, 128, 95, 69, 59, 59, 57, 49, 42, 38, 29, 15, 6, 10, 22, 31, 31, 27, 25, 21, 13, 6, 7, 22, 45, 66, 79, 86, 91, 92, 84, 67, 52, 48, 53, 61, 67, 69, 66, 56, 42, 27, 15, 7, 8, 17, 27, 30, 26, 19, 14, 14, 23, 44, 71, 93, 105, 110, 110, 100, 78, 45, 12, -14, -29, -29, -12, 11, 31, 38, 34, 22, 5, -9, -17, -17, -19, -28, -45, -59, -67, -71, -72, -66, -48, -21, 5, 26, 39, 48, 58, 76, 98, 115, 118, 107, 86, 60, 35, 18, 16, 23, 22, 6, -18, -40, -53, -61, -66, -67, -67, -66, -58, -39]
2808c9K6K4J8J0KppLJ8K3J8J0Njorpmpj1j3r%PNlj0j2mjmj3j6j2mNJ1J1QRJ4J8J5MmnlJLQ
2788F5J9K4K1J5J1J1J0Okj0j4j6j6j4j1qoj0j8k6k5k0k0k1j7lQOmr%J8K6K0Mpj4j7k0k0j3
2772i7jRJ5J4J2OKJMNKKOJ1RPNNMNNMjrpJQRMlpj3j5pJMKmj1j0oJJ1J7J7J3OLNKoj2r%QNj
2749C1JQJ4J1Knrj5k2k4k3j7qNJ6K3K6K8K9K8K0Pnj1j2j0nklj2k6l6l8k9j7mKKjKJ3K6L3K9
2731B2J9RLJKNJqj7k1k0j9j6j2qJJ2K0J9Ooq%RJ2J5J5J3QOKmj6k1j6nLMNQJ2J0LknkJKJLN
2711E1NJ%NJ3J1Jpqpj0pjMlj6k1j5nKMJkm%OJ2J4J2Lpj4j5mJ0K7K9J3j3k8k5j0joj4j7j4j2
2692f2j3j2q%QJ5J5J1NKJMOJ1J3RJoj1j6j7j4oJlj5k6l1l0k6j5LK0K5K0J1QPOOQJ0QLjLQJ5
2672d9K2K5J7kj9k4j8j5k0k2j6nOJ1J5J3NjMJ5K1J5Mqj6k0j9j2kOJ1J8K3K3J7J5J6J9K2J9
$$ y = [-39, -13, 11, 29, 39, 41, 34, 27, 30, 48, 71, 89, 99, 104, 103, 97, 88, 81, 77, 70, 59, 46, 37, 37, 44, 49, 46, 36, 24, 20, 19, 15, 2, -14, -26, -30, -25, -14, -3, 5, 14, 28, 46, 61, 65, 61, 56, 53, 54, 57, 65, 84, 108, 129, 144, 155, 166, 176, 182, 180, 170, 156, 140, 124, 110, 99, 91, 85, 75, 57, 31, 6, -14, -34, -55, -72, -75, -67, -61, -65, -74, -74, -56, -30, -10, -6, -13, -27, -44, -64, -84, -97, -98, -89, -74, -60, -48, -42, -40, -39, -35, -30, -28, -26, -20, -9, 0, 7, 12, 17, 21, 26, 31, 35, 34, 25, 18, 19, 27, 36, 40, 37, 30, 17, 2, -5, -4, 0, 2, -2, -13, -23, -29, -28, -17, 0, 17, 30, 36, 39, 44, 46, 40, 28, 19, 19, 27, 32, 31, 32, 40, 54, 65, 67, 62, 53, 38, 16, -8, -31, -48, -56, -51, -35, -12, 14, 42, 71, 99, 119, 126, 121, 110, 98, 88, 83, 81, 78, 66, 40, 4, -34, -63, -80, -84, -82, -80, -81, -79, -66, -40, -7, 22, 41, 50, 53, 54, 56, 61, 62, 54, 37, 16, -4, -23, -39, -51, -59, -58, -46, -26, -7, -1, -7, -15, -15, -6, 6, 21, 36, 49, 57, 63, 65, 61, 45, 24, 8, 3, 6, 10, 15, 23, 35, 45, 48, 46, 41, 39, 40, 42, 43, 46, 51, 56, 57, 57, 62, 75, 86, 87, 80, 72, 65, 55, 48, 47, 51, 48, 32, 11, -4, -9, -7, -3, -2, -4, -8, -8, -2, 10, 24, 36, 39, 32, 18, 3, -1, 9, 36, 65, 78, 65, 37, 12, 2, 1, -5, -19, -36, -50, -62, -75, -87, -95, -95, -87, -72, -57, -46, -41, -39, -38, -34, -28, -17, -4, 5, 6, 0, -11, -27, -44, -58, -64, -63, -66, -81, -107, -138, -168, -194, -209, -206, -186, -161, -141, -130, -122, -115, -109, -103, -95, -85, -77, -74, -75, -72, -64, -49, -27, -2, 15, 13, -6, -30, -48, -63, -83, -105, -121, -126, -120, -109, -94, -81, -76, -77, -73, -58, -37, -22, -18, -26, -42, -62, -81, -93, -95, -89, -78, -60, -37, -14, 3, 18, 34, 53, 75, 94]
2656I4J0lj1j1lMMLJjmqrqqj1j3nJ1K3K0Lj7k2j6rqo%KMLOO%rj0lJkrj1oJPJ4K2K4J2nj5j2
2635B0nLQJ3J2QKlpj2k0j9j1JJ0J3Qjpqn%KPRLqj6j3lPJ3J8J7Prj7j1LJ4J4Mqj2oJKlkRK3
2615D5L2L0J8Lj3k4k6k3j7j4j6k1j9j1%%prKJ3J4P%%jkjPJ7J9J3ok1l1k7j6kJ2K4L1K8K5K0
2598E3J7J4J6J7J0qk9m1m1l4l0k3j5qLJ8K8K9K2J5J1Kj2k3k8k4j5mOJ0OkprlJ4L0L1J4mql
2581eNRQMKJKlj8l0l3k7k1j9j2KJ9K9K9K0NnlRJ7J0j0k0j8mPJ2J0OLKkrj3r%QJ3J5J5J7J5
2562C3Kj9l7m5l2j2LMnj6k3k6k1qOJ4J3J2J5J9K0K4L1L9L5K4J1LLPPkj9l4l9l7k8k2j9j0N
2545a24J5J5J0RJ3J7J6J1O%lLJ5K6K0jj7k0j1oJNRQ%nmjkqj6j7j3oJOOL%KJ0K2K9K5J3%j1
2527E1j8k5k2j5kJ2J9K4K2J4OKlqj6k1k0j4j0mjLQJ5K3K9K9K8L0K9J9Kj2j8j9k3k9l0k7k1
$$ y = [94, 104, 101, 90, 79, 76, 80, 84, 87, 88, 87, 83, 75, 66, 58, 50, 39, 26, 21, 32, 55, 75, 78, 61, 39, 23, 14, 6, 0, 0, 2, 6, 9, 15, 21, 21, 12, 2, -1, 0, -2, -11, -22, -28, -27, -20, -6, 16, 40, 52, 47, 32, 20, 15, 18, 26, 39, 51, 59, 61, 58, 51, 39, 19, 0, -11, -10, 0, 13, 21, 20, 13, 5, 0, 0, 2, 9, 18, 21, 13, -3, -16, -19, -12, 1, 19, 36, 43, 34, 17, 6, 9, 23, 37, 41, 33, 21, 15, 16, 18, 15, 13, 22, 45, 77, 107, 125, 128, 115, 91, 65, 42, 25, 11, -5, -26, -45, -56, -56, -56, -63, -72, -70, -57, -43, -36, -36, -36, -37, -39, -40, -33, -16, 3, 16, 10, -11, -42, -69, -85, -87, -75, -51, -20, 8, 33, 53, 70, 84, 100, 117, 127, 119, 90, 49, 8, -26, -56, -79, -94, -102, -99, -81, -53, -24, -2, 13, 24, 26, 14, -9, -37, -61, -76, -80, -74, -64, -58, -60, -67, -76, -79, -65, -35, -4, 10, 6, -2, -5, 0, 9, 17, 21, 23, 24, 26, 23, 5, -25, -58, -85, -106, -125, -137, -135, -116, -87, -58, -38, -33, -38, -41, -32, -15, -5, -15, -35, -53, -57, -50, -38, -28, -22, -19, -17, -19, -28, -41, -50, -50, -42, -29, -14, 1, 18, 33, 35, 16, -21, -66, -98, -110, -107, -103, -108, -124, -147, -173, -194, -202, -196, -182, -169, -157, -142, -123, -103, -79, -48, -9, 26, 50, 61, 64, 67, 74, 81, 79, 60, 26, -13, -50, -78, -100, -119, -129, -124, -109, -94, -84, -75, -62, -45, -29, -18, -12, -12, -15, -12, 3, 29, 49, 48, 31, 11, 0, -6, -5, 0, 9, 17, 17, 12, 8, 7, 5, -3, -19, -36, -49, -55, -54, -48, -42, -39, -39, -37, -27, -5, 24, 49, 62, 62, 51, 33, 8, -14, -29, -31, -19, 0, 24, 46, 60, 66, 68, 65, 57, 41, 20, 0, -14, -24, -28, -29, -26, -18, -3, 20, 49, 78, 106, 136, 165, 184, 186, 174, 156, 137, 114, 85, 55, 28, 7]
2510Gk1k2j4%J0RJpoJQJ1J2QMkj1j4j2pnmllrj3nJ2K3J9J0MLlj2j6j3pkLJ0J9K6K5J9Lj4k4
2491bk1j0JQJ1J1Lnj4j3pkKMOM%l%MQOLjkkJKkljOQMnj3j2rj0j6k1j7mQJ2PQJ7K1J1nj0LJ9
2470a2L1L3K3Lj3j4nlj0j5qKOKk%MRJ2Rlk1l0l0j6kM%j1j6j2lLQJ0J5J9J7J0MKRK2K6J6Kn
2451G0jLjj3k6l2k9j9mPJ3J5J3Njmrj6k0j8j0mlKJ3K2K3J5NKMPM%mjMQJ3J6J6J1Mjoj5k5l2
2431Ak8j8pmmmMJ5K3K1J2Lqj4j2KJ7K3J9J1NNkj2k0k2j7j5j7j8j5j0mLJ3K2K2J2J%QR%no%
2413a1MOPJ3J0Lrj5j4j1qj0j5j7j5oPJ4J3ONJ1J7J0jpnmpmRK4L0K6J5Lj0k3k6j7ojoj9l2l4
2394a00k3oK%omPJ7J6J0RJ9K9L5L8M2M1L0Nk1l7l6k5j2oonLJ3K1K1K0J5Qmj4k0k5k5k3j7j3
2378b7j1pmpj3j1lRJ5J5J5J2LmlNPlj5k1k0j0PK6M5N7O7P2O9N7M5M4N2P1R5J23J53J81J98
$$ y = [7, -14, -36, -50, -50, -40, -31, -30, -37, -43, -42, -34, -23, -11, -3, 1, -1, -12, -26, -38, -45, -50, -54, -57, -60, -69, -82, -87, -75, -52, -33, -23, -19, -16, -19, -31, -47, -60, -67, -69, -66, -56, -37, -11, 14, 33, 36, 22, -2, -23, -33, -32, -24, -13, -2, 1, -4, -18, -31, -38, -40, -38, -34, -28, -24, -24, -27, -27, -23, -15, -9, -6, -7, -9, -11, -10, -8, -10, -13, -14, -8, 0, 4, -1, -14, -26, -35, -45, -61, -82, -99, -103, -95, -83, -76, -68, -51, -30, -19, -24, -34, -31, -12, 19, 52, 75, 78, 65, 51, 46, 43, 33, 18, 10, 12, 18, 20, 18, 18, 22, 31, 43, 52, 49, 28, -2, -32, -48, -50, -46, -46, -57, -73, -85, -88, -85, -77, -67, -52, -33, -16, -6, -2, 0, 9, 31, 57, 73, 75, 70, 69, 72, 71, 58, 32, 0, -29, -48, -52, -45, -32, -17, -4, 1, 0, -4, -13, -29, -49, -67, -77, -81, -84, -82, -69, -47, -24, -9, -4, -2, 2, 9, 13, 13, 9, 8, 12, 20, 33, 49, 65, 76, 80, 79, 73, 58, 33, 1, -27, -45, -52, -56, -60, -64, -60, -45, -22, -1, 11, 14, 6, -8, -20, -18, -1, 22, 41, 52, 57, 62, 60, 48, 28, 6, -11, -26, -43, -61, -76, -86, -90, -87, -74, -52, -30, -18, -17, -17, -9, 0, 0, -5, -11, -11, -7, -1, 6, 19, 29, 32, 23, 8, -6, -17, -25, -35, -50, -67, -82, -88, -81, -67, -54, -48, -43, -32, -15, -5, -6, -13, -18, -22, -29, -33, -24, 0, 30, 56, 71, 74, 64, 41, 15, -2, -8, -9, -15, -34, -66, -100, -123, -129, -127, -127, -133, -137, -130, -113, -97, -87, -78, -59, -30, 5, 43, 85, 126, 156, 161, 140, 103, 67, 42, 30, 24, 18, 13, 16, 29, 50, 71, 91, 106, 114, 110, 96, 76, 51, 26, 3, -14, -27, -38, -45, -49, -56, -69, -80, -83, -74, -59, -44, -29, -17, -14, -18, -21, -16, -9, -12, -27, -48, -68, -78, -71, -45, 0, 57, 124, 196, 265, 322, 367, 411, 463, 534, 629, 752, 905, 1086, 1284]
2362A284J96J78J41Q5J3o9j35j72j83j76j62j45j26j10r5p9o2n0m7m7m3l6k9k3j8j2j0j2j4
2350D2j7j4oKQPKlrqKJ4K4K2J3Kpj3j8j8j5lJ1K0J9J1jj1k0k3j6mL%nojPJ5K5L7M0L0J0j0
2332A38j9j6j2j2j3j2qlll%RK2L0K9J7N%nj3k1j9j3j1j7k1j4mNRROjoqj0j5j4nRJ4QjmJOR
2313B3OJpj4j8k1j6qmpj4j8j3LK3L2K6Prj6j6j5j4j2j0qnj%pj7k0j2LJ7K1J7QQJ6J8OoqKJ0
2295f9RKnj0j0nJMjmlklqqnKJ3K9M1M0L2K2J5RKoj5k1k8k7k3j4nkm%J2K7L4L4K7J7Mj3k6k2
2276C7nRQnj0%J3J5O%LJ0J2Okj1k1k6k2j0JOOJ0K0K8K3Mj9l5l6k4pRJ8J6Moqooj0j5j1jJ1
2258b1K1K2J6Jj0j3qJJ0J2PK%kqk0k1j4mkoojQJ5J5Qnj9j8pRJ4Onj2pLJ3J8J9J6QknjMOLJ
2237D1oj3j4ojok2l3l4k5j3PL0M8N0L8J3j0k6k6j9pKON%k%JklLJ4J6J1LKNONJmj6k9m0l7k2
$$ y = [1284, 1480, 1658, 1799, 1884, 1897, 1828, 1693, 1521, 1338, 1162, 1000, 855, 729, 619, 524, 445, 383, 333, 286, 239, 196, 160, 131, 108, 90, 78, 68, 56, 42, 25, 11, 5, 7, 15, 22, 24, 21, 12, 4, 6, 20, 44, 66, 79, 81, 74, 61, 43, 25, 10, 7, 18, 38, 57, 68, 67, 56, 36, 13, -3, -7, -4, -4, -9, -15, -16, -9, 6, 31, 68, 108, 138, 148, 138, 119, 103, 91, 79, 66, 54, 46, 43, 40, 37, 37, 46, 68, 98, 127, 144, 149, 149, 144, 131, 110, 91, 78, 67, 50, 29, 15, 11, 16, 25, 34, 40, 39, 33, 25, 15, 0, -14, -19, -10, 4, 12, 11, 7, 8, 14, 23, 29, 30, 23, 9, -9, -30, -46, -54, -58, -65, -79, -97, -110, -107, -84, -52, -26, -19, -28, -44, -60, -75, -89, -101, -111, -119, -124, -125, -125, -132, -149, -169, -181, -178, -161, -140, -123, -115, -107, -91, -73, -67, -73, -81, -79, -69, -60, -58, -63, -73, -83, -88, -87, -83, -84, -88, -91, -93, -96, -104, -112, -117, -115, -102, -73, -32, 8, 40, 62, 77, 86, 88, 82, 67, 46, 18, -9, -32, -46, -51, -53, -57, -57, -45, -18, 16, 50, 77, 94, 98, 85, 59, 37, 32, 41, 49, 44, 34, 34, 47, 62, 68, 68, 71, 81, 93, 99, 97, 86, 65, 39, 17, 7, 8, 14, 20, 30, 50, 78, 101, 105, 86, 51, 15, -9, -16, -7, 11, 27, 31, 25, 17, 11, 5, -5, -20, -31, -32, -21, 0, 22, 38, 39, 29, 16, 8, 9, 19, 31, 38, 40, 40, 38, 30, 10, -11, -25, -29, -31, -37, -43, -44, -36, -21, -6, 2, -3, -22, -40, -47, -38, -24, -18, -23, -35, -42, -39, -26, -8, 11, 27, 35, 33, 28, 27, 31, 37, 40, 41, 35, 22, 8, 2, 1, -5, -27, -60, -94, -119, -132, -125, -95, -47, 3, 41, 54, 44, 18, -8, -27, -34, -32, -26, -21, -21, -23, -23, -22, -24, -27, -24, -10, 6, 17, 20, 22, 27, 33, 38, 39, 35, 19, -10, -50, -87, -109]
2219a09lJ3J9J5P%rj7j8j1NJ8K2J3%ppnqj2pOK0K7L0L2L3K7J9J1Lrk1l0l3k9k3qPK2L0L1K7
2201G1J6Okllmrj4j3j2j4k5l3l1j9q%QJ6J5PLJ2K4K0RkkLLLNPOjnoLJ4K2K4J7J1Mlj2j5r%
2182H4ONJnj1j4j6j7k0k0j6pjlj0j7k0j7qLOKkmKJ3K6L4K8J5ORJ7J2nj7oJ8L1K0nj8j1%K%
2163G0kJKMOJ1J2Lrj6j9k5l1l1k2rjQJ9K6K1PkKJ2J5Qkj2k3k9k5pJ2K0J4OjpplJ0K0K0Qnj3
2144C6j8k2k0j0QJ9J7Kj5k2j4lJlqplLMKkj2j9k2j7j0kOJ5K4L1L4K8J3nj4j0%M%lpj4k6l3
2126i4k3JK4L1K2RJJQJ7K0J9J7J5J4J0kj6k4k3j5kOPKpj4j4rjQJ3J6J1Loj1j0mjkml%%npj
2107b3QJ2NjkJJ0J9K7K5J1qj8j5kJ1J5J3RNJlkQK3K7J8Moj0ronj3k4l3k7j3jLlj1j5j2kRJ7
2088A7J3NKMQPKmj0j4j6j2okK%jJPJ7K2K0J6J2Q%rj0njlj2k1k5k4k3j6nJ0K0K3J7J0N%j1k3
$$ y = [-109, -112, -99, -80, -65, -58, -58, -67, -84, -102, -113, -108, -90, -68, -55, -55, -62, -69, -74, -82, -94, -101, -95, -75, -48, -18, 14, 47, 74, 93, 104, 107, 98, 77, 47, 14, -15, -38, -46, -39, -17, 13, 44, 71, 87, 93, 91, 88, 85, 81, 72, 58, 45, 33, 19, -6, -39, -70, -89, -97, -97, -89, -73, -58, -51, -48, -36, -12, 8, 17, 15, 13, 16, 19, 22, 27, 34, 40, 39, 34, 28, 31, 45, 67, 91, 108, 119, 123, 120, 108, 93, 84, 84, 90, 95, 96, 91, 80, 66, 50, 33, 13, -7, -23, -30, -31, -34, -44, -61, -81, -98, -106, -103, -97, -95, -97, -101, -99, -86, -60, -26, 2, 17, 23, 32, 49, 61, 56, 39, 33, 51, 82, 102, 97, 79, 68, 68, 70, 70, 68, 69, 71, 75, 81, 92, 104, 107, 98, 82, 63, 38, 7, -24, -46, -55, -56, -48, -29, -3, 18, 25, 23, 25, 37, 52, 60, 58, 46, 23, -6, -31, -38, -26, -6, 8, 14, 13, 6, -1, -4, 6, 26, 46, 54, 49, 36, 18, -4, -24, -34, -26, -7, 10, 12, -3, -25, -39, -42, -41, -44, -52, -59, -62, -59, -55, -53, -55, -67, -86, -108, -125, -135, -137, -131, -116, -92, -61, -27, 1, 14, 9, -5, -15, -15, -11, -11, -14, -21, -35, -61, -94, -117, -116, -92, -61, -39, -30, -29, -28, -20, -3, 17, 36, 53, 68, 82, 92, 90, 74, 50, 27, 12, 10, 16, 23, 25, 18, 4, -10, -19, -20, -12, 1, 17, 28, 31, 25, 14, 4, 0, -1, -3, -7, -10, -10, -10, -15, -22, -23, -15, -3, 2, 1, -1, 0, 10, 29, 56, 81, 92, 84, 66, 51, 49, 60, 75, 88, 97, 102, 103, 100, 98, 106, 129, 156, 174, 178, 172, 162, 153, 147, 142, 129, 105, 72, 45, 32, 31, 34, 31, 20, 5, -7, -9, 0, 17, 30, 35, 37, 41, 49, 56, 58, 54, 44, 30, 14, 2, -4, -6, -4, -4, -5, -4, 3, 20, 42, 62, 78, 90, 98, 98, 89, 79, 74, 73, 70, 58, 37, 12, -12, -35, -51, -56, -46, -26, -3, 14, 24, 29, 29, 18, -5]
2069el2k5oJ2K2K1J5RMJLNRJ6J8J2jpjPNlrj1j0j0pk%pk1k9l2k2qLJ2K0K9L4L3K3J0Llqj0
2050E7pklj0j6qQK3K7K0J2PLlj1j7j8j1%J3J8J5PJlj1j9k4k2j5j1rnmj0j5j4kJ1J4QknmMJ5
2032a8L0M2M2K3mk5l2k6j7qKRJ1Qjrj1qojKLK%JLMJlpj2k0k6k1j1jQJ4J4Nqj1LJ5J3JroMJ4
2012b7K1K2J9J0JkJJ0J4Nj6l8m2l1j5lPJ7K2J3jj2j0lMQQOMLOJ5K4K0Oj2j9j4lJ0J9K0J3N
1994H5jqj4j9j7mJ0J8J5Nrj7j9j9k1k5j7%J5J5%j4j8pPJ3Qlj0rprpjNONORMknMJ4K1K3K4J8
1975D8Mj0j4oQJ8K1J7J1PKmj1j3j2okKK%moj0j7k3k4k2j6j0kJ1K4L5L4K3Lj2j5qKJ4K0J8R
1957H6kj1j1rlMNKmnkJKNQMpk2l6m3n0m4l0j1LJ0J7K5L7M6M4K7Kk5m5n5m8k4MK0K4K7L8M6
1939@M8L6K1Qoj6k2k6l1k6j4%Kpj8k4k1j1MJ4J5PjklmpqqnkJKNJ3J7J5J0J2J7J6J0MOOlj5
$$ y = [-5, -37, -62, -68, -56, -34, -13, 2, 11, 15, 16, 19, 24, 33, 49, 67, 79, 78, 71, 70, 77, 82, 79, 70, 59, 49, 39, 32, 30, 30, 23, 2, -27, -59, -81, -89, -86, -74, -54, -25, 9, 42, 65, 75, 78, 75, 67, 57, 50, 48, 45, 35, 19, 11, 19, 42, 69, 89, 101, 108, 111, 108, 97, 80, 62, 51, 51, 64, 82, 97, 104, 105, 102, 91, 72, 48, 26, 11, 0, -9, -14, -18, -28, -43, -57, -59, -48, -34, -26, -28, -33, -37, -33, -18, 12, 54, 96, 119, 115, 90, 58, 32, 15, 7, 9, 18, 29, 37, 36, 27, 16, 8, 2, 1, 3, 6, 8, 8, 9, 12, 16, 17, 14, 7, -5, -25, -51, -72, -83, -84, -76, -62, -48, -43, -51, -62, -59, -44, -31, -30, -39, -45, -41, -27, -6, 16, 35, 45, 46, 44, 45, 55, 69, 74, 58, 20, -22, -53, -68, -71, -64, -47, -25, -12, -13, -25, -35, -38, -34, -26, -18, -12, -8, -5, 1, 16, 40, 60, 66, 54, 35, 21, 18, 28, 47, 67, 80, 85, 84, 76, 62, 43, 26, 22, 32, 50, 65, 70, 61, 44, 25, 6, -15, -40, -57, -57, -42, -27, -27, -41, -59, -66, -59, -46, -38, -41, -51, -60, -67, -76, -83, -84, -79, -73, -68, -62, -53, -49, -51, -56, -52, -38, -17, 6, 30, 48, 52, 42, 28, 22, 30, 48, 69, 86, 97, 104, 106, 102, 91, 78, 66, 60, 58, 60, 62, 62, 58, 52, 42, 25, 2, -22, -44, -60, -70, -72, -61, -37, -2, 32, 55, 58, 46, 31, 23, 25, 39, 59, 77, 86, 84, 73, 62, 53, 50, 54, 59, 61, 57, 52, 50, 51, 53, 58, 66, 70, 63, 41, 5, -38, -88, -132, -162, -173, -170, -160, -143, -118, -81, -35, 9, 36, 38, 13, -32, -87, -135, -159, -155, -135, -111, -84, -46, 0, 48, 84, 105, 113, 107, 91, 69, 43, 12, -14, -28, -28, -26, -33, -51, -75, -96, -107, -103, -89, -74, -67, -68, -70, -73, -77, -84, -92, -100, -105, -107, -106, -104, -99, -86, -69, -54, -44, -32, -15, 1, 11, 15, 21, 27, 24, 9]
1921Ik1k4k1j6oMPONNMLNJ0J9K4J9Nj1j3pKL%nj0j7j7rLJ4K5L1K7J0nrlK%loj0qjMKj%NNj
1900C4m%MNKlorlLNKKNNnj6k1k4k4k4j8rkJNRJ5J0ok7l3k0QL0L8L0J5%j3j5j2rj1j5j2jJ2
1880a02K6L2K9J6OLPPLmj1j7k3k2j5mJ3K9L0K0%j1j3j6j6j2kJmj3j6j5j1oJLLMJ0J7J9J6J6
1863b2J8Rlj4j8j3nKQJ0J2J0J0J0QMK%%JLQRLppJJ0J2PLNQO%qj0j1j2j5j8j6j1lLOJrk1k5
1843e9j7nJLNJ0J7J8J5J2QPQPJrj8k1j8j0KJ6K7K5J1mq%RJ1Ojpj2j3nPK1K7K1Mj8l2l3k2j6
1825b9k1k7k1qJJJJjj0j6j4mLJ0K0L5M4L7K5J2QJ1J8K2J5Jrj0plknj0j7k0j2KRNnj0pkMJ0
1806B5J4J5Qmj1j1kNN%mJRJ7K2K1J8J4Pkj6k8k9j8onj0j3qjLPJ3J6J4Mlqj2j6j7j4j7k1j8
1788e6rkjjKRJ4K0K5K4Pj5k8k3mJ5K4K4J5Lrj9k4j8nNOLJMNQJ0J1Krj4nPK2K7K1Lj2j5q%L
$$ y = [9, -12, -36, -57, -73, -79, -75, -68, -62, -57, -52, -48, -45, -40, -30, -11, 13, 32, 37, 26, 13, 6, 8, 11, 11, 6, -4, -21, -38, -47, -44, -30, -5, 26, 53, 63, 58, 49, 46, 48, 48, 45, 39, 29, 21, 20, 24, 26, 25, 25, 30, 35, 34, 30, 30, 34, 39, 41, 38, 32, 23, 20, 23, 28, 30, 32, 37, 42, 37, 21, 0, -24, -48, -72, -90, -99, -101, -100, -95, -86, -71, -61, -67, -94, -127, -147, -139, -109, -71, -41, -26, -26, -39, -54, -66, -75, -86, -101, -113, -114, -102, -76, -44, -15, 1, 7, 10, 17, 24, 27, 23, 12, -5, -28, -50, -65, -69, -56, -27, 3, 23, 23, 12, -1, -17, -33, -45, -47, -46, -50, -63, -79, -94, -105, -111, -110, -107, -104, -100, -90, -73, -54, -38, -22, -4, 5, 2, -12, -30, -43, -48, -46, -38, -28, -16, -6, 4, 14, 22, 26, 28, 28, 28, 29, 32, 40, 49, 52, 45, 38, 39, 49, 61, 68, 71, 76, 84, 90, 90, 82, 72, 61, 49, 34, 16, 0, -11, -14, -11, -5, -4, -13, -34, -59, -76, -81, -80, -77, -72, -62, -45, -27, -12, 0, 8, 15, 23, 30, 31, 22, 4, -17, -35, -45, -43, -27, 0, 25, 36, 32, 24, 24, 33, 44, 50, 49, 42, 30, 17, 12, 19, 40, 67, 88, 92, 74, 42, 9, -13, -29, -50, -77, -98, -106, -105, -104, -103, -102, -103, -113, -129, -143, -147, -144, -134, -114, -79, -35, 2, 27, 39, 47, 58, 76, 98, 113, 114, 105, 95, 88, 85, 83, 78, 68, 51, 31, 19, 21, 30, 35, 30, 20, 13, 11, 15, 25, 39, 54, 62, 58, 47, 36, 34, 39, 44, 44, 40, 41, 50, 67, 89, 110, 128, 142, 149, 147, 131, 103, 74, 56, 50, 45, 35, 22, 14, 13, 16, 23, 36, 52, 66, 70, 67, 59, 47, 31, 14, 0, -17, -38, -56, -65, -67, -68, -69, -67, -58, -44, -24, 1, 25, 32, 17, -11, -34, -38, -23, 1, 25, 40, 43, 34, 15, -9, -27, -32, -27, -21, -18, -17, -13, -8, 0, 10, 21, 23, 14, 0, -5, 2, 24, 51, 72, 75, 63, 48, 40, 40, 43]
1769D3NQPLJKKlqnjjmqj0j2j4j1nNJ7K7K3Nrj2lJJKRNj0k4k4lJ5K4J5kj6j8j3ppopoolMPO
1748b1jrj4j4qKOlj8k2qJ2K3K2J0jkQJ9K4K1J0%loprj1j0pJQRLjMJ1J5Nj2k7l5k6rOJ2RNN
1728c4LLMNKmj1j1pmmjKOQOMLMKjmmkk%MJ4J9J8J4Pkj2j7rJLlj2j3oNJ4J8J6J0Njqj6j8j7
1707b3rJJ0J6J5J7K1K9K9J6jqj0j7l2m3l7k3lJ0J2N%NJ9K8L0K8K6K2J0j0k1j8lJ0J6J4RNK
1690A47jnrrnMJ1J6J3%k1m2n0m4k9j8j6j9k1j7oLJ1J2J2RPRJ4J6J0mj8k3j7nNNJkjMLlj0o
1672h9LJ1RL%%JLRJ5J8J3PPRNlqkPMqj4mJ3K3J3rk3k0j1lJPJ8K9K9J9Noj2j2j1qnoj1j4j5
1652a3j4j1qpjPJ0J1RJ1J5J6J1LJLQJ0J0Ook4l6l5k6j4ooj2j9j8mJ8L1K8J6NPJ6K6K9K2J2
1635H1Koj6k4k4j5mjnj1j4j5j2lRJ7J7J3J0J1J4J4J3RJj3k1j9qNJ5K0J7Mj1j6qJNkj0j5j7
$$ y = [43, 48, 56, 63, 66, 67, 69, 71, 68, 60, 55, 54, 53, 49, 41, 31, 19, 5, -6, -11, -6, 11, 38, 61, 66, 57, 45, 42, 43, 44, 46, 55, 60, 50, 26, 2, -1, 14, 38, 53, 51, 35, 17, 4, -3, -10, -16, -23, -29, -35, -38, -34, -27, -21, -22, -31, -45, -59, -67, -65, -59, -62, -80, -102, -110, -98, -75, -53, -43, -44, -46, -38, -19, 5, 26, 36, 36, 33, 27, 20, 11, 0, -10, -17, -16, -8, 1, 4, 3, 7, 18, 33, 38, 26, -1, -36, -62, -71, -65, -53, -44, -39, -34, -31, -28, -24, -19, -17, -21, -32, -43, -50, -54, -58, -59, -57, -51, -43, -37, -33, -30, -26, -24, -25, -29, -33, -35, -37, -37, -33, -19, 0, 18, 32, 39, 37, 25, 8, -1, 0, 3, 0, -12, -25, -31, -26, -12, 6, 22, 32, 37, 36, 28, 12, -6, -23, -32, -31, -21, -5, 10, 27, 48, 77, 106, 122, 121, 113, 103, 86, 54, 11, -26, -49, -52, -42, -30, -25, -25, -20, -1, 27, 57, 85, 111, 133, 143, 133, 112, 94, 91, 101, 117, 131, 140, 145, 147, 146, 141, 132, 123, 118, 122, 133, 149, 162, 162, 141, 99, 49, 5, -24, -42, -58, -77, -98, -115, -121, -118, -107, -95, -83, -74, -67, -58, -44, -28, -18, -22, -40, -63, -80, -85, -80, -75, -74, -76, -77, -73, -70, -73, -83, -89, -86, -75, -66, -63, -63, -63, -62, -59, -50, -35, -17, -4, 3, 10, 19, 24, 21, 13, 11, 18, 22, 14, 0, -4, 9, 32, 45, 36, 13, -7, -18, -21, -20, -13, 5, 34, 63, 82, 87, 81, 69, 57, 46, 38, 33, 27, 16, 2, -13, -27, -38, -46, -53, -54, -47, -37, -26, -17, -6, 9, 25, 36, 39, 40, 43, 51, 61, 71, 77, 71, 47, 11, -24, -50, -64, -70, -76, -88, -107, -125, -129, -111, -80, -52, -36, -31, -24, -8, 18, 47, 69, 81, 83, 77, 61, 37, 13, -2, -6, -7, -12, -23, -37, -52, -64, -67, -58, -41, -24, -11, -1, 10, 24, 38, 51, 60, 61, 48, 27, 8, 0, 5, 20, 40, 57, 61, 50, 34, 26, 27, 32, 30, 20, 5, -12]
1617a2j6j0LJ6K2K0J0%rj9l2l6k3%J9K3J9J5J3J1LkjRJ5J9K0K4L4M0L8K9J8J0Klqj2j5k1k6
1601A87l1l1l1l2l4l2k7k0k0k0j6rpj2k1k1j4kJ1K1K4J9J0MLJlj0j5j3pNJ2J2L%NJ6K6L4L9
1585DM0L1J0j6l5m0l6k8j7oOJ4J8K0K0J4pl0m2l4j9j0omkKNJ1J4J2J2J5J4%j9k3qJ1K2K3K1
1568d3J8J3J0J0J3J2ROKrj7k0j1lK%nj6k5l0k6j9j6j5j2mJ3L0M3M4L9K7J5NJNJ4J7J1kj8k6
1551D2k5j7n%MJ0K1K7K5J7Pjpolmj1j5rLJ0Oqk3l4l9m1l7l0k7k6k3j6mJ0K1K5K5J9J1MjkK
1534a25J3K4K5J6MKOQPPQNmj1j0jL%mpj2k0k1j0OOrk6l1k4j1NK6M0L9K6J2J0J1PJmmonjNO
1514a8kj2k1k3j9mJ3K5K2Rpj7j4JJ8K7K6K2J6Onj6k0j8k0k1j8j0OJ9K6J9QJLJ0J1OJpj6k1
1497a4k2j4kPRLmokNJ0PNJmj3k2k5j6KJ9K7K4K1K1K8K9K1Rmj5k0j6pJK%nj0j6j5j3onrrkP
$$ y = [-12, -28, -38, -35, -19, 3, 23, 33, 33, 24, 5, -27, -63, -86, -86, -67, -44, -25, -10, 3, 14, 17, 15, 14, 23, 38, 57, 77, 101, 135, 175, 213, 242, 260, 270, 272, 269, 261, 249, 234, 213, 187, 156, 125, 94, 62, 28, -4, -31, -51, -71, -91, -107, -116, -123, -135, -156, -177, -191, -193, -182, -161, -137, -118, -108, -104, -101, -100, -103, -113, -128, -141, -148, -143, -131, -119, -116, -116, -111, -95, -69, -35, 4, 44, 75, 85, 69, 34, -6, -42, -70, -87, -93, -87, -73, -55, -35, -15, -1, -8, -38, -80, -114, -133, -143, -149, -153, -155, -153, -148, -137, -123, -111, -99, -84, -70, -70, -89, -112, -120, -109, -87, -64, -43, -25, -12, -2, 8, 21, 33, 42, 48, 50, 41, 24, 4, -7, -10, -8, -8, -13, -29, -54, -84, -110, -129, -145, -160, -172, -176, -163, -133, -90, -46, -7, 20, 35, 40, 41, 46, 60, 77, 88, 86, 68, 42, 17, 0, -5, -5, -1, 9, 30, 57, 82, 99, 106, 105, 98, 92, 89, 85, 74, 59, 50, 53, 63, 69, 61, 38, 4, -35, -76, -113, -143, -170, -196, -219, -235, -239, -229, -208, -183, -158, -139, -128, -124, -125, -127, -125, -112, -88, -63, -47, -43, -41, -35, -27, -20, -13, -5, 0, -4, -15, -25, -26, -23, -23, -27, -34, -46, -66, -87, -97, -91, -85, -94, -120, -151, -175, -186, -181, -155, -115, -76, -50, -38, -28, -17, -10, -9, -13, -17, -23, -28, -29, -24, -18, -20, -32, -53, -76, -95, -99, -86, -61, -39, -30, -37, -54, -68, -67, -49, -22, 4, 26, 42, 48, 43, 27, 7, -11, -31, -52, -70, -80, -74, -55, -29, -10, -2, -1, 2, 12, 23, 29, 30, 23, 7, -14, -36, -50, -52, -45, -36, -33, -37, -43, -45, -40, -30, -23, -18, -17, -21, -34, -56, -81, -97, -95, -76, -49, -25, -4, 17, 45, 74, 95, 104, 100, 85, 65, 49, 42, 43, 45, 45, 40, 30, 14, -1, -14, -20, -25, -34, -43, -45, -38]
1478c8J1J1J0J1J2Ojnol%Jpj4j6pjnj6j7j1m%OJ5J6NomKJnqlPJ8K9L5L0J4%m%KKLPJ0QLnj1
1457G8j2pJJ0J3J2PJKNQQQJ1Pmk1l7m8n0m1j9JJ3J1PNPQPLloqj4k4l0k6j7r%PJ3J1NKNOLK
1437h9jkkLJ2J9J9J0jj0j0KK1L5M6N1M9M8N1O5Q7J13J55K15K63K40J17o0k03k63k46j97j45
1424C92j02p0n1l8k4j0mnj1j5j5j1mLONOQOJrj8k8k9k1jJ7K0R%NJ9L5L5K0lj8k6k7k7k4j8
1407b2qjNJ2J4J1JolPJ4J2Nmj2j6j6j3n%NONJlkKKknmmpj5k3k6k1j3jLNQJ5K2J9J5J5K6L2
1387C0K5Orj4j0ljnj6j9j3mkrj4j3j0nNK0L3L1J9Nqj8k0j2LJ6K2K5K1J0krropj3k0k0j3lO
1369c0J1J6J4R%m%Kpj5j4kJ1J1Kj6l3l8k8pJ1J9J6J1LkJJ4L1L7K9J4%j1j4j5j6j7j9j1KJ0
1352b5J0OMMMKpj6j2KJ6K0K3K2J7Oj0j7j4qjLMJkjOJ1Oqk2l1l8l2j7JJ4J5J1MklKJ2J9J8R
$$ y = [-38, -27, -16, -6, 5, 17, 23, 22, 17, 11, 8, 8, 9, 2, -12, -28, -35, -36, -41, -57, -74, -85, -89, -89, -83, -68, -52, -47, -53, -57, -55, -54, -59, -67, -70, -63, -45, -16, 19, 49, 63, 63, 59, 59, 61, 63, 66, 73, 83, 91, 94, 89, 78, 66, 59, 60, 70, 83, 95, 102, 103, 105, 110, 118, 126, 134, 145, 152, 148, 127, 90, 42, -8, -49, -68, -67, -54, -43, -36, -31, -24, -16, -9, -6, -9, -15, -23, -37, -61, -91, -117, -134, -143, -143, -136, -123, -112, -107, -105, -100, -94, -91, -89, -90, -92, -94, -91, -79, -60, -41, -31, -32, -42, -52, -50, -29, 6, 52, 103, 152, 200, 251, 316, 403, 516, 671, 886, 1149, 1389, 1506, 1446, 1243, 980, 734, 537, 392, 290, 220, 169, 131, 107, 97, 93, 88, 77, 62, 47, 36, 32, 35, 41, 46, 52, 60, 66, 67, 58, 40, 12, -17, -38, -39, -22, -2, 7, 7, 12, 31, 66, 101, 121, 118, 100, 74, 47, 20, -4, -22, -30, -31, -26, -14, 0, 11, 12, 6, 3, 10, 24, 36, 41, 37, 25, 9, -7, -20, -25, -25, -20, -14, -9, -8, -11, -13, -11, -9, -11, -16, -20, -24, -31, -46, -69, -95, -116, -129, -130, -127, -122, -114, -99, -77, -58, -43, -28, -2, 30, 55, 61, 52, 38, 28, 25, 24, 19, 3, -16, -29, -33, -35, -44, -58, -71, -81, -86, -81, -61, -28, 3, 22, 27, 19, 1, -19, -31, -28, -12, 10, 35, 56, 66, 64, 55, 46, 40, 33, 20, 0, -20, -33, -36, -30, -19, -3, 11, 20, 20, 16, 16, 18, 11, -4, -18, -20, -9, 2, 4, -12, -45, -83, -111, -118, -107, -88, -72, -61, -58, -60, -59, -45, -14, 23, 52, 66, 66, 55, 41, 26, 10, -7, -26, -37, -35, -25, -15, -9, -5, -1, 3, 5, -2, -18, -30, -28, -12, 8, 31, 53, 70, 76, 66, 49, 35, 27, 26, 29, 33, 34, 32, 31, 37, 48, 54, 46, 24, -7, -45, -77, -94, -93, -79, -64, -53, -49, -51, -54, -52, -40, -21, -3, 6]
1334F%njLMmj6k7k4j3mkqro%NJ0J4J1Lqj0jJ1K0K5K4J9J4Nmj1j2r%KNLjj0j9j6qjmqqorj4
1313i4j1%J2J5J0Jqj4j4oNJ6K8L8M3L9K9J8RKlj0j6j9j4kLLlqrrj0j4j9k5k1pRJ4Q%mllqk2
1294g4l8l9k4jJ2J6J4J9K8L3L4K6J9J5J7J9J7Nj1k5l2l0k0j6j3j3rorj0jJ3K4J9Pjnprrpm
1277g6KJ1J9K1J7J1J2RJj1k5l3k7j1OJ7J7J2Jj3k3k1oRJ6J5J1J0J0J2J3J5J9K3K1Oj5k7k5
1262B3j5j2j8k0qJ0K4K7K6K4K4J7Jj5k3k2k3k6k6j7okoj0j1j4j9k2j8j0mMJ0J7J9J9K3K9L4
1246a6L0K1J1LllKJ0J4J3Pmj9l3l8l1j5lKPJ4J6J6J3J1%j7l1l7l0k1j5j3j1pl%KKLPJ5K2K5
1228h4K3J5PMOJ1J3J4J5Ork4l4l4l0k2rMJ6K5L2L2K0JrmOJ0J1RPLOJ1J4Qlj4k1k5k3j3JPQ
1210a3QJ3J6J4RRJ1J5J2Lj3k8l5l3k7j6lNLoj2qmjJLJnr%J3K1J1nj3j1qj3k4k6j1J2K9K6J5
$$ y = [6, 6, 1, 0, 3, 7, 3, -13, -40, -64, -77, -81, -83, -91, -100, -106, -106, -101, -91, -77, -66, -63, -71, -81, -82, -71, -51, -26, -2, 17, 31, 36, 32, 21, 9, 0, 0, 2, 7, 10, 9, -1, -20, -36, -44, -45, -49, -57, -65, -71, -80, -94, -105, -105, -93, -78, -68, -67, -75, -89, -103, -109, -104, -88, -60, -22, 21, 60, 89, 107, 116, 118, 115, 105, 89, 70, 56, 54, 57, 60, 57, 49, 40, 31, 21, 7, -12, -37, -58, -65, -56, -42, -34, -34, -38, -41, -44, -52, -74, -112, -151, -175, -176, -164, -148, -134, -115, -87, -54, -20, 6, 25, 40, 57, 76, 93, 98, 87, 62, 30, 0, -20, -36, -49, -62, -71, -77, -86, -96, -97, -84, -60, -41, -34, -35, -40, -47, -56, -65, -72, -76, -74, -63, -44, -23, -6, 5, 17, 26, 27, 16, -9, -42, -69, -80, -74, -57, -40, -28, -27, -40, -63, -84, -90, -81, -65, -50, -39, -29, -19, -7, 6, 21, 40, 63, 84, 90, 75, 48, 23, 8, -4, -22, -42, -50, -40, -16, 11, 37, 61, 85, 102, 103, 88, 65, 43, 20, -6, -32, -49, -55, -57, -63, -73, -84, -98, -117, -139, -157, -167, -171, -167, -157, -140, -121, -102, -79, -50, -16, 14, 35, 46, 49, 46, 43, 45, 55, 69, 82, 89, 85, 66, 33, -5, -36, -51, -54, -52, -45, -31, -15, 1, 14, 25, 25, 8, -23, -60, -90, -111, -126, -139, -150, -157, -160, -160, -158, -156, -153, -146, -131, -109, -84, -61, -46, -39, -35, -29, -18, -5, 9, 24, 30, 21, -3, -37, -71, -101, -123, -132, -128, -112, -87, -55, -23, -3, -2, -11, -15, -9, 1, 12, 21, 28, 31, 37, 48, 62, 70, 67, 53, 32, 7, -16, -29, -28, -21, -13, -5, 8, 24, 38, 47, 56, 67, 82, 94, 97, 84, 56, 21, -12, -39, -55, -58, -53, -50, -56, -68, -76, -80, -81, -80, -77, -76, -81, -90, -90, -77, -56, -45, -50, -63, -74, -82, -95, -119, -145, -156, -144, -115, -89, -74]
1192g4PQJ0Mpj2rnknojRK0K7K5J5Lpj1j2rlNQJ0J0J0J2P%pj0j4j8j2PK3K6J4lk1l1l9l2j7
1174a07KJ1Qlj3j4nJ2K7L7L6K7J6NmokJlj1j5rNJ4J2KolNJ1J1OkpoLJ0RJ%Kkj1j8j4qj0k2
1154b8k5j5ljpoMJ1Qnj6j8j2n%MRJ6J9J0JlJMJknrj5j6rKPPOQJ1Qmj7k4j8j2rpMK2K8J8kj6
1134a00j4pjMJ0J1QPORQLknkKRJ3J4J4Qjj3k1k2j7j3rlMJ5K3L1L1K3Rnj5j6k0k5k8k9k4k0
1116a50j3pjjJQJ7K4K2J6J1PQRJ4J5Qoj9k5k3j7qkLMMjooNJ9L1L3K4Qoj7j5qnpp%J0K0K9L1
1097C1K2Kj9k7k2j4nMQRJ1K0L0L4L3K4J0j0k2k3j5mLPMqk2l0l0k4k0j5mJ0K3K5K0J5J8K9L6
1080A14L1J6Krj8k3j9j3j8k8l5k9k2j8k0j9j2jJ0J8K4K2J9J6J4J7J8K0J4Kj2k1k2j8nNJ3J0
1065B3JllnoooomMJ1J3QKnj2k0k3j8j1rj2j8k1j8j3njOJ2J6J9J9K1J7QmnJKrj9j9qMJ3J6J5
$$ y = [-74, -67, -59, -49, -45, -52, -64, -73, -78, -80, -85, -91, -92, -83, -63, -36, -11, 4, 7, 0, -11, -23, -32, -35, -30, -22, -12, -2, 8, 20, 27, 27, 20, 10, -4, -22, -34, -27, -4, 22, 36, 33, 12, -19, -58, -90, -107, -105, -94, -86, -89, -102, -116, -121, -109, -82, -45, -9, 18, 34, 39, 35, 29, 27, 28, 25, 14, -1, -10, -5, 9, 21, 23, 17, 14, 19, 30, 41, 47, 45, 38, 32, 35, 45, 54, 55, 55, 57, 55, 44, 26, 12, 4, -6, -28, -53, -68, -71, -72, -79, -85, -81, -70, -62, -67, -83, -101, -113, -118, -118, -114, -105, -89, -70, -60, -59, -62, -61, -57, -56, -58, -63, -72, -87, -103, -112, -110, -103, -96, -90, -82, -71, -63, -67, -84, -108, -126, -138, -147, -154, -150, -128, -100, -82, -84, -100, -114, -121, -122, -118, -108, -97, -89, -82, -76, -67, -59, -56, -58, -63, -65, -63, -54, -41, -27, -13, -5, -6, -19, -40, -62, -79, -92, -101, -104, -100, -85, -62, -31, 0, 23, 32, 27, 12, -4, -24, -49, -77, -106, -130, -150, -163, -170, -171, -172, -171, -163, -146, -122, -100, -84, -73, -66, -58, -49, -35, -20, -12, -18, -37, -62, -85, -102, -110, -112, -109, -105, -101, -102, -108, -114, -109, -90, -59, -26, -2, 6, 0, -17, -32, -40, -45, -52, -59, -59, -49, -29, 0, 31, 53, 55, 36, 9, -13, -27, -32, -28, -20, -11, 0, 20, 50, 84, 117, 141, 151, 141, 119, 96, 81, 77, 80, 87, 91, 83, 61, 31, 1, -23, -43, -58, -62, -52, -29, -4, 16, 31, 49, 78, 114, 145, 161, 163, 154, 136, 113, 94, 81, 63, 35, 0, -29, -51, -69, -89, -108, -120, -121, -111, -93, -69, -47, -28, -12, 2, 19, 37, 57, 71, 73, 61, 40, 18, 0, -5, 0, 13, 23, 24, 21, 18, 13, 7, 1, -5, -11, -15, -11, 0, 13, 21, 23, 18, 6, -14, -37, -55, -66, -75, -87, -105, -126, -144, -157, -162, -163, -157, -145, -129, -110, -91, -70, -53, -45, -49, -54, -53, -51, -60, -79, -98, -106, -102, -89, -73, -58]
1046e8Omp%ONlqnMJ6J6Nj2k0j8j1j0j4j3q%J1J7J5Oj%J1K0K0J2kj8k6k1qjlqpkKNJ2K1L0L5
1026a3K8J6mk0k7l2l4l2k1qKLJKLQJ7K9L3K8J4Llprj0j1j0j2j5j8j5oQJ5J1%j2j9k3j7nJ3
1009a49K6K5J9J0PJ3J9K0J1NNOMlqj0j1j7j8oPJ3QKKMOPJ0J5J8J6J5J2RPMlj6k7l1k6k3j8
991d1j4rqj3j8j8j3rkRK0K1Rjmkj%MQMnqLJ7K5K2J4LmplJjmojQJ5J7J1%j1j4j3j0rprj5k0
971h9k1j3mORQKJPJ6J7J0KMJ2J7J3Lklnj0j6j6rmllOK1L0K6J7Pjqj2j0lKkqj2pKPL%%OQMn
950@j2j3oMJ3J1Km%NOkonLQJ1Olj3j5j2lJ0K1L0K2Oj1j6j8k2l1l1k0mOLnj1j0mRK4L7M0K9
931B9J2%jLMKLQJ2J1QRQLoj4k2k8k7j8pjnj3j9j7rLJ2K1K6K3J8RLKK%oj2j4j2pJOQ%rj6j2
911b9nKNQNjooJPNLLQJ0J3J3J0OLPJ2J0jj2j9k2k0j0KJ2J1MJ%kmJJ1J9K4K0J1jrrj0j7k4j9
$$ y = [-58, -52, -56, -63, -63, -57, -52, -55, -63, -68, -64, -48, -32, -27, -39, -59, -77, -88, -98, -112, -125, -133, -133, -122, -105, -90, -84, -85, -85, -74, -54, -34, -22, -24, -42, -68, -89, -97, -98, -101, -109, -116, -118, -116, -111, -99, -78, -48, -13, 15, 31, 27, 7, -20, -52, -86, -118, -139, -147, -145, -142, -141, -139, -136, -128, -111, -82, -49, -21, -7, -4, -7, -14, -23, -33, -44, -54, -66, -81, -99, -114, -120, -112, -97, -86, -86, -98, -117, -140, -157, -162, -149, -123, -98, -79, -69, -62, -49, -30, -10, 1, 6, 11, 17, 21, 18, 10, 0, -11, -28, -46, -52, -45, -32, -24, -22, -20, -16, -10, -3, 7, 22, 40, 56, 71, 83, 92, 99, 103, 100, 84, 57, 26, 0, -23, -41, -55, -64, -72, -85, -103, -121, -134, -143, -145, -136, -116, -95, -86, -87, -91, -93, -94, -94, -90, -82, -78, -83, -91, -88, -71, -46, -24, -10, -7, -11, -18, -21, -20, -21, -25, -31, -32, -24, -9, 8, 19, 19, 8, -6, -19, -29, -38, -45, -54, -69, -89, -110, -123, -127, -121, -112, -104, -102, -101, -94, -78, -61, -51, -49, -45, -33, -16, -3, 0, -2, -5, -10, -20, -36, -52, -61, -65, -68, -71, -65, -44, -14, 12, 29, 36, 35, 27, 15, 5, 2, 4, 2, -6, -18, -25, -23, -16, -13, -13, -13, -7, 1, 5, 0, -12, -25, -31, -27, -14, -3, -1, -5, -5, 0, 6, 4, -2, -7, -4, 4, 15, 21, 18, 5, -10, -22, -25, -15, 6, 36, 58, 64, 53, 37, 19, -3, -34, -65, -85, -89, -83, -80, -85, -96, -106, -110, -101, -77, -40, 0, 29, 41, 41, 40, 43, 47, 49, 52, 60, 72, 83, 91, 100, 108, 111, 105, 91, 69, 41, 14, -4, -11, -12, -17, -30, -49, -66, -75, -72, -60, -39, -13, 10, 28, 37, 40, 42, 44, 44, 38, 26, 12, 0, -7, -6, 0, 8, 8, -1, -17, -29, -34, -32, -27, -19, -14, -15, -21, -27, -26, -19, -14, -11, -8, 0, 10, 23, 36, 46, 52, 55, 62, 74, 84, 83, 71, 52, 30, 10, 0, 2, 14, 25, 29, 30, 30, 28, 24, 25, 36, 55, 79, 99, 110, 109, 100, 91, 81, 64, 40, 21]
891B1pJMNPJ1J1J0Kj4l1l7l0j2jLNMKqj9k6k8k1nJ4K6K9K5J7R%oj0j1j0nMJ2J3J1J0J1J4K0
873B0K0J4%j0j5j1lNJ4J4J2QNJmpkNOmj5j9j3nlrj3j0QK5L1K0LnJJ3K0J8J4J1J2Omj6j9j8
854A01j8k2k5k0j2lNRRN%nj1j7j9j1l%KQJ8K3J4qk7l4k5nJ0J5J4J4J6J6J5J0Lj%KKlqrrj6
836@k8k9k1j3roJM%mLJ5K3K2J8J5J2J1J0Nmj6j8j5pjKNMMRJ2J5J2J1QJj1k1k1j8j3plmonJ
816e7Nkj0j2pJJ3K9L8L2J4qj9j7rMJ0OjomjkjLLKjlj0j4oPJ5J4J7K5L1K5J0jnqrolrk4l3k4
796hpRJ3J2NkoqqqlJNNMNKlqj4j8j9j5lPJ0PMLkj5k9l2k5j5kJ4K8L1J8Jqomlnpj1j4j5j0o
775a55npjJ1K5K2Nj5j8nJ4K2J7Nmonk%%MJ0J7J8J0KKQJ2J1Mlrj4j6j9k6k5j2J4L6M3L3J4j
757A1j0qLJ7K6J8Jj1j4j2j3j2rLJ0Mpj6j3lQJ3J0LnrmMPLmrrrpnkkpj1j0%J3J5Pqj9j6lNJ
$$ y = [21, 14, 15, 19, 24, 31, 42, 53, 63, 65, 51, 20, -17, -47, -59, -60, -57, -52, -48, -46, -54, -73, -99, -127, -148, -153, -139, -113, -84, -59, -42, -33, -33, -39, -49, -60, -70, -75, -71, -59, -46, -35, -25, -14, 0, 20, 40, 54, 54, 44, 29, 18, 15, 20, 34, 48, 60, 68, 73, 74, 70, 63, 61, 66, 72, 68, 53, 34, 21, 16, 13, 4, -9, -19, -11, 14, 45, 65, 68, 63, 64, 77, 97, 115, 129, 140, 152, 158, 154, 138, 119, 101, 83, 61, 36, 16, 4, 1, 6, 15, 24, 29, 29, 24, 13, -4, -23, -34, -37, -37, -35, -27, -9, 14, 28, 20, -7, -41, -66, -71, -61, -46, -32, -18, -2, 14, 29, 39, 42, 41, 41, 43, 45, 42, 34, 25, 16, 0, -28, -57, -78, -91, -100, -106, -105, -101, -101, -105, -102, -87, -64, -42, -24, -9, 3, 14, 24, 29, 25, 9, -9, -24, -31, -32, -30, -25, -21, -17, -8, 4, 19, 31, 42, 50, 51, 40, 19, -2, -20, -33, -40, -43, -47, -53, -58, -57, -52, -54, -64, -76, -83, -82, -69, -40, -2, 30, 44, 36, 17, 0, -9, -5, 5, 11, 10, 4, 0, -1, -3, -4, -1, 2, 4, 3, 0, -10, -24, -30, -23, -8, 6, 23, 48, 79, 104, 114, 113, 108, 100, 91, 85, 82, 73, 49, 16, -8, -15, -6, 7, 19, 24, 22, 16, 8, 0, -8, -11, -10, -5, 0, 4, 9, 11, 8, 0, -14, -32, -51, -66, -69, -62, -52, -45, -41, -38, -40, -55, -84, -116, -141, -156, -158, -144, -116, -85, -67, -66, -74, -80, -84, -87, -92, -99, -110, -124, -139, -149, -155, -160, -167, -168, -157, -132, -110, -105, -120, -138, -143, -129, -107, -90, -85, -89, -95, -100, -102, -102, -102, -98, -88, -71, -53, -43, -41, -39, -31, -19, -8, -4, -7, -16, -30, -46, -65, -91, -116, -128, -114, -78, -35, -2, 12, 11, 1, -7, -4, 13, 39, 57, 58, 47, 33, 21, 8, -4, -13, -10, 0, 4, -3, -19, -32, -35, -27, -14, -4, -1, -6, -15, -19, -15, -8, -5, -9, -18, -27, -36, -43, -48, -50, -52, -59, -70, -80, -80, -67, -52, -45, -53, -72, -88, -91, -86, -85]
737h5j2k0j9j4j6k1k0rNJ4J7J9K0K0J5PjnkPJ8L0L4K4Pj2j6j1jKLQJ3J8J9J3Jj8l0k5j3lk
720d1nmMJ0J4J5K0K9L3K8J9R%qj5j7j8j7j9j6rpj3k8l3k6j6nKNKnj0mNQ%rj3j2j2j6k1k0p
702b23J3K6L0K9K6J7Moqnkkj%K%mj2k0k1j7j3j2rLJ9K6K5K1J8J4Mmmmpj2j0kOJ1J3J5J8J8
683d0J8J4QNMMNQJ5J7Rlj0qjQJ3J3J0OJ1K0J9Lj6j8oJ%olNJ1J7K0K0Roj9k6k7k6j7qqj8l0
665cl7l3k1pOJ4J8J4Nj0j7pPJ3jj8k1rOJ3J5J5J3J1J0J4J8K2K2K0J8J9J8J1lj8k9k9k3k0j4
648BlQJ9K2J8J1MJLMOJ2K1K8K1Kk0l1k9j5JLpk2k3j2%Kkokjjnoprj0pjKNNNJoj3j3oRK1K4
627CK3J8J6K0K0J3lj5k0j5roqj2j7j4rmoj6j9j7rrrnOJ4Oj4l3l7k2%J9K8L0K7K1J7J6K0J8
610GJ5J3J5J7Pj2k5k7j9j8j4nJ4K5K2J1ORJ2Mqj7j7j5j2j2j0j4k1l0k9j6LJ6J9J8K1K8L1K6
$$ y = [-85, -97, -117, -136, -150, -166, -187, -207, -216, -211, -197, -180, -161, -141, -121, -106, -99, -100, -105, -107, -100, -82, -52, -18, 6, 13, 1, -15, -26, -27, -25, -22, -14, -1, 17, 36, 49, 50, 32, 2, -23, -36, -39, -41, -46, -50, -46, -36, -22, -7, 13, 42, 75, 103, 122, 131, 131, 123, 108, 91, 73, 56, 37, 21, 12, 5, -8, -36, -69, -95, -111, -116, -114, -109, -107, -112, -122, -126, -121, -113, -113, -122, -135, -147, -159, -175, -196, -216, -223, -210, -184, -154, -125, -99, -82, -78, -84, -92, -97, -99, -101, -102, -102, -100, -100, -104, -116, -136, -157, -174, -187, -199, -208, -205, -186, -160, -135, -114, -96, -82, -78, -82, -86, -90, -97, -109, -119, -121, -115, -104, -91, -76, -58, -40, -22, -8, 0, 5, 9, 13, 18, 26, 41, 58, 67, 64, 54, 46, 45, 53, 66, 79, 89, 95, 106, 126, 145, 148, 132, 114, 108, 109, 109, 103, 100, 105, 116, 133, 153, 173, 182, 176, 157, 131, 104, 78, 61, 53, 45, 27, -3, -40, -73, -94, -101, -95, -81, -63, -49, -44, -54, -71, -78, -71, -58, -59, -77, -98, -107, -101, -88, -73, -58, -45, -34, -24, -10, 8, 30, 52, 72, 90, 109, 127, 138, 135, 117, 88, 59, 36, 16, 2, -1, 7, 26, 48, 66, 77, 81, 82, 85, 89, 95, 107, 128, 156, 177, 179, 159, 128, 99, 84, 85, 88, 81, 59, 36, 24, 24, 26, 24, 18, 16, 15, 14, 9, 3, -4, -13, -23, -30, -31, -29, -24, -19, -14, -13, -19, -32, -45, -51, -42, -21, 3, 26, 44, 60, 80, 100, 113, 110, 95, 75, 60, 51, 45, 37, 25, 8, -6, -15, -19, -25, -41, -60, -77, -86, -95, -104, -109, -103, -89, -83, -97, -130, -167, -189, -189, -170, -142, -112, -85, -64, -47, -31, -11, 7, 22, 35, 50, 67, 74, 62, 37, 10, -9, -27, -41, -46, -32, -7, 15, 26, 32, 41, 53, 57, 49, 32, 15, 0, -12, -24, -34, -48, -69, -99, -128, -144, -141, -125, -106, -88, -67, -39, -8, 18]
594A8J7Olj8l3m0k8oJ3J9J5QLjlqj5j8j2kJ0J4J4J0NKKOPPPNPNLjpj1j1lRJ2J2Mmj1j5j3q
574c1pj0r%J0J3Mj2k5l1k4nJ4K0J3KmnprnOJ1Nrj0NK7L9L3J6JprrpomKPQRQJ0Mqj9k6k6j8
554g5pLJ0J0J1J4J3Npj4j2kMPRJ3J8K2J9Prk3l0k7j5MJ7K1J0oj6j7j2j1j1qjRJ2J3J5K1K5
537IK2J0mj4k0k1j9j0KJ2J4Mj1j8j6qlkNJ6K0J5QOQQJjNJ3J1%j2j5j0m%QJ3J3Noj1qoj0j9
518b0k2j7rjMOPPLjoj0j3j5j5j2okj%J%jlJJ0K3L6M2L7K5Rkrj2j2oJ1K9M0L4J6nj8k3k4k5
499E1k5j7kJ2J6J6J4J8K2K6K8J9Jk0l5l9l6l1k3j5nMM%nn%QJ8K4K2Rlp%Llj2j2mJkppmmpj3
480b7j8k2k2j6oLPKrj9k1j3%RMj0j9j9j0mmjPJ4J7K1L0L5K6Jk5l6k9qJ9L6L5K0PJkpj1qkk
461g6nok%LJ0J9K2J8J2J0J3J3J3J2Nnj1j1j0j6k5k6j6%J1J2QNPJ4J9J8J6R%j6l4l9l5k2qM
$$ y = [18, 35, 41, 38, 20, -13, -53, -81, -87, -74, -55, -40, -32, -29, -30, -33, -41, -56, -74, -86, -88, -78, -64, -50, -40, -35, -33, -31, -25, -18, -11, -4, 1, 8, 13, 16, 15, 8, -3, -14, -17, -8, 4, 16, 20, 16, 5, -10, -23, -31, -38, -48, -57, -57, -47, -34, -30, -42, -67, -98, -122, -127, -113, -93, -80, -78, -82, -87, -94, -103, -108, -102, -91, -86, -95, -105, -100, -73, -34, -1, 15, 16, 9, 0, -9, -16, -22, -26, -24, -17, -9, 0, 8, 18, 22, 14, -5, -31, -57, -75, -82, -79, -69, -59, -48, -34, -21, -16, -23, -37, -49, -51, -47, -40, -31, -18, 0, 22, 41, 48, 39, 16, -14, -41, -56, -52, -35, -14, -4, -10, -26, -43, -55, -66, -77, -85, -86, -77, -65, -52, -37, -16, 9, 31, 41, 37, 23, 3, -18, -37, -47, -45, -33, -19, -15, -26, -44, -60, -68, -71, -73, -68, -52, -32, -17, -9, -3, 5, 13, 14, 13, 18, 31, 42, 42, 30, 15, 5, 1, 1, 9, 22, 35, 40, 34, 23, 15, 9, -1, -20, -42, -59, -68, -69, -65, -59, -52, -45, -42, -43, -49, -59, -72, -87, -102, -114, -120, -122, -123, -123, -122, -122, -123, -126, -125, -115, -92, -56, -14, 23, 48, 57, 55, 46, 34, 22, 16, 27, 56, 96, 130, 146, 141, 123, 100, 76, 51, 26, 9, 7, 19, 35, 51, 65, 83, 105, 131, 159, 178, 179, 159, 124, 85, 49, 18, -5, -20, -25, -21, -17, -17, -22, -27, -27, -19, -1, 23, 45, 54, 51, 44, 44, 47, 44, 32, 20, 16, 17, 15, 8, 1, -3, -7, -14, -27, -45, -67, -89, -105, -111, -108, -101, -99, -108, -127, -148, -161, -161, -152, -148, -158, -177, -196, -206, -210, -214, -215, -208, -194, -177, -156, -126, -91, -65, -64, -89, -125, -154, -162, -143, -107, -72, -52, -45, -44, -46, -53, -64, -72, -74, -76, -81, -87, -89, -89, -86, -76, -57, -35, -17, -5, 5, 18, 31, 44, 56, 61, 56, 45, 34, 24, 8, -17, -43, -59, -59, -48, -36, -28, -23, -16, -2, 17, 35, 51, 60, 60, 44, 10, -29, -64, -86, -94, -90]
444i0ROKMJ0J4J0PONOJ2K4K7J9LppjK%rj8k2k0j7j1onj0j6j6qLJ3J6J2%j5k4k6k7l0k4jK8
426a72M5M2L1J9J2RPOJoj0qKJ1J3Pjqj4j9k3j9nJ4K5K5J6Nqk0k0pQJ1Nnj3j8j5oPJ6K0J9J0
408a1kj9l0l4k5mJ4J9J0jllnqkJ3K4K3J0oj6j7nRJ7J3JpoPK1K4J6Mlnoom%%mmLJ2J4Qnj7j9
388a5j2l%lJJ4K2K0QLKmk1l9m8l9j9KJ5J0mj6j5kJ2K1K5K6J8J0NLjrj7j8j6j2pjJ0K0K4K3
370b7J9J5J4J0Mnj3j8k6k7k0jJ8K9K4J3Jrk1l1l1k1pklkOK0K8K9K4J8J1jj8k4j9jJ6K4K0J3
353B9POJ0J0Krj6k1k5l5l7l0k0j3oKJ0J2Mmrpljoj2j5j6j6j3mJ2K5K3RkmlnpqpKJ6L5M0K9
334g1J1NQJ3RJnlknj6k4k4j3mjMK0L9M3K5Mj1j2j4j3j0qj1j4pQK4K9K4J5Kj2k2k3j3ljnj4
316g7k0k1j5o%LOQP%pokjllLJ2J9J9J5OjmJRJ6J9J3Lqj5j5j3j2qkKKJ%kj2k0k0j3pj2k2k2
$$ y = [-90, -81, -75, -73, -69, -59, -45, -35, -28, -22, -17, -11, 1, 25, 52, 71, 74, 67, 60, 59, 61, 61, 52, 34, 12, -8, -25, -36, -42, -47, -57, -73, -89, -97, -94, -81, -65, -53, -53, -68, -92, -118, -145, -175, -199, -200, -172, -127, -85, -54, -35, -23, -14, -7, -1, 0, -6, -16, -24, -22, -11, 2, 9, 8, 0, -14, -33, -56, -75, -80, -66, -41, -16, 0, 5, -3, -23, -43, -50, -42, -31, -26, -31, -44, -62, -77, -83, -76, -60, -40, -21, -11, -13, -32, -62, -96, -121, -125, -111, -92, -82, -83, -86, -89, -94, -102, -104, -91, -67, -44, -34, -40, -56, -73, -78, -69, -52, -39, -38, -45, -51, -44, -23, 1, 17, 21, 18, 13, 7, 1, -3, -3, -3, -7, -11, -8, 4, 18, 26, 21, 4, -15, -27, -30, -30, -33, -32, -18, 4, 24, 32, 35, 37, 33, 12, -27, -75, -114, -133, -131, -116, -106, -110, -126, -141, -143, -131, -110, -85, -59, -41, -31, -26, -23, -24, -33, -50, -68, -84, -96, -103, -104, -94, -74, -50, -27, -8, 7, 21, 31, 35, 30, 17, -1, -27, -54, -74, -75, -57, -28, -4, 9, 10, 1, -20, -51, -82, -103, -110, -112, -115, -117, -111, -91, -63, -34, -10, 8, 19, 18, 0, -24, -43, -44, -28, -4, 16, 29, 36, 42, 52, 62, 64, 55, 39, 18, -7, -42, -79, -109, -129, -142, -148, -146, -136, -124, -120, -124, -133, -140, -143, -144, -150, -162, -177, -193, -209, -222, -226, -214, -189, -166, -157, -159, -163, -166, -171, -178, -186, -193, -191, -175, -140, -100, -71, -60, -55, -47, -34, -25, -24, -29, -32, -34, -39, -55, -79, -103, -116, -120, -121, -117, -97, -58, -15, 10, 14, 3, -9, -23, -36, -46, -54, -65, -79, -86, -78, -54, -25, -1, 14, 16, 4, -18, -41, -54, -57, -58, -63, -77, -97, -118, -133, -139, -139, -136, -130, -122, -115, -115, -122, -128, -130, -131, -134, -137, -134, -122, -103, -84, -69, -63, -64, -68, -67, -58, -42, -23, -10, -7, -15, -30, -45, -58, -70, -78, -80, -78, -76, -75, -75, -77, -89, -109, -129, -142, -149, -161, -183, -205]
296b05oJ8L5L8L1K3J5Kj4k3j9rpj4k5k4j4JRJ2J5K6L8M2L0Pj3k3k6k7k8k6j6JJ4J9J2QRPk
279a09j4j7pOJ0Mpj3j4j0lLRJ5J9J6OlppmKJ0J2O%kMJ4K4L7M1L3J5jj2j7j9j2jJ1J6J0lk1
261B0l2l8l5l0k4j3KJ5J9J9K0K6L2L0J8jj2j1orj2oJ7L8M3K8J0krj1rmjrk0k3j7oJNPMmj1
244aj1KJ7K4J5mj6k2k1k0j4%J7L0L3L3K7J5%rqjL%opjOOjprqj6k6l2k8j4jNPJ0J1RNKLORM
224A6pj6j4%J8K0J3LJMPMlqpjKnj8k1oJ6K6J6lj8j9rJNOPJ0J1QJkkknj0pLJ0J2Plj2j7j3m
203eLJnnjKknnj%JLOMoj7j6qnj1j9j6kPJ3J5J7J1lj0oNJ4J5J6J3Kqj5j9k0k4j9j1nlQL2N3
183c1N4L4J2lj2j7j7qLJ1J2Nqk4k8k0mRJ1QJllJOPLkopmMJ0P%pnJJnj5j8j6j0nJPRMoj3j4
162i0qKJ2J9J7RLKNMJjLOPKkkKPQJ0J1J3J4J3Rlk3m1m3k6%J5J3Jqj5j6j6j3j0nMJ4K0K2K4
$$ y = [-205, -211, -193, -158, -120, -89, -66, -51, -49, -63, -86, -105, -114, -121, -135, -160, -184, -198, -197, -188, -176, -161, -135, -97, -55, -25, -18, -31, -54, -80, -107, -135, -161, -177, -176, -162, -143, -131, -123, -114, -107, -109, -123, -140, -147, -141, -131, -127, -134, -147, -161, -171, -174, -171, -162, -147, -128, -112, -106, -109, -116, -123, -127, -125, -115, -103, -97, -97, -99, -95, -81, -57, -20, 21, 54, 69, 68, 56, 39, 20, 8, 7, 18, 34, 44, 41, 20, -12, -50, -85, -115, -139, -152, -150, -135, -116, -97, -77, -51, -19, 11, 29, 28, 16, 5, -1, -10, -22, -28, -11, 27, 70, 98, 108, 106, 97, 86, 77, 73, 72, 63, 43, 20, 3, -3, -2, 3, 10, 14, 10, -1, -12, -10, 7, 31, 46, 42, 26, 4, -17, -37, -51, -51, -34, -4, 29, 62, 89, 104, 104, 95, 87, 86, 89, 89, 83, 76, 75, 81, 87, 86, 79, 70, 62, 46, 20, -12, -40, -54, -55, -50, -43, -33, -22, -13, -8, -6, -3, 3, 12, 16, 9, -7, -21, -21, -3, 17, 30, 33, 34, 38, 45, 49, 46, 38, 31, 30, 32, 27, 9, -12, -18, -2, 24, 40, 37, 19, 0, -9, -8, -3, 3, 10, 20, 31, 39, 40, 38, 36, 34, 29, 19, 12, 15, 25, 37, 44, 41, 29, 12, -1, -5, -2, -1, -6, -11, -12, -10, -12, -17, -22, -23, -23, -22, -19, -13, -9, -15, -32, -48, -56, -61, -72, -91, -107, -109, -102, -89, -74, -57, -46, -49, -59, -65, -60, -46, -31, -15, -2, 0, -8, -23, -42, -62, -86, -105, -116, -121, -124, -116, -84, -31, 23, 57, 69, 66, 54, 37, 20, 12, 15, 26, 38, 43, 35, 11, -17, -37, -41, -32, -21, -13, -12, -15, -18, -17, -11, -4, -1, -3, -9, -16, -20, -16, -6, 1, 1, -6, -11, -10, -9, -14, -29, -47, -63, -73, -78, -77, -70, -61, -57, -63, -76, -90, -98, -96, -84, -65, -48, -39, -36, -34, -29, -25, -24, -25, -22, -16, -9, -7, -9, -11, -9, -2, 6, 16, 27, 40, 54, 67, 76, 73, 50, 9, -34, -60, -60, -45, -32, -31, -39, -54, -70, -86, -99, -109, -114, -110, -96, -76, -54, -30]
143c0K7K4J4mj5j6o%NJnj2j5j0ooqpkLKKJ0K1K4J0jplJJmrj6j6j1ooqkJ0J6J0ok3l5l7k2L
123a70K6L6L1K0Qnj8k4k3j5jJ2J8J5J1RROJoj1j2oLRQONRJ3J5J7J4Lj1j4j1mmrp%QJ3J3J1
105bQNlj2j4pQJ6J1lj2j4j2j3j7j7j1kNJ0J0Nnj1j0okkkOJ3J4RMkj0j6j4%RPqk1k7k0qLMM
85a52J0J7J9J2NMRJ5J7J5J1M%KJ2K4K7J3j3l5m4l7k4j9j6j2nkpj4j2%J2J2%rkJ8L4L4K2J0
68d5Lj%NJ4J8J8J8K1K3J8OkkMMlj0j0noj6k3k4j3kPOmk1l5m3m3l6k2qklJK0L9M6M4M4M1K9
50E0Nk0l3l4k7j0J1K3J8Jj6j8qRK0K0RMMNMJKNMjpnkJKKMQPpk4l9m6m1l1j5JJ2J7J6J3RMm
30i7qmLJ0J1J0J4K6L5L5K5J3jj5k7k3qkrk0k1j0nj0k0k7k6j7jJ0J2QLJkpplOJ4K0J8J4PKm
11g7j0j1KJ6K3J6RPOKkmrj8k3j3NJ6J0kj5k3k4j5JJ8K7K5K1J4P%qj2j3pkKLMJlonjjloonJ
$$ y = [-30, -3, 21, 35, 31, 16, 0, -6, -6, -1, 0, -5, -17, -32, -42, -48, -54, -62, -69, -71, -68, -66, -64, -54, -33, -9, 1, 0, -7, -10, -9, -8, -12, -21, -37, -53, -64, -70, -76, -84, -86, -76, -60, -50, -56, -79, -114, -151, -173, -170, -144, -108, -77, -57, -49, -54, -72, -96, -119, -134, -135, -123, -105, -90, -79, -70, -61, -55, -54, -60, -71, -83, -89, -86, -77, -69, -63, -58, -49, -36, -21, -4, 10, 13, 2, -12, -23, -27, -31, -40, -47, -47, -39, -26, -13, -2, 6, 11, 8, -4, -18, -25, -17, -1, 10, 7, -5, -19, -31, -44, -61, -78, -89, -91, -86, -76, -66, -61, -66, -77, -87, -93, -95, -97, -99, -93, -80, -66, -57, -53, -55, -65, -81, -95, -95, -86, -79, -87, -108, -135, -155, -163, -160, -156, -152, -142, -125, -106, -94, -89, -85, -76, -61, -44, -29, -18, -14, -14, -12, 0, 24, 51, 64, 51, 16, -28, -65, -89, -108, -124, -136, -141, -143, -150, -164, -176, -176, -164, -152, -152, -161, -163, -145, -111, -77, -55, -45, -42, -43, -43, -38, -24, -6, 12, 30, 51, 74, 92, 98, 96, 94, 98, 102, 99, 89, 79, 74, 68, 52, 29, 5, -8, -10, -3, 3, -1, -22, -57, -100, -143, -179, -201, -209, -211, -214, -213, -193, -154, -108, -64, -20, 21, 50, 55, 35, 2, -32, -59, -69, -58, -35, -17, -16, -32, -50, -58, -49, -29, -9, 0, 4, 8, 13, 17, 18, 20, 25, 29, 28, 21, 16, 14, 15, 17, 19, 23, 31, 38, 31, 7, -32, -78, -119, -150, -165, -164, -152, -135, -119, -106, -97, -93, -97, -105, -109, -106, -96, -85, -75, -61, -35, 0, 35, 60, 73, 72, 57, 30, 7, -1, -3, -12, -32, -53, -63, -68, -78, -98, -125, -151, -168, -169, -159, -147, -139, -136, -135, -137, -144, -151, -154, -148, -134, -114, -96, -82, -75, -73, -77, -87, -98, -96, -80, -57, -41, -32, -25, -19, -17, -19, -23, -32, -50, -73, -86, -81, -65, -55, -57, -72, -95, -119, -134, -133, -115, -88, -63, -42, -28, -21, -21, -29, -41, -54, -61, -63, -61, -58, -54, -53, -56, -62, -67, -68, -69, -72, -78, -84, -89, -88]
-9h8J0J8K0J7Qlj1qKJ2J4Pjj3k5l4k9j6kNJ1J5K0J7RkqqjPROKKJlrj0j0j2j2qjKJ%jmqrpk
-30a30J0K5L5L6K7K4K4J7Nj0j7j9j9j6j0%J1J7K1J7Qnj7k1j8j8k6l9m2k6LK6L0J9QLmj2j7
-46a00j4oJKNJ2J8K1J5Mpj1oQK1K5J2nj7j7rmnqj0pjOJ1PjjPJ9K1J4N%lqj6k2k2j2KJ2J2K
-65e0pj3j3j4j6j9j7nJ3K7K7J7QOJ0J7K0J9J7J1LkmKOQMLJlj6k9l0j8JJ2J3Kj3k5k5j7pmo
-83a06pjLJnpkRJ7J6Ppj5j7j5j5j4rj%kJJ7M0N3M6K4Jj7k7k5j0NJ4J3QL%JOJ3J7J6R%mnpq
-103A4pkKlj1j6j0%NMLMOJ1J4J0ok6m1m4l0pJ4K2J4NRJ8K3J5Jj2k2k2j0KLqj4j1kkml%J%j
-122a14%kmLJ5K4K5K1J8J5J4J1Mnj0jRJ1Loj0j4j7j7pMLmokMRJ6K0J6Jj1j0jNMkmkOJ7K7K7
-141H3J9Olnpj1j7k1j6roj0j4j3nLRJ2J2J4J0PNJqj6k2k2j5qjKJj%KMLkqj6k3k4j7j1o%OP
$$ y = [-88, -78, -60, -40, -23, -15, -18, -29, -37, -35, -23, -9, -2, -3, -16, -41, -75, -104, -120, -122, -117, -106, -91, -71, -54, -45, -47, -55, -63, -64, -57, -48, -42, -40, -38, -37, -40, -49, -59, -69, -81, -93, -101, -102, -100, -99, -99, -100, -104, -112, -121, -128, -130, -120, -95, -60, -24, 3, 27, 51, 68, 73, 63, 46, 27, 8, -8, -18, -18, -7, 10, 31, 48, 56, 51, 34, 13, -5, -23, -49, -88, -130, -156, -153, -127, -97, -78, -70, -67, -71, -83, -100, -114, -120, -119, -117, -112, -100, -82, -61, -46, -42, -49, -60, -66, -58, -37, -12, 0, -5, -22, -39, -48, -52, -57, -65, -75, -82, -83, -77, -66, -59, -60, -61, -54, -35, -14, 0, 5, 5, 2, -6, -22, -44, -66, -78, -76, -64, -52, -50, -57, -70, -83, -97, -113, -132, -149, -154, -141, -114, -87, -70, -62, -56, -46, -29, -9, 10, 27, 38, 41, 39, 35, 37, 43, 51, 55, 58, 59, 56, 40, 11, -19, -37, -36, -24, -11, -9, -22, -47, -72, -89, -96, -100, -106, -113, -114, -111, -110, -115, -122, -124, -115, -98, -82, -75, -82, -97, -114, -129, -144, -158, -167, -168, -168, -170, -169, -152, -112, -59, -13, 11, 12, -5, -32, -57, -67, -62, -48, -35, -27, -24, -24, -23, -17, -4, 13, 29, 38, 38, 34, 29, 22, 14, 7, 5, 7, 4, -7, -23, -33, -33, -28, -24, -21, -17, -11, 0, 14, 24, 18, -8, -49, -93, -123, -130, -116, -94, -80, -75, -66, -48, -25, -10, -9, -21, -43, -65, -75, -73, -70, -78, -92, -103, -105, -107, -111, -114, -114, -113, -113, -114, -114, -116, -120, -117, -102, -78, -53, -32, -14, 1, 15, 26, 30, 25, 15, 14, 23, 34, 37, 31, 21, 7, -10, -27, -34, -30, -27, -31, -37, -39, -35, -26, -10, 10, 26, 27, 16, 6, 5, 10, 14, 12, 8, 6, 12, 29, 56, 83, 102, 108, 105, 100, 93, 82, 65, 44, 28, 19, 13, 3, -11, -24, -29, -26, -17, -5, 7, 21, 31, 38, 43, 44, 36, 20, -2, -24, -39, -47, -48, -46, -45, -46, -46, -44, -40, -37, -39, -47, -63, -86, -110, -127, -138, -144, -144, -138, -131]
-161a31lj7k0rJ0K4K7K5J6Lj6l8n3n4l5nJ6K2J9J7J3OmnJQJ0OJ%Jj%MJ5K8K9J4nj4rJQJ3K0
-179f2K1J8RLklljNJ2J4J0kj3j4j1ojRJ9K3J6Jj3k5l4l6k6qQK3L2L5K2Jj4j6j5j7k0j8j4j2
-196a05j2oJNNJ3L0M6M5L0Qpj0m%Jnj1j4j2j3j2j1qokkklnnkMQMoj1oOJ3J7K1K6K8K2J8J9
-215I0J8J3Kj1k4l7m4l8k8k0j5j2j2j1rnlormPJ4J3RQJ0J5J7J4LnmLO%rj4j8k1j7kJ5K1J3
-233h7kj4j6r%Loj3j0KRNkkQK1L0L1K3Prk5l3l1k1j2okMJ1J1NjLJ5K3K0Nj1k1k3j4lMkj3j7
$$ y = [-131, -134, -151, -171, -180, -170, -146, -119, -94, -78, -75, -91, -129, -182, -236, -271, -276, -260, -238, -219, -202, -189, -183, -187, -192, -191, -183, -173, -167, -166, -166, -165, -166, -166, -162, -147, -119, -90, -76, -81, -95, -104, -103, -95, -82, -62, -41, -23, -14, -11, -13, -16, -19, -20, -15, -3, 11, 21, 19, 6, -8, -19, -25, -26, -17, 2, 25, 41, 42, 29, 4, -30, -66, -92, -100, -92, -69, -37, -2, 20, 21, 7, -9, -24, -41, -61, -79, -93, -105, -117, -123, -122, -117, -112, -99, -69, -23, 22, 52, 60, 53, 43, 39, 39, 40, 35, 24, 10, -2, -15, -27, -38, -46, -52, -54, -56, -58, -61, -66, -71, -73, -69, -61, -57, -63, -74, -80, -74, -61, -44, -23, 3, 31, 53, 71, 90, 108, 121, 123, 112, 88, 51, 7, -31, -59, -79, -94, -106, -118, -129, -138, -143, -146, -152, -161, -165, -158, -144, -131, -122, -114, -104, -89, -72, -58, -55, -60, -64, -61, -55, -55, -64, -78, -96, -117, -134, -136, -121, -100, -87, -89, -103, -119, -128, -128, -125, -131, -144, -154, -152, -143, -138, -140, -142, -134, -113, -83, -52, -29, -22, -31, -56, -89, -120, -141, -153, -159, -161, -157, -146, -135, -130, -131, -128, -113, -90, -70, -65, -76, -97, -120, -134, -137, -133, -135, -148, -165]
$$ [...]
-2084d0
##END=	
##END=	
