##TITLE=	Nov10-2021.40.fid
TM-VI-156

##JCAMP-DX=	6.0	$$ MestReNova 14.3.0-30573
##DATA TYPE=	LINK
##BLOCK_ID=	1
##BLOCKS=	2    
##ORIGIN=	Mestrelab Research S.L.
##OWNER=	hrzepa
##$MNOVA/LINK_BLOCK_TYPE=	ITEM	$$ NMR Spectrum
##$MNOVA/ITEM/POLYGON=	(XY..XY)
5321,5835
8722,5835
8722,8208
5321,8208
5321,5835
##$MNOVA/ITEM/Z=	0
##$MNOVA/ITEM/ANGLE=	0
##TITLE=	Nov10-2021.40.fid
##JCAMP-DX=	6.0	$$ MestReNova 14.3.0-30573
##BLOCK_ID=	2
##DATA TYPE=	MNOVA NMR VIEW DATA
##DATA CLASS=	MNOVA VIEW DATA
##$MNOVA/ITEM/ZOOM/X=	-4.005464102252559222,	16.005770000004368114
##$MNOVA/ITEM/ZOOM/Y=	-724.49255275726318359,	8021.14630126953125
##END=	
##TITLE=	Nov10-2021.40.fid
##JCAMP-DX=	6.0	$$ MestReNova 14.3.0-30573
##BLOCK_ID=	3
##DATA TYPE=	NMR SPECTRUM
##DATA CLASS=	XYDATA
##NUMDIM=	1
##ORIGIN=	Bruker BioSpin GmbH
##OWNER=	nmr
##.OBSERVE FREQUENCY=	400.4124024600000098
##.OBSERVE NUCLEUS=	^1H
##.SOLVENT NAME=	CD2Cl2
##.PULSE SEQUENCE=	zg30
##LONGDATE=	2021/11/10 13:45:00.000
##.ACQUISITIONMODE=	SIMULTANEOUS (DQD)
##$ORIGINAL FORMAT=	Bruker XWIN-NMR
##$MNOVA/SCALES_VERSION=	9
##$PARAMETER FILE=	(acqus, ASCII, /private/var/folders/f6/rjf_tdyn2v98c5c0wvkgn4s80000gn/T/3S78RiS1SnKrNURNmLsfDw/40/acqus, 0)
$$ ##TITLE= Parameter file, TOPSPIN		Version 3.2
$$ ##JCAMPDX= 5.0
$$ ##DATATYPE= Parameter Values
$$ ##NPOINTS= 11	$$ modification sequence number
$$ ##ORIGIN= Bruker BioSpin GmbH
$$ ##OWNER= nmr
$$ $$ 2021-11-10 13:45:53.023 +0000  nmr@CZC10666PP
$$ $$ /opt/topspin/data/agmb/nmr/Nov10-2021/40/acqus
$$ $$ process /opt/topspin3.2/prog/mod/shimcntl
$$ ##$ACQT0= -2.36344537815126
$$ ##$AMP= (0..31)
$$ 100 100 100 100 100 100 100 100 100 100 100 100 100 100 100 100 100 100
$$ 100 100 100 100 100 100 100 100 100 100 100 100 100 100
$$ ##$AMPCOIL= (0..19)
$$ 0 0 0 0 0 0 0 0 0 0 0 0 0 0 0 0 0 0 0 0
$$ ##$ANAVPT= -1
$$ ##$AQSEQ= 0
$$ ##$AQ_mod= 3
$$ ##$AUNM= <au_zg>
$$ ##$AUTOPOS= <31 >
$$ ##$BF1= 400.41
$$ ##$BF2= 400.41
$$ ##$BF3= 400.41
$$ ##$BF4= 400.41
$$ ##$BF5= 400.41
$$ ##$BF6= 400.41
$$ ##$BF7= 400.41
$$ ##$BF8= 400.41
$$ ##$BYTORDA= 0
$$ ##$CAGPARS= (0..11)
$$ 0 0 0 0 0 0 0 0 0 0 0 0
$$ ##$CFDGTYP= 0
$$ ##$CFRGTYP= 9
$$ ##$CHEMSTR= <none>
$$ ##$CNST= (0..63)
$$ 1 1 145 1 1 1 1 1 1 1 1 1 1 1 1 1 1 1 1 1 1 1 1 1 1 1 1 1 1 1 1 1 1 1 1
$$ 1 1 1 1 1 1 1 1 1 1 1 1 1 1 1 1 1 1 1 1 1 1 1 1 1 1 1 1 1
$$ ##$CPDPRG= (0..8)
$$ <> <> <> <> <mlev> <mlev> <mlev> <mlev> <mlev>
$$ ##$D= (0..63)
$$ 0 1 0 0 0 0 0 0 0 0.06 0 0 0 0 0 0 0.0002 0 0 0 0 0 0 0 0 0 0 0 0 0 0 0
$$ 0 0 0 0 0 0 0 0 0 0 0 0 0 0 0 0 0 0 0 0 0 0 0 0 0 0 0 0 0 0 0 0
$$ ##$DATE= 1636551952
$$ ##$DE= 6.5
$$ ##$DECBNUC= <off>
$$ ##$DECIM= 2496
$$ ##$DECNUC= <off>
$$ ##$DECSTAT= 4
$$ ##$DIGMOD= 1
$$ ##$DIGTYP= 12
$$ ##$DQDMODE= 0
$$ ##$DR= 22
$$ ##$DS= 2
$$ ##$DSPFIRM= 0
$$ ##$DSPFVS= 20
$$ ##$DTYPA= 0
$$ ##$EXP= <proton>
$$ ##$F1LIST= <111111111111111>
$$ ##$F2LIST= <222222222222222>
$$ ##$F3LIST= <333333333333333>
$$ ##$FCUCHAN= (0..9)
$$ 0 2 0 0 0 0 0 0 0 0
$$ ##$FL1= 90
$$ ##$FL2= 90
$$ ##$FL3= 90
$$ ##$FL4= 90
$$ [...]
$$ 90 74 58 42 26 10 0 0
$$ ##$Sgu3PowerLevels= (0..7)
$$ 0 0 0 0 0 0 0 0
$$ ##$Sgu4PowerLevels= (0..7)
$$ 0 0 0 0 0 0 0 0
$$ ##$Sgu5PowerLevels= (0..7)
$$ 0 0 0 0 0 0 0 0
$$ ##$Sgu6PowerLevels= (0..7)
$$ 0 0 0 0 0 0 0 0
$$ ##$Sgu7PowerLevels= (0..7)
$$ 0 0 0 0 0 0 0 0
$$ ##$Sgu8PowerLevels= (0..7)
$$ 0 0 0 0 0 0 0 0
$$ ##$SguType= 3
$$ ##$ShimPowMaxUA= (0..63)
$$ 130000 130000 130000 130000 130000 130000 130000 130000 130000 130000 130000
$$ 130000 130000 130000 130000 130000 130000 130000 130000 130000 0 0 0 0
$$ 0 0 0 0 0 0 0 0 0 0 0 0 0 0 0 0 0 0 0 0 0 0 0 0 0 0 0 0 0 0 0 0 0 0 0 0
$$ 0 0 0 0
$$ ##$ShimPowMaxUC= (0..63)
$$ 130000 130000 130000 130000 130000 130000 130000 130000 130000 130000 130000
$$ 130000 130000 130000 130000 130000 130000 130000 130000 130000 0 0 0 0
$$ 0 0 0 0 0 0 0 0 0 0 0 0 0 0 0 0 0 0 0 0 0 0 0 0 0 0 0 0 0 0 0 0 0 0 0 0
$$ 0 0 0 0
$$ ##$ShimPowMaxUG= (0..63)
$$ 524287 524287 524287 524287 524287 524287 524287 524287 524287 524287 524287
$$ 524287 524287 524287 524287 524287 524287 524287 524287 524287 0 0 0 0
$$ 0 0 0 0 0 0 0 0 0 0 0 0 0 0 0 0 0 0 0 0 0 0 0 0 0 0 0 0 0 0 0 0 0 0 0 0
$$ 0 0 0 0
$$ ##$ShimPowRcbType= 3
$$ ##$ShimPowRes= (0..63)
$$ 1e-20 1e-20 1e-20 1e-20 1e-20 1e-20 1e-20 1e-20 1e-20 1e-20 1e-20 1e-20
$$ 1e-20 1e-20 1e-20 1e-20 1e-20 1e-20 1e-20 1e-20 0 0 0 0 0 0 0 0 0 0 0 0
$$ 0 0 0 0 0 0 0 0 0 0 0 0 0 0 0 0 0 0 0 0 0 0 0 0 0 0 0 0 0 0 0 0
$$ ##$ShimPowRng0= (0..63)
$$ 1 1 1 1 1 1 1 1 1 1 1 1 1 1 1 1 1 1 1 1 0 0 0 0 0 0 0 0 0 0 0 0 0 0 0 0
$$ 0 0 0 0 0 0 0 0 0 0 0 0 0 0 0 0 0 0 0 0 0 0 0 0 0 0 0 0
$$ ##$ShimPowRng1= (0..63)
$$ 1 1 1 1 1 1 1 1 1 1 1 1 1 1 1 1 1 1 1 1 0 0 0 0 0 0 0 0 0 0 0 0 0 0 0 0
$$ 0 0 0 0 0 0 0 0 0 0 0 0 0 0 0 0 0 0 0 0 0 0 0 0 0 0 0 0
$$ ##$ShimPowRng2= (0..63)
$$ 1 1 1 1 1 1 1 1 1 1 1 1 1 1 1 1 1 1 1 1 0 0 0 0 0 0 0 0 0 0 0 0 0 0 0 0
$$ 0 0 0 0 0 0 0 0 0 0 0 0 0 0 0 0 0 0 0 0 0 0 0 0 0 0 0 0
$$ ##$ShimPowRng3= (0..63)
$$ 1 1 1 1 1 1 1 1 1 1 1 1 1 1 1 1 1 1 1 1 0 0 0 0 0 0 0 0 0 0 0 0 0 0 0 0
$$ 0 0 0 0 0 0 0 0 0 0 0 0 0 0 0 0 0 0 0 0 0 0 0 0 0 0 0 0
$$ ##$ShimSysFunc= (0..63)
$$ 1 2 3 4 5 7 9 11 15 16 8 10 12 14 6 17 13 18 19 20 0 0 0 0 0 0 0 0 0 0
$$ 0 0 0 0 0 0 0 0 0 0 0 0 0 0 0 0 0 0 0 0 0 0 0 0 0 0 0 0 0 0 0 0 0 0
$$ ##$ShimSysMatrix= 0
$$ ##$ShimSysType= 1
$$ ##$TFXNUM= 0
$$ ##$TRIPLO2= 0
$$ ##$VTU= 2
$$ ##$VTUETH= <149.236.99.20>
$$ ##$VTUTY= <no>
$$ ##$WBREFAM= (0..15)
$$ 135 116 100 100 100 100 100 100 100 100 100 100 100 100 100 100
$$ ##$WBREFLM= (0..15)
$$ 0 0 0 0 0 0 0 0 0 0 0 0 0 0 0 0
$$ ##$WBREFPH= (0..15)
$$ 71.66 -68.25 0 0 0 0 0 0 0 0 0 0 0 0 0 0
$$ ##$WBSGU= (0..15)
$$ 0 0 0 0 0 0 0 0 0 0 0 0 0 0 0 0
$$ ##$XFAC= 2
$$ ##END=
$$ 
##$DECIM=	2496
##$DSPFVS=	20
##XUNITS=	HZ
##YUNITS=	ARBITRARY UNITS
##FIRSTX=	6408.8703656999996383
##LASTX=	-1603.8278811825093726
##DELTAX=	-0.12226593800080123864
##XFACTOR=	1
##YFACTOR=	0.014120872429486270791
##FIRSTY=	9.9438428878784179688
##MINY=	4.7025766372680664063
##MAXY=	7291.951171875
##NPOINTS=	65536
##XYDATA=	(X++(Y..Y))
$$ [...]
2138C001o4n0l6l2l6m6o3o7m7k2j9l1l3j9j2k7m0l3k2k5l7l8k7j6lJ0J5Jk1l0j7NK0J9pm5
2134B106p2p1n8n6o3o2m9l2j5OJ9Qk4m7m0j7l%NK0L3K8Mk3l3k1JJ7J9J3PLMOLj1k6k9j6pj5
2129A512k8k5oLj2l6m4l6k3k1k0pJ9M1M6L2J4KKOLj%J1K0J4jj9k4j3J3M2N3L5%k4k1rnj4k4
2124A455l1l6l1j4RK0J0pj9k6k5j5MJ0ol1l3j0J0Lj6k0pL%omOPL%llkNJ5J9J6Qok6l7l4k3
2118A132k0j6kK1L1K3J9K4K1j0m7m9j6J8L4L2L2L1K7K3K6L1K3jl0m7m7m3m5m0k3%Lj4l0k6
2114A045k0k5l2j3K1M0K8J1QJ7J4%j6k5l1k6jL3N3N1L3J0j4l8n6n6l8qJ5K1RKNJ7K4K3J3K
2109A096kLOrl8n5l9JK8L2L1M9P1O5K9nj4j4k8n0n6l6j5rj3nLJj0j1NJ6J0jkNJj4k1j1RK1
2104A024J6O%MJ3K3K3J3ok1k1j2JJj4l7n6n6l3LL4M2L3K2J5J3J2J3Oj3l7m2k4JJ1Lm%RJ1J
$$ plain form
2138 3001 2937 2887 2851 2819 2783 2737 2674 2607 2560 2538 2519 2488 2455 2436 2424 2397 2357 2324 2302 2277 2240 2202 2175 2159 2156 2166 2181 2182 2161 2131 2114 2119 2139 2158 2151 2106
2134 2106 2034 1963 1905 1849 1786 1724 1675 1643 1628 1634 1653 1661 1637 1590 1550 1533 1530 1530 1535 1555 1588 1616 1620 1597 1564 1543 1544 1561 1580 1593 1600 1603 1607 1613 1616 1605 1579 1550 1534 1527 1512
2129 1512 1484 1459 1453 1456 1444 1408 1364 1328 1305 1284 1264 1257 1276 1317 1363 1395 1409 1411 1413 1419 1422 1421 1421 1432 1452 1466 1465 1446 1422 1409 1422 1464 1517 1552 1552 1528 1507 1498 1493 1479 1455
2124 1455 1424 1388 1357 1343 1352 1372 1382 1375 1356 1330 1305 1290 1294 1304 1298 1267 1234 1224 1234 1237 1221 1201 1194 1197 1197 1191 1187 1193 1200 1203 1203 1200 1197 1195 1200 1215 1234 1250 1258 1252 1226 1189 1155 1132
2118 1132 1112 1096 1094 1115 1146 1169 1188 1212 1233 1223 1176 1127 1111 1129 1163 1195 1227 1258 1285 1308 1334 1365 1388 1387 1357 1310 1263 1220 1175 1135 1112 1112 1115 1101 1071 1045
2114 1045 1025 1000 968 955 976 1016 1044 1055 1063 1080 1094 1094 1078 1053 1022 996 995 1028 1081 1132 1165 1175 1161 1123 1067 1011 973 965 980 1001 1010 1012 1017 1034 1058 1081 1094 1096
2109 1096 1094 1097 1103 1094 1056 1001 962 963 991 1023 1054 1103 1174 1239 1268 1263 1249 1235 1207 1157 1101 1065 1050 1041 1028 1023 1026 1027 1017 1006 1011 1027 1037 1036 1034 1039 1040 1026 1005 994 1003 1024
2104 1024 1040 1046 1046 1050 1063 1086 1109 1122 1116 1095 1074 1062 1063 1064 1050 1013 957 901 868 871 905 947 980 1002 1017 1030 1042 1055 1061 1048 1011 969 945 946 957 960 956 956 965 976 977
2099I77j3j7lK3L9L2J1oj2j9k9l4k7j2k%jMJ5K7L2K7K0K1K1J4kj0kPml1n2m8k6kJ4K5L1J5
2094A003j6m1l1PL9L7J7%jLnj5j6LK9M4L7J9%j8l6m8m5l2k1j0J0K9K7LpJ8M9M4Pj6p%j8m1
2089A001l7j1J4K2J9J2Moj2j7j9j1MJ5OrrOJ4Nj1j7j1kkqj5nK4M5L8RnOJ8Rrj1KJ5J5RJj5
2084A071k8j9J1L6L4J5jpj5k6l0k3j8k5l4k9j1%qk4k3KL2M6M1L1K4K0J8J4J3Rkqpkqk3l5l6
2079I75k9k6k3j0QK2K7K3J2kj6k5k3j3kNMLMJ4K4K8K8K6K0Nj6k9k4j2nj0k0l0l2k0NK8L8L3
2074I65K1J3J6K7L4K9Pj8l0l0k3j9k0k1j9qRK1J8RJnj4k1j6JJ1Lj1j2LK1K6K0J5J8K0Rk2n4
2069I74n9l0OK0J1nqkJMOQKl%J3K4K1J2OPJ3J9K5L3L3J9ql2m2l6k4j6j1pKJ0J0kj9k7k3j5
2064I10j4j7j3QK8K8RqnPJ1NOJ3J5Kj3rQK1K2K0K2K3K1K2K8L1K3J3J0J5K0K3L1M5N6N7N7N8
$$ plain form
2099 977 964 947 944 967 1006 1038 1049 1043 1031 1012 983 949 922 910 908 908 907 911 926 953 985 1012 1032 1053 1074 1088 1086 1076 1074 1081 1077 1046 994 946 920 918 932 957 988 1003
2094 1003 987 946 915 922 961 998 1015 1015 1014 1017 1012 997 981 984 1013 1057 1094 1113 1113 1095 1059 1011 966 934 913 903 913 942 969 972 965 983 1032 1076 1083 1067 1060 1060 1042 1001
2089 1001 964 953 967 989 1008 1020 1024 1018 1006 989 970 959 963 978 984 975 966 972 986 991 980 963 952 950 948 940 925 920 944 989 1027 1036 1031 1037 1055 1064 1055 1044 1046 1061 1076 1085 1086 1071
2084 1071 1043 1024 1035 1071 1105 1120 1119 1112 1097 1071 1041 1018 1000 975 941 912 901 901 893 869 846 848 880 926 967 998 1022 1042 1060 1074 1087 1096 1094 1086 1079 1077 1069 1046 1011 975
2079 975 946 920 897 887 895 917 944 967 979 977 961 936 913 900 898 903 907 910 914 928 952 980 1008 1034 1054 1059 1043 1014 990 978 973 963 943 913 881 861 866 894 932 965
2074 965 986 999 1015 1042 1076 1105 1112 1094 1064 1034 1011 992 972 951 932 924 933 954 972 981 982 977 963 942 926 927 938 941 930 918 921 942 968 988 1003 1021 1041 1050 1028 974
2069 974 915 885 891 911 922 917 909 907 908 912 918 926 928 925 925 938 962 983 995 1001 1008 1021 1040 1065 1098 1131 1150 1142 1110 1068 1032 1008 992 981 974 976 986 996 994 975 948 925 910
2064 910 896 879 866 874 902 930 939 931 926 933 944 949 955 968 983 985 972 963 971 992 1014 1034 1056 1079 1100 1122 1150 1181 1204 1217 1227 1242 1262 1285 1316 1361 1417 1474 1531 1589
2059A589N7M1J9RJ3J4jk4l0rJ9L0J0j8l0j5QJ2%qjLj3m6o9p3o9p0o6n0l0k1k7l5l7l1j8jR
2054A041LrrQK5K4J6J6K3K4Qj2k1j2kok1l1k6j3klpj3j2oKLnp%RQoj5j8j9j6lK0L0J8j0k8
2049I46k6nK6M6M6K1qk2j8qrk6m6n0l1lJ4J0kmNJ1QNJ3L0M4L8J3j1j5oLLOJ0Nj5k9k2mQJ3
2044I64K1K9K8J5Kj1j6lK5L8J1l1m6k2kok1j7m%KRJ4Orj6j6j5nJ9L8K9OJJ8K2nl8m9k9%K7
2038I63M6M8K9%j5j5j1j6k3k2j5j0j3j4lJ5K4J3pj9j6pmrj1rmmj1j4nJ5K6J8jp%Omj9k2j5
2033H58roOK8L9K5mk0j0J5K9K3QmrrmLJ0J4J3NjmjMRJ3J7J3mk3k8j9j3k0k4j0QQpoK2N0M7
2028A032K5J2J2Pj0k1j3jMlj1j4j2lPJ0lk0k7j8lMKJJlj5k3j9oJ%JJ5L1L4K7L0L7L3Qk4l8
2023A047l6k8j8oLjj3k2k1j6nNJ4J1jj8l1l0j1J6K9J9NJPNor%QQNNlj9l0k6j1%J1K3K6J4j
$$ plain form
2059 1589 1646 1687 1706 1715 1728 1742 1741 1717 1687 1678 1697 1727 1737 1719 1689 1674 1682 1694 1694 1686 1685 1688 1675 1629 1560 1487 1418 1348 1282 1232 1202 1181 1154 1119 1082 1051 1033 1032 1041
2054 1041 1044 1035 1026 1034 1059 1083 1099 1115 1138 1162 1170 1158 1137 1125 1123 1117 1096 1065 1039 1026 1024 1021 1014 1001 989 983 985 988 983 976 976 985 993 987 972 954 935 919 916 936 966 984 974 946
2049 946 920 915 941 987 1033 1054 1046 1024 1006 998 989 963 917 867 836 833 847 857 855 851 856 867 875 880 893 923 967 1005 1018 1007 992 986 989 992 998 1008 1013 998 969 947 943 951 964
2044 964 985 1014 1042 1057 1059 1048 1032 1029 1054 1092 1103 1072 1026 1004 1002 996 975 958 954 954 956 965 979 985 976 960 944 929 924 943 981 1010 1016 1017 1035 1057 1052 1014 965 936 936 963
2038 963 1009 1057 1086 1086 1071 1056 1045 1029 1006 984 969 959 946 932 929 944 968 981 974 955 939 932 928 919 908 899 895 891 880 866 861 876 902 920 919 912 912 918 914 895 873 858
2033 858 849 843 849 877 916 941 937 917 907 922 951 974 982 978 969 960 956 959 969 983 996 1001 1000 996 995 999 1008 1021 1038 1051 1047 1024 996 977 964 944 920 910 918 926 919 913 935 985 1032
2028 1032 1057 1069 1081 1088 1078 1057 1044 1043 1047 1044 1033 1019 1007 1004 1011 1021 1018 998 971 953 950 954 956 957 958 955 940 917 898 892 893 893 894 909 940 974 1001 1031 1068 1101 1109 1085 1047
2023 1047 1011 983 965 959 962 961 948 926 905 889 884 889 903 914 913 895 864 834 823 839 868 887 892 893 900 905 899 890 890 898 906 911 916 913 894 864 838 827 827 838 861 887 901 900
2017I00OL0N3N6L9J5or%Nj0l7m7l7k0j3pMK0L0L1K4J0krj2j8j9j0koj5j0J1K0Rj1j7j0lPK7
2012I67M7N0L1Pj0j9k2k1j3nRK6L3J6j1l0k8j8rJJ3J6Pop%PJ0J0Nnj3j8k3k6k3j5lRK4L5K8
2007A026Pj2j6j8k8l1pK4L3J5jPK0J5%%J6K8J9%j2rKQOmj7l0l8l6k5nJ1J1LMK1L1J5k1m1l5
2002I36j8j1j0kJ6K8K9J9Orj9j5jPOOJ2J5Lj3rJ5L1K3kj9j9rOK1K5J0j9l3k5qj2k8l5j5J1
1997H94K3J8J3J6K1K1J9J1ok8l7k1QK5K2Qnp%QJ1J0PNlk0m1n6m9k3J0L1L0J3KRK4K6J7Kj0
1992I98j8j5LJ8Rk0l8l0oM%kNJ6K3K0J2jj3j8j6j4j1j0oKJ3K5K8K1R%k%QJ7K3J5mk0j9n%j3
1986I88k9k8j0QJ2RJ0J7L0L7L2J0j5k3j3pj6k4j0J3J1j4l0j5J2J9Ppj7k2j8mMj1l1k6QM0N0
1982I47M1L5L2K8K1J3Jj3k0j5j1j8l3l9k8j0NJ0J1J3J6J2lk2k9j6MJ3J3J1Plj6k3j6lLL%P
$$ plain form
2017 900 906 936 989 1045 1084 1099 1093 1084 1084 1089 1079 1042 995 958 938 925 918 922 942 972 1003 1027 1037 1035 1026 1014 996 977 967 965 959 944 934 945 965 974 963 946 936 933 940 967
2012 967 1014 1064 1095 1102 1092 1073 1051 1030 1017 1012 1021 1047 1080 1096 1085 1055 1027 1009 1000 1001 1014 1030 1037 1031 1024 1024 1031 1041 1051 1056 1051 1038 1020 997 971 948 933 930 939 963 998 1026
2007 1026 1033 1021 1005 987 959 928 921 945 978 993 992 999 1019 1034 1034 1034 1050 1078 1097 1097 1085 1076 1078 1086 1092 1088 1071 1041 1003 967 942 937 948 959 962 966 987 1018 1033 1012 971 936
2002 936 918 907 897 895 911 939 968 987 993 984 965 950 949 956 962 968 980 995 998 985 976 991 1022 1045 1043 1024 1005 996 1002 1023 1048 1058 1039 1006 981 973 961 933 898 883 894
1997 894 917 935 948 964 985 1006 1025 1036 1030 1002 965 944 952 977 999 1007 1002 995 995 1003 1014 1024 1031 1036 1033 1013 972 916 867 844 854 885 915 928 930 939 963 989 1006 1008 998
1992 998 980 965 968 986 995 975 937 907 901 905 905 903 908 924 947 967 979 978 965 947 931 917 906 896 890 892 905 930 958 979 988 988 986 986 994 1011 1034 1049 1045 1025 1006 1001 1001 988
1986 988 959 931 921 929 941 950 960 977 1007 1044 1076 1086 1071 1048 1035 1028 1012 988 978 991 1002 988 958 943 955 974 981 974 957 935 917 913 917 906 875 849 857 897 947
1982 947 988 1023 1055 1083 1104 1117 1118 1105 1085 1070 1059 1041 1008 969 941 931 936 946 957 970 986 998 995 973 944 928 932 945 958 969 976 973 957 934 918 915 918 921 921 928
1977I28K0K1%l1m4k6%J5J6J8K4K7K0J0jrj6j3kPOJoj0j0%J4K3K0Poj5j7j4olljNPnk1k5j5
1971H90JJ3J6J4J2J7J6Lk0l5k8rPJ2J6J7J1MMPmk1k3kK0J8Kj0oOJ9K9K8J7O%qk5m0l6k0j3
1966I05j7j1J2K8J5j8l2j7PJ4PNOLpqRL0L5J9%mLNnk0l0l5l1k4j1jKOJ0J5J3PJJPJ9L5M2L4
1961A024J0j7k7k0plrj7k3k4j2J5L8L9J3rrPRqk4k6j9j2ql%mplMNNJ2K0K1J4J1J4J5QLPJ3
1955A016Mk1l5k2OK1J4NOPpk3j7PJ8Nj2qJ1K2K2K0J8J2Korj4j9j9j8j8j6kJ4J4mj6j6qqpM
1950I23J8K3J1JJJ3K4K6J8RPJ1Pj0k7l1k4j4qKJ3K1J6Lj1j2KJ9K3Rrj9j6kJ7L8M4L0Kk1l5
1945A092m0l6k1oKJJNJ1J5J9J2lj7j9j6k4m0l9j2K4M1L4J9J6K2K8K3Nj1j8j9k7l9l7j6KOJ
1940I39OK3L1J6pj8j1JNKLJ4K4K1J1RJ6K3J9Ork2k8k0jJ6J6J1J3J7Mk1l6k7mJ4J8Ppj5j5j7
$$ plain form
1977 928 948 969 969 938 894 868 868 883 899 917 941 968 988 998 997 988 972 959 957 964 970 971 965 955 945 945 959 982 1002 1009 1003 988 971 957 951 948 945 944 949 956 951 930 905 890
1971 890 891 904 920 934 946 963 979 982 962 927 899 890 897 909 925 942 953 957 961 968 964 943 920 918 938 956 958 948 942 948 967 996 1024 1041 1047 1047 1039 1014 974 938 918 905
1966 905 888 877 889 917 932 914 882 865 872 886 893 898 904 907 900 892 901 931 966 985 985 981 984 989 984 964 934 899 868 844 833 832 834 840 850 865 878 885 886 887 894 913 948 990 1024
1961 1024 1034 1017 990 970 963 960 951 934 911 887 875 890 928 967 980 971 962 969 978 970 946 920 901 889 881 878 878 874 867 864 868 873 878 890 910 931 945 956 970 985 993 996 1003 1016
1955 1016 1020 999 964 942 948 969 983 988 994 1001 994 971 954 961 979 984 972 964 975 997 1019 1039 1057 1069 1071 1065 1056 1042 1023 1004 986 968 952 950 964 978 974 958 942 934 926 919 923
1950 923 941 964 975 976 977 990 1014 1040 1058 1067 1074 1085 1092 1082 1055 1024 1000 986 978 980 993 1014 1030 1033 1022 1010 1012 1031 1054 1063 1054 1035 1019 1017 1034 1072 1116 1146 1148 1127 1092
1945 1092 1052 1016 995 989 991 992 993 998 1009 1024 1043 1055 1052 1035 1016 1000 976 936 897 885 909 950 984 1003 1019 1041 1069 1092 1097 1086 1068 1049 1022 983 946 930 932 938 939
1940 939 945 968 999 1015 1008 990 979 980 985 987 990 1004 1028 1049 1060 1069 1085 1108 1127 1133 1124 1102 1074 1054 1053 1069 1085 1096 1109 1126 1130 1109 1073 1046 1042 1056 1074 1081 1074 1059 1044 1027
1935A027k8l2j9%Q%KK4L9K5nj6lJ9K2Nk0l7l6j8JKokJ4K8K1Nrj6j9j6mRJ3OKQJ4RjlLRRNk
1929A037j5l1m0l0oJ5K7L4M0M1L0J3NN%k2m6n3l8k0rJJ6L3M0L3K1J1kj9l1k9j6lMJ0J6J4j
1925A035k4l3j7QK0J2JMJ4J5Kj0j2j1j2qOK5K2kk3k3p%rj5kK0L2J9ok3k2j6j1nMJ4K4K6J5
1920A027pk4j7J2L9L6J5looj1j2pj0k7l9k9pKlmRK1J9J1%rj7j1J2L6M3K9%k8n0n4l4nJ5J8
1915I24J3J1J0MklKLj%QJ7J4jj0j0%J1J8J6Nj2j7qNJ1J5K1K2J1pj8j8j7j5mJ0J2KkNQoj9r
1909I99K2L8J7k3n1m7k2KJ1QORMj2k4j6J0L0L8M0M2L3J0j3k1j8j6j9j5rj4k4k1LK9L3J8OL
1904A046Jrj7j3kPRPPQOLK%kmpqp%J0K3K5J4pl3m5l6j2PJ1%j0j1mPK4M2M3K1j8m0l2rJpj6
1899I75j4j2k0k9k4pLKOJ9L1K7K1J9J4ql6m5k1J4M0N1M5K6jk1k0rlnlPJ3PmqjLJKJ3K3J1j4
$$ plain form
1935 1027 999 967 948 948 956 956 958 982 1021 1046 1041 1025 1022 1041 1063 1068 1048 1011 975 957 958 960 954 952 966 994 1015 1020 1011 995 976 960 956 965 978 984 986 994 1008 1017 1016 1013 1016 1025 1034 1039 1037
1929 1037 1022 991 951 921 915 930 957 991 1031 1072 1102 1115 1120 1125 1125 1103 1057 1004 966 946 937 938 954 987 1027 1060 1081 1092 1090 1071 1040 1011 995 992 996 1006 1022 1036 1035
1925 1035 1011 978 961 969 989 1001 1002 1006 1020 1035 1037 1027 1015 1004 992 984 990 1015 1037 1035 1012 989 982 982 973 958 956 976 1008 1027 1021 998 976 960 949 944 948 962 986 1012 1027
1920 1027 1020 996 979 991 1030 1066 1081 1078 1072 1066 1055 1043 1036 1026 999 960 931 924 926 923 919 928 949 968 979 979 970 953 942 954 990 1033 1062 1062 1034 984 930 896 891 906 924
1915 924 937 948 958 962 960 957 959 962 961 961 969 986 1000 999 989 979 979 990 1008 1024 1029 1017 1000 992 997 1008 1023 1044 1066 1077 1070 1052 1034 1017 1002 998 1008 1020 1022 1020 1025 1033 1027 1008 999
1909 999 1021 1059 1076 1053 1002 955 933 935 946 954 960 969 973 961 937 921 931 961 999 1039 1081 1114 1124 1111 1090 1072 1056 1037 1022 1013 999 975 954 957 986 1019 1037 1043 1046
1904 1046 1047 1038 1021 1008 1006 1013 1022 1029 1036 1044 1050 1053 1055 1055 1053 1049 1042 1034 1027 1027 1037 1060 1085 1099 1092 1059 1014 978 966 973 984 984 974 963 959 966 990 1032 1075 1096 1078 1038 1006 997 998 991 975
1899 975 961 949 929 900 876 869 872 874 880 899 930 957 978 997 1011 1003 967 922 901 915 955 1006 1051 1077 1076 1055 1035 1026 1023 1018 1015 1022 1035 1042 1038 1030 1029 1032 1033 1035 1048 1071 1082 1068
1893A068k6j9j1k0l7l7j2K2M6M6K6pk9k9j8j2j6j2KJ5J3jj9k7j6J2M2M6K6QQJ0mk6k5%K7L4
1889A048K7K1J5Kj6k8l1k5j9j1mPJ7J9J1NJ0J6J5RRJ0Lj3k7l0k0lJ5J8Pqj4j0rrlOJ1%j3k2
1883I86k7k4j1OJ3RQQMnjK1L3J6rj2JP%%QQpj8j2%LLJ4K1J1j3k6k2rqj4j8mK3N4O6N3K0j0
1878A146k7k8k2j7k1k8k5lK3K6RroOJ1N%jmj3k1j9pNJ3J9K0J5MnjJ9L6L2Qj8k7k2j9j7pJ2
1873A042K5K1Nj0j3qJJ1J4J0MMKj4l9n1l6kK3L0K3Mj6l0k7oJ5J9Lj7k6j4JPlj3j1LK2K9K3
1868A005PlKJ6K0J0nj2j8k6l0k4rKLPJ5K2K0J0qk2k9k3rKJ2K0K6K4K0J2%k1l8l1nK0K4J2k
1863I96lknj8l0k9j0J6L4L7L1K4J6OJ%JnqnJORJ4J7J5Qkj2k1k7l0l5m0l3qJ6K6K0J6K1K2J4
1858A044Mpk0l2k9pJ0Pqj3njopPK2K8K7L1M0L9K1%nOJ6Qj0k1j4%PPLNQQ%j7l6m6l7qJ9K3Q
$$ plain form
1893 1068 1042 1023 1012 992 955 918 906 928 974 1020 1046 1039 1010 981 963 951 935 923 925 940 953 952 933 906 890 902 944 990 1016 1024 1032 1042 1038 1012 987 987 1014 1048
1889 1048 1075 1096 1111 1113 1097 1069 1038 1013 994 983 979 986 1003 1022 1033 1038 1048 1064 1079 1088 1097 1107 1110 1097 1070 1040 1020 1017 1032 1050 1057 1049 1035 1025 1016 1007 1004 1010 1021 1021 1008 986
1883 986 959 935 924 930 943 952 960 968 972 967 966 987 1020 1036 1027 1015 1016 1023 1023 1023 1031 1039 1032 1014 1002 1002 1005 1008 1022 1043 1054 1041 1015 993 984 976 962 944 940 963 1017 1083 1136 1156 1146
1878 1146 1119 1091 1069 1052 1031 1003 978 975 998 1024 1033 1024 1018 1024 1035 1040 1040 1039 1035 1022 1001 982 975 980 993 1012 1032 1047 1051 1046 1045 1064 1100 1132 1140 1122 1095 1073 1054 1037 1030 1042
1873 1042 1067 1088 1093 1083 1070 1062 1063 1074 1088 1098 1102 1106 1108 1094 1055 1004 968 966 989 1019 1042 1046 1030 1000 973 967 982 1001 1004 987 961 947 948 955 952 939 928 931 953 982 1005
1868 1005 1012 1009 1011 1027 1047 1057 1052 1040 1022 996 966 942 933 935 938 945 960 982 1002 1012 1004 982 953 930 921 923 935 955 981 1005 1025 1037 1037 1016 978 947 942 962 986 998 996
1863 996 993 991 986 968 938 909 899 915 949 986 1017 1041 1057 1063 1064 1064 1065 1060 1052 1047 1048 1054 1063 1077 1094 1109 1117 1115 1103 1082 1055 1025 990 950 917 909 925 951 971 987 1008 1030 1044
1858 1044 1048 1041 1021 989 960 953 963 970 962 949 944 943 937 930 937 959 987 1014 1045 1085 1124 1145 1145 1140 1146 1162 1170 1160 1139 1125 1125 1132 1139 1142 1147 1155 1163 1163 1146 1110 1064 1027 1019 1038 1061 1069
1852A069rj7j8j8j0J1L3M4L6K4J1kj4k2k7l7n3n5l0NK9K9J7PMOJ2J5J3J1J5J5%j8j6NK2K1
1847A108J7L4N8O4M8L1L0K7J0j7l1l1k7l0l7l8m0m6m8l8j7PK2L1L5L1J4qj4kJ2Rnj5j6j1j3
1843A104j7j5pLRJ0J0J1J2Noj4qQJ7J2NQJ5J6J3K6N2O6M8J5jQJ6Oj4k4k2k5l9n7p2p6o5l3
1838A000PL1K7J1%lpj0nPJ4J4J6K2K0%k0k2qJpj7j7j1orj7k4k3qJ8L2K6OmKJ0NmpMK0L0L1
1832A125K3Mj7k5j7JJ3J0NNRJ1J0Ojj8l5m0k2JJ3J0PJ5K8L0J8kk3l4l3k6k2k4k0j0lj0k0k0
1828I22nJ2K3K0Qop%Lqk1j2PJ6Kj8k8k3j2OL1N0M9K9RjKRJ4J5J7J7J2mk6l5k4KJ9J4oj7j2
1822A043KNoj5qMMpj7j9j5kK1L3J6j1j7LJ8PmLJ3kk4l0j5mrj8j9j1LK0K8K4K2L1L6J8j6l3
1817A052k5j8k3k8k0j1j4j1J4M4M5Rl2m0j3K6M6M3K3Lj4k5k4j3LNnj6j1RL2M3L4Rj2j3JJ3
$$ plain form
1852 1069 1060 1043 1025 1007 997 1008 1041 1085 1121 1145 1156 1154 1140 1118 1091 1054 1001 946 916 921 950 979 996 1003 1007 1013 1025 1040 1053 1064 1079 1094 1094 1076 1060 1065 1087 1108
1847 1108 1125 1159 1217 1281 1329 1360 1390 1417 1427 1410 1379 1348 1321 1291 1254 1216 1176 1130 1082 1044 1027 1034 1056 1087 1122 1153 1167 1159 1145 1143 1155 1164 1159 1144 1128 1117 1104
1843 1104 1087 1072 1065 1068 1077 1087 1097 1108 1120 1125 1119 1105 1097 1105 1122 1134 1139 1147 1162 1178 1191 1217 1269 1335 1383 1398 1397 1405 1421 1427 1413 1389 1367 1342 1303 1246 1174 1098 1033 1000
1838 1000 1007 1038 1065 1076 1076 1073 1066 1056 1051 1058 1072 1086 1102 1124 1144 1144 1124 1102 1094 1095 1088 1071 1054 1043 1037 1028 1011 987 964 956 974 1006 1032 1038 1034 1036 1046 1051 1047 1040 1044 1064 1094 1125
1832 1125 1148 1152 1135 1110 1093 1094 1107 1117 1122 1127 1136 1147 1157 1163 1162 1144 1109 1069 1047 1048 1061 1071 1078 1093 1121 1151 1169 1167 1144 1110 1077 1051 1029 1005 985 975 972 962 942 922
1828 922 917 929 952 972 980 974 967 967 970 962 941 929 936 952 954 936 908 885 873 879 910 960 1009 1038 1047 1046 1048 1057 1071 1086 1103 1120 1132 1128 1102 1067 1043 1045 1064 1078 1072 1055 1043
1822 1043 1045 1050 1044 1029 1021 1025 1029 1022 1005 986 971 969 990 1023 1039 1028 1011 1014 1032 1039 1035 1038 1051 1049 1025 995 980 976 967 949 930 919 922 942 970 994 1016 1047 1083 1101 1085 1052
1817 1052 1027 1009 986 958 938 927 913 902 916 960 1005 1014 982 942 929 955 1001 1044 1067 1070 1056 1031 1007 994 997 1002 997 981 970 979 1011 1054 1088 1097 1085 1072 1073 1086
1813A086K7M5O1M4Jk7j4K0K8Oj7k4k9l9m1k6qNJ0J3J1JnJJ9L3K5Jk4k8j6pj3k4j6LJ4Lj1j3
1808A075nMJ1J6J8J2LloolKMJ%LPKlkQK5L9M3L0Oj5j9j2m%LLpj8j8rpj6k6k2j1m%OJ2Nj0k2
1802A090j9j0mJRQqk9l6k5j2oKJ7K5J7LPL1M7L6Nj7j4JJ5J7J1Kpp%Jj0k2j2J3L1J9j0l1l7
1797A092l3k5rRJ5J1PJ0Opj4LK7L2K2J6K3K7J2knLJ0J6K0K0J2JjPJ0NljKkj2j6oNQPJ5K7L1
1791A375J7%pqj2j2LL0M0K9Pj1k2k9k9j9pNJ9L8N2N0L9L2L0K4J4PPJ0J2J2J0POJ8M3O8P9P8
1786B005P3O8O1M8L1L0M5O2O6O2P3J01J22J17R8Q8R9J20J44J64J79J75J59J49J65K04K51K91
1783E250L29L75M36M99N55O16P07Q25R42J044J146J265J380J455J472J430J306J045O12L6
1780B2725n82j118j481j644j642j530j350j132r08p11n59m46l65l07k58k03j35o4pK7L6L8
$$ plain form
1813 1086 1113 1158 1219 1263 1264 1237 1223 1243 1271 1277 1260 1236 1207 1168 1127 1101 1093 1098 1108 1121 1132 1133 1128 1129 1148 1181 1206 1207 1183 1155 1139 1132 1119 1095 1079 1082 1096 1099 1088 1075
1808 1075 1070 1074 1085 1101 1119 1131 1134 1131 1125 1119 1116 1118 1122 1123 1123 1126 1133 1135 1132 1130 1138 1163 1202 1245 1275 1281 1266 1247 1235 1231 1231 1234 1237 1230 1212 1194 1185 1178 1162 1136 1114 1103 1099 1099 1105 1117 1122 1112 1090
1802 1090 1071 1061 1057 1058 1067 1075 1067 1038 1002 977 965 959 961 978 1003 1020 1023 1030 1061 1108 1144 1149 1132 1118 1119 1134 1151 1162 1164 1157 1150 1150 1151 1141 1119 1107 1120 1151 1170 1160 1129 1092
1797 1092 1059 1034 1025 1034 1049 1060 1067 1077 1083 1076 1062 1065 1092 1124 1146 1162 1185 1212 1224 1222 1217 1220 1230 1246 1266 1286 1298 1299 1298 1305 1315 1320 1317 1316 1318 1316 1304 1288 1282 1287 1295 1302 1317 1344 1375
1791 1375 1392 1392 1385 1377 1365 1353 1356 1386 1426 1455 1462 1451 1429 1400 1371 1352 1345 1350 1369 1407 1459 1509 1548 1580 1610 1634 1648 1655 1662 1672 1684 1696 1706 1713 1719 1737 1780 1848 1927 2005
1786 2005 2078 2146 2207 2255 2286 2316 2361 2423 2489 2551 2624 2725 2847 2964 3062 3150 3249 3369 3513 3677 3856 4031 4190 4339 4504 4708 4959 5250
1783 5250 5579 5954 6390 6889 7444 8060 8767 9592 10534 11578 12724 13989 15369 16824 18296 19726 21032 22077 22689 22725
1780 22725 22143 21025 19544 17900 16258 14728 13378 12246 11338 10627 10068 9622 9257 8950 8692 8489 8354 8290 8283 8310 8346 8384
1778H384N9J12J72K09K19K28K46K65K84L19L78M43M98N67O66P84Q91R88J100J249J446J697
1775B1204J998K331K677L041L433L835M209M519M718M726M413L645K345N55j501l446m892
1773E7810n630n708n332m723m034l351k734k223j827j528j283j067q84p48o50n58m60l74l14
1770A4382k70k21j66j16p4l3J3O0J03J49J98K52L21M04M95N84O78P97R57J155J379J618J881
1768B4546K179K516K878L252L640M034M401M664M737M523L906K769J098r31k960m604n615
1766E5033n946n722n151m436l725l092k558k120j770j501j296j131r87q58p49o63n92n20m48
1763A1768l81l36l14l04k81k40j89j50j28j10p6k9J8M9P2J10J66K26K75L17L84M88O11P26
1760A2672Q29R41J068J194J289J348J364J319J171Q79M28j49p69j320j702j886j893j771j571
$$ plain form
1778 8384 8443 8555 8727 8936 9155 9383 9629 9894 10178 10497 10875 11318 11816 12383 13049 13833 14724 15712 16812 18061 19507 21204
1775 21204 23202 25533 28210 31251 34684 38519 42728 47247 51965 56691 61104 64749 67094 67649 66148 62702 57810
1773 57810 52180 46472 41140 36417 32383 29032 26298 24075 22248 20720 19437 18370 17486 16738 16088 15530 15070 14696 14382
1770 14382 14112 13891 13725 13609 13535 13502 13515 13575 13678 13827 14025 14277 14598 15002 15497 16081 16759 17556 18513 19668 21047 22665 24546
1768 24546 26725 29241 32119 35371 39011 43045 47446 52110 56847 61370 65276 68045 69143 68212 65252 60648 55033
1766 55033 49087 43365 38214 33778 30053 26961 24403 22283 20513 19012 17716 16585 15598 14740 13991 13328 12736 12216 11768
1763 11768 11387 11051 10737 10433 10152 9912 9723 9573 9445 9335 9259 9230 9248 9297 9369 9479 9645 9871 10146 10463 10847 11335 11946 12672
1760 12672 13501 14442 15510 16704 17993 19341 20705 22024 23195 24074 24502 24353 23584 22264 20562 18676 16783 15012 13441
1758A3441j344j128r42p92o75n80m95m16l49l06k78k53k36k36k47k47k23j87j61j45j32j18
1755C951j00q7q6r3r6q9p8q2r3q8o1l5l0l8m2m2m8n8n8m3k5k2l5n1n9n2m3m3m8l7oK2K2ol9
1751B182n9o7o1m3k6j9k2k0j5j5k0k0j0nj0j7j8j7j8j6q%NOKoj7j7nNmk3l6m1l9l3k2j5j8
1746A418j6LK1J5j7m5m8l0j0J3L8N0L4Nj8k0rLJ2J9J5Jj5k0j1RK4K3Lj9k8k1j2j1j3j1opj7
1741A302k8l0j7%J3J9J8J2LnqmloqlLJ2K7L9L7J4qmK0M0L4J2pj3j1qrj4j4qj0k9n0m6j6ON
1736A257omMjj6j9nPLlNK0K7K0J0QJ4J2lk2k5qJ4J8OmmjMJ2K1J8Nl%Jj1k5k7k3j8j2KJ5J2
1731A275rl0l9l4j4QK4K3J6J5J0ol0l9k6lJ1J3RQJ3J9J8QkjJ2K5K6J4lj1lJ8L5L7L0J9Oj3
1726A429k6k7k3k6l1j8j%k2l8l2k2j8j0J1K6K0Mkpk5m5m2j4J7L0K7K0K2L0L8K9%k6k7oJ4K0
$$ plain form
1758 13441 12097 10969 10027 9235 8560 7980 7485 7069 6720 6414 6136 5883 5647 5411 5164 4917 4694 4507 4346 4201 4069 3951
1755 3951 3851 3764 3678 3585 3489 3400 3322 3240 3147 3059 2998 2963 2933 2895 2853 2811 2763 2705 2647 2604 2579 2557 2522 2471 2412 2360 2317 2274 2226 2189 2183 2205 2227 2221 2182
1751 2182 2123 2056 1995 1952 1926 1907 1885 1865 1850 1835 1815 1795 1785 1780 1770 1753 1735 1718 1700 1684 1676 1676 1681 1687 1689 1683 1666 1649 1644 1649 1645 1622 1586 1545 1506 1473 1451 1436 1418
1746 1418 1402 1405 1426 1441 1424 1379 1331 1301 1291 1304 1342 1392 1426 1431 1413 1393 1384 1387 1399 1418 1433 1434 1419 1399 1388 1397 1421 1444 1447 1428 1400 1379 1367 1356 1343 1332 1326 1319 1302
1741 1302 1274 1244 1227 1227 1240 1259 1277 1289 1292 1287 1279 1275 1272 1266 1258 1255 1258 1270 1297 1336 1373 1387 1379 1375 1395 1435 1469 1481 1474 1461 1450 1442 1433 1419 1405 1397 1387 1358 1308 1262 1246 1252 1257
1736 1257 1251 1247 1251 1250 1234 1215 1210 1217 1220 1217 1222 1242 1269 1289 1299 1307 1321 1333 1330 1308 1283 1275 1289 1307 1313 1309 1305 1304 1308 1320 1341 1359 1364 1361 1361 1362 1351 1326 1299 1276 1258 1246 1248 1263 1275
1731 1275 1266 1236 1197 1163 1149 1157 1181 1204 1220 1235 1245 1239 1209 1170 1144 1141 1152 1165 1174 1182 1195 1214 1232 1240 1238 1237 1249 1274 1300 1314 1311 1300 1297 1315 1350 1387 1417 1436 1442 1429
1726 1429 1403 1376 1353 1327 1296 1278 1277 1277 1255 1217 1185 1163 1145 1135 1146 1172 1192 1196 1194 1187 1162 1117 1075 1061 1078 1108 1135 1155 1177 1207 1245 1274 1274 1248 1221 1215 1229 1249
1721A249K2K5J6pk6k2oKqj8k0j3oqj0kJ3K8K8J9Ork5l4j8J2K4Nk3l2k1oOJ5J4kk6l9l0j3O
1716A066J5K0K0J8J6Qj3l2l6k0JPLnjJ7L6M0K2jj3k1l4m9m9k5kjq%K7N0M8K7QLPJ4J7J2%k2
1711A170m6o1n6k9MJ9J0j0k0j6mMNkj5k4j8RL7M8L7J9Opk0k3mK7M8M1J5nj4k1l1l4k3jQJo
1706A018KJ8K0J3K2M3M8K6%KJ8J4j7m4m4k9k4l0l1j7k%j1k1j8jJ7K3J6LopqrrmJ2L1L2Nk8
1701A023l4qK0K6RolRK1K2K1K4L2L5K6J5J7L4N1N1M2L4K5Kl0n7o4n9n2m8l9k0jJ0O%NJ9K2
1696A180Rj7l8m5l4j1J0J8J8J8K2J9Kj5j7j0m%QJ9J7Kj6k0j3lM%nnMJ1MmkRJ4J4K3L9N3M8
1691A306L0J2nj9k9k8k1j1rj5k4k5j4%Lrk0k2k2k2j9pLMjonlJJ0J6J3Lk%%ljJ3K8K9J4mj1
1686A128qnlMJ7K3Qj2j4RL6L8J5j0k2j7oLLj0k4l2k7j1KJ3J9K2K3K0J2Jnrj4k2k7k2j2lQK5
$$ plain form
1721 1249 1271 1296 1312 1305 1279 1257 1251 1253 1245 1227 1207 1194 1188 1180 1170 1168 1181 1209 1237 1256 1262 1253 1228 1194 1176 1188 1212 1217 1194 1162 1141 1135 1141 1156 1170 1168 1142 1103 1073 1060 1066
1716 1066 1081 1101 1121 1139 1155 1163 1150 1118 1082 1062 1063 1070 1073 1068 1067 1084 1120 1160 1182 1181 1168 1147 1113 1064 1015 990 988 987 979 979 1006 1056 1104 1131 1139 1142 1149 1163 1180 1192 1192 1170
1711 1170 1124 1063 1007 978 982 1001 1011 1001 981 965 961 965 970 968 953 929 911 920 957 1005 1042 1061 1067 1060 1040 1017 1013 1040 1088 1129 1144 1139 1125 1104 1073 1039 1016 1015 1023 1024 1018
1706 1018 1020 1038 1058 1071 1093 1136 1184 1210 1210 1212 1230 1244 1227 1183 1139 1110 1086 1056 1025 1008 1006 1006 995 974 956 955 972 995 1011 1014 1008 1001 993 984 975 971 983 1014 1046 1051 1023
1701 1023 989 981 1001 1027 1036 1030 1027 1036 1057 1079 1100 1124 1156 1191 1217 1232 1249 1283 1334 1385 1427 1461 1486 1488 1458 1401 1337 1278 1226 1178 1139 1119 1118 1128 1134 1134 1139 1158 1180
1696 1180 1189 1172 1134 1089 1055 1044 1054 1072 1090 1108 1130 1149 1151 1136 1119 1109 1105 1105 1113 1132 1149 1151 1135 1115 1102 1099 1103 1103 1098 1093 1097 1108 1112 1108 1106 1115 1129 1143 1166 1205 1258 1306
1691 1306 1336 1348 1343 1324 1295 1267 1246 1235 1226 1211 1187 1162 1148 1148 1151 1142 1122 1100 1078 1056 1037 1030 1033 1037 1036 1030 1025 1022 1023 1033 1049 1062 1065 1063 1063 1063 1060 1059 1072 1100 1129 1143 1139 1128
1686 1128 1120 1115 1112 1116 1133 1156 1164 1152 1138 1147 1183 1221 1236 1226 1204 1187 1181 1184 1187 1177 1153 1121 1094 1083 1085 1098 1117 1139 1162 1182 1194 1195 1190 1181 1167 1145 1118 1096 1084 1081 1089 1114
1681A114L3K2mk6k7j7nPJ8J8Opj1pj1k5l2k3j1j1j8k1j2lmlK1N9P6N4J3j2j9k6l9l9j5J1J2
1676A036pj7rJ2K6J9jk1k5j8j4j0NL0M2K6NOJ9J0k2m5l2kJ3Nj0j7j9j5j2oPK5L3J4j7k7lK9
1671A013L6K2J3J4Rpj9j8pOK0K6J0j8l6k8j4j4k1j3PJ5Kj2pJ6L3L5K7J7Nj2k2j9pKNMKqk2
1666A035k4qJ0J7J3QKj0k2k6j8qjPJ7J9J2J1J7J7QKRJ9J0rj9rMPL%mo%J2J7Qor%J0J0%j4k2
1660A089j4LJ6J2oj9j9rj%%jKMNONlj8k5j6JRmj5nK0L2K5J1Joj7l0m3m5l4pK2L5K3NLJ4K2
1655A028J5Lmqj3j7mJ6K8K1RPJ4J3Jj2j3j2j5j8pJ2K2J6J0K0L3K4nl5m1l2j8pJLlj2j3jJ0
1650A016J7K3K6J7ol3m4l4j8JK1L7L7K3RQJ2Rjj1k1k3j1J1J9nm3n6k7J7L5K6J0J1K0K1J3Q
1645A114QMj2k6k3%K6L6L1J8KpKK5L3J0l2o1o2m6l1j6NK1K2J3PRLj2k8l4k9j8pNO%jRJ9J5
$$ plain form
1681 1114 1147 1169 1165 1139 1112 1095 1090 1097 1115 1133 1139 1132 1121 1114 1103 1078 1046 1023 1012 1001 983 962 950 947 943 940 961 1020 1096 1150 1163 1151 1132 1106 1067 1028 1013 1024 1036
1676 1036 1029 1012 1003 1015 1041 1060 1059 1038 1013 995 981 971 976 1006 1048 1074 1079 1085 1104 1114 1092 1047 1015 1013 1026 1031 1021 1004 985 970 958 952 959 984 1017 1031 1014 987 984 1013
1671 1013 1049 1071 1084 1098 1107 1100 1081 1063 1056 1062 1082 1108 1118 1100 1064 1036 1022 1008 987 974 981 996 998 986 979 995 1028 1063 1090 1107 1112 1100 1078 1059 1052 1054 1059 1063 1065 1057 1035
1666 1035 1011 1003 1013 1030 1043 1051 1053 1043 1021 995 977 969 968 975 992 1011 1023 1034 1051 1068 1076 1078 1087 1106 1116 1107 1088 1079 1083 1090 1093 1093 1089 1083 1083 1095 1112 1120 1114 1105 1105 1115 1125 1125 1111 1089
1660 1089 1075 1078 1094 1106 1100 1081 1062 1053 1052 1052 1052 1051 1053 1057 1062 1068 1073 1070 1052 1027 1011 1012 1021 1017 1002 997 1017 1049 1074 1085 1086 1080 1063 1033 990 945 911 904 926 961 984 989 992 1006 1028
1655 1028 1043 1046 1042 1034 1021 1004 1000 1016 1044 1065 1074 1081 1095 1108 1109 1097 1084 1072 1057 1039 1032 1044 1066 1082 1092 1112 1145 1169 1164 1129 1088 1056 1038 1031 1032 1035 1032 1020 1007 1006 1016
1650 1016 1033 1056 1082 1099 1093 1060 1016 982 964 965 986 1023 1060 1083 1092 1100 1112 1121 1120 1109 1088 1065 1054 1065 1084 1079 1036 980 953 970 1005 1031 1041 1052 1072 1093 1106 1114
1645 1114 1122 1126 1114 1088 1065 1065 1091 1127 1158 1176 1178 1171 1173 1198 1231 1241 1209 1148 1086 1040 1009 993 998 1019 1041 1054 1061 1070 1073 1061 1033 999 970 952 945 950 956 956 955 964 983 998
1640I98Jrqprj0lOM%J%j6l6l4oJ9K0J2J6L6M8M0J4j7l5l0j3pj4j3J2L5K8%rQK0Jk4k5lJ1O
1635A008kjMRJ2J1kk1k4mK1K7J2noPJ7J7J1QNmj2j5mJ0K1K8K5J2j2k7k7j4kMOJkjNROOOlk5
1629A095m3l5qJ5J9Nj6k8k7j7j0j1oJ4L1J8k0m7m0j4LRJ4J8J7J6J8J7Rmj3j1qlOJ8K6K6J9
1624A052J2Omj5k7k5qJ2J8QlomljMRP%rj7k6k1%K8M0K8Jk7m5n2l9j0K0L9L9L2L0L3K7Kk3l1
1619A051j4NJ3J0J1J2jk3l5j9NJ6J1%mmomjOJ0J1J4J3Qkj4k5l4l8l6k8j3QK7L7L2J3mj2j2
1614I84j6k5k5j4jPQQKomJ6M5N7M0Qj7k1nJ4K7K5J3pk5l5l7l1j8lJ3K6L3M2N0M8K5j4m0m4
1609A103l7l4l0j0K2M6M5K4Jj1rjMLknrj2j1ommnkpk1l2k2JJ2jj2JL1M5K9mk7l4k9k3j2PK2
1604I80J8lj6qJ6K7J8QPLj8m6m7j4K8N3M9L3J5mj3j0LRjj7j8j0oj1j3lJ4J9J2NQK1L2L2K5
$$ plain form
1640 998 999 990 982 975 966 956 953 959 963 963 964 964 948 912 878 872 891 911 923 939 975 1023 1063 1077 1060 1025 995 982 975 961 948 960 995 1023 1023 1014 1022 1042 1043 1019 994 991 1002 1008
1635 1008 1006 1005 1009 1018 1030 1041 1039 1018 994 990 1011 1038 1050 1045 1039 1046 1063 1080 1091 1099 1104 1100 1088 1073 1069 1079 1100 1128 1153 1165 1153 1126 1099 1085 1083 1087 1093 1094 1092 1091 1096 1105 1111 1117 1123 1120 1095
1629 1095 1052 1017 1009 1024 1043 1048 1032 1004 977 960 950 939 933 947 978 996 976 929 889 875 878 887 901 919 936 952 970 987 996 992 979 968 960 957 963 981 1007 1033 1052
1624 1052 1064 1070 1066 1051 1024 999 991 1003 1021 1029 1026 1020 1016 1013 1012 1016 1025 1032 1032 1023 1006 980 959 959 987 1027 1055 1056 1029 984 932 893 883 903 942 981 1013 1043 1076 1103 1105 1082 1051
1619 1051 1037 1042 1055 1065 1076 1088 1087 1064 1029 1010 1015 1031 1042 1042 1038 1034 1028 1024 1023 1029 1039 1050 1064 1077 1085 1083 1069 1044 1010 972 936 908 895 903 930 967 999 1012 1008 996 984
1614 984 968 943 918 904 903 910 918 926 928 922 918 934 979 1036 1076 1084 1067 1046 1041 1055 1082 1107 1120 1113 1088 1053 1016 985 967 964 977 1003 1036 1078 1128 1176 1201 1187 1147 1103
1609 1103 1066 1032 1002 992 1014 1060 1105 1129 1130 1119 1110 1109 1113 1116 1114 1109 1100 1088 1077 1071 1067 1063 1058 1056 1049 1028 996 974 975 987 986 974 975 1006 1051 1080 1076 1049 1015 986 963 951 958 980
1604 980 998 995 979 971 987 1014 1032 1040 1047 1050 1032 986 939 925 953 1006 1055 1088 1103 1099 1086 1076 1079 1088 1087 1070 1052 1042 1036 1025 1012 1009 1023 1042 1054 1059 1067 1088 1120 1152 1177
1599A177K0L0M8N7M3J4j2k1j5%J5K2K8M0N6O5N6M4M8P0R7J19J29J21R7O4L6Om1r7j35j39j27
1595A915j13r6p2n1m5m5m3l6l4m4n5n9m5j7J0J6ll0m7m5k6kJ8K4K1J5J1MmnNJ0Pkpoprj0j0
1590A088oKJ0Onj3j4j6j9j0RK1J0plJ8K7J7qk6k9j3J0J9OqqLMkJJ3J2nk1k6k9l2k7j2JOJ3
1584I57K4K2Mj3j2l%kQK8L6K0j0l5l8k2kQJ3K1K9K8J5RJ1J0LKJ1J6Mj5j8j0pj5k5k7k1j0J0
1579A004K8L3K4J4J0J0QNjrj8k5k7k7k0oJ1K1K7K5J7Lj1j4pKJ0J1jk0l1j9QL0L6L3K9K1Jk3
1574A162m0m2k8j1%jmmorrLJ6J5LkOJ8K4K1J0rk1j3J2K5J8J0J9L2K7PpkRPj0l2m0k8lJ9K6
1569A168K3J7Oj3k9l1j6%Mlrrrj4k6k9j5RJ7NoJJ6J3j0l3l8k4jK8M9N0K6kj5k0k8l9m0k3k
1564I48J1J5K0K5L0L1K6J8QNLkj0j7j4lOJ0NkrmPJ2PjmkklKJ4K4K5J9J3Kj2k4k7k2k1k3k2
$$ plain form
1599 1177 1197 1227 1275 1332 1375 1389 1377 1356 1341 1341 1356 1378 1406 1446 1502 1567 1623 1667 1715 1785 1882 2001 2130 2251 2348 2412 2448 2454 2413 2316 2181 2042 1915
1595 1915 1802 1706 1634 1583 1538 1493 1450 1414 1380 1336 1281 1222 1177 1160 1170 1186 1183 1153 1106 1061 1035 1033 1051 1075 1096 1111 1122 1126 1122 1117 1122 1132 1139 1137 1130 1124 1117 1108 1098 1088
1590 1088 1082 1084 1094 1100 1095 1082 1068 1052 1033 1023 1032 1053 1063 1056 1053 1071 1098 1115 1107 1081 1052 1039 1049 1068 1074 1066 1058 1061 1065 1063 1064 1077 1089 1084 1063 1037 1008 976 949 937 938 944 957
1584 957 981 1003 1007 994 982 979 979 977 985 1013 1049 1069 1059 1024 986 964 962 970 983 1004 1033 1061 1076 1085 1096 1106 1109 1111 1122 1138 1142 1127 1109 1099 1092 1077 1052 1025 1004 994 1004
1579 1004 1032 1065 1089 1103 1113 1123 1131 1136 1135 1126 1108 1083 1056 1029 1009 1003 1014 1035 1062 1087 1104 1107 1096 1082 1075 1077 1087 1098 1097 1077 1046 1027 1035 1065 1101 1134 1163 1184 1185 1162
1574 1162 1122 1080 1052 1041 1041 1040 1036 1032 1026 1017 1008 1011 1027 1042 1045 1043 1049 1067 1091 1112 1122 1113 1092 1079 1091 1116 1134 1144 1163 1195 1222 1229 1222 1220 1229 1236 1226 1194 1154 1126 1123 1142 1168
1569 1168 1191 1208 1214 1201 1172 1141 1125 1125 1129 1126 1117 1108 1099 1085 1059 1030 1015 1024 1041 1046 1040 1041 1057 1070 1060 1027 989 965 964 992 1041 1091 1117 1115 1100 1080 1052 1013 973 950 948
1564 948 959 974 994 1019 1049 1080 1106 1124 1132 1137 1140 1138 1128 1111 1097 1094 1100 1110 1115 1113 1104 1100 1107 1119 1126 1125 1121 1119 1117 1114 1116 1130 1154 1179 1198 1211 1213 1201 1177 1150 1128 1107 1084 1062
1559A062j3KJ5J5Mnrj2j6j8rNJ2J3K1L3L5K2QJ4K8L3K3J1jj4k1oK5N3N4L1Kj6j2QL0L5K1l
1554A460k5m0m5l5j2J0J4Nkkkj1k1j8JJ5Rrj7nJ1J2K%NRKloj1k0k1j0LJ0J2J2jk8m7m0j8n
1549A138j1k3k4pJ7L1K1lqJ4M1M1K2RJ0Oj1k0oK4N1O3O3N8N3N6O1N3L2J9K9M8N2L7J8Onj4
1544A941j6pkk0m5n6m4k7j5rKJ0J3J4K3L5L3J3rj6kJ9M0N1N1L8K7K4K4J9J4J5K3L0K7J7kl0
1539B203n9o6m3nK0K3J6J5J6J2Olj1j8j5JJ9K4J9J9K8L7L3J6jmMJ8K8L3L9M7N5N5N2N8P0P3
1535B814O2M7L9L2J4lrolmNJ6K6L6N7P8P6N6M4O4R4J06J02R7J09J32J61J85J98K07K18K32
1531E282K33K29K49L09L89M51M86N06N34N81O42P05P55P92Q34Q84R29R62J000J047J092J133
1528B0024J185J254J325J384J448J540J664J815K011K262K560K894L277L727M254M881N675
$$ plain form
1559 1062 1049 1051 1066 1081 1085 1080 1071 1059 1043 1025 1016 1021 1033 1046 1067 1100 1135 1157 1165 1179 1207 1240 1263 1274 1273 1259 1238 1232 1257 1310 1364 1395 1397 1381 1369 1377 1407 1442 1463 1460
1554 1460 1435 1395 1350 1315 1303 1313 1327 1332 1330 1328 1326 1315 1294 1276 1277 1292 1301 1292 1275 1270 1281 1293 1295 1295 1300 1309 1311 1308 1302 1291 1271 1250 1240 1243 1253 1265 1277 1276 1248 1201 1161 1143 1138
1549 1138 1127 1104 1080 1073 1090 1121 1142 1139 1131 1145 1186 1227 1249 1258 1268 1274 1263 1243 1237 1261 1312 1375 1438 1496 1549 1605 1666 1719 1751 1770 1799 1847 1899 1936 1954 1960 1955 1941
1544 1941 1925 1918 1916 1896 1851 1795 1751 1724 1709 1700 1702 1712 1725 1739 1762 1797 1830 1843 1834 1818 1816 1835 1875 1926 1977 2015 2042 2066 2090 2109 2123 2138 2161 2191 2218 2235 2233 2203
1539 2203 2144 2078 2035 2030 2050 2073 2089 2104 2120 2132 2138 2135 2124 2106 2091 2092 2111 2135 2154 2173 2201 2238 2271 2287 2286 2282 2286 2304 2332 2365 2404 2451 2506 2561 2613 2671 2741 2814
1535 2814 2876 2923 2962 2994 3008 3005 2996 2990 2987 2983 2988 3004 3030 3066 3123 3201 3277 3333 3377 3441 3535 3641 3743 3840 3949 4081 4242 4427 4625 4832 5050 5282
1531 5282 5515 5744 5993 6302 6691 7142 7628 8134 8668 9249 9891 10596 11351 12143 12977 13861 14790 15752 16752 17799 18891 20024
1528 20024 21209 22463 23788 25172 26620 28160 29824 31639 33650 35912 38472 41366 44643 48370 52624 57505 63180
1526F3180O701P973R484J1226J3160J5189J7236J9288K1276K2898K3625K2796J9652J3488
1524B87172M212o989j7725k5528k9176k9048k6449k2705j8754j5153j2151r761p884o427n319
1523E8315m473l814l299k911k618k392k214k077j956j832j710j597j485j368j246j136j036
1520B1151r43q64q06p62p21o75o28n81n42n26n18m87m25l70l52l64l63l44l28l32l36l25l03
1518I256k90k91l02l14l22l24l23l28l31l17k73k16j75j66j73j72j52j22j05j05j21j36j40
1515D058j27j03q4p6p6o9n4m1l7l9m8o6p6o2k3J4K7J3ok3l8m8m7l7k8l2m2m4k7nlk9n8o7n5
1511B542m3m4m0j9K%k3m9o3o7o5n5l8k2j3j6k5k9j9olo%J4K3K0J6J8J3j3l6l5j9k1m2n1l4
1506A752lJ8K6K9K5Rnqpj8l8m7l7j8j1k2l8m7l3kK4L4K8J7J5J5J7K0K8M2N7O2M9K1ok4l0l3
$$ plain form
1526 63180 69881 77854 87338 98564 111724 126913 144149 163437 184713 207611 231236 254032 273684 287172
1524 287172 291384 284395 266670 241142 211966 182918 156469 133764 115010 99857 87706 77945 70061 63634 58315
1523 58315 53842 50028 46729 43818 41200 38808 36594 34517 32561 30729 29019 27422 25937 24569 23323 22187 21151
1520 21151 20208 19344 18538 17776 17055 16380 15752 15171 14629 14103 13585 13098 12673 12303 11951 11587 11224 10880 10552 10220 9884 9559 9256
1518 9256 8966 8675 8373 8059 7737 7413 7090 6762 6431 6114 5841 5625 5450 5284 5111 4939 4787 4665 4560 4455 4334 4198 4058
1515 4058 3931 3828 3744 3668 3592 3523 3469 3428 3391 3352 3304 3238 3162 3100 3077 3091 3118 3131 3125 3102 3064 3016 2969 2932 2904 2872 2830 2786 2759 2754 2751 2722 2664 2597 2542
1511 2542 2499 2455 2415 2396 2398 2398 2375 2326 2263 2196 2131 2076 2038 2016 2003 1987 1962 1933 1914 1908 1905 1899 1899 1913 1936 1956 1972 1990 2003 1990 1954 1919 1900 1879 1837 1786 1752
1506 1752 1749 1767 1793 1822 1847 1856 1851 1843 1836 1818 1780 1733 1696 1678 1667 1645 1607 1560 1527 1525 1549 1583 1611 1628 1643 1658 1675 1695 1723 1765 1822 1884 1933 1954 1948 1924 1894 1861
1501A861l5l1k1j5k1k5k0lO%j0qLNj1l5m9m3k7j3j0j1oNNj4m1n4m3k1lJ0J9K1J6J3K0L2L8
1497A484L7K7Nk2l5l0k0k8m6m6k4%Nnj1j0mMJ2J8J8J7J9J8J1lj4j5qoj4k9l6k5%K6M2M3K6
1492A381Lj1oONj1j9j5okJ1L4N3M4J3j4k2k5m1n9n6l1KK1K6K3K0J2%j2j7j4pqj3j8rOJ4Pj1
1487A254k0j7oJKJOJ0J2J4J7J9J2K%J2K4K0NkKLnj3j1j8m0n5m2j0OmqJ0K9K3jj6j8j4j4j9
1482A151k9l3j8J2L4L6L0L6L7J6j4k2qkj4k6k0j3j3j6j2olOK1L5L6L3K0mk8k4PL0K5RKnk1
1477A245l2j7J0J4qk3j6nmj1j1lRJ4Jk8m9l3OK7J5%QK7L4L2L5L8K4mk1k3k7m3m9l1nKj5l1
1472A052k5rJjKQPmj2lJ0J2ORK5L0J6oj7j4mNJ0Mpj4oJ5L0K5Jk2k8oK5M3L4J1mjJ0J5Oqk0
1467A201k5k4k3k1j8j1qj3j5mJ5K9K3PJJ3K4J2j5l3k2PL1M2L9K3Jj6k2k6l7m5l1KL3M0K7P
$$ plain form
1501 1861 1826 1795 1774 1759 1738 1713 1693 1690 1696 1696 1686 1678 1681 1686 1675 1640 1591 1548 1521 1508 1498 1487 1481 1486 1491 1477 1436 1382 1339 1318 1315 1325 1344 1365 1381 1394 1414 1446 1484
1497 1484 1521 1548 1553 1531 1496 1466 1446 1418 1372 1326 1302 1302 1307 1302 1291 1281 1277 1281 1293 1311 1329 1346 1365 1383 1394 1391 1377 1362 1354 1348 1334 1305 1269 1244 1244 1270 1312 1355 1381
1492 1381 1384 1373 1367 1373 1378 1367 1348 1333 1327 1325 1336 1370 1423 1467 1480 1466 1444 1419 1378 1319 1263 1232 1234 1255 1281 1304 1324 1336 1336 1324 1307 1293 1286 1278 1265 1247 1238 1244 1258 1265 1254
1487 1254 1234 1217 1211 1212 1214 1215 1221 1231 1243 1257 1274 1293 1305 1307 1307 1319 1343 1363 1368 1366 1368 1371 1366 1353 1342 1324 1284 1229 1187 1177 1183 1179 1171 1181 1210 1233 1232 1216 1198 1184 1170 1151
1482 1151 1122 1089 1071 1083 1117 1153 1183 1219 1256 1272 1258 1236 1228 1226 1212 1186 1166 1153 1140 1124 1112 1106 1103 1109 1130 1165 1201 1234 1254 1250 1222 1198 1205 1235 1260 1269 1271 1266 1245
1477 1245 1213 1196 1206 1220 1212 1189 1173 1168 1164 1153 1142 1139 1148 1162 1163 1135 1086 1053 1059 1086 1101 1101 1109 1136 1170 1202 1237 1275 1299 1295 1274 1251 1224 1181 1132 1101 1096 1098 1083 1052
1472 1052 1027 1018 1019 1018 1020 1028 1035 1031 1019 1016 1026 1038 1044 1053 1078 1108 1124 1118 1101 1087 1083 1088 1098 1102 1095 1081 1075 1090 1120 1145 1146 1124 1096 1090 1115 1158 1192 1203 1199 1198 1208 1223 1229 1221 1201
1467 1201 1176 1152 1129 1108 1090 1079 1071 1058 1043 1039 1054 1083 1106 1113 1114 1127 1151 1163 1148 1115 1093 1100 1131 1173 1212 1235 1236 1220 1198 1172 1135 1090 1059 1061 1094 1134 1161 1168
1462A168rj9k2k4k6k4j2OK2K6K1J0%rj6j6j3%J1J0j0k7k0MJ5Kj1jK5M3M3L0J1rk1j2J0K3J7
1457A196kj5j6qoj8l0k5mJ1Nj0j5rj0k6l7k4NK6K6J1%%LJ0K5M6N8M8L1L2N3P0P3O8O6O9P8
1452A755R0R8R0P8Q4J00R5N0qn5r6j38j63j46j04p6p9q4p7o0l6j1Kj4l9m2k4j1j6j6%Pqk5
1448A121j9mkj1j4rqqMJ7J0j0j8mJ5J5Kj3k2k6k1lJ1J2NKNLmoJPJqpjlj5k4j9qkQK3M1M3K8
1442A085Mj9l4l1pK8N1M9L0Lk0l0k2jJ3J6K0K7K4OpMK4L0J2rk0k0j9j5pkpk0k5j4RK8L3K1
1438A188Nrj5j4j1j0j6k2j7pLPJ0R%j1nJ4K5K0J3J4J2ol0l7k7j2m%JooPK3J9nk7l1j8MK8M2
1432A098L7J5nj3j9k5k3qRJ6Qmj2k2k9k7rJ4K4J5%mKLj0j7nJ5J8J1PJ1Qmj2rnmjJj0l0l1%
1427I74L8N1K6rk9k2%J4Roj4j5j9k7j8RL7M5L5J8Jj1j2MJ5J3RJ3K2J5nk2k6k6j9qNQMNO%j1
$$ plain form
1462 1168 1159 1140 1118 1094 1068 1044 1032 1038 1060 1086 1107 1117 1117 1108 1092 1076 1063 1063 1074 1084 1074 1047 1027 1031 1046 1048 1037 1036 1061 1104 1147 1177 1188 1179 1158 1146 1156 1179 1196
1457 1196 1194 1179 1163 1155 1149 1131 1101 1076 1072 1083 1088 1078 1063 1054 1044 1018 981 957 962 988 1014 1025 1025 1025 1028 1038 1063 1109 1167 1215 1246 1278 1331 1401 1474 1542 1608 1677 1755
1452 1755 1845 1943 2033 2111 2195 2295 2390 2440 2432 2377 2281 2143 1980 1834 1730 1654 1575 1491 1414 1354 1318 1307 1309 1295 1256 1214 1190 1179 1163 1147 1147 1154 1146 1121
1448 1121 1102 1098 1096 1085 1071 1062 1054 1046 1050 1067 1077 1067 1049 1045 1060 1075 1077 1064 1042 1016 995 992 1003 1015 1020 1022 1027 1030 1026 1020 1021 1028 1029 1021 1014 1013 1010 995 971 952 944 942 950 973 1014 1057 1085
1442 1085 1089 1070 1036 1005 998 1026 1077 1126 1156 1159 1139 1109 1087 1086 1099 1115 1135 1162 1186 1192 1185 1189 1213 1243 1255 1246 1226 1206 1187 1172 1165 1163 1156 1136 1111 1097 1106 1134 1167 1188
1438 1188 1193 1184 1169 1155 1144 1134 1118 1096 1079 1072 1075 1082 1092 1101 1101 1090 1085 1099 1124 1144 1157 1171 1183 1177 1147 1110 1083 1071 1067 1067 1068 1062 1056 1063 1086 1105 1100 1073 1042 1024 1028 1056 1098
1432 1098 1135 1150 1145 1132 1113 1088 1065 1057 1066 1082 1090 1086 1074 1052 1023 996 987 1001 1025 1040 1040 1036 1038 1041 1031 1014 1009 1024 1042 1053 1060 1071 1079 1075 1063 1054 1049 1045 1044 1045 1035 1005 974 974
1427 974 1012 1063 1089 1080 1051 1029 1029 1043 1052 1046 1032 1017 998 971 953 962 999 1044 1079 1097 1098 1087 1075 1079 1094 1107 1116 1129 1151 1166 1161 1139 1113 1087 1068 1060 1065 1073 1077 1082 1088 1088 1077
1422A077j3kNKljJ0J8J8Qk%J2J9Pj8k7j8lJKLOOjoj0mLlj7j8PM1M4J2j8k0rnpolprnKNOP%
1415A086j4j9j0lj3k8k0RM0M8L1Mk0l0k9k4j6NM2O2L8j7n8n8k5NJ3mk4l0j2J1K4K6K2J5jj4
1411A012j3jJ3J9K2J3nj7nJ4J0j0j0K3N3M2Kk3k0j1qj1oKMLNROqk1k1j0rk4l3j7J1J3qj9N
1406I71L4M0K6J7J3Jk1k5pJ0J0KjPJ3J4J5J9K5L0K7J0j1j9nJ4K7K7K2J3OJmk2m2m7k9nJj3
1401A144k4j8lRJ3Rok4l3j7J1K1Oj9k9k2rjPJ4J4QLJ0J6J5N%LMKlnnjQJ7J9J6J5J6J4Kj7l3
1395A152l8l0k3k7l6l0oJ4Qj6k7j6%Kpj0lQK1K4Nk2l9k9pJ1K0K4J7Jj0lJ0J6J7K4L6M0K9J0
1390A110j3l1l6k2kLj0k2j8kJ4K5K8K6J8J3Jj5k7j7LQj0l2l5k6k5l3l0oK7M6M0J9%nNQkj6
1385I59j8kJ8K8K5J3KPK5L7K9RlKJ5K0Pk3n2n9l6lJ5J7J1Jj1k2k0j0oj3j6j1nrj1%K0K8J8
$$ plain form
1422 1077 1064 1062 1067 1069 1066 1065 1075 1093 1111 1119 1117 1117 1129 1148 1155 1137 1110 1092 1089 1090 1092 1095 1101 1107 1106 1100 1090 1086 1089 1086 1069 1051 1058 1099 1143 1155 1137 1117 1108 1103 1096 1090 1087 1080 1071 1066 1068 1073 1079 1086 1086
1415 1086 1072 1053 1043 1040 1027 999 979 988 1028 1076 1107 1111 1091 1061 1032 1008 992 997 1039 1101 1139 1122 1064 1006 981 986 999 995 971 941 929 940 964 990 1012 1027 1026 1012
1411 1012 999 998 1011 1030 1052 1065 1060 1043 1038 1052 1062 1052 1042 1065 1118 1160 1162 1139 1119 1108 1100 1089 1083 1085 1089 1092 1097 1106 1112 1104 1083 1062 1052 1043 1019 986 969 980 993 985 966 971
1406 971 1005 1045 1071 1088 1101 1102 1081 1056 1049 1059 1069 1071 1070 1077 1090 1104 1119 1138 1163 1193 1220 1230 1219 1200 1195 1209 1236 1263 1285 1298 1304 1305 1301 1279 1237 1190 1161 1156 1157 1144
1401 1144 1120 1102 1099 1108 1121 1130 1124 1100 1067 1050 1061 1082 1088 1069 1040 1018 1009 1008 1015 1029 1043 1051 1054 1064 1080 1095 1100 1100 1103 1107 1109 1106 1101 1096 1095 1103 1120 1139 1155 1170 1186 1200 1202 1185 1152
1395 1152 1114 1084 1061 1034 998 968 962 976 984 968 941 925 925 927 920 910 907 915 936 960 965 943 904 875 868 879 899 923 940 941 931 928 938 954 971 995 1031 1071 1100 1110
1390 1110 1097 1066 1030 1008 1006 1009 999 977 959 957 971 996 1024 1050 1068 1081 1082 1067 1040 1023 1026 1034 1024 992 957 931 906 873 843 837 864 910 950 969 969 964 969 977 975 959
1385 959 941 939 957 985 1010 1023 1025 1032 1057 1094 1123 1132 1129 1131 1146 1166 1173 1150 1098 1039 1003 1000 1015 1032 1043 1044 1033 1011 991 981 975 962 946 935 930 921 910 910 930 958 976
1380I76Llk%llNK2L1K5Nj1j5qJJ4K7L9L9K6Nj8l7m3l4j9nNJ1J0OQK0K4Oj8l0k9l0l5k3QK5
1375I75Qj6j3J0J8mk6k0LQok1j0J9M8N7L6Mj9j6LJ2Lk1l7l1qJ6K2J9J8K4K7J5jmNJ6K1J9J4
1370A167Kj3k6l5l6j9PK1J2qj2oj0k4k8j1J0QnrKP%rj2oPJ9K2J2NJ5K8K8J5N%j0k2k0o%j2
1365A053k2j2QJ3%j5j3JJ8K3J1j5l3k6nPjj2j5j3j4j0QK6K8J3LQK3K9K2RlplLN%oonj1k3k8
1360A013j8jRJ2J3J6J7J4J2Qjj4j9j1KPLKONoj1mNNoj8k3l0l7l2j5mj1j6%K8L9K3QJ6K6J6
1354A028rk4k0j3j1j2j0mJ2L1M1L3J4%%lj0j4nNJ0J2J3Nj4l3l5j7QK9L9L8J9ok7k7j1J0J5
1350A057Lqpkpk2k5j2%kj4j9j9j9j4mJj1k5k1ML1M3M0L4L6M6N0L0j1l9l5j1kj7l5m4m0l1j4
1345H65J0L3M5M1K0j1k8j9OJ7RJOJ3J2QJ3J7Qj3k5j9oOJ0Omj0pPJ4J1kj3pJ3L0K3Kj5k0k3
$$ plain form
1380 976 979 976 974 974 971 968 973 995 1026 1051 1056 1045 1030 1022 1023 1037 1064 1103 1142 1168 1173 1155 1118 1075 1041 1022 1017 1022 1033 1043 1049 1057 1077 1101 1107 1089 1059 1030 1000 965 942 950 975
1375 975 983 967 954 964 982 978 952 932 935 943 937 916 906 925 973 1030 1066 1070 1051 1035 1038 1050 1053 1032 995 964 956 972 994 1013 1031 1055 1082 1097 1096 1092 1097 1113 1134 1153 1167
1370 1167 1169 1156 1130 1095 1059 1040 1047 1068 1080 1072 1060 1054 1044 1020 992 981 991 999 994 985 987 994 994 985 973 967 974 993 1015 1027 1032 1047 1075 1103 1118 1123 1123 1113 1091 1071 1065 1065 1053
1365 1053 1031 1019 1027 1040 1040 1025 1012 1013 1031 1054 1065 1050 1017 991 986 993 992 980 965 952 938 928 936 962 990 1003 1006 1014 1037 1066 1088 1097 1094 1087 1084 1087 1092 1092 1086 1080 1075 1064 1041 1013
1360 1013 995 994 1003 1015 1028 1044 1061 1075 1087 1095 1094 1080 1061 1050 1052 1059 1062 1064 1070 1075 1069 1058 1054 1059 1064 1058 1040 1017 987 950 918 903 899 888 872 872 900 939 962 970 986 1012 1028
1354 1028 1019 995 975 962 951 939 929 925 937 968 1009 1042 1056 1056 1056 1053 1043 1029 1024 1029 1039 1051 1064 1069 1055 1022 987 970 978 1007 1046 1084 1103 1097 1070 1043 1032 1042 1057
1350 1057 1060 1052 1045 1043 1036 1014 989 977 977 975 961 942 923 904 890 886 887 876 851 830 834 865 908 948 982 1018 1064 1114 1144 1133 1094 1059 1048 1046 1029 994 950 910 879 865
1345 865 875 908 953 994 1014 1003 975 956 962 979 988 989 995 1008 1020 1028 1041 1058 1066 1053 1028 1009 1003 1009 1019 1025 1021 1011 1004 1011 1025 1036 1034 1021 1014 1027 1057 1080 1082 1067 1047 1024
1339A024l0l0j1J4K2J0nnJ0K6L1J9ok2k6k5k4j3OK0J4OJ8L8M2K0mj8k0j7nQJ1OLM%j4k4k4
1335A029k0k0j5qkJJ1K5K4Nj1lJ3J5QJ0J8J4lj4qMQMj0k6l3k0MK1K0J2Mrk4k8pJ6J7kj7j7
1329I86j2j2rMK0K4J7MkMJ3J1ok7l3j9lOLJjpj0qlLNQRNNK0M0M1J6j6l1k9k7k6j7KJ5J5PN
1324I91QRJjLRPjqpkmj2j7qJ5L8M4K6%j9k0j1pj1j5j8j5qJOkj9l1k4mJ9L2L5K8K0J9J7Pj2
1318A059k0j3lj6m0m3j6J5J5pk4j7LK1K8L0K6J7O%jJ%lrj6k7l4k8j0QJ2J0J6K5K5J1PK3M2
1313A073M0J7%mnolPRqk5k6pNJj4j8kK2L0J7mj0prk5l3k3p%l%RJ0KmjPJ5K0K0Rm%K0K8Jl6
1308A078m1mL3L2jk9l7l6l2k5j4n%QJ4Pj5l0j9QK7K8K1J8K4K9K6J2lj4j7j6j7j3%J6K6K5J1
1303A075pk3k8j2RK2J8Okrj6k0j9j5j2nJ6L5L8K1PORJj0nJ1Rj1k7j7jok3k5j0JkKJ8K7Rk2
$$ plain form
1339 1024 994 964 953 967 989 999 994 989 999 1025 1056 1075 1069 1047 1021 996 972 959 965 985 999 1005 1023 1061 1103 1123 1119 1101 1081 1064 1059 1067 1078 1084 1087 1091 1091 1077 1053 1029
1335 1029 1009 989 974 966 964 965 976 1001 1025 1030 1019 1016 1029 1044 1052 1062 1080 1094 1091 1077 1069 1073 1081 1085 1075 1049 1016 996 1000 1021 1041 1053 1057 1048 1024 996 989 1005 1022 1020 1003 986
1329 986 974 962 953 957 977 1001 1018 1022 1020 1024 1037 1048 1042 1015 982 963 960 966 969 970 969 962 952 944 941 944 949 957 966 971 976 996 1036 1077 1093 1077 1046 1017 990 964 947 949 964 979 986 991
1324 991 999 1008 1009 1008 1011 1020 1027 1026 1018 1011 1009 1005 993 976 968 983 1021 1065 1091 1091 1072 1052 1041 1034 1023 1008 990 975 967 968 974 972 953 922 898 894 913 945 980 1008 1028 1047 1064 1071 1059
1318 1059 1039 1026 1023 1007 967 924 908 923 938 931 907 890 893 914 942 972 998 1015 1021 1021 1020 1021 1021 1018 1009 993 966 932 904 894 902 914 924 940 965 990 1001 1008 1031 1073
1313 1073 1113 1130 1130 1126 1121 1115 1112 1119 1128 1120 1095 1069 1062 1067 1068 1054 1036 1034 1056 1086 1103 1099 1089 1082 1073 1048 1015 992 985 985 982 982 991 1001 1003 999 998 1005 1020 1040 1060 1069 1065 1065 1085 1113 1114 1078
1308 1078 1037 1033 1066 1098 1097 1068 1031 995 963 938 924 919 919 927 941 948 933 903 884 892 919 947 968 986 1010 1039 1065 1077 1074 1060 1043 1027 1010 997 997 1013 1039 1064 1075
1303 1075 1068 1045 1017 1005 1014 1036 1054 1060 1058 1049 1033 1013 994 979 967 962 978 1013 1051 1072 1079 1085 1094 1095 1085 1080 1091 1100 1089 1062 1045 1044 1038 1015 990 980 981 979 981 999 1026 1035 1013
1298A013l4k5oJ3K5K4Nj3j4kjj5k3k0j6j3mRRjkJ7L8L7K2J1Lj1k2k4j5rkQJ4QJRJ9Qk2l9k7
1292I33lJ2J3J1J3J8J9Oj6k8j4PNj7k7rQLrjJ7J0k2m2k3J5M3N2M6L5K4J0ql0m7m5l3j7pLQ
1287I13%nQL4L5Mk7k0J1K7J4KQJ6Nj3j1PJ5OnjJ1J1Kooqj4k6l6l6j9QK2J8PRJ7J5krKJ6J5
1282A014PJ1K2K2Oj0j9k3k8k4oQQlj1j3oRK9M5M0J9lj1rjJ0K4L2K8J2krj4j9k8k8j9nPJ6K0
1277A098J3jj7k5k5k7k6j6%J5K1K2J5Moqlpk0k9j9%J1Noj3j6j3j0j1k0k2oK0L2K5J8K1J8J
1272I93k0k3pQJ4J8K3J7Kj3j4rmnrj2j8k2j9jK5M4M2K5J0J1J5RkJK6M5L8J1rj5k4m7o9o9m5
1267I21j5j%jMRJ5K3L3L6K4Lrpj%nj1qLJ5J2nk4k3jK3K4PqoMJ4J7J5Ojljoj8j8LK5K9QpnL
1261A092MlkPQ%j2j2p%%oj1j2oLJj3k7k4j3j1j9k2j0RJ8J0mj1rojOJ6K8L1K2NpoJMlpOK6L2
$$ plain form
1298 1013 979 954 948 961 986 1010 1015 1002 988 986 985 970 947 927 911 898 894 903 912 911 909 926 964 1001 1023 1034 1037 1026 1004 980 965 956 954 962 976 984 985 994 1013 1021 999 960 933
1292 933 930 942 955 966 979 997 1016 1022 1006 978 964 971 976 959 932 923 931 934 925 924 941 951 929 887 864 879 922 974 1020 1055 1079 1089 1081 1051 1004 959 926 909 902 905 913
1287 913 913 908 916 950 985 989 962 942 953 980 994 996 1004 1020 1025 1012 1001 1008 1023 1029 1024 1023 1034 1045 1047 1041 1035 1027 1013 987 951 915 896 904 926 944 951 960 977 992 990 981 983 999 1014
1282 1014 1021 1032 1054 1076 1082 1072 1053 1030 1002 978 972 980 988 985 974 961 955 964 993 1038 1078 1097 1094 1083 1074 1073 1083 1107 1139 1167 1179 1177 1168 1154 1135 1107 1079 1060 1055 1062 1078 1098
1277 1098 1111 1110 1093 1068 1043 1016 990 974 974 989 1010 1032 1047 1051 1045 1037 1034 1027 1007 978 959 959 970 975 969 956 940 927 917 906 886 864 858 878 910 935 953 974 992 993
1272 993 973 950 943 951 965 983 1006 1023 1025 1012 998 989 985 980 971 959 941 919 900 899 924 968 1010 1035 1045 1056 1071 1080 1078 1079 1105 1150 1188 1199 1190 1175 1151 1104 1035 966 921
1267 921 906 905 905 904 908 917 932 955 988 1024 1048 1051 1042 1035 1034 1034 1029 1018 1010 1013 1028 1040 1035 1011 988 987 1010 1034 1041 1033 1027 1031 1045 1062 1077 1083 1082 1079 1078 1072 1054 1036 1039 1064 1093 1101 1094 1089 1092
1261 1092 1096 1093 1091 1098 1106 1106 1094 1082 1075 1075 1075 1069 1058 1046 1040 1043 1044 1031 1004 980 967 956 937 915 905 914 932 942 938 927 918 912 911 917 933 961 992 1014 1019 1012 1006 1007 1011 1008 1001 1007 1033 1065
1255A065J4j7l8m0l1k7l0k7j0J7L4L3K2J3J4K1K7K6Pl2o6n7qM0M5J8mlNjj6k6k5j3OK3L0J8
1250A007LlmnrlJ1J9J7Q%pj1kJ4K4J8PLNNmj7k3j4NJ1nl3m2k4LJ9J8Qlr%J8K1%k3k3mJ2J4
1245A002J5K2J9Kk0k4j1MJ2J4J0mk3l3k8j4j0j7j9mJ8K6J4RK3M3L7Ok2k4pQJ4J8J8Rpk0k2
1240A034j6j3j8k4k0kJ6J7QMJ5K2Rj4k6k0j7k8l7k3RK7K0QJ4K8K9J0j4k5k6k0qPJ6J4OQJ5
1235I85J7Poj9k2pJ9L1K0%lQPj5l6l6k3oJ3K8K5Mj2j1KRJ3K0K0Jk0j7KJ3J0RJ5J7J2J4J7Q
1230A113k3m6m1j8jPJ4J9J1oj3j1j1k1k6j2NRok0j7%J5K2K9L8L7J7pj6qkjLJ8L0K0mk5l4l3
1225A005k7j3JRJ0Lrj7oK8N7O1L8Qj5l2m3m4l3j8jJ2J8J2OOJ1NkjRJ5J3J7K8K9J0k1m9o2n4
1220I64k2J7L1Pj9j9KJ6J6J7K6L1K8K2J4Kj6k9l3k6j6LJ8J3j4l9m3l2j9rQK3K8K5K1J7Nj3
$$ plain form
1255 1065 1079 1062 1024 984 953 926 896 869 859 876 910 943 965 978 992 1013 1040 1066 1073 1041 975 918 910 950 995 1013 1009 1006 1011 1010 994 968 943 930 936 959 989 1007
1250 1007 1010 1007 1003 998 989 986 997 1016 1033 1041 1041 1034 1023 1021 1035 1059 1077 1084 1087 1092 1097 1093 1076 1053 1039 1044 1055 1050 1017 975 951 954 973 991 999 996 987 987 1005 1026 1026 1003 980 976 988 1002
1245 1002 1017 1039 1058 1060 1040 1016 1005 1009 1021 1035 1045 1041 1018 985 957 943 933 916 897 893 911 937 951 960 983 1026 1063 1069 1047 1023 1016 1024 1038 1056 1074 1083 1076 1056 1034
1240 1034 1018 1005 987 963 943 941 957 974 982 986 1001 1023 1032 1018 992 972 955 927 890 867 876 903 923 931 945 973 1002 1012 998 973 947 927 919 926 942 956 962 970 985
1235 985 1002 1009 1003 984 962 955 974 1005 1025 1025 1022 1030 1037 1022 986 950 927 921 934 962 987 991 979 968 970 979 992 1012 1032 1033 1013 996 998 1011 1021 1030 1045 1062 1074 1088 1105 1113
1230 1113 1090 1044 1003 985 984 991 1005 1024 1035 1029 1016 1005 994 973 947 935 940 949 943 923 906 906 921 943 972 1010 1047 1064 1057 1041 1033 1031 1030 1033 1051 1081 1101 1097 1072 1038 1005
1225 1005 978 965 966 975 985 988 979 962 956 984 1041 1102 1140 1148 1133 1101 1058 1014 981 963 962 974 992 1004 1010 1016 1027 1032 1030 1029 1038 1053 1066 1083 1111 1140 1150 1129 1080 1018 964
1220 964 942 959 990 997 978 959 961 977 993 1010 1036 1067 1095 1117 1131 1133 1117 1088 1055 1029 1013 1016 1034 1047 1033 994 951 919 900 891 899 922 950 975 996 1013 1018 1005
1215A005k0qOQKPK4L8L2J3lj5k6k9j5J7L7K9Lj1prk6l9k7LL0M1M0K6kl3m4l1j1KLkj0j5j0
1210I73m%lnnj0j4rPJ9J7J1J3J6Mj7k6j9n%JKPJ7K6K9J7lj6k4l0l1k0NK5K6J2JOK2L1K6Pj1
1205A068j6rjJpj8l3l9k8kJ8J5pj9pK7N7O2M1J1lKJ3J8J0mj7k7l0k9k2nJ4K3Nk6m1k4RK7K1
1200A028J2RRPJmlLJ2J5Nj1j8rMJ0Pkj9l0k4lR%k0l1k9k2pK1N4O0L0pj9pLmj0KK1K5J1jJM
1194A083lj2pOJ2P%mj1k3k8k1qkjQK2L0J8mk5l2j7J1L3L1J1kLJ2Lj9l2l1k6k1qJ9L8L1J2%
1189A053%mj3j3KJ8J9J0MJj1l0m5m5l1j0J6L1L3K8K7K6J3j2l0k6jK1L4L2K5J0j3l4m0j8J6
1185A043L1J3j9l7l7l4l3k1KJ8J7Nnj8k8k8oK3M2M6M6L8K0KKJ7J8kk5k6rMOPNkqkJ4J5qm3
1179A043o0n3l6j8JK4M2M3L1J9J5J7J0mk0k4j3RK7L1K6J9Pj6l6l3jL0L3J1j1j2jJj2k5k3m
$$ plain form
1215 1005 985 977 983 991 993 1000 1024 1062 1094 1107 1104 1089 1063 1034 1019 1036 1073 1102 1105 1094 1087 1078 1052 1013 986 989 1019 1060 1100 1126 1124 1091 1047 1016 1005 1007 1010 1008 998 983 973
1210 973 969 969 966 961 956 946 932 923 930 949 966 977 990 1006 1010 993 967 948 943 943 944 946 953 970 996 1025 1042 1039 1023 999 969 938 918 923 948 974 986 987 993 1015 1046 1072 1079 1068
1205 1068 1052 1043 1042 1043 1036 1018 985 946 918 916 934 949 942 923 916 943 1000 1062 1103 1114 1111 1113 1126 1144 1154 1150 1133 1106 1076 1047 1025 1020 1034 1057 1062 1036 995 971 980 1007 1028
1200 1028 1040 1049 1058 1065 1066 1062 1059 1062 1074 1089 1094 1083 1065 1056 1060 1070 1077 1075 1056 1026 1002 999 1008 1008 988 957 928 906 899 920 974 1034 1064 1057 1038 1031 1034 1030 1020 1022 1043 1068 1079 1078 1079 1083
1194 1083 1080 1068 1061 1067 1079 1086 1086 1082 1071 1048 1020 999 991 989 988 996 1018 1048 1066 1062 1037 1005 988 999 1032 1063 1074 1072 1075 1087 1090 1071 1039 1008 982 961 953 972 1010 1041 1053 1053
1189 1053 1053 1049 1036 1023 1025 1043 1062 1072 1076 1077 1066 1036 991 946 915 905 921 952 985 1013 1040 1066 1079 1067 1037 1011 1010 1031 1065 1097 1122 1132 1119 1085 1045 1027 1043
1185 1043 1074 1087 1068 1031 994 960 927 906 908 926 943 948 943 925 897 869 863 886 928 974 1020 1058 1078 1080 1082 1099 1117 1115 1090 1064 1055 1059 1065 1072 1077 1075 1067 1065 1079 1094 1086 1043
1179 1043 983 930 894 876 877 901 943 986 1017 1036 1051 1068 1078 1074 1054 1030 1017 1026 1053 1084 1110 1129 1136 1120 1084 1051 1050 1080 1113 1124 1113 1101 1100 1101 1089 1064 1041 1037
1175A037Omk4k7j1Knj7j6kK%kkj5l0k5ML2L9K8K0K1K4K4J2j0k6k2oL%mkkj1j6j1lmnQL0M9
1169A039N4L9J0j9k3kJ4Mj9k8j6kOQRQQPql0l4oL1L7J4orj6l3l8j7PJ2JkKJ%MJ2J0NJ2L1L6
1164A113J8mj4pOJ5J4jk3l8l0j7k1m4n8l8OL7L7K4K2K8K1NOK7M1J5l6o9o4l9j1J1K8L3K6J1
1159A030JjJKNQRNkqrLJ9K1Lk6m2l3j2KQRJ0Lpj4j0JLlj0j0j0j0oJ1L2L7K6J7K2K7J6j3m1
1154A064n6n1l0oPOjoj%nj2mK5N8O8M0ql2j8OKk6m3k8OK5K5J5Jj5k3j2J0J4jj4qLM%J1L2M2
1148A064L0J0%kKJ3K5J9ol1l5k1j0j1j2j0qlQK3K1Jj8k0j4j1mJ8M5N2L4Nj6k9m1m4k8JJ9J0
1143A026j7l6k8jK4L0J6%j0j1lNPjj0j4j4j3rLJ7K2J7RM%lljqk1k9j8MJ5J2NOJ2K1K8K6J3
1138A072jlLNmj3qNJ2J0RPJj0j5j0oj3j8j5mJoj3j2qo%J5L5M2L0J3NPLj3l0l3k2nOJ0J1OO
$$ plain form
1175 1037 1043 1039 1015 988 977 979 974 957 941 939 941 941 939 937 922 892 867 871 903 942 970 990 1011 1035 1059 1071 1061 1035 1013 1007 1010 1010 1006 1004 1002 991 975 964 961 957 952 960 990 1039
1169 1039 1093 1132 1142 1123 1100 1098 1112 1116 1097 1069 1053 1051 1057 1065 1074 1082 1090 1097 1089 1059 1025 1019 1050 1087 1101 1095 1086 1070 1037 999 982 989 1001 1002 1000 1002 1003 1003 1007 1019 1029 1034 1046 1077 1113
1164 1113 1131 1127 1113 1106 1112 1127 1141 1140 1117 1079 1049 1032 1011 967 909 871 877 914 951 975 997 1025 1046 1051 1057 1084 1125 1140 1104 1035 971 932 921 932 960 993 1019 1030
1159 1030 1031 1030 1031 1033 1038 1046 1055 1060 1058 1050 1041 1044 1063 1084 1087 1061 1019 986 974 976 984 993 1003 1006 999 985 975 976 979 976 966 956 946 936 930 941 973 1010 1036 1053 1075 1102 1118 1105 1064
1154 1064 1008 957 927 921 928 934 933 927 926 926 921 909 905 930 988 1056 1096 1088 1056 1038 1044 1046 1020 977 949 955 980 1005 1020 1021 1006 983 971 981 995 994 980 972 975 979 979 990 1022 1064
1148 1064 1094 1104 1104 1102 1104 1117 1142 1161 1155 1124 1089 1068 1058 1047 1035 1025 1017 1014 1022 1045 1066 1067 1049 1029 1015 1004 1000 1018 1063 1115 1149 1154 1138 1109 1068 1024 996 997 1016 1026
1143 1026 1009 973 945 944 968 998 1014 1014 1004 993 990 995 1002 1001 991 977 963 950 941 944 961 983 1000 1009 1013 1013 1010 1007 1006 998 977 948 930 934 949 961 966 972 984 1005 1033 1059 1072
1138 1072 1071 1068 1071 1076 1072 1059 1051 1056 1068 1078 1087 1094 1095 1085 1070 1060 1054 1041 1023 1008 1004 1005 999 986 974 966 960 960 975 1010 1052 1082 1095 1100 1107 1110 1097 1067 1034 1012 1007 1013 1023 1034 1040 1046
1133A046J2K0J8kk5l2k3j5j7j2J1M5N8L8jl5m9m0j7RJ7LqkJ6J7mk4k3oNRNok1k8j8jPMMJ4
1127I49J9J8K4M0N0L5Nk3l9m5m0j9J1L4M0L3J5j0k9l8l9m2l7j5J4L0J9LjRK1K8K4Pj9l8l6
1123I58j2J0J7Nj2j4QL9M9K5j3l5k7oJ1J5J4J7K2K1J0mj1j3j5j9j5nlj0j6pJ1K5K7J7rl6n1
1118I68l9j2RJ8J8J3P%oj5k3j4J2L0J9nj0MJ4PNJ1Rpj0J4L5K3nj6pkqpQJ2mk1j6JJ4J6J1k
1113A049k2l6l7k5pJ6L8M4K8Omnmrrqrj3j7j9j9j2MJ8J8RJ2K5L4K5Qk%QJ1Nj2l4m5l9k0jO
1108I56MLJ0K3K9K3J1NMLnj2j3qkkj5l1l8k4NK8L4K5Rnj4j0RL1L6K3Jj5k0j6j6j7j2NK7L5
1102A064K5Qmj1j1rj2l0n0n1k3J9M8N3L9J9Ojlj2k2k3j3kmj0rLPJj1k4k9j5K0N6O1L5Mj5k6
1097A048k7j2J5K7Pj7k2j0qj2mJ5K4J1jKJ0jk3l2j4J3K5J9OMJ5K5J8jj7j2NJ9K0J0kj4k0k1
$$ plain form
1133 1046 1058 1078 1096 1094 1069 1037 1014 999 982 970 981 1026 1084 1122 1121 1086 1037 997 980 989 1006 1009 1001 999 1015 1032 1028 1004 981 975 980 989 994 988 967 939 921 920 927 931 935 949
1127 949 968 986 1010 1050 1100 1135 1140 1117 1078 1033 993 974 985 1019 1059 1092 1107 1097 1068 1030 991 949 912 897 911 941 960 963 962 971 992 1020 1044 1051 1032 994 958
1123 958 946 956 973 978 966 952 960 999 1048 1073 1060 1025 998 992 1003 1018 1032 1049 1071 1092 1102 1098 1087 1074 1059 1040 1025 1020 1017 1007 991 984 995 1020 1047 1064 1055 1019 968
1118 968 929 917 926 944 962 975 982 982 976 961 938 924 936 966 985 980 970 974 988 995 1000 1011 1020 1013 1003 1017 1052 1075 1070 1054 1047 1045 1037 1030 1038 1050 1046 1025 1009 1010 1024 1040 1051 1049
1113 1049 1027 991 954 929 922 938 976 1020 1048 1054 1050 1045 1041 1032 1023 1015 1006 993 976 957 938 926 930 948 966 975 987 1012 1046 1071 1079 1077 1077 1085 1096 1101 1089 1055 1010 971 951 950 956
1108 956 960 963 973 996 1025 1048 1059 1064 1068 1071 1066 1054 1041 1033 1031 1029 1014 983 945 921 926 954 988 1013 1022 1017 1003 993 1002 1033 1069 1092 1093 1078 1058 1042 1026 1009 997 1002 1029 1064
1102 1064 1089 1097 1093 1082 1071 1062 1050 1020 970 919 896 915 963 1016 1055 1074 1080 1079 1076 1064 1042 1019 1006 1004 1000 990 981 984 991 992 981 957 928 913 933 989 1050 1085 1089 1074 1048
1097 1048 1021 1009 1024 1051 1058 1041 1019 1009 1001 989 985 1000 1024 1035 1034 1036 1046 1045 1022 990 976 989 1014 1033 1039 1043 1058 1083 1101 1100 1083 1071 1076 1095 1115 1125 1123 1109 1089 1068
1093A068j8j5rJRR%kNJ5J5Npj8k5j3J3L7L6J6kj0k6n2o4m6j1QKqp%PJ5J9J2KKJ7L7M6M3L3
1087A139J8Loooj0j3j0qpolpj6k3j6jJ4K8M0M2K9Rmj1k3l4l0rNKj1j5qKJ5K0J3pk1j5NJ7J8
1082A093J7K2J8om1o0n7l4oK2M1M8L7J7lj5j6qJJqj2kJ3J9J9J4Qoj8k1j6j2j1JJ8K2J1%jk
1077A087j5k5k1pqj7k1pJ3K6K8K3J9K2K7K1Jj1jJ4J3KJQjj6j6NJ5Mrj2k2m8o0l6NK4J6J0J9
1072A050L0L3K7J7PMMqk9m2k3OJ6KoLJ5J9J9J6nm2o7n8k3J4L3L9L2J5nj8j8j3mjqk0k9j6J3
1067I79L9M6K6jj8j7j4j3j0OK1J5pk2j7%J0K1L2L5J6j4l5l4k7k6k7k8k1pJ4L9N6N5L8J5kp
1062A116nkk%Jlj3k1j6nKJLJ1J6Rj1k8l0j6%J0Nj0k5k8qK0L0J5j0j6nLoj8j7nJ1K3K7J4j1
1057A006l1k9j0PJ2QjpoJQJ6K6K9J6j2l1k2kKrj4LK3K5Rj1k1j7rjNJ8L5M2K9OjPJ2Jj5k0k0
$$ plain form
1093 1068 1050 1035 1026 1027 1036 1045 1045 1043 1048 1063 1078 1083 1076 1058 1033 1020 1033 1070 1106 1122 1120 1110 1084 1032 968 922 911 919 921 913 906 906 913 928 947 959 961 963 980 1017 1063 1106 1139
1087 1139 1157 1160 1154 1148 1142 1132 1119 1109 1101 1094 1088 1085 1078 1062 1039 1023 1022 1036 1064 1104 1146 1175 1184 1180 1169 1146 1112 1082 1073 1078 1080 1069 1054 1046 1048 1063 1083 1096 1089 1068 1053 1058 1075 1093
1082 1093 1110 1132 1150 1144 1103 1043 986 952 946 968 1009 1057 1094 1111 1108 1093 1077 1069 1070 1071 1063 1051 1049 1062 1081 1100 1114 1122 1116 1098 1077 1061 1049 1038 1039 1057 1079 1090 1090 1089 1087
1077 1087 1072 1047 1026 1019 1011 994 973 966 979 1005 1033 1056 1075 1097 1124 1145 1146 1135 1134 1148 1161 1163 1164 1172 1171 1155 1139 1144 1159 1163 1154 1142 1120 1072 1012 976 981 1005 1021 1031 1050
1072 1050 1080 1113 1140 1157 1164 1168 1172 1164 1135 1093 1070 1076 1092 1094 1088 1091 1106 1125 1144 1160 1155 1113 1046 988 965 979 1012 1051 1083 1098 1093 1075 1057 1044 1040 1039 1031 1011 982 966 979
1067 979 1018 1064 1090 1089 1071 1054 1040 1027 1017 1023 1044 1059 1052 1030 1013 1013 1023 1044 1076 1111 1127 1113 1078 1044 1017 991 964 936 915 908 922 961 1017 1072 1110 1125 1123 1116
1062 1116 1111 1109 1107 1107 1108 1105 1092 1071 1055 1050 1052 1053 1056 1067 1083 1092 1081 1053 1023 1007 1007 1017 1022 1012 987 959 951 971 1001 1016 1006 990 985 988 982 964 947 942 953 976 1003 1017 1006
1057 1006 975 946 936 943 955 963 962 955 949 950 958 974 1000 1029 1045 1033 1002 980 978 980 971 957 960 983 1008 1017 1006 985 968 959 958 963 981 1016 1058 1087 1093 1092 1099 1111 1112 1097 1077 1057
1052A057k5k5j0J4L0K9J8Pnk1l3l3j5NJ0pk4k0MK8K9J6ONOJ1J7K0Rj3k2j2RJ8J4Nok3l9m2
1047I92k7pOMmlNJ5K1K0J6Rlj6k3j8mMLmnlknqlQJ1OJOJ2jl1n5m7j0K6M0L4K5J4%mNK4K9J3
1041A066mqmoj8k5j7jJ0J7J3Kj3k0j1jNLNNLoj2j4j4j4j3nNJ1J7K4L8N5O1M7J5k1l9l0rjj6
1036A080l4l3j7qj1j2NK5J8j2l7k7J4N1O3N0L1K0J9J8J2NKNMj1l7n5m9k6lRJ1PMJMOJj4k6
1031A053k5j9k0k3j3PK2K6K9L4K5%k8l5j9OJ7J4jj3j2MK0K4J5Moj1kJ9L5K9Nj2j3pomLNok4
1025A097l8m2l4j7nmoJ1M0N5L5Lj4j2mLJ2J9J4NOK0L6L6J5k0n1n2k0J6K2%k5l5m1m8m5k4Q
1021I16L2M4L8J9pk1k1j8k2k6j5J2M2N2L5nl5l5j2%rj9j4%M%NJ6K1J6QPPRRQlj9k6j8LJ9K0
1015A017J0NJ1J5Jk4l5k7j2lPK6L3J5mJK2K6Lj5j1jj%Knk5l5j8RJ6LlJ0J5kl1m3l3j0QJ1M
$$ plain form
1052 1057 1032 1007 997 1011 1041 1070 1088 1095 1090 1069 1036 1003 988 993 1003 996 972 952 956 984 1013 1029 1035 1040 1046 1057 1074 1094 1103 1090 1068 1056 1065 1083 1097 1102 1096 1073 1034 992
1047 992 965 958 964 968 964 961 966 981 1002 1022 1038 1047 1044 1028 1005 987 983 987 990 986 981 978 976 971 963 960 968 979 985 986 992 1004 1003 972 917 870 860 886 926 960 985 999 999 995 1000 1024 1053 1066
1041 1066 1062 1054 1050 1044 1026 1001 984 983 993 1010 1023 1025 1012 992 981 980 985 988 993 998 1001 995 983 969 955 941 928 923 928 939 956 980 1018 1073 1134 1181 1196 1175 1136 1106 1097 1096 1080
1036 1080 1046 1013 996 988 977 965 970 995 1013 1001 964 937 951 1002 1065 1115 1146 1166 1185 1203 1215 1220 1222 1227 1231 1220 1183 1128 1079 1053 1050 1059 1070 1077 1081 1082 1086 1092 1093 1079 1053
1031 1053 1028 1009 989 966 953 960 982 1008 1037 1071 1096 1096 1068 1033 1014 1020 1037 1051 1050 1037 1025 1029 1049 1073 1088 1092 1086 1075 1073 1092 1127 1156 1161 1149 1136 1129 1123 1119 1122 1127 1121 1097
1025 1097 1059 1017 983 966 961 957 951 962 1002 1057 1092 1095 1081 1069 1065 1068 1080 1099 1113 1118 1124 1144 1180 1216 1231 1211 1160 1108 1088 1104 1126 1126 1101 1066 1025 977 932 908 916
1021 916 948 992 1030 1049 1042 1021 1000 982 960 934 919 931 973 1025 1060 1055 1020 985 973 973 964 945 931 931 935 935 940 956 977 993 1001 1008 1015 1024 1033 1041 1038 1019 993 975 978 997 1017
1015 1017 1027 1032 1043 1058 1059 1035 1000 973 961 958 965 991 1024 1039 1035 1036 1058 1084 1087 1072 1061 1060 1059 1059 1061 1056 1031 996 978 987 1003 1006 1003 1013 1028 1026 995 952 919 909 917 928 932
1010I32mnLQJ4K3L3L3J5j5l8m1k3KK3L0K9K4J3pk2k3j0lorLK3L9M2L2K0Nlj3k5l6l2j2MKj1
1005A014j6j4k0l3l4j4QRpj6lK3M5N0L8J7Jnmpj6k5k4mK1L4K1mj9j6o%MPPLjlJOJ8L0L0J0
1000A106j2j2JOkj1lJ0J3LnlOJ2J1Knoj0k3m0m1k4j0j3k4j8%J3J6J8K5L0K9L2L9L3J3j1j3
995A132%Qll0n5o3n1k6poj3pRJ7RLJ5L0K8Rqj3j5j3KL1M9L6Oj2j2rj5j8pJ1K3K4K1J4Lj0j9
989A068k0rPK0K1Qj0k2k8k7j9n%mj0rnj3k7l1j7PK4L7M6M3K5ONJ3Qj0k1j7pqpRL2L9K7J0j0
984A119l1m6m2j7NNj1k4k0nJ2K3K2Qj0k0k5k6k0JK3K6J2%MJ6K0J5J1Pkj4j9j3KK3M0M0K2m
979A107j6j2nj2l2n2o2m8j7J3K9L2L7M9N5L6Oj5j5lJoj9l4l8l1mK9M9M0Qj9k2lJ6J9J2QJ2
975A093Oj1k4j6J1K7J5j3k7k0mNRJ2J2Nqj7j7j6j4pOK5L4L2J7kj5k0k1j7pOPlj5j5ojJLLl
$$ plain form
1010 932 928 923 926 934 948 971 1004 1037 1052 1037 999 958 935 937 960 990 1019 1043 1056 1049 1027 1004 994 991 985 976 979 1002 1041 1083 1115 1135 1140 1137 1124 1099 1063 1031 1019 1023 1025 1014
1005 1014 998 984 964 931 897 883 891 900 893 877 874 897 942 992 1030 1047 1048 1043 1039 1032 1016 991 967 963 984 1018 1039 1035 1016 1000 994 994 998 1005 1012 1015 1014 1011 1012 1018 1036 1066 1096 1106
1000 1106 1094 1082 1083 1089 1087 1076 1073 1083 1096 1099 1094 1091 1097 1109 1120 1122 1117 1111 1101 1078 1038 997 973 963 950 926 908 908 921 937 955 980 1010 1039 1071 1110 1143 1156 1145 1132
995 1132 1132 1140 1137 1107 1052 989 938 912 905 899 886 879 888 905 914 917 932 962 990 999 991 978 963 950 952 983 1032 1068 1074 1062 1050 1041 1026 1008 1001 1012 1035 1059 1080 1094 1097 1087 1068
989 1068 1048 1039 1046 1066 1087 1095 1085 1063 1035 1008 989 984 984 980 970 961 956 943 916 885 868 875 899 936 982 1025 1050 1056 1061 1074 1082 1072 1051 1034 1027 1019 1012 1021 1053 1092 1119 1129 1119
984 1119 1088 1042 1000 983 988 993 982 958 938 933 945 968 990 998 988 968 943 917 897 898 921 947 959 959 963 979 999 1014 1025 1032 1030 1016 997 984 986 1009 1049 1089 1111 1107
979 1107 1091 1079 1074 1062 1030 978 916 868 851 864 893 925 962 1011 1066 1102 1108 1093 1078 1075 1076 1070 1051 1017 979 948 944 973 1022 1062 1070 1051 1029 1026 1042 1061 1073 1081 1093
975 1093 1099 1088 1064 1048 1059 1086 1101 1088 1061 1041 1037 1042 1051 1063 1075 1080 1072 1055 1038 1022 1008 1001 1007 1032 1066 1098 1115 1113 1098 1078 1057 1040 1033 1039 1046 1043 1028 1013 1007 1006 1007 1010 1013 1010
969A010j2j1k%j1k0j8j2j8k5j7PK7L0J9QPJ7L3L8K7QonjJjlorj1qqj0j5j1OK3L0J8jqLK1J7
964A101ok8l2k1j3j5j7j1mnplNJ0NJNJ4J4Ooj5j9j1J1K8K2JoK0N1N0J3j6j6NJ6J0%j1k0k2
958A084j6rrj6j9j3pqj1oJ1K7K6J0nmOJ0lk0k0kJ7J7Mm%RJ0NORPlj0pOJ3Pj0k1j6JJ5J7J3
953A091J4J5Nj4k0qQNj8l3l2j9qkNOJonNJ3J2QPOKqj1lQJ1JmMJ4J6J0J2K2K5Rj4j9oPNlqq
947A098j5l4m8l7mK8L6J8nj9k4j5RM0N0L5J2Jjrj7j4MJ5J3PJok2l7l9k5mJ1K2L2L8L2J0qq
942A121nj7m4n3k4J5K9J9PNkj8k4j1RJ1jj1j0lNJ2J5J1LjMRRjj3k3k0mJ6K6K5J7RJqj3j2q
936A052pj1j3mRJ7J4P%oj3j1JJ6K6L0K9K3Nj8l2k6j2lknpj1j8k5k9k5qOKj4k1mK5L9L3J6M
931A029knqj2rJK3M0M4K9Rrj9k0j1%QLj3l5m6l2jK3J9JmOJ2Lj2j3q%J6M0N3L7RlRK2J3rj9
$$ plain form
969 1010 998 987 985 985 974 954 936 924 906 881 864 871 898 928 947 955 962 979 1012 1050 1077 1085 1079 1074 1073 1074 1073 1070 1064 1055 1044 1036 1028 1018 1003 992 998 1021 1051 1069 1068 1060 1063 1084 1101
964 1101 1095 1067 1035 1014 1001 986 969 958 954 949 942 939 944 954 959 960 965 979 993 999 993 978 959 948 959 987 1009 1010 1004 1024 1075 1125 1138 1122 1106 1111 1127 1137 1137 1126 1106 1084
958 1084 1068 1059 1050 1034 1015 1002 995 987 976 970 981 1008 1034 1044 1039 1035 1041 1051 1048 1028 1008 1006 1023 1040 1044 1040 1040 1049 1059 1064 1070 1079 1086 1083 1073 1066 1072 1085 1092 1082 1061 1045 1046 1061 1078 1091
953 1091 1105 1120 1125 1111 1091 1083 1091 1096 1078 1045 1013 994 986 984 989 995 996 990 985 990 1003 1015 1023 1030 1036 1038 1030 1019 1016 1024 1035 1036 1032 1036 1050 1066 1076 1088 1110 1135 1144 1130 1111 1105 1112 1117 1114 1106 1098
947 1098 1083 1049 1001 964 960 988 1024 1042 1037 1018 994 979 988 1028 1078 1113 1125 1126 1125 1116 1099 1085 1089 1104 1117 1124 1125 1119 1097 1060 1021 996 992 1003 1025 1057 1095 1127 1137 1129 1121
942 1121 1116 1099 1055 1002 978 993 1022 1041 1048 1053 1051 1033 1009 998 1007 1018 1017 1006 996 993 998 1010 1025 1036 1039 1038 1042 1051 1060 1059 1046 1023 1003 999 1015 1041 1066 1083 1092 1093 1085 1072 1060 1052
936 1052 1045 1034 1021 1017 1026 1043 1057 1064 1064 1058 1045 1034 1035 1051 1077 1107 1136 1159 1164 1146 1114 1088 1076 1073 1071 1066 1059 1048 1030 1005 976 951 943 949 951 937 916 912 937 976 1009 1025 1029
931 1029 1027 1022 1014 1002 993 994 1017 1057 1101 1130 1139 1130 1111 1091 1080 1080 1088 1091 1078 1043 997 965 964 987 1006 1007 1003 1009 1021 1024 1012 999 991 991 1007 1047 1100 1137 1146 1143 1152 1174 1187 1178 1159
926A159pPJk5n0m8j6J6K6J6PRJ2J1J2J2Jj8k2oMj0k8k3OK1Rrj3nlnmKOQJ1R%j1k0k4k1j0k
920I85pj8j7LJ5RPK6M8M1Qj3j2qj4j0PJ8RjNJ1mk9l1j3OJ3J7K1J3jkJ3J6lk5j9%Lj3k2j1%
915A021ok0j8%J2Nn%J9L0J7qk7k6j4%J1J3Kj0oJ9M4M7K5nk4l6m4m3k6jJ6J8J2J3K0K2J0qj9
910A030k2k1k7l3l4j6J5M2M7K7PNK1L3K9J4ol0n2n6l9j1NRPQJ4K3L7L9K4mj7qJ1J7J3QOjj3
905A101k0j5qooNK7M3L8J6rk6l0l0l0l1l2k6j1OJ3NnnLNLJ1L7N4M0Lk2j7jJj4k6k6j7j1qn
900I74jRJ3Lj3j6jJ1ll0m4l3j5kJ1K7L7K8J8J7K2J2mpJ0K7K9J4lj0JK6M2L0nl4l2j4%qk7l8
894A021l5j7lkpmJ1J9Rqj7pQK3K7K3J7RMKJNJ1J2Nj%jqj5j1NJ8K2J9J7J8J4Njorj2j2j3j4
889A122j6j4nOJ0NJPK4L0J3j3k7j6OK3K5J2rj8JL4N2L8Pj5k3l3m7n0l6k1k0k3j3PK1J6%j5
$$ plain form
926 1159 1152 1159 1160 1135 1085 1037 1021 1037 1063 1079 1086 1095 1107 1118 1130 1142 1143 1125 1103 1097 1101 1091 1063 1040 1046 1067 1076 1067 1054 1049 1046 1041 1037 1039 1045 1053 1064 1073 1073 1062 1042 1018 997 987 985
920 985 978 960 943 946 961 970 977 1003 1051 1092 1100 1087 1075 1067 1053 1043 1050 1068 1077 1076 1081 1092 1088 1059 1028 1015 1021 1034 1051 1072 1085 1084 1082 1095 1111 1108 1083 1064 1064 1067 1054 1032 1021 1021
915 1021 1015 995 977 977 989 994 989 989 1008 1038 1055 1047 1020 994 980 980 991 1004 1006 996 990 1009 1053 1100 1125 1120 1096 1060 1016 973 947 946 962 980 992 1005 1025 1047 1057 1049 1030
910 1030 1008 987 960 927 893 877 892 934 981 1008 1015 1020 1041 1074 1103 1117 1111 1081 1029 973 934 923 928 937 944 952 966 989 1026 1065 1089 1085 1068 1060 1071 1088 1101 1109 1115 1114 1101
905 1101 1081 1066 1058 1052 1046 1051 1078 1121 1159 1175 1166 1140 1110 1080 1050 1019 987 961 950 956 969 974 969 964 967 972 975 986 1023 1077 1117 1120 1098 1081 1080 1081 1067 1041 1015 998 987 979 974
900 974 973 982 995 998 985 969 968 979 976 946 902 869 854 852 863 890 927 955 973 990 1012 1024 1020 1013 1023 1050 1079 1093 1090 1080 1081 1107 1149 1179 1174 1140 1108 1094 1094 1086 1059 1021
894 1021 986 969 966 964 957 953 964 983 992 984 967 960 968 991 1018 1041 1058 1067 1071 1073 1074 1079 1090 1102 1107 1106 1106 1105 1097 1082 1071 1076 1094 1116 1135 1152 1170 1184 1189 1188 1182 1173 1161 1149 1136 1122
889 1122 1106 1092 1087 1093 1103 1108 1109 1116 1140 1170 1183 1170 1143 1127 1133 1156 1181 1193 1184 1166 1167 1201 1253 1291 1298 1283 1260 1227 1180 1130 1094 1073 1053 1030 1017 1024 1045 1061 1061 1046
884A046j6nJ0J7RmmLKj2j6LK5L1K7L4M7M1Rk1k8k2k1k3j2PJ2%j9k5j5OK6L1J8NRJ8J2j1j9
879A175LK6J7j6l8k7%J6K3K8L4L4K4J4MmpJJ8K8K4J0RK6M5N2M7N1O6P4O0L8K3J8%l1n9p0p6
874A660r3j08r9o0k2mk%Jnj4j4mMJnojmj2j4lJ1J4LqoNMk0m7m4j0J7Rk0l6k8rLPJ2J8J9J3
869A103MLJ6L6M5L0Nqojqj9k6k7k2j1NK1K5J6Mmpj1j4j0KJ6K1J7J2J1Qjj4j9j6j3j7j7qPJ7
863A145Qj0k8l4k5pJ0J6J2NOJ4J8QmmQJ5J0NJ1J3Jj9k1pPRJ3K1J9lk5k3nNkj7k9m0m5l4rJ6
858A004K7K5J5Nlrj5k1j7oNLmkJ0K1K0J3RPOQJ4K0J8J3PML%rk6l7l4j5NJ4J1%j4j7rOOj1k8
852A022k9k0j1kPJ7K7M0N5N9M5K0%pj5k1j8kJ5J7Pqj6j6j3j0j0j1j0pprlRJ8Qj5k7j7OJ4%
847A082j6k3k5k9k3JK9M1L2K2K3K2J2lmJ2L5N0N2L5Rj1j7j7k3m0n3n0k7OL0K6ll1l3j5QK4
$$ plain form
884 1046 1030 1025 1035 1052 1061 1057 1053 1056 1058 1046 1030 1033 1058 1089 1116 1150 1197 1238 1247 1226 1198 1176 1155 1132 1120 1127 1139 1139 1120 1095 1080 1086 1112 1143 1161 1166 1175 1193 1205 1194 1175
879 1175 1178 1204 1221 1205 1167 1140 1140 1156 1179 1207 1241 1275 1299 1313 1317 1313 1306 1307 1325 1353 1377 1387 1396 1422 1467 1519 1566 1617 1683 1757 1817 1855 1878 1896 1896 1865 1806 1736 1660
874 1660 1567 1459 1360 1300 1278 1274 1272 1272 1273 1268 1254 1240 1236 1240 1241 1236 1230 1229 1225 1213 1199 1196 1207 1221 1224 1216 1210 1215 1219 1199 1152 1108 1098 1115 1124 1104 1068 1040 1031 1034 1041 1053 1071 1090 1103
869 1103 1107 1110 1126 1162 1207 1237 1242 1234 1228 1227 1219 1200 1174 1147 1125 1114 1119 1140 1165 1181 1185 1181 1174 1163 1149 1139 1141 1157 1178 1195 1207 1218 1226 1225 1211 1192 1176 1163 1146 1129 1121 1128 1145
863 1145 1153 1143 1115 1081 1056 1049 1059 1075 1087 1092 1098 1112 1130 1138 1134 1130 1138 1153 1163 1168 1179 1192 1193 1174 1153 1146 1153 1162 1175 1196 1215 1212 1187 1164 1159 1164 1162 1145 1116 1076 1031 997 988 1004
858 1004 1031 1056 1071 1076 1073 1064 1049 1028 1011 1005 1010 1013 1009 1007 1017 1038 1058 1071 1080 1087 1093 1101 1115 1135 1153 1166 1173 1177 1180 1180 1171 1145 1108 1074 1059 1064 1078 1089 1089 1075 1058 1049 1055 1061 1050 1022
852 1022 993 973 962 960 967 984 1011 1051 1106 1165 1210 1230 1230 1223 1208 1187 1169 1167 1182 1199 1206 1198 1182 1166 1153 1143 1133 1122 1112 1105 1098 1089 1086 1095 1113 1121 1106 1079 1062 1068 1082 1082
847 1082 1066 1043 1018 989 966 967 996 1037 1069 1091 1114 1136 1148 1145 1141 1153 1188 1238 1290 1325 1334 1323 1306 1289 1266 1226 1173 1123 1096 1102 1132 1158 1155 1124 1091 1076 1084 1108
843A108L2L4K9K5K5J9ol5l9j2J3Kk5l6j8MJ1QLlj5k3j4QK1J5JlOJ9J8P%%K%rj9k2j4PL3M8
837A205M7L3J4mj9k6k2j7k0k9k7j4%MjnMJ6K1J5RPPlj6j1J0K3J4knkj1k6k2OK7K5J5J7K3J2
832A272j2l1l3l5m4n0m0j4J5L3L8L2L0K9K2jk5k6JL0L8L0K4K7L2L3K9J8Mrj0JK0L4L5K4Mj9
828A506l9m6l9k4k1l3m6l7j3J0K1K2J7OljQQoj7j1JLkKJ9K8J8%qLJ7K8K5J7PMRJ6J6QkqmN
822A464OKkQL0N3N9M0RqQL6M3K1OK4O0Q3R3J12J41J56J51J44J52J68J78J83J75J38P3J1l1
818C786o7j11j54j72j79j90j98j79j31q3n2l3k0j9k7l0k5l4n6p2o4m0k3k0k0j6oOPj2m9p4
814A643o7l6pLJj0k4l7l9l1k2j5KK2K7J5Jkmrj1jQol1l6j3Npl5l9j2J3Rj6l1j8PK9L3K7J5
809A301Jj4k5k5j1NO%%RJ7J4QQJ0Mpj0mjmpmnpqjjrj6nJ8L3L0J7NjnnlOJ6K2K5K1J5PLMJ2
$$ plain form
843 1108 1140 1174 1203 1228 1253 1272 1266 1231 1192 1180 1193 1195 1170 1134 1116 1120 1131 1139 1142 1139 1124 1101 1087 1095 1116 1131 1132 1129 1135 1154 1172 1179 1179 1179 1181 1181 1172 1153 1131 1117 1124 1157 1205
837 1205 1252 1285 1299 1295 1276 1250 1228 1211 1191 1162 1135 1121 1121 1125 1124 1119 1123 1139 1160 1175 1184 1191 1198 1195 1179 1168 1178 1201 1215 1213 1208 1206 1195 1169 1147 1153 1180 1205 1220 1237 1260 1272
832 1272 1260 1229 1196 1161 1117 1067 1027 1013 1028 1061 1099 1131 1161 1190 1212 1211 1186 1160 1161 1191 1229 1259 1283 1310 1342 1375 1404 1422 1426 1417 1407 1408 1428 1462 1497 1521 1525 1506
828 1506 1467 1421 1382 1358 1337 1304 1258 1221 1208 1218 1239 1261 1278 1284 1281 1280 1288 1296 1290 1273 1262 1263 1266 1264 1266 1285 1313 1331 1331 1323 1326 1343 1371 1396 1413 1420 1424 1433 1449 1465 1473 1471 1463 1459 1464
822 1464 1470 1472 1470 1478 1508 1561 1620 1660 1669 1661 1669 1705 1748 1769 1775 1799 1859 1942 2035 2147 2288 2444 2595 2739 2891 3059 3237 3420 3595 3733 3806 3817 3786
818 3786 3719 3608 3454 3282 3103 2913 2715 2536 2405 2322 2270 2237 2217 2198 2171 2141 2116 2082 2026 1954 1890 1850 1827 1807 1787 1771 1765 1771 1778 1766 1717 1643
814 1643 1576 1540 1533 1536 1537 1527 1503 1466 1427 1396 1374 1359 1361 1383 1410 1425 1426 1424 1420 1411 1400 1399 1407 1401 1370 1334 1321 1326 1319 1284 1245 1233 1246 1255 1239 1208 1190 1197 1226 1259 1286 1301
809 1301 1302 1288 1263 1238 1227 1232 1238 1238 1238 1247 1264 1278 1286 1294 1304 1308 1301 1291 1287 1286 1282 1275 1271 1266 1259 1251 1250 1249 1240 1224 1219 1237 1270 1300 1317 1322 1321 1316 1311 1308 1314 1330 1352 1377 1398 1413 1420 1423 1427 1439
803A439K1K3J0j5l2l6k9k9k8j7KJ5Ppj2j0rnRK9L0Nk3l4k5lK5M7M4J3k2l1k1j0rnkklLJ0P
798A320pj1mMNQJ9K3J3%LJ0Prj7j1mnj2j9k2k2j8j2qmpj1rMK0L0L8M9N6N2L6K9K8K3Mpjkk2
792A537l5j1L2M5J3k2l1j9j5j7j6j3j5j7j2qj3k2k3j2NJ9K4K0J1RR%k0l3j7QJ2j5m1l6j4l
788A264mjJ8L7M1L0K0J6J4J5K2L4M4N2N4M3J7nqknj9j6J0L4L0J2MJ5K3K3J8J1kj3j5j5k9n1
783A716o1m0nK1K6J9J5J3J7J5Kj6l3m0m3m1l1j0J3K8K5Qj0j6j1oj3k3k5k0j9k2j7pJRJ7K3
778A459Qk4m7l9j2J3K7L8N0N7N6M4K7K5M5P5Q2O1L8L5M4M4M1N1O7O6M2J3pk5m1n0m0k4j6j3
774B170lJ1J8J2NJ0K2K3QlPL4N1N0L7K0N%J5M0N4M8M1N4P8Q4O9M3K3J0PJ0RLJJ0J6PmJK3L3
769C152K2Nnj1j8k0kL1O8R2R4P8N4L8L2K9K6K3K9N0P9J05J07R1P7Q5J12J29J25J08R4Q2O9
$$ plain form
803 1439 1460 1483 1493 1478 1446 1410 1381 1352 1324 1307 1309 1324 1331 1324 1312 1302 1293 1288 1297 1326 1356 1361 1338 1304 1279 1276 1301 1348 1392 1405 1383 1352 1331 1321 1312 1307 1305 1303 1300 1303 1313 1320
798 1320 1313 1302 1298 1302 1307 1315 1334 1357 1370 1370 1373 1383 1390 1381 1364 1353 1349 1344 1332 1313 1291 1269 1251 1239 1231 1227 1220 1209 1200 1204 1224 1254 1292 1341 1397 1449 1485 1514 1542 1565 1569 1562 1561 1559 1537
792 1537 1502 1491 1523 1568 1581 1559 1528 1509 1494 1477 1461 1448 1433 1416 1404 1396 1383 1361 1338 1326 1331 1350 1374 1394 1405 1414 1423 1423 1403 1370 1353 1361 1373 1358 1317 1281 1267 1264
788 1264 1260 1259 1277 1314 1355 1385 1405 1421 1435 1450 1472 1506 1550 1602 1656 1699 1716 1711 1703 1701 1696 1677 1661 1671 1705 1735 1747 1751 1766 1789 1812 1830 1841 1839 1826 1811 1796 1767 1716
783 1716 1655 1615 1610 1631 1657 1676 1691 1704 1721 1736 1738 1722 1689 1649 1606 1565 1534 1524 1537 1565 1590 1598 1588 1572 1561 1555 1542 1519 1494 1474 1455 1433 1416 1409 1410 1419 1436 1459
778 1459 1467 1443 1396 1357 1345 1358 1385 1423 1473 1530 1586 1630 1657 1682 1727 1802 1884 1945 1983 2018 2062 2106 2147 2198 2265 2331 2373 2386 2379 2354 2313 2263 2223 2199 2183 2170
774 2170 2167 2178 2196 2208 2213 2223 2245 2268 2276 2273 2280 2314 2365 2415 2452 2472 2477 2477 2492 2532 2586 2634 2675 2729 2807 2891 2960 3003 3026 3036 3043 3053 3062 3065 3066 3076 3092 3099 3095 3096 3119 3152
769 3152 3174 3179 3174 3163 3145 3125 3123 3154 3222 3314 3408 3486 3540 3578 3610 3639 3665 3688 3717 3767 3846 3951 4058 4149 4226 4311 4423 4552 4677 4785 4879 4961 5030
765E030N8O2Q3R8R4P2N1M9N6N8O1Q3J30J74J94J89J81J81J85J92K08K36K73L11L42L66L96
761I413M44N00N43N78O36P24Q14Q83R47J038J146J245J337J437J536J615J677J744J826J917
759C2000K026K162K309K443K564K701K847K985L120L287L492L720L991M363M880N538O324
757I0752P247Q327R599J1127J2979J5173J7689K0505K3558K6709K9802L2751L5416L7386L7937
755D16957L6229L1375K2513R321p034k3598l6809m4401m6339m4149l9639l4204k8787k3958
753A87477j9908j6569j3828j1626r887q491p347o417n666n039m506m073l731l449l207l011
751F0722k860k737k625k522k411k270k100j934j801j687j574j466j372j283j193j108j047
749B8732j007r76r40q97q48q01p62p34p18p14p20p20p04o73o40o22o13o04n91n75n57n34n02
$$ plain form
765 5030 5088 5150 5233 5331 5425 5497 5548 5597 5653 5711 5772 5855 5985 6159 6353 6542 6723 6904 7089 7281 7489 7725 7998 8309 8651 9017 9413
761 9413 9857 10357 10900 11478 12114 12838 13652 14535 15482 16520 17666 18911 20248 21685 23221 24836 26513 28257 30083 32000
759 32000 34026 36188 38497 40940 43504 46205 49052 52037 55157 58444 61936 65656 69647 74010 78890 84428 90752
757 90752 97999 106326 115925 127052 140031 155204 172893 193398 216956 243665 273467 306218 341634 379020 416957
755 416957 453186 484561 507074 516395 509361 485763 448954 404553 358214 314065 274426 240222 211435 187477
753 187477 167569 151000 137172 125546 115659 107168 99821 93404 87738 82699 78193 74120 70389 66940 63733 60722
751 60722 57862 55125 52500 49978 47567 45297 43197 41263 39462 37775 36201 34735 33363 32080 30887 29779 28732
749 28732 27725 26749 25809 24912 24064 23263 22501 21767 21049 20335 19615 18895 18191 17518 16878 16256 15643 15039 14448 13873 13316 12782 12280
746A2280m59m19l83l48l15k85k72k73k78k80k74k62k38k16k01j96j85j66j49j32j14r3q2q3
743F577p7o0m5m6n8p1q2r4j00r2q0p6p8o8m7l0k9m2n9o9o1m4l7n3p6r4j04j09j05r3q5q6q0
739D247n3k6k3l6l8l3m2o8p4m8j9j8l3l7k6j4j8l0m3m5m1l3k6k3j7j3j6k3j9MK6K6Kk9m6m4
735C251l4k9l5m4m4l0j4nj1k7m3m8l7j6QK9M3M4L0J2QK3M5O6Q0Q2O2K7nk6m3n8o3m8k8j0J
730C113PLj1l2m7n4m7k4J3L6K5j2m8o0n1l4j6j0j7k9l1k0kJ0J4K1L4M4M3L2J3lj2rMJ6J5Q
726B882LMlk3m2m3k6j5k0l4m2l4j5OJ9J9J4J2Qj0k7k7j2%KQK7M2L4Rj6k8k1LK7K5nl4l6k0
721B611qj0j8k9m0m4l4k4k2k4j2J2K5J8QOPKoqoJPJ0Plj2j6j2j0j4j8k0j7j7j9j9oQPoj0N
716B250K4L0K3J8J9J8J5J3J3Qlj6k7l7l7k5qlj6l1l3k5j2JJ0J5J3Npj3JK5L2J0k0l1k2j5j8
$$ plain form
746 12280 11821 11402 11019 10671 10356 10071 9799 9526 9248 8968 8694 8432 8194 7978 7777 7581 7396 7230 7081 6949 6835 6742 6660 6577
743 6577 6500 6440 6395 6349 6291 6220 6138 6044 5944 5852 5772 5696 5618 5550 5503 5473 5444 5402 5343 5274 5213 5169 5132 5079 5003 4909 4805 4696 4591 4498 4413 4327 4247
739 4247 4194 4168 4145 4109 4071 4038 3996 3928 3854 3806 3787 3769 3736 3699 3673 3659 3641 3611 3568 3523 3482 3449 3423 3400 3383 3370 3354 3331 3312 3316 3342 3368 3370 3341 3295 3251
735 3251 3217 3188 3153 3109 3065 3035 3021 3016 3005 2978 2935 2887 2850 2834 2842 2871 2914 2958 2988 3000 3008 3031 3076 3142 3222 3304 3366 3393 3388 3362 3319 3261 3198 3150 3122 3112 3113
730 3113 3120 3123 3112 3080 3033 2979 2932 2908 2921 2957 2982 2970 2922 2862 2811 2777 2761 2751 2734 2705 2674 2654 2652 2662 2676 2697 2731 2775 2818 2850 2863 2860 2848 2839 2843 2859 2874 2882
726 2882 2885 2889 2886 2863 2821 2778 2752 2737 2717 2683 2641 2607 2592 2598 2617 2636 2650 2662 2670 2660 2633 2606 2594 2594 2596 2604 2631 2673 2707 2716 2700 2672 2651 2654 2681 2706 2701 2667 2631 2611
721 2611 2603 2593 2575 2546 2506 2462 2428 2404 2382 2358 2346 2358 2383 2401 2409 2415 2422 2424 2418 2410 2404 2405 2412 2422 2429 2426 2414 2398 2386 2376 2362 2344 2324 2307 2290 2271 2252 2246 2254 2261 2255 2245 2250
716 2250 2274 2304 2327 2345 2364 2382 2397 2410 2423 2431 2428 2412 2385 2348 2311 2286 2278 2275 2259 2228 2195 2170 2158 2159 2169 2184 2197 2202 2195 2182 2183 2208 2240 2250 2230 2199 2177 2162 2144
711B144k0j1nj0j5j0lJMJ1J6J2lk7n2o5m8j5Nmk4l0j9pJPJ5K5L6M2L3Qj4j6jJ6K4K3Rj5l4
706A984l6k9k9l0j8QK8L0K3K0J7OmkJ0J7J3PJ0J3OkJJ3J3lk1k1j3j6k2j5PJ9PnLK2K4Poo%
701B030KlnlKKpk1k2j0jmrlRQJNJ0Kk0k9j6LRPJ0J1Kj5k0oJ5K3J0j2k2j1J2K1J6RM%jJ3L4
695B030M2K8Omlln%J1J6J6J3J0QJ1J4Oj3k3j0K0M0M0L5M0M8M9M3M5O3Q7J06J16J19J26J33
690C260J35J25J19J29J48J58J54J34R3K3o7j43j81j91j96k02j95j70j37j08q8p9p9p4o0m5
687B463m6o1o2l8j2j0k4k6j2K%pj2k3l4k7OL4K4j6m8m9k8mJ3J5Jj7k1j5j9m1o0n1k2KPJlp
682A773lRK0J7KlJ3L1L3J5oj3pnj4l4n0m7k6rj5l0k3J3M8M8J5pjJ6J1pqJ4L0K1lj5rKPQOJ
677A818rk1l1l2k1jJ6J6NjOQKnjJ0J3Mnroj0j3j2jK0L9M4L1Oj3j8k3l9n3m9k4kJqj2kJ1J6
$$ plain form
711 2144 2124 2113 2108 2098 2083 2073 2070 2071 2075 2086 2102 2114 2111 2084 2032 1967 1919 1904 1909 1905 1881 1851 1832 1825 1826 1833 1848 1873 1909 1951 1984 1992 1978 1962 1961 1977 2001 2024 2033 2018 1984
706 1984 1948 1919 1890 1860 1842 1850 1878 1908 1931 1951 1968 1974 1970 1968 1978 1995 2008 2015 2025 2038 2044 2042 2043 2056 2069 2066 2045 2024 2011 1995 1973 1958 1965 1984 1991 1986 1989 2011 2035 2042 2036 2030 2030
701 2030 2032 2029 2024 2021 2023 2025 2018 1997 1975 1965 1964 1960 1951 1948 1957 1965 1966 1971 1981 1983 1963 1934 1918 1921 1930 1937 1947 1958 1960 1945 1925 1919 1934 1957 1967 1955 1933 1922 1934 1955 1971 1980 1984 1984 1983 1996 2030
695 2030 2072 2100 2106 2102 2099 2096 2091 2091 2102 2118 2134 2147 2157 2165 2176 2190 2196 2183 2160 2150 2170 2210 2250 2285 2325 2373 2422 2465 2510 2573 2660 2766 2882 3001 3127 3260
690 3260 3395 3520 3639 3768 3916 4074 4228 4362 4455 4478 4411 4268 4087 3896 3700 3498 3303 3133 2996 2888 2800 2721 2642 2568 2508 2463
687 2463 2417 2356 2294 2256 2244 2234 2210 2184 2172 2174 2174 2167 2155 2132 2098 2071 2077 2111 2135 2119 2071 2022 1994 1990 2003 2018 2019 2002 1981 1966 1947 1906 1846 1795 1773 1775 1782 1783 1780 1773
682 1773 1770 1779 1799 1816 1818 1815 1828 1859 1892 1907 1901 1888 1881 1876 1862 1828 1778 1731 1705 1696 1681 1651 1628 1641 1689 1737 1752 1745 1744 1760 1771 1764 1756 1770 1800 1821 1818 1803 1794 1796 1803 1811 1817 1818
677 1818 1809 1788 1757 1725 1704 1703 1719 1735 1740 1739 1745 1753 1755 1750 1749 1759 1772 1776 1771 1762 1756 1746 1733 1721 1720 1740 1779 1823 1854 1860 1847 1829 1806 1767 1714 1665 1641 1639 1640 1632 1620 1618 1629 1645
672A645Qpj5mK1L7K7Pmnj2k3k2%K6L2J8Kpj0rkPJ4K0K5K5J0j7m4n4m2k0kjrj2pLRPlj6k1j2
666A563PJ7J3Koj2j9j7qjrk1k2oQJ3J2J2J3J3J7K6K9K0%j7j9j1j%mo%QJ2Rql1m1j9J8L8K7
661A599Nnj3k4l2k0oqk2j6J1L6L7K1QJ%OJ2RPJ3K4J9mk3k2j3rj1j3j2r%J6K6J7nk0k6k9k6
656A499j7j0rj4j0KJ3K1K1J3KJJ2K5K4J4QJ3J8J7J0jj4k0j9j2rpkMML%lj8l5l8k1MK4K8J5
651A536nk0k3j7pNJ5Qk2n5o6m9j8OJ3Kj1qJ6M6N5M3K3Npj0jOnk1k1JJ6J2%JPJ2J5J9J2j5l9
645A454l4jL4M3L2J4MKQJ4J4%k5m5l8%L6L7Qj6j1PJ6J9K4K0qm6o4n4l2j3JJ0J3J5K3K9K1M
640A515JJ1J5J3J5K5K6J1JJ4L6M0K6J2Olk1l2k6j5j3k4l7l9l6k7j4jOMjPK2L2K6Oj4k9l3k8
636A477k1j3rkJ1K8M1M6L5J0j8k4pJ1J3JKJ7K9K6J4J2K1L7M8N2N1N0N1N4N0L6J2j5l7m5m6
$$ plain form
672 1645 1653 1646 1631 1627 1648 1685 1712 1719 1715 1710 1698 1675 1653 1653 1679 1711 1729 1731 1724 1714 1705 1703 1710 1724 1744 1769 1794 1804 1787 1743 1689 1647 1627 1625 1624 1615 1603 1596 1599 1608 1615 1612 1596 1575 1563
666 1563 1570 1587 1600 1602 1596 1584 1565 1548 1540 1539 1530 1509 1487 1481 1489 1502 1514 1526 1539 1552 1569 1595 1624 1644 1644 1627 1608 1597 1596 1596 1592 1586 1586 1594 1606 1615 1607 1576 1535 1516 1534 1572 1599
661 1599 1604 1599 1586 1562 1530 1510 1504 1496 1474 1458 1469 1505 1542 1563 1571 1572 1572 1578 1590 1599 1606 1619 1643 1662 1658 1635 1613 1600 1591 1580 1567 1555 1546 1546 1562 1588 1605 1600 1580 1554 1525 1499
656 1499 1482 1472 1463 1449 1439 1441 1454 1475 1496 1509 1511 1512 1524 1549 1573 1587 1595 1608 1626 1643 1653 1652 1638 1618 1599 1587 1578 1571 1569 1573 1577 1580 1580 1577 1559 1524 1486 1465 1469 1493 1521 1536
651 1536 1531 1511 1488 1471 1464 1469 1484 1492 1470 1415 1349 1300 1282 1288 1301 1303 1292 1284 1300 1346 1401 1444 1467 1472 1465 1455 1454 1460 1455 1434 1413 1414 1430 1442 1442 1443 1450 1462 1477 1496 1508 1493 1454
645 1454 1420 1419 1453 1496 1528 1542 1546 1548 1556 1570 1584 1584 1559 1514 1476 1476 1512 1549 1557 1541 1530 1537 1553 1572 1596 1616 1608 1562 1498 1444 1412 1399 1400 1410 1423 1438 1461 1490 1511 1515
640 1515 1516 1527 1542 1555 1570 1595 1621 1632 1633 1647 1683 1723 1749 1761 1767 1764 1743 1711 1685 1670 1657 1633 1596 1557 1521 1494 1480 1479 1485 1489 1488 1495 1517 1549 1575 1581 1567 1538 1505 1477
636 1477 1456 1443 1434 1432 1443 1471 1512 1558 1593 1603 1585 1561 1554 1565 1578 1579 1581 1598 1627 1653 1667 1679 1700 1737 1785 1837 1888 1938 1989 2043 2093 2129 2141 2126 2089 2044 1998
631A998m3m2l2k0k1m1o4o1l5pJmj2j2mJ2K7K9J9jj8l0k5nJ2J1JMJ6J3j3k8j9nj1j9%L2M2J8
626A663nlOLn%J3K3K6K8K7J6Nkok2m3n3m1k5j9k9l8l3j4J4L7M0J4k6m9m4k2oLJ0J1LkRL0K9
621A523kk8j9J5L4K9J2PPMlrj7k1j6JJ3J2RJ1J6J4Jj5k7l1l0k7k7k5pK5M8M5J9pj0OK5L5K5
616A615Lk0k8k4k0k4l3l2j7J3L8M6L1Qoj4k7m4n1l8k0ojjoj7j9%L2N6N3L0Lj6k7k4j0PJ1K
611A423pnJJJOJ2J2lk2l2k9k1j4j8k8k8j1RJ8J8K2L2L5K8K5L1L0Qk2l3k0njjPJ6J8Mj3k5j9
606A400jJ1J0QJ3J8Qqj0MJ0nk7l2l0l2l4k2NL1M3M2K6Kj5j4rj8l1k7%K0J0j2k3k3k6l4l5k6
601A167j5qjRK0L1M1M4L7K7K2J9J1mj4j6j6j5oRK2K6K4K5K1Qkllpj0jMnk1k5j8j3j2kJ3J7
596A380J1RJ7J9QKM%k4l9k2J1K1%k0j0J7L0K2LqmPJ3QLOJ3J6J2J4J1jj3oJ7K6J6QJ4K0J1k
$$ plain form
631 1998 1955 1913 1881 1861 1840 1799 1735 1674 1639 1632 1633 1629 1617 1605 1601 1613 1640 1669 1688 1687 1669 1639 1614 1609 1621 1632 1633 1637 1653 1666 1653 1625 1606 1601 1590 1571 1571 1603 1645 1663
626 1663 1658 1655 1661 1664 1659 1659 1672 1695 1721 1749 1776 1792 1797 1795 1789 1767 1724 1671 1630 1605 1586 1557 1519 1486 1472 1486 1523 1563 1577 1551 1502 1458 1436 1430 1433 1443 1454 1457 1455 1464 1494 1523
621 1523 1521 1493 1474 1489 1523 1552 1564 1571 1578 1582 1579 1570 1553 1532 1516 1517 1530 1542 1551 1562 1578 1592 1593 1578 1551 1520 1490 1463 1436 1411 1404 1429 1477 1522 1541 1534 1524 1530 1555 1590 1615
616 1615 1618 1598 1570 1546 1526 1502 1469 1437 1420 1433 1471 1517 1548 1556 1550 1536 1509 1465 1414 1376 1356 1350 1349 1348 1342 1325 1306 1306 1338 1394 1447 1477 1480 1464 1437 1413 1403 1410 1421 1423
611 1423 1416 1411 1412 1413 1414 1420 1432 1444 1441 1419 1387 1358 1337 1323 1305 1277 1249 1238 1247 1265 1283 1305 1337 1372 1400 1425 1456 1486 1494 1472 1439 1419 1414 1413 1412 1419 1435 1453 1457 1444 1419 1400
606 1400 1399 1410 1420 1428 1441 1459 1467 1459 1449 1453 1463 1458 1431 1399 1369 1337 1303 1281 1286 1317 1360 1402 1428 1430 1415 1401 1392 1374 1343 1316 1316 1336 1346 1334 1311 1288 1262 1228 1193 1167
601 1167 1152 1144 1143 1152 1172 1203 1244 1288 1325 1352 1374 1393 1404 1400 1386 1370 1354 1339 1333 1342 1364 1390 1414 1439 1460 1468 1466 1463 1460 1453 1443 1442 1446 1441 1420 1395 1377 1364 1352 1350 1363 1380
596 1380 1391 1400 1417 1436 1444 1446 1450 1450 1426 1387 1365 1376 1397 1397 1377 1367 1384 1414 1436 1439 1431 1427 1434 1447 1455 1458 1464 1477 1493 1505 1519 1530 1529 1516 1510 1527 1553 1569 1577 1591 1611 1622 1620
591A620MK4L7L8M8O6P0N0J8jjJ5L4M4L7K4J3J0Noj9l0l3l5l5l1k0lMrl1l6j8kjoOK4K8K3K0
586A945K2J0ppJ7M1M9M7M3L3J9J2J2Jj7k1QM5O2O3O6P1O8N9N3M7L6L4N5Q7J02R6Q9R6J06J07
581C549J12J36J70J95K10K20K33K45K58K71K89L03L12L20L30L48L70L86M00M27M79N55O35
578A0753P09P76Q41R21J034J189J383J610J873K194K579L006L440L864M283M695N049N240
576E5439N130M593L516J852k81k532m432n622o036n841n279m542l777l079k484j984j577j266
574B1798j024q08o02m36l25k44j67j03o2k3M4J30K06K59K97L40L94M71N59O42P26Q36R87J160
571B5055J342J544J787K067K391K794L306L930M650N466O369P310Q251R175J0034J0664J0805
569A16940J0159Q417N323R37m098q683j1815j3131j2922j1764j0178q517o992n696m628l762
$$ plain form
591 1620 1624 1648 1685 1723 1771 1837 1907 1957 1975 1974 1973 1988 2022 2066 2103 2127 2140 2150 2155 2149 2130 2100 2067 2032 1997 1966 1946 1943 1947 1938 1907 1871 1853 1851 1850 1844 1850 1874 1902 1925 1945
586 1945 1967 1977 1970 1963 1980 2021 2070 2117 2160 2193 2212 2224 2236 2237 2220 2199 2207 2252 2314 2377 2443 2514 2582 2641 2694 2741 2777 2811 2866 2953 3055 3151 3240 3336 3442 3549
581 3549 3661 3797 3967 4162 4372 4592 4825 5070 5328 5599 5888 6191 6503 6823 7153 7501 7871 8257 8657 9084 9563 10118 10753
578 10753 11462 12238 13079 14000 15034 16223 17606 19216 21089 23283 25862 28868 32308 36172 40455 45150 50199 55439
576 55439 60569 65162 68678 70530 70249 67717 63285 57663 51627 45786 40507 35965 32188 29109 26625 24641 23064 21798
574 21798 20774 19966 19364 18928 18603 18359 18192 18089 18027 18004 18048 18178 18384 18643 18940 19280 19674 20145 20704 21346 22072 22908 23895 25055
571 25055 26397 27941 29728 31795 34186 36980 40286 44216 48866 54332 60701 68011 76262 85437 95471 106135 116940
569 116940 127099 135516 140839 141776 137678 128995 117180 104049 91127 79363 69185 60668 53676 47980 43352 39590
567C9590l075k534k102j762j508j318j156j008q87p97p20o47n86n43m88l99l00k25j81j33
565A9221n7L4J14J83K69L87N30O74Q18R79J175J404J673J998K387K807L219L619M034M440
562D9908M745M832M593L915K676Q52j344l492n146o066o264n921n265m498l756l104k559k116
560B1990j766j492j269j080r27q17p43o83o26n76n42n17m92m63m32l92l46k97k54k27k18k23
557G608k29k15j85j63j72k01k17k07j81j56j34j10r4q9r1r3r6j02j07j11j12j15j11j01q6
554D130p7p1o7o7p8r6j02q0m3j6j8l0l3k0j4k8n4o6n8m0k5j6qJJ5L1L8K8J0JNRjk1l3l2k3
550C051nQLk4m5m2k5k4m1n1m0k6l2m6l9j0J8K5J7J0NMPK1L9M1J9pj3QK7K4RRK0J6j3m0m1k7
545B790k3k5rK1L6K0mj6k0l0l0oL1N1M6L4K2ll7n2l4KK2J2pk4l0k9j7jJ9M3O4O9N5L0J3PR
$$ plain form
567 39590 36515 33981 31879 30117 28609 27291 26135 25127 24240 23443 22723 22076 21490 20947 20459 20060 19760 19535 19354 19221
565 19221 19164 19198 19312 19495 19764 20151 20681 21355 22173 23152 24327 25731 27404 29402 31789 34596 37815 41434 45468 49908
562 49908 54653 59485 64078 67993 70669 71521 70177 66685 61539 55473 49209 43288 38023 33525 29769 26665 24106 21990
560 21990 20224 18732 17463 16383 15456 14639 13896 13213 12587 12011 11469 10952 10460 9997 9565 9173 8827 8530 8276 8049 7831 7608
557 7608 7379 7164 6979 6816 6644 6443 6226 6019 5838 5682 5548 5438 5344 5255 5164 5071 4975 4873 4766 4655 4543 4428 4317 4216 4130
554 4130 4053 3982 3915 3848 3770 3674 3572 3492 3449 3433 3415 3385 3352 3332 3318 3290 3236 3170 3112 3072 3047 3031 3023 3024 3039 3070 3108 3136 3146 3147 3152 3161 3160 3139 3106 3074 3051
550 3051 3046 3054 3057 3033 2988 2946 2921 2897 2856 2805 2765 2739 2707 2661 2622 2612 2630 2655 2672 2682 2687 2691 2698 2719 2758 2799 2818 2811 2798 2806 2833 2857 2866 2875 2895 2911 2898 2858 2817 2790
545 2790 2767 2742 2733 2754 2790 2810 2806 2790 2770 2740 2710 2704 2735 2786 2832 2866 2888 2885 2848 2796 2762 2764 2786 2798 2791 2767 2737 2708 2691 2690 2709 2752 2816 2885 2940 2970 2983 2990 2999
540B999J9L8N8O6N6L5J2%NK6M4L7J1qj5l1o2q3o8l7j4nQJ8Pk3m2k3J8M4M0J5j4l1l1j7OK0
535C078K0PlmQJ9K3K5K7K6K7L5N4O7N9L5J6J2J3PKPK2L7M3M5M4L8L2K9L2L8L8K9J8J1J4J7
531D047J1%%J1K6L5N0P0Q5Q2O6O2P6R9J08J04R6R5R4Q5P7P8Q6Q7P6O7P3Q8R4R4J01J09J05
527F437Q7P6Q6R9Q9N9L9M1N7P6R7J19J34J38J36J35J29J17J03R7R2Q3O8N8N7O6P8Q5Q4P1N0
523I143L2K6L0L7L3K8K5K1jm0q1j14j49j93k44k89l22l45l59l58l49l38l20k88k53k27k17
520D888k04j71j29j01j00j10j11r6p4n4l8l1l4n0o8p1n6l9l9n4o8p0o0m8l4j9rj1k1l5m7m9
516B787l8k5k5m0m8l7k1j8l1m0m1m5n2n2l7k7k6k4lK6L8L3K7K5J3j1k8k0KJ4J2J2J5J1qk9
511B289m8o6q3q4n9k1OJ1jj5k0j4lPJ5K3K6J4j1l7m0k7j0jNJor%Nrk2qK7M5K8Jnjok1k1j5
$$ plain form
540 2999 3018 3056 3114 3180 3236 3271 3283 3283 3288 3314 3358 3395 3406 3398 3383 3352 3290 3207 3139 3102 3088 3083 3091 3109 3116 3093 3051 3028 3046 3090 3130 3145 3131 3100 3069 3052 3058 3078
535 3078 3098 3105 3102 3098 3106 3125 3148 3173 3200 3226 3253 3288 3342 3409 3468 3503 3519 3531 3544 3551 3553 3560 3582 3619 3662 3707 3751 3789 3821 3850 3882 3920 3958 3987 4005 4016 4030 4047
531 4047 4058 4058 4058 4069 4095 4130 4180 4250 4335 4417 4483 4545 4621 4720 4828 4932 5028 5123 5217 5302 5379 5457 5543 5630 5706 5773 5846 5934 6028 6122 6223 6332 6437
527 6437 6524 6600 6686 6785 6874 6933 6972 7013 7070 7146 7243 7362 7496 7634 7770 7905 8034 8151 8254 8351 8443 8526 8594 8652 8709 8775 8853 8938 9022 9093 9143
523 9143 9175 9201 9231 9268 9301 9329 9354 9375 9374 9334 9253 9139 8990 8797 8553 8264 7942 7597 7238 6880 6531 6193 5873 5585 5332 5105 4888
520 4888 4684 4513 4384 4283 4183 4073 3962 3866 3792 3738 3700 3669 3635 3585 3517 3446 3390 3351 3312 3258 3190 3120 3060 3012 2978 2959 2950 2939 2918 2883 2836 2787
516 2787 2749 2724 2699 2659 2611 2574 2553 2535 2504 2464 2423 2378 2326 2274 2237 2210 2184 2160 2157 2183 2221 2254 2281 2306 2319 2308 2280 2260 2262 2276 2288 2300 2315 2326 2318 2289
511 2289 2241 2175 2092 2008 1949 1928 1934 1945 1944 1929 1909 1895 1892 1899 1914 1937 1963 1977 1966 1929 1889 1862 1852 1851 1856 1857 1851 1842 1842 1847 1838 1816 1808 1835 1880 1908 1909 1904 1903 1897 1876 1855 1840
506A840k0l4l0%L6O1P6Q6Q3O5M9M6M0J4k9o5q1p8o7n3m1l6l2k7k8l9n1n0l7j9j1j0j8l3m6
502A461m1j2K3M4M8L8J7j2l9m6k5MK3K4J8J3RQPNmrlJ2J6NjJ5M0M5J6j7j6K4P1R1P0K4j9l7
497A890l0j4oqk1l7n6o8o4m4j9%J2J3Nj4l2m3l9k5r%kj0rJ1L1L2Pk4l7k4JK2K4Pj4k3j9j7
492A347l2n0m2j1J1PrlK2L6J6j6k4JK7K7Kk3k9k4j5oMLj0j8pJ6K8J7%pj2j9k3j2MJ0M%%JL
487A194J3K8L2K1Mmrj6k3k5j8mPJ1Jj3k3j9rLJ0Mj2k2j3LPOJ4M1N7M5J2j4j9rLKj5l7m0k0
482A154NJ3J1J8L0L2K2J2J0Lnj0kRK1L0K7Jk8k7KK3J2j7l0k1j3j6k1k1k0k2k7k2j0OJ4Rmj4
477A134rMJ4Qpj9j0J1K3Qk2l6k2NK0J8J3J7K8L7L7K4Jj4j6qkkoj1j2pLRJ0RJ5K4K3Rj4l0l6
472A221k7j3jKJKMNKLRJ7K1J5jj9k6k2j5j0lQJ7K4K4J6Kp%J5K2J2qj9j9j3nKMkpj0pnmlmm
$$ plain form
506 1840 1820 1786 1756 1756 1792 1853 1929 2015 2098 2163 2212 2258 2298 2312 2283 2218 2137 2059 1992 1939 1898 1862 1830 1803 1775 1736 1685 1635 1598 1579 1568 1558 1540 1507 1461
502 1461 1420 1408 1431 1475 1523 1561 1578 1566 1527 1481 1456 1460 1483 1507 1525 1538 1547 1555 1562 1567 1563 1554 1551 1563 1579 1584 1583 1598 1638 1683 1699 1682 1666 1690 1761 1852 1922 1946 1927 1890
497 1890 1860 1846 1840 1832 1811 1774 1718 1650 1586 1542 1523 1523 1535 1548 1553 1539 1507 1464 1425 1400 1391 1391 1389 1379 1370 1381 1412 1444 1451 1427 1390 1366 1367 1389 1413 1420 1406 1383 1364 1347
492 1347 1315 1265 1223 1212 1223 1230 1221 1218 1240 1276 1292 1276 1252 1253 1280 1307 1309 1286 1257 1233 1218 1212 1216 1219 1209 1191 1184 1200 1228 1245 1245 1238 1226 1207 1184 1172 1176 1186 1190 1190 1190 1191 1194
487 1194 1207 1235 1267 1288 1292 1288 1279 1263 1240 1215 1197 1193 1200 1211 1212 1199 1176 1157 1148 1151 1161 1165 1153 1131 1118 1121 1128 1134 1148 1189 1246 1291 1303 1289 1270 1261 1264 1266 1251 1214 1174 1154
482 1154 1159 1172 1183 1201 1231 1263 1285 1297 1307 1310 1305 1295 1293 1302 1323 1353 1380 1381 1353 1326 1328 1351 1363 1346 1316 1295 1282 1266 1245 1224 1204 1182 1155 1133 1123 1129 1143 1152 1148 1134
477 1134 1125 1129 1143 1151 1144 1125 1115 1126 1149 1157 1135 1099 1077 1082 1102 1120 1133 1150 1178 1215 1252 1276 1277 1263 1247 1239 1237 1235 1229 1218 1206 1199 1202 1211 1221 1230 1245 1269 1292 1301 1287 1257 1221
472 1221 1194 1181 1180 1182 1183 1185 1189 1194 1196 1199 1208 1225 1246 1261 1260 1241 1215 1193 1178 1168 1165 1173 1190 1214 1238 1254 1256 1249 1249 1264 1286 1298 1290 1271 1252 1239 1234 1236 1240 1238 1231 1221 1214 1209 1205 1202 1198 1194
466A194j%oj1mJ6L2K8J1ok5l6l0mJ6Pj9k9j6l%JJ0J7J4OjmjJ4L0K7Qrj2j2j3rMJ2NnlMKlj
460A195OPKMJ2J5Pnj5k5l4l4k4j3omj0k4l4k6oPQJ4L3N2M2Nl1m3k6%J3J1KjLkj2j8mJ8L1K8
455A118K0K1K5K0%k4m0m5l9k0J3M7O0L8Nj2j0loj0j2j0j4j7j5oNJ6J7QnjK0L9L0kk5j8OJ4
450A188lk4k5nPmj9j7kJ2J5Rmk4l9l5rJ1Roj4nJ5L7M5K8kj2QL1K8Lj4j4j2k1k3j3KMjkJJm
444A101lQJ6J2Jj0j5j4pMJ6K6K3J1oj4j0%OOjj1j6qRK4K1RjjQJ4J0kk4n0o3n1k1OJ8J9J9J9
439A078Qj3k3j1J6L7M0L2J6ol1m4l2j0kj7k7j0K0K6Jk4k8j8j4j3kK1L5K9J2JnpLJ6K4J9J1
434A108QOlpNJ8J5mj7j6%J6L0L4K0pl2l7k4nJ3K1J8J0jj1k0k3j2KQJj0j7k1k6k5j7mOQOKL
429A019J0J3Kj2j2J0K6J9lj6j2%PQLoj4qRK3K5J8RLmj1j7j2KJ4J2kj1j1qj1rLJ9K6K7L1L1
$$ plain form
466 1194 1193 1193 1187 1176 1172 1188 1220 1248 1259 1253 1228 1192 1162 1158 1174 1181 1162 1133 1117 1114 1114 1115 1125 1142 1156 1162 1161 1157 1156 1170 1200 1227 1235 1226 1214 1202 1189 1180 1184 1196 1201 1196 1193 1197 1199 1196 1195
460 1195 1201 1208 1210 1214 1226 1241 1248 1243 1228 1203 1169 1135 1111 1098 1092 1088 1078 1054 1020 994 988 995 1003 1017 1050 1102 1144 1149 1118 1075 1049 1049 1062 1073 1075 1074 1077 1075 1063 1045 1041 1059 1090 1118
455 1118 1138 1159 1184 1204 1204 1180 1140 1095 1056 1036 1049 1096 1156 1194 1199 1187 1177 1174 1168 1158 1146 1136 1122 1105 1090 1084 1089 1105 1122 1130 1125 1124 1144 1183 1213 1211 1186 1168 1174 1188
450 1188 1185 1161 1136 1131 1138 1134 1115 1098 1096 1108 1123 1132 1128 1104 1065 1030 1021 1032 1041 1035 1021 1016 1031 1068 1113 1141 1139 1127 1135 1166 1194 1197 1183 1169 1157 1136 1113 1100 1102 1106 1105 1103 1104 1105 1101
444 1101 1098 1106 1122 1134 1135 1125 1110 1096 1089 1093 1109 1135 1158 1169 1163 1149 1139 1139 1145 1151 1150 1139 1123 1115 1124 1148 1169 1178 1177 1176 1184 1198 1208 1206 1182 1132 1069 1018 997 1003 1021 1040 1059 1078
439 1078 1086 1073 1050 1039 1055 1092 1132 1164 1180 1174 1143 1099 1067 1057 1055 1038 1011 1001 1021 1047 1048 1024 996 978 964 951 949 970 1005 1034 1046 1047 1042 1035 1038 1054 1078 1097 1108
434 1108 1116 1122 1119 1112 1117 1135 1150 1146 1129 1113 1113 1129 1159 1193 1213 1206 1174 1137 1113 1108 1121 1142 1160 1170 1169 1158 1138 1115 1103 1105 1113 1114 1104 1087 1066 1040 1015 998 994 1000 1008 1014 1016 1019
429 1019 1029 1042 1044 1032 1020 1030 1056 1075 1072 1056 1044 1044 1051 1059 1062 1056 1042 1034 1043 1066 1091 1109 1118 1121 1117 1106 1089 1077 1079 1093 1105 1103 1092 1081 1073 1062 1053 1056 1075 1101 1128 1159 1190
423A190J7ok1k7l4m2l5rJ1QmkPMj2j6lJ4J0lqOK2K6J7QONnj8k5k1j5j7k4l3l7k9j0J1J4Jr
418I12KK8M6M4K3kk2k6rJ5K9K3J1RJ2J9K1J5Pkqj2j6j6j4j2j6j5JK8M3L7K1RPPKj4l0l4k4
413A099j8k5l2j6J9M1L4J7RJ0%j7k6k0j0mnjJ2K9K6pm5m4jL4K7lj2OK0J6LnrnRK4J4j7l9k8
408A060lJ5K0K8L8L3Pk1k8qJ7K7K2J6Rpk9l0nJ6%m1o0l9rNJ2K3K8J5jkKkoJJ1Mrj2jOJ1J4
403A127Rj8m4m4j6RJ6J5J4Ooj1m%oj1lJ2K1K9L3K7Mj3j4qj0k0k5j6oJLOJ2K6L6L1Pj7l2m2
397A078m5l4j2QJ4K0L1L6K4Okoj3j8qJ1K2K2K1K3K1Oj4l3l5j9NQj5l9l2lJ4J3J0J8K5J9J1
393A138PJrj2qqj8k4j7oomRK0J1j4k9k9k6k2rJ0K6L1L1L1K3Nrj3j2k0l2l4j5J9N2O2M7J6r
388A154j5j2rj3j0lkj4k5k1jJ8K4K1J1JKK3M9N2L2J2J0J3Kj4j7j1j3k2j8JJ6J7J7K1K1QkJ
$$ plain form
423 1190 1207 1201 1180 1153 1119 1077 1042 1033 1044 1052 1048 1046 1053 1057 1045 1029 1026 1040 1050 1047 1039 1045 1067 1093 1110 1118 1124 1129 1124 1106 1081 1060 1045 1028 1004 971 934 905 895 906 920 921 912
418 912 914 942 988 1032 1055 1053 1031 1005 996 1011 1040 1063 1074 1083 1095 1114 1135 1150 1157 1155 1147 1135 1119 1103 1089 1077 1061 1046 1047 1075 1118 1155 1176 1185 1192 1199 1201 1187 1157 1123 1099
413 1099 1081 1056 1024 1008 1027 1068 1102 1119 1128 1138 1138 1121 1095 1075 1065 1061 1056 1055 1067 1096 1122 1115 1070 1026 1025 1059 1086 1083 1071 1077 1097 1113 1116 1111 1102 1097 1106 1130 1144 1127 1088 1060
408 1060 1057 1072 1092 1120 1158 1191 1198 1177 1149 1141 1158 1185 1207 1223 1232 1225 1196 1166 1161 1177 1177 1136 1076 1037 1028 1033 1045 1068 1096 1111 1110 1108 1110 1108 1102 1103 1114 1118 1109 1097 1096 1102 1113 1127
403 1127 1136 1118 1074 1030 1014 1023 1039 1054 1068 1074 1068 1057 1053 1053 1047 1036 1033 1045 1066 1095 1128 1155 1159 1146 1132 1124 1114 1094 1069 1053 1047 1048 1051 1057 1069 1095 1131 1162 1169 1152 1120 1078
397 1078 1033 999 987 995 1009 1029 1060 1096 1120 1126 1124 1118 1105 1087 1079 1090 1112 1134 1155 1178 1199 1205 1191 1158 1123 1104 1109 1117 1102 1063 1031 1028 1042 1055 1065 1083 1108 1127 1138
393 1138 1145 1146 1137 1125 1117 1109 1091 1067 1050 1044 1038 1034 1043 1063 1074 1060 1031 1002 976 954 945 955 981 1012 1043 1074 1097 1102 1093 1080 1068 1048 1016 982 967 986 1038 1100 1147 1163 1154
388 1154 1139 1127 1118 1105 1095 1092 1090 1076 1051 1030 1029 1047 1071 1092 1103 1104 1106 1129 1178 1230 1262 1274 1284 1297 1299 1285 1268 1257 1244 1222 1204 1205 1221 1238 1255 1276 1297 1305 1303 1304
383A304OJrj0LJ8L0L9L8K6RKOJ6K8L5L6L5M4N1L8QrML1M5M9N6O4O0N1N0N5N9O6Q9J12J21J24
378B781J45J78J93J74J40J05O4J6k3m3n3n7m7k8j8k9m0m1m0m4m3k6oLKkj3k9l3k2j1j5j4P
374C131L5M3L6L4M5N0M8M6M9N5O7Q6J01J01J02J28J75K15K40K64K97L26L38L43L39L21K75
371G290J93O5j09k90m14m50m30l92l56l17k85k61k36j94j46j18j12j07r0n8k3%nl1n5n1l2
367B986j8j7k1k4l0l2k7k1k9l7k6MK8L1J9J3J3K8N7Q9J07J06J07J20J30J24J10J01R1O3K2
363D067j9n4r4j38j71j88j91j85j70j57j56j53j25p3l0k1l6n3o2o3n4l0pjnnMLj4l2m3m6n0
359A648n2m1j8MJ4J4QJj0k3l5m0l7k8j5%J3K0K2K3J6ql5m2j7J0Pk1l2j6Njk3l0k1j7k9l8k2
355A154J1L3L1J3%JRJ2J1QO%j6k7k5j5j1j2j3poj0rQK6L0K1Kj8l4l8k1OJ8QnpnprNK8L5K2
$$ plain form
383 1304 1310 1311 1302 1292 1295 1313 1343 1382 1420 1446 1455 1457 1463 1479 1507 1542 1578 1613 1657 1708 1746 1754 1745 1749 1780 1825 1874 1930 1994 2054 2105 2155 2210 2269 2335 2424 2536 2657 2781
378 2781 2926 3104 3297 3471 3611 3716 3780 3796 3773 3730 3677 3620 3573 3545 3527 3498 3458 3417 3377 3333 3290 3264 3258 3261 3263 3261 3248 3219 3186 3164 3153 3138 3124 3131
374 3131 3166 3209 3245 3279 3324 3374 3422 3468 3517 3572 3639 3725 3826 3927 4029 4157 4332 4547 4787 5051 5348 5674 6012 6355 6694 7015 7290
371 7290 7483 7548 7439 7149 6735 6285 5855 5463 5107 4790 4505 4244 4008 3814 3668 3550 3438 3331 3241 3183 3160 3160 3155 3124 3069 3018 2986
367 2986 2968 2951 2930 2906 2876 2844 2817 2796 2767 2730 2704 2708 2736 2767 2786 2799 2812 2840 2897 2986 3093 3199 3306 3426 3556 3680 3790 3891 3982 4045 4067
363 4067 4048 3994 3900 3762 3591 3403 3212 3027 2857 2700 2544 2391 2266 2193 2163 2142 2106 2053 1991 1928 1874 1844 1837 1836 1831 1826 1830 1833 1819 1787 1744 1698 1648
359 1648 1596 1555 1537 1541 1555 1569 1577 1578 1568 1545 1510 1470 1433 1405 1390 1390 1403 1423 1445 1468 1484 1476 1441 1399 1382 1392 1399 1378 1346 1330 1335 1334 1311 1281 1260 1243 1214 1176 1154
355 1154 1165 1198 1229 1242 1242 1243 1252 1264 1275 1283 1289 1289 1273 1246 1221 1206 1195 1183 1170 1163 1157 1147 1138 1146 1172 1202 1223 1225 1207 1173 1135 1114 1120 1138 1146 1141 1134 1129 1122 1113 1118 1146 1181 1203
349A203Mnj3l1l6j7J2J4rk3j2PNpj1JJ4J6Ooj6j1OJ6Kk1k8j2QJ4P%klmnomMJ1Pnj1mRJ7J4
344A095Lj3k4k4j8j1j5k1k5k2j0J2L0K9J2l%J1Oj0j9rjqk4k5lK7L8L0J6Pjj4j9oJ4J7Mp%Q
338A027J0J0K1K8K1RQJ1ml1l7j8MQ%mqj6k1j2KPNPK0K9L0K2J2jj7k5k3j9j4j3qKJ2J3Mrj6
333A026j4mPJ9K5K2Rmj6k9m3m4k6lJj5k8j7OK1J8Onj5j9j9j1MJ7K7L7M6M4K9Oonlqj8j9rM
328I94RJ2J4J5Nj1k4k1nJ1K0J6J0QQQOjj0k6l2j4K3M9M5J7mrj3l0m2l0jJ8J9J8K2K0Mj3j4
323A071njnolnj2j1MJ7J3%okKrk3l0j8PK3K2Orj4j3j2oLNmj7j9j2pqmJ3L3M0K4Jj2j2pj1j7
317I64j7kJ7L1K7Pj3j4LK5L0K4J8J8J4Mklj2k8l2j3RJ3KLK0K6%l7n3l7nK3L6L0Rj9l3k7j1
312I95%jnlQK2L2L4K4Oj5k4k1j2lQJ8J5kj2pJnj4j4k%pkK2M3L5Lk6l9l9k5oOOkkKkj4k1j4
$$ plain form
349 1203 1207 1202 1189 1158 1122 1105 1117 1131 1122 1099 1087 1094 1099 1092 1081 1082 1096 1112 1118 1112 1096 1085 1091 1107 1109 1088 1060 1048 1056 1070 1077 1077 1075 1072 1068 1063 1057 1053 1057 1068 1075 1070 1059 1055 1064 1081 1095
344 1095 1098 1085 1061 1037 1019 1008 993 972 947 925 915 927 957 986 998 995 995 1006 1012 1002 983 974 973 965 941 916 913 940 978 1008 1024 1031 1030 1016 997 991 1005 1022 1026 1019 1019 1027
338 1027 1037 1047 1068 1096 1117 1126 1134 1145 1141 1110 1073 1055 1059 1067 1067 1063 1055 1039 1018 1006 1008 1015 1020 1027 1047 1076 1106 1128 1140 1139 1122 1097 1074 1055 1041 1028 1020 1022 1034 1047 1051 1042 1026
333 1026 1012 1008 1015 1034 1059 1081 1090 1086 1070 1041 998 954 928 925 926 911 883 866 872 893 911 917 912 897 878 859 848 852 869 896 933 979 1023 1052 1058 1052 1047 1044 1036 1018 999 990 994
328 994 1003 1015 1029 1044 1049 1038 1014 993 988 999 1019 1035 1045 1053 1061 1069 1075 1074 1064 1038 1006 992 1015 1064 1109 1126 1122 1113 1100 1070 1028 998 997 1015 1034 1052 1074 1094 1098 1085 1071
323 1071 1066 1065 1060 1054 1051 1046 1034 1023 1027 1044 1057 1057 1051 1049 1051 1042 1019 989 971 978 1001 1023 1029 1020 1006 993 981 975 978 983 979 962 943 931 924 916 912 925 958 998 1022 1023 1011 999 992 981 964
317 964 947 945 962 993 1020 1027 1014 1000 1003 1028 1058 1082 1100 1118 1132 1136 1134 1131 1119 1091 1059 1046 1055 1068 1070 1073 1093 1119 1119 1082 1029 992 987 1010 1046 1076 1085 1066 1033 1006 995
312 995 995 994 989 986 994 1016 1048 1082 1106 1112 1097 1073 1052 1040 1037 1045 1063 1078 1076 1064 1057 1058 1053 1039 1025 1023 1023 1016 1014 1036 1079 1114 1117 1091 1052 1013 988 982 988 994 992 990 992 990 976 955 941
306I41%QQMNJ0J2Kj3k2k6l3l5j7K0N2N0K4PRJ9K3J7Rmj2pJnj9j7J1L5K5lj3QK7J9nk6l1k6
301A032j3LJ6J7Pmj0j3j4j0jJoj8k1j0JKljPJ7K2K3J5%j3j3nMQJ0J3RJjJ1K6K5J5RPlk5m4
296A073l9k2j1j4j4%K4M2M3K5jk3l0k6j1jKmqlKmk1l1k5j0mop%J1K1L0L4L2K0Oqj8k3j6%J8
290A003K7K2Nj5k1j5mj%J0K3K1nl1l2qJ0Kj7j6%J0kk0k2r%kLK3M0L2ml6m4k3QJ9Nk3l6k6k
285H49J4J2NLRK0L2L6K0j0l1k3OL1L9L6L2K7J6kj5j9j0MJ2Opk0k3j5kRPnj0JJ6J6lj9j8j0
280A016j2j4mJ7L1K5J4QLj0k3k1qJkmKRjk4l5k1jLpj7j3nkkjK%kkKKkLK5N0O0L9Oj4nJ8L0
274A114J4j7l1k2lKmj2j9k9l8l0mK1K4Mj6k2k5l0l7k8lK3L7L3K0QJ4L2M4L1ll4m2l0j9j5j0
269H98LK1L4L2K5J8K0K0Qj6k8k1ljj1j9j4nmmkKOJ4K4K1Lj4j7n%qj4rKJ1J3J2J1J0Pkj9k8
$$ plain form
306 941 941 949 957 961 966 976 988 990 977 955 929 896 861 844 864 916 966 990 997 1006 1025 1048 1065 1074 1070 1058 1051 1052 1047 1028 1011 1022 1057 1082 1079 1066 1074 1101 1120 1115 1089 1058 1032
301 1032 1019 1022 1038 1055 1062 1058 1048 1035 1021 1011 1010 1011 1005 987 966 956 957 959 956 955 962 979 1001 1024 1039 1039 1026 1013 1008 1012 1020 1030 1043 1052 1053 1052 1063 1089 1114 1129 1138 1145 1142 1117 1073
296 1073 1034 1012 1001 987 973 973 997 1039 1082 1107 1106 1083 1053 1027 1016 1015 1017 1013 1005 1002 1004 1000 979 948 923 913 909 903 896 896 907 928 958 992 1024 1044 1050 1042 1024 1001 985 985 1003
290 1003 1030 1052 1057 1042 1021 1006 1002 1001 1001 1011 1034 1055 1050 1019 987 979 989 991 974 958 958 968 966 946 924 915 915 913 916 939 979 1011 1007 971 927 904 912 931 936 913 877 851 849
285 849 863 875 880 883 892 912 944 980 1000 990 959 936 942 973 1012 1048 1080 1107 1123 1121 1106 1087 1077 1081 1093 1099 1092 1072 1049 1034 1032 1041 1048 1043 1033 1034 1050 1066 1063 1044 1026 1016
280 1016 1004 990 986 1003 1034 1059 1073 1081 1084 1074 1051 1030 1022 1023 1021 1017 1019 1028 1027 1003 968 947 946 949 942 925 912 907 905 903 902 904 904 902 900 902 904 902 905 930 980 1040 1079 1085 1071 1066 1084 1114
274 1114 1128 1111 1080 1058 1055 1057 1053 1041 1022 993 955 925 921 942 966 970 954 932 907 877 840 812 809 832 869 902 922 930 944 976 1020 1051 1048 1014 972 942 923 908 898
269 898 901 922 956 988 1013 1031 1051 1071 1079 1063 1035 1014 1011 1010 999 980 966 961 957 953 951 953 959 973 997 1018 1021 1007 990 985 985 977 963 954 956 967 980 992 1003 1013 1020 1018 999 971
264I71j9JJ0Jj2j0MJ7J9J9J9J8J1jj4k9m2l9j9QK0J1rj7j2oqj8k5k4j3RL8O3O2L9Rj1j8j8
259I85j7j1qoLJ5J5jk2k2oNLljmj1j0RK6K2Kj3j9k5l2k8j8rkOJ6J8J3J2J4PkjQOj1k0j0kj5
253H56l3l7k2nRK2L0L2K7K9L3K9J6MkolRJ9Rj8l2k5j3j3k2k2j0J0K6K9J7QK0M6N4K2k6n1l6
249I80ML2L4J9ONR%j1pNQnj3rj0k9m4l9k3j4oJ3L2K7LnJ2K1QkPK2J8kj5j9k6l9n0m7l3oK6
243H37M3L1%k0j3NJ7K5L4L7K9J2%KKoj6j7oKMKMQRQJ0Qkj8k7k3j3mMJ1J1Mnj0j3j8k5k8k3
238H72j1mlmOK7L8K5NkQJ0kj1lQN%QK0J3j1k3j1MOMQOj7m7m9j4K7M7M2L2K8J6j0m1n8n3l1
232H60pMM%RK8L8K7Jj5j9j4j1nOQJlJ2L2L9K3Kj2j8j8j1KQJj3k0j8j5j9k9l5k1J5N5P1M7K
227I92k6k2%Qmj8j7noj8k4oJ8L0K6J4mk5l6k5JJ4PkkKJmJRJ6J6J7J6J1LLOJj2k2k1j3mMJ2
$$ plain form
264 971 952 953 963 964 952 942 946 963 982 1001 1020 1038 1049 1048 1034 1005 963 924 905 913 933 944 935 918 906 900 892 874 849 825 812 821 859 922 984 1023 1032 1021 1003 985
259 985 968 957 949 943 946 961 976 975 953 931 925 930 933 930 929 925 914 904 913 939 961 963 950 931 906 874 846 828 819 817 823 839 857 870 882 896 903 901 900 908 914 903 883 873 871 856
253 856 823 786 764 759 768 790 820 852 879 908 941 970 986 990 988 982 979 988 1007 1016 998 966 941 928 915 893 871 861 871 897 926 943 951 971 1017 1071 1093 1067 1016 980
249 980 984 1016 1050 1069 1075 1080 1089 1089 1078 1071 1076 1084 1079 1066 1057 1047 1018 974 935 912 898 892 905 937 964 967 962 974 995 1003 1001 1008 1030 1048 1046 1031 1012 986 947 897 850 817 811 837
243 837 880 911 911 891 878 883 900 925 959 996 1025 1037 1037 1039 1041 1035 1019 1002 996 998 1002 1004 1008 1016 1025 1033 1043 1051 1049 1031 1004 981 968 964 968 979 990 994 989 979 966 948 923 895 872
238 872 861 857 854 850 856 883 921 946 951 949 957 967 965 954 951 959 964 964 972 992 1005 994 971 960 964 970 974 982 988 971 924 875 861 888 935 977 1009 1037 1053 1043 1002 944 891 860
232 860 853 857 861 861 870 898 936 963 964 949 930 916 905 900 906 914 915 912 924 956 995 1018 1020 1008 990 972 961 963 971 972 959 939 921 906 887 858 823 802 817 872 943 990 992
227 992 966 944 944 952 948 930 913 908 902 884 860 854 872 902 928 942 938 913 877 852 853 867 874 872 870 872 873 869 870 879 895 911 928 944 955 958 961 967 968 956 934 913 900 896 900 912
221I12J5QmjJ9L6L0Lj6j4KJ0Oqk8m0k9KK9L3K5K8L4J9j2k8j4NOjJNpk9m2l4k1j0lRK2L1L5
216I84K8J5Jpmklqj4j9j7rkLQJ7K2K1J9J4Kk0l6l3j8njLPJ1J0J0QKkMJ5J2lk3l9m6m0j5J6
211H66L2K7J9K3K9K3Nj5k9l1j9LK2K9J9mk6l0qK1L0J6KKNnj9j9lQKj2k0j3OK1K4J4Jj0j7j6
205I53oQJ4OJPJ4J1%j4k6k6j2J1J6mk4k3qlomRJ5Rmj8l3k9lK5K4%j4nOOOJ0J2OOJ6J7Lj0j1
200I28nprj5l0n1n3k5LLpNL9O1O0N2M2J7j8l3j7Lkj7k1rMJ7K8K8%l0l2JL1L2J0pqnj0j1lJ1
194I50J4N%J0K5K5Mj7k3j9j9k8l1j9jJ2J5J5J4J3QMjpj2j1lJ0K4L0K3Mj9k9k3oMMNJ2J8Nj7
189I68k8k0qj1k5k9j7OJ9K4K5K7K4J4%lJKj0k2j3J1K0lk9k3J5M8N7M9L4Nl8p2p4n3l3k1nK2
184H34L7K6MkJ3K2Pj5k6k0pLJ0J5J4RJ0J9K6J4j2l5m1l3j5KJ4Rj0k9k8j1OJ0J2K5M0L8J2j2
$$ plain form
221 912 927 935 931 930 949 985 1015 1018 1002 988 990 1000 1006 998 970 930 901 903 932 965 990 1018 1052 1071 1059 1031 1017 1022 1028 1027 1028 1033 1026 997 955 921 900 890 887 896 918 949 984
216 984 1012 1027 1028 1021 1017 1015 1012 1004 990 971 954 945 943 946 954 971 993 1014 1033 1047 1049 1029 993 960 942 937 936 939 946 957 967 977 985 987 985 989 1004 1016 1013 990 951 905 865 850 866
211 866 898 925 944 967 996 1019 1024 1009 980 949 930 933 955 984 1003 999 973 943 935 956 986 1002 1004 1006 1011 1006 987 968 965 973 975 963 943 930 936 957 981 995 996 986 969 953
205 953 947 955 969 975 976 983 997 1008 1008 994 968 942 930 941 957 953 929 906 898 895 889 885 894 909 918 914 896 863 834 831 856 880 880 866 861 867 873 879 889 901 907 913 929 946 949 939 928
200 928 923 916 907 892 862 811 758 733 736 739 732 737 776 837 897 949 991 1008 990 957 940 943 941 924 903 894 898 915 943 971 971 941 909 910 941 973 983 976 968 963 953 942 939 950
194 950 964 969 969 979 1004 1029 1033 1016 993 974 955 927 896 877 876 888 903 918 932 945 953 957 956 949 937 926 923 933 957 987 1010 1014 995 966 943 937 941 945 950 962 980 985 968
189 968 940 920 912 901 876 847 830 836 855 879 904 931 955 969 969 966 967 969 959 937 924 935 955 952 923 900 915 963 1020 1069 1103 1108 1070 998 924 871 838 817 812 834
184 834 871 897 901 899 912 934 941 926 900 880 873 876 886 901 915 924 934 953 979 993 981 946 905 872 857 859 873 882 872 843 815 804 810 820 832 857 897 935 947 935
179I35j8ojooMJ3J0%moj6k6k4mJ5J9Poj3j6j6j3jJ4L3M5M1K2lj9j9qKORJ4J7Ok2m0l0OL1K5
174I51Lqnlj2k1k1j5j7k4k7k1pJ0K1K1J2jj0j6j3KK1L1K3QjKJ1J2QNQRLj2k1j5MK4L0K4Qr
168I72j7pQJ7J2Lnj1j3mQJ2kk2l4l2k0%J9K9K4J5J3J7J9J7J1Mj0k1k2j7r%RQoj4%K2K3nk8
163I63k4kJ4J7J1mk8m6m1k0rj3qK1N5N9L1nj9j5qj0k0k5k2pRK1K4K3J6jk6m6l5JL6M7L3J7
158I64J1Jj9m0n0m4k8j4lKRJ7K2J6PNJ6K4J4lp%MjoqpnMJ6J8Qlk%mqKJ2J1%m%mj6j5MK1K1
152I38J2J3J8J0j1k0j0jmj2oJ1K3J9Pqj8j3MJ4%k4l0pJ6K4K0J9J0j1l6m1k2KJ3J4J3J1RJ0
147I56J3J6J7K1K4K0Oqrkkj3k0j4MJ8K1Pj5l3l5k3nPJ5J6Mj5k6j5NRjqJQKonlj0qJ6M9N2J7
142A048j8k3qLMRJ7J2kj1qpk1l4l0j4mppMJ5J4%j3j6j1lKLkj2j6j5j3j3pJ0K5K4J2MMLlmK
$$ plain form
179 935 917 911 910 904 898 902 915 925 925 921 915 899 873 849 845 860 879 886 880 867 851 835 822 821 835 868 913 954 976 973 954 935 927 929 935 944 958 975 981 959 919 889 895 926 951
174 951 954 946 941 938 926 905 884 869 852 828 801 780 773 783 804 825 837 836 826 810 797 799 820 851 874 882 881 883 894 906 914 919 927 936 939 927 906 891 895 919 949 973 981 972
168 972 955 948 956 973 985 988 983 972 959 955 963 975 973 951 917 885 865 865 884 913 937 952 965 982 1001 1018 1029 1033 1023 1002 980 963 954 954 963 971 965 951 951 973 996 991 963
163 963 939 937 951 968 979 975 947 901 860 840 831 818 810 831 886 945 976 971 952 937 929 919 899 874 852 845 854 875 899 922 938 937 911 865 830 831 867 914 947 964
158 964 975 976 957 917 867 823 795 781 778 780 789 806 828 844 851 856 872 896 910 907 900 900 904 903 897 889 882 877 881 897 915 923 920 918 918 914 906 908 920 931 931 927 927 923 907 892 896 917 938
152 938 950 963 981 991 980 960 950 949 945 933 927 938 961 980 987 979 961 948 952 966 966 942 912 905 921 945 965 984 994 983 947 906 884 886 899 913 926 937 946 956
147 956 969 985 1002 1023 1047 1067 1073 1065 1056 1054 1052 1039 1019 1005 1009 1027 1048 1055 1040 1007 972 949 944 951 966 982 986 971 945 930 935 944 943 935 936 944 946 940 935 932 922 914 930 979 1031 1048
142 1048 1030 1007 999 1002 1006 1015 1032 1044 1042 1031 1023 1016 995 961 931 917 913 906 899 903 918 932 932 919 903 892 889 891 894 892 880 864 849 836 823 816 826 851 875 887 891 895 898 895 891 893
136H93%j3k0oJ3J3%nmj2k9l0nK4L5L0J6lk3l4l0j9rPL1M6L7J1rj3q%J1K4K3Nj6k4j5LJ5J3
131I23%j3j2lPLqj9j5LK5L1J6nj4okrk2k4j4mknojKKJJjlLJ5K0Lk4k9oJ7J8J0J2K7L7L3K0
125I82Rmj2qLJ2Rkj1j6j1JJ2J2Mmqj7k7l0j6%PJ1J9K8K7Qj1j7j0jmj7k6k2mOKlQL7N7N0J7
120A040j5k3j0L%pkJ0Mk7n8n8k8NJ4QQJ8K9L0J6%j7l1l8l6k1%K0K7K0PLJ7L4K8ml3l5j7ml
115H74NK3L0J4j0k1k3k0rJ3K6K0OJ2L3L6Pl2n3m8l2j1J1K8L0K1J0MMLjqj2j4j8k3j7%J3Op
110H70nJ1K2K2K1K5K0Kj0j5j9l1l3j4J2K1J4PJ4J9J6Qnj4j9j1lK%LKj1k6k6qJ0J9K3L0K8J1
105I82qj4oPJ5J6Oj3l0l2j8oqj6k3k0oJ6L4L5J7qk2k2j4j4k6l8l0jL2M7L5J3looqj7k1j6m
99G99NPRJ2J7J6Rjj0j7j7j0rj4j5jJ8K1J0OK2L5K3nj8rNJ7K2K5J1j0k2j6nKLNmk4l6k2JOr
$$ plain form
136 893 893 880 860 854 867 880 880 875 871 859 830 800 795 819 854 884 900 897 874 840 810 791 782 789 820 866 903 914 905 892 884 884 895 919 942 947 931 907 892 895 910 923
131 923 923 910 898 895 902 905 897 878 863 866 891 922 938 933 919 913 911 902 880 856 842 838 836 831 825 824 826 828 829 830 829 826 829 844 864 867 843 814 808 825 843 853 865 892 929 962 982
125 982 991 987 975 967 970 982 991 989 978 962 951 952 964 976 980 976 968 951 924 894 878 878 885 896 915 943 970 978 967 950 940 939 935 918 892 870 866 872 874 871 879 916 973 1023 1040
120 1040 1025 1002 992 995 995 988 986 996 1000 973 915 857 829 834 848 856 864 882 911 941 957 957 940 909 871 835 814 814 834 861 881 888 891 908 942 970 966 933 898 881 877 874
115 874 879 902 932 946 936 915 892 872 863 876 902 922 928 940 973 1009 1016 984 931 883 851 840 851 879 909 930 940 944 948 951 950 942 930 916 898 875 858 858 871 877 870
110 870 865 876 898 920 941 966 986 988 978 963 944 913 880 866 878 899 913 920 934 953 969 977 972 958 939 928 925 927 927 930 932 921 895 869 861 871 890 913 943 971 982
105 982 974 960 954 961 976 992 998 985 955 923 905 899 891 875 852 832 826 842 876 911 928 920 898 876 862 848 822 784 754 753 785 832 867 880 877 871 865 857 840 819 803 799
99 799 804 811 820 832 849 865 874 873 863 846 829 819 810 796 781 780 798 819 829 835 857 892 915 910 892 883 888 905 927 952 963 953 931 915 910 912 915 920 916 892 856 834 835 841 832
94H32j9rJ0K2K9K8J7pk4k1nRJ6J9J4jj5j7j7j8j7r%%poMJ4K1K3K0J2QJ6K2J0j8l8l7k9j7K
89H17K6L3J5rqJ1K2RqrLJ7K2J3j0l6m8l1jK2K0OjNJ1JrnQRnj4jJ9K1J2PQ%k0l4k4lJ1J5J0
83H97PPMrl0m4l0KK0Rj3k1pJ2J8J3Mk%ORJ0J7K8L7L2K1J3Jj5l3m1l9l4l0k2j1orj5j5j4j8
78G09k3j8lJ8L0L0K3K3K8K5Mj9k2qPRMmj3k1j9oLJ%QK0K2J5O%j1k5l2k0LK5L1K0%j3j2pj1
73G77j3mRJ1JmNJ5R%MJ5J8J0K%MOPRPjpj2j5j6j1lLNPPKqj3nPJ0Moj5k3k6j9j2qnOJ8K3K2
66G97K6L6K9Lk0k3j2j0j1%J8K2OnjKj1k7k2kJ1QNPJ4J9K0J6Om%RNj9l4j7J6L3K0kqJJ0J6J7
61I44J3Mj2k6l0k5j7j2pJQNj1k8k8j4oj4k2j4NJ6J2J4K8M3L6J4jmqj9k4j4LJ6L1M3M1J7j1
56I47k3j7j9l2m2l1nJ7L0L5L0J5NJ1K6K6Qj1j9j5j2j7k4k5j3JKj2k2j1J3K1J0nj4k1l2k7k
$$ plain form
94 832 813 804 814 836 865 893 910 903 879 858 853 862 878 897 911 910 895 878 861 843 826 817 817 817 810 804 808 822 843 866 886 898 906 922 944 954 936 898 861 832 815 817
89 817 843 876 891 882 874 885 907 916 908 899 902 919 941 954 944 908 860 829 828 850 870 876 875 880 891 892 883 878 886 895 890 876 875 894 915 927 934 942 942 922 888 864 861 872 887 897
83 897 904 911 915 906 876 832 802 804 824 833 820 799 792 804 822 835 839 837 837 843 852 862 879 907 944 976 997 1010 1011 996 963 922 883 849 819 797 786 780 771 756 741 727 709
78 709 686 668 665 683 713 743 766 789 817 842 846 827 805 797 804 813 817 813 800 779 760 754 757 758 758 766 786 808 823 829 829 818 793 761 741 744 769 800 820 820 807 795 788 777
73 777 764 760 769 780 781 777 782 797 806 806 810 825 843 853 855 855 859 865 872 881 888 887 880 868 853 837 826 823 826 831 838 845 847 839 826 821 828 838 842 836 821 798 772 753 741 733 728 734 752 775 797
66 797 823 859 888 891 871 848 836 826 815 815 833 855 861 856 855 857 846 819 797 795 806 814 819 826 840 859 879 895 901 897 897 906 911 892 858 841 857 890 910 908 900 901 911 927 944
61 944 957 961 949 923 893 868 851 839 832 833 841 846 835 807 779 765 759 745 723 709 714 730 742 756 784 827 863 877 876 872 864 845 821 807 810 826 857 900 941 958 947
56 947 924 907 888 856 814 783 778 795 825 860 890 905 910 921 947 973 981 970 951 936 924 907 883 858 845 846 848 836 814 803 816 837 847 842 828 807 775 748 746
51G46K9L3J4l%J0Kj5j9%K6L6K7Rqk3l2l1k4j8j7pK0M2M1J1k7m1k3QK8K1KlJ2K9K7J2mj7l0
46H43l4j8QK3J9J6K1K5K0J2J0%j5k3j2MNmlQJ0pk7k9j6pj6k8k8rJ5K0J1QK4L7K7Lj5j0%NM
41H77OP%j0j5j1JRLj1j8nJ4K0RnnMJ5K4L0K0nk7l4k7k1k1k4k1j3KJ4J7OjNK0K9L3L8M1L8K4
35A032Rlj2k5l4l5l4l4l6l2j7OK5K6Qj1j3KK0K4J9J5J6J0kj2nJ0J1j0k2oK3K2j9o7p6m2QM0
31G79L6Ok2k4%J8J5QJ3K1J4kjJ3J6%j4j0qj8l1k9j6k0l4l7j0K4M3M0K2OmjJ2K6L3K9J9Mj3
25I03k7k9j8jJ2K0K4L2L3K2NoLK1L1K2Nqj4k8n1o3m4j1Nnj3lNrk5j5J7L3J8jmqk0k4qJ3J5
20H04%prj4j7JK9L7J2j3j7j0qoRK9K6jk8l2j3MOjlOJ7J8Lj7k5oK8N2M7K1%mlj0j7j0NJ5J2
15I10Ljorrmpk0k4j0Lll3n5m4oL9O7O9M4Mk8m3l9k7j9j0LK3L7L8K1nk4k8j4OJ6RmmQJ8J2n
$$ plain form
51 746 775 808 822 819 819 829 831 816 797 797 823 859 886 895 887 864 832 801 777 759 742 735 755 797 838 849 822 781 758 766 794 815 817 814 826 855 882 894 890 873 843
46 843 809 791 799 822 841 857 878 903 923 935 945 945 930 907 895 899 904 900 897 905 915 908 881 852 836 829 813 785 757 748 763 783 794 802 826 863 890 893 878 868 868 873 877
41 877 883 890 890 880 865 854 855 864 867 856 838 833 847 867 876 871 866 870 885 909 939 959 954 927 893 866 845 824 800 779 766 768 782 799 805 804 809 829 858 891 929 970 1008 1032
35 1032 1041 1038 1026 1001 967 932 898 864 828 796 779 785 810 836 844 833 820 822 842 866 885 900 916 926 924 912 907 917 928 918 896 890 913 935 916 849 773 731 739 779
31 779 815 821 799 775 775 793 808 816 829 850 864 862 861 874 890 890 876 866 858 840 809 780 764 744 710 673 663 687 730 770 792 798 794 793 805 831 864 893 912 916 903
25 903 876 847 829 828 840 860 884 916 949 971 976 970 973 994 1025 1047 1052 1044 1030 1002 951 888 844 833 838 833 820 817 822 813 788 773 790 823 841 840 836 828 808 784 776 789 804
20 804 804 797 788 774 757 758 787 824 836 823 806 796 788 782 791 820 846 845 817 785 772 776 782 781 778 784 801 819 822 805 780 774 802 854 901 922 922 918 915 905 888 878 883 898 910
15 910 913 912 906 897 888 884 877 857 833 823 826 823 790 735 691 685 724 791 860 904 908 880 837 798 771 752 742 745 768 805 843 864 859 835 807 793 799 815 824 820 816 824 842 854 849
9H49j4rLRMmqolpj2rLJ7K3K2J6J2J2Rnk2k6qJ6K7K3J6Kk3n2n5l3j1j4k6j4K0M6M5K0j5m4m3
4G31j2K3K9J1JJ6L4L1Qj7l6m7m6l0j0J0K9M3L6J1j1j4olnKJ6K5J7QOJ3K0J7J0mj9l4m5m3l0
-1G35qQJ4J3J3J8K4K5J8QPJ5K5K5J6J0J0Kj3k8k9k3j4jJ2J6Mj2j7j6j7k0k3k5k8k2%K2K9K1
-6G94J0jj8l5l9k2jJ6K7K2Mj0lJ0Lj9k4%K0J1oML4N2M8M0L4K1jj9k2j7j1mjnk1l2k9j3JQJ2
-11H18J6J7J3KnlPJ1Jj3j6lJ6L3L6K0rk5j3Njk4l5j9LPoj7j9j7j0knj6k0rRJ6J4J2J1Kj0j7
-17G55j5j6j9k3k6k4j3RL2L8K8J9J9K3K0J0mj9k2j0OJ4J3J7K9L2K0J1J8K4Pk1k5KK4J9%ql
-21I41NJmkOQnk8m1l0nOmj4qORJjJ3K7K3%k3l7l0j0LLrj2lLlj2rNJ5K1K3K2J3jj2rKQKrj3
-28H32mRJ5QmnLJ3J7J7J4Nmj3j2KK3L3K3lj8j2j%j1j8k1k0k0j0KP%lMJ3J1kj2j2ql%LMJpk1
$$ plain form
9 849 835 826 829 838 842 838 830 824 821 814 802 793 796 813 836 858 874 886 898 907 902 880 854 846 862 889 912 928 930 907 855 800 767 756 742 716 702 722 768 813 833 818 774 731
4 731 719 742 771 782 783 799 833 864 872 855 819 772 726 696 686 696 725 768 804 815 804 790 784 781 776 778 794 819 836 844 850 863 883 900 910 906 887 853 808 765 735
-1 735 727 735 749 762 775 793 817 842 860 868 875 890 915 940 956 966 976 978 965 937 908 885 871 870 882 898 902 890 873 857 840 820 797 772 744 722 722 744 773 794
-6 794 804 803 785 750 711 689 688 704 731 753 757 747 744 754 757 738 714 714 734 745 739 743 777 829 877 917 951 972 971 952 930 913 902 898 897 892 871 839 810 797 798 806 818
-11 818 834 851 864 866 861 858 865 876 877 864 848 845 861 894 930 950 941 916 903 908 907 883 848 829 832 839 833 816 797 780 770 768 763 747 727 718 727 743 757 769 780 782 772 755
-17 755 740 724 705 682 656 632 619 628 660 698 726 745 764 787 807 817 813 794 772 762 768 782 795 812 841 873 893 904 922 946 953 932 907 909 933 952 952 944 941
-21 941 946 947 943 941 947 955 950 922 881 851 846 852 848 834 826 832 841 842 841 854 881 904 904 881 844 814 804 807 810 801 789 786 789 786 774 765 770 785 806 829 851 864 863 851 842 844 852 854 845 832
-28 832 828 837 852 860 856 851 854 867 884 901 915 920 916 903 891 893 916 949 972 969 951 939 938 938 927 909 888 868 848 838 840 847 847 844 848 861 872 870 858 846 838 835 835 838 842 843 836 815
-33H15k7j8KK0K1J2kj3j6oJ2J6KrMK9L2J3%PJ7J0j3k3j7nmj4k1j1J1L1L3J9%j1j7k3k4j6k
-38H14OPJ2K8M5M4K4%j0qnpj1j2pnrj6k0k0k4l3m0l2pJ7K4J5RJ0J3J0M%nj3j4ML1N0M5K7J0
-44I51%oj1j6j7k0k3l0l0j8lMlj4j9j7qRK5L1K7K6L0K9J0j1j4nj3l6m4j6K1K9RnPK7L0J1j6
-49H81l5l6k1%J0Lpj2mPJ5K1K4J7Lj2j7j3j2j3pPRmj3jK4L1J0j1j9j9k7l1j7NJ7J5J8K7L4
-54H47L2K1J1NKok9n4n7l5j0lroQJ9K0K0K1J8QLJ0J8J8Rjprppj2j9j9j3j0oPK7L7K7Nj6k7
-59H31k7j5NK6L7L0Pk6m7m1j8KRJ3J2Nrj3kJ3J3PKkrj1kPQNK%kLJ8K6J3j2k8k8j8lJ3K2J0
-65H26npMRJmJJ1J6J4J1Npj5j4j1j4j6nJ9L6K8Orrpj5k1oK0K5Jk5k8j2ooLJ2ll3l9j0K0J7
-70G58jlQJ1jroLMmj7k6j7J2L9M2J9j1l5m2k1J9M3K6j9m2k8LK1L1M3M3K2qk0j2jNPQJj5k9
$$ plain form
-33 815 788 770 772 792 813 825 823 810 794 788 800 816 818 809 813 842 874 887 887 894 911 921 908 885 868 863 859 845 824 813 824 855 888 907 907 896 879 856 832 816 814
-38 814 820 827 839 867 912 956 980 980 970 962 957 950 939 927 920 915 906 890 870 850 826 793 753 721 714 731 755 770 779 789 802 812 816 816 811 798 784 788 819 869 914 941 951
-44 951 951 945 934 918 901 881 858 828 798 780 777 781 778 764 745 728 720 729 754 785 812 838 868 897 907 896 882 877 864 828 784 768 789 818 827 822 829 856 886 897 881
-49 881 846 810 789 789 799 802 795 783 779 786 801 822 846 863 866 854 837 824 812 799 792 799 808 804 791 790 814 845 855 844 825 806 779 748 731 736 753 768 786 813 847
-54 847 879 900 911 916 918 912 883 829 772 737 727 724 715 709 717 736 756 776 797 815 823 826 836 854 872 881 880 873 864 857 850 838 819 800 787 777 771 778 805 842 869 874 858 831
-59 831 804 789 794 820 857 887 894 868 821 780 762 764 773 786 798 803 794 781 779 792 805 812 814 812 803 792 790 797 805 810 812 812 810 813 831 857 870 858 830 802 784 781 794 816 826
-65 826 821 814 818 827 828 824 825 836 852 866 877 882 875 860 846 835 821 805 800 819 855 883 889 880 871 864 849 828 822 842 867 868 843 815 803 797 791 794 806 803 770 731 721 741 758
-70 758 757 754 762 773 772 763 757 760 764 760 743 717 700 712 751 793 812 801 766 724 703 722 765 791 772 730 702 705 726 757 800 843 865 857 837 825 824 829 836 844 845 830 801
-75H01l3k6j4JJ3J9K1K3K4K2J4KpqmLKoj4pQRpk5k7j9j7j9j0J0K9L2K2Lk2m2m0j7RJ5J0MO
-81G38OKJORO%%%jnj0j0jRJ4ROJ3K3J5pk3k4k1k3j5RL0K4%j7j7j7k6l6l4j0K3M7M5J8npJ0
-86G54J3PRL0M3K6j3l6l3j8j0j0j2j4j1n%NJ3J8J2JmLQkj5j3jOKOJ6J3oj4PL0K5%rNJ3Kj1
-92H30oJ1K1J2jrqopj1j3j5j9k4j9LK3J9lj6jK1K6K0K0K8K8J7Jj2j9j5PK5J9rk2qJ1J5Kj4
-97I02k9l9l7k0ollPJ7Pj8k5pJ9K3Rk%J4K7K6J1jj%j6l1k0J9M8L9Kk7k7mK3L7K7Kk2k7j6n
-102H73lj1j8j8j2olmmpj4k1j4MJ7J6PjkMJ2J6J2MMJ1Oj0j8pQJ0NPRjj4j1NNj0k1j4oj3k3
-108G49j5J0L2L7K0j3m1l6oJ8J1nj0mj4l5l7j4J8L7M2L5J8nj7j4ppjJ6K7J7lj3j0j1j8j7K
-112G36K0J9PLROj1k8k8j9j5j3mJ1K4L2L2K5J1Jjnj5j8mJ5J3j0j9mJ7K1J3Pkj9k2lK1J8j1
$$ plain form
-75 801 768 742 728 729 742 761 782 805 829 851 865 867 860 852 848 851 853 847 833 826 834 843 836 811 784 765 748 729 719 729 758 790 812 815 793 751 711 694 703 718 728 732 738
-81 738 744 746 747 753 762 768 768 768 768 767 762 752 742 741 750 764 773 779 792 815 830 823 800 776 755 732 717 726 756 780 780 763 746 729 703 667 633 623 646 693 738 756 751 744 754
-86 754 767 774 783 813 856 882 869 833 800 782 772 762 750 736 725 720 720 725 738 756 768 769 765 768 776 774 759 746 745 751 753 759 775 788 782 768 775 805 830 830 821 826 839 841 830
-92 830 824 835 856 868 867 858 850 844 837 826 813 798 779 755 736 739 762 781 778 762 761 782 808 828 848 876 904 921 922 910 891 876 883 908 927 918 896 888 899 914 916 902
-97 902 873 834 797 777 771 768 765 772 789 796 778 753 746 765 788 797 795 795 809 836 862 873 872 871 871 855 824 804 823 871 910 912 885 858 854 877 914 941 943 921 894 878 873
-102 873 870 859 841 823 811 805 802 798 794 787 773 752 738 742 759 775 782 781 779 783 795 811 823 827 831 842 848 838 820 813 821 831 836 843 852 851 837 826 831 836 826 805 791 785 772 749
-108 749 734 744 776 813 833 820 779 743 737 755 766 761 751 747 733 698 661 647 665 702 744 779 797 792 775 761 754 747 746 762 789 806 803 790 780 769 751 734 736
-112 736 756 775 782 785 794 800 789 761 733 714 699 686 682 693 717 749 781 806 817 818 817 812 797 779 775 790 803 793 774 770 787 808 821 828 826 807 785 782 803 821 810
-117H10k9j5QJ4MlJKnj7j8mJ2J9QmpnmqoLJ0Lj1j6pJ1K9L7L1J2oj6j6qKJj4l5m5l0rKJ%Jo
-123F77k3l4k1J0L3L9L0J4%j3j9j7qMJ6K6K5J3jpjOLlmlnj1j1qoj2oJ7M9O7O1M3K8J5Jj1j9
-129I34j8j3rj4k4l2k5jK4L1J7jj4j5j2lMMoj2qJJljJ0J4LrmQMj8l8l8k2%J5K0J2kj0oLJ0
-134G57J3J3MppRK7L0J9Q%j0k8l7l3j7kQJ2J7J5J2NMRJ5J1mj9k2j1krk1k2mJ9L1K8J8J4J6
-139H59J3OlplJjrj3pJ1K4K3J0oj5j6j2okpj3nJ6L6L2Pj9l2l1k5j8j6k0j6MK8L7K6Rlj5k6
-144G96k6j3JjqqJRJ3K2L0K7J1nj0prj6j8qJ1K2J4nj7r%pk8l6j9J2L1L2J7kj3j2orj4pK0M0
-150G96L6J1omNOkj6k6k5j1NJ2PPK1L3K7%k6l8k8mJ9K2Mk0k7j3LMlommrj3nOJ0J0J2J8K1Q
-155H13j3l1l6l0j5%PMkJJ5K1Pj6k7j6NJ4J0%pj5k0j2J1L4M1L2J8RJoqJJ4J9J5QMmk3m2m5
$$ plain form
-117 810 781 766 774 788 792 789 790 792 787 770 752 748 760 779 787 783 776 771 767 759 753 756 766 769 758 742 735 746 775 812 843 855 849 833 817 809 811 812 798 763 718 688 679 681 682 682 683 677
-123 677 654 620 599 609 642 681 711 725 725 712 693 676 668 672 688 714 739 752 751 744 743 749 752 749 745 742 737 726 715 707 701 689 683 700 749 816 877 920 948 963 964 953 934
-129 934 916 903 894 880 856 824 799 798 822 853 870 869 855 840 828 825 829 833 827 815 807 808 809 806 805 815 829 832 823 819 827 831 813 775 737 715 715 730 750 762 760 750 744 747 757
-134 757 770 783 787 780 773 782 809 839 858 866 866 856 828 791 758 741 739 747 759 776 791 803 808 812 821 836 847 843 824 802 791 789 780 759 737 733 752 783 811 829 843 859
-139 859 872 878 875 868 865 866 865 856 843 836 847 871 894 904 898 883 867 855 849 847 840 827 822 838 874 906 913 894 862 831 806 788 772 752 736 740 768 805 831 840 837 822 796
-144 796 770 757 758 757 749 741 742 751 764 786 816 843 854 849 839 832 823 807 789 781 792 814 828 823 806 797 797 790 762 726 707 719 750 782 799 797 784 772 766 757 743 736 756 796
-150 796 832 843 837 833 838 844 842 826 800 775 764 769 781 788 795 816 849 876 876 850 812 784 780 799 821 825 805 778 765 768 772 769 763 759 755 746 733 728 734 744 754 766 784 805 813
-155 813 800 769 733 703 688 688 695 699 697 698 713 734 741 725 698 682 687 701 711 711 704 689 669 657 668 702 743 775 793 802 803 797 789 790 804 823 838 846 850 846 823 781 736
-161G36l1j9k1k1%L0M0J5j7l0k3j1JJ5L1L4K6J3Olj1j0oj1k5l1j5ORnj4rJRJ2J4QjmllooK
-166F72J3J5J1QJ0K3L5M0L0Rj3k1k1k0k1k5j9jK5M1L7J9mk1k8k0%J5J5J5K9N2O1M3J4j2k8
-171I78l8l4k3j8k2k3j5j1k5m1l7j3J3K6K7K5K0J9K5L0K3Kk2l8m3l7j7NJ8J9J7J7J5Kj1nJ9
-175H27M2M3J9j0k4j9j2j1j9k1j7j1mOJ3Qpk3k6j5OK3K6J5J1K1L6K8%k6l2k8k2j6j2j3j6n
-180G35J3K4J4NLJj5k2mK8M3L1J6Nlj6k2j6qj1k2l3l2j2J7L0J6pqQK1K1K3K3Rj7k9k0j3j9
-185G57k1kK0J6nj7j0JJ0K0K5J9Mqrrj2j8k2k8l1k3rjmroPK0J8Lj3j3MJ6QnjJ8L0K5J4RJ3
-190G81J5J3P%%jok1l0k2nMLjjoj8k1qPJ2J2J7K4K5K0J9K1K1J6J4J1%k1l5k6jK3L1K5J1Jo
-195I04j2j3j6k7m0m5k7LK5K3Poj1pJJ0J2RNMNJnj1pMJ9K6J3pj7j2lmj2j6rlmj3k3k4k0j4
$$ plain form
-161 736 705 686 665 644 644 674 714 729 712 682 659 648 649 664 695 729 755 768 774 771 760 750 744 733 708 677 662 668 677 672 658 649 650 659 671 685 693 692 688 685 682 676 670 672
-166 672 685 700 711 719 729 752 787 827 857 866 853 832 811 791 770 745 726 725 750 791 828 847 843 822 794 774 774 789 804 819 848 900 961 1004 1018 1006 978
-171 978 940 906 883 865 843 820 805 794 769 728 691 678 691 717 744 769 789 808 833 863 886 888 866 828 785 748 731 736 754 773 790 807 822 824 813 808 827
-175 827 869 912 931 921 897 878 866 855 836 815 798 787 783 789 802 810 803 780 754 739 745 768 794 809 820 841 877 905 905 879 847 819 797 781 769 756 740 735
-180 735 748 772 786 791 794 795 780 758 754 782 825 856 872 877 874 858 836 820 812 801 779 746 714 702 719 749 765 758 750 758 779 800 823 846 855 838 809 789 776 757
-185 757 736 734 754 770 765 748 738 739 749 769 794 813 817 809 800 791 779 761 739 711 680 657 648 647 643 634 628 635 655 673 676 663 650 654 670 678 673 672 690 720 745 759 768 781
-190 781 796 809 816 816 816 815 809 788 758 736 731 735 738 737 736 730 712 691 683 690 702 714 731 755 780 800 819 840 861 877 891 902 902 881 846 820 819 842 873 898 909 910 904
-195 904 892 879 863 836 796 751 724 727 752 775 782 776 765 758 759 769 781 790 795 799 804 805 800 789 782 786 805 831 844 837 820 808 805 801 789 773 764 761 757 744 721 697 677 663
-201F63qKK1L1J2k4m3k3RJ9QJQJ4J6J4J4J7J6J3Mj3k9k8j4lLJ2K5L1K4J5J4J6J8J6Pj6m1m1
-205G80j2J9K7J1jrk3m1l9j3K3L6K2Kqnlj2j9j9j1j1j8j3J2M3N5L8Jl2m3k6MK0J7J5K9M2L3
-210H71%k7l3k6k1j9j6rlKQJ0Kqr%J4J8J2%j5k4k2j1kkrrjJ0J1Krj3mJ7M3N0L2RLJ2Qj5l1
-216G96k1JJ1J3K3L2J8j6l7l3j9j7j9j2LJ3Rkn%J0J5QLRJ5Nk0l7k5kJ0Jj1j0LJ8J9Lj8k8k0
-221F86qkNJ2Qj3k7j6J3K7K0N%JJlnlJ2L3M6L4NqLJ1j2m7n6l2mPJ1K3L3K3ok3j5NJ3LojJ2
-226G65J6Lj4k1j2jjlLJ2J2jj0roqpKJ0Lqp%kj0qKMoj3plj1j2MJ7Mj5rK1M0K5JnNJ1LnnJL
-233G48NJ6L5L6Qk9l3kK8K3mk5l2m0m5l7k2j4j1KK2K6J4J2K5L3J7mnRJ7J4J3J6J0nj0lLmk0
-238G87k6j7qkMJ9L5L2J0oKK1K5Pj2k2k7l0k3nPJqlRQmj4j0JJ8L1K9J0rj4j5k3l2k8j1LJ4
$$ plain form
-201 663 655 657 678 709 721 697 654 631 640 659 667 668 676 690 706 720 734 751 767 780 784 771 742 714 700 697 700 712 737 768 792 807 821 837 855 871 878 862 821 780
-205 780 768 787 814 825 824 815 792 751 712 699 722 758 780 782 774 769 766 754 735 716 705 694 676 663 675 718 773 811 812 780 737 711 715 735 752 767 796 838 871
-210 871 871 844 811 785 764 745 729 720 717 719 727 737 739 731 722 722 736 754 766 766 751 727 705 694 692 690 681 672 671 681 692 694 685 672 668 685 728 778 810 819 822 834 842 827 796
-216 796 775 776 787 800 823 855 873 857 820 787 768 751 732 720 723 736 745 743 738 738 748 763 771 774 783 798 803 783 746 721 719 729 730 719 709 712 730 749 752 734 706 686
-221 686 678 676 681 693 701 688 661 645 658 685 705 710 710 711 712 709 704 701 713 746 792 826 831 823 826 837 825 778 722 690 686 693 704 727 760 783 777 754 739 744 757 760 754 753 765
-226 765 781 784 770 749 737 736 735 732 735 747 759 758 748 739 733 725 718 720 730 733 725 718 718 716 706 698 700 704 698 685 678 675 664 652 656 673 677 662 653 674 714 739 740 735 740 751 754 749 744 745 748
-233 748 753 769 804 840 848 819 786 784 812 835 831 806 774 734 689 652 630 616 605 607 629 655 669 681 706 739 756 752 747 756 773 787 800 816 826 821 811 808 811 807 787
-238 787 761 744 736 734 738 757 792 824 834 828 830 851 876 883 871 849 822 792 769 764 771 772 764 761 770 778 774 760 750 751 769 800 829 839 830 816 801 778 746 718 707 710 724
-243G24L0M4L1pl2k1J2K9J8%ollj2k1j5MJ9K0J0Jrk3l2j6J3K6J0j2j4JJ1RPJ2J5J1MPJ0Qk
-248H58qJJ8K3J0qj3pnj1j2qj0k2l0k2mJ4K4K3Oj9l1k0okkRK0K0J3RNlkJ6K7Lm2o4l8NK9K5
-253G69J2%pokrk9m0k6jJ3J0QJ8L0K8J4loJJ1J1MornMJ4J7Mj7l2l1j8kJ2J9K1J8J1lk2l6k7
-259G12lJ7J8J0J0Pnk0k3j8j9k5j6OK1J7J3K3L7L8K2Q%oj4k5l0k5j2KNlj4j2JQONJ9L5L3O
-264H09k0k4j3qj3j7kJ9L0K4Oj1j7j7j7k1k4j9pLLnqolkJJ2L0M3M5L8J8ol1m6m0j4K0M1L6
-269G87J5%MJ3Qj6l8l9j4J5K9K6Rj5l2k9mK5L3K0%rj5k7m1m4k7LK6L0J8Mjoj9l2k3RL3K5L
-274G04nK%j2j3RL3L7K9K3J7Jj4j4jMqk0j9lJ1J3NljPJ3Rjnnpj1oRK5K6J1oj7j9j8k2k8k9
-279G01j6MJ7J8Nqj2pjNRJ3J2PjmjLOQQLmqoklolJ0K3K7J8KnLJ9K4J2oj3j7k6l5l1j4llrq
$$ plain form
-243 724 754 798 829 822 790 769 781 810 828 828 822 819 816 804 783 768 772 791 811 821 822 813 790 758 742 755 781 791 779 765 766 777 786 793 805 820 831 835 842 852 860 858
-248 858 850 851 869 892 902 894 881 874 869 858 846 838 828 806 776 754 750 764 788 811 817 798 767 747 741 739 737 746 766 786 799 808 813 810 808 824 851 854 812 748 710 715 744 769
-253 769 781 781 774 768 766 757 728 688 662 661 674 684 692 710 740 768 782 779 773 774 785 796 800 794 785 780 784 798 815 819 802 770 739 721 719 731 750 771 789 800 797 775 739 712
-259 712 709 726 744 754 764 771 766 746 723 705 686 661 645 651 672 689 702 725 762 800 822 830 830 824 810 785 755 730 718 720 725 722 708 696 697 705 711 716 735 770 803 809
-264 809 789 765 752 744 731 714 712 731 761 785 791 780 763 746 729 708 684 665 658 661 664 659 651 645 642 640 641 653 683 726 771 809 827 821 790 744 704 690 710 751 787
-269 787 802 802 806 819 827 811 773 734 720 735 764 790 799 784 752 723 719 744 777 797 797 788 773 746 705 661 634 637 663 693 711 715 714 708 689 657 634 643 676 701 704
-274 704 699 701 701 689 676 685 718 755 784 807 824 825 811 797 796 800 792 772 753 750 761 774 779 776 775 782 795 804 803 798 793 786 775 769 778 803 829 840 834 817 798 780 758 730 701
-279 701 685 689 706 724 729 721 709 702 701 706 715 728 740 747 746 742 741 744 750 758 766 769 765 757 751 749 746 740 737 747 770 797 815 817 812 815 834 858 870 864 851 834 808 773 742 728 725 722 713 705
-286G05j0j5j1PK4K1K%J5K9K0Kj0j6k3l1k3p%j2k5j6J4L5L3J8J1J2Ppk0k0j5j4j4pLKj4l1
-290F19l0qJ5K5K3K4L1K6Kk2k7pJ0J0%KJ2K1K3K0J0qk6l2k6j8j4qPK7M4N1L7Jm0o2n2k8j0
-295F22LK0L7M6L3Mk3l5k4kQOLRJ4Rnj4j4j1lJ6L6L7J9%mnj3k3k0rlooOK2L3K8Rj1k0j3mj0
-301G42k5k6kL0M8M5L0J5%j2k0k3j9j1kmroMJ0lj5j0J3K9L2K7K0Nj5k3j7qqmNKk3m3k3J9M0
-306G65K5Nlqj9k4j0Knj6j5j5l1m3k4J6M0L8L1L5L0Mk3l1k6j9rPK0J8J0Opk9l8j5K1L4J9K
-311G18LNoj8k0j6j3j4rmnj1j5mK3N6P1N7K3rk4k9k8j4J2K9K6J1koj1j5j6rNJ8K7K2kk3k2
-316G61jJ3Nj3k1j2%NQJ4K3K8J9jj9j9nJ0J5J5J6J5Poj4j7j9k4k9k9k1nQJ1POJ5K5K4J2Lm
-321H06j4k5k3qOJj3j7j4j3k0k5k5j9jK4M0K7nk5k1j0j1qPK4K1NmklplJ3K4K4J6Mj0j8j2P
$$ plain form
-286 705 695 680 669 676 700 721 723 723 738 767 787 789 779 763 740 709 686 679 679 667 642 626 640 675 708 726 737 749 756 749 729 709 694 680 666 659 662 664 650 619
-290 619 589 581 596 621 644 668 699 725 727 705 678 671 681 691 691 693 705 726 749 769 779 771 745 713 687 669 655 647 654 681 725 776 813 814 774 712 660 632 622
-295 622 625 645 682 728 761 765 742 707 683 681 689 695 698 707 721 730 725 711 697 686 683 699 735 772 791 791 787 782 769 746 726 717 714 708 702 708 730 763 791 800 789 769 756 752 742
-301 742 717 691 689 719 767 812 842 857 857 845 825 802 783 772 770 766 757 751 755 765 762 747 737 750 779 811 838 858 863 848 825 808 800 792 788 793 795 772 729 706 725 765
-306 765 790 795 792 784 765 741 731 733 728 712 697 682 651 608 584 600 640 678 709 744 774 778 755 724 698 679 670 677 697 715 725 731 724 695 657 642 663 697 716 718
-311 718 721 726 720 702 682 666 653 639 630 626 621 610 595 591 614 670 741 798 821 812 788 759 731 717 729 758 784 795 793 787 776 761 745 736 741 759 786 808 806 783 761
-316 761 760 773 778 765 744 732 732 737 745 759 782 810 829 828 809 790 785 795 810 825 841 856 863 857 843 826 807 783 754 725 704 699 707 718 725 731 746 771 795 807 810 806
-321 806 792 767 744 736 742 743 730 713 699 686 666 641 616 597 596 620 660 687 682 657 636 626 615 607 614 638 659 664 660 658 655 648 645 658 682 706 722 726 716 698 686 693
-326F93J5J0LKlj7k1mJ8K4J7%k3m1k9J7N5M3ll3l0j9j6j0MJ2QJ1K7L5J9lrlnj2qJPJ1K0K8
-331G91K0lk1k2j2nKPlk0l3k8j2KJ5K9M1M0K1mk0j9qLJ1J8K1J3nj7j3lnk0k2jK5L5L3L0L5
-336H96L4K0ok9l7k6qJnj0qLJ5K3K5J1j3l3l6k8k0j1LJ4J1jqoJJ0K0K7K2QMJ1J4Kj4j2KQL
-341H77jMMj1k8k4jJ7J1j1k2j6njlqj6k7l2k0%J3Ooj2qlLJ2J8Qrj3%J3J2MPJ3Q%OL0M2K3k0
-347H34n7o7n0j9OJ5J2NlrnJ5K9J5k0m0k2J2K8K1J5J5J1LjMNkpkJoj3pjjmOK4L1K2POK1L7
-353H64L6J3j8l2k2KK1K5J1j1l0l8l0j6nKLok0k7j7lkj3k3j9oPJ7K1J7J1QLj0k2k6j6n%KO
-358F52J1J3J3J4K1K5K1OnjJ2Pk6n9n6j8RKk0k4oJ6K4J5KlJ2L3M2L2K3K3J8kk2k1j2j9l5l4
-363F83j0J1J4J5K8L9L2Rj6l1l3k2oNnk3l5l5l0j7KK0K2J1jkLJ0J4J8J6J1jj6k5k4j2lKMJ3
$$ plain form
-326 693 708 718 721 723 720 703 682 678 696 720 737 737 714 673 644 661 716 759 756 723 693 674 658 648 652 664 672 683 710 745 764 761 752 749 744 732 724 725 732 743 763 791
-331 791 811 808 787 765 753 748 750 757 754 734 701 673 661 663 678 707 748 788 809 805 785 766 758 761 772 790 811 824 819 802 789 786 781 761 739 738 763 798 831 861 896
-336 896 930 950 944 915 878 852 844 845 840 830 822 825 840 863 888 899 886 853 817 789 769 758 761 775 786 785 777 771 772 782 802 829 851 859 863 874 888 890 876 864 866 874 877
-341 877 876 880 884 873 845 821 820 837 848 837 815 799 794 793 790 782 766 739 707 687 687 700 706 700 688 680 677 680 692 710 718 709 696 696 709 721 725 732 745 753 753 759 789 831 854 834
-347 834 777 710 660 641 647 662 674 679 676 667 662 677 706 721 701 661 639 651 679 700 715 730 741 744 743 747 752 750 743 741 742 736 723 716 715 714 710 716 740 771 793 800 806 827 864
-353 864 900 913 895 863 841 843 864 889 900 889 859 821 791 775 770 772 775 769 749 722 705 702 700 687 664 645 639 646 663 684 701 712 720 723 713 691 665 649 644 644 646 652
-358 652 663 676 689 703 724 749 770 776 771 770 782 789 763 704 648 630 639 641 621 597 591 607 631 646 648 645 657 690 732 764 787 810 828 826 804 783 771 752 717 683
-363 683 673 684 698 713 741 780 812 821 805 774 741 719 713 718 713 690 655 620 590 573 575 595 617 628 627 625 628 638 652 670 686 697 696 680 655 631 619 616 618 622 635
-368F35J9J4kj4j6j4j0njkkJQQjoJJ5K5K7J7Jj0j4j0plNJ4J8J5Rlk4m1l7j0J4J3%kRK5L8M1
-373G38K5j3m7n4l3j2nlQK1K1Qpj2oJ2L1L5J9koKMj1k8l3k2rlJJ1K6L7L2J5rk5l3l5l4l2k2
-378E50lK2L9L9K7J7J5J2ONJ4K5J8ol3m3l4j2J3L8M7L5Oj7j5PK6K3Rkoj2k2k8k4j1MJ7K6K7
-383G99Rj8m3n1l7nL4N8N4K6ok1k5k8l5l6k6pJ5L6M8M5K2j1l3l0j7pkOJ7K5J9Lj7l3l9l1j1
-388F47QJ7J7J0jj3k1j1J3L0K5QJJ4K8K3Jj7j4jRJ3J3J3Qmj8k2j8pPK0K4J6Jj3k5k9k0mJ3
-393G41J5Mj0j5j0mlqj2j1kM%j0j1rpj1rkKjMJ7K8K6K2K8L7K9Mj4j7qlKOLj2k7l6m0l8k4M
-398F22K8K9J1ljRJ5J6J7J8J4QJj3k9m1l8k1ojnqnOK0L4L9L0J5Llnj4k2k1j1jmj4k1j7jJ5
-404F45K3J7%j0lJ3J3%plJj2l1l7k4mJ9M1N1L7J0j2j3lLMjqj7j8j5j0pMJ9L0K4Qoj2j4j2p
$$ plain form
-368 635 654 668 666 652 636 622 612 607 606 604 602 603 611 619 618 612 613 628 653 680 697 698 688 674 664 657 654 659 673 691 706 715 712 688 647 610 600 614 627 627 625 634 659 697 738
-373 738 763 750 703 649 616 604 599 596 604 625 646 654 647 635 629 641 672 707 726 724 718 720 724 713 685 652 630 621 618 619 630 656 693 725 740 731 706 673 638 604 572 550
-378 550 547 569 608 647 674 691 706 718 724 729 743 768 786 780 747 704 670 658 671 709 756 791 797 780 765 772 798 821 830 828 822 810 788 760 736 725 729 746 772 799
-383 799 808 790 747 696 659 654 688 746 800 826 820 799 774 746 711 675 649 642 657 693 741 786 808 797 764 734 717 710 708 714 731 756 775 778 761 728 689 658 647
-388 647 655 672 689 699 698 685 664 653 666 696 721 729 730 744 772 795 796 779 765 764 773 786 799 812 820 816 798 776 758 751 758 778 802 818 819 806 781 752 732 728 741
-393 741 756 760 750 735 725 721 718 710 698 687 685 689 689 679 668 659 652 641 632 630 632 631 635 652 680 706 728 756 793 822 826 812 795 787 784 786 792 795 783 756 720 680 642 618 622
-398 622 650 679 690 687 686 695 710 726 743 761 775 783 784 771 742 701 663 642 636 635 630 622 617 623 643 677 716 746 761 764 761 756 742 720 699 688 687 683 669 648 631 630 645
-404 645 668 685 685 675 672 685 698 698 691 688 689 677 646 609 585 581 600 641 692 729 739 727 714 711 714 718 717 709 692 674 659 649 642 646 665 695 719 727 721 709 695 683 676
-409F76jjoj2j7k5k8k2oORPRJ3J3PMJ8M4O0M1Kk4k5k2k5k0PL0K7Nnnj8l9l8qK7M2L7K7J1n
-414G70j1olj4k2j2KQNMOONOJj2j8pJj4l7l3lJ9J2kKJ4J9J5OkrqjJ0J7K1K0Mj8k9k4j7j7j1
-420F43LJ4J0%OK0K7K4K0J8J5J4K3L0J9qk8l2l4m4m2j6J8K9J5jJJ2J5QJmj2k7m0l9k3qjJP
-425F34J3Mj8l1k1ljj7k5j5LQPJ3K0J7LLJ9L3L0J8J7K2J5nj6j0LPok6m4m6k3J0L6M7M4L0Q
-430G57j8k5j4LJ2J3Qok2k8j8j0ppqj3j8pK1L6K2QK5M7L4ql0j2J3Qj4k5j9pNJ2Qpj1MJ9J4
-435G35MOJ3QmKK1K5Nj8k2j2%OPJj0j7j2KRRjrronj8l6m5l7k0KJ8K8K3J4J2J7J6NJJ5L7M3
-440H03L1J6Mj2l2l9k5lPNJklrj0pJJ0K0K4J9Lj4k5k8k3j4njOJ9L3K8Lj2kJ4Lk5l4j3J4J8
-446G44Kj1k1l3m4m1k6j2kJ1K1K4J9K2L4L1Ok5l6k5mJ2J8J4PQK0L2K6Nj3j6qoj2j8j5jJ7L0
$$ plain form
-409 676 675 674 668 656 639 614 586 564 558 564 573 580 589 602 615 622 626 644 688 748 789 791 767 742 720 695 675 682 712 739 744 739 734 716 677 639 631 658 700 737 764 775 770
-414 770 759 753 750 736 714 702 704 712 717 721 727 733 738 744 745 733 715 708 709 695 658 625 622 641 653 651 653 667 686 701 707 705 696 688 687 697 714 735 755 759 741 712 688 671 654 643
-420 643 646 660 670 670 676 696 723 747 767 785 800 814 837 867 886 878 850 818 784 740 698 682 700 729 744 743 744 756 771 779 780 776 764 737 697 658 635 627 626 627 634
-425 634 647 651 633 602 581 578 577 560 535 520 523 531 538 551 571 588 591 594 613 646 676 694 711 733 748 743 727 717 720 727 721 695 651 605 582 592 628 675 719 749 757
-430 757 739 714 700 703 715 728 736 730 708 680 662 652 645 638 630 617 599 592 613 649 671 679 704 751 785 777 747 735 748 756 742 717 698 691 696 708 716 709 698 702 721 735
-435 735 739 745 758 766 762 764 785 810 815 797 775 763 763 769 776 777 767 750 738 740 749 758 757 748 739 733 728 710 674 629 592 572 574 592 620 643 657 669 686 702 707 708 723 760 803
-440 803 834 850 854 842 810 771 746 743 750 755 756 754 751 742 732 725 726 736 756 780 799 802 788 763 735 712 698 693 692 698 717 750 778 781 769 767 781 784 759 725 712 726 744
-446 744 746 735 714 681 637 596 570 558 556 567 588 612 631 653 687 718 724 699 663 638 634 646 664 678 685 693 713 745 771 776 763 747 739 733 721 703 688 687 704 734
-451G34L8M0L8K9J4lk4m1m9m1k1QL5M3K4rl1k5j1j1k6l4k6rQK8M6M5K1lrmj0k3k6j0RJ0MJ
-456G29J%j0j7k2k5k2j1KQJnmKKoj4j6j4lJ7L3L0J2LJ2K4K2Mj3k5l1k3PL9M1J5plRQ%LJ5J0
-461G78j2l7m9n2m2j7RJ6lj9j7kJ2K0K6K6K0J6K0J7Jk2k8j5QJ9J5POJ5K0J4LPK4K9J6jqj6
-466H04l2m2k8rlqkJ0J2ONJ0Mj1j3LMj9l6k2J0K7K6K6K6J1j2k7k6k3j5KJ6Pj6k2%J9J3jKJ3
-471F89J2%pmoj0nQJ5J4J8K9L2J9lj3qQK4L1J7rk4j7KQ%qj1j3j9k5k2j3jJ0J4J2Lnonmonn
-477G11j0k0k2j3KRJ1J8K5K2Pj3k3k0pQJ4Pj0k1k5k5k9k7j3J1K9K9J5KNK0L6L8K6J1N%j1k8
-482G44m5n3m7k5OK4J7%lJ0J7Mj5j7mNKmLJ9L4L5K9K0J2jj4j5JJ1ml2m7l5j2RK6L7L3J2l%
-487G34Pkj4j0PJ4jj9k6k6k2pJ5K5J4KMJ0Jj9k7k0j1rjJ6K9K5OpqjPJ1RM%koj5j4MK0J2j5
$$ plain form
-451 734 772 812 850 879 893 890 866 825 776 735 714 722 757 800 824 815 784 759 748 737 711 677 651 642 650 678 724 769 790 787 778 774 764 741 715 705 714 724 728 729
-456 729 730 730 720 703 681 656 634 623 625 633 634 629 625 627 629 623 609 593 579 576 593 626 656 668 671 683 707 729 733 720 695 664 641 648 687 728 743 736 733 742 750 750 753 768 778
-461 778 766 729 680 628 586 569 578 594 591 572 555 553 565 585 611 637 657 673 693 710 711 689 661 646 654 673 688 695 701 716 736 750 753 760 784 813 829 828 820 804
-466 804 772 730 702 693 690 682 680 690 702 708 713 723 727 716 703 706 710 691 655 633 643 670 696 722 748 759 747 720 694 671 656 658 674 681 665 643 643 662 675 674 676 689
-471 689 701 701 694 690 684 674 669 677 692 706 724 753 785 804 801 788 780 788 812 843 860 851 827 810 812 820 820 812 801 788 769 744 722 709 708 718 732 744 747 742 736 731 727 721 716 711
-477 711 701 681 659 646 648 657 668 686 711 733 740 727 704 684 677 685 699 706 696 675 650 625 596 569 556 567 596 625 640 642 647 667 703 741 767 778 783 783 772 744
-482 744 699 646 599 574 580 604 621 621 618 628 645 649 634 617 613 618 620 616 619 638 672 707 736 756 768 767 753 738 739 750 746 714 667 632 620 629 655 692 725 737 734 734
-487 734 741 739 725 715 722 736 735 716 690 664 642 635 650 675 689 691 695 705 706 687 660 640 629 620 619 635 664 689 695 688 680 679 686 697 706 710 710 708 702 687 673 677 697 709 694
-492F94k8j0J7K5J5Koj0kJ9L3J3l0n3l5JJ6J5K0L1L7L2K6J7%k1l0k6k4k6j9KK5L5L2J9kk1
-497G83k5j4mlJQJ2jj7j4PJ8Qrj7j6j9k8k9qJ7K3Kj8j4OJ5Jj1mJ3J8J3Nrl1m5k8J3M4M2K2
-502G07PMNJnmjL%qj0nLKqrMK3L4K7J3%JM%j7k3mL1M6L2Npj3k6m3n0m5l1j6OK9L9K7Kk2l4
-508F74k7lK1K8J5%kQK1K8K8J5ql3n2o6o5m2MM5N7L6RjLOOKKJ0K2K6J1qrJ1K6J2j7k7rJ3J4
-513G84jj7j9j6j1plKJ0J1Jj7k8j7MJ9J5KpkOQjqqk%mrj5j8j1J0L1L3J7%mkrk1l1k7j1J3L1
-519F71K8J0pj3j1rKK0K9J5j1k3j5NK5L5K7PmMJ9J7Lmkpk5l7l5l2l1k2LK5K7J6Lqk0k6j6M
-524F37J7J5MKRJ8J8Lj6k3j9j1kJ3L4M1K4%rmjmljmrj0rj4j6q%%j2j8rNK1L8M7L9J3j2k8m1
-529G15n2m4j3J9K0nk7k7qJ6L2L1J2j6l6l2rJ7L7M4L9L2K0PkJJ7K6J6j1k8k7j4ommoj1j4n
$$ plain form
-492 694 666 656 673 698 713 715 709 699 697 716 749 762 732 679 644 645 661 676 696 727 764 796 822 839 839 818 788 762 738 712 693 695 720 755 787 806 804 783
-497 783 758 744 740 737 738 746 758 757 740 726 733 751 759 750 733 717 698 670 641 633 650 673 675 657 643 649 664 665 654 650 663 681 694 699 690 659 614 586 599 643 685 707
-502 707 714 718 723 724 719 715 714 717 717 709 699 694 697 699 691 682 686 709 743 770 783 783 784 788 788 771 748 744 775 821 853 858 851 838 812 769 719 674 643 627 633 662 701 728 730 708 674
-508 674 647 644 665 693 708 708 706 714 735 763 791 806 798 765 713 647 582 540 544 589 646 682 691 690 693 699 705 707 709 719 741 767 778 770 761 772 798 810 793 766 757 770 784
-513 784 783 766 747 731 720 713 710 712 722 733 734 717 689 672 676 695 710 712 705 703 709 717 716 708 700 698 698 694 685 670 652 641 651 682 715 732 732 728 726 717 696 665 638 627 640 671
-519 671 699 709 702 689 678 669 671 691 720 735 724 701 686 691 716 751 778 785 781 785 804 821 824 820 818 811 786 749 714 682 651 629 632 657 684 700 703 695 675 649 633 637
-524 637 654 669 673 675 684 702 720 723 707 684 665 654 652 665 699 740 764 764 755 751 750 746 743 742 738 729 719 710 696 680 672 672 672 660 642 633 638 659 697 744 783 796 784 756 715
-529 715 663 619 606 625 645 640 613 586 578 594 626 657 669 653 617 585 576 593 630 674 713 745 765 772 770 771 788 814 830 819 791 764 750 744 740 736 730 719 705 700
-534G00J3K2K0J3Nnj0kJ3J5j0l7m1k1rj5k2j7m%k%OJ0J7K6L3K7J3LMNjj0j8j9j4pmmlMJ0J4
-540F98J8J9J2mj5j3mJJPJ3Kk2m1m1k7j0OK2L0L0K4J6J0QJ7L5M5L6J5mk1m1n7o2n0l3j7oP
-544F04K4L7L4J3j2k2j6qlLJ1J9J5Mqj7j4JK3L2K4Qnj5j7j1oj2k8l2j6monJ4L8L9K1J2J6J4
-549G49LjNLj3k0rPOlj2j9k9l4k1kJ0J1J3K2K9K8K2J0lj6j8j4qj1k0l0k5j0RK0K1J7Qkrnl
-555F56pj1lPJj4j3J5L5K0j2j7J0L5L2J5MkmJRJ1lk0k2oJ3K2K1J2Kjkqk0k5j7mjj2j7j1%j
-560F68j6k7k2LK9L9L0J6Njnqj0j8k4j7PK6J5k1n0m8j8RJ6Q%MJ2J9K1K3K5K6J9Lj3j1PK7L0
-565G78J2j0k8l6l5j8PK6K8J7RMmrjJ5J8ml2l9k7j6j6j7qMJ1Nrj8j6jJ1J2PLKjkRK4K5%k9
-570F51l2j2RJ7J6J3Mrj1lOKk%RJ0Jqj6k2k4j5omq%J9L2K7Rlrj0jK1M0M1K4Ok%%Jjj1k1k5
$$ plain form
-534 700 713 735 755 768 773 768 758 756 769 784 774 737 696 675 666 651 629 612 608 608 606 606 612 622 639 665 698 725 738 741 745 750 749 739 721 702 688 681 677 673 670 674 684 698
-540 698 716 735 747 743 728 715 711 712 713 720 733 735 713 672 631 604 594 600 622 652 682 706 722 732 740 757 792 837 873 888 884 863 822 765 703 653 620 603 597 604
-544 604 628 665 699 712 700 678 662 654 651 654 665 684 699 703 695 678 664 665 688 720 744 752 747 732 715 704 698 686 658 626 610 606 600 595 609 647 686 707 719 735 749
-549 749 752 751 756 759 746 726 717 724 730 727 715 696 667 633 612 610 620 631 644 666 695 723 745 755 752 736 718 704 696 685 665 635 610 600 609 629 650 667 675 673 664 659 656
-555 656 649 638 635 642 643 629 616 631 666 686 674 657 667 702 734 749 753 751 747 748 757 768 765 745 723 717 730 752 773 785 787 786 784 776 756 731 714 710 709 697 680 669 669 668
-560 668 652 625 603 606 635 674 704 720 725 724 719 711 701 683 659 642 649 675 690 669 619 571 553 562 578 586 586 590 602 621 642 665 690 716 735 738 725 714 721 748 778
-565 778 790 780 752 716 681 663 670 696 724 741 750 754 750 741 740 755 773 769 737 698 671 655 639 622 614 618 629 634 625 607 591 590 601 613 620 623 625 624 622 631 655 680 680 651
-570 651 619 607 616 633 649 662 666 657 646 643 649 651 649 649 658 668 669 661 645 623 599 584 578 574 566 566 585 617 644 653 650 641 631 630 651 691 732 756 762 760 760 760 761 760 749 728 703
-576G03j4jPPRJ7K0Pj9m3m9l7j8nkk%OJ5K1J3nj8j4kNjppnnkLPPQJ4J5J5K1L6M1J8j7l7l4
-582F71k5k0j0LPok0j3QK6L2L2K8Rj8l4k6%K3K6J7NMJ1J7Qrk1k1j1JJ4K8L5K3%j8j2RK1J1
-587H05j3l2m0m6m9m1j7J4L6M2M0K7J2kmKJ1Pqk5l5k7nJ2J7J5J0ol7n4l5J2M3L7J2%jlj2j7
-592F45j7j7j0J0K7K2NonnqkJ5K5J4ok0k1j5pjjlMJ0Rmrkjrj0J1L1K7RJNKrpORKjOKj7k8j2
-598F44J5K4Qn%J9L5L0Lk8l9k7qNJ8L0K6ll0l1j0K%JJ4K7L0K6J9Oqj1JJ8J9Kk3l8l5k3j6k2
-603F65k6k1pOJ5J9J7QJLJ5K0Qj0k1k1j4oKQJ0J0Pjj4k6l3l3k7j2RL1M0L5K8K7L2K9J1j3k5
-608G46j9JJ8K5J4rl8n6n3l6j5m%NRQjomjlj1j0jMKmJJ4K2K3K4K5K1J1NPNnj2mQJ1MjKJ1J8
-614G51K3J5pk7k8j5kQK0K4Rj4j9p%j1k2j8j1j7k2rJ4K3J2JLJ2J7J7Pqk1j7LK0J6nk3j9KK1
$$ plain form
-576 703 689 688 695 702 711 728 748 755 736 693 644 607 589 584 582 580 580 586 601 622 635 630 612 598 596 601 600 593 586 581 576 574 577 584 591 599 613 628 643 664 700 741 759 742 705 671
-582 671 646 626 616 619 626 620 600 587 595 621 653 685 713 722 704 670 644 644 667 693 710 715 719 730 747 755 746 725 704 693 694 708 736 771 794 794 776 764 773 794 805
-587 805 792 760 720 674 625 584 567 581 617 659 699 726 738 736 732 734 745 752 744 719 684 657 652 664 681 696 706 700 663 609 574 586 629 666 678 678 677 674 662 645
-592 645 628 611 601 611 638 660 665 659 654 649 641 639 654 679 693 687 667 646 631 624 623 622 619 623 633 642 638 629 627 626 617 607 618 649 676 685 686 691 693 684 677 683 692 694 693 699 701 684 656 644
-598 644 659 683 691 686 686 705 740 770 773 745 706 679 671 676 694 724 750 747 717 686 676 678 678 679 693 720 750 776 795 801 793 782 783 801 820 822 799 761 726 703 687 665
-603 665 639 618 611 617 632 651 668 676 677 680 695 715 723 713 692 671 657 651 653 661 671 681 688 687 673 647 614 581 554 542 551 582 622 657 685 712 744 773 784 771 746
-608 746 727 728 746 771 785 776 738 682 629 593 578 574 574 579 588 596 595 589 585 584 581 570 560 559 563 565 561 562 576 598 621 645 670 691 702 707 714 719 714 702 698 706 717 721 720 722 733 751
-614 751 774 789 782 755 727 712 710 718 738 762 771 757 738 731 731 720 698 680 669 652 630 621 635 658 670 671 674 686 703 720 727 719 698 681 684 704 720 715 692 673 675 696
-619F96J5rk7k4pPJ2J2Onj4pOJ4J3J1J3J1Olj3k4k7j8jJ2J8K2K3J3j1k8k6nJ4K8L1K6Rj0k3
-624G36k5k0pOJ3Lj0j5j1j0j8k4j4QK0J4pj8oJ9L4K4Lrrj2k1k3pK1L9L8K7J7Oj1l2m3l7k1
-629F18mJ1J6Qrk4k5j9j1JK4M5L9Pk3k7j4qoLK0L2L0K1J2Jj4k9k9j3J2L1L6K6J2J%mj4k9l7
-634F67l1j7%RQKlm%LPJ3K1L0K9K0J2J1J7J1j1l7n0m4l0j5kKnj3mJ7K3PnJ3L9L8Kk8k4LJ5
-639F96Orj3j1qonnpqqj5k7l0j3J4L0L0J2pj4jK5M0K8Kj9k3j1LJ4J6NpqMJ4J1jpkOPKjQK2
-645G29L6L6K4J0OPOnj6j7j1j1k4l7l7k2JJ5J2NLRJk6n3n0k4%KLJ4K3J2j3k6j7kNJ4K4L0L2
-650F68L6M2K9jk5k3ronQK1J3j5l2j7QJ5jj9k4j6rj8l7n1m2j9NJ9K9L5L4K7J5Jj6k5j6LJ0
-655E92Kpj0j3j3MK8L4J3rr%nk3l0j8NK9M1L3J0mMJ5J1JNJ4Oj6k6j8pjPJ0jj9j6OJ9J3QK0
$$ plain form
-619 696 711 702 675 651 644 651 663 675 681 676 662 655 661 675 688 699 712 723 729 726 713 689 662 644 643 655 673 695 718 731 720 692 666 661 675 703 734 760 769 759 736
-624 736 711 691 684 690 703 706 696 681 670 660 642 618 604 612 632 646 639 621 615 634 668 692 695 686 677 665 644 621 614 635 674 712 739 756 762 751 719 676 639 618
-629 618 614 625 641 649 640 616 591 572 561 562 586 631 670 677 654 627 613 605 599 602 622 654 684 705 717 718 704 675 646 633 645 676 712 738 750 751 751 747 733 704 667
-634 667 636 619 619 628 636 638 635 631 631 634 641 654 675 705 734 754 766 777 794 805 794 757 707 663 633 618 616 618 613 600 596 613 636 643 638 651 690 728 730 702 678 681 696
-639 696 702 693 680 669 661 655 650 645 638 630 622 607 580 550 537 551 581 611 623 616 602 601 626 666 694 696 677 654 643 646 660 676 681 674 666 670 684 695 694 687 685 691 698 700 699 707 729
-645 729 765 801 825 835 841 848 854 849 833 816 805 794 770 733 696 674 675 690 702 707 710 719 720 694 641 591 567 567 569 572 586 609 621 608 582 565 563 568 582 606 636 668
-650 668 704 746 775 774 749 726 717 711 706 714 735 748 733 701 684 692 707 706 687 663 647 638 620 583 532 490 471 476 495 524 559 593 620 635 636 620 595 579 582 592
-655 592 594 587 577 564 551 555 583 617 630 621 612 612 607 584 554 536 541 570 611 644 654 650 654 669 680 681 686 700 706 690 664 646 639 638 645 655 654 635 619 625 644 657 665 685
-660F85L0J7qk3k9l2k6qJ3K1J9J7J0%mLJj7l1j9%kj3mK2K8%k8k5%J3Mrj6j0LJ4RlmJ1K5J4
-666F48nj1LJ7J7J1N%orpoj0j1j0j4k4k9j2K0L5J7j6l0j2K2M6M5K6MrqmjOK0K9J9mk2k5k2
$$ plain form
-660 685 715 732 724 701 672 640 614 606 619 640 659 676 686 686 682 685 686 669 638 619 619 617 604 600 622 650 650 622 597 597 610 614 605 589 579 582 596 605 602 598 609 634 648
-666 648 643 632 635 652 669 680 685 685 679 670 663 657 647 636 626 612 588 559 547 567 602 619 603 573 561 583 629 674 700 704 695 687 683 682 688 708 737 756 752 730 705 683
$$ [...]
-1604F42
##END=	
##END=	
