##TITLE=	N$kDJk$KRVyOQWXwqXlJJQ.41.ser
TM-VI-156 cosy

##JCAMP-DX=	6.0	$$ MestReNova 14.3.0-30573
##DATA TYPE=	LINK
##BLOCK_ID=	1
##BLOCKS=	2    
##ORIGIN=	Mestrelab Research S.L.
##OWNER=	hrzepa
##$MNOVA/LINK_BLOCK_TYPE=	ITEM	$$ NMR Spectrum
##$MNOVA/ITEM/POLYGON=	(XY..XY)
5321,5835
8722,5835
8722,8208
5321,8208
5321,5835
##$MNOVA/ITEM/Z=	0
##$MNOVA/ITEM/ANGLE=	0
##TITLE=	N$kDJk$KRVyOQWXwqXlJJQ.41.ser
##JCAMP-DX=	6.0	$$ MestReNova 14.3.0-30573
##BLOCK_ID=	2
##DATA TYPE=	MNOVA NMR VIEW DATA
##DATA CLASS=	MNOVA VIEW DATA
##$MNOVA/2D/THRESHOLD=	73.05966949462890625
##$MNOVA/ITEM/ZOOM/X=	-0.98001264966690615488,	11.003459999979801509
##$MNOVA/ITEM/ZOOM/Y=	-0.98001264966690615488,	11.003459999979801509
##END=	
##TITLE=	N$kDJk$KRVyOQWXwqXlJJQ.41.ser
##JCAMP-DX=	6.0	$$ MestReNova 14.3.0-30573
##BLOCK_ID=	3
##DATA TYPE=	nD NMR SPECTRUM
##DATA CLASS=	NTUPLES
##NUMDIM=	2
##ORIGIN=	Bruker BioSpin GmbH
##OWNER=	nmr
##.OBSERVE FREQUENCY=	400.41200205000001233
##.OBSERVE NUCLEUS=	^1H
##.SOLVENT NAME=	CD2Cl2
##.PULSE SEQUENCE=	cosygpqf
##LONGDATE=	2021/11/10 13:47:53.000
##.ACQUISITIONMODE=	SIMULTANEOUS (DQD)
##$ORIGINAL FORMAT=	Bruker XWIN-NMR
##$MNOVA/SCALES_VERSION=	9
##$PARAMETER FILE=	(acqu2s, ASCII, /private/var/folders/f6/rjf_tdyn2v98c5c0wvkgn4s80000gn/T/N$kDJk$KRVyOQWXwqXlJJQ/41/acqu2s, 0)
$$ ##TITLE= Parameter file, TOPSPIN		Version 3.2
$$ ##JCAMPDX= 5.0
$$ ##DATATYPE= Parameter Values
$$ ##NPOINTS= 121	$$ modification sequence number
$$ ##ORIGIN= Bruker BioSpin GmbH
$$ ##OWNER= nmr
$$ $$ 2021-11-10 13:56:48.631 +0000  nmr@CZC10666PP
$$ $$ /opt/topspin/data/agmb/nmr/Nov10-2021/41/acqu2s
$$ $$ process /opt/topspin3.2/prog/mod/go
$$ ##$ACQT0= 0
$$ ##$BF1= 400.41
$$ ##$FnMODE= 1
$$ ##$NUC1= <1H>
$$ ##$NusJSP= 0
$$ ##$NusT2= 1
$$ ##$NusTD= 120
$$ ##$O1= 2002.04999998732
$$ ##$SFO1= 400.41200205
$$ ##$SW= 12.0068636381483
$$ ##$SW_h= 4807.69230769231
$$ ##$TD= 120
$$ ##END=
$$ 
##$PARAMETER FILE=	(acqus, ASCII, /private/var/folders/f6/rjf_tdyn2v98c5c0wvkgn4s80000gn/T/N$kDJk$KRVyOQWXwqXlJJQ/41/acqus, 0)
$$ ##TITLE= Parameter file, TOPSPIN		Version 3.2
$$ ##JCAMPDX= 5.0
$$ ##DATATYPE= Parameter Values
$$ ##NPOINTS= 12	$$ modification sequence number
$$ ##ORIGIN= Bruker BioSpin GmbH
$$ ##OWNER= nmr
$$ $$ 2021-11-10 13:56:52.678 +0000  nmr@CZC10666PP
$$ $$ /opt/topspin/data/agmb/nmr/Nov10-2021/41/acqus
$$ $$ process /opt/topspin3.2/prog/mod/shimcntl
$$ ##$ACQT0= 1000000
$$ ##$AMP= (0..31)
$$ 100 100 100 100 100 100 100 100 100 100 100 100 100 100 100 100 100 100
$$ 100 100 100 100 100 100 100 100 100 100 100 100 100 100
$$ ##$AMPCOIL= (0..19)
$$ 0 0 0 0 0 0 0 0 0 0 0 0 0 0 0 0 0 0 0 0
$$ ##$ANAVPT= -1
$$ ##$AQSEQ= 0
$$ ##$AQ_mod= 3
$$ ##$AUNM= <au_zg>
$$ ##$AUTOPOS= <31 >
$$ ##$BF1= 400.41
$$ ##$BF2= 400.41
$$ ##$BF3= 400.41
$$ ##$BF4= 400.41
$$ ##$BF5= 400.41
$$ ##$BF6= 400.41
$$ ##$BF7= 400.41
$$ ##$BF8= 400.41
$$ ##$BYTORDA= 0
$$ ##$CAGPARS= (0..11)
$$ 0 0 0 0 0 0 0 0 0 0 0 0
$$ ##$CFDGTYP= 0
$$ ##$CFRGTYP= 9
$$ ##$CHEMSTR= <none>
$$ ##$CNST= (0..63)
$$ [...]
$$ 0 0 0 0 0 0 0 0 0 0 0 0 0 0 0 0 0 0 0 0 0 0 0 0 0 0 0 0 0 0 0 0 0 0 0 0
$$ 0 0 0 0
$$ ##$ShimPowMaxUC= (0..63)
$$ 130000 130000 130000 130000 130000 130000 130000 130000 130000 130000 130000
$$ 130000 130000 130000 130000 130000 130000 130000 130000 130000 0 0 0 0
$$ 0 0 0 0 0 0 0 0 0 0 0 0 0 0 0 0 0 0 0 0 0 0 0 0 0 0 0 0 0 0 0 0 0 0 0 0
$$ 0 0 0 0
$$ ##$ShimPowMaxUG= (0..63)
$$ 524287 524287 524287 524287 524287 524287 524287 524287 524287 524287 524287
$$ 524287 524287 524287 524287 524287 524287 524287 524287 524287 0 0 0 0
$$ 0 0 0 0 0 0 0 0 0 0 0 0 0 0 0 0 0 0 0 0 0 0 0 0 0 0 0 0 0 0 0 0 0 0 0 0
$$ 0 0 0 0
$$ ##$ShimPowRcbType= 3
$$ ##$ShimPowRes= (0..63)
$$ 1e-20 1e-20 1e-20 1e-20 1e-20 1e-20 1e-20 1e-20 1e-20 1e-20 1e-20 1e-20
$$ 1e-20 1e-20 1e-20 1e-20 1e-20 1e-20 1e-20 1e-20 0 0 0 0 0 0 0 0 0 0 0 0
$$ 0 0 0 0 0 0 0 0 0 0 0 0 0 0 0 0 0 0 0 0 0 0 0 0 0 0 0 0 0 0 0 0
$$ ##$ShimPowRng0= (0..63)
$$ 1 1 1 1 1 1 1 1 1 1 1 1 1 1 1 1 1 1 1 1 0 0 0 0 0 0 0 0 0 0 0 0 0 0 0 0
$$ 0 0 0 0 0 0 0 0 0 0 0 0 0 0 0 0 0 0 0 0 0 0 0 0 0 0 0 0
$$ ##$ShimPowRng1= (0..63)
$$ 1 1 1 1 1 1 1 1 1 1 1 1 1 1 1 1 1 1 1 1 0 0 0 0 0 0 0 0 0 0 0 0 0 0 0 0
$$ 0 0 0 0 0 0 0 0 0 0 0 0 0 0 0 0 0 0 0 0 0 0 0 0 0 0 0 0
$$ ##$ShimPowRng2= (0..63)
$$ 1 1 1 1 1 1 1 1 1 1 1 1 1 1 1 1 1 1 1 1 0 0 0 0 0 0 0 0 0 0 0 0 0 0 0 0
$$ 0 0 0 0 0 0 0 0 0 0 0 0 0 0 0 0 0 0 0 0 0 0 0 0 0 0 0 0
$$ ##$ShimPowRng3= (0..63)
$$ 1 1 1 1 1 1 1 1 1 1 1 1 1 1 1 1 1 1 1 1 0 0 0 0 0 0 0 0 0 0 0 0 0 0 0 0
$$ 0 0 0 0 0 0 0 0 0 0 0 0 0 0 0 0 0 0 0 0 0 0 0 0 0 0 0 0
$$ ##$ShimSysFunc= (0..63)
$$ 1 2 3 4 5 7 9 11 15 16 8 10 12 14 6 17 13 18 19 20 0 0 0 0 0 0 0 0 0 0
$$ 0 0 0 0 0 0 0 0 0 0 0 0 0 0 0 0 0 0 0 0 0 0 0 0 0 0 0 0 0 0 0 0 0 0
$$ ##$ShimSysMatrix= 0
$$ ##$ShimSysType= 1
$$ ##$TFXNUM= 0
$$ ##$TRIPLO2= 0
$$ ##$VTU= 2
$$ ##$VTUETH= <149.236.99.20>
$$ ##$VTUTY= <no>
$$ ##$WBREFAM= (0..15)
$$ 135 116 100 100 100 100 100 100 100 100 100 100 100 100 100 100
$$ ##$WBREFLM= (0..15)
$$ 0 0 0 0 0 0 0 0 0 0 0 0 0 0 0 0
$$ ##$WBREFPH= (0..15)
$$ 71.66 -68.25 0 0 0 0 0 0 0 0 0 0 0 0 0 0
$$ ##$WBSGU= (0..15)
$$ 0 0 0 0 0 0 0 0 0 0 0 0 0 0 0 0
$$ ##$XFAC= 2
$$ ##END=
$$ 
##$DECIM=	4160
##$DSPFVS=	20
##.ACQUISITIONSCHEME=	NOT PHASESENSITIVE
##NTUPLES=	nD NMR SPECTRUM
##VAR_NAME=	FREQUENCY1,	FREQUENCY2,	SPECTRUM
##SYMBOL=	F1,	F2,	Y
##.NUCLEUS=	1H,	1H
##.OBSERVE FREQUENCY=	400.41200205000001233,	400.41200205000001233
##VAR_TYPE=	INDEPENDENT,	INDEPENDENT,	DEPENDENT
##VAR_FORM=	AFFN,	AFFN,	ASDF
##VAR_DIM=	512,	512,	262144
##UNITS=	HZ,	HZ,	ARBITRARY UNITS
##FIRST=	4405.895418600002813,	4405.895418600002813,	0.1008054390549659729
##LAST=	-392.40686505384644533,	-392.40686505384644533,	0.35623416304588317871
##MIN=	-392.40686505384644533,	-392.40686505384644533,	0.0018858278635889291763
##MAX=	4405.895418600002813,	4405.895418600002813,	7970.44384765625
##FACTOR=	1,	1,	0.0049693432779828123139
##PAGE=	F1=4405.9
##FIRST=	4405.895418600002813,	4405.895418600002813,	0.1008054390549659729
##DATA TABLE=	(F2++(Y..Y)), PROFILE
$$ [...]
##PAGE=	F1=-2561.5
##FIRST=	4405.895418600002813,	4405.895418600002813,	0
##DATA TABLE=	(F2++(Y..Y)), PROFILE
##PAGE=	F1=-2580.28
##FIRST=	4405.895418600002813,	4405.895418600002813,	0
##DATA TABLE=	(F2++(Y..Y)), PROFILE
$$ plain form
4406 58 83 86 14 98 15 67 162 63 83 57 167 108 36 63 50 26 87 110 44 100 44 108 196 254 69 125 171 29 71 27 128 149 196 234
4087 234 134 94 88 141 233 88 59 5 11 101 79 89 113 101 71 100 73 87 33 71 90 33 53 33 104 59 26 135 150 84 57 24 197 61
3767 61 163 78 83 57 137 44 92 97 139 117 136 40 116 121 36 20 146 133 78 107 85 39 53 68 87 103 49 10 86 110 80 13 59 96 108 128
3429 128 106 76 128 83 3 102 119 102 118 57 133 23 57 61 197 78 244 238 142 180 285 148 2 34 42 74 88 190 139 122 74 48
3129 48 48 13 140 251 175 32 68 96 140 191 182 85 321 366 410 181 138 137 87 102 52 115 136 136 16 48 75 100 98 186 158 133 167 109 91
2800 91 83 94 186 450 535 180 92 246 154 80 130 120 69 87 191 31 123 168 155 105 112 19 106 196 90 38 115 23 47 61 65 39 42 82
2481 82 90 71 135 62 72 97 43 105 176 43 112 10 133 137 51 163 74 32 82 150 145 685 1478 1904 491 262 186 116 96 108 186 100
2180 100 76 100 388 554 184 38 212 112 71 58 46 63 4 71 16 175 281 175 33 16 14 97 73 43 21 42 69 65 99 104 29
$$ packed form
4406E8K5Lp2Q4q3N2R5r9K0k6J10n9p2K7j3k4O1K3o6N6n6O4Q8N8j85N6M6j42M2m4J01K1M7L8
4087B34j00m0oN3R2j45k9n4OR0k2J0K4j2l0K9k7J4n4L8J9n7K0k0P1m5l3J09J5o6k7l3J73j36
3767F1J02q5Nk6Q0r3M8NM2k2J9r6P6Nq5j6J26j3n5K9k2m6J4J5J9J6n4l9P6K4l0o7M6L7J2K0
3429A28k2l0N2m5q0R9J7j7J6o1P6j10L4MJ36j19J66or6L8J05j37j46L2QL2J4J02n1j7m8k6
3129D8%l5J27J11p6j43L6K8M4N1rr7K36M5M4k29m3jn0J5n0O3K1%j20L2K7K5kQ8k8k5L4n8j8
2800I1qJ1R2K64Q5l55q8J54r2p4N0j0n1J8J04j60R2M5j3n0Pr3Q7R0j06n2P7r2K4J4Mk6LM0
2481H2Qj9O4p3J0K5n4O2P1j33O9j02J23Mq6J12q9m2N0O8nN40P93M26j413k29p6p0k0J2P8q6
2180A00k4K4K88J66l70j46J74j00m1j3j2J7n9O7n5J59J06j06j42j7kQ3k4l0k2K1K7mL4Np5
$$ plain form
1889 29 80 147 165 66 78 154 146 87 22 173 77 113 87 53 85 85 55 137 90 104 211 63 106 56 88 29 75 87 170 101 119 210 24 40
1570 40 100 159 464 1566 1900 429 194 25 26 134 149 82 100 88 28 109 127 175 235 286 271 91 72 98 164 39 136 90 103 88
1288 88 68 84 83 85 86 190 179 104 136 245 69 36 68 43 48 48 117 106 143 10 86 161 10 38 55 138 184 49 73 128 101 227 49 139
969 139 101 95 184 74 35 154 148 252 239 598 157 119 294 359 244 167 601 256 309 112 1473 12429 18216 2021 2584 1108
725 1108 520 379 383 106 181 283 137 97 290 160 99 76 56 224 194 394 533 472 232 126 136 268 66 60 153 93 100 96 50 23
443 23 53 133 129 121 29 166 212 36 155 24 164 192 113 154 149 219 82 93 48 93 131 90 112 52 84 123 75 109 152 53 80 166 52 96
124 96 144 168 167 215 131 154 143 66 13 19 55 43 139 185 161 27 34 129 141 35 63 65 61 51 151 72 18 35 64 73 120 128 178 123 79 180 213
-223 213 158 78 62 123 89 33 90 78 75 241 105 66 57 92 46 182 55 53
$$ packed form
1889B9N1O7J8r9J2P6qn9o5J51r6L6k6l4L2%l0Q2m7J4J07j48M3n0L2n9M6J2Q3o9J8R1j86J6
1570D0O0N9L05J102L34j471k35j69JJ08J5o7J8j2o0Q1J8M8O0N1j5j80j9K6O6j25R7m6J3j5
1288H8k0J6jKJJ04j1p5L2J09j76l3L2k5N%O9j1L7j33P6P5j51K8J7Q3M6j35K4N5k7J26j78R0
969A39l8oQ9j10l9J19oJ04j3L59m41l8J75O5j15p7M34l45N3j97J361J0956N787j6195N63j476
725A108n88j41Mk77P5J02j46m0J93j30o1k3k0J68l0K00J39o1k40j06J0J32k02oR3o0Pmm6k7
443B3L0Q0mqr2J37M6j76J19j31J40K8p9M1nP0j37J1m5M5L8m1K2o0L2L9m8L4M3r9K7Q6j14M4
124I6M8K4jM8q4K3j1p7n3OL6j2R6M6k4j34PR5J2j06K8Kmj0J00p9n4J7K9RM7QN0n5m4J01L3
-223B13n5q0j6O1l4n6N7j2lJ66j36l9rL5m6J36j27k
-392E3
##PAGE=	F1=-2599.06
##FIRST=	4405.895418600002813,	4405.895418600002813,	0
##DATA TABLE=	(F2++(Y..Y)), PROFILE
$$ plain form
4406 91 62 92 28 95 27 125 179 83 96 54 177 112 45 65 75 27 84 100 28 102 29 61 191 263 73 128 174 44 33 19 122 183 191
4096 191 252 135 57 70 143 235 112 66 52 26 77 97 75 106 102 57 83 74 105 48 82 134 77 87 37 92 36 20 105 158 87 53 24 210
3777 210 74 134 92 109 21 114 16 78 103 153 116 119 25 90 103 27 22 126 120 78 116 87 50 41 53 69 87 58 28 77 110 125 45 51 93 86 118
3429 118 88 69 128 71 24 89 133 117 122 61 149 34 58 73 223 110 183 154 131 159 261 95 32 28 19 57 104 218 133 122 51 78 99
3119 99 25 136 221 169 21 45 67 147 202 142 42 178 423 429 168 158 118 81 108 48 93 155 154 5 42 89 127 126 183 169 162 181 106 93
2800 93 57 134 231 445 470 238 139 273 203 110 133 114 87 115 194 31 130 150 125 82 99 34 114 200 74 19 91 61 69 55 96 78 32
2490 32 78 100 96 110 65 111 108 52 87 166 67 102 19 164 188 63 171 63 14 79 187 67 783 1543 1759 549 296 177 120 85
2209 85 91 174 105 79 147 338 558 208 58 232 118 27 53 87 82 7 75 50 149 256 164 46 33 51 92 62 80 16 67 63 47 101 76
$$ packed form
4406I1k9L0o4O7o8R8N4r6J3m2J23o5o7K0J0m8N7J6p2P4p3L2J30P2j90N5M6j30j1j4J03O1Q
4096A91O1j17p8J3P3R2j23m6j4k6N1K0k2L1mm5K6rL1n7L4N2n7J0n0N5n6j6Q5N3p1l4k9J86
3777B10j36O0m2J7q8R3r8O2K5N0l7Lr4O5J3p6nJ04om2L8k9l7rJ2J6J8k9l0M9L3J5q0OM2pL2
3429A18l0j9N9n7m7O5M4j6No1Q8j15K4J5J50j13P3k9k3K8J02j66o3mrL8M7J14q5j1p1K7K1
3119I9p4J11Q5n2j48K4K2Q0N5o0j00J36K45Ok61j0m0l7K7o0M5O2jj49L7M7L8jN7j4pJ9p5j3
2800I3l6P7R7K14K5k32r9J34p0r3K3j9k7K8P9j63R9K0k5m3J7o5Q0Q6j26n5P2l0Qj4M1j8m6
2490C2M6K2mJ4m5M6ln6L5P9r9L5q3J45K4j25J08j08m9O5J08j20P16P60K16j210k53j19n7l5
2209H5OQ3o9k6O8J91K20l50j50J74j14r1K6L4np5O8k5R9J07r2j18j3J8M1l0J8o4N1mj6N4k5
$$ plain form
1899 76 7 76 133 195 98 53 168 147 67 22 210 78 111 96 85 69 84 68 158 79 130 244 78 81 68 48 35 84 114 184 135 108 196
1589 196 40 58 153 161 612 1567 2315 732 259 23 63 153 167 76 79 61 53 97 152 176 272 294 246 83 69 87 153 27 101 70 138
1298 138 144 87 119 109 63 70 160 202 161 125 195 56 16 47 56 32 56 131 124 119 54 82 146 9 32 28 175 189 53 59 115 116 245 58 96 122
960 122 50 149 67 57 145 177 281 360 899 404 69 287 327 304 439 693 319 265 294 1097 9676 12418 1457 2054 949 502
716 502 368 361 130 181 215 54 160 252 143 74 76 58 199 105 433 646 694 278 92 120 296 51 81 186 116 80 95 85 65 92
434 92 128 142 99 43 202 190 52 142 29 130 174 99 117 158 170 90 97 61 95 140 113 136 35 110 136 58 112 166 85 61 161 55 78
124 78 109 137 172 223 157 91 134 85 30 23 64 39 148 143 158 53 31 85 140 54 91 58 65 28 137 43 15 57 80 60 112 142 190 139 121 170
-214 170 201 160 78 47 98 44 27 57 117 77 224 110 98 33 67 85 181 63 49
$$ packed form
1899G6o9O9N7O2r7m5J15k1q0m5J88j32L3j5j1j6J5j6R0p9N1J14j66Lj3k0j3M9L0P0m9k7Q8
1589A96j56J8R5QM51R55P48j583m73k36M0R0J4r1Lj8qM4N5K4R6K2m8j63j4J8O6j26P4l1O8
1298A38On7L2j0m6PR0M2m1l6P0j39m0L1Rk4K4P5pno5K8O4j37K3mJ47J4j36ON6JJ29j87L8K6
960A22p2R9q2j0Q8L2J04P9N39m95l35K18M0k3J35K54l74n4K9Q03Q579K742j0961N97j105m47
716E02j34pk31N1L4j61J06R2j09o9Kj8J41r4L28K13M8m16j86K8J76k45L0J05p0l6J5j0k0K7
434I2L6J4m3n6J59j2j38R0j13J01M4p5J8M1J2q0Pl6L4M5k7K3j01P5K6p8N4N4q1k4J00j06K3
124G8L1K8L5N1o6o6M3m9n5pM1k5J09nJ5j05k2N4N5q6L7l3Pl7J09r4k8M2K3k0N2L0M8n1j8M9
-214A70L1m1q2l1N1n4j7L0O0m0J47j14j2o5L4J8R6j18j4
-392D9
##PAGE=	F1=-2617.84
##FIRST=	4405.895418600002813,	4405.895418600002813,	0
##DATA TABLE=	(F2++(Y..Y)), PROFILE
$$ plain form
4406 129 36 74 68 94 57 174 176 105 112 83 158 112 65 88 89 75 59 94 52 91 10 26 164 240 85 139 154 90 25 46 104 187 179 264 130
4077 130 23 60 146 237 122 54 107 51 68 104 56 91 90 32 61 93 104 81 84 176 120 117 58 74 28 65 78 160 73 56 64 207 96 90 97 131
3739 131 30 89 25 54 105 150 99 89 53 54 95 38 57 107 107 72 115 67 69 55 31 56 53 62 67 62 122 177 89 46 84 78 106 71 97 135 59 40
3382 40 75 149 128 119 58 158 52 56 92 258 127 109 55 111 139 225 63 52 29 29 55 108 213 108 128 67 97 132 30 128 191 140 38
3073 38 3 44 143 196 92 108 101 423 451 164 178 108 99 105 28 68 177 167 37 29 99 150 145 174 173 171 185 107 94 24 167 266 427 410 288
2744 288 177 280 233 169 125 95 99 145 193 30 131 128 86 58 84 58 130 188 56 12 84 93 97 55 122 124 15 75 105 128 89 63 139 127
2425 127 77 78 159 89 86 55 199 219 79 158 74 10 95 222 17 845 1765 1747 574 350 165 134 76 77 188 99 90 202 256 532
2143 532 207 85 234 134 48 65 116 98 26 94 79 118 224 167 76 89 88 92 40 110 44 86 57 68 104 38 36 80 108 209 120 35 187
$$ packed form
4406A29r3L8oK6l7J17Kp1Pk9P5m6m7K3Jj4j6L5m2L9q1J6J38P6j55N4J5o4o5K1N8Q3qQ5j34
4077A30j07L7Q6R1j15o8N3n6J7L6m8L5jn8K9L2J1k3LR2n6ln9J6m6L7J3Q2q7j7QJ43j11oPL4
3739A31j01N9o4K9N1M5n1j0l6JM1n7J9N0%l5M3m8Kj4k4K5lRNnO0N5q8m3L8oK8l5K6L8p6j9
3382D0L5P4k1ro1J00j06ML6J66j31j8n4N6K8Q6j62j1k3%K6N3J05j05K0o1L0L5j02R8O3n1j02
3073C8l5M1R9N3j04J6pL22K8k87J4p0rOp7M0J09j0j30qP0N1nK9jkJ4p8j3p0J43R9J61j7j22
2744B88j11J03m7o4m4l0MM6M8j63J01lm2k8K6k6P2N8j32m4P2RMm2O7Kj09O0L0K3l9k6P6j2
2425A27n0JQ1p0ll1J44K0j40P9q4o4Q5J27k05Q28R20j8j173k24j85l1n8JJ11q9rJ12N4K76
2143E32l25j22J49j00q6J7N1j8p2O8j5L9J06n7r1J3jMn2P0o6M2k9J1L6o6kM4K8J01q9q5J52
$$ plain form
1833 187 134 31 16 255 136 229 91 177 57 75 70 162 65 166 252 90 71 87 67 51 101 149 164 160 116 181 50 89 220 180 744
1542 744 1623 2841 1051 330 28 114 161 176 81 64 44 66 100 174 155 304 295 202 96 63 80 131 12 65 65 162 204 85 164 103
1260 103 16 71 100 194 237 117 111 40 40 55 125 68 91 123 133 113 108 81 99 47 30 67 233 154 45 104 120 188 206 115 81 145 46 111 114
932 114 157 69 209 304 507 1140 711 147 347 237 374 587 806 498 297 849 1193 4641 9499 6141 703 818 634
716 634 444 209 364 251 18 178 296 238 88 26 134 169 115 238 509 661 867 273 17 178 327 13 171 200 101 84
471 84 57 160 89 155 90 178 96 86 243 133 86 92 50 140 180 87 77 199 102 121 73 95 111 147 137 133 52 131 142 32 96 179 109 95
152 95 125 81 44 94 92 184 235 155 27 117 103 53 27 90 50 132 76 141 75 26 61 151 85 132 55 79 26 130 36 44 95 90 61 104 147 194
-186 194 172 141 152 167 162 85 52 56 5 13 7 149 71 210 126 99 59 42 130 155 72 45
$$ packed form
1833A87n3j03j5K39j19R3j38Q6j20J8nR2r7J01Q6j62j9J6k0j6N0M8J5mm4O5j31L9J31m0N64
1542G44Q79J218j790p21l02Q6M7J5r5j7k0K2L4P4j9J49rr3j06l3J7N1j19N3%R7M2j19P9o1
1260A03q7N5K9R4M3j20op1%J5P0n7K3L2J0k0nk7J8n2j7L7J66p9j09N9J6O8J8r1l4O4r9O5L
932A14M3q8J40R5K03O33m29n64K00j10J37K13K19l08k01N52L44L448M858l358n438J15j84
716F34j90k35J55j13k33J60J18n8j50o2J08L5n4J23K71J52K06n94k56J61J49l14J58K9r9j7
471H4k7J03p1O6o5Q8q2j0J57j10m7Om2R0M0r3j0J22r7J9m8K2J6L6j0mq1P9J1j10O4Q3p0j4
152I5L0m4l7N0kR2N1q0j28R0j4n0k6O3m0Q2n6O5o6m9L5R0o6M7p7K4n3J04r4QN1nk9M3M3M7
-186A94k2l1J1J5np7l3Mn1QoJ42p8J39q4k7m0j7Q8K5q3k7
-392D5
##PAGE=	F1=-2636.62
##FIRST=	4405.895418600002813,	4405.895418600002813,	0
##DATA TABLE=	(F2++(Y..Y)), PROFILE
$$ plain form
4406 165 48 38 117 123 83 202 154 120 127 133 124 117 98 131 89 117 14 104 91 81 19 28 126 192 92 156 119 131 37 51 79 159 157 267 123
4077 123 32 59 149 231 118 33 152 71 75 106 35 73 69 37 38 122 87 113 76 209 157 137 80 60 67 118 59 145 55 65 101 189 114 41 94
3749 94 153 90 61 40 21 105 132 71 51 101 35 92 81 89 94 97 67 101 36 94 106 3 50 23 64 105 57 145 224 121 58 68 104 109 53 127
3411 127 147 58 53 61 166 132 111 53 154 79 53 131 290 131 55 40 87 119 183 116 60 39 48 70 93 174 75 140 110 101 145 27 118 164
3091 164 94 63 53 63 129 175 43 178 202 370 472 165 202 111 126 94 35 47 194 175 96 37 103 167 147 153 170 159 179 113 89 11
2791 11 195 279 398 332 294 196 268 240 240 124 83 101 171 193 31 128 106 57 42 74 81 151 165 41 50 94 116 123 63 142 168 41 67 105
2472 105 159 79 60 155 150 108 104 155 108 69 93 232 230 91 127 100 13 115 245 84 845 1899 1768 558 414 158 156 84 80 218
2190 218 82 106 255 138 445 176 109 220 150 104 61 124 109 57 116 90 87 202 189 111 136 112 100 24 129 65 99 57 111 97 52
$$ packed form
4406A65j17j0P9Om0J19m8l4POrpj9L3m2K8j03R0j3j0o2RR8O6j00O4l7J2r4J4K8Q0kJ10j44
4077A23r1K7R0Q2j13q5J19q1ML1p1L8ml2JQ4l5K6l7J33n2k0n7k0PN1n9Q6r0J0L6Q8p5p3N3
3749I4N9o3k9k1j9Q4K7o1k0N0o6N7j1QNLl0L4o5N8J2j03M7k7M1M1m8Q8P9j03o3J0L6Nn6P4
3411A27K0q9nQJ05l4k1n8J01p5k6P8J59j59p6j5M7L2O4o7n6k1RK2K3Q1r9O5l0rM4j18R1M6
3091A64p0l1j0J0O6M6j32J35K4J68J02l07L7r1J5l2n9J2J47j9p9n9O6O4k0OJ7j1K0o6k4p8
2791A1J84Q4J19o6l8r8P2k8%j16m1J8P0K2j62R7k2m9j5L2PP0J4j24RM4K2Po0P9K6j27K6L8
2472A05N4q0j9R5nm2mN1m7l9K4J39kj39L6k7q7J02J30j61P61J054j31j210j44k56kp2mJ38
2190B18j36K4J49j17L07k69o7J11p0m6m3O3j5n2N9k6lJ15j3p8K5k4j2p6J05o4L4m2N4j4m5
$$ plain form
1899 52 75 102 74 209 129 74 202 111 37 11 306 209 343 132 267 60 56 62 153 46 199 240 104 78 110 130 65 115 188 121 165
1608 165 132 172 65 122 275 213 829 1725 3239 1301 381 22 169 160 176 94 60 68 66 124 194 128 323 294 156 113 76 88 120 26
1326 26 86 84 171 255 88 208 81 57 99 37 156 304 109 83 53 62 47 195 124 143 104 144 146 165 129 58 97 75 151 298 107 71
1025 71 182 145 277 141 202 184 191 159 155 191 276 110 313 366 650 1287 999 371 512 421 517 563 844 743 611 1608 3295 13260
763 13260 33383 13613 2254 1568 1156 685 155 645 504 270 466 482 346 137 164 233 338 165 360 500 528 893
556 893 240 83 276 365 101 278 205 81 162 42 244 118 214 47 220 138 136 277 60 143 48 71 188 201 74 105 245 33
293 33 148 34 139 134 168 157 125 118 145 141 20 89 190 123 148 70 111 13 92 43 196 252 130 71 111 117 76 52 138 63 94 27 111 84
-26 84 21 114 162 115 186 57 98 62 131 84 81 135 87 74 97 145 187 209 142 123 122 163 90 69 43 51 19 62 167 52 204 152 81 104 65
$$ packed form
1899E2K3K7k8J35q0n5J28r1p4k6K95r7J34k11J35k07mOR1j07J53M1j36k6L2K0o5N0P3o7M4
1608A65l3M0j07N7J53o2O16Q96J514j938r20l59J47rJ6q2l4QkN8P0o6J95k9j38m3l7J2L2r4
1326B6O0kQ7Q4j67J20j27k4M2o2J19J48j95k6l0Rj5J48p1J9l9M0KJ9l6p1L9k2P6J47j91l6
1025G1J11l7J32j36O1j8Pl2mL6Q5j66K03N3K84O37k88o28J41r1R6M6K81j01j32R97J687R965
763A3260K0123j9770j1359o86m12m71n30M90j41k34J96J6j36k09K7O9J05j73J95J40K8L65
556H93o53j57J93Q9k64J77p3j24Q1j20K02j26R6j67J73q2kJ41k17Q3r5K3J17J3j27L1J40k12
293C3J15j14J05nL4j1l2pK7mj21O9J01o7K5p8M1r8P9m9J53N6j22n9M0Om1k4Q6p5L1o7Q4k7
-26H4o3R3M8m7P1j29M1l6O9m7lN4m8j3K3M8M2K2o7j9jM1p3k1k6Ql2M3J05j15J52n2p1K3l9
$$ plain form
-355 65 169 114 78 37
$$ packed form
-355F5J04n5l6m1
-392C7
##PAGE=	F1=-2655.4
##FIRST=	4405.895418600002813,	4405.895418600002813,	0
##DATA TABLE=	(F2++(Y..Y)), PROFILE
$$ plain form
4406 188 75 6 147 160 92 199 122 128 133 172 93 123 125 174 78 144 40 119 120 72 45 42 89 142 83 169 83 149 46 38 50 106 126 254 113
4077 113 60 58 144 210 107 29 172 82 94 110 27 62 50 71 12 143 63 132 57 219 180 141 92 54 112 170 60 114 49 72 127 160 117
3767 117 3 81 174 145 42 36 18 97 98 50 36 142 60 88 126 114 89 88 64 73 27 123 166 28 48 48 61 136 72 167 259 140 80 50 134
3439 134 124 30 146 154 61 70 43 175 129 103 52 134 111 65 172 308 132 68 113 67 101 144 182 60 56 63 87 61 107 68 148 153 93 139
3119 139 28 111 138 47 83 110 94 115 150 44 223 318 287 489 161 225 122 144 78 66 35 194 180 165 77 96 174 132 120 159 132
2828 132 164 121 75 40 215 273 365 224 253 190 239 229 298 149 102 93 188 192 40 125 86 56 42 70 96 174 141 28 84 112 127 140 77
2519 77 158 201 68 53 100 177 78 68 161 165 132 153 151 121 61 116 254 228 90 89 124 21 128 259 147 768 1856 1741 498 475
2237 475 163 178 103 95 239 57 125 293 38 281 120 128 194 157 146 43 105 111 87 123 82 54 199 219 136 159 118 107 40 139 84 108
$$ packed form
4406A88j13o9J41J3o8J07p7ONL9p9L0KM9r6O6j04P9Jm8k7lM7N3n9Q6q6O6j03qJ2N6K0J28j41
4077A13n3kQ6O6j03p8J43r0J2J6q3L5j2K1n9J31q0O9p5J62l9l9m9l8N8N8j10N4o5K3N5L3m3
3767A17j14P8R3k9j03oj8P9Jm8j4J06q2K8L8j2k5jk4Rm6R6M3j38K0%J3P5o4R5R2j19o0l0Q4
3439A34j0r4J16Qr3Rk7J32m6k6n1Q2k3m6J07J36j76o4M5m6L4M3L8j22mPK4k6M6l9Q0No0M6
3119A39j11Q3K7r1L6K7j6K1L5j06J79R5l1K02l28O4j03K2o6j2l1J59j4j5q8J9P8m2j2L9k7
2828A32L2m3m6l5J75N8R2j41K9o3M9j0O9j49m7rR5Mj52Q5l9l0j4K8K6P8l3j13N6K8J5J3o3
2519G7Q1M3j33j5M7P7r9j0R3Ml3K1kl0o0N5J38k6j38jL5j03J07J31j12O21J088j15j243k3
2237D75l12J5p5qJ44j82O8J68k55K43j61QO6l7j1j03O2Ok4L6m1k8J45K0q3K3m1j1o7R9n5K4
$$ plain form
1936 108 60 140 79 102 106 132 32 204 135 121 200 81 86 16 353 272 399 245 329 73 36 46 137 22 216 216 118 85 128 179 65
1645 65 126 216 80 146 144 163 77 150 292 250 842 1772 3316 1428 402 87 224 146 163 98 60 97 60 150 203 116 321 286 123
1373 123 116 110 102 128 42 124 121 174 283 113 229 71 124 137 57 102 336 98 153 89 98 33 237 159 183 95 148 172 200 191 85 132 107 216
1054 216 336 95 93 239 165 329 102 266 272 236 249 220 255 350 205 421 423 730 1332 1165 563 664 677 575 948 586 869 881
791 881 2136 4988 20695 50405 18842 3870 2279 1581 895 341 806 728 460 681 607 450 210 273 311 466 279
594 279 334 469 273 742 238 155 346 397 165 345 208 95 237 87 298 146 237 53 242 187 163 286 45 192 75 78
349 78 224 219 66 160 269 43 150 31 170 151 201 164 129 167 141 132 42 111 184 128 172 19 130 50 92 29 194 260 99 114 119 123
49 123 87 74 188 61 45 70 80 73 23 180 157 130 235 67 114 95 132 131 98 161 78 99 95 137 168 230 126 92 86 156 90 92 78 89 36
$$ packed form
1936A08m8Q0o1K3MK6j00J72o9j4P9j19Np0L37q1J27j54Q4k56l7J0R1j15J94%r8l3M3N1j14
1645F5O1R0j36O6kJ9q6P3J42m2N92R30J544j888j026l15J37p8J7o5l8L7l7R0N3q7K05l5j63
1373A23poqK6q6Q2lN3J09j70J16j58N3J3q0M5K34k38N5o4Ro5K04p8K4q8N3K4K8rj06M7k5J09
1054B16J20k41kJ46p4J64k27J64Ol6J3k9L5R5j45K16KL07O02j67o02J01J3j02L73l62K83J2
791H81J255K852J5707K9710l1563j4972j591o98o86n54M65p8k68K21p4j57k40O3L8J55j87
594B79N5J35j96M69n04q3J91N1k32J80j37j13J42j50K11j52R1j84J89n5k4J23k41J47j17L
349G8J46nj53R4J09k26J07j19J39j9N0l7l5L8k6rr0O9P3n6M4j53J11q0M2o3J65O6j61J5NM
49A23l6j3J14j27j6K5J0pn0J57k3k7J05j68M7j9L7jl3O3q3K1mM2L1O2j04l4oP0o6Kj4J1n3
$$ plain form
-280 36 110 163 25 205 174 67 128 95 185 78 73 30
$$ packed form
-280C6P4N3j38J80l1j07O1l3R0j07nm3
-392C0
##PAGE=	F1=-2674.18
##FIRST=	4405.895418600002813,	4405.895418600002813,	0
##DATA TABLE=	(F2++(Y..Y)), PROFILE
$$ plain form
4406 189 76 18 131 163 85 159 89 132 125 171 75 115 126 204 59 149 87 124 129 49 50 43 61 123 61 165 57 131 72 18 27 42 90 217
4087 217 94 75 44 130 176 102 37 158 76 123 113 50 71 58 94 40 141 46 135 28 197 179 127 82 36 145 214 82 80 47 76 131
3786 131 127 102 37 62 189 182 40 47 45 75 55 49 67 167 83 78 158 131 89 79 60 29 45 158 218 60 40 75 48 151 100 173 275 145
3467 145 94 32 143 132 24 147 148 57 95 29 163 124 95 51 102 141 100 196 299 141 98 158 56 83 117 219 55 80 70 94 40
3176 40 35 88 139 182 79 122 41 110 109 31 88 159 109 117 139 80 242 402 205 501 142 245 140 143 69 79 36 171 185 228 125 78
2875 78 164 104 75 133 102 140 127 57 54 221 253 335 86 186 155 195 207 323 194 136 72 191 188 60 120 62 63 49 67 93 189 126 10
2565 10 103 136 128 144 94 170 213 74 35 87 176 81 89 150 158 139 205 141 125 64 112 256 223 68 56 140 38 130 269 202 617 1651 1648
2256 1648 394 518 182 187 115 101 237 29 141 308 179 59 49 140 161 151 162 22 67 101 101 105 59 22 205 243 143 147 104 103
$$ packed form
4406A89j13n8J13L2p8P4p0M3pM6r6M0J1P8j45R0o2L7Nq0JpJ8O2o2J04j08P4n9n4RJ5M8J27
4087B17j23j9l1Q6M6p4o5J21q2M7j0o3K1j3L6n4J01r5Q9j07J69j8n2m5m6J09O9j32kl3K9N5
3786A31mk5o5K5J27pj42PkL0k0oJ8J00q4nQ0k7m2j0j9l1J6J13O0j58k0L5k7J03n1P3J02j30
3467A45n1o2J11j1j08J23Jr1L8o6J34l9k9m4N1L9m1R6J03j58m3O0j02K7L4J02j64K5j0K4n4
3176D0nN3N1M3j03M3q1O9jp8N7P1n0QK2n9J62J60j97K96l59J03j05Lp4J0m3J35J4M3j03m7
2875G8Q6o0k9N8l1L8j3p0lJ67L2Q2k49J00l1M0J2J16j29n8o4J19lj28O0n8Jj4J8K6R6o3j16
2565A0R3L3qJ6n0P6M3j39l9N2Q9r5QO1Qj9O6o4j6o1M8J44l3j55j2Q4j02R2J39o7M15J034l
2256A648j254J24l36Np2j4J36k08J12J67j29j20j0R1K1j0J1j40M5L4%Mm6l7J83L8j00Mm3j
$$ plain form
1974 103 62 149 107 106 60 135 60 140 117 151 34 200 148 147 174 39 124 41 385 313 372 347 346 72 35 26 115 32 207 185 121 70 131 194
1655 194 41 126 216 61 100 139 139 71 155 254 275 773 1694 3052 1425 402 177 281 115 136 80 51 106 51 157 186 115 293
1392 293 262 117 93 133 100 140 50 137 150 185 282 129 206 77 169 162 85 39 313 70 186 137 131 49 229 147 182 74 115 147 187 217
1091 217 107 130 84 223 310 98 64 235 143 297 73 251 275 224 269 221 250 318 192 429 390 688 1282 1119 610 655 740 413
828 413 2144 310 721 855 1982 4928 18221 46157 17481 3664 2165 1504 886 385 719 738 425 681 568 417
640 417 192 278 299 467 294 168 575 147 471 267 150 326 384 177 324 212 102 252 88 288 137 193 51 217 202
406 202 137 246 70 192 98 55 213 213 86 177 243 56 121 53 167 146 221 159 128 167 109 104 53 124 147 117 137 17 125 82 80 39
105 39 166 241 81 113 121 115 80 71 214 54 31 90 59 36 35 216 121 123 252 85 117 110 125 152 82 156 64 134 105 126 129 218 93 73 64 135
$$ packed form
1974A03m1Q7m2jm6P5p5Q0k3L4j17J66n2jK7j35Q5q3L44p2N9k5jk74l7rQ9q3J75k2o4n1O1O3
1655A94j53Q5R0j55L9L9%o8Q4R9K1M98R21J358j627j023k25J04j66K1n6k9N5n5J06K9p1J78
1392B93l1j45k4M0l3M0r0Q7J3L5R7j53P7j29R2pp7m6K74k43J16m9oq2J80q2L5j08M1L2M0L0
1091B17j10K3m6J39Q7k12l4J71r2J54k24J78K4n1M5m8K9O8j26K37l9K98N94j63n09M5Q5l27
828D13J731j834M11J34J127K946J3293K7936k8676j3817j499o61o18n01L34J9l13K56j13j51
640D17k25Q6K1J68j73j26M07m28L24k04j17J76N8k07J47j12j10J50j64K00j51N6j42J66j5
406B02o5J09j76J22r4m3J58%j27R1O6j87O5o8J14k1P5o2l1L9n8nn1P1K3l0K0j20J08m3km1
105C9J27P5j60L2Qol5rJ43j60k3N9l1k3jJ81r5KJ29j67L2pJ5K7p0P4r2P0k9K1LQ9j25k0rP1
$$ plain form
-233 135 87 109 92 114 44 115 131 32 211 182 62 110 85 161 67 46 42
$$ packed form
-233A35m8K2j7K2p0P1J6r9J79k9j20M8k5P6r4k1m
-392D2
##PAGE=	F1=-2692.96
##FIRST=	4405.895418600002813,	4405.895418600002813,	0
##DATA TABLE=	(F2++(Y..Y)), PROFILE
$$ plain form
4406 163 38 49 53 112 116 90 77 133 106 119 60 100 92 223 35 132 115 121 129 38 25 31 50 143 93 134 39 82 128 4 42 53 55 157 74 78
4068 78 23 111 141 102 32 123 45 158 112 79 101 98 95 109 118 39 126 12 139 151 106 46 19 154 246 110 53 61 83 109 99 79 58 49 194
3739 194 194 49 105 60 41 21 56 99 175 85 61 185 141 90 74 62 26 51 203 248 88 25 85 20 151 137 155 268 140 90 25 119
3439 119 122 73 132 126 40 123 58 123 125 91 41 63 159 142 188 258 165 117 186 58 65 114 217 51 115 67 91 92 87 97 108 190 71 108 53 117
3101 117 73 43 76 197 101 144 148 100 248 452 158 503 106 257 164 121 78 65 46 123 196 268 169 70 136 82 24 92 88 107 130 58
2800 58 60 207 227 321 88 153 94 142 184 304 237 162 41 179 172 93 108 25 58 52 61 72 188 130 49 99 167 126 134 115 178 204 53 15
2481 15 65 154 82 109 119 123 126 251 130 118 83 83 233 221 31 40 151 67 118 277 250 410 1349 1510 254 529 212 176 114 84 209
2190 209 8 154 294 317 236 27 144 128 141 151 10 79 87 91 62 37 13 205 245 138 99 74 94 85 171 139 91 62 89 83 154 103 148
$$ packed form
4406A63j25J1MN9Mk6j3N6k7J3n9M0qJ31j88R7j7OQr1j3OJ9R3n0M1r5M3M6j24L8J1KJ02q3M
4068G8n5Q8L0l9p0R1p8J13m6l3K2llJ4Rp9Q7j14J27J2m5o0k7J35R2j36n7QK2K6j0k0k1rJ45
3739A94%j45N6m5j9k0L5M3P6r0k4J24m4n1j6j2l6K5J52M5j60o3O0o5J31j4J8J13j28n0o5R4
3439A19Lm9N9oq6Q3o5O5Kl4n0K2R6j7M6P0r3m8O9j28PM9J03j66O4m8K4JnJ0J1Q2j19L7n5O4
3101A17m4l0L3J21r6M3Mm8J48K04k94L45l97J51r3m3m3j3j9P7P3P2r9r9O6n4n8O8mJ9K3p2
2800E8KJ47K0R4k33O5n9M8M2J20o7p5j21J38pp9J5q3L3oRJ1J16n8q1N0O8m1Qj9O3K6j51l8
2481A5N0Q9p2K7J0MLJ25j21j2l5%J50j2j90RJ11q4N1J59k7J60R39J61j256K75l17l6o2l0J25
2190B09k01J46J40K3q1k09J17j6J3J0j41O9QMk9k5k4J92M0j07l9k5K0rQ6l2m8k9K7oP1n1M5
$$ plain form
1880 148 99 191 173 143 126 20 138 90 394 320 272 363 309 77 50 31 84 82 184 145 102 25 116 168 29 115 181 45 47 115 93 50
1579 50 123 165 266 631 1512 2567 1313 399 266 345 80 91 52 26 92 61 153 138 109 245 219 148 56 128 68 151 83 132 147 210
1298 210 260 119 135 100 182 170 69 40 228 59 146 210 157 82 164 90 135 17 29 60 118 185 95 118 43 156 207 109 48 149 56
1007 56 165 27 128 163 135 193 150 155 153 26 285 265 527 1162 831 452 413 531 541 3879 1579 402 429 928 2460 5440
763 5440 14709 7353 1011 959 774 694 179 374 437 129 395 379 216 149 141 157 300 194 276 673 278 244 272 43 195 286
518 286 198 197 239 95 182 19 198 109 71 19 131 167 52 157 62 134 97 38 139 173 156 135 155 25 120 48 122 110 210 178 100
227 100 105 67 54 41 101 70 82 40 22 90 101 45 30 120 191 92 69 95 91 57 34 200 114 76 70 52 25 70 205 57 116 220 112 99
-92 99 102 106 131 56 117 41 175 132 109 80 176 55 91 37 98 84 109 66 150 62 64 74 64 211 169 44 73 21 92 91 7 78
$$ packed form
1880A48m9R2j8l0j7j06J18m8L04p4m8R1n4k32k7j9N3kJ02l9m3p7R1N2j39Q6O6j36KO8k2m3
1579E0P3M2J01L65Q81J055j254r14j33P9k65J1l9k6O6l1R2j5k9J36k6p1r2P2o0Q3o8M9J5O3
1298B10N0j41J6l5Q2j2j01k9J88j69Q7O4n3p5Q2p4M5j18J2L1N8O7r0K3p5J13N1r8o1J01r3
1007E6J09j38J01L5k8N8m3Nkj27K59k0K62O35l31l79l9J18J0L338k300j177K7M99J532K980
763E440R269p356o342n2j85q0n15J95O3l08K66j6j63o7qJ6J43j06Q2L97l95l4K8k29J52R1
518B86q8jM2j44Q7j63J79q9l8n2J12L6j15J05r5P2l7n9J01L4j7k1K0j30R5p2P4j2J00l2p8
227A00Nl8j3j3O0l1J2m2j8O8J1n6j5R0P1r9k3K6ml4k3J66q6l8oj8k7M5J35j48N9J04j08j3
-92I9LMK5p5O1p6J34m3k3k9R6j21L6n4O1j4K5m3Q4q8KJ0j0J47m2j25K9n2P1jq4P1
-392G8
##PAGE=	F1=-2711.74
##FIRST=	4405.895418600002813,	4405.895418600002813,	0
##DATA TABLE=	(F2++(Y..Y)), PROFILE
$$ plain form
4406 117 36 107 71 17 202 38 104 133 97 38 65 131 37 243 18 97 119 136 152 105 42 11 55 168 181 84 61 60 196 13 74 122
4105 122 46 102 90 86 49 101 124 97 28 127 29 190 113 104 146 156 78 194 103 37 126 58 56 100 108 18 80 141 259 130 34 114 99 72 95
3777 95 85 72 57 188 191 68 180 59 44 50 62 119 179 69 42 224 146 87 72 86 88 53 251 255 109 28 83 16 145 180 117 240
3476 240 127 67 32 67 98 133 111 92 15 147 108 58 130 102 23 34 161 176 156 189 199 132 222 68 54 134 186 47 163 54 87
3185 87 166 170 83 60 181 80 105 61 130 33 46 51 226 73 179 161 96 266 485 162 493 68 259 188 86 103 37 61 58 207
2903 207 278 200 100 94 94 37 76 99 64 131 88 75 180 204 326 261 211 29 94 165 245 263 169 32 156 148 133 82 39 53 57 51 35 169
2584 169 146 108 75 203 129 113 137 176 182 27 24 36 126 83 122 71 71 101 287 132 104 118 55 190 221 30 41 163 102 97 284 287 182
2274 182 1065 1360 93 501 240 144 109 46 164 39 162 257 409 494 94 142 100 150 120 14 158 107 58 28 54 51 194 227
$$ packed form
4406A17q1P1l6n4J85j64O6K9l6n9K7O6r4K06k25P9K2J7J6m7o3l1M4J13J3r7k3jJ36j83O1M8
4105A22p6N6j2ml7N2K3k7o9R9r8J61p7rM2J0p8J16r1o6Q9o8kM4Qr0O2O1J18j29r6Q0j5k7K3
3777I5j0j3j5J31Lj23J12j21j5OJ2N7O0j10k7J82p8n9j5J4Kl5J98Mj46q1N5o7J29L5o3J23
3476B40j13o0l5L5L1L5k2j9p7J32l9n0P2k8p9J1J27J5k0L3J0o7R0j54j4Q0N2j39J16j09L3
3185H7P9Mq7k3J21j01K5m4O9r7J3NJ75j53J06j8o5J70K19l23L31m25J91p1j02J7o6K4lJ49
2903B07P1p8j00o%n7L9K3l5O7m3j3J05K4J22o5n0j82O5P1Q0J8r4j37J24qj5n1m3J4Moj6J34
2584A69k3l8l3J28p4j6K4L9Oj55lJ2R0m3L9n1%L0J86j55k8J4o3J35L1j91J1J22o1nJ87Lj05
2274A82Q83K95j267M08k61r6l5o3J18j25J23R5J52Q5m00M8m2N0l0j06J44n1m9l0K6lJ43L3
$$ plain form
2011 227 145 23 38 102 119 207 174 72 75 14 137 145 71 123 167 172 201 117 89 91 127 156 377 298 159 253 216 163 65 72 48 146 183 105 59
1683 59 47 90 110 88 124 118 36 66 88 44 65 62 82 216 444 1302 2035 1116 414 332 413 107 54 77 25 94 107 178 86 108 195 175 213
1373 213 94 96 42 187 152 163 110 240 245 100 63 154 177 181 35 135 100 150 68 306 192 119 70 104 92 117 106 97 77 123 110 183 192
1063 192 81 106 197 190 3 86 89 164 100 55 150 67 181 105 135 268 104 336 417 1015 380 170 147 387 1356 5866 3262 879
800 879 476 929 1965 24406 40645 9578 3569 1456 716 852 305 364 131 503 123 474 270 357 134 88 100 224
594 224 560 538 265 235 295 176 112 107 342 43 318 164 70 128 80 205 103 120 9 108 114 103 93 136 137 127 27 117 254 53
312 53 40 77 214 40 81 56 182 253 64 38 114 21 32 58 42 48 95 67 47 121 7 65 114 156 130 63 41 54 45 60 147 220 128 72
-7 72 51 97 123 149 68 144 141 139 58 83 85 75 125 64 18 217 171 89 82 149 79 147 22 56 82 90 30 221 106 37 29 90 197 144 51 131 82
$$ packed form
2011B27q2j22J5O4J7Q8l3j02Lo1J23Qp4N2M4NK9q4k8KL6K9K21p9j39R4l7n3r8Pk4R8L7p8m6
1683E9j2M3K0k2L6oq2L0K2m4K1lK0J34K28Q58P33r19p02q2Q1l06n3K3n2O9J3P1r2K2Q7k0L8
1373B13j19Kn4J45l5J1n3J30Nj45l7R1K3Mj46J00l5N0q2K38j14p3m9L4j2K5j1rk0M6j3P3R
1063A92j11K5R1pj87Q3LP5o4m5R5q3J14p6L0J33j64K32Q1N98o35k10k3K40R69M510k604k383
800H79m03M53J036K2441J6239l1067o009k113p40J36n47N9k33L72l80L51k04Q7k23m6J2J24
594B24L36k2k73l0O0j19o4nK35k99K75j54r4N8m8J25j02J7j11R9Oj1j0M3Jj0j00R0J37k01
312E3j3L7J37j74M1k5J26P1j89k6P6r3J1K6j6OM7k8k0P4j14N8M9M2k6o7k2J3rJ5Q7P3r2n6
-7G2k1M6K6K6q1P6lkq1K5Kj0N0o1m6J99m6q2pO7p0O8j25L4K6Qo0J91j15o9qO1J07n3r3Q0m9
$$ plain form
-355 82 34 141 65 120
$$ packed form
-355H2m8J07p6N5
-392A20
##PAGE=	F1=-2730.52
##FIRST=	4405.895418600002813,	4405.895418600002813,	0
##DATA TABLE=	(F2++(Y..Y)), PROFILE
$$ plain form
4406 75 108 160 198 87 284 84 148 134 109 101 90 191 45 265 35 60 112 165 196 175 107 18 71 180 270 47 100 114 249 20
4124 20 100 179 70 109 132 112 91 106 128 82 55 186 79 200 119 122 194 219 60 271 127 39 150 105 42 46 137 69 150 115 251 133
3824 133 16 181 117 63 111 128 88 76 177 187 105 238 50 94 84 75 126 189 51 28 274 147 85 69 115 137 66 286 243 121
3542 121 55 81 51 148 217 84 200 107 39 39 23 75 184 99 55 15 165 153 12 127 125 16 48 148 183 131 107 225 158 271 79
3251 79 53 162 157 37 212 43 89 236 232 52 27 167 91 112 64 140 10 40 24 242 38 203 159 71 313 522 199 467 80
2979 80 254 204 52 128 52 70 21 207 259 211 147 52 125 89 129 117 16 130 124 99 151 197 332 437 308 71 67 145 166 266 150
2688 150 72 133 123 164 40 103 67 64 35 17 136 156 164 56 231 136 86 155 157 161 52 57 24 107 79 122 37 50 86 306 149 93 166 82
2368 82 143 212 68 43 176 132 76 285 299 120 982 1235 62 437 246 102 113 20 123 74 161 216 438 676 140 138 87 180
$$ packed form
4406G5L3N2L8j11J97k00O4j4k5qj1J01j46K20k30K5N2N3L1k1o8q9N3J09R0k23N3J4J35k29
4124B0Q0P9j09L9K3k0k1J5K2m6k7J31j07J21q1LP2K5j59K11j44q8J11m5o3MR1o8Q1l5J36j18
3824A33j17J65o4n4M8J7m0j2J01J0q2J33j88M4j0rN1O3j38k3K46j27o2j6M6K2p1K20m3j22
3542A21o6K6l0R7O9j33J16r3o8%j6N2J09q5m4m0J50j2j41J15kj09L2J00L5n2k4J18o7J13j92
3251G9k6J09nj20J75j69M6J47mj80k5J40p6K1m8P6j30L0j6K18k04J65m4q8K42K09l23K68l87
2979H0J74n0j52P6p6J8m9J86N2m8o4r5P3l6M0j2j01J14ok5N2M6J35J05j29k37mP8K1J00j16
2688A50p8O1j0M1j24O3l6lk9j8J19K0Qj08J75r5n0O9KMj09Nl3Q3k8M3q5J3L6K20j57n6P3q4
2368H2O1O9j44k5J33m4n6K09J4j79Q62K53j173L75j91j44J1r3J03m9Q7N5K22K38n36kn1R3
$$ plain form
2105 180 84 24 236 161 18 73 86 84 177 203 166 54 11 131 159 237 200 65 88 76 181 124 36 94 217 147 214 91 117 157 101
1814 101 222 341 279 162 98 74 295 78 112 39 203 221 84 29 120 77 41 141 172 59 79 114 100 79 109 51 138 135 258 1142
1533 1142 1629 853 458 361 465 175 88 131 57 136 155 233 107 125 160 161 283 170 66 83 239 220 231 53 258 246 116 128
1270 128 213 185 211 77 220 30 253 131 387 233 146 77 210 137 242 231 224 176 133 177 284 351 168 207 310 325 163 230 285
997 285 303 317 255 321 159 337 258 393 565 335 595 549 868 229 321 526 795 2217 7751 4877 1668 1285 2701 6475
772 6475 48740 93227 26441 8151 3602 1964 1369 795 840 714 1054 634 861 620 604 401 333 370 431 674 125 433
565 433 212 424 400 303 105 520 238 408 277 169 274 148 357 264 226 143 118 259 196 167 264 205 226 131 104 332 88 133
302 133 157 322 72 141 52 169 339 89 146 201 79 62 86 139 82 220 130 60 154 57 129 165 202 167 134 28 19 65 143 81 314
$$ packed form
2105A80r6o0K12p5j43N5J3kR3K6l7j12m3J20K8P8l7j35K3j2J05n7q8N8J23p0O7j23K6M0n6
1814A01J21J19o2j17o4k4K21k17L4p3J64J8j37n5R1m3l6J00L1j13K0L5j4k1L0n8Q7lJ23Q84
1533A142M87p76l95r7J04k90q7M3p4P9J9P8j26J8L5JJ22j13j04J7J56j9J1j78K05j2j30J2
1270A28Q5k8K6j34J43j90K23j22K56j54q7o9J33p3J05j1pm8m3M4J07O7j83L9J03J5j62O7N5
997B85J8J4o2O6j62J78p9J35J72k30K60m6L19o39R2K05K69J422N534k874l209l83J416L774
772F475M2265M4487o6786j8290m549j638n95n74M5j26L40m20K27k41j6k03o8L7O1K43n49L08
565D33k21K12k4r7j98M15k82J70j31j08J05j26K09r3l8q3k5J41o3k9R7n9K1r5k7K28k44M5
302A33K4J65k50O9q9J17J70k50N7N5j22j7K4N3n7J38r0p0R4r7P2L6L7l5l3j06rM6P8o2K33
$$ plain form
11 314 167 143 55 161 175 79 146 187 44 151 9 78 78 9 220 52 35 253 209 70 144 183 131 207 69 29 80 62 97 302 142
-280 142 140 78 106 166 121 106 228 180 119 188 120 150
$$ packed form
11C14j47k4q8J06J4r6O7M1j43J07j42O9%o9K11j68j7K18m4j39P4L9n2P6j38m0N1j8L5K05j60
-280A42ko2K8O0m5j5J22m8o1O9o8L0
-392A50
##PAGE=	F1=-2749.3
##FIRST=	4405.895418600002813,	4405.895418600002813,	0
##DATA TABLE=	(F2++(Y..Y)), PROFILE
$$ plain form
4406 57 137 153 260 130 296 109 177 133 109 171 76 206 56 268 58 36 108 162 208 193 144 55 92 184 317 46 101 142 256 31
4124 31 114 207 90 130 153 127 107 112 128 63 69 228 103 168 121 134 237 262 63 306 152 35 180 140 115 55 151 93 194 97 218
3833 218 112 17 225 117 80 120 166 109 84 166 188 150 248 51 133 100 92 127 189 39 25 311 144 95 55 120 150 71 283 228 120
3542 120 77 87 62 155 223 76 155 77 33 28 47 48 205 95 26 32 177 170 58 96 134 24 68 122 150 139 31 221 204 311 93 51
3242 51 174 155 43 241 37 92 288 254 27 53 153 86 112 58 141 24 41 11 232 16 200 133 39 376 559 240 428 121
2979 121 249 197 37 132 83 59 58 180 219 198 177 37 144 138 187 127 22 122 150 107 131 214 310 604 397 124 49 108 103 236 110
2688 110 107 126 103 163 43 153 84 62 22 41 106 141 193 76 231 130 63 153 116 138 74 77 33 98 69 101 64 77 98 301 163 107
2387 107 215 113 105 177 79 37 176 138 72 270 268 331 1203 1166 187 353 210 69 117 42 96 95 145 198 406 726 150 122 81 203
$$ packed form
4406E7Q0J6J07j30J66j87O8m4k4O2r5J30j50K12k10k2P2N4M6j5m9q9L7R2J33k71N5M1J14k25
4124C1Q3R3j17M0K3k6k0NJ6o5OJ59j25O5m7J3J03K5j99K43j54j17J45m0k5o0R6n8J01r7J21
3833B18j06r5K08j08l7M0M6n7k5Q2K2l8R8j97Q2l3qL5O2j50j4K86j67m9m0O5L0p9K12n5j08
3542A20m3J0k5R3O8j47P9p8m4nJ9JJ57j10o9OJ45pj12L8L8j10M4N4K8j1j08J90j7J07k18m2
3242E1J23j9j12J98k04N5J96l4k27K6J00o7K6n4Q3j17J7l0K21k16J84o7r4L37J83l19J88l07
2979A21J28n2j60R5m9k4jJ22L9k1k1j40J07oM9o0j05J00K8m3K4Q3R6K94k07k73p5N9nJ33j26
2688A10lJ9k3O0j20J10o9k2m0J9O5L5N2j17J55j01o7R0l7K2o4Lm4O5k9L2l7J3K1K03j38n6
2387A07J08j02qP2r8m2J39l8o6J98kO3Q72l7r79J66j43j41M8p5N4jN0N3K08L20n76k8m1J22
$$ plain form
2105 203 68 26 276 206 4 100 99 98 155 193 168 100 23 147 188 235 202 65 72 133 186 101 24 81 225 129 192 83 165 190 79 262
1805 262 306 298 228 301 113 410 77 127 49 224 249 74 63 163 75 12 146 215 32 116 123 133 127 125 97 196 61 129 1055 1487 577
1514 577 504 354 463 222 130 152 53 167 162 262 136 131 120 155 315 209 64 92 252 235 267 9 230 224 129 173 219 187 226 101
1232 101 249 92 290 195 393 233 130 107 265 157 300 273 262 228 173 196 309 413 211 271 340 359 239 288 380 320 410 334
969 334 391 219 390 304 488 680 452 680 626 643 456 458 672 1027 2660 9162 5861 2085 1656 3395 8252 56354 111357
753 111357 32615 9824 4370 2459 1531 1019 971 964 1236 820 1006 753 655 512 414 519 479 485 425 931 237 553 521 394
528 394 212 588 346 419 322 266 333 202 422 318 255 218 143 335 247 185 344 210 268 217 109 333 136 198 171 361 78 205
265 205 69 163 359 99 213 238 105 73 130 178 105 265 157 81 176 74 159 186 260 160 166 71 17 75 194 44 343 169 204
$$ packed form
2105B03j35m2K50p0k02R6jjN7L8k5o8p7J24M1M7l3j37PO1N3q5p7N7J44r6O3j09Q2K5j11J83
1805B62M4qp0P3j88K97l33N0p8J75K5j75j1J00q8o3J34O9j83Q4PJ0okk8R9j35O8R26M32r10
1514E77p3j50J09k41r2K2r9J14nJ00j26nj1L5J60j06j45K8J60j7L2k58K21or5M4M6l2L9j25
1232A01J48j57J98r5J98j60j03k3J58j08J43k7j1l4n5K3J13J04k02O0O9J9j20M9R2o0R0p6
969C34N7j72J71q6J84J92k28K28n4J7j87KK14L55J633O502l301l776m29J739M857M8102N5003
753A11357p8742k2791n454j911r28n12m8pK72m16J86k53r8j43r8J05m0Oo0N06o94L16l2j27
528C94j82L76k42P3r7n6O7j31K20j04o3l7p5J92q8o2J59j34N8n1j08K24j97O2k7J90k83J27
265B05j36R4J96k60J14K5j33l2N7M8p3J60j08p6R5j02Q5K7P4j00Or5n4N8J19j50K99j74L5
$$ plain form
-7 204 56 189 200 57 170 184 56 125 42 94 69 26 264 42 31 270 230 51 181 210 134 223 97 26 81 47 156 334 121
-280 121 197 103 111 119 99 133 262 210 156 187 141 150
$$ packed form
-7B04j48J33J1j43J13J4j28O9q3N2k5m3K38k22j1K39m0j79J30K9p6Q9j26p1N5l4J09J78k13
-280A21P6r4QQk0L4J29n2n4L1m6R
-392A50
##PAGE=	F1=-2768.08
##FIRST=	4405.895418600002813,	4405.895418600002813,	0
##DATA TABLE=	(F2++(Y..Y)), PROFILE
$$ plain form
4406 45 73 36 184 44 180 109 170 130 93 151 50 112 30 220 72 38 108 87 136 110 113 119 111 196 288 43 32 94 190 55 111 194 118
4096 118 90 148 103 70 100 102 64 53 209 58 72 96 144 267 262 121 274 142 8 187 153 147 103 112 64 182 113 159 65 30 208 105
3796 105 57 122 169 132 66 152 183 207 184 89 134 96 99 136 153 65 73 302 150 116 24 80 101 45 220 224 108 75 116 28 154 176 73
3486 73 124 37 36 20 40 12 178 88 34 48 192 145 56 26 101 26 63 83 66 145 42 162 274 312 118 45 150 163 124 230 24
3195 24 102 309 228 33 67 134 60 90 40 124 31 68 45 174 39 166 81 21 437 573 259 405 138 256 155 59 95 89 24 64
2913 64 115 175 158 169 68 150 198 202 124 38 93 160 69 123 259 234 759 461 137 19 33 97 168 79 111 147 76 110 140 158 73 42 74
2603 74 39 97 82 186 117 186 95 76 119 53 90 56 62 42 87 50 50 92 69 143 265 150 166 257 100 66 101 44 57 152 114 98 227 182
2284 182 552 1581 1168 259 274 115 51 90 35 66 85 111 221 332 617 130 92 62 187 86 45 259 212 37 74 72 87 136
$$ packed form
4406D5K8l7J48j40J36p1O1m0l7N8j01O2q2J90j48l4P0k1M9k6LOqQ5R2k45j1O2R6j35N6Q3p6
4096A18k8N8m5l3L0Kl8j1J56j51J4K4M8J23nj41J53j32j34J79l4om4Rm8J18o9M6r4l5J78j03
3796A05m8O5M7l7o6Q6L1K4k3r5M5l8LL7J7q8QK29j52l4r2N6K1n6J75Mj16l3M1q8J26K2j03
3486G3N1q7jj6K0k8J66r0n4J4J44m7q9l0P5p5L7K0j7P9j03J20J12L8j94p3J05J3l9J06k06
3195B4P8K07q1j95L4O7p4L0n0Q4r3L7k3J29j35J27q5o0M16J36l14J46k67J18j01r6L6oo5M0
2913F4N1O0j7J1j01Q2M8Mp8q6N5O7r1N4J36k5N25k98l24j18J4O4P1q9L2L6p1L4L0J8q5l1L2
2603G4l5N8j5J04o9O9r1j9M3o6L7l4Ok0M5l7%M2k3P4J22j15J6R1j57l4L5n7J3R5l8j6J29m5
2284A82L70J029m13r09J5j59o4L9n5L1J9K6J10J11K85m87l8l0J25j01m1K14m7j75L7kJ5M9
$$ plain form
2021 136 198 111 81 86 114 182 179 162 59 1 124 134 104 40 91 169 124 129 89 189 161 77 249 295 331 265 506 333 450 51 91 50
1720 50 181 230 76 80 147 57 28 75 200 46 100 97 141 123 95 80 166 108 98 1015 1575 502 515 359 365 258 147 111 29 128 94
1429 94 206 77 120 39 110 263 187 115 14 175 151 211 86 123 145 114 94 120 131 181 31 163 53 192 137 263 162 56 28
1157 28 189 76 208 172 124 134 101 108 166 275 63 134 183 201 135 179 242 102 228 143 208 64 200 107 245 409 179 347 339 168
875 168 274 137 206 780 2400 9879 5704 1671 1021 1854 4277 30251 58925 16689 5453 2190 1314 808 605
697 605 406 469 665 316 579 408 312 275 158 301 197 332 774 1397 575 506 419 231 71 448 236 281 198 204 204 126 288 171
434 171 131 156 66 268 142 91 266 73 196 184 42 194 59 116 49 262 38 188 42 146 245 12 161 171 85 19 98 109
171 109 80 171 93 91 155 22 109 131 247 105 102 57 39 95 159 96 257 137 212 48 159 181 83 100 112 66 41 60 104 48 26 204
$$ packed form
2021A36O2q7l0NK8O8lj7j03n8J23J0l0o4N1P8m5Nm0J00k8q4J72M6L6o6K41j73J17l99M0m1
1720E0J31M9j54MO7r0k9M7J25j54N4lM4j8k8j5Q6n8j0R17N60j073J3j56Oj07j11l6q2R9l4
1429I4J12j29M3q1P1J53p6p2j01J61k4O0j25L7K2l1k0K6J1N0j50J32j10J39n5J26j01j06k8
1157B8J61j13J32l6m8J0l3PN8J09k12P1M9J8o6M4O3j40J26q5O5j44J36r3J38J64k30J68qj71
875A68J06j37O9N74J620P479m175m033o50Q33K423K5974K8674m2236j1236l263q76n06k03
697F05j99O3J96l49K63j71r6l7j17J43j04J35M42O23q22o9q7j88j60L77k12M5q3O%p8J62j17
434A71m0K5r0K02j26n1J75j93J23j2j42J52j35N7o7K13k24J50j46J04R9k33J49J0q6o6P9J1
171A09k9R1p8kO4j33Q7K2J16j42lm5j8N6O4o3J61j20P5j64J11K2r8J7J2m6k5J9M4n6k2J78
$$ plain form
-129 204 60 42 258 221 36 147 150 69 147 70 15 88 69 162 258 15 145 67 115 62 92 80 168 116 76 93 105 108
$$ packed form
-129B04j44j8K16l7j85J11Lq1P8p7n5P3j9R3R6k43J30p8M8n3L0j2Q8n2m0J7J2L
-392A08
##PAGE=	F1=-2786.86
##FIRST=	4405.895418600002813,	4405.895418600002813,	0
##DATA TABLE=	(F2++(Y..Y)), PROFILE
$$ plain form
4406 113 129 266 89 231 101 234 135 149 204 73 288 145 222 134 78 88 137 155 90 106 30 224 122 222 168 172 190 124 35 104
4124 104 89 136 217 84 247 116 41 83 45 116 139 180 87 103 27 161 284 198 252 218 156 89 160 133 123 176 74 108 125 186 72
3833 72 9 36 107 174 46 196 132 161 20 141 188 309 57 174 81 97 92 189 100 177 183 233 186 142 41 88 32 104 81 242 98
3542 98 49 198 69 181 74 103 139 54 39 110 65 137 113 114 83 90 224 91 75 124 24 79 36 38 69 112 146 37 370 259 164 78
3242 78 92 187 268 172 75 156 295 158 86 104 142 94 56 37 99 97 140 136 50 113 132 11 37 492 537 253 453 117 290 78 128 34
2941 34 122 96 93 38 138 99 118 156 205 298 151 123 21 31 172 41 154 334 118 902 495 97 115 96 160 63 146 71 202 23
2659 23 18 284 97 39 72 174 24 130 71 183 183 106 66 145 79 97 78 72 22 105 112 50 39 144 9 244 229 103 270 302 62
2368 62 54 85 89 152 127 108 168 152 128 772 1951 1210 273 227 61 68 63 82 85 28 109 295 244 357 169 146 71 117 143 133 212 185 149
$$ packed form
4406A13J6J37j77J42j30J33r9J4N5j31K15j43P7q8n6J0M9J8o5J6p6J94j02J00n4MJ8o6q9O9
4124A04j5M7Q1j33J63j31p5M2l8P1K3M1r3J6p6J34J23q6N4l4o2o7P1k7j0N3j02L4J7O1j14
3833G2o3K7P1O7j28J50o4K9j41J21M7J21k52J17r3J6nR7q9P7ON0m7m4j01M7n6P2k3J61j44
3542I8m9J49j29J12j07K9L6q5j5P1m5P2k4Jl1PJ34j33j6M9j00N5m3KL1M3L4j09L33j11r5q6
3242G8J4R5Q1r6r7Q1J39j37p2J8L8m8l8j9O2kM3mq6O3J9j21K6M55M5k84K00l36J73k12N0r4
2941C4Q8k6ln5J00l9J9L8M9R3j47k8j02J0J41j31J13J80k16P84m07l98J8j9O4r7Q3p5J31j79
2659B3nK66j87n8L3J02j50J06n9J12%p7m0P9o6J8j9on0Q3Po2j1J05j35K35j5j26J67L2k40
2368F2qL1MO3k5j9O0j6k4O44J179p41r37m6j66PnJ9Ln7Q1J86n1J13j88k3p5M6K6j0P9k7l6
$$ plain form
2058 149 47 45 95 160 209 58 28 216 65 140 67 82 126 149 45 97 183 115 133 41 156 146 168 228 69 107 171 331 324 328 519 561
1758 561 378 100 26 139 130 225 199 117 66 104 107 133 89 199 86 182 145 38 149 43 114 234 113 1000 1741 807 493 492 142
1486 142 399 215 130 202 20 163 116 121 259 188 166 113 232 295 244 135 112 135 252 129 239 281 164 197 166 170 176 91 233 122
1204 122 223 122 291 257 262 138 298 152 288 248 177 155 308 224 135 359 294 243 236 241 303 267 498 336 421 342 451 401 570 489
922 489 428 649 577 485 719 558 930 1189 1633 2263 10080 4302 159 1137 3199 8289 41371 90679 29933 7335
734 7335 4072 2181 1313 736 1116 1074 990 1140 796 612 557 459 606 543 744 1223 655 1680 1018 302 362 281 449 428 249
500 249 329 167 153 207 431 175 251 250 125 232 150 188 325 173 291 111 16 206 131 202 191 261 22 235 72 208 306 51
237 51 266 114 37 167 134 76 167 233 150 110 230 129 129 122 194 204 263 100 62 127 229 9 279 125 258 201 100 87 185 197 190
$$ packed form
2058A49j02kN0O5M9j51l0J88j51P5p3J5M4K3j04N2Q6o8J8r2J15j0K2O0j59L8O4J60pMJ91M2
1758E61j83k78p4J13rR5k6q2n1L8LK6m4J10j13R6l7j07J11j06P1J20j21Q87P41r34l14jl50
1486A42K57j84q5P2j82J43m7NJ38p1k2n3J19O3n1j09k3K3J17j23J10M2j17L3l1MOq5J42j11
1204A22J01j01J69l4Nj24J60j46J36m0p1k2J53q4q9K24o5n1pNO2l6K31j62Q5p9J09n0J69q1
922D89o1K21p2r2K34j61L72K59M44O30P817n778m143R78K062N090L3082M9308o0746k2598
734G335l263j891q68n77L80m2q4J50l44j84n5r8J47o3K01M79n68J025o62p16O0q1J68k1j79
500B49Q0j62j4N4K24k56P6jj25J07q2L8J37j52J18j80r5J90p5P1j1P0k39K13j63J36R8k55
237E1K15j52p7J30l3n8R1O6q3m0J20j01%pP2J0N9j63l8O5J02k20K70j54J33n7j01j3R8J2p
$$ plain form
-54 190 232 47 118 37 122 172 192 9 290 205 235 177 106 93 114 230 57 78 88 99 154 172 56 283 66 115 145 28 204 165
-336 165 156 218 173 125 69 70
$$ packed form
-54A90M2j85P1q1Q5N0K0j83K81q5L0n8p1j3K1J16j73K1J0J1N5J8j16K27k17M9L0j17J76l9
-336A65rO2m5m8n6J
-392G0
##PAGE=	F1=-2805.64
##FIRST=	4405.895418600002813,	4405.895418600002813,	0
##DATA TABLE=	(F2++(Y..Y)), PROFILE
$$ plain form
4406 289 464 720 553 699 543 501 175 232 457 346 670 547 543 233 99 190 256 465 415 457 265 369 125 260 107 430
4162 430 511 396 204 184 50 109 409 330 515 307 220 122 54 219 350 347 332 347 104 189 297 110 454 352 326 239 145 77 87
3889 87 304 266 318 213 321 43 92 76 105 359 240 379 131 206 83 185 283 485 229 305 31 145 113 308 214 365 355
3636 355 153 261 164 134 263 237 285 132 292 121 74 338 232 310 156 230 216 144 105 247 226 333 159 224 164 170 288 157
3373 157 240 317 153 188 83 84 246 130 313 162 489 169 233 167 124 302 466 128 200 270 252 132 200 231 268 223 122 106 116
3101 116 229 262 287 142 235 197 96 103 549 459 285 600 116 357 84 242 172 267 240 231 159 125 94 96 307 357 450 87 167 67
2819 67 67 230 215 270 453 192 1035 502 60 279 279 299 125 276 31 292 76 190 476 76 123 187 306 116 224 243 284
2565 284 305 160 175 250 165 243 247 221 153 231 218 112 169 278 164 412 287 84 409 375 187 180 279 263 300 183 215 282 138 316
$$ packed form
4406B89J75K56j67J46j56m2l26N7K25j11L24j23ml10j34R1O6K09n0M2j92J04k44J35j53L23
4162D30Q1j15j92k0j34N9L00p9J85k08q7r8o8J65J31lj5J5k43Q5J08j87L44j02k6q7r4o8J0
3889H7K17l8N2j05J08k78M9j6K9K54j19J39k48P5j23J02R8K02k56P6k74J14l2J95r4J51j0
3636C55k02J08r7l0J29k6M8j53J60j71m7K64j06P8j54P4j4p2l9J42k1J07j74O5o0OJ18j31
3373A57Q3P7j64L5j05JJ62j16J83j51L27l20O4o6m3J78J64l38P2P0j8j20O8L1L7m5j01j6J0
3101A16J13L3K5j45R3l8j01PM46r0j74L15m84K41k73J58p0R5k7rp2l4l1KK11N0R3l63Q0j00
2819F7%J63j5N5J83k61Q43n33m42K19%K0j74J51k45K61k16J14K86m00M7O4J19j90J08J9M1
2565B84K1j45J5P5q5P8Mk6o8P8j3j06N7J09j14K48j25k03L25l4j88pR9j6L7j17L2O7j44J78
$$ plain form
2284 316 989 2218 1220 259 232 277 175 201 244 230 83 211 422 157 130 346 334 184 97 248 285 273 245 344 213 180 205 269
2021 269 259 279 231 412 220 159 149 116 286 376 203 289 343 258 232 167 277 345 357 370 173 195 118 425 329 476 262 759 256
1749 256 268 197 330 317 410 438 269 169 276 282 417 154 463 288 407 257 135 374 284 362 429 241 1026 2029 1287 566
1504 566 795 234 716 434 377 477 279 488 398 462 580 497 448 234 518 610 637 477 472 423 536 466 615 663 608 629 512 450
1241 450 529 497 648 601 717 599 740 652 711 591 812 695 868 858 701 619 846 849 828 1071 1019 939 914 879 973 1067 1425 1308 1379
969 1379 1258 1295 1319 1595 1693 1808 2071 2092 1869 2067 2012 2710 3480 4290 4557 10537 3318 2636 4752 11303 29005 159803
763 159803 339925 108247 28769 14622 7950 4622 3091 3514 3734 3695 3591 2899 2304 1961 1705 1858 1885 2105 2486
584 2486 849 2074 1512 885 1150 1137 1395 1207 990 968 789 714 887 1137 883 942 826 590 699 590 745 890 709 847
$$ packed form
2284C16O73J229r98r61k7M5j02K6M3j4j47J28K11k65k7K16j2j50q7J51L7j2k8R9j31l3K5O4
2021B69j0K0m8J81j92o1j0l3J70R0j73Q6N4q5k6o5J10O8J2J3j97K2p7L07r6J47k14M97n03
1749B56J2p1J33j3R3K8j69j00J07OJ35k63L09j75J19j50j22K39r0P8O7j88P85J003p42p21
1504E66K29n61M82k82n7J00j98K09r0O4J18q3m9k14K84R2K7j60nm9J13p0J49M8n5K1j17o2
1241D50P9l2J51m7J16j18J41q8N9j20K21j17J73j0j57q2K27Lk1K43n2q0k5l5R4R4L58j17P1
969A379j21L7K4K76R8J15K63K1k23J98n5O98P70Q10K67N980p219o82K116O551J7702J30798
763A59803J80122k31678p9478j4147o672l328j531M23K20l9j04o92n95l43k56J53K7K20L81
584B486j637J225n62o27K65j3K58j88k17k2j79p5J73K50k54N9j16k36J09j09J55J45j81J38
$$ plain form
359 847 500 393 587 632 660 698 762 480 593 270 535 693 530 703 512 393 417 391 367 558 593 608 456 502 287 375 435 537
96 537 437 635 427 262 289 470 295 601 438 584 346 241 182 358 458 560 598 279 351 81 214 414 493 350 651 467
-148 467 278 120 252 309 451 598 394 284 218 112 313 371 364 701 424 345 225 98 433 512 611 691 584 473 244 193
$$ packed form
359H47l47j07J94M5K8L8O4k82J13l23K65J58j63J73j91j19K4k6k4J91L5J5j52M6k15Q8O0J02
96E37j00J98k08j65K7J81j75L06j63J46k38j05n9J76J00J02L8l19P2k70J33K00P9j43L01j84
-148D67j89j58J32N7J42J47k04j10o6j06K01N8pL37k77p9j20j27L35P9R9Q0j07j11k29n1
-392A93
##PAGE=	F1=-2824.42
##FIRST=	4405.895418600002813,	4405.895418600002813,	0
##DATA TABLE=	(F2++(Y..Y)), PROFILE
$$ plain form
4406 533 906 1301 1177 1320 1101 847 336 375 790 777 1154 1069 954 506 157 332 460 866 855 906 597 541 123 305 382 780
4162 780 924 760 505 293 7 240 666 668 885 596 457 216 155 368 634 670 655 639 271 229 320 232 705 675 601 441 234
3908 234 11 188 489 552 604 465 502 166 187 169 370 611 509 629 268 272 200 309 481 726 528 471 189 236 205 478 448
3655 448 607 575 260 363 188 255 503 504 526 399 378 187 179 517 448 527 392 425 329 258 223 419 455 585 351 392 270 274 388
3382 388 338 484 549 358 334 189 195 439 310 540 407 624 149 316 286 290 519 696 246 373 421 211 268 368 427 490 392 261
3119 261 207 203 407 420 486 386 390 347 205 217 618 426 421 816 231 454 235 384 383 489 420 441 330 155 202 219 507 573 640 238
2838 238 267 182 192 351 443 455 617 435 1159 495 179 481 499 505 320 430 156 409 213 413 701 279 280 343 454 256 372
2584 372 465 479 486 358 348 375 333 418 490 426 348 399 370 211 331 481 386 630 461 196 564 491 405 374 530 490 481 321 389 430 296
$$ packed form
4406E33L73L95j24J43k19k54n11L9M15j3L77q5j15m48l49J75J28M06j1N1l09n6m18J82P7L98
4162G80J44j64k55k12k86K33M26KK17k89j39k41o1K13K66L6j5j6l68m2R1q8M73l0p4j60k07
3908B34k23J77L01O3N2j39L7l36K1j8K01K41j02J20l61Mp2J09J72K45j98n7k82M7l1K73l0
3655D48J59l2l15J03j75O7K48JK2j27k1j91qL38o9P9j35L3r6p1l5J96L6J30k34M1j22MJ14
3382C88n0J46O5j91k4j45OK44j29K30j33K17m75J67l0MK29J77m50J27M8k10N7J00N9O3r8j31
3119B61n4mK04J3O6j00Mm3j42J2M01j92nL95n85K23k19J49jJ06o9K1j11j75M7J7K88O6O7m02
2838B38K9q5J0J59R2J2J62j82P24o64l16L02J8Oj85J10k74K53j96K00K88m22JO3J11j98J16
2584C72R3J4Pj28j0K7m2Q5P2o4p8N1k9j59J20J50r5K44j69k65L68p3q6l1J56m0rj60O8M1j34
$$ plain form
2293 296 598 1188 2323 1139 299 296 533 352 423 473 441 239 369 590 68 498 603 595 352 284 392 483 486 463 604 440 378
2040 378 380 436 391 574 506 654 467 321 382 296 504 660 489 575 558 456 387 420 486 609 624 616 433 346 312 572 548 652 290
1767 290 898 386 498 434 589 646 743 749 513 420 520 525 779 477 807 601 694 479 382 675 623 748 695 487 1136 2650 1830
1514 1830 861 1201 697 1153 767 726 827 635 920 858 920 1007 895 841 618 947 1029 1147 959 955 886 920 902 1115 1177 1197 1193 1008
1251 1008 891 992 1037 1201 1245 1398 1254 1346 1163 1294 1221 1486 1448 1645 1644 1396 1250 1556 1667 1734 2008 1977 1851 1791 1734 1884 2132
997 2132 2622 2599 2638 2465 2415 2519 2936 3274 3637 3962 4058 3680 3780 3965 5077 6490 7930 8568 12187 6309 6294 9614 22059
781 22059 56394 313257 665496 211107 56924 28500 15501 8932 6257 6573 7266 7241 6801 5673 4523 3760
631 3760 3355 3502 3684 3865 3920 2445 3075 2117 2020 2340 2259 2689 2350 2000 1848 1610 1505 1793 2071 1841 1837 1580 1229 1325 1267
$$ packed form
2293B96L02N90J135j184q40lK37j81P1N0l2k02J30K21n22M30J05qk43o8J08R1Lk3J41j64o2
2040C78KN6m5J83o8J48j87j46O1q6K08J56j71Q6j7j02o9L3O6J23J5qj83q7l4K60k4J04l62
1767B90O08n12J12o4J55N7R7Ok36r3J00NK54l02L30k06R3k15r7K93n2J25n3k08O49J514q20
1514A830r69L40n04M56l86m1J01j92K85o2O2Q7j12n4k23L29Q2J18j88mo9L4j8K13O2K0mj85
1251A008j17J01M5J64M4J53j44R2j83J31p3K65l8J97jk48j46L06J11O7K74l1j26o0n7J50K48
997B132M90k3L9j73n0J04M17L38L63L25R6l78J00J85J112J413J440O38L619n878j5L320J2445
781B2059L4335K56863L52239m54389j54183k8424j2999o569k675L16O93k5m40j128j150p63
631C760m05J47J82J81N5j475O30r58r7L20q1M30l39l50j52k38j05K88K78k30mk57l51R6n8
$$ plain form
396 1267 1483 1639 1491 1558 1059 909 1094 1271 1275 1374 1407 1076 1061 670 972 1220 1151 1275 1067 860 756 731 777 1081 1081 1206 922
143 922 852 582 693 871 1003 899 1116 853 547 509 778 702 1035 934 1019 654 439 412 652 835 1044 1070 630 635 224 378
-101 378 732 902 811 1107 800 431 147 449 655 924 1072 835 574 382 129 533 720 868 1225 909 650 347 195 732
-327 732 985 1219 1312 1123 915 499 379
$$ packed form
396A267K16J56j48O7m99j50J85J77MR9L3l31j5l91L02K48o9J24k08k07j04k5M6L04%J25k84
143I22p0k70J11J78J32j04K17k63l06l8K69p6L33j01Q5l65k15k7K40J83K09K6m40Nm11J54
-101C78L54J70r1K96l07l69k84L02K06K69J48k37k61j92k53M04J87J48L57l16k59l03j52N37
-327G32K53K34R3j89k08m16j20
-392C79
##PAGE=	F1=-2843.2
##FIRST=	4405.895418600002813,	4405.895418600002813,	0
##DATA TABLE=	(F2++(Y..Y)), PROFILE
$$ plain form
4406 806 1388 1921 1859 2000 1687 1207 539 546 1144 1265 1667 1629 1392 813 243 490 706 1291 1334 1382 967 714 122 353 704
4171 704 1167 1367 1147 820 416 57 425 943 1036 1284 923 712 318 254 544 942 1039 1002 937 456 277 365 470 965 1052 906
3927 906 666 390 112 358 702 867 917 760 699 291 275 293 669 882 815 896 460 345 327 476 726 990 846 647 368 337
3683 337 337 667 710 864 815 480 470 223 389 758 791 785 683 492 271 311 701 686 778 649 644 453 378 364 600 708 855 577
3420 577 576 384 384 514 543 759 784 579 493 308 326 619 555 790 667 760 266 399 415 490 780 923 438 567 576 222 459 564
3157 564 652 752 571 420 318 317 605 592 704 649 549 516 313 361 694 549 617 1053 400 564 404 529 620 738 608 682 498
2903 498 229 341 385 729 801 834 470 394 324 325 506 689 671 805 693 1268 490 341 688 725 743 529 584 306 532 370 644
2650 644 930 530 459 512 592 416 551 695 700 696 580 533 500 514 597 755 644 573 578 528 325 505 708 641 857 680 348 710 631
$$ packed form
4406H06N82N33o2J41l13m80o68PN98J21M02l8k37n79n70K47K16N85M3M8m15k53n92K31L51
4171G04M63K00k20l27m04l59L68N18R3K48l61k11l94o4K90L98R7l7o5m81j79Q8J05M95Q7j46
3927I06k40k76k78K46L44J65N0j57o1m08j6J8L76K13o7Q1m36j15j8J49K50K64j44j99k79l1
3683C37%L30M3J54m9l35j0k47J66L69L3oj02j91k21M0L90j5R2j29nj91p5j4K36J08J47k78
3420E77jj92%J30K9K16K5k05q6j85J8K93o4K35j23R3m94J33J6P5K90J43m85J29Rl54K37J05
3157E64Q8J00j81j51j02jK88j3J12n5j00l3k03M8L33j45O8M36o53J64j60J25R1J18j30P4j84
2903D98k69J12M4L44P2L3l64p6p0JJ81J83j8J34j12N75p78j49L47L7J8k14N5k78K26j62K74
2650F44K86m00p1N3Q0j76J35J44Nmj16m7l3J4Q3J58j11p1Nn0k03J80K03o7K16j77l32L62p9
$$ plain form
2378 631 647 596 788 735 662 481 575 591 507 886 1340 2243 961 428 405 784 570 671 726 678 417 535 765 106 901 884 885
2124 885 539 521 554 694 746 750 891 684 596 574 621 583 884 811 906 736 535 631 495 742 962 809 887 792 678 568 684 745
1861 745 877 925 907 724 536 586 747 957 767 980 990 710 748 695 871 1010 1115 1078 799 698 793 795 1162 849 1173 954 988
1608 988 747 664 991 1005 1164 995 790 1345 3586 2389 1296 1627 1203 1621 1149 1110 1195 1032 1389 1370 1424 1466 1326 1270 1046
1373 1046 1419 1487 1696 1478 1476 1392 1347 1370 1649 1738 1843 1797 1565 1392 1492 1625 1801 1944 2146 1960 2002 1713 1920 1912 2215 2284 2484
1119 2484 2487 2154 1954 2321 2554 2711 3026 3022 2843 2728 2670 2889 3282 3905 4011 4008 3774 3644 3810 4388 4988 5630 6037 6168 5638
885 5638 5619 6097 7674 9758 11923 13077 15036 11037 10296 14983 33795 86205 477959 1017334 322820 87501
734 87501 43632 23636 13554 9750 9845 11126 11085 10278 8672 6928 5677 5151 5287 5650 5749 5383 4488 4508 2874 3317
$$ packed form
2378F31J6n1J92n3p3j81R4J6q4L79M54R03j282n33k3L79k14J01N5m8k61J18K30o59P95j7J
2124H85l46j8L3J40N2MJ41k07q8k2M7l8L01p3R5j70k01R6j36K47K20j53P8r5j14j10J16O1
1861G45J32M8j8j83j88N0J61K10j90K13J0k80L8n3J76J39J05l7k79j01R5KL67l13L24k19L4
1608I88k41q3L27J4J59j69k05N55K241j197j093L31m24M18m72l9Q5j63L57j9N4M2j40n6k24
1373A046L73O8K09k18kq4m5K3K79Q9J05m6k32j73J00J33J76J43K02j86M2k89K07qL03O9K00
1119B484Ll33k00L67K33J57L15mj79j15n8K19L93O23J06lk34j30J66N78O00O42M07J31n30
885E638j9M78J577K084K165J154J959l999p41M687J8812N2410L91754N39375o94514k35319
734H7501m3869j9996j0082l804R5J281m1q07j606j744j251n26J36L63R9l66q95K0j634M43
$$ plain form
547 3317 3655 3481 4124 3597 3108 2798 2503 2388 2781 3083 2885 2795 2390 1936 2012 2015 2290 2453 2349 2313 1676 1481 1647 1950 1953 2111
302 2111 2093 1715 1568 1124 1452 1795 1819 1895 1674 1367 1121 1103 1238 1647 1622 1837 1438 1215 926 1031 1354 1507 1442 1625 1311
68 1311 870 754 1102 1161 1515 1463 1487 1021 660 669 986 1266 1558 1563 1040 931 400 573 1076 1358 1308 1586 1152 640 260 669
-176 669 1040 1442 1576 1313 897 552 157 782 1127 1415 1780 1440 976 486 304 1052 1509 1876 1979 1707 1385 772 571
$$ packed form
547C317L38j74O43n27m89l10k95j15L93L02j98r0m05m54P6LK75J63j04l6o37j95J66L03LJ58
302B111j8l78j47m44L28L43K4P6k21l07k46j8J35M09k5K15l99k23k89J05L23J53o5J83l14
68A311m41j16L48N9L54n2K4m66l61RL17K80K92Nn23j09n31J73N03K82n0K78m34n12l80M09
-176F69L71M02J34k63m16l45l95O25L45K88L65l40m64m90j82P48M57L67J03k72l22o13k01
-392E71
##PAGE=	F1=-2861.98
##FIRST=	4405.895418600002813,	4405.895418600002813,	0
##DATA TABLE=	(F2++(Y..Y)), PROFILE
$$ plain form
4406 1055 1820 2468 2475 2610 2195 1515 725 710 1451 1716 2117 2125 1773 1086 333 633 944 1663 1766 1797 1307 854 126 400 996
4171 996 1518 1759 1484 1094 531 108 598 1189 1365 1636 1226 938 398 330 716 1213 1373 1307 1191 622 322 421 708 1182
3946 1182 1397 1177 874 547 214 523 901 1147 1200 1031 871 399 345 423 941 1123 1100 1128 644 404 441 643 957 1220 1128
3711 1128 798 536 424 471 838 945 1088 1035 690 562 272 514 982 1049 1011 935 606 349 441 851 906 1007 879 840 561 486
3467 486 501 757 934 1097 783 739 483 478 644 725 1009 983 775 634 412 456 752 796 1013 896 877 390 464 528 677 1024 1108
3213 1108 622 746 704 285 638 751 862 1000 725 563 419 425 786 742 899 888 677 664 405 509 761 766 796 1266 564 669
2969 669 559 646 840 964 772 907 634 320 470 534 930 995 994 694 518 464 438 660 906 871 978 916 1351 498 492 860 917
2716 917 965 716 712 446 637 520 843 1123 772 623 661 694 568 729 890 891 894 774 695 601 668 753 993 829 787 732 654 438 665
$$ packed form
4406A055P65O48PJ35m15o80p90j5P41K65M01Ql52o87p53L00L11P19J03L1m90m53p28K74N96
4171I96N22K41k75l90n63m23M90N91J76K71m10k88n40o8L86M97J60o6j16n69l00R9K87M74
3946A182K15k20l03l27l33L09L78K46N3j69j60m72n4P8N18J82k3K8m84k40L7K02L14K63r2
3711A128l30k62j12M7L67J07J43n3l45j28k90K42M68O7l8p6l29k57R2M10N5J01j28l9k79p5
3467D86J5K56J77J63l14m4k56nJ66Q1K84k6k08j41k22M4K96M4K17j17j9m87P4O4J49L47Q4
3213A108m86J24m2m19L53J13J11J38k75j62j44OL61m4J57j1k11j3k59J04K52NL0M70p02J05
2969F69j10Q7J94J24j92J35k73l14J50O4L96O5jl00j76n4k6K22K46l5J07o2M35q53oL68N7
2716I17M8k49mk66J91j17L23K80l51j49L8L3j26J61J61JLj20p9r4O7Q5K40j64m2n5p8k16K27
$$ plain form
2443 665 905 886 1046 884 493 817 759 862 807 1007 955 807 624 733 735 707 1123 1420 1989 783 591 535 986 788 895 952
2199 952 898 583 675 908 265 1216 1137 1148 706 748 703 877 976 1031 1150 898 793 749 786 785 1151 1087 1121 976 739 852 670 954
1936 954 1229 1100 1169 1001 887 740 915 1003 1096 1202 1177 990 730 856 914 1405 780 1661 1103 1004 966 931 1124 1337 1439 1358
1692 1358 1066 945 1045 1039 1496 1197 1489 1276 1234 997 928 1258 1356 1527 1266 1088 1608 4550 2902 1735 1988 1661 2023 1501
1467 1501 1460 1511 1399 1807 1838 1882 1865 1715 1654 1434 1838 1900 2182 1937 1939 1842 1739 1787 2118 2238 2426 2330 2078 1855 1932 2155 2332
1213 2332 2571 2815 2591 2584 2201 2473 2531 2863 3048 3227 3231 2834 2598 2998 3348 3578 3937 3960 3736 3555 3511 3802 4296 5039 5285
979 5285 5236 4943 4752 4950 5682 6522 7420 7915 8026 7381 7260 8003 10022 12682 15512 17111 18114 15482 13897 19879 44354
781 44354 112900 623324 1330374 422793 114871 57268 30821 17617 12892 12796 14585 14523 13377 11339 9077
$$ packed form
2443F65K40j9J60j62l91L24n8J03n5K00n2j48j83J09Kk8M16K97N69j206j92n6M51j98J07N7
2199I52n4l15R2K33o43R51p9J1m42M2m5J74R9N5J19k52j05m4L7jL66o4L4j45k37J13j82K84
1936I54K75j29O9j68j14j47J75Q8R3J06k5j87k60J26N8M91o25Q81n58r9l8l5J93K13J02q1
1692A358k92j21J00oM57k99K92k13m2k37o9L30R8J71k61j78N20K942j648j167K53l27L62n22
1467A501m1N1j12M08L1M4j7j50o1k20M04O2K82k45Kr7j03M8L31J20J88r6k52k23P7K23J77
1213B332K39K44k24pl83K72N8L32J85J79Ml97k36M00L50K30L59K3k24j81m4K91M94P43K46
979E285m9k93j91J98P32Q40Q98M95J11o45j21P43K019K660K830J599J003k632j585N982K4475
781D4354O8546N10424P07050r07581l07922n7603k6447j3204m725r6J789o2j146k038k262
$$ plain form
640 9077 7361 6757 6880 7414 7417 6737 6305 5792 3702 4484 4830 4598 5410 4708 4108 3641 3301 3193 3667 3984 3820 3639 3106
425 3106 2578 2629 2688 3020 3182 3114 2972 2236 1999 2142 2552 2569 2768 2694 2281 2018 1542 1888 2306 2415 2447 2216 1824 1444 1437 1662
180 1662 2150 2116 2381 1912 1515 1245 1325 1794 1952 1951 2068 1714 1170 977 1379 1588 1951 1922 1899 1360 860 902 1290 1667 2008 1985
-64 1985 1430 1188 571 755 1382 1778 1749 2000 1458 842 377 873 1389 1906 2020 1739 1191 695 198 1012 1506 1902 2267 1916
-289 1916 1259 613 409 1334 1985 2462 2568 2226 1801 1010 730
$$ packed form
640I077j716o04J23N34Lo80m32n13k090P82L46k32Q12p02o00m67l40j08M74L17j64j81n33
425C106n28N1N9L32J62o8j42p36k37J43M10J7J99p4m13k63m76L46M18J09L2k31l92l80pK25
180A662M88l4K65m69l97k70Q0M69J58jJ17l54n44j93M02K09L63k9k3n39n00M2L88L77L41k3
-64A985n55k42o17J84O27L96k9K51n42o16m65M96N16N17J14k81n48m96m97Q14M94L96L65l51
-289A916o57o46k04R25O51M77J06l42m25p91k80
-392G30
##PAGE=	F1=-2880.76
##FIRST=	4405.895418600002813,	4405.895418600002813,	0
##DATA TABLE=	(F2++(Y..Y)), PROFILE
$$ plain form
4406 1231 2115 2832 2901 3026 2524 1709 851 834 1646 2035 2414 2455 2023 1266 406 733 1120 1909 2065 2065 1546 933 137 432 1203
4171 1203 1758 2022 1700 1277 615 146 720 1352 1586 1866 1446 1089 435 369 847 1388 1606 1503 1353 735 353 469 892
3955 892 1308 1637 1351 1021 661 294 644 1041 1333 1399 1219 977 474 386 528 1130 1285 1307 1275 779 429 519 767 1122 1363
3720 1363 1322 888 660 477 575 954 1102 1233 1192 831 621 328 603 1132 1227 1157 1109 688 404 544 934 1067 1159 1042 967 629
3476 629 560 606 858 1086 1263 927 842 545 538 749 845 1183 1106 905 726 479 561 813 981 1162 1055 955 458 498 603 814
3232 814 1192 1213 751 874 774 352 766 887 1014 1178 825 659 488 501 915 838 1032 1058 746 760 466 629 802 961 903
2997 903 1414 682 745 672 711 1000 1119 878 1072 712 400 566 632 1073 1112 1081 859 611 572 508 780 1050 1013 1095 1066 1394 516
2744 516 598 961 1038 1121 846 791 546 699 631 972 1238 957 741 759 736 685 867 1010 1010 1033 901 800 657 760 861 1153 942
$$ packed form
4406A231Q84P17O9J25n02q15q58j7Q12L89L79M1m32p57q60L27L87P89J56%n19o13p96K95P71
4171A203N55K64l22m23o62m69N74O32K34K80m20l57o54o6M78N41K18j03j50o18l82J16M23
3955H92M16L29k86l30l60l67L50L97K92O6j80k42n03q8J42O02J55K2l2m96l50R0K48L55K41
3720A363m1m34k28j83R8L79J48J31m1l61k10k93K75N29R5p0m8m21k84J40L90J33R2j17p5l38
3476F29o9M6K52K28J77l36q5k97pK11R6L38p7k01j79k47Q2K52J68J81j07j00m97M0J05K11
3232H14L78K1m62J23j00m22M14J21J27J64l53j66j71J3M14p7J94K6l12J4k94J63J73J59n8
2997I03N11p32O3p3L9K89J19k41J94l60l12J66O6M41L9l1k22k48l9o4K72K70l7Q2k9L28q78
2744E16Q2L63P7Q3k75n5k45J53o8L41K66k81k16J8k3n1J82J43%K3j32j01j43J03J01K92k11
$$ plain form
2490 942 948 827 720 530 780 1025 1076 1150 1026 599 863 836 1005 965 1141 1111 881 721 831 835 851 1258 1416 1609 762 732 649
2237 649 1102 961 1048 1096 1056 701 758 980 433 1392 1313 1330 816 922 808 992 1126 1242 1329 1038 928 866 896 944 1320 1279 1256
1983 1256 1136 883 1006 783 1096 1409 1299 1367 1143 1040 867 1068 1205 1223 1396 1367 1179 883 1067 1032 1760 743 2134 1298
1758 1298 1162 1104 1093 1292 1556 1642 1531 1254 1111 1224 1206 1715 1450 1685 1497 1384 1174 1118 1420 1600 1760 1445 1322 1859 5236
1523 5236 3296 2064 2208 1987 2273 1750 1710 1709 1661 2092 2165 2201 2121 1987 1913 1704 2116 2180 2504 2242 2250 2145 2010 2070 2427 2575
1279 2575 2827 2685 2439 2187 2217 2519 2684 2997 3265 3027 2975 2526 2842 2954 3296 3585 3723 3725 3296 3053 3448 3890 4155 4553
1054 4553 4601 4352 4106 4083 4437 4962 5791 6159 6076 5731 5514 5707 6552 7564 8642 9213 9250 8555 8372 9290 11639 14660 17952
838 17952 19812 20325 18554 16375 23319 51594 131014 719730 1540919 490711 133477 66673 35571 20282
$$ packed form
2490I42Oj21j07j90K50K45N1P4j24m27K64k7J69m0J76l0k30j60J10MJ6M07J58J93q47l0q3
2237F49M53j41Q7M8m0l55N7K22n47R59p9J7n14J06j14J84J34J16Q7k91j10o2L0M8L76m1k3
1983A256j20k53J23k23L13L13j10O8k24j03j73K01J37J8J73k9j88k96J84l5P28j017J391q36
1758A298j36n8j1J99K64Q6j11k77j43J13j8N09k65K35j88j13k10n6L02J80J60l15j23N37L377
1523E236j940j232J44k21K86n23m0jm8M31P3L6q0j34p4k09M12O4L24k62Qj05j35O0L57J48
1279B575K52j42k46k52L0L02J65L13K68k38n2m49L16J12L42K89J38Km29k43L95M42K65L98
1054D553M8k49k46k3L54N25Q29L68q3l45k17J93Q45J012J078N71L7o95j83R18K349L021L292
838A7952J860N13j771k179O944K8275P9420N88716Q21189j050208l57234o6804l1102j5289
$$ plain form
706 20282 14977 14951 16913 16859 15465 13132 10534 8475 7837 7952 8613 8538 7833 7325 6468 4452 5243 5612 5406 6254 5460 4800
500 4800 4203 3838 3755 4270 4587 4455 4195 3582 3023 3047 3147 3531 3673 3628 3399 2624 2358 2479 2959 2997 3211 3083 2660 2321 1838
265 1838 2191 2646 2820 2819 2577 2140 1656 1665 1960 2488 2465 2726 2250 1686 1473 1513 2097 2250 2321 2353 1981 1386 1132 1552 1897 2251
21 2251 2219 2171 1597 996 1067 1502 1953 2303 2250 1716 1355 698 882 1587 2078 2044 2263 1651 987 459 1020 1628 2220 2313 2027 1398
-223 1398 780 241 1174 1773 2231 2590 2243 1440 701 491 1519 2315 2859 2960 2575 2081 1167 824
$$ packed form
706B0282n305k6J962n4j394k333k598k059o38J15O61p5p05n08q57k016P91L69k06Q48p94o60
500D800n97l65q3N15L17j32k60o13n59K4J00L84J42m5k29p75k66J21M80L8K14j28m23l39m83
265A838L53M55J74jk42m37m84RK95N28k3K61m76n64k13M0N84J53P1L2l72n95k54M20L45L54
21B251l2m8n74o01P1M35M51L50n3n34l61o57J84P05M91l4K19o12o64n28N61O08N92R3k86o29
-223A398o18n39R33N99M58L59l47q03p39k10J028P96N44J01l85m94r14l43
-392H24
##PAGE=	F1=-2899.54
##FIRST=	4405.895418600002813,	4405.895418600002813,	0
##DATA TABLE=	(F2++(Y..Y)), PROFILE
$$ plain form
4406 1297 2210 2936 3047 3155 2607 1748 888 890 1688 2154 2497 2546 2089 1317 442 766 1192 1981 2167 2128 1632 931 153 437
4181 437 1287 1831 2101 1748 1333 649 165 765 1396 1655 1924 1538 1132 418 366 906 1429 1691 1547 1388 770 360 487 984
3955 984 1312 1727 1387 1074 703 336 695 1089 1381 1476 1284 989 502 393 588 1197 1335 1392 1303 836 409 547 819 1179
3730 1179 1381 1394 894 714 484 626 986 1148 1268 1253 872 638 374 637 1176 1290 1190 1171 715 422 601 929 1138 1197
3504 1197 1109 998 638 586 656 882 1127 1319 979 864 554 554 805 880 1239 1128 942 748 494 623 792 1065 1200 1114 975
3270 975 450 491 625 873 1244 1216 795 921 770 388 817 944 1077 1247 852 687 512 530 965 859 1072 1128 738 785 485
3035 485 694 809 1057 909 1464 725 772 721 712 1064 1171 902 1143 716 447 609 655 1127 1128 1074 930 652 622 519 840 1091
2791 1091 1065 1124 1123 1381 532 639 966 1062 1177 894 806 583 703 680 1007 1248 1046 788 782 710 744 934 1030 1033 1080 936 829 656
$$ packed form
4406A297R13P26J11J08n48q59q60KP98M66L43M9m57p72q75L24M26P89J86l9m96p01p78K84
4181D37Q50N44K70l53m15o84m84O00O31K59K69l86m06p14n2N40N23K62j44j59o18m10J27M97
3955I84L28M15l40l13l71l67L59L94K92R5j92k95m87j09J95O09J38N7q9m67m27J38K72L60
3730A179K02J3n00j80k30J42L60J62J20j5l81k34k64K63N39J14j00j9m56k93J79L28K09N9
3504A197q8j11l60n2P0K26K45J92l40j15l10%K51P5L59j11j86j94k54J29J69K73J35q6j39
3270I75n25M1J34K48L71k8m21J26j51l82M29J27J33J70l95j65j75J8M35j06K13N6l90M7l00
3035D85K09J15K48j48N55p39M7n1rL52J07k69K41m27k69J62M6M72Jn4j44k78l0j03L21K51
2791A091k6N9jK58q49J07L27R6J15k83q8k23J20k3L27K41k02k58op2L4J90R6LM7j44j07j73
$$ plain form
2528 656 765 901 1202 956 1023 843 706 584 828 1035 1176 1141 1077 646 836 836 1044 1038 1163 1173 862 751 847 871 910 1263 1336
2274 1336 1194 861 822 712 1112 1049 1095 1123 1121 747 766 960 564 1409 1376 1391 843 1006 847 1011 1165 1336 1390 1073 971 896 925
2021 925 1019 1355 1346 1282 1184 934 1063 809 1136 1466 1362 1443 1185 1105 920 1113 1306 1229 1462 1431 1250 960 1177 1066 1918 808
1777 808 2255 1532 1139 1127 1146 1340 1619 1677 1557 1317 1162 1292 1258 1776 1550 1716 1565 1408 1237 1194 1443 1678 1815 1482 1446
1542 1446 2046 5473 3501 2206 2237 2117 2314 1838 1811 1743 1763 2182 2285 2314 2174 2086 1994 1799 2193 2266 2590 2329 2342 2237 2101
1307 2101 2158 2512 2675 2960 2787 2567 2320 2283 2640 2781 3132 3396 3177 3090 2615 2949 3090 3418 3780 3867 3865 3441 3220 3575 4064
1072 4064 4319 4741 4808 4560 4269 4260 4657 5136 5998 6443 6349 5967 5761 5919 6808 7894 9034 9651 9574 8913 8713 9682 12173 15262
847 15262 18707 20595 20905 19601 17214 24574 53964 136635 746558 1603922 512045 139336 69859 36852
$$ packed form
2528F56J09J36L01k46O7j80j37j22K44K07J41l5o4m31J90%K08oJ25J0l11j11R6K4L9L53P3
2274A336j42l33l9j10M00o3M6K8kl74J9J94l96Q45l3J5n48J63j59J64J54J71N4l17j02p5K9
2021I25R4L36ro4r8k50J29k54L27L30j04Q1k58q0j85J93J93p7K33l1j81k90K17j11Q52j110
1777H08J447p23l93j2J9J94K79N8j20k40j55J30l4N18k26J66j51j57j71m3K49K35J37l33l6
1542A446O00L427j972j295L1j20J97m76k7o8K0M19J03K9j40q8r2j95L94P3L24k61J3j05j36
1307B101N7L54J63K85j73k20k47l7L57J41L51K64k19q7m75L34J41L28L62Q7km24k21L55M89
1072D064K55M22O7k48k91rL97M79Q62M45r4l82k06J58Q89J086J140O17p7o61k00R69K491L089
847A5262L445J888L10j304k387P360K9390Q2671O09923Q57364j091877l72709o9477l3007
$$ plain form
716 36852 20966 15470 16016 17579 17595 16089 13670 10984 8787 8156 8268 8992 8875 8487 7253 6425 4985 5417 5832 5753
528 5753 6451 5697 5039 4363 3999 3954 4461 4761 4657 4343 3715 3176 3173 3294 3716 3814 3779 3500 2756 2483 2583 3093 3143 3341 3175
293 3175 2776 2409 1947 2295 2741 2951 2928 2679 2251 1712 1733 2067 2587 2594 2799 2379 1686 1559 1554 2198 2340 2470 2421 2055 1474 1184
49 1184 1581 2022 2348 2293 2242 1679 1037 1132 1576 2058 2382 2300 1834 1400 750 925 1644 2193 2132 2314 1690 1041 484 1079 1707
-186 1707 2317 2393 2117 1473 785 272 1232 1868 2336 2680 2351 1480 729 530 1569 2425 2985 3074 2679 2170 1208 833
$$ packed form
716C6852j5886n496N46J563J6j506k419k686k197o31J12P24j17l88j234q28j440M32M15p9
528E753O98p54o58o76l64m5N07L00j04l14o28n39lJ21M22R8l5k79p44k73J00N10N0J98j66
293C175l99l67m62L48M46K10k3k49m28n39K1L34N20PK05m20o93j27nO44J42J30m9l66n81k90
49A184L97M41L26n5n1n63o42R5M44M82L24q2m66m34o50J75P19N49o1J82o24o49n57N95O28
-186A707O10P6k76o44o88n13R60O36M68L44l29q71p51j99J039Q56N60Q9l95n09r62l75
-392H33
##PAGE=	F1=-2918.32
##FIRST=	4405.895418600002813,	4405.895418600002813,	0
##DATA TABLE=	(F2++(Y..Y)), PROFILE
$$ plain form
4406 1241 2084 2755 2883 2968 2427 1624 826 865 1563 2044 2347 2375 1959 1227 430 724 1144 1864 2052 1972 1545 845 168 405
4181 405 1238 1717 1979 1617 1254 626 162 725 1309 1558 1793 1484 1056 349 329 875 1323 1614 1428 1288 719 338 463 970
3955 970 1186 1654 1277 1018 663 332 667 1033 1276 1419 1214 900 479 370 592 1129 1261 1335 1202 803 344 522 784 1116
3730 1116 1266 1332 809 691 442 612 927 1076 1185 1204 804 612 399 604 1110 1227 1103 1110 673 399 601 835 1105 1106 1071
3495 1071 925 584 559 644 823 1049 1252 929 800 509 523 794 822 1165 1044 878 695 452 629 696 1032 1119 1066 931 367
3260 367 444 587 845 1165 1118 744 877 693 380 782 906 1039 1187 798 638 487 506 927 798 1006 1087 656 735 456 692
3026 692 781 1025 816 1399 683 740 698 647 1016 1110 839 1104 647 448 592 602 1079 1042 968 894 632 603 469 824 1021 1016 1057 1084
2763 1084 1305 534 610 871 985 1119 852 754 548 643 655 945 1145 1023 755 721 620 739 915 942 956 1020 874 778 598 681
$$ packed form
4406A241Q43O71J28Q5n41q03p98L9O98M81L03K8m16p32p97K94M20P20J88q0m27p00o77K37
4181D05Q33M79K62l62l63o28m64N63N84K49K35l09m28p07k0N46M48K91j86j40n69l81J25N07
3955I70K16M68l77k59l55l31L35L66K43J43k05l14m21j09K22N37J32P4j33l99m59J78K62L32
3730A116J50O6n23j18k49J70L15J49J09J9m00j92k13K05N06J17j24Pm37k74K02K34K70Jl5
3495A071j46l41k5Q5J79K26K03l23j29k91J4K71K8L43j21j66j83k43J77O7L36Q7n3j35n64
3260C67P7J43K58L20m7l74J33j84l13M02J24J33J48l89j60j51J9M21j29K08Q1m31P9k79K36
3026F92Q9K44k09N83p16N7m2n1L69R4k71K65m57j99J44J0M77l7p4p4k62k9j34L55J97nM1K7
2763A084K21p71P6K61J14J34k67r8k06R5J2K90K00j22k68l4j01J19J76K7J4O4j46r6j80Q3
$$ plain form
2519 681 866 1130 866 999 775 616 590 798 928 1170 1014 1023 627 738 751 970 1015 1066 1133 751 712 779 834 873 1133 1201 851
2265 851 866 849 699 1018 1029 1026 1020 1077 711 694 848 622 1277 1313 1313 777 983 809 927 1089 1290 1319 997 909 829 866 993 1250 1277
1993 1277 1189 1109 880 1016 738 1064 1385 1272 1380 1118 1065 889 1042 1283 1113 1384 1353 1188 935 1165 1001 1827 1009 1980
1767 1980 1681 951 1031 1079 1259 1514 1537 1431 1241 1092 1233 1185 1664 1480 1570 1466 1301 1172 1138 1327 1570 1682 1364 1437 2140
1533 2140 5254 3468 2133 2068 2029 2135 1743 1746 1601 1684 2060 2174 2199 2011 1991 1880 1702 2051 2137 2422 2183 2193 2100 1988 2032 2355
1288 2355 2516 2795 2615 2432 2226 2114 2494 2602 2948 3179 3014 2906 2443 2774 2912 3197 3589 3629 3619 3238 3062 3350 3832 4036
1063 4036 4457 4535 4318 4014 4000 4411 4777 5613 6073 6000 5600 5434 5539 6388 7443 8511 9128 8925 8379 8200 9099 11498 14352
847 14352 17596 19292 19563 18458 16255 23378 50942 128509 697991 1505633 482134 131154 66138 34374
$$ packed form
2519F81J85K64k64J33k24j59k6K08J30K42j56Rl96J11J3K19M5N1O7l82l9O7N5L9K60O8l50
2265H51J5j7j50L19J1loN7l66j7J54k26O55L6%n36K06j74J18J62K01K9l22q8q0L7J27K57K7
1993A277q8q0k29J36k78L26L21j13J08k62n3j76J53K41j70K71l1j65k53K30j64Q26q18R71
1767A980k99p30Q0M8J80K55K3j06j90j49J41m8M79j84R0j04j65j29l4J89K43J12l18P3P03
1533B140L114j786j335o5l9J06l92Lj45Q3L76J14K5j88k0j11j78L49Q6K85k39J0r3j12M4L23
1288B355J61K79j80j83k06j12L80J08L46K31j65j08m63L31J38K85L92M0j0l81j76K88M82K04
1063D036M21P8k17l04j4M11L66Q36M60p3m00j66J05Q49J055J068O17k03n46j79Q99K399K854
847A4352L244J696K71j105k203P123K7564P7567N69482Q07642j023499l50980o5016l1764
$$ plain form
716 34374 19510 14156 15956 16401 16568 15107 12834 10322 8233 7642 7752 8472 8346 8500 6200 5922 5181 4984 5451 5570
528 5570 5954 5368 4775 4085 3749 3752 4199 4465 4385 4049 3476 3005 2976 3100 3540 3567 3540 3251 2602 2353 2431 2929 2975 3130 2949 2607
284 2607 2264 1846 2177 2569 2782 2750 2499 2138 1599 1626 1958 2427 2473 2583 2274 1513 1481 1442 2070 2206 2367 2255 1918 1417 1120
49 1120 1457 1936 2216 2133 2095 1588 972 1087 1498 1958 2230 2122 1753 1315 712 874 1539 2099 1996 2138 1563 991 446 1036
-176 1036 1609 2176 2243 1991 1400 709 281 1172 1767 2198 2515 2220 1370 685 516 1473 2292 2813 2882 2515 2049 1126 753
$$ packed form
716C4374j4864n354J800M45J67j461k273k512k089n91J10P20j26J54k300k78p41j97M67J19
528E570L84n86n93o90l36LM47K66q0l36n73m71k9J24M40K7k7k89o49k49P8M98M6J55j81l42
284B607l43m18L31L92K13l2k51l61n39K7L32M69M6J10l09p61l2l9O28J36J61j12l37n01k97
49A120L37M79K80q3l8n07o16J15M11M60K72j08l69m38o03J62O65N60j03J42n75n72n45N90
-176A036N73N67O7k52n91o91m28Q91N95M31L17k95q50o85j69R57Q19N21O9l67m66r23l73
-392G53
##PAGE=	F1=-2937.1
##FIRST=	4405.895418600002813,	4405.895418600002813,	0
##DATA TABLE=	(F2++(Y..Y)), PROFILE
$$ plain form
4406 1078 1767 2326 2448 2503 2024 1365 675 764 1300 1732 1997 1977 1665 1018 369 615 986 1586 1748 1631 1301 691 178 340
4181 340 1074 1438 1681 1335 1059 551 142 612 1109 1320 1499 1299 878 241 272 756 1096 1394 1174 1070 596 288 396 861
3955 861 951 1441 1041 865 550 283 572 881 1037 1244 1028 725 409 325 546 945 1082 1151 988 692 251 453 670 943
3730 943 1038 1151 648 596 357 539 789 903 1003 1054 644 552 396 509 950 1051 915 940 568 337 546 669 977 901 940 765
3486 765 474 486 575 693 869 1076 788 666 418 454 715 684 974 872 730 576 365 579 545 887 938 924 828 231 367 495
3242 495 736 973 939 610 752 555 329 671 784 909 1009 676 521 420 436 809 668 846 947 519 620 386 624 725
3016 725 873 660 1221 566 649 608 532 864 950 701 961 520 402 520 485 939 875 780 764 557 517 371 734 859 875 906 965
2763 965 1167 521 523 692 826 963 729 645 452 529 563 801 945 898 653 586 487 676 813 765 799 864 728 661 493 524 763 954
$$ packed form
4406A078O89N59J22N5m79o59o90Q9N36M32K65k0l12o47o49K46L71O00J62j17l30o10n13J62
4181C40P34L64K43l46k76n08m09M70M97K11J79k00m21o37L1M84L40K98k20j04m74l08J08M65
3955H61R0M90m00j76l15k67K89L09J56K07k16l03l16q4K21L99J37O9j63k96m41K02K17K73
3730I43R5J13n03n2k39J82K50J14J00N1m10r2j56J13M41J01j36K5l72k31K09J23L08p6L9j75
3486G65k91J2Q9J18J76K07k88j22k48L6K61l1K90j02j42j54k11K14l4L42N1j4r6n97J36J28
3242D95K41K37l4l29J42j97k26L42J13J25J00l33j55j01J6L73j41J78J01m28J01k34K38J01
3016G25J48k13N61o55Q3m1p6L32Q6k49K60m41j18J18l5M54o4r5j6k07m0j46L63J25J6L1N9
2763I65K02o46KJ69J34J37k34q4j93P7L4K38J44m7k45o7r9J89J37m8L4O5j36o7j68L1K39J91
$$ plain form
2500 954 692 884 641 469 548 696 729 1067 792 876 550 587 595 799 902 871 1000 569 610 643 732 755 895 1042 659 644 821
2246 821 604 846 902 857 807 935 604 556 668 596 1029 1138 1112 632 858 702 754 919 1112 1130 825 757 678 729 873 1027 1088
1993 1088 996 930 733 875 585 894 1184 1048 1191 956 926 783 869 1141 898 1174 1147 1005 810 1035 843 1496 1187 1374 1627
1758 1627 670 840 907 1069 1262 1252 1181 1041 920 1060 1003 1406 1257 1280 1220 1089 993 964 1101 1299 1390 1112 1295 2122 4698 3178
1514 3178 1868 1732 1747 1772 1481 1533 1311 1442 1753 1860 1881 1664 1719 1596 1438 1723 1816 2034 1839 1834 1769 1694 1714 1989 2132 2365
1270 2365 2208 2063 1925 1746 2111 2185 2486 2658 2572 2461 2044 2355 2462 2676 3055 3065 3038 2733 2615 2824 3242 3369 3761 3839 3676
1035 3676 3400 3359 3749 3965 4717 5126 5104 4710 4600 4654 5378 6309 7187 7754 7443 7072 6937 7676 9753 12120 14849 16193 16499
819 16499 15453 13731 19997 43175 108399 584657 1267503 407514 110695 56319 28675 16221 11218 14982
$$ packed form
2500I54k62J92k43j72P9J48L3L38k75Q4l26L7QK04J03l1J29m31M1L3Q9K3J40J47l83j5J77
2246H21k17K42N6m5n0J28l31m8J12p2M33J09k6m80K26j56N2J65J93J8l05o8p9N1J44J54O1
1993A088r2o6j97J42k90L09K90j36J43k35l0j43Q6K72k43K76k7j42j95K25j92O53l09J87K53
1758A627r57J70O7J62J93j0p1j40j21J40n7M03j49K3o0j31r6k9J37J98R1k78J83Q27K576j520
1514C178j310j36J5K5k91N2k22J31L11J07K1k17N5j23j58K85R3K18j95no5p5K0K75J43K33
1270B365j57j45j38j79L65P4L01J72q6j11m17L11J07K14L79J0k7l05j18K09M18J27L92P8j63
1035C676k76m1L90K16P52M09k2l94j10N4P24R31Q78N67l11l71j35P39K077K367K729J344L06
819A6499j046j722O266K3178O5224M76258O82846q59989k96819n4376k7644j2454n003L764
$$ plain form
687 14982 13607 13998 12725 10805 8685 6937 6410 6515 7174 7046 7700 4616 5272 4895 4088 4572 4885 4892 4542 4066 3428 3147
481 3147 3200 3548 3759 3703 3375 2916 2551 2497 2612 3043 2980 2966 2703 2195 2004 2057 2508 2529 2624 2450 2192 1918 1561 1861 2168 2351
237 2351 2320 2076 1830 1342 1366 1660 2042 2130 2125 1958 1204 1257 1202 1740 1879 2034 1890 1600 1231 953 1202 1661 1883 1776 1758 1343
-7 1343 817 945 1285 1675 1883 1751 1490 1118 594 739 1291 1814 1671 1768 1296 848 354 897 1360 1826 1894 1679 1196 567
-233 567 260 1006 1493 1853 2125 1881 1135 575 451 1252 1942 2380 2427 2117 1748 939 602
$$ packed form
687A4982j375L91j273j920k120j748n27J05O59j28O54l084O56l77q07M84L13Pl50m76o38k81
481C147N3L48K11n6l28m59l65n4J15M31o3j4k63n08j91N3M51K1R5j74k58k74l57L00L07J83
237B351l1k44k46m88K4K94L82Q8nj67p54N3n5N38J39J55j44k90l69k78K49M59K22j07j8m15
-7A343n26J28L40L90K08j32k61l72n24J45N52N23j43R7m72m48m94N43M63M66O8k15m83o29
-233E67l07P46M87L60K72k44p46n60j24Q01O90M38M7l10l69q09l37
-392F02
##PAGE=	F1=-2955.88
##FIRST=	4405.895418600002813,	4405.895418600002813,	0
##DATA TABLE=	(F2++(Y..Y)), PROFILE
$$ plain form
4406 845 1324 1738 1833 1857 1482 1023 467 604 952 1283 1520 1431 1271 733 269 461 755 1206 1319 1175 949 499 180 253 838
4171 838 1052 1271 959 793 440 114 452 835 993 1098 1024 635 116 213 571 796 1079 842 774 429 219 295 686 651 1140
3936 1140 732 644 390 202 435 663 712 991 766 501 305 274 470 688 833 882 702 528 159 361 503 696 746 887 443
3702 443 452 245 423 604 667 765 833 427 471 368 373 733 799 666 696 422 249 448 466 779 625 747 556 332 383 467 522 625
3439 625 828 585 493 300 363 585 495 706 646 529 420 250 486 372 666 698 722 683 85 276 363 569 713 715 420 572 386
3185 386 248 511 602 718 751 510 360 330 335 639 497 621 738 360 467 288 510 645 652 490 955 399 512 471 391 638
2941 638 726 516 741 362 318 412 333 733 664 546 571 443 384 251 587 642 674 705 794 978 499 404 462 621 744 553 502 321
2678 321 380 427 608 685 704 506 403 338 572 653 537 596 642 529 505 365 329 613 714 470 710 476 299 468 540 481 890
$$ packed form
4406H45M79M14R5K4l75m59n56J37L48L31K37q9j60n38m64J92K94M51J13j44k26m50l19P3N85
4171H38K14K19l12j66l53l26L38L83J58J05p4l89n19R7L58K25K83k37o8l45k10P6L91l5M89
3936A140m08q8k54j88K33K28M9K79k25k65j96l1J96K18J45M9j80j74l69K02J42J93N0J41m44
3702D43Rk07J78J81O3R8O8m06M4j03NL60O6j33L0k74j73J99J8L13j54J22j91k24N1Q4N5J03
3439F25K03k43r2j93O3K22r0K11o0j17j09j70K36j14K94L2K4l9n98J91Q7K06J44Kk95J52j86
3185C86j38K63R1J16L3k41j50l0NL04j42J24J17l78J07j79K22J35Pj62M65n56J13m1q0K47
2941F38Q8k10K25l79m4R4p9M00o9j18K5j28n9j33L36N5L2L1Q9J84m79r5N8J59J23j91n1j81
2678C21N9M7J81P7J9j98j03o5K34Q1j16N9M6j13k4j40l6K84J01k44K40k34j77J69P2n9M09
$$ plain form
2425 890 518 662 435 413 396 569 727 619 804 355 468 470 584 586 599 884 596 186 755 439 640 692 628 530 723 453 380
2171 380 459 505 713 888 828 437 656 546 528 697 837 862 591 547 471 542 687 734 827 741 686 527 673 379 660 903 740
1918 740 912 733 714 624 631 911 629 874 856 739 607 816 619 994 1200 589 1336 401 604 670 819 917 884 860 763 690 811
1664 811 754 1055 935 905 882 815 744 711 817 922 1003 785 1046 1977 3945 2649 1476 1294 1336 1299 1105 1219 931 1087 1326
1429 1326 1412 1428 1207 1325 1205 1066 1281 1371 1509 1372 1337 1314 1282 1273 1493 1604 1762 1650 1540 1482 1263 1572 1619 1847 1947 1947 1849
1176 1849 1500 1781 1840 1961 2291 2295 2244 2036 1971 2108 2420 2460 2801 2868 2771 2561 2471 2809 2876 3498 3802 3855 3489 3434 3452 3987 4735
922 4735 5347 5816 5444 5271 5186 5722 7302 9038 11041 11957 12305 11301 10200 15153 32301 80575 430610 940080
753 940080 304059 82275 42474 20965 11790 7200 13476 9783 10430 9443 8012 6415 5169 4729 4816 5380 5221
$$ packed form
2425H90l72J44k27k2j7J73J58j08J85m49J13KJ14KJ3K85k88m10N69l16K01N2o4r8J93k70p3
2171C80P9M6K08J75o0l91K19j10j8J69J40K5k71m4p6P1J45M7R3q6n5j59J46k94K81K43j63
1918G40J72j79j9r0PK80k82K45j8j17j32K09j97L75K06o11P47r35K03O6J49R8l3k4r7p3J21
1664H11n7L01j20l0k3o7p1l3J06J05Q1k18K61R31J968j296j173j82M2l7j94J14k88J56K39
1429A326Q6J6k21J18j20j39K15R0J38j37l5k3l2rK20J11J58j12j10n8k19L09M7K28J00%r8
1176A849l49K81N9J21L30Mn1k08o5J37L12M0L41O7r7k10r0L38O7O22L04N3l66n5J8N35P48
922D735O12M69l72j73q5N36J580J736K003R16L48j004j101M953J7148M8274L50035N09470
753I40080o36021k21784l9801k1509r175m590O276l693O47r87j431j597j246m40Q7N64j59
$$ plain form
594 5221 6045 2994 4388 3974 2986 3403 3818 3520 3388 3059 2533 2327 2425 2650 2789 2763 2462 2155 1916 1837 1939 2331 2175 2182
368 2182 1971 1622 1516 1542 1920 1897 1931 1785 1621 1443 1154 1413 1623 1753 1728 1503 1395 996 1008 1235 1515 1637 1519 1501 826
133 826 935 888 1276 1431 1540 1403 1165 960 721 867 1257 1417 1301 1301 997 608 739 981 1271 1414 1261 1102 855 424 551
-101 551 953 1399 1230 1275 944 643 229 689 1015 1343 1419 1251 906 386 212 772 1105 1378 1587 1409 824 417 347 951
-327 951 1450 1778 1801 1572 1328 687 413
$$ packed form
594E221Q24l051J394m14r88M17M15k98j32l29n26k06R8K25J39k6l01l07k39p9J02L92j56P
368B182k11l49j06K6L78k3L4j46j64j78k89K59K10J30k5k25j08l99J2K27K80J22j18j8o75
133H26J09m7L88J55J09j37k38k05k39J46L90J60j16%l04l89J31K42K90J43j53j59k47m31J27
-101E51M02M46j69M5l31l01m14M60L26L28P6j68l45n20j74N60L33K73K09j78n85m07p0O04
-327I51M99L28K3k29k44o41k74
-392D13
##PAGE=	F1=-2974.66
##FIRST=	4405.895418600002813,	4405.895418600002813,	0
##DATA TABLE=	(F2++(Y..Y)), PROFILE
$$ plain form
4406 589 845 1105 1162 1161 906 667 240 417 590 788 1007 844 857 430 148 292 501 796 858 693 559 304 173 170 583 640
4162 640 829 564 508 318 97 279 542 646 666 717 381 18 168 365 489 729 501 452 254 142 175 488 345 815 417
3927 417 402 220 116 288 423 368 713 485 270 184 232 390 418 564 584 396 348 116 269 327 424 448 590 233 289 129 292
3673 292 413 420 523 585 203 384 321 224 502 519 406 426 265 149 326 265 550 333 531 342 184 273 344 345 367 553 361 319
3411 319 182 269 429 293 414 411 319 259 135 371 211 414 454 500 529 101 191 213 375 440 490 213 375 215 159 337 400 501
3148 501 467 335 186 239 225 451 321 375 502 212 306 181 376 542 443 355 641 222 355 315 247 384 482 323 485 203 217
2894 217 292 183 500 452 306 358 316 232 135 412 420 453 496 606 758 475 285 220 414 513 357 355 203 220 278 404 410 485 346 214
2612 214 210 452 470 307 388 398 317 344 240 136 442 464 247 515 332 156 363 359 237 679 256 418 306 246 198 327 526
$$ packed form
4406E89K56K60N7jk55k39m27J77J73J98K19j63J3m27k82J44K09K95O2j65j34k55j31lM13N7
4162F40J89k65n6j90k21J82K63J04K0N1l36l63J50J97J24K40k28m9j98j12L3L13j43M70l98
3927D17j5j82j04J72J35n5L45k28k15q6M8J58K8J46K0j88m8k32J53N8R7K4J42l57N6j60J63
3673B92J21PJ03O2l82J81o3r7K78J7j13K0j61j16J77o1K85k17J98j89j58Q9P1JK2J86j92m2
3411C19j37Q7J60j36J21lr2o0j24K36j60K03M0M6K9m28R0K2J62O5N0k77J62j60n6J78O3J01
3148E01l4j32j49N3j4K26j30N4J27k90R4j25J95J66r9q8K86m19J33m0o8J37R8j59J62k82J4
2894B17P5j09L17m8j46N2m2q4r7K77QL3M3J10J52k83j90o5J94R9j56kj52J7N8J26OP5j39j32
2612B14mK42J8j63Q1J0q1K7j04j04L06K2k17K68j83j76K07mj22M42m23J62j12o0m8J29J99
$$ plain form
2359 526 359 581 161 310 296 416 409 313 740 635 438 669 234 447 442 391 247 480 294 200 265 412 404 613 516 235 417
2105 417 370 294 469 519 569 340 327 257 345 478 429 552 475 431 308 452 169 412 598 412 599 494 470 445 378 643 362 543
1842 543 539 445 368 553 372 436 1045 326 909 268 379 416 567 550 508 533 466 452 537 487 683 588 521 519 531 483 435 536 520 596 466
1551 466 728 1690 3079 1930 1042 829 878 807 688 867 536 691 864 922 929 730 885 787 664 815 887 952 879 800 829 835 796
1298 796 967 1036 1105 1053 969 983 767 983 1019 1161 1188 1260 1192 921 1166 1176 1190 1453 1476 1393 1289 1260 1347 1531 1493 1769 1814 1780 1667
1025 1667 1516 1776 1730 2197 2363 2500 2181 2168 2174 2491 3033 3362 3700 3329 3333 3295 3634 4630 5720 6931 7432 7787 6887 6386 9823
791 9823 20487 50623 266620 588889 192534 51569 27362 12791 7098 2886 11853 5750 6583 5917 5014
650 5014 3968 3275 2948 2997 3453 3207 3703 1616 2988 2396 1950 2189 2553 2135 2134 1952 1581 1459 1589 1691 1746 1755 1491 1343
$$ packed form
2359E26j67K22m20J49j4J20pr6M27j05j97K31m35K13nn1j44K33j86r4O5J47qK09r7k81J82
2105D17m7p6J75N0N0k29j3p0Q8J33m9J23p7m4j23J44k83K43J86j86J87j05k4k5o7K65k81J81
1842E43mr4p7J85j81O4O09p19N83o41J11L7J51j7m2K5o7j4Q5n0J96r5o7kJ2m8m8J01j6P6j30
1551D66K62R62J389j149q88k13M9p1j19J79l31J55J73N8Pj99J55r8j23J51P2O5p3p9K9Ol9
1298G96J71O9O9n2q4J4k16K16L6J42K7P2o8k71K45J0J4K63K3q3j04k9Q7J84l8K76M5l4j13
1025A667j51K60m6M67J66J37l19j3OL17N42L29L38l71Ml8L39R96J090J211N01L55r00n01L437
791I823J0664L0136K15997L22269l96355j40965k4207j4571n693m212Q967o103Q33o66r03
650E014j046o93l27M9M56k46M96k087J372n92m46K39L64m18jj82l71j22J30J02N5Rk64j48
$$ plain form
425 1343 1230 1128 1221 1545 1318 1348 1199 998 994 990 1284 1207 1192 1086 1009 937 711 923 1042 1108 1090 898 922 630 627 771 954 1093
162 1093 884 993 454 579 562 773 951 983 889 699 663 474 515 807 911 804 811 620 389 508 647 832 918 746 668 578 244
-92 244 349 592 937 768 754 576 419 98 450 649 820 914 802 591 201 143 517 688 873 1002 900 502 238 227 630
-327 630 915 1123 1127 988 872 420 237
$$ packed form
425A343j13j02R3L24k27L0j49k01mmK94p7j5j06p7p2k26K12J19O6j8j92K4k92lJ44J83J39
162A093k09J09n39J25j7K11J78L2r4j90l6j89M1K92J04j07Pj91k31J19J39J85Q6j72p8r0l34
-92B44J05K43L45j69j4j78j57l21L52J99J71R4j12k11l90n8L74J71J85J29j02l98k64j1M03
-327F30K85K08Mj39j16m52j83
-392B37
##PAGE=	F1=-2993.44
##FIRST=	4405.895418600002813,	4405.895418600002813,	0
##DATA TABLE=	(F2++(Y..Y)), PROFILE
$$ plain form
4406 356 415 539 556 544 400 363 34 233 280 338 547 322 499 164 35 140 273 429 461 272 202 145 160 131 362 296 430
4152 430 218 257 216 103 124 279 343 277 435 179 94 145 209 232 402 219 157 107 74 58 306 116 528 179 191 98 95 162 203 98
3871 98 459 237 75 67 202 324 212 324 319 124 188 131 196 205 177 200 309 63 137 79 176 258 215 329 364 66 303 265 100 300
3589 300 261 181 181 130 58 203 100 328 95 330 169 68 178 229 201 148 299 158 177 90 192 284 114 150 207 139 134 40 256
3317 256 85 186 262 301 403 202 126 72 186 215 301 35 197 71 89 185 218 298 226 181 40 171 125 283 174 166 284 105
3054 105 169 85 252 417 346 293 333 101 202 173 123 148 261 155 233 71 120 187 90 281 278 104 167 200 91 51 248 234 258 321
2772 321 447 529 450 198 20 251 319 177 233 166 75 147 224 166 287 207 104 136 339 309 129 211 177 129 211 146 34 278 258
2500 258 99 341 261 116 254 189 44 471 128 185 186 124 89 130 336 139 371 95 159 158 251 258 143 618 813 1074 575 35
$$ packed form
4406C56N9J24J7j2j44l7l29J99M7N8K09k25J77l35j29J05J33J56L2j89p0n7J5k9K31o6J34
4152D30k12L9m1j13K1J55O4o6J58k56q5N1O4K3J70j83o2n0l3j6K48j90M12l49J2r3lO7M1j05
3871I8L61k22j62qJ35J22j12J12nj95O4n7O5Rk8K3J09k46P4n8R7Q2m3J14L5k98K37l8j65K00
3589C00l9q0%n1p2J45j03K28k33K35j61j01J10N1k8n3J51j41J9q7J02R2j70L6N7o8nr4K16
3317B56j71J01P6L9J02k01p6n4J14K9Q6k66J62j26J8R6L3Q0p2m5j41J31m6J58j09qJ18j79
3054A05O4q4J67J65p1n3M0k32J01k9n0K5J13j06P8j62M9O7r7J91lj74O3L3j09m0J97j4K4O3
2772C21J26Q2p9k52j78K31O8j42N6o7r1P2P7n8J21q0j03L2K03l0j80Q2l4m8Q2o5j12K44k0
2500B58j59K42q0j45J38o5j45M27l43N7Jo2l5M1K06j97K32k76O4jR3Pj15M75J95K61m99n40
$$ plain form
2237 35 306 212 193 37 249 162 48 130 409 276 363 236 73 185 207 97 276 216 303 116 156 121 178 287 163 326 247 231
1974 231 131 258 80 209 330 150 307 284 237 279 172 388 167 241 260 199 144 297 155 139 904 966 681 280 213 194 365
1720 365 226 191 253 208 252 298 251 365 287 199 202 286 278 191 306 186 243 283 398 1265 2128 1111 654 408 459 378 310 539 191
1448 191 324 448 479 472 319 475 421 311 410 448 465 449 323 397 435 378 508 526 513 524 455 515 360 448 490 551 521 636 604 416
1166 416 617 600 498 696 756 637 627 608 679 744 639 848 868 882 884 674 841 735 1049 1069 1283 1027 1034 1048 1155 1509 1591 1788
903 1788 1481 1601 1607 1791 2217 2762 3261 3421 3745 3035 2996 4977 9855 23935 121954 276880 93028 24085 13697
725 13697 5629 2982 1197 10420 2581 3192 2797 2361 1804 1583 1407 1391 1741 1350 1112 1351 1767 548 1171 1135 1307 978
518 978 1005 941 746 703 843 846 817 865 637 628 620 500 591 823 569 611 525 437 533 506 710 585 544 475 467 490 313 477 531 534 520 376
$$ packed form
2237C5K71r4j9j56K12q7j14Q2K79j33Q7j27j63J12K2j10J79o0Q7j87M0l5N7J09j24J63p9j6
1974B31j00J27j78J29J21j80J57k3m7M2j07K16k21P4J9o1n5J53j42j6P65O2k85m01o7j9J71
1720C65j39l5O2m5M4M6m7J14p8q8LQ4qq7J15j20N7M0J15Q67Q63j017m57k46N1q1o8K29l48
1448A91J33J24L1pj53J56n4j10R9L8J7j6j26P4L8n7J30J8j3J1o9O0j55Q8M2O1l0J15l2j88
1166D16K01j7j02J98O0j19j0j9P1O5j05K09K0J4Kk10J67j06L14K0K14k56PJ4J07L54Q2J97
903A788l07J20OJ84M26N45M99J60L24p10l9J981M878J4080R8019J54926j83852o8943j0388
725A3697q068k647j785R223p839O11l95m36n57k21j76j6L50l91k38K39M16j219O23l6J72l29
518I78K7o4j95m3J40Lk9M8k28rqj20R1K32k54M2q6q8R6k7K04j25m1o9qK3j77J64N4Lj4j44
$$ plain form
218 376 498 313 304 351 462 596 330 526 157 257 281 325 525 463 438 285 394 266 212 396 456 374 374 281 204 293 343 438 484 294
-64 294 272 339 118 172 271 511 373 296 255 224 21 219 331 352 472 431 314 47 66 293 334 431 468 449 227 75 112 345 432
-336 432 535 524 472 461 185 157
$$ packed form
218C76J22j85rM7J11J34k66J96l69J00K4M4K00o2k5j53J09j28n4J84O0q2%r3p7Q9N0R5M6j90
-64B94k2O7k21N4R9K40j38p7m1l1k03J98J12K1J20m1j17k67J9K27M1R7L7j9k22j52L7K33Q7
-336D32J03j1n2j1k76k8
-392A57
##PAGE=	F1=-3012.22
##FIRST=	4405.895418600002813,	4405.895418600002813,	0
##DATA TABLE=	(F2++(Y..Y)), PROFILE
$$ plain form
4406 176 95 121 115 129 76 158 124 82 78 14 204 91 253 71 78 55 109 163 241 29 67 71 146 148 218 177 132 33 77 159 122 21 85 129
4087 129 23 219 130 142 144 203 72 143 58 71 30 43 38 166 174 317 146 99 119 154 74 47 191 265 61 68 32 178 274 172 148 147
3786 147 89 75 146 143 197 65 52 95 78 16 141 113 167 116 216 223 158 231 208 69 153 69 34 50 42 43 101 15 145 137 173 72 69 114 142
3458 142 121 60 106 29 86 53 148 189 26 59 63 34 89 21 160 19 81 176 155 344 260 90 83 26 99 168 112 67 38 78 79 93 134 147
3138 147 76 97 142 46 162 86 127 130 55 85 29 156 277 355 318 137 136 82 72 33 43 94 37 31 22 46 120 105 114 170 64 30 114 26 18
2810 18 150 113 140 213 377 317 416 154 152 161 204 40 160 202 43 67 94 20 144 112 166 123 251 211 93 91 26 38 129 101 115 141
2509 141 148 134 217 265 154 158 89 68 299 212 26 91 98 155 90 185 39 202 149 36 84 110 150 189 528 1103 1583 476 157 234
2227 234 137 73 144 69 77 58 87 509 421 173 61 80 5 88 64 146 46 109 51 118 175 83 155 24 191 97 169 78 142 184 142 159
$$ packed form
4406A76q1K6oJ4n3Q2l4m2mo4J90j13J62j82Pk3N4N4P8k12L8MP5KP0m1m5r9M4Q2l7j01O4M4
4087A29j06J96q9J2KN9j31P1q5J3m1J3nJ28QJ43j71m7K0L5q0k7J44P4k04Pl6J46R6j02k4j
3786A47n8j4P1lN4j32j3M3j7o2J25k8N4n1J00Po5P3k3j39Q4q4l5J6qJN8q6J30qL6j01lM5K8
3458A42k1o1M6p7N7l3R5M1j63L3Mk9N5o8J39j41O2R5k1J89q4j70pn7P3O9n6m5k9M0JJ4M1J3
3138A47p1K1M5r6J16p6M1Lp5L0n6J27J21P8l7j81jn4j0l9J0N1n7orK4P4j5RN6j06l4Q4q8q
2810A8J32l7K7P3J64o0R9k62kRM3j64J20M2j59K4K7p4J24l2N4m3J28m0j18ko5J2R1k8J4K6
2509A41Pj4Q3M8j11Mo9k1K31q7j86O5PN7o5R5j46J63n3j13M8K6M0L9L39N75M80j107l19P7
2227B34r7o4P1p5Qj9K9M22q8k48j12J9p5Q3k4Q2j00O3n8O7N7r2P2j31J67r4P2r1O4M2m2J7
$$ plain form
1927 159 153 90 135 81 151 127 189 137 17 83 163 19 93 76 410 966 1345 843 308 119 37 242 11 31 54 45 125 169 78 186
1645 186 117 60 61 107 191 51 148 151 6 308 191 753 1139 333 384 82 143 71 122 280 57 51 139 153 133 33 170 171 86 134 117
1354 117 126 141 107 79 151 153 211 147 80 146 74 142 158 93 107 117 91 164 167 119 210 247 32 131 268 88 147 133 206 253 26 176 194 209
1035 209 351 179 190 39 234 123 376 234 228 241 203 394 292 401 242 318 393 496 460 601 649 497 867 388 672 1402
791 1402 1965 4380 17795 49589 20186 3913 3541 769 87 3908 9276 2200 1097 760 569 382 346 465 324
612 324 502 87 1139 2459 2824 1580 698 363 290 197 174 178 178 175 293 245 202 220 65 144 173 119 142 279 95 101 50 35 206
340 206 176 276 151 119 39 74 178 55 140 185 117 104 88 183 120 139 37 122 228 70 167 46 52 80 34 211 55 111 19 195
58 195 149 92 89 119 89 57 50 81 130 130 160 195 54 86 172 121 63 50 195 120 34 50 123 89 30 109 60 168 249 139 67 22 156 164 129
$$ packed form
1927A59oo3M5n4P0k4O2n2j20O6Q0j44P4j7L34N56L79n02n35j89q2K05k31K0K3rQ0M4r1J08
1645A86o9n7JM6Q4j40R7Lj45L02j17N62L86q06N1l02O1p2N1J58k23oQ8J4k0j00J37Jq5M8j7
1354A17RJ5l4k8P2KN8o4o7O6p2O8J6o5J4J0k6P3Lm8R1L7k15R9J37j80N9j4P3M7k27J50J8J5
1035B09J42j72J1j51J95j11K53j42oJ3l8J91j02J09j59P6P5J03l6J41M8j52L70m79K84P30
791A402N63K415J3415L1794k9403j6273l72k772o82L821N368p076j103l37j91j87l6J19j41
612C24J78m15J052J320L65j244q82l35p3r3k3M%lJ18m8m3J8j55P9K9n4K3J37j84On1j5J71
340B06l0J00j25l2q0L5J04j23Q5M5o8j3j6R5o3J9j02Q5J06j58R7j21OK8m6J77j56N6r2J76
58A95m6n7lL0l0l2pL1M9%L0L5j41L2Q6n1n8j3J45p5q6J6P3l4n9P9m9J08Q1j10p2m5J34Ql5
$$ plain form
-270 129 64 122 46 78 23 139 86 115 84 108 160 17 197
$$ packed form
-270A29o5N8p6L2n5J16n3K9l1K4N2j43J80
-392A97
##PAGE=	F1=-3031
##FIRST=	4405.895418600002813,	4405.895418600002813,	0
##DATA TABLE=	(F2++(Y..Y)), PROFILE
$$ plain form
4406 64 95 123 182 195 199 68 215 36 68 201 37 289 145 166 141 87 46 84 253 189 220 79 136 174 159 250 47 159 44 144
4124 144 138 81 45 32 188 89 171 148 157 269 42 32 72 213 46 56 101 79 261 193 188 144 167 211 32 82 300 143 52 138 94 147
3824 147 225 215 65 110 201 30 135 104 240 165 57 86 131 63 200 125 139 127 162 188 216 170 153 96 72 71 69 139 18 91 34 50
3523 50 58 226 75 54 112 85 97 100 117 53 93 44 58 135 162 94 168 12 63 96 38 89 34 152 177 82 345 276 85 177 97 89 95 186
3204 186 5 93 100 25 68 34 206 38 163 140 7 101 71 211 111 48 65 52 98 140 356 406 234 195 44 36 44 143 23 40 129
2913 129 69 26 98 132 65 136 130 60 66 84 10 154 60 133 186 422 152 367 133 237 126 163 53 138 229 120 69 22 127 70 69
2622 69 225 124 197 183 122 44 92 105 98 92 137 52 129 178 157 281 168 89 126 100 179 271 141 67 130 207 139 93 97 86 163 55 61 6
2303 6 87 225 475 1401 1861 367 284 224 230 45 196 96 30 107 101 632 578 60 121 121 125 57 129 84 189 80 149 144 245 69 103
$$ packed form
4406F4L1K8N9J3Mj31J47j79L2J33j64K52j44K1k5n4m1L8J69o4L1j41N7L8j5R1k03J12j15J00
4124A44on7l6j3J56r9Q2k3RJ12k27j0M0J41j67J0M5k2J82o8nm4K3M4j79N0K18j57r1Q6m4N3
3824A47P8j0j50M5R1j71J05l1J36p5j08K9M5o8J37p5J4j2L5K6K8m6j7n7k4jkP0j21P3n7J6
3523E0QJ68j51k1N8k7J2LJ7o4M0m9J4P7K7o8P4j56N1L3n8N1n5J18K5r5K63o9j91R2q0qOR1
3204A86j81Q8Pp5M3l4J72j68J25k3j33R4l0J40j00o3J7j3M6M2K16N0j72l9j51qQR9j20J7Q9
2913A29o0m3P2L4o7P1op0OJ8p4J44r4P3N3K36k70K15k34J04j11L7j10Q5R1j09n1m7J05n7j
2622F9J56j01P3j4o1p8M8J3poM5q5P7M9k1J24j13p9L7k6P9R2j30p4O3P7o8m6Mj1P7j08On5
2303FQ1J38K50R26M60j494q3o0Oj85J51j00o6P7oN31n4n18O1%Mo8P2m5J05j09O9nJ01j76L4
$$ plain form
2011 103 125 136 52 200 107 130 240 184 130 236 84 59 118 83 178 69 169 108 88 254 100 35 129 463 1081 1344 955 331
1749 331 67 77 180 144 133 81 93 83 191 43 187 137 147 173 5 187 100 57 255 138 363 323 436 458 495 268 148 80
1486 80 103 244 112 193 145 62 90 141 107 135 94 121 94 83 118 39 278 111 95 218 172 85 179 125 142 106 188 251 106 164 248 113
1185 113 88 205 24 241 308 191 201 223 129 235 111 325 325 222 296 196 223 381 332 329 287 448 147 341 326 237 426 316
922 316 429 556 598 421 394 421 706 651 1081 1136 1153 1205 1091 1135 2623 6540 40887 79038 21578 7777 2752 2399 1562
706 1562 5329 8313 3123 1393 1115 832 687 494 584 542 357 895 2322 3055 3880 2542 447 104 371 310 277 288 226
490 226 157 23 160 354 129 328 224 81 278 98 145 249 254 213 212 89 122 21 212 209 192 140 112 169 69 161 119 155 202 19
209 19 129 163 152 105 105 275 65 110 149 55 174 53 200 76 177 79 125 191 100 72 118 139 122 35 69 106 94 145 218 235 90 152
$$ packed form
2011A03K2J1q4J48r3K3J10n6n4J06j52k5N9l5R5j09J00o1k0J66j54o5R4L34O18K63l89o24
1749C31k64J0J03l6j1n2J2j0J08j48J44n0J0K6j68J82q7m3J98j17K25m0J13K2L7k27j20o8
1486H0K3J41j32Q1m8q3K8N1l4K8m1K7k7j1L5p9K39j67j6J23m6q7R4n4J7l6Q2O3j45N8Q4j35
1185A13k5J17j81K17O7j17J0K2r4J06j24K14%j03P4j00K7J58m9lm2J61l01J94j5q9J89j10
922C16J13J27M2j77k7K7K85n5M30N5J7N2j14M4J488L917L4347L8151n7460j3801n025l53q37
706A562L767K984n190j730k78k83j45j93R0m2j85N38J427P33Q25j338k095l43K67o1l3J1o2
490B26o9j34J37J94k25J99j04j43J97j80M7J04Nm1jj23L3j01J91lj7n2k8N7j00R2m2L6M7j83
209A9J10L4j1m7%J70k10M5L9r4J19j21J47j24J01r8M6O6r1k8M6K1j7q7L4L7j2N1P3J7j45O2
$$ plain form
-92 152 76 102 105 100 209 126 134 120 101 40 216 98 248 109 124 79 151 196 103 187 58 75 156 43 65 158 188 179 116 75 79 230
$$ packed form
-92A52p6K6LnJ09q3Qj4j9o1J76j18J50j39J5m5P2M5r3Q4j29J7Q1j13K2R3L0ro3m1MJ51
-392B30
##PAGE=	F1=-3049.78
##FIRST=	4405.895418600002813,	4405.895418600002813,	0
##DATA TABLE=	(F2++(Y..Y)), PROFILE
$$ plain form
4406 24 158 195 268 240 252 20 240 89 70 267 100 341 132 199 165 112 60 118 295 222 260 72 133 184 134 263 110 183 73
4134 73 138 147 129 93 24 244 38 171 123 170 302 31 124 66 269 44 69 128 49 268 138 164 165 176 241 43 124 319 90 76
3852 76 159 123 104 169 218 67 109 231 33 101 80 265 220 50 143 133 102 228 164 146 127 108 192 209 116 104 93 53 114 79 180 29
3551 29 123 20 42 106 241 43 48 130 77 90 86 124 99 119 34 54 131 162 112 203 25 68 88 20 44 35 192 185 80 364 268 103 237
3242 237 179 63 62 201 20 111 114 13 75 78 231 37 182 144 40 87 85 252 147 58 60 66 76 76 303 515 354 215 67 23 83
2950 83 175 55 76 209 87 42 95 132 95 142 135 87 52 108 18 182 65 158 211 523 142 305 110 253 97 142 88 137 223 161
2669 161 101 2 173 44 54 229 114 171 175 105 46 124 131 88 88 101 55 118 164 143 277 149 56 173 73 117 263 208 121 153 208 139
2368 139 59 100 29 146 112 54 79 95 179 444 1616 1879 249 351 250 292 42 172 168 12 108 126 720 655 16 155 106 177
$$ packed form
4406B4J34L7P3k8J2k32K20j51j9J97j67K41k09O7l4n3n2N8J77p3L8j88O1N1n0J29j53P3j10
4134G3O5Rj8l6o9K20k06J33m8M7J32k71R3n8K03k25K5N9p9K19j30K6JJ1O5j98Q1J95k29j4
3852G6Q3l6j9O5M9j51M2J22j98O8k1J85m5j70R3j0l1J26o4j8j9j9Q4J7r3j2j1m0O1l5J01j51
3551B9R4j03K2O4J35j98NQ2n3J3mL8k5K0q5K0P7L1n0R1j78M3K0o8K4rJ57pj05K84r6j65J34
3242B37n8j16jJ39j81R1Lj01O2LJ53j94J45l8j04M7kJ67j05q9KOJ0%K27K12j61j39j48m4O0
2950H3R2j20K1J33j22m5N3L7l7M7pm8l5N6r0J64j17R3N3L12l81J63j95J43j56M5n4M9Q6o2
2669A61o0r9J71j29J0J75j15N7Mp0n9P8Pm3%J3m6O3M6k1J34j28r3J17j00M4J46n5q7L2N5o9
2368A39q0M1p1J17l4n8K5J6Q4K65J172K63j630J02j01M2k50J30mj56R6J8N94o5o39J39m9P1
$$ plain form
2105 177 75 141 77 253 121 186 129 266 55 99 147 88 41 207 97 140 234 205 135 236 130 41 161 80 181 43 151 138
1842 138 97 292 106 84 122 381 1144 1142 885 387 78 128 136 188 146 146 120 84 235 81 208 158 154 206 35 167 113 38 266 172
1561 172 362 490 787 1007 1000 248 265 154 149 318 44 234 215 129 157 234 121 217 92 148 122 155 173 74 342 176 129 254 194
1288 194 165 247 190 212 234 221 358 168 238 305 206 179 240 106 285 392 291 253 304 209 357 164 405 420 335 426 329 254 478 457
1007 457 390 406 614 319 454 459 358 593 516 627 823 739 670 576 601 1040 994 1505 1589 1632 1510 1461 1847 4032 9538 55494
763 55494 113510 33043 11086 4657 2980 1916 5423 7336 3284 1685 1419 1074 768 802 734 691 591 1114 2033 2125
575 2125 3091 2052 257 319 588 451 363 440 295 230 136 250 474 211 412 292 164 358 145 267 271 343 271 277 117 154 99
321 99 299 253 245 189 163 222 148 212 181 228 210 78 154 167 221 130 160 317 158 97 201 111 203 72 308 132 207 40 115 238 159
$$ packed form
2105A77j02O6o4J76j32O5n7J37k11M4M8n9m7J66j10M3R4k9p0J01j06q9J20q1J01j38J08j3
1842A38m1J95j86k2L8K59P63kk57m98l09N0QN2m2%k6l6J51j54J27n0mN2j71J32n4p5K28r4
1561A72J90J28K97K20pp52J7j11nJ69k74J90j9q6K8P7j13R6j25N6k6L3J8r9K68j66m7J25o0
1288A94k9Q2n7K2K2j3J37j90P0O7r9k7O1j34J79J07j01l8N1r5J48j93K41J5q5R1r7p5K24k1
1007D57o7J6K08k95J35Nj01K35p7J11J96q4o9r4K5M39m6N11Q4M3j22m9L86K185N506M5956
763E5494N8016q0467k1957o429j677j064L507J913m052j599k66l45l06L4o8m3j00N23R19R2
575B125R66j039j795O2K69j37q8P7j45o5r4J14K24k63K01j20j28J94k13J22MP2p2Oj60L7n5
321I9K00m6qn6k6N9p4O4l1M7j8j32P6J3N4r1L0J57j59o1J04r0R2j31K36j76P5j67P5J23p9
$$ plain form
30 159 127 150 197 155 34 106 139 129 177 259 289 80 142 96 134 156 116 247 167 145 118 171 78 283 112 238 102 141 125 186 199 131
-270 131 280 94 95 185 71 81 232 266 250 158 112 109 215
$$ packed form
30A59l2K3M7m2j21P2L3j0M8Q2L0k09O2m6L8K2m0J31q0k2k7N3r3K05j71J26j36L9j6O1J3o8
-270A31J49j86JR0j14J0J51L4j6r2m6lJ06
-392B15
##PAGE=	F1=-3068.56
##FIRST=	4405.895418600002813,	4405.895418600002813,	0
##DATA TABLE=	(F2++(Y..Y)), PROFILE
$$ plain form
4406 39 145 153 234 159 203 62 212 107 42 238 123 277 152 183 154 108 77 102 297 170 215 44 137 173 99 198 96 143 67 121
4124 121 152 157 111 19 214 30 125 82 173 286 62 154 75 257 49 76 121 65 210 118 87 146 151 246 84 135 273 92 64 157 120
3833 120 48 109 174 75 78 201 48 59 88 261 228 37 138 105 112 223 199 174 92 37 177 156 68 69 60 68 102 42 170 78 140 23 38
3523 38 142 200 46 72 133 82 96 61 87 105 99 55 38 117 153 91 180 14 44 59 19 47 24 190 181 111 374 260 125 258 226 51
3223 51 47 173 9 106 115 38 55 134 213 40 165 141 58 91 106 243 155 81 44 58 82 154 218 600 416 203 68 34 112 156 51
2932 51 108 233 95 46 91 115 95 147 93 82 60 107 54 184 110 164 246 617 253 250 79 218 73 114 88 137 188 176 137 17 178
2641 178 22 53 187 100 164 156 50 61 113 121 87 87 36 93 91 111 141 248 109 49 186 50 105 210 224 181 164 172 96 48 62 35 167
2331 167 143 91 133 155 71 403 1706 1690 124 367 287 302 59 124 197 66 78 157 747 645 10 135 51 170 73 117 107 247
$$ packed form
4406C9J06QQ1p5M4j41J50j05o5J96j15J54j25L1k9m6l1K5J95j27M5j71R3L6p4R9j02M7p6N4
4124A21L1Nm6r2J95j84R5m3R1J13k24R2p9J82k08K7M5n6J45r2l1N9NR5j62N1J38j81k8R3l7
3833A20p2O1O5r9LJ23j53J1K9J73l3j91J01l3PJ11k4k5q2n5J40k1q8JrQL4o0J28r2O2j17J5
3523C8J04N8j54K6O1n1J4l5K6J8om4j7P9L6o2Q9j66L0J5m0K8k3J66rp0K63j14j35J33l2j75
3223E1mJ26j64R7Rp7J7P9P9j73J25k4q3L3J5J37q8p4l7J4K4P2O4L82j84k13j35l4P8M4j05
2932E1N7J25j38m9M5K4k0N2n4j1k2M7n3J30p4N4Q2L71l64lj71J39j45M1k6M9N1j2l9j20J61
2641A78j56L1J34q7O4qj06J1N2Ql4%n1N7kK0L0J07j39o0J37j36N5J05J4m3j7Qp6m8J4k7J32
2331A67k4n2M2K2q4L32J303j6j566K43q0J5k43O5P3j31J2P9N90j02o35J25q4J19r7M4j0J40
$$ plain form
2068 247 124 181 75 250 37 97 118 21 41 182 66 129 190 188 107 170 121 58 152 99 132 51 93 102 81 274 105 79 53 679 1440
1777 1440 1504 1065 507 152 154 92 177 102 180 109 102 250 84 189 137 103 177 38 116 81 79 207 162 320 577 1241 1653 1293 237
1504 237 308 154 114 313 63 213 208 127 157 243 54 233 57 114 91 137 158 35 306 163 101 211 156 150 192 176 183 277 261 362
1223 362 131 200 230 166 163 182 83 265 327 236 197 242 169 352 104 349 348 268 374 275 191 417 388 255 310 513 247 350 372 268
941 268 496 426 464 711 523 583 432 464 890 745 1209 1242 1308 1086 1184 1649 3263 7115 41481 85396 24491 8765 3820
725 3820 2148 1451 4514 6186 2699 1362 1143 837 386 854 703 523 539 885 374 792 1213 417 235 424 446 432 194
509 194 371 213 179 120 206 418 111 335 229 139 318 68 269 144 285 209 228 106 133 103 270 170 185 126 185 196 143 187
246 187 133 187 112 102 133 118 210 60 154 252 165 71 196 132 148 64 303 108 144 57 93 233 138 89 105 170 120 51 135 120 120 174 206
$$ packed form
2068B47j23N7j06J75k13O0K1r7K0J41j16O3O1kq1O3m9o3R4n3L3q1M2Rk1J93j69k6k6O26P61
1777A440O4m39n58l55Ko2Q5p5P8p1pJ48j66J05n2l4P4j39P8l5kJ28m5J58K57O64M12l60j056
1504B37P1j54m0J99k50J50nq1L0Q6j89J79j76N7k3M6K1j23K71j43o2J10n5oM2j6PR4j6J01
1223C62k31O9L0o4lJ9r9J82O2r1l9M5p3J83k48K45jq0J06r9q4K26k9j33N5K03k66J03K2j04
941B68K28p0L8K47j88O0j51L2M26j45M64L3O6k22R8M65J614L852L4366M3915o0905j5726m945
725C820j672o97L063J672l487j337k19l06m51M68j51j80J6L46n11M18M21p96j82J89K2j4k38
509A94J77j58l4n9Q6K12l07K24j06r0J79k50K01j25J41p6J9j22K7l0J67j00J5n9N9J1n3M4
246A87n4N4p5j0L1j5R2j50R4R8q7r4J25o4J6q4K39j95L6q7L6J40r5m9J6O5n0o9Q4j5%N4L2
$$ plain form
-64 206 256 111 101 88 102 145 112 208 149 124 100 190 122 261 62 171 54 139 152 201 163 88 258 40 81 175 76 66 223 225 199 109
-364 109 92 109 160
$$ packed form
-64B06N0j45j0j3J4M3l3R6n9k5k4R0o8J39j99J09j17Q5J3M9l8p5J70k18M1R4r9j0J57Kk6r0
-364A09j7J7N1
-392A60
##PAGE=	F1=-3087.34
##FIRST=	4405.895418600002813,	4405.895418600002813,	0
##DATA TABLE=	(F2++(Y..Y)), PROFILE
$$ plain form
4406 63 118 77 156 37 111 153 155 101 96 161 146 160 195 149 120 88 109 59 279 85 132 55 146 146 51 90 51 111 55 95 158 169 124 84 140
4077 140 42 62 47 164 235 134 150 140 203 85 84 91 85 123 105 54 109 111 232 134 145 201 123 56 153 97 13 67 111 82 56 151 83 26 119
3749 119 240 210 82 88 72 107 193 222 207 37 49 139 92 22 61 20 90 61 24 136 144 150 45 88 152 135 58 121 135 92 102 39 45 83
3429 83 57 81 19 88 132 50 131 52 27 27 66 86 15 172 174 153 365 260 137 244 241 128 43 127 45 92 108 65 21 181 193 58 128
3119 128 129 65 101 131 203 134 101 40 40 94 235 175 632 429 176 54 91 137 112 33 143 219 100 42 84 101 72 131 29 66 75 100
2819 100 82 161 164 155 268 670 369 241 44 153 84 94 70 135 141 173 175 48 170 9 70 121 98 161 127 16 89 86 92 95 93 53 120 70
2500 70 63 132 204 70 50 171 87 120 141 207 224 172 121 40 35 34 53 239 161 153 169 214 75 328 1683 1418 8 346 311 277 91
2209 91 126 199 118 45 180 708 570 41 91 22 127 57 87 147 200 101 157 40 219 80 94 71 55 88 156 78 106 159 150 60 79 97
$$ packed form
4406F3N5m1P9j19P4M2Kn4nO5j5J4L5m6k9l2K1n0K20j94M7p7R1%r5L9l9O0n6M0O3J1m5m0N6
4077A40r8K0j5J17P1j01J6j0O3j18jPoL8j8n1N5KJ21r8J1N6p8o7R7n6q4N4M4k9k6R5o8n7R3
3749A19J21l0j28Oj6L5Q6K9j5j70J2R0m7p0L9m1P0k9l7J12QOj05M3O4j7p7O3J4m3J0o3OL8
3429H3k6K4o2O9M4q2Q1p9k5%L9K0p1J57Kk1K12j05j23J07lj13q5Q4q2M7J6m3m4J60J2j35P0
3119A28Jo4L6L0P2o9l3o1%N4J41o0M57k03k53j22L7M6k5p9J10P6j19n8M2J7k9N9j02L7RK5
2819A00j8P9LrJ13M02l01j28j97J09o9J0k4O5OL2Kj27J22j61O1N1k3O3l4j11P3lOLkm0O7n0
2500G0pO9P2j34k0J21q4L3K1O6J7n2n1q1njJ9J86p8qJ6M5j39K53J355k65j410L38l5l4j86
2209I1L5P3q1p3J35N28j38n29N0o9J05p0L0O0N3r9N6j17J79j39J4k3j6L3O8p8K8N3rr0J9J8
$$ plain form
1908 97 84 108 110 57 60 33 55 107 227 171 66 72 1198 2021 2398 1637 645 216 168 64 149 44 194 93 137 242 69 153 101
1636 101 40 118 38 73 40 112 129 177 273 577 1526 2059 1375 222 303 117 51 261 102 169 157 99 129 203 62 204 47 68 39
1364 39 74 129 43 222 115 43 127 87 99 99 163 118 275 333 314 60 120 104 81 111 105 23 232 189 119 86 163 98 276 18 245 208
1063 208 135 237 133 79 288 225 47 144 289 68 153 200 95 281 223 150 423 172 353 155 233 515 242 632 556 607 400
810 400 652 1017 1552 2407 15943 31105 7536 3975 1716 773 680 3085 4811 1759 759 650 537 350 857 693
622 693 252 358 553 2300 4576 5044 3074 652 589 315 525 170 192 77 91 108 128 289 67 207 134 75 222 58 200
387 200 76 159 133 129 79 125 59 195 54 100 48 209 133 108 122 56 97 51 145 96 85 169 56 117 166 131 107 167 132 123 40 237 59
77 59 52 87 89 204 87 40 34 114 67 80 147 62 93 173 111 181 150 52 67 45 88 146 187 105 83 85 173 181 213 21 80 34 134 160 197 172 48
$$ packed form
1908I7j3K4Kn3Lk7K2N2J20n6j05OJ126Q23L77p61r92m29m8j04Q5j05J50j01M4J05j73Q4n2
1636A01o1P8q0L5l3P2J7M8R6L04R49N33o84j153Q1j86o6K10j59O7j2n8L0P4j41J42j57K1k9
1364C9L5N5q6J79j07p2Q4m0J2%O4m5J57N8j9k54O0j6k3L0oq2K09m3p0l3P7o5J78k58K27l7
1063B08p3J02j04n4K09o3j78R7J45k21Q5M7j05J86n8p3K73k51J81j98P8K82k73L90p6N1k07
810D00K52L65N35Q55J3536J5162k3569l561k259r43r3K405J726l052j000j09j13j87N07j64
622F93m41J06J95J747K276M68j970k422o3k74K10l55K2j15J4J7K0J61k22J40p3n9J47j64J42
387B00j24Q3k6mn0M6o6J36j41M6n2J61p6k5J4o6M1m6R4m9j1Q4j13O1M9l5k4O0l5rq3J97j78
77E9pL5KJ15j17m7oQ0m7J3O7q5L1Q0o2P0l1r8J5k2M3N8M1q2k2KQ8QL2j92N9m6J00K6L7k5j24
$$ plain form
-270 48 178 65 77 156 69 28 190 132 120 75 90 112 89
$$ packed form
-270D8J30j13J2P9q7m1J62n8j2m5J5K2k3
-392H9
##PAGE=	F1=-3106.12
##FIRST=	4405.895418600002813,	4405.895418600002813,	0
##DATA TABLE=	(F2++(Y..Y)), PROFILE
$$ plain form
4406 88 120 100 116 109 28 218 96 85 161 82 175 49 235 117 81 63 144 49 253 42 89 99 157 110 1 21 29 137 49 68 163 173
4105 173 135 145 65 46 31 35 148 170 188 137 190 135 117 94 51 91 79 80 131 79 74 206 181 165 141 148 66 145 71 72 78 69 87 81 126 117 15 153
3749 153 208 183 112 19 47 100 152 229 224 26 118 94 70 25 73 46 103 19 83 106 199 157 88 143 145 67 72 160 142 98 102 35 67 54 17 93
3411 93 4 46 108 13 84 90 42 10 106 126 15 164 162 189 341 256 128 204 229 203 50 89 80 82 97 75 26 214 205 74 87 106 66 108
3091 108 148 152 98 100 54 46 97 288 221 602 407 150 51 149 159 71 31 170 190 98 35 75 96 49 89 44 59 80 94 89 127 203 137 266
2772 266 663 467 293 18 83 116 88 52 133 99 160 204 77 165 20 86 64 109 151 96 66 116 61 65 104 99 111 134 70 88 103 153 46
2462 46 60 141 115 141 82 180 239 181 74 35 38 62 65 309 173 204 188 244 212 217 1603 1206 109 307 310 238 103 159 193 152 48 180
2162 180 609 463 73 54 79 74 39 71 177 146 71 134 93 185 130 94 40 106 127 157 116 92 180 109 24 46 100 96 54 103 20 67 57 71
$$ packed form
4406H8L2k0J6pq1J90j22j1P6p9R3j26J86j18l6j8Q1r5K04k11M7J0N8m7j09K0QJ08q8J9R5J0
4105A73l8J0q0j9j5MJ13K2J8n1N3n5j8k3m3M0j2JN1n2nJ32k5j6k4Pq2P9p4JOrJ8oM5rj02J38
3749A53N5k5p1r3K8N3N2P7nj98R2k4k4m5M8k7N7q4O4K3R3m2o9N5Kp8NQ8j8m4Mo7L2j3l7P6
3411I3q9M2O2r5P1Om8l2R6K0j11J49kK7J52q5j28P6K5k6j53L9rKJ5k2m9J88rj31J3J9m0M2
3091A08M0Mn4Km6qN1J91o7L81j95k57r9R8J0q8m0J39K0r2o3M0K1m7M0m5J5K1J4nL8P6o6J29
2772B66L97j96j74k75O5L3k8l6Q1l4O1M4j27Q8j45O6k2M5M2n5l0N0n5ML9nJ2K3o4J8J5N0j07
2462D6J4Q1k6K6n9R8N9n8j07l9LK4LK44j36L1j6N6l2NJ386l97j097J98Lp2j35N6L4m1j04J32
2162A80M29j46l90j9K5nl5L2J06l1p5O3m1R2n5l6n4O6K1L0m1k4Q8p1q5K2N4mm2M9q3M7j0J4
$$ plain form
1842 71 142 177 239 77 177 1508 2394 2969 2024 681 225 163 77 124 51 182 99 180 217 52 126 76 51 63 54 106 44 124 91 225
1561 225 241 513 1579 2211 1300 218 276 83 71 196 145 129 100 85 111 148 145 159 87 62 4 30 118 107 136 68 43 45 36 87 116 194
1260 194 69 260 396 262 24 67 40 115 84 106 55 216 50 42 19 187 87 187 102 193 81 88 109 36 47 173 96 132 126 79
979 79 102 31 106 72 85 158 135 170 136 147 141 232 168 219 345 76 71 224 363 466 664 2059 6742 17962 8490 817 440 463
716 463 209 1618 3285 877 320 409 609 872 916 806 341 184 541 4424 7732 8804 5491 1049 778 637 763 413
509 413 43 41 60 184 114 199 230 128 132 30 129 169 121 210 83 117 36 65 157 14 159 110 87 118 235 68 91 58 70 58 162
218 162 200 78 131 147 162 116 147 101 142 138 116 187 49 162 34 85 102 111 172 61 96 23 85 62 100 146 27 71 190 24 107 172
-83 172 18 44 22 23 183 227 62 45 77 137 228 189 82 9 96 128 153 180 231 85 94 143 83 159 60 35 168 81 133 118 143 113 32
$$ packed form
1842G1P1L5O2j62J00J331Q86N75r45j343m56o2q6M7p3J31q3Q1L7j65P4n0k5J2rN2o2Q0l3J34
1561B25J6K72J066O32r11j082N8j93j2J25n1j6k9j5K6L7lJ4p2k5n8K6Q8j1K9o8k5KrN1K9P8
1260A94j25J91J36j34k38M3k7P5l1K2n1J61j66qk3J68j00J00q5R1j12PK1p3J1J26p7L6om7
979G9K3p1P5l4J3P3k3L5l4J1oR1o4N1J26k69nJ53J39J03J98J395M683J1220r472p673l77K3
716D63k54J409J667k408n57Q9K00K63M4j10m65j57L57L883L308J072l313m442k71j41J26l50
509D13l70kJ9J24p0Q5L1j02Mj02R9M0m8Q9j27L4q1K9R2j43J45m9k3L1J17j67K3l3J2j2J04
218A62L8j22N3J6J5m6L1m6M1mk2P1j38J13j28N1J7RO1j11L5p3O2k3L8M6j19M4J19j66Q3O5
-83A72j54K6k2JJ60M4j65j7L2O0R1l9j07p3Q7L2K5K7N1j46RM9o0P6r9k5J33q7N2j5K5l0q1
-392C2
##PAGE=	F1=-3124.9
##FIRST=	4405.895418600002813,	4405.895418600002813,	0
##DATA TABLE=	(F2++(Y..Y)), PROFILE
$$ plain form
4406 107 114 149 115 167 34 226 58 77 192 25 174 15 247 85 54 43 161 72 208 67 126 135 165 73 59 103 40 166 41
4134 41 45 160 175 132 182 34 28 52 35 139 110 206 128 196 76 126 102 22 87 122 38 186 60 50 174 216 179 108 147 62 122 63 120
3824 120 109 79 80 108 134 137 31 181 167 158 105 47 35 98 121 214 209 72 163 62 87 68 79 80 97 21 128 97 228 162 137 185 127 25
3504 25 76 176 153 95 97 34 103 33 31 82 11 14 84 41 63 108 46 16 128 153 16 167 142 202 310 234 100 150 196 245 75 77 96 82
3185 82 83 65 47 223 235 74 51 77 69 103 147 108 60 76 66 82 83 315 295 523 359 136 62 190 176 47 42 176 164 85 23 64 97
2875 97 44 26 93 70 68 89 72 100 218 121 239 592 539 370 42 36 138 81 44 130 75 140 214 93 159 34 87 61 123 130 72 86 128
2565 128 47 54 102 96 141 129 81 127 57 99 52 82 110 105 154 41 164 222 188 43 61 56 85 66 346 186 225 191 239 321 107 1533 1120
2256 1120 199 261 285 203 86 163 195 159 69 152 472 357 89 49 112 30 26 65 186 105 55 123 138 147 158 92 42 120 130 174 132 103
$$ packed form
4406A07PL5l4N2j33J92j68J9J15j67J49j59K32j62l1j1J18q9J36j41N9RL0r2j4M4o3J26j25
4134D1MJ15J5m3N0j48oK4j7J04k9R6p8O8j20N0k4q0O5L5q4J48j26j0J24M2l7p1L9q5O0n9N7
3824A20j1l0JK8K6Lj06J50j4rn3n8j2O3K3R3nj37R1j01K5j9J1JJ7p6J07l1J31o6k5M8n8j02
3504B5N1J00k3n8Ko3O9p0kN1p1LP0m3K2M5o2l0J12K5j37J51k5O0J08p6j34N0M6M9j70KJ9j4
3185H2Jj8j8J76J2j61k3K6qL4M4l9m8J6j0J6JK32k0K28j64k23p4J28j4j29nJ34j2p9o2M1L3
2875I7n3j8O7k3kK1j7K8J18r7J18L53n3j69l28oJ02n7l7Q6n5O5P4j21O6j25N3k6O2Pn8J4M2
2565A28q1PM8oM5j2m8M6p0M2m7L0K8nM9j13J23N8l4j45J8nK9j9K80j60L9l4M8Q2k14J426m13
2256A120r21O2K4q2j17P7L2l6r0Q3L20j15k68m0O3q2mL9J21q1n0O8J5RJ1o6n0P8J0M4m2k9
$$ plain form
1955 103 220 81 17 85 108 96 11 72 66 67 83 86 135 142 245 113 257 1466 2338 2965 1942 630 145 137 125 100 96 138 122 218 188
1664 188 39 117 70 89 63 80 163 67 121 100 268 213 427 1423 2170 1147 237 243 76 135 138 179 105 66 89 112 95 192 120 105 73
1373 73 10 68 109 145 80 33 80 21 46 112 181 223 57 243 413 235 44 71 83 192 76 143 83 197 52 56 78 228 113 121 145
1082 145 202 14 127 48 109 93 117 144 226 183 62 187 123 130 148 63 231 285 135 268 77 263 320 114 465 478 403 454 472 487
800 487 352 1379 4363 17372 42399 16330 3094 1425 1005 390 459 1783 397 371 465 743 1152 979 1014 627 62
603 62 483 4597 7664 8871 5439 1040 753 876 819 505 102 87 82 258 112 168 321 106 167 32 76 228 64 270 140
368 140 103 21 59 180 12 173 176 102 178 242 21 93 26 93 88 227 234 85 187 155 234 156 166 100 138 108 92 239 59 113 46 145
68 145 87 137 148 66 133 42 81 73 100 134 96 46 197 34 67 166 13 24 47 34 180 257 45 28 65 96 241 182 102 34 133 114 138
$$ packed form
1955A03J17j39o4O8K3j2q5O1oJJ6LM9PJ03j32J44J209Q72O27j023j312m85qj2k5mM2j6R6l0
1664A88j49P8m7J9k6J7Q3r6N4k1J68n5K14R96P47j023r10Oj67N9LM1p4l9K3K3j7R7p2j5l2
1373G3o3N8M1L6o5m7M7n9K5O6O9M2j66J86J70j78j91K7J2J09j16O7o0J14j45MK2J50j15QK4
1082A45N7j88J13p9O1j6K4K7Q2m3j21J25o4PJ8q5J68N4j50J33j91J86N7k06L51J3p5N1J8J5
800D87j35J027K984J3009K5027k6069j3236j669m20o15O9J324j386k6R4K78M09j73L5l87n65
603F2M21M114L067J207l432m399k87J23n7l14m03j5nJ76j46N6J53k15O1j35M4J52j64K06j30
368A40l7q2L8J21j68J61Lp4P6O4k21P2o7O7nJ39Pj49J02l2P9p8J0o6L8l0j6J47j80N4o7R9
68A45n8N0J1q2O7r1L9qK7L4l8n0J51j63L3R9j53J1K3j3J46P7k12j7L7L1J45n9q0o8R9j9K4
$$ plain form
-242 138 160 271 102 46 172 73 182 57 69 139 117 170 136 176 86 32
$$ packed form
-242A38K2J11j69n6J26r9J09j25J2P0k2N3l4M0r0n4
-392C2
##PAGE=	F1=-3143.68
##FIRST=	4405.895418600002813,	4405.895418600002813,	0
##DATA TABLE=	(F2++(Y..Y)), PROFILE
$$ plain form
4406 121 65 149 77 151 86 165 39 114 177 26 119 32 227 64 60 56 149 79 135 75 161 157 166 45 123 140 42 157 66 28 141 185 115
4096 115 195 39 53 58 41 141 83 189 125 155 40 109 111 46 91 160 59 199 52 32 137 241 172 92 111 34 79 81 150 131 95 61
3796 61 121 138 140 67 200 120 140 72 91 62 97 117 180 162 107 182 66 87 101 69 100 73 35 154 107 224 163 178 208 109 64 62 170 169
3476 169 84 92 28 117 27 57 51 32 55 61 66 69 101 38 32 130 163 22 166 117 183 283 191 67 101 154 244 116 89 88 89 63 55 50 202 251 62
3129 62 28 68 80 90 126 80 41 32 67 124 57 320 359 429 288 138 70 202 185 49 50 161 155 62 12 54 97 39 49 117 99 36 82 37
2810 37 82 214 121 191 470 569 437 84 42 138 63 42 130 71 114 203 90 141 66 69 82 129 104 53 71 120 63 61 86 82 142 100 99 139 9
2481 9 52 87 111 94 64 154 11 163 180 189 29 70 69 94 52 340 203 209 174 205 384 142 1496 1092 268 219 248 175 58 118 205
2190 205 138 81 108 321 260 87 77 113 18 14 59 171 74 68 137 154 100 155 84 64 97 92 182 115 142 241 82 34 89 87 134 12 33 78
$$ packed form
4406A21n6Q4p2P4o5P9j26P5O3j51R3q7J95j63mmR3p0N6o0Q6mRj21P8J7r8J15r1l8J13M4p0
4096A15Q0j56J4Nj7J00n8J06o4L0j15O9Ko5M5O9j01J40j47k0J05J04o9q0J9p7M5KO9j9l6l4
3796F1O0J7Kp3J33q0K0o8J9k9L5K0O3j8n5P5j16K1J4l2L1k7l8J19m7J17o1J5L0r9m5kJ08j
3476A69q5Qo4Q9r0L0oj9K3ONLL2o3oR8L3j41J44m9O6J00r2j24L4N3R0j28k7jJk6qnJ52M9j89
3129F2l4M0J2J0L6m6l9rL5N7o7K63L9P0j41j50o8J32j7j36JJ11or3n0M2M3n8J0O8j8o3M6m5
2810C7M5J32r3P0K79R9j32l53m2R6p5k1Q8n9M3Q9j13N1p5LJ3M7k5n1J8M9n7kK5mO0m2jM0j30
2481IM3L5K4j7l0R0j43J52J7Rj60M1jK5m2K88j37Ol5L1J79k42J354m04q24m9K9p3j17O0Q7
2190B05o7n7K7K13o1j73j0L6r5mM5J12r7oO9J7n4N5p1k0L3nR0o7K7R9j59m8N5kM7j22K1M5
$$ plain form
1871 78 87 92 54 115 173 163 222 296 2076 3616 4608 2836 1238 151 136 190 81 136 73 140 247 175 36 121 78 118 109 109 206 81
1589 81 119 110 291 171 387 1144 2028 991 281 209 103 192 91 201 91 67 91 129 52 193 99 93 68 14 95 102 160 64 17 97
1307 97 43 68 124 206 215 80 221 381 229 66 94 80 229 58 151 75 162 92 23 91 213 136 92 137 197 11 114 25 123 96 121
1016 121 200 230 163 72 177 141 108 150 72 227 281 131 229 104 258 311 118 462 432 400 510 407 528 336 1456 4402 15150
763 15150 39381 15575 3175 1320 881 288 270 575 344 352 377 718 1064 995 1309 891 196 169 1616 2828 3687 1713
556 1713 494 279 774 448 365 82 80 110 282 72 103 318 96 153 69 73 231 15 238 175 57 50 60 174 40 176 200 81
293 81 186 224 7 80 31 77 85 231 235 96 221 160 271 193 156 131 96 70 72 240 47 86 99 155 46 156 130 63 118 35 61 51
-7 51 81 115 162 49 172 42 75 135 39 10 57 61 133 233 77 43 59 71 219 151 79 21 133 96 130 142 260 67 20 140 72 200
$$ packed form
1871G8RNl8O1N8j0N9P4J780J540R92j772j598j087j5N4j09N5o3O7J07p2j39Q5m3M0r%R7j25
1589H1L8rJ81j20K16P57Q84j037p10p2j06Q9j01J10j10k4K4L8p7J41r4ok5n4Q1PN8r6m7Q0
1307I7n4K5N6Q2Rj35J41J60j52j63K8j4J49j71R3p6Q7p0o9O8J22p7m4M5O0j86J03q9R8k7K5
1016A21P9L0o7r1J05l6l3M2p8J55N4j50R8j25J54N3j93L44l0l2J10j03J21j92J120K946J0748
763A5150K4231k3806j2400j855m39n93j8L05k31QK5L41L46o9L14m18o95k7J447J212Q59j974
556A713j219k15M95l26q3k83kL0J72k10L1K15k22N7q4MJ58k16K23o3j18pJ0J14j34J36K4j19
293H1J05L8k17P3m9M6QJ46Mj39J25o1J11p8l7k5l5k6KJ68j93L9J3N6j09J10k6o7N5q3K6j0
-7E1L0L4M7j13J23j30L3O0r6k9M7MP2J00j56l4J6J2J48o8p2n8J12l7L4J2J18j93m7J20o8J28
$$ plain form
-308 200 70 86 70 148 145 123 158 17 46
$$ packed form
-308B00j30J6j6P8lk2L5j41K9
-392D6
##PAGE=	F1=-3162.46
##FIRST=	4405.895418600002813,	4405.895418600002813,	0
##DATA TABLE=	(F2++(Y..Y)), PROFILE
$$ plain form
4406 148 78 113 30 104 181 41 52 203 120 95 12 85 192 119 99 106 106 80 59 84 177 173 164 35 194 129 71 107 138 39 107 206 107 196
4087 196 21 134 58 66 139 110 154 125 88 40 75 138 75 114 164 131 177 88 12 94 256 135 80 45 29 44 105 156 140 90 61 132 118
3777 118 137 113 208 74 136 88 107 123 95 131 131 98 136 177 97 55 115 40 107 35 52 163 129 187 157 207 209 107 109 33 162 187 71 103
3458 103 31 104 40 80 22 58 96 43 77 94 74 51 63 114 159 32 146 94 134 275 135 62 81 118 207 159 111 59 99 42 73 39 148
3148 148 241 78 32 104 93 80 92 72 41 21 60 162 43 314 410 361 207 151 67 187 183 71 68 127 166 38 14 46 91 17 107 117
2847 117 138 10 79 26 62 204 140 125 322 548 478 127 54 117 45 37 135 75 87 175 72 107 106 38 85 121 82 43 31 91 111 82 58
2537 58 60 123 48 129 121 56 37 133 142 98 40 139 22 172 135 179 26 68 67 100 29 299 218 159 136 160 396 256 1453 1016 320 181
2237 181 210 158 81 43 214 101 82 68 183 160 71 129 89 53 25 64 139 46 97 182 142 67 127 72 101 59 42 178 71 198 230 113
$$ packed form
4406A48p0L5q3P4P7j40J1J51q3k5q3P3J07p3k0P%k6k1K5R3mrj29J59o5n8L6L1r9O8R9r9Q9
4087A96j75J13p6QP3k9M4k9l7m8L5O3o3L9N0l3M6q9p6Q2J62j21n5l5j6J5O1N1j6n0k9P1j4
3777A18J9k4R5j34O2m8J9J6k8L6%l3L8M1q0m2O0p5O7p2J7J11l4N8l0N0Kj02Kp6J29K5j16L2
3458A03p2P3o4M0n8L6L8n3L4J7k0k3J2N1M5j27J14n2M0J41j40p3J9L7Q9m8m8n2M0n7L1l4J09
3148A48R3j63m6P2j1j3J2k0l1k0L9J02j19K71R6m9j54n6q4J20mj12lN9L9j28k4L2M5p4R0J0
2847A17K1j28O9n3L6J42o4j5J97K26p0l51p3O3p2qR8o0J2Q8j03L5jo8M7L6l9l9j2O0K0k9k4
2537E8KO3p5Q1qo5j9R6Rm4n8R9j17J50l7M4j53M2jL3p1K70q1n9k3K4K36j40J197m37o96j39
2237A81K9n2p7l8J71j13j9j4J15k3q9N8m0l6k8L9P5r3N1Q5m0p5O0n5K9m2j7J36j07J27L2j17
$$ plain form
1936 113 85 49 30 232 27 79 61 146 128 64 212 295 94 416 314 4531 7925 10038 6370 2823 523 259 274 115 180
1702 180 119 138 269 211 70 140 89 147 162 135 228 96 137 119 297 112 438 877 1880 882 342 175 149 235 51 211 83
1448 83 84 82 157 43 163 93 66 54 43 108 113 169 79 41 99 53 92 115 189 170 130 196 319 222 108 130 59 226 62 137 48 121 91 61
1129 61 79 146 162 84 103 158 51 51 45 96 79 155 218 173 85 10 115 137 50 110 32 144 172 78 97 179 188 239 82 288 187 185 373 184
810 184 470 339 992 2907 4357 18003 9064 1729 447 446 201 647 587 253 139 212 728 619 1061 1697 1187 534 1420
594 1420 6254 12458 14709 9419 2028 967 489 674 130 92 81 174 261 174 85 247 170 90 111 103 212 61 158 144 110 78
349 78 72 146 90 140 227 63 157 202 23 41 59 94 59 199 204 99 235 139 290 205 113 182 32 28 57 201 25 53 183 119 12 170
49 170 119 58 63 67 44 23 57 90 215 106 116 48 119 101 82 27 77 74 89 151 135 89 83 92 182 75 75 32 109 100 148 126 199 35 55 78 123
$$ packed form
1936A13k8l6j9K02k05N2j8Q5j8o4J48Q3k01L22j02M217L394K113l668l547k300k64J5j59O5
1702A80o1J9J31n8j41P0n1N8J5k7R3j32M1j8J78j85L26M39J003r98n40j67k6Q6j84J60j28
1448H3JkP5j14J20p0k7j2j1O5NN6r0l8N8m6L9K3P4j9m0O6J23r7j14K2p1J67j64P5q9P3l0l0
1129F1J8O7J6p8J9N5j07%oN1j7P6O3m5q8p5J05K2q7O0p8J12K8r4J9Q2RN1j57K06j01kJ88j89
810A84K86j31O53J915J450J3646q939p335j282jk45M46o0l34j14P3N16j09M42O36n10o53Q86
594A420M834O204K251n290p391j061m78J85n44l8j1R3Q7q7q9J62p7q0K1qJ09j51R7j4l4l2
349G8oP4n6N0Q7j64R4M5j79J8J8L5l5J40Nj05J36r6J51q5r2O9j50mK9J44j76K8J30o4j07J58
49A70n1o1NMk3k1L4L3J25j09J0o8P1j8j9n5N0lJ5O2j6m6oRR0j07%m3P7rM8k2P3j64K0K3M5
$$ plain form
-299 123 206 112 95 52 176 46 173 99 95 100
$$ packed form
-299A23Q3r4j7m3J24j30J27p4mN
-392A00
##PAGE=	F1=-3181.24
##FIRST=	4405.895418600002813,	4405.895418600002813,	0
##DATA TABLE=	(F2++(Y..Y)), PROFILE
$$ plain form
4406 214 236 150 175 186 311 124 125 325 39 199 137 198 182 222 159 170 72 121 127 130 196 197 169 55 269 102 133 36 228 72 70 233
4105 233 139 211 28 223 87 99 119 169 136 134 78 65 43 192 95 144 150 197 134 159 14 51 266 74 75 62 86 79 128 142 143 64 109 150
3786 150 77 142 155 196 47 148 162 91 192 86 145 78 78 167 157 129 39 108 0 108 34 88 165 158 130 144 221 184 139 138 32 176
3486 176 200 58 140 49 76 67 103 55 86 129 55 78 134 39 89 98 84 147 48 103 73 76 289 85 83 93 100 153 189 140 28 106 38 100 48
3157 48 68 208 132 60 156 101 88 62 88 36 73 52 189 62 306 443 340 132 166 58 153 169 98 105 81 193 24 21 45 79 24
2866 24 136 108 171 61 79 64 28 196 165 43 190 474 492 165 52 95 57 27 145 76 69 146 48 56 139 37 65 98 71 53 31
2575 31 46 170 108 24 39 100 26 161 85 94 55 176 171 109 91 118 53 179 128 156 25 72 59 110 35 239 227 89 83 121 363 344 1340
2265 1340 845 363 151 172 150 138 87 209 76 79 57 73 96 67 189 53 102 52 85 96 60 126 248 112 104 88 60 150 71 105 176
$$ packed form
4406B14K2q6K5J1J25j87JK00k86J60o2O1j6M0o3J1r8M9OLO6Jk8j14K14j67L1r7J92j56kJ63
4105B33r4P2j83J95j36J2K0N0l3kn6j3k2J49r7M9OM7o3K5j45L7K15j92Jj3K4pM9J4Jp9M5M1
3786A50p3O5J3M1j49J01J4p1J01j06N9o7%Q9j0k8r0O9j08J08p4N4P7pk8J4P7l7m5jj06J44
3486A76K4j42Q2r1K7rL6m8L1M3p4K3N6r5N0Rj4O3r9N5l0LK13k04kJ0PN3L6m9j12P8o8O2n2
3157D8K0J40p6p2R6n5j3k6K6n2L7k1J37j27K44J37j03k08L4j08R5J6p1Pk4J12j69lK4L4n5
2866B4J12k8O3j10J8j5l6J68l1j22J47K84J8l27j13M3l8l0J18o9pP7r8QQ3j02K8L3k7j8k2
2575C1J5J24o2q4J5O1p4J35p6Rl9J21no2j8K7o5J26n1K8j31M7j3N1p5K04j2j38oL8K42j9R96
2265A340m95m82k12K1k2j2n1J22j33Lk2J6K3k9J22j36M9n0L3J1l6O6J22j36qj6k8R0p9L4P1
$$ plain form
1974 176 15 253 190 155 151 36 65 358 62 162 56 228 217 193 404 470 322 668 351 8346 14479 18328 11825 5131
1749 5131 1064 478 387 211 241 273 130 296 295 147 181 107 182 213 157 240 124 190 143 300 55 547 758 1789 823 410 146
1495 146 197 258 17 214 74 111 56 184 80 122 90 44 59 62 137 125 185 104 64 97 64 124 108 149 102 178 175 254 193 153 172 90 203
1185 203 94 120 27 87 86 165 83 64 180 69 85 112 100 42 98 104 78 183 222 102 30 102 118 161 76 72 50 68 36 135 149 257 173
875 173 166 204 66 111 185 339 238 443 506 620 1226 8468 11091 3435 1495 1008 770 648 899 971 127 188 471 1019 123
640 123 1365 2150 1594 1026 3326 17576 32979 38481 24689 5165 2841 1188 2026 618 308 132 298 300 413 341
453 341 225 296 16 129 159 254 174 178 40 205 103 84 117 158 85 306 113 124 195 45 59 109 184 104 183 149 88 240 89 313
171 313 188 85 239 33 29 32 171 66 2 273 52 59 180 112 72 100 134 107 85 61 61 258 171 82 110 181 94 130 63 127 108 141
$$ packed form
1974A76j61K38o3l5mj15K9K93k96J00j06J72j1k4K11O6j48L46l17P995O133L849o503o694
1749E131m067n86r1j76L0L2j43J66jj48L4p4P5L1n6Q3j16O6m7J57k45M92K11J031r66m13k64
1495A46N1O1k41J97j40L7n5J28j04M2l2m6J5LP5j2O0q1m0L3l3O0j6M1m7P6lP9o1m0J9q2J13
1185B03j09K6r3O0jP9q2j9J16j11J6K7j2n8N6Ok6J05L9j20p2P2J6M3q5mk2J8l2R9J4J08q4
875A73pL8j38M5P4J54j01K05O3J14O06P242K623p656j940m87k38j22K51P2q44O1K83N48q96
640A23J242P85n56n68K300J4250J5403N502j3792j9524k324j653Q38j408l10j76J66KJ13p2
453C41j16P1k80J13L0R5q0Mj38J65j02j9L3M1p3K21j93J1P1j50J4N0P5q0P9l4o1J52j51K24
171C13j25j03J54k06mLJ39j05o4K71k21PJ21o8m0K8L4k7k2k4%J97q7q9K8P1q7L6o7O4j9L3
$$ plain form
-129 141 45 204 159 125 142 162 42 152 109 103 147 194 118 126 152 159 131 195 216 184 135 212 239 111 306 119 231 204
$$ packed form
-129A41r6J59m5l4J7K0j20J10m3oM4M7p6QK6Pk8O4K1l2m9P7K7j28J95j87J12k7
-392B04
##PAGE=	F1=-3200.02
##FIRST=	4405.895418600002813,	4405.895418600002813,	0
##DATA TABLE=	(F2++(Y..Y)), PROFILE
$$ plain form
4406 315 426 291 349 351 449 299 231 456 96 329 305 330 220 331 228 236 151 206 251 198 242 233 191 96 341 142 206 70 317 107
4124 107 81 262 196 258 90 298 140 129 83 237 161 165 154 100 47 262 102 171 160 247 91 236 41 55 272 3 85 165 143
3852 143 131 148 113 150 47 177 170 46 161 184 162 58 180 235 49 253 71 148 42 142 204 130 156 102 87 43 110 86 133 171
3570 171 184 71 127 220 132 193 144 83 218 198 40 191 70 66 100 122 101 113 154 96 74 179 44 127 126 50 137 68 38 49 87 316
3270 316 65 95 110 100 121 202 175 42 107 53 106 93 45 161 194 94 202 99 105 58 121 13 115 46 203 89 296 451 357
2997 357 94 177 51 115 146 117 149 27 225 22 22 54 59 77 126 113 189 107 76 98 31 185 186 60 130 377 491 193 42 119 85
2706 85 15 159 67 75 131 34 11 153 78 32 62 67 71 86 8 224 134 16 26 84 106 184 62 112 72 204 195 115 142 109 82 179 163 119
2387 119 28 84 79 119 80 182 223 15 24 87 296 391 1118 591 401 127 129 146 189 188 186 94 76 69 54 213 109 244 32 157 77 111
$$ packed form
4406C15J11j35N8KR8j50o8K25l60K33k4K5j10J11j03Qq5N5M5n3M4rm2r5K45j99O4j36K47k10
4124A07k6J81o6O2j68K08j58j1m6J54p6Mj1n4n3K15j60O9j1Q7j56J45j95J4K17k69Q2Q0k2
3852A43j2J7l5L7j03J30pj24J15K3k2j04J22N5j86K04j82P7j06J00O2p4K6n4j5m4O7k4M7L8
3570A71J3j13N6R3q8O1m9o1J35k0j58J51j21mL4K2k1J2M1n8k2J05j35Q3jp6Q7o9l0J1L8K29
3270C16k51L0J5j0K1Q1k7j33O5n4N3j3m8J16L3j00J08j03Om7O3j08J02o9J57j14K07J55r4
2997C57k63Q3j26O4L1k9L2j22J98k03%L2NJ8M9j3P6q2l1K2o7J54Jj26P0K47J14k98j51P7l4
2706H5p0J44r2QN6r7k3J42p5m6L0NMJ5p8K16r0j18J0N8K2P8j22N0m0J32rq0K7l3k7R7j6m4
2387A19r1N6nM0l9J02M1k08RO3K09R5P27n27j90k74KJ7M3jkr2j8pj5J59j04J35k12J25q0L4
$$ plain form
2087 111 51 116 146 319 76 170 64 56 199 130 203 204 43 294 135 196 216 134 164 481 115 240 108 315 335 346 622 664 618
1814 618 936 429 12890 22275 28231 18335 7878 1704 743 531 335 322 454 172 345 399 257 247 154 218 256 186 261
1598 261 171 273 182 306 85 653 849 1766 782 478 129 234 250 21 214 70 150 12 203 127 89 77 31 94 62 196 111
1345 111 209 125 73 102 80 161 133 107 53 199 171 210 141 181 209 137 178 118 116 21 53 115 257 118 55 167 36 98 124 143 121 132 162
1035 162 108 173 234 91 82 198 194 180 108 75 76 168 66 210 265 277 201 103 306 116 324 376 442 379 438 634 747 1002 17098 28538
753 28538 6721 2829 1979 1305 1042 1157 988 210 429 824 1441 929 1925 2628 2117 1638 5597 31530 58553 68170
565 68170 43609 9160 5242 2536 3403 1236 552 197 482 503 714 673 385 419 98 108 246 391 323 322 153 254 107
349 107 100 131 239 137 419 182 119 204 81 166 177 293 202 221 81 65 244 92 344 164 122 288 84 57 59 201 145 74 346
$$ packed form
2087A11o0O5L0J73k43R4j06qJ43o9P3Jj61K51j59O1K0q2L0L17l66J25j32K07K0J1K76M2m6
1814F18L18n07J2461R385N956r896j0457o174r61k12j96j3J32k82J73N4j42j0r3O4L8p0P5
1598B61r0J02r1J24k21N68J96R17r84l04l49J05J6k29J93j44Q0j38J91p6l8j2m6O3l2J34q5
1345A11R8q4n2K9k2Q1k8k6n4J46k8L9o9M0K8p2M1o0kr5L2O2J42j39o3J12j31O2K6J9k2J1L0
1035A62n4O5O1j43rJ16mj4p2l3JR2j02J44N5J2p6r8K03j90K08N2O6o3N9J96J13K55J6096J1440
753B8538k1817l892q50o74k63J15j69p78K19L95O17n12R96P03n11m79L959K5933K7023R617
565F8170k4561l4449l918k706Q67k167o84l55K85K1K11m1k88L4l21J0J38J45o8jj69J01j47
349A07pL1J08j02K82k37o3Q5j23Q5J1J16r1J9j40j6J79j52K52j80m2J66k04k7KJ42n6p1K72
$$ plain form
77 346 46 87 182 119 102 227 206 195 149 100 29 290 226 155 194 241 113 168 110 193 177 234 122 272 239 161 202 194 181 248 190 144 216
-233 216 249 147 145 291 295 257 255 253 276 224 390 340 297 456 254 370 335
$$ packed form
77C46l00M1R5o3j7J25k1j1m6m9p1K61o4p1L9M7j28N5n8Q3j6N7j12J50l3p8M1qj3O7n8m6P2
-233B16L3j02kJ46Ml8kkK3n2J66n0m3J59k02J16l5
-392C35
##PAGE=	F1=-3218.8
##FIRST=	4405.895418600002813,	4405.895418600002813,	0
##DATA TABLE=	(F2++(Y..Y)), PROFILE
$$ plain form
4406 432 610 459 516 517 568 452 344 570 210 463 466 453 281 426 293 292 276 308 364 264 305 271 227 144 401 246 277 151 390
4134 390 134 138 292 251 327 158 344 198 147 58 301 206 219 230 137 71 328 95 196 216 282 70 300 62 110 270 81 106
3871 106 262 189 166 165 88 166 93 248 184 82 183 191 107 84 228 281 16 296 52 139 52 216 243 104 173 170 75 80 116 146 173 185
3570 185 201 48 108 208 61 248 131 139 268 178 16 238 87 105 131 134 140 138 171 146 73 222 88 151 143 19 137 88 55 34 163
3279 163 336 64 84 116 118 146 198 210 72 101 67 83 149 144 112 243 127 231 89 124 80 157 25 142 44 203 106 272 439 391
2997 391 96 181 57 88 122 125 190 39 253 29 22 73 48 130 81 144 185 139 66 118 95 168 200 177 144 323 495 207 33 194 105
2706 105 17 177 47 94 141 45 80 143 121 8 18 63 84 133 63 261 155 46 23 73 184 196 79 123 80 211 210 110 172 130
2425 130 106 170 202 74 53 97 136 116 135 142 204 46 35 44 211 406 812 351 438 109 88 136 226 267 150 134 78 84 134 390 176
$$ packed form
4406D32J78j51N7JN1j16j08K26l60K53Lj3j72J45j33jj6L2N6j00M1l4m4q3K57j55L1j26K39
4134C90k56MJ54m1P6j69J86j46n1q9K43r5J3J1r3o6K57k33J01K0O6k12K30k38M8J60j89K5
3871A06J56p3k3jp7P8p3J55o4j02J01Qq4k3J44N3k65K80k44Q7q7J64K7j39O9lr5NL6L0K7J2
3570A85J6j53O0J00j47J87j17QJ29r0j62K22j51J8K6LOkL3k5p3J49j34O3qj24J18m9l3k1J29
3279A63J73k72K0L2KK8N2J2j38K9l4J6O6nl2J31j16J04j42L5m4P7j32J17r8J59r7J66J67m8
2997C91k95Q5j24L1L4LO5j51K14k24pN1k5Q2m9O3M1m6p3N2k3P3L2k3l3J79J72k88j74J61q9
2706A05q8J60j30M7M7r6L5O3k2j13J0M5K1M9p0J98j06j09k3N0J11J2j17M4m3J31jj00O2m2
2425A30k4O4L2j28k1M4L9k0J9PO2j58j1RJ67J95M06m61Q7l29k1M8R0M1j17j6n6ON0K56k14
$$ plain form
2134 176 281 54 205 94 133 30 181 158 384 42 226 72 70 244 189 287 262 93 310 97 236 266 243 255 582 172 301
1880 301 178 397 460 493 829 844 908 1174 523 17431 30069 38185 24869 10659 2349 1008 691 460 413 630 276
1683 276 418 500 377 328 234 252 287 230 303 230 369 225 316 160 712 1080 1765 716 544 128 257 209 45 212 90 196
1439 196 67 213 170 79 55 29 146 55 269 64 234 135 74 125 98 202 182 73 95 186 186 197 98 192 245 165 162 120 126 39 9 164
1138 164 321 166 109 121 49 120 195 181 186 139 218 165 118 259 164 118 267 262 162 90 142 87 305 125 223 300 219 193 86 330 244
847 244 394 434 448 353 371 619 743 978 18817 32715 7971 3278 2395 1535 1253 1385 781 287 540 1063 1788 1724 2582
631 2582 3079 2674 2288 7849 45792 84979 98853 63096 13347 7792 4192 4265 1783 755 254 694 789 1022 1023 620
443 620 514 182 71 358 567 493 472 421 231 89 135 202 326 272 530 246 137 210 130 293 249 397 301 285 36 50 253 204
$$ packed form
2134A76J05k27J51j11L9j03J51k3K26l42J84j54kJ74n5R8k5j69K17k13J39L0k3J2L27m10J29
1880C01j23K19O3L3L36J5O4K66o51J6908J2638Q116j3316j4210q310j341l17k31m7K17l54
1683B76J42Q2j23m9r4J8L5n7P3p3J39j44R1j56N52L68O85j049j72m16J29m8j64J67j22J06
1439A96j29J46m3r1k4k6J17r1K14k05J70r9o1N1k7J04k0j09K2R1%J1r9R4N3q0lm2Oq7l0J55
1138A64J57j55n7J2p2P1P5j4Nm7P9n3m7J41r5m6J49nj00p2N2n5K18j80R8P7q1k6j07K44q6
847B44J50M0J4r5J8K48J24K35J7839J3898k4744m693q83q60k82J32o04m94K53N23P25o4Q58
631B582M97m05l86N561L7943L9187J3874l5757m9749n555l600P3k482j028n01M40R5K33Jm03
443F20j06l32j11K87K09p4k1n1j90j42M6O7J24n4K58k84j09P3q0J63m4J48r6j6k49J4K03m9
$$ plain form
180 204 375 194 177 318 115 70 144 260 236 159 388 125 87 177 153 138 360 271 279 189 150 36 309 270 266 276 282 131 190 162 256
-111 256 264 318 241 329 314 177 258 266 318 335 261 198 287 296 219 245 422 440 374 289 311 371 338 557 450 480 583 402 487 462
$$ packed form
180B04J71j81j7J41k03m5P4J16k4p7K29k63l8R0k4j5K22q9Qr0l9j14K73l9mJ0Oj51N9k8R4
-111B56QN4p7Q8j5j37Q1QN2J7p4o3Q9Rp7K6J77J8o6q5K2O0l3K19j07L0J03j81Q5k5
-392D62
##PAGE=	F1=-3237.58
##FIRST=	4405.895418600002813,	4405.895418600002813,	0
##DATA TABLE=	(F2++(Y..Y)), PROFILE
$$ plain form
4406 538 752 608 645 650 646 555 441 642 311 576 594 540 334 490 337 327 392 403 445 313 363 298 260 185 441 351 337 214 436
4134 436 145 199 320 288 397 219 353 249 153 86 348 246 279 285 169 87 374 74 219 287 307 77 340 75 170 258 146
3880 146 131 336 218 177 175 83 182 160 309 187 133 194 176 40 107 279 293 76 314 43 122 71 274 278 86 182 215 93 101 127
3598 127 202 195 200 204 75 90 187 47 287 114 190 310 145 39 264 97 160 154 141 171 160 178 193 77 257 134 155 149 17 147
3317 147 99 144 58 234 336 49 53 110 149 195 182 242 89 90 72 37 203 234 73 271 150 236 75 143 105 185 71 151 47 189
3035 189 111 226 440 425 112 182 79 79 110 127 218 101 269 48 41 98 70 173 13 187 164 153 62 124 165 146 217 297 170 370
2753 370 514 203 33 279 115 37 198 27 109 165 61 148 112 157 43 28 58 85 165 115 277 169 73 30 59 245 199 106 143
2481 143 83 197 212 97 182 168 128 155 223 50 96 104 200 102 193 123 176 82 75 31 121 412 562 415 470 95 80 118 250 309 111
$$ packed form
4406E38K14j44L7Nmr1j14K01l31K65J8n4k06J56j53j0O5J1M2j32N0o5l8p5K56r0j4j23K22
4134D36k91N4J21l2J09j78J34j04r6o7K62j02L3Oj16q2K87l00J45O8K0k30K63k65R5Q8j12
3880A46j5K05j18m1kr2R9k2J49j22n4O1j8j36O7J72J4k17K38k71P9n1K03Mj92R6L3j22QK6
3598A27P5pNMj29J5R7j40K40j73P6J20j65j06K25j67O3oj3L0j1J8J5j16J80j23K1oj32J30
3317A47m8M5q6J76J02k87MN7L9M6j3O0j53Jj8l5J66L1j61J98j21Q6j61O8l8Q0j14Q0j04J42
3035A89p8J15K14j5l13P0j03%L1J7R1j17J68k21pN7k8J03j60J74k3j1r1O2M1j9P1Q0j27K00
2753C70J44l11j70K46j64p8J61j71Q2N6j04Q7l6M5j14j5L0K7Q0n0J62j08r6m3K9J86m6r3L7
2481A43o0J14J5j15Q5j4m0K7O8j73M6QR6r8R1p0N3r4pm4R0K91J50j47N5l75j5L8J32N9j98
$$ plain form
2190 111 170 89 96 213 553 243 298 85 235 100 147 62 240 164 434 20 258 99 93 279 236 344 329 136 302 120 271
1936 271 295 347 322 648 225 336 241 466 572 606 993 982 1143 1343 598 21170 36487 46438 30287 12996 2886 1226
1730 1226 833 560 495 771 394 493 577 481 408 323 275 298 280 358 284 448 260 324 226 693 1362 1732 594 607 136 274 142
1476 142 62 203 129 242 147 224 204 96 40 63 206 75 331 40 256 140 81 163 122 242 225 49 161 146 210 208 130 198 282
1204 282 169 155 107 148 84 58 212 357 210 153 82 117 141 272 224 237 137 256 234 52 292 255 154 311 308 118 93 243 143
932 143 428 179 182 271 103 166 208 316 365 365 376 309 177 255 530 417 152 14265 24130 5691 2706 2223 1439 1275 1513
697 1513 640 298 512 1148 1967 2350 3148 3435 3134 2854 9655 57658 107263 124733 79486 16905 10005 6190 4435
518 4435 2141 873 278 878 1052 1271 1330 842 581 251 105 476 729 662 572 756 166 100 186 290 401 412 610 299 152
$$ packed form
2190A11N9q1PJ17L40l10N5k13J50j35M7q5J78p6K70m14K38j59oJ86m3J08j5j93J66j82J51
1936B71K4N2k5L26m23J11r5K25J06L4L87j1J61K00p45K0572J5317R951j6151j7291j0110j660
1730A226l93k73o5K76l77R9Q4r6p3q5m8K3j8P8p4J64j88O4r8M67O69L70j138J3m71J38j32
1476A42q0J41p4J13r5P7k0j08n6K3J43j31K56k91K16j16n9Q2m1J20j7j76J12j5O4kp8O8Q4
1204B82j13j4m8M1o4k6J54J45j47n7p1L5K4J31m8J3j00J19k2j82K40l7j01J57lj90k5J50j00
932A43K85k49LQ9j68O3M2J08M9%J1o7j32P8K75j13k65J4113R865j8439k985m83p84j64K38
697A513q73l42K14O36Q19L83P98K87l01k80O801M8003M9605J7470m5247o2581o900l815j755
518D435k294j268n95O00J74K19N9m88k61l30j46L71K53o7r0J84n90o6Q6J04J11J1J98l11j47
$$ plain form
284 152 206 178 412 307 486 380 343 84 66 265 330 393 284 221 326 127 68 235 301 325 243 398 195 63 171 203 177 469
21 469 321 343 193 192 85 312 304 370 340 295 137 193 206 303 343 382 328 367 369 170 305 343 424 399 312 237 347 324 301 343 522 567 456
-289 456 292 366 449 448 682 539 628 661 521 564 557
$$ packed form
284A52N4k8K34j05J79j06l7k59j8J99O5O3j09o3J05j99n9J67O6K4q2J55k03j32J08L2k6K92
21D69j48K2j50jj07K27qO6l0m5j58N6J3R7M0L9n4L9Kj99J35L8Q1k5q7p5J10k3k3M2J79M5j11
-289D56j64P4Q3jK34j43Q9L3j40M3p
-392E57
##PAGE=	F1=-3256.36
##FIRST=	4405.895418600002813,	4405.895418600002813,	0
##DATA TABLE=	(F2++(Y..Y)), PROFILE
$$ plain form
4406 607 822 704 708 728 671 593 502 657 379 642 672 575 364 515 350 333 470 474 481 336 401 306 276 206 453 425 376 251 450 136
4124 136 248 334 296 450 263 324 288 150 127 368 265 326 313 188 94 385 45 239 342 323 92 350 78 219 229 186 156
3871 156 372 231 165 175 92 188 220 348 184 171 189 145 32 125 322 272 134 307 54 99 71 309 297 81 183 227 122 105
3608 105 143 246 192 209 197 98 72 164 125 298 114 229 328 114 88 260 102 202 162 149 190 176 170 229 79 280 172 140 146 36
3326 36 157 93 225 85 279 316 18 16 94 182 230 165 264 89 75 68 38 248 299 55 270 157 214 65 162 126 198 114 144 54 163
3035 163 107 158 498 445 135 181 114 76 112 132 228 155 270 68 75 124 106 198 59 224 136 147 82 121 227 124 241 398 211 462
2753 462 543 183 41 351 122 64 222 33 111 187 69 199 70 187 70 72 55 73 182 157 269 178 95 50 39 279 201 116
2490 116 174 77 168 200 86 176 199 145 135 222 84 146 110 251 79 245 113 153 90 94 101 50 430 614 713 493 80 116 98 264
$$ packed form
4406F07K15j18MK0n7p8r1J55k78K63L0r7k11J51j65j7J37MPj45O5r5l0p0K47k8m9j25J99l14
4124A36J12Q6l8J54j87O1l6j38k3K41j03O1j3j25r4K91l40J94J03j9k31K58k72J41J0m3l0
3871A56K16j41o6J0q3R6L2J28j64j3J8m4j13R3J97n0j38J73k53M5k8K38j2k16J02M4j05j7
3608A05L8J03n4J7j2r9k6R2l9J73j84J15R9k14k6J72j58J00m0j3M1j4oN9j50K01j08l2Oj10
3326C6J21o4J32j40J94L7k98kP8Q8M8o5R9j75j4pl0K10N1k44K15j13N7j49R7l6P2q4L0r0J09
3035A63n6N1L40n3l10M6o7l8L6K0R6p3J15k02PM9j8R2j39J65q8J1o5L9J06j03J17J57j87K51
2753D62Q1l60j42L10k29n8J58j89P8P6j18J30j29J17j17Kj7J8J09k5J12r1q3m5j1K40p8q5
2490A16N8r7R1L2j14R0K3n4j0Q7j38O2l6J41j72J66j32M0o3MPn1L80J84R9k20m13L6j8J66
$$ plain form
2209 264 309 84 192 106 106 269 670 293 296 114 240 98 151 100 285 166 462 32 266 129 111 305 268 368 382 173 278
1955 278 172 301 301 431 353 675 267 344 284 514 656 668 1096 1055 1292 1418 638 23405 40319 51428 33576 14451
1749 14451 3211 1350 921 612 547 854 483 543 613 541 465 391 283 283 318 403 313 485 277 321 267 586 1623 1696 439 658
1504 658 139 293 79 73 184 164 276 217 237 221 131 46 113 259 115 362 101 269 149 100 200 147 267 240 34 215 101
1251 101 229 224 194 209 309 158 149 94 174 132 113 248 372 235 190 115 178 153 320 264 273 151 275 291 98 319 329 204 336 339
969 339 97 180 333 229 514 248 136 235 28 198 343 342 491 356 301 92 79 229 523 74 1060 6572 9463 2879 1665
734 1665 1673 1153 1170 1521 722 321 396 1099 1962 2711 3474 3617 3375 3209 10654 64706 120830 140518 89431 19066 11413
537 11413 8691 5073 2245 921 261 970 1209 1399 1535 999 625 304 170 567 833 804 593 1129 230 169 231 359 449
$$ packed form
2209B64M5k25J08q6%J63M01l77Lj82J26j42N3n1J85j19K96m30K34j37j8J94l7J00J4k09J05
1955B78j06J29%J30p8L22m08P7o0K30J42J2M28m1K37J26p80K2767J6914J1109j7852j9125
1749A4451j1240j861m29l09o5L07l71O0P0p2p6p4j08%L5Q5r0J72k08M4n4L19J037P3j257K19
1504F58n19J54k14oJ11k0J12n9K0j6r0q5O7J46j44K47k61J68j20m9J00n3J20k7k06J81j14
1251A01J28nl0J5J00j51rn5Q0m2j9J35J24j37m5p5O3k5J67n6Rj22J24J6j93K21J0j25J32L
969C39k42Q3J53j04K85k66j12R9k07J70J45jJ49j35n5k09j3J50K94m49R86N512K891o584j214
734A665Qn20J7L51p99m01P5P03Q63P49P63J43k42j66P445N4052N6124J9688n1087p0365p653
537A1413k722l618k828j324o60P09K39J90J36n36l74l21j34L97K66k9k11N36q99o1O2J28R0
$$ plain form
321 449 520 641 339 156 194 211 497 336 547 423 381 131 85 276 427 386 378 253 308 124 57 305 307 394 310 380 249 29 170
49 170 243 210 538 350 380 165 216 135 291 325 447 376 276 135 180 230 325 392 424 369 381 393 140 337 402 474 433 340 248 387 323
-242 323 362 404 576 655 492 269 394 491 527 740 585 719 679 590 589 597
$$ packed form
321D49P1J21l02j83L8J7K86j61K11j24m2k50m6J91J51m1qj25N5j84o7K48KQ7q4P0j31k20J41
49A70P3l3L28j88L0k15N1q1J56L4J22p1j00j41M5N0R5O7L2n5J2J2k53J97O5P2m1r3r2J39o4
-242C23L9M2J72P9j63k23J25R7L6K13j55J34m0q9jQ
-392E97
##PAGE=	F1=-3275.14
##FIRST=	4405.895418600002813,	4405.895418600002813,	0
##DATA TABLE=	(F2++(Y..Y)), PROFILE
$$ plain form
4406 624 806 727 694 742 640 564 516 608 399 641 688 550 364 498 325 306 491 508 462 331 411 292 267 197 435 448 385 260
4143 260 430 110 275 323 271 476 283 265 312 146 149 352 261 347 316 191 96 360 35 245 363 327 102 332 79 247 184
3889 184 192 176 366 227 137 164 94 175 262 357 179 190 166 106 84 135 345 225 176 281 70 75 50 320 295 81 177 201 143 94 164
3598 164 272 163 207 184 102 55 140 188 276 127 254 316 103 136 223 106 217 152 160 194 182 146 248 80 289 197 110 139 51 160
3317 160 74 282 92 288 280 54 42 74 202 238 152 272 75 59 66 94 278 328 56 242 148 172 70 179 139 195 143 124 64 130
3035 130 97 92 606 441 162 181 155 69 117 140 221 190 255 81 115 144 134 199 121 244 121 124 117 113 272 111 267 464 286 526 564
2744 564 147 50 395 137 94 242 51 101 195 70 223 29 213 86 114 57 58 183 185 242 183 111 77 16 279 199 109 202 62
2472 62 132 174 89 158 209 154 114 201 130 189 117 275 58 282 104 151 80 90 171 75 464 851 1002 505 65 158 102 269 271 69
$$ packed form
4406F24J82p9l3M8j02p6m8R2k09K42M7j38j86J34j73j9J85J7m6j31Q0j19k5p0K38J3o3j25
4143B60J70l20J65M8n2K05j93j8M7j66LK03r1Q6l1j25r5K64l25K10J18l6k25K30k53J68o3
3889A84Qj6J90j39r0K7p0Q1Q7R5j78J1k4o0k2N1K10j20m9J05k11Nk5K70k5k14R6K4n8m9P0
3598A64J08j09M4k3q2m7Q5M8Q8j49J27O2k13L3Q7j17J11o5QL4j2l6J02j68K09r2q7K9q8J09
3317A60q6K08j90J96qk26j2L2J28L6q6J20j97j6PK8J84N0k72J86r4K4j02J09m0N6n2j9o0O6
3035A30l3nN14j65k79J9k6q6M8K3Q1l1O5j74L4K9j0O5p8J23j23LpmJ59j61J56J97j78K40L8
2744E64m17r7L45k58m3J48j91N0R4j25J53j94J84j27K8n7JJ25KN7n9p2l4o1K63q0r0R3j40
2472F2P0M2q5O9N1n5m0Q7p1N9p2J58k17K24j78M7p1J0Q1r6L89L87J51m97m40R3n6J67Kk02
$$ plain form
2190 69 195 122 109 288 723 314 282 140 221 93 145 129 312 161 463 60 253 157 115 318 281 358 408 205 248 217 316 288 487
1918 487 347 661 294 324 299 531 697 671 1122 1051 1336 1393 642 23708 40822 52173 34102 14735 3256 1356 927
1720 927 601 553 862 516 544 603 537 484 414 271 242 326 421 301 465 265 298 280 395 1829 1875 437 686 136 316 92 82
1467 82 154 180 292 261 240 224 170 54 157 291 144 351 149 272 160 118 223 165 265 219 32 252 72 233 225 238 216 309
1204 309 139 137 94 193 164 143 262 369 229 215 167 207 146 323 281 291 176 280 312 166 321 362 244 338 353 124 269 378 294
932 294 539 299 129 236 122 262 421 405 577 402 285 118 289 310 595 464 2002 1387 5563 4051 1005 1036 843
716 843 1007 1424 814 380 258 960 1800 2760 3467 3554 3316 3263 10639 65446 122769 142845 90809 19329 11708 11761 8198
518 8198 2124 1011 310 924 1209 1370 1597 1057 646 336 204 610 852 894 541 1494 435 252 252 387 454 573 613 357
$$ packed form
2190F9J26p3j3J79M35m09l2j42Q1j28N2j6J83j51L02m03J93r6m2K03l7P7N0k03M3l1R9k8J99
1918D87j40L14l67L0k5K32J66k6M51p1K85N7p51K3066J7114J1351j8071j9367j1479j900m29
1720I27l26m8L09l46K8N9o6n3p0j43k9Q4R5j20J64k00L3j8J15J434M6j438K49n50J80k24j0
1467H2P2K6J12l1k1j6n4j16J03J34j47K07k02J23j12m2J05n8J00m6j87K20j80J61qJ3k2R3
1204C09j70km3R9k9k1J19J07j40j4m8M0o1J77m2J0j15J04L2j46J55M1j18R4J5k29J45J09q4
932B94K45k40j70J07j14J40J59j6J72j75j17j67J71K1K85j31J538o15M176j512l046L1j93
716H43J64M17o10m34j22P02Q40R60P07Q7k38n3P376N4807N7323K0076n2036p1480p621N3l563
518H198o074j113p01O14K85J61K27n40m11l10j32M06K42M2l53R53j059j83%J35O7J19M0k56
$$ plain form
293 357 152 177 216 526 328 567 422 393 148 80 279 466 348 439 277 264 113 44 331 274 431 345 342 281 7 171 256 226
30 226 555 351 386 114 216 175 246 323 483 377 232 133 154 226 317 396 441 364 369 380 94 351 425 456 434 346 229 401 293 383
-252 383 417 574 689 479 230 383 486 556 719 574 742 634 598 559 571
$$ packed form
293C57k05K5L9L10j98K39j45k9k45o8J99J87j18R1j62j3j51o9K87n7J57q6lo1k74J64Q5l0
30B26L29k04L5k72J02m1P1P7J60j06j45r9K1P2R1P9M5p7NJ1k86K57P4L1k2q8j17J72j08R0
-252C83L4J57J15k10k49J53J03P0J63j45J68j08l6l9J2
-392E71
##PAGE=	F1=-3293.92
##FIRST=	4405.895418600002813,	4405.895418600002813,	0
##DATA TABLE=	(F2++(Y..Y)), PROFILE
$$ plain form
4406 581 705 672 605 690 560 478 479 506 369 568 645 470 337 446 266 250 447 503 392 297 392 259 231 158 390 415 364 242 380
4134 380 79 280 283 215 472 277 186 320 147 144 301 235 336 294 179 97 302 65 227 346 310 106 294 88 251 128 167
3880 167 187 323 207 109 140 80 145 280 331 170 187 133 68 114 137 342 161 197 240 83 51 35 308 270 77 166 144 156 73 191
3598 191 277 111 194 166 91 43 120 219 224 129 263 271 111 171 163 109 197 128 172 182 177 112 246 89 281 207 75 135 61 151 68 305 70
3288 70 261 238 114 78 53 198 218 146 258 52 43 75 135 291 320 60 192 129 120 94 188 142 181 151 99 72 101 84 93 710 411 180
2988 180 181 197 59 113 144 199 201 229 79 157 154 146 180 161 241 128 92 150 105 295 107 282 483 373 534 564 102 60 404 165 128
2697 128 253 65 91 185 66 213 27 235 92 150 68 64 169 196 200 185 123 103 8 246 185 91 213 34 98 138 108 131 191 150
2415 150 95 168 164 215 128 266 52 295 94 174 80 77 219 139 504 1031 1207 503 56 191 139 259 205 62 180 129 107 271
$$ packed form
4406E81J24l3o7Q5j30q2JK7j37J99P7j75j33J09j80j6J97N6j11r5R5j33k8p3K32K5n1j22J38
4134C80l01K01Lo8K57j95r1J34j73lJ57o6J01m2j15q2K05k37J62J19l6k04J88k06J63j23L9
3880A67K0J36j16r8L1o0O5J35N1j61J7n4o5M6K3K05j81L6M3j57l2j6K73l8j93Q9k2J2q3J18
3598A91Q6j66Q3k8p5m8P7R9Nr5J34Qj60O0qn4Q8o9M4J0no5J34j57J92p4j32O0p4R0q3K37k35
3288G0J91k3j24l6k5J45K0p2J12k06rL2O0J56K9k60J32o3rk6R4m6L9l0n2k7K9j7RO17k99k31
2988A80JJ6j38N4L1N5KK8j50P8lqL4j9Q0j13l6N8m5J90j88J75K01j10J61L0m62m2L44k39l7
2697A28J25j88K6R4j19J47j86K08j43N8q2mJ05K7Mj5o2k0r5K38o1r4J22j79O4M0l0K3O0m1
2415A50n5P3mN1q7J38k14K43k01Q0r4lJ42q0L65N27J76p04m47J35n2J20n4j43J18n1k2J64
$$ plain form
2152 271 711 304 261 158 182 88 132 144 320 147 435 91 230 177 101 312 275 318 402 225 222 240 312 261 507 309 612 306
1889 306 285 285 509 685 616 1069 965 1279 1279 621 22027 37908 48527 31767 13788 3011 1241 842 527 516 797
1692 797 483 490 551 468 459 382 251 187 296 406 247 395 226 253 276 150 2001 2478 745 683 131 335 147 94 114 174 286
1439 286 269 227 219 201 53 182 292 148 297 160 264 164 125 222 169 230 166 49 269 60 219 199 244 206 269 114 116 114 200 169
1157 169 137 252 347 189 222 192 196 113 276 265 290 190 271 285 195 284 348 253 309 347 153 313 362 309 495 302 135 250 159 295
875 295 412 439 583 422 290 236 422 348 626 622 2292 5061 11744 4896 964 540 597 817 1246 773 410 147 772 1528
650 1528 2508 3115 3221 2954 2995 9611 59726 112654 131221 83312 17612 10833 15177 13416 1929 1300 579 735
481 735 1047 1187 1510 1008 638 347 193 594 782 918 504 1799 661 322 245 360 415 561 528 346 144 161 192 490 288
$$ packed form
2152B71M40m07m3j03K4r4M4J2J76j73K88l44J39n3p6K11l7M3Q4j77lJ8P2n1K46j98L03l06
1889C06k1%K24J76o9M53j04L14%o58K1406J5881J0619j6760j7979j0777j770l99l15j1K81
1692G97l14PO1q3rp7j31o4J09J10j59J48j69K7K3j26J851M77j733o2n52K04j88n3K0O0J12
1439B86j7m2qj8j48J29J10j44J49j37J04j00l9R7n3O1o4j17K20k09J59k0M5l8O3j55KkQ6l1
1157A69l2J15R5j58L3l0Mq3J63j1K5j00Q1J4r0Q9O4r5N6L8j94J60M9n3J86j93j67J15r1J36
875B95J17K7J44j61j32n4J86p4K78mJ670K769O683o848l932m24N7K20M29m73l63k63O25P56
650A528R80O07J06k67M1O616N0115N2928J8567m7909o5700o779M344j761j1487o29p21J56
481G35L12J40L23n02l70k91j54M01J88J36m14J295j138l39p7J15N5J46l3j82k02J7L1K98k02
$$ plain form
246 288 540 379 380 131 45 270 437 278 451 296 198 97 33 307 215 431 341 292 288 24 169 234 213 523 321 361 60 191
-17 191 198 183 292 473 344 169 139 119 198 280 353 430 322 335 332 49 348 405 375 400 335 190 390 240 355 379 520 666 422
-289 422 186 331 434 528 621 503 699 535 546 482 483
$$ packed form
246B88K52j61Jk49q6K25J67j59J73j55r8j01o4K74r2K16r0m9mk64J45O5k1L10k02M0l01J31
-17A91Pj5J09J81j29j75l0k0P9Q2P3P7j08J3lk83K99N7l0K5o5j45K00j50J15K4J41J46k44
-289D22k36J45J03R4R3j18J96j64J1o4J
-392D83
##PAGE=	F1=-3312.7
##FIRST=	4405.895418600002813,	4405.895418600002813,	0
##DATA TABLE=	(F2++(Y..Y)), PROFILE
$$ plain form
4406 488 539 554 459 584 445 357 398 371 295 434 558 355 288 367 181 175 349 461 284 240 348 216 173 95 325 339 313 201 309
4134 309 59 261 218 136 441 247 106 311 155 114 223 200 295 256 154 103 227 98 184 298 271 108 250 107 229 75
3889 75 117 190 255 173 104 107 55 102 274 273 155 165 101 44 117 131 313 96 200 194 91 34 75 280 224 68 147 71 170 51 221 261
3589 261 45 172 145 68 38 105 214 153 112 257 200 118 184 93 111 142 96 178 154 160 79 222 113 257 200 53 137 67 133 102 292
3298 292 26 207 199 164 99 37 169 177 144 219 25 29 94 153 286 282 62 127 113 77 129 186 131 165 137 78 73 99 73 133 762 369 169
2988 169 179 230 51 95 141 166 184 196 63 197 156 138 146 178 214 144 63 171 106 292 108 277 455 443 488 543 63 69 381 198
2706 198 160 254 82 101 156 61 172 59 252 92 181 95 89 143 187 153 184 130 123 18 187 154 79 203 12 75 97 127 96 147 134
2415 134 79 137 181 218 138 228 73 280 87 204 115 75 235 198 542 1101 1311 486 59 210 186 234 126 68 147 123 110 244
$$ packed form
4406D88N1J5r5J25j39q8M1k7p6J39J24k03o7P9j86oJ74J12j77m4J08j32m3p8K30J4k6j12J08
4134C09k50K02m3q2L05j94j41K05j56m1J09k3R5l9j02n1J24j29Q6J14k7j63J42j43J22j54
3889G5M2P3O5q2o9Ln2M7J72jj18J0o4n7P3J4J82k17J04oj03n7M1K05n6j56P9p6R9j19J70M0
3589B61k16J27k7p7l0O7J09o1m1J45n7q2O6r1J8L1m6Q2k4Oq1J43j09J44n7j47Q4p0O6l1J90
3298B92k66J81ql5o5o2J32Ql3P5j94MO5N9J33mk20O5j4l6N2N7n5L4k8n9nK6k6O0O29l93k00
2988A69J0N1j79M4M6K5J8J2j33J34m1j8QL2L6p0q1J08o5J86j84J69J78j2M5N5m80OL12j83
2706A98l8R4j72J9N5r5J11j13J93j60Q9q6oN4M4l4L1n4pj05J69l3p5J24j91O3K2L0l1N1j3
2415A34n5N8M4L7q0R0j55K07j93J17q9m0J60l7L44N59K10q25m27J51k4M8j08n8P9k4j3J34
$$ plain form
2152 244 651 269 239 166 137 86 117 145 308 126 380 120 207 182 71 286 249 256 367 226 201 237 286 224 487 249 533 302
1889 302 234 243 447 618 520 942 809 1136 1101 581 18705 32170 41227 27041 11797 2527 1031 682 406 448 675 397
1683 397 386 473 348 398 301 242 149 234 366 163 302 173 189 276 104 2176 3381 1190 646 128 341 185 107 75 158 261
1439 261 241 197 212 221 51 182 266 124 214 130 248 153 119 200 157 168 102 79 270 47 192 145 215 174 192 91 84 150 201 147 99 222
1138 222 306 127 207 190 147 61 197 223 273 190 250 217 180 210 298 229 251 327 164 298 293 272 396 254 137 244 145 282 328 412 511
847 511 374 282 253 464 306 599 540 1969 5567 10675 3423 740 279 396 608 1004 604 371 98 562 1198 2018 2486
631 2486 2658 2357 2460 7777 48776 92663 108152 68536 14277 9015 18429 19228 1897 1794 992 460 762 902
462 902 1296 869 600 337 157 531 639 873 614 1994 849 367 214 286 345 490 402 306 133 146 150 400 237 468 303
$$ packed form
2152B44M07l82l0p3k9n1L1K8J63j82K54k60Q7k5j11K15l7PJ11j41k5L6M9o2K63k38K84k31
1889C02o8RK04J71r8M22j33L27l5n20J8124J3465R057j4186j5244r270j496l49k76M2K27k78
1683C97j1Q7j25N0r7n9r3Q5J32k03J39j29J6Q7j72K072J205k191n44n18K13j56p8l2Q3J03
1439B61k0m4J5Rj70J31Q4j42R0q4J18r5l4Q1m3J1o6k3J91k23J45m7P0m1J8j01pO6N1n4m8J23
1138B22Q4j79Q0j7m3q6J36K6N0q3O0l3l7L0Q8o9K2P6j63J34nk1J24j42j17J07r9J37M6Q4R9
847E11j37r2k9K11j58K93n9J429L598N108p252k683m61J17K12L96m00k33k73M64O36Q20M68
631B486J72l01J03N317M0999M3887J5489l9616n4259n262R414P99j7331j03q02n32L02J40
462I02L94m27k69k63j80L74J08K34k59J380j145m82j53P2N9J45q8r6j73J3MK50j63K31j65
$$ plain form
227 303 345 86 31 248 349 186 419 305 121 83 31 238 151 398 297 237 267 29 160 184 173 450 263 313 38 147 204
-26 204 120 237 421 283 97 152 85 168 225 279 391 260 285 256 56 333 347 251 339 311 156 356 175 285 300 425 595 334
-289 334 143 250 346 448 468 383 604 395 446 374 350
$$ packed form
227C03M2k59n5K17J01j63K33j14j84l8n2K07q7K47j01o0L0k38J31K4j1K77j87N0k75J09N7
-26B04q4J17J84j38j86N5o7Q3N7N4J12j31K5k9k00K77J4r6Q8k8j55K00j81J10J5J25J70k61
-289C34j91J07R6J02K0q5K21k09N1p2k4
-392C50
##PAGE=	F1=-3331.48
##FIRST=	4405.895418600002813,	4405.895418600002813,	0
##DATA TABLE=	(F2++(Y..Y)), PROFILE
$$ plain form
4406 364 343 401 287 441 311 226 289 231 195 264 445 233 225 275 85 96 216 392 159 170 285 173 103 27 253 241 243 145 227 63
4124 63 223 139 49 392 201 62 287 167 70 130 172 236 209 124 114 157 118 122 234 214 112 213 127 185 63 60 185 178 133 125 73 36
3824 36 56 250 194 135 131 87 44 96 120 262 68 189 148 97 36 126 244 166 59 122 26 192 35 251 230 36 142 122 45 41 95
3533 95 178 80 82 242 123 110 173 42 110 57 67 173 114 137 68 181 145 217 181 58 143 68 115 148 248 47 143 162 195 102 27 123
3232 123 129 140 156 4 18 112 148 263 225 69 63 112 66 167 176 108 153 106 68 64 126 64 145 742 343 115 170 250 51 66 130 125 145
2922 145 163 39 229 151 115 103 177 168 155 59 178 118 267 110 252 393 481 411 510 62 77 334 226 187 246 112 127 115 57 111
2641 111 86 258 89 202 135 114 110 162 118 178 134 138 20 111 107 79 180 49 68 61 135 55 82 117 75 121 182 200 147 176 108 237 84
2331 84 226 164 93 214 247 576 1134 1332 454 76 211 226 192 48 95 101 105 127 255 568 217 218 161 109 89 108 132 279 106 306
$$ packed form
4406C64k1N8j14J54j30q5O3n8l6O9J81k12qN0j90J1J20J76k33J1J15j12p0p6K26j2Kr8Q2j64
4124F3J60q4r0L43j91j39K25j20r7O0M2O4k7q5j0M3l9MJ12k0j02J01q6N8j22lJ25pm5qn2l7
3824C6K0J94n6n9mm4m3N2K4J42j94J21m1n1o1R0J18p8j07O3r6J66j57K16k1j94J06k0p7mN4
3533I5Q3r8KJ60j19j3O3j31O8n3J0J06n9K3o9J13l6P2l6j23Q5p5M7L3J00k01R6J9L3r3p5R6
3232A23OJ1J6j52J4R4L6J15l8j56oM9m6J01Ro8M5m7l8mO2o2Q1N97l99k28N5Q0j99J5O4nK0
2922A45J8j24J90p8l6j2P4rj3r6J19o0J49j57J42J41Q8p0R9m48J5K57j08l9N9j34J5j2n8N4
2641A11k5J72j69J13o7k1mN2m4O0m4Mj18R1mk8J01j31J9pP4q0K7L5m2M6O1J8n3K9o8J29j53
2331H4J42o2p1J21L3L29N58J98q78l78J35J5l4j44M7OMK2J28L13l51Jn7n2k0J9K4J47j73K00
$$ plain form
2049 306 139 189 166 34 239 208 180 314 202 182 209 239 181 431 180 433 281 183 188 352 505 404 758 605 935 891 520
1795 520 14382 24715 31687 20837 9145 1905 771 482 266 370 521 283 253 388 212 321 186 256 157 156 312
1598 312 93 236 147 118 295 323 2344 4285 1640 583 126 330 196 116 45 148 222 188 161 208 227 61 160 221 82 122
1354 122 72 227 124 102 165 132 97 71 112 262 27 162 78 165 127 96 78 46 189 204 110 49 182 254 58 177 171 77 18 124
1072 124 181 247 184 219 128 136 114 238 188 174 303 160 236 203 205 277 174 149 223 108 245 218 343 397 287 283 204 442 213 582 379
781 379 1532 3733 5417 1211 217 206 213 396 723 377 280 119 340 854 1393 1709 1963 1652 1775 5499 34869 66962
575 66962 78438 49534 10033 6721 20865 24221 2125 2365 1434 313 439 600 1008 673 534 307 149 444 457
396 457 766 826 2045 958 384 173 185 261 383 259 246 118 131 108 277 197 365 213 294 30 102 216 227 86 362 303 49
$$ packed form
2049C06j67N0k3j32K05l1k8J34j12k0K7L0n8K50k51K53j52r8NJ64J53j01L54j53L30m4l71
1795E20J3862J0333O972j0850j1692p240j134k89k16J04J51k38l0J35j76J09j35P0r9jJ56
1598C12k19J43q9k9J77K8K021J941k645j057m57K04j34q0p1J03P4l4k7M7J9j66R9O1j39M0
1354A22n0J55j03k2O3l3l5k6M1J50k35J35q4Q7l8l1j8l2J43J5r4o1J33P2j96J19or4n9J06
1072A24N7O6o3L5r1Qk2J24n0j4J29j43P6l3KP2j03k5P4j15J37k7J25N4j10mp9K38k29L69k03
781C79J153K201J684m206r94j1PJ83L27l46r7j61K21N14N39L16K54l11J23L724K9370L2093
575F6962J1476k8904l9501l312J4144L356k2096K40r31j121J26J61M08l35j39k27j58K95J3
396D57L09O0J219j087n74k11J2P6J22j24j3j28J3k3J69q0J68j52Q1k64P2J14J1j41K76n9k54
$$ plain form
143 49 78 41 143 110 338 225 180 219 38 148 121 112 350 186 250 55 97 193 87 173 334 208 30 168 67 169 169 206 327
-129 327 198 226 165 105 311 267 130 260 279 162 309 113 192 202 308 495 234 102 159 245 332 291 238 480 237 320 254 199
$$ packed form
143D9K9l7J02l3K28j13m5L9j81J10k7rK38j64O4j95M2R6j06Q6J61j26j78J38j01J02%L7J21
-129C27j29K8o1o0K06m4j37J30J9j17J47j96P9J0J06J87k61j32N7Q6Q7m1n3K42k43Q3o6n5
-392A99
##PAGE=	F1=-3350.26
##FIRST=	4405.895418600002813,	4405.895418600002813,	0
##DATA TABLE=	(F2++(Y..Y)), PROFILE
$$ plain form
4406 235 153 247 124 286 178 116 168 115 91 92 329 150 160 184 5 40 76 311 47 102 213 142 32 59 187 148 166 81 150 74
4124 74 171 63 32 332 157 90 251 175 31 37 160 173 167 100 129 123 122 54 170 149 118 189 136 127 89 43 175 110 107 150 50 44 16 213
3805 213 112 114 97 95 55 64 105 196 98 171 104 104 49 164 207 109 53 90 78 215 27 271 191 100 106 102 35 45 91 132 38 64 228 100
3486 100 92 139 59 103 43 57 154 73 109 80 130 171 167 158 76 148 67 108 181 186 107 99 126 203 91 24 75 87 128 74 34 12 126 130 226 164 91
3138 91 52 119 72 198 164 75 146 71 66 47 162 59 113 658 357 20 154 252 56 51 116 80 95 136 20 249 145 88 60 167
2857 167 124 152 78 171 133 225 112 212 321 501 326 478 87 84 274 243 204 235 152 153 71 51 67 102 252 91 209 179 126 74
2575 74 132 116 167 132 154 14 33 52 83 152 88 74 41 126 15 17 117 87 130 174 166 153 146 145 177 83 234 206 114 167 281 601 1237 1310
2256 1310 406 98 195 248 136 22 127 54 80 157 320 486 161 201 143 116 95 103 109 238 93 222 146 181 133 19 179 158 112
$$ packed form
4406B35q2R4j23J62j08o2N2n3k4JK37j79J0K4j79L5L6K35k64N5J11p1j10K7J28l9J8q5O9p6
4124G4R7j08l1L00j75o7J61p6j44OJ23J3oo7K9ojo8J16k1l1P1n3rl8m6J32o5lM3j00ok8J97
3805B13j01Kj7km0RM1R1r8P3o7%n5J15M3r8n6L7j2J37j88K44q0r1Omo7J0M6M1r4K6J64j28
3486A00qM7q0M4o0J4R7q1L6k9N0M1mrq2P2q1M1P3Np9qK7P7j12o7N1J2M1n4m0k2J14MR6o2p3
3138I1l9O7m7J26l4q9P1p5nj9J15j03N4N45l01l37J34R8j96nO5l6J5M1j16K29j04n7k8J07
2857A67m3K8p4R3l8R2j13J00J09J80j75J52l91lJ90l1l9L1q3Jq2k0J6L5J50j61J18l0n3n2
2575G4N8j6N1l5K2j40J9J9L1O9o4j4l3Q5j11KJ00l0M3M4qj3pjL2r4J51k8r2N3J14L20O36P3
2256A310r04l08R7N3j12j14J05p3K6P7J63J66l25M0n8k7k1QOJ29j45J29p6L5m8j14J60k1m6
$$ plain form
1983 112 257 157 160 164 176 138 345 115 324 245 141 151 243 364 295 544 385 709 686 432 9839 16890 21644 14283 6318
1749 6318 1275 507 288 153 296 363 174 116 312 120 253 62 277 186 88 256 115 231 176 53 323 471 2429 4921
1523 4921 2012 503 114 303 181 114 35 146 178 126 133 198 223 75 124 174 42 53 13 200 87 78 126 106 53 94 138 254 21
1251 21 139 40 113 78 42 76 14 213 211 81 50 142 203 19 148 152 15 49 113 164 214 181 186 47 87 28 186 156 94 284 146 152
950 152 132 143 172 96 168 201 80 211 165 269 283 217 283 152 382 125 607 333 1531 1606 4542 3260 346 168 146 267
706 267 447 169 180 150 116 540 756 935 1271 977 1081 3195 20699 40561 47849 29977 5741 4568 21903 27230
518 27230 2436 2867 1800 503 255 386 705 465 448 265 186 360 276 613 1000 1936 965 374 136 88 181 273 132 177
293 177 98 113 79 151 177 257 125 239 25 171 181 106 18 301 288 30 80 59 45 100 262 140 124 151 64 139 68 46 239 105
$$ packed form
1983A12J45j00LMJ2l8K07k30K09p9j04J0R2J21o9K49j59L24k3k54R407P051M754p361p965
1749F318n043p68k19j35J43O7j89n8J96j92J33j91K15r1r8J68j41J16n5j23K70J48J958K492
1523D921k909j509l89J89j22o7p9J11L2n2PO5K5j48M9N0j32J1m0J87j13rM8k0n3M1M4J16k33
1251B1J18r9P3l5l6L4o2J99kj30l1R2O1j84J29Mj37L4O4N1N0l3Nj39M0n9J58l0o2J90j38O
950A52k0J1K9p6P2L3j21J31m6J04J4o6O6j31K30k57M82k74J198P5K936j282k914j78k2J21
706B67J80k78J1l0l4M24K16J79L36k94J04K114J7504J9862P288j7872k4236j173J7335N327
518B7230k4794M31j067j297k48J31L19k40j7j83p9J74q4L37L87R36r71n91k38m8R3R2j41M5
293A77p9J5l4P2K6Q0j32J14k14J46J0p5q8K83j3k58N0k1j4N5J62j22j6K7q7P5p1k2J93j34
$$ plain form
11 105 182 63 62 172 98 128 227 136 50 180 73 206 143 177 247 154 165 86 155 286 189 121 176 242 203 257 65 96 123 191 382 143
$$ packed form
11A05P7j19jJ10p4L0R9r1q6J30j07J33o3L4P0r3J1p9O9J31r7o8N5O6l9N4j92L1K7O8J91k39
$$ [...]
-392G1
##END NTUPLES=	nD NMR SPECTRUM
##END=	
##END=	
