##TITLE=	y$lYxgjEQnyvfQrG3XS0Cg.44.ser
TM-VI-156 hmbc

##JCAMP-DX=	6.0	$$ MestReNova 14.3.0-30573
##DATA TYPE=	LINK
##BLOCK_ID=	1
##BLOCKS=	2    
##ORIGIN=	Mestrelab Research S.L.
##OWNER=	hrzepa
##$MNOVA/LINK_BLOCK_TYPE=	ITEM	$$ NMR Spectrum
##$MNOVA/ITEM/POLYGON=	(XY..XY)
5321,5835
8722,5835
8722,8208
5321,8208
5321,5835
##$MNOVA/ITEM/Z=	0
##$MNOVA/ITEM/ANGLE=	0
##TITLE=	y$lYxgjEQnyvfQrG3XS0Cg.44.ser
##JCAMP-DX=	6.0	$$ MestReNova 14.3.0-30573
##BLOCK_ID=	2
##DATA TYPE=	MNOVA NMR VIEW DATA
##DATA CLASS=	MNOVA VIEW DATA
##$MNOVA/2D/THRESHOLD=	4.7118411064147949219
##$MNOVA/ITEM/ZOOM/X=	-0.47501081208716700033,	14.504330000039219684
##$MNOVA/ITEM/ZOOM/Y=	-9.5107036222489718114,	249.98529999918474687
##END=	
##TITLE=	y$lYxgjEQnyvfQrG3XS0Cg.44.ser
##JCAMP-DX=	6.0	$$ MestReNova 14.3.0-30573
##BLOCK_ID=	3
##DATA TYPE=	nD NMR SPECTRUM
##DATA CLASS=	NTUPLES
##NUMDIM=	2
##ORIGIN=	Bruker BioSpin GmbH
##OWNER=	nmr
##.OBSERVE FREQUENCY=	400.41280287000000726
##.OBSERVE NUCLEUS=	^1H
##.SOLVENT NAME=	CD2Cl2
##.PULSE SEQUENCE=	hmbcgplpndqf
##LONGDATE=	2021/11/11 01:39:36.000
##.ACQUISITIONMODE=	SIMULTANEOUS (DQD)
##$ORIGINAL FORMAT=	Bruker XWIN-NMR
##$MNOVA/SCALES_VERSION=	9
##$PARAMETER FILE=	(acqu2s, ASCII, /private/var/folders/f6/rjf_tdyn2v98c5c0wvkgn4s80000gn/T/y$lYxgjEQnyvfQrG3XS0Cg/44/acqu2s, 0)
$$ ##TITLE= Parameter file, TOPSPIN		Version 3.2
$$ ##JCAMPDX= 5.0
$$ ##DATATYPE= Parameter Values
$$ ##NPOINTS= 129	$$ modification sequence number
$$ ##ORIGIN= Bruker BioSpin GmbH
$$ ##OWNER= nmr
$$ $$ 2021-11-11 01:59:12.587 +0000  nmr@CZC10666PP
$$ $$ /opt/topspin/data/agmb/nmr/Nov10-2021/44/acqu2s
$$ $$ process /opt/topspin3.2/prog/mod/go
$$ ##$ACQT0= 0
$$ ##$BF1= 100.683175
$$ ##$FnMODE= 1
$$ ##$NUC1= <13C>
$$ ##$NusJSP= 0
$$ ##$NusT2= 1
$$ ##$NusTD= 128
$$ ##$O1= 12080.308799824
$$ ##$SFO1= 100.6952553088
$$ ##$SW= 259.972631192251
$$ ##$SW_h= 26178.0104712042
$$ ##$TD= 128
$$ ##END=
$$ 
##$PARAMETER FILE=	(acqus, ASCII, /private/var/folders/f6/rjf_tdyn2v98c5c0wvkgn4s80000gn/T/y$lYxgjEQnyvfQrG3XS0Cg/44/acqus, 0)
$$ ##TITLE= Parameter file, TOPSPIN		Version 3.2
$$ ##JCAMPDX= 5.0
$$ ##DATATYPE= Parameter Values
$$ ##NPOINTS= 12	$$ modification sequence number
$$ ##ORIGIN= Bruker BioSpin GmbH
$$ ##OWNER= nmr
$$ $$ 2021-11-11 01:59:17.139 +0000  nmr@CZC10666PP
$$ $$ /opt/topspin/data/agmb/nmr/Nov10-2021/44/acqus
$$ $$ process /opt/topspin3.2/prog/mod/shimcntl
$$ ##$ACQT0= 1000000
$$ ##$AMP= (0..31)
$$ 100 100 100 100 100 100 100 100 100 100 100 100 100 100 100 100 100 100
$$ 100 100 100 100 100 100 100 100 100 100 100 100 100 100
$$ ##$AMPCOIL= (0..19)
$$ 0 0 0 0 0 0 0 0 0 0 0 0 0 0 0 0 0 0 0 0
$$ ##$ANAVPT= -1
$$ ##$AQSEQ= 0
$$ ##$AQ_mod= 3
$$ ##$AUNM= <au_zg>
$$ ##$AUTOPOS= <31 >
$$ ##$BF1= 400.41
$$ ##$BF2= 100.683175
$$ ##$BF3= 400.41
$$ ##$BF4= 400.41
$$ ##$BF5= 400.41
$$ ##$BF6= 400.41
$$ ##$BF7= 400.41
$$ ##$BF8= 400.41
$$ ##$BYTORDA= 0
$$ ##$CAGPARS= (0..11)
$$ 0 0 0 0 0 0 0 0 0 0 0 0
$$ ##$CFDGTYP= 0
$$ ##$CFRGTYP= 9
$$ ##$CHEMSTR= <none>
$$ [...]
$$ 0 0 0 0
$$ ##$ShimPowMaxUC= (0..63)
$$ 130000 130000 130000 130000 130000 130000 130000 130000 130000 130000 130000
$$ 130000 130000 130000 130000 130000 130000 130000 130000 130000 0 0 0 0
$$ 0 0 0 0 0 0 0 0 0 0 0 0 0 0 0 0 0 0 0 0 0 0 0 0 0 0 0 0 0 0 0 0 0 0 0 0
$$ 0 0 0 0
$$ ##$ShimPowMaxUG= (0..63)
$$ 524287 524287 524287 524287 524287 524287 524287 524287 524287 524287 524287
$$ 524287 524287 524287 524287 524287 524287 524287 524287 524287 0 0 0 0
$$ 0 0 0 0 0 0 0 0 0 0 0 0 0 0 0 0 0 0 0 0 0 0 0 0 0 0 0 0 0 0 0 0 0 0 0 0
$$ 0 0 0 0
$$ ##$ShimPowRcbType= 3
$$ ##$ShimPowRes= (0..63)
$$ 1e-20 1e-20 1e-20 1e-20 1e-20 1e-20 1e-20 1e-20 1e-20 1e-20 1e-20 1e-20
$$ 1e-20 1e-20 1e-20 1e-20 1e-20 1e-20 1e-20 1e-20 0 0 0 0 0 0 0 0 0 0 0 0
$$ 0 0 0 0 0 0 0 0 0 0 0 0 0 0 0 0 0 0 0 0 0 0 0 0 0 0 0 0 0 0 0 0
$$ ##$ShimPowRng0= (0..63)
$$ 1 1 1 1 1 1 1 1 1 1 1 1 1 1 1 1 1 1 1 1 0 0 0 0 0 0 0 0 0 0 0 0 0 0 0 0
$$ 0 0 0 0 0 0 0 0 0 0 0 0 0 0 0 0 0 0 0 0 0 0 0 0 0 0 0 0
$$ ##$ShimPowRng1= (0..63)
$$ 1 1 1 1 1 1 1 1 1 1 1 1 1 1 1 1 1 1 1 1 0 0 0 0 0 0 0 0 0 0 0 0 0 0 0 0
$$ 0 0 0 0 0 0 0 0 0 0 0 0 0 0 0 0 0 0 0 0 0 0 0 0 0 0 0 0
$$ ##$ShimPowRng2= (0..63)
$$ 1 1 1 1 1 1 1 1 1 1 1 1 1 1 1 1 1 1 1 1 0 0 0 0 0 0 0 0 0 0 0 0 0 0 0 0
$$ 0 0 0 0 0 0 0 0 0 0 0 0 0 0 0 0 0 0 0 0 0 0 0 0 0 0 0 0
$$ ##$ShimPowRng3= (0..63)
$$ 1 1 1 1 1 1 1 1 1 1 1 1 1 1 1 1 1 1 1 1 0 0 0 0 0 0 0 0 0 0 0 0 0 0 0 0
$$ 0 0 0 0 0 0 0 0 0 0 0 0 0 0 0 0 0 0 0 0 0 0 0 0 0 0 0 0
$$ ##$ShimSysFunc= (0..63)
$$ 1 2 3 4 5 7 9 11 15 16 8 10 12 14 6 17 13 18 19 20 0 0 0 0 0 0 0 0 0 0
$$ 0 0 0 0 0 0 0 0 0 0 0 0 0 0 0 0 0 0 0 0 0 0 0 0 0 0 0 0 0 0 0 0 0 0
$$ ##$ShimSysMatrix= 0
$$ ##$ShimSysType= 1
$$ ##$TFXNUM= 0
$$ ##$TRIPLO2= 0
$$ ##$VTU= 2
$$ ##$VTUETH= <149.236.99.20>
$$ ##$VTUTY= <no>
$$ ##$WBREFAM= (0..15)
$$ 135 116 100 100 100 100 100 100 100 100 100 100 100 100 100 100
$$ ##$WBREFLM= (0..15)
$$ 0 0 0 0 0 0 0 0 0 0 0 0 0 0 0 0
$$ ##$WBREFPH= (0..15)
$$ 71.66 -68.25 0 0 0 0 0 0 0 0 0 0 0 0 0 0
$$ ##$WBSGU= (0..15)
$$ 0 0 0 0 0 0 0 0 0 0 0 0 0 0 0 0
$$ ##$XFAC= 2
$$ ##END=
$$ 
##$DECIM=	3328
##$DSPFVS=	20
##.ACQUISITIONSCHEME=	NOT PHASESENSITIVE
##NTUPLES=	nD NMR SPECTRUM
##VAR_NAME=	FREQUENCY1,	FREQUENCY2,	SPECTRUM
##SYMBOL=	F1,	F2,	Y
##.NUCLEUS=	13C,	1H
##.OBSERVE FREQUENCY=	100.69525530880000019,	400.41280287000000726
##VAR_TYPE=	INDEPENDENT,	INDEPENDENT,	DEPENDENT
##VAR_FORM=	AFFN,	AFFN,	ASDF
##VAR_DIM=	512,	512,	262144
##UNITS=	HZ,	HZ,	ARBITRARY UNITS
##FIRST=	25169.313707327481097,	5807.6787752999953227,	0.27056449651718139648
##LAST=	-957.56783717514929322,	-190.19907926730809322,	0.40383693575859069824
##MIN=	-957.56783717514929322,	-190.19907926730809322,	0.00037946694646961987019
##MAX=	25169.313707327481097,	5807.6787752999953227,	49.0363922119140625
##FACTOR=	1,	1,	0.0030594227195452558532
##PAGE=	F1=25169.3
##FIRST=	25169.313707327481097,	5807.6787752999953227,	0.27056449651718139648
##DATA TABLE=	(F2++(Y..Y)), PROFILE
$$ [...]
##PAGE=	F1=-10518.7
##FIRST=	25169.313707327481097,	5807.6787752999953227,	0
##DATA TABLE=	(F2++(Y..Y)), PROFILE
$$ plain form
1230 119 6 67 170 161 136 103 219 30 87 78 67 62 104 260 234 9 182 106 88 142 52 91 34 170 193 91 82 136 67 143 221 221 101
843 101 127 120 23 239 126 63 237 240 193 272 323 141 323 85 180 132 94 169 76 201 208 98 90 175 175 97 218 182 103 59 115 131 109
455 109 161 171 76 132 75 85 80 93 188 76 168 64 70 87 119 244 89 137 121 131 214 255 240 146 101 122 121 223 109 219 268 200 389
68 389 234 121 286 214 237 100 53 103 177 63 234 45 129 91 179 355 210 50 34 8 45 64
$$ packed form
1230A19j13O1J03rk5l3J16j89N7rj1nM2J56k6k25J73p6j8N4r0L9n7J36K3j02rN4o9P6P8%j20
843A01K6pr7K16j13o3J74Lm7P9N1j82J82k38R5m8l8P5r3J25Pj10qQ5%p8J21l6p9m4N6J6k2
455A09N2J0r5N6n7J0nJ3R5j12R2j04OJ7L2J25j55M8j6J0Q3M1j5r4m5K1jJ02j14J10M9o8J89
68C89j55j13J65p2K3j37m7N0P4j14J71j89Q4l8Q8J76j45j60j6k6L7J9
-190F4
##PAGE=	F1=-10620.9
##FIRST=	25169.313707327481097,	5807.6787752999953227,	0
##DATA TABLE=	(F2++(Y..Y)), PROFILE
$$ plain form
5808 85 157 243 127 151 199 110 157 137 86 107 188 111 163 157 146 181 124 159 180 190 294 160 86 50 32 99 152 169 204 146 187 157 86 127
5409 127 142 199 197 79 152 208 118 51 76 232 197 82 73 130 116 183 73 72 128 124 194 166 147 131 78 66 214 240 252 234 143 52 55 102 187
4998 187 43 284 369 375 217 149 37 74 130 116 146 85 83 76 68 22 71 263 255 201 140 139 148 146 78 72 67 196 117 48 163 240 61 44 81 81
4575 81 54 121 155 108 196 79 49 135 99 82 67 47 150 239 220 228 234 197 151 72 143 211 113 53 114 111 134 31 128 181 276 189 90 85 68 141
4153 141 189 63 43 68 119 76 116 130 267 187 51 124 208 158 261 155 111 203 79 171 95 202 264 261 65 44 64 184 149 195 172
3789 172 9 140 195 34 87 206 193 63 171 232 100 189 158 71 65 98 191 200 200 64 153 145 138 254 319 100 139 71 34 112 173 283
3413 283 187 154 233 125 306 176 70 22 151 77 89 169 261 215 243 56 158 18 119 78 84 165 138 94 95 47 100 183 116 91 58
3049 58 42 140 158 105 60 87 159 71 49 25 90 32 229 136 116 32 123 71 141 124 34 51 93 174 277 30 157 90 81 142 195 167 40
$$ packed form
5808H5P2Q6j16K4M8q9M7k0n1K1Q1p7N2oj1L5n7L5K1J0J04j34p4l6j8O7N3J7L5n8M1l0p1M1
5409A27J5N7kj18P3N6r0o7K5J56l5j15rN7j4O7j10jN6mP0k8j9j6n3j2J48K6J2j8r1r1LM7Q5
4998A87j44K41Q5Oj58o8j12L7N6j4L0o1kpqm6M9J92qn4o1jRko8onJ29p9o9J15P7j79j7L7%
4575H1k7O7L4m7Q8j17l0Q6l6j7j5k0J03Q9j9QOl7m6p9P1O8r8o0O1lK3j03R7N3R5q7r9nj7P3
4153A41M8j26k0K5N1m3M0J4J37q0j36P3Q4n0J03j06m4R2j24R2p6J07O2lj96k1K0J20l5M6k3
3789A72j63J31N5j61N3J19j3j30J08O1j32Q9l1q7oL3R3R%j36Q9qpJ16O5k19L9o8l7P8O1J10
3413B83r6l3P9j08J81j30j06m8J29p4J2Q0R2m6K8j87J02j40J01m1OQ1k7m4Jm8N3Q3o7k5l3
3049E8j6R8J8n3m5K7P2q8k2k4O5n8J97r3k0q4R1n2P0j7r0J7M2Q1J03k47J27o7rO1N3k8j27
$$ plain form
2662 40 125 54 63 117 62 125 145 162 66 142 178 118 46 142 177 186 112 127 153 64 234 94 86 153 214 181 199 250 83 173 40 106 103 161 61
2251 61 151 79 37 257 115 130 76 69 23 117 84 181 164 41 157 128 126 181 126 88 190 126 159 176 90 68 151 224 281 376 73 90 233
1864 233 423 308 297 278 179 170 177 112 49 89 85 159 5 116 107 50 102 26 158 141 12 128 102 158 201 73 119 144 129 97 43 98 142
1477 142 78 225 163 76 218 271 281 78 284 232 187 33 194 323 134 176 218 56 113 147 111 36 73 152 130 164 74 201 20
1136 20 64 51 86 51 60 235 226 10 234 145 80 124 55 98 43 158 166 100 65 137 75 141 224 258 103 109 117 13 233 89 67 246 202
749 202 256 308 296 115 314 78 182 129 68 172 98 205 206 68 100 176 142 115 235 164 113 89 122 89 121 149 221 149 183 101 79 86
373 86 58 215 56 182 50 80 107 97 212 45 166 135 134 197 269 289 173 135 138 131 239 153 223 263 220 413 264 73 256 204 195
9 195 122 87 117 184 47 211 30 170 95 201 356 212 70 45 18 26 53
$$ packed form
2662D0Q5p1RN4n5O3K0J7r6P6L6o0p2R6L5Rp4J5K6q9J70j40qO7O1l3J8N1j67R0j33O6lN8j00
2251F1R0p2m2K20j42J5n4pm6R4l3R7j7j23J16k9kN5n5l8J02o4L3J7q6k2Q3P3N7R5l03J7J43
1864B33J90j15j1j9r9rPo5o3M0mP4j54J11rn7N2p6J32j7j29J16k6N6M3j28M6K5j5l2n4N5M4
1477A42o4J47o2q7J42N3J0k03K06n2m5j54J61J29j89M2M2j62N7L4l6p5L7P9k2L4r0J27j81
1136B0M4j3L5l5RJ75rk16K24q9o5M4o9M3n5J15Qo6l5P2o2O6Q3L4j55OQj04K20j44k2J79m4
749B02N4N2j2j81J99k36J04n3o1J04p4J07Jj38L2P6l4k7J20p1n1k4L3l3L2K8P2p2L4q2k2P
373H6k8J57j59J26j32L0K7j0J15j67J21l1jO3P2K0j16l8LpJ08q6P0M0m3J93j49j91J83n2r
9A95p3l5L0O7j37J64j81J40p5J06J55j44j42k5k7QK7
-190E3
##PAGE=	F1=-10723.2
##FIRST=	25169.313707327481097,	5807.6787752999953227,	0
##DATA TABLE=	(F2++(Y..Y)), PROFILE
$$ plain form
5808 65 147 214 109 125 180 104 198 171 81 86 182 113 163 203 117 159 127 132 162 188 242 158 119 21 68 31 128 162 160 128 176 153 99 172 141 179
5385 179 191 120 111 147 93 83 81 221 186 66 118 142 90 171 113 53 120 94 189 207 171 145 103 20 191 220 258 227 132 70 18 89 188 37
4986 37 271 392 410 272 148 87 66 154 162 166 116 89 65 72 95 56 260 229 149 79 137 97 125 54 78 87 185 133 83 215 249 71 29 69
4587 69 39 12 104 145 136 224 159 105 118 72 44 47 89 179 268 207 197 217 210 181 51 152 212 101 57 145 127 162 69 162 147 241 174 94 94 51
4164 51 118 233 73 75 41 93 44 124 120 311 219 65 116 185 155 273 218 73 181 75 135 96 207 243 261 87 83 69 135 116 203 162
3789 162 22 165 198 21 75 196 169 26 173 252 94 168 176 44 57 76 216 182 186 91 163 116 134 263 285 99 124 96 61 87
3437 87 149 285 126 170 243 108 276 155 56 27 175 82 69 121 193 244 217 28 147 38 104 97 71 135 93 45 32 44 152 225 97
3073 97 92 91 112 170 158 94 44 69 178 104 24 9 87 90 200 151 165 35 180 91 134 138 14 59 112 171 274 12 200 107 59 150 200
$$ packed form
5808F5Q2O7j05J6N5p6R4k7r0NR6o9N0M0q6M2l2NL0K6N4q4l9r8M7l7R7L4kl2M8k3n4P3l1L8
5385A79J2p1rL6n4j0kJ40l5j20N2K4n2Q1n8o0O7k6R5J8l6k6m2q3J71K9L8l1r5o2n2P1R9j51
4986C7K34J21J8j38j24o1k1Q8QMn0k7k4PK3l9K04l1q0p0N8m0K8p1K4RR8n2n0J32L4j78m2M0
4587F9l0k7R2M1rQ8o5n4J3m6k8LM2R0Q9o1j0K0pk9j30J01O0j11m4Q8j8L5r3R3j5R4o7q0%m3
4164E1O7J15j60Kl4N2m9Q0mJ91r2j54N1O9l0J18n5j45J08j06O0l9J11L6J8j74mj4O6j9Q7m1
3789A62j40J43L3j77N4J21k7j43J47P9j58P4Qj32J3J9J40l4Mr5P2m7J8J29K2j86K5k8l5K6
3437H7O2J36j59M4P3j35J68j21r9k9J48r3j3N2P2N1k7j89J19j09O6pk6O4m2m8j3J2J08P3j28
3073I7njK1N8j2o4n0K5J09p4q0j5P8LJ10m9J4j30J45q9M3Mj24M5N3N9J03k62J88r3m8R1N0
$$ plain form
2685 200 174 74 90 34 37 100 81 133 161 157 44 150 179 93 86 101 132 159 77 142 107 68 204 116 52 168 204 176 155 194 102 165 48
2298 48 99 123 173 95 190 74 38 259 166 139 99 93 11 118 71 178 159 49 110 28 137 169 143 54 169 143 204 164 93 38 161 240
1923 240 297 339 144 100 231 348 289 321 259 191 168 154 160 37 135 156 186 28 135 86 60 32 55 201 170 42 175 112 150 173 66
1559 66 145 146 134 142 46 117 138 46 206 123 104 210 288 267 67 220 202 107 56 184 323 124 170 190 60 61 110 96 94 116 127 96 191
1171 191 63 164 52 62 28 91 79 10 194 202 43 267 173 71 113 46 109 57 152 161 131 55 110 78 130 211 278 109 81 104 14 219
796 219 74 99 270 180 303 313 247 87 275 70 181 116 136 200 118 205 218 69 101 156 95 148 245 150 113 116 116 60 111 144 275 198
420 198 204 123 73 77 64 231 41 190 29 86 127 74 168 14 187 138 121 171 278 329 202 161 131 106 237 193 219 248 212 398 265
56 265 52 216 201 142 146 128 125 201 58 188 29 191 82 212 336 207 91 69 29 41 59
$$ packed form
2685B00k6j00J6n6LO3j9N2K8mj13J06K9q6pJ5L1K7q2O5l5l9J36q8o4J16L6k8k1L9r2O3j17
2298D8N1K4N0p8R5j16l6K21r3k7m0oq2J07m7J07j9j10O1q2J09L2k6q9J15k6O1m0p1n5J23P9
1923B40N7M2j95m4J31J17n9L2o2o8k3j4Oj23R8K1L0j58J07m9k6k8K3J46l1j28J33o3L8K3j07
1559F6P9Jj2Qr6P1K1r2J60q3j9J06P8k1k00J53j8r5n1J28J39j99M6K0j30JM9j4kK2J1l1R5
1171A91j28J01j12J0l4O3j2o9J84Qj59K24r4j02M2o7O3n2R5Rl0p6N5l2N2Q1O7j69k8K3r0K05
796B19j45K5J71r0J23J0o6j60J88k05J11o5K0O4q2Q7J3j49L2N5o1N3R7r5l7L%n6N1L3J31p7
420A98Oq1n0Mj3J67j90J49j61N7M1n3R4j54J73m9j7N0J07N1j27m1l0k5J31m4K6K9l6J86j33
56B65k13J64j5n9Mj8lP6j43J30j59J62j09J30J24j29j16k2m0J2J8
-190E9
##PAGE=	F1=-10825.5
##FIRST=	25169.313707327481097,	5807.6787752999953227,	0
##DATA TABLE=	(F2++(Y..Y)), PROFILE
$$ plain form
5808 48 121 164 78 85 131 105 237 202 93 81 154 95 157 215 73 145 124 99 151 193 185 163 175 76 99 75 127 141 113 92 146 141 92 202 149
5397 149 156 190 156 66 61 55 97 65 202 170 72 164 147 58 152 139 37 109 102 179 272 222 136 136 71 168 206 251 185 117 91 43 69 183 11
4986 11 232 395 421 302 136 141 56 212 182 177 138 80 72 96 152 62 233 175 84 20 148 73 100 20 84 141 170 183 137 252 253 91 37
4599 37 57 66 74 71 115 149 240 223 155 134 41 37 33 116 185 270 174 150 192 202 199 45 156 191 85 64 159 114 160 108 174 100 192 145 89 103 62
4164 62 87 249 89 103 26 75 31 145 111 333 252 86 93 140 132 270 269 133 168 59 116 98 198 197 250 124 103 67 96 81 206 149
3789 149 28 194 197 77 68 190 156 26 183 263 79 146 176 50 110 66 234 159 151 106 146 52 116 249 236 88 119 118 71 73 136 273
3413 273 99 186 238 77 227 113 56 63 186 74 56 68 115 254 199 40 138 74 115 122 80 92 48 42 82 38 209 260 103 84 128
3049 128 198 187 149 94 63 69 182 143 29 45 72 151 158 144 189 16 234 137 127 144 58 76 116 149 249 12 224 117 73 144 193 192
$$ packed form
5808D8P3M3q6PM6k6J32l5j09j2P3n9O2N8j42P2k1k5N2M2qk2J2r9K3k4N2J4k8k1N4nm9J10n3
5397A49PL4l4r0noM2l2J37l2r8R2j7q9R4j3j02P2pP7R3n0q6%o5R7L8M5o6o8k6m8K6J14j72
4986A1K21J63K6j19j66Nq5J56l0nl9n8qK4N6r0J71n8r1o4J28p5K7q0O4N7K9J3m6J15Jj62n4
4599C7K0RQlM4L4R1j7o8k1r3mmQ3O9Q5r6k4M2J0lj54J11L5j06k1R5m5M6n2O6p4R2m7n6J4m1
4164F2K5J62j60J4p7M9m4J14l4K22q1j66PM7qJ38jj36L5j09N7j8J00jN3j26k1l6K9j5J25n7
3789A49j21J66Lj20rJ22l4j30J57Q0j84O7L0j26O0m4J68p5qm5M0r4O4J33j3j48L1jm7KO3J37
3413B73j74Q7N2j61J50j14n7PJ23j12j8J2M7J39n5j59R8o4M1Pm2J2m4oM0m4J71N1j57j9M4
3049A28P0j1l8n5l1OJ13l9j14J6K7P9Pj4M5j73K18r7j0J7q6J8M0L3J00k37K12j07m4P1M9j
$$ plain form
2674 192 110 43 47 32 93 112 155 164 131 43 140 153 59 142 66 70 98 80 157 59 88 166 122 35 155 199 147 147 125 117 144 51 85 140 182 112 194
2239 194 60 51 239 198 154 124 130 34 136 62 157 146 74 89 55 189 147 155 11 129 139 228 133 94 10 190 244 298 303 206 118 221 275
1852 275 263 309 207 203 163 139 191 64 191 216 194 61 157 67 57 34 125 241 192 69 236 130 136 135 56 164 141 122 177 43 108
1488 108 117 32 196 120 130 207 303 237 49 123 169 55 88 166 290 103 150 136 49 29 65 85 157 172 95 65 205 59 109 76 73 45
1113 45 85 134 47 138 164 83 276 183 65 112 36 125 74 160 178 159 51 60 75 115 188 274 112 69 84 23 197 101 144 293 174 327
737 327 290 185 65 213 71 171 98 185 226 125 198 225 84 101 135 48 187 249 138 96 134 106 110 97 161 311 212 190 137 73 62
373 62 97 231 37 191 70 100 140 70 129 66 189 131 97 146 283 356 227 172 101 55 221 224 212 228 180 346 232 74 184 209
21 209 96 162 161 135 219 66 173 26 190 61 209 306 200 100 104 47 82 81
$$ packed form
2674A92q2o7Mj5O1J9M3Rl3q8R7J3r4Q3p6MK8j8P7r8K9P8m4q7J20M4n2%k2qK7r3L4N5M2p0Q2
2239A94j34rJ88m1m4l0Or6J02p4R5j1p2J5l4J34m2Qj44J18J0Q9r5l9q4J80N4N4Nr7q8J03N4
1852B75j2M6j02mm0k4N2j27J27K5k2j33R6r0j0k3R1J16m9j23J67j06Ojp9J08k3j9N5j34O5
1488A08Rq5J64p6J0P7R6o6j88P4M6j14L3P8J24j87M7j4q7k0L6K0P2J5p7l0J40j46N0l3lk8
1113D5M0M9q7R1K6q1J93r3j18M7p6Q9n1Q6J8j9j08RJ5M0P3Q6j62m3J5o1J74r6M3J49j19J53
737C27l7j05j20J48j42J00p3Q7M1j01P3K7j41J7L4q7J39O2j11m2L8k8Mj3O4J50r9k2n3o4j1
373F2L5J34j94J54j21L0M0p0N9o3J23n8l4M9J37P3j29n5p1m6J66Lj2J6m8J66j14j58J10K5
21B09j13O6jk6Q4j53J07j47J64j29J48R7j06j00Mn7L5j
-190H1
##PAGE=	F1=-10927.7
##FIRST=	25169.313707327481097,	5807.6787752999953227,	0
##DATA TABLE=	(F2++(Y..Y)), PROFILE
$$ plain form
5808 42 83 108 43 35 63 111 266 228 121 111 129 84 142 192 26 155 120 67 156 204 138 173 227 134 114 154 173 106 77 38 105 124 60 209
5409 209 168 137 180 172 48 37 21 98 38 182 140 76 205 152 48 138 149 29 97 114 164 336 272 102 165 145 159 200 233 124 117 113
5033 113 76 47 174 32 174 378 408 299 118 177 39 267 170 176 145 71 121 106 179 85 185 103 38 28 167 100 78 23 92 184
4681 184 157 229 183 263 249 105 57 45 118 121 39 66 138 238 263 182 161 10 100 79 119 167 245 133 93 161 174 202 77 162 156 68 75 156
4282 156 76 127 136 161 57 135 113 81 109 92 58 240 112 125 36 75 67 167 114 331 282 121 57 83 101 256 295 213 182 36 134 102
3906 102 178 140 232 161 97 57 91 46 202 138 34 214 197 131 64 187 161 48 196 263 56 121 154 72 163 75 242 139 98 108
3554 108 105 30 90 216 177 71 129 129 61 69 123 253 120 197 223 40 165 57 77 88 176 59 66 23 37 242 178 76 129 112 135 133
3178 133 107 44 74 114 146 33 250 278 121 64 165 274 185 127 95 87 83 172 164 49 85 58 197 122 113 182 41 270 179 118 138 92
$$ packed form
5808D2M1K5o5qK8M8J55l8j07j0J8m5N8N0j66J29l5n3Q9M8o6L5N4r3k0M0J9o7k9l9O7J9o4J49
5409B09m1l1M3qj24j1j6P7o0J44m2o4J29n3j04R0J1j20O8J7N0J72o4j70O3k0J4M1L3j09pm
5033A13l7k9J27j42J42K04L0j09j81N9j38K28r7Ol1p4N0j5P3r4J00q2o5j0J39o7k2n5O9R2
4681A84k7P2m6Q0j4j44m8j2P3Lq2K7P2J00K5q1k1j51R0k1M0M8P8j12m0O8J3K8j25Q5oq8PQ1
4282A56q0N1RK5j04P8k2l2K8j7l4J82j28J3q9L9qJ00n3K17m9j61o4K6J8J55L9q2l1j46R8l2
3906A02P6l8R2p1o4m0L4m5J56o4j04J80j7o6o7J23k6j13J48O7k07O5L3q2R1q8J67j03m1J0
3554A08lp5O0J26l9j06N8%o8QN4J30j33P7K6j83J25j08K0J1Q8j17Pm3J4K05o4j02N3j7K3k
3178A33k6o3L0M0L2j13K17K8j57n7J01J09q9n8l2qmQ9qj15L6k7J39p5rO9j41K29r1o1K0m6
$$ plain form
2803 92 97 114 115 206 13 224 107 111 119 176 219 145 4 80 60 114 145 174 147 94 75 129 106 21 193 70 30 19 109 160 36 123 124 113
2404 113 38 117 204 104 191 55 134 124 48 63 152 191 105 163 45 59 199 198 175 154 158 60 154 60 126 124 105 84 113 249 121 149 46
2016 46 98 117 228 84 97 26 231 239 282 270 245 137 205 221 236 268 137 213 146 133 193 88 243 247 189 97 186 88 52 92 187 266 199
1629 199 85 297 162 122 100 58 175 133 121 194 53 80 103 57 196 142 131 222 312 204 50 21 154 116 120 145 231 76 117 71
1277 71 55 118 31 82 214 227 55 54 197 53 40 94 75 85 81 192 99 74 114 125 259 173 65 118 35 145 85 175 202 171 49 2
901 2 72 102 162 243 113 94 62 44 171 146 186 302 171 327 244 121 51 139 87 151 88 194 232 114 181 213 104 108 118 30 222 246
526 246 126 62 139 98 179 104 191 319 192 149 146 84 64 124 217 41 182 129 128 147 100 114 103 164 121 74 135 289 364 238 166 70 41
138 41 190 238 200 211 135 270 170 95 175 226 68 168 178 148 240 52 168 17 170 43 187 274 193 93 137 75 126 109
$$ packed form
2803I2NJ7JR1j93K11j17MQN7M3p4j41P6k0N4L1K9k7n3j9N4k3q5J72j23m0j1R0N1j24Q7Jj1
2404A13p5P9Q7j00Q7j36P9j0p6J5Q9L9q6N8j18J4J40jk3k1Mr8R4r4O6kj9k1K9J36j28K8j03
2016D6N2J9J11j44J3p1K05QM3j2k5j08O8J6J5L2j31P6o7j3O0j05J55Mn8r2Q9r8l6M0R5P9o7
1629A99j14K12j35m0k2m2J17m2j2P3j41K7K3m6J39n4j1R1R0j08j54k9J33l8MK5Q6j55M1m6
1277G1j6O3q7N1J32J3j72jJ43j44j3N4j9J0mJ11r3k5M0J1J34q6j08N3q3J10o0R0K7l1j22m7
901BP0L0O0Q1j30j9l2j8J27k5M0J16j31J56q3j23p0Q8n2O4o3J06L8j18O7L2j09MJ0q8J92K4
526B46j20o4P7m1Q1p5Q7J28j27m3lo2k0O0R3j76J41n3jJ9m7J4j1O1m3m7O1J54P5j26p2r6k9
138D1J49M8l8J1p6J35j00p5Q0N1j58J00J0l0R2j88J16j51J53j27J44Q7q1j00M4o2N1j7
-190A09
##PAGE=	F1=-11030
##FIRST=	25169.313707327481097,	5807.6787752999953227,	0
##DATA TABLE=	(F2++(Y..Y)), PROFILE
$$ plain form
5808 46 49 88 31 44 15 127 277 244 152 155 130 97 117 138 29 174 120 47 177 220 114 184 256 177 116 213 238 71 64 31 68 102 24
5420 24 189 191 127 152 164 86 132 55 104 10 160 86 56 232 166 78 131 143 32 79 106 148 376 298 49 182 204 159 195 211 75 133
5045 133 131 85 30 164 79 107 349 378 263 97 189 37 297 134 168 139 93 188 93 170 103 127 27 74 53 182 143 68 59 102 210
4681 210 152 254 214 242 232 114 88 44 157 146 61 3 112 223 276 187 172 13 155 134 95 129 199 99 34 136 131 195 125 174 121
4317 121 55 90 141 23 71 150 126 74 74 92 72 118 126 54 220 138 137 52 86 100 176 131 309 303 167 10 31 79 234 289 269 210 15
3930 15 174 108 154 85 217 184 64 43 111 12 190 135 38 216 195 178 63 185 173 60 209 250 36 89 113 90 197 95 240
3589 240 130 41 101 48 107 62 172 124 65 148 128 45 64 102 228 141 190 199 21 105 27 110 111 149 46 92 39 29 207 152 116 125 149
3202 149 151 127 133 37 137 196 197 32 262 275 128 42 193 328 171 94 92 101 93 151 159 73 120 68 219 116 73 148 90 278 208 106 119
$$ packed form
5808D6LL9n7J3k9J12J50l3r2Lk5l3K0K1j09J45n4p3J30M3j06P0P2p9o1R7K5j67pl3L7L4p8
5420B4J65Ko4K5J2p8M6p7M9r4J50p4l0J76o6q8N3J2j11M7K7M2K28p8k49J33K2m5L6J6j36N8
5045A33km6n5J34q5K8K42K9j15j66R2j52K60j63L4k9m6R5r5P7o7K4j00M7k1J29l9p5rM3J08
4681B10n8J02m0K8j0j18k6m4J13j1q5n8J09J11N3q9j5j59J42k1l9L4P0j00o5J02nO4p0M9n3
4317A21o6L5N1j18M8P9k4n2%J8k0M6Qp2J66q2jq5L4J4P6m5J78oj36j57K1M8J55N5k0n9j95
3930A5J59o6M6o9J32l3j20k1O8r9J78n5r7J78k1j7j15J22j2j13J49M1k14N3K4k3J07j02J45
3589B40j10q9O0n3N9m5J10m8n9Q3k0q3J9L8J26q7M9Rj78Q4p8Q3JL8j03M6n3j0J78n5l6RK4
3202A49Kk4Or6J00N9Jj65K30J3j47q6J51J35j57p7kRqN8Qq6M7n2J51j03m3P5n8J88p0j02J3
$$ plain form
2815 119 107 117 117 85 151 22 198 92 151 81 158 252 170 44 110 84 146 171 179 110 69 113 136 51 25 225 91 92 76 125 145 42 160
2427 160 80 98 61 69 212 60 252 30 155 113 41 32 155 199 78 106 39 60 143 166 190 177 171 81 161 63 93 101 134 75 138 297 95
2040 95 118 101 107 86 208 25 112 42 275 233 248 241 263 150 180 192 211 212 65 222 105 126 170 120 275 246 177 129 217 149 72 136 227
1653 227 270 189 88 341 205 110 76 73 179 129 142 193 76 47 109 91 206 158 118 261 316 187 82 105 160 193 141 126 157 54
1300 54 79 38 92 202 39 95 252 270 25 74 169 51 57 117 66 120 90 235 139 39 67 165 221 152 72 131 33 165 88 184 222 166
925 166 50 45 72 95 142 191 118 130 41 74 146 186 215 292 163 305 189 67 40 68 105 126 101 163 214 90 155 179 132 130 98 42 243
538 243 238 114 19 133 97 232 132 216 298 146 103 155 110 95 136 194 46 164 176 164 147 142 125 116 117 121 65 141 293 352 226 150 78
150 78 107 147 234 185 209 93 186 100 101 188 246 63 168 176 156 266 35 167 6 136 43 150 241 189 71 155 108 164 138
$$ packed form
2815A19j2J0%l2O6j29J76j06N9p0P7R4q2j26O6k6O2K5Qo9m1M4K3q5k6K00j34Jj6M9K0j03J18
2427A60q0J8l7QJ43j52J92k22J25m2p2rJ23M4j21K8o7K1Q3K3K4j3or0Q0r8L0QL3n9O3J59k02
2040I5K3j7Ok1J22j83Q7p0K33m2J5pK2j13L0J2J9Jj47J57j17K1M4n0J55k9o9m8Q8o8p7O4R1
1653B27M3q1j01K53j36r5l4lJ06n0J3N1j17k9O2j8J15m8m0J43N5j29j05K3N5L3n2j5L1j03
1300E4K5m1N4J10j63N6J57J8k45M9R5j18OO0n1N4l0J45r6j00K8R8N6o9q0N9r8J32p7R6L8n6
925A66j16nK7K3M7M9p3J2q9L3P2M0K9P7j29J42j16j22k7K8L7K1k5O2N1j24O5K4m7kl2n6K01
538B43nj24r5J14l6J35j00Q4Q2j52m3N2m5j5M1N8j48J18J2j2j7nj7rJMn6P6J52N9j26p6p2
150G8K9M0Q7m9K4j16R3q6JQ7N8j83J05Qk0J10k31J32j61J30r3J07R1n2j18Q4m7N6k6
-190A38
##PAGE=	F1=-11132.2
##FIRST=	25169.313707327481097,	5807.6787752999953227,	0
##DATA TABLE=	(F2++(Y..Y)), PROFILE
$$ plain form
5808 56 41 133 57 107 76 150 266 247 182 192 145 116 81 65 59 181 126 43 200 232 117 193 256 197 113 244 295 76 71 104 50 78 75 144
5409 144 211 125 120 141 137 206 111 129 15 133 12 12 237 189 111 124 122 43 57 79 133 377 294 35 183 234 157 182 192 91 148 142 68
5021 68 23 150 118 40 315 344 208 79 180 66 290 96 157 127 137 254 61 129 105 74 50 120 57 184 178 78 90 111 222
4681 222 157 249 225 192 199 123 119 60 178 148 112 60 104 204 267 178 159 28 183 179 50 82 143 79 24 132 84 189 173 194 93 51
4305 51 105 118 39 11 150 77 131 16 88 66 130 156 79 206 160 139 65 89 113 167 158 274 309 217 38 34 73 208 248 284 227 30 210
3918 210 116 130 59 218 186 13 47 132 24 177 142 43 193 188 211 73 182 176 61 216 228 45 58 69 100 202 110 229 131 49
3566 49 88 12 161 38 128 97 79 167 119 60 51 77 198 141 155 168 45 73 79 141 137 116 44 122 73 78 158 123 156 132 182 158 107 151 72
3155 72 190 279 236 34 240 250 116 46 209 353 157 60 86 104 89 124 134 91 143 96 211 138 57 102 130 260 224 94 88 97 137
$$ packed form
5808E6j5R2p6N0l1P4J16j9o5J0m7k9l5j6oJ22n5q3J57L2j15P6O3n9q4J31N1k19nL3n4K8lO9
5409A44O7q6nK1mO9r5J8j14J18j21%K25m8p8J3kp9J4K2N4K44q3k59J48N1p7K5J0j01N7op4
5021F8m5J27l2p8K75K9j36j29J01j14K24j94O1l0J0J17j93O8k4l1k4P0o3J27oj00J2K1J11
4681B22o5R2k4l3Pp6mn9J18l0l6n2M4J00O3q9j9j31J55mj29L2O1o4n5J08m8J05j6K1j01m2
4305E1N4J3p9k8J39p3N4j15P2k2O4K6p7J27m6k1p4K4K4N4rJ16L5r2j79mL9J35M0L6n7j97J80
3918B10r4J4p1J59l2j73L4Q5j08J53l5r9J50nK3j38J09oj15J55J2j83J3J1L1J02r2J19r8q2
3566D9L9p6J49j23R0l1j8Q8m8n9rK6J21n7J4J3j23K8OO2mk1p2P8m9NQ0l5L3k4N0k4n1M4p9
3155G2J18Q9m3k02K06J0j34p0J63J44j96r7K6J8j5L5J0m3N2m7J15p3q1M5K8J30l6j30oRM0
$$ plain form
2791 137 129 82 91 39 150 112 184 60 148 286 178 69 129 93 165 185 166 54 90 138 162 39 59 229 95 156 156 111 112 42 185 36
2416 36 104 92 53 206 41 301 67 176 108 33 13 146 202 46 36 51 63 85 116 188 181 170 97 154 71 68 87 150 57 129 326 77
2040 77 66 154 137 64 177 33 140 42 310 234 199 212 271 155 138 188 189 152 34 226 40 122 144 172 277 216 166 153 240 219 111
1676 111 164 240 251 159 80 359 251 99 61 89 176 123 164 177 98 23 114 120 218 154 121 313 316 184 125 190 172 248 149 114 81 46 39 79
1277 79 133 258 59 132 268 295 63 106 126 63 143 149 58 140 108 247 160 89 58 201 171 137 78 144 24 180 85 179 230 146 58 67
901 67 75 98 131 130 139 155 24 106 130 209 226 269 144 269 140 37 29 16 106 105 127 105 176 64 119 136 172 162 77 44 246 228 110 23
502 23 120 96 255 157 224 258 93 87 165 147 132 131 168 56 138 197 196 139 179 139 110 92 142 76 150 292 322 189 129 117 167 97 210 165
103 165 221 73 105 67 92 211 258 75 166 156 151 296 72 165 10 97 52 105 204 183 40 152 139 191 162
$$ packed form
2791A37qm7Rn2J11l8P2j24Q8J38j08j09O0l6P2K0j9j12L6M8K4j23K0J70j34O1%m5Jp0J43j49
2416C6O8j2l9J53j65K60k34J09o8p5k0J33N6j56j0J5J2K2L1P2pj1p3N7q3lJ9O3r3P2J97k49
2040G7j1Q8j7p3J13j44J07r8K68p6l5J3N9j16j7N0Jl7j18J92j86Q2K2K8J05o1n0j3Q7k1j08
1676A11N3P6J1r2p9K79j08j52l8K8Q7n3M1J3p9p5R1OR8o4l3J92Lj32n9O5j8P6r9l5l3l5pM0
1277G9N4J25j99P3J36K7k32M3K0o3Q0Or1Q2l2J39q7p1l1J43l0l4n9O6j20J56r5R4N1q4q8R
901F7QK3L3jRJ6j31Q2K4P9J7M3j25J25j29j03qj3R0jK2k2P1j12N5J7L6j0q5l3K02j8j18q7
502B3R7k4J59r8O7L4j65oP8j8j5jL7j12Q2N9jn7M0m0k9j8N0o6P4J42L0j33o0j2N0p0J13m5
103A65N6j48L2l8K5J19M7j83R1j0nJ45k24R3j55Q7m5N3R9k1j43J12j3N2k9
-190A62
##PAGE=	F1=-11234.5
##FIRST=	25169.313707327481097,	5807.6787752999953227,	0
##DATA TABLE=	(F2++(Y..Y)), PROFILE
$$ plain form
5808 73 49 189 80 167 126 170 233 232 210 212 144 117 35 30 75 168 134 48 212 232 139 203 227 191 112 248 325 118 82 174 38 62 145 79
5409 79 217 129 111 119 184 251 169 163 31 102 91 48 217 206 126 108 90 57 48 60 123 337 264 95 167 234 142 158 179 140 158 148 35 45
5010 45 132 139 17 287 315 147 78 153 99 249 101 144 117 180 304 27 66 91 62 96 149 52 169 194 104 111 113 226 170 214 215 123 154
4622 154 136 142 79 180 134 160 116 140 194 242 161 129 32 181 212 42 48 88 65 65 148 46 192 212 220 82 54 116 95 90 69 143 42 187
4223 187 51 102 72 145 176 112 209 172 129 73 74 104 142 185 236 294 258 81 61 82 180 180 257 217 59 228 123 111 80 233 165 61
3848 61 75 151 53 169 156 65 152 175 225 93 176 166 54 213 199 73 60 83 111 175 114 208 134 106 77 65 180 28 98 98 98 179 108
3460 108 97 33 59 159 117 94 132 62 84 125 155 154 102 53 155 97 108 112 101 191 151 210 162 82 160 98 218 352 267 39 185 211 91
3073 91 68 206 342 151 36 85 98 70 94 106 99 152 123 175 160 72 55 153 222 229 88 52 62 155 144 103 38 61 89 162 203 93 149
$$ packed form
5808G3k4J40j09Q7m1M4O3jk2Ko8k7q2nM5R3l4q6J64K0r3O4K4l6p9J36P7k07l6R2j36K4Q3o6
5409G9J38q8j8QO5O7q2oj32P1j1m3J69j1q0j8j8l3rJ2O3K14p3j69P2O7r2J6K1l9J8j0j13J0
5010D5Q7Pj22K70K8j68o9P5n4J50j48M3k7O3J24k77L9K5k9L4N3r7J17K5r0PKJ13n6M4Jr2L1
4622A54j8Oo3J01m6K6m4K4N4M8q1l2r7J49L1j70OM0k3%Q3j02J46K0Qj38k8O2k1nk1P4j01J45
4223A87j36N1l0P3L1o4R7l7m3n6JL0L8M3N1N8l6j77k0K1R8%P7m0j58J69j05j2l1J53o8j04
3848F1J4P6r8J16j3r1Q7K3N0j32Q3j0j12J59j4j26j3K3K8O4o1R4p4k8k9j2J15j52P0%%Q1p1
3460A08j1o4K6J00m2k3L8p0K2M1L0jn2m9J02n8J1Mj1R0m0N9m8q0P8o2J20J34q5k28J46K6j20
3073I1k3J38J36j91j15M9J3k8K4J2pN3k9N2j5q8j7R8O9Pj41l6J0R3j1m1o5K3K8P3M1j10N6
$$ plain form
2685 149 311 166 83 133 85 160 185 140 22 138 138 194 90 86 207 80 200 214 72 68 36 194 28 138 122 97 179 48 324
2345 324 82 192 100 24 58 129 194 32 32 81 76 53 81 164 161 159 104 136 88 57 91 151 47 102 330 69 6 194 164 65 146 81 171
1958 171 35 325 242 143 179 278 154 77 207 170 96 62 224 52 137 152 233 245 168 161 164 243 276 149 171 222 212 110 67 348 287
1594 287 82 42 100 166 107 171 155 114 21 100 145 224 130 152 358 310 172 167 237 179 272 147 114 26 53 22 114 161 271 68 184 262
1218 262 295 113 137 81 93 222 180 63 138 121 220 157 140 90 230 119 140 82 152 39 191 81 155 223 115 68 57 75 108 125
866 125 81 178 163 11 135 140 208 219 248 114 226 117 38 17 42 82 94 150 49 132 51 78 107 219 194 72 49 229 217 115 59
502 59 108 90 248 163 215 214 58 100 175 186 160 111 144 78 114 192 217 124 199 139 112 151 176 97 153 281 281 134 109 144 205 59 177 139
103 139 231 80 34 99 77 233 254 94 164 129 135 322 127 155 37 61 56 65 160 172 21 127 164 202 179
$$ packed form
2685A49J62j45q3N0m8P5K5m5j18J16%N6j04mJ21j27J20J4j42ml2J58j66J10j6k5Q2j31K76
2345C24k42J10r2p6L4P1O5j62%M9nk3K8Q3lkn5L2m8l1L4O0j04N5K28k61o3J88l0r9Q1o5R0
1958A71j36K90q3r9L6R9j24p7J30l7p4l4J62j72Q5J5Q1J2p7pLP9L3j27K2N1j0j02m3K81o1
1594B87k05m0N8O6n9O4j6m1r3P9M5P9r4K2K06m8j38nP0n8R3j25l3q8K7l1R2M7J10k03J16P8
1218B62L3j82K4n6J2J29m2j17P5j7R9o3j7n0J40j11K1n8P0j13J52j10P4O8j08m7j1J8L3J7
866A25m4R7j5j52J24NO8J1K9j34J12j09p9k1K5M0J2N6j01Q3q1K7K9J12k5j22k3J80j2j02n6
502E9M9j8J58q5N2jj56M2P5J1k6m9L3o6L6P8K5r3P5o0k7L9K5p9N6J28%j47k5L5O1j46J18l8
103A39R2j51m6O5k2J56K1j60P0l5OJ87j95K8j18K4nRR5J2j51J06L7L8k3
-190A79
##PAGE=	F1=-11336.7
##FIRST=	25169.313707327481097,	5807.6787752999953227,	0
##DATA TABLE=	(F2++(Y..Y)), PROFILE
$$ plain form
5808 101 46 227 90 215 158 180 187 196 230 214 116 101 18 93 79 140 141 57 203 213 170 213 179 165 109 229 320 151 91 230 19 85
5432 85 205 14 203 135 132 120 219 266 220 187 43 91 188 113 173 198 121 79 53 67 69 82 118 265 227 144 139 207 115 130 170 179 163 148 54
5021 54 84 104 133 63 272 295 96 89 115 120 182 145 127 117 209 329 38 17 63 94 113 157 56 141 188 130 121 105 224 186 153 184 62
4634 62 103 157 157 90 168 118 195 153 189 194 207 140 93 27 155 232 105 57 41 53 95 162 32 203 234 245 92 58 115 74 125 122 136 56
4235 56 225 106 126 94 160 181 140 221 166 111 76 43 82 116 211 204 257 278 110 76 106 153 99 195 179 87 222 129 94 110 253 128 120
3848 120 110 172 72 173 170 102 114 158 218 114 164 146 45 199 165 96 102 148 131 124 106 180 131 153 72 101 167 40 92 103 109 182 102 124
3448 124 20 58 113 78 30 102 63 108 151 142 151 117 78 189 109 122 93 92 216 171 233 167 59 162 112 214 402 290 51 110 171 74
3073 74 81 184 298 143 31 88 85 41 68 106 96 149 141 120 170 72 15 155 178 222 87 31 38 171 149 122 20 87 28 209 207 141 159
$$ packed form
5808A01n5J81j37J25n7K2PRL4j6r8j5q3P5j4O1Jq4J46J0m3M3l4j4n6J20R1j69o0J39k11O6
5432H5J20j91J89o8lj2R9M7m6l3j44M8R7p5O0K5p7m2k6J4KJ3L6J47l8q3nO8r2J5M0Rj6j5r4
5021E4L0K0K9p0K09K3j99pK6NO2l7j8j0R2J20k91k1M6L1J9M4j01Q5M7n8rj6J19l8l3L1j22
4634F2M1N4%o7P8n0P7m2L6NJ3o7m7o6J28P7j27m8j6J2M2O7j30J71L1J1j53l4N7m1N1lJ4q0
4235E6J69j19K0l2O6K1m1Q1n5n5l5l3L9L4R5pN3K1j68l4L0M7n4R6j6r2J35r3l5J6J43j25q
3848A20j0O2j00J01lo8J2M4O0j04N0j8j01J54l4o9OM6j7pj8P4m9K2q1K9O6j27N2J1OP3q0K2
3448A24j04L8N5l5m8P2l9M5M3rRl4l9J11q0J3k9jJ24m5O2o6j08J03n0J02J88j12k39N9O1r7
3073G4PJ03J14j55j12N7lm4K7L8j0N3qk1N0r8n7J40K3M4j35n6PJ33k2k7j02O7n9J81ko6J8
$$ plain form
2685 159 320 146 94 122 62 129 170 112 84 185 109 222 140 104 168 54 219 245 35 23 44 189 64 179 143 143 139 49 323 66
2333 66 199 86 14 105 119 174 36 84 122 95 61 87 120 117 143 99 110 115 60 108 138 72 101 314 68 70 215 181 79 120 114 190 48
1946 48 317 252 87 140 283 156 12 247 151 54 79 209 139 178 196 285 187 114 162 167 220 306 176 160 179 159 49 53 315 304 54
1582 54 10 107 146 80 171 133 131 26 68 173 217 96 185 382 295 139 203 241 178 261 139 125 51 71 47 125 170 240 64 230 244 268
1207 268 150 162 43 137 277 195 76 116 123 161 129 165 120 249 78 153 83 148 83 200 83 120 202 80 73 23 65 117 121 72 227
843 227 161 3 158 183 182 200 251 90 180 124 58 14 72 59 97 161 54 99 62 34 115 257 210 83 85 196 204 127 90 110 78 216 150
455 150 191 180 54 108 180 216 173 84 125 113 114 170 226 105 196 123 145 235 208 118 148 259 242 76 94 146 215 64 146 108 228 98
80 98 44 135 73 247 227 112 158 119 122 332 171 137 73 35 55 46 112 154 43 87 180 195 186
$$ packed form
2685A59J61j74n2K8o0O7M1n8k8J01p6J13q2l6O4j14J65K6k10j2K1J45j25J15l6%mr0K74k57
2333F6J33j13p2R1J4N5j38M8L8k7l4K6L3lK6m4J1Nn5M8L0o6K9K13k46KJ45l4j02M1oP6j42
1946D8K69o5j65N3J43j27j44K35r6r7K5J30p0L9J8Q9r8p3M8NN3Q6j30j6J9k0j10MK62j1k50
1582E4m4R7L9o6R1l8kj05M2J05M4j21Q9J97q7j56O4L8o3Q3j22j4p4K0k4P8M5P0j76J66J4K4
1207B68j18J2j19R4J40q2j19M0PL8l2L6m5J29j71P5p0O5o5J17j17L7Q2j22pn0M2N2Mm9J55
843B27o6j58J55K5jJ8N1j61R0n6o6m4N8j3L8O4j07M5l7k8Q1J42m7j27KJ11Qp7l7K0l2J38o6
455A50M1j1j26N4P2L6m3q9M1j2JN6N6j21R1p3K2R0k7r0L0J11j7j66J8N2O9j51Q2l8J20j30
80I8n4R1o2J74k0j15M6l9LK10j61l4o4l8K0rO6M2j11M4R3J5r
-190A86
##PAGE=	F1=-11439
##FIRST=	25169.313707327481097,	5807.6787752999953227,	0
##DATA TABLE=	(F2++(Y..Y)), PROFILE
$$ plain form
5808 136 31 238 88 246 172 176 141 144 233 200 69 85 64 142 79 114 144 72 172 172 200 226 128 131 96 194 278 160 97 264 40 138
5432 138 241 73 170 141 157 144 239 257 254 189 58 120 269 170 115 160 100 41 40 67 99 120 119 179 200 167 105 159 83 110 161 193 166 145
5033 145 109 125 64 102 94 278 286 66 100 75 124 102 190 101 127 225 331 64 77 40 134 101 150 78 115 160 144 121 86 215 197 80 136
4646 136 82 55 181 172 88 150 111 218 165 222 190 167 114 67 16 119 241 167 76 9 47 112 158 31 213 232 261 119 59 96 60 142
4270 142 152 135 82 234 150 150 124 167 167 159 226 142 88 79 41 70 108 234 186 202 269 119 83 136 127 25 117 122 107 195 129 77 130 268 88
3859 88 157 142 195 77 187 178 140 115 140 193 127 149 132 42 173 131 107 149 211 162 60 96 147 119 182 75 116 140 70 112 101 111 178
3472 178 102 126 19 69 82 31 79 94 51 126 157 109 121 145 118 219 107 129 112 92 222 184 249 177 43 161 119 180 417 301 68
3108 68 34 143 83 78 143 226 123 53 99 77 7 53 138 91 139 149 59 172 44 45 145 141 202 93 48 92 180 137 126 48 118 40 232
$$ packed form
5808A36j05K07j50J58p4Ml5LQ9l3j31J6k1P8o3L5L0p2J00%K8K6r8Ll5R8Q4j18o3J67k24R8
5432A38J03j68R7k9J6j3R5J8lo5j31O2J49r9n5M5o0n9jK7L2K1jO0K1l3o2N4p6K7N1L2k7k1
5033A45l6J6o1L8qJ84Qk20L4k5M9k2Q8q9K6R8J06k67J3l7R4l3M9p2L7M5j6k3l5J29j8j17N6
4646A36n4k7J26rq4O2l9J07n3N7l2k3n3m7n1J03J22p4r1o7L8O5M6j27J82J9K9j42o0L7l6Q2
4270A42J0j7n3J52q4%k6M3%qO7q4n4rl8K9L8J26m8J6O7j50l6N3rj02R2Nj5Q8o6n2N3J38j80
3859H8O9j5N3j18J10rl8k5K5N3o6K2j7r0J31m2k4M2O2m9j02L6N1k8O3j07M1K4p0M2j1J0O7
3472A78p6K4j07N0J3n1M8J5m3P5L1m8J2K4k7J01j12K2j7k0J30l8O5p2j34J18m2O1K37j16k33
3108F8l4J09o0nO5Q3j03p0M6k2p0M6Q5m7M8J0r0J13j28JJ00mO1j09m5M4Q8m3j1p8P0p8J92
$$ plain form
2721 232 194 178 169 308 136 105 98 40 82 147 94 141 218 58 240 183 115 126 39 213 246 59 23 65 175 94 204 150 174 118 48 308
2345 308 31 202 71 8 144 133 142 40 114 165 111 65 94 74 68 123 80 82 143 70 128 122 116 154 284 68 129 211 193 88 102 128 189
1958 189 71 288 252 36 97 280 167 99 296 131 45 75 180 211 227 244 317 127 67 172 169 172 304 184 137 124 112 35 35 274
1606 274 300 17 33 115 115 70 189 113 154 38 46 205 197 79 196 377 267 93 230 206 174 217 130 142 79 106 68 115 164 173 50
1242 50 252 222 216 167 178 12 188 300 189 85 84 113 103 83 156 137 252 56 157 84 130 131 212 93 82 171 60 75 41 44 120 118
866 118 93 275 162 15 182 251 139 176 285 109 129 142 92 43 94 106 109 156 79 87 79 11 146 273 204 85 141 151 188 134 124 127
491 127 65 172 129 161 162 60 99 177 227 171 68 111 154 152 144 228 88 172 94 192 301 223 130 141 228 211 49 90 117 198 89 129 72
103 72 208 118 107 154 91 247 180 122 144 140 127 324 193 115 113 35 57 51 75 131 61 44 184 170 183
$$ packed form
2721B32l8j6rJ39j72l1pn8M2O5n3M7P7j60J82n7o8J1q7J74L3j87l6M2J10q1J10n4K4n6p0K60
2345C08k77J71j31o3J36j1Rj02P4N1n4m6K9k0oN5m3KO1p3N8ooL8J30k16O1Q2j8j05J4K6O1
1958A89j18K17l6k16O1J83j13o8J97j65q6L0J05L1J6J7P3j90o0J05lLJ32j20m7j3j2p7%K39
1606B74K6k83J6Q2%m5J19p6M1j16QJ59qj18J17J81j10j74J37k4l2M3q7J2o3K7l8M7M9Rj23
1242E0K02l0om9J1j66J76J12j11j04jK9j0k0P3j9J15j96J01p3M6JQ1j19j1Q9j11J5l4LP6k
866A18k5J82j13j47J67O9j12L7J09j76K0J3n0m9N1J2LM7p7Qqo8J35J27o9j19N6J0L7n4j0L
491A27o2J07m3L2Jj02L9P8N0n6j03M3M3kqQ4j40Q4p8R8J09p8r3J1Q7j7j62M1K7Q1j09M0n7
103G2J36r0j1M7o3J56o7n8K2mj3J97j31p8kp8K2oK4N6p0j7J40j4J3
-190A83
##PAGE=	F1=-11541.3
##FIRST=	25169.313707327481097,	5807.6787752999953227,	0
##DATA TABLE=	(F2++(Y..Y)), PROFILE
$$ plain form
5808 168 36 220 79 259 172 157 111 84 211 171 57 99 100 164 90 101 143 94 126 110 220 243 85 110 68 147 206 143 99 275 90
5444 90 194 249 133 126 144 168 174 243 234 265 168 74 160 320 212 68 96 79 10 75 56 120 154 124 112 188 160 71 94 60 100 153 178 163
5045 163 139 157 159 20 52 120 306 282 60 108 51 112 31 220 71 142 230 313 76 127 53 172 74 137 104 119 120 142 112 58 196 195
4669 195 48 81 136 20 196 188 73 137 117 227 157 226 170 123 81 61 7 88 236 208 79 25 47 120 129 47 212 204 260 147 63 58
4294 58 52 139 161 143 95 209 178 163 151 165 135 167 222 105 67 91 92 85 120 255 182 140 232 109 86 157 101 35 44 68 113 157 121 56 140
3883 140 273 77 166 164 217 70 202 174 164 147 122 156 127 144 139 49 137 100 108 183 249 195 37 96 113 97 188 84 108 126 106 149 106
3495 106 105 168 109 98 26 80 110 33 146 110 33 139 152 91 71 174 161 233 91 139 142 85 208 189 251 191 36 158 127 122 392 294
3120 294 84 29 131 100 64 88 135 94 91 131 94 26 48 173 94 128 147 17 178 52 110 136 115 166 107 70 156 178 108 112 73 149 77
$$ packed form
5808A68j32J84j41J80q7j5m6k7J27m0j14M2JO4p4J1M2m9L2j6J10K3j58K5m2P9N9o3m4J76j85
5444I0J04N5j16pJ8K4OO9rL1r7r4Q6J60j08j44K8j7o9O5j9O4L4l0j2P6k8q9K3l4M0N3K5j5
5045A63k4J8Kj39L2O8J86k4k22M8n7O1q1J89j49P1Q8Q3k37N1p4J19r8O3l3J5JK2l0n4J38j
4669A95j47L3N5j16J76qj15O4k0J10p0O9n6m7m2k0n4Q1J48k8j29n4K2P3Rq2J65qN6j13q4n
4294E8oQ7K2j8m8J14l1j5j2J4l0L2N5j17l8K4JpL5J35p3m2R2j23k3P1n6o6RK4M5M4l6o5Q4
3883A40J33j96Q9kN3j47J32k8j0j7k5L4k9J7nr0Q8l7QP5O6n4j58N9J7j6R1j04K4J8k0M3m3
3495A06jO3n9j1p2N4L0p7J13l6p7J06J3o1k0J03j3P2j42M8Ln7J23j9O2o0j55J22l1nK70r8
3120B94k10n5J02l1l6K4M7m1lM0l7o8K2J25p9L4J9j30J61j26N8K6k1N1n9l7Q6K2p0Ml9P6p2
$$ plain form
2732 77 221 168 196 175 276 150 110 62 66 58 118 91 179 229 43 245 218 127 92 48 183 220 88 48 79 155 111 204 144 185 151 86 294
2345 294 48 205 64 24 168 164 108 72 125 201 117 44 75 85 80 103 47 65 163 79 143 113 162 223 251 68 170 182 201 83 93 125
1970 125 166 85 246 238 14 53 265 185 190 334 109 68 57 138 252 265 273 323 93 41 189 175 116 272 170 114 76 105 102 15 236
1606 236 282 48 80 128 78 103 228 95 181 59 75 234 166 109 181 343 231 75 244 142 170 144 126 161 88 161 75 90 150 89
1254 89 34 241 200 145 167 185 17 233 288 165 94 60 100 108 31 116 141 239 45 141 87 102 167 230 109 54 135 75 78 92 16 113 116 111
854 111 316 175 31 218 324 88 158 332 168 71 153 132 80 111 179 126 138 79 89 93 55 181 260 181 67 196 98 169 129 163
502 163 153 65 130 120 131 154 71 76 164 219 158 78 105 189 201 121 230 79 133 67 225 329 213 125 136 191 186 65 98 71 158 106 120
115 120 34 178 140 160 155 120 229 125 121 120 175 144 297 198 100 150 61 69 64 67 111 62 10 175 133 171
$$ packed form
2732G7J44n3K8k1J01j26m0m8MqO0k7Q8N0j86K02k7r1l5m4J35L7j32m0L1P6m4R3o0M1l4o5K08
2345B94k46J57j41m0J44mn6l6N3P6q4p3L1J0nK3n6J8R8q4O4l0M9O1K8j83J02J2J9j18J0L2
1970A25M1q1J61qk24L9K12q0NJ44k25m1j1Q1J14J3QN0k30n2J48j4n9J56j02n6l8K9lq7K21
1606B36M6k34L2M8n0K5J25j33Q6j22J6J59o8n7P2J62j12j56J69j02K8k6j8L5p3P3q6J5O0o1
1254H9n5K07m1n5K2J8j68K16N5j23p1l4M0Qp7Q5K5R8j94R6n4J5O5O3j21n5Q1o0LJ4p6R7Ln
854A11K05j41j44J87J06k36P0J74j64r7Q2k1n2L1O8n3J2n9J0Ml8J26P9p9j14J29r8P1m0L4
502A63j0q8O5j0J1K3q3NQ8N5o1q0K7Q4J2q0J09j51N4o6J58J04j16q8J1N5nj21L3k7Q7n2J4
115A20q6J44l8K0nl5J09j04mjN5l1J53r9r8N0q9QnLM4m9n2J65m2L8
-190A71
##PAGE=	F1=-11643.5
##FIRST=	25169.313707327481097,	5807.6787752999953227,	0
##DATA TABLE=	(F2++(Y..Y)), PROFILE
$$ plain form
5808 188 68 179 72 254 159 126 102 34 164 137 116 136 120 161 116 92 136 121 93 37 225 262 57 113 31 94 116 115 100 264 138
5444 138 237 231 171 91 142 166 203 234 203 250 130 87 184 334 238 85 26 75 25 123 46 126 177 135 100 178 128 51 19 64 95 153 136 149
5045 149 128 187 177 66 20 150 349 280 71 132 73 91 53 232 51 158 228 285 70 154 81 205 66 125 129 150 81 128 100 25
4693 25 169 176 100 38 169 24 189 197 55 139 126 227 137 203 127 82 45 74 23 73 214 221 61 43 58 123 84 89 198 151 237 165 74
4305 74 26 50 125 156 158 98 156 184 159 168 153 91 169 217 73 58 118 146 106 131 270 187 97 172 84 85 155 73 62 30 46 101 126 106 32 143
3883 143 273 110 151 174 232 58 212 157 167 169 107 114 111 155 165 63 94 78 104 194 251 215 80 106 82 77 172 98 77 131 140 192 131 96
3484 96 157 124 46 33 86 169 85 187 131 22 146 148 132 35 200 188 222 63 156 168 70 177 190 237 204 39 153 133 52 329 263
3120 263 93 56 126 106 46 36 42 84 132 184 135 51 41 193 101 125 142 54 200 134 184 136 95 122 122 86 201 163 70 90 94 175 91 182
$$ packed form
5808A88j20J11j07J82r5l3k4o8J30k7k1K0j6M1m5k4M4j5k8n6J88L7k05N6q2O3K2jj5J64j26
5444A38R9oo0q0N1K4L7L1l1M7j20m3R7J50r6j53n9M9n0R8p7Q0N1m2l5P8n0p7l2M5L1N8j7J3
5045A49k1N9j0j11m6J30J99o9k09O1n9J8l8J79j81J07P0N7k15Q4p3J24j39N9MK1o9M7k8p5
4693B5J44Pp6o2J31j45J65Qj42Q4j3J01r0O6p6m5l7K9n1N0J41Pj60j8J5O5l9NJ09m7Q6p2r1
4305G4m8K4P5L1Ko0N8K8k5Rj5o2P8M8j44j5O0K8m0K5J39q3r0P5q8JP0q2j1l2J6N5K5k0p4J11
3883A43J30j63M1K3N8j74J54n5J0Ko2PlM4J0j02L1j6K6R0N7l6j35K6k4nR5p4k1N4RN2o1l5
3484I6O1l3p8j3N3Q3q4J02n6j09J24Kj6r7J65j2L4j59R3J2r8J07J3M7l3j65J14k0q1K77o6
3120B63j70l7P0k0o0j0OM2M8N2m9q4j0J52r2K4J7q8J46o6N0m8m1K7%l6J15l8r3K0MQ1q4R1
$$ plain form
2721 182 132 193 175 234 172 97 20 117 91 89 99 196 216 105 237 242 149 79 56 135 169 92 68 79 129 112 176 130 178 206 153 286 103 214
2322 214 68 44 173 192 100 139 131 223 114 38 53 144 140 88 17 70 168 79 151 116 203 281 219 69 187 135 201 62 91 107 132 89 203
1934 203 213 56 14 237 205 264 343 87 93 29 89 254 281 276 303 89 51 208 177 87 218 134 98 69 141 162 48 209 261 110 121
1570 121 144 44 145 265 76 204 83 111 248 129 165 149 285 191 102 241 67 169 57 136 178 84 229 66 66 138 10
1254 10 42 198 175 68 164 184 51 261 245 145 112 59 94 154 16 54 137 208 32 107 92 77 181 250 128 44 99 108 91 128 34
890 34 96 115 119 343 194 52 271 385 39 149 367 231 16 151 166 112 114 234 143 117 58 92 100 93 210 226 155 40 238 42
538 42 151 108 201 183 85 104 135 112 150 94 51 139 196 141 96 105 207 240 99 235 84 91 63 232 315 178 101 136 152 157 70 114 65 109
138 109 118 105 6 154 157 195 144 146 193 85 112 86 198 156 261 197 102 174 94 83 87 70 94 51 5 153 90 149
$$ packed form
2721A82n0O1j8N9o2p5p7R7k6kJ0R7K0j11J32Nr3p0k3P9L4p7k4J1N0j7O4m6M8K8n3J33j83J11
2322B14j46k4J29J9r2L9qR2j09p6J5R1mn2p1N3R8q9P2l5Q7P8o2j50J18n2O6j39K9J6K5m3J14
1934B03J0j57m2K23l2N9P9k56Oo4O0J65K7nK7k14l8J57l1r0J31q4l6k9P2K1j14J61N2j51J1
1570A21K3j00J01J20j89J28j21K8J37j19L6j6J36r4q9J39j74J02j12P9M2r4J45j63%P2j28
1254A0L2J56k3j07R6K0j33K10j6j00l3n3L5O0j38L8Q3P1j76P5j5j5J04O9j22q4N5Rj7L7r4
890C4O2J9MK24j49j42K19J14l46J10K18j36k15J35J5n4KJ20r1k6n9L4QpJ17J6p1j15J98j96
538D2J09m3R3j8r8J9L1k3L8n6m3Q8N7n5m5RJ02L3j41J36j51Pk8J69Q3j37p7L5J6Nq7M4m9M4
138A09Rj3r9J48LL8n1KM7j08K7k6J12m2J05o4r5P2q0j1Mj7K4m3m6J48o3N9
-190A49
##PAGE=	F1=-11745.8
##FIRST=	25169.313707327481097,	5807.6787752999953227,	0
##DATA TABLE=	(F2++(Y..Y)), PROFILE
$$ plain form
5808 186 97 125 70 233 138 88 100 29 104 126 182 170 123 148 151 73 124 148 107 40 215 277 58 123 19 44 23 105 106 238 169 254 196
5420 196 183 90 136 159 227 217 167 213 86 92 180 312 247 135 66 81 27 173 59 115 192 150 119 162 85 47 64 83 93 175 79 123 113
5033 113 197 179 132 68 187 398 284 91 185 115 68 94 226 67 172 223 254 55 159 103 231 90 121 150 179 57 115 88 12
4693 12 137 138 145 49 173 41 155 191 49 155 129 218 125 160 68 69 35 101 50 77 173 202 26 58 87 123 75 141 172 89 193 166 94
4305 94 84 52 113 147 178 102 91 171 139 172 135 45 172 221 68 66 156 184 113 123 272 195 107 101 64 81 124 40 65 59 52 82 121 90 20 148
3883 148 269 155 128 171 238 45 214 132 147 164 91 72 83 175 195 78 61 70 104 178 211 212 113 116 58 69 136 116 28 134 167 232 165
3495 165 84 146 146 50 41 82 222 135 197 143 38 143 157 194 67 220 186 187 30 177 187 61 137 193 204 210 49 145 131 15 238
3132 238 209 91 48 122 94 31 63 61 105 161 241 180 65 26 195 99 134 139 93 231 224 250 138 73 79 131 97 215 138 30 84 112 190
$$ packed form
5808A86q9K8n5J63r5n0J2p1P5K2N6j2m7K5Lp8N1K4m1o7J75O2k19O5j04K5k1Q2JJ32o9Q5n8
5420A96j3r3M6K3O8j0n0M6j27OQ8J32o5j12o9J5n4J46j14N6P7m2l1M3p7l8J7J9J0Q2r6M4j0
5033A13Q4j8m7o4J19K11j14j93R4p0m7K6J32j59J05N1L1j99J04n6J28j41L1K9K9j22N8k7p6
4693A2J25JPr6J24j32J14L6j42J06k6Q9r3L5r2Jl4O6n1K7R6K9j76L2K9L6m8O6L1q3J04k7p2
4305I4j0l2O1L4L1p6j1Q0l2L3l7r0J27M9j53kR0K8p1J0J49p7q8ol7J7M3q4K5opL0L9l1p0J28
3883A48J21j14k7M3O7j93J69q2J5J7p3j9J1R2K0j17j7RL4P4L3Jr9Ln8J1O7k0q8J06L3O5o7
3495A65q1O2%r6rM1J40q7O2n4j05J05J4L7j27J53l4Jj57J47J0j26P6N6J1Oj61R6j4j16K23
3132B38k9j18m3P4k8o3L2kM4N6Q0o1j15l9J69r6L5Nm6J38pK6j12o5ON2l4J18p7j08N4K8P8
$$ plain form
2744 190 80 134 91 174 168 196 180 63 36 164 130 60 112 195 182 159 215 249 177 98 57 78 102 69 86 65 98 101 126 115 157 246 226 282
2345 282 150 232 80 65 161 203 131 222 144 229 109 91 101 199 191 78 53 90 157 70 151 119 234 312 187 77 182 77 190 31
1993 31 99 80 121 107 168 191 95 17 198 217 308 313 71 112 6 43 220 272 258 264 79 82 223 164 100 155 78 84 90 181 201 105 196 246 171
1582 171 150 155 27 169 272 58 212 103 128 239 92 220 127 218 152 122 220 29 172 36 158 186 74 294 52 68 131
1265 131 47 73 136 143 33 177 181 90 263 186 151 143 64 98 180 48 24 128 167 23 73 98 64 169 262 143 48 76 141 116 140 75
890 75 73 111 120 350 207 82 334 421 1 145 374 275 59 134 187 132 96 251 155 106 41 90 98 120 226 186 131 29 258 15 143
526 143 73 226 214 112 98 161 112 143 126 47 101 166 124 103 112 202 255 71 243 103 64 83 212 263 133 66 135 113 123 49 129 123 72
138 72 133 77 32 145 164 211 126 159 144 89 100 46 197 153 223 198 113 181 125 84 120 67 84 50 11 121 52 120
$$ packed form
2744A90j10N4m3Q3oK8j6j17k7J28l4p0N2Q3j3k3N6L4p2p9m1K1K4l3J7k1L3LK5j1M2Q9k0N6
2345B82j32Q2j52j5R6M2p2R1p8Q5j20j8J0R8qj13k5L7O7q7Q1l2J15P8j25j10J05j05J13j59
1993C1O8j9M1j4O1K3r6p8J81J9R1Nk42M1j06L7J77N2j4Oj85LJ41n9o4N5p7OOR1K0r6R1N0p5
1582A71k1Nj28J42J03k14J54j09K5J11j47J28r3R1o6l0R8j91J43j36J22K8j12K20k42J6O3
1265A31q4K6O3Pj10J44Mr1J73p7l5qp9L4Q2j32k4J04L9j44N0K5l4J05R3j19r5K8O5k5K4o5
890G5kL8RK30j43j25K52Q7m20J44K29r9k16P5N3n5l6J55r6m9o5M9QK2J06m0n5j02K29k43J28
526A43p0J53j2j02j4O3m9L1j7p9N4O5m2k1RR0N3j84J72j40l9J9J29N1j30o7O9k2J0p4Q0on1
138G2O1n6m5J13J9M7q5L3j5n5J1n4J51m4P0k5q5O8n6m1L6n3J7l4l9J10o9O8
-190A20
##PAGE=	F1=-11848
##FIRST=	25169.313707327481097,	5807.6787752999953227,	0
##DATA TABLE=	(F2++(Y..Y)), PROFILE
$$ plain form
5808 161 109 70 70 197 110 49 96 39 82 169 234 192 111 143 189 37 114 168 139 93 192 282 89 122 43 14 58 120 119 206 174 239 157 172
5409 172 109 125 156 241 196 124 162 48 88 147 263 240 176 123 79 17 221 88 90 199 164 128 146 54 48 139 99 109 222 58 93 98 188
5021 188 171 189 106 227 439 296 111 255 157 49 113 206 101 179 219 226 48 146 110 243 110 129 165 186 48 112 80 44 107 87
4669 87 161 79 149 53 101 171 55 177 122 201 135 114 42 94 69 130 78 93 116 158 17 67 125 125 138 185 142 65 132 150 117 160 54 117
4270 117 142 204 110 59 150 109 167 118 47 180 239 88 91 198 203 102 93 255 196 144 34 73 75 77 10 68 73 55 88 143 77 43 162 263
3871 263 191 110 158 236 38 214 107 112 132 70 49 47 189 216 94 70 71 111 137 133 182 125 119 51 67 87 136 37 118 181 260 193 72 142
3472 142 168 120 46 64 251 173 179 148 74 130 175 242 101 227 152 141 17 195 199 78 103 196 158 205 64 132 118 69 140 136 82 14 118
3085 118 74 20 116 131 127 164 280 213 68 23 179 83 158 140 123 258 296 293 131 48 47 129 110 197 102 15 105 122 189 47 115 48 142
$$ packed form
5808A61n2l9%J27q7o1M7n7M3Q7O5m2q1L2M6j52P7N4k9m6R9R0j93L3p9k9M4O2jQ7l2O5q2J5
5409A72o3J6L1Q5m5p2L8j14M0N9J16k3o4n3m4o2K04j33KJ09l5l6J8r2oR1m0J0J13j64L5NR0
5021A88j7J8q3J21K12j43j85J44r8j08O4R3j05P8M0Pj78R8l6J33j33J9L6K1j38O4l2l6O3k0
4669H7P4q2P0r6M8P0j16J22n5P9o6k1p2N2k5O1n2J5K3M2j41N0N8%J3M7m3p7O7J8l3M3j06O3
4270A17K5O2r4n1R1m1N8m9p1J33N9j51LJ07Nj01rJ62n9n2j10L9KKo7N8Nj8L3N5o6l4J19J01
3871B63p2q1M8P8j98J76j07NK0o2k1kJ42K7j22k4JM0K6mM9n7oo8J6K0M9r9Q1O3P9o7j21P0
3472A42K6m8p4J8J87p8Ol1p4N6M5O7j41J26p5j1j24J78Mj21K5R3l8M7j41O8j4m9P1mn4o8J04
3085A18m4n4R6J5mL7J16o7j45m5J56r6P5j8j7J35L8lj62q3jQ2j9Q7r5q7R0J7O7j42O8o7R4
$$ plain form
2697 142 159 174 163 11 88 195 150 37 126 182 133 184 179 233 200 139 55 35 33 33 102 52 77 80 65 102 128 253 285 275 181 258 96 82
2298 82 136 192 171 300 165 219 112 147 174 233 219 66 98 106 137 63 142 113 251 312 156 94 167 20 165 26 117 61 162 152 146
1934 146 177 128 43 155 219 316 245 64 126 41 18 164 242 226 213 56 124 234 132 112 96 9 60 105 205 214 169 202 233 218 162 152
1559 152 24 168 235 53 199 114 120 206 64 261 132 159 116 111 183 79 179 103 175 178 64 342 55 93 125 78 104 73 104 87
1207 87 200 176 127 245 134 178 176 61 105 170 59 77 118 125 42 63 101 64 133 263 148 64 79 163 149 129 112 45 101 121 334 207
831 207 127 395 423 39 134 344 284 110 105 188 134 56 223 163 114 52 84 88 134 223 153 98 56 254 58 149 39 233 245 139 106
467 106 187 134 135 153 78 54 139 106 98 126 173 243 52 245 130 62 106 170 192 116 59 129 74 100 23 139 178 73 151 38 54 147 156 215
68 215 110 152 92 121 90 13 168 133 189 196 117 168 144 64 154 79 89 70 42 81 30 87
$$ packed form
2697A42J7J5j1j52P7J07m5j13Q9N6m9N1nN4l3o1q4k0k%O9n0K5Lj5L7K6J25L2j0r4P7j62j4
2298H2N4N6k1J29j35N4j07L5K7N9j4j53L2QL1p4P9k9J38O1j56o2P3j47J45j39R1n6J01j0o
1934A46L1m9q5J12O4R7p1j81O2q5k3J46P8j6j3j57O8J10j02k0j6q7N1M5J00Rm5L3L1j5n6j0
1559A52j28J44O7j82J46q5OQ6j42J97j29K7m3nP2j04J00p6P2Lj14K78k87L8L2m7K6l1L1j7
1207H7J13k4m9J18j11M4kj15M4O5j11J8M1Pq3K1L8l7O9J30j15q4J5Q4j4k0j7o7N6K0K13j27
831B07q0K68K8l84R5K10o0j74nQ3n4p8J67o0m9o2L2MM6Q9p0n5m2J98j96R1j10J94J2j06l3
467A06Q1n3JJ8p5k4Q5l3qK8M7P0j91J93j15o8M4O4K2p6n7P0n5K6p7J16L9j05P8j13J6R3RN9
68B15j05M2o0K9l1p7J55l5N6Pp9N1k4q0R0p5J0j9k8L9n1N7
-190H7
##PAGE=	F1=-11950.3
##FIRST=	25169.313707327481097,	5807.6787752999953227,	0
##DATA TABLE=	(F2++(Y..Y)), PROFILE
$$ plain form
5808 115 102 27 69 151 78 19 87 32 137 241 267 197 90 156 223 21 111 177 153 113 159 272 126 106 58 39 117 136 137 175 153 192
5432 192 125 148 123 112 156 239 175 82 109 29 73 97 200 218 199 153 60 67 266 113 60 195 172 120 149 56 43 197 104 152 277 96
5056 96 74 93 168 164 225 119 256 462 313 127 318 194 36 110 175 135 179 219 204 60 121 102 235 108 150 174 164 32 111 69
4704 69 69 82 33 147 96 105 62 80 149 59 194 108 175 156 91 97 122 106 149 96 109 51 99 59 71 156 132 214 206 120 109 66 125 136 229 53
4282 53 133 136 230 118 90 140 89 157 106 93 191 262 111 124 239 205 75 47 218 185 172 24 103 71 75 48 94 78 62 133 170 68 73
3894 73 190 252 210 93 136 226 56 217 99 76 89 43 65 32 184 224 110 104 71 120 75 31 127 119 114 66 57 34 156 109 96 181 273
3507 273 213 60 151 182 180 43 36 251 191 146 159 122 113 190 265 112 212 98 120 43 206 203 103 80 190 115 186 80 117 97 99 59
3132 59 60 72 49 113 66 22 154 178 134 138 283 222 63 56 154 70 194 145 146 270 333 301 111 28 32 114 126 161 59 37 131 121 174 16
$$ packed form
5808A15j3p5M2Q2p3n9O8n5J05J04K6p0j07O6O7k02R0O6k4m0M6J13j46k0m8j9P8J9JL8k2L9
5432A92o7K3k5j1M4Q3o4r3K7q0M4K4J03J8j9m6r3PJ99j53n3J35k3n2K9r3j3J54r3M8J25j81
5056I6k2J9P5mO1j06J37K06j49j86J91j24j58P4O5m0M4M0j5j44O1j9J33j27M2K4j0j32P9m2
4704F9%J3m9J14n1Rm3J8O9r0J35q6O7j9o5OK5j6M3n3J3n8M8m0J2Q5k4Q2qq6j1m3N9J1R3j76
4282E3Q0LR4j12k8N0n1O8n1j3R8P1j51J3J15l4j30k8J71l3j3j48P9l2Mk7M6j6j6P1L7j02N
3894G3J17O2m2j17M3R0j70J61j18k3J3m6K2l3J52M0j14ol3M9m5m4R6qnm8rk3J22m7j3Q5R2
3507B73o0j53R1L1kj37pK15o0m5J3l7rP7P5j53J00j14K2p7J63lj00k3J10p5P1j06L7k0Km0
3132E9JJ2k3O4m7m4J32K4m4MJ45o1j59pR8q4J24m9JJ24O3l2j90q3MQ2J2L5j02k2R4j0N3j58
$$ plain form
2732 16 143 4 108 149 168 120 52 141 208 148 30 137 165 78 175 131 195 209 184 58 77 54 18 111 57 83 55 6 89 98 224 317
2357 317 260 200 285 111 94 110 165 195 355 187 199 125 181 231 237 223 45 131 105 117 80 132 96 251 283 134 119 161 47 130 57 144
1981 144 81 227 205 141 163 151 67 118 210 290 152 63 135 82 21 101 203 197 161 75 167 245 114 102 50 73 21 105 207 198 230 231 210 240
1582 240 161 134 17 141 157 76 162 114 95 155 66 285 146 130 89 71 138 116 192 141 168 147 54 362 84 120 123 85 124 36 74 132
1207 132 215 167 157 216 125 201 200 51 109 132 51 107 108 88 68 74 95 71 84 254 138 87 102 167 177 107 137 16 81 129 293 194 183 441
807 441 389 79 107 275 253 139 70 172 120 7 159 167 134 66 72 74 135 196 123 90 113 227 88 168 61 222 270 160 120 207 167
444 167 125 166 126 11 118 90 97 147 124 210 69 230 152 68 122 120 126 150 99 117 42 107 69 146 208 89 162 17 73 153 138 217 108
56 108 126 64 152 85 42 116 101 164 180 109 140 146 28 179 127 116 91 82 45 24 59
$$ packed form
2732A6J27j39J04M1J9m8o8Q9O7o0j18J07K8q7R7m4O4J4k5j26J9k3l6R3n4K6k8m9Q3RJ26R3
2357C17n7o0Q5j74j7J6N5L0J60j68J2p4N6N0Oj4j78Q6k6J2l7N2l6J55L2j49j5M2j14Q3p3Q7
1981A44o3J46k2o4K2j2q4N1R2Q0j38q9P2n3o1Q0J02ol6q6R2P8j31j2n2K3n2Q4J02rL2Jk1L0
1582B40p9k7j17J24J6q1Q6m8j9O0q9K19j39j6m1j8O7k2P6n1K7k1r3L08k78L6Ll8L9q8L8N8
1207A32Q3m8j0N9r1P6jj49N8K3q1N6Jk0k0OK1k4J3J70j16n1J5O5J0p0L0j21O5M8J64r9j1K58
807D41n2l10K8J68k2j14o9J02n2j13J52Ql3o8OKO1O1p3l3K3J14j39Q0j07J61M8j10m0Q7m0
444A67m2M1m0j15J07k8PN0k3Q6j41J61p8q4N4kOK4n1J8p5O5l8P7O2j19P3j45N6Q0j5P9j09
56A08J8o2Q8o7m3P4j5O3J6p1L1Oj18J51n2j1k5rl7k1L5
-190E9
##PAGE=	F1=-12052.5
##FIRST=	25169.313707327481097,	5807.6787752999953227,	0
##DATA TABLE=	(F2++(Y..Y)), PROFILE
$$ plain form
5808 62 76 12 64 98 46 30 78 27 206 309 275 187 67 177 249 72 118 168 136 90 116 245 153 89 63 73 151 134 148 146 114 123 107
5420 107 120 126 99 155 219 153 67 64 32 53 56 136 185 204 154 32 145 305 125 55 176 170 107 175 65 33 228 97 206 320 129
5056 129 76 104 150 173 235 110 265 456 320 136 356 222 39 93 136 163 173 223 189 73 89 80 206 86 177 176 117 5 96 50
4704 50 84 64 21 111 97 58 71 134 146 52 201 91 139 170 104 148 130 129 152 98 114 30 41 91 66 167 140 274 198 111 153 12 105
4317 105 153 279 48 143 126 253 122 118 150 102 148 99 140 196 278 132 159 278 199 43 30 167 160 180 57 133 75 133 94 127 84
3953 84 75 185 188 67 101 229 236 206 67 108 210 98 217 116 54 73 11 93 64 160 217 129 132 68 123 19 91 60 103 100 94 34 33 177
3554 177 178 110 167 271 228 47 175 187 212 34 26 222 184 118 188 174 99 197 262 102 173 74 140 64 202 197 116 65 169 104 158 95
3178 95 104 78 104 36 59 65 103 108 81 47 167 197 144 100 238 207 62 90 127 89 234 147 161 262 324 273 85 20 23 89 142 139 18 54
$$ packed form
5808F2J4o4N2L4n2j6M8n1J79J03l4q8j20J10P2j77M6N0l2m6K6J29r2o4k6J0P8j7J4kl2Rj6
5420A07J3Ok7N6O4o6q6ll2K1LQ0M9J9n0j22J13J60j80p0J21oo3O8j10l2J95j31J09J14j91
5056A29n3K8M6K3O2j25J55J91j36j84K20j34j83N4M3K7J0N0l4j16J6rJ26j20R1jn9j12R1m6
4704E0L4k0m3R0j4l9J3O3J2r4J49j10M8L1o6M4j8jK3n4J6q4J1N0k5J01k7J34p6q7M2j41R3
4317A05M8J26k31R5j7J27j31mL2m8M6m9M1N6Q2j46K7J19p9j56j3J37pK0j23P6n8N8l9L3m3
3953H4rJ10Lj21L4J28Pl0j39M1J02j12J19j01o2J9o2Q2k9R6N7q8Lo4N5j04P2l1M3loo0jJ44
3554A77Jo8N7J04m3j81J28J2K5j78qJ96l8o6P0j4p5R8O5j60P1r9O6p6J38nq1n1J04o5N4o3
3178I5Rk6K6o8K3OL8Nk7l4J20L0n3m4J38l1j45K8L7l8J45q7J4J01O2n1j88o5LO6N3lj21L6
$$ plain form
2779 54 145 103 150 53 180 43 87 142 169 60 111 190 215 128 42 137 145 26 135 75 141 198 218 63 138 112 37 108 78 106 25 49 76
2392 76 76 168 313 232 217 308 116 97 96 131 192 375 200 174 144 181 259 213 217 12 148 83 111 110 135 73 235 233 129 147 176 105 94 81
1993 81 172 122 283 243 150 136 161 96 105 194 237 72 67 140 126 24 49 165 180 122 134 204 260 163 82 31 150 29 95 191 161 278 275
1606 275 169 230 156 102 21 105 60 118 106 106 72 111 91 292 148 125 80 33 91 130 208 151 138 91 42 352 116 138 128 80 127 37 74
1218 74 157 205 150 178 194 154 206 205 41 105 88 32 101 99 58 85 79 73 88 35 238 113 110 126 151 193 88 141 21 46 143 229 174 243 462
807 462 325 123 62 172 190 141 36 145 98 59 82 173 160 66 51 61 127 144 83 142 174 186 105 197 110 198 286 176 133 219 200 118
432 118 163 174 52 104 90 121 173 65 167 100 191 155 64 128 76 97 197 145 101 21 127 130 152 205 92 157 51 91 156 121 218 125
56 125 85 90 170 79 79 51 64 150 148 90 101 128 54 186 193 157 95 116 54 14 52
$$ packed form
2779E4R1m2M7r7J27j37M4N5K7j09N1P9K5q7q6R5Qj19J09o0O6N7K0j55P5k6p5P1l0K8q1K4K7
2392G6%R2J45q1j5R1j92j9jL5O1J83j75k6l0L7P8m6Mk05J36o5K8jK5o2J62kj04J8K9p1j1j3
1993H1R1n0J61m0r3j4K5o5RQ9M3j65nP3j4j02K5J16J5n8J2P0N6r7q1n1J19j21O6R6l0J17l
1606B75j06O1p4n4q1Q4m5N8j2%l4L9k0K01j44k3m5m7N8L9P8n7j3m7m9L10k36K2j0m8M7r0L7
1218G4Q3M8n5K8J6m0N2jj64O4j7n6O9km1K7ooJ5n3K03j25lJ6K5M2j05N3j20K5R7Q6n5O9K19
807D62j37k02o1J10J8m9j05J09m7l9K3R1j3r4j5J0O6J7o1N9L2J2q1R2q7Q8Q8j10m3Q6j9q2
432A18M5J1j22N2j4L1N2j08J02o7R1l6r1O4n2K1J00n2m4q0J06LK2N3j13O5j06M0O5l5R7r3
56A25m0NQ0r1%k8J3Q6kn8J1K7p4J32Pl6o2K1o2m0L8
-190E2
##PAGE=	F1=-12154.8
##FIRST=	25169.313707327481097,	5807.6787752999953227,	0
##DATA TABLE=	(F2++(Y..Y)), PROFILE
$$ plain form
5808 53 40 17 55 50 24 48 66 50 259 349 253 162 48 189 262 117 127 140 93 26 68 201 161 90 73 112 162 114 145 114 77 43 104
5420 104 98 129 90 147 185 139 95 37 38 43 69 86 148 197 133 29 231 335 122 89 141 155 101 209 63 23 233 83 256 335 134
5056 134 87 123 145 195 221 91 252 420 300 143 358 236 65 70 96 179 167 225 179 74 52 52 160 55 198 169 57 36 60
4716 60 21 87 58 50 69 83 35 79 194 164 32 196 84 97 167 127 175 113 133 142 79 100 86 24 107 51 150 145 306 163 117 171 39
4329 39 98 170 300 40 141 111 264 119 121 170 140 142 95 179 191 280 152 184 312 196 35 74 119 125 170 71 153 87 189 133 145 93
3953 93 78 218 192 81 120 271 214 180 40 75 185 147 202 146 49 102 27 112 96 124 198 151 142 68 111 73 196 56 88 77 124 16
3578 16 86 201 236 158 140 258 245 32 204 181 209 39 54 170 155 113 227 216 86 194 237 80 122 121 164 74 183 178 110 66 138
3214 138 122 126 107 100 75 87 52 121 56 141 102 102 80 150 192 179 94 149 182 81 112 105 127 266 140 168 239 271 222 66 19 24 58 151 159 50
$$ packed form
5808E3j3k3L8nk6K4J8j6K09R0r6r1j14J41P3j45J0J3m7o7M2J33m0p1j7L9N0m8L1l1l7l4O1
5420A04oL1l9N7L8m6m4n8JNK6J7O2M9o4j04K02J04k13l3N2J4n4J08j46m0K10j50J73P9k01
5056A34m7L6K2N0K6j30J61J68j20j57K15j22j71NK6Q3j2N8m6j05k2%J08j05J43k9j12k1K4
4716F0l9O6k9qJ9J4m8M4J15l0j32J64j12J3P0m0M8o2K0Ro3K1j4o2Q3n6R9nJ61j43m6N4j32
4329C9N9P2J30k60J01l0J53j45KM9l0Km7Q4J2Q9j28L2J28j16j61L9M5OM5r9Q2o6J02n6J2n2
3953I3j5J40k6j11L9J51n7l4j40L5J10l8N5n6r7N3p5Q5j6K8P4m7rp4M3l8J23j40L2j1M7j08
3578A6P0J15L5p8j8J18j3k13J72k3K8j70J5J16j5m2J14j1j30J08M3j57M2jM3r0J09no8m4P2
3214A38j6Mj9pk5J2l5O9o5Q5l9%k2P0M2j3q5N5L3j01L1pK2J39j26K8P1L2m9j56m7NL4R3Qj09
$$ plain form
2791 50 67 141 73 132 91 202 93 92 141 167 12 154 230 234 103 57 120 125 21 79 19 84 165 233 63 192 156 39 95 99 126 12
2416 12 90 80 67 104 274 191 243 320 106 94 104 103 163 352 202 149 170 148 259 169 219 39 148 41 120 131 150 52 205 176 134
2052 134 169 202 161 66 92 192 155 313 254 170 99 162 131 118 175 173 122 83 140 166 48 39 133 180 103 186 225 276 246 94 37 213 72
1664 72 79 162 116 306 318 111 186 156 65 45 83 90 164 36 99 79 115 112 287 138 121 85 70 57 121 222 142 120 29 29 318 143 145 143
1265 143 74 113 30 100 166 170 125 185 185 184 189 183 31 98 69 9 62 93 24 87 70 30 121 20 217 81 128 135 114 190 86 123 54 44 159
854 159 153 154 294 454 244 166 42 46 131 121 11 118 80 100 46 184 187 55 37 51 108 79 32 165 191 132 115 227 152 166 285 184
479 184 141 224 229 113 148 206 93 94 113 161 199 5 129 125 132 132 48 125 63 107 228 179 87 15 132 179 161 175 79 137 78 112 156 113 208
68 208 150 50 136 172 72 113 17 34 146 107 70 60 101 120 173 251 196 78 134 94 8 68
$$ packed form
2791E0J7P4o8N9m1J11j09jM9K6j55J42P6Mj31m6O3Nj04N8o0O5Q1O8j70J29l6j17N6MK7j14
2416A2P8j0j3L7J70q3N2P7k14j2J0jO0J89j50n3K1k2J11r0N0j80J09j07P9J1J9r8J53k9m2
2052A34L5L3m1r5K6J00l7J58n9q4p1O3l1j3N7kn1l9N7K6j18rR4M7p7Q3L9N1l0j52n7J76j41
1664G2PQ3m6J90J2k07P5l0r1k0L8PP4j28O3k0L6lJ75j49j7l6j5j3O4J01q0k2r1%K89j75Kk
1265A43o9L9q3P0O6Mm5O0%jNoj52O7k9o0N3L1o9O3j7m0R1j01J97j36M7Pk1P6j04L7o9j0J15
854A59oJJ40J60k10p8j24MQ5j0j10J07l8K0n4J38Lj32j8J4N7k9m7J33K6n9j7J12p5J4J19j01
479A84m3Q3Nj16L5N8j13JJ9M8L8j94J24mP%q4P7o2M4J21m9r2p2J17M7j8J4r6N8n9L4M4m3R5
68B08n8j00Q6L6j00M1r6J7J12l9l7j0M1J9N3P8n5j18N6m0q6O0
-190F8
##PAGE=	F1=-12257.1
##FIRST=	25169.313707327481097,	5807.6787752999953227,	0
##DATA TABLE=	(F2++(Y..Y)), PROFILE
$$ plain form
5808 99 12 16 44 37 42 56 52 78 286 351 201 123 38 185 262 144 130 95 78 76 46 147 151 106 90 146 158 85 125 79 80 34 120 87 139 87
5385 87 133 151 149 135 31 37 58 105 64 114 184 102 60 309 352 106 130 90 129 101 235 49 13 215 69 290 316 112 89 133 158 216
5010 216 190 85 221 355 247 150 322 231 102 56 62 180 171 217 177 62 16 45 112 40 202 155 30 71 10 24 76 62 65 58 58 49 86
4622 86 226 185 9 179 96 55 145 139 170 75 115 128 52 67 128 55 106 33 109 141 305 119 130 159 58 95 191 287 32 130 92 260
4247 260 110 108 183 179 139 91 205 175 265 174 188 335 203 57 110 99 95 158 66 165 103 222 156 137 108 55 221 179 111 125 304 190
3871 190 139 65 39 151 188 161 172 47 136 57 116 113 92 169 174 133 78 86 135 274 124 94 49 146 43 138 233 273 205 105 237 262 19
3484 19 225 167 171 79 79 106 108 126 259 239 69 184 197 60 100 174 166 78 147 147 88 90 107 131 95 118 109 87 65 66 164 38 156 95 116 107
3061 107 109 169 228 131 49 178 116 118 93 154 280 123 165 210 187 171 62 13 41 29 149 196 100 82 124 58 134 114 204 144 112 144 162
$$ packed form
5808I9q7MK8pNJ4mK6K08O5j50p8q5J47P7j18j4l5j7kl0J01Mm5j6N6J2p3M0m6Jm6Q6l3N2n2
5385H7M6J8kj4j04OK1M7m1N0P0q2m2K49M3k46K4m0L9k8J34j86l6K02j46K21K6k04k3M4K5N8
5010B16k6j05J36J34j08r7J72r1j29m6OJ18rM6m0j15m6K9O7p2J62m7j25M1o1J4N2j4Lp%rL7
4622H6J40m1j76J70q3m1R0oL1r5M0J3p6J5O1p3N1p3P6L2J64j86J1K9j01L7R6R6k55R8l8J68
4247B60j50kP5mm0m8J14l0R0r1J4J47j32j46N3j1mO3r2R9o2J19o6j9k9n3J66m2o8J4J79j14
3871A90n1p4k6J12L7k7J1j25Q9p9N9lk1P7Nm1n5QM9J39j50l0m5R7j03R5R5M0o8j00J32K5k43
3484A9K06n8Mr2%K7KJ8J33k0j70J15J3j37M0P4qq8O9%n9KJ7K4l6K3rk2k2JR8j26J18o1K1r
3061A07KO0N9r7q2J29o2Kk5O1J26j57M2M5k3j6j09m9K8j2J20M7r6j8M2o6P6k0R0o0l2L2J8
$$ plain form
2674 162 57 170 255 271 88 70 85 114 62 35 27 47 118 224 59 229 187 27 80 110 138 48 118 110 63 58 210 144 278 314 90
2310 90 92 133 95 117 290 195 126 204 103 244 119 237 85 134 17 133 133 162 36 168 126 135 181 219 211 49 93 195 170 309 239
1946 239 195 94 159 171 134 158 124 216 117 133 198 87 61 111 189 93 210 223 285 317 138 47 250 99 62 130 77 313 345 46 112
1582 112 166 38 65 92 192 200 35 105 104 158 117 275 127 105 85 115 52 94 225 133 162 81 23 275 159 145 163 69 88 26 132
1218 132 167 123 93 176 182 190 149 132 17 93 83 6 20 90 21 74 50 32 161 45 189 65 140 129 62 175 99 86 89 112 173 93 137
831 137 324 416 164 200 105 89 150 92 8 100 81 110 77 201 212 44 61 45 80 29 77 81 118 68 131 247 178 128 264 186 142 223 249
444 249 107 125 212 119 80 140 199 217 57 104 146 77 87 31 119 88 120 236 199 77 9 109 209 176 138 68 108 90 131 148 108 177
68 177 172 60 177 155 65 141 67 31 146 70 57 27 95 181 142 287 221 58 132 129 37 85
$$ packed form
2674A62j05J13Q5J6j83j8J5K9n2k7qK0P1J06j65J70m2j60N3L0K8r0P0qm7nJ52o6J34L6k24
2310I0KM1l8K2J73r5o9P8j01J41j25J18j52M9j17J16%K9j26J32m2RM6L8qj62M4J02k5J39p0
1946B39m4j01O5J2l7K4l4R2r9J6O5j11k6N0P8r6J17J3O2L2j79r1K03j51l7O8n3K36L2k99O6
1582A12N4j28K7K7J00Qj65P0jN4m1J58j48k2k0L0o3M2J31r2K9q1n8K52j16j4J8r4J9o2J06
1218A32L5m4l0Q3OQm1j7j15P6j0p7J4P0o9N3k4j8J29j16J44j24P5j1o7J13p6j3LK3O1q0M4
831A37J87R2k52L6r5j6O1n8q4R2j9K9l3J24J1j68J7j6L5n1M8ML7n0O3J16o9n0J36p8m4Q1K6
444B49j42J8Q7r3l9O0N9J8j60M7M2o9J0n6Q8l1L2J16l7j22o8J00J00l3l8p0M0j8M1J7m0O9
68A77nj12J17k2r0P6p4l6J15p6j3l0O8Q6l9J45o6j63P4lr2M8
-190H5
##PAGE=	F1=-12359.3
##FIRST=	25169.313707327481097,	5807.6787752999953227,	0
##DATA TABLE=	(F2++(Y..Y)), PROFILE
$$ plain form
5808 140 32 19 33 59 73 58 37 97 282 319 125 75 39 168 250 147 118 45 146 188 87 92 131 117 102 165 143 62 93 59 120 97
5432 97 152 98 155 87 111 136 178 166 48 29 82 132 76 89 172 79 86 368 354 82 163 33 96 95 248 43 6 184 61 301 267 79
5056 79 73 125 178 224 150 104 189 273 166 162 258 205 142 63 47 163 186 195 180 58 33 76 95 45 183 137 68 91 58 70 52 71 69 88 38
4646 38 61 90 219 198 32 152 117 43 108 130 139 35 85 125 57 25 144 73 92 37 56 129 273 102 141 120 57 88 213 241 31
4282 31 118 72 237 92 97 181 205 135 89 215 155 235 195 163 341 214 76 129 112 88 170 51 169 121 228 157 107 139 40 192 157
3918 157 150 113 318 169 109 113 31 106 210 94 179 41 162 76 104 112 80 132 194 110 100 75 181 312 183 126 46 158 68 183 270
3554 270 288 230 68 210 273 17 226 143 108 137 92 49 51 138 276 241 40 169 149 52 137 201 141 83 98 111 63 119 83 115 64 128
3178 128 128 100 69 104 183 9 150 88 120 123 49 135 264 162 120 211 154 112 92 158 269 100 155 183 90 151 66 8 61 9 133 216
$$ packed form
5808A40j08j3J4K6J4j5k1O0J85L7j94n0l6J29Q2j03k9p3J01M2j01NL9j4j5O3k2q1L1l4O1k3
5432I7N5n4N7o8K4K5M2j2j18j9N3N0n6J3Q3r3PK82j4k72Q1j30O3jJ53k05l7J78j23K40l4j88
5056G9oN2N3M6p4m6Q5Q4j07mR6n3o3p9j6J16K3Rj5j22k5M3J9n0J38m6o9K3l3J2j8J9kJ9n0
4646C8K3K9J29k1j66J20l5p4O5K2Rj04N0M0o8l2J19p1J9n5J9P3J44j71L9k1o3L1J25K8k10
4282C1Q7m6J65j45NQ4K4p0m6J26o0Q0m0l2J78j27j38N3j7k4Q2j19J18m8J07p1n0L2r9J52l5
3918A57pl7K05j49o0Mq2P5J04j16Q5j38J21q6K8Ql2N2O2q4j0k5J06J31j29n7q0J12r0J15Q7
3554B70J8n8j62J42O3k56K09q3l5K9m5m3KQ7J38l5k01J29k0r7Q5O4o0n8J5J3m8N6l6L2n1O4
3178A28%k8l1L5P9j74J41o2L2Lp4Q6J29j02m2R1n7m2k0O6J11j69N5K8r3O1q5n8N3n2J24Q3
$$ plain form
2803 216 145 99 105 88 156 119 191 186 131 151 154 86 157 263 312 88 86 47 122 93 47 55 51 67 196 62 245 211 34 72 110 143 86 140 153
2392 153 53 50 139 120 314 289 108 104 171 111 78 199 181 107 245 92 228 79 256 121 114 76 139 116 155 38 130 95 129 180 219
2028 219 250 36 95 181 163 269 205 221 146 159 207 141 144 119 295 162 116 212 121 83 99 193 74 197 194 277 353 180 56 254 108
1664 108 45 107 53 299 347 36 25 187 35 68 108 268 214 97 125 127 200 103 260 123 80 70 140 71 63 208 128 230 155 23
1312 23 237 167 144 186 61 74 64 160 169 94 62 153 173 165 90 57 17 95 111 11 72 90 74 52 30 107 196 67 152 97 148 109 15 162
913 162 114 41 124 192 181 93 128 325 356 105 222 173 213 228 74 11 98 106 88 93 224 227 35 105 50 60 57 209 214 181 59 160 249
526 249 190 92 221 183 138 220 260 95 100 185 131 49 153 221 222 110 95 171 106 49 51 117 124 118 221 204 72 23 63 214 194 130 84 78 88
115 88 145 130 94 133 183 87 201 123 70 164 103 44 141 48 55 24 135 223 100 297 226 65 115 149 67 93
$$ packed form
2803B16p1m6Oj7O8l7P2nn5K0Lo8P1J06M9k24kl9P5k9m6QmJ6J29j34J83l4j77L8L8L3n7N4J3
2392A53j00lQ9j9J94k5j81mO7o0l3J21j8p4J38j53J36j49J77j35pl8O3k3L9j17R2l5L4N1L9
2028B19L1k14N9Q6j8J06o4J6p5J3M8o6Lk5J76j33m6R6r1l8J6R4j19J23lQ3P6j73j24J98j46
1664A08o3O2n4K46M8l11j1J62j52L3M0J60n4j17K8KP3r7J57j37m3j0P0o9qJ45q0J02p5j32
1312B3K14p0k3M2j25J3j0R6Rp5l2R1K0qp5l3m0P8J6j00O1J8j6k2k2P7Q9j29Q5n5N1l9r4J47
913A62m8p3Q3O8j1q8L5J97L1k51J17m9M0J5j54o3Q7Qj8NJ31Lj92P0n5J0lJ52Nl3j22J01Q9
526B49n9r8J29l8m5Q2M0j65NQ5n4q2J04O8Jj12j5P6o5n7KO6PoJ03j7j32m9M0J51k0o4m6oJ0
115H8N7j5l6L9N0r6J14p8n3R4o1n9R7r3Pl1J11Q8j23J97p1j61N0L4q2K6
-190I3
##PAGE=	F1=-12461.6
##FIRST=	25169.313707327481097,	5807.6787752999953227,	0
##DATA TABLE=	(F2++(Y..Y)), PROFILE
$$ plain form
5808 160 51 28 28 73 105 58 33 105 251 267 55 32 48 143 228 123 91 48 232 293 137 44 117 111 98 158 121 54 65 84 164 141 190
5420 190 135 173 85 84 141 208 184 83 29 101 149 104 77 164 79 105 402 340 56 177 49 62 81 251 66 22 147 61 289 199 62
5056 62 39 102 194 211 113 127 172 190 84 178 187 165 179 78 50 128 206 160 183 87 71 112 114 42 143 115 93 90 115 116 18 79 76 122 54 61 95
4622 95 181 202 62 117 133 65 62 103 96 51 70 129 90 27 129 79 70 63 17 111 221 129 143 68 55 88 234 168 45 108 55 200 67 103
4223 103 166 210 126 96 208 142 190 212 110 321 220 81 135 136 98 211 39 169 139 215 138 72 183 110 135 131 186 86 309 162
3871 162 128 145 76 54 206 11 160 34 180 85 83 95 87 93 204 82 128 111 206 305 220 168 84 162 79 220 306 281 229 40 179
3507 179 270 17 203 108 34 200 94 51 9 137 274 225 5 150 98 57 187 199 98 91 43 80 42 134 65 93 38 141 152 108
3155 108 97 163 184 28 131 82 124 126 14 100 269 159 228 255 185 103 97 140 234 79 141 164 42 159 69 16 75 21 104 204 177
$$ packed form
5808A60j09k3%M5L2m7k5P2J46J6k12k3J6R5Q5j05l2m3J84O1j56r3P3oj3O0l7o7J1J9Q0k3M9
5420A90n5L8q8jN7O7k4j01n4P2M8m5k7Q7q5K6K97o2k84J21j28J3J9J70j85m4J25q6K28r0j37
5056F2k3O3R2J7r8J4M5J8j06R4Rk2J4j01k8P8P8m6K3r6j6M1Kp2J01k8k2lK5Jr8O1lM6o8PL4
4622I5Q6K1j40N5J6o8lM1pm5J9N9l9o3J02n0rpm6R4J10r2J4p5j3L3J46o6j23O3n3J45j33L6
4223A03O3M4q4l0J12o6M8K2j02K11j01j39N4Jl8J13j72J30l0P6p7o6J11p3K5mN5j00K23j47
3871A62l4J7o9k2J52j95J49j26J46r5kJ2qOJ11j22M6j7R5R9q5n2q4P8q3J41Q6k5n2j89J39
3507A79R1k53J86r5p4J66j06m3m2J28J37m9k20J45n2m1J30J2j01pm8L7l8R2o9K8n5J03J1m4
3155A08j1O6K1j56J03m9M2Kj12Q6J69j10O9K7p0q2oM3R4j55O2K3j22J17r0n3N9n4Q3J00k7
$$ plain form
2791 177 121 100 133 186 109 173 213 140 158 144 87 115 248 336 91 106 63 143 111 64 68 58 23 158 85 240 229 59 73 98 144 121 158
2404 158 191 37 43 84 140 336 251 170 134 204 142 77 95 161 91 280 126 220 61 256 137 94 128 132 95 122 60 99 100 132 170 201 274
2016 274 18 110 155 140 202 171 246 206 162 232 140 134 153 350 207 89 204 133 100 94 185 42 152 142 246 348 205 69 221 117
1664 117 34 100 38 271 320 81 72 213 36 48 112 302 199 141 144 140 228 78 248 124 61 57 155 92 65 169 118 281 209 20 212
1300 212 169 150 206 55 90 108 178 176 104 41 117 155 112 27 38 49 107 153 10 122 90 126 25 16 179 217 89 106 152 153 85 53 159
913 159 123 35 153 263 182 128 130 296 285 82 229 221 310 297 72 12 113 149 58 87 248 229 29 151 66 84 88 402 669 563
561 563 166 211 232 194 75 170 175 129 218 259 73 76 135 136 7 144 224 210 151 93 196 175 84 91 128 160 99 192 198 75 56 26 196 211
162 211 163 115 45 76 150 103 70 110 177 95 202 95 95 178 122 52 126 40 65 36 195 240 62 287 212 88 99 152 90 93
$$ packed form
2791A77n6k1L3N3p7O4M0p3J8j4n7K8J33Q8k45J5m3Q0l2m7Mj0l5J35p3J55j1j70J4K5M6k3L7
2404A58L3j54OM1N6J96q5q1l6P0o2o5J8O6p0J89j54R4j59J95j19m3L4Ml7K7o2L9JL2L8L1P3
2016B74k56R2M5j5O2l1P5m0m4P0r2oJ9J97j43j18J15p1l3oR1j43J10j0J04J02j43j36J52j04
1664A17q3O6o2K33M9k39rJ41j77J2O4J90j03n8LmQ8j50J70j24o3mR8o3k7J04n1J63p2j89J92
1300B12m3j9N6j51L5J8P0kp2o3P6L8m3q5J1J1N8M6j43J12l2L6j01rJ63L8j28J7M6Jo8l2J06
913A59l6q8J18J10q1n4KJ66j1k03J47qQ9j3k25o0J01L6r1K9J61j9k00J22q5J8ML14K67j06
561E63l97M5K1l8j19R5Nm6Q9M1j86LN9Jj29J37Q0j4n9n8J03k1r1PL7L2o1R3Oj23j9l0J70J5
162B11m8m8p0L1P4m7l3M0O7q2J07j07%Q3n6p0P4q6K5k9J59M5j78K25p5j24J1N3o2L
-190I3
##PAGE=	F1=-12563.8
##FIRST=	25169.313707327481097,	5807.6787752999953227,	0
##DATA TABLE=	(F2++(Y..Y)), PROFILE
$$ plain form
5808 155 57 36 31 71 134 61 41 105 200 218 88 53 53 117 203 74 51 98 302 369 173 25 114 87 73 126 92 67 74 125 200 166 219 184
5409 184 191 79 53 149 221 187 125 62 114 163 136 78 160 95 126 411 311 43 169 108 41 66 249 102 46 112 74 259 126 70 45
5045 45 105 199 174 100 139 175 126 67 193 141 128 208 90 56 83 217 115 178 126 101 139 137 26 91 93 93 72 159 154 18 86 94 149 94 56
4634 56 104 124 203 86 75 136 86 16 71 82 98 99 129 111 65 87 83 53 88 42 91 161 164 134 36 81 117 250 86 66 101 64 154 42 115
4223 115 142 195 113 114 185 146 131 216 45 277 213 70 142 160 104 260 45 164 158 197 103 63 228 199 61 108 213 55 275 169
3871 169 182 151 131 53 174 68 113 31 196 95 58 70 97 61 198 58 158 170 208 259 233 207 132 165 73 247 334 257 206 42
3519 42 145 251 11 158 64 57 259 89 95 55 123 261 199 45 125 51 66 216 173 51 100 29 76 28 122 45 120 55 159 174 111
3155 111 120 220 191 63 108 80 136 120 70 69 243 118 297 280 202 100 103 116 182 73 128 147 96 164 74 28 81 35 72 159 193 142 110
$$ packed form
5808A55r8k1nM0O3p3k0O4R5J8j30l5%O4Q6j29k3M7K04O7j96j48Q9k7j4N3l4k5PN1P5l4N3l5
5409A84Pj12k6R6P2l4o2o3N2M9k7n8Q2o5L1K85j00k68J26o1o7K5J83j47n6O6l8J85j33n6k5
5045D5O0R4k5p4L9L6m9n9J26n2j3Q0j18l4K7J34j02O3n2k5L8kj11O5K%k1Q7nj36O8QN5n5l8
4634E6M8K0P9j17j1O1n0p0N5J1J6JL0j8m6K2ml0L5m6M9P0Ll0r8M5L6J33j64k0L5l7R0j12P3
4223A15K7N3q2JP1l9j5Q5j71K32o4j43P2J8n6J56k15J19oL9r4m0J65k9j38M7J05j58K20j06
3871A69J3l1k0p8J21j06M5q2J65j01l7J2K7l6J37j40J00J2L8N1k6k6p5L3r2J74Q7p7n1j64
3519D2J03J06k40J47r4pK02j70Om0O8J38o2j54Q0p4J5J50m3j22M9p1M7m8R4p7P5o5J04J5o3
3155A11RJ00k9j28M5k8N6j6n0jJ74j25J79j7p8j02LJ3O6j09N5J9n1O8r0m6N3m6L7Q7L4n1l2
$$ plain form
2768 110 165 212 89 156 217 139 158 129 61 54 212 330 85 127 115 155 111 59 80 47 10 122 120 220 238 77 79 75 145 150 176 215 48
2380 48 14 74 168 334 211 244 170 223 175 97 29 131 78 297 159 211 57 228 132 74 161 110 103 65 87 85 143 163 159 171 283 13
2005 13 136 134 115 119 150 267 244 155 235 135 128 194 379 243 54 177 113 110 91 160 28 89 74 191 308 215 86 157 148 32 107 28
1629 28 240 268 109 144 234 27 31 108 290 156 159 150 150 239 64 248 128 62 91 175 107 102 109 107 298 235 16 195 170 163 222 63 120
1242 120 136 179 188 124 31 79 135 39 67 135 85 127 205 30 144 89 165 3 24 232 219 107 60 210 160 66 87 160 123 63 170 310
866 310 178 154 146 245 216 80 220 236 364 331 67 19 141 194 90 88 273 215 41 193 86 130 110 644 1266 1070 300 288 206
526 206 198 89 136 167 119 218 249 42 53 74 143 86 114 208 178 176 86 207 224 133 129 153 194 72 159 182 87 97 80 161 220 206 141 18
127 18 60 146 78 57 136 149 76 179 111 131 177 131 49 99 28 91 40 246 232 56 270 190 95 90 141 98 88
$$ packed form
2768A10N5M7j23O7O1p8J9k9o8pJ58J18k45M2j2M0m4n2K1l3l7J12kJ00J8j61KmP0NK6L9j67
2380D8l4O0R4J66j23L3p4N3m8p8o8J02n3K19j38N2j54J71r6n8Q7n1pl8K2kN8K0mJ2J12k70
2005A3J23kj9ML1J17k3q9Q0j00pO6J85j36j89J23o4lj9O9j32O1j5J17J17r3j29P1rj16P5p9
1629B8K12K8j59L5R0k07MP7J82j34Lr%Q9j75J84j20o6K9Q4o8nPkJ91o3k19J79k5pN9j59N7
1242A20J6M3Ro4r3M8N6r6K8O8n0M2P8j75J14n5P6j62K1K08j3j12m7J50n0r4K1P3l7o0J07J40
866C10j32k4qR9k9j36J40J6J28l3k64m8J22N3j04kJ85n8j74J52j07M4k0N34O22j96p70j2q2
526B06qj09M7L1m8R9L1k07J1K1O9n7K8R4l0kr0J21J7r1mK4M1j22Q7K3r5J0j7Q1N9j4o5j23
127A8M2Q6o8k1P9J3p3J03o8K0M6m6q2N0p1O3n1K06j4j76K14q0r5nN1m3j0
-190H8
##PAGE=	F1=-12666.1
##FIRST=	25169.313707327481097,	5807.6787752999953227,	0
##DATA TABLE=	(F2++(Y..Y)), PROFILE
$$ plain form
5808 130 52 40 45 57 156 70 46 98 143 193 155 109 51 96 182 10 1 141 338 401 188 42 110 49 34 76 63 96 106 156 223 175 228
5420 228 225 210 72 20 148 213 177 165 110 125 178 170 89 155 111 157 401 272 58 143 154 54 64 247 135 71 87 104 215 64 81
5056 81 111 163 191 121 129 138 182 104 103 200 140 119 222 92 58 55 212 69 157 153 115 148 143 24 49 71 75 61 187 176 49 100 114 167 136
4646 136 52 118 67 199 101 28 120 94 43 81 115 141 141 116 105 97 28 97 61 108 56 73 109 181 113 70 124 170 255 48 82 93 104 110 48
4235 48 118 118 163 96 141 148 165 60 204 68 219 197 42 156 185 96 293 61 156 179 186 63 74 258 276 19 89 222 47 222
3883 222 182 235 129 181 117 118 127 49 34 206 115 38 45 102 59 176 44 187 223 186 189 224 235 179 173 62 266 346 225 168 64 112 218
3495 218 29 101 31 128 307 80 131 91 104 244 165 84 93 16 79 213 133 17 104 70 97 24 88 30 190 96 181 190 112 126 258 223
3120 223 87 92 86 155 111 106 51 205 47 312 270 208 100 103 110 131 76 117 130 132 147 84 38 81 42 62 92 193 155 122 173 227 69 142
$$ packed form
5808A30p8j2NJ2R9q6k4N2M5N0l8m6n8M5Q6j72rJ40J97O3k13j46O8o1j5M2j3L3J0N0O7m8N3
5420B28lj5j38n2J28O5l6j2n5J5N3qq1O6m4M6K44j29k14Q5J1j00J0J83j12o4J6J7J11j51J7
5056H1L0N2K8p0QRM4p8jR7o0k1J03j30l4lJ57j43Q8ml8L3nj19K5K2Mj4J26j1j27N1J4N3l1
4646A36q4O6n1J32r8p3R2k6n1L8L4K6%k5j1qo9O9l6M7n2J7L6P2o8m3N4M6Q5k07L4J1J1Oo2
4235D8P0%M5o7M5PJ7j05J44j36J51k2j55J14K9q9J97k32R5K3Pj23J1J84J8k57P0J33j75J75
3883B22m0N3j06N2o4JRp8j5J72r1p7PN7m3J17j32J43L6l7LL5J1n6oj11K04Q0j21n7j04M8J06
3495B18j89P2p0R7J79k27N1m0J3J40p9q1Rp7O3J34q0j16Q7l4K7p3O4n8J60r4Q5Rp8J4J32l5
3120B23j36NoO9m4nn5J54j58K65m2o2j08LPK1n5M1J3KJ5o3m6M3l9K0L0J01l8l3N1N4j58P3
$$ plain form
2721 142 200 128 147 110 14 44 157 293 71 146 161 148 91 39 111 38 22 99 154 194 230 85 80 51 148 172 194 223 92 34 96 170 303
2333 303 186 306 201 216 197 108 104 87 72 288 170 197 56 172 110 55 168 74 137 30 106 93 210 216 154 137 282 45 159
1993 159 138 100 35 147 282 247 126 211 130 123 228 383 260 12 147 63 109 85 124 58 50 0 115 254 223 99 74 195 37
1653 37 116 35 218 200 117 185 238 33 82 117 240 96 154 139 166 237 76 261 145 74 152 207 113 142 38 120 282 233 18 178
1300 178 174 177 229 82 144 137 159 199 134 27 64 121 36 135 225 116 145 249 64 140 86 182 31 47 255 200 116 28 260 175 58 98
925 98 152 111 72 171 328 171 160 174 189 162 80 198 216 370 326 66 28 172 225 149 110 296 190 73 232 104 164 148 900 1898
573 1898 1603 432 385 188 200 113 152 159 111 218 230 5 35 21 154 181 73 177 132 178 66 189 233 157 153 181 231 52 131 156
221 156 104 138 138 122 217 241 155 63 45 131 66 83 175 99 43 135 166 170 156 134 36 66 16 125 37 278 205 84 261 173 78 86 126 90 83
$$ packed form
2721A42N8p2J9l7r6L0J13J36k22P5J5j3n7n2P2p3j6P7N5M0L6j45nk9R7K4K2K9j31n8O2P4J33
2333C03j17J20j05J5j9q9mj7j5K16j18K7j41J16o2n5J13r4O3j07P6j3J17Oo2j7J45k37J14
1993A59k1l8o5J12J35l5j21Q5q1pJ05J55j23k48J35q4M6k4L9o6qn0J15J39l1j24k5J21j58
1653C7P9q1J83j8q3O8N3k05M9L5J23j44N8j5K7P1j61J85j16p1P8N5r4K9j04Q2J62m9k15J60
1300A78mLN2j47O2pK2M0o5j07L7N7q5R9R0j09K9J04j85P6n4R6j51J6K08n5q4q8K32q5j17M0
925I8N4m1l9R9J57j57j1J4J5k7q2J18J8J54m4k60l8J44N3p6l9J86j06j17J59j28O0j6P52R98
573A898k95j171m7j97J2q7L9Pm8J07J2k25L0j4J33K7j08J04m5M6j12J23M4p6mK8N0j79P9K5
221A56n2L4%j6R5K4q6r2j8Q6o5J7R2p6n6R2L1Mj4k2r8L0n0J09q8K41p3j21J77q8r5QM0l6p
-190H3
##PAGE=	F1=-12768.3
##FIRST=	25169.313707327481097,	5807.6787752999953227,	0
##DATA TABLE=	(F2++(Y..Y)), PROFILE
$$ plain form
5808 93 41 42 65 49 168 85 41 85 94 187 200 171 48 79 176 86 50 163 336 384 182 57 94 11 18 25 53 132 133 166 229 176 211 247 228
5397 228 70 7 143 196 157 192 158 132 190 200 105 146 121 200 382 232 88 112 174 87 69 243 156 91 90 145 166 21 81 180 239 173
5021 173 74 184 133 181 119 113 198 154 137 216 81 56 78 191 39 117 154 110 138 132 46 46 52 59 93 203 177 62 122 128 179 170 57 138 30
4610 30 183 106 34 84 96 83 128 151 176 171 89 72 129 60 120 92 123 50 55 77 170 87 106 166 224 249 92 83 87 154 78 75 107 103 124 77 168
4176 168 101 186 18 173 140 172 184 9 173 209 73 295 74 145 199 191 39 73 264 324 89 70 212 67 162 193 272 88 219
3836 219 180 53 152 51 40 201 139 34 26 103 89 146 39 214 256 146 115 203 251 225 190 69 282 337 190 126 92 83 179 66
3484 66 60 56 187 341 66 153 112 84 231 123 111 52 39 96 177 98 25 97 95 120 50 59 47 258 131 202 196 117 117 272 269 92 95 94 172
3073 172 102 118 52 181 36 272 227 209 101 93 123 102 73 109 110 135 107 97 45 79 42 92 37 180 155 125 155 227 59 125 170 111 120
$$ packed form
5808I3n2JK3j6J19q3m4M4RR3J3k9j23L1R7r0l6J13J73M8k02j25L7q3PPK8P9JL3O3n3L5L6j9
5397B28j58o3J36N3l9L5l4k6N8J0r5M1k5P9J82j50j44K4O2q7j8J74q7o5jN5K1j45O0R9N9o6
5021A73r9J10n1M8o2oQ5m4j7P9j35k5K2J13j52P8L7m4K8oq6%OPL4J10k6j15O0ON1rj13Q1j08
4610C0J53p7p2N0J2j3M5K3K5nq2j7N7o9O0k8L1p3NK2R3q3J9O0N8K5j57rMO7p6lL2mK1m7R1
4176A68o7Q5j68J55l3L2J2j75J64L6j36K22k21P1N4qj52L4J91O0k35j9J42j45R5L1P9j84J31
3836B19l9j27R9j01j1J61o2j05qP7j4N7j07J75M2j10l1Q8M8k6l5j21K13N5j47o4l4rR6j13
3484F6omJ31J54k75Q7m1k8J47j08j2n9j3N7Q1p9p3P2kK5p0Rj2K11j27P1op9%J55lj77LjP8
3073A72p0J6o6J29j45K36m5j8j08qL0k1k9L6JK5k8j0n2L4l7N0n5J43k5l0L0P2j68O6M5n9R
$$ plain form
2685 120 89 42 117 91 231 60 158 189 121 53 34 156 70 20 90 175 170 202 102 72 53 155 183 210 217 136 85 119 137 244 187 341
2310 341 218 184 203 103 166 30 81 255 166 178 61 100 87 50 149 31 171 110 112 116 283 269 155 108 280 83 170 169 113 38 155
1946 155 285 215 73 167 126 120 248 363 257 34 146 24 95 78 89 79 83 73 31 212 235 102 30 233 42 121 54 206 133
1606 133 120 188 220 69 149 148 171 39 131 115 191 227 94 278 179 89 206 237 108 171 38 160 247 214 28 158 183 185 221 101
1254 101 157 113 127 207 131 24 90 117 99 184 291 140 154 265 102 127 79 172 57 74 244 166 110 32 297 203 64 85 131 85
901 85 60 154 319 166 151 202 146 128 83 170 171 334 286 100 35 195 231 187 129 315 163 105 267 121 172 213 1114 2430 2050 536
549 536 480 187 192 131 197 152 116 211 207 45 45 20 166 272 48 139 81 159 31 138 200 145 160 201 266 60 113 123 117 171 185 103 198
162 198 262 158 126 39 107 66 120 197 51 73 91 229 203 114 131 16 46 31 153 32 285 167 113 256 170 45 86 112 69 82
$$ packed form
2685A20l1m7P5k6J40j71R8L1o8o8j9J22q6n0P0Q5nL2j00l0j9J02K8K7Pq1n1L4J8J07n7J54
2310C41j23l4J9j00O3j36N1J74q9J2j17L9j3l7R9j18J40o1KMJ67j4j14m7J72j97Q7jn6p5J17
1946A55J30p0j42R4m1oJ28J15j06k23J12j22P1j7J1j0Mj0m2J81K3j33p2K03j91P9o7J52p3
1606A33j3O8L2j51Q0jK3j32R2j6P6L6j33J84r9r0J17L1j29O3j33J22Q7l3j86J30K5KL6j20
1254A01N6m4J4Q0p6j07O6K7j8Q5J07j51J4J11j63K5m8R3j15J7J70p8n6p8K65r4j39K1M6m6
901H5k5R4J65j53j5N1n6j8m5Q7JJ63m8j86o5J60L6m4n8J86j52n8J62j46N1M1R01J316l80j514
549E36n6k93No1O6m5l6R5mj62%k5J46J06k24R1n8P8j28J07O2n5J5M1O5k06N3J0oN4J4q2R5
162A98O4j04l2q7O8m1N4P7j46K2J8J38k6q9J7j15L0j5J22j21K53j18n4J43q6j25M1K6m3J3
-190H2
##PAGE=	F1=-12870.6
##FIRST=	25169.313707327481097,	5807.6787752999953227,	0
##DATA TABLE=	(F2++(Y..Y)), PROFILE
$$ plain form
5808 55 30 48 83 68 165 104 27 72 63 180 216 229 58 68 190 180 99 160 297 324 160 68 61 25 50 34 69 164 144 156 218 172 173 245
5409 245 240 76 24 143 190 134 200 197 135 194 226 117 132 126 246 361 195 119 98 164 122 68 233 158 102 112 187 127 3 85 230 299
5033 299 147 87 247 138 169 144 87 188 153 152 187 57 47 110 157 43 60 132 84 109 113 56 52 41 74 147 215 159 53 144 131 185 190
4646 190 78 161 18 148 108 96 34 102 107 171 165 197 182 52 26 164 130 145 127 134 32 37 65 136 70 125 195 264 232 123 65 88 199
4258 199 73 93 83 102 86 62 188 43 201 98 125 195 169 195 45 183 224 43 259 79 131 212 206 52 47 248 334 144 49
3918 49 184 86 109 201 287 41 236 228 64 140 115 50 178 156 43 14 107 127 121 44 237 261 94 65 181 256 265 212 99 300 304 156
3542 156 93 121 60 143 107 64 90 228 360 46 158 117 66 222 70 124 19 79 113 118 93 55 83 93 133 88 85 78 296 146 217 186
3167 186 131 104 263 311 78 119 93 178 94 106 78 181 110 189 169 215 107 69 128 101 62 105 90 110 66 109 51 78 39 136 79 158 136
$$ packed form
5808E5k5J8L5j5R7o1p7M5rJ17L6J3j71J0J22j0q1O1J37K7j64r2pl6K5j6L5R5k0J2O2m6JP2
5409B45nj64n2J19M7n6O6lo2N9L2j09J5oJ20J15j66p6k1O6m2n4J65p5n6J0P5o0j24Q2J45O9
5033B99j52o0J60j09L1k5n7J01l5jL5j30j0O3M7j14J7P2m8K5Mn7mj1L3P3O8n6j06R1j3N4N
4646A90j12Q3j43J30m0j2o2O8NO4oL2j5j30k6J38l4J5j8Pj02NK8P1o6N5P0O9l2j09n8K3J11
4258A99j26K0j0J9j6k4J26j45J58j03K7P0k6K6j50J38M1j81K16j80N2Q1oj54nK01Q6j90r5
3918D9J35r8K3R2Q6k46J95qj64P6k5o5J28k2j13k9R3K0op7J93K4j67k9J16P5Rn3j13K01Mj48
3542A56o3K8o1Q3l6m3K6J38J32l14J12m1n1J56j52N4j05O0L4Nk5l8K8J0M0m5lpK18j50P1l1
3167A86n5k7J59M8k33M1k6Q5q4J2k8J03p1P9k0M6j08l8N9k7l9M3j5K0m4M3n8K7l9R7n7P9k2
$$ plain form
2779 136 114 118 212 62 107 142 90 83 74 98 184 39 162 71 160 197 86 5 57 198 117 13 85 177 149 161 144 57 82 169 180 219 201
2392 201 165 123 134 85 165 204 348 219 136 197 92 201 36 110 214 162 161 75 39 77 89 107 25 188 195 106 144 342 303 155 96
2028 96 286 120 164 209 153 92 162 272 154 14 124 129 117 251 324 235 81 183 93 66 79 71 73 120 137 58 197 246 91 104 245
1664 245 46 117 63 195 87 137 158 180 115 207 186 103 26 105 86 216 212 102 282 213 105 237 248 95 184 94 197 209 189 35
1312 35 139 194 181 195 117 161 78 109 207 123 33 126 118 134 204 325 155 146 240 138 129 67 144 78 94 206 124 91 64 317 238 81 52
925 52 109 46 70 125 291 169 137 216 119 110 92 145 118 271 229 157 46 200 207 188 122 328 141 122 293 137 147 288 1233 2734
573 2734 2307 591 545 191 167 147 239 145 138 193 184 93 83 54 179 341 65 98 49 125 37 64 145 103 151 205 291 86 105 95 119 191
197 191 219 117 169 271 156 184 50 75 64 145 198 92 142 88 286 228 60 116 26 72 54 164 32 267 123 129 245 172 39
$$ packed form
2779A36k2MR4j50M5L5n2prK4Q6j45J23r1Q9L7j11q1N2J41q1j04P2R2k8J2j7q7K5Q7J1L9j8
2392B01l6m2J1m9Q0L9J44j29q3O1j05J09j65P4J04n2jq6l6L8J2J8q2J63Pq9L8J98l9j48n9
2028I6J90j66M4M5n6o1P0J10j18j40J10Nj2J34P3q9j54J02r0k7J3qKM7J7p9J39M9j55J3J41
1664B45j99P1n4J32j08N0K1K2o5R2k1q3p7P9j9J30mj10J80o9j08J32J1j53Q9r0J03J2k0j54
1312C5J04N5j3J4p8M4q3L1R8q4r0R3qJ6P0J21j70rR4j02ro2P7o6J6J12q2l3k7K53p9j57k9
925E2N7o3K4N5J66j22l2P9r7rj8N3k7J53m2p2j11J54Pj9o6K06j87j9J71j56J0J41R45J501
573B734m27j716m6l54k4k0R2r4pN5rr1j0k9J25J62k76L3m9P6q8K7Q1m2M8N4Q6k05J9j0K4P2
197A91K8j02N2J02j15K8j34K5j1Q1N3j06N0n4J98n8j68N6r0M6j8J10j32K35j44OJ16p3j33
$$ plain form
-143 39 104 107 45 85
$$ packed form
-143C9O5Lo2M0
-190H5
##PAGE=	F1=-12972.9
##FIRST=	25169.313707327481097,	5807.6787752999953227,	0
##DATA TABLE=	(F2++(Y..Y)), PROFILE
$$ plain form
5808 39 21 59 90 98 145 126 19 79 57 159 210 272 79 69 220 270 140 134 233 235 134 81 17 44 66 61 87 182 142 127 189 170 135 224
5409 224 241 85 27 155 205 111 191 219 134 185 244 121 115 127 285 344 167 148 102 125 149 61 213 142 107 128 218 122 14 104 247
5045 247 324 120 138 304 153 152 171 37 176 132 146 139 27 24 118 118 58 9 102 53 81 100 43 38 48 109 201 226 126 45 156 121 184
4657 184 194 116 185 10 96 113 162 28 114 106 189 151 199 169 13 49 201 186 166 155 142 27 23 70 83 83 122 205 279 204 118 36 98 226
4258 226 96 87 51 109 60 50 195 23 204 173 68 221 200 224 87 181 228 36 192 79 118 210 214 79 19 219 305 179 31
3918 31 149 91 74 208 281 15 226 251 134 100 157 61 137 160 58 33 120 161 116 60 254 237 43 56 164 252 294 233 133 322
3566 322 251 125 84 146 43 118 140 77 106 249 365 39 146 109 43 211 38 123 60 117 121 49 120 92 69 59 130 128 127 103 298 136
3190 136 221 161 153 97 241 332 52 146 79 173 89 75 123 186 160 86 139 225 123 42 108 104 50 104 78 72 77 121 59 81 37 177 131 132 103
$$ packed form
5808C9j8L8L1QM7j9j07O0k2J02N1O2j93j0J51N0j30oR9Kj01n3o4K7K2nK6R5m0j5O2j9l5Q9
5409B24J7j56n8J28N0r4Q0K8q5N1N9j23oJ2J58N9j77j9m6K3K4q8J52p1l5K1R0r6j08R0J43
5045B47P7k04J8J66j51jJ9j34J39m4J4pj12lR4%o0m9R3m9K8J9n7nJ0O1R2K5j00q1J11l5O3
4657A84J0p8O9j75Q6J7M9j34Q6qQ3l8M8l0j56L6J52j5k0j1j3j15mM7J3%L9Q3P4p5q6q2O2J28
4258B26j30rl6N8m9j0J45j72J81l1j05J53k1K4j37R4M7j92J56j13L9R2Mj35o0K00Q6j26j48
3918C1J18n8j7J34P3k66K11K5j17l4N7r6P6K3j02k5Q7M1m5n6J94j7j94J3J08Q8M2o1j00J89
3566C22p1j26m1O2j03P5K2o3K9J43J16l26J07l7o6J68j73Q5o3N7Mp2P1k8k3j0P1kjk4J95j62
3190A36Q5o0qn6J44R1k80R4o7R4q4j4M8O3k6p4N3Q6j02q1O6mn4N4k6oNM4o2K2m4J40m6Jk9
$$ plain form
2779 103 94 74 184 64 90 129 78 76 72 144 229 62 102 95 152 187 72 57 80 225 158 9 75 155 124 124 198 55 111 190 163 217 180 166
2380 166 140 134 78 80 220 332 204 101 189 87 206 100 154 193 169 147 90 49 78 153 49 65 184 266 100 170 373 310 149 107
2028 107 301 153 146 247 209 127 162 239 78 86 124 146 114 237 271 199 128 227 151 30 97 72 40 136 187 126 196 247 72 163 225 55
1653 55 110 56 172 77 167 116 134 158 244 216 58 33 95 68 228 193 100 263 229 117 237 232 80 180 127 207 176 168 32 127 203 162
1277 162 151 127 161 65 132 198 110 53 153 112 136 195 324 160 122 174 165 140 47 115 89 102 164 84 67 119 318 263 100 9 110 36
901 36 130 93 254 180 129 209 91 101 103 135 85 203 178 209 66 180 160 151 85 334 128 120 304 150 97 352 1221 2734 2310 584
549 584 557 179 127 170 260 137 174 162 163 138 127 104 200 370 90 65 74 87 95 39 122 63 132 187 297 115 110 102 113 194 241 140 152 275
150 275 150 225 73 37 52 148 187 162 201 131 328 244 52 90 62 116 68 153 39 230 75 129 217 162 69 139 112 38 85
$$ packed form
2779A03rk0J10j20K6L9n1kmP2Q5j67M0pN7L5j15j5K3J45o7j49O6Q0l1%P4j43N6P9k7N4l7j4
2380A66k6on6KJ40J12j28j03Q8j02J19j06N4L9k4k2n7m1K9P5j04J6J19Q2j66P0K03o3j61m2
2028A07J94j48pJ01l8q2L5P7j61QL8K2l2J23L4p2p1R9p6j21O7k5l2R6N1o1P0N1j75R1O2j70
1653E5N5n4J16r5R0n1J8K4Q6k8j58k5O2k7J60l5r3J63l4j12J20nj52J00n3Q0l1qj36R5P6m1
1277A62j1k4L4r6O7O6q8n7J00m1K4N9J29j64l8N2rk5r3O8k6J3O2q0j7N2J99n5j63r1J01p4
901C6R4l7J61p4n1Q0j18J0KL2n0J18k5L1j43J14k0ro6K49k06qJ84j54n3K55Q69J513m24j726
549E84k7l78n2M3R0j23L7j2Jk5j1k3R6J70k80k5RJ3Qn6Q3n9O9N5J10j82nqJ1Q1M7j01J2J23
150B75j25P5j52l6J5R6L9k5L9p0J97q4j92L8k8N4m8Q5j14J91j55N4Q8n5r3P0k7p4M7
-190H5
##PAGE=	F1=-13075.1
##FIRST=	25169.313707327481097,	5807.6787752999953227,	0
##DATA TABLE=	(F2++(Y..Y)), PROFILE
$$ plain form
5808 56 20 69 81 125 108 145 30 109 72 128 190 287 98 87 253 342 176 89 158 138 119 98 30 48 55 70 97 185 143 91 149 174 140 202
5409 202 230 93 14 169 224 92 167 220 136 163 253 111 97 129 311 329 147 170 102 67 163 68 182 115 105 127 231 152 22 129
5056 129 227 305 94 182 344 168 138 199 25 170 103 125 79 33 15 100 78 65 69 98 58 101 104 12 12 71 144 246 232 86 97 156 100
4669 100 177 185 161 206 32 41 126 226 81 125 78 176 117 177 139 32 97 225 218 179 171 142 46 31 87 23 114 99 194 264 169 88 58 115
4270 115 226 131 57 28 115 60 43 191 92 196 235 43 219 227 251 116 173 225 73 107 81 105 190 200 102 69 188 247 189 21 122
3906 122 80 58 213 258 29 190 247 192 50 163 70 89 152 73 71 139 185 125 83 266 191 9 70 159 241 305 247 159 344 184 100
3542 100 91 158 26 104 157 68 97 248 359 62 122 93 15 190 90 118 110 144 113 33 151 128 66 23 110 163 152 117 265 104 214
3178 214 123 180 95 217 329 35 157 67 161 88 32 175 189 179 27 165 229 143 52 65 95 53 103 83 41 122 132 68 89 45 210
$$ packed form
5808E6l6M9J2M4j7L7j15P9l7N6O2R7j89j1J66Q9j66q7O9k0j9k1o8J8PJ5K7Q8m2n2N8K5l4O2
5409B02K8j37p9J55N5j32P5N3q4K7R0j42j4L2J82J8j82K3o8l5R6r5J14o7j0K2J04p9j30J07
5056A29R8P8k11Q8J62j76l0O1j74J45o7K2m6m6j8Q5k2j3MK9m0M3Lr2%N9P3J02j4j46J1N9n6
4669A00P7Qk4M5j74RQ5J00j45M4m7R8n9O0l8j07O5J28pl9qk9r6j5N6o4R1j5R5P0r5q1l0N7
4270A15J11r5p4k9Q7n5j7J48r9J04L9j92J76QK4j35N7N2j52L4k6K4Q5J0r8l3J19N9n8j68J01
3906A22m2k2J55M5k29J61N7n5j42J13r3J9O3p9kO8M6o0m2J83p5j82O1Q9Q2O4n8q8J85j60q4
3542A00rO7j32P8N3q9K9J51J11k97O0k9p8J75j00K8qL4l1q0J18k3o2m3Q7N3j1l5J48j61J10
3178B14r1N7q5J22J12k94J22r0R4p3n6J43J4j0j52J38O4q6r1J3L0m2N0k0m2Q1J0o4K1m4J65
$$ plain form
2815 210 161 107 73 92 37 147 58 81 126 83 130 83 173 244 95 65 117 131 162 91 112 94 234 181 13 58 111 92 106 245 81 130
2439 130 219 139 198 155 135 140 121 133 25 222 303 174 113 189 94 181 151 199 213 178 130 96 73 79 225 16 108 168 314 102 184 367
2063 367 289 135 122 312 177 126 274 266 145 149 189 10 162 162 172 108 208 215 159 171 254 175 48 122 73 40 129 218 167 191 232 52
1688 52 192 179 69 105 34 136 80 196 99 113 194 255 227 35 15 104 73 218 170 94 223 214 120 208 191 71 163 133 181 142 153 19
1312 19 126 205 130 93 131 162 85 168 181 90 79 161 89 108 162 294 154 96 85 177 135 21 106 87 94 140 52 57 190 302 267 111 33
925 33 144 92 203 71 215 195 130 182 53 100 108 135 85 148 156 236 89 136 115 84 47 331 122 102 294 149 65 388 1076 2425
573 2425 2057 515 507 143 83 201 258 126 207 125 148 173 165 165 234 355 103 57 118 59 147 107 167 99 109 149 276 150 130 143 109
209 109 179 248 151 171 282 138 240 99 5 40 130 170 212 232 178 350 251 116 65 102 157 68 125 51 179 26 111 170 131 85 172
$$ packed form
2815B10m9n4l4J9n5J10q9K3M5m3M7m7R0P1j49l0N2J4L1p1K1j8J40n3j68M5N3j9J4J39j64M9
2439A30Q9q0N9m3k0Nj9J2j08J97Q1j29o1P6r5Q7l0M8J4l5m8l4k3OJ46k09R2O0J46k12Q2J83
2063C67p8j54j3J90j35n1J48qj21MM0j79J52%J0o4J00Pn6J2Q3p9j27P4m9l3Q9Q9n1K4M1j80
1688E2J40j3j10L6p1J02n6J16r7J4Q1O1k8j92k0Q9l1J45m8p6J29rr4Q8j7j20R2l0M8l9J1j34
1312A9J07P9p5l7L8L1p7Q3J3r1j1Q2p2J9N4J32j40n8j1R2m2j14Q5j9PM6q8NJ33J12l5j56p8
925C3J11n2J11j32J44k0o5N2j29M7QK7n0O3QQ0j47M7k1l1l7K84k09k0J92j45q4L23O88J349
573B425l68j542ql64o0J18N7j32Q1q2K3K5q%O9J21k52m6O1n9Q8m0O0o8J0M0J27j26k0J3l4
209A09P0O9r7K0J11j44J02j41r4L5R0M0M2K0n4J72r9j35n1L7N5q9N7p4J28j53Q5N9l9m6Q7
$$ plain form
-155 172 125 51 76
$$ packed form
-155A72m7p4K5
-190G6
##PAGE=	F1=-13177.4
##FIRST=	25169.313707327481097,	5807.6787752999953227,	0
##DATA TABLE=	(F2++(Y..Y)), PROFILE
$$ plain form
5808 76 26 77 59 145 60 160 36 140 99 97 161 267 103 112 277 387 208 35 91 60 124 115 69 51 30 70 95 179 163 56 117 185
5432 185 194 196 212 97 26 176 226 77 135 199 144 133 250 88 81 134 320 315 139 182 84 33 159 99 142 83 99 110 224 193 36 141
5056 141 176 249 70 207 356 171 137 225 69 173 81 118 20 72 73 74 45 64 117 121 93 156 125 40 39 96 174 279 230 51 175 154
4681 154 75 163 173 200 216 68 47 145 275 124 127 32 135 82 135 100 66 128 225 221 186 170 132 66 55 111 42 145 64 160 221 131 85
4294 85 121 142 198 161 33 54 112 76 42 177 155 182 280 83 195 228 254 125 166 225 120 51 92 95 150 155 115 126 163 170 176 13 111 54
3894 54 55 210 224 29 139 220 222 39 134 73 46 140 89 114 157 194 136 103 270 131 28 107 165 225 293 249 171 356 116 84 92 150
3519 150 8 93 152 31 69 226 346 93 93 75 26 155 151 113 149 149 90 89 168 153 75 96 77 194 154 120 212 59 197 82 204
3155 204 88 199 307 48 145 88 153 92 16 222 196 165 96 207 220 158 91 30 81 59 98 99 36 156 142 75 96 69 234 166 86
$$ packed form
5808G6n0N1j8Q6q5J00j24J04m1kO4J06j64RJ65J10j79j73N6l1O4rm6j8k1M0K5Q4j6j07O1O8
5432A85RKJ6j15p1J50N0j49N8O4n5j1J17j62pN3J86nj76M3r8n1J26o0M3n9J6J1J14l1j57J05
5056A41L5P3j79J37J49j85l4Q8j56J04r2L7r8N2JJk9J9N3Mk8O3l1q5jN7P8J05m9j79J24k1
4681A54p9Q8J0K7J6j48k1R8J30j51Lr5J03n3N3l5l4O2R7ml5j6l8o6j1N6o9J03q1R6O1r0m6
4294H5L6K1N6l7j28K1N8l6l4J35k2K7R8j97J12L3K6j29M1N9j05o9M1LN5Nm0J1L7POj63R8n7
3894E4JJ55J4j95J10Q1Kj83R5o1k7R4n1K5M3L7n8l3J67j39j03P9N8O0O8m4p8J85k40l2QN8
3519A50j42Q5N9j21L8J57J20k53%j8m9J29ml8L6%n9jP9j5p8K1j9J17m0l4R2j53J38j15J22
3155B04j16J11J08k59R7n7O5o1p6K06k6l1o9J11J3o2o7o1N1k2L9Jo3J20j4o7K1k7J65o8q0
$$ plain form
2791 86 82 135 27 110 40 79 117 98 197 97 184 224 101 59 134 100 130 113 156 101 227 184 23 45 56 57 103 272 116 135 254 131
2416 131 165 132 76 135 105 178 80 205 265 132 150 195 105 132 176 232 255 177 104 91 73 83 292 78 156 160 333 110 182 323 247 116
2040 116 127 307 186 117 285 309 151 129 139 65 217 195 190 99 172 163 127 208 252 157 102 139 69 110 107 230 174 176 203 39 192 120 78
1653 78 110 30 91 72 207 124 138 220 243 222 18 48 116 96 187 144 94 176 168 109 161 136 67 135 115 124 108 150 4 138 200 88 31 126
1254 126 164 103 189 160 61 108 144 41 64 116 249 140 106 81 170 95 35 119 70 70 141 36 69 262 277 241 106 67 189 148 261
890 261 69 177 204 135 150 48 108 104 133 95 119 161 234 106 79 109 20 82 317 118 88 262 132 110 389 831 1878 1608 400
549 400 404 84 55 226 234 112 226 89 139 195 186 220 273 301 107 72 157 49 177 152 226 164 87 100 232 196 159 185 111 149 239 143
174 143 219 291 121 227 125 49 43 105 144 226 228 209 349 251 179 75 142 186 53 90 62 119 20 80 114 83 79 187 140 60 63
$$ packed form
2791H6mN3j08Q3p0L9L8j9R9j00Q7M0j23m2P5l4L0j7M3n5J26m3j61K2J1JM6J69j56J9J19j23
2416A31L4l3n6N9l0P3r8J25O0j33J8M5r0K7M4N6K3p8p3j3j8J0K09k14P8MJ73k23P2J41p6j31
2040A16J1J80j21o9J68K4j58k2J0p4J52k2nr1P3rl6Q1M4r5n5L7p0M1lJ23n6KK7j64J53p2m2
1653G8L2q0O1j9J35q3J4Q2K3k1k04L0O8k0R1m3n0Q2qn9N2k5o9O8k0Rj6M2j46J34O2j12n7R5
1254A26L8o1Q6k9r9M7L6j03K3N2J33j09l4k5Q9p5o0Q4m9%P1j05L3J93J5l6j35l9J22m1J13
890B61j92J08K7o9J5j02O0mK9l8K4M2P3j28k7L0q9O2K35j99l0J74j30k2K79M42J047k70j208
549D00Ml20k9J71Qj22J14j37N0N6rL4N3K8j94l5Q5j08J28k5P4o2p7J3J32l6l7K6p4L8R0r6
174A43P6P2j70J06j02p6oO2L9Q2Kj9J40r8p2j04O7M4j33L7k8N7r9O0L4l1mJ08m7q0L
-190F3
##PAGE=	F1=-13279.6
##FIRST=	25169.313707327481097,	5807.6787752999953227,	0
##DATA TABLE=	(F2++(Y..Y)), PROFILE
$$ plain form
5808 87 38 79 41 158 50 168 29 155 125 76 124 214 93 136 286 399 235 23 47 56 137 127 93 70 54 78 86 172 199 30 116
5444 116 202 258 201 191 100 67 175 205 67 100 159 147 104 233 61 63 143 312 295 144 182 53 77 139 138 97 59 87 82 197 224 62
5068 62 133 113 171 48 211 337 158 150 243 92 183 71 155 31 108 140 91 35 56 137 134 117 207 152 84 68 114 199 299 217 33 245
4693 245 158 60 143 166 219 211 102 86 165 300 150 119 51 75 77 82 70 90 138 194 196 190 152 111 82 81 134 94 167 32 106 156 103 151 183 179
4270 179 147 174 85 94 99 92 52 156 202 165 305 122 163 201 224 112 163 230 165 99 110 87 95 82 113 169 144 90 149 10 108 22 65 193
3871 193 188 16 98 177 217 78 93 69 20 127 105 151 166 188 145 116 266 74 39 174 179 208 256 234 166 348 73 76 71 127 17 77
3495 77 128 27 57 186 329 120 73 59 67 108 196 114 173 128 78 131 163 162 80 188 43 220 140 116 157 23 176 56 217 74
3143 74 194 274 64 115 130 154 100 71 252 216 126 132 232 195 160 120 74 78 51 85 113 38 166 151 76 97 112 248 150 71 119 204 45
$$ packed form
5808H7m9M1l8J17j08J18j39J26l0m9M8R0j21M3J50J13j64k12K4RQ1j0l4k3j6K4QQ6K7j69Q6
5444A16Q6N6n7j0r1l3J08L0j38L3N9j2m3J29j72KQ0J69j7j51L8j29K4O2jm1l8K8nJ15K7j62
5068F2P1k0N8j23J63J26j79qR3j51R1j12Q4j24P7L2m9n6K1Q1lj7R0n5o8j6M6Q5J00q2j84K12
4693B45q7r8Q3K3N3qj09j6P9J35j50l1o8K4KNj2K0M8N6Kol8m1k9jN3m0P3j35P4N0n3M8L2m
4270A79l2K7q9RNpm0J04M6l7J40j83M1L8K3j12N1O7o5o6J1k3Qj3L1N6k5n4N9j39R8q6M3J28
3871A93nj72Q2P9M0j39J5k4m9J07k2M6J5K2m3k9J50j92l5J35NK9M8k2o8J82k75LnN6j10O0
3495G7N1j01L0J29J43k09m7j4QM1Q8q2N9m5n0N3L2jq2J08j45J77q0k4M1j34J53j20J61j43
3143G4J20Q0k10N1J5K4n4k9J81l6r0OJ00l7l5m0m6Mk7L4K8p5J28j5p5K1J5J36r8p9M8Q5j59
$$ plain form
2756 45 80 17 78 94 112 249 104 180 171 76 83 156 64 97 121 181 101 209 165 44 50 30 50 99 273 143 127 284 151 123 112 7
2380 7 137 110 192 134 168 217 82 182 200 116 67 168 243 292 161 73 92 71 98 343 135 209 175 322 113 161 246 195 99 114 279
2016 279 179 123 279 327 148 113 125 110 243 203 187 87 135 126 108 237 222 100 152 137 75 179 79 220 151 159 169 35 164 75
1664 75 72 120 56 45 52 196 156 182 234 213 210 41 115 119 124 145 121 98 140 109 84 117 83 59 102 93 50 94 163 36 164 192 43 24 111 164
1242 164 101 190 144 24 136 99 36 48 71 204 128 164 173 144 24 86 133 39 38 149 37 87 321 252 189 81 86 227 182 288 77
878 77 139 199 139 146 105 117 88 115 98 114 175 208 110 52 143 77 137 286 115 98 214 107 171 359 547 1221 1065 262 275 13 56
514 56 236 195 103 225 61 134 202 184 249 300 223 113 91 182 58 175 159 263 216 65 65 173 248 188 210 111 109 211 127 270 297
150 297 97 194 147 94 57 100 104 203 196 218 322 246 224 116 179 197 30 60 68 55 58 44 68 32 60 180 151 58 62
$$ packed form
2756D5L5o3O1J6J8J37j45P6rr5PP3r2L3K4O0q0J08m4j21Ok0K0M9J74j30j6J57j33k8j1j05
2380GJ30k7Q2n8L4M9j35J00J8q4m9J01P5M9j31q8J9k1K7K45k08P4l4J47k09M8Q5n1r6J5J65
2016B79j00n6J56M8j79l5J2j5J33m0j6j00M8rj8J29j5j22N2j5o2J04j00J41o9QJ0j34J29q9
1664G5lM8o4j1PJ44m0K6N2k1lj69P4MNK1k4k3M2l1k5L3l4k4M3rm3M4O9j27J28K8j49j9Q7N3
1242A64o3Q9m6j20J12l7o3J2K3J33p6L6Rk9j20O2M7r4jJ11j12N0K34o9o3j08NJ41m5J06k11
878G7O2O0o0Pm1J2k9K7j7J6O1L3r8n8R1o6O0J49j71j7J16j07O4J88J88O74j56q03J3k62M3
514E6J80m1r2J22j64P3O8j8O5N1p7j10k2R1j24J17j6J04m7j51%J08P5o0K2r9kJ02q4J43K7
150B97k00R7m7n3l7M3MR9pK2J04p6k2j08O3J8j67L0Qj3Lj4K4l6K8J20k9r3M
-190F2
##PAGE=	F1=-13381.9
##FIRST=	25169.313707327481097,	5807.6787752999953227,	0
##DATA TABLE=	(F2++(Y..Y)), PROFILE
$$ plain form
5808 86 52 76 56 169 102 171 18 146 139 70 76 141 79 152 276 380 254 64 32 88 148 128 100 103 107 96 74 173 230 10 142 219 308
5420 308 200 175 106 111 171 166 64 67 107 130 86 202 50 41 152 291 269 158 170 43 110 116 168 52 56 67 54 155 236 101 108 76 90
5033 90 27 198 287 132 168 248 95 194 63 216 58 135 204 145 47 44 125 118 115 233 173 111 76 120 219 306 191 28 284 164 72
4669 72 121 165 215 187 121 104 182 296 158 106 104 15 95 42 63 102 132 137 145 192 122 80 96 103 150 132 178 42 39 85 96 231 230 218 103 167
4247 167 152 128 78 101 73 131 224 143 311 140 136 154 160 79 153 231 201 148 125 82 38 19 96 191 121 45 121 40 106 40 83 164 154 31
3848 31 100 126 177 114 95 61 16 111 122 176 163 172 152 117 249 61 44 252 195 190 202 203 144 314 81 74 29 112 50 50 88 94 104 141 315
3437 315 137 73 43 108 59 216 126 180 84 117 152 138 152 71 274 43 237 122 110 110 42 147 63 215 62 200 240 68 90 166
3085 166 163 109 130 256 241 74 127 229 163 151 125 122 93 30 61 120 37 148 157 69 84 166 255 117 62 154 273 78 56 26 70 74 128
$$ packed form
5808H6l4K4k0J13o7O9j53J28po9OO5o2P3J24J04j26j90l2N6O0k0k8LMj1k2R9N7k20J32P7Q9
5420C08j08k5o9NO0nj02LM0K3m4J16j52rJ11J39k2j11J2j27O7ON2j16MJ1j3J01Q1j35Pl2J4
5033I0o3J71Q9j55L6Q0j53R9j31J53j58P7O9n9r8lQ1plJ18o0o2l5M4R9Q7j15j63K56j20r2
4669G2M9M4N0k8o6j7P8J14j38n2kq9Q0n3K1L9L0NQM7p0m2J6PM7j8M6j36lM6J1J35jj2j15O4
4247A67j5k4n0K3k8N8R3q1J68j71mJ8Oq1P4P8l0n3k3m3m4j9P7R5p0p6P6q1O6o6M3Q1j0j23
3848C1O9K6N1o3j9l4m5R5J1N4j3Rk0l5J32j88j7K08n7nJ2Jn9J70k33pm5Q3o2%L8OJ0L7J74
3437C15j78o4l0O5m9J57r0N4r6L3L5j4J4q1K03k31J94j15j2%o8J05q4J52j53J38M0j72K2P6
3085A66ln4K1J26j5j67N3J02o6j2k6lk9o3L1N9q3J11Rq8J5Q2Q9j38n5R2J19j95k2l0M4MN4
$$ plain form
2697 128 269 100 166 95 24 121 189 49 72 115 183 93 190 129 72 68 66 79 87 251 154 110 301 186 87 92 81 142 136 172 173 113 155 30
2298 30 202 200 125 18 130 224 304 135 60 121 109 120 367 183 259 204 285 108 123 149 143 93 90 234 161 134 261 317 138 110 162 133
1923 133 243 183 158 76 105 111 98 254 173 19 185 111 97 229 62 191 107 151 136 45 114 72 46 126 75 8 27 165 178 219 233
1559 233 175 200 81 176 110 150 114 110 100 123 70 60 92 46 39 71 107 27 116 188 70 203 193 9 61 85 158 81 185 141 13 159
1183 159 41 122 78 37 167 137 237 249 102 64 146 134 9 7 150 53 99 355 233 118 39 88 245 186 277 81 96 173 138 181
831 181 162 115 59 76 104 128 183 176 98 95 180 133 169 234 112 128 159 103 213 306 304 596 547 128 166 55 67 223 146 107 209 46 131
444 131 197 155 239 299 141 127 105 188 80 139 131 269 242 41 77 119 289 203 212 97 66 173 122 302 291 73 147 162 139 65 128 54
68 54 156 150 205 271 238 245 158 209 189 46 41 63 25 82 39 70 40 60 158 153 50 80
$$ packed form
2697A28J41j69O6p1p1R7O8j40K3M3O8r0R7o1n7mkJ3QJ64r7m4J91j15r9Nj1O1oL6Jo0M2j25
2298C0J72kp5j07J12R4Q0j69p5O1j2J1K47j84P6n5Q1j77J5K6on0lJ44p3k7J27N6j79k8N2k9
1923A33J10o0k5q2K9Oj3J56q1j54J66p4j4J32j67J29q4M4j5r1O9m2k6Q0n1o7J9J38J3M1J4
1559B33n8K5j19R5o6M0l6mj0K3n3j0L2m6pL2L6q0Q9P2j18J33j0j84N2K4P3p7J04m4j28J46
1183A59j18Q1m4m1J30l0J00J2j47l8Q2j2j25kJ43r7M6K56j22j15p9M9J57n9R1j96J5P7l5M3
831A81j9m7n6J7K8K4N5pp8lQ5m7L6O5j22J6L1n6J10R3kK92m9m19L8j11J2J56p7l9J02j63Q5
444A31O6m2Q4O0j58j4k2Q3j08N9qJ38k7k01L6M2J70q6Rj15l1J07n1J80j1k18P4J5k3p4O3p4
68E4J02oN5O6l3Pq7N1k0j43nK2l8N7m3L1l0K0R8nj03L0
-190H0
##PAGE=	F1=-13484.2
##FIRST=	25169.313707327481097,	5807.6787752999953227,	0
##DATA TABLE=	(F2++(Y..Y)), PROFILE
$$ plain form
5808 70 65 69 82 183 156 173 42 112 137 80 19 70 73 158 251 336 257 90 29 106 148 118 90 136 150 113 67 182 239 19 168 228 332
5420 332 178 165 115 151 174 121 73 32 57 87 89 161 63 19 156 260 237 172 144 69 110 118 184 16 74 43 38 103 225 146 86 81 28 11
5021 11 176 216 101 182 239 85 196 53 269 65 153 251 192 55 36 84 71 85 226 178 113 56 115 235 300 156 17 279 158
4681 158 101 100 160 189 146 120 94 195 265 153 98 137 34 105 47 70 103 121 82 77 188 81 57 107 117 157 152 179 67 31 58 107 294
4294 294 256 252 123 139 207 149 60 111 103 103 216 116 303 133 123 106 74 38 127 217 223 166 134 75 27 100 66 192 91 79 109 78 108
3906 108 89 96 127 129 64 127 73 110 134 142 56 33 87 138 189 150 153 157 104 215 100 55 317 203 171 140 160 114 254 103 80 30 137 90
3507 90 19 42 158 167 108 306 144 87 26 146 43 214 153 174 32 178 152 104 126 47 339 75 238 113 105 67 71 108 96 200
3155 200 61 210 212 59 96 181 170 115 187 236 256 31 88 204 137 139 100 148 114 49 30 117 49 111 158 61 67 221 258 77 59 173
$$ packed form
5808G0nMJ3J01k7J7j31P0K5n7o1N1LQ5R3Q5p9j67o1P7M2l0k8M6J4l7m6J15N7k20J49O0J04
5420C32j54j3n0L6K3n3m8m1K5L0KP2r8m4J37J04k3o5k8p5M1QO6j68N8l1nO5J22p9o0nn3j7
5021A1J65M0j15Q1N7j54J11j43K16k04Q8R8n9j37j9M8j3J4J41m8o5n7N9J20O5j44j39K62j21
4681A58n7jO0K9m3k6k6J01P0j12n5L9j03P1n8K3L3J8l9nJ11j07k4N0J0M0nK7j12l6K7M9J87
4294B94l8mj29J6O8n8q9N1q%J13j00J87j70j0j7l2l6Q9R0On7l2n9m8P3l4J26j01j2L0l1L0
3906A08j9PL1Ko5O3n4L7K4Qq6k3N4N1N1l9LMn3J11j15m5K62j14l2l1K0m6J40j51k3n0J07m7
3507I0p1K3J16Rn9J98j62n7o1J20j03J71o1K1j42J46k6m8K2p9K92k64J63j25ql8ML7j2J04
3155B00j39J49Kj53L7Q5j1n5P2M9K0k25N7J16o7Kl9M8l4o5j9Q7o8O2M7r7OJ54L7j81j8J14
$$ plain form
2779 173 320 119 29 47 55 94 150 254 88 152 6 44 157 226 85 68 102 161 72 177 85 100 84 92 112 71 214 149 90 297 215
2416 215 80 65 150 141 166 129 199 49 79 29 213 194 128 67 71 178 281 110 77 172 171 136 362 222 292 226 230 111 70 54 96 103 69
2028 69 188 145 140 240 283 122 115 212 134 226 146 108 67 83 113 90 260 122 66 196 70 123 251 71 146 56 153 109 75 51 89 17
1653 17 121 78 17 14 126 190 241 215 135 198 110 213 88 173 111 116 101 112 86 55 81 36 8 52 159 82 147 209 101 247 207 34
1277 34 76 53 149 46 188 148 42 169 72 210 104 21 138 170 302 284 58 144 203 122 47 19 144 75 105 362 223 43 20
937 20 74 237 163 230 75 42 125 134 222 197 96 22 27 122 150 185 157 70 138 206 165 166 163 112 156 107 131 225 240 190 149 174 33 128 110 81
514 81 190 93 123 191 56 125 181 102 189 264 74 146 112 173 104 85 82 252 243 14 100 91 303 194 192 66 29 135 141 310 273 59 99
127 99 164 178 57 161 30 104 108 171 203 226 245 189 229 161 98 21 47 81 89 76 96 72 84 137 142 47 99
$$ packed form
2779A73J47k01r0J8QL9N6J04j66O4j46L8J13O9j41j7L4N9q9J05r2J5j6QK0m1J43o5n9K07q2
2416B15j35j5Q5rK5l7P0j50L0n0J84j9o6o1MJ07J03j71l3R5jl5K26j40P0o6Mj19m1j6M2Pl4
2028F9J19m3nJ00M3j61pR7p8R2q0l8m1J6L0k3J70j38n6J30j26N3J28j80P5r0R7m4l4k4L8p2
1653A7J04m3o1lJ12O4N1k6q0O3q8J03j25Q5o2Nj5J1k6l1K6m5k8M4J07p7O5O2j08J46m0j73
1277C4M2k3R6j03J42m0j06J27r7J38j06q3J17L2J32j8k26Q6N9q1p5k8J25o9L0K57j39j80k3
937B0N4J63p4O7j55l3Q3RQ8k5j01p4NR5K8L5k8q7O8O8m1Jln1M4m9K4R4J5n0m1K5j41R5j8k9
514H1J09r7L0O8j35O9N6p9Q7P5j90P2l4O1o9j9lJ70rk29Q6rK12j09kj26l7J06OJ69l7k14M0
127I9O5J4j21J04j31P4MO3L2K3J9n6M0o8o3p7K6L4Qj3K0k4J2N3Nr5N2
-190I9
##PAGE=	F1=-13586.4
##FIRST=	25169.313707327481097,	5807.6787752999953227,	0
##DATA TABLE=	(F2++(Y..Y)), PROFILE
$$ plain form
5808 40 75 57 95 196 190 174 79 62 122 98 39 52 79 152 216 277 238 103 29 115 137 102 72 161 169 118 73 189 220 48 174 221 326
5420 326 131 157 125 178 188 88 87 2 56 23 104 115 75 32 150 223 206 177 108 86 73 152 187 26 96 61 38 52 199 190 88 80 14
5033 14 19 151 148 76 183 221 76 185 50 295 60 163 266 213 51 49 22 4 36 186 159 88 19 102 245 279 116 18 234 129
4681 129 134 89 140 150 97 101 74 204 214 144 98 138 62 98 64 77 98 115 108 27 174 36 70 109 120 157 155 175 79 92 107 117 326 259 274
4270 274 187 104 239 156 64 131 135 68 183 95 288 101 119 81 20 36 80 183 227 152 139 64 66 168 29 171 59 116 107 112 118 134 98
3883 98 92 108 91 146 37 34 134 181 64 66 55 155 193 133 138 157 76 160 141 70 353 197 148 87 116 95 178 107 103 84 188 132 43 38 209
3472 209 220 108 298 135 107 9 183 75 196 193 165 46 229 138 90 87 35 373 103 216 114 102 21 94 58 140 182 66 212
3132 212 191 51 125 175 169 117 234 200 254 60 37 164 128 138 53 144 134 104 35 110 76 83 159 69 75 266 260 63 58 178 334 154 5
$$ packed form
5808D0L5j8L8J01oj6r5j7O0k4n9J3K7P3O4O1l9j35p4Q6K2l5l0Q9Qn1m5J16L1j72J26M7J05
5420C26j95K6l2N3J0j00jq5N4l3Q1J1m0m3J18P3j7k9o9k2j3P9L5j61P0l5k3J4J47rj02qo6
5033A4NJ32lp2J07L8j45J09j35K45k35J03J03n3j62kk7j8L2J50k7p1o9Q3J43L4j63r8K16j05
4681A29Nm5N1J0n3Mk7J30J0p0m6M0p6L6l4J3K1J7pq1J47j38L4L9J1L7kK0r6J3J5J0K09o7J5
4270B74q7q3J35q3r2O7Mo7J15q8J93j87J8l8o1J6M4J03M4p5j3p5KJ02j39J42j12N7rNOJ6l6
3883I8oJ6j7N5j09lJ00M7j17Kj1J00L8o0NJ9q1Q4j9p1K83j56m9o1K9k1Q3p1mj9J04n6q9nJ71
3472B09J1j12J90j63k8r8J74j08J21lk8j19J83r1m8ln2L38k70J13j02j2q1P3l6Q2M2j16J46
3132B12k1j40P4N0on2J17l4N4j94k3J27l6J0q5R1j0l0o9P5l4PP6r0OJ91oj97nJ20J56j80j49
$$ plain form
2744 5 57 42 146 178 208 83 144 77 114 178 250 130 87 89 120 47 174 40 118 94 97 140 61 172 134 73 273 231 97 32 198 128
2369 128 187 79 211 61 6 74 215 180 121 104 23 119 225 87 92 223 225 138 332 252 298 228 167 133 12 59 56 120 72 160 145 138
1993 138 225 233 106 120 248 120 213 106 48 64 63 123 84 251 87 136 185 58 142 247 99 93 19 154 87 113 22 95 62 105 66
1629 66 36 21 96 198 240 179 103 197 112 213 56 189 123 133 115 96 116 67 67 38 40 49 220 117 162 212 125 287 223 53 70 24 143
1242 143 42 192 152 64 161 153 285 110 21 109 206 342 275 51 195 247 102 87 35 136 100 104 348 220 35 66 46 201 139
901 139 160 57 25 66 126 245 202 59 47 68 147 165 182 154 35 158 217 171 134 85 114 173 66 158 208 173 193 215 168 72 138 142 104
514 104 147 41 140 179 95 121 160 52 110 198 33 162 114 142 122 62 53 225 227 14 102 96 283 158 160 33 20 111 170 294 256 67
138 67 57 147 208 39 178 63 66 72 122 128 211 231 206 234 116 154 9 43 135 82 115 107 84 107 132 120 49 105
$$ packed form
2744EN2j5J04L2L0j25O1o7L7O4P2j20m3KL1p3J27j34P8k4LM3p9J11l8o1K00m2j34o5J66p0
2369A28N9j08J32j50n5O8J41l5n9j7q1R6J06j38NJ31Kq7J94q0M6p0o1l4j21M7lO4m8Q8j5p
1993A38Q7Qj27J4J28j28R3j07n8J6jO0l9J67j64M9M9j27Q4J05j48op4J35o7K6r1P3l3M3l9
1629F6l0j5P5J02M2o1p6R4q5J01j57J33o6J0j8j9K0m9%k9KRJ71j03M5N0q7J62o4j70J7m6J19
1242A43j01J50m0q8R7qJ32j75q9Q8R7J36o7k24J44N2j45j5n2J01l6MK44j28j85L1k0J55o2
901A39K1j03l2M1O0J19m3j43j2K1P9J8J7k8j19J23N9m6l7m9K9N9j07R2N0l5K0K2m7r6O6Ml8
514A04M3j06R9L9q4K6L9j08N8Q8j65J29m8K8k0o0rJ72Kk13Q8oJ87j25Kj27j3R1N9J24l8j89
138F7j0R0O1j69J39j15LON0OQ3K0k5K8j18L8j45L4R2n3L3qk3K3K5j2p1N6
-190A05
##PAGE=	F1=-13688.7
##FIRST=	25169.313707327481097,	5807.6787752999953227,	0
##DATA TABLE=	(F2++(Y..Y)), PROFILE
$$ plain form
5808 4 82 43 90 205 197 177 112 12 99 110 91 85 81 137 177 213 195 109 38 123 118 93 68 172 159 113 94 187 178 77 155 196 294 68 142 130
5385 130 188 207 78 100 38 100 47 117 78 75 52 132 183 181 167 66 80 11 194 182 50 114 124 50 53 171 224 101 49 7 34 127 121 69
4986 69 165 200 74 159 57 286 62 169 244 203 36 80 46 73 27 121 118 48 46 85 249 246 75 52 181 83 164 98 99 112 49 80 99
4599 99 207 158 138 100 109 76 79 70 92 96 114 182 90 151 18 108 96 119 151 145 172 72 134 158 118 323 246 282 245 86 243 152 87 159 160
4188 160 28 137 104 271 61 116 84 106 76 21 135 210 120 143 49 90 204 9 134 38 137 102 132 129 167 94 65 86 105 152 60
3824 60 75 111 189 87 104 24 172 193 120 133 148 35 87 173 78 353 174 122 70 89 116 109 90 141 118 235 171 92 83 239 248 134 287
3437 287 109 133 21 219 104 173 236 162 92 255 121 116 40 84 372 115 172 120 104 50 119 9 188 170 70 194 176 72 160
3096 160 161 155 114 262 164 239 105 67 122 140 158 22 114 148 153 81 106 104 107 162 97 119 288 263 104 59 171 306 172 40 59 61 199
$$ packed form
5808DP8l9M7J15qk0o5j00Q7J1j9omN6M0L6j8q6p1Q5nk5k5J04j3m6j9R3rj01P8M1R8k26P4j2
5385A30N8J9j29K2o2O2n3P0l9lk3Q0N1kj4j01J4o9J83j2j32O4J0p4LJ18N3j23n2m2K7R3on2
4986F9R6L5j26Q5j02K29k24J07P5m1j67M4l4K7m6R4lp0kL9J64lj71k3J29r8Q1o6JJ3o3L1J9
4599I9J08m9k0l8Rl3LrK2MJ8O8r2O1j33R0j2K3L2oK7j00O2K4m0K05p7L6l7j59J57r1o5P2J
4188A60j32J09l3J67k10N5l2K2l0n5J14P5r0K3r4M1J14j95J25r6R9l5L0lL8p3k9K1J9M7r2
3824F0J5L6P8j02J7q0J48K1p3J3J5j13N2Q6r5K75j79n2n2J9K7pj9N1k3J17o4p9rJ56Rj14J53
3437B87j78K4j12J98j15O9O3p4p0J63j34np6M4K88k57N7n2j6n4O9j10J79j8j00J24j8j04Q8
3096A60Jom1J48r8P5j34l8N5J8J8j36R2L4Np2K5kLN5o5K2J69k5j59m5J12J35j34j32J9KJ38
$$ plain form
2709 199 197 141 102 140 143 174 176 247 160 115 81 74 53 179 11 121 98 90 171 58 135 119 65 239 236 108 32 218 108 200 39 208 134
2322 134 80 105 204 154 103 111 52 75 143 55 87 256 254 125 290 270 272 205 105 164 62 119 25 130 90 155 166 127 219 177 91 124 263
1934 263 98 219 82 25 67 36 134 97 225 72 176 155 98 156 231 138 40 34 144 72 140 82 83 119 87 61 55 29 96 199 213 127
1559 127 96 193 85 181 19 195 130 149 153 87 134 76 43 45 83 61 270 138 155 191 142 313 225 61 65 22 144 104 178 141 83 133
1183 133 220 335 99 24 78 227 351 227 88 206 268 80 115 52 126 121 96 318 222 95 105 32 143 149 87 28 92 52 116 242
831 242 179 15 99 141 169 160 180 156 14 151 210 153 90 54 114 173 34 155 166 109 185 296 229 109 130 147 134 121 7 143 168
467 168 148 122 137 86 59 114 21 171 112 118 133 105 83 201 204 39 77 112 235 110 126 51 36 98 195 262 257 89 36 110 223 33 171
80 171 82 37 30 67 57 192 215 203 224 60 204 44 77 174 71 145 97 76 117 140 92 48 91
$$ packed form
2709A99kn6l9L8LL1KP1q7m5l4pk1J26j68J10k3qQ1j13P7j6n4J74lj28p6J86j10R2j61J69p4
2322A34n4K5R9n0n1Qn9K3O8q8L2J69kj29J65k0Ko7j00N9j02N7r4J05m0O5J1l9R2m2q6L3J39
1934B63j65J21j37n7M2l1R8l7J28j53J04k1n7N8P5r3r8oJ10p2O8n8JL6l2k6ok6O7J03J4q6
1559A27l1R7j08R6j62J76o5J9Mo6M7n8l3KL8k2K09j32J7L6m9J71q8j64Mm3J22m0P4l7n8N0
1183A33Q7J15k36p5N4J49J24j24j39J18O2j88L5o3P4nk5K22r6j27J0p3J11Oo2n9O4m0O4J26
831B42o3j64Q4M2K8rK0k4j42J37N9n7o3l6O0N9j39J21J1n7P6J11o7j20K1J7j3j3j14J36K5
467A68k0k6J5n1k7N5r3J50n9OJ5k8k2J18Lj65L8L5J23j25J6p5j5O2R7O7nj68n3P4J13j90J38
80A71q9m5pL7j0J35K3j2K1j64J44j60L3R7j03P4m8k1M1K3m8m4M3
-190I1
##PAGE=	F1=-13790.9
##FIRST=	25169.313707327481097,	5807.6787752999953227,	0
##DATA TABLE=	(F2++(Y..Y)), PROFILE
$$ plain form
5808 35 82 29 69 200 176 179 133 33 77 111 131 108 71 112 138 150 132 120 45 129 95 98 97 169 131 107 118 174 133 94 118 166 243 39 113
5397 113 125 182 218 94 109 71 138 103 118 71 62 58 103 143 169 144 35 51 76 223 179 71 123 197 67 111 157 242 101 17 26 45 105
5010 105 146 79 133 182 77 126 67 242 84 173 186 168 18 119 104 138 72 47 63 37 96 62 249 206 38 90 178 70 190 123
4657 123 42 88 14 96 169 204 120 139 99 69 88 63 69 123 107 115 241 151 125 63 146 67 125 141 127 171 57 149 186 107 290 228 276 276 98
4247 98 221 141 116 186 173 33 106 146 257 62 109 86 170 109 56 80 175 96 147 33 101 202 44 87 45 142 86 132 129 182 102 58
3871 58 57 105 149 101 156 72 165 115 139 31 186 193 120 147 133 29 20 193 71 321 139 96 94 101 165 85 69 181 119 263 202 137 129 250
3472 250 246 165 266 64 169 44 253 119 146 272 170 121 254 124 157 32 149 341 110 111 124 118 110 143 56 227 164 81 155
3132 155 163 116 201 156 129 106 266 137 219 137 133 86 169 196 69 63 153 180 126 112 125 158 173 129 170 283 263 166 60 160 243 168 70
$$ packed form
5808C5M7n3M0J31k4Lm6j00M4L4K0k3l7M1K6J2j8j2p5Q4l4LjP2l8k4J1N6m1l9K4M8P7k04P4
5397A13J2N7L6j24J5l8O7l5J5m7rmM5M0K6k5j09J6K5J47m4j08N2P4j30M4M6Q5j41q4RJ9O0
5010A05M1o7N4M9j05M9n9J75j58Q9J3j8j50J01j5L4o6k5J6k6N9l4J87m3j68N2Q8j08J20o7
4657A23q1M6p4Q2P3L5q4J9m0l0J9k5ON4j6QJ26r0k6o2Q3p9N8J6j4M4j14R2L7p9J83o2M8%j78
4247I8J23q0k5P0j3j40P3M0J11j95M7k3Q4o1n3K4R5p9N1j14O8J01j58M3m2R7n6M6lN3q0m4
3871E8jM8M4m8N5q4R3n0K4j08J55Pp3K7j4j04rJ73j22K50j82m3kPO4q0j6J12o2J44o1o5qJ21
3472B50mq1J01k02J05j25K09j34K7J26j02m9J33j30L3j25J17J92k31JJ3oqL3q7J71o3q3P4
3132A55Qm7Q5m5k7k3J60j29Q2q2mm7Q3K7j27oR0K7n4j4J3L3J5m4M1J13k0r7j06J00Q3p5r8
$$ plain form
2744 70 64 106 242 195 71 139 135 183 215 156 214 164 136 79 62 98 182 24 109 101 100 205 61 117 114 67 207 235 100 73 213 91 212
2357 212 28 194 198 136 115 175 112 79 92 75 78 48 8 57 262 248 100 254 272 218 167 53 186 121 153 6 121 114 165 206 107 225
1981 225 131 80 134 257 77 245 76 73 76 7 143 132 183 62 181 113 137 166 223 180 31 57 126 64 143 126 57 167 88 78 75 47
1606 47 121 187 161 70 109 181 48 147 34 189 133 155 209 105 140 72 26 62 112 88 300 161 131 147 156 320 207 68 90 42 148
1242 148 180 141 114 104 89 259 356 77 20 47 220 322 154 127 183 259 59 123 84 121 134 88 280 226 146 130 71 74 188 63 10
878 10 151 102 103 219 136 51 138 204 183 134 187 158 42 122 181 119 72 95 106 153 15 116 115 51 143 257 195 118 90 126 162 136 49 128
479 128 144 201 129 117 155 121 57 42 174 110 132 145 148 117 187 184 66 38 122 195 116 98 87 46 83 209 223 276 111 48 53 217 59 140
80 140 75 21 29 40 38 166 208 181 201 29 238 76 119 195 72 159 68 55 120 146 63 37 64
$$ packed form
2744G0oM2J36m7j24O8mM8L2n9N8n0k8n7j7L6Q4j58Q5qjJ05j44N6lm7J40K8j35k7J40j22J21
2357B12j84J66Mo2k1O0o3l3J3j7Ll0m0M9K05j4j48J54J8n4n1j14J33o5L2j47J15pN1M1r9J18
1981B25r4n1N4J23j80J68j69lLo9J36j1N1j21J19o8K4K9N7m3j49K6O9o2P9j7o9J10p9j0lk8
1606D7P4O6k6r1L9P2j33R9j13J55n6K2N4j04L5o8m6L6N0k4K12j39l0J6RJ64j13j39K2m8J06
1242A48L2l9k7j0j5J70R7k79n7K7J73J02j68k7N6P6k00O4l9L7J3m6J92n4q0j6n9LJ14j25n3
878A0J41m9JJ16q3q5Q7O6k1m9N3k9j16Q0N9o2m7K3J1M7j38J01jo4R2J14o2p7k8L6L6k6q7P9
479A28J6N7p2j2L8l4o4j5J32o4K2J3Ll1P0lj18k8Q4P3p9j8j1m1L7J26J4N3j65o3NJ64j58Q1
80A40o5n4QJ1kJ28M2k7K0j72K09j62M3P6j23Q7r1j3O5K6q3k6K7
-190F4
##PAGE=	F1=-13893.2
##FIRST=	25169.313707327481097,	5807.6787752999953227,	0
##DATA TABLE=	(F2++(Y..Y)), PROFILE
$$ plain form
5808 63 79 18 40 179 134 176 138 55 56 100 156 113 58 82 102 95 54 139 43 126 73 109 146 156 112 115 136 159 114 93 89 165 188 90 69 113 160
5373 160 211 125 115 97 157 127 107 92 51 44 69 106 173 110 50 16 158 236 181 97 120 260 86 171 161 242 84 84 78 51 83 180 93 95 172
4963 172 83 101 77 170 117 175 103 120 35 162 143 182 100 55 36 69 131 30 247 166 11 125 226 115 209 151 37 75 29 150
4610 150 245 193 114 142 91 58 108 64 71 161 130 112 266 185 105 106 175 31 140 129 103 174 66 136 189 91 238 210 257 272 117 180 127
4223 127 140 202 171 83 118 193 245 107 102 67 203 127 120 31 128 101 147 21 102 168 74 42 61 137 60 112 114 177 128 73 23 94 145 138 224
3812 224 55 122 142 165 53 196 194 134 179 115 89 99 207 46 268 99 72 126 138 217 102 77 210 79 270 224 169 165 244 215
3460 215 189 236 8 216 65 283 119 116 296 185 129 232 157 189 80 210 291 90 55 127 151 159 161 96 248 151 102 103 147 164 254
3096 254 167 98 92 245 119 202 151 191 62 203 242 108 0 145 177 158 122 138 202 189 152 211 249 258 224 64 152 156 142 84 74 162
$$ packed form
5808F3J6o1K2J39m5M2l8q3JM4N6m3n5K4K0pm1Q5r6Q3n3L6L7J0m4LK1K3m5k1mP6K3r8k1M4M7
5373A60N1q6j0j8O0l0k0j5m1pK5L7O7o3o0l4J42P8n5q4K3J40j74Q5j0Q1j58%ok7L2R7q7KP7
4963A72q9J8k4R3n3N8p2J7q5J27j9L9q2m5j9L3O2j01K17q1j55J14J01j11R4n8j14L8m6J21
4610A50R5n2p9K8n1l3N0m4PR0l1j8J54q1q0JO9j44J09j1k6P1j08P0N3r8J47k8M7J5j55O3n3
4223A27J3O2l1q8L5P5N2j38nl5J36p6pq9R7k7M6j26Q1O6r4l2J9P6p7N2KO3m9n5n0P1N1pQ6
3812B24j69O7K0K3j12J43ko0M5o4k6J0J08j61K22j69k7N4J2P9j15k5J33j31J91m6n5mP9k9
3460B15k6M7k28K08j51K18j64lJ80j11n6J03p5L2j09J30Q1k01l5P2K4QKo5J52r7m9JM4J7R0
3096B54q7o9oJ53j26Q3n1M0j29J41L9j34j08J45L2j9l6J6O4j3l7N9L8Rl4j60Q8Mj4n8j0Q8
$$ plain form
2721 162 274 163 15 178 124 197 234 132 162 142 142 81 92 148 175 30 88 105 137 237 66 120 120 78 187 229 72 108 187 83
2369 83 222 45 172 238 159 103 129 59 69 58 81 113 43 58 11 237 209 71 235 254 147 129 18 191 161 166 41 87 141 189 256
2005 256 83 238 119 70 148 235 66 276 74 117 86 45 147 173 127 52 156 66 150 171 235 221 71 78 105 66 117 142 28 196
1653 196 114 102 94 80 154 158 88 46 116 159 63 163 82 178 149 148 262 143 136 62 51 89 120 120 306 194 104 87 170 311 178 84 132 59
1254 59 143 248 105 98 129 49 261 352 51 19 22 185 261 72 155 152 221 43 109 132 130 135 94 238 231 187 140 121 8 221 106 54 188
866 188 141 90 189 84 99 157 246 193 95 210 166 64 84 133 86 96 122 88 116 27 65 88 0 105 181 131 108 35 87 179 176 81 97 101
467 101 242 136 103 211 189 105 77 174 107 169 163 166 132 185 177 96 60 128 219 195 81 108 47 62 208 185 289 121 72 16 189 90 96
80 96 56 80 97 81 82 137 211 138 171 85 253 92 148 193 93 151 39 32 120 141 41 26 51
$$ packed form
2721A62J12j11j48J63n4P3L7j02L0k0%o1J1N6K7j45N8J7L2J00j71N4%m2J09M2j57L6P9j04
2369H3J39j77J27O6p9n6K6p0J0j1K3L2p0J5m7K26k8j38J64J9j07j8j11J73l0Nj25M6N4M8O7
2005B56j73J55j19m9P8Q7j69K10k02M3l1m1J02K6m6p5J04r0Q4K1O4j4j50PK7l9N1K5j14J68
1653A96q2j2qj4P4Mp0m2P0M3r6J00q1R6k9jJ14j19pp4j1L8L1%J86j12r0j7Q3J41j33r4M8p3
1254E9Q4J05j43pL1q0K12R1l01l2LJ63P6j89Q3lO9j78O6K3kNm1J44pm4m7j9j13K13j15n2J34
866A88m7n1R9j05J5N8Q9n3r8J15m4j02K0M9m7J0K6l4K8q9L8K3q8J05P6n0k3p3N2R2lr5J6M
467A01J41j06l3J08k2q4k8R7o7O2oLl4N3qq1l6O8R1k4j14K7o1J5J46k3J04j68m9n6J73r9O
80I6m0K4J7j6JN5P4p3L3q6J68j61N6M5j00N8j12pQ8K1j00j5K5
-190E1
##PAGE=	F1=-13995.4
##FIRST=	25169.313707327481097,	5807.6787752999953227,	0
##DATA TABLE=	(F2++(Y..Y)), PROFILE
$$ plain form
5808 74 74 9 11 140 86 161 129 56 36 85 168 104 69 54 67 53 26 159 33 113 59 111 197 137 124 136 144 154 126 71 100 214 145 132 22
5397 22 102 125 183 162 122 111 154 111 93 117 61 36 39 79 187 72 80 40 223 236 187 132 107 298 101 223 167 231 72 145 132 54 65
5010 65 199 106 67 172 92 95 92 90 148 175 13 78 82 208 154 204 105 125 75 89 149 44 246 136 17 151 261 157 216 172 103 59
4634 59 72 214 307 175 129 140 77 83 123 76 83 201 160 107 249 187 101 142 193 34 157 117 76 176 104 99 172 83 177 185 228 233 121 133
4235 133 112 153 200 158 129 153 222 233 147 106 24 206 129 168 23 85 121 141 26 101 116 96 34 74 126 29 80 87 157 153 91 30 81 147
3836 147 170 272 90 84 164 182 64 197 194 158 216 97 151 182 220 9 212 65 57 153 174 257 111 114 217 6 266 235 183 189 230
3472 230 161 204 199 60 268 89 306 109 78 306 203 119 200 202 204 126 253 233 61 62 139 201 187 165 114 244 125 124 62 127 202 309
3096 309 181 80 75 203 102 189 143 235 53 227 282 128 63 122 149 170 130 145 226 200 162 231 194 244 270 71 153 64 104 78 73 218
$$ packed form
5808G4%o5KJ29n4P5l2p3k0M9Q3o4l5j5J3j4k7J33j26Q0n4N2Q6o0j3J2QJ0k8n5K9J14o9j3j10
5397B2Q0K3N8k1m0j1M3m3j8K4n6k5LM0J08j15Qm0J83J3m9n5k5J91j97J22n6O4j59P3j3p8J1
5010F5J34r3l9J05q0LlkN8K7j62O5MJ26n4N0r9K0n0J4O0j05K02j10j19J34J10j04N9m4o9m4
4634E9J3J42R3j32m6J1o3OM0m7PJ18m1n3J42o2q6M1N1j59J23m0m1J00p2nP3q9R4QM3Nj12J2
4235A33k1M1M7m2k9K4O9J1q6m1q2J82p7L9j45O2L6K0j15P5J5k0o2M0N2r7N1PP0mo2o1N1O6
3836A47K3J02j82oQ0J8j18J33ll6N8j19N4L1L8k11K03j47qR6K1Q3j46LJ03k11K60l1n2OM1
3472B30o9M3nj39K08j79K17j97l1K28j03q4Q1KKp8J27k0j72JP7O2j4k2n1J30j19jo2O5P5J07
3096C09j28j01nJ28j01Q7m6R2j82J74N5j54o5N9K7K1m0J5Q1k6l8O9l7N0K6j99Q2q9M0k6nJ45
$$ plain form
2721 218 292 107 39 212 106 192 235 123 123 118 126 88 117 188 156 21 75 112 180 251 70 129 135 95 178 215 31 127 149 86 227 71
2345 71 148 247 144 75 86 37 85 53 106 164 116 133 53 188 148 45 222 214 74 109 17 182 174 187 107 43 168 221 306 75 249 144
1970 144 64 156 205 65 298 71 155 94 89 143 203 60 67 112 22 135 161 250 250 105 98 95 77 72 128 38 203 146 115 108 122 186 115 7
1570 7 97 101 124 108 223 133 178 185 126 297 177 122 55 79 125 104 145 288 231 92 23 189 291 167 112 166 72 123 289 121 129 151
1195 151 65 230 330 21 51 9 132 176 17 172 149 168 41 75 186 152 123 123 200 235 220 143 164 55 228 148 98 196 150 79
843 79 171 35 136 151 265 198 69 249 183 76 57 88 85 127 117 75 71 42 92 116 45 95 146 108 91 20 37 182 210 102 76 72 261
455 261 133 97 240 223 170 110 168 101 194 182 159 128 190 181 126 124 144 298 281 85 108 43 46 189 153 275 111 96 83 145 110 50 68
68 68 151 159 127 119 109 217 82 139 146 249 83 153 170 120 120 46 16 116 123 33 51 79
$$ packed form
2721B18P4j85o8J73j06Q6M3j12%nQl8K9P1l2j35N4L7O8P1j81N9Om0Q3L7j84R6K2o3J41j56
2345G1P7R9j03o9J1m9M8l2N3N8m8J7q0J35m0j03J77qj40L5r2J65qJ3q0o4J25N3Q5k31J74j05
1970A44q0R2M9j40K33k27Q4o1nN4O0j43PM5r0J13K6Q9%j45plj8nN6r0J65n7l1pJ4O4p1j08
1570GR0MK3j6J15r0M5Pn9J71j20n5o7K4M6k1M1J43n7j39o9J66J02j24n5N4r4N1J66j68QK2
1195A51q6J65J00l09L0m2J23M4j59J55k3J9j27L4J11l4k9%P7L5j5p7K1j09J73q0n0R8m6p1
843G9R2j36J01J5J14o7j29J80o6j07j9L1lM2j0m2mk9N0K4p1N0N1l8j7p1J7J45K8j08k6mJ89
455B61j28l6J43j7n3o0N8o7R3j2k3l1O2rn5kK0J54j7j96K3o5LJ43l6J22j64j5j3O2l5o0J8
68F8Q3Ql2qj0J08j35N7PJ03j66P0J7n0%p4l0J00Pr0J8K8
-190G9
##PAGE=	F1=-14097.7
##FIRST=	25169.313707327481097,	5807.6787752999953227,	0
##DATA TABLE=	(F2++(Y..Y)), PROFILE
$$ plain form
5808 65 69 4 15 92 51 134 111 41 18 77 169 84 107 49 36 30 98 176 25 88 58 95 240 123 147 156 141 163 140 37 132 284 129 150
5409 150 57 96 87 151 201 134 112 128 60 91 138 83 75 19 65 204 39 101 72 259 234 195 172 93 303 106 259 163 217 95 179 172 55
5021 55 64 203 113 53 177 100 95 117 60 170 174 66 66 138 253 140 208 93 182 112 88 154 108 245 117 29 166 250 168 207 180 162
4646 162 49 131 272 344 151 145 132 57 101 125 90 105 243 191 103 197 159 105 169 201 57 162 113 45 173 146 47 149 95 120 146
4282 146 189 166 105 100 100 150 181 142 162 177 218 214 165 131 39 182 116 195 50 78 131 132 44 94 60 103 57 85 110 39 63 57 132 160 98 65
3859 65 76 161 199 296 124 80 177 190 67 183 191 186 242 77 204 245 232 38 167 50 54 176 197 280 98 150 202 86 263 238 176
3495 176 199 216 100 208 160 120 317 123 319 94 37 305 215 105 169 239 199 163 267 181 32 106 164 255 190 154 108 219 85
3155 85 137 80 105 221 349 185 96 57 145 84 176 116 263 49 229 305 135 119 92 106 161 130 150 227 198 155 226 131 220 300 79
$$ packed form
5808F5Mo5J1P7m1Q3k3p0k3N9R2q5K3n8j3oO8P8j51O3l0L7J45j17K4Rj5K2k3j03R5J52j55K1
5409A50r3L9rO4N0o7k2J6o8L1M7n5qn6M6J39j65O2k9J87k5l9k3p9K10j97J53r6N4j22Q4pj17
5021E5RJ39r0o0J24p7nK2n7J10Mj08%P2J15j13O8j15Q9p0k4O6m6J37j28q8J37Q4q2L9k7j8
4646A62j13Q2J41P2j93oj3p5M4K4l5J5J38n2q8R4l8n4O4L2j44J05m9o8J28k7r9J02n4K5K6
4282A46M3k3o1n%N0L1l9K0J5M1mm9l4r2J43o6P9j45K8N3Jq8N0l4M3m6K8K5p1K4oP5K8o2l3
3859F5J1Q5L8R7j72m4R7J3j23J16QnN6j65J27M1j3j94J29j17MJ22K1Q3j82N2N2j16J77k5o2
3495A76K3J7j16J08m8m0J97j94J96k25n7K68r0j10O4P0m0l6J04q6j49P4N8R1o5l6m6J11j34
3155H5N2n7K5J16J28j64q9l9Q8o1R2o0J47k14J80P6j70j6k7J4N5l1K0P7k9m3P1r5Q9Q0k21
$$ plain form
2791 79 163 13 68 67 49 265 296 38 72 234 85 182 218 133 138 138 96 98 120 210 129 19 88 121 212 240 72 129 152 112 172 190 29
2404 29 127 110 98 222 102 126 229 95 60 83 86 117 92 168 226 158 202 105 127 82 28 199 159 13 105 29 164 157 232 199 77 187
2028 187 251 340 100 247 176 61 149 168 67 304 68 187 101 127 130 213 8 106 61 23 100 131 247 260 127 113 94 93 72 91 76
1664 76 191 168 115 119 166 209 68 73 168 59 73 134 275 182 205 230 94 299 198 102 59 94 166 82 151 248 256 97 52 214 267 191
1289 191 147 178 84 87 287 170 183 164 111 172 301 20 98 8 86 87 64 179 172 126 55 28 234 175 102 163 176 233 243 143 192 100 206
901 206 179 135 174 127 76 172 28 159 130 268 199 77 292 202 81 51 91 116 150 86 93 67 48 164 155 80 89 143 99 75 55 20 173
514 173 227 114 95 116 255 113 97 238 217 217 134 151 89 193 190 138 113 195 190 148 184 188 384 342 107 91 40 58 147 126 227 79 118
127 118 133 92 117 20 101 205 197 159 142 88 216 49 111 194 231 49 130 127 138 71 71 19 105 99 35 93 114
$$ packed form
2791G9Q4j50N5jj8K16L1k58L4J62j49R7L6q5N%m2KK2R0q1j10O9L3R1K8j68N7K3m0O0J8j61
2404B9R8j7j2J24j20K4J03j34l5K3LL1k5P6N8o8M4r7K2m5n4J71m0j46R2p6J35pP5l3j22J10
2028A87O4Q9k40J47p1j15Q8J9j01K37k36J19q6K6LQ3k05R8m5l8P7L1J16J3j33j4j9jk1J9j5
1664G6J15k3n3MM7M3j41NR5j09J4O1J41r3K3K5j36K05j01r6m3L5P2q4O9R7Qj59m5J62N3p6
1289A91m4L1r4LK00j17J3j9n3O1J29k81P8r0P8Jk3J15pm6p1k7K06n9p3O1J3N7J0j00M9r2J06
901B06k7m4L9m7n1R6j44J31k9J38o9j22K15r0j21l0M0K5L4o4Pk6j9J16rp5RN4m4k4k0l5J53
514A73N4j13j9K1J39j42j6J41k1%q3J7o2J04ln2k5Q2nm2L6MJ96m2k35j6n1J8Q9k1J01j48L9
127A18J5m1K5r7Q1J04ql8j7n4J28j67O2Q3L7j82Q1lJ1o7%n2Q6oo4N8K1
-190A14
##PAGE=	F1=-14200
##FIRST=	25169.313707327481097,	5807.6787752999953227,	0
##DATA TABLE=	(F2++(Y..Y)), PROFILE
$$ plain form
5808 42 61 16 37 66 48 104 92 21 13 71 162 55 149 67 26 19 154 188 31 58 71 62 264 118 155 162 132 173 143 24 150 346 134
5420 134 142 112 94 68 148 237 153 101 88 14 111 155 101 125 15 66 214 33 112 92 260 234 198 209 99 278 95 276 148 212 137
5056 137 177 189 54 79 196 118 42 183 106 84 145 111 177 170 118 79 194 290 109 201 73 215 137 80 155 171 239 105 37 172 190
4693 190 155 180 171 202 75 197 317 350 121 156 116 36 102 110 109 132 289 216 104 134 120 102 184 196 56 149 123 13 165 178 18
4329 18 145 121 85 90 146 83 74 97 93 130 147 133 176 177 177 183 159 171 111 139 96 201 70 104 122 131 66 79 21 93 68 96 90 90 87 35 115 142 85
3871 85 88 80 192 224 299 133 95 178 189 65 151 185 211 245 51 236 275 239 78 149 53 62 197 203 287 82 170 181 179 265 234 154 201 210
3472 210 45 204 124 166 357 166 320 82 11 296 216 102 148 259 181 193 251 144 10 137 202 301 173 135 86 182 46 134
3143 134 123 89 215 360 174 129 40 82 65 157 83 268 39 204 306 138 160 68 60 134 121 156 209 176 135 197 78 184 313 87
$$ packed form
5808D2J9m5K1K9j8N6j2p1qN8R1j07R4q2m1pJ35L4j57K7J3rK02j46L7Pl0M1l0j19J26J96k12
5420A34Ql0j8k6Q0Q9q4n2j3p4R7M4n4K4j10N1J48j81P9k0J68k6l6J1j10J79j83J81j28O4p5
5056A37M0J2j35K5J17p8p6J41p7k2O1l4O6pn2l9J15R6j81R2j28J42p8n7P5J6O8j34o8J35J8
4693A90l5K5rL1j27J22J20L3k29L5m0q0O6QjK3J57p3j12L0j4j8Q2J2j40R3k6j10J52J3j60
4329A8J27k4l6NN6o3rK3mL7J7j4M3J%Ok4J2o0K8m3J05j31L4J8Ro5J3n8P2k5K8o%ln2Q0K7n7
3871H5LqJ12L2P5j66l8Q3J1j24Q6L4K6L4j94J85L9l6j61P1r6RJ35OQ4k05Q8J1kQ6l1q0M7R
3472B10j65J59q0M2J91j91J54k38p1K85q0j14M6J11p8J2N8j07j34J27O5R9j28l8m9R6j36Q8
3143A34j1l4J26J45j86m5q9M2j7R2p4J85k29J65J02j68K2r2qP4j3L5N3l3m1O2j19J06J29k26
$$ plain form
2791 87 178 64 55 87 15 293 282 29 103 244 71 179 186 144 179 193 76 109 103 209 102 53 120 135 225 204 71 112 165 122 167 157
2416 157 68 110 84 118 210 130 108 193 29 91 110 135 147 135 240 286 162 251 138 66 48 23 155 106 31 95 47 145 115 286 300 156
2040 156 198 262 342 136 225 191 59 125 125 68 290 72 211 112 154 105 201 68 147 20 54 62 94 211 246 137 121 93 106 136 63
1676 63 116 168 173 106 130 203 217 35 138 242 21 14 133 291 225 249 264 57 267 199 87 69 96 208 94 136 195 257 105 112 246
1312 246 239 225 181 165 99 57 237 200 228 166 148 106 271 71 149 21 83 46 100 179 186 126 73 42 266 183 82 202 177 220 254 142
937 142 201 131 172 203 160 132 80 81 189 71 174 110 266 193 92 326 212 85 51 126 142 170 44 137 119 45 213 173 100 80 150
573 150 52 57 70 63 156 227 118 131 182 227 76 98 207 175 245 146 121 68 166 177 122 97 193 193 158 227 252 448 361 124 66 51 91 84 102
162 102 155 45 134 152 42 110 26 122 223 198 173 152 71 208 97 90 220 205 21 82 68 137 26 85 39 92 88 37 134 139
$$ packed form
2791H7R1j14rL2p2K78j1k53P4J41j73J08Pm2L5J4j17L3oJ06j07m9O7J5R0k1j33M1N3m3M5j0
2416A57q9M2k6L4R2q0k2Q5j64O2J9K5J2j2J05M6j24Q9j13p2j8k5J32m9p5O4m8R8l0J71J4j44
2040A56M2O4Q0k06Q9l4j32O6%n7K22k18J39r9M2m9R6j33P9j27L4QL2J17L5j09j6k8J3L0p3
1676F3N3N2No7K4P3J4j82J03J04k21pJ19J58o6K4J5k07K10o8j12j8K7J12j14M2N9O2j52PJ34
1312B46pj4m4j6o6m2J80l7K8o2j8m2J65k00P8j28O2l7N4P9Po0n3l1K24q3j01J20k5M3L4j12
937A42N9p0M1L1m3k8n2JJ08j18J03o4J56p3j01K34j14j27l4P5J6K8j26R3j8p4J68m0p3k0P0
573A50r8NJ3pR3P1j09J3N1M5j51K2J09l2P0r9k5n3R8J1n5k5R6%l5O9K5J96q7k37n8j5M0pJ8
162A02N3j10Q9J8j10O8q4R6J01k5k5k1q1J37j11pJ30j5j84O1j4O9j11N9m6N3mn1R7N
-190A39
##PAGE=	F1=-14302.2
##FIRST=	25169.313707327481097,	5807.6787752999953227,	0
##DATA TABLE=	(F2++(Y..Y)), PROFILE
$$ plain form
5808 38 48 34 60 96 57 95 83 17 22 53 153 20 181 80 52 7 189 194 42 31 94 35 266 124 135 150 120 171 139 53 144 383
5432 383 144 121 153 92 90 182 267 173 83 43 91 139 169 109 163 26 79 211 58 131 108 230 231 192 233 128 240 63 271 130 220
5068 220 178 142 180 46 93 184 125 33 186 108 56 164 158 174 163 136 90 233 313 74 187 53 220 154 97 155 217 222 96 49 172
4704 172 104 150 144 145 220 125 256 346 330 89 161 96 27 92 87 134 155 336 230 114 131 103 88 185 176 27 122 141 12 151 195 78
4329 78 173 150 95 38 112 22 40 111 98 104 105 141 172 155 99 141 135 213 178 84 79 191 82 129 93 139 91 60 34 67 74 105 68 146 127 25
3906 25 114 106 54 92 90 235 242 285 120 104 171 180 65 102 176 231 224 30 244 271 235 102 158 58 74 212 196 284 93 175 179 253 266 224
3507 224 127 208 213 14 193 100 195 381 210 310 77 29 280 203 120 144 257 157 217 208 125 24 147 241 329 149 120 67 148 36
3155 36 118 156 90 190 338 154 156 26 42 59 127 73 233 24 163 282 140 182 71 36 99 103 161 179 139 104 148 60 141 307 92
$$ packed form
5808C8J0j4K6L6l9L8j2o6NL1J00j33J61j01k8m5J82Nj52j1O3n9K31j42J1J5l0N1l2q6R1K39
5432C83k39k3L2o1kR2Q5r4r0m0M8M8L0o0N4j37N3J32j53P3k3J22Jl9M1j05J12j77K08j41R0
5068B20m2l6L8j34M7R1n9r2J53p8n2J08oJ6j1k7m6J43Q0k39J13j34J67o6n7N8O2Nj26m7J23
4704A72o8M6oJP5r5J31R0j6k41P2o5o9O5nM7K1J81j06j16J7k8j5R7rj49R5J9j29J39M4j17
4329G8R5k3n5n7P4r0J8P1j3OJL6L1j7n6M2oP8l5r4nJ12j09M7l6M6m8l1k6L3PL1l7P8j9j02
3906B5Q9qn2L8kJ45PM3j65j6O7Rj15L7P4N5pj94K14K7l6j33N6j00J6J38j6Q8j91Q2MP4J3m2
3507B24r7Q1Nj99J79r3R5J86j71J00k33m8K51p7q3K4J13j00O0rq3j01J23R4Q8j80k9n3Q1j12
3155C6Q2L8o6J00J48j84Kj30J6J7O8n4J60k09J39J19j42M2j11l5O3MN8J8m0l5M4q8Q1J66k15
$$ plain form
2791 92 191 88 69 132 83 299 248 74 139 239 81 188 139 149 204 241 101 118 82 185 88 100 151 155 224 160 67 85 170 118 164 121
2416 121 95 83 76 142 195 149 99 154 57 134 130 165 170 171 296 320 132 270 142 21 63 21 95 98 54 64 74 124 56 323 388 230 208 245
2016 245 302 158 180 177 53 89 73 67 257 84 221 134 164 72 173 112 173 33 81 38 94 145 208 137 123 83 112 197 93 149 145 167
1641 167 90 141 228 206 32 180 310 89 69 128 263 256 287 278 28 206 183 87 79 87 240 142 105 142 229 107 162 282 204 240 210 141
1265 141 125 90 144 197 251 164 168 61 244 126 191 45 107 95 122 175 175 150 85 100 276 168 88 229 199 193 249 138 194 147 152 226 167
878 167 83 35 93 213 117 189 102 268 179 97 341 210 92 40 145 147 185 16 188 179 42 220 160 102 100 196 59 43 73 93 132
514 132 218 119 155 231 185 28 94 154 110 256 150 89 40 133 146 121 86 182 186 155 247 313 479 334 122 45 73 130 14 80 74 81 136
127 136 135 23 92 35 116 192 160 173 152 51 195 158 77 222 174 77 30 1 112 65 81 64 98 103 45 168 148
$$ packed form
2791I2R9j03j9O3m9K16n1j74O5J00j58J07m9J0N5L7j40J7l6J03r7J2N1MO9o4r3J8Q5n2M6m3
2416A21k6j2pO6N3m6n0N5r7P7mL5NJJ25K4j88J38j28j21M2m2P4Lm4J0J0N0o8K67O5j58k2L7
2016B45N7j44K2lj24L6j6oJ90j73J37q7L0r2J01o1O1j40M8m3N6N1O3p1j4m0K9Q5j04N6mK2
1641A67p7N1Q7k2j74J48J30k21k0N9J35pL1rk50J78k3r6qQJ53r8l7L7Q7j22N5J20p8L6l0o9
1265A41j6l5N4N3N4q7Mj07J83j18O5j46O2j2K7N3%k5o5J5J76j08q0J41l0oN6j11N6m7NP4n9
878A67q4m8N8J20r6P2q7J66q9q2K44j31j18n2J05KL8j69J72rj37J78o0n8kR6j37j6L0K0L9
514A32Q6r9L6P6m6j57O6O0m4J46j06o1m9R3J3k5l5R6Ml1R2O6J66j45k12p7K8N7j16O6oPN5
127A36jj12O9n7Q1P6l2J3k1j01J44l7q1J45m8r7m7k9J11m7J6j7L4Nn8J23k0
-190A48
##PAGE=	F1=-14404.5
##FIRST=	25169.313707327481097,	5807.6787752999953227,	0
##DATA TABLE=	(F2++(Y..Y)), PROFILE
$$ plain form
5808 74 25 55 84 141 62 121 91 26 49 22 145 29 197 76 83 34 209 190 45 14 121 71 248 133 94 128 104 153 137 74 116
5444 116 394 151 100 174 84 126 217 286 188 69 17 153 160 180 114 181 48 99 192 85 175 133 178 214 174 237 158 213 28 244 125
5080 125 231 211 87 149 29 90 167 137 49 185 113 18 166 182 174 152 119 92 244 312 49 169 37 198 166 137 144 230 191 87
4728 87 66 171 86 183 122 109 217 173 297 359 290 58 163 77 41 82 74 158 164 369 229 136 208 124 62 172 138 48 88 159 25 140
4352 140 198 133 216 172 125 77 104 74 42 120 115 97 68 170 154 130 8 94 103 249 225 25 82 171 90 134 48 148 114 57 63 42 96 108
3953 108 40 191 161 30 125 66 20 79 98 280 249 261 108 106 163 166 72 41 164 246 187 38 226 236 217 103 182 60 87 216 183
3589 183 277 127 173 205 295 254 208 114 229 225 26 182 98 208 388 243 287 78 35 256 176 147 157 235 135 236 154 121 50 136
3237 136 272 330 129 119 66 128 51 97 175 104 165 287 131 169 8 84 84 100 80 140 73 125 242 135 188 98 70 65 82 162 146 91
$$ packed form
5808G4m9L0K9N7p9N9l0o5K3k7J23j16J68j21Pm9J75j9j45l1J07n0J77j15l9L4k4M9j6o3M2
5444A16K78k43n1P4r0M2R1O9r8j19n2J36PK0o6O7j33N1R3j07R0m2M5L6m0O3p9N5j85K16j19
5080A25J06k0j24O2j20O1P7l0q8J36p2r5J48J6qk2l3k7J52O8k63J20j32J61l2k9PQ6l9j04
4728H7k1J05q5R7o1j3J08m4J24O2o9k32J05q6l6M1qQ4OK05j40r3P2q4o2J10l4r0M0P1j34J15
4352A40N8o5Q3m4m7m8K7l0l2P8nj8k9J02j6k4j22Q6RJ46k4k00N7Q9q1M4q6J00l4n7Ok1N4J2
3953A08o8J51l0j31R5n9m6N9J9J82l1J2j53kN7Lr4l1J23Q2n9j49J88J0j9j14P9j22K7J29l3
3589A83R4j50M6L2R0m1m6r4J15mj99J56q4J10J80j45M4k09m3K21q0k9J0P8j00J01q2l3p1Q6
3237A36J36N8k01j0n3O2p7M6P8p1O1J22j56L8j61P6%J6k0O0o7N2J17j07N3r0k8nJ7Q0j6n5
$$ plain form
2862 91 73 86 67 103 282 92 198 102 97 173 167 284 199 100 174 219 116 210 82 148 202 257 142 121 85 145 100 150 167 183 219 137 63
2474 63 76 161 100 161 89 104 49 73 163 181 153 103 124 120 167 126 176 187 201 319 308 77 257 117 18 71 20 33 141 62 13 102 100 6
2075 6 323 443 282 227 203 225 155 121 135 37 56 13 67 209 104 210 165 157 38 138 133 178 57 109 41 134 70 150 133 126 64 108 231
1688 231 140 168 129 159 68 152 237 176 31 197 359 158 137 156 196 269 303 266 32 132 154 100 87 72 255 187 74 108 176 100 196
1324 196 314 168 224 227 131 162 157 26 168 247 161 174 80 215 171 216 81 120 134 143 168 141 162 90 155 263 129 125 241 228 152 229
948 229 128 177 154 168 246 155 39 63 108 235 157 204 99 270 155 96 330 200 104 22 134 128 191 15 234 228 51 185 120 92
596 92 146 266 162 51 70 107 106 207 116 154 248 142 20 81 89 55 256 155 98 28 125 110 126 83 163 170 147 243 349 476 268 104
221 104 42 93 168 74 65 21 155 120 91 50 67 43 84 118 93 165 141 29 181 201 76 199 141 135 51 69 64 117 69 87 130 128 63 190
$$ packed form
2862I1j8J3j9L6J79j90J06r6nP6oJ17q5r9P4M5j03R4j28O6N4N5j15k1l6O0m5N0J7J6L6q2p4
2474F3J3Q5o1O1p2J5n5K4R0J8k8n0K1mM7m1N0J1J4J18j1k31J80j40r9N3n1J3J08p9m9Q9kr4
2075FL17J20j61n5k4K2p0l4J4r8J9m3N4J42j05J06m5qj19J00nM5j21N2o8R3o4Q0j7po2M4J23
1688B31r1K8l9L0r1Q4Q5o1j45J66J62k01k1J9M0P3L4l7k34J00K2n4j3j5J83o8j13L4O8p6R6
1324A96J18j46N6Lr6L1nj31J42P9q6J3r4J35m4M5j35L9J4RK5k7K1p2O5J08j34mJ16j3p6P7
948B29j01M9k3J4P8r1j16K4M5J27p8M7j05J71j15n9K34j30r6q2J12oO3j76K19oj77J34o5k8
596I2N4J20j04j11J9L7jJ01r1L8R4j06j22O1Ql4K01j01n7p0R7j5J6m3Q0Pk3R6J06J27k08j64
221A04o2N1P5r4rm4J34l5k9m1J7k4M1L4k5P2k4j12J52K0j25J23n8oq4J8nN3m8J8M3ko5J27
$$ plain form
-178 190 146
$$ packed form
-178A90m4
-190A46
##PAGE=	F1=-14506.7
##FIRST=	25169.313707327481097,	5807.6787752999953227,	0
##DATA TABLE=	(F2++(Y..Y)), PROFILE
$$ plain form
5808 113 13 75 107 173 69 158 107 40 95 26 138 76 194 52 108 76 220 175 43 18 146 119 217 144 46 124 82 125 143 86 73
5444 73 381 153 90 173 72 153 224 283 193 72 47 190 164 186 127 180 74 121 163 109 236 169 119 180 148 219 171 202 73 194 136
5080 136 236 237 39 104 9 64 140 148 83 182 126 30 148 182 190 135 77 88 221 287 42 148 41 161 166 174 114 207 146 75 86 172 163 231
4681 231 137 73 199 203 310 355 243 37 157 62 61 82 80 176 150 377 214 169 295 150 37 150 94 123 61 170 25 142 191
4340 191 175 253 183 148 135 117 113 80 119 140 126 75 213 126 135 116 64 76 272 244 35 102 148 94 117 15 153 134 76 98 53 142 106
3953 106 16 209 180 44 137 52 52 69 103 319 248 229 128 117 165 155 83 26 148 256 146 59 191 189 184 88 204 65 96 205 173
3589 173 270 158 173 239 304 224 189 130 260 239 53 179 112 207 381 257 251 78 21 224 142 167 177 197 120 241 117 123 78 112 287
3225 287 302 116 132 76 127 62 76 179 117 165 222 111 167 19 143 125 107 68 22 172 111 196 117 184 129 130 52 65 156 119 42 63
$$ packed form
5808A13j00O2L2O6j04Q9n1o7N5o9J12o2J18j42N6l2J44m5j32k5J28k7R8p3r8P8m2M3J8n7j3
5444G3L08k28o3Q3j01Q1P1N9r0j21k5J43k6K2n9N3j06M7M2n4J27o7n0O1l2P1m8L1j29J21n8
5080A36J00Jj98O5r5N5P6Qo5R9n6r6J18L4Qn5n8J1J33O6k45J06j07J20NQo0R3o1p1J1Q6rO8
4681B31r4o4J26MJ07M5j12k06J20r5jK1kR6k6K27j63m5J26j45j13J13n6K9o2J09j45J17M9
4340A91j6P8p0l5j3j8ml3L9K1j4n1J38q7Rj9n2J2J96k8k09O7M6n4K3j02J38j9n8K2m5Q9l6
3953A06r0J93k9j36R3q5%J7L4K16p1j9j01j1M8j0p2n7J22J08j10q7J32knr6J16j39L1J09l2
3589A73R7j12J5O6O5q0l5n9J30k1j86J26o7R5J74j24oj73n7K03q2K5J0K0p7J21j24Om5L4J75
3225B87J5j86J6n6N1o5J4J03o2M8N7j11N6j48J24j8j8l9m6J50o1Q5p9O7n5Jp8J3R1l7p7K1
$$ plain form
2850 63 43 70 89 238 89 202 136 133 194 240 261 144 124 199 182 162 241 38 143 174 233 170 116 114 101 128 199 163 213 219 147 66 112 141
2451 141 71 156 65 101 11 58 174 170 143 121 108 161 179 103 172 200 229 307 244 24 219 71 29 53 33 46 189 64 52 118 79 53
2075 53 283 453 303 251 149 128 125 65 73 13 58 56 76 154 124 174 195 134 25 105 129 164 72 138 73 168 78 83 128 133 39 96 235 171 169
1664 169 117 160 38 159 228 133 17 189 379 209 189 215 105 258 290 232 48 70 127 122 94 57 249 213 70 107 121 84 213
1324 213 334 143 178 228 153 208 225 95 142 223 159 170 117 179 194 221 127 119 146 168 161 97 147 91 202 230 71 172 236 251 108 199
948 199 109 158 154 204 257 124 8 108 125 253 185 219 89 263 123 100 292 187 118 12 96 90 180 14 272 259 69 121 71 91
596 91 190 317 251 82 61 103 79 193 108 127 230 115 57 53 37 78 247 165 151 57 144 91 124 84 141 155 153 215 345 442 181 109 59
209 59 104 201 137 67 68 230 85 68 78 40 57 55 58 54 162 120 40 168 222 89 158 114 177 97 134 8 159 60 109 171 143 86 197 141
$$ packed form
2850F3k0K7J9J49j49J13o6lO1M6K1j17k0P5j7k0P9k03J05L1N9o3n4kj3K7P1l6N0Op2q1M6K9
2451A41p0Q5r1L6r0M7J16mk7k2j3N3J8p6O9K8K9P8o3k20J95j48m2K4k0J3J43j25j2O6l9k6
2075E3K30J70j50n2j02k1lo0Qo0M5kK0P8l0N0K1o1j09Q0K4L5r2O6o5R5r0NM5Nr4N7J39o4k
1664A69n2M3j22J21O9r5j16J72J90j70k0K6j10J53L2n8j84K2N7nk8l7J92l6j43L7J4l7J29
1324B13J21j91L5N0p5N5J7j30M7Q1o4J1n3O2J5K7r4qK7K2po4N0n6J11K8j59J01O4J5j43R1
948A99r0M9mN0N3j33j16J00J7J28o8L4j30J74j40k3J92j05o9j06Q4oR0j66K58j3j90N2n0K0
596I1R9J27o6j69k1M2k4J14q5J9J03j15n8mj6M1J69q2j4r4Q7n3L3m0N7J4kO2J30R7k61p2n0
209E9M5R7o4p0JJ62j45j7J0l8J7kLmJ08m2q0J28N4j33O9m4O3q0L7j26J51r9M9O2k8n7J11n6
-190A41
##PAGE=	F1=-14609
##FIRST=	25169.313707327481097,	5807.6787752999953227,	0
##DATA TABLE=	(F2++(Y..Y)), PROFILE
$$ plain form
5808 140 50 93 121 184 85 184 118 64 151 66 125 125 174 18 122 118 230 143 48 37 160 152 182 158 24 157 55 98 152 98 30 354
5432 354 152 80 151 60 164 194 255 184 93 76 201 150 182 155 166 96 141 134 130 293 207 70 134 124 184 158 195 140 127 146 227 258 52
5045 52 56 36 21 102 151 114 180 155 73 112 166 219 118 24 85 168 242 40 128 65 129 148 195 63 155 88 57 101 174 227 262 174 54 170
4646 170 207 295 334 201 35 139 54 79 96 93 185 112 353 192 201 358 160 38 128 90 193 52 170 31 160 184 199 270 180
4305 180 153 174 124 121 119 111 163 162 120 254 91 177 216 79 57 281 228 92 121 133 94 84 78 155 146 93 137 78 196 107 43 191 180 56
3906 56 143 72 101 93 112 349 244 195 170 141 184 157 93 85 127 257 109 73 155 154 140 83 215 80 102 183 168 260 175 177 257 283 178 170
3507 170 165 286 247 93 193 129 198 368 248 206 81 27 192 116 172 189 149 107 228 116 124 100 82 281 249 106 150 83 139 69
3155 69 63 168 119 193 166 98 149 61 189 162 146 24 249 302 111 157 88 175 154 194 65 64 145 98 24 96 86 58 104 176 92 210 192
$$ packed form
5808A40r0M3K8O3r9R9o6n4Q7q5N9%M9j56J04mJ12q7r5j1J23qL0k4j34J33j02M3N4n4o8L24
5432C54k02p2P1r1J04L0O1p1r1j7J25n1L2k7J1p0M5pmJ63q6j37O4j0O0k6L7n5j3J9Q1L1k06
5045E2Mk0j5Q1M9l7O6k5q2L9N4N3j01r4O1Q3P4k02Q8o3O4J9M7j32R2o7l1M4P3N3L5q8j20J16
4646A70L7Q8L9j33j66J04q5K5J7lR2p3K41j61RJ57j98j22R0l8J03j41J18j39J29K4J5P1r0
4305A80k7K1n0lkqN2jm2J34j63Q6L9j37k2K24n3j36K9J2l9j0oP7rn3M4n9J18q9o4J48j1j24
3906E6Q7p1K9qJ9K37j05m9k5k9M3k7o4qM2J30j48l6Q2jj4n7J32j35K2Q1j5R2q5KQ0K6j05q
3507A70nJ21l9j54J00o4O9J70j20m2j25n4J65p6N6J7m0m2J21j12Qk4j8J99l2j43M4o7N6p0
3155F9oJ05m9P4k7o8N1q8J28k7j6j22K25N3j91M6o9Q7k1M0j29jQ1m7p4P2j0k8M6P2q4J18j8
$$ plain form
2768 192 171 189 288 250 99 166 203 131 207 271 70 132 131 177 175 106 148 83 158 245 134 236 226 163 90 166 113 40 146 52 97 29 37 172
2369 172 159 123 151 103 173 170 70 162 217 256 272 138 64 171 46 32 13 61 86 219 80 125 116 71 85 212 419 292 265 108 74
2005 74 76 50 6 18 90 121 97 101 140 111 216 107 46 88 108 138 79 162 124 172 143 36 121 138 18 81 217 176 148 99 168 33 157
1617 157 202 93 21 160 365 236 214 267 8 224 254 183 56 63 118 161 103 43 229 217 88 124 112 60 214 335 145 112 210
1277 210 183 258 283 196 148 190 154 161 142 131 183 204 179 124 134 193 150 57 108 100 235 185 29 209 219 258 82 173 85 146 151 234 251 79
878 79 21 135 142 265 193 228 72 238 85 109 229 173 133 18 46 49 148 57 298 269 88 63 53 116 218 324 298 120 39 86 53
514 53 169 93 80 183 116 74 20 65 129 227 175 210 87 157 101 111 84 122 154 175 167 296 385 99 159 87 100 218 174 82 113 293 42
127 42 120 106 36 77 95 140 123 172 93 77 154 219 114 110 115 198 128 189 69 193 63 140 202 139 108 191 137
$$ packed form
2768A92k1J8R9l8j51O7L7p2P6O4k01O2jM6ko9M2o5P5Q7j11J02j0o3p3P6n3p3J06r4M5o8QJ35
2369A72j3l6K8m8P0lj00R2N5L9J6j34p4J07j25j4j9M8K5J33j39M5rm5J4J27K07j27k7j57l4
2005G4Kk6m4J2P2L1k4ML9k9J05j09o1M2K0L0n9Q3l8M8k9j07Q5J7j20O3J36m1k8m9O9j35J24
1617A57M5j09p2J39K05j29k2N3k59K16L0p1j27PN5M3n8o0J86j2j29L6j2n2J54J21j90l3R8
1277B10k7P5K5q7m8M2l6Pj9j1N2K1k5n5J0N9m3r3N1qJ35n0j56J80J0L9j76R1q8O1NQ3J7j72
878G9n8J14PJ23p2L5j56J66j53K4J20n6m0j15K8LR9r1K41k9j81k5j0O3J02J06k6j78q1M7l3
514E3J16p6j3J03o7m2n4M5O4R8n2L5j23P0n6J0k7L8L2K1qJ29Q9k86O0p2J3J18m4r2L1J80k51
127D2P8j4p0M1J8M5j7M9p9j6P7O5j05mNQ3p0O1j20J24j30P7O2o3l1Q3n4
-190A37
##PAGE=	F1=-14711.2
##FIRST=	25169.313707327481097,	5807.6787752999953227,	0
##DATA TABLE=	(F2++(Y..Y)), PROFILE
$$ plain form
5808 151 85 105 123 172 104 192 115 96 201 93 103 171 140 43 123 151 241 98 66 69 161 166 154 175 43 204 35 77 160 117 38 322
5432 322 152 63 114 50 161 131 202 162 120 101 191 126 164 190 146 110 154 117 145 326 235 46 86 112 139 126 186 196 53 140 204 271
5056 271 82 18 73 43 69 144 128 182 198 120 81 142 243 105 24 87 101 188 31 114 88 113 112 205 9 97 27 44 106 177 251 257 205
4669 205 60 136 186 264 296 173 44 108 53 96 122 100 187 57 303 177 221 383 153 59 113 135 236 64 160 66 187 182 204 262
4317 262 161 141 187 109 102 151 106 177 182 162 277 56 230 289 111 42 278 182 139 129 137 91 50 143 162 148 93 175 88 239 120 86
3941 86 136 169 56 144 102 147 136 131 365 240 162 206 165 213 178 92 129 102 242 76 79 135 151 90 111 215 104 105 162 162 247 177 174 249
3542 249 242 124 155 205 292 240 137 226 141 190 355 218 171 105 68 169 115 161 185 98 92 198 127 121 108 56 253 177 94 164 85 153 81
3155 81 59 145 106 226 148 88 119 111 214 180 180 85 514 447 101 133 57 168 167 249 89 80 132 80 62 146 145 33 122 98 109 229 251 199
$$ packed form
5808A51o6K0J8M9o8Q8p7j9J05j08J0O8l1r7Q0K8R0j43l2LR2Nj2K1j32J61j69M2Q3m3p9K84
5432C22j70q9N1o4J11l0P1m0m2j9R0o5L8K6m4l6M4l7K8J81r1j89M0K6K7j3O0J0j43Q7O4O7
5056B71j89o4N5l0K6P5j6N4J6p8l9O1J01j38q1O3J4Q7j57Q3k6K5jR3j96Q8p0J7O2P1P4On2
4669B05j45P6N0P8L2j23j29O4n5M3K6k2Q7j30K46j26M4J62k30r4N4K2J01j72R6r4J21nK2N8
4317B62j01k0M6p8pM9m5P1Nk0J15k21J74N9j78o9K36r6m3j0Qm6m1R3J9j4n5Q2q7J51j19l4
3941H6N0L3j13Q8m2M5j1nK34j25p8M4m1M8l5q6L7k7J40j66LN6J6o1K1J04j11JN7%Q5p0lP5
3542B49pj18L1N0Q7n2j03Q9q5M9J65j37m7o6l7J01n4M6K4q7oJ06p1oj3n2J97p6q3P0p9O8p2
3155H1k2Q6l9J20p8o0L1qJ03l4%r5M29o7l46L2p6J11jQ2j60rN2n2j8Q4jj12Q9k4J1J20K2n2
$$ plain form
2756 199 163 302 265 76 220 184 70 243 291 119 112 85 104 160 97 177 106 178 286 85 245 231 163 134 216 84 19 136 58 98
2404 98 64 50 153 139 102 187 114 161 144 50 151 238 278 236 23 111 133 86 33 46 95 106 226 120 195 102 73 97 129 351 258 261 104
2016 104 123 35 80 54 45 122 180 123 63 142 28 219 95 64 94 80 111 80 172 175 145 183 68 110 137 18 69 195 161 107 70 170
1641 170 74 145 166 84 53 117 324 242 208 288 76 171 204 136 58 84 133 215 115 33 211 211 102 139 160 29 203 316 166 43
1289 43 178 196 304 322 262 173 156 139 151 150 70 136 170 225 157 107 207 133 29 49 117 253 140 82 227 192 242 90 161 59 143
925 143 145 244 223 30 42 141 165 267 179 231 63 192 55 108 147 153 146 13 4 20 107 121 306 260 104 77 74 149 231 291 296 158 4
538 4 64 33 125 70 28 118 137 67 62 115 161 196 177 250 103 149 119 94 85 111 171 200 108 213 317 69 221 119 79 214 182 92 151 338
138 338 43 182 139 77 94 169 242 206 197 63 111 135 199 151 64 146 201 147 230 130 224 70 191 215 117 119 177 135
$$ packed form
2756A99l6J39l7j89J44l6j14J73M8j72pk7J9N6o3Q0p1P2J08k01J60j4o8k9Q2j32o5J17p8M0
2404I8l4j4J03j4l7Q5p3M7j7r4J01Q7M0m2k13Q8K2m7n3J3M9J1J20j06P5r3k9K4L2K22r3Lj57
2016A04J9q8M5k6rP7N8n7o0P9j14J91j24l1L0j4L1l1R2Ll0L8j15M2K7j19N1J26l4n4l7J00
1641A70r6P1K1q2l1O4K07q2l4Q0k12R5L3o8p8K6M9Q2j00q2J78%j09L7K1j31J74J13j50j23
1289D3J35J8J08J8o0q9j7j7J2jq0O6L4N5o8n0J00p4j04K0O8J36j13n8J45l5N0j52P1j02Q4
925A43KR9k1j93J2R9K4J02q8N2j68J29j37N3L9Opj33rJ6Q7J4J85m6j56k7lP5Q2O0Nj38j54
538DO0l1R2n5m2R0J9p0nN3M6L5j9P3j47M6l0k5rK6O0K9r2J05J04k48J52j02m0J35l2r0N9J87
138C38k95J39m3o2J7P5P3l6rj34M8K4O4m8q7Q2N5n4Q3j00R4j54J21K4r8KN8m2
-190A35
##PAGE=	F1=-14813.5
##FIRST=	25169.313707327481097,	5807.6787752999953227,	0
##DATA TABLE=	(F2++(Y..Y)), PROFILE
$$ plain form
5808 147 111 109 110 144 124 180 94 125 231 97 73 206 101 84 110 166 241 48 95 109 149 169 139 190 48 239 37 62 161 140 78 290
5432 290 160 61 70 43 148 53 135 130 141 124 170 112 128 218 123 116 162 125 155 322 248 36 49 114 98 98 191 231 68 115 171 274 101
5045 101 39 101 98 80 138 122 185 245 175 95 119 244 105 59 88 36 144 29 104 96 103 90 222 74 78 44 76 97 178 238 217 213 74 100
4646 100 146 232 244 156 50 74 58 113 147 99 187 3 242 181 218 371 143 74 102 176 240 95 142 111 208 185 191 228 128 120 179 69
4270 69 70 173 109 173 174 188 266 54 274 324 132 30 264 118 168 119 165 91 62 197 175 139 76 202 79 261 141 128 56 174
3918 174 40 139 129 186 165 153 362 234 135 222 178 242 206 73 156 76 208 43 82 134 165 41 149 215 137 106 152 150 231 169 155
3554 155 215 194 73 148 235 271 207 171 270 144 193 344 174 174 156 111 164 132 140 160 49 73 157 119 112 95 48 206 100 78 169 88 157
3167 157 93 67 110 80 242 159 77 79 159 211 176 189 200 772 582 72 121 33 162 165 285 113 108 124 63 100 193 190 10 129 13 135
$$ packed form
5808A47l6kJL4k0N6q6L1J06j34k4J33j05j7K6N6P5j93M7J4M0K0l0N1j42J91k02K5R9k1o2K12
5432B90j30r9Rk7J05r5Q2nJ1j7M6n8J6R0r5pM6l7L0J67p4k12J3O5j6%R3M0j63M7N6J03j73
5045A01o2O2lj8N8j6O3O0p0q0K4J25j39m6K9n2J08j15P5qPj3J32j48Ml4L2K1Q1O0k1mj39K6
4646A00M6Q6J2q8j06K4j6N5L4m8Q8j84K39o1L7J53k28o9K8P4O4j45M7l1R7k3OL7j00qN9j10
4270F9JJ03o4O4JJ4P8k12K20N0j92j02K34j46N0m9M6p4k9J35k2l6o3J26j23J82j20j3p2J18
3918A74j34R9j0N7k1j2K09j28r9Q7m4O4l6j33Q3q0J32j65L9N2L1j24J08O6p8l1M6kQ1o2j4
3554A55O0k1j21P5Q7L6o4l6R9j26M9J51j70%j8m5N3l2QK0j11K4Q4l8pj7m7J58j06k2R1q1O9
3167A57o4k6M3l0J62q3q2KQ0N2l5J3J1N72j90n10M9q8J29LJ20j72nJ6o1L7R3lj80J19j16J22
$$ plain form
2791 135 253 295 206 126 284 296 70 263 144 8 262 294 155 80 50 49 131 97 200 139 187 320 43 233 228 143 187 252 61
2451 61 16 133 80 100 85 87 124 106 88 220 143 134 112 62 137 258 289 218 111 135 113 127 33 98 126 103 210 170 255 107 71 94 68
2063 68 272 217 247 124 169 58 106 93 65 151 228 143 57 130 65 207 111 73 119 59 91 79 158 207 101 187 107 94 129 33 67 182
1688 182 133 55 28 157 116 124 128 106 78 76 275 236 179 267 138 105 152 107 63 88 154 270 130 34 218 212 105 147 211 9 183 283
1312 283 186 33 148 182 336 338 287 189 130 114 138 145 4 55 122 255 204 76 205 109 9 22 133 253 115 135 218 164 205 102
960 102 156 37 151 140 230 173 16 62 126 192 259 148 227 75 133 58 91 57 119 153 12 43 26 92 188 292 236 116 113 84 168 228
584 228 232 251 197 41 46 36 66 40 49 68 162 51 129 154 171 151 158 261 98 123 129 87 93 106 198 213 68 114 248 92 260 145 48 188
185 188 162 87 189 361 84 220 175 134 103 244 317 276 228 44 133 112 167 195 31 182 195 161 256 174 252 78 258 212 83 114
$$ packed form
2791A35J18M2q9q0J58J2k26J93j19j36K54L2j39p5l0jQ2l4J03o1M8J33k77J90nq5M4O5j91
2451F1m5J17n3K0j5KL7j8j8J32p7rk2n0P5J21L1p1j07K4k2J4r4O5K8k3J07m0Q5j48l6K3k6
2063F8K04n5L0j23M5j11M8j3k8Q6P7q5q6P3o5J42r6l8M6o0L2j2P9M9j06Q6q0j3L5r6L4J15
1688A82m9p8k7J29m1QMk2k8kJ99l9n7Q8j29l3M7m5m4K5O6J16j40r6J84oj07M2O4k02J74J00
1312B83r7j53J15L4J54Kn1r8n9j6K4Pj41N1O7J33n1j28J29r6j00J3J11J20j38K0Q3n4M1j03
960A02N4j19J14j1R0n7j57M6O4O6O7j11P9j52N8p5L3l4O2L4j41L1j7O6R6J04n6j20lk9Q4O0
584B28MJ9n4j56Nj0L0k6RJ9R4j11P8K5J7k0PJ03j63K5Om2OJ3R2J5j45M6J34j56J68j15r7J40
185A88k6p5J02J72k77J36m5m1l1J41P3m1m8j84Q9k1N5K8j64J51J3l4R5q2P8j74J80m6j29L1
$$ plain form
-167 114 162 129
$$ packed form
-167A14M8l3
-190A29
##PAGE=	F1=-14915.8
##FIRST=	25169.313707327481097,	5807.6787752999953227,	0
##DATA TABLE=	(F2++(Y..Y)), PROFILE
$$ plain form
5808 131 122 105 86 107 145 157 58 145 231 75 54 221 73 109 88 160 222 31 124 146 137 182 136 195 41 242 39 50 152 157 116 259
5432 259 179 100 35 33 130 35 69 91 150 148 148 126 77 227 99 115 168 159 155 279 242 17 22 119 67 93 217 242 147 103 136 264 113 72
5033 72 113 139 126 152 95 186 283 235 142 99 218 117 76 83 10 125 54 97 91 77 127 258 133 111 101 137 73 176 199 155 196 83 67
4646 67 103 213 182 138 57 64 65 130 161 92 188 59 190 196 189 330 148 81 83 184 205 135 120 151 215 181 165 175 85 101 162 18 55 187
4247 187 115 152 138 193 219 95 302 322 138 32 240 53 176 97 208 101 107 235 186 118 63 211 66 254 158 161 56 213
3918 213 25 130 148 212 165 164 333 220 110 212 176 259 228 37 169 65 160 37 89 142 170 11 171 230 175 107 158 135 217
3578 217 152 114 163 151 42 146 245 222 144 182 312 140 207 330 126 210 217 144 175 147 129 121 12 50 120 86 101 63 55 144 46 62 167
3190 167 98 144 97 77 72 59 230 166 62 35 194 184 162 171 312 972 680 42 117 24 157 148 296 132 142 126 48 127 225 212 34
$$ packed form
5808A31rj7j9K1L8J2r9Q7Q6j56k1J67j48L6k1P2O2j91R3K2rM5m6N9j54K01k03J1J02Nm1J43
5432B59q0p9o5kR7r5L4K2N9k%k2m9J50j28J6N3rmJ24l7k25NR7n2K6J24K5r5m4L3J28j51m1
5033G2M1K6j3K6n7R1R7m8r3m3J19j01m1Pp3J15p1M3oj4N0J31j25k2j0L6o4J03K3m4M1j13j6
4646F7L6J10l1m4q1PJO5L1o9R6j29J31OpJ41j82o7KJ01K1p0j5L1O4l4j6J0r0J6O1j44L7J32
4247A87p2L7j4N5K6j24K07K0j84j06K08j87J23p9J11j07OJ28m9o8n5J48j45J88r6Lj05J57
3918B13j88J05J8O4m7jJ69j13j10J02l6Q3l1j91J32j04R5j23N2N3K8j59J60N9n5o8N1k3Q2
3578B17o5l8M9j2j09J04R9k3p8L8J30j72O7J23k04Q4Pp3L1k8j8qj09L8P0l4J5l8qQ9r8J6J05
3190A67o9M6m7k0nj3J71o4j04k7J59j0k2RJ41O60k92o38P5r3J33rJ48j64J0j6p8P9R8j3j78
$$ plain form
2826 34 123 71 160 271 314 189 87 244 325 77 278 97 45 262 278 175 41 49 74 99 110 215 163 185 346 84 200 215 114
2486 114 237 271 52 11 137 104 92 84 108 91 57 78 240 175 101 84 81 115 265 281 220 199 138 103 142 26 134 145 88 180 212 298
2110 298 150 63 83 71 202 192 239 145 178 97 124 105 75 176 264 150 66 106 152 186 139 72 150 59 75 83 117 208 74 165 129 77 122
1723 122 51 85 171 103 18 29 125 143 104 103 127 83 57 239 225 138 207 175 45 104 104 78 69 168 307 145 48 249 226 104 146 240 48
1336 48 162 243 194 76 139 146 348 330 276 188 113 84 120 131 65 46 65 259 243 50 184 80 35 95 138 233 120 162 182 139 158 95
960 95 140 24 165 138 199 104 51 83 94 217 240 111 210 96 71 90 58 28 71 154 46 83 53 135 243 255 204 127 124 74 162 209 171
573 171 181 238 87 41 67 58 5 103 92 184 66 191 176 161 94 117 239 75 100 128 100 118 102 223 206 97 20 189 104 259 159
209 159 38 146 126 65 222 364 115 225 209 192 98 306 354 325 256 51 141 85 128 234 37 201 185 175 265 196 268 100 326
$$ packed form
2826C4Q9n2Q9J11M3j25j02J57Q1k48K01j81n2K17J6j03j34QK5K5J1J05n2K2J61k62J16J5j01
2486A14J23L4k19m1J26l3j2qK4j7l4K1J62o5p4j7lL4J50J6o1k1o1l5L9j16J08J1n7R2L2Q6
2110B98j48q7K0j2J31j0M7r4L3q1K7j9l0J01Q8j14q4M0M6L4m7o7P8r1J6QL4R1j34R1l6n2M5
1723A22p1L4Q6o8q5J1R6J8l9jK4m4k6J82j4q7O9l2j30N9%k6rR9J39j62r7K01k3j22M2R4j92
1336D8J14Q1m9j18O3PK02j8n4q8p5k9L6J1o6j9J9J94j6j93J34j04m5O0M3R5j13M2K0m3J9o3
960I5M5j16J41k7O1r5n3L2J1J23K3j29R9j14k5J9l2l0M3Q3j08L7l0Q2J08J2n1p7ln0Q8M7l8
573A71J0N7j51m6K6rn3R8j1R2j18J25j5j5o7K3J22j64K5K8k8J8j6J21j7j09p7J69q5J55j00
209A59j21J08k0o1J57J42k49J10j6j7r4K08M8k9o9k05R0n6M3J06j97J64j6j0R0o9P2j68K26
$$ plain form
-132 326 198 52 90 148 113
$$ packed form
-132C26j28j46L8N8l5
-190A13
##PAGE=	F1=-15018
##FIRST=	25169.313707327481097,	5807.6787752999953227,	0
##DATA TABLE=	(F2++(Y..Y)), PROFILE
$$ plain form
5808 111 121 91 57 76 166 131 24 154 201 36 66 214 83 112 62 135 181 63 146 171 144 214 136 180 38 208 22 39 130 171
5456 171 148 227 205 153 45 18 106 83 25 49 144 172 134 155 13 213 76 110 175 206 143 204 219 30 12 120 55 96 241 236 218 147
5080 147 113 243 120 98 102 159 169 190 60 180 308 289 186 79 171 137 80 85 31 131 91 96 100 31 190 301 171 149 148 206 49
4716 49 173 149 87 159 88 46 85 204 116 110 73 84 77 145 157 82 191 103 163 206 141 279 169 79 48 151 151 171 97 177 201 159 135 117
4317 117 40 98 148 42 81 196 117 118 91 189 144 139 311 291 128 39 201 47 165 77 254 121 150 250 182 87 78 202 69 219
3965 219 161 185 146 271 56 118 150 220 128 147 271 192 81 179 162 258 233 31 178 85 124 68 104 145 157 34 170 265 213 109
3613 109 170 123 211 129 55 107 129 52 148 227 151 52 164 341 132 218 306 89 249 274 158 201 147 139 76 37 31 96 41 93 18 63 78
3225 78 72 51 160 118 114 88 83 49 68 189 148 49 9 202 145 166 140 391 1071 716 61 118 42 151 123 287 142 176 139 40 132 233
$$ packed form
5808A11J0l0l4J9R0l5j07J30M7j65L0J48j31K9n0P3M6j18Q3K5k7P0p8M4j42J70j86J7R1M1
5456A71k3P9k2n2j08k7Q8k3n8K4R5K8l8K1j42K00j37L4O5L1o3O1J5j89j8J08o5M1J45nj8p1
5080A47l4J30j23k2MN7J0K1j30J20J28j9j03j07R2l4n7Nn4J00m0NMo9J59J11j30k2jN8j57
4716D9J24k4o2P2p1m2L9J19q8ol7J1pO8J2p5J09q8O0M3o5J38j10r0l1J03%K0p4Q0K4m2k4j8
4317A17p7N8N0j06L9J15p9Jk7R8m5nJ72k0j63q9J62j54J18q8J77j33K9J00o8r5rJ24j33J50
3965B19n8K4l9J25k15O2L2P0r2J9J24p9j11R8j7R6k5k02J47r3L9n6L6M1J2j23J36R5n2j04
3613A09O1m7Q8q2p4N2K2p7R6P9p6r9J12J77k09Q6Q8k17J60K5j16M3n4qo3l9oO5n5N2p5M5J5
3225G8ok1J09m2mk6nl4J9J21m1r9m0J93n7K1k6K51O80l55o55N7p6J09k8J64j45L4l7r9R2J01
$$ plain form
2850 233 208 61 109 136 169 278 302 148 58 198 339 103 255 65 78 243 252 182 33 80 122 73 131 222 174 180 361 146 155 194
2498 194 90 274 275 59 22 142 120 78 65 99 64 12 60 241 198 67 71 90 88 248 247 225 242 130 89 128 12 145 148 73 142 227
2122 227 316 207 68 74 94 155 191 246 157 155 138 136 92 76 199 288 142 63 78 217 166 159 64 176 73 58 96 58 173 82 145 137 61
1735 61 116 73 120 151 79 56 84 81 149 102 95 129 60 58 225 208 109 122 186 68 57 113 96 49 172 316 159 62 282 243 109 139 240
1347 240 84 141 200 187 102 153 103 337 296 244 178 103 53 96 113 121 152 24 234 259 31 153 50 77 167 129 197 136 156 122 125 123 72
960 72 101 21 178 133 160 24 80 105 50 230 211 81 180 113 26 119 23 99 25 148 86 132 97 197 275 199 170 143 107 71 133 174 130
573 130 109 274 126 45 104 141 42 148 148 201 112 235 180 140 33 60 190 41 96 118 119 156 95 242 181 152 51 148 90 213 157
209 157 75 108 89 34 245 351 129 199 234 243 80 345 355 353 273 66 138 62 90 259 71 195 174 182 260 196 265 136 381 186 36
$$ packed form
2850B33k5j47M8K7L3J09K4j54r0J40J41k36J52j90J3J65Rp0j49M7M2m9N8R1m8OJ81k15RL9
2498A94j04J84Jk16l7J20k2m2j3L4l5n2M8J81m3j31MJ9kJ60jk2J7j12m1L9j16J33Lp5O9Q5
2122B27Q9j09j39OK0O1L6N5q9kj7km4j6J23Q9j46p9J5J39n1pr5J12j03j5L8l8J15r1O3qp6
1735F1N5m3M7L1p2k3K8lO8m7pL4o9kJ67j7r9J3O4j18j1N6j7m7J23J44j57r7K20l9j34L0J01
1347B40j56N7N9j3q5N1n0K34m1n2o6p5n0M3J7QL1j28K10K5k28J22j03K7R0l8O8o1K0l4Lkn1
960G2K9q0J57m5K7j36N6K5n5J80j9j30R9o7q7R3r6P6p4J23o2M6l5J00P8p6k9k7l6l6O2M1m4
573A30k1J65j48q1N9L7r9J06%N3q9J23n5m0j07K7J30j49N5K2JL7o1J47o1k9j01R7n8J23n6
209A57q2L3j9n5K11J06k22P0L5Rj63K65J0kq0k07P2p6K8J69j88J24k1QP8o4O9j29K45j95j50
$$ plain form
-155 36 51 129 86
$$ packed form
-155C6J5P8m3
-190H6
##PAGE=	F1=-15120.3
##FIRST=	25169.313707327481097,	5807.6787752999953227,	0
##DATA TABLE=	(F2++(Y..Y)), PROFILE
$$ plain form
5808 98 115 69 50 71 179 110 47 154 151 25 88 188 122 92 42 102 128 89 156 177 168 251 130 142 48 138 21 40 98 188 171 189 225
5420 225 193 72 12 76 101 30 28 122 194 134 176 52 176 60 98 184 246 121 115 182 80 49 120 61 77 235 221 267 220 102 213
5056 213 120 111 71 166 195 234 54 167 317 329 212 53 120 160 82 112 38 148 126 106 145 45 239 328 184 174 180 265 68 173
4704 173 104 32 114 89 59 100 193 69 82 98 101 95 158 135 77 195 134 155 202 89 241 191 72 8 85 118 189 74 186 168 115 109 72
4317 72 9 119 144 76 116 205 108 87 88 192 69 167 299 245 105 36 145 93 143 84 292 139 180 244 159 53 105 177 89 163 148
3953 148 199 218 319 104 104 138 204 66 99 181 154 42 125 147 236 222 81 185 117 142 97 128 142 126 47 149 305 246 112 178 123
3589 123 209 103 34 58 135 74 148 182 74 56 122 347 124 213 272 83 269 312 154 239 133 162 42 71 39 80 52 93 31 64
3237 64 19 109 49 156 147 74 67 82 56 96 126 101 57 44 178 116 195 122 417 1047 681 105 124 79 143 101 265 145 205 164 45 112
$$ packed form
5808I8J7m6j9K1J08o9o3J07lj26O3J00o6l0n0O0K6l9O7K1rQ3j21J2r4R0j17J9N8R0j7J8L6
5420B25l2j21o0O4K5p1kR4P2o0M2j24J24j16L8Q6O2j25oO7j02l1P1n9J6J58j4M6m7j18J11
5056B13r3rm0R5K9L9j80J13J50J2j17j59O7M0p8L0p4J10k2k0L9j00J94Q9j44j0OQ5j97J05
4704A73o9p2Q2k5l0M1R3j24J3J6LoO3k3n8J18o1K1M7j13J52n0j19o4P7L3P1j15J12j8n3ol7
4317G2o3J10K5o8M0Q9r7k1JJ04j23R8J32n4j40o9J09n2N0n9K08j53M1O4q5j06N2P2q8P4j5
3953A48N1J9J01k15%L4O6j38L3Q2k7j12Q3K2Q9j4j41J04o8K5m5L1J4j6p9J02J56n9j34O6n5
3589A23Q6j06o9K4P7o1P4L4j08j8O6K25k23Q9N9j89J86M3j58Q5j06K9j20K9l2M1k8M1o2L3
3237F4m5R0o0J07rp3pJ5k6M0L0k5m4j3J34o2P9p3K95O30l66n76J9m5O4m2J64j20O0m1j19O7
$$ plain form
2862 112 212 179 82 95 173 157 274 263 92 59 161 335 143 198 66 85 208 224 184 70 119 164 64 153 215 173 173 362 194
2521 194 114 168 82 292 269 71 50 140 126 67 57 64 45 65 28 221 204 34 75 85 75 203 186 220 243 125 78 89 11 129 135 73
2146 73 102 204 306 253 92 72 103 131 194 253 156 130 191 150 63 72 219 297 123 44 58 251 153 162 51 188 91 46 116 50 113 88
1770 88 150 140 42 108 100 162 123 65 88 133 37 134 120 93 110 15 55 220 179 108 29 177 131 38 119 109 71 171 295 165 66 299 248
1383 248 123 125 213 110 122 154 169 110 168 77 301 239 207 170 94 30 68 96 159 246 70 186 250 14 117 29 118 230 111 147 143
1019 143 119 51 124 126 68 46 29 179 116 126 54 110 131 2 222 172 62 140 121 41 135 31 143 55 135 121 187 149 248 279 137 140
643 140 167 73 98 95 127 116 54 293 151 50 138 232 98 176 192 213 160 251 167 119 28 38 141 7 101 102 130 195 84 252 145 196
268 196 89 127 54 133 144 121 101 69 15 252 326 131 152 245 277 55 351 329 356 272 74 132 56 73 258 110 162 158 176 244 179 243
$$ packed form
2862A12J00l3r7J3P8j6J17j1j71l3J02J74j92N5j32J9J23J6m0j14M9M5j00Q9O2m2%J89j68
2521A94q0N4q6K10k3j98k1R0j4n9j0Pj9K0l7J93j7j70M1J0j0J28j7L4K3j18m7J1p8J18Oo2
2146G3K9J02J02n3j61k0L1K8O3N9r7k6O1m1q7RJ47P8j74p9J4J93r8Rj11J37r7m5P0o6O3k5
1770H8O2j0r8O6qO2l9n8K3M5r6R7j4k7J7r5M0J65m1p1p9J48m6r3Q1j0l8J00J24j30r9K33n1
1383B48j25KQ8j03J2L2J5n9N8r1K24o2l2l7p6o4L8K8O3Q7j76J16O4k36J03q8Q9J12j19L6m
1019A43k4o8P3Kn8k2j7J50o3J0p2N6K1j29K20n0j10P8j9q0R4j04J12q8Q0j4O6l8R9L1j42L
643A40K7r4K5lL2j1o2K39j42j01Q8R4j34P8J6K1n3R1q4m8r1J0J03j34R4JK8O5j11J68j07N1
268A96j07L8p3P9J1k3k0l2n4K37P4j95K1R3L2k22K96k2K7q4j98N8p6J7J85j48N2mJ8O8o5O4
$$ plain form
-108 243 170 412 186 35 9 99 48
$$ packed form
-108B43p3K42k26j51k6R0n1
-190D8
##PAGE=	F1=-15222.5
##FIRST=	25169.313707327481097,	5807.6787752999953227,	0
##DATA TABLE=	(F2++(Y..Y)), PROFILE
$$ plain form
5808 104 118 45 74 90 180 97 84 151 102 70 98 155 163 59 44 88 103 102 148 160 192 273 111 82 53 46 89 77 78 212 185 140 228 211 91
5397 91 48 44 89 49 62 89 207 141 177 110 126 54 80 191 265 92 37 137 132 92 123 84 34 186 199 289 282 94 180 111 110 31 178 200
4998 200 265 98 149 312 349 217 28 86 183 87 160 55 164 148 128 202 110 259 323 177 187 196 303 123 181 74 34 74 90 95
4646 95 122 169 86 92 124 97 120 168 109 82 196 154 153 185 70 230 203 66 66 38 138 180 51 180 129 54 93 66 34 151 151 80 146
4258 146 211 88 84 146 211 78 173 266 199 71 27 84 138 125 108 315 140 196 221 120 33 120 141 106 95 119 206 258 335 145 88 138
3883 138 164 77 65 82 112 5 60 143 198 198 124 186 142 194 108 154 133 88 42 124 336 267 110 175 129 206 79 110 23 155 96 141 120
3495 120 66 167 62 323 116 185 231 101 261 325 133 281 111 181 30 106 71 62 100 101 70 61 21 121 51 161 171 36 46 83
3143 83 73 117 56 42 84 65 123 117 224 128 387 909 580 142 131 121 131 88 237 148 226 195 65 72 165 132 98 86 176 138 272 207
$$ packed form
5808A04J4p3K9J6R0q3j3O7m9l2K8N7Qj04j5M4J5jM6J2L2Q1j62k9k9pM3j2JJ34k7m5Q8j7j20
5397I1m3mM5m0J3K7J18o6L6o7J6p2K6J11P4j73n5J00nm0L1l9n0J52J3R0pj88Q6o9jp9J47K2
4998B00O5j67N1J63L7j32j89N8R7r6P3j05J09j6k0P4r2J49O4j46J0RJ07j80N8j07m0M0J6N
4646I5K7M7q3OL2k7K3M8n9k7J14m2jL2j15J60k7j37%k8J00M2j29J29n1p5L9k7l2J17%p1O6
4258A46O5j23mO2O5j33R5R3o7j28m4N7N4j3j7K07j75N6K5j01q7Q7K1l5j1K4Q7N2P7j90n7N0
3883A38K6q7j2J7L0j07N5Q3N5%p4O2m4N2q6M6k1m5m6Q2K12o9j57O5m6P7j27L1q7J32n9M5k1
3495A20n4J01j05K61k07O9M6j30J60O4j92J48j70P0j51P6l5rL8Jl1rm0J00p0J10J0j35J0L7
3143H3j0M4o1j4M2j9N8oJ07r6K59N22l29m38j1j0J0m3J49q9P8l1j30PR3l3l4j2R0l8J34o5
$$ plain form
2768 207 35 89 140 319 181 123 72 70 160 202 187 101 159 201 84 169 193 164 160 344 219 100 143 87 292 257 80 80 123 121 74 98
2392 98 64 36 113 18 196 192 25 85 64 96 139 102 205 214 132 83 40 30 91 110 82 62 146 272 276 119 82 98 116 181 242 143 142 254
1993 254 165 34 70 238 290 102 11 58 249 143 144 34 182 107 52 136 116 61 69 164 150 19 93 128 198 103 60 103 170 42 104
$$ packed form
2768B07j72N4N1J79j38n8n1kR0M2j5q6N8M2j17Q5K4k9mJ84j25j19M3n6K05l5j77%M3km7K4
2392I8l4k8P7r5J78mj67O0k1L2M3l7J03Rq2m9m3j0O1J9k8k0Q4J26Mj57l7J6J8O5O1r9jJ12
1993B54q9j31L6J68N2j88r1M7J91j06Jj10J48p5n5Q4k0n5QR5j4j31P4L5P0r5m3M3O7j28O2
$$ [...]
-190A31
##END NTUPLES=	nD NMR SPECTRUM
##END=	
##END=	
