##TITLE=	eAcOHZpoSL6d4ZJ8R8bVlg.42.ser
TM-VI-156 hmqc

##JCAMP-DX=	6.0	$$ MestReNova 14.3.0-30573
##DATA TYPE=	LINK
##BLOCK_ID=	1
##BLOCKS=	2    
##ORIGIN=	Mestrelab Research S.L.
##OWNER=	hrzepa
##$MNOVA/LINK_BLOCK_TYPE=	ITEM	$$ NMR Spectrum
##$MNOVA/ITEM/POLYGON=	(XY..XY)
5321,5835
8722,5835
8722,8208
5321,8208
5321,5835
##$MNOVA/ITEM/Z=	0
##$MNOVA/ITEM/ANGLE=	0
##TITLE=	eAcOHZpoSL6d4ZJ8R8bVlg.42.ser
##JCAMP-DX=	6.0	$$ MestReNova 14.3.0-30573
##BLOCK_ID=	2
##DATA TYPE=	MNOVA NMR VIEW DATA
##DATA CLASS=	MNOVA VIEW DATA
##$MNOVA/2D/THRESHOLD=	4.447277069091796875
##$MNOVA/ITEM/ZOOM/X=	-0.98001264966690615488,	11.003459999979801509
##$MNOVA/ITEM/ZOOM/Y=	-9.7479769829748601495,	190.10579999390242278
##END=	
##TITLE=	eAcOHZpoSL6d4ZJ8R8bVlg.42.ser
##JCAMP-DX=	6.0	$$ MestReNova 14.3.0-30573
##BLOCK_ID=	3
##DATA TYPE=	nD NMR SPECTRUM
##DATA CLASS=	NTUPLES
##NUMDIM=	2
##ORIGIN=	Bruker BioSpin GmbH
##OWNER=	nmr
##.OBSERVE FREQUENCY=	400.41200205000001233
##.OBSERVE NUCLEUS=	^1H
##.SOLVENT NAME=	CD2Cl2
##.PULSE SEQUENCE=	hmqcgpqf
##LONGDATE=	2021/11/10 13:57:58.000
##.ACQUISITIONMODE=	SIMULTANEOUS (DQD)
##$ORIGINAL FORMAT=	Bruker XWIN-NMR
##$MNOVA/SCALES_VERSION=	9
##$PARAMETER FILE=	(acqu2s, ASCII, /private/var/folders/f6/rjf_tdyn2v98c5c0wvkgn4s80000gn/T/eAcOHZpoSL6d4ZJ8R8bVlg/42/acqu2s, 0)
$$ ##TITLE= Parameter file, TOPSPIN		Version 3.2
$$ ##JCAMPDX= 5.0
$$ ##DATATYPE= Parameter Values
$$ ##NPOINTS= 129	$$ modification sequence number
$$ ##ORIGIN= Bruker BioSpin GmbH
$$ ##OWNER= nmr
$$ $$ 2021-11-10 14:07:28.440 +0000  nmr@CZC10666PP
$$ $$ /opt/topspin/data/agmb/nmr/Nov10-2021/42/acqu2s
$$ $$ process /opt/topspin3.2/prog/mod/go
$$ ##$ACQT0= 0
$$ ##$BF1= 100.683175
$$ ##$FnMODE= 1
$$ ##$NUC1= <13C>
$$ ##$NusJSP= 0
$$ ##$NusT2= 1
$$ ##$NusTD= 128
$$ ##$O1= 9059.81359838393
$$ ##$SFO1= 100.692234813598
$$ ##$SW= 200.226863172749
$$ ##$SW_h= 20161.2903225806
$$ ##$TD= 128
$$ ##END=
$$ 
##$PARAMETER FILE=	(acqus, ASCII, /private/var/folders/f6/rjf_tdyn2v98c5c0wvkgn4s80000gn/T/eAcOHZpoSL6d4ZJ8R8bVlg/42/acqus, 0)
$$ ##TITLE= Parameter file, TOPSPIN		Version 3.2
$$ ##JCAMPDX= 5.0
$$ ##DATATYPE= Parameter Values
$$ ##NPOINTS= 12	$$ modification sequence number
$$ ##ORIGIN= Bruker BioSpin GmbH
$$ ##OWNER= nmr
$$ $$ 2021-11-10 14:07:32.750 +0000  nmr@CZC10666PP
$$ $$ /opt/topspin/data/agmb/nmr/Nov10-2021/42/acqus
$$ $$ process /opt/topspin3.2/prog/mod/shimcntl
$$ ##$ACQT0= 1000000
$$ ##$AMP= (0..31)
$$ 100 100 100 100 100 100 100 100 100 100 100 100 100 100 100 100 100 100
$$ 100 100 100 100 100 100 100 100 100 100 100 100 100 100
$$ ##$AMPCOIL= (0..19)
$$ 0 0 0 0 0 0 0 0 0 0 0 0 0 0 0 0 0 0 0 0
$$ ##$ANAVPT= -1
$$ ##$AQSEQ= 0
$$ ##$AQ_mod= 3
$$ ##$AUNM= <au_zg>
$$ ##$AUTOPOS= <31 >
$$ ##$BF1= 400.41
$$ ##$BF2= 100.683175
$$ ##$BF3= 400.41
$$ ##$BF4= 400.41
$$ ##$BF5= 400.41
$$ ##$BF6= 400.41
$$ ##$BF7= 400.41
$$ ##$BF8= 400.41
$$ ##$BYTORDA= 0
$$ ##$CAGPARS= (0..11)
$$ 0 0 0 0 0 0 0 0 0 0 0 0
$$ ##$CFDGTYP= 0
$$ ##$CFRGTYP= 9
$$ ##$CHEMSTR= <none>
$$ [...]
$$ 0 0 0 0
$$ ##$ShimPowMaxUC= (0..63)
$$ 130000 130000 130000 130000 130000 130000 130000 130000 130000 130000 130000
$$ 130000 130000 130000 130000 130000 130000 130000 130000 130000 0 0 0 0
$$ 0 0 0 0 0 0 0 0 0 0 0 0 0 0 0 0 0 0 0 0 0 0 0 0 0 0 0 0 0 0 0 0 0 0 0 0
$$ 0 0 0 0
$$ ##$ShimPowMaxUG= (0..63)
$$ 524287 524287 524287 524287 524287 524287 524287 524287 524287 524287 524287
$$ 524287 524287 524287 524287 524287 524287 524287 524287 524287 0 0 0 0
$$ 0 0 0 0 0 0 0 0 0 0 0 0 0 0 0 0 0 0 0 0 0 0 0 0 0 0 0 0 0 0 0 0 0 0 0 0
$$ 0 0 0 0
$$ ##$ShimPowRcbType= 3
$$ ##$ShimPowRes= (0..63)
$$ 1e-20 1e-20 1e-20 1e-20 1e-20 1e-20 1e-20 1e-20 1e-20 1e-20 1e-20 1e-20
$$ 1e-20 1e-20 1e-20 1e-20 1e-20 1e-20 1e-20 1e-20 0 0 0 0 0 0 0 0 0 0 0 0
$$ 0 0 0 0 0 0 0 0 0 0 0 0 0 0 0 0 0 0 0 0 0 0 0 0 0 0 0 0 0 0 0 0
$$ ##$ShimPowRng0= (0..63)
$$ 1 1 1 1 1 1 1 1 1 1 1 1 1 1 1 1 1 1 1 1 0 0 0 0 0 0 0 0 0 0 0 0 0 0 0 0
$$ 0 0 0 0 0 0 0 0 0 0 0 0 0 0 0 0 0 0 0 0 0 0 0 0 0 0 0 0
$$ ##$ShimPowRng1= (0..63)
$$ 1 1 1 1 1 1 1 1 1 1 1 1 1 1 1 1 1 1 1 1 0 0 0 0 0 0 0 0 0 0 0 0 0 0 0 0
$$ 0 0 0 0 0 0 0 0 0 0 0 0 0 0 0 0 0 0 0 0 0 0 0 0 0 0 0 0
$$ ##$ShimPowRng2= (0..63)
$$ 1 1 1 1 1 1 1 1 1 1 1 1 1 1 1 1 1 1 1 1 0 0 0 0 0 0 0 0 0 0 0 0 0 0 0 0
$$ 0 0 0 0 0 0 0 0 0 0 0 0 0 0 0 0 0 0 0 0 0 0 0 0 0 0 0 0
$$ ##$ShimPowRng3= (0..63)
$$ 1 1 1 1 1 1 1 1 1 1 1 1 1 1 1 1 1 1 1 1 0 0 0 0 0 0 0 0 0 0 0 0 0 0 0 0
$$ 0 0 0 0 0 0 0 0 0 0 0 0 0 0 0 0 0 0 0 0 0 0 0 0 0 0 0 0
$$ ##$ShimSysFunc= (0..63)
$$ 1 2 3 4 5 7 9 11 15 16 8 10 12 14 6 17 13 18 19 20 0 0 0 0 0 0 0 0 0 0
$$ 0 0 0 0 0 0 0 0 0 0 0 0 0 0 0 0 0 0 0 0 0 0 0 0 0 0 0 0 0 0 0 0 0 0
$$ ##$ShimSysMatrix= 0
$$ ##$ShimSysType= 1
$$ ##$TFXNUM= 0
$$ ##$TRIPLO2= 0
$$ ##$VTU= 2
$$ ##$VTUETH= <149.236.99.20>
$$ ##$VTUTY= <no>
$$ ##$WBREFAM= (0..15)
$$ 135 116 100 100 100 100 100 100 100 100 100 100 100 100 100 100
$$ ##$WBREFLM= (0..15)
$$ 0 0 0 0 0 0 0 0 0 0 0 0 0 0 0 0
$$ ##$WBREFPH= (0..15)
$$ 71.66 -68.25 0 0 0 0 0 0 0 0 0 0 0 0 0 0
$$ ##$WBSGU= (0..15)
$$ 0 0 0 0 0 0 0 0 0 0 0 0 0 0 0 0
$$ ##$XFAC= 2
$$ ##END=
$$ 
##$DECIM=	4160
##$DSPFVS=	20
##.ACQUISITIONSCHEME=	NOT PHASESENSITIVE
##NTUPLES=	nD NMR SPECTRUM
##VAR_NAME=	FREQUENCY1,	FREQUENCY2,	SPECTRUM
##SYMBOL=	F1,	F2,	Y
##.NUCLEUS=	13C,	1H
##.OBSERVE FREQUENCY=	100.69223481359800587,	400.41200205000001233
##VAR_TYPE=	INDEPENDENT,	INDEPENDENT,	DEPENDENT
##VAR_FORM=	AFFN,	AFFN,	ASDF
##VAR_DIM=	512,	512,	262144
##UNITS=	HZ,	HZ,	ARBITRARY UNITS
##FIRST=	19140.455529915001534,	4405.895418600002813,	0.69079303741455078125
##LAST=	-981.45727250430979893,	-392.40686505384644533,	0.42717874050140380859
##MIN=	-981.45727250430979893,	-392.40686505384644533,	0.00060432142345234751701
##MAX=	19140.455529915001534,	4405.895418600002813,	55.419536590576171875
##FACTOR=	1,	1,	0.0029774143659637920985
##PAGE=	F1=19140.5
##FIRST=	19140.455529915001534,	4405.895418600002813,	0.69079303741455078125
##DATA TABLE=	(F2++(Y..Y)), PROFILE
$$ [...]
##PAGE=	F1=-12440.3
##FIRST=	19140.455529915001534,	4405.895418600002813,	0
##DATA TABLE=	(F2++(Y..Y)), PROFILE
744D36l11J36J49k19q7J11Lm7O5r0j06M3M1n8K4n8J17r1J39j26J6O7r0K9L4o1M9J10l1r7K4
$$ 436 125 261 410 191 104 215 218 171 236 146 40 83 124 66 90 32 149 58 197 71 87 154 64 93 127 66 115 225 194 97 121
453A21Q9j27J27k9q4J41o1q4QJ59p6N7R2k14jP9O3j51k6N8J18q8n2M6K2k4J61n1j57J21O1
$$ 121 210 83 210 181 97 238 177 93 101 260 184 241 333 119 118 197 260 109 83 141 259 171 119 165 187 163 324 273 116 237 298
162B98j36j2M5j40M6O5n4p9M2m4N2N7q5J86j7j26lo6R0R0l0j48lO0J06rp6k0J62j16j10J4
$$ 298 162 150 195 55 101 166 112 33 75 31 83 140 55 241 224 98 95 29 119 209 179 31 28 88 194 185 109 89 251 135 25 39
-139C9O2PJ00l8K50j11j71p2J3K3J58k05M4P7j2N9K8j0j21rN5lk0o3l6J5N3
$$ 39 101 108 208 170 420 309 138 66 79 102 260 55 99 176 164 223 251 241 120 111 166 163 143 80 44 59 112
-392A12
##PAGE=	F1=-12519.1
##FIRST=	19140.455529915001534,	4405.895418600002813,	0
##DATA TABLE=	(F2++(Y..Y)), PROFILE
4406E1J41m3p0P5n8l1N9L7L1L6M4o8%r1j6P9k3oj17M6J8J9p7M5Q4j30R1q4O5k1k7l3PN7R6
$$ 51 192 149 79 154 96 65 124 161 192 228 272 204 204 113 97 176 153 147 30 76 94 113 36 81 165 35 126 42 107 86 59 26 33 90 186
4077A86j07m7Q4K1mj9k5R1j0P6o6Q7o5k5L9j09j9mLk3J21j14O2p5J09Jm6K5R4m0m6j25J0R9
$$ 186 79 32 116 137 133 114 89 180 170 246 180 267 202 177 216 107 88 84 87 64 185 71 133 58 167 168 122 147 241 201 155 30 40 139
3758A39p3Q7Q4j72L5jN1pQo5Q3m5L3j13J48p9P1r5k8J00P5LJ9k9rn4j4pk3p1J59j12qL7O4
$$ 139 66 153 237 65 100 99 150 143 151 86 169 124 157 44 192 113 184 89 61 161 236 239 258 229 220 166 152 145 122 51 210 98 90 127 191
3429A91j61J49Nl0K5k3j03J39p9K8p7L2M5j8j20M7L9J91K9j89pK4m1P0n0o3J76Q3m7k10L3
$$ 191 30 179 184 154 179 156 53 192 113 141 64 96 141 123 3 50 89 280 309 120 113 137 96 166 116 53 229 312 265 55 88
3138H8o0jOJ19ll0j0O4n4J47%k01O0k2oQ7j32J51j19J86p5J30k47oKP5m7L9j11Q3p3L8L2J4
$$ 88 28 27 33 152 149 119 109 173 119 266 266 65 125 103 97 184 52 203 84 270 195 325 78 72 74 149 102 141 30 113 40 78 110 124
2819A24q9K3K4l5LP8M0m0J3P2m3q7P3k7r8K88n3j94rQ5l7K0q2P7j02J73P6l0q6p2J13p7M6
$$ 124 35 58 82 47 50 128 168 128 141 213 170 83 156 129 31 319 266 72 63 148 111 131 49 126 24 197 273 243 157 85 198 121 167
2509A67q0n6N6P2j46J02k2K3L8J23m9j65O4N0r9K2k4J00q0l6O8r5M1L2J36P7q4m5l8l8o8M5
$$ 167 87 31 87 159 13 115 93 116 154 277 228 63 127 177 78 100 76 176 96 60 128 33 74 106 242 319 235 190 152 114 46 91
2209I1n7j0O8J87m0n3j0j33rL9J66j00j2K6K8ml6Ln6J32K7o0K2J3j73J20l3P7j14k2M6J56
$$ 91 34 24 92 279 239 186 176 43 34 73 239 139 127 153 181 177 141 144 88 220 247 187 209 222 49 169 136 213 99 77 123 279
1908B79j76Q2m1j8n3P1K8k1l0M5k4k9p8K3J9J06o3o0M0n4Q7j16P6M3q9J03j43N4kL6p7J65
$$ 279 103 185 144 126 73 144 172 151 121 166 142 113 35 58 77 183 120 60 100 46 133 17 93 136 47 150 7 61 59 95 18 183
1608A83J78j18n9M2j04RlN8r7N1j17J94P9j91k4J67m1p7k8l0J02n7n4%P6k7QO6Q9j33Nj2p3
$$ 183 361 243 184 226 122 131 128 186 89 140 23 217 296 105 81 248 207 130 102 72 174 117 63 63 139 112 120 186 275 142 147 135 62
1298F2K2J65p0p8l8M7o4Q4J51k26Q7J28q7K1K2pn7PJ89O1j83J01k63J12Rk7l6oN5Om2j16M6
$$ 62 84 249 179 101 63 110 46 130 281 55 142 270 183 204 226 219 162 169 358 419 236 337 74 186 195 168 132 126 181 187 145 29 75
988G5N9m0l4J01O9j40J51j65P8R2k7j03p1R5L5L5j78M1Q9j02J4Q3K29L51L60p06k25N6J82
$$ 75 134 94 60 161 230 90 241 76 154 246 219 116 45 140 175 210 32 73 162 60 74 157 386 737 1097 391 166 222 404
716D04j86r5N4k5j4P9j11j4L4k6mp8K2R1n9J16j01kO0j29P3N0m2K8P7k8p0QR7j36J21l4m2
$$ 404 218 123 177 152 138 217 106 92 126 100 96 18 40 131 72 188 87 85 145 16 89 139 97 125 202 174 104 112 209 73 194 160 118
406A18J03q1q9N1J87j04O2Q8j92pQ1O6j72n6O0J56q8r2O1P1j0J38m0j71Q5N7j33J4M7j46P8
$$ 118 221 140 51 102 289 185 247 335 143 136 217 283 111 55 115 271 183 91 152 223 213 351 311 140 225 282 149 163 210 64 142
115A42M7l9r6K4j9PL7k6J49k2q2l3p2J22Q4l3j75O3O9L6j7m4k6J45j07j08J2N2N4L8l1K77
$$ 142 189 150 54 78 59 66 103 77 226 204 122 89 17 139 223 190 15 78 147 183 166 122 96 241 134 26 38 90 144 182 151 428
-186D28r2j93p8RJ5J53k04J19j5K5O9pRj00kP1k8m4n4ro6R2
$$ 428 336 143 65 74 89 242 38 157 142 167 236 229 238 138 136 207 179 135 81 72 6 98
-392I8
##PAGE=	F1=-12597.8
##FIRST=	19140.455529915001534,	4405.895418600002813,	0
##DATA TABLE=	(F2++(Y..Y)), PROFILE
4406G2J10n5p0R8n8j5K4L1N6K4M8n6J0p5l3P6m1j1n8K7k0l6oR1Oj18P2o7J54o2j2l2j6l7J24
$$ 72 182 127 57 155 97 82 106 137 193 217 265 209 219 144 111 187 146 135 77 104 84 48 42 133 139 21 93 26 180 118 106 74 58 21 145
4077A45o9m7N6O1JJ8q2Q7k4J09l2O4r5k4L2j00j0JJ9l9J29j25N0l2R3k9l2O5R9q6o7r5O9R7
$$ 145 76 29 85 146 147 165 83 170 146 255 223 287 192 168 200 100 90 91 110 71 200 75 125 93 186 157 125 190 289 203 136 41 110 207
3758B07j52O2Q7j47L8K0O7Qm2q7R6o2J9m5R8n3O3r2pJ34Q3k6k2o0K1m4l3N1r5nR5r6n3P4P6
$$ 207 55 117 204 57 95 115 182 190 148 61 157 95 114 69 167 114 177 85 78 212 295 269 247 187 208 164 131 182 87 82 177 81 28 102 178
3429A78j48J29mJM2k1j23J17q6L8m3L6M7J6j33JK8J76L0k09P5jm8P0m1l2J82J8o7j44j0pk1
$$ 178 30 159 155 156 198 177 54 171 85 123 80 116 163 179 46 47 75 251 281 72 147 146 98 168 127 95 277 295 228 84 74 67 46
3119D6J7J46l1n4k9J05r3R9M1j77N3m8K4J11j52J67k11K13p6J18j76l3j2P8j0M9p9M8p1K4
$$ 46 63 209 178 124 95 200 107 206 247 70 123 75 99 210 58 225 14 227 151 269 93 60 48 126 116 165 86 134 63 87
2838H7L0jn9mJ0Kj5N8K7j2k1M2j6p5Q6n9m6K68j9j83n5L7l0L4m2Q1r8J27O7k9r7oP4l8M5p8
$$ 87 117 116 57 53 63 65 50 108 135 123 102 144 128 53 139 80 34 302 283 100 45 82 52 86 44 125 27 154 221 192 95 89 163 125 170 92
2500I2p1O2P8j26Q5p6L3L7J43k4j46P7M6j29J9l1Q6j01oR3r2M2NJ54Q3n1r8l7o2kLn7RP9J54
$$ 92 21 83 161 35 120 44 77 114 257 233 87 164 210 81 100 69 155 54 48 141 49 91 96 250 333 282 184 147 85 83 86 29 38 117 271
2171B71m0n1j9j00Mj9J84o7j01Q7O0nq3L9r0J03N3m3K4l4j53J28N0L0j28j4M1J15j77J55p6
$$ 271 231 180 161 61 65 46 230 163 62 149 209 204 121 160 70 173 226 183 207 173 20 148 198 228 100 86 127 242 65 220 144
1880A44k8m2P8L2l6j7L9oj0j40J8P2R9o5r3M3OR1j73J61jj60R0p7N4K0J3m8N1K17q7r0K3p1
$$ 144 116 74 152 184 148 131 170 164 154 14 32 104 203 138 45 88 94 185 12 173 172 12 102 25 79 99 112 64 115 332 245 155 178 107
1561A07Kn1M8P1J2j53J92O6k05LJ59j6r2o2M7P1q1o6k0J18q6Q2M4O6j31K0J7p3OJ51r0q6r
$$ 107 109 58 106 177 189 36 228 294 89 92 251 235 143 81 128 199 118 52 32 150 64 146 190 256 125 145 162 89 95 246 156 70 61
1251F1O6n6K2J54j92R1J07q6%JK7l7QJ84N4k03J53k79Q1M7l9o9mL1K2j4q7MR5l3mP2N5j37
$$ 61 127 71 93 247 55 146 253 167 167 168 195 158 166 350 404 201 354 75 156 203 164 95 91 122 144 130 43 47 142 109 105 177 232 95
932I5J30j92Q7J46k1j34p4Q7N0O0j98N2J36j92K9O3K36M63L55q15j59m1J91j37p4pn5M8N0
$$ 95 225 33 120 266 245 111 37 124 174 234 36 88 224 32 61 124 360 823 1178 363 204 163 354 217 143 136 81 129 179
659A79r3P4j3o2M2l3k6M1l8J14p7l5N4q5M7O9k6NK8l3l2mJ14j36R7l9j1O9q8q3R5J96j31O4
$$ 179 86 160 147 85 127 94 68 109 71 185 108 73 127 42 89 158 132 137 165 132 100 96 210 74 171 132 121 190 102 19 114 310 179 243
340B43P8j57NN5O0j81m6K2J91q2j13N2J08J3J08l4j60L0N8j14J5N5j32J16K7l3j08N0l8j1
$$ 243 321 164 169 224 284 103 57 79 270 188 75 127 235 248 356 322 162 192 250 136 151 206 74 190 217 184 76 126 88 77
58G7L8j4R7k1k6n3p0J16Q8m7j28R4N1l0k5j2l2J03q0r7L2J8R7l1%K58p3j91p4nLJ45j57J34
$$ 77 115 101 198 177 151 98 28 144 232 185 57 151 202 172 147 135 103 206 126 29 61 79 176 145 145 403 330 139 65 60 63 208 51 185
-261A85q3N3R1l8K1p1j7P6m6o3j0Jn4L0
$$ 185 102 155 246 208 229 158 141 217 171 108 98 99 45 75
-392G5
##PAGE=	F1=-12676.6
##FIRST=	19140.455529915001534,	4405.895418600002813,	0
##DATA TABLE=	(F2++(Y..Y)), PROFILE
4406I7O7p3o5J17m9Lk1L1P8J5O2m5J7m5n7L7n1kj0K4n9l5M4R5o6r8L9J4J62o7Lm3l8j5K7k3
$$ 97 164 91 26 143 94 97 76 107 185 200 262 217 234 189 132 169 118 116 106 130 71 36 80 175 109 11 50 64 226 159 162 119 81 66 93 70
4068G0o2M4R4J3M4j25P1n0J41J8L6j20qK3j11K2j9M3l2J15j28J5L2O0n4nQ9R8j18q4o8J05
$$ 70 8 52 146 159 203 78 149 99 240 258 294 174 166 189 78 100 81 124 92 207 79 94 126 186 132 127 216 314 196 112 44 149
3767A49R6k12M6R7r1OM7O4J9q0r1J11r2MJ8N4m9O6p4K0J48Q0n1n7q3M9l6j6P8j22J5K1n7k1
$$ 149 245 33 79 176 85 91 138 202 221 141 50 161 69 73 91 145 96 162 88 108 256 336 285 228 145 194 158 142 220 98 113 134 77 56
3448E6K6P2j23J06j8K3M7j5j27Q6q0M6%K5N8L6j41l6P0R5L5k03J21j1m0O3m2KJ68l8q7o6m5
$$ 56 82 154 31 137 119 142 189 174 47 133 53 99 99 124 182 218 77 41 111 206 241 38 159 148 108 171 129 131 299 261 174 108 63
3138F3K0j5J8J55n6o2l5J19r1K4O4j24M0q0M2J25j21J57j88J26n9P9r7l9l9P1K9O7n7no2K0
$$ 63 83 68 86 241 185 123 88 207 116 140 204 80 120 40 82 207 86 243 55 181 122 201 104 65 26 97 126 193 136 131 69 89
2838H9L0j8k0k7kL5l9M8nJ3m7J8Jm6Q3q4J5K15J9j53j07kRM6k3O7q0P0P4k4j26R4mML4p7l5
$$ 89 119 101 81 54 52 87 48 96 91 104 57 75 76 30 113 29 44 259 278 125 18 16 25 71 48 115 35 105 179 155 29 123 119 123 157 80 45
2490D5J7R1j01Q2j08J1L9J55kj20Q4N2j56K3n4P4r2j8J00o4M8j0J60J02o2j32K4j01K9l6n5
$$ 45 62 153 52 134 26 37 76 231 229 109 193 245 89 112 58 132 40 22 122 58 106 96 256 358 296 164 188 87 116 80 25
2199B5N2O6J18m1m7l3o7L4m5J61m9j72J36R1j1j17N5r3P5P8m6J7p6o9Q2J28k2j36NN6O3j79
$$ 25 77 143 261 220 173 140 73 107 62 223 174 2 138 229 218 101 156 63 138 216 170 187 111 42 124 252 230 94 99 155 218 39
1899C9K07q4m7m7R7L6n2j2K1PLj54pJ33P8o4j21M4N6R0j91K25o5j74M6nK9L9rj0o6K53n3r2
$$ 39 246 162 115 68 165 201 149 137 158 165 168 14 7 140 218 154 33 77 133 223 32 257 192 18 64 59 88 127 118 108 42 295 242 150
1579A50j9m9Qn5MJ98qj60J47O2k09L0J25Rr5n4R2L4p8p9pJ01j14J32K1M3j25L5M2o1jJ02j07
$$ 150 131 82 90 35 39 237 229 69 216 278 69 99 224 233 138 84 176 210 132 53 46 147 33 165 186 229 104 139 181 120 119 221 114
1270A14o8K6O8n8l3J45j51J10O6p9rk7M6k8K8J85M7k27J81k56K6J07n2j01PL6OM4q5NP5l9
$$ 114 46 72 140 82 49 194 43 153 219 140 131 104 150 122 150 335 382 155 336 80 106 213 161 60 67 103 109 153 68 73 148 109
969A09L9L4K5j01J23j68MJ86nj50n8O7O2P4j98N3J72j67m7N7J90N74L89q79j62j10J54q4l8
$$ 109 148 182 207 106 229 61 65 251 246 96 38 105 167 241 43 96 268 101 54 111 301 875 1264 385 223 113 267 183 145
697A45m0q0J31j8m9J08m6p7O9J1p5M1n3J25m9r4N4j6JR2l0k0j5l8J4j7J41j14M6m3QL5o9k1
$$ 145 105 25 156 138 89 197 151 74 143 154 79 120 67 192 143 49 103 87 88 180 150 130 115 77 91 74 215 101 147 104 112 147 78 57
378E7P2J89j54O2O2j14L4J3M0j62Mn2K11p0j15J3J36M1O7l6j25k6O0q2oO8j11J63J0m9j13
$$ 57 129 318 164 226 288 174 208 221 261 99 103 51 262 192 77 90 226 267 334 298 173 147 207 125 119 187 76 239 249 200 87
86H7Q0n7NM6m7M5j6L2m9o3Q3Q7p2m8R1L7p9m0K4k6L4m1q2O4oJ11r1M2K06n8j65p1lj9J27j13
$$ 87 167 110 115 161 114 159 143 175 126 63 146 233 161 113 204 241 162 122 146 120 154 113 31 95 89 200 109 151 357 299 134 63 60 41 168 55
-252E5J33j10N5J16m9K7m9n1O6n3o8M8lm1k2
$$ 55 188 78 133 249 200 227 178 127 193 140 72 120 117 76 54
-392E4
##PAGE=	F1=-12755.3
##FIRST=	19140.455529915001534,	4405.895418600002813,	0
##DATA TABLE=	(F2++(Y..Y)), PROFILE
4406A22J8r8k9J07l7J8o3M4Q6J2Q0l2K6j3q6k3n3J6J4K6o6LK8J00j14o3j6P8J56n1J9n7n0
$$ 122 140 42 13 120 83 101 38 82 168 180 260 228 254 241 155 132 79 95 109 135 69 72 100 200 86 23 7 85 241 190 209 152 102
4096A02J5o8J8l7L6P3K8N9j50M6p6J62O8J5j42J6J4j34Q1o2P6j9P8j20l3J01J6o6K2R3J00
$$ 102 117 49 67 30 66 139 167 226 76 122 46 208 276 291 149 165 179 45 126 64 140 121 199 79 46 147 163 97 119 212 312
3805C12j21r7n7J15R0k15M6J01m7m1N3N8L8j01p9J24j05k1M4L3o7P1l4L9J40P5p0q1r3O8k9
$$ 312 191 94 37 152 242 27 73 174 127 86 139 197 235 134 55 179 74 53 97 130 63 134 100 139 279 354 284 203 110 178 149
3514A49L2O2j16rk8mK8k0K3q7R3l7K1M7pj11M7n2M2L7PO9M4j44l3J10JL5j76J27kl8O6l6J5
$$ 149 181 243 127 118 90 86 114 94 117 30 123 86 107 154 147 36 83 31 73 110 117 186 230 86 53 163 164 199 23 150 148 110 176 140 155
3185A55J30p4j01J2p6K5K2KJ46p7n7j9J02p5l6O9l8J0r6K2J27o4J46j54L7k4L7m3l0o3N5O2
$$ 155 285 211 110 122 46 71 93 95 241 164 107 88 190 115 79 148 110 120 24 46 173 109 255 101 138 114 151 108 78 15 70 132
2885A32Q6m0p5m6K9L1l3J7m9nO0o0N6m6J8l5k3OL0L0n5K1J49N2j13j06N0j0K8n0M8n0J3J01
$$ 132 218 178 103 57 86 117 84 101 52 47 107 47 103 57 75 40 17 23 53 83 28 49 198 250 137 31 81 71 99 49 97 47 60 161
2565A61j6m7P9r6M7Pp7M0n6J02q8R6j14RRJ55J1r9Q4O2j73L5q9P2p2j7P1l1O1j3J62J07j04
$$ 161 145 98 177 81 128 135 58 98 42 144 56 152 38 47 56 211 222 123 207 269 96 131 42 114 42 25 96 65 126 113 275 382 278
2256B78j42J04j17J8o8m7Q0N4R0l9m6m5m0O3n4J38n1j23O5J16j6j39N2p0O5Q8o7jj07L8K7
$$ 278 136 240 123 141 73 26 106 160 250 211 165 120 80 143 89 227 176 53 118 234 218 79 131 61 126 214 147 146 39 77 104
1964A04J85p2j24J9P7K7j86K20p6n4o7J30M4o7j9lQJ2j30j4J59N5o9j34M6Q4Q7j85K69j34
$$ 104 289 217 93 112 189 216 30 250 174 120 53 183 227 160 141 138 146 158 28 14 173 228 159 25 71 155 242 57 326 192
1683A92j51L2J6mM4k2L9j20K27j4p8o9l9K6rl8K28j7j36P6N7k04Q3N8K9r2j3J01Jo0q6L3M0
$$ 192 41 73 89 85 129 107 146 26 253 239 161 92 53 79 70 32 260 243 107 183 240 36 119 177 206 114 101 202 203 143 57 90 130
1373A30o6J05LK6j16N4O0m5kL3j16m1O9N6p8o0J19j05J31K6p3nm3L2k8P0J76M0k48J77j92
$$ 130 64 169 172 198 82 136 196 151 149 182 66 25 94 150 72 12 131 26 157 183 110 105 62 94 66 136 312 352 104 281 89
1082H9l8J72o2j19L5N7l2R5j05L7L3p0Q7kj6n7J41j26j16K01J7j56k1M0O8Q0j92N6J97j25
$$ 89 51 223 161 42 77 134 102 197 92 129 162 92 179 177 161 104 245 119 3 204 221 65 44 84 152 232 40 96 293 168
800A68r0L5J09O65M55q87k24j23M9l5nl4k8J40p7k0J06n9o4O4L7j07Q0q4J30j6j65O1M4m3
$$ 168 78 113 222 887 1342 455 231 108 157 122 117 83 55 195 118 98 204 145 81 145 182 75 155 71 201 185 20 81 125 82
518H2J06m3m6l9l9O6l7J73q5om7J3kj3K0L5J69j66N3M1o7P3l0J1j15M5r5J96n8r9n4J61O8
$$ 82 188 145 99 60 21 87 50 223 138 132 85 98 96 83 103 138 307 141 194 235 168 241 211 222 107 152 57 253 195 96 42 203 271
209B71J3m3p6o8N9l8k4O4r1K11jq6r6Q9n4K9M4r5Oj1Q1k2n8M9O7j00M9O3K1j04o4O9%n6jo6
$$ 271 284 241 165 97 156 118 94 158 67 278 277 191 95 184 130 159 203 108 114 103 184 162 104 153 220 120 169 232 253 149 85 154 154 98 97 31
-129C1R3qR5j22P6J41n0j22o9K4k7O9q9J34r2K7J31m8M0m3q8L9m4n8R9k0k9l2
$$ 31 124 116 211 89 165 306 256 134 65 89 62 131 42 176 84 111 242 194 234 191 103 142 98 40 139 119 90 58
-392E8
##PAGE=	F1=-12834.1
##FIRST=	19140.455529915001534,	4405.895418600002813,	0
##DATA TABLE=	(F2++(Y..Y)), PROFILE
4406A41k7j02L6M3k7K6p2N2P7J0R2j6L6J7j10p1m6K0J3K4m0J9PJ04j29m1nN4J45k9L8p2m8
$$ 141 114 12 48 91 64 90 18 70 147 157 249 233 269 286 176 105 59 79 92 116 76 95 102 206 77 36 31 85 230 201 239 167 119
4096A19K0j01L9PL4J0M0O6j54J6p0J44J04Nj56K9J0j45J45q2R4k2K3r9l3J12l3n3K8Q2J05
$$ 119 139 38 77 84 118 128 168 234 80 96 26 170 274 279 123 152 162 17 162 80 174 152 175 76 43 155 122 69 97 179 284
3805B84r3r9o9J00P5j26L0Q9l6p3L0N1P6j03p1J42r5m9K0K9q5P0K6L9J11P5p9r2q8O8j4Q4
$$ 284 191 92 23 123 198 72 102 191 155 82 112 163 239 136 65 207 112 63 83 112 27 97 123 162 273 348 269 177 89 157 143 227
3504B27K0j02n1l5L6N8k1o1m7R3m8j3M4Lp5LkK3N6j2P4M1j39J2J26o6J6j21R4J6m8P9j0qP5
$$ 227 247 145 94 59 95 153 132 71 24 117 69 56 100 103 28 31 29 52 108 96 170 211 72 84 210 144 160 39 133 149 101 180 170 162 237
3176B37r0r5P1r8J7Q0k8J14q7m8J8O2o1o5O7O4l0o6n8J17MJ28j25k9J1L0l6j4q3M4Q8R5k7
$$ 237 147 52 123 25 42 122 94 208 121 73 91 153 92 27 94 158 128 62 4 121 125 253 128 99 110 140 104 90 7 51 139 234 207
2866B07j48k9N2K7l9M1o5KO8o6P9n0j5K4l7k7O5l3npR1O9o9p9P7l7K7q1L6j6l5J39jK2M6j73
$$ 207 59 30 82 109 70 111 46 48 116 50 129 79 64 88 51 24 89 56 51 44 135 204 135 56 133 96 123 42 78 62 27 166 165 187 233 60
2528F0Q1k8o8J10q8Q1j00J27j27K9j5J40J6r0P6O6j71N0j22P5o6M0K2k5Q4j8J69Q6j56j25
$$ 60 141 113 45 155 67 148 48 175 48 77 62 202 218 128 204 270 99 149 27 102 36 76 98 73 157 139 308 394 238 113
2246A13J62j09rr1l5Q4M8P4k6n3n3k3Q6o4J40p5o4j8J33j6j49M0m2P6P9r0l2m7O8j0K05j10
$$ 113 275 166 157 66 31 115 163 237 211 158 105 82 168 104 244 169 105 87 220 204 55 95 53 129 208 118 86 39 107 97 302 192
1946A92r4K0R2Pj83J99o6m7q4J73N0q1l6k7NJ8j00j0J65L9q4j24M7Q5Q1j56K84j87j07M0m
$$ 192 98 118 210 217 34 233 167 120 36 209 259 178 142 115 120 138 38 28 193 232 148 24 71 156 237 81 365 178 71 111 107
1655A07l4K9k0R2r1J19L4o3j03l7M2J1l6K02k2r3KM3j59J43l4K9q0L8Q3k3l9q4O6k2LN4rJ6
$$ 107 73 102 82 174 83 202 236 173 70 33 75 86 50 252 230 137 139 182 23 166 132 161 81 119 202 179 140 56 122 100 103 157 148 164
1335A64j05Q0P0l3kl5j07j4R8M5j14J2M2o7J19Jo5Pk9k2J2Q3J37M0k53J36r7j3J39o6j08M5
$$ 164 59 139 209 176 174 139 32 18 116 161 47 59 101 34 153 154 89 96 67 45 57 140 277 317 64 200 103 90 229 163 55 100
1035A00O9n1J14j24O7J0j22J32k8n9j6J68r2r1N9N0j64L3J4O3Q4j87O1K02p4r5lL6P13N30
$$ 100 169 118 232 108 175 185 63 195 167 108 92 260 168 77 136 186 22 55 69 132 216 29 90 292 218 123 120 156 869 1399
753A399q65l01r9q7QQlL6J29r5k4Q2m8k6K6M0j10J10j06J27J1j98N0R4p9R0n3o6j1pN9n8J95
$$ 1399 534 233 134 47 55 63 60 96 225 130 106 188 140 114 140 180 70 180 74 201 212 14 64 158 79 169 116 50 39 32 91 33 228
443B28o2l6m8Mm2O5L6rJ42j68M3J8k7J18n8k5n8O5j02J57n2o9r6J52Q3m7n3k0q8M9J1oL0q3
$$ 228 166 130 82 86 44 109 145 136 278 110 153 171 144 262 204 179 121 186 84 241 189 120 24 176 259 212 159 139 51 100 111 105 135 52
124E2K43pj25n3O7k8M7L0j43jk3J17K2n7K2L4j18J35K1Lj09r3J20M2j37K0n4J14kO7j07R1
$$ 52 295 288 163 110 177 149 196 226 83 82 59 176 198 141 163 197 79 214 235 238 129 36 156 198 61 81 27 141 139 206 99 190
-176A90Q0n9p6n6N0k5kq3J44o8jJ20l7O3n2j07Kk1l0J19m6j9j
$$ 190 270 211 135 79 129 104 102 19 163 95 94 214 177 240 188 81 83 62 32 151 105 86 85
-392H5
##PAGE=	F1=-12912.8
##FIRST=	19140.455529915001534,	4405.895418600002813,	0
##DATA TABLE=	(F2++(Y..Y)), PROFILE
4406A49o2k4Rnk0K3k0J3O2PR0%M4M6j23p0k6k3nJ5NK1rR8j10l9J6NJ32qN2p8m2Pp4M0M8K4
$$ 149 87 63 72 67 47 70 50 63 125 132 222 222 266 312 189 119 93 70 65 80 85 106 97 195 85 46 62 67 199 191 243 165 123 130 56 96 144 168
4049A68n2M8O6j47rk4Q5J15Mj58K5J2q6J53o7Q9m5l8o7L4M4p6Nj6P3J05n5q4q9N9N5JPO8m5
$$ 168 116 164 230 83 74 50 135 250 254 96 121 133 47 200 133 222 177 139 72 106 150 74 79 63 136 241 186 102 13 72 127 128 135 203 158
3720A58o9k0M8J24q5p4J59q0q1l3L5o5M1R4K6O1Q0o8r2p4M5J4J16l1q6r5jM9P4Lj27l7J04
$$ 158 89 69 117 241 156 82 241 161 80 47 82 17 58 152 178 239 319 251 159 85 130 144 260 229 143 48 47 96 170 173 46 9 113
3411A13m0n8K7J8k7k0J9ON5k4O8K6j19P3J26r3k7n0M9K9p1R6K4m7J1q6l8P0q1L8R0o8O3m6
$$ 113 73 15 42 60 33 13 32 38 93 69 137 163 44 117 243 150 123 73 122 151 80 176 200 153 164 78 40 110 29 67 157 89 152 106
3091A06n8N2Ro0j6L6J41p2l2m8L4M4R9r5p6L5M9n5Pr2L5J08Q8j4k06nP6J1l7M6p0K5M5o0J15
$$ 106 48 100 109 49 33 69 210 138 106 58 92 136 235 140 64 99 148 93 100 8 43 151 239 225 19 14 90 101 64 110 40 65 110 50 165
2763A65l1l4M5n0l6N6o8Pk0M8O8k7m4P7o4L1r0K7J7o6J73J6N5K3k27J03n4l1J41r3N1j14J48
$$ 165 134 100 145 95 59 115 47 54 34 82 150 123 79 156 92 123 33 60 77 11 184 200 255 278 51 154 100 69 210 117 168 54 202
2453B02j28K0k3J25K6r8O5N8j54O8j41P8o5R2lm1J12k9J83M1k04q0J81q5l6j10k1O8M7P4j
$$ 202 74 94 71 196 222 124 189 247 93 161 20 98 33 125 122 81 193 164 347 388 184 104 285 200 164 54 33 101 148 222 221
2162B21o7n8j4J02q2J64j09or9J36j2j45K6j4Q8N4r8m3P2J2k9J92j28o2J2R2Jj60J54n5k8
$$ 221 154 96 82 184 102 266 157 151 52 188 176 31 57 43 131 185 87 44 116 128 99 291 163 101 113 205 206 46 200 145 117
1871A17q1K12M4r5o0m5J3J3p9qJ62L4j01r8M7O1P2j08K69k10n7M1l0m7j5K0J20o6J5Q7m7j15
$$ 117 36 248 292 197 137 92 105 118 39 31 193 227 126 28 75 136 208 100 369 159 102 143 113 66 51 71 191 125 140 227 180 65
1570F5l6L8J0nJ66l3n7m4Nk6J44j16lm2O4M9l7j7p7Q6p4O8Lj1Pr3J10P6k6nq4p4LR8M3j48
$$ 65 29 67 77 72 238 205 148 104 109 83 227 111 108 66 130 179 142 125 48 134 60 128 131 120 127 34 144 220 194 189 105 31 34 132 175 27
1232B7Q5L6q5P3Jn5K1j9m0P8L9O9M8k04M5KN4N4o4p7K4P6n6J11j28Q1J3j70J59m5r4K5J87
$$ 27 112 148 63 136 137 82 103 84 44 122 161 230 278 74 119 121 175 229 165 88 112 188 132 243 115 196 209 39 198 153 59 84 271
922B71p1n4q4J11j48M9mM7R7j58J7J87j8o9m6MP11N82q38l60p9r7Jlj2Q5J17p7n0M4k2J9j7
$$ 271 200 146 62 173 25 74 70 117 214 56 73 260 242 173 127 131 842 1424 586 226 147 50 51 48 36 121 238 161 111 155 133 152 135
612A35J8q6J11j07J22J8j86L3J32q2J3m9o5P7j9L1o6J94m9l9m2j0n4J06M4n3J09j64L9Pj1
$$ 135 153 67 178 71 193 211 25 58 190 108 121 72 7 84 65 96 30 224 175 136 94 84 30 136 180 127 236 72 111 118 107
321A07J64o7n7j4O9r0J08n0k9o3O9Q6j03n7L4p0RN4L6oq4K36mj53%K9J2N3Oj80N3o0J23P4
$$ 107 271 204 147 133 202 112 220 170 141 78 147 233 130 73 107 37 46 100 136 130 46 282 278 125 125 154 166 219 225 45 98 38 161 235
2B35o6nJq8J60j3k2j03o8J22Q5j67km6J15QL9n5R8K8r0l5l2O8k5o0o6J43n6j8P7qP9o8q8k7
$$ 235 169 164 165 77 237 224 202 99 31 153 238 71 69 23 138 146 185 130 228 256 166 131 99 167 142 82 16 159 103 85 162 154 233 165 77 50
-336E0nJJ11q1pM3
$$ 50 45 46 157 76 69 112
-392A12
##PAGE=	F1=-12991.6
##FIRST=	19140.455529915001534,	4405.895418600002813,	0
##DATA TABLE=	(F2++(Y..Y)), PROFILE
4406A42p9L7k1k8LnK4k6O6mO8J4M6P3j20l8op4j7lM1J9j2P3p1m6L2n1J15J1N6n8n3j4rL2Q1
$$ 142 63 100 79 51 54 49 73 47 113 109 177 191 237 310 190 152 146 72 55 52 93 112 100 173 102 56 88 37 152 163 219 161 108 94 85 117 198
4058A98Or2M6N5j33k3kN2J02Oj43lK6j5J50m0Q0p7r0l4R2j9r4P1o9O5Q1k8n8q1j3M0J24k2
$$ 198 204 112 158 213 80 57 55 107 209 215 72 69 95 80 230 190 270 193 103 69 161 142 48 119 50 115 196 168 110 29 16 56 180 158
3739A58L5n8l0n2M7J44n2q4J74p2j17o7J6pj0J55J0oR2l6q2o4OM9J19p4o9j14L6M3P6M5j27
$$ 158 193 135 105 53 100 244 192 108 282 210 93 26 42 35 25 180 190 184 276 240 158 94 100 149 268 194 125 11 47 90 166 211 84
3429H4o4P9j9j2l2K8j1j4jlL3k5N2Jp9J25J19j01p6L0QK8r8J06N0p6n1o2M7K6m1Q5O1j08Q
$$ 84 20 99 80 68 36 64 53 39 38 35 68 43 95 96 17 142 261 160 84 114 122 150 52 158 208 132 81 19 66 92 51 136 197 89 97
3101I7P8p1J3l9p7P9J1J61j09kl7K2J7N6n7j03L8O9o7L3q2J5J25O1Kj86OO6j8l3L1n6N6j1
$$ 97 175 104 117 78 1 80 91 252 143 141 104 126 143 199 142 39 77 146 79 112 30 45 170 231 233 47 53 119 101 68 99 43 99 88
2781H8m4J55j1l7M4o9m5M4o2j6kK2L0J5JN7q8J9o5J1M0p5J96K8O0Pk63J19o0J8J40r0K5j03
$$ 88 44 199 188 151 195 126 81 125 63 47 45 67 97 112 113 170 82 101 36 47 87 12 208 236 296 303 40 159 99 117 257 167 192 89
2462H9J42j08k7j9J07M6j05M4L8j27Q4j36P0m6J11k5n3J37m1J99j8k37j8J64n2n5j31%L3N1
$$ 89 231 123 96 77 184 230 125 169 207 80 164 28 98 52 163 138 85 222 181 380 362 125 107 271 219 164 33 33 66 117
2180A17Q4L1q6n6mJ07j09J99j45M9j35Q6nj26K0L1P1J1p6L1Q5l8l9J57j22m3KQ3Nj27R8l8
$$ 117 201 232 146 90 86 193 84 283 138 187 52 138 133 7 27 58 129 140 64 95 180 142 103 260 138 95 97 180 185 58 156 118
1880A18Mn3K27K3j07q5o0M1j0o4rJ48L5j11o1M5J9N9n0K30j88k1L2n8k9n4Q3R3m6q0J42l1
$$ 118 122 69 296 319 212 127 67 108 98 34 25 173 208 97 36 81 100 159 109 339 151 130 162 104 75 21 104 197 151 71 213 182
1579A82j14m9L0NP1J26n0o5l0p3J09J39j66n8M1L6Om1Lo2Q5j12J24l7omq1J42P4k5j2r5n8
$$ 182 68 19 49 54 125 251 201 136 106 33 142 281 115 57 98 134 140 99 102 40 125 13 137 100 94 90 9 151 225 200 188 93 35
1270C5K0Q6N1j49J15O4j34J7K0l8L9l5j6J13jj4O6j20k0M3J07k9n6l6k4Q1m7R2j16Q0L0j67
$$ 35 55 141 192 43 158 222 88 105 125 87 126 91 75 188 187 173 239 119 99 142 249 220 164 128 104 185 138 230 114 194 224 57
969E7J35n6j11O3J85o0j6j58J56j25L2k0K9J23j18p2J50L6j6p4lO92O08q22m01q3l0j9K5n9
$$ 57 192 136 25 88 273 213 197 39 195 70 102 82 111 234 116 44 194 230 214 140 137 829 1437 615 214 131 101 82 107 48
687D8Q1J10m2q1pJ4N9m5k0n6Q8o5J10j4j58M2J57n2j02m0K0P9m6Rn7J81m9j7l7j8j9Q4M3q4
$$ 48 129 239 197 116 109 123 182 137 117 61 149 84 194 180 22 64 221 169 67 27 47 126 80 89 32 213 164 147 110 92 73 157 200 116
368A16P2j58N0L5n0K04o1p3J3N5o5N6n4J5k3k3Q3j21j2L1j7m3N4P8k1p2J74Nj63M8%M2M9k0
$$ 116 188 30 80 115 65 269 208 135 148 203 138 194 140 155 132 109 192 71 59 90 73 30 84 162 141 69 243 248 85 133 133 175 224 204
49B04j89J36p9Q8J16q7m0j9k1J23j9m7j05K8N8J18j67l4m1R4J9J2J7J10k0j36jKP7k7j07k5
$$ 204 15 151 72 160 276 189 149 130 109 232 213 166 61 89 147 265 98 64 23 117 136 148 165 275 255 119 118 120 197 170 63 38
-252C8J26m4l8NO0O1q4l6k4k7L1Q7j15OP8
$$ 38 164 120 82 87 147 208 124 88 64 37 68 155 40 46 124
-392A24
##PAGE=	F1=-13070.4
##FIRST=	19140.455529915001534,	4405.895418600002813,	0
##DATA TABLE=	(F2++(Y..Y)), PROFILE
4406A18p6P7n4k4L8l3K9n5J02l0K7K8M1R1j00oK0j08j4jL5J3nL4l0m9M7q2O5L1M3Jq6l9Q1
$$ 118 42 119 65 41 79 46 75 20 122 92 119 147 188 279 179 173 193 85 71 70 105 118 113 147 117 68 115 33 98 129 172 173 87 48 129
4077A29JJ05j5r8L8K6j13k2pM8O7J5j05o5N4M0J47j3P0j05j14j1J16m9n6Q3p7M5L3l5k7n2
$$ 129 130 235 220 122 160 186 73 51 44 92 159 174 69 4 58 98 245 232 302 197 83 72 188 139 83 166 89 134 167 132 105 53
3777E3j8L2J50m5j0p0K7k7M9J08k0q7J82o9j52j0l9j0l5J91Nq0J04J7p6o6l5Q5R5j01m7l4
$$ 53 35 67 217 172 162 92 119 92 141 249 229 142 324 255 103 93 54 44 9 200 205 125 229 246 170 104 69 154 249 148 101 67
3476F7k3M3O1R8j08p8J0MM2l6K2k2k5mnqj6M0l8J0J22J07j05j12J05k6K0j28J06O1p5j02N3
$$ 67 44 87 148 246 138 60 70 74 116 80 102 80 55 51 46 38 22 62 24 34 156 263 158 46 151 125 145 17 123 184 109 7 60
3166F0K1Pk5J39L4j38KJ74q3m7p3l4P9J3J48j37K2k9M3l4Pj8q6LP6n6N8p7JJ42K3J6j54J6
$$ 60 81 88 63 202 236 98 100 274 191 144 71 37 116 129 277 140 162 133 176 142 149 131 45 48 124 68 126 49 50 192 215 231 77 93
2847I3P2n0l2kk3Q4q1j9J83Rl9L3q6n3K8l4k5K5J5l7N3N0M4r4l7k8rN2o4K03L1M7mk67J17
$$ 93 165 115 83 81 58 142 61 42 225 234 195 228 142 89 117 83 58 83 98 61 114 164 208 114 77 49 40 92 28 231 262 309 305 38 155
2519A55n4O8J27q5Jp9J21p6q2j2P2Q2r4PJ6j02R4j21O7k7J09n4n1J55n1K11p5k55M8J25k2
$$ 155 101 169 296 211 212 133 254 178 96 84 156 238 144 151 167 65 159 38 105 78 187 133 82 237 186 397 322 67 115 240 218
2227B18n9j45L4l1N8R7O1j03l7OJ00j42K30j72R0j06k2Ko5oR0L3n2j1Q7O5o5n6J17r2l7j3
$$ 218 159 14 48 17 75 172 233 130 93 99 199 57 287 115 205 99 77 79 14 8 98 131 79 68 155 220 155 99 216 124 87 74
1927G4Q4J1j03M3j0L3j9K33j1j13j05p7P7m6k8k0J13L7j10j5L6j2K6RJ76j28nJ9q4Lj4Q1M1
$$ 74 158 169 66 109 99 132 113 346 335 222 117 40 117 71 43 23 136 173 63 48 84 72 98 107 283 155 150 169 85 88 74 155 196
1617A96l4j28J61j4j05o6J4L3J39R7n3j30K0j00J51J31j90j08J31j3l8l6K4m2O1p0J01o3Q
$$ 196 162 34 195 181 76 10 24 57 196 293 240 110 130 30 181 312 122 14 145 132 94 58 82 40 101 31 132 69 77
1345G7j9l4J42N8k9k3o8p2M3O8O8j47J30R2j87l4M7j5O3o9QJ37k6r2P9l6j7K3J26r0m5Pq1
$$ 77 58 24 166 224 195 172 104 32 75 143 211 64 194 286 99 65 112 97 160 91 99 236 210 118 197 161 144 167 293 203 158 165 84
1035H4P6k1O8r8O6N4j35R0o9q4P1J62n2J0j31J41j30L5m3J4J55p8j58P3P8O2p7rO89O38q31
$$ 84 160 139 207 109 175 229 94 184 115 31 102 264 212 222 91 232 102 137 94 108 263 185 27 100 178 240 163 154 843 1481 650
744F50m18j38J2k7P1p1M3J13oj12o6O0Q6n3l5o0N5K3Q5q3j13O1J70j3j50o4N1P4p0nl1J57
$$ 650 232 94 106 79 150 79 122 235 229 117 51 111 197 144 109 49 104 127 212 129 16 77 247 234 84 20 71 145 75 70 39 196
443A96n6K1l8j8J4N0K9q5L3j14L6P9j18K29n4o4L3K5l6K6p3M6J6j13P7m7K5j8J5m0j2J08j7
$$ 196 140 161 123 105 119 169 198 113 146 32 68 147 29 258 204 140 173 198 162 188 115 161 177 64 141 94 119 101 116 76 64 172 155
133A55n0Q2J5j51Q5pM0M4m1j17J51r2P3J31j13p9k8L5O4J3n0j35J14MJ32j56n3m0N6L0rQ5
$$ 155 105 187 202 51 136 129 169 213 172 55 206 114 187 318 205 126 98 133 197 210 160 25 139 143 275 119 66 26 82 112 103 188
-167A88J32o8j82L0L5Q7l3j46J0J17k0p3m5J40mr4K3j9n0P4N0j40K2Q3
$$ 188 320 252 70 100 135 222 189 43 53 170 150 77 32 172 168 74 97 78 28 102 152 12 34 117
-392A17
##PAGE=	F1=-13149.1
##FIRST=	19140.455529915001534,	4405.895418600002813,	0
##DATA TABLE=	(F2++(Y..Y)), PROFILE
4406H1n0Q9p8qP2l9j5OR5p0k4M4L6R1p4J8N2j23j2J6J8jNqLm1O5o0j3L8J0Q6j13n1J35m9J15
$$ 81 31 120 42 34 106 67 52 58 153 83 59 103 139 230 156 174 226 103 91 107 125 124 129 121 124 83 148 88 75 113 123 209 96 45 180 131 246
4058B46l0p7L0k1p7pj5M5J4N5n8l8l3O3J47QO1j19j11MR4m1pP9p5K7op3Kj2qM7J21n4o4p2
$$ 246 216 139 169 148 71 64 49 94 108 163 105 67 34 97 244 252 313 194 83 87 181 140 133 212 137 164 158 85 87 75 67 114 235 181 117 45
3720D5P9QO6N6Jp8J83o7j80N5n5p4j9J85J7j27J01O8p7p7o7J11N5j09j7L0p6N7K8J56r3p7
$$ 45 124 132 198 254 255 177 360 293 113 168 113 39 20 205 222 95 196 264 187 110 43 154 209 100 83 113 37 94 122 278 185 108
3420A08q2K3J00l3J8k4l2j2Kn7kN4njR9R1j07j26J61n1J6j18N8N4m4m1O3l2K8m9J90J8j56
$$ 108 26 49 149 116 134 110 78 66 68 11 9 63 58 57 156 247 140 14 175 124 140 22 80 134 90 49 112 80 108 59 249 267 111
3110A11L3K12q4r5j10j5P6L6J16j49L5k6O9p6l6J2n0m5P8k4O9p7qJ56j5K7j34L9R3p9l6m2
$$ 111 144 356 272 177 67 52 128 164 280 131 166 140 209 133 97 109 59 14 92 68 137 60 52 208 193 220 86 125 218 139 103 61
2810F1J4J11j14j3J77L2m1J6j04n6J0jmM0J2q9Q1Q8N3r4r1l0k1N3l9K01K1K8j4k23Q4n4J21
$$ 61 75 186 72 59 236 268 227 243 139 83 93 92 88 128 140 51 132 220 273 179 88 58 37 90 51 252 273 301 287 64 148 94 215
2500B15J06p6k5m9R4m3j21mJ4J29o0m2Pr0R2r9O7k2J03q2l9J57n5K17j16k22P0P2Km9r8L0
$$ 215 321 245 220 171 265 222 101 97 111 240 180 138 145 55 147 48 115 93 196 114 75 232 177 394 278 56 126 198 200 151 53 83
2199H3m4pJ01Q2j14OJ2Q3j76K52j75R9n2j08j3MqJ19Kj23P6R0M1o1q5Q4m4k0n8J16Nj02jK0
$$ 83 39 32 133 215 101 107 119 202 26 278 103 202 150 42 29 33 25 144 146 23 99 189 230 169 84 168 124 104 46 162 167 65 64 84
1880H4M8K7K33n3j09j20q1R5q9L5l0N2L5j04M4J6Pn3N5J22m8lJ0j11L2J6Q7pk8p8R2Lq6m5
$$ 84 132 159 392 339 230 110 29 124 35 70 40 92 127 23 67 83 90 37 92 214 166 163 173 62 94 110 197 190 162 84 176 179 93 48
1561D8j0N7J65P6l6k06N6p8J15J24j89j02J63n7p3k9N3l0K7pM9p7L0l4J7J40K3l7k7k9q2N2
$$ 48 38 95 260 336 300 94 150 72 187 311 122 20 183 126 53 24 77 47 74 67 116 39 69 35 52 192 215 178 151 122 40 92
1260I2M8Q6j55J50J05k31p2P3J1Q8r9J4J54l9j50P4L9j1J2J12j22l1M1j18M6K3N5q6M3P7j03
$$ 92 140 226 71 221 326 95 23 96 107 195 96 110 264 225 75 149 188 177 189 301 179 148 189 71 117 140 195 109 152 229 126
969A26N2q9l1O5J21m1J4q4J27j43N8p4jJ80l6j85j9N6J46n4MO79P00q64l99k15k1l4J14n8
$$ 126 178 89 58 123 244 203 217 133 260 117 175 101 100 280 244 59 40 96 242 188 192 871 1571 707 308 93 72 38 152 94
687I4J1J23K2j40q8Q5Q9m7jj03J5J17N9j48m6M9J67K1j34r7K3O5q1kJ9J09o7O1m6j2M3J8n
$$ 94 105 228 250 110 22 107 196 149 148 45 60 177 236 88 42 91 258 279 145 48 71 136 55 53 72 181 114 175 129 117 160 178 173
378A73n3nl1j7J07j46K15n8l2N2j0j5M5j06L8N6j40J8N5J9m9L3k5p6J21pk6jJ7j31J20jQM1
$$ 173 120 115 84 67 174 28 243 185 153 205 195 180 225 119 157 213 73 91 146 165 116 149 124 48 169 162 136 135 152 21 141 140 148 189
58A89n1l5J49j07P7J30j28r6l7M3LP8l1j53J43k7J26j41o0m5K2L4rJ18J58j05k21O0O2R5k9
$$ 189 138 103 252 145 222 352 224 128 91 134 137 215 184 31 174 147 273 132 72 27 49 83 74 192 350 245 24 84 146 241 212
-233B12j85L7J07J0j16M8R4q4r7O6j4k9R8Mj20J7M4
$$ 212 27 64 171 181 65 113 207 123 26 92 78 49 147 151 31 48 92
-392I2
##PAGE=	F1=-13227.9
##FIRST=	19140.455529915001534,	4405.895418600002813,	0
##DATA TABLE=	(F2++(Y..Y)), PROFILE
4406C7oP4n9j4R6k8r0J13P0j08n8N0M0O7n9L4Q2j22j7L3J2j7J1m1J6j7Q6l0k8Mk2J46j06o6
$$ 37 31 105 46 32 128 100 10 123 193 85 27 77 117 184 125 159 241 119 102 135 147 130 141 100 116 99 185 155 127 131 109 255 149 83
4087H3J39j08J13l1m2K6p7k4J2kJ9l6J34m6k9j12O3J48J9N7j16j01K7K8pL7P5p5Rk3j09J0
$$ 83 222 114 227 196 154 180 103 79 91 89 108 72 206 160 131 19 82 230 249 306 190 89 116 144 137 174 249 174 183 160 51 61
3786F1L0j2O0R1m4j20l1Q8L0Q6J5J0n9J77o3j90J06p0j39J4J50M8j20P5R1q8r3p6J24J5j03
$$ 61 91 79 139 230 186 66 35 123 153 239 254 264 205 382 319 129 235 165 26 40 190 238 118 193 284 196 103 27 151 166 63
3495F3J7O2j15Q2j4K06q3o2j29k0J61k6J0j5k1m2J5o4oO4L6m8P3P0j01j06J75n9J8p7LK5j8
$$ 63 80 142 27 109 95 301 218 156 27 7 168 142 152 137 116 74 89 25 19 83 119 71 144 214 113 7 182 123 141 64 67 92 74
3185G4%P5q1O9r3K27J5j70N4K29p6j13j60pO6P8P6j42L0k4R1r9n5K1k4l4L6J5N8p7j1J67m1
$$ 74 74 149 68 137 44 271 286 116 170 399 323 210 50 43 109 187 263 121 151 127 218 119 64 85 61 27 63 78 136 59 48 215 174
2875A74K9j28P5J16j04m2p4M0J37r6l6J35O2m0j0j20m9j1K8M0M6Oj21J02J06P2r5j13o9k3
$$ 174 203 75 150 266 162 120 46 86 223 127 91 226 288 248 238 118 69 58 86 126 172 178 57 159 265 337 242 129 60 37
2594C7M5pJ92jJ2k6j52M9p7J71Q8o3n0k6O6j6j40Mm9J84k6q6J4r1P5o6O3l4J01r5k9J45n9
$$ 37 82 75 267 266 278 252 100 149 72 243 331 268 218 192 258 242 102 106 57 241 215 129 143 52 127 61 124 90 191 96 67 212 153
2284A53K18j34j34M0PJ5k2l4J8l6o5O9Q7j22O7J3N9j96K56j45P2Oj04l2j2OJ35j2j11P5N2
$$ 153 371 237 103 143 150 165 143 109 127 91 26 95 182 60 127 140 199 3 259 114 186 192 88 56 44 50 185 173 62 137 189
1993A89K3k6j23O5QJ7j33J65j7j12l0L5N0Q3K31r1r5j35m0O2j19R4l6qL3n9O7j8N0r3L3P5
$$ 189 212 186 63 128 136 153 20 185 168 56 26 61 111 194 425 334 239 104 64 126 7 101 65 57 90 31 98 80 130 37 70 145
1692A45L1pJ2j35M9K0J06m1k6k3L0J1n8k6j1N9J62N4mk41M9o7O9J23j61p3J56q7q9k7R1l3
$$ 145 176 169 181 46 95 115 221 180 154 131 161 172 114 88 77 136 298 352 348 107 156 89 158 281 120 47 203 116 27 0 91 58
1392E8oL4Lq1O1m9N7J45k0m8j1mq0M5K9J01j73J82R8k67n3N5M0J06j14%J60l8j79M3R6j5K8
$$ 58 52 86 89 8 69 20 77 222 202 154 143 139 59 104 133 234 61 243 341 74 21 76 116 222 108 108 268 230 51 94 190 175 203
1082B03P3j24j9O0j04j9O6O5p8J0R5p9K2j13K5O6O3k4ll2J18j56R4j05j8J84J1j91L6r0J83
$$ 203 276 152 133 193 89 70 136 201 123 133 228 149 171 58 83 149 212 188 185 153 271 115 209 104 86 270 281 90 126 36 219
791B19j3M8O33P85r10l42k53r2k9O7l1J2J25L4j59lL6N4l7N6j29m3J83L5j58j2K1J51M5j08
$$ 219 206 254 887 1672 762 420 167 75 46 113 82 94 219 253 94 91 127 181 144 200 71 28 211 246 88 76 97 248 293 185
509A85j18j3N4p7L5N9M5o8Q4o4JO7ko0Om0M5p9J19j32J79p7K1O1l9nR4j36jR5j00o9J14Lo7
$$ 185 67 54 108 31 66 125 170 102 186 122 123 190 188 128 134 94 139 60 179 47 226 149 170 231 192 187 281 145 144 239 139 70 184 187 120
180A20M2Lj20J12Mom3Jq9J30kl6M5n2M0J34j24Q2J26j23p0n4j4l4J47j3j56J44l5J13j25o8
$$ 120 162 165 45 157 161 155 112 113 24 154 152 116 161 109 149 283 159 241 367 244 174 120 106 72 219 206 50 194 159 272 147 79
-120G9n4L0OL4P7J88j25k14N4P5J05j2k12M8Q3L7j53J46L6j42p5O1J0J1J01m0j03J8p
$$ 79 25 55 61 95 172 360 235 21 75 150 255 243 31 79 162 199 46 192 228 86 11 72 82 93 194 154 51 69 62
-392F2
##PAGE=	F1=-13306.6
##FIRST=	19140.455529915001534,	4405.895418600002813,	0
##DATA TABLE=	(F2++(Y..Y)), PROFILE
4406DL0M9rl7J07qr5J43M7j34m5J9N0M0o9M7R8j08k3M0J6k8J1o0PK4J05kk3k5l4J58q0j02
$$ 4 34 83 74 37 144 136 41 184 231 97 52 71 121 161 92 139 237 129 106 146 162 134 145 85 92 116 221 219 196 171 137 295 215 113
4087A13J28j64R9Mk0K2j23K9L0J3j0m2J90n3l7j67N3J43K3N9r6j09O8n2K1P3P8q0mk9r3j9
$$ 113 241 77 176 180 160 182 59 88 118 131 121 79 269 216 179 12 65 208 231 290 194 85 153 101 122 195 273 193 189 160 67 48
3786D8N1k5O3P0k3j62L5O3L4J00oQl7J66n4j81J32q5j82N2Q8Q8q5O0P8j03j10o3J25j0q1L6
$$ 48 99 74 137 207 184 22 57 120 154 254 248 256 219 385 331 150 282 197 15 67 155 243 158 218 296 193 83 20 145 135 54 90
3486I0O2j36J07m8K35p6l6j13m0J36j7qmQq0J9m8j5N8P1q7M4M2q0o9J60m9K8n2OJ1o0J1R8
$$ 90 152 16 123 75 310 234 198 85 45 181 164 156 152 160 80 99 51 36 94 165 78 122 164 84 15 175 126 154 102 108 119 59 70 168
3166A68j20J07j13K27K7j89N2K32n7j01k07J0K9J28L7j18Qj6J04r7m3K0m2K0k0N0K1n6k3J76
$$ 168 48 155 42 269 296 107 159 391 334 233 26 36 65 193 230 112 120 104 208 111 68 88 46 66 46 96 117 61 38 214
2885B14n2K3j29J11J32j24m6q8M6J61n9o7P3R9l1m5j39j9l9N1R9L6mj41J24R9Q9q9j15j15
$$ 214 162 185 56 167 299 175 129 41 87 248 189 122 195 294 263 218 79 60 21 72 171 207 203 62 186 285 374 285 170 55
2603E5k0L5K3J80l1Ll7p2K8j22K06P4m4p0j3L9Jj50J4n9K06j1j20K5r0N0k3M7n3J11r4k4J15
$$ 55 35 70 93 273 242 245 208 136 164 42 248 322 278 208 195 234 235 85 99 40 246 235 115 140 50 100 77 124 71 182 88 64 179
2293A79o3K15j23n8J4o5K5J2L0Nl7p6K1P1j41J33J4L0j74K25r7L5M3q1m1m8K4J46j3r7O0j3
$$ 179 116 331 208 150 164 99 124 136 166 171 134 58 79 150 9 142 156 186 12 237 140 175 218 137 96 48 72 218 205 108 168 155
1993A55K2K4j36L7N5N1j94J86m6j10l6J7M4J44K26j18p1j55J1J8q0P9l8l9M6oN2n3P4p4l7
$$ 155 177 201 65 102 157 208 14 200 154 44 8 25 69 213 439 321 250 95 106 124 44 123 85 46 92 86 138 85 159 85 48
1702D8L8R7j4J8j37N5j3J31n4k5J5qNk5j4rN8J30K7M2k33J9o4J3J37j12n4J30r7p0k2J03m2
$$ 48 86 183 169 187 50 105 92 223 169 144 159 151 156 131 117 108 166 296 323 365 132 151 87 100 237 125 71 201 104 34 12 115 73
1392G3l7M9l1k5M8p1Q8J49n4n6L1j4p6L3J7J06j84K21O7k91OOO8J11j13k8J55l0j80JJ31k9
$$ 73 36 85 54 29 77 6 94 243 189 133 164 150 74 107 124 230 46 267 334 43 49 55 123 234 121 93 248 218 38 39 170 141
1091A41N9L3j08j0N9n5n3N1R0n8l6J13o5mj31O8Q3Kj2l5J8J14j66J36j28l3J55N9j85R8p9
$$ 141 200 233 125 115 174 119 66 117 207 149 113 226 161 157 26 94 177 179 167 132 150 264 98 234 106 73 228 287 102 200 121
800A21N3M7R8N80Q65r80k59k66q7m0o6j0N7R1L5j59P6Rnl3J13j31r8K08J3j24mj3J22N9q1
$$ 121 174 221 319 899 1764 784 525 259 172 132 66 56 113 204 239 80 156 165 160 127 240 109 11 219 232 108 104 91 213 272 191
509A91j12m5N1m2N5Q4j7o0Q8r1J9Q6oj21P0p1J07j43J22j05J48j07R1N2n9rJ44j55l9J25n0
$$ 191 79 34 85 43 98 182 165 105 193 102 121 207 201 80 150 79 186 43 165 60 208 101 192 244 185 176 320 165 126 251 201
218B01j09J08j6p3L9M1j29P7J3Ol1j0n6J05j2p5N5m2R7J08j45P7J24q9k8p7j04J5J39oj54
$$ 201 92 200 184 111 150 191 62 139 152 158 127 117 61 166 154 79 134 92 189 297 152 229 353 264 236 159 55 70 209 203 49
-73D9J55k8J04j13q2n8O1k9Q2lK10j22j79K7P5J14J8k34N2M5N5j57K01j3j59l9OP1K8R4p7
$$ 49 204 176 280 167 85 27 88 59 141 138 348 226 47 74 149 263 281 47 99 144 199 42 243 230 71 32 38 109 137 231 154
-364A54r2K2l4
$$ 154 62 84 50
-392E0
##PAGE=	F1=-13385.4
##FIRST=	19140.455529915001534,	4405.895418600002813,	0
##DATA TABLE=	(F2++(Y..Y)), PROFILE
4406C7pL2L4n6J11J6p7J31L5j39m8KN1M0r4N2R6q1l0L8K2l1Mn7k6Q0J11J9j9l5m3J48m3j44
$$ 37 30 62 96 40 151 167 90 221 256 117 69 71 122 162 68 120 216 135 105 143 165 134 138 81 55 135 246 265 246 211 168 316 273 129
4087A29J01k10P8J06m3J1j47O5N0K2l7mK00n8o1j55K0J12K2P1o6j35J17q9oR8Q4q5ol3n0l4
$$ 129 230 20 98 204 161 172 25 90 140 162 125 121 321 263 202 47 67 179 201 272 206 71 188 99 93 191 275 190 184 151 101 67
3786F7L2m1N6N7Kj53M1O1K2R7rKj8J51l7j59J30r7j69O2RJ26m6O5M8j20j32k3J12j6n8L7M6
$$ 67 99 58 114 171 173 20 61 122 144 241 232 234 216 367 330 171 301 204 35 97 106 232 186 251 299 179 47 24 136 120 62 99 145
3476A45j39J26o5K35p1oq4m4J01j3l4JM9r7j1j8k5M3J02j07J0jl5k7J31l1L9m5K9K2j36KJ21
$$ 145 6 132 67 302 231 225 141 97 198 185 151 152 201 104 93 75 50 93 195 88 98 97 62 35 166 135 174 129 158 180 44 46 167
3166A67j40J29r0J90M6k19K7K27l6o0j97K4k4J35Qq1k9OJ08p6l3L9j00Q0n6P2l5Mn6J79n5
$$ 167 27 156 66 256 302 83 110 337 301 241 44 68 44 179 187 106 77 83 191 115 82 121 21 101 45 117 82 86 30 209 154
2875A54J8j13J21J31j37m5q4L4J78j7r7KJ39j4q5j53M2n6N3J56Nk0j52J44P3R7p0j08j48k0
$$ 154 172 59 180 311 174 129 45 79 257 240 143 145 284 270 185 32 74 18 71 227 232 212 60 204 277 374 304 196 48 28
2594B8L3M0J65o1pl7J2K0j46J81O8j9p9j8J8Rj61K5J1J75k4j40L0p1J8J8K4n2J32j03k2P6
$$ 28 61 101 266 205 198 161 173 193 47 228 296 277 198 180 198 207 46 71 82 257 233 93 123 52 70 88 112 60 192 89 67 143
2293A43p2K08q6plj34N4K7Q2om1q6ON9r7R9J7kj50K04n4J7N3o8n3n9L7J54pj03N1q8M9O2j07
$$ 143 71 279 193 186 183 49 103 130 212 206 165 79 85 144 47 146 163 161 11 215 161 178 231 163 110 51 88 242 235 132 183 95 144 206 99
1964I9pQ9O7k14J58p0p4ok3J2J83K17j28m2j84O4k5m1N5l4m8P4J9M2p6N8m3q9K8J22k1K5j19
$$ 99 92 181 248 34 192 122 48 42 19 31 214 431 303 261 77 141 116 75 130 96 48 122 141 183 107 165 122 33 61 183 162 187 68
1655F8O5p1J50n8j9L1j9j9J2j1pN7P6pR6j97po0m5J65n7m6Q4r1l9l6J25m6n8L1n3N3J8p6R4
$$ 68 133 62 212 154 135 166 147 128 140 129 122 179 255 248 344 147 140 80 35 200 143 97 181 90 51 15 140 94 36 67 14 67 85 9 103
1326A03J42p0m8P5m8q2L0J2J00j63K40K1l04N9l1Q9J03j03n8J37j7j57NJ02l5P8J0r0nL9Q
$$ 103 245 175 127 202 154 72 102 114 214 51 291 312 8 67 36 125 228 125 67 204 187 30 35 137 102 180 190 100 95 134 142
1035A42k8l6J18j8q6J25m9l0j30P8J15m3j5p0N5J13j72J73j35l5R1J02j69J40l3q0J19J28
$$ 142 114 78 196 178 92 217 168 138 8 86 201 158 143 73 128 241 69 242 107 72 163 265 96 236 203 123 242 370
772C70N77R28j106j82k50n2p2j12k6Q3K7K5j28J23Ln7n4J58j13j35J96lq3Mm8Q2P5o2q3o1
$$ 370 947 1875 769 587 337 285 213 101 75 158 185 210 82 205 208 151 97 255 142 7 203 200 117 121 73 155 230 168 85 24
490B4P2j9M7J06o9n0Q2j23M0R8Mj54J03q8J45j85J10p8J23j39J68K6o7k8J73j56n9J40rj19
$$ 24 96 77 124 230 161 111 193 70 110 208 212 58 161 73 218 33 143 65 188 49 217 243 176 148 321 165 106 246 237 118
209A18P6l3o4K0Q2j11K8K4PJ0Mn9O7k4r6O4k1J28P4j67N7J27l6J0j00j76J16N5j1j32J74j8
$$ 118 194 161 97 117 199 88 116 140 147 157 161 102 169 145 49 113 92 220 294 127 184 311 275 285 185 9 125 180 169 37 211 193
-92A93J05j07j00m8P5m7J12p5K08j04j55J6P0J17N5k50N4jO5j20J94l4j46l9rJ21J6P9j01
$$ 193 298 191 91 43 118 71 183 108 316 212 57 73 143 260 315 65 119 118 183 63 257 223 77 38 29 150 166 245 144
-364A44p7K3k5
$$ 144 67 90 65
-392F5
##PAGE=	F1=-13464.1
##FIRST=	19140.455529915001534,	4405.895418600002813,	0
##DATA TABLE=	(F2++(Y..Y)), PROFILE
4406E9l2K1N0o4J14L9o3J03L5j20p7J0K9O0r7L5Q0m4l4K5K6k6ol4n3J17R9L3k3k1n5J29%j79
$$ 59 27 48 98 34 148 187 124 227 262 142 65 75 104 164 67 102 182 138 104 129 155 129 123 89 36 153 252 285 262 241 186 315 315 136
4087A36N5j43k1K48j08j7j38P3O6K3n6M8J78n1r5j11rO2K1R2l5j67J59p1p2R3R4q8Lk9j6l1
$$ 136 191 48 27 275 167 150 12 85 151 174 118 166 344 293 198 87 78 140 161 253 218 51 210 139 67 160 254 166 169 140 124 93
3786I3%n2L9M9K3j08mR0PO7kJnJ31j2j29J05j04j24N5p0J59j5Q6J5j32j56M2P6j6m3L5K1j17
$$ 93 93 41 80 129 152 44 40 130 137 204 202 203 198 329 317 188 293 189 65 120 50 209 194 280 295 163 7 49 125 109 66 101 122 5
3467EJ29o7K12o9K3m8m5P8j6o1%R5q3p6K0l8K8J24j06j7o6K0L3R1k2M5n0N5L2j87k4J34j28
$$ 5 134 67 279 210 233 185 140 218 202 141 141 236 153 77 97 59 87 211 105 88 22 42 75 166 144 189 139 194 226 39 15 149 21
3157B1J22n0J53O5k63j2K24k1rj49K4j5N6Jm5p4N3R6n2m2O8j35J05n7P3r5Q5r5J71o0K6q1
$$ 21 143 93 246 311 48 36 260 239 230 81 105 90 146 147 102 28 81 177 125 83 151 16 121 64 137 42 127 32 203 143 169 88
2857H8J00J10j41l3p0RJ85K2j18o4J68Mj15r4M9n6M9J94l8m1j57J59L7R3l9j00j58k5M1M0
$$ 88 188 298 157 124 54 63 248 270 152 88 256 260 145 51 100 44 93 287 249 208 51 210 247 340 301 201 43 18 59 99
2575I9J50p6l4k0R0K0j45J06O6Rp4m0QJ4j40kQ4J50n6j45K8k8j6L9j%J45j34k6M3q7J99l1
$$ 99 249 173 139 119 209 229 84 190 256 265 191 151 159 173 33 31 115 265 209 64 92 64 48 87 86 86 231 97 71 114 27 226 195
2265A95K2k1j88J15mJ15rm0j02MQ6p1L2L0l5j13J75k6K4M5p0p0k8L0J60jj18M0j56J06P1o1
$$ 195 217 196 8 123 119 234 225 185 83 87 173 102 134 164 129 16 191 165 189 234 164 94 66 96 256 255 137 177 21 127 198 137
1964A37m8J10O0k02J07q6qJ5k3qJ46K01j24qk16J11o0rK4k4n1J03L9L6q3Njj11N2R4l1L0q9
$$ 137 89 199 259 57 164 78 70 85 62 54 200 401 277 269 53 164 104 95 119 95 44 147 186 222 139 144 143 32 84 178 147 177 88
1655H8Q5r3J19o6lK8rn7M7j3j0O3Nm4J47j45j4m5k8J34j7m2K0p8rn5J54m3n7mk8P1j8n5P7
$$ 88 173 80 199 133 130 158 149 92 139 126 116 179 184 140 287 142 128 83 55 189 172 130 150 72 63 8 162 119 62 58 30 101 83 28 105
1326A05J21o4k9J02q3j00L5J5Q3j09K30k6k56N0m6R2Q4r0p3R8%j00K5N2kL1J5p9jKO6J3j30
$$ 105 226 162 133 235 152 52 87 102 185 76 306 280 24 74 28 120 204 114 41 139 139 39 64 116 114 145 160 81 80 82 148 161 31
1016C1J37L8j22J13j9n8q9L6J52o7l1o3M6R9j71J98j27k4J2J36j43J51K1j60J72J26O44R88
$$ 31 168 206 84 197 178 120 31 67 219 152 121 58 104 203 32 230 103 79 91 227 84 235 256 96 268 394 1038 2026
753B026j273j66k05lj08j00m0Q0m1Mp8J38Op2j07J85q6j36J52j1n5J5p2L1J11n5n2p4J06j5
$$ 2026 753 587 382 379 271 171 131 211 170 174 96 234 240 168 61 246 160 24 176 165 110 125 53 84 195 140 88 14 120 105
471A05K7J24r9n0Q1j55N8R9K4j32Q1q7J53j74P0o1J02j38K16kp2o5J78j39n6J33J8j12M2m9
$$ 105 132 256 157 107 188 33 91 190 214 82 163 76 229 55 125 64 166 28 244 242 170 105 283 144 88 221 239 127 169 120
190A20l5j3J17p7k1L9mN7L0p4J9l1q2N7MJ27M3j82K1J36K4L0j17j12Q9l0j2n8J54j1J10j10
$$ 120 85 72 189 112 91 130 126 183 213 139 158 127 45 102 106 233 276 94 115 251 275 305 188 76 165 135 123 65 219 208 318 208
-111B08j07l0O9n5J25j14J72p6j40K1O3J09R2k55M7l7O4p0J53j5j37n1M8J05j7N7j09m8J3
$$ 208 101 71 140 85 210 96 268 192 52 73 136 245 337 82 129 92 156 86 239 224 87 36 84 189 172 229 120 72 85
-383H5o
-392G9
##PAGE=	F1=-13542.9
##FIRST=	19140.455529915001534,	4405.895418600002813,	0
##DATA TABLE=	(F2++(Y..Y)), PROFILE
4406G4l0NL5o4J13N9n6O3N0q4j19M6j1P3p0%N8%m0RK4j4j7ok5R2O7M4l9J5n7R7M5j93j3j1
$$ 74 44 49 84 20 133 192 136 199 249 165 46 92 81 154 84 84 142 142 102 111 135 121 104 98 73 165 232 276 237 252 195 292 337 144 131 120
4068A20nK44j76o2j15P8P1J3o3R5J34l2j34m8m4J7J5J21pj80J71m0r8L7J00r0K6j8jk0k7m8
$$ 120 115 359 183 121 6 84 155 168 105 200 334 302 168 120 76 93 108 229 222 42 213 173 75 112 212 122 148 130 129 109 82 34
3767C4OM8L6o2n6J37lJ3RKPJ06J9j00O7j03o8M0j16J72pJ17pj29j05K9K9k4k9K9po6J14p0
$$ 34 40 88 124 62 6 143 140 153 162 164 171 277 296 196 263 160 92 132 16 188 181 298 291 162 57 86 115 91 62 91 84 18 132 62
3448F2J84p2M8rm7O3k0p7jJ32n5j33M6o1K1J34r0j5n1l9J03N4k8M4o3Q2L2j89k6Q8p0Q2j8
$$ 62 246 174 222 213 166 229 209 132 131 263 208 75 121 60 81 215 125 110 59 20 123 177 149 193 130 212 244 55 29 117 47 129 111
3138A11J33Q2l02L4J35j3K3r6J5Rl2L1k7p6O8P2m1o0R4j26Q8k5N6j15J25j22J53p1M5n0P2
$$ 111 244 326 24 58 193 180 203 107 122 131 99 130 103 27 95 167 126 66 160 34 122 97 153 38 163 41 194 123 168 118 190
2847A90P3j27j9n4j3J72N2j27j01J59J8j24MJ8o5O3K18p9o4j57J63NQ0jr6j48l3N5K4J41n4
$$ 190 263 136 117 63 50 222 274 147 46 205 223 99 103 121 56 119 337 258 194 37 200 205 285 284 188 40 7 62 86 227 173
2556A73r7J1J55J8j45L2O1L6n5p2QK8n5m0O7J37r1j35K2K6k9J4j6O9J60j69m2L5p1J52K2L9
$$ 173 76 87 242 260 115 147 208 244 189 117 125 153 98 58 125 262 171 36 58 84 55 69 53 122 282 113 71 106 35 187 209 248
2256B48m8j70J29n8J23Kk9j26KJ46o9m2N4o5n8J27j3L7L8p9q4K8QJ55Pj34K5j04O6N9j6p4
$$ 248 200 30 159 101 224 226 197 71 73 219 150 108 162 97 39 166 153 190 228 149 65 93 101 256 263 129 154 50 116 175 159 85
1955H5J20L5j57M3q8N4M4l6j3R3J75j11K4k36J39p7J4j2j1n6J25N8L4p9o2L9j07Q3M7m0L1
$$ 85 205 240 83 126 38 92 136 100 87 180 355 244 268 32 171 94 108 96 85 29 154 212 246 167 105 144 37 120 167 127 158
1664A58n2J04q0O7r1K0J9Qr3O9j2k7P8o4q3J84q8kk2PR8Ql5n8o1J7o2J75l6n0rk1O0o2j0M8
$$ 158 106 210 130 197 106 126 145 153 60 129 117 90 168 104 21 205 117 115 93 100 198 206 171 113 52 69 7 182 146 96 87 66 126 64 54 102
1326A02Q7l5j4J08r9j22M0K5N5n0K06o2j92K4l9P3N8p7m2J9J6k7J6N5M3o3M1p1Nn0J07N3j27
$$ 102 189 154 140 248 149 27 67 92 147 97 303 241 49 73 34 107 165 88 46 65 81 54 70 125 168 105 146 75 80 30 137 190 63
1016F3P7R6j16N7K3q4p0J5J68p9m0kMM0j39J84j06om5J54j05J27O8j61J67J15P30J067j414
$$ 63 140 236 120 177 200 116 46 61 229 150 110 108 112 152 13 197 91 85 40 194 89 216 284 123 290 405 1135 2202 788
744G88k56j48N1j34p9m1P7q9k6m4J41J4n8j56J77n5j20J10j4m5K7p0k5J73n0n7p3J10j0LJ35
$$ 788 532 384 435 301 222 181 258 169 143 99 240 254 196 40 217 162 42 152 138 93 120 50 25 198 148 91 18 128 118 121 256
453B56j06o2R1j43K7R2M9r4M3p2J37j26K6n4P9p8K06k0q7j10J65j11k5R7L5r9J4o5J3m5J32
$$ 256 150 88 179 36 63 155 204 110 153 81 218 92 118 64 143 65 271 251 164 54 219 108 83 180 215 116 130 65 78 33 165
162A65m0n4N4k6R6N6q4l1l0n1N1J8R8K3j60m8J53O9L2j24l7M4p4J9OJ02oJ10j21r0j1M4n8
$$ 165 125 71 125 99 195 251 167 136 106 55 106 124 222 245 85 37 190 259 291 167 130 174 100 119 125 227 221 331 210 120 109 153 95
-148I5J22j25J16l7j35M0N2R3J21k44K8n2N1k9J04L8j45n2J07P0o7L1j00mnN
$$ 95 217 92 208 171 36 76 128 221 342 98 126 74 125 96 200 238 93 41 148 218 151 182 82 78 73 78
-392G8
##PAGE=	F1=-13621.6
##FIRST=	19140.455529915001534,	4405.895418600002813,	0
##DATA TABLE=	(F2++(Y..Y)), PROFILE
4406H9j7nMn6R3P3n5K5O8m0j57R5l0M6l0k2K3M7n1nK0Pl6J1J7M9K5N3o4O1l9N5Q7j84q7J08
$$ 89 72 67 71 15 108 181 126 151 219 179 22 117 87 133 103 81 104 151 100 95 115 122 86 97 114 163 188 241 177 238 199 254 341 157 70 178
4068A78L2K13k22j07p9Q1N9mn5J21P8mj73J5p7J2k5J58J4j60J44j8p6m1R6r5O2nlj3l5k9j8
$$ 178 210 423 201 94 15 96 155 151 96 217 295 291 118 133 56 68 43 201 215 55 199 181 105 64 160 65 127 122 119 106 71 42 24
3758B4K7M3k0j8J06j4m4J7mK6P4N2p1K3r2j9K1p9J34l2J50j1j13o8J5k0m0pOl2JR6q2J64q2
$$ 24 51 94 74 56 162 148 104 121 117 143 217 269 198 221 129 110 131 52 186 154 304 293 180 112 127 107 67 60 66 34 35 131 49 213 131
3429A31O2K6m8N2k2p6J6J39k9j51M5r2J9J33o4Mj5j24J62K1m2L5p5J03K2j49k8K2KM7nJ21
$$ 131 193 219 171 223 201 125 141 280 251 100 145 53 72 205 141 145 130 6 168 189 147 182 107 210 232 83 55 77 79 126 121 242
3129B42R8k98R6L3pMm9rL1r3J01l9l7L9M2m1p6J07j05O1L0K8r1J13j32J29q3O4k1M9L0q6j9
$$ 242 340 42 138 171 164 168 119 110 141 48 149 110 73 112 154 113 37 144 39 100 130 158 67 180 48 177 94 158 137 186 216 130 111
2819A11m0k0J32P1j20o4O4K2j03R0j6p4P7K28r8q0j53J52j2N8L7r1j27l7N7kJ49pj50K7J83
$$ 111 71 51 183 254 134 70 134 156 53 143 127 53 130 358 260 180 27 179 167 225 262 171 44 7 64 62 211 204 54 81 264
2528B64Qj48%L6N6k7j05J6N6Om2pJ31j10j16K9N3j8l7kJ01J78j86o8N4n2J10M6M7q2j43J32
$$ 264 272 124 124 160 216 189 84 100 156 162 120 113 244 134 18 47 100 82 45 43 144 322 136 68 122 70 180 226 273 191 48 180
2227A80j04J06K8qj38RJ98q6j14R3r0j1P9j1M3L8p4n6M0j5J33J3j32Ok1j1M4J8q2J20kq3j7
$$ 180 76 182 210 202 64 73 271 185 71 164 74 63 142 131 174 212 138 82 122 107 240 253 121 127 106 95 139 157 75 195 193 110 93
1918I3p7Q8Q5n1k7N2J41j00N3k22J27p0K4m9Oo3J32P0L7o8j27P1q3J05Nm6L2j8J18o7L4j34
$$ 93 16 104 189 138 111 163 304 204 257 35 162 92 116 67 73 10 142 212 249 181 54 125 42 147 152 106 138 120 238 171 205 71
1617G1M7J7K2r5M5mn1J00j01M7J1l3K4KJ6Q8L2k2j40m4L2l5J73k9m8Ol6M7j13O5NM3J6j8R6
$$ 71 118 135 157 62 107 103 52 152 51 98 109 76 100 102 118 206 238 216 76 32 64 29 202 173 125 131 95 142 29 94 99 142 158 140 236
1288B36q8r2qL6K2oJ81q1j35%k3N0K5n3J0l0k3M1j4R8O9j49P2n9J6q3J03Q4p8J5J33q6qN9
$$ 236 148 56 48 84 106 100 281 200 65 65 42 92 117 64 74 44 21 62 48 146 215 66 138 79 95 12 115 199 121 136 269 183 175 234
969B34j06p5L4J47r7l3N4ko4m4J01p7J5m2J42o9Q9J03j30J32J36P94J204j524m41j26J01j42
$$ 234 128 53 87 234 137 104 158 156 92 48 149 72 87 45 187 118 207 310 180 312 448 1242 2446 922 481 355 456 314
706C14o6m0Q4j03n6n1J47J5l3j45J06k5r5Q4j1m9L2l5kJ60m4q2l9M8jj9J36r0q2J09q8m7P7
$$ 314 248 208 292 189 133 82 229 244 211 66 172 147 52 136 125 76 108 73 71 231 187 105 66 114 113 94 230 140 58 167 79 32 109
396A09P3o2Qm9J10o5j2m2N3k4J91k3j15j25J39r8L9L3N2r3j4q0P0n5J17j4n5N6n5J16P7q0
$$ 109 182 120 128 79 189 124 112 70 123 99 290 267 152 27 166 68 107 140 192 99 85 5 75 20 137 123 68 124 69 185 262 182
96A82p3k0l4O9J6M8K0q2q0J01Q0J8j19L2rk4N2J1M2jR9j37m6PPn9J05j30P5J2j43P0L3O9J38
$$ 182 109 89 55 124 140 188 208 126 46 147 227 245 126 158 149 125 177 188 230 229 328 191 145 152 159 100 205 75 150 162 19 89 122 191 329
-233C29k19jl5L2j0O6R5j63l5J50K2j23%o8M5l0R
$$ 329 110 109 74 106 96 162 257 94 59 209 231 108 108 40 85 55 64
-392F4
##PAGE=	F1=-13700.4
##FIRST=	19140.455529915001534,	4405.895418600002813,	0
##DATA TABLE=	(F2++(Y..Y)), PROFILE
4406A03ooj0m6M3Q1o1J0P1kj48J09k0mJKl5Q3o6j5K0L2o4J0N8Pk4O8r9J08kJ3J19j57j24J61
$$ 103 97 91 81 35 78 159 98 108 179 177 29 138 118 114 115 117 82 165 99 84 104 136 72 82 140 147 123 191 92 200 198 211 330 173 49 210
4068B10P0J66k39j33k3P2L4k9k9J17K4K0k04O7r2Q6r0J43K9j21R6j1l7p1N5j02J05jj7j0j7
$$ 210 280 446 207 74 51 123 157 128 99 216 240 260 56 123 31 117 27 170 199 78 174 163 126 55 110 8 113 112 95 85 68
3777F8j5J2k9K8J7K6P7l7o5K0l2N2L5Q2m5j6p4J1Rm5J28q4J77kr2m8No3m8K0m0%K4P7r0J44
$$ 68 53 65 36 64 81 107 184 147 82 102 70 122 157 239 194 178 104 115 124 79 207 123 300 298 206 158 163 100 52 72 32 32 56 133 43 187
3439A87r7O5M8m5M0k1n8N0J15j8j33L5j30J2J29l0K6Qj52J68rm7J8p6J05Nq6l9l5P1K7mJ00
$$ 187 90 155 203 158 198 177 119 169 284 266 133 168 38 50 179 149 175 183 31 199 190 143 161 85 190 195 109 70 35 106 133 129 229
3129B29J16k84J39j8Pn0ro1N0r3J60o4j0J2J0m4o9R9r2L8Q7mo4Q5j14R3r0P3J4K9kk3m3l2
$$ 229 345 61 200 182 189 139 130 69 119 26 186 122 112 124 134 90 21 120 28 66 153 149 85 170 56 149 59 132 146 175 173 150 107 75
2810G5j2P6P8r9Jn4J4m8J31m2q6Q6K21q6q1j33J24j8K8O9o7j18m2M5l1J72L4j38OJ64j1j46
$$ 75 63 139 217 118 119 65 79 31 162 120 34 120 341 255 174 41 165 147 175 244 177 59 17 62 31 203 237 99 105 269 258 112
2509A12K5j6O1Mj18J4Q5M0l2q1J32j09j08N3M2Nm5OP4J93j80r4Q1n0J05L2N3j15j16J25j17
$$ 112 137 121 182 186 68 82 167 207 175 94 226 117 9 62 104 109 64 70 144 337 157 63 144 94 199 231 284 169 53 178 61
2218F1N2O8J7j07K8K02j17j72J38j02J3M5j3L3M1l3j1Jl1R2K1j06jJ9q2M1L1n5R8l9Oo5o9
$$ 61 113 181 198 91 119 321 204 32 170 68 81 126 113 146 187 154 143 144 113 205 226 120 119 138 56 97 128 73 171 132 138 73 4
1908DJ00J30n5m0J6J01r6P7j87R0m8L2q5L1n8R9P7L8m9j67Q1m6J16k3m7K8J4J20o3K7j88P5
$$ 4 104 234 179 139 155 256 160 237 50 140 92 124 39 70 12 111 188 226 177 10 91 45 161 138 91 119 133 253 190 217 29 104
1608A04K9K3o7j7Ro6J20o1J11j61LN3K6jR8N9kk26j3L0RJ63k3n9K8n6L9j22J16m7nQ7l9O2
$$ 104 133 156 89 72 81 15 135 74 185 24 27 80 106 105 203 262 260 34 21 51 60 223 200 141 169 113 152 30 146 99 94 181 142 204
1288B04n4m0o6L2qJ3J65p3j01j7kL8j5pK7Np2K6l5J34Q2k02R6m7K9p3M9J04k9j1J47n0n1P4
$$ 204 150 110 44 76 68 81 246 173 72 55 53 91 76 69 96 101 29 55 20 154 236 34 130 83 112 39 88 192 163 152 299 249 198 272
969B72j25r0O2J15j26j4R5J7j64L4L0l7K4l8J52m8O3J39j13J05K12Q60J428j701o23j93J31
$$ 272 147 57 119 234 108 94 189 206 42 76 106 69 93 55 207 159 222 361 248 353 565 1425 2853 1152 529 336 467
716D67j29p5m8R3q2o9j07J57Qrr2kPo4P0Ln9K8RJ5J44m1r5pl0J0l9J21n8r2J15l1r0L6Q9m6
$$ 467 338 263 215 308 226 157 50 207 215 206 114 112 119 55 125 128 69 97 106 121 265 224 129 122 92 102 63 184 126 34 149 118 28 64 153 107
378A07k2j5Q2pm3j6K1QJ80j6j57n7R1j20J11j5O8r6n3KL5o8R3nk3L3p9J14R0n8j03ll9J02
$$ 107 85 70 152 145 102 86 107 115 295 279 122 65 156 36 147 132 200 104 51 53 88 20 113 108 85 118 39 153 243 185 82 79 40 142
58A42LrL8J4q5J9N9kj04P6m9Q2O0pj2KQ1j53J2K5l4n9P8j38Q0N0j40Q6LM3J40j83l4kK8j0
$$ 142 145 136 174 188 103 122 181 179 75 151 102 184 244 237 225 227 308 155 167 192 158 99 177 39 119 169 29 115 118 161 301 118 84 82 110 100
-280A00M2J25j77rJ77k9j76k9RN5m9M
$$ 100 142 267 90 81 258 229 53 24 33 88 39 43
-392D3
##PAGE=	F1=-13779.2
##FIRST=	19140.455529915001534,	4405.895418600002813,	0
##DATA TABLE=	(F2++(Y..Y)), PROFILE
4406A12nOrm9oQ3o9L9L7J8j07R6ll4J0N9q6R2q0k2K0N4r6pR1k0p3R2j27J27M2j2J40j28j01
$$ 112 107 113 104 55 49 132 63 102 139 157 50 146 143 109 119 178 92 184 104 82 102 156 60 53 144 124 51 143 16 143 185 173 313 185 84
4077H4J24J03J10k29j30L6N7J1n9QQ7j6K7k04Q6l9J32r5M6L6p5M8rj2l2j2k5M8rl2qK5k3M7
$$ 84 208 311 421 192 62 98 155 166 107 115 202 186 213 9 95 56 188 93 139 175 100 148 139 127 95 83 58 106 97 65 57 82 59 106
3758A06m4k2M0O5N7p1l5J7m6M1kJ02k1m4m9J5J1l1J47j32J80J2p4l0jr9l4L3p0P2j4N9p6J07
$$ 106 62 40 80 145 202 131 96 113 67 108 106 208 187 143 94 109 120 89 236 104 284 296 222 192 191 92 58 91 21 93 79 138 62 169
3439A69j03N7M8m0K7j6l0R1P0k3r3K7j58j5J25J3M1K0j60J61l3l6mn4P4j2k1n3n8J08J2PO2
$$ 169 66 123 171 131 158 142 112 203 273 250 157 184 26 11 136 149 190 210 50 211 178 142 138 84 158 146 125 72 14 122 134 141 203
3129B03J34k72J74m2K1q5K4j46O2j1J55q5Lqj8m1j7O6j14N9R7l7l5M9o8M6q8O7O1OrL3p9k6
$$ 203 337 65 239 197 218 133 157 11 73 62 217 132 135 127 109 68 51 117 3 62 159 122 87 136 68 114 26 93 154 160 151 184 105 79
2810G9nL0P6p5O0o9j0k9J04n4j02Q4K00m7o0j04J02k9rR1j3j42m7K8n5J94N1j08MJ09l7j32
$$ 79 74 104 180 105 165 96 86 57 161 107 5 89 289 242 182 78 180 151 142 233 220 78 31 59 4 198 249 141 145 254 217 85
2509H5Q1o2M1L4j02j0J03N8j6j16J34r6j29P7J6L1j4j6K6K02j61j11J01n2J20nN7j42q3J06
$$ 85 166 104 145 179 77 67 170 228 212 96 230 134 5 82 98 129 115 99 125 327 166 55 156 104 224 219 276 134 51 157
2227A57p5m5J06M2m9M7J78j55j86J56j04K1K8j5RM7K7J1m8l7M5K6o0J1Nj28M3L1RM4o8Q9r2
$$ 157 82 37 143 185 136 183 361 206 20 176 72 93 121 106 115 162 189 200 152 115 160 186 126 137 142 14 57 88 97 141 73 162 70
1918G0n0P4J67m5l9k4O0r7R6j56N1k1M6j11N7m1L0P8L5k1r7j6JJ14l5m3J9M2J11o7M2k13O9
$$ 70 20 94 261 216 177 153 213 116 212 56 107 86 132 21 78 37 67 145 180 159 62 46 47 161 126 83 102 144 255 188 230 17 86
1608H6N5Nl4q4K0l3J07j2J25j59l0J0M9l4J16Q8J9k75PJ7N3J47j8p7M2o6L6q2J24r8n0J60
$$ 86 141 146 112 28 48 15 122 110 235 76 46 56 105 71 187 275 294 19 26 43 96 243 225 148 190 124 160 78 202 104 54 214
1307B14m8Jj7Rj07J0j6%J72l9j05l1K6M3m5K6J4M2q4k7K0P9R3k04R1l4L8p1J3J11Qk0J53j6
$$ 214 166 167 150 159 52 62 46 46 218 179 74 43 69 112 67 93 107 149 65 38 58 137 230 26 117 83 121 50 63 174 182 162 315 299
988B99o7P0j41r6P5Q8j54lJ20N0j67J6J9kJn8J85l2L7J96j18R7L09R71J682j973p36k98J29
$$ 299 232 302 161 65 140 228 74 71 191 241 74 90 109 107 108 50 235 203 240 436 318 415 724 1695 3377 1404 668 370 499
716D99j11j08o1Q8l5o4j59J34kJ0k7j28N6l9P0K7p1K0M2RJ31m4q7K2p8J7n6P6k5o2Q1K0q5
$$ 499 388 280 219 307 272 208 49 183 181 191 164 36 92 53 123 150 79 99 141 150 281 237 150 172 94 111 55 131 106 44 125 145 60
406F0jO2m7m8L5N2L6o2K4j7J2J77rj99K8O4j41J57k4P8j01r1N7J7r1P3j6K6pr6R6R3j9j17
$$ 60 59 121 74 26 61 113 149 87 111 94 106 283 274 75 103 167 26 183 159 237 136 45 102 119 28 101 85 111 104 8 104 197 178 61
86F1J0n8J36j2n6P7Q7j08l8K9j8q6Q5l7J62N3k3n1kN9j54O0M8p4o1M7j20J11M8j19R2l0J8
$$ 61 71 13 149 137 81 158 245 137 99 128 110 24 109 72 234 287 264 213 211 270 116 176 224 150 89 136 16 127 175 56 148 118 136
-223A36J26j43n6K1L8qK9J20j82K0J89p7j80K6RJ9n5m
$$ 136 262 119 63 84 122 114 143 263 81 101 290 213 33 59 68 87 32 28
-392B8
##PAGE=	F1=-13857.9
##FIRST=	19140.455529915001534,	4405.895418600002813,	0
##DATA TABLE=	(F2++(Y..Y)), PROFILE
4406A11j3K4mm7m2P6p6Q7pJ3o1Q1Ok8nJ26j17P9p9l5J5O2j12l7J16k1r5R4k0MO6j5J47j07
$$ 111 98 122 118 71 29 105 29 116 109 122 61 142 148 120 115 241 124 203 124 89 104 166 54 17 133 112 17 111 91 95 161 146 293 186
4087A86p4O2J26N4j95j02R3M0pr2M4M9l3Nr2LL3J45j05l1M0l4J4J2k3L3o0J4qj0n1L1M8n2
$$ 186 112 174 300 354 159 57 150 190 183 91 135 184 151 156 64 67 100 245 140 109 149 115 129 141 118 151 91 105 97 87 36 67 115 63
3767F3O9l6p0M4R1M9j10J3J4k1pl1J10%n7k1pL3m1J71j45J41K5n5pnj29nK7m9R3m6L9m8O2
$$ 63 132 96 26 70 161 210 100 113 127 106 99 68 178 178 121 100 93 126 85 256 111 252 277 222 215 210 81 76 103 54 147 101 140 92 154
3439A54r0M6K5l6J7ooJ27K3m7m2K3j36MK1P0M2K3j51J41m6rk3k4K0j6J8o2j2P6nL1J7J50k62
$$ 154 64 110 135 99 116 110 104 231 254 207 165 188 52 56 77 147 189 212 61 202 156 147 124 100 120 104 122 60 48 124 119 150 167 317 55
3110E5K00m4K9r4N5j45m1Q1J34r5Kj6l9k1K5O2j16Q0L9o5mK7k5Jo0L9J08k7PO3j09j7qJ5O4
$$ 55 255 211 240 146 201 56 15 96 230 135 137 121 82 61 86 148 32 112 151 86 82 109 84 85 25 64 172 145 152 215 106 89 81 96 160
2781A60o0J04k3j8q5P2m9o7J4J71Pk8p0R8n9m3J04N1j82m6Oj8J48M8p4K4L8o7q9J23q1LN5
$$ 160 100 204 181 163 78 150 101 34 48 219 226 198 128 226 167 124 228 279 97 51 57 39 187 235 161 185 223 156 67 190 109 112 167
2472A67o6l5R5O9Jr8J29r0j42P1%L9K6n1j8K04j42j13J05n2J42n1O2j61m0P7qn4M0N7J1N9
$$ 167 101 66 161 230 231 133 262 172 30 101 101 140 166 115 97 301 159 46 151 99 241 190 252 91 51 128 120 66 106 163 174 233
2171B33J50j88j50J28q7K1K0j3k3N5P8J1q7m0PK6j2L5m0o6k8M1P2k3n9J16r5k6K7J80k4k5
$$ 233 383 195 45 173 86 107 127 114 91 146 224 235 148 108 115 141 129 164 124 58 30 71 143 120 61 177 82 56 83 263 239 214
1871B14o2K3r7J03j28J8JO5j23P8k1n0P4K8K3k8j08M3R8l4l6OO8Q9o8P1j80J2P4k6np9j0l
$$ 214 152 175 78 181 53 71 72 137 14 92 71 21 95 123 146 118 10 53 151 117 81 87 155 244 176 247 67 79 153 127 122 43 33 30
1551C0Q2K2J16j10k8p9O5p1J38J12L8k35m3L1O6J21j5q8M5o6L4n0J31j39p0K09l6o0qN5j39
$$ 30 112 134 250 140 112 33 98 27 165 277 315 80 37 68 134 255 240 152 197 131 165 115 246 107 37 246 210 150 142 197 58
1260E8j6Pk1J88lj36m9O3N1o0K0NO9r1o0P6lJ02j46M3j3L7o8j2J07L5k5J51J5o5N7j46q8O2
$$ 58 42 49 28 216 213 77 28 91 142 82 102 107 176 85 25 101 98 200 54 97 84 121 53 41 148 183 158 309 324 259 316 170 82 144
941A44P0j58j6J22Q7j13m1N0K0l7n7J78kj2K70j18Q6L92J096J861k242p90l56J17r9j48o7
$$ 144 214 56 40 162 249 136 95 145 165 128 71 249 247 235 505 387 473 865 1961 3822 1580 790 434 551 452 304 237
687B37N5K1m0j66O6j7K7K3j48M7o1R9M2q4J8N9k3J19n0o5M5p6J7p2J4mk1L2O2o9M%m7QPJ9
$$ 237 292 313 273 107 173 156 183 206 58 105 44 143 185 101 119 178 155 274 224 159 204 128 145 73 87 83 62 94 156 87 91 91 44 52 59 78
349G8N9o5P1o2j2J86ok18R2L9j26J63qQ6j06j17Q6J7r3L3k8O8n3n6K7Q1K6j07Lk8J06k0n7
$$ 78 137 72 143 81 69 255 249 31 123 162 36 199 191 277 171 54 140 157 64 97 69 137 84 28 55 136 162 55 58 30 136 116 59
40E9J06J22j41q0J6j6m8K1O6J51L6k7p0j3L4j21P0P4j04o5J9k1P4K0p9R5n8kR9j08n6K3M5
$$ 59 165 287 146 66 82 66 18 39 105 256 292 265 195 182 216 95 165 239 135 70 89 68 142 162 83 178 120 118 217 109 53 76 121
-270A21MK4R5j73M5J84j11j20N3k6j4m5m
$$ 121 125 149 244 71 116 300 189 69 122 96 82 37 33
-392C3
##PAGE=	F1=-13936.7
##FIRST=	19140.455529915001534,	4405.895418600002813,	0
##DATA TABLE=	(F2++(Y..Y)), PROFILE
4406I9l1M5Lk8o8O4p4J07k5j2j3O5Kkk5J83j38O5n8n0mN3r5m6J07om3L3N2m9K8lJ39j03m9
$$ 99 68 113 116 88 20 84 10 117 92 80 67 132 134 132 107 290 152 217 159 109 105 158 63 17 124 118 75 108 160 111 139 136 275 172 123
4077A23mJ34J2j53n5J45K1j6j26P1J5l0m1Pk4N5J39j12q3M5KoN9n0Q6r6J7n9K1o7R0M3q2N7
$$ 123 119 253 265 112 57 202 223 207 81 152 167 137 96 103 79 134 273 161 78 123 125 119 178 128 214 118 135 76 97 30 120 163 81 138
3758A38j5r5K4J04N1j43M9RJ5m7m5J04J5n3Nm5O7o4J88j22N8M2l1K0rj53K8Nk2J06o4J9k2
$$ 138 123 28 52 156 207 64 113 122 137 90 45 149 164 111 116 71 138 74 262 140 198 240 209 229 220 67 95 100 78 184 120 139 117
3448A17J7o6M8Om3J0J3kJ49j6q8J3J8q5L3j14J37L0J8j24J07m7K6l1j0l1MPo1M7K8k5O0j3
$$ 117 134 68 116 122 79 89 102 100 249 233 145 158 176 91 124 10 147 177 195 71 178 131 157 126 116 85 89 96 35 82 110 85 145 132
3129A32J57k54K18k4K9r5Q1j29p2P7J00r6rpm7KN1P3j17J04m0o6J8N8m4j8k9L1J14o5K8P5
$$ 132 289 35 253 229 258 163 244 115 43 120 220 124 115 108 61 63 114 187 70 174 134 68 86 144 100 82 53 84 198 133 161 236
2828B36j16j2k7L0M7n4J26K4l1j43O0l4l4k8J17N1ok2R7r7p2J10J09k19l7j9J6R2L2l8N7k9
$$ 236 120 108 81 111 158 104 230 254 223 80 140 106 72 44 161 212 206 184 281 184 112 222 331 112 75 56 72 164 196 158 215 186
2528A86q9j0J13p5l3N8k4l3N6Q7Jn2J18q8j54N8J3J3N9q8l6J90j32r6Q5m1J56q6O7j77ON5
$$ 186 97 87 200 125 92 150 126 93 149 236 237 185 303 215 61 119 132 145 204 116 80 270 138 42 127 86 242 156 223 46 52 107
2227A07M3j5m1M6M8O6J28k03j16R1l9J3J4on6O0J04lj07m3jJ2K4N5r0J3p7P2R3o4k4P7q2m
$$ 107 150 135 94 140 188 254 382 179 63 154 115 128 142 136 80 140 244 241 134 91 90 102 126 181 91 104 27 99 192 128 104 181 99 95
1908I5j7J62mkq9j0q0R0r5JJ7O6j18Q9Po0QJ5P8J6j20K0O8k9k8JQ3N4m0R6j58j4O1o3J7k1
$$ 95 78 240 236 234 145 135 55 145 50 51 68 134 16 105 112 52 60 75 153 169 49 69 137 108 80 81 164 218 178 274 116 102 163 100 117 96
1570I6k0m1P2M6R1o1oj42M7m6J14J22M8j71r9O7M9Q3j1p8L4n9L0l6J40j65n3K13pq3n7J03
$$ 96 76 35 107 153 244 183 177 35 82 36 150 272 320 149 50 117 166 249 238 160 194 135 165 129 269 104 51 264 257 174 117 220
1270B20j64l9M6JJ70J8j67p5J04N2q0jK0P7r0n7Q9q0J15p3lJ0K5o1l1Q4O8k9J28M6n2M4j40
$$ 220 56 17 63 64 234 252 85 10 114 166 86 85 105 182 92 35 124 44 159 86 83 93 118 57 26 110 178 149 277 323 271 315 175
960A75o9K3O9j24n2Q4J21l2p7N2N6p4rQ6O5q7L43p2M6M71J252J979k526q54l56J21q8j85n5
$$ 175 106 129 198 74 22 106 227 195 118 170 226 152 143 229 294 207 550 478 524 995 2247 4226 1700 846 490 611 523 338 283
687B83pO7Nj63Pn3M1M8p0J5j39J56L9r8J7O6p6J05m9l5O1m8J0r9j7klOQ4n1K2n9QO7p5j5O3
$$ 283 276 343 348 185 192 139 180 228 158 173 34 190 229 131 148 214 138 243 194 159 220 172 182 83 66 64 61 67 151 100 122 63 71 138 63 48 111
340A11n3J17j04m3J93j6j36N4Kp7J39K1R3j13j25J03K2q0j3k8Q7q9Mj8K4O8p1l5L4L3j8kR7
$$ 111 58 175 71 28 221 205 69 123 125 48 187 208 301 188 63 166 188 108 95 67 154 65 69 51 75 143 72 37 71 104 86 84 181
30A81J26j72j05L0J8l6OJ10Q7J2j8o6k5Mn2L5J00j16p6kP0K4j2k2R4p2j9P1q5m1J5L1K5K8
$$ 181 307 135 30 60 78 42 48 158 245 257 239 173 148 152 100 135 235 119 43 41 111 135 123 101 195 123 104 175 90 49 64 95 120 148
-289A48O5j45N4J65j23p5O6m3l7l0l
$$ 148 213 68 122 287 164 89 155 112 75 45 42
-392D2
##PAGE=	F1=-14015.4
##FIRST=	19140.455529915001534,	4405.895418600002813,	0
##DATA TABLE=	(F2++(Y..Y)), PROFILE
4406H3o2O4K0J1r8O6n3O0j2k3K8M1j3K3l8K13j48N6j9n9l7L4m7n1R2loJ4P2l8l1OJ13j15k3
$$ 83 21 85 105 116 18 84 31 91 79 56 84 125 112 135 97 310 162 218 199 140 103 137 90 39 131 128 122 136 208 170 139 145 258 143 120
4077A20m7J12oj13oJ90mj2j58Q2pk1r0P9JL0J18j14j03N3K6j2J05n3J05j28Kj03Q2p7J31L3
$$ 120 73 185 179 66 60 250 246 234 76 158 151 130 40 119 120 150 268 154 51 104 130 118 223 170 275 147 149 46 128 51 182 215
3777B15r7J2Oj03lJ05O7j46L7OM3o1m8R0K1l6K9r0J03q7J93p6n1O9jM1j6j70N6k8PJ13o6j
$$ 215 118 130 136 33 30 135 202 56 93 99 142 81 33 123 144 108 137 47 150 63 256 180 129 198 197 238 222 52 108 80 87 200 134 133
3458A33jk5m0N5J8n0lL2j4J53m7j35O2J0k8O5j31R8RJ2q4N4l4N8k3j9n8L0m6m4J04k6l8P0
$$ 133 132 107 67 122 140 90 87 119 105 258 211 76 138 148 120 185 54 152 161 173 89 143 109 167 144 125 67 97 51 7 111 85 47 117
3138A17j5J56k46K27J3K5j06J01j12o3L8N5q7k9J8m1OP7Q0j09J26j20j0MJ16j13nk4M3J01
$$ 117 102 258 12 239 252 277 171 272 160 97 135 190 103 74 92 51 57 134 214 105 231 111 101 105 221 108 103 79 122 223
2857B23r8M5Q1j01j5n9N2L1m2J22O3n6j86P8k6qj7N9O1j0L8R1j33r2J11J48k39k1m7M6L2J4
$$ 223 125 170 251 150 135 76 128 159 117 239 302 246 60 138 112 104 87 146 207 197 235 326 193 101 212 360 121 100 53 99 131 145
2556A45mQ8p9o3M8O4n7m6L1K0j2J1J20k8kR6q1j64M6M8l7Q0j21j8J55j33n3M0k4J61r7N9j88
$$ 145 141 229 150 87 135 199 142 96 127 147 135 146 266 238 236 332 251 87 133 181 144 224 103 85 240 107 54 94 70 231 134 193 5
2246EM5M9O4K3n8kM6O9J16j92r1M6L6kMRq5N2J11j9j10n2K8j2L5O6j24P3r8R6J00p0nK0o1
$$ 5 50 99 163 186 128 126 172 241 357 165 74 120 156 154 158 167 82 134 245 226 116 64 92 80 115 181 57 130 32 128 228 158 153 173 112
1918A12J1m1J16RK5r9l8l3N3n0kK0L6r5R1L4n0l7OJ08L2j20JL4k6k2J2Q4QK4J05j47j4J6r2
$$ 112 123 82 198 207 232 133 95 62 115 65 63 83 119 24 115 149 99 62 68 176 208 88 89 123 97 75 87 171 179 203 308 161 147 163 71
1589G1L7L2j5p9O0O5O0k6K7j68rK8P2J05M9r4j45J00J6L1nm2K2n5J8l7J46j73j7J88K7o2j48
$$ 71 108 140 125 46 106 171 231 205 232 64 55 83 155 260 309 215 70 170 186 217 212 170 192 137 155 118 264 91 74 262 289 227 79
1279G9J53j83l5O2K3J47L3j78q5J20M2j12qM9O3p5l9P3j17J27k7nLJ5o0k1J8J15j9P4P6l7
$$ 79 232 49 14 76 99 246 279 101 16 136 178 66 58 107 170 95 56 129 12 139 112 107 110 125 65 44 62 177 158 232 308 271
979B71L4j22m9l8J00p6p1jJ44N6o3k3J24r1N6q3J95j37L68M4J6N90J660K371l203j133l72
$$ 271 305 183 134 96 196 120 49 48 192 248 185 162 286 195 251 168 363 226 594 638 654 1244 2904 5275 2072 939 567
725E67J29p4k14l7q4R2O0j58l8j22M8N3L2J1j93J87J9j17K3O1j35Q1k5J0O5l0j1j23j4qj7
$$ 567 696 622 408 371 287 379 439 281 243 121 169 222 254 265 72 259 278 161 184 245 110 191 166 176 241 211 200 77 63 55 38
434C8K8P5m3M7j08Q5J02j52l1M0l8J58j30J0J09m1k6j8l3j3R7N7R2j23j04J00K4n8n5j5Q8
$$ 38 66 141 98 145 37 122 224 72 41 81 43 201 71 81 190 149 123 105 72 59 156 213 305 182 78 178 202 144 89 74 162
143A62j03N6k9n5R4k3r3R8m6nN3Q0J14j93o2J5M0n6R3N9Lj7Qm0l7l2K7k1J22r7q9j1J21l3
$$ 162 59 115 86 31 125 102 9 107 61 56 109 189 303 110 48 63 103 47 140 199 202 185 193 153 116 84 111 90 212 115 26 15 136 103
-176A03l8M0Q7p2l0N7q5k4L5j5M1L5M2r3L7J34j08o5P8m2m8j9m
$$ 103 65 105 192 120 90 147 62 38 73 58 99 134 176 83 120 254 146 81 159 117 69 50 46
-392D6
##PAGE=	F1=-14094.2
##FIRST=	19140.455529915001534,	4405.895418600002813,	0
##DATA TABLE=	(F2++(Y..Y)), PROFILE
4406G2l4NO8M3j31Q7n2j7J9QO3jl5L3m0K06j49N8K8n5p7J9Mq0J00j5L7J7N6j0o4jP9j34Ol9
$$ 72 38 43 111 154 23 110 58 41 60 68 131 130 95 128 88 294 145 203 231 176 99 118 122 42 142 127 164 181 237 227 163 162 241 107 113 74
4068G4M4Kq5L2K18l2Mj75O7j9j6q9Q4M8qQ5j06q0N0L6j0J28l3R9j48k1j10J26r0J65K6j03
$$ 74 118 120 35 67 285 253 257 82 149 130 114 25 109 157 149 234 128 48 98 134 124 252 219 318 170 149 39 165 75 240 266 163
3767A63l6Oj00k0R7R0j15k0J4L9m9m1P5J5nM7j28J21r5J88k3j51J00K4M4k6j77P3o1L2J14
$$ 163 127 133 33 13 110 200 85 65 79 118 69 28 103 118 113 160 32 153 58 246 223 72 172 196 240 214 37 110 49 81 195
3476A95n1k0Ro0j0N1N2m3k4M1k0J39p6j67R3NJ3R8j16M9j2J3m6qj2P5kl8n8L0p7K5Q6q0KJ5
$$ 195 144 124 133 73 63 114 166 123 99 140 120 259 183 16 109 114 127 225 109 158 146 159 113 105 93 168 166 128 70 100 23 48 134 54 56 71
3138G1MJ53k15K07M5K7j23J08r0m5kOo0l9K8k6j2J07Q2r3J39j88O9k8J70j90K3k8M7R2j19
$$ 71 75 228 13 220 265 292 169 277 187 142 140 146 86 47 75 49 37 144 226 133 272 84 153 125 295 105 128 100 147 239 120
2847A20O2Q6q1k5r2O6J1j3R5R0q2k02J04l0J6OL5M3m1J05P9j61j00J08J65k41%p8P4k4%K5
$$ 120 182 268 187 162 70 136 147 134 229 319 237 35 139 109 125 131 166 209 168 273 352 191 91 199 364 123 123 45 119 95 95 120
2547A20J01r6LO3Lm1l3k2O6J4k1J64q0L7O4o8j72L3Q9q6Q9j49K6J04j38J1mj2J47q0L3j34
$$ 120 221 125 128 191 194 153 120 98 164 178 157 321 241 278 342 274 102 135 224 138 227 78 104 208 70 81 77 65 212 132 165 31
2246C1J3N2N8O2l2o1MP5J13j59p7lJ25k0j3K7j03K8J17l3j04o5O7k4K2O4j25J01j11J09J04
$$ 31 44 96 154 216 184 123 127 202 315 156 79 76 201 181 168 195 92 120 237 204 100 35 102 78 100 164 39 140 29 138 242
1955B42n4Ll9m1K5m6N9J6M8r7n8L3J9j9j3K2nn2P7N1m4n1J3J04L9j12j7Ql0j3K6P7l9J07J02
$$ 242 188 191 152 111 136 90 149 165 213 116 58 91 110 91 78 100 95 43 120 171 127 76 89 193 232 120 103 111 81 68 94 171 132 239 341
1626C41j45jm8r5O3M8mr3M2P5L8j1O1j72p7J09M5O6M3j9j74J24k9l0QJ0K0o1Jm6J47j64K5
$$ 341 196 195 147 52 115 163 159 66 108 183 221 210 271 99 22 131 176 242 285 266 92 216 187 157 165 175 195 134 135 89 236 72 97
1317I7J40N8j1k47K00j91qM8L5J15N1j69p0J12K0j59O3L0K9l6k6N8p6J07l8K8l4J9p6J3l2
$$ 97 237 295 284 37 237 46 38 86 121 236 287 118 48 160 180 21 84 114 143 107 81 139 63 170 132 160 126 145 69 82 50
1025E0J36LQJ01l1K3r2l4j08J68l1j02PR0J15k1j49K18q1J15k71L61j04L27J96O2P84K521
$$ 50 186 189 197 298 267 290 198 164 56 224 193 91 98 188 303 282 133 351 270 385 114 475 371 698 894 956 1740 4261
763D261L416m645j758n08R9q1k45l5j53R9R9j52q2j91L7L7J41J9k03J89k0j36L8M3j65J9L4
$$ 4261 7677 3032 1274 766 865 784 539 504 351 450 549 397 315 124 161 198 339 358 155 344 324 188 226 269 104 123 157
509A57P5O2n3n3j12jj4m2P5N2m9O5j38J40J36k11k9Ok6J79j39P0J4o9O6p8k1KP2Q1P1j29n9
$$ 157 232 294 241 188 76 75 61 19 94 146 97 162 24 164 300 89 60 66 40 219 80 150 164 95 161 83 62 64 136 217 288 159 100
199A00P0K5l1q2nQ5j03J00l4r7Q9J7j11J10r5NP1O9R3j95J0k6N1p5J84nq2n1N1ll9p4R0p4
$$ 100 170 195 164 82 77 162 59 159 125 28 117 134 23 133 38 43 114 183 276 81 91 65 116 41 225 220 138 87 138 135 96 22 112 38
-120C8J40m8p5mQ8p3l5N8P7n7l4O3j10mQ5m1J1L0L8l2oR9o7q3Q4l0n0j3m
$$ 38 178 130 55 51 139 66 31 89 166 109 75 138 28 24 109 68 79 109 147 115 109 208 141 58 142 112 62 49 45
-392D5
##PAGE=	F1=-14172.9
##FIRST=	19140.455529915001534,	4405.895418600002813,	0
##DATA TABLE=	(F2++(Y..Y)), PROFILE
4406G4J8o9J22M9j57J09n7n2QM8J08n6m8J5l1J61j37O5P5l3j21L2K0j17J12k0Q4K3K9J3p5
$$ 74 92 23 145 194 37 146 89 37 45 93 201 145 97 112 81 242 105 170 245 212 91 123 143 26 138 118 202 225 254 267 192
4115A92j9M8j48L8j4k3J7n9M3K25n6L1j71K4k2j8k6J2J02l8M8p7k9K5L4mJ21lQ1j54l8o7J19
$$ 192 173 221 73 111 97 74 91 32 75 300 244 275 104 128 106 88 62 74 176 138 186 109 80 105 139 135 256 253 334 180 142 75 194
3805A94r5J89J8j06n4j9r9j6P3J12q6m7L4k1k1l0O2KL7N7j41J06r0J77K5j64P9K8K6l5j76
$$ 194 99 288 306 200 146 127 28 12 85 197 111 64 98 77 56 26 88 90 127 184 43 149 59 236 261 97 176 204 230 195 19
3514A9P8o7L4J15k6l8Op4J5L0Q6k1m1L6qJ09j09r0K3J7J2J32r1J4k9K5k3n6NP4K4n4m9Qj2
$$ 19 97 30 64 179 153 115 121 47 62 92 178 157 116 152 144 253 144 54 77 94 106 238 147 161 132 157 134 78 83 157 181 127 78 86 74
3185G4K2N0j19O6o1J2J54j63J68N7L3j34J03o8k2l9l2pok8qm3J34Q1p6J41k36J42o1K08k51
$$ 74 96 146 27 93 32 44 198 35 203 260 293 159 262 194 172 133 101 94 88 60 52 9 143 224 148 289 53 195 134 342 91
2894I1N4l3L8Q9j23Q4R0p1l5j19O9j7L1N2J12r5j59P6l9L5L2K5K3q1J61O6j75r3R7J56k25
$$ 91 145 112 150 239 116 200 290 219 184 65 134 117 148 200 312 217 58 134 95 130 162 187 210 129 290 356 181 88 185 341 116
2603A16K5j11R8n9oM1Q6p5N7P4n5l0j4q2J10L7l7K02j33N9L2n4j79J9J26j23R4j75Q7M5j37
$$ 116 141 30 128 69 63 104 190 115 172 246 191 161 147 65 175 212 175 377 244 303 335 281 102 121 247 124 218 43 130 175 38
2312C8P3j4k1J18n5lp0l2O1L3R8J1j15n7Q9J07j14o1m9K05l6m2M2j05RJ29m6j08n1P5k6jN2
$$ 38 111 97 76 194 139 136 66 34 95 128 226 237 122 65 154 261 147 86 37 242 206 164 206 101 110 239 193 85 34 109 83 82 134
2002A34q3R9j30J09J04l0J0q9k9L8l5QK1N6q6o1R2Jj7l7K2k7NM8M3l6n3K3R2M6r5m4kl3%K6
$$ 134 51 150 20 129 233 203 213 124 95 133 98 106 127 183 97 36 128 129 112 75 97 70 75 123 166 130 77 100 192 238 143 99 97 64 64 90
1664I0P2p7J81R5j41J2j18m2P7J0J5q8K4P8K5j0Q5j62r4J43K3J5L9M0j84J33p3r2K9O8K7p5
$$ 90 162 85 266 361 220 232 114 72 149 159 174 86 110 188 213 203 288 126 32 175 198 213 252 292 108 241 168 76 105 173 200 125
1364A25j6l7J30j43O3P1Q3M6k92K09j85J0L1M1O2P6j46m9J08qj39J08k9mJ5j8O5p3J31q1O0
$$ 125 109 72 202 59 122 193 276 322 30 239 54 64 95 136 198 274 128 79 187 179 40 148 119 115 130 112 177 104 235 154 214
1072B14p9L3j01N7j4R5J8k9J12m3J1n2l0j19K00J1j44M8O0J14K5k48K85n6J64l12M01l4K99
$$ 214 135 168 67 124 110 205 223 194 306 263 274 222 192 73 273 284 140 188 248 362 387 139 424 368 532 220 621 587 886
800H86L27J78J040L707M976o667k589p52K5j25k92m5k09J08J03j51j32j98K2j8K12L0j82J83
$$ 886 1213 1391 2431 6138 11114 4447 1858 1106 1131 1006 714 669 460 568 671 520 388 190 212 194 406 436 254 437
575D37q8j38O6Rj33r4J05J46O1j14j10l1pl4JN3N5o3N4j35J51J64k39l5lj5J65j39J12o7m8
$$ 437 349 211 277 286 153 59 164 310 371 257 147 116 109 75 76 129 184 121 175 40 191 355 116 81 78 63 228 89 201 134 86
284H6R5j02L3m9R5O9K4j15j4J6L1%p9j6R4j14J38k5j17P1M1j12R8q3j7N2O0P2j69O4p4O8n7
$$ 86 181 79 112 63 158 227 251 136 122 138 169 169 90 74 168 54 192 167 50 121 162 50 148 65 48 100 160 232 63 127 53 121 64
-26F4K30p3j50m6P8J6l2m9O0q4J30J5o3j2L8m0qj8O4l0l3Q6j32K8J14l5l3j1P1J0o4O6qp7
$$ 64 294 221 71 25 103 119 87 38 98 14 144 159 96 84 122 82 74 56 120 90 57 143 11 39 153 118 85 74 145 155 91 157 149 72
-345G2N6l0m6j0k
$$ 72 128 98 52 42 40
-392D0
##PAGE=	F1=-14251.7
##FIRST=	19140.455529915001534,	4405.895418600002813,	0
##DATA TABLE=	(F2++(Y..Y)), PROFILE
4406H3N2p5J24M0j70J22n5jm7M4J58j12m7k5j7R3j12O7J15Jj55O2%j37J00J5J10J9NL1p6m9
$$ 83 135 60 184 224 54 176 121 120 73 117 275 163 116 91 74 167 55 122 237 238 83 145 145 8 108 123 233 252 257 288 212 163
4105A63L5j42O3rm8Mk7M3K08o8O5j47l5j8l2M2o4J41m4J3k0MkK2oR2K8N6j44m1k2R5q2J98
$$ 163 198 56 119 110 62 66 39 82 290 222 287 140 105 87 55 97 33 174 130 143 123 127 125 147 141 233 261 317 173 132 110 205 123 321
3786C21J0j11m5m2j03rM1J18o4j7L7q4Ok8M9nQ0N1j40P3p4J61N9j30L6J7kl9j53N5k0mJ17
$$ 321 331 220 175 133 30 21 62 180 116 99 136 52 58 30 79 74 154 205 65 138 64 225 284 154 190 207 205 166 13 68 48 44 161
3476A61Lm7j8m6J4%R9J6m4J2K2O6j30j1m1N3m3J64o1j3m1M2j3o6jN3N4o5m4k0O8J7Lj29J03
$$ 161 164 117 99 53 67 67 166 182 138 150 172 238 108 97 56 109 66 230 169 156 115 157 144 78 77 130 184 119 75 55 123 140 143 14 117
3148A17n6n3J57j05J34M2L7j30Q9n0ko9m2M9K1q9Mk4J01P5n9J28k48J91r2K25k73O9l1J5R2
$$ 117 61 8 165 60 194 236 273 143 232 182 180 111 69 118 139 50 54 30 131 206 147 275 27 218 126 351 78 147 116 131 223
2857B23j14J09R3p0m1j37O1n0P9MJ34p5j12J4m2M4N8K1Mj07J88N7j73o8P2J23j97N3j41J15
$$ 223 109 218 311 241 200 63 124 74 153 157 291 216 104 118 76 120 178 199 203 96 284 341 168 100 172 295 98 151 10 125
2575A25o2mL8M1j7Q4Q6j03k5Pj35J44N3m4K27j72O0J4m4j83LJ46j41J03j97J61j4j13R6Jm0
$$ 125 63 59 97 138 121 205 291 188 163 170 35 179 232 188 415 243 303 317 273 90 93 239 98 201 4 165 151 38 134 135 95
2284I5Q2m0k9op7P6j2J31N2j59p5Q3P6o4l7o1K40m5q8N0r2J8J41n8j30rM8k6k0L9k5R9j58
$$ 95 177 137 108 102 25 101 89 220 272 113 38 121 197 133 96 35 275 230 142 192 100 118 259 201 71 62 110 84 64 103 78 177 19
1974A9R9R2qJ2j17k9N3j8k3K5M4p5l9J35k1l2o9K1nN7NPk0n1L6P3O1p7p9Ol2K1jP3r4K24Q8
$$ 19 118 210 202 214 97 68 121 103 80 105 149 74 35 170 149 117 48 69 64 121 126 133 113 62 98 171 232 155 76 82 50 71 70 143 49 273 361
1626C61j31J6j79N4P7o9M5q1J5Q0J5j2R3j46o3J35nl0M1P5j81J29j02j05L2J06L4r5k6J4Q4
$$ 361 230 246 67 121 198 129 174 93 108 188 203 191 284 138 75 210 205 175 216 291 110 239 137 32 64 170 204 109 83 97 181
1335A81j19Q7oR8Q7k83J91j68L1KM9j1J05j19k3J11l6p2R8q6mM5j5Q5r1J62j16O4j09M4j20
$$ 181 62 149 143 241 328 45 236 68 99 101 150 139 244 125 102 213 177 105 203 117 113 158 143 228 137 299 183 247 138 182 62
1044F2J00J1O1Ok4J09o9jnl9o3J73N0j78P3P2Q6N5k66K79k7K04k68L71L2L06M15L20J294M922
$$ 62 162 173 234 240 216 325 256 255 250 211 148 321 371 193 266 338 424 479 213 492 465 669 401 772 804 1110 1525 1845 3139 8061
763H061O615q744l423j008p0j94l52n4k54J26P9j55j80j53K8p9K09L5j40J76j87j03J02l8
$$ 8061 14676 5932 2509 1501 1431 1237 885 831 577 703 782 627 447 294 322 243 452 487 347 523 336 233 335 297
537B97o2j49Q2K12O0j83j72R1j8o3M7J8Q2p7J8j19J40J80k35o3J7j2J38j35J27j30M2M9q1
$$ 297 235 86 168 380 440 257 85 176 158 95 142 160 242 165 183 64 204 384 149 86 103 91 229 94 221 91 133 182 101
265A01N5r8J42L3l3o6Kn0M4L7m3n6J18j46J68Lj31N5M9j15Q2n9l9K1N2N2j06P7j19J00j1K22
$$ 101 156 58 200 233 200 134 136 86 130 167 124 68 186 40 208 211 80 135 184 69 151 92 53 74 126 178 72 149 30 130 119 341
-36C41j34j60P5lj6j8prj8P9N9n5k6j8L8j9r5M9Kk8J12j12L6J21l5n7o8J38J9j21M1N3l6J1
$$ 341 207 47 122 119 103 85 78 69 51 130 189 134 108 90 128 109 14 63 65 37 149 37 73 194 159 102 34 172 191 70 111 164 128 139
-355A39o0l5j4N
$$ 139 79 44 30 35
-392C5
##PAGE=	F1=-14330.4
##FIRST=	19140.455529915001534,	4405.895418600002813,	0
##DATA TABLE=	(F2++(Y..Y)), PROFILE
4406H8P2o6J10L3j67J20m0N5q2J6J99j62l5p1oL3n4K4J45L9j73Q4l4q4K2R2R0LrM9o9q8L5
$$ 88 160 94 204 237 70 190 150 205 123 139 338 176 141 70 64 97 43 67 212 251 78 162 128 44 66 158 248 251 242 291 222 134 169
4096A69j03O8j2o4l0J8L5J76o0J02j19q5j6n5J07o8R6k0j7L1K4k3Qk6N1N6L3j25l0QO0m1J87
$$ 169 66 134 122 58 28 46 81 257 197 299 180 95 79 24 131 63 159 139 122 153 177 154 162 136 187 243 276 151 121 129 189 148 335
3786C35Lj13k9l8j13j6J2J00m8M0K9q7Pm3L6K0R7K9j42M7n1J32P7r1k%k4l4r7JL6m4J16L3
$$ 335 338 225 196 158 45 29 41 141 93 133 162 75 82 39 75 95 192 221 79 126 75 207 284 193 191 191 167 133 36 37 73 29 145 178
3467A78m1o4Omj2O8O0k8k9O6J8j08J1o2Q6q3J57m1l3n1N9j3m0k3J6P8p3m0m3J42K1n5j08J02
$$ 178 137 73 79 75 63 131 191 163 134 200 218 110 121 59 145 62 219 178 145 94 153 140 100 77 93 171 98 58 15 157 178 123 15 117
3148A17j8p1R6l6J08KL5j06O9m8Rq2j0P1L4j25RJN6O1m7J04j94J83j12K18k37M7k0j8R7r6
$$ 117 99 28 124 88 196 198 233 127 196 148 157 75 65 136 170 45 54 55 111 172 125 229 35 218 106 324 87 134 114 96 193 97
2847I7J32R5p3m3j41M1q2J17l4J59k4j02n1k5L1Q2K4j5r7J65N6j54l0L1P1j59Q2j39R7m5K
$$ 97 229 324 251 208 67 108 26 143 109 268 244 142 91 66 97 179 203 188 91 256 312 158 128 159 230 71 153 14 111 66 68
2556F8K4k1O4R1R5j39j9K0j55J47O1m6K32j93M5J6l4j82j5J42j33J08j20J51o4q3Q4K4n4M4
$$ 68 92 71 135 226 321 182 163 183 28 175 236 190 422 229 274 290 256 74 59 201 68 176 56 207 143 60 144 168 114 158
2274A58m2k9M9j17R7o8J52Q3j92RK0Qj4nn1K36m0j50M9o8N6J41o0j63K8K5l6k6L1K8J11j78
$$ 158 116 87 136 19 116 48 200 283 91 100 120 128 114 109 58 294 254 104 153 85 141 282 222 59 87 112 76 50 81 109 220 42
1974D2Q5O2O%j18l7O7%m0K2J9n1k0J77o2m7j04K0O2R3m2n7K8o6N4M4Q6o8j11K2k4M5m2Q2q8
$$ 42 127 189 195 195 77 40 107 107 67 89 108 57 37 214 152 105 1 21 83 176 134 77 105 39 93 137 223 155 44 66 42 87 45 127 39
1645C9K21P9j11Ok11J53P0j66R1q5J4R4Lk2Q8j30j8J15l8o0M9Q7j74J15j02lj2Q1L1j16k3
$$ 39 260 339 228 234 23 176 246 80 171 86 100 194 197 175 263 133 115 230 192 132 181 268 94 209 107 104 92 173 204 88 65
1354F5O8M6j08J02o3J00Q5k51J79j39O3m4O4q2J16r2kJ24n9rO3j18L6M0j6R6j01J75j25L4
$$ 65 133 179 71 173 110 210 295 44 223 84 147 103 167 85 201 109 107 231 172 163 226 108 144 184 168 264 163 338 213 247
1072B47j10M3j17J25K9N0l7QR8r5qM2n8NJ26P9j87P2J06N8O5k38K34kK33j93L12P7L27M62
$$ 247 137 180 63 188 217 267 230 238 336 241 233 275 217 222 348 427 240 312 418 476 541 303 537 535 768 575 887 964 1291 1753
791A753M45J474N854P891j0326m056j197j63k66m08n1k81J39M7j64k14q5M7j21J55L0r4J77
$$ 1753 2198 3672 9526 17417 7091 3035 1838 1675 1409 1001 950 669 808 855 691 477 392 439 318 473 503 409 586
575E86l10qJ24q5J1j52j1K63N5k37k14K05k3q7Q1j3J11r0k9r3J26J79k06j11N8k4J18j27J07
$$ 586 276 268 392 307 318 166 155 418 473 236 22 227 204 117 198 185 296 206 177 84 210 389 183 72 130 106 224 97 204
302B04j71J54j9m1M6j18J73nq3J1j0p4K0P2Oj02J46j78J69N0j38M3M4j24O9m2n2oM8L1k9O0
$$ 204 33 187 168 127 173 55 228 223 140 151 141 67 87 159 165 63 209 31 200 250 112 155 199 75 144 102 50 44 92 123 94 154
2A54j50J51K7J82j84r7J13l7p7mK7p3M4O7O7m9l9p2J11m3q5j4K1j5J22r1M5J28m5q1r0J95
$$ 154 4 155 182 364 180 83 196 159 82 78 105 32 76 143 210 161 122 50 161 118 33 19 40 25 147 56 101 229 184 103 13 208
-299B08Pj59L0R3Mj1j05j9l3J6
$$ 208 215 56 86 179 183 172 67 48 15 31
-392C1
##PAGE=	F1=-14409.2
##FIRST=	19140.455529915001534,	4405.895418600002813,	0
##DATA TABLE=	(F2++(Y..Y)), PROFILE
4406H6P9m6Q0L0j47J03j7J08j08oK12j98j6j10%N4k7l6J44O3j65Q2n9k9oJ33L7j9j9P5n5j16
$$ 86 165 119 199 229 82 185 168 276 168 162 374 176 160 50 50 104 77 41 185 248 83 165 106 77 71 204 241 222 203 278 223 107
4105A07K6l6N3Kj10j7K9J2J49l8J33r8j16k0p5J66m4K9J1m7N8N0l7po2RQ4J8j11rJ6J8L0J51
$$ 107 133 97 150 152 42 25 54 66 215 177 310 212 96 76 1 167 123 152 163 116 174 224 187 180 118 127 211 229 118 109 125 143 173 324
3786C24Nj05k1j8j26k4nN4l8J03J4n7J0o2J8P1R4j0j47L8k8Q7Q5n7l3j7l1k3l8j4M4o1R8O0
$$ 324 329 224 203 185 59 35 30 84 46 149 163 106 116 54 72 143 237 227 80 118 90 177 262 205 172 155 124 101 63 49 93 32 130 190
3467A90k3j05L8k1J0qJ02Jp5J12k6m9k5n2J09o3J10m4m8o0P4k3km0k1Q5p9l5oJ49L2j19o9
$$ 190 167 62 100 79 89 81 183 184 109 221 195 146 121 69 178 115 225 181 133 73 147 124 122 82 61 146 67 32 26 175 207 88 19
3157A9P6K0n7J8L9R0m6K0o0M2o2Mo7L8O3L6j29LJ6K7L1l9P5j04J40j11J92j52j4%n4J06p9
$$ 19 95 115 58 76 115 205 159 179 119 161 99 103 36 74 137 173 44 47 63 90 121 82 157 53 193 82 274 122 108 108 54 160 81
2847H1J44R8o7m3j39J6p1R9n6J91K6j20r8J2nJ01L0k9o8J11O0j18J1k0Pj05R8j09N2k3J0N
$$ 81 225 323 256 213 74 90 19 118 62 253 279 159 61 73 68 169 199 170 102 213 273 155 166 146 153 48 146 37 89 66 76 81
2547H1p6J45Q4J00j64j1K5j43J22O0m3K14j94J6L7j3j75k2R7p2P6k8J29j02p0O5N2o3Mn7O
$$ 81 5 150 234 334 170 159 184 41 163 223 180 394 200 216 253 240 65 43 140 68 144 116 245 143 73 138 190 127 131 74 80
2256H0Q4j47J12r8J37J00k07J00k5p8L8K4m7K24k6k08M4m9R8J31m6j90N3J5o2j4L0O2J26j88
$$ 80 164 17 129 31 168 268 61 161 136 58 96 120 73 297 271 63 107 58 156 287 241 51 104 119 57 43 73 135 261 73
1974G3Q4K7Qk3r6m9P1J4n3J1LNm3K20j11n5k4j8O7J22q8j35J28j05O9%J16o7j04Pj4O8n5Q2
$$ 73 157 184 192 169 73 24 95 109 56 67 70 75 32 252 141 86 62 44 111 233 145 10 138 33 102 102 218 151 47 54 40 108 53 135
1655A35p2J72O8q2k0j54J79N6k44J36r8J0J27qm7P9j26L8Q7p6o8O3Q8j79R2o1O5k1M3J8j35
$$ 135 63 235 303 221 201 47 226 282 38 174 76 86 213 205 158 237 111 149 236 160 92 155 243 64 156 95 160 139 182 200 65
1364F5j5J01K8j09J19o9Q1L2j86J53j01J05j02P7q7N6o4MJ46p5M6Pj12P9K2k1Q8q4J60j09
$$ 65 50 151 179 70 189 120 201 233 47 200 99 204 102 179 92 148 84 88 234 159 205 212 100 179 201 180 268 184 344 235
1082B35k3p7K6r0J28L4O3j07N6Q2j12mP6p7O3O9R1j65M8J50M2N5j92J68J9K47j06K37R6L38
$$ 235 212 135 161 71 199 233 296 189 245 327 215 211 287 210 273 342 433 268 316 466 508 563 371 539 558 805 699 936 1032 1370
800A370M67N21J527O258Q470j0990m332j269k36l19m42l0k85J39J7j75k21k0O9j46Q8K1o0
$$ 1370 1837 2358 3885 10143 18613 7623 3291 2022 1786 1467 1025 995 710 849 866 691 470 450 519 373 461 482 422
584D22J90m29J35J17j18O9j44j18K87M1k55j42J96j9r7J01l5J31j07p0n8J16J61j64j67J12
$$ 422 612 183 318 435 317 386 242 124 411 452 197 55 251 232 135 236 201 332 225 155 97 213 374 210 43 155
340A55m9J04j06N4j25J89p8mK3j01J66m0r9P8k4np8P6N4j24J57j79J30R5j36M5L3j43N8l4
$$ 155 106 210 104 158 33 222 144 140 163 62 228 188 89 167 143 138 60 136 190 66 223 44 174 269 133 178 211 68 126 92
58I2n2j8N0NL3K9j12J63M6J25k12l8J23m0j34%O0p0M2P9M9m5m8j21J64o2m6j1l4J8J03p6N0
$$ 92 40 22 72 77 110 139 27 190 236 361 149 111 234 194 60 60 120 50 92 171 220 175 127 6 170 108 62 51 17 35 138 62 112
-252A12J41m8j21l9J87j1j65L3R6L5j1j27j8n7K1
$$ 112 253 205 84 45 232 221 56 89 185 220 209 82 64 7 28
-392B8
##PAGE=	F1=-14487.9
##FIRST=	19140.455529915001534,	4405.895418600002813,	0
##DATA TABLE=	(F2++(Y..Y)), PROFILE
4406G5Q0j0K7L1j15P4J0J49j28j2J93k13Nj31RJ17o0k1R5N5j35O0m5j1K6J09k4l7l3J06k8
$$ 75 155 145 172 203 88 162 172 321 193 181 374 161 166 35 44 161 101 80 175 230 95 155 110 99 125 234 210 173 140 246 218
4115B18q1m4M2K6L7j80N3rk8J57k5J51r0j34k5n0J85l1oK1p9O6R0m6k2j05k6J09K0j14J4M
$$ 218 137 93 135 161 198 18 71 62 34 191 166 317 227 93 68 18 203 172 166 187 108 174 264 218 196 91 65 174 194 80 94 98
3814I8k3J20R2K0p4l3oj32k6mplJ19%j6K4p9kJ29Q2n8j56N2j2L1R2k8n8l8j6j1QMK2o0O0Q5
$$ 98 75 195 287 307 233 200 194 62 36 32 25 22 141 141 125 149 70 68 197 279 221 65 117 105 136 228 200 142 104 88 77 85 89 111 51 111 196
3467A96kj19L7l6M3q8J30L6j18J54n4np6k9J26l1Q4p0n1p1Q7m4L3l8k8N0p7k1L8J29M1j82
$$ 196 194 75 112 76 119 31 161 197 79 233 179 174 98 69 195 164 248 178 127 56 143 99 132 94 66 116 39 18 56 185 226 44
3166D4nL3L6l0n1J10P5q0j5J1J3p4k8J3K5M6L1j09j3K0K6kn7N4j7R2q5J63o2q5J7p8J20o6
$$ 44 39 72 108 78 27 137 212 132 117 128 141 67 39 52 77 123 154 45 32 52 78 76 19 73 56 148 63 226 164 79 96 18 138 72
2847G2J31J01m3m5j35%l1K9n3K20N5j47j11M4l5J03K7k7m5N1O5o6M6p4n6k2P7p2J1pK0k0J2
$$ 72 203 304 261 216 81 81 50 79 26 246 301 154 43 87 52 155 182 155 110 161 226 160 206 132 76 54 131 59 70 63 83 63 75
2537G5Q2P2J02j76lK0j22R6M9l7J80j80k1O7K4j56j5K2L5qO9R4j34o2M6P8o5l9o9O6R1j63
$$ 75 157 229 331 155 152 172 50 146 195 158 338 158 137 204 228 72 57 79 114 106 175 269 135 73 119 197 132 93 24 90 181 18
2237A8J12p8P7J05j90J60n6j27P0L7n0K06j2k10L9o8J24J07j3k02O5J5r4QK7Q0J30j77Q7L
$$ 18 130 52 129 234 44 204 148 21 91 128 78 284 272 62 101 33 157 264 251 49 114 129 35 43 70 150 280 103 190 193
1955A93%l7p3n9O8J9n8OK6M0q6K37j40n3M0k3M2J42j30j01J36j35P2m8J39o6o8m0kQ9m1Q1
$$ 193 193 156 83 24 92 111 53 59 85 125 39 276 136 83 123 100 142 284 154 53 189 54 126 78 217 151 83 43 41 130 89 170
1655A70o2J00N8n0m9q6J77M0k25J12r5j8J65j1q8Q1j36R2N8j17m2O9R5k04N9LQ5j2K1%j43
$$ 170 108 208 266 216 167 81 258 298 73 185 90 72 237 226 138 219 83 175 233 116 74 143 238 34 93 96 181 169 190 190 47
1364D7j7J15K2j15J41l6N7l5q5P7o0J45j54P6l7m9k4k0J72q3R1o2p0R8Rk5N5m0J23p7q9k1
$$ 47 30 145 167 52 193 157 214 179 94 171 111 256 102 178 141 92 68 48 220 137 228 166 96 194 203 178 233 193 316 239 150 129
1063A29kn2J18K9R1j86J08O0j18J3R0q9R7J5P9j11MK01L4L5j48R6L4K42k2J60Q5L29M30N34
$$ 129 127 75 193 222 313 127 235 295 177 190 280 191 288 303 382 271 275 476 510 545 397 493 527 769 747 907 992 1321 1751 2285
781B285J433O026Q203j0556m179j207k78l35m48J0k63J16Jj88j93K2R0j54K7J5m6K13m84K56
$$ 2285 3718 9744 17947 7391 3212 2005 1727 1392 944 954 691 807 808 620 427 449 539 385 412 427 381 594 110 366
556C66Q8j29R8j19k17K71K0k30n0J44rr1J08m1J37j31r7j6J08J38j19j97J45p2P9o6k3%J38
$$ 366 454 325 423 304 87 358 378 148 98 242 233 142 250 209 346 215 118 102 210 348 229 32 177 105 184 118 95 95 233
284B33j17J9mn2J23p3m6Q6k1P9j37kR8j06J36j49P1J22j30P4K3j69M1l3k7k0N7k4N8on2J72
$$ 233 116 135 131 79 202 129 83 169 148 227 90 88 186 80 216 67 138 260 130 204 227 58 99 66 39 19 76 52 110 104 52 224
-17B24M4O7k14KJ13k1j64j7R8j2j6R1K3m3n1q7J31p1k9J0n9M3O6o6L9J61k2j74PJ60k4j43
$$ 224 268 335 121 123 236 215 51 34 132 120 104 195 218 175 124 37 168 97 68 78 19 62 128 62 101 262 240 66 73 233 209 66
-317F6L7P7N6Jj23l2o0P
$$ 66 103 180 236 237 114 82 22 29
-392B9
##PAGE=	F1=-14566.7
##FIRST=	19140.455529915001534,	4405.895418600002813,	0
##DATA TABLE=	(F2++(Y..Y)), PROFILE
4406E9P6M2l1J6p5L5L8J71j39jJ46k03K0j29L5J47j02J6O5J6r6L1Ol7O3O5p2m1n6J32J7Mj47
$$ 59 135 177 146 162 87 122 160 331 192 191 337 134 154 25 60 207 105 121 186 202 106 137 143 106 169 234 162 121 65 197 214 218 71
4096G1R8mP6k13P8m0n2J94n1J55r0j47j5k9K01l2rKj01O4J38n7l6j34n5J27L2j25L0j9OJ50
$$ 71 169 165 241 28 106 66 14 208 157 312 222 75 60 31 232 200 191 193 92 156 294 237 201 67 12 139 171 46 76 57 63 213
3796B13J2N6k0o4k0j24k3MQM4K5JK1M7r8k4J83O6j05j63Q5mk9J13j5o9p3K5j2M0K3Nn8J6J06
$$ 213 225 281 261 197 177 53 30 34 42 86 111 112 133 180 82 58 241 307 202 39 124 120 91 204 189 120 47 72 60 100 123 128 70 86 192
3467A92J6j16K3n1P5j06R8O6j47J83o0Kj12qJ39rQ3r8m3p9R4p1N5j8j2km8oL3J19M4k24O1
$$ 192 208 92 115 64 139 33 131 197 50 233 173 175 63 55 194 185 268 170 127 48 142 71 126 108 96 94 46 40 73 192 236 12 73
3157G3J1KJm2J03O4r0o6R5rl6j3J0l7L6L1q7k3KN3K6m6j9JM8m3J55kj20kl8J05o4R0R6jm5
$$ 73 84 86 87 45 148 212 122 56 151 142 106 93 103 66 102 133 46 23 25 78 104 58 39 40 88 45 200 198 78 76 38 143 79 169 265 264 219
2810B19j38Qk2k2j7K16N6j73o0L2k1P1Oj1m0JO7lP3j21p8L1L3l3j2%K6m1Q7K2N4J05j75NN
$$ 219 81 89 67 45 28 244 300 127 67 99 78 149 155 144 104 105 172 169 242 121 43 74 107 74 62 62 88 47 134 156 210 315 140 145 150
2481A50j02P8K6k5J34j47o0R8O7j26k2J8P9j04J58N1j62l3J6R5n7q4NO9O7j67R2m6K5J00j34
$$ 150 48 126 152 127 261 114 54 152 219 93 71 89 168 64 222 273 111 78 94 189 132 48 53 122 189 22 114 68 93 193 59
2190E9J70p8q7L4L3n6J79kj53M5j11J20P1K3j91O5J5r9J1J4Q4J20j36Q4pj8k1o7p4P8Om3K2
$$ 59 229 151 64 98 131 75 254 252 99 144 33 153 224 247 56 121 136 37 48 62 146 266 130 214 207 189 168 101 27 105 111 68 90
1880I0N3L5j06K08j28m7O5l1L6J45j63n9J33j55P6q7J45m6n6p9J1J12l4R6m7J3N8j5o2o4J65
$$ 90 143 178 72 280 152 105 170 139 175 320 157 98 231 76 152 65 210 164 108 29 40 152 118 214 167 180 238 223 161 97 262
1589B62K9j67P1o5o5J85qj26R6j41J19L7j60K3N7J15k20mN6P4QJ2j3j36j5R4K5j19J60J0M3
$$ 262 291 124 195 130 65 250 242 116 212 71 190 227 67 90 147 262 42 38 94 168 176 188 175 39 24 118 143 24 184 194 237
1298B37m7l3j3l2J81j83M8K5j40L7o4J77q7J28j26j2Q3Qj5jJ7P7l6j42L2l2j8J07J4J27k32
$$ 237 190 157 144 112 293 110 158 183 43 80 16 193 106 234 108 96 179 187 172 171 188 265 229 87 119 87 69 176 190 317 85
1007H5J29L2j11L5Q3q4R9k8M9m3m8K53L1J2j13K5M6K14M5J00M8K97L61M84J214N218P169r139
$$ 85 214 246 135 170 253 169 268 240 289 246 198 451 482 494 381 406 452 666 711 811 859 1156 1517 2001 3215 8433 15602 6463
744F463l638j030k85l09m27O3k19P7mj99j35K9J07j46j8K0n4K38m01K60N0j14R5p6k62J84
$$ 6463 2825 1795 1510 1201 774 837 618 695 691 492 357 386 493 347 329 349 295 533 132 392 442 328 423 347 85 269
500B69mj60J4Q7Kp4J06l0J30j58j09K6J00J18q0j62J16p1K8j5q5R5P8j29K4k4OO7j06N9L7
$$ 269 265 105 119 206 208 134 240 210 340 182 73 99 199 317 237 75 191 120 148 133 48 143 221 92 116 92 98 165 59 118 155
209A55JJ46j42j40J36n0Q1r9K6J05j19J32J7j91J6l9J9k4O2m1M1l9K4J69K8K1j87J9Q4J2j50
$$ 155 156 302 160 20 156 106 187 88 114 219 100 232 249 58 74 35 54 30 92 51 92 53 77 246 274 295 108 127 211 223 73
-83G3j5R4M5p4P8Ll8m9m2R9p2n7L6l4M9K6n4LJ79L5j90mJ20l0j03L2N5O9K1j11n3n3J
$$ 73 58 152 197 123 201 204 166 117 75 174 102 45 81 47 96 122 68 71 250 285 95 91 211 181 78 110 165 234 255 144 91 38 39
-392C9
##PAGE=	F1=-14645.5
##FIRST=	19140.455529915001534,	4405.895418600002813,	0
##DATA TABLE=	(F2++(Y..Y)), PROFILE
4406C8P3J01o5l1l8oO5J70j41K8P9j73K4r8O7J33j28M7N8l6n4%O2p7Q7J5r0k1o7J16Q3R0k06
$$ 38 111 212 147 116 78 72 137 307 166 194 273 100 124 26 93 226 98 145 203 167 113 113 175 98 185 200 110 89 22 138 221 311 105
4096A05Q7k8J05k08O0n7RJ77j04J45r3j53K3k3K05m6Jl5r0N2J82p6m7j30k7O9M4j17K6k1J12
$$ 105 192 164 269 61 121 64 73 250 146 291 198 45 68 45 250 204 205 170 80 132 314 238 191 61 34 103 147 30 56 35 147
3805A47P8p8J12L9j01o4r5k0K7L2O4p5M1K6P7j23m6K25M5j37j61J23no9J41k7o2j01N9l1O6
$$ 147 225 147 259 298 197 133 38 18 45 77 141 66 107 133 210 87 41 266 311 174 13 136 131 62 203 176 114 13 72 41 107
3514A07L6pn6k3J25K2j10J9o8J03q4L7Q6j61J95m5l0j07j0J45kR8j14l1p7R3r6O2J2Kl1k1
$$ 107 143 136 80 57 182 204 94 113 45 148 64 101 187 26 221 176 146 39 29 174 172 270 156 125 48 141 45 107 119 121 90 69
3213F9j0K0J15M1j88O7J5o8K6J0N0N2p6j06J56j6J0J2l2j01L7M7q0ok5O4R2l3l9r5L2pJ62
$$ 69 59 79 194 235 47 114 129 61 87 97 147 199 123 17 173 157 167 179 147 46 83 130 50 44 19 83 175 142 103 8 40 33 195
2903A95K2j06n8J8R5p2L2P8M8l0j51M0m2mj6J91L7j87J7KJ8L6l6Pm9l4O8N7R0j54l2NrLk1
$$ 195 217 111 53 71 166 94 126 204 252 222 71 111 69 65 49 240 277 90 107 109 127 163 127 134 85 51 119 176 266 112 80 85 76 79 58
2575E8J5K2m2J20k8L3J08j60J2j6q5P0rrR0r3o5R0R9q8n2Q1O2j90K26Pj80L0k6R0m1j22J02
$$ 58 73 95 53 173 145 178 286 126 138 122 37 107 98 89 179 86 21 111 210 122 70 151 213 23 249 256 76 106 80 170 129 7 109
2265A09N8K5j65N7j5QP5p0J52r1n0J7J9o4J47kp6N0j40J15L1L4j55N6Rp0j1qP7R5o8P8qm9
$$ 109 167 192 27 84 69 77 152 82 234 143 93 110 129 65 212 210 134 184 44 159 190 224 69 125 134 64 53 45 122 217 149 227 219 170
1946A70K3p5p7R4k6k1M6O6J9j06J47q1m9O5m1N5J27j85l3J32j57P6j17J42j1p2j01K6J39m4
$$ 170 193 118 41 135 109 88 134 200 219 113 260 179 130 195 154 209 336 151 118 250 93 169 52 194 183 111 10 36 175 131
1664A31J17j7q8P3K6n2r7J43K6j09M2j9j09J73mj41J15j21J03K8j95R6M0J39k35m5N9N0L3
$$ 131 248 231 143 216 242 190 93 236 262 153 195 176 67 240 236 95 210 89 192 220 25 121 161 300 65 20 79 129 162
1392A62J5k1j12K4J1M1q0J26N9L3nm0p9l7K07j77lQ0j60O5l7Q6q4J51j42J2M4J2K2o3N6L7
$$ 162 177 156 44 68 79 120 40 166 225 258 253 213 134 97 304 127 124 204 44 109 72 158 74 225 83 95 139 151 173 110 166 203
1091B03J0j23J1n1PR4lJ66j83N7Jr3N4N7n9Q1o0J8J2r4K96K9nr0l5N3J66Q8P1mK49K71L93
$$ 203 213 90 101 50 57 151 148 314 131 188 189 96 150 207 148 229 169 187 199 105 401 430 425 335 300 353 519 607 678 674 923 1194 1587
781A587R25M045N648p118k849p84k65k40l96J16j56L3lk04o4KJ13j20m6L5p6K54k62K07J4
$$ 1587 2512 6557 12205 5087 2238 1454 1189 949 553 669 513 546 543 339 275 277 390 270 224 259 183 437 175 382 396
547C96p0O3k2k37L4k0n8L2L8Qn1R9jJ13j77j07N1R2J03n0j06O4m9m0L7p2R9K7j20K3l3M8K2
$$ 396 326 389 367 130 164 144 86 118 156 164 113 212 211 324 147 40 91 183 286 236 130 194 145 105 142 70 169 196 76 99 66 114 136
237A36j25J42k4L3J85j08j50M1RJl2PM0q7J91J0j96Km9N2l7P0n6Ml3Q0J47Oj1j36K0N3L6j14
$$ 136 11 153 129 162 347 239 89 130 139 140 108 115 155 68 259 269 73 75 26 78 41 111 55 59 26 106 253 259 248 112 132 185 221 107
-83A07J2O3Q7j16L0jk9m3oR6q2j07N6RN9rl7l6J63J08j78m6O9k3n9J8L8Q2L7j04p0l4L
$$ 107 119 182 269 153 183 182 153 110 104 200 118 11 67 76 135 126 89 53 216 324 146 100 169 146 87 105 143 225 262 158 88 54 57
-392E7
##PAGE=	F1=-14724.2
##FIRST=	19140.455529915001534,	4405.895418600002813,	0
##DATA TABLE=	(F2++(Y..Y)), PROFILE
4406A8O7J52o4j03%k7Q0J39j41P0Qj27J4m5Q7R1j27N5O1q2j2l5J08j06Q9k9p3J5j0NJ69J48
$$ 18 85 237 173 70 70 43 123 262 121 191 199 72 86 41 128 219 92 147 208 126 114 79 187 81 170 141 68 83 73 78 247 395
4105C95k25L4m0J12j87K6n8P5J55j58J28r8j36O6k9J90o1Np5k2J8K10j05n5r5j2OM3n5j5L7
$$ 395 170 204 164 276 89 115 57 132 287 129 257 159 23 89 60 250 189 194 119 97 115 325 220 165 70 58 64 107 52 37 74
3814G4J57jj61J77Q5j34j18l5k4N7J2Q6j52J15j4J13j51o4K43K1j43j16J18j0o9J47o2m5o3
$$ 74 231 230 69 246 331 197 79 44 20 77 89 175 23 138 124 237 86 22 265 286 143 27 145 135 66 213 151 106 43
3542D3L0n4Q6M4k1n6l1J32J2j10K9p8J20o7KR1j61J85j7q3m9m3J38pJ17j12k5o2Q0j01M8M6
$$ 43 73 19 105 149 128 72 41 173 185 75 104 26 146 79 81 172 11 196 179 96 47 4 142 135 252 140 115 53 133 32 80 126
3242A26Pl5j7j4J3J07L5j46Q2K2j33L9N6rM2n0p7J33j0L8L2o7j38K9P5q0J8k4K9J52j4p0j18
$$ 126 133 98 81 67 80 187 222 76 158 180 47 86 142 133 175 125 48 181 171 209 241 174 36 65 140 60 78 54 83 235 221 151 33
2932C3M7k0J33K6p1j03N7R0q6k7M4R6Pj74Q7p6M9m7J65Qj76Q2k2O0J1p6No4m2O1R8R5j62k
$$ 33 80 60 193 219 148 45 102 192 106 79 123 219 226 52 139 63 112 65 230 238 62 144 122 182 193 117 122 58 16 77 175 270 108 106
2612A06k8l7L4k6M8Pk9J13o2J3J05j23J2m2n8O3n9QO6k0l0K9J07m5r8J53L3k28K38k5j80J04
$$ 106 78 41 75 49 97 104 75 188 126 139 244 121 133 91 33 96 37 45 111 91 61 90 197 152 54 207 240 12 250 225 45 149
2312A49o5O0j8r5J20N8rj71L2mK4L3j7J24r9j9J9Jo7J06omM6j50J27Rjr8L3Ql6l2l3N6N8J8
$$ 149 84 144 126 31 151 209 200 29 61 57 81 114 97 221 122 103 122 123 56 162 156 152 198 48 175 184 183 85 118 126 90 58 25 81 139 157
1974A57P5kr3P5q6n9J08p1mO3P4%q6P1k4n7N3m9R9Q7j90k7J29j39P2j44J38K7j09o9J5J67
$$ 157 232 230 137 212 126 67 175 104 100 163 237 237 151 222 198 141 194 145 244 331 141 114 243 104 176 32 170 197 88 19 34 201
1673B01o6J26K8k01J04P7m0j55J10L5o5K5L2j42J33nj16J21q4O2K4j78J22L1J52k50m7J9L2
$$ 201 135 261 289 88 192 269 229 74 184 219 154 179 211 69 202 197 81 202 118 180 204 26 148 179 331 81 34 53 85
1401H5M7K8k6p6O5p9O9k8N8J05K6M1o7j05p5K19j37n6J11j16M5j1jp2J57r6j9NMQ3p8K4J5
$$ 85 132 160 134 58 123 44 113 85 143 248 274 315 248 143 68 287 150 94 205 89 134 123 122 50 207 111 92 97 101 184 106 130 145
1091A45N5n3o8n6M3O0k0K08j10m3k8o6N9K1j5O4r4L1Qq8K89K2j4o9p8N5J09R9P9o1K07J81
$$ 145 200 147 79 23 66 126 106 314 204 161 133 67 126 147 132 196 102 133 141 53 342 364 350 281 203 258 367 466 545 484 691 872
791H72K83O55K809M044n031k021n26k41j38l70J48p9Prj90j6l1Q9q0n5N8j08K49j35J60j9
$$ 872 1155 1810 4619 8663 3632 1611 1085 844 706 336 484 405 412 403 213 197 166 255 175 120 178 70 319 184 344 325
547C25qJ2L5j79r7rOJ8LRl3R5M4Q5j56r1K0Q5R3l0m6Rk7r6P7l7O7pj01M2m0N7%o0J02o7O1
$$ 325 317 329 364 185 88 79 85 103 106 115 82 177 221 306 150 59 79 164 257 227 181 190 163 67 144 107 174 167 66 108 68 125 125 65 167 100 161
199A61J93m7j22l3K6q8M0ml9J7J72jj89J7m3M5n4P8p7l3O3N9J08j5l4p3J1M0L4p7M4L6J11
$$ 161 354 307 185 152 178 90 130 126 87 104 276 275 86 103 60 105 51 129 52 19 82 141 249 234 200 127 138 178 212 135 179 215 326
-111C26j33n4J3j2l7J9J09j04o4%L7P6l6k6k3P4J76j51q9J7pk1KK6R7M1j03q0oJ6
$$ 326 193 139 152 140 103 122 231 127 63 63 100 176 140 114 91 165 341 190 101 118 111 90 92 118 215 256 153 73 67 83
-392H3
##PAGE=	F1=-14803
##FIRST=	19140.455529915001534,	4405.895418600002813,	0
##DATA TABLE=	(F2++(Y..Y)), PROFILE
4406B1L5J84m3j67M5J9M8Q0j56J18n5p2KkJ02L6j00L3O8j16L0p1J35j15P3o1k0K3L0o8K46
$$ 21 56 240 197 30 75 94 142 222 66 184 129 57 59 57 159 195 95 128 196 80 110 39 174 59 132 71 51 74 104 36 282
4115B82J72k21k4m0R3j56j5m4J34J24j99J11j03q0P2k8J56o9mj06Q0k2K13j36o4m8qnrL1n4
$$ 282 454 233 209 169 262 106 91 47 181 305 106 217 114 34 106 78 234 165 161 55 135 113 326 190 126 78 70 65 56 87 33
3824C3Q3J74o1j89K02J06j49j45J5l2P8l4J03j46J41p7J52j70q2K37mj17p2R9j4m8J26r9k7
$$ 33 116 290 229 40 242 348 199 54 69 37 115 81 184 38 179 102 254 84 2 239 235 118 46 145 131 83 209 110 83
3551H3k0Pn8Q4M9m4n7J8J10j2j20M8p0J21o3JQ2j48J53Rj30J0l8R6j6J25r0l7l3N6q3K0P4
$$ 83 63 70 12 96 145 101 44 62 172 160 40 88 18 139 76 77 159 11 164 173 43 53 15 111 95 220 130 93 60 116 33 53 127
3242A27%k4k8j5K2Q5L3j13J14K6j83M6Q5o4L3k5m7R4PM7M6q7j26j0R8o5L6k6j3J90K2j16r4
$$ 127 127 103 75 60 82 167 200 87 201 227 44 90 175 111 144 119 72 166 173 220 266 179 53 43 141 76 112 86 73 263 285 169 75
2932G5O3k9P1K8l5j08O6Q3j04q0J1J34N6j90J24j05R1p8J35j6j18R8k7Q8or5k1p2MJ6J01R2
$$ 75 138 109 180 208 173 65 131 214 110 30 41 175 231 41 165 60 151 73 208 192 74 172 145 233 227 132 111 39 43 59 160 252
2631B52j42ln4m4N6k9R6j5k2Q5p8nR2n5lo9rM3p2j5Q5K6m8OJ05qj42K10Pk10J85l4j45J39
$$ 252 110 107 53 9 65 36 132 117 95 180 102 97 189 134 131 62 53 96 24 9 94 120 72 78 183 175 33 243 250 40 225 191 46 185
2312A85q8K2Pp3J21N9k0j85M1k5M7j4L0Q4j03J9K5j9n6N8j3M7L0j24J27Ro5k6nL0j6m6n5K8
$$ 185 97 119 126 53 174 233 213 28 69 44 91 77 107 191 88 107 132 113 57 115 102 149 179 55 182 191 126 100 95 125 109 63 8 36
1993C6J6J02Q2Kj37J15r5k7J16j16MP2Q0k1n3jK3o3L6n3J58L4j77m0J24j07O3j54J31N0j53
$$ 36 52 154 236 238 101 216 121 94 210 94 98 170 250 229 176 175 198 135 171 118 276 310 133 93 217 110 173 19 150 200 47
1702D7jpJ92q7J12P6l08J33J39l8k07P1N1m7K0Q3j66P9j4n2J05m1J8J3j12J04L0J53k49m3
$$ 47 46 39 231 144 256 332 24 157 296 258 51 122 173 126 146 229 63 142 128 76 181 140 158 171 59 163 193 346 97 54
1420E4k0L3L0M7l5l2R4j41R1MpJ50J7O8r6r3j04J87p3p9J00n5RNo3m7J45m5m8%m1J44m4o4
$$ 54 34 67 97 144 109 77 171 30 121 125 118 268 285 353 257 164 60 247 174 95 195 140 149 154 91 44 189 144 96 96 55 199 155 91
1101I1RR2Jj37l9R1ml3K43n5j24n3l4N0k0M1O6j41J04o7K7J81Pk0m2r2M3O7P3J13j07J96J15
$$ 91 100 192 193 56 17 108 104 71 314 259 135 82 48 98 78 119 185 44 148 81 108 289 296 276 234 142 185 252 325 438 331 527 642
791F42J77M87J842K773l439j370l12k43k4l36J17LJ5k2j26m7J4l7k6j7O6j12J78k1J28o5N7
$$ 642 819 1306 3148 5921 2482 1112 800 557 533 197 314 317 332 310 184 137 151 114 88 71 137 25 203 182 310 245 302
537C02m0P8j11j11J1m9%j4J8l3R8R1M8r7r3l3Q3Q1j8J3l3k6j16R2j2L4k1q5Q6o1M9pk5N7q1
$$ 302 262 340 229 118 129 80 80 66 84 51 149 240 288 191 98 65 148 229 211 224 191 165 49 141 129 163 142 57 143 82 131 124 99 156 75
209G5P3J68L0q4n3Pj59J00l0o8J18R9k1j69M6l3L3p0Q3j03j3J08M2O2l1n9mj0M7J4m7P2J7
$$ 75 148 316 346 262 209 216 57 157 127 59 177 276 255 86 132 99 132 62 145 42 29 137 179 241 210 151 147 137 184 198 151 223 240
-101B40J23j29j47L3Pl4L8J19j27mk5J6J03n3k9J3m1K29j17j21j9PKlRJ15L2j08p7K7L4
$$ 240 363 234 87 120 127 93 131 250 123 119 94 110 213 160 131 144 103 332 215 94 75 82 84 81 90 205 237 129 52 79 113
-392A13
##PAGE=	F1=-14881.7
##FIRST=	19140.455529915001534,	4405.895418600002813,	0
##DATA TABLE=	(F2++(Y..Y)), PROFILE
4406D7k1J92j8j99R6O2K3K6j83J45r8j9RPJ10j6o0rP5j33O5n0R7j14N2p8L8jO6p9K78J67j98
$$ 47 26 218 200 1 97 159 182 208 25 170 72 53 62 69 179 163 103 94 169 36 101 51 148 34 86 8 46 45 111 32 310 477 279
4096B79o9l6N6j21n0k3J74R3k21J06j17k8O8j3J09o5k7n4J15o1K01j54q1ljM9p0O5p1R3J73
$$ 279 210 174 230 109 59 36 210 303 82 188 71 43 111 98 207 142 115 61 176 115 316 162 81 78 77 126 56 121 50 143 316
3805C16r4j31J49J04j38j25Qm0R2p8J09j06J47j42J87j67p6J85l2o7m5P4j5k6Q6j08%Pkm0
$$ 316 222 91 240 344 206 81 89 49 141 63 172 66 213 71 258 91 15 200 168 101 56 130 115 89 175 67 67 74 72 32
3523C2M8N4p2m4Q2P9l8j29N5m1J04o8L1N8j23J01K4j19Nk1P5qJ02o1n7KK4n7mQ8j5qm8rM9
$$ 32 80 134 62 18 100 179 141 12 67 26 130 62 93 151 28 129 153 34 39 18 93 85 187 126 69 71 95 38 34 122 107 99 51 42 91
3195I1N5K7r6J62K8k24O1R0j09K8j1k8N8K9M0M9q8q5o3J04k5N0l1o3K02P4j62n5O9k1KL3j2
$$ 91 146 173 77 239 267 43 104 194 85 113 102 74 132 161 201 250 162 77 14 118 93 143 112 49 251 325 163 108 177 156 158 191 179
2885A79q5O8P3j29q9P5O3P9j73J22j19J11r9R7k7m0Q2j1R9k5r2n0n6J5j0P3Q0r7k5p3J9J9
$$ 179 94 162 235 106 17 92 155 234 61 183 64 175 76 173 146 106 188 177 276 251 159 109 53 68 58 131 211 114 89 16 35 54
2584E4j2J32l7l0M9q0k1P1L7l0r6M7K4l0l0Q2K9q8j1J08J8j55K27rj91J19j0j02J35r6MK2
$$ 54 42 174 137 107 156 76 55 126 163 133 37 84 108 78 48 130 159 71 60 168 186 31 258 249 58 177 167 65 200 104 108 130
2284A30o8J20M8nj91N2m4N5m9P1L0r9P4J3l8l1Rj5O4Rn7R0J7j24M6m9Q6k4n1o4L1L2O9J03
$$ 130 62 182 230 225 34 86 42 97 48 119 149 50 124 137 99 68 77 62 126 135 78 168 185 61 107 58 144 120 69 5 36 68 137 240
1964B40Nj60J20r6%J21j48JP2Q7m2j9n1N4o9J9m6K15k4j52n9J16p1N1j29J11M3j87O6j7K10
$$ 240 245 85 205 109 109 230 82 83 155 242 200 181 130 184 115 134 88 303 279 127 68 184 113 164 35 146 189 2 68 51 261
1673B61r6P7J13k87M7K04m5k37M0O0m6QJ29j74K0k6L0O9Lj7j7k4P0L6J43k15l2m7L5j9O6m7
$$ 261 165 242 355 68 115 319 274 37 77 137 91 99 228 54 74 48 78 147 150 133 116 92 162 198 341 126 94 47 82 63 129 82
1373H2J3J07j76J03K3n9J90OP6j20n5p6Q1Jo8N9Om1J1r5k2J35j7n1J6o7J44nj36J5J00L1j71
$$ 82 95 202 26 129 152 93 283 289 365 245 190 114 195 196 128 187 193 152 163 68 46 181 164 113 129 62 206 201 65 80 180 211 40
1063D0j4J34p2m2K58k6j74o4pL6m6Q3P9j65J45j37J29R3j8k8j1o8PO9K5J32j35K24R4R6M42
$$ 40 26 160 88 46 304 278 104 40 33 69 23 106 185 20 165 28 157 250 232 204 193 125 132 201 226 358 223 447 541 637 1079
772A079J357K073k642j027j87k60M3k41j9P9M4l0m7j21J32j74lN1M6o1M4Q8Q9j38J05p3R0
$$ 1079 2436 4509 1867 840 653 393 436 195 176 255 299 269 222 101 233 59 56 107 153 92 136 224 313 175 280 207 297
518B97m5p0kj12rj9M3n7J09J24Rl5j01q2Q7O4j4O3m9m0j14R6rRk6n9J24r6M4j1j1J1o6O9J16
$$ 297 252 182 180 68 59 40 83 26 135 259 268 233 132 50 137 201 187 250 201 161 47 143 134 143 117 58 182 86 130 119 108 119 53 122 238
190B38J06m0m5rj90J26p6j3J42J6n0j31P4j6K1p7Q1j20L5J11L0K2m4r3P1m8O2%l2R2OJ31j09
$$ 238 344 304 259 250 60 186 110 97 239 255 205 74 148 132 153 76 157 37 72 183 213 235 191 98 169 121 183 183 151 243 249 380 271
-120B71j85RK2l6N3J14j41M9k3k9J34n7m5N1j35K50q2j38j8pJ1J4k1J29J8j15m0L5N6
$$ 271 86 95 117 81 134 248 107 156 133 104 238 181 136 187 52 302 220 82 64 57 68 82 61 190 208 93 53 88 144
-392A44
##PAGE=	F1=-14960.5
##FIRST=	19140.455529915001534,	4405.895418600002813,	0
##DATA TABLE=	(F2++(Y..Y)), PROFILE
4406G6o3J60Oj58J01R0Plj58Q5j23L6J9nJ13n2j6o0Q2r7M7K0K6j19L6j5lk2J05p8K77J45j63
$$ 76 13 173 179 21 122 212 219 216 58 143 20 56 75 70 183 131 115 55 137 40 87 107 133 14 50 35 32 10 115 37 314 459 296
4096B96r0l5J6q6o2j2J93O7k23J19j48NO1J6O2n2m7M8Q1r3J80j47j01K4J2J11q3L5p5P8J57
$$ 296 206 171 187 101 39 27 220 287 64 183 35 40 101 117 179 127 80 128 209 116 296 149 48 72 84 195 112 147 72 150 307
3805C07r8p0R6Q6j04j15pm7R5r6J01p2J57j71J86j38p9J33n8j5k8L2qjK2j2J3j5rm0J4O1p5
$$ 307 209 139 235 321 217 102 95 48 143 47 148 76 233 62 248 110 31 164 106 91 63 95 87 86 108 96 109 94 85 45 59 120 45
3495D5K2O8N4o0p5Jk1Q9o6O7K1r2M7J6o2k6rP3J0N2l5n1J6jl6k4R0l8Po6JQ9L7Qj00K18K8
$$ 45 67 135 189 129 54 55 34 123 57 124 145 53 100 116 54 28 19 92 102 154 119 68 84 83 47 23 113 75 82 16 17 106 143 151 51 269 297
3148B97k58Q9P7j49L6k1j6L5M8K9M1p9l4o0L6L5O1l0j23J90J31j91j8O3om9M2j0m9P6O1j54
$$ 297 39 128 205 56 92 71 55 90 138 167 208 129 95 35 71 106 167 137 14 204 335 144 126 189 183 134 176 166 117 193 254 100
2847A00l9J20J2L9j40R9j21J12j06N1j6K2N9K0R8n1p9o1m0jk6L9O1m2m4l7L6j4K0J48n5n2
$$ 100 61 181 193 232 92 191 70 182 76 127 111 133 192 212 310 259 180 119 79 78 52 91 152 110 66 29 65 51 71 219 164 112
2547A12J4p5l4N0J27o1j17J00J0rk9Q4K4r8n9J13K8j33K07j0j76M8M1p3J05q8J3K3p7J23J9
$$ 112 126 51 17 67 194 133 16 116 126 117 88 172 196 98 39 152 180 47 254 244 68 116 157 84 189 101 114 137 60 183 202
2256B02K4j76M0m3N0m3Q0l8m6J11k1o0kk9nM5rK9K3K6j40Q7q6J53n0m9o8O3P6l5J33J2j49
$$ 202 226 50 90 47 97 54 134 96 50 161 140 80 78 49 44 89 80 109 132 158 18 105 19 172 122 73 5 68 144 109 242 254 105
1946A05P7q2LJ25j56%N2R3n3Ko9O8p1jk3K51p6j27o7J02l9L6r8J01J5j24L5j0K17r6M4J21
$$ 105 182 100 103 228 72 72 124 217 164 166 97 165 94 93 70 321 245 118 51 153 114 150 52 153 168 44 79 69 286 190 234 355
1645C55k19o1K61n1k48M0L8k5m5J67j48j8NK9K8M3l6o9P8K3M3J29j53k2p7K9n8P0n8N8J00
$$ 355 136 75 336 285 37 77 115 90 45 212 64 46 51 80 108 151 115 46 124 147 190 319 166 144 67 96 38 108 50 108 208
1354B08j95J18K8q8K25j1P1j34nl3l3O3m7K1N4r7J0r5k0J45mm4J8n8J04K4j62K4P4L9j66J2
$$ 208 13 131 159 71 296 285 356 222 217 184 151 214 167 188 242 145 155 60 40 185 181 137 155 97 201 225 63 87 161 200 34 46
1054D6J58j26m6K44j6j96m8KM0K4NR2j08Q1j20J44N0n1m2J9k8m3J04lJ09j55K67J00N0M35
$$ 46 204 78 32 276 260 64 16 18 58 82 87 179 71 152 32 176 226 175 133 152 124 81 185 182 291 136 403 503 553 988
772I88J207J773k343r00j38k41K6j44j44J23O5k5jj55K18j58n3M5M3n7K5J42N0k15J14o9O5
$$ 988 2195 3968 1625 725 587 346 372 228 84 207 272 247 246 91 309 151 98 143 186 129 154 296 346 131 245 176 241
518B41J1k6k3j30j2j9N8r1J25J32k4J2j03j15R1M4j3R8m2l7j36J12k4rk8j2J28j31M6j5j1
$$ 241 252 226 203 73 61 42 100 9 134 266 242 254 151 36 127 171 158 256 214 177 41 153 129 120 92 80 208 77 123 108 97
227I7l3l0N1M4J71Pk1j0j99J33j30N6J36o0q2o8Q2PJ4p1O7j11O3J07J7qn9j26J46j00P4Ql4
$$ 97 64 34 85 129 300 307 286 276 77 210 80 136 272 212 130 62 144 151 165 94 161 50 113 220 237 229 170 44 190 90 164 172 138
-83A38J00MJ37q3j48n3J8l5N4R4j41P8np5J62n1n5P7j52K01n4j43J3m7QN4o1J29Oj14L1PP9
$$ 138 238 242 379 296 148 95 113 78 132 226 85 163 158 83 245 194 139 216 64 265 211 68 81 34 42 96 35 164 170 56 87 94 173
-392A73
##PAGE=	F1=-15039.2
##FIRST=	19140.455529915001534,	4405.895418600002813,	0
##DATA TABLE=	(F2++(Y..Y)), PROFILE
4406A02o2P4K4j02J05J03oj2j26Ko6K7J2j5J10o5K8j13R1l0pQ3qj21J4Pl3N0P6j08K54J15
$$ 102 40 114 138 36 141 244 238 226 100 102 36 63 75 60 170 105 133 20 111 81 74 157 149 28 42 49 16 66 142 34 288 403
4105D03j20r3l8rn7l4j8J85M2j98J38j89L2L6N3L1m0m7J09M4j17J53j17j03J6K9J55q9%o8
$$ 403 283 190 152 143 86 52 34 219 261 63 201 12 44 80 133 164 124 77 186 230 113 266 149 46 62 91 246 157 157 89
3824H9N4J26p8j3M9N5n9j29on6Q8q4R2n9J69j34J30r9q2R4o5J2rl9%L9o9J62Jn3k0o0j0P1
$$ 89 143 269 191 178 227 282 223 94 88 32 120 36 128 69 238 104 234 135 53 147 82 94 85 46 46 85 16 178 179 126 106 46 36 107
3504A07j8L5L5L3p1l1k2k6P5l8Q2k3n7lj3j0J2l0O0J5Pj7p%%k4m0O8n9J9l3j3J09M2k2j04
$$ 107 89 124 159 192 121 90 68 42 117 79 161 138 81 78 65 55 67 37 97 112 119 102 95 95 95 71 31 99 40 59 26 13 122 164 142 38
3166C8K48K5k78J24N5j87O7o3J8L1L5L2L1q2J6k5p8J03P1j5j23R6J76j84oN0J0p4N6k7qQ9
$$ 38 286 311 33 157 212 25 92 29 47 78 113 145 176 94 110 85 7 110 181 166 43 139 315 131 125 175 185 111 167 140 132 221
2866B21M8j70%J48J0m0j01O8j14J07r6%J4N3L8N7R5r0n9n2m4k2l5J5L2J0l9J7J3k7M5J61o5
$$ 221 269 99 99 247 257 217 116 184 70 177 81 81 95 148 186 243 338 248 189 137 93 71 36 51 83 93 54 71 84 57 102 263 198
2556A98p9j7p0j4L9J55q5j20J38lmj9Q0K2p4j04R3J9r7J77Nj64k1R8m9N2o4L6K3r8J35k8N1
$$ 198 119 102 32 18 57 212 127 7 145 142 138 119 199 221 147 43 136 155 58 235 240 76 55 153 104 156 92 128 151 53 188 160 211
2246B11j43Ok6M5pO2j08N1J13n7q7J7n2J0J8kQ6m6L2o7L8o2J60p6m0p4Q6J11j28J65L3j21
$$ 211 68 74 48 93 86 148 40 91 204 147 60 77 25 35 53 51 137 91 123 56 94 32 192 116 76 2 88 199 71 236 269 148
1946A48Lm4l3J31j30J2LR1m2pn1O8o7k5J3K55j11j13m7P4j5K0p4R9j6p2NJ2K14r8L4R5j52
$$ 148 151 107 74 205 75 87 90 181 139 132 81 149 82 57 70 325 214 101 54 128 113 133 59 158 142 70 75 87 301 203 237 332 180
1636A80j30K96m8k57M6J0K6j13J76q7rK3l5%O8l6q0J22l0M8J15q3j2j10J7o9M8n9R6P3j67
$$ 180 50 346 298 41 87 97 123 10 186 99 90 113 78 78 146 110 30 152 122 170 285 202 190 80 97 28 76 17 113 186 19
1345A9J16J1p6K34l3N7j36N0%j16R9k6mQ3j46J2p8m4J69J2m6jm1P1L7j52L2L3K7j29L9J58
$$ 19 135 146 70 304 271 328 192 242 242 126 225 199 195 278 132 144 66 22 191 203 157 156 115 186 223 71 103 136 163 34 73 231
1044B31j59m6K02j5j92qJ7N5O4q8J11n2ql4Q7M7q9n9M3J0q0J21QN9j78K98J10K6M06J099J540
$$ 231 72 26 228 213 21 13 30 85 149 61 172 120 112 78 165 212 123 64 107 117 37 158 166 225 47 345 455 481 887 1986 3526
753C526k083q07j24j76k6q9j53J03O5j9K1j39K50j21q0NN2o9N1J59K6k55P4l3K1N1Rl8r2j8
$$ 3526 1443 636 512 336 310 221 68 171 236 217 238 99 349 228 148 153 205 136 187 346 372 117 191 158 179 230 239 201 109 91
471I1k7N5j12J31J16m5L9r5j29R2K4j1J21l1Jj93J39l8k9k8M0J03j58N1j1k6o7K2K1l7K15
$$ 91 64 119 7 138 254 209 248 153 24 116 140 129 250 219 220 27 166 128 99 71 111 214 56 107 96 70 3 25 46 9 224
180B24N2J4Mk03J32j70J08J08j17j02K8M4K9J3n2M3q3P5R9kk8p7j05J70j51Q4L5n4R7OJ44
$$ 224 276 290 294 91 223 53 161 269 152 50 78 122 151 164 112 155 72 147 246 244 216 139 34 204 53 137 172 118 215 221 365
-111C65o0r7r3Kk1L0O8j31P8J9j07J76l6l6Q6j28J18l6j39L7q4jJ02p6R1jp7Q1l4R6
$$ 365 305 208 115 117 96 126 194 63 141 160 53 229 193 157 243 115 233 197 58 95 11 10 112 36 127 126 49 130 96 192
-392A92
##PAGE=	F1=-15118
##FIRST=	19140.455529915001534,	4405.895418600002813,	0
##DATA TABLE=	(F2++(Y..Y)), PROFILE
4406A20n7j2L3l5J01J03k0j1r9p3M5k7oj3Q7m9O3j39R3J3m5J22rj26j4j1J0P7O1j38J91Q8
$$ 120 63 51 84 49 150 253 233 222 123 50 95 68 62 49 136 87 150 11 104 117 72 194 185 59 45 34 44 121 182 44 235 323
4105C23p3q3m8j4l7Mj6J64Rj55J52k10N6j8Q9K5l1l9J28J4j34J22q2r1oM9J69r2k6n2L5Q3
$$ 323 250 167 119 105 68 72 56 220 229 74 226 16 72 54 143 168 137 98 226 240 106 228 146 55 49 98 267 175 149 97 132 215
3805B15m9M0J4J3k0j56K3n9P4o2Q7p0J80o9P1p4p6O3n0K2J2j02j9R3j4J73j7q4l5p9k8R8L3
$$ 215 166 206 220 233 213 57 80 21 95 33 120 50 230 161 232 158 82 145 95 117 129 27 8 101 87 260 243 159 124 45 17 115 148
3495A48K5mJ6p2%k0l8N6MP5o1k7m0n6L2P9n7L8Mk5KM9k7K3j8m6K3m8K0J0l2J03N7m5p0K11
$$ 148 173 169 185 113 113 93 55 111 115 190 129 102 62 6 38 117 60 98 102 77 79 128 101 124 106 60 83 35 55 65 33 136 193 148 78 289
3157B89J6k78J59L0j93Q7o1N2Rj6N4L8j05M5J4q1M1Q5Qr7LJ69j34k9M0J5o9P4n4K9R8L2j65
$$ 289 305 27 186 216 23 110 49 101 110 94 148 186 81 126 140 59 100 185 193 96 99 268 134 105 145 160 91 165 111 140 238 270 105
2847A05K1J51L0j20o3L7j05J11p1l3K9O1J9R2R5j36m3k4o8l6m0L3RJ1j0N1j8k0N8J74o6j01
$$ 105 126 277 307 187 124 161 56 167 96 63 92 153 172 264 359 223 180 156 88 52 12 45 54 65 55 106 88 68 126 300 234 133
2547A33m3o4K2N3J08r8r3J49j8j1jO5K2l7j19N2ko0J47K9j47m6J06k2rl1N3L3j26J51o8N4
$$ 133 90 26 48 101 209 111 18 167 149 138 137 202 224 187 68 120 118 58 205 234 87 41 147 125 116 85 138 171 45 196 128 182
2246A82j05k8%L6K9L9j33J14J04p4j11K0o6J7L0J8Q2p8L1k0qk6J39r2k5o3P7J37j94J86O9
$$ 182 77 49 49 85 114 153 20 134 238 164 53 73 7 24 54 72 154 76 107 87 79 53 192 100 75 12 89 226 32 218 287
1955B87r1q2Qq6J33p2K6n7P4om7j4O4n6m7M0K34j14j21oM3KJo0R7l5m4j4M7J98j06N1L9r9
$$ 287 196 114 122 36 169 97 123 66 140 134 87 73 137 81 34 74 308 194 73 67 110 112 113 53 150 115 71 57 104 302 196 247 286 187
1636A87j53L15l4k63K2mP7j06J17k0j0K3p9LO2k4j5P5p0L8J05k7jj35Km4lj5Q8K9q7R0k5k0
$$ 187 34 349 315 52 74 70 147 41 158 138 128 151 72 75 137 113 98 173 103 141 246 219 218 83 85 41 38 23 111 140 53 143 118 98
1317I8K06n8L5j26J03J6j62J17qk3R4j78K3o1o7J79L8o2l0k8N9L4j29L9JLq3P3J31j70m1J47
$$ 98 304 246 281 155 258 274 112 229 221 198 292 114 137 76 9 188 226 164 134 106 165 199 70 109 110 113 30 103 234 64 23 170
1016A70j2j21l6N7O8P4j61J48l4r1O1J1O3j24l8L5L4l2L6L8K1j14K11J20J5L62R71J291j777
$$ 170 158 37 1 58 126 200 39 187 153 62 123 134 197 73 35 70 104 72 108 146 167 53 264 384 399 761 1732 3023 1246
744A246p07j32r3n3q8p9N6O1k4K6r7K33p6p6m8N8r2P2J59K7k37j9J8k0P7L1l4l9k1m6N7j16
$$ 1246 539 407 314 261 173 94 150 211 187 213 116 349 273 197 149 207 115 187 346 373 136 117 135 115 192 223 189 150 129 83 140 24
443B4J15Q2n0M9q2j06O9RMJ32l4N6k33J39l2n8j5P0N7j58M3Qn4L0j5k9Q2K6R8N5K3j92J09
$$ 24 139 221 171 220 138 32 101 110 114 246 212 268 35 174 142 84 69 139 196 38 81 89 35 65 50 21 103 129 227 282 305 113 222
133B22j68J17O4j51j4N0l3M4J9k5J4m7P6R1k7m3r0k3J29j80J05N8r2Q8RJ44m1n7j07ollM5
$$ 222 54 171 235 84 70 120 87 131 150 125 139 92 168 259 232 189 99 76 205 25 130 188 96 184 193 337 296 239 132 126 123 120 165
-176A65j20N2L7j10J68j5J8Q3j17N0k9j29M5p7J9Q5o6K8omR2p4J02
$$ 165 45 97 134 24 192 177 195 278 161 211 182 53 98 21 40 125 59 87 81 77 169 95 197
-392A97
##PAGE=	F1=-15196.7
##FIRST=	19140.455529915001534,	4405.895418600002813,	0
##DATA TABLE=	(F2++(Y..Y)), PROFILE
4406A25m9m9JL5Q6R3l3rq0j18J43p8k2J3K8j0P9j36R5K9n8J38oj25n1l1P1P6N5j43J03P0k7
$$ 125 76 27 28 63 149 242 209 200 120 2 145 67 45 58 86 76 155 19 114 143 85 223 217 92 41 10 81 157 212 69 172 242 215
4096B15n9p7nk2L1kJ48m1r9J58k19Q4q1J14L7j8l1J22j3j47R0n8p7j4P8J40r0m0l2L9L0k6
$$ 215 156 79 74 52 83 81 229 188 89 247 28 112 31 145 182 164 133 255 242 95 185 127 50 36 114 254 164 124 92 131 161 135
3796A35Q3nl1Jj67P4l3N6p1P7q3J74kM0p5n7K2l4M8L1r8l0P0N5J42l8j03m6p4n1J39N8jm5
$$ 135 218 213 182 183 16 90 57 113 42 119 36 210 208 248 173 116 138 104 152 183 85 55 125 180 322 284 181 135 61 10 149 207 206 161
3476A61Rn8Rj0l3K6M1N6q1j0o1O%J06r1K4j5m4L4Q5n2N3j4m1l3kK1Qn2R9O8n1l0J50kk45J79
$$ 161 170 112 121 111 78 104 145 201 120 110 49 55 55 161 70 94 79 35 69 154 102 155 141 100 67 65 86 94 42 141 209 158 128 278 276 31 210
3129B10Mj60P9j8O2l3o4P8O3j27M9N0p7m3J03L9p3rP0o2p1L6J1m4R1p5N5R9J0j37J9J33N8
$$ 210 214 54 133 115 177 144 80 158 221 94 143 193 116 73 176 215 142 133 203 141 70 106 117 73 164 89 144 243 253 116 135 268 326
2819C26j82l1J4r8J25l8l3OO1jJ21R7j76l6K0j10j8l3O3L6o9J3P2n3MO2J85o0j18o4n7M4P2
$$ 326 144 113 127 29 154 116 83 89 150 149 270 367 191 155 175 65 47 14 77 113 44 57 129 76 80 142 327 267 149 85 28 72 144
2509A44M2r4o6J52l4k3J6M5J7Mj09J4l1k7J16N4j17j8N1Om9qN6N9j57J56p3K2p6l4J1K1N9
$$ 144 186 92 26 178 144 121 137 182 199 203 94 108 77 50 166 220 103 85 136 142 93 85 141 200 43 199 126 148 72 38 49 70 129
2199A29J8q0J02Q3o7j14J4n4lN5J1O9p3L0k0l4j2J21r1j4n1N8J50j87J48J11o0j64N6o6P2
$$ 129 147 67 169 252 185 71 85 31 28 83 94 163 90 120 100 66 54 175 84 70 19 77 227 40 188 299 239 75 131 65 137
1908A37j1K7r4L9M3r6K3O1m9n4M4K01q1j49L8J5J2j6n0Q9l9m2j3Q1J70j17Q3k8o7j45L34j9
$$ 137 126 153 59 98 141 45 68 129 80 26 70 271 190 41 79 94 106 90 40 129 90 48 35 116 286 169 252 224 157 12 346 327
1608C27k53l6nJ13r0P9L5k5J6r9K7L8j3L5L5q1OJ05%J2j44j3%k6J2M8k8J2O6p2N6J57q1Lj08
$$ 327 74 38 33 146 56 135 170 145 161 62 89 127 114 149 184 103 109 214 214 226 82 69 69 43 55 103 75 87 153 81 137 294 213 216 108
1279A08J51J4j80J30Rm2R3j90M0n0n2J38O6q1n7k6P2J6j02M0j2k4m1J07Q5j60l0R6Om5n5N9
$$ 108 259 273 93 223 232 190 283 93 133 83 31 169 235 154 97 71 143 159 57 97 85 61 20 127 212 52 22 118 124 79 24 83
979H3P3O8j71J79o1j38J29o8Q1j33M0k3K8M7o7N3J5kM3J39J2L31Q79J107j541o29j64m0l0
$$ 83 156 224 53 232 171 33 162 94 175 42 82 59 87 134 67 120 135 133 176 315 327 658 1537 2644 1103 474 310 270 240
706B40j37JL4O9k9J9o6J86l2m1q4M8j29R0J42N0j74j37N1m2R1L9qmk1o7P5j22R3L9m4M8o4
$$ 240 103 104 138 207 178 197 131 317 285 244 160 208 79 169 311 361 187 50 101 59 150 189 181 177 156 89 164 42 135 174 130 178 114
396A14m7K5%K7J42o0R7k30J06mr2J3O7Mj15jM5o1R4l3p2J67j51J46R2L9j57N4j33R7J0j62
$$ 114 67 92 92 119 261 201 298 68 174 170 78 91 158 162 47 46 91 30 124 91 19 186 35 181 273 312 155 209 76 173 183 21
96B1J17K9j14M3K8Mj5rO8Q1m8n6r1N0Q4j66J32N8j37P5QJ36k7l6j03%J0k5L2j14J0M1o7J21
$$ 21 138 167 53 96 124 128 113 104 172 253 205 149 58 108 192 26 158 216 79 154 162 298 271 235 132 132 142 117 149 35 45 86 19 140
-223A40OR4P8j25lk4j17L9m1M1M3n4j7j7O1R0j03R8
$$ 140 146 240 318 193 190 166 49 88 47 88 131 77 60 43 104 194 91 189
-392A89
##PAGE=	F1=-15275.5
##FIRST=	19140.455529915001534,	4405.895418600002813,	0
##DATA TABLE=	(F2++(Y..Y)), PROFILE
4406A16l8km1M3O1P5m3j0p3n3J35j19NL4n5L3P2j19J10K9n6J45j6j12q9J5O0N6M9j20K7O2
$$ 116 78 76 35 78 139 214 171 161 88 35 170 51 56 90 35 68 140 21 131 160 104 249 233 121 32 47 107 163 212 92 119 181
4105A81J7k4j30KJ2L3J0J39j04k8J47k18J16j27J12N2KqR6m5j60O8m9o9jJ16P1p7m8pO0pl3
$$ 181 198 174 44 46 58 91 101 240 136 108 255 37 153 26 138 190 192 184 280 235 75 143 94 25 24 140 211 134 86 79 139 132 99
3796I9J12qo7%o7M6j0N6j03N6o6J34N5L7r7k9l3k2R2N1r3m4M3J01J09n7j13m4m9p2J74O7l8
$$ 99 211 203 136 136 69 115 105 161 58 114 48 182 237 274 177 148 115 93 185 236 143 99 142 243 352 295 182 138 89 17 191 258 220
3486B20q3J9l4oLrj3O3K4o8j6m6N7%Q4j32K4l5l4O3R0o9P6ql0q4L7K9j6p2J02O7m5QQ8k6j75
$$ 220 137 156 122 116 119 110 97 160 184 116 100 54 111 111 195 63 87 52 18 81 171 102 178 170 140 56 93 122 106 34 136 203 158 166 254 228 53
3138E3J69k0j19O6L3O3q8r2Q6Q9j32M9Q1q7j17J22P6o4K0o2J2j09L7%qJ04p6N9R4j9q8rJ01
$$ 53 222 202 83 149 182 245 157 65 151 240 108 157 238 151 34 156 232 168 188 126 138 29 66 66 58 162 86 145 239 220 132 123 224
2828B24Q8k15rNq3J26lk8k7O6k5J37R6j92l9P1j42L0m9P9O9j23lQ8q9M1N9J87m7j32q1m7N8
$$ 224 312 97 88 93 10 136 133 105 78 144 119 256 352 160 121 192 50 80 31 110 179 56 53 141 52 93 152 339 292 160 79 32 90
2519I0Q1k2o2o0J51n3l3K8K3RL9p1j6n9oQ1P2p2NkK7n0j3M9R8j72J31n5k0o9%nMQ1Nl1R4M5
$$ 90 171 149 87 27 178 125 92 120 143 152 191 120 104 45 39 120 192 120 125 123 150 100 87 136 234 62 193 138 118 49 49 44 48 129 134 103 197 242
2162B42m4r5J8o7j1O0pP3o7L7l4m8k3J19o8k3m5M2J53j25P3J36l0k31Q8QPJ1J3j06LQ6j21
$$ 242 198 103 121 54 43 103 96 169 102 139 105 57 34 153 85 62 17 59 212 87 160 296 266 35 123 131 138 149 162 56 59 145 24
1852B4L9O2n1m7K8J66j9j66M7oJ1k8l0O9l1m0K1P3J35j29J22q8o5p3L09rk24q2J0R3p2P7O1
$$ 24 63 125 74 27 55 221 202 36 83 77 88 60 30 99 68 28 49 122 257 128 250 162 97 24 333 324 100 18 28 121 49 126 187
1542A87m5Rj01M9J5qP4No6l5J12kK4j37k3M6j3j0J3q9J11M4j16J25J03r9k8p4J71Kj73J38
$$ 187 142 151 50 99 114 106 180 185 119 84 196 194 218 81 58 104 91 81 94 5 116 160 44 169 272 173 145 71 242 244 71 209
1241B09K7o4Q5j89N7l9l9R3Q1q9p5l5J04oq4K9pj4j8J11L3j38j0P1L4j9m8M0O2N4j25J97j01
$$ 209 236 172 257 68 125 86 47 140 221 132 57 22 126 120 36 65 58 44 26 137 170 32 22 93 127 108 60 100 162 216 91 288 187
932A87j35J37j26P9q7P0o6J1J15p9LK5N3q4J69OL19Q33J012j411n75j78o7J4j73M1K3R0j0
$$ 187 52 189 63 142 55 125 59 70 185 106 109 134 187 103 272 278 597 1430 2442 1031 456 278 211 225 52 93 116 206 196
659A96Ro8J27J0Qo9K0j42J03J10M9j09j47l0k4P1L8L7qj8q2J06j32P0nl0M0m4L1oKJ9J61r8
$$ 196 205 137 264 274 282 213 233 91 194 304 353 244 97 67 43 114 152 189 181 163 81 187 55 125 120 90 130 86 117 111 113 132 293 195
340A95J06j99O3L3j17M1M4m3n1o1R0k9J03l6j32K23j81J09J09N5j07j5j02P3l7r0J36K5j60
$$ 195 301 102 165 198 81 122 166 123 72 11 101 72 175 139 7 230 49 158 267 322 215 200 98 171 134 44 180 205 45
68D5J2L6K9m1K8N0O8n5o7o8Q3M5j29J64M9j81O1KJ15j0l6r3K1J7j9J7j10Qj8ON4K5J62P8j41
$$ 45 57 93 122 81 109 159 227 172 105 37 120 165 36 200 249 68 129 131 246 236 200 107 128 145 126 143 33 41 23 29 83 108 270 348 207
-261B07m7j6j08L2KO8j2m0l1k2Q2Q4j11Q5
$$ 207 160 144 36 68 70 138 126 86 55 33 115 199 88 173
-392A73
##PAGE=	F1=-15354.3
##FIRST=	19140.455529915001534,	4405.895418600002813,	0
##DATA TABLE=	(F2++(Y..Y)), PROFILE
4406I4k5N1m4J3L4M9m6k2o4J2J07j38O5M0n6j4N0p5J15K6n5J52m0q5j18O3K9K1L9p7NM5M5
$$ 94 69 120 76 89 123 172 126 104 40 52 159 21 86 126 70 56 106 31 146 172 117 269 229 144 26 89 118 139 178 101 106 151 196
4096A96J4j75qO8QPJ31j60M9J19k07J47j48Q1O2K7L3O0q4j69O8n3m6JJ51j9m6o9K5Q2j0p5
$$ 196 210 35 27 95 103 110 241 81 130 249 42 189 41 122 184 211 244 304 220 51 119 66 20 21 172 153 107 38 63 145 135 60
3796F0J21Kq6j6M8J1J2M7j31L5l5P9R8N5j33Or3j5J37P5q7n9RJ21Q1o3j15k4k6q7J93P2p0
$$ 60 181 183 97 81 129 140 152 199 68 103 68 147 245 300 167 173 80 65 202 277 190 131 140 261 342 279 164 140 114 27 220 292 222
3486B22j21M7j0l7J7K7n4O3j2k6l9QO9J4N2j72L4n1%O3R0p2Q1qj1j19N5L4m7q9J14N3l2L9
$$ 222 101 148 138 101 118 145 91 154 142 116 77 85 154 168 220 48 82 31 31 94 184 112 193 185 174 55 110 144 97 8 122 175 143 182
3166A82L7n0q8J40m1q1M9Q9N1j43q5N8J07j17N4J04j06j24J00J18q3N3j74O9q5Lj6L0J07o1
$$ 182 219 169 81 221 180 99 148 237 288 145 60 118 225 108 162 266 160 36 136 254 171 224 50 119 34 37 21 51 158 97
2885I7M6R0n4k8n9O5J16k01j9K4k0N6K4k7m9P5m5J29Q7j74l5J09j22M3r1R8R4j53k7R3j03
$$ 97 143 233 179 151 92 157 273 72 53 77 57 113 137 110 61 136 91 220 307 133 98 207 85 128 37 135 229 76 49 142 39
2594C9O6N1J78k9j43r0l6O5P8p5Mq6J42o6l9K9OKO5j6m1o2j5N0P0j7K0m0L6k9k8L9J40j70
$$ 39 105 156 334 305 162 72 36 101 179 104 108 22 164 98 59 88 94 96 161 145 104 42 27 77 147 130 150 110 146 117 89 128 268 98
2274I8Q4m2m1p9L4j1j4R3kJJ00nk2o1K6r3j2M9k2J01q4M8l6n6l8J26l1n7m4L7J45n8J7J28
$$ 98 182 140 99 20 54 43 29 122 120 121 221 216 194 133 159 66 54 103 81 182 98 146 110 54 16 142 111 54 10 47 192 134 151 279
1955B79rk61R1R1k3rj6j00j2J07j10L2P2o9l4OJ42M5j50Lj9kl0RL3j2K0J7K8J02j38J64j05
$$ 279 270 9 100 191 168 159 143 43 31 138 28 60 132 63 29 35 177 222 72 75 56 54 24 33 66 54 74 91 119 221 83 247 142
1645A42j16M0K43pj85n4J1K2p1J08N5o1Or5O2JrJ02j6m3n6J16k3L1j22k6Q1ll4j1j8P1K0j48
$$ 142 26 66 309 302 117 63 74 96 25 133 188 127 133 38 100 101 92 194 178 135 79 195 172 203 81 55 136 133 99 88 70 141 161 13
1326A3J75N3j09l0rJ17rj33J20N0q0P2j89Q2k9m0N3P7p3q3RQ0j6q9J6kN4k2P3j5j01RO5N1
$$ 13 188 241 132 102 93 210 201 68 188 238 158 230 41 123 94 54 107 184 111 28 37 117 101 12 28 26 80 58 131 116 15 24 89 140
1007A40k3k3J7L0L8n1K05j13j41J19j35L9k4P2j04J6J56l8n3K5O2j46J90nK99P89R35j316
$$ 140 117 94 111 141 179 128 333 220 79 198 63 102 78 150 46 62 218 180 127 152 214 68 258 253 552 1341 2276 960
744I60n11j33j47J9j16lLJ11L3J0r3P7M1N3j4j0j16J14R5j4q0j04j19K5PM4Q3n4j3q0J37j43
$$ 960 449 316 169 188 72 69 72 183 216 226 133 210 251 304 290 280 164 278 373 359 279 175 56 81 88 132 215 161 148 68 205 62
443F2M8m2j0K2j7J10pLk6J77j22P5j48K8O1j29O9J4o8mn6P9jJ03l6j42J94j23N2R6P3n3o7
$$ 62 110 68 58 80 63 173 166 169 143 320 198 273 125 153 214 85 154 168 100 96 40 119 118 221 185 43 237 114 166 262 335 282 215
133B15r8N2n9k7J04M0j59l6L1M7n8N4K6N4m3p0k4O4J7q2J83M6k14M8j0Q6Qm5r1N2L3Nj1r8
$$ 215 117 169 110 83 187 227 68 32 63 110 52 106 132 186 143 73 49 113 130 48 231 277 63 111 101 187 195 150 59 111 144 149 138 40
-186D0M4l8j3J6K9J99P7j49q7Jj08L6L8J01p7j8l7kN0P7r8P5
$$ 40 84 46 33 49 78 277 354 205 118 119 11 47 85 186 109 91 54 52 102 179 81 156
-392A56
##PAGE=	F1=-15433
##FIRST=	19140.455529915001534,	4405.895418600002813,	0
##DATA TABLE=	(F2++(Y..Y)), PROFILE
4406G4k0R5m8pPJ7m0m2K1%N3q9R1M1k0r6L9k3J04K2n9J52o7n0j26R0pj9K3k2L1J5N4M6j89
$$ 74 54 149 101 94 101 118 78 36 57 57 110 21 112 153 133 37 76 53 157 179 120 272 205 155 29 119 112 93 116 94 125 140 194 240 51
4077E1KQ7j7j6J16j56Q4P4j82J72j60M5O0N4Q5K6j27j58R0n2j2m3J80j09J6q4K6Q7J1j13R3
$$ 51 53 140 123 107 223 67 151 225 43 215 55 100 160 214 299 325 198 40 130 78 66 23 203 94 110 26 52 139 150 37 130
3786A30J9q9k8J40j8L9J7j46K9j2K7J26Q8j75L9j38j7J69J02q0p8l0J17O6n4j12J1j1q6J79
$$ 130 149 60 32 172 154 193 210 64 93 81 108 234 322 147 186 48 31 200 302 222 144 114 231 297 243 131 142 131 45 224
3504B24P5p6j56P8Jo6L9N7q8M3m7L3o7P2O3K7K7j82K1n4MO1J10n6O0k0J2j35N3L1p4l2O4K8
$$ 224 299 223 67 145 146 80 119 176 88 131 84 117 50 122 185 212 239 57 78 24 28 89 199 143 203 183 195 60 113 144 70 38 102 130
3185A30j8N9Oo6qJ05n1n7K9J42K4j86k9j6J11q0O4J14j31m9M8J50j32O8j92N9j7k1m0L3J02
$$ 130 112 171 177 111 103 208 157 100 129 271 295 109 80 64 175 95 159 273 142 93 141 291 159 227 35 94 77 56 16 49 151
2894A51m2K9R4r0L0j08L1J32j31p3O4J5j0L9l5n4Q3l9P3P5j22JJ04p3L0j43J22J03j73l2Q2
$$ 151 109 138 232 142 172 64 95 227 96 23 87 102 92 131 96 42 125 86 159 234 112 113 217 144 174 31 153 256 83 51 133
2603A33p0N4L6J57nj48r0k2O4N9j06Q1j27J24p1l5K0%JO5M0n8m5m1M4L0L8L2o2L4jl6K5J77
$$ 133 63 117 153 310 305 157 67 45 109 168 62 143 16 140 69 34 54 54 55 120 160 102 57 16 60 90 128 160 98 132 131 95 120 297
2284B97j58L1n1l4l8qM2k7O0nJ0J20m7k0j8L0j20nK7k0J34j11N2k3o5qJ02jr6k7K7J21Kj4
$$ 297 139 170 119 85 47 39 81 54 114 109 119 239 192 172 154 184 64 59 86 66 200 89 141 118 53 45 147 146 50 23 50 171 173 159
1964A59R0kk15M1J57l1n2n0q3LJ07r6M1P5r0k6j3J41Q5j31n1k1k5MK5mK8O7jk2P9j46K06o4
$$ 159 249 247 32 73 230 199 147 97 14 17 124 28 69 144 54 28 15 156 241 110 59 38 13 17 42 38 66 133 132 110 189 43 249 185
1645A85j24M2J69j1j39k8K1j5p5J24K3o6Qq6O6lj4J23l1k7m6J06m3K7j12j3R6Kn0k2M8L4j0
$$ 185 61 103 272 261 122 94 115 100 25 149 172 106 114 28 94 91 77 200 169 142 96 202 159 186 74 61 157 159 109 87 135 169 159
1335A59j48J82J4j12K7K3K2Kp8P3Q0p6N3j98J21l4m4J7N7l2o1L3M0j0r9L6k6J04k5J3m6l2
$$ 159 11 193 207 95 122 145 167 169 91 164 244 168 221 23 144 110 66 83 140 108 47 80 120 110 11 47 21 125 100 113 67 35
1035C5oN5N5l1J2jk3K4L4J99q5j61Q1j01k2K1O9j34N3J60J1q4J2M9j50J85%K44P30Q28j213
$$ 35 29 84 139 108 120 119 96 120 154 353 268 107 188 87 65 86 155 21 74 234 245 161 173 222 72 257 257 501 1231 2059 846
744H46m22n4j85n6k9n0k5J15Q2J9j15M3O1P2N8l1r1J33J09r6j06m6j58N0n7O6J13j19j0m5
$$ 846 424 370 185 129 100 50 25 140 222 241 126 169 230 302 360 329 238 371 480 384 278 232 74 124 67 133 246 127 117 72
462G2J38j49L0o7K5j3J3J78QJp9J72j26J6q3QO9j29J00j2o6Nl2O2J4J04m1j07J11o5L6O0R4
$$ 72 210 61 91 24 49 36 49 227 235 236 157 329 203 219 136 144 213 84 184 172 106 111 79 141 155 259 218 111 222 157 193 253 347
152C47mr0j18L4n3j4N8O9j36n5MN2m5M9MM2j5n6lK1Kk0J76M1k27L5k2N0K6l3q7N5P9K2o0p4
$$ 347 343 253 135 169 116 102 160 229 93 38 42 94 49 98 102 144 129 73 70 91 93 73 249 290 63 98 76 126 152 119 32 87 166 188 128 54
-186E4O8j1p6L5QJ82P3j36j19J9p0J8M6J37j39J9p0M3j5O9o6P5
$$ 54 122 111 35 70 78 260 333 197 78 97 27 45 91 228 89 108 38 81 66 135 69 144
-392A44
##PAGE=	F1=-15511.8
##FIRST=	19140.455529915001534,	4405.895418600002813,	0
##DATA TABLE=	(F2++(Y..Y)), PROFILE
4406G3l3J18n4j5j8j3k0lQ7m8m1L5N5L8K0j60P8k1Q5J4o4J32q1rj14R4l8l9qK6P2qL6P8j84
$$ 73 40 158 104 89 71 58 38 35 122 74 33 68 123 161 181 21 99 78 163 177 113 245 164 155 41 135 97 58 50 76 148 140 176 254 70
4077G0K0Q6l2n3R7o8M9J6j46J82j60J5M4Q0J34Jj65j09J04n1nq8K04j67P9n5l7P7L6r2LL0
$$ 70 90 176 144 91 188 120 169 185 39 221 61 76 120 200 334 335 170 61 165 114 109 21 225 58 137 82 45 122 158 66 69 99
3777I9p5j0J80m2P1k8j54O0j7j0J34J30k19O9j41k1J54J26o7j02p0R4P1l0j09N6op1J28Q1
$$ 99 24 14 194 152 223 195 41 101 84 74 208 338 119 188 47 26 180 306 239 137 67 161 232 202 93 149 143 72 200 281
3495B81m5j68P1lp5P1O6j10J3p2Q3o9J07N3K9J9j60j4l6lK6J56l0K1m6L2j36M7J3o4L6qo%
$$ 281 236 68 139 136 61 132 198 88 101 29 112 43 150 203 232 251 91 77 41 38 64 220 190 211 165 197 61 108 121 57 93 85 79 79
3176G9N6nn1L2Q3m6o1J0J85j7k06N8j04Q9k3P2J08j53M4L0J62j83L8j14qL8j3o1J0R0k5J7
$$ 79 135 130 79 111 194 148 87 97 282 265 59 117 13 102 79 151 259 106 150 180 342 159 197 83 75 113 100 39 49 139 114 131
2875A31J06j13O7r5LJ03o2j07P2L4m9M1n7m9Q5Pl8O9l9M2O7k0J0j90J52R3j89j0N2k1L4J7
$$ 131 237 124 191 96 99 202 140 33 105 139 90 131 74 25 110 117 79 148 109 151 218 198 208 18 170 263 74 64 116 95 129 146
2575A46J23K6j44q1j0N9K4r1J24j55Q7o1j0J0kK5JQ5o2k5m1N5n5Q6M3p2K7M2l5lJ96j38j8
$$ 146 269 295 151 70 60 119 143 52 176 21 108 47 37 47 45 70 71 156 94 69 28 83 28 114 157 85 112 154 119 116 312 174 156
2265A56q0pK7o8J21n2J2j4MJ46o6m1K3K5j34J3Q%J44j26L6op0K5Q4K3j32mJ0R2M7l0M2mj55
$$ 156 76 69 96 28 149 97 109 95 99 245 179 138 161 186 52 65 73 73 217 91 127 121 51 76 160 183 51 47 57 149 196 166 208 204 49
1936D9K6J65k9r6o7j8k2R9p3O0O1j01k5k8J60R3j12q9jLKj0j9P6P9k3o1O8j52K37pj20KJ02
$$ 49 75 240 211 115 48 30 8 107 34 94 155 54 29 1 161 254 142 53 52 55 57 47 28 104 183 160 99 167 15 252 245 125 127 229
1617B29j8r7j7M7j5n7R3j9o2J4o9N8jk0J39m1k8j6Q8n4J3j09J0Q9Om9k6R7J7m9j29J68j8j10
$$ 229 211 114 97 144 129 72 165 146 84 98 29 87 86 66 205 164 136 120 208 154 167 58 68 157 163 114 88 185 202 153 24 192 174 64
1298F4R5K7o4L8m9L4J10n3K9j94J52n4l2k8L6J6l9J6K9or7O0l2J06k0m5l9Pl1L6N3l8M7mr1
$$ 64 159 186 122 160 111 145 255 202 231 37 189 135 103 75 111 127 88 104 133 127 30 90 58 164 144 99 60 67 36 72 125 87 134 130 39
969C9J9J10J75l1j72K5n7o1K8O5r0N5J33N1r3j2L9j41J70L9J50O73P05j123l25L0j68j50K4
$$ 39 58 168 343 312 140 165 108 47 75 140 50 105 238 289 196 184 223 82 252 291 441 1114 1819 696 371 401 233 83 107
697A07n6K5K8J05L0j13J4P4O1J23l5p3J56J33j40j89J2j66O7j21J00J29j82NNJ01j43J3n7
$$ 107 51 76 104 209 239 126 140 214 275 398 363 290 446 579 439 250 262 96 163 42 142 271 89 94 99 200 57 70 13
425A3M9j7oK31K6jj14J37j18n2qNM9j12J29l1n8lpN3J2J06n1m3K1l4M1J9J12L5q8j43J3l6
$$ 13 62 45 39 270 296 295 181 318 200 148 140 145 194 82 211 180 122 119 112 165 177 283 232 189 210 176 217 236 348 383 295 152 165 129
105A29k4NJ01j02o4qL8mJ6oL6J4m0jk9jM5J57K7k20J7l0K3L1K6l7k6J46J5j15m9P8J5j21O0
$$ 129 105 110 211 109 45 37 75 71 87 81 117 131 91 90 61 60 105 262 289 69 86 56 79 110 136 99 73 219 234 119 70 148 163 42 102
-223A02KJ23O3r5j26K1j6lJ5J72j73N9j31J08r1N0l0Q1
$$ 102 104 227 290 195 69 90 74 71 86 258 85 144 13 121 30 80 50 131
-392A31
##PAGE=	F1=-15590.5
##FIRST=	19140.455529915001534,	4405.895418600002813,	0
##DATA TABLE=	(F2++(Y..Y)), PROFILE
4406H9m2R7n6j2l9k2J9O7P3o5m7M8NL2N4j63J20n9O6ko2Q6p2L2q5P6n0qj4rJ11j3j0J05j66
$$ 89 47 144 88 76 37 15 34 101 174 109 62 110 115 147 201 38 158 99 165 163 101 187 115 147 62 138 88 80 66 57 168 155 145 250 84
4077H4K8Q1l7r2Q2L3jm8r7J72j51MJ0J10J65j1j93m8J08m9j2j20K18j72J02k7j03O9M7l8p3
$$ 84 112 193 156 64 146 179 178 130 33 205 54 58 68 178 343 332 139 91 199 150 138 18 236 64 166 139 36 105 152 114 41
3786D1PKk1J62n5J05p2j67J23m5j0J03J75k51Q6j19j1R8J42n1j27j00P0J03j9j07R8Mo1N6
$$ 41 48 50 29 191 136 241 169 2 125 80 70 173 348 97 183 64 53 151 293 242 115 15 85 188 169 62 160 164 103 159
3504A59R3J2j57J5j5n2J01N2j21rl9O0l9R9N3J5K5j33l1j4J2n9K16%k2q7M4j25M7k0K6M6p7
$$ 159 252 264 107 122 107 55 156 208 87 78 39 99 60 159 212 227 252 119 88 74 86 27 243 243 221 134 178 53 100 80 106 152 75
3195G5m2M0PKOJ3Q8l0r6OK05o7j95J37r4k9M5P2Q9j57J19M3J58k00n2l1m6P3%q6j2P9j0J5
$$ 75 33 73 80 82 88 101 189 159 63 69 274 207 12 149 55 26 71 143 232 75 194 237 395 195 143 112 66 139 139 53 41 120 110 125
2875A25J20j16P4m2rN5k8j21O1M3n6N0q7o2Q5O7j39Q5K7N0K2L0j0k04J67O9j96K5RK4K3jP3
$$ 125 245 129 203 161 152 207 179 58 119 162 106 156 69 7 92 159 20 105 132 182 204 234 224 20 187 256 60 85 94 118 141 140 213
2565B13O6j32o4jN3k4k8J16j67M2l6K2QlN3j04J20n6lj5N2p0N6M8p7K4J08l6n3J95j11o3j09
$$ 213 279 147 83 82 135 111 83 199 32 74 38 60 68 65 118 14 134 78 75 60 112 42 98 146 69 93 201 165 112 307 196 133 24
2256B4L3Q1o4J51r0l3k6oJ65o6o5M8J4j18K6K4JJ27j19KPp0N1P7M1j60J3qO4P8m5mJj01N9
$$ 24 57 138 74 225 135 102 76 70 235 169 104 152 166 48 74 98 99 226 107 109 116 46 97 174 215 55 68 60 124 202 157 153 154 53 112
1927A12J05j7j29nJ6p0P9l1O6L1r3l3k4J63Q8r5r1J6J9j6m2qJ11O3m7p2N7j34K23M6j18l6
$$ 112 217 200 71 66 82 12 91 60 126 157 64 31 7 170 258 163 72 88 107 91 49 41 152 215 168 96 153 19 242 288 170 134
1626A34O0k6o0l7Q6Jl3M7n5n3K1m3M0Kk6J52m6m4K1O4o0oj05M1N8J3l2k7J29J8r4j02J53n1
$$ 134 194 168 108 71 157 158 125 172 117 64 85 42 82 84 58 210 164 120 141 205 145 139 34 75 133 146 114 87 216 234 140 38 191 140
1307A40r7J36K4j18P5m8K1J33k6Nj83J75p3mp2K5L9k2k4M6j4r2P2k7J02rp6j4Mn7K7N0n0P4
$$ 140 43 179 203 85 160 112 133 266 240 245 62 237 164 160 88 113 152 130 106 152 138 46 118 91 193 184 108 94 98 41 68 118 68 142
988A42Jj13K7J15J31K8j55l3k8o4mO1pM6Q5P6q7m2M1j34J49R7M2O24N90j048k47R6j29j60
$$ 142 143 30 57 172 303 331 176 143 115 51 47 108 101 147 232 308 221 179 220 86 235 332 374 998 1588 540 293 389 260 100
706A00J0m0P0k6P2L2q2k8Q5L9J65j6p0J89J53j27k88L4j54Q0j87J35J36k22M0L6M0j17j4j
$$ 100 110 70 140 114 186 218 136 108 193 232 397 381 311 500 653 526 238 272 118 198 11 146 282 60 100 136 176 59 45 44
425D4L1J4n9K64M0oj18Q8j00j27P4J4Lp4J44l9o2rJ8M9oJ04o7L9l6n5N5j9J26O2p0j61pj9
$$ 44 75 89 30 294 334 328 210 298 198 71 145 159 162 88 232 193 131 122 140 189 183 287 220 259 223 168 223 204 330 392 322 161 154 135
105A35l6l8J20o5p4NKM6k3PL6L4m2kp2MR5J47Mj97rl9L4RR2jq2J90kj65k8P6L5j42O7RN8M6
$$ 135 99 61 181 116 42 47 49 95 72 79 115 149 107 105 33 37 132 279 283 86 77 38 72 81 173 172 90 280 278 113 85 161 196 54 121 130 188 234
-252B34k8j07KK6k1l6K03j65Q2j44J26r7%l3P0
$$ 234 206 99 101 127 106 70 273 108 190 46 172 75 75 42 112
-392A12
##PAGE=	F1=-15669.3
##FIRST=	19140.455529915001534,	4405.895418600002813,	0
##DATA TABLE=	(F2++(Y..Y)), PROFILE
4406A05k9L4m4nm4L7PR2M9n7%nm9K2P7j23J47j01M9l1l5J9m3O9n3M9m1J8ko2J30no5J26j45
$$ 105 76 110 66 61 17 54 61 153 202 145 145 140 91 113 190 67 214 113 162 131 96 115 72 141 88 137 96 114 112 50 180 175 110 236 91
4077I1J9Q2l2j31Q7J08m7j11l2J34j31K2m8J44J70j0k04NJ04m1l0j24K11j46R8lj64Q5L2K5
$$ 91 110 192 160 29 116 224 177 66 34 168 37 59 11 155 325 315 111 116 220 179 149 25 236 90 188 185 21 106 138 163
3796A63p1k7M4p8J35n8J33q2j10J04p7K6L6K14k59Q3j03%N4J41l6j42l2M8J00n8j08J34K4
$$ 163 92 65 109 31 166 108 241 159 49 153 76 102 138 352 93 176 73 73 127 268 232 90 58 106 206 148 40 174 198
3523A98o5pJ11O2j50n5l3LJ18K4j23j0rJ4lP3O4qL2j07j6JL0j06K24K9o0j35M3r4N2o7J48
$$ 198 133 126 237 299 149 94 61 64 182 206 83 73 64 78 75 148 212 204 236 129 113 114 144 38 262 291 231 96 139 45 97 30 178
3213A78K7j28n5P4q1K7P1l6J17j9j32K7J84j14r1J17p2m2J5O7O8j19J35P3J47j86j55K1o0
$$ 178 205 77 22 96 15 42 113 77 194 175 43 70 254 140 49 166 94 52 67 134 202 83 218 291 438 252 97 118 58
2941E8R5Oj05l4P3QK3J25j00O0J2k8L2k0j31N4M1m6P4j08p7O7J12r1N2J9K3k3P3k3j81J63
$$ 58 153 159 54 20 93 101 124 249 149 209 221 193 225 205 74 128 169 123 197 89 12 79 191 100 152 171 194 171 244 221 40 203
2641B03L8j89N6l3N8J8j4J0J12j14l8LM5p2L3R1j67PlM2kJ1P7r3L2n5K8J5K9l7J1L2p8K6J82
$$ 203 241 52 108 75 133 151 137 147 259 145 107 110 155 83 116 207 40 47 44 86 84 95 172 79 111 56 84 99 128 91 102 134 56 82 264
2312B64m1j19J78q0j03m6J3R8k5J55j33p1l8rJ66o3o5M9Np3K2O1j6R7r8l4Po6P7P6N5j82K1
$$ 264 223 104 282 202 99 53 66 164 139 294 161 90 52 43 209 146 81 130 135 62 84 145 129 226 128 94 101 35 112 188 243 61 82
2002H2k7N2Q2n3m9L3p3J07J0J2j31O5K0q5L5J3N9kp3m5k4J63Q3q4p0K0K7l5n2oJ45K4o6n3
$$ 82 55 107 189 136 87 120 47 154 164 176 45 110 130 45 80 93 152 150 77 32 8 171 254 170 100 120 147 112 60 54 199 223 157 104
1683A04L1r3J71Q9j09o6N5l6k7r6J32K6oqo9n2L0j5J8Kl0J60m3o6M9L9o3k6r3P5MK7kk5J38
$$ 104 135 42 213 302 193 127 182 146 119 23 155 181 175 167 98 46 76 61 79 81 51 211 168 102 151 190 127 101 8 83 87 114 112 87 225
1354B25L1j39n6J30r3n6J43J3j38Q9n7L5J44rj5j66J89p6K8j05RM2lp4P8k7q3O5j3R9Nq0j0
$$ 225 256 117 61 191 98 42 185 198 60 149 92 127 271 262 247 81 270 194 222 117 126 168 165 91 169 142 59 124 111 210 215 135 125
1044A25kq1M3M5o3Q5%q1L7O3O9P9j10p9k7m8m0N4P5M7K8Q1o9p8N5j18J11J54n4N69M95r35
$$ 125 123 42 85 130 67 152 152 71 108 171 240 319 209 130 103 55 15 69 144 191 219 300 231 153 208 90 201 355 301 870 1365 430
744D30k34J36q5j24Rk7P9l4J8K0m9p4R4L3J73J9p9K35J54p9l39jj28Q5k00J09J39k28O8M8
$$ 430 196 332 247 123 132 105 184 150 168 188 139 65 159 192 365 384 305 540 694 615 276 275 147 232 32 141 280 52 120 168
462A68k6o6o2N3QN1j08K79M4j4r7N8p8k08J61K1o0k0J40l9p4oM0M4l4Q8p8J20n1j22P4n2J33
$$ 168 142 76 14 67 75 126 18 297 341 327 230 288 210 2 163 184 124 104 244 205 131 125 165 209 175 263 185 305 254 132 206 154 287
152B87P7l9j63l0Lm3j8P8l1q3K3l7Q7n6L5M4M1n9qr3MJ29J52j3j73l8n7P4nJ15K9j12K04k0
$$ 287 364 325 162 132 135 92 74 152 121 38 61 24 111 55 90 134 175 116 108 15 19 148 300 287 114 76 19 93 88 203 232 120 324 304
-167C04j96qO3M5j42N7K4%K2N4q8j7O6m3q8K14j27R6j46J33q1jp1K2
$$ 304 108 100 163 208 66 123 147 147 169 223 135 118 184 141 53 267 140 236 90 223 142 141 70 92
-392I2
##PAGE=	F1=-15748
##FIRST=	19140.455529915001534,	4405.895418600002813,	0
##DATA TABLE=	(F2++(Y..Y)), PROFILE
4406A11Jm9jqrM8qJ04J9m0L7n3r5J3Q6o7J61j30L6p0J8j5k7Q2l0K7k8J1Lp6J32%j01J35j27
$$ 111 112 63 62 54 45 93 85 189 208 168 205 152 57 70 156 89 250 120 156 86 104 89 62 144 114 141 113 124 127 51 183 183 82 217 90
4077I0jR9k6j52J02J35q2j54L2P8j08O9l7R2J49Jj91L6Q9k2n5j06J84j08Q8J0k11J20jQ7o5
$$ 90 89 188 162 10 112 247 165 11 43 121 13 82 45 137 286 287 96 132 221 199 144 38 222 114 202 212 1 121 120 207 142
3786A42j3L7j45J02n2J50m7p0O7r7O3k5K33k37O3j04J6L4J21k3j26K3P6P7j26j12J60M8q1
$$ 142 129 166 21 123 71 221 174 104 171 74 137 112 345 108 171 67 83 117 238 215 89 112 188 265 139 27 187 235 154
3514A54l0J27P5j48j19n0O9J26j2j14moj4K7L5Q7k9L1q5K5NM5j15J93N3q4j73J5j7L5p2K17
$$ 154 124 251 326 178 59 9 78 204 192 78 74 68 54 81 116 203 174 205 120 145 150 195 80 273 326 242 69 84 67 102 30 247
3213B47%j57l9P1p1%Q1p4J43k3j38N2J39j48NP6n1j7l6O1N8o1J01J08J36j57j85j2o2J09m
$$ 247 247 90 51 122 51 51 132 58 201 178 40 92 231 83 88 164 113 96 60 121 179 118 219 327 463 306 121 109 47 156 152
2922A52j12k3N0K7L0J19o8L5N3n7K2j4j33N3K9l3J05j21q2N4J14l8M9jk6o2J08k5j47J57O
$$ 152 40 17 67 94 124 243 175 210 263 206 228 214 81 134 163 130 235 114 32 86 200 162 211 210 184 122 230 205 58 215 221
2631B21j67P4n2P2J0k2n9J59r8K%L6j12O8O8j59JK0M9k6M6R5n4n5q8P9L1j2pJ7rp9M0K39m9
$$ 221 54 128 76 148 158 136 77 236 138 140 140 176 64 132 200 41 42 62 111 85 131 226 172 117 29 108 139 127 120 137 128 49 89 328 279
2303B79j88J47m4j28M5k1P8L6J42j75r9m2%J44p5l1L4Ok9RJ03l6O4o7o3rn9J03P5O4j95K5
$$ 279 91 238 194 66 111 90 168 204 346 171 72 30 30 174 99 68 102 108 79 88 191 155 219 152 89 80 21 124 199 263 68 93
2002I3n2P6M5m3q6Q5q2J47r2P1q6N7L1p6j4M8M4l0m9n9k0J54Q2q1m1J7K8n0l5k8J82k5q2j3
$$ 93 41 117 162 119 33 118 36 183 91 162 76 133 164 88 74 122 166 136 87 28 8 162 244 163 122 139 167 117 82 54 236 211 129 116
1683A16qm4R8J27q9q5P9m8mr7R5N6J6n9m9p4L9J0pjj9J56l8p7N8J1o1m2l9P7p0M8L3j7J20
$$ 116 108 64 162 289 200 115 194 146 142 45 140 196 212 153 104 30 69 79 72 71 52 208 170 93 151 162 101 59 20 97 27 75 108 91 211
1354B11M8j64kR2j41K3J24j1j37P6o2O1J45mk7j45J91n9N7j22j6L2J7j14J07l8p5L8J0J03
$$ 211 259 95 93 185 44 67 191 180 43 119 57 118 263 259 232 87 278 219 276 154 138 170 187 73 180 142 67 105 115 218
1072B18J7p5j8%j05P1M4p2Q6j7n6N6J9%J11m9j08m8k6j8J0J31N7k8P1m7j11O8p5M5J94j03
$$ 218 235 160 142 142 37 108 152 80 166 149 93 149 168 168 279 230 122 74 48 30 40 171 228 200 271 224 113 181 106 151 345 242
772B42N03M31p45l39J48l8r6N6nM3k1rj5l2j02R1N5J51O8r8K84J37k9l35o2r7Q2j91O0J36
$$ 242 745 1176 431 92 240 202 106 162 157 200 179 170 155 123 21 112 167 318 386 288 572 709 680 345 283 186 268 77 137 273
490B73k04O3N9q8Qq1M7j8Q8j38K71L4k6o4O9m9j92J44J4j26M0J21l0q7PN3L3o5N8q1J83l5
$$ 273 69 132 191 103 111 30 77 59 147 9 280 314 288 224 293 244 52 196 210 84 124 245 215 128 135 188 221 156 214 133 316 281
190B81k01R8r1J36Q0Jj47n9L7m7L9J2qp5J7l1P3p2O1N3M2p9l0p9KJ39J64qj59o4q0J01RJ01
$$ 281 80 178 87 223 303 304 157 98 135 88 127 139 131 56 73 42 115 43 104 157 199 120 90 11 13 152 316 308 149 85 5 106 115 216
-129B16N7j30J93l2k06K9L2M1j21L0M5n0j3J55q1l1J07o3j22J84p4J05j47J38o3J6r9k4
$$ 216 273 143 336 304 98 127 159 200 79 109 154 104 91 246 165 134 241 178 56 240 166 271 124 262 199 215 116 92
-392I2
##PAGE=	F1=-15826.8
##FIRST=	19140.455529915001534,	4405.895418600002813,	0
##DATA TABLE=	(F2++(Y..Y)), PROFILE
4406A06L9j30O4j6J1N3k0J05ql1O1q7j23L5P1l2J61j37K8j12Q5J7n8P1j7J9l0k2jn2J23mr7
$$ 106 145 15 79 63 74 127 107 212 204 173 234 147 24 59 130 98 259 122 150 38 123 140 82 153 136 155 125 103 102 50 173 169 72
4096G2J27j16j0J28l4j26Q4J23j07r9J0L1n5Q5k7L6J15J3j51M0O0J1q1q2J46o6Q1Qj99J16
$$ 72 199 83 73 201 167 41 125 248 141 42 52 83 28 113 86 122 237 250 99 139 199 210 129 47 193 127 208 216 17 133
3814A33l5J40o8J9K0k02O4m3J53K3n1K0j00Q4n5K24k02M3j16L2L8R3j6p8L4R8O9j80j12J63
$$ 133 98 238 170 189 209 7 71 28 181 204 153 173 73 157 102 326 124 167 51 83 121 214 198 120 154 252 321 141 29 192
3533A92O7r7k2J31N8j42j55J2M4J29m7r8lj0k4M4pJ13l4J4o5P5MN1j18J63O9q5j80n8R3kl8
$$ 192 259 162 140 271 329 187 32 44 88 217 170 72 69 59 35 79 72 185 151 165 100 175 179 230 112 275 344 259 79 21 114 112 74
3223G4K22k4j63k6N8k9j7M3o4J24l8j07N4R8j59O8L0k8on0M9N7j8M8J42J26j23j52q4m7Q9
$$ 74 296 272 109 83 141 112 95 138 74 198 160 53 107 205 46 114 144 116 110 60 109 166 148 196 338 464 341 189 105 58 147
2932A47l0j05O0lK2K5J08k4J6P4r5RKj24N7J7l1J31j24q6O4P5MN2kq6q5J38j9j18J47k2j42
$$ 147 117 12 72 69 91 116 224 200 216 290 195 204 206 82 139 156 125 256 132 46 110 185 189 241 239 153 68 206 187 69 216 194 52
2622E2Q7m0P4ql9j14J95q2N0oK7j35O2N5j43K0L3M6n9R4R7nj10j50J50K5o8J6O0n4p8N3K71
$$ 52 139 99 173 165 126 12 207 125 175 169 196 61 123 178 35 55 88 134 75 169 266 261 151 1 151 176 108 124 184 130 52 105 376
2312C76n3k36R5jj16R1m5L7J13J14k07j14l5QJ12j00K2J5J5qJJ38m5L5l4q5l6l6J11P0O9j95
$$ 376 323 87 182 181 65 156 111 148 261 375 168 54 19 27 139 39 61 76 91 83 84 222 177 212 178 93 57 21 132 202 271 76
2011G6L3p9J24k1j8l8N4j07J64j64J50o3J6M8m3n6O4K2m3k7p5lJ31Q2q6j1J0L2o1jp2K21p5
$$ 76 109 30 154 133 115 77 131 24 188 24 174 111 127 175 132 76 140 162 119 92 17 14 145 227 141 130 140 172 111 110 38 259 184
1702A84r0K9m6NK2J59o4q8R8n8Qn6J1Q8K6r2qj13N1K5l2kQJ35l1p0M3j8m8n6J4Q1p8PN8lQ2
$$ 184 94 123 77 82 104 263 199 111 209 151 159 103 114 202 228 136 128 15 66 91 59 57 65 200 169 99 142 124 76 20 34 115 37 44 102 99 181
1354A81O2j44K9M1j51Q2J08m6j40N2m6P4J39ql3j20J80k1P9j26l6PL1j23J13m7o8lM1J12K9
$$ 181 243 99 128 169 18 100 208 162 22 74 28 102 241 233 200 80 260 239 318 192 156 163 194 71 184 137 69 66 107 219 248
1063B48p5k7J0j30R5M7p1Q5m9m2P8po4J26J0j32p0jK5j0J33P0p2N0k6j27O8j1l5K05p4M47
$$ 248 173 146 156 26 121 168 97 182 133 91 169 162 98 224 234 102 32 31 56 46 179 249 177 227 201 74 142 131 96 301 227 674
763F74M14n66m65Q1J9j00J21L9k8PNq1l9o8N5P8J29J35q0L11J31k1l28j07p9Q0j90J9J33j74
$$ 674 1088 522 57 138 157 57 178 217 189 196 201 120 81 13 68 146 275 410 330 641 772 751 423 316 237 317 127 146 279 105
481A05K8P1j37R0p6j4l2J16j17K16J1m3l3J15j3k04J53oj86R3R6rr1K1N3J1q8J4o6K12%k41
$$ 105 133 204 67 157 81 67 35 151 34 250 261 218 185 300 287 83 236 230 44 137 233 224 133 154 207 218 130 144 78 290 290 49
180D9J19j51J35O9M9j12j00P7m7R2l6Oo2qkL0o0O7N7M4r3p3k3J5J06J66K2j49q2p0O2L4Q2
$$ 49 168 17 152 221 270 158 58 135 88 180 144 150 88 80 78 108 48 115 172 216 123 50 27 42 148 314 336 187 105 35 97 131 213
-129B13Q1j43J64m1j89Q1j0K2q4j1P5p3o5K57q7m3J49p9j28J09j9J10j45J35m2L6j14l9
$$ 213 294 151 315 274 85 166 156 178 94 83 158 85 20 277 190 147 296 217 89 198 179 289 144 279 237 273 159 120
-392A20
##PAGE=	F1=-15905.5
##FIRST=	19140.455529915001534,	4405.895418600002813,	0
##DATA TABLE=	(F2++(Y..Y)), PROFILE
4406I5P3j29N8j9J9O8l3R3k0l8O8j06r7O2N4n5J51j24K5r8R8M6r2N7pK3m6o4k2OJ04j1n6J03
$$ 95 168 39 97 78 97 165 132 225 205 167 235 129 32 94 148 93 244 120 145 47 145 191 99 156 149 172 126 62 40 46 150 139 83 186
4087A86j14K4J34n6j09P3R0j17m9j1J3MP1l3JQ2J7r6K7K0M6q9o8J03k3P6lj69R7n6J81q2O3
$$ 186 72 96 230 174 65 138 228 111 62 51 64 68 139 106 107 189 206 110 137 157 203 114 46 149 126 202 199 30 127 71 252 170 233
3777B33lk15K1j8J09J09m6l4q5Q2n0J92j68L0j24M3N7O7ol1J8J03P3k01j06J36P5j02j3J23
$$ 233 230 15 36 18 127 236 190 156 71 153 103 295 127 157 33 76 133 200 194 163 181 284 357 156 50 186 261 159 146 269
3495B69L3j27j38N2OJ26p8p7rJj9L5n1J36j4k1m4J16%N1j20J47P3o7j66o9J20m3j3K11m2j51
$$ 269 302 175 37 89 95 221 143 66 57 58 39 74 23 159 145 124 80 196 196 247 127 274 347 280 114 45 165 122 109 320 278 127
3195A27oM4lk1j1k5P6o3n4M6O4j41R7j6Jk2j1L2M9JpJ65J19q7j00j35k3L2o8j6R2l5j0KR8
$$ 127 121 165 162 141 130 105 181 118 64 110 174 33 130 114 115 93 82 114 163 164 157 322 441 354 254 119 96 128 60 44 136 101 91 93 191
2866A91K9J0Q1j29k6K9j06O7Rm2J41j12r5Q5K3J8O2K3j46n5J40j4j12J34m7j18R9j5Q0k5p7
$$ 191 220 230 311 182 156 185 79 146 155 113 254 142 47 132 155 173 235 258 112 57 197 183 71 205 158 40 139 124 204 179 102
2575A02n4J24o8J04j5J9j34J0N4j18M8M2L7q1J28Q4M5j39j58J69Oj25K5J18q9p1N3K80m8k37
$$ 102 48 172 104 208 193 212 78 88 142 24 72 114 151 70 198 282 327 188 30 199 205 80 105 223 134 63 116 396 348 111
2293A11J4M4q5J01o0j5J90Q1k22j15k8J2Q5o2J5j0J4LkJ63l5J2kj16m6nQ7O5P4j88N5r9J61
$$ 111 125 169 84 185 125 110 300 381 159 44 16 28 113 51 66 56 70 73 71 234 199 211 209 93 47 42 129 194 268 80 135 36 197
1983A97q2mK1Nj23J54r5J26p0k5N6Pq3O1kl9j2q3J5R6Q2r6J5RM1o5L0j28K60j13r3N5n1K8
$$ 197 115 111 132 137 14 168 73 199 129 104 160 167 84 145 143 104 92 9 24 120 202 106 121 130 171 106 136 8 268 155 62 117 66 94
1664I4k4J66m0q3R8o5J1j2o7J13K5r1K9j45N7L1n7ML6J08k1n5J9n1j9n0K1J01l6n2N0J0M3
$$ 94 70 236 196 113 211 146 157 145 78 191 216 125 154 9 66 97 40 44 80 188 167 112 131 80 61 11 32 133 97 45 95 105 148
1354A48P0q9L0j6o5N1J02q1j42J9J5M0J24om0j00J63K9R2j21l8k9L2j01R5n9n8m8P6J27L6
$$ 148 218 129 159 143 78 129 231 150 8 27 42 82 206 200 160 60 223 252 344 223 185 156 188 87 182 123 65 17 93 220 256
1063B56q5l0K6j56J08N4n7P5q8l5J02k0j09J30N0j56m8jN6pJ11P3r6K6j6j03L7N5j04J88P
$$ 256 171 141 167 11 119 173 116 191 103 68 170 150 41 171 221 65 17 16 72 65 176 249 153 179 163 60 97 152 48 236 243
772B43M32M31m93m76n6Q0o5P5J08j21N9M4j88k1l1N8N2J32K30K4L41J75j02m01j33r0Q1k03
$$ 243 675 1106 613 137 81 161 96 171 279 158 217 261 73 52 21 79 131 263 493 517 858 1033 931 530 397 307 388 185
509A85oJ32j58j8P4j49J51p4j01J6R1p0J44k4o0j8J75L5k33J84l9k31J39P1K4r2L3L7k1j01
$$ 185 179 311 153 135 209 60 211 137 36 52 143 73 217 193 133 115 290 325 92 276 237 6 145 216 240 148 181 218 197 96
227I6l4j4J88M0j91J12j30K3N0R8o2j48J04l6J32p3J5n2l7K3j4k9N8N5N0r9q9K4J9O2J48O5
$$ 96 62 48 236 276 85 197 67 90 140 238 176 28 132 96 228 155 170 118 81 104 90 61 119 174 224 125 36 60 79 141 289 354
-73C54j30q8o2lM6P9J03j46J22n1j41J25m8j2l4o0J10l4j2J99j08n0J85q9j23K5K9J02j33
$$ 354 224 136 74 71 117 196 299 153 275 224 83 208 160 148 114 54 164 130 118 317 209 159 344 255 132 157 186 288 155
-345A55J15j7N4j14l7
$$ 155 270 253 307 193 156
-392A56
##PAGE=	F1=-15984.3
##FIRST=	19140.455529915001534,	4405.895418600002813,	0
##DATA TABLE=	(F2++(Y..Y)), PROFILE
4406H3R3j02K9j4K3R5m6P0j7n4O2j18l8O7O3j19J35r5K3m8P1M8j07M2PK7o6p0JJ2O2moO8j19
$$ 83 176 74 103 89 112 207 161 231 214 160 222 104 66 133 196 77 212 117 140 92 163 211 104 146 153 180 114 44 45 57 119 115 109 177 58
4077E8P5J26q0j00O3N2j01m0oRN9M0m9j6N7Ql6Rl1P8o9o7N4K0P2j3j33O0n7K03j05J17l2j90
$$ 58 133 259 179 79 142 194 93 53 47 56 115 155 106 90 147 155 119 128 97 175 106 39 93 113 185 172 39 99 42 245 140 257 225 35
3758C5L2lJ3J90n6q5n7N6k5J56j42K2j18M6Q2N0J0nmQ8Q3j88j05R1P4q7j3R4J3j03r4P2k1
$$ 35 67 64 77 267 211 126 69 125 100 256 114 136 18 64 146 196 206 201 197 285 368 180 75 166 240 153 140 234 247 144 50 122 101
3448A01J15j02n5j5K8j5Qm0J02K4o3k5J43lM6j30J59N8l7j51m7J05p9NJ82n1j24K5M0oj6p1
$$ 101 216 114 59 44 72 57 65 25 127 151 88 63 206 203 249 119 278 336 299 148 101 206 127 132 314 263 139 164 204 198 182 111
3148A11J7K7q7jM3K8p5P7n7L9o9O5J9L3nn4J70J10m6m4j60pl6o7O7J02o5m5l6R1Q7J4Q9j43
$$ 111 128 155 68 67 110 138 63 140 83 122 53 118 137 170 165 111 281 391 345 301 141 134 98 31 98 200 135 90 54 145 232 246 335 192
2828A92r3N8p9P6Qn9J29q6j15J10pj7Q2O7j95L0J18k4j29J19o9r4J05J4Q8l1j36L3L7n0J51
$$ 192 99 157 78 154 162 103 232 146 31 141 134 117 199 266 71 101 219 195 66 185 116 22 127 141 229 198 62 95 132 82 233
2537B33j9J0j11p6O1q1O7M8K7p9J31N7R4j46j59J81j4j65J1J72j08n4L2K74l4j95p3Q1p5J09
$$ 233 214 224 113 37 98 17 84 132 159 80 211 268 362 216 57 238 224 59 70 242 134 80 112 386 352 157 84 165 90 199
2256A99o5o5K48N0k23j02j8K8M8J1k5m2j0K4mJ72pkK0j57pqM7O1Q3j78Q9j17J85j09l0P2l4
$$ 199 134 69 317 367 144 42 24 52 100 111 86 44 34 58 54 226 219 217 237 80 73 65 112 173 256 78 167 50 235 126 96 168 134
1946A34j30J21%Q9q9l5L1O1q9M6k9j4no7J3M9Q3j05L2K1N4o1M7j26K38j29r4N5j1J0j5J28
$$ 134 4 125 125 214 125 90 121 182 93 139 110 96 91 24 37 86 169 64 96 117 171 110 157 31 269 140 46 101 90 100 85 213
1645B13k3p7Q3o9PK8j26J22K0n5M7j46M5L4q5J5M9R4j4m2Or1K5m0JJ25mq0L0J4K3O9m1K1o3
$$ 213 190 113 196 127 134 162 36 158 178 123 170 24 69 103 18 33 82 176 162 120 126 35 60 20 21 146 142 62 92 106 129 198 157 178 115
1317A15J1K4R9j10r4j2L1J2R6J2o1q9J42Q0R5j16j8n9J4p1P4p6l8k9N4J33M0j04k0M0j55Q4
$$ 115 126 150 249 139 45 33 64 76 172 184 123 34 176 256 351 235 217 158 172 101 175 99 61 32 86 219 259 155 135 175 20 104
1016A04O9l1M9j24l3J24k7j25J28O1j56K7l7M7MR3N7j03Qj9m8qJ00j37J46P8M45M61m95m47
$$ 104 173 142 191 67 34 158 131 6 134 195 39 66 29 76 80 173 230 127 135 116 68 60 160 23 169 247 692 1153 658 211
734B11j00R5%n5J84k20J41Q0l28J10o8R9L6J37L28J76M47K59k58n80j69j28Q1k35rJ30j53
$$ 211 111 206 206 151 335 115 256 336 8 118 50 149 185 322 650 826 1273 1532 1274 694 525 397 478 243 234 364 211
481B11o5O6j05J57p2j78R0K8j2O5o3n5m5K35R1k59K17p8j85J09N0N9r6M3Pn3j08k5L9R8P4
$$ 211 146 212 107 264 192 14 104 132 120 185 122 67 22 257 348 89 306 228 43 152 202 261 165 208 215 162 54 29 68 166 240
190B40j18J20j13o8L6J22j4j60P7j0J59j05J6m6n7L2m5LM5M8O6j02l4QJ5J8J11J08r7q1n4
$$ 240 122 242 129 61 97 219 205 45 122 112 271 166 182 136 79 111 66 69 114 162 228 126 92 100 115 133 244 352 255 174 120
-101A20o7J6R9J23j25P6o8p7J38p0n2K4r6J36K9K1J32j40m6K03q8j17k5N0P6j09P4J4O4j04
$$ 120 53 69 168 291 166 242 174 97 235 165 113 137 41 177 206 227 359 219 173 376 288 171 146 196 272 163 237 251 315 211
-383B11k9
$$ 211 182
-392A82
##PAGE=	F1=-16063
##FIRST=	19140.455529915001534,	4405.895418600002813,	0
##DATA TABLE=	(F2++(Y..Y)), PROFILE
4406G1R7p1JnK8J24n6L9oo6M9j27K3N7Q2j85J28o7J6qM7K6j00K5K3K8p7qM8n0LL0K0L5j27
$$ 71 168 97 98 93 121 245 189 228 222 156 205 78 101 158 240 55 183 116 132 124 171 197 97 122 145 173 96 88 136 86 89 119 139 174 47
4077D7J07J18r8r1N4J4m0r0M0qJ11qo1j8L0KJ9j3q6R7j8n7j5N8P1j2j01LpJ71j27J71o3j43
$$ 47 154 272 174 83 137 151 111 21 61 53 164 156 95 77 107 109 128 115 29 126 108 51 36 94 165 153 52 55 48 219 92 263 200 57
3758E7N2pk4K17p9j19k4NNJ30j16Kr2M0J08M0L3jk2N7R0j54j01M0O5m7k1L5Lo9n1R4l9R3j16
$$ 57 109 102 78 295 216 97 73 78 83 213 97 99 7 47 155 195 228 227 205 262 352 198 97 137 202 155 134 169 172 103 52 146 107 200 84
3429H4l5pM0ml2J4L6N8r8j6J67oL6j46J96K6j0j33k9R0j13K4J42n6q7O5N1l5oj28M7%o7nN9
$$ 84 49 42 82 78 46 60 96 154 56 40 207 201 237 91 287 313 303 170 141 231 118 142 284 228 141 206 257 222 216 88 135 135 68 63 122
3101A22k2J9K7p7O9j09J20RK5k5q9J56R4KQj72Jr8L5N2J05r5o8q1Q5J38K2J06j34j45M7m5
$$ 122 100 119 146 69 138 29 149 158 183 158 69 225 319 321 329 157 158 60 95 147 252 157 89 8 93 231 253 359 225 80 127 82
2800H2Q3Ko9R8n4j33J22J3j09J17J09k19J00J14m7j49J08r5m1P4L8R4k6j98J19l7k8J81j6
$$ 82 165 167 98 196 142 9 131 144 35 152 261 42 142 256 209 60 168 73 32 106 144 238 212 14 133 96 68 249 233
2528B33%p7j19J8l2O6M9K0o2J10J9J39j26j59J79k7j62l3K01j11k4j3K61j5j29j33J01j05
$$ 233 233 156 37 55 23 89 138 158 96 206 225 364 238 79 258 231 69 36 237 126 102 89 350 335 206 73 174 69
2265F9J32n8q6K55K1k10p8OM0J0N4m6o3nJ6k0J63L6j0L0k01O3l2mO3R6j72J26j39K06r8q7
$$ 69 201 143 57 312 333 123 45 51 91 101 155 109 46 41 57 37 200 236 226 256 55 118 86 82 145 241 69 195 56 262 164 77
1964G7J06m8j26O1Q0O0j04Lm2J08p5K4n7L1j0m9J3qQ6q4QO1N5m7M7j02J99j26r4K9M6j6%Q1
$$ 77 183 135 9 70 150 210 106 109 67 175 100 124 67 98 88 39 52 44 130 46 54 115 170 123 170 68 267 141 47 76 122 106 106 187
1645A87j2p1O8p9J0M7j38R5J5OM5j28K7M7j07ON4R3qm0J0j01M9o1K5J09K0r7K7LK6O5k7J7
$$ 187 175 104 172 93 103 150 12 107 122 128 173 45 72 119 12 18 72 165 157 117 127 26 75 14 39 148 168 71 98 101 127 192 165 182
1326A82q8O1QR2j28m4j4OK6O4L3r9q1J13J20Q5j14J8o9k2n1O7r6qRK1J21M1j22LM8j32L1R3
$$ 182 94 155 163 255 127 83 69 75 101 165 198 99 18 131 251 336 222 240 171 149 98 165 69 61 70 91 212 253 131 134 182 50 81 174
$$ [...]
-392A43
##END NTUPLES=	nD NMR SPECTRUM
##END=	
##END=	
