##TITLE=	Nov11-2021.23.fid
TM-VI-158 13C

##JCAMP-DX=	6.0	$$ MestReNova 14.3.1-31739
##DATA TYPE=	LINK
##BLOCK_ID=	1
##BLOCKS=	2    
##ORIGIN=	Mestrelab Research S.L.
##OWNER=	hrzepa
##$MNOVA/LINK_BLOCK_TYPE=	ITEM	$$ NMR Spectrum
##$MNOVA/ITEM/POLYGON=	(XY..XY)
5321,5835
8722,5835
8722,8208
5321,8208
5321,5835
##$MNOVA/ITEM/Z=	0
##$MNOVA/ITEM/ANGLE=	0
##TITLE=	Nov11-2021.23.fid
##JCAMP-DX=	6.0	$$ MestReNova 14.3.1-31739
##BLOCK_ID=	2
##DATA TYPE=	MNOVA NMR VIEW DATA
##DATA CLASS=	MNOVA VIEW DATA
##$MNOVA/ITEM/ZOOM/X=	-20.698776542268014111,	240.66949999422217843
##$MNOVA/ITEM/ZOOM/Y=	-229.74633407592773438,	2314.8159942626953125
##END=	
##TITLE=	Nov11-2021.23.fid
##JCAMP-DX=	6.0	$$ MestReNova 14.3.1-31739
##BLOCK_ID=	3
##DATA TYPE=	NMR SPECTRUM
##DATA CLASS=	XYDATA
##NUMDIM=	1
##ORIGIN=	Bruker BioSpin GmbH
##OWNER=	nmr
##.OBSERVE FREQUENCY=	100.69424847706599735
##.OBSERVE NUCLEUS=	^13C
##.SOLVENT NAME=	CD2Cl2
##.PULSE SEQUENCE=	zgpg30
##LONGDATE=	2021/11/11 21:26:00.000
##.ACQUISITIONMODE=	SIMULTANEOUS (DQD)
##$ORIGINAL FORMAT=	Bruker XWIN-NMR
##$MNOVA/SCALES_VERSION=	9
##$PARAMETER FILE=	(acqus, ASCII, /private/var/folders/f6/rjf_tdyn2v98c5c0wvkgn4s80000gn/T/hbPu+$0+TIemW1$IStm+sw/23/acqus, 0)
$$ ##TITLE= Parameter file, TOPSPIN		Version 3.2
$$ ##JCAMPDX= 5.0
$$ ##DATATYPE= Parameter Values
$$ ##NPOINTS= 11	$$ modification sequence number
$$ ##ORIGIN= Bruker BioSpin GmbH
$$ ##OWNER= nmr
$$ $$ 2021-11-11 21:26:47.483 +0000  nmr@CZC10666PP
$$ $$ /opt/topspin/data/agmb/nmr/Nov11-2021/23/acqus
$$ $$ process /opt/topspin3.2/prog/mod/shimcntl
$$ ##$ACQT0= -2.01680680282977
$$ ##$AMP= (0..31)
$$ 100 100 100 100 100 100 100 100 100 100 100 100 100 100 100 100 100 100
$$ 100 100 100 100 100 100 100 100 100 100 100 100 100 100
$$ ##$AMPCOIL= (0..19)
$$ 0 0 0 0 0 0 0 0 0 0 0 0 0 0 0 0 0 0 0 0
$$ ##$ANAVPT= -1
$$ ##$AQSEQ= 0
$$ ##$AQ_mod= 3
$$ ##$AUNM= <au_zgonly>
$$ ##$AUTOPOS= <52 >
$$ ##$BF1= 100.683175
$$ ##$BF2= 400.41
$$ ##$BF3= 100.683175
$$ ##$BF4= 100.683175
$$ ##$BF5= 100.683175
$$ ##$BF6= 100.683175
$$ ##$BF7= 100.683175
$$ ##$BF8= 100.683175
$$ ##$BYTORDA= 0
$$ ##$CAGPARS= (0..11)
$$ 0 0 0 0 0 0 0 0 0 0 0 0
$$ ##$CFDGTYP= 0
$$ ##$CFRGTYP= 9
$$ ##$CHEMSTR= <none>
$$ ##$CNST= (0..63)
$$ 1 1 145 1 1 1 1 1 1 1 1 1 1 1 1 1 1 1 1 1 1 1 1 1 1 1 1 1 1 1 1 1 1 1 1
$$ 1 1 1 1 1 1 1 1 1 1 1 1 1 1 1 1 1 1 1 1 1 1 1 1 1 1 1 1 1
$$ ##$CPDPRG= (0..8)
$$ <waltz16> <> <waltz16> <> <mlev> <mlev> <mlev> <mlev> <mlev>
$$ ##$D= (0..63)
$$ 0 1 0.00345 0 0 0 0 0 0 0.06 0 0.03 2e-05 3e-06 0 0 0.0002 0 0 0 0 0 0
$$ 0 0 0 0 0 0 0 0 0 0 0 0 0 0 0 0 0 0 0 0 0 0 0 0 0 0 0 0 0 0 0 0 0 0 0 0
$$ 0 0 0 0 0
$$ ##$DATE= 1636666006
$$ ##$DE= 6.5
$$ ##$DECBNUC= <off>
$$ ##$DECIM= 760
$$ ##$DECNUC= <off>
$$ ##$DECSTAT= 4
$$ ##$DIGMOD= 1
$$ ##$DIGTYP= 12
$$ ##$DQDMODE= 0
$$ ##$DR= 21
$$ ##$DS= 4
$$ ##$DSPFIRM= 0
$$ ##$DSPFVS= 20
$$ ##$DTYPA= 0
$$ ##$EXP= <c13>
$$ ##$F1LIST= <111111111111111>
$$ ##$F2LIST= <222222222222222>
$$ ##$F3LIST= <333333333333333>
$$ ##$FCUCHAN= (0..9)
$$ [...]
$$ ##$Sgu3PowerLevels= (0..7)
$$ 0 0 0 0 0 0 0 0
$$ ##$Sgu4PowerLevels= (0..7)
$$ 0 0 0 0 0 0 0 0
$$ ##$Sgu5PowerLevels= (0..7)
$$ 0 0 0 0 0 0 0 0
$$ ##$Sgu6PowerLevels= (0..7)
$$ 0 0 0 0 0 0 0 0
$$ ##$Sgu7PowerLevels= (0..7)
$$ 0 0 0 0 0 0 0 0
$$ ##$Sgu8PowerLevels= (0..7)
$$ 0 0 0 0 0 0 0 0
$$ ##$SguType= 3
$$ ##$ShimPowMaxUA= (0..63)
$$ 130000 130000 130000 130000 130000 130000 130000 130000 130000 130000 130000
$$ 130000 130000 130000 130000 130000 130000 130000 130000 130000 0 0 0 0
$$ 0 0 0 0 0 0 0 0 0 0 0 0 0 0 0 0 0 0 0 0 0 0 0 0 0 0 0 0 0 0 0 0 0 0 0 0
$$ 0 0 0 0
$$ ##$ShimPowMaxUC= (0..63)
$$ 130000 130000 130000 130000 130000 130000 130000 130000 130000 130000 130000
$$ 130000 130000 130000 130000 130000 130000 130000 130000 130000 0 0 0 0
$$ 0 0 0 0 0 0 0 0 0 0 0 0 0 0 0 0 0 0 0 0 0 0 0 0 0 0 0 0 0 0 0 0 0 0 0 0
$$ 0 0 0 0
$$ ##$ShimPowMaxUG= (0..63)
$$ 524287 524287 524287 524287 524287 524287 524287 524287 524287 524287 524287
$$ 524287 524287 524287 524287 524287 524287 524287 524287 524287 0 0 0 0
$$ 0 0 0 0 0 0 0 0 0 0 0 0 0 0 0 0 0 0 0 0 0 0 0 0 0 0 0 0 0 0 0 0 0 0 0 0
$$ 0 0 0 0
$$ ##$ShimPowRcbType= 3
$$ ##$ShimPowRes= (0..63)
$$ 1e-20 1e-20 1e-20 1e-20 1e-20 1e-20 1e-20 1e-20 1e-20 1e-20 1e-20 1e-20
$$ 1e-20 1e-20 1e-20 1e-20 1e-20 1e-20 1e-20 1e-20 0 0 0 0 0 0 0 0 0 0 0 0
$$ 0 0 0 0 0 0 0 0 0 0 0 0 0 0 0 0 0 0 0 0 0 0 0 0 0 0 0 0 0 0 0 0
$$ ##$ShimPowRng0= (0..63)
$$ 1 1 1 1 1 1 1 1 1 1 1 1 1 1 1 1 1 1 1 1 0 0 0 0 0 0 0 0 0 0 0 0 0 0 0 0
$$ 0 0 0 0 0 0 0 0 0 0 0 0 0 0 0 0 0 0 0 0 0 0 0 0 0 0 0 0
$$ ##$ShimPowRng1= (0..63)
$$ 1 1 1 1 1 1 1 1 1 1 1 1 1 1 1 1 1 1 1 1 0 0 0 0 0 0 0 0 0 0 0 0 0 0 0 0
$$ 0 0 0 0 0 0 0 0 0 0 0 0 0 0 0 0 0 0 0 0 0 0 0 0 0 0 0 0
$$ ##$ShimPowRng2= (0..63)
$$ 1 1 1 1 1 1 1 1 1 1 1 1 1 1 1 1 1 1 1 1 0 0 0 0 0 0 0 0 0 0 0 0 0 0 0 0
$$ 0 0 0 0 0 0 0 0 0 0 0 0 0 0 0 0 0 0 0 0 0 0 0 0 0 0 0 0
$$ ##$ShimPowRng3= (0..63)
$$ 1 1 1 1 1 1 1 1 1 1 1 1 1 1 1 1 1 1 1 1 0 0 0 0 0 0 0 0 0 0 0 0 0 0 0 0
$$ 0 0 0 0 0 0 0 0 0 0 0 0 0 0 0 0 0 0 0 0 0 0 0 0 0 0 0 0
$$ ##$ShimSysFunc= (0..63)
$$ 1 2 3 4 5 7 9 11 15 16 8 10 12 14 6 17 13 18 19 20 0 0 0 0 0 0 0 0 0 0
$$ 0 0 0 0 0 0 0 0 0 0 0 0 0 0 0 0 0 0 0 0 0 0 0 0 0 0 0 0 0 0 0 0 0 0
$$ ##$ShimSysMatrix= 0
$$ ##$ShimSysType= 1
$$ ##$TFXNUM= 0
$$ ##$TRIPLO2= 0
$$ ##$VTU= 2
$$ ##$VTUETH= <149.236.99.20>
$$ ##$VTUTY= <no>
$$ ##$WBREFAM= (0..15)
$$ 135 116 100 100 100 100 100 100 100 100 100 100 100 100 100 100
$$ ##$WBREFLM= (0..15)
$$ 0 0 0 0 0 0 0 0 0 0 0 0 0 0 0 0
$$ ##$WBREFPH= (0..15)
$$ 71.66 -68.25 0 0 0 0 0 0 0 0 0 0 0 0 0 0
$$ ##$WBSGU= (0..15)
$$ 0 0 0 0 0 0 0 0 0 0 0 0 0 0 0 0
$$ ##$XFAC= 2
$$ ##END=
$$ 
##$DECIM=	760
##$DSPFVS=	20
##XUNITS=	HZ
##YUNITS=	ARBITRARY UNITS
##FIRSTX=	24231.369385662510467
##LASTX=	-2084.0185409410978536
##DELTAX=	-0.40154708059210514337
##XFACTOR=	1
##YFACTOR=	0.071519566994166450247
##FIRSTY=	13.555271148681640625
##MINY=	-19.308513641357421875
##MAXY=	2104.378173828125
##NPOINTS=	65536
##XYDATA=	(X++(Y..Y))
$$ [...]
14158 102 91 84 87 105 137 173 201 216 222 224 222 218 208 195 185 179 179 178 174 162 144 126 115 115 118 117 114 114 119 128 144 165 185 193 184 165 145 129 120 119 124 131 134 136 136 128 108 81
14138 81 61 52 58 80 118 164 201 218 213 194 164 126 92 73 71 78 85 90 97 100 97 89 85 83 75 59 42 39 51 74 97 116 128 128 116 93 66 39 19 8 2 -3 -9 -7 4
14120 4 19 31 41 54 71 84 92 100 109 114 108 94 82 79 83 88 92 96 103 104 95 78 65 62 68 79 96 121 146 160 158 148 140 142 155 171 183 187 184 176 166 155 147 145 150 160 174
14102 174 191 203 203 193 181 174 170 169 169 175 184 191 195 200 209 221 231 237 237 241 263 313 387 472 551 621 684 751 830 924 1029 1135 1234 1320 1390 1433 1440 1408 1338 1236
14085 1236 1113 986 870 774 694 624 557 490 419 343 269 207 165 145 142 144 143 138 135 144 161 177 181 174 163 160 166 175 178 167 144 119 102 96 102 114 129 140 142 135
14069 135 124 113 103 87 67 51 49 63 88 113 131 138 138 139 151 174 200 216 219 213 203 190 175 161 153 150 147 134 109 82 64 60 67 79 95 115 134 146 151 152 150
14053 150 146 142 146 160 175 183 181 172 160 144 127 111 98 87 77 70 73 86 103 113 109 95 81 77 87 109 137 164 183 189 183 165 139 116 104 111 129 145 150 139 115
14036 115 90 81 94 116 129 133 136 146 156 158 154 150 150 153 160 172 187 201 208 207 193 164 124 84 54 45 63 107 162 209 238 251 255 256 255 256 262 267 263 243 208 168 136 119
14019 119 120 133 148 158 163 171 181 188 190 192 201 220 239 248 245 237 231 232 235 234 223 208 196 191 190 186 178 169 159 149 140 137 140 146 154 162 168 167 159 149 145 152 165 172 168 158 149 141 124 95 64
13998 64 50 56 70 84 96 106 111 110 103 97 89 73 49 25 12 13 23 34 38 34 30 35 54 82 111 128 130 122 113 115 132 160 188 206 212 215 218 215 208 204 211 224 227 214 195 177
13980 177 164 149 130 113 105 110 124 135 131 113 93 87 96 116 139 158 172 182 193 207 219 225 227 230 236 243 248 249 246 238 229 221 213 202 186 171 159 153 150 149 150 154 158 162 167 177 193
13961 193 209 215 206 188 172 167 174 187 199 203 200 191 176 154 131 118 125 140 151 149 142 137 134 134 136 140 143 144 148 158 170 182 196 216 239 255 254 236 207 179 159 154 163 175 183
13943 183 183 178 171 166 164 169 176 178 174 173 184 204 221 233 245 262 280 289 287 274 250 216 180 150 130 116 101 87 77 75 79 88 98 112 133 160 186 200 196 178 154 130
13926 130 113 110 118 129 136 139 143 147 141 118 83 45 18 7 17 48 91 135 164 173 164 146 126 109 95 85 81 87 106 135 163 179 180 169 156 145 137 126 111 90 67
13910 67 47 36 41 58 81 101 116 126 131 135 141 153 168 180 184 182 180 178 179 182 187 193 200 209 219 225 222 207 182 150 114 81 55 39 31 30 35 47 67 96 131 163 184 190 188
13892 188 183 179 178 180 184 188 192 202 216 227 233 238 244 243 224 192 161 143 142 158 184 209 219 208 179 144 118 110 117 129 137 142 148 155 160 162 164 168 169 160 143 128 122 128 138 140 131 110
13872 110 86 66 57 63 79 99 113 122 127 133 142 154 168 180 187 183 168 150 141 143 149 151 148 146 145 139 126 111 100 87 70 56 58 80 113 144 165 179 188 193 196 193 180 160 141
13854 141 129 125 128 135 142 147 152 163 178 187 188 183 173 160 151 152 162 172 182 198 225 257 280 285 277 261 240 218 200 190 187 186 180 168 157 156 164 171 169 160 156 157 163 168 172 169 156 133
13835 133 105 76 49 28 15 11 14 26 50 84 117 139 143 132 112 92 81 76 71 66 65 70 73 69 62 62 75 100 132 164 188 200 198 184 162 137 114 94 76 60 44
13818 44 32 33 53 91 134 171 197 218 230 224 196 160 130 112 98 84 72 65 66 77 101 138 180 216 241 254 256 250 237 221 205 190 175 158 145 140 143 144 139 133
13802 133 130 130 132 140 158 180 196 203 205 211 222 232 231 209 169 125 95 85 87 87 77 59 40 29 20 7 -10 -25 -26 -16 -5 1 9 20 30 36 43 57 79 101 119 134
13786 134 141 142 142 145 151 151 137 117 102 97 101 106 105 101 98 104 122 144 157 156 144 127 114 108 111 116 121 123 127 133 140 143 138 120 95 70 57 56 60 64 69 77 83 82 80 83 91 92 80 62 49 45
13765 45 42 33 20 12 17 29 37 33 24 20 25 36 52 74 98 111 106 85 58 33 15 11 24 45 60 68 77 91 106 122 146 178 208 227 236 245 251 241 210 167 128 103 91
13747 91 88 93 110 135 159 172 176 181 196 221 250 280 308 335 358 380 399 416 431 449 478 517 558 589 599 581 531 461 389 331 282 231 175 125 99 100 121
13733 121 151 178 193 191 176 160 154 164 187 211 228 233 227 215 198 177 159 145 132 113 91 76 75 86 106 128 146 150 138 124 119 125 134 147 173 211 246 266 277
13717 277 289 305 313 302 274 243 219 209 208 210 215 225 239 251 248 227 192 152 116 88 71 68 80 99 115 120 118 116 119 124 132 145 163 177 178 165 144 130 133 156 189
13700 189 212 214 197 170 142 114 89 69 56 47 46 56 77 101 122 131 121 97 68 45 35 40 59 86 107 116 118 123 133 137 139 145 159 169 166 151 130 106 84 76 84
13684 84 100 113 120 128 137 140 132 117 99 82 68 62 62 59 51 43 45 58 80 103 123 136 140 132 116 101 94 99 110 117 112 96 80 70 64 55 35 7 -14 -24 -24 -23 -24 -22 -12 8
13665 8 39 72 97 106 104 101 104 110 118 128 139 147 151 152 154 160 174 195 216 224 211 188 171 163 158 151 146 145 145 142 137 135 136 140 147 157 165 165 155 137 113 88 71 72 91 115 130 135 137 139
13645 139 141 143 148 154 155 144 126 108 98 98 107 121 136 149 159 167 172 170 159 140 119 99 87 81 78 77 81 92 110 125 130 121 106 92 85 86 90 95 99 102 98 88 78 77 89 104
13627 104 113 113 105 96 94 103 115 114 99 81 74 77 76 66 54 49 53 65 81 96 101 95 87 85 89 93 93 85 70 49 28 16 15 26 51 88 129 158 166 153 130 104 77 50 26
13609 26 16 23 38 48 45 32 16 8 12 31 54 70 71 55 26 -8 -39 -53 -50 -37 -24 -7 17 51 82 103 114 121 124 122 115 108 106 112 124 137 146 150 151 151 149 142 128 111
13591 111 94 87 93 108 119 123 125 130 136 131 109 80 61 62 79 97 110 120 133 148 155 150 139 130 122 115 115 125 142 157 168 180 194 199 189 172 164 171 185 195 194 180 156
13574 156 131 115 107 101 91 83 84 89 88 72 45 19 6 10 28 51 69 79 85 93 106 124 146 165 173 165 143 119 101 96 103 115 126 132 133 132 130 129 131 135 138 141 144 150 159 166 169 168
13555 168 164 156 145 134 121 105 88 77 77 79 72 59 54 68 93 111 114 101 79 53 26 4 -12 -26 -39 -56 -82 -114 -138 -141 -125 -103 -83 -59 -24 13 42 61
13539 61 81 108 133 146 148 144 144 156 182 214 235 235 219 199 180 163 150 149 161 175 181 171 147 116 89 74 72 81 99 121 138 140 129 120 121 129 134 134 131 125 117 116 130 155
13522 155 183 209 233 253 259 246 217 177 130 80 38 8 -10 -23 -34 -50 -74 -99 -114 -116 -112 -109 -101 -80 -46 -7 32 73 115 148 164 164 150 126 100 78 68
13507 68 65 63 59 56 60 69 78 84 90 94 92 79 57 37 31 42 62 85 108 130 147 160 172 185 196 199 191 174 153 132 117 112 113 111 103 94 86 78 69 62 61 63 65 66 70 81 94 103 108 109
13487 109 105 96 86 81 84 92 101 111 120 125 121 106 87 69 57 53 55 56 56 62 78 103 127 142 148 147 139 124 105 89 83 91 110 126 130 126 124 135 155 175 188 193 198 205 215 221 220 216
13467 216 212 202 182 158 141 135 131 122 117 127 148 163 161 143 123 108 99 90 71 43 19 10 22 45 75 111 149 183 205 210 201 183 169 171 191 215 226 216 190 154
13451 154 118 94 88 97 111 127 142 157 172 188 207 223 231 230 230 236 252 269 282 282 262 230 200 182 173 161 146 135 137 148 156 157 156 161 171 177 170 153 135 126 127 132 131 126
13434 126 127 141 165 183 186 175 165 166 175 184 182 166 141 115 95 87 92 109 132 152 166 170 165 153 138 124 115 113 117 124 132 141 151 164 180 198 215 229 238 242 236 220 198 176
13416 176 163 166 182 201 219 234 249 264 274 272 256 236 218 203 183 154 122 100 93 97 102 103 101 98 97 101 114 135 153 159 148 128 109 99 102 109 110 99 80 65 62 67
13399 67 74 81 92 112 141 175 203 220 228 234 243 249 244 224 191 154 122 107 109 121 133 141 146 146 139 123 102 84 75 78 91 107 115 116 114 113 111 105 99 94 91 82 69 55 47 48 56 64 65
13380 65 58 50 52 68 88 100 100 93 86 87 97 115 137 158 171 170 152 127 111 112 123 133 134 127 119 112 104 90 65 35 12 2 2 1 -4 -15 -30 -46 -56 -51 -34 -11 10 32
13362 32 58 86 108 122 127 123 107 83 61 51 55 66 73 71 62 56 62 81 107 135 159 177 185 181 168 150 127 100 68 32 0 -18 -24 -20 -11 2 22 50 84 122 156
13345 156 179 191 200 213 224 223 207 187 175 174 178 180 173 159 147 146 159 179 198 214 228 237 238 230 213 191 165 139 113 87 69 64 75 93 108 116 122 128 133 136 138 137 133 129
13328 129 130 133 130 120 110 106 105 98 80 58 41 31 27 29 36 51 70 87 93 91 84 72 50 19 -10 -28 -30 -25 -18 -16 -18 -22 -20 -11 2 13 22 36 59 85 106 118 118 109 99 98
13309 98 103 108 103 91 75 59 44 34 29 32 43 59 77 88 89 81 72 66 66 72 82 91 95 95 96 99 99 92 81 68 56 41 22 3 -3 6 30 64 99 128 144 146 142 142 151 164 179
13290 179 194 204 200 183 165 161 172 188 200 202 198 191 188 189 194 201 209 220 231 238 239 234 224 214 212 223 239 244 231 204 178 161 151 152 168 202 247 286 308 312 303 284 251
13273 251 207 162 130 115 111 107 98 84 69 64 73 93 112 121 119 115 117 129 150 169 174 154 116 80 60 60 77 100 120 128 123 111 106 113 130 147 157 159 156 156 163 179 200 221
13255 221 238 259 285 310 322 314 293 269 252 242 237 237 243 255 266 266 253 230 207 187 175 174 184 196 197 181 155 132 122 126 137 146 148 145 149 167 191 209 219 226 228
13239 228 220 201 180 166 158 151 143 142 147 149 142 130 123 125 132 140 149 160 171 175 172 169 177 200 229 252 262 259 250 238 228 225 231 242 252 258 264 268 263 243 208 175 156 149 141 123 104 100
13220 100 118 148 176 189 189 182 173 164 154 142 130 117 103 87 69 50 35 29 34 43 51 52 49 48 55 71 91 112 130 142 147 146 143 138 134 135 148 166 173 159 131 110 103 105 110
13202 110 115 125 138 149 154 151 141 125 110 96 82 66 47 27 10 -1 -6 -7 -3 7 27 52 71 82 98 126 157 170 157 127 99 81 72 74 87 107 123 131 132
13186 132 130 128 131 144 165 185 193 186 171 156 143 133 124 119 122 136 159 180 188 182 174 175 184 192 195 198 207 218 219 206 181 151 126 112 109 113 118 122 130 140 147 145 135 122 108 97 92
13167 92 96 109 118 115 98 79 69 71 83 104 126 142 147 143 141 141 133 113 88 72 70 76 91 118 153 183 205 227 252 271 273 255 230 203 171 132 88 48 13 -14 -33
13151 -33 -35 -14 27 79 127 162 185 201 211 217 217 217 218 223 236 251 257 245 218 189 171 170 183 202 219 227 226 221 215 207 196 180 161 140 122 114 115 115 105 88 79 84 102 122
13133 122 135 135 125 113 107 109 113 112 103 91 80 75 74 77 83 95 117 142 161 170 171 168 162 152 143 137 131 121 109 101 97 95 95 106 128 151 164 169 176 195 225 258 282 285 264 233
13115 233 212 207 214 225 237 246 244 227 200 173 155 146 145 148 147 139 125 109 91 73 65 73 94 113 126 134 140 143 147 158 178 203 221 229 224 212 197 184 175 172 173 181 198 219 234
13096 234 234 220 199 182 176 187 214 247 277 296 302 297 286 270 254 246 256 280 311 336 346 341 326 309 291 267 232 192 160 144 142 150 166 183 193 195 197 203 209 208 200
13080 200 189 175 155 133 114 102 99 104 117 135 153 168 179 185 189 193 198 201 196 185 176 179 194 214 231 240 239 229 216 199 176 146 113 90 81 84 96 108 114 110 100 96 108
13063 108 134 162 184 199 215 234 249 247 228 199 174 158 150 146 148 158 181 214 249 276 286 275 250 220 193 175 162 150 138 126 113 97 71 34 -8 -41
13048 -41 -57 -62 -69 -80 -86 -77 -52 -20 8 33 53 67 71 64 43 13 -14 -24 -12 13 43 66 85 106 136 177 220 252 264 259 245 231 221 210 189 159 129 115
13033 115 119 136 158 179 196 203 199 194 192 195 196 193 185 178 176 184 199 211 213 207 200 196 196 200 208 221 239 258 274 278 267 238 197 157 131 129 151 185 218 241 250 246 237 227 220 217 218 224
13014 224 227 219 196 168 151 147 147 143 135 129 125 122 118 110 101 89 79 73 73 83 102 121 131 127 118 117 134 161 186 203 212 220 230 241 247 238 209 170 135 112 97 84 70 56 46
12996 46 48 66 98 133 153 154 137 112 90 81 93 120 150 175 192 205 212 214 216 224 238 252 259 255 240 215 187 159 129 99 70 48 40 47 70 102 130 150 168 192
12980 192 219 238 241 230 207 176 149 142 157 186 217 243 260 263 253 242 243 256 275 290 297 297 288 274 260 253 256 273 301 337 379 432 500 587 696 832 981
12965 981 1099 1132 1058 912 756 632 541 472 420 386 370 363 361 361 363 369 378 391 400 403 400 394 386 379 385 413 456 499 528 546 561 580 604 633 666 706 765 854 968
12949 968 1105 1281 1524 1856 2279 2792 3364 3882 4163 4063 3604 2962 2337 1828 1436 1135 909 748 632 545 476 412 343 272 214
12939 214 180 165 160 161 166 169 163 149 134 118 103 90 82 82 89 101 116 125 124 112 99 93 94 99 104 112 126 147 172 197 220 239 254 266 274 274 267 258 249 238 218 188 152 117
12921 117 88 69 61 57 54 56 71 102 145 198 259 318 361 377 373 365 357 349 341 335 330 326 326 336 346 345 329 307 286 267 253 249 255 262 266 269 276 282 281 274 262 245 225 218 235 275
12903 275 323 366 395 406 394 365 332 308 296 293 297 306 317 325 325 316 304 294 292 295 301 314 341 379 416 445 468 494 527 570 623 687 763 859 988 1154 1351
12888 1351 1566 1775 1942 2019 1971 1802 1558 1299 1063 865 710 601 532 488 452 419 386 353 318 278 234 189 151 125 113 104 95 91 100 120 141
12876 141 155 162 166 165 163 163 169 177 180 181 185 192 195 192 183 169 148 127 115 120 131 134 121 101 87 83 86 91 93 88 76 61 50 41 30 19 13 18 33 54 81 111 143 174 203 228
12857 228 245 250 245 240 239 239 235 223 201 174 146 126 111 97 81 68 64 67 74 87 105 125 143 159 172 176 170 160 153 151 149 149 153 159 163 160 155 155 164 179 194 202 197 183 164 148
12839 148 131 110 86 65 54 55 67 85 103 118 132 146 159 167 171 178 191 210 230 245 256 261 259 248 234 222 213 203 188 174 167 167 169 170 174 183 190 185 165 137 108 84
12822 84 65 50 42 42 54 76 100 123 144 165 185 199 206 207 209 210 203 185 158 128 102 82 74 82 103 131 155 170 176 178 184 198 212 212 191 155 123 105 99 99 104 115 129
12805 129 132 118 90 63 46 39 34 23 3 -17 -31 -34 -30 -26 -28 -33 -32 -21 -6 7 17 31 49 67 83 95 101 99 96 103 122 145 158 157 148 131 108 86 74 77 89 101
12788 101 112 120 121 114 108 111 122 128 125 117 114 115 118 121 127 132 139 148 159 165 161 151 143 137 125 104 88 83 86 87 83 83 92 108 129 152 174 190 203 220 241 256 257 249 244 246 250 249 241 225 198
12767 198 164 132 110 101 101 106 113 121 130 137 144 150 157 165 172 176 175 175 178 185 192 196 200 209 224 238 241 229 210 197 191 187 176 160 142 120 91 61 37 26 29 44 70 103 131 147 148
12748 148 140 132 126 124 125 131 136 136 133 130 130 132 132 131 132 134 134 127 115 107 109 117 126 133 137 142 147 149 148 144 143 151 170 192 207 207 193 172 151 133 116 96 73 48 27 15 11 9 5 -1 -5 0 16
12727 16 41 65 83 95 103 109 116 128 143 159 174 190 212 234 243 240 236 237 243 246 245 243 242 239 237 239 247 257 265 266 258 243 221 197 172 150 135 121 104 87 84 99 117 124 122 124
12709 124 130 130 120 113 122 141 154 156 151 147 148 154 158 154 140 122 108 97 86 77 77 86 98 107 108 100 83 67 56 47 38 35 44 61 72 73 72 75 82 89 94 97 96 92 91 93 93 90 90 98 110 122
12688 122 137 161 191 212 216 205 193 190 197 210 223 234 242 249 252 249 240 223 199 174 153 142 139 138 132 117 100 85 75 69 67 70 75 83 94 112 129 136 131 127 136 155 170 177 181
12670 181 186 185 176 165 159 163 174 192 212 225 225 215 204 194 181 165 148 136 131 129 126 123 126 139 157 169 166 153 140 136 139 146 154 164 176 189 199 203 201 198 200 205 211 213 208 198
12651 198 186 173 164 165 180 212 245 262 251 219 186 165 160 163 167 170 175 185 198 205 201 188 173 159 147 142 147 155 155 145 133 125 120 116 115 119 124 121 107 87 67 47 23 -8
12633 -8 -44 -77 -94 -90 -66 -32 3 35 64 90 115 140 163 185 204 219 229 234 229 212 187 163 145 133 126 119 111 103 95 93 99 112 127 137 141 139 145 171 217 274 338 414
12617 414 500 569 590 555 488 423 373 334 301 274 251 228 204 179 157 142 140 151 167 178 177 163 138 108 82 66 64 72 85 98 107 111 112 118 135 163 196 223
12601 223 232 218 188 156 138 138 152 173 190 200 202 201 200 199 200 201 195 179 156 135 120 112 111 120 134 141 136 124 114 106 95 79 64 53 50 53 61 73 82 86 83 74 59 39 23
12583 23 21 34 59 92 134 186 237 274 291 289 276 259 245 240 240 238 231 217 199 178 155 133 113 98 90 91 102 115 124 124 121 118 116 113 107 99 90 80 67 54 46 50 70 99
12566 99 126 144 152 156 160 170 190 216 233 230 213 199 195 195 194 195 204 212 204 183 165 163 171 177 177 177 178 175 169 167 178 204 238 271 292 293 280 266 266 279 294 304 310 314 314 307 292 271
12546 271 245 213 182 162 161 175 196 220 243 259 260 243 218 195 180 170 160 154 153 159 167 176 184 193 198 196 190 185 185 195 215 247 283 313 324 319 306 296 287 274 254 234
12529 234 220 216 219 223 226 228 238 258 286 313 334 347 356 365 382 411 443 461 464 465 489 545 622 702 775 843 911 979 1044 1105 1168 1237 1311 1384 1447 1502 1549 1589 1621
12514 1621 1641 1648 1635 1599 1544 1480 1407 1321 1217 1103 989 886 797 722 657 598 544 498 461 429 397 363 334 316 311 318 332 346 357 360 353 337 314 291
12500 291 275 268 265 258 246 235 229 225 222 220 221 222 216 201 181 162 150 148 160 183 208 222 217 197 171 150 140 141 148 157 166 178 195 214 226 228 219 207 197 190 184 177 168 153 137
12482 137 130 140 163 184 194 191 183 180 187 202 211 197 160 115 84 68 58 48 39 38 46 57 61 53 34 13 3 13 35 58 70 74 74 75 78 82 86 88 89 89 92 103 118 127 122 106
12464 106 95 102 120 136 139 133 121 107 95 90 97 108 112 107 99 91 80 66 54 54 66 85 104 123 140 156 174 195 215 230 237 237 235 231 226 216 201 181 155 128 108 98
12447 98 93 88 78 65 57 58 63 69 76 85 94 97 92 84 79 81 88 101 117 133 148 160 172 184 197 212 227 235 231 216 195 174 163 167 183 202 211 205 187 161 133 113 108 115 121 115 97
12428 97 75 57 42 31 25 29 46 74 102 117 116 105 96 92 90 89 95 113 139 165 183 189 185 179 175 174 170 160 147 139 137 135 128 114 97 80 64 50 41 39 43 56 75 97 116
12410 116 131 144 156 166 175 182 187 184 171 155 144 139 139 143 149 156 159 162 168 178 182 173 159 150 150 157 166 178 193 211 228 237 233 218 199 179 158 138 125 123 128 134 142 158 178 193
12391 193 202 214 235 260 278 286 282 268 248 229 216 209 201 194 191 192 186 166 136 110 98 101 112 127 143 160 171 175 174 172 168 154 128 92 52 16 -9 -16 -2 26 57 80
12374 80 95 107 121 136 147 148 140 126 109 93 83 86 102 121 132 130 117 99 82 67 61 66 83 104 119 124 122 121 128 144 163 181 191 196 199 203 207 209 210 213 220 225 221 202 176
12356 176 155 147 143 137 130 132 145 162 171 174 178 190 202 206 194 165 127 92 70 65 71 89 119 157 193 216 225 224 220 216 208 192 165 130 93 64 52 62 88 114 125 121 112
12339 112 103 95 89 90 100 115 130 144 159 170 175 180 192 211 227 229 218 200 185 176 168 150 121 89 65 48 29 7 -14 -30 -37 -34 -19 3 23 34 40 52 69 84
12323 84 90 84 72 62 61 72 91 116 141 159 167 174 184 196 201 199 194 187 168 133 97 77 76 85 93 97 96 98 110 132 149 144 118 85 57 38 27 27 40 63 87 108 120
12306 120 121 118 119 130 147 162 174 182 188 195 200 200 189 166 135 104 78 61 57 64 73 70 47 11 -23 -45 -46 -27 3 38 70 93 102 97 89 86 91 99 103 104 104 106 107 104 92 76 66
12287 66 69 85 102 108 102 88 73 61 60 75 103 129 141 143 148 165 188 205 209 200 188 183 189 199 204 198 189 183 185 188 187 182 177 175 176 179 187 202 224 248 261 256 238 219 209 208 207 199
12268 199 187 176 169 167 168 169 167 159 149 144 149 161 175 183 181 166 141 115 97 88 80 71 66 71 85 101 117 129 133 123 100 73 54 49 57 67 74 76 82 95 116 141 164 176 175
12250 175 164 155 152 154 155 159 172 190 206 212 205 184 157 133 119 109 92 63 31 4 -18 -35 -42 -37 -24 -13 -6 0 8 17 27 38 46 52 58 68 76 76 68 58 50 45 45 54 68 80
12231 80 85 86 86 86 89 101 123 143 151 145 135 132 136 141 146 156 168 179 181 171 151 127 105 93 90 92 96 105 120 134 137 127 108 90 77 68 63 64 69 72 65 50 33 23 24 31 43
12212 43 63 92 122 147 166 180 189 189 181 170 160 149 130 106 84 77 91 125 163 191 199 193 184 177 174 178 185 186 171 147 132 136 156 178 193 203 209 213 215 212 203 189 174 162
12195 162 153 143 138 141 150 155 149 136 127 130 138 140 127 101 74 60 62 75 94 117 144 172 193 203 207 213 221 226 225 221 219 224 232 237 232 217 193 166 143 130 134 152 175 191 191 181
12176 181 168 160 159 165 177 187 188 184 177 172 166 158 150 140 129 122 123 131 136 135 131 128 127 128 131 136 135 125 112 103 99 94 84 72 59 44 30 29 45 70 90 100 104 103 96 79 57 37 27
12156 27 29 41 62 90 123 152 172 177 171 160 140 111 80 63 71 97 124 138 137 126 112 100 91 85 79 76 78 91 114 140 164 185 200 209 212 215 227 246 263 267 262 254 243
12139 243 220 179 131 93 70 57 45 31 22 22 37 68 108 152 195 233 264 282 282 267 244 216 186 158 138 128 132 147 165 174 170 160 154 151 145 132 121 118 120 124
12123 124 131 141 154 166 174 174 165 148 127 107 91 81 83 95 113 131 144 150 145 129 104 80 61 47 37 31 26 18 6 -2 -3 9 30 54 73 86 95 100 97 83 66 57
12106 57 61 68 67 56 44 36 35 40 50 64 79 93 100 95 76 54 36 19 -1 -21 -33 -34 -26 -13 9 41 74 95 99 89 75 64 58 56 53 47 40 38 39 33 16 -9 -33 -48
12089 -48 -52 -43 -20 13 47 72 85 96 114 135 152 158 159 167 185 203 212 212 215 225 241 250 247 233 211 187 166 156 160 178 199 213 217 219 232 257 284 299 298 287 273 250
12072 250 212 166 126 103 92 86 78 71 68 67 65 62 61 65 72 78 84 95 112 132 155 179 201 214 215 212 215 226 234 227 200 159 115 81 68 72 79 77 65 51 43 44 54 70 84
12054 84 90 95 108 126 140 147 151 159 171 183 188 177 149 112 79 52 26 -2 -27 -38 -31 -7 24 56 77 86 94 107 124 141 157 178 199 210 209 203 201 203 207 214 218 213 195
12036 195 171 145 113 70 22 -15 -30 -23 -2 26 58 88 116 142 163 173 173 166 158 151 149 156 169 177 171 152 135 132 141 154 160 156 146 139 144 159 172 167 139 100 70 64 85
12019 85 121 157 179 182 170 153 136 123 111 101 94 93 96 97 91 81 73 73 80 92 108 127 143 149 144 133 127 133 144 153 152 140 122 107 100 99 98 96 98 112 142 181 219 243 249
12001 249 239 219 198 180 173 180 206 251 317 405 514 631 736 802 811 760 662 544 438 364 321 294 266 238 219 212 210 204 193 176 152 121 88 61 44
11987 44 40 50 73 103 129 145 155 167 181 186 177 161 155 165 182 194 197 192 184 179 178 181 178 165 151 144 142 137 125 117 116 111 96 76 61 54 46 40 41 54 68 76 78 84 98 119 139
11968 139 150 146 130 107 87 81 92 114 135 147 155 166 180 190 192 190 192 199 206 208 207 204 196 182 159 132 101 73 50 34 28 31 41 52 62 67 67 62 56 55 63 79 96 111
11950 111 118 115 105 88 68 51 41 44 53 60 62 64 67 69 67 68 72 73 66 58 60 81 115 149 172 177 171 166 171 185 201 217 231 241 238 220 196 176 166 167 178 189 185 160 128 104
11932 104 93 90 88 85 80 73 70 75 83 91 95 99 103 103 102 105 110 113 116 124 140 154 159 151 135 114 94 80 75 79 86 97 110 120 116 100 79 67 70 82 96 102 100 98 103 117 132 139 137 136 144
11912 144 162 182 196 204 211 223 234 232 210 175 139 112 102 109 132 159 173 169 154 142 136 124 99 66 37 17 6 7 23 52 87 117 136 143 142 139 139 142 148 155 163 175
11895 175 190 202 207 201 187 167 149 136 129 125 121 116 114 116 120 120 115 111 107 102 94 82 71 66 75 98 126 141 137 121 107 100 100 103 108 111 107 99 94 96 106 118 125 123 111 98 93 103 124
11875 124 152 180 199 200 192 191 204 222 230 224 213 202 187 167 147 132 126 132 148 161 163 152 136 125 119 117 117 115 111 106 109 122 138 145 138 128 125 133 145 152 147 132 116 104 102
11857 102 109 115 111 94 71 52 43 42 47 59 80 104 124 133 131 126 128 137 147 149 144 139 134 124 105 88 83 89 95 92 81 69 62 60 61 62 63 66 74 86 98 106 112 123 139 157 167 164 152
11837 152 138 129 126 123 113 95 78 75 91 115 134 137 126 110 97 87 80 76 76 78 87 103 129 163 200 228 237 227 205 181 162 150 145 146 147 144 136 126 114 100 91 94 108
11820 108 120 115 98 86 93 111 124 122 111 99 89 77 68 70 83 103 120 134 150 167 181 184 178 169 161 154 143 131 126 135 151 163 163 155 149 147 150 153 157 161 165 168 169 168 165 158 142
11801 142 114 81 55 48 59 79 101 122 140 158 174 187 194 193 184 164 134 100 74 61 56 51 47 53 70 89 103 112 116 115 110 109 114 125 136 146 154 157 148 131 114 107 114 132
11783 132 155 176 189 195 203 213 217 207 183 156 134 117 105 99 105 126 152 171 178 180 184 190 194 193 189 180 165 147 139 147 165 181 189 188 181 169 155 150 164 193 217 219 199 173
11766 173 156 147 134 112 87 69 59 56 63 82 111 139 162 177 189 197 196 188 178 174 178 186 189 182 169 158 153 156 165 179 197 209 212 210 214 228 248 265 277 282 278 268 259 261 271
11748 271 277 274 265 258 252 239 220 200 187 177 165 151 135 120 105 93 84 81 86 99 118 138 151 156 158 164 175 190 201 206 205 200 192 179 160 140 125 116 111 105 100 98 96 88 74
11730 74 66 74 96 119 128 120 104 90 83 82 82 83 90 106 129 150 155 142 118 93 76 70 70 72 73 75 83 98 119 141 159 166 160 144 126 111 99 91 89 96 110 126 139 145 141 125
11711 125 104 90 88 93 97 101 109 125 145 163 172 173 171 168 168 171 172 164 146 124 105 92 84 76 69 66 71 86 104 113 109 95 79 61 43 26 17 19 29 41 56 76 100 122 142
11693 142 160 179 193 200 201 198 192 185 180 180 181 180 176 173 170 169 172 181 200 219 230 230 223 212 199 189 185 186 186 182 177 179 190 206 224 240 251 258 264 272 281 285 278 256 224 189 155 127 103
11673 103 79 60 50 55 72 96 122 145 163 179 191 200 209 218 229 236 235 223 205 189 180 181 187 194 201 210 219 221 209 180 139 94 54 27 16 19 26 36 51 68 82 90 95
11656 95 101 105 107 107 109 112 111 109 106 100 94 91 94 101 105 104 104 105 108 114 125 143 160 172 176 173 165 153 137 118 96 76 64 60 64 75 96 124 150 165 167 158 143 127 115 110 109 111 120 132
11636 132 140 139 132 127 124 120 117 123 140 161 183 200 212 216 209 190 156 114 78 57 48 45 51 73 108 143 168 187 206 220 222 216 213 220 235 251 260 255 240 220 201 184 173 170
11618 170 172 172 168 164 167 178 192 209 228 244 244 224 191 156 125 98 75 59 47 36 25 14 7 6 14 30 50 68 81 89 92 90 83 73 68 72 81 86 77 53 25 5 -2 1
11601 1 14 37 67 95 111 111 102 94 89 87 84 81 80 80 81 86 97 118 145 171 189 194 192 194 206 224 240 246 244 238 232 226 219 212 204 197 192 189 183 169 145 121 109 109 114 115 113 114 123 139 156
11580 156 171 185 200 214 220 213 201 197 208 229 248 263 275 280 268 234 183 130 85 56 46 54 74 100 123 141 151 160 171 183 184 171 152 140 140 144 148 151 150 145 141
11564 141 143 150 154 150 144 146 157 169 176 178 177 174 167 159 153 155 164 176 186 191 191 187 178 169 164 163 162 163 170 186 206 221 231 236 235 230 223 222 228 238 245 246 239 227 218 219 229 237 238 230 213 188 164 151
11542 151 150 151 144 132 129 140 160 183 201 206 191 158 120 85 53 23 -4 -25 -33 -26 0 39 81 117 146 170 192 205 205 195 182 174 177 187 195 197 196 200 211 218 216 206
11525 206 200 207 221 231 228 210 190 178 177 181 183 185 189 196 203 207 207 206 206 203 196 182 166 149 129 102 75 61 68 89 108 116 121 128 138 141 136 127 123 128 139 151 159 159 153 139 118 91
11506 91 70 65 78 100 124 150 180 215 251 276 278 256 220 191 178 179 183 186 191 196 196 186 168 149 132 119 106 95 88 84 82 79 78 85 103 125 141 143 132 118 112 119 133
11489 133 140 131 111 92 77 62 45 31 32 49 71 90 100 102 95 85 83 96 121 147 161 161 154 148 148 153 159 164 166 164 160 156 154 152 147 141 141 149 160 172 182 192 197 192 182 178 188
11470 188 203 212 207 193 181 176 181 195 215 235 249 254 253 252 255 252 229 186 142 114 104 102 102 107 119 132 141 152 166 181 188 184 180 181 189 199 205 205 200 195 196 202 207 205 198 192 191 195 207
11450 207 225 239 238 220 199 191 202 217 220 207 189 172 160 151 147 149 156 166 174 182 190 197 204 208 211 214 214 210 205 205 213 226 234 227 203 166 129 100 81 71 67 72 84 97 106 113 123
11431 123 136 151 169 187 197 191 169 140 116 98 88 88 100 116 130 138 144 145 133 105 72 50 50 72 106 143 171 184 178 159 137 120 109 100 92 86 85 85 87 91 99 111
11414 111 130 158 194 230 250 247 225 198 171 141 101 51 2 -27 -29 -8 22 51 79 107 131 147 152 155 164 180 194 198 187 162 129 96 69 51 44 52 73 99
11399 99 119 129 130 133 138 141 138 134 139 151 163 166 162 159 160 167 180 199 219 233 235 232 234 240 240 226 199 173 156 149 148 151 151 145 137 132 132 134 138 152 182 219 245 253 246 231 212 193 182
11379 182 185 196 203 200 188 176 170 173 180 185 183 175 169 169 170 167 154 135 118 109 106 105 104 104 103 94 76 62 67 87 108 121 126 127 122 109 92 77 73 81 98 116 125 126 124 123 122 120 124 138 159
11359 159 177 188 192 189 176 154 128 109 103 106 111 110 100 88 88 105 133 160 178 185 183 173 156 138 122 115 118 130 142 146 139 127 120 123 135 147 151 149 148 156 170 179 178 171 165 162
11341 162 157 151 149 150 147 128 95 59 35 29 37 54 71 84 94 101 108 116 134 162 189 201 194 178 166 159 154 149 148 148 143 132 122 124 143 175 209 231 237 227 208 187 170 155
11323 155 142 131 125 125 126 125 119 109 92 73 59 57 63 65 55 34 10 -5 -10 -3 12 34 56 72 79 82 92 114 142 163 172 173 176 184 199 215 222 214 194 181 183 195 201 195 178
11305 178 154 125 99 85 89 104 112 103 78 44 13 -4 -2 13 32 45 50 50 46 35 14 -9 -27 -37 -43 -51 -59 -62 -61 -60 -56 -44 -29 -17 -17 -25 -36 -46 -54 -53 -37 -7 25
11287 25 56 79 91 91 79 68 66 76 89 97 93 81 67 54 44 37 35 38 40 42 45 53 64 75 84 94 102 106 103 99 99 103 110 119 134 159 184 195 185 162 145 142 149 155 154 146 132
11269 132 113 91 72 61 58 56 52 48 55 77 103 118 118 110 102 97 92 91 95 95 84 64 45 31 17 -3 -22 -30 -20 0 24 41 50 55 69 97 130 151 158 159 160 161 159 159 165 175
11250 175 177 167 146 122 104 89 79 74 79 87 88 76 58 45 39 38 42 52 64 69 60 48 43 51 65 81 95 108 117 121 123 127 139 160 185 199 193 169 141 124 124 134 145
11233 145 148 145 142 149 170 201 227 241 240 229 216 207 202 196 184 171 165 168 176 183 189 190 181 162 136 113 100 89 69 32 -11 -48 -62 -56 -37 -15 3 17 26 32 38 43 46 47 42 29
11214 29 7 -11 -12 8 40 70 93 105 105 89 59 29 9 8 24 50 73 81 80 80 88 95 95 88 88 102 125 141 140 122 97 78 74 84 103 124 145 164 181 187 180 162
11198 162 145 137 145 165 189 210 223 235 250 269 281 277 259 236 215 196 178 161 146 132 117 103 92 83 77 75 77 78 77 76 81 93 106 118 127 129 116 94 77 74 77 71
11181 71 54 39 42 62 86 100 98 80 53 31 28 52 89 122 138 135 121 100 81 67 59 54 47 38 32 33 40 53 67 72 63 41 16 -3 -12 -12 -5 3 9 9 6 2 0 -1 -1 1 5 9
11161 9 14 23 37 50 56 52 45 43 49 60 66 68 73 85 98 108 112 114 109 93 68 47 42 56 75 86 79 54 23 0 -1 16 43 69 87 98 107 118 134 154 172 182 185 185 187
11143 187 192 197 196 191 187 188 192 188 168 135 99 72 60 64 80 95 104 108 118 137 157 167 167 163 162 162 160 152 143 137 135 131 122 109 99 97 99 103 112 133 165 196 209 194 158 119 86
11124 86 65 56 63 87 122 150 162 158 147 136 126 113 94 68 42 29 34 52 70 76 71 62 57 58 62 65 61 53 47 47 54 65 78 92 105 107 92 63 28 1 -4 11 42 78
11107 78 108 129 142 147 143 132 122 116 113 106 90 71 57 51 47 40 31 28 36 51 66 77 88 104 123 140 152 159 160 151 129 95 56 22 6 10 33 63 93 116 125 112 78
11090 78 37 3 -18 -28 -28 -20 -11 -7 -2 17 54 91 112 115 111 107 103 98 95 98 108 119 126 125 121 125 137 144 135 114 94 78 65 59 66 82 89 74 48 27 15 8 3 8 24 44 62
11071 62 76 86 93 96 104 120 141 159 168 172 175 178 175 163 142 120 105 101 100 98 95 101 118 142 164 177 181 181 180 182 186 188 184 170 146 117 92 80 82 93 103 107 102 90 70 47
11052 47 29 24 38 68 103 130 144 150 157 168 180 188 190 186 173 151 118 79 40 12 3 16 47 85 118 140 149 150 150 154 157 153 145 143 158 193 236 270 284 274 246 207
11035 207 160 113 77 58 55 61 75 97 122 144 157 162 160 150 134 121 113 105 96 92 97 106 103 80 46 16 -1 -5 -1 0 -4 -14 -23 -25 -21 -11 4 26 49 64 70 71 73 83 102
11017 102 126 145 157 167 182 201 216 223 226 229 232 226 208 184 163 153 153 162 173 181 182 168 140 106 78 62 57 58 61 62 58 46 32 20 19 26 38 49 58 63 66 68 71 76 86
10999 86 102 119 129 126 114 103 96 91 85 77 67 58 54 62 85 113 136 152 170 195 217 223 207 178 153 134 118 98 77 64 63 71 82 95 110 132 157 179 193 196 196
10983 196 201 216 237 254 257 245 227 215 215 226 240 248 244 224 194 162 137 125 125 133 142 146 141 133 133 148 174 198 213 219 218 208 181 140 95 59 39 37 52 75 99 116
10966 116 127 136 148 162 175 185 191 195 197 195 192 187 179 166 149 132 115 97 78 59 45 35 30 38 59 86 110 126 134 136 133 130 133 144 159 177 198 223 249 267 272 264 245
10949 245 226 214 215 217 208 184 161 152 161 178 191 197 199 198 192 186 186 193 202 205 202 199 198 198 193 182 168 154 147 151 163 175 178 173 170 176 194 212 215 196 161 126 98 72 46 25 13
10930 13 7 1 1 14 38 65 88 108 125 128 105 61 11 -24 -39 -39 -33 -25 -12 3 18 28 32 41 62 87 108 124 148 185 224 246 245 228 206 186 170 161 162 169 179
10913 179 186 183 165 136 110 96 92 91 91 92 95 92 82 68 55 46 38 30 22 15 14 21 36 47 43 26 3 -16 -36 -59 -80 -87 -74 -47 -17 13 46 77 100 104 92 74 58
10896 58 50 50 57 69 80 91 105 122 138 145 143 138 133 127 112 91 73 67 73 83 88 91 100 119 144 172 199 224 242 249 241 220 191 162 144 142 154 169 180 182 179 176 175 171 160
10878 160 142 127 123 126 129 126 118 109 100 95 96 99 100 96 87 78 75 82 96 106 107 104 107 118 133 150 168 183 186 174 153 136 130 138 152 159 152 140 139 155 177 188 184 172 160 147 136
10859 136 130 130 132 131 129 127 125 126 129 129 125 118 113 114 117 119 123 131 137 136 130 124 123 124 122 115 110 110 116 123 124 118 107 94 85 79 78 77 72 58 38 21 14 15 17 18 23 38 62 84 92 87 78 73 71 72 80 97 118
10835 118 137 145 139 119 91 67 53 47 41 33 25 23 30 40 46 49 57 74 95 108 105 87 58 25 -2 -15 -9 10 31 46 57 66 72 70 60 48 36 29 30 42 66 97 130
10818 130 160 182 190 182 165 149 139 131 122 116 122 138 156 168 173 179 186 187 174 148 116 89 77 81 95 111 123 128 128 125 128 143 167 188 196 195 193 196 199 196 181 155 126 105 99
10800 99 106 119 133 144 148 142 125 105 86 69 52 33 21 27 56 99 140 165 175 176 176 171 154 125 95 75 73 81 86 80 70 63 64 70 76 80 88 104 129 158 180 191 192 191
10782 191 191 191 186 177 167 157 149 143 141 138 129 114 97 84 74 60 37 9 -19 -41 -52 -52 -43 -26 -4 19 39 52 57 58 65 84 115 146 161 153 133 114 106 108 118 129 134
10765 134 131 125 124 128 130 134 146 171 195 209 215 223 233 238 233 219 199 172 136 99 66 45 37 38 42 43 42 41 38 27 9 -6 -8 3 21 39 51 51 42 30 24 24 24 28 41 61
10747 61 79 93 108 125 135 134 132 143 162 174 166 142 112 83 61 49 49 53 53 49 44 42 40 40 40 42 40 35 26 17 10 8 16 32 53 76 97 115 131 144 152 155 153 146 136 127 122 120
10727 120 117 114 116 125 136 141 138 129 119 114 111 108 99 83 66 57 58 64 66 57 31 -8 -51 -79 -80 -57 -27 0 21 40 56 63 61 57 56 59 61 64 73 92 115 133 136 125 106 88 78
10708 78 79 90 109 125 128 113 89 72 75 97 129 162 190 212 225 224 214 203 200 204 208 210 210 212 213 211 207 204 206 215 228 238 237 224 208 197 195 200 209 212 201 173 139 109 86
10690 86 66 52 51 70 109 158 207 247 267 270 265 261 255 242 218 189 161 139 127 125 129 128 119 107 99 90 73 45 13 -15 -39 -56 -64 -62 -52 -39 -26 -14 -5 1 8 17 24 27
10673 27 25 21 18 13 4 0 10 37 71 104 134 165 194 211 209 195 180 167 151 126 97 78 75 82 89 88 80 62 35 5 -15 -22 -20 -14 0 27 63 95 113 117 114 106 96 89
10655 89 83 80 81 85 91 93 88 81 75 72 70 69 71 68 57 43 36 39 44 37 16 -6 -19 -16 -1 21 45 65 77 79 77 72 66 65 74 96 129 165 197 222 235 237 231 216 189 154 128 127 147
10635 147 170 176 165 148 141 150 175 206 229 237 227 208 180 148 120 106 110 122 127 123 115 112 113 115 117 121 128 132 133 132 131 135 144 155 161 159 146 130 116 106 103 111 134 168 202 227
10617 227 235 228 212 191 168 147 134 130 131 134 136 138 140 139 132 124 120 120 118 111 98 82 67 57 56 61 68 73 75 75 69 55 37 24 13 1 -11 -15 2 36 68 83 83 80 84 94 105
10598 105 108 97 76 56 51 65 84 96 96 91 85 82 82 87 88 80 62 44 32 25 20 20 30 48 66 76 78 79 85 101 123 139 143 135 123 111 101 94 91 90 88 85 86 92 97 94 82 71
10579 71 71 83 99 110 114 114 115 122 137 157 178 191 193 187 175 159 141 125 114 102 86 67 54 46 39 25 5 -15 -28 -31 -27 -25 -31 -42 -48 -40 -17 10 36 55 65 67 63
10562 63 57 52 54 62 72 78 86 102 123 133 124 101 81 66 53 39 24 13 9 14 32 60 91 119 142 160 173 178 176 169 158 145 133 124 125 138 157 168 166 158 150 142 128 113
10544 113 107 110 112 105 95 94 110 141 180 215 233 238 243 258 270 267 254 247 257 272 277 267 243 209 171 141 127 130 148 177 208 229 237 240 249 261 265 257 241 221 194 160
10527 160 125 99 86 81 80 79 80 86 101 120 134 138 137 139 144 146 141 132 127 132 147 169 192 212 225 227 220 207 191 174 154 132 114 106 109 120 134 153 177 202 222 229 224 210
10509 210 192 180 175 173 168 163 165 174 183 186 189 192 185 161 130 113 122 146 171 187 194 191 176 152 125 102 88 86 95 111 133 160 189 212 225 231 240 250 256 250 239 232 232 236 236 228 214
10490 214 196 175 154 134 120 110 109 119 138 160 174 172 159 143 129 116 106 104 112 123 129 127 124 125 133 147 166 184 195 194 187 179 171 158 137 111 86 63 39 20 17
10474 17 33 58 80 92 101 109 114 119 130 151 168 168 151 127 108 98 100 115 135 142 130 106 92 94 107 118 122 119 117 121 135 151 159 155 146 142 146 153 163 176 195 216 231 229
10456 229 212 190 174 173 184 199 207 203 185 160 137 119 104 91 83 87 107 134 155 156 136 108 87 81 90 108 127 144 159 176 200 228 249 260 261 252 234 208 179
10441 179 152 127 104 85 73 65 54 38 24 19 21 22 21 21 27 31 25 10 -4 -8 -4 0 -1 -3 -2 4 17 38 64 86 94 85 68 56 54 59 62 57 42 22 1 -12 -19 -19 -13 -6 0 6
10421 6 15 32 53 71 83 90 95 96 90 77 59 43 32 28 33 45 60 71 75 74 77 90 109 126 135 144 161 186 204 201 171 125 78 48 43 62 90 115 131 140 145 145 140 136 137
10403 137 142 152 168 185 193 187 178 189 223 267 299 314 314 302 283 269 266 266 259 243 226 213 201 187 172 153 131 109 96 91 87 75 63 63 72 77 72 62 57 59 60 57 51 44
10386 44 38 34 38 49 68 89 106 117 125 130 130 119 100 85 83 92 105 119 136 147 143 123 97 74 54 36 19 5 -11 -30 -44 -45 -33 -16 -1 13 29 40 44 47 54
10369 54 64 74 87 109 137 158 162 147 122 92 63 37 17 8 12 23 32 29 16 2 -4 -2 6 21 38 53 64 77 95 118 137 148 152 151 145 138 135 135 133 123 109 98
10352 98 92 89 94 109 133 156 168 167 162 166 182 200 207 201 190 181 169 150 129 115 108 104 98 92 82 64 40 19 10 13 26 48 74 96 111 123 140 158 170 170 162 151 138
10335 138 127 119 108 93 78 75 83 92 98 112 140 174 196 197 183 165 148 130 117 110 110 110 103 90 80 77 78 74 67 65 79 105 130 144 145 139 131 123 115 105 89 69 46 26
10317 26 13 9 9 10 9 6 4 6 14 32 56 77 88 94 107 130 157 175 174 159 142 132 129 131 135 141 146 143 127 104 90 92 102 109 102 79 45 6 -31 -62 -82 -89 -79 -52 -17
10299 -17 13 34 48 60 67 58 33 2 -20 -32 -34 -27 -10 12 32 41 43 44 50 63 81 103 126 147 168 185 190 177 150 123 107 104 109 118 126 129 129 128 126 127 138 161 189 204
10282 204 200 182 164 155 156 165 183 206 227 240 242 237 231 227 225 225 232 243 250 245 227 207 189 177 171 174 185 193 191 180 168 164 169 177 183 182 178 177 182 192 203 213 217 213 204 197 193 185 169 149
10262 149 134 119 99 76 63 70 92 116 136 151 163 170 174 178 184 192 193 181 162 150 154 169 184 194 200 199 189 174 169 179 192 197 197 202 211 214 203 183 166 162 168 173 167 154
10244 154 147 158 179 194 194 183 174 169 162 150 134 120 112 109 107 103 99 97 96 101 111 121 119 104 87 82 90 100 105 109 118 133 145 148 143 134 126 121 121 125 129 128 122 117 116 122 135 150 159 154 134
10223 134 109 93 91 97 108 120 131 133 128 126 137 162 193 218 229 222 206 194 196 207 214 210 195 171 144 124 122 138 160 178 190 195 193 182 168 157 151 148 147 150 156 160 162 164
10206 164 170 177 180 174 161 145 131 122 119 120 122 120 108 91 78 78 88 102 114 125 138 156 173 184 182 170 152 133 120 122 140 165 180 182 182 185 186 181 174 176 182 181 168 154 146
10188 146 143 136 127 121 122 128 136 141 138 129 118 108 90 64 39 30 36 39 26 1 -16 -13 13 52 91 119 131 127 111 87 64 48 40 32 24 21 27 37 41 35 27 23 25 30 34 38 41 40 37 32
10168 32 26 20 15 12 15 24 36 42 36 22 8 4 10 19 28 41 65 95 122 136 142 147 158 172 187 205 227 246 255 251 241 231 219 203 185 168 154 148 152 166 185 204 219 223
10150 223 208 176 141 123 122 127 126 119 114 118 133 153 169 174 169 161 147 125 100 81 74 71 65 59 62 77 100 124 145 162 176 190 206 224 242 258 267 265 250 226 199 171
10133 171 143 123 117 127 145 162 176 187 198 208 213 214 213 214 221 231 242 249 245 227 202 185 183 192 204 216 229 234 226 205 182 161 143 131 130 136 141 137 125 108 89 66
10116 66 45 33 38 60 95 127 146 157 171 189 199 192 178 174 184 199 210 217 224 232 233 223 201 178 164 159 154 143 131 130 141 154 161 163 166 174 183 188 185 173 154 131 109
10099 109 89 72 57 47 48 61 78 94 114 143 172 184 174 155 145 143 142 137 131 123 113 112 127 154 177 188 184 166 137 106 87 81 72 53 35 33 53 85 118 146
10083 146 163 165 157 146 136 131 131 133 133 127 117 108 104 108 120 136 150 156 156 155 158 164 171 175 171 158 141 126 114 98 76 53 40 42 54 68 80 93 109 128 144 151 149 142 139 139
10064 139 134 119 94 66 42 31 35 51 71 81 75 54 33 28 44 71 88 86 68 51 45 49 56 55 45 33 29 40 61 84 101 109 109 105 105 113 127 141 148 148 137 116 89
10047 89 66 57 65 80 93 100 107 119 141 168 189 195 189 181 175 164 143 115 88 68 54 44 35 31 35 48 61 65 59 47 35 23 11 3 2 9 22 42 64 78 80 77 86 108
10029 108 130 141 143 146 153 163 172 180 185 186 188 192 197 197 191 178 160 136 114 102 103 110 113 112 109 110 116 122 125 127 133 148 167 178 175 161 144 130 123 125 135 147 155 159 166 179 195 203 192
10010 192 157 108 65 49 59 83 105 123 142 161 181 198 209 205 183 149 114 88 72 62 57 57 58 61 71 90 114 133 142 146 151 156 156 146 133 127 132 148 169 188
9994 188 198 194 179 163 157 160 163 161 159 161 163 158 142 121 98 86 97 132 176 210 227 233 237 234 221 202 182 165 145 121 98 80 72 71 75 79 83 88 97 104 102 92 77 61 54 64
9975 64 97 138 166 167 144 106 58 6 -37 -62 -64 -52 -37 -23 -8 10 30 50 68 82 90 86 76 69 72 83 95 104 107 98 76 49 31 29 39 50 59 65 70 72 75 81 91
9958 91 103 119 138 155 164 168 180 201 219 216 197 177 164 154 145 140 143 148 151 155 163 173 180 181 175 160 137 113 92 77 69 73 93 124 155 177 191 202 214 227 243 256 259
9941 259 252 237 217 191 160 135 123 119 114 105 94 86 81 77 76 75 75 79 87 101 117 133 148 157 156 148 143 150 168 187 195 191 181 175 176 182 188 194 200 200 195 186 178 170 157 138 116 98 93 103
9921 103 122 139 144 139 129 115 93 62 34 24 34 47 51 45 39 35 28 12 -7 -15 -1 27 60 88 113 135 150 156 154 150 146 142 137 129 122 119 122 127 132 134 134 130 124 121 128 149 179 206
9901 206 226 240 248 253 253 245 229 204 173 141 116 102 96 93 85 75 69 71 75 72 62 49 41 41 47 56 68 84 106 130 149 158 159 156 149 136 117 97 88 95 114 137 155 166 172 172
9883 172 161 143 129 124 126 125 120 112 102 86 66 52 53 70 96 123 146 163 174 181 191 202 208 200 179 152 128 110 102 106 119 131 139 148 163 179 178 152 109 65 36 28
9866 28 43 72 100 118 126 127 122 111 98 94 100 113 128 144 162 177 185 182 170 157 147 140 126 99 62 22 -11 -30 -32 -19 -2 9 18 32 52 72 85 94 107 128 149
9850 149 159 157 150 146 148 146 129 97 60 29 7 -12 -31 -44 -46 -37 -21 -6 2 1 -6 -10 0 30 68 97 105 94 68 34 2 -16 -16 0 28 61 98 131 154 170 186
9833 186 204 218 224 224 218 203 178 154 140 136 134 133 133 135 139 142 142 129 95 42 -10 -46 -58 -45 -13 27 60 77 81 83 89 95 97 97 95 89 78 63 52 49 46 33 7 -19 -34
9815 -34 -31 -14 4 20 31 38 40 37 31 27 26 29 36 40 41 42 47 57 70 81 85 83 72 53 32 14 4 0 0 9 32 67 103 133 156 173 180 170 144 110 78 49 21 -3 -22
9797 -22 -37 -55 -77 -99 -113 -115 -105 -83 -49 -12 13 26 29 30 31 25 15 10 14 26 37 41 36 25 10 0 -3 4 22 49 79 101 109 102 91 85 90 101 112 117 119 125 134 139 137 135
9778 135 139 154 172 187 190 175 147 120 108 112 125 134 135 128 120 120 134 152 160 153 137 124 118 113 103 80 45 11 -6 0 23 55 85 105 108 91 61 33 18 16 18 16 6
9761 6 -5 -10 -5 7 23 39 53 64 70 72 68 57 39 23 17 22 28 27 19 8 0 1 19 54 96 131 147 145 135 127 130 141 154 166 179 190 193 183 164 144 126 107 90 78
9744 78 75 77 80 81 84 92 110 138 170 195 206 208 207 212 220 228 232 231 222 203 179 159 151 155 164 170 175 182 195 215 236 248 245 225 193 161 131 107 88 80 85 97 108 120 140 170 202
9725 202 225 234 234 230 228 226 219 206 188 170 154 145 145 159 185 211 229 238 240 238 228 207 175 140 111 94 89 88 84 76 72 76 90 112 137 159 174 180 179 173 169 168 172 178 181 176 165 154
9705 154 150 157 173 188 193 184 161 131 101 81 76 86 102 120 135 146 153 154 149 142 138 144 156 163 158 144 128 108 79 45 21 21 35 48 56 68 90 113 123 115 96 76 60
9688 60 48 37 27 21 23 28 29 21 4 -15 -37 -58 -80 -100 -111 -105 -78 -33 16 57 86 108 128 147 161 166 163 160 163 173 187 198 200 191 177 167 164 159 145 126 109 97
9671 97 87 76 65 58 57 61 70 86 106 126 139 140 127 110 96 85 72 58 51 54 61 64 63 65 75 91 107 122 134 146 159 170 175 174 174 177 181 180 172 161 152 151 162 182 205
9653 205 222 230 230 224 217 207 190 161 125 94 78 79 95 120 152 182 202 215 232 257 284 302 302 284 259 242 242 250 251 232 198 161 131 108 92 83 83 90 101 115 128
9637 128 138 145 144 136 125 116 111 109 109 112 122 133 139 131 110 83 59 41 31 26 25 22 15 6 3 9 24 44 66 85 97 105 115 129 143 152 154 150 144 135 125 112 96 81 76 80 91
9618 91 103 119 139 159 175 188 201 208 202 183 166 159 162 166 161 140 105 63 26 2 -8 -6 2 11 16 22 39 66 95 114 119 111 97 85 80 83 91 101 112 121 127 140 170 223
9600 223 295 392 518 648 732 733 656 542 427 332 263 221 196 181 170 164 159 149 134 122 113 104 94 85 75 65 61 71 92 111 126 142 163 182 197 210
9586 210 220 220 207 188 174 169 172 177 175 157 126 96 82 82 90 99 108 114 110 100 92 90 90 87 84 85 89 95 102 109 112 105 87 64 52 61 86 114 137 159 185 206 211 196 177 168 172 181 191
9566 191 202 212 220 224 221 210 184 147 110 83 69 62 60 64 73 79 76 62 45 39 52 80 106 116 106 90 80 80 87 99 123 156 190 213 225 230 228 219 206 193 178 152
9549 152 111 66 34 22 24 30 27 17 5 4 15 32 46 57 65 72 80 88 97 102 95 77 54 40 38 44 47 43 42 54 77 94 98 94 93 100 107 107 101 94 86 76 68 70 86 108 127 136 139
9530 139 144 155 170 182 185 179 172 168 163 152 136 129 139 161 182 194 194 183 162 139 121 107 95 89 92 101 105 94 68 39 14 0 0 8 19 31 47 68 85 86 75 67 71
9512 71 82 90 90 83 73 62 55 55 59 63 61 52 36 17 2 -4 -5 -4 -1 8 22 30 20 -7 -39 -59 -54 -25 16 60 98 129 157 183 204 214 207 190 172 159 152 149 149 154 164 173
9494 173 172 161 148 142 145 150 151 148 145 141 134 124 111 97 84 77 82 96 111 117 111 98 85 77 73 73 76 80 83 85 85 82 74 66 60 61 70 87 109 126 130 122 107 88 65 38 14 5 10 22
9474 22 32 37 35 22 5 -3 0 10 13 7 0 1 11 23 39 58 79 96 102 95 84 78 79 82 79 72 70 74 83 92 97 96 84 67 50 38 32 26 15 -3 -21 -26 -9 24 62 92 112
9455 112 121 121 116 112 114 126 145 168 186 193 190 183 180 180 178 177 180 188 200 216 234 244 235 207 170 141 125 118 114 108 94 70 43 27 31 51 77 99 105 95 79 68 68 72 71 69 74
9436 74 87 100 102 90 71 51 39 34 32 22 3 -16 -25 -22 -9 12 42 80 119 151 167 167 159 155 161 173 182 183 176 161 139 111 79 48 27 21 29 39 40 29 18 14 21 35
9418 35 48 53 50 43 40 44 55 74 105 139 161 161 143 122 113 117 127 133 128 118 109 103 101 106 123 146 161 158 142 128 124 133 156 189 221 238 238 226 207 182 151 122 98 80
9401 80 66 62 71 94 119 140 149 145 130 118 117 126 129 115 92 72 61 51 34 10 -15 -36 -51 -63 -77 -89 -90 -78 -58 -44 -43 -52 -61 -60 -46 -23 8 42 72 92 103
9384 103 110 119 131 142 147 144 131 110 87 70 73 97 133 165 183 193 200 205 201 186 166 144 124 103 85 71 62 55 52 56 67 81 94 108 123 136 141 138 134 135 138 137 131 127 125
9366 125 117 100 80 71 75 88 101 114 128 148 170 189 198 195 184 170 158 152 153 160 165 157 137 117 112 123 140 152 161 171 177 175 163 152 149 152 156 158 162 169 176 176 169 155 137 122
9348 122 113 110 110 112 119 132 143 142 132 122 125 139 154 165 171 174 179 185 189 186 173 155 141 137 139 141 140 141 150 166 178 177 160 135 113 105 110 126 147 170 192 207 207 195 183 179 181
9329 181 178 167 151 139 135 138 142 143 136 124 113 106 100 94 92 97 105 111 110 104 96 90 90 95 98 93 79 61 42 25 12 4 1 4 16 39 73 112 146 169 179 179 173 158 136 110 91 81
9309 81 78 81 90 106 118 120 114 110 112 114 115 118 124 130 134 143 159 180 200 213 217 211 202 204 221 243 254 250 240 234 233 236 239 241 239 226 197 157 115 88 86 102 119 126 124 119 114 113 120 136 157
9289 157 177 191 197 191 175 153 131 109 87 71 67 78 100 127 161 201 239 260 254 227 195 173 167 174 186 197 204 208 209 211 208 200 189 185 187 191 190 188 194 210 229 239 236 227 217
9271 217 211 204 197 194 198 206 210 203 190 173 157 144 133 126 123 123 124 124 119 109 104 108 120 129 128 119 102 87 83 93 113 124 119 99 75 53 38 31 30 32 32 34 41 56 77 102 124 136
9252 136 134 116 86 58 46 55 75 91 95 91 80 64 50 48 57 67 70 66 65 69 75 79 79 76 72 75 85 88 70 33 -2 -21 -22 -12 1 14 20 14 0 -13 -18 -8 15 46 74
9234 74 90 95 95 89 79 67 59 54 53 55 59 63 63 58 46 29 12 11 34 74 107 119 113 106 108 117 131 150 173 195 207 206 191 163 124 80 39 10 0 10 31 52 67 77
9216 77 86 96 101 98 85 71 59 47 31 12 0 0 12 27 38 41 41 40 37 31 24 20 22 32 44 51 45 24 -4 -30 -37 -22 11 50 84 106 116 116 106 85 56 23 -3
9199 -3 -20 -29 -30 -22 -5 21 48 70 85 98 109 116 118 119 125 132 134 128 120 120 127 132 131 129 129 129 124 118 122 141 167 182 180 164 144 130 122 116 112 108 107 107 104 95 80 65 54 49 49 58 76 98
9178 98 119 136 155 175 190 191 176 155 137 124 116 112 110 108 100 89 85 93 112 133 149 159 164 165 160 146 124 97 69 48 40 45 58 69 66 45 9 -27 -47 -42 -18 13 47
9161 47 79 104 117 114 102 89 79 68 55 42 37 42 55 73 91 105 110 108 104 106 112 115 107 87 65 47 34 21 8 -1 -4 0 12 31 49 65 75 83 88 89 87 86 91 99 108 117
9142 117 128 134 131 120 109 108 115 119 113 102 92 88 94 111 142 181 211 213 186 142 99 61 29 7 -1 0 2 -1 -9 -13 -6 11 34 58 80 96 103 99 86 69 50 27 -1 -28
9124 -28 -49 -64 -77 -82 -73 -47 -13 20 53 86 114 131 137 139 142 143 135 120 109 109 116 121 121 116 114 116 117 109 89 54 15 -15 -23 -6 22 46 54 49 38 25 16 14 19 28 34 35 33 29 22
9105 22 13 6 7 17 33 47 54 54 49 41 33 28 26 27 29 33 38 42 46 52 61 66 63 55 49 50 54 59 73 99 131 155 161 152 137 124 120 127 141 154 161 164 164 163 161 162 169 182 197 207 207 203 205 223 254
9083 254 284 297 290 270 244 216 190 168 151 141 135 127 109 77 42 15 3 4 8 14 23 35 51 67 78 85 93 106 124 137 136 123 106 89 73 54 35 19 13 18 28
9066 28 40 56 79 106 122 121 109 101 108 126 146 159 165 169 180 200 223 238 241 235 223 206 188 177 175 174 167 160 160 171 185 193 193 185 167 141 121 115 119 118 104 79 52 31
9048 31 23 31 50 68 79 87 97 108 111 104 95 94 100 109 116 121 122 117 109 103 104 113 126 140 152 159 158 149 137 128 121 112 99 85 75 69 64 60 57 54 51 50 51 57 64 71 74 71 65 61 62 65 57 33 1 -23
9026 -23 -30 -18 4 29 49 59 59 52 44 34 17 -4 -22 -23 -4 26 56 77 92 103 110 114 114 111 104 93 80 67 52 34 17 9 18 40 66 87 100 111 121 131 137 138
9009 138 137 135 132 132 140 156 171 175 168 152 132 107 80 61 56 61 64 59 48 35 25 24 33 48 66 83 97 103 103 99 95 93 97 109 132 162 189 201 189 157 119 92 78 65
8991 65 38 3 -16 -4 34 79 109 121 120 117 116 117 118 120 125 133 141 144 140 133 124 115 108 105 114 136 166 194 206 202 189 179 169 148 110 56 1 -39 -55 -50 -37 -26 -17 0 24
8973 24 53 82 115 151 182 198 195 181 165 148 127 98 60 20 -11 -27 -28 -23 -19 -12 2 24 46 60 63 58 49 44 49 63 82 100 112 117 115 109 102 101 109 126 145 158 162 156
8956 156 144 130 119 115 113 104 87 71 64 67 70 70 72 81 99 122 143 154 153 147 147 153 158 158 155 150 144 139 141 159 192 235 281 322 349 357 347 325 295 262 228 196 171 159 162 176
8937 176 189 195 197 198 196 189 179 174 171 164 150 137 130 128 124 116 110 114 127 143 158 173 190 206 213 205 185 164 150 144 141 135 127 119 116 117 114 101 83 71 70 83 104 130 150 154 139 112
8918 112 87 64 37 3 -37 -77 -106 -112 -94 -62 -34 -15 0 16 32 43 48 53 62 72 85 105 131 157 177 190 198 202 206 211 215 213 205 200 202 204 197 176 150 130 120 121 129
8901 129 136 134 120 102 88 85 92 101 103 93 75 59 48 43 44 51 62 69 67 62 56 51 46 43 43 47 53 66 90 115 125 114 91 74 72 83 93 88 69 47 38 45 65 91 117 130
8882 130 126 108 91 82 76 65 53 40 21 -6 -32 -41 -32 -17 -3 8 23 41 58 67 63 46 28 20 26 38 49 62 78 90 90 79 66 61 70 89 110 127 140 150 151
8866 151 138 115 96 93 101 103 92 74 63 65 78 95 110 120 128 133 138 145 157 174 190 199 201 199 199 204 214 227 238 243 239 227 209 190 169 142 112 89 85 102 132 159 175
8849 175 180 181 189 207 229 244 248 241 225 199 168 148 149 167 188 198 198 196 201 215 233 249 258 254 235 206 181 174 184 188 168 127 86 56 35 21 16 25 38 47 53 64 82
8831 82 99 107 107 107 111 120 131 143 162 188 213 230 235 229 214 195 182 183 190 190 175 149 122 101 84 71 62 60 66 79 96 109 114 113 108 95 73 49 34 27 27 28 27 18 -1 -24
8813 -24 -35 -26 -2 27 58 90 117 137 150 160 173 189 203 208 201 189 179 173 169 166 163 156 141 121 102 85 72 63 57 48 32 10 -5 -9 -2 10 27 41 44 33 13 -4
8796 -4 -16 -24 -29 -32 -33 -30 -19 0 18 19 0 -25 -40 -33 -9 17 35 42 48 62 83 102 115 122 124 122 117 112 109 106 104 104 104 102 95 84 74 75 96 138 187 226 245 246 231 204 172
8777 172 147 134 127 120 114 114 119 120 114 102 88 77 72 72 70 61 49 46 54 69 83 95 106 114 120 131 146 157 149 123 94 70 51 39 36 44 62 84 106 122 126 115 96 80
8759 80 66 52 39 31 33 38 34 19 -1 -13 -11 2 18 30 36 41 49 59 68 74 79 87 95 100 98 95 99 108 112 99 72 44 30 36 56 83 106 119 123 126 137 156 173 176 163 147 141
8740 141 145 148 141 123 101 82 66 51 40 37 47 66 90 114 138 157 166 165 161 165 176 180 169 150 132 118 106 96 92 87 73 49 26 15 19 29 41 52 63 71 73 63
8724 63 44 23 13 16 22 20 10 4 5 5 -3 -16 -19 -8 5 14 23 39 64 88 103 106 98 84 71 65 68 73 77 83 98 125 157 185 199 203 201 201 204 210 214 213 207 196 183 169 154 142
8704 142 138 145 162 182 198 206 203 186 156 120 89 71 60 48 34 27 32 47 69 92 116 139 162 185 206 220 220 206 184 161 147 141 139 131 111 86 70 68 71 69 65 66
8687 66 77 89 94 93 94 100 107 109 104 91 72 50 33 27 27 24 13 0 -4 6 25 39 41 35 25 14 2 -5 -1 17 44 67 80 85 89 91 84 66 40 13 -11 -34 -51 -55 -47 -34
8669 -34 -24 -23 -31 -45 -55 -48 -23 7 27 33 36 46 61 70 70 66 65 65 64 62 59 56 57 66 83 103 117 120 111 98 88 88 96 106 113 113 109 111 130 162 189 192 168 129 86 42 0 -32
8650 -32 -49 -52 -43 -23 8 46 73 79 70 58 52 52 54 56 57 55 48 33 13 -5 -21 -31 -32 -22 -5 8 12 7 2 4 8 13 19 30 38 32 15 -4 -15 -22 -28 -29 -18 2 20 20 5 -16
8630 -16 -32 -41 -44 -43 -37 -24 -5 21 55 89 109 111 100 91 92 96 96 90 82 74 69 67 70 74 71 60 45 27 12 7 19 45 72 93 113 138 163 174 167 148 129 114 102 89 76
8612 76 67 62 60 54 42 29 24 33 46 51 40 21 7 5 15 32 45 50 42 24 4 -12 -23 -31 -33 -25 -3 24 49 67 81 92 100 102 97 85 70 57 50 50 56 67 81 99 117
8594 117 128 128 116 88 46 -3 -49 -80 -88 -76 -57 -40 -28 -18 -7 2 11 21 33 47 62 78 98 119 140 160 175 180 170 154 143 142 146 148 148 146 140 130 118 106
8578 106 94 75 47 15 -14 -36 -46 -47 -41 -31 -19 -6 0 0 2 14 37 61 80 94 104 109 107 97 83 66 47 29 10 -5 -19 -26 -27 -24 -18 -11 -4 0 1 0 1 9 24 40
8561 40 54 65 76 91 103 101 82 55 36 33 46 74 108 137 149 144 131 122 119 123 132 140 142 139 136 135 132 125 113 101 89 81 82 89 94 94 98 115 141 162 174 179 178 164 136 104
8542 104 78 61 52 50 59 76 95 106 109 114 129 152 169 171 161 154 152 147 131 112 99 94 90 86 86 94 105 114 115 103 80 57 48 60 90 127 162 191 213 230 236 226 200 166
8524 166 142 137 151 174 203 233 256 263 252 227 197 167 135 99 62 29 5 -7 -16 -27 -43 -58 -67 -71 -79 -94 -108 -108 -93 -75 -67 -69 -72 -67 -55 -43 -33 -24 -16 -10 -7 -7 -10
8507 -10 -19 -36 -59 -82 -101 -116 -127 -131 -127 -117 -110 -107 -106 -102 -90 -67 -36 -1 27 43 46 36 12 -17 -40 -46 -31 -1 39 83 123 150 169 187 209 232 246 250 241 220 188
8491 188 150 113 83 64 56 53 48 43 48 69 101 135 163 183 193 196 194 190 180 160 128 93 64 49 49 61 79 99 120 139 148 144 134 128 126 122 110 97 93 98 100 89 65
8473 65 43 30 29 33 39 47 57 71 92 117 142 161 178 201 224 231 219 200 187 178 164 142 124 115 112 109 98 72 28 -19 -50 -56 -47 -37 -28 -19 -10 -4 3 18 36 45 40 24
8456 24 7 -7 -21 -37 -50 -49 -29 3 32 47 50 48 46 44 43 38 30 21 14 8 2 0 5 22 44 65 88 112 130 137 136 135 137 135 125 113 108 110 109 100 84 65 45 20 -9 -40 -61
8437 -61 -66 -59 -46 -34 -23 -14 -8 -2 4 17 36 57 73 74 61 45 36 37 41 41 37 30 22 16 15 21 33 47 56 59 60 61 67 77 90 98 98 84 65 53 58 77 100 119 132 135 129 118 114
8417 114 117 123 123 117 106 85 57 30 16 14 17 22 35 58 85 103 104 89 61 31 11 12 33 60 78 87 97 115 138 157 168 173 175 175 168 156 142 128 112 93 71 51
8400 51 41 43 52 55 48 34 23 19 23 38 60 80 88 89 93 103 112 110 95 76 61 53 54 60 65 63 60 60 64 66 66 69 77 87 93 96 100 109 121 127 126 116 100 84 72 66 63 54 44 42 58 89
8379 89 117 130 123 103 74 40 8 -15 -33 -52 -67 -70 -53 -26 -3 14 34 58 78 81 70 62 67 83 94 89 74 60 58 67 79 90 97 98 96 96 103 122 146 165 169 163 157
8362 157 158 165 169 168 170 180 196 206 202 181 151 124 108 103 101 95 81 68 63 64 68 68 64 59 61 71 84 91 87 74 63 61 73 96 123 146 164 179 191 193 182 159 139 132 141 158
8344 158 172 178 175 163 147 128 114 114 128 149 165 171 164 147 124 102 90 91 103 120 135 144 150 155 158 154 143 132 128 128 126 120 112 100 80 59 53 71 108 152 192 224 244
8326 244 252 250 245 237 222 199 174 154 141 132 123 115 108 105 108 117 130 150 176 205 224 224 199 154 100 50 15 0 3 21 42 57 65 69 78 88 97 103 111 123 136 142 139 132 126 123 126
8308 126 136 150 157 151 134 113 93 75 63 65 86 118 148 170 186 201 216 226 229 226 220 211 198 180 159 143 134 127 111 90 81 91 114 136 153 168 173 160 135 116
8292 116 115 124 127 114 91 68 56 64 90 124 154 168 165 148 125 103 86 68 45 22 5 -2 0 16 48 89 121 135 141 153 174 193 203 207 205 201 193 186 182 183 186 189 185 168
8274 168 138 101 68 42 29 35 62 101 134 152 152 136 102 58 16 -8 -13 -6 8 23 30 25 12 2 0 3 12 26 41 54 64 74 81 79 68 58 54 52 46 35 24 13
8257 13 2 -5 -4 1 3 0 -1 6 21 31 33 30 27 22 14 4 -4 -10 -14 -20 -30 -40 -43 -31 -9 13 29 39 50 66 89 118 148 172 187 190 186 175 154 129 112 109 118 132 144 151
8239 151 148 137 119 99 79 57 36 25 34 59 92 123 146 163 175 187 198 208 220 234 249 259 259 247 221 188 158 143 143 153 162 165 161 150 136 120 107 102 106
8223 106 115 120 118 110 101 93 84 79 84 96 108 117 127 140 150 148 133 114 98 88 85 86 83 69 50 33 21 13 9 12 22 35 45 52 58 69 91 123 155 176 178 167 147 126 111
8205 111 107 116 126 131 129 126 129 138 152 164 167 155 138 125 115 104 86 70 66 74 89 104 120 136 146 148 144 141 143 145 147 150 156 158 151 136 122 112 99 85 77 80 88 93 97 105 120 134
8186 134 139 128 101 59 15 -16 -29 -22 2 36 70 96 111 118 115 105 91 78 71 69 70 72 70 63 55 49 41 33 28 35 54 77 100 123 145 152 134 99 66 47 46 63 97 137
8168 137 168 177 164 140 115 95 81 76 75 73 66 52 35 21 17 25 38 47 51 57 71 88 100 101 95 89 85 84 84 84 82 78 74 69 67 68 71 75 78 79 75 61 42 27 25 34 45 55 65 74
8148 74 76 71 70 76 82 76 60 52 60 80 97 106 106 98 82 62 49 52 71 95 114 122 123 123 127 135 148 161 169 169 156 139 126 126 137 147 150 144 138 133 133 134 137 141 146 149 153 156 160 163 163 153 132
8127 132 102 75 59 58 67 77 76 60 38 27 33 50 69 90 116 143 164 177 188 202 218 231 232 216 183 150 131 135 155 182 212 233 234 212 182 158 144 133
8111 133 121 113 116 131 149 161 159 145 124 100 73 49 33 25 19 12 5 3 3 0 -7 -13 -16 -13 0 20 37 42 37 33 32 28 19 10 9 17 29 37 39 38 43 54 66 74 80 88 97 99 94 87 86 90 95
8090 95 102 110 112 102 83 65 50 34 14 -4 -12 -8 5 22 43 66 85 94 98 107 125 142 147 140 132 134 144 157 169 178 181 179 174 167 156 143 131 119 100 70 36 13 12 32
8072 32 60 82 89 85 83 93 112 129 138 142 148 157 163 162 158 157 155 146 124 93 61 34 13 0 -2 5 19 31 39 45 51 56 56 50 40 33 33 36 43 57 88 130 168 191 201 205 207 205 197 188
8052 188 180 169 153 139 139 159 193 221 229 215 191 170 158 155 160 166 168 163 154 145 142 141 142 142 144 153 169 189 205 210 202 182 157 143 148 163 166 146 110 73 48 39 43 52 58 56 47 31
8033 31 11 -3 0 23 48 59 55 49 47 45 44 46 54 68 88 115 137 143 128 104 81 62 51 56 76 102 125 145 160 166 158 140 116 83 42 0 -29 -42 -38 -20 5 30
8016 30 43 45 43 42 38 30 20 10 3 0 6 27 53 75 87 89 81 67 51 39 31 22 9 1 3 15 26 35 49 72 93 99 83 57 35 20 7 -7 -23 -36 -39 -30 -14 -2
7998 -2 2 4 12 26 42 58 74 88 97 101 106 113 119 125 134 147 156 157 148 133 112 79 42 17 16 39 67 90 106 121 136 148 153 157 162 166 163 154 142 130 122 119 119 108 77 34 -1
7980 -1 -13 -1 22 49 72 85 86 75 57 41 32 36 54 73 83 79 70 68 81 103 124 138 144 148 153 160 164 163 158 153 144 128 108 92 85 81 72 58 43 33 34 44 62 81 101
7961 101 128 165 204 233 243 237 217 189 159 138 128 120 104 82 65 64 79 96 103 92 69 46 35 31 24 13 4 8 29 63 102 136 155 156 142 124 110 104 107 112 116
7945 116 119 126 131 129 118 104 92 75 46 12 -12 -20 -13 2 23 45 64 79 88 92 89 82 77 79 88 104 124 141 147 141 132 126 122 121 122 127 135 137 135 132 133 132 118 92 60 33 18 12 8
7925 8 4 1 7 26 56 88 111 118 110 94 82 81 94 119 151 192 236 275 299 310 317 325 325 308 278 253 240 231 214 186 156 131 114 104 99 96 88 74 58 52 59 76 87
7908 87 81 61 43 42 57 75 83 79 73 76 92 112 130 144 162 182 199 207 203 190 171 150 134 125 118 107 97 96 103 112 116 122 136 155 177 196 209 205 179 145 124 125 140 155
7890 155 162 164 161 155 145 131 115 101 98 113 144 180 208 220 218 210 203 198 188 166 132 95 68 57 59 69 79 84 78 65 53 54 71 96 114 121 119 113 105 94 84 80 83 92 100
7872 100 104 100 89 74 62 54 49 47 50 56 60 60 56 46 32 22 23 38 60 81 94 93 78 57 39 34 39 52 68 79 81 75 67 64 64 64 65 71 75 66 40 7 -19 -31 -25 0 42
7853 42 88 128 154 164 161 151 140 132 124 115 109 109 115 125 140 160 176 182 177 167 156 148 144 142 136 128 127 142 166 184 193 200 210 215 210 194 172 149 128 111 99 89 85 89 99 107
7835 107 107 103 99 94 85 71 57 50 51 61 77 91 98 93 80 64 51 39 25 5 -14 -26 -29 -29 -27 -19 -3 15 29 38 49 63 78 92 102 106 101 89 76 66 53 39 33
7818 33 41 57 68 68 58 47 37 33 41 59 81 98 103 95 79 55 23 -8 -27 -31 -27 -31 -44 -59 -60 -44 -18 6 17 8 -11 -30 -41 -43 -37 -24 -5 10 17 18 24 32 34 24
7800 24 9 4 14 37 69 102 130 148 158 161 162 159 151 143 143 157 178 195 204 214 228 243 253 254 251 243 227 203 175 150 134 124 115 98 70 39 16 6 5 8 9 8 7 12
7782 12 32 62 87 99 100 101 102 99 91 86 86 86 79 70 65 67 69 64 52 40 37 42 49 50 43 36 37 46 51 40 16 -9 -27 -40 -51 -57 -51 -37 -26 -29 -43 -53 -47 -28 -7 7 16 30 52
7763 52 80 105 121 127 123 113 98 79 60 43 30 24 24 28 38 51 62 62 48 32 28 38 58 79 100 119 132 136 133 129 131 141 154 163 164 159 156 159 167 176 180 176 165 151 142 144
7744 144 158 179 197 202 188 157 119 89 75 77 88 101 110 110 103 95 89 82 70 53 46 56 80 101 107 101 96 96 97 95 91 90 89 80 61 37 21 20 31 45 58 68 75 76 76 83 100
7725 100 122 136 140 141 144 152 165 177 177 163 143 131 135 149 164 174 176 167 146 124 113 114 122 126 124 122 124 128 128 114 90 62 40 20 0 -18 -26 -20 -7 3 10 15 20 22 20 17 18
7707 18 28 47 68 83 90 94 98 98 94 91 93 96 92 80 68 61 58 59 63 74 89 104 119 129 130 123 114 112 111 103 81 54 37 40 62 93 123 146 158 156 139 113 88 77 86 106
7688 106 126 137 142 143 142 139 141 148 159 166 165 160 154 148 146 148 156 164 163 149 126 104 90 85 84 81 73 66 62 61 57 46 30 14 6 3 1 -1 0 11 30 39 29 1 -33 -62 -76 -68 -42 -8
7668 -8 19 34 37 34 30 23 11 -5 -19 -23 -17 -9 -5 -5 -4 5 27 63 104 138 160 176 189 200 207 211 216 219 213 193 165 136 112 98 94 95 95 94 95 99 106 115 127 141 152 161 168 167 147
7648 147 106 55 16 2 8 24 37 47 63 90 122 141 138 115 85 55 31 16 12 17 29 47 68 81 74 48 13 -16 -36 -42 -40 -45 -67 -98 -115 -102 -69 -30 5
7633 5 39 69 90 105 119 131 136 132 131 137 147 152 153 153 152 142 122 101 92 99 113 126 129 121 106 86 65 41 20 9 12 24 34 39 42 45 43 37 34 41 60 85 110 127 135 135 133
7614 133 130 117 96 79 82 106 140 170 187 184 158 115 71 43 38 54 84 121 153 172 180 186 195 204 210 214 216 220 224 231 236 236 225 203 178 160 149 140 132 130 137 146 152 156 166 183
7595 183 195 191 173 154 135 118 105 102 107 113 114 112 112 114 123 139 162 185 200 204 193 167 130 91 58 35 21 21 40 75 118 158 188 210 227 237 233 215 190 168 152
7579 152 142 137 135 127 109 85 63 49 41 39 49 69 86 88 77 69 68 70 70 75 91 110 121 122 117 107 89 67 51 51 65 82 95 106 119 130 136 134 128 119 108 98 93 97 110
7561 110 126 144 161 169 157 130 108 109 133 161 173 164 146 131 124 123 124 126 128 131 131 125 110 89 74 73 87 109 128 135 128 112 97 95 105 119 129 134 138 138 136 134 136 137 137 143 162
7542 162 191 211 211 193 170 153 144 143 144 142 136 126 110 85 50 9 -30 -57 -65 -55 -33 -8 15 39 59 70 71 72 80 98 121 143 158 161 151 141 142 154 165 167 159 150
7525 150 138 124 109 104 111 129 146 153 146 125 95 62 31 5 -9 -11 -2 14 39 69 101 132 160 180 188 187 186 190 196 191 170 144 124 111 101 88 69 48 29 26 45
7509 45 79 111 126 127 121 113 107 107 120 140 153 148 131 114 101 88 71 51 36 30 32 40 49 59 68 72 68 54 39 30 26 19 5 -11 -20 -14 3 26 45 53 51 47 51 70 98 123
7490 123 137 141 145 156 178 205 231 256 273 271 246 205 166 140 121 100 77 56 43 41 51 75 105 133 151 157 155 149 144 140 132 118 97 82 79 89 103 116 130 149
7474 149 173 191 195 184 162 139 126 126 129 128 120 113 111 111 106 96 88 88 97 108 114 110 98 87 85 93 105 117 125 124 114 102 97 98 94 85 80 85 93 95 93 98 113 128 133 124 105 82 63 51
7454 51 44 34 17 -1 -17 -24 -21 -11 3 14 15 4 -8 -10 1 18 28 23 6 -14 -31 -40 -44 -49 -57 -62 -55 -34 -7 14 26 28 23 17 12 16 32 60 93 124 146 156 153 137
7436 137 110 77 47 29 20 17 16 15 15 12 3 -8 -20 -29 -30 -17 9 43 72 89 95 96 96 102 113 127 138 148 160 172 178 175 169 165 162 153 141 132 126 116 100 81 71 69 73 77 79
7417 79 75 67 58 58 70 92 120 147 166 169 147 105 58 27 26 55 97 130 141 137 129 119 103 81 59 40 24 14 14 27 41 48 46 43 48 62 80 96 103 100 86 65 48
7400 48 40 42 49 54 55 52 45 37 33 42 61 79 85 78 65 50 33 15 1 -1 5 20 42 63 75 71 55 39 31 32 39 53 75 101 122 128 122 113 114 128 148 159 156 143 125 105 84
7381 84 67 61 64 67 67 72 87 106 111 98 76 60 53 56 63 76 87 91 85 73 60 48 39 35 37 43 49 55 63 73 77 71 58 46 42 42 44 46 53 64 74 82 90 103 121 136 143 136 119 96
7361 96 75 61 57 65 83 106 127 137 138 132 123 109 95 86 85 89 87 73 52 37 32 35 39 44 55 69 76 73 67 66 72 80 89 95 96 89 82 87 109 139 161 166 149 117 82 57 48 51 56 56
7341 56 47 26 1 -20 -28 -22 -6 15 41 71 102 125 132 124 112 103 95 80 59 34 11 -9 -23 -26 -15 5 24 36 37 30 23 24 35 49 56 55 51 50 56 73 99 132 164 189
7323 189 200 193 171 140 105 67 29 2 -3 8 29 51 68 73 60 32 0 -21 -31 -31 -23 -7 14 38 54 59 56 56 70 103 147 184 201 197 178 150 115 78 45
7308 45 24 11 4 2 8 21 32 38 39 41 43 41 34 30 30 33 36 40 51 70 88 97 94 85 79 77 70 52 27 10 8 16 21 20 14 7 0 -6 -8 -4 3 8 7 1 -1 4 14 20 19 16 13 9 0 -11 -16 -12 -3 1
7284 1 0 -6 -18 -31 -39 -37 -25 -7 13 40 69 96 113 118 114 107 95 77 52 27 9 0 2 11 23 36 54 79 106 117 101 65 29 9 4 5 3 -3 -13 -30 -53 -79 -101
7267 -101 -115 -120 -114 -96 -69 -40 -18 -7 -7 -12 -14 -6 6 13 9 0 -6 -10 -13 -13 -8 -1 7 19 35 47 46 35 30 41 61 73 70 54 33 9 -15 -42 -70 -94 -99 -74 -25 27 63
7249 63 77 72 61 57 65 78 84 79 67 57 51 50 56 68 75 64 38 8 -12 -22 -30 -37 -38 -32 -20 -8 3 19 42 75 114 153 182 193 190 180 172 172 185 210 243 271 287
7232 287 286 270 244 215 191 169 144 115 95 95 111 129 137 133 119 96 67 39 14 -10 -31 -40 -31 -12 7 22 35 51 69 86 99 109 120 138 160 173 168 147
7217 147 122 104 95 93 96 106 121 142 164 176 172 151 122 92 66 50 50 62 74 76 63 40 12 -13 -30 -29 -11 9 22 23 21 25 38 54 67 72 73 76 81 87 89 81 66
7199 66 49 37 32 33 33 30 23 13 2 -9 -19 -22 -19 -11 -2 11 31 52 63 60 48 40 39 42 46 56 75 101 125 141 152 163 177 190 198 201 201 198 191 184 182 188 200 208 206 194 181
7180 181 174 172 170 162 144 119 93 73 68 82 113 150 181 203 217 229 238 246 250 250 246 234 214 193 177 170 169 170 168 165 160 153 147 143 141 141 141 142 144 146 145 144 148 156 163 165 162 155 144 130 117
7160 117 111 110 112 117 120 122 119 116 114 114 114 112 110 107 104 95 78 54 25 -1 -25 -41 -48 -45 -37 -27 -16 -1 18 41 66 91 114 129 134 130 120 108 100 104 122 148 163 162 152 146 151 162
7141 162 173 180 183 183 181 173 156 129 99 72 54 48 52 65 79 90 98 106 116 126 133 133 130 131 141 159 179 194 204 211 210 196 168 139 127 143 176 212 238 250 254 250 240
7123 240 223 199 170 139 105 71 43 31 38 58 78 88 89 88 87 84 73 61 60 75 97 112 116 118 122 121 112 101 101 114 136 156 170 174 167 153 134 108 79 57 52 59 55
7106 55 30 -4 -22 -15 5 22 31 34 35 32 24 17 20 39 67 91 109 123 136 144 144 141 138 135 127 112 96 79 61 42 26 16 9 6 3 1 -1 -4 -7 -12 -21 -30 -31 -25 -16 -7 0 4 2 -4 -8 -4
7085 -4 5 17 32 45 47 34 12 -5 -11 -10 -6 0 7 17 31 49 72 91 100 96 85 74 67 65 64 63 59 57 58 64 71 72 69 69 80 101 121 136 147 160 175 190 204 215 219 214 205 197
7066 197 191 181 160 132 106 88 80 81 88 92 86 69 53 49 61 84 117 151 177 184 174 155 137 121 104 89 85 95 112 126 135 140 145 147 144 130 105 69 30 -2 -23 -33
7049 -33 -34 -32 -27 -19 -11 -8 -15 -26 -25 -5 27 57 76 82 78 66 51 42 43 50 56 58 59 61 69 81 92 93 87 87 105 138 172 194 199 194 187 185 183 173 154 133 116 96 68 39 26 32 49
7029 49 63 72 78 80 82 87 99 114 124 125 116 100 79 62 56 67 90 117 138 150 156 154 144 126 106 91 85 85 82 75 65 64 77 99 110 99 69 36 14 8 19 39 57
7012 57 64 59 52 45 35 20 6 0 -1 -9 -21 -25 -13 9 33 48 51 45 37 34 36 37 30 16 -1 -18 -27 -22 -4 16 33 46 63 86 108 122 127 124 111 86 53 20 -8 -33 -53
6994 -53 -62 -55 -37 -22 -15 -10 1 20 39 49 49 47 49 58 71 87 109 136 159 167 158 144 133 129 127 128 136 154 176 198 216 226 226 213 191 163 129 92 55 29 20 24 30 32 34
6976 34 42 60 80 90 90 83 74 61 39 10 -20 -40 -40 -16 21 60 84 86 69 47 31 24 24 28 32 34 29 14 0 -7 -9 -9 -9 -3 12 30 45 61 83 111 132 139 132 119 104
6958 104 86 68 58 65 88 121 151 173 186 191 191 190 189 183 164 125 77 37 11 -2 -11 -12 0 26 55 79 101 122 139 142 129 109 96 94 98 102 99 86 61 30 5
6942 5 -8 -10 -5 3 14 26 34 39 39 36 31 27 21 11 -4 -20 -32 -40 -42 -36 -27 -23 -28 -39 -44 -45 -49 -61 -72 -73 -60 -38 -15 1 8 8 10 12 13 15 26 50 80 99 100 87 70 57 50 47
6921 47 46 47 50 53 55 55 54 48 40 35 42 65 98 129 148 149 129 92 51 15 -11 -27 -33 -27 -16 -5 4 20 42 66 85 98 105 112 126 148 172 186 186 177 164 146 118 82 48
6903 48 24 18 29 49 69 84 96 109 121 132 140 149 154 152 141 125 114 114 118 112 95 77 75 89 107 120 126 127 125 122 120 118 114 112 118 130 137 133 127 134 156 181 195 196 188 176 165
6885 165 151 131 103 72 47 34 29 26 20 13 9 16 30 40 36 21 7 5 11 25 45 71 94 110 118 123 122 111 90 66 45 28 16 14 19 24 19 3 -13 -21 -17 -2 16 31
6867 31 39 42 43 44 45 56 84 126 170 198 205 192 165 131 100 76 58 42 28 16 10 14 30 55 82 104 119 133 154 180 205 218 214 199 186 184 191 202 211 221 234
6850 234 244 250 248 241 229 216 204 197 192 188 182 178 175 169 157 144 139 143 149 149 143 138 139 148 158 163 160 144 115 79 49 31 25 25 25 27 28 29 29 32 43 59 75 94 120 149 166 163 145
6831 145 127 115 105 89 66 39 14 -4 -18 -29 -38 -41 -35 -27 -31 -48 -62 -54 -27 1 15 19 21 25 31 42 59 75 83 82 79 78 76 70 64 63 67 74 86 100 113 122 122 114 99 79
6812 79 55 29 3 -16 -25 -25 -24 -27 -32 -32 -24 -7 18 48 76 95 107 109 102 89 77 75 80 88 94 96 90 74 59 55 63 72 70 56 37 24 26 46 72 89 89 77 59 35 7 -19
6794 -19 -35 -39 -34 -23 -8 9 26 38 42 40 37 39 47 50 40 22 8 5 8 11 22 46 77 98 100 83 56 24 -5 -26 -33 -25 -11 3 17 31 50 72 94 109 113 108 99 88
6776 88 77 69 66 70 82 99 116 130 136 133 119 94 65 40 22 8 -4 -11 -11 -7 -2 4 17 37 55 66 65 55 39 22 8 2 1 0 -2 -5 -3 7 29 60 88 100 91 65
6758 65 34 14 9 20 39 63 83 90 83 64 43 28 20 20 28 43 63 83 95 95 81 64 54 55 63 76 91 101 95 71 41 23 22 28 30 23 4 -21 -45 -57 -58 -55 -53 -50
6741 -50 -46 -43 -43 -36 -15 16 44 59 58 49 36 22 4 -19 -46 -72 -87 -87 -71 -46 -21 -2 12 30 58 89 113 120 115 102 87 76 78 95 121 144 159 171 184 197
6725 197 204 207 208 212 217 222 223 222 217 211 203 191 177 165 158 158 155 143 119 89 62 40 20 4 1 15 39 59 65 61 52 36 13 -6 -11 -2 6 4 -6 -18 -25 -29 -29 -21 -8 8 24 39
6705 39 50 59 65 69 73 80 90 101 104 97 89 87 91 93 90 88 88 86 80 75 77 81 84 84 87 94 105 117 128 130 121 103 84 67 54 52 65 88 107 110 103 99 104 113 118 113 101 86 78 80 91 100 99 89
6684 89 75 65 63 64 57 33 -1 -38 -65 -81 -95 -107 -111 -102 -81 -57 -35 -13 10 34 48 46 38 33 40 54 65 72 78 87 99 110 123 139 155 168 174 176 173 165 153 136 116
6666 116 93 69 49 31 13 -5 -14 -8 6 21 33 41 46 50 58 71 90 107 121 131 137 137 133 125 115 103 92 85 78 66 50 37 29 21 10 -5 -20 -36 -52 -64 -65 -52
6650 -52 -24 13 53 81 92 94 101 118 140 156 163 162 155 146 138 138 145 154 161 167 172 178 181 176 162 145 132 127 129 138 148 157 159 154 141 123 103 85 72 66 71 85 101 111 110 99 84 67
6630 67 51 42 45 59 81 107 132 151 156 149 135 113 79 34 -14 -62 -107 -145 -163 -155 -126 -85 -43 -5 19 27 21 10 1 -2 -1 -1 -3 -7 -10 -10 -15 -28 -42 -46 -36 -22 -11 -10
6613 -10 -21 -41 -63 -73 -70 -61 -59 -64 -68 -65 -54 -36 -10 24 59 84 93 90 83 76 72 72 79 90 93 78 46 18 5 2 -4 -18 -32 -38 -42 -45 -46 -39 -26 -11 5 25 46 61 65 58 49
6594 49 49 62 83 103 118 131 143 146 128 90 49 21 16 29 51 72 87 94 98 102 107 109 104 93 80 70 62 58 57 58 58 52 42 35 37 44 47 43 36 36 45 56 59 48 24 0 -21
6575 -21 -36 -48 -59 -68 -70 -62 -43 -19 0 8 1 -15 -33 -43 -40 -25 -8 2 4 1 0 1 4 10 21 36 54 70 80 81 74 68 67 68 64 57 50 43 31 13 -5 -22 -44 -70 -92 -97
6556 -97 -80 -53 -27 -9 7 27 52 75 86 77 54 24 -2 -25 -46 -63 -75 -83 -89 -91 -89 -85 -80 -76 -71 -63 -56 -49 -38 -20 1 25 51 81 106 118 119 116 112 105 91 74 64
6539 64 66 73 76 72 65 59 57 58 61 68 75 81 82 78 67 50 34 28 40 68 101 124 127 111 86 62 46 33 21 9 1 0 8 19 24 18 4 -4 -2 5 10 9 7 8 12 14 16 20 21 18 9 -2 -13
6518 -13 -17 -11 6 28 46 59 69 79 83 78 68 60 58 58 52 39 26 23 33 52 72 87 91 83 67 49 35 24 14 9 14 30 51 74 99 117 120 109 94 77 57 35
6501 35 17 9 5 -1 -5 1 23 54 80 92 81 56 36 33 44 56 64 71 81 89 91 87 80 70 60 55 56 61 66 67 62 51 35 16 -2 -17 -27 -30 -26 -15 2 26 52 73 83
6483 83 77 60 41 33 37 44 46 42 42 47 53 53 47 42 40 40 36 24 9 -5 -18 -30 -39 -44 -45 -47 -52 -51 -35 -8 14 23 22 21 27 41 65 94 121 134 128 108 83 65 60 66 76 79 77 74 75
6463 75 78 75 66 54 45 42 44 43 33 19 7 2 0 -4 -10 -10 -3 5 9 8 8 14 26 39 50 56 59 62 66 68 63 54 49 53 63 66 59 50 49 63 87 117 148 173 191 202 202 184 143 87 40
6442 40 17 15 21 26 35 53 73 82 74 58 49 58 80 105 118 114 95 70 51 43 42 45 51 60 72 81 84 78 67 58 56 57 62 68 77 84 85 79 74 74 74 67 53 37 22 11 7 11 18 16 7 4 19
6421 19 52 88 113 120 111 95 77 63 54 44 27 9 4 20 50 79 94 96 98 106 116 121 119 117 120 120 104 72 39 17 0 -19 -43 -56 -53 -42 -34 -32 -29 -21 -4 16 32 27
6403 27 3 -22 -28 -16 -6 -12 -32 -57 -85 -113 -133 -133 -114 -86 -58 -33 -12 8 34 66 97 115 118 117 119 124 124 113 94 74 58 44 33 29 34 47 64 82 101 117
6387 117 121 111 94 79 70 58 37 15 0 -1 5 15 23 29 34 38 37 28 15 1 -13 -35 -69 -106 -127 -121 -92 -57 -30 -16 -10 -4 4 14 20 23 30 47 70 92 109 120 128 134
6369 134 140 148 155 154 142 127 121 125 132 136 132 123 109 97 95 107 131 161 190 208 207 182 142 103 72 49 36 34 46 67 88 100 102 96 85 75 69 71 85 105 125 142 157
6352 157 171 181 184 181 173 164 157 150 141 126 105 81 62 53 62 87 121 152 171 179 180 177 169 160 151 143 135 126 115 101 84 67 54 47 40 35 31 32 38 45 49 43 31 27 40 67 87 91 81
6332 81 69 64 66 74 85 93 97 97 96 90 84 83 93 103 100 79 46 11 -18 -38 -45 -39 -21 7 39 66 79 78 71 65 58 49 39 37 44 55 60 54 42 26 9 -6 -17 -20 -15 -6 2 16
6313 16 40 70 97 114 123 128 128 120 103 84 69 62 66 82 101 116 123 128 133 130 110 83 65 64 70 73 72 75 86 101 120 143 169 188 195 189 177 164 150 136 123 113 108 111 117
6295 117 122 121 116 110 112 124 141 152 151 142 133 130 136 146 156 159 149 127 102 83 72 71 78 88 96 99 100 104 111 115 111 102 93 89 91 99 112 127 141 152 155 147 132 115 102 94 89 88 89 96 105
6275 105 116 133 159 188 206 206 191 170 147 125 105 92 79 60 35 15 8 11 15 17 24 40 66 94 112 111 93 75 68 69 68 59 47 43 52 69 87 98 99 88 68 48
6258 48 36 36 38 34 24 18 21 25 26 29 35 37 25 3 -15 -26 -30 -29 -22 -14 -14 -23 -31 -31 -24 -5 25 64 102 133 159 177 180 167 151 143 137 128 118 118 130 146 158 165 164 153 136 121
6238 121 115 116 120 126 132 134 132 128 127 129 132 130 119 101 82 68 57 43 25 10 7 17 36 57 76 89 95 94 89 83 80 87 103 123 140 153 163 169 169 163 150 129 99 65 31 2
6220 2 -22 -43 -61 -73 -78 -76 -65 -53 -48 -57 -72 -80 -68 -36 5 39 54 48 30 14 9 14 25 37 50 63 74 75 62 36 7 -13 -19 -12 4 28 59 97 138 174 197
6204 197 205 200 190 182 180 180 180 179 179 179 177 176 180 192 205 209 199 178 153 136 137 155 178 193 193 180 156 126 97 77 69 72 78 77 65 41 17 4 7 23 49 85 126 158 172
6185 172 174 173 171 169 170 181 201 219 221 206 183 168 164 168 174 175 172 161 141 116 95 87 93 106 120 131 133 119 97 82 84 98 114 128 138 137 121 95 66 39 18 5 4
6168 4 13 23 28 32 37 42 44 43 47 56 67 76 84 95 108 119 123 118 109 109 124 147 170 191 210 225 228 216 193 167 139 105 66 33 17 20 37 61 88 114 137 158 177 193
6151 193 209 231 267 314 375 462 593 778 1020 1317 1646 1934 2078 2013 1773 1463 1179 958 790 663 567 493 427 363 304 249 202 167
6139 167 147 138 132 134 147 170 194 211 217 205 175 133 93 63 43 34 37 52 74 99 127 155 176 183 183 186 193 198 193 174 149 122 98 75 51 32 23 29 44 60 72 83
6122 83 93 102 108 115 125 137 149 155 152 140 123 106 87 65 38 7 -16 -26 -21 -13 -15 -26 -41 -54 -65 -68 -53 -19 18 41 47 48 57 72 80 75 64 55 51 48 40 30 23 20 19 17
6104 17 14 11 6 0 -4 -5 -4 -2 -1 -3 -12 -26 -41 -52 -62 -73 -80 -72 -41 8 62 100 117 119 118 119 118 112 105 100 101 107 116 130 145 154 155 148 138 126 113 100 87 78 81 99 125 143 141 123
6084 123 102 92 98 113 128 136 132 117 97 82 77 80 85 89 94 101 106 105 105 110 117 115 100 81 67 57 45 34 29 31 31 26 18 13 13 16 13 2 -10 -16 -13 -4 7 23 40 50 49 43 41 41
6064 41 31 9 -13 -25 -24 -22 -27 -36 -40 -35 -22 -4 15 34 48 55 58 61 62 57 47 41 49 70 97 114 113 95 69 42 14 -17 -50 -73 -75 -56 -24 11 40 60 73 84 99
6047 99 115 128 134 132 125 116 110 109 108 100 85 71 62 58 56 56 57 58 53 44 34 26 17 8 3 7 16 24 29 35 46 59 65 60 45 26 12 8 14 27 42 56 71 88 105 119 122 109 80 40
6026 40 1 -23 -28 -16 3 18 20 12 6 7 19 39 61 82 99 119 152 193 226 240 238 230 217 195 163 128 96 72 58 57 67 80 87 93 110 138 167 186 193 190 185 184
6010 184 187 191 186 172 160 155 150 135 112 91 80 75 64 42 12 -18 -42 -53 -52 -46 -37 -25 -9 9 30 55 84 114 139 153 157 150 136 119 109 110 122 135 145 151 155 156
5993 156 152 142 135 136 145 157 166 170 165 150 130 112 98 81 61 45 39 41 45 51 58 58 42 12 -16 -30 -29 -20 -15 -16 -21 -25 -26 -22 -14 0 26 65 109 148 174 183 174 152 127 105 84
5974 84 65 55 60 79 105 130 146 146 135 128 133 143 144 135 124 117 113 108 104 102 101 101 103 104 97 81 67 59 50 34 13 -3 -14 -19 -19 -16 -15 -15 -16 -16 -19 -25 -26 -13 12 42 69 96 123
5954 123 147 160 156 136 108 82 67 65 71 80 86 83 72 62 62 70 75 70 56 38 16 -8 -30 -38 -23 14 65 114 145 152 135 104 70 44 33 33 36 35 32 34 43 58 73 89
5936 89 108 134 163 186 195 188 172 152 134 122 118 122 126 124 117 105 90 74 62 56 51 44 39 45 61 79 87 83 73 66 67 79 97 108 104 86 60 35 13 -2 -13 -21 -26 -25 -10
5918 -10 19 55 85 105 117 124 124 120 118 118 116 100 75 50 31 15 0 -9 -7 3 15 20 18 12 5 -2 -7 -11 -11 -3 16 46 76 102 123 143 162 174 172 155 132 113 103 99 102
5900 102 112 133 159 177 180 168 151 134 121 112 107 97 77 48 23 12 18 36 58 78 91 100 109 121 135 145 148 142 127 107 85 65 47 29 11 0 -6 -6 -7 -4 7
5884 7 28 49 58 50 31 7 -12 -24 -25 -22 -27 -44 -66 -83 -89 -86 -75 -58 -38 -21 -12 -13 -25 -42 -54 -55 -49 -47 -49 -44 -25 2 30 57 83 103 108 104 105 115 125 122 110 99 90
5866 90 83 77 75 69 57 44 39 42 42 37 38 56 83 108 126 140 153 159 158 156 164 182 208 231 242 234 208 173 138 109 91 87 91 93 85 70 63 72 90 108 115 107 89 69 55 48 43
5847 43 38 40 53 71 85 87 81 71 54 32 11 -1 -4 -5 -10 -16 -14 3 35 78 125 169 203 216 209 190 171 154 136 114 92 76 64 56 53 57 65 73 78 83 92 101 107 109 103 88
5828 88 66 41 20 6 0 0 -1 -1 1 8 19 30 42 54 60 50 27 3 -9 -8 1 16 34 49 55 51 43 41 53 73 91 96 88 77 65 49 27 6 -2 0 6 12 21 32 41 47
5810 47 56 74 94 110 124 144 172 200 217 220 213 204 192 176 157 134 109 87 72 67 67 70 75 80 80 69 44 12 -19 -39 -40 -21 6 31 48 58 61 57 46 34 24 14
5793 14 3 -8 -16 -20 -19 -13 -1 13 30 47 59 55 35 13 6 20 44 68 83 87 80 69 63 69 82 98 117 133 139 136 132 133 136 130 110 86 68 63 72 87 100 103 98 91 88 90 91
5774 91 88 83 79 81 88 94 89 71 47 26 8 -6 -16 -14 -1 12 15 4 -15 -40 -64 -79 -76 -56 -28 -3 15 32 46 58 64 69 76 89 113 140 159 156 132 102 77 60
5757 60 47 35 25 18 14 8 0 -10 -12 2 28 52 61 57 52 59 77 98 111 111 104 96 93 93 93 86 70 47 30 21 18 13 11 21 41 60 66 61 53 51 57 69 83 96 103 104 105 110 121 137
5737 137 149 149 136 116 97 78 55 30 11 6 14 29 46 60 76 97 120 137 141 142 151 167 179 182 181 181 180 174 159 138 113 88 70 62 58 50 37 25 21 25 31 35 35 33 34
5719 34 39 46 47 37 12 -21 -54 -74 -74 -52 -12 34 71 87 88 87 93 106 122 138 150 150 137 121 108 100 95 90 86 86 90 95 101 104 102 95 88 87 90 90 82 67 50 36 28 26 27 30 36 44
5699 44 55 67 74 73 64 50 36 27 27 30 31 24 11 2 8 23 36 36 19 -4 -27 -45 -59 -70 -75 -71 -61 -54 -53 -57 -64 -72 -77 -76 -70 -66 -69 -76 -83 -83 -70 -48 -20 4 21 32 42 50 55
5679 55 52 43 30 16 5 0 3 15 31 49 66 77 77 69 60 56 54 46 28 6 -9 -15 -11 0 16 27 25 10 -7 -18 -19 -7 15 50 86 115 130 130 119 100 76 52 35
5662 35 35 57 95 130 151 156 152 140 125 110 101 100 105 111 116 116 104 81 51 20 -4 -17 -14 -2 10 19 23 24 22 18 20 29 41 49 50 47 41 29 12 -4 -14 -15 -13 -13 -14 -11 -1 12
5643 12 26 36 42 43 32 4 -40 -86 -117 -124 -108 -77 -44 -25 -24 -40 -60 -76 -85 -83 -67 -41 -17 -7 -9 -14 -16 -22 -35 -46 -45 -30 -7 13 28 36 36 33 31 35 44 53 59 56 42
5625 42 24 15 21 36 47 47 38 24 5 -14 -25 -18 3 25 38 48 59 69 69 57 42 32 24 11 -5 -18 -26 -30 -35 -43 -51 -59 -58 -42 -12 17 38 48 54 59 61 59 60 70 92
5607 92 115 130 134 127 107 73 31 -5 -28 -37 -42 -44 -43 -42 -46 -55 -62 -67 -69 -67 -58 -43 -31 -24 -16 -1 17 29 29 23 16 12 8 0 -15 -33 -48 -56 -54 -39 -12 18 42 53 58 68 91 126
5588 126 167 204 227 230 221 208 199 190 181 174 171 171 170 166 159 152 142 128 105 76 47 19 -8 -33 -49 -47 -23 16 68 123 166 184 175 153 131 119 117 118 115 100 79 62 51
5570 51 41 26 7 -7 -13 -7 6 24 43 60 76 89 96 96 89 81 77 81 93 107 117 122 124 123 118 115 118 129 139 142 142 148 167 194 219 230 224 204 180 157 138 123 116 113 110 102
5552 102 93 90 94 102 103 93 76 63 60 67 77 83 84 78 67 53 42 32 20 2 -15 -21 -16 -6 -3 -16 -46 -85 -117 -129 -122 -108 -99 -102 -112 -125 -137 -144 -143 -130 -104 -72 -48 -38
5534 -38 -40 -43 -40 -35 -33 -35 -39 -38 -30 -16 -3 2 1 -2 -8 -15 -20 -18 -5 15 36 54 70 84 97 109 127 153 182 202 202 181 148 117 96 86 80 67 43 11 -14 -24 -18 -5 7
5516 7 17 23 28 30 32 35 39 46 48 41 20 -11 -43 -62 -61 -43 -20 0 15 27 32 27 13 2 2 10 14 5 -15 -40 -63 -82 -96 -99 -87 -63 -38 -18 -3 13 25 28 19 10 7 5 -1
5497 -1 -7 0 19 43 67 89 111 127 133 133 129 122 108 88 63 37 14 1 0 6 16 30 47 61 63 58 53 51 48 37 21 10 8 14 23 34 51 75 102 123 129 117 94 74
5480 74 67 74 86 97 104 110 115 117 110 95 78 71 78 91 102 107 109 115 124 129 129 123 116 118 129 138 132 114 100 103 117 125 125 125 135 149 162 174 188 207 226 235 229 210 188 167 147 124
5460 124 102 89 86 86 85 85 94 114 141 165 181 187 192 201 215 229 246 266 283 284 265 231 195 165 146 140 142 148 153 158 161 160 160 170 196 234 280 334 391 443 488 537 597
5443 597 665 736 813 901 999 1115 1269 1478 1751 2096 2551 3161 3957 4954 6157 7511 8808 9709 9914 9374 8305 7038 5824
5434 5824 4776 3925 3265 2771 2400 2115 1895 1732 1614 1527 1456 1388 1310 1215 1107 996 890 797 730 701 704 717 721 710 690 667 650 645 651 655
5422 655 651 640 628 620 622 640 674 716 764 821 890 963 1031 1101 1186 1290 1413 1564 1756 1999 2293 2652 3100 3665 4391 5347 6611 8255 10331
5410 10331 12839 15587 18069 19584 19627 18231 15930 13386 11040 9057 7453 6192 5215 4452 3853 3385 3018 2719 2476
5402 2476 2286 2129 1972 1804 1649 1527 1431 1342 1257 1184 1124 1073 1034 1011 995 972 943 918 897 874 855 855 881 924 975 1026 1070 1105 1139 1192 1274 1375
5390 1375 1488 1613 1753 1910 2097 2338 2644 3010 3449 3996 4689 5570 6712 8232 10248 12849 16108 19992 24118 27614
5382 27614 29423 28944 26441 22822 19029 15623 12786 10516 8742 7356 6254 5373 4679 4134 3696 3340 3050 2800 2556
5374 2556 2310 2071 1853 1665 1513 1394 1297 1211 1139 1089 1056 1026 994 961 923 877 834 809 806 810 816 832 869 921 979 1042 1112 1183 1248 1309 1377 1455 1546
5361 1546 1660 1815 2016 2264 2572 2963 3460 4091 4912 6004 7443 9293 11596 14285 17021 19160 20027 19338 17392 14847
5353 14847 12302 10073 8237 6777 5644 4765 4072 3518 3073 2704 2387 2116 1890 1697 1519 1356 1214 1096 994 913 861 832
5344 832 809 781 750 718 685 656 640 640 645 645 641 637 627 607 586 575 581 602 632 663 691 718 750 790 841 905 984 1078 1187 1317 1487 1704 1968 2292 2716
5330 2716 3290 4049 5016 6208 7571 8900 9850 10110 9611 8559 7288 6059 4998 4131 3444 2899 2453 2082 1785 1555 1373
5321 1373 1213 1063 918 778 650 555 504 483 471 456 439 420 396 368 345 327 311 293 276 263 254 251 254 261 261 251 237 222 205 188 179 181 184 172 144 115
5307 115 99 98 102 106 108 109 111 114 119 130 146 167 188 209 234 262 285 292 280 252 213 175 147 135 138 150 163 174 180 183 185 184 177 162 146 132 121 106 91 85 91 105 113 106
5289 106 83 55 32 21 24 41 70 102 125 133 126 113 104 105 117 132 145 153 159 162 155 141 131 134 146 156 158 159 164 173 178 173 157 132 109 98 102 114 125 130 124 112 102 104 117
5271 117 130 129 112 90 70 51 30 9 -7 -17 -20 -20 -18 -13 -7 0 10 29 56 85 104 107 97 83 71 67 73 91 112 124 119 101 84 77 81 89 100 110 114 109 98 91 90 96
5253 96 106 122 138 147 144 133 117 97 79 73 82 93 91 81 82 105 143 178 196 196 184 169 159 152 144 135 126 115 98 85 87 109 137 155 161 163 170 183 204 234 269 299 316
5236 316 324 327 328 326 321 310 288 258 225 192 160 126 94 69 58 59 64 63 48 27 11 7 13 22 27 32 41 52 62 66 65 63 64 66 69 72 72 66 58 55 61 69 72 70 71 74 76 73 75 87 109 131
5215 131 146 157 167 177 188 197 205 209 207 199 186 169 152 139 129 118 104 87 74 69 70 76 80 77 65 47 24 1 -18 -35 -46 -48 -45 -42 -47 -60 -74 -79 -75 -66 -56 -45 -30
5198 -30 -12 6 24 45 67 84 94 100 111 132 160 188 210 219 210 186 154 122 99 88 89 92 87 77 72 77 85 86 82 79 80 85 89 92 93 91 88 87 88 89 91 93 90 81 69 58 48 38
5179 38 27 16 7 2 5 19 38 55 65 67 61 48 33 24 22 21 19 19 21 24 24 18 8 -6 -24 -43 -62 -75 -79 -67 -42 -12 12 29 37 37 27 10 -4 -13 -12 -11 -16 -28 -35 -28 -12
5160 -12 -4 -10 -22 -26 -22 -15 -5 10 26 31 19 0 -12 -16 -13 -7 0 6 12 14 11 5 2 9 27 50 71 91 113 137 158 170 169 155 131 106 87 76 75 80 89 96 101 107 115 123 130 134 137 137
5140 137 134 129 121 111 98 85 76 73 77 87 102 115 126 136 144 146 138 124 116 120 129 132 127 118 113 115 122 132 137 136 130 122 114 108 103 95 81 60 33 5 -19 -39 -53 -67 -84 -104 -122 -131
5121 -131 -135 -140 -148 -151 -139 -115 -94 -82 -72 -53 -26 -4 2 -2 -6 -1 13 38 67 85 84 66 44 32 32 40 50 63 77 92 107 122 136 149 159 166 169 172 176 177 173 166 161 164 170
5102 170 171 168 167 171 173 167 155 143 132 124 117 114 112 107 101 96 93 90 91 100 115 126 123 109 92 78 63 42 13 -19 -45 -51 -41 -25 -15 -13 -18 -31 -49 -67 -74 -68 -54 -38 -24 -14
5084 -14 -9 -9 -12 -20 -36 -58 -81 -95 -94 -80 -58 -40 -33 -34 -37 -40 -45 -52 -62 -74 -83 -82 -69 -50 -38 -29 -13 15 48 73 85 85 79 74 74 77 73 60 48 45 50 58 67 80 97 117 137
5065 137 157 175 184 182 170 151 124 92 59 30 6 -10 -18 -14 -1 14 29 38 43 45 46 40 25 4 -14 -25 -30 -33 -35 -40 -48 -62 -83 -111 -141 -164 -176 -180 -180 -178 -178 -182 -192 -201 -200
5047 -200 -191 -178 -161 -137 -112 -101 -104 -107 -94 -65 -35 -13 0 4 4 7 22 47 68 80 84 90 99 109 115 117 118 119 117 111 103 100 105 119 137 157 174 182 177 159 135 113 95 84 83
5029 83 90 103 119 135 145 148 147 148 156 166 171 164 143 106 58 16 0 16 52 91 119 138 153 165 170 168 160 151 140 126 110 90 67 43 26 24 39 62 82 91 91 89 98
5012 98 125 163 202 231 245 242 221 181 129 82 50 31 16 -1 -15 -23 -28 -36 -45 -43 -26 -3 14 28 39 49 54 52 45 37 30 24 20 15 8 5 11 24 40 58 77 91 94 86 78
4994 78 78 85 96 109 129 153 173 186 191 191 186 175 161 147 138 138 145 151 148 135 113 85 57 39 36 44 56 64 64 57 43 33 35 50 69 81 85 83 77 66 50 34 26 32 51 74
4975 74 93 108 122 136 148 155 159 158 152 145 138 133 126 114 98 81 63 45 27 7 -18 -47 -73 -84 -77 -60 -45 -39 -39 -40 -38 -35 -34 -34 -38 -45 -51 -53 -48 -42 -35 -23 -1 25 48 60 62
4956 62 59 57 57 61 69 74 76 74 66 53 36 23 18 20 26 36 45 48 40 24 6 -10 -26 -41 -53 -56 -52 -43 -35 -28 -22 -18 -17 -19 -22 -24 -21 -15 -9 -4 3 21 55 102 150 189 210 213 202 180 154
4936 154 138 140 154 169 177 179 179 179 175 167 154 141 132 132 137 142 137 125 118 125 142 158 167 168 164 157 152 158 175 196 205 193 167 138 112 95 88 91 98 103 105 108 111 107 93 71 44 17 -5
4916 -5 -17 -12 8 35 56 65 67 73 94 128 160 175 168 144 115 87 64 49 43 44 45 43 38 31 24 26 41 68 96 121 143 162 178 188 192 188 174 152 127 103 83 69 61 60
4898 60 64 73 88 110 127 128 113 100 100 108 107 90 68 53 50 54 64 81 101 121 139 151 151 134 101 67 50 56 75 91 93 85 77 74 77 78 75 70 67 65 60 49 36 25 20 27 50
4880 50 89 136 177 198 193 166 128 90 67 60 64 68 69 71 81 95 108 114 114 107 95 83 75 69 57 37 11 -13 -33 -50 -60 -62 -55 -40 -24 -10 -4 0 14 43 80 114 139
4862 139 157 171 170 147 109 70 45 33 28 29 39 59 78 87 82 67 53 45 42 39 30 16 3 0 8 22 31 32 26 17 12 15 28 45 56 57 47 34 25 23 25 26 24 24 28 35 40 43 44
4843 44 46 46 49 60 77 89 87 75 64 58 54 53 63 80 91 91 87 90 98 100 93 87 97 126 164 195 208 204 190 173 148 112 72 37 15 0 -15 -32 -48 -62 -79 -102 -128
4825 -128 -151 -165 -168 -164 -157 -149 -138 -122 -101 -80 -65 -57 -48 -28 0 23 32 30 29 35 44 50 46 34 20 14 22 41 65 90 112 128 134 130 121 108 89 68 50 41 38 41 48 54 53 42 29
4807 29 17 5 -4 -3 15 43 67 85 98 105 101 88 73 61 46 29 18 21 33 41 38 28 19 16 14 4 -16 -42 -63 -74 -76 -76 -78 -87 -103 -122 -133 -133 -128 -125 -122 -110 -89 -65
4789 -65 -44 -26 -8 9 21 26 24 16 3 -11 -24 -28 -18 0 15 20 18 17 20 20 13 2 -7 -14 -21 -29 -39 -52 -65 -68 -50 -15 20 44 48 35 7 -26 -54 -69 -71 -65 -57 -49 -43 -45
4770 -45 -53 -63 -72 -80 -87 -88 -79 -59 -33 -11 -2 -11 -34 -63 -92 -115 -125 -117 -93 -64 -39 -21 -9 -4 -2 0 4 8 8 7 10 17 28 43 58 69 68 56 44 37 34 32 31 30 31 33 38 39 29
4751 29 12 -1 -1 8 17 16 6 -7 -19 -25 -25 -20 -12 -2 7 11 5 -6 -22 -44 -76 -111 -138 -148 -143 -124 -90 -42 2 25 23 11 5 14 25 25 10 -7 -14 -5 10 23 33 40 43
4733 43 41 40 49 70 94 110 117 127 147 174 191 191 179 171 177 190 197 189 165 135 108 92 86 84 80 70 56 47 47 52 55 48 36 24 16 8 -1 -9 -8 -1 3 3 0 -2 -7 -23 -46 -66 -68 -52
4713 -52 -29 -11 -5 -10 -19 -26 -26 -19 -10 0 9 19 33 49 63 71 74 74 73 69 61 54 50 50 53 64 89 124 157 177 186 187 180 162 135 108 90 82 78 69 51 32 21 26 43 61 70 71 68
4693 68 66 61 46 22 -2 -16 -15 -3 13 31 47 62 75 87 92 90 86 87 94 100 99 90 77 64 58 59 63 59 45 26 15 18 30 45 57 64 66 60 47 31 21 21 34 48 54 50
4674 50 42 31 14 -8 -31 -47 -56 -64 -72 -74 -67 -58 -55 -61 -67 -68 -63 -57 -53 -49 -47 -41 -28 -10 5 9 4 1 7 14 14 7 0 -6 -11 -10 -1 11 15 9 7 24 56 86 104 114 127 146 168 186 195 192
4654 192 177 152 122 93 71 56 47 45 52 66 85 105 124 138 142 132 116 104 101 105 111 115 112 100 81 66 63 70 81 91 99 100 93 76 51 18 -18 -50 -66 -67 -57 -39
4637 -39 -11 21 46 56 54 54 59 65 62 51 37 26 25 39 66 93 105 99 84 72 72 80 91 98 98 95 95 100 101 91 75 70 81 97 101 88 72 68 76 87 90 82 64 42 24 18
4618 18 29 52 76 92 100 103 106 106 98 80 57 35 19 13 15 24 36 51 66 79 88 91 89 83 70 51 28 8 -1 -1 0 -5 -17 -30 -39 -41 -36 -21 -1 18 35 46 52 58 64 71 76
4599 76 76 70 60 51 47 49 54 57 55 47 36 25 17 10 4 0 -1 6 20 35 49 65 89 119 147 165 166 158 146 133 114 88 60 40 29 27 28 27 21 11 2 2 8 8 -3 -24 -40 -42
4580 -42 -25 3 32 46 40 25 19 28 46 58 61 59 54 46 36 29 32 42 51 56 56 49 32 9 -9 -18 -21 -26 -35 -45 -54 -65 -79 -88 -88 -80 -69 -55 -34 -8 12 14 0 -19 -24 -10 15
4561 15 41 63 80 93 100 97 90 83 78 74 66 52 32 12 0 -3 0 4 6 5 0 -5 -10 -14 -19 -26 -30 -30 -32 -39 -49 -55 -53 -47 -39 -28 -14 -3 -1 -7 -11 -8 4 22 35 34 22 9 6 11 21 32
4540 32 42 48 49 53 69 101 141 178 201 207 200 189 180 163 131 89 55 41 40 39 34 33 42 59 75 85 85 80 76 76 86 103 126 148 164 169 164 153 139 125 112 105 108 120 132
4522 132 136 135 137 147 159 164 164 161 155 141 116 86 56 28 4 -7 0 26 55 74 83 94 116 141 157 152 131 105 77 46 13 -8 -12 2 27 55 82 104 116 117 110
4506 110 92 62 24 -9 -30 -39 -42 -41 -35 -27 -21 -18 -16 -10 0 12 22 21 12 0 -5 -5 -4 -4 0 11 16 3 -25 -49 -53 -39 -22 -13 -12 -15 -19 -27 -40 -53 -58 -54 -46 -43 -45 -46 -43 -37 -32 -36 -49
4485 -49 -67 -81 -87 -88 -89 -91 -86 -66 -33 2 31 46 46 34 18 7 6 21 51 84 108 113 104 92 86 88 96 105 111 112 112 116 125 137 150 157 157 152 150 156 163 164 156 147 137 120 92 61 37
4466 37 24 18 14 16 28 51 76 94 98 89 72 54 38 29 25 24 23 23 28 36 39 35 35 50 79 106 124 135 147 159 162 153 135 117 98 79 64 61 70 82 90 94 103 122 141 152
4447 152 151 142 133 125 121 120 118 112 101 92 91 96 97 87 68 46 27 14 11 17 28 40 51 65 78 85 86 86 95 112 123 115 87 51 19 0 -12 -23 -37 -50 -58 -56 -42 -12 31
4429 31 82 127 158 176 183 180 170 164 167 179 187 180 155 118 79 46 23 11 7 5 0 -14 -30 -40 -41 -35 -29 -18 3 33 61 82 94 103 113 127 146 167 180 180 175 169 161 147
4411 147 124 98 74 57 53 62 83 109 139 178 223 263 290 301 302 301 303 304 295 270 235 200 172 153 140 134 134 139 146 153 157 155 142 121 105 100 105 107 98 83 72 67 60 45 29
4393 29 21 19 16 8 4 9 22 38 52 61 62 52 32 7 -19 -40 -56 -67 -78 -85 -78 -53 -16 24 63 97 122 139 151 158 158 150 136 119 98 73 51 42 48 64 80 92 98
4376 98 98 92 82 70 53 32 5 -24 -52 -69 -67 -46 -19 4 22 38 55 73 89 100 101 93 83 79 83 87 87 86 88 94 92 77 54 34 29 36 45 48 45 40 36 34 32 29 26 24 21 24 37
4356 37 61 90 114 128 134 132 124 112 96 79 67 65 76 95 109 113 107 97 86 75 71 80 97 113 122 127 130 128 114 88 53 16 -15 -36 -41 -29 -7 19 47 69 81 85
4340 85 85 90 100 116 131 142 145 143 137 126 107 84 63 52 47 42 36 33 38 52 69 84 92 94 92 89 85 79 72 65 61 61 66 73 76 73 66 60 59 61 66 71 76 79 77 65 43 16 -2 -4 7 20
4319 20 20 7 -9 -19 -21 -17 -9 1 9 8 0 -12 -19 -18 -9 3 18 35 48 52 47 35 25 29 50 82 112 124 118 99 75 51 30 15 8 1 -7 -14 -7 11 30 38 36 30 20 2
4300 2 -22 -45 -59 -60 -48 -25 1 26 42 51 51 46 40 41 47 50 49 51 67 89 105 108 98 79 55 31 10 -9 -31 -50 -53 -35 -10 6 5 -5 -16 -22 -21 -16 -16 -25 -42 -57 -62
4282 -62 -57 -51 -49 -50 -50 -47 -43 -36 -19 9 40 57 54 43 37 40 48 52 49 36 15 -9 -36 -61 -80 -83 -65 -32 0 22 30 30 29 34 51 78 110 140 163 178 188 193 191 179 162 146
4264 146 133 123 109 89 65 45 38 46 64 85 103 114 114 106 98 101 114 123 122 109 90 64 34 3 -21 -39 -50 -51 -39 -22 -9 -7 -12 -21 -37 -57 -75 -80 -77 -76 -80 -86 -88 -88
4246 -88 -88 -88 -87 -81 -68 -51 -32 -17 -7 -4 -6 -7 -5 -2 -8 -28 -56 -79 -90 -89 -80 -66 -54 -46 -41 -34 -26 -24 -33 -52 -71 -84 -94 -99 -98 -87 -70 -59 -60 -64 -62 -55 -52 -57 -64 -65 -54 -34 -10
4226 -10 5 6 -6 -13 -2 20 40 51 56 58 51 31 7 -5 -4 3 11 19 30 43 51 51 43 31 24 27 42 68 96 119 133 142 150 155 153 146 139 132 119 94 60 27 3 -5 3 25 49
4207 49 63 65 62 56 46 27 0 -34 -66 -86 -90 -79 -60 -43 -34 -37 -54 -78 -97 -104 -104 -102 -101 -100 -100 -102 -105 -105 -103 -105 -112 -123 -130 -136 -141 -143 -134 -109 -66 -14 35 76 106 124 129 124 113 98
4188 98 77 47 14 -16 -42 -65 -84 -89 -75 -43 -5 23 37 36 33 40 59 83 104 120 127 124 112 100 94 93 92 89 90 94 94 83 63 40 14 -13 -37 -51 -54 -47 -35 -23 -11
4171 -11 0 14 32 44 42 26 5 -15 -38 -60 -74 -78 -79 -83 -87 -81 -62 -34 -6 9 5 -13 -28 -23 1 33 56 68 68 59 47 41 42 43 40 34 26 22 28 46 67 78 72 60 48
4153 48 31 6 -22 -41 -45 -42 -39 -38 -41 -50 -70 -90 -98 -88 -65 -44 -30 -22 -12 1 17 26 26 18 9 10 30 65 103 130 146 157 163 157 136 108 88 83 89 99 109 114 118 124 135
4135 135 149 164 178 191 199 200 195 189 183 181 188 209 252 317 396 464 491 463 398 326 270 228 192 157 127 103 79 49 20 1 0 10 25 34 36 33 28 21 17 19 29 43
4118 43 50 45 27 1 -25 -49 -60 -55 -37 -20 -13 -18 -32 -46 -55 -55 -46 -33 -18 -4 1 -6 -25 -43 -48 -36 -13 15 44 61 58 40 22 12 10 12 16 19 19 20 24 31 36 39 51 76
4099 76 106 128 133 124 107 85 58 28 -5 -44 -81 -101 -99 -85 -72 -67 -65 -62 -58 -52 -38 -13 21 59 92 119 137 145 142 130 114 100 94 95 104 115 125 133 142 151 158 162 159 149 134
4081 134 118 102 85 64 40 17 1 -5 -6 -5 -2 3 11 18 19 14 9 10 13 11 5 3 14 38 68 98 122 134 136 130 119 103 84 63 42 18 -7 -28 -38 -38 -35 -32 -26 -15 0
4063 0 12 15 5 -18 -47 -65 -67 -59 -52 -50 -50 -46 -36 -22 -11 -5 -5 -10 -21 -34 -43 -45 -41 -37 -35 -35 -36 -38 -42 -48 -56 -68 -78 -79 -70 -58 -46 -33 -17 -2 6 10 16 21 21 17 16 23 34 41 39 26
4042 26 9 -1 3 19 34 42 44 42 36 25 19 26 45 63 75 82 88 93 97 100 104 105 105 107 112 116 113 100 83 70 64 63 62 63 66 68 67 65 67 74 77 72 63 58 66 79 84 75 55 38 27 23 25 35
4021 35 49 56 44 22 10 19 41 62 77 86 90 89 84 78 70 53 30 7 -16 -43 -72 -89 -85 -63 -34 -5 25 57 82 99 110 116 114 105 96 94 100 104 101 91 77 57 32 9
4003 9 -2 1 15 31 42 56 78 105 126 132 128 123 122 122 117 110 107 109 114 119 122 120 117 118 127 139 146 143 132 123 119 118 115 110 107 107 110 112 112 111 112 114 116 113 103 88 72 57 40 15 -14 -36 -40
3982 -40 -25 -1 15 19 9 -4 -14 -17 -16 -11 -2 9 25 46 73 104 131 147 148 131 98 63 42 42 58 79 102 125 138 134 115 94 78 64 49 39 43 58 76 83
3966 83 76 61 50 50 59 66 63 49 34 28 35 48 58 58 53 48 44 38 28 20 21 33 44 44 31 15 5 2 0 -3 -4 3 20 35 41 42 40 39 36 31 26 21 14 6 -2 -11 -18 -20 -15 -7 1 10 19 24 24 19
3943 19 9 2 5 21 45 62 68 71 81 95 103 99 89 80 73 68 60 48 33 23 25 38 52 52 37 11 -13 -27 -27 -16 -5 3 14 30 50 69 84 94 93 81 63 43 24
3926 24 4 -12 -22 -25 -25 -27 -32 -40 -46 -45 -33 -13 9 28 41 49 54 54 42 19 -8 -28 -37 -37 -32 -25 -19 -20 -28 -35 -31 -14 7 27 42 48 49 50 57 65 63 50 33 24 26 36 54 81 112
3906 112 136 147 149 147 148 155 170 191 213 228 229 216 194 165 131 93 58 35 28 36 50 55 46 28 10 0 -7 -15 -15 1 33 65 86 94 92 81 61 33 2 -26 -44 -45
3889 -45 -29 -5 16 30 39 43 43 45 54 63 63 50 27 0 -28 -56 -78 -86 -79 -58 -29 -2 16 27 35 42 48 49 46 39 32 27 26 25 18 2 -16 -29 -34 -31 -25 -23 -27 -35 -38 -33 -25 -17 -11 -3 7
3869 7 18 28 35 39 46 62 80 91 86 69 50 41 46 66 94 117 122 111 91 74 64 62 66 62 43 16 -2 0 15 35 49 53 49 36 22 15 17 28 47 70 86 86 73 56
3851 56 43 27 5 -13 -16 0 24 44 52 50 41 30 24 28 38 45 42 29 8 -15 -35 -38 -26 -12 -6 -3 9 36 66 86 90 79 58 37 25 26 33 42 51 64 78 92 103
3834 103 112 114 107 86 54 17 -15 -36 -46 -53 -57 -53 -41 -27 -20 -21 -27 -40 -62 -82 -86 -68 -42 -21 -6 5 17 28 39 51 62 66 61 47 28 15 18 38 65 85 88 78
3817 78 62 52 57 80 114 148 173 188 192 183 164 138 109 83 62 50 45 43 46 51 56 54 46 38 35 41 55 74 91 102 110 120 136 150 160 161 150 127 99 78 70 72 78 86 88
3799 88 79 54 26 9 9 17 21 12 -6 -26 -38 -41 -43 -50 -56 -55 -45 -33 -21 -7 12 36 56 64 55 37 22 21 36 57 75 84 81 68 53 39 23 -2 -38 -70 -85 -80 -61
3782 -61 -36 -10 14 37 56 65 56 28 -5 -28 -34 -30 -28 -29 -36 -46 -58 -59 -40 1 57 112 154 173 162 127 76 24 -17 -43 -54 -52 -43 -26 -1 27 55 80 101 115
3766 115 116 105 85 67 56 50 48 44 34 18 0 -15 -24 -32 -46 -69 -97 -123 -136 -132 -113 -90 -73 -67 -67 -65 -55 -36 -14 7 26 40 45 37 16 -12 -43 -67 -81 -87 -89 -92
3749 -92 -94 -89 -73 -51 -27 -8 1 0 -6 -13 -16 -19 -24 -27 -20 3 40 84 126 161 183 190 181 164 146 137 140 149 155 150 133 109 82 55 28 -2 -31 -52 -61 -61 -57 -48 -29 -1 27 50
3730 50 66 71 66 56 49 45 39 31 25 24 23 19 14 11 12 17 26 37 44 41 32 21 6 -14 -41 -66 -83 -89 -85 -73 -55 -37 -20 -5 3 0 -18 -45 -72 -95 -110 -112 -104 -90 -70 -39 2
3712 2 40 60 61 52 43 34 24 17 18 22 23 17 11 8 11 17 22 25 22 17 17 26 38 42 31 8 -21 -47 -63 -62 -45 -17 14 41 64 87 112 136 145 135 110 83 61 43 25 8 -1
3693 -1 -2 2 5 8 15 34 60 79 83 76 69 65 58 44 26 10 -6 -26 -48 -63 -64 -52 -36 -22 -14 -13 -21 -35 -51 -63 -65 -56 -38 -18 1 14 19 15 6 -3 -9 -8 1 22 48 71 85
3674 85 88 85 76 65 50 31 5 -21 -40 -46 -46 -53 -68 -82 -87 -85 -76 -60 -41 -34 -49 -81 -109 -119 -109 -84 -47 -3 31 46 36 13 -7 -17 -22 -25 -28 -22 -5 15 26 19 1
3656 1 -19 -40 -61 -81 -99 -113 -122 -121 -106 -78 -49 -30 -31 -46 -57 -48 -16 26 62 80 79 61 33 6 -9 -14 -13 -6 6 24 37 39 36 38 46 51 45 28 4 -20 -40 -49 -47 -32
3639 -32 -7 26 67 105 132 142 139 132 128 129 136 148 164 182 199 212 217 211 194 173 154 140 132 132 142 153 155 139 105 63 23 -3 -10 0 20 42 63 79 83 73 60
3622 60 58 69 84 96 103 102 97 91 90 88 79 59 34 13 -1 -9 -10 -9 -6 -2 5 17 29 42 56 69 76 80 89 105 127 147 160 160 152 141 129 113 91 74 74 89 106 113 112 105 93
3603 93 73 47 19 -8 -35 -59 -76 -84 -84 -82 -81 -84 -89 -90 -83 -70 -52 -38 -31 -34 -38 -35 -25 -16 -11 -3 13 27 25 4 -24 -46 -54 -51 -39 -23 -4 16 36 47 44 31 19 17 26 38
3585 38 46 46 46 55 74 94 97 77 40 -2 -37 -53 -48 -34 -24 -25 -30 -36 -44 -53 -62 -66 -67 -65 -54 -34 -12 0 1 -4 -10 -16 -24 -38 -52 -61 -66 -67 -71 -77 -83 -89 -96 -103 -110 -110 -101 -81 -52 -18 8
3565 8 25 31 36 47 64 82 93 95 89 81 75 73 78 92 104 108 102 93 82 62 33 4 -14 -23 -31 -41 -46 -44 -38 -29 -17 -2 6 5 0 -6 -11 -22 -40 -56 -62 -54 -43 -39 -43 -49 -47 -41 -41 -51 -66
3544 -66 -78 -81 -74 -58 -37 -15 3 15 22 28 37 50 66 76 77 75 80 96 113 120 115 109 111 121 125 116 99 85 74 66 59 60 69 82 95 104 109 109 107 102 90 66 35 8 -6 -9 -5 2
3525 2 8 8 0 -14 -24 -26 -23 -20 -20 -23 -30 -34 -27 -7 20 46 68 81 82 70 54 38 23 6 -6 -5 12 32 43 46 49 53 53 47 35 23 12 4 4 10 15 12 -1 -20 -40 -55 -62 -64
3506 -64 -64 -66 -70 -70 -61 -44 -21 3 24 35 34 31 31 35 40 42 41 36 27 18 15 20 27 26 17 8 5 12 28 57 97 137 163 164 140 101 60 31 14 2 -15 -39 -58 -57 -38 -15 0 3
3486 3 0 2 15 38 63 79 82 75 60 44 29 17 3 -11 -24 -31 -30 -24 -11 8 29 39 33 15 -3 -16 -24 -27 -24 -15 -3 7 10 5 -5 -11 -7 8 25 29 16 -7 -28 -39
3469 -39 -40 -37 -26 0 39 78 105 116 121 127 128 118 100 85 80 80 73 59 50 51 61 70 74 74 70 59 48 42 41 34 16 -4 -16 -15 -4 8 20 33 47 59 66 63 46 18 -13
3451 -13 -35 -37 -16 11 22 5 -31 -66 -92 -114 -136 -149 -148 -134 -113 -91 -68 -45 -29 -21 -18 -14 -5 9 23 31 41 57 77 90 85 62 32 9 0 6 16 22 19 11 5 9 22
3433 22 37 42 32 14 4 11 25 35 38 43 58 85 116 143 157 155 136 112 96 96 107 119 125 125 121 112 99 84 69 63 70 92 120 141 147 143 137 133 132 131 132 134 132 124 110 89
3415 89 58 17 -24 -55 -69 -71 -67 -65 -66 -70 -74 -78 -80 -81 -80 -76 -69 -61 -58 -58 -55 -46 -33 -28 -33 -40 -40 -29 -14 -2 9 17 18 9 -5 -13 -10 8 35 61 78 82 77 70 64 58 53 49 44 40 38 34 23 11
3393 11 9 22 38 42 34 29 35 47 57 61 57 48 32 13 -4 -14 -11 7 35 59 73 78 81 88 98 109 116 119 121 127 135 141 140 136 136 137 134 124 109 95 90 94 103 107 101 87 69 48 29
3373 29 18 21 30 35 28 13 0 1 20 50 83 108 123 126 120 108 101 104 115 120 113 99 90 93 106 119 123 114 90 55 18 -10 -24 -22 -13 -1 14 31 46 51 42 21 0 -11 -5
3355 -5 12 32 45 49 46 38 27 16 8 0 -10 -20 -27 -26 -19 -10 0 11 20 27 30 29 24 19 13 10 7 4 5 9 16 21 19 16 19 28 39 44 41 36 29 17 0 -22 -40 -53 -64 -77 -93 -107 -114 -112
3334 -112 -108 -109 -120 -133 -138 -130 -111 -88 -62 -36 -14 0 5 7 4 -2 -7 -5 5 23 44 63 80 94 105 110 108 98 80 62 51 54 64 68 55 26 -6 -33 -47 -46 -33 -16
3318 -16 -7 -5 0 17 42 60 65 61 56 53 49 41 30 17 10 20 46 76 94 94 87 87 95 104 105 99 90 87 93 105 116 119 114 106 94 80 69 67 76 88 96 96 90 78 61 45 33 26 16 4
3298 4 -4 -9 -10 -14 -21 -28 -34 -37 -36 -29 -15 1 20 36 43 45 53 75 106 131 145 150 146 130 105 86 86 107 134 154 157 146 129 117 114 117 117 117 123 130 126 103 72 53 54 69 85 93 97
3278 97 99 97 87 72 62 63 70 73 69 63 58 50 37 19 0 -22 -44 -59 -61 -54 -41 -26 -11 -1 0 -3 -7 -8 -8 -8 -9 -14 -22 -26 -19 -6 6 13 18 27 35 36 23 -2 -29 -49 -55 -52 -42 -32
3258 -32 -25 -24 -31 -45 -69 -106 -148 -179 -188 -173 -142 -102 -56 -12 21 46 68 92 111 120 118 106 82 45 3 -28 -42 -38 -23 -9 -3 -9 -23 -33 -33 -26 -18 -12 -12 -21 -37 -49 -48
3240 -48 -28 2 31 47 47 35 26 24 28 28 21 18 28 50 74 88 90 80 61 35 4 -24 -48 -65 -79 -92 -106 -121 -135 -145 -150 -150 -141 -120 -91 -63 -42 -26 -11 2 10
3224 10 9 3 -4 -12 -20 -23 -19 -6 15 43 69 88 96 95 86 67 42 17 0 -12 -27 -49 -72 -87 -90 -81 -58 -22 20 58 79 82 76 67 55 42 32 31 36 40 40 35 27 16 6 10
3206 10 37 87 140 175 183 167 139 107 75 47 30 22 20 18 18 29 51 76 87 79 64 58 66 85 105 123 136 139 127 102 74 50 32 21 14 11 7 6 13 28 48 60
3189 60 60 51 40 30 21 5 -16 -38 -49 -44 -31 -18 -9 -5 -5 -6 -6 -6 -9 -20 -35 -44 -44 -39 -38 -46 -62 -78 -88 -93 -96 -102 -103 -89 -65 -42 -33 -34 -33 -29 -28 -33 -41 -44 -37 -24 -11 1 18 36
3169 36 50 54 48 39 32 23 11 0 -4 -3 1 6 7 6 3 0 -4 -12 -17 -16 -9 -6 -10 -19 -29 -38 -47 -53 -54 -48 -38 -22 3 36 65 81 81 73 62 51 41 32 25 19 15 13 13 15 18 21 18 9 -5 -26 -51
3147 -51 -80 -110 -136 -153 -158 -146 -120 -85 -47 -14 12 34 54 68 77 84 96 111 119 118 113 112 108 94 69 40 13 -14 -36 -44 -37 -24 -11 1 15 25 32 45 67 91 106
3130 106 112 116 116 110 100 92 86 75 60 46 37 24 3 -21 -42 -58 -73 -90 -106 -115 -114 -106 -97 -95 -95 -88 -69 -44 -15 16 52 84 102 104 90 66 36 5 -21 -43 -59 -64 -53
3113 -53 -32 -14 -5 -2 2 12 29 50 67 72 61 39 14 -4 -12 -9 2 22 47 69 77 66 44 26 20 19 15 11 22 51 86 109 115 110 103 97 91 88 86 83 79 74 69 61 51 47 55 71
3094 71 86 88 76 57 38 27 26 32 40 45 43 31 15 2 0 4 7 5 4 11 26 38 37 23 6 -6 -8 2 21 37 42 32 17 6 7 16 32 48 60 61 48 27 8 -1 -2
3075 -2 1 5 11 17 15 1 -20 -38 -42 -33 -19 -3 19 51 87 116 132 131 115 88 62 39 19 -2 -25 -40 -46 -44 -38 -30 -22 -16 -14 -15 -17 -20 -18 -10 3 21 41 64 88 105 112 110 100
3057 100 82 58 36 20 7 -5 -20 -29 -33 -35 -40 -46 -47 -43 -34 -20 -8 0 3 6 12 20 29 34 32 24 16 17 24 23 9 -12 -32 -43 -51 -58 -68 -74 -71 -55 -31 -9 2 5 6 6 7 14 27 44
3037 44 60 66 61 48 30 10 -12 -36 -54 -57 -45 -25 -5 14 34 50 55 46 26 1 -22 -45 -66 -87 -104 -110 -100 -75 -47 -22 -3 13 27 34 29 12 -12 -42 -67
3021 -67 -77 -72 -61 -54 -52 -49 -36 -13 14 44 69 82 82 75 67 62 56 48 40 40 53 74 91 90 71 44 28 34 52 66 68 59 50 43 40 38 37 31 16 -6 -25 -30 -18 7 43 78 101
3002 101 106 97 88 88 94 97 91 81 73 69 65 58 49 40 35 32 30 32 41 58 78 96 108 111 101 82 69 79 113 152 177 182 173 155 131 105 84 72 64 49 23 -5 -22 -21 -9 1
2984 1 1 -4 -12 -16 -15 -12 -8 -5 0 6 20 37 53 62 61 58 62 76 92 100 95 78 52 25 5 -3 -2 5 22 45 72 90 95 89 79 69 60 47 33 25 32 54 80 99 109 118 129 136 132
2964 132 116 93 71 58 61 79 106 135 160 180 190 185 169 148 130 114 100 89 85 81 68 44 14 -10 -24 -31 -35 -39 -40 -34 -23 -12 -6 -3 -1 5 19 41 63 77 75 60
2947 60 39 20 3 -12 -26 -37 -46 -54 -60 -66 -75 -89 -97 -88 -61 -33 -18 -16 -18 -23 -32 -44 -49 -44 -36 -32 -32 -34 -38 -45 -54 -59 -59 -56 -48 -38 -29 -21 -11 -4 -8 -23 -36 -33 -16 2 12 16 16 13 7 7
2926 7 17 33 49 59 62 52 34 14 2 -2 -6 -11 -21 -35 -48 -54 -49 -38 -28 -22 -14 1 23 43 55 61 62 59 50 41 35 32 29 30 45 76 109 128 129 119 108 94 77 63 57
2908 57 56 55 48 33 12 -9 -22 -23 -15 -6 4 18 27 22 0 -30 -58 -74 -77 -67 -51 -33 -14 5 24 31 16 -17 -51 -69 -65 -49 -31 -16 -6 -3 -10 -20 -27 -24 -18 -12 -9 -7 -8
2890 -8 -12 -19 -27 -32 -34 -34 -31 -23 -5 17 34 37 29 19 12 3 -7 -13 -13 -15 -27 -43 -55 -60 -65 -65 -52 -26 -1 12 20 31 47 63 75 75 62 42 25 17 14 14 17 24 35 48 70 106
2871 106 148 178 187 179 165 155 152 151 145 127 103 85 82 90 104 117 128 136 144 154 168 180 187 185 172 153 131 115 107 99 84 58 26 -5 -34 -55 -63 -57 -45 -36 -37 -44 -54 -60
2853 -60 -60 -52 -36 -13 14 40 61 76 89 107 129 145 149 150 156 169 180 181 172 154 129 101 72 42 10 -17 -29 -25 -15 -14 -19 -22 -21 -21 -21 -15 1 20 26 18 3 -9 -17 -19 -15
2835 -15 -6 0 0 -7 -16 -20 -22 -26 -27 -19 2 29 52 64 69 74 80 84 82 73 57 39 21 3 -17 -35 -41 -28 -1 26 51 70 88 111 141 174 198 203 189 168 152 147 150 154 152 138
2816 138 112 75 36 1 -29 -57 -82 -94 -85 -58 -26 -1 17 32 44 49 44 32 19 6 -4 -15 -28 -38 -40 -33 -23 -20 -23 -25 -23 -21 -21 -21 -21 -20 -18 -12 -2 7 17 32 56
2799 56 77 81 72 63 69 80 77 50 10 -22 -34 -32 -27 -27 -30 -31 -27 -22 -17 -14 -17 -25 -32 -34 -33 -34 -44 -57 -66 -66 -54 -30 6 45 77 98 107 107 99 84 69 62 66 78 92 100 101 101 105 114 123 130
2778 130 134 134 130 125 128 146 172 194 207 213 214 208 201 196 194 185 166 141 121 110 110 121 135 140 127 102 74 50 31 22 28 47 67 79 80 74 67 66 74 83 82 68 49 39 39 44 51 61
2759 61 73 85 95 104 108 106 99 89 77 64 55 58 74 94 106 108 107 109 113 118 117 108 90 72 65 68 71 65 54 49 49 49 47 44 43 40 36 33 31 28 23 21 24 26 21 16 20 34 47 53 56 57 47 16
2737 16 -31 -81 -117 -131 -119 -84 -39 0 25 43 61 80 93 97 92 79 59 36 16 3 -2 -8 -11 -3 19 52 83 102 106 92 56 6 -37 -62 -70 -71 -73 -74 -69 -59 -42
2721 -42 -21 -1 9 12 10 4 -6 -20 -29 -28 -19 -9 -2 1 -1 -13 -31 -47 -62 -73 -79 -76 -66 -56 -48 -38 -23 -3 21 51 85 112 119 104 77 52 38 32 30 29 28 23 11 -5
2703 -5 -20 -23 -13 3 15 19 17 12 7 3 0 -1 5 21 39 52 54 49 44 42 43 42 39 34 29 23 19 22 36 57 75 82 82 80 77 67 46 19 -8 -33 -55 -69 -63 -39 -13 -1 -10 -32 -58
2684 -58 -83 -106 -124 -133 -130 -121 -111 -104 -99 -93 -89 -89 -91 -90 -79 -59 -32 -10 3 7 3 -7 -21 -37 -48 -56 -66 -79 -89 -86 -70 -50 -38 -39 -50 -65 -75 -73 -54 -24 4 25 36
2666 36 39 36 27 12 -4 -14 -12 0 19 33 42 47 52 58 56 40 13 -13 -32 -44 -55 -69 -83 -95 -99 -91 -67 -40 -23 -20 -21 -13 4 25 44 59 65 60 50 46 50 59 66 67 57 39
2648 39 22 17 20 24 23 22 25 23 10 -4 -9 1 22 46 68 89 103 103 86 54 21 1 -2 1 3 0 -6 -14 -25 -35 -42 -49 -59 -70 -70 -56 -36 -18 3 35 71 94 94 74 52
2630 52 41 41 47 52 57 63 72 79 78 71 64 60 59 56 49 34 12 -11 -33 -49 -55 -44 -17 10 24 25 26 38 53 59 56 53 57 64 67 71 80 91 93 79 52 22 -1 -19 -31 -32 -19 4 31
2610 31 54 73 90 100 97 80 59 44 38 36 35 31 24 13 0 -10 -14 -15 -18 -25 -31 -26 -11 1 6 11 28 58 81 83 70 53 31 0 -33 -58 -64 -53 -30 -1 23 33 25 12
2592 12 1 -7 -13 -9 6 21 21 8 -7 -18 -24 -25 -20 -11 -3 -2 -2 3 17 35 54 70 80 80 72 55 36 19 11 12 17 20 23 24 24 15 -4 -35 -72 -102 -118 -118 -110 -98 -83 -60 -31
2574 -31 -3 15 24 30 41 58 77 90 100 113 131 138 119 77 32 1 -14 -23 -33 -41 -48 -55 -61 -58 -43 -22 -5 4 12 23 33 35 29 21 12 1 -12 -22 -23 -17 -8 1 15 37 65
2555 65 95 122 140 149 149 144 136 128 124 124 120 109 94 85 91 108 127 142 153 165 181 198 213 220 219 210 193 171 149 129 111 93 77 59 35 3 -33 -64 -81 -89 -93 -94 -84
2538 -84 -60 -29 -2 11 15 14 12 5 -3 -10 -7 4 12 6 -16 -47 -69 -72 -53 -23 3 17 20 19 18 16 10 1 -3 3 20 40 56 66 71 69 64 66 84 116 152 177 190 199 212 229 240
2519 240 234 214 190 170 156 148 146 152 160 160 148 128 109 90 69 46 23 4 -7 -16 -27 -45 -69 -94 -116 -131 -136 -133 -120 -101 -84 -75 -73 -70 -60 -44 -32 -23 -15 -3 11 24
2502 24 34 43 51 56 55 49 41 39 44 50 47 32 11 0 6 21 35 39 36 33 35 40 42 37 27 18 14 11 8 8 14 22 28 27 21 13 3 -14 -40 -62 -67 -57 -45 -39 -42 -45 -47 -48 -45 -39 -37 -40 -45 -45 -37 -30 -29
2480 -29 -28 -19 -3 11 19 20 15 5 -13 -35 -54 -63 -61 -53 -44 -37 -29 -19 -5 9 18 16 3 -13 -25 -30 -25 -16 -10 -11 -20 -33 -51 -79 -116 -146 -156 -141 -115 -88 -61 -34 -11 2 3
2461 3 -5 -20 -40 -64 -87 -103 -106 -91 -65 -36 -17 -14 -26 -47 -64 -66 -49 -23 1 17 23 19 7 -8 -20 -24 -22 -16 -8 3 18 37 61 85 100 99 84 63 50 55 73 95
2445 95 112 122 123 111 91 70 53 39 24 7 -6 -20 -36 -52 -59 -50 -27 0 21 30 27 17 8 9 16 23 24 24 27 37 51 62 69 75 80 80 73 64 58 57 60 67 72 64 40 10 -6
2426 -6 -2 7 11 6 0 -3 -4 -4 -3 0 5 20 42 62 72 71 65 56 46 36 30 33 46 64 76 69 41 0 -32 -44 -32 -2 31 59 78 92 110 131 150 158 149 124 92 67 57
2408 57 55 52 41 27 16 11 9 8 6 4 2 -3 -12 -16 -8 9 29 40 40 32 21 13 14 24 37 49 60 70 75 70 60 50 41 32 29 35 42 40 29 22 25 32 31 19 2 -11 -14 -9 -2 -3 -9 -13
2387 -13 -12 -12 -15 -17 -16 -15 -25 -43 -59 -68 -71 -69 -64 -57 -45 -26 0 25 44 54 59 60 59 57 58 59 57 54 54 61 70 73 67 53 31 3 -23 -44 -64 -92 -126 -156 -165 -151 -126 -104 -90 -84
2368 -84 -80 -79 -78 -74 -62 -42 -21 -8 -8 -18 -30 -43 -58 -75 -88 -92 -95 -110 -138 -164 -174 -167 -153 -135 -114 -92 -70 -51 -37 -33 -37 -40 -32 -18 -9 -9 -11 -3 10 21 17 0 -19 -22
2350 -22 -5 24 49 64 68 59 33 -2 -34 -53 -62 -66 -65 -57 -46 -37 -32 -27 -19 -3 24 68 127 200 293 411 554 726 933 1179 1454 1740 2013 2250 2425
2336 2425 2512 2496 2384 2193 1947 1673 1401 1161 967 817 695 590 500 437 403 388 374 349 318 289 265 243 220 196 179 170 167 162 149 131 113
2323 113 96 82 79 93 115 126 112 80 42 7 -24 -46 -54 -48 -39 -34 -31 -20 0 18 25 19 7 0 3 10 8 -9 -37 -62 -70 -62 -45 -22 2 28 51 62 60 49 42 46 59
2306 59 68 67 59 50 40 24 4 -14 -27 -35 -36 -23 3 38 70 95 112 117 108 85 53 24 6 3 11 20 21 13 0 -12 -21 -28 -34 -41 -43 -33 -14 5 15 16 13 8 0 -3 -3 0 -3 -12 -21
2286 -21 -26 -26 -27 -32 -40 -49 -50 -36 -11 13 25 18 -1 -21 -31 -27 -15 -3 2 4 6 9 13 13 4 -11 -21 -15 4 28 47 59 62 54 39 29 26 28 28 27 20 1 -27 -53 -68 -77 -89 -101
2267 -101 -109 -118 -133 -149 -153 -144 -129 -116 -101 -79 -52 -25 -2 9 10 6 6 12 18 20 20 18 12 2 -3 -4 -7 -18 -28 -27 -15 2 25 49 64 58 38 20 19 31 44 52 56 62 72 85
2249 85 92 86 67 43 22 6 -1 1 17 43 72 93 95 79 55 39 34 33 33 35 39 35 22 5 -7 -17 -29 -42 -46 -41 -33 -29 -29 -29 -29 -27 -24 -21 -19 -19 -22 -31 -43 -56 -65 -70 -71 -72 -72 -72 -71
2228 -71 -69 -68 -63 -54 -45 -45 -55 -72 -85 -92 -94 -93 -89 -84 -83 -86 -92 -100 -109 -115 -111 -89 -53 -14 14 26 18 -1 -22 -36 -45 -52 -61 -72 -85 -101 -115 -124 -129 -131 -127 -112 -89 -69 -66 -76 -90 -102 -113
2209 -113 -125 -139 -149 -153 -150 -147 -146 -142 -127 -99 -64 -31 -4 12 13 0 -12 -12 2 19 27 22 8 -14 -45 -82 -117 -144 -163 -175 -180 -182 -184 -188 -185 -166 -133 -101 -83 -79 -78 -77 -81 -91
2191 -91 -100 -102 -105 -116 -130 -132 -113 -82 -47 -12 22 49 56 37 -3 -54 -103 -134 -139 -123 -96 -66 -40 -21 -13 -16 -28 -43 -58 -69 -70 -60 -44 -27 -14 -6 -1 3 14 32 51
2174 51 59 48 19 -19 -59 -90 -106 -108 -104 -99 -98 -98 -93 -79 -56 -27 -2 10 13 12 19 36 57 72 79 79 74 61 41 21 7 -2 -13 -26 -37 -42 -41 -38 -37 -39 -38 -33 -27 -25 -25 -21 -7 15
2155 15 42 66 85 96 94 80 59 39 29 29 30 22 1 -21 -37 -42 -41 -36 -24 -2 22 31 19 -7 -29 -37 -35 -29 -20 -8 -1 -5 -17 -27 -26 -15 1 19 34 42 36 21 6 -2
2137 -2 -4 1 20 56 101 139 156 149 127 99 71 44 17 -6 -28 -52 -78 -99 -101 -80 -45 -7 25 56 87 117 144 165 176 172 156 131 103 75 55 52 64 77 77
2122 77 61 39 19 5 -6 -18 -31 -47 -64 -81 -99 -120 -139 -145 -135 -117 -103 -93 -83 -64 -38 -10 7 14 11 10 17 28 34 29 18 11 10 12 11 6 -3 -19 -38 -54 -63 -71 -80
2105 -80 -88 -82 -59 -29 -4 11 20 23 16 -2 -26 -47 -62 -70 -70 -58 -39 -19 -1 15 30 38 34 24 14 9 9 13 23 36 41 31 8 -15 -32 -44 -63 -93 -124 -141 -136 -112
2088 -112 -74 -27 20 62 92 112 127 133 126 103 68 29 -3 -27 -38 -42 -43 -47 -53 -64 -78 -89 -85 -62 -34 -18 -18 -21 -15 -3 0 -10 -23 -25 -12 8 26 31 20 0 -18
2071 -18 -27 -31 -36 -41 -42 -36 -27 -22 -20 -20 -17 -13 -6 -1 -3 -13 -21 -21 -15 -12 -17 -25 -30 -36 -43 -51 -55 -55 -52 -42 -20 13 48 70 77 80 87 98 108 115 127 145 164 170 162 151 146 143 130 108 87 76 69 57
2050 57 40 27 23 28 41 57 68 68 62 58 60 60 49 32 20 18 21 24 27 27 21 3 -22 -46 -64 -75 -83 -89 -91 -91 -93 -97 -103 -109 -112 -110 -101 -84 -60 -31 -4 14 20 18 16 20 26 29 32 39 48 55
2029 55 57 63 79 104 129 149 159 159 150 135 117 97 74 49 30 23 28 40 51 57 58 59 63 69 70 63 58 65 83 101 106 101 95 93 87 75 63 58 60 62 57 48 41 40 44 51 60 72 81 76 54
2008 54 25 9 14 30 45 54 65 78 88 94 95 95 90 80 70 68 71 73 71 65 54 41 28 21 18 18 22 27 30 24 7 -19 -54 -89 -114 -124 -123 -124 -135 -149 -159 -162 -159 -149 -136 -122
1990 -122 -110 -98 -83 -67 -53 -47 -50 -60 -70 -70 -65 -65 -79 -105 -131 -150 -158 -153 -136 -113 -98 -96 -104 -110 -106 -93 -79 -73 -78 -82 -74 -55 -32 -15 -8 -10 -17 -24 -27 -26 -23 -17 -5 9 18 22 33
1971 33 56 82 98 103 107 114 121 126 131 137 135 116 79 32 -9 -36 -42 -31 -13 0 5 4 3 11 25 36 36 26 13 4 0 0 -1 -2 -1 2 11 25 46 74 103 124 132 132 134 137 133 118 99
1951 99 82 68 57 52 59 77 97 113 123 125 112 83 48 15 -7 -22 -30 -33 -29 -25 -25 -29 -33 -29 -20 -16 -22 -35 -42 -37 -20 1 16 21 20 20 25 32 37 33 22 6 -10 -29 -50 -72 -86
1932 -86 -92 -96 -102 -102 -83 -42 7 48 70 70 57 44 39 38 34 23 16 22 35 38 23 -1 -14 -1 34 78 113 131 138 139 138 134 125 113 98 84 74 68 61 49 30 9 -4 -4 9
1914 9 27 39 40 36 33 32 25 10 -9 -27 -34 -30 -12 14 47 77 98 108 113 118 126 133 133 124 106 81 52 27 9 -5 -19 -28 -26 -13 5 16 14 -4 -32 -53 -55 -35 0 36
1897 36 65 73 56 23 -8 -24 -23 -11 4 25 48 74 96 107 104 89 66 39 12 -11 -25 -28 -24 -19 -17 -15 -12 -9 -10 -18 -29 -35 -34 -30 -27 -23 -13 0 10 17 24 33 40 40 37 34 31 26
1877 26 18 8 -2 -12 -13 -1 15 21 7 -14 -25 -17 -1 4 -6 -28 -43 -41 -20 12 48 74 88 89 84 74 59 42 27 16 6 -2 -8 -8 -4 4 24 57 93 117 120 107
1860 107 83 52 14 -19 -38 -37 -21 -2 8 4 -11 -33 -48 -47 -30 -4 18 31 33 29 18 -2 -32 -67 -95 -110 -114 -110 -103 -95 -88 -77 -63 -48 -39 -40 -52 -69 -87 -105 -122
1844 -122 -129 -122 -102 -71 -37 -3 24 41 49 53 54 48 32 13 1 2 10 19 26 31 32 25 10 -7 -21 -28 -24 -13 -1 2 -4 -18 -30 -33 -27 -14 2 21 42 60 74 82 81 71 54
1826 54 38 32 34 35 29 15 -4 -29 -54 -72 -77 -71 -64 -65 -79 -101 -119 -123 -111 -90 -70 -55 -46 -39 -31 -20 -6 6 15 21 27 31 28 15 0 -4 5 23 35 29 8 -17 -36 -45 -46 -39 -22
1807 -22 0 22 32 24 5 -16 -33 -42 -45 -45 -44 -45 -49 -53 -51 -40 -17 17 57 88 98 86 60 35 24 25 31 34 30 23 19 19 19 9 -12 -43 -69 -76 -60 -26 12 43 65 76
1789 76 79 78 78 85 95 98 91 79 70 62 48 28 14 18 38 59 67 60 44 19 -12 -45 -68 -76 -74 -65 -53 -42 -36 -38 -44 -55 -71 -91 -109 -119 -119 -112 -105 -102 -103 -99 -83 -54 -24 -3 3
1770 3 4 4 8 19 33 45 49 47 43 39 36 34 35 37 37 38 41 46 49 47 43 44 53 70 90 104 104 87 59 35 29 44 70 89 93 82 61 38 17 4 4 17 40 62 74 73 65 56 46
1751 46 30 7 -8 -4 20 54 91 126 157 180 194 201 194 168 129 91 66 53 48 42 33 17 -3 -21 -34 -46 -61 -77 -92 -105 -117 -125 -122 -104 -76 -43 -10 15 25
1735 25 17 -4 -34 -67 -99 -126 -139 -136 -115 -86 -60 -48 -45 -44 -36 -20 2 31 63 93 115 125 121 113 109 112 115 106 82 50 17 -12 -36 -47 -48 -42 -32 -18 -1 8 3 -14 -30
1718 -30 -31 -17 2 20 37 53 65 72 74 71 62 44 24 11 8 5 -1 -12 -24 -36 -50 -62 -65 -53 -30 -4 16 28 32 33 31 22 6 -11 -19 -11 7 30 54 78 101 119 129
1701 129 126 112 85 49 11 -17 -29 -23 -8 7 15 12 -1 -18 -26 -19 -3 15 37 64 92 108 108 97 87 82 79 76 78 91 111 126 121 92 51 14 -5 -6 7 24 37
1684 37 38 30 20 15 18 30 50 72 91 105 117 124 125 117 100 78 56 40 29 16 -2 -26 -48 -63 -67 -55 -28 5 32 45 48 45 35 20 8 5 8 12 15 18 22 29 42 60
1666 60 78 90 95 96 93 86 78 71 62 48 32 19 9 -2 -21 -42 -58 -68 -69 -62 -49 -34 -26 -24 -23 -16 3 30 56 70 67 52 35 26 31 48 68 78 71 50 21 -7 -30 -44
1649 -44 -47 -39 -23 -9 -7 -15 -22 -16 -2 8 10 8 6 7 12 22 40 60 72 75 71 64 58 57 60 61 55 42 30 23 23 25 22 12 -4 -24 -44 -55 -47 -16 27 64 83 83 74 63 52 46 41
1629 41 34 23 9 -2 -10 -14 -16 -20 -30 -45 -60 -72 -80 -83 -79 -65 -46 -33 -35 -47 -64 -80 -91 -101 -109 -114 -115 -112 -107 -97 -78 -52 -27 -10 -1 0 -8 -25 -44 -57 -62 -59 -50 -40 -36 -39
1611 -39 -45 -43 -33 -19 -3 12 25 32 33 31 29 30 34 39 45 48 49 47 42 34 28 30 36 42 46 54 67 81 88 87 81 72 67 71 84 97 100 89 71 53 43 46 62 80 87 75 52 25 1 -18
1591 -18 -34 -45 -50 -49 -42 -35 -30 -25 -22 -29 -53 -83 -101 -93 -67 -40 -23 -17 -17 -19 -19 -21 -27 -35 -37 -30 -18 -14 -26 -44 -53 -44 -27 -13 -9 -6 1 12 16 4 -17 -37 -40 -23 8 39 57 61 60
1571 60 62 64 58 41 15 -13 -35 -42 -28 1 35 62 77 79 66 45 28 29 50 73 82 69 42 14 -9 -29 -50 -71 -88 -100 -109 -122 -138 -150 -153 -146 -138 -134 -132 -127 -115 -102
1554 -102 -95 -96 -103 -110 -112 -110 -111 -118 -128 -133 -129 -115 -96 -77 -62 -54 -52 -51 -47 -41 -41 -48 -56 -57 -49 -35 -21 -11 -9 -13 -16 -9 7 27 43 54 65 79 89 89 74 49 21 -4 -26 -45 -61
1535 -61 -72 -75 -66 -51 -36 -26 -21 -16 -8 2 16 31 43 46 42 38 39 45 53 62 69 71 62 42 19 0 -9 -12 -12 -17 -30 -48 -64 -72 -66 -43 -4 40 75 92 90 77 57 36 23 22 28
1516 28 32 32 32 35 35 30 22 17 16 17 18 19 18 19 24 35 48 55 59 65 74 79 72 54 33 18 15 24 40 55 62 57 44 29 14 1 -5 0 15 22 7 -25 -52 -56 -40 -17 2 20 36 45
1496 45 41 21 -2 -19 -22 -16 -11 -11 -8 4 25 48 66 75 74 66 56 51 51 53 57 67 81 90 86 72 59 52 47 41 31 19 8 2 4 11 18 19 6 -21 -56 -84 -93 -82 -59 -35 -13
1477 -13 5 26 52 83 116 142 154 150 132 107 82 67 65 73 79 76 63 46 34 34 48 68 85 93 98 102 98 82 57 38 32 32 23 3 -22 -46 -66 -79 -84 -80 -74 -66 -53 -35
1460 -35 -16 -3 3 8 13 17 17 13 5 0 -5 -9 -13 -15 -14 -10 -6 -6 -9 -14 -17 -15 -6 7 23 43 63 78 85 87 89 87 77 58 39 28 30 42 60 83 107 129 145 155 157 147 126 100 82
1440 82 82 94 109 120 129 134 128 103 70 40 17 -1 -13 -13 -4 1 0 1 12 29 44 57 71 86 106 147 216 307 414 543 711 925 1189 1515 1882 2200
1426 2200 2339 2222 1905 1520 1175 898 674 496 367 277 213 169 149 147 149 143 127 104 82 68 69 80 88 87 81 79 83 92 107 133 166 196 208 199 174
1411 174 143 116 104 113 140 175 203 213 205 189 177 173 171 161 140 111 82 59 45 35 29 30 40 58 74 84 85 76 54 16 -25 -51 -55 -48 -49 -64 -85 -100 -104 -103 -108 -123
1395 -123 -137 -136 -118 -90 -65 -46 -36 -34 -37 -38 -30 -19 -11 -9 -10 -11 -15 -22 -34 -49 -59 -58 -45 -25 -10 -1 3 10 14 13 4 -10 -27 -36 -31 -18 -11 -17 -34 -56 -78 -97 -108 -108 -101 -90 -78
1376 -78 -67 -61 -61 -62 -59 -55 -54 -56 -54 -44 -29 -11 5 24 45 71 97 111 103 80 57 46 45 45 38 20 -5 -34 -59 -79 -97 -111 -117 -113 -104 -97 -97 -101 -105 -105 -95 -73 -37 3 37
1358 37 54 48 25 2 -5 5 29 54 69 71 65 54 42 28 11 -5 -19 -28 -37 -47 -60 -75 -89 -102 -117 -128 -124 -97 -54 -11 18 32 38 41 41 36 25 8 -9 -21 -19
1341 -19 -11 -6 -11 -20 -25 -25 -22 -16 -3 11 20 18 8 -2 -6 0 10 19 18 3 -25 -59 -88 -104 -105 -93 -75 -53 -34 -28 -39 -61 -80 -86 -79 -64 -46 -28 -17 -12 -5 9 28 39 33 15
1323 15 -2 -13 -16 -12 -2 10 20 26 25 16 0 -14 -19 -5 20 46 66 76 81 87 105 139 180 210 219 209 187 155 118 85 64 50 35 19 8 5 8 13 15 13 8 5 7 6
1305 6 -8 -40 -76 -106 -125 -134 -136 -132 -131 -137 -145 -150 -146 -136 -121 -104 -93 -92 -95 -90 -72 -46 -16 15 43 65 74 72 61 48 40 35 22 -6 -46 -80 -96 -97 -92 -88 -89 -97 -110 -121 -124 -116 -99
1286 -99 -79 -67 -70 -81 -87 -80 -68 -68 -82 -96 -100 -94 -82 -69 -56 -51 -55 -65 -74 -75 -69 -59 -46 -32 -22 -23 -36 -53 -61 -54 -39 -25 -19 -17 -18 -26 -45 -70 -90 -95 -87 -78 -82 -96 -107 -106 -96
1267 -96 -85 -79 -71 -62 -54 -52 -52 -47 -34 -18 -10 -16 -33 -54 -75 -91 -94 -80 -54 -32 -23 -20 -12 1 14 19 19 15 8 0 -9 -16 -17 -10 6 26 40 42 40 44 61 86 108 115 104 80 56 40
1248 40 35 39 51 67 78 80 77 79 90 105 115 113 102 83 59 34 13 0 -9 -25 -47 -64 -63 -44 -15 11 33 55 79 101 111 109 96 78 60 46 39 37 37 35 29 26 28
1231 28 27 15 -5 -23 -31 -35 -37 -31 -10 20 45 56 56 49 39 33 38 51 65 74 83 101 122 136 135 126 119 119 126 135 140 136 123 102 81 66 61 67 78 83 77 62 42 17 -8 -31 -40
1212 -40 -33 -14 11 42 78 112 133 133 120 104 94 90 94 103 114 120 121 126 141 159 165 145 105 64 39 31 27 17 4 -6 -15 -29 -44 -52 -45 -29 -11 2 12 19 16 5 -9
1195 -9 -22 -27 -24 -14 -2 0 -10 -35 -63 -82 -88 -90 -95 -100 -95 -76 -55 -47 -57 -77 -94 -101 -98 -87 -72 -58 -49 -47 -57 -79 -114 -151 -177 -183 -172 -155 -146 -146 -149 -150 -149 -149 -144 -128 -99 -61
1176 -61 -23 3 14 10 0 -3 0 11 26 43 58 66 61 49 35 26 26 35 49 57 53 39 28 26 32 37 36 28 18 10 5 2 1 5 13 20 17 2 -15 -27 -32 -31 -22 -7 6 8 -5 -27 -50
1156 -50 -68 -81 -85 -77 -59 -39 -24 -21 -27 -38 -44 -45 -46 -53 -65 -78 -87 -87 -75 -50 -21 4 20 24 18 6 0 6 25 42 49 42 27 8 -10 -22 -26 -22 -15 -10 -11 -16 -17 -12 -6 -7 -17 -30
1137 -30 -40 -50 -62 -71 -73 -73 -80 -96 -114 -128 -138 -149 -158 -158 -149 -134 -116 -94 -67 -39 -18 -5 1 13 32 55 73 81 77 66 55 50 50 48 35 12 -10 -20 -9 16 47 71
1120 71 85 91 92 85 66 41 24 25 37 47 45 35 23 15 10 9 10 9 3 -5 -12 -12 -9 -4 -1 0 -2 -11 -29 -48 -60 -61 -56 -50 -44 -33 -18 0 16 29 30 13 -18 -53 -78 -89 -88 -81 -66
1101 -66 -43 -17 0 0 -17 -38 -48 -39 -16 11 35 47 47 40 31 23 21 22 25 27 28 33 40 40 29 11 -7 -22 -32 -39 -44 -50 -62 -78 -91 -95 -89 -72 -48 -20 1 13 16 11 -1 -19
1082 -19 -36 -46 -51 -53 -51 -46 -45 -54 -67 -68 -53 -31 -19 -22 -33 -47 -59 -71 -84 -99 -113 -117 -109 -96 -84 -76 -62 -39 -14 3 7 -3 -26 -49 -61 -57 -40 -18 2 19 25 20 11
1065 11 4 3 6 12 18 18 6 -16 -44 -70 -87 -94 -91 -82 -71 -58 -41 -21 -4 4 2 -5 -11 -9 1 18 35 47 56 59 59 58 60 66 78 95 114 126 125 112 94 71 43 19 14 29
1046 29 49 59 61 64 70 74 70 65 62 57 45 24 0 -25 -49 -69 -79 -76 -60 -37 -15 -2 -3 -11 -20 -25 -29 -37 -46 -53 -57 -59 -64 -66 -61 -46 -29 -18 -16 -20 -28 -38 -48 -53 -53 -48 -41 -36 -38 -47 -59
1026 -59 -72 -87 -104 -122 -135 -137 -129 -109 -79 -45 -19 -8 -9 -10 -4 10 32 60 87 97 79 39 0 -22 -34 -44 -56 -63 -59 -41 -18 4 17 20 16 12 8 2 -4 -4 7 21
1009 21 27 24 17 8 -5 -27 -51 -65 -68 -64 -56 -42 -19 8 30 42 53 74 104 126 127 110 87 68 56 51 54 64 73 75 63 36 -1 -43 -80 -109 -135 -156 -168 -166 -148 -118
992 -118 -84 -55 -36 -25 -19 -19 -33 -60 -91 -112 -119 -122 -128 -140 -153 -167 -178 -184 -181 -171 -159 -153 -152 -153 -151 -145 -133 -113 -86 -59 -41 -34 -32 -27 -17 -9 -11 -27 -53 -80 -102 -116 -115 -96
975 -96 -70 -53 -52 -58 -51 -28 1 25 38 37 25 8 -3 -3 0 -1 -3 -2 0 -11 -40 -73 -92 -88 -67 -42 -19 -1 12 20 18 12 5 -1 -8 -10 -1 16 35 48 59 71 81 82 67 44
956 44 19 1 -1 8 25 34 27 6 -19 -42 -59 -69 -70 -64 -55 -48 -42 -36 -26 -11 3 10 4 -16 -52 -93 -130 -158 -176 -182 -170 -136 -91 -53 -32 -20 -2 25 61 96 122 131 120
939 120 97 76 63 57 55 61 74 86 85 64 27 -12 -46 -69 -81 -87 -88 -80 -59 -26 9 36 48 50 48 50 56 62 65 65 68 78 95 113 126 133 137 141 147 155 157 152 141 127 106 80
920 80 54 38 33 30 18 0 -10 -4 12 30 39 40 36 30 18 -2 -28 -53 -67 -74 -80 -87 -89 -80 -65 -49 -34 -20 -10 -6 -11 -21 -30 -33 -28 -15 3 29 59 91 119 140 147 139 117
902 117 94 82 82 85 80 68 56 48 37 21 2 -13 -21 -28 -43 -70 -94 -99 -81 -53 -34 -28 -27 -30 -44 -67 -87 -94 -86 -71 -57 -43 -24 2 37 73 103 125 138 141 133 120
885 120 108 102 95 78 50 18 -11 -35 -51 -55 -45 -23 8 46 79 94 88 67 39 6 -31 -65 -81 -74 -52 -26 -4 7 6 -9 -34 -56 -65 -60 -45 -30 -24 -28 -35 -37 -29 -8
869 -8 18 38 45 37 25 14 6 1 1 7 12 6 -10 -30 -44 -47 -43 -33 -22 -19 -28 -45 -56 -56 -46 -36 -31 -29 -25 -18 -10 -3 3 9 8 -2 -27 -56 -78 -82 -68 -43 -21 -9 -4 4 19 35 46
849 46 50 48 41 25 3 -16 -25 -26 -24 -24 -22 -16 -8 -7 -10 -10 -2 12 30 50 65 69 61 53 50 49 43 35 33 35 32 19 4 -3 -8 -13 -16 -12 -3 2 0 -5 -7 0 13 32 50 64 78 92 100 98 87 73
827 73 60 44 25 10 5 10 15 14 8 4 9 26 51 74 83 74 51 25 6 0 -2 -7 -14 -15 -4 15 40 66 87 98 96 87 83 93 118 147 164 158 134 103 74 50 32 21 15
809 15 9 -3 -22 -45 -67 -86 -105 -128 -157 -184 -197 -188 -164 -137 -112 -85 -56 -34 -24 -27 -31 -27 -13 2 7 -1 -18 -35 -52 -68 -83 -94 -101 -103 -96 -79 -58 -44 -42 -53 -72
793 -72 -92 -109 -117 -116 -109 -103 -100 -99 -95 -80 -54 -30 -22 -30 -39 -37 -24 -11 -4 -6 -15 -28 -37 -37 -29 -20 -16 -13 -9 -5 -8 -23 -43 -59 -64 -58 -47 -37 -31 -32 -34 -35 -32 -29 -27 -23 -15 -8 -3 5 26 56 77 81 73
771 73 62 55 55 62 72 73 59 35 16 12 19 28 35 45 59 73 79 77 73 73 78 84 88 86 69 35 -2 -27 -29 -13 12 44 77 102 114 119 129 142 149 144 128 112 102 101 105 112 121 131
751 131 141 147 148 142 129 111 88 66 48 35 26 17 9 1 -7 -17 -27 -35 -39 -45 -56 -72 -87 -92 -84 -69 -53 -41 -34 -30 -26 -19 -10 -1 10 27 52 74 86 82 68 48 31 21 17 15
733 15 12 10 12 22 39 68 103 133 146 142 125 100 67 34 8 -8 -26 -47 -65 -70 -58 -38 -19 -12 -20 -35 -49 -51 -40 -25 -16 -24 -48 -76 -89 -82 -65 -55 -60 -74 -89 -99
716 -99 -104 -105 -99 -83 -58 -29 -6 5 7 5 4 1 -4 -12 -14 -13 -17 -35 -62 -77 -64 -28 10 30 28 9 -22 -64 -108 -139 -144 -121 -81 -42 -15 -1 1 0 -3 -4 0 1 -3 -12 -19 -18 -14 -12 -14
696 -14 -20 -36 -60 -83 -96 -101 -104 -110 -116 -117 -116 -116 -116 -106 -84 -51 -15 20 52 75 84 78 61 38 15 -5 -20 -28 -36 -50 -72 -94 -106 -104 -93 -77 -61 -49 -38 -26 -13 -3 0
679 0 -2 -8 -12 -13 -8 1 12 17 12 0 -9 -7 1 6 3 -2 -1 9 21 27 27 26 28 29 27 25 25 29 38 50 62 70 67 54 33 9 -11 -25 -31 -28 -15 1 14 17 14 13 18 28 38 48 56 61 64 63 58
657 58 46 30 16 14 25 43 58 60 48 27 10 9 26 47 53 38 11 -11 -17 -6 15 39 54 50 32 12 0 -3 -9 -17 -26 -30 -31 -24 -2 32 70 99 118 127 117 86 43
640 43 10 4 20 43 58 64 66 68 67 59 45 26 6 -13 -33 -50 -62 -67 -65 -57 -46 -35 -24 -14 -9 -14 -31 -55 -78 -96 -111 -121 -120 -103 -74 -47 -33 -33 -41 -51 -60 -74 -92
622 -92 -117 -144 -165 -175 -170 -153 -130 -104 -76 -53 -43 -50 -64 -72 -67 -50 -29 -17 -17 -26 -34 -35 -28 -17 -5 2 4 1 -1 -6 -16 -35 -58 -83 -107 -128 -142 -151 -160 -172 -182 -187 -194 -206 -214
604 -214 -207 -186 -164 -149 -138 -122 -104 -86 -70 -58 -51 -46 -41 -36 -41 -57 -72 -73 -62 -49 -39 -26 -5 22 48 66 80 91 102 110 112 106 89 64 38 19 9 5 2 0 -1 -6 -12
587 -12 -13 -5 6 12 10 2 -8 -17 -19 -8 9 19 11 -10 -37 -62 -85 -100 -106 -103 -96 -86 -71 -48 -18 13 38 51 52 50 51 56 64 74 85 91 91 85 78 68 57 51 55 66 75 77 73 64 48
567 48 32 23 24 27 25 23 26 34 42 45 39 22 -3 -25 -39 -46 -52 -53 -44 -30 -22 -26 -37 -52 -71 -94 -113 -120 -113 -95 -65 -25 21 62 86 92 91 90 87 72 44 15 2 8 20 26 22 14 9
548 9 11 19 28 29 18 6 3 12 25 30 24 9 -2 0 13 26 24 13 4 2 -1 -13 -31 -44 -50 -52 -50 -44 -33 -15 9 36 58 66 59 42 23 2 -17 -31 -35 -26 -11 4 15 23 32 44
528 44 54 51 33 7 -12 -18 -14 -8 -4 -7 -17 -38 -63 -85 -100 -109 -118 -121 -109 -84 -59 -46 -46 -50 -51 -49 -42 -32 -28 -37 -57 -74 -78 -70 -56 -38 -23 -18 -24 -31 -28 -20 -20 -29 -32 -19 3 24 35
509 35 35 25 4 -22 -46 -56 -47 -23 6 26 27 4 -37 -87 -131 -161 -175 -176 -168 -149 -121 -84 -44 -7 18 28 25 19 11 0 -18 -39 -54 -63 -68 -74 -74 -61 -29 10 42 50
492 50 35 6 -24 -52 -72 -84 -90 -94 -98 -103 -111 -124 -139 -146 -137 -117 -89 -58 -24 7 31 42 39 28 13 0 -12 -28 -49 -69 -83 -87 -79 -61 -37 -15 0 13 28 42 56
475 56 71 89 105 111 108 100 88 71 52 39 35 36 34 26 17 11 11 16 19 21 26 36 43 35 14 -5 -14 -22 -39 -67 -94 -118 -140 -163 -186 -198 -195 -172 -138 -104 -79 -60 -40 -15 4
457 4 13 9 -4 -24 -47 -71 -92 -110 -121 -123 -111 -84 -46 -3 32 54 57 46 26 2 -22 -49 -78 -106 -126 -131 -118 -88 -47 -8 13 14 5 0 0 -2 -10 -13 -7 2 8 14 29 52
440 52 70 73 59 34 8 -10 -20 -25 -35 -53 -74 -94 -114 -139 -162 -176 -175 -159 -136 -110 -85 -61 -36 -9 13 31 42 48 50 44 29 9 -9 -24 -42 -66 -88 -99 -99
424 -99 -94 -95 -102 -111 -122 -138 -162 -187 -203 -204 -195 -183 -168 -145 -117 -92 -76 -68 -62 -57 -61 -75 -96 -117 -136 -153 -168 -184 -204 -227 -243 -247 -235 -209 -172 -133 -100 -76 -53 -22 12
408 12 43 64 82 97 110 114 108 93 68 36 11 2 12 34 57 74 78 71 54 33 10 -11 -30 -46 -58 -64 -59 -40 -14 2 1 -18 -51 -89 -122 -141 -143 -134 -122 -109 -92
391 -92 -70 -48 -32 -26 -28 -37 -46 -54 -66 -86 -112 -131 -134 -128 -124 -121 -113 -95 -75 -64 -61 -59 -56 -57 -65 -78 -87 -86 -77 -64 -53 -42 -32 -25 -24 -28 -34 -40 -50 -63 -74 -79 -80 -78 -74 -66 -60 -57 -58 -63 -68 -73 -74
370 -74 -73 -73 -78 -85 -90 -92 -89 -76 -53 -28 -13 -13 -20 -30 -44 -63 -87 -108 -125 -140 -152 -158 -156 -144 -123 -96 -68 -42 -19 3 21 31 34 32 27 20 15 15 18 15 4 -11 -22 -21 -13 -3
351 -3 2 2 -2 -10 -21 -32 -41 -50 -63 -81 -98 -108 -108 -99 -90 -84 -81 -72 -49 -13 20 43 57 69 77 76 66 53 42 28 12 -2 -8 -5 0 3 1 -3 -12 -22 -25 -16 1 16 18 9 -3 -11 -15 -18
331 -18 -22 -23 -19 -10 0 6 8 8 17 40 72 98 108 105 100 95 89 79 70 60 49 36 25 17 11 0 -15 -34 -48 -56 -59 -59 -56 -52 -51 -56 -65 -72 -74 -75 -80 -89 -99 -103 -95 -73 -41 -8 18 40 58
311 58 70 69 52 21 -10 -35 -55 -78 -108 -138 -159 -171 -177 -179 -178 -176 -179 -190 -204 -213 -210 -195 -169 -143 -125 -117 -111 -103 -92 -81 -70 -59 -49 -38 -21 2 23 29 18 0 -15 -26
294 -26 -32 -37 -49 -74 -106 -126 -123 -105 -88 -80 -77 -67 -45 -17 6 18 15 2 -11 -24 -32 -37 -38 -36 -31 -21 -7 9 30 60 98 132 152 151 131 104 83 79 88 96 91 77 65 57
276 57 50 39 31 35 53 79 103 119 127 135 145 151 143 123 101 87 77 63 43 22 5 -5 -15 -25 -36 -46 -50 -50 -46 -39 -28 -19 -18 -30 -53 -77 -95 -103 -100 -88 -69 -46 -25
259 -25 -9 0 6 10 13 17 22 24 19 7 -1 0 9 17 18 16 16 18 24 28 25 9 -12 -31 -40 -43 -44 -41 -32 -22 -21 -29 -36 -31 -16 1 10 0 -29 -73 -114 -139 -143 -129 -108 -90 -81 -77 -76 -77 -84 -95 -109
238 -109 -123 -133 -137 -131 -111 -80 -45 -15 4 14 20 20 15 10 17 41 70 85 76 49 16 -12 -33 -45 -48 -43 -30 -14 -5 -11 -32 -61 -88 -110 -121 -116 -93 -63 -36 -16 -1 6
221 6 5 -2 -9 -14 -22 -41 -66 -86 -94 -89 -78 -65 -52 -43 -37 -31 -21 -4 16 36 51 55 48 28 1 -21 -32 -28 -18 -7 4 16 29 37 37 26 7 -13 -31 -51 -77 -103 -117 -110
203 -110 -86 -53 -19 7 17 5 -17 -42 -67 -95 -127 -155 -172 -175 -165 -139 -103 -68 -47 -44 -50 -56 -57 -50 -40 -34 -40 -52 -55 -44 -27 -20 -30 -51 -78 -105 -131 -149 -158 -158 -147
187 -147 -128 -105 -87 -81 -85 -94 -105 -116 -123 -118 -99 -74 -49 -27 -8 6 15 16 11 3 -1 -2 0 1 4 12 26 41 46 39 29 26 31 37 35 23 7 -3 -6 -1 4 6 3 -11 -38 -74 -108 -129
167 -129 -135 -130 -115 -89 -57 -26 -5 8 21 35 48 59 64 62 54 44 32 21 8 -1 -6 -4 -2 -3 -4 0 11 20 19 7 -12 -33 -47 -47 -33 -13 1 5 0 -11 -20 -23 -22 -21 -27 -44
149 -44 -69 -84 -79 -61 -48 -53 -70 -86 -95 -105 -123 -145 -156 -148 -124 -91 -60 -34 -11 5 10 -1 -27 -50 -56 -40 -13 13 35 51 59 53 30 -6 -41 -63 -70 -66 -57 -49 -47 -54 -62
132 -62 -56 -30 2 20 17 2 -9 -12 -9 -5 -5 -14 -30 -48 -60 -68 -73 -74 -63 -37 -2 26 37 34 28 30 42 57 69 74 76 77 79 81 82 83 82 76 64 51 43 45 57 68 69 58 35 7
112 7 -20 -44 -65 -77 -80 -75 -65 -53 -36 -14 9 26 35 41 47 49 42 32 27 30 30 23 16 17 27 41 50 48 32 2 -31 -55 -62 -55 -36 -12 9 22 23 17 8 -10 -42 -81 -109 -120
94 -120 -114 -102 -89 -74 -55 -34 -18 -16 -26 -44 -64 -81 -96 -104 -103 -93 -77 -60 -50 -47 -47 -39 -18 10 32 39 29 7 -23 -56 -83 -96 -94 -81 -62 -40 -23 -16 -21 -30 -33 -26 -10
77 -10 3 11 9 0 -19 -40 -53 -50 -32 -11 0 4 5 4 0 -8 -10 2 26 52 68 72 66 56 44 30 14 -1 -11 -14 -11 -7 -2 6 16 19 11 -3 -18 -28 -35 -40 -47 -58 -70 -75 -71 -63 -63
57 -63 -76 -96 -110 -113 -107 -99 -86 -61 -23 18 50 63 64 61 59 59 53 39 17 -8 -29 -38 -32 -15 7 29 47 53 46 28 5 -20 -45 -67 -83 -86 -74 -49 -18 9 28 35 32 21
39 21 10 7 10 14 12 4 -6 -20 -37 -54 -64 -64 -59 -54 -54 -52 -44 -28 -7 11 24 33 42 53 55 41 14 -16 -39 -57 -76 -94 -105 -99 -78 -53 -33 -28 -38 -57 -73 -80 -82 -84 -80 -59
21 -59 -25 3 11 3 -6 -13 -21 -31 -41 -47 -52 -58 -62 -63 -66 -72 -79 -84 -88 -89 -80 -55 -22 5 18 18 14 15 24 32 23 -6 -48 -89 -119 -135 -135 -119 -97 -82 -83 -93 -99 -96 -87 -81 -83 -90 -92 -86 -72 -56 -40
0 -40 -24 -12 -12 -28 -51 -70 -75 -70 -63 -58 -51 -32 1 36 55 53 42 30 15 -6 -27 -42 -50 -56 -60 -55 -43 -32 -27 -22 -12 1 11 14 9 -3 -20 -39 -60 -83 -106 -122 -124 -118 -114 -117
-19 -117 -124 -130 -131 -128 -126 -135 -160 -193 -216 -214 -186 -149 -121 -109 -112 -120 -126 -124 -115 -101 -88 -80 -77 -75 -68 -58 -57 -73 -108 -151 -186 -205 -207 -201 -194 -191 -194 -201 -208 -214 -217 -212 -199 -177 -150 -122 -94 -72 -62
-39 -62 -66 -78 -91 -105 -120 -135 -147 -155 -161 -163 -155 -137 -115 -99 -92 -88 -86 -85 -88 -88 -80 -68 -63 -76 -103 -131 -151 -160 -156 -142 -127 -115 -110 -109 -113 -128 -154 -177 -187 -181 -167 -148 -124 -98 -75
-57 -75 -60 -57 -68 -94 -128 -154 -160 -146 -116 -83 -60 -56 -73 -102 -133 -161 -178 -180 -166 -147 -136 -134 -135 -133 -127 -118 -105 -88 -69 -52 -39 -31 -24 -11 11 38 57 66 71 81 92 96 88
-74 88 74 63 59 58 57 56 60 73 90 107 119 121 108 82 57 44 43 42 34 22 15 11 6 -2 -13 -25 -39 -52 -57 -54 -48 -44 -41 -36 -33 -36 -42 -45 -44 -45 -46 -42 -23 4 27 32 17 -4 -21 -30
-94 -30 -37 -48 -59 -59 -44 -26 -21 -30 -39 -36 -27 -25 -34 -48 -63 -82 -100 -108 -101 -87 -79 -78 -78 -73 -66 -59 -46 -23 6 35 60 81 95 94 76 49 25 6 -9 -28 -50 -71 -88 -99 -104
-112 -104 -103 -98 -89 -74 -48 -9 35 77 106 119 118 107 89 66 44 26 15 6 -7 -26 -43 -45 -29 -5 13 19 14 5 -2 -8 -15 -28 -50 -79 -111 -144 -174 -195 -207 -211 -211 -208
-129 -208 -201 -188 -166 -135 -107 -91 -86 -78 -63 -49 -47 -52 -52 -43 -35 -30 -25 -11 12 37 55 61 56 49 48 51 47 31 8 -11 -31 -57 -88 -112 -119 -119 -124 -141 -167 -189 -203 -210 -215 -221 -223 -211
-147 -211 -182 -142 -105 -77 -62 -58 -60 -61 -55 -39 -14 14 42 65 84 99 110 113 108 102 100 105 113 124 135 138 122 83 35 -8 -40 -62 -79 -86 -84 -76 -69 -66 -57 -40 -20 -11 -22 -42
-165 -42 -59 -65 -63 -58 -50 -43 -44 -54 -65 -74 -80 -86 -89 -83 -69 -53 -43 -38 -37 -35 -29 -17 -4 1 2 2 4 3 -6 -23 -38 -45 -44 -36 -23 -8 2 6 3 0 -2 -3 -3 0 7 16 19 11 -12 -46 -82 -108 -121
-186 -121 -120 -114 -106 -99 -93 -90 -91 -94 -98 -98 -97 -93 -84 -68 -45 -19 5 29 51 64 61 42 15 -16 -55 -97 -131 -143 -134 -115 -98 -87 -80 -80 -88 -103 -119 -132 -140 -140 -129 -107 -79 -52 -30
-204 -30 -14 -2 1 -6 -23 -45 -64 -78 -88 -99 -112 -127 -142 -153 -150 -134 -110 -83 -54 -23 0 5 -2 -14 -26 -43 -70 -98 -115 -118 -110 -96 -86 -87 -101 -122 -140 -149 -151 -148 -139
-221 -139 -128 -122 -126 -142 -163 -178 -181 -176 -165 -150 -129 -104 -78 -54 -32 -17 -15 -28 -45 -60 -71 -79 -86 -94 -105 -119 -130 -131 -122 -106 -83 -56 -33 -21 -13 -1 20 45 68 82
-237 82 79 55 23 -1 -11 -17 -31 -54 -74 -85 -84 -71 -53 -39 -40 -53 -70 -83 -88 -84 -73 -60 -54 -57 -66 -76 -84 -88 -87 -86 -87 -92 -99 -108 -115 -111 -92 -63 -34 -9 18 50 78 91 89
-255 89 84 84 90 97 98 94 89 89 94 100 100 95 85 70 53 38 30 28 30 34 37 37 30 16 -3 -26 -51 -76 -96 -110 -117 -117 -111 -101 -93 -88 -82 -73 -68 -69 -76 -82 -86 -91 -99 -110 -125 -144 -157 -153 -130 -97
-276 -97 -66 -40 -16 5 25 38 44 41 35 31 37 53 72 82 75 52 24 2 -6 -9 -13 -19 -26 -34 -50 -78 -114 -143 -153 -141 -115 -89 -70 -58 -51 -53 -68 -90 -102 -99 -87 -76 -68
-293 -68 -60 -52 -45 -36 -24 -11 -5 -9 -18 -24 -25 -28 -41 -64 -86 -95 -87 -70 -54 -47 -47 -52 -56 -57 -51 -42 -38 -41 -49 -56 -57 -48 -31 -12 -2 -5 -18 -35 -56 -80 -102 -119 -129 -131 -125 -115 -106 -106 -110 -110 -99
-314 -99 -75 -43 -13 7 18 25 33 39 41 42 47 53 54 44 27 8 -5 -13 -14 -15 -20 -29 -29 -12 18 47 61 56 44 36 40 47 49 42 35 35 40 46 49 50 54 62 73 85 92 91 83 68 51 38 34
-334 34 35 35 28 15 -1 -19 -34 -35 -19 6 30 42 45 45 48 56 70 81 85 79 64 47 34 31 42 63 81 82 65 34 -2 -36 -54 -50 -30 -7 4 6 1 -6 -14 -21 -27 -32 -31 -20
-353 -20 -3 13 28 43 57 60 46 17 -10 -28 -39 -48 -53 -45 -21 9 38 53 48 26 -4 -33 -55 -72 -88 -102 -114 -123 -128 -124 -112 -98 -86 -77 -61 -34 -2 25 44 47
-369 47 32 1 -29 -47 -52 -57 -68 -80 -84 -75 -62 -53 -53 -53 -46 -30 -11 1 4 -1 -16 -39 -58 -62 -55 -51 -64 -89 -111 -126 -134 -137 -134 -124 -117 -119 -127 -130 -117 -86 -49 -20 -12 -27 -55 -83
-387 -83 -100 -103 -95 -79 -59 -36 -14 -1 -6 -28 -60 -90 -115 -132 -147 -161 -170 -168 -151 -126 -103 -85 -69 -55 -50 -55 -60 -57 -45 -31 -20 -8 0 1 -6 -17 -22 -16 -2 8 5 -9 -24
-404 -24 -25 -12 9 37 71 103 124 129 124 109 79 36 -9 -41 -53 -45 -26 -10 -5 -9 -12 -8 0 0 -7 -13 -12 -4 5 15 23 24 18 7 -3 -12 -20 -31 -48 -74 -101 -123 -136 -140 -136 -128 -117
-423 -117 -105 -92 -79 -70 -72 -80 -84 -78 -67 -59 -56 -55 -53 -44 -26 -3 15 21 15 2 -14 -27 -30 -25 -21 -27 -34 -30 -13 4 11 9 1 -10 -23 -35 -41 -46 -56 -72 -90 -109 -130 -152 -170 -180
-442 -180 -182 -172 -148 -114 -86 -72 -70 -70 -71 -80 -98 -113 -112 -93 -65 -38 -15 5 25 42 53 55 48 37 32 39 54 66 64 50 33 16 1 -14 -28 -39 -47 -56 -63 -60 -44 -24
-459 -24 -13 -21 -42 -64 -81 -92 -94 -80 -47 -1 39 64 69 57 33 3 -22 -35 -38 -39 -49 -68 -90 -105 -111 -112 -117 -127 -135 -136 -132 -130 -136 -144 -150 -154 -158 -164 -167 -166 -157 -137 -102 -58 -19 4
-477 4 12 12 15 30 57 83 90 72 36 -5 -44 -78 -101 -107 -95 -76 -62 -60 -70 -85 -97 -97 -88 -78 -76 -85 -102 -117 -119 -106 -86 -72 -72 -81 -86 -74 -43 -6 19 22 6 -12 -22
-494 -22 -20 -10 3 12 11 0 -16 -32 -47 -63 -74 -80 -83 -94 -110 -123 -127 -129 -138 -154 -172 -186 -194 -198 -197 -193 -186 -172 -149 -117 -82 -53 -37 -36 -41 -41 -34 -25 -22 -20 -11 5 24 38 50 63
-513 63 74 77 72 66 66 68 69 65 59 55 54 58 70 84 88 76 55 37 32 36 44 53 59 62 60 59 62 70 82 95 104 103 93 86 90 101 103 85 49 6 -29 -48 -51 -47 -42 -41 -42 -46 -52 -58 -56 -44 -26
-534 -26 -7 8 20 28 29 20 -1 -27 -46 -54 -57 -65 -82 -101 -112 -107 -85 -53 -22 -8 -16 -39 -72 -108 -142 -163 -163 -143 -108 -65 -25 -3 -9 -37 -66 -80 -80 -74 -67 -60 -56 -58 -65 -73
-552 -73 -81 -93 -103 -102 -83 -56 -41 -46 -60 -66 -57 -39 -23 -14 -10 -10 -16 -23 -27 -30 -34 -47 -69 -93 -112 -119 -115 -107 -102 -97 -87 -71 -53 -42 -43 -59 -88 -125 -164 -198 -220 -227 -218 -198 -173 -152
-570 -152 -134 -117 -97 -74 -53 -38 -33 -34 -30 -11 19 46 53 35 2 -30 -57 -77 -91 -97 -92 -82 -76 -79 -88 -96 -96 -85 -65 -42 -25 -21 -27 -37 -46 -55 -61 -63 -58 -47 -36 -29 -25 -24 -21 -15
-589 -15 -7 0 1 1 7 21 39 48 41 21 -2 -24 -39 -48 -52 -53 -52 -46 -34 -22 -20 -29 -47 -67 -91 -116 -140 -156 -164 -165 -158 -140 -118 -100 -92 -95 -102 -109 -115 -120 -121 -117 -105 -89 -79 -82 -95 -106
-608 -106 -107 -95 -76 -57 -45 -51 -72 -97 -113 -114 -102 -81 -56 -30 -6 11 20 18 9 0 -9 -21 -36 -52 -61 -61 -53 -38 -21 -8 -5 -16 -37 -59 -76 -81 -78 -74 -71 -64 -50 -30 -13
-625 -13 -6 -6 -5 -1 5 10 6 -6 -23 -37 -41 -37 -28 -16 0 19 37 43 34 16 7 16 32 39 29 7 -18 -43 -65 -81 -93 -101 -107 -111 -110 -104 -95 -85 -80 -85 -101 -123 -143 -154 -158 -156 -146 -125
-644 -125 -96 -65 -41 -35 -45 -64 -79 -80 -72 -64 -61 -60 -60 -65 -79 -92 -87 -60 -29 -15 -23 -39 -48 -49 -45 -41 -40 -47 -65 -91 -117 -134 -139 -134 -125 -119 -115 -109 -102 -95 -92 -91 -87 -79 -69 -61 -58 -60 -64 -65 -63 -60
-665 -60 -56 -49 -36 -16 10 37 56 60 49 25 -8 -49 -86 -110 -118 -122 -128 -134 -135 -132 -131 -137 -147 -160 -170 -171 -155 -124 -88 -56 -34 -19 -11 -8 -12 -26 -44 -57 -59 -55 -52 -51 -43 -22 6
-683 6 32 51 66 81 95 107 112 106 88 63 39 23 18 22 32 45 59 71 77 73 60 40 13 -22 -57 -86 -108 -126 -138 -136 -120 -99 -86 -86 -94 -104 -105 -95 -80 -71 -71 -72
-700 -72 -65 -57 -58 -70 -80 -80 -77 -83 -101 -117 -122 -121 -123 -131 -140 -140 -131 -115 -98 -82 -70 -61 -52 -46 -43 -47 -54 -57 -52 -43 -39 -48 -72 -103 -130 -146 -150 -142 -121 -88 -53 -27 -14 -8 -6 -4 -2 1 4 5 1 -6 -17
-722 -17 -30 -45 -61 -75 -90 -99 -98 -85 -72 -66 -62 -51 -34 -24 -24 -26 -24 -18 -17 -15 -5 17 47 70 78 71 56 41 28 17 11 13 24 39 50 50 42 29 14 5 2 7 14 22 27 27 19
-740 19 3 -22 -56 -92 -118 -119 -95 -61 -34 -24 -27 -37 -48 -60 -74 -87 -100 -113 -122 -124 -115 -103 -93 -91 -90 -87 -80 -75 -75 -79 -79 -65 -32 13 58 92 117 136 151 161 167 174 178
-758 178 173 157 132 107 87 73 63 65 82 107 126 127 111 88 65 41 15 -13 -41 -64 -81 -87 -82 -74 -72 -83 -103 -119 -124 -119 -112 -112 -117 -120 -118 -111 -105 -102 -96 -84 -69 -60 -64 -81 -103
-776 -103 -119 -128 -132 -133 -133 -136 -147 -165 -175 -165 -133 -94 -60 -35 -20 -18 -33 -61 -91 -108 -105 -90 -78 -81 -97 -109 -108 -98 -91 -99 -123 -155 -182 -197 -200 -198 -195 -188 -178 -168 -162 -159 -159 -161
-793 -161 -156 -139 -107 -77 -64 -71 -87 -98 -100 -95 -86 -73 -58 -45 -38 -38 -40 -35 -21 -6 0 -8 -16 -15 -5 4 8 11 22 41 60 71 73 72 72 77 84 87 83 73 62 53 44 36 28 22 16 10 4 3 10
-814 10 27 47 67 82 93 103 114 122 125 126 126 123 113 94 76 63 52 31 -3 -39 -62 -68 -66 -66 -77 -95 -110 -113 -104 -94 -89 -91 -95 -102 -110 -114 -108 -92 -69 -40 -11 12 19 13 6
-832 6 9 20 32 43 51 57 62 66 70 67 53 30 11 4 2 -3 -15 -29 -40 -48 -54 -59 -58 -51 -40 -30 -20 -5 10 23 25 22 20 21 20 11 -1 -11 -17 -20 -26 -37 -47 -44 -20 13 43 59
-851 59 63 63 62 59 57 61 70 82 89 89 85 81 80 81 81 80 79 76 67 55 42 31 18 1 -11 -13 -8 -1 10 36 73 105 123 130 133 130 113 83 52 29 19 14 9 5 7 17 23 16 -5 -31
-871 -31 -51 -65 -81 -99 -116 -125 -124 -110 -88 -72 -75 -96 -120 -133 -135 -133 -129 -117 -97 -80 -76 -78 -73 -56 -37 -22 -10 2 14 14 2 -13 -24 -24 -14 3 22 34 40 47 61 79
-888 79 93 98 96 86 68 41 7 -32 -78 -121 -153 -169 -173 -178 -191 -206 -213 -205 -185 -160 -139 -120 -103 -85 -68 -52 -37 -23 -11 2 15 21 18 9 6 13 28 48 72 101 129
-905 129 151 169 191 215 230 222 189 141 91 45 6 -24 -40 -43 -34 -24 -17 -15 -14 -8 3 17 29 35 38 36 29 15 -2 -24 -43 -54 -46 -19 18 53 73 71 53 31 20
-921 20 22 29 29 20 4 -12 -29 -43 -47 -40 -27 -14 -4 1 3 6 11 14 13 2 -17 -45 -74 -92 -90 -67 -35 -9 2 0 -11 -21 -23 -21 -22 -29 -40 -50 -57 -58 -59 -67 -84 -104 -112 -103 -88
-940 -88 -81 -84 -96 -110 -121 -121 -110 -93 -79 -73 -83 -112 -154 -191 -206 -199 -183 -161 -130 -93 -66 -58 -67 -78 -79 -73 -71 -85 -116 -147 -159 -150 -126 -99 -72 -54 -51 -59 -62 -50 -25 0
-957 0 25 53 83 107 123 133 140 137 124 101 74 46 18 -1 -12 -14 -13 -9 -5 -5 -11 -21 -29 -36 -46 -59 -66 -65 -54 -35 -12 8 14 0 -26 -48 -56 -51 -47 -55 -74 -94 -101 -92 -74
-975 -74 -54 -34 -9 21 54 87 113 124 112 83 49 19 0 -4 11 39 62 63 41 2 -45 -92 -129 -144 -135 -113 -90 -75 -69 -69 -72 -78 -90 -105 -113 -109 -96 -82 -75 -76 -82
-991 -82 -92 -96 -86 -65 -39 -15 4 22 37 44 47 47 46 43 41 40 45 53 60 53 26 -17 -60 -90 -103 -104 -97 -84 -73 -69 -73 -80 -85 -85 -76 -59 -37 -17 0 15 31 42 41 28 8 -12
-1010 -12 -25 -31 -34 -37 -40 -43 -50 -65 -79 -85 -78 -65 -48 -27 0 26 44 49 42 26 6 -16 -35 -44 -36 -18 -1 6 10 16 21 19 9 -1 -6 -4 -3 -3 -5 -14 -31 -57 -83 -105 -121 -134
-1028 -134 -144 -149 -144 -129 -113 -105 -106 -110 -109 -104 -100 -97 -94 -91 -88 -86 -84 -84 -84 -77 -59 -37 -19 -14 -19 -24 -25 -25 -31 -44 -58 -67 -70 -68 -64 -53 -35 -13 6 25 41 48 43 30 13 0 -5 2 24 48
-1048 48 59 54 41 27 13 -5 -26 -47 -61 -68 -70 -70 -73 -74 -70 -58 -43 -31 -25 -25 -28 -29 -23 -15 -12 -13 -10 5 26 41 43 35 16 -9 -38 -60 -69 -68 -64 -58 -51 -46 -43 -44 -48 -54 -61 -66 -70 -77 -92
-1069 -92 -113 -127 -122 -95 -59 -26 3 32 56 58 33 -8 -46 -68 -79 -85 -93 -98 -96 -83 -60 -30 1 28 42 40 25 7 -9 -22 -33 -41 -45 -45 -41 -31 -15 6 26 39
-1085 39 44 41 31 16 -3 -27 -52 -71 -87 -98 -105 -103 -92 -80 -73 -74 -81 -90 -100 -105 -96 -76 -54 -43 -47 -59 -69 -72 -64 -51 -38 -29 -26 -30 -44 -64 -83 -93 -94 -94 -99 -113 -132 -146
-1103 -146 -152 -153 -152 -151 -148 -146 -147 -151 -151 -147 -143 -141 -135 -119 -96 -79 -73 -71 -63 -44 -20 2 15 18 14 8 3 -3 -14 -25 -32 -30 -21 -9 2 12 22 28 29 26 19 7 -7 -20 -22 -12 0 6 1 -6
-1123 -6 -10 -2 21 61 108 147 164 155 125 84 42 3 -32 -62 -83 -93 -93 -87 -77 -60 -33 1 32 50 54 45 29 11 0 -1 7 17 15 -5 -40 -79 -110 -127 -129 -118 -93
-1139 -93 -61 -32 -17 -18 -28 -39 -51 -66 -84 -98 -101 -98 -96 -100 -116 -141 -171 -198 -211 -205 -184 -159 -139 -126 -117 -110 -108 -114 -125 -134 -142 -153 -165 -166 -145 -109 -80 -68 -67 -62 -53 -48 -54 -69
-1157 -69 -86 -98 -102 -98 -92 -87 -81 -67 -49 -36 -33 -40 -54 -73 -96 -120 -141 -155 -164 -170 -173 -177 -184 -194 -204 -209 -206 -196 -180 -155 -123 -87 -56 -37 -32 -37 -42 -43 -35 -19 1 14 10 -15 -52
-1175 -52 -88 -119 -142 -156 -155 -139 -115 -96 -87 -80 -72 -59 -44 -28 -13 -2 1 2 5 6 2 -4 -7 -4 -8 -35 -87 -145 -191 -215 -220 -211 -193 -169 -145 -127 -115 -104 -89 -71 -64 -73 -93
-1192 -93 -111 -117 -118 -118 -115 -106 -95 -92 -102 -117 -126 -127 -121 -112 -101 -89 -78 -71 -70 -75 -85 -92 -87 -67 -44 -30 -32 -40 -44 -40 -34 -29 -24 -17 -2 17 36 47 44 28 6 -18 -44 -70 -93 -109 -118
-1211 -118 -123 -126 -127 -122 -108 -87 -67 -57 -59 -73 -92 -116 -146 -181 -215 -233 -231 -215 -199 -188 -176 -149 -106 -61 -30 -20 -25 -34 -45 -58 -69 -78 -84 -90 -92 -85 -68 -47 -31 -23 -22 -27
-1228 -27 -33 -34 -26 -9 9 25 34 33 21 0 -27 -57 -86 -109 -121 -128 -138 -151 -161 -160 -148 -135 -130 -136 -149 -164 -179 -189 -187 -169 -137 -101 -73 -58 -51 -48 -47 -48 -49 -53 -63 -83 -105
-1245 -105 -117 -108 -79 -40 -4 18 23 12 -12 -43 -72 -89 -91 -83 -71 -60 -49 -37 -24 -9 1 6 8 11 14 14 5 -9 -26 -44 -64 -83 -94 -99 -100 -105 -114 -130 -153 -183 -214
-1262 -214 -232 -232 -218 -203 -195 -186 -166 -136 -114 -116 -136 -155 -156 -135 -102 -62 -28 -9 -9 -16 -16 -6 0 -9 -34 -63 -89 -110 -125 -131 -125 -115 -112 -121 -136 -143 -142 -141 -152 -172 -189 -199 -205
-1279 -205 -209 -209 -199 -179 -153 -126 -101 -74 -48 -29 -23 -26 -33 -40 -46 -52 -54 -52 -47 -42 -38 -32 -23 -13 -7 -11 -28 -53 -79 -97 -104 -103 -98 -92 -86 -80 -72 -61 -48 -30 -8 14 33 42 42 38 33 27 19
-1299 19 10 2 -3 -9 -17 -27 -36 -41 -42 -34 -16 7 30 47 59 73 87 97 97 88 75 56 32 3 -29 -62 -90 -108 -115 -114 -108 -102 -94 -83 -65 -38 -12 0 -7 -26 -42 -48 -49 -54 -65
-1317 -65 -84 -109 -135 -153 -162 -165 -166 -167 -165 -161 -156 -148 -139 -130 -120 -104 -84 -64 -46 -30 -13 1 15 28 42 50 49 43 42 48 52 47 33 20 12 9 7 3 -2 -8 -16 -28 -42 -45 -31 -5 17
-1336 17 29 30 25 15 1 -10 -17 -17 -14 -11 -9 -8 -5 -5 -12 -22 -29 -31 -32 -41 -55 -69 -79 -90 -108 -132 -157 -174 -180 -171 -145 -104 -61 -30 -21 -32 -53 -69 -71 -59 -41 -30 -38 -63 -96
-1354 -96 -126 -150 -168 -179 -183 -183 -184 -187 -185 -173 -150 -121 -92 -68 -51 -39 -33 -35 -45 -52 -49 -40 -31 -22 -6 15 34 44 47 46 39 24 5 -12 -20 -17 -2 19 38 46 42 29 13 -1
-1371 -1 -13 -24 -37 -48 -53 -49 -43 -39 -36 -29 -17 -3 5 10 13 17 19 19 14 4 -8 -23 -37 -44 -40 -30 -21 -17 -14 -8 0 8 17 28 35 33 26 19 16 9 -1 -13 -22 -27 -29 -26 -16 -1 12 22 27 29
-1392 29 35 50 69 85 91 88 78 59 33 7 -8 -17 -21 -26 -29 -34 -39 -42 -40 -40 -46 -54 -52 -38 -18 -5 -6 -18 -33 -46 -52 -51 -49 -50 -59 -81 -112 -148 -180 -199 -198 -178 -149 -128 -124 -135
-1411 -135 -147 -154 -158 -158 -153 -143 -128 -108 -88 -72 -65 -63 -57 -46 -39 -41 -46 -43 -30 -14 -5 -13 -35 -55 -60 -53 -54 -73 -102 -123 -134 -143 -155 -162 -156 -141 -130 -131 -141 -153 -157 -152 -141 -131 -127 -131
-1429 -131 -132 -122 -93 -52 -16 1 -2 -20 -44 -69 -88 -97 -98 -92 -81 -63 -43 -30 -27 -27 -18 -4 3 0 -14 -30 -39 -42 -43 -43 -46 -46 -44 -40 -33 -25 -16 -12 -16 -27 -40 -51 -60 -64 -61 -52 -42 -34
-1448 -34 -31 -32 -34 -37 -36 -31 -19 1 25 42 45 33 12 -9 -34 -59 -85 -112 -138 -160 -171 -168 -158 -149 -143 -139 -131 -118 -98 -77 -63 -60 -65 -75 -89 -111 -144 -182 -218 -247 -265 -269
-1465 -269 -258 -237 -217 -206 -200 -198 -197 -199 -200 -192 -168 -133 -95 -61 -37 -27 -36 -62 -94 -121 -139 -147 -145 -134 -115 -92 -68 -49 -40 -41 -48 -55 -64 -78 -98 -120 -146 -175 -202 -218 -218 -202
-1482 -202 -178 -151 -128 -114 -111 -117 -124 -129 -128 -124 -123 -126 -133 -132 -118 -94 -70 -48 -26 -3 17 29 29 23 17 14 13 9 3 0 0 4 15 35 60 81 89 84 70 55 43 37 31 20 0 -23
-1501 -23 -41 -53 -67 -90 -113 -126 -128 -128 -131 -136 -130 -108 -73 -39 -21 -25 -46 -73 -94 -105 -111 -119 -130 -137 -137 -133 -131 -134 -140 -149 -162 -177 -186 -186 -181 -181 -186 -186 -174 -155 -136 -122 -110 -96 -82
-1519 -82 -75 -76 -80 -79 -68 -52 -40 -34 -33 -36 -40 -44 -43 -44 -56 -79 -102 -117 -130 -150 -172 -185 -186 -181 -171 -153 -129 -104 -83 -64 -45 -32 -33 -45 -56 -61 -58 -49 -31 -7 15 34 49
-1536 49 58 57 39 9 -21 -39 -39 -24 -3 8 4 -14 -42 -72 -94 -102 -96 -87 -83 -80 -69 -51 -39 -48 -74 -100 -114 -117 -113 -110 -109 -108 -102 -89 -75 -67 -64 -56 -41 -29 -33 -56 -86 -108 -114
-1554 -114 -106 -94 -89 -92 -97 -96 -90 -85 -90 -105 -127 -145 -150 -141 -124 -107 -95 -84 -71 -57 -47 -44 -54 -73 -92 -102 -102 -97 -90 -82 -75 -80 -100 -132 -161 -173 -164 -139 -110 -87 -74 -66 -55 -42
-1572 -42 -32 -29 -30 -30 -26 -23 -29 -43 -52 -45 -17 21 59 87 103 109 100 75 42 11 -6 -13 -19 -35 -61 -92 -117 -135 -142 -139 -124 -99 -67 -36 -11 2 0 -13 -32 -44 -48 -48 -51 -59
-1589 -59 -67 -70 -67 -56 -42 -28 -20 -18 -18 -17 -13 -11 -16 -24 -32 -40 -48 -57 -69 -88 -113 -136 -148 -150 -144 -132 -111 -82 -55 -46 -62 -97 -137 -169 -186 -188 -181 -167 -148 -127 -108 -91 -73 -55 -40
-1607 -40 -38 -51 -72 -94 -112 -121 -118 -105 -88 -75 -67 -61 -51 -36 -23 -24 -38 -52 -51 -34 -12 1 3 -3 -16 -29 -37 -39 -42 -49 -59 -70 -77 -79 -78 -80 -92 -113 -135 -154 -171 -189 -206
-1625 -206 -213 -206 -192 -179 -173 -172 -167 -154 -139 -128 -124 -121 -117 -118 -129 -141 -146 -144 -148 -162 -179 -182 -166 -138 -111 -95 -90 -91 -95 -101 -114 -135 -157 -173 -178 -172 -155 -127 -91 -52 -25 -20 -35 -58
-1642 -58 -77 -93 -114 -139 -158 -162 -151 -130 -103 -76 -61 -65 -82 -100 -110 -112 -107 -94 -71 -40 -11 9 20 25 24 15 -1 -13 -9 6 23 32 31 25 17 9 6 8 11 6 -5 -19 -31
-1660 -31 -37 -36 -30 -24 -27 -47 -84 -130 -174 -201 -204 -186 -160 -135 -112 -86 -57 -35 -31 -47 -76 -107 -136 -161 -183 -202 -216 -224 -222 -212 -201 -194 -189 -177 -155 -129 -109 -99 -100 -114 -138
-1676 -138 -163 -178 -183 -183 -184 -188 -194 -203 -210 -209 -199 -181 -158 -131 -105 -88 -79 -73 -67 -60 -53 -44 -30 -19 -16 -28 -51 -80 -104 -117 -125 -137 -157 -180 -200 -216 -229 -238 -234 -217 -198 -189 -194 -208
-1694 -208 -222 -232 -239 -246 -250 -248 -240 -227 -213 -200 -188 -176 -159 -137 -116 -105 -106 -114 -122 -128 -131 -129 -119 -104 -87 -69 -50 -30 -13 -1 4 7 13 22 31 27 4 -29 -60 -77 -84 -87 -87 -82 -75
-1712 -75 -71 -70 -70 -68 -65 -64 -63 -58 -51 -46 -51 -63 -79 -91 -96 -94 -84 -68 -52 -39 -29 -25 -26 -33 -44 -53 -53 -48 -43 -45 -58 -79 -98 -108 -109 -114 -129 -150 -165 -167 -160 -158 -166 -182 -196 -202 -196 -186 -176
-1731 -176 -173 -176 -180 -176 -156 -124 -88 -57 -33 -17 -14 -28 -57 -91 -124 -153 -177 -194 -203 -209 -213 -213 -208 -202 -202 -205 -204 -195 -181 -162 -140 -118 -103 -98 -99 -101 -106 -116 -131 -145 -157 -167 -176 -182 -184
-1750 -184 -184 -181 -172 -158 -137 -112 -89 -74 -66 -61 -52 -42 -38 -42 -53 -66 -74 -71 -56 -34 -16 -5 0 5 9 8 2 -1 -2 1 7 10 4 -10 -30 -44 -50 -52 -57 -69 -84 -97 -104 -106 -110 -118 -126 -131 -130 -122
-1770 -122 -107 -87 -71 -65 -71 -81 -87 -86 -77 -59 -34 -10 0 -7 -34 -70 -107 -133 -138 -120 -91 -61 -41 -29 -20 -13 -5 -1 -3 -14 -34 -57 -72 -78 -80 -87 -102 -122 -144 -166 -185 -194
-1786 -194 -189 -170 -143 -116 -92 -75 -64 -63 -72 -87 -103 -114 -118 -116 -103 -80 -57 -46 -56 -82 -113 -135 -139 -126 -111 -108 -118 -134 -153 -175 -199 -219 -228 -228 -224 -215 -201 -183 -166 -151
-1803 -151 -137 -127 -126 -134 -143 -144 -136 -122 -110 -103 -101 -102 -106 -112 -115 -110 -100 -96 -101 -111 -117 -118 -119 -120 -114 -97 -70 -42 -21 -11 -12 -17 -22 -26 -29 -34 -40 -46 -52 -55 -51 -42 -35 -35 -35 -26 -7 16 32 37 31 18 5
-1824 5 -5 -13 -20 -21 -13 0 6 0 -21 -52 -86 -111 -120 -112 -95 -75 -55 -37 -22 -11 -4 0 0 -5 -9 -6 7 27 46 59 64 58 39 10 -23 -51 -68 -74 -72 -65 -51 -29 0 34 68
-1842 68 99 118 119 97 62 27 1 -14 -25 -33 -42 -53 -60 -58 -46 -31 -19 -11 -6 -6 -12 -23 -32 -38 -42 -46 -42 -27 -7 6 5 -11 -35 -58 -75 -81 -75 -60 -40 -19 4 27 43
-1859 43 46 39 29 23 17 6 -8 -18 -17 -10 -2 5 12 21 29 32 27 12 -14 -51 -92 -125 -141 -134 -110 -78 -49 -26 -9 0 -3 -19 -43 -64 -76 -76 -73 -72 -73 -75 -76 -75 -75 -70 -55 -31 -6
-1878 -6 12 20 21 17 12 5 -2 -8 -8 -3 5 20 38 55 61 53 34 11 -12 -36 -57 -70 -73 -69 -63 -60 -61 -64 -62 -56 -50 -49 -53 -56 -60 -68 -84 -104 -121 -126 -118 -102 -83 -70 -66 -74 -87 -95 -88 -66 -38
-1899 -38 -14 -4 -8 -27 -53 -75 -86 -89 -90 -96 -102 -103 -96 -85 -75 -69 -63 -52 -36 -22 -18 -28 -46 -66 -83 -96 -105 -112 -115 -113 -108 -103 -102 -103 -102 -96 -86 -78 -75 -78 -84 -90 -93 -93 -90 -82 -73 -70 -76 -90 -106
-1919 -106 -119 -124 -121 -112 -106 -108 -115 -115 -105 -92 -87 -93 -102 -104 -96 -77 -55 -42 -48 -69 -93 -110 -119 -121 -121 -121 -124 -135 -152 -162 -156 -134 -105 -81 -70 -75 -91 -110 -123 -126 -119 -106 -91 -80 -75 -78
-1937 -78 -82 -81 -77 -77 -89 -112 -135 -147 -142 -121 -95 -71 -55 -46 -41 -39 -39 -39 -38 -39 -44 -54 -66 -79 -95 -113 -128 -136 -136 -131 -118 -98 -75 -57 -48 -44 -43 -46 -50 -47 -35 -23 -22 -34 -51 -67
-1956 -67 -84 -102 -116 -120 -117 -115 -116 -117 -119 -124 -134 -141 -139 -130 -118 -109 -106 -107 -112 -121 -134 -148 -164 -175 -176 -165 -148 -137 -139 -150 -159 -155 -137 -118 -105 -100 -94 -81 -61 -41 -27 -22 -19 -14 -7 -2 -3 -8 -12
-1976 -12 -15 -19 -25 -29 -30 -30 -30 -30 -30 -31 -37 -46 -56 -61 -58 -48 -38 -34 -36 -36 -30 -20 -16 -23 -36 -51 -65 -80 -91 -96 -98 -101 -108 -112 -111 -107 -111 -120 -129 -133 -136 -139 -142 -143 -141 -140 -140 -139 -135 -122 -101 -75 -53 -43 -43
-1998 -43 -49 -57 -65 -70 -72 -69 -60 -49 -43 -46 -55 -62 -67 -76 -90 -102 -106 -107 -113 -126 -143 -161 -177 -186 -185 -173 -154 -134 -112 -88 -67 -55 -53 -59 -66 -70 -67 -59 -50 -47 -52 -66 -80 -89 -92 -93 -96 -95 -82 -62 -49
-2018 -49 -50 -61 -73 -82 -89 -95 -100 -107 -113 -116 -109 -97 -85 -79 -80 -86 -94 -97 -95 -91 -87 -84 -79 -75 -75 -83 -93 -98 -95 -88 -81 -74 -62 -43 -22 -9 -6 -8 -11 -15 -25 -38 -48 -52 -53 -56 -66 -82 -99 -106 -101 -94 -100 -118
-2040 -118 -137 -146 -147 -149 -154 -156 -153 -149 -149 -154 -164 -177 -187 -190 -186 -178 -170 -167 -165 -159 -144 -119 -94 -76 -66 -62 -60 -59 -56 -50 -46 -46 -53 -62 -73 -83 -90 -88 -76 -59 -42 -29 -22 -19 -19 -18 -15 -8 0 5 3 -7
-2061 -7 -25 -42 -52 -55 -54 -53 -51 -50 -50 -54 -58 -57 -52 -44 -33 -21 -14 -17 -25 -30 -27 -27 -39 -62 -86 -103 -108 -98 -75 -47 -27 -24 -34 -45 -50 -48 -45 -47 -62 -88 -112 -128 -137 -144 -148 -147 -144 -145 -150 -155 -152
-2081 -152 -141 -127 -110 -91 -71 -54 -44
-2084d4
##END=	
##END=	
