##TITLE=	Nov11-2021.20.fid
TM-VI-158

##JCAMP-DX=	6.0	$$ MestReNova 14.3.1-31739
##DATA TYPE=	LINK
##BLOCK_ID=	1
##BLOCKS=	2    
##ORIGIN=	Mestrelab Research S.L.
##OWNER=	hrzepa
##$MNOVA/LINK_BLOCK_TYPE=	ITEM	$$ NMR Spectrum
##$MNOVA/ITEM/POLYGON=	(XY..XY)
5321,5835
8722,5835
8722,8208
5321,8208
5321,5835
##$MNOVA/ITEM/Z=	0
##$MNOVA/ITEM/ANGLE=	0
##TITLE=	Nov11-2021.20.fid
##JCAMP-DX=	6.0	$$ MestReNova 14.3.1-31739
##BLOCK_ID=	2
##DATA TYPE=	MNOVA NMR VIEW DATA
##DATA CLASS=	MNOVA VIEW DATA
##$MNOVA/ITEM/ZOOM/X=	-4.005464102252559222,	16.005770000004368114
##$MNOVA/ITEM/ZOOM/Y=	-836.12654209136962891,	9259.98260498046875
##END=	
##TITLE=	Nov11-2021.20.fid
##JCAMP-DX=	6.0	$$ MestReNova 14.3.1-31739
##BLOCK_ID=	3
##DATA TYPE=	NMR SPECTRUM
##DATA CLASS=	XYDATA
##NUMDIM=	1
##ORIGIN=	Bruker BioSpin GmbH
##OWNER=	nmr
##.OBSERVE FREQUENCY=	400.4124024600000098
##.OBSERVE NUCLEUS=	^1H
##.SOLVENT NAME=	CD2Cl2
##.PULSE SEQUENCE=	zg30
##LONGDATE=	2021/11/11 10:30:00.000
##.ACQUISITIONMODE=	SIMULTANEOUS (DQD)
##$ORIGINAL FORMAT=	Bruker XWIN-NMR
##$MNOVA/SCALES_VERSION=	9
##$PARAMETER FILE=	(acqus, ASCII, /private/var/folders/f6/rjf_tdyn2v98c5c0wvkgn4s80000gn/T/37KuYTAYTAWP4ovuzwtypw/20/acqus, 0)
$$ ##TITLE= Parameter file, TOPSPIN		Version 3.2
$$ ##JCAMPDX= 5.0
$$ ##DATATYPE= Parameter Values
$$ ##NPOINTS= 11	$$ modification sequence number
$$ ##ORIGIN= Bruker BioSpin GmbH
$$ ##OWNER= nmr
$$ $$ 2021-11-11 10:30:53.429 +0000  nmr@CZC10666PP
$$ $$ /opt/topspin/data/agmb/nmr/Nov11-2021/20/acqus
$$ $$ process /opt/topspin3.2/prog/mod/shimcntl
$$ ##$ACQT0= -2.36344537815126
$$ ##$AMP= (0..31)
$$ 100 100 100 100 100 100 100 100 100 100 100 100 100 100 100 100 100 100
$$ 100 100 100 100 100 100 100 100 100 100 100 100 100 100
$$ ##$AMPCOIL= (0..19)
$$ 0 0 0 0 0 0 0 0 0 0 0 0 0 0 0 0 0 0 0 0
$$ ##$ANAVPT= -1
$$ ##$AQSEQ= 0
$$ ##$AQ_mod= 3
$$ ##$AUNM= <au_zg>
$$ ##$AUTOPOS= <52 >
$$ ##$BF1= 400.41
$$ ##$BF2= 400.41
$$ ##$BF3= 400.41
$$ ##$BF4= 400.41
$$ ##$BF5= 400.41
$$ ##$BF6= 400.41
$$ ##$BF7= 400.41
$$ ##$BF8= 400.41
$$ ##$BYTORDA= 0
$$ ##$CAGPARS= (0..11)
$$ 0 0 0 0 0 0 0 0 0 0 0 0
$$ ##$CFDGTYP= 0
$$ ##$CFRGTYP= 9
$$ ##$CHEMSTR= <none>
$$ ##$CNST= (0..63)
$$ 1 1 145 1 1 1 1 1 1 1 1 1 1 1 1 1 1 1 1 1 1 1 1 1 1 1 1 1 1 1 1 1 1 1 1
$$ 1 1 1 1 1 1 1 1 1 1 1 1 1 1 1 1 1 1 1 1 1 1 1 1 1 1 1 1 1
$$ ##$CPDPRG= (0..8)
$$ <> <> <> <> <mlev> <mlev> <mlev> <mlev> <mlev>
$$ ##$D= (0..63)
$$ 0 1 0 0 0 0 0 0 0 0.06 0 0 0 0 0 0 0.0002 0 0 0 0 0 0 0 0 0 0 0 0 0 0 0
$$ 0 0 0 0 0 0 0 0 0 0 0 0 0 0 0 0 0 0 0 0 0 0 0 0 0 0 0 0 0 0 0 0
$$ ##$DATE= 1636626652
$$ ##$DE= 6.5
$$ ##$DECBNUC= <off>
$$ ##$DECIM= 2496
$$ ##$DECNUC= <off>
$$ ##$DECSTAT= 4
$$ ##$DIGMOD= 1
$$ ##$DIGTYP= 12
$$ ##$DQDMODE= 0
$$ ##$DR= 22
$$ ##$DS= 2
$$ ##$DSPFIRM= 0
$$ ##$DSPFVS= 20
$$ ##$DTYPA= 0
$$ ##$EXP= <proton>
$$ ##$F1LIST= <111111111111111>
$$ ##$F2LIST= <222222222222222>
$$ ##$F3LIST= <333333333333333>
$$ ##$FCUCHAN= (0..9)
$$ 0 2 0 0 0 0 0 0 0 0
$$ ##$FL1= 90
$$ ##$FL2= 90
$$ ##$FL3= 90
$$ ##$FL4= 90
$$ [...]
$$ 90 74 58 42 26 10 0 0
$$ ##$Sgu3PowerLevels= (0..7)
$$ 0 0 0 0 0 0 0 0
$$ ##$Sgu4PowerLevels= (0..7)
$$ 0 0 0 0 0 0 0 0
$$ ##$Sgu5PowerLevels= (0..7)
$$ 0 0 0 0 0 0 0 0
$$ ##$Sgu6PowerLevels= (0..7)
$$ 0 0 0 0 0 0 0 0
$$ ##$Sgu7PowerLevels= (0..7)
$$ 0 0 0 0 0 0 0 0
$$ ##$Sgu8PowerLevels= (0..7)
$$ 0 0 0 0 0 0 0 0
$$ ##$SguType= 3
$$ ##$ShimPowMaxUA= (0..63)
$$ 130000 130000 130000 130000 130000 130000 130000 130000 130000 130000 130000
$$ 130000 130000 130000 130000 130000 130000 130000 130000 130000 0 0 0 0
$$ 0 0 0 0 0 0 0 0 0 0 0 0 0 0 0 0 0 0 0 0 0 0 0 0 0 0 0 0 0 0 0 0 0 0 0 0
$$ 0 0 0 0
$$ ##$ShimPowMaxUC= (0..63)
$$ 130000 130000 130000 130000 130000 130000 130000 130000 130000 130000 130000
$$ 130000 130000 130000 130000 130000 130000 130000 130000 130000 0 0 0 0
$$ 0 0 0 0 0 0 0 0 0 0 0 0 0 0 0 0 0 0 0 0 0 0 0 0 0 0 0 0 0 0 0 0 0 0 0 0
$$ 0 0 0 0
$$ ##$ShimPowMaxUG= (0..63)
$$ 524287 524287 524287 524287 524287 524287 524287 524287 524287 524287 524287
$$ 524287 524287 524287 524287 524287 524287 524287 524287 524287 0 0 0 0
$$ 0 0 0 0 0 0 0 0 0 0 0 0 0 0 0 0 0 0 0 0 0 0 0 0 0 0 0 0 0 0 0 0 0 0 0 0
$$ 0 0 0 0
$$ ##$ShimPowRcbType= 3
$$ ##$ShimPowRes= (0..63)
$$ 1e-20 1e-20 1e-20 1e-20 1e-20 1e-20 1e-20 1e-20 1e-20 1e-20 1e-20 1e-20
$$ 1e-20 1e-20 1e-20 1e-20 1e-20 1e-20 1e-20 1e-20 0 0 0 0 0 0 0 0 0 0 0 0
$$ 0 0 0 0 0 0 0 0 0 0 0 0 0 0 0 0 0 0 0 0 0 0 0 0 0 0 0 0 0 0 0 0
$$ ##$ShimPowRng0= (0..63)
$$ 1 1 1 1 1 1 1 1 1 1 1 1 1 1 1 1 1 1 1 1 0 0 0 0 0 0 0 0 0 0 0 0 0 0 0 0
$$ 0 0 0 0 0 0 0 0 0 0 0 0 0 0 0 0 0 0 0 0 0 0 0 0 0 0 0 0
$$ ##$ShimPowRng1= (0..63)
$$ 1 1 1 1 1 1 1 1 1 1 1 1 1 1 1 1 1 1 1 1 0 0 0 0 0 0 0 0 0 0 0 0 0 0 0 0
$$ 0 0 0 0 0 0 0 0 0 0 0 0 0 0 0 0 0 0 0 0 0 0 0 0 0 0 0 0
$$ ##$ShimPowRng2= (0..63)
$$ 1 1 1 1 1 1 1 1 1 1 1 1 1 1 1 1 1 1 1 1 0 0 0 0 0 0 0 0 0 0 0 0 0 0 0 0
$$ 0 0 0 0 0 0 0 0 0 0 0 0 0 0 0 0 0 0 0 0 0 0 0 0 0 0 0 0
$$ ##$ShimPowRng3= (0..63)
$$ 1 1 1 1 1 1 1 1 1 1 1 1 1 1 1 1 1 1 1 1 0 0 0 0 0 0 0 0 0 0 0 0 0 0 0 0
$$ 0 0 0 0 0 0 0 0 0 0 0 0 0 0 0 0 0 0 0 0 0 0 0 0 0 0 0 0
$$ ##$ShimSysFunc= (0..63)
$$ 1 2 3 4 5 7 9 11 15 16 8 10 12 14 6 17 13 18 19 20 0 0 0 0 0 0 0 0 0 0
$$ 0 0 0 0 0 0 0 0 0 0 0 0 0 0 0 0 0 0 0 0 0 0 0 0 0 0 0 0 0 0 0 0 0 0
$$ ##$ShimSysMatrix= 0
$$ ##$ShimSysType= 1
$$ ##$TFXNUM= 0
$$ ##$TRIPLO2= 0
$$ ##$VTU= 2
$$ ##$VTUETH= <149.236.99.20>
$$ ##$VTUTY= <no>
$$ ##$WBREFAM= (0..15)
$$ 135 116 100 100 100 100 100 100 100 100 100 100 100 100 100 100
$$ ##$WBREFLM= (0..15)
$$ 0 0 0 0 0 0 0 0 0 0 0 0 0 0 0 0
$$ ##$WBREFPH= (0..15)
$$ 71.66 -68.25 0 0 0 0 0 0 0 0 0 0 0 0 0 0
$$ ##$WBSGU= (0..15)
$$ 0 0 0 0 0 0 0 0 0 0 0 0 0 0 0 0
$$ ##$XFAC= 2
$$ ##END=
$$ 
##$DECIM=	2496
##$DSPFVS=	20
##XUNITS=	HZ
##YUNITS=	ARBITRARY UNITS
##FIRSTX=	6408.8703656999996383
##LASTX=	-1603.8278811825093726
##DELTAX=	-0.12226593800080123864
##XFACTOR=	1
##YFACTOR=	0.014800003839732317479
##FIRSTY=	11.887939453125
##MINY=	5.6900472640991210938
##MAXY=	8418.166015625
##NPOINTS=	65536
##XYDATA=	(X++(Y..Y))
$$ [...]
2052A000jJJ3K7K2R%mj6l0l5k3oKLKjnlQK0K1J2kj7k7k6j5MJ7J6PMNQMjKRPqj9j5KJ5J7J4
2046A017Plj1j1mmroJ3L6M7M1K8J1mj4j9k5k7j1J7L3J6j8l6l4k7k5j9pMLoj4j8j9j2%J0J1
2042I11Ooj9k6j8%QJqkJ4K1Rj2k1j0NJ1PMJ1K1K1J6J8K3J4j5m3m7k5MK8M1M0K4%k1l0k5j3
2037I17kmj3j3OK9L7L1K3K2J6kk3l3k4oNkj8k2j2LJ1J5K2K3Qj2j9qJkmQK5L4K3%k4m3n1n2
2031H70m8l7j4J2K6K3J7K0K5K0PPK8M9M7J6j6k7j6lkj0k0k6k4qJ1J5Jk3l6l5k9j4NJ8J6Ln
2027H43NJ6K0J9J8K1K1J5%j7k2rRJ5QQJ9K2Qorrj8k5j1J2K0Qpj1ponmrj8j8jJ9K6J1qj1LJ3
2021I48Mj5j6QL0K0j1k3LL5M3K3N%Kmj9l3l7k5nROnp%LjmQK5L3K3kk8m0l1pJ7K5J7Mrj5j3
2016I41oJjj2j2ML0L8J9j5m0m3k8qJ4L5M2L1RjNJ9K6K0Poj3pKLj0k3j8MK2K5J5Q%j2k8l6l0
$$ y = [1000, 999, 1000, 1013, 1040, 1062, 1071, 1071, 1067, 1051, 1021, 986, 963, 957, 959, 962, 964, 963, 958, 955, 963, 983, 1004, 1016, 1014, 997, 970, 944, 929, 933, 950, 966, 973, 977, 982, 990, 994, 993, 995, 1004, 1011, 1003, 984, 969, 971, 986, 1003, 1017, 1024, 1021, 1010, 999, 995, 991, 982, 976, 989, 1025, 1072, 1113, 1141, 1152, 1148, 1134, 1115, 1090, 1063, 1052, 1069, 1102, 1118, 1100, 1064, 1030, 1003, 978, 959, 952, 956, 959, 953, 939, 921, 902, 890, 890, 900, 911, 917, 911, 892, 866, 848, 848, 856, 857, 849, 847, 861, 882, 891, 879, 858, 848, 853, 864, 871, 875, 886, 907, 928, 944, 962, 985, 999, 984, 941, 894, 869, 873, 901, 942, 982, 1006, 1006, 985, 955, 930, 917, 915, 911, 898, 885, 891, 920, 957, 988, 1011, 1033, 1049, 1047, 1024, 991, 967, 961, 966, 964, 946, 924, 912, 915, 926, 941, 963, 986, 994, 982, 963, 955, 956, 954, 950, 958, 983, 1017, 1040, 1040, 1016, 973, 922, 870, 822, 785, 771, 783, 809, 832, 849, 869, 894, 914, 921, 928, 956, 1005, 1052, 1068, 1052, 1025, 1009, 1006, 1004, 994, 974, 948, 924, 916, 927, 942, 943, 920, 884, 849, 820, 806, 811, 829, 845, 848, 843, 848, 864, 884, 903, 921, 942, 963, 978, 978, 961, 939, 930, 939, 954, 962, 970, 989, 1011, 1019, 1013, 1004, 995, 977, 952, 941, 953, 973, 981, 974, 963, 956, 950, 945, 941, 932, 914, 896, 895, 914, 940, 951, 943, 932, 935, 948, 952, 937, 921, 929, 959, 979, 968, 945, 948, 983, 1026, 1049, 1054, 1054, 1056, 1052, 1033, 1000, 963, 938, 933, 942, 948, 943, 936, 936, 939, 938, 934, 942, 967, 1000, 1023, 1021, 993, 953, 922, 915, 932, 957, 974, 978, 969, 954, 941, 935, 936, 935, 923, 911, 915, 945, 983, 1002, 987, 947, 904, 876, 868, 882, 917, 959, 990, 999, 998, 1003, 1022, 1048, 1068, 1075, 1069, 1056, 1049, 1051, 1054, 1044, 1021, 1003, 1007, 1029, 1054, 1069, 1077, 1077, 1065, 1037, 1001, 971]
2010I71j9j2j3rJJ6K2J7Nlj%qj8j6MK2K2QooJOjj1j2KK2K8J1j1k0j2KNJjJ%pj3j2%J5K6K5
2005A022J2mj5j7j7j5j2nJkj3k2k2j8j8j8j0J0L3M3M4M0L1J3pk1k9l4l6k5jJ8J8OKRJ4Lj5
2000I43k1j4lKJ0J9K4Rj1j1J3M1M4K0loKJ0J1Plj1j0m%rj9j9j3j1j6j5jJ0Qlj2j2JJ5J8Pj1
1995I76j8nJ0J1jrqopnJ%j4l2k4J0M3M5J8j2k8k1oQPrk3j8jQPNJ0J2kj9k5j4jNMJmjJ1J7Q
1989I04j0j5pJkj0oPJ7K0K1K8L5L3J5j1k5j6NJ1mk3k5j3oj1k2k6j9rmppKJ6K0Qqj0PK7L7L0
1984I48Rj5k5k2j8j8j1J1L1K4kj2kJ0MnlNLKJ3K5K4J2Nkk3m5m7k9j4j2j0PK8L4K9K6K5Rk5
1979I44n0n0k7kJ0J1J1J9L2L5K7Rrk5l3k7qJ7K6J6ok7m2m6m0k6rJ3L8N7O0M6K7J2Knrqj0j3
1974I40j2jJ2J1kj0qmqj9k1j1MJ2OooPJ6Nj4k2rNJ0OQJ4J5J3J3Prk8k7lK1K2Mj1pRJ7J5J1
$$ y = [971, 952, 940, 927, 918, 919, 935, 957, 974, 979, 976, 975, 975, 967, 949, 933, 937, 959, 981, 989, 983, 977, 978, 984, 983, 972, 960, 962, 984, 1012, 1023, 1012, 992, 980, 982, 987, 988, 987, 988, 988, 981, 968, 956, 956, 971, 997, 1022, 1034, 1030, 1015, 998, 981, 966, 954, 949, 950, 948, 935, 913, 891, 873, 855, 837, 827, 837, 870, 913, 957, 997, 1028, 1041, 1034, 1013, 984, 950, 914, 889, 888, 906, 924, 930, 932, 941, 955, 958, 943, 922, 908, 905, 907, 917, 936, 960, 969, 958, 947, 960, 1001, 1045, 1065, 1062, 1056, 1058, 1068, 1079, 1086, 1083, 1072, 1062, 1058, 1058, 1049, 1030, 1011, 998, 987, 971, 956, 955, 965, 973, 970, 958, 946, 947, 962, 980, 987, 976, 958, 953, 963, 974, 973, 964, 956, 950, 943, 938, 939, 939, 925, 893, 869, 879, 922, 967, 985, 973, 945, 924, 918, 926, 933, 924, 901, 883, 882, 890, 897, 902, 912, 924, 922, 903, 878, 864, 863, 868, 872, 873, 869, 868, 879, 896, 904, 894, 879, 872, 873, 871, 861, 855, 862, 879, 899, 920, 948, 983, 1016, 1031, 1020, 995, 979, 984, 995, 991, 968, 943, 930, 924, 913, 891, 865, 846, 837, 833, 826, 819, 821, 837, 857, 865, 857, 847, 854, 881, 918, 948, 957, 942, 917, 895, 877, 859, 848, 859, 890, 914, 912, 900, 898, 908, 912, 907, 904, 909, 912, 914, 927, 952, 976, 988, 993, 991, 968, 923, 876, 847, 833, 821, 811, 818, 846, 880, 909, 935, 960, 969, 944, 894, 844, 817, 815, 825, 836, 847, 866, 898, 933, 960, 969, 960, 935, 902, 875, 867, 884, 910, 926, 920, 893, 851, 805, 765, 739, 730, 743, 781, 838, 898, 944, 971, 983, 985, 980, 971, 963, 953, 940, 928, 927, 939, 950, 948, 938, 930, 926, 918, 899, 878, 867, 871, 883, 889, 883, 877, 884, 900, 905, 891, 869, 860, 865, 875, 881, 889, 903, 918, 931, 944, 951, 942, 914, 887, 884, 905, 927, 931, 920, 913, 922, 939, 954, 965]
1968I65J3J3Nj3k3j6jNlqJJ1Nj7l5l8k9j6LK3K9J9N%jmpkPOKOJ4J2lj3pKlj0o%kp%J9K3Mj5
1962I13j9j3j2j2lQJ0KoqlJ0K7L4K7J8J4J5Q%%PMrj6j5j3j1mJ5K5J2j0j2J0L2L3J2j4k7k6
1957A003j5pjJ2K9L4J6mkJ9L0J4rj7j0j0k2l6m4m3l0j0QRnj1JJ8K8K4J5Lrk1k1oJ2K8L2K6
1952A028J3L%MRQMnj5j3kRKj8l2k8j7j5j2NK9L3J2j1j5nM%j0j7j1OK6L7L3K1Nj4k8l2k3j3
1947I55mJ0K6K5PkJ5L5K5ok3j0MLKJ4K4J4qj9j5j0popqkJ1J9J1J%Ojk2l7l5k0jJ5K0Rj0j5
1942I83rlplJ3K5K0MmnpoKPOJ1K9M5L1lk5k2pkkknj5j8j2pj1j5j1rj5j8jK4L1K2J8K6K3ol9
1936A031m6k9j5j3j2jRJ3J4J7J4PLJ0K2K8K6K1J0rk4k3j2j5k8k7%L3M3K3OQK7L8L5K5J5J0
1932A234Plj7k5k3j4rpqrj3j0nK%oj1k1l6m4k7J1L9L4J5QJ7K7K8K2J0lj2rllj0j2nKQJ0RJ
$$ y = [965, 978, 991, 996, 983, 960, 944, 943, 948, 945, 937, 938, 949, 954, 937, 902, 864, 835, 819, 822, 845, 874, 893, 898, 898, 897, 893, 886, 884, 891, 897, 899, 905, 919, 931, 928, 915, 908, 910, 907, 897, 891, 891, 889, 882, 882, 901, 924, 928, 913, 894, 881, 869, 857, 854, 862, 872, 874, 868, 860, 857, 867, 894, 928, 955, 973, 987, 1002, 1010, 1010, 1010, 1017, 1021, 1012, 996, 981, 968, 957, 953, 968, 993, 1005, 995, 983, 993, 1025, 1058, 1070, 1056, 1029, 1003, 988, 981, 980, 992, 1021, 1055, 1071, 1067, 1065, 1084, 1114, 1128, 1119, 1102, 1092, 1082, 1060, 1024, 980, 937, 907, 897, 905, 914, 909, 898, 899, 917, 945, 969, 984, 987, 978, 957, 936, 930, 942, 970, 1002, 1028, 1041, 1044, 1044, 1048, 1057, 1065, 1069, 1064, 1049, 1036, 1034, 1043, 1045, 1027, 995, 967, 950, 935, 923, 928, 957, 990, 1002, 991, 976, 971, 975, 975, 965, 948, 937, 943, 969, 1006, 1039, 1060, 1065, 1051, 1023, 991, 968, 955, 951, 961, 987, 1012, 1019, 1017, 1032, 1067, 1092, 1086, 1063, 1053, 1057, 1060, 1062, 1076, 1100, 1114, 1106, 1087, 1072, 1062, 1055, 1049, 1042, 1034, 1032, 1043, 1062, 1073, 1074, 1074, 1080, 1079, 1057, 1020, 985, 965, 964, 979, 999, 1008, 998, 983, 974, 971, 964, 961, 974, 999, 1019, 1023, 1019, 1014, 1007, 1001, 1003, 1010, 1016, 1027, 1056, 1101, 1132, 1129, 1104, 1082, 1075, 1073, 1071, 1069, 1064, 1049, 1031, 1019, 1012, 1001, 986, 975, 966, 951, 933, 932, 956, 987, 1009, 1027, 1053, 1076, 1070, 1031, 985, 956, 941, 928, 916, 915, 924, 937, 951, 968, 982, 989, 992, 1002, 1024, 1052, 1078, 1099, 1109, 1100, 1076, 1053, 1041, 1026, 998, 971, 971, 1004, 1047, 1070, 1076, 1084, 1111, 1149, 1184, 1209, 1224, 1234, 1241, 1238, 1221, 1196, 1173, 1159, 1150, 1143, 1135, 1126, 1113, 1103, 1098, 1100, 1100, 1094, 1083, 1062, 1026, 982, 955, 966, 1005, 1039, 1054, 1062, 1079, 1106, 1134, 1156, 1166, 1163, 1151, 1142, 1139, 1136, 1126, 1114, 1109, 1111, 1119, 1129, 1138, 1139]
1926A139nKK2L4K9J6J2J7K1K2K4K9L0K2J4OKknqj3j8j8j2nmj5k8l7l9l5l2k4j0J0K8L8L6J5
1921A258j2k7j5J2K7K1Lj3k6l3k6j1LJ0J7K8L3K2QNK1L8M1L0J3mr%J5K4K3J2lj5j2PK7L2K4
1917A548J0lk2l8m3m2n1o6o3l9j1kmKJ8K3J2mj2j1j4j3lJ2K0J2lpk%j1k3k1r%KLJ5L1L9L3
1912A263K1QkrnQK1K7K2Rlrj0rj3j9k0j1jLlj1j6j7j8j8j5oMROLKMRJ0Lrj7j1PJ7RmpLJ0J
1906A216j5j8mRJ2QJ2K3K3Nj5j4ljj5k5k0o%m%RJ5J0KnppjKlk0l4l3qK6M7L7Ok1j8LJ8J2N
1900A203J0K6L6L4K1Nj4k9l5l1j9lQRRJ8L0K9J2ljRPpk4k7j7JJ9K2Pqj1qrk1k5j7lRK1L3L1
1895A297J2qj5lJ1K0J9J3Mpj2pOJ0jk3k8qJ8K3J1LOMjMK1K7J1j4k0qjoj2j5j9k1j0KKj4k4
1890A247j2QJ5J1RK1L2K5%k4k9k4k1k7k7j4JRJ5K7L6K8Qrj1rnoj2k2k7j6LJ4J6J8K5K9K8K9
$$ y = [1139, 1134, 1136, 1158, 1192, 1221, 1237, 1249, 1266, 1287, 1309, 1333, 1362, 1392, 1414, 1428, 1434, 1436, 1434, 1429, 1421, 1408, 1390, 1372, 1360, 1355, 1351, 1336, 1308, 1271, 1232, 1197, 1165, 1141, 1131, 1141, 1169, 1207, 1243, 1258, 1246, 1219, 1204, 1216, 1243, 1264, 1267, 1254, 1228, 1195, 1169, 1158, 1161, 1171, 1188, 1216, 1249, 1271, 1279, 1284, 1305, 1343, 1384, 1414, 1427, 1423, 1414, 1414, 1429, 1453, 1476, 1488, 1485, 1470, 1458, 1465, 1492, 1524, 1548, 1558, 1555, 1533, 1495, 1452, 1410, 1359, 1293, 1230, 1191, 1180, 1178, 1174, 1176, 1194, 1217, 1229, 1225, 1213, 1202, 1188, 1175, 1172, 1184, 1204, 1216, 1213, 1206, 1204, 1204, 1193, 1170, 1149, 1140, 1140, 1142, 1145, 1160, 1191, 1230, 1263, 1284, 1292, 1290, 1281, 1276, 1284, 1305, 1332, 1354, 1363, 1360, 1351, 1341, 1332, 1319, 1300, 1280, 1269, 1268, 1271, 1268, 1257, 1241, 1224, 1206, 1188, 1173, 1167, 1171, 1180, 1186, 1189, 1191, 1195, 1204, 1214, 1217, 1208, 1191, 1180, 1187, 1204, 1213, 1209, 1202, 1205, 1215, 1216, 1201, 1183, 1179, 1188, 1200, 1208, 1220, 1243, 1266, 1271, 1256, 1242, 1239, 1238, 1223, 1198, 1178, 1172, 1172, 1168, 1168, 1177, 1192, 1202, 1204, 1199, 1192, 1185, 1184, 1186, 1183, 1163, 1129, 1096, 1088, 1114, 1161, 1198, 1204, 1183, 1165, 1168, 1186, 1198, 1203, 1213, 1239, 1275, 1309, 1330, 1335, 1321, 1292, 1257, 1226, 1207, 1204, 1212, 1221, 1230, 1248, 1278, 1307, 1319, 1316, 1315, 1324, 1331, 1324, 1300, 1273, 1256, 1257, 1276, 1298, 1305, 1297, 1286, 1278, 1269, 1248, 1223, 1206, 1203, 1212, 1233, 1266, 1297, 1309, 1301, 1286, 1283, 1294, 1314, 1333, 1346, 1350, 1343, 1331, 1324, 1330, 1340, 1339, 1316, 1288, 1280, 1298, 1321, 1332, 1335, 1341, 1345, 1344, 1348, 1369, 1396, 1407, 1393, 1373, 1365, 1364, 1358, 1346, 1331, 1312, 1291, 1281, 1283, 1285, 1271, 1247, 1235, 1243, 1258, 1269, 1278, 1299, 1331, 1356, 1356, 1332, 1303, 1279, 1258, 1231, 1204, 1190, 1191, 1200, 1215, 1242, 1278, 1306, 1314, 1305, 1294, 1285, 1280, 1274, 1262, 1240, 1213, 1197, 1200, 1214, 1230, 1248, 1273, 1302, 1330, 1359]
1885A359L0K2PLJ7L2L1J4j5m7o4n1j7J0J3NLL%jRJ7Rnj1pnlPJ1Jj2qMMppKmk0j2K8N7M1Jk0
1879A424j5lJOJ2J0lk0l4m1l5j6PK1K0J5PMQK3L2L0J9J0Kj6m0n2m1j6J2K9K8J1rj8j4j2j5
1875A331j7rOK4L6L2J2j6k9k1nJkolNJ4J8J4OKMPJ3K5L4K9Oj2j4rpj1nJ1K4K5J5Lj3k7l5k6
1869A430kK2L0J4j0k6k6j7qKJ6K7L1K8K3J7J0Mkmoljj0k6l2k1j1j7k8k4nkj5k6qJ9L2K3Qn
1864A401j7l6m8m4k7nJ4K4K4J2kq%K0L4L0Rj4k3j7kJ5K9K9J1j4j8ML9N6M8K6J2RPJm%RJ0p
1859A587l4n3n2m0k8j9%K2K8Ol4o3o2l6kK5L4K3MpLK3L2K1jk3l2l3k3j0KMLQJ8K2J7J4K4K9
1854A397J1k0l2rK4L2K0K2M8P0O3L6J5Omk3m2n0m1k4j1j6l2m1l0qKok4l1j6J1K2Ll2n0l6j4
1850A190prlOMj0j6j1nlQK1K4Pj3k2k4k0j0PJ3QJ1L0M4K7kj0LJ5J5J3J4J2PJ0J4Oj4k7k5k1
$$ y = [1359, 1389, 1411, 1418, 1421, 1438, 1470, 1501, 1515, 1500, 1453, 1389, 1338, 1321, 1331, 1344, 1349, 1352, 1355, 1355, 1354, 1363, 1380, 1389, 1384, 1373, 1366, 1361, 1358, 1365, 1376, 1377, 1365, 1357, 1361, 1365, 1358, 1351, 1353, 1349, 1329, 1317, 1345, 1402, 1443, 1444, 1424, 1409, 1406, 1407, 1413, 1425, 1435, 1432, 1412, 1378, 1337, 1302, 1286, 1293, 1314, 1334, 1349, 1356, 1360, 1368, 1391, 1423, 1453, 1472, 1482, 1484, 1468, 1428, 1376, 1335, 1319, 1331, 1360, 1388, 1399, 1390, 1372, 1358, 1346, 1331, 1314, 1305, 1311, 1335, 1371, 1403, 1415, 1399, 1370, 1349, 1344, 1345, 1343, 1337, 1334, 1339, 1353, 1371, 1385, 1391, 1393, 1397, 1404, 1417, 1442, 1476, 1505, 1511, 1499, 1485, 1476, 1469, 1458, 1453, 1464, 1488, 1513, 1528, 1531, 1518, 1491, 1456, 1430, 1428, 1450, 1480, 1494, 1484, 1458, 1432, 1415, 1407, 1409, 1425, 1452, 1483, 1511, 1534, 1551, 1561, 1565, 1563, 1559, 1553, 1550, 1549, 1539, 1513, 1481, 1460, 1449, 1432, 1404, 1380, 1375, 1373, 1358, 1332, 1324, 1343, 1375, 1398, 1406, 1401, 1384, 1348, 1300, 1256, 1229, 1224, 1238, 1262, 1286, 1298, 1296, 1288, 1288, 1308, 1342, 1372, 1381, 1367, 1344, 1327, 1325, 1340, 1369, 1398, 1409, 1395, 1377, 1381, 1420, 1476, 1524, 1550, 1562, 1571, 1578, 1579, 1575, 1575, 1584, 1594, 1587, 1553, 1500, 1448, 1408, 1380, 1361, 1361, 1383, 1411, 1417, 1383, 1320, 1258, 1222, 1220, 1245, 1279, 1302, 1306, 1299, 1302, 1325, 1357, 1378, 1377, 1354, 1322, 1289, 1266, 1256, 1258, 1262, 1265, 1273, 1291, 1313, 1330, 1344, 1368, 1397, 1408, 1388, 1356, 1347, 1371, 1403, 1423, 1445, 1493, 1563, 1626, 1662, 1677, 1683, 1679, 1656, 1614, 1564, 1523, 1499, 1488, 1472, 1440, 1399, 1369, 1361, 1363, 1357, 1333, 1302, 1286, 1297, 1319, 1322, 1290, 1240, 1204, 1190, 1183, 1174, 1171, 1177, 1181, 1171, 1155, 1144, 1139, 1136, 1144, 1165, 1189, 1196, 1183, 1161, 1137, 1117, 1107, 1114, 1127, 1135, 1146, 1176, 1220, 1247, 1245, 1235, 1238, 1253, 1268, 1281, 1295, 1307, 1314, 1324, 1338, 1344, 1330, 1303, 1278, 1257]
1845A257k3k7k4k1k4k4j7j1j3j0NK1K3J9K0J7jk9l8k7j3j3j9j6qLJ7L2L7K9J0rk4l0k4j2l
1840A030KJ3K9L6K1%j2r%J0J8J2ok2k1jJ3Nk0l8k9%K8L5J7pk4k6j7mjj1k6k7j0J1J6Mj0j6
1835I63nJ4K8K2LrJJ5J5LkMMj2k8k5rLNOQPkj5k2j4J0L6M0K4Jrqj0k2l0k6j7r%RJ3Pj%J6L1
1829A013K6Mk5l6k5lJ6K1J2nj8j1J4M6O3N6L1Pqj4j9k7l1k4j4j2j6j0RK2J2noPJ7J0NJ7L1
1825A130K8Rj2k3k6j8oK%rj2n%MQJ4J2N%NRNlnJjj3k8l2k6j4nMJ2K0K7K6J3rk4k3j0jloJK0
1819A041L5L8L2K9K9K6J5MmqoPK3K8K0OKMKj0k3l5m3m1k6LK9L9K8Po%J9L2J9nj8j0nj8l4k8
1814A197kJ5J1NJ1J6Kk1k6j1KKKJ0K2K0Qmj4k0j7lJ6L1L9L9L2K2J3Rjk1m0m2k9j8j6j6pQK3
1809A247L9M9M4K4lj5j8j8k1j9j0j%rk0j5RL6L7J1j1nJ7K3J0%KLqj4nJj4l7l8rK2L7L6K9J8
$$ y = [1257, 1234, 1207, 1183, 1162, 1138, 1114, 1097, 1086, 1073, 1063, 1068, 1089, 1112, 1131, 1151, 1168, 1167, 1138, 1100, 1073, 1060, 1047, 1028, 1012, 1004, 1007, 1024, 1056, 1093, 1122, 1132, 1123, 1099, 1069, 1045, 1033, 1030, 1032, 1045, 1074, 1110, 1131, 1131, 1119, 1110, 1110, 1120, 1138, 1150, 1144, 1122, 1101, 1100, 1113, 1118, 1098, 1060, 1031, 1031, 1059, 1094, 1111, 1104, 1080, 1054, 1037, 1033, 1032, 1021, 995, 968, 958, 969, 985, 989, 979, 963, 958, 972, 1000, 1022, 1025, 1016, 1017, 1032, 1047, 1050, 1048, 1052, 1056, 1044, 1016, 991, 982, 985, 990, 996, 1004, 1011, 1009, 994, 972, 958, 968, 1004, 1044, 1068, 1069, 1060, 1052, 1042, 1020, 990, 964, 947, 938, 938, 947, 960, 967, 966, 966, 982, 1013, 1039, 1043, 1018, 982, 957, 954, 970, 991, 1003, 998, 980, 969, 983, 1029, 1092, 1148, 1179, 1186, 1178, 1164, 1145, 1118, 1087, 1063, 1049, 1037, 1021, 1011, 1020, 1042, 1054, 1049, 1043, 1050, 1067, 1077, 1082, 1099, 1130, 1158, 1167, 1155, 1132, 1106, 1088, 1082, 1084, 1084, 1075, 1063, 1058, 1058, 1062, 1070, 1084, 1096, 1101, 1101, 1106, 1115, 1120, 1117, 1112, 1113, 1112, 1099, 1071, 1039, 1013, 999, 994, 998, 1010, 1030, 1057, 1083, 1096, 1087, 1063, 1040, 1030, 1029, 1026, 1020, 1021, 1041, 1076, 1114, 1146, 1175, 1204, 1230, 1245, 1249, 1245, 1237, 1231, 1238, 1261, 1289, 1309, 1315, 1317, 1321, 1323, 1313, 1290, 1255, 1212, 1171, 1145, 1148, 1177, 1216, 1244, 1251, 1245, 1245, 1264, 1296, 1315, 1310, 1292, 1282, 1277, 1259, 1225, 1197, 1195, 1210, 1221, 1226, 1237, 1253, 1255, 1234, 1208, 1197, 1199, 1201, 1203, 1213, 1235, 1255, 1263, 1259, 1245, 1225, 1208, 1205, 1221, 1252, 1291, 1330, 1362, 1384, 1397, 1406, 1405, 1384, 1344, 1302, 1273, 1255, 1239, 1223, 1216, 1224, 1247, 1286, 1335, 1379, 1403, 1400, 1385, 1367, 1349, 1328, 1309, 1299, 1298, 1298, 1289, 1269, 1254, 1263, 1299, 1336, 1347, 1336, 1331, 1348, 1371, 1381, 1381, 1383, 1386, 1378, 1364, 1359, 1360, 1346, 1309, 1271, 1262, 1284, 1321, 1357, 1386, 1404]
1804A404MlJRPkj0j4j1LK3K8Rj8j6J2L2K3J0K3M9N7M3L1L4K4pl3j9K7O0O1M3L2L3M1N6P6Q9
1799B211Q6P4O6P4Q5R3Q9Q6Q8R7J09J17J26J41J56J65J68J67J74J91K18K55K99L49M12M88
1796F584N67O37P05P97R29J092J260J412J546J668J784J882J920J829J554J082M51k54r27
1793B6518j469j820j971j957j819j601j345j093q72o97n60m54l68k93k25j67j23q7m4J2O9
1791I634J09J32J55J98K50K88L03L15L54M17M88N54O26P14Q10R15J045J213J426J674J962
1788B3582K296K676L089L525L981M465M963N437N809N964N768N087L832K012k15k535m563
1786G5173n983o666o680o213n480m661l877l200k645k190j814j515j297j146j017q79p35o09
1784A8566n10m27l53k89k29j56o4L0J05J51J83K13K52L06L75M59N57O79Q32J019J236J482
$$ y = [1404, 1408, 1405, 1406, 1415, 1422, 1420, 1410, 1396, 1385, 1388, 1411, 1439, 1448, 1430, 1414, 1426, 1458, 1481, 1491, 1514, 1563, 1620, 1663, 1694, 1728, 1752, 1745, 1712, 1693, 1720, 1780, 1841, 1884, 1916, 1949, 1990, 2046, 2122, 2211, 2297, 2371, 2437, 2511, 2596, 2689, 2778, 2864, 2952, 3049, 3158, 3275, 3401, 3542, 3698, 3863, 4031, 4198, 4372, 4563, 4781, 5036, 5335, 5684, 6096, 6584, 7151, 7788, 8493, 9290, 10219, 11311, 12571, 13983, 15529, 17197, 18981, 20863, 22783, 24612, 26166, 27248, 27699, 27445, 26518, 25049, 23229, 21258, 19301, 17482, 15881, 14536, 13443, 12571, 11874, 11314, 10860, 10492, 10199, 9974, 9807, 9684, 9597, 9553, 9565, 9634, 9743, 9875, 10030, 10228, 10478, 10766, 11069, 11384, 11738, 12155, 12643, 13197, 13823, 14537, 15347, 16262, 17307, 18520, 19946, 21620, 23582, 25878, 28554, 31643, 35168, 39149, 43614, 48577, 54014, 59823, 65787, 71555, 76642, 80474, 82486, 82271, 79736, 75173, 69190, 62524, 55844, 49631, 44151, 39490, 35613, 32413, 29768, 27578, 25764, 24249, 22952, 21806, 20789, 19910, 19175, 18566, 18056, 17629, 17276, 16987, 16758, 16602, 16538, 16568, 16673, 16824, 17007, 17220, 17472, 17778, 18153, 18612, 19169, 19848, 20680, 21699, 22935, 24417]
1781B4417J764K088K446K836L261L722M211M713N198N612N855N801N314M283K663N37j831
1779H2890m051n741o692o918o590n932n139m343l618k996k494k111j822j593j397j226j084
1777A9143r67q63p68o77n84m93m16l67l35l03k64k29k04j81j50j10o4j6L4P8J25J88K73L60
1774A3210M37N15O18P53Q97J043J193J351J504J637J734J766J678J408R38L04m20j131j718
1772B7717k097k242k200k043j830j596j363j153r77q37p22o30n53m83m19l68l27k94k60k30
1769G093k16k11k01j78j61j57j56j45j25j22j34j36j17q6o4n2m0l6n2p9r1r0r2j08j19j08
1766D017r1r1j04j11j03q7o7m6k8k8m1m8m4l7m3n0m4k6rklj0k0l2l8l3k6k3k7l4m0m3l8k4
1762B526kJ7K3J5PLlj6j9KL6N0L7J2LNMpj8k3k8l4l5l4l0k7k4k4k5k3j4ork4l5l3k6j8j1J
$$ y = [24417, 26181, 28269, 30715, 33551, 36812, 40534, 44745, 49458, 54656, 60268, 66123, 71924, 77238, 81521, 84184, 84721, 82890, 78839, 73098, 66406, 59488, 52898, 46966, 41827, 37484, 33866, 30870, 28376, 26265, 24443, 22850, 21453, 20227, 19143, 18176, 17313, 16545, 15868, 15284, 14791, 14375, 14008, 13673, 13370, 13106, 12877, 12673, 12492, 12342, 12232, 12168, 12152, 12186, 12264, 12389, 12577, 12850, 13210, 13647, 14162, 14780, 15533, 16430, 17473, 18666, 20017, 21521, 23158, 24892, 26658, 28336, 29744, 30682, 30986, 30566, 29435, 27717, 25620, 23378, 21178, 19135, 17305, 15709, 14346, 13193, 12216, 11379, 10657, 10027, 9474, 8991, 8572, 8204, 7877, 7583, 7323, 7093, 6877, 6666, 6465, 6287, 6126, 5969, 5813, 5668, 5543, 5421, 5287, 5151, 5034, 4948, 4884, 4832, 4792, 4756, 4704, 4625, 4534, 4444, 4352, 4244, 4125, 4017, 3926, 3835, 3731, 3620, 3517, 3430, 3363, 3317, 3289, 3261, 3220, 3172, 3128, 3091, 3048, 2998, 2954, 2928, 2919, 2917, 2914, 2904, 2884, 2852, 2814, 2781, 2755, 2732, 2705, 2671, 2631, 2588, 2550, 2526, 2524, 2541, 2564, 2579, 2586, 2589, 2586, 2570, 2551, 2553, 2589, 2639, 2676, 2688, 2691, 2696, 2700, 2693, 2675, 2652, 2624, 2590, 2555, 2521, 2491, 2464, 2440, 2416, 2391, 2368, 2354, 2348, 2339, 2315, 2280, 2247, 2221, 2203, 2192, 2193]
1757B193RJ3Rmk6m6m9l1mJ4K2K5K1Pj2j8j2lJ%joj2j3qPK0K3J4%rnJjnporj8k6l2l5l3j7J
1752A932QKpj1j5k3k2pJ1J4QOPPJpj2j7k1j6mJ0J5J0kj4j6rmj5l5m7m2k5nJ4K0K1K2K9L2K7
1747A820K3L5M2K1j9m2l2j2j1j7pJ7K4Oj9k5j2MJ1Kj5k4j5jQJ2J5Rj1k7k6j3opKJ9K6J5%r
1742A761k1m0m8k9%Qlj4j1lMJ4K8K9J0pq%%mOK1J9qk9k0NJ5OqqkNJ6L1L5K5J2Mlj1qJ6L7L0
1736A852ll1l5k7j9qNMj2k8k9j7qkmj2k4k4nJ0Oj1pJ9L9L7J8kj3rRK9L5K7K2K9L6K7QJJ5L3
1731A931M3L9L0J8ROJ1J3Jk2m2m7m2l9m0l2k3k8m9n5k8J2K4J0NK7N2N4L4J3KkJMnk6l5k5j5
1726A784j9k4qK4M5L9K4J5J2J1J4K7M3O1Q3R7R1P3O2O8Q4R4R8R6Q1M1j1n8r2j20j47j61j47
1722B280j08o0k1mkqj8l4m8n3m5k8j0MJ1J3J1J3J9K8L2K6J3%%J5L6M2K3pk5k0pLRJ6J7Pol
$$ y = [2193, 2202, 2215, 2224, 2220, 2194, 2148, 2099, 2068, 2064, 2078, 2100, 2125, 2146, 2153, 2141, 2123, 2111, 2108, 2109, 2109, 2108, 2102, 2090, 2077, 2069, 2076, 2096, 2119, 2133, 2133, 2124, 2119, 2120, 2119, 2114, 2107, 2101, 2092, 2074, 2048, 2016, 1981, 1948, 1931, 1932, 1940, 1942, 1935, 1924, 1909, 1886, 1864, 1857, 1868, 1882, 1890, 1896, 1903, 1910, 1911, 1904, 1892, 1875, 1854, 1838, 1834, 1844, 1859, 1869, 1867, 1853, 1837, 1828, 1824, 1809, 1774, 1727, 1685, 1660, 1655, 1669, 1689, 1710, 1732, 1761, 1793, 1820, 1843, 1878, 1920, 1941, 1922, 1880, 1848, 1836, 1825, 1808, 1801, 1818, 1842, 1848, 1829, 1804, 1792, 1796, 1807, 1809, 1794, 1770, 1755, 1754, 1762, 1774, 1789, 1798, 1787, 1760, 1734, 1721, 1715, 1708, 1710, 1729, 1755, 1770, 1770, 1761, 1740, 1700, 1652, 1623, 1623, 1631, 1628, 1614, 1603, 1600, 1604, 1618, 1646, 1675, 1685, 1678, 1670, 1670, 1670, 1666, 1672, 1693, 1712, 1704, 1675, 1655, 1660, 1675, 1681, 1673, 1665, 1663, 1668, 1684, 1715, 1750, 1775, 1787, 1791, 1788, 1777, 1769, 1785, 1822, 1852, 1849, 1818, 1783, 1756, 1737, 1729, 1734, 1738, 1726, 1698, 1669, 1652, 1644, 1642, 1638, 1626, 1602, 1578, 1573, 1583, 1589, 1578, 1571, 1590, 1629, 1666, 1684, 1682, 1669, 1660, 1669, 1698, 1733, 1760, 1782, 1811, 1847, 1874, 1882, 1883, 1898, 1931, 1974, 2013, 2043, 2061, 2070, 2076, 2087, 2100, 2101, 2079, 2037, 1990, 1948, 1909, 1869, 1837, 1814, 1786, 1737, 1682, 1654, 1666, 1690, 1700, 1705, 1732, 1784, 1838, 1872, 1885, 1887, 1885, 1886, 1890, 1885, 1859, 1824, 1799, 1784, 1765, 1741, 1733, 1757, 1802, 1841, 1865, 1880, 1892, 1903, 1917, 1944, 1987, 2048, 2131, 2228, 2319, 2392, 2454, 2522, 2606, 2700, 2798, 2894, 2975, 3016, 3005, 2947, 2855, 2735, 2588, 2427, 2280, 2172, 2112, 2091, 2087, 2085, 2077, 2059, 2025, 1977, 1924, 1879, 1851, 1841, 1845, 1856, 1869, 1880, 1893, 1912, 1940, 1972, 1998, 2011, 2011, 2011, 2026, 2062, 2104, 2127, 2120, 2095, 2075, 2068, 2071, 2080, 2096, 2113, 2120, 2114, 2111]
1717B111K3N7Q0Q8Q9Q8Q5Q3Q2P6N1J0k7m4m9o7r7j17j08p8n5m4m1l3k0j5k6n0o9o3l7oJ0Q
1713A895mj6j5%J7K1J2JNK6N2O7O6M8K4ml4o2p0n1j9%J%J0K2K6K5K5K1J3J0K1K7J4j0k7l4
1709B103l9m0k7oMjqj0j5k8l9l6k0kJ1J4Kj3j9j5j1kJ3K7K3NKK2M4M4L0K1J4ol1l7k6k0l5
1704A893n0m8k8j1rj6k8l7m0l3k3j3kPJ1RNOPKopmJKOQLpj4oQJ8J7PknjMQJ1QPOQJ5K0K0J0
1698A737rk5k5rLLllkj0k8l5k3omj1j4q%%kjlprmNROKkKJ0J6Pj9m3m3j5J8L4K7Nj3k0j5qq
1692A457j1j2pnrj5j3lRJ8K2K7L6M5M3L0Pj0j2mOPLlj1k1l0l1k1kK0K9J9%j1j2j1j2j5j3r
1687A475nMJ8K6J9Pjmj7l6m8m0k0mNQJ1J6K3L0K7J9J1MjpqLJ4J8J3RPjj2j9k2k9l6l4j7mn
1682A397j2lK3M5M7L6K5J4%j4k0j7j3j6j9j7j3pmloj6j8nJ5K2J4L%ORRJ0J0Nrj9k0r%kj0r
$$ y = [2111, 2134, 2191, 2271, 2359, 2448, 2536, 2621, 2704, 2786, 2862, 2913, 2923, 2896, 2852, 2803, 2736, 2639, 2522, 2414, 2336, 2281, 2237, 2196, 2163, 2143, 2128, 2102, 2052, 1983, 1920, 1883, 1877, 1887, 1895, 1891, 1875, 1860, 1860, 1877, 1898, 1910, 1911, 1916, 1942, 1994, 2061, 2127, 2175, 2199, 2195, 2161, 2099, 2029, 1978, 1959, 1959, 1960, 1960, 1970, 1992, 2018, 2043, 2068, 2089, 2102, 2112, 2133, 2160, 2174, 2164, 2137, 2103, 2064, 2024, 1997, 1991, 1995, 1994, 1986, 1976, 1961, 1933, 1894, 1858, 1838, 1836, 1847, 1861, 1863, 1850, 1831, 1816, 1805, 1803, 1816, 1843, 1866, 1871, 1873, 1895, 1939, 1983, 2013, 2034, 2048, 2042, 2011, 1974, 1948, 1928, 1893, 1843, 1795, 1767, 1756, 1747, 1731, 1703, 1666, 1626, 1593, 1570, 1557, 1555, 1562, 1573, 1582, 1587, 1593, 1600, 1602, 1596, 1589, 1585, 1586, 1588, 1594, 1602, 1605, 1598, 1584, 1578, 1586, 1604, 1621, 1628, 1626, 1621, 1620, 1624, 1632, 1643, 1651, 1658, 1664, 1672, 1687, 1707, 1727, 1737, 1728, 1703, 1678, 1669, 1672, 1675, 1672, 1669, 1667, 1657, 1629, 1594, 1571, 1565, 1561, 1550, 1536, 1528, 1528, 1528, 1526, 1525, 1522, 1515, 1506, 1502, 1507, 1516, 1522, 1524, 1522, 1524, 1534, 1550, 1557, 1538, 1495, 1452, 1437, 1455, 1489, 1516, 1521, 1508, 1488, 1473, 1465, 1457, 1446, 1434, 1427, 1422, 1413, 1398, 1385, 1382, 1391, 1409, 1431, 1458, 1494, 1539, 1582, 1612, 1619, 1609, 1597, 1593, 1599, 1606, 1609, 1606, 1595, 1574, 1544, 1513, 1492, 1490, 1510, 1539, 1558, 1558, 1547, 1535, 1524, 1512, 1497, 1484, 1475, 1470, 1474, 1492, 1518, 1537, 1544, 1543, 1539, 1522, 1486, 1438, 1398, 1378, 1374, 1379, 1387, 1398, 1414, 1437, 1467, 1494, 1513, 1524, 1528, 1527, 1520, 1512, 1515, 1529, 1547, 1560, 1569, 1576, 1575, 1563, 1544, 1522, 1493, 1457, 1423, 1406, 1402, 1397, 1385, 1382, 1405, 1450, 1497, 1533, 1558, 1572, 1572, 1558, 1538, 1521, 1508, 1492, 1473, 1456, 1443, 1436, 1432, 1429, 1423, 1407, 1389, 1384, 1399, 1421, 1435, 1438, 1438, 1444, 1453, 1462, 1472, 1482, 1487, 1478, 1459, 1439, 1430, 1430, 1428, 1418, 1409]
1676A409QK1J6lj3poj3j4MK6L2K5J4Oqj7j5j4k2k9j8lpk1j3K5N3N0K9J4Kj9l9l9k7j7j2kM
1672A360ok7l0j6nnmNQ%jQJ8J0mj0pJJ0K1L1L4L6L9L4J0j6k8k3j5qknj7k9j8J0L3L6K2Mj2
1666A442k3k1j2lMJ2J7Lk6m6l1kJ3Lj2k2k8k9j7OJ8J5PRJ7K0K2K2J3qk1j2OOpqJ3L3K9J5J0
1661A427J1Ojkjj1k1rJ6L0K3J1NKjKRKk3l7k7j2j4k6k4rkj3k0j0J1K6L4L3J8lj5nRJ2%n%O
1656A402KkNJ3Rkpj%j6l2k9r%oj2%J3Rmj0pj0j6j0PJ6J0JlKPJ1J3Mj5l4m0l5k4j1KMmj2j2
1650A167qokRK1K1J0MJ1K4K4Ok0l7l7k0%J9L4M0K8Lj1kJ6K8K8K9K5Qj7k6rK1L7L3J3pj7j7
1646A423j7k1k3k0j9l2m6m3j8PJ7J4J0J2K6M4M9K8rl7m3l3j7MK5L3J8qk5k6j9j3nkqj8k1j6
1641A171mJ1K9M0L5J8PRJ3OmromokNRJ0J2K0K7K3Oj2k3k1pJ3K7K2Jk6m2m4l2k1j4j1kJ4K4
$$ y = [1409, 1417, 1438, 1454, 1451, 1438, 1431, 1425, 1412, 1398, 1402, 1428, 1460, 1485, 1499, 1505, 1497, 1480, 1465, 1451, 1429, 1400, 1382, 1379, 1372, 1351, 1338, 1363, 1416, 1466, 1495, 1509, 1511, 1492, 1453, 1414, 1387, 1370, 1358, 1356, 1360, 1354, 1327, 1297, 1281, 1276, 1271, 1267, 1272, 1280, 1280, 1279, 1287, 1305, 1315, 1311, 1301, 1294, 1295, 1305, 1326, 1357, 1391, 1427, 1466, 1500, 1510, 1494, 1466, 1443, 1428, 1420, 1418, 1413, 1396, 1367, 1349, 1359, 1392, 1428, 1450, 1454, 1442, 1419, 1398, 1386, 1383, 1387, 1399, 1416, 1419, 1393, 1347, 1316, 1314, 1327, 1330, 1318, 1296, 1268, 1239, 1222, 1228, 1246, 1261, 1268, 1277, 1294, 1314, 1336, 1358, 1371, 1363, 1342, 1330, 1336, 1342, 1335, 1327, 1340, 1373, 1402, 1417, 1427, 1438, 1444, 1443, 1441, 1440, 1429, 1408, 1399, 1415, 1445, 1468, 1479, 1484, 1486, 1485, 1487, 1496, 1498, 1475, 1438, 1411, 1399, 1385, 1359, 1335, 1326, 1324, 1311, 1291, 1281, 1292, 1318, 1352, 1385, 1403, 1400, 1385, 1380, 1389, 1401, 1401, 1396, 1396, 1402, 1404, 1402, 1407, 1420, 1429, 1427, 1420, 1419, 1419, 1403, 1371, 1342, 1333, 1333, 1327, 1315, 1315, 1328, 1337, 1333, 1323, 1316, 1306, 1290, 1280, 1287, 1303, 1313, 1314, 1311, 1313, 1320, 1331, 1344, 1348, 1333, 1299, 1259, 1224, 1200, 1189, 1191, 1195, 1191, 1179, 1167, 1159, 1153, 1151, 1160, 1181, 1202, 1212, 1216, 1227, 1251, 1275, 1281, 1261, 1224, 1187, 1167, 1167, 1186, 1220, 1260, 1288, 1291, 1280, 1278, 1294, 1322, 1350, 1379, 1404, 1412, 1395, 1369, 1360, 1381, 1418, 1451, 1464, 1457, 1440, 1423, 1406, 1385, 1362, 1342, 1323, 1291, 1245, 1202, 1184, 1191, 1208, 1222, 1232, 1244, 1270, 1314, 1363, 1391, 1382, 1345, 1302, 1269, 1252, 1256, 1281, 1314, 1332, 1324, 1299, 1273, 1254, 1241, 1236, 1234, 1226, 1208, 1187, 1171, 1167, 1178, 1207, 1247, 1282, 1300, 1307, 1316, 1329, 1335, 1331, 1322, 1316, 1312, 1306, 1304, 1309, 1318, 1328, 1340, 1360, 1387, 1410, 1416, 1404, 1381, 1360, 1353, 1366, 1393, 1415, 1416, 1390, 1348, 1304, 1272, 1251, 1237, 1226, 1224, 1238, 1262]
1636A262K0Plpj6k5k5j0Knj3pJ3K6K1J1Kpj4j7j1kOJ4K0J8Pkj1k1l0k8k2k1k5j0K1L8K3mj4
1631A161nNOONLQK1L1J8jkJ9L2K3Kj4k1j8nKj1l5m4l5k5k4j1J9L9K7KqlLKKMJnlJlj4j9rR
1625A136K3K9K2Mj3k4k1j3LJ7K4J4%qj5k2k6j9lRJ3J2Nmonmj2j7qRJ9J9K2K4K0J3J5K0Rj6
1620A245l3l5l1l7l9k7nJ3K5K9K4J1jJMKrj7j6oJ1K9L7L4K8J5j2m3n3k8NJ9J4J2J1jk1l1k1
1615A103nLMjj3k3j8LK3K7K2J3Mnrj1j7k2k1rlJJ4L0K7%k7k9j0JjlNJ3Oj0j7j3%PRPRJ5J6
1610A095J2NL%mMK1K6Pk2l4k5j1OK3K8J5mjJ9L0K0Krk2l0k1OK3J4JPK3J5j1k7j6JOok3l2k1
1604A093J1M2M3J5j7l2l6l3j6J7L7L1J2MJ7L2L6K0pl1l2rJ1J2jnlj2l1l9k8j3n%J2J5%k3l4
1600A053k5lJ7K8K4J0mrolmjMQPPJ0Q%mMJ9K4J1oj0MJ8J7Plrj4j3kJ4J2pk2j4KKj4j9ML2L7
$$ y = [1262, 1282, 1289, 1286, 1279, 1263, 1238, 1213, 1203, 1205, 1200, 1187, 1180, 1193, 1219, 1240, 1251, 1253, 1246, 1232, 1215, 1204, 1202, 1208, 1222, 1242, 1260, 1267, 1265, 1254, 1233, 1203, 1175, 1153, 1132, 1107, 1097, 1118, 1156, 1179, 1175, 1161, 1156, 1161, 1167, 1173, 1178, 1181, 1189, 1210, 1241, 1259, 1258, 1256, 1275, 1307, 1330, 1332, 1318, 1297, 1279, 1274, 1276, 1265, 1230, 1186, 1151, 1126, 1102, 1091, 1110, 1149, 1176, 1178, 1170, 1167, 1170, 1172, 1174, 1178, 1179, 1174, 1171, 1172, 1169, 1155, 1136, 1127, 1136, 1159, 1188, 1210, 1214, 1201, 1177, 1156, 1143, 1146, 1163, 1187, 1201, 1201, 1193, 1178, 1156, 1130, 1111, 1108, 1117, 1130, 1142, 1147, 1143, 1137, 1132, 1128, 1116, 1099, 1091, 1100, 1119, 1138, 1160, 1184, 1204, 1217, 1232, 1252, 1261, 1245, 1212, 1177, 1146, 1109, 1070, 1043, 1038, 1051, 1076, 1105, 1129, 1140, 1139, 1140, 1144, 1146, 1137, 1120, 1104, 1098, 1109, 1138, 1175, 1209, 1237, 1252, 1240, 1197, 1144, 1116, 1121, 1140, 1154, 1166, 1177, 1176, 1155, 1124, 1103, 1098, 1101, 1105, 1104, 1091, 1068, 1050, 1053, 1076, 1103, 1125, 1138, 1142, 1137, 1128, 1117, 1100, 1078, 1057, 1048, 1045, 1046, 1060, 1090, 1117, 1117, 1090, 1061, 1051, 1052, 1051, 1048, 1053, 1066, 1072, 1062, 1045, 1032, 1032, 1039, 1048, 1055, 1064, 1079, 1095, 1107, 1112, 1115, 1115, 1111, 1115, 1136, 1162, 1169, 1147, 1113, 1088, 1077, 1083, 1106, 1134, 1149, 1145, 1144, 1163, 1193, 1213, 1215, 1206, 1184, 1154, 1133, 1139, 1162, 1176, 1177, 1184, 1207, 1222, 1211, 1184, 1168, 1169, 1175, 1169, 1146, 1114, 1093, 1104, 1146, 1189, 1204, 1187, 1155, 1119, 1086, 1070, 1087, 1124, 1155, 1167, 1171, 1188, 1220, 1256, 1276, 1269, 1238, 1206, 1197, 1208, 1220, 1219, 1214, 1211, 1199, 1168, 1129, 1101, 1088, 1083, 1083, 1095, 1110, 1110, 1087, 1053, 1028, 1025, 1042, 1070, 1094, 1104, 1100, 1091, 1085, 1082, 1078, 1077, 1081, 1089, 1096, 1103, 1113, 1121, 1121, 1117, 1121, 1140, 1164, 1175, 1169, 1159, 1163, 1181, 1198, 1205, 1202, 1193, 1179, 1166, 1164, 1178, 1190, 1183, 1161, 1147, 1149, 1151, 1137, 1118, 1122, 1154, 1191]
1594A191K5J8K4K6J2qj8j4j1j9l2l8k1RK9K2rl2l2j3RK1J9kk8l5j1K6L8K1Jmok1l4k7JK1K1
1589A119J3Mpj6j4lmk1l6k3JJ6J7K5M5N2L2kk1k1j5j2nPJ2Kj4k2j6qj2k2k6j9qooKJ7K6K1
1584A052J8J9J6lk2j8KJ2lk0j6kjj3j6%J8K6K2J2Jqj2j0j2j9j7nJ2J8J4Lrk1k6j5%PNMRJ1
1579A013RJ1K7M0M2L1J8Qmj2qJ0K4K4Qj1k0j7j2j3k0k4j9j5j4j6rNJ6K0J2nk1k5j6lMRJ9K2
1574A088Qj5k3j2lrj6j0Ljj8k6j7prj0OL1M1K9J2RJ0Jj4k1j2kNJ8L7M7L3Mj7k4k5k4j4LR%
1569A065j2j5pOK6M0L6J1qr%J%QK1J2j4l1k4n%j3l1l4j8NJ6J5J4K1K3J1kKK1K5Kk2k8k1j6
1564A071rNJ9J4kj0KJ6K0J0%kJPJ0J0RNok0k9k4pRJ0kj5j1MK0K1J0kqj0j3j1jJ4K8L3L0K0
1559A216Pnj3j5j0jOM%klrj8j9j7j7k2j6OK4J5j4l4k7jK2L1K0Kj2qOJ4J0PJ2J8J4jj9k9l0
$$ y = [1191, 1216, 1234, 1258, 1284, 1296, 1288, 1270, 1256, 1245, 1226, 1194, 1156, 1135, 1144, 1173, 1195, 1186, 1154, 1122, 1109, 1118, 1139, 1158, 1156, 1128, 1093, 1082, 1108, 1146, 1167, 1168, 1164, 1158, 1137, 1103, 1076, 1077, 1098, 1119, 1132, 1136, 1129, 1113, 1099, 1096, 1092, 1071, 1035, 1012, 1013, 1029, 1046, 1071, 1116, 1168, 1200, 1198, 1177, 1156, 1141, 1129, 1124, 1131, 1143, 1145, 1131, 1109, 1093, 1085, 1073, 1051, 1025, 1006, 998, 992, 986, 988, 1005, 1031, 1052, 1070, 1089, 1105, 1102, 1080, 1062, 1064, 1076, 1073, 1053, 1037, 1035, 1034, 1021, 1005, 1005, 1023, 1049, 1071, 1083, 1084, 1076, 1064, 1054, 1042, 1023, 1006, 1001, 1013, 1031, 1045, 1048, 1039, 1018, 992, 977, 977, 984, 989, 993, 1002, 1013, 1022, 1033, 1060, 1100, 1142, 1173, 1191, 1199, 1195, 1183, 1175, 1185, 1209, 1233, 1241, 1230, 1210, 1193, 1181, 1168, 1148, 1124, 1105, 1090, 1076, 1060, 1051, 1056, 1072, 1092, 1104, 1099, 1078, 1053, 1037, 1034, 1038, 1047, 1066, 1088, 1096, 1081, 1058, 1046, 1043, 1034, 1018, 1008, 1011, 1010, 992, 966, 949, 942, 933, 923, 929, 960, 1001, 1030, 1042, 1051, 1061, 1062, 1048, 1027, 1015, 1013, 1018, 1036, 1073, 1120, 1153, 1157, 1140, 1116, 1091, 1067, 1053, 1056, 1065, 1065, 1053, 1038, 1031, 1037, 1063, 1103, 1139, 1150, 1142, 1133, 1133, 1134, 1134, 1142, 1163, 1175, 1161, 1130, 1106, 1101, 1101, 1088, 1057, 1023, 1005, 1010, 1026, 1041, 1055, 1076, 1099, 1110, 1108, 1110, 1131, 1156, 1158, 1136, 1108, 1087, 1071, 1062, 1067, 1086, 1100, 1098, 1088, 1090, 1106, 1126, 1136, 1136, 1134, 1135, 1142, 1152, 1162, 1171, 1176, 1170, 1150, 1121, 1097, 1090, 1099, 1109, 1107, 1092, 1081, 1085, 1105, 1126, 1136, 1134, 1126, 1116, 1103, 1092, 1091, 1105, 1133, 1166, 1196, 1216, 1223, 1218, 1205, 1190, 1180, 1179, 1185, 1189, 1189, 1187, 1184, 1175, 1157, 1138, 1121, 1104, 1082, 1066, 1072, 1096, 1111, 1097, 1063, 1036, 1035, 1057, 1088, 1108, 1110, 1098, 1090, 1096, 1110, 1120, 1127, 1139, 1157, 1171, 1170, 1151, 1122, 1092]
1554A092k0pkj2k5k2pQJ4J7K2K5K0Ooj2r%J3K1J9Pj0j8j5pMJ5K1J9J2RQjk1l5k8j0PJ9L5M4
1548A190K5pk1KK9L2J0j1j7j7j4j2qmKQRJj1j4j0rj5k2k7k6j8ML1N0M0Ok7l9k8qLLKPJ4K1
1543A124K6K7K2J2%qj8k9l3k8k4k3j8lJ0QjjJ2K4K5J8Nj7l4l1j2M%j1j1lNQJ1Qmj2nQQj3l2
1538I94k8j0RK4M1M9L8J0j1j1lqk4l2k1pooNK7L5J9pk3j8kQPNJ2K2J7pk9k8j4jLJ7L2L1Qj2
1533A105j5j1j7j8%K3J9j4l9k8KK3K4J9J6J1Llpj1j2j0ppqkRJ8J5PLOLrj8j1OJ4Nj3k5k5j5
1528A006omqj0JK2K8J2onPPqj4jJ5K3K1K0J1j2l1k9j1lonJ5L8M6L9K8K4K3J3jpJJ8K5J1j6
1522A271l2k2lMloKJ4Rj3l0k7lJ6J2j3l4l2j4knj0j0prj2q%RJ5J9J4lj9j6KJ2kk8l5j3J5K4
1517A027J5OJ1K2K3J2jmOK2L1K7J1mj1j2j0pjPJ1Pnj6k4k5k4k1j9j1NK2K9K2J2J0Qlk3l3k6
$$ y = [1092, 1072, 1065, 1063, 1051, 1026, 1004, 997, 1005, 1019, 1036, 1058, 1083, 1103, 1109, 1103, 1091, 1082, 1082, 1095, 1116, 1135, 1142, 1132, 1114, 1099, 1092, 1096, 1111, 1132, 1151, 1163, 1172, 1180, 1179, 1158, 1123, 1095, 1085, 1092, 1111, 1146, 1190, 1215, 1208, 1187, 1189, 1218, 1250, 1260, 1249, 1232, 1215, 1201, 1189, 1181, 1177, 1179, 1187, 1196, 1197, 1186, 1172, 1162, 1153, 1138, 1116, 1089, 1063, 1045, 1049, 1080, 1130, 1170, 1176, 1149, 1110, 1082, 1074, 1077, 1080, 1082, 1089, 1103, 1124, 1150, 1177, 1199, 1211, 1211, 1203, 1185, 1156, 1123, 1095, 1071, 1048, 1030, 1027, 1037, 1045, 1044, 1043, 1055, 1079, 1104, 1122, 1127, 1110, 1076, 1045, 1033, 1037, 1037, 1026, 1015, 1012, 1017, 1025, 1036, 1044, 1040, 1028, 1023, 1031, 1039, 1026, 994, 966, 956, 965, 989, 1030, 1079, 1117, 1127, 1116, 1105, 1102, 1094, 1070, 1038, 1017, 1010, 1004, 998, 1003, 1030, 1065, 1084, 1077, 1054, 1036, 1034, 1042, 1049, 1054, 1066, 1088, 1105, 1098, 1069, 1041, 1027, 1026, 1029, 1046, 1078, 1109, 1117, 1105, 1090, 1079, 1062, 1044, 1044, 1067, 1086, 1072, 1033, 1005, 1007, 1030, 1054, 1073, 1089, 1100, 1103, 1100, 1093, 1082, 1070, 1060, 1053, 1046, 1038, 1036, 1045, 1063, 1078, 1085, 1088, 1094, 1097, 1088, 1070, 1059, 1065, 1079, 1084, 1071, 1046, 1021, 1006, 1000, 996, 988, 978, 979, 1001, 1029, 1041, 1035, 1030, 1037, 1044, 1036, 1022, 1021, 1036, 1059, 1080, 1100, 1111, 1099, 1068, 1039, 1028, 1025, 1019, 1014, 1029, 1067, 1113, 1152, 1180, 1204, 1227, 1240, 1239, 1232, 1233, 1251, 1276, 1287, 1271, 1239, 1217, 1214, 1218, 1215, 1209, 1211, 1225, 1234, 1221, 1191, 1164, 1161, 1177, 1189, 1176, 1142, 1110, 1096, 1094, 1089, 1079, 1069, 1062, 1053, 1041, 1033, 1033, 1042, 1057, 1076, 1090, 1087, 1068, 1052, 1054, 1066, 1064, 1036, 1001, 988, 1003, 1027, 1042, 1048, 1059, 1081, 1104, 1116, 1115, 1111, 1117, 1139, 1170, 1197, 1208, 1204, 1193, 1181, 1171, 1164, 1163, 1170, 1181, 1188, 1183, 1167, 1143, 1118, 1094, 1073, 1054, 1043, 1048, 1070, 1099, 1121, 1133, 1143, 1151, 1148, 1125, 1092, 1066]
1512A066j1npj0oKQJ5J9K3K7K8J7kj7j4JJ2Rpk2k3pJ3J4j3l5k6RK9J8j0k4k1j0JJ0J3Kj0j1
1507A045OK5K6Rrj3lOjj7k1j2JNON%j1j3lMmj0KK6L3J5qk4l0l1k2kJ3J6J7K6K8J3rj2J0L6
1502A118M5L8K6J4Kj1k1l2m2m7m3k5JJ9K0J1Jkmpj3j2lJ0K4K6J4OJ3K8K4Kj3nPJj6j8pmj0
1497A115oJ6L0K1JjOQLMJ2J3NjLOJqj3oQK1K5J8Qjrk1l0l0k1j3j3j5j6k3l1l0j6lmqLK1K6
1491A055J5OJ1K0J7Jj1rNJ7J6Mj2k1k3k1j8j6j5j2kJ4K2J6Kn%PJ2J7J5lk9l9k5jK0K8K3Po
1486A082lPNj5k9k4j3j5j8kK0K5J7J8L2L4J4rj3pmmorj3j0%NmpNJ8J7ROQKrrkMOJ4K4K1On
1481A169k%j3l2l6j4J5K5J6nj8k1k1j6lJ2J5jk0j6J0K9K6Oj2j7j0JJ1J4J5J9K5K4J4Koj2k1
1476A152k3j1J2K7K3Mj5k5k1rNJ4J9J7Lk4m7m9k4NJ6QlmJOJ1J6J8J4J3J9K2K0J2%j5l3m1k7
$$ y = [1066, 1055, 1050, 1043, 1033, 1027, 1029, 1037, 1052, 1071, 1094, 1121, 1149, 1166, 1164, 1147, 1133, 1134, 1146, 1155, 1148, 1126, 1103, 1096, 1109, 1123, 1110, 1075, 1049, 1058, 1087, 1105, 1095, 1071, 1050, 1040, 1041, 1051, 1064, 1066, 1056, 1045, 1051, 1076, 1102, 1111, 1102, 1089, 1086, 1092, 1091, 1074, 1053, 1041, 1042, 1047, 1053, 1058, 1058, 1047, 1034, 1031, 1035, 1031, 1021, 1023, 1049, 1082, 1097, 1089, 1065, 1035, 1004, 982, 980, 993, 1009, 1026, 1052, 1080, 1093, 1084, 1072, 1082, 1118, 1163, 1201, 1227, 1241, 1243, 1232, 1211, 1179, 1137, 1090, 1047, 1022, 1023, 1042, 1062, 1073, 1074, 1072, 1068, 1061, 1048, 1036, 1033, 1043, 1067, 1093, 1107, 1113, 1126, 1154, 1178, 1180, 1167, 1162, 1169, 1170, 1154, 1136, 1129, 1125, 1115, 1109, 1125, 1155, 1176, 1177, 1176, 1182, 1190, 1193, 1197, 1209, 1222, 1227, 1226, 1229, 1235, 1236, 1228, 1215, 1209, 1217, 1238, 1263, 1281, 1289, 1288, 1279, 1258, 1228, 1198, 1177, 1164, 1151, 1136, 1120, 1097, 1066, 1036, 1020, 1017, 1013, 1005, 1008, 1029, 1055, 1070, 1076, 1087, 1107, 1124, 1125, 1114, 1105, 1110, 1127, 1143, 1147, 1135, 1114, 1091, 1070, 1052, 1036, 1021, 1009, 1007, 1021, 1043, 1059, 1061, 1056, 1056, 1063, 1075, 1092, 1107, 1104, 1075, 1036, 1011, 1010, 1030, 1058, 1081, 1088, 1082, 1079, 1086, 1091, 1076, 1047, 1023, 1010, 995, 977, 975, 995, 1020, 1037, 1055, 1087, 1121, 1135, 1126, 1113, 1106, 1102, 1098, 1092, 1083, 1070, 1060, 1060, 1065, 1061, 1054, 1059, 1077, 1094, 1103, 1109, 1117, 1119, 1110, 1101, 1099, 1103, 1109, 1123, 1147, 1168, 1174, 1169, 1167, 1167, 1154, 1122, 1086, 1072, 1087, 1112, 1128, 1123, 1105, 1084, 1063, 1047, 1044, 1056, 1071, 1070, 1050, 1034, 1044, 1073, 1099, 1105, 1093, 1076, 1066, 1067, 1078, 1092, 1107, 1126, 1151, 1175, 1189, 1191, 1185, 1173, 1152, 1129, 1118, 1130, 1157, 1180, 1184, 1169, 1144, 1123, 1114, 1119, 1133, 1152, 1169, 1172, 1148, 1101, 1052, 1028, 1033, 1049, 1057, 1054, 1050, 1051, 1057, 1068, 1084, 1102, 1116, 1129, 1148, 1170, 1190, 1202, 1202, 1187, 1154, 1113, 1086]
1471A086onk6m3l8j2RK0K1J8J3J1J4J2lj9j5J0L1L1J3lmNJ6J7Lj5k4j3J0L0L6K1JrMK7L6K2
1466A282mk1j4RK7K1ok2j0K0L9L5J5rk9l3j5J4K2Kk0k1lJ1J7K0K4K2J4Kj0k2l0l1k9k8k5j5
1461A199pnpmMJ0J1J1J6K2K6J6rl8m9l5j7j2j3rjpj8j5PK6K8J9J5J5J3J0J2J3Jj9l4l2j6l
1456A124kj6l0k5oJ1J6J3J3J3J1PJ0J5Qj1l5n0m3j8J4L5L2J9J0J6J9Pk2m4m1k2omponj0j2
1452I78kJ7K8K2J5J7K3K3J7J5J3%k0l6l7k7j3jJ5K8L3K5Oj1j9j4%RQpk3k9k1kK1M2N3M0J1
1447A197j4j4KMj4l5l5j9onj0j4j9k2j5KJ8K1J5Plj1j7j4kQQQJ6K9L2K3J3NLok0l0l2j7OK5
1442A068K3Qlljoj2j0%J0J9K6J6j1k6j1K1L2J5kjMj0k5k6j2nnkMOKMJ2K2K8L4L5L2K6K0J1
1437A307LKJ5K4J4pj8jL2N7N9L7J6J9M9P8Q1P0O7P9R2R9R8R5Q5P8Q1R4R8J01J18J50J82J91
$$ y = [1086, 1080, 1075, 1049, 1006, 968, 956, 965, 985, 1006, 1024, 1037, 1048, 1062, 1074, 1071, 1052, 1037, 1047, 1078, 1109, 1122, 1119, 1115, 1120, 1136, 1153, 1156, 1141, 1117, 1104, 1114, 1144, 1180, 1201, 1202, 1193, 1197, 1224, 1260, 1282, 1278, 1257, 1243, 1252, 1279, 1300, 1294, 1272, 1262, 1282, 1321, 1356, 1371, 1362, 1333, 1300, 1285, 1299, 1321, 1323, 1303, 1282, 1279, 1290, 1307, 1327, 1351, 1373, 1387, 1389, 1379, 1357, 1327, 1296, 1267, 1239, 1214, 1199, 1192, 1187, 1180, 1176, 1180, 1190, 1201, 1212, 1228, 1250, 1276, 1292, 1283, 1245, 1196, 1161, 1144, 1132, 1119, 1110, 1109, 1102, 1084, 1069, 1076, 1102, 1130, 1149, 1164, 1179, 1192, 1202, 1214, 1227, 1228, 1209, 1175, 1143, 1127, 1124, 1122, 1106, 1076, 1051, 1045, 1056, 1072, 1085, 1098, 1111, 1122, 1129, 1139, 1154, 1162, 1151, 1116, 1066, 1023, 1005, 1019, 1054, 1086, 1105, 1115, 1131, 1150, 1157, 1135, 1091, 1050, 1028, 1022, 1018, 1011, 1005, 1000, 990, 978, 976, 993, 1021, 1043, 1058, 1075, 1098, 1121, 1138, 1153, 1166, 1166, 1146, 1110, 1073, 1046, 1033, 1032, 1047, 1075, 1108, 1133, 1139, 1128, 1109, 1095, 1095, 1104, 1112, 1105, 1082, 1053, 1032, 1030, 1051, 1093, 1146, 1186, 1197, 1183, 1169, 1171, 1175, 1161, 1126, 1091, 1072, 1066, 1061, 1051, 1037, 1018, 996, 981, 983, 1001, 1022, 1037, 1044, 1041, 1030, 1013, 999, 997, 1005, 1013, 1021, 1037, 1066, 1098, 1121, 1134, 1139, 1142, 1136, 1116, 1086, 1054, 1037, 1043, 1068, 1091, 1099, 1096, 1093, 1092, 1086, 1074, 1064, 1064, 1074, 1093, 1119, 1135, 1124, 1098, 1087, 1108, 1140, 1155, 1153, 1152, 1156, 1146, 1121, 1095, 1083, 1078, 1073, 1071, 1075, 1081, 1083, 1087, 1099, 1121, 1149, 1183, 1218, 1250, 1276, 1296, 1307, 1310, 1312, 1327, 1351, 1365, 1358, 1340, 1339, 1371, 1428, 1487, 1524, 1540, 1559, 1608, 1686, 1767, 1837, 1904, 1983, 2075, 2174, 2272, 2367, 2452, 2530, 2611, 2705, 2803, 2904, 3022, 3172, 3354, 3545]
1433C545J89J94K18K53K81K89K81K79K98L34L71M09M59N29O18P20Q42R83J140J306J490J696
1430A6724J927K175K423K624K716K652K403J962J349O58L9l73n18m25j87O0J70M5l38r17j590
1427C3579k223k679k865k789k532k193j847j542j293j092r18p69o62n96n46m91m31l78l39
1425G394l08k78k54k39k32k21k07j99k01k05j94j71j56j53j47j30j20j27j32j14q8p8q9r5
1422C256q6p1o3o0n7n6n5m2k2j4k9n1o2n5m4l4k6k3k3k4k3j9j5qnqj6j2RK7K3MpjJ0J9L1M5
1417B413N1M5L5L8N9Q6J17J52J82J92J80J77K03K52K81K65K12J49Q0kr4j78k48l01l29l15
1414C702k70k27k03j84j55j15q1n5l9m1o1p6o5l9k5l6n0m9m1l9m4m0k3qjoj5k1j8qmj0k0j8
1410A615rj1k8m2l4j5kKOJ4J5jj7k1j6j3j7k1k1j6rKJ8K9K2ll1m2l5k0oJ1K9L8K7Mj0plj7
$$ y = [3545, 3734, 3928, 4146, 4399, 4680, 4969, 5250, 5529, 5827, 6161, 6532, 6941, 7400, 7929, 8547, 9267, 10109, 11092, 12232, 13538, 15028, 16724, 18651, 20826, 23249, 25873, 28589, 31241, 33644, 35606, 36955, 37613, 37652, 37279, 36761, 36336, 36149, 36209, 36379, 36424, 36086, 35169, 33579, 31356, 28677, 25812, 23023, 20491, 18298, 16451, 14909, 13616, 12524, 11606, 10837, 10175, 9579, 9033, 8542, 8111, 7733, 7394, 7086, 6808, 6554, 6315, 6083, 5862, 5655, 5456, 5255, 5050, 4856, 4685, 4529, 4376, 4229, 4099, 3979, 3852, 3720, 3606, 3518, 3440, 3351, 3256, 3170, 3099, 3036, 2976, 2919, 2863, 2808, 2766, 2744, 2730, 2701, 2650, 2588, 2533, 2489, 2455, 2429, 2406, 2383, 2359, 2336, 2317, 2302, 2294, 2289, 2281, 2265, 2253, 2262, 2289, 2312, 2316, 2309, 2308, 2318, 2337, 2368, 2413, 2464, 2509, 2544, 2582, 2641, 2727, 2844, 2996, 3178, 3370, 3550, 3727, 3930, 4182, 4463, 4728, 4940, 5089, 5169, 5167, 5073, 4895, 4647, 4346, 4017, 3702, 3432, 3205, 3002, 2818, 2663, 2548, 2467, 2412, 2373, 2332, 2271, 2195, 2130, 2091, 2066, 2030, 1980, 1931, 1890, 1851, 1807, 1767, 1744, 1736, 1735, 1729, 1714, 1693, 1675, 1667, 1663, 1653, 1633, 1615, 1606, 1595, 1567, 1525, 1491, 1476, 1474, 1476, 1482, 1496, 1511, 1510, 1493, 1472, 1456, 1443, 1426, 1405, 1384, 1368, 1359, 1361, 1379, 1408, 1430, 1427, 1396, 1354, 1319, 1299, 1293, 1304, 1333, 1371, 1398, 1402, 1392, 1385, 1382, 1365]
1405A365l6m6m0k7j3OK5K6Qj6k7k5j8pjkj2j5mJ5K8K6J5PNRJ6K1K3J7Jj6k3qJ6K9K2Lj4k6
1400A307k7j6mkolJ1J4mk6l1j9kJ3K8L5K5Oj0j5j0KJ2Rj0k4j8kLljLol3n3m6j9PK4K6J2qj9
1395A120j4pnqokJJNRJ1J6K3K6J9RJ3K3L0K9K2J1kj1rknj7k6k9l0l2k7j2JQJ3K0J6lk3k6j0
1390A120PJ1J0J4J8Rj6l3k4JJ7J4JokJ%%PJ9K6K1Ppj4j4mJ5L3L3Pk4k9oJ7J7NQK5L3K2Kj1
1384A330r%ROj8m6n7l9jL2M6M4L2J6Jj0j3pjmj0j3j1j9l5m4l3nJ1J0Jpj4j8j0NJ4J0MJmj9
1379A125l1l0j7rmKJ0J2J2J9K8K3Jk0k3j1MJ3J7J3MKJ7L5L8K2PKjj7l4l5k2rjJ5M0M8K5j2
1374A258l4l3k6j9j1kMOPKj0k1j5jK%NK2L1K0OJKMPJ6K1J2%ork0k8k1j5k3m1m2k3rj0j2lL
1369I95lj3rJ1L3M2K9Kj5lK5L9K3jj0lOJ1J3J2PKMJrj5oJ0K1K8L0K2jk2k5j3ooJJ9K8J4nr
$$ y = [1365, 1329, 1283, 1243, 1216, 1203, 1209, 1234, 1260, 1268, 1252, 1225, 1200, 1182, 1175, 1174, 1172, 1160, 1145, 1141, 1156, 1184, 1210, 1225, 1232, 1237, 1246, 1262, 1283, 1306, 1323, 1324, 1308, 1285, 1277, 1293, 1322, 1344, 1347, 1333, 1307, 1280, 1264, 1260, 1258, 1252, 1249, 1260, 1274, 1270, 1244, 1213, 1194, 1192, 1205, 1233, 1268, 1293, 1299, 1289, 1274, 1264, 1266, 1278, 1287, 1277, 1253, 1235, 1233, 1236, 1233, 1232, 1235, 1229, 1196, 1143, 1097, 1078, 1085, 1109, 1135, 1147, 1139, 1120, 1106, 1099, 1094, 1086, 1080, 1078, 1079, 1080, 1085, 1094, 1105, 1121, 1144, 1170, 1189, 1198, 1211, 1234, 1264, 1293, 1315, 1326, 1324, 1313, 1304, 1302, 1297, 1280, 1254, 1225, 1195, 1163, 1136, 1124, 1125, 1133, 1146, 1166, 1182, 1179, 1156, 1130, 1120, 1127, 1138, 1148, 1162, 1180, 1189, 1173, 1140, 1116, 1117, 1134, 1148, 1149, 1143, 1141, 1142, 1142, 1142, 1149, 1168, 1194, 1215, 1222, 1215, 1201, 1187, 1183, 1198, 1231, 1264, 1271, 1247, 1218, 1212, 1229, 1246, 1251, 1259, 1284, 1317, 1339, 1341, 1330, 1321, 1321, 1330, 1336, 1318, 1272, 1215, 1176, 1175, 1207, 1253, 1297, 1329, 1345, 1346, 1336, 1323, 1316, 1315, 1311, 1301, 1288, 1277, 1258, 1223, 1179, 1146, 1141, 1152, 1162, 1163, 1156, 1142, 1124, 1114, 1119, 1133, 1143, 1147, 1148, 1144, 1125, 1094, 1064, 1047, 1038, 1034, 1036, 1046, 1058, 1070, 1089, 1117, 1140, 1141, 1121, 1098, 1087, 1091, 1104, 1121, 1134, 1138, 1140, 1157, 1192, 1230, 1252, 1259, 1261, 1260, 1243, 1209, 1174, 1152, 1143, 1142, 1157, 1197, 1245, 1270, 1258, 1224, 1191, 1165, 1146, 1135, 1133, 1137, 1143, 1150, 1152, 1142, 1121, 1106, 1105, 1107, 1107, 1112, 1134, 1165, 1185, 1191, 1192, 1194, 1198, 1205, 1221, 1242, 1254, 1254, 1248, 1239, 1219, 1191, 1170, 1155, 1132, 1091, 1049, 1026, 1017, 1007, 995, 992, 995, 992, 979, 970, 981, 1014, 1056, 1085, 1087, 1072, 1069, 1094, 1133, 1156, 1155, 1145, 1142, 1148, 1159, 1172, 1184, 1191, 1193, 1197, 1198, 1189, 1174, 1168, 1178, 1199, 1227, 1257, 1279, 1278, 1256, 1231, 1218, 1212, 1206, 1207, 1226, 1254, 1268, 1263, 1254]
1364A254MJ9K3J3krKJ2Oj8l7m3l7k8qK2M5L8J6jmjMJ8K9K3ol7m7l7k1pLJ5K0J2qk7k9qJ8L0
1359A211K3J0kj1j6j5j1rj0j4j1KJ9L1K6Qj1k2k6l2l2k1nKoj1kRJ2PMJj2k7l4k8j3jPJ4J8
1354A022K0K3K5K7K1NplJ9L6K8om1n5m2k1olKJ1K3K4J6Nkqj0jJ4K5J5joPJ9J9J2Kj1l1l7j8
1348A111J5L2K5Pqj3qLJ0Lj1j7j0KRQOQJ2J4J2Mj1k6l6l8k5JL1N1N2L8J9LjJmj9l1k3lQlk2
1343A176l1k6j4p%Kjpp%QJ3J1RJ3K4K9J6oj3MK1K0NlKQNnj0rnJLLLNONRJ7J6Jk0k8k1j4j0
1337A198%J6K6K7L1L4K5kk0j0J9L7L7L7M4M7L0Lj6j7kJ5K3J8PkKJ1J9K7K9K3J6QKpj8k0rM
1332A692Nkj1j8l0m1l8k1qj0k0k0rkllNJ4J3Kj7l6m4l7j7kLoj6k5k8k4j0JPJ4K8L8K8kk7l6
1327A287k7j4kPJ0N%NJ0Nj5l5l5j8jjj3k0j1JQMlpj4k3k7k4j2LJ5K3K4J7J3J3J3Kj1j7j4o
$$ y = [1254, 1258, 1277, 1300, 1313, 1311, 1302, 1304, 1316, 1322, 1304, 1267, 1224, 1187, 1159, 1151, 1173, 1218, 1256, 1272, 1271, 1267, 1266, 1270, 1288, 1317, 1340, 1334, 1297, 1250, 1213, 1192, 1185, 1188, 1203, 1223, 1235, 1227, 1200, 1171, 1163, 1181, 1211, 1234, 1244, 1242, 1231, 1215, 1200, 1189, 1180, 1170, 1156, 1145, 1147, 1166, 1197, 1223, 1231, 1220, 1198, 1172, 1140, 1108, 1087, 1082, 1084, 1078, 1067, 1065, 1074, 1086, 1093, 1097, 1098, 1086, 1059, 1025, 997, 984, 983, 990, 1004, 1022, 1042, 1065, 1090, 1117, 1138, 1143, 1136, 1133, 1152, 1188, 1216, 1210, 1169, 1114, 1072, 1051, 1045, 1042, 1044, 1055, 1078, 1102, 1118, 1123, 1121, 1113, 1103, 1102, 1116, 1141, 1156, 1155, 1149, 1156, 1175, 1194, 1206, 1208, 1197, 1166, 1129, 1111, 1126, 1158, 1183, 1190, 1182, 1169, 1161, 1164, 1174, 1177, 1166, 1149, 1139, 1141, 1150, 1158, 1164, 1172, 1184, 1198, 1210, 1214, 1203, 1177, 1141, 1103, 1078, 1079, 1110, 1161, 1213, 1251, 1270, 1273, 1272, 1273, 1269, 1250, 1219, 1196, 1193, 1201, 1198, 1176, 1145, 1119, 1105, 1098, 1098, 1100, 1099, 1092, 1085, 1085, 1093, 1106, 1117, 1126, 1139, 1163, 1192, 1208, 1202, 1189, 1193, 1214, 1234, 1239, 1236, 1238, 1246, 1251, 1246, 1236, 1227, 1222, 1223, 1226, 1229, 1232, 1237, 1243, 1248, 1257, 1274, 1290, 1291, 1271, 1243, 1222, 1208, 1198, 1198, 1214, 1240, 1267, 1298, 1332, 1357, 1355, 1335, 1325, 1344, 1381, 1418, 1455, 1499, 1546, 1576, 1579, 1563, 1546, 1544, 1559, 1582, 1600, 1607, 1605, 1607, 1618, 1637, 1664, 1693, 1716, 1732, 1740, 1742, 1735, 1717, 1697, 1688, 1692, 1697, 1695, 1684, 1666, 1636, 1595, 1557, 1536, 1528, 1518, 1498, 1478, 1469, 1467, 1464, 1461, 1466, 1480, 1493, 1495, 1478, 1442, 1398, 1361, 1344, 1342, 1345, 1339, 1323, 1298, 1270, 1246, 1236, 1237, 1244, 1258, 1286, 1324, 1352, 1350, 1323, 1287, 1260, 1246, 1244, 1251, 1261, 1266, 1266, 1271, 1281, 1286, 1271, 1236, 1201, 1183, 1182, 1181, 1168, 1148, 1137, 1138, 1146, 1150, 1147, 1140, 1126, 1103, 1076, 1052, 1040, 1043, 1058, 1081, 1105, 1122, 1135, 1148, 1161, 1163, 1152, 1135, 1121, 1115]
1322A115jklmNK0K3Rqj3oqk2k6j0Onk6k6OL7L9J7kmjok2l5l0j1J0J3MMK0M2M8L9K5J0nj7k1
1317A178k0k3l2l9l3j3PK1J9PllMNloMJ5J3MOK2L4L1J6Lqk0l4l9l3k3j9j8j5pMJ1Q%pj0nN
1311A004J8L0L3K3Pqj8k6k8k3j1KJ1J6J3KqnJ4K6J8kj5j2kPJ4J6J0jnJQPRJ6K4J8kj7j3NJ0
1306A166ql6m2k0J5L2K0%j0oOJ4J3kk3l2k4rokRJ9Nk6m1k7qpnJ3L3K9kk8k8pJ6L3K9Rj1j0
1301A041PJ2jj0KJ7J6kj6j8j4%J9L1K2rl2k9nR%j9k4pJ1J2KKJ2J6Kj3j2LJ8K4J7Lj4j8rlj0
1296A033j7qJ0K2K2J6RJ%J1K8L5K8J8Oj4l7m1j7J9L5K3mk1k8k6k5k4j7nNOLMOLkJJ2J7J0j
1290A096mkKJ2K1J9Jj4j6j3k0k8k2njj1j2J0L9M4J5k6m7m2k2JJ9K3J4JlRK9L1J6kj0rnkQJ7
1285A111J3ok4k9j8mkj1j7oK2M3L6J1j4k5k3j5kPNnj2qMJ3J8K1J6%j9k2kK0K7J6NPJ6J9Rn
$$ y = [1115, 1114, 1112, 1109, 1105, 1110, 1130, 1153, 1162, 1154, 1141, 1135, 1127, 1105, 1079, 1069, 1075, 1070, 1044, 1018, 1024, 1061, 1100, 1117, 1115, 1111, 1110, 1104, 1082, 1047, 1017, 1006, 1016, 1029, 1033, 1037, 1057, 1099, 1147, 1186, 1211, 1221, 1216, 1199, 1178, 1158, 1135, 1103, 1064, 1031, 1018, 1025, 1046, 1065, 1072, 1069, 1066, 1070, 1075, 1072, 1066, 1070, 1085, 1098, 1102, 1108, 1130, 1164, 1195, 1211, 1214, 1206, 1186, 1152, 1113, 1080, 1057, 1038, 1020, 1005, 998, 1002, 1013, 1021, 1021, 1014, 1004, 999, 1004, 1022, 1052, 1085, 1108, 1115, 1107, 1089, 1063, 1035, 1012, 1001, 1003, 1014, 1030, 1043, 1045, 1037, 1032, 1046, 1072, 1090, 1088, 1073, 1061, 1059, 1066, 1080, 1096, 1106, 1105, 1100, 1101, 1109, 1116, 1125, 1141, 1165, 1183, 1181, 1164, 1151, 1156, 1166, 1158, 1122, 1080, 1060, 1075, 1107, 1127, 1127, 1117, 1111, 1117, 1131, 1144, 1142, 1119, 1087, 1063, 1054, 1048, 1046, 1055, 1074, 1079, 1053, 1012, 985, 977, 970, 965, 978, 1011, 1040, 1038, 1010, 982, 975, 991, 1024, 1053, 1062, 1051, 1041, 1048, 1060, 1059, 1049, 1051, 1068, 1084, 1082, 1066, 1048, 1034, 1034, 1053, 1084, 1106, 1097, 1065, 1036, 1031, 1040, 1040, 1021, 997, 990, 1001, 1013, 1015, 1017, 1029, 1045, 1047, 1034, 1022, 1025, 1043, 1067, 1084, 1087, 1073, 1055, 1046, 1043, 1033, 1016, 1008, 1018, 1040, 1062, 1078, 1087, 1088, 1088, 1099, 1127, 1162, 1190, 1208, 1214, 1200, 1163, 1122, 1105, 1124, 1159, 1182, 1178, 1157, 1129, 1103, 1078, 1054, 1037, 1032, 1037, 1043, 1046, 1050, 1056, 1059, 1057, 1058, 1070, 1087, 1097, 1096, 1092, 1090, 1092, 1104, 1125, 1144, 1145, 1131, 1115, 1102, 1082, 1054, 1032, 1027, 1026, 1015, 1003, 1013, 1052, 1096, 1111, 1085, 1038, 996, 974, 975, 994, 1017, 1031, 1032, 1029, 1038, 1067, 1098, 1114, 1112, 1102, 1093, 1088, 1086, 1094, 1111, 1124, 1118, 1094, 1065, 1047, 1043, 1041, 1030, 1013, 1007, 1029, 1072, 1108, 1119, 1105, 1080, 1057, 1042, 1040, 1047, 1052, 1047, 1035, 1027, 1031, 1044, 1062, 1083, 1099, 1099, 1080, 1058, 1056, 1076, 1103, 1119, 1124, 1131, 1147, 1166, 1175, 1170]
1280A170j9k9k9j5LJ1Jj7k3j4JJ3J4Lj0qJ0L4M1L2J7Jj0j4nOJ0QJ2J6Oj5k6qJ6J7nj9j6nn
1275A150j2j2j0j4k0j4OJ9J3mpMJ3Opj0kN%j0j1KK0L0K4QmpjMQJ4J6J3ROKnj9l1l7l6k5j2
1270A062nqj4j3j0j1j9j4OK9L6K7J8J7K5K9J9mk7l5k4pMQOmj8k8k7j9rJJ3K2K4K7L5L9K3m
1265A170j9j5j0k4m0l7qJ7J4j0k4j5NK0K8L1L0J8nk3k5j0PJ4J2PMlj2j1LJ8J7KlPJ2LoPL2
1260A178L6J5nn%pj9k2j6j3j4qQK6L5L2K1Orj5j1%Pkk9n2n0k6qqj1oKMQK1L5L4J9Krj3oJ1
1255A136K3J9MmllkJ3L0K4rm1m3k3lMKlpp%NNLLKqk0k3j3KJ6K0J6Nlm%kj0j7j7j2j2j6j6p
1249A004Ljj3j7mRLj1qJ5L3K9J5Llj4k2j5LJ5J5OjPK6M3L4Nk3k7j5JJ0J7J4POJ1Nk0m4l9j1
1244A051QMKJ5K7J9jj4j1mloqrrrnLOmj8j7kJ4J2MJQJ0J2J6J8Nj4j9j0j5l8n3l6lJ6J5J3J5
$$ y = [1170, 1151, 1122, 1093, 1078, 1081, 1092, 1093, 1076, 1053, 1039, 1040, 1053, 1067, 1070, 1060, 1052, 1062, 1096, 1137, 1169, 1186, 1187, 1177, 1163, 1158, 1164, 1174, 1182, 1194, 1210, 1216, 1201, 1175, 1167, 1183, 1200, 1195, 1176, 1160, 1155, 1150, 1138, 1126, 1116, 1102, 1082, 1068, 1074, 1093, 1106, 1102, 1095, 1099, 1112, 1118, 1111, 1101, 1099, 1104, 1104, 1094, 1083, 1085, 1105, 1135, 1159, 1167, 1163, 1156, 1155, 1159, 1167, 1181, 1197, 1210, 1219, 1225, 1227, 1222, 1203, 1172, 1135, 1099, 1074, 1062, 1057, 1049, 1035, 1022, 1012, 1001, 982, 968, 974, 1003, 1039, 1066, 1084, 1101, 1126, 1155, 1174, 1170, 1143, 1108, 1084, 1077, 1081, 1089, 1095, 1091, 1073, 1045, 1018, 999, 990, 991, 1004, 1026, 1050, 1077, 1112, 1151, 1174, 1170, 1151, 1136, 1126, 1102, 1062, 1025, 1017, 1034, 1048, 1038, 1014, 999, 1004, 1024, 1052, 1083, 1113, 1131, 1126, 1103, 1078, 1068, 1075, 1089, 1101, 1108, 1112, 1109, 1097, 1086, 1089, 1107, 1124, 1126, 1123, 1130, 1142, 1145, 1139, 1146, 1178, 1214, 1229, 1224, 1219, 1219, 1212, 1193, 1171, 1155, 1142, 1128, 1120, 1128, 1154, 1189, 1221, 1242, 1248, 1239, 1224, 1213, 1213, 1220, 1218, 1189, 1137, 1087, 1061, 1053, 1045, 1034, 1028, 1030, 1034, 1042, 1063, 1098, 1132, 1151, 1153, 1144, 1131, 1125, 1136, 1159, 1178, 1182, 1178, 1175, 1172, 1170, 1183, 1213, 1237, 1228, 1187, 1144, 1121, 1118, 1122, 1124, 1121, 1114, 1107, 1107, 1112, 1117, 1120, 1123, 1125, 1117, 1097, 1074, 1061, 1063, 1079, 1099, 1115, 1120, 1117, 1113, 1113, 1111, 1101, 1084, 1067, 1055, 1043, 1027, 1011, 1004, 1007, 1006, 993, 976, 972, 981, 984, 973, 965, 980, 1013, 1042, 1057, 1060, 1057, 1043, 1021, 1006, 1009, 1024, 1039, 1045, 1044, 1051, 1077, 1120, 1154, 1159, 1136, 1109, 1094, 1095, 1105, 1122, 1136, 1143, 1149, 1160, 1165, 1145, 1101, 1062, 1051, 1059, 1063, 1065, 1080, 1107, 1126, 1125, 1111, 1100, 1096, 1093, 1087, 1079, 1070, 1061, 1052, 1047, 1050, 1056, 1052, 1034, 1017, 1015, 1029, 1041, 1045, 1046, 1054, 1064, 1076, 1092, 1110, 1115, 1101, 1082, 1072, 1057, 1019, 966, 930, 927, 943, 958, 971, 986]
1238I86J4Jj2qQK1K1Nj3k1j6oJPJ6J7PpnJ2J8ll4m7l6j3PJ7J2lj9k0p%qj9j5LK0K2J8K0K6
1233I67K9K5J7J0RJ5J7Nj7k6qK1L6K5RML%qj5j8j9j8j1prp%RJ2J4K0L0K7Mk2l4k8j1OJ5J4
1228A085J0RJ3J1nk5l4k3pmj5k5k0KJ9J4rk7k3jJ5J3kj1mJ1K1J9J6K0L0L5K6J2Jllrj6j3n
1223A098JjnKK1L6L6K5J6J5K0K7K9L1L3L5K2j1n4p6n9k3KPLkrk2l0k4qQJ6J9K1K3K3J5mk7
1218A229l9l0j1lj3k4k3j2lkkjJOK0L1K8Pj1j1l%knqrrlKNMQJ0Jj9l0k6rjoj6k0rQK2K6K0
1212A068J5J3J0%j5l1m4m4k7mQJ0J2K2K3Qj3k0j1LJ1J6K0K3K2J4kk4m0l9k6j0%%%mj0j8k3
1207H93j7plrj5pJ0K0K2K8M4N6M9L0J2%j2j9j7j3j7k2j3J5L9L8J2j3j9qmj6l0k6jK3K9K6K3
1202A081J5lk1k1j0%KNOqk8l2j0J4K1RjpnPJ7J0j2k3mK9M2L1J5Jj6m0m8l6j0J5L4M5L9J2j8
$$ y = [986, 1000, 1001, 989, 981, 989, 1010, 1031, 1036, 1023, 1002, 986, 980, 981, 988, 1004, 1021, 1028, 1021, 1016, 1028, 1046, 1043, 1009, 962, 926, 913, 920, 937, 949, 946, 927, 907, 900, 900, 892, 873, 858, 861, 881, 903, 921, 941, 967, 996, 1021, 1038, 1048, 1057, 1072, 1089, 1094, 1077, 1051, 1043, 1064, 1100, 1125, 1134, 1138, 1141, 1141, 1133, 1118, 1100, 1081, 1063, 1052, 1045, 1036, 1029, 1029, 1038, 1050, 1064, 1084, 1114, 1141, 1145, 1123, 1089, 1061, 1050, 1056, 1071, 1085, 1095, 1104, 1117, 1128, 1123, 1098, 1064, 1041, 1034, 1030, 1015, 990, 970, 972, 991, 1005, 996, 969, 946, 945, 960, 973, 971, 960, 956, 967, 988, 1007, 1023, 1043, 1073, 1108, 1134, 1146, 1147, 1144, 1141, 1132, 1116, 1103, 1098, 1099, 1098, 1093, 1095, 1116, 1152, 1188, 1213, 1229, 1244, 1264, 1291, 1320, 1351, 1384, 1419, 1441, 1430, 1376, 1300, 1241, 1218, 1220, 1227, 1230, 1228, 1219, 1197, 1167, 1143, 1135, 1143, 1159, 1178, 1199, 1222, 1245, 1260, 1256, 1229, 1190, 1160, 1149, 1146, 1133, 1109, 1086, 1074, 1071, 1069, 1067, 1066, 1067, 1073, 1093, 1124, 1152, 1159, 1148, 1137, 1134, 1134, 1132, 1127, 1119, 1110, 1101, 1098, 1100, 1105, 1109, 1117, 1127, 1128, 1109, 1079, 1053, 1044, 1043, 1037, 1021, 1001, 992, 1000, 1022, 1048, 1068, 1083, 1096, 1106, 1106, 1091, 1060, 1016, 972, 945, 941, 949, 959, 971, 993, 1016, 1024, 1011, 991, 980, 983, 994, 1010, 1030, 1053, 1075, 1089, 1087, 1063, 1023, 984, 958, 948, 948, 948, 948, 944, 934, 916, 893, 876, 869, 866, 857, 842, 835, 845, 865, 887, 915, 959, 1015, 1064, 1094, 1106, 1106, 1094, 1075, 1058, 1045, 1028, 1006, 993, 1008, 1047, 1085, 1097, 1084, 1065, 1057, 1053, 1037, 1007, 981, 980, 1003, 1032, 1058, 1081, 1096, 1093, 1072, 1051, 1041, 1041, 1043, 1048, 1054, 1046, 1018, 986, 976, 990, 1011, 1020, 1019, 1012, 1007, 1014, 1031, 1041, 1029, 1006, 1002, 1031, 1073, 1104, 1119, 1120, 1104, 1064, 1016, 980, 970, 985, 1019, 1064, 1103, 1115, 1097]
1197A097l2k6oJ3K1K2J6Qjqj4j9k3k5j8nJ2K3K9K6J1j4l4m3m4l5j2J8L5K9J2KMNlrq%J6K8
1193A048K9Qj7k3j0OJ1RNkoMK6L5K0rk6k0qkk%joj3j0LJ2Qnj0nKLmj1j5k0k1j9j6k0k0oJ6
1187I18L2L1K7K3K1J5RQJ4K1K2J3pk8l3k1jPKj1k9l9k9JL1L1J0p%K4L8K7Lj3nQRpk1k7l1m3
1182I93m2j4K3L7J9rk2j6LK2L5K8Oj6k3j4lNRROOPJ0QMMJ4K4K0Mj7k9l0k6k0qOJ5J7K0K1J7
1177A103Jj1oJ3K7K5J2jj0j7j7j8j5lJ7L0K4Mj4j5j3j5j9j7k1k9l2j4J7L6L3K0J1Kj1k1j6
1172A040LJ6RmrjRJ4J8J8Pj0k0pJ3J6KnMRjj6j4mpj8j2J1K3J0lQK9K4JrLQj2l8m2k3nKPJ3
1166A057J8J7J1KlkMNoj4j6j4k1l2k2QL6L9J9%JJ3J8Lj9k6pJ5J6lj1%J8K4J9J0Jj0j6j7j7
1161A098j5pKKj4k4rJ4K1QmonlOJ7J1rk7l0k5j9j2nKQJ6K1J6J2J5J5%k1k2lJ1RJ3L5M8K4j4
$$ y = [1097, 1065, 1039, 1033, 1046, 1067, 1089, 1105, 1113, 1112, 1104, 1090, 1071, 1048, 1023, 1005, 1000, 1012, 1035, 1064, 1090, 1101, 1087, 1053, 1010, 966, 931, 919, 937, 972, 1001, 1013, 1015, 1019, 1024, 1021, 1012, 1004, 1004, 1020, 1048, 1077, 1085, 1068, 1045, 1035, 1041, 1052, 1061, 1066, 1064, 1058, 1062, 1088, 1123, 1143, 1134, 1108, 1088, 1080, 1078, 1076, 1076, 1075, 1069, 1056, 1046, 1049, 1061, 1069, 1064, 1054, 1049, 1051, 1054, 1050, 1039, 1024, 1004, 983, 964, 948, 928, 908, 902, 918, 950, 981, 1008, 1031, 1052, 1067, 1076, 1084, 1098, 1119, 1141, 1154, 1147, 1119, 1086, 1065, 1064, 1071, 1073, 1062, 1033, 994, 965, 966, 997, 1028, 1038, 1031, 1031, 1055, 1093, 1120, 1123, 1110, 1105, 1113, 1122, 1115, 1094, 1067, 1036, 993, 951, 937, 960, 997, 1016, 1007, 985, 969, 972, 994, 1029, 1057, 1063, 1047, 1024, 1010, 1007, 1012, 1021, 1030, 1036, 1042, 1049, 1059, 1067, 1071, 1075, 1089, 1113, 1133, 1137, 1120, 1091, 1061, 1035, 1015, 1007, 1013, 1028, 1045, 1065, 1086, 1103, 1104, 1093, 1087, 1100, 1127, 1152, 1164, 1163, 1153, 1136, 1119, 1101, 1086, 1083, 1100, 1130, 1154, 1158, 1144, 1129, 1116, 1101, 1082, 1065, 1044, 1015, 983, 969, 986, 1022, 1055, 1075, 1086, 1088, 1077, 1056, 1040, 1043, 1059, 1068, 1064, 1055, 1054, 1063, 1077, 1095, 1113, 1120, 1110, 1090, 1083, 1096, 1112, 1114, 1109, 1113, 1122, 1121, 1105, 1091, 1087, 1080, 1062, 1050, 1061, 1084, 1094, 1091, 1099, 1128, 1152, 1153, 1144, 1147, 1155, 1143, 1105, 1063, 1040, 1035, 1037, 1044, 1057, 1075, 1092, 1103, 1105, 1102, 1100, 1104, 1109, 1103, 1089, 1073, 1059, 1038, 1006, 984, 992, 1028, 1067, 1086, 1086, 1087, 1100, 1118, 1121, 1102, 1076, 1069, 1084, 1100, 1097, 1086, 1086, 1104, 1128, 1147, 1157, 1158, 1148, 1132, 1115, 1098, 1083, 1076, 1078, 1080, 1066, 1042, 1033, 1047, 1068, 1076, 1072, 1066, 1061, 1058, 1064, 1081, 1092, 1083, 1056, 1026, 1001, 982, 970, 965, 967, 975, 991, 1012, 1028, 1040, 1055, 1070, 1070, 1049, 1027, 1024, 1035, 1044, 1057, 1092, 1140, 1164, 1150]
1156A150l5k9j8j3nLKoj2rqrrqj2pJ3L3L7L1L4L5J6j9l4k0qj3j6NK3Qk5l1mK6K4Kj8k6k0o
1151A022J0J9J9J1nk5l2j2J9L4J9JJJ1J0nj7j4jJ0J3J1QN%j2k7l6l5k6j7mJ0K2K3J6J2J3R
1146A060knLJ3Prj9j5oOJ9K7J6j5m1l8rJ3J6ROONK%kolQJ8J2ok3k8j8KJ9K3J5NKPJ0Kj0k1
1141A055k6k2pJ3K7K5J2lro%PJ2K1K8K2Lj7j8j0j0k0k0mJ1OqmJ6K7J8jj0j0plORjj5j7kRQ
1135A085Lkoj6k5k3j2JJ3K1K4J7Onj2j7j8qRK1K4K4K2J6Lpro%J2K2J5nj9j7oJ%MQLrj8j5j1
1130A088j6k5k5j2J0K9L5K1LpkOjk0l5l1j3PJ2Lj5k5k1mRJ1QJ3K9M2L9J8nk4l5l3j0K0L6K8
1125A108J5J1J1lj9k2j3rj2j2KJ0MlJJ3J5jk5m3m2k3kPJ2K9N1N0K1lLK6K9Rj0qJNLJnj2j0
1120A160MJ8J7J0OO%pnMJ0RKmrj5j5rllj1j8j9j7j3pJ0L1M3L3J2pj4j7j9k0k1k1k0j9j5j0
$$ y = [1150, 1115, 1086, 1068, 1055, 1050, 1053, 1055, 1049, 1037, 1028, 1020, 1011, 1002, 994, 982, 975, 988, 1021, 1058, 1089, 1123, 1158, 1174, 1155, 1121, 1101, 1093, 1080, 1064, 1069, 1092, 1100, 1075, 1044, 1040, 1066, 1090, 1092, 1074, 1048, 1028, 1022, 1032, 1051, 1070, 1081, 1076, 1051, 1019, 1007, 1026, 1060, 1079, 1080, 1081, 1092, 1102, 1097, 1080, 1066, 1065, 1075, 1088, 1099, 1107, 1112, 1112, 1100, 1073, 1037, 1002, 976, 959, 955, 965, 987, 1010, 1026, 1038, 1051, 1060, 1058, 1053, 1056, 1069, 1076, 1067, 1048, 1033, 1027, 1033, 1052, 1079, 1095, 1080, 1039, 1001, 992, 1005, 1021, 1030, 1036, 1042, 1047, 1049, 1049, 1047, 1041, 1038, 1046, 1064, 1076, 1070, 1047, 1019, 1001, 1003, 1022, 1045, 1060, 1065, 1067, 1074, 1084, 1086, 1076, 1055, 1029, 1007, 1000, 1013, 1040, 1065, 1077, 1074, 1065, 1059, 1059, 1066, 1078, 1099, 1127, 1149, 1152, 1135, 1117, 1107, 1097, 1077, 1057, 1053, 1064, 1070, 1062, 1058, 1074, 1101, 1119, 1118, 1108, 1098, 1091, 1088, 1094, 1103, 1102, 1087, 1070, 1068, 1077, 1085, 1088, 1086, 1080, 1064, 1039, 1016, 1004, 1005, 1018, 1039, 1063, 1080, 1086, 1081, 1069, 1052, 1034, 1026, 1035, 1056, 1080, 1104, 1126, 1142, 1145, 1138, 1129, 1123, 1123, 1135, 1157, 1172, 1167, 1148, 1131, 1125, 1126, 1126, 1130, 1138, 1141, 1132, 1114, 1099, 1088, 1072, 1047, 1022, 1010, 1020, 1049, 1084, 1105, 1108, 1101, 1099, 1105, 1104, 1084, 1049, 1018, 1005, 1012, 1024, 1027, 1012, 987, 966, 962, 971, 982, 990, 1003, 1032, 1074, 1113, 1131, 1126, 1102, 1067, 1034, 1024, 1044, 1080, 1108, 1123, 1134, 1145, 1142, 1123, 1101, 1088, 1079, 1067, 1055, 1057, 1067, 1071, 1068, 1069, 1082, 1097, 1096, 1071, 1028, 986, 963, 961, 968, 980, 1009, 1060, 1110, 1131, 1128, 1131, 1157, 1186, 1195, 1185, 1177, 1178, 1183, 1186, 1187, 1182, 1170, 1160, 1164, 1182, 1199, 1209, 1215, 1221, 1221, 1214, 1209, 1213, 1223, 1232, 1234, 1230, 1221, 1206, 1191, 1182, 1179, 1176, 1165, 1147, 1128, 1111, 1098, 1091, 1101, 1132, 1175, 1208, 1220, 1213, 1199, 1182, 1163, 1143, 1122, 1101, 1081, 1062, 1047, 1037]
1115A037KK0L6L9K8J0nj0qnrj9k2j0MOpj4qLONJ1J7J5Mpj0nMJ1Mj7l7m4l9l2k6j1LJ0MkjO
1109I37J9L4L5J7prJ4L8M5L7K5J4ONJ2J3N%Ljk7n2m7j1J4Mk3k9j0J6L3L3K1LkJ2K7K2Mqop
1104A209k4l9l2j3KMKKnj7k1oJ5L2L6L0J3j2l0k3%J6J4KlKQNok0k8k5j1NJ4J2kj6j2J1L1L2
1099A152J8J1J5J8Qj0k3k9k7k3k0k3k7k0j5k2l9l9kM2N4L4J2J0J7J4KpmNRLkKJ2Rj6l8l5j1
1094A015Loj8j5kJ1K3L7L7J7mj1nlqj0omrj1j0qj1oPJ7K0K0J8J6J0OMnk4l7k8mRkk2k7qJ4
1088I80K1J4OJ1J9K0J0KMRR%j2j7oRJ6J3QPRQPOJ%NJ3Mk3m7m2j9oqrjORJ9L5L9K5Poj7k1j0
1083A107QJ2kj1JJ6Pj4k6k8k8j8QK7Rl6n7l9j2jNJ9K9K3J6K2L5L7K8K0J7J0JLK0L3K7kl6n5
1078A175m7k3n%klqj4j1KROQK1L3K8J9J8K2J5mj8k2k5l0k6rQJ5J6J7J0klJ3K9K5Oj1j4j4j6
$$ y = [1037, 1039, 1059, 1095, 1134, 1162, 1172, 1167, 1157, 1149, 1144, 1135, 1116, 1094, 1084, 1088, 1094, 1087, 1073, 1065, 1068, 1074, 1079, 1090, 1107, 1122, 1126, 1119, 1109, 1104, 1108, 1119, 1123, 1106, 1069, 1025, 986, 954, 928, 917, 920, 930, 934, 932, 931, 937, 956, 990, 1025, 1042, 1035, 1026, 1040, 1078, 1123, 1160, 1185, 1199, 1205, 1210, 1222, 1235, 1240, 1240, 1243, 1242, 1215, 1163, 1116, 1105, 1119, 1123, 1100, 1071, 1061, 1077, 1110, 1143, 1164, 1167, 1165, 1177, 1204, 1226, 1230, 1222, 1216, 1209, 1185, 1146, 1114, 1101, 1103, 1107, 1109, 1111, 1106, 1089, 1068, 1062, 1077, 1109, 1145, 1175, 1188, 1176, 1146, 1123, 1123, 1139, 1153, 1155, 1152, 1154, 1162, 1167, 1161, 1141, 1113, 1088, 1077, 1082, 1096, 1108, 1106, 1090, 1078, 1089, 1120, 1152, 1170, 1181, 1196, 1214, 1222, 1212, 1189, 1160, 1133, 1110, 1090, 1067, 1040, 1020, 1005, 983, 944, 905, 903, 945, 999, 1033, 1045, 1055, 1072, 1086, 1088, 1081, 1077, 1082, 1091, 1094, 1092, 1094, 1106, 1115, 1099, 1061, 1026, 1015, 1018, 1012, 994, 979, 977, 988, 1011, 1048, 1085, 1102, 1098, 1087, 1082, 1079, 1071, 1061, 1055, 1051, 1042, 1031, 1021, 1013, 1002, 996, 1003, 1020, 1040, 1060, 1078, 1094, 1104, 1110, 1114, 1109, 1085, 1048, 1020, 1016, 1025, 1023, 1001, 974, 966, 980, 1001, 1015, 1021, 1032, 1051, 1071, 1081, 1083, 1087, 1096, 1105, 1105, 1093, 1076, 1070, 1079, 1095, 1108, 1116, 1123, 1132, 1140, 1147, 1153, 1154, 1154, 1159, 1172, 1176, 1153, 1106, 1064, 1045, 1039, 1031, 1022, 1021, 1027, 1036, 1055, 1090, 1129, 1154, 1161, 1155, 1138, 1117, 1107, 1115, 1127, 1125, 1114, 1115, 1131, 1138, 1124, 1098, 1070, 1042, 1024, 1032, 1059, 1068, 1032, 975, 936, 924, 923, 928, 947, 976, 999, 1015, 1037, 1072, 1109, 1137, 1157, 1174, 1184, 1185, 1188, 1208, 1241, 1268, 1266, 1230, 1175, 1128, 1105, 1100, 1100, 1098, 1095, 1087, 1073, 1062, 1064, 1073, 1079, 1087, 1108, 1141, 1169, 1188, 1206, 1228, 1243, 1239, 1221, 1199, 1174, 1144, 1118, 1109, 1117, 1132, 1148, 1165, 1175, 1173, 1170, 1183, 1212, 1237, 1243, 1232, 1218, 1204, 1188]
1073A188j8j4qqj5k1j2OJ6Mj7j7OK9K1lj8j5qrj4j5j0okMRJ1J0J1Npj3mJ5K6J8%j3qKjj8l8
1067A049l9j6J5L2L3K7K0J4PJjoj2j4pKJ2K5L3K4pl4l0oQKjQJ5Nm%Pnk4l0j8j2j5j3mjkQK9
1062A075L6J3j8k2JJ9J9QNRJ2Mj3l0l0j6pj3j9rJ2K4K2K0K5K4J3LLKoj0jJ3J8J1J0RKk0l4
1057A164k8kJ6J2j0l0k8nJ8K2J0JOK2K9K5J7J1Lmj1j8l0m5n2l8qK0L1K2kk9m2l7k2rjJ3L0
1052A021L7K6J1NJ1J6J7J1kj9k8j8LK1K5J6QLNOKqj4qjKLNMoj3j0kok4l7k6mJ2J9K0J9J7J1
1047A130MKLQJ0%j0oJ3K9L2K3Qoj8j8oMMMJ2K0J7Kpm%QJ7K2Qj9l6l1j5opj3k0k6k2j2kNJ3
1041A114K4K7J6MNJ8K5J9Kj5k6k7j0J4K8K3NonPJ8K3K0Pj2k9l7k8j0NNpj5j2kPJ2J7J7J2J
1036A234rj3j3j0mJlpjJ8L5L5K7J9J5Oj0k2k6k5rJ3K8K3PJLlk4l6l1k1j8rJ5L4K6Jj0JR%j2
$$ y = [1188, 1170, 1156, 1148, 1140, 1125, 1104, 1092, 1098, 1114, 1118, 1101, 1084, 1090, 1119, 1140, 1137, 1119, 1104, 1096, 1087, 1073, 1058, 1048, 1042, 1040, 1044, 1053, 1064, 1074, 1085, 1090, 1083, 1070, 1066, 1081, 1107, 1125, 1125, 1112, 1104, 1106, 1105, 1087, 1049, 1010, 994, 1009, 1041, 1074, 1101, 1121, 1135, 1142, 1143, 1142, 1136, 1124, 1110, 1103, 1105, 1117, 1142, 1175, 1199, 1192, 1158, 1128, 1122, 1130, 1132, 1131, 1139, 1154, 1159, 1155, 1155, 1162, 1157, 1133, 1103, 1085, 1073, 1058, 1045, 1041, 1040, 1038, 1046, 1075, 1111, 1124, 1106, 1084, 1085, 1104, 1123, 1131, 1136, 1145, 1157, 1161, 1148, 1118, 1088, 1072, 1065, 1052, 1033, 1024, 1036, 1060, 1082, 1102, 1127, 1151, 1164, 1167, 1170, 1172, 1166, 1156, 1155, 1168, 1186, 1197, 1207, 1216, 1218, 1198, 1164, 1136, 1134, 1150, 1162, 1152, 1122, 1094, 1089, 1107, 1129, 1139, 1140, 1146, 1168, 1197, 1222, 1239, 1250, 1253, 1249, 1238, 1220, 1190, 1145, 1093, 1055, 1047, 1067, 1098, 1120, 1118, 1089, 1047, 1010, 988, 979, 978, 991, 1021, 1058, 1084, 1095, 1100, 1111, 1127, 1144, 1155, 1153, 1134, 1106, 1088, 1091, 1112, 1137, 1153, 1161, 1164, 1169, 1175, 1177, 1169, 1155, 1147, 1146, 1148, 1151, 1156, 1160, 1154, 1141, 1131, 1129, 1123, 1099, 1062, 1036, 1032, 1044, 1063, 1083, 1102, 1119, 1130, 1134, 1136, 1139, 1147, 1157, 1157, 1147, 1141, 1154, 1183, 1215, 1238, 1246, 1240, 1222, 1204, 1198, 1202, 1206, 1210, 1222, 1242, 1259, 1261, 1254, 1250, 1250, 1258, 1275, 1297, 1305, 1286, 1250, 1219, 1204, 1198, 1191, 1178, 1158, 1132, 1110, 1098, 1096, 1101, 1114, 1138, 1165, 1181, 1185, 1190, 1208, 1233, 1252, 1254, 1239, 1213, 1186, 1176, 1190, 1218, 1241, 1246, 1240, 1235, 1242, 1260, 1283, 1303, 1310, 1298, 1269, 1232, 1204, 1194, 1199, 1204, 1197, 1182, 1170, 1168, 1175, 1187, 1204, 1221, 1233, 1234, 1225, 1212, 1199, 1189, 1185, 1186, 1183, 1176, 1175, 1193, 1228, 1263, 1290, 1309, 1324, 1330, 1320, 1298, 1272, 1247, 1238, 1251, 1279, 1302, 1309, 1310, 1313, 1310, 1286, 1250, 1219, 1198, 1180, 1171, 1186, 1220, 1246, 1247, 1237, 1238, 1247, 1247, 1235]
1031A235j7j7j8j5%J7K4J8J3J1J4K3K9K8J1pj1JK1L4L5K7J3MOJ3J4MlKJ5K4K2J1Kkj0k2l5
1026A514m0l5k6k2j9j5nJ0K1K1J1lrqonjRJ3Jj4j8qJj1l5n1m5k0kkj1j5pJPNoj8j8JJ9J9Q
1021A186J7L8M5J8j4k2j3j5k8l4k3rlkJOOOOJrj9k2j8j1%J6K8L2K6J5JqroloqjRRkj5j6nN
1015A150ONRJ7J8J2NJ2K2K0Kj9k6j5OJ5J3RJ4K3K0kk6l8l5k6j2kKoj0lNlk0k2LL6N6N8N2M3
1010A368K7Nj8k6j9olqj3rqk5m3l6LM2N2M0K2J1KmlJ1L3M7M5K6Kj2j5j5j2j0mjJMJ0Pj2l8
1005A418n5n7m7l2j6rqj5k4k7j8J0M2N4L4MoKJ0Nmj0j2j3j0JJ4J6Lj3j8j0k%mLJ7K1J1KQJ7
1000A282J5MKJ0Nj2k2j0J4K4J9QK%jmpj0j0j0j8l2l7k6nJ0J6K1K2J6Mqj3j5j0%Olj8j8kJ2
994A201RPK3M8M8J8j4k2nRRmj7k0j3kKoj1mQJ4J3J4J3Omn%mj3j0QJ7Lj4j3NJ7J4OjkLJ2J2
$$ y = [1235, 1218, 1201, 1183, 1168, 1168, 1185, 1209, 1227, 1240, 1251, 1265, 1288, 1317, 1345, 1356, 1349, 1338, 1339, 1360, 1394, 1429, 1456, 1469, 1473, 1479, 1492, 1506, 1510, 1507, 1509, 1524, 1548, 1570, 1581, 1583, 1581, 1571, 1549, 1514, 1474, 1439, 1413, 1391, 1372, 1357, 1352, 1362, 1383, 1404, 1415, 1412, 1403, 1395, 1389, 1384, 1383, 1392, 1405, 1406, 1392, 1374, 1366, 1367, 1356, 1321, 1270, 1225, 1205, 1203, 1201, 1190, 1175, 1168, 1169, 1176, 1181, 1175, 1157, 1139, 1140, 1159, 1178, 1186, 1203, 1241, 1286, 1304, 1290, 1268, 1255, 1240, 1212, 1178, 1155, 1146, 1143, 1141, 1142, 1148, 1154, 1160, 1166, 1167, 1158, 1139, 1117, 1099, 1088, 1088, 1104, 1132, 1164, 1190, 1205, 1206, 1198, 1189, 1183, 1180, 1174, 1166, 1165, 1174, 1183, 1181, 1166, 1150, 1145, 1150, 1156, 1161, 1170, 1187, 1205, 1217, 1222, 1234, 1256, 1276, 1278, 1259, 1233, 1218, 1224, 1239, 1252, 1261, 1275, 1298, 1318, 1316, 1290, 1252, 1217, 1191, 1179, 1177, 1179, 1173, 1163, 1160, 1165, 1162, 1142, 1120, 1123, 1159, 1215, 1273, 1325, 1368, 1395, 1400, 1382, 1356, 1337, 1331, 1328, 1320, 1307, 1298, 1290, 1265, 1222, 1186, 1189, 1231, 1283, 1323, 1345, 1356, 1358, 1354, 1351, 1362, 1395, 1442, 1487, 1513, 1515, 1503, 1488, 1473, 1461, 1451, 1447, 1446, 1447, 1451, 1461, 1468, 1456, 1418, 1363, 1306, 1259, 1227, 1211, 1202, 1194, 1179, 1155, 1128, 1110, 1120, 1162, 1216, 1250, 1254, 1248, 1250, 1260, 1265, 1261, 1251, 1239, 1226, 1216, 1217, 1231, 1247, 1250, 1237, 1219, 1209, 1207, 1207, 1203, 1206, 1223, 1244, 1255, 1257, 1265, 1282, 1297, 1301, 1303, 1313, 1318, 1306, 1284, 1274, 1288, 1312, 1331, 1339, 1341, 1341, 1340, 1336, 1329, 1319, 1309, 1299, 1281, 1249, 1212, 1186, 1181, 1191, 1207, 1228, 1250, 1266, 1270, 1262, 1249, 1234, 1224, 1224, 1230, 1227, 1209, 1191, 1189, 1201, 1210, 1217, 1240, 1288, 1336, 1354, 1340, 1318, 1313, 1322, 1331, 1327, 1310, 1290, 1277, 1275, 1277, 1271, 1260, 1256, 1264, 1278, 1291, 1305, 1318, 1324, 1320, 1315, 1315, 1311, 1298, 1288, 1296, 1313, 1316, 1302, 1289, 1294, 1311, 1325, 1331, 1330, 1328, 1331, 1343, 1355]
989A355LJJ3K8K0NOK1K6J0KJ3K4J5pj9k4k9k5j0KL%OJ7J3lrnJLPJ7J6NonjkmnJJ0K0K2J4L
983A548KRJ6J0kqj3j5j7k0k5k6j5LJ7J9J7J8J3Krj1onj1k0l0l3k6j0MQMmj3k2j9LK4K3kk1
978A357j2J4K6J1j1k0j5j0j1rMJ6J5KppjMK%mpj0j9k3j4J1K7J3k3m3k5RK4J5Kloj2j6oOMj0
973A238j7pJ3K6K6J6LnmKMpk2j7J1M1M3J2k6n1n3l8j7JJ1J5J6J4PjjJ1J9Nk7n4n1k1NQrj9
967A100pJ0J4OJORMlnJQJ2RONNPMkJRJ2Lj1j8j7j0%RJ3J0NMNK%KMjmkPJ2Pkj1j6j5mJ3K1J9
961A237J0N%rj8j5qkJ%krj2lK0L5L1J9J7K0J6%k0k8k5j9j4j2j2nPK2K2Oj1qJ0K1J4Mklj3k8
956A239l8l4k1qJ%%RJ9K0QPK6M1K8pk7j4J1K3K2K0J8J2%qj2j5j3jJ2J2mk0k5k1j2o%nk6m7
950A164m3rK8L6J7klRJ5J2Nkj0rjJ2K1J9Oj7l8m0k1LJ1RRJ5J3KlNJ4J8K5L7L8K0mj8j7j4j4
$$ y = [1355, 1358, 1359, 1372, 1400, 1420, 1425, 1431, 1452, 1478, 1488, 1490, 1503, 1527, 1542, 1535, 1516, 1492, 1463, 1438, 1428, 1430, 1433, 1433, 1439, 1456, 1469, 1466, 1457, 1452, 1453, 1456, 1463, 1480, 1496, 1501, 1495, 1490, 1489, 1487, 1483, 1478, 1479, 1489, 1509, 1531, 1545, 1548, 1550, 1559, 1575, 1585, 1583, 1575, 1562, 1547, 1530, 1510, 1485, 1459, 1444, 1447, 1464, 1483, 1500, 1518, 1531, 1533, 1524, 1513, 1507, 1502, 1491, 1471, 1441, 1408, 1382, 1372, 1376, 1384, 1388, 1384, 1371, 1349, 1330, 1333, 1357, 1380, 1378, 1357, 1345, 1359, 1385, 1396, 1385, 1365, 1350, 1340, 1329, 1320, 1324, 1340, 1355, 1357, 1350, 1343, 1342, 1346, 1348, 1348, 1344, 1337, 1327, 1308, 1285, 1271, 1282, 1309, 1322, 1299, 1256, 1231, 1240, 1264, 1279, 1281, 1278, 1272, 1260, 1244, 1238, 1244, 1248, 1238, 1221, 1214, 1227, 1253, 1279, 1295, 1298, 1293, 1289, 1291, 1295, 1288, 1266, 1249, 1260, 1301, 1344, 1356, 1330, 1279, 1226, 1188, 1171, 1172, 1183, 1198, 1214, 1228, 1235, 1234, 1233, 1244, 1263, 1268, 1241, 1187, 1136, 1115, 1120, 1128, 1119, 1100, 1093, 1103, 1117, 1123, 1124, 1130, 1139, 1143, 1140, 1135, 1136, 1144, 1156, 1165, 1171, 1176, 1181, 1188, 1192, 1190, 1191, 1200, 1212, 1215, 1204, 1186, 1169, 1159, 1159, 1168, 1181, 1191, 1196, 1200, 1205, 1207, 1207, 1209, 1213, 1212, 1208, 1206, 1213, 1225, 1232, 1230, 1219, 1203, 1188, 1184, 1197, 1218, 1237, 1247, 1252, 1252, 1243, 1225, 1210, 1202, 1200, 1201, 1201, 1199, 1190, 1178, 1175, 1195, 1230, 1261, 1280, 1297, 1317, 1333, 1333, 1313, 1285, 1260, 1241, 1227, 1215, 1203, 1198, 1205, 1227, 1249, 1255, 1244, 1236, 1246, 1267, 1281, 1285, 1283, 1280, 1267, 1239, 1201, 1167, 1146, 1138, 1139, 1139, 1139, 1148, 1167, 1187, 1195, 1202, 1228, 1269, 1297, 1290, 1263, 1249, 1260, 1283, 1305, 1325, 1343, 1355, 1355, 1347, 1335, 1320, 1307, 1306, 1318, 1330, 1326, 1306, 1281, 1260, 1248, 1242, 1242, 1237, 1211, 1164, 1121, 1112, 1140, 1176, 1193, 1191, 1188, 1197, 1212, 1224, 1229, 1227, 1217, 1208, 1207, 1219, 1240, 1259, 1265, 1248, 1210, 1170, 1149, 1152, 1163, 1172, 1181, 1196, 1209, 1211, 1208, 1213, 1227, 1245, 1270, 1307, 1345, 1365, 1361, 1343, 1326, 1312, 1298]
945A298j6k2l2l7k5mJ3J3ONRJ3J3J3J5Rj0k5k3qORJ5K3K4Qj6k2j0mj3k4j4J1K6K0%j9k1j1
940A193%%j0j3KK2L0K6K2J9J5OKJ1K2K3J2MKKkqrmMOOMOJ0J5J8K0K1K6L6M3L9K4Ppk0l1m0
935A554m2l7l0k4j7j5j3nOPqk4k7k0j5j6j5oJlj0lJ7L4L4J9PMMLlnlmoJJ6K2Rj6l0k4oNPL
929A326%MRLj1k1j4jRJ0RKj7l5l1JL5M2K2pk4k4k0k2k9k4JL3M0J8jQL3N2M9L4J9PLNJj9m0
924A435m0j9NJ4J1NKjjMM%pj4j5j2kRJ7J3Lnj1oPK4K5J1onQJ7J7J2QKnql%JQK3L7L6K3J9L4
918A674N1N0L4J8J1J2J1J2K2M0N3N3M6N6Q0J07J20J15J06R9R7R9R6P4L1k2o5q9r7r5p8n2k7
914B642pRJ6J1MRL0N2N8N2L5Nl4o6p2o9p4r0j05j07j04r5p8n6m6m8m6l3k2k0k7k7k1j9j8j2
910A627m%j5m0o0o1m4k0jMNONOPJ2J7J7J2Jj2j9j5j1j2j2%J4Ok1l5k0LQnrj%j4k4j6mllLJ0
$$ y = [1298, 1282, 1260, 1228, 1191, 1166, 1162, 1175, 1188, 1194, 1199, 1208, 1221, 1234, 1247, 1262, 1271, 1261, 1236, 1213, 1205, 1211, 1220, 1235, 1258, 1282, 1290, 1274, 1252, 1242, 1238, 1225, 1201, 1187, 1198, 1224, 1244, 1244, 1225, 1204, 1193, 1193, 1193, 1183, 1170, 1172, 1194, 1224, 1250, 1272, 1291, 1306, 1312, 1314, 1325, 1347, 1370, 1382, 1386, 1388, 1390, 1388, 1380, 1371, 1367, 1371, 1377, 1383, 1387, 1393, 1403, 1418, 1436, 1456, 1477, 1503, 1539, 1582, 1621, 1645, 1652, 1645, 1625, 1594, 1554, 1512, 1475, 1445, 1421, 1404, 1389, 1376, 1371, 1377, 1384, 1376, 1352, 1325, 1305, 1290, 1274, 1259, 1253, 1254, 1251, 1241, 1238, 1255, 1289, 1323, 1342, 1349, 1353, 1357, 1360, 1357, 1352, 1349, 1345, 1339, 1340, 1356, 1378, 1387, 1371, 1341, 1317, 1311, 1316, 1323, 1326, 1326, 1330, 1339, 1342, 1331, 1310, 1296, 1295, 1304, 1314, 1323, 1325, 1308, 1273, 1242, 1243, 1278, 1320, 1342, 1335, 1311, 1287, 1267, 1245, 1216, 1192, 1193, 1226, 1266, 1284, 1283, 1291, 1324, 1376, 1425, 1459, 1478, 1485, 1488, 1493, 1494, 1475, 1435, 1395, 1376, 1381, 1395, 1406, 1411, 1413, 1412, 1411, 1415, 1419, 1419, 1412, 1398, 1383, 1371, 1369, 1378, 1395, 1408, 1411, 1406, 1395, 1389, 1396, 1420, 1445, 1456, 1450, 1445, 1453, 1470, 1487, 1499, 1507, 1509, 1504, 1496, 1493, 1493, 1494, 1502, 1525, 1562, 1598, 1621, 1640, 1674, 1725, 1775, 1809, 1827, 1838, 1850, 1861, 1873, 1895, 1935, 1988, 2041, 2087, 2143, 2223, 2330, 2450, 2565, 2671, 2770, 2867, 2966, 3062, 3136, 3167, 3145, 3080, 2991, 2894, 2799, 2721, 2669, 2642, 2635, 2644, 2660, 2671, 2675, 2684, 2714, 2766, 2824, 2876, 2911, 2916, 2882, 2816, 2744, 2675, 2601, 2511, 2406, 2299, 2195, 2100, 2022, 1966, 1920, 1872, 1826, 1793, 1771, 1751, 1724, 1697, 1676, 1657, 1639, 1627, 1623, 1623, 1608, 1568, 1508, 1447, 1403, 1383, 1382, 1386, 1391, 1397, 1402, 1408, 1415, 1427, 1444, 1461, 1473, 1474, 1462, 1443, 1428, 1417, 1405, 1393, 1393, 1407, 1413, 1392, 1357, 1337, 1340, 1348, 1343, 1334, 1333, 1333, 1319, 1295, 1279, 1275, 1272, 1269, 1272, 1282]
904A282J0PJ0J8J3pk1oK1K9Nk7l0nJ7J3%kJ2K3K4J3pl1m5l4rRPLJ0K1J5mk1k2r%j2l2l7j6
899A185J4L2L4L5L8K8Mj9k7k7k8k8j5OK2K8K3J6J2J0Nlj0qLNpj9j6jJ1J4J5Rpk9l8k0QK1J7
894A293NJ%loKK0L0K0kj5j0J2L4M1K8NkJ9N2N9L9J1mj0j8j9pNPLJ0L0M5L9K0jj2qLJ3J4Q%
889A751j2k9m2m0j7J2L0L0J3mr%J2J8J9J7Qj5l9m2j8J1K5K1J8K6M1M7M0L4M6P5R6R7R2J00
884B412J10R8O0J7opkj0l4o6q7q4p1o5o9p1o2m8m3m2m0l4l3l8m1l1j1PJ4Rlj5k7l7m3l7k5
880A545rQK2K3J3LPJ7K2K0J9J9J0LOJ7J9J4J9L2L5J6MK3N6O7N3L6L6M3M4L9L4L3M0O0Q3Q8
875B619P4N9O4Q5J06J21J43J82K29K69L01L27L46L59L64L63L52L15K55J75Q6j8j34k46l31
872F465l82m01l94l55k94k36j99j76j50j22r8p8m9j8jmj0JK0K5J1LK1M9N9M7K6J5Pkrrj6l5
$$ y = [1282, 1292, 1299, 1309, 1327, 1340, 1333, 1312, 1306, 1327, 1356, 1361, 1334, 1304, 1299, 1316, 1329, 1329, 1327, 1339, 1362, 1386, 1399, 1392, 1361, 1316, 1282, 1273, 1282, 1289, 1292, 1302, 1323, 1338, 1334, 1313, 1291, 1282, 1282, 1270, 1238, 1201, 1185, 1199, 1231, 1265, 1300, 1338, 1366, 1370, 1351, 1324, 1297, 1269, 1241, 1226, 1232, 1254, 1282, 1305, 1321, 1333, 1343, 1348, 1345, 1335, 1327, 1330, 1335, 1328, 1309, 1293, 1292, 1303, 1317, 1332, 1341, 1334, 1305, 1267, 1247, 1255, 1276, 1293, 1298, 1299, 1299, 1296, 1290, 1292, 1312, 1342, 1362, 1360, 1345, 1335, 1347, 1381, 1422, 1450, 1455, 1453, 1472, 1524, 1583, 1622, 1633, 1629, 1619, 1601, 1582, 1575, 1580, 1587, 1590, 1600, 1630, 1675, 1714, 1734, 1733, 1721, 1713, 1716, 1729, 1743, 1751, 1751, 1739, 1710, 1668, 1628, 1611, 1623, 1653, 1683, 1696, 1692, 1683, 1683, 1695, 1713, 1732, 1749, 1757, 1742, 1703, 1661, 1643, 1654, 1679, 1700, 1718, 1744, 1785, 1832, 1872, 1906, 1952, 2027, 2123, 2220, 2312, 2412, 2522, 2620, 2680, 2697, 2691, 2684, 2682, 2672, 2638, 2572, 2485, 2401, 2330, 2265, 2196, 2125, 2063, 2015, 1972, 1930, 1890, 1856, 1823, 1785, 1744, 1713, 1702, 1709, 1723, 1732, 1729, 1714, 1687, 1650, 1607, 1570, 1545, 1536, 1544, 1566, 1589, 1602, 1605, 1612, 1629, 1651, 1671, 1690, 1709, 1719, 1722, 1728, 1745, 1764, 1778, 1797, 1829, 1864, 1880, 1884, 1907, 1963, 2030, 2083, 2119, 2155, 2198, 2242, 2281, 2315, 2348, 2388, 2448, 2531, 2619, 2693, 2752, 2816, 2901, 3007, 3128, 3271, 3453, 3682, 3951, 4252, 4579, 4925, 5284, 5648, 6011, 6363, 6678, 6933, 7108, 7194, 7176, 7042, 6796, 6465, 6083, 5682, 5288, 4933, 4639, 4403, 4204, 4028, 3878, 3756, 3658, 3580, 3531, 3513, 3512, 3508, 3498, 3499, 3519, 3544, 3555, 3558, 3579, 3628, 3687, 3734, 3760, 3775, 3782, 3780, 3771, 3762, 3746, 3711]
868C711n9o4n4m7n6o7o5n4m3l1k1j5j3rrk0l4l4j8pj9l6k9kJ6Qj3l2m0l7k8j9j8j8j1lnk0
863B685k5j0J1K4K7K2%l6o7p5o4m7l3k2j7k0j9pQPj0k5k7j9j4j1lJ3K1J4pk4l1m0n7p1o2l0
858A959QK2J2pj7qJ3K7K2Mj1j4j1onqj5k0j4noj6k0oROpj4mJ1J3Nj0k7k9j5M%k7n4m5pK7L1
853A745J0j0j3jQJ3J3Nrj9j1PJ2Kj0qlrk1j2J2K6J0j7k7j5%jj2j8j5j1rj0j3j7j8j0J1K6K3
848A604Kj3qJ1L0L6K7Mk2l9l8k7j3JJ1J3MplJ4K6K3J2NKJMLmj1jK6M3L3RJJ3J7Lj7k6k4k3
843A702k4k1j9k2l4m2m1l5k8k0rkNJ2K0K1Rnj2j1qjJ5L2L8K6J1Mlj2j1PK3J0k4m0k3KJ0QJ0
838A518J3pl4l9j0J8J5j2k4j4JLllMJ7L0L4K6J1koj1j6j1NJ1mk9m0k9k0k7m1m0k1lKqj6j4
833A224%J6K7L0L0K7K2K4L2L7K2jj4nN%j6k6k0j1mJRJ4Qpk6l4k6j2jMJ6L2M2L8K8K3J6Mnj1
$$ y = [3711, 3652, 3588, 3534, 3487, 3431, 3364, 3299, 3245, 3202, 3171, 3150, 3135, 3122, 3113, 3104, 3084, 3050, 3016, 2998, 2991, 2972, 2936, 2907, 2905, 2921, 2929, 2916, 2884, 2844, 2807, 2779, 2760, 2742, 2724, 2713, 2710, 2705, 2685, 2660, 2650, 2661, 2685, 2712, 2734, 2734, 2698, 2631, 2556, 2492, 2445, 2412, 2390, 2373, 2353, 2334, 2327, 2335, 2342, 2332, 2307, 2280, 2261, 2247, 2236, 2233, 2246, 2267, 2281, 2274, 2250, 2219, 2179, 2122, 2051, 1989, 1959, 1967, 1989, 2001, 1994, 1977, 1969, 1982, 2009, 2031, 2035, 2024, 2010, 1999, 1993, 1988, 1980, 1965, 1945, 1931, 1926, 1920, 1904, 1884, 1878, 1887, 1893, 1886, 1872, 1868, 1879, 1892, 1897, 1887, 1860, 1831, 1816, 1820, 1820, 1793, 1739, 1694, 1687, 1714, 1745, 1755, 1745, 1732, 1731, 1739, 1752, 1765, 1770, 1761, 1742, 1731, 1738, 1750, 1752, 1742, 1734, 1731, 1722, 1701, 1689, 1701, 1727, 1737, 1720, 1693, 1678, 1678, 1677, 1665, 1647, 1632, 1621, 1612, 1602, 1589, 1572, 1554, 1544, 1555, 1581, 1604, 1606, 1593, 1585, 1596, 1626, 1662, 1689, 1693, 1671, 1632, 1594, 1567, 1554, 1555, 1566, 1579, 1583, 1576, 1573, 1587, 1613, 1636, 1648, 1653, 1655, 1656, 1660, 1663, 1659, 1648, 1647, 1673, 1716, 1749, 1758, 1759, 1772, 1789, 1792, 1775, 1749, 1725, 1702, 1678, 1657, 1638, 1616, 1582, 1540, 1499, 1464, 1436, 1416, 1407, 1405, 1410, 1422, 1442, 1463, 1472, 1467, 1455, 1444, 1436, 1435, 1450, 1482, 1520, 1546, 1557, 1561, 1558, 1546, 1535, 1542, 1565, 1575, 1551, 1511, 1488, 1490, 1500, 1508, 1518, 1531, 1524, 1490, 1451, 1441, 1459, 1474, 1462, 1438, 1424, 1425, 1428, 1425, 1422, 1426, 1443, 1473, 1507, 1533, 1544, 1542, 1536, 1525, 1509, 1498, 1503, 1514, 1510, 1481, 1441, 1412, 1392, 1365, 1324, 1284, 1263, 1260, 1262, 1254, 1238, 1224, 1224, 1240, 1267, 1297, 1327, 1354, 1376, 1400, 1432, 1469, 1491, 1490, 1476, 1471, 1476, 1476, 1460, 1434, 1414, 1403, 1399, 1400, 1409, 1423, 1431, 1424, 1398, 1364, 1338, 1326, 1325, 1329, 1345, 1377, 1419, 1457, 1485, 1508, 1524, 1528, 1523, 1512]
828A512j8k6k6j1mj9l6k6MJ9J4J3K4K7J0mjLmoOJ9Qj8k7j6noqnoj4j7rPK0K5J8%j5j4%J2J7
822A417J5Oj3k3j1J1J7%pOJ7Lk2k7j1L%qj2j1j1j0kRK9N2O5N7L0J1NJj0j8rJ1K5K7L0L9M2
817A723L2K4K4K7K6K0L0M6M9K8kk0k7l2m4n9p1p8o7m0j1MMNNlk1l1k2j0rj6j7j3qkQJ8J6l
812A483k4k8j3J1J4mk6k4mNlj2mNMkPK4K7J5NJmj2j0nj2l0l4j2J1J0npLP%rn%mj1j2jJ5K2
807A352J2mj0nLMOJ6K0Lk7l9k0PJ8J1KOJ5K0K1K2K9L3K2pl8n0l7j3MJ2J3J3J6K1K6K5J3nk2
802A488k5j4%Lrj9oJ9K6Jk8k8%K3K1NnlLNRJ6K3J9Orj1kNMjlmj6l6m8l2mJ2PmjJ1J5KpKK3
796A433K6Jl0l0kK5K9K5K7L3K6PkMJ2OljONmjJ4K9L5L8M6M6K7NkJ0J7PqrRL3N7P3Q2Q2Q7J02
791B372J23J40J43J41J33J24J16J14J13R2N2Mm2r2j45j80j79j56j41j38j33j18j05j04r8p3
$$ y = [1512, 1494, 1468, 1442, 1431, 1427, 1408, 1372, 1346, 1350, 1369, 1383, 1396, 1420, 1447, 1457, 1453, 1452, 1455, 1451, 1445, 1451, 1470, 1478, 1460, 1433, 1417, 1412, 1406, 1398, 1393, 1387, 1373, 1356, 1347, 1354, 1374, 1399, 1417, 1417, 1402, 1388, 1388, 1400, 1417, 1432, 1438, 1425, 1402, 1391, 1402, 1419, 1419, 1412, 1418, 1435, 1438, 1416, 1389, 1378, 1381, 1381, 1373, 1361, 1350, 1339, 1329, 1327, 1336, 1365, 1417, 1482, 1539, 1569, 1580, 1585, 1586, 1576, 1558, 1549, 1560, 1585, 1612, 1642, 1681, 1723, 1755, 1779, 1803, 1830, 1856, 1876, 1906, 1952, 2001, 2029, 2027, 2007, 1980, 1948, 1904, 1845, 1774, 1696, 1629, 1589, 1578, 1582, 1586, 1591, 1596, 1593, 1572, 1541, 1519, 1509, 1500, 1484, 1467, 1454, 1446, 1444, 1452, 1470, 1486, 1483, 1459, 1431, 1418, 1429, 1443, 1439, 1413, 1389, 1385, 1390, 1387, 1375, 1371, 1376, 1380, 1378, 1385, 1409, 1436, 1451, 1456, 1457, 1453, 1441, 1431, 1426, 1414, 1384, 1350, 1338, 1349, 1359, 1354, 1347, 1350, 1357, 1357, 1348, 1343, 1343, 1339, 1328, 1316, 1315, 1330, 1352, 1364, 1360, 1350, 1345, 1348, 1352, 1358, 1374, 1394, 1397, 1370, 1331, 1311, 1318, 1336, 1347, 1349, 1355, 1370, 1390, 1411, 1433, 1462, 1495, 1517, 1510, 1472, 1422, 1385, 1372, 1376, 1388, 1401, 1414, 1430, 1451, 1477, 1502, 1515, 1510, 1488, 1463, 1449, 1449, 1452, 1443, 1424, 1418, 1437, 1463, 1464, 1436, 1408, 1408, 1431, 1452, 1457, 1452, 1449, 1452, 1457, 1466, 1482, 1505, 1524, 1530, 1521, 1510, 1508, 1513, 1517, 1516, 1513, 1509, 1493, 1457, 1409, 1377, 1373, 1385, 1392, 1388, 1387, 1398, 1413, 1415, 1408, 1410, 1433, 1459, 1460, 1430, 1400, 1398, 1423, 1452, 1477, 1504, 1537, 1563, 1570, 1568, 1572, 1584, 1590, 1587, 1586, 1592, 1597, 1593, 1592, 1606, 1635, 1670, 1708, 1754, 1800, 1827, 1832, 1830, 1840, 1857, 1864, 1856, 1847, 1856, 1889, 1946, 2019, 2101, 2183, 2270, 2372, 2495, 2635, 2778, 2919, 3052, 3176, 3292, 3406, 3519, 3611, 3663, 3667, 3625, 3533, 3388, 3208, 3029, 2873, 2732, 2594, 2461, 2343, 2238, 2134, 2036, 1963]
787A963k8LLk5n6n9l9j8k1l7m6l9l5m2m2j9RJ8Nprnmnpj5k5k0kJ9K5J0j5l8m1j7J7L0J9Lk
782A406mj6k9k0MJ6PlkKrl4n0m0j0K0L3K2LnLJ8K5K0Qoj4j4rqj0j4j8k0j7p%j0k9l3j7knj2
777A120LK9L3J3%NJ6J3NNMJMJ6K3Nj9k4nJ4J5OkopjMjj2qJ3L2L7L4L2L1K7K7L2L4K2Lj2j5
772A546j0ML0N8P4P8Q4R9J15J24J31J51J76J91J86J73J65J57J40J09O9K3k9q7j37j71j93k07
768C049k11j95j66j39j21j05q6p3p4q0p3n2l7m4o1o6n2l3k6k4k0j5j6k7l3k9k0j7j9k2k0j8
764A075qJ0K7K7J3lqprj0prk0l1k8k3l0m9n2k3J4K5J0nLK5L5K2jj8k8k9k5j4qpnPK1J8lk0
759H52j7kJ5K5L5M3M3L6K6J8QMLL%mlkqj5j4jP%j2j9j3jJ1J1Jj3j8j2jNLoj3j0LJ7K0J3Pk
753A023j5k5k3j4j8l3l4j3J9L4L0J4knKJ2Mj6k3qRRJmmj4k1j1J1J7KrmNNQK2K7J1j9k9j9o
$$ y = [1963, 1935, 1938, 1941, 1916, 1860, 1801, 1762, 1744, 1723, 1686, 1640, 1601, 1566, 1524, 1482, 1463, 1472, 1490, 1495, 1488, 1479, 1474, 1470, 1465, 1458, 1443, 1418, 1398, 1396, 1415, 1440, 1450, 1435, 1397, 1356, 1339, 1356, 1386, 1405, 1408, 1406, 1402, 1386, 1357, 1337, 1341, 1357, 1364, 1361, 1359, 1361, 1352, 1318, 1268, 1228, 1218, 1238, 1271, 1293, 1296, 1291, 1294, 1312, 1337, 1357, 1365, 1359, 1345, 1331, 1322, 1314, 1304, 1290, 1272, 1252, 1235, 1228, 1228, 1218, 1189, 1156, 1139, 1137, 1132, 1120, 1123, 1152, 1185, 1198, 1198, 1203, 1219, 1232, 1237, 1242, 1246, 1247, 1251, 1267, 1290, 1295, 1276, 1252, 1247, 1261, 1276, 1282, 1280, 1274, 1267, 1266, 1270, 1269, 1257, 1249, 1262, 1294, 1331, 1365, 1397, 1428, 1455, 1482, 1514, 1548, 1570, 1573, 1561, 1546, 1536, 1540, 1570, 1628, 1702, 1780, 1864, 1963, 2078, 2202, 2333, 2484, 2660, 2851, 3037, 3210, 3375, 3532, 3672, 3781, 3850, 3873, 3844, 3757, 3620, 3449, 3256, 3049, 2838, 2643, 2477, 2338, 2217, 2112, 2026, 1953, 1879, 1799, 1726, 1674, 1637, 1593, 1532, 1466, 1414, 1381, 1355, 1331, 1311, 1296, 1280, 1253, 1220, 1191, 1171, 1154, 1135, 1113, 1093, 1075, 1067, 1077, 1104, 1131, 1144, 1141, 1133, 1126, 1117, 1107, 1100, 1091, 1071, 1040, 1012, 989, 959, 910, 858, 835, 849, 874, 884, 879, 882, 907, 942, 964, 963, 945, 917, 888, 863, 849, 841, 834, 829, 836, 857, 875, 872, 852, 835, 833, 848, 873, 908, 951, 994, 1030, 1056, 1074, 1082, 1086, 1089, 1092, 1092, 1088, 1085, 1083, 1075, 1060, 1046, 1045, 1052, 1052, 1040, 1021, 1008, 1007, 1018, 1029, 1030, 1017, 999, 987, 986, 991, 994, 988, 975, 965, 968, 985, 1005, 1018, 1025, 1023, 1008, 983, 960, 946, 928, 895, 861, 848, 867, 901, 931, 945, 943, 938, 940, 952, 956, 940, 917, 909, 918, 927, 928, 924, 920, 906, 885, 874, 885, 902, 904, 895, 891, 896, 901, 909, 931, 958, 969, 950, 921, 902, 896]
748H96j3k8l1j6LJ0RJ0J7J9J2%ppJK0M3N1L4Jk3k8k3j8j1QK7L3J9lj2lJ6K8K5K0K1K7K5Rn
743A156j6k4k7k1oOMnj0qkJ1K7L3K1RJ2K6L1J5oj9j8oJ3K7K2%k6l9l4k0nOJ2J5J1Jj2k0j6
738A118kJ5L2L9L4K1ROJ0J9K4J7ql9n0k9%RJMK4L7K6MpkPJ2Q%j0j3jK2M4N3M5J7j4l0k6k4
733A402l9o3o5m3j2J1J8J1jj0kJ4J9J0rk0k6k1jK5L8K3mk0k4k9l6l3k0pjjKRJ8J9Nk5n0n1
728A011k5KJ2POJ2J8K3L2M6N1M2K6J6J3J1J0J3J7J9J5QKnj7l0l4k4rqk0l2k5kJ3J2LNJ2J5
723A241Mj7k8k6k0k0k6k9k5k0j9j2OK5K3%l0m6m7m2l9l5k6rNJ7K6M4O2P1O3M8M2L9L1K0J3
719A264J1J0QJ6L4M3L6K2K2L7N2N4M5L5K6K3K6L6N4P2P8P3O0N4O2Q1J05J28J44J54J63J74
715C202J74J61J52J66J93K02J88J80K04K49K83K97L10L32L63L97M29M54M72M92N24N55N73
$$ y = [896, 883, 855, 824, 808, 811, 821, 830, 840, 857, 876, 888, 888, 881, 874, 875, 895, 938, 989, 1023, 1024, 1001, 973, 950, 932, 921, 929, 956, 989, 1008, 1005, 993, 990, 1006, 1034, 1059, 1079, 1100, 1127, 1152, 1161, 1156, 1140, 1116, 1089, 1068, 1062, 1068, 1072, 1067, 1057, 1049, 1047, 1058, 1085, 1118, 1139, 1148, 1160, 1186, 1217, 1232, 1226, 1207, 1189, 1183, 1196, 1223, 1245, 1245, 1219, 1180, 1146, 1126, 1121, 1127, 1139, 1154, 1165, 1166, 1154, 1134, 1118, 1116, 1131, 1163, 1202, 1236, 1257, 1266, 1272, 1282, 1301, 1325, 1342, 1334, 1295, 1245, 1216, 1216, 1225, 1226, 1230, 1254, 1291, 1317, 1321, 1314, 1312, 1319, 1331, 1339, 1339, 1329, 1316, 1315, 1337, 1381, 1434, 1479, 1496, 1482, 1452, 1426, 1402, 1363, 1300, 1235, 1192, 1180, 1191, 1209, 1220, 1219, 1209, 1207, 1221, 1240, 1250, 1241, 1221, 1195, 1174, 1173, 1198, 1236, 1259, 1255, 1235, 1211, 1182, 1146, 1113, 1093, 1086, 1085, 1084, 1086, 1095, 1113, 1132, 1137, 1112, 1062, 1011, 986, 988, 1000, 1007, 1013, 1025, 1043, 1066, 1098, 1144, 1195, 1237, 1263, 1279, 1292, 1303, 1313, 1326, 1343, 1362, 1377, 1385, 1387, 1382, 1365, 1335, 1301, 1277, 1268, 1260, 1240, 1208, 1183, 1181, 1194, 1206, 1209, 1214, 1226, 1241, 1245, 1228, 1200, 1174, 1154, 1134, 1108, 1079, 1054, 1034, 1015, 1003, 1009, 1034, 1057, 1057, 1027, 981, 934, 892, 853, 818, 792, 783, 788, 805, 831, 875, 937, 1008, 1071, 1119, 1161, 1200, 1231, 1251, 1264, 1275, 1285, 1293, 1309, 1343, 1386, 1422, 1444, 1466, 1503, 1555, 1609, 1654, 1689, 1715, 1738, 1764, 1800, 1854, 1926, 2004, 2077, 2137, 2191, 2253, 2334, 2439, 2567, 2711, 2865, 3028, 3202, 3376, 3537, 3689, 3855, 4048, 4250, 4438, 4618, 4822, 5071, 5354, 5651, 5961, 6293, 6656, 7053, 7482, 7936, 8408, 8900, 9424, 9979, 10552]
712A0552N82O01O33O70P09P57Q27R21J036J171J306J423J523J623J729J824J905J989K087
710C3868K200K325K469K646K850L070L297L525L750L972M206M475M788N162N617O188O908
708A01316P812Q926J0265J1839J3665J5762J8119K0703K3462K6349K9286L2166L4835L7029
706C91534L8310L8080L5711L0678K2673J1808j080j4371k6078l4639l9446m0821l9588l6679
704C36092l2918k8935k5135k1725j8781j6306j4245j2523j1073r854q816p907p098o385n768
702A08623n236m775m375m033l737l492l301l160l048k947k849k741k615k470k328k196k067
700E3253j933j815j731j677j624j558j496j457j433j407j369j320j263j199j126j049r70q98
698B7928q37p87p39o95o63o47o38o26o05n78n45n10m71m32l95l66l43l19k92k64k50k50k56
$$ y = [10552, 11134, 11735, 12368, 13038, 13747, 14504, 15331, 16252, 17288, 18459, 19765, 21188, 22711, 24334, 26063, 27887, 29792, 31781, 33868, 36068, 38393, 40862, 43508, 46358, 49428, 52725, 56250, 60000, 63972, 68178, 72653, 77441, 82603, 88220, 94408, 101316, 109128, 118054, 128319, 140158, 153823, 169585, 187704, 208407, 231869, 258218, 287504, 319670, 354505, 391534, 429844, 467924, 503635, 534313, 556986, 568794, 567714, 553343, 527265, 492626, 453180, 412359, 372771, 336092, 303174, 274239, 249104, 227379, 208598, 192292, 178047, 165524, 154451, 144597, 135781, 127874, 120776, 114391, 108623, 103387, 98612, 94237, 90204, 86467, 82975, 79674, 76514, 73466, 70519, 67670, 64929, 62314, 59844, 57516, 55320, 53253, 51320, 49505, 47774, 46097, 44473, 42915, 41419, 39962, 38529, 37122, 35753, 34433, 33170, 31971, 30845, 29796, 28826, 27928, 27091, 26304, 25565, 24870, 24207, 23560, 22922, 22296, 21691, 21113, 20568, 20058, 19587, 19155, 18760, 18394, 18051, 17732, 17440, 17176, 16926, 16676, 16420]
695A6420k50k41k40k48k51k38k20k09k00j95j95k02k02j82j51j29j25j34j47j63j74j73j66
692A1985j66j85j98j88j59j39j39j45j37j17j05j06j09r7o9m2m0o7j04j34j43j37j30j27j27
689H875j31j39j50j55j47j28j10j03j02j08j18j21j08q0o2o4p4p4o4o3o9o1m2k9m1o0o5n9
686F348n6n7n5n0n7p2q0p4o8o9o5m3j4lj6l1l2k3k1k9l5k8j5rj0j0j3k2l0l0k4l1n4p3o8m7
682D934l3l0k5j6ppnmj4m1p0q0p7p4o7m6j3J4K3J6Mj6l6m5l4j9j2j2rmpk0l4m1m1l6k4rln
677C975plLKlj0j5j4kJ0Rpj8j3nj0k2k0oql5n8n6l4j5j1j4j7j4mPOrk4j7OK4K6K0J7J4Qql0
671C618m8n4m3k5j5j6k3k1j2mnj3j8j0QK2K2J1Jm%J1K0J1j3k4j4Jok2k7k1k4l7l9j8OJ5J1
667C201Kj0k0j7%J2kk5l4j8RL2M3L6J5oj4qjNJ2K4K9K0Kj3j4nJLMJ0Rj0l3l7k2qqj5j1npr
$$ y = [16420, 16170, 15929, 15689, 15441, 15190, 14952, 14732, 14523, 14323, 14128, 13933, 13731, 13529, 13347, 13196, 13067, 12942, 12808, 12661, 12498, 12324, 12151, 11985, 11819, 11634, 11436, 11248, 11089, 10950, 10811, 10666, 10529, 10412, 10307, 10201, 10092, 9995, 9926, 9884, 9844, 9777, 9673, 9539, 9396, 9259, 9129, 9002, 8875, 8744, 8605, 8455, 8300, 8153, 8025, 7915, 7812, 7710, 7602, 7484, 7363, 7255, 7175, 7113, 7049, 6975, 6901, 6837, 6774, 6705, 6644, 6602, 6573, 6532, 6472, 6407, 6348, 6292, 6235, 6180, 6130, 6073, 6001, 5921, 5847, 5779, 5710, 5645, 5602, 5588, 5585, 5569, 5538, 5506, 5483, 5462, 5433, 5398, 5370, 5355, 5346, 5336, 5326, 5313, 5291, 5261, 5231, 5207, 5176, 5122, 5049, 4981, 4934, 4901, 4871, 4846, 4830, 4823, 4816, 4811, 4807, 4793, 4752, 4682, 4602, 4525, 4451, 4384, 4338, 4325, 4339, 4362, 4378, 4382, 4366, 4330, 4285, 4251, 4232, 4220, 4208, 4199, 4195, 4188, 4168, 4134, 4093, 4052, 4016, 3992, 3983, 3980, 3975, 3968, 3965, 3968, 3970, 3967, 3957, 3942, 3928, 3926, 3936, 3945, 3938, 3920, 3907, 3902, 3892, 3870, 3850, 3844, 3836, 3801, 3743, 3687, 3653, 3638, 3627, 3613, 3596, 3582, 3578, 3585, 3591, 3582, 3558, 3541, 3547, 3571, 3597, 3617, 3634, 3648, 3656, 3648, 3618, 3570, 3516, 3473, 3448, 3433, 3417, 3394, 3373, 3361, 3357, 3352, 3339, 3321, 3311, 3319, 3341, 3363, 3374, 3375, 3371, 3371, 3382, 3402, 3413, 3400, 3376, 3362, 3363, 3357, 3335, 3308, 3287, 3263, 3226, 3187, 3169, 3175, 3190, 3201, 3203, 3193, 3173, 3156, 3156, 3168, 3166, 3141, 3107, 3089, 3098, 3130, 3173, 3209, 3224, 3218, 3204, 3196, 3195, 3200, 3212, 3236, 3265, 3285, 3287, 3274, 3260, 3255, 3256, 3259, 3263, 3273, 3282, 3272, 3239, 3202, 3180, 3172, 3164, 3149, 3138, 3133, 3126, 3117]
661C117kROqk0j9j1kK%rk0k5k6k1pJ6L1K7J4J3K8L9L7L4L4K7Kl0m8m5k8j2lkJRJ4QJNJ8K2
656C176J2LMJj0k6k7j9j1j6k6l1k6k0k2k9k9j7nj0k5k3jK3L4L6L8K9QnMK6L9M4N6P2P0M8K6
651C371K2K4L1M5P0Q7P6M4J1j2k9l9l8k7k4l7n7o6n9m2k5j0jnj9l3l8l8l6k5%J6Pk1l3j4J7
647C093L2K2%k3l5k7JK4K4J1PJ9L8M8M9M7M0L7M4N6O5O7P2P9Q0P6P3P9Q4P9O0K9ql4l6k1j
642D250J8M3O8Q2Q2Q8J10J32J38J29J24J25J24J16R6O5K4k3p3j26j70j98k08k13k14j96j58
639D235j22j12j18j13r2o7m7k4omk0l3k3mLmoRL6N3M7K0j3l3m4n2n6m2j1J8K0pl5m0j6J8M3
634C358N0M7L8K4Mj8m3o1p2o9o3o0n7m7m0n0o7o6l2OK0J0JMJ1J2J0Nqk4k3mJ8K9L7M1L7K7
630B985K6M1N9O0M6K5Jk3l7l3j8j1j7k9l9m6n1m1qL5O4O5M2J4kj0j6k1k4k8l6m1l3j9j3j8
$$ y = [3117, 3115, 3124, 3130, 3122, 3102, 3083, 3072, 3070, 3072, 3072, 3063, 3043, 3018, 2992, 2971, 2964, 2980, 3011, 3038, 3052, 3065, 3093, 3132, 3169, 3203, 3237, 3264, 3266, 3236, 3188, 3143, 3115, 3103, 3100, 3098, 3099, 3108, 3122, 3130, 3131, 3136, 3154, 3176, 3188, 3191, 3195, 3196, 3186, 3160, 3133, 3114, 3103, 3087, 3061, 3030, 3004, 2984, 2962, 2933, 2904, 2887, 2882, 2872, 2847, 2824, 2823, 2846, 2880, 2916, 2954, 2983, 2991, 2986, 2990, 3016, 3055, 3099, 3155, 3227, 3297, 3345, 3371, 3393, 3417, 3448, 3493, 3563, 3650, 3726, 3770, 3781, 3769, 3740, 3701, 3663, 3636, 3612, 3575, 3518, 3452, 3393, 3351, 3326, 3316, 3315, 3310, 3291, 3258, 3220, 3182, 3146, 3121, 3121, 3137, 3144, 3123, 3090, 3076, 3093, 3125, 3147, 3147, 3124, 3089, 3062, 3063, 3087, 3111, 3122, 3129, 3148, 3186, 3234, 3283, 3330, 3370, 3407, 3451, 3507, 3572, 3639, 3711, 3790, 3870, 3946, 4019, 4098, 4182, 4261, 4321, 4350, 4342, 4308, 4272, 4251, 4250, 4268, 4311, 4379, 4461, 4543, 4631, 4741, 4873, 5011, 5140, 5264, 5389, 5513, 5629, 5725, 5790, 5814, 5791, 5718, 5592, 5422, 5224, 5016, 4803, 4589, 4393, 4235, 4113, 4001, 3883, 3770, 3678, 3611, 3564, 3540, 3534, 3530, 3510, 3477, 3454, 3450, 3453, 3449, 3443, 3452, 3488, 3541, 3588, 3608, 3595, 3562, 3518, 3466, 3410, 3368, 3357, 3375, 3395, 3388, 3353, 3313, 3297, 3315, 3358, 3408, 3455, 3493, 3517, 3521, 3503, 3460, 3399, 3327, 3258, 3195, 3135, 3078, 3031, 2991, 2941, 2874, 2808, 2776, 2782, 2802, 2812, 2813, 2817, 2828, 2840, 2850, 2855, 2847, 2823, 2800, 2796, 2814, 2843, 2880, 2921, 2958, 2985, 3011, 3052, 3111, 3171, 3217, 3242, 3243, 3220, 3183, 3150, 3132, 3121, 3104, 3075, 3036, 2990, 2939, 2898, 2890, 2925, 2989, 3054, 3096, 3110, 3108, 3098, 3082, 3061, 3037, 3009, 2973, 2932, 2899, 2880, 2867, 2849]
625B849k3j8rjPJ6J8J4J0J2J6J7K4M0N6O3O6P5Q5Q5O9N1L7K6K2K2J7NnjQJl0o2p0o0m8m8m7
620C289l6j7mqk0k1j4j5l0m1l1j3qj9k1pQQmj5k4l0k9j8oKOPkj5j4omj8k9j9KJ5J6J2RRK2
615B867M7O1N1K8Oj3l7n3l7lK0J7Lrk3m4n0l2lJ6J8J4J1RJ3K5K8J3qk0k2k1k0j0J3M0N0L4
611B979Nk0l0l4m3n0m4k5qj0k2l1l6l9l0j4%lj6k4k2j8j4kOJj9l8l9k8j4nRJ9J8Jk2l6l3j9
606B250jJ7L7M6L6J5JLR%j8k8k0o%%oj2j7k4k8l1k9k3k2k9l5k7pRJ6J5Qpj7j3MJ4J0%npqq
600B062%J1J6J7J7K1J7Pjnoj2k3l7m1k9mJ3Pj3k5k1j0jOQlk5l8k7JK1K0Pj0j8j7nJ3K7L9N5
595B014P3P9P0N5N3O4P6Q0P6P8Q4Q5P8O3N1M9O7R7J30J49J54J54J60J75J95K16K42K72K94
592E433L03L03L05L22L46L76M11M53M95N27N53N89O45P21Q11R15J035J169J320J490J696J952
$$ y = [2849, 2826, 2808, 2799, 2798, 2805, 2821, 2839, 2853, 2863, 2875, 2891, 2908, 2932, 2972, 3028, 3091, 3157, 3232, 3317, 3402, 3471, 3522, 3559, 3585, 3607, 3629, 3646, 3651, 3646, 3645, 3653, 3654, 3624, 3562, 3492, 3432, 3384, 3336, 3289, 3253, 3236, 3232, 3224, 3204, 3183, 3169, 3154, 3124, 3083, 3052, 3039, 3031, 3012, 2991, 2984, 2992, 3000, 2996, 2981, 2957, 2927, 2898, 2880, 2874, 2876, 2882, 2889, 2887, 2872, 2858, 2852, 2848, 2830, 2801, 2782, 2784, 2799, 2815, 2827, 2836, 2845, 2867, 2914, 2975, 3026, 3054, 3060, 3047, 3010, 2957, 2920, 2917, 2937, 2954, 2957, 2948, 2925, 2881, 2831, 2799, 2796, 2812, 2830, 2844, 2855, 2864, 2877, 2902, 2930, 2943, 2935, 2915, 2893, 2872, 2852, 2842, 2855, 2895, 2945, 2979, 2984, 2964, 2934, 2900, 2857, 2807, 2763, 2738, 2730, 2720, 2698, 2667, 2631, 2592, 2562, 2548, 2548, 2545, 2529, 2505, 2483, 2465, 2451, 2449, 2455, 2456, 2437, 2399, 2360, 2332, 2318, 2313, 2322, 2341, 2359, 2360, 2338, 2302, 2269, 2250, 2249, 2266, 2303, 2349, 2385, 2400, 2401, 2404, 2413, 2413, 2395, 2367, 2347, 2341, 2341, 2341, 2335, 2323, 2306, 2282, 2254, 2223, 2194, 2171, 2149, 2120, 2085, 2058, 2051, 2060, 2076, 2091, 2099, 2092, 2075, 2062, 2066, 2080, 2090, 2090, 2085, 2078, 2070, 2062, 2062, 2073, 2089, 2106, 2123, 2144, 2161, 2168, 2167, 2162, 2156, 2144, 2121, 2084, 2043, 2014, 2010, 2023, 2030, 2017, 1992, 1971, 1961, 1960, 1966, 1974, 1971, 1946, 1908, 1881, 1882, 1903, 1923, 1930, 1920, 1902, 1885, 1880, 1893, 1920, 1959, 2014, 2087, 2166, 2236, 2291, 2344, 2408, 2484, 2564, 2640, 2718, 2802, 2887, 2965, 3028, 3079, 3128, 3195, 3292, 3422, 3571, 3725, 3879, 4039, 4214, 4409, 4625, 4867, 5139, 5433, 5736, 6039, 6344, 6666, 7012, 7388, 7799, 8252, 8747, 9274, 9827, 10416, 11061, 11782, 12593, 13508, 14543, 15712, 17032, 18522, 20218, 22170]
589B2170K260K622L030L489L997M555N148N740O259O588O582O082M953L146P69j850m250o008
587G5282o934p092o693n964n092m226l454k800k253j814j478j217j000q13o63n48m51l64k87
584B2139k08j11JJ07K00K87L78M63N47O41P49Q56R54J063J210J407J651J947K306K749L293
582D2629L946M698N543O490P548Q696R893J1105J2267J3194J3573J3025J1226P973L337k167
580A72976p579j1860j4368j5082j4427j2953j1140r318p670o266n120m228l554l028k596k242
578D1545j965j737j538j376j259j161j050r20p97o87n82m76l78k93k18j56j05m7L4J41K63
575B7238L99N72P84J025J285J580J915K292K712L191L729M306M887N442N897O137O013N378
573H4782M111K181k65k844n065o552p208p166o648n858m977m146l442k870k398k014j712j474
$$ y = [22170, 24430, 27052, 30082, 33571, 37568, 42123, 47271, 53011, 59270, 65858, 72440, 78522, 83475, 86621, 87390, 85540, 81290, 75282, 68348, 61256, 54563, 48599, 43507, 39281, 35827, 33027, 30774, 28960, 27482, 26265, 25265, 24452, 23789, 23241, 22790, 22426, 22139, 21931, 21820, 21821, 21928, 22128, 22415, 22793, 23256, 23803, 24444, 25193, 26049, 27003, 28066, 29276, 30683, 32334, 34281, 36587, 39336, 42629, 46575, 51273, 56816, 63306, 70854, 79550, 89443, 100548, 112815, 126009, 139582, 152607, 163833, 171806, 175143, 172976, 165397, 153537, 139169, 124087, 109660, 96707, 85567, 76249, 68579, 62313, 57193, 52965, 49411, 46383, 43787, 41545, 39580, 37843, 36305, 34929, 33670, 32509, 31459, 30539, 29742, 29055, 28473, 27997, 27619, 27326, 27108, 26952, 26847, 26800, 26834, 26975, 27238, 27637, 28209, 28993, 30018, 31303, 32883, 34798, 37090, 39802, 42993, 46722, 51028, 55915, 61357, 67254, 73391, 79404, 84782, 88893, 91074, 90809, 87965, 82900, 76348, 69140, 61974, 55326, 49468, 44491, 40345, 36903, 34033, 31635, 29621, 27909, 26435]
571B6435j273j107r82q92q23p75p53p52p42p08o66o19n63n00m48m24m07l77l40l17l07k94
568A2366k77k70k70k61k44k30k25k17k03k00k06k10k05j92j72j48j29j27j37j34j12q6p8p7
565G956p0o5o8p6p9q2r0r6q7o7n0m0l9m4n5o7o3m8m3n9q6j02j00r3r0r2q1n1k2prj2j6k5l8
561E844m4l5l1l8m8m5l2k5k6k8l0l3l5l2k7l1l9l9k3MK7L6L0J6Mjrk4m6n7n3m4m0m4m9m7m2
556D864l3k3k1k2k6k3k0j7k3l3l7l4k7k9k9j3J6L0J9JmNQQJ1J6Qj0j4kPjk0l3l4k3mRPlLK2
551D476L0J5okJ9L1K6J1ok7m0l8k9k7k9j8RK7K3Onrj2j0MK7M4M6L7K8J8MrqPK6K5J6J4K6M2
546D762N0N7P2Q8J02J17J34J41J25R4N9K1l1q9j24j26j11r3p9o7o0n4m2k3j0j5k1k2k1l1m2
543D761l4lK7L6J8j0k2j5kNQJ8L6M9N9O9P8P3N5M2M3M3L1K7M8Q4J08J18J31J54J72J81J98
$$ y = [26435, 25162, 24055, 23073, 22181, 21358, 20583, 19830, 19078, 18336, 17628, 16962, 16343, 15780, 15280, 14832, 14408, 14001, 13624, 13284, 12967, 12660, 12366, 12089, 11819, 11549, 11288, 11044, 10814, 10589, 10372, 10169, 9969, 9763, 9553, 9348, 9156, 8984, 8836, 8707, 8580, 8443, 8309, 8197, 8111, 8033, 7956, 7886, 7821, 7753, 7677, 7598, 7516, 7426, 7330, 7243, 7176, 7126, 7086, 7047, 7003, 6948, 6881, 6818, 6770, 6727, 6668, 6582, 6480, 6380, 6287, 6197, 6105, 6024, 5973, 5951, 5944, 5935, 5923, 5907, 5882, 5844, 5800, 5765, 5734, 5696, 5648, 5603, 5571, 5546, 5520, 5492, 5462, 5429, 5394, 5362, 5335, 5304, 5265, 5226, 5203, 5207, 5234, 5270, 5300, 5316, 5320, 5319, 5310, 5286, 5240, 5183, 5130, 5086, 5046, 5002, 4953, 4906, 4864, 4831, 4808, 4787, 4765, 4739, 4716, 4696, 4679, 4656, 4623, 4586, 4552, 4525, 4496, 4467, 4454, 4470, 4500, 4519, 4520, 4516, 4521, 4529, 4537, 4548, 4564, 4572, 4562, 4548, 4546, 4553, 4552, 4532, 4499, 4465, 4442, 4438, 4447, 4454, 4451, 4454, 4476, 4506, 4521, 4515, 4513, 4532, 4563, 4589, 4600, 4594, 4567, 4527, 4489, 4460, 4433, 4404, 4386, 4395, 4422, 4445, 4451, 4446, 4437, 4425, 4415, 4419, 4446, 4490, 4536, 4573, 4601, 4619, 4623, 4614, 4606, 4613, 4639, 4664, 4680, 4694, 4720, 4762, 4812, 4869, 4941, 5029, 5131, 5248, 5382, 5523, 5648, 5742, 5801, 5822, 5791, 5702, 5578, 5452, 5341, 5248, 5169, 5102, 5042, 4988, 4946, 4923, 4913, 4898, 4877, 4855, 4834, 4803, 4761, 4727, 4724, 4751, 4787, 4805, 4795, 4773, 4758, 4756, 4761, 4769, 4787, 4823, 4872, 4931, 5000, 5078, 5151, 5206, 5248, 5291, 5334, 5365, 5392, 5440, 5524, 5632, 5750, 5881, 6035, 6207, 6388, 6586]
539F586K26K44K31J91J33O3j9j07j91k56k90k80k36j84j40j06q4p4q2q6p6n7m0k2%J5Qj6k8
535E323j6LJ1J0RJ1J1QJ0J8L7N9P5P2N6M3M3M7M3L4L6M9O1O0N7O5Q3R7J04J12J25J35J28J07
531G126Q5O4K7k3o9r4r8r2q2o2l5j3OK8M9N7N4N2N6N0K8QJ4M5P6Q7Q4Q3Q2P8P3P0P4Q5R9J11
526H183J15J16J16J22J33J48J65J80J87J87J84J84J82J78J73J77J95K26K58K72K64K50K49
524A2444K65K84K99L10L22L21L01K70K44K24J90J38P0jp2j49k33l21m02m64m97n07n08n01
521A2027m85m52m15l78l44l14k88k68k56k47k41k34k13j78j41j21j20j28j34j26j05q1p3q1
518F604q7p2m7l4m5n8n0k4%J3K0K7L1J9nl8o4p7p7p0p1q1j03j27j39j30r9o5m8n0n2m2l0l4
514D895m7m8k8qmj5k8l2k8j2QK5K1jk1k6j9j4k3l7m5m6m8m7l5j1J0J2mj7j6rmJJ0J9K2K2K3
$$ y = [6586, 6812, 7056, 7287, 7478, 7611, 7674, 7655, 7548, 7357, 7101, 6811, 6531, 6295, 6111, 5971, 5865, 5781, 5707, 5625, 5539, 5463, 5406, 5366, 5344, 5344, 5359, 5367, 5351, 5323, 5307, 5310, 5321, 5331, 5340, 5351, 5362, 5370, 5380, 5398, 5435, 5494, 5569, 5641, 5697, 5740, 5783, 5830, 5873, 5907, 5943, 5992, 6053, 6113, 6170, 6235, 6318, 6415, 6519, 6631, 6756, 6891, 7019, 7126, 7211, 7275, 7302, 7279, 7210, 7116, 7018, 6926, 6844, 6782, 6747, 6734, 6740, 6768, 6817, 6874, 6928, 6980, 7036, 7086, 7114, 7122, 7136, 7181, 7257, 7344, 7428, 7511, 7593, 7671, 7744, 7814, 7888, 7973, 8072, 8183, 8298, 8414, 8530, 8652, 8785, 8933, 9098, 9278, 9465, 9652, 9836, 10020, 10202, 10380, 10553, 10730, 10925, 11151, 11409, 11681, 11945, 12195, 12444, 12709, 12993, 13292, 13602, 13924, 14245, 14546, 14816, 15060, 15284, 15474, 15612, 15682, 15681, 15609, 15460, 15227, 14906, 14504, 14040, 13543, 13036, 12528, 12027, 11542, 11090, 10675, 10297, 9953, 9639, 9351, 9083, 8827, 8580, 8339, 8105, 7892, 7714, 7573, 7452, 7332, 7204, 7070, 6944, 6839, 6758, 6685, 6604, 6517, 6445, 6398, 6364, 6319, 6261, 6211, 6187, 6187, 6200, 6220, 6247, 6278, 6297, 6292, 6254, 6190, 6113, 6036, 5966, 5895, 5814, 5711, 5584, 5445, 5315, 5216, 5151, 5103, 5053, 5001, 4959, 4929, 4895, 4848, 4800, 4772, 4764, 4760, 4745, 4717, 4685, 4657, 4645, 4653, 4678, 4699, 4698, 4677, 4651, 4632, 4618, 4595, 4558, 4513, 4467, 4419, 4372, 4337, 4326, 4336, 4348, 4344, 4327, 4311, 4302, 4298, 4299, 4309, 4328, 4350, 4372, 4395]
509D395K5J4nk0k6k9l7m1l7k9l5n6p1n8k0J7K6J0rj9k6l4l6k4mM%%PJ7J3lj9k6j7J1M1M7J6
504C962l3o8p1n5l7l4l8l6l1k7l0k2OL3L0pm3m3j7LPNMmj9l4m5m9m8l5qJ8K9K4Qj2k6k6j7
499C214j1j6k0j1NJ0MLJ8L4L1J1%J2K7K0qk7k5j6k1l0k6j1ok2l7l7k3j1ppmjJjj2k3k6j5j
494B935NJlllJQQol0m4m2l1k4k0rQK1K6K3J4kj8k4qJ6L1K7J7J7K1J6MlJLnrkRNj1k6k6j7j1
489B840rrqmlj5l2m0k8mJ4J8J4J3QJ%OQNJ0K2K9J4j7m2m3k5JJ8J5%nLJ4J0ok1k3k1j7j6j8
483B657k3k5k2j7j9j8oJ7L1L0K0Oj0k7m2m5l4j3QJ4QNJ5K8L1K3K1K9L3K8J6Qkj3j1J0L1L5
479B777K4J6J6J5%k2m1m5l7k5k6l7l8j5J8L3K3J2J1J3Pjnj1k3k7k5k7m6n7l7QL9L6J7Jqj5
474B498j3MK4K8K3J9K1J7KrpJRK0L2L1J0j8l3k9j6rmjJKKkj8l6m0k4nK%NJ3J1rl1m1l3j8l
$$ y = [4395, 4420, 4434, 4429, 4409, 4383, 4354, 4317, 4276, 4239, 4210, 4175, 4119, 4048, 3990, 3970, 3987, 4013, 4023, 4014, 3995, 3969, 3935, 3899, 3875, 3871, 3875, 3875, 3875, 3882, 3899, 3912, 3909, 3890, 3864, 3847, 3858, 3899, 3946, 3962, 3929, 3861, 3790, 3735, 3698, 3664, 3626, 3590, 3559, 3532, 3502, 3480, 3486, 3519, 3549, 3542, 3499, 3456, 3439, 3442, 3449, 3454, 3458, 3454, 3435, 3401, 3356, 3307, 3259, 3224, 3216, 3234, 3263, 3287, 3295, 3283, 3257, 3231, 3214, 3203, 3187, 3167, 3156, 3161, 3171, 3175, 3178, 3196, 3230, 3261, 3272, 3272, 3284, 3311, 3331, 3323, 3296, 3271, 3255, 3234, 3204, 3178, 3167, 3161, 3139, 3102, 3065, 3042, 3031, 3024, 3017, 3013, 3012, 3013, 3012, 3000, 2977, 2951, 2936, 2935, 2940, 2941, 2938, 2935, 2932, 2933, 2941, 2949, 2943, 2913, 2869, 2827, 2796, 2772, 2752, 2743, 2751, 2772, 2798, 2821, 2835, 2833, 2815, 2791, 2783, 2799, 2830, 2857, 2874, 2891, 2912, 2928, 2932, 2929, 2930, 2933, 2928, 2919, 2917, 2926, 2931, 2920, 2894, 2868, 2851, 2840, 2831, 2822, 2814, 2810, 2807, 2792, 2760, 2720, 2692, 2688, 2702, 2720, 2734, 2747, 2755, 2756, 2756, 2762, 2770, 2775, 2785, 2807, 2836, 2850, 2833, 2791, 2748, 2723, 2724, 2742, 2757, 2757, 2752, 2755, 2769, 2779, 2773, 2752, 2729, 2708, 2691, 2675, 2657, 2634, 2609, 2587, 2570, 2551, 2533, 2527, 2544, 2575, 2605, 2625, 2631, 2621, 2594, 2552, 2507, 2473, 2460, 2468, 2482, 2490, 2495, 2510, 2538, 2569, 2592, 2613, 2642, 2675, 2703, 2719, 2727, 2725, 2712, 2701, 2711, 2742, 2777, 2801, 2817, 2833, 2848, 2848, 2826, 2785, 2740, 2703, 2678, 2652, 2615, 2577, 2562, 2580, 2613, 2636, 2648, 2659, 2672, 2679, 2678, 2673, 2662, 2639, 2612, 2587, 2560, 2514, 2457, 2420, 2428, 2467, 2503, 2520, 2521, 2513, 2498, 2485, 2489, 2513, 2541, 2564, 2583, 2604, 2621, 2623, 2614, 2607, 2608, 2617, 2637, 2669, 2700, 2710, 2692, 2659, 2630, 2614, 2605, 2601, 2600, 2601, 2603, 2605, 2603, 2585, 2549, 2509, 2485, 2480, 2482, 2482, 2487, 2500, 2511, 2502, 2471, 2430, 2397, 2379, 2376]
469B376OQJ0J1J2J3J9K9L1J5pk2k1j5qjLLmn%Nmj7j8oPRJ2K0K7K0pl0k9qJ1J1OJ0J2Kj3j6
463B457qoj6j9pJoj8j8j0ppLJ6J7Kj7k3k1j2LJ7J5KokKlj0j5k1l2l0oK1K1RRK5K9J1rrNJ6
458B343J7J1kk0l1l4k8k2j5j0j0k0k6k1qK%mnMK4M4M7K8Kj0p%%nj0j4j7j6j4j9k3j6PK9L4
453B185K9K4K1J2ok8m5m9l5rJ4K1J6RKpj7j4kLj1l0l0pJ9L1K3PjLJ4J6Oj0j9k1j9j5kJ3J7
448B108Mj6k8k4j4roJJ0J1LmJJ3J8J2PNjj3k3j7opk1l0k6j8j2oJ4L2K8Jl1m0k3JJ4J4J1K1
443A954L9N1N0L3km1o3n2j8jrk3j3QRrj3QL1L3J9RLmqkON%LJ1Pqj9j2%Llj1k0k7l1k4pJ6L8
437A916M5K8lk7j9OK4J6mj9j5lPLnj1oNJ0J5K3L4M3L8K1ql9o1o3m7k0KJ9K4K2J3J0J6K5K8
432B043J6ok6l3k7j5j3j6j4lKj3l5m1k0OJ8J0MRK2K8K3J1JjNRJj0j5q%K%%PQpl0l7j8J3K7
$$ y = [2376, 2382, 2390, 2400, 2411, 2423, 2436, 2455, 2484, 2515, 2530, 2523, 2501, 2480, 2465, 2457, 2456, 2459, 2462, 2458, 2453, 2453, 2458, 2454, 2437, 2419, 2413, 2420, 2429, 2441, 2461, 2488, 2508, 2501, 2471, 2442, 2434, 2445, 2456, 2462, 2472, 2484, 2486, 2473, 2457, 2449, 2443, 2427, 2408, 2401, 2402, 2396, 2378, 2360, 2350, 2343, 2336, 2339, 2355, 2372, 2374, 2357, 2334, 2313, 2301, 2304, 2321, 2336, 2338, 2332, 2330, 2332, 2329, 2319, 2304, 2283, 2251, 2221, 2215, 2236, 2257, 2266, 2275, 2300, 2329, 2340, 2331, 2322, 2327, 2343, 2360, 2371, 2369, 2349, 2318, 2284, 2256, 2234, 2219, 2209, 2199, 2179, 2153, 2132, 2124, 2126, 2126, 2122, 2117, 2121, 2145, 2189, 2236, 2264, 2266, 2256, 2249, 2249, 2249, 2244, 2234, 2220, 2203, 2187, 2173, 2154, 2131, 2115, 2122, 2151, 2185, 2214, 2238, 2259, 2271, 2265, 2237, 2192, 2143, 2108, 2099, 2113, 2134, 2150, 2159, 2161, 2154, 2137, 2123, 2121, 2124, 2113, 2083, 2053, 2046, 2065, 2096, 2119, 2126, 2125, 2128, 2142, 2158, 2164, 2154, 2135, 2114, 2095, 2080, 2078, 2091, 2108, 2112, 2096, 2068, 2044, 2030, 2021, 2015, 2016, 2026, 2037, 2040, 2036, 2037, 2050, 2068, 2080, 2087, 2092, 2091, 2078, 2055, 2038, 2032, 2025, 2004, 1974, 1948, 1930, 1918, 1912, 1926, 1958, 1986, 1987, 1956, 1916, 1893, 1894, 1908, 1922, 1933, 1954, 1993, 2044, 2094, 2127, 2125, 2084, 2021, 1969, 1951, 1950, 1941, 1918, 1905, 1913, 1922, 1913, 1900, 1908, 1939, 1972, 1991, 2000, 2003, 1999, 1991, 1989, 1995, 2000, 2000, 2003, 2014, 2021, 2013, 1994, 1982, 1982, 1985, 1982, 1971, 1951, 1924, 1893, 1869, 1862, 1878, 1916, 1961, 1989, 1986, 1959, 1940, 1946, 1970, 1986, 1982, 1963, 1948, 1945, 1952, 1955, 1950, 1939, 1933, 1938, 1948, 1963, 1986, 2020, 2063, 2101, 2122, 2114, 2075, 2014, 1951, 1904, 1884, 1886, 1905, 1929, 1951, 1964, 1974, 1990, 2015, 2043, 2059, 2053, 2027, 1994, 1967, 1952, 1939, 1923, 1909, 1906, 1908, 1895, 1860, 1819, 1799, 1805, 1823, 1833, 1837, 1846, 1868, 1896, 1919, 1930, 1931, 1930, 1935, 1944, 1945, 1935, 1920, 1912, 1912, 1914, 1914, 1914, 1921, 1929, 1922, 1892, 1855, 1837, 1850, 1877]
427A877J7JmKOKqj5j3lQJ3Mrj5j1JJ2J6J6J1Omj9l2k9j1PKj7k8j9l%mmOJ4J5J2O%pj3j4oQ
421A774J8J7KqnOJ1N%JMQJ2J0JlOK4L3K6J7J4J5J4Pnk0l0k5pJ3K4K7K5J6%rokqk0j8kJ8L6
416B016M9N5M8L2K6M0N7O5O1N1L9K8K1J8J4Mnpqk1l9m7l7k5j8j9j9k5m7p3q5p0l7oQJ0J1J3
411B078Pj2k6k0nrm1o0l4K0M6K3j5l0j3RK5L7M1L1Oj2j3njoj3j6j2lLJj2k3k0j3j3k0k3j1
406A846RK4K4J0mqJPmk5l4j8PJ7QnnOJ4J1RRROjlklpj2j2rjQJ1Oqj8j7pJQJ6K2J6KoKJ1Mq
400A907mPOj3k4j3NPnj0llj6k4j5LJ5J7J0%j6k1rQJ1MjJLjnmnolnj8l2k5kJ4Nj5k1j2%J0K3
394A725L2K8J7J0Mj1k2j9j0j0j7oJ6K3Oj1oKoj9j3NJ4Pmj2k2l1k8j3%ORJ2J2RJ1J5J4Lqj3
389A699j5k0k5k2j3%J0J2P%mj0j1mJ9M6N4M1K2J2J0Mlj2k2k6j5NJ3Jj3j5poj3j4nLPJ2J7J3
$$ y = [1877, 1894, 1895, 1891, 1893, 1899, 1901, 1893, 1878, 1865, 1862, 1870, 1883, 1887, 1878, 1863, 1852, 1853, 1865, 1881, 1897, 1908, 1914, 1910, 1891, 1859, 1830, 1819, 1826, 1828, 1811, 1783, 1764, 1761, 1761, 1757, 1753, 1759, 1773, 1788, 1800, 1806, 1806, 1799, 1786, 1772, 1766, 1774, 1792, 1809, 1811, 1803, 1798, 1804, 1815, 1820, 1820, 1821, 1825, 1833, 1845, 1855, 1856, 1853, 1859, 1883, 1916, 1942, 1959, 1973, 1988, 2002, 2009, 2004, 1984, 1954, 1929, 1922, 1935, 1959, 1986, 2011, 2027, 2027, 2018, 2012, 2010, 2002, 1982, 1964, 1962, 1980, 2016, 2065, 2120, 2168, 2200, 2226, 2266, 2323, 2388, 2449, 2500, 2539, 2567, 2588, 2606, 2620, 2624, 2619, 2612, 2604, 2583, 2544, 2497, 2460, 2435, 2417, 2398, 2379, 2354, 2307, 2234, 2149, 2079, 2042, 2036, 2044, 2054, 2065, 2078, 2085, 2073, 2047, 2027, 2022, 2013, 1972, 1912, 1878, 1898, 1944, 1967, 1952, 1922, 1909, 1918, 1943, 1980, 2021, 2052, 2058, 2046, 2033, 2028, 2027, 2021, 2008, 1992, 1980, 1977, 1980, 1981, 1969, 1946, 1926, 1913, 1900, 1880, 1857, 1846, 1855, 1879, 1903, 1913, 1909, 1901, 1902, 1909, 1905, 1880, 1846, 1828, 1835, 1852, 1860, 1855, 1850, 1856, 1870, 1881, 1890, 1899, 1908, 1914, 1913, 1910, 1908, 1905, 1898, 1886, 1874, 1865, 1864, 1872, 1883, 1889, 1881, 1863, 1846, 1839, 1840, 1848, 1864, 1886, 1902, 1904, 1898, 1900, 1911, 1915, 1907, 1903, 1910, 1916, 1903, 1879, 1866, 1871, 1878, 1873, 1863, 1860, 1857, 1841, 1817, 1802, 1805, 1820, 1837, 1847, 1847, 1831, 1810, 1801, 1809, 1820, 1824, 1823, 1824, 1827, 1826, 1821, 1817, 1812, 1806, 1803, 1798, 1780, 1748, 1723, 1721, 1735, 1740, 1725, 1704, 1692, 1692, 1702, 1725, 1757, 1785, 1802, 1812, 1816, 1805, 1783, 1764, 1754, 1744, 1727, 1721, 1737, 1760, 1766, 1755, 1749, 1751, 1745, 1726, 1713, 1718, 1732, 1739, 1735, 1723, 1701, 1670, 1642, 1629, 1629, 1635, 1644, 1656, 1668, 1677, 1688, 1703, 1717, 1720, 1712, 1699, 1684, 1664, 1639, 1617, 1604, 1604, 1614, 1626, 1633, 1633, 1629, 1619, 1608, 1604, 1623, 1669, 1723, 1764, 1786, 1798, 1808, 1812, 1809, 1797, 1775, 1749, 1734, 1739, 1752, 1753, 1740, 1725, 1718, 1712, 1699, 1685, 1680, 1683, 1690, 1702, 1719, 1732]
384A732%j3j3qqqLJ5J1j2k6j6KNLK3O0Q1O4L2J8J8J0poJ7L7L5J9N%KJ6L1L1J5LJ5L5M3M0M5
378B349O0P5Q8J05J18J08Q0N7N3N2M2K3Mj5l7m3l0j0nj1j4qqj7k3j6kJ0J3J1KolJ6L2K9J5
374C094MOJ5K3K7K7K4K3L2M5M9M5M0M9O4P8Q7J06J34J63J80J85J85J84J82J80J68J29N6l7
370E547j21j78k09k15k01j74j50j37j28j13r7r2r6r6q5o3m5l2k6k5l0l2k8k1j3j0ok%nj6k4
366C077k8k9k8k0kK0L5L6K8K7L4L9L4K6L7N9O9N9M5M1L7J9JlKrm5p8r0r0r8j03r3p3n7m4k6
362B809j5k3l5l0j5j2k8l7k9k0k8m2m0k4j1rnjkj3j8j6j3j8k8l2k5pJ3K4K2Qlomloj4k1j7
357B226pJmj7k2k1k4l1l1k0j0j4k3k1j1mmJRJ7J2Krj8k4j5LK1J7JrnJlnLQlk8m0k4KJ6J7J5
351A925J0N%MJ2J3Lj5l0l9l6k2j2j0j3nOLpnRJ6Kj5j1Jjj4k0j0JML%pj0KK7L7K0j0k2j6oJ
$$ y = [1732, 1732, 1719, 1706, 1698, 1690, 1682, 1685, 1700, 1711, 1699, 1673, 1657, 1659, 1664, 1667, 1690, 1750, 1831, 1895, 1927, 1945, 1963, 1973, 1966, 1960, 1977, 2014, 2049, 2068, 2073, 2073, 2075, 2091, 2122, 2153, 2168, 2171, 2186, 2221, 2264, 2304, 2349, 2409, 2484, 2572, 2677, 2795, 2903, 2983, 3040, 3093, 3145, 3187, 3210, 3214, 3199, 3162, 3119, 3089, 3079, 3074, 3063, 3049, 3041, 3033, 3016, 2993, 2977, 2975, 2985, 2998, 3009, 3011, 3005, 3002, 3018, 3050, 3079, 3094, 3098, 3104, 3119, 3142, 3169, 3196, 3220, 3243, 3275, 3320, 3369, 3414, 3454, 3503, 3567, 3645, 3732, 3838, 3972, 4135, 4315, 4500, 4685, 4869, 5051, 5231, 5399, 5528, 5584, 5547, 5426, 5248, 5039, 4824, 4623, 4449, 4299, 4162, 4034, 3921, 3824, 3732, 3636, 3540, 3455, 3392, 3347, 3315, 3289, 3264, 3234, 3202, 3174, 3153, 3140, 3130, 3124, 3122, 3122, 3117, 3101, 3077, 3049, 3020, 2992, 2972, 2970, 2990, 3025, 3061, 3089, 3116, 3150, 3189, 3223, 3249, 3286, 3345, 3414, 3473, 3518, 3559, 3596, 3615, 3616, 3613, 3615, 3606, 3561, 3483, 3393, 3303, 3205, 3102, 3009, 2936, 2879, 2835, 2809, 2794, 2771, 2736, 2706, 2691, 2679, 2651, 2614, 2585, 2565, 2537, 2495, 2455, 2431, 2420, 2411, 2406, 2405, 2403, 2390, 2372, 2356, 2343, 2325, 2297, 2265, 2240, 2233, 2246, 2270, 2292, 2300, 2297, 2291, 2287, 2284, 2278, 2264, 2243, 2226, 2219, 2220, 2216, 2199, 2177, 2156, 2132, 2101, 2070, 2050, 2040, 2026, 2003, 1982, 1971, 1967, 1963, 1964, 1973, 1990, 2002, 2004, 1995, 1977, 1953, 1938, 1941, 1962, 1979, 1980, 1971, 1966, 1967, 1964, 1959, 1962, 1970, 1967, 1939, 1899, 1875, 1877, 1893, 1910, 1925, 1935, 1940, 1940, 1944, 1956, 1969, 1972, 1957, 1927, 1888, 1852, 1830, 1818, 1808, 1795, 1790, 1796, 1799, 1792, 1787, 1796, 1812, 1814, 1799, 1788, 1789, 1788, 1774, 1754, 1744, 1745, 1749, 1752, 1752, 1745, 1735, 1737, 1764, 1801, 1821, 1811, 1789, 1773, 1767, 1768]
346A768RJ9K0J0lj5j8j7j6k1l0k8j0J8L1K3Mj4j9j4okj2k3k5j4oomOJ7J3krkJ1K5L5L2J2j3
341A724k5j8kJ0Pok6m2m0k4j0lMJ3J7J4J4K5K8J7KPK4K3kk8k9j4lkkJKKORRMJOJ1Lj3k9l0
335A635j9mJ3K7L4K8J0j7l9m1k8qLNLKMNRJ3J2KpmQOj4l6l7j8%NMNNPNN%j0k0k6k8l4l7k7
330A401mK3L6K6Qkk%nj1rj%nj1j2qNK2L3K5OmJQPNRQJlKQJn%RQ%QK2J9pk7k0kNMJ0K0J4j0
323A606l0l5k4j2LJ7K4J6mj8j6nMLoj3j0JJ1J0Jml%nj9k1jL3N3N0L4J9Ork2k5j8j2oLJ5J7
318A608Kj7k1j3nqoRL0M1L3J4j2l2m2m0m1m2l2qJ4K0J9K9M3L6Nk0j6%LnmJnj4j6oJKJ2K6K9
313A572J5OJ5K6J7j2l2l5k9k6k1j1kJjlljQK4L9M1K0j2k7j7JLj2k1j5pj2j2MK5L1J8Knrrp
308A527qj8l5l7k3kJ2J6J3QPJ4K1J4joKRK%J0K1J4lnPQmj4jK3L4K6Oj3k8l3k7j7qjOJ4J8J1
$$ y = [1768, 1777, 1796, 1816, 1826, 1823, 1808, 1790, 1773, 1757, 1736, 1706, 1678, 1668, 1686, 1717, 1740, 1744, 1730, 1711, 1697, 1691, 1689, 1677, 1654, 1629, 1615, 1609, 1603, 1599, 1605, 1622, 1635, 1633, 1624, 1622, 1633, 1658, 1693, 1725, 1737, 1724, 1699, 1681, 1679, 1689, 1696, 1690, 1664, 1622, 1582, 1558, 1548, 1545, 1549, 1562, 1579, 1593, 1607, 1632, 1660, 1677, 1679, 1686, 1710, 1733, 1731, 1703, 1674, 1660, 1657, 1655, 1653, 1654, 1656, 1658, 1664, 1673, 1682, 1686, 1687, 1693, 1704, 1707, 1694, 1665, 1635, 1616, 1612, 1625, 1652, 1686, 1714, 1724, 1707, 1668, 1627, 1599, 1591, 1594, 1599, 1602, 1604, 1608, 1613, 1622, 1635, 1647, 1649, 1642, 1638, 1646, 1652, 1638, 1602, 1565, 1547, 1547, 1552, 1556, 1561, 1566, 1573, 1578, 1583, 1583, 1573, 1553, 1527, 1499, 1465, 1428, 1401, 1397, 1420, 1456, 1482, 1490, 1488, 1486, 1486, 1481, 1470, 1461, 1460, 1460, 1455, 1444, 1432, 1424, 1429, 1451, 1484, 1509, 1515, 1511, 1512, 1520, 1527, 1532, 1541, 1549, 1550, 1547, 1549, 1557, 1558, 1553, 1553, 1562, 1570, 1570, 1578, 1600, 1619, 1612, 1585, 1565, 1563, 1568, 1572, 1582, 1602, 1616, 1606, 1576, 1541, 1517, 1505, 1508, 1525, 1549, 1565, 1561, 1543, 1527, 1522, 1526, 1529, 1523, 1510, 1500, 1501, 1512, 1522, 1523, 1519, 1516, 1516, 1511, 1492, 1471, 1470, 1503, 1556, 1606, 1640, 1659, 1665, 1656, 1634, 1609, 1591, 1579, 1573, 1576, 1591, 1608, 1610, 1593, 1572, 1559, 1554, 1546, 1540, 1549, 1579, 1620, 1653, 1667, 1655, 1623, 1581, 1541, 1500, 1458, 1426, 1418, 1432, 1452, 1471, 1500, 1543, 1579, 1584, 1564, 1548, 1548, 1551, 1546, 1542, 1543, 1538, 1524, 1508, 1502, 1503, 1505, 1517, 1543, 1572, 1587, 1593, 1608, 1634, 1651, 1639, 1607, 1572, 1543, 1517, 1496, 1485, 1483, 1484, 1483, 1480, 1477, 1476, 1484, 1508, 1547, 1588, 1608, 1596, 1569, 1552, 1553, 1556, 1544, 1523, 1508, 1501, 1489, 1477, 1481, 1506, 1537, 1555, 1557, 1552, 1543, 1534, 1527, 1519, 1501, 1466, 1429, 1406, 1404, 1416, 1432, 1445, 1453, 1460, 1474, 1495, 1509, 1508, 1502, 1504, 1513, 1515, 1515, 1525, 1546, 1560, 1557, 1552, 1559, 1567, 1563, 1549, 1548, 1571, 1605, 1631, 1637, 1624, 1596, 1563, 1536, 1519, 1511, 1510, 1516, 1530, 1548, 1559]
302A559ql2l8k4%J0PMJ3J8Mj9k6j1NNj%N%rj2JJ3J8K1K5K2Kk4l5k8j9j4j2lLQJ4J6J1lj6j9
297A431j2mNJ2J1KnlOJ3K0K5J9ol5m6l5j7pljoj8k2rRJ2JpJJ5K3K2K2K3J7%j7k4j7mLNPJ6
291A422J8Ok0m0l9j8%Lj0k0j5NK5L2L0K7K2J3Knqj2j9k4k6k6k1pJ4K6K1Ooj0j2j0mMRPRJ3
286A362Oj3k5j5NJ6Qoj5j2MJ9K6J6mj8j9pJ0K7L6K9J2MJ4K5K2Onnqj8k6k3j3pnJQLqrRK4J3
281A444j4k7k0j3k2l2k7j5oJJ6L5L7K1Nqk1l5l7k5rpj0oNJ2NllOJ5Rpj8rJ0J6O%J4L0K7Nj3
275A332j9k0k2j8pKPJ8L5M5L5J5KKJnj1oNJ2Rmj4j6j5k0k9k6qJ5K1J4OJ2K1K3J8Qkj3k3k1
270A359pJ1J7Pj2k1j1MJ0OQJ4J6R%JN%j4k0rJ1K8L3L0J6nk4l1k5j2JRKj7l4l6k0lOJ0J8K9
265A359L4K3Jj8l1l7m4m1j9J2L0J9j0k5j2OJ3J1J7L3L4J4j3k1mJ8J7jj5j2j%noJJ0J7K3K4
$$ y = [1559, 1551, 1519, 1481, 1457, 1457, 1467, 1474, 1478, 1491, 1509, 1513, 1494, 1468, 1457, 1462, 1467, 1466, 1466, 1471, 1471, 1462, 1450, 1451, 1464, 1482, 1503, 1528, 1550, 1552, 1528, 1493, 1465, 1446, 1432, 1420, 1417, 1420, 1428, 1442, 1458, 1469, 1466, 1450, 1431, 1419, 1415, 1420, 1432, 1443, 1445, 1440, 1437, 1443, 1456, 1476, 1501, 1520, 1514, 1479, 1433, 1398, 1381, 1374, 1371, 1370, 1364, 1346, 1324, 1315, 1324, 1336, 1337, 1330, 1331, 1346, 1369, 1391, 1413, 1436, 1453, 1453, 1436, 1412, 1395, 1391, 1394, 1399, 1406, 1422, 1440, 1446, 1426, 1386, 1347, 1329, 1329, 1332, 1322, 1302, 1287, 1292, 1317, 1349, 1379, 1406, 1428, 1441, 1443, 1438, 1430, 1418, 1399, 1375, 1349, 1323, 1302, 1295, 1309, 1335, 1356, 1362, 1356, 1346, 1334, 1324, 1320, 1324, 1333, 1340, 1349, 1362, 1368, 1355, 1330, 1315, 1320, 1336, 1344, 1338, 1323, 1311, 1315, 1334, 1360, 1376, 1372, 1354, 1335, 1328, 1338, 1365, 1401, 1430, 1442, 1446, 1460, 1485, 1507, 1513, 1508, 1503, 1495, 1477, 1451, 1428, 1415, 1408, 1403, 1404, 1412, 1415, 1407, 1398, 1407, 1431, 1444, 1430, 1403, 1383, 1370, 1348, 1316, 1289, 1274, 1268, 1269, 1285, 1320, 1357, 1378, 1383, 1375, 1354, 1319, 1282, 1257, 1248, 1241, 1231, 1225, 1230, 1242, 1247, 1244, 1241, 1247, 1262, 1271, 1264, 1246, 1237, 1247, 1263, 1269, 1269, 1283, 1313, 1340, 1345, 1332, 1313, 1293, 1271, 1253, 1246, 1248, 1255, 1273, 1308, 1353, 1388, 1403, 1405, 1407, 1408, 1403, 1392, 1386, 1391, 1403, 1412, 1408, 1394, 1378, 1363, 1343, 1314, 1288, 1280, 1295, 1316, 1330, 1336, 1348, 1369, 1392, 1410, 1418, 1416, 1403, 1380, 1359, 1352, 1363, 1380, 1387, 1375, 1354, 1343, 1347, 1357, 1363, 1371, 1385, 1401, 1410, 1410, 1411, 1416, 1416, 1402, 1382, 1373, 1384, 1412, 1445, 1475, 1491, 1486, 1462, 1431, 1406, 1394, 1395, 1404, 1406, 1389, 1355, 1319, 1299, 1296, 1302, 1312, 1330, 1359, 1393, 1416, 1417, 1399, 1368, 1331, 1287, 1246, 1227, 1239, 1269, 1288, 1278, 1253, 1241, 1247, 1260, 1271, 1288, 1321, 1355, 1369, 1356, 1335, 1331, 1349, 1366, 1365, 1350, 1338, 1337, 1337, 1332, 1326, 1327, 1337, 1354, 1377, 1401]
260A401Rj4k4j1RJ1lj4j2kOJ0Lj1k8l0j4J2L1K9J0j8l5l3k1j0kNQL%PJ8J2nj5roj4j7KK5K9
255A292K1J8K2J6JplJlMK4L5J9rk1j1LKqj9k5k3j0QJ8J6OMRJ1J0Mmj8l5m6l6oK9M7L8J6%k
249A388OJ1Ojljkj4l0l6k4qNQRJ0QKkmj0j5j7rNJ6K3K1Nj7k4nK4K9Pj0qkj2l2l1j1RJ3J1J1
244A299J1N%kj0k3k7j7rnKK5M5L9J4orrk2l5l4j6OK2K5J6Kpooj2j8j6KK4L9L9K9J4jj7k6j3
239A312J3L2K9K1K3K8J9pk4k5k4l2l1j1J3K4J7%k1m1m3j9RK4K2K1K0Pqj3n%%MJ7K9L5L0J6
234A461mj9j3NJ0nj8j5nlrj3j4j2oPJ9J6Kj7l2m0l3j0J5K3J4JopopnJRJ5J1%j3j9k3k9k6j1
228A189RJ8J0KLJ4J7J1jjONj3l6l7j2J6K3J1LOJ8L1L9L8K0nk4l4l4k3nLj0l3l1kK8K5%j5q
223A221Jql1m2k7J1M8N7L8J6J6K8L0J2j0k6l2l3k8j7nLJ8L9N1L5kk7k5j0j3l3m3l0oJ1J8J9
$$ y = [1401, 1410, 1396, 1372, 1361, 1370, 1381, 1378, 1364, 1352, 1350, 1356, 1366, 1369, 1358, 1330, 1300, 1286, 1298, 1329, 1358, 1368, 1350, 1315, 1282, 1261, 1251, 1249, 1254, 1262, 1265, 1265, 1272, 1290, 1302, 1297, 1282, 1273, 1267, 1253, 1236, 1238, 1263, 1292, 1313, 1331, 1353, 1369, 1370, 1363, 1360, 1361, 1358, 1362, 1386, 1421, 1440, 1431, 1410, 1399, 1402, 1404, 1396, 1377, 1352, 1329, 1319, 1327, 1345, 1361, 1367, 1371, 1380, 1391, 1401, 1405, 1401, 1383, 1348, 1302, 1266, 1260, 1289, 1336, 1374, 1390, 1390, 1388, 1394, 1405, 1411, 1410, 1407, 1406, 1404, 1390, 1360, 1324, 1300, 1292, 1297, 1305, 1314, 1324, 1332, 1334, 1332, 1328, 1318, 1303, 1286, 1277, 1282, 1298, 1321, 1342, 1347, 1330, 1306, 1301, 1325, 1354, 1361, 1351, 1343, 1341, 1329, 1297, 1266, 1255, 1264, 1277, 1288, 1299, 1310, 1315, 1315, 1313, 1303, 1280, 1253, 1236, 1227, 1222, 1224, 1249, 1294, 1333, 1347, 1341, 1332, 1323, 1301, 1266, 1232, 1216, 1222, 1244, 1269, 1285, 1287, 1280, 1274, 1268, 1256, 1238, 1222, 1224, 1248, 1287, 1326, 1355, 1369, 1368, 1351, 1325, 1312, 1325, 1357, 1386, 1407, 1430, 1458, 1477, 1470, 1446, 1421, 1397, 1365, 1334, 1323, 1336, 1360, 1377, 1377, 1356, 1315, 1272, 1253, 1262, 1286, 1308, 1329, 1349, 1356, 1348, 1335, 1330, 1330, 1330, 1334, 1351, 1380, 1415, 1445, 1461, 1457, 1438, 1425, 1430, 1440, 1435, 1417, 1402, 1397, 1394, 1385, 1372, 1358, 1346, 1340, 1347, 1366, 1382, 1384, 1367, 1335, 1295, 1262, 1252, 1267, 1290, 1304, 1305, 1299, 1292, 1286, 1279, 1274, 1275, 1284, 1299, 1310, 1310, 1297, 1278, 1255, 1226, 1200, 1189, 1198, 1216, 1226, 1228, 1231, 1245, 1262, 1273, 1272, 1271, 1277, 1282, 1269, 1233, 1196, 1184, 1200, 1223, 1234, 1237, 1243, 1261, 1292, 1331, 1369, 1389, 1384, 1360, 1326, 1292, 1269, 1264, 1267, 1257, 1224, 1193, 1191, 1219, 1244, 1244, 1229, 1221, 1222, 1214, 1183, 1141, 1114, 1125, 1173, 1230, 1268, 1284, 1300, 1328, 1358, 1370, 1360, 1334, 1302, 1269, 1241, 1224, 1219, 1222, 1240, 1279, 1330, 1365, 1363, 1336, 1311, 1301, 1288, 1255, 1212, 1182, 1176, 1187, 1205, 1224]
219A224J3jj8k1j0MJ3J4J0OPK1L7L4Rj3j5olrj0j0j4k4k4j4j2j2lJ5K2QpmMjj1rKNmqJJ2J7
213A215J8J5Kj5j9p%npLJ5J3jn%KmojKJlloj1j3oOJ3J3J1RJ0Qjj0oJ2L0K4ll4n0m9l4j5JJ1
207A120J7J9J6MnNK8M0K2j1k6k0nLNLMMMkj0j6j5j3j3j1jJ4K1J2lnPK8L8L3J6nj9j9qMRQN
202A282%pk0k5j6m%qj2kJ6L0L3K3Lj7k0%K0K0jk3l3l3k6j3LJ2QkroPJ6J6JroPJ1J1J3J8J7
196A275Opj4j3j2rlknpkNOMJ2K9M4M6K7ml1m1l6k6j3NK8L4J9mqKOmj4j5j2j4k0k2k1j8j3o
191A152LOQJ5K1J7Lqpnqj3oLjk0l0j3J5L0K1MpnOJ9K2J1qj6j4j5j9j3QK3J3nkJ7K2Mj3qNJ2
185A224J3K1L0K0mk4k6j4KJ1J1kk0k5j7olJJ0K0J7%j8k3j5onnOK4L1J2j9l1j2J9L3K0%pn%
180A238jkKJ0J8J6%k2l5k9j4nnjMjj7k6j0J7K3Mj5qJ3J2qk2j3LOj%RJ0%poLJ0J4J4R%jJ%j2
$$ y = [1224, 1237, 1236, 1218, 1197, 1187, 1191, 1204, 1218, 1228, 1234, 1241, 1262, 1299, 1333, 1342, 1329, 1314, 1308, 1305, 1296, 1286, 1276, 1262, 1238, 1214, 1200, 1188, 1176, 1173, 1188, 1210, 1218, 1211, 1207, 1211, 1210, 1199, 1190, 1192, 1197, 1193, 1185, 1186, 1198, 1215, 1233, 1248, 1250, 1235, 1216, 1209, 1209, 1204, 1197, 1200, 1215, 1228, 1227, 1222, 1222, 1224, 1220, 1214, 1213, 1215, 1216, 1213, 1210, 1204, 1193, 1180, 1174, 1180, 1193, 1206, 1217, 1226, 1236, 1244, 1243, 1233, 1227, 1239, 1269, 1293, 1290, 1256, 1206, 1157, 1123, 1108, 1109, 1120, 1137, 1156, 1172, 1176, 1171, 1176, 1204, 1244, 1266, 1255, 1229, 1209, 1204, 1207, 1212, 1215, 1219, 1223, 1227, 1225, 1215, 1199, 1184, 1171, 1158, 1147, 1146, 1160, 1181, 1193, 1190, 1185, 1192, 1220, 1258, 1291, 1307, 1302, 1283, 1264, 1256, 1260, 1269, 1277, 1282, 1282, 1275, 1255, 1230, 1214, 1210, 1210, 1202, 1190, 1188, 1204, 1234, 1267, 1290, 1293, 1276, 1256, 1256, 1276, 1296, 1295, 1272, 1239, 1206, 1180, 1167, 1170, 1182, 1190, 1188, 1179, 1173, 1180, 1196, 1212, 1213, 1204, 1198, 1205, 1216, 1227, 1240, 1258, 1275, 1281, 1274, 1260, 1247, 1235, 1226, 1223, 1221, 1216, 1209, 1207, 1212, 1218, 1222, 1234, 1263, 1307, 1353, 1380, 1376, 1345, 1304, 1268, 1242, 1229, 1234, 1262, 1296, 1315, 1311, 1303, 1305, 1311, 1307, 1293, 1278, 1266, 1252, 1232, 1210, 1189, 1171, 1158, 1152, 1155, 1161, 1169, 1184, 1205, 1222, 1225, 1217, 1210, 1205, 1197, 1184, 1178, 1181, 1180, 1160, 1130, 1117, 1132, 1162, 1183, 1187, 1180, 1175, 1181, 1200, 1222, 1233, 1225, 1209, 1195, 1180, 1161, 1148, 1156, 1179, 1192, 1187, 1185, 1202, 1224, 1228, 1215, 1207, 1212, 1224, 1237, 1258, 1288, 1308, 1304, 1280, 1254, 1240, 1242, 1253, 1264, 1262, 1242, 1217, 1200, 1194, 1191, 1192, 1202, 1222, 1239, 1239, 1221, 1198, 1183, 1177, 1172, 1167, 1173, 1197, 1228, 1240, 1221, 1190, 1178, 1197, 1230, 1250, 1250, 1243, 1238, 1238, 1237, 1235, 1237, 1247, 1265, 1281, 1281, 1259, 1224, 1195, 1181, 1176, 1171, 1170, 1174, 1173, 1156, 1130, 1120, 1137, 1160, 1164, 1149, 1141, 1154, 1166, 1158, 1136, 1123, 1126, 1132, 1131, 1131, 1140, 1150, 1150, 1143, 1137, 1140, 1150, 1164, 1178, 1187, 1187, 1186, 1187, 1187, 1175]
174A175k6k9j9JJ8K9K8K0Qnj4qQJ9Pj8l1k4j6j6j5kJ5J9J2J2J7J2lj7j3lLLOJ1J2LmnjNJ0
169A184J8K2J6kk4l6l6k7j3RL2L7J6prPJ4J3J4K1J6lj4kJ2Pqj3ooj3j4rpj5j9j6j7k4k4qJ5
164A081K5J8Jj1qJ0L1M1L7L0K3Rj5l5l2j6qj6k9l1j6MJ5J4J2J5K2K7K5K0J2Lqj6j7j2pqj0
159A180j2qkKKPJ6K5K3J4RPjk0l7m0k8rPJ6J4RJ3J9J5nk6k9j5lMMMJjKJ3J9J4KrrmOJ8K9L4
154A270K3mk3k2j0rj5j0J1J9Jk2k1%Ppk1j4OJ8J0nj5j2NK3L3L3K8J9Nj0j7j6j2j1j5k0k8k9
149A143j5OJ4Qjljnj2j4j0nqj3pJ1K8K1mk3j1J6K6Qj4j6lJ0J6J8J7J4J1Qkj9l0k7j5poJPJ0
143A122KnkJ3L0L5K6J0jnoj5k2k1j4j3j4rOJ9J8Mj1j5kJ4K0J0nj8k4l0k9k4j1NK0K4J4%kM
138A098%j6k6j4LLj2j8pJ1K2K8K7J9Okpj8k8k5lJ6J8Nk%KJj%QJ2J1RJ5K8L6K8Mj9l4l6l2k2
$$ y = [1175, 1149, 1120, 1101, 1102, 1120, 1149, 1177, 1197, 1205, 1200, 1186, 1178, 1186, 1205, 1212, 1194, 1163, 1139, 1123, 1107, 1092, 1090, 1105, 1124, 1136, 1148, 1165, 1177, 1174, 1157, 1144, 1141, 1144, 1147, 1153, 1164, 1176, 1179, 1175, 1170, 1169, 1174, 1184, 1202, 1224, 1240, 1238, 1214, 1178, 1142, 1115, 1102, 1111, 1143, 1180, 1196, 1189, 1180, 1187, 1201, 1214, 1228, 1249, 1265, 1262, 1248, 1246, 1258, 1265, 1257, 1244, 1238, 1232, 1219, 1205, 1196, 1189, 1174, 1155, 1139, 1122, 1098, 1074, 1066, 1081, 1106, 1124, 1125, 1114, 1106, 1116, 1147, 1188, 1225, 1255, 1278, 1287, 1272, 1237, 1205, 1189, 1181, 1165, 1136, 1105, 1089, 1093, 1108, 1122, 1134, 1149, 1171, 1198, 1223, 1243, 1255, 1258, 1250, 1234, 1217, 1205, 1198, 1190, 1180, 1168, 1160, 1158, 1160, 1162, 1169, 1185, 1210, 1233, 1247, 1256, 1263, 1262, 1242, 1205, 1165, 1137, 1128, 1135, 1151, 1165, 1174, 1187, 1206, 1221, 1216, 1190, 1161, 1146, 1143, 1147, 1151, 1155, 1156, 1155, 1157, 1170, 1189, 1203, 1205, 1196, 1187, 1183, 1189, 1207, 1236, 1270, 1293, 1289, 1266, 1244, 1234, 1225, 1210, 1200, 1211, 1230, 1231, 1209, 1188, 1188, 1195, 1188, 1167, 1153, 1159, 1177, 1187, 1182, 1167, 1155, 1160, 1183, 1216, 1249, 1277, 1296, 1301, 1291, 1274, 1258, 1246, 1235, 1220, 1200, 1172, 1143, 1128, 1134, 1148, 1156, 1155, 1152, 1151, 1146, 1134, 1120, 1110, 1105, 1097, 1084, 1077, 1088, 1116, 1137, 1133, 1110, 1099, 1115, 1141, 1149, 1135, 1119, 1116, 1126, 1142, 1160, 1177, 1191, 1202, 1210, 1208, 1189, 1159, 1132, 1117, 1110, 1104, 1105, 1112, 1122, 1124, 1119, 1117, 1130, 1160, 1195, 1221, 1231, 1230, 1225, 1219, 1204, 1182, 1161, 1147, 1134, 1120, 1111, 1117, 1136, 1154, 1158, 1147, 1132, 1130, 1144, 1164, 1174, 1169, 1151, 1127, 1097, 1068, 1044, 1033, 1038, 1058, 1082, 1096, 1096, 1094, 1098, 1098, 1082, 1056, 1042, 1045, 1048, 1036, 1018, 1011, 1022, 1044, 1072, 1099, 1118, 1124, 1122, 1115, 1097, 1069, 1044, 1041, 1057, 1075, 1080, 1078, 1078, 1080, 1081, 1080, 1080, 1088, 1100, 1111, 1120, 1135, 1163, 1199, 1227, 1231, 1212, 1178, 1142, 1110, 1088]
133A088rmnmOJ8K4K3K2J9Qqj8j1OJ6J3MLPJj0j5pJloMK1K7K1J6J9J5%j4k3k6k9k2oOLpoNJ0
127A173jj7j6mOJj5k4k3j8j5pJ3K9K1j0l1k1OJ8J7J2J1QLjjooQL5M8M0J9%j0j5j6j7j8j9j5
122A142pjLJ0J5Pj8m3n0l1mJ8K4K4K8L8L7J3k0k6LL5L6Lk8k9nJ6Rj3k6j4LLppRK2J7Knnkk
116A174%LL%%jmlRK2K5J8Qkj7k9k7j5rj4k1j7lJ0J0jj2pJ4L2K7PplLlj6j9j5oNK6M4M4K7R
111A269Jlj5k8l5l0j9j0kRJ8K1J0j2k5k0MK5K8J2j5l2l0nK3K7J0n%J5J8LoLJ4Oj6k5j1J1J7
106A200Mj5k1j7rj2k4l0k6j5j0j3j3%J9K7J7jj6k4k4j5%J9L4L7L1J8QNPOKLRJ3J3J5J3Mj3
101A206k3k3j5j1nLJ0Mqj2mMONQJ5J4P%KJ3K5K9K0Nj0k0k4j7lPjk0l2l0j7pJPLj2k4j9KK3
95A082K7J9J6K0K2Rrk1j5nnj6k6k4j4nLQQPJ2K4K7J5jmJnk2k5nK0K9K4J4Mj4l1l2j7MK1K9
$$ y = [1088, 1079, 1075, 1070, 1066, 1072, 1090, 1114, 1137, 1159, 1178, 1186, 1178, 1160, 1149, 1155, 1171, 1184, 1188, 1191, 1198, 1199, 1189, 1174, 1167, 1168, 1165, 1159, 1163, 1184, 1211, 1232, 1248, 1267, 1282, 1282, 1268, 1245, 1219, 1190, 1168, 1162, 1168, 1171, 1164, 1158, 1163, 1173, 1172, 1155, 1139, 1135, 1141, 1142, 1127, 1103, 1080, 1062, 1047, 1040, 1053, 1082, 1103, 1093, 1062, 1041, 1047, 1065, 1082, 1094, 1105, 1113, 1116, 1115, 1114, 1108, 1102, 1110, 1145, 1193, 1233, 1252, 1252, 1242, 1227, 1211, 1194, 1176, 1157, 1142, 1135, 1134, 1137, 1147, 1162, 1169, 1151, 1108, 1058, 1027, 1023, 1041, 1065, 1089, 1117, 1155, 1192, 1205, 1185, 1159, 1162, 1197, 1233, 1236, 1208, 1179, 1174, 1190, 1199, 1186, 1160, 1146, 1149, 1152, 1145, 1138, 1147, 1169, 1186, 1188, 1183, 1178, 1176, 1174, 1174, 1177, 1180, 1180, 1180, 1179, 1175, 1172, 1181, 1203, 1228, 1246, 1254, 1252, 1235, 1206, 1179, 1164, 1155, 1141, 1120, 1103, 1100, 1110, 1120, 1119, 1107, 1100, 1114, 1146, 1173, 1180, 1173, 1170, 1173, 1170, 1154, 1135, 1120, 1114, 1119, 1145, 1189, 1233, 1260, 1269, 1270, 1267, 1252, 1224, 1189, 1159, 1140, 1130, 1128, 1137, 1155, 1176, 1186, 1174, 1149, 1129, 1133, 1158, 1186, 1198, 1183, 1151, 1121, 1116, 1139, 1166, 1176, 1171, 1171, 1186, 1204, 1207, 1201, 1204, 1218, 1224, 1208, 1183, 1172, 1183, 1200, 1204, 1189, 1168, 1151, 1142, 1130, 1106, 1076, 1050, 1035, 1025, 1012, 999, 999, 1018, 1045, 1062, 1061, 1045, 1021, 997, 982, 982, 1001, 1035, 1072, 1103, 1121, 1129, 1134, 1141, 1147, 1149, 1152, 1161, 1174, 1187, 1202, 1215, 1219, 1206, 1183, 1160, 1145, 1134, 1129, 1132, 1142, 1146, 1138, 1126, 1122, 1126, 1132, 1137, 1145, 1160, 1174, 1181, 1181, 1183, 1196, 1221, 1250, 1270, 1275, 1265, 1245, 1221, 1204, 1201, 1208, 1207, 1187, 1155, 1125, 1108, 1101, 1102, 1109, 1112, 1100, 1076, 1057, 1059, 1082, 1109, 1128, 1144, 1164, 1186, 1195, 1186, 1165, 1150, 1145, 1140, 1124, 1098, 1074, 1060, 1055, 1058, 1066, 1074, 1081, 1093, 1117, 1144, 1159, 1158, 1154, 1155, 1150, 1128, 1103, 1098, 1118, 1147, 1171, 1185, 1189, 1175, 1144, 1112, 1095, 1099, 1120, 1149]
90A149K8J6PNKj4l5l6j5J0K1K0K0K2K1J2MjlLJ1J1Kprj1k3l6l6k4j3oNK6M0L3Rj4k5j9mJ2
85A158J9Rpj7k1k2k9l0k4j2plPK6L9L7K4Rkj3j7j1npj9k2j1nj8l2k3LK5K6J6OkrkJ9L4L0J3
80A130lj0j5j9j7j0pmjONpk6l7l2j0J9M2N3M5K7OmjPJ2J1J2J6J7Opj8j9j5oNNmoMJ4Pj2k1
74A138j2NQjj4k3k8k4j0OJ6J9J8J6J7J4Nqj5nJ1J9J1lj3j9k3k2j0JPOKlj1j6oJ3K7K7K2J5
69A157Oj2l3l9k4LK4L0K6K0J3%j7k4j7kJ1K3L5L8K6Kj5k3k4k1oJ2K0J2lj1j3j7j8j4j0rmJ1
64A113K0Pj9l3k4j4j8k6k1pMRJ4K4K5J1oj4oOQ%olOPloOK6L1J6lrKJ6K1Oj5k4j1J3K4K0PK
58A176MRJ1Olppqj3j3jJ4J6Lj1k1l0m1l5rJ8K4J7J7J7Oj2j2RL0K9J1pj6k0k0j5j6k0j9rKP
53A061J0J8J8OmQL0L8K0Jlkqk0k4j8j1j2j5j9j9j1NJ8K1J4J3K1L0L0K3J5J0jk0l0j6J1K2N
$$ y = [1149, 1177, 1193, 1200, 1205, 1207, 1193, 1158, 1122, 1107, 1117, 1138, 1158, 1178, 1200, 1221, 1233, 1237, 1236, 1233, 1236, 1247, 1258, 1260, 1253, 1244, 1233, 1210, 1174, 1138, 1114, 1101, 1095, 1100, 1126, 1166, 1199, 1208, 1194, 1169, 1150, 1146, 1158, 1177, 1186, 1179, 1162, 1141, 1119, 1090, 1060, 1036, 1024, 1017, 1014, 1021, 1047, 1086, 1123, 1147, 1156, 1154, 1141, 1124, 1113, 1108, 1101, 1082, 1060, 1049, 1044, 1026, 994, 971, 974, 999, 1025, 1041, 1047, 1045, 1036, 1034, 1053, 1087, 1117, 1130, 1127, 1117, 1102, 1083, 1066, 1056, 1049, 1045, 1044, 1050, 1055, 1048, 1022, 985, 953, 943, 962, 1004, 1057, 1102, 1129, 1135, 1131, 1130, 1137, 1149, 1160, 1172, 1188, 1205, 1211, 1204, 1186, 1167, 1152, 1146, 1151, 1156, 1152, 1146, 1150, 1164, 1171, 1159, 1138, 1126, 1131, 1139, 1138, 1124, 1101, 1073, 1049, 1039, 1045, 1061, 1080, 1098, 1114, 1131, 1145, 1150, 1142, 1127, 1122, 1133, 1152, 1163, 1160, 1147, 1128, 1105, 1083, 1073, 1074, 1081, 1087, 1089, 1086, 1075, 1059, 1053, 1066, 1093, 1120, 1142, 1157, 1163, 1151, 1118, 1079, 1055, 1058, 1082, 1112, 1138, 1158, 1171, 1171, 1154, 1130, 1113, 1111, 1122, 1145, 1180, 1218, 1244, 1246, 1231, 1208, 1184, 1163, 1157, 1169, 1189, 1201, 1198, 1187, 1174, 1157, 1139, 1125, 1115, 1106, 1102, 1113, 1133, 1140, 1121, 1088, 1064, 1050, 1032, 1006, 985, 978, 982, 991, 1005, 1029, 1054, 1065, 1059, 1045, 1039, 1045, 1053, 1053, 1047, 1044, 1050, 1057, 1054, 1048, 1054, 1080, 1111, 1127, 1124, 1115, 1117, 1133, 1154, 1160, 1145, 1121, 1110, 1123, 1147, 1167, 1174, 1176, 1180, 1189, 1200, 1206, 1203, 1196, 1189, 1181, 1168, 1155, 1154, 1168, 1184, 1187, 1176, 1155, 1125, 1084, 1049, 1040, 1058, 1082, 1099, 1116, 1133, 1139, 1127, 1115, 1124, 1154, 1183, 1194, 1187, 1171, 1151, 1131, 1116, 1100, 1080, 1061, 1052, 1054, 1061, 1071, 1089, 1107, 1113, 1109, 1117, 1147, 1185, 1205, 1206, 1203, 1201, 1193, 1173, 1149, 1131, 1120, 1108, 1093, 1074, 1055, 1044, 1049, 1067, 1088, 1102, 1115, 1136, 1166, 1196, 1219, 1234, 1244, 1243, 1223, 1193, 1177, 1188, 1210, 1215]
48A215k0k8k4k2k8k0MK4K3RmolNJ4J7Roj3oQJ8K1J4%j4j9j3rnmoj2j8j5n%oqlNPkj2j4mJ1
43A055J8J1nj9k4k3j7pMJ0J3J5J6R%KJ7K9K6J3Njj0k0j9qlqj3oJ6L4L5J2j9l8l4j6kjoj1j3
37A017j7k0j9j0QK6L1K2J0PJ5J6Prj7j8j5mJ0J4Kj0pRJ5MpmKKOJ9K6J3j2k5k7k9l3j8QJ7%
32A005j5jK0J8nj2LJ7J5J0J9L0K7Rj0k0k1j2LQkj5j6oNQPKmomKJpoLJ4J0mj8k0qJ0K1J8Lj3
26A063k5k9k7j8%J8L0L6L6K8J1rj7j0knj7k0qKkj8k3j7j0j2qJ0L1M0L1J7Pjj0j5j3KK4L3K0
21A123j0l0k1%Pok0k4j5%J5K0J3OOPjj3rQJ4NlJJ0Kj4j5JJ9K8K9K6K0Qj0k9m1l5j7%OQJ2J9
16A100J8J0Mnj7k8k6j7j2j2nRJ6Nj5k1nJ7L0K7K1K3L2K9Pj7k3pJ1J6Qkj1j9k1j3PK3K5Oj8
11A150k5qJ7K9J8mk3k9j5J1L4L7J9ok7l4k9j5%Klj4k6l3k8mK1K0kk4k2j3j5k4k6j4LJ7K0J3
$$ y = [1215, 1195, 1167, 1143, 1121, 1093, 1073, 1077, 1101, 1124, 1133, 1129, 1123, 1120, 1125, 1139, 1156, 1165, 1159, 1146, 1140, 1148, 1166, 1187, 1201, 1201, 1187, 1168, 1155, 1146, 1141, 1137, 1131, 1119, 1101, 1086, 1081, 1081, 1075, 1067, 1064, 1069, 1076, 1074, 1062, 1048, 1044, 1055, 1073, 1084, 1079, 1060, 1036, 1013, 996, 989, 993, 1003, 1016, 1031, 1047, 1056, 1056, 1058, 1075, 1104, 1130, 1143, 1148, 1147, 1137, 1117, 1098, 1090, 1087, 1079, 1066, 1060, 1076, 1110, 1145, 1157, 1138, 1100, 1066, 1050, 1048, 1047, 1041, 1030, 1017, 1000, 980, 961, 951, 959, 985, 1016, 1038, 1048, 1055, 1070, 1086, 1093, 1084, 1067, 1049, 1034, 1030, 1040, 1054, 1056, 1046, 1039, 1048, 1063, 1067, 1060, 1056, 1058, 1060, 1066, 1085, 1111, 1124, 1112, 1087, 1060, 1031, 998, 980, 988, 1005, 1005, 990, 989, 1009, 1027, 1022, 1010, 1013, 1030, 1045, 1055, 1074, 1104, 1131, 1140, 1130, 1110, 1089, 1077, 1080, 1088, 1086, 1071, 1055, 1049, 1054, 1062, 1069, 1071, 1067, 1061, 1057, 1059, 1060, 1053, 1047, 1050, 1064, 1074, 1070, 1052, 1032, 1024, 1034, 1055, 1073, 1076, 1063, 1038, 1009, 982, 964, 964, 982, 1012, 1048, 1084, 1112, 1123, 1114, 1097, 1087, 1085, 1080, 1063, 1043, 1035, 1037, 1035, 1017, 994, 977, 967, 955, 947, 957, 988, 1028, 1059, 1076, 1083, 1082, 1072, 1057, 1044, 1046, 1070, 1103, 1123, 1113, 1083, 1062, 1062, 1069, 1063, 1043, 1019, 1004, 1004, 1019, 1039, 1052, 1058, 1064, 1071, 1070, 1057, 1048, 1056, 1070, 1075, 1072, 1073, 1083, 1085, 1071, 1056, 1057, 1076, 1104, 1133, 1159, 1179, 1187, 1177, 1148, 1107, 1072, 1055, 1055, 1061, 1069, 1081, 1100, 1118, 1128, 1132, 1127, 1110, 1082, 1056, 1039, 1027, 1015, 1010, 1019, 1035, 1040, 1025, 1004, 999, 1016, 1046, 1073, 1094, 1117, 1149, 1178, 1185, 1168, 1145, 1138, 1149, 1165, 1173, 1171, 1160, 1141, 1120, 1107, 1114, 1137, 1162, 1168, 1150, 1125, 1117, 1134, 1163, 1181, 1177, 1154, 1125, 1110, 1121, 1155, 1192, 1211, 1205, 1178, 1144, 1115, 1100, 1100, 1102, 1099, 1085, 1059, 1026, 998, 994, 1015, 1035, 1033, 1009, 987, 974, 959, 935, 909, 895, 898, 915, 935, 948]
6I48%qj1j4k0j3J1L0K5KnJ3K6J1j7k5j0RK0K5L5L5J7qk3j9qkmlMJ2J1Knn%KJQK0K5Rj2j5P
0A081L3L5J1j3j8j2j2j9k3j7qmpj0nNJ0Nmpmkoj2j6j2kJ3K2J7PLOJ1J0J2J0nl1l7qK6L2J1
-5A066KJ3K2J1m%K0L0J9Kj4k3l3m1m3l2j3QK1K3J7J1QMLlpqjMLnj4j5qJLmj5j4kMKLJ8K7J1
-11A057k0m0m3l8k9j1RJ3LJJ7L1K2NlkloJJ5K0J1%mkJLJlj0j6j3jJ5K5K0Ojnj3k3k1oKoj4
-16I45mJ0Qoj1kMmj4j2MK0K4Rj6j8OL3K6nk1mJ6J2lpMJ4J5Plj2j3mRJ7K3K0Nk1m0m0k7k0j9
-22I05j5lRJ0MNJ4K2J9PjQK4L3K3R%LQRol1m5l4lK0J8PLLjmKJ6J7%k3k7qJ2J3mj8j1J0K7K8
-28A054K1RklPK2K0kk1j9m%qj7j6nMJ2J6J1Jj0j3pJ3L0L1J4JMJ0pl9o0n6l4j0J1K1K2J6J4
-33A031J3P%NK4L4J8j0k7k5j3jQJ4J7J7Pj4l8m6m0l4l8l6j0K4M0K6RJ1K3K6J3mj1mQJ2jk0
$$ y = [948, 948, 940, 929, 915, 895, 882, 893, 923, 948, 950, 945, 958, 984, 995, 978, 953, 943, 952, 972, 997, 1032, 1067, 1084, 1076, 1053, 1034, 1026, 1024, 1020, 1017, 1021, 1033, 1044, 1046, 1041, 1036, 1036, 1038, 1039, 1047, 1067, 1092, 1101, 1089, 1074, 1081, 1114, 1149, 1160, 1147, 1129, 1117, 1105, 1086, 1063, 1046, 1038, 1034, 1027, 1017, 1012, 1017, 1027, 1032, 1028, 1021, 1017, 1015, 1009, 997, 981, 969, 967, 980, 1002, 1019, 1026, 1029, 1035, 1046, 1056, 1068, 1078, 1073, 1042, 1005, 997, 1023, 1055, 1066, 1068, 1081, 1103, 1114, 1110, 1110, 1130, 1160, 1179, 1181, 1167, 1144, 1111, 1070, 1027, 995, 982, 990, 1011, 1034, 1051, 1062, 1070, 1074, 1077, 1074, 1067, 1059, 1058, 1062, 1065, 1060, 1046, 1031, 1023, 1024, 1027, 1023, 1008, 994, 992, 996, 998, 1001, 1019, 1046, 1057, 1037, 997, 954, 916, 887, 876, 885, 898, 901, 902, 919, 950, 972, 977, 974, 972, 969, 963, 964, 979, 999, 1010, 1010, 1006, 1004, 1005, 1008, 1009, 1006, 996, 980, 967, 966, 981, 1006, 1026, 1032, 1031, 1026, 1013, 990, 969, 963, 965, 959, 945, 941, 951, 959, 953, 942, 940, 944, 940, 926, 914, 918, 938, 962, 971, 955, 937, 943, 976, 1002, 997, 976, 972, 988, 1000, 997, 990, 994, 1008, 1023, 1030, 1027, 1015, 1002, 998, 1007, 1024, 1047, 1067, 1072, 1051, 1011, 971, 944, 924, 905, 890, 887, 896, 906, 910, 915, 929, 951, 970, 977, 976, 984, 1008, 1041, 1064, 1073, 1073, 1076, 1084, 1093, 1087, 1056, 1011, 977, 974, 994, 1012, 1019, 1022, 1025, 1024, 1020, 1022, 1038, 1055, 1055, 1032, 1005, 997, 1009, 1022, 1018, 1000, 989, 999, 1026, 1054, 1075, 1084, 1082, 1079, 1086, 1108, 1128, 1126, 1105, 1086, 1082, 1082, 1074, 1057, 1041, 1036, 1040, 1052, 1068, 1079, 1080, 1070, 1057, 1050, 1063, 1093, 1124, 1138, 1139, 1143, 1153, 1146, 1107, 1047, 991, 957, 947, 958, 979, 1001, 1017, 1031, 1044, 1051, 1051, 1056, 1080, 1114, 1132, 1122, 1095, 1070, 1057, 1056, 1064, 1078, 1095, 1112, 1119, 1105, 1067, 1021, 981, 947, 909, 873, 863, 887, 927, 953, 962, 973, 996, 1022, 1035, 1031, 1020, 1016, 1024, 1036, 1035, 1015]
-38A015k9k1pkpj2oJ0K3K3J6J5K4K7J3rk3k2j9j7j2lJj0k1j5OK2K2K2K9L1J3k0l9k5OK5K3
-42A047Oj5l4l7j4J6K2lk5j0K6M7L3J2PJ0Lj5k6k8l1l6l3j0J9L3K8J6ROK%jmqlQJ6Qoj0j0
-48A015j4k3j8OK4K1Mpokkkkj0j9j5%J3J6Ppj8k7k6k4k5k4pK5M5L6J1ojJ2J7J1%kJjj8l3k4
-53I01J2N0O1M7K4Pqj9j6%J6K5K9K3Nk1l0j2J7L2K0nk3l3l5l3k3rjJMJ8L7M0J6k2m8m5j4K2
-58A010M1L0%j7qJ4K5J7%j6k6k7j8mJnrrpj4j8j7qLJ2J9J8J3PRJ3J6K1K4J9kk6m0m1k7oJ5
-63I82K0%k2j9NK2J1pj3oNJ4K4K5Rj2j3J0L0K6Nj6k1j6j0rj4j6qJKqj5pRJ5Kk0l6l5j7J2L7
-68I26M7L9J9nk1k2j1ok0l9l8j2J9L1K8K6L2L0J7lj6j7rmrk1k7j3J8L9K5j9n5n8l3j2nMJ9
-73H44L1K6J6J6K4K3J1OJ1J2jj4j3KJ4J9J9J5Kj6k5k2j3j0j5k4k3pJ3J8RNJ5K5J2qj2MJ5R
$$ y = [1015, 986, 965, 958, 956, 949, 937, 931, 941, 964, 987, 1003, 1018, 1042, 1069, 1082, 1073, 1050, 1028, 1009, 992, 980, 977, 978, 968, 947, 932, 938, 960, 982, 1004, 1033, 1064, 1077, 1057, 1018, 993, 999, 1024, 1047, 1053, 1038, 1004, 967, 953, 969, 991, 988, 963, 953, 979, 1026, 1059, 1071, 1078, 1088, 1091, 1076, 1050, 1022, 991, 955, 922, 912, 931, 964, 992, 1008, 1017, 1023, 1025, 1025, 1024, 1020, 1012, 1009, 1017, 1033, 1041, 1035, 1025, 1015, 1001, 978, 960, 966, 990, 1011, 1015, 1008, 1002, 1000, 998, 996, 994, 984, 965, 950, 950, 963, 979, 986, 979, 961, 934, 908, 884, 859, 835, 828, 853, 898, 934, 945, 939, 938, 950, 967, 978, 978, 976, 977, 976, 958, 925, 901, 913, 963, 1024, 1071, 1095, 1102, 1094, 1075, 1059, 1059, 1075, 1100, 1129, 1152, 1157, 1136, 1106, 1094, 1111, 1143, 1163, 1158, 1135, 1102, 1067, 1034, 1011, 1002, 1001, 1002, 1006, 1024, 1061, 1101, 1117, 1095, 1047, 1002, 988, 1010, 1051, 1081, 1081, 1064, 1056, 1070, 1095, 1112, 1112, 1096, 1070, 1043, 1025, 1021, 1022, 1017, 1008, 999, 992, 978, 960, 943, 935, 938, 950, 969, 987, 1000, 1007, 1016, 1029, 1045, 1066, 1090, 1109, 1107, 1081, 1041, 1000, 973, 967, 982, 1002, 1002, 980, 961, 966, 988, 999, 992, 979, 973, 978, 992, 1016, 1041, 1050, 1038, 1025, 1035, 1065, 1091, 1096, 1080, 1059, 1043, 1033, 1024, 1010, 994, 986, 987, 989, 981, 966, 959, 968, 983, 985, 965, 929, 894, 877, 889, 926, 973, 1012, 1031, 1026, 1005, 983, 972, 966, 946, 907, 869, 857, 876, 907, 935, 961, 993, 1023, 1040, 1037, 1021, 1004, 995, 991, 982, 961, 934, 921, 939, 978, 1003, 984, 929, 871, 838, 826, 821, 825, 844, 875, 901, 917, 933, 957, 980, 991, 997, 1008, 1020, 1019, 1005, 992, 994, 1008, 1027, 1046, 1061, 1063, 1047, 1022, 1000, 987, 977, 962, 938, 915, 908, 921, 939, 948, 953, 968, 993, 1005, 997, 985, 989, 1004, 1013]
-78A013JNJ1Nloqj7k5j8%J1J3J2J0kk1k9k2j3j2j3rm%RK1K5J1j0j3MK2K5J5MNJ1J5J1MMJ0
-83A052J8J9J2OMOOJlkN%j7l0j8J6L7K6jj5j0koj7k2j7mJ0J2Jj1j3noj8k8j7NJ8J7PMJ1J6
-89A047J2MLJ0J1nk6l5l0k8l7m1k6j1qqLK5L7L0J6QPPKqj6j0QJ2rl1k8JK3K6K9L9L6Rk3l0
-94I95j2krj5pQJ1lj9k6j9pjjlkKPJ4K0J1j3l0j7K2N1M4Rk1k9k0pJPJ8K9L0K0Lj0j1lNNoj3
-99A006lJ9L9M0K6Qpk1k6k2j5j7k6k7j2J0K3K0J2J6K9L5K0j3m5n9n8m3k3jJ2J0RJ1J4MrrJ
-104I28Olj1qQK5L7L6K0KjJ2K2J7Moj5k7l4k4j2rqJJ1Qqj7qQK0K0Rj3l0k2NL0L3K3Roj5j3
-109A004JRNlkKlqlQJ0JjMLnoPK2K2J7J5J5Lj8l3l6l1k6k2k0k2k6k8k4j5jJ5K6K2ROJ9L8M1
-115I91K1kpQK1J9Nj0k0l1l7k8nJ5J5LJQJ5J6J8K0J3pk1j9jQQM%pj3j3j0j3k2k4qQRlj4j8
$$ y = [1013, 1014, 1019, 1030, 1035, 1032, 1026, 1018, 1001, 976, 958, 958, 969, 982, 994, 1004, 1002, 981, 952, 930, 917, 905, 892, 883, 879, 879, 888, 909, 934, 945, 935, 922, 926, 948, 973, 988, 992, 997, 1008, 1023, 1034, 1038, 1042, 1052, 1070, 1089, 1101, 1107, 1111, 1117, 1123, 1124, 1121, 1119, 1124, 1124, 1107, 1077, 1059, 1075, 1112, 1138, 1137, 1122, 1112, 1110, 1104, 1087, 1065, 1048, 1044, 1054, 1066, 1067, 1056, 1043, 1038, 1032, 1014, 986, 969, 974, 992, 1009, 1016, 1020, 1031, 1047, 1059, 1063, 1066, 1076, 1087, 1082, 1056, 1021, 991, 963, 926, 885, 859, 848, 840, 832, 835, 860, 897, 927, 943, 951, 958, 965, 967, 959, 943, 933, 941, 953, 944, 913, 885, 886, 909, 935, 964, 1003, 1039, 1048, 1025, 995, 983, 981, 972, 957, 950, 958, 969, 966, 947, 921, 902, 895, 894, 893, 890, 888, 890, 897, 911, 931, 942, 929, 899, 882, 904, 955, 999, 1008, 987, 958, 938, 931, 932, 939, 957, 986, 1016, 1036, 1039, 1029, 1018, 1015, 1020, 1025, 1019, 1006, 1003, 1022, 1061, 1101, 1127, 1135, 1128, 1107, 1081, 1059, 1044, 1027, 1001, 974, 962, 972, 995, 1015, 1027, 1043, 1072, 1107, 1127, 1114, 1069, 1010, 952, 909, 886, 885, 897, 907, 916, 927, 941, 945, 936, 927, 928, 934, 931, 920, 912, 920, 945, 982, 1018, 1038, 1040, 1039, 1051, 1073, 1090, 1094, 1088, 1073, 1046, 1012, 988, 976, 967, 959, 960, 971, 979, 971, 954, 946, 954, 974, 994, 1003, 990, 960, 938, 943, 973, 1006, 1029, 1038, 1032, 1017, 1004, 1005, 1014, 1019, 1016, 1014, 1016, 1013, 1005, 1002, 1010, 1020, 1021, 1020, 1024, 1027, 1022, 1016, 1023, 1045, 1067, 1084, 1099, 1114, 1117, 1099, 1066, 1030, 999, 973, 951, 931, 909, 883, 855, 831, 816, 815, 830, 856, 878, 887, 893, 912, 950, 991, 1012, 1010, 1003, 1011, 1032, 1051, 1056, 1046, 1026, 995, 958, 930, 925, 940, 955, 958, 959, 967, 982, 998, 1016, 1036, 1049, 1042, 1021, 1002, 1001, 1009, 1017, 1021, 1021, 1014, 1001, 988, 978, 965, 943, 919, 911, 919, 928, 925, 911, 893]
-120H93j7pQJ4Lj1j0LJ1PRK4L3K2N%J0J9K0J4Kj5k6k2j1%NJ3J7PplJ7L0K7K2K5K2Pj0j6j7
-126A117l0m1l2nRLj0j2j0qoKJj0k0j8nPJ6K2K3J6RJ1J3Npj1rj4k6k5nK0L5L8L0J5mj6j9k5
-131A024m0m8m0k2mJ1K4K8J3qj4MK9M1L5K2Pnj6k2k6k3j4ojLJ1K2K7K7K3J4Jj2j3kOJj1j6
-136A030pMPnk3l2k0mkj5k0qNMppLQJ0J9L6L6Ol6n8n1k9qOJ9K5K7K2J7J2RRO%oJJ5J7Jk3k9
-141I64j4NJ2OkoJJ2J6Oj2k7k6j5kJ1K1K8K7K8L0K5Jl4m8l0kMrj8nJ4J9J2OOnk4l8k6ML2L4
-146I81K0Mmj0j8k1j0J1K3J6ok2k2rNJ4J8K2K0J1K%LNLjkMMjqlJ3K7K1jj5oROj7l3l2k3j8
-152I60j5mJ4K3K5K3K0J4QOOkj6k5k0oOJ7J5kl2n0m3k2mOJ6L3M6N0L9J5j4l1l1k4j2JJ9L0
-157A039K1Lj0j2j5k7l9m4m6m3k7PM1N5M4K9J5Moj1qlorrmjmj3j4kJ5K2J4RJ8L2L2Pk3l1j7
$$ y = [893, 876, 869, 877, 891, 894, 883, 873, 876, 887, 894, 903, 927, 960, 982, 987, 987, 997, 1016, 1036, 1050, 1052, 1037, 1011, 989, 978, 978, 983, 996, 1013, 1020, 1013, 1010, 1027, 1057, 1084, 1106, 1131, 1153, 1160, 1150, 1134, 1117, 1087, 1046, 1014, 1009, 1018, 1021, 1011, 999, 989, 981, 975, 977, 978, 968, 948, 930, 925, 932, 948, 970, 993, 1009, 1018, 1029, 1042, 1047, 1040, 1029, 1020, 1006, 980, 955, 950, 970, 1005, 1043, 1073, 1088, 1084, 1068, 1049, 1024, 984, 936, 896, 874, 870, 881, 905, 933, 946, 938, 924, 928, 957, 998, 1033, 1055, 1062, 1057, 1041, 1019, 993, 970, 956, 950, 949, 952, 963, 985, 1012, 1039, 1062, 1076, 1077, 1065, 1052, 1050, 1056, 1057, 1046, 1030, 1023, 1027, 1034, 1029, 1006, 974, 954, 950, 948, 933, 913, 905, 910, 914, 907, 900, 903, 911, 921, 940, 976, 1012, 1018, 982, 924, 873, 844, 836, 842, 861, 886, 913, 935, 952, 964, 973, 982, 988, 988, 982, 983, 998, 1015, 1016, 993, 964, 950, 955, 967, 973, 971, 965, 966, 978, 994, 1000, 988, 961, 935, 920, 918, 929, 950, 978, 1005, 1033, 1063, 1088, 1089, 1055, 1007, 977, 975, 979, 970, 952, 947, 961, 980, 992, 998, 1004, 999, 975, 937, 911, 915, 947, 981, 1001, 1005, 1001, 991, 973, 952, 942, 953, 976, 992, 986, 964, 942, 933, 938, 952, 970, 992, 1012, 1023, 1025, 1025, 1028, 1033, 1036, 1035, 1033, 1037, 1041, 1040, 1032, 1029, 1042, 1069, 1090, 1089, 1074, 1068, 1077, 1083, 1066, 1033, 1001, 978, 960, 945, 941, 955, 978, 1003, 1026, 1046, 1060, 1068, 1074, 1080, 1078, 1062, 1037, 1017, 1011, 1017, 1034, 1049, 1047, 1015, 965, 922, 900, 896, 902, 918, 951, 997, 1047, 1086, 1101, 1087, 1056, 1025, 1001, 989, 990, 1009, 1039, 1060, 1063, 1053, 1041, 1026, 999, 960, 916, 870, 827, 800, 807, 848, 903, 947, 976, 991, 995, 989, 978, 970, 967, 961, 952, 943, 939, 938, 934, 921, 907, 905, 920, 942, 956, 965, 983, 1015, 1047, 1054, 1031, 1000, 983]
-162I83LJ5J7J3Mj0k4k9k4k0k0j8mJ5K6J8Lqj2j2pNJ7K4K1J9K5L0K0pl6n0m7l3j6%RJj6k1
-167H54lK4L3J9LJ%qj9j8oKPJ5L2M3L7J9nk2k7j9j0rj0nMJj2j2OK9L2K1QJorkJ3K0K0J4No
-172A055j1qqj8l0k1jQJ%J3K1PrkJ5J1j6l4k4kJ1J5J5J0JlKPlj4j6rj2j8nK7N0L9Ok1k9k6
-178I74j3J1L6M0J5j4k6k2k2k6k6j3%%j4k6k4nK0L0J7%LJ8J8rl2k2QJ9NqMK1J5pk1k0j7k1
-182H66j7KK3K7J8J2J7K4K7K2J0lj0oMPJkOK1K7J7kk4m0m3l2j7rj2j3lJ3K2J3qk4k7j2PJ9
-187I01J9J5J3RKjNJ5J4LlKLqk2k5k0j6j6qMOmj3rKMknlNJ6K5J8ok6j9MJ2jj2mQJ2NJok2l5
-193H37l1j6jNJ2K2K9K5K0J9K1J8J2Omj4j4lJ3J9J6RJpqorj6j5jJ2J4J1J9K6J0k4l8k0QJ1
-199I68jpkKj0k2k8k4j4JK1L7M0L0Rqj3mJ0J7Oj3k1j0NJ0jj4j6j7k4l4k7mJ5J6PRJ8K3J5P
$$ y = [983, 986, 1001, 1018, 1031, 1035, 1025, 1001, 972, 948, 928, 908, 890, 886, 901, 927, 945, 948, 940, 928, 916, 909, 914, 931, 955, 976, 995, 1020, 1050, 1070, 1063, 1027, 977, 930, 897, 881, 881, 890, 891, 875, 854, 851, 875, 908, 927, 930, 931, 931, 923, 904, 886, 880, 882, 889, 904, 936, 979, 1016, 1035, 1030, 1008, 981, 962, 952, 943, 933, 928, 932, 933, 921, 909, 915, 944, 976, 997, 1005, 1006, 1000, 991, 989, 1002, 1022, 1042, 1056, 1061, 1055, 1044, 1036, 1028, 1010, 980, 959, 958, 966, 967, 967, 980, 1001, 1008, 999, 997, 1012, 1023, 1007, 973, 949, 947, 958, 973, 988, 998, 999, 996, 998, 1005, 1002, 988, 972, 963, 951, 933, 928, 955, 1005, 1044, 1050, 1029, 1000, 974, 961, 972, 1008, 1048, 1063, 1049, 1023, 1001, 979, 953, 927, 914, 914, 914, 900, 874, 850, 845, 865, 895, 912, 912, 915, 933, 951, 942, 910, 888, 896, 915, 920, 912, 916, 937, 952, 945, 924, 904, 887, 866, 849, 851, 874, 901, 919, 931, 948, 972, 999, 1021, 1031, 1028, 1018, 1012, 1016, 1023, 1024, 1022, 1028, 1049, 1076, 1093, 1091, 1067, 1027, 984, 952, 935, 926, 914, 901, 898, 911, 933, 946, 938, 914, 887, 875, 882, 901, 920, 935, 948, 957, 959, 958, 963, 978, 992, 995, 992, 994, 997, 989, 967, 942, 922, 906, 890, 882, 886, 892, 888, 875, 866, 868, 872, 870, 865, 862, 867, 883, 908, 926, 920, 894, 875, 879, 891, 890, 878, 874, 882, 894, 899, 900, 894, 872, 837, 806, 790, 789, 794, 806, 828, 857, 882, 902, 921, 942, 960, 972, 978, 974, 960, 946, 943, 956, 975, 991, 1000, 1001, 994, 986, 980, 971, 955, 940, 939, 951, 965, 976, 995, 1021, 1031, 1007, 969, 949, 957, 968, 967, 960, 958, 960, 950, 928, 900, 876, 862, 863, 884, 921, 961, 991, 1000, 992, 979, 975, 985, 1002, 1008, 995, 974, 964, 969, 979, 978, 964, 948, 931, 907, 873, 846, 842, 857, 873, 880, 889, 907, 930, 945, 952]
-204I52MJoj0rpqrjJ2J6PmkJ6L0K9J3lj2j8k5k1%K4K5Mj9k5j4oorj1nOJ1Ooj1pqk2l5l4k8
-209G75k6k4kL8O4N4J7j5k6j7NK7M0L0Rj0j4nOJ3J1LmoJRJ2J0QPOKqk2l3l3k0jJ1J0lj3j1
-215H75JJ1QKMJ5K6K8K3J7Rkrj0l%%lrj4j4okqk1k3j4qj4j6jK3L7K6Jk1k8k2j0LJ0J4J6J7
-220I08J5J1O%n%J8L4K8Lk5l8m5m7l9j6NJ1PJ2L5N4N5M3J9j2m1m4k1MJk1k5nJ1PlMJ7J7QR
-225I55J7Pk2m0k3J2L1K4Mj3k2k1j0%JlmMJ3J6J9K0J4lj8j5kMnk1k5j5mJkj1k3k6j4J0L2L9
-230H81L1J1j2k9k9nK6M1L0Pj7l6m3k9%K3K7K3K0J8Lk1l1j9jJj0k4k0nJ5K1J9J6J9J5pl5m1
-235H33k4lQJ9L4M1K5jqJ3L3L2J1j4k7k1kJ8J8nk5k4p%rj5jJ9J9kj5qOMoqmnnNJ9J2j0j6Q
-240I12K9J8klRjk8l5rJ6J4LJMjqnlj4j7%K4K8J2OK0L0J6qk1j5qrj6k3k1j0J0K8K7J1kmLJ
$$ y = [952, 956, 957, 951, 941, 932, 925, 917, 908, 907, 919, 935, 942, 938, 936, 952, 982, 1011, 1024, 1021, 1009, 991, 966, 945, 945, 969, 994, 998, 979, 954, 940, 934, 928, 919, 908, 903, 909, 920, 926, 920, 909, 902, 894, 872, 837, 803, 775, 749, 725, 723, 761, 825, 879, 896, 881, 855, 838, 843, 870, 910, 940, 949, 939, 925, 920, 926, 939, 950, 953, 949, 943, 944, 953, 965, 975, 983, 990, 996, 998, 990, 968, 935, 902, 882, 881, 892, 902, 899, 886, 875, 876, 887, 895, 897, 901, 916, 942, 970, 993, 1010, 1019, 1017, 1008, 998, 995, 995, 995, 992, 983, 969, 955, 949, 947, 939, 918, 895, 881, 873, 859, 843, 842, 865, 902, 928, 929, 908, 880, 858, 848, 851, 861, 875, 891, 908, 923, 934, 940, 940, 935, 935, 953, 987, 1015, 1018, 993, 955, 910, 863, 824, 808, 813, 824, 831, 843, 878, 932, 987, 1030, 1049, 1037, 996, 952, 931, 935, 936, 915, 890, 885, 896, 903, 900, 904, 921, 938, 946, 955, 972, 979, 957, 917, 894, 906, 937, 961, 965, 952, 930, 909, 899, 899, 900, 897, 893, 897, 910, 926, 945, 965, 979, 976, 958, 943, 941, 945, 940, 919, 894, 879, 875, 876, 874, 863, 840, 814, 800, 810, 842, 881, 912, 923, 911, 882, 853, 848, 874, 915, 945, 952, 935, 899, 856, 827, 827, 850, 877, 900, 920, 938, 941, 920, 889, 870, 869, 870, 860, 836, 816, 811, 826, 847, 866, 882, 901, 916, 909, 874, 833, 809, 806, 814, 833, 867, 908, 933, 932, 924, 937, 970, 1002, 1013, 999, 972, 951, 949, 967, 985, 980, 955, 931, 924, 924, 915, 900, 899, 918, 937, 935, 920, 912, 918, 922, 916, 908, 904, 899, 894, 899, 918, 930, 920, 904, 912, 941, 959, 957, 954, 963, 962, 934, 899, 890, 906, 920, 923, 924, 928, 927, 919, 914, 911, 897, 880, 880, 904, 932, 944, 950, 970, 1000, 1016, 1008, 987, 972, 964, 955, 939, 916, 895, 885, 895, 923, 950, 961, 959, 955, 958, 959]
-246I59j3k2j3J0K3Rj7k7j4JPOJ0J7J4OOJ6K5K0Lj0pNJ6J3Jj5k3k4k7l4l6k1MK6K9J9Jj5k1
-251I07j0J5L7L4J1j4k8k8k0qLNlj3rPK3K5Qj7l5l5j8JRJ1OlnMJ6J3pk2j7kjrj2kPLmJJ5K7
-257H66K9K0%j8k5j9lQJ6J8J3%j2j7j6j5j2ojKOJ2K3K6K2J4Ojoj1qkOPkrrlmj0j2mKJ%MQN
-262H89knnj4k1j8rrj7j2J2L3K5LqMJ6J4Nlpj3j9j7nJ0J5PkMK4L9L5K1J8J9Nk3m0k8mQMKJ
-268I32j0k8l7k4ojoj0%K0M5O1N7L6J4%j2l0m3l7j6qj5j9mK0K8J7ROkk3l8k6NL0K5Kj6k0j3
-273H63j0rmPJ4J1NJ2K7L8K8Nj1rLMrj9j4jJpj0JJ5J3JlKNkj0oPJ8K0K4K5J7qk8l2k0oLOK
-279I59j0k2j7KJ9K4J7Lj5k5j8JQ%j3j5j4j8j4RL7M1K0kro%J1J7J6J1QMj3l8m2j6RRopJ1K1
-284I37J1nj0pjQJ6J4Jj2j1m%kmJQJ2J2RON%pj0pPJ9K4J7Pmj1j8k2k2j9j4j5j7j4kQOklLJ0
$$ y = [959, 946, 924, 911, 921, 944, 953, 936, 909, 895, 896, 903, 909, 919, 936, 950, 956, 962, 978, 1003, 1023, 1026, 1016, 1009, 1014, 1030, 1043, 1044, 1029, 1006, 982, 955, 921, 885, 864, 868, 894, 923, 942, 943, 928, 907, 897, 912, 949, 983, 994, 980, 952, 924, 904, 896, 899, 904, 901, 888, 879, 886, 909, 934, 942, 925, 890, 855, 837, 838, 847, 858, 864, 861, 856, 860, 876, 889, 882, 860, 843, 841, 840, 831, 819, 817, 824, 827, 823, 824, 839, 866, 895, 915, 915, 897, 872, 853, 850, 858, 874, 892, 905, 905, 893, 876, 860, 845, 833, 827, 826, 828, 834, 846, 869, 895, 917, 931, 937, 936, 930, 919, 911, 909, 915, 922, 920, 911, 902, 899, 895, 885, 873, 869, 871, 872, 872, 876, 884, 889, 887, 882, 877, 863, 842, 824, 815, 806, 789, 777, 789, 822, 847, 850, 842, 846, 862, 876, 881, 878, 871, 858, 839, 822, 817, 827, 842, 849, 847, 851, 875, 914, 949, 970, 988, 1007, 1012, 989, 949, 921, 917, 925, 929, 931, 932, 922, 894, 857, 833, 827, 826, 820, 810, 810, 830, 875, 936, 993, 1029, 1043, 1043, 1031, 1001, 958, 921, 905, 897, 882, 863, 859, 879, 907, 924, 933, 939, 937, 914, 876, 850, 855, 885, 910, 912, 896, 876, 863, 853, 844, 840, 847, 861, 872, 877, 889, 916, 954, 982, 987, 976, 967, 970, 974, 965, 946, 932, 931, 932, 925, 915, 916, 931, 944, 945, 942, 944, 949, 947, 937, 931, 938, 956, 976, 1000, 1025, 1042, 1034, 1006, 974, 954, 948, 951, 957, 959, 949, 927, 910, 912, 931, 955, 972, 975, 960, 935, 917, 918, 926, 926, 913, 898, 884, 866, 852, 861, 898, 939, 959, 957, 948, 942, 942, 953, 970, 986, 997, 1005, 1009, 996, 958, 916, 900, 909, 918, 912, 905, 916, 937, 948, 943, 933, 926, 925, 933, 949, 963, 964, 952, 941, 937, 937, 935, 931, 932, 940, 952, 964, 973, 979, 984, 984, 977, 967, 960, 967, 986, 1010, 1027, 1034, 1030, 1019, 1001, 979, 957, 938, 924, 909, 892, 878, 876, 884, 890, 888, 885, 888, 898]
-290H98J0MjmoolKOKj1j5KL5N7M9J9rk3k8k5j5lrk8m4l2kK7L3K3J3J4K3K9K0Omrj2j6j8j3
-295I36j0pjPOqk0j6KJ8K0J6J9K2J4qk3j5NRj1l5l4j7rj4j6%K2K5J5ONQRJ1J2J0jj7l3l8l1
-300H33j7lMQKj0k3k3j0KOOJ1J2%j6k1j1J0L0L9L9L2K1J0oj9k0pMjj2j4nkj3j8j2LJ2J4J6
-305H51K5L1K5Pj2j6mRJ3OOQMorjLmj7k1j8j1o%PNkllqj6j9j3nnoNK0K7K0J5K0K2Oj8k9j9
-311H64lPJ3J8K3K7L2L2J7j3l0k5j0pj1j1l%j%jj3k8k6oJ2Qj2k3qK1L7K4qk6k3j4j1j0JMj0
-316H07k3qK1K8J0%NMj6k5j1O%j5j2PK1K6K3J3%kJ5K8J8QK0L2J5k5l9j6QPqj4j5k4k7j7nn
-322H15oQK4K7K2J8J0rk6j8RK0Oj4j3NK0J6Mnn%K%jKLnj4rPJ6Kk1k8j3PJ4J3J7K5J9rl7m0
-327H58j5J1K2J4LlmKRJ1Lj2j9j8j5j3rl%pj0KK7L7K1lnRJ0j0l2l2j5KJ3K6L4L0J6Nnj5k1
$$ y = [898, 908, 912, 911, 907, 901, 895, 892, 894, 900, 902, 891, 876, 878, 913, 970, 1019, 1038, 1029, 1006, 978, 953, 938, 935, 926, 898, 854, 822, 820, 847, 880, 903, 916, 930, 953, 982, 1002, 1008, 1004, 995, 983, 967, 949, 936, 926, 919, 918, 925, 931, 923, 903, 887, 889, 907, 927, 943, 962, 984, 998, 990, 967, 952, 957, 966, 955, 920, 886, 869, 860, 846, 830, 830, 852, 877, 892, 898, 903, 911, 920, 931, 943, 953, 952, 935, 902, 864, 833, 816, 813, 817, 825, 827, 817, 794, 771, 761, 763, 769, 775, 786, 798, 798, 782, 761, 750, 760, 790, 829, 868, 900, 921, 931, 925, 906, 886, 879, 883, 882, 870, 856, 851, 849, 836, 818, 806, 809, 821, 835, 851, 876, 907, 932, 939, 927, 911, 907, 916, 929, 935, 941, 949, 953, 947, 938, 937, 940, 936, 919, 898, 880, 869, 863, 863, 870, 875, 873, 870, 867, 859, 843, 824, 811, 806, 801, 795, 800, 820, 847, 867, 882, 902, 924, 930, 912, 883, 864, 861, 868, 881, 899, 922, 949, 981, 1013, 1030, 1017, 987, 962, 952, 945, 934, 923, 920, 920, 919, 919, 918, 905, 877, 851, 845, 857, 865, 853, 830, 822, 843, 880, 904, 896, 870, 847, 833, 822, 812, 813, 817, 807, 784, 776, 797, 825, 835, 835, 840, 844, 828, 803, 792, 798, 798, 783, 771, 778, 799, 825, 848, 861, 861, 859, 874, 902, 920, 928, 948, 980, 995, 970, 931, 915, 923, 930, 922, 908, 893, 869, 842, 825, 820, 815, 809, 817, 841, 868, 890, 908, 918, 909, 883, 865, 874, 894, 900, 886, 873, 878, 898, 914, 918, 913, 908, 908, 910, 910, 909, 911, 914, 909, 895, 886, 893, 909, 911, 890, 862, 849, 856, 870, 883, 900, 925, 944, 935, 898, 858, 843, 854, 876, 890, 893, 890, 886, 888, 897, 908, 911, 899, 880, 862, 847, 834, 825, 822, 822, 815, 805, 807, 834, 871, 892, 889, 884, 893, 903, 893, 861, 829, 814, 816, 829, 855, 889, 919, 935, 940, 935, 920, 899]
-332H99qRMj8k4qQJj8j8%K1L1L5L2K7K5L1L1K0Okj0k6l8l0pMnj3j1qpJJ5J9kk6k8j8j1j8k2
-338H43j2JJ0J2J0NK%mooJPJ2J7K2J9Mk0l8m3l8k4nPRJ2K0K4Rj3k1pJ1K2K4K6K2J0OJ4K0J3
-343I77pk4l0k9j5MOj5l4k3J0K7J9J4K6L3J6pj1rj9l4k9qJppMKj1j0J3K8J1j7k1qpj7j9jJ7
-348G89K0J8J7J4MmonlPJ8J2j4l4k4OK1J1j2j9kK7M9M7K6NnkLLkopj0j6k8l3k2JJ6J2LQK2
-353I05J9ok8k7j0LJonkkrk2l3l0j0J7K9J5j1k9l0j6QL3M5L2Nj4j4qkMJ7K5J8Mjkrk3k7j4
-359G90%MJNJ5K1J5RPJ2J0Lm%J2K1K0J4J1PJoqj0j7k2j5mlj4j7lRNrj9k0j7qQJ7J2PRQkpJ0
-364H58L5L8J9LNPnk2k4j8qKJ5K2J5jj7k7k9j6PJ8Mj4j8j4j6j7oJ1J3LJJ0Rrj9%K3K7J5QR
-370H97PLQJ4QmlJ5K0mk9l1j2RK1L0L1J8nk5l2l0j9%J9K6J7OPJ3Oj5k7j6LJ0mj9k3j6j3j6
$$ y = [899, 891, 900, 904, 886, 862, 854, 862, 863, 845, 827, 827, 848, 879, 914, 946, 973, 998, 1029, 1060, 1080, 1086, 1084, 1074, 1048, 1010, 980, 973, 977, 972, 959, 948, 940, 933, 934, 949, 968, 966, 940, 912, 894, 883, 865, 843, 831, 832, 842, 854, 864, 869, 871, 871, 867, 861, 855, 856, 863, 875, 892, 914, 933, 937, 917, 879, 836, 798, 774, 769, 776, 785, 797, 817, 841, 850, 837, 816, 809, 820, 842, 866, 892, 914, 924, 930, 944, 964, 977, 970, 946, 916, 887, 872, 876, 882, 867, 833, 810, 820, 847, 866, 880, 906, 939, 955, 948, 937, 928, 909, 875, 846, 838, 839, 832, 825, 829, 831, 820, 810, 823, 851, 862, 845, 824, 816, 809, 792, 773, 772, 789, 809, 827, 844, 858, 862, 858, 852, 847, 844, 851, 869, 881, 867, 833, 809, 815, 836, 847, 835, 816, 814, 841, 890, 937, 963, 968, 963, 961, 964, 967, 965, 959, 952, 942, 926, 898, 865, 843, 844, 860, 872, 875, 883, 905, 924, 918, 890, 863, 853, 856, 857, 851, 846, 844, 842, 833, 811, 778, 748, 738, 755, 784, 799, 788, 759, 729, 713, 721, 754, 799, 831, 836, 822, 808, 800, 798, 802, 819, 844, 862, 866, 865, 863, 854, 831, 804, 790, 790, 794, 795, 800, 815, 836, 851, 860, 867, 879, 889, 892, 888, 888, 900, 921, 941, 955, 966, 973, 974, 968, 960, 950, 933, 911, 896, 892, 889, 875, 858, 855, 864, 869, 860, 841, 821, 804, 796, 804, 821, 833, 840, 849, 857, 855, 848, 858, 893, 931, 950, 953, 958, 965, 960, 938, 914, 896, 888, 890, 905, 927, 942, 941, 924, 897, 868, 852, 859, 877, 881, 867, 849, 835, 819, 802, 796, 807, 820, 823, 824, 834, 843, 834, 815, 815, 838, 865, 880, 888, 897, 904, 907, 915, 929, 937, 933, 930, 945, 965, 961, 932, 901, 889, 898, 919, 949, 980, 998, 993, 968, 936, 906, 887, 887, 906, 932, 949, 955, 962, 975, 981, 966, 939, 923, 926, 936, 932, 913, 890, 874, 861, 845]
-375H45j0KJ4J5J1N%omJ%mnjmj9k3qJ4K0J5J9L0K1nk1j5mmoRK7K8Rj2k6l9m1k6nKprOK0K0
-380H29J2QJj0j7j0OJ7K3K8L1K3Oj0k5l6m2l3j5lnmPJ7J3QJ7L1K9Pj6k2j8j5qJ3L7M5L5J9
-385I73Nj5l3l6k3qKOJ0QlrMK0J7ql5m1l0j2LRNlmPJ8J6RJ2K4K8J3j4k4j0J5K4Pj5k4j9j7
-391H52k0k2k0j6j6j0QL3N0M8L4J9J3J3J0Kpj3j6j9j8rJMpj7j4lMoj8j3J2L3K5kj7oJ4J7O
-396I09kqj8k7k4qQJ6K8M1L7J3j3k7k5k0j3j2j9k9j9RK9J9qj6PL1L5K8K6K7K0%j7k1j5j2j9
-400I11k8l3l2l2l3k3%K3L0K0J1NjmLJ9L2L2K2Lj9l4l0j2MOPJ8K2kl8n0k1K1L5K0PRJ5Prj8
-405H63j7k2k7k1kJ8K6K5J7ll0l9k1J1K9L3L5M0L3J5jqj3k1k3j0RJ7J3Krj3oLLnj1n%lrpl
-411H63llNJ4J3OLNKmnKKmmNJ1%j6j8kJ4K4K9L2L0J9Nrk4l6l5j4J4K1ll8n6m3j4NPJlorrl
$$ y = [845, 835, 837, 851, 866, 877, 882, 882, 876, 872, 873, 873, 869, 864, 863, 859, 840, 817, 809, 823, 843, 858, 877, 907, 928, 923, 902, 887, 883, 879, 873, 882, 909, 937, 946, 934, 908, 869, 828, 802, 797, 799, 792, 783, 789, 809, 829, 841, 849, 850, 840, 823, 813, 819, 836, 859, 887, 918, 941, 947, 937, 912, 876, 834, 801, 786, 783, 778, 774, 781, 798, 811, 819, 836, 867, 896, 903, 887, 865, 847, 832, 824, 837, 874, 919, 954, 973, 978, 963, 930, 894, 871, 863, 865, 871, 881, 889, 886, 877, 881, 901, 918, 910, 875, 834, 804, 792, 795, 804, 809, 806, 802, 809, 827, 843, 852, 864, 888, 916, 929, 915, 891, 881, 896, 920, 927, 912, 888, 869, 852, 832, 810, 790, 774, 758, 748, 756, 789, 839, 887, 921, 940, 953, 966, 976, 978, 971, 958, 942, 923, 905, 896, 897, 901, 894, 877, 863, 860, 864, 858, 840, 827, 839, 872, 897, 895, 878, 872, 886, 903, 909, 907, 899, 881, 854, 830, 822, 830, 846, 874, 915, 952, 965, 952, 925, 900, 880, 867, 855, 836, 807, 788, 797, 826, 845, 837, 821, 828, 859, 894, 922, 948, 975, 995, 995, 978, 957, 942, 930, 911, 883, 850, 818, 786, 753, 730, 730, 753, 783, 803, 814, 819, 818, 814, 817, 836, 868, 900, 922, 925, 906, 872, 842, 830, 834, 840, 847, 865, 887, 885, 847, 797, 776, 797, 832, 852, 859, 868, 883, 890, 881, 863, 846, 824, 797, 776, 774, 792, 818, 843, 860, 857, 827, 788, 767, 778, 807, 840, 875, 915, 948, 963, 962, 954, 941, 920, 897, 887, 896, 913, 926, 928, 919, 906, 900, 903, 906, 901, 890, 885, 885, 882, 873, 866, 863, 860, 857, 862, 876, 889, 895, 898, 903, 905, 901, 896, 898, 900, 896, 892, 897, 908, 908, 892, 874, 872, 886, 910, 939, 971, 1001, 1020, 1025, 1016, 992, 956, 921, 907, 921, 942, 939, 901, 845, 802, 788, 793, 800, 801, 798, 792, 783, 774, 771]
-417G71RK4L5M0L1Rj5k7k3j2lNJ5K1J8Pkrj7k2j8j0mmlMPNOJ8K2Rj2j8j7k5l6k7LL0L2K0J8
-422H55K4K4J3lj8k8k9k0j1oonrj3oJ1K0Rj4k2j2KJ0J6J7QqqOJ4Orj2oKJ0K4L8L8L0J9J1O
-427I68Klj5k9k8pJ9K3Oj5k6k8k5j9oJ0K1K3J8Qpk2l2k9j0J5K9J9ok3k2nJ2K1J7Kj4k0pJ1
-432H26J9J5PKKORNpj7j8oJ2K5L4L1J9%j5k0k4l0l6l1j8jJ3K2K7K1J3RJ2J2jk2l8l9k9j6l
-437G70PJ4J8K5K6J5qk7k4pMMj%J0J8J9J2MLMkj8l4k9oJ2RmqLJ1QLRJ8J4mk0k3j2lLQJ3J4
-443H48J2OJkmmoj0j7k0j4%J4J6Mj0pJ4L2L0J5OMLlpk%mj4j8j2jPOok0k2j2%MLJ0K0K6J4j8
-448H62m6m8j8J7K8J7PMok7l7j9J2L0K3J1PPOJ0K2L3K6%k9l7k2poj2mJ2K0J3JJ%j4k9k6nJ1
-454G88J1J0J8K6J9Jj2j3rnKJ1J7J3lj2mJ4K6J9Kj1j7j3nLPJ0J7K5K2Nj0oOPok6m5n8n2k4
$$ y = [771, 780, 804, 839, 879, 910, 919, 904, 877, 854, 842, 839, 844, 859, 880, 898, 905, 903, 894, 877, 855, 837, 827, 823, 819, 816, 820, 827, 832, 838, 856, 878, 887, 875, 857, 840, 815, 779, 752, 755, 785, 817, 837, 855, 879, 903, 916, 913, 895, 867, 838, 818, 807, 801, 795, 790, 781, 768, 762, 773, 793, 802, 788, 766, 754, 756, 766, 782, 799, 807, 799, 791, 797, 811, 817, 808, 796, 790, 792, 802, 826, 864, 902, 932, 951, 962, 968, 970, 967, 952, 923, 895, 888, 907, 930, 936, 921, 895, 867, 842, 823, 817, 827, 848, 871, 889, 897, 890, 868, 836, 807, 797, 812, 841, 860, 854, 831, 809, 804, 816, 837, 854, 856, 842, 822, 815, 826, 845, 860, 867, 869, 871, 877, 886, 891, 884, 867, 849, 843, 855, 880, 914, 945, 964, 964, 949, 929, 905, 875, 839, 808, 790, 789, 802, 824, 851, 872, 885, 894, 906, 918, 917, 895, 857, 818, 789, 773, 770, 777, 791, 809, 834, 860, 875, 867, 840, 816, 809, 813, 817, 816, 816, 826, 844, 863, 875, 879, 882, 886, 884, 866, 832, 803, 797, 809, 818, 814, 806, 809, 820, 828, 831, 840, 858, 872, 868, 848, 825, 813, 810, 813, 821, 834, 848, 860, 866, 867, 865, 861, 857, 851, 841, 824, 804, 790, 790, 804, 820, 824, 814, 807, 821, 853, 883, 898, 904, 908, 911, 908, 901, 899, 899, 895, 881, 863, 851, 850, 857, 863, 857, 837, 815, 803, 803, 807, 810, 820, 840, 866, 880, 862, 816, 768, 750, 767, 795, 812, 819, 823, 817, 790, 753, 734, 746, 776, 799, 810, 817, 824, 830, 840, 862, 895, 921, 921, 892, 855, 833, 826, 820, 808, 804, 816, 836, 849, 850, 851, 851, 837, 808, 782, 777, 788, 799, 809, 827, 853, 872, 873, 861, 848, 839, 834, 836, 847, 864, 877, 874, 862, 858, 872, 898, 917, 919, 908, 891, 878, 873, 876, 883, 893, 910, 935, 957, 962, 952, 946, 952, 959, 953, 927, 882, 824, 772, 748]
-459G48J1J8jj7j6j0j1rKJ0OLJ2K2K0J2J9L1L2J8LlnqqnJJjl%J0K3K2Oj6k7l4l9l2j0J7K7
-464H19J9J0QKj4k9l9m4m0j7K0M6M1J4qpOK1K7K6K2J9J3nl0m2k9lJ1Mrj1JQMrj1kJ3J8J3L
-469H39j0k3l0k6j1kJKKnj7k5j5QK6K6J5Lkj%JKQJ1Kj2k0pJ8L9M5K7ol3l7j9mmj2qOK0K3J8
-475H13Mrj5qPJ6J7J8J8J2Jj5k9l1j6J2K7K3J4K1L6L5J5jJNok5l1k0lQQkrnQJ8J1mj0qlJ%
-480H99pk3l8l5j4PJ6J4J5J5Pqj3nJ1K1K1J6J0Jj1j7j4j3j2oQJ3mk5k8j0%j2k2oJ6J9QPK0
-485H21K0LoPK5K6J3Kknomkpr%RPklLKj4k9l2j8JJ6J8Jk0k4kJ9K0Kj3j3o%LPMoj6j1OK1K5
-491H31J8Ooj6j6oNOqj8j4JJ1J2PJoj4k0k5k6j7J3M7O1M5J7LQJ5J1Jj5k9l8l4j9qj4k9l6k5
-496F80%K2L2L5L7L8L3J8kj7k7l3l7l3j8PK9L8K6MmQK5K6Oj9l2k8k0j7j3kJ3K1J7RJ3K5L1
$$ y = [748, 759, 777, 776, 759, 743, 733, 722, 713, 715, 725, 731, 734, 746, 768, 788, 800, 819, 850, 882, 900, 903, 900, 895, 887, 879, 874, 875, 876, 875, 872, 872, 882, 905, 927, 933, 917, 890, 856, 817, 785, 775, 792, 819, 838, 848, 856, 858, 844, 815, 776, 732, 692, 675, 695, 741, 782, 796, 788, 781, 787, 808, 835, 861, 883, 902, 915, 910, 880, 838, 809, 806, 817, 821, 812, 801, 802, 810, 814, 805, 794, 792, 805, 823, 836, 839, 829, 806, 776, 750, 739, 737, 738, 740, 742, 737, 720, 695, 680, 688, 714, 740, 755, 758, 756, 755, 755, 756, 758, 766, 777, 779, 767, 747, 740, 758, 797, 842, 869, 863, 830, 793, 774, 770, 766, 754, 746, 752, 772, 795, 813, 817, 808, 793, 785, 792, 808, 825, 843, 861, 873, 874, 859, 830, 799, 783, 795, 822, 845, 859, 880, 916, 951, 966, 965, 966, 971, 965, 940, 909, 889, 886, 894, 902, 900, 891, 886, 894, 912, 923, 919, 909, 901, 898, 899, 899, 892, 869, 831, 796, 782, 789, 805, 819, 834, 849, 856, 848, 835, 830, 841, 862, 883, 899, 909, 910, 899, 882, 868, 855, 843, 837, 845, 858, 854, 829, 801, 791, 791, 779, 757, 751, 767, 786, 794, 801, 821, 841, 844, 838, 845, 870, 896, 909, 911, 909, 904, 898, 894, 892, 885, 876, 876, 885, 892, 890, 887, 890, 892, 878, 849, 817, 799, 800, 816, 834, 835, 815, 791, 789, 808, 828, 830, 817, 804, 798, 798, 801, 808, 812, 806, 790, 779, 785, 806, 831, 849, 855, 849, 833, 817, 811, 816, 822, 814, 796, 782, 783, 794, 806, 813, 814, 808, 794, 774, 749, 723, 706, 719, 766, 827, 872, 889, 892, 900, 915, 926, 927, 912, 883, 845, 811, 792, 784, 770, 741, 705, 680, 680, 702, 734, 769, 806, 844, 877, 895, 893, 876, 849, 816, 779, 746, 728, 735, 764, 802, 828, 832, 828, 836, 861, 887, 893, 874, 842, 814, 794, 777, 764, 762, 775, 796, 813, 822, 835, 860, 891]
-501H91J9jj4j2qj0j3q%mj7k2pJ5J9Kj0%J6J2j2k9k2kJ4K4L6M3L5J7Koj1j5j4romLMlj1lR
-506H88Kk2l6k2KRpk7l4k2NK6K7J2RK1L2K0%rrj0j4pKpk9l9k7oJ2K9M1L2jl4m1k3%J7K3K0
-512H03J4J4J9J5lk2k9k8k3j0J0K4J8JokNOJ3J9J8Poj1j6k2k2j5nJMM%mJJ5K7K6K2K0K1J7
-517I20O%LOKrk1k5k0j2omoj0j3j4rJOJpj3qQK5L0J9kj3mJ3J0j2l3l2rJ2J9J4PNL%mopkJ0
-523H19K3K5J4lj4j4j1j0oMJ8K5K1J0pk2l4m3m4l1lK9M2K3j6m9n4l3kK3L7M1L9L9L7K7Rqj1
-527H90nkjPJ3%l0m7l4rMMQJ7J8Mj4k2j8qPJ5J0JJJ5K0J0jMJ5J4NNJ5K2J2j0l2m1k7kJ2%j6
-533H29j3PK1J6QQNoqKPjj2oJ3K4J9Lj3l1m2l9j8KJ0PMJ0J7K1J6Mqj2j1pjMLnj1kJ1J1nk3
-538H08k4j1NK0L1L5K4Kj9k5j8j5j6rJ2L4L4J1j2j5kJ1Plj2j5j9k9l7k8mJ7J7%r%J4J8J7K4
$$ y = [891, 910, 909, 895, 883, 875, 865, 852, 844, 844, 840, 823, 801, 794, 809, 828, 830, 820, 820, 836, 848, 836, 807, 785, 783, 797, 821, 857, 900, 935, 952, 954, 948, 937, 922, 908, 899, 893, 889, 892, 896, 893, 882, 879, 888, 890, 868, 832, 810, 812, 821, 814, 787, 753, 731, 736, 762, 789, 801, 810, 831, 863, 883, 883, 874, 865, 855, 841, 834, 836, 829, 800, 761, 734, 728, 740, 769, 810, 842, 841, 807, 766, 743, 743, 760, 783, 803, 817, 831, 850, 865, 862, 840, 811, 783, 760, 750, 760, 784, 802, 803, 797, 795, 800, 806, 819, 838, 856, 863, 857, 846, 830, 808, 786, 771, 766, 767, 771, 775, 775, 771, 772, 787, 814, 840, 862, 882, 903, 920, 926, 926, 929, 935, 937, 928, 907, 882, 862, 850, 844, 840, 834, 824, 811, 797, 788, 789, 795, 796, 789, 776, 768, 776, 801, 831, 850, 848, 835, 831, 844, 854, 842, 809, 777, 768, 780, 799, 813, 820, 825, 828, 828, 824, 818, 811, 809, 819, 842, 867, 881, 878, 864, 850, 839, 829, 823, 827, 845, 870, 891, 901, 894, 872, 838, 795, 751, 720, 717, 746, 788, 811, 795, 746, 692, 659, 657, 680, 717, 758, 797, 836, 873, 900, 909, 901, 890, 885, 883, 882, 889, 902, 902, 872, 825, 791, 782, 786, 790, 798, 815, 833, 837, 823, 801, 783, 775, 782, 797, 807, 808, 809, 824, 844, 854, 853, 857, 872, 886, 891, 896, 911, 933, 945, 935, 903, 862, 835, 833, 845, 845, 829, 816, 823, 844, 860, 868, 876, 881, 875, 867, 869, 876, 875, 863, 857, 870, 894, 913, 916, 903, 872, 830, 791, 773, 775, 785, 792, 796, 806, 823, 844, 860, 864, 856, 844, 833, 826, 825, 829, 832, 827, 816, 814, 825, 836, 831, 808, 784, 773, 778, 798, 829, 864, 888, 890, 871, 846, 828, 813, 797, 788, 800, 834, 868, 879, 867, 852, 850, 861, 868, 865, 853, 838, 819, 790, 753, 725, 721, 738, 755, 755, 746, 746, 760, 778, 795, 819]
-543H19L4L1J3mj4k4l5l3j2J1J8J4J0Plj5j7qmj2k1k1j3mJ2L1L9K3pk4j8j1j5j8lJ9K7J0j1
-548G71j4lOQMjnlPJ9K1J4Kj6l1l0nK8L8K0lj1ploppnnoqnRK3K5J5J0J4J5%j5j4kQJ0RJj3
-554H52k3k1j0%PJ4J5PjKJ0J0MRK1K5J4OMkj8k8k4k2l0l5k4olqKK6L6K5Okml%J0J5J1NOJ2
-559H90J1mk7m0l1mJ9K1OJJ1K2J9ROOLllKLkmkoj6k4k2j3j1j2oJ5L5L4Ok9m0k6nmj2j2KJ1
-565G74MqoNROPK2L7L5J6%onj2j8j0OJ1pk6k2jJ2Nqj3j3j7k3k7k2j3OK7M1L3J1j0j8j8j5q
-570G41NJ5J6Ooj0mNJ2J2Mnj0%J7L0K5Mj8k4j7j0qpkNONQJ4J6Qj0k8l0j7NK4L2K7J5M%PJ1
-576H73Kj7k9l3l0k6j3NJ6QprJJ0J0QJ3J8J7J1OPRPkj6k8l2k5qJ3K2J1j6l4l2k2j6j4kJ5J7
-581F88Jj3%K8M5L3Lk7l6j7J5K2kj9LM9O3L4JKJ9Qk9n8n8m1k4jK6M0L4J8RLoj3nJ3K4K1J1
$$ y = [819, 853, 884, 897, 893, 879, 855, 820, 787, 775, 786, 804, 818, 828, 835, 832, 817, 800, 792, 788, 776, 755, 734, 721, 717, 729, 760, 799, 822, 815, 791, 773, 762, 747, 729, 726, 745, 772, 782, 771, 757, 754, 760, 768, 772, 771, 766, 763, 770, 789, 810, 824, 826, 810, 779, 749, 744, 772, 810, 830, 827, 816, 809, 806, 800, 793, 786, 781, 776, 770, 762, 757, 766, 789, 814, 829, 839, 853, 868, 868, 853, 839, 837, 845, 855, 864, 865, 852, 829, 808, 798, 798, 805, 819, 834, 841, 840, 842, 852, 862, 866, 875, 896, 921, 935, 941, 945, 943, 925, 897, 873, 851, 821, 786, 762, 756, 753, 745, 747, 773, 809, 834, 840, 838, 834, 831, 831, 841, 856, 867, 872, 878, 890, 901, 897, 870, 830, 799, 795, 814, 835, 841, 842, 853, 875, 894, 903, 909, 915, 918, 915, 912, 914, 917, 915, 911, 909, 903, 887, 863, 841, 828, 817, 805, 799, 814, 849, 883, 889, 860, 820, 794, 789, 785, 773, 761, 763, 774, 778, 770, 764, 769, 778, 784, 791, 813, 850, 885, 901, 901, 895, 890, 878, 860, 850, 856, 867, 860, 834, 812, 811, 823, 828, 820, 807, 794, 777, 754, 727, 705, 692, 698, 725, 766, 799, 810, 800, 782, 764, 749, 741, 746, 761, 777, 783, 777, 767, 763, 768, 780, 792, 796, 791, 781, 781, 798, 828, 853, 857, 839, 815, 798, 788, 780, 773, 771, 776, 782, 787, 795, 809, 825, 833, 823, 795, 765, 748, 753, 777, 809, 836, 851, 855, 855, 862, 873, 875, 858, 829, 796, 766, 740, 727, 732, 748, 756, 749, 740, 741, 751, 761, 769, 782, 800, 817, 828, 834, 841, 850, 857, 855, 839, 811, 779, 754, 746, 759, 781, 792, 776, 742, 710, 688, 672, 658, 656, 671, 688, 689, 676, 676, 704, 749, 782, 785, 758, 722, 705, 720, 742, 740, 721, 724, 773, 836, 870, 871, 873, 892, 900, 871, 813, 755, 714, 690, 689, 715, 755, 789, 807, 816, 819, 813, 800, 795, 808, 832, 853, 864]
-586H64MJKKjj1k2j8LJ6J1orLJ2Rkj4k3l0k8j6qj1j6nJ5K8K5J7J5J4Pnj8k4k2j2kJjJRJ8K0
-591G93J0mj5j5oQJ4J6J3RLpj2j0%J3K4L0K3OmKJ4J4j0l6m4l3k0j1JJ5K4K2J5J5J4P%OJ6J5
-596I15%pOJ7Jl5n4m0nK4L7L1J2j6l6l0%K9L4J1k3l9k9j0LJLJ6K7K5J2Jrj8k5k0oQJ2J0OJ
-602H40nj0j2j3j1lJ2K4K4J1pk2k1%K6L4K1Jj1j5j8j6jK1L3K9J4Kklrk5m3m5k7nlj8k3j0J3
-607G27K9L5L8L3J6lj1o%oj9k8k9k0pJ0K0J4kj3pPJ7J5Plj3j8j4rj5k8k8j0J2J8J4J9L2L6
-612H10K0Jl%jj1j6pQJ9J8QJmj0k2l2k6j0ORRJ2J2NmpqoKJ6K6K2J6K2L3K2j0m0m6l5k4j2%
-617G63J1QJlKJ0J3J0mj9k9l3l1k5qJ3K6L1L2L1K1KrjJ5J7Mpppj7k8k8j4RK6L0K0J2J0J0%
-622H57qMK8L6J4j5k4j3qj6j6JJ5Pj4k0mJ4J3nk1k4j5KK3M2M5L2Oj8l4m0l3j8lRJ5J3KqmJ2
$$ y = [864, 868, 869, 871, 873, 872, 861, 839, 821, 824, 840, 851, 845, 836, 839, 851, 860, 858, 844, 821, 791, 763, 747, 739, 728, 712, 707, 722, 750, 775, 792, 807, 821, 828, 823, 805, 781, 759, 747, 745, 746, 745, 746, 755, 773, 793, 803, 799, 784, 769, 763, 771, 785, 801, 814, 823, 826, 819, 807, 797, 797, 810, 834, 864, 887, 893, 889, 891, 905, 919, 909, 873, 829, 796, 776, 765, 766, 781, 805, 827, 842, 857, 871, 878, 878, 884, 900, 915, 915, 908, 914, 931, 932, 897, 843, 803, 798, 822, 859, 890, 902, 886, 850, 820, 820, 849, 883, 894, 871, 832, 803, 793, 796, 797, 800, 816, 843, 868, 880, 881, 872, 854, 829, 809, 803, 811, 823, 833, 839, 840, 835, 825, 813, 800, 789, 786, 798, 822, 846, 857, 850, 828, 807, 807, 833, 867, 888, 889, 878, 863, 845, 829, 828, 849, 882, 911, 925, 927, 925, 922, 913, 888, 845, 800, 773, 768, 765, 747, 724, 714, 727, 756, 791, 829, 862, 878, 875, 864, 858, 858, 852, 833, 805, 776, 756, 749, 759, 779, 793, 791, 778, 771, 778, 795, 810, 817, 814, 801, 783, 769, 760, 745, 717, 689, 679, 691, 709, 723, 742, 774, 810, 830, 831, 828, 828, 827, 816, 800, 793, 801, 820, 838, 846, 847, 843, 833, 811, 779, 753, 743, 749, 758, 767, 779, 791, 796, 792, 785, 777, 771, 773, 789, 815, 837, 853, 875, 908, 930, 920, 880, 834, 799, 775, 763, 763, 774, 782, 783, 780, 782, 792, 805, 815, 811, 792, 763, 730, 699, 674, 666, 679, 705, 736, 768, 799, 820, 822, 813, 812, 827, 844, 848, 841, 834, 827, 810, 782, 754, 740, 749, 775, 805, 825, 837, 847, 857, 857, 849, 853, 881, 917, 931, 916, 892, 879, 871, 855, 839, 840, 855, 862, 848, 828, 824, 838, 851, 846, 825, 801, 786, 788, 811, 853, 898, 930, 936, 918, 884, 844, 811, 793, 790, 799, 814, 827, 829, 821, 817, 829]
-627H29K1Qj2j2J0K5J6rk3k0pMJ1J4J4Pkqj1j2j2pjNRJ2K0K0Rrk2k5k8k9j4J7M2L1kk9k8j1
-632G91KMjmQL2M7L0qk9j8LOmrn%%kpj1j4j5j7k6k5j1LO%MJ4J6J6K7M0L6Qj6k0j0LK1L5L0
-638I30Lj7j2kj6m4m6k0JKkNJ7J7Nnj4k4k8j8JJ2J1MKPJ2J2Nlpj0j2j0mOPOQJ3J6J1N%rk4
-643G91l2k0KJ5Jk1l0j7LJ8K6K8K3J4J0J4K2J8Lj0j0nqj2pMRkk4m2l8j4J8L1K1jj3j5j2oJ1
-648G43K7K6NoOL0M2L1J2rk7l7l2j3OJ5J2NKOJ2Nj2k1jK7L0jl2l0qKqj3nLok3k8j5KRKrj6
-654G08j4n%LJ2K5L0J9KlQK0K4K3K7K9J5j1k6k2qkj0k5l1k1JK0K6K1J6J2J0RJ0J0Nqk1k3j1
-659H44RK2K1Oj5k2j8j0j2j4j3j0j3j6j3MJ7K0J7J9K0J7RLLJmj1j7j4lJ2K1J5Jj2j9j9j5q
-664H03lkmlNJ3J6J7J4PjjMLj2l3m4m3l2j6QL1L9K8J1kj2k5k5pK5M7M2J6j0j7mJ0Oqj4mJ0
$$ y = [829, 850, 858, 846, 834, 844, 869, 885, 876, 853, 833, 826, 830, 841, 855, 869, 876, 874, 866, 855, 843, 831, 824, 823, 828, 837, 849, 869, 889, 898, 889, 867, 842, 814, 785, 771, 788, 830, 861, 859, 830, 802, 791, 793, 797, 796, 792, 800, 832, 879, 909, 901, 872, 854, 857, 863, 859, 850, 845, 845, 845, 843, 836, 825, 811, 796, 779, 753, 728, 717, 720, 726, 726, 730, 744, 760, 776, 803, 843, 879, 887, 871, 851, 841, 844, 865, 900, 930, 933, 916, 904, 902, 886, 842, 796, 776, 777, 779, 777, 782, 799, 816, 821, 816, 802, 778, 750, 732, 733, 745, 756, 760, 762, 769, 781, 793, 798, 795, 788, 778, 766, 756, 752, 758, 765, 771, 779, 792, 808, 819, 824, 824, 815, 791, 759, 739, 741, 756, 757, 736, 706, 689, 692, 710, 736, 764, 787, 801, 811, 825, 847, 865, 868, 858, 848, 843, 835, 823, 816, 820, 829, 827, 803, 761, 723, 709, 727, 758, 779, 778, 765, 750, 738, 732, 743, 770, 796, 801, 795, 801, 831, 873, 904, 916, 907, 880, 843, 811, 798, 804, 819, 831, 836, 838, 844, 856, 861, 849, 828, 827, 854, 884, 883, 851, 821, 813, 815, 807, 794, 789, 792, 786, 763, 735, 720, 722, 731, 733, 724, 708, 694, 689, 689, 692, 704, 729, 759, 778, 780, 777, 785, 805, 829, 852, 879, 908, 923, 912, 886, 864, 856, 854, 844, 819, 788, 767, 768, 788, 814, 835, 851, 863, 873, 882, 892, 902, 907, 899, 878, 855, 844, 853, 875, 896, 902, 887, 865, 847, 837, 825, 811, 798, 788, 775, 759, 746, 750, 767, 787, 804, 823, 843, 860, 869, 872, 875, 876, 872, 861, 844, 830, 827, 839, 860, 875, 876, 864, 845, 826, 811, 803, 800, 798, 794, 791, 796, 809, 825, 842, 856, 863, 862, 861, 865, 868, 856, 823, 779, 736, 704, 688, 696, 727, 766, 794, 805, 803, 791, 766, 741, 734, 759, 806, 848, 864, 854, 837, 833, 843, 849, 841, 827, 823, 833]
$$ [...]
-1604G70
##END=	
##END=	
