##TITLE=	mf91scoPSga44Gvctwuz7g.21.ser
TM-VI-158 cosy

##JCAMP-DX=	6.0	$$ MestReNova 14.3.1-31739
##DATA TYPE=	LINK
##BLOCK_ID=	1
##BLOCKS=	2    
##ORIGIN=	Mestrelab Research S.L.
##OWNER=	hrzepa
##$MNOVA/LINK_BLOCK_TYPE=	ITEM	$$ NMR Spectrum
##$MNOVA/ITEM/POLYGON=	(XY..XY)
5321,5835
8722,5835
8722,8208
5321,8208
5321,5835
##$MNOVA/ITEM/Z=	0
##$MNOVA/ITEM/ANGLE=	0
##TITLE=	mf91scoPSga44Gvctwuz7g.21.ser
##JCAMP-DX=	6.0	$$ MestReNova 14.3.1-31739
##BLOCK_ID=	2
##DATA TYPE=	MNOVA NMR VIEW DATA
##DATA CLASS=	MNOVA VIEW DATA
##$MNOVA/2D/THRESHOLD=	73.248443603515625
##$MNOVA/ITEM/ZOOM/X=	-0.98001264966690615488,	11.003459999979801509
##$MNOVA/ITEM/ZOOM/Y=	-0.98001264966690615488,	11.003459999979801509
##END=	
##TITLE=	mf91scoPSga44Gvctwuz7g.21.ser
##JCAMP-DX=	6.0	$$ MestReNova 14.3.1-31739
##BLOCK_ID=	3
##DATA TYPE=	nD NMR SPECTRUM
##DATA CLASS=	NTUPLES
##NUMDIM=	2
##ORIGIN=	Bruker BioSpin GmbH
##OWNER=	nmr
##.OBSERVE FREQUENCY=	400.41200205000001233
##.OBSERVE NUCLEUS=	^1H
##.SOLVENT NAME=	CD2Cl2
##.PULSE SEQUENCE=	cosygpqf
##LONGDATE=	2021/11/11 10:38:06.000
##.ACQUISITIONMODE=	SIMULTANEOUS (DQD)
##$ORIGINAL FORMAT=	Bruker XWIN-NMR
##$MNOVA/SCALES_VERSION=	9
##$PARAMETER FILE=	(acqu2s, ASCII, /private/var/folders/f6/rjf_tdyn2v98c5c0wvkgn4s80000gn/T/mf91scoPSga44Gvctwuz7g/21/acqu2s, 0)
$$ ##TITLE= Parameter file, TOPSPIN		Version 3.2
$$ ##JCAMPDX= 5.0
$$ ##DATATYPE= Parameter Values
$$ ##NPOINTS= 121	$$ modification sequence number
$$ ##ORIGIN= Bruker BioSpin GmbH
$$ ##OWNER= nmr
$$ $$ 2021-11-11 10:47:01.689 +0000  nmr@CZC10666PP
$$ $$ /opt/topspin/data/agmb/nmr/Nov11-2021/21/acqu2s
$$ $$ process /opt/topspin3.2/prog/mod/go
$$ ##$ACQT0= 0
$$ ##$BF1= 400.41
$$ ##$FnMODE= 1
$$ ##$NUC1= <1H>
$$ ##$NusJSP= 0
$$ ##$NusT2= 1
$$ ##$NusTD= 120
$$ ##$O1= 2002.04999998732
$$ ##$SFO1= 400.41200205
$$ ##$SW= 12.0068636381483
$$ ##$SW_h= 4807.69230769231
$$ ##$TD= 120
$$ ##END=
$$ 
##$PARAMETER FILE=	(acqus, ASCII, /private/var/folders/f6/rjf_tdyn2v98c5c0wvkgn4s80000gn/T/mf91scoPSga44Gvctwuz7g/21/acqus, 0)
$$ ##TITLE= Parameter file, TOPSPIN		Version 3.2
$$ ##JCAMPDX= 5.0
$$ ##DATATYPE= Parameter Values
$$ ##NPOINTS= 12	$$ modification sequence number
$$ ##ORIGIN= Bruker BioSpin GmbH
$$ ##OWNER= nmr
$$ $$ 2021-11-11 10:47:05.247 +0000  nmr@CZC10666PP
$$ $$ /opt/topspin/data/agmb/nmr/Nov11-2021/21/acqus
$$ $$ process /opt/topspin3.2/prog/mod/shimcntl
$$ ##$ACQT0= 1000000
$$ ##$AMP= (0..31)
$$ 100 100 100 100 100 100 100 100 100 100 100 100 100 100 100 100 100 100
$$ 100 100 100 100 100 100 100 100 100 100 100 100 100 100
$$ ##$AMPCOIL= (0..19)
$$ 0 0 0 0 0 0 0 0 0 0 0 0 0 0 0 0 0 0 0 0
$$ ##$ANAVPT= -1
$$ ##$AQSEQ= 0
$$ ##$AQ_mod= 3
$$ ##$AUNM= <au_zg>
$$ ##$AUTOPOS= <52 >
$$ ##$BF1= 400.41
$$ ##$BF2= 400.41
$$ ##$BF3= 400.41
$$ ##$BF4= 400.41
$$ ##$BF5= 400.41
$$ ##$BF6= 400.41
$$ ##$BF7= 400.41
$$ ##$BF8= 400.41
$$ ##$BYTORDA= 0
$$ ##$CAGPARS= (0..11)
$$ 0 0 0 0 0 0 0 0 0 0 0 0
$$ ##$CFDGTYP= 0
$$ ##$CFRGTYP= 9
$$ ##$CHEMSTR= <none>
$$ ##$CNST= (0..63)
$$ [...]
$$ 0 0 0 0 0 0 0 0 0 0 0 0 0 0 0 0 0 0 0 0 0 0 0 0 0 0 0 0 0 0 0 0 0 0 0 0
$$ 0 0 0 0
$$ ##$ShimPowMaxUC= (0..63)
$$ 130000 130000 130000 130000 130000 130000 130000 130000 130000 130000 130000
$$ 130000 130000 130000 130000 130000 130000 130000 130000 130000 0 0 0 0
$$ 0 0 0 0 0 0 0 0 0 0 0 0 0 0 0 0 0 0 0 0 0 0 0 0 0 0 0 0 0 0 0 0 0 0 0 0
$$ 0 0 0 0
$$ ##$ShimPowMaxUG= (0..63)
$$ 524287 524287 524287 524287 524287 524287 524287 524287 524287 524287 524287
$$ 524287 524287 524287 524287 524287 524287 524287 524287 524287 0 0 0 0
$$ 0 0 0 0 0 0 0 0 0 0 0 0 0 0 0 0 0 0 0 0 0 0 0 0 0 0 0 0 0 0 0 0 0 0 0 0
$$ 0 0 0 0
$$ ##$ShimPowRcbType= 3
$$ ##$ShimPowRes= (0..63)
$$ 1e-20 1e-20 1e-20 1e-20 1e-20 1e-20 1e-20 1e-20 1e-20 1e-20 1e-20 1e-20
$$ 1e-20 1e-20 1e-20 1e-20 1e-20 1e-20 1e-20 1e-20 0 0 0 0 0 0 0 0 0 0 0 0
$$ 0 0 0 0 0 0 0 0 0 0 0 0 0 0 0 0 0 0 0 0 0 0 0 0 0 0 0 0 0 0 0 0
$$ ##$ShimPowRng0= (0..63)
$$ 1 1 1 1 1 1 1 1 1 1 1 1 1 1 1 1 1 1 1 1 0 0 0 0 0 0 0 0 0 0 0 0 0 0 0 0
$$ 0 0 0 0 0 0 0 0 0 0 0 0 0 0 0 0 0 0 0 0 0 0 0 0 0 0 0 0
$$ ##$ShimPowRng1= (0..63)
$$ 1 1 1 1 1 1 1 1 1 1 1 1 1 1 1 1 1 1 1 1 0 0 0 0 0 0 0 0 0 0 0 0 0 0 0 0
$$ 0 0 0 0 0 0 0 0 0 0 0 0 0 0 0 0 0 0 0 0 0 0 0 0 0 0 0 0
$$ ##$ShimPowRng2= (0..63)
$$ 1 1 1 1 1 1 1 1 1 1 1 1 1 1 1 1 1 1 1 1 0 0 0 0 0 0 0 0 0 0 0 0 0 0 0 0
$$ 0 0 0 0 0 0 0 0 0 0 0 0 0 0 0 0 0 0 0 0 0 0 0 0 0 0 0 0
$$ ##$ShimPowRng3= (0..63)
$$ 1 1 1 1 1 1 1 1 1 1 1 1 1 1 1 1 1 1 1 1 0 0 0 0 0 0 0 0 0 0 0 0 0 0 0 0
$$ 0 0 0 0 0 0 0 0 0 0 0 0 0 0 0 0 0 0 0 0 0 0 0 0 0 0 0 0
$$ ##$ShimSysFunc= (0..63)
$$ 1 2 3 4 5 7 9 11 15 16 8 10 12 14 6 17 13 18 19 20 0 0 0 0 0 0 0 0 0 0
$$ 0 0 0 0 0 0 0 0 0 0 0 0 0 0 0 0 0 0 0 0 0 0 0 0 0 0 0 0 0 0 0 0 0 0
$$ ##$ShimSysMatrix= 0
$$ ##$ShimSysType= 1
$$ ##$TFXNUM= 0
$$ ##$TRIPLO2= 0
$$ ##$VTU= 2
$$ ##$VTUETH= <149.236.99.20>
$$ ##$VTUTY= <no>
$$ ##$WBREFAM= (0..15)
$$ 135 116 100 100 100 100 100 100 100 100 100 100 100 100 100 100
$$ ##$WBREFLM= (0..15)
$$ 0 0 0 0 0 0 0 0 0 0 0 0 0 0 0 0
$$ ##$WBREFPH= (0..15)
$$ 71.66 -68.25 0 0 0 0 0 0 0 0 0 0 0 0 0 0
$$ ##$WBSGU= (0..15)
$$ 0 0 0 0 0 0 0 0 0 0 0 0 0 0 0 0
$$ ##$XFAC= 2
$$ ##END=
$$ 
##$DECIM=	4160
##$DSPFVS=	20
##.ACQUISITIONSCHEME=	NOT PHASESENSITIVE
##NTUPLES=	nD NMR SPECTRUM
##VAR_NAME=	FREQUENCY1,	FREQUENCY2,	SPECTRUM
##SYMBOL=	F1,	F2,	Y
##.NUCLEUS=	1H,	1H
##.OBSERVE FREQUENCY=	400.41200205000001233,	400.41200205000001233
##VAR_TYPE=	INDEPENDENT,	INDEPENDENT,	DEPENDENT
##VAR_FORM=	AFFN,	AFFN,	ASDF
##VAR_DIM=	512,	512,	262144
##UNITS=	HZ,	HZ,	ARBITRARY UNITS
##FIRST=	4405.895418600002813,	4405.895418600002813,	0.53717261552810668945
##LAST=	-392.40686505384644533,	-392.40686505384644533,	0.45455482602119445801
##MIN=	-392.40686505384644533,	-392.40686505384644533,	0.0010479766642674803734
##MAX=	4405.895418600002813,	4405.895418600002813,	9186.6484375
##FACTOR=	1,	1,	0.0048479441022296195993
##PAGE=	F1=4405.9
##FIRST=	4405.895418600002813,	4405.895418600002813,	0.53717261552810668945
##DATA TABLE=	(F2++(Y..Y)), PROFILE
$$ [...]
##PAGE=	F1=-2636.62
##FIRST=	4405.895418600002813,	4405.895418600002813,	0
##DATA TABLE=	(F2++(Y..Y)), PROFILE
-392G2
##PAGE=	F1=-2655.4
##FIRST=	4405.895418600002813,	4405.895418600002813,	0
##DATA TABLE=	(F2++(Y..Y)), PROFILE
$$ plain form
4406 54 61 118 59 124 35 87 62 77 134 44 188 79 190 235 80 59 124 72 50 89 121 55 61 36 19 134 105 110 107 19 53 88 54 31 114
4077 114 40 108 142 17 169 147 95 210 56 53 63 29 104 122 148 24 137 91 10 33 64 138 104 109 104 50 79 39 21 79 113 59 38
3767 38 94 170 34 64 70 165 23 18 131 134 43 49 70 65 181 182 60 82 127 109 129 108 111 94 125 115 89 72 120 241 185 57 40 52 111
3439 111 85 55 64 75 55 140 149 82 126 91 80 124 92 117 190 265 194 64 174 184 88 173 109 94 140 47 112 83 144 66 332 438 203
3129 203 154 171 53 32 31 86 23 144 168 140 86 167 49 249 250 498 193 94 219 144 172 83 146 66 101 36 221 232 173 129 26
2838 26 58 27 51 107 197 110 104 176 181 89 84 111 188 106 82 183 234 200 83 215 140 141 204 149 46 49 66 70 132 139 161 39 13 106 275 123
2500 123 141 73 47 165 169 89 83 108 53 69 12 36 99 30 27 49 100 233 160 213 142 92 80 100 41 130 171 88 148 20 33 115 116 54 40
2171 40 104 353 773 433 157 88 156 105 49 121 145 144 63 102 81 32 121 44 154 121 80 187 65 116 68 131 172 161 228 78 81 60
$$ packed form
4406E4PN7n9O5q9N2k5J5N7r0J44j09J11M5j55k1O5n2k2L9L2o6Ok5j7J15k9Nlq8L4L5l4k3Q3
4077A14p4O8L4j25J52k2n2J15j54lJ0l4P5J8K6j24J13m6q1K3L1P4l4Nnn4K9m0j8N8L4n4k1
3767C8N6P6j36L0OR5j42nJ13Lr1OK1nJ16Jj22K2M5j8K0k1Lj7L1j0k6j7M8J21n6j28j7J2N9
3439A11k6l0RJ1k0Q5Ro7M4l5j1M4l2K5P3P5p1j30J10J0r6Q5o4j5M6r3O5k9O1p8K66J06k35
3129B03m9J7j18k1jN5o3J21K4k8n4Q1j18K00JK48l05r9J25p5K8q9O3q0L5o5J85J1n9m4j03
2838B6L2l1K4N6R0q7oP2Nr2nK7P7q2k4J01N1l4j17J32p5JO3n5j03LJ7MO2PK2j22k6R3J69j52
2500A23J8o8k6J18Mq0oK5n5J6n7K4O3o9lK2N1J33p3N3p1n0j2K0n9Q9M1q3O0j28J3Q2Jo2j4
2171D0O4K49M20l40k76o9O8n1n6P2K4jq1L9k1m9Q9p7J10l3m1J07j22N1m8O3M1j1O7j50Lk1
$$ plain form
1871 60 139 218 181 147 12 126 156 275 409 375 193 193 200 97 171 55 86 72 100 74 42 52 70 79 185 110 34 60 129 206 136 49 81
1561 81 44 87 153 73 129 164 258 159 114 33 98 81 151 227 116 87 65 27 99 107 72 63 242 171 162 147 55 96 55 64 154 99 89 154 136 69
1223 69 52 95 85 161 172 36 105 153 60 49 40 133 59 48 178 41 184 40 122 127 72 200 50 69 316 130 131 293 142 201 236
932 236 1019 3279 853 2437 7056 11426 13778 5711 2885 1955 1019 469 274 269 355 714 168 705 466 915 770 1746
725 1746 6232 21761 11098 2678 627 717 737 214 525 271 398 393 308 328 845 484 622 112 36 93 233 515 189 44
500 44 165 89 89 38 147 146 110 64 36 77 170 155 96 95 82 45 115 94 151 64 90 101 105 196 97 57 94 168 138 124 114 29 171 118 136 199
162 199 53 133 25 35 125 84 118 44 40 93 46 96 117 152 126 64 161 45 121 136 134 136 100 129 57 82 131 220 177 88 89 86 27 147 68 74
-176 74 88 19 44 31 50 83 55 37 25 99 222 149 96 86 78 58 84 101 61 151 74 83 73
$$ packed form
1871F0P9P9l7l4j35J14L0J19J34l4j82%Pj03P4j16L1j4K8k6l2J0J8RJ06p5p6K6O9P7p0q7L2
1561H1l7M3O6q0N6L5R4r9m5q1O5j7P0P6j11k9k2l8P2Ql5rJ79p1rj5r2M1m1RR0n5j0O5j8o7
1223F9j7M3j0P6J1j36O9M8r3j1rR3p4j1J30j37J43j44Q2Nn5J28j50J9K47j86JJ62j51N9L5
932B36P83K260k426J584M619M370K352q067k826r30r36n50j95nQ6L59n46N37k39M49j45R76
725A746M486J5529j0663q420k051R0K0n23L11k54J27nq5K0N17l61J38n10p6N7J40K82l26j45
500D4J21p6%n1J09jl6m6k8M1R3j5n9jj3l7P0k1N7q7K6J1MR1r9m0L7P4l0j4j0q5J42n3J8O3
162A99j46Q0j08J0R0m1L4p4mN3m7N0K1L5k6o2R7j16P6J5kKl6K9p2K5M9Q9m3q9Jln9J20p9O
-176G4J4o9K5j3J9L3k8j8j2P4J23p3n3j0qk0K6J7m0R0p7Rj0
-392G3
##PAGE=	F1=-2674.18
##FIRST=	4405.895418600002813,	4405.895418600002813,	0
##DATA TABLE=	(F2++(Y..Y)), PROFILE
$$ plain form
4406 46 48 116 47 110 53 33 52 80 136 47 177 84 181 245 82 46 134 62 85 72 111 68 60 15 60 122 120 62 82 41 38 55 81 32 115 25
4068 25 105 146 57 157 163 91 184 41 59 67 24 121 149 137 50 134 91 36 34 84 173 156 75 104 53 75 73 53 87 122 47 37 99 160 55 56
3730 56 51 141 41 22 116 139 60 39 80 44 185 204 64 99 133 88 101 90 141 107 124 118 44 116 169 265 218 50 40 27 79 62 59 109 92
3401 92 54 143 159 99 142 73 107 135 80 119 166 234 171 41 160 166 45 101 103 81 106 80 92 115 119 70 268 444 233 135 209 45 20
3091 20 31 82 17 153 185 121 88 178 43 314 266 522 189 39 226 129 166 97 151 89 85 35 203 215 172 164 61 41 25 89 148 210
2791 210 143 93 193 179 126 99 110 193 127 80 136 252 211 80 193 174 153 180 164 65 18 88 95 144 150 134 49 34 134 258 90 185
2490 185 81 45 188 174 120 115 146 68 45 22 47 84 38 33 35 95 211 155 210 142 89 53 104 50 118 204 47 126 52 6 137 100 56 80
2171 80 88 310 692 407 133 101 147 68 50 129 148 148 54 94 86 50 163 34 174 91 85 212 19 131 48 131 198 154 255 73 90
$$ packed form
4406D6KO8o9O3n7k0J9K8N6q9J30r3R7O4j63l6Q8p2K3j3L9m3qm5M5O2kn8K0m1lJ7K6m9Q3r0
4068B5Q0M1q9J00Op2R3j43J8Qm3R7K8j2q7Q4m3n5kN0Q9j7q1K9n1K2kk0L4L5p5j0O2O1j05J
3730E6nR0j00j9R4K3p9k1M1l6J41J9j40L5L4m5J3j1N1l4J7op4P2N3R6m7j68j0j3N2j7lN0j7
3401I2l8Q9J6o0M3o9L4K8n5L9M7O8o3j30J19Oj21N6Kk2K5k6J2K3Mm9J98J76k11r8P4j64k5
3091B0J1N1o5J36L2o4l3R0j35K71m8K56l33j50J87r7L7o9N4o2mn0J68J2m3qj03k0j6O4N9O2
2791B10o7n0J00j4n3k7J1Q3o6m7N6J16m1j31J13j9k1K7j6r9m7P0PM9Oj6q5j5J00J24j68R5
2490A85j04l6J43j4n4nL1p8k3k3K5L7m6nKO0J16n6N5o8n3l6N1n4O8Q6j57P9p4m6J31l7m4K4
2171H0QK22L82k85k74l2M6p9j8P9J9%r4M0ql6J13j29J40q3oJ27j93J12q3Q3O7m4J01j82J7
$$ plain form
1880 90 34 138 258 231 161 6 171 162 246 449 337 175 208 187 108 187 76 88 55 120 96 108 87 109 111 215 116 21 100 119 228
1589 228 118 71 125 81 49 99 98 143 162 270 135 125 31 99 59 196 333 173 84 13 15 85 75 93 33 232 162 160 174 47 158 5
1288 5 73 144 79 96 137 182 80 55 58 93 163 168 33 98 208 82 42 43 139 65 31 205 69 191 50 103 205 11 208 149 41
997 41 327 121 116 296 116 76 322 284 1732 951 2190 6232 11459 14010 5963 3473 2341 1323 803 547 301 482
791 482 841 322 358 570 1050 1142 1773 6887 30214 19361 2308 605 443 837 399 538 341 473 328 260 625 1193
584 1193 809 900 172 33 16 195 448 171 145 118 82 113 8 122 139 140 130 71 58 149 157 81 109 106 46 164 147 135 74 72 132 61
284 61 147 136 120 70 185 163 98 65 31 138 92 146 255 71 154 19 27 118 125 77 41 29 134 57 69 99 156 136 82 174 26 75 130
-26 130 122 154 99 138 40 143 163 219 183 84 100 98 37 96 52 77 99 53 56 30 69 52 61 67 11 88 187 100 88 89 74 63 93 88 108 149 97 65
$$ packed form
1880I0n6J04J20k7p0j55J65rQ4K03j12j62L3k1p9P9j11J2l3O5k4J2k1K2KJ04r9r5P9J9J09
1589B28j10m7N4m4l2N0jM5J9J08j35j0r4O8m0J37J37j60q9p1KP0j0J8o0J99p0kJ4j27J11j53
1288EO8P1o5J7M1M5j02k5LL5P0Nj35O5J10j26m0JR6p4l4J74j36J22j41N3J02j94J97n9j08
997D1K86k06nJ80j80m0K46l8J448p81J239M042N227K551q047k490j132j018n20k56k46J81
791D82L59n19L6K12M80R2O31N114K3327j0853j7053j703j62L94m38J39j97J32j45o8L65N68
584A193l84R1p28j39j7J79K53k77k6k7l6L1j05J14J7Jj0n9j3R1Qp6K8lo0J18j7j2o1kO0p1
284F1Q6j1j6n0J15k2o5l3l4J07m6N4J09j84Q3j35QR1Pm8l6j2J05p7J2L0N7k0n4R2j48M9N5
-26A30qL2n5L9r8J03K0N6l6r9J6ko1N9m4K5K2m6Lk6L9j7ROn6P7R9q7j2Jj5j1L0nK0M1n2l2
-383F5K
-392F7
##PAGE=	F1=-2692.96
##FIRST=	4405.895418600002813,	4405.895418600002813,	0
##DATA TABLE=	(F2++(Y..Y)), PROFILE
$$ plain form
4406 52 33 121 51 71 70 10 34 88 125 42 163 92 173 218 85 31 144 53 103 62 108 62 50 59 94 106 125 47 48 53 24 30 106 31 110 38
4068 38 91 152 89 124 158 85 151 30 36 73 29 138 177 127 68 113 90 86 57 100 191 179 47 88 64 63 108 86 90 113 53 36 90 136 74 52
3730 52 42 112 43 27 76 123 61 20 104 28 176 211 75 108 137 79 73 63 150 126 124 126 80 159 193 283 232 44 70 23 43 31 75 137 102
3401 102 46 122 157 112 136 72 122 137 76 115 138 191 127 30 149 154 5 34 98 65 62 89 51 150 96 72 295 463 252 129 216 76
3101 76 34 36 69 42 162 190 102 109 199 70 353 249 519 181 48 210 93 169 105 157 118 68 44 171 180 161 189 96 21 24 118 169
2800 169 205 153 90 213 171 140 105 113 191 144 72 86 240 213 74 165 181 149 153 169 86 10 109 141 158 163 87 55 59 161 231 63 205 83
2481 83 46 199 157 141 150 166 71 44 45 50 66 56 40 25 67 183 126 193 124 74 41 87 62 105 210 30 116 76 1 143 96 70 110 99
2162 99 266 585 352 105 114 137 19 85 128 155 152 54 69 92 112 192 29 164 51 92 205 30 137 55 137 212 139 258 64 94
$$ packed form
4406E2j9Q8p0K0jo0K4N4L7q3J21p1Q1M5j33n4J13r1N0m1M6m6j2RL5J2J9p8JNk9OP6p5P9p2
4068C8N3O1o3L5L4p3O6j21OL7m4J09L9n0n9M5k3mk9M3R1j2j32M1k4jM5k2MK3o0j7N4M6o2k2
3730E2j0P0o9j6M9M7o2m1Q4p6J48L5j36L3K9n8oj0Q7k4kKm6P9L4R0n1j88K6m7K0j2M4O2l5
3401A02n6P6L5m5K4o4N0J5o1L9K3N3o4r7J19Nj49K9O4l3lK7l8R9n4k4K23J68k11j23Q7j40
3101G6m2KL3k7J20K8q8PR0j29K83j04K70l38j33J62j17P6o4N2l9n0k4J27Rj9K8r3p5LR4N1
2800A69L6n2o3J23m2l1l5QP8m7p2J4J54k7j39R1J6l2MJ6q3p6R9L2J7Np6l2MJ02P0j68J42j22
2481H3l7J53m2j6RJ6r5k7JNJ6j0j6j5M2J16n7O7o9n0l3M6k5M3J05j80Q6m0p5J42m7k6M0j1
2162I9J67L19k33k47RK3j18O6M3K7lr8J5K3K0Q0j63J35j13M1J13j75J07q2Q2P5p3J19j94L0
$$ plain form
1880 94 26 135 275 270 157 31 200 151 216 493 276 117 198 168 117 189 94 84 36 127 108 140 98 133 142 237 108 4 116 106 227
1589 227 90 91 153 117 61 42 124 153 148 253 114 116 41 111 33 224 431 245 62 42 54 81 34 123 29 198 148 152 179 20 190 48
1288 48 75 105 79 107 101 205 102 45 91 106 150 135 27 111 248 80 59 26 125 63 43 203 105 148 56 59 222 42 168 204 41
997 41 262 118 108 244 136 76 401 234 564 902 1761 4966 10336 12905 5658 3765 2523 1632 1378 976 306 288 600
781 600 547 228 504 789 972 1117 5447 25634 18597 1873 736 333 744 350 360 300 401 287 145 592 1228 867
575 867 985 163 29 89 148 272 167 195 50 52 108 29 106 94 125 166 69 88 121 132 60 98 102 80 185 186 137 68 43 123 59 114 164
265 164 163 22 167 172 97 41 25 85 64 150 276 98 167 11 40 88 147 57 53 9 141 50 57 67 155 129 102 160 37 52 91 101 165 105
-54 105 132 63 187 195 196 176 93 136 78 64 48 13 67 113 75 61 10 94 105 93 101 45 77 138 85 56 107 66 73 101 88 127 138 90 53 44
$$ packed form
1880I4o8J09J40nj13j26J69m9O5K77k17j59Q1l0n1P2r5j0m8R1j9L2m2L5RR5j29j04J12j0J21
1589B27j37JO2l6n6j9Q2K9nJ05j39Kp5P0p8J91K07j86j83k0J2K7m7Q9r4J69n0MK7j59J70j42
1288D8K7L0k6K8oJ04j03n7M6J5M4j5j08Q4J37j68k1l3R9o2k0J60r8M3r2LJ63j80J26L6j63
997D1K21j44j0J36j08o0L25j67L30L38Q59L205N370K569p247j893j242q91k54m02o70j8L12
781F00n3l19K76K85J83J45M330K0187p037j6724j137m03M11l94J0o0J01j14j42M47O36l61
575H67J18q22j34O0N9J24j05K8j45KN6p9P7j2L1M1r7J9L3J1p2L8Mk2J05Jm9o9k5Q0o4N5N0
265A64jj41J45Np5n6j6O0k1Q6J26j78O9j56K9M8N9r0mm4J32r1PJ0Q8k6k7N8j23J5L9J0O4o0
-54A05K7o9J24QJk0q3M3n8j4j6l5N4M6l8j4n1Q4J1j2Qn6L2O1n3k9N1m1PK8j3L9J1m8l7r
-392D4
##PAGE=	F1=-2711.74
##FIRST=	4405.895418600002813,	4405.895418600002813,	0
##DATA TABLE=	(F2++(Y..Y)), PROFILE
$$ plain form
4406 75 21 121 74 23 67 26 43 104 106 28 142 118 169 152 88 25 158 42 94 57 122 42 46 95 113 87 128 75 63 42 31 18 123 20
4087 20 104 64 65 163 111 73 133 78 121 37 26 74 62 147 201 124 77 70 85 143 88 110 194 173 59 69 83 44 138 108 90 80 69 31 74 102
3749 102 98 52 46 80 24 21 24 90 47 16 138 22 154 198 92 107 137 82 50 38 136 144 124 131 131 191 187 295 220 49 119 56 38 8 83 145
3411 145 114 37 82 142 117 109 92 123 124 80 107 119 150 71 35 133 147 33 16 94 46 13 71 18 177 86 59 373 493 260 143 192 105
3101 105 55 46 51 92 165 183 91 143 223 114 364 200 493 183 86 180 54 175 106 162 146 64 53 132 140 142 195 122 53 44 132 166 180 138
2781 138 87 232 158 130 98 118 188 150 66 46 203 200 55 134 160 127 130 155 96 30 129 185 169 178 33 63 76 185 200 48 196 86
2481 86 48 201 128 149 181 167 60 63 71 44 41 77 44 22 19 155 78 162 89 51 54 51 70 94 184 51 126 87 14 131 109 101 127 120 216 458
2143 458 289 87 131 124 36 116 117 168 156 68 34 87 170 203 41 126 7 101 172 50 132 94 151 211 111 231 64 95 50 131 272
$$ packed form
4406G5n4J00m7n1M4m1J7O1Kp8J14k4N1j7o4o3J33j16N2l7O5q0MM9J8k6M1n3j2k1j1j3J05j03
4087B0Q4m0JR8n2l8O0n5M3q4j1M8j2Q5N4p7m7pJ5N8n5K2Q4k1j14J0J4l9R4l0j8j0j1l8M3K8
3749A02mm6oL4n6lLO6m3l1J22j16J32M4j06J5L0n5l2j2R8Qk0P%O0mJ08p5j71P0o3j8l0P5O2
3411A45l1p7M5O0k5qj7L1Jm4K7J2L1p9l6R8J4j14j7P8m8l3N8n3J59r1k7L14J20k33j17M9q7
3101A05n0rNM1P3J8r2N2Q0j09K50j64K93l10r7R4j26J21o9N6j6q2j1P9QKN3p3o9rQ8L4J4m2
2781A38n1J45p4k8l2K0P0l8q4k0J57lj45P9K6l3LK5n9o6R9N6j6Rj45L0J3J09J5j52J48j10
2481H6l8J53p3K1L2j4j07LQk7lL6l3k2lJ36p7Q4p3l8LlJ9K4R0j33P5l9p3J17k2qK6pR6K42
2143D58j69k02M4pq8Q0JN1j2q8l4N3Q3L3j62Q5j19R4P1j22Q2l8N7O0j00J20j67L1m5Q1J41
$$ plain form
1852 272 292 141 74 199 115 268 543 405 149 196 140 123 177 122 84 38 112 110 135 85 141 164 251 87 29 102 84 209 51 109 152
1561 152 143 76 89 144 159 124 215 107 89 57 113 35 246 518 322 43 85 87 80 22 155 31 139 131 145 161 27 188 96 66 41 78
1260 78 116 84 195 141 22 158 143 122 88 66 130 263 63 85 16 79 90 67 166 137 63 39 62 176 79 88 200 77 149 114 102 148
960 148 166 124 369 392 248 672 1243 3529 8289 10692 4879 3710 2447 1899 2130 1403 239 468 274 593 576 146 223
744 223 297 355 1890 5845 6190 1707 800 556 363 207 136 273 172 393 27 208 874 566 759 131 87 145 49 111 113 176
500 176 81 18 101 93 77 29 74 164 67 136 85 88 87 57 61 125 170 208 165 38 14 70 102 134 178 176 43 108 158 121 26 15 28 40 150 256
162 256 130 156 67 66 33 152 75 84 30 111 49 63 27 150 106 115 114 75 61 31 72 166 121 113 109 209 222 152 160 109 187 47 99 26 42 46 120
-186 120 80 44 38 94 180 133 133 72 61 80 93 5 139 65 87 109 99 109 136 44 59 37
$$ packed form
1852B72K0j51o7J25q4J53K75j38k56M7n6j7N4n5l8m6P4kK5n0N6K3Q7j64n8P3j8J25j58N8M3
1561A52ro7J3N5J5l5R1j08j8l2N6p8K11K72j96k79M2Kpn8J33j24J08qJ4J6j34J61r2l0k5L7
1260G8L8l2J11n4j19J36j5k1l4k2O4J33k00K2o9O3J1k3R9k9p4k4K3J14r7RJ12j23P2l5j2M6
960A48J8m2K45K3j44M24N71K286M760K403n813j169j263n48K31p27j164K29j94L19j7m30P7
744B23P4N8J535L955L45m483r07k44j93j56p1J37j01K21l66J81O66l08J93o28m4N8r6O2KO3
500A76r5o3Q3qj6m8M5R0r7O9n1Ljl0MO4M5L8m3j27k4N6L2L2M4kj33O5N0l7r5j1J3J2J10J06
162B56j26K6q9jl3J19p7Rn4Q1o2J4l6J23m4Rjl9j4l0M1R4m5qmJ00J3p0Qn1P8j40N2p3J6MP4
-186A20m0l6oN6Q6m7%o1j1J9J3q8J34p4K2K2j0J0K7r2J5k2
-392C7
##PAGE=	F1=-2730.52
##FIRST=	4405.895418600002813,	4405.895418600002813,	0
##DATA TABLE=	(F2++(Y..Y)), PROFILE
$$ plain form
4406 109 22 115 111 88 79 71 93 125 101 27 112 158 170 65 103 26 171 32 63 65 149 56 72 116 111 68 136 99 132 17 56 21 128 5
4087 5 96 101 35 178 122 30 95 74 104 53 94 68 100 146 214 132 80 23 76 196 116 115 186 145 96 72 105 25 158 116 94 29 84 24 71
3758 71 65 124 58 58 50 30 30 79 53 33 43 168 20 122 171 110 96 133 92 46 45 110 153 123 125 158 208 155 295 186 65 172 93 70 49
3429 49 78 138 132 40 37 116 113 78 128 112 100 82 99 113 132 42 46 108 141 72 43 92 26 31 40 52 188 87 34 438 524 263 168 147 120 72
3091 72 56 46 149 158 168 93 181 235 164 352 131 446 203 110 150 57 175 104 166 162 78 57 100 108 118 184 136 103 75 129 138 137 107 80 240
2763 240 144 103 79 122 190 143 70 22 154 168 23 109 124 93 112 123 97 39 146 215 171 188 56 79 86 201 174 42 166 101 54 195
2462 195 112 146 205 168 36 80 94 37 21 98 62 24 47 130 31 124 45 40 77 8 70 89 135 66 150 87 40 107 127 139 132 133 168 334 248
2134 248 93 150 108 86 137 99 182 159 99 28 70 211 195 68 77 34 103 132 55 117 136 170 196 76 184 82 104 68 125 256 292 125
$$ packed form
4406A09q7R3mk3rqK2L2k4p4Q5M6J2j05L8p7J45j39L1KQ4r3J6M4nm3O8l7L3j15L9l5J07j23
4087ER1No6J43n6r2O5k1L0n1M1k6L2M6O8q2n2n7N3J20q0jP1m1m9k4L3q0J33m2k2o5N5o0M7
3758G1oN9o6%qk0%M9k6k0J0J25j48J02M9o1j4L7m1m6jO5M3l0KL3N0n3J40j09j21J07p9k3k1
3429D9K9O0or2lP9ll5N0j6j2j8J7J4J9r0MO2L3o9k9M9o6NRJ2J36j01n3M04Q6k61r5k1k7m8
3091G2j6j0J03RJ0p5Q8N4p1J88k21L15k43r3M0r3J18p1O2mq4k1M3QJ0O6m8l3k8N4Rjl0k7J60
2763B40r6m1k4M3O8m7p3m8J32J4j45Q6J5l1J9J1k6n8J07O9m4J7j32K3PJ15k7j32J24o5m7J41
2462A95q3L4N9l7j32M4J4n7j6P7l6l8K3Q3r9R3p9nL7o9O2J9M6o9Q4o3m7O7K0J2pJL5J66q6
2134B48j55N7m2k2N1l8Q3k3o0p1M2J41j6j27Rm3O9K9p7O2J9L4K6j20J08j02K2l6N7J31L6j67
$$ plain form
1833 125 125 165 62 330 545 571 244 210 101 127 158 162 101 66 78 110 101 56 136 174 256 62 66 68 57 184 20 121 122 149 70 168 157
1523 157 160 95 172 111 61 82 101 60 272 597 397 85 109 114 81 78 183 25 70 123 143 133 84 158 132 65 52 75 137 121 164 184 28
1213 28 218 201 115 83 131 152 255 82 112 62 23 161 95 114 163 63 26 143 101 106 8 154 124 106 145 139 45 191 163 298 312 558
913 558 338 751 2180 5753 7826 3790 3334 2137 2076 2909 1785 200 1792 1517 314 679 428 1025 961 2160 2649
716 2649 23256 16405 2102 731 962 362 634 637 500 168 599 204 519 325 117 354 227 160 171 111 303 10 113
500 113 230 110 131 176 30 109 112 149 133 187 50 68 172 32 67 181 140 219 200 10 63 20 158 201 188 161 111 29 125 160 63
209 63 44 68 35 160 204 158 123 132 95 40 141 94 119 77 81 83 89 9 142 87 124 61 123 78 76 42 155 144 91 150 216 241 98 139 124 229
-129 229 83 138 73 100 22 120 75 36 94 73 247 175 160 85 42 37 127 70 182 95 105 115 118 63 162 28 104 92
$$ packed form
1833A25%M0j03K68K15K6l27l4j09K6L1Mo1l5J2L2rm5Q0L8Q2j94MKj1J27j64J01JK7p9R8j1
1523A57Lo5P7o1n0K1J9m1K12L25k00l12K4Nl3lJ05j58M5N3K0j0m9P4k6o7j3K3O2j6M3K0j56
1213B8J90j7q6l2M8K1J03j73L0n0l9J38o6J9M9j00l7J17m2Nr8J46l0j8L9or4J46k8J35J4K46
913E58k20M13J429L573K073m036m56j197o1Q33j124j585J592k75j203L65k51N97o4J199M89
716B649K0607o851j4303j371K31o00K72Lj37l32M31l95L15j94k08K37j27o7J1o0J92k93J03
500A13J17j20K1M5j46P9LL7j6N4j37J8J04j40L5J14m1P9j9j90N3m3J38M3j3k7n0q2R6L5r7
209F3j9K4l3J25M4m6l5Rl7n5J01m7K5m2MKOq0J33n5L7o3O2m5kl4J13j1n3N9O6K5j43M1j5J05
-129B29j46N5o5K7p8R8m5l9N8k1J74p2j5p5m3nR0n7J12q7J0J0Ln5R9j34P6j2
-392I2
##PAGE=	F1=-2749.3
##FIRST=	4405.895418600002813,	4405.895418600002813,	0
##DATA TABLE=	(F2++(Y..Y)), PROFILE
$$ plain form
4406 136 23 104 145 154 110 119 132 133 120 54 88 189 168 33 126 11 177 31 29 76 171 91 105 120 92 53 146 109 197 17 77 33 119
4096 119 30 82 135 25 184 125 56 56 79 107 62 159 61 123 132 212 141 89 49 71 231 130 116 171 109 129 86 120 20 163 107 106 25
3786 25 88 25 77 28 140 68 73 35 80 56 149 54 46 66 184 22 86 140 116 78 125 101 57 67 91 145 118 109 151 204 108 275 142 79
3467 79 214 126 98 83 65 127 139 53 48 89 97 81 167 91 84 72 96 112 145 79 56 79 130 114 49 89 6 68 48 77 174 82 21 452 544 275
3129 275 187 101 120 79 62 72 195 141 151 103 211 229 210 322 82 376 236 124 129 100 165 110 168 157 97 57 88 89 96 161 137 141 103
2819 103 113 93 80 73 74 229 130 78 53 120 197 127 75 10 111 117 22 93 95 55 97 84 92 38 157 229 165 179 111 96 93 203 157 50 132
2490 132 122 70 180 120 126 220 188 7 90 101 41 28 113 99 36 104 108 39 81 4 59 101 40 69 88 79 67 171 87 66 90 131 170 131 130
2162 130 148 256 246 110 166 97 117 149 78 185 165 137 54 41 224 177 97 62 71 93 105 47 96 165 185 169 47 132 97 124 67 112 239
$$ packed form
4406A36j13Q1M1Rm4RJ3Jj3o6L4J01k1j35R3j15J66j46kM7R5q0J4J5k8l9R3l7Q8j80O0m4Q6
4096A19q9N2N3j10J59n9o9%K3K8m5R7r8O2RQ0p1n2m0K2J60j01j4N5o2K0m3L4j00J43n6jq1
3786B5O3o3N2m9J12p2Nl8M5k4R3r5qK0J18j62O4N4k4l8M7k4m4J0K4N4k7rM2N3r6J67j33o3
3467G9J35q8k8j5j8O2J2q6nM1Qj6Q6p6pj2K4J6L3o6k3K3N1j6o5M0q3O2k0K9R7r2o1M31R2k69
3129B75q8q6J9m1j7J0J23n4J0m8J08J8j9J12k40K94j40j12Nk9O5n5N8j1o0m0L1JPO5k4Ml8
2819A03J0k0j3pJJ55r9n2k5O7P7p0n2o5J01Or5P1Km0M2j3Qn4J19P2o4J4o8j5lJ10m6j07Q2
2490A32j0n2J10o0OR4l2j81Q3J1o0j3Q5j4o3O8Mo9M2p7N5M2o1K9J9rj2J04q4k1K4M1L9l9j
2162A30J8J08j0j36N6o9K0L2p1J07k0k8q3j3J83m7q0l5RK2J2n8M9O9K0j6j22Q5l5K7n7M5J27
$$ plain form
1852 239 266 110 159 111 15 324 460 600 285 214 55 124 142 206 141 106 49 114 67 23 121 170 250 45 98 34 40 165 52 123 72
1561 72 124 50 221 168 147 70 139 110 50 102 85 70 299 664 448 141 111 129 83 119 199 24 39 130 144 112 132 122 145 72 128 87
1260 87 166 156 138 209 64 250 254 138 119 186 168 237 127 124 88 42 233 107 83 178 147 61 205 83 121 69 106 155 180 196 199 54
960 54 202 174 266 113 584 101 402 1100 3257 4866 2589 2718 1695 2119 3507 2089 339 3711 3181 404 415 909
753 909 1817 1737 3404 6097 46205 34306 2509 506 1292 890 1029 1044 704 395 746 316 1133 472 657 380 350 200
547 200 164 294 515 132 60 345 181 158 239 32 190 195 143 197 216 34 81 256 75 124 227 128 220 212 58 107 93 200 258 189
265 189 139 161 82 80 187 113 71 118 32 181 146 166 85 177 110 94 118 87 140 111 112 114 117 28 128 96 130 86 161 99 148 35 134 164 80
-64 80 164 218 240 53 112 130 245 141 162 122 143 6 117 75 84 137 48 285 210 180 83 44 49 169 123 219 135 121 116 138 25 193 91
$$ packed form
1852B39K7j56M9m8r6L09J36J40l15p1j59O9J8O4o5l5n7O5m7m4R8M9Q0k05N3o4OJ25j13P1n1
1561G2N2p4J71n3k1p7O9k9o0N2j7j5K29L65k16l07l0J8m6L6Q0j75J5R1J4l2K0j0K3p3N6m1
1260H7P9j0j8P1j45J86Mj16j9O7j8O9j10ll6m6J91j26k4R5l1q6J44j22L8n2L7M9K5J6Lj45
960E4J48k8R2j53M71m83L01O98K157J609k277J29j023M24J388j418j750L372n30k777J1M94
753I09R08q0J667K693M0108j1899l1797k003P86m02J39J5l40l09L51m30Q17o61J85k77l0j50
547B00l6J30K21l83p2K85j64k3Q1k07J58Nn2N4J9j82M7J75j81M9J03r9R2qj54M9j4J07N8o9
265A89n0K2p9kJ07p4m2M7q6J49l5K0q1R2o7j6K4l1N3k9JKLq9J00l2L4m4P5o2M9j13R9L0q4
-64H0Q4N4K2j87N9J8J15j04K1m0K1j37J11m2RN3q9K37p5l0r7l9NJ20m6R6q4j4nK2j13J68j02
$$ plain form
-374 91 148 141
$$ packed form
-374I1N7p
-392A41
##PAGE=	F1=-2768.08
##FIRST=	4405.895418600002813,	4405.895418600002813,	0
##DATA TABLE=	(F2++(Y..Y)), PROFILE
$$ plain form
4406 133 3 86 155 173 114 131 125 108 141 82 102 185 144 69 131 33 163 41 20 69 165 102 116 112 72 45 143 109 231 18 91 39 97
4096 97 57 56 146 35 163 124 88 39 92 115 68 190 70 117 112 193 141 112 72 82 235 120 117 149 84 140 82 119 16 155 86 117 64
3786 64 73 39 64 16 132 72 83 49 124 90 190 96 72 78 177 32 45 116 100 54 113 97 61 73 84 112 106 90 113 178 63 226 105 86
3467 86 234 151 113 97 47 115 121 59 101 83 71 102 195 59 94 49 104 107 165 107 56 60 117 154 48 84 16 91 78 78 135 54 53 403 546
3138 546 311 188 67 108 74 67 111 214 124 132 110 220 204 246 282 129 281 268 135 122 145 146 132 163 122 103 57 88 78 89 133 126 150
2828 150 117 88 40 26 51 75 195 115 75 27 110 197 108 63 10 84 65 58 84 94 44 77 48 75 46 158 228 150 143 145 104 107 187 149 77 115
2490 115 134 97 152 130 87 221 222 26 92 91 48 38 120 142 70 137 91 50 43 25 78 125 68 73 84 37 60 177 100 80 91 114 181 127 107
2162 107 167 252 256 122 168 109 116 160 63 167 180 165 65 11 202 161 118 93 107 66 85 35 77 172 183 127 36 95 90 143 41 87 228
$$ packed form
4406A33j30Q3O9J8n9J7oj7L3n9K0Q3m1p5O2r8J30j22k1M9R6o3J4mm0k7R8l4J22k13P3n2N8
4096I7m0jR0j11J28l9l6m9N3K3m7J22j20M7nQ1n2k9m0J0J53j15lL2o5N6n8L7j03J39o9L1n3
3786F4Rl4K5m8J16o0J1l4P5l4J00r4k4OR9j45J3P1j6m6N9j6l6J2J1K8oj6K3O5j15J63j21j9
3467H6J48q3l8j6n0O8Oo2M2j8j2L1R3j36L5m5N5LN8n8n1MN7L7j06L6o8P5j3%N7q1jL50J43
3138E46k35j23j21M1l4pM4J03r0Qk2J10j6M2L6j53J52j3j33j3K3Jj4L1m1j9m6L1j0J1M4pK4
2828A50l3k9m8j4K5K4J20q0m0m8Q3Q7q9m5n3P4j9pK6J0n0L3k9K7k9J12P0p8pKm1LQ0l8p2L8
2490A15J9l7N5k2m3J34Jj96O6jm3j0Q2K2p2O7m6m1pj8N3M7n7NJ1m7K3J17p7k0J1K3O7n4k0
2162A07O0Q5Mj34M6n9PM4r7J04J3j5j00n4J91m1m3k5J4m1J9n0M2R5J1n6r1N9nN3j02M6J41
$$ plain form
1852 228 215 81 151 57 18 237 294 444 240 185 31 111 144 237 195 156 47 122 80 29 98 157 227 57 110 22 59 149 82 112 33
1561 33 60 32 228 180 110 71 114 87 51 98 71 49 317 700 454 173 91 123 69 123 191 22 73 134 133 113 152 108 121 66 175 132
1260 132 177 140 123 198 82 234 276 146 124 209 174 225 151 106 67 36 267 86 78 162 174 86 204 97 90 66 82 137 202 208 218 50
960 50 163 127 235 71 432 214 226 382 1306 2342 1473 1962 1265 2008 3724 2251 558 6029 4921 1472 1375 976 1911
744 1911 1595 3089 6290 47237 36978 2274 188 1281 1063 995 1042 613 383 705 289 1402 718 1023 501 364
556 364 182 104 422 647 214 80 351 182 122 244 53 202 217 108 196 187 56 66 294 106 128 241 129 195 189 83 115 137
293 137 199 259 164 149 178 144 24 167 133 63 123 28 194 114 138 63 172 91 109 83 47 132 106 149 105 124 41 105 117 132 133 166 136 182
-26 182 60 110 167 78 131 211 204 48 79 124 224 165 152 138 162 47 117 83 130 145 29 275 231 194 69 59 60 182 131 228 156 126
$$ packed form
1852B28j3j34P0r4l9K19N7J50k04n5j54Q0L3R3m2l9j09P5m2n1O9N9P0j70N3q8L7R0o7L0p9
1561C3K7k8J96m8p0l9M3k7l6M7k7k2K68L83k46k81q2L2n4N4O8j69N1O1jk0L9m4J3n5J09m3
1260A32M5l7j7P5j16J52M2j30k2Q5l5N1p4m5l9l1K31j81qQ4J2q8J18j07pk4J6N5O5OJ0j68
960E0J13l6J08j64L61k18J2J56R24J036q69M89o97P43J716j473j693N471j108l449r7l99R35
744A911l16J494L201M0947j0259l4704k086J093k18o8M7m29k30L22m16J113o84L05n22j37
556C64j82p8L18K25m33j34K71j69o0J22j91J49J5j09Q8rj31J0K28j88K2J13j12O6oj06L2K2
293A37O2O0r5j5K9l4j20J43l4p0O0r5J66q0K4p5J09q1J8k6l6Q5k6M3m4J9q3O4J2J5JL3l0M6
-26A82j22N0N7q9N3Q0pj56L1M5J00n9j3j4K4j15P0l4M7J5j16K46m4l7j25j0JJ22n1R7p2l0
$$ plain form
-327 126 113 147 43 185 111 150 149
$$ packed form
-327A26j3L4j04J42p4L9j
-392A49
##PAGE=	F1=-2786.86
##FIRST=	4405.895418600002813,	4405.895418600002813,	0
##DATA TABLE=	(F2++(Y..Y)), PROFILE
$$ plain form
4406 87 43 57 125 123 63 93 62 37 150 95 147 138 101 49 94 110 126 48 12 53 120 82 91 106 86 48 113 118 222 45 114 35 66 74 20 118
4068 118 53 103 126 98 46 99 115 97 170 100 75 97 160 123 151 53 116 203 84 121 129 82 120 67 92 4 152 66 121 71 54 64 18 55
3749 55 93 63 85 84 144 139 185 144 91 75 149 54 32 96 56 28 99 78 52 61 72 51 86 81 65 128 37 151 90 100 224 165 113 88 24 99
3411 99 70 52 153 113 53 106 204 13 116 62 122 100 176 104 38 70 118 182 64 74 42 100 82 61 89 2 89 300 527 377 170
3119 170 55 86 59 77 151 195 126 106 106 202 168 267 245 211 169 287 150 133 182 124 172 148 56 89 66 82 72 114 101 105 122 123 60 16 69
2791 69 38 82 148 97 90 9 92 177 92 28 27 62 85 81 71 113 76 48 26 35 80 143 217 131 77 147 107 129 151 153 118 113 129 137 107 120 39 203
2434 203 250 63 85 90 45 54 116 179 126 133 91 27 52 31 82 150 71 90 68 37 66 163 124 78 89 79 173 124 80 199 281 241 117 149 156
2105 156 81 175 61 127 210 171 64 41 147 166 121 120 142 39 48 32 85 159 158 69 36 86 71 147 9 49 218 153 21 89 24 1 123
$$ packed form
4406H7m4J4O8ko0L0l1k5J13n5N2rl7n2M5J6J6p8l6M1O7l8RJ5k0l8O5NJ04j77O9p9L1Qn4R8
4068A18o5N0K3k8n2N3J6j8P3p0k5K2O3l7K8r8O3Q7j19L7Qm7L8n3K5q8J48q6N5n0j7J0m6L7
3749E5L8l0K2jO0nM6m1n3j6P4r5k2O4m0k8P1k1k6RJ1k1L5nj6O3r1J14o1J0J24n9n2k5o4P5
3411I9k9j8J01m0o0N3R8j91J03n4O0k2P6p2o6L2M8O4j18J0l2N8j8k1K8q7Q7K11K27j50k07
3119A70j15L1k7J8P4M4o9k0%R6l4R9k2l4m2J18j37j7M9n8M8k4r2L3k3J6j0M2j3MJ7Jo3m4N3
2791F9l1M4O6n1pq1Q3Q5q5o4jL5K3mj0M2l7k8k2RM5O3P4q6n4P0m0K2K2Kl5nJ6Ql0J3q1J64
2434B03M7j87K2Nm5RO2O3n3Pm2o4K5k1N1O8p9J9k2l1K9R7l9m6J1j0R4m9m4J19Q2m0j24L2P
2105A56p5R4j14O6Q3l9j07k3J06J9m5jK2j03Rj6N3P4jq9l3N0j5P6j38M0J69o5j32O8o5k3J22
$$ plain form
1795 123 119 166 210 132 70 101 163 245 253 213 49 140 122 74 68 145 182 112 94 14 113 122 86 99 56 41 35 180 194 50 115 93 38 80 66 63
1457 63 15 326 678 409 170 91 97 26 77 160 16 87 127 104 166 131 126 58 67 174 211 156 57 101 157 73 160 264 122 69 200 195 235
1148 235 132 76 31 46 251 92 101 106 124 101 140 62 22 28 94 61 127 164 180 73 85 24 132 124 283 192 70 323 617 752 669 1156
847 1156 982 1779 3457 2222 857 8400 6392 2830 3526 406 1014 466 669 2573 16783 17344 1546 618 792
669 792 759 365 543 115 81 421 135 1128 682 968 171 215 206 60 428 693 207 218 208 122 9 200 72 127 172 37 128
415 128 93 131 73 257 145 44 226 158 133 166 75 91 149 156 192 109 202 173 155 50 86 117 32 80 94 181 110 95 78 103 71 79 42 52
96 52 94 46 139 45 110 91 73 121 142 140 142 204 159 97 102 140 73 62 188 128 84 47 108 171 132 104 101 168 108 119 97 146 127 38 208 243 208
-252 208 52 58 54 146 84 207 160 117 115 128 37 112 75 91 125
$$ packed form
1795A23mM7M4p8o2L1O2Q2Qm0j64R1j8m8oP7L7p0j8q0R9Rl6J3m3j5oJ45J4j44O5k2n5M2j4l
1457F3m8L11L52k69k39p9Op1N1Q3j44P1M0k3O2l5no8RJ07L7n5r9M4N6q4Q7J04j42n3J31nM0
1148B35j03n6m5J5K05j59RNJ8k3L9p8m0OO6l3O6L7J6j07J2o1J08qJ59r1j22K53K94J35q3M87
847A156j74P97J678j235j365P543k008l562O96l120O08n48K03J904J4210N61j5798r28J74
669G92l3l94J78m28l4L40k86R93m46K86p97M4rj46L68K65m86J1j0q6j13J91j28N5M5j35R1
415A28l5L8n8J84j12j01J82o8k5L3r1J6N8PL6q3R3k9j8j05L6L1q5M8J4Q7p1j5j7K5l2Ql7J0
96E2M2m8R3r4O5j9j8M8K1kKO2m5o2NL8o7j1J26o0m4l7O1O3l9k8lO7o0J1k2M9j9q9J70L5l5
-252B08j56OmR2o2J23m7m3kJ3r1P5l7J6L4
-392A25
##PAGE=	F1=-2805.64
##FIRST=	4405.895418600002813,	4405.895418600002813,	0
##DATA TABLE=	(F2++(Y..Y)), PROFILE
$$ plain form
4406 17 112 19 78 35 72 100 91 70 159 90 199 117 117 36 22 205 73 47 27 98 53 96 60 126 131 62 66 159 185 129 160 23 36 77 60
4077 60 54 100 55 139 93 49 89 107 162 108 139 13 102 121 84 202 25 166 140 30 135 122 104 72 110 52 44 169 67 120 40 81
3777 81 97 69 99 30 37 77 128 136 200 134 190 100 58 114 88 89 77 23 20 93 54 38 65 62 41 59 86 58 65 31 86 97 138 187 169 99 71 33
3420 33 80 34 35 196 158 80 85 193 50 132 131 141 99 179 83 4 108 138 189 100 64 73 99 54 65 92 66 121 177 491 462 149 83 62
3101 62 51 92 185 143 160 78 95 157 129 271 233 281 89 288 172 158 208 104 221 124 31 57 85 66 79 160 74 86 75 136 57 55 129
2791 129 19 92 129 87 110 17 74 134 83 53 61 37 151 88 51 136 111 40 18 27 125 115 201 115 21 121 122 159 99 175 160 109 117 185 52
2462 52 89 68 172 257 104 70 139 34 91 104 201 192 92 118 38 97 13 70 179 52 118 39 74 100 134 150 77 70 62 171 126 97 218
2152 218 286 190 103 116 223 27 197 68 74 252 154 86 89 71 193 106 135 173 82 44 48 125 145 112 18 51 102 109 137 68 26 198 129
$$ packed form
4406A7R5r3N9m3L7K8rk1Q9o9J09q2%q1j4J83j32k6k0P1m5M3l6O6No9MR3K6n6L1j37J3M1j7
4077F0oM6m5Q4m6m4M0J8N5n4L1j26Q9J9l7J18j77J41k6j10J05j3j8l2L8n8qJ25j02N3q0M1
3777H1J6k8L0o9PM0N1QO4o6N6r0m2N6k6Jj2n4lP3l9j6K7lk1J8K7k8Pl4N5J1M1M9j8p0k8l8
3420C3M7m6JJ61l8p8NJ08j43Q2jJ0m2Q0r6p9J04L0N1q9l6RK6m5J1K7k6N5N6L14k9l13o6k1
3101F2j1M1R3m2J7q2J7O2k8J42l8M8j92J99j16j4N0j04J17r7r3K6K8j9J3Q1q6J2j1O1p9kP4
2791A29j10P3L7m2K3r3N7O0n1l0Qk4J14o3l7Q5k5p1k2RR8j0Q6q6r4J00JL7o0P6j5n1QO8j33
2462E2L7k1J04Q5j53l4O9j05N7J3R7rj00K6q0N9q4N7J09j27O6p9L5K6L4J6p3pqJ09m5k9J21
2152B18O8r6q7J3J07j96J70j29OJ78r8o8Lj8J22q7K9L8r1l8MP7K0l3r4L3N1PK8o9m2J72o9
$$ plain form
1842 129 67 17 7 60 103 209 231 355 106 111 126 190 229 303 266 47 178 158 130 61 149 123 198 55 54 183 82 65 107 91 161 70
1542 70 90 210 61 183 107 31 155 70 87 86 326 574 328 150 163 99 56 10 129 48 85 140 89 276 81 172 51 140 135 311
1260 311 126 85 81 153 55 45 252 143 35 211 267 274 94 143 153 191 226 205 188 80 50 159 153 124 192 179 188 117 82 174 193 257 219
950 219 184 121 80 367 61 235 583 907 783 637 380 892 1550 2779 2020 1264 10368 7309 4317 6275 741 736 2487
734 2487 3525 7059 43047 29553 2766 1298 604 1016 894 829 794 590 177 347 378 1062 600 639 174 400 265 320
528 320 686 196 459 69 213 193 228 157 124 228 200 187 143 246 205 148 238 118 256 273 63 231 66 122 200 165 139 113 273
256 273 187 114 140 97 136 118 92 200 142 113 158 135 53 153 82 63 146 67 64 74 73 132 174 55 108 184 105 152 297 84 137 123 87 87
-64 87 127 168 76 138 62 83 110 49 93 37 195 182 122 122 124 156 113 97 266 231 40 29 87 104 85 201 190 102 136 88 7 57 106 57 176
$$ packed form
1842A29o2n0j0N3M3J06K2J24k49NJ5O4L9P4l7k19J31k0k8o9Q8k6P5j43jJ29j01j7M2j6P0r1
1542G0K0J20j49J22p6p6J24q5J7jK40K48k46j78J3o4m3m6J19q1L7N5n1J87j95R1j21Q9nJ76
1260C11j85m1mP2r8j0K07j09j08J76N6Pj80M9J0L8L5k1j7j08l0J09ok9O8j3Rp1l5R2J9O4l8
950B19l5o3m1K87l06J74L48L24j24j46k57N12O58J229p59p56R104l059k992J958n534nJ751
734B487J038L534L5988j3494k6787j468o94M12j22o5l5k04m13J70L1O84m62L9m65K26j35N5
528C20L66m90K63l90J44k0L5p1l3J04k8j3m4J03m1n7R0j20J38J7k10J68j65N6P8l5k6k6J60
256B73q6p3K6m3L9j8k6J08n8k9M5k3q2J00p1j9Q3p9lJ0jN9M2j19N3P6p9M7J45k13N3j4l6%
-64H7M0M1r2O2p6K1K7o1M4n6J58j3o0%KL2m3j6J69l5j91j1N8J7j9J16j1q8L4m8q1N0M9m9J19
-392A76
##PAGE=	F1=-2824.42
##FIRST=	4405.895418600002813,	4405.895418600002813,	0
##DATA TABLE=	(F2++(Y..Y)), PROFILE
$$ plain form
4406 88 184 42 112 141 197 209 223 177 181 76 241 203 204 134 82 286 52 40 82 172 89 171 92 167 175 80 65 217 159 226 211 12 37
4096 37 66 120 23 156 139 158 90 42 63 99 232 73 162 68 122 82 36 247 98 214 68 30 154 136 140 28 187 61 90 194
3814 194 84 121 20 131 121 157 135 55 2 70 162 119 252 59 225 106 30 101 119 147 63 90 37 104 70 47 100 87 127 34 92
3523 92 87 25 36 113 115 185 140 159 80 89 68 72 99 21 222 198 126 50 170 113 134 206 149 111 188 99 37 153 155 179 137 64 102 93 35 101 138
3176 138 134 149 120 450 545 150 134 45 66 100 205 78 201 68 91 98 91 263 253 326 125 270 196 183 217 84 262 104 111 41 96
2885 96 46 95 203 67 76 72 168 93 80 167 23 101 167 91 129 29 66 75 78 124 103 40 199 80 27 153 128 76 25 101 161 83 177 106
2565 106 107 88 152 184 49 212 189 93 124 225 26 58 142 142 248 137 50 206 38 138 93 205 250 35 155 106 130 15 59
2293 59 204 28 143 20 119 143 103 167 100 38 96 195 127 146 206 244 123 101 88 287 54 217 76 35 292 126 131 133 10 225
$$ packed form
4406H8R6j42P0K9N6J2J4m6Mj05J65l8Jp0n2K04k34j2M2R0q3Q2p9P5Qr5j5J52n8O7j5j99K5
4096C7K9N4r7J33j7J9o8m8K1L6J33j59Q9r4N4m0m6K11j49J16j46l8J24j8Mj12J59j26K9J04
3814A94j10L7j01J11j0L6k2q0n3O8R2m3J33j93J66j19p6P1J8K8q4K7n3O7l4k3N3j3M0r3N8
3523I2no2J1P7KP0m5J9p9Rk1MK7p8K01k4p2p6J20n7K1P2n7l8P7q9o2J16KK4m2p3L8rn8O6L7
3176A38mJ5k9L30R5l95j6q9K1L4J05j27J23j33K3PpJ72j0P3k01J45p4j3L4j33J78j58Pp0N5
2885I6n0M9J08j36RmR6p5j3Q7j44P8O6p6L8j00L7RLM6k1o3J59j19n3J26k5n2n1P6O0p8R4p1
2565A06Jj9O4L2j35J63k3r6L1J01j99L2Q4%J06j11q7J56j68J00m5J12M5k15J20m9K4j15M4
2293E9J45j76J15j23R9K4m0O4o7o2N8R9o8J9O0L8j21k2j3J99k33J63j41m1K57j66NKj23K15
$$ plain form
2011 225 83 151 190 142 117 61 168 150 64 80 81 125 186 132 119 69 164 169 161 137 12 130 125 369 463 518 139 135 182 205 198 331 297 69
1692 69 224 175 178 94 160 64 286 43 114 242 38 52 132 120 268 116 19 218 137 245 155 97 241 139 131 157 312 392 248 146
1410 146 257 150 127 111 133 90 104 186 115 395 58 219 154 236 105 393 147 229 101 222 71 101 274 246 142 266 359 318
1148 318 105 252 280 347 253 326 296 173 157 246 289 270 377 333 309 267 251 313 328 441 418 363 317 207 518 303 535 725 928
875 928 918 907 263 905 1422 1963 1720 1641 11444 7537 5778 9016 2033 2578 5020 7958 15851 107254 76316 5288
687 5288 1794 1580 2125 2154 1923 1722 1215 631 713 620 1789 616 1522 484 615 478 318 660 312 705 352 404 376 359
462 359 258 294 414 392 364 314 352 354 37 342 297 350 420 93 341 98 214 304 264 243 204 326 233 54 218 255 216 227 200 306
180 306 98 116 287 195 178 260 168 117 230 104 189 20 181 206 253 79 95 246 74 225 380 41 165 156 33 124 258 173
$$ packed form
2011B25j42O8L9m8k5n6J07j8q6J6JM4O1n4j3n0R5Nqk4j25J18nK44R4N5l79mM7K3pJ33l4k28
1692F9J55m9Lq4O6r6K22k43P1J28k04J4Q0j2J48j52r7J99q1J08r0n8J44j02qK6J55Q0j44j02
1410A46J11j07k3j6K2m3J4Q2p1K80l37J61o5Q2j31K88k46Q2j28J21j51L0J73k8j04J24R3m1
1148C18k13J47K8O7r4P3l0j23j6Q9M3j9J07m4k4m2j6O2J5J13k3n5m6j10L11k15K32J90K03
875I28j0j1o44O42N17N41k43p9R803l907j759L238o983N45K442K938P893R1403l0938p1028
687E288l494k14N45K9k31k01n07n84Q2r3J169j173R06j038J31j37j60L42l48L93l53N2k8j7
462C59j01L6J20k2k8n0L8Kl17L05m5N3P0l27K48k43J16R0m0k1l9J22r3j79J64L7l9J1k7J06
180C06k08J8J71r2j7Q2r2n1J13j26Q5j69J61K5M7j74J6J51j72J51J55l39J24rj23R1J34q5
$$ plain form
-83 173 166 189 109 63 85 70 169 125 242 242 123 156 77 244 200 48 298 259 39 27 152 160 195 252 259 89 171 85 68 204 229 169 306
$$ packed form
-83A73pK3q0m6K2j5R9m4J17%j19L3p9J67m4j52K50l9k20j2J25QL5N7Pj70Q2q6j7J36K5o0J37
-392C06
##PAGE=	F1=-2843.2
##FIRST=	4405.895418600002813,	4405.895418600002813,	0
##DATA TABLE=	(F2++(Y..Y)), PROFILE
$$ plain form
4406 133 223 65 173 232 268 269 296 228 196 72 257 290 253 189 143 310 83 32 127 206 138 215 121 189 198 91 117 252 155 284 222
4115 222 13 58 48 150 74 174 211 152 92 49 32 86 263 111 139 113 138 47 18 261 156 222 50 64 169 156 164 47 231 95
3833 95 118 195 89 122 83 148 107 217 145 121 45 64 162 103 259 10 233 128 10 103 120 171 49 138 42 131 109 66 119 113 183 18
3533 18 84 91 49 34 157 120 202 103 131 59 126 85 79 139 19 222 219 160 19 136 149 110 252 132 124 203 148 71 178 142 161 160 76 111
3213 111 80 67 125 162 177 175 158 422 591 153 169 50 88 91 196 31 215 73 92 54 52 256 269 348 159 234 206 185 200 60 271
2922 271 89 154 64 79 40 104 222 76 58 101 195 126 81 166 44 98 205 94 133 29 66 19 89 174 131 55 201 72 12 154
2641 154 107 95 25 159 168 72 145 93 174 78 165 183 41 239 194 73 143 231 51 57 201 129 229 145 42 242 50 167 84 191
2359 191 274 36 168 152 122 35 61 209 18 141 24 145 167 91 160 126 13 126 213 109 173 152 158 86 110 70 314 90 220
$$ packed form
4406A33R0j58J08N9L6JK7o8l2j24J85L3l7o4m6J67k27n1R5P9o8P7r4O8Rj07K6J35r7J29o2
4115B22k09M5j0J02p6J00L7n9o0m3j7N4J77j52K8k6K5r1k9K43j05O6j72J4J05j3Qj17J84j36
3833I5K3P7j06L3l9O5m1J10p2k4p6J9R8n9J56k49K23j05j18R3J7N1j22Q9r6Q9k2m3N3oP0j65
3533A8O6Pm2j5J23l7Q2r9K8p2O7m1oO0j20K03ln9j41J17J3l9J42j20qP9n5p7J07l6J9jq4L5
3213A11l1j3N8L7J5kj7K64J69m38J6j19L8LJ05j65J84j42J9l8kK04J3P9j89P5k8k1J5j40K11
2922B71j82O5r0J5l9O4J18j46j8M3R4o9m5Q5j22N4J07j11L9j04L7m7P0Q5m3p6J46j29o0J42
2641A54m7j2p0J34Rr6P3n2Q1r6Q7J8j42J98m5j21P0Q8j80OJ44p2J00q4j03K00j92J17q3J07
2359A91Q3k38J32j6l0q7K6J48j91J23j17J21K2p6O9l4j13J13Q7j04O4k1Op2K4m0K44k24J30
$$ plain form
2087 220 75 39 307 111 155 153 49 233 72 161 171 169 169 44 184 157 37 124 94 122 235 138 140 101 113 205 217 219 44 166 158 458
1786 458 535 540 183 125 221 187 176 321 278 90 241 165 188 114 145 35 339 69 145 251 19 71 134 142 314 131 76 191 179 268
1504 268 181 124 285 184 144 182 260 177 205 148 311 181 148 173 141 101 126 207 121 452 75 223 228 289 113 399 166 309 102
1232 102 276 87 193 287 322 177 290 394 311 128 304 327 427 271 358 338 234 229 277 361 341 468 385 362 344 353 397 405 491 496 426
941 426 418 325 524 455 681 653 795 651 907 636 831 1251 1347 1306 1698 11218 7130 7104 10972 2713 3371 5990 10230 20416
716 20416 139916 100812 6970 1741 2103 2754 2754 2455 2191 1464 864 887 1227 2080 970 1963 632 675 562 469 578
518 578 363 792 493 483 439 425 276 385 520 473 448 394 373 425 83 364 383 398 489 100 387 102 255 364 311 330 242 316 251
246 251 34 232 356 252 275 277 363 77 94 376 195 252 307 226 135 259 124 270 67 227 255 284 104 82 272 80 267 398
$$ packed form
2087B20j45l6K68j96M4kj04J84j61Q9J0k%j25J40k7j20Q7l0K8J13r7Kl9J2R2J2Kj75J22qL00
1786D58P7Nl57n8R6l4j1J45m3j88J51p6K3p4L1j10L04k70P6J06k32N2O3QJ72j83n5J15j2Q9
1504B68q7n7J61j01m0L8P8q3K8n7J63j30l3K5l2m0K5Q1q6L31l77J48NO1j76K86k33J43k07
1232A02J74j89J06R4L5j45J13J04q3j83J76K3J00j56Q7k0j04nM8Q4k0J27q3k3j8RM4QQ6Np0
941D26qr3J99o9K26k8J42j44K56k71J95M20R6m1L92R520m088k6L868q259O58K619M240J0186
716B0416J19500l9104r3842n229L62O51%k99k64p27o00K3L40Q53j110R93j331M3j13r3J09
518E78k15M29k99j0m4j4j49J09J35m7k5n4k1N2l42K81J9J5R1l89K87k85J53J09n3J9q8P4o5
246B51k17J98J24j04K3KQ6k86J7K82j81N7N5q1r1J24j35J46k03J60K8K9j80k2J90j92J87J31
$$ plain form
-17 398 108 154 171 41 133 330 162 238 204 140 64 86 143 210 212 252 253 119 185 41 301 239 104 299 270 45 95 188 217 257 287
-308 287 305 60 193 134 97 305 293 221 394
$$ packed form
-17C98k90M6J7j30R2J97j68P6l4o4p6K2N7O7KM0Jj34O6j44K60o2j35J95k9k25N0R3K9M0L0
-308B87J8k45J33n9l7K08j2p2J73
-392C94
##PAGE=	F1=-2861.98
##FIRST=	4405.895418600002813,	4405.895418600002813,	0
##DATA TABLE=	(F2++(Y..Y)), PROFILE
$$ plain form
4406 96 193 34 172 202 195 181 224 163 158 94 235 293 181 121 145 233 84 28 126 145 92 152 74 154 191 79 155 223 150 244 146 61 73
4096 73 40 117 54 112 194 92 79 88 4 71 209 99 46 108 134 13 24 227 141 157 99 50 167 158 152 65 190 106 108 153 64 111 122 103
3777 103 19 211 111 152 78 39 115 63 181 20 195 177 52 77 62 126 37 129 37 167 127 84 78 84 168 38 54 52 40 9 132 83
3476 83 158 95 80 38 130 78 85 104 54 194 212 163 28 82 127 47 248 86 125 203 169 106 153 137 152 159 85 80 77 63 123 136 181 203 162
3148 162 431 568 108 153 86 102 76 145 35 169 47 75 70 9 269 236 356 114 186 181 146 152 36 226 50 126 71 13 35 107
2866 107 195 63 6 80 185 129 49 114 42 66 196 97 100 25 53 19 149 167 118 32 142 85 36 124 41 65 43 169 127 90 114 52
2565 52 189 102 136 133 52 232 181 72 138 183 49 104 220 129 196 115 76 213 47 155 82 166 241 39 122 140 51 23 54 177 29
2274 29 84 21 121 150 114 116 125 26 128 173 47 148 54 82 78 102 31 273 78 184 62 38 270 136 114 142 39 193 87 138
$$ packed form
4406I6R7j59J38L0pj4M3o1no4J41N8j12o0K4Q8j49n6R8J9n3O0p8Q0L7j12P6O8p3R4r8q5J2
4096G3l3P7o3N8Q2j02j3Rq4O7J38j10n3O2K6j21J1K03q6J6n8m9J17roq7J25q4KM5q9M7J1j9
3777A03q4J92j00M1p4l9P6n2J18j61J75j8j25K5j5O4q9R2r2J30m0m3oOQ4j30J6kj2l1J23m9
3476H3P5o3j5m2R2n2PJ9n0J40J8m9j35N4M5q0K01j62L9P8l4o3M7j6J5Pp4nlj4O0J3M5K2m1
3148A62K69J37m60M5o7J6k6O9j10J34j22K8no1K60l3J20k42P2nl5Oj16J90j76P6n5n8K2P2
2866A07Q8j32n7P4J05n6q0O5p2K4J30r9Lp5K8l4J30J8m9q6J10n7m9Q8q3K4k2J26m2l7K4o2
2565E2J37q7L4lq1J80n1j09O6M5j34N5J16r1O7q1l9J37j66J08p3Q4P5k02Q3J8q9k8L1J23j48
2274B9N5o3J00K9l6KRr9J02M5j26J01r4K8mK4p1K42j95J06j22k4K32j34k2K8j03J54j06N1
$$ plain form
1993 138 95 127 157 39 155 127 28 110 58 52 209 158 133 92 66 184 191 215 120 135 344 523 487 351 212 58 198 112 190 262 193
1702 193 63 187 134 128 82 74 71 317 77 98 167 58 89 78 164 257 70 54 95 158 221 134 75 241 155 69 136 172 129 181 95 281
1401 281 157 67 140 83 48 95 132 87 376 100 131 243 238 88 264 80 245 40 238 122 192 220 269 58 203 293 188 96
1138 96 222 218 328 166 212 227 173 149 160 261 219 346 231 264 245 258 276 253 273 322 239 286 217 273 290 475 241 497 156 497
856 497 611 439 706 927 589 1142 9473 6345 8281 11407 1961 1861 3594 7643 15088 98448 69622 6244 810
678 810 1281 1915 1846 1629 1634 909 512 617 1024 1418 953 1434 410 440 365 427 346 111 548 301 319 268 286 105 259 380 312
425 312 290 278 228 328 17 203 257 312 369 42 292 17 159 283 187 252 131 208 168 40 126 305 169 193 280 320 111 2
162 2 350 67 184 227 179 81 192 93 236 4 140 210 223 100 54 204 65 202 291 125 81 146 40 63 269 77 202 163
$$ packed form
1993A38m3L2L0j18J16k8r9Q2n2oJ57n1k5m1k6J18PK4r5J5K09J79l6j36j39j54J40q6P8P2o9
1702A93j30J24n3om6qlK46k40K1O9j09L1j1Q6R3j87j6M1O3O3q7n9J66q6q6O7L6m3N2q6J86
1401B81j24r0P3n7l5M7L7m5K89k76L1J12nj50J76j84J65k05J98j16P0K8M9k11J45R0j05r2
1138I6J26mJ10j62M6J5n4k4J1J01m2J27j15L3j9J3J8k3K0M9q3M7o9N6J7J85k34K56l41L41
856D97J14j72K67K21l38N53Q331l128J936L126r446j00J733M049P445Q3360k8826o3378n434
678H10M71O34o9k17Np25l97J05M07L94m65M81j024L0p5O2q1k35M37k47J8n1J8j81J54J21o8
425C12k2j2n0J00l11J86N4N5N7l27K50k75J42J24r6O5j21P7m0j28Q6J79j36K4Q7M0k09j09
162BL48k83J17M3m8r8J11r9J43k32J36P0J3j23m6J50j39J37Q9j66m4O5j06K3K06j92J25l9
$$ plain form
-101 163 141 93 71 123 143 213 159 181 99 187 61 244 167 52 232 232 63 167 141 157 179 222 255 34 175 151 96 258 194 138 339
$$ packed form
-101A63k2m8k2N2K0P0n4K2q2Q8j26J83p7j15J80%j69J04k6J6K2M3L3k21J41k4n5J62o4n6K01
-392C39
##PAGE=	F1=-2880.76
##FIRST=	4405.895418600002813,	4405.895418600002813,	0
##DATA TABLE=	(F2++(Y..Y)), PROFILE
$$ plain form
4406 184 80 81 153 124 161 196 78 115 42 151 227 217 73 152 243 26 24 43 47 69 131 82 152 40 161 34 197 163 271 65 54
4115 54 165 82 80 31 103 150 44 97 70 141 45 169 73 84 176 125 107 32 65 207 46 80 196 37 141 127 103 166 73 185 93
3824 93 101 3 109 131 127 166 139 80 131 96 30 131 63 7 56 96 250 108 13 78 18 153 39 95 212 97 154 51 39 58 117 39
3523 39 40 46 101 18 52 47 133 34 53 70 138 150 32 156 160 182 132 131 85 18 100 195 82 115 172 133 201 50 271 157 139 80 10 152
3204 152 46 167 112 152 240 92 492 455 56 59 165 123 118 41 121 43 48 61 137 53 312 127 375 59 181 98 71 90 73 112 48
2913 48 42 73 115 32 137 111 60 126 51 123 114 32 27 48 83 155 179 28 89 38 51 273 81 75 61 63 140 97 72 125 79 151 119 35 131 138
2575 138 67 146 188 122 18 77 169 198 137 131 109 96 210 187 139 137 113 176 138 99 122 124 153 143 35 7 71 97 41 32 114 126 68 124 54
2246 54 85 185 65 103 114 185 38 89 52 116 190 66 126 111 169 91 108 98 96 168 239 30 186 73 92 151 53 74 68 109 192 126 36
$$ packed form
4406A84j04JP2k9L7L5j18L7p3J09P6j0j44P9R1k17kJ9MK2O2m9P0j12J21j27J63l4J08k06j1
4115E4J11q3km9P2M7j06N3k7P1r6J24r6J1R2n1j8p5L3J42j61L4J16j59J04j4k4O3r3J12r2
3824I3Qr8J06K2mL9k7n9N1l5o6J01o8n6M9M0J54j42r5O5o0J35j14N6J17j15N7j03j2J9N9p8
3523C9JON5q3L4nQ6r9J9J7O8J2j18J24MK2n0jm6o7Q2R5j13L3N7l9O8j51K21j14j8n9p0J42
3204A52j06J21n5M0Q8j48M00l7l99LJ06m2np7Q0p8NJ3P6q4K59j85K48l16J22q3k7J9j7L9o4
2913D8oL1M2q3J05k6n1O6p5P2rq2nK1L5P2K4j51O1n1J3K22j92oj4KP7m3k5N3m6P2l2q4R6P
2575A38p1P9M2o6j04N9R2K9o1ok2j3J14k3m8kk4O3l8l9K3KK9j0j08k8O4K6n6rQ2J2n8N6p0
2246E4L1J00j20L8J1P1j47N1l7O4P4j24O0j5N8p8J7j0kP2P1k09J56j13J9N9r8K1oM1Q3o6r0
$$ plain form
1936 36 108 25 71 115 73 238 203 29 148 147 47 123 279 157 592 721 501 240 238 92 94 68 266 175 103 75 81 214 77 51
1655 51 75 193 203 174 79 52 185 159 67 235 85 112 143 148 156 115 21 113 165 154 141 177 244 247 181 111 243 247 163 46 92 139 104 99 282
1326 282 112 294 101 265 82 145 57 182 36 285 157 320 159 230 58 276 240 109 113 257 114 158 36 279 180 111
1082 111 170 166 180 310 192 169 254 281 154 123 159 258 362 386 315 274 259 322 407 385 629 253 704 406 569 490 620 1133 1159 931
800 931 6287 5689 9416 10003 1769 3387 3655 2105 6650 56699 45406 2918 1275 1581 1230 1283 1162 840 778 740
612 740 336 264 622 709 365 750 551 364 175 401 634 375 372 434 339 190 360 306 187 288 215 283 164 6 313 219 183
359 183 422 79 391 183 265 168 202 209 82 201 216 64 233 192 75 296 192 329 170 264 216 201 267 132 148 58 108 36 234
86 234 83 237 156 152 46 119 147 49 214 214 61 187 125 95 125 161 78 251 72 193 150 156 169 125 188 196 101 21 48 161 175 76 155
$$ packed form
1936C6P2q3M6M4m2J65l5j74J19jj00P6J56j22M35J29k20k61kj46Kk6J98r1p2k8OJ33j37k6
1655E1K4J18J0k9r5k7J33k6r2J68j50K7L1NQm1r4R2N2j1j3L6O7Lo6p0J32Mq4j17M6M7l5nJ83
1326B82j70J82j93J64j83O3q8J25j46K49j28J63j61P1j72K18l6j31MJ44j43M4j22K43r9o9
1082A11N9mJ4J30j18k3Q5K7j27l1L6R9J04K4p1m1j5O3Q5k2K44l76M51k98J63p9J30N13K6k28
800I31N356n98L727N87q234J618K68j550M545N0049j1293m2488j643L06l51N3j21l22o2l8
612G40m04p2L58Q7l44L85j99j87j89K26K33k59lO2r5j49J70n4j19J01p3O8j19j58L07r4l6
359A83K39l43L12k08Q2r7L4Pj27J19J5j52J69m1j17K21j04J37j59R4m8j5O6j35J6r0N0p2J98
86B34j51J54q1mj06P3K8r8J65%j53J26o2l0L0L6q3J73j79J21m3OJ3m4O3Qr5q0K7J13J4r9P9
$$ plain form
-223 155 193 245 130 101 254 96 116 126 197 124 185 100 117 290 79 149 305 70
$$ packed form
-223A55L8N2j15k9J53j58K0J0P1p3O1q5J7J73k11P0J56k35
-392G0
##PAGE=	F1=-2899.54
##FIRST=	4405.895418600002813,	4405.895418600002813,	0
##DATA TABLE=	(F2++(Y..Y)), PROFILE
$$ plain form
4406 539 205 284 395 539 698 769 585 515 220 254 370 376 523 615 590 311 115 89 136 405 505 485 482 190 154 57 321 347 602
4134 602 286 376 326 100 166 244 366 487 254 336 157 196 140 389 291 351 481 305 84 89 199 374 270 351 381 186 100 65
3871 65 167 396 297 416 223 207 100 199 195 381 455 218 226 65 118 156 337 277 307 233 62 335 183 167 303 261 370 143 216
3598 216 267 16 306 275 270 172 248 123 160 186 273 228 242 202 239 132 133 66 323 329 270 325 197 165 112 308 261 187 300 190 200 136
3298 136 145 116 385 146 520 192 147 97 157 310 233 339 254 164 294 115 599 261 272 129 291 186 227 113 295 167 224
3044 224 179 252 136 384 90 447 291 307 57 141 127 170 90 220 245 182 302 93 225 51 193 322 254 118 180 153 157 159 249
2772 249 252 365 152 211 105 128 450 141 192 229 219 240 204 137 338 268 340 141 138 206 245 226 158 368 279 174 178 48 305 272 259
2481 259 248 257 384 132 196 100 263 347 250 253 199 228 212 128 196 226 198 320 164 111 153 301 291 316 208 130 306 178 180 287 386
$$ packed form
4406E39l34P9J11J44J59P1j84p0k95L4J16OJ47R2k5k79j96k6M7K69J00k0lk92l6r7K64K6K55
4134F02l16R0n0k26O6P8J22J21k33Q2j79L9n6K49r8O0J30j76k21NJ10J75j04Q1L0j95q6l5
3871F5J02K29r9J19j93j6j07R9mJ86P4k37Qj61N3L8J81o0L0p4j71K73j52j6J36m2J09k27P3
3598B16N1k51K90l1nr8P6j25L7K6Q7m5J4m0L7j07Jo7K57On9N5j28l2n3J96m7p4J13j10J0o4
3298A36Rk9K69k39L74l28m5n0O0J53p7J06q5r0J30j79M84l38J1j43J62j05M1j14J82j28N7
3044B24m5P3j16K48k94L57j56J6k50Q4j4M3q0J30K5o3J20k09J32j74J42J29o8j36O2k7MKR0
2772B49LJ13k13N9j06K3L22l09N1L7j0K1l6o7K01p0P2j99lO8L9j9o8K10q9j05Mj30K57l3j3
2481B59j1RJ27k52O4r6J63Q4r7Ln4K9j6q4O8L0k8J22j56n3M2J48j0K5j08p8J76j28KJ07R9
$$ plain form
2190 386 201 291 122 310 377 178 293 320 226 262 156 229 244 135 439 258 382 251 110 280 119 301 295 289 428 257 147
1936 147 273 188 277 388 186 423 409 128 329 300 222 275 529 413 749 1085 578 756 331 337 203 300 415 237 314 297 310
1683 310 471 332 252 306 408 194 423 381 382 411 348 296 412 291 429 453 479 375 243 283 395 424 440 499 481 557 299 321 413
1410 413 506 599 545 364 397 417 377 483 695 352 671 483 485 363 460 569 647 500 737 438 685 445 647 486 843 743 558
1157 558 581 672 589 714 676 898 824 678 647 712 771 997 921 922 1012 896 785 819 942 1162 1369 1358 1254 1109 1135 1266 1577 1674 2003
885 2003 1637 1906 1739 1660 2025 2600 3035 3547 3332 2415 5905 10709 7650 7164 11995 15903 19105 41152 325014 250823
697 250823 8670 4302 6659 6818 6732 6026 4425 3634 2836 1996 2544 3157 1668 3180 2332 1806 1454 1156 1310 1916
509 1916 1607 1554 1432 1216 964 1125 1140 1081 1202 1099 1012 789 595 904 925 955 1114 739 966 652 707 693 743 860 698 759 651
$$ packed form
2190C86j85R0j69J88O7j99J15K7r4L6j06P3J5j09L04j81J24j31j41J70j61J82ooJ39j71j10
1936A47J26q5Q9J11k02K37j4k81K01k9p8N3K54j16L36L36n07J78m25Oj34R7J15j78P7j7J3
1683C10J61j39q0N4J02k14K29m2JK9o3n2J16j21J38K4K6j04j32M0J12K9J6N9j8P6k58K2R2
1410D13R3R3n4j81L3K0m0J06K12l43L19j88Kj22R7J09P8j47K37k99K47k40K02j61L57j00j85
1157E58K3R1q3J25l8K22p4j46l1O5N9K26p6JR0j16j11L4J23K20K07j1j04j45K6J31L11R7L29
885B003l66K69j67p9L65N75M35N12k15r17L490M804l059m86M831L908L202K2047K83862p4191
697B50823k42153m368K357J59q6p06j601p91p98q40N48O13j489J512q48n26l52k98J54O06
509A916l09n3j22k16k52J61J5n9J21j03q7k23j94L09K1L0J59l75K27l14N5j4N0J17j62O1j08
$$ plain form
256 651 458 597 672 529 870 688 671 304 551 566 392 795 630 583 412 378 321 589 408 680 641 483 274 271 382 376 576
2 576 656 470 464 382 170 351 512 457 697 406 466 260 272 407 472 617 499 502 278 43 183 407 432 587 621 579 140 150 389
-270 389 402 573 631 631 424 422 47 224 700 569 755 898 439
$$ packed form
256F51j93J39P5j43L41j82j7l67K47J5j74M03j65m7j71l4n7K68j81K72l9j58k09lJ11oK00
2E76Q0j86oq2k12J81J61n5K40k91O0k06J2J35O5J45j18Lk24k35J40K24K5J55L4m2m39J0K39
-270C89J3J71N8%k07kl75J77M76j31J86J43m59
-392D39
##PAGE=	F1=-2918.32
##FIRST=	4405.895418600002813,	4405.895418600002813,	0
##DATA TABLE=	(F2++(Y..Y)), PROFILE
$$ plain form
4406 1032 533 563 833 1187 1462 1565 1291 1074 548 398 657 833 1140 1255 1102 751 304 163 401 866 1032 1041 934 481
4181 481 227 181 549 736 1077 759 799 526 138 286 560 737 956 678 660 312 243 290 691 692 759 863 581 142 164 406
3936 406 684 649 749 649 391 104 87 379 726 693 756 457 405 227 374 384 734 825 514 462 113 181 337 626 589 690 498
3683 498 267 420 277 382 596 590 663 396 373 331 138 519 577 595 485 420 244 299 381 512 543 519 484 405 270 248 273 583 598
3411 598 585 546 324 225 197 545 517 475 562 347 358 225 240 296 638 424 814 276 240 184 355 522 524 598 495 278 363 325 733
3138 733 203 581 385 457 298 366 306 541 445 473 379 416 241 476 342 592 601 526 273 327 258 301 332 456 558 378 529 204
2875 204 352 236 408 572 544 309 350 315 344 332 490 514 619 357 376 221 262 663 411 437 463 456 375 349 307 602 527 593 361
2603 361 336 323 399 440 354 624 538 423 344 122 482 460 511 529 484 609 202 325 238 496 580 540 479 394 376 352 361 437 522 472 592
$$ packed form
4406A032m99L0K70L54K75J03k74k17n26j50K59J76L07J15j53l51m47j41K38M65J66Rj07m53
4181D81k54m6L68J87L41l18M0k73l88J48K74J77K19k78j8l48o9M7M01JO7J04k82m39K2K42
3936D06K78l5J00j00k58k87j7K92L47l3O3k99n2j78J47J0L50R1l11n2l49O8J56K89l7J01j92
3683D98k31J53j43J05K14oP3k67k3m2j93L81N8J8j10o5j76N5Q2J31L1k4l5p9j35k2K5L10J5
3411E98j3l9k22r9k8L48k8m2Q7k15J1j33J5N6L42k14L90n38l6n6J71J67KP4j03k17Q5l8M08
3138G33n30L78j96P2j59O8o0K35r6K8r4L7j75K35j34K50Rp5k53N4o9M3L1J24J02j80J51l25
2875B04J48j16J72J64k8k35M1l5K9j2J58K4J05k62J9j55M1M01k52K6K6pq1k6m2K95p5O6k32
2603C61k5j3P6M1q6K70q6j15p9k22L60k2N1J8m5J25m07J23q7K58Q4m0o1q5j8k4RP6Q5n0J20
$$ plain form
2312 592 336 261 332 538 592 579 477 337 466 373 372 539 685 522 551 345 529 581 396 559 607 530 509 371 420 451 368 718
2049 718 574 677 498 335 462 351 593 633 626 726 493 379 498 461 560 742 541 688 691 329 561 593 588 654 843 769 681 1482
1786 1482 480 1315 572 672 546 611 630 482 646 618 707 835 691 542 599 700 514 785 803 818 718 635 600 687 727 864
1542 864 884 911 732 567 638 781 896 886 983 915 967 388 593 834 1003 1107 1049 818 812 790 784 1004 1252 976 1183 987 892 859
1279 859 929 1226 1283 1150 1334 947 1174 951 1271 1168 1594 1454 1240 1201 1245 1266 1470 1558 1755 1668 1439 1337 1457 1573 1973 1917
1035 1917 1996 2024 1784 1666 1775 2013 2404 2706 2692 2517 2260 2339 2507 3175 3470 3805 3575 3537 3414 3393 4098 5241 6009 6762 6717
800 6717 3969 7361 12311 8137 14883 23613 32243 42362 89290 694232 533631 21353 7974 13625 14581 14146
650 14146 12575 9568 7428 5652 4312 5369 6110 3726 6500 4526 3582 2972 2696 2595 3648 3346 3155 2821 2405 2020
$$ packed form
2312E92k56p5P1K06N4j3j02j40J29r3jJ67J46j63K9k06J84N2j85J63M8p7k1j38M9L1q3L50
2049G18j44J03j79j63J27j11K42M0pJ00k33j14J19l7R9J82k01J47Ll62K32L2nO6J89p4q8Q01
1786A482j002Q35p43J00j26O5J9j48J64k8Q9J28j44j49N7J01j86K71J8J5j00q3l5Q7M0J37
1542H64K0K7j79j65P1J43J15j0R7o8N2n79K05K41J69J04n8k31ok2oK20K48k76K07j96r5l3
1279H59P0K97N7j33J84l87K27k23L20j03M26j40k14l9M4K1K04Q8J97q7k29j02J20J16M00n6
1035A917P9K8k40j18J09K38L91L02j4j75k57P9J68O68K95L35k30l8j23k1P05J143P68P53m5
800F717k748L392M950m174O746Q730Q630J0119M6928O04942j60601n12278j3379N651R56m35
650A4146j571l007k140j776j340J057P41k384K774j974r44o10k76j01J053l02j91l34m16l85
$$ plain form
462 2020 2146 2309 2334 2465 2292 2036 1620 1390 1729 1861 2004 2119 1684 1715 1362 1295 1409 1570 1736 1551 1503 1262 982 1103 1316
227 1316 1278 1663 1391 1236 766 944 1028 967 1490 1331 1219 924 743 727 1073 978 1293 1295 1018 681 516 706 862 1092 1298 1086
-17 1086 894 714 371 677 989 1071 1292 935 869 459 437 726 989 1212 1039 1036 630 171 332 750 1007 1204 1208 1079 401 197
-261 197 586 852 1220 1326 1286 976 715 233 523 1263 1319 1580 1708 1145
-392 1145
$$ packed form
462B020J26J63K5J31j73k56m16k30L39J32J43J15m35L1l53o7J14J61J66j85m8k41k80J21K13
227A316l8L85k72j55m70J78Q4o1N23j59j12k95j81j6L46r5L15Kk77l37j65J90J56K30K06k12
-17A086j92j80l43L06L12Q2K21l57o6m10k2K89K63K23j73lm06m59J61M18K57J97Mj29o78k04
-261A97L89K66L68J06m0l10k61m82K90P40N6K61J28n63
-392A145
##PAGE=	F1=-2937.1
##FIRST=	4405.895418600002813,	4405.895418600002813,	0
##DATA TABLE=	(F2++(Y..Y)), PROFILE
$$ plain form
4406 1582 907 878 1352 1936 2326 2457 2085 1694 922 565 1003 1397 1835 1973 1687 1228 515 252 715 1377 1632 1667 1436 807
4181 807 347 327 834 1199 1615 1294 1260 735 189 420 923 1156 1478 1163 1017 487 278 477 1028 1141 1230 1265 888 253 251
3946 251 655 1037 1086 1195 960 617 183 211 639 1105 1135 1145 731 610 361 585 649 1120 1223 872 728 266 288 549 933
3711 933 954 1101 808 489 491 376 626 916 954 990 683 540 396 321 753 915 966 844 609 377 433 595 788 891 837 789 599
3458 599 417 379 519 873 911 924 787 480 342 336 805 813 803 852 568 519 352 422 561 917 751 1096 405 382 318 571 757 871
3195 871 885 760 432 435 558 873 506 921 676 640 434 505 507 819 752 761 612 604 356 576 627 787 928 776 530 530 394 450 601
2922 601 727 908 614 761 341 485 449 664 839 869 556 559 497 533 534 764 836 895 581 560 355 430 883 730 728 729 700 526 515
2650 515 499 882 808 876 647 546 468 570 677 622 916 825 698 541 315 680 677 811 843 736 849 385 498 451 752 847 872
$$ packed form
4406A582o75k9M74N84L90J31l72l91p72l57M38L94M38J38k86m59p13k63M63O62K55L5k31o29
4181H07m60k0N07L65M16l21l4n25n46K31N03K33L22l15j46n30k09J99N51J13Q9L5l77o35k
3946B51M04L82M9J09k35l43m34K8M28M66L0J0m14j21k49K24O4M71J03l51j44m62K2K61L84
3711I33K1J47k93l19Kj15K50K90L8L6l07j43j44p5M32J62N1j22k35k32N6J62J93J03n4m8j90
3458E99j82l8J40L54L8J3j37l07j38oM69Qj0M9k84m9j67P0J39L56j66L45o91k3o4K53J86J14
3195H71J4j25l28LJ23L15l67M15k45l6k06P1KL12o7Rj49qk48K20N1J60J41j52k46%j36N6J51
2922F01J26J81k94J47m20J44l6K15J75L0l13Lo2L6JK30P2N9l14k1k05P5M53j53kJk9j74j1
2650E15j6L83p4O8k29j01p8J02J07n5K94r1j27j57k26L65lJ34L2j07J13m64J13m7L01R5K5
$$ plain form
2396 872 742 621 540 531 646 721 852 784 873 532 442 544 802 929 878 779 584 642 589 607 837 1024 875 833 589 748 772 653
2134 653 868 930 893 778 628 640 684 662 1031 926 1007 773 590 667 618 905 1010 1014 1043 754 636 747 774 879 1123 944 984 986
1871 986 564 813 919 991 1090 1169 1131 339 1777 319 1692 952 1059 959 952 882 777 1006 989 1160 1244 1086 874 915 1030 917
1626 917 1204 1282 1290 1064 972 934 1014 1205 1356 1368 1382 1140 933 1029 1212 1432 1395 1532 1397 1399 659 912 1306 1579 1679 1601 1332 1280
1364 1280 1198 1260 1586 1871 1668 1751 1541 1382 1413 1478 1933 2000 1874 1990 1533 1713 1550 1969 1951 2420 2242 1998 1883 1885 2026 2303
1119 2303 2553 2713 2587 2280 2123 2286 2475 3058 3038 3200 3136 2776 2652 2856 3214 3811 4177 4166 3923 3539 3680 3892 4950 5477
894 5477 5818 5763 5406 5204 5353 6435 8154 9468 10362 10451 8616 9602 14150 13177 23641 36508 50272 68355 142999
716 142999 1109624 853607 36376 11660 21497 23432 22469 19829 15351 11600 8743 6976 8089 8837 6681 9484
$$ packed form
2396H72j30j21q1rJ15P5J31o8Q9l41r0J02K58J27n1r9j95N8n3J8K30J87j49m2k44J59K4j19
2134F53K15O2l7j15j50J2M4k2L69j05Q1k34j83P7m9K87J05MK9k89j18J11K7J05K44j79M0K
1871I86m22K49J06P2R9P9l8p92J438j458J373p40J07j00pp0j05K29j7J71Q4j58k12M1J15j13
1626I17K87P8Qk26r2l8Q0J91J51J2J4k42k07R6J83K20l7J37j35Kp40K53L94K73J00p8k69n2
1364A280q2O2L26K85k03Q3k10j59L1O5M55O7j26J16m57J80j63M19j8M69j78k44j15KJ41K77
1119B303K50J60j26l07j57J63J89N83k0J62o4l60j24K04L58N97L66j1k43l84J41K12J058N27
894E477L41n5l57k02J49J082J719J314Q94Q9j835R86M548r73J0464J2867J3764J8083P4644
716A42999R66625k56017q17231k4716R837J935r63k640m478l751k857j767J113P48k156K803
$$ plain form
565 9484 6996 5615 4683 4485 4077 5571 5284 4940 4374 3721 3198 3281 3625 3738 3879 3623 3173 2538 2275 2672 2898 3178 3243
349 3243 2742 2531 2147 1948 2207 2512 2704 2514 2324 1937 1561 1676 2032 2135 2543 2178 1887 1306 1386 1537 1657 2253 2120 1924
124 1924 1497 1143 1162 1610 1636 1988 2022 1625 1125 802 1070 1402 1687 2009 1768 1390 1065 609 1054 1526 1761 1946 1535 1317
-101 1317 689 630 1072 1585 1868 1679 1623 1001 319 546 1157 1652 1899 1869 1623 717 227 822 1362 1958 2100 2023 1613 1019
-327 1019 446 908 1894 2179 2504 2603 1946
-392 1946
$$ packed form
565I484k488j381r32j98m08J494k87l44n66o53n23Q3L44J13J41k56m50o35k63L97K26K80O5
349C243n01k11l84j99K59L05J92j90j90l87l76J15L56J03M08l65k91n81Q0J51J20N96j33j96
124A924m27l54J9M48K6L52L4l97n00l23K68L32K85L22k41l78l25m56M45M72K35J85m11k18
-101A317o28n9M42N13K83j89n6o22o82K27O11M95K47l0k46r06m90N95N40N96J42p7m10n94
-327A019n73M62R86K85L25R9o57
-392A946
##PAGE=	F1=-2955.88
##FIRST=	4405.895418600002813,	4405.895418600002813,	0
##DATA TABLE=	(F2++(Y..Y)), PROFILE
$$ plain form
4406 2085 1257 1174 1853 2646 3132 3282 2821 2265 1275 723 1330 1941 2485 2640 2235 1660 704 339 1023 1845 2199 2253 1892 1107
4181 1107 466 468 1113 1643 2114 1794 1675 913 239 544 1272 1545 1961 1620 1342 644 295 669 1343 1554 1677 1616 1161 371
3955 371 339 905 1356 1500 1609 1254 820 277 340 890 1463 1539 1507 990 775 477 788 926 1466 1581 1214 972 421 410 758
3720 758 1203 1308 1465 1105 688 537 464 856 1207 1289 1294 949 685 448 510 960 1230 1314 1185 783 501 539 785 1052 1204 1143
3476 1143 1060 781 548 501 761 1136 1212 1223 1007 622 469 469 1041 1099 1113 1125 771 651 478 613 831 1168 1076 1310 546 531 465
3223 465 766 975 1211 1145 994 568 491 757 992 860 1225 947 812 566 618 681 1073 1036 1038 832 778 462 668 884 977 1215
2979 1215 1007 786 711 500 596 849 983 1231 842 957 479 597 646 917 1077 1166 792 753 672 692 727 1020 1147 1142 782 732 480
2725 480 598 1071 1036 1007 979 909 664 671 672 1133 1056 1139 930 730 610 728 892 887 1187 1081 955 730 497 857 884 1095 1128 966
$$ packed form
4406B085q28q3O79P93M86J50m61n56r90n52O07O11N44J55m05n75r56l65O84Q22L54N4l61p85
4181A107o41KO45N30M71l20j19p62o74L05P28K73M16l41k78o98l49L74O74K11J23o1m55p90
3955C71l2N66M51J44J09l55m34n43O3N50N73P6l2n17k15k98L11J38N40J15l67k42n51j1L48
3720G58M45J05J57l60m17j51p3L92L51Q2Nl45k64k37O2M50K70Q4j29m02k82L8K46K67J52o1
3476A143q3k79k33m7K60L75P6J1k16l85j53%N72N8J4J2l54j20j73J35K18L37r2K34p64j5o6
3223D65L01K09K36o6j51m26p7K66K35j32L65k78j35k46N2O3L92l7Kk06n4l16K06K16R3K38
2979A215k08k21p5k11R6K53J34K48l89J15m78J18M9K71J60Q9l74l9q1K0L5K93J27nl60n0k52
2725D80J18M73l5k9k8p0k45PJM61p7Q3k09k00j20J18J64nL00j06j26k25k33L60K7K11L3j62
$$ plain form
2462 966 1060 581 674 666 982 1104 1174 995 823 688 708 914 994 1160 1072 1114 716 622 737 1044 1245 1160 1055 819 797 785 831 1130
2199 1130 1338 1192 1088 813 943 913 892 1159 1231 1232 1015 869 850 903 937 1319 1251 1307 1023 828 854 872 1182 1358 1373 1325 982 868
1936 868 974 1068 1178 1459 1327 1251 1232 793 1043 1202 1353 1492 1441 1411 400 1891 999 1760 1397 1432 1368 1268 1122 1055 1332
1702 1332 1345 1588 1628 1448 1191 1200 1339 1299 1603 1734 1713 1384 1294 1243 1328 1637 1820 1815 1808 1518 1267 1387 1612 1925 1874 2050 1840 1779
1439 1779 1040 1202 1739 2114 2205 2102 1812 1719 1567 1718 2125 2443 2305 2273 2049 1849 1918 2008 2565 2670 2543 2582 2082 2204 2127
1204 2127 2608 2693 3172 2961 2695 2508 2476 2730 3063 3486 3600 3417 3049 2863 3049 3320 4055 4086 4312 4147 3688 3565 3870 4327
979 4327 5133 5522 5511 5220 4713 4903 5194 6577 7328 7709 7777 7171 6812 7155 8631 10827 12735 13717 13863 12562 11901 15888
772 15888 19287 31856 48357 66744 92387 192440 1496851 1154008 51027 14639 28868 31829 30256
$$ packed form
2462I66R4m79R3qL16J22P0j79j72j35K0K06Q0J66q8M2l98r4J15L07K01q5j05k36k2j2M6K99
2199A130K08j46j04k75J30l0k1K67P2Jk17j46j9N3L4L82o8N6k84j95K6J8L10J76J5m8l43j14
1936H68J06R4J10K81j32p6j9m39K50J59J51J39n1l0j011J491q92P61l63L5o4j00j46o7K77
1702A332J3K43M0j80k57RJ39m0L04J31k1l29r0n1Q5L09J83npk90k51J20K25L13n1J76k10o1
1439A779p39J62N37L75R1j03k90r3j52J51M07L18j38l2k24k00O9R0N57J05j27L9n00J22p7
1204B127M81Q5M79k11k66j87l2K54L33M23J14j83l68j86J86K71P35L1K26j65m59j23L05M57
979D327Q06L89j1k91n07J90K91J383P51L81O8o06l59L43J476K196J908R82J46j301o61L987
772A5888L399J2569J6501J8387K5643J00053J304411l42843j102981l6388J4229K961j573
$$ plain form
650 30256 26470 20708 15418 11528 9534 10105 11114 10395 11403 9304 7564 6276 6144 5534 7323 7071 6594 5811 4930
471 4930 4286 4328 4852 5036 5192 4855 4211 3384 3091 3562 3855 4266 4275 3724 3265 2860 2552 2942 3394 3591 3415 3074 2557 2090
246 2090 2208 2696 2944 3346 2906 2491 1813 1795 2004 2324 2947 2854 2568 2023 1506 1549 2106 2260 2638 2694 2186 1530 1071 1410 1898
11 1898 2254 2654 2398 1852 1373 834 1410 2031 2400 2539 2093 1725 897 815 1382 2148 2465 2290 2161 1325 459 762 1555 2247
-214 2247 2549 2484 2102 1024 229 1049 1836 2657 2812 2705 2217 1279 649 1297 2481 2994 3361 3420 2697
-392 2697
$$ packed form
650C0256l786n762n290l890j994N71J009p19J008k099j740j288j32o10J789k52m77p83q81
471D930o44M2N24J84J56l37o44q27k93M71K93M11Rn51m59m05l08L90M52J97j76l41n17m67
246B090J18M88K48M02m40m15o78j8K09L20O23r3k86n45n17M3N57J54L78N6n08o56m59L39M88
11A898L56M00k56n46m79n39N76O21L69J39m46l68q28q2N67P66L17j75j29q36q66L03P93O92
-214B247L02o5l82j078p95Q20P87Q21J55j07m88r38o30O48J184N13L67N9p23
-392B697
##PAGE=	F1=-2974.66
##FIRST=	4405.895418600002813,	4405.895418600002813,	0
##DATA TABLE=	(F2++(Y..Y)), PROFILE
$$ plain form
4406 2443 1515 1395 2231 3175 3718 3876 3354 2675 1538 840 1571 2355 2961 3119 2635 1965 828 408 1262 2176 2623 2680 2210
4190 2210 1322 555 578 1328 1979 2472 2162 1961 1024 270 627 1542 1823 2309 1956 1569 751 292 825 1573 1852 2006 1848
3974 1848 1344 467 412 1105 1573 1805 1912 1472 958 352 442 1080 1728 1823 1767 1181 863 552 938 1157 1703 1829 1470 1146
3749 1146 539 516 924 1380 1576 1713 1325 827 546 519 1029 1414 1528 1512 1139 780 472 669 1093 1464 1568 1439 908 592
3523 592 602 909 1252 1420 1377 1241 909 637 589 948 1320 1439 1417 1162 718 569 559 1203 1320 1341 1333 902 731 571 760 1046
3279 1046 1339 1336 1414 659 652 592 897 1134 1474 1320 1150 650 513 885 1065 1164 1430 1146 936 661 684 795 1249 1246 1251 993 896
3026 896 539 735 1064 1109 1409 1172 996 835 550 712 1031 1175 1464 1012 1079 592 663 788 1117 1238 1375 967 885 805 790
2791 790 871 1206 1384 1305 915 858 571 729 1194 1269 1214 1162 1048 760 788 787 1310 1216 1330 1150 850 718 844 1042 1092 1379 1255
$$ packed form
4406B443r28j20Q36R44N43J58n22o79j137o98P31P84O06J58m84o70j137m20Q54R14M47N7m70
4190B210q88p67K3P50O51M93l10k01r37p54L57R15K81M86l53l87q18m59N33P48K79J54j58
3974A848n04q77n5O93M68K32J07m40n14o06R0O38O48R5n6n86l18l11L86K19N46J26l59l24
3749A146o07k3M08M56J96J37l88m98k81k7N10L85J14j6l73l59l08J97M24L71J04j29n31l16
3523E92J0L07L43J68m3j36l32k72m8L59L72J19k2k55m44j49j0O44J17K1qm31j71j60J89K86
3279A046K93lP8p55po0L05K37L40j54j70n00j37L72J80R9K66k84k10k75K3J11M54lNk58r7
3026H96l57J96L29M5L00k37j76j61k85J62L19J44K89m52O7m87P1J25L29J21J37m08q2q0j5
2791G90Q1L35J78p9l90n7k87J58M65P5n5n2j14k88K8jN23r4J14j80l00j32J26J98N0K87j24
$$ plain form
2537 1255 1147 871 631 976 1041 1300 1327 1124 1197 738 811 835 1142 1299 1386 1186 954 789 846 1114 1197 1387 1274 1268 850 766 871
2284 871 1214 1479 1369 1247 993 900 923 997 1358 1566 1410 1268 975 1090 968 1057 1371 1449 1476 1170 1044 1009 1065 1135 1520 1488 1515
2030 1515 1195 1010 979 1063 1373 1611 1629 1518 1130 1027 1132 1284 1400 1678 1616 1434 1372 970 1207 1381 1601 1781 1602 1543 1109
1795 1109 1789 1941 1503 1800 1714 1688 1497 1296 1258 1563 1611 1904 1909 1707 1431 1400 1565 1579 1899 2067 2005 1610 1531 1467 1560 1938 2162
1542 2162 2133 2105 1790 1504 1641 1903 2270 2228 2439 2159 2037 1397 1391 2043 2494 2579 2454 2159 2041 1817 2067 2515 2854 2761 2640
1307 2640 2410 2195 2271 2409 2999 3157 3026 2989 2483 2546 2567 3053 3246 3697 3463 3194 2950 2896 3237 3601 4173 4235 3992 3593 3404
1072 3404 3590 3938 4761 4852 5109 4853 4336 4218 4617 5125 6105 6474 6457 6143 5550 5756 6164 7729 8650 9108 9197 8447 7939 8429
847 8429 10247 12732 15116 16152 16274 15061 13607 17047 24130 37876 56787 78355 109635 227597 1778544 1375096
$$ packed form
2537A255j08k76k40L45O5K59K7k03P3m59P3K4L07J57Q7k00k32j65N7K68Q3J90j13om18q4J05
2284H71L43K65j10j22k54r3K3P4L61K08j56j42k93J15j22Q9L14P8K7l06j26l5N6P0L85l2K7
2030A515l20j85l1Q4L10K38J8j11l88j03J05J52J16K78o2j82o2m02K37J74K20J80j79n9m34
1795A109O80J52m38K97q6k6j91k01l8L05M8K93Nk02k76l1J65J4L20J68o2l95p9o4R3L78K24
1542B162k9k8l15k86J37K62L67m2K11k80j22o40oO52M51Q5j25k95j18k24K50M48L39r3j21
1307B640k30k15P6J38N90J58j31l7n06O3K1M86J93M51k34k69k44n4L41L64N72O2k43l99j89
1072C404J86L48Q23R1K57k56n17j18L99N08R80L69j7l14n93K06M08J565R21M58Q9p50n08M90
847H429J818K485K384J036J22j213j454L440P083J3746J8911K1568L1280J17962J550947m03448
$$ plain form
697 1375096 62467 16281 34255 38133 36023 31165 24533 18146 13427 11466 11078 12960 14178 11928 10990 9042
547 9042 7425 7278 6728 8531 8350 7791 6844 5789 5066 5075 5744 5968 6140 5744 4940 3988 3675 4219 4545 5055 4999 4435 3768
331 3768 3358 2985 3468 4037 4219 4071 3601 2997 2465 2586 3180 3540 3909 3429 2920 2185 2089 2332 2836 3433 3389 3021 2397 1758
105 1758 1813 2463 2725 3107 3180 2584 1817 1266 1655 2248 2680 3099 2857 2182 1575 1001 1673 2406 2864 2951 2495 2011 1034 950 1595
-129 1595 2564 2881 2745 2545 1538 562 930 1865 2670 3025 2932 2414 1263 199 1212 2181 3183 3317 3193 2667 1440
-327 1440 803 1614 2903 3602 3980 3996 3248
-392 3248
$$ packed form
697A375096j312629m6186J7974L878k110m858o632o387m719j961l88J882J218k250r38j948
547I042j617j47n50J803j81n59r47j055p23RO69K24J72l96q04r52l13N44L26N10n6n64o67
331C768m10l73M83N69J82j48m70o04n32J21N94L60L69m80n09p35r6K43N04N97m4l68o24o39
105A758N5O50K62L82P3n96p67n51L89N93M32M19k42o75o07n74O72P33M58Q7m56m84r77q4O45
-129A595R69L17j36k00j007r76L68R35Q05L55r3n18j151j064J013R69J002J34j24n26j227
-327A440o37Q11J289O99L78J6p48
-392C248
##PAGE=	F1=-2993.44
##FIRST=	4405.895418600002813,	4405.895418600002813,	0
##DATA TABLE=	(F2++(Y..Y)), PROFILE
$$ plain form
4406 2580 1631 1500 2409 3412 3959 4119 3570 2841 1660 893 1674 2554 3163 3308 2804 2085 861 448 1382 2302 2814 2859
4199 2859 2318 1407 599 632 1431 2137 2611 2322 2060 1042 272 646 1681 1930 2449 2101 1650 784 269 907 1669 1974 2148
3983 2148 1910 1400 522 457 1215 1644 1936 2039 1566 1000 390 495 1170 1844 1931 1867 1261 856 571 1004 1291 1780 1915 1590
3758 1590 1211 596 581 1011 1428 1700 1794 1421 881 513 526 1109 1493 1622 1599 1211 802 457 766 1118 1571 1673 1554 958
3533 958 629 617 937 1344 1494 1488 1297 952 662 622 1042 1384 1544 1463 1220 749 620 584 1259 1430 1440 1436 929 743 605 829
3288 829 1160 1390 1481 1390 707 721 671 935 1206 1604 1372 1197 661 493 920 1073 1362 1490 1231 988 695 691 825 1305 1339 1354
3044 1354 1059 926 567 759 1129 1143 1475 1238 1119 881 532 774 1115 1263 1556 1087 1099 658 671 850 1224 1289 1451 1042
2819 1042 924 871 811 933 1278 1500 1348 951 910 609 792 1225 1382 1301 1238 1094 790 841 821 1380 1251 1407 1260 884 765
$$ packed form
4406B580r49j31R09J003N47J60n49p29j181p67P81Q80O09J45n04p19j224m13R34R20N12M5
4199B859n41r11q08L3P99P06M74k89k62j018p70L74J035K49N19l48m51q66n15O38P62L05J74
3983B148k38n10q78o5P58M29K92J03m73n66o10J05O75O74Q7o4o06m05k85M33K87M89J35l25
3758A590l79o15j5M30M17K72R4l73n40l68J3N83L84J29k3l88m09l45L09L52M53J02j19n96
3533I58l29j2L20M07J50oj91l45k90m0M20L42J60q1k43m71j29l6O75J71J0mn07j86j38K24
3288H29L31K30R1r1o83J4n0K64K71L98k32j75n36j68M27J53K89J28k59k43k93mJ34M80L4J5
3044A354k95j33l59J92L70J4L32k37j19k38l49K42L41J48K93m69J2m41J3J79L74O5J62m09
2819A042j18n3o0J22L45K22j52l97m1l01J83M33J57q1o3j44l04N1k0N59j29J56j47l76j19
$$ plain form
2584 765 897 1094 1195 1447 1309 1235 933 693 1011 1117 1379 1399 1178 1229 819 876 917 1199 1389 1470 1270 982 823 914 1207 1285
2340 1285 1486 1349 1304 906 843 920 1274 1585 1462 1314 1068 925 974 1067 1473 1661 1482 1335 1048 1170 917 1109 1457 1537 1575
2105 1575 1212 1114 1084 1139 1213 1586 1591 1587 1249 1104 1010 1151 1436 1719 1727 1581 1166 1078 1190 1373 1502 1730 1758 1494 1376 1061 1271
1852 1271 1421 1685 1906 1623 1499 1707 1410 2682 1071 2040 1832 1845 1587 1357 1344 1654 1727 2042 2026 1807 1540 1471 1660 1696
1626 1696 2026 2209 2103 1688 1627 1559 1654 2047 2309 2250 2208 1898 1591 1740 2025 2395 2381 2616 2287 2123 1628 1425 2150 2635 2715
1392 2715 2581 2297 2177 1890 2231 2673 3014 2945 2771 2546 2343 2393 2592 3147 3354 3225 3118 2648 2660 2777 3207 3495 3881 3642
1166 3642 3392 3117 3052 3437 3804 4469 4484 4188 3796 3628 3792 4196 5027 5172 5422 5102 4578 4470 4941 5435 6518 6834 6803 6486
941 6486 5872 6057 6591 8166 9160 9707 9725 8934 8352 8902 10933 13464 16086 17135 17172 15775 14231 17192 26465 40407
$$ packed form
2584G65J32J97J01K52j38p4l02k40L18J06K62K0k21N1m10N7M1K82J90Q1k00k88j59R1K93P8
2340A285K01j37m5l98o3P7L54L11j23j48k46j43M9R3M06J88j79j47k87J22k53J92L48Q0L8
2105A575l63r8l0N5P4L73Nml38j45r4J41K85K83Qj46m15q8J12J83J29K28K8k64j18l15K10
1852A271J50K64K21k83j24K08k97J272j611R69k08J3k58k30j3L10P3L15j6k19k67o9J89L6
1626A696L30J83j06m15o1o8R5L93K62n9m2l10l07J49K85L70j4K35l29j64m95k03P25M85Q0
1392B715j34k84j20k87L41M42L41o9j74k25k03N0J99N55K07j29j07m70J2J17M30K88L86k39
1166C642k50k75o5L85L67O65J5k96l92j68J64M04Q31J45K50l20n24j08M71M94J083L16l1l17
941F486o14J85N34J575R94N47J8p91n82N50K031K531K622J049L7j397j544K961R273J3942
$$ plain form
753 40407 60007 82629 116444 240929 1894957 1470112 68354 16237 36491 41043 38638 32943 25965 19243
622 19243 14029 12318 11014 14171 16757 11279 11680 9707 7866 7604 7444 8921 8849 8281 7248 6112 5371 5355 6111 6334
434 6334 6524 6097 5201 4221 3905 4499 4817 5383 5257 4727 3926 3534 3153 3670 4305 4455 4342 3791 3164 2605 2720 3383 3799
218 3799 4109 3637 3078 2343 2200 2451 3087 3605 3612 3186 2539 1843 1905 2607 2934 3293 3381 2730 1929 1341 1753 2375 2874 3247 3051
-17 3051 2307 1626 1075 1783 2573 3058 3092 2656 2112 1069 998 1666 2742 3028 2945 2698 1600 601 1014 2021 2832 3228 3117
-233 3117 2490 1389 136 1269 2323 3431 3510 3383 2872 1470 884 1792 3072 3878 4234 4209 3487
-392 3487
$$ packed form
753D0407J9600K2622L3815J24485J654028m24845j401758n2117K0254M552k405n695o978o722
622A9243n214j711j304L157K586n478M01j973j841k62j60J477p2n68j033j136p41j6P56K23
434F334J90m27q96r80l16N94L18N66j26n30q01l92l81N17O35J50j13n51o27n59J15O63M16
218C799L10m72n59p35j43K51O36N18Pm26o47o96O2P02L27L59Q8o51q01n88M12O22M99L73j96
-17C051p44o81n51P08P90M85L4m36n44j043p1O68J076K86q3k47j098r99M13J007Q11L96j11
-233C117o27j101j253J133J054J108P9j27n11j402n86R08J280Q06L56k5p22
-392C487
##PAGE=	F1=-3012.22
##FIRST=	4405.895418600002813,	4405.895418600002813,	0
##DATA TABLE=	(F2++(Y..Y)), PROFILE
$$ plain form
4406 2469 1587 1473 2353 3309 3807 3962 3425 2733 1618 873 1618 2500 3049 3168 2706 1996 794 453 1362 2198 2734 2751 2193
4190 2193 1346 591 622 1402 2084 2500 2245 1949 959 238 593 1666 1845 2351 2025 1562 740 228 895 1612 1899 2072 1789
3974 1789 1317 525 464 1212 1554 1866 1963 1516 937 382 488 1144 1786 1840 1783 1212 754 531 970 1304 1678 1821 1550 1154
3749 1154 578 588 1002 1341 1649 1692 1372 840 441 480 1081 1431 1549 1535 1149 746 403 783 1025 1533 1605 1507 926 601 589
3514 589 861 1308 1411 1455 1217 896 616 594 1024 1316 1503 1349 1169 708 608 536 1199 1403 1389 1416 845 685 571 804 1150
3279 1150 1309 1481 1247 667 724 684 868 1178 1571 1286 1124 600 433 860 1013 1419 1390 1187 953 658 640 765 1226 1300 1326
3044 1326 1016 853 539 728 1069 1063 1404 1189 1132 846 451 770 1086 1228 1489 1048 1013 666 622 819 1213 1221 1381 1002 859
2810 859 852 752 900 1221 1472 1257 881 874 585 769 1157 1353 1247 1190 1044 748 819 763 1330 1153 1353 1238 825 738 874 1036
$$ packed form
4406B469q82j14Q80R56M98J55n37o92j115p45P45Q82N49J19m62p10j202l41R09Q36N36J7n58
4190B193q47p55L1P80O82M16k55k96r90p21L55J073J79N06l26m63q22n12O67P17K87J73k83
3974A789m72p92o1P48L42L12R7m47n79n55J06O56O42N4n7n71m58k23M39L34L74J43k71l96
3749A154n76J0M14L39L08M3l20n32l99L9O01L50J18j4l86m03l43L80K42N08P2r8n81l25j2
3514E89K72M47J03M4k38l21k80k2M30K92J87j54j80m61j00p2O63K04j4K7n71j60j14K33L46
3279A150J59J72k34n80N7m0J84L10L93k85j62n24j67M27J53M06k9k03k34k95j8J25M61P4K6
3044A326l10j63l14J89L41oL41k15n7k86l95L19L16J42K61m41l5l47m4J97L94QJ60l79j43
2810H59pj00J48L21K51k15l76pk89J84L88J96j06n7j46k96P1n6N67j77K00j15m13q7J36J62
$$ plain form
2565 1036 1175 1374 1234 1205 901 672 952 1097 1314 1327 1115 1147 810 853 895 1143 1351 1415 1224 901 781 895 1176 1238 1436
2331 1436 1284 1214 876 839 877 1208 1542 1419 1242 1026 863 929 1022 1447 1605 1396 1273 1021 1174 770 1039 1398 1477 1511 1132
2096 1132 1063 1056 1110 1157 1498 1542 1509 1170 1100 936 1122 1359 1663 1647 1501 1083 1008 1137 1313 1466 1601 1726 1423 1244 1046 1223
1852 1223 1318 1593 1854 1513 1306 1948 664 2904 911 2023 1745 1794 1515 1281 1292 1584 1663 1969 1947 1727 1492 1397 1602 1625
1626 1625 1950 2127 1985 1594 1556 1496 1585 1942 2225 2140 2092 1817 1510 1663 1951 2270 2299 2541 2198 2017 1682 1286 2034 2502 2580
1392 2580 2455 2195 2097 1766 2171 2566 2883 2819 2631 2428 2257 2257 2513 2980 3212 3102 2937 2541 2516 2712 3033 3387 3678 3456 3251
1157 3251 2968 2905 3285 3631 4310 4289 3960 3611 3481 3609 4034 4796 4974 5185 4837 4358 4266 4772 5188 6279 6519 6474 6166 5607
932 5607 5744 6371 7796 8744 9354 9264 8501 7955 8477 10532 12854 15423 16429 16355 14729 13532 16086 25820 38882 57308
$$ packed form
2565A036J39J99j40k9l04k29K80J45K17J3k12L2l37M3M2K48K08O4j91l23j20J14K81O2J98
2331A436j52p0l38l7L8L31L34j23j77k16j63O6R3M25J58k09j23k52J53m04K69L59P9L4l79
2096A132o9pN4M7L41M4l3l39p0j64J86K37L04j6j46m18p5J29J76J53J35J25l03j79j98J77
1852A223R5K75K61l41k07O42j284K240j993J112k78M9k79k34J1K92P9L06k2k20k35r5K05K3
1626A625L25J77j42l91l8o0Q9L57K83q5m8k75l07J53K88L19K9K42l43j81l35l96P48M68P8
1392B580j25k60r8l31M05L95L17o4j88k03j71%K56M67K32j10j65l96k5J96L21L54K91k22k05
1157C251k83o3L80L46O79k1l29l49j30J28M25P62J78K11l48m79r2N06M16J091K40m5l08n59
932E607J37O27J425R48O10r0p63n46N22K055K322K569J006p4j626j197K554R734J3062J8426
$$ plain form
744 57308 78614 111341 229471 1820646 1418357 67456 14553 35067 39957 37637 31495 24640 18504 13220
612 13220 11825 10200 14098 16715 10136 11189 9355 7485 7048 7516 8406 8459 7961 6922 5816 5127 5097 5871 6056 6257
425 6257 5833 4936 4026 3728 4338 4608 5184 4985 4537 3696 3349 3013 3501 4136 4248 4172 3598 3017 2479 2573 3262 3664 3896 3483
199 3483 2926 2253 2102 2334 3026 3421 3478 3028 2418 1737 1809 2503 2846 3152 3256 2590 1843 1279 1682 2252 2793 3066 2941 2200
-26 2200 1509 1040 1713 2495 2947 2925 2540 2006 990 941 1581 2645 2873 2845 2588 1499 567 997 1988 2697 3116 3004 2308
-242 2308 1377 51 1201 2234 3351 3350 3236 2790 1361 879 1800 2949 3770 4070 4014 3365
-392 3365
$$ packed form
744E7308K1306L2727J18130J591175m02289j350901n2903K0514M890k320o142o855o136n284
612A3220j395j625L898K617o579J053j834j870m37M68Q90N3m98j039j106o89l0P74J85K01
425F257m24q97r10k98O10K70N76j99m48q41l47l36M88O35J12p6n74n81n38R4O89M02K32m13
199C483n57o73j51K32O92L95N7m50o10o81P2O94L43L06J04o66p47n64M03N70N41K73j25p41
-26B200o91m69O73P82M52k2l85n34j016m9O40J064K28k8k57j089r32M30R91P09M19j12o96
-242B308r31j326J150J033J117jj14m46j429m82R21J149Q21L00n6o49
-392C365
##PAGE=	F1=-3031
##FIRST=	4405.895418600002813,	4405.895418600002813,	0
##DATA TABLE=	(F2++(Y..Y)), PROFILE
$$ plain form
4406 2133 1398 1325 2080 2893 3297 3446 2951 2376 1427 789 1418 2214 2645 2730 2365 1720 645 429 1208 1890 2405 2378 1859 1154
4181 1154 538 551 1250 1836 2161 1956 1652 789 172 475 1503 1590 2035 1746 1320 630 176 787 1413 1647 1796 1509 1118
3965 1118 477 431 1099 1328 1615 1698 1332 782 332 428 1010 1566 1572 1534 1044 578 447 846 1195 1420 1566 1363 987 491 534
3730 534 898 1139 1435 1431 1193 715 338 388 953 1243 1325 1333 968 623 317 718 833 1360 1381 1309 818 512 531 698 1150 1193 1283
3476 1283 1020 751 504 510 898 1132 1323 1097 1019 608 535 428 1038 1243 1201 1278 667 569 473 691 1021 1115 1336 1018 540 662
3232 662 627 710 1059 1382 1078 949 487 346 723 899 1328 1154 1028 838 554 546 629 1029 1137 1174 875 686 460 640 900
2997 900 882 1212 1040 1035 740 327 699 955 1082 1273 904 838 616 526 708 1087 1048 1181 855 704 749 628 779 1045 1308 1050
2753 1050 723 758 507 664 1002 1192 1061 1029 915 640 728 628 1171 942 1179 1090 687 639 782 880 1039 1173 1046 1064 781
$$ packed form
4406B133p35p3P55Q13M04J49m95n75r49o38O29P96M31Q5l65o45j075k16P79O82N15k7n19p05
4181A154o16J3O99N86L25k05l04q63o17L03J028Q7M45k89m26o90m54O11O26K34J49k87l91
3965A118o41m6O68K29K87Q3l66n50m50R6N82N56Ol8m90m66j31L99L49K25J46k03l76m96M3
3730E34L64K41K96mk38m78l77N0N65K90Q2Ql65l45l06M01J15N27K1p2m91l06J9J67M52M3R0
3476A283k63k69k47OL88K34J91k26p8m11p3j07O10K05m2P7o11r8r6K18L30R4K21l18m78J22
3232F62l5Q3L49L23l04j29m62j41L77J76M29j74j26j90k84qQ3M00J08L7k99j89k26J80K60
2997I00j8L30j72nk95m13L72K56J27J91l69o6k22r0J82L79l9J33l26j51M5j21J51K66K63k58
2753A050l27L5k51J57L38J90j31l2j14k75Q8j00N43k29K37q9m03m8J43R8J59J34j27J8k83
$$ plain form
2519 781 577 809 989 1119 1127 951 964 714 743 777 988 1187 1244 1049 724 673 792 1030 1064 1250 1096 1016 768 755 755 1030 1358
2265 1358 1247 1052 875 722 799 873 1284 1412 1174 1096 903 1102 574 870 1209 1281 1300 949 902 933 984 981 1271 1356 1300 971 1003
2011 1003 769 985 1156 1458 1410 1295 902 832 988 1115 1305 1319 1531 1238 1008 927 1074 1104 1355 1653 1308 1056 1782 613
1786 613 2585 1365 1722 1465 1537 1290 1075 1112 1368 1428 1702 1685 1480 1296 1191 1403 1383 1686 1839 1675 1343 1329 1289 1363 1647
1551 1647 1930 1823 1780 1565 1276 1429 1698 1923 2000 2227 1913 1738 1564 995 1718 2122 2198 2102 1873 1816 1468 1899 2218 2481 2417
1317 2417 2248 2077 1956 1892 2186 2537 2758 2690 2480 2182 2137 2386 2565 2949 3129 2942 2803 2534 2479 2815 3123 3730 3693 3354 3079
1082 3079 2993 3080 3483 4119 4299 4452 4111 3718 3649 4146 4439 5439 5597 5541 5242 4807 4891 5538 6703 7491 8106 7933 7230 6818
856 6818 7254 9126 11024 13275 14169 13989 12277 11583 13778 22457 33621 49263 67158 95459 195672 1571751
$$ packed form
2519G81k04K32J80J30Qj76J3k50K9L4K11J99N7j95l25n1J19K38L4J86j54q0k48j3%K75L28
2265A358j11j95j77j53P7P4M11J28k38p8j93J99n28K96L39P2J9l51m7L1N1lK90Q5n6l29L2
2011A003k34K16J71L02m8j15l93p0J56J27J90J4K12k93k30q1J47L0K51K98l45k52P26j169
1786F13J972j220L57k57P2k47k15L7K56O0K74j7k05j84j05K12k0L03J53j64l32j4m0P4K84
1551A647K83j07m3k15k89J53K69K25P7K27l14j75j74n69P23M04P6r6k29n7l48M31L19K63o4
1317B417j69j71j21o4K94L51K21o8k10k98m5K49J79L84J80j87j39k69n5L36L08O07l7l39k75
1082C079q6Q7M03O36J80J53l41l93o9M97K93J000J58n6k99m35Q4O47J165P88O15j73p03m12
856F818M36J872J898K251Q94j80j712o94K195Q679J1164J5642J7895K8301J00213J376079
$$ plain form
706 1571751 1231112 59991 11680 30287 35150 33337 27331 20829 16116 11233 10002 9144 12261 13249 9313 9579
556 9579 7995 6349 5779 6849 7111 7265 6894 5925 4952 4382 4350 5074 5197 5399 5002 4201 3438 3185 3766 3959 4506 4238 3907
340 3907 3121 2840 2593 2997 3566 3643 3599 3060 2582 2111 2171 2842 3170 3314 3001 2495 1934 1811 2005 2669 2917 3017 2578 2062
115 2062 1461 1554 2168 2485 2712 2833 2195 1580 1090 1458 1903 2456 2598 2552 1884 1245 904 1475 2187 2563 2484 2174 1711 813
-111 813 785 1359 2294 2454 2470 2237 1259 466 885 1774 2299 2715 2618 1906 1233 48 1017 1938 2966 2875 2784 2441 1137 796
-336 796 1643 2560 3309 3526 3453 2916
-392 2916
$$ packed form
706A571751l40639j171121m8311J8607M863j813o006o502m713m883j231q58L117R88l936K66
556I579j584j646n70J070K62J54l71r69r73n70l2P24J23K02l97q01p63k53N81J93N47k68l31
340C907p86k81k47M04N69P7m4n39m78m71O0O71L28J44l13n06n61j23J94O64K48J00m39n16
115B062o01R3O14L17K27J21o38o15m90L68M45N53J42m6o68o39l41N71P12L76p9l10m63q98
-111H13k8N74R35J60J6k33r78p93M19Q89N25M16r7p12o73j185R69R21J028r1r1l43j304l41
-336G96Q47R17P49K17p3n37
-392B916
##PAGE=	F1=-3049.78
##FIRST=	4405.895418600002813,	4405.895418600002813,	0
##DATA TABLE=	(F2++(Y..Y)), PROFILE
$$ plain form
4406 1641 1111 1089 1653 2255 2541 2684 2250 1847 1132 662 1118 1764 2039 2085 1856 1316 445 385 957 1447 1899 1818 1387 874
4181 874 456 439 1009 1446 1665 1523 1234 564 84 316 1230 1224 1568 1327 968 484 122 604 1115 1276 1379 1129 849 388
3955 388 366 901 1015 1238 1298 1055 567 255 335 799 1233 1188 1172 793 362 345 663 995 1058 1205 1067 749 354 433 720 871
3711 871 1103 1065 922 536 224 270 752 969 999 1036 711 456 213 588 582 1093 1050 1004 659 381 460 482 904 888 1010 750 547
3458 547 347 390 692 873 1045 758 800 469 416 286 812 982 916 1052 434 420 333 519 803 850 1077 753 348 551 510 494
3213 494 878 1081 790 708 352 252 539 761 1113 831 792 664 401 436 449 755 884 931 670 458 349 504 658 640 939
2979 939 822 850 594 188 576 753 859 953 687 608 520 406 543 874 809 897 633 493 580 469 598 790 1043 766 512 584
2734 584 391 493 788 938 785 789 737 490 589 446 936 665 919 849 499 488 639 665 818 885 785 844 597 433 609 817
$$ packed form
4406A641n30k2N64O02K86J43m34m03p15m70M56O46K75M6k29n40q71o0N72M90M52q1m31n13
4181H74m18j7N70M37K19j42k89o70m80K32R14oL44k41l59m84l62M82N11J61J03k50k80m61
3955C88k2N35J14K23O0k43m88l12Q0M64M34m5j6l79m31j7L18L32O3J47j38l18l95P9K87J51
3711H71K32l8j43l86l12M6M82K17L0L7l25k55k43L75oN11m3m6l45k78P9K2M22j6J22k60k03
3458E47k00M3L02J81J72k87M2l31n3j30N26J70o6J36o18j4q7J86K84M7K27l24m05K03m1j6
3213D94L84K03k91q2l56j00K87K22L52k82l9j28k63L5J3L06J29M7k61k12j09J55J54j8K99
2979I39j17K8k56m06L88J77J06R4k66p9q8j14J37L31o5Q8k64j40Q7j11J29J92K53k77k54P2
2734E84j93J02K95J50j53Mn2k47R9j43M90k71K54p0l50j1J51K6J53O7j00N9k47j64J76K08
$$ plain form
2490 817 838 843 722 713 555 567 591 768 928 1002 779 490 520 625 803 801 968 829 748 611 608 583 779 1071 985 788 647 528 615
2218 615 649 1018 1124 866 838 720 970 416 652 932 992 992 702 667 738 787 727 950 1073 1009 689 839 549 773 869 1152 1069
1964 1069 1005 661 588 775 820 1054 945 1218 981 728 725 858 828 1028 1353 1060 888 1531 2065 2330 1995 1194 1056 1121 960
1730 960 777 839 1048 1070 1299 1289 1119 995 895 1109 1024 1288 1405 1236 985 994 981 1037 1228 1485 1369 1335 1196 937 1092 1320
1486 1320 1430 1545 1737 1492 1340 1331 608 1270 1575 1649 1596 1402 1391 1061 1472 1704 1887 1827 1700 1568 1505 1378 1679 1916 2084
1251 2084 2081 1843 1647 1602 1870 1902 2282 2346 2208 2147 1909 1863 2127 2388 2852 2825 2498 2313 2267 2318 2658 3141 3289 3386 3078 2793 2753
997 2753 3200 3352 4176 4261 4203 3907 3639 3684 4264 5123 5667 6214 6028 5391 5170 5501 7018 8354 10110 10825 10568 9008 8751
781 8751 10599 17228 25747 37572 50682 72211 146714 1201468 948479 47565 8387 23196 27693 26732 21800
$$ packed form
2490H17K1Nj21rj58J2K4J77J60P4k23k89L0J05J78kJ67j39q1j37lk5J96K92q6j97j41j19Q7
2218F15L4L69J06k58k8j18K50n54K36K80O0%k90l5P1M9o0K23J23o4l20J50k90K24R6K83q3
1964A069o4l44p3J87M5K34j09K73k37k53lJ33l0K00L25k93j72O43N34K65l35q01j38O5j61
1730I60j83O2K09K2K29j0j70j24j00K14q5K64J17j69k51Rj3N6J91K57j16l4j39k59J55K28
1486A320J10J15J92k45j52rp23O62L05P4n3j94j1l30M11K32J83o0j27j32o3j27L01K37J68
1251B084lk38j96m5K68L2L80O4j38o1k38m6K64K61M64k7l27j85m6N1L40M83J48R7l08k85m0
997B753M47J52Q24Q5n8k96k68M5N80Q59N44N47j86o37k21L31J517J336J756P15k57j560k57
781H751J848O629Q519J1825J3110K1529P4503J054754k52989r00914l9178J4809M497r61m932
$$ plain form
640 21800 15453 12621 8602 7164 8546 9605 7244 9313 7168 5871 4697 4151 5472 5340 5526 5302 4457 3696 3293
462 3293 3272 3891 3944 4132 3777 3151 2580 2394 2904 3005 3495 3171 2972 2314 2112 1978 2266 2719 2770 2751 2285 1948 1582 1597 2212
227 2212 2428 2482 2293 1874 1456 1389 1537 2098 2196 2329 1933 1549 1071 1201 1668 1934 2066 2200 1628 1195 817 1132 1402 1935
2 1935 1944 1966 1429 886 700 1121 1712 1996 1858 1637 1285 579 561 1048 1764 1861 1904 1719 932 324 707 1428 1725 2112 2044 1366
-242 1366 987 136 757 1500 2361 2189 2124 1902 844 653 1361 1986 2604 2720 2645 2240
-392 2240
$$ packed form
640B1800o347k832m019j438J382J059k361K069k145j297j174n46J321j32J86k24q45p61m03
462C293k1O19N3J88l55o26n71j86N10J01M90l24j99o58k02j34K88M53N1j9m66l37l66J5O15
227B212K16N4j89m19m18o7J48N61R8J33l96l84m78J30M67K66J32J34n72m33l78L15K70N33
2A935RK2n37n43j86M21N91K84j38k21l52p06j8M87P16R7M3j85p87o08L83P21K97L87o8o78
-242A366l79q51O21P43Q61j72o5k22j058j91P08O25O18J16p5m05
-392B240
##PAGE=	F1=-3068.56
##FIRST=	4405.895418600002813,	4405.895418600002813,	0
##DATA TABLE=	(F2++(Y..Y)), PROFILE
$$ plain form
4406 1088 787 809 1160 1524 1693 1829 1461 1249 793 518 778 1243 1355 1362 1279 865 236 330 663 960 1321 1182 871 566 364
4171 364 312 729 994 1108 1038 775 324 17 152 903 823 1042 855 576 337 78 382 775 861 905 722 566 280 286 661 681
3927 681 814 842 742 336 177 237 555 853 764 770 510 149 266 462 748 663 808 722 492 195 308 504 596 722 668 617 341
3673 341 124 147 517 663 637 704 438 281 111 423 324 784 683 655 486 243 388 260 621 561 691 462 324 183 260 452
3429 452 593 723 397 556 322 277 153 572 672 596 784 195 267 187 327 544 569 758 506 138 413 358 267 672 733 481
3185 481 451 231 171 338 633 827 489 529 465 231 336 271 458 592 648 449 224 237 341 401 389 640 582 615 444 79 426
2932 426 522 615 591 441 368 400 292 364 620 551 592 382 273 374 308 394 509 730 460 296 390 267 290 556 647 474 522 545
2669 545 331 431 260 670 378 625 568 298 318 476 448 559 565 503 591 387 274 391 616 530 529 473 437 369 361 382 526 622 744
$$ packed form
4406A088l01K2L51L64J69J36l68k12m56k75K60M65J12Pq3m14o29R4L33K97L61j39l11l05k02
4171C64n2M17K65J14p0k63m51l07J35P51q0K19j87k79k39k59L04L93Q6M4j83j56k86OL75K0
3927F81J33K8j00m06j59O0L18K98q9Ok60l61J17J96K86q5J45q6k30k97J13J96R2J26n4n1k76
3673C41k17K3L70J46k6O7k66j57j70L12r9M60j01k8j69k43J45j28L61o0J30k29j38j41P7J92
3429D52J41J30l26J59k34m5j24M19J00p6J88n89P2q0J40K17K5J89k52l68K75n5r1M05O1k52
3185D81l0k20o0J67K95J94l38M0o4k34J05o5J87J34N6j99k25J3J04O0j2K51n8L3j71l65L47
2932D26R6R3k4j50p3L2j08P2K56o9M1k10j09J01o6Q6J15K21k70j64R4j23K3K66R1j73M8K3
2669E45k14J00j71M10k92K47n7k70K0J58k8J11Oo2Q8k04j13J17K25q6jn6l6o8qK1J44R6J22
$$ plain form
2396 744 463 242 354 428 543 500 648 543 459 442 428 399 507 739 683 508 390 317 416 399 701 800 536 554 507 809 389 444
2134 444 623 671 650 437 409 511 558 450 596 749 697 379 642 329 533 555 804 694 688 411 329 540 486 763 561 848 702
1880 702 475 471 624 547 677 1006 799 853 1733 3357 2829 2435 578 628 636 597 449 532 694 663 848 839 718 656 569 785 626
1626 626 842 918 761 594 620 634 678 774 982 870 848 791 566 721 895 894 1025 1170 1024 900 1069 216 781 970 1042 1037 884
1373 884 910 635 981 1132 1217 1175 1098 1004 1003 824 1099 1243 1327 1404 1152 1048 1018 1271 1182 1527 1486 1401 1422 1228 1178 1366 1581 1854
1110 1854 1862 1568 1469 1455 1481 1729 2062 2150 2207 1949 1769 1765 2132 2151 2750 2779 2732 2433 2338 2371 2813 3379 3644 4064 3939 3365 3337 3579
847 3579 4649 5381 6580 7079 6778 5598 5602 7082 11322 16868 24583 32508 46341 92507 785197 628166 32723
687 32723 5608 15319 19174 19201 16964 10137 8874 6043 3866 8720 9140 5526 9839 4484 3432 2894 2581 3617
$$ packed form
2396G44k81k21J12P4J15m3J48j05q4j7j4k9J08K32n6j75j18p3R9j7L02R9k64J8m7L02m20N5
2134D44J79M8k1k13k8J02M7j08J46J53n2l18K63l13K04K2K49j10ok77q2K11n4K77k02K87j46
1880G02k27mJ53p7J30L29k07N4Q80J624n28l94j857N0Ql9j48Q3J62l1J85rj21o2q7K16j59
1626F26K16P6j57j67K6J4M4R6K08j12k2n7k25J55J74jJ31J45j46j24J69q53N65J89P2nj53
1373H84K6k75L46J51Q5m2p7r4jj79K75J44Q4P7k52j04l0K53q9L45m1q5K1j94n0J88K15K73
1110A854Qk94r9j4K6K48L33Q8N7k58j80mL67J9N99K9m7k99r5L3M42N66K65M20j25n74k8K42
847C579J070P32J199M99l01j180MJ480M240N546P715P925J3833M6166O92690j57031n95443
687C2723k7115R711L855K7k237o827j263k831k177M854M20l614M313n355j052n38l13J036
$$ plain form
518 3617 3474 3600 3499 2812 2305 2091 2091 2570 2556 2716 2405 2003 1630 1528 1930 1947 2355 2001 1926 1434 1315 1298 1462 1769 1804 1805
274 1805 1427 1241 1006 969 1499 1595 1565 1504 1192 921 921 1032 1430 1403 1554 1223 986 647 828 1101 1314 1345 1485 1009 765 523
30 523 784 854 1339 1241 1301 930 502 473 725 1165 1368 1169 1039 812 343 327 706 1162 1217 1267 1133 581 186 504 1019 1095 1428
-223 1428 1399 794 692 200 473 1014 1655 1430 1387 1283 538 479 1015 1338 1803 1812 1748 1477
-392 1477
$$ packed form
518C617j43J26j01o87n07k14%M79j4J60l11m02l73j02M02J7M08l54p5m92j19j7J64L07L5J
274A805l78j86k35l7N30R6l0o1l12k71%J11L98k7J51l31k37l39J81K73K13L1J40m76k44k42
30E23K61P0M85r8O0l71m28k9K52M40K03j99j30k27m69j6L79M56N5N0j34n52l95L18N15P6L33
-223A428k9o05j02m92K73N41O41k25m3j04p45n9N36L23M65Ro4k71
-392A477
##PAGE=	F1=-3087.34
##FIRST=	4405.895418600002813,	4405.895418600002813,	0
##DATA TABLE=	(F2++(Y..Y)), PROFILE
$$ plain form
4406 565 489 524 687 829 906 1030 725 681 472 376 456 745 718 686 736 450 70 269 380 516 781 584 403 299 280 196 460
4152 460 561 589 594 359 106 96 73 583 461 550 423 219 223 50 165 452 482 460 362 323 174 210 426 388 425 412 454 132 128 169
3871 169 322 496 378 401 248 36 231 287 504 305 445 388 271 48 190 288 368 363 308 337 172 78 45 292 379 310 398 214
3608 214 137 39 255 115 488 348 326 335 152 319 80 352 271 386 208 127 85 148 221 343 421 86 328 193 163 107 368 370
3345 370 300 520 54 137 87 153 295 325 441 340 114 274 200 82 477 424 223 228 155 115 152 537 554 192 292 277 75 264
3082 264 158 193 311 377 264 136 162 182 203 178 374 369 376 321 80 281 305 412 251 214 166 279 215 218 384 320 341 151 87 168
2800 168 178 207 256 430 187 125 220 167 104 342 378 187 285 370 203 286 125 417 135 348 302 122 159 324 297 308 272 249 353
2528 353 189 141 193 423 259 244 248 182 197 163 194 305 322 521 180 27 205 237 307 216 352 297 198 298 247 244 271 418 399 267
$$ packed form
4406E65p6L5J63J42P7J24l05m4k09r6Q0K89k7l2N0k86l80J99J11J36K65j97j81j04j9q4K64
4152D60J01K8Nk35k53j0k3N10j22Q9j27k04Mj73J15K87L0k2r8l9j49L6K16l8L7j3M2l22mM1
3871A69J53J74j18K3j53k12J95N6K17j99J40n7j17k23J42R8Q0nn5K9j65r4l3K47Q7o9Q8j84
3608B14p7r8K16j40L73j40k2Rj83J67k39K72q1J15j78q1m2O3P3J22P8l35K42j35l0n6K61K
3345C70p0K20m66Q3n0O6J42L0J16j01k26J60p4j18L95n3k01Np3m0L7L85J7l62J00j5k02J89
3082B64j06L5J18O6j13j28K6K0K1k5J96nPn5k41K01K4J07j61l7m8J13o4LJ66o4K1j90o4Q1
2800A68J0K9M9J74k43o2R5n3o3K38L6j91R8Q5j67Q3j61K92k82K13m6j80L7J65k7J1l6k3J04
2528C53j64m8N2K30j64j5Mo6J5l4L1J11J7J99l41j53J78L2P0r1J36n5r9J00n1lK7J47j9j32
$$ plain form
2246 267 154 126 242 195 392 497 245 312 306 665 455 296 339 379 341 201 181 293 338 204 272 439 421 98 446 194 309
1993 309 268 478 358 406 201 138 330 174 485 270 490 458 313 209 418 298 356 654 531 805 2077 3853 3344 2405
1767 2405 134 301 192 282 162 251 378 286 440 424 361 353 280 501 267 442 473 348 248 285 315 359 378 515 424 410 430 243
1504 243 388 505 422 536 631 600 500 844 215 344 420 493 528 427 463 289 521 610 592 584 556 490 558 345 559 644 628 788 537
1232 537 506 497 709 544 830 711 671 765 640 559 678 858 923 986 745 706 718 733 873 1082 1102 1137 940 846 875 1157 1070 1430 1427
960 1427 1404 1105 1151 1192 1475 1800 1797 2064 2050 1549 1665 1854 2486 2659 3347 3638 3322 2656 2756 3822 5942 8649 12671 15967
734 15967 22645 43025 400233 329959 18273 4095 8347 11331 12118 14811 7517 6166 4280 857 8609 10496
584 10496 10000 9615 2162 1238 1372 1391 1905 1858 1847 1819 1301 1061 1034 1048 1370 1301 1416 1150 976 776 773 1032 995 1296 947 977
$$ packed form
2246B67j13k8J16m7J97J05k52O7oL59k10j59M3M0l8j40k0J12M5j34O8J67j8l23L48k52J15
1993C09m1K10j20M8k05o3J92j56L11k15K20l2j45j04K09j20N8K98j23K74J272J776n09r39
1767B405k271J67j09R0j20Q9J27r2J54j6o3qp3K21k34J75L1j25j00L7L0M4J9J37r1j4K0j87
1504B43J45J17q3J14R5l1j00L44o29J29P6P3L5j01L6j74K32Q9j8qk8o6O8k13K14Q5j6J60k51
1232E37l1rK12j65K86j19m0R4j25q1J19J80O5O3k41l9J2J5J40K09K0L5j97r4K9K82q7L60l
960A427k3k99M6M1K83L25lK67j4n01J16J89O32J73O88K91l16o66J00J066K120K707M022L296
734A5967O678K0380L57208p0274l11686j4178M252K984P87K693p294j351j886l423P752J887
584A0496m96l85p453r24J34J9N14m7j1k8n18k40k7J4L22o9J15k66j74k00lK59l7L01l49L0
$$ plain form
340 977 646 605 687 746 896 922 946 645 596 511 411 833 837 731 781 580 443 499 595 796 688 834 580 485 274 506 573 743
77 743 681 818 459 370 271 503 366 777 623 678 486 167 282 375 643 802 541 491 378 178 177 394 599 646 681 581 271
-176 271 114 314 627 525 783 801 296 407 228 222 568 974 732 704 697 271 297 667 727 1054 961 915 764
$$ packed form
340I77l31m1Q2N9J50K6K4l01m9q5j00M22Mj06N0k01j37N6R6K01j08J46k54r5k11K32O7J70
77G43o2J37l59q9r9K32j37M11j54N5j92l19J15R3K68J59k61n0j13k00jK17K05M7L5j00l10
-176B71j57K00L13j02K58J8n05J11j79oL46M06k42k8pm26K6L70O0L27r3m6j51
-392G64
##PAGE=	F1=-3106.12
##FIRST=	4405.895418600002813,	4405.895418600002813,	0
##DATA TABLE=	(F2++(Y..Y)), PROFILE
$$ plain form
4406 138 262 260 295 269 296 393 149 223 209 245 191 342 237 154 304 147 126 203 150 181 378 110 48 155 211 113 239 218 186 264
4124 264 47 63 149 150 311 189 167 151 110 156 41 63 192 203 122 102 152 95 153 233 182 151 81 240 27 126 136 133 212 109 117 45
3824 45 143 217 169 304 44 165 116 139 63 115 104 217 80 37 129 74 89 27 108 154 120 174 125 87 48 115 76 249 97 71 243
3533 243 152 248 66 143 81 141 30 63 129 73 44 159 195 165 147 100 136 162 252 122 91 301 160 58 94 27 101 157 182 308 249
3242 249 155 61 89 319 266 144 84 132 82 33 478 408 62 134 130 44 216 149 8 84 163 173 249 143 84 173 60 210 227 182 240
2950 240 112 173 136 303 44 51 69 177 187 158 244 153 232 24 50 26 96 67 68 212 24 75 136 124 125 175 184 36 147 237 140 176
2650 176 113 214 49 132 96 34 40 210 258 106 72 59 174 43 79 50 263 96 49 88 19 84 18 64 136 72 365 168 125 98
2368 98 85 164 27 149 148 48 203 96 145 132 156 189 105 78 41 121 179 154 261 38 218 171 579 529 212 123 175 113 74 53 124
$$ packed form
4406A38J24kL5k6K7R7k44P4j4L6n4J51j05q3J50j57k1P7n3L1J97k68o2J07N6r8J26k1l2P8
4124B64k17J6Q6JJ61j22k2j6m1M6j15K2J29J1q1k0N0n7N8Q0n1l1p0J59k13R9J0lP9j03Qp2
3824D5R8P4m8J35k60J21m9K3p6N2j1J13j37m3R2n5J5o2Q1M6l4N4m9l8l9O7l9J73j52k6J72
3533B43r1R6j82P7o2O0j11L3O6n6k9J15L6l0j8m7L6K6R0j30l1K10j41j02L6o7P4N6K5J26n9
3242B49r4r4K8K30n3j22o0M8n0m9M45p0l46P2mq6J72o7j41P6P9J0P6j06n9Q9j13J50J7m5N8
2950B40j28O1l7J67k59PJ8J08J0k9Q6r1P9k08K6k4P0k9JJ44j88N1O1j2JN0Rj48J11R0r7L6
2650A76o3J01j65Q3l6o2OJ70M8j52l4j3J15j31L6k9K13j67m7L9o9O5o6M6P2o4K93j97m3k7
2368I8j3P9j37J22jj00J55j07M9j3K4L3q4k7l7Q0N8k5J07k23J80m7M08n0l17q9N2o2l9k1P1
$$ plain form
2077 124 170 57 21 184 222 131 278 213 136 56 223 131 227 84 180 208 79 275 225 220 326 260 127 282 96 120 329 292 663
1805 663 2218 3649 3513 2041 460 91 128 78 29 46 153 15 149 132 135 146 79 304 36 185 147 155 52 59 84 133 143 155
1542 155 118 95 180 113 146 215 125 158 207 288 213 670 444 56 14 89 169 162 134 146 171 226 138 157 161 109 270 119 159 211 101 332
1241 332 108 158 131 297 139 303 179 145 284 316 150 175 361 220 336 237 145 212 241 258 348 350 347 270 238 228 472 310 442
969 442 425 459 238 298 327 517 678 426 574 682 313 472 623 968 665 929 1090 791 677 865 1348 2124 2432 3689 3617
734 3617 4876 5868 107644 102048 6634 3555 4144 5876 6515 15094 8691 5994 3721 1790 6207 8476 9720 6757
565 6757 736 303 690 713 1573 701 554 554 197 270 409 359 519 419 442 274 255 180 328 384 357 488 203 342 79 168 273
312 273 281 246 265 326 96 123 238 104 316 293 120 249 164 169 200 307 302 197 280 104 174 79 283 206 311 178 307 130 83 113
$$ packed form
2077A24M6j13l6J63L8r1J47o5p7q0J67r2R6j43R6K8j29J96n0nJ06o6j33J55j86K4K09l7L71
1805F63J555J431j36j472j581l69L7n0m9J7J07j38J34j7LJ1o7K25k68J49l8Qj03PK5M9J0J2
1542A55l7k3Q5o7L3O9r0L3M9Q1p5M57k26l88m2P5Q0pk8J2K5N5q8J9Mn2J61j51M0N2j10K31
1241C32k24N0k7J66j58J64j24l4J39L2j66K5J86j41J16r9r2O7K9J7R0Klp7l2j0K44j62J32
969D42j7L4k21O0K9J90J61k52J48J08l69J59J51L45l03K64J61k99j14J88M83P76L08J257p2
734C617J259R92J01776n596r5414l079N89J732O39Q579o403k697k273j931M417K269J244k963
565F757o021m33L87K3Q60q72j47%l57P3J39n0J60j00K3j68j9p5J48N6k7J31k85J39k63Q9J05
312B73Ql5J9O1k30K7J15j34K12k3j73J29q5NL1J07nj05Q3j76P0r5K04p7J05j33J29j77m7L0
$$ plain form
30 113 360 130 336 220 196 191 68 180 181 225 389 79 88 81 142 193 152 158 263 252 148 60 114 170 315 101 271 342 109 184 214
-261 214 85 222 415 201 172 235 80 124 369 236 471 286 258 204
$$ packed form
30A13K47k30K06j16k4nj23J12JM4J64l10RpO1N1m1OJ05j1j04q8N4N6J45k14J70P1k33P5L0
-261B14j29J37J93k14k9O3j55M4K45j33K35j85k8n4
-392B04
##PAGE=	F1=-3124.9
##FIRST=	4405.895418600002813,	4405.895418600002813,	0
##DATA TABLE=	(F2++(Y..Y)), PROFILE
$$ plain form
4406 162 143 36 22 149 161 35 241 131 15 126 47 99 173 211 37 117 231 126 41 88 219 199 166 163 164 103 84 100 105 123 145
4115 145 180 159 211 110 26 115 229 253 107 52 166 73 116 158 37 58 70 124 101 87 155 152 133 95 145 112 5 24 142 60 89 183
3814 183 187 121 170 129 18 81 115 120 94 41 124 104 122 56 79 93 49 20 5 176 107 145 117 61 33 133 95 51 81 215 167 174 104 72
3495 72 106 17 89 132 160 44 89 50 119 291 30 65 171 215 232 45 115 149 212 56 108 37 75 84 83 364 316 69 40 145 211 295
3195 295 215 60 134 66 114 440 418 163 114 39 101 178 158 112 73 34 174 326 139 119 228 82 193 173 106 190 105 123 35 277
2913 277 194 82 100 106 181 185 246 101 256 123 104 131 57 25 37 165 137 112 147 130 239 84 103 163 145 170 129 112 137 77 125 67
2612 67 46 95 24 146 265 47 125 55 101 68 84 47 149 114 125 89 147 77 94 37 49 102 280 307 199 54 18 159 159 137 123 149
2312 149 158 31 103 118 23 129 44 178 117 63 272 115 122 92 278 165 552 596 155 50 118 32 157 96 79 105 106 137 27 111
$$ packed form
4406A62j9j07j4J27J2j26K06j10j16J11p9N2P4L8j74Q0J14j05q5M7J31k0l3lJo1j9J6NJ8K2
4115A45L5k1N2j01q4Q9J14K4j46n5J14r3M3M2j21K1J2N4k3j4O8lj9l8N0l3j07J9J18q2K9R4
3814A83Mo6M9m1j11O3L4Nk6n3Q3k0J8o6K3J4m4k9j5J71o9L8k8n6k8J00l8m4L0J34m8Pp0l2
3495G2L4q9P2M3K8j16M5l9O9J72k61L5J06M4J7j87P0L4O3j56N2p1L8RjK81m8k47k9J05O6Q4
3195B95q0j55P4o8M8L26k2k55m9p5O2P7k0m6l9l9J40J52j87k0J09j46J11k0o7Q4q5J8q8K42
2913B77q3j12J8OP5MO1j45J55j33j9K7p4l2J2J28k8k5L5j7J09j55J9O0j8K5m1j7K5o0M8n8
2612F7k1M9p1J22J19k18P8p0M6l3J6l7J02l5J1l6N8p0J7n7J2N3J78K7j08j45l6J41%k2j4K6
2312A49Rj27P2J5r5J06q5J34o1n4K09j57Pl0J86j13L87M4m41j05O8q6J25o1j7K6JL1j10Q4
$$ plain form
2030 111 263 153 265 29 92 116 134 210 89 272 228 236 220 309 188 363 256 332 229 78 184 242 417 933 3640 6089
1786 6089 6145 3453 987 194 269 55 117 68 28 153 44 108 129 38 15 183 134 138 26 221 124 75 84 7 140 65 94 90 69 180
1504 180 36 56 153 74 70 119 86 529 551 164 225 129 148 187 95 156 47 72 230 115 72 98 179 212 106 65 209 93 169 196 64
1213 64 173 219 15 245 206 64 297 208 98 232 251 93 308 160 198 230 230 79 297 141 322 326 124 276 263 261 229 303 493
941 493 307 168 314 399 420 466 426 536 420 331 646 704 617 691 905 709 921 594 1315 1616 2070 3732 5941 15719 76244
706 76244 50614 2279 2964 3763 4211 2906 15593 10552 7645 4147 3269 336 4054 3996 2019 439 647 705 604
528 604 1829 95 314 347 465 354 364 219 292 340 193 411 202 153 286 214 293 174 307 339 231 253 154 242 174 190 158 296
265 296 152 209 234 21 166 280 141 163 214 104 176 95 238 74 158 203 151 165 209 68 137 122 222 108 58 310 282 78 209
$$ packed form
2030A11J52j10J12k36O3K4J8P6j21J83m4Qj6Q9j21J75j07P6j03j51J06N8J75N16K707K449
1786F089N6k692k466p93P5k14O2m9m0J25j09O4K1r1k3J68m9Mj12J95r7m9Rp7J33p5K9mk1J11
1504A80j44K0R7p9mM9l3M43K2l87O1r6J9L9r2O1j09K5J58j15m3K6Q1L3j06m1J44j16P6K7j32
1213F4J09M6k04K30l9j42K33q9j10J34J9j58K15j48L8L2%j51K18j56J81Mk02J52j3kl2P4J90
941D93j86j39J46Q5K1M6m0J10j16q9L15N8q7P4K14j96K12l27P21L01M54J662K209R778O0525
706G6244k5630m8335O85P99M48j305J2687n041k907l498q78k933L718n8j977j580K08N8j01
528F04J225j734K19L3J18j11J0j45P3M8j47K18k09m9J33p2P9j19J33L2j08K2r9Q8o8J6l2J38
265B96j44N7K5k13J45J14j39K2N1j10P2q1J43j64Q4M5n2J4M4j41O9j5J00j14n0K52k8k04J31
$$ plain form
-7 209 121 151 169 162 201 54 177 226 199 172 146 217 25 128 195 128 156 98 88 92 142 158 83 128 281 74 184 142 51 79 172 178 84 88
-327 88 35 172 121 166 170 175 165
$$ packed form
-7B09q8L0J8pL9j47J23M9k7k7k6P1j92J03O7o7K8n8j0MN0J6p5M5J53k07J10m2r1K8R3Or4M
-327H8n3J37n1M5MNj0
-392A65
##PAGE=	F1=-3143.68
##FIRST=	4405.895418600002813,	4405.895418600002813,	0
##DATA TABLE=	(F2++(Y..Y)), PROFILE
$$ plain form
4406 354 159 187 193 376 348 273 432 323 139 67 172 180 305 394 158 181 319 33 142 184 251 347 251 178 159 163 14 207 226 152
4124 152 220 257 127 236 57 50 232 327 295 46 88 229 162 161 271 63 54 92 129 28 72 234 246 102 106 170 71 73 81 210 136 163
3824 163 161 135 130 103 185 110 175 121 121 87 127 49 191 180 81 97 81 35 94 80 227 137 147 139 55 57 143 65 108 133 217 143 109 81 124 145
3486 145 88 124 159 133 53 142 11 149 321 46 94 186 253 239 131 177 65 195 84 78 44 133 66 144 431 305 25 104 143 150
3204 150 340 245 56 147 71 159 403 444 200 150 7 104 153 126 147 147 47 188 329 116 157 242 104 218 156 145 156 63 111 21
2922 21 263 264 122 101 69 165 238 289 137 283 148 109 186 68 56 70 210 176 134 156 147 304 94 90 210 161 179 115 82 120 5
2631 5 136 125 86 124 35 130 249 119 178 92 117 101 77 65 77 135 181 148 199 90 129 43 58 197 240 369 203 53 54 181 227 185
2331 185 125 205 150 79 75 119 119 168 28 226 148 60 324 187 83 137 339 219 540 673 132 104 134 69 230 107 128 117 134 209
$$ packed form
4406C54j95K8OJ83k8p5J59j09j84p2J05QJ25Q9k36K3J38k86J09M2O7R6r6p3j9Mj49J93J9p4
4124A52O8L7j30J09j79pJ82R5l2k49M2J41o7jJ10k08rL8L7j01M4J62J2j44MO4r9KQJ29p4K7
3824A63kk6nk7Q2p5O5n4%l4M0p8J42j1r9J6j6m6N9j4J47r0J0qq4KQ6p8M3K5Q4p4l4k8M3K1
3486A45n7L6L5k6q0Q9j31J38J72k75M8R2O7j4j08M6j12J30j11ol4Q9o7P8K87j26k80P9L9P
3204A50J90r5j89R1p6Q8K44M1k44n0j43R7M9k7K1%j00J41J41k13M1Q5j38J14o2j1J1r3M8r0
2922B1K42Jj42k1l2R6P3N1j52J46j35l9P7j18j2J4J40l4m2K2rJ57k10mJ20m9J8o4l3L8j15
2631EJ31j1l9L8q9R5J19j30N9q6K5j6k4j2J2N8M6l3N1j09L9q6J5J39M3J29j66j50JJ27M6m2
2331A85o0Q0n5p1mM4%M9j40J98p8q8K64j37j04N4K02j20L21J33n41k8L0o5J61j23K1j1J7P5
$$ plain form
2049 209 121 71 315 71 277 41 144 173 190 258 96 313 296 313 294 350 299 481 261 522 234 235 351 548 871 1984 7622
1795 7622 13076 13034 7548 1918 704 351 232 211 139 163 207 115 108 150 68 81 114 163 116 53 221 123 59 146 97 126 156 91 113
1523 113 98 170 86 21 161 150 160 88 45 471 534 201 291 166 199 195 142 95 87 87 336 161 109 142 124 199 148 108 295 39 211 210
1223 210 60 196 247 102 310 281 75 270 234 147 236 386 168 341 219 218 243 313 218 402 244 385 385 179 264 329 425 377 400
950 400 582 401 294 362 471 644 707 621 605 539 412 739 1027 1049 1075 1320 851 1037 954 1629 2801 3816 5902 9210 22231
716 22231 135103 97113 5306 1932 3880 4371 1370 14828 11320 9441 5248 4307 11940 22304 22685 14388 2208
556 2208 1039 740 908 1161 326 515 529 587 296 233 151 327 446 343 518 239 124 231 241 323 296 406 415 271 254 101
312 101 257 281 320 198 387 191 137 239 154 209 397 215 179 220 138 79 175 315 193 220 236 132 164 277 68 243 208 255 145
$$ packed form
2049B09q8n0K44k44K06k36J03K9J7O8j62K17j7J7j9N6n1J82k20K61k88JJ16J97L23J113N638
1795G622N454m2n486n630j214l53j19k1p2K4M4r2pM2q2J3L3M9m7o3J68r8o4Q7m9K9L0o5K2
1523A13j5P2q4o5J40j1J0p2m3M26O3l33R0j25L3mn3m7q%K49j75n2L3j8P5n1m0J87k56J72j
1223B10j50J36N1j45K08k9k06J95l6q7Q9J50k18J73j22jK5P0r5J84j58J41%k06Q5O5R6m8K3
950D00J82j81j07O8J09J73O3q6j6o6j27L27K88K2K6K45m69J86q3O75J172J015K086L308J3021
716B2231J12872l7990r1807l374J948M91l001J3458l508j879m193r41P633J0364L81q297j2180
556B208j169k99J68K53q35J89J4N8k91o3q2J76J19j03J75k79j15J07J0Q2k7J10Rj44j7j53
312A01J56K4L9j22J89j96n4J02q5N5J88j82l6M1q2n9R6J40j22K7J6j04L2J13k09J75l5M7j10
$$ plain form
40 145 109 244 354 120 261 239 183 156 165 218 191 113 323 311 224 144 164 113 258 229 186 295 130 15 116 136 257 249 193 321 99
-252 99 208 198 166 225 329 347 220 187 178 196 318 231 403 405 355
$$ packed form
40A45l6J35J10k34J41k2n6k7RN3k7p8K10j2q7q0K0n1J45k9m3J09j65j15J01K0J21qn6J28k22
-252I9J09j0l2N9J04J8j27l3rJ8J22q7J72Kn0
-392C55
##PAGE=	F1=-3162.46
##FIRST=	4405.895418600002813,	4405.895418600002813,	0
##DATA TABLE=	(F2++(Y..Y)), PROFILE
$$ plain form
4406 480 263 381 334 504 416 381 500 441 276 182 293 289 342 455 247 192 402 85 232 233 265 379 250 186 213 245 83 268
4143 268 257 174 225 317 74 245 161 72 262 363 245 84 139 247 239 180 306 35 131 126 175 64 64 263 253 75 82 209 40 117
3861 117 137 211 142 208 109 108 168 95 171 164 198 135 86 76 181 57 210 166 82 118 88 14 137 119 219 139 148 161 68 87 135 89 109 105
3542 105 217 88 97 24 152 139 95 120 154 63 83 148 32 159 280 77 146 162 283 227 162 197 25 141 123 13 22 152 46
3270 46 170 484 231 42 137 105 126 332 225 57 171 93 148 345 398 187 174 13 65 159 62 135 163 63 187 280 70 154
3007 154 208 118 212 128 174 145 14 101 15 231 258 120 63 57 127 297 307 172 274 114 100 184 126 69 59 225 159 158 131 164 318
2716 318 132 60 200 147 224 80 66 72 27 108 146 70 128 4 148 200 153 175 80 132 93 54 44 40 119 188 175 188 79 118 19 64 227
2406 227 214 352 162 56 49 165 236 193 104 213 163 92 38 83 155 185 8 228 141 88 324 215 77 140 358 257 504 755
$$ packed form
4406D80k17J18m7J70q8l5J19n9j65r4J11mN3J13k08n5K10l17J47JL2J14j29o4K7L2j62J85
4143B68j1q3N1R2k43J71q4q9J90J01j18j61N5J08qn9J26k71R6nM9j11%J99j0j78PJ27j69P7
3861A17K0P4o9O6r9jO0p3P6pL4o3m9j0J05j24J53m4q4L6l0p4J23j8J00q0RJ3r3J9M8m6K0m
3542A05J12j29Rp3J28j3m4K5L4r1K0O5j16J27J21k03O9J6J21n6o5L5j72J16j8j10RJ30j06
3270D6J24L14k53j89R5l2K1K06j07j68J14p8N5J97N3k11j3j61N2R4r7P3K8j00J24R3k10Q4
3007A54N4r0R4q4M6k9j31Q7q6K16K7j38n7oP0J70J0j35J02j60j4Q4n8n7j0J66o6jk7L3J54
2716C18j86p2J40n3P7j44j4Om5Q1L8p6N8j24J44N2m7K2r5N2l9l9j0mP9O9j3J3j09L9r9M5J63
2406B27j3J38j90j06pJ16P1m3q9J09n0p1n4M5P2L0j77K20q7n3K36j09j38O3K18j01K47K51
$$ plain form
2143 755 185 121 124 77 269 92 157 119 119 223 185 70 305 30 249 66 142 233 204 289 82 309 336 330 377 348 382 597 269 674
1861 674 257 403 505 925 1431 3486 13519 23089 23015 13355 3277 1420 619 518 436 244 406 251 245 22 194 233
1655 233 219 193 181 77 98 124 148 69 224 238 74 169 21 43 227 96 172 111 82 111 135 163 84 598 436 149 246 72 158 165
1373 165 131 85 59 44 313 93 70 94 50 126 82 67 219 69 135 108 71 140 165 94 211 200 96 199 112 89 141 308 83 219
1091 219 113 74 104 233 195 300 129 267 241 115 100 184 323 247 269 374 246 242 158 291 471 521 490 263 307 189 488 783
828 783 824 767 1019 422 564 693 1086 2262 3144 4583 7410 17987 111950 82581 5562 691 2965 3939 1203 12535
640 12535 10858 10719 6774 5819 28218 50888 53977 32995 5325 3098 1765 1263 1487 497 374 374 453 304 213 258
453 258 269 340 230 339 203 134 196 132 199 250 287 346 172 113 71 177 221 283 92 318 71 67 121 211 137 340 154 96 132 200 65
$$ packed form
2143G55n70o4Lm7J92j77O5l8%J04l8j15K35k75K19j83P6R1k9Q5k07K27K7oM7k9L4K15l28M05
1861F74m17J46J02M20N06K055J0033R570p4r660j0078j857q01j01q2j92J62j55ok23J72L9
1655B33j4k6j2j04K1K6K4p9J55J4j64R5j48K2J84j31P6o1k9K9K4K8p9N14j62k87R7j74Q6P
1373A65l4m6k6j5K69k20k3K4m4P6m4j5J52j50O6k7l7O9K5p1J17j1j04J03q7k3N2J67k25J36
1091B19j06l9L0J29l8J05j71J38k6j26j5Q4J39p6K2J05j28mq4J33J80N0l1k27M4j18K99K95
828G83M1n7K52n97J42J29L93J176Q82J439K827J0577R3963k9369p7019m871K274R74k736J1332
640A2535j677j39l945r55K2399K2670L089k0982k7670k227j333n02K24r90j23%P9j49r1M5
453B58J1P1j10J09j36o9O2o4O7N1L7N9j74n9m2J06M4O2j91K26k47mN4R0p4K03j86n8L6O8j35
$$ plain form
162 65 163 255 165 144 200 27 262 247 96 215 194 190 97 248 139 346 171 228 231 185 119 201 186 233 58 290 348 175 214 43 180
-129 180 285 202 177 337 125 134 204 172 263 300 241 267 166 323 235 261 316 370 399 276 301 316 329 425 307 487 501 440
$$ packed form
162F5R8R2r0k1N6j73K35j5j51J19k1mr3J51j09K07j75N7Lm6o6Q2j5M7j75K32N8j73L9j71J37
-129A80J05q3k5J60k12RP0l2R1L7n9K6j01J57q8K6N5N4K9j23K5J5J3R6j18J80J4o1
-392D40
##PAGE=	F1=-3181.24
##FIRST=	4405.895418600002813,	4405.895418600002813,	0
##DATA TABLE=	(F2++(Y..Y)), PROFILE
$$ plain form
4406 588 416 563 451 584 429 431 517 530 410 341 406 367 327 452 319 222 482 217 320 264 243 361 216 248 299 326 151 293
4143 293 239 184 221 376 100 260 256 81 247 367 141 201 192 250 291 180 299 95 226 164 248 138 68 268 222 64 85 259
3880 259 95 153 177 176 115 241 107 167 211 128 125 211 174 171 95 87 218 135 198 123 103 162 128 68 169 137 179 113 190 200 118 115 145 100 92
3551 92 38 207 90 142 77 160 118 76 110 147 53 124 132 54 143 208 95 196 104 309 187 180 199 26 110 170 66 55 146 25 172
3260 172 518 128 73 150 75 122 281 177 119 197 115 91 268 274 159 189 47 31 193 40 106 149 84 177 220 33 116 147 149 177 82
2969 82 171 163 67 89 17 186 210 99 53 57 73 355 294 194 238 49 114 144 191 86 37 207 113 186 93 181 294 164 11 165 123
2678 123 259 43 57 53 50 79 136 40 129 50 176 142 165 141 58 136 71 65 41 32 104 178 166 135 63 96 14 49 218 183 282 114 72 21
2359 21 119 213 176 78 200 178 75 23 27 160 175 53 211 118 125 285 208 64 139 339 270 431 819 263 120 99 108 286 113 167
$$ packed form
4406E88j72J47j12J33j55KQ6J3j20o9O5l9m0J25j33r7K60k65J03n6k1J18j45L2N1K7j75J42
4143B93n4n5L7J55k76J60mj75J66J20k26O0rN8M1j11J19k04J31o2Q4j10p0K00m6j58K1J74
3880B59j64N8K4jo1J26j34O0M4q3lQ6l7lp6qJ31q3O3p5k0N9l4o0J01l2M2o6P7J0q2lL0m5q
3551I2n4J69j17N2o5Q3m2m2L4L7r4P1Qp8Q9O5j13J01r2K05j22pJ9j73Q4O0j04j1R1j21J47
3260A72L46l90n5P7p5M7J59j04n8P8q2k4J77Oj15L0j42j6J62j53O6M3o5R3M3j87Q3L1KK8r5
2969H2Q9qr6K2p2J69K4j11m6MJ6K82o1j00M4j89O5L0M7j05m9J70r4P3r3Q8J13j30j53J54m2
2678A23J36k16J4mlK9N7r6Q9p9J26l4K3k4q3P8o5ok4rP2P4j2l1p2L3q2L5J69l5R9j68m2n1
2359B1R8R4l7r8J22k2j03n2MJ33J5j22J58r3PJ60p7j44P5K00o9J61L88n56j43k1RJ78j73N4
$$ plain form
2077 167 102 90 209 222 76 261 38 200 84 116 275 195 303 73 287 328 314 436 339 434 683 262 786 273 593 654 1301
1824 1301 2028 5170 20373 34552 34555 20020 4865 2233 1070 855 753 379 705 369 426 188 322 426 404 356 269
1626 269 189 254 49 295 214 355 400 166 176 171 103 397 145 281 248 96 47 100 276 229 847 328 85 189 83 100 233 190
1364 190 252 159 130 239 107 162 158 187 228 130 115 65 214 104 133 251 85 182 169 50 88 243 294 95 199 22 118 81 150 136
1082 136 166 150 169 228 106 92 220 51 305 176 131 81 25 179 127 207 341 190 50 114 169 233 256 220 246 40 356 333 120
810 120 484 297 276 124 362 865 1345 1746 3263 8918 48112 36022 4043 560 1516 2899 1231 9129 9590 11293
622 11293 8303 8173 47259 84889 91401 55004 9298 6018 3636 1571 4063 677 84 440 636 852 775 678 431
443 431 236 68 54 466 489 473 263 128 108 80 315 269 243 306 210 162 168 125 236 141 312 130 287 125 207 72 200 128 312
$$ packed form
2077A67o5j2J19J3j46J85k23J62j16L2J59q0J08k30K14M1j4J22r7R5K49m21N24n13L20O1O47
1824A301P27L142J5203J4179Lj4535j5155k632j163k15j02l74L26l36N7k38J34J04k2m8q7
1626B69q0O5k05K46q1J41M5k34J0no8K94k52J36l3j52m9N3J76m7O18n19k43J04j06J7J33m3
1364A90O2r3k9J09j32N5mK9M1r8j5n0J49j10K9J18j66R7j3j19L8J55N1j99J04j77R6l7O9j4
1082A36L0j6J9N9j22j4J28j69K54j29m5n0n6J54n2Q0J34j51j40O4N5O4K3l6K6k06L16k3k13
810A20L64j87k1j52K38N03M80M01J517N655L9194j2090l1979l483R56J383j668P898M61J703
622A1293k990j30L9086L7630O512l6397m5706l280k382k065K492l386n93L56J96K16p7r7k47
443D31j95j68j4M12K3j6k10j35k0k8K35m6k6O3r6m8Om3J11r5J71j82J57j62Q2j35J28p2J84
$$ plain form
171 312 239 134 133 58 101 207 159 386 204 154 122 122 156 102 416 123 320 207 173 173 223 218 287 187 235 40 194 383 93 341
-111 341 121 238 273 159 168 346 158 285 312 222 242 288 263 203 272 475 283 345 337 362 404 339 435 451 466 490 353 499 547 499
$$ packed form
171C12p3j05jp5M3J06m8K27j82n0l2%L4n4L14k93J97j13l4%N0nO9j00M8j95J54J89k90K48
-111C41k20J17L5j14RJ78j88J27K7r0K0M6k5o0O9K03j92O2qK5M2o5R6J6J5K4j37J46M8m8
-392D99
##PAGE=	F1=-3200.02
##FIRST=	4405.895418600002813,	4405.895418600002813,	0
##DATA TABLE=	(F2++(Y..Y)), PROFILE
$$ plain form
4406 694 589 725 563 652 449 479 535 616 525 508 514 428 310 436 397 301 544 352 403 303 218 348 199 355 384 393 227 312 212
4134 212 195 244 427 191 289 340 97 223 362 56 320 236 267 326 187 286 174 314 199 326 216 91 279 204 110 126 307
3880 307 166 193 209 132 99 260 174 252 241 176 85 258 132 212 176 122 245 194 185 87 156 213 172 125 204 147 133 81 245 245 175 147 170
3570 170 110 74 64 189 175 188 150 169 106 77 114 152 140 163 122 64 120 145 106 227 31 323 136 208 204 58 141 213 137 107 137 22
3270 22 183 534 68 105 151 91 125 210 123 193 212 133 37 216 106 142 198 86 80 230 99 80 143 120 166 199 74 64 81 199 128
2979 128 39 147 188 124 85 57 148 155 79 114 64 52 397 264 201 192 26 138 104 237 105 26 174 64 198 90 192 248 186 45
2697 45 138 110 262 64 54 109 74 75 113 66 132 105 196 105 176 103 69 134 68 108 81 47 119 175 122 65 67 108 37 24 196 134 194 107 100
2368 100 10 59 179 156 67 194 178 44 58 33 160 156 82 196 98 157 223 191 53 155 297 268 338 844 310 123 103 148 289
$$ packed form
4406F94j05J36j62Q9k03L0N6Q1r1j7Oq6j18J26l9r6K43j92N1j00q5J30j49J56K9Rj66Q5j00
4134B12j7M9J83k36R8N1k43J26J39l06K64q4L1N9j39R9j12J40j15J27j10j25J88p5r4J6J81
3880C07j41K7J6p7l3J61q6P8j1o5r1J73j26Q0l6n4J23n1rr8O9N7m1m7P9n7j4n2J64%p0k8K3
3570A70o0l6j0J25j4J3l8J9o3k9L7L8j2K3m1n8N6K5l9J21j96K92j87P2mj46Q3P2p6l0L0j15
3270B2J61L51m66L7M6o0L4Q5q7P0J9p9r6J79j10L6N6j12oJ50j31j9O3k3M6L3j25j0J7J18p1
2979A28q9J08M1o4l9k8R1Pp6L5n0j2L45j33o3rj66J12l4J33j32p9J48j10J34j08J02N6o2j41
2697D5R3k8J52j98j0N5l5JL8m7O6k7R1r1P1p3l4O5o6M0k7l4P2N6n3n7KM1p1j3J72o2O0q7p
2368A00r0M9J20k3q9J27j6j34J4k5J27mp4J14r8N9O6l2j38J02J42k9P0N06n34j87k0M5J41
$$ plain form
2096 289 163 166 83 73 190 249 66 203 59 152 112 92 312 184 317 74 270 276 289 469 350 472 735 224 859 268 796
1842 796 810 1640 2592 6753 27021 45595 45750 26495 6394 2999 1563 1161 1089 492 1004 519 597 384 471 592 583 509
1636 509 380 324 416 180 460 351 499 538 294 204 317 221 550 285 377 384 210 131 176 371 368 1097 283 110 222 231 145 351
1373 351 303 401 302 253 202 231 290 292 339 398 269 211 93 354 210 307 410 189 326 283 147 172 394 478 293 353 170 118 227
1101 227 298 318 391 370 287 347 171 301 388 257 543 429 362 164 273 379 381 481 562 512 375 250 370 302 728 602 620 412
838 412 492 390 521 600 931 957 663 1008 570 948 1442 1544 3931 16992 11954 2262 1202 638 1825 1265 5326 8041
631 8041 11132 9370 10814 65979 118490 128428 76911 13375 9119 5941 2077 6247 935 231 890 1089 1404 1331
462 1331 1081 718 362 277 313 785 821 790 550 278 186 131 426 494 504 529 368 243 84 300 287 349 547 302 388 248 102
$$ packed form
2096B89j26Lq3j0J17N9j83J37j44R3m0k0K20j28J33k43J96OJ3J80j19J22K63n11O35n91N28
1842G96J4Q30R52M161K0268J8574J55j9255k0101l395j436m02p2n97N12m85P8k13Q7J21rp4
1636E09j29n6R2k36K80j09J48L9k44r0J13r6L29k65R2Pj74p9M5J95lP29q14j73J12Rq6K06
1373C51m8R8r9m9n1K9N9KM7N9j29n8j18K61j44R7J03k21J37m3j36K5K22Q4j85O0j83n2J09
1101B27P1K0P3k1q3O0j76J30Q7j31K86j14o7j98J09J06KJ00Q1n0j37j25J20o8M26j26J8k08
838D12Q0j02J31P9L31K6k94L45m38L78M94J02K387J3061n038r692j060n64J187n60M061K715
631H041L091j762J444N5165N2511R938n1517o3536m256l178l864M170n312p04O59J99L15p3
462A331k50l63l56q5L6M72L6l1k40k72r2n5K95O8J0K5j61j25j59K16j3O2J98k45Q6j40j46
$$ plain form
209 102 166 385 265 430 395 198 66 51 222 295 318 483 267 218 35 100 232 214 563 245 312 241 140 156 292 361 386 260
-54 260 239 96 97 435 125 458 283 289 269 154 207 370 233 417 417 295 227 264 287 212 392 613 344 422 335 365 411 448 568 575
-336 575 593 548 410 505 604 568
$$ packed form
209A02O4K19j20J65l5j97j32j5J71P3K3J65k16m9j83O5J32j8L49l18O7p1j01J6J36O9K5j26
-54B60k1j43JL38l10L33j75Ok0j15N3J63j37J84%j22o8L7K3p5J80K21k69P8q7L0M6L7J20P
-336E75J8m5j38R5R9l6
-392E68
##PAGE=	F1=-3218.8
##FIRST=	4405.895418600002813,	4405.895418600002813,	0
##DATA TABLE=	(F2++(Y..Y)), PROFILE
$$ plain form
4406 786 745 846 666 722 504 545 560 694 600 656 609 478 318 437 470 390 573 473 466 362 221 360 211 455 443 436 301 337
4143 337 204 205 283 453 271 322 406 128 209 352 113 412 262 307 344 216 284 221 374 223 386 282 120 310 209 171 155
3889 155 336 226 228 230 92 134 253 235 319 252 218 80 295 92 236 263 156 261 221 189 70 209 249 199 170 237 153 95 67 275
3608 275 276 219 174 194 128 47 130 163 256 212 201 185 115 98 133 159 203 198 127 60 107 121 106 232 46 321 114 240 212 84 181 236 184
3298 184 147 134 50 206 533 117 131 138 124 126 138 72 250 211 150 115 265 91 148 193 116 129 252 135 64 161 153 148 219 122 45 20 259
2988 259 79 71 107 195 169 86 100 130 114 75 172 74 107 406 228 193 149 81 148 113 248 118 12 142 31 175 131 189 197 198 87
2697 87 137 104 227 107 52 164 95 87 94 101 133 145 192 99 196 85 95 124 77 145 113 69 149 185 46 23 79 146 46 18 180 69 120
2387 120 128 124 34 4 149 146 66 205 155 15 87 84 166 144 83 189 80 180 154 181 55 184 241 257 255 818 307 140 153 168 284
$$ packed form
4406G86m1J01j80N6k18M1J5J34r4N6m7j31j60J19L3q0J83j00pj04j41J39j49K44j2pj35L6
4143C37j33JP8J70j82N1Q4k78Q1J43k39K99j50M5L7j28O8o3J53j51J63j04j62J90j01l8j6
3889A55J81j10KKj38M2J19j8Q4o7l4j38K15k03J44K7j07J05m0l2j19J39M0n0k9O7q4n8k8K08
3608B75Jn7m5K0o6q1Q3L3R3m4j1j6p0j7L5K6M4np1o7M7J4j5J26j86K75k07J26k8j28R7N5n2
3298A84l7j3q4J56L27m16J4Pj4KJ2o6J78l9o1l5J50j74N7M5p7J3J23j17p1R7qnP1r7p7k5K39
2988B59j80qL6Q8k6q3J4L0j6l9R7r8L3K99j78l5m4o8O7l5J35j30j06J30j11J44m4N8QJj11
2697H7N0l3J23j20n5J12o9qPPL2J2M7r3R7j11J0K9m7O8l2m4Q0L6j39k3N6O7j00k8J62j11N1
2387A20Qmr0l0J45lq0J39n0j40P2lQ2k2o1J06j09J00k6K7j26J29N7J6kN63n11j67J3J5J16
$$ plain form
2096 284 203 161 73 82 179 273 43 140 75 136 152 86 357 181 342 65 270 202 269 483 390 505 752 171 896 245 987 966 1898
1824 1898 3044 7956 32238 54245 54573 31638 7572 3577 1979 1362 1380 534 1242 633 712 545 584 684 710 608
1636 608 454 409 533 277 581 436 609 612 377 220 411 296 644 396 428 481 281 211 255 412 452 1271 297 155 293 324
1392 324 216 428 390 483 413 336 209 313 371 385 435 514 362 263 190 437 282 434 495 293 437 347 245 268 479 610 432 437
1129 437 272 269 294 409 437 540 521 393 420 299 421 521 408 696 584 517 308 416 526 598 682 709 704 581 458 623 480
875 480 995 853 849 676 766 655 869 924 1321 1368 1095 1462 1380 1888 2839 3741 7850 54922 40572 1269 1313 994 1154 1462
650 1462 2169 6617 10298 9661 12954 80830 145170 157869 94603 16720 11791 8377 3296 6488 1284 327 1233
490 1233 1432 1748 1721 1349 931 494 412 511 993 1029 1014 778 419 346 220 523 653 694 671 489 312 108 399 368 498 703
$$ packed form
2096B84q1m2q8RR7R4k30R7o5O1J6o6K71j76J61k77K05o8O7K14r3J15K47n81P25o51P42k1R32
1824A898J146M912K4282K2007L28k2935k4066l995j598o17J8q46P08o09P9j67L9J00K6j02
1636F08j54m5J24k56L04j45J73Lk35j57J91j15L48k48L2N3k00p0M4J57M0Q19r74j42J38L1
1392C24j08K12l8R3p0p7j27J04N8J4N0P9j52r9p3K47j55J52O1k02J44r0j02K3K11J31j78N
1129D37j65lK5J15K8J03j9j28K7j21J22J00j13K88j12o7k09J08J10P2Q4K7nj23j23J65j43
875D80N15j42mj73R0j11K14N5L97M7k73L67q2N08R51R02M109M7072j4350l9303M4l19J60L08
650A462P07M448L681o37L293O7876O4340J2699o3266p7883m929l414n081L192n204r57R06
490A233J99L16k7l72m18m37q2R9M82L6j5k36l59p3j26L03J30M1k3j82j77k04K91l1J30K05
$$ plain form
246 703 425 465 331 85 248 511 366 510 496 284 108 113 320 378 426 527 385 245 23 135 298 313 653 351 309 257 113
-7 113 183 339 465 459 343 247 140 42 471 209 521 414 322 279 185 249 404 299 500 498 373 226 252 316 261 487 703 407 488
-280 488 341 402 426 563 668 674 700 609 489 534 680 631
$$ packed form
246G03k78M0j34k46J63K63j45J44j4k12j76NK07N8M8J01j42j40k22J12J63J5L40l02m2n2j44
-7A13P0J56J26oj16r6j07r8M29k62L12j07r2m3r4O4J55j05K01kj25j47K6O4n5K26K16k96Q1
-280D88j47O1K4J37J05OK6r1j20M5J46m9
-392F31
##PAGE=	F1=-3237.58
##FIRST=	4405.895418600002813,	4405.895418600002813,	0
##DATA TABLE=	(F2++(Y..Y)), PROFILE
$$ plain form
4406 836 845 903 742 780 578 613 578 742 616 758 672 516 354 454 515 449 554 555 493 431 250 380 235 511 460 447 360 365 227
4134 227 208 316 443 313 343 447 175 206 337 173 458 265 348 343 260 293 228 393 227 413 327 147 352 217 227 150 337
3880 337 264 248 243 59 203 216 261 352 250 241 103 316 68 235 322 173 260 222 206 55 242 258 201 195 261 160 77 78 265 279 240
3589 240 189 216 153 52 169 133 305 209 225 206 138 116 162 154 225 229 138 56 121 130 91 207 104 302 147 256 220 93 196 232 203
3298 203 170 140 100 224 518 162 146 111 152 122 94 25 281 198 171 196 374 233 174 174 131 158 254 134 71 190 167 122 237 153 82
3007 82 37 316 35 134 66 175 201 77 145 130 89 90 208 86 170 375 199 176 120 112 135 153 221 127 19 122 34 117 174 168 151 201
2706 201 120 161 86 159 136 46 200 110 101 93 116 127 163 164 101 225 99 111 111 75 167 128 91 180 200 54 66 82 177 53 48 174 22 80
2387 80 135 135 53 53 125 148 70 223 116 23 102 126 177 143 58 182 61 203 90 186 68 220 185 243 213 746 254 161 217 158 270
$$ packed form
4406H36RN8j61L8k02L5l5J64j26J42q6j56j62J00O1o6J05Jo2o2j81J30j45K76n1j3q7Nj38
4134B27j9J08J27j30L0J04k72L1J31j64K85j93Q3nq3L3o5J65j66J86q6j80K05j35J0p7J87
3880C37p3j6nj84J44J3M5R1j02rj38K13k48J67Q7j49Q7l8j6j51J87J6n7oO6j01q3JJ87J4l9
3589B40n1K7o3j01J17l6J72r6J6j9o8k2M6qP1Mr1q2O5Rl9J16j03J98j55J09l6j27J03L6k9
3298B03l3l0m0J24K94l56j6l5M1l0k8o9K56q3k7K5J78j41n9%m3K7R6j20o3J19k3m5J15q4p1
3007H2m5K79k81R9o8J09K6j24O8j5m1JJ18j22Q4K05j76k3n6qK3J8O8r4j08J03q8Q3N7oj7N0
2706B01q1M1p5P3k3r0J54r0rqK3J1L6Jo3J24j26J2%l6R2l9l7Q9K0j46J2J6R5j24nJ26j52N8
2387H0N5%q2%P2K3p8J53j07r3P9K4N1l4q5J24j21J42j13R6j18J52l5N8l0N33m92r3N6n9J12
$$ plain form
2096 270 222 157 70 116 178 289 74 76 82 165 202 101 407 190 377 37 283 164 264 481 444 530 734 176 894 223 1128 1094
1833 1094 2033 3305 8550 35017 58859 59336 34468 8170 3869 2234 1408 1579 480 1378 676 747 639 632 678 760
1645 760 632 465 420 579 312 631 448 656 610 396 202 435 310 658 446 419 515 290 242 279 390 455 1331 308 163
1410 163 335 345 251 434 416 484 466 362 200 327 383 409 457 544 381 256 209 445 285 477 488 341 474 341 255 297 479 643
1148 643 478 424 313 337 266 418 457 585 572 409 407 323 430 543 438 727 604 553 322 415 539 653 732 724 732 624 484 679
885 679 531 1006 894 880 715 795 652 864 960 1390 1400 1176 1394 1458 1920 2760 4030 8585 58880 43586 685 957 969
669 969 1030 1973 2362 5501 8940 9088 13990 88734 159369 173663 104422 18627 13567 10670 5665 3622 1772 187
500 187 1270 1515 1786 1850 1435 1010 529 412 546 1031 1067 1097 879 580 452 201 518 692 767 698 534 304 157 396 378
$$ packed form
2096B70m8o5q7M6O2J11k15KOQ3L7j01L06k17J87l40K46j19J00K17l7Q6K04n58P18o71R05l4
1833A094R39J272N245K6467K3842M77k4868k6298m301j635q26J71j099Q98p02P1j08pM6Q2
1645G60j28j67m5J59k67L19j83K08m6k14j94K33j25L48k12k7R6k25m8L7J11O5Q76j023j45
1410A63J72J0r4J83j8O8j8j04j62J27N6K6M8Q7j63j25m7K36j60J92J1j47J33j33q6M2J82J64
1148F43j65n4j11K4p1J52L9J28j3j63kq4J07J13j05K89j23n1k31R3J24J14P9qQj08j40J95
885F79j48M75j12j4j65Q0j43K12R6M30J0k24K18O4M62Q40J270M555N0295j5294m2901K72J2
669I69O1R43L89L139L439J48M902P4744P0635J4294o9241q5795n060k897n005k043j850j585
500A87J083K45K71O4m15m25m81j17J34M85L6L0k18k99j28k51L17J74P5o9j64k30j47K39j8
$$ plain form
265 378 560 743 468 489 342 63 262 544 388 530 524 339 126 111 351 410 459 510 476 231 26 143 303 364 667 402 287
11 287 249 95 198 337 501 480 394 245 190 41 466 256 510 494 330 291 233 265 422 330 517 538 431 256 249 346 292 531 725
-261 725 453 537 361 465 435 638 712 726 770 657 577 579 750 660
$$ packed form
265C78J82J83k75K1j47k79J99K82j56J42oj85k13j5K40N9M9N1l4k45k05J17J60O1L03k65j15
11B87l8j54J03J39J64k1q6j49n5j49M25k10K54j6j64l9n8L2J57r2J87K1j07j75pR7n4K39J94
-261G25k72Q4j76J04l0K03P4J4M4j13q0KJ71r0
-392F60
##PAGE=	F1=-3256.36
##FIRST=	4405.895418600002813,	4405.895418600002813,	0
##DATA TABLE=	(F2++(Y..Y)), PROFILE
$$ plain form
4406 825 860 876 764 804 634 654 572 736 567 788 683 534 391 469 519 464 484 584 474 488 281 386 256 504 430 421 389 380 268
4134 268 198 332 391 306 344 455 224 204 314 194 447 247 370 320 300 299 200 369 211 401 346 164 386 210 268 108 309
3880 309 277 242 258 51 270 159 244 350 241 241 133 320 61 214 342 171 236 210 223 36 249 238 177 192 270 165 94 97 219
3608 219 252 234 189 236 176 117 177 101 313 184 228 221 165 121 201 135 205 254 146 62 158 146 63 161 139 272 192 251 224 86 185 203 198
3298 198 177 151 158 226 485 173 145 76 174 108 110 13 288 180 200 242 462 328 201 151 130 168 237 103 103 210 161 93 226 162 120
3007 120 87 357 14 190 67 132 223 55 188 140 65 120 219 102 215 308 187 156 116 114 105 181 164 142 53 118 49 37 201 132 116
2716 116 200 148 192 54 72 145 32 215 123 110 109 112 117 158 122 94 254 137 114 105 53 174 127 101 208 211 151 100 74 188 77 71 178
2406 178 74 69 117 130 76 94 101 152 90 237 87 36 105 160 187 144 23 169 57 231 40 201 82 252 140 228 218 639 169
$$ packed form
4406H25L5J6j12M0j70K0q2J64j69K21j05j49j43P8N0n5K0J00j10J4k07J05j30K48p4rl2rj12
4134B68p0J34N9q5L8J11k31k0J10j20K53k00J23n0k0jr9J69j58J90n5j82K22j76N8j60K01
3880C09l2l5J6k07K19j11Q5J06j09%j08J87k59J53J28j71O5k6J3j87K13j1o1J5P8j05p1LJ22
3608B19L3j8m5M7o0n9O0p6K12j29M4pn6m4Q0o6P0M9j08q4R6j2q3R8k2J33q0N9k7j38R9J8n
3298A98k1k6PO8K59l12k8o9R8o6Kr7K75j08K0M2K20j34j27n0k1L8O9j34%J07m9o8J33o4m2
3007A20l3K70l43J76j23O5R1j68J33m8p5N5R9j17J13R3j21l1m0krP6j7k2q9O5o9j2J64o9j6
2716A16Q4n2M4j38J8P3j13J83r2j3jLNM1l6k8J60j17k3rn2J21m7k6J07Lo0n1k6J14j11oJ07
2406A78j04nM8J3n4J8PN1o2J47j50n1O9N5K7m3j21J46j12J74j91J61j19J70j12Q8j0M21m70
$$ plain form
2134 169 172 270 134 243 225 150 67 165 185 289 141 24 77 207 251 122 452 203 409 25 295 205 266 459 487 536 683 260
1871 260 849 228 1182 1153 2018 3319 8420 34813 58534 59105 34421 8078 3833 2288 1292 1664 336 1395 638
1692 638 709 656 614 581 727 585 413 363 556 291 608 391 633 537 356 152 397 269 595 429 358 483 246 224 243 320 381
1439 381 1266 284 142 336 305 247 375 378 415 460 338 152 285 337 367 410 487 334 207 163 387 235 438 400 330 443 282 193
1176 193 274 406 581 435 329 315 326 177 337 391 532 528 342 326 255 348 467 364 645 504 494 233 302 437 566 640 618 630
913 630 530 366 565 488 805 751 742 576 607 427 586 748 1189 1119 957 944 994 1198 1532 2719 5727 36390 26827 609
687 609 362 467 1281 2599 3869 4674 7264 7788 13642 87951 158009 172495 104198 18698 14224 12595 9385 4301
518 4301 2583 609 916 1301 1520 1697 1348 970 494 309 435 897 945 1043 841 826 525 153 409 611 719 613 511 248
$$ packed form
2134A69LR8j36J09j8p5q3R8K0J04j48j17N3J30M4j29L30k49K06l84K70r0O1J93K8M9J47m23
1871B60N89o21R54k9Q65J301N101K6393K3721N71k4684k6343m245j545r96L72j328J059p57
1692F38P1n3m2l3J46j42j72n0J93k65L17k17K42r6j81k04K45j28L26j66p1J25k37k2J9P7O1
1439C81Q85r82j42J94l1n8J28LL7M5j22j86J33N2L0M3P7j53j27m4K24j52K03l8p0J13j61q9
1176A93Q1J32J75j46j06j4J1j49J60N4J41mj86j6p1R3J19j03K81j41j0k61O9J35J29P4k2J2
913F30j00j64J99p7L17n4rj66L1j80J59J62M41p0j62j3N0K04L34J187L008L0663r563k6218
687F09k47J05Q14J318J270Q05K590N24N854P4309P0058J4486o8297q5500m474j629l210n084
518D301j718j974L07L85K19J77l49l78m76j85J26M62M8R8k02j5l01l72K56K02J08j06j02k63
$$ plain form
293 248 219 309 304 537 669 438 461 299 27 222 486 333 497 484 360 125 65 323 389 419 441 511 201 53 114 249 360 609
30 609 394 242 238 130 190 285 470 446 400 231 253 75 418 257 426 519 307 300 287 264 406 318 466 530 454 319 241 373 289 512
-252 512 670 466 557 377 522 423 648 688 716 779 667 639 615 782 634
$$ packed form
293B48k9R0nK33J32k31K3j62k72J95K64j53J64j3j24k35o0K58O6L0K2P0l10j48O1J35J11K49
30F09k15j52mj08O0R5J85k4m6j69K2j78L43j61J69R3k12pj3k3J42q8J48O4p6j35p8J32q4K23
-252E12J58k04R1j80J45r9K25M0K8O3j12k8k4J67j48
-392F34
##PAGE=	F1=-3275.14
##FIRST=	4405.895418600002813,	4405.895418600002813,	0
##DATA TABLE=	(F2++(Y..Y)), PROFILE
$$ plain form
4406 745 782 766 712 767 633 639 528 668 462 736 629 520 397 461 473 431 371 553 407 508 292 364 262 434 359 358 379 368 303
4134 303 167 333 305 251 320 429 254 193 276 181 382 215 358 269 319 285 161 309 179 353 337 160 394 185 288 45 256
3880 256 267 209 271 73 313 100 190 319 225 216 155 307 64 180 318 156 188 196 222 23 228 195 138 159 260 162 127 106 151 205
3598 205 204 178 249 186 188 158 75 285 145 216 218 181 119 241 108 152 269 151 66 199 158 37 105 146 232 213 227 215 69 159 154 179
3298 179 170 164 208 213 434 157 127 50 183 84 155 38 278 166 235 243 493 377 208 137 118 164 209 70 136 214 141 78 185 152 146 125
2997 125 370 49 222 110 85 235 57 223 149 45 149 210 122 234 218 184 133 124 92 70 185 99 165 78 127 55 48 209 95
2725 95 90 197 174 215 29 27 136 8 214 132 109 128 99 107 138 96 83 268 183 108 111 21 174 121 95 228 206 230 119 62 178 107
2425 107 77 184 115 60 80 111 106 124 72 147 123 240 93 38 98 180 191 137 29 150 85 256 25 216 89 264 110 213 235
$$ packed form
4406G45L7j6n4N5j34Oj11J40k06K74j07j09j23O4J2m2o0J82j46J01k16P2j02J72p5jK1j1o5
4134C03j36J66k8n4O9J09j75o1Q3r5K01j67J43q9N0l4j24J48j30J74j6j77K34k09J03k43K11
3880B56J1n8O2j98K40k13R0J29r4ro1J52k43J16J38j62L2QK6j99K05l3n7K1J01r8l5k1M5N4
3598B05jk6P1o3Kl0q3K10j40P1Kl7o2J22j33M4J17j18q5J33m1j21O8M1Q6j9J4j2j46R0nK5
3298A79roM4NK21k77l0p7J33r9P1j17K40j12O9QK50j16j69p1j9M6M5j39O6P8p3o3J07l3ok1
2997A25K45l21J73j12k5J50j78J66p4j04J04O1q8J12j6l4n1rl2k2J15q6O6q7M9p2pJ61j14
2725I5nJ07k3M1j86kJ09j28K06q2k3J9k9QL1m2j3J85q5p5Lr0J53n3k6J33k2K4j11n7J16p1
2425A07l0J07o9n5K0L1nJ8n2P5k4J17j47n5O0Q2J1n4j08J21o5J71k31J91j27J75j54J03K2
$$ plain form
2152 235 509 76 161 293 120 202 220 134 68 211 188 265 197 51 62 233 284 133 475 208 420 69 293 266 263 413 497 510
1889 510 598 346 761 249 1127 1113 1848 3073 7592 31680 53346 53941 31503 7323 3493 2149 1046 1635 132
1711 132 1305 532 617 601 545 428 627 484 318 259 479 238 528 289 549 422 280 86 323 192 478 358 265 396 174
1476 174 181 166 236 257 1095 224 113 310 235 216 284 293 302 407 285 93 219 258 284 321 368 251 146 82 292 165 340 266 277 370
1195 370 206 96 244 291 454 330 192 306 268 114 209 271 417 422 237 225 141 223 346 233 488 336 384 112 140 280 395
941 395 457 438 470 366 194 370 443 491 512 507 361 341 126 207 485 837 683 616 440 495 274 406 1053 1283 4645 3393 1927
687 1927 225 264 1564 2979 4443 3995 5496 6045 11978 78590 141362 154697 93898 16954 13820 13997 14377 14829
518 14829 3928 1668 185 824 1036 1320 1137 859 462 200 240 636 714 894 712 1122 610 237 236 447 580 448 448 224
$$ packed form
2152B35K74m33Q5J32j73Q2J8q6o6J43k3P7o8j46J1J71N1j51L42k67K12l51K24k7lJ50Q4J3
1889E10Q8k52M15n12Q78j4P35J225M519K4088K1666N95k2438k4180l830j344j103N89j503
1711A32J173p73Q5j6n6j17J99j43j66n9K20k41K90k39K60j27j42j94K37j31K86j20r3J31k22
1476A74Pj5P0K1Q38q71j11J97p5j9O8RRJ05j22j92J26L9K6L7M7j17j05o4K10j27J75p4J1R3
1195C70j64j10J48M7J63j24j38J14l8j54R5O2J46Nj85j2q4Q2J23j13K55j52M8k72K8J40J15
941C95O2j9L2j04j72J76P3M8K1nj46k0k15Q1K78L52j54o7j76N5k21J32O47K30L362j252j466
687A927j702L9J300J415J464m48J501N49N933O6612O2772J3335o0799p6944l134J77L80M52
518A4829j0901k260j483O39K12K84j83k78l97k62M0L96P8J80j82M10n12l73jK11J33j32%k24
$$ plain form
293 224 287 181 172 456 505 365 398 242 102 165 364 223 431 393 360 139 84 262 330 326 342 484 188 103 79 161 307 499 338
21 338 182 239 184 177 197 392 366 367 206 302 121 344 222 294 493 255 304 322 257 359 270 362 474 433 383 213 382 255 440 548
-261 548 433 536 368 544 379 586 598 642 715 621 641 614 752 547
$$ packed form
293B24O3j06rK84M9j40L3j56j40O3J99j41K08l8l3k21n5J78O8mJ6J42k96q5k4Q2J46J92j61
21C38j56N7n5pK0J95k6Jj61R6j81K23j22P2J99k38M9J8o5J02q9R2J12m1n0j70J69j27J85J08
-261E48j15J03j68J76j65K07J2M4P3r4K0k7J38k05
-392E47
##PAGE=	F1=-3293.92
##FIRST=	4405.895418600002813,	4405.895418600002813,	0
##DATA TABLE=	(F2++(Y..Y)), PROFILE
$$ plain form
4406 607 622 588 582 662 560 557 442 545 322 613 508 466 352 416 382 361 238 471 302 474 270 308 246 314 261 266 327 320 310 117
4124 117 319 202 160 274 369 252 170 215 152 274 180 309 190 302 241 144 225 143 285 306 130 362 142 283 76 189 237
3871 237 155 269 99 318 59 113 269 193 172 159 278 68 141 257 137 123 180 191 29 184 140 94 101 232 142 153 97 77 151
3598 151 159 166 241 178 240 127 61 231 99 194 193 175 114 272 81 89 269 157 59 229 160 44 53 129 185 202 192 187 52 139 97 152 153
3288 153 179 239 188 368 127 93 53 175 58 194 44 258 164 271 212 460 405 181 135 99 149 177 86 148 200 113 86 126 130 163
3007 163 144 354 84 219 148 70 237 107 241 151 48 166 187 146 226 121 171 107 129 55 38 165 68 182 83 140 51 119 202
2734 202 84 72 191 192 218 46 98 114 29 201 131 92 135 86 99 118 108 74 255 223 96 118 29 172 110 77 232 180 274 132 53
2443 53 150 128 66 184 128 47 44 83 131 140 34 124 154 230 111 31 83 181 182 118 50 127 121 264 42 220 82 245 85 197 240 369
$$ packed form
4406F07J5l4oQ0j02lj15J03k23K91j05m2j14O4l4k1j23K33j69J72k04L8o2O8n3NO1pj0j93
4124A17K02j17m2J14R5j17q2M5o3J22r4J29j19J12o1r7Q1q2J42K1j76K32k20J41k07J13M8
3871B37q2J14j70K19k59N4J56p6k1j3J19k10P3J16j20j4N7J1j62J55m4m6PJ31r0J1n6k0P4
3598A51QPP5o3O2j13o6J70j32R5jj8o1J58j91QJ80j12r8J70o9j16RP6N6J7j0nj35Q7m2N5J
3288A53K6O0n1J80k41l4m0J22j17J36j50K14r4J07n9K48n5k24m6l6N0K8r1O2N2q7k7M0ML3
3007A63j9K10k70J35p1p8J67j30J34r0j03J18K1m1Q0j05N0o4K2p4j7J27r7J14r9N7q9O8Q3
2734B02j18j2J19JK6j72N2J6q5J72p0l9M3m9J3J9j0l4J81l2j27K2q9J43o2l3J55n2R4j42p9
2443E3R7k2o2J18n6q1lL9M8Rj06R0L0P6j19q0N2R8Jo4o8P7oJ43k22J78j38J63j60J12M3J29
$$ plain form
2143 369 27 125 279 127 149 204 101 75 242 177 214 222 86 40 232 289 125 465 195 400 114 269 298 239 342 464 445 485
1880 485 391 635 258 967 969 1551 2605 6231 26257 44329 44884 26293 6061 2924 1861 740 1513 89 1139
1702 1139 387 500 493 450 278 492 358 206 140 371 186 419 181 427 298 197 34 248 107 336 260 163 277 100 148
1467 148 87 178 139 855 142 105 270 170 174 204 187 179 325 230 102 174 173 186 218 221 169 98 20 192 117 217 133 207 282 149 31 240
1166 240 172 303 206 77 295 202 160 82 141 282 292 155 153 40 107 240 127 303 176 267 102 52 131 211 254 244 321 202 103
894 103 193 434 172 275 258 171 204 166 173 417 464 292 401 411 601 630 1509 1394 2897 22868 16275 3121 583 673 1596
659 1596 2871 4024 3316 3836 4191 9361 62601 112970 124126 75668 13827 12645 14795 20164 27943 5789 3125
500 3125 905 181 472 826 862 726 476 236 49 319 448 708 611 1385 725 377 55 248 392 248 373 270 331 56
$$ packed form
2143C69l42R8J54j52K2N5j03k6J67o5L7Qj36m6J92N7j64L40k70K05k86J55K9n9J03J22j9M0
1880D85r4K44l77P09KN82J054L626K0026J8072N55j8591k0232l137j063j121P73j424J050
1702A139p52J13pm3j72K14j34j52o6K31j85K33k38K46j29j01j63K14j41K29p6r7J14j77M8
1467A48o1R1l9P16p13l7J65j00ML0j7qJ46r5j28P2jJ3L2Ln2p1p8J72p5J00q4P4P5j33j18K09
1166B40o8J31r7j29K18r3m2p8N9J41J0j37kj13O7J33j13J76j27R1j65n0P9Q0M3j0P7j19r9
894A03R0K41k62J03j7q7L3l8PK44M7j72J09J0J90K9Q79j15J503J9971o593j3154k538R0R23
659A596J275J153p08N20L55N170N3240N0369J1156m8458o1841j182K150N369P779k2154k664
500C125k220p24K91L54L6j36k50k40j87K70J29K60r7P74o60l48l22J93J44j44J25j03O1k75
$$ plain form
274 56 23 353 297 280 317 199 170 132 215 95 359 277 341 158 174 195 259 224 237 407 191 135 88 69 224 364 253 117 242 206
-7 206 170 93 294 263 307 169 310 156 265 172 157 429 181 295 314 243 291 198 228 380 372 410 162 358 200 334 382 350 467
-280 467 319 513 302 463 459 511 579 512 564 564 651 409
$$ packed form
274E6l3L30n6j7L7j18k9l8Q3j20K64q2O4j83J6K1O4l5J3J70k16n6m7j9J55J40j11j36J25l6
-7B06l6p7K01l1M4j38J41j54J09r3j5K72k48J14J9p1M8r3L0J52qL8k48J96j58J34M8l2J17
-280D67j48J94k11J61mN2O8o7N2%Q7k42
-392D09
##PAGE=	F1=-3312.7
##FIRST=	4405.895418600002813,	4405.895418600002813,	0
##DATA TABLE=	(F2++(Y..Y)), PROFILE
$$ plain form
4406 435 417 378 393 501 426 424 323 392 177 446 341 378 262 338 261 273 137 356 177 392 219 221 209 169 156 162 244 246 281 84 294
4115 294 103 65 215 283 220 151 130 128 146 153 230 92 250 170 174 141 114 222 258 82 293 86 256 160 119 198 94 237 115 284
3833 284 55 40 210 142 115 145 233 66 101 177 124 59 159 130 42 124 86 60 37 191 105 161 70 27 107 116 162 210 155 264 103 62
3533 62 169 56 164 149 144 109 285 66 51 253 168 66 242 150 74 14 94 135 166 152 139 48 134 50 118 127 201 248 156 296 99
3242 99 49 66 145 64 214 41 231 177 302 186 373 441 127 132 80 121 154 131 132 169 84 111 80 102 178 136 315 112 177 164 95 227
2941 227 166 237 145 71 165 162 172 194 37 141 77 124 21 13 128 91 184 71 148 53 164 181 108 60 183 200 199 70 149 87 67 182
2641 182 112 57 127 77 91 110 133 73 212 246 84 117 65 170 92 66 216 133 280 144 53 110 134 64 175 121 37 50 53 141 144 16
2340 16 80 175 209 111 32 64 160 164 90 53 101 144 247 61 209 64 195 51 178 222 236 71 72 229 140 94 173 49 84 251 152
$$ packed form
4406D35j8l9J5J08p5kj01O9k15K69j05L7j16P6p7J2j36K19j79K15j73Kj2m0j3OQ2KL5j97K10
4115B94j91l8J50O8o3o9k1kJ8PP7j38J58q0Ml3k7J08L6j76K11k07J70r6m1P9j04J43j22J69
3833B84k29j5J70o8k7L0Q8j67L5P6n3o5J00k9q8Q2l8k6k3J54q6N6r1m3Q0RM6M8n5J09j61m1
3533F2J07j13J08j5nl5J76k19j5K02q5j02J76r2p6o0Q0M1L1j4j3r1Q6q4O8RP4M7r2J40j97
3242I9n0J7P9q1J50j73J90n4J25j16J87O8l14Nn2M1L3k3JL7q5K7l1K2P6m2J79k03O5j3o9J32
2941B27o1P1r2p4R4lJ0K2j57J04o4M7j03qJ15l7R3j13P7r5J11J7p3m8J23J7jj29P9o2k0J15
2641A82p0n5P0n0J4J9K3o0J39L4j62L3n2J05p8k6J50q3J47j36r1N7K4p0J11n4q4J3LQ8Lj28
2340A6O4R5L4r8p9L2R6Mp4l7M8M3J03j86J48j45J31j44J27M4J4j65JJ57q9m6P9j24L5J67r9
$$ plain form
2049 152 143 210 98 15 204 264 95 420 170 347 150 224 288 194 253 394 342 356 385 485 238 735 743 1181 1992 4600 19591
1795 19591 33213 33676 19801 4531 2235 1490 483 1328 278 938 235 378 356 348 208 354 235 110 39 253 155
1598 155 307 137 294 201 130 49 194 35 198 165 72 150 47 148 81 162 122 598 51 125 229 135 133 173 87 77 227 190 166
1326 166 172 105 98 132 82 118 83 53 116 107 104 83 142 195 128 74 253 80 170 123 109 272 157 210 21 46 161 177 140 126 39 36 193 133
1007 133 126 129 157 158 123 35 74 96 83 212 79 142 110 410 77 111 76 56 244 298 339 473 161 240 397 557 710 916 2003 1989
725 1989 5224 33296 22565 3751 670 700 1271 2253 2914 2572 2439 2522 6325 43245 78651 87073 53239 10055
556 10055 11097 14960 25877 41263 7888 4808 2146 635 59 354 579 594 507 339 157 110 231 532 662 1545
368 1545 839 477 88 71 202 59 294 319 330 37 107 259 92 204 228 167 197 131 78 48 296 165 300 159 258 139 198
$$ packed form
2049A52rO7j12q3J89O0j69L25k50J77j97P4O4r4N9J41n2J4K9J00k47M97QM38Q11K608J4991
1795A9591J3622M63j3875j5270k296p45j007Q45j050O60p03J43k2qj40J46j19j25p1K14r8
1598A55J52j70J57r3p1q1J45j59J63l3r3P8j03J01o7Q1m0M76n47P4J04r4kM0q6j0J50l7k4
1326A66Oo7pL4n0L6l5l0O3rlk1N9N3o7n4J79j73R0m7j4J63j15N3j89K5J15J6l7j4q7lJ57o0
1007A33pLK8Jl5q8L9K2j3J29j33O3l2L00l33L4l5k0J88N4M1J34l12P9J57J60J53K06J087j4
725A989L235K8072j0731j8814l081L0N71R82O61l42j33Q3L803L6920L5406Q422l3834m3184
556A0055J042L863J0917J5386l3375l080k662j511n76K95K25J5q7j68j82m7J21L01J30Q83
368A545p06l62l89j7J31j43K35K5J1k93P0J52j67J12K4o1L0o6n3l0K48j31J35j41R9j19N9
$$ plain form
115 198 179 156 298 189 133 119 20 128 233 163 61 228 184 164 12 205 168 236 124 267 167 197 132 124 341 106 269 254 217
-158 217 218 119 94 262 284 385 121 295 134 224 204 227 361 232 433 205 303 300 347 393 360 417 473 496 249
$$ packed form
115A98j9k3J42j09n6j4r9J08J05p0j02J67m4k0j52J93l7O8j12J43j00L0o5qK17k35J63j5l7
-158B17Jr9k5J68K2J01k64J74j61R0k0K3J34j29K01k28R8lM7M6l3N7N6K3k47
-392B49
##PAGE=	F1=-3331.48
##FIRST=	4405.895418600002813,	4405.895418600002813,	0
##DATA TABLE=	(F2++(Y..Y)), PROFILE
$$ plain form
4406 264 232 186 179 319 275 277 193 242 72 282 160 276 175 241 132 189 159 235 77 281 159 123 164 37 65 94 144 172 222 128
4124 128 263 50 87 152 184 171 159 32 125 32 140 136 23 174 99 230 92 101 194 205 49 200 40 215 230 57 162 53
3861 53 172 121 225 67 65 152 81 59 124 179 61 63 106 130 63 136 59 60 60 53 41 74 146 60 153 31 63 85 98 169 159 134 263 110
3542 110 72 111 29 127 107 94 102 278 73 70 223 182 104 240 126 100 7 50 93 125 115 78 57 138 51 85 97 226 241 123 237 81
3242 81 22 65 100 97 214 58 197 206 322 214 250 489 93 118 65 80 148 165 91 130 62 139 82 76 197 105 265 131 102 158 119 205
2941 205 214 214 130 93 147 142 197 149 48 100 43 113 46 15 86 112 166 63 146 77 180 152 139 59 170 199 163 84 171 64 99 159 74 17
2622 17 108 67 84 118 143 77 145 248 81 106 94 170 62 83 186 80 255 154 61 64 128 109 157 112 37 81 28 129 139 59 17 189
2321 189 184 90 56 44 120 146 61 38 78 146 206 79 185 48 124 11 155 180 127 93 29 155 142 47 123 22 88 240 130 65 169
$$ packed form
4406B64l2m6pJ40m4Kq4M9j70K10j22J16j01O6j09N7l0P6j58K04j22l6M1j27K8K9N0K8N0r4
4124A28J35k13L7O5L2j3j2j27R3r3J08mj13J51p5J31j38RR3J1j56J51j60J75J5j73J05j09
3861E3J19n1J04j58kQ7p1k2O5N5j18KM3K4o7P3p7J%pj2L3P2q6R3j22L2K2J3P1j0k5J29j53
3542A10l8L9q2R8k0j3QJ76k05lJ53m1p8J36j14k6r3M3M3L2j0l7k1Q1q7L4J2J29J5j18J14j56
3242H1n9M3L5lJ17j56J39RJ16j08L6K39l96K5n3J5O8J7p4L9o8P7n7oJ21r2J60j34k9N6l9Q6
2941B05R%q4l7N4nN5m8j01N2n7P0o7l1P1K6N4j03Q3o9J03k8j3q0J11K9l6p9Q7j07L5O0q5n7
2622A7R1m1J7L4K5o6O8J03j67K5j2P6j08K1J03j06J75j01r3LO4j9M8m5p5M4n3J01J0q0m2J72
2321A89nr4l4j2P6K6q5k3M0O8O0j27J06j37P6j13J44K5n3l4o4J26j3r5P6j01O6J52j10o5J04
$$ plain form
2030 169 89 6 157 214 59 348 153 272 173 167 239 136 161 304 219 225 335 329 200 480 476 807 1339 2996 12882 21994 22331
1777 22331 13212 3002 1543 1106 408 1113 402 738 113 265 214 253 228 246 134 75 52 141 135 213 181 177 152 98 81 162 40
1523 40 83 107 16 53 37 160 123 161 166 370 39 159 189 121 101 183 34 14 125 169 220 191 65 39 95 46 94 97 64 81 109 25 128
1213 128 94 112 129 95 254 39 94 135 171 233 139 215 51 68 79 120 147 118 47 32 192 168 21 169 73 166 147 20 49 81 62
922 62 133 24 148 102 331 224 44 130 60 232 313 341 457 47 350 377 499 491 775 1698 1776 5655 27667 16455 3734
687 3734 611 398 718 1321 1533 1813 1410 1233 3427 24204 44924 50543 30919 6518 9502 14490 30438 52246
518 52246 9798 6454 3387 1427 429 31 339 464 510 406 262 289 167 389 806 1568 908 511 171 100 47 95 214
302 214 328 282 87 194 198 92 137 144 131 176 132 49 124 244 98 231 139 320 102 161 216 129 179 170 96 139 62 37 126 89 59 191
$$ packed form
2030A69q0q3J51N7j55K89j95J19r9oP2j03K5J43q5OJ10oj29K80mL31N32J657R886R112L37
1777B2331r119j0210j459m37o98P05p11L36o25J52n1L9k5J8j12n9k3Q9oP8l2mk5n4j7Q1j22
1523D0M3K4r1L7j6J23l7L8NK04l31J20L0o8k0Q2j49k0J11M4N1k9j26k6N6m9M8Ll3J7K8q4J03
1213A28l4J8J7l4J59k15N5M1L6O2r4P6j64J7J1M1K7k9p1j5J60k4j47J48r6R3j9j27K9L2j9
922F2P1j09J24m6K29j07j80Q6p0J72Q1K8J16m10L03K7J22qK84R23P8L879K2012j1212j2721
687C734l123k13L20O03K12K80m03j77K194K0777K0720N619j9624k4401K984M988J5948K1808
518E2246m2448l344l067j960r98l98L08J25M6j04j44K7j22K22M17P62o60l97l40p1n3M8J19
302B14J14m6j95J07Mj06M5Pj3M5m4q3P5J20j46J33r2J81k18N9N5q7N0rp4M3p7k5Q9l7l0J32
$$ plain form
2 191 130 152 95 145 118 176 98 190 154 148 121 195 244 80 229 154 181 156 52 40 141 189 315 148 206 70 145 59 84 245 125 324
-299 324 120 148 157 187 194 207 232 370 321 136
$$ packed form
2A91o1K2n7N0k7N8p8R2l6ok7P4M9j64J49p5K7k5j04j2J01M8J26j67N8j36P5q6K5J61j20J99
-299C24k04K8RL0PJ3K5J38m9j85
-392A36
##PAGE=	F1=-3350.26
##FIRST=	4405.895418600002813,	4405.895418600002813,	0
##DATA TABLE=	(F2++(Y..Y)), PROFILE
$$ plain form
4406 124 181 96 19 160 184 177 95 134 84 181 32 188 165 149 24 129 234 129 103 174 115 51 126 86 26 126 48 135 148 189 231
4115 231 68 164 98 90 123 190 66 138 88 137 53 89 96 93 283 97 103 204 156 70 104 63 176 274 31 144 59 82 113 162 82 119 104
3805 104 35 30 106 123 54 35 102 157 111 121 59 82 26 59 34 146 109 38 137 7 97 80 114 181 103 131 253 140 88 72 39 90 93 34
3486 34 89 257 95 90 189 193 146 230 90 114 14 8 74 105 83 24 68 137 75 80 69 246 228 104 211 72 54 50 51 122 196 91 156 245
3166 245 326 287 116 537 150 86 56 43 160 176 36 95 60 166 104 55 217 60 217 151 50 137 128 172 241 182 115 103 120 133
2885 133 217 103 95 89 10 108 81 30 50 110 130 79 136 107 169 120 159 69 154 191 120 89 168 53 114 135 25 34 87 58 82 134 131 83 75 229
2547 229 92 96 115 170 30 109 153 51 218 157 70 27 115 175 141 116 48 108 15 99 128 93 55 200 159 54 90 29 77 143 38 22
2246 22 65 125 150 98 156 47 51 42 126 112 62 88 57 74 133 18 62 79 86 214 134 23 111 71 22 105 151 55 260 162 193 189 117 165 85
$$ packed form
4406A24N7q5p7J41K4pq2L9n0R7j49J56k3j6j25J05J05j05k6P1n9o4P5m0o0J00p8Q7J3M1M2
4115B31j63R6o6qL3O7j24P2n0M9q4L6PlJ90j86OJ01m8q6L4m1J13R8k43J13q5K3L1M9q0L7j5
3805A04o9nP6J7o9j9O7N5m6J0o2K3n6L3k5J12l7p1R9j30R0j7L4O7p8K8J22j13n2j6l3N1Ln9
3486C4N5J68j62nR9Mm7Q4j40K4j00oO6L1k2n9M4O9o2Nj1J77j8j24J07j39j8mJP1P4j05O5Q9
3166B45Q1l9j71M21l87o4l0j3J17J6j40N9l5J06o2m9J62j57J57o6j01Q7rM4O9n9o7j2J7J3
2885A33Q4j14qop9R8k7n1K0O0K0n1N7k9O2m9L9r0Q5L7p1l1P9j15O1K1j10RN3k9K4N2lm8qJ54
2547B29j37MJ9N5j40P9M4j02J67o1q7m3Q8O0l4k5o8O0r3Q4K9l5l8J45m1j05L6o1M8O6j05j6
2246B2M3O0K5n2N8j09MrQ4j4n0K6l1J7N9j15M4J7PJ28q0j11Q8m0m9Q3M6r6K05r8L1mp2M8q0
$$ plain form
1918 85 83 218 118 108 260 190 170 269 219 499 748 1689 7232 12509 12705 7638 1713 949 764 475 895 445 561 85 171
1683 171 89 168 248 189 65 103 94 53 109 147 238 109 133 103 105 137 76 1 101 57 89 57 158 144 146 174 194 100 191 151 106 85 197 69
1364 69 14 26 162 248 204 53 64 115 112 73 120 50 74 107 38 161 70 41 136 89 234 47 93 176 200 189 137 182 42 105 72 137 135
1054 135 114 35 38 198 169 127 182 120 132 126 9 73 126 127 77 92 111 100 211 290 78 216 161 150 288 228 364 186 376 312 318 52
753 52 593 959 1221 4887 14586 7151 3284 691 533 520 519 288 1188 814 400 1120 8637 17372 20466 12508 4049 7992
547 7992 13397 32837 58680 11074 7763 4439 2177 729 50 194 333 467 422 298 419 215 269 905 1450 906
359 906 484 194 182 70 188 135 295 203 111 231 174 205 70 85 91 120 122 105 168 197 101 139 118 360 91 147 266 150 76 142 40
68 40 145 82 38 56 79 100 140 89 133 160 116 120 150 125 126 127 117 135 239 158 112 186 49 148 119 32 108 49 111 226 207 110 25 122 85 65
$$ packed form
1918H5kJ35j00j0J52p0k0R9n0K80K49R41N543N277J96n067n925p64j85k89M20m50J16m76Q6
1683A71q2P9Q0n9j24L8rm1N6L8R1j29K4l0KL2o1p5J00m4L2l2J01j4KK8K0r4R1m0m5k1J12j28
1364F9n5J2J36Q6m4j51J1N1ll9M7p0K4L3o9J23r1k9R5m7J45j87M6Q3K4j1n2M5j40O3l3O5k
1054A35k1p9LJ60k9m2N5o2J2oj17O4N3Jn0J5J9j1J11P9k12J38n5j1J38o0J36j78J90o4Ok66
753E2N41L66K62L666R699p435l867k593j58j3jk31R00l74m14P20P517Q735L094p958q459L943
547G992N405J9440K5843m7606l311l324k262j448o79J44J39J34m5j24J21k04N4O36N45n44
359I06m22k90j2j12J18n3J60r2r2J20n7L1j35J5OK9Kj7O3K9r6L8k1K42k69N6J19j16p4O6j02
68D0J05o3m4J8K3K1M0n1M4K7m4ML0k5JJj0J8J04q1m6P4j37R9k9q7P6n9O2J15j9r7q5R7l7k0
$$ plain form
-270 65 163 29 217 106 94 67 103 48 140 63 291 174 166
$$ packed form
-270F5R8j34J88j11j2k7L6n5R2p7K28j17q
-392A66
##PAGE=	F1=-3369.04
##FIRST=	4405.895418600002813,	4405.895418600002813,	0
##DATA TABLE=	(F2++(Y..Y)), PROFILE
$$ plain form
4406 36 244 135 167 79 193 161 90 94 116 172 121 134 202 84 56 96 284 55 158 106 101 76 105 144 58 178 34 139 75 216 201
4115 201 77 212 65 27 90 214 135 155 150 135 62 129 52 144 318 108 110 221 122 95 26 99 152 288 53 145 74 21 93 119 98
3824 98 155 70 47 55 90 71 52 23 142 196 145 124 113 104 64 82 28 198 87 70 121 36 107 83 140 188 58 143 251 170 110 56 62 59 103
3495 103 22 66 227 121 90 161 195 167 219 50 113 19 32 77 107 58 53 76 126 88 112 49 249 215 113 219 66 83 22 19 126 165
3195 165 116 112 287 309 362 29 571 232 40 49 69 177 163 22 85 80 192 109 38 232 34 178 193 127 118 123 135 244 152 105 101 97
2894 97 135 229 69 126 129 24 113 107 38 34 91 84 102 119 123 141 98 161 86 136 179 78 92 147 56 103 110 48 64 74 47 86 151 98 89 56 193
2547 193 115 98 129 172 40 122 123 64 185 149 72 28 102 236 139 129 63 129 17 60 117 109 128 215 139 22 123 22 59 152 24 33
2246 33 65 87 93 117 131 57 24 84 91 17 55 69 85 5 117 14 46 121 81 183 158 69 55 69 34 60 94 84 169 179 135 197 95 83
$$ packed form
4406C6K08j09L2q8J14l2p1MK2N6n1J3O8j18k8M0J88k29J03n2nk5K9L9q6J20j44J05o4J41j5
4115B01j24J35j47l8O3J24p9K0nj5p3O7p7R2J74k10KJ11r9k7o9P3N3J36k35R2p1n3P2K6k1
3824I8N7q5k3QL5j9j9k9J19N4n1k1j1rm0J8n4J70j11j7N1q5P1k4N7M8j30Q5J08q1o0n4OlM4
3495A03q1M4J61j06l1P1L4k8N2j69O3r4J3M5L0m9nK3N0l8K4o3K00l4j02J06j53J7o1lJ07L9
3195A65m9mJ75K2N3l33N42l39j92RK0J08j4j41O3nJ12q3p1J94j98J44J5o6rNJ2J09r2m7mm
2894I7L8R4j60N7Lj05Q9oo9mN7pJ8J7MJ8m3O3p5N0M3j01J4N5r1M7Po2J6J0k7L9O5n3rl3J37
2547A93p8j7L1M3j32Q2Jn9J21l6p7m4P4J34r7j0o6O6j12M3N7qJ9Q7p6j17J01j01L7R3j28R
2246C3L2K2OK4J4p4l3O0Pp4L8J4J6q0J12j03L2P5m0J02k5q9j4J4l5K6L4j0Q5J0m4O2j02j2
$$ plain form
1927 83 61 37 155 135 28 181 84 175 189 46 311 301 886 3549 6227 6297 3979 857 530 500 523 695 412 412 132 117 28
1673 28 99 227 173 25 128 112 60 80 111 275 107 115 136 125 112 101 54 108 92 149 84 133 133 114 140 68 133 210 112 90 86 202 98
1364 98 10 65 154 248 203 61 117 151 143 49 135 41 69 104 56 166 67 50 140 80 203 60 108 198 202 159 137 135 31 123 110 173 109 118 72
1035 72 44 202 145 197 159 218 83 100 16 84 152 165 63 160 80 111 115 305 166 264 266 116 303 100 270 295 356 364 274 403 764
744 764 687 1101 3967 13566 14991 2779 952 1083 899 736 547 846 603 40 484 1862 2903 592 2357 2978 6514
547 6514 11728 32433 59263 11397 8470 5142 2816 1079 143 204 208 380 400 271 427 242 159 888 1216 829 418
349 418 176 217 123 226 64 238 114 126 222 173 260 18 81 58 52 107 124 175 148 114 38 119 379 106 143 289 181 46 117 29
68 29 144 77 86 20 119 130 91 101 115 200 111 134 155 176 135 100 105 158 226 112 134 147 76 124 107 57 141 74 68 146 243 31 21 131 136 173
$$ packed form
1927H3k2k4J18k0j07J53r7R1J4j43K65j0N85K663K678P0k318l122l27l0K3J72k83%k80j5q9
1673B8P1J28n4j48J03j6n2K0L1J64j68QK1j1j3j1m7N4j6N7o5M9%j9K6p2O5P7r8k2mJ16j04
1364I8q8N5Q9R4m5j42N6L4qr4Q6r4K8L5m8J10r9j7R0o0J23j43M8R0Mm3k2kj04R2j3O3o4Rm6
1035G2k8J58n7N2l8N9j35J7q4O8O8J3j02R7q0L1MJ90j39R8Kj50J87k03J70K5O1Qr0J29L61
744G64p7M14K866R599J425j2212j827J31j84j63j89K99k43n63M44J378J041k311J765O21L536
547F514N214K0705K6830m7866k927l328k326j737r36O1MJ72K0j29J56j85q3P29L28l87m11
349D18k42M1r4J03j62J74j24J2R6m9Q7k42O3k3oN5J7N1k7l4p6Q1K60k73L7J46j08j35P1q8
68B9J15o7Ro6R9J1l9J0J4Q5q9K3K1K1m1l5NN3O8j14K2J3p1M8j7n0Q4o7oP8R7k12j0J10NL7
$$ plain form
-270 173 146 65 139 135 157 60 152 119 180 92 249 104 222
$$ packed form
-270A73k7q1P4mK2r7R2l3O1q8J57j45J18
-392B22
##PAGE=	F1=-3387.82
##FIRST=	4405.895418600002813,	4405.895418600002813,	0
##DATA TABLE=	(F2++(Y..Y)), PROFILE
$$ plain form
4406 19 283 151 248 82 212 164 112 95 115 179 167 110 208 69 90 73 294 14 176 88 100 108 103 148 79 201 83 143 33 192
4124 192 174 60 222 57 50 81 213 166 166 173 131 111 129 62 185 324 97 115 226 104 97 34 111 140 277 68 154 78 111 69 110
3833 110 112 174 54 58 78 64 25 58 17 170 231 156 134 144 121 95 103 24 220 80 105 110 48 91 89 159 183 39 147 263 186 135 57 82
3514 82 42 106 67 37 197 142 73 145 186 155 214 29 99 31 60 80 107 42 88 79 104 86 147 43 231 204 150 239 62 92 19 16 108 128
3195 128 118 66 321 276 421 126 584 294 30 37 118 187 135 65 103 114 215 92 20 232 73 147 257 205 109 115 97 227 132 104
2913 104 92 86 145 233 52 143 175 55 126 123 36 36 74 35 110 95 117 104 96 143 103 113 160 50 95 117 65 71 82 102 80 69 38 90 164 57
2575 57 93 93 149 140 112 138 177 76 115 96 75 165 128 58 40 92 279 158 139 78 149 34 45 110 100 191 233 125 26 145 23 78 164
2265 164 30 53 70 41 46 137 113 66 51 110 49 112 101 60 89 39 102 39 105 135 76 155 179 104 29 92 45 37 62 104 94 182 118 200 98
$$ packed form
4406A9K64j32R7j66J30m8n2j7K0O4j2n7R8j39K1j7K21k80J62q8J2QnM5o9J22j18O0j10J59
4124A92j8j14J62j65pL1J32m7%Pm2k0J8o7J23J39k27J8J11j22po3P7K9J37k09Q6p6L3m2M1
3833A10KO2j20MK0j4l9L3m1J53O1p5k2J0k3k6Qp9J96j40K5No2M3kP0K4j44J08J16p7n1p8K5
3514H2m0O4l9l0J60n5o9P2M1l1N9j85P0o8K9K0K7o5M6rK5j8O1j04J88k7n4Q9j77L0p3lR2K0
3195A28j0n2K55m5J45k95M58k90k64PQ1O9n2p0L8J1J01j23p2K12j59P4J10n2r6Oj8J30r5k8
2913A04j2oN9Q8j81R1L2j20P1lq7%L8l9P5j5K2j3qM7m0J0M7j10M5K2n2OJ1K0k2j1l1N2P4j07
2575E7L6%N6rk8K6L9j01L9j9k1R0l7p0j8N2J87j21j9o1P1j15J1O5j0R1M2j08r9J19j22N5Q6
2265A64j34K3J7k9NR1k4m7j5N9o1O3j1m1K9n0O3o3O6L0n9P9K4p5p5O3m7qK5M2j0Q8o4Q2j02
$$ plain form
1936 98 24 54 34 124 212 66 109 43 199 222 152 238 137 609 2374 3973 4037 2659 554 326 322 503 523 328 284 168 123 70
1673 70 49 174 171 11 136 115 106 72 96 291 122 90 181 145 91 113 79 102 113 184 114 88 95 72 115 143 155 210 70 83 94 203 108
1364 108 34 139 135 222 189 79 160 176 145 39 135 57 59 105 62 153 79 95 135 82 173 74 111 197 190 147 126 94 73 129 143 197 86 133
1044 133 123 54 202 126 235 127 293 50 103 33 95 170 185 62 205 80 122 114 290 258 279 334 176 335 98 221 379 345
781 345 507 371 713 917 1119 1266 3705 20064 21925 2550 1175 1450 1107 1056 883 706 542 101 1140 6333 9973
584 9973 9257 6483 2499 4990 9599 29160 53950 10666 8428 5395 3284 1546 580 343 162 253 355 200 327
406 327 232 71 751 905 692 335 140 217 133 220 10 183 38 143 182 175 266 75 102 38 10 100 114 157 98 100 60 136 378 134
124 134 140 280 202 81 100 75 145 54 107 11 155 138 59 124 107 216 120 139 165 214 176 79 116 179 165 119 126 113 132 102 107 79 137 115 57
$$ packed form
1936I8p4L0k0R0Q8j46M3o6J56K3p0Q6j01M72J765J599O4j378k105k28mJ81K0j95m4j16m5n3
1673G0k1J25lj60J25k1rl4K4J95j69l2R1l6n4K2l4K3J1P1p0k6Pk3M3K8J2N5j40J3J1J09r5
1364A08p4J05mQ7l3j10Q1J6l1j06R6p8KM6m3R1p4J6M0n3R1r9L7Q6pm3k1l2k1N6J4N4j11M7
1044A33j0o9J48p6J09j08J66k43N3p0O2P5J5j23J43j25M2qJ76l2K1N5j58J59k37J23J58l4
781C45J62j36L42K04K02J47K439J6359J861j9375j375K75l43n1j73j77j64m41J039N193L640
584I973p16k774l984K491M609J9561K4790m3284k238l033k111j738r66k37j81R1J02j55J27
406C27r5j61O80J54k13l57j95P7q4Q7k10J73j45J05L9pR1j91K7o4k8R0J4M3n9Km0P6K42k44
124A34OJ40p8j21J9k5P0r1N3r6J44j7p9O5j7J09r6J9K6M9l8r7L7O3j4m6Pj3J9l0Nk8N8k2n8
$$ plain form
-205 57 95 238 19 29 136 135 241 159 107 99 144 192 65 203 166 208 153 226 97 228
$$ packed form
-205E7L8J43k19J0J07jJ06q2n2qM5M8j27J38l7M2n5P3j29J31
-392B28
##PAGE=	F1=-3406.6
##FIRST=	4405.895418600002813,	4405.895418600002813,	0
##DATA TABLE=	(F2++(Y..Y)), PROFILE
$$ plain form
4406 35 274 126 264 92 192 137 106 107 89 154 155 86 164 83 92 62 270 25 159 82 95 110 118 105 92 191 104 130 67 121 146 42 197
4096 197 62 73 89 184 157 168 161 121 139 101 69 201 300 66 117 212 98 85 54 95 128 249 65 160 82 182 61 125 121 181 51
3805 51 43 87 23 18 74 9 169 250 149 142 144 128 110 120 25 210 84 132 104 46 50 92 165 166 42 136 274 184 160 62 98 38 86 95 32 171
3467 171 155 48 140 169 112 214 49 79 47 78 71 91 44 99 80 75 74 168 44 198 192 194 254 59 83 62 9 75 90 93 23 340 231 456
3148 456 198 579 323 91 27 151 186 112 91 130 151 231 66 2 214 119 124 319 244 103 115 65 196 122 113 81 86 159 231 45 147
2857 147 201 83 143 136 31 37 79 20 99 68 88 63 108 107 115 85 136 63 99 85 75 48 52 143 81 62 36 87 173 50 93 119 105 164 129 143
2519 143 183 108 89 65 67 148 97 27 44 87 298 190 145 87 170 63 75 110 71 237 249 119 36 153 39 101 167 55 66 70 5 17
2218 17 161 100 70 56 116 6 260 202 72 73 58 93 74 162 118 76 137 182 122 43 122 62 46 58 105 78 164 126 197 97 67 41 42 132
$$ packed form
4406C5K39j48J38j72J00n5l1Jj8O5Jo9P8q1Rl0K08k45J34p7J3J5Qj3j3R9q7K6o3N4K5j04J55
4096A97j35J1J6R5k7J1pm0J8l8l2J32R9k34N1R5j14j3l1M1L3J21j84R5p8J00j21O4mO0j30
3805E1qM4o4nN6o5J60Q1j01pKj6j8J0r5J85j26M8k8n8MM2P3Jj24R4J38r0k4r8L6o0M8Ro3J39
3467A71j6j07R2K9n7J02j65L0l2L1pK0m7N5j9njR4j24J54oKO0j95K4k1n3O6J5Lp0L17j09K25
3148D56k58L81k56k32o4J24L5p4k1L9K1Q0j65o4K12r5NJ95p5j41J2n0J31p4rl2NP3P2j86J02
2857A47N4j18O0pj05OM2n9P9l1K0k5M5jQl0N1p3L6j4j0k7MR1o2j9k6N1Q6j23M3K6j4N9l5J4
2519A43M0p5j9k4KQ1n1p0J7M3K11j08m5n8Q3j07J2L5l9J66J2j30q3J17j14O2O6j12J1Mo5J2
2218A7J44o1l0j4O0j10K54n8j30Jj5L5j9Q8m4m2O1M5o0p9P9o0j6J2M7k7Q6l8P1j00l0k6JR0
$$ plain form
1899 132 268 104 50 73 214 248 232 201 225 503 2251 3611 3791 2387 525 270 219 427 385 225 171 185 151 82 26 116 164
1645 164 29 129 113 129 89 92 286 124 78 225 168 84 114 82 81 118 195 139 32 46 44 169 326 202 192 33 95 103 205 105 73
1354 73 191 102 173 164 103 184 183 132 43 119 72 45 107 70 134 100 121 120 85 153 86 101 182 175 139 100 71 121 131 159 204 73 155 161 63 194
1016 194 127 245 115 328 42 125 34 104 180 187 35 212 77 116 130 248 325 261 346 205 335 144 179 423 359 599 380 831
753 831 801 1339 1259 4285 19532 20837 2669 1231 1498 993 1025 836 543 497 44 1189 6370 10377 10278 6913 1793
556 1793 3443 7206 23575 43956 9032 7645 5179 3527 2061 1173 577 313 92 291 128 172 194 77 538 577
368 577 520 252 106 201 114 187 26 152 52 157 129 166 239 135 109 22 53 103 89 126 50 61 135 153 359 164 136 247 212 105
86 105 90 103 152 20 105 34 172 126 54 127 111 215 136 142 164 231 199 68 143 193 74 142 98 82 143 75 112 96 106 126 53 70 196
$$ packed form
1899A32J36j64n4K3J41L4j6l1K4K78J748J360J80j404j862k55n1K08m2j60n4J4l4o9n6R0M8
1645A64j35J00j6J6m0LJ94j62m6J47n7q4L0l2jL7P7n6j07J4kJ25J57j24j0j59O2QJ02j00l2
1354G3J18q9P1ro1Q1jn1q9P6m7k7O2l7O4l4K1jl5O8o7J5Q1pl6l9k9N0J0K8M5j31Q2Or8J31
1016A94o7J18j30K13k86Q3r1P0P6Pj52J77j35L9J4J18P7o4Q5j41J30j91L5K44o4K40k19M51
753H31l0N38q0L026J5247J305j8168j438K67n05L2j89k93m6m53J145N181M007r9l365n120
556A793J650L763J6369K0381l4924j387k466j652j466q88n96k64k21J99j63M4K2j17M61L9
368E77n7k68j46R5q7P3j61J26j00J05k8L7P3j04k6q7L1N0j4L7p6J1P4J8K06j95k8J11l5j07
86A05j5J3M9j32Q5p1J38m6p2P3j6J04p9OK2O7l2j31P5N0j19O8m4j6O1o8L7j6J0K0p3J7J26
$$ plain form
-223 196 41 44 129 95 262 163 118 83 126 181 70 219 154 188 150 206 79 182
$$ packed form
-223A96j55LQ5l4J67r9m5l5M3N5j11J49o5L4l8N6j27J03
-392A82
##PAGE=	F1=-3425.38
##FIRST=	4405.895418600002813,	4405.895418600002813,	0
##DATA TABLE=	(F2++(Y..Y)), PROFILE
$$ plain form
4406 70 238 85 229 113 151 83 80 128 58 103 104 53 96 93 79 84 224 53 123 70 91 99 144 34 105 159 102 110 111 35 114 65 148 69 80
4077 80 103 136 119 156 124 106 148 80 54 194 253 33 116 186 96 83 48 55 110 214 46 156 93 222 79 150 127 175 54 18 84 40
3777 40 62 95 7 143 246 136 146 122 123 109 131 28 175 99 153 100 38 11 89 157 139 50 115 269 168 178 70 109 45 49 101 66
3476 66 154 159 26 142 156 49 217 73 62 63 87 49 63 58 89 77 43 63 169 45 165 177 235 259 59 72 108 32 36 57 46 31 338
3166 338 184 468 232 556 317 152 35 158 170 114 103 152 180 235 63 22 180 150 112 351 233 87 124 42 160 119 125 70
2903 70 90 171 224 56 137 202 103 156 150 38 31 93 53 78 37 46 26 118 59 118 52 111 99 98 57 82 84 24 164 72 46 54 72 176 91 86 123
2556 123 75 184 141 143 188 130 51 30 50 123 63 32 66 93 292 223 147 91 189 98 112 116 37 263 253 122 31 143 64 112 158 83 71
$$ packed form
4406G0J68j53J44j16L8o8lM8p0M5Jn1M3lj4NJ40j71P0n3K1QM5j10P1N4n7QJp6P9m9Q3p9J1
4077H0K3L3j7L7l2j8M2o8k6J40N9k20Q3P0r0j3l5PN5J04j68J10o3J29j43P1k3M8j21l6O6m4
3777D0K2L3q8J36J03j10J0k4Jj4K2j03J47p6N4n3o2k7P8O8j8q9O5J54j01J0j08L9o4MN2l5
3476F6Q8Nj33J16J4j07J68j44j1JK4l8J4nL1j2l4K0J06j24J20J2N8K4k00J3L6p6MK1j1j5L07
3166C38j54K84k36L24k39j65j17J23J2n6j1M9K8N5j72m1J58l0l8K39j18j46L7q2J18m1On5
2903G0K0Q1N3j68Q1O5r9N3oj12pO2m0K5m1Rk0R2n9N9o6N9j2jm1K5Ko0J40r2k6QJ8J04q5nL7
2556A23m8J09m3KM5n8p9k1K0P3o0l1L4K7J99o9p6n6R8r1J4Mp9K26j0j31r1J12p9M8M6p5j2
$$ [...]
-392I3
##END NTUPLES=	nD NMR SPECTRUM
##END=	
##END=	
