##TITLE=	tRTsCSg+QHWyzJGtm+aVPQ.24.ser
TM-VI-158 hmbc

##JCAMP-DX=	6.0	$$ MestReNova 14.3.1-31739
##DATA TYPE=	LINK
##BLOCK_ID=	1
##BLOCKS=	2    
##ORIGIN=	Mestrelab Research S.L.
##OWNER=	hrzepa
##$MNOVA/LINK_BLOCK_TYPE=	ITEM	$$ NMR Spectrum
##$MNOVA/ITEM/POLYGON=	(XY..XY)
5321,5835
8722,5835
8722,8208
5321,8208
5321,5835
##$MNOVA/ITEM/Z=	0
##$MNOVA/ITEM/ANGLE=	0
##TITLE=	tRTsCSg+QHWyzJGtm+aVPQ.24.ser
##JCAMP-DX=	6.0	$$ MestReNova 14.3.1-31739
##BLOCK_ID=	2
##DATA TYPE=	MNOVA NMR VIEW DATA
##DATA CLASS=	MNOVA VIEW DATA
##$MNOVA/2D/THRESHOLD=	4.6376481056213378906
##$MNOVA/ITEM/ZOOM/X=	-0.47501081208716700033,	14.504330000039219684
##$MNOVA/ITEM/ZOOM/Y=	-9.5107036222489718114,	249.98529999918474687
##END=	
##TITLE=	tRTsCSg+QHWyzJGtm+aVPQ.24.ser
##JCAMP-DX=	6.0	$$ MestReNova 14.3.1-31739
##BLOCK_ID=	3
##DATA TYPE=	nD NMR SPECTRUM
##DATA CLASS=	NTUPLES
##NUMDIM=	2
##ORIGIN=	Bruker BioSpin GmbH
##OWNER=	nmr
##.OBSERVE FREQUENCY=	400.41280287000000726
##.OBSERVE NUCLEUS=	^1H
##.SOLVENT NAME=	CD2Cl2
##.PULSE SEQUENCE=	hmbcgplpndqf
##LONGDATE=	2021/11/11 21:27:25.000
##.ACQUISITIONMODE=	SIMULTANEOUS (DQD)
##$ORIGINAL FORMAT=	Bruker XWIN-NMR
##$MNOVA/SCALES_VERSION=	9
##$PARAMETER FILE=	(acqu2s, ASCII, /private/var/folders/f6/rjf_tdyn2v98c5c0wvkgn4s80000gn/T/tRTsCSg+QHWyzJGtm+aVPQ/24/acqu2s, 0)
$$ ##TITLE= Parameter file, TOPSPIN		Version 3.2
$$ ##JCAMPDX= 5.0
$$ ##DATATYPE= Parameter Values
$$ ##NPOINTS= 129	$$ modification sequence number
$$ ##ORIGIN= Bruker BioSpin GmbH
$$ ##OWNER= nmr
$$ $$ 2021-11-11 21:47:01.661 +0000  nmr@CZC10666PP
$$ $$ /opt/topspin/data/agmb/nmr/Nov11-2021/24/acqu2s
$$ $$ process /opt/topspin3.2/prog/mod/go
$$ ##$ACQT0= 0
$$ ##$BF1= 100.683175
$$ ##$FnMODE= 1
$$ ##$NUC1= <13C>
$$ ##$NusJSP= 0
$$ ##$NusT2= 1
$$ ##$NusTD= 128
$$ ##$O1= 12080.308799824
$$ ##$SFO1= 100.6952553088
$$ ##$SW= 259.972631192251
$$ ##$SW_h= 26178.0104712042
$$ ##$TD= 128
$$ ##END=
$$ 
##$PARAMETER FILE=	(acqus, ASCII, /private/var/folders/f6/rjf_tdyn2v98c5c0wvkgn4s80000gn/T/tRTsCSg+QHWyzJGtm+aVPQ/24/acqus, 0)
$$ ##TITLE= Parameter file, TOPSPIN		Version 3.2
$$ ##JCAMPDX= 5.0
$$ ##DATATYPE= Parameter Values
$$ ##NPOINTS= 12	$$ modification sequence number
$$ ##ORIGIN= Bruker BioSpin GmbH
$$ ##OWNER= nmr
$$ $$ 2021-11-11 21:47:05.810 +0000  nmr@CZC10666PP
$$ $$ /opt/topspin/data/agmb/nmr/Nov11-2021/24/acqus
$$ $$ process /opt/topspin3.2/prog/mod/shimcntl
$$ ##$ACQT0= 1000000
$$ ##$AMP= (0..31)
$$ 100 100 100 100 100 100 100 100 100 100 100 100 100 100 100 100 100 100
$$ 100 100 100 100 100 100 100 100 100 100 100 100 100 100
$$ ##$AMPCOIL= (0..19)
$$ 0 0 0 0 0 0 0 0 0 0 0 0 0 0 0 0 0 0 0 0
$$ ##$ANAVPT= -1
$$ ##$AQSEQ= 0
$$ ##$AQ_mod= 3
$$ ##$AUNM= <au_zg>
$$ ##$AUTOPOS= <52 >
$$ ##$BF1= 400.41
$$ ##$BF2= 100.683175
$$ ##$BF3= 400.41
$$ ##$BF4= 400.41
$$ ##$BF5= 400.41
$$ ##$BF6= 400.41
$$ ##$BF7= 400.41
$$ ##$BF8= 400.41
$$ ##$BYTORDA= 0
$$ ##$CAGPARS= (0..11)
$$ 0 0 0 0 0 0 0 0 0 0 0 0
$$ ##$CFDGTYP= 0
$$ ##$CFRGTYP= 9
$$ ##$CHEMSTR= <none>
$$ [...]
$$ 0 0 0 0
$$ ##$ShimPowMaxUC= (0..63)
$$ 130000 130000 130000 130000 130000 130000 130000 130000 130000 130000 130000
$$ 130000 130000 130000 130000 130000 130000 130000 130000 130000 0 0 0 0
$$ 0 0 0 0 0 0 0 0 0 0 0 0 0 0 0 0 0 0 0 0 0 0 0 0 0 0 0 0 0 0 0 0 0 0 0 0
$$ 0 0 0 0
$$ ##$ShimPowMaxUG= (0..63)
$$ 524287 524287 524287 524287 524287 524287 524287 524287 524287 524287 524287
$$ 524287 524287 524287 524287 524287 524287 524287 524287 524287 0 0 0 0
$$ 0 0 0 0 0 0 0 0 0 0 0 0 0 0 0 0 0 0 0 0 0 0 0 0 0 0 0 0 0 0 0 0 0 0 0 0
$$ 0 0 0 0
$$ ##$ShimPowRcbType= 3
$$ ##$ShimPowRes= (0..63)
$$ 1e-20 1e-20 1e-20 1e-20 1e-20 1e-20 1e-20 1e-20 1e-20 1e-20 1e-20 1e-20
$$ 1e-20 1e-20 1e-20 1e-20 1e-20 1e-20 1e-20 1e-20 0 0 0 0 0 0 0 0 0 0 0 0
$$ 0 0 0 0 0 0 0 0 0 0 0 0 0 0 0 0 0 0 0 0 0 0 0 0 0 0 0 0 0 0 0 0
$$ ##$ShimPowRng0= (0..63)
$$ 1 1 1 1 1 1 1 1 1 1 1 1 1 1 1 1 1 1 1 1 0 0 0 0 0 0 0 0 0 0 0 0 0 0 0 0
$$ 0 0 0 0 0 0 0 0 0 0 0 0 0 0 0 0 0 0 0 0 0 0 0 0 0 0 0 0
$$ ##$ShimPowRng1= (0..63)
$$ 1 1 1 1 1 1 1 1 1 1 1 1 1 1 1 1 1 1 1 1 0 0 0 0 0 0 0 0 0 0 0 0 0 0 0 0
$$ 0 0 0 0 0 0 0 0 0 0 0 0 0 0 0 0 0 0 0 0 0 0 0 0 0 0 0 0
$$ ##$ShimPowRng2= (0..63)
$$ 1 1 1 1 1 1 1 1 1 1 1 1 1 1 1 1 1 1 1 1 0 0 0 0 0 0 0 0 0 0 0 0 0 0 0 0
$$ 0 0 0 0 0 0 0 0 0 0 0 0 0 0 0 0 0 0 0 0 0 0 0 0 0 0 0 0
$$ ##$ShimPowRng3= (0..63)
$$ 1 1 1 1 1 1 1 1 1 1 1 1 1 1 1 1 1 1 1 1 0 0 0 0 0 0 0 0 0 0 0 0 0 0 0 0
$$ 0 0 0 0 0 0 0 0 0 0 0 0 0 0 0 0 0 0 0 0 0 0 0 0 0 0 0 0
$$ ##$ShimSysFunc= (0..63)
$$ 1 2 3 4 5 7 9 11 15 16 8 10 12 14 6 17 13 18 19 20 0 0 0 0 0 0 0 0 0 0
$$ 0 0 0 0 0 0 0 0 0 0 0 0 0 0 0 0 0 0 0 0 0 0 0 0 0 0 0 0 0 0 0 0 0 0
$$ ##$ShimSysMatrix= 0
$$ ##$ShimSysType= 1
$$ ##$TFXNUM= 0
$$ ##$TRIPLO2= 0
$$ ##$VTU= 2
$$ ##$VTUETH= <149.236.99.20>
$$ ##$VTUTY= <no>
$$ ##$WBREFAM= (0..15)
$$ 135 116 100 100 100 100 100 100 100 100 100 100 100 100 100 100
$$ ##$WBREFLM= (0..15)
$$ 0 0 0 0 0 0 0 0 0 0 0 0 0 0 0 0
$$ ##$WBREFPH= (0..15)
$$ 71.66 -68.25 0 0 0 0 0 0 0 0 0 0 0 0 0 0
$$ ##$WBSGU= (0..15)
$$ 0 0 0 0 0 0 0 0 0 0 0 0 0 0 0 0
$$ ##$XFAC= 2
$$ ##END=
$$ 
##$DECIM=	3328
##$DSPFVS=	20
##.ACQUISITIONSCHEME=	NOT PHASESENSITIVE
##NTUPLES=	nD NMR SPECTRUM
##VAR_NAME=	FREQUENCY1,	FREQUENCY2,	SPECTRUM
##SYMBOL=	F1,	F2,	Y
##.NUCLEUS=	13C,	1H
##.OBSERVE FREQUENCY=	100.69525530880000019,	400.41280287000000726
##VAR_TYPE=	INDEPENDENT,	INDEPENDENT,	DEPENDENT
##VAR_FORM=	AFFN,	AFFN,	ASDF
##VAR_DIM=	512,	512,	262144
##UNITS=	HZ,	HZ,	ARBITRARY UNITS
##FIRST=	25169.313707327481097,	5807.6787752999953227,	0.18679592013359069824
##LAST=	-957.56783717514929322,	-190.19907926730809322,	0.13374158740043640137
##MIN=	-957.56783717514929322,	-190.19907926730809322,	0.00097922782879322767258
##MAX=	25169.313707327481097,	5807.6787752999953227,	76.29871368408203125
##FACTOR=	1,	1,	0.0030138980286378083684
##PAGE=	F1=25169.3
##FIRST=	25169.313707327481097,	5807.6787752999953227,	0.18679592013359069824
##DATA TABLE=	(F2++(Y..Y)), PROFILE
$$ [...]
##PAGE=	F1=15557.1
##FIRST=	25169.313707327481097,	5807.6787752999953227,	0.63779306411743164063
##DATA TABLE=	(F2++(Y..Y)), PROFILE
$$ plain form
5409 102 18 195 268 42 135 218 119 165 94 9 219 212 157 117 167 26 32 78 16 70 180 295 277 187 79 99 116 45 64 68 192 167
5033 167 194 143 116 79 55 192 59 268 157 91 148 81 97 19 38 95 51 88 97 152 231 204 182 178 138 317 255 186 70 63 187 199 89
4646 89 178 177 93 76 71 100 158 201 129 74 36 57 172 209 159 117 12 41 69 82 76 130 142 189 285 59 77 48 190 181 189 226 72 84 178
4235 178 124 125 67 51 136 154 168 93 138 124 158 112 125 125 172 108 130 151 221 179 179 71 67 82 40 203 270 242 147 186 131 185 39 105 68
3824 68 91 213 185 10 206 206 119 140 77 91 29 53 86 267 252 235 370 93 51 313 342 108 90 250 112 140 73 80 131 52 134
3460 134 291 134 201 236 112 52 187 221 236 98 255 133 46 71 39 102 95 171 38 33 133 162 56 184 99 135 152 197 109 125
3108 125 105 78 45 71 71 180 121 132 276 203 187 254 77 253 185 179 187 122 45 36 51 102 73 29 116 85 114 137 52 110 163 9 183 142
2709 142 219 87 93 199 218 56 125 102 116 121 161 141 43 11 172 298 350 305 293 234 66 151 97 132 63 194 85 100 56 118 167 220
$$ packed form
5409A02q4J77P3k26R3Q3r9M6p1q5K10pn5m0N0j41OM6o2N4J10J15j8r0j08K0J7p1J9MJ24k5
5033A67K7n1k7l7k4J37j33K09j11o6N7o7J6p8J9N7m4L7RN5P9k7k2mm0J79o2o9j16pJ24J2j10
4646H9Q9jq4j7nK9N8M3p2n5l8K1J15L7n0m2j05K9K8J3oN4J2M7R6k26J8k9J42rQL7j54J2R4
4235A78n4Jn8j6Q5J8J4p5M5j4L4m6J3%M7o4K2K1P0m2%j08mJ5m2J63O7k8r5L9n5N4j46O6l7
3824F8K3J22k8j75J96%q7K1o3J4o2K4L3J81j5j7J35k77m2K62K9k34j8J60j38K8o7PN1p9Q2
3460A34J57j57O7L5j24o0J35L4J5j38J57j22q7K5l2O3pP6j33nJ00K9j06J28q5L6J7M5q8J6
3108A25k0k7l3K6%J09n9J1J44p3j6O7j77J76o8oQo5p7rJ5N1k9m4Q7l1K9K3q5N8N3j54J74m1
2709A42P7j32OJ06J9j62O9k3J4NM0k0r8l2J61J26N2m5j2n9j68Q5n4L5o9J31j09J5m4O2M9N3
$$ plain form
2333 220 145 197 60 121 86 161 171 71 50 106 289 325 181 204 131 87 171 105 104 92 202 203 40 134 90 36 102 96 85 204 167 40
1958 40 175 151 110 247 162 93 22 184 270 112 62 58 92 84 18 75 62 91 86 32 49 125 221 109 96 54 163 187 91 65 238 276 60
1570 60 64 137 29 140 91 85 211 224 133 30 115 92 189 88 35 90 117 42 105 176 101 129 214 35 271 101 215 84 166 79 179
1207 179 74 86 129 173 54 240 98 151 175 102 150 193 48 221 165 190 307 206 143 152 90 220 294 198 105 183 8 146 136 128
854 128 370 144 165 15 69 92 89 112 262 249 206 147 88 111 185 132 98 168 76 155 160 81 79 62 30 112 135 84 129 190 198 155 106 179 126
444 126 153 258 143 162 140 34 94 54 14 81 120 152 93 91 50 230 269 183 74 34 77 207 75 185 101 58 57 46 79 13 119 16
68 16 198 28 208 85 141 173 46 182 312 279 128 218 60 185 269 156 87 143 9 174 230 140
$$ packed form
2333B20p5N2j37O1l5P5J0j00k1N6J83L6j44K3p3m4Q4o6jj2J10Jj63R4m4n4O6oj1J19l7j27
1958D0J35k4m1J37q5o9p1J62Q6j58n0mL4qo6N7j3K9nn4J7P6R6j12j3m2J09K4r6k6J73L8k16
1570F0MP3j08J11m9oJ26J3r1j03Q5k3R7j01n3N5K7p5O3P1p5K8Q5j79K36j70J14j31Q2q7J00
1207A79j05J2M3M4j19J86j42N3K4p3M8M3j45J73n6K5J17j01o3Ro2J30P4r6r3P8j75J38j0q
854A28K42k26K1j50N4K3lK3J50j3m3n9n9K3P4n3l4P0r2P9Np9kj7l2Q2K3n1M5O1Qm3m9P3n3
444A26K7J05j15J9k2j06O0m0m0O7L9L2n9km1J80L9q6j09m0M3J30j32J10q4m3jj1L3o6J06j03
68A6J82j70J80j23N6L2j27J36J30l3j51R0j58J25Q4j13o9N6j34J65N6r0
-190A40
##PAGE=	F1=15454.8
##FIRST=	25169.313707327481097,	5807.6787752999953227,	0.53509163856506347656
##DATA TABLE=	(F2++(Y..Y)), PROFILE
$$ plain form
5808 68 60 108 23 95 125 180 107 98 71 101 64 98 55 35 69 75 216 253 214 75 136 47 142 95 267 252 91 85 131 79 59 35 104 129 34
5397 34 176 230 58 156 249 110 235 141 26 208 233 145 101 199 52 59 114 39 106 195 284 223 166 91 128 109 38 47 7 170 169 191 123
5010 123 110 48 62 193 77 213 118 99 184 56 63 17 27 137 57 85 87 160 215 218 162 163 104 290 258 204 55 58 204 194 68 108 164
4622 164 107 63 70 74 141 243 147 61 31 29 257 249 140 136 32 40 68 13 126 103 88 226 246 72 170 57 184 206 154 207 103 85 235
4235 235 152 153 74 59 198 190 201 141 153 164 152 130 102 144 243 119 165 168 163 124 141 75 50 103 54 205 239 244 195 198 76 199 26 100 98
3824 98 106 239 189 15 144 129 114 128 78 92 14 89 114 269 261 200 345 98 17 290 327 125 88 192 117 95 70 29 95 63 157 278
3448 278 164 179 234 151 65 157 205 277 108 254 93 43 37 66 142 105 203 90 15 135 181 110 179 61 164 162 201 116 112 92 30 37 34
3061 34 74 135 52 107 255 182 176 241 110 250 159 156 206 200 73 106 58 98 147 18 85 28 139 152 54 146 184 32 137 99 200 96
$$ packed form
5808F8qM8q5P2L0N5p3rk7L0l7L4m3k0L4OJ41L7l9j39O1q9R5m7J72j5j61oM6n2k0k4O9K5r5
5397C4J42N4j72R8R3j39J25r4j15J82K5q8m4R8j47PN5p5O7Q9Q9o1n7p5L7j9p1Rm0J63jK2o8
5010A23j3o2J4J31j16J36r5j9Q5j28Pm6J0J10q0K8KP3N5Ln6Jn9J86l2n4j49LJ46j0j26M0N6
4622A64n7m4PMO7J02r6q6l0kK28qj09mj04QK8n5J13k3j5J38K0j74R8j13J27K2n2N3j04j8J50
4235B35q3Jp9j5J39qJ1o0J2J1j2k2k8M2R9j24M6Lnl9J7o6k5N3m9J51L4Nm9Lj22J23j73P4k
3824I8QJ33n0j74J29j5j5J4n0J4p8P5K5J55qo1J45k47q1K73L7k02l7J04p5k2k5m1O6l2R4J21
3448B78j14J5N5q3q6R2M8P2j69J46j61n0oK9P6l7R8j13p5J20M6p1O9j18J03kL9q5mk0o2Pl
3061C4M0O1q3N5J48p3oO5j31J40r1lN0oj27L3m8M0M9j29O7n7J11J3r8R2L8j52J05l8J01j04
$$ plain form
2685 96 95 224 298 121 111 62 89 91 163 156 52 41 189 298 308 252 266 248 40 99 130 143 68 175 82 89 52 64 154 183 148 159 26
2298 26 127 69 167 164 79 73 126 219 277 164 189 153 117 166 94 159 78 229 183 18 125 125 26 58 71 97 185 121 12 182 133 116 246
1911 246 112 129 62 116 210 95 84 70 75 56 17 87 113 120 98 71 40 114 219 125 118 91 162 170 117 81 207 230 55 87 146 6 128
1523 128 100 72 220 190 95 45 135 80 193 101 85 91 110 78 68 170 59 149 151 39 252 69 224 114 100 46 120 64 68 107 158 21
1148 21 262 116 147 218 152 194 217 68 208 168 153 264 156 96 138 135 255 303 233 133 184 29 145 123 75 270 159 165 60 92
796 92 25 75 86 257 212 225 214 233 73 233 153 121 162 87 150 173 105 143 64 18 100 116 86 141 157 194 133 110 216 142 136 173 66 182
397 182 136 13 90 36 62 81 65 107 90 96 60 203 235 184 49 26 77 223 105 141 93 21 62 40 84 33 116 39 179 41 198 60
21 60 105 163 79 165 229 218 130 232 43 143 268 130 108 146 41 166 238 101
$$ packed form
2685I6jJ29P4j77j0m9K7KP2pj04j1J48J09J0n6J4j8k08N9L1J3p5J07r3Pl7J2R0K9l5J1j33
2298B6J01n8R8lq5oN3R3N8j13K5l6l6M9p2O5q1J51m6j65J07%r9L2J3K6Q8o4j09J70m9j7J30
1911B46j34J7o7N4R4j15j1j4Nj9l9P0K6Pk2k7l1P4J05r4pk7P1Qn3l6J26K3j75L2N9j40J22
1523A28k8k8J48l0r5n0R0n5J13r2j6OJ9l2j0J02j11R0Kj12K13j83J55j10j4n4P4n6ML9N1j37
1148B1K41j46L1P1o6M2K3j49J40m0j5J11j08o0M2lJ20M8p0j00N1j55J16k2m8J95j11Oj05L2
796I2o7N0J1J71m5J3j1J9j60J60q0l2M1p5O3K3o8L8p9m6Q2J6l0N5J6L7o1k3J06p4oL7j07J16
397A82m6j23P7n4K6J9j6M2j7Ol6J43L2n1j35k3N1J46j18L6m8p2M1k2M4n1Q3p7J40j38J57j38
21F0M5N8q4Q6O4j1q8J02j89J00J25j38k2L8j05J25P2j37
-190A01
##PAGE=	F1=15352.6
##FIRST=	25169.313707327481097,	5807.6787752999953227,	0.29731169342994689941
##DATA TABLE=	(F2++(Y..Y)), PROFILE
$$ plain form
5808 23 104 109 61 99 141 221 135 129 97 103 43 130 58 28 95 67 198 245 203 104 154 60 109 98 255 231 53 91 141 85 23 25 106 142 63 168
5385 168 185 74 165 264 132 294 187 57 181 223 103 97 230 74 86 148 74 131 206 244 150 142 103 158 118 59 94 42 137 157 178
5021 178 145 102 39 84 187 129 141 87 81 210 68 38 52 36 181 78 92 93 149 204 230 143 154 65 265 238 220 37 104 211 177 107
4646 107 49 131 109 63 52 40 121 269 195 63 24 87 318 275 115 156 72 37 76 71 191 85 36 238 186 152 237 88 166 220 148
4282 148 188 130 79 267 178 176 101 72 231 209 228 204 176 190 156 152 100 197 317 137 191 177 88 62 138 87 51 140 61 195 197 233 217 202
3883 202 10 211 43 89 147 129 237 176 29 70 77 122 103 68 93 53 120 148 256 247 197 270 74 22 236 290 175 83 128 94 53
3519 53 147 89 58 70 161 258 176 148 214 174 137 114 179 313 146 244 79 122 6 116 170 105 205 128 13 134 180 146 169 45 196
3155 196 156 190 119 102 70 21 27 31 77 109 14 96 216 127 148 226 137 219 136 148 217 252 125 154 58 103 201 65 66 27 147 163 40 163
$$ packed form
5808B3Q1Nm8L8M2Q0q6ol2Oo0Q7p2l0O7k8J31M7m2r9N0r4M9j1J57k4j78L8N0n6o2KQ1L6p9J05
5385A68J7j11R1R9j32J62j07j30J24M2j20oJ33j56J2O2p4N7P5L8r4ql9N5m0n9L5n2R5K0K1
5021A78l3m3o3M5J03n8J2n4oJ29j42l0J4j6J45j03J4JN6N5K6q7J1q9K00k7j8j83O7J07l4p0
4646A07n8Q2k2m6j1j2Q1J48p4j32l9O3K31m3j60M1q4l5L9nJ20j06m9K02n2l4Q5j49P8N4p2
4282A48M0n8n1J88q9kp5k9J59k2J9k4k8J4l4mn2R7J20j80N4j4q9k6P6n1l6Q9p9J34KL6j6j5
3883B02j92K01j68M6N8j8J08o1j47M1PM5j9l5K5m0O7K8J08rn0P3j96n2K14N4j15r2M5l4m1
3519E3R4n8l1J2R1R7q2k8O6m0l7k3O5J34j67R8j65M3j16J10N4o5J00p7j15J21M6l4K3j24J51
3155A96m0L4p1j7l2m9OMM6L2r5Q2J20q9K1P8q9Q2q3J2O9L5j27K9r6M5R8j36Jl9J20J6j23J23
$$ plain form
2756 163 184 56 83 72 171 100 74 248 356 181 87 58 51 52 168 162 49 81 195 288 270 192 238 255 52 43 164 149 72 136 68 73 57
2369 57 72 177 152 140 120 10 127 77 166 141 71 79 141 149 219 139 172 167 144 151 105 195 62 250 171 10 106 163 47 38 49 127 147 70
1970 70 19 166 90 92 203 51 162 113 66 142 69 96 84 56 21 21 92 161 172 116 111 31 98 197 120 126 126 158 141 132 101 141 167 57 129 176
1547 176 39 117 113 66 228 140 46 48 132 82 210 137 135 92 109 116 136 143 47 153 70 82 214 37 215 139 25 64 71 92 80 79 132 48
1148 48 262 147 116 249 188 225 225 81 165 141 123 209 91 67 126 173 263 279 244 180 165 63 147 96 22 161 172 168 120 99 59 92 87
761 87 230 165 231 264 398 56 266 171 137 154 126 136 184 124 201 76 6 101 99 94 132 121 199 112 119 215 126 103 76 65 181 125 24 97
361 97 38 104 72 33 57 103 94 68 162 186 177 102 41 64 234 143 104 81 38 89 53 76 60 97 82 150 74 178 30 68 144 111 129 149 148 126
-61 126 229 91 130 261 114 97 145 60 160 241 59
$$ packed form
2756A63K1j28K7j1R9p1k6J74J08j75r4k9pJJ16oj13L2J14R3j8p8M6J7k03rJ21j5p7O4o8Nj6
2369E7J5J05k5j2k0j10J17n0Q9k5p0QO2QP0q0L3nk3Pm6R0j33J88p9j61R6N7j16rJ1P8K0p7
1970G0n1J47p6KJ11j52J11m9m7P6p3K7j2k8l5%P1O9J1n6nq0O7R9p7O%L2j7rl1M0K6j10P2M7
1547A76j37P8mm7J62q8r4KQ4n0J28p3km3J7PK0Pr6J06q3J2J32j77J78p6j14L9PK1j2jN3q4
1148D8K14j15l1J33o1L7%j44Q4k4j8Q6j18k4N9M7R0J6l5o4j5j02Q4n1p4J39J1mm8k1m0L3n
761H7J43o5O6L3J34l42K10r5l4J7k8J0M8o0P7j25p0R5knL8j1P8q7PR6q9k3k7j1J16n6j01P3
361I7n9O6l2l9K4M6rk6R4K4rp5o1K3J70r1l9k3m3N1l6K3j6L7j5O8p6J04j48L8P6l3J8K0jk2
-61A26J03j38L9J31j47j7M8q5J00Q1j82
-190E9
##PAGE=	F1=15250.3
##FIRST=	25169.313707327481097,	5807.6787752999953227,	0.15169213712215423584
##DATA TABLE=	(F2++(Y..Y)), PROFILE
$$ plain form
5808 43 128 91 87 106 147 235 166 166 101 96 36 163 76 7 102 70 166 231 204 149 173 105 75 73 208 197 12 100 145 75 99 10 109 145 92 178
5385 178 145 79 151 248 172 336 227 81 139 189 35 115 257 90 110 173 109 138 196 181 88 119 112 172 129 97 127 60 104 127 154 192
5010 192 106 89 118 174 173 69 123 48 218 90 31 76 64 222 102 107 99 119 194 229 125 157 58 254 200 226 38 159 201 140 140 94
4634 94 79 96 72 21 76 107 276 243 81 13 137 344 273 81 178 105 25 95 147 253 91 31 224 117 209 266 111 143 222 168
4282 168 164 145 74 270 189 180 149 94 230 200 255 257 193 202 162 154 108 252 379 161 203 169 11 12 156 82 74 177 63 176 153 201 207 197
3883 197 50 225 79 67 191 158 211 153 48 44 112 141 74 50 92 84 135 176 225 204 222 171 40 69 157 232 227 84 73 49 43 218 159
3495 159 25 74 148 233 174 118 178 174 196 62 145 338 185 221 78 182 50 165 183 94 182 147 26 126 157 147 156 51 229 144
3143 144 164 122 96 44 62 38 41 94 102 52 101 169 66 134 211 145 167 125 151 213 264 163 170 49 114 228 100 41 76 149 165 21 155
$$ packed form
5808D3Q5l7mJ9M1Q8o9%o5no0J27q7o9R5l2R6O5k7n5K4o8l0kJ35j1j85Q8M5p0K4q9R9L6n3Q6
5385A78l3o6P2R7p6J64j09j46N8N0j54Q0J42j67K0O3o4K9N8j5r3L1pO0m3l2L0o7M4K3K7L8
5010A92q6j7K9N6jj04N4p5J70j28n9M5j2J58j20NqK0P5L5j04L2r9J96n4K6j88J21M2o1%m6
4634I4j5J7k4n1N5L1J69l3j62o8J24K07p1j92R7p3q0P0N2J06j62o0J93j07R2N7j55L2P9n4
4282A68mj9p1J96q1rl1n5J36l0N5Ko4Rm0qm6J44J27k18M2l4j58JJ44p4qJ03j14J13k3M8Oj0
3883A97j47J75j46j2J24l3N3n8j05mO8K9o7k4M2qN1M1M9k1J8n1j31K9Q8P5nj43j1k4oJ75n9
3495A59j34M9P4Q5n9n6O0mK2j34Q3J93j53L6j43J04j32J15J8q9Q8l5j21J00L1j0Rj05J78q5
3143A44K0m2k6n2J8k4LN3Qn0M9O8j03O8P7o6K2m2K6O2N1j01Pj21O5J14j28n9L5P3J6j44J34
$$ plain form
2756 155 153 68 38 69 138 101 42 263 376 215 60 86 23 31 172 154 43 113 190 267 246 160 226 249 81 44 193 150 86 99 42 67
2380 67 65 119 214 133 129 88 25 118 107 150 107 47 65 146 99 159 111 157 171 156 126 117 208 51 263 176 57 87 194 75 59 38 148 94
1981 94 64 48 139 29 48 135 15 186 146 59 91 55 98 99 54 10 41 88 195 220 127 146 24 90 170 94 114 149 155 109 128 130 50 105
1582 105 61 171 218 65 104 121 55 229 86 6 44 106 92 233 172 168 87 105 148 223 119 58 152 27 118 173 13 197 158 46
1230 46 79 39 115 79 57 103 95 241 183 65 259 201 237 216 91 101 108 106 139 60 98 115 195 249 229 223 217 136 92 156 61 36 83 182 170 182
807 182 95 102 114 102 183 123 219 248 473 81 274 182 145 147 170 122 190 135 242 79 27 110 84 108 106 87 208 93 121 175 88 73 16
420 16 116 160 110 53 98 49 128 53 18 26 122 84 73 117 143 176 168 62 40 233 171 88 68 78 122 79 58 82 82 104 127 100 150 20 73
9 73 133 141 79 115 76 107 207 154 167 255 103 89 137 63 158 238 33
$$ packed form
2756A55kq5l0L1O9l7n9K21J13j61j55K6o3QJ41j8j11P0P7P7k1q6O6K3j68l7J49m3o4J3n7K5
2380F7kN4R5q1mm1o3R3j1M3m3o0J8Q1m7O0m8M6J4j5l0rR1j57K12q7j19L0J07j19j6k1J10n4
1981I4l0j6R1j10J9Q7j20J71m0q7L2l6M3Jm5m4L1M7J07K5r3J9j22O6Q0p6K0L5Om6J9Kq0N5
1582A05m4J10M7j53L9J7o6J74j43q0L8O2j4J41o1mq1J8M3P5j04o1R4j25R1N5j60J84l9j12
1230D6L3m0P6l6k2M6qJ46n8j18J94n8L6k1j25J0PkL3p9L8J7Q0N4k0ooq1m4O4r5k5M7R9j2J2
807A82q7PJ2j2Q1o0R6K9K25l92J93r2l7KK3m8O8n5J07j63n2Q3k6K4kj9J21j15K8N4q7j5n7
420A6J00M4n0n7M5m9P9p5l5QR6l8j1M4K6L3qj06k2J93o2q3k0J0M4m3k1K4%K2K3k7N0j30N3
9G3O0Qo2L6l9L1J00n3J3Q8j52j4M8p4R5Q0k05
-190C3
##PAGE=	F1=15148
##FIRST=	25169.313707327481097,	5807.6787752999953227,	0.19909331202507019043
##DATA TABLE=	(F2++(Y..Y)), PROFILE
$$ plain form
5808 64 133 62 96 112 142 220 184 197 89 85 34 188 123 57 85 76 129 209 212 192 185 148 44 35 135 154 32 104 136 51 152 22 107 146
5409 146 112 196 115 63 117 193 213 359 257 99 86 162 53 149 278 100 130 184 142 130 163 119 109 105 118 166 130 140 143 60 87 80 121
5021 121 229 123 149 156 159 205 75 201 40 206 105 33 84 98 255 126 127 94 77 177 213 107 166 82 256 155 217 57 193
4681 193 177 93 150 167 22 72 67 39 135 99 265 278 101 24 162 331 245 64 203 125 13 126 213 299 115 65 187 57 225
4340 225 255 119 124 209 189 135 144 69 249 181 162 205 125 205 162 278 288 196 199 155 130 111 289 418 189 198 134 52 47 162 58 110 205
3953 205 72 155 114 152 171 185 87 239 118 36 219 191 167 127 63 99 171 156 67 56 84 105 129 187 176 133 245 123 91 117 79 159
3578 159 257 90 49 15 79 268 216 30 74 123 204 167 111 133 149 226 9 104 350 215 183 72 213 88 201 184 75 145 151 44
3225 44 111 114 110 140 62 250 139 136 128 97 22 105 75 36 135 118 67 117 131 106 154 189 129 101 122 158 188 233 179 157 29 125 230 113 2
$$ packed form
5808F4O9p1L4J6L0P8l6J3j08mn1J54o5o6K8rN3Q0Lk0pl7j04rJ00J9j22P2L2q5J01j30Q5L9
5409A46l4Q4q1n2N4P6K0J46j02j58j3P6j09R6J29j78L0N4m2j2L3m4j0mJ3M8l6J0Lq3K7pM1
5021A21J08j06K6PLM6j30J26j61J66j01p2N1J4J57j29Jl3j7J00L6j06N9q4J74j01O2j60J36
4681A93j6q4N7J7j45N0nk8R6l6J66J3j77p7J38J69q6j81J39p8j12J13Q7Q6j84n0J22j30J68
4340B25L0j36NQ5k0n4Rp5J80o8j9M3q0Q0m3J16J0r2Lm4k5j9J78J29k29Ro4q2nJ15j04N2R5
3953B05j33Q3m1L8J9J4r8J52j21q2J83k8k4m0o4L6P2j5q9j1K8K1K4N8j1m3J12j22l2K6l8Q0
3578A59R8j67m1l4O4J89n2j86M4M9Q1l7n6K2J6P7k17R5K46j35l2j11J41j25J13j7j09P0Oj07
3225D4O7LmL0p8J88j11lql1p5Q3l0l9R9j7n1N0J4k5M8L5o0k8K1L6L0M5n4k2j28R6J05j17j11
$$ plain form
2815 2 134 155 160 48 126 90 71 54 81 111 103 51 262 353 214 36 113 84 61 170 132 43 129 178 234 234 170 235 227 99 93 215 146 107
2416 107 98 9 97 75 160 247 126 120 73 41 95 146 121 79 18 39 133 79 108 86 144 169 146 102 118 197 45 269 199 112 79 208 96
2028 96 85 44 146 36 106 71 121 35 65 89 63 196 154 70 81 68 91 109 79 18 77 75 210 244 123 172 20 106 160 54 78 151
1653 151 157 86 101 163 48 87 64 200 263 79 83 126 46 218 54 57 47 68 101 246 192 177 75 102 171 290 130 60 162 125 143
1289 143 140 24 188 171 102 70 30 125 54 49 89 135 208 215 23 246 187 225 193 101 30 114 105 60 128 140 108 195 224 173 175 228 118 106 173
878 173 48 74 99 184 167 233 106 116 125 116 125 111 190 157 406 77 252 181 147 146 199 114 187 135 262 80 62 112 73 127 78 65 217
491 217 75 107 104 40 64 76 142 124 93 88 80 67 129 36 24 58 140 71 76 81 124 185 217 68 35 213 181 88 58 102 145 107 44 105 103 99 117
56 117 122 121 41 113 139 168 26 149 42 74 173 207 220 250 94 125 119 55 160 232 36
$$ packed form
2815BJ32K1Nj12P8l6j9j7K7L0qn2K11R1j39j78P7k9k3J09l8q9Q6M9N6%o4O5qj28oJ22o9l9
2416A07rq9Q8k2Q5Q7j21om7l2N4N1k5m2o1K1R4n4K9k2N8K5k3m4J6P9j52K24p0q7l3J29j12
2028I6j1m1J02j10P0l5N0q6L0K4k6J33m2q4J1j3K3J8l0o1N9kJ35L4j21M9j52Q6N4j06K4P3
1653A51Op1J5O2j15L9k3J36O3j84MM3q0J72j64Lj0K1L3J45n4j5j02K7O9J19j60p0J02l7J8
1289A43lj16J64j7o9l2m0R5p1nM0M6P3Pj92K23n9L8l2r2p1Q4rm5O8J2l2Q7K9n1KN3j10j2O7
878A73j25K6K5Q5j7O6j27J0RrRj4P9l3K49l29J75p1l4jN3q5P3n2J27j82j8N0l9N4m9j3J52
491B17j42L2lo4K4J2O6j8l1nqj3O2r3j2L4Q2o9NNM3O1L2j49l3J78l2r3l0M4M3l8o3O1kmJ8
56A17Njq0P2K6K9j42J23j07L2R9L4J3L0j56L1oo4J05P2j96
-190C6
##PAGE=	F1=15045.8
##FIRST=	25169.313707327481097,	5807.6787752999953227,	0.15402577817440032959
##DATA TABLE=	(F2++(Y..Y)), PROFILE
$$ plain form
5808 60 123 31 90 110 126 177 185 217 71 80 32 193 183 128 49 81 100 181 222 226 185 172 25 50 55 103 74 94 115 23 176 59 95 156 118
5397 118 207 91 25 71 103 239 364 274 114 35 174 137 190 292 103 141 176 175 124 120 116 182 110 121 151 126 184 151 53 101 27 83 236
5010 236 144 202 192 150 232 141 274 74 173 108 28 74 133 274 147 148 78 32 155 185 92 173 101 257 114 194 67 191 151 82 137
4646 137 226 70 40 42 90 171 84 238 292 115 39 156 287 202 97 230 131 27 159 259 327 139 89 137 37 201 212 115 117
4305 117 179 195 100 125 62 216 157 135 257 162 173 112 288 289 184 180 132 91 106 299 431 220 177 73 89 80 146 29 144 224 102
3941 102 138 84 94 125 169 93 250 155 31 227 222 115 103 68 144 213 153 94 102 69 121 105 174 116 49 240 179 177 157 83 96 252 91
3554 91 57 70 128 297 255 57 69 92 168 173 147 87 104 220 45 63 351 240 139 56 213 109 216 177 52 110 150 64 89 63
3202 63 56 128 77 249 141 126 139 100 11 147 118 27 182 152 58 135 113 191 182 155 93 32 120 162 142 173 175 128 11 136 213 95 64
$$ packed form
5808F0O3r2N9K0J6N1QL2j46Rm8J61j0n5p9L2J9Q1M1Mm1j3j47K5NM8k9K0K1r2J53j17L6O1l8
5397A18Q9j16o6M6L2J36J25r0j60p9J39l7N3J02j89L8L5jn1mmO6p2J1L0k5N8l3r8M8p4N6J53
5010B36r2N8j0m2Q2r1J33k00R9o5q0M6N9J41j27Jp0m6J23L0r3Q1p2J56j43Q0j27J24m0o9N5
4646A37Q9j56l0KM8Q1q7J54N4j77p6J17J31q5j05J33r9j04J32J00O8j88n0M8j00J64J1r7K
4305A17O2J6r5K5o3J54n9k2J22r5J1o1J76Jj05mm8m1J5J93J32k11m3j04J6rO6j17J15Q0j22
3941A02L6n4J0L1M4p6J57r5j24J96nj07j2l5P6O9o0n9Ql3N2j6O9n8o7J91o1kk0p4J3J56j61
3554I1l4J3N8J69m2j98J2K3P6Nk6o0J7J16j75J8K88j11j01q3J57j04J07l9j25N8M0q6K5k6
3202F3pP2n1J72j08j5J3l9q9J36k9r1J55l0r4P7k2P8rk7o2o1Q8M2k0L1Km7j17J25P7j18l1
$$ plain form
2815 64 194 167 149 84 97 30 74 89 95 98 111 101 239 290 185 24 134 161 94 157 94 48 124 159 191 225 196 253 190 100 129 223 130 124
2416 124 122 43 152 86 190 269 124 117 77 57 61 178 89 92 33 19 97 70 84 76 133 164 110 101 105 169 46 270 232 157 73 203 106 102 50
2005 50 118 52 148 85 133 90 131 114 99 189 136 75 86 86 75 108 122 17 116 55 204 237 102 189 21 147 174 29 28 133 161 86 55
1617 55 182 132 117 64 206 298 88 60 133 70 193 82 103 55 47 104 240 196 159 53 117 186 323 172 45 189 218 157 116 64
1265 64 198 178 135 36 47 125 13 62 91 159 171 236 50 218 151 190 168 115 51 155 113 42 209 160 111 171 198 131 111 207 125 96
890 96 189 76 96 135 173 157 263 136 101 119 122 64 129 148 164 270 57 201 170 145 150 203 112 174 129 261 97 98 99 66 148 76 64 222
491 222 58 76 46 34 71 102 135 80 74 122 36 89 107 38 63 94 156 58 77 60 119 189 236 51 73 171 174 92 55 103 150 128 53 130 153
80 153 74 115 140 96 51 143 152 189 27 197 87 37 136 241 254 245 101 179 93 53 163 222 48
$$ packed form
2815F4J30k7j8o5J3o7M4J5OLJ3j0J38N1j05j61J10K7o7O3o3m6P6L5L2L4k9N7o3r0K9R4r3o
2416A24kp9J09o6J04P9j45pm0k0MJ17q9Ln9j4P8k7J4qN7L1n4rMO4j23K24l8p5q4J30r7mn2
2005E0O8o6R6o3M8m3M1j7j5R0n3o1J1%j1L3J4j05R9o1J49L3j35Q7j68J26K7j45jJ05K8p5l1
1617E5J27n0j5n3J42R2k10k8P3o3J23j11K1m8qN7J36m4l7j06O4O9J37j51j27J44K9o1m1n2
1265F4J34k0m3r9J1P8j12M9K9O8J2O5j86J68o7L9k2n3o4J04m2p1J67m9m9O0K7o7k0R6q2k9
890I6R3j13K0L9L8j6J06j27l5J8Ln8O5J9J6J06k13J44l1k5NN3r1O2m5J32j64JJl3Q2p2j2J58
491B22j64J8l0j2L7L1L3n5oM8q6N3J8o9K5L1O2r8J9j7N9P0M7j85K2R8Lq2l7M8M7k2p5P7K3
80A53p9M1K5m4m5R2RL7j62J70j10n0R9J05J3rj44P8q6m0J10N9j74
-190D8
##PAGE=	F1=14943.5
##FIRST=	25169.313707327481097,	5807.6787752999953227,	0.28204369544982910156
##DATA TABLE=	(F2++(Y..Y)), PROFILE
$$ plain form
5808 34 104 8 73 97 105 118 170 220 55 89 31 172 237 201 8 88 91 160 228 248 174 169 25 103 71 51 110 67 90 47 171 90 71 178
5409 178 112 199 73 33 35 8 246 352 273 122 34 209 204 230 299 106 141 151 206 150 106 174 248 127 124 152 138 225 164 45 127 51
5033 51 45 210 161 239 221 159 262 198 323 102 123 97 10 52 162 278 160 170 57 35 134 153 92 177 107 244 86 160 59 152
4681 152 139 128 111 259 137 12 38 134 169 58 199 286 115 42 122 226 164 145 252 125 52 180 276 332 152 98 88 50 148
4340 148 154 106 121 135 182 69 94 51 188 128 120 289 196 149 94 273 259 166 151 101 70 95 284 420 251 145 19 98 103 111 48 168
3965 168 234 146 127 59 40 89 161 74 258 186 75 217 242 68 83 58 169 236 126 137 159 49 131 74 136 81 70 198 241 254 180
3601 180 149 105 210 76 64 124 177 309 279 76 55 52 122 194 203 51 48 177 87 33 343 263 109 31 189 112 203 164 39 91 153
3237 153 82 65 50 83 121 100 224 142 142 153 99 18 185 153 38 220 190 37 153 103 250 194 112 53 33 116 160 81 109 154 101 38
$$ packed form
5808C4P0r6O5K4QJ3N2N0j65L4n8J41O5l6j93Q0LO9O8K0p4nj44P8l2k0N9m3K3m3J24q1j9J07
5409A78o6Q7j26m0Kk7K38J06p9j51q8J75nK6O9j93L5J0N5n6m4O8P4j21lK8j4Q7o1j19Q2p6
5033E1oJ65m9P8j8o2J03o4J25k21K1k6q7M2J10J16j18J0j13k2R9J9o1Q5p0J37j58P4j01R3
4681A52j3j1j7J48j22j25K6R6L5j11J41Q7j71p3Q0J04o2j9J07j27p3J28R6N6j80n4j0l8R8
4340A48Om8J5J4M7j13K5m3J37o0qJ69r3m7n5J79j4r3j5n0l1K5J89J36j69j06j26P9NQo3J20
3965A68O6q8j9o8j9M9P2q7J84p2j11J42K5j74J5k5J11O7j10J1K2j10Q2n7O2n5j1J28M3J3p4
3601A80l1m4J05j34j2O0N3J32l0k03k1lP0P2Rj52lJ29r0n4L10q0j54p8J58p7R1l9j25N2O2
3237A53p1j7j5L3L8k1J24q2%J1n4q1J67l2j15J82l0j53J16n0J47n6q2n9k0Q3M4p9K8M5n3o3
$$ plain form
2862 38 152 188 44 139 242 178 133 104 108 109 81 111 97 95 125 150 204 202 142 26 156 229 112 128 43 49 98 132 145 215 219 270 140 88 143
2451 143 211 97 130 134 88 204 95 209 274 120 117 88 69 22 195 65 141 64 48 49 51 100 84 126 152 57 123 84 130 51 269 259 176
2063 176 56 180 102 108 42 66 118 181 91 162 123 182 150 121 163 97 71 78 92 54 90 169 53 146 35 185 200 84 199 24 193
1700 193 200 47 43 101 164 96 20 176 187 140 57 183 313 113 55 141 118 160 126 144 55 71 103 216 186 123 30 156 197 320 216
1336 216 25 223 292 162 88 114 216 180 141 18 77 121 58 95 89 165 137 242 76 190 105 142 153 134 114 194 128 109 268 147
984 147 126 129 178 117 47 164 154 65 192 103 100 141 148 140 265 167 74 98 125 17 151 101 326 305 97 130 151 145 157 180 114 147 119 246
584 246 128 125 67 55 165 102 80 221 43 31 115 86 77 93 108 41 52 153 33 115 70 46 106 120 171 41 75 50 108 175 224 16
209 16 114 109 152 95 50 79 134 134 81 151 206 60 111 154 78 44 146 157 198 60 228 131 17 110 253 253 235 134 216 61 76 165 208
$$ packed form
2862C8J14L6j44R5J03o4m5k9MJk8L0j4kL0K5N4ko0j16J30P3j17J6q5OM9L4J3P0MN1j30n2N5
2451A43O8j14L3Mm6J16j09J14O5j54lk9j9m7J73j30P6p7j6JKM9j6M2K6r5O6l9M6p9K18j0q3
2063A76j20J24p8Oo6K4N2O3r0P1l9N9l2k9M2o6k6PJ4l8L6P9j16R3j11J50J5j16J15j75J69
1700A93Pj53mN8O3o8p6J56J1m7q3J26J30k00n8Q6k3M2l4J8q9J6L2J13l0o3r3J26M1J23j04
1336B16j91J98O9j30p4K6J02l6l9j23N9M4o3L7oP6k8J05j66J14q5L7J1j9k0Q0o6j9J59j21
984A47k1LM9o1p0J17j0q9J27q9lM1PqJ25r8r3K4K7j08J34n0K25k1k08L3K1oJ2K3o6L3k8J27
584B46j18ln8j2J10o3k2J41j78j2Q4k9rJ6J5o7J1J01j20Q2m5k4O0J4N1j30L4k5N8O7M9k08
209A6R8nM3n7m5K9N5%n3P0N5j46N1M3p6l4J02J1M1j38J68r7j14R3J43%j8j01Q2j55J5Q9M3
$$ plain form
-178 208 71
$$ packed form
-178B08j37
-190G1
##PAGE=	F1=14841.3
##FIRST=	25169.313707327481097,	5807.6787752999953227,	0.39635831117630004883
##DATA TABLE=	(F2++(Y..Y)), PROFILE
$$ plain form
5808 27 80 11 57 77 83 68 146 204 47 115 31 125 273 257 39 96 101 163 229 258 172 141 34 149 142 50 134 37 71 86 149 104 52 206
5409 206 101 172 76 98 42 119 235 323 253 116 57 228 243 262 296 111 131 115 230 209 144 232 288 141 125 179 174 257 190 38 149
5045 149 108 28 163 180 258 240 189 297 236 339 112 79 74 20 47 179 269 162 190 46 74 126 130 103 182 113 208 70 119 47 85 144
4669 144 182 89 263 185 39 86 160 127 42 155 267 101 23 65 163 145 179 265 115 80 178 262 314 147 92 52 48 82 99 103 130 82
4294 82 153 74 58 37 173 102 123 296 219 135 124 227 201 149 127 91 90 82 250 392 281 111 93 80 120 68 87 172 235 191 122 35 17
3906 17 73 166 43 259 208 116 199 244 51 81 39 177 245 84 186 207 38 127 63 77 121 157 122 261 304 179 200 166 143 51 59
3542 59 173 221 308 296 80 36 19 82 219 254 31 35 106 114 31 323 279 115 10 152 108 166 148 48 96 167 92 47 92 154 117 127
3167 127 184 132 169 169 88 38 214 171 62 238 215 15 164 77 265 178 68 52 90 114 153 12 82 124 92 66 176 169 38 215
$$ packed form
5808B7N3o9M6K0Oj5P8N8j57O8q4R4J48j6k18N7NO2O6K9q6l1j07J15pr2Q4r7L4J5O3m5n2J54
5409B06j05P1r6K2n6P7J16Q8p0j37n9J71J5J9L4j85K0j6J15k1o5Q8N6j47j6N4nQ3o7j52J11
5045A49m1q0J35J7P8j8n1J08o1J03k27l3nn4K7J32R0j07K8j44K8N2Mk7P9o9R5j38M9p2L8N9
4669A44L8r3J74p8j46M7P4l3q5J13J12j66p8M2R8j8L4Q6j50l5R8Q4N2j67n5m0mL4J7MK7m8
4294H2P1p9j6k1J36p1K1J73p7q4j1J03k6n2k2l6jqJ68J42j11j70j8j3M0n2J9Q5O3m4o9q7j8
3906A7N6R3j23K16n1r2Q3M5j93L0m2J38O8j61J02K1j69Q9o4J4M4L6l5J39M3j25K1l4k3r2Q
3542E9J14M8Q7j2k16m4j7O3J37L5k23MP1Qq3K92m4j64j05J42m4N8j8j00M8P1p5m5M5O2l7J0
3167A27N7n2L7%q1n0J76m3j09J76k3k00J49q7J88q7j10j6L8K4L9j41P0M2l2k6J10pj31J77
$$ plain form
2815 215 266 177 112 101 153 193 87 113 83 93 140 187 172 116 115 41 181 277 115 83 21 43 57 94 122 208 236 276 92 82 138 175 46
2427 46 120 118 124 238 98 222 261 107 116 99 76 18 192 58 196 84 90 60 21 131 94 125 129 16 146 56 89 62 268 268 161 33
2052 33 144 87 102 29 22 179 206 88 182 129 199 156 133 118 42 60 57 83 32 55 210 111 161 33 168 147 91 201 31 224 224 53
1676 53 91 72 158 97 76 143 205 138 44 132 302 158 74 140 163 129 159 177 43 99 104 179 169 101 37 204 210 283 246 16 249 336 159
1289 159 52 162 223 173 121 83 111 120 125 142 73 156 115 234 78 172 65 89 148 158 161 217 152 159 290 103 141 81 165 122 7 113
913 113 189 22 176 110 90 119 107 117 239 185 75 74 131 51 157 60 411 383 123 56 124 154 166 141 117 107 108 226 152 136 31 42
538 42 174 133 93 212 33 22 202 140 79 72 110 37 25 182 119 144 41 40 136 134 187 19 68 55 101 145 189 31 141 37 125 100
162 100 33 41 105 123 110 160 248 102 103 158 69 24 116 142 187 73 232 150 20 107 243 216 219 178 225 32 111 163 191 108
$$ packed form
2815B15N1q9o5j1N2M0j06K6l0J0M7M7j5n6jp4J40R6j62l2o2K2J4L7K8Q6K8M0j84j0N6L7j29
2427D6P4kOJ14j40J24L9j54Rj7k3n8J74j34J38j12Ol0l9J10l7L1Mj13J30r0L3k7K06%j07j28
2052C3J11n7J5p3pJ57K7j18R4n3P0m3k3j5p6J8lK6n1K3J55r9N0j28J35k1n6J10j70J93%j71
1676E3L8j9Q6o1k1O7O2o7r4Q8J70j44q4O6K3l4L0J8j34N6NP5j0o8o4J67OP3l7k30K33Q7j77
1289A59j07J10O1n0n2l8K8RNJ7o9Q3m1J19j56R4j07K4N9J0LN6o5PJ31j87L8o0Q4m3j15J06
913A13P6j67J54o6k0K9j2J0J22n4j10jN7q0J06r7L51k8k60o7O8L0J2k5k4j0JJ18p4j6j05J1
538D2J32m1m0J19j79j1J80o2o1pL8p3j2J57o3K5j03jR6kN3j68M9j3M6M4M4j58J10j04Q8k5
162A00o7QO4J8j3N0Q8j46JN5q9m5R2K6M5j14J59q2j30Q7J36k7Lm1M7j93P9N2K8q3
-190A08
##PAGE=	F1=14739
##FIRST=	25169.313707327481097,	5807.6787752999953227,	0.29107075929641723633
##DATA TABLE=	(F2++(Y..Y)), PROFILE
$$ plain form
5808 64 59 41 52 64 66 77 122 171 48 154 38 65 286 284 64 101 119 186 223 256 193 99 42 178 197 111 141 58 60 111 125 95 68 225
5409 225 89 129 101 156 55 212 221 279 214 86 60 213 249 282 285 120 118 75 244 274 194 265 296 140 123 212 217 272 226 46 159 153
5033 153 45 129 214 263 251 237 330 252 322 101 90 43 57 85 178 253 152 202 52 105 132 123 111 190 124 155 61 75 81 55 152 221 87
4646 87 239 201 71 127 165 56 78 116 246 79 17 16 108 138 190 268 114 110 158 220 277 123 77 34 27 22 64 111 138 36 118 112 46 26
4247 26 166 82 124 275 224 121 153 151 126 142 129 116 113 72 206 354 305 86 156 47 133 37 115 155 221 226 122 8 41 65 169 20
3871 20 252 216 136 182 225 75 101 35 175 246 78 233 235 61 100 71 12 184 229 35 230 315 160 224 220 65 44 46 219 262 300
3507 300 310 69 21 66 92 235 290 25 96 32 130 53 286 280 149 44 114 109 119 130 70 127 188 92 45 132 204 112 143 144 110 191 183 73
3108 73 66 227 164 79 237 215 1 164 29 230 138 35 92 138 118 144 61 94 93 95 82 203 165 135 282 256 159 88 76 195 245 89
$$ packed form
5808F4nj8J1J2KJ1M5M9j23J06j16K7K21kk20L7J8O7L7L3o3r4n7J36J9q6L0q3KN1J4l0k7J57
5409B25j36M0k8N5j01J57RN8o5j28k6J53L6L3Lj65km3J69L0q0P1L1j56j7Q9NN5m6j80J13o
5033A53j08Q4Q5M9j2j4R3p8P0k21j1m7J4K8R3P5j01N0j50N3K7rj2P9o6L1r4J4Ok6R7O9j34
4646H7J52l8j30N6L8j09K2L8J30j67o2jR2L0N2P8j54mM8O2N7j54m6m3pnM2M7K7j02Q2oo6k0
4247B6J40q4M2J51n1j03L2kk5J6j3j3lm1J34J48m9k19P0j09Q6r6P8M0O6Nj04j14L3K4J04j49
3871B0K32l6q0M6M3j50K6o6J40P1j68J55Kj74L9k9n9J72M5j94J95Q5j55O4mj55k1KJ73M3L8
3507C00J0k41m8M5K6J43N5k65P1o4R8p7K33oj31j05P0nJ0J1o0N7O1r6m7Q7P2r2L1Jl4Q1qj10
3108G3pJ61o3q5J58k2k14J63j35K01r2j03N7M6k0K6q3L3jKj3J21l8l0J47k6r7p1j2J19N0j56
$$ plain form
2732 89 100 55 92 154 211 159 83 123 67 205 295 105 29 88 38 38 45 147 204 252 263 87 106 125 124 17 95 69 142 242 105 234 230
2345 230 82 112 105 82 45 176 72 238 89 131 127 19 155 93 126 94 57 157 23 55 75 265 258 126 63 106 69 88 70 84 225
1981 225 225 75 181 111 178 130 136 56 21 39 34 66 25 18 235 170 159 52 166 87 108 195 45 225 235 28 114 65 142 75 128 92 191
1594 191 111 25 64 264 207 88 123 192 113 172 203 55 110 111 139 151 125 70 244 228 221 258 18 251 345 149 18 194 208 155 81
1230 81 146 140 126 188 191 44 141 119 218 58 165 40 45 142 185 190 226 179 184 271 47 143 40 155 133 16 71 212 37 141 91 69
854 69 82 54 96 190 186 111 74 147 92 141 36 325 258 90 8 94 178 170 97 117 60 92 206 157 131 53 35 170 155 96 195 35 75 268
455 268 186 76 92 164 68 7 209 204 173 61 16 141 134 203 51 57 87 126 115 143 76 153 50 107 104 22 50 73 98 133 150 271 165
68 165 103 146 67 26 59 110 152 64 208 141 36 128 217 155 197 211 217 11 145 155 168 150
$$ packed form
2732H9J1m5L7O2N7n2p6M0n6J38R0j90p6N9n0%PJ02N7M8J1j76J9J9jj07P8k6P3J00j37J29m
2345B30j48L0pk3l7J31j04J66j49M2mj08J36o2L3l2l7J00j34L2K0J90pj32o3M3l7J9j8J4J41
1981B25%j50J06p0O7m8Oq0l5J8nL2m1pK17o5j1j07J14p9K1Q7j50J80J0k07Q6m9P7o7N3l6R9
1594A91q0q6L9K00n7j19L5O9p9N9L1j48N5JK8J2k6n5J74j6pL7k40K33R4j96j31J76J4n3p4
1230H1O5oj4O2Lj47R7k2R9j60J07j25NR7M3NL6m7NQ7k24R6j03J15k2j17N5J41j75J04n0k2
854F9J3k8M2R4mp5l7P3n5M9j05K89o7j68q2Q6Q4qp3K0n7L2J14m9k6p8j8J35j5n9R9j60M0J93
455B68q2j10J6P2r6o1K02nl1j12m5J25pO9j52OL0L9j1K8o7P7j03N7lq2K8K3K5L5J7J21j06
68A65o2M3p9m1L3N1M2q8J44o7j05R2Q9o2M2J4Ok06J34J0J3j8
-190A50
##PAGE=	F1=14636.8
##FIRST=	25169.313707327481097,	5807.6787752999953227,	0.073398090898990631104
##DATA TABLE=	(F2++(Y..Y)), PROFILE
$$ plain form
5808 99 56 86 54 73 55 120 105 126 50 192 52 51 279 276 66 97 133 208 205 238 227 68 47 186 228 176 128 101 51 113 112 77 98 222
5409 222 78 80 130 192 52 271 220 223 165 30 42 167 223 288 265 126 108 43 242 323 226 267 270 119 113 230 250 263 268 89 154 177
5033 177 63 140 266 260 258 289 353 253 284 75 133 10 95 138 157 236 132 204 66 124 141 134 106 191 130 101 57 30 144 127 149 241
4657 241 100 195 180 95 140 154 30 126 91 232 58 72 79 70 129 183 265 125 145 136 163 224 85 58 32 11 31 62 127 144 38 92 155
4270 155 91 30 155 69 110 235 206 99 156 64 47 144 160 151 109 70 158 312 317 76 181 28 138 53 127 124 191 241 127 23 63
3906 63 51 151 22 236 205 124 178 187 106 123 55 168 238 129 267 240 107 54 71 43 231 272 96 160 284 137 224 244 14 71
3554 71 37 262 298 285 319 54 20 120 145 238 305 28 154 76 146 85 231 256 190 80 83 116 90 112 94 174 213 79 57 159 221
3190 221 100 139 117 81 199 193 66 97 221 134 83 222 187 19 150 55 166 83 26 141 177 129 137 124 100 67 97 80 222 169 236
$$ packed form
5808I9m3L0l2J9j8O5j5K1p6J42j40jK28lk10L1L6P5lL3j1j59k1J39M2n2m8k7n0O2jl5K1J24
5409B22j44KN0O2j40K19n1Ln8j35J2J25N6O5k3j39j8o5J99Q1r7M1Lj51oJ17K0J3Nj79O5K3
5033A77j14P7J26okL1O4j00L1k09N8j23Q5M3J9P9j04P2j38N8J7pk8Q5o1k9m4k7J14j7K2R2
4657B41j41R5j5q5M5J4j24R6l5J41j74J4PrN9N4Q2j40K0rK7O1j39k7k6k1K0L1O5J7j06N4O3
4270A55o4o1J25q6M1J25k9j07N7r2j7R7J6rm2l9Q8J54Nk41J05j53J10q5P4lO7N0j14j04M0
3906F3j2J00j29K14l1q1N4Rq1J7o8J13P0j09J38k7j33n3J7k8J88M1j76O4J24j47Q7K0k30N7
3554G1l4K25L6j3L4k65l4J00K5R3O7k77J26p8P0o1J46K5o6j10LL3k6K2j8Q0L9j34k2J02O2
3190B21j21L9k2l6J18oj27L1J24q7n1J39l5j68J31r5J11q3n7J15L6m8Qj3k4l3L0j7J42n3O7
$$ plain form
2826 236 326 211 125 67 47 215 257 85 82 37 99 163 222 159 115 141 99 220 282 88 48 158 49 87 10 195 201 266 229 146 152 130
2451 130 76 81 68 14 140 216 139 248 185 45 105 108 87 59 159 94 261 86 166 190 45 167 79 121 53 86 153 15 36 86 259
2087 259 233 107 119 83 52 74 141 151 250 237 52 155 78 123 92 127 16 79 30 20 49 43 55 235 210 148 74 178 29 111 175 71
1711 71 193 227 51 100 73 122 29 157 48 163 73 23 52 204 242 84 92 199 116 164 217 113 101 125 104 132 166 100 267 245 149
1347 149 250 41 223 321 133 38 198 174 128 43 193 155 138 239 230 21 124 147 202 49 168 32 17 129 212 201 228 200 183
1007 183 214 66 128 32 142 148 2 50 213 75 99 50 43 46 16 84 133 178 150 102 173 122 110 34 87 174 143 53 82 214 166 59 113
620 113 21 66 184 144 110 99 42 153 166 85 175 56 122 302 215 72 150 231 100 42 233 270 199 97 25 120 126 218 116 54 130
256 130 171 102 104 108 153 118 112 109 69 105 47 75 147 116 272 217 122 119 66 60 44 95 97 43 158 108 79 163 183 90 173 221 215 4 167 140 140 184
$$ packed form
2826B36R0j15q6n8k0J68M2j72lm5O2O4N9o3m4K6m2J21O2j94m0J10j09L8p7J85OO5l7q3Ok2
2451A30n4Nj3n4J26P6p7J09o3j40O0Lk1k8J00o5J67j75Q0K4j45J22q8M2o8L3O7j38K1N0J73
2087B59k6j26J2l6l1K2O7J0R9j3j85J03p7M5l1L5j11O3m9j0K9oJ2J80k5o2p4J04j49Q2O4j04
1711G1J22L4j76M9k7M9r3J28j09J15r0n0K9J52L8j58QJ07q3M8N3j04j2K4k1K8L4o6J67k2r6
1347A49J01k09J82R8j88r5J60k4m6q5J50l8j7J01rk09J03K3N5j53J19j36j5J12Q3j1K7k8j7
1007A83L1j48O2r6J10Oj46M8J63j38K4m9pLl0O8M9M5k8m8P1n1j2p6N3Q7l1r0K9J32m8j07N4
620A13r2M5J18m0l4j1n7J11J3q1R0j19O6J80q7j43P8Q1j31n8J91L7p1j02p2R5OR2j02o2P6
256A30M1o9KMM5l5olm0L6n8K8P2l1J56n5r5ln3oj6N1Kn4J15n0k9Q4K0r3Q3M8ok11J63k7%M4
-190A84
##PAGE=	F1=14534.5
##FIRST=	25169.313707327481097,	5807.6787752999953227,	0.12086813151836395264
##DATA TABLE=	(F2++(Y..Y)), PROFILE
$$ plain form
5808 120 80 139 56 96 51 157 96 78 50 216 67 106 264 237 47 89 140 213 177 204 251 68 51 171 235 232 99 132 41 91 109
5444 109 86 117 196 71 37 146 198 46 292 234 160 123 60 24 101 179 281 245 125 106 30 225 342 233 237 215 81 94 225 263
5092 263 229 304 151 137 178 80 170 322 255 261 331 356 246 236 44 162 19 126 189 119 220 104 193 75 131 138 157 88 173 115 75
4728 75 61 15 206 200 135 246 110 147 128 110 116 137 104 161 82 233 51 130 139 47 119 175 261 142 184 143 111 162 57 41 43 45 55 88
4329 88 148 145 63 85 190 153 47 135 69 87 189 170 69 133 69 23 149 197 178 74 77 107 273 310 85 162 63 127 87 123 89 149
3953 149 230 134 52 89 29 104 47 213 171 78 189 136 128 131 71 159 221 185 277 223 160 66 52 72 246 286 191 80 222 130 211 233 54
3566 54 91 46 293 325 264 312 69 40 159 192 230 298 36 197 139 169 123 163 208 230 106 64 115 88 100 118 225 233 58 70 174
3202 174 213 82 107 94 52 194 197 84 126 199 82 82 198 134 54 124 139 137 49 43 193 207 144 135 174 79 56 103 62 224 169 324 343
$$ packed form
5808A20m0N9q3M0m5J06o1j8k8J66j49L9J58k7j90M2N1P3l6K7M7j83j7J20O4lj33L3r1N0J8
5444A09k3L1P9j25l4J09N2j52K46n8p4l7o3l6P7P8J02l6j20j9p6J95J17j09Mk2j34J3J31L8
5092B63l4P5j53j4M1r8R0J52o7OP0K5j10j0j92J18j43J07O3p0J01j16Q9j18N6PJ9o9Q5n8m0
4728G5j4m6J91oo5J11j36L7j9j8OK1l3N7p9J51j82P9Rr2P2N6Q6j19M2m1l2N1j05j6KKJ0L3
4329H8O0lq2K2J05l7j06Q8o6J8J02j9j01O4o4m6J26M8j9j04LL0J66L7k25P7r9O4m0L6l4O0
3953A49Q1r6q2L7o0P5n7J66m2r3J11n3qLo0Q8O2l6R2n4o3r4j4K0J74M0r5j11J42r2Q1K2j79
3566E4L7m5K47L2o1M8k43k9J19L3L8O8k62J61n8L0m6M0M5K2j24m2N1k7J2J8J07Qj75J2J04
3202A74L9j31K5j3m2J42Lj13M2P3j17%J16o4q0P0J5kq8oJ50J4o3rL9r5k3M7m1J62n5J55J9
$$ plain form
2815 343 139 83 68 62 207 229 86 77 48 115 165 224 155 142 146 132 219 244 69 110 221 79 143 60 236 191 272 184 222 197 168 74 137
2427 137 68 93 117 167 201 264 137 33 103 108 88 62 154 113 260 96 195 233 56 171 63 105 22 91 137 53 39 90 247 206 135
2063 135 164 89 44 83 216 201 254 236 33 108 50 51 84 111 89 127 58 13 37 64 105 206 219 141 94 195 31 96 139 104 143 200 139
1676 139 58 75 118 41 160 52 144 49 42 123 131 248 60 65 183 124 136 217 187 81 144 79 112 190 116 266 252 83 228 96 166
1312 166 273 112 64 173 134 100 70 212 148 150 275 250 45 108 181 192 90 186 64 6 117 236 198 224 206 168 135 134 102 50 125
948 125 161 33 49 189 98 74 18 18 30 66 83 94 174 178 129 201 142 91 41 269 600 298 83 106 247 152 42 106 41 32 155 122
573 122 79 132 51 125 164 63 162 90 157 306 220 72 205 282 126 77 251 302 217 123 71 79 116 226 188 75 165 205 99 82 123
209 123 155 168 133 117 127 155 34 76 150 61 250 243 148 79 58 91 121 136 37 46 96 64 133 199 149 53 148 208 230 6 174 120 106 202
$$ packed form
2815C43k04n6j5oJ45K2j43rk9O7N0N9o9j3Mj4Q7K5j75M1J11j42O4q3J76m5Q1q8L8k5k9r4O3
2427A37o9K5K4N0L4O3j27j04P0Nk0k6R2m1J47j64R9L8j77J15j08M2q3O9M6q4j4N1J57m1p1
2063A35K9p5m5L9J33j5N3j8k03P5n8JL3K7k2L8o9m5K4K7M1J01J3p8m7J01j64O5M3l5L9N7o1
1676A39q1J7M3p7J19j08R2r5pQ1QJ17j88NJ18n9J2Q1l0j06O3o5L3P8p4J50j4j69J45j32P0
1312A66J07j61m8J09l9l4l0J42o4KJ25k5k05O3P3J1j02R6j22n8J11J19l8K6j8l8l3jl2n2P5
948A25L6j28J6J40r1k4n6%J2L6J7J1Q0Mm9P2n9n1n0K28L31l02k15K3J41r5j10O4o5rJ23l3
573A22m3N3q1P4L9j01R9p2O7J49q6j48J33P7j56m9J74N1q5r4n2QL7J10l8j13R0M0j06j7M1
209A23L2J3l5j6J0K8j21M2P4q9J89pr5o9k1L3L0J5r9RN0l2O9O6n0r6R5O0K2k24J68n4j4R6
-190B02
##PAGE=	F1=14432.2
##FIRST=	25169.313707327481097,	5807.6787752999953227,	0.24084874987602233887
##DATA TABLE=	(F2++(Y..Y)), PROFILE
$$ plain form
5808 128 110 186 68 121 48 182 87 37 52 217 80 151 250 179 18 81 137 199 142 151 248 71 55 134 225 272 70 138 34 53 108
5444 108 125 119 151 71 10 139 172 58 281 247 99 112 152 52 47 135 267 229 110 109 39 197 328 219 181 139 35 68 198 257
5092 257 175 322 213 111 158 99 186 367 247 258 346 331 236 195 17 166 39 144 229 72 205 75 172 76 128 116 180 66
4763 66 126 74 90 74 61 250 248 119 244 107 120 58 117 62 127 156 171 87 247 63 180 183 35 118 181 258 156 224 178 87 101 81
4387 81 37 56 69 61 120 171 145 74 88 213 211 60 103 78 78 148 121 37 97 143 69 152 220 191 19 92 59 239 282 107 110 105 98 119 109 62
3965 62 111 193 132 73 118 28 65 91 191 121 28 212 84 138 118 70 149 193 220 257 193 212 150 55 70 224 275 263 86 143 142 194 196 74
3566 74 88 75 302 336 240 279 114 82 174 212 210 270 42 216 172 189 154 95 143 261 115 62 100 87 94 139 268 241 30 82 181 201
3190 201 61 56 57 33 178 192 112 147 168 19 93 168 76 103 90 216 198 91 69 239 226 158 134 207 33 57 121 35 207 157 385
$$ packed form
5808A28j8P6j18N3p3J34r5n0J5J65j37P1R9p1j61O3N6O2n7RR7j77j6P9R1M7k02O8j04J9N5
5444A08J7oL2q0o1J29L3j14K23l4j48J3M0j00nQ8J32l8j19jp0J58J31j09l8m2j04L3J30N9
5092B57q2J47j09j02M7n9Q7J81j20J1Q8j5r5m1j78J49j27J05Q5j57J33j30R7r6N2j2O4j14
4763F6O0n2J6j6j3J89kj29J25j37J3o2N9n5O5K9J5q4J60j84J17Lj48Q3O3P7j02O8m6r1J4k0
4387H1m4J9J3qN9N1k6p1J4J25kj51M3k5%P0k7q4O0M6p4Q3O8k9j72P3l3J80M3j75LnpK1j0m7
3965F2M9Q2o1n9M5r0L7K6J00p0r3J84j28N4k0m8P9M4K7L7o4J9o2r5J5J54N1j2j77N7jN2Kj22
3566G4J4j3K27L4r6L9j65l2R2L8kO0k28J74m4J7l5n9M8J18j46n3L8j3PM5J29k7k11N2R9K0
3190B01j40nJk4J45J4q0L5K1j49P4P5r2K7j3J26j8j07k2J70j3o8k4P3j74K4O4q6J72n0K28
$$ plain form
2826 385 328 56 46 89 109 178 177 102 95 51 130 162 219 134 146 130 163 203 194 51 167 269 115 187 98 253 174 264 158 285 223 220 106
2439 106 175 95 169 84 123 269 281 112 81 112 105 76 58 155 120 240 132 216 251 48 170 64 76 38 79 113 84 51 82 227 185
2075 185 172 186 111 46 119 276 227 241 221 61 49 61 36 106 110 150 156 87 12 28 79 141 154 191 150 112 204 95 92 88 136 128 156 234 71
1664 71 68 139 117 141 73 138 55 60 184 50 221 23 75 152 126 92 204 257 66 165 63 95 185 111 240 242 50 195 168 98 217
1300 217 87 77 125 115 84 127 201 115 157 291 250 74 94 201 189 148 219 114 11 119 255 188 208 190 150 80 189 89 68 104
948 104 168 75 67 147 103 82 66 35 38 112 84 105 186 190 137 222 158 100 40 478 867 387 108 139 260 131 50 98 62 29 115 103 46 143
549 143 58 96 152 37 165 128 173 285 199 79 237 305 143 106 262 295 225 133 110 37 109 221 251 112 180 206 89 75 121 162
197 162 194 154 128 175 188 35 95 148 35 207 233 165 41 39 110 195 201 49 81 65 24 181 222 126 53 125 178 246 17 164 96 69
$$ packed form
2826C85n7k72j0M3K0O9jp5pm4P9L2N7q5J2j6L3M0rj43J16J02j54P2q9J55p9R0j06J27o2lj14
2439A06O9q0P4q5L9J46J2j69l1L1pk9j8R7l5J20j08Q4L5k03J22j06J2l8M1L4k9l3L1J45m2
2075A85j3J4p5o5P3J57m9J4k0j60j2J2k5P0MM0Oo9p5J6N1O2J3L7m1l8R2j09lmM8qK8P8j63
1664G1lP1k2K4o8O5q3NJ24j34J71j98N2P7k6l4J12N3j91R9j02L2R0p4J29Kj92J45k7p0J19
1300B17j30j0M8j0l1M3P4q6M2J34m1j76K0J07j2m1P1j05j03J08J36o7K0j8m0p0J09j00k1L6
948A04O4r3qQ0m4k1j6l1LP4k8K1Q1Mn3Q5o4n8o0M38L89m80k79L1J21j29q1M8l6l3Q6j2n7R7
549A43q5L8N6j15J28l7M5J12q6j20J58O8j62l7J56L3p0r2k3p3P2J12L0j39O8K6j17j4M6M1
197A62L2m0k6M7J3j53O0N3j13J72K6o8j24kP1Q5Oj52L2j6m1J57M1r6p3P2N3O8k29J47o8k7
$$ plain form
-178 69 202
$$ packed form
-178F9J33
-190B02
##PAGE=	F1=14330
##FIRST=	25169.313707327481097,	5807.6787752999953227,	0.29030624032020568848
##DATA TABLE=	(F2++(Y..Y)), PROFILE
$$ plain form
5808 131 134 214 94 145 43 195 73 11 68 193 85 171 237 119 13 78 121 173 110 87 219 51 62 83 209 292 77 119 28
5467 28 26 105 163 104 99 74 16 111 122 82 247 244 58 133 236 85 61 111 251 219 84 112 60 166 287 201 113 54 14 51 161 240
5092 240 112 311 261 82 128 119 178 384 234 246 326 279 227 170 1 146 53 147 248 28 187 57 143 71 119 75 194 60 58
4751 58 56 111 96 104 270 264 117 238 86 122 14 120 35 128 177 154 105 265 87 211 205 32 130 198 256 165 258 213 86 53 129 59
4376 59 60 76 56 144 188 144 73 91 222 250 61 62 80 89 118 68 31 76 187 85 154 219 193 62 105 54 210 236 133 79 141 58 147
3988 147 92 45 97 140 118 83 144 70 129 145 178 73 98 238 52 131 100 47 139 158 225 206 159 253 235 113 62 168 246 299 155 73
3613 73 158 179 153 81 61 114 278 322 216 218 160 140 169 198 181 227 43 208 170 193 165 55 72 277 108 77 91 69 97 157 292 232
3237 232 7 93 181 205 48 62 18 33 157 178 132 159 146 58 122 135 75 155 51 271 281 147 95 267 233 168 127 226 30 63 154
$$ packed form
5808A31LQ0j20N1j02J52j22o2N7J25j08Q6O6j18j06O5M3N2o3k3J32j68J1K1J26Q3k15M2r1
5467B8kP9N8n9nk5n8R5J1m0J65lj86P5J03j51k4N0J40l2j35K8n2J06J21q6q8n9m0L7J10P9
5092B40j28J99n0j79M6rN9K06j50J2Q0m7n2n7j69J45r3R4J01k20J59j30Q6p2M8m4J19j34k
4751E8kN5j5QJ66oj47J21j52L6j08J06q5R3M9k3m9J60j78J24oj73R8O8N8r1R3m5j27l3P6p0
4376E9JJ6k0Q8M4m4p1J8J31K8j89JJ8RK9n0l7M5J11j02O9O5k6j31M3n1J56K6j03n4O2q3Q9
3988A47n5m7N2M3k2l5O1p4N9J6L3j05K5J40j86P9l1n3R2J9O7j9m7R4j8j22n1J06P8N3j44q2
3613G3Q5K1k6p2k0N3J64M4j06Kn8k0K9K9j7M6j84J65l8K3k8j10J7K05j69l1J4k2K8O0J35o0
3237B32k25Q6Q8K4j57J4m4J5J24K1m6K7j3q8O4J3o0Q0j04K20J0j34n2J72l4o5m1R9j96L3R1
$$ plain form
2873 154 38 178 131 411 287 52 38 114 155 141 120 127 128 27 134 161 210 99 134 104 188 176 147 54 211 294 143 208 115 241
2521 241 154 236 172 314 220 263 128 190 117 217 50 118 322 294 134 136 130 98 50 51 150 113 210 179 231 241 22 162 80 44 53 75 84
2134 84 103 61 67 196 166 189 180 137 57 159 307 230 217 191 108 37 97 97 120 142 191 159 97 23 21 84 158 95 131 172 130 202 158 130 28
1723 28 155 174 104 312 154 71 171 188 118 78 129 61 68 217 38 163 19 102 113 117 43 182 309 70 181 53 90 154 91 192
1371 192 215 54 157 240 84 173 62 86 74 120 83 178 169 69 156 286 236 98 80 197 185 198 257 161 27 137 269 180 175 151
1019 151 141 117 220 102 86 81 163 106 97 106 98 92 111 79 52 138 78 138 214 183 120 227 172 103 49 416 713 313 141 158 238 112 64
631 64 93 64 74 72 87 16 133 65 82 132 23 181 154 166 247 156 92 243 299 149 122 269 256 222 124 132 44 111 200 292 151 172 170 94
232 94 82 107 169 195 164 132 196 198 46 110 150 109 152 188 164 43 40 111 244 255 96 114 100 6 206 225 118 52 105 146 242 30 139
$$ packed form
2873A54j16J40m7K80j24k35j4P6M1j4k1PJj01J07K7M9j11L5l0Q4j2k9r3J57Q3j51O5r3J26
2521B41q7Q2o4J42r4M3j35O2p3J00j67O8K04k8j60Kol2m8JR9l7R7l1N2J0k19J40q2l6RK2R
2134H4J9m2OJ29l0K3rm3q0J02J48p7j3k6q3p1O0%K3K2M9l2o2p4kO3P4o3L6M1m2P2m4k8j02
1723B8J27J9p0K08j58q3J00J7p0m0N1o8PJ49j79J25j44Q3J1Mp4J39J27k39J11j28L7O4o3J01
1371A92K3j61J03Q3j56Q9j11K4j2M6l7R5rj00Q7J30n0j38j8J17j2J3N9r6j34J10J32q9nk4
1019A51j0k4J03j18j6nQ2n7rRqoJ9l2k7Q6o0O0P6l1o3J07n5o9n4L67K97m00j72J7Q0j26m8
631F4K9k9J0kJ5p1J17o8J7N0j09J58k7J2Q1r1o4J51N6j50k7J47j3l4r8Qq8O7Q9R2j41K1kp6
232I4j2K5O2K6l1l2O4Kj52O4M0m1M3L6k4j21lP1J33J1j59J8j4r4K00J9j07o6N3M1R6k12J09
$$ plain form
-155 139 69 31 185
$$ packed form
-155A39p0l8J54
-190A85
##PAGE=	F1=14227.7
##FIRST=	25169.313707327481097,	5807.6787752999953227,	0.27415069937705993652
##DATA TABLE=	(F2++(Y..Y)), PROFILE
$$ plain form
5808 135 146 215 124 165 34 200 50 7 104 159 79 166 216 72 40 78 93 146 100 49 185 27 72 57 205 289 115 88 20 60 95
5444 95 180 82 54 80 18 70 66 101 205 222 61 153 293 103 97 112 235 212 49 113 89 138 231 197 75 37 43 75 126 222 62 271
5068 271 281 58 109 134 149 365 214 219 270 207 215 159 5 114 62 133 241 19 164 61 110 65 110 33 195 73 71 125 118 125 135 267
4693 267 250 139 229 49 137 62 122 104 136 167 109 129 274 118 221 208 37 141 210 250 168 277 230 81 31 170 102 50 65 52
4340 52 146 193 144 65 89 217 260 42 15 66 94 90 19 52 83 186 72 156 193 186 123 109 97 182 181 155 125 167 32 175 77 44 105 99
3941 99 88 81 159 126 221 192 171 71 177 256 50 107 113 16 133 120 203 134 136 275 296 183 105 86 211 296 205 46 171 158 135 97
3566 97 39 157 221 283 195 136 192 202 159 154 146 176 43 172 138 172 148 62 14 271 99 95 114 42 109 171 296 203 38 100 168 214 44
3178 44 129 81 46 134 153 133 158 153 127 156 100 130 197 15 295 337 186 115 269 227 179 110 234 100 72 194 75 149 95 402 227
$$ packed form
5808A35J1O9r1M1j31J66j50m3R7N5q0Q7N0j44l2L8J5N3m6n1J36j58M5j5J48Q4j74k7o8M0L5
5444I5Q5r8k8K6o2N2mL5J04J7j61R2J40j90oJ5J23k3j63O4k4M9R3l4j22l8OL2N1R6j60K09
5068B71J0k23N1K5J5K16j51NN1o3Qn6j54J09n2P1J08k22J45j03M9m5M5p7J62j22kN4pPJ0J32
4693B67j7j11R0j80Q8p5O0j8L2L1n8K0J45j56J03j3j71J04O9M0q2J09m7j49n0J39o8n2J5j3
4340E2R4M7m9p9K4J28M3k18k7N1K8mp1L3L1J03j14Q4L7po3j4j2Q5jk6l0M2j35J43r8l3O1o
3941I9j1pP8l3R5k9k1j00J06P9k06N7Or7J17j3Q3o9KJ39K1j13p8j9J25Q5r1j59J25j3k3l8
3566I7n8J18O4O2q8n9N6J0m3nqL0j33J29l4L4k4q6m8K57j72mJ9p2O7O2J25r3j65O2O8M6j70
3178D4Q5m8l5Q8J9k0K5nk6K9n6L0O7j82K80M2j51p1J54m2m8o9J24j34k8J22j19P4n4L07j75
$$ plain form
2815 227 124 53 135 190 112 73 151 166 28 129 175 195 62 119 87 206 147 119 90 240 289 150 200 107 207 138 191 200 297 182 281
2451 281 129 183 119 225 25 147 349 299 179 183 151 85 32 38 132 97 184 223 240 209 15 144 99 46 53 101 52 107 68 57 157 137
2075 137 181 149 156 70 185 303 217 190 150 146 87 131 139 112 188 205 135 79 34 17 77 157 76 71 196 150 188 208 187 32 151 227 62 354
1676 354 232 97 197 239 114 69 108 59 66 218 114 86 52 115 79 99 6 159 335 84 187 46 105 115 74 128 179 56 120
1336 120 292 145 148 50 104 47 126 89 214 131 81 144 261 215 118 69 170 169 228 284 191 47 158 280 182 126 94 137 178 226 125
972 125 98 59 150 115 124 93 96 77 139 127 69 142 68 157 248 153 87 214 184 77 102 33 218 160 188 160 179 106 72 93 72 122 48 65 7
561 7 113 76 95 110 31 197 159 135 198 101 102 224 272 142 121 277 202 209 100 137 76 121 165 305 186 151 111 147 104 89 165 175 157
174 157 120 180 182 61 115 163 186 106 119 145 72 82 102 259 279 121 133 139 5 205 207 119 37 89 125 208 38 107 43 10 153
$$ packed form
2815B27j03p1Q2N5p8l9P8J5j38J01M6K0j33N7l2J19n9k8k9J50M9j39N0r3J00o9N3RR7j15R9
2451B81j52N4o4J06k00J22K02n0j20Ml2o6n3OR4l5Q7L9J7l1j94J29m5n3PM8m9N5l9j1J00k0
2075A37M4l2Pq6J15J18q6k7m0mn9M4Qk7P6J7p0n6m5j7O0Q0q1nJ25m6L8K0k1j55J19P6j65K92
1676C54j22j35J00M2j25m5L9m9PJ52j04k8l4O3l6K0r3J53J76k51J03j41N9J0m1N4N1j23O4
1336A20J72j47Lr8N4n7P9l7J25q3n0O3J17m6r7m9J01jN9N6r3j44J11J22r8n6l2M3M1M8j01
972A25k7l9R1l5Rl1Lj9O2j2n8P3p4Q9R1r5o6J27l0j07K5o9J85n8K8k8J9p3l4K1k1N0p4J7n8
561GJ06l7J9J5p9J66l8k4O3r7JJ22M8j30k1J56p5Pj09L7o1M5M4J40j19l5m0L6m3j5P6J0j8
174A57l7O0Kj21N4M8K3q0J3K6p3J0K0J57K0j58J2Oj34K00Kq8q2N2L6Q3j70O9o4l3J43
-190A53
##PAGE=	F1=14125.5
##FIRST=	25169.313707327481097,	5807.6787752999953227,	0.28321984410285949707
##DATA TABLE=	(F2++(Y..Y)), PROFILE
$$ plain form
5808 142 147 190 146 179 30 197 16 19 150 149 62 144 179 44 69 79 58 128 114 99 186 79 78 113 228 266 153 75 18 104 80 172 69
5420 69 34 88 12 68 59 110 162 194 81 154 311 104 121 123 222 204 11 121 113 118 179 204 110 108 58 123 104 209 54 209 267 55 122
5033 122 140 109 311 185 181 190 129 196 154 9 87 67 105 211 37 134 71 80 71 105 63 186 82 159 205 113 155 147 248 213 175 215 12
4646 12 151 81 126 166 147 139 44 152 263 153 213 198 49 139 206 240 167 273 223 62 28 193 158 49 53 56 121 184 146 56 86 197
4270 197 238 6 29 41 77 56 22 71 99 144 34 157 145 176 160 100 136 153 131 168 175 183 37 200 66 72 112 109 51 69 165 184 288
3883 288 218 163 98 227 257 45 73 162 60 135 83 163 54 132 270 320 240 182 30 178 259 222 59 186 129 148 129 77 197 145
3531 145 224 174 54 200 252 160 95 107 125 47 116 90 129 103 77 40 241 110 105 155 41 125 184 280 162 70 102 138 210 38 179
3167 179 149 68 109 116 116 144 190 186 180 69 178 217 17 291 352 201 127 243 213 191 92 232 167 93 230 116 130 55 365 161 180
$$ packed form
5808A42NM3m4L3j49J67j81LJ31jq7Q2L5j35K5J0k1P0j4j5Q7j07jL5J15L8j13p8n7Q6k4R2j03
5420F9l5N4p6N6rN1N2L2j13P3J57k07J7KR9j8j93J10qNO1K5r4kn0O5j9J05j55J55N8k12O7
5033A22J8l1K02j26mRo1O7m2j45P8k0L8J06j74R7o3RrL4m2J23j04P7M6r2M2qJ01l5l8M0k03
4646A2J39p0M5M0j9qr5J08J11j10O0j5j49R0O7L4p3J06n0j61l4J65l5j09MLO5O3l8r0L0J11
4270A97M1k32K3J2L6k1l4M9K8M5j10J23j2L1j6o0L6J7k2L7PQj46J63j34OM0ln8J8R6J9J04
3883B88p0n5o5J29L0k12K8Q9j02P5n2Q0j09P8J38N0q0n8j52J48Q1l7j63J27n7J9j9n2J20n2
3531A45P9n0j20J46N2r2o5J2J8p8O9k6L9k6k6l7K01j31nN0j14Q4N9R6j18r2L2L6P2j72J41
3167A79l0q1M1P%K8M6moj11J09L9k00K74O1j51p4J16l0k2r9J40o5p4J37j14J4p5L10k04J9
$$ plain form
2803 180 66 152 208 101 39 161 196 88 123 201 175 56 106 92 216 123 118 139 255 254 129 161 82 166 126 135 208 232 117 269 114
2439 114 160 95 197 22 172 345 293 218 215 170 63 61 16 109 85 177 255 242 159 56 119 113 84 52 138 26 100 75 68 114 96 162 103
2052 103 167 78 189 268 201 162 109 163 124 156 155 86 217 194 92 41 48 29 56 142 113 92 213 175 170 236 229 84 119 250 67 347 275
1664 275 133 211 259 128 58 82 68 59 190 182 25 74 102 64 78 33 144 333 89 179 44 133 105 88 59 154 55 88 313 206 136
1300 136 62 129 52 114 95 232 105 151 124 217 189 138 64 137 140 233 289 197 62 170 289 197 78 31 127 220 215 135 98 47 138 95 140
913 140 107 111 35 149 174 87 126 61 150 270 104 77 189 183 35 170 533 950 433 235 151 101 110 71 94 120 169 71 32 21 96 83
538 83 120 90 46 199 143 85 137 51 106 189 234 124 99 284 158 188 65 134 96 135 121 291 213 138 89 221 138 71 147 142 135 91 132
150 132 143 73 115 179 241 100 54 113 91 128 94 240 264 119 135 155 34 185 176 122 26 81 117 148 35 79 37 40 109
$$ packed form
2803A80j14Q6N6j07o2J22L5j08L5P8k6j19N0j4J24r3nK1J16jj25L2p9Q4m0RP3K4j15J52j55
2439A14M6o5J02j75J50J73n2p5lm5j07km5R3k4R2P8j3q3j03O3ok9l2Q6j12P4k5pM6j8O6n9
2052A03O4q9J11P9o7l9n3N4l9L2jo9J31k3j02n1Pj9K7Q6k9k1J21l8nO6pj45L5J31j83K80p2
1664B75j42P8M8j31p0K4j4rJ31qj57M9K8l8J4m5J11J89k44R0j35Q9k8j7k9R5r9L3K25j07p0
1300A36p4O7p7O2j9J37j27M6k7R3k8n1p4P3LR3N6r2j35J08J19r2j19m7R6R3nq0l7n1R1m3M5
913A40l3Mp6J14K5q7L9o5Q9J20j66k7J12oj48J35L63M17n17j98q4n0Rl9K3K6M9r8l9j1P5j3
538H3L7l0m4J53n6n8N2q6N5Q3M5j10k5J85j26L0j23O9l8L9j4J70p8p5m9J32q3o7P6npm4M1
150A32J1p0M2O4O2j41m6N9k2L7l4J46K4j45J6K0j21J51rn4r6N5L6L1j13M4m2LO9
-190A09
##PAGE=	F1=14023.2
##FIRST=	25169.313707327481097,	5807.6787752999953227,	0.31338277459144592285
##DATA TABLE=	(F2++(Y..Y)), PROFILE
$$ plain form
5808 149 143 146 153 182 47 186 24 43 194 181 36 119 130 31 105 80 29 119 136 153 228 146 77 189 269 231 176 101 37 140 73 143 74
5420 74 55 96 26 123 106 110 128 179 92 132 287 92 135 130 213 197 36 143 122 109 149 206 151 161 62 172 99 206 61 139 218 78
5045 78 159 142 81 231 147 138 107 63 168 146 22 80 67 69 170 44 100 69 58 96 106 117 174 76 234 267 101 180 135 217 165 212 195
4657 195 57 167 68 131 201 160 104 34 168 225 184 200 179 67 119 187 229 166 247 195 41 19 194 214 87 67 62 73 165 144 55 81
4282 81 165 186 47 62 36 35 15 55 84 118 87 18 154 93 172 168 81 153 125 96 169 189 190 32 213 58 114 111 142 42 53 165 232 311
3883 311 213 142 107 233 237 17 61 215 122 144 50 115 46 147 238 302 270 255 115 152 199 207 68 214 99 162 162 126 224 89 157 153
3507 153 49 182 281 170 34 74 84 52 55 49 78 46 80 63 192 136 97 189 60 140 196 253 116 96 101 91 179 21 190 195 95 87
3132 87 76 92 118 235 228 186 60 199 210 39 267 327 188 131 198 194 205 99 223 222 132 256 154 129 33 312 104 216 72 167
$$ packed form
5808A49oLPK9j35J39j62J9J51j3j45Q3J1r9P4k5n1R0J7J7P5q2o9J12Q0l8n5p5o4J03o7P0o9
5420G4j9M1p0R7j7MJ8N1q7M0J55j95M3nQ3j6j61J07k1j3M0N7n5J0r9J10p3J07j45P8P9j40
5045G8Q1j7o1J50q4rl1m4J05k2j24N8j3KJ01j26N6l1j1L8J0J1N7r8J58L3j66P9m5Q2n2M7j7
4657A95j38J10r9O3P0m1n6p0J34N7m1J6k1j12N2O8M2o3Q1n2j54k2J75K0j27k0nJ1R2k1q9K6
4282H1Q4K1j39J5k6jk0M0K9L4l1o9J36o1P9mq7P2k8k9P3K0Jj58J81j55N6lL1j00J1J12O7P9
3883C11r8p1l5J26Mk20M4J54r3K2r4O5o9J01R1O4l2j5j40L7M7Qj39J46j15O3%l6R8j35O8m
3507A53j04J33R9j11j36M0J0l2LoK9l2L4j7J29n6l9R2j29Q0N6N7j37k0Nj0Q8j58J69Nj00q
3132H7j1J6K6J17pm2j26J39J1j71K28O0j39n7O7mJ1j06J24jr0J24j02k5r6K79k08J12j44R5
$$ plain form
2779 167 209 102 11 156 207 140 129 224 149 83 94 107 218 107 128 181 258 193 86 99 76 145 112 85 184 133 62 237 89 128 54
2416 54 157 46 174 315 277 239 231 184 39 94 22 91 86 191 269 234 104 90 100 124 124 75 168 45 93 87 92 77 51 155 53 165
2040 165 75 166 215 196 135 102 149 138 169 147 57 216 167 39 60 85 67 26 125 149 149 218 205 164 242 240 122 58 238 100 291 269 163
1653 163 211 244 138 54 65 102 60 146 232 84 86 61 77 61 45 136 305 82 160 49 164 138 120 7 161 70 65 297 240 128 87
1289 87 145 49 83 104 232 88 216 107 158 158 161 69 125 103 210 270 181 65 170 301 220 74 51 98 236 193 123 82 52 139 49
925 49 138 123 145 43 147 207 106 99 61 124 260 60 109 155 155 46 205 952 1622 702 248 125 74 104 68 91 185 213 118 3
573 3 28 91 80 137 80 69 184 117 51 64 47 101 145 199 97 63 288 142 161 30 137 102 149 78 263 232 152 144 283 168 53 111
197 111 103 106 59 83 89 76 118 187 261 117 64 78 89 158 102 198 214 100 132 145 76 167 146 121 23 84 116 76 22 66 65 69 61
$$ packed form
2779A67M2j07r1J45N1o7j1R5p5o6J1J3J11j11K1N3P7o5j07J3k3O9l3k7R9n1p1J75j48L9p4
2416E4J03j11J28J41l8l8qm7j45N5p2O9nJ05P8l5j30j4J0K4%m9R3j23M8oNj5k6J04j02J12
2040A65r0R1M9j9o1l3M7j1L1k2r0J59m9j28K1K5j8m1R9K4%O9j3m1P8kj18o4J80j38J91k2j06
1653A63M8L3j06q4J1L7m2Q6Q6j48Kk5J6j6j6R1J69k23P8j11J15k6j8j13J54r1nK32n7j12m1
1289H7N8r6L4K1J28j44J28j09N1%Lr2N6k2J07O0q9j16J05J31q1j46k3M7J38m3p0m1l0Q7r0
925D9Q9j5K2j02J04O0j01pl8O3J36k00M9M6%j09J59P47O70r20m54j23n1L0l6K3R4K8r5j15
573CK5O3j1N7n7j1J15o7o6J3j7N4M4N4j02l4K25j46J9j31J07l5M7p1J85l1q0qJ39j15j15N8
197A11qLm7K4Oj3M2O9P4j44n3J4J1O9n6R6J6j14L2J3o9R1k1k5r8O1L2m0n4M4jMq
-190F1
##PAGE=	F1=13920.9
##FIRST=	25169.313707327481097,	5807.6787752999953227,	0.35404890775680541992
##DATA TABLE=	(F2++(Y..Y)), PROFILE
$$ plain form
5808 154 135 92 143 172 74 166 65 72 226 224 13 99 91 47 144 78 32 113 157 180 279 201 67 254 306 194 182 136 56 168 87 109 85
5420 85 86 96 63 186 147 104 108 181 94 92 228 75 140 131 202 196 85 184 113 112 143 188 160 189 71 212 110 208 51 84 141 112 199 148
5021 148 100 138 108 104 48 30 135 131 40 100 72 40 142 47 65 52 44 134 113 158 161 64 277 298 88 196 110 179 119 238 168 106 187 34
4622 34 134 206 172 77 114 175 164 202 187 154 87 86 170 221 166 208 160 41 2 174 255 140 97 64 14 145 137 64 73 124 116 101 77 55 18
4211 18 33 78 97 147 98 71 142 69 179 159 67 144 102 71 161 161 191 46 213 51 148 117 158 73 39 160 256 287 179 105 87 195
3836 195 199 41 106 252 179 154 31 73 114 171 183 248 267 304 195 135 141 170 79 251 94 158 182 158 232 97 97 130 92 143 289 171
3460 171 22 52 61 47 10 34 43 50 79 68 133 154 73 205 61 146 207 220 76 108 95 40 125 10 152 206 124 82 67 86 82 273 251
3073 251 171 82 186 176 52 235 277 156 132 151 174 216 136 208 254 184 270 185 144 65 256 68 235 71 179 201 111 40 135 192
$$ packed form
5808A54j9m3N1K9r8R2j01PJ54kk11Q6qm4R7o6m6Q1M4K3R9p8j34J87N2j12j2m6q0J12q1K2k4
5420H5JJ0l3J23l9m3MP3q7kJ36j53O5rP1oj11R9p1jL1M5k8K9j18J41j02R8j57L3N7k9Q7n1
5021A48m8L8l0mn6j8J05mr1O0k8l2J02r5J8j3qR0k1M5Lr7K13K1k10J08q6O9o0J19p0o2Q1j53
4622C4J00P2l4r5L7O1j1L8j5l3o7jQ4N1n5M2m8j19l9J72Q1j15m3l3n0J31qp3RN1qj5k4k2l7
4211A8J5M5J9N0m9k7P1p3J10k0r2P7m2l1R0%L0j45J67j62R7l1M1q5l4J21R6L1j08p4j8J08
3836A95Mj58O5J46p3k5j23M2M1N7J2O5J9L7j09o0OK9r1J72j57O4K4k4P4j35%L3l8N1J46j18
3460A71j49L0Rj4l7K4RPK9j1O5K1q1J32j44Q5O1J3j44L2j3n5Q5j15J42N4q2m2j5J9mJ91k2
3073B51q0q9J04j0j24J83M2j21k4J9K3M2q0P2M6p0Q6q5m1p9J91j88J67j64J08K2r0p1R5N7
$$ plain form
2721 192 162 141 228 116 113 85 124 214 99 126 203 251 114 68 37 122 157 93 80 134 41 111 211 66 94 36 152 83 152 273 255 246
2345 246 232 188 49 107 60 87 106 216 267 220 68 110 96 135 159 113 186 84 95 100 111 56 47 176 21 150 56 123 166 204 110 139
1970 139 107 127 169 120 49 179 136 27 131 152 121 28 114 162 177 213 233 177 235 218 143 37 206 127 200 212 179 196 197 133 50 62 145
1582 145 77 107 258 145 96 32 105 61 40 130 260 62 132 56 190 185 142 58 189 99 50 254 243 129 112 144 31 52 117 220
1230 220 68 253 108 90 120 188 82 143 88 166 228 151 52 158 318 245 105 115 47 234 165 90 52 70 158 17 117 128 190 121
878 121 139 216 125 82 60 98 206 86 130 106 88 65 159 788 1351 602 177 65 110 64 73 73 231 247 178 21 26 100 64 132 87 107
502 107 157 98 99 30 84 95 105 172 69 64 286 139 132 28 141 93 157 44 234 240 179 208 312 181 48 61 66 78 67 115 30 68 122
115 122 175 243 123 101 48 64 162 117 153 141 81 138 123 119 162 129 116 11 96 115 46 4 68 101 91 18
$$ packed form
2721A92l0k1Q7j12lk8L9R0j15K7P7M8j37m6l1Q5L5o4j3N4r3P0J00j45K8n8J16o9O9J21j8r
2345B46j4m4j39N8m7K7J9J10N1m7j52M2j4L9K4m6P3j02J1NJ1n5rJ29j55J29r4O7M3L8r4K9
1970A39l2K0M2m9p1J30m3j09J04K1l1r3Q6M8J5L6K0n6N8j7p5j06J69p9P3J2l3J7Jo4q3J2Q3
1582A45o8L0J51j13m9o4P3m4k1R0J30j98P0p6J34nm3q4J31r0m9K04j1j14j7L2j13K1O5J03
1230B20j52J85j45j8L0O8j06O1n5P8O2p7r9J06J60p3j40J0o8J87o9p5l8J8Q8j41J00J1O2o9
878A21J8P7r1m3k2L8J08j20M4k4j8k3R4O29N63p49m25j12M5m6R%J58J6o9j57NP4l6O8m5K0
502A07N0n9Jo9N4J1J0O7j03nK22j47pj04J13m8O4j13J90Oo1K9J04j31j33J3NJ2j1M8q5L8N4
115A22N3O8j20k2n3J6R8m5L6j2o0N7j5mM3l3j3j05Q5J9o9m2O4L3j0p3
-190A8
##PAGE=	F1=13818.7
##FIRST=	25169.313707327481097,	5807.6787752999953227,	0.37135937809944152832
##DATA TABLE=	(F2++(Y..Y)), PROFILE
$$ plain form
5808 155 125 42 120 147 98 138 100 96 243 251 25 90 98 83 178 74 46 105 172 167 311 232 60 295 322 164 177 160 61 188 109 91 91
5420 91 110 80 110 235 173 91 105 188 88 44 151 62 135 125 183 201 142 236 97 121 156 153 127 193 96 236 126 207 22 68 56 150
5045 150 233 157 149 52 93 92 35 26 110 109 59 141 91 55 143 50 43 47 32 177 119 176 151 82 284 296 78 202 114 138 93 249 135 142 202
4634 202 18 135 184 175 68 187 173 100 203 174 122 103 55 180 218 165 174 134 56 33 142 269 187 117 55 44 131 130 85 61 82 44
4258 44 146 76 64 69 74 96 113 187 166 118 118 86 192 159 81 108 87 44 147 103 186 118 206 48 158 139 139 103 26 145 251 228 123
3871 123 60 58 130 155 112 170 267 222 159 49 50 169 197 125 169 236 319 248 123 130 130 103 284 122 135 187 169 217 118 54 107 104 96 282 149
3460 149 56 43 56 32 29 32 44 98 82 58 77 152 57 209 36 136 215 187 52 104 86 40 57 48 73 183 150 105 109 105 47 290 253 139
3061 139 116 145 119 59 207 217 115 131 118 152 218 177 194 258 237 269 205 169 108 201 72 242 66 180 194 127 80 106 153 143 142 205
$$ packed form
5808A55l0q3P8K7m9M0l8mJ47Qk26O5Qj5R5j04k8N9O7nJ44p9j72K35K7j58J3j7r9J27p9j8%
5420I1J9l0L0J25o2q2J4Q3j00m4J07q9P3j0N8J8n9R4j39K4L5lk6O6r7J40j10Q1j85M6j2R4
5045A50Q3p6qr7M1jn7rQ4jn0Q2n0l6Q8r3pMj5J45n8N7k5o9K02J2k18J24q8K4m5J56j14PO0
4634B02j84J17M9rj07J19j4p3J03k9n2j9m8J25L8n3Rm0p8k3J09J27q2p0o2j1Q7jm5k4K1l8
4258D4J02p0j2NNK2J7P4k1m8%l2J06l3p8K7k1m3J03m4Q3o8Q8j58J10j9%l6p7J19J06k3j05
3871A23o3kP2K5m3N8R7m5o3j10JJ19K8p2M4O7Q3p1j25P%k7J81j62J3N2j8M8r9o4N3lqJ86j33
3460A49r3j3J3k4lLJ2N4j6k4J9P5r5J52j73J00P9k8j35N2j8m6J7rK5J10l3m5Mmn8K43l7j14
3061A39k3K9k6o0J48J0j02J6j3L4O6m1J7O4k1L2o4l6o1R3j29J70j76J14J4o7m7K6M7j0jO3
$$ plain form
2685 205 82 134 89 138 206 98 104 199 234 34 115 88 185 190 69 114 73 98 194 212 53 65 72 191 122 113 240 236 256 221 177 85 93 98 101
2275 101 139 240 249 203 74 109 95 144 186 144 193 123 104 111 115 48 86 212 56 123 26 83 144 216 89 185 45 98 157 83 56 118 110 71
1876 71 201 232 183 76 109 147 160 202 246 194 228 172 152 128 183 137 102 122 183 166 128 123 40 63 179 104 94 259 193 112 105 138 76 36
1477 36 123 208 33 102 61 205 227 141 92 210 126 46 201 217 142 134 130 32 60 126 200 48 255 129 31 84 213 96 163 111 111 169
1101 169 119 29 136 340 263 124 170 24 225 125 47 33 97 189 96 83 117 236 200 131 194 140 94 63 104 112 153 106 29 59 97 74
725 74 351 496 161 23 137 104 23 92 46 226 265 245 9 13 126 37 93 108 157 130 84 169 112 121 102 85 147 45 137 282 126
361 126 102 65 131 71 152 23 212 233 199 247 299 171 88 21 34 64 104 193 24 52 118 139 189 112 113 32 20 135 125 123 72 82 156 103
-38 103 152 166 121 110 27 114 112 107 19 73 136 106 32
$$ packed form
2685B05j23N2m5M9O8j08OR5L5k00Q1k7R7Nj21M5m1K5R6J8j59J2PJ19o9rJ27mK0l5m4r2QNL
2275A01L8J01Rm6j29L5j4M9M2m2M9p0j9PMo7L8J26j56O7r7N7O1P2j27R6j40N3N9p4k7O2ql9
1876G1J30L1m9j07L3L8J3M2M4n2L4n6k0k4N5m6l5K0O1j7l8nq3K3J16p5j0J65o6q1pL3o2m0
1477C6Q7Q5j75O9m1J44K2q6m9J18q4q0J55J6p5qmr8K8O6P4j52K07j26r8N3J29j17O7n2%N8
1101A69n0r0J07K04p7j39M6j46K01j00p8j4O4R2r3j3L4J19l6o9O3n4m6l1M1QM1m7p7L0L8k3
725G4K77J45l35j38J14l3q1O9m6J80L9k0k36MJ13q9N6J5M9k7m6Q5n7Rj9j7O2j02R2J45j56
361A26k4l7O6o0Q1j29J89K1l4M8N2j28q3o7J3L0M0Q9j69K8O6K1N0p7Jq1j2J15j0kn1J0P4n3
-38A03M9J4m5j1q3Q7knq8N4O3l0p4
-190C2
##PAGE=	F1=13716.4
##FIRST=	25169.313707327481097,	5807.6787752999953227,	0.245931282639503479
##DATA TABLE=	(F2++(Y..Y)), PROFILE
$$ plain form
5808 152 112 12 90 114 107 104 122 105 249 252 39 94 131 118 199 83 50 94 187 115 317 235 78 303 307 144 167 168 51 201 121 99
5432 99 88 114 56 159 261 181 68 114 183 79 13 82 50 118 115 149 204 202 290 106 129 183 121 67 185 131 242 137 196 27 78 62
5056 62 187 253 164 195 34 111 101 22 40 106 83 74 191 115 94 156 49 49 86 16 218 117 172 144 132 260 267 72 201 167 115 96
4681 96 243 99 157 199 47 132 146 163 74 244 164 81 188 153 84 113 44 213 219 160 159 122 65 70 120 247 216 124 39 83 122 135 117
4294 117 43 49 66 175 67 55 104 103 112 130 227 220 154 84 101 200 181 109 62 74 30 132 38 179 206 210 58 138 165 91 118 13 114 217
3894 217 161 63 33 76 87 113 184 228 261 242 157 76 55 205 219 110 93 184 299 267 112 175 111 129 299 154 103 180 167 181 108 38
3519 38 85 87 82 273 104 83 45 69 30 36 29 51 133 87 44 38 125 96 214 46 111 216 155 47 90 72 78 22 87 49 137 171 138 162 129
3108 129 39 280 234 100 151 99 51 65 185 163 81 128 99 127 210 201 191 234 281 252 212 192 140 146 110 245 56 165 200 144 108 78 98
$$ packed form
5808A52m0j00P8K4plJ8j7J44Lk13N5L7j3Q1j16l3M4R3p2K02q2j57K25Mj63K3Jj17J50q0k2
5432I9j1K6n8J03J02q0j13M6O9j04o6O9l2O8lL4N5kQ8j84K3N4o2n4J18n4J11j05N9j69N1j6
5056F2J25O6q9L1j61P7j0p9J8O6k3rJ17p6k1O2j07%L7p0K02j01N5k8j2J28Pj95J29l4n2j9
4681I6J47j44N8M2j52Q5J4J7q9J70q0q3J07l5o9K9o9J69On9jl7n7NN0J27l1r2q5M4L9J3j8
4294A17p4OJ7J09j08j2M9jRJ8R7po6p0J7R9j9p2m7J2m4J02r4J41K7Mj52Q0K7p4K7j05J01J03
3894B17n6r8l0M3J1K6P1M4L3j9q5q1k1J50J4j09j7R1J15l2j55O3o4J8J70j45n1P7j3J4p3p0
3519C8M7KnJ91j69k1l8K4l9OpK2Q2m6m3oQ7k9J18j68O5J05o1j08M3j8On6O5l8Q8L4l3K4l3
3108A29r0K41m6j34N1n2m8J4J20k2q2M7k9K8Q3rj0M3M7k9m0k0n2Ol6J35j89J09L5n6l6l0K0
$$ plain form
2721 98 84 124 163 73 144 109 150 195 104 62 171 206 48 167 165 241 225 50 149 39 171 263 232 48 54 101 232 152 73 231 223 283
2345 283 205 151 118 57 127 126 173 251 219 187 88 85 84 147 203 158 195 152 107 112 104 42 114 243 101 87 32 97 150 222 75 214 31 61 136
1934 136 47 52 48 87 106 254 308 238 130 101 112 99 189 237 194 225 128 154 216 189 129 83 69 186 118 61 126 17 77 195 136 101 235
1547 235 232 138 190 168 92 60 111 172 28 75 57 201 260 116 110 208 144 64 169 175 157 151 127 63 90 129 180 80 229 153 59 81 233
1160 233 108 166 147 67 105 95 49 105 365 270 116 211 107 218 69 38 73 132 221 177 59 88 278 263 124 139 153 127 91 146
807 146 107 231 61 96 230 257 360 2622 4149 1575 359 369 19 155 141 68 151 266 307 47 35 173 21 44 133 211
502 211 117 53 229 187 156 130 99 119 39 230 288 93 73 111 91 36 136 30 193 212 204 257 248 136 160 94 11 76 130 256 64 35
127 35 107 83 116 104 99 33 49 81 119 106 71 100 173 92 173 169 119 109 78 134 107 173 32 72 162 110 56
$$ packed form
2721I8j4M0L9r0P1l5M1M5r1m2J09L5j58J19kP6j6j75R9j10J32R2l1j84OM7J31q0p9J58qO0
2345B83p8n4l3o1P0jM7P8l2l2r9ljO3N6m5L7m3m5Nqo2P2J29j42j4n5O5N3P2j47J39j83L0P5
1934A36q9NmL9J9J48N4p0j08k9J1j3R0M8m3L1r7K6O2k7o0m6j4J17o8n7O5j09O0J18n9l5J34
1547B35lr4N2k2p6l2N1O1j44M7j8J44N9j44oR8o4q0J05Oj8ok4o4K7L9N1j00J49p6r4K2J52
1160B33j25N8j9q0L8j0m6N6K60r5j54R5j04J11j49l1L5N9Q9m4j18K9J90j5j39J5J4k6l6N5
807A46l9J24j70L5J34K7J03K262J527k574j216J0l50J36j4p3Q3J15M1k60j2J38j52K3Q9P8
502B11r4o4J76m2l1k6l1K0q0J91N8j95k0L8k0n5J00j06J63J9qN3rj12K4o6q3O5N4J26j92k9
127C5P2k4L3j2no6J6L2L8j3l5K9P3q1Q1mn0j0l1N6k7O6j41M0R0n2n4
-190E6
##PAGE=	F1=13614.2
##FIRST=	25169.313707327481097,	5807.6787752999953227,	0.019495766609907150269
##DATA TABLE=	(F2++(Y..Y)), PROFILE
$$ plain form
5808 147 102 20 63 81 97 70 123 93 252 235 43 111 155 141 206 128 54 80 204 36 301 215 109 276 260 125 160 162 44 204
5456 204 113 117 75 98 60 201 261 176 43 130 166 71 42 75 31 90 105 102 197 260 333 144 136 217 116 73 185 165 234 139 167 67 85
5068 85 134 216 252 156 223 72 134 116 25 92 116 63 85 231 128 133 158 42 69 137 16 246 102 148 140 186 218 225 71 196 229 134
4693 134 115 225 66 146 170 60 127 99 133 89 276 150 115 164 121 44 117 41 248 217 146 157 114 68 110 137 193 222 131 49 95 111
4317 111 151 152 25 42 137 188 59 33 115 114 130 138 251 240 177 52 93 198 205 135 71 64 61 118 47 170 279 230 77 88 177 37 117
3930 117 13 63 166 129 47 60 124 112 79 241 265 240 238 144 93 70 222 230 154 86 129 254 249 102 229 125 143 291 172 72 169
3566 169 170 131 64 46 68 68 119 266 43 108 52 99 61 44 55 52 154 96 30 24 87 160 230 121 81 206 122 55 90 49 103 81 120 151
3167 151 95 189 163 204 143 63 241 198 65 184 108 17 73 171 124 61 122 80 99 190 199 203 190 310 221 203 204 152 93 162 243 44 133 214
$$ packed form
5808A47m5q2M3J8J6k7N3l0J59j7j92O8M4j4O5p8p4K6J24j68K65q6j06J67j6j35L5Kj18J60
5456B04r1Mm2K3l8J41O0q5j33Q7L6r5k9L3m4N9J5lR5O3P3j89qQ1j01m3J12k0O9r5K8j00J8
5068H5M9Q2L6r6O7j51O2j8r1O7K4n3K2J46j03NK5j16K7O8j21K30j44M6qM6L2Pj54J25L3r5
4693A34j9J10j59Q0K4j10O7k8L4m4J87j26l5M9m3p7P3p6K07l1p1J1m3m6M2K7N6K9r1q2M6J6
4317A11M0Jj27J7R5N1j29k6Q2jJ6QJ13j1o3j25M1J05Pp0o4plN7p1J23J09m9j53J1Q9j40Q0
3930A17j04N0J03l7q2J3O4j2l3J62K4k5kr4n1k3J52Qp6o8M3J25nj47J27j04J8J48j19j00R7
3566A69Jl9o7j8K2%N1J47k23O5n6M7l8j7J1lJ02n8o6oO3P3P0j09m0J25q4o7L5m1N4k2L9L1
3167A51n6R4k6M1o1q0J78m3j33J19p6r1N6R8m7o3O1m2J9R1RMj3J20q9j8Jn2n9O9Q1j99Q9Q1
$$ plain form
2768 214 147 117 68 50 16 88 140 104 144 139 155 180 114 15 129 168 101 192 224 278 253 43 172 75 218 308 245 43 68 109 246 167
2392 167 56 241 217 322 189 115 131 16 142 153 192 241 175 169 84 44 58 143 208 150 199 167 97 100 83 38 120 257 143 47 76 153
2016 153 166 217 73 219 97 47 113 29 31 16 57 129 285 363 275 182 82 68 6 175 205 164 214 120 156 283 203 103 146 150 202 62
1641 62 72 150 22 113 191 167 103 193 267 169 261 184 104 94 94 180 70 56 41 181 284 76 115 180 151 101 178 138 160 162 161 88 110 128
1242 128 163 143 192 165 110 116 244 117 148 174 77 60 83 106 67 386 260 81 232 187 213 10 72 128 173 242 249 87 40 310 303 130
866 130 79 181 169 145 209 259 323 167 248 448 521 794 5857 9352 3625 817 665 144 317 230 146 28 263 349 137 90
561 90 229 58 122 158 263 124 11 268 238 188 174 133 97 54 322 310 43 47 166 22 14 118 62 168 187 195 239 172 87 244 187
197 187 2 103 132 284 86 46 99 18 45 124 71 37 116 30 103 82 114 122 175 76 185 172 124 112 131 148 99 225 42 61 176 104
$$ packed form
2768B14o7l0m9j8l4P2N2l6M0nJ6K5o6r9J14L9o7R1L2N4k5k10J29r7J43R0o3k02K5M1J37p9
2392A67j11J85k4J05j33p4J6j15J26J1L9M9o6oq5m0J4Q5O5n8M9l2p0Lj7m5Q2J37j14r6K9P7
2016A53J3N1j44J46j22n0O6q4Kj5M1P2J56P8q8r3j00j4o2J69L0m1N0r4L6J27q0j00M3MN2j40
1641F2J0P8j28R1P8k4o4R0P4r8R2p7q0j0%Q6j10j4j5J40J03k08L9O5k9n0P7m0K2Kjp3K2J8
1242A28L5k0M9k7n5OJ28j27L1K6r7j7K3K3l9L19j26j79J51m5K6k03O2N6M5O9Pj62m7K70pj73
866A30n1J02j2k4O4N0O4j56Q1K00P3K73N063L495n727k808j52n21J73q7q4j18K35Q6k12m7
561I0J39j71O4L6J05j39j13K57l0n0j4m1l6m3K68j2k67MJ19j44qJ04n6J06J9QM4o7q5J57n7
197A87j85J01K9J52j98m0N3q1K7P9n3l4P9q6P3k1L2QN3r9J09j3m8j2J9J7m9J26j83J9J15p2
$$ plain form
-178 104 66
$$ packed form
-178A04l8
-190F6
##PAGE=	F1=13511.9
##FIRST=	25169.313707327481097,	5807.6787752999953227,	0.29264909029006958008
##DATA TABLE=	(F2++(Y..Y)), PROFILE
$$ plain form
5808 147 106 25 45 57 70 38 99 58 257 215 41 131 159 143 199 194 77 63 220 61 275 180 133 219 186 100 157 150 70 195 82 135
5432 135 63 72 97 226 239 157 47 148 146 79 68 114 8 57 100 58 183 308 357 178 149 247 130 156 206 192 222 129 121 102 86 186
5056 186 234 229 126 224 85 141 129 92 159 120 56 88 245 122 165 141 34 87 177 39 257 76 113 141 224 168 183 76 190 270
4704 270 172 131 205 47 111 116 54 122 55 95 112 282 131 145 139 83 9 119 27 266 211 122 147 101 71 145 185 124 208 166 94 81 94
4317 94 162 177 28 55 198 193 49 27 101 106 150 130 251 222 189 46 72 191 210 161 137 67 99 107 91 160 312 245 98 22 164 62
3941 62 107 27 37 115 147 84 88 158 144 47 268 274 213 210 121 89 78 221 227 205 142 92 196 200 99 268 156 143 266 171 47 161 183
3554 183 81 8 55 60 93 164 255 41 134 64 136 96 77 98 56 169 111 25 18 77 218 250 205 77 185 85 69 128 15 112 132 142
3178 142 235 79 205 172 227 143 84 180 151 45 211 168 74 79 160 102 50 120 50 75 161 171 216 140 319 176 180 199 138 63 213 233
$$ packed form
5808A47m1q1K0J2J3l2O1m1J99m2j74R0K8j6N6nj17j4J57j59K14r5m7Q6l3q6N7pq0J25j13N3
5432A35p2RK5J29J3q2j10J01ko7j1M6j06M9M3m2J25J25M9j79k9R8j17K6N0j4L0r3qj9j6J00
5056A86M8nj03R8j39N6j2l7O7l9o4L2J57j23M3k4j07N3R0j38K18j81L7K8Q3n6J5j07J14Q0
4704B70r8m1P4j58O4No2O8o7M0J7J70j51J4on6p4J10r2K39n5q9K5m6l0P4M0o1Q4m2p2j3J3
4317I4O8J5j49K7J43nj44k2P4NM4k0J21k9l3j43K6J19J9m9k4p0L2Qj6O9J52o7j47p6J42j02
3941F2M5q0J0P8L2o3MP0j4r7K21Oo1lq9l2j1J43Ok2o3n0J04Mj01J69j12j3J23r5j24J14K2
3554A83j02p3M7NL3P1R1k14R3p0P2m0j9K1m2J13n8q6pN9J41L2m5j28J08j00j6N9j13R7K0J0
3178A42R3j56J26l3N5q4n9R6k9j06J66m3r4NQ1n8n2P0p0K5Q6J0M5p6J79j43MJ9o1p5J50K0
$$ plain form
2803 233 38 91 221 131 107 79 55 88 42 171 146 133 175 157 160 124 51 91 119 129 181 254 292 271 47 185 121 246 328 237 34 92
2427 92 98 230 161 65 252 210 355 174 87 119 47 141 170 182 202 117 146 64 9 26 130 200 126 207 163 73 80 74 47 102 247 175 15
2040 15 115 209 178 201 83 204 151 71 99 34 4 54 19 142 294 388 286 225 49 40 98 160 158 111 184 141 157 316 199 65 191
1676 191 234 233 58 130 181 72 154 171 190 87 139 298 200 300 179 107 124 75 236 121 42 22 149 299 58 118 136 150 148 205
1324 205 139 147 168 215 94 114 132 148 204 169 157 147 159 247 123 116 189 122 89 81 164 28 393 238 34 231 250 207 85 96 179 213
948 213 241 298 140 18 334 321 154 120 233 214 204 289 418 431 344 410 674 830 1282 9528 15256 5952 1324 967 357 482
643 482 351 236 197 279 360 244 158 272 111 246 180 305 147 91 281 259 215 219 171 105 78 398 340 15 29 224 70 69 109 98
291 98 132 174 178 203 96 52 325 280 13 131 111 273 87 76 106 52 34 155 47 39 178 80 92 45 139 145 156 46 190 183 142 116
$$ packed form
2803B33j95N3J30r0k4k8k4L3m6J29k5j3M2j8Ll6p3M0K8J0N2P3L8k1k24J38o4J25Q2r1k03N8
2427I2OJ32o9r6J87m2J45j81q7L2p2R4K9J2K0q5K9q2n5J7J04P0p4Q1m4r0Pok7N5J45p2j60
2040A5J00R4l1K3j18J21n3q0K8o5l0N0l5J23J52R4j02o1j76rN8O2km7P3m3J6J59j17j34J26
1676A91M3jj75P2N1j09Q2J7J9j03N2J59r8J00j21p2J7m9J61j15p9k0J27J50k41O0J8J4kN7
1324B05o6QK1M7j21K0J8J6N6l5j2j0J2Q8j24pP3o7l3qQ3j36L65j55k04J97J9m3j22J1Q3L4
948B13K8N7j58j22L16j3j67l4J13j9j0Q5J29J3q7O6K64J56M52Q246N728r304m628l57o10J25
643D82j31j15l9Q2Q1j16q6J14j61J35o6J25j58n6J90k2m4Mm8o6k7L20n8l25J4J95j54jM0j1
291I8L4M2MK5j07m4K73m5k67J18k0J62j86j1L0n4j8J21j08qJ39r8J2m7R4OJ1j10J44pm1k6
$$ plain form
-85 116 171 154 87 260 62 41 174 88 64
$$ packed form
-85A16N5j7o7J73j98k1J33q6k4
-190F4
##PAGE=	F1=13409.7
##FIRST=	25169.313707327481097,	5807.6787752999953227,	0.48785355687141418457
##DATA TABLE=	(F2++(Y..Y)), PROFILE
$$ plain form
5808 155 130 21 39 45 56 20 49 17 260 201 35 142 144 123 187 259 112 43 229 146 247 138 136 157 106 68 160 143 109 175 37 152
5432 152 68 64 126 229 204 127 78 167 136 116 88 152 27 30 103 45 174 343 357 186 170 259 133 226 235 214 218 112 64 126 87 207 236
5045 236 188 74 196 85 130 138 167 220 109 55 84 224 105 186 116 48 104 196 59 245 51 77 143 235 114 150 85 184 274 198
4693 198 136 192 52 56 49 52 116 23 89 145 262 107 156 123 53 19 123 20 259 197 88 123 85 79 171 239 90 184 230 150 54 78 155
4305 155 182 45 71 237 199 31 47 71 84 167 103 225 175 192 63 73 193 201 199 203 93 128 99 119 146 292 231 113 60 125 107 95
3930 95 37 110 84 175 110 102 163 143 37 260 252 185 172 92 59 73 206 208 237 191 83 145 131 113 281 188 135 242 157 26 161 196 62
3542 62 54 53 63 137 191 234 104 157 81 173 123 120 139 66 182 131 28 4 114 256 259 279 110 154 43 81 185 33 108 172 154 281
3167 281 76 218 165 226 136 91 107 108 36 225 221 110 77 144 89 46 130 12 59 128 125 218 102 304 118 153 185 99 92 250 209 53
$$ packed form
5808A55k5j09J8OJ1l6K9l2K43n9j66J07Kk1O4P2j47o9J86q3J01j09kK1n1l8R2j7l4O6j38J15
5432A52q4mO2J03k5p7m9Q9l1k0k8O4j25LP3n8J29J69J4j71j6Q9j26R3Rk1Mj06m8O2l9J20K9
5045B36m8j14J22j11M5QK9N3j11n4K9J40j19Q1p0o8N6R2j37J86j94K6O6R2j21L6o5R9R0p6
4693A98o2N6j40MpLO4r3O6N6J17j55M9l3p0l4J04j03K39o2j09L5l8oR2O8j49R4M6q0r6K4P7
4305A55K7j37K6J66l8j68J6K4J3Q3o4J22n0J7j29J0J20QkMj10L5k9K0K7J46o1j18n3O5j8j2
3930I5n8P3k6R1o5qO1k0j06K23qo7j3q0l3J4J33KK9m6j08O2j4j8J68r3n3J07q5j31J35L5j34
3542F2qjJ0P4N4M3j30N3p6R2n0lJ9p3J16n1j03k4J10J42LK0j69M4j11L8J04j52P5O4j8J27
3167B81k05J42n3O1r0m5J6Jp2J89mj11l3O7n5m3Q4j18M7O9lR3j16K02j86L5L2q6pJ58m1j56
$$ plain form
2791 53 45 210 106 84 96 82 156 4 229 177 116 214 162 138 131 94 89 63 129 146 254 284 276 55 195 163 269 328 212 39 115 78
2416 78 193 137 73 250 194 360 155 80 88 83 126 172 140 137 43 115 54 63 26 112 183 95 216 144 38 73 93 68 78 215 192 26 138
2028 138 249 182 179 101 186 188 95 103 37 43 77 38 145 284 379 270 252 13 61 190 141 124 79 136 155 155 313 167 29 202 282 268
1653 268 116 176 204 132 178 143 200 58 85 314 224 300 149 99 145 65 305 170 27 37 116 302 96 125 105 145 194 220 174 127
1300 127 166 261 82 106 144 133 250 171 127 166 190 245 129 81 198 162 145 83 212 48 375 213 38 205 283 196 159 99 218
960 218 245 214 316 186 71 348 325 189 224 299 259 252 377 539 536 520 549 864 1114 1724 12879 20651 8077 1782 1209 575
655 575 615 478 312 406 326 337 343 228 283 168 361 203 333 174 181 270 249 231 251 202 138 104 446 360 66 36 270 162 126 114
303 114 127 89 181 161 155 73 73 389 356 28 147 73 229 76 102 119 105 58 175 45 44 226 142 92 40 140 167 122 36 184 198 167
$$ packed form
2791E3qJ65j04k2J2j4P4j52K25n2o1R8n2k4pl7nk6O6J7J08L0qk21J40l2J06N9j16j73P6l7
2416G8J15n6o4J77n6J66k05p5QnM3M6l2lr4P2o1Rl7Q6P1q8J21p2j06L5K0k5J0J37k3j66J12
2028A38J11o7lp8Q5Kr3Qo6OL4l9J07J39R5j09j8k39M8J29m9j7m5N7J9%J58j46j38J73Q0j4
1653B68j52O0K8p2M6l5N7j42K7K29r0P6j51n0M6q0K40j35j43J0P9J86k06K9k0M0M9K6m6m7
1300A27L9R5j79K4L8j1J17p9m4L9K4N5j16m8J17l6j7o2J29j64L27j62j75J67P8q7l7o0J19
960B18K7l1J02j30j15K77k3j36L5P5m0pJ25J62lj6K9L15K50O10J1155P772j2574o295n73o34
655E75M0j37j66R4q0J1Oj15N5j15J93j58J30j59PQ9k1j8K0m9o4l4L42q6k94l0K34j08l6j2
303A14J3l8R2k0oq2%L16l3l28J19p4J56j53K6J7j4m7J17j30jJ82q4n0n2J00K7m5q6J48J4l1
$$ plain form
-73 167 116 186 150 70 277 103 14 155 65 54
$$ packed form
-73A67n1P0l6q0K07j74q9J41r0j1
-190E4
##PAGE=	F1=13307.4
##FIRST=	25169.313707327481097,	5807.6787752999953227,	0.54829615354537963867
##DATA TABLE=	(F2++(Y..Y)), PROFILE
$$ plain form
5808 170 166 17 39 38 88 27 25 79 248 191 23 136 118 87 173 303 143 19 226 209 223 95 114 144 85 40 163 147 136 144 20
5444 20 168 87 75 130 210 167 85 101 181 136 173 102 187 53 19 104 54 184 364 335 163 193 249 114 258 254 233 231 92 6 139 90
5068 90 199 220 148 6 144 103 117 142 230 257 86 48 76 169 106 193 104 74 123 191 69 214 64 61 139 216 53 127 99 182 246 196
4693 196 129 188 68 18 32 78 104 17 146 190 223 77 155 123 50 32 129 60 230 177 55 96 85 94 180 282 133 161 300 201 60
4329 60 78 124 159 57 84 248 209 26 65 40 54 175 65 181 111 185 79 111 207 201 250 249 127 147 96 137 130 221 179 120 125 68 124
3941 124 87 39 188 81 189 114 101 137 105 83 218 204 166 149 57 13 56 177 173 242 219 86 121 68 147 270 214 133 231 138 10
3578 10 165 192 95 79 35 77 167 194 197 156 169 104 205 138 153 169 75 189 143 36 32 159 264 247 329 148 119 13 85 235 91
3214 91 96 203 157 287 64 221 150 204 125 83 37 87 26 218 241 121 67 112 80 59 150 23 59 99 84 214 93 263 50 135
$$ packed form
5808A70mj49K2jN0o1kN4J69n7j68J13j8l1Q6J30j60j24K07j7J4j28J9L0n9m5J23j6j1Qj24
5444B0J48q1j2N5Q0m3q2J6Q0m5L7p1Q5j34l4Q5n0J30J80k9j72L0N6j35J44mk1kj39q6J33m9
5068I0J09K1p2j42J38m1J4K5Q8K7j71l8K8R3o3Q7q9l0M9O8j22J45j50lP8P7j63P4k8Q3O4n0
4693A96o7N9j20n0J4M6K6q7J29M4L3j46P8l2p3j8R7o9J70n3j22M1j1RQ6J02j49K8J39r9j41
4329F0J8M6L5j02K7J64l9j83L9k5J4J21j10J16p0P4j06L2R6oM9jj22K0n1M1pR1m2n9Nn7N6
3941A24l7m8J49j07J08p5j3L6l2k2J35j4l8j7r2m4M3J21mO9k3j33L5n3P9J23n6q1R8r3j28
3578A0J55K7r7j6m4M2R0K7Lm1J3o5J01o7J5J6r4J14m6j07mJ27J05j7Q2j81k9j06P2J50j44
3214I1NJ07m6J30k23J57p1N4p9m2m6N0o1J92K3j20n4M5l2k1R1j27L6M0j5J30j21J70k13Q5
$$ plain form
2862 135 175 55 135 264 174 90 4 182 112 59 102 96 193 19 276 189 97 249 170 121 129 117 119 6 106 117 231 257 265 63 204
2498 204 198 291 317 180 71 129 60 152 99 65 231 163 329 127 85 66 103 103 163 84 81 42 79 77 108 51 90 162 68 221 123 16 102
2110 102 127 93 103 175 194 39 137 266 180 157 123 176 210 103 118 28 77 96 86 139 263 343 231 260 40 93 248 122 128 112 79
1746 79 149 145 277 118 46 188 288 292 170 199 215 191 174 115 196 41 55 308 234 258 106 82 157 78 360 207 10 63 92 294
1394 294 144 138 120 135 230 209 208 122 156 280 61 93 156 121 279 188 88 168 204 238 134 54 213 187 190 84 240 103 331 204
1042 204 79 157 279 180 212 83 241 262 164 299 213 106 355 320 216 321 355 293 277 451 596 613 647 634 976 1304 2024 15135
714 15135 24299 9517 2091 1334 744 686 581 359 583 383 285 407 283 257 223 439 226 342 196 252 243 216 234 260 221
420 221 165 125 456 358 101 58 293 240 173 120 141 50 192 149 108 114 107 425 399 53 144 30 166 67 114 120 145 57 175 65 68 256
$$ packed form
2862A35M0j20Q0J29r0q4q6J78p0n3M3oR7j74K57q7r2J52p9m9Qj2Kj13J00J1J14K6Qk02J41
2498B04oR3K6j37j09N8o9R2n3l4J66o8J66k02m2j9L7%O0p9ll9L7kL1n7L9P2r4J53r8j07Q6
2110A02K5l4J0P2J9j55R8J29q6k3l4N3L4j07J5r0M9J9j0N3J24Q0j12K9k20N3J55j26Oj6l3
1746G9P0mJ32j59p2J42J00Mj22K9J6k4j7n9Q1j55J4K53p4K4j52k4P5p9K82j53j97N3K9K02
1394B94j50oj8J5R5k1jq6L4J24k19L2O3l5J58r1j00Q0L6L4j04q0J59k6Lj06J56j37K28j27
1042B04j25P8J22r9L2j29J58K1r8J35q6j07K49l5j04J05L4o2j6J74J45J7L4j3L42L28P20J3111
714A5135R164j4782p426p57n90n8j05k22K24k00r8J22j24k6l4K16k13J16j46N6rk7J8K6l9
420B21n6m0L31r8k57m3K35n3o7n3K1r1J42m3m1OpL18k6l46R1j14J36r9M7OK5q8J18j10LJ88
$$ plain form
45 256 183 98 86 121 184 93 95 163 208 187 109 176 140 52 281 155 29 121 38 43
$$ packed form
45B56p3q5j2L5O3r1KO8M5k1p8O7l6q8K29j26j26R2q3N
-190D3
##PAGE=	F1=13205.1
##FIRST=	25169.313707327481097,	5807.6787752999953227,	0.3605365753173828125
##DATA TABLE=	(F2++(Y..Y)), PROFILE
$$ plain form
5808 184 200 9 39 30 133 38 109 159 214 174 23 112 86 43 164 311 158 15 210 243 202 55 72 200 154 30 161 155 141 105
5456 105 63 181 102 72 104 172 135 37 107 183 136 233 113 220 67 24 96 57 212 371 295 113 207 217 75 251 255 248 253 76 42
5092 42 137 92 167 187 134 78 80 150 123 140 266 261 68 24 70 100 142 187 112 97 145 169 70 169 98 78 125 174 23 109 116 185 196 168 111
4681 111 187 77 78 88 109 87 22 223 240 178 47 156 141 66 37 131 102 189 151 44 91 108 117 173 304 187 150 353 234 103 98
4317 98 73 110 58 93 231 213 58 81 29 26 167 42 140 58 171 83 149 219 223 297 263 154 160 99 147 112 118 106 121 171 29 110 88 30
3918 30 250 90 184 95 92 92 43 140 146 146 161 163 22 66 32 138 128 224 222 82 126 69 190 241 234 138 233 122 34 170 165 140 61 20 101
3507 101 173 171 147 190 170 132 229 142 172 186 84 185 134 48 65 187 242 210 348 172 98 58 81 264 153 79 226 158 261 53
3155 53 209 137 165 111 63 21 91 20 190 222 111 55 60 72 86 171 47 77 87 81 226 134 195 45 143 178 72 161 251 145 136 26
$$ packed form
5808A84J6j91L0rJ03r5P1N0N5m0j51Q9k6m3J21J47j53j43J95L3m1j47J7J28m6j24J31oj4l6
5456A05m2J18p9l0L2O8l7r8P0P6m7R7j20J07j53m3P2l9J55J59p6j82R4J0j42J76MpNj77l4
5092D2R5m5P5K0n3n6KP0k7J7J26nj93m4M6L0M2M5p5j5M8K4r9R9p1k0M7M9j51Q6PO9J1k8n7
4681A11P6j10JJ0K1k2o5K01J7o2j31J09j5p5k9R4k9Q7l8j07M7J7RN6J31j17l7K03j19j31n
4317I8k5L7n2L5J38j8j55K3n2lJ41j25R8q2J13q8O6P0MP4l4j09Oo1M8l5Oj2J5N0j42Q1k2n8
3918C0K20j60R4q9l%m9R7O%J5Kj41M4l4J06j0R6kj40M4n7J21N1pr6R5j11q8J36nk5p9m1Q1
3507A01P2kk4M3k0l8R7q7L0J4j02J01n1q6J7J22N5l2J38j76p4m0K3J83j11p4J47o8J03k08
3155E3J56p2K8n4m8m2P0p1J70L2j11n6NJ2J4Q5j24L0J0oJ45r2O1j50R8L5j06Q9R0j06rj10
$$ plain form
2779 26 153 163 41 93 98 195 14 294 183 87 269 171 119 116 119 154 44 70 125 197 214 235 70 209 221 303 304 153 115 136 48 123
2404 123 54 43 199 122 265 92 91 100 107 87 158 84 131 130 50 100 139 71 70 145 47 219 125 52 147 160 120 168 154 190 38 113 261 171
2005 171 144 143 169 217 93 130 6 97 122 123 126 238 290 178 244 74 117 264 115 156 152 49 124 125 219 80 83 164 264 298 200 199 215
1617 215 233 139 94 181 74 69 276 225 190 88 57 161 96 384 223 24 78 80 277 182 156 155 124 249 168 221 145 137 268 52 83
1254 83 158 112 294 208 78 157 201 226 134 55 242 188 207 78 247 156 276 221 103 98 240 157 232 59 244 259 99 253 220 111
901 111 356 307 224 386 380 303 278 489 580 639 693 645 984 1348 2111 15744 25315 9925 2178 1310 824 677 633 368 687
608 687 424 216 416 312 206 268 460 246 330 205 288 210 168 220 241 221 167 136 429 331 114 77 282 292 203 122 137 56 189
268 189 145 90 154 125 431 399 87 119 19 100 81 105 103 174 35 159 99 108 266 196 95 123 95 190 94 160 123 209 201 99 150 127 40
$$ packed form
2779B6J27J0j22N2NR7j81K80j11r6J82r8n2lLL5j10K6N5P2J7K1j65J39J2Q2Jj51l8K1q8P5
2404A23o9j1J56p7J43j73jRPk0P1p4M7jq0N0L9o8jP5r8J72r4p3R5J3m0M8j4L6j52P5J48r0
2005A71k7jK6M8j24L7j24R1K5JLJ12N2j12O6j70M3J47j49M1mj03P5JR4j39LQ1J00L4r8jJ6
1617B15J8r4m5Q7j07nK07n1l5j02l1J04o5K88j61j99N4KJ97r5k6jl1J25q1N3p6qJ31k16L1
1254H3P5m6J82q6j30P9M4K5r2p9J87n4J9j29J69r1J20n5j18nJ42q3P5j73J85J5j60J54l3j09
901A11K45m9q3J62op7k5K11R1N9N4m8L39L64P63J3633R571j5390p747q68m86j47m4k65L19
608F87k63k08K00j04j06O2J92k14Q4j25Q3p8m2N2K1k0n4l1K93r8k17l7K05J0q9q1J5q1J33
268A89m4n5O4k9L06l2l12L2j00Q1j9K4kP1j39J24o0RJ58p0j01K8k8R5r6O6l7Q6qj02N1k3q7
$$ plain form
-120 40 280 204 67 80 8 31
$$ packed form
-120D0K40p6j37J3p2K3
-190C1
##PAGE=	F1=13102.9
##FIRST=	25169.313707327481097,	5807.6787752999953227,	0.063984960317611694336
##DATA TABLE=	(F2++(Y..Y)), PROFILE
$$ plain form
5808 188 225 10 37 19 164 45 193 231 156 143 63 77 52 19 160 279 151 40 189 249 183 20 35 271 229 31 149 155 122
5467 122 61 95 186 100 42 59 126 106 25 96 168 127 281 122 248 66 39 74 76 246 364 245 52 207 172 29 220 242 258 272
5115 272 69 71 115 89 121 140 147 156 63 201 138 129 269 229 73 19 68 75 184 168 126 109 169 139 70 121 124 103 103 123 86 87 135 194 144 126
4693 126 88 178 70 133 127 127 69 26 290 285 144 44 157 174 87 46 127 129 153 125 55 112 141 144 151 302 216 147 378 242 146 124 33 55
4294 55 45 98 190 203 89 100 37 19 140 62 131 87 153 76 164 215 246 318 240 167 173 108 148 101 17 85 122 196 75 83 94 11 283 103
3894 103 166 59 83 45 26 187 58 107 170 196 12 135 33 91 82 192 205 72 140 109 229 208 247 141 233 114 66 165 117 180
3542 180 5 60 125 155 133 89 202 163 161 246 144 175 195 96 171 102 65 94 193 191 152 336 178 114 105 75 268 206 57 239 158 219
3167 219 75 188 129 116 93 41 63 99 42 148 169 87 58 4 70 116 183 53 109 93 110 268 213 105 120 177 190 131 161 214 149 183
$$ packed form
5808A88L7k15K7j8J45j19J48L8p5j3q0J4k5l3J41J19j28j11J49O0o6j63J5K36m2j98J18Ol3
5467A22o1L4R1q6n8J7O7k0q1P1P2m1J54j59J26j82k7L5KJ70J18j19j93J55l5j43J91K2J6J4
5115B72k03KM4k6L2J9PRr3J38o3rJ40m0j56n4M9PJ09j6m2j7O0l0o9N1Lk1%K0l7JM8N9n0j8
4693A26l8R0j08O3o%n8m3K64nj41j00J13J7q7m1Q1KK4k8p0N7K9LPJ51q6o9K31j36r6k2r1K2
4294E5j0N3R2J3j14J1o3j8J21p8O9m4O6p7Q8N1L1P2p8p3Oo5M0m7q4O8L7P4j21QJ1q3K72j80
3894A03O3j07K4l8j9J61j29M9O3K6j84J23j02N8rJ10J3j33O8l1J20k1L9j06R2j19m8R9m8O3
3542A80j75N5O5L0k2m4J13l9kQ5j02L1K0r9P5o9l7K9R9kl9J84j58o4rl0J93o2j49J82q1O1
3167B19j44J13n9j3k3n2K2L6n7J06K1q2k9n4O6M6O7j30N6j6J7J58n5j08J5N7J3n9L0N3o5L4
$$ plain form
2791 183 49 146 222 31 63 97 169 16 283 172 94 257 147 135 90 103 182 80 38 150 165 157 193 85 203 225 293 297 140 156
2439 156 132 33 108 16 15 163 80 182 57 106 158 102 90 166 143 223 209 42 99 150 85 58 137 31 207 154 89 181 183 152 233 169 190
2052 190 25 80 238 158 148 159 153 211 71 130 33 98 151 142 107 216 232 122 208 92 131 235 131 178 161 72 98 96 151 90 112 150
1676 150 230 285 205 182 208 248 83 77 163 117 92 224 196 125 124 39 158 100 369 216 56 70 86 257 202 174 178 118 244 107 206 181
1300 181 113 231 71 73 148 105 303 224 127 141 185 206 125 94 286 164 192 65 238 197 240 252 106 51 176 132 216 50 226 237
948 237 36 194 214 82 352 278 207 410 365 277 260 470 500 604 646 582 885 1236 1961 14552 23446 9202 2025 1140 796
655 796 590 623 343 694 432 143 366 308 169 295 417 256 297 194 282 182 119 191 198 201 135 135 371 287 107 86 234 320 211
315 211 127 128 99 168 150 114 177 124 409 353 126 75 44 51 110 75 74 197 38 135 136 153 259 184 77 135 72 181 118 211 73 205 213
$$ packed form
2791A83j34R7P6j91L2L4P2j53K67j11p8J63j10j2m5J3P9j02m2J12J5qL6j08J18K2O8Mj57J6
2439A56k4r9P5r2jJ48q3J02j25M9N2n6j2P6k3Q0j4j67N7N1o5k7P9j06J76n3o5R2Kl1Q1o4K1
2052A90j65N5J58q0j0J1oN8j40N9r7O5N3rl5J09J6j10Q6j16L9J04j04M7j7q9K6kN5o1K2L8
1676A50Q0N5q0k3K6M0j65oQ6m6k5J32k8p1jq5J19n8K69j53j60J4J6J71n5k8Mo0J26j37R9k5
1300A81o8J18j60KP5m3J98p9r7J4M4K1q1l1J92j22K8j27J73m1M3J2j46n5J25m4Q4j66J76J1
948B37k01J58K0j32K70p4p1K03m5q8j7K10L0J04M2o4L03L51P25J2591Q894j4244p177q85l44
655G96k06L3k80L51k62k89K23n8j39J26J22j61M1j03Q8j00o3P2PLo6%K36q4j80k1J48Q6j09
315B11q4Jk9O9j8l6O3n3K85n6k27n1l1PN9l5jJ23j59R7JJ7J06p5j07N8o3J09o3R3j38J32Q
$$ plain form
-73 213 93 121 115 42 277 236 104 41 21 22
$$ packed form
-73B13j20K8op3K35m1j32o3k0J
-190B2
##PAGE=	F1=13000.6
##FIRST=	25169.313707327481097,	5807.6787752999953227,	0.45805257558822631836
##DATA TABLE=	(F2++(Y..Y)), PROFILE
$$ plain form
5808 171 233 41 35 8 171 48 259 281 87 105 116 51 21 37 157 216 125 58 171 236 163 16 67 323 281 30 122 139 83 20
5456 20 107 176 75 29 33 87 75 56 82 135 106 305 131 259 53 68 39 129 271 336 195 14 194 130 10 194 233 255 273 72
5103 72 74 70 79 68 83 160 221 124 234 139 110 239 168 89 77 79 126 210 137 132 109 192 117 76 82 130 115 80 84 141 60 150 197 102 83 62 160 43
4657 43 169 144 124 56 37 333 314 134 69 149 216 118 59 117 128 148 108 65 132 172 168 120 278 213 145 368 222 172 143 65 69 23 97
4270 97 138 176 105 126 42 45 93 80 157 157 134 61 153 187 243 300 182 166 186 119 139 108 80 142 125 209 122 83 103 17 282 120 147 19
3871 19 83 33 80 219 56 124 181 221 41 190 59 38 41 160 174 68 145 139 255 183 254 137 218 116 101 143 67 210 75 105
3519 105 138 121 91 29 192 159 189 256 147 168 199 108 157 56 85 113 180 124 82 299 168 153 145 76 251 242 36 242 159 181 110 174
3143 174 119 63 79 28 88 101 76 112 100 60 73 70 79 140 184 43 145 102 135 313 306 30 190 221 200 182 137 162 185 217 65 162 264
$$ packed form
5808A71O2j92ok7J63j23K11K2j94J8J1o5l0J6J20N9r1o7J13O5p3j47N1K56m2k51R2J7n6o3
5456B0Q7O9j01m6MN4j2j9K6N3k9J99j74J28k06J5k9R0J42O5j41j81J80o4j20J84L9K2J8k01
5103G2KmRj1J5P7O1r7J10r5k9J29p1p9j2KM7Q4p3nk3Q3p5m1OM8j5l5MN7q1R0M7r5j9k1R8j17
4657D3J26k5k0o8j9K96j9j80o5Q0O7r8n9N8J1K0m0m3O7M0mm8J58o5o8K23j46n0k9p8Mm6P4
4270I7M1L8p1K1q4LM8j3P7%k3p3R2L4N6N7j18j6K0o7K0l1k8O2j7Q4q7l9K0q6K65j62K7j28
3871A9O4n0M7J39j63O8N7M0j80J49j31k1LJ19J4j06P7oJ16p2P1j17Q1j02j5M2p6J43j35L0
3519A05L3j7l0o2J63l3L0O7j09K1L1r1M9j01K9K8O7n6m2K17j31j5qo9J75rk06K06q3K2p1O4
3143A74n5n6J6n1O0J3k5L6j2m0J3lRO1M4j41J02m3L3J78pk76J60L1k1j8m5K5K3L2j52R7J02
$$ plain form
2756 264 26 15 97 126 60 253 170 117 210 96 164 56 81 198 98 37 159 144 90 161 118 183 204 259 302 139 183 119 9 95
2404 95 28 20 132 59 98 43 141 208 94 107 178 191 296 266 46 69 143 92 60 144 35 187 185 118 188 192 187 275 196 196 16 71 204 145
2005 145 169 169 126 190 58 114 83 80 171 137 87 199 177 74 155 89 135 175 161 183 135 106 98 62 96 121 129 146 206 256 191 154 199 232 30
1594 30 63 153 150 103 166 153 118 171 61 142 79 320 188 89 42 122 234 207 184 176 116 218 57 169 211 90 186 98 61 136 95 310
1218 310 235 191 124 162 175 109 149 333 125 146 55 220 219 246 280 96 55 103 112 169 58 189 197 39 140 204 30 343 229 171 395
854 395 313 211 232 391 378 515 519 465 704 996 1608 11855 19156 7532 1672 864 672 447 561 303 606 403 78 269
573 269 274 185 303 322 251 251 162 242 163 79 149 140 163 74 124 291 240 90 82 154 334 206 153 131 141 135 163 146 185 111 368 269 165 27
174 27 61 33 134 53 55 210 80 103 157 191 239 157 47 120 63 158 137 239 39 201 230 93 97 108 51 271 245 131 19 49 17
$$ packed form
2756B64k38j1Q2K9o6J93q3n3R3j14O8j08K5J17j00o1J22j5n4P1m3O5K1N5M3j63M4o4j10Q6
2404I5o7qJ12p3L9n5R8O7j14J3P1J3J05l0k20K3P4n1l2Q4j09J52ko7P0MnQ8p9%j80N5J33n9
2005A45K4%m3O4j32N6l1lR1l4n0J12k2j03Q1o6M6M0j4K2m8k9ql6L4K5QJ7O0N0o5l7M5L3k02
1594C0L3R0lm7O3j3l5N3j10Q1o3K41j32r9m7Q0J12k7k3qo0J02j61J12M2j21R6q8l7P5m1K15
1218C10p5m4o7L8J3o6M0J84k08K1r1J65jK7L4j84m1M8RN7j11J31Qj58J01O4j74L13j14n8K24
854C95q2j02K1J59j3J37Mn4K39K92O12J0247P301j1624n860q08j92k25J14k58L03k03l25J91
573B69Nq9J18J9p1%q9Q0p9q4P0rK3q9N0J67n1j50qP2J80j28n3k2J0oK8j7L9p4K57r9j04j38
174B7L4k8J01q1KJ55j30K3N4L4M8q2j10P3n7R5k1J02k00J62K9j37MJ1n7K20k6j14j12L0l2
-190A7
##PAGE=	F1=12898.4
##FIRST=	25169.313707327481097,	5807.6787752999953227,	0.57535421848297119141
##DATA TABLE=	(F2++(Y..Y)), PROFILE
$$ plain form
5808 133 220 82 40 3 152 44 291 295 49 85 167 66 35 41 143 146 102 64 165 213 147 32 114 344 301 34 84 105 35 46 100
5444 100 146 32 93 67 85 40 70 89 85 78 300 136 244 48 106 3 186 275 285 150 37 177 112 39 195 238 235 249 81 53
5092 53 10 60 19 25 157 263 185 238 116 82 187 89 99 143 108 180 211 95 125 99 213 112 84 61 115 107 62 73 174 42 151
4728 151 185 69 49 32 142 20 183 140 103 55 56 341 318 140 90 129 260 159 73 103 98 175 114 72 140 190 177 83 234 181 138
4364 138 327 181 177 148 102 126 19 94 88 136 109 162 48 86 51 73 187 228 118 59 121 139 201 244 101 160 196 126 131 134 126 185 125 219
3965 219 151 113 110 53 249 142 148 50 97 53 115 239 150 170 186 221 63 217 82 19 11 134 139 77 139 155 261 171 254 124 188 127
3589 127 136 103 61 226 155 131 129 85 62 27 164 167 210 259 157 157 199 115 144 50 102 121 160 66 23 251 152 193 171 86 222 252 31 236
3190 236 160 160 127 183 110 17 80 30 100 99 109 105 57 35 84 123 104 159 178 29 176 104 144 331 386 113 239 257 203 211 97 106 221 230
$$ packed form
5808A33Q7j38m2l7J49j08K47Mk46L6Q2j01l1OJ02Lm4l8J01M8o6j15Q2K30m3k67N0K1p0J1N4
5444A00M6j14O1k6J8m5L0J9mpK22j64J08j96N8j03J83Q9J0j35j13J40o5p3J56M3lJ4j68k8
5092E3m3N0m1OJ32J06p8N3j22l4J05r8J0M4l5P2L1j16L0k6J14j01k8k3N4qm5J1J01j32J09
4728A51L4j16k0j7J10j22J63m3l7m8JK85k3j78n0L9J31j01q6L0nP7o1m2O8N0j3r4J51n3m3
4364A38J89j46mk9m6K4j07P5oM8k7N3j14L8l5K2J14M1j10n9O2J8O2M3j43N9L6p0NLqN9o0R4
3965B19o8l8ln7J96j07Or8M7m4O2J24q9K0J6L5j58J54j35o3qJ23No2O2J6J06r0Q3j30O4o1
3589A27Rl3m2J65p1k4km4k3l5J37LM3M9j02%M2q4K9r4N2J9L9r4m3K28r9M1k2q5J36L0k21K05
3190B36p6%l3N6p3r3O3n0P0jJ0mm8k2M9L9j9N5J9j49J47p2M0J87N5k73J26J8n4Qj14RJ15R
$$ plain form
2791 230 75 176 283 23 46 97 77 107 218 177 148 133 77 200 28 71 199 97 52 139 132 38 168 161 154 153 213 312 142 190 97
2427 97 22 76 45 40 113 70 31 58 184 241 87 122 180 206 327 292 56 20 118 92 74 165 67 156 201 137 163 187 219 280 202 194 26 99
2028 99 167 137 199 175 98 155 75 88 136 47 186 115 74 185 131 44 101 68 132 105 186 174 101 139 126 29 82 144 133 141 197 218 173 130 190
1617 190 190 58 56 149 163 100 129 113 154 196 105 119 38 251 151 115 50 180 206 201 180 152 116 174 75 120 225 76 154 121 42 138 81
1230 81 309 240 246 114 140 133 85 201 369 94 89 59 202 227 275 291 90 76 47 110 104 56 138 143 67 115 191 47 329 159 125 353
854 353 243 113 206 264 245 394 351 329 482 689 1131 8305 13476 5317 1204 543 490 282 475 279 449 348 39 148
573 148 217 224 289 195 230 202 115 188 150 56 100 86 116 17 111 202 202 84 66 55 346 202 198 149 168 101 177 161 182 98 317 162 196 33
174 33 73 46 144 89 72 205 119 62 149 212 210 133 15 88 75 126 139 242 52 199 249 91 71 111 57 256 226 144 20 72 26
$$ packed form
2791B30j55J01J07k60K3N1k0L0J11m1k9j5n6J23j72M3J28j02m5Q7pr4J30ppjO0R9j70M8r3
2427I7p5N4l1nP3m3l9K7J26N7j54L5N8K6J21l5k36l6R8k6j8R1r8Q9M5o4K6K4L2O1p8qj68P3
2028I9O8l0O2k4p7N7q0J3M8q9J39p1m1J11n4q7N7l3O4k7Q1j2p3L8j3r7N3O2j1QN6K1m5m3O0
1617A90%j32kR3J4o3K9j6M1M2r1J4q1K13j00l6o5J30K6nk1k8l6N8r9M5J05j49P8l3p9R6n7
1230H1K28o9Oj32K6pm8J16J68k75nl0J43K5M8J6k01j4k9O3om8Q2Np6M8P6j44K82j70l4K28
854C53j10j30R3N8j9J49m3k2J53K07M42P174N171q159m113o61n3k08J93j96J70j01l09J09
573A48O9PO5r4L5k8q7P3l8r4M4j4L0r9R4R1%j18j8j1K91j44mm9J9o7P6j6K1q4K19j55L4j63
174C3M0k7R8n5j7J33q6n7Q7O3kp7j18P3j3N1J3J03j90J47N0j58k0M0n4J99l0q2j24N2m6
-190B6
##PAGE=	F1=12796.1
##FIRST=	25169.313707327481097,	5807.6787752999953227,	0.41154772043228149414
##DATA TABLE=	(F2++(Y..Y)), PROFILE
$$ plain form
5808 84 184 124 58 6 114 35 281 270 96 106 200 96 67 24 110 126 118 54 166 184 137 35 148 335 286 47 44 59 22 90 81 99
5432 99 29 153 98 119 24 57 117 31 49 265 130 201 67 145 42 222 248 213 115 42 162 127 67 204 245 199 199 93 15 75 38
5068 38 22 28 141 282 217 210 68 51 131 19 102 205 152 218 193 46 108 84 231 130 84 58 85 87 48 87 179 63 131 151 39 27
4693 27 6 143 71 177 123 72 68 80 316 296 146 93 115 300 203 89 90 48 215 136 90 140 191 164 49 176 128 128 263 129 162
4329 162 133 118 165 47 93 53 93 126 207 70 132 93 41 201 290 103 83 83 85 129 169 31 157 202 126 140 165 125 185 117 230 158
3953 158 137 121 93 194 163 182 101 121 66 134 259 238 214 183 193 76 207 92 75 13 114 113 93 129 167 244 162 248 109 155 143 170
3578 170 54 94 222 211 126 92 61 55 76 122 183 223 258 169 147 193 113 129 94 114 128 148 79 59 205 139 217 180 94 192 234 41 222
3190 222 160 156 118 206 109 32 92 28 97 100 138 127 89 15 83 152 146 176 171 26 190 100 135 301 433 195 256 271 194 215 51 60 236 213
$$ packed form
5808H4J00o0o6n2J08p9K46j1j74J0R4j04k9m3Q6J6qo4J12J8m7j02J13J87m9k39lJ5l7O8rJ8
5432I9p0J24n5K1r5L3O0q6J8K16j35P1j34P8j03J80K6l5r8p3J20l5o0J37M1m6%j06p8O0l7
5068C8j6OJ13J41o5pj42j7Q0j12Q3J03n3O6k5j47O2k4J47j01m6k6K7Kl9L9R2j16O8K0j12j2
4693B7k1J37p2J06n4n1mJ2K36k0j50n3K2J85r7j14Jm2J67p9m6N0N1k7j15J27m8%J35j34L3
4329A62k9j5M7j18M6m0M0L3Q1j37O2l9n2J60Q9j87k0%KM4M0j38J26M5p6J4K5m0O0o8J13p2
3953A58k1j6k8J01l1J9q1K0n5O8J25k1k4l1J0j17J31j15j7o2J01jk0L6L8P7q2Q6j39M6j2K7
3578A70j16M0J28j1q5l4l1oK1M6O1M0L5q9k2M6q0J6l5K0J4K0o9k0J46o6P8l7q6R8M2j93J81
3190B22o2ml8Q8r7p7O0o4O9LL8j1l8p4O8O9oL0nj45J64r0L5J66J32k38O1J5p7K1j64RJ76k3
$$ plain form
2791 213 80 171 285 33 110 99 39 144 184 179 177 64 156 239 36 88 187 82 57 91 121 81 206 196 120 79 185 314 140 173
2439 173 67 56 48 42 48 109 88 7 76 213 251 83 124 165 188 310 287 81 61 80 90 98 195 111 116 195 145 108 168 238 248 174 171 29 122
2028 122 134 137 231 179 87 117 105 68 180 7 203 90 74 168 92 33 77 36 123 62 196 153 105 175 163 25 105 154 129 129 190 178 166
1641 166 131 179 136 100 66 144 156 93 132 103 178 191 155 110 34 183 129 129 117 244 169 188 159 116 111 122 108 76 220 76 142 136 22 147
1242 147 63 295 236 284 114 131 86 56 237 379 100 77 75 186 234 293 282 95 79 42 128 48 33 78 79 68 119 172 108 310 82
878 82 79 301 191 24 184 113 131 269 213 215 268 387 633 4699 7677 3052 728 245 297 136 401 290 264 286 59 42 150
561 150 241 254 67 198 165 60 141 135 57 50 75 78 92 101 112 175 97 45 51 353 212 244 166 174 66 188 152 171 95 263 53 212 66
174 66 86 85 133 143 112 177 145 42 107 212 176 131 42 55 96 92 125 222 63 195 260 83 34 121 56 227 186 141 15 87 43
$$ packed form
2791B13j33R1J14k52P7j1o0J05M0nkj13R2Q3k03N2R9j05k5L4L0m0J25j0p6m1J06J29j74L3
2439A73j06j1qoOO1k1q1O9J37L8j68M1M1K3J22k3k06k0J9J0QR7q4NP9n0l7O0P0J0p4lj42R3
2028A22J2LR4n2r2L0j2l7J12j73J96j13j6R4p6n9M4m1Q7o1J34m3m8P0j2j38Q0M9k5%O1j2j2
1641A66l5M8m3l6l4P8J2o3L9k9P5J3l6m5p6J49n4%j2J27p5J9k9m3nJ1j4l2J44j44O6oj14J25
1242A47q4K32n9M8j70J7m5l0J81J42k79k3kJ11M8N9j1j87j6l7Q6q0j5M5Jj1N1N3o4K02k28
878H2lK22j10j67J60p1J8J38n6KN3J19K46M066K978m625k324m83N2j61K65j11k6K2k27j7J08
561A50R1J3j87J31l3j05Q1op8pK5LJ4RJ1O3p8n2OL02j41L2p8Qj08J22l6J9p6J68k10J59j46
174F6K0jM8J0l1O5l2j03O5J05l6m5q9J3M1mL3R7j59J32O5j77m9Q7o5J71m1m5j26P2m4
-190D3
##PAGE=	F1=12693.9
##FIRST=	25169.313707327481097,	5807.6787752999953227,	0.18049752712249755859
##DATA TABLE=	(F2++(Y..Y)), PROFILE
$$ plain form
5808 64 130 158 78 18 70 18 229 209 144 144 207 118 89 32 55 169 164 45 166 151 134 32 163 301 243 52 23 15 66 124 61 41 77
5420 77 188 113 156 53 40 147 55 36 208 105 137 97 175 72 216 188 131 90 53 159 158 107 192 236 149 129 105 42 151 38 53
5056 53 65 124 283 213 161 16 29 105 78 109 250 198 241 166 17 81 68 245 165 79 64 53 76 43 123 160 104 88 98 25 37 51 174
4669 174 130 157 100 49 92 109 265 255 154 74 133 331 239 111 87 47 247 158 126 141 171 126 58 108 66 119 190 83 131 100 111 176
4294 176 75 99 33 58 168 251 105 172 163 22 193 337 90 117 58 41 51 121 93 161 201 119 159 186 86 146 99 231 147 143 146 129
3918 129 128 173 230 148 148 74 143 284 306 244 172 143 77 162 88 129 30 98 111 107 127 182 205 146 235 97 145 164 200 58 113 195 229 89
3519 89 44 61 58 116 73 194 224 256 179 137 174 102 103 129 120 138 144 129 96 172 138 222 175 93 160 189 50 201 160 161 83 221 122 61 102 21
3096 21 81 108 161 158 128 27 73 155 199 194 166 32 183 93 108 224 433 239 234 252 172 196 14 37 219 167 82 138 276 59 166
$$ packed form
5808F4O6K8q0o0N2n2K11k0o5%O3q9k9n7K3J14nj19J21j5j7j02J31J38n8j91k9qN1N8o3k0L6
5420G7J11p5M3j03j3J07r2j9J72j03L2m0P8j03J44k8n7m1l7J06jn1Q5M4q7k0k4o3J09j13J5
5056E3J2N9J59p0n2j45J3P6k7L1J41n2M3p5j49O4j3J77q0q6j5j1K3l3Q0L7n6j6J0p3J2J4J23
4669A74m4K7n7n1M3J7J56j0j01q0N9J98r2j28k4m0K00q9l2J5L0m5o8N0m2N3P1j07M8l1J1O5
4294A76j01K4o6K5J10Q3j46O7rj41J71J44k47K7n9j7J0P0k8O8M0q2M0K7j00O0m7J32q4mLj7
3918A29jM5N7q2%p4O9J41K2o2p2k9o6Q5p4M1r9O8J3mK0N5K3n9Q9j38M8J9L6j42N5Q2L4j40
3519H9m5J7lN8m3J21L0L2p7m2L7p2JK6rJ8Oj5l3P6l4Q4m7q2O7K9j39J51m1Jp8J38r9o1M1q1
3096B1O0K7N3ll0j01M6Q2M4nk8j34J51r0J5J16K09j94nJ8q0K4j82K3J82n2q5N6J38k17J07
$$ plain form
2732 166 111 68 161 147 164 198 95 248 275 47 115 167 64 49 25 103 145 240 205 86 44 200 296 123 142 42 86 22 20 42 120
2369 120 98 15 86 214 240 86 109 136 147 250 256 116 122 37 87 127 228 158 77 172 147 40 138 235 185 113 120 15 120 106 148 257
1993 257 181 87 96 138 84 201 32 221 87 83 143 58 26 101 13 111 77 186 124 138 210 195 49 128 159 119 119 172 142 177 160 164 86 125
1594 125 86 131 138 96 152 124 173 160 205 144 89 135 134 131 193 301 129 172 128 90 100 76 114 45 199 84 133 142 32 144 47 265 229
1207 229 301 127 149 45 29 248 360 123 119 93 176 255 282 251 104 65 52 151 72 26 17 23 49 128 143 151 285 41 44 257 194 126 164
819 164 42 60 171 199 156 103 165 214 1744 2891 1179 335 36 141 60 347 322 118 235 93 81 84 216 198 46 168 150
502 150 52 119 113 80 31 105 72 162 101 35 150 113 33 141 345 234 271 168 161 26 191 121 155 98 212 46 209 87 103 147 109
138 109 180 157 129 154 99 43 196 145 148 82 41 114 62 98 190 46 185 256 71 27 128 49 187 136 126 2 92 63
$$ packed form
2732A66n5m3R3j4J7L4j03J53K7k28O8N2j03j5k4P8M2R5l5j19m2J56R6j73J9j00M4o4kK2P8
2369A20k2q3P1J28K6j54K3K7J1J03Oj40Oq5N0M0J01p0q1R5k5j07R8R7n0p2Pj05J05j4M2J09
1993B57p6r4RM2n4J17j69J89j34mO0q5l2P5q8R8l4J09o2J4P2j5j46P9L1m0%N3l0L5j7Mp8L9
1594A25l9M5Pm2N6k8M9j3M5o1n5M6jlO2J08j72M3m4l8J0k4L8o9J54j15M9Rj10J12r7K18l6
1207B29P2j74K2j04j6K19J12k37mk6Q3P9K7l1j47l9j3R9p9m6rOK6P9J5QJ34k44LK13o3o8L8
819A64j22J8J11K8m3n3O2M9J530J147j712q44k99J05q1K87k5k04J17j42j2LJ32j8j52J22j8
502A50r8O7ol3m9P4l3R0o1o6J15l7q0J08K04j11L7j03pj35J65p0L4n7J14j66J63j22J6M4l8
138A09P1k3k8K5n5n6J53n1Lo6m1P3n2L6R2j44J39P1j85m4J01p9J38n1j0j24R0k9
-190F3
##PAGE=	F1=12591.6
##FIRST=	25169.313707327481097,	5807.6787752999953227,	0.04906915128231048584
##DATA TABLE=	(F2++(Y..Y)), PROFILE
$$ plain form
5808 109 67 176 94 37 47 17 144 126 167 175 189 125 92 84 25 214 202 63 164 118 135 51 160 253 183 40 25 31 101 140 52 21 111
5420 111 188 118 180 85 91 170 117 45 140 63 71 120 185 88 166 112 70 72 95 169 187 153 150 198 99 61 116 93 212 65 75 83 118 276 178 114
4998 114 64 47 123 137 124 267 235 256 139 67 46 62 251 207 88 74 36 90 68 185 127 146 35 40 43 77 105 221 174 130 77 50
4622 50 126 140 201 210 173 39 174 343 258 133 98 107 260 169 170 150 135 74 102 39 29 112 127 67 95 56 90 161 98 111 16 34 217 281
4223 281 143 192 214 84 165 359 73 144 57 23 37 135 162 164 190 108 170 188 27 92 77 215 124 136 187 155 72 164 268 188 168 87
3848 87 147 306 348 258 155 84 65 92 73 178 47 81 132 117 138 194 150 126 218 93 166 189 222 119 105 146 208 40 88 75 58 147
3472 147 42 186 211 249 178 126 137 85 67 139 125 151 136 162 107 151 148 209 160 81 121 126 52 174 162 164 34 215 138 79 103 36 57 124
3073 124 177 187 144 57 73 133 254 215 161 34 155 82 72 120 389 235 178 200 132 160 32 38 173 99 87 81 262 91 203 137 122
$$ packed form
5808A09m2J09q2n7J0l0J27j8M1QJ4o4l3qn9J89j2j39J01m6J7q4J09R3p0j43j5OP0L9q8l1R0
5420A11P7p0O2r5OP9n3p2R5p7QM9O5r7P8n4m2KK3P4J8l4lM8r9l8N5k3J19j47J0QL5J58r8o4
4998A14n0j7P6J4j3J43l2K1j17p2k1J6J89m4j19j4l8N4k2J17n8J9j11NLL4K8J16m7m4n3k7
4622E0P6J4O1Rl7j34J35J69q5j25l5RJ53r1Jk0j5o1K8o3j0Q3J5o0K8l9L4P1o3J3r5J8J83O4
4223B81j38M9K2j30Q1J94k86P1q7l4J4R8K7KK6q2O2J8j61O5j5J38r1J2N1l2q3R2J04q0k0q1
3848H7O0J59M2r0j03p1j9K7j9J05j31L4N1j5K1N6m4k4R2j25P3K3L3j03j4M1O2j68M8j3j7Q9
3472A47j05J44K5L8p1n2J1n2j8P2j4K6j5K6n5M4lO1m9p9M0Np4J22j2Kj30J81p7n9K4o7K1O7
3073A24N3J0m3q7J6O0J21l9n4j27J21p3j0M8K69j54n7K2o8K8j28OJ35p4j2oJ81j71J12o6j5
$$ plain form
2709 122 158 98 130 206 150 308 302 37 132 143 51 35 46 76 196 249 174 53 118 235 250 88 115 53 107 47 14 29 136 101 2 92
2333 92 182 212 100 81 101 102 165 211 148 164 32 83 153 255 202 80 144 148 60 103 203 110 29 48 14 88 86 166 274 182 81 101 172
1946 172 127 191 63 228 105 92 108 28 14 136 45 95 102 158 98 158 232 213 71 133 172 109 128 142 116 195 197 142 51 138 100 107 133 117
1547 117 164 149 148 116 252 204 133 108 152 122 263 340 100 157 102 92 95 44 89 32 168 97 110 138 73 115 36 223 228 303 152 193 28
1160 28 44 231 315 135 147 107 174 283 244 203 111 55 45 167 126 79 43 62 65 129 120 170 255 80 40 231 238 224 140 152 41 121 249
772 249 142 30 105 112 140 199 42 85 102 50 69 293 348 123 205 121 137 26 156 129 115 152 154 113 132 88 119 64 135 87 208 111
397 111 70 119 118 35 210 310 251 270 150 137 41 184 77 132 96 165 106 188 97 122 219 107 184 201 93 146 167 60 172 131 165
33 165 119 52 120 45 69 153 4 168 237 73 79 120 43 144 89 108 27 86 81
$$ packed form
2709A22L6o0L2P6n6J58ok65R5J1r2j6J1L0J20N3p5j21O5J17J5j62K7o2N4o0l3J5J07l5r9R0
2333I2R0L0j12j9K0JO3M6o3J6j32N1P0J02n3j22O4Mq8M3J00r3q1J9l4P4kQ0J08r2j01K0P1
1946A72m5O4j28J65j23j3J6q0j4J22r1N0PN6o0O0P4j9j42O2L9o3J9J4k6P9Kn5r1Q7l8PK6j6
1547A17M7j5jl2J36m8p1k5M4l0J41P7k40N7n5j0Ln1M5n7J36p1J3K8o5M2p9J87NP5j51M1j65
1160B8J6J87Q4j80J2m0O7J09l9m1r2n6j0J22m1m7l6J9LO4rN0Q5j75m0J91Pj4q4J2j11Q0J28
772B49j07j12P5PK8N9j57M3J7n2J9K24N5k25Q2q4J6j11J30k7j4L7Km1J9m4L1n5P1m8J21r7
397A11m1M9jq3J75J00n9J9j20j3r6J43j07N5l6O9n9Q2r1K5R7j12P7J7j08N3K1j07J12m1L4
33A65m6o7O8p5K4Q4j49J64O9j64OM1p7J01n5J9q1N9n
-190H1
##PAGE=	F1=12489.3
##FIRST=	25169.313707327481097,	5807.6787752999953227,	0.02671884000301361084
##DATA TABLE=	(F2++(Y..Y)), PROFILE
$$ plain form
5808 161 26 173 103 59 65 51 42 52 161 192 157 114 74 136 100 230 212 97 164 96 131 94 143 201 128 18 17 52 125 137 50 63 123
5420 123 159 116 186 109 172 187 171 56 77 50 52 128 171 90 80 100 86 58 144 188 203 190 88 140 71 68 120 133 247 92 96 84 131 272
5021 272 132 103 115 76 148 170 138 252 252 263 121 117 32 71 246 245 125 93 43 112 118 260 90 182 74 44 57 125 162 267 189 102
4646 102 61 60 161 167 140 180 209 26 207 328 252 143 120 152 247 162 210 163 93 44 142 46 75 103 89 86 68 28 71 130 118 127 15 30
4247 30 252 282 173 187 232 147 133 352 57 163 76 29 68 165 205 155 163 95 156 171 38 74 66 176 96 134 232 165 62 133 282 218
3871 218 176 105 143 311 362 253 133 46 39 46 56 221 64 64 160 126 146 195 90 122 200 99 198 214 236 178 73 81 158 75 176 95
3495 95 59 171 70 155 185 230 162 110 84 68 29 129 136 159 112 169 92 138 164 191 141 65 69 56 55 137 169 165 15 187 147 90 95 70 49
3085 49 145 189 205 136 83 108 96 299 234 157 45 113 63 61 59 318 185 104 125 78 121 56 41 112 32 97 18 237 115 212 173 170 138 38
$$ packed form
5808A61j35J47p0m4Oj4rJ0J09L1l5m3m0O2l6J30j8j15O7o8L5l7M9N8p3j10jL5P3J2q7J3O0
5420A23L6m3P0p7O3J5j6j15K1k7KP6M3q1j0K0j4k8Q6M4J5j3j02N2o9lN2J3J14j55Mj2M7J41
5021B72j40k9J2l9P2K2l2J14%J1j42mq5L9J75jj20l2n0O9OJ42j70R2j08l0J3O8L7J05p8q7
4646A02m1jJ01Ok7M0K9j83J81J21p6j09k3L2R5q5M8m7p0m9R8r6K9K8j4lj8m0M3N9j2Rj12J5
4247C0K22L0j09J4M5q5j4K19k95J06q7m7L9R7M0n0Qo8O1J5j33L6qJ10q0L8R8o7j03P1J49o4
3871B18m2p1L8J68N1j09j20q7pPJ0J65j57%R6l4K0M9j05L2P8j01R9J6K2n8j05QP7q3J01q1
3495I5l6J12j01Q5L0M5o8n2k6j6l9J00PK3m7N7p7M6K6K7n0p6Mj3jQ2L2mj50J72m0n7Nk5k1
3085D9R6M4J6o9n3K5j2K03o5p7j12O8n0kkK59j33q1K1m7M3o5j5P1q0O5p9K19j22R7l9ll2j00
$$ plain form
2685 38 91 196 171 318 313 31 129 121 47 32 109 44 230 225 104 31 181 254 177 39 115 89 117 84 50 36 148 102 27 104 119 177 128
2298 128 52 76 68 75 169 164 175 72 70 167 268 239 131 130 152 122 79 147 72 70 42 54 44 84 187 277 180 70 110 208 174 146 84 207 121
1887 121 95 64 18 19 159 78 75 114 120 100 156 232 212 91 118 198 100 155 114 105 205 220 119 46 151 100 79 159 148 158 162 117 70 287
1488 287 263 152 92 161 108 314 359 96 141 101 110 102 34 44 32 137 116 69 127 127 60 28 182 239 295 187 248 31 83 189 263 127
1113 127 135 118 174 296 191 147 117 68 34 176 173 131 91 115 129 115 126 168 221 108 61 226 284 291 110 219 44 118 263 136 55
749 55 129 231 898 1479 552 66 122 28 71 214 348 181 200 138 158 21 79 75 148 150 163 181 167 71 165 95 150 95 223 128 136 88
373 88 111 39 250 252 248 238 121 118 97 169 35 104 86 127 132 156 104 138 285 159 152 238 115 126 217 130 153 144 170 151 83 116 52 56 119 58
-49 58 147 213 101 125 93 53 107 59 100 50 72 93
$$ packed form
2685C8N3J05k5J47nk82R8qp4j5P7o5J86nj21p3J50P3p7j38P6k6K8l3l4j4J12m6p5P7J5N8m9
2298A28p6K4qPR4nJ1j03kR7J01k9j08jK2l0m3O8p5kk8J2j0M0J03R0r7j10M0R8l4k8o2J23q6
1887A21k6l1m6JJ40q1lL9Ok0N6P6k0j21K7Q0r8N5m1rJ00J5j01p3J05n1k1Q0j1J0Mm5m7K17
1488B87k4j11o0O9n3K06M5k63M5m0Rqo8J0j2J05k1m7N8%o7l2J54N7N6j08O1k17N2J06P4j36
1113A27Qj7N6J22j05m4l0m9l4J42lm2m0K4J4j4J1M2N3j13m7J65N8Pj81J09j75P4J45j27q1
749E5P4J02O67N81r27m86N6r4M3J43J34j67J9o2K0j37N8mP3KJ3J8j4r6R4p0N5n5J28r5Qm8
373H8K3p2K11Kmj0j17lk1P2j34O9j8M1NK4n2L4J47j26pQ6j23J1R1q7K3rK6j9o8L3o4MO3o1
-49E8Q9O6j12K4l2m0N4m8M1n0K2K1
-190I3
##PAGE=	F1=12387.1
##FIRST=	25169.313707327481097,	5807.6787752999953227,	0.080041937530040740967
##DATA TABLE=	(F2++(Y..Y)), PROFILE
$$ plain form
5808 197 62 152 107 79 90 89 57 74 129 190 125 87 42 173 170 210 188 126 169 94 118 145 117 150 98 57 35 59 138 120 44 89 111 118 107
5397 107 179 125 249 199 207 59 38 98 80 121 129 86 21 184 131 45 174 204 203 204 55 91 69 121 116 154 254 110 127 82 160 273 117
5010 117 123 143 98 155 170 137 205 244 261 120 157 65 86 230 267 177 126 59 121 174 330 59 210 145 84 54 171 215 298 173 73
4646 73 63 63 190 182 96 179 250 67 214 283 217 129 143 167 210 140 239 174 72 81 163 112 122 89 77 120 65 60 76 95 138 142 40 60 265
4235 265 245 185 160 211 198 117 314 69 186 107 47 75 172 216 129 120 79 118 142 86 106 75 120 72 149 270 162 87 84 269 237 169 123
3848 123 127 291 350 232 107 75 15 107 42 253 79 51 186 140 140 180 54 147 188 112 222 235 241 221 38 9 104 139 250 115 69
3484 69 189 113 105 152 193 128 86 57 67 24 111 153 157 88 148 61 131 177 177 127 68 23 28 62 89 175 167 52 145 143 102 83 105 80 169 196 201 110
3038 110 96 166 57 324 246 157 74 66 45 98 120 244 106 69 43 33 97 73 43 63 68 110 77 195 117 198 208 202 108 33 86 173 157 274
$$ packed form
5808A97j35R0m5k8J1jl2J7N5O1o5l8m5J31lM0k2o2M3p5K4K7k8L3n2m1k2K4P9j8p6M5K2Pj1
5397A07P2n4J24n0Qj48k1O0j8M1Qm3o5J63n3q6J29L0jJj49L6k2N2nL8J00j44J7m5P8J13j56
5010A17OK0m5N7J5l3O8L9J7j41L7r2K1J44L7r0n1o7O2N3J56k71J51o5o1l0J17M4Q3j25j00
4646G3j0%J27qq6Q3P1j83J47O9o6q8J4K4M3p0R9o5j02RQ2n1J0l3j2M3n5nJ6J9M3Mj02K0K05
4235B65k0o0k5N1j3q1J97k45J17p9o0K8R7M4q7rm1L9K4n6K0l1M5m8P7J21j08p5lJ85l2o8m6
3848A23MJ64N9j18j25l2o0R2o5K11j74k8J35m6%M0j26R3M1p6J10J3Ok0j83k9R5L5J11j35m6
3484F9J20p6qM7M1o5m2k9J0m3Q7M2Mo9O0q7P0M6%n0n9m5NL4K7Q6qj15R3km1j9K2k5Q9K7Nr1
3038A10j4P0j09K67p8q9q3qk1N3K2J24j38l7k6j0O4k4l0K0NM2l3J18p8Q1J0or4p5N3Q7j6J17
$$ plain form
2639 274 304 76 103 101 49 44 155 47 244 174 4 68 208 243 88 23 137 124 114 111 73 62 150 107 53 130 42 144 168 51 78
2275 78 51 5 146 159 154 105 48 161 263 265 186 134 159 159 91 90 119 160 117 94 70 100 206 265 170 74 105 239 214 80 97 150 125 90
1876 90 26 46 38 165 105 51 122 80 135 154 207 191 114 86 232 94 182 102 101 198 218 107 90 173 82 60 204 182 137 160 95 32 305
1488 305 303 145 81 152 97 341 361 102 125 115 123 120 48 24 41 114 137 17 111 186 47 31 168 265 287 229 298 25 119 134 223 105
1113 105 82 133 165 279 140 90 126 90 49 181 207 165 127 150 197 88 152 151 185 104 80 236 309 323 82 236 62 136 226 134 55
749 55 132 229 792 1349 517 86 72 51 74 111 316 198 214 145 156 56 48 102 152 149 172 235 202 77 208 111 152 93 209 147 182 72
373 72 101 46 262 188 223 180 100 106 143 150 28 73 74 106 130 133 114 147 329 236 92 258 165 98 237 176 142 169 158 177 127 114 76 68 89
-38 89 120 122 198 141 154 59 80 81 46 104 63 54 98
$$ packed form
2639B74L0k28K7kn2nJ11j08J97p0j70O4J40L5j55o5J14j3j0ll8j1Q8m3n4P7q8J02K4j17K7
2275G8k7m6J41J3nm9n7J13J02Kp9n2K5%o8jK9M1m3k3k4L0J06N9r5r6L1J34k5j34J7N3k5l5
1876I0o4K0qJ27o0n4P1m2N5J9N3j6p7k8J46j38Q8q0jR7K0j11j7Q3r1k2J44k2m5K3o5o3K73
1488C05kj58o4P1n5K44K0k59K3j0Qlp2k4J7P3K3j20R4P5j39j6J37R7K2n8O9k73R4J5Q9j18
1113A05k3N1L2J14j39n0L6l6m1J32K6m2l8K3M7j09O4jL4q1k4J56P3J4k41J54j74P4R0r2p9
749E5P7R7N63N57q32m31j4k1K3L7K05j18J6o9J1j00qN4N0lK3O3l3j25J31r7M1n9J16o2L5j10
373G2K9n5K16p4L5m3q0OL7Pj22M5JL2K4Lj9L3J82r3j44J66r3o7J39o1l4K7j1J9n0j3l8qK1
-38H9L1KP6n7J3r5K1Jl5N8m1rM4
-190I8
##PAGE=	F1=12284.8
##FIRST=	25169.313707327481097,	5807.6787752999953227,	0.11543782055377960205
##DATA TABLE=	(F2++(Y..Y)), PROFILE
$$ plain form
5808 207 91 120 110 94 106 124 137 124 80 170 102 55 40 183 217 159 134 143 173 102 107 194 86 102 87 114 86 64 142 103 30 96 83 94
5409 94 86 166 131 302 202 221 56 41 142 91 99 66 95 117 267 164 34 173 203 184 187 92 100 65 153 100 154 238 113 167 94 198
5033 198 268 142 135 143 108 135 137 113 133 211 247 141 183 97 93 202 269 230 172 78 110 218 376 62 229 198 106 37 208 257 312 131
4657 131 42 87 56 205 182 97 199 282 103 189 210 154 93 158 148 154 110 255 180 84 121 160 169 153 69 66 165 84 97 103 67 160 154 66 112
4247 112 264 171 176 133 163 231 125 248 115 226 144 72 79 158 198 90 70 63 66 121 114 132 93 59 60 171 292 152 107 47 237 243 151
3859 151 136 102 247 318 195 88 123 59 175 36 272 88 43 202 162 117 152 75 180 180 127 232 243 241 243 61 63 78 180 291
3507 291 137 91 203 146 58 127 142 90 57 112 97 46 98 165 149 113 108 32 122 176 169 120 99 70 84 69 35 172 167 72 102 128 116 79 129
3096 129 124 192 199 172 76 95 231 48 321 247 164 107 28 55 137 166 185 54 113 32 76 104 84 51 73 124 124 149 138 93 172 233 220 78
$$ packed form
5808B07j16K9j0j6J2J8J3j3m4R0o8m7j5J43L4n8k5RL0p1NQ7j08J6j5K7k8k2P8l9p3O6j3J1
5409I4qQ0l5J71j00J9j65j5J01n1Ql3K9K2J50j03j30J39L0j9Lr5Ql5Q8n3N4Q4j25N4p3J04
5033A98P0j26pQl5K7Kk4K0P8L6j06M2q6mJ09O7l9n8r4L2J08J58l14J67l1r2o9J71M9N5j81
4657A31q9M5l1J49k3q5J02Q3j79Q6K1n6o1O5j0Om4J45p5r6L7L9Rj6q4lR9q1J3Ol6R3oq8M6
4247A12J52r3Nm3L0O8j06J23j33J11q2p2PP9M0j08k0pLN5pJ8l9l4JJ11J21j40m5o0J90Or2
3859A51j5l4J45P1j23j07L5o4J16j39K36j84m5J59m0m5L5p7J05%n3J05J1kKj82KJ5J02J11
3507B91j54m6J12n7q8O9J5n2l3N5j5n1N2O7j6l6np6R0N4pm9k1k9J4j5l4J37nr5L0K6j2l7N0
3096A29nO8Pk7r6J9J36j83K73p4q3n7p9K7Q2K9J9j31N9q1M4K8k0l3K2N1%K5j1m5P9O1j3j42
$$ plain form
2697 78 90 127 142 129 188 276 130 65 85 53 55 179 90 242 107 109 132 195 206 30 76 158 153 103 121 76 95 137 116 70 171 46 124
2310 124 212 76 100 42 59 149 137 108 123 44 137 237 277 224 144 168 163 127 101 182 233 171 126 130 117 219 237 152 95 82 256 239 64
1923 64 107 64 120 79 46 78 49 159 127 27 131 55 176 177 163 154 142 45 260 88 201 108 96 167 187 124 156 204 47 57 243 215
1547 215 107 147 78 14 301 318 119 86 123 94 345 349 95 109 122 125 137 86 61 45 101 154 33 94 243 122 55 197 304 283 272
1183 272 334 21 144 78 204 76 1 159 140 228 104 42 134 102 79 186 227 170 151 159 250 55 169 130 147 71 90 250 305 325
831 325 73 212 92 162 152 136 40 144 146 279 500 191 87 11 97 112 58 257 180 236 140 154 76 92 161 144 138 175 266 220 102
467 102 236 110 153 86 176 162 198 73 103 69 252 151 178 111 99 90 161 132 53 43 75 109 124 136 122 145 340 304 38 256 202 73
92 73 226 186 129 187 133 198 174 128 103 91 61 168 94 201 178 166 73 113 74 50 110 63 39 94
$$ packed form
2697G8J2L7J5j3N9Q8j46o5K0l2KJ24q9J52j35KK3O3J1j76M6Q2nn0J8m5J9M2k1m6J01j25P8
2310A24Q8j36K4n8J7R0j2k9J5p9R3J00M0n3q0K4nl6k6Q1N1o2m5Mj3J02J8q5n7j3J74j7j75
1923F4M3m3N6m1l3L2k9J10l2j00J04p6J21Jj4rj2r7K15j72J13r3j2P1K0o3L2M8j57J0J86k8
1547B15j08M0o9o4K87J7j99l3L7k9K51Mk54J4J3LJ2n1k5j6N6N3j21O1J49j21o7J42J07k1j1
1183B72O2l13J23o6J26j28p5J58j9Q8j24o2R2l2k3J07M1n7j9QR1j95J14l9J7p6J9J60N5K0
831C25k52J39j20P0j0j6r6J04KJ33K21l09j04p6Q6J5n4J99p7N6r6J4p8J6O9j7oL7R1m6j18
467A02J34j26M3o7R0j4L6j25L0l4J83j01K7o7j2rP1k9p9j0L2L4J5J2j4K3J95l6k66K18n4j29
92G3J53m0n7N8n4O5k4m6k5j2l0J07p4J07k3j2r3M0l9k4O0m7k4N5
-190I4
##PAGE=	F1=12182.6
##FIRST=	25169.313707327481097,	5807.6787752999953227,	0.23975649476051330566
##DATA TABLE=	(F2++(Y..Y)), PROFILE
$$ plain form
5808 194 96 89 115 99 113 149 187 158 54 134 83 49 80 164 235 92 64 147 172 110 120 233 57 65 69 164 137 79 140 101 12 92 48 103
5409 103 71 156 128 319 188 211 53 50 160 74 70 41 126 187 317 183 45 140 177 151 142 125 129 43 156 74 136 211 105 211 117 227
5033 227 249 167 122 118 106 96 74 69 53 162 224 169 190 111 83 167 251 276 225 97 82 238 389 104 234 217 107 24 235 280 306 85
4657 85 29 121 41 202 173 140 225 296 122 137 121 75 62 162 101 93 79 258 181 103 141 139 206 165 49 47 217 115 123 138 59 185 161
4270 161 88 172 260 72 147 129 116 247 140 166 171 275 175 88 105 137 157 42 45 50 39 128 120 136 104 35 63 189 294 146 118 84
3894 84 205 236 127 144 83 190 272 152 88 164 114 220 38 273 88 41 204 190 100 122 102 198 172 135 228 234 237 247 106 119 88
3531 88 186 289 157 119 210 164 71 121 104 84 42 179 141 64 93 165 150 177 72 31 104 156 159 119 140 128 137 67 30 159 159 75 70 106 131
3120 131 94 135 163 212 195 123 56 80 291 89 291 234 174 132 24 82 154 172 152 102 150 78 130 131 87 66 104 158 135 200 76 48 157
$$ packed form
5808A94r8pK6j6J4L6L8k9j04Q0n1l4L1Q4P1j43k8Q3K5o2J0J13j76QMR5k7n8O1l9q9Q0m4N5
5409A03l2Q5k8J91j31K3j58lJ10q6mk9Q5O1J30j34j38R5L7k6rj7Mq6J13q2O2P5j06J06r4J10
5033B27K2q2m5mj2j0k2nj6J09O2n5K1p9k8Q4Q4K5n1j28j5J56J51k85J30j7j10q3K11M5K6k21
4657H5n6R2q0J61k9l3Q5P1j74J5j6m6j3J00o1qj4J79p7p8L8kO7m1j16kJ70j02QJ5p9J26k4
4270A61p3Q4Q8j88P5j8j3J31j07K6NJ04j00q7J7L2K0j15LNj1Q9qJ6l2o9K8J26J05j48k8l4
3894H4J21L1j09J7o1J07Q2j20o4P6n0J06j82K35j85m7J63j4r0K2k0R6k6l7R3OLJ0j41J3l1
3531H8R8J03j32l8R1m6r3N0j7k0m2J37l8p7K9P2j5K7j05m1P3N2Lm0K1j2Rp0l7J29%q4nL6K5
3120A31l7M1K8M9j7p2o7K4K11k02K02n7o0m2j08N8P2J8k0n0M8p2N2Jm4k1L8N4k3O5j24k8J09
$$ plain form
2732 157 246 229 58 127 173 110 130 85 232 166 51 72 56 57 182 131 227 41 211 201 152 161 90 126 172 173 90 113 59 131 110 127 80
2345 80 219 108 124 249 96 125 31 95 167 112 53 127 84 106 194 270 234 148 176 137 159 164 234 283 195 144 173 118 220 196 137 106 50
1958 50 251 244 138 121 37 125 68 78 111 48 143 145 12 142 69 197 217 115 120 173 27 270 80 207 117 84 115 135 163 225 235 24
1582 24 53 266 242 76 126 59 40 275 308 99 104 75 97 329 326 67 95 115 117 147 134 85 35 86 160 69 82 287 192 91 255 348
1207 348 285 306 349 42 155 44 195 46 93 195 99 154 92 26 133 105 106 187 231 148 162 141 276 44 162 110 106 21 89 257
854 257 268 309 86 166 118 186 69 129 27 173 36 361 527 186 98 84 134 159 144 187 149 247 122 163 78 119 202 134 115 170 269
491 269 210 131 242 95 163 83 140 173 180 77 114 105 224 157 127 51 106 62 145 116 77 32 95 125 137 159 124 127 313 343 80 231 215
103 215 77 193 165 106 186 100 211 208 146 117 111 39 192 66 220 202 175 135 144 99 81 107 55 32 79
$$ packed form
2732A57Q9j7j71O9M6o3K0m5J47o6j15K1j6JJ25n1R6j86J70j0m9Rp1L6M6Jq3K3n4P2k1J7m7
2345H0J39j11J6J25j53K9r4O4P2n5n9P4m3K2Q8P6l6q6K8l9K2NP0M9q8n1K9n5J02k4n9l1n6
1958E0K01pj06j7q4Q8n7J0L3o3R5Kj33J30p3J28K0j02NN3j46K43j90J27r0l3L1K0K8O2J0k11
1582B4K9K13k4j66N0o7j9K35L3k09Nk9K2K32lk59K8K0KL0j3m9n0N1P4r1J3K05r5j01J64R3
1207C48o3K1M3l07J13j11J51j49M7J02r6N5o2o6J07k8JQ1M4q3J4k1J35k32J18n2mq5O8J68
854B57J1M1k23Q0m8O8j17O0j02J46j37L25J66l41q8j4N0K5j5M3l8R8j25M1q5M1Q3o8j9N5R9
491B69n9p9J11j47O8q0N7L3Pj03L7rJ19o7l0p6N5m4Q3k9l9m5O3L0J2K2l5LJ86L0k63J51j6
103B15j38J16k8n9Q0q6J11lo2k9op2J53j26J54j8k7m0Rm5j8K6n2k3M7
-190G9
##PAGE=	F1=12080.3
##FIRST=	25169.313707327481097,	5807.6787752999953227,	0.36821731925010681152
##DATA TABLE=	(F2++(Y..Y)), PROFILE
$$ plain form
5808 162 77 78 123 92 115 161 206 181 97 95 69 83 117 121 225 34 46 142 164 112 162 258 48 61 38 193 168 99 132 114 21 86 22 122
5409 122 102 149 117 297 152 181 55 55 144 49 40 110 167 224 328 192 76 98 126 113 79 126 130 51 136 44 104 185 96 251 136 235
5033 235 210 167 87 72 95 76 14 21 52 108 199 184 177 105 57 129 221 311 271 109 50 229 364 155 220 195 107 48 252 278 284 71 59
4646 59 156 28 177 163 190 246 291 121 71 54 51 89 157 49 49 54 254 180 112 142 114 221 161 40 33 269 157 138 171 75 210 165
4270 165 104 232 260 37 120 142 103 252 143 87 220 316 188 83 128 122 104 7 73 43 66 154 113 126 103 78 77 200 283 150 127
3906 127 138 192 215 108 144 82 136 217 107 104 195 166 235 43 256 79 42 192 216 124 102 110 191 159 131 211 210 228 236 134 153 103 159
3519 159 247 170 142 212 170 113 126 111 115 63 226 179 80 89 145 171 237 70 31 70 123 143 114 173 170 181 54 78 149 135 68 54 80 140 125
3108 125 122 192 225 181 74 72 56 335 139 238 208 179 141 36 96 141 154 147 146 151 96 164 154 79 84 120 165 138 223 44 54 168 244 237 54
$$ packed form
5808A62q5JM5l1K3M6M5k5q4kk6J4L4MJ04j91J2R6K2n2N0R6k10J3k3J55k5o9L3j8r3O5o4J00
5409A22k0M7l2J80j45K9j26%Q9r5rP0N7N7J04j36j16K2K8j3l4M7Mp9Q5r2O0Q1q9J55j15R9
5033B35k5m3q0j5K3j9o2PL1N6R1j5pp2m8P2R2R0m0j62n9J79J35k09O5k5q8n9K04K6Ok13j2
4646E9R7j28J49j4K7N6M5j70n0j7lL8O8j08%NK00p4o8L0k8J07o0j21pK36j12j9L3r6J35m5
4270A65o1J28K8k23Q3K2l9J49j09n6J33R6j28j05M5oj8r7O6l0K3Q8m1J3k3k5jJ23Q3j33k3
3906A27J1N4K3j07L6o2N4Q1j10lR1k9O9j92K13j77l7J50K4r2k2QQ1l2k8Q0jJ8Qj02J9n0N6
3519A59Q8p7k8P0m2n7J3j5Mn2J63m7r9RN6K6O6j67l9L9N3K0k9N9lJ1j27K4P1j4o7j4K6O0j5
3108A25lP0L3m4j07kj6K79j96R9l0k9l8j05O0M5J3pjNn5O8j0p5NL6M5k7Q5j79J0J14P6pj83
$$ plain form
2697 54 132 205 85 164 19 179 170 85 61 53 60 171 152 204 12 283 261 101 135 138 166 180 187 83 96 58 168 74 138 96 268 146
2322 146 143 271 103 143 13 118 187 108 36 124 131 82 145 245 214 143 181 92 173 215 272 307 184 150 187 99 208 146 141 93 19 220
1946 220 227 209 137 130 146 65 93 141 37 121 160 29 148 106 187 243 81 110 198 54 258 71 205 124 69 51 84 206 279 259 80
1582 80 34 269 256 51 105 49 70 234 280 106 129 15 100 299 296 23 86 105 106 144 177 101 13 58 152 87 75 308 235 124 320
1218 320 387 286 325 345 66 155 43 185 16 170 234 58 76 99 47 115 104 123 175 216 107 163 105 274 70 126 85 65 33 80
866 80 252 206 286 96 116 135 202 56 101 17 190 69 632 1065 411 95 128 144 189 219 138 121 237 99 181 62 112 212 120
526 120 84 152 246 173 159 223 70 184 86 123 181 137 78 123 140 188 170 84 54 105 39 99 99 96 51 124 139 158 176 116 91 253 344 132
127 132 186 205 117 161 124 73 163 67 216 221 149 110 125 44 192 51 239 211 197 196 166 148 131 94 52 35 51
$$ packed form
2697E4P8P3j20P9j45J60rq5k4qPJ11j9N2j92K71k2j60L4LK8J4Pj04J3l8J10r4O4m2J72j22
2322A46lJ28j68M0j30J05O9p9p2Q8Pm9O3J00l1p1L8q9Q1M2N7L5j23l4L7q8J09o2nm8p4K01
1946B20Pj8p2pJ6q1K8M8j04Q4L9j31J19m2Q1N6j62K9Q8j44K04j87J34q1n5j8L3J22P3k0j79
1582H0m6K35j3k05N4n6K1J64M6j74K3j14Q5J99lk73O3J9JL8L3p6q8M5R4o5j2K33p3j11J96
1218C20O7j01L9K0k79Q9j12J42j69J54O4j76J8K3n2O8j1J9N2M1j09N6n8J69k04N6m1k0l2M7
866H0J72m6Q0j90K0J9O7j46M5q4J73j21N63M33o54l16L3J6M5L0q1j7J16j38Q2j19N0J00r2
526A20l6O8R4p3j4O4j53J14r8L7N8m4n9M5J7M8j8q6l0N1o6O0%lm5P3J5J9J8o0k5J62R1k12
127A32N4J9q8M4l7n1R0r6J49Np2l9J5q1J48j41J88k8j4jl0j8j7l7m2j7J6
-190E1
##PAGE=	F1=11978.1
##FIRST=	25169.313707327481097,	5807.6787752999953227,	0.39500564336776733398
##DATA TABLE=	(F2++(Y..Y)), PROFILE
$$ plain form
5808 119 41 91 129 70 114 161 198 204 151 77 90 120 137 68 199 61 101 136 148 111 214 267 70 78 43 196 166 115 123 135 43 83 27 133
5409 133 161 139 101 249 94 138 61 66 104 57 22 177 206 236 303 193 111 97 73 84 11 95 96 114 121 44 69 166 100 278 144 215 156
5021 156 141 40 19 80 122 100 53 121 61 175 174 143 93 20 94 188 336 299 110 27 191 306 196 182 138 125 87 257 250 252 88 97
4646 97 183 31 135 160 224 259 274 104 13 93 123 138 150 63 63 45 247 177 114 129 98 216 146 46 34 315 203 144 194 93 227
4282 227 172 122 285 259 128 132 145 118 251 127 70 250 331 185 55 125 107 49 46 110 41 85 175 101 118 93 116 94 206 267 161
3918 161 139 176 196 183 99 136 95 100 159 67 115 211 205 225 51 223 62 45 170 231 177 101 97 162 141 109 179 176 211 213 137 161 110 118 185 168
3495 168 152 210 169 141 125 138 139 90 243 200 98 86 107 203 270 85 17 19 93 130 97 188 189 216 34 113 163 100 60 54 54 136 159 89 205
3085 205 229 156 53 99 31 356 179 174 173 173 132 39 85 107 147 168 151 114 96 172 163 57 100 123 151 132 218 71 118 191 229 245 59 107
$$ packed form
5808A19p8N0L8n9M4M7L7On3p4J3L0J7o9J31j38M0L5J2l7J03N3j97Ql5J53l0n1QJ2r2M0n6J06
5409A33K8k2l8J48j55M4p7NL8m7l5J55K9L0O7j10q2j4k4J1p3Q4JJ8Pp7K5R7o6J78j34P1n9
5021A56j5j01k1O1M2k2m7O8o0J14jl1n0p3P4R4J48l7j89q3J64J15j10j4m4j3l8J70pKj64R
4646I7Q6j52J04K5O4L5J5j70r1Q0L0J5J2q7%j8K02p0o3J5l1J18p0j00j2K81j12n9N0j01J34
4282B27n5n0J63k6j31MJ3k7J33j24n7J80Q1j46j30P0j8n8lO4o9M4R0p4J7k5K3k2J12O1j06
3918A61k2L7K0j3q4L7m1NN9r2M8R6oK0j74J72j61j7J25O1n4p6mO5k1l2P0lL5Kp6K4n1QO7j7
3495A68j6N8m1k8j6J3Jm9J53m3j02j2K1R6O7j85o8KP4L7l3R1JK7j82P9N0o3m0o%Q2K3p0J16
3085B05K4p3j03M6o8L25j77nj%m1r3M6K2M0K1j7l7j8P6rj06M3K3K8j9Q6j47M7P3L8J6j86M8
$$ plain form
2685 107 218 71 194 76 126 138 119 54 49 79 158 144 178 44 314 303 74 144 156 195 184 196 85 84 103 200 34 149 128 309
2333 309 152 176 274 102 151 15 134 203 126 69 127 164 78 111 202 164 135 180 47 164 234 294 306 146 147 173 67 184 100 163 61
1970 61 4 166 187 254 149 198 173 70 90 169 36 97 170 48 148 145 154 235 71 123 211 76 225 64 206 129 63 36 76 237
1617 237 308 270 149 18 255 248 40 89 74 91 185 244 129 156 48 100 262 260 35 79 106 99 125 204 123 35 15 129 91 71 303
1254 303 243 145 373 411 278 322 326 79 148 38 177 33 213 265 59 24 111 75 84 103 129 147 183 63 156 77 250 95 72 53
901 53 32 79 67 237 129 264 91 80 143 206 111 52 6 179 137 577 1097 453 75 134 125 194 258 147 104 200 95 197 43 78
549 78 192 98 55 121 210 124 184 186 46 203 91 130 187 90 90 117 161 149 161 65 89 95 70 38 76 109 77 155 143 164 177 100 49 169 306
138 306 162 129 183 173 148 81 41 121 40 210 210 128 81 129 76 180 53 248 203 229 237 172 206 185 74 62 46 11
$$ packed form
2685A07J11j47J23j18N0J2j9o5nL0P9j4L4j34K70j1k29P0J2L9j1J2j11jJ9R7j66J15k1J81
2333C09j57K4R8j72M9j36J19O9p7n7N8L7q6L3R1l8k9M5j33J17P0O0J2j60JK6j06J17q4O3j02
1970F1n7J62K1O7j05M9k5j03K0P9j33O1P3j22J00lRQ1j64N2Q8j35J49j61J42p7o6k7M0J61
1617B37P1l8j21j31K37pk08M9j5J7R4N9j15K7j08N2J62kk25M4K7pK6P9q1q8k0J14l8k0K32
1254C03o0r8K28L8j33M4Mk47O9j10J39j44J80N2k06l5Q7l6RJ9K6J8L6j20R3p9J73j55k3j9
901E3k1M7j2J70j08J35j73j1O3O3r5n9m6J73m2M40N20o44l78N9rO9O4j11m3R6j05J02j54L5
549G8J14r4m3O6Q9q6O0Kj40J57j12L9N7r7%K7M4j2J2r6K4Ok5l2L8L3l2P8j2K1J3p7n1J20J37
138C06j44l3N4j0k5o7m0Q0q1J70%q2m7M8n3J04j27J95m5K6Qo5L4k1j11j2j6l5
-190A1
##PAGE=	F1=11875.8
##FIRST=	25169.313707327481097,	5807.6787752999953227,	0.39714565873146057129
##DATA TABLE=	(F2++(Y..Y)), PROFILE
$$ plain form
5808 70 23 110 127 34 112 152 176 223 187 103 142 146 139 33 169 102 140 132 129 105 256 263 97 84 85 174 129 127 117 158 68 79 43 133 217 121 89
5373 89 211 37 90 68 88 63 86 19 220 234 236 255 184 143 139 75 75 50 43 48 182 146 86 39 154 121 290 147 172 97 98 12 37 68 189
4963 189 181 92 176 31 156 135 95 101 30 69 161 348 300 104 16 134 226 215 122 60 157 125 248 197 217 108 124 194 41 83 157 231
4587 231 261 252 78 52 150 184 170 145 117 99 67 241 177 124 106 86 203 127 75 36 345 243 142 199 93 230 181 149 326 246 192
4223 192 177 121 131 253 92 117 258 313 177 47 88 84 29 78 149 41 82 179 91 120 84 140 108 207 251 170 151 189 198 142 101 121 111
3836 111 82 104 48 110 210 223 198 61 180 43 48 152 227 225 113 70 115 117 70 129 141 186 179 115 145 112 99 138 147 141 208 173 144 115 142
3425 142 133 108 231 206 119 102 55 226 268 84 53 42 87 141 62 176 182 241 21 131 201 79 54 65 39 119 183 39 199 223 122
3061 122 55 114 17 350 201 113 132 156 111 31 57 71 163 200 117 59 98 163 155 21 113 118 128 122 200 103 176 206 204 245 61 64 212 67
$$ packed form
5808G0m7Q7J7r3P8M0K4M7l6q4L9Mpj06J36o7L8qlk4J51Pj66j3JQ9m5kj0M1r0J1l6R0Q4r6l2
5373H9J22j74N3k2K0k5K3o7K01J4KJ9p1m1mo4%k5pNJ34l6o0m7J15l3J69j43K5p5Jq6K5L1J21
4963A89qq9Q4j45J25k1m0Op1L9R2J87m8j96q8J18R2j1r3o2R7l2J23n1K0j09J6P0j53M2P4P4
4587B31L0rj74k6R8L4j4k5k8j8l2J74o4n3j8k0J17p6n2l9L09j02j01N7j06J37m9l2J77q0n4
4223A92j5n6J0J22j61K5J41N5j36j30M1mn5M9P1j08M1R7q8K9l6N6l2R9M4q1j9L8Rn6m1K0j0
3836A11k9K2n6O2J00J3k5j37J19j37NJ04P5kj12m3M5Km7N9J2M5po4L0l3j3L9RoO7l5k9k9K7
3425A42rk5J23k5q7j7m7J71M2j84l1j1M5N4p9J14ON9k20J10P0j22k5J1k6Q0O4j44J60K4j01
3061A22o7N9r7L33j49q8J9K4m5q0K6J4R2L7q3n8L9O5qj34R2NJ0oP8r7P3L0kM1j84LJ48j45
$$ plain form
2662 67 202 96 82 81 133 49 61 114 156 111 151 58 303 322 86 178 147 207 181 209 94 84 157 220 10 158 172 335 133 216 260
2298 260 108 151 55 145 209 146 88 134 174 87 115 142 95 132 171 32 137 219 298 279 87 139 145 58 158 83 188 72 5 106 130
1934 130 266 152 231 191 78 76 189 59 76 174 60 140 176 126 191 67 134 207 81 181 63 214 137 72 100 108 249 308 268 214
1582 214 71 230 217 46 87 114 100 133 209 144 186 102 95 218 223 81 71 112 105 88 208 158 75 40 92 97 68 275 220 144 403 410 255
1195 255 300 301 73 138 11 184 75 214 285 91 45 118 112 74 98 121 110 138 33 146 99 218 105 29 17 43 106 57 214 54
843 54 245 73 65 144 197 151 31 11 146 175 283 743 361 79 110 88 176 265 189 92 146 133 207 58 44 153 69 42 78 177 83
479 83 205 150 37 210 98 140 187 91 123 95 161 116 124 70 113 91 113 25 46 115 100 185 139 142 159 83 49 80 240 172 75 160 229 153
80 153 50 37 70 17 196 183 99 64 125 109 171 57 240 179 254 249 162 257 233 54 74 64 42
$$ packed form
2662F7J35j06j4jN2q4J2N3M2m5M0r3K45J9k36R2l1O0k6K8j15j0P3O3k10J48J4J63k02Q3M4
2298B60j52M3r6R0O4o3n8M6M0q7K8K7m7L7L9j39J05Q2P9j9j92N2Oq7J00p5J05j16o7J01K4
1934A30J36j14P9m0j13kJ13j30J7R8j14Q0L6n0O5j24O7P3j26J00j18J51p7o5K8QJ41N9m0n4
1582B14j43J59j3j71M1K7j4L3P6o5M2q4pJ23Nj42j0M1pj7J20n0q3l5N2Nk9K07n5p6K59Pj55
1195B55M5Jk28O5j27J73j09J39P1j94m6P3ol8K4K3j1K8j05J13m7J19j13p6j2K6O3m9J57j60
843E4J91j72qP9N3m6j20k0J35K9J08M60l82k82L1k2Q8Q9p6r7N4j3P4j49j4J09q4k7L6R9r4
479H3J22n5j13J73j12M2M7r6L2k8O6m5Qn4M3k2K2q8K1O9j5Q5m6LJ7p6l4L1J60o8r7Q5O9p6
80A53j03j3L3n3J79j3q4l5O1j6O2j14J83o1P5nq7R5k4j79K0j0k2
-190D2
##PAGE=	F1=11773.5
##FIRST=	25169.313707327481097,	5807.6787752999953227,	0.41096803545951843262
##DATA TABLE=	(F2++(Y..Y)), PROFILE
$$ plain form
5808 23 64 125 114 12 113 140 152 225 197 146 196 155 127 49 150 123 152 132 113 99 279 247 116 66 116 137 77 140 119 183 98 68 59
5420 59 119 250 93 88 231 84 48 76 114 63 100 17 236 248 238 201 161 164 174 120 76 98 28 73 232 203 137 22 144 152 285 153
5045 153 124 47 56 36 75 62 243 237 105 209 22 150 81 46 132 65 58 147 347 273 108 6 77 140 205 44 31 182 154 221 130
4681 130 190 132 135 185 48 37 148 209 250 231 51 86 179 216 173 139 161 129 111 237 180 148 76 65 201 113 125 43 357 267 136 180
4305 180 68 218 192 188 354 216 221 219 75 146 260 43 156 246 266 180 104 39 62 64 102 195 42 59 163 86 129 87 149 118 200 237
3930 237 171 154 180 184 98 109 99 126 66 72 78 89 191 215 164 73 133 31 49 156 200 252 129 40 58 87 26 75 113 152 135 82 113 112 120
3519 120 135 110 104 205 188 124 118 113 93 117 203 207 139 138 7 229 232 56 118 101 103 176 15 142 152 253 24 138 240 93 56 80 60
3132 60 95 192 22 170 204 98 47 114 26 319 203 78 93 134 88 15 64 69 180 218 57 59 115 151 141 45 124 111 117 126 186 125 214
$$ packed form
5808B3M1O1j1j02J01K7J2P3k8n1N0m1k8p8J01k7K9k0j9j4J80l2j31n0N0K1o0O3k1O4q5l0r
5420E9O0J31j57nJ43j47l6K8L8n1L7q3K19J2j0l7m0LJ0n4m4K2p0M5J59k9o6j15J22QJ33j32
5045A53k9p7Rk0L9j3J81oj32J04j87J28o9l5Q6o7pQ9K00p4j65j02P1O3O5j61j3J51k8O7r1
4681A30O0n8LN0j37j1J11O1M1j9j80L5R3L7m3l4K2l2j8J26n7l2p2j1J36q8J2q2L14r0j31M4
4305A80j12J50k6mJ66j38Nkj44P1J14k17J13R0K0q6p6o5K3KL8R3j53J7J04p7M3m2O2l1Q2L7
3930B37o6j7K6Mq6J1j0K7o0OOJ1J02K4n1r1O0j02J8J07M4N2j23q9J8K9o1M9L8L9j7n3L1jQ
3519A20J5k5oJ01j7o4onk0K4Q6Mo8jj31K22Lj76O2j7KP3j61J27J0J01k29J14J02j47l7K4k0
3132F0L5R7j70J48L4j06n1O7q8K93j16j25J5M1m6p3M9NJ11L8j61KN6L6j0r6P9j3ORO0o1Q9
$$ plain form
2744 214 207 169 232 59 48 196 73 188 80 60 27 127 45 88 153 168 69 129 59 261 316 108 222 121 197 169 230 110 86 192
2392 192 218 46 162 215 340 99 251 231 128 148 101 152 203 158 85 132 160 102 147 75 18 138 152 51 110 178 280 229 23 128
2040 128 128 89 140 110 200 134 32 76 62 249 140 230 193 86 62 196 83 63 173 65 127 190 140 125 57 127 189 73 141 69 232
1676 232 152 87 156 132 244 287 259 268 135 201 170 62 101 147 97 79 182 147 209 134 88 167 196 113 53 107 122 39 191 190 104 100 52 117
1277 117 69 231 182 119 402 382 217 268 279 52 125 42 203 111 177 292 114 64 116 156 116 81 100 80 94 30 139 144 189 98 66
913 66 47 74 112 52 188 16 227 57 65 134 178 164 84 39 102 193 68 268 242 111 86 54 144 255 229 85 95 188 204 95 59
549 59 112 43 52 44 153 63 220 141 48 199 103 136 173 138 167 70 140 92 69 81 124 103 140 60 15 112 118 213 133 95 130 73 88 26 162
138 162 173 62 144 273 160 40 49 30 12 176 147 111 117 116 132 173 47 219 143 258 234 135 294 266 49 77 82 98
$$ packed form
2744B14pl8O3j73j1J48j23J15j08k0l3J00q2M3O5J5r9O0p0K02N5k08J14j01P6k8O1j20k4J06
2392A92K6j72J16N3J25k41J52k0j03K0m7N1N1m5p3M7K8n8M5p2n7J20J4j01N9O8J02n1k06J05
2040A28%l9N1l0R0o6j02M4j4J87j09R0l7j07k4J34j13k0J10j08O2O3n0j5o8P0O2j16O8p2J63
1676B32q0o5O9k4J12M3k8Rj33O6l1j08L9M6n0j8J03l5O2p5m6P9K9q3o0N4J5q3J52jq6mm8O5
1277A17m8J62m9o3K83k0j65N1J1k27P3q3J61r2O6J15j78n0N2M0m0l5J9k0J4o4J09NM5r1l2
913F6j9K7L8o0J36j72K11j70QO9M4j4q0m5O3R1j25K00k6j31k5l2R0J11k6j44J0R3J6j09l6
549E9N3o9RqJ09r0J57p9r3J51r6L3L7l5K9r7P0m8k3J2M3k1L7q0m5R7OR5q0l8L5n7J5o2J36
138A62J1j11Q2J29j13j20Rj9j8J64k9l6OjJ6M1j26J72p6J15k4r9J59k8k17K8NJ6
-190I8
##PAGE=	F1=11671.3
##FIRST=	25169.313707327481097,	5807.6787752999953227,	0.32777857780456542969
##DATA TABLE=	(F2++(Y..Y)), PROFILE
$$ plain form
5808 38 105 133 88 66 118 128 135 199 182 186 233 145 113 64 151 129 144 131 111 103 277 222 126 29 124 110 81 160 133 212 125 51 75 86 253 61
5385 61 101 299 160 21 84 135 96 90 20 225 244 239 154 132 171 186 150 70 131 89 130 251 265 185 21 137 181 268 166 111 34 36 43
4998 43 92 60 269 257 89 222 42 163 62 50 162 87 60 147 331 221 132 23 72 72 167 47 95 189 166 172 62 175 171 129
4646 129 152 48 42 126 166 227 214 29 99 176 214 152 125 190 154 158 234 188 179 39 58 216 107 185 82 348 268 128 137 53 193 194 232
4258 232 368 173 216 237 50 184 269 13 169 225 204 193 167 78 74 102 119 241 46 28 132 87 137 101 148 118 183 227 161 144 153
3894 153 152 56 116 74 139 53 76 129 57 155 179 130 82 90 42 45 179 155 253 141 25 4 52 53 77 97 116 80 76 75 110 148 149 70 46 199
3472 199 214 88 156 76 26 124 176 214 153 176 66 209 173 16 184 147 121 213 61 114 112 248 30 141 258 111 70 97 99 83
3120 83 187 91 119 172 112 56 105 31 271 200 86 59 113 73 5 119 82 183 209 21 109 132 151 139 111 138 99 137 151 188 140 231
$$ packed form
5808C8O7K8m5k2N2J0PO4j7MM7q8l2m9Q7k2J5j3k0qJ74n5r6r7R5j4k9P9k7P9q7p4K4J1J67j92
5385F1M0J98j39j39O3N1l9op0K05J9nq5k2L9J5l6q0O1m2M1J21J4q0j64J16M4Q7j02n5p7KP
4998D3M9l2K09j2j68J33j80J21j01j2J12p5k7Q7J84j10q9j09M9%R5j20M8R4k3Oj10J13mm2
4646A29K3j04oQ4M0O1j3j85P0P7L8o2k7O5l6MP6m6rj40J9J58j09P8j03K66q0j40Rq4J40JL8
4258B32J36j95M3K1j87J34Q5k56J56N6k1j1k6q9mK8J7J22j95j8J04m5N0l6M7l0O5M4o6j7R
3894A53jr6O0m2O5q6K3N3p2R8K4m9m8Qm8LJ34k4R8j12j16k1M8JK4K0J9l6mjL5L8Jp9k4J53
3472A99J5j26O8q0n0R8N2L8o1K3j10J43l6j57J68l7k6R2j52N3kJ36k18J11J17j47m1K7Kj6
3120H3J04r6K8N3o0n6M9p4K40p1j14k7N4m0o8J14l7J01K6j88Q8K3J9j2k8K7l9L8J4L7m8R1
$$ plain form
2744 231 198 130 206 58 84 176 82 162 65 64 55 110 43 113 187 184 48 114 58 200 285 128 261 87 167 153 258 128 78 199 193 81
2369 81 161 243 319 76 272 189 156 145 145 160 183 158 62 110 125 121 182 52 52 148 126 64 115 131 237 161 63 112 136 118 141 151 199 192 72
1958 72 103 15 208 115 204 181 90 53 185 95 54 173 63 110 181 180 85 45 102 157 63 119 82 253 172 100 197 139 236 253 247 301 192
1570 192 171 118 78 130 163 90 21 165 149 211 137 85 112 193 129 23 81 144 35 158 206 115 153 40 140 74 186 150 74 368 334
1207 334 169 234 261 26 112 107 216 133 119 289 118 70 108 201 178 51 71 77 68 32 139 176 171 84 108 94 98 97 58 162 44 210 54
819 54 65 112 154 154 126 85 57 198 307 77 170 132 91 27 108 243 255 86 84 236 188 125 90 81 29 69 73 129 61 229 170 64 172
432 172 104 112 141 184 206 79 102 79 22 91 127 122 141 71 9 103 126 234 128 43 99 74 114 74 95 171 100 133 295 160 54 50 61 36
33 36 154 115 168 191 111 141 180 21 191 102 237 206 97 310 283 62 66 95 151
$$ packed form
2744B31l3o8P6j48K6R2r4Q0r7jrN5o7P0P4lj36O6n6J42Q5j57J33j74Q0j4J05j30n0J21oj12
2369H1Q0Q2P6k43J96q3l3j1%J5K3k5r6M8J5mO1j30%R6k2o2N1J6J06p6r8M9K4j8K3J0M8pj20
1958G2L1q8J93r3Q9k3r1l7J32r0m1J19j10M7P1jr5m0N7N5r4N6l7J71q1p2R7n8R7J7oN4j09
1570A92k1n3m0N2L3p3o9J44j6O2p4n2K7Q1o4j06N8O3j09J23M8r1L8j13J00o6J12l6p6K94l4
1207C34j65O5K7k35Q6nJ09q3j4J70j71m8L8R3k3j27K0Orl6J07L7nq7K4j4Mjl9J04j18J66j56
819E4J1M7M2%k8m1k8J41J09k30R3l8m1o4Q1J35J2j69kJ52m8o3l5rn2M0MN6o8J68n9j06J08
432A72o8QK9M3K2j27K3k3n7O9L6nJ9p0o2R4K3J08j06q5N6k5M0m0K1P6p1L3J62j35j06mJ1k5
33C6J18l9N3K3q0L0L9j59J70q9J35l1j09K13k7k21MK9N6
-190A51
##PAGE=	F1=11569
##FIRST=	25169.313707327481097,	5807.6787752999953227,	0.15654842555522918701
##DATA TABLE=	(F2++(Y..Y)), PROFILE
$$ plain form
5808 86 133 137 52 122 126 119 127 146 158 216 245 119 105 61 166 128 140 122 127 121 250 193 135 62 113 116 138 183 153 239 141 29 87 42 224 32
5385 32 118 363 224 27 88 151 125 64 39 195 222 230 123 107 165 175 149 55 151 146 164 237 318 222 27 132 199 242 180 143 52 51 28
4998 28 91 60 261 237 61 222 83 190 104 92 177 93 70 158 299 154 163 51 113 62 111 129 138 178 162 104 33 172 218 111 98
4634 98 43 62 94 120 194 199 15 99 147 185 120 100 206 177 197 228 200 206 11 105 237 108 236 136 316 243 123 82 116 165 182 270
4258 270 367 123 186 225 96 238 272 56 158 211 144 202 209 141 109 138 128 273 58 17 93 93 139 117 139 111 161 216 142 119 116 112 21
3871 21 119 44 146 61 92 175 28 109 119 97 81 53 72 32 202 102 230 147 35 65 39 104 140 91 85 18 118 43 105 162 140 50
3495 50 44 186 245 44 213 109 52 135 164 224 155 200 121 174 110 59 236 175 138 239 129 142 106 223 43 150 247 107 99 117 137
3132 137 96 173 160 64 129 157 106 98 25 220 214 110 36 98 70 26 170 78 183 173 76 139 137 160 153 176 154 79 180 180 199 150 231 188 100
$$ packed form
5808H6M7Mq5P0MpQJ9J2N8K9j26j4m4J05l8J2j8NoJ29n7n8p3N1LK2M5l0Q6r8j12N8m5J82j92
5385C2Q6K45j39j97O1O3k6o1k5J56K7Qj07j6N8J0k6r4R6nJ8P3Q1r6j95J05O7M3o2l7r1jk3
4998B8O3l1K01k4j76J61j39J07q6j2Q5q4k3Q8J41j45Rj12O2n1M9J8RM0j6n8p1J39M6j07j3
4634I8n5J9L2K6P4Nj84Q4M8L8o5k0J06k9K0L1k8Oj95R4J32j29J28j00J80p3j20m1L4M9J7Q8
4258B70R7k44O3L9j29J42L4k16J02N3o7N8Po8l2K9j0J45k15m1P6%M6k2K2k8N0N5p4k3lmr1
3871B1R8p5J02q5L1Q3j47Q1J0k2j6k8J9m0J70j00J28q3j12L0k6O5L6m9oo7J00p5O2N7k2r0
3495E0oJ42N9k01J69j04n7Q3K9O0o9M5p9N3o4n1J77o1l7J01j10J3l6J17j80J07R7j40qJ8K0
3132A37m1P7j3r6O5K8n1qp3J95oj04p4O2k8m4J44r2J05j0r7O3kK3pK3k2p5J01%J9m9Q1m3q8
$$ plain form
2721 100 171 64 113 158 91 138 96 89 85 101 47 123 208 193 54 109 66 136 232 140 281 52 122 154 283 137 61 175 147 111 156 250
2345 250 272 83 277 140 175 139 177 170 153 156 32 70 76 142 214 114 102 149 94 69 149 111 174 82 129 90 158 126 152 186 192 221 114 137
1946 137 70 152 82 172 161 89 37 159 89 48 182 60 93 147 205 128 51 66 118 65 114 103 268 191 109 224 135 243 218 232 307 229
1570 229 144 75 91 168 159 89 39 155 166 184 111 93 63 210 132 17 38 166 93 119 198 105 189 70 150 82 151 134 30 310 277 119
1195 119 205 245 22 104 170 211 135 68 272 103 64 100 241 234 12 62 93 58 37 145 185 161 75 129 130 112 62 70 137 48 194 55
819 55 57 76 129 125 145 142 13 189 360 176 129 132 113 6 74 235 269 95 114 266 155 140 98 62 28 83 125 96 66 233 213 80
444 80 134 95 71 95 214 232 123 66 79 48 100 127 139 116 65 25 94 125 241 125 54 78 80 114 105 60 166 140 120 289 155 79 37
56 37 107 65 132 89 222 249 121 141 186 18 165 63 201 192 62 303 284 82 49 98 192
$$ packed form
2721A00P1j07M9M5o7M7m2pmJ6n4P6Q5j5j39N5m3P0R6r2J41k29P0L2J29j46p6J14k8l6M5R4
2345B50K2j89J94j37L5l6L8pj7Lj24L8OO6P2j00j2M7n5k5Q0l8O3r2M7l9O8l2K6L4OK9j07K3
1946A37o7Q2p0R0j1p2n2J22p0m1J34j22L3N4N8p7p7J5N2n3M9j1J65p7q2J15q9J08k5J4P5p8
1570B29q5o9J6P7rp0n0J16J1J8p3j8l0J47p8j15K1J28p3K6P9r3Q4j19Q0o8O9j7j04K80l3j58
1195A19Q6M0k23Q2O6M1p6o7K04j69l9L6J41pk22N0L1l5k1J08M0k4q6N4Jj8n0QO7q9J46j39
819E5KJ9N3mK0lj29J76J71j84m7Lj9j07O8J61L4j74J9J52j11j5m2l6l4N5M2k9l0J67k0j33
444H0N4l9k4K4J19J8j09n7J3l1N2K7J2k3n1m0O9L1J16j16p1K4KL4rm5J06k6k0J69j34p6m2
56C7P0m2O7m3J33K7j28K0M5j68J47j02J38rj30K41j9k02l3M9R4
-190A92
##PAGE=	F1=11466.8
##FIRST=	25169.313707327481097,	5807.6787752999953227,	0.072384186089038848877
##DATA TABLE=	(F2++(Y..Y)), PROFILE
$$ plain form
5808 132 149 144 10 173 132 112 124 78 145 234 231 81 106 50 184 125 163 102 147 145 202 162 153 137 100 140 178 198 173 255 136 20 93 45
5409 45 171 26 131 394 269 59 91 159 148 52 64 157 189 203 113 104 150 153 119 55 160 192 163 204 352 241 39 126 201 216 188
5045 188 189 67 81 13 84 64 221 182 91 214 131 213 141 122 174 85 81 168 250 83 187 78 148 84 51 198 154 163 160 41 62 170
4669 170 253 92 31 41 62 57 91 158 180 11 92 102 136 95 64 212 198 217 218 214 224 49 173 249 106 259 184 262 198 121 60 203
4294 203 148 154 290 350 73 146 186 145 283 261 86 133 207 113 192 221 182 135 176 123 280 79 38 48 104 139 126 126 104 149 203 117 83
3906 83 80 86 21 113 11 147 88 99 204 27 59 46 63 65 28 111 7 204 64 195 144 47 124 76 141 197 91 69 46 167 25
3542 25 98 159 100 62 120 169 270 7 263 185 118 145 163 226 139 202 166 140 66 110 260 183 156 249 189 203 154 180 75 163 206 80
3167 80 138 134 162 113 154 220 89 95 203 163 96 25 178 251 123 25 91 73 46 197 48 201 138 114 138 129 165 163 230 172 50 225 193
$$ packed form
5808A32J7nj34J63m1k0J2m6O7Q9lj50K5n6J34n9L8o1M5kN7m0rj6l7M0L8K0k5Q2j19j16P3m8
5409D5J26j45J05K63j25k10L2O8j1r6J2R3L2J4r0rM6Ll4o4J05L2k9M1J48j11k02Q7P5J5k8
5045A88Jj22J4o8P1k0J57l9r1J23q3Q2p2j9N2q9mQ7Q2j67J04j09P0o4l3J47m4Rlj19K1J08
4669A70Q3j61o1J0K1nL4O7K2j69Q1J0L4m1l1J48j4J9JmJ0j75J24P6j43J53p5P8o4p7o1J43
4294B03n5OJ36O0k77P3M0m1J38k2j75M7P4r4P9K9l9m7M1n3J57k01m1J0N6L5j3%k2M5N4q6l4
3906H3lOo5R2j02J36n9J1J05j77L2j3J7Kl7Q3j04J97j40J31n1r7P7m8O5N6j06k2k3J21j42
3542B5P3O1n9l8N8M9J01k63K56p8o7K7J8O3q7O3l6k6p4M4J50p7k7R3o0J4m9K6j05Q8M3j26
3167H0N8mK8m9M1O6j31OJ08m0o7p1J53P3j28r8O6j8k7J51j49J53o3k4K4rL6kO7n8j22J75l2
$$ plain form
2779 193 213 161 217 185 107 137 81 116 141 93 119 138 125 87 110 66 113 218 189 51 108 88 81 166 134 269 44 78 174 292 127 59
2404 59 137 90 134 151 237 202 106 272 99 178 125 193 179 121 169 43 51 23 154 240 176 125 136 62 69 182 144 96 12 183 63 174
2028 174 108 161 208 193 208 144 155 116 98 54 152 146 83 16 134 65 63 198 60 84 104 197 191 67 29 74 72 108 132 271 200 114 244 134
1629 134 271 193 214 284 237 128 57 101 204 135 95 94 147 198 128 65 113 45 227 131 62 39 186 146 84 169 81 203 102 140 86 136
1254 136 124 69 240 221 76 178 228 36 105 216 183 118 67 236 74 43 98 274 272 28 88 112 45 55 155 170 154 77 129 146
901 146 121 27 79 114 38 184 71 40 31 106 85 143 195 29 168 255 95 112 131 120 61 47 231 277 111 148 274 109 140 81 44
538 44 31 95 170 59 79 230 247 96 92 81 21 49 225 241 170 71 95 73 108 126 153 81 75 41 87 118 232 117 95 71 87 94 110 57
138 57 154 166 99 251 141 99 16 143 94 110 70 249 274 149 144 194 61 145 41 168 210 61 276 271 100 52 89 213
$$ packed form
2779A93K0n2N6l2p8L0n6L5K5m8K6J9j3l8K3m4M7J05k9j38N7k0pQ5l2J35k25L4R6J18j65o8
2404E9P8m7M4J7Q6l5r6J66j73P9n3O8j4n8M8j26Qk8J31Q6o4n1J1p4PJ13l8m8q4J71j20J11
2028A74o6N3M7j5J5o4J1l9j8m4R8oo3o7J18o9kJ35j38K4K0R3oj24l8M5kL6K4J39p1q6J30j10
1629A34J37p8K1P0m7j09p1M4J03o9m0jN3N1p0o3M8o8J82r6o9k3J47m0o2Q5q8J22j01L8n4N0
1254A36j2n5J71j9j45J02N0j92O9J11l3o5n1J69j62l1N5J76kk44O0K4o7J0J00J5j6p7N2J7
901A46k5r4N2L5p6J46j13l1rP5k1N8N2j66J39Q7j60J7J9j1n9j4J84M6j66L7J26j65L1n9l7
538D4j3O4P5j11K0J51J7j51mj1o0K8J76J6p1r9K4k2L5J8K7p2ol4M6L1J14j15k2k4J6PJ6n3
138E7R7J2o7J52j10m2q3J27m9J6m0J79K5j25nN0j33Q4j04J27M2j49K15nj71m8L7J24
-190B13
##PAGE=	F1=11364.5
##FIRST=	25169.313707327481097,	5807.6787752999953227,	0.18391524255275726318
##DATA TABLE=	(F2++(Y..Y)), PROFILE
$$ plain form
5808 169 153 157 31 213 131 105 121 32 151 240 195 38 104 53 195 115 198 74 158 165 141 135 177 204 100 154 180 197 186 252 107 53
5432 53 93 100 113 41 139 378 295 107 99 158 165 69 88 127 157 160 122 117 133 129 70 91 155 221 136 186 362 239 58 110 186 196 191 228 79 122
5010 122 47 92 75 157 110 166 205 173 220 153 133 155 66 86 165 188 30 199 99 164 92 11 247 153 159 189 96 84 159 265 89 49
4634 49 48 45 26 80 124 153 15 84 62 82 90 25 213 217 218 204 222 235 82 234 245 94 240 207 194 145 122 101 276 144 110 280 314
4247 314 31 111 133 172 296 234 95 111 207 117 162 207 192 144 216 100 263 104 59 9 114 140 125 112 111 154 186 94 44 58 90 39
3871 39 97 42 144 113 96 211 46 31 50 21 28 34 151 32 175 59 164 133 53 173 116 160 229 95 69 103 202 18 87 145 43
3507 43 81 187 158 279 40 288 250 156 146 162 209 107 180 192 120 54 140 253 178 171 245 228 252 211 124 117 175 147 44 178 140 166
3132 166 112 131 259 166 109 237 203 96 60 154 292 116 22 87 79 66 194 18 236 147 128 113 122 162 153 261 183 15 257 181 238
$$ packed form
5808A69j6Mj26J82q2k6J6q9J19Q9m5j57O6n1J42q0Q3j24Q4Pk4oM2K7j04N4K6J7j1O6j45n4
5432E3M0PJ3p2R8K39q3j88qN9Pr6J9L9L0Ll8nJ6mn9K1O4O6q5N0J76j23j81N2P6J0nL7j49M3
5010A22p5M5j7Q2m7N6L9l2M7o7k0K2q9K0P9K3j58J69j00O5p2q1K36r4OL0r3j2P5J06j76m0
4634D9jlj9N4M4K9j38O9k2K0Qo5J88MJj4J8J3j53J52J1j51J46l3j3m9k3k1J75j32l4J70L4
4247C14k83Q0K2L9J24o2j39J6R6r0M5M5j5m8P2j16J63j59m5n0J05K6j5j3jM3L2r2n0J4L2n1
3871C9N8n5J02l1j7J15j65j5J9k9POJ17j19J43j16J05l1q0J20n7M4O9j34k6L4R9j84O9N8j02
3507D3L8J06k9J21k39K48l8r4j0J6M7j02P3J2p2o6Q6J13p5pP4j7K4m1q7pN8k8j03J34l8K6
3132A66n4J9J28r3n7J28l4j07l6R4J38j76r4O5qj3J28j76K18q9j9j5RM0rJ08p8j68K42p6N7
$$ plain form
2768 238 177 191 196 154 109 109 91 124 84 104 153 161 79 129 98 85 217 171 36 105 117 49 99 104 227 80 57 196 275 94 99 124 40 150
2369 150 151 216 124 125 268 97 159 100 194 178 106 203 81 96 38 149 258 215 117 110 35 67 198 199 34 52 218 29 179 74 163
2005 163 211 209 154 153 158 147 70 49 151 143 77 67 137 42 109 208 65 89 106 160 234 79 2 33 70 92 165 258 192 118 265 143 308 180
1606 180 189 235 211 126 84 109 229 94 106 135 136 229 70 44 137 54 229 136 104 97 201 180 61 128 63 194 120 109 81 139 105 125 181
1218 181 173 45 154 207 47 109 233 135 89 85 178 47 8 99 299 286 55 119 134 18 79 166 136 146 83 108 141 134 79 77 91 57 185
831 185 120 31 24 88 51 133 224 68 136 87 198 152 148 104 129 32 231 284 134 173 265 57 133 62 17 44 102 195 47 98 222 261 108
444 108 54 76 32 47 220 234 200 113 124 75 112 124 174 82 112 72 79 109 209 99 118 75 101 90 99 53 139 174 68 184 117 104 5 163
45 163 119 88 57 242 261 185 157 212 98 132 40 152 243 86 233 247 113 84 76 210
$$ packed form
2768B38o1J4Nm2m5%j8L3m0K0M9Qq2N0l1j3J32m6j35O9J2o8N0NJ23j47k3J39P9j81NK5q4J10
2369A50JO5r2JJ43j71O2n9R4j6p2R7j22J5n8J11J09m3r8pp5L2J31Jj65J8J66j89J50j05Q9
2005A63M8kn5jNj1p7k1J02qo6j0P0r5O7R9j43K4J7N4P4j55p7L1L7K2P3R3o6p4J47j22J65j28
1606A80RM6k4q5m2K5J20j35J2K9JR3j59k6R3q3J75r3l2pJ04k1j19O7o5J31p4j1k8N8l4K0N6
1218A81qj28J09N3j60O2J24r8m6mR3j31l9R1K00j3k31O4J5j16O1Q7l0J0o3K5L3pn5kJ4l4J28
831A85o5q9pO4l7Q2R1j56O8m9J11m6mm4K5r7J99N3j50L9R2k08P6p1m5K7N8R3j48N1J24L9j53
444A08n4K2m4J5J73J4l4q7J1m9L7J2N0r2L0m0PL0J00j10J9m3K6j1Rm6Q6L5j06J16o7j3r9J58
45A63m4l1l1J85J9p6k8N5j14L4r2J12R1j57J47J4j34k9qJ34
-190B10
##PAGE=	F1=11262.2
##FIRST=	25169.313707327481097,	5807.6787752999953227,	0.25066295266151428223
##DATA TABLE=	(F2++(Y..Y)), PROFILE
$$ plain form
5808 189 151 173 65 237 121 94 113 62 157 229 141 30 93 79 195 92 219 44 153 178 79 125 195 248 104 145 144 180 187 224 57
5444 57 99 93 145 100 58 140 316 303 163 121 142 173 87 106 123 152 109 141 128 122 103 15 138 135 229 114 210 348 215 84 82 157 187 191
5045 191 254 93 173 83 123 92 90 82 239 196 195 205 142 127 128 44 80 140 122 51 203 118 160 80 43 272 150 167 245 176 91 135 250 106
4646 106 113 63 39 31 72 96 118 22 72 56 41 92 7 215 230 210 187 218 243 99 277 226 76 173 197 118 96 126 141 315 141 57 236
4258 236 259 41 98 94 172 267 193 90 114 196 130 127 180 178 140 259 59 236 127 87 46 123 145 114 101 134 166 163 82 26 68 103 50 73
3859 73 92 141 123 95 198 63 57 125 28 29 65 184 81 118 65 153 118 54 202 138 163 232 101 72 144 217 11 73 125 64 106 229
3484 229 164 267 65 279 287 158 131 153 174 63 139 193 110 54 144 220 169 176 231 243 265 248 64 157 180 86 27 212 131 145 82 102
3108 102 272 231 162 250 217 98 102 142 314 88 25 80 89 89 165 67 267 192 126 84 127 153 118 266 182 25 266 145 271 201 155
$$ packed form
5808A89l8K2j08J72j16k7J9n1R5P2q8j11O3j4J16j03J27j75J09K5r9M6P0N3j44M1jL6PL7j67
5444E7M2oN2m5m2Q2J76j3j40m2K1L1q6J9J7K9m3L2j3oj9q8J23lR4j15R6J38j33j31kP5L0M
5045A91O3j61Q0r0M0l1kqJ57m3jJ0o3j5Jq4L6O0j8p1J52q5M2q0l7K29j22J7P8o9q5M4J15j44
4646A06Pn0k4qM1K4K2r6N0j6j5N1q5K08J5k0k3L1K5j44J78n1j50R7K4p9k2L0J5J74j74q4J79
4258B36K3k18N7mP8R5p4j03K4Q2o6lN3kl8J19k00J77j09m0m1P7K2l1j3L3L2lq1n6M2L5n3K3
3859G3J9M9j8k8J03j35oO8r7JL6J19j03L7n3Q8l5o4J48o4K5O9j31k9P2P3k06O2N2o1M2J23
3484B29o5J03k02K14Qj29k7K2K1j11P6N4q3n6R0P6n1PN5J2K2j7j84R3K3r4n9J85q1J4o3K0
3108A02J70m1o9Q8l3j19MM0J72k26o3N5R%P6r8K00p5o6m2M3K6l5J48q4j57K41j21J26p0m6
$$ plain form
2744 155 218 219 85 142 47 105 67 88 134 180 93 150 138 60 209 145 53 97 139 58 62 48 177 125 64 202 233 54 155 160 57 157
2369 157 156 206 80 139 271 130 118 71 184 164 117 249 110 148 84 126 260 220 94 88 17 68 194 252 85 84 231 11 174 42
2016 42 162 197 231 73 138 151 164 82 60 162 150 83 146 173 73 168 198 74 108 165 107 246 83 27 38 52 68 195 232 164 124
1653 124 291 155 337 178 161 169 159 131 136 114 242 43 120 153 124 243 99 81 160 51 210 153 135 153 209 193 52 98 79 166
1300 166 120 69 63 146 76 163 156 138 35 144 184 68 111 220 76 53 87 100 52 64 106 314 271 62 137 162 35 100 174 96 143 88
925 88 76 119 154 157 70 68 107 199 187 49 65 76 55 130 217 101 97 49 338 181 172 66 196 37 236 294 165 193 248 51 132 87 19
538 19 65 103 196 74 123 212 247 113 25 101 77 75 203 214 207 159 157 59 108 118 205 131 152 114 65 98 179 71 126 84 133 132 86 37 134 164
115 164 31 104 81 92 15 161 140 65 51 211 225 220 176 239 121 129 44 147 262 106 180 216 119 119 79 184
$$ packed form
2744A55O3Jj34N7r5N8l8K1M6M6q7N7j2p8J49o4r2M4M2q1Mj4J29n2o1J38L1j79J01Nj03J00
2369A57jN0j26N9J32j41j2m7J13k0m7J32j39L8o4M2J34m0j26op1N1J26N8j67jJ47k20J63j32
2016D2J20L5L4j58O5J3J3q2k2J02j2o7O3K7j00R5L0j24L4N7n8J39j63n6J1J4J6J27L7o8m0
1653A24J67j36J82j59j7Qj0k8Nk2J28j99P7L3k9J19j44j8P9j09J59n7j8J8N6j6j41M6j9Q7
1300A66m6n1oQ3p0Q7pj8j03J09M0j16M3J09j44k3L4J3m8J2M2K08m3k09P5K5j27O5P4p8M7n5
925H8j2M3L5Lq7kL9R2j2j38J6J1k1P5Q7j16mm8K89j57rj06J30j59J99N8j29K8N5j97Q1m5o8
538A9M6L8R3j22M9Q9L5j34q8P6k4kJ28J1pm8kr8M9J0Q7p4K1l8m9L3Q1j08N5m2M9jm6m9R7L0
115A64j33P3k3J1p7J46k1p5j4J60J4nm4O3j18Qq5J03J15j56P4L6r7%m0J05
-190A84
##PAGE=	F1=11160
##FIRST=	25169.313707327481097,	5807.6787752999953227,	0.25016525387763977051
##DATA TABLE=	(F2++(Y..Y)), PROFILE
$$ plain form
5808 189 146 183 89 243 101 77 101 86 145 201 80 70 71 114 194 60 211 19 132 185 55 139 201 260 105 111 88 153 175 172 18
5444 18 146 101 167 157 77 135 222 291 214 155 108 168 96 118 142 184 74 159 126 122 70 33 175 100 212 137 260 311 181 115 41 119 186
5056 186 191 266 105 225 114 166 112 64 136 289 186 191 169 122 111 99 22 59 91 75 78 207 138 145 55 66 277 153 175 301 233 88
4681 88 101 215 130 159 78 66 58 60 72 81 30 59 72 43 89 25 221 234 206 170 197 250 98 296 199 78 67 156 50 61 130 154 311
4294 311 128 3 159 190 86 114 113 153 199 153 89 144 174 133 119 164 155 134 303 10 214 139 127 90 132 154 94 96 160 168 136 83 57
3906 57 93 104 55 46 140 144 113 104 178 76 87 184 84 103 99 200 134 74 63 163 102 61 205 136 166 212 105 73 164 215 23 58 100 134
3507 134 146 238 182 233 75 242 297 132 99 134 128 18 89 166 91 55 122 173 166 169 210 233 237 258 17 184 178 56 26 234 110 115 28
3120 28 74 256 258 212 241 207 110 133 130 302 40 37 64 101 117 119 118 280 232 122 72 142 147 69 247 163 58 252 98 295 226 122 245
$$ packed form
5808A89m3L7r4J54j42k4K4j5N9N6j21j0JM3Q0j34J51j92J13N3j30Q4O2N9j55Ok3O5K2lj54
5444A8J28m5O6j0q0N8Q7O9p7n9m7O0p2K2K4M2j10Q5l3mn2l7J42p5J12p5J23N1j30o6p4P8O7
5056A86NP5j61J20j11N2n4m8P2J53j03Nk2m7j1j2p7L7L2j6LJ29o9Pr0J1K11j24K2J26o8j45
4681H8J3J14q5K9q1j2qKJ2Rn1K9J3k9M6o4J96J3k8l6K7N3j52J98r7j21j1Q9j06J1O9K4J57
4294C11j83j25J56L1j04K8jM0M6m6o4N5L0m1j4M5rk1J69k93K04p5j2l7M2K2o0KO4Ql2n3k6
3906E7L6J1m9rR4Ml1rP4j02J1R7j00J9mJ01o6o0j1J00o1m1J44o9L0M6j07l2R1N1j92L5M2L4
3507A34J2R2n6N1j58J67N5j65l3L5oj10P1P7p5l6O7N1pLM1K3MK1k41J67oj22l0K08j24Nq7
3120B8M6J82Km6K9l4r7K3lJ72k62lK7L7J6KjJ62m8j10n0P0Np8J78q4j05J94j54J97o9j04J23
$$ plain form
2732 245 285 67 171 7 88 50 73 82 171 130 170 179 70 196 115 94 86 143 82 80 28 172 160 71 186 174 60 206 215 103 154 163 211
2345 211 124 155 277 160 62 67 168 140 140 292 125 179 116 97 242 188 98 105 24 78 171 289 146 91 228 56 161 35 163 169
1993 169 250 33 107 137 170 98 66 170 158 105 232 217 131 222 162 82 135 224 58 226 86 52 74 46 64 216 202 121 137 319 161
1629 161 346 185 145 100 95 132 187 114 248 22 138 145 114 233 173 114 175 34 181 179 151 201 216 183 53 116 118 130 105 36 36 146
1254 146 55 172 161 117 59 162 165 107 108 184 19 13 67 36 80 135 118 316 230 50 133 189 81 114 178 72 149 92 61 98 171 231 75
866 75 41 160 226 246 69 96 72 77 135 173 124 52 72 347 154 188 22 246 57 238 305 202 210 229 96 142 132 55 83 96 171 105
491 105 159 210 204 115 14 141 107 91 175 188 186 196 183 42 97 105 241 185 179 154 45 83 152 34 141 89 178 189 80 15 143 145 6
103 6 61 50 73 17 139 156 42 57 180 194 246 187 261 125 135 45 136 253 110 126 180 119 142 102 137
$$ packed form
2732B45M0k18J04j64Q1l8K3RQ9m1M0Rj09J26q1k1qN7o1kn2J44j2q9J15j2j14J46Rj12N1RM8
2345B11q7L1J22j17r8NJ01k8%J52j67N4o3j9J45n4r0Pq1N4R3J18j43n5J37j72J05j26J28O
1993A69Q1k17P4L0L3p2l2J04j2n3J27j5q6R1o0q0N3Q9j66J68j40l4K2k8J8J52j4q1J6J82j58
1629A61J85j61m0m5nL7N5p3J34k26J16Pl1J19o0n9O1j41J47kk8N0J5l3j30O3KJ2k5o9%J10
1254A46r1J17j1m4n8J03Ln8JP6j65oN4l1M4N5j7J98q6j80Q3N6j08L3O4j06P7n7l1L7P3O0j56
866G5l4J19O6K0j77K7k4NN8L8m9p2K0K75j93L4j66K24j89J81O7j03QJ9j33M6j0p7K8J3P5o6
491A05N4N1oq9j01J27l4j6Q4J3kJ0j3j41N5QJ36n6ok5j09L8O9j18J07n2Q9J1j09o5J28Kj39
103FN5j1K3n6J22J7j14J5J23J4N2n9P4j36J0r0R1J17j43J6N4o1K3m0L5
-190A37
##PAGE=	F1=11057.7
##FIRST=	25169.313707327481097,	5807.6787752999953227,	0.20721732079982757568
##DATA TABLE=	(F2++(Y..Y)), PROFILE
$$ plain form
5808 166 137 176 102 228 74 53 89 85 111 157 23 105 44 154 205 56 168 3 101 193 90 171 195 240 108 64 75 131 152 106 67
5444 67 187 118 168 227 103 122 118 255 248 196 63 150 106 122 168 234 89 166 108 129 30 68 188 59 168 189 303 257 151 147 15
5080 15 80 184 193 259 110 270 141 214 138 104 191 304 173 162 122 112 92 77 13 35 33 73 81 211 154 126 30 79 266 157 172 332
4704 332 256 80 59 176 151 180 90 96 85 53 53 58 38 67 74 62 75 23 232 227 212 157 158 253 84 292 173 127 73 104 42 45 130 135 266
4294 266 99 49 66 128 132 149 172 126 109 135 113 192 151 124 150 167 145 136 346 61 199 136 174 129 145 165 74 104 179 152 109 87 88 116
3894 116 87 61 28 178 149 88 128 168 86 103 217 140 184 127 192 184 132 70 179 98 79 182 109 178 185 108 80 164 201 49 46 80 193
3507 193 192 211 195 185 71 195 290 99 58 104 81 27 37 116 53 74 90 128 177 156 183 201 178 252 49 195 169 75 9 245 82 111
3132 111 47 66 216 237 237 215 182 132 139 110 254 28 51 35 109 147 73 151 270 243 127 76 155 150 33 212 129 83 219 59 291
$$ packed form
5808A66k9L9p4J26j54k1L6mK6M6j34Q2o1J10N1j49J12j65R8R2j03Q1K4M5j32m4J1N6K1m6l9
5444F7J20o9N0N9j24J9mJ37pn2j33Q7m4J6M6O6j45P7n8K1r9L8J20j29J09K1J14m6j06mj32
5080A5O5J04RO6j49J60j29P3p6l4Q7J13j31j1m0j0k0j5o4K2kM0QJ30n7k8r6M9J87j09J5J60
4704C32p6j76k1J17k5K9r0Oj1l2%Nk0K9Pj2J3n2K09nj5n5JR5j69K08j19m6n4L1o2LQ5NJ31
4294B66j67n0J7O2MJ7K3m6j7K6k2P9m1k7K6J7k2rK10k85J38o3L8m5J6K0r1L0P5k7m3k2JK8
3894A16k9k6l3J50k9o1M0M0q2J7J14p7M4n7O5qn2o2J09q1j9J03p3O9Pp7k8Q4L7j52lL4J13
3507A93jJ9j6j0j14J24R5j91m1M6k3n4J0P9o3K1J6L8M9k1K7J8k3P4k03J46k6r4o6K36j63K9
3132A11o4J9J50K1%k2l3n0Pk9J44k26K3j6P4L8p4P8J19k7j16n1P9nj17J79q3m6J36j60K32
$$ plain form
2768 291 237 109 269 344 69 186 43 76 56 65 11 136 163 190 215 102 180 86 124 79 123 98 102 103 227 179 70 156 113 96 238
2404 238 264 145 139 168 215 191 180 281 171 25 102 141 112 158 323 128 183 129 86 206 123 153 151 52 102 135 302 187 95 222 98
2040 98 143 44 166 132 259 105 72 118 168 95 67 166 159 133 311 250 191 256 107 90 164 251 38 180 92 79 102 99 102 222 178 79 155
1653 155 339 158 332 193 152 54 60 119 214 111 251 63 158 115 107 199 232 125 179 51 160 206 150 243 228 157 58 173 163 101
1300 101 87 36 19 125 62 150 169 108 94 196 159 151 102 145 53 29 36 98 103 194 134 301 166 45 108 204 115 118 176 88 160 100 102 97 175
890 175 285 95 11 203 263 279 77 115 73 86 135 100 135 15 7 241 75 188 26 269 81 230 312 235 223 213 137 154 162 84
538 84 92 83 127 131 204 222 137 126 18 179 116 94 140 165 142 220 194 48 86 87 269 220 189 178 25 63 137 20 179 82 228 237 77 15
138 15 155 125 31 112 70 73 30 102 170 17 79 168 195 257 186 265 109 144 47 119 219 95 83 143 116 144 126 75
$$ packed form
2768B91n4j28J60P5k75J17j43L3k0Rn4J25K7K7K5j13P8r4L8m5M4k5MJJ24m8j09Q6m3j7J42
2404B38K6j19oK9M7k4j1J01j10j46P7L9k9M6J65j95N5n4m3J20q3L0kr9N0L3J67j15r2J27j24
2040I8M5r9J22l4J27j54l3M6N0p3k8R9pk6J78o1n9O5j49j7P4Q7k13J42q8j3K3lLJ20m4r9P6
1653A55J84j81J74j39m1r8ON9R5j03J40j88R5m3qR2L3j07N4j28J09M6n6R3j5p1r9J15j0o2
1300A01j4n1j7J06o3Q8J9o1j4J02l7qm9M3r2k4PO2NR1o0J67j35j21O3R6q9LN8q8P2o0KnP8
890A75J10j90q4J92O0J6k02L8m2J3M9l5L5j20qK34j66J13j62K43j88J49Q2p7j2j0p6J7Qp8
538H4QrM4MP3J8q5j1j08J61o3k2M6K5k3P8k6j46L8JJ82m9l1j1j53L8P4j17J59r7J46Rj60o2
138A5J40l0r4Q1m2Lm3P2O8j53O2Q9K7O2p1P9j56L5r7P2J00j24j2O0k7K8j8n1
-190G5
##PAGE=	F1=10955.5
##FIRST=	25169.313707327481097,	5807.6787752999953227,	0.30477389693260192871
##DATA TABLE=	(F2++(Y..Y)), PROFILE
$$ plain form
5808 125 120 151 106 198 44 24 84 66 60 102 38 124 48 194 230 100 103 19 68 203 124 209 181 200 127 19 129 127 122 43 110 218 135 161
5409 161 285 136 97 42 193 257 241 72 122 125 118 186 279 132 153 84 138 30 88 169 39 107 235 323 196 142 172 57 55 170 197
5045 197 228 104 302 167 262 172 147 216 282 154 116 82 118 81 67 30 42 59 83 61 205 161 108 16 94 245 153 155 327 241 79
4681 79 14 143 165 181 97 112 110 63 52 59 48 108 57 69 52 10 242 207 220 147 108 244 70 269 156 198 207 92 81 40 120 91 196
4294 196 61 90 76 119 166 190 232 99 77 157 152 245 147 114 196 180 161 142 383 120 180 128 220 159 162 172 68 120 184 121 87 87 105 132
3894 132 54 70 46 201 149 60 163 177 92 102 222 190 257 139 157 224 230 105 187 107 104 142 68 198 168 109 104 152 182 77 40 84 236
3507 236 231 156 189 141 58 165 277 88 33 63 41 55 12 53 10 104 72 106 201 150 153 155 122 254 94 190 157 95 44 255 57 145 114
3120 114 90 162 171 228 182 152 153 115 83 179 89 57 10 108 175 52 163 242 224 136 73 156 159 43 173 88 95 178 50 249 227 113 284
$$ packed form
5808A25nL1m5R2j54k0O0j8oM2o4Q6p6J46L6j30Lq4M9J35p9Q5k8J9p3j08J10knp9O7J08q3K6
5409A61J24j49l9n5J51O4j6j69N0LpO8R3j47K1o9N4j08N8Q1j30O8J28Q8j27n4L0j15kJ15K7
5045A97L1j24J98j35R5r0k5O9O6j28l8l4L6l7j4l7J2J7K4k2J44m4n3r2P8J51r2KJ72q6j62
4681G9o5J29K2J6q4J5km7j1Pj1O0n1J2j7m2K32l5J3p3l9J36j74J99j13M2Rj15j1m1Q0k9J05
4294A96j35K9j4M3M7K4M2j33k2Q0nR3r8l3Q2j6j9j9K41k63O0n2R2o1LJ0j04N2O4o3l4%J8K7
3894A32p8J6k4J55n2q9J03J4q5J0J20l2O7j18J8O7Oj25Q2q0lL8p4J30l0n9nM8L0j05l7M4J52
3507B36np5L3m8q3J07J12j89n5L0k2J4m3M1m3R4l2L4R5n1LKl3J32j60R6l3o2n1K11j98Q8l1
3120A14k4P2RN7m6l0Jl8l2R6r0l2m7R8O7j23J11P9j8q8o3Q3Lj16J30q5PQ3j28J99k2j14J71
$$ plain form
2732 284 387 95 180 65 71 85 63 61 94 178 206 243 127 164 59 130 79 86 100 101 165 289 181 63 129 69 111 245 298 177 117 168
2357 168 208 245 211 277 158 76 152 102 88 164 338 127 164 124 101 165 37 220 200 89 136 92 291 202 125 226 130 125 61 167 96
1993 96 256 152 47 96 157 72 75 146 148 154 372 264 240 262 65 97 188 237 42 115 103 103 116 179 155 212 163 74 172 343 150 297
$$ packed form
2732B84J03k92Q5j15OJ4k2kL3Q4K8L7j16L7j05P1n1PJ4JO4J24j08j18O6o0M2J34N3j21o0N1
2357A68M0L7l4O6j19q2P6n0j4P6J74k11L7m0k3O4j28J83k0j11M7m4J99q9p7J01r6no4J06p1
1993I6J60j04j05M9O1q5LP1KOK18j08k4K2j97L2R1M9j95P3j2%J3O3k4N7m9q9R8J71j93J47
$$ [...]
-190D4
##END NTUPLES=	nD NMR SPECTRUM
##END=	
##END=	
