##TITLE=	ZiL6NwUVRbGlWpdzIVFClw.22.ser
TM-VI-158 hmqc

##JCAMP-DX=	6.0	$$ MestReNova 14.3.1-31739
##DATA TYPE=	LINK
##BLOCK_ID=	1
##BLOCKS=	2    
##ORIGIN=	Mestrelab Research S.L.
##OWNER=	hrzepa
##$MNOVA/LINK_BLOCK_TYPE=	ITEM	$$ NMR Spectrum
##$MNOVA/ITEM/POLYGON=	(XY..XY)
5321,5835
8722,5835
8722,8208
5321,8208
5321,5835
##$MNOVA/ITEM/Z=	0
##$MNOVA/ITEM/ANGLE=	0
##TITLE=	ZiL6NwUVRbGlWpdzIVFClw.22.ser
##JCAMP-DX=	6.0	$$ MestReNova 14.3.1-31739
##BLOCK_ID=	2
##DATA TYPE=	MNOVA NMR VIEW DATA
##DATA CLASS=	MNOVA VIEW DATA
##$MNOVA/2D/THRESHOLD=	4.4580426216125488281
##$MNOVA/ITEM/ZOOM/X=	-0.98001264966690615488,	11.003459999979801509
##$MNOVA/ITEM/ZOOM/Y=	-9.7479769829748601495,	190.10579999390242278
##END=	
##TITLE=	ZiL6NwUVRbGlWpdzIVFClw.22.ser
##JCAMP-DX=	6.0	$$ MestReNova 14.3.1-31739
##BLOCK_ID=	3
##DATA TYPE=	nD NMR SPECTRUM
##DATA CLASS=	NTUPLES
##NUMDIM=	2
##ORIGIN=	Bruker BioSpin GmbH
##OWNER=	nmr
##.OBSERVE FREQUENCY=	400.41200205000001233
##.OBSERVE NUCLEUS=	^1H
##.SOLVENT NAME=	CD2Cl2
##.PULSE SEQUENCE=	hmqcgpqf
##LONGDATE=	2021/11/11 10:47:59.000
##.ACQUISITIONMODE=	SIMULTANEOUS (DQD)
##$ORIGINAL FORMAT=	Bruker XWIN-NMR
##$MNOVA/SCALES_VERSION=	9
##$PARAMETER FILE=	(acqu2s, ASCII, /private/var/folders/f6/rjf_tdyn2v98c5c0wvkgn4s80000gn/T/ZiL6NwUVRbGlWpdzIVFClw/22/acqu2s, 0)
$$ ##TITLE= Parameter file, TOPSPIN		Version 3.2
$$ ##JCAMPDX= 5.0
$$ ##DATATYPE= Parameter Values
$$ ##NPOINTS= 129	$$ modification sequence number
$$ ##ORIGIN= Bruker BioSpin GmbH
$$ ##OWNER= nmr
$$ $$ 2021-11-11 10:57:29.241 +0000  nmr@CZC10666PP
$$ $$ /opt/topspin/data/agmb/nmr/Nov11-2021/22/acqu2s
$$ $$ process /opt/topspin3.2/prog/mod/go
$$ ##$ACQT0= 0
$$ ##$BF1= 100.683175
$$ ##$FnMODE= 1
$$ ##$NUC1= <13C>
$$ ##$NusJSP= 0
$$ ##$NusT2= 1
$$ ##$NusTD= 128
$$ ##$O1= 9059.81359838393
$$ ##$SFO1= 100.692234813598
$$ ##$SW= 200.226863172749
$$ ##$SW_h= 20161.2903225806
$$ ##$TD= 128
$$ ##END=
$$ 
##$PARAMETER FILE=	(acqus, ASCII, /private/var/folders/f6/rjf_tdyn2v98c5c0wvkgn4s80000gn/T/ZiL6NwUVRbGlWpdzIVFClw/22/acqus, 0)
$$ ##TITLE= Parameter file, TOPSPIN		Version 3.2
$$ ##JCAMPDX= 5.0
$$ ##DATATYPE= Parameter Values
$$ ##NPOINTS= 12	$$ modification sequence number
$$ ##ORIGIN= Bruker BioSpin GmbH
$$ ##OWNER= nmr
$$ $$ 2021-11-11 10:57:33.397 +0000  nmr@CZC10666PP
$$ $$ /opt/topspin/data/agmb/nmr/Nov11-2021/22/acqus
$$ $$ process /opt/topspin3.2/prog/mod/shimcntl
$$ ##$ACQT0= 1000000
$$ ##$AMP= (0..31)
$$ 100 100 100 100 100 100 100 100 100 100 100 100 100 100 100 100 100 100
$$ 100 100 100 100 100 100 100 100 100 100 100 100 100 100
$$ ##$AMPCOIL= (0..19)
$$ 0 0 0 0 0 0 0 0 0 0 0 0 0 0 0 0 0 0 0 0
$$ ##$ANAVPT= -1
$$ ##$AQSEQ= 0
$$ ##$AQ_mod= 3
$$ ##$AUNM= <au_zg>
$$ ##$AUTOPOS= <52 >
$$ ##$BF1= 400.41
$$ ##$BF2= 100.683175
$$ ##$BF3= 400.41
$$ ##$BF4= 400.41
$$ ##$BF5= 400.41
$$ ##$BF6= 400.41
$$ ##$BF7= 400.41
$$ ##$BF8= 400.41
$$ ##$BYTORDA= 0
$$ ##$CAGPARS= (0..11)
$$ 0 0 0 0 0 0 0 0 0 0 0 0
$$ ##$CFDGTYP= 0
$$ ##$CFRGTYP= 9
$$ ##$CHEMSTR= <none>
$$ [...]
$$ 0 0 0 0
$$ ##$ShimPowMaxUC= (0..63)
$$ 130000 130000 130000 130000 130000 130000 130000 130000 130000 130000 130000
$$ 130000 130000 130000 130000 130000 130000 130000 130000 130000 0 0 0 0
$$ 0 0 0 0 0 0 0 0 0 0 0 0 0 0 0 0 0 0 0 0 0 0 0 0 0 0 0 0 0 0 0 0 0 0 0 0
$$ 0 0 0 0
$$ ##$ShimPowMaxUG= (0..63)
$$ 524287 524287 524287 524287 524287 524287 524287 524287 524287 524287 524287
$$ 524287 524287 524287 524287 524287 524287 524287 524287 524287 0 0 0 0
$$ 0 0 0 0 0 0 0 0 0 0 0 0 0 0 0 0 0 0 0 0 0 0 0 0 0 0 0 0 0 0 0 0 0 0 0 0
$$ 0 0 0 0
$$ ##$ShimPowRcbType= 3
$$ ##$ShimPowRes= (0..63)
$$ 1e-20 1e-20 1e-20 1e-20 1e-20 1e-20 1e-20 1e-20 1e-20 1e-20 1e-20 1e-20
$$ 1e-20 1e-20 1e-20 1e-20 1e-20 1e-20 1e-20 1e-20 0 0 0 0 0 0 0 0 0 0 0 0
$$ 0 0 0 0 0 0 0 0 0 0 0 0 0 0 0 0 0 0 0 0 0 0 0 0 0 0 0 0 0 0 0 0
$$ ##$ShimPowRng0= (0..63)
$$ 1 1 1 1 1 1 1 1 1 1 1 1 1 1 1 1 1 1 1 1 0 0 0 0 0 0 0 0 0 0 0 0 0 0 0 0
$$ 0 0 0 0 0 0 0 0 0 0 0 0 0 0 0 0 0 0 0 0 0 0 0 0 0 0 0 0
$$ ##$ShimPowRng1= (0..63)
$$ 1 1 1 1 1 1 1 1 1 1 1 1 1 1 1 1 1 1 1 1 0 0 0 0 0 0 0 0 0 0 0 0 0 0 0 0
$$ 0 0 0 0 0 0 0 0 0 0 0 0 0 0 0 0 0 0 0 0 0 0 0 0 0 0 0 0
$$ ##$ShimPowRng2= (0..63)
$$ 1 1 1 1 1 1 1 1 1 1 1 1 1 1 1 1 1 1 1 1 0 0 0 0 0 0 0 0 0 0 0 0 0 0 0 0
$$ 0 0 0 0 0 0 0 0 0 0 0 0 0 0 0 0 0 0 0 0 0 0 0 0 0 0 0 0
$$ ##$ShimPowRng3= (0..63)
$$ 1 1 1 1 1 1 1 1 1 1 1 1 1 1 1 1 1 1 1 1 0 0 0 0 0 0 0 0 0 0 0 0 0 0 0 0
$$ 0 0 0 0 0 0 0 0 0 0 0 0 0 0 0 0 0 0 0 0 0 0 0 0 0 0 0 0
$$ ##$ShimSysFunc= (0..63)
$$ 1 2 3 4 5 7 9 11 15 16 8 10 12 14 6 17 13 18 19 20 0 0 0 0 0 0 0 0 0 0
$$ 0 0 0 0 0 0 0 0 0 0 0 0 0 0 0 0 0 0 0 0 0 0 0 0 0 0 0 0 0 0 0 0 0 0
$$ ##$ShimSysMatrix= 0
$$ ##$ShimSysType= 1
$$ ##$TFXNUM= 0
$$ ##$TRIPLO2= 0
$$ ##$VTU= 2
$$ ##$VTUETH= <149.236.99.20>
$$ ##$VTUTY= <no>
$$ ##$WBREFAM= (0..15)
$$ 135 116 100 100 100 100 100 100 100 100 100 100 100 100 100 100
$$ ##$WBREFLM= (0..15)
$$ 0 0 0 0 0 0 0 0 0 0 0 0 0 0 0 0
$$ ##$WBREFPH= (0..15)
$$ 71.66 -68.25 0 0 0 0 0 0 0 0 0 0 0 0 0 0
$$ ##$WBSGU= (0..15)
$$ 0 0 0 0 0 0 0 0 0 0 0 0 0 0 0 0
$$ ##$XFAC= 2
$$ ##END=
$$ 
##$DECIM=	4160
##$DSPFVS=	20
##.ACQUISITIONSCHEME=	NOT PHASESENSITIVE
##NTUPLES=	nD NMR SPECTRUM
##VAR_NAME=	FREQUENCY1,	FREQUENCY2,	SPECTRUM
##SYMBOL=	F1,	F2,	Y
##.NUCLEUS=	13C,	1H
##.OBSERVE FREQUENCY=	100.69223481359800587,	400.41200205000001233
##VAR_TYPE=	INDEPENDENT,	INDEPENDENT,	DEPENDENT
##VAR_FORM=	AFFN,	AFFN,	ASDF
##VAR_DIM=	512,	512,	262144
##UNITS=	HZ,	HZ,	ARBITRARY UNITS
##FIRST=	19140.455529915001534,	4405.895418600002813,	0.30010274052619934082
##LAST=	-981.45727250430979893,	-392.40686505384644533,	0.26268270611763000488
##MIN=	-981.45727250430979893,	-392.40686505384644533,	0.00013181468239054083824
##MAX=	19140.455529915001534,	4405.895418600002813,	73.018707275390625
##FACTOR=	1,	1,	0.0029963480596454754312
##PAGE=	F1=19140.5
##FIRST=	19140.455529915001534,	4405.895418600002813,	0.30010274052619934082
##DATA TABLE=	(F2++(Y..Y)), PROFILE
$$ [...]
##PAGE=	F1=-13149.1
##FIRST=	19140.455529915001534,	4405.895418600002813,	0
##DATA TABLE=	(F2++(Y..Y)), PROFILE
4406D2O6n2M5J4K7pJ07j5j13q9J1mRO5O5L7j16J53J6R0j39n0J34j05j59J43k3nL2k8J5r4K07
$$ 42 108 56 101 115 142 135 242 227 114 25 36 32 41 106 171 208 92 245 261 351 212 162 296 191 32 175 152 147 179 151 166 72 279
4096B79j80M2J76j01j23J03p0LK6m1L5l8oJ31n7q7L6J64j20M7j01J80p9l0o0l0j1M3j9q1%
$$ 279 99 141 317 216 93 196 126 129 155 114 149 111 105 236 179 92 128 292 172 219 118 298 219 189 129 99 88 131 112 31 31
3805C1J17O4r7Q0L4o4O5l4q9O0m5p2m3L7j9M3k4M9O4O0r9k8l8J10O7o2q8K3m6l6J20pN7k9
$$ 31 148 212 115 195 229 165 230 196 107 167 122 50 7 44 25 68 44 93 157 217 118 90 52 162 229 167 79 102 56 20 140 133 190 161
3486A61j29L9P8L3j79J16J7q1J6M5N7q7M2P1p4ln3M3r0JJ16o3N6J7j2r9K1J14k5m5J57O4j02
$$ 161 32 71 149 182 3 119 136 55 71 116 173 86 128 199 125 122 69 112 22 23 139 76 132 149 137 38 59 173 148 103 260 324 222
3176B22j38M9j4M1Ln1l7J08l1j26J5K7%P9j25J12o6Q6j12L8K1O1p6K1Oj3n1Q6N6J6l9J24q7
$$ 222 84 133 119 160 163 112 75 183 152 26 41 68 68 147 22 134 68 154 42 80 101 162 86 107 113 100 49 135 191 207 168 292 205
2866B05k6p5p9P7J46J7q7J5J09j49q4L8P1M9j01l5M4Q2O2j66nQ8p9l8J54j40M0J6o1jK2k2
$$ 205 179 104 25 102 248 265 178 193 302 153 69 107 178 227 126 91 135 217 279 113 108 196 117 79 233 93 133 149 88 87 109 87
2565H7J14J6Jk5j4r8lL0J3K8P3o3l3K4o7L3J4L3Rj47R7OQ1m3%o4J9pj00J70L3j93K17k4r4
$$ 87 201 217 218 193 179 81 78 108 121 149 222 159 126 150 83 116 130 163 172 25 122 128 209 166 166 102 121 114 14 184 217 24 241 217 123
2237A23p6O3O6j14J16j4m8J17j20k7j5m4J44k8k7Ql1L8Ll9J21o4p5J0L5n0N0o0L9l9J63l3
$$ 123 47 110 176 62 178 164 116 233 113 86 71 27 171 143 116 124 93 131 134 95 216 152 77 87 122 72 122 62 101 62 225 192
1936A92j16m3M6J2k5K5N1o3Q0jj9J53j25j04j8KP5p9J78l7k4J13j16p3L4Km5M0p6N3J5J32
$$ 192 76 33 79 91 66 91 142 79 159 158 139 292 167 63 45 47 122 43 221 184 160 273 157 84 118 120 75 115 39 92 107 239
1636B39j37j8OK3K6J2%j44K53o0p0N5K4o8j12J80J4j52K2J01j36J78j59j9O6p6L9M3J0j2J03
$$ 239 102 84 90 113 139 151 151 7 260 200 130 185 209 141 29 209 223 71 93 194 58 236 77 58 124 48 87 130 140 128 231
1345B31J09o4j38r0k8Q6P8Mq9q2J05j2p3N7oo2L8ppP5J2n8o2J13Q8j04J2o5Q7K2j05O9n0k0
$$ 231 340 276 138 48 20 106 184 188 99 17 122 110 37 94 88 26 64 57 50 125 137 79 17 130 218 114 126 61 148 170 65 134 84 64
1025F4L8N2n9N4j7j3n1m1P5L5j03rN6J5N1P0j25j9m6M6Q4p2M5J58j65P4j0o4J13p6K63j86
$$ 64 102 154 95 149 132 119 68 27 102 137 34 25 81 96 147 217 92 73 27 73 157 85 130 288 123 197 187 123 236 160 423 237
725B37N55J238o35p52k11k94M6K9j74R5K53j68j70M5J54K2k14M0n9N1L72Jl37j3J31m4j46
$$ 237 792 2030 1395 643 432 138 184 213 39 134 387 219 49 94 248 270 56 96 37 88 460 461 124 111 242 198 52
471E2L5RJ9K7j16jO3J08J4j62Q1K4L1K3q6n2L6l6N4J80o6j50R9J08m7m6j07N0m3p2L5n9R7
$$ 52 87 96 115 142 26 25 88 196 210 48 129 153 184 207 121 69 105 69 123 303 237 87 186 294 247 201 94 144 101 29 64 5 102
162A02J3r4O3L4n8L8Ll7J61l6j51l2L5j8L4K4J26J08j31q8k2J06O4P9k20j0N4n6k0Q5Q7J29
$$ 102 115 21 84 118 60 98 101 64 225 189 38 6 41 23 57 81 207 315 184 96 74 180 244 323 103 93 147 91 71 156 243 372
-139C72j55j28RJP0m1j2j6J26n7K8J6m2kJ64j66j48J7J7K8k7K9P3j24J54m5n4
$$ 372 217 89 98 99 169 128 116 100 226 169 197 213 171 169 333 167 19 36 53 81 54 83 156 32 186 141 87
-392H7
##PAGE=	F1=-13227.9
##FIRST=	19140.455529915001534,	4405.895418600002813,	0
##DATA TABLE=	(F2++(Y..Y)), PROFILE
4406D3P4o6J5K2M5rR2o8q8l2PJ0K6M8P0Lj46K03K4J23j37r7J44j05j50P9oL1M4n5J9r3J73
$$ 43 117 51 66 88 133 124 216 148 60 28 35 45 71 119 189 192 46 249 273 396 259 162 306 201 51 130 124 155 199 144 163 70 243
4096B43j35J3J71q4j13O7p9L4N4m2L4m5lJ17n4r0P7J42j32N6n6J67j03k7p2k5Nk4L5n9k7J44
$$ 243 108 121 292 208 95 162 83 117 171 129 163 118 115 232 178 88 165 307 175 231 175 342 239 212 140 115 120 96 131 72 45 189
3796A89R6j41L2L4p2P4l0j03Q7o8n0l9M4m7O4m3P4O8N0p2m7OQ7O4j06n2K1l1m4N5K1R2k5j06
$$ 189 285 144 176 210 138 212 182 79 166 98 48 9 53 6 70 27 101 169 219 147 100 106 193 257 151 99 120 89 45 100 121 213 188 82
3476H2l9Q0L1j11N3N6j33L0N7P2p6L8O0q1N1l1rr2k1J14r1N4PJ3p9K3J27m6o0K01L7j09j16
$$ 82 43 123 154 43 96 152 19 49 106 178 102 140 200 119 170 139 130 38 17 131 40 94 101 114 35 58 185 139 79 280 317 208 92
3166I2M9Mpj8m4KQ4n7k8k4kL8Q4j66J31p0P3j08M1RJ1m2N2J7Mo0L4N3L3j7J10o4m2p1r1O3
$$ 92 141 145 138 120 76 78 162 105 77 53 51 89 173 7 138 68 141 33 74 83 94 52 104 121 125 65 99 152 185 168 278 214 172 101 10 73
2828G3J38N4o6k5J52j43n0j07J29L8p3k6N0O2M9j45J7O8p6p5J90j63Q4l0k5L5J3n8J05J3O
$$ 73 211 265 199 174 326 183 133 26 155 193 120 94 144 206 255 110 127 195 119 44 234 71 155 125 100 135 148 90 195 208 214
2537B14l8Qq1l4K8L1L5O3j04j4O1m3oL1Lj6j15J07oR5k4j6m7j3J7q6J47M7k21J88j4o8r6P7
$$ 214 176 184 103 69 97 128 163 226 122 108 169 126 120 151 154 138 23 130 124 219 195 179 132 119 136 50 197 244 23 211 197 129 33 110
2218A10K9j05J48Kn6P5j13km3JJ19o0o9P1nJ7j1j9J04k0q1MM4k6K9o6K8n0J88l3j10p4O5l1
$$ 110 139 34 182 184 128 203 90 88 45 46 165 105 36 107 102 119 108 89 193 173 92 96 140 114 143 77 105 55 243 210 100 26 91 60
1899F0K4qO0l1Q6np6J69j25q3l4J5L9k5J69n0k8J09j11q0M5pm9M6m8M5k3J41j28pl7L7J5K0
$$ 60 84 76 136 105 191 186 110 279 154 71 37 52 91 66 235 185 157 266 155 75 120 113 64 110 62 107 84 225 97 90 53 90 105 125
1579A25Qj16K43p6r9P1J9n5o3J49jj32M6Q2j53J89j70j0O5p3OM0O1l0N1J02l0j19o8l0P6O5
$$ 125 133 17 260 184 85 156 175 120 57 206 205 73 119 201 48 237 67 57 122 49 55 95 156 126 177 279 249 130 62 32 108 173
1279A73nj13K1J29n7j04N1pn4L4k2j9N0M6k7p6R0N9m8%q1J43J0q2M5jkp1P6j15J37k9j5l0
$$ 173 168 55 76 205 148 44 95 88 34 68 46 27 77 123 96 20 110 169 121 121 40 183 193 111 156 155 153 82 158 43 180 151 136 106
960A06p0M4L9p4J8QN7L5O2r2p2k6pR7k2nJ59j52P1O5n9J01j14K60j80N90J342p26p57k24k50
$$ 106 36 80 119 45 63 71 128 163 225 133 61 35 28 125 103 98 257 105 176 241 182 283 169 429 249 839 2181 1455 698 474 224
669B24j08J35k30L3K82j18j13m4J85P0k46k3JR5L19K7l51l9J69o7j25J3J4L0O9j81lR9P9%
$$ 224 116 251 21 54 336 218 105 61 246 316 70 47 48 143 462 489 138 99 268 201 76 89 103 133 202 21 18 117 196 196
387A96j47R4J2J9K0r6j0jKJ1J75n3j14O1O7n2Rq1L4m3l6M9p9P2K6j19R8Q9r4j5K0p0J40j1
$$ 196 49 143 155 174 194 98 88 87 89 100 275 222 108 169 236 184 193 112 146 103 67 116 37 109 135 16 114 203 109 94 114 44 184 173
68A73q0l0k3rR4j1P1J38j13j04m4R4P1Q7k31k3Q7l4p5Q8R0R6j23j16K3J4N6m3l5L0J25n4L9
$$ 173 93 63 40 31 125 114 185 323 210 106 62 156 227 314 83 60 147 113 38 126 216 312 189 73 96 110 166 123 88 118 243 189 228
-242B28K2p6j8J65j38j15n1JO6l7O8K0j12J48k6n5
$$ 228 250 174 156 321 183 68 17 18 84 47 115 135 23 171 145 90
-392I0
##PAGE=	F1=-13306.6
##FIRST=	19140.455529915001534,	4405.895418600002813,	0
##DATA TABLE=	(F2++(Y..Y)), PROFILE
4406D4Q2n3k3J0O6j5P2j05k3k7K7OL4K2P8l1j26K06J4J47j12j46J48r2j24K4mM5O0o2Qo7J09
$$ 44 126 73 50 60 126 111 183 78 55 28 55 61 95 117 195 164 38 244 258 405 293 147 295 203 79 103 99 144 204 142 150 83 192
4096A92r3K2J33o4m2J4j03L6P0l4N6m0k8J01n2p5Q0J25j29N3j9J70j27k8p7rNp8Q4m0l8J43
$$ 192 99 121 254 190 148 162 59 95 165 131 187 147 119 220 168 93 173 298 169 222 203 373 246 218 141 132 137 59 143 103 65 208
3796B08J32j51l8L9q5P2j1p2O5p7l4k6L3k9N4l1N2P1M8n5o3M5O3N0j47J4J9k6l6jK8J07l0
$$ 208 340 189 151 190 105 177 166 94 159 82 48 22 55 26 80 49 101 172 220 165 102 147 210 260 113 127 146 120 84 83 111 218 188
3486A88o3j09R2Pl1QP4j45LP4P7n3K6N3q3P8rl8j01k8R4j05M9OJ7m6J6J37m8r3K36Qr7q3L2
$$ 188 125 16 108 115 84 92 166 21 24 98 175 122 148 201 118 196 187 149 48 20 114 9 58 64 81 35 51 188 140 47 283 291 194 111 143
3157A43Jl7l4m4N3P1o9L3kr0Q5Q6j82J20o1M9r5M1J2m2j2Q6J6Rn7jM9K6RP5l5m4o4p8J1J24
$$ 143 144 107 73 29 82 153 84 117 115 25 110 196 14 134 73 122 27 68 80 38 26 112 128 137 80 79 128 154 163 238 203 159 95 17 28 152
2819A52Q8m5n7J86j05j2j37M7L9l8k1M7M2L3j10K2O6p3p5J82j39J05q4oO6K2r2Q3R%m7M1n3
$$ 152 240 195 138 324 219 207 70 117 156 118 97 144 186 219 109 131 197 124 49 231 92 197 113 107 173 195 103 186 195 195 148 189 136
2509A36p9P2NK6M4j36J8P7mm1N0k4m1o2Q5nR5ml0k9k7M8q4J26M8k45J72l5l9r5R0J4j01J44
$$ 136 57 129 134 160 204 68 86 163 159 118 168 144 103 41 126 121 216 212 182 153 126 174 90 216 264 19 191 156 117 22 112 126 25 169
2190A69L0n4K8j05L0n6L1Q3o5m2O8j9J0k5J4P4J8o4qL9pLo2L0m1J80l5j01p7O3l6K3m7P5J
$$ 169 199 145 173 68 98 42 73 156 91 49 117 98 108 83 97 171 189 125 117 156 149 152 90 120 79 259 224 123 46 109 73 96 49 124 125
1861A25Q6kj07J55j23o0k5NQL0J54p7l0Q8r6p0M8jm3K3j5M3o7J35j00Pm6K1JK5J7p4K07r4
$$ 125 211 209 102 257 134 74 49 54 62 92 246 169 139 227 131 61 109 108 65 88 73 116 49 184 84 91 45 66 67 92 109 35 242 148
1542A48j18Q6L4n5NQ3j8q5O6N6j68J83j63L0M2p9JO9O6o7J9Q7j0r9m2l4N4O9j0j35J18J47
$$ 148 30 116 150 95 100 183 165 80 146 202 34 217 54 84 126 47 48 117 183 116 135 222 212 113 71 37 91 160 150 15 133 280
1241B80r9j38M9jl9N2j2o1K6P5k3p9O7J8K6j7q4J68ko3J7N0Or3L2j36J89k3k7j0q9K1K7n2
$$ 280 181 43 92 91 52 104 92 31 57 132 109 30 97 115 141 124 40 208 206 143 160 210 216 123 155 19 208 185 158 148 59 80 107 55
922E5M9k2Q6OO0n6j08l6mO1L3n3J60j38K7J43l3Q1o8K04j75N87J413p96p69k23j91k35K24
$$ 55 104 82 168 174 234 178 70 34 30 91 124 71 231 93 120 263 230 311 243 447 272 859 2272 1476 707 484 293 58 282
650B82j96n2K27o2m6j08J74J19k49n7J00O7K57J9l12q1J87q0q8j3M6P1N4k01m3J32K5Lj03
$$ 282 86 34 261 199 153 45 219 338 89 32 132 199 456 475 163 82 269 189 101 88 134 205 259 58 15 147 172 175 72
378G2Q5j5j5M0q2Qk3K0k5J60k8p9K7K5n7N1n9N1n6MN4q9O5K4j45J33J34j25p8L6q2Q5L7J3
$$ 72 157 142 127 167 85 93 70 90 65 225 197 118 145 170 113 164 105 156 100 104 158 69 134 158 13 146 280 155 77 113 31 116 153 166
58A66m4r0PJ53m7oJ65p3j09pK2O8R8k01q3J42l4q0N6O9P2q5r0J9K6M9n2n3P6J13m7M4K7j03
$$ 166 122 32 39 192 145 139 304 231 122 115 137 205 303 102 19 161 127 47 103 172 244 159 69 88 114 163 111 58 134 247 200 244 271 168
-261A68m7J56r2n8n5MpM1K4j1p8J04jo0
$$ 168 121 277 185 127 72 76 69 110 134 123 45 149 148 88
-392H8
##PAGE=	F1=-13385.4
##FIRST=	19140.455529915001534,	4405.895418600002813,	0
##DATA TABLE=	(F2++(Y..Y)), PROFILE
4406D5Q2k9k4l3Q1k6N3j00J9m3M9kL9rQ5o0n3J51pJ62o1j97J48p5q7qk6M9P5m5j5l0N1q8O0
$$ 45 127 98 74 41 122 96 149 49 68 25 74 72 111 102 187 127 74 225 218 380 319 122 270 195 108 100 74 123 198 153 138 108 159 71 131
4077A31Q3n2N5lj23k5P8k4R3j9p1P3n0n6O2J17j04L3KJ83j41l6o9Kjj15J20l2l8J29J65j36
$$ 131 214 162 217 214 91 66 144 120 213 194 123 196 146 90 152 269 165 198 200 383 242 206 137 139 138 23 143 111 73 202 367 231
3777B31j00N4j02O0K4l0J6p4l4mLJ9L7l1K3Q0M3n2o1O5M0L6j83R6J5k6l4k7K0J06m4qj51J00
$$ 231 131 185 83 143 167 137 153 79 45 41 44 63 100 69 92 172 215 163 102 167 207 243 60 156 171 145 111 84 104 210 166 158 7 107
3458A07l2M2j2O4j11n1Q6P4l0J5M9p7P4Rn2j08j7N8o4LJ2K%LJ29k9j22K42j4o0n5kk1k3l4
$$ 107 75 117 105 169 58 7 93 167 137 152 201 124 198 207 155 47 30 88 24 27 39 41 41 44 173 144 22 264 250 190 135 133 112 89 55
3129E5l3N8P4o4N8K4j57J12Q2j68Q7m5J9o6K6M8j6q4J25Jlm5LM3j5M3K5j6l0n4m6pP0R9k3
$$ 55 22 80 154 90 148 172 15 127 209 41 128 83 102 36 62 110 94 10 135 136 133 88 91 134 119 162 187 171 141 87 41 34 104 203 180
2800A80r0K04l4J6j13q4N9ll4L8L3On7JQ8p7n2J40p6J08j39nQ4M6j12N3lj8n8R0k2j23J17
$$ 180 90 294 260 276 163 79 138 135 101 139 172 178 121 122 210 133 81 221 145 253 114 109 193 239 127 180 177 159 101 191 169 46 163
2490A63l6NK4j53Q3N1L6o7O9n2n9kN5%R0J1l6j1l2Q6r7J05L3k33J64r4j2l0N2K8j15J20N8
$$ 163 127 132 156 3 86 137 173 106 175 123 64 62 117 117 207 218 182 171 139 225 128 233 266 33 197 103 91 61 113 141 26 146 204
2180B04l8j5p6K4l2L9L4n3J7L4n4K8l0L6L8L4k6k5L0lj8n1L9m0J66l7q3q2P7k7j9p3R4K4Q2
$$ 204 166 151 75 99 67 106 140 87 104 138 84 112 82 118 156 190 164 139 169 166 148 97 136 96 262 225 142 60 137 110 91 18 112 136 218
1852B18Mj07J17j24l7Mj9RN3J17j05k6O1p4m4M6J6k9k9J8M6p6Q7o1K5k3k5j4K7L0l2J58j10
$$ 218 222 115 232 108 71 75 56 65 118 235 130 104 165 91 47 93 109 80 51 69 115 39 126 65 90 67 42 28 55 85 53 211 101
1542A01n6L0P1o8M8K4l8j8Q1L7j84J52j31O9J7r5M8Q5L8j11L2O7j7p8l1m0M6P0j3j05J42J61
$$ 101 45 75 146 78 126 150 112 94 175 212 28 180 49 118 135 40 88 173 211 100 132 199 182 104 73 33 79 149 136 31 173 334
1241C34j36j51M7jk6P9rq3L0P0m5m8K4k2J01k6o4J38j0m5j2R4Jp5j8p5J60rm1kr2PJ6n1P6
$$ 334 198 47 94 93 67 146 137 54 84 154 109 61 85 63 164 138 74 212 202 157 145 239 240 165 147 72 232 223 182 180 88 95 111 60 136
913A36l5R8l2O8j9j11p8L2J2R4j06J51j02o9K05J1N8J6J55j49N33J497q65q15k15j37k32J96
$$ 136 101 199 167 235 216 105 27 59 71 165 59 210 108 39 244 255 313 329 484 335 868 2365 1500 685 470 333 101 297
650B97j43m1O0lJ4r9R0J68k24m7J35K8K05j5k42j15J85q4n5l5P8J11L3j98q2J50m6L2n9P1
$$ 297 154 113 173 170 184 85 175 343 119 72 207 235 440 425 183 68 253 169 114 79 157 268 301 103 21 171 125 157 98 169
368A69m2p6P9m6Kk3Qm1J33Nm9Lj8o2P7k2P0p5M5M8r3P0K5j66J45J71j49j39N6q6J3J18P7n5
$$ 169 127 51 130 84 86 63 71 30 163 168 119 122 104 42 119 97 167 92 137 185 92 162 187 21 166 337 188 49 105 19 32 150 227 172
49A72j45QK11p7q6J79k4j01K3l1N2R9j55r0J45n4o9L4K7O0m5m6j1L0N1o0n4J03Q7m0M7M1j18
$$ 172 27 35 246 169 83 262 238 137 160 129 181 280 125 35 180 126 57 91 118 178 133 87 76 106 157 97 43 146 233 193 240 281 163
-261A63q8J35m0jm6np7J41m7Jo6N3K3o6
$$ 163 75 210 170 169 123 118 41 182 135 136 70 123 146 80
-392H0
##PAGE=	F1=-13464.1
##FIRST=	19140.455529915001534,	4405.895418600002813,	0
##DATA TABLE=	(F2++(Y..Y)), PROFILE
4406D6O9mlo4Q1m1M0o7Jk6N9j7M5l8Q7p8J7Q2l1J72J0k37J31o1m0m2n0O7P9j3m1LL6j41J02
$$ 46 115 111 108 44 125 84 124 57 58 32 91 74 119 81 168 90 107 189 158 330 340 103 234 173 133 91 41 108 187 174 133 136 172 31 133
4077A33N3n8J50Rj46j03P9k2J34J2j09L4n4l7M5J10o2kOJ97j37n4m8Oj0j07J14l6k9J04J92
$$ 133 186 128 278 287 141 38 117 95 229 241 132 166 112 75 120 230 168 166 172 369 232 178 130 136 126 19 133 97 68 172 364
3786C64j00j40P1j02M2N4j1l2o0l3J2m0P6J4m4J2Q8K3n5l0N6K5L0k04J64J0k9l8l7J2R8o4
$$ 364 264 124 195 93 135 189 178 146 86 53 65 25 101 115 71 83 171 194 139 109 165 190 220 16 180 190 161 123 86 98 196 132
3486A32M6j55Q6p2J01j9L6p2o4P2O4j8RN3o8M7J6n0j10RJ5j9k8K5l2M9PQ7nr5J75j5pm6m7
$$ 132 178 23 109 37 138 119 155 83 19 91 155 137 146 199 131 178 194 144 34 43 58 39 11 36 4 53 60 147 142 47 222 207 200 154 107
3157A07n1N4k7j9J1Q3o0P0L9j72R7P4j39N4k2j4k8NR5J6j65J59k3k7k5K0L8o4Q2k3j9km6j5
$$ 107 56 110 83 64 75 158 98 168 207 35 132 206 67 121 99 85 57 62 157 173 8 167 144 117 92 112 150 86 168 145 126 124 78 63
2838F3L7L9L4Jj27J94N6L2q4j81Q8J9o4K9M5l6Jm0J22q3l6R0mJ10j84j9R2P4j18L5l1m5p3
$$ 63 100 139 173 174 47 241 297 329 245 64 152 171 107 136 181 145 146 106 228 145 109 199 195 305 121 102 194 268 150 185 154 109 36
2528C6J48J1j52J36p0k5Kk2M7nO4q2P9p6n3M6K6%Q7J7k9Mk2J14j22P8Pj74J49j61RM5JN0j34
$$ 36 184 195 43 179 109 84 86 64 111 106 170 88 167 91 38 84 110 110 197 214 185 189 167 281 159 237 244 70 219 58 67 112 113 163 29
2199B9R2P3nm3m1k3J6L9j7m7O1J7q0O6l1L9%K6K7m8K7j9k0m1M9n5J52l1n4r2J10k8q1m5Q0
$$ 29 121 194 189 146 105 82 98 137 120 73 134 151 71 137 106 145 145 171 198 150 177 158 138 97 146 91 243 212 158 66 176 148 67 22 102
1871A02L9P0J3q7P0j31j0L5m4M4M3N1j26j4L7m9kM0L5j0r9M8N1k5j6k3N2op2QKM8jJ01j02
$$ 102 141 211 224 137 207 76 66 101 57 101 144 195 69 55 92 43 41 81 116 106 7 55 106 81 65 42 94 88 16 24 26 74 73 174 72
1542G2K1m9J07p8O1op0N3R4K9k00J01p4Q7oj12J14Q9jj58R3N8n3o5l7m0O6M7j8o0J26J67j61
$$ 72 93 44 151 73 134 128 58 111 205 234 34 135 61 148 142 30 144 233 232 74 167 225 172 107 70 30 96 143 125 65 191 358 197
1232A97j32M1j8k0J02oq8N1M9q0Nl0k9J39k4m3Q1j6l2l2J24j0n1m5k0J38On8Mr0MJ4p1R5l7
$$ 197 65 106 88 68 170 164 76 127 176 96 101 71 42 181 157 114 195 179 147 115 239 229 178 133 113 251 257 199 203 113 117 131 60 155 118
903A18R4p6Q8J6q9j13M2j6J56j37J06n0o7J13O8L3J09J42j01M60J641r53r10k29j04j65J15
$$ 118 212 136 224 240 151 38 80 64 220 83 189 139 72 185 253 286 395 537 436 896 2537 1584 674 445 341 176 291
650B91q2k3r1N6M5n2PJ89j72o7J56j4J69n7j69j21J67p9l8n4R9J41K1j83j09J55j25Q7l0O1
$$ 291 209 186 95 151 196 144 151 340 168 101 257 243 412 355 186 65 232 153 115 61 160 301 322 139 30 185 60 147 117 178
368A78m8r2M8Rj6j2l0JP2M0l7ql8j8K1N1N4r1Q0L3q7O4M2j86J37J98j64j82Q4o5K4J06R6n9
$$ 178 130 38 86 95 79 67 37 38 110 150 113 105 67 49 70 121 175 84 164 197 110 174 216 30 167 365 201 19 103 38 62 168 264 205
49B05j60k6K60r8j25J49K3q3L5m9K5Q4j12m9J15p9m9K4k3O1j2jm7J7O0o0k7R7L9l6N8O7j19
$$ 205 45 19 279 181 56 205 228 145 180 131 156 240 128 79 194 115 66 90 67 128 116 115 68 85 145 85 58 155 194 158 216 283 164
-261A64j36J03ON3k7k7j18K22j21M6p6MM7p1
$$ 164 28 131 137 190 163 136 18 240 119 165 89 93 140 69
-392F9
##PAGE=	F1=-13542.9
##FIRST=	19140.455529915001534,	4405.895418600002813,	0
##DATA TABLE=	(F2++(Y..Y)), PROFILE
4406E2L9J6K4p6Q0n9L9n4l4K7N4m4N6n7P8p6O3J2m1J69R2k51Q2n1Or2l9R2O9J6n7K4N0j85
$$ 52 91 107 131 55 135 76 115 61 27 54 108 64 120 63 141 65 128 140 99 268 360 109 191 140 146 54 15 107 176 192 135 159 209 24
4087B4R3N7p9K22L2j68j65Q3l9J64M6j27no6k0M6R2j4m0mK03j17p9j5Ok5m6P2o2oO4K10n0
$$ 24 117 174 95 317 349 181 16 99 60 224 270 143 138 72 52 98 190 176 136 132 335 218 139 124 130 105 59 131 69 63 127 337 287
3777B87j60Q0q2K8O2j1o6l7k0J0q2J18j4n6K3Q5j3m9K1K0K4L4j54J51Ll3m5l7KR0q2Q9j53
$$ 287 127 207 125 153 215 204 138 101 81 91 9 127 113 57 80 165 152 103 124 144 168 202 48 199 202 169 124 87 89 179 97 186 33
3467C3P0q9J34k1qk9o0N8N5k4J1O4n7%J6m0q9L1j8jLK2k1K4K5M0Pn5Q7J2M1o1r7j3J00l9j8
$$ 33 103 14 148 127 119 90 30 88 143 119 130 194 137 137 153 113 24 55 37 36 39 61 40 64 89 129 136 81 168 180 221 160 63 50 150 111 93
3119I3j7Q0o2P8M3j65P2O3j02L0Nm5Pj0J32L8k21J78m6n7PK2L1r2J10m8m5L2m4J6P8N4n0K0
$$ 93 76 156 94 172 215 50 122 185 83 113 118 73 80 70 202 240 19 197 151 94 101 123 154 62 172 124 79 111 67 83 161 215 165 185
2800A85j27J16J49L7n5k24J00L4j03K3P4q1M1q0J49q5k6M2N6J11k08m6R1J01j14M1p2p8j1
$$ 185 58 174 323 360 305 81 181 215 112 135 209 128 169 89 238 153 127 169 225 336 128 82 173 274 160 201 129 51 40
2528D0J26M4j59J30p7o8k4J13J1m7O4p8P0r3NM2PnQ4J9j5J9JJ20j46M4k5q6J18j84J3R4m3
$$ 40 166 210 51 181 104 36 12 125 136 89 153 75 145 52 57 99 106 101 185 204 189 208 209 329 183 227 202 116 234 50 63 157 114
2218A14O4j42P7N1M2m4k8q2P5L1o4m1Q9Op3R4l3L6l7JQ7q0L9n8Pm4N6p8J30qj9r9J51l8j51
$$ 114 178 36 113 164 206 162 134 52 127 158 94 53 142 148 75 169 136 172 135 136 223 143 182 124 131 87 143 65 195 187 168 69 220 182 31
1889C1J9M5M9M3K9n7K8j48K8N1o4R1K5m0j17oJ9jK3L2M4Lr6PN4L7q9k1Q9j3o1K3k6N9RM7n9
$$ 31 50 95 144 187 216 159 187 39 67 118 54 145 170 130 13 7 26 25 48 80 124 127 31 38 92 129 40 19 108 95 34 57 31 90 99 146 87
1542H7L7r8J26p9N4Jj08J04J05K9k14M4lR1k8j27J73R0m3k05J87N1r4o5n4l0R4J5k4k9J02
$$ 87 124 26 152 73 127 128 20 124 229 258 44 88 85 176 148 21 194 284 241 36 223 274 180 115 61 31 125 140 116 87 189
1251A89J61j70r3L3m5k4J16Kp7P3K3j18O5q0QJ21rk8J1j5k5l1J28j5m7m7K8J23K3q1J6q6J6
$$ 189 350 180 87 120 75 51 167 169 92 165 188 70 135 55 63 184 175 147 158 143 118 87 215 200 153 106 134 257 280 199 215 129 145
941A45J9j14J06l2P9j17J12M8n1j25L1n1K14j36L4kJn0J24mJ93J65m7M14J807j038j020k81
$$ 145 164 50 156 124 203 86 198 246 195 70 101 50 264 128 162 160 161 111 235 231 424 589 542 956 2763 1725 705 424
678D24j04q5K6l0J0j71Q6L1J1j0J50j08j26J73m9J39q7j11j05J49p1l2o8J01J60J6j63j19
$$ 424 320 235 261 231 241 70 156 187 198 188 338 230 104 277 228 367 280 169 64 213 142 110 42 143 303 319 156 37
415C7J46j73J30j7N6j9l9p0O5k9pp2N9K3N9m8klJ7p1J23Pq9R8J6o5K7P6k01J12K14j66j71
$$ 37 183 10 140 123 179 160 121 51 116 87 80 8 67 90 149 101 99 96 113 42 165 172 83 181 197 132 159 235 34 146 360 194 23
105B3R4m4O2M9Q9n8j42m4K57j08p9M4N7n8L2l4rN5q0MQ5q9j7J0n4N7lL8o3j8P1m8LQ2l3l7
$$ 23 117 73 135 184 273 215 73 29 286 178 99 143 200 142 174 140 131 186 106 110 195 106 89 99 45 102 99 137 74 56 127 79 82 164 131 94
-233I4P7J05j07j47L6L6R5Lo0q9K29j75R3r2l2O2p1
$$ 94 171 276 169 22 58 94 189 192 132 43 272 97 190 98 66 128 57
-392E7
##PAGE=	F1=-13621.6
##FIRST=	19140.455529915001534,	4405.895418600002813,	0
##DATA TABLE=	(F2++(Y..Y)), PROFILE
4406F8j1L0M8p5Q5p1M7n2j7K9N1q5O6o2O2n5Q3o0NJ26J62k38Pm1M3j27N7L9M8L4o0L5O6j70
$$ 68 57 87 135 60 145 74 121 69 52 81 132 47 113 51 113 58 141 81 86 212 374 136 143 102 145 18 75 114 162 196 136 171 237 67
4087F7J7P9r5K60M9j78j76Q6p1J59P4j26k4q5oO7N4K9o9k0J93q6r9K0J4n2K1N9j06J6KK20
$$ 67 84 163 68 328 377 199 23 109 38 197 271 145 121 36 30 97 151 180 111 91 284 198 99 119 133 81 102 161 55 71 73 293
3786B93Rj71P8n0J3N3j3q7mnlq8J11m6n3M3O4n7LN3k9K9M5j09J35ol6n3k8j6Q3q6J14j46M6
$$ 293 302 131 209 159 172 225 212 125 121 116 113 25 136 90 37 80 144 87 90 143 114 143 188 79 214 208 172 119 91 75 158 72 186 40 86
3458H6n0J12k1o3J7m5M8N0m8J9P9l6o7J4j9l1J8k1k5N8K2k2lM3L1rl0J8N3O3r3j39J14N4n9
$$ 86 36 148 127 64 81 36 84 134 86 105 184 148 81 95 76 45 63 42 17 75 97 75 72 115 146 137 107 125 178 241 148 9 123 177 118
3129A18j3j8O0o3P0M5j32L5N0p0J5M1p5L6j3J50N0k45J73o2p9L9PJ9q6J10m8o8N3m7M8J08
$$ 118 105 87 147 84 154 199 67 102 152 82 97 138 63 99 86 236 286 41 214 152 73 112 119 138 52 162 114 46 99 52 100 208
2828B08O8j08L0j00RK24L4k8k34J01N0j41K0J06j12N4j06J51p2k1%R4J11k08q0P9J24j02P0
$$ 208 276 168 198 98 107 331 365 337 103 204 254 113 133 239 127 181 75 226 154 133 133 227 338 130 50 129 253 151 221
2556B21j08r4R6J9Q3j49J18n4p3K2R0k5o0M2n1L8p6M2K0jj0P9J9qM4K7J06j58On0NO7j70J8
$$ 221 113 19 115 134 217 68 186 132 59 81 171 146 86 128 77 115 39 81 101 100 90 169 188 180 224 251 357 199 205 155 160 227 57 75
2237G5J11p0O6j33Q7j6Q4j4l7j33J26K2j02k6R5Jm7J03l4L3p0l0J44j20O8j13O7p1N9j03R9
$$ 75 186 116 182 49 136 120 204 190 153 20 146 168 66 40 135 136 89 192 158 191 121 91 235 115 183 70 137 66 125 22 121
1946A21M2Qj01J90n2j83M6J6O1kN7k6qj60P0M4q2J46J1j46J5j4k0L3MK6L4Lp7k2M4R1j01m8
$$ 121 163 171 70 260 208 25 71 87 148 146 203 177 169 9 79 123 41 187 198 52 67 53 33 66 70 96 130 133 56 34 78 169 68 20
1626B0J06m3JNm2P8QJj5K2j20J20p0M0L2j17J06J09K9k17pO6R7m9j44K08R5q7k13K68K8j23
$$ 20 126 83 84 89 47 125 133 134 119 141 21 141 71 111 143 26 132 241 270 53 46 112 209 160 16 224 319 232 19 287 315 192
1326A92p2p3j4J10nl1j4P8J39j58n1K8p1l7J16J8n3Q5pj45J14j10L7R8J3j9n7nl3JJ00Mq0
$$ 192 120 47 33 143 138 107 93 171 310 152 101 129 58 21 137 155 102 187 180 35 149 39 76 174 187 168 111 106 73 74 174 178 98
1016I8k6O1J11M1j09L8q1L9L4j68J04k3O3j53J28P2oj16K8j20K62j05l6K0O7j25J31o7K43
$$ 98 72 133 244 285 176 214 133 172 206 38 142 119 182 29 157 229 223 107 135 15 277 172 136 156 223 98 229 162 405
744D05K13J5M06J937j104j097l44j45j4m4j7O1j91R3j8P7K3Q8n3k09J94p1J06r8q2q0J36n4
$$ 405 618 633 1039 2976 1872 775 431 286 272 228 211 272 81 174 156 233 256 344 291 82 276 205 311 213 131 51 187 133
481A33k6p5P9J69J7j41j11J19r1O3k6O0L1j6j27Q1k3j4n3L8NO8p5J8L9K1j07J42m0o5R3Kl0
$$ 133 107 32 111 280 297 156 45 164 73 136 110 170 201 185 58 139 116 102 49 87 92 160 85 103 142 163 56 198 158 93 186 188 158
171A58m0J19k06P5K23j53j38R7l1P6KP3n4j04k7J96j05po7O9k8K4Jm7K3n9N1N7o4Knm6L1k3
$$ 158 118 237 31 106 329 176 38 135 104 180 182 255 201 97 70 266 161 154 87 156 128 152 153 106 129 70 121 178 114 116 111 65 96 73
-148G3O9n8m5O6k7K6O9j14m6J00J45q8j24j6L2J09L8r5m2K03j88J15j05m6O1o6
$$ 73 142 84 39 105 78 104 173 59 13 113 258 170 46 30 62 171 209 114 72 275 87 202 97 51 112 46
-392D6
##PAGE=	F1=-13700.4
##FIRST=	19140.455529915001534,	4405.895418600002813,	0
##DATA TABLE=	(F2++(Y..Y)), PROFILE
4406I3p6L6O7o4R0p1N5l1J7j2N4j20N9n9O0l6Q7j19J00M5K00k15o7k4N9k8M7k6K0M3n4M2P5
$$ 93 17 53 120 56 146 75 130 99 116 104 158 38 97 38 98 62 149 30 130 175 375 160 93 69 128 100 147 121 141 184 130 172 247
4096B47j42o2R6q8K56N4j55j48R1p9Q2Q7j08j9q1j2Q1J4O1q4l0J59n4j02M7L6q4P7Q0j40Q
$$ 247 105 43 139 51 307 361 206 58 149 70 152 239 131 112 31 19 100 114 175 91 61 220 166 64 111 147 63 140 220 80 88
3805H8n9K13O8j81O8j1j4M1pr5L6kk0q1Q0p2k2M0L4r3J18L0p4K6N5p2J32j1l7o2j2m7P6p1
$$ 88 29 242 310 129 197 186 172 213 206 111 147 145 125 44 124 52 30 70 104 11 129 159 85 111 166 94 226 215 178 116 104 57 133 62
3486F2J24j36J4%P8k2j01M8l0M1N1p3K2R5Mj38K4J1Qj4j1l9R4K0k7l1N5O5l5l9J3N0O5j28
$$ 62 186 50 64 64 142 120 19 67 37 78 129 56 78 173 177 39 63 74 82 68 57 18 112 132 105 74 129 194 159 120 133 183 248 120
3166A20n5J20rp1kjL0n3L5O0o9j9M2o5QQ0r7N8mJ44N7k42J45o8q5O0j5Kn8Q3l5n5M2m8Q3J17
$$ 120 65 185 176 105 103 102 132 79 114 174 105 86 128 63 71 151 54 112 108 252 309 67 212 144 59 119 104 106 48 131 96 41 83 35 118 235
2828B35O8j44L4o9o7K63K9pk27R5O8j72J5J37j22M1j14J26m2k0l0J07J10j92q7K9J44q2J10
$$ 235 303 159 193 124 57 320 349 342 115 210 278 106 121 258 136 177 63 189 147 127 97 204 314 122 35 64 208 126 236
2556B36j15o2J16q2J29j31J12k9p0M6M7o0o0J7lOk6J2NMj1O5K4k7Q4M9Q2j47l0m7O1kj53M5
$$ 236 121 59 175 93 222 91 203 174 104 150 197 137 77 94 91 97 71 83 88 92 81 146 170 143 227 276 358 211 181 134 195 193 40 85
2237H5J09q0N9j09J10q7Q9L9m8j58J46J5j32J3P3kk8J02k8K8r0n5J85j65J11j74J41j13N7
$$ 85 194 114 173 64 174 87 176 215 167 9 155 170 38 51 124 122 94 196 168 196 106 51 236 71 182 8 149 36 93
1964I3n5pJ28Pr7K18o1j59K0oP1o1R6Ll8j08N3J6q6J99%j92P8j9l1M2MJ5Pj5n5j2J9J24j07
$$ 93 38 31 159 166 69 287 226 67 87 81 152 91 187 190 152 44 97 113 27 226 226 34 112 93 62 104 108 123 130 115 60 48 67 191 84
1636H4l3Q8p5P8k3o2J08Pl1QLj30R7n2K8O0j18R6J05K3k01m6J22J08o2j67K13R9j23j23K65
$$ 84 51 139 64 142 119 57 165 172 141 149 152 22 119 67 95 155 37 133 238 261 60 14 136 244 182 15 228 327 204 81 346
1345C46pj36p3r2qJ11ol8j5O4J01j26j6L0r2j3N9M1j6P6m1j45J35j01K5R4L3j5j14K4m5L5
$$ 346 339 203 130 38 30 141 135 97 82 146 247 121 105 135 43 30 89 130 114 190 149 4 139 38 63 157 190 175 61 85 40 75
1044G5M9N0j39L9M4R2N6j32O3p0O4O3j89O0j8O7j51Q0Q2M1q8M6j32K01m7p2pJ19p9J00j06
$$ 75 124 174 35 74 118 210 266 134 197 127 191 254 65 125 107 174 23 103 185 226 138 184 52 253 206 134 127 246 167 267 161
753A61J87K71J00M47K075j200j165l84k08J8m7r2J31j98Q9p2J29P4M5k0k95K28p5N3r2p8l4
$$ 161 348 619 719 1166 3241 2041 876 492 284 302 255 163 294 96 185 113 242 316 361 341 46 274 199 252 160 82 48
500D8R6j9k0p2L9J70K0j11r1P3j4J6n5O7Q7j5j24O3oj8n3K1mP7j07M2O2J9j18J35p5l2P9q
$$ 48 144 125 105 33 72 242 262 151 60 133 119 135 80 147 234 219 95 158 152 134 81 102 98 175 68 110 172 191 73 208 133 101 180 172
180A72Rj19J59j96L8K20j22j23J06k0O7l4O0m7o2OJ04q4O7j29K6NK6L4p3Ll6N6L5j6Jj7k5
$$ 172 181 62 221 25 63 283 161 38 144 124 191 157 217 170 108 114 218 134 201 72 98 103 129 163 90 93 57 113 148 132 133 116 91
-129I1Ln7R0l9j6J6j2M4O2j35L9k1J68p1j04kJ3P1P4j18pJ58j48J02j14k8L8o0
$$ 91 94 37 127 88 72 88 76 120 182 47 86 65 233 162 58 56 69 140 214 96 89 247 99 201 87 59 97 37
-392C7
##PAGE=	F1=-13779.2
##FIRST=	19140.455529915001534,	4405.895418600002813,	0
##DATA TABLE=	(F2++(Y..Y)), PROFILE
4406A23j00pP6m4Q8o0N7LL7n4O0j30K6l9P0l8R0r8J16j9K01j94j15ON0P7K9q4j5M7m4N1P5
$$ 123 23 16 92 48 136 76 133 136 173 119 179 49 75 36 106 68 158 60 176 157 358 164 49 55 105 182 211 127 112 159 115 166 241
4096B41j07j09P4n4K10M9p9j28J03q8qP9q2Kn5k6P0qP4q8j1Q8k6p9N7O1j06J10J19j65j5m6
$$ 241 134 25 99 45 255 304 225 97 200 112 104 183 101 103 48 22 92 84 158 70 59 147 121 42 99 160 54 164 283 118 103 57
3796E7J37J20j92N6K4m9K8Pr1P5j5l3o5L8q8L3KOK1J14j6j00JN9l4J34nl3p2%p9O8m4J25j25
$$ 57 194 314 122 178 202 153 181 188 97 172 157 124 59 97 9 42 44 50 71 185 169 69 70 129 95 229 224 191 119 119 40 108 64 189 64
3467F4k5M6M7k2l6ll8L8N5o3qJ11N8j42K0K1Jn0pj7R6J7l3o1O4J16n3p4N6lO3j49M2Q7p2o0
$$ 64 39 85 132 110 74 71 33 71 126 63 55 166 224 82 102 123 124 74 67 50 146 163 130 69 133 249 196 122 178 175 238 89 131 218 146 86
3129H6OK1Jl2k1J03np0M5j05NJ21j11P4J3J19N7k16J00o5p2O7l3j9k8L8j0j4Nl1J12J02N2
$$ 86 92 113 114 82 61 164 159 89 134 29 34 155 44 118 131 250 307 91 191 126 54 121 88 69 41 79 69 55 60 29 141 243 295
2819B95j70L4l5q1K55K2Mk10Q2Q3j85NJ68j14Oj05P6Pk9m4R7J12j72k8m6J27n7J42q5p0J24
$$ 295 125 159 124 43 298 320 324 114 196 279 94 99 267 153 159 54 130 137 108 64 161 273 101 73 27 154 97 239 154 84 208
2528B08j54J73j09J06j6p7O6Lq3o5KN3Oqm7J0J4pM9L2p9J36O4N4j12n6j0O3q0j22P9R2q0M6
$$ 208 54 227 118 224 208 131 197 200 117 52 54 107 113 105 58 68 82 75 124 156 77 213 277 331 219 163 153 216 136 14 93 185 105 151
2209A51p2J28r7J3J03m3j66J36J6j48M9M6ll2R3qJ8r7m9J89k06J61j29J07j56N2M2l2J17l3
$$ 151 79 207 110 123 226 183 17 153 169 21 70 116 113 81 174 166 184 87 38 227 21 182 53 160 4 56 98 66 183 150
1927A50q7K33o0j27nj6P0j26J41K2o4n0K9j9m0K12rj61L5j4m5O2K7jl8m2l3J7mJ36j19J5N2
$$ 150 63 296 236 109 104 88 158 32 173 195 131 81 110 91 51 263 254 93 128 114 69 131 158 157 119 77 44 61 57 193 74 89 141
1617A41o5J23n1q7J42Lm7K0j3j40O6k7K4P0j17R3Q7Qj66m8J36J17o7j89J94J02j52j5K47m7
$$ 141 76 199 148 61 203 206 159 179 166 26 92 65 89 159 42 135 222 230 64 16 152 269 202 13 207 309 157 142 389 342
1335C42j30n6j10k2J00J0m3k9O0N1p9NM5j08K9k5O3K7M7q2n3O5m2k5J06M3j8j44O7j1lj0J07
$$ 342 212 156 46 24 124 134 91 62 122 173 94 99 144 36 65 40 103 130 177 95 42 107 65 40 146 189 171 27 94 83 80 70 177
1025A77j00N4k4N2N8j28P3n0Q4J01j73Rl5J00j42j1P1Q3m4P9j05P1K9p0o4J39lJ11o3J3L13
$$ 177 77 131 107 159 217 89 162 112 196 297 124 133 98 198 56 45 116 199 155 234 129 200 229 159 95 234 231 342 279 292 605
734F05K14N42K337j385j309m07k47j4K5k01J69j76M2r8J31J28K3rl31K54p5j8o7q5M7j6M5
$$ 605 819 1361 3698 2313 1004 597 350 336 361 160 329 153 195 97 228 356 379 370 39 293 218 200 133 48 95 79 124
481A24l0n7oJ64K5o1p2J0M4%j01P5J34k4r1K8K0j0p2K0KP3j37N9O7J0j19J21r3oO6j5L7j73
$$ 124 94 37 31 195 220 159 87 97 141 141 40 115 249 225 134 162 182 172 100 120 122 195 58 117 184 194 75 196 103 97 163 148 185 12
162A2J79j72L7J79p6j38J16mM1n8N7l4l7M9lm8J38j16q6L1N3M8p7joJ9J5K9j0k5jj4p6P4m
$$ 12 191 19 56 235 159 21 137 133 174 116 173 139 102 151 148 100 238 122 36 67 120 168 91 90 84 103 118 147 137 112 111 97 21 95 91
-167I1L5l0l0O2O3q4O1q0J26o9q6J1K7LJ01j12%J07p5P3j24J2Nn6
$$ 91 126 96 66 128 191 107 168 88 214 145 59 70 97 100 201 89 89 196 121 194 70 82 87 31
-392C1
##PAGE=	F1=-13857.9
##FIRST=	19140.455529915001534,	4405.895418600002813,	0
##DATA TABLE=	(F2++(Y..Y)), PROFILE
4406A50r0l0K5j4P5l9M9L8M5q7O4j23%RN6n2Q9n8R8o3J83j80j11L1K5J52J2j20n5N3l6O3O9
$$ 150 60 30 55 41 116 77 126 164 209 122 186 63 63 72 128 76 165 107 205 142 325 145 34 65 90 242 254 134 79 132 96 159 228
4096B28p4j05%lJ38M5M0j37J11j04n0L5o5K9k3k3L4pO8q9L8j7Kl7M9P9j05J10J64j80m1%M5
$$ 228 154 49 49 46 184 229 269 132 243 139 89 124 59 88 65 42 76 69 137 48 86 69 71 34 83 162 57 167 331 151 110 110 155
3786A55J62k01M9M1q1J3K5p5R9l8m0l7ol2K6n3L7R5R1n7r0l5L5OJ28J7k4q7Nq4M8k1J19j09
$$ 155 317 116 165 206 125 138 163 88 187 149 109 72 66 34 60 7 44 139 230 173 83 48 83 89 217 234 210 123 128 44 92 71 190 81
3467H1o4P9K6k3L0k9p2L4N6k4m7J21J04j33RL4j5q5j3MR9J6m1q9O9J68o4j13J01p0O4j25R4
$$ 81 17 96 122 99 129 100 28 62 118 94 47 168 272 139 148 182 167 82 69 73 172 188 147 58 127 295 231 118 219 149 213 88 182
3157A82L2j15j4mL6j9j0p4J60M0j14O1j48lJ41j14Q2L2Q0N3j75M5n2m7O9m3m0j4kM0Rm3J7
$$ 182 214 99 85 81 117 98 88 14 174 214 100 161 13 10 151 37 119 151 231 284 109 154 102 55 124 81 41 27 25 65 74 31 48
2847D8J21O9K1j89K9Nn1K21J2Nj86N8R0j68qJ92r5m4p0J5O0m9n1P2J24j59M9j3J7m1J42l3
$$ 48 169 238 259 70 99 104 53 274 286 291 105 163 253 85 77 269 174 130 60 75 135 86 35 107 231 72 121 108 125 84 226 193
2547A93j09J29j76J90q1Q8j1q7P9l3q2p4j3J08L3k5j05K7K9qL7M1j40J74O7L0n4p4L6L2j55
$$ 193 84 213 37 227 146 234 223 136 215 182 100 26 13 121 154 129 24 51 80 72 109 150 10 184 251 281 227 153 189 221 66
2256F6J4L2O0q5L1k7J30o2j03J60j3j81J27K1j32M9J8Jn8P7L1kq7j6J59j75J47q0O2j25mJ17
$$ 66 80 112 172 87 118 91 221 159 56 216 203 22 149 170 38 87 105 106 48 125 156 154 67 51 210 35 182 102 164 39 35 152
1955A52lP0r5p5K38n0r3j8k0N8j08J05K9q7MMm8L5J97j6j44j7jn3Q2O7k4r1l5l4L7k1J32j34
$$ 152 149 219 124 49 287 237 144 126 106 164 56 161 190 103 107 111 63 98 295 279 135 118 117 64 146 213 189 98 63 29 66 45 177 43
1636D3Q4OnJ17p2j12J68jn1L2k5j54L5KL2N7j04R1N4j3j18k7J14J15o6j92J65R7j73R1K16
$$ 43 127 133 128 245 173 61 229 228 177 209 184 30 65 67 99 156 52 143 197 184 66 39 153 268 202 10 175 272 99 190 406
1345D06p7j14k6j26l4O8L8m4l5M8Kk4PP1j18M6q5P9O7Rj28M2mL5l0P8L5k6j24Q4K2n6o4J56
$$ 406 329 215 189 63 29 97 135 91 56 104 106 82 89 160 42 88 3 82 149 158 30 72 68 103 73 151 186 160 36 120 142 86 22 178
1025A78k9M7q3OK4p4M2k4R6J41j36j5p2J40j74n7J8J17MJ17o2n4R7n8p3R3M7J56J3j20K83
$$ 178 149 196 113 119 143 69 111 87 183 324 188 173 101 241 67 10 28 145 149 266 204 150 247 189 116 209 256 412 425 305 588
734E88L34O54K692j614j529m26k53p9J07k33J40j22l9p1N8J73Qj5l00K54p4r2k8o0R4j57J31
$$ 588 922 1576 4268 2654 1125 699 446 367 474 241 381 259 220 149 207 380 388 373 73 327 253 161 133 73 167 10 141
481A41o8k3j9J15L3Qo2n1O3J2j09L6J65l5l7k1M9J4j04L5L3N2j63N6O3rj09J11q6j3O1k2M8
$$ 141 73 50 31 146 179 187 125 74 137 149 40 76 241 206 169 148 197 211 107 142 175 227 64 120 183 174 65 176 90 77 138 116 164
171A64j25J12j39Q5J01l3j57J09J5J7p1O7j4n1R1r5j2K09p9j37k7J00L5n8kQ%jL3%l2J2j2
$$ 164 39 151 12 97 198 165 8 117 132 149 78 145 131 80 171 76 64 273 194 57 30 130 165 107 105 113 113 112 145 145 113 125 113
-139A13n3J3M2O9n1q4P7P1m1O9q4P3r2o9K1M8n4R8p4j9N5J1N1j41O1k3n7
$$ 113 60 73 115 184 133 49 126 197 156 225 141 214 122 53 74 122 68 166 92 73 128 139 190 49 110 87 30
-392C0
##PAGE=	F1=-13936.7
##FIRST=	19140.455529915001534,	4405.895418600002813,	0
##DATA TABLE=	(F2++(Y..Y)), PROFILE
4406A68p8k8l8J6M8j3L4O1M8j06O4j12J1N4K2o7Q2k9P2r3J66j73n8L3J2J68kj21r0O4l7Q0
$$ 168 90 62 24 40 88 75 109 170 218 112 176 64 75 129 151 84 166 137 209 116 282 109 51 84 96 264 262 141 51 115 78 158
4105A58N4m7r9n8M3N4P1J46j72J12j21j6k0q9N4J6j0j4NN0r1Q8q5J8j1K9Q4p8P5K07j79o4
$$ 158 212 165 66 8 51 105 176 322 150 262 141 125 105 16 70 86 76 62 67 117 26 114 29 47 36 65 149 71 146 353 174 110
3805A10M9l1J95k07M5L8r2j1L9n2J05o5l7mk6J2J2m2O3Q4O6q2m5l4m5L3J10N0j1j06Mn3J8
$$ 110 159 128 323 116 161 199 107 96 135 83 188 123 86 82 56 68 80 38 101 185 251 169 124 90 45 78 188 238 227 121 125 72 90
3495I0j7J11q7r2R1J4k3P6k9j05K3N1J7o5J21J31j26qN5k1j16k8J8J07J7n5j07P5K05o9j40
$$ 90 73 184 97 5 96 110 87 163 134 29 52 103 120 55 176 307 181 173 228 207 91 63 81 188 205 150 43 118 323 254 114
3204A14J27j33P4o0Q8k9j00K2k9L9k7Lm6J42P2j57Q5j34KQ9j04Q0M6L7M3j25rl3j7P3m5n6
$$ 114 241 108 182 122 210 181 81 103 74 113 86 89 43 185 257 100 185 51 53 142 38 118 164 201 244 119 110 77 60 133 88 32
2903C2kM4K6pq7P0J24K5j6j89RO7l1J86k%j54K0Q4j10j8K00p4j02j8MO0o4o3L4J47j53J20
$$ 32 30 74 100 93 6 76 200 225 209 20 29 96 65 251 249 249 95 115 199 89 71 271 197 95 77 81 141 77 14 48 195 42 162
2594A62K4l1o2J10K1j65J36j52J76n0N9qr7Q1n9m7m6j4R2P0n6r2nM6j8L1M4m8M6N7J3J5q2
$$ 162 186 155 93 203 224 59 195 43 219 169 228 220 123 204 145 98 52 38 130 200 144 52 47 93 75 106 150 102 148 205 218 233 151
2284A51O7qj89J38j5K0r3RJ8J17j8j51J39K8j70R9K1j01M1j5Pp6L4Q8k8o5J1J27j09J05n0
$$ 151 218 210 21 159 144 164 71 80 98 215 197 46 185 213 43 142 163 62 103 88 95 19 53 141 113 48 59 186 77 182 132
1993A32L1r0j1J32J5L7j57n8K29l0n6j9l2M3m3L1J7j03N2k2n8J06J72j8j41p2J7m0Q7J14n1
$$ 132 163 73 62 194 209 246 89 31 260 230 174 155 123 166 123 154 171 68 120 98 40 146 318 300 159 87 104 64 151 265 214
1702B14j44M7n3Jm0J28j16J24m0O7Q4q2j34J81qm6N2l3j73J7K7M5K9o9Q5Ol9o5jP2R4n9j57
$$ 214 70 117 64 65 25 153 37 161 121 188 272 190 56 237 229 183 235 202 29 46 73 118 147 78 163 169 130 65 64 136 230 171 14
1392A4J35Q7j91J70J84r5j01Pj29l6K0O9l2j9Qk6K0KQ6j15L6q4O1R4k2j06N2k0P2JL0J3l7
$$ 14 149 236 45 215 399 304 203 210 81 45 65 134 102 83 91 65 85 87 173 58 94 10 71 165 143 37 89 69 141 142 172 185 148
1082A48j01R8L9r4o8J53K9M5j20Nq6M4l9jJ00J69q1j6j11J71k24k6L1K5K5J48mj04J14o2j6
$$ 148 47 145 184 90 22 175 204 249 129 134 48 92 53 52 152 321 240 224 113 284 60 34 65 90 115 263 259 155 269 207 191
791A91K6J5K13J01j39J76M34P46L011j812j761m36k42j44J54j98R5n2j06m0l0K02nm3k55K51
$$ 191 217 232 445 546 407 583 1017 1763 4774 2962 1201 765 523 379 533 335 430 378 272 232 202 404 399 356 101 352
547C52n9j52nl0J31j54R3j26K5LJ5N3Q1n6q2J9M5o5m2J66m4L2q8P8N2j34N0P7L6j85L5O0m0
$$ 352 293 141 136 106 237 83 176 50 75 78 93 146 227 171 89 108 153 88 46 212 168 200 112 190 242 108 158 235 271 86 121 181 141
237A41r0J16n9o9P2l3L8o4N1r8J34M1j0j27M8L0J6o6P3Rj03J20q5n3K77m4j41o5R1Nk4oOK2
$$ 141 51 167 108 39 111 78 116 52 103 5 139 180 170 43 91 121 137 71 144 153 50 170 85 32 309 265 124 59 150 155 131 125 131 153
-83A53j6j3N2l3pLm5QO0P4n5j45Q1P9qO4p2N2j36n5L9O0o3L8k1n3K0Q6M5j65J09m0n9
$$ 153 137 124 176 143 136 139 94 102 162 236 181 36 117 196 188 252 180 232 96 41 80 140 77 115 94 41 61 147 192 27 136 96 37
-392C7
##PAGE=	F1=-14015.4
##FIRST=	19140.455529915001534,	4405.895418600002813,	0
##DATA TABLE=	(F2++(Y..Y)), PROFILE
4406A73o4k6m4PJ1J5J4O8M8j13O5j02M9R1k6p4O7j5M7j12J59j72jL3J7J28j0r1j06P8m3R0
$$ 173 109 83 39 46 57 72 86 154 202 89 154 52 101 192 166 92 159 144 191 79 238 66 65 98 115 243 233 142 36 114 71 161
4105A61L3l0j00k6J7k0J42J79k11J04j30N6l9j16M0N6Jo0J1M0r8J17m5ol7J3P7m0K1K36j58
$$ 161 194 164 64 38 55 35 177 356 145 249 119 175 136 20 60 116 117 57 68 108 10 127 82 76 39 52 129 89 110 346 188
3814A88q3R5q7K20k11M5K0p0m8M6l1Q8q6j7J9j2K3kk1O8N8M5q6J3l1j02K7P6R0jj28Mnqk8
$$ 188 105 200 113 333 122 167 187 117 69 115 84 172 86 69 88 76 99 97 76 144 202 247 161 174 143 41 68 144 234 233 105 109 104 96 68
3486F8J03o1q5O3Qk2R8j4j14kM0N2o3J13J35j13l3Q1j7j43m2K4J20J4p2j09Q0K20p1j43J25
$$ 68 171 110 25 88 96 74 172 158 44 42 82 134 71 184 319 206 173 254 237 94 52 76 196 210 138 29 109 329 258 115 240
3195B40j77R2KN4p0k3Kn1L2k2Pj8J15R8j95J05j13J5M2q6P1M7JK4p3m9j1NQ3m3p3M0P2ml3
$$ 240 63 155 157 211 141 118 120 69 101 79 86 68 183 281 86 191 78 93 135 49 120 167 168 192 119 70 59 64 147 104 31 71 143 139 106
2866A06p3O8J28k1n0r5MP0o1J54k0j0j08k5N4j2k5J81m8j52K3L9K0n9p9J9J43j26J42N9k7
$$ 106 33 101 229 208 158 63 67 137 76 230 210 200 92 67 121 109 84 265 217 65 88 127 147 88 9 28 171 45 187 246 219
2575B19j10O9N9k11J49j35J59j6K4lj07P0p0Oj4j9O5J08r4n1m8O7l1K4L5L5o2L0RP9q3Q1m6
$$ 219 109 178 237 26 175 40 199 183 207 204 97 167 97 103 89 70 135 243 149 98 50 117 86 110 145 180 118 148 157 236 153 234 188
2265A88j07J51n7j5q9k1M9Q9K6j06L1O5j35N5J7o0L8m9J2k2k0Q4n6l2J9J03n4P4l4J5o5OJ19
$$ 188 81 232 175 160 71 50 99 188 214 108 139 204 69 124 141 81 119 70 82 60 40 124 68 36 55 158 104 178 144 159 94 100 219
1955B19J7J6j93k8J92nk0j5n3L3K0l5pj09R3n2l5J45J42j0j38j24K7kO8J58p4j84J37p1m4
$$ 219 236 252 59 31 223 218 198 183 130 163 183 148 141 32 125 73 38 183 325 315 177 53 80 78 146 304 230 46 183 112 68
1664F8m9J29o3R8p2J26L8q2j47J74j1m1Q3l8j86QM7N4Kj6P2n3o5j5K9J3N5m0q5J01R2j78J69
$$ 68 19 148 85 183 111 237 275 193 46 220 209 168 251 213 27 35 82 136 138 122 194 141 76 61 90 103 158 118 33 134 226 48 217
1354B17J56j07r8L7j05m3k7R6lJm3j6K0J5O7q6J2p1M6J05l1n1LK2N8L6j0j5m4j03J18L6j04
$$ 217 373 266 168 205 100 57 30 126 123 124 81 65 85 100 167 81 93 22 68 173 142 91 94 116 174 210 200 185 141 38 156 192 88
1044H8n1J30P1N5j53N1j34Q3p8k2P1J71j6Oj40J84k44m4J22k9n9J61O6p3R7q8P2Rj13K63J90
$$ 88 37 167 238 293 140 191 57 140 62 40 111 282 266 272 132 316 72 28 150 121 62 223 289 216 313 225 297 306 193 456 646
753F46n3P8N13R09L490k141k130m54k65j93J22j17N5K9j36k6r1K12Lj05k19K35k5j93j9j0
$$ 646 593 671 1184 2093 5583 3442 1312 858 593 400 522 405 460 489 353 327 236 448 451 346 127 362 337 144 125 115
509A15J77j33O3j90P5K2r0R4J35m9q1p7R1j1q7J17m3J02j73J02J03j53M6J22L9j97OO1p4p0
$$ 115 292 159 222 32 107 129 39 133 268 219 138 61 152 141 54 171 128 230 57 159 262 109 155 277 316 119 125 186 112 42
227D2J33l1j25P3n1J4k2J0k8J52J8j2r4oK4M4n5O7K9j32R8Pj42L36k7j38n7M3l1J5Mj1O2l8
$$ 42 175 144 19 92 41 55 33 43 15 167 185 173 79 73 97 141 86 153 182 50 148 155 13 349 322 184 127 170 139 154 158 147 209 171
-92A71q5J38k3n2J4m8M8N2O0m9j80O5P2K5M9o0N9j78n3P2O0m1m2J2o6M1Q3N3j83J43n3n3
$$ 171 86 224 201 149 163 115 163 215 275 226 46 111 183 208 257 197 256 78 25 97 157 116 74 86 20 61 144 197 14 157 104 51
-392E1
##PAGE=	F1=-14094.2
##FIRST=	19140.455529915001534,	4405.895418600002813,	0
##DATA TABLE=	(F2++(Y..Y)), PROFILE
4406A63m6k4j9j6l2M1mN9M7j10P2p2O5J24p5p4M7j2K0r4J39j73M4L5K6N6j4l8r8Q6m6Q3Rk1
$$ 163 117 93 74 58 26 67 63 122 169 59 131 59 124 248 173 99 146 134 154 60 199 26 70 105 131 187 173 135 37 123 77 160 169 148
4087A48r7NLl3J70J61k39Q4j15J26m5j20J2R1Mr8J8L8j07J09J2j0p3MO5mk9K37j22r7J31j19
$$ 148 51 56 59 26 196 357 118 202 87 213 168 48 60 151 155 57 75 113 6 115 127 117 44 48 113 109 80 317 195 98 229 110
3786A10K34k11N0ok5p9M3j6M6r8K2J7J6L4l2mN7L4K9p1O8m1j28K3K3J26Nj50OM8l0l3R0m0
$$ 110 344 133 183 177 152 73 116 100 146 48 70 87 103 137 105 101 158 192 221 150 218 177 49 72 95 221 226 76 82 130 100 67 157 117
3467A17p5L7Kk1R8J0j03l3K5P9m7R4J23r1o1J02nj67m2K8J30jq5r4Q9K06p0j27J05j96J13
$$ 117 42 79 81 60 158 168 65 32 57 136 89 183 306 215 154 256 251 84 42 70 200 199 114 20 109 315 245 118 223 27 140
3176A40L7J3o5L2l5o1K1mKkQ6J22k18J10q5L3Op0O4L6j7qk4o3KJ0R3l2q3Q6O8l4m6n8O0J33
$$ 140 177 190 125 157 122 61 82 78 80 78 164 286 68 178 93 126 132 62 126 162 145 137 113 50 52 62 155 123 40 126 194 160 114 56 116 249
2838B49o4o6j9L8O8j21J21l9k1n2k5k4R0l5J44j5j64J6P7j7m2q7P0Q5q2J10Q3Oj56L4O9j76
$$ 249 185 119 100 138 206 85 206 167 146 94 69 45 135 100 244 229 65 81 158 141 99 12 82 167 85 195 278 284 128 162 231 55
2537E5J22j59J54J6mnj12M4o8N5J4k7M9J42j28j7q0R1m0J1J7J02j24j5J9J21p8Q3q1k1J50
$$ 55 177 18 172 188 184 179 67 111 43 98 112 85 134 276 148 131 51 142 102 113 130 232 108 93 112 233 155 238 157 136 286
2246B86r4m7o4l7N2N3O7n7o7Q0q9MJ2qL8o3OL6J7j6p1jLR0k2N9k8J5n4L1R4LOj62j2J24J5
$$ 286 192 145 81 44 96 149 216 159 92 172 83 87 99 91 129 66 72 108 125 109 38 37 40 130 108 167 139 154 100 131 225 228 234 72 60 184 199
1899A99J7rq2K5Q0r0l3j06J32q2kJ53J10Rj26j57J4L8L9J92q1j83J71p7o0k8J14m7O2q6J63
$$ 199 216 207 125 150 230 140 107 1 133 51 49 202 312 321 195 38 52 90 129 321 240 57 228 151 91 63 177 130 192 106 269
1608B69j5p5j42J44%m7J21l9j81nO4N4j7M5N2j16p7J9O2n0lK1k3N7J25j59J20J38j26j08P2
$$ 269 254 179 37 181 181 134 255 216 35 30 94 148 131 176 228 112 35 54 116 66 63 84 61 118 243 84 204 342 216 108 180
1317A80n5o1l8Q4M3Rr0J2j3O3Jk9Mm8J0J02j9k6l9P9L4O3m2l3m7j38J40J6p2o2J28R7R2j97
$$ 180 125 64 26 110 153 162 72 84 71 134 135 106 110 62 72 174 155 129 90 169 203 266 224 191 144 6 146 162 90 28 156 253 345 148
997A48J08r1M5o7m0j3J19O0M7j48J74k10j16K03Nj44R9J31lR6j16J50M4k06K60K49R8R7O16
$$ 148 256 165 210 143 103 90 209 269 316 168 342 132 16 219 224 80 179 310 307 403 287 437 481 275 535 784 882 979 1595
725A595J366M786l005l010n92l71k29j9m5K6R6j21k8j22K03M1j92k05J99K3k17n8j5K25j02
$$ 1595 2961 7747 4742 1732 1140 769 540 521 476 502 598 477 449 327 530 571 379 174 373 396 179 121 106 331 229
490B29M6k34R9L8j18R5J56m6o2j26Q3L2j03O6k6J31k19O6J65j53J2J57N8j91k1O8q7p4J51
$$ 229 275 41 140 178 60 155 311 265 203 77 160 192 89 155 129 260 41 107 272 119 131 288 346 155 134 202 115 41 192
218A92j3r5Qp5N3n3J4NJ37L8l3n7m1j8Q4n3N6N3j17K6J04j86L65l7j29k7j6o7N4L0k4Q9p0
$$ 192 179 84 92 17 70 17 31 36 173 211 178 121 80 62 146 93 149 202 85 111 215 29 394 357 228 201 185 118 172 202 178 267 197
-92A97j45K16%j03J1n3R6L4M1l7j96N0M4O3L7o0Q3k03o2J05N7j9n8k9%M5J9O4j61J34o6l8
$$ 197 52 268 268 165 176 123 219 253 294 257 61 111 155 218 255 195 278 75 13 118 175 156 98 69 69 114 133 197 36 170 104 66
-392F6
##PAGE=	F1=-14172.9
##FIRST=	19140.455529915001534,	4405.895418600002813,	0
##DATA TABLE=	(F2++(Y..Y)), PROFILE
4406A39k2j9Rl7o6N6j0K9M6r4R2j8M1J42j18o1K4j8oj2P4j60O2K9L7j1k7K2p6Q4m1O0j2k4
$$ 139 117 98 107 70 4 60 50 79 125 31 123 105 146 288 170 109 133 115 109 97 171 11 73 102 139 128 101 123 47 131 90 150 138 114
4087A14o4LJ2j2J41J28k47N7n1J52n7j06oJ16Pj27M0L0j26P5P2Lr8jN0K1m3J90p8j07J52j23
$$ 114 50 53 65 53 194 322 75 132 81 233 176 70 64 180 187 60 100 130 4 79 151 154 56 55 105 126 83 273 195 88 240 117
3786A17K33k08O5l2K0r7L6Lpj14O4lN2N9r0K0K2K0K3m5J07n9j32M5m7J48Pj70J3R3m6j2O7
$$ 117 350 142 207 175 195 98 134 137 130 16 80 77 129 188 98 118 140 160 183 138 245 186 54 99 52 200 207 37 50 143 97 85 152
3476A52l8o5K7nk4Q2L6q3n9J1R4k5O6J05o3q0J07Nj83rK3J30l6p5p7J06J62o1j02P7j87J19
$$ 152 114 49 76 71 47 129 165 82 23 34 128 103 169 274 211 131 238 243 60 51 74 204 168 93 16 122 284 223 121 198 11 130
3176A30N0k3k0L4o1o4J2K2nJ1N1J44k10Q3n5N4j8o5P0J2j0m4J0n4MpR9np2J08L2n5l6n3M5
$$ 130 180 157 137 171 110 46 58 80 75 86 137 281 71 154 99 153 135 70 140 152 142 98 108 54 58 51 150 145 73 181 213 158 122 69 114
2847A14J38r7m7KQ0Q4j85R3o0l5ML0l2P1n3R4K6j34l7J08m5k5q4J18O4n9N2R5N5j79JN5j07
$$ 114 252 155 108 110 190 274 89 182 122 87 91 121 89 160 107 201 227 93 56 164 119 94 10 128 192 133 185 280 335 156 157 212 105
2537A05J04j74J08M1j5k0j13K2n1O9L9l3M6J69j54Kr5J06l7jj1J44j37n8M0J25o6Q2j14N5
$$ 105 209 35 143 184 169 149 36 58 7 76 115 82 128 297 143 145 50 156 119 118 107 251 114 56 96 221 155 237 123 178
2256A78J38j28q0k0l7L9J6J10k6j16N7n4l2jM5M2n3pP3N2r1m3rj7P4k2O3k7K1n3N8O6k7Rq7
$$ 178 316 188 108 88 51 90 106 216 190 74 131 77 45 44 89 131 78 71 144 196 105 62 53 36 110 88 151 124 145 92 150 216 189 198 111
1927A11k1O0K4N0kj11J9J31j33m9n2J27j01%J49Q0L1j01j68k1O9QK16o8j48J39o6m2j2J03
$$ 111 90 150 174 224 222 111 130 261 128 79 27 154 53 53 202 282 313 212 44 23 92 100 316 248 100 239 173 131 119 222
1645B22o8L1q2J77o8o6r7P4M7o4J43l8j51j9O4M8k1J00K3j67j9k4R2q7j5R1l4jJ74j60Q7J21
$$ 222 154 185 103 280 212 146 49 123 170 106 249 211 60 41 105 153 132 232 255 88 69 45 137 50 35 126 92 91 265 105 192 313
1345C13j59j16J34j9p7rK6R4Kj26N2o5J31j05O0K1m1l9R8Qk4p0J23J6P2o4k7m6j15O6MPr3
$$ 313 154 38 172 153 76 67 93 187 189 63 115 50 181 76 136 157 116 77 175 183 159 89 212 228 300 236 209 163 48 114 118 125 32
1035C2J13J15J58k44J42m9L2o6m7o0qJ47R5j33J40j48j27J86O1j55L8J37O3J23j35J96J05
$$ 32 145 260 418 174 316 267 299 233 186 126 118 265 360 227 367 219 92 278 339 184 222 359 422 545 410 606 711
781G11k17K59K66K52K23P99K157P157m498m529r16n33k92j51q4PJ18p7m3j35J78P9k76k06
$$ 711 494 753 1019 1271 1494 2293 4450 11607 7109 2580 1664 1131 839 688 604 611 729 652 609 474 652 731 455 249
556B49J64O4k28p0o7K46o4L4k34Q1N2q6P1J47n9k4r9J8M7j14P8j2R5j75m4K11j39m4J78P6
$$ 249 413 477 249 179 112 358 294 328 94 175 227 141 212 359 300 276 177 195 242 128 206 194 289 114 70 281 142 98 276 352
274C52j60m3P5p0j11J65nm5m8o9J05o9L4n1R6Q8n2j8o6n4R0n9M8P3q7m5J79j96L85p2j16J6
$$ 352 192 149 224 154 43 208 203 158 110 41 146 77 111 60 156 244 192 174 108 54 144 85 133 206 119 74 253 57 442 370 254 270
-26B70p8r9Q4O4j8R3j10j22K11K9j38rn1J27J1K7j9k09N1NJ00M0p3J04k00o4J13N2qk9r2O1
$$ 270 192 93 177 241 223 316 206 84 295 324 186 177 126 253 264 291 272 63 114 119 219 259 186 290 90 26 139 191 183 154 62 123
-327A23L1l4O3j15J03q0j4
$$ 123 154 120 183 68 171 91 77
-392G7
##PAGE=	F1=-14251.7
##FIRST=	19140.455529915001534,	4405.895418600002813,	0
##DATA TABLE=	(F2++(Y..Y)), PROFILE
4406A08Nj3L3n8m5K2lj6M1m4J05K8OJ36j48l2kk6k9Q2Mj00L7nN4k3n0M0m9P5l1L0k9l6J2m2
$$ 108 113 100 133 75 30 52 49 33 74 30 135 163 169 305 157 125 123 97 68 150 154 54 91 86 140 117 67 107 58 133 102 132 103 67 79 37
4068C7L8j5J05J04k34K0N6J23p6o7k5J31J3j47P0K0j47K7J20L3j11JK4L3l0J19l5j11J56r8
$$ 37 75 60 165 269 35 55 111 234 158 91 66 197 210 63 133 153 6 33 153 186 75 76 100 133 103 222 187 76 232 134
3786A34K11j99Q7n6N6j06K5L7m4j35P2k5R8Q9j67O2l8J8K4j5J19p7r6O5j16J51J2j56j3J23
$$ 134 345 146 233 177 233 127 152 189 145 10 82 57 155 244 77 139 101 119 143 128 247 170 74 139 23 174 186 30 17 140
3504A40n0K2L9n0n5L1jl4O0N3o2p9J0Q9mL3Q9l8p7Q9Qj84N2KJ27r3k4q2J34R8m3p7N2j60J04
$$ 140 90 112 151 101 46 77 76 42 102 155 93 14 24 113 109 142 231 193 116 205 213 29 81 83 210 117 93 11 145 243 200 123 175 15 119
3176A19N6m5J7J2o6p1J6M5j1L7PJ58j79L8k7O8l3o5Q4j5Qn5J8n3J0l8J07K6m5J03l2n7Lp1
$$ 119 175 130 147 159 93 22 38 83 72 109 116 274 95 133 106 174 141 76 160 145 153 98 116 63 73 35 142 168 123 226 194 137 140 69
2857F9K6J37j12J6l6J18J09k39P9q3n7N1R3KPp5L3P3r0r6J22o4j3n5J39Q4n9j8R2J12j73l4
$$ 69 95 232 120 136 100 218 327 88 167 84 27 78 171 173 180 105 138 211 121 25 147 83 70 15 154 238 179 161 253 365 192 158
2556A58L1m4J04j54K9N2j2m7j00M6j6MN1l3N0J87j65Pj03J05k3jl4J49j23o2M1J02n2Q5j39
$$ 158 189 145 249 95 124 176 164 117 17 63 47 51 102 69 119 306 141 148 45 150 127 126 92 241 118 56 97 199 147 232 93
2265I3J13J15j58j16M2l5K9j6J56j8j04J4n5J2l9M2M7l3j4Q6P5j22nk8k2M3n4Q5k8K4m7P3
$$ 93 206 321 163 47 89 54 83 67 223 205 101 115 60 72 33 75 122 89 75 161 236 114 109 81 59 102 48 133 105 129 82 155
1964A55N3p3K3j7l4J5K2Q0Nj30J1J68j66m5k0J36j13k7J45N8M7p2j78l5P8j6K21l4j07O3l8
$$ 155 208 135 158 141 107 122 144 224 229 99 110 278 112 67 47 183 70 43 188 246 293 221 43 8 86 70 291 257 150 213 175
1673A75LkQ1j05J7p2J73j16n7j1k4J31p0J18m1j07k5M6L7j0J38j0j84M7r4J15q1M3P0o6o4
$$ 175 178 176 257 152 169 97 270 154 97 86 62 193 123 241 200 93 68 114 151 141 279 269 85 132 38 153 72 115 185 119 55
1382E5K17j64Q2R4j94j7J40l7p4Lj9J33j9j39R7j00J70k03J45M7m9q7J02L3k7r1J42PO4p9
$$ 55 272 108 190 284 90 73 213 176 102 105 86 219 200 61 158 58 228 25 170 217 168 81 183 216 189 98 240 247 311 232
1101B32J4n5q2k5N3N7j00N6J21K31k75J44j5L4p2n0q4j11K06J23j04R3p7j32J54J08j43M5
$$ 232 246 191 109 84 137 194 94 150 271 502 227 371 356 390 318 268 184 73 279 402 298 391 314 182 336 444 301 346
838C46J06R7J64j48K18J71k01L00K77L72L87J042L102J0105o292o394j345o95l95k03k16j0
$$ 346 452 549 713 565 783 954 753 1053 1330 1702 2089 3131 6233 16338 10046 3652 2307 1612 1217 1014 798 788
631G88R9k8o9j38J42P9l35k04J51Q6k28n5j28K24l2J6j97M0O2m2N6J24r2K7n0m3L2j25J40
$$ 788 887 859 790 652 794 873 538 334 485 571 343 288 160 384 352 368 171 211 273 231 287 411 319 346 296 253 285 160 300
359C00k0L0j19p3J83j26q2J72O5j08n3P3m1j57J71kJ6r7n3J37p8M9j07M4J44n8K5r3l6L0o0
$$ 300 280 310 191 118 301 175 93 265 330 222 169 242 201 44 215 213 229 132 79 216 138 187 80 124 268 210 235 142 106 136 76
68G6N2P2n9r0K14j72L99j30r9O1j36j22R7R6RP8j52m6J51N8j49l4m5J30j6K6Kk25O7j6J16
$$ 76 128 200 141 51 265 93 492 362 263 324 188 66 163 259 268 346 194 148 299 357 208 174 129 259 243 269 271 46 113 97 213
-223B13N6q9J12j79o8J12M3oMj06P3Lo0M8n7O0r3J4
$$ 213 269 180 292 113 45 157 200 194 198 92 165 168 108 156 99 159 66 80
-392H0
##PAGE=	F1=-14330.4
##FIRST=	19140.455529915001534,	4405.895418600002813,	0
##DATA TABLE=	(F2++(Y..Y)), PROFILE
4406G9K9oM4p5k0pMj7kK4J05N5j7J02j62J1l1k7l8J43m7m1J9o4P9J1m3k2k4O5j7%l7n7R9r7
$$ 79 108 102 146 71 51 44 48 31 29 53 158 213 196 298 136 147 116 89 51 194 147 106 125 61 140 151 108 86 62 127 110 110 73 16 115 18
4068A8P1l9P9R9j79j6J10P8r8j0m5J32K7j66R4K2j54L7Q0O6j06J6k2L2j4N7jj01J38m7J71
$$ 18 89 50 129 228 49 33 143 221 123 113 68 200 227 61 155 177 23 60 140 206 100 116 94 126 112 169 168 67 205 158 329
3777C29j87J08p2P9j08QQ6o1j41K8l6J51J10k46J25r1OK5QJ04q3k5O0j70J38K6r9n9J06l7
$$ 329 142 250 178 257 149 157 243 182 41 69 33 184 294 48 173 82 88 113 121 225 142 117 177 7 145 171 72 13 119 82
3495H2M6J2o0m6M0K1m0L7N5n1q3K7N2J7%P7k5n0N6lj25P8l1J36j67O0j03J57K7j5n5L5j44
$$ 82 128 140 80 34 74 95 55 92 147 96 13 40 92 109 109 186 161 111 167 164 39 117 86 222 55 115 12 169 196 181 126 161 17
3185A7Q6P1m9J0Ko1m0QM1j2P1k6J52j58J5pP2m4n8R7m3K0l9J3p2K4n6J10M4j2P3j12k4N7j16
$$ 17 103 174 125 135 137 76 36 44 85 73 144 118 270 112 127 120 192 148 90 187 144 164 125 138 66 90 34 144 188 176 249 137 113 170 54
2857E4J0J27r9R4q5J23J33k73Q2r7l6K1J51L2m5r7l1J16m7r1P5p5jj2J26J25o7q8Q3J64j45
$$ 54 64 191 92 186 101 224 357 84 166 69 33 54 205 237 192 95 64 180 133 42 117 42 41 29 155 280 213 125 208 372 227
2565B27o6QkJ04j11l1L9mp9m8O7l2mRj1M4J92j54Jj14Q2LJ8l7J15j06l9K7P3l9R2j49J43Q8
$$ 227 161 169 167 271 160 129 168 164 85 37 104 72 68 77 66 110 302 148 149 35 117 120 138 101 216 110 71 98 171 132 224 75 218 306
2246C06j80q8O2m1J6l2J89k1p3Np3O1n8k1N3j7j2Q0P9j07K9l9k7J1p1Q9k9J2j6N7P1j15L4
$$ 306 126 38 100 59 75 43 232 211 138 143 70 131 73 52 105 88 76 156 235 128 157 118 91 102 31 120 91 103 87 144 215 100 134
1936A34J1m1pJ4J04J2j28NJ75j86k6%J38j24n9J52M5M6n0j80j3N9j0J85Po6m0LO2%M7j44K6
$$ 134 145 104 97 111 215 227 99 104 279 93 67 67 205 81 22 174 219 265 215 35 22 81 71 256 263 197 157 160 222 222 269 125 151
1626A51o6J55j54m5R3r9K00o1O0m9n8l0K1K2J4J51m1j55Q3j43J13o3O5N6q7r5K17j59R5N9
$$ 151 85 240 86 41 134 35 235 174 234 185 127 97 118 140 154 305 264 109 192 49 162 99 164 220 133 38 255 96 191 250
1345B50j81Q0J28r5m4j4k6J43m8j17J25j01J63j66J08O4o6j16J15M0k1j08J36NM3q3P7p0n7
$$ 250 69 149 277 182 138 124 98 241 193 76 201 100 263 97 205 269 203 87 202 242 221 113 249 254 297 214 291 221 164
1072A64o0J22M4j01PJ10K82k78J26QL8p6n2j03j05J86J18p0M2lj35J32J26j15P0Q4J02K05
$$ 164 104 226 270 169 176 286 568 290 416 424 462 386 334 231 126 312 430 360 402 399 264 396 522 407 477 561 663 868
810H68j60K20K29j74L45K98M58N33J279L970J2866p928q153j757q14n08k14l57l1O6J7j01
$$ 868 708 928 1157 983 1328 1626 2084 2617 3896 7866 20732 12804 4651 2894 2080 1572 1358 1001 970 1036 1053 952
603I52j34R8K9l58j86J55J03k16l8j85J87j3rj32qO9KM4J00j43Q5Nr6kj27K15m1m1o0n8J34
$$ 952 818 916 945 587 401 556 659 443 405 220 407 394 385 253 245 314 316 360 460 317 402 407 311 309 182 397 356 315 255 197 331
312C31j21q3J53Lm5m9N8j0j91J66lP9j43k6J45q2O4j52MJ76m7O6j22ol9l0O2L7m7j04K10j18
$$ 331 210 127 280 283 238 189 247 237 46 212 209 288 145 119 264 182 246 94 98 274 227 293 171 165 126 96 158 195 148 44 254 136
11A36L98j97q1R8j80j33Q7J19M8N2j87M7P2Q6j43m7m3J01l7L8K2k05O7oR3P0r7J01j41p5J12
$$ 136 534 337 256 354 174 41 128 247 295 347 160 207 279 365 222 175 132 233 196 234 256 51 118 112 205 275 178 279 138 63 175
-280A75K3oL2q2M3k9o0K6JJ2j03L9
$$ 175 198 192 224 142 185 156 96 122 123 135 32 71
-392G1
##PAGE=	F1=-14409.2
##FIRST=	19140.455529915001534,	4405.895418600002813,	0
##DATA TABLE=	(F2++(Y..Y)), PROFILE
4406E9M5nM5q7Qk6KM0k0J7J10N2k1M9j60O4o4j8l3J65q1J7J0j28J02L2k0r6pO3jj9k9l0J06
$$ 59 104 99 144 57 65 39 41 81 61 78 188 240 219 268 108 172 108 90 57 222 141 158 168 40 142 174 154 58 51 114 113 94 65 35 141
4077A41j24Q6p6Q1J08j28lP7L8j14M5n6J14M9j89J06L6j47Q0oR3q2M2p9J1MPK2p2J00K0J23
$$ 141 17 103 27 108 216 88 85 162 200 86 131 75 189 238 49 155 191 44 124 118 211 129 171 92 103 107 114 136 64 164 184 307
3777C07j77J22p8Q7j02j5J42o4j40l5rJ76J11k96J86r9l0J0J8P0o0M0M1j77Q9M8n2o8L5oM8
$$ 307 130 252 174 261 159 144 286 222 82 47 38 214 325 29 215 116 86 96 114 184 124 164 205 28 117 165 113 45 80 74 122
3486A22j2n4k9L9N3l8J8M6n4o2L8JL8l1P3l2rK4k6k3O6o9J57j87R0j11J57l5J3k7K2j41P0
$$ 122 110 56 27 66 119 81 99 145 91 29 67 68 106 75 148 116 107 131 105 82 148 79 236 49 139 28 185 150 163 136 158 17 87
3176H7R7m3l6K7p3L4j9J3rR8l3J21j51K0NO8n8k8R8o8J2j4K0j02L5m4J07L9J3K6j85M9R4j70
$$ 87 184 141 105 132 59 93 74 87 78 176 143 264 113 133 138 206 148 120 218 150 162 148 168 66 101 57 164 203 216 242 57 106 200 30
2857C0K1Q9n2J47j02P9J50k83R4r5%m6J85N3q0j09n8J17j5m9J0n4J9j1Q9J69p1j42P5J98j07
$$ 30 51 140 88 235 133 212 362 79 173 78 78 32 217 270 190 81 23 140 125 76 86 32 51 40 129 298 227 85 160 358 251
2565B51q0j7J9Q9m5n7Kjj03LO9m9L7o5L4J7J82j17rj41M0L6N5k1N5r5rJ4M5k7R9j40J44O2
$$ 251 171 154 173 262 217 160 162 161 58 61 130 81 118 53 87 104 286 169 160 19 59 95 150 129 184 89 80 94 139 112 211 71 215 277
2246B77j89L1J1m9j6j9J89k4m4J1o5N5p4o4N6j7QO0N7n8O3m3m1j2j6K9l1j6M2J3J20j21Qj1
$$ 277 88 119 130 81 65 46 235 211 167 178 113 168 94 30 86 69 77 137 194 136 199 156 115 103 87 116 85 69 111 124 244 123 131 120
1927A20l7j3RJ20K0j07JJ50j90jK5J16j33n5J49M2J8m2j35k2M9K2J20L4k7j44M4J20oPj70
$$ 120 83 70 79 199 219 112 113 263 73 72 97 213 80 25 174 216 234 192 57 35 84 106 226 260 233 89 133 253 247 254 84
1636H4N5p1J22j71K5J41j21K07n1Qo2j1l7%NM2J33n8r8R6j57Q5m8N6M9r8p2J63j36J00K8r2
$$ 84 139 68 190 19 44 185 64 271 220 228 166 155 118 118 123 165 298 240 142 238 81 166 118 174 223 125 53 216 80 180 208 116
1335A16Q8J18j59Mn0LJ29p9o6J22q8J38j04N8O7q6j13J25K9rj19J15MJ9p2J41q9m1l9J52J2
$$ 116 204 322 163 167 117 120 249 170 104 226 138 276 172 230 297 211 98 223 252 243 124 239 243 262 190 331 242 201 162 314 326
1044C26q7l1Q7K96k51J03J6M1p3n3j23p8J62R4l5oO6j38J32J12p7Q4P9Q8K35j70K04K69j43
$$ 326 239 208 295 591 340 443 459 500 427 374 251 173 335 429 394 388 454 316 448 560 483 567 646 734 969 799 1003 1272 1129
772A129L65L16N12O23J447M541J4728q989r364k040q58n97k06m62n9L8N5j33j19M9o0l36j47
$$ 1129 1494 1810 2322 2945 4392 8933 23661 14672 5308 3268 2410 1813 1607 1145 1086 1124 1179 1046 927 976 916 580 433
556D33J59J24j95k3k38J58j5l1n2m8O8M3K8P8j94J38N7j40m4j18K80o8j02ml0R7j21p7J51
$$ 433 592 716 521 498 260 418 403 372 320 272 340 383 411 489 295 433 490 350 306 188 468 400 298 294 264 361 240 163 314
284C14r1Rk5K1K1k00J47jJ27j77J1J25q2Q0j81LJ55j6R5j47K2r9L4O1Jo1j09J84l9L74k56
$$ 314 223 232 207 228 249 49 196 195 322 145 156 281 199 279 98 101 256 240 335 188 210 111 145 206 207 146 37 221 182 556 300
-7C00o4J20k04j26N2J29Q9K3k09J35qJ12j25m0n3N5n0O3L3j23M3mN6O8j01Q2r3p7J09omN5
$$ 300 236 356 152 26 78 207 296 319 110 245 237 349 224 184 131 186 136 199 232 109 152 148 204 272 171 253 160 83 192 186 182 237
-308B37n0j0n5m1J8L4l2r6M5
$$ 237 187 177 122 81 99 133 101 5 50
-392E0
##PAGE=	F1=-14487.9
##FIRST=	19140.455529915001534,	4405.895418600002813,	0
##DATA TABLE=	(F2++(Y..Y)), PROFILE
4406E2M9j1L7q9L5l1j8J04j1j8J28J5j2qj39J11r2mk9J71j13P2Rj50Q9J7K0j51qO9K2k4j0
$$ 52 101 90 127 38 73 42 24 128 117 99 227 242 230 222 83 194 102 98 69 240 127 199 208 58 147 164 184 33 25 94 116 92 82
4096H2j7Q6j25Q7r5Q5J19r8mM9Pj13Q3n9Q4O9j98R0N8j21J13q5J02l6O7j32k2L1n1L7k9N4
$$ 82 65 151 26 113 18 103 222 124 120 169 176 63 146 87 171 240 42 132 190 69 182 97 199 163 230 98 76 107 56 93 64 118
3796A18Q8Q8j83J25p2Q4r2l8J93o3j17q5K7J63R4k88K08q6o2j6J9L7lO4J6j63L6P4k1o2n4
$$ 118 206 294 111 236 164 248 156 118 311 248 131 46 73 236 330 42 250 164 102 86 105 142 139 203 219 56 92 166 145 83 29
3504B9L8M3m4k5kK0Q5l2mL9o8k4M2n1N9o2P8n2K9J3o6P5M5r4J78j34M2j05J41q3L3J0J0j44
$$ 29 67 110 66 41 39 59 144 112 108 147 79 55 97 46 105 43 121 69 98 111 45 120 165 71 249 115 157 52 193 110 143 153 163 19
3185A9N8J19l2r2P8j10J18n0j8mJ09j8P3j51M3QO6p7K0Q6q7j7J3M3j26K7j6J04K1K7k9j47
$$ 19 77 196 164 72 150 40 158 108 90 86 195 177 250 99 142 150 216 139 159 245 158 141 154 197 71 98 82 186 207 234 205 58
2885E8N8J05k05O8K7nJ56q6J6J51k73J06q5J8p2J70O6r9j11J3K3%ol8J4K2m5L6K02o6j68P7
$$ 58 116 221 16 84 111 106 262 176 192 343 70 176 91 109 37 207 273 174 63 76 99 99 93 55 69 91 46 82 284 218 50 127
2584A27K04p3o5m8K9M5L5n9l7rj08L8N4n7Q9j09O2j6J63o8j6j46j2L0J07klr6K2QK0j5J02
$$ 127 331 258 193 145 174 219 254 195 158 149 41 79 133 76 165 56 118 102 265 197 181 35 23 53 160 158 155 59 81 89 109 94 196
2274A96j19J19M3j75J22j8n2o4PJ70k2k5J0l7J4p5o0L8l4M7L7J3jR5m1o0k2M1k5l8l9R6l3
$$ 196 77 196 239 64 186 168 116 52 59 229 207 182 192 155 169 94 34 72 38 85 122 135 134 229 188 128 106 147 122 84 45 141 108
1964A08J73j14l4n7j4k3J1J31K6q0jJ00j75L8M6P1j37pJ31L8k5n0n4n1M0M8O7L8Ok13O2J67
$$ 108 281 167 133 76 62 39 50 181 207 127 126 226 51 89 135 206 69 62 193 231 206 156 102 51 91 139 206 244 250 37 99 266
1664B66k0l1j63Q4p3O0p1N3J30j54K08m2k7p6L0m9j1j4P0Q8o0k9R5j46M7l4K0N3j12l1J01
$$ 266 246 215 52 136 63 123 52 105 235 81 289 247 220 144 174 125 114 100 170 258 198 169 264 118 165 131 151 204 92 61 162
1373A62r3Q0J6NO0R9k08N4r4O1R6j05jR1o8J06l4RN4j04p2J24Nkj13Q6Jkl9J76j05l2%J58
$$ 162 69 149 165 170 230 329 121 175 81 142 238 133 132 223 155 261 227 236 290 186 114 238 243 241 128 214 215 213 174 350 245 213 213 371
1054C71k6n4o0N4K71j94P8J3M1o0n0j40o2J41O8jm7J24j42J49P6l4P9Q3O3K47j73J69K82j11
$$ 371 345 291 231 285 556 362 440 453 494 434 384 244 182 323 391 390 343 467 325 474 550 516 595 678 741 988 815 984 1266 1155
772A155L42L23N34O33J502M672J5208r200r722k121q14o33j88n10q8J4R1j58r7Lj64k63r6
$$ 1155 1497 1820 2354 2987 4489 9161 24369 15169 5447 3326 2512 1879 1691 1181 1093 1107 1198 1040 943 946 782 519 423
556D23J49J49j65qk86J42l0m2K2o7N7P6NO3k33J77R7j69q9r2L20r5j46M7nP4j19p8J59j66
$$ 423 572 721 556 548 262 404 374 332 354 287 344 420 425 488 255 432 529 360 271 179 499 404 258 305 300 374 255 177 336 170
274A70L4J7m1N2j79J13J0J50j94N6P7p9R7j87K2R9L1J01j57L7j35J05M0kr0j07J32M9L28k87
$$ 170 204 221 180 232 53 166 176 326 132 188 265 186 283 96 118 217 248 349 192 229 94 199 239 237 147 40 172 221 549 262
-7B62n9J26k06q9QJ07J19Jk06J92p9J42j05j7p2J6m8Q5K5k1L5l5K7N3j08O2m4o5J01l5lP4
$$ 262 203 329 123 34 42 149 268 269 63 255 176 318 213 196 124 140 92 177 202 181 216 181 208 261 153 215 171 106 207 172 169 243
-308B43l0p1o7rM8J4o6k2k0
$$ 243 213 142 75 66 114 128 62 40 20
-392B0
##PAGE=	F1=-14566.7
##FIRST=	19140.455529915001534,	4405.895418600002813,	0
##DATA TABLE=	(F2++(Y..Y)), PROFILE
4406D9N1k2K4q1N4j8n1J56%m6J58n1Jn7q9J28j03Nk3J68j42J07K0j42N5k2P4j60l1O3M8j3
$$ 49 100 78 102 21 75 57 6 162 162 116 274 223 224 167 78 206 103 108 85 253 111 218 238 96 151 129 203 43 12 75 123 110
4105A10jl9P5j07P7n0L8J18o4j1L0k3j01J07n6N9O6j63L3P3p7J29j41R2K5Q4j71k8M6j22M9
$$ 110 109 70 145 38 115 65 103 221 157 146 176 153 52 159 103 162 228 65 98 171 94 223 82 174 199 283 112 84 130 8 57
3814E7JJ8J44P5k02J15n7P9q8n1K25o1p9r5K8J33O6k44K02p2p8m3J9L4N1N0j0j37pR1Kl8j01
$$ 57 58 76 220 295 93 208 151 230 142 91 316 255 176 81 109 242 308 64 266 194 116 73 92 126 177 227 217 80 73 164 166 128 27
3504B7M5O0p8lNJ0J02k7l4L8q6K7L6r6Q1q8Q5o4M7K3j03J37K2r3J81q0rq7J17j13L2N7Jj49
$$ 27 72 132 54 51 56 66 168 141 107 145 59 86 122 26 107 19 104 40 87 110 7 144 166 73 254 174 165 78 195 82 114 171 172 23
3185B3N3J21j1j30J09j27J81q1l8oJ04J1J6j35O1%O8j00P6O7r9n4K9Q2j34pJ8R8MK8q3oj5
$$ 23 76 197 186 56 165 38 219 138 100 94 198 209 225 90 151 151 219 119 195 262 163 109 138 220 86 79 97 195 199 227 144 138 123
2875A23J04j93R1J0j0J32n5l2J36k49J17p6K7p1J32O9j15j00Q1n6lK5o4R1J6q4j6K11m7j61
$$ 123 227 34 125 135 125 257 202 170 306 57 174 98 125 54 186 255 140 40 121 65 62 87 23 114 130 46 30 241 194 33
2594C3Q2J80m6k5q7M9l6J11m2n7l5r3N7K6n3J31j03N3m0J37k0k3j22K8r6J59J2n3j00N0J2
$$ 33 115 295 249 224 137 186 150 261 219 162 127 34 91 117 64 195 92 145 105 242 222 199 77 105 9 168 180 127 27 77 89
2303H9rPR6r9Q0L0j31J62k7m7j13K6J53k3j3kjm2l9l8Qk4O7K5k5J8J19l8q1j8Q4o2n4nR3m8
$$ 89 80 87 183 84 164 194 63 225 198 151 38 64 217 194 181 179 178 136 97 59 67 43 110 135 110 128 247 209 128 110 194 132 78 73 166 118
1964A18J89j11p2n4Nn5PJ34L2n4qM1j40Q7N3K1j37M4J17L3o6o9K9o9K3N8L6K2K7j90J2J97
$$ 118 307 196 124 70 75 20 27 161 193 139 131 172 32 119 172 193 56 100 217 250 184 115 144 75 98 156 192 214 241 51 63 260
1664B60m0n6j09P9m6l6N3N9J18k03K08l2m7r0O4o1j1k9Q8K1m4L8Q1j12Nj4l3P1j35NN0l7L7
$$ 260 220 164 55 134 88 52 105 164 282 79 287 255 208 118 182 121 110 81 169 190 146 184 265 153 158 144 111 182 47 52 102 65 102
1354A02L7O7K4O8k27Q6j25J28M9j20O1M4m7P4L4l6K7j15jJ08j8rq7O1oj8QJ75j16k8L6J49
$$ 102 139 206 230 298 71 157 32 160 209 89 150 194 147 221 255 219 246 131 130 238 220 211 124 185 179 161 169 344 228 200 236 385
1054C85o7%p9J0K17j16N7kM1l8l7j48o7J10N6K6p6J60j43J69L8NN5R0L6K33j63J19K67p8K75
$$ 385 318 318 239 249 466 350 407 405 446 408 371 223 156 266 322 348 272 432 289 458 496 501 556 646 682 915 752 871 1138 1060 1335
763A335L05N27N62J429M337J4184q505r139j985o93n99j67m95j13qJ20j66p3l1k58j47m3J16
$$ 1335 1640 2167 2729 4158 8495 22679 14174 5035 3050 2357 1758 1591 1096 983 975 1095 929 856 825 567 420 377 493
547D93J73j30J1l23J37n2k7O8o3L2J03k5N4k47J94J21j79j30n4L29j15j69Q7J0O3j08r1J64
$$ 493 666 536 547 224 361 309 282 350 287 319 422 397 451 204 398 519 340 210 156 485 370 201 288 298 361 253 162 326
284C26j84J6P3j20P6j31O7L4J44j93J02Rp4J16j72L3M0R1Q1j49L8j37J56jK9j13q6M5J31K67
$$ 326 142 158 231 111 187 56 123 157 301 108 210 219 145 261 89 122 162 253 334 185 223 86 242 241 270 157 71 116 247 514
2E14k82p1J17j89l7J8K9J16jj43J67j38J82q8Pr1K2l3P5oP5M5q6QM1j28M9ql5Q7n8nR1l3j20
$$ 514 232 161 278 89 52 70 99 215 214 71 238 100 282 194 201 110 132 99 174 168 243 288 202 210 251 123 172 164 129 216 158 153 244 211 91
-327I1n8K6R2m2q8M7n0
$$ 91 33 59 151 109 21 68 18
-392A8
##PAGE=	F1=-14645.5
##FIRST=	19140.455529915001534,	4405.895418600002813,	0
##DATA TABLE=	(F2++(Y..Y)), PROFILE
4406D8N1k4No4O2%n5J53J0n9J94j25Mq8j7J09q7oKJ54j61J10L7j22J8n1J21j53k1J9P5Nrq4
$$ 48 99 75 80 16 78 78 23 176 186 127 321 196 200 112 95 204 117 111 113 267 106 216 253 131 149 98 219 66 45 64 139 144 135 51
4087E1Q6p6N4J2KP7j9j3J3n4r3J33n3N3L1j04j8N7k0J26j67O7Q9Q6j90LL4j06J3l2PJ75Q1
$$ 51 137 61 115 127 129 206 187 174 187 133 40 173 120 173 204 100 82 139 119 245 78 145 234 320 130 133 167 61 74 42 49 224 305
3777C05k22R3m0Q5r8m6K27o1l7q4J7R1L7j83J77o2p9o9L0O3P7J8l9j07l7R7K8mr7J4J00r1
$$ 305 83 176 136 221 123 77 304 243 206 122 139 230 267 84 261 199 120 51 81 144 221 239 200 93 56 153 181 177 80 94 194 103
3476A03k2j2J5J05k7o1L6j01Q1J9j23J04q3O0l8K9L6p6J07lo2J61l1n1o1R2j20lJ05Oj46M3
$$ 103 81 69 84 189 162 101 137 36 117 136 13 117 34 94 56 85 121 45 152 149 87 248 217 166 105 197 77 74 179 185 39 82
3176H2R8K5j48J04q9J93j03m4k0R1M3m2q4N5k1P2j17J20M4r6p1J4J24j25n6N1Q5kK4j32J17
$$ 82 180 205 57 161 72 265 162 118 98 189 232 190 106 161 140 212 95 215 259 163 92 106 230 105 49 100 185 183 207 75 192
2885A92q0J06j70J06K7m9Q5j3n2J09k18J25p2L6p3J04P5j46p9J40j08k2L6l4J35Kj20QJ37
$$ 192 112 218 48 154 181 132 217 204 152 261 43 168 96 132 59 163 238 92 13 153 45 23 59 25 160 162 42 50 187
2612A87j5j34P2J44k6K2j21R1j33J52k0m4p5p1P0Jm9J52p0L1n2J08J8l4p9N7j36J27K1r7q2
$$ 187 172 38 110 254 228 250 129 220 87 239 219 175 100 29 99 100 51 203 133 164 112 220 238 204 125 182 46 173 194 97 15
2321A5N9J8l5M2P9q8L6K0o6J47j7l3j44K5J44k7j0k4L4p4K8m6j0K6N1J7j7k5J27l7r4oJ09
$$ 15 74 92 57 99 178 90 126 146 80 227 210 177 33 58 202 175 165 141 175 101 129 83 73 99 150 167 150 125 252 215 121 115 224
2011B24q1q1O6N7l3J62j16r5K5j7o9l2J31L7l2j7k1p9J22M4j8j31Q2J03L1r4q8Q5o1PM1K2
$$ 224 143 62 128 185 152 314 198 103 128 111 42 10 141 178 146 129 108 29 151 195 177 46 128 231 262 168 80 165 104 111 152 174
1711A74%L4j30m9K07o1o4m1N6%q3R7P0J11k51K01j9n6j00Q3o2pl2Q5m7k3R0O1o4l5J3p1Q6
$$ 174 174 208 78 29 236 175 111 70 126 126 43 140 210 321 70 271 252 196 96 179 117 110 78 163 116 93 183 244 180 145 158 87 173
1401A73j23JlJ4kQ3Q0pL7j90N5m2R4oj22J10Kl4M5R2p3qj20Q5Q1k9l6l9M5j5l0N0J46j20k0
$$ 173 50 51 48 62 60 143 223 216 253 63 118 76 170 164 42 152 154 120 165 257 184 176 56 141 222 193 157 118 163 148 118 168 314 194 174
1072A74M9J38j12P3q9l9J45l1M4k6M1j3j0j39r2N8O5M6r7J71j39J80J2L6J9R5J5J94j41O0
$$ 174 223 361 249 322 233 194 339 308 352 326 367 354 344 205 113 171 236 282 185 356 217 397 409 445 464 559 574 768 627 687
791F87K31m6J76K59M96M33J239L636J1937p080p778j682n25m96j44m27j29l4J36j53n5m0l25
$$ 687 918 872 1048 1307 1803 2236 3475 7111 19048 11968 4190 2508 1983 1487 1343 916 787 753 889 736 681 641 316
575C16%jN5J84r1L7l39J34p1J9O8l6oJ21n9N2k30J83J32j69j63j3L11j25j70J10J2O2q6j14
$$ 316 316 315 370 554 463 500 161 295 224 243 311 275 269 390 331 383 153 336 468 299 136 123 434 309 139 249 261 323 237 123
293A23J56j41l1J32j69N4o2J3O6J13j75J43p0o7J39j40J9mJ54L9j19K6j07J71n6Q3j20n9l4
$$ 123 279 138 107 239 70 124 62 75 141 254 79 222 152 85 224 84 103 99 253 292 173 199 92 263 207 290 170 111 77
21G7J77K04k41j04J03j61J2M3j5N3L7o5Q2j60K09p7K1j02P2l2N3n1J48O6j36j3M6j58M7LR
$$ 77 254 458 217 113 216 55 67 110 95 148 185 120 202 42 251 174 195 93 165 133 186 135 283 349 213 200 246 88 135 138 147
-270A47O8p0j5J01n1j11j8J5J18r7o7O8l6
$$ 147 215 145 130 231 180 69 51 66 184 87 20 88 52
-392E2
##PAGE=	F1=-14724.2
##FIRST=	19140.455529915001534,	4405.895418600002813,	0
##DATA TABLE=	(F2++(Y..Y)), PROFILE
4406D8N1j2j2n6O7J4n6J27J7n6K21j74j6r0M1P1m6l2M6J25j58Q1N0j00rl6J24j60klR6K8l6
$$ 48 99 87 75 19 86 100 44 171 188 132 353 179 163 73 114 185 139 107 153 278 120 201 251 151 142 106 230 70 68 65 161 189 153
4096A53j19J11n5L0O9LkK1%j6p8p7J44n2O7k1n2k8J2L0J03j55L6J38P3j88L9J3r2K0r6J7J69
$$ 153 34 145 90 120 189 192 190 211 211 195 117 40 184 132 199 178 126 98 110 140 243 88 124 262 335 147 186 199 107 127 31 48 217
3786B17R2k19N6k7J05j19l4K10o6kn7KM8J2j17J35n7o2r5O0R1Q2j2p3p7n5R1O3L2j03LJ35
$$ 217 309 90 146 119 224 105 71 281 215 213 156 158 206 218 101 236 179 117 22 82 173 255 243 170 93 38 129 192 224 121 124 259
3486B59j04l6m0K2J01l1p1K4r3J11pj05J01o1K6j4J2M0o4P2k4j8J33J0q0l0O7j01o6J41K4
$$ 259 155 119 79 101 202 171 100 124 31 142 135 30 131 70 96 82 94 134 70 142 118 100 233 243 163 133 200 99 33 174 198
3195A98j31K9N0P3j50P3l0J74j09l1m5P3O6q6rL0n5P5j09J25K1p3l9n3J57j06r2O9O6LL7j53
$$ 198 67 96 146 219 69 142 112 286 177 146 101 174 240 154 145 175 120 195 86 211 232 159 120 67 224 118 26 95 161 164 201 48
2894D8J56j24J19j45J05N6q9K8L3m3P6j88J33q0N2r0J04Q5k02j3J54j39k5J1M1J38j7j45O5
$$ 48 204 80 199 54 159 215 126 154 187 144 220 32 165 85 137 47 151 236 34 21 175 36 11 22 63 201 184 39 104
2622A04M9J7j28N2J08kN8j44J48j69J05nkj09o3Q9on5J41k2Qn5Q1M2n4j7O7j57R6K6j40l3
$$ 104 153 170 42 94 202 200 258 114 262 93 198 193 191 82 19 108 102 47 188 166 174 119 200 242 188 171 238 81 177 203 63 30
2321C0M5K3m6O9O2q6j0J2KR6Krj42LJ33l2j7m6O2l1N2p3j4P4L5lKo8J17l7r3PJ20q7j11J46
$$ 30 75 98 52 121 183 97 87 99 101 197 199 190 48 51 184 152 135 89 151 120 172 99 85 159 194 191 193 125 242 205 112 119 239 152 41 187
1983A87J2qJ10j23j04J13m8p5o0J18M0j3k0o8j9J28K8l7j17R6Q5L8j09r5R7k7NmJ6j3K9o2
$$ 187 199 191 301 178 74 187 139 64 4 122 162 149 129 61 42 170 198 161 44 140 225 263 154 59 156 129 134 130 146 133 162 100
1683A00r3J95q0n4LM0M8o0N4Q4J05k75J81lo0r2P1m6kk2O2o1l9J13L9j0o6L2o3O8o5j8p0L8
$$ 100 7 202 122 68 71 111 159 99 153 237 342 67 248 245 185 93 164 118 116 94 156 95 56 169 208 198 132 164 101 169 104 86 16 54
1364E4K5Q7N9k2K1j15k3O7K0o5p4J07Jm5J4J32r7l4q7J18M8k3o7J4L7j9m0O5J14j23LK7J32
$$ 54 79 166 225 203 224 109 86 153 173 108 34 141 142 97 111 243 146 112 25 143 191 168 101 115 152 133 93 158 272 149 152 179 311
1054C11j56J51q6q0O4M3M7n6L5RK9j10j15k3Q7O6j16J59j26J65J0N4k0R8J4J27j02%J81j2
$$ 311 155 306 220 140 204 247 294 238 273 282 311 201 86 63 150 216 100 259 133 298 308 362 342 440 454 581 479 479 660 648
772F48O6J81M52K86R66K767R066n279o000j311l56l42j24l22j35n7J19j14n0k0l60J62K0l5
$$ 648 714 895 1347 1633 2599 5366 14432 9153 3153 1842 1486 1144 1020 698 563 506 625 511 461 441 81 243 263 228
547B28J75m9O9l15J12o7Q2J6Mn1J28q5N1j88J49J29j41j79K0K74j22j56J13OO2m5j49J32o8
$$ 228 403 354 423 108 220 153 235 251 255 204 332 247 298 110 259 388 247 68 88 362 240 84 197 203 265 220 71 203 135
274A35o5J75j13o3Mm4R8P0j49J76j39m2J41j02j5l3K14j4p2Rp3J63j16J42j13l0o4J63J52
$$ 135 70 245 132 69 73 29 127 197 48 224 85 43 184 82 67 34 248 234 162 171 98 261 145 287 174 144 80 243 395
2C95j85j48J00j21L5O2j4m2J12l0ko2J28o6J7j00J22m2M3r6J87R0j66l7O4j85N8k5O2M9p7
$$ 395 210 62 162 41 76 138 124 82 194 164 162 100 228 162 179 79 201 159 202 106 293 383 217 180 244 59 117 92 154 203 126
-289A26k8R8o7j6j9j7J22j16l0M7j9
$$ 126 98 196 129 113 94 77 199 83 53 100 81
-392H1
##PAGE=	F1=-14803
##FIRST=	19140.455529915001534,	4405.895418600002813,	0
##DATA TABLE=	(F2++(Y..Y)), PROFILE
4406E0M9Nj6p1P8K0n3R3K0m4K28j83n5n5N9K7Ro1R5Q3j42M7N3q6j9JR8j84K7LJ10N1p8r3J04
$$ 50 99 104 88 17 95 115 62 155 175 131 359 176 121 66 125 152 161 100 195 278 136 183 236 150 131 132 230 46 73 76 186 237 159 66 170
4077A70n8K2J07K4p8L9J9n8q4l5J20n4Q7n2m0j1j2M9O0j04QJ63M7j70O3pp7M0j19QJ34R6j89
$$ 170 112 134 241 265 187 226 245 187 103 68 188 134 221 169 129 118 106 155 215 111 119 282 329 159 222 215 138 178 59 67 201 297 108
3767A08Pj6J26j26m1J95p6K1k3qJ3nn7Q4o0l1r5Q2R3Q2l1j09m3o3O3J10N9j17PJ52j09l3o8
$$ 108 115 99 225 99 58 253 177 198 175 167 180 175 118 202 142 111 16 98 191 273 242 133 90 27 90 200 259 142 149 301 192 159 91
3458I1J7R7l6n5Jm9Q9l3o1Q7m1J2j1NK7n7L4m0L1J09M0j00LM0o2q4J02N2j11K0j4J24j26K8
$$ 91 108 205 169 114 115 66 155 122 61 148 107 119 108 113 140 83 117 77 108 217 257 157 160 200 138 54 156 208 97 117 103 227 101 129
3138A29J3J36r5%p2M9P1j04O0Mr3O8o1P8Ml1J2j19J50p6q2M7N1RQ1j38Q2j33J34j05P3Q1j10
$$ 129 142 278 183 183 111 160 231 127 187 191 98 166 105 183 187 156 168 49 199 123 41 88 139 148 229 91 173 40 174 69 142 223 113
2828A13pP0k1M0j69J42r9P5j17J22R8k19L0J27j58J3NN3J30l6j51J07J8J9j43J9P5L0P7j59
$$ 113 106 176 155 195 26 168 69 144 27 149 247 28 58 185 27 40 45 98 228 192 41 148 166 185 42 61 136 166 243 84
2547H4K11j61K6rM6j10q4J16Oo9J03K5j0n1N6N8q2N3N8j72Q8K7j80J3L8K8l7O9N9q6o1OO0
$$ 84 295 134 160 151 197 87 3 119 125 56 159 184 174 123 179 237 155 208 266 94 182 209 29 42 80 108 71 140 199 113 52 58 118
2237A18L5J2K4j17qR6l0l6n8P7O0K8r3j1J13K2m0J4q8R6l2p4J2J24q7j13J96l1J3N4j31r5
$$ 118 153 165 189 72 64 160 130 94 36 113 173 201 108 97 210 232 192 206 118 214 182 108 120 244 157 44 240 209 222 276 145 50
1936E0J72p6p6o3R8L8Nrn9k7J14Ql6q7Q1O7N6j11q8O3K4J5o0J0KK6pj03J38r6k6J5L4Q4l7
$$ 50 222 146 70 7 105 143 148 139 80 53 167 175 139 52 133 200 256 145 57 120 144 159 99 109 111 137 130 27 165 69 43 58 92 176 139
1608A39NR7R5k66J52J4o1o0K3k1Rj4M0rq9R4J5M5p8K3k5K1mj7j02K4P9O3K4k0K7p2n6J20m9
$$ 139 144 241 336 70 222 236 175 115 138 117 126 112 152 143 54 148 163 208 130 153 128 149 145 128 26 50 129 192 216 196 223 151 95 215 166
1279A66j18M0L8M5o7j9J35r3j3j5L1J8mn9L1L1j2n0N3R0j22L9l3J40j97K21p4r4j5Q7P1p6
$$ 166 48 88 126 171 104 85 220 127 114 99 130 148 144 85 116 147 135 85 138 228 106 145 112 252 55 276 202 108 93 180 251 175
979A75NK2P1p4j06n4M3R4j44J42q6R0L2O8o1R7M9L5m8m8J25L2k4O4M02J81O49J966O333l541
$$ 175 180 202 273 199 93 39 82 176 32 174 88 178 210 278 217 314 363 398 350 302 427 459 435 499 901 1082 1731 3697 10030 6489
697F489m259r88k43j74j02k08j37l7K5m7n9K2j70J06K2j35J37j1J00k23M8j5J07o5N4j00J26
$$ 6489 2230 1242 999 825 723 515 378 341 366 319 260 282 112 218 240 105 242 231 331 108 156 141 248 183 237 137 263
443B63r6M4j27J00J11j02j55K2K29j09j34R9MN2J4j90R0Po1J85l5j34J2q1J03L3j24J94j40
$$ 263 167 211 84 184 295 193 38 60 289 180 46 145 149 201 215 25 115 122 61 246 211 77 89 8 111 144 20 214 74
171G4J4O5o9m4QJ91o8j4qo0J51j72J89r8Mo0J14J13j34j75J16p5J7P2or7J69k7n9M1M3n3l
$$ 74 88 153 84 40 48 239 171 157 149 89 240 68 257 159 163 103 217 330 196 21 137 62 79 151 145 48 217 190 131 172 215 162 159
-139A59q1J42n3M4j28J90J11j69n8Q4j92P5q9J12L4p8m3P8m7P3l4m3J05q5k8K6k
$$ 159 78 220 167 211 83 273 384 215 157 241 49 124 35 147 181 103 60 138 91 164 130 87 192 107 79 105 103
-392A03
##PAGE=	F1=-14881.7
##FIRST=	19140.455529915001534,	4405.895418600002813,	0
##DATA TABLE=	(F2++(Y..Y)), PROFILE
4406D9M6J8pr4Q7K3m4O2J4l0K09j53q9j0M4j2O3o6J20L2j25L3L8p8j1K2P7k08N4L1J12P1j26
$$ 49 95 113 106 12 99 122 78 140 154 124 333 180 91 81 125 113 176 110 230 262 137 170 208 130 119 141 218 10 64 95 207 278 152
4096A52m1Q2p5L2J20M9j27L5L7j06p1J8P4n7J03l6q3J9NL0J0k7j0J59J3j41P0k0o3O4j11q
$$ 152 111 193 118 150 270 319 192 227 264 158 87 105 179 122 225 189 106 125 130 160 170 143 133 292 305 164 234 214 151 215 104 96
3796I6Q3Q5j35m6nJ33j00q3J94q6K8J2j5%j0j9L6p7J6o2P4P1P8l2j43Nn4jJ60P4j33J8J49
$$ 96 179 264 129 83 78 211 111 28 222 136 164 176 161 161 151 132 168 91 107 45 119 190 268 236 93 98 44 43 203 277 144 162 311
3486C11j04j3q6JQ8l8k1j9rM8n8oO7k6K1j7k%n1j1m3Q6Q6O1j15L0J0ro8J9P6q7K3p9J63p8
$$ 311 207 194 108 109 197 159 138 119 110 158 100 94 161 135 156 139 137 137 86 75 32 118 204 265 150 180 190 181 113 132 208 121 144 65 228 150
3148A50oJ0R1o6M2q8J5N6q9J08k1j20M6P%OK0M7j34Q5l6o4K6M8LJ36j45j3n7R6m9QR5j10K0
$$ 150 144 154 245 179 221 133 148 204 115 223 202 82 128 135 135 141 161 208 74 159 123 59 85 133 136 272 127 114 57 153 104 112 207 97 117
2819A17Q1rjj62J49j16R2j15J13J04j66J1Q2j58M5K4K9J15n1j40J33L1j2j41l8M0O8Q9j76
$$ 117 198 189 188 26 175 59 151 36 149 253 87 98 180 22 67 91 120 235 184 44 177 208 196 55 17 57 125 214 38
2547C8K67j54kl7P2p8q4J05L0q3N0O3j8m5K7P8j08J10L9j84J01K7j74J5L2L3j9M7P0p5j18
$$ 38 305 151 149 112 184 106 22 127 157 74 124 187 169 124 151 229 121 231 270 86 187 214 40 55 87 120 101 148 218 143 25
2256B5JR4Oj1O2p9lL1j2o9l2O0J43rr8j0J43J2q9K1q3O3j8m1J3J23q8q0K05o5K2J4j39p3J89
$$ 25 26 120 126 115 177 98 95 126 114 45 13 73 216 207 109 99 242 254 165 186 103 166 148 107 120 243 155 75 280 215 237 251 112 39 228
1927B28r5p0n8Q7K8K5J1l6o7Q8rk3m3M2N3Q4j02p5OP0L2j05lN8L7%j17Q6j10J8J2L1R1j9l6
$$ 228 133 63 5 92 120 145 156 120 53 141 132 109 66 108 161 245 143 68 74 144 176 71 68 126 163 163 46 132 22 40 52 83 174 155 119
1598A19J00Q0k33J24L3n9k3l6jL1j4L0L7j24N9kR0o4k9K9m2N5nj22K5J13M1qk0L8n1n0J24
$$ 119 219 299 66 190 223 164 141 105 104 135 121 151 188 64 123 121 211 147 118 147 105 160 155 33 58 171 212 204 184 222 171 121 245
1288B45r5j19J17k5Q3p5l4J01o8L3j3m9jJ2LMK5Jo3K8P4j11P4r6J42j63K08n8p9n2P2J06o6
$$ 245 150 31 148 123 206 131 97 198 130 163 150 101 100 112 115 119 144 145 82 110 184 73 147 51 193 30 238 180 101 49 121 227 161
979A61o0K2J00m3p7nn8J32j30J03k2o0O7R4j02Q1J23o5K0p5P0Q6m3r5L31J82L36J417M434
$$ 161 101 123 223 180 103 98 40 172 42 145 123 63 130 224 122 203 326 261 281 206 276 362 319 224 555 737 1073 2490 6924
706F924k286k962p82k22o2p1j19j38O0j42K4l9K2K1mJ5j49J6J2J26j07j7N8Q9j47J11j45J17
$$ 6924 4638 1676 894 672 610 539 420 282 342 200 224 185 207 228 224 239 90 106 118 244 137 120 178 267 120 231 86 203
443B03q5K2o3O4O2o0q7j1J80q7j12Q3J2K4P7j83J3N1l6J69K8j42j4p5N9J7q3J63p3L2on3l2
$$ 203 118 140 77 141 203 143 56 45 225 138 26 109 121 145 222 39 52 103 67 236 264 122 108 33 92 109 26 189 116 148 142 89 57
133E7N4J21j20M6k1p7J54k06J97q0M1m4N9P8r3j28J06n3qP1j2p5J61l0q9J11j3l5l1m7J19
$$ 57 111 232 112 158 137 60 214 8 205 125 166 122 181 259 166 38 144 91 83 154 142 67 228 198 109 220 207 172 141 94 213
-158B13n3N0j44J65J19j45p1R9j75Q6j07R1K6p2n9M1M8Q4m2n2P0k8m7PJ1
$$ 213 160 210 66 231 350 205 134 233 58 144 37 128 154 82 23 64 112 196 154 102 172 144 97 104 115
-392A15
##PAGE=	F1=-14960.5
##FIRST=	19140.455529915001534,	4405.895418600002813,	0
##DATA TABLE=	(F2++(Y..Y)), PROFILE
4406D7M1J8J3r7P2L0k8L7jk1J68r7p7j1K1l2J01m3J12j5j21L8J7p8J6J7P6j31j8O7R6Q7j67
$$ 47 88 106 119 22 94 124 96 133 132 111 279 182 105 94 115 83 184 141 253 238 117 155 172 94 110 127 203 72 54 121 217 304 137
4096A37NN4r4N6J10O9j50K8M3j51m1P1J9n9J06K0j55N3L7nj9M5j8J30k3j11O3j9n6R0q6k4
$$ 137 142 196 102 158 268 337 187 215 258 107 66 137 156 97 203 223 68 121 158 153 134 179 161 291 268 157 220 201 145 235 149 125
3796A25K7O4o6q4j0J24m2j19J68q8K4L7j9OMj2Nj10P4m3O7L6O6j4j59M9m4n0J82Q3j45K6J28
$$ 125 152 216 150 66 56 180 138 19 187 99 123 160 141 147 151 139 144 34 108 65 132 168 234 220 61 110 66 16 198 281 136 162 290
3486B90q5J5r3lO5m1J4k5J4Np8M7M3k3M5j5j2l9m7m9j8J23O1P3j26M7k6N7m6o2Q6o4L7j06
$$ 290 205 220 127 124 189 148 162 137 151 156 78 125 168 145 190 175 163 124 77 28 10 133 194 267 141 188 162 219 173 111 197 133 170 64
3166F4J58k3k8k4N0l2Q9r5k4L0m8J29m6j27J0P1p4N2M3N1j19J2Ln8K9M5j3J79j64o3L8K7R
$$ 64 222 199 171 147 197 165 254 159 135 165 117 246 200 73 83 154 80 132 175 226 107 119 122 64 93 138 125 304 140 77 115 142 151
2857A51n2Q0r3O9Q9qm2j58J42j09Q9q9P6J00j08%K0j20N8L2%R1o1j11J42O0n9j05m7j3N4J14
$$ 151 99 179 86 155 244 236 194 36 178 69 158 69 145 245 137 137 157 37 95 127 127 218 157 46 188 248 189 84 37 24 78 192
2556A92j75K70j50K5n9M5k6p6Q4N9r4KQ2j7m2oJ09j16J32J7j95J34K2j35j2K2L9JJ2R1n6j59
$$ 192 17 287 137 162 103 148 122 46 130 189 95 97 179 162 120 114 223 107 239 256 61 195 217 82 70 92 131 132 144 235 179 20
2256B0kQ4L9o9Q5l1Mm6K4r8M4j5J94l9q8j7J62Mj41L6m9J4pnJ6J18q9m0J94q9K0kj42n1J69
$$ 20 18 102 141 72 157 126 130 84 108 10 54 39 233 194 106 89 251 255 114 150 101 115 108 103 119 237 148 108 302 213 233 231 89 38 207
1927B07r5n4m3P2ON1K8k6j02N1j9mNoM7J16q3o3mM9M4j13l6J35M9k7j22M0q2K8K5J7O5qo2
$$ 207 112 58 15 87 93 144 172 146 44 95 76 72 77 71 118 234 151 88 84 133 177 64 28 163 212 185 63 103 21 49 74 91 156 148 86
1598H6R0N8j71R0N1n8J0p6mO0j7K8N8j39L5mJ10l4j04R3j22J06J3j30M3J25K6l3l1L9k9m6
$$ 86 176 234 63 153 204 146 156 80 76 136 119 147 205 66 101 97 207 173 69 162 40 146 159 29 72 197 223 190 159 198 169 123
1298A23J15j09m6J23o9Q6p2l3O0m5O6k5j15mJ5P5k1J6J6q1RN0q5R8p2O6n4J12m0n5l5J9J20
$$ 123 238 129 83 206 137 223 151 118 178 133 199 174 59 55 70 145 124 140 156 75 84 134 49 147 75 141 87 199 159 104 69 88 208
988B08l6j24QJ03k4l5J4r1J61j07Q8Oj01NJ46j09MK10j35Q3r2L8J21nj29J44K73J49J108L567
$$ 208 172 48 56 159 135 100 114 23 184 77 165 171 70 75 221 112 116 326 191 274 182 220 341 336 207 351 624 773 1881 5448
706E448j708k264o63k24q3k8p6j55J56j89QK6l8P4n1Nq8p8l7J37j8m6J03O8k05J63j75J07
$$ 5448 3740 1476 813 589 506 478 402 247 403 214 222 248 210 284 233 238 150 72 35 172 154 108 211 279 74 237 62 169
443A69n6j0j8O2k4k6k9k5J27o6q8Q3J6lJ17j61MJ5j6J41O6j23k7p7J8L0m4R9jL9m3n6j2Q5
$$ 169 113 103 85 147 123 97 68 43 170 104 16 99 115 112 229 68 72 87 71 212 278 155 128 51 69 99 55 154 153 192 149 93 81 166
124A66O6j70R9l0r9J66j31P6o0P7k4PL9o1n3R3m6j2M7l4l3J32k7j04J53m1qn5j2O3m4N4j39
$$ 166 232 62 161 131 32 198 67 143 83 160 136 143 182 121 68 161 115 103 150 116 83 215 188 84 237 196 188 133 121 184 140 194 55
-186E5J20J14j00p6J08j50R1p0J0K2n5o6QJ51L9l5l6K0K7o8rK1
$$ 55 175 289 189 113 221 71 162 92 102 124 69 3 11 162 201 166 130 150 177 109 100 121
-392A21
##PAGE=	F1=-15039.2
##FIRST=	19140.455529915001534,	4405.895418600002813,	0
##DATA TABLE=	(F2++(Y..Y)), PROFILE
4406D9L2%M5p9L2N0j6J7k3j0J09k9k3n1%k5J05kP6l9j35N1Kq7N9j1J04o1q7J01N9R5j89L4
$$ 49 81 81 126 47 79 129 113 130 107 97 206 177 154 103 103 78 183 181 257 218 83 134 136 49 108 97 201 140 53 154 213 308 119 153
4087A53K3j12Q4Q7Q3j55K8L3j74qJ13l7n5R4R3j93O4N4l7J1O1j7Q5n2r1M9kn6J10m8m0k4L8
$$ 153 176 64 148 235 318 163 191 224 50 42 155 118 63 157 250 57 121 175 138 149 210 193 278 226 135 184 182 126 236 188 148 124 162
3777A62Rp8n5R9K9r9Q5q4J8M6k5K1M0l4mr1P3m1O2nM5K2j54O8l0k1J27R4j48K7R1o0M8r1K1
$$ 162 171 93 38 137 166 67 152 68 86 132 107 128 168 134 130 39 112 71 133 128 173 195 41 109 79 58 185 279 131 158 249 189 237 146 167
3448A67K4m6L5k2K3k4r7R1J2k6P5%k1q8m7Rj9J06K4Q5j26M5o3J29k3j20P2m6N6r1J20J6m4
$$ 167 191 145 180 158 181 157 60 151 163 137 212 212 191 103 56 65 46 152 176 261 135 180 117 246 223 103 175 129 185 94 214 230 186
3138A86n9K6j2J31r3o0MkJ33p1j23j7J11j22J31K9K9r1l1K0o1N3K8k5J95j76j2M4k3N5o9L1
$$ 186 127 153 141 272 179 119 123 121 254 183 60 43 154 32 163 192 221 130 99 119 58 111 139 114 309 133 121 165 142 197 128 159
2838A59p2R2J09pp9j53J20p3P3o6L3R3n4ln6n2N8K6k8O2o9o6J35R2j11m5l5J4o7J65j23J76
$$ 159 87 179 288 281 202 49 169 96 169 103 136 229 175 172 116 64 122 148 120 182 113 47 182 274 163 118 83 97 30 195 72 248
2537B48j40O6n6k0K8n9O0Q7j00k9Q4qm7m1J43j06J26Jk03J71J1r7l8J0M6K6l0J12l4j67j1
$$ 248 108 174 118 98 126 67 127 214 114 85 169 161 114 73 216 110 236 237 34 205 216 119 81 91 137 163 133 245 211 44 33
2246C3M0J08q5L6K4Nj04N7n4K7p0K08m9p4l6J73lj84O4J9j6m5J8K6J07q9oJ71r8QKj38l8J32
$$ 33 73 181 96 132 156 161 57 114 60 87 17 225 176 102 66 239 236 52 116 135 119 74 92 118 225 136 130 301 203 211 213 75 37 169
1927A69o6k0m7N5k7Q3L5l1j15MqJ6L3m0M2J42n8n9L7l0M4p2p6J87N3o5j05lj7KM6LJ9qp1O8
$$ 169 103 83 36 91 64 147 182 151 36 40 32 48 81 41 83 225 167 108 145 115 159 87 11 198 251 186 81 78 61 63 109 112 131 123 52 120
1589A20M0p2K8O5n7K7o3m0P7qK0N3j32K4K2R5lj59J43j45P5L3j22N9J24K0n0m9J8Pn9J03q6
$$ 120 160 88 116 181 124 151 88 48 125 117 137 190 58 82 104 199 196 37 180 35 110 143 21 80 204 224 174 125 143 150 91 194 108
1279A08K3J23r3N2o0k2L0m3R0l2j36nj4J38k8LK7r7ROn5J19j2k1%N2j4l1k7J6P9j2j27l0O9
$$ 108 131 254 161 213 153 131 161 118 208 176 40 35 21 159 131 134 161 64 73 79 24 143 131 110 110 162 148 117 90 106 185 173 46 16 85
950H5j8J9No0J60r0P9K1n9r7K05q8j04K75j57J19j26L7J29K2q2k2L26J56Q84L189j523j914
$$ 85 67 86 91 31 191 101 180 201 142 45 250 162 58 333 176 295 169 206 335 357 275 253 579 735 1619 4808 3285 1371
687A371n77j73j70Nn4j87K11j42n0P5p1O0o2j2l7o7r0R2L3n6J22O0k13J78j91J11l2k1pP2
$$ 1371 794 621 451 456 402 215 426 284 234 309 238 298 236 224 187 120 30 122 155 99 221 281 68 246 55 166 134 113 106 178
406A78r5k1J0k1O2m6l2P3%NJ08j37K0j9j4J02P7q6j9p5k0N7k5M4N5L4n4o5pJ15L7k16J37l2
$$ 178 83 62 72 51 113 67 35 108 108 113 221 84 104 85 71 173 250 164 145 70 50 107 82 126 181 215 161 96 89 204 241 25 162 130
86A30o2J35r9j9k6R3jl8Qn4K1Q5m2J0Jo6PR6j3j18J82n3K3o3J4j4k2M6j14O8R6m4p7J19j25
$$ 130 68 203 104 85 59 152 151 113 121 67 88 173 131 141 142 76 83 179 166 48 230 177 200 137 151 137 115 161 47 115 211 167 90 209 84
-242H4Q9l7n7J6l1n3O1J31k2j5lk1N7q7k0L2
$$ 84 173 136 79 95 64 11 72 203 181 166 163 142 199 112 92 124
-392A24
##PAGE=	F1=-15118
##FIRST=	19140.455529915001534,	4405.895418600002813,	0
##DATA TABLE=	(F2++(Y..Y)), PROFILE
4406E9K5m1Q3m7j3P8j8mm4J0L7M1M4r8j8KP9L9L0k8j57N2jr9R8l6J41k1j40J37OR4j82M2r
$$ 59 84 43 126 79 66 144 126 122 78 88 125 166 210 112 94 96 175 214 244 216 59 111 110 11 109 73 214 193 53 190 196 290 108 150 141
4077A41j21R8O1R4j52M2Lj07l2J30q6l9O5J61j57K7M6n2Q4K3pL2p2q1L7K4o4J23rn5n8J9P7
$$ 141 20 118 179 273 121 163 166 59 27 157 71 32 97 258 101 128 174 122 206 229 222 254 182 101 138 162 98 221 212 157 99 118 195
3767A95n5j04N9R0p8J6p7K1L0k5L0Q4p2J3k6J5n4O8n7J7O9j19M4oJ3Q0J12j47K7M0l6P9q9
$$ 195 140 36 95 185 107 123 46 67 97 72 102 186 114 127 101 116 62 130 73 90 159 40 84 78 91 171 283 136 163 203 167 246 157
3458A57P0k1n5L7j6K3l6j15J27k6k8J04J9k5j33n3J10o8R9k5R8j11K7r2J90%j50L9l2O8n8
$$ 157 227 206 151 188 172 195 159 44 171 145 117 221 240 215 82 29 139 71 170 145 243 132 159 67 257 257 107 146 114 182 124
3166A24Q4K3n8o0K6k9J61q3q0j6K8J28r2j18%R7j21J79J1j0n7l4J1o0P8Jk9J81j67N8J8m6
$$ 124 208 231 173 113 139 110 271 188 108 92 120 248 156 38 38 135 14 193 204 194 137 103 114 54 132 133 104 285 118 176 194 148
2866A48Q6o0j5n4Q5J18kr8j49Q3j6O6n7j4R7j7kj36K9M9J0m6L1p7oJ09J18j55K0k6K7j26J94
$$ 148 234 174 159 105 190 308 306 208 59 142 126 192 135 121 218 201 199 63 92 141 151 105 136 59 53 162 280 125 145 119 146 20 214
2556B14r9R1j04O8m0o3N3l8L6J03r5m2Q4%o1o9J64r5J25j5j80J82j0o7o1kO4M9o7J17j3j55
$$ 214 115 206 102 170 130 67 120 82 118 221 126 84 168 168 107 38 202 107 232 217 37 219 209 142 81 79 143 192 125 242 229 74
2256G4k9K3J53n8n7P8jr5M0k1Nj02J89l5o3o1J73qj97Q5R7jj21NM5Q7q3J6J42r4j5J7j23k8
$$ 74 45 68 221 163 106 184 183 88 128 107 112 10 199 164 101 40 213 205 8 93 190 189 68 73 118 205 122 138 280 186 171 188 65 37
1936C7Q8j4J2o1L9n4J08L0m5r3l2M3KJ5j9PJ59l2p1Q5j07L0%p7J66N2j02o5l9M0k0N8kl3j5
$$ 37 125 111 123 62 101 47 155 185 140 47 15 58 60 75 56 63 222 190 119 204 97 127 127 50 216 268 166 101 62 102 82 140 138 105 90
1608I0o9M7N1J9m0O1n0J7po9N3K5rL1j04K3O2O4J4j48J39j01l2N8j08N8J17K0n8n1l1N5q5
$$ 90 21 68 119 138 98 159 109 126 119 50 103 128 119 150 46 69 131 195 209 61 200 99 67 125 17 75 192 212 154 103 72 127 42
1298D2Q3l3P6J21j08Km4qJ0n7J11k3q5l2k1J26j7j9L3r8K6k3n1J32K8n9kK4J5Jl7L9J7j8q5
$$ 42 125 92 168 289 181 183 139 131 141 84 195 172 87 55 34 160 143 124 157 59 85 62 11 143 171 112 110 134 149 150 113 152 169 151 66
969F6k8%k2O0j8nJ33p1N2M4k5j45K37p0j56K76j43J33j68M4J28L9n7j06K96K32P05K822j400
$$ 66 38 38 16 76 58 53 186 115 167 211 186 41 278 208 52 328 185 318 150 194 322 361 304 198 494 726 1431 4253 2853
697B853j633m98q7k29J0k1k26K33p9q7R6o9K7o0k8jm6r5K9N8o2J18O6j76J50j92J32j5k0j5
$$ 2853 1220 722 635 406 416 395 169 402 323 236 332 263 290 230 202 201 155 60 89 147 85 203 269 93 243 51 183 168 148 133
415A33P3r4o5L1j5j2k4M4M6k5N1N0j03K4j3l1N4O2l9J3o5m2P3k5L4P8Qn3p2j8J42L5k52J53
$$ 133 206 112 47 78 63 51 27 71 117 92 143 193 90 114 101 70 124 186 147 160 95 53 126 101 135 213 221 168 96 78 220 255 3 156
96A56k4qR8j04o8K3P5J6n1J9j03P5P6m3M8n6p2J4N9Qr5J77p2N4n1K7r5PK7q0K4P0J1p9J34
$$ 156 132 124 222 118 50 73 148 164 113 132 29 104 180 137 185 129 57 71 130 138 43 220 148 202 151 178 83 90 117 37 61 131 142 63 197
-233A97j00P7qr7Nj8m4R6J18p8OL7m6O1j01k5M5
$$ 197 97 174 166 69 74 56 12 108 226 148 154 191 145 206 105 80 125
-392A25
##PAGE=	F1=-15196.7
##FIRST=	19140.455529915001534,	4405.895418600002813,	0
##DATA TABLE=	(F2++(Y..Y)), PROFILE
4406G1L2q5J03j1l4Q8l7k5n2L8m1J04J04j30l5K8M5P2k2J6j55K0Qo8P6l9J58j0j78J86m8P3
$$ 71 103 18 121 110 76 164 127 102 50 88 47 151 255 125 90 118 163 235 213 229 74 94 102 34 110 71 229 219 41 227 179 252
4105B52j43M5l8n6J3L7J12j51O6m1K4q0J05j13pJ3K06r6j2K2m0J45l2J1j8q4q2L4M7p0J24
$$ 252 109 154 116 60 73 110 222 71 137 96 120 40 145 32 25 38 244 148 136 158 118 263 231 242 224 140 58 92 139 69 193
3814A93K4o8o9J5J30m8j23K0J16o2j5q6M8j3J9nJ18j13N4K4m6p2R8j11k2J10n7k6L8L8N6J29
$$ 193 217 149 80 95 225 177 54 74 190 128 113 27 75 62 81 76 194 81 135 159 113 41 139 28 6 116 59 33 71 109 165 294
3514B94j45L1j7k1J07r5J28o0n8K3j4J6l7j17J46o8j2J21L4k4j59k8J62j22R6p4J10q1kp0
$$ 294 149 180 163 142 249 154 282 222 164 187 173 189 152 35 181 113 101 222 256 232 73 45 207 85 181 107 217 136 134 64
3232F4J88J5j52jk1O7j1O0qo9oK9p9J72o3p3k9K7J25j00j30O2M4r7J83On1k5j7jm9Q6k2k3
$$ 64 252 267 115 114 93 160 149 209 201 132 126 155 76 248 185 112 83 110 235 135 5 67 111 14 197 203 152 127 110 109 60 146 124 101
2913A01J40j30R3om3J01m8m2l5O1J04Mr4j44M0M9P2n9o5J15jmj81Q6L1om9Qp4M4P3J27j76
$$ 101 241 111 204 198 155 256 208 166 131 192 296 300 206 62 102 151 223 164 99 214 213 209 28 114 145 139 90 98 24 68 141 268 92
2603I2O7j7K4j15J75q8M9n6J9k1l3J1j6J5R5p0m9R8Jq1n4J34q8J45m4j29J72l8n5q2oJ02O1
$$ 92 159 142 166 51 226 138 187 131 150 129 96 107 91 106 201 131 82 180 181 100 46 180 92 237 193 64 236 198 143 61 55 157 218
2293B18r7J06Mj27n4N5J50k8j44J19j3m6Jlj6j14J50j0m5o9J44qj13RJ66K5j68m1O7O1p0K4
$$ 218 121 227 231 104 50 105 255 227 83 202 189 143 144 141 125 11 161 151 106 37 181 173 60 69 235 260 92 51 118 179 109 133
1993A33J11p5n1L1r6j1M2L3M2p4K3m6J01K0o5m9j2L8rk4K8l8J71nr6J21j60RP7p9J28M9j29
$$ 133 244 169 118 149 53 42 84 117 159 85 108 62 163 183 118 69 57 95 86 62 90 52 223 218 122 243 83 92 169 90 218 267 138
1683A38j9n8P7k8N9kq0k5n5L2R9M7q0L7k4l1N9p5PP4n8Ln9K1J00M0J5j36J32p0q9P3j10M4
$$ 138 119 61 138 110 169 167 87 62 7 39 138 185 105 142 118 87 146 71 78 152 94 97 38 59 159 199 214 78 210 140 51 124 14 58
1364E8J05K5n4j5q7Q6m3k8L2J11J14j15m3k9jjp4J33Pl9o1nP9Ln1L1p0M5Ko2J03L4n3k3PL1
$$ 58 163 188 134 119 32 118 75 47 79 190 304 189 146 117 116 115 41 174 181 142 81 76 155 158 107 138 68 113 115 53 156 190 137 114 121 152
1025A52L6n1O2k5n8m0k7L9J1k1qNR4m7MP8nj31K22o0j45K24j04J21j82L8J24O4n5j23K01K84
$$ 152 188 137 199 174 116 76 49 88 99 78 70 75 169 122 126 204 199 68 290 230 85 309 205 326 144 182 306 370 315 192 393 677
725F77O03K452j282j407m29rk31j6K2k56K23k4r0Q8n7Mn0l0K2k3r2l5P6o6R1Q2j29J09j73
$$ 677 1280 3732 2450 1043 614 605 374 358 380 124 347 323 233 321 264 268 218 188 210 187 95 60 136 70 161 243 114 223 50
453E0J55Kk5k2O4o2j15M1j0m4LP0Rk8R5l3n7J6K5o7LK4J2P1n3m5P1m1O6Q4l9n5p1m1J61N6
$$ 50 205 207 182 160 224 162 47 88 78 34 37 107 116 88 183 150 93 109 134 67 70 94 106 177 124 79 150 109 175 259 220 165 94 53 214 270
115B70k51J23mL8O7j27p8N1O2J5k0M7j40O6O7n1R0j12k8k2J8K6j5J33j12P4k1L2j50K1Pn1
$$ 270 19 142 138 176 243 116 38 89 151 166 146 193 53 119 186 135 225 113 85 63 81 107 92 225 113 187 166 198 48 69 76 25
-186B5NL4N2p8J49p5N4J7j08pk6j1Q7J14j15J5P2n8N0j07k2O0
$$ 25 30 64 116 38 187 112 166 183 75 68 42 31 118 232 117 132 204 146 196 89 67 127
-392A27
##PAGE=	F1=-15275.5
##FIRST=	19140.455529915001534,	4405.895418600002813,	0
##DATA TABLE=	(F2++(Y..Y)), PROFILE
4406G6N5p6N4K5l0P5o0m3l7N9o1J05J40j44n0N0J3R5p4O9j41j0J0m5M8k3J49j3j81K28q6K3
$$ 76 131 55 109 134 104 179 119 76 39 98 37 142 282 138 88 138 151 246 172 241 100 90 100 55 103 80 229 216 35 263 177 200
4105B00p5N6n5j0r4K6J31j46Q7p7J30j14O6o8j9kJ73l3m6KLJ65q7L5n8r2q4N0N0p0J13M2p3
$$ 200 125 181 126 116 22 48 179 33 120 43 173 59 125 57 38 36 209 176 130 132 135 300 213 248 190 98 14 64 114 44 157 199 126
3796A26n5K7J57o4j15NJ03n5nj18R6o6R7n6J07j36J06M8j01q2J46q4J7k3J5m2K8L5N8J32j43
$$ 126 71 98 255 191 76 81 184 129 124 6 102 36 133 77 184 48 154 202 101 19 165 81 98 75 90 48 76 111 169 301 158
3504A58L8o3j4J27j11J83r3m4lk2Ql7p3J24j06L1J13M3k1j54LJ69j65R3j01J06m3k3j0J20
$$ 158 196 133 119 246 135 318 225 181 178 156 164 127 54 178 72 103 216 259 238 84 87 256 91 184 83 189 146 123 113 233
3223B33J8j34m0kM9M3M9o8p5Q8J2j27J58l3l8m8J0J26q4r9N3J2q3J50J8q5JJ1nm4Q1k4j5Q0
$$ 233 251 117 77 75 124 167 216 148 73 161 173 46 204 171 133 85 95 221 137 38 91 103 20 170 188 103 104 115 110 66 147 123 108 188
2903A88p0Q1j3k3R6m3n8pL2O5J1o7j22j2J07Q6o3j17J35%qj28O2nj3l4Mj9K8M4J05j63P3%
$$ 188 118 199 186 163 259 216 158 151 183 248 259 192 70 58 165 251 188 71 206 206 198 70 132 127 114 80 84 65 93 137 242 79 152 152
2584A52Pq9J44p4N5l4m1jK0m5PoN5j6n8J28j1r9k0Q1o2J58r0o7J60o8o4r8lJ61N4j21Q5J7
$$ 152 159 70 214 140 195 161 120 119 139 94 101 95 150 134 76 204 193 94 74 155 93 251 161 94 254 186 122 24 21 182 236 115 200 217
2265B17q6p6R1J32mk04J35l1J8l6Ml5j17J11Nro2J00mn2n9K16M8j86q2Q5L2n4K7P8m8r6M1
$$ 217 131 55 146 278 274 70 205 174 192 156 160 125 8 119 124 115 53 153 149 97 38 254 302 116 34 119 151 97 124 202 154 58 99
1955I9n8NQN0P1p7Rj4P3J0q2nnL3j6n8P7q1J89J7j22J34j86JJ32p8Q4M6j40J6o3R7j8N4kj21
$$ 99 41 46 54 104 175 98 107 93 166 176 94 89 84 117 101 43 120 39 228 245 123 257 71 72 204 126 210 256 116 132 69 166 148 202 200 79
1617G9k9j5RJ25M4r5J3J5r6J06p7kR7j07k5rJ7J28L1J0j56J35n0p5O8j34L2Q3L1l5L2p6N9
$$ 79 50 35 44 169 213 118 131 146 50 156 79 77 174 67 42 33 50 178 209 219 63 198 148 73 141 7 39 122 153 118 150 74 133
1307A33J4j25M3J30J04j15o7k0j0pl2J09M6j9q5OM4K0q4K2k8O2L2p6Q4Qk5j7k6K7O6o7Q8l4
$$ 133 147 22 65 195 299 184 117 97 87 80 48 157 203 184 99 105 149 169 85 107 79 141 173 97 181 189 164 147 121 148 214 147 235 201
988B01j07k3l1R7L3q6K1j5N1k1n2J19Lp7J69n9j09J60n2R1j59RJ25R4n9j01J17K69N69K191
$$ 201 94 71 40 137 170 84 105 90 141 120 68 187 190 113 282 223 114 274 222 313 154 163 288 382 323 222 339 608 1177 3368
706C368j191j294l59K1j85o5O5k61J77J0o5O8o2Pk2k1L7Mq6j22R7o2M4R8q3O7j25J67Rl6k1
$$ 3368 2177 883 524 545 360 295 360 99 276 286 221 289 227 234 212 191 228 232 146 24 121 59 103 201 118 185 60 227 236 200 179
415A79N0l0j55N2jjk2O5l4PJ10j13qJ2O5j10m7LK6J49m2m5O7p3J10R2q0p2o5o7J64R2k33P3
$$ 179 229 199 44 96 95 94 72 137 103 110 220 107 99 111 176 66 19 22 48 197 155 110 177 104 214 306 226 154 89 22 186 278 45 118
96A18K9P5L7j51q7O2P7nK9N9j55M5N9o5J24j51J9n6j0K6N7J05j64P7K3L2j40j4K0o2L0j2N9
$$ 118 147 222 259 108 21 83 160 155 184 243 88 133 192 127 251 100 119 63 53 79 136 241 77 154 177 209 69 55 75 13 43 31 90
-214I0n7J44m8K8L8j06j2n3L4M8J21j21kR6o3L4j05rP0
$$ 90 33 177 129 157 195 89 77 24 58 106 227 106 104 200 137 171 66 57 127
-392A27
##PAGE=	F1=-15354.3
##FIRST=	19140.455529915001534,	4405.895418600002813,	0
##DATA TABLE=	(F2++(Y..Y)), PROFILE
4406F8R1o5lN6j6N1p4m1rN4k1N5J41j44n7P1j4J07j23J15j26k8Jk6K4kJ26k2j25K30r9n1O
$$ 68 159 94 91 147 131 182 108 67 58 112 91 146 287 143 86 157 143 250 127 242 116 88 89 63 87 85 211 189 64 294 195 144 150
4096A50P3o8Kj20PR8j06Q0l7J26j33K9Ln9K8Q8J6o9nN8J51j33O1q5j02j2K9J9o2R1M0o5k3
$$ 150 223 155 157 37 44 142 36 116 79 205 72 101 104 45 73 161 177 108 103 161 312 179 240 155 53 41 70 89 27 118 158 93 70
3786G0M2J64r9q3jQ3n7L0j30J14j10J65q2N5j14J30M8j43n3J69m9K9j25O6Nk7NP1J20j35M1
$$ 70 112 276 177 94 93 176 119 149 19 133 23 188 106 161 47 177 225 82 29 198 149 178 53 119 124 97 102 173 293 158 199
3495A99r0qJ35j36K27j21rk8m6kl9PP0j07O1Q9M9k0j25J6J52j78R0j01Q3qk9K4N2Mj00q1L8
$$ 199 109 101 236 100 327 206 197 169 123 121 82 89 159 52 113 202 251 231 106 122 274 96 186 85 168 160 131 155 207 211 111 30 68
3185F8J0J05L7j19m7J42k6j35J06NRp3mJ30m9q0K4J5n8N7M1j04K5N2j3n6P0Jj0J9j1M3MqP2
$$ 68 78 183 220 101 54 196 170 35 141 146 155 82 78 208 159 79 103 118 60 117 158 54 79 131 118 62 132 133 123 142 131 174 178 170 242
2857B42m6p0K7JJ7J9k4p5m6J18R9o6j50J41qj6m4K9n5j5%J3J6J4L2N8j32M7K7j8o4J05m7Q3
$$ 242 196 126 153 154 171 190 166 91 45 163 262 196 46 187 179 163 119 148 93 78 78 91 107 121 153 211 79 126 153 135 71 176 129 212
2537B12l8q6K2N3o9J9k3j5O4o5J63m0j09MM3rJ36j35jJ43q8r6n9jJ80L6j41O5K6l8q4J00J16
$$ 212 174 88 110 163 94 113 90 75 139 74 237 197 88 92 135 126 262 127 126 269 181 85 26 25 205 241 100 165 191 153 69 169 285
2227B85J3k23J14n5Q8o5Mm7r8R0k2M1o4P4Mk1o7J88O4j79r1Q8Om1L3M4k1j24K9j8J4J0J5R9
$$ 285 298 75 189 134 222 157 161 114 16 106 84 125 61 135 139 118 51 239 303 124 33 121 127 86 119 163 142 18 47 29 43 53 68 167
1908A67o9JK6L7Lq8L0j2K7k1p9J19j21K14L3j37J13j90K6J46p3N2L6j39L7o3J03J2N4j1j50
$$ 167 98 99 125 162 165 77 107 95 122 101 22 141 20 234 267 130 243 53 79 225 152 204 240 101 138 75 178 190 244 233 83
1617H3k9MoJ26M1r9NM8j30J03p9M4P1j39l2J4J6J42L4J4k09J37l9k3N7j42L5L3L2kN9p0O1
$$ 83 54 58 52 178 219 120 125 173 43 146 67 111 182 43 11 25 41 183 217 231 22 159 120 97 154 12 47 80 112 110 169 99 160
1307A60M1j32k0J40Q6j08o6j7l6j1O3N3P0j5r9J0J9L1j02%J4Q0N1q1P4l1RJ4o7%Q5q3J23k3
$$ 160 201 69 49 189 275 167 101 84 48 37 100 153 223 208 109 119 138 169 67 67 81 161 212 131 205 174 183 197 130 130 215 132 255 232
988B32j19o3k9J40N9j31L3k8ROr3J50Rj4R3o6n9R7KM9j05m0J26J17o0p6J02J99N27K000j081
$$ 232 113 50 21 161 220 89 122 94 103 109 16 166 175 161 254 188 129 226 228 277 172 132 258 375 315 239 341 540 1067 3067 1986
697A986j249k71%j18j09R6k16P4K0k1N7p3J2L7k4N2K4p1j83P9m9LR1m1L4n5J58Jm9qL9j1j81
$$ 1986 737 466 466 348 239 335 119 193 213 192 249 176 188 225 201 253 277 206 23 102 53 56 147 106 140 85 243 244 195 187 226 215 34
387C4O0K1L3n6N9p2O4J08j70K5K4Q5j43l8R4p2J65l2n3P0j17J45J07j01r9o0m8J08J33j94
$$ 34 94 115 148 92 151 79 143 251 81 106 130 215 72 34 128 56 221 189 136 206 89 234 341 240 141 81 33 141 274 80
105H0QO9J05Oj64r0M1J15l8P3N5j46K4N7p9J46j70M4p5%LQ8R6k01O0P1L4j06n5N5q9M0j5L6
$$ 80 88 157 262 268 104 14 55 170 132 205 260 114 138 195 116 262 92 136 61 61 64 152 248 47 107 178 212 106 51 106 17 57 42 78
-214G8k7J18k4QN4j04j3q1P2LJ27r6m5J11o2J7q9J0O2
$$ 78 51 169 145 153 207 103 90 9 81 84 211 115 70 181 119 136 47 57 119
-392A19
##PAGE=	F1=-15433
##FIRST=	19140.455529915001534,	4405.895418600002813,	0
##DATA TABLE=	(F2++(Y..Y)), PROFILE
4406D6J32n6n5Q0lK8o2j1mL2KL0J14j37n3Q9l4J11j63J44j09m0j9%kK5R5k8m9K08r7j17Q1
$$ 46 178 122 67 147 144 172 110 99 95 127 129 159 273 136 83 172 138 249 86 230 121 81 62 62 60 85 180 152 103 311 214 97 178
4096A78Q5q6lj00MK6m4O0J3Q1j34%O2j00N4J3M2p6MJ02J21j69Q3j00j08Q1Ql0m7O2J9l1%N3
$$ 178 263 177 174 74 78 104 60 120 133 214 80 80 142 42 96 109 151 75 79 181 302 133 216 116 8 89 97 67 20 82 101 70 70 123
3777A23J57j40l8oP8n4N8j32J13j35K06r2mo1J23L1j66j0J72j8L1j68O4N5p0k9Q1R4j14L3
$$ 123 280 140 102 96 174 120 178 46 159 24 230 138 134 73 196 227 61 51 223 205 236 68 132 187 117 88 169 263 149 182
3495A82r5MJ25j64K54j39M5m6q7j2m3R7Ll9K6O2O7k6r0J5J20j51Q5j04O3K1l2L1Ok4n2o4L6
$$ 182 87 91 216 52 306 167 212 166 79 67 24 121 124 85 111 173 240 214 124 139 259 108 193 89 152 173 141 172 178 154 102 38 74
3185G4m2J65J8j05KJ05p9r2K3M9N0r7mJ24j1p0j0L7k8n3O3r1M3R6m4p4N7M0ll2L1J7L1j7L5
$$ 74 32 197 215 110 112 217 138 46 69 118 168 71 67 191 180 110 100 137 109 56 119 28 71 167 123 49 106 146 143 111 142 159 190 173 208
2857B08n1q2O0k9l1L2K3j1m9P5J06o8j31J10k8k5M6Rr8k8M4J4L9J3K5Qj09J0O9l9n8O2JJ06
$$ 208 157 75 135 106 75 107 130 119 70 145 251 183 52 162 134 109 155 164 66 38 82 96 135 148 173 181 72 82 151 112 54 116 117 223
2537B23n0j10M3N7m8Pk8q4J37o0J83p8j10J2L3L9R3j53N1J20r4j38L0j3J52J5j54N3L1Pp4
$$ 223 173 63 106 163 115 122 94 10 147 87 270 192 82 94 127 166 259 106 157 277 183 45 75 62 214 229 75 128 159 166 92
2246I2Q0R9K6k01O8q9J55q3jm7o0J17q7O8q3P7Rj6j8Q8P1j52o9Q1j3l6M8Qoo4n4J2J1M8o2
$$ 92 172 271 297 96 164 75 230 147 146 99 39 156 69 137 54 131 140 124 106 194 265 113 44 125 112 76 124 132 126 62 8 20 31 79 17
1918A7J20n2NN9Kjp4N0l3J9k8o5J34j40K23M4j38O2j82P5J33o8L9J3j35O6o9R7N3O5l3j63
$$ 17 137 85 90 149 151 150 76 126 93 112 84 19 153 13 236 280 142 204 22 97 230 162 201 214 79 145 76 173 226 291 258 95
1617I5l5J5k0J08M2r6J4O3j28O6q4J14J7j47K3k5RJ45L7L4j87L9l4M8L8j21M9j8J0L7N7p6
$$ 95 60 75 55 163 205 109 123 186 58 124 40 154 171 24 47 22 31 176 213 247 60 99 65 113 151 30 79 61 71 108 165 89
1317H9R6L8j33m1J33O0r8n4j9m9PJ17J8O5j7j03J2kL3r1l2M6R5N4p8P3o9M1M8r7l9R1r9J63
$$ 89 185 223 90 49 182 242 144 90 71 22 29 146 164 229 212 109 121 119 152 61 29 75 170 224 146 219 150 191 239 142 103 194 95 258
997B58pr7j33K4J14Q2j50K3k3l3L8l8Q5K7K7J5q0%L9M7J2l4r0J04J30n5p0J36J35M39J774
$$ 258 251 154 21 45 159 241 91 114 91 58 96 58 143 170 197 212 132 132 171 218 230 196 106 210 340 285 215 351 486 925 2699
706B699r20j179j80l8n5j17R2j28o9J5K8P7np3J07m8O3L4m4j85J6l9K7J4mJ0K0J30k1n5J0
$$ 2699 1779 600 420 382 327 210 302 174 105 120 148 225 220 147 254 206 269 303 259 74 90 51 78 92 88 98 118 248 227 172 182
415A82L4oj86O2N0M9r6O0r3J19J01j94L0L9Q8j49j0J48r6J09j6p0P9j60J58J19r6j21o4NJ7
$$ 182 216 210 24 86 136 185 89 149 56 175 276 82 112 151 239 90 80 228 132 241 225 155 234 74 232 351 255 134 70 75 92
124I2J62j35o0J02J32k3j64m2m8J64p4R5M1j12kO1q4J55j69M8q4K1LN1J03j97J9J12M4q1p3
$$ 92 254 119 59 161 293 270 106 64 16 180 106 201 242 130 128 189 105 260 91 139 55 76 79 130 233 36 55 167 211 130 57
-167E7P5j02L0nM2k7R1mjO3j09j5q2Q1l2J19n5r2J22n7km2J0L6
$$ 57 132 30 60 55 97 70 161 157 156 219 110 95 13 94 62 181 126 34 156 99 97 55 65 101
-392A01
##PAGE=	F1=-15511.8
##FIRST=	19140.455529915001534,	4405.895418600002813,	0
##DATA TABLE=	(F2++(Y..Y)), PROFILE
4406A5J68m4r5R1NJ0k2K0qkMK4P6j26l5R7m6J05j80J53r2n2m1M2m3N9O1k8J7J76r2j49J34
$$ 15 183 139 44 135 140 150 128 148 140 138 142 166 242 116 81 178 132 237 57 210 118 66 25 67 24 83 144 116 133 309 217 68 202
4096B02Q4j04j5p3Ol0K0L4M7L2j15k7J01j29P1m1M4n0QJ17R5j88R4j09k1Q3j0p2l4L8j2L1
$$ 202 286 182 167 94 100 70 90 124 171 203 88 61 162 33 104 63 107 57 65 182 277 89 183 74 53 136 126 54 20 58 46 77
3796G7j0N9J35j60jj2Q8l7O6j34J00j41K22r4m4k1J10Oj59J7J64OK8j68K4R8r6n1P7O3p9J2
$$ 77 67 126 261 101 100 88 176 139 205 71 171 30 252 158 114 93 203 209 50 67 231 237 265 97 121 219 123 72 149 212 133 145
3495A45p8K3R5j77K55j43J03n4j35j3J3J05o1N4m0L6J00l6o0KQ2q8Q0j36O1M5m4K3rn6J5K
$$ 145 67 90 185 8 263 120 223 169 34 21 34 139 78 132 92 128 228 192 132 134 216 128 208 72 133 178 134 157 148 92 107 109
3195A09j5p6J91j2m0J0N0j37j5j8O6N8j15PJ07J4o3l5O0Pj16M1j6K1J24r1o9L0Q0Lo3N3K7
$$ 109 94 18 209 197 157 167 217 80 65 47 113 171 56 63 170 184 121 86 146 153 37 78 62 83 207 116 47 77 157 160 97 150 177
2885A77L2m4om8p8O8ro6J1N4M9n0K6J07p3p1P2o1l2J16Mr4n2N5LN9J7J6k4j08k0J17l7q8K5
$$ 177 209 165 159 111 33 101 92 26 37 91 140 90 116 223 150 79 151 90 58 174 178 84 32 87 90 149 166 182 158 50 30 147 110 22 47
2556D7O6J14n6j13M6L9Nk7j6k2O9m0J86j22r9MM3O7M9j27O4R5q5j48P5k4J07Jj41M3K3M8n7
$$ 47 113 227 171 58 104 143 148 121 105 83 152 112 298 176 77 81 124 191 240 113 177 272 187 39 114 90 197 198 57 100 123 171 114
2246A14M8P3L9j49K0j32K01q7ol1k4J70j26N0j08R1Rl4L9k1P5j24l3P7k2m1O8k7jlo6j9lR3
$$ 114 162 235 274 125 145 13 214 127 121 90 66 236 110 160 52 143 152 118 157 136 211 87 54 131 109 68 136 109 108 105 39 20 17 110
1927A10n9M8k8J7P7k7lm4N8o4Pl1j7J14j24J95N0j30pj22R0J16o9L9k3j26J09p3P0R2Q7o2
$$ 110 51 99 71 88 165 138 135 91 149 85 92 61 44 158 34 229 279 149 142 20 110 226 157 196 173 47 156 83 153 245 332 270
1626B70j62m2K2k6P2M6q3L2N1j23M1o5J59m3j39O4m2j3J39L2O2j22r8%R5Oq2N8k8m7P0L8r1
$$ 270 108 66 88 62 134 180 97 129 180 57 98 33 192 149 10 74 32 19 158 190 252 130 32 32 127 133 51 109 81 34 104 142 51
1317E1J46J5j25j2J11K9r1n1k7J1K1R8OL4j8r5J1k2L1n4o2O5R7M6p7P3r1O2P5r9q5Q7j16K05
$$ 51 197 212 87 75 186 215 124 73 46 57 78 176 182 216 198 103 114 92 123 69 7 72 169 215 138 211 120 182 257 158 73 160 44 249
997B49Oo5j65O9M9Q8j34qko5P5JL0N0L3m8r3N8j2Q1j3L6r6K9J39n3p7J77J12L53J516p48j064
$$ 249 255 190 25 94 143 231 97 89 87 22 97 98 128 178 211 163 70 128 116 197 184 220 124 153 292 239 162 339 451 804 2320 1572 508
687E08j33n7j0q1L8l3j60M5J6J14J36j76Q7q6O2K9nj72k9m6Q3p5K4j2Q7Q8m9m5K1L1j1j66
$$ 508 375 318 308 227 265 232 72 117 133 247 383 207 294 208 270 299 294 122 93 47 130 55 79 67 154 242 193 148 169 200 189 23
387B3N5P6N2j38O0o5J41R5k03K5L8Q5j27PJ78r8M6Pq9R3j83J32J26p4j26p9O0m9J51o5j05
$$ 23 78 154 206 68 128 63 204 299 96 121 159 244 117 124 302 204 250 257 168 261 78 210 336 262 136 57 117 68 219 154 49
96D9J06J52m4j53Po7J38j02Q5K7o2l7P3p5J58j58N2q2J5L1m0J34j54m3J38O2p5o7O9r8J5J5
$$ 49 155 307 263 110 117 50 188 86 171 198 136 99 172 97 255 97 149 67 82 113 73 207 53 10 148 210 135 68 137 39 54 69
-205F9O6n4P1NOO3j22j5o4P5m8Q6j1j21J26n0j8J5n%
$$ 69 135 81 152 157 163 226 104 89 25 100 52 138 127 6 132 82 64 79 74 74
-392G4
##PAGE=	F1=-15590.5
##FIRST=	19140.455529915001534,	4405.895418600002813,	0
##DATA TABLE=	(F2++(Y..Y)), PROFILE
4406B4J49l0r7P2%NL1L6mm5j1K3M2j07mQ3m9Q9j55J37p3p0k8O4n1M9K8k5O5J45r4j34J51P1
$$ 24 173 143 46 118 118 123 154 190 186 141 130 153 195 88 84 167 118 207 52 189 116 46 18 82 31 80 108 83 148 293 199 65 216 287
4087B87j16k9m3J4l2M6kO4j2p9n4J14j30P3o4J8K3j5R7Q7j86Q8j19P7P4l3r8k9L4KM5m1N7
$$ 287 171 142 99 113 81 127 125 189 177 98 44 158 28 101 37 55 78 63 160 247 61 149 30 107 181 148 50 21 55 57 102 61 118
3777A18J03j13j3j4Q9j0O5j35P6j30K19r5n3qR7j9j28K7J42K2K4j40m0J26r8n0N2L7l6k0m6
$$ 118 221 108 95 81 170 160 225 90 166 36 255 160 107 99 196 177 49 76 218 240 264 124 84 210 112 62 114 151 115 95 49
3486D9M4N2r2J53j18J42o0j43K7K7N4j07J42j06OJ50m9m4j5M7oP5j89O9N9o3QNp9R5M6n9o4
$$ 49 93 145 53 206 88 230 170 27 54 81 135 28 170 64 70 220 171 127 112 159 153 228 39 108 167 104 112 117 38 133 179 120 56
3176E6J60m5K7%jj60N4L1L1J7j20J5Q5J9o1m1P5M1j07j8M5nJ36j42k5nJ02Pp5O6N3Jp7l7k8
$$ 56 216 171 198 198 197 37 91 122 153 170 50 65 150 169 108 67 142 183 76 58 103 98 234 92 67 62 164 171 96 162 215 216 139 102 74
2847G4j9J7Q6m3n7MQ5n4rJ13q4j1O0p8j8J11Oo3m8J9j9Q2J9Jk8j29J3J10j1j04NQ3J21n8j01
$$ 74 55 72 158 115 58 62 147 93 84 197 113 102 162 84 66 177 183 120 72 91 72 154 173 174 146 17 30 140 129 25 30 113 234 176 75
2519G5K8RP1p6PJ6K0j6J76j58q0j2N9P4J5p7M9P4o8j21O9l2N3np3K1j5Q3m0K9L0N1p8j1q3
$$ 75 103 112 183 107 114 130 150 134 310 152 72 60 119 193 208 131 180 254 186 65 134 102 155 150 77 98 83 166 126 155 185 236 158 147 64
2190F4J16q1plKK19j53M5j13P3J1p1Q9j00Q8j21jQ2k6n0Q1m8J2L2p5l9qJ12k1k6mJ6P8m6k
$$ 64 180 99 92 89 91 310 157 202 89 162 173 102 191 91 179 58 57 139 113 63 144 96 108 140 65 26 18 130 109 83 79 95 173 127 125
1861A25j4N8r4oj6J4Q8r9J53N3j17p6kN0J02q1M2o0o6J17o8J9J18J17q9j51m6L8k7K0M5m8
$$ 125 111 169 75 69 53 67 155 56 209 262 145 69 67 117 219 138 180 120 54 171 103 122 240 357 268 117 71 109 82 102 147 99
1561I9M4J9j33N1j3J51q3j28Q1m2l9J26J5Q5m6j36M7N0l5m1N7k7r2P9K7q9J66j9j01L6R4O
$$ 99 143 162 29 80 67 218 135 7 88 46 7 133 148 233 187 51 98 148 113 72 129 102 10 89 116 27 193 174 73 109 203 209
1260B09r6n7n2R1L0N8J1rj3p8J0m1K6ko9O2P6M0q8P2r3O6R3o6j23P1j21K25J3l4j53Q6j3O2
$$ 209 113 56 4 95 125 183 194 185 172 94 104 63 89 87 18 80 156 196 108 180 87 153 246 180 57 128 7 232 245 211 58 144 131 193
941A93q5l8K7n2P9pJ1O0Pp7r9J05n2R8k7Q7o8n8J51n0p9J74J29L38J304o41r40j52l8Nl0l8
$$ 193 108 70 97 45 124 117 128 188 195 118 19 124 72 170 143 230 162 104 255 205 126 300 429 767 2071 1430 490 338 300 305 275 237
640B37L0j33R7m0J22K60k00l3j20M2KM0j45n4o5J33j04J3l2J40L7o6j5RK6k7j31O2P7M9j76
$$ 237 267 134 231 191 313 573 373 340 220 262 264 304 159 105 40 173 69 82 50 190 227 161 146 155 181 154 23 85 162 211 35
349C5O0LJ34Q6j97J4J5Q3q7J7J77q8j0L6j04J12j86P8J28n4j10r7J07o3Q1Pj10O6J59m6j32
$$ 35 95 98 232 318 121 135 150 233 146 163 340 252 242 278 174 286 100 178 306 252 142 45 152 89 170 177 67 133 292 246 114
58A14N1o7R6j17M8J6pq1R0n2J65j49P7p5l0P1j11J57j11n1R7P9q6m4M3q3J0L6Q3q7N2RK3N9
$$ 114 165 98 194 77 125 141 134 53 143 91 256 107 184 109 79 150 39 196 85 34 131 210 124 80 123 40 50 86 169 82 134 143 166 225
-261B25j42ql7O3m0L1K3q1Q2m2k8N5k3l0
$$ 225 83 75 38 101 61 92 115 34 116 74 46 101 78 48
-392D8
##PAGE=	F1=-15669.3
##FIRST=	19140.455529915001534,	4405.895418600002813,	0
##DATA TABLE=	(F2++(Y..Y)), PROFILE
4406F0Q7j6n8K8j7J6P6L9Rr0l1J7J6o7K4M2m2O0p7R9m9r9J7N3k0lmk0J05J19j07q0J31M7j14
$$ 60 147 131 73 101 84 100 176 215 224 134 103 120 136 69 93 135 93 153 76 175 126 27 44 97 77 74 70 50 155 274 167 87 218 265 151
4077A51m2j4L1jL6m3O8l9l8q3J07j01O2n3k6R2l6M4J07j62O6j10J39O7o3j07k9M8K9K2o8M5
$$ 151 109 95 126 125 161 118 186 147 109 26 133 32 94 41 15 107 71 115 222 60 126 16 155 222 159 52 23 71 100 122 54 99
3777I9P0pn7j1N2K0O5j28M0j01J97j00l4rP7l3r6L5J08K5K5r3j10J31p4k0kK1J0n8kN2QpN5
$$ 99 169 162 105 94 146 166 231 103 143 42 239 139 105 96 173 140 44 79 187 212 237 144 34 165 91 71 69 90 100 42 40 92 100 93 148
3448A48n3J35o8j04L2J5Qr6J79j30l1J78n8m5k2K1O7P0j75K1M7q1rL4q1J65P0r3n1J24p0P5
$$ 148 95 230 162 58 90 105 113 17 196 66 35 213 155 110 88 109 176 246 71 92 139 58 49 83 2 167 237 144 93 217 147 222
3148B22k4l6n5J7P2J3l4j14J1O9mo6j9P9O5r2k4N7l1J31j87M6k2R5Lp3P7O8m6j01n4QK8pJ58
$$ 222 198 162 107 124 196 209 175 61 72 141 137 71 52 131 196 104 80 137 106 237 50 96 74 169 172 99 176 244 198 97 43 51 79 72 230
2819B30n3q0m5Q5n9j2J27q5LO6o1j1O0Nl0k7k2m4J08Rj1qr4K6N3K3p5RK3J38o5q4J1k7J33
$$ 230 177 97 52 137 78 66 193 108 111 177 116 105 165 170 140 113 91 47 155 164 153 145 51 77 130 153 78 87 110 248 183 99 110 83 216
2490B16j29K7K5kMJ59j77n5l0P5O5ll5K2O1m7q7M1l4Pj2K6Lp8J09l2M2k3M7Mk9m8K3o6kK3
$$ 216 87 114 139 137 141 300 123 68 38 113 178 175 140 162 223 176 89 130 96 103 91 117 120 42 151 119 161 138 185 189 160 112 135 69 67 90
2152I0J5K57j81P3j06L4J9j17J19j13J03j46PR0k8n3Q1m2M6K5q9n3LR8J9m0lnP3n9NNN3j10
$$ 90 105 362 181 254 148 182 201 84 203 90 193 47 54 144 116 63 144 102 148 173 84 31 34 132 151 111 108 103 176 117 122 127 180 70
1833G0j3J1J2O1o7J05N3r6q8O1QR4j03M6p9L5P2n2m0J18J51j02j38m5P3k7m3K9RN4j9j23M6
$$ 70 57 68 80 141 74 179 232 136 48 109 117 211 108 154 75 110 182 130 90 208 359 257 119 74 147 120 77 106 115 169 150 27 73
1523G3L1J27q2j22O8l9m2R2j4R2L4j07N3J2o0k4M1k8q5M1M6k8R1m6o2P5Q5lj02m3j8O5M0M
$$ 73 104 231 149 27 95 56 14 106 92 184 218 111 164 176 116 92 133 105 20 61 107 79 170 124 62 137 222 219 117 74 56 121 161 165
1204A65K7m9on2J0m6J1M8q7O7M3M9j08O3q5N1J09jj45M1n8J64J8j3j33J04m4qj2l0L0m7Q9
$$ 165 192 143 137 85 95 49 60 108 21 88 131 180 72 135 50 101 210 209 64 105 47 211 229 216 83 187 143 135 123 93 123 76 165
894A65n0K7M4l5n8o2R0p4R5m7J17k9j02J57l4m5P7J66L74J184o11q51j88QoMq2L2q4J56n9
$$ 165 115 142 186 151 93 31 121 47 142 95 212 183 81 238 204 159 236 402 776 1960 1349 498 310 318 312 316 234 266 182 338 279
603B79J05L29j60j73j33J2m3P2j05p0q0J69r4j9k8J61j4o2J5j6J5m7r1Q3M9N1j90M6P3J24
$$ 279 384 713 553 380 247 259 216 288 183 113 33 202 108 89 61 222 208 146 161 145 160 113 22 105 154 205 15 61 134 258
321B58P0j71ok4Q5m1J9J46p0m9O1j08J36j82K7J26m7q6j00J28n2qO8r0OJ50k5j07Q8o9O5j19
$$ 258 328 157 151 127 212 171 190 336 266 217 278 170 306 124 151 277 230 144 44 172 120 112 180 90 96 246 221 114 202 133 198 79
21G9lJ1M5j16R0j8J81j51J18p4r3J11o0R8j01n9O5Q2j05j0Oo5K3M1R1j14L4J0M7M7j61J4j5
$$ 79 76 87 132 16 106 88 269 118 236 162 69 180 120 218 117 58 123 205 100 90 96 31 54 95 186 72 106 116 163 210 49 63 48
-289D8N0j9pK1l3M8l1l1O5l4k5
$$ 48 98 79 72 93 60 108 77 46 111 77 52
-392E2
##PAGE=	F1=-15748
##FIRST=	19140.455529915001534,	4405.895418600002813,	0
##DATA TABLE=	(F2++(Y..Y)), PROFILE
4406I3J6nmj2m1M3J00K8K8j25l6noJL6k8k6K1L6N9k0j26K5M6K0n6l7LJ35J00j17k5Q8J4r6
$$ 93 109 104 100 88 47 90 190 218 246 121 85 80 74 75 111 83 57 78 114 173 153 27 52 98 118 62 25 28 163 263 146 121 209 223 127
4077A27m5QN0J8K3p8O3m5nj07Q1n4N5l2k3R0m0l2J54j43M9n6J34O0r4r5m0O9L4%p5K3M9R4
$$ 127 82 90 140 158 181 103 166 121 116 9 90 36 91 59 36 126 86 54 208 65 114 58 192 252 158 63 23 92 126 126 51 74 123 217
3758B17q0rk7N4O7j05lo5J61j11Lj4N3l5p6M8O5J5L4l6r0M6k7J6o4RM5o7J4M3k7O6k0K3R9
$$ 217 137 128 101 155 222 117 114 49 210 99 102 88 141 106 30 78 143 158 192 156 66 112 85 101 37 46 91 24 38 81 54 120 100 123 222
3429B22p9o3K5Kk6k8J58j03k8J27n9n4j4RJ04O2j10k6k6m6j5J4k6J72P6j11l2Q0o7R3n8m6
$$ 222 143 80 105 107 81 53 211 108 80 207 148 94 80 89 193 255 145 119 93 47 32 46 20 192 268 157 125 205 138 231 173 127
3129A27O1k9R1jo8r9kO4m4q4L4O9P6q0%M6n5J11j99J08j9O8j4n8Q4O1q8j14k4RM6PJ82o6q9
$$ 127 188 159 250 249 181 82 80 144 100 16 50 119 195 115 115 161 106 217 18 126 107 175 161 103 187 248 160 46 22 31 77 84 266 200 111
2800A11n7O4o6K0J36o9l5P5l5j2J4pnJ5n9p0J32j1j0K0m4NQN4m4kk9J63q3o1J2o5J80j66K4
$$ 111 54 118 52 72 208 139 104 179 144 132 146 139 134 149 90 20 152 141 131 151 107 112 120 174 130 128 99 262 179 118 130 65 245 79 103
2472A03NJ5PJ32j70l0l6Q6M4j0rj0N7k9m8Jl3J1m6J17nj26J07l9P9n7J2Q8m3l8l9n7J0L6K1
$$ 103 108 123 130 262 92 62 26 112 156 146 137 127 184 155 107 108 75 86 40 157 152 26 133 94 173 116 128 216 173 135 96 39 49 85 106
2143A06K72k03J26r5j1L5j51J16q7J15j63j4R6l1m1O4pQ2mj05o8J5O7N6k5rk9P2p4K2RM2r9
$$ 106 378 175 301 206 195 230 79 195 108 223 60 46 142 111 70 134 127 209 205 100 32 47 114 170 145 136 107 179 105 127 136 178 79
1833G9j5J9qM1k8N7M6n3k7K1j6Q1j27N7m9Q9J8l6q0Q9J81r1j34m4J24j9j00k0P3P0l5o3k8
$$ 79 64 83 75 116 88 145 191 138 111 132 116 197 70 127 78 167 185 149 69 158 339 248 114 70 194 175 75 55 128 198 163 100 72
1523G2O5R7n6j27N2l9l4N1l3O0J15o2N2no5l5J3l4m9j6R8QOn8j8R8P5mr2pqJ4M6n4M9q0Jj7
$$ 72 137 234 178 51 103 64 30 81 48 108 223 161 213 208 143 108 121 87 38 22 120 128 134 76 58 156 231 227 135 128 120 134 180 126 175 95 96 79
1166G9J5l4k2Q8r8N9J5P0j03M0p9OJ29O7j50Oj1J12K2lj10J21m6j06O8QJ0n7J09j09O3Rq0
$$ 79 94 60 38 126 28 87 102 172 69 109 30 36 165 232 82 88 77 189 211 208 98 219 173 67 135 143 153 96 205 96 159 168 88
856H8Pm6P1o9P4p8J13J6q9J36jNp4K14L95J108o03q02j88N9k7J2o6k3n5K16l7Q0L20o2k93
$$ 88 95 49 120 51 125 47 160 176 87 223 222 227 153 367 762 1870 1267 465 277 336 309 321 255 232 177 393 356 436 756 694 401
565D01j26%p2N1n9p6q5J86p1n6OJ52o0m8K8l2Jp1l4R9oO6j57LJ16J16M8j22l6o0Q2kK0R2n2
$$ 401 275 275 203 254 195 119 34 220 149 93 99 251 191 143 171 139 140 69 35 134 128 194 37 40 156 272 320 198 162 102 184 182 202 294 242
237B42o4P5j01J64j80KJ24o0o3q2J17l6q2J07o0n5J25K5r0J23q1M9j13l5jQ6o4oK0K03j63
$$ 242 178 253 152 316 136 138 262 202 139 57 174 138 56 163 103 48 173 198 108 231 150 199 86 51 50 136 72 66 86 289 126
-54A26J61p8j52J40LN3j12p2N4P1j24K9k6n6N1J9R4j22J3RP2K8j56M1j0K7Njj9J0K9j4m1N7
$$ 126 287 209 57 197 200 253 141 69 123 194 70 99 73 17 68 87 181 59 72 81 153 181 25 66 56 83 88 87 68 78 107 93 52 109
-374A09l4R
$$ 109 75 84
-392H4
##PAGE=	F1=-15826.8
##FIRST=	19140.455529915001534,	4405.895418600002813,	0
##DATA TABLE=	(F2++(Y..Y)), PROFILE
4406A19n2nN1l7n6P3J02RM9j37j6l3k8N9L9j15pKJ35L3Pj38j5L9P0j04j8L7J11Q8j04nL4j8
$$ 119 67 62 113 76 20 93 195 204 253 116 100 67 39 98 137 22 15 17 152 185 192 54 39 78 148 44 26 63 174 262 158 153 187 169
4087A69o6l6J6O3J5J7r7N3k8Rj04L4j5O3j3k0O9k3o7J64j43M5rJ14N8j16o4o5Q9J9j8n8jN5
$$ 169 103 67 83 146 161 178 81 134 106 115 11 45 30 93 80 60 129 106 39 203 60 105 96 210 268 152 88 23 112 131 113 55 54 109
3767A09J47p7j6j09Q2O8o8l5l9J08j22M6j7L3l0n3N0J9mN1J5k6mj9L0q3rM1m0j8L0l9J13n5
$$ 109 256 179 163 54 136 204 136 101 62 170 48 94 77 110 80 27 77 96 92 143 158 132 128 109 139 56 47 88 48 30 60 21 134 79
3448G9O2O4r3k6J2pl1J8J39o4k3O7m8m5j4J4R7N1l9l6j30M8%q7K1J70O9j18lL1l1Q5r7k2J38
$$ 79 141 205 112 86 98 91 60 78 217 153 130 197 149 104 90 104 201 252 213 177 47 95 95 8 29 199 268 150 147 178 147 232 135 113 251
3119B51o2Q4j9p8p1j8O4p6k9RO1O7p2L4K7o9P6j09Q8j2L5m0l5P7M4j06j14N9n1M4K2J70o4
$$ 251 189 273 254 176 105 87 151 75 46 55 116 183 111 145 172 103 179 70 158 146 181 141 106 183 227 121 7 66 15 59 81 251 187
2810A87q3n3M6p4O4J34n0q5P8rpk5k9J9O7r0p4J27l9K3L1Jl0pO7j8k4o2J83j11k9K7r5K07
$$ 187 104 51 97 23 87 221 171 86 164 155 148 123 94 113 180 90 16 143 104 127 158 159 129 122 189 171 147 85 268 157 128 155 60 267
2490B67j77rl3P3k1R9j34j3k4R3J4j4Pm0N6j5nm8k3P5o5J25nj24O3o2J21m9o3J63n0m7n4n4
$$ 267 90 81 48 121 100 199 65 52 28 121 135 121 128 88 144 129 124 76 53 128 63 188 183 59 122 60 181 132 69 232 182 135 81 27
2171B7J2L4K0K64k15J87p9m8N3j54P3o1J24j64l8R5l7j0L2M0J12l6j17q7K7K7Q1jj1m3P4r4
$$ 27 39 73 93 357 142 329 250 202 255 101 174 113 237 73 35 130 93 83 115 155 267 231 114 27 54 81 162 161 150 107 181 87
1871H7M9MK8p0k0Kk6K6J5K1L2J1Ol7j2N5j47R3lR5k6k9q2K8K03n1j46m9J77Kj33o5R0R3k3
$$ 87 136 140 168 98 78 80 54 80 95 116 148 159 165 128 116 171 24 117 114 209 183 154 72 100 303 252 106 57 234 236 103 38 128 221 198
1542A98j8j08R0O2k2j28M0l7l0J3K5o1J92j5M3ro0o0k0l8%k7J07K1o4n3J6J06N9ln8K4rl5
$$ 198 180 72 162 224 202 74 114 77 47 60 85 24 216 201 244 235 175 115 95 57 57 30 137 158 94 41 57 163 222 219 161 185 176 141
1223A41L9j03P4j04NJ9L4k4o4J17q6L8OQ2o8K6p1j5Q4J05j42k2K3O8L4Mr7J33l2j93J25N4
$$ 141 180 77 151 47 52 71 105 81 17 134 48 86 92 174 106 132 61 46 130 235 93 71 94 162 196 200 103 236 204 11 136 190
922A90j7p0J30j65R8l3j14R4o2P0m6N6m1jP1m5P4M6N1k22K70L81J027n79p76j70J09m3Jpo9
$$ 190 173 103 233 68 166 133 19 113 51 121 75 131 90 89 160 115 189 235 286 64 334 715 1742 1163 387 217 326 283 284 277 208
631B08r1K55M6R7K46O6l73j44Mm6m5j3p6q4J85m2r8N8J31j06m5K7k9%r8K7J03q1J07j33k2
$$ 208 117 372 418 515 761 827 454 310 314 268 223 210 134 50 235 193 95 153 284 178 133 160 131 131 33 60 163 82 189 56 34
340C4J21J12K5n9p0p6N9K4L2L1m4n7P1q2J86j79J3J18p6n8m9Q1j5r1P9l0r0R1R0r3J55j03
$$ 34 155 267 292 233 163 87 146 170 202 233 189 132 203 121 307 128 141 259 183 125 76 157 142 51 130 100 10 101 191 98 253 150
40A50M4j02k7j2R7j8j01N5K18j76J93q2j96J56N4K2j24p8N3M9j38P3m4k9N3k3Q7r8lkQ7%q1
$$ 150 194 92 65 53 150 132 31 86 304 128 321 239 43 199 253 275 151 73 126 175 37 110 66 37 90 67 154 56 53 51 138 138 57
-270E7K3oj9K0K4m6L5K1Nn9M1j8M1
$$ 57 80 74 55 75 99 53 88 109 114 55 96 78 119
-392A19
##PAGE=	F1=-15905.5
##FIRST=	19140.455529915001534,	4405.895418600002813,	0
##DATA TABLE=	(F2++(Y..Y)), PROFILE
4406A38r8k5R6m9l2O7R5j1O9j23jl9k3N6N0j05l1N3R0K5L0j42o9J7J22j41O0K9P4Q0p5j5j8
$$ 138 40 15 111 62 30 97 192 181 250 127 126 87 64 120 170 65 34 87 177 202 232 90 21 38 160 19 79 108 182 262 187 172 154
4096A54m7k8k4J1O9oK5j00M0J0Jq7K6j8P0Nk2L8Rk7R8j56M9L4Q2O0j10l3j02J02Kl8k2j1P1
$$ 154 107 79 55 66 135 129 154 54 94 104 105 18 44 26 96 101 79 117 126 99 197 41 90 124 206 266 156 123 21 123 125 87 65 54 125
3767A25J48n5l3j20N9N9k6m1l5M3j17P8j4L0l8lJ5j7qN6M3L4K3o4L3r0rJ3l3m4L9k5J12n3
$$ 125 273 218 185 65 124 183 157 116 81 124 7 85 71 101 63 60 75 58 50 106 149 183 206 142 175 85 76 89 56 12 51 26 138 85
3448H5N6L7j03LmnkK7J16k8j9K1k7j2m8L7O1L8K5k3j71P4Nj12KJ54N1j17L2j8K9N9j20J9J65
$$ 85 141 178 75 78 74 69 67 94 210 182 163 184 157 145 97 134 195 233 258 235 64 138 143 31 33 187 238 121 153 135 164 223 103 122 287
3119B87q2N8m8o4k3l7O0p7L1m5O6L9o4O5Oo9L2pO2rMp5%M9K7p6n8N1n3OJJ39m0o7n2M4o3P4
$$ 287 205 263 215 151 128 91 151 74 105 60 126 165 101 166 172 103 135 128 190 181 185 110 110 159 186 110 52 103 50 56 57 196 156 89 37 81 18 92
2763I2J27l6j17P2J5J0o8n3O7R9j12n8Q8o6Q8J3L6o8RO0nm7p2J85j43J1M3j06K11j72n1k5
$$ 92 219 183 66 138 153 163 95 42 109 208 96 38 126 60 148 161 197 129 138 198 193 146 74 259 116 127 170 64 275 103 52 27
2462B7J10p6N9o1k1lR9j9j8K9n6L9rM4j03J3J23o4R4Kj15L5p3J30j8j50K18m3o9k9m5j9K5
$$ 27 137 61 120 59 38 35 134 115 97 126 70 109 100 144 41 54 177 113 207 209 94 129 56 186 168 18 236 193 124 95 50 31 56
2152E6J1K33k09K39n7p1P0j28Pn3J24j46n5Q4m2L6nQ1J28n9j21j09L9KP4K1ol6P2j14P7KK1
$$ 56 67 300 91 330 273 202 272 144 151 98 222 76 21 105 63 99 94 175 303 244 123 14 53 55 129 150 144 108 180 66 143 145 166
1842A66m8l2k4m2J8N2LJ5Q0Mr5K1J3r0R6J2Q3l9m4o0m2K17Nj69o4K15L9j46n2K4J10QJ6j78
$$ 166 118 86 62 20 38 90 93 108 188 192 97 118 131 41 137 149 232 193 149 89 47 264 269 100 36 251 290 144 92 116 226 234 250 72
1523G2J06K5Mj14L3l3l2j5R9n9J34J0L2j0n7q1n2k6L9kO9K3j00l6K2J10L5qnM2j4o3J7j12
$$ 72 178 203 207 93 126 93 61 46 145 86 220 230 262 252 195 114 62 36 75 73 142 165 65 29 51 161 196 188 183 225 211 148 165 53
1204E3R0j35%N2P1l0q0J08n6L7J7N7l9K7o9QPR3j16m4N0L2N3J8r9J37j8j63O1R8m5p1J37j95
$$ 53 143 8 8 60 131 101 21 129 73 110 127 184 145 172 103 111 118 211 95 51 101 133 186 204 105 242 224 61 122 220 175 104 241 46
885D6J08o5m4Q8q6Q0j8M3K1j29J16j2j4R3R0l01K95L54R40n30p51k00J62l9j0N7k1j59J82
$$ 46 154 89 45 133 47 127 109 152 173 44 160 148 134 227 317 16 311 665 1605 1075 324 124 286 247 237 294 273 114 296
612B96K06K42K52J10m42k57k2Kj59J6q4p7J73j1j52J27J04j55n9K3j5K1j13O3J04j60J70j36
$$ 296 502 744 996 1106 664 407 385 387 228 244 160 83 256 245 93 220 324 169 110 133 118 139 26 89 193 33 203 67
349F7m3J05J06J0Pr9o1NL7O6j8n2l9M7m6J86j76M7J10p9p6j0L0J5l1j2j4k1N5R2j17J77j32
$$ 67 24 129 235 245 252 153 92 97 134 200 182 130 91 138 92 278 102 149 259 180 104 94 124 139 108 96 82 61 116 208 91 268 136
40A36M5r1koQ4J5j58O5K18j84K10q6k15J59Q2Kj29o8M7K6j39J15m5ML8m6M1m3kk2P0k9MjK3
$$ 136 181 90 88 82 166 181 23 88 306 122 332 246 31 190 272 274 145 77 124 150 11 126 81 85 123 77 118 75 73 51 121 92 96 95 118
-289A18o1j7M9k8L0J8J9p4K4RO1
$$ 118 57 40 89 61 91 109 128 54 78 87 148
-392A48
##PAGE=	F1=-15984.3
##FIRST=	19140.455529915001534,	4405.895418600002813,	0
##DATA TABLE=	(F2++(Y..Y)), PROFILE
4406A47q8k1O0n1mM7R5k1Q2j01rl4j7M7P0p2n5O6M0L0N0j32p8l1J37j44J11J7M0P8m8m1n4
$$ 147 59 38 98 47 43 90 185 164 246 145 136 102 85 132 202 130 75 141 181 211 261 129 51 20 157 13 124 141 181 259 211 170 116
4096A16p1J1j9PO1l7N3r4L3M5j6p7O7k9M1K6j8lM3RL6j66N3O6M1O7o8j5j35R6Mp1K3rP5J25
$$ 116 45 56 37 44 105 68 121 27 60 105 89 12 79 50 91 117 99 96 139 148 184 18 71 137 178 245 177 162 27 123 127 56 79 70 145 270
3758B70k4n7p5J0M3Lk9m1k0k6K1J4L2o8M6k7k2L8QL4Q0P1j17L4r8Pj4n1j1M7m1J03m0J8K5
$$ 270 246 189 114 124 167 170 141 100 80 54 75 89 121 53 99 72 50 88 96 130 210 281 164 198 100 107 93 42 31 78 37 140 100 118 143
3429A43j05K2j9J2L5J3Q8kj2mmL0j03P4PK5P5Lj60M4Rr9l8J23L2j14O8o5J00K4j13M5J57q9
$$ 143 38 60 41 53 88 101 189 187 175 171 167 197 94 168 175 200 275 278 118 162 171 72 34 157 189 75 143 78 178 202 89 134 291 202
3110B02K0q5l3M6n2M7o1O4q4Q3om9Q9j8n3j5Q2L9j3k1j10M8mK7j4m1L7l6qn7J11Pn5o6N0l4
$$ 202 222 137 104 150 98 145 84 148 64 147 141 92 181 163 110 95 177 216 203 182 72 120 116 143 129 88 125 89 81 24 135 142 87 21 71 37
2772C7M7J15k5j13M9L9K7j07n9J34R0j29m9M5p2J53k8O3j00M1M2j2o1n8J64j66M7N3r5J89
$$ 37 84 199 174 61 110 149 176 69 10 144 234 105 56 101 29 182 154 217 117 158 200 188 127 69 233 67 114 167 72 261
2490B61j58q3P6O2j29L6K1m4jJ03n3nN2n5%j0R3j53O6J26n5O0K0j09L2n7R9J6j68J82j9r1
$$ 261 103 20 96 158 29 65 86 42 41 144 91 86 138 83 83 73 166 13 79 205 150 210 230 121 153 96 195 211 43 225 206 115
2190A15kl1o1K4rJ84j87K69l1p0P4q3n0p3J16j15o3O3m3Q6l7J04J28p3j10j09K9K3J1L3J1
$$ 115 113 82 21 45 36 220 33 302 271 201 275 192 142 69 185 70 7 70 27 113 76 180 308 235 125 16 45 68 79 112 123
1899A23j3O2j18Q6J3L1n3m4m2k9lO0mQJ34k2j32O8m7L1P2lO0j6p6l8q8K14N8j96p2K16Q2j43
$$ 123 110 172 54 140 153 184 131 87 45 16 13 73 69 77 211 189 57 125 78 109 181 178 238 222 146 108 20 234 292 96 24 240 322 179
1579A79l5m3J08M9M0k25J09j3K2q8K3k3l5l1J52k2P8%K8k1n3r1o9J0L6K3K2K6r3l0J1J04J0
$$ 179 144 101 209 258 298 73 182 169 191 103 126 103 68 37 189 167 245 245 273 252 199 108 39 49 85 108 130 156 63 33 44 148 158
1270A58j6M7M9k2n4j6o5Q6j29PK0J06n5n6O0k8O8K1J8k9K3n5K1l9L8n9p2O9J0P2N0j14J24
$$ 158 142 189 238 216 162 146 81 167 38 45 65 171 116 60 120 92 160 181 199 170 193 138 159 120 158 99 27 96 106 178 228 114 238
960B38j1j24oJ26o3m9J17j79P1n6L1N6j04R1RK0P4j68R9mr5J25J12k46K23L35Q59m41o82k96
$$ 238 227 103 97 223 160 111 228 49 120 64 95 151 47 138 147 167 241 73 172 168 73 198 310 64 287 622 1481 1040 358 62
678F2J83%L3N7R0j41kL74N07M39M1n89m57j02K5k29J3j08n9J53J5k22K17O7k04q0J9LN4j17
$$ 62 245 245 278 335 425 284 282 656 1163 1602 1643 1054 597 495 520 291 304 196 137 290 305 83 300 367 163 83 102 105 159 42
396D2P8J03j51J63j65l6N6R0J3N8j14k3m9K5J18l3o7l9RJ4J38j57P9R9o4j05K4k2N5K8p4l0
$$ 42 120 223 72 235 70 34 90 180 193 251 137 114 65 90 208 175 108 69 78 92 230 73 152 251 187 82 106 84 139 167 93 63
96F3N1Q3M2j42J73j58N0q6K7J6N5M0j80N2K03j81K11r0j86J40P8j1j25m4L5Oq7J10l2K7K0
$$ 63 114 197 239 97 270 112 162 76 103 119 174 214 34 86 289 108 319 229 43 183 261 250 125 81 116 122 35 145 113 140 160
-195A60k2l7J%l0L5l4N3j7P3o5o9J6J8OJ8K1p8J6L1O8
$$ 160 138 101 102 102 72 107 73 126 109 182 117 48 64 82 88 106 127 49 65 96 164
-392A64
##PAGE=	F1=-16063
##FIRST=	19140.455529915001534,	4405.895418600002813,	0
##DATA TABLE=	(F2++(Y..Y)), PROFILE
4406A46n5j5J0l9kK0J11j5Q3r0l1k5j7N7R0n1p2N7lM1P2j08o8j4O4r8J07kK5Q1m0p2n2p7K4
$$ 146 91 76 86 47 45 65 176 161 244 154 123 98 81 138 228 177 105 162 159 200 272 164 96 82 146 48 155 153 178 259 219 147 95 18 42
4077D2k5L8Nm8R1q2L0N5l3o2R6j7j7N1Jn6P0L1nj46M5O6lQ4Jj4j44O8K3j18O8oP0R3J1q8k5
$$ 42 17 55 60 12 103 21 51 106 73 11 107 90 73 124 125 69 139 170 165 19 64 130 127 211 212 198 54 122 145 27 95 89 159 252 263 175 150
3730A50k2L1Qj1m1p0M7k3O3K1j05Q1o2%P0l7LJ07J16j57L6j08L4l3p4M9M8q5J06j8m8K9q1
$$ 150 128 159 167 156 115 45 92 69 132 153 48 129 67 67 137 100 103 210 326 169 205 97 131 98 24 73 121 36 142 124 76 105 24
3420B4K3l1M5N1j2N3J2MmRO9j58J12n7J4J15K9j37MJ7o9q3Q4K8j08Q4r7J61j6p7M6J33q7k4
$$ 24 47 16 61 112 100 153 165 169 165 174 243 85 197 140 154 269 298 161 165 182 113 30 114 142 34 118 21 182 166 89 135 268 181 157
3101A57j19J1J24n8K4m9P8j00J04n9k2J03m4k3o0J44J4j6l7j40J03p5N7L2l4J7j8j2o0Q9L4
$$ 157 38 49 173 115 139 90 168 68 172 113 91 194 150 127 67 211 225 209 172 32 135 60 117 149 115 132 114 102 42 131 165
2810A65n9o4K8k3K1J02k1p6K0N5L0j16qJ38N7j38m7Rk5J64p6Q1j20O8K8l6n9l1J27j53M7N8
$$ 165 106 42 70 47 68 170 149 73 93 148 178 62 54 192 249 111 64 73 48 212 136 217 97 165 193 157 98 67 194 41 88 146
2509A46p0J46j38p3J38K0j32O6K2m9l1J03q9M8N1n6l9pJ31j78R5J02l5K8M4j05M1m2P3M3j71
$$ 146 76 222 84 11 149 169 37 103 125 76 45 148 59 107 158 102 63 56 187 9 104 206 171 199 243 138 179 137 210 253 82
2218H2J16J4j02J3pj03L3j9J05j10K30mn0O6l1p9j02J01r0l5Ok0J10n9J05J12q0q3p4j0O3
$$ 82 198 212 110 123 116 13 46 27 132 22 252 248 198 264 233 154 52 153 63 28 34 14 124 65 170 282 202 119 45 35 98
1927I8o6L3L9NM7r4O0L8N7q2m9k8oNj1KJ0J61o0p3M9j15J57N7k8K2L0r5m0q4J84Q8k17m2J47
$$ 98 32 65 104 109 156 62 122 160 217 135 86 58 52 57 46 48 58 219 159 86 135 20 177 234 206 228 258 163 123 39 223 311 94 52 199
1598A99J26j29k1p7P2R1N5k44J02m9K8n1Mol2m0J79J6N2l0L5m4m4q0n9J0K0M4j7L6p4l3PP5
$$ 199 325 196 175 98 170 261 316 72 174 125 153 102 106 100 68 28 207 223 275 245 280 236 192 112 53 63 83 127 110 146 72 39 46 121
1279A21rk2Q1M9k6j3m1k4R7j46K5J5J12q7l3J9j6J08J6j2l8Pk0J9o6k8K8j00O4J6P5R7j38
$$ 121 112 90 171 220 194 181 140 116 213 67 92 107 219 132 99 118 102 210 226 214 176 183 163 182 116 88 116 16 80 96 171 268 130
969A30R7j8q6n8J29o1jO3j26%L1K5L9j05R6K8k2J15j88Q4j2j26J26J04j81J64L12Q05l03o01
$$ 130 227 209 123 65 194 133 132 195 69 69 100 125 164 59 155 183 161 276 88 172 160 34 160 264 83 247 559 1364 1061 460
687D60k82Q4M5J15QJ73j11m8M31Q09P15n2q17o86k10Nk45j1j42l3J30K8k95L12J7k39q9J3
$$ 460 178 262 307 422 430 603 492 444 875 1684 2399 2347 1530 844 634 639 394 383 241 208 338 366 71 383 400 161 72 85
425H5J3Q0j19R7R7j01J21k03J2QK3M2P3j08K3l9j2J37k8o3o0rM8N9j00O5R0m0j29N1o2R4O8
$$ 85 98 178 59 156 253 152 273 70 82 90 113 155 228 120 143 104 92 229 201 138 78 69 117 176 76 141 231 191 62 113 51 145 213
115B13r1n9J03J04Kj56J42j78O1r0N6N2J0N8j94M3J76j66K02r7j10J07M1k1j16j1K3rl1R6
$$ 213 122 63 166 270 272 116 258 80 141 51 107 159 169 227 33 76 252 86 288 191 81 188 229 208 92 81 104 95 64 160
-167A60j2M6%K0q7jnl1J1ML6k1J29o0o6n8L7k3K4Qp0J8L9O7
$$ 160 148 194 194 214 127 126 121 90 101 105 141 120 249 189 123 65 102 79 103 111 41 59 98 165
-392A65
##PAGE=	F1=-16141.8
##FIRST=	19140.455529915001534,	4405.895418600002813,	0
##DATA TABLE=	(F2++(Y..Y)), PROFILE
4406A32j9j4j4j2l8pJ38%P4r4n0j0k8Q6R9m6p7K4l1N8R4p1o0OKo2R0k3L8Q2n6j01Lm9j7k0
$$ 132 113 99 85 73 35 28 166 166 240 146 96 86 58 144 243 197 120 144 113 171 265 194 134 140 142 80 170 147 185 267 211 110 113 64 47 27
4068B7P5p2N1L2p8L7L2l7k0P8Mq3P2L6j10Q0M2j5j16M3K5m0J16P0k1j32M2L0j65J12pN9N6
$$ 27 102 30 81 113 35 72 104 67 47 125 129 46 118 154 44 124 166 151 35 78 103 63 179 249 228 96 138 168 3 115 108 167 223
3758B23M9j15Ll7L0nQl2q6Q1m7J10kj34R7q4K4Q7p2k6J17J46j75L3j12O3m5n0O5M3j30J17
$$ 223 272 157 160 123 153 148 156 124 38 119 72 182 180 46 143 59 83 170 98 72 189 335 160 193 81 144 99 49 114 157 27 144
3458A44K0j25K8k4J4j9O2L9n2K2J1L1J4J2R4j88J28j16NJ48M9j12k8L2l4j25L6O3o2K2l9J25
$$ 144 164 39 67 43 57 38 100 139 87 109 120 151 165 177 271 83 211 95 100 248 297 185 157 189 155 30 66 129 67 89 50 175
3157A75n7l2L4J04p7o5j1j9J42n0nn5P7r0J19j04J0J09o7J2r6J70j1j0m5j30J26j31R2L7j7
$$ 175 118 86 120 224 147 82 71 52 194 144 139 84 161 71 190 86 96 205 138 150 54 224 213 203 158 28 154 23 115 152 135
2866A35rqj7k2R0K6o5m7kl8J5Q6k2l4J0M2K2p7J1J33J9j42m7j1K6J51j21R2j18P5K4p0m2l
$$ 135 126 118 101 79 169 195 130 83 81 43 58 144 122 88 98 140 162 85 96 229 248 106 59 48 74 225 104 196 78 153 177 107 65 62
2547F2Q5p7j3P4o0R2j14j2J41j4j11J04Lm0p4R9j24J27K8o5o6J8J40j81R4O7j0KP0j02N3l6
$$ 62 147 70 57 131 71 163 49 37 178 164 53 157 160 120 46 145 21 148 176 111 45 63 203 22 116 183 173 175 245 143 196 160
2246A60O6N9j77N1M1r8K2K3j20K5OJ1kJ23K2k0M4J7p8r0Q4r9qk7LR1o7Q5Q6q2m5k8m0Q1n2
$$ 160 226 285 108 159 200 102 124 147 27 52 58 69 67 190 212 192 236 253 175 85 169 70 62 35 38 129 62 147 233 151 106 78 38 119 67
1918F7MM5j6L2n1J4O4Q9j14m8m%J9o8L6j7J60j02N2j3j09J94N0m9k6P4q8n9o5J62R0k32LM6
$$ 67 71 116 100 132 81 95 159 248 134 86 82 82 101 33 69 52 212 110 162 149 40 234 284 235 209 283 195 136 71 233 323 91 94 140
1598A40J57j07qp4PJ28O3k38Q7q2K6rj9J5k9l7J79M9M0o3N2p1k4m6n8k0QO4l0N2p7l0K1J3
$$ 140 297 190 182 108 115 243 306 68 155 73 99 90 71 86 57 20 199 248 288 225 277 206 182 136 78 58 66 130 100 152 75 45 66 79
1279G9j3j3P7N2k9M6n1qJ23j75M6L8R9j18k6Ol2J40Ok4n5k3L2Lp9o8J11j01K1N3M5J46j58
$$ 79 66 53 130 182 153 199 148 140 263 88 134 172 271 153 127 133 101 241 247 223 168 145 177 180 101 33 144 43 64 117 162 308 150
969A50O3m0n3q3J01k6N2j4o3m7J23k5L2q9R4L8q1J38k05P9k3p3R0M7r0R5K62Q13j54n64k46
$$ 150 213 173 120 37 138 112 164 150 87 40 163 138 170 81 175 213 132 270 65 144 121 48 138 185 95 190 452 1265 1111 547 301
678C01L8N7J90k9K04q4j4M37J084R79j25j066q88l13m8k15m7j66qJ01K8l32L74m9k45q5J5
$$ 301 339 396 586 557 761 677 663 1100 2184 3163 3038 1972 1084 771 723 508 461 295 287 388 416 84 458 409 164 79 94
425I4J0P9j02J12Q7m8P1k27O5Lq6R0M2r2P0lj5J01k9n4o6OL2mk2%Q3j5j33P1n4Q6Q6r1o6J36
$$ 94 104 183 81 193 280 232 303 76 141 144 58 148 190 98 168 165 150 251 222 168 102 108 140 136 114 114 197 182 49 120 66 152 238 147 81 217
86B17R9k0j59R5j89Q2r1P7Q9n0O9k02M1J43j34J81j07j5P4j1l6j02K1K1k1J0Q0J1N9j9O7j12
$$ 217 316 296 137 232 43 125 34 111 200 150 219 17 58 201 67 248 141 126 200 189 153 51 72 93 72 82 162 173 232 213 280 168
-214A68k8j6k7PN0rj5J73n7m7q9Qn3M0j7n5K3L1O2
$$ 168 140 124 97 104 154 145 130 303 246 199 110 118 65 105 88 33 56 87 149
-392A49
##PAGE=	F1=-16220.6
##FIRST=	19140.455529915001534,	4405.895418600002813,	0
##DATA TABLE=	(F2++(Y..Y)), PROFILE
4406A08J4j4j7J3q6J0J27J5N9j08l8Km2J16Q6n4p2k5m1Q7J09l5n6K4k6n3O6l6P2P2q8j13P2
$$ 108 122 108 91 104 18 28 155 170 229 121 83 85 43 159 245 191 119 94 53 140 249 214 158 182 156 103 169 133 205 277 189 76 148
4096A48m7l4k1J02r1P9nq6N0Lk1J5M2K2j35Q1Q5j43N1M6J0j09N7l6l1J36J09l1j04L2Pj59
$$ 148 101 67 46 148 57 136 131 45 95 98 77 92 134 156 21 102 187 44 95 141 151 42 99 63 32 168 277 246 142 174 181 22
3796B2J13qM7J3Q8j27jm0M0k9K5j5p6Q8n5J40l0j51R7r3M4R5j04m0J12J57j60J3j09Q8n5%
$$ 22 135 127 174 187 275 148 147 107 147 118 143 128 52 140 85 225 195 44 141 48 92 187 83 43 155 312 152 165 56 144 89 89
3495H9N3L5j46J10P4j40l7K2K1j0Q0J8j06J9k2P6L1OJ03j80J06j54mJ78N9r4m1N3mj45j7J17
$$ 89 142 177 31 141 215 75 38 60 81 71 151 169 63 82 60 136 167 173 276 96 202 48 44 222 281 187 146 199 195 50 33 150
3195A50l4l9K0O1r1PK0P9o2r0J31n0J08l7k7p6O2o1J24j28L4J11q4M8j20J60l5K3n3r0J11
$$ 150 116 77 97 158 67 74 94 173 111 21 152 102 210 173 146 70 132 71 195 67 101 212 128 176 56 216 181 204 151 61 172
2903A72j07N4J1J6l5j0k3K4Q6J6n8k2k5o7L4O5k5qK1JK1k6J9J14k2j41m5kM9J32j57R6r5O0
$$ 172 65 119 130 146 111 101 78 102 188 204 146 124 99 32 66 131 106 98 119 120 141 115 134 248 226 85 40 38 87 219 62 158 63 123
2584A23K8q8l0K8L6Rm7R2r6M8q7M3J25l4r8J30Lk2j15Q8r4J43%p4p9N8J22j77P8L1J7j8R1
$$ 123 151 63 33 61 97 106 59 151 55 103 16 59 184 150 52 182 185 163 48 136 42 185 185 111 32 90 212 35 113 144 161 143 234
2274B34j01O5l7P3O5j78nM8p6L4N2j22jM3rJ6K5M7RJ1N1n6m3Q4j36Nl4j5Q0o2N2N4p9nJ7n1
$$ 234 133 198 161 234 299 121 116 164 88 122 174 52 51 94 85 101 126 173 182 193 244 188 145 229 93 98 64 49 129 67 119 173 94 89 106 55
1936E5O7%RK4p2J8jj7N9J26j36m3OJ7K7p4O0p0J36j37J80p0p2J80M8n9p4R5n6q3l1J44P1k41
$$ 55 122 122 131 155 83 101 100 83 142 268 132 89 95 112 139 65 125 55 191 54 234 164 92 272 320 261 187 282 226 143 112 256 327 86
1617H6M9m8J59q3Mm6o6J52O8k15P1j10K5K3j0K0m0nJ35P7K6q5P4r2Rnp9n8mQ9mN3j03j1M7
$$ 86 135 87 246 163 167 121 55 207 275 60 131 21 46 69 59 79 39 34 169 246 272 187 261 169 178 173 94 36 32 121 117 170 67 56 103
1288A03p3JK5K1O8l2J01n4mJ51k09O7P6P8j37m5K2o7J50lj7p2n9R3k2q4j4J05r5qQ5lJ89j69
$$ 103 30 31 56 77 145 113 214 160 156 307 98 165 241 319 182 137 159 92 242 239 222 150 91 184 162 78 64 169 74 66 151 148 337 168
969A68L1p5k8q1N0M4Q4r1o%J29q8L2o0Q8L6j46J40k01P6m1lQ7n4M1K1J64Q98o1n79j95L7M5
$$ 168 199 124 96 15 65 109 193 102 96 96 225 137 169 109 197 233 87 227 26 102 61 58 145 91 132 153 317 1215 1154 575 380 417 462
659D62K50m3J95o5L5M28J280J160j68j264j018l85j12j50q9j65LP3J4l08L73j18k20p6L3%
$$ 462 712 669 864 799 834 1262 2542 3702 3534 2270 1252 867 755 605 516 351 354 427 441 133 506 388 168 92 125 125
415A25M6n9J12P4LJ6k20R6Pj41J04j5q5J19L1jN1m4m7m5K1kj6K2p6P9Jj10Q5j2L2Q8r3n4J71
$$ 125 171 112 224 298 301 317 97 193 200 59 163 148 63 182 213 212 263 219 172 127 148 146 130 152 76 155 156 46 131 119 151 239 146 92 263
86B63O8k4j51N1k01J11n2O1J06j11P5j81J8J06o5J37j15P1M1o4n7p5M3L1l1K9O1K9P0l3J10
$$ 263 331 307 156 207 6 117 65 126 232 121 196 15 33 139 74 211 96 167 208 144 87 12 55 86 55 84 145 174 244 211 321
-205C21j25n3k7j8J4Q1n4kJ94n6k1r5l1p9O3m1m2K0J4N7
$$ 321 196 143 116 98 112 193 139 137 331 275 254 159 128 49 112 71 29 49 63 120
-392A20
##PAGE=	F1=-16299.3
##FIRST=	19140.455529915001534,	4405.895418600002813,	0
##DATA TABLE=	(F2++(Y..Y)), PROFILE
4406H0M2pk4L8j24P1P0J9M3j25J6Kl6J13N5p2n6p0k8J29R9j1o1L8k2o4M4l7J03N0j17r2J07
$$ 80 122 115 91 129 5 76 146 165 208 83 99 101 65 178 233 161 105 35 7 136 235 224 163 201 179 115 159 122 225 275 158 66 173
4096A73m9k9l9J20r0P7k6q9O5k5OM3%K6j32N4J34j40j9N0N0j22P5p0L9R9J12m2o9L0l2j21
$$ 173 124 95 56 176 86 163 137 48 113 88 94 137 137 163 31 85 219 79 60 110 160 38 113 43 82 181 293 251 182 212 180 59
3796E9R5pL4l4J22j18l3l2N0m7L7Oo8R5n4J51n9j54Q1q9N8J00j36k6R3J48j13l4r8J12p1N1
$$ 59 154 147 181 147 269 151 118 86 136 89 126 132 64 159 105 256 197 43 124 35 93 193 57 31 124 272 159 125 27 139 68 119
3495A19L5K2j27Q2J32j27j08L7L8mJ00oj52N2n9J08J8JR9j44N8j65oJ94O3q7m3P9K0j49k8
$$ 119 154 176 49 131 263 136 28 65 103 99 199 193 41 93 34 142 160 161 260 116 174 9 3 197 260 173 130 209 229 80 52
3204E2J21k3n8L5J0j14M2%O2l3l3J36o3P8k3l5q8K0k4J28j30L7J14q8P7j28J21n0Q3o2p7R6
$$ 52 173 150 92 127 137 23 65 65 127 94 61 197 134 212 189 154 66 86 62 190 60 97 211 123 200 72 193 143 226 164 87 183
2903A83p7Nk4N7n1k1k7N9O3J8l6Nm3o6L7N2k3j1M5n3M9mK7Q6o5j36k5K5L8J07j69Q4n7L8L0
$$ 183 106 111 87 144 93 72 45 104 167 185 149 154 111 45 82 134 111 100 145 92 141 137 164 250 185 49 24 49 87 194 25 109 52 90 120
2575A20l7q1P0k3Q2k8R3j66M5l0L2R9l8j03J37K3Lj43O6k4J06k7o9p2Q4R5j64M6NL6k5R8j02
$$ 120 83 2 72 49 131 103 196 30 75 45 77 176 138 35 172 195 198 55 121 97 203 176 107 35 119 214 50 96 101 137 112 210 108
2265A08P5l9Q6N8j64k9J4k8M2P2j16l5Q3jon1Q0J7k3O7k7K5Q8j78J4m8m0Q1n0K0K0m6J0M1
$$ 108 183 144 230 288 124 95 109 81 123 195 79 44 127 126 120 69 149 166 143 210 183 208 296 118 132 84 44 125 75 95 115 69 79 120
1946A20m8L9N2K4Qj34LN2nkJ62j35m7JN2K5o2P7j20R9j37K62j14l7J52M9n7j03P6pj01J0J32
$$ 120 72 111 163 187 195 61 64 116 111 109 271 136 89 90 142 167 105 182 62 161 24 286 172 135 287 336 279 176 252 245 144 154 286
1636B86L6k41Q5q5J02o6K1j2r5J31P0j83O0o8L3k9O0kq7M3O6R9Lr1R2r2M7K3j11q7OR4M2L8
$$ 286 322 81 166 81 183 117 138 126 31 162 232 49 109 41 74 45 105 103 16 59 125 224 227 136 228 136 183 206 95 8 14 108 150 188
1317A88j34K6P0j08nL9l1Q2m0J35n8OJ66k37Q2J18N8j43q9O0j01J26nMq0q4J45n3q0L5Q9q8
$$ 188 54 80 150 42 37 76 45 127 87 222 164 170 336 99 181 299 357 214 125 185 84 210 205 209 129 45 190 137 57 92 181 93
1016I3j4R9m7K12j61Rj11k1m3LJ01Q8j45L0O5J16j48L5k2P7K7k06J24q7K6l8j5J15j16J34
$$ 93 79 178 131 343 182 191 80 59 16 19 120 208 63 93 158 274 126 161 139 216 243 37 161 74 100 62 47 162 46 180
734A80oO1R84o4o16j44N7J9K93l7J63n5P2M06J353J218j78j358j045m11j64o6j28j42LM6j1
$$ 180 174 235 1219 1155 539 395 452 471 764 727 890 835 907 1313 2666 3884 3706 2348 1303 892 728 662 534 392 395 441 430
481D30k39L27j83j66o3O0rj6KR7O3M4l8j82J01kj51J03n1j11J67N4J6Mo6m4%L3m1QK6j13N9
$$ 430 191 518 335 169 106 166 157 141 143 240 303 347 309 127 228 226 75 178 127 16 183 237 253 257 191 147 147 180 139 147 173 60 119
171A19lo3R9K8l7P5j02k7K09J8j3j33K3j68Q7jM4R1j56P3j17l5O4L1Q2j08J13Nj02o5K4lL1
$$ 119 116 53 152 180 143 218 116 89 298 316 303 170 193 25 112 111 155 246 90 163 46 11 75 106 188 80 193 198 96 31 55 52 83
-139H3m0K7M1L5P4l5J43j27o5l2oK0R6q5RJ94o2Pq3n9j01Q3m7m3J4j1O1
$$ 83 43 70 111 146 220 185 328 201 136 104 98 118 214 129 138 332 270 277 194 135 34 117 70 27 41 30 91
-392I1
##PAGE=	F1=-16378.1
##FIRST=	19140.455529915001534,	4405.895418600002813,	0
##DATA TABLE=	(F2++(Y..Y)), PROFILE
4406F5O0Pm9O1j17R5J6J1K8j33P7mk8J01K0r2l6j2j8J13O4np1M3%p9L1k9J10K4j34m5J05m5
$$ 65 125 132 83 144 27 122 138 149 177 44 121 117 89 190 210 118 82 70 52 165 229 224 153 196 196 117 148 119 229 253 119 74 179 134
4087A34po8J21q6O4k9q0P6n3L8O4m5J9r5K3J67j21q7M8P6j25Q2m1M6Q0R4n4l7K9o7o0O3jJ7
$$ 134 127 59 180 94 158 129 49 125 72 110 174 129 148 53 76 243 122 35 83 159 34 116 75 121 201 295 241 204 233 166 106 169 168 185
3767A85q0J44r6o5k2N4n0M4K2o9J12m7J42q6j46N8p6P0J08j68J0O8J26n4j06o7J36j05R4J2
$$ 185 105 249 153 88 66 120 70 114 136 67 179 132 274 188 42 100 24 94 202 34 44 112 238 184 78 11 147 42 136 148
3486A48Qr0M9J76j07j55L1N8nJ16k6j47O3l6Q7k8JQ4r2Rj23J8J34P2r3m5J03M5j47k4R5j8
$$ 148 156 66 115 291 184 29 60 118 113 229 203 56 119 83 170 142 143 227 135 144 21 39 173 245 152 107 210 255 108 84 179 161
3185A61m1K1k3j06O3l2N8OkR5o1N5j2k1o8o2J6J36j15J4J20p9R6j21P3n4J43o8r0P9n1m2n1
$$ 161 120 141 118 12 75 43 101 107 105 200 139 194 182 161 93 31 47 183 68 82 202 123 219 98 171 117 260 192 102 181 130 88 37
2875C7Q6m8k5j4N1K7L2oK8n8k7RO4j9m0O7q8R4k5L2O1j04j03L0J4J1P2j06Oj6M6PL8j01O5
$$ 37 123 75 50 36 87 114 146 140 168 110 83 92 156 137 97 164 76 170 145 177 238 134 31 61 75 86 158 52 58 42 88 95 133 32 97
2547I7q5J30PQ3k19P0KQP0k4j33J25O0L2j54K9M7M7m6l9n9R4P0j48OnM1j7Q8j06Q6l9R8L7
$$ 97 12 142 149 232 13 83 85 93 163 139 6 131 191 223 69 98 145 192 146 107 48 142 212 64 70 65 106 89 177 71 157 118 216 253
2227B53j32lp4N0L2Q3j00n3R4kk8p2J00lm7P0j3J05Q3k09K5p0o0Q8l6knK5rK2l5J5Q7M1Jj81
$$ 253 121 118 44 94 126 209 109 56 150 148 120 48 148 145 98 168 155 260 343 134 159 89 29 117 81 79 74 99 90 112 77 92 179 220 221 40
1889D0j9J12K3q7J91j13o3j3R9J3m5Q9j62O4o9K50j41jJ19M7m8j01J4M8j11N3J23pk29J04
$$ 40 21 133 156 69 260 147 84 71 170 183 138 227 65 129 60 310 169 168 287 334 286 185 199 247 136 189 312 305 76 180
1608A80o8Qn9M2J7m2M4O4j48N8lM6j06J27j5j26O1lJ14k9q2J02n9O7L4j42m7L1L5P8J4j51
$$ 180 112 120 61 103 120 78 122 186 38 96 93 139 33 160 145 19 80 77 191 162 80 182 123 190 224 82 35 66 101 179 193 42
1307D2P6Q0j09l4L6j7N2n8J50o4K7J64k53R0J52M4j39j44J13j14N7%L8q0o4J51q1o0L5R5r5
$$ 42 118 198 89 55 91 74 126 68 218 154 181 345 92 182 334 378 239 95 208 94 151 151 189 109 45 196 115 55 90 185 90
1016I0oJ05p8K13j36Oj12m6J0L2N2P5j69M2J23J01j90L8J4O4J3k24P0N2J1j6j10J43m7R3N
$$ 90 84 189 111 324 188 194 82 36 46 78 130 205 36 78 201 302 112 150 164 228 241 17 87 139 150 134 24 167 120 213 218
725B18P6R49j36o46j15Q2j3L16j7J22n2Q4L69J291J143j62j320r66l89j91K2j60j03mK8m4
$$ 218 294 1243 1107 461 346 428 415 731 714 836 784 868 1237 2528 3671 3509 2189 1223 834 643 665 505 402 398 426 382
481C82j44K53k33r5l9P8j2r1O6P1N4P2q2j24Q5l3j47J21l3j04J31N9L0l3q2m1N4M3p0K4J1
$$ 382 238 491 258 163 124 202 190 99 165 236 290 362 280 156 241 208 61 182 149 45 176 235 265 232 150 109 163 206 136 160 171
190A71o9Ql9lJ10O3j10N2j00mK35l6Mr9J2j44N5M4L3N1j74O8n2m6OJ08L8q9J06l3j18K1L5
$$ 171 102 110 71 68 178 241 131 183 83 79 314 278 282 183 195 51 106 150 183 234 60 128 76 30 36 144 182 93 199 166 48 69 104
-120A04k4Km7K4QL7N6k0J59j19n5k9J0J1R5r7J6J88p9K7o1o8j10Q4l7m4K3k9N6
$$ 104 80 82 35 59 67 104 160 140 299 180 125 96 106 117 212 115 131 319 240 267 206 138 28 112 75 31 54 25 81
-392H1
##PAGE=	F1=-16456.8
##FIRST=	19140.455529915001534,	4405.895418600002813,	0
##DATA TABLE=	(F2++(Y..Y)), PROFILE
4406G4O2K4o8O0j02J10k7j3J9j19J08rk3Q8lj07k1P8n4J20L1j1p8L3K6q1K7k9R4Oj35mQ9l5
$$ 74 136 160 92 152 50 160 133 120 139 20 128 119 96 184 181 74 53 131 77 197 228 217 139 172 198 117 144 115 209 215 80 76 165 130
4087A30L0r5R7q0M4rn6P5q7O6Q3q6Km4LJ74q9j13J8P8r4O1NK1P7P3o9j4K5q0RK4Qmj11J40
$$ 130 160 65 162 82 126 117 61 136 49 115 198 112 114 70 73 247 158 45 63 141 47 108 113 134 211 284 215 201 226 146 155 179 187 183 72 212
3749B12p2o9j0L7l3M8K5q0J38l6J22j13j26L0n6Q2J23j72J1O1J02j3j79PJ34j35J01j1om5
$$ 212 140 71 61 98 65 113 138 58 196 160 282 169 43 73 17 99 222 50 61 122 224 211 32 39 173 38 139 128 122 77
3467G7K9J84q3j80K6P3j9J26l8j01M3j1P6r0J0O6l4pj20L3R4Q8j08o3J26P3j40j8N6j6ojl8
$$ 77 106 290 207 27 53 126 107 233 195 94 137 126 202 112 122 188 154 147 27 60 154 242 134 71 197 270 130 112 168 152 146 145 107
3157A07p3P2o7N2M0%L5m8L8pJ8k6j12lJ57r6k8J28o3J08j03L4n5J79o8j03N0l1p8lL5l5l%
$$ 107 34 106 39 91 131 131 166 118 156 149 167 141 29 26 183 87 59 187 124 232 129 163 108 287 219 116 166 135 57 54 89 54 51 51
2838E1Oj0N2K6L6o5L1l7J02j7q4Q3q9J12n3K1M6j30oL8mj2L0l2n9nQ7k9P9j04O0q8J08L2O0
$$ 51 57 47 99 125 161 96 127 90 192 175 91 174 85 197 144 165 211 81 75 113 109 97 127 95 36 31 118 89 168 64 124 36 144 176 236
2509B36j93L9M1j3M1nj15L9J04O6j52k2J02k0n0J8n9R7N4j34l0lL4NN9j03Q7k3R8Jq1M3j32
$$ 236 43 82 123 110 151 146 31 70 174 240 88 66 168 148 98 116 57 154 208 74 44 41 75 80 139 36 123 100 198 199 118 161 29
2199B9Q5QR5p8m4O5j2m6k6Q5m2l2O5m2J79O4k21M9r8p0Q9k0lk2P8j8l5j4RR1N6Kj96lJ24M3
$$ 29 114 122 217 139 95 160 148 102 76 161 119 87 152 110 289 353 132 181 83 13 102 82 79 57 135 117 82 68 77 168 224 226 30 27 151 194
1861A94j43J90p8q8k6J41nk9R3j93M6j6K23j56L3R5M0m0p4p1R8j14R0J18n1k01R6l5o2m5L9
$$ 194 51 241 163 75 49 190 185 156 249 56 102 86 309 153 186 281 321 281 207 136 234 120 210 328 277 76 172 137 75 30 69
1570F9L8J4k1M5j07N5M3N3j45J58j6j42M6m3J04o2n6R6%O4K8j62kN6oQ6j4j40J23P3j16n8
$$ 69 107 121 100 145 38 93 136 189 44 202 186 44 90 47 151 89 33 129 129 193 221 59 57 113 107 193 179 39 162 235 119 61
1270F1L9PJ4p9J58o6N5J45k57R3J68M0j28j92J68j07l9J3P3p2l1J35r6k2j2J26j32RJ15r5
$$ 61 100 107 121 42 200 134 189 334 77 170 338 378 250 58 226 119 80 93 166 94 63 198 102 80 68 194 62 71 186 91
988I1J90r5K5q3n8K0L1J0N7j71M2J58Q7k08M4M0M7jj80k5J65J6kj84J34M3K8J7J63Q63k32
$$ 91 281 186 211 128 70 90 121 131 188 17 59 217 304 96 140 180 227 226 46 21 186 202 200 16 150 193 221 238 401 1264 1032
697A032o34j48J03n0L19J0Q8m8O5L18J113R63j29j163q05l29j93R8j77n9j2K3q1m2J74k61
$$ 1032 398 250 353 303 622 632 720 672 737 1055 2168 3131 3002 1839 1034 705 512 610 433 374 362 385 304 262 436 175
453A75k6mP3mj60J17L9M8Q5j11o1O4q8j32J59J8r0O5M7L6n9q1j5Q1N0p6OqPl0q3M8J18Q6j72
$$ 175 149 145 218 214 54 171 210 258 343 232 171 235 147 15 174 192 102 167 214 250 191 110 95 176 226 150 156 148 155 125 42 90 208 294 122
124A22K0l6j7K23q3K0n6Pj31K9P7K2%j58O0Jl8J5R8Qp3P0o3r5J02J7k3l8m8M7l7P2m4J2J58
$$ 122 142 106 89 312 229 249 193 200 69 98 175 197 197 39 99 100 62 77 175 183 110 180 117 22 124 141 118 80 32 79 42 114 70 82 240
-205B40r8k5j8K3j4P8r0K1J88j02L4m3o1r4O0k5l0M5k8L4
$$ 240 142 117 99 122 108 186 96 117 305 203 237 194 133 39 99 74 44 89 61 95
-392I5
##PAGE=	F1=-16535.6
##FIRST=	19140.455529915001534,	4405.895418600002813,	0
##DATA TABLE=	(F2++(Y..Y)), PROFILE
4406H9O4L3m8K6q8J15o4m4J4p1Q9nk7P3nj05k3J47q9J29J3j4p1%M4n9K5m8O9Jj09MP2k2P3
$$ 89 153 186 138 164 76 191 127 83 97 26 115 110 83 156 151 46 23 170 81 210 223 209 138 138 182 123 148 100 169 170 61 65 137 115 188
4077A88j07M7p0J6N1l5N8j31R0J00j16k5J5j5J58m3j10k6N9l3K3M4k1Q5N7q2pK2o5O9j4J9
$$ 188 81 128 58 74 125 90 148 17 107 207 91 66 81 66 224 181 71 45 104 71 94 138 117 202 259 177 170 192 127 196 182 201
3777B01k5j15J00n2m1NjLM7J3r7J71k6R5j35r3%l2R2J40j65j5O6Q5Ok12N3J31j35O9l3j7k
$$ 201 176 61 161 109 68 73 72 75 122 135 38 209 183 278 143 50 50 18 110 250 85 70 136 221 227 15 68 199 64 133 100 83 81
3467H1L4J40n5j71K3P7m9J30m2l5QOP8j48K8N1J5J2j66N7P4R9j23r3J39J06j30qJ3k2L6k1
$$ 81 115 255 200 29 52 129 80 210 168 133 141 147 225 77 105 156 171 183 17 74 148 247 124 31 170 276 146 138 151 129 165 144
3166A44m3m8Q4q8L5O1ml2k7K6j1O9K0j01o7J67p8o8J29m5J12p6J4p4J89n9q9Mj6r9P5m4k5
$$ 144 101 53 137 49 84 145 141 109 82 108 97 166 186 85 18 185 107 39 168 123 235 159 173 99 288 229 140 144 128 29 104 60 35
2857C5K1mk9j0M5N1K4n6Q6q3J56k3j30R0p2R9o3j1M1j29Q1M3j6k8oJ5p0l8J27m9Q1q8N4p9
$$ 35 56 52 23 13 58 109 133 77 163 80 236 213 83 173 101 200 137 126 167 38 119 162 146 118 112 127 57 19 146 97 178 90 144 65
2537F5P2L8K5j22k5J03l0J1Op6n9J42J02j40p6J16p5k3P8p4R5M8j22n2lL8K5J5o2N0MQ8m5
$$ 65 137 175 200 78 53 156 126 137 143 67 8 150 252 112 36 152 77 54 132 58 153 201 79 27 24 62 87 102 40 90 94 182 137
2227A37k4Q7j20M3j9J14m7k6Rj9o4L1O6p8K0O7j22K31L4k12R1j21p1P6JRk9R3j2j08K2J9N4
$$ 137 113 200 80 123 104 218 171 145 154 135 71 102 168 90 110 177 55 286 320 108 199 78 7 83 84 93 64 157 145 37 59 78 132
1918A32O8J0j77M1R3M8j41J45l9j11l3J60j6k4Q9k09N5lJ99j62O2R2L2m4m1j41J31j15J13
$$ 132 200 210 33 74 167 215 74 219 180 69 36 196 180 156 245 36 91 88 287 125 187 279 311 267 226 85 216 101 214
1645B14J16r1j58O7no9Ol1M2N4m7J2n2L8O6M8j51J64pj50K1j3L3p6jM7O2M8J0j52J5Q5k6O9
$$ 214 330 239 81 148 143 74 80 49 91 145 98 110 58 96 162 210 59 223 216 66 87 74 107 31 30 77 139 187 197 45 60 145 119 188
1326A88m1r0J47M8j25p0N2Rj2q1J42o0Q6J15k56J06J56M6j16k06K00r6r7J2R2o3j2J20r6K3
$$ 188 147 57 204 252 127 57 109 118 106 25 167 107 193 308 52 158 314 360 244 38 238 142 45 57 149 86 74 194 98 121
1044A21m5J41j96L5J26j07J47m8N6n2o2K5%j8M6j60M5J50P9j98N2M7K8j0j37k4J68K6J0k07
$$ 121 76 217 21 56 182 75 222 174 230 178 116 141 141 123 169 9 54 204 283 85 137 184 212 202 65 41 209 235 245 38
763C8P7J35k7nK51Q07l06n70k60J12q7K95L9O9l1K9K54Q69P35r5r28o11k51j79J48j75k6r
$$ 38 115 250 223 218 469 1276 970 400 140 252 165 460 499 568 537 566 820 1689 2424 2329 1401 790 539 360 508 333 307 298
500B98L4j19M6J12k67K6L1M4J8j98J34RM5Q2j23mN1j49qR5P3q4J3K3L5p7n3K8O8N0n8m1k1
$$ 298 332 213 259 371 104 130 161 205 223 25 159 168 213 295 172 168 219 70 62 157 230 146 159 182 217 140 87 115 183 233 175 134 113
190A13P8n1q2N9J22R3k12j8O3m2J71j05K1j0oj12OR4Om8q4K0M3k2L2O7j2o2K0q0rJ08nqo9
$$ 113 191 140 58 117 239 332 120 102 165 123 294 189 210 200 194 82 88 182 188 140 56 76 119 97 129 196 184 122 142 62 53 161 156 148 79
-139G9m4P9m2J14j53j1J39o7K2jK5n1N2o8K8K00j17K8m7m4o1K3j9JO4l8K1
$$ 79 35 114 72 186 33 22 161 94 116 115 140 89 141 73 101 301 184 212 165 121 60 83 64 65 129 91 112
-392A12
##PAGE=	F1=-16614.3
##FIRST=	19140.455529915001534,	4405.895418600002813,	0
##DATA TABLE=	(F2++(Y..Y)), PROFILE
4406I6O8L4Kj5q3J13r6p6J4k8N8J1m2N6J5p0l7J58j04J22J3lm8m9M8k0J7p6L6J4m9l0N6rJ07
$$ 96 164 198 200 185 102 215 119 43 57 29 87 98 56 112 127 57 20 178 74 196 209 206 158 109 157 137 154 78 114 128 79 49 105 96 203
4077B03j07mm8l2J50l7L7j33N7J17j17o8O8l8J27J5r2p5L6L8j9P2o9R7M4q9j0K3l5J11m4K8
$$ 203 96 92 44 12 162 125 162 29 86 203 86 18 86 48 175 190 98 23 59 97 78 150 81 178 222 133 123 146 111 222 178 206
3777B06m1q9K5l8KL0n1N3M0j7j08K02k1O9j51m9k0j7R9J55j63m8P0P3J6j82M4J18j16K7n2
$$ 206 165 76 101 63 65 95 44 97 137 120 12 214 193 262 111 62 42 25 124 279 116 68 138 211 227 45 89 207 91 118 66
3486F6j1K7N7N4k8j26J7P3q0J19l8L0k7J3Q7j83M3M1M8L8j99P2O0R6j35q9J10J36j12Kj7m0
$$ 66 55 82 139 193 165 39 56 129 49 168 130 160 133 146 233 50 93 134 182 220 21 93 153 249 114 25 135 271 159 161 144 104
3185A04P2l9m4k8R3r0kP1Mr2nL5l9J14O1q1r4J40o0q0J04k5J06m1Jj10J86m5m3m5rj02J22
$$ 104 176 137 93 65 158 68 66 137 141 49 44 79 40 154 215 134 40 180 120 40 144 119 225 184 185 75 261 216 173 128 119 17 139
2875A39n8l6Nj0j5K5k0P1j3j8J15j18K07l2j73R6o1P3n1o3M5q5J21N3j6l9k7K7o8o5J47n1
$$ 139 81 45 50 40 25 50 30 101 88 70 185 67 274 242 69 165 104 177 126 63 108 23 144 197 181 142 115 142 74 9 156 105
2575A05N9o0M6o4L8J8j6j7q8J61m2k2Nk7m7P5J38j22p6L1n8M1P2r9Q6N0j08o6L2L8K6l7ko
$$ 105 164 104 150 86 124 142 126 109 21 182 140 118 123 96 49 124 262 140 64 95 37 78 150 51 137 187 79 13 45 83 109 72 70 64
2256F4L1P8r2K3J20j07nm1J39j0j0n5j1q7P3N1r2O5P9j84K20jj83J46j29o0N9J4K1l2Q5qj18
$$ 64 95 173 81 104 224 117 112 71 210 200 190 135 124 37 110 161 69 134 213 29 249 248 65 211 82 22 81 95 116 84 169 161 43
1946D3L6J1j4P9K3j36P3O2L9j19J03mj27l8J58j7l2P8j81P0l6J81j60P5J10K9o3qj61J26j10
$$ 43 79 90 76 155 178 42 115 177 216 97 200 196 69 31 189 172 140 218 37 107 71 252 92 167 277 306 243 235 74 200 90
1655I0J14J15j21j09K7J2k9K9o5K0O2m5j3lJ5O5L4j31J61Kj50mM6o1mkrQ8L6j3r6j8J11k3
$$ 90 204 319 198 89 116 128 99 128 63 83 145 100 87 84 99 164 198 67 228 230 80 76 122 61 57 55 46 134 170 157 61 43 154 131
1335A31L3n5j4J38J1j29m8N2j6j6k2N8l6J16P0k59J49J12N3j09j67J88r0o2j7P3n6KR2q3O5
$$ 131 164 109 95 233 244 115 67 119 103 87 65 123 87 203 273 14 163 275 328 219 52 240 150 88 71 144 88 90 182 99 164
1044A64l7J18j85QJ24j23Q9lQ8k5o2L3m9l0N2j32M5R2P5j59O2L0J3lj09OJ27L6K3k11QK22
$$ 164 127 245 60 68 192 69 158 155 243 218 156 189 140 110 162 30 75 167 242 83 145 175 188 185 76 82 209 245 268 57 65 287
744B87l7p8L02P97l45m78l77R9q4J91O5P0MKJ81O41N24p9o74m48j77j67J66j52j9NO4j51J07
$$ 287 250 172 474 1271 926 448 71 170 86 277 342 412 416 418 599 1240 1764 1685 1011 563 386 219 385 233 214 219 283 132 239
471B39P1k41M7N1oN3j74R6k1M6P0j22L9O0j02L5nJ11q1j6oL8r3j0N2M9M2l1r4k1J25o5n2O2
$$ 239 310 69 116 167 161 214 40 136 115 161 231 109 148 208 106 141 136 247 166 150 144 182 89 79 131 180 222 191 97 76 201 136 84 146
152A46J21Q3k27o1J50n2J08r2oL0k8p8j4R9j9p3J7m5P6nL5L9j9m5m8p8O7R4l0J4q0l5R4l0
$$ 146 267 350 123 62 212 160 268 176 170 200 172 94 80 179 160 87 104 59 135 130 165 204 185 140 92 14 81 175 145 159 79 44 138 108
-167A08J53j28j03M7k9P6J7J5r2J7l4L9K10j10K6q6k3k3%l0L6P2n2J0
$$ 108 261 133 30 77 48 124 141 156 64 81 47 86 296 186 212 126 103 80 80 50 86 158 106 116
-392A16
##PAGE=	F1=-16693.1
##FIRST=	19140.455529915001534,	4405.895418600002813,	0
##DATA TABLE=	(F2++(Y..Y)), PROFILE
4406I3O3L2O8m8q1J03j25r3J4LK3L8o1L6M7k3l8J09q4Q8J6K9k4q8L8J7Lq7rL1J7o2L0NJ19
$$ 93 156 188 256 208 127 230 105 12 26 29 52 90 29 65 112 89 51 160 76 164 180 209 185 97 135 152 155 68 59 90 107 45 75 80 199
4077A99r8l3nj2J55m8J8r9qJ21r0p3O0o5R5O9o2j19K2R0n3R0r5Q8L0q0j1L3k4J34o2L4m5n6
$$ 199 101 68 63 51 206 158 176 77 69 190 100 27 87 22 117 186 124 5 27 117 64 154 59 147 177 97 86 119 95 229 167 201 156 100
3758A00n3l3M3N6q1R4K7o0n8J75k3M3j52Kk0k5J00J63j62p8O8N7K9j45L2R2q5qo7J7L6P8m0
$$ 100 47 14 57 113 32 126 153 93 35 210 187 230 78 80 60 35 135 298 136 58 126 183 212 67 99 191 106 98 31 48 84 162 122
3448A22qo3J4O3o8N3k3Q2n3J1R7j84M8L0O1N5j88P2L9Q2j44m7N2J56r0Ol1n7R1n4m5j3R7p0
$$ 122 114 51 65 128 60 113 90 172 119 130 227 43 91 121 182 237 49 121 160 242 98 51 103 259 169 175 144 87 178 124 79 66 163 93
3129I3m6N7L0j04jO6m8P9R1m7j02R3m4o7O6nQ9kj3j51J76l1K4p7nr3J27k4n3m3J8K%k0O6o7
$$ 93 47 104 134 30 29 95 47 126 217 170 68 161 117 50 116 111 200 198 185 34 210 179 203 126 121 28 155 131 78 35 53 55 55 35 101 34
2791C4N3R9j26K35m5k00R8n5M3k3r5L6jQ8P1mm7m0K0o7p1J41m4L4l1M1m8J0k1n0J00o2J23
$$ 34 87 186 60 295 250 50 148 93 136 113 18 54 53 141 212 208 161 121 141 74 3 144 100 134 103 144 96 106 85 35 135 73 196
2481A96n0n5nK9k6J3J65r4m7q3Q1J2K9j24O5N7q3p0Q5K4K1q4M0m6M1P7j13L5J41r5n2n8J68
$$ 196 146 91 86 115 89 102 267 173 126 43 124 136 165 41 106 163 80 10 95 119 140 56 96 50 91 168 55 90 231 136 84 26 194
2171A94K9kj13J3j01P9M1p6P7R6j57J04l2j44K04j20l4O0LJ8l2P4k1o4K1j8q8R2L2p9Q7L7
$$ 194 223 221 108 121 20 99 140 64 141 237 80 184 152 8 212 92 58 118 121 139 107 181 160 96 117 99 11 103 135 56 143 180
1871A80K3j00Q5K2j36n2J49jo2O6r1O2q6J54j50O1J39L4r0K4j44J02j02J00J09j35o7jOJ7
$$ 180 203 103 188 210 74 22 171 170 108 174 83 145 59 213 63 124 263 297 207 231 87 189 87 187 296 161 94 93 99 116
1589A16L6o6NK8k5j4K3rM9J7r6J60Oj44j9R6j21O4l5%L5L5l2k1o3J14%j3l8N2J03l2j20PL0
$$ 116 152 86 91 119 94 80 103 94 143 160 64 224 230 86 67 163 42 106 71 71 106 141 109 88 25 139 139 126 88 140 243 211 91 98 128
1260A28o3J0L7l3J7J29J1j99J55N6M4j12j16J63r3j0k8N9n6K8M4p5R9j8Q6j44k0J15j42L2
$$ 128 65 75 112 79 96 225 236 37 192 248 292 180 64 227 134 124 96 155 99 127 171 96 195 177 263 119 99 214 72 104
979A04L0J05Qn9L8j00k8P0j17N2J5P6j02O9oJ6K3j07K2Q7M6L4k02o4K89Oj66K82Q08l56l92
$$ 104 134 239 247 188 226 126 98 168 51 103 118 194 92 161 155 171 194 87 109 196 242 276 74 10 299 305 139 421 1229 873 481
687D81l95O8J0n4Q2Q0N4J5R9N18L88r1m76l55j25j54J38j08o2K5J10j64J36M2j97N1M9o2R0
$$ 481 86 154 164 110 192 272 326 341 440 958 1346 1255 779 424 299 145 283 175 113 138 248 84 220 262 65 116 165 103 193
$$ [...]
-392H7
##END NTUPLES=	nD NMR SPECTRUM
##END=	
##END=	
