##TITLE=	Nov04-2021.23.fid
TM-VI-146repeat solid dmso d6 13C

##JCAMP-DX=	6.0	$$ MestReNova 14.3.0-30573
##DATA TYPE=	LINK
##BLOCK_ID=	1
##BLOCKS=	2    
##ORIGIN=	Mestrelab Research S.L.
##OWNER=	hrzepa
##$MNOVA/LINK_BLOCK_TYPE=	ITEM	$$ NMR Spectrum
##$MNOVA/ITEM/POLYGON=	(XY..XY)
5321,5835
8722,5835
8722,8208
5321,8208
5321,5835
##$MNOVA/ITEM/Z=	0
##$MNOVA/ITEM/ANGLE=	0
##TITLE=	Nov04-2021.23.fid
##JCAMP-DX=	6.0	$$ MestReNova 14.3.0-30573
##BLOCK_ID=	2
##DATA TYPE=	MNOVA NMR VIEW DATA
##DATA CLASS=	MNOVA VIEW DATA
##$MNOVA/ITEM/ZOOM/X=	-31.150195598113686657,	251.15679998888273872
##$MNOVA/ITEM/ZOOM/Y=	-415.30547332763671875,	4214.271331787109375
##END=	
##TITLE=	Nov04-2021.23.fid
##JCAMP-DX=	6.0	$$ MestReNova 14.3.0-30573
##BLOCK_ID=	3
##DATA TYPE=	NMR SPECTRUM
##DATA CLASS=	XYDATA
##NUMDIM=	1
##ORIGIN=	Bruker BioSpin GmbH
##OWNER=	nmr
##.OBSERVE FREQUENCY=	100.64143946071199309
##.OBSERVE NUCLEUS=	^13C
##.SOLVENT NAME=	DMSO_weak
##.PULSE SEQUENCE=	zgpg30
##LONGDATE=	2021/11/05 06:46:00.000
##.ACQUISITIONMODE=	SIMULTANEOUS (DQD)
##$ORIGINAL FORMAT=	Bruker XWIN-NMR
##$MNOVA/SCALES_VERSION=	9
##$PARAMETER FILE=	(acqus, ASCII, /private/var/folders/f6/rjf_tdyn2v98c5c0wvkgn4s80000gn/T/m5A$RxmjTeKjiShnNE16qw/23/acqus, 0)
$$ ##TITLE= Parameter file, TOPSPIN		Version 3.2
$$ ##JCAMPDX= 5.0
$$ ##DATATYPE= Parameter Values
$$ ##NPOINTS= 11	$$ modification sequence number
$$ ##ORIGIN= Bruker BioSpin GmbH
$$ ##OWNER= nmr
$$ $$ 2021-11-05 06:46:53.597 +0000  nmr@CZC2439F63
$$ $$ /opt/topspin/data/agmb/nmr/Nov04-2021/23/acqus
$$ $$ process /opt/topspin3.2/prog/mod/shimcntl
$$ ##$ACQT0= -2.26890760309556
$$ ##$AMP= (0..31)
$$ 100 100 100 100 100 100 100 100 100 100 100 100 100 100 100 100 100 100
$$ 100 100 100 100 100 100 100 100 100 100 100 100 100 100
$$ ##$AMPCOIL= (0..19)
$$ 0 0 0 0 0 0 0 0 0 0 0 0 0 0 0 0 0 0 0 0
$$ ##$ANAVPT= -1
$$ ##$AQSEQ= 0
$$ ##$AQ_mod= 3
$$ ##$AUNM= <au_zg>
$$ ##$AUTOPOS= <52 >
$$ ##$BF1= 100.63037
$$ ##$BF2= 400.2
$$ ##$BF3= 100.63037
$$ ##$BF4= 100.63037
$$ ##$BF5= 100.63037
$$ ##$BF6= 100.63037
$$ ##$BF7= 100.63037
$$ ##$BF8= 100.63037
$$ ##$BYTORDA= 0
$$ ##$CAGPARS= (0..11)
$$ 0 0 0 0 0 0 0 0 0 0 0 0
$$ ##$CFDGTYP= 0
$$ ##$CFRGTYP= 9
$$ ##$CHEMSTR= <none>
$$ ##$CNST= (0..63)
$$ 1 1 145 1 1 1 1 1 1 1 1 1 1 1 1 1 1 1 1 1 1 1 1 1 1 1 1 1 1 1 1 1 1 1 1
$$ 1 1 1 1 1 1 1 1 1 1 1 1 1 1 1 1 1 1 1 1 1 1 1 1 1 1 1 1 1
$$ ##$CPDPRG= (0..8)
$$ <waltz16> <> <waltz16> <> <mlev> <mlev> <mlev> <mlev> <mlev>
$$ ##$D= (0..63)
$$ 0 1 0.00345 0 0 0 0 0 0 0.06 0 0.03 2e-05 3e-06 0 0 0.0002 0 0 0 0 0 0
$$ 0 0 0 0 0 0 0 0 0 0 0 0 0 0 0 0 0 0 0 0 0 0 0 0 0 0 0 0 0 0 0 0 0 0 0 0
$$ 0 0 0 0 0
$$ ##$DATE= 1636094812
$$ ##$DE= 6.5
$$ ##$DECBNUC= <off>
$$ ##$DECIM= 704
$$ ##$DECNUC= <off>
$$ ##$DECSTAT= 4
$$ ##$DIGMOD= 1
$$ ##$DIGTYP= 12
$$ ##$DQDMODE= 0
$$ ##$DR= 21
$$ ##$DS= 4
$$ ##$DSPFIRM= 0
$$ ##$DSPFVS= 20
$$ ##$DTYPA= 0
$$ ##$EXP= <c13>
$$ ##$F1LIST= <111111111111111>
$$ ##$F2LIST= <222222222222222>
$$ ##$F3LIST= <333333333333333>
$$ [...]
$$ ##$Sgu3PowerLevels= (0..7)
$$ 0 0 0 0 0 0 0 0
$$ ##$Sgu4PowerLevels= (0..7)
$$ 0 0 0 0 0 0 0 0
$$ ##$Sgu5PowerLevels= (0..7)
$$ 0 0 0 0 0 0 0 0
$$ ##$Sgu6PowerLevels= (0..7)
$$ 0 0 0 0 0 0 0 0
$$ ##$Sgu7PowerLevels= (0..7)
$$ 0 0 0 0 0 0 0 0
$$ ##$Sgu8PowerLevels= (0..7)
$$ 0 0 0 0 0 0 0 0
$$ ##$SguType= 3
$$ ##$ShimPowMaxUA= (0..63)
$$ 130000 130000 130000 130000 130000 130000 130000 130000 130000 130000 130000
$$ 130000 130000 130000 130000 130000 130000 130000 130000 130000 0 0 0 0
$$ 0 0 0 0 0 0 0 0 0 0 0 0 0 0 0 0 0 0 0 0 0 0 0 0 0 0 0 0 0 0 0 0 0 0 0 0
$$ 0 0 0 0
$$ ##$ShimPowMaxUC= (0..63)
$$ 130000 130000 130000 130000 130000 130000 130000 130000 130000 130000 130000
$$ 130000 130000 130000 130000 130000 130000 130000 130000 130000 0 0 0 0
$$ 0 0 0 0 0 0 0 0 0 0 0 0 0 0 0 0 0 0 0 0 0 0 0 0 0 0 0 0 0 0 0 0 0 0 0 0
$$ 0 0 0 0
$$ ##$ShimPowMaxUG= (0..63)
$$ 524287 524287 524287 524287 524287 524287 524287 524287 524287 524287 524287
$$ 524287 524287 524287 524287 524287 524287 524287 524287 524287 0 0 0 0
$$ 0 0 0 0 0 0 0 0 0 0 0 0 0 0 0 0 0 0 0 0 0 0 0 0 0 0 0 0 0 0 0 0 0 0 0 0
$$ 0 0 0 0
$$ ##$ShimPowRcbType= 3
$$ ##$ShimPowRes= (0..63)
$$ 1e-20 1e-20 1e-20 1e-20 1e-20 1e-20 1e-20 1e-20 1e-20 1e-20 1e-20 1e-20
$$ 1e-20 1e-20 1e-20 1e-20 1e-20 1e-20 1e-20 1e-20 0 0 0 0 0 0 0 0 0 0 0 0
$$ 0 0 0 0 0 0 0 0 0 0 0 0 0 0 0 0 0 0 0 0 0 0 0 0 0 0 0 0 0 0 0 0
$$ ##$ShimPowRng0= (0..63)
$$ 1 1 1 1 1 1 1 1 1 1 1 1 1 1 1 1 1 1 1 1 0 0 0 0 0 0 0 0 0 0 0 0 0 0 0 0
$$ 0 0 0 0 0 0 0 0 0 0 0 0 0 0 0 0 0 0 0 0 0 0 0 0 0 0 0 0
$$ ##$ShimPowRng1= (0..63)
$$ 1 1 1 1 1 1 1 1 1 1 1 1 1 1 1 1 1 1 1 1 0 0 0 0 0 0 0 0 0 0 0 0 0 0 0 0
$$ 0 0 0 0 0 0 0 0 0 0 0 0 0 0 0 0 0 0 0 0 0 0 0 0 0 0 0 0
$$ ##$ShimPowRng2= (0..63)
$$ 1 1 1 1 1 1 1 1 1 1 1 1 1 1 1 1 1 1 1 1 0 0 0 0 0 0 0 0 0 0 0 0 0 0 0 0
$$ 0 0 0 0 0 0 0 0 0 0 0 0 0 0 0 0 0 0 0 0 0 0 0 0 0 0 0 0
$$ ##$ShimPowRng3= (0..63)
$$ 1 1 1 1 1 1 1 1 1 1 1 1 1 1 1 1 1 1 1 1 0 0 0 0 0 0 0 0 0 0 0 0 0 0 0 0
$$ 0 0 0 0 0 0 0 0 0 0 0 0 0 0 0 0 0 0 0 0 0 0 0 0 0 0 0 0
$$ ##$ShimSysFunc= (0..63)
$$ 1 2 3 4 5 7 9 11 15 16 8 10 12 14 6 17 13 18 19 20 0 0 0 0 0 0 0 0 0 0
$$ 0 0 0 0 0 0 0 0 0 0 0 0 0 0 0 0 0 0 0 0 0 0 0 0 0 0 0 0 0 0 0 0 0 0
$$ ##$ShimSysMatrix= 0
$$ ##$ShimSysType= 1
$$ ##$TFXNUM= 0
$$ ##$TRIPLO2= 0
$$ ##$VTU= 2
$$ ##$VTUETH= <149.236.99.20>
$$ ##$VTUTY= <no>
$$ ##$WBREFAM= (0..15)
$$ 135.5 97.7 100 100 100 100 100 100 100 100 100 100 100 100 100 100
$$ ##$WBREFLM= (0..15)
$$ 0 0 0 0 0 0 0 0 0 0 0 0 0 0 0 0
$$ ##$WBREFPH= (0..15)
$$ 72.26 -67.22 0 0 0 0 0 0 0 0 0 0 0 0 0 0
$$ ##$WBSGU= (0..15)
$$ 0 0 0 0 0 0 0 0 0 0 0 0 0 0 0 0
$$ ##$XFAC= 2
$$ ##END=
$$ 
##$DECIM=	704
##$DSPFVS=	20
##XUNITS=	HZ
##YUNITS=	ARBITRARY UNITS
##FIRSTX=	25274.001712016048259
##LASTX=	-3134.6557087493106337
##DELTAX=	-0.43348832563920586258
##XFACTOR=	1
##YFACTOR=	0.081007634609995396446
##FIRSTY=	-4.2580118179321289063
##MINY=	-32.18990325927734375
##MAXY=	3831.15576171875
##NPOINTS=	65536
##XYDATA=	(X++(Y..Y))
$$ [...]
10998 -51 -72 -103 -121 -126 -127 -136 -152 -167 -174 -163 -131 -85 -44 -22 -19 -30 -47 -59 -58 -39 -10 14 27 23 8 -7 -17 -21 -25 -30 -25 -1 35 68 81 69 35 -7 -41 -57
10981 -57 -57 -60 -77 -105 -130 -141 -137 -128 -125 -128 -129 -121 -109 -94 -70 -35 -7 -6 -32 -60 -75 -82 -94 -108 -108 -82 -36 0 -3 -51 -116 -163 -187 -200 -204 -185 -146 -114 -109 -117 -116 -109 -114 -134
10962 -134 -156 -174 -191 -206 -213 -208 -193 -170 -137 -102 -79 -73 -73 -65 -51 -39 -39 -45 -43 -29 -11 -7 -24 -50 -68 -68 -49 -11 33 61 56 30 10 10 24 43 62 72 63 40 21
10944 21 13 1 -22 -48 -60 -60 -57 -52 -41 -29 -20 -8 12 32 33 16 -1 -5 -3 -5 -19 -39 -57 -67 -71 -74 -67 -34 22 78 102 98 83 68 51 42 54 75 75 38 -12 -42
10926 -42 -45 -33 -22 -17 -21 -29 -35 -32 -26 -21 -21 -26 -34 -38 -31 -20 -19 -32 -37 -20 5 17 13 13 30 59 82 80 44 -11 -52 -57 -41 -31 -35 -37 -34 -42 -70 -98 -109 -107 -116 -152 -206 -257 -275
10906 -275 -250 -197 -152 -134 -133 -134 -136 -143 -146 -134 -117 -115 -137 -171 -199 -215 -219 -214 -199 -176 -152 -136 -131 -131 -129 -131 -146 -174 -199 -206 -192 -168 -140 -118 -115 -135 -155 -149 -117 -86 -75 -72
10887 -72 -60 -45 -44 -63 -86 -96 -94 -94 -101 -109 -106 -96 -98 -123 -161 -196 -219 -228 -223 -208 -196 -191 -181 -150 -114 -103 -125 -145 -133 -96 -63 -49 -46 -49 -62 -84 -112 -136 -152 -156 -153 -154
10869 -154 -167 -185 -191 -182 -167 -150 -129 -107 -97 -106 -133 -170 -207 -235 -245 -239 -220 -187 -140 -98 -89 -118 -153 -157 -128 -93 -74 -73 -78 -81 -81 -78 -78 -87 -100 -109 -110 -103 -93 -86 -93 -116 -143
10851 -143 -159 -163 -167 -170 -158 -126 -96 -96 -125 -151 -153 -136 -121 -124 -140 -159 -174 -181 -182 -178 -175 -180 -193 -199 -183 -145 -107 -90 -92 -90 -76 -64 -75 -104 -131 -140 -139 -144 -163 -184 -193 -179 -151
10832 -151 -127 -118 -119 -114 -99 -84 -84 -95 -104 -104 -100 -97 -93 -82 -66 -47 -32 -24 -26 -39 -52 -53 -43 -35 -38 -46 -47 -46 -56 -75 -83 -71 -54 -50 -60 -70 -77 -84 -82 -60 -26 -10 -25 -55 -79
10812 -79 -98 -121 -143 -151 -148 -152 -166 -177 -177 -165 -146 -120 -89 -63 -48 -39 -32 -29 -29 -26 -16 -4 -4 -18 -40 -59 -68 -66 -61 -63 -76 -95 -112 -124 -131 -133 -128 -125 -139 -180 -234 -273 -277 -257
10793 -257 -243 -247 -250 -230 -186 -143 -121 -117 -117 -113 -105 -87 -56 -16 21 42 39 14 -17 -40 -51 -54 -53 -45 -36 -41 -68 -106 -142 -172 -197 -210 -203 -184 -166 -150 -130 -106 -92 -93 -97 -95
10775 -95 -95 -112 -142 -163 -155 -126 -99 -91 -94 -88 -69 -56 -67 -96 -119 -121 -115 -113 -115 -111 -102 -97 -100 -108 -113 -107 -86 -58 -39 -35 -36 -28 -18 -20 -37 -53 -57 -60 -71 -86 -92 -93 -101 -122 -141 -142 -129 -114
10754 -114 -107 -105 -101 -88 -64 -38 -28 -46 -83 -119 -139 -144 -130 -95 -40 15 49 55 47 41 42 43 35 16 -7 -26 -39 -54 -76 -96 -101 -87 -67 -57 -65 -83 -98 -104 -104 -103 -97 -85
10736 -85 -74 -76 -84 -85 -75 -66 -69 -77 -84 -103 -150 -210 -247 -238 -195 -148 -117 -106 -109 -115 -110 -94 -82 -88 -106 -130 -156 -176 -178 -160 -137 -131 -143 -163 -184 -207 -224 -228 -212 -179 -134 -88
10718 -88 -59 -59 -77 -93 -102 -116 -146 -185 -214 -223 -208 -174 -132 -99 -87 -92 -96 -81 -42 9 51 68 63 49 33 15 -7 -33 -59 -85 -103 -104 -86 -59 -34 -17 -12 -16 -20 -19
10701 -19 -17 -22 -32 -35 -29 -26 -33 -46 -63 -86 -110 -126 -132 -137 -142 -130 -92 -46 -15 0 12 23 20 3 -12 -17 -15 -12 -10 -14 -26 -41 -46 -42 -48 -76 -116 -150 -163 -148 -113 -82 -83 -115
10681 -115 -151 -164 -159 -158 -169 -183 -190 -196 -212 -231 -235 -207 -155 -111 -99 -116 -134 -133 -119 -104 -89 -69 -50 -45 -64 -97 -122 -130 -134 -150 -181 -203 -195 -164 -134 -120 -113 -113 -130 -168
10664 -168 -210 -234 -243 -245 -240 -221 -194 -172 -153 -131 -116 -126 -155 -169 -149 -113 -90 -87 -89 -93 -114 -154 -194 -208 -185 -143 -116 -129 -175 -223 -250 -255 -248 -235 -217 -198 -184 -176 -174
10647 -174 -180 -192 -201 -203 -198 -191 -175 -154 -140 -149 -166 -158 -113 -58 -28 -33 -54 -71 -78 -79 -82 -95 -126 -170 -210 -223 -201 -159 -125 -112 -111 -105 -85 -56 -34 -34 -64 -119 -174 -203 -200 -183
10629 -183 -174 -168 -150 -115 -85 -85 -117 -159 -192 -207 -207 -193 -169 -145 -133 -130 -127 -119 -113 -118 -132 -148 -165 -178 -178 -159 -133 -113 -97 -79 -61 -58 -75 -96 -100 -86 -74 -79 -97 -119 -139
10611 -139 -153 -160 -163 -170 -187 -204 -203 -178 -144 -122 -118 -116 -104 -83 -63 -46 -34 -34 -51 -72 -77 -64 -47 -39 -39 -43 -55 -79 -111 -145 -175 -193 -198 -199 -214 -245 -271 -268 -232 -186 -152
10593 -152 -138 -139 -142 -138 -128 -122 -128 -142 -153 -155 -145 -127 -105 -91 -90 -95 -97 -97 -99 -97 -88 -79 -84 -103 -116 -114 -109 -118 -144 -183 -228 -264 -272 -251 -218 -191 -173 -164 -171 -197 -231 -250 -251 -243 -234 -225 -214
10573 -214 -202 -190 -182 -184 -195 -206 -211 -213 -222 -235 -243 -242 -236 -225 -207 -182 -150 -107 -53 0 40 56 48 19 -21 -60 -86 -97 -102 -100 -86 -67 -53 -51 -58 -67 -74 -80 -90 -109 -135 -158
10555 -158 -175 -200 -237 -268 -267 -241 -219 -214 -209 -193 -176 -166 -146 -110 -84 -96 -130 -144 -127 -103 -88 -71 -44 -19 -15 -29 -44 -45 -31 -7 13 19 8 -4 -5 8 29 44
10538 44 47 35 20 18 26 25 0 -45 -86 -108 -107 -91 -69 -56 -55 -58 -49 -28 -8 1 0 -12 -37 -71 -100 -110 -96 -68 -44 -39 -49 -57 -55 -50 -62 -98 -143 -175 -181 -163 -136 -114
10520 -114 -105 -106 -104 -89 -68 -61 -79 -114 -142 -149 -139 -124 -112 -95 -68 -34 -8 -2 -16 -34 -43 -38 -31 -35 -53 -77 -97 -107 -105 -94 -89 -107 -151 -200 -227 -222 -200 -178 -163 -150 -135
10502 -135 -117 -98 -81 -71 -69 -78 -98 -121 -130 -116 -88 -63 -51 -48 -50 -58 -69 -76 -76 -75 -77 -76 -67 -53 -44 -40 -37 -32 -29 -30 -37 -51 -70 -90 -111 -138 -171 -199 -207 -195 -173 -144 -112 -85
10483 -85 -76 -81 -83 -76 -72 -84 -105 -111 -97 -75 -62 -58 -59 -61 -65 -73 -82 -85 -80 -68 -62 -71 -91 -107 -109 -109 -122 -150 -170 -165 -140 -121 -121 -136 -151 -161 -170 -180 -180 -164 -141 -128 -133 -146 -153 -148 -138
10463 -138 -133 -133 -133 -125 -108 -93 -95 -115 -144 -166 -182 -193 -196 -184 -168 -164 -181 -200 -202 -190 -179 -174 -165 -151 -142 -139 -129 -103 -75 -62 -63 -63 -56 -54 -71 -106 -150 -189 -216 -234 -253 -273
10445 -273 -276 -246 -197 -161 -150 -148 -136 -116 -100 -85 -62 -37 -30 -50 -82 -110 -124 -120 -88 -31 24 41 5 -54 -97 -108 -107 -119 -147 -175 -188 -183 -160 -118 -74 -53 -62 -84
10428 -84 -96 -102 -119 -147 -169 -174 -164 -145 -117 -84 -60 -52 -59 -73 -97 -129 -155 -163 -155 -144 -142 -153 -174 -189 -181 -154 -135 -137 -141 -121 -90 -85 -119 -165 -185 -174 -150 -135 -135 -136 -120
10411 -120 -80 -33 -6 -4 -8 -5 -4 -14 -32 -45 -56 -76 -101 -121 -131 -142 -164 -193 -222 -244 -257 -258 -249 -233 -216 -201 -190 -176 -152 -124 -111 -123 -143 -147 -126 -93 -64 -50
10394 -50 -57 -82 -111 -124 -123 -125 -140 -156 -160 -151 -140 -125 -100 -68 -44 -44 -64 -88 -99 -92 -76 -61 -54 -56 -68 -88 -109 -119 -117 -110 -106 -105 -109 -119 -130 -134 -133 -136 -140 -136 -120 -106 -101 -95 -76
10375 -76 -49 -32 -37 -62 -95 -122 -126 -111 -98 -103 -115 -110 -81 -56 -56 -73 -85 -80 -68 -61 -62 -70 -87 -118 -162 -199 -204 -175 -144 -138 -155 -168 -168 -164 -156 -134 -94 -57 -39 -33 -21 -4
10356 -4 10 25 41 48 32 1 -23 -38 -53 -73 -89 -94 -94 -96 -99 -100 -98 -94 -87 -78 -74 -76 -82 -87 -98 -119 -141 -150 -137 -113 -92 -81 -70 -49 -26 -16 -27 -49 -75 -106 -139 -151 -129
10338 -129 -88 -68 -88 -127 -148 -133 -89 -42 -19 -29 -56 -74 -74 -68 -65 -59 -50 -51 -68 -91 -103 -104 -101 -96 -90 -87 -91 -98 -105 -114 -123 -120 -99 -73 -60 -65 -79 -97 -119 -135 -132 -112 -89 -73
10319 -73 -64 -65 -75 -81 -68 -41 -22 -21 -27 -32 -47 -72 -91 -91 -81 -82 -93 -100 -102 -110 -127 -140 -141 -140 -146 -157 -166 -168 -161 -142 -115 -90 -79 -78 -75 -63 -49 -50 -78 -121 -154 -153 -122 -85 -67
10299 -67 -77 -102 -117 -110 -92 -89 -109 -136 -156 -177 -209 -240 -245 -225 -208 -214 -229 -230 -211 -180 -144 -110 -85 -78 -84 -96 -112 -128 -140 -140 -130 -122 -121 -123 -123 -116 -101 -81 -63 -54 -46 -34
10281 -34 -22 -19 -25 -28 -23 -24 -41 -70 -93 -104 -109 -113 -120 -129 -141 -153 -154 -137 -105 -70 -49 -59 -99 -150 -188 -208 -224 -248 -264 -252 -218 -197 -211 -252 -291 -314 -319 -309 -285 -251
10264 -251 -217 -186 -157 -123 -93 -76 -78 -95 -111 -117 -114 -111 -109 -100 -80 -65 -71 -95 -113 -106 -77 -43 -19 -14 -25 -43 -60 -70 -76 -68 -38 6 41 44 16 -22 -56 -77 -76 -58 -38
10246 -38 -31 -34 -37 -36 -38 -48 -63 -82 -108 -137 -158 -163 -151 -129 -106 -91 -84 -74 -52 -28 -26 -47 -68 -68 -53 -37 -24 -13 -13 -34 -63 -81 -90 -104 -127 -144 -145 -142 -147 -155 -160 -168 -185
10227 -185 -199 -195 -175 -155 -145 -142 -141 -138 -121 -85 -40 -9 -7 -26 -49 -70 -88 -100 -97 -80 -59 -43 -35 -35 -39 -41 -36 -33 -46 -76 -110 -130 -133 -126 -113 -90 -59 -35 -32 -45 -60 -70
10209 -70 -79 -96 -116 -129 -135 -143 -163 -185 -195 -182 -154 -130 -125 -133 -136 -118 -83 -49 -26 -14 -12 -24 -47 -73 -90 -102 -111 -116 -113 -110 -115 -122 -116 -95 -69 -48 -31 -15 -8 -25 -60 -94
10191 -94 -108 -92 -57 -30 -29 -47 -59 -58 -59 -79 -102 -110 -110 -126 -162 -187 -183 -161 -149 -149 -148 -137 -120 -100 -84 -82 -96 -116 -126 -125 -123 -125 -130 -136 -142 -141 -130 -110 -86 -61 -33 -8 4
10172 4 1 -11 -30 -54 -79 -89 -80 -66 -56 -48 -36 -31 -46 -72 -89 -89 -91 -112 -148 -174 -178 -165 -153 -150 -148 -132 -91 -38 5 29 37 34 19 -9 -41 -62 -71 -86 -117 -148 -156 -132
10154 -132 -99 -84 -98 -126 -150 -164 -172 -180 -181 -171 -149 -123 -96 -70 -50 -46 -59 -75 -80 -79 -84 -97 -110 -125 -149 -181 -203 -203 -191 -178 -164 -144 -127 -123 -126 -114 -84 -56 -42
10137 -42 -41 -51 -76 -112 -137 -138 -124 -108 -89 -61 -38 -35 -45 -46 -36 -37 -60 -90 -106 -105 -101 -98 -90 -73 -56 -53 -72 -110 -151 -182 -201 -215 -222 -213 -187 -159 -147 -155 -177 -203 -222
10119 -222 -228 -228 -241 -267 -285 -272 -237 -203 -184 -177 -175 -179 -179 -164 -137 -123 -137 -170 -202 -220 -228 -233 -237 -236 -225 -198 -163 -135 -125 -128 -131 -133 -136 -143 -151 -162 -176 -187 -186 -170 -146 -120 -94
10101 -94 -76 -78 -99 -119 -119 -101 -82 -73 -69 -64 -63 -69 -81 -93 -102 -107 -109 -114 -123 -131 -128 -114 -100 -94 -96 -98 -98 -103 -119 -142 -163 -172 -165 -145 -133 -141 -163 -174 -161 -133 -112 -104 -103 -104 -106 -107 -107 -112 -126
10079 -126 -137 -125 -92 -68 -79 -113 -133 -125 -108 -103 -107 -104 -90 -72 -60 -63 -85 -117 -136 -127 -102 -88 -94 -104 -96 -72 -51 -48 -66 -94 -116 -118 -102 -83 -74 -74 -75 -74 -77 -89 -111 -144
10061 -144 -183 -212 -216 -200 -188 -191 -195 -181 -152 -126 -114 -114 -117 -113 -92 -55 -16 2 -2 -19 -33 -44 -59 -76 -81 -69 -54 -52 -67 -82 -82 -68 -51 -35 -18 2 25 40 47 42
10044 42 24 -3 -27 -29 -10 5 0 -22 -47 -64 -73 -76 -71 -59 -52 -62 -85 -97 -85 -55 -27 -14 -6 9 36 62 79 82 70 42 10 -9 -11 -5 -3 -3 -1 -2 -16 -37 -50 -42
10026 -42 -18 5 16 9 -11 -36 -55 -61 -54 -44 -40 -43 -49 -45 -30 -16 -22 -51 -86 -115 -138 -161 -181 -190 -189 -188 -192 -191 -178 -160 -151 -152 -156 -161 -174 -195 -210 -199 -160 -107 -56 -22 -14 -34
10007 -34 -71 -108 -132 -141 -136 -116 -91 -75 -78 -95 -118 -148 -187 -225 -247 -249 -243 -241 -241 -233 -219 -204 -190 -172 -152 -139 -138 -142 -139 -127 -114 -105 -106 -115 -126 -125 -102 -55 -4 33 51 55 51
9988 51 32 -9 -67 -120 -152 -166 -176 -192 -215 -240 -258 -258 -237 -203 -168 -145 -132 -117 -94 -68 -60 -86 -133 -165 -158 -124 -99 -99 -115 -130 -137 -135 -125 -111 -101 -100 -111 -138 -187
9971 -187 -243 -272 -255 -218 -204 -225 -255 -263 -245 -216 -183 -145 -110 -87 -77 -72 -67 -70 -83 -93 -82 -48 -16 -10 -32 -61 -83 -106 -144 -181 -189 -163 -134 -128 -134 -122 -90 -63 -56
9954 -56 -53 -36 -17 -14 -25 -28 -15 5 23 36 40 27 -7 -44 -61 -54 -40 -35 -39 -47 -60 -83 -111 -128 -125 -109 -95 -90 -91 -95 -105 -127 -154 -180 -203 -220 -221 -190 -136 -86 -61 -52
9936 -52 -45 -36 -31 -34 -43 -60 -84 -109 -120 -121 -126 -146 -175 -198 -208 -207 -198 -184 -167 -145 -118 -97 -93 -110 -136 -152 -142 -110 -73 -53 -55 -64 -57 -34 -17 -18 -25 -14 9 16 -18 -83 -146
9917 -146 -185 -203 -214 -216 -197 -158 -121 -105 -112 -126 -132 -125 -99 -55 -11 9 -5 -48 -102 -148 -173 -174 -167 -168 -182 -192 -188 -174 -154 -134 -121 -124 -140 -150 -143 -128 -119 -113 -99 -79 -62
9899 -62 -46 -26 -13 -25 -62 -110 -150 -174 -183 -182 -181 -183 -175 -147 -111 -92 -93 -92 -74 -48 -37 -52 -83 -115 -132 -131 -123 -124 -137 -151 -158 -158 -155 -150 -150 -169 -203 -229 -229 -205 -168 -126 -92
9881 -92 -80 -92 -110 -115 -108 -107 -118 -133 -147 -157 -157 -145 -126 -110 -96 -82 -78 -91 -106 -101 -81 -74 -99 -134 -149 -140 -121 -99 -76 -55 -54 -75 -103 -110 -82 -31 7 8 -26 -72 -104
9863 -104 -116 -115 -106 -92 -76 -67 -65 -65 -61 -58 -58 -62 -65 -66 -69 -72 -69 -53 -31 -19 -25 -36 -36 -25 -22 -39 -70 -96 -105 -105 -108 -121 -133 -135 -128 -121 -121 -126 -134 -144 -153 -156 -154 -153 -161 -174 -183 -180 -163 -132 -92
9841 -92 -57 -36 -31 -30 -28 -27 -30 -39 -50 -61 -75 -94 -115 -130 -125 -100 -75 -72 -95 -129 -157 -172 -175 -178 -195 -222 -243 -252 -258 -271 -278 -265 -234 -202 -171 -133 -94 -73 -74 -80 -79 -82 -91 -95 -91
9821 -91 -95 -117 -132 -117 -83 -62 -62 -67 -61 -50 -36 -19 0 13 16 9 -1 -9 -12 -16 -36 -85 -152 -207 -230 -221 -193 -153 -106 -60 -27 -18 -32 -54 -71 -79 -86 -92 -91 -85 -89 -117 -159 -195
9802 -195 -218 -232 -238 -233 -221 -210 -202 -190 -173 -156 -142 -131 -134 -161 -207 -251 -276 -282 -276 -259 -230 -197 -169 -151 -147 -158 -183 -208 -224 -229 -224 -210 -197 -195 -206 -220 -227 -231 -238 -254 -281
9785 -281 -317 -342 -329 -275 -206 -158 -136 -126 -115 -107 -109 -120 -132 -138 -140 -141 -138 -123 -88 -42 -6 5 -4 -27 -59 -91 -103 -87 -62 -55 -76 -111 -147 -176 -188 -176 -144 -108 -82
9768 -82 -61 -40 -29 -40 -78 -128 -169 -189 -191 -189 -186 -175 -146 -103 -58 -25 -11 -17 -36 -48 -43 -30 -29 -42 -52 -47 -40 -45 -56 -57 -47 -47 -69 -102 -128 -148 -175 -206 -221 -214 -200
9750 -200 -196 -198 -198 -201 -214 -226 -213 -174 -139 -128 -136 -144 -147 -147 -139 -128 -130 -159 -198 -219 -215 -202 -194 -188 -182 -187 -202 -215 -222 -229 -237 -237 -223 -208 -204 -210 -219 -228 -229 -215 -191 -179 -190 -210 -218 -212 -204 -199 -186
9729 -186 -165 -146 -137 -137 -142 -151 -162 -163 -148 -123 -103 -104 -128 -161 -188 -199 -200 -199 -196 -186 -166 -141 -118 -97 -72 -39 -4 13 2 -32 -61 -57 -21 22 47 47 27 -2 -28 -41
9711 -41 -32 -8 19 34 25 -11 -71 -135 -185 -213 -229 -244 -258 -256 -234 -208 -195 -194 -187 -160 -120 -81 -53 -42 -54 -84 -115 -134 -147 -169 -194 -198 -167 -114 -60 -22 -9 -25
9695 -25 -63 -99 -119 -129 -145 -163 -162 -137 -104 -77 -55 -36 -28 -39 -62 -77 -76 -71 -75 -89 -106 -122 -137 -143 -129 -95 -56 -30 -25 -36 -58 -93 -139 -183 -208 -203 -176 -143 -120
9678 -120 -115 -120 -126 -135 -149 -163 -157 -119 -68 -36 -36 -59 -87 -111 -126 -131 -129 -135 -156 -179 -188 -177 -158 -142 -133 -126 -108 -70 -16 27 35 10 -20 -36 -48 -73 -107 -124 -106 -59 -8
9660 -8 26 40 38 26 5 -24 -53 -69 -74 -78 -81 -68 -34 5 36 53 53 32 -9 -52 -76 -79 -74 -70 -63 -57 -62 -81 -106 -133 -162 -187 -194 -181 -163 -151 -145 -141 -144 -153 -157 -148 -133 -123 -124
9641 -124 -134 -153 -175 -186 -179 -163 -148 -126 -90 -56 -47 -63 -81 -83 -73 -56 -36 -19 -24 -59 -107 -145 -170 -184 -182 -154 -106 -68 -57 -70 -92 -110 -115 -99 -66 -39 -34 -40 -30
9624 -30 0 25 13 -27 -61 -67 -52 -32 -10 13 32 39 35 20 -10 -53 -95 -120 -133 -142 -137 -102 -42 11 40 51 56 49 27 5 1 4 -14 -63 -112 -130 -122 -121 -143 -173 -184
9606 -184 -173 -154 -143 -131 -106 -68 -36 -29 -47 -69 -78 -70 -52 -31 -2 31 55 51 26 7 8 12 -5 -42 -76 -88 -86 -85 -91 -100 -98 -73 -27 16 36 31 20 16 14 7 0 -1 -1 -6
9587 -6 -14 -24 -42 -75 -107 -119 -106 -79 -54 -42 -51 -79 -110 -131 -148 -174 -200 -202 -173 -128 -92 -73 -68 -76 -93 -109 -120 -133 -158 -185 -197 -187 -172 -171 -187 -211 -233 -253 -270
9570 -270 -282 -279 -257 -222 -186 -160 -148 -145 -140 -126 -111 -102 -98 -90 -76 -65 -62 -58 -46 -39 -53 -85 -115 -130 -133 -139 -152 -162 -160 -147 -131 -123 -126 -129 -125 -117 -115 -118 -116 -107 -103 -111 -130 -148 -159 -162 -165
9550 -165 -181 -216 -252 -259 -222 -164 -122 -118 -138 -160 -170 -168 -156 -137 -122 -118 -121 -115 -90 -58 -32 -13 7 32 37 6 -53 -114 -155 -173 -174 -162 -148 -144 -148 -146 -132 -111 -91 -68
9532 -68 -37 -4 16 24 27 31 34 36 33 22 4 -9 -14 -16 -31 -56 -75 -79 -81 -91 -105 -112 -111 -109 -110 -114 -121 -127 -121 -100 -75 -66 -74 -83 -75 -58 -47 -52 -70 -102 -147 -197 -231 -234 -212 -184 -153
9512 -153 -111 -57 -12 0 -19 -46 -62 -72 -93 -123 -142 -131 -97 -59 -30 -12 -2 3 3 3 12 25 28 15 -2 -17 -35 -76 -141 -204 -233 -223 -193 -164 -145 -138 -143 -160
9495 -160 -174 -166 -132 -89 -64 -63 -69 -65 -52 -45 -52 -64 -71 -74 -73 -62 -40 -28 -52 -110 -170 -202 -204 -194 -183 -176 -180 -204 -240 -266 -263 -227 -173 -116 -67 -29 0 24 33 16 -17 -46
9477 -46 -54 -44 -28 -20 -28 -56 -93 -121 -132 -141 -161 -180 -176 -156 -149 -168 -191 -194 -181 -173 -179 -191 -199 -202 -198 -180 -147 -114 -100 -114 -141 -162 -171 -182 -208 -247 -285 -308 -307 -275 -222 -174
9459 -174 -156 -168 -186 -191 -187 -186 -189 -189 -192 -203 -221 -232 -232 -218 -190 -149 -103 -64 -38 -29 -44 -88 -143 -177 -175 -150 -119 -86 -44 1 33 40 22 -9 -46 -83 -117 -148 -169 -172
9442 -172 -153 -124 -105 -103 -107 -98 -69 -37 -22 -37 -73 -112 -132 -120 -75 -13 38 59 45 3 -54 -116 -165 -191 -198 -196 -192 -187 -185 -186 -185 -168 -139 -114 -108 -117 -130 -143 -163 -184 -192
9424 -192 -178 -156 -142 -137 -130 -114 -99 -98 -114 -139 -167 -192 -208 -213 -210 -209 -209 -202 -186 -172 -168 -176 -191 -212 -233 -241 -231 -217 -217 -225 -215 -178 -133 -102 -91 -96 -111 -129 -144 -161 -192 -227
9406 -227 -234 -198 -145 -113 -103 -90 -67 -53 -61 -83 -104 -121 -131 -127 -106 -80 -59 -38 -15 -2 -11 -34 -48 -46 -41 -51 -77 -110 -140 -162 -174 -180 -181 -174 -160 -145 -135 -132 -135 -139 -148
9388 -148 -162 -180 -200 -215 -220 -213 -203 -198 -192 -170 -135 -108 -99 -92 -58 0 46 52 22 -14 -39 -55 -69 -83 -98 -115 -129 -134 -124 -111 -104 -101 -91 -73 -59 -62 -78 -87 -75 -53 -38
9370 -38 -35 -30 -14 -1 -13 -51 -90 -104 -98 -99 -116 -137 -143 -140 -145 -160 -167 -156 -140 -136 -140 -129 -95 -56 -35 -29 -25 -14 0 13 16 0 -38 -81 -102 -93 -72 -54 -37 -19 -11 -24 -56
9352 -56 -87 -110 -129 -145 -150 -133 -98 -60 -29 -6 18 44 52 27 -25 -80 -116 -137 -154 -162 -150 -126 -116 -129 -141 -131 -100 -66 -33 0 24 18 -18 -58 -73 -67 -64 -73 -85
9335 -85 -93 -105 -121 -129 -115 -90 -77 -90 -114 -129 -124 -106 -90 -86 -98 -117 -133 -141 -145 -146 -135 -111 -90 -89 -107 -126 -136 -150 -174 -197 -200 -184 -166 -158 -156 -150 -140 -136 -142 -149 -148 -136 -120
9316 -120 -107 -101 -104 -115 -128 -140 -147 -152 -149 -135 -119 -119 -140 -171 -196 -212 -219 -212 -185 -151 -121 -95 -66 -40 -34 -55 -91 -125 -144 -146 -136 -129 -140 -162 -178 -179 -172 -166 -161 -154 -152 -153 -146 -128
9297 -128 -107 -91 -79 -70 -73 -94 -123 -141 -143 -139 -139 -147 -159 -163 -148 -122 -107 -113 -123 -115 -90 -72 -76 -98 -124 -139 -134 -113 -93 -85 -80 -69 -54 -52 -70 -99 -123 -127 -104 -64 -31 -23 -27
9278 -27 -24 -14 -13 -24 -31 -35 -51 -86 -123 -143 -154 -170 -190 -204 -210 -210 -200 -180 -163 -165 -179 -184 -165 -130 -91 -62 -51 -62 -89 -116 -131 -131 -122 -113 -110 -114 -120 -124 -126 -132 -143 -156 -166 -171
9259 -171 -167 -153 -132 -111 -103 -118 -158 -207 -239 -241 -229 -225 -231 -232 -220 -208 -207 -219 -238 -263 -291 -309 -305 -285 -263 -249 -233 -204 -165 -132 -121 -139 -169 -191 -192 -171 -138 -99 -68
9242 -68 -61 -85 -126 -155 -161 -155 -150 -141 -124 -109 -115 -139 -159 -163 -159 -163 -176 -185 -173 -138 -99 -78 -89 -119 -146 -165 -182 -194 -185 -153 -113 -83 -61 -39 -24 -28 -49 -68 -77 -83 -96 -109
9224 -109 -110 -95 -78 -73 -86 -108 -122 -127 -134 -147 -148 -130 -113 -123 -155 -177 -176 -167 -163 -154 -130 -105 -96 -106 -128 -160 -196 -222 -229 -220 -206 -184 -149 -109 -71 -40 -15 -5 -6 0 17 23
9206 23 -8 -66 -109 -123 -131 -156 -193 -225 -239 -230 -197 -152 -120 -114 -119 -115 -99 -84 -81 -87 -95 -104 -116 -134 -154 -162 -151 -129 -109 -98 -97 -113 -150 -193 -215 -211 -209 -225 -245 -241 -211 -172
9188 -172 -143 -132 -137 -153 -160 -145 -112 -82 -77 -98 -135 -167 -180 -173 -154 -129 -98 -73 -73 -110 -165 -203 -207 -185 -151 -117 -92 -82 -87 -101 -116 -132 -146 -161 -177 -199 -221 -233
9171 -233 -231 -220 -199 -170 -142 -134 -150 -165 -153 -116 -81 -68 -74 -85 -96 -108 -116 -115 -101 -83 -77 -89 -113 -135 -147 -152 -155 -153 -138 -103 -56 -10 20 31 22 0 -32 -61 -80 -85
9154 -85 -77 -60 -42 -28 -13 9 51 111 186 275 381 500 616 697 714 654 537 401 276 173 87 15 -39 -74 -87 -82 -71 -73 -91 -104 -92 -66 -55
9140 -55 -72 -95 -101 -95 -102 -129 -159 -172 -173 -176 -188 -208 -224 -223 -204 -181 -167 -161 -156 -155 -173 -205 -224 -210 -175 -149 -147 -163 -182 -197 -200 -187 -167 -155 -157 -165 -177 -204 -245 -274 -261 -211
9121 -211 -163 -149 -160 -173 -177 -178 -173 -157 -140 -142 -163 -180 -170 -143 -121 -115 -120 -126 -129 -130 -133 -144 -160 -167 -157 -140 -131 -133 -131 -121 -113 -116 -128 -143 -155 -161 -158 -145 -133 -135 -157 -191 -219 -227 -216
9102 -216 -200 -195 -205 -220 -233 -239 -230 -197 -145 -101 -86 -97 -106 -91 -54 -22 -16 -38 -78 -118 -148 -154 -134 -104 -98 -129 -176 -208 -216 -223 -239 -246 -225 -182 -136 -97 -65 -41 -33 -39 -55
9084 -55 -74 -93 -107 -109 -106 -111 -127 -144 -148 -138 -127 -133 -162 -204 -238 -244 -225 -195 -165 -141 -132 -144 -168 -182 -168 -131 -95 -77 -78 -92 -117 -146 -166 -165 -140 -109 -88 -79 -75 -71 -74 -89
9066 -89 -108 -115 -110 -108 -120 -139 -154 -158 -156 -152 -149 -147 -143 -140 -141 -150 -161 -161 -139 -101 -63 -30 -2 10 -3 -44 -88 -120 -146 -177 -204 -204 -177 -144 -117 -93 -74 -72 -85 -89 -68 -42 -37 -52
9047 -52 -67 -74 -87 -108 -124 -131 -143 -165 -176 -163 -139 -125 -126 -128 -121 -109 -96 -87 -88 -93 -91 -75 -58 -48 -41 -38 -47 -74 -98 -92 -63 -36 -25 -18 -9 -8 -22 -41 -56 -73 -105 -146 -183
9028 -183 -209 -219 -211 -186 -154 -130 -116 -105 -92 -73 -49 -25 -9 -5 -11 -26 -48 -70 -85 -90 -92 -96 -96 -83 -65 -60 -77 -111 -147 -173 -177 -152 -106 -60 -34 -35 -52 -71 -84 -94
9011 -94 -109 -134 -158 -168 -163 -153 -144 -135 -130 -130 -133 -124 -96 -59 -32 -17 -11 -17 -42 -80 -110 -116 -109 -109 -121 -132 -135 -136 -141 -147 -144 -134 -134 -153 -185 -212 -217 -199 -171 -142 -108 -67 -39 -50 -104
8991 -104 -174 -218 -222 -193 -147 -93 -41 -12 -22 -62 -103 -115 -105 -101 -127 -167 -183 -163 -129 -110 -114 -129 -154 -190 -223 -235 -222 -202 -194 -198 -209 -221 -227 -218 -194 -169 -151 -136
8975 -136 -120 -111 -108 -102 -89 -80 -85 -94 -86 -63 -43 -37 -33 -26 -23 -32 -47 -57 -65 -83 -111 -139 -158 -171 -189 -214 -235 -242 -236 -228 -216 -188 -137 -79 -39 -30 -46 -73 -102 -125 -141 -152 -158 -151
8956 -151 -128 -102 -89 -88 -83 -68 -56 -57 -63 -60 -50 -48 -59 -77 -94 -108 -118 -119 -110 -98 -94 -97 -92 -72 -52 -57 -93 -136 -162 -172 -183 -201 -210 -198 -174 -157 -156 -169 -190 -210 -219 -210 -183
8937 -183 -147 -113 -84 -64 -60 -77 -115 -161 -193 -191 -159 -120 -95 -93 -111 -147 -188 -213 -206 -176 -140 -113 -95 -88 -89 -89 -75 -52 -39 -46 -63 -73 -75 -79 -89 -93 -83 -65 -53 -54 -66
8919 -66 -82 -99 -111 -116 -110 -92 -66 -38 -21 -21 -32 -43 -53 -62 -72 -76 -74 -78 -91 -100 -96 -90 -102 -132 -160 -168 -161 -148 -131 -112 -96 -90 -91 -95 -106 -130 -159 -176 -173 -157 -136 -110 -78
8901 -78 -45 -18 -4 -4 -17 -37 -59 -85 -117 -148 -166 -164 -153 -148 -150 -152 -143 -123 -98 -77 -62 -51 -42 -34 -31 -34 -43 -58 -79 -103 -124 -133 -125 -101 -71 -51 -46 -52 -52 -36 -12 5 6 -7
8882 -7 -24 -31 -25 -11 2 7 0 -15 -28 -32 -36 -55 -96 -144 -174 -172 -138 -87 -45 -28 -35 -50 -62 -77 -102 -130 -143 -138 -125 -117 -123 -146 -184 -222 -242 -239 -228 -224 -229 -243 -262 -279 -280
8863 -280 -262 -235 -208 -176 -134 -94 -77 -88 -107 -123 -141 -168 -194 -201 -184 -154 -130 -121 -126 -137 -144 -141 -131 -125 -128 -139 -152 -168 -186 -196 -185 -153 -122 -113 -121 -125 -115 -105 -106 -108 -92
8845 -92 -64 -48 -57 -80 -89 -71 -40 -24 -39 -74 -95 -86 -62 -52 -70 -104 -133 -150 -150 -136 -121 -116 -121 -123 -119 -123 -140 -155 -151 -134 -119 -104 -71 -26 -4 -30 -86 -129 -135 -112 -83
8827 -83 -64 -64 -79 -95 -97 -91 -95 -112 -126 -119 -96 -73 -57 -45 -40 -49 -73 -98 -106 -93 -70 -52 -46 -43 -31 -11 7 20 33 47 40 7 -28 -31 2 38 53 51 46 34 8 -24
8809 -24 -51 -73 -95 -115 -129 -146 -180 -222 -247 -242 -214 -178 -144 -122 -118 -131 -151 -166 -170 -160 -144 -138 -154 -178 -188 -184 -186 -200 -200 -169 -126 -109 -129 -168 -202 -218 -222 -223 -228 -239
8792 -239 -249 -249 -236 -215 -188 -166 -162 -181 -212 -233 -235 -221 -194 -151 -99 -53 -31 -31 -40 -44 -44 -47 -50 -49 -42 -47 -75 -120 -162 -192 -217 -245 -271 -280 -268 -248 -234 -236 -254 -274 -275 -252
8774 -252 -228 -225 -241 -255 -257 -257 -261 -261 -254 -249 -256 -263 -249 -211 -165 -129 -114 -118 -129 -133 -127 -118 -111 -98 -77 -58 -60 -84 -112 -128 -130 -122 -111 -101 -102 -119 -143 -164 -178 -186 -183 -159 -116 -71 -44
8754 -44 -45 -67 -99 -127 -145 -159 -174 -191 -202 -201 -193 -191 -193 -182 -146 -93 -50 -35 -42 -54 -61 -66 -71 -74 -68 -55 -47 -54 -71 -78 -63 -36 -16 -7 -1 8 14 12 7 2 -6 -24 -43 -51 -47 -45 -59 -89
8733 -89 -119 -128 -115 -101 -103 -118 -134 -139 -133 -112 -79 -54 -59 -90 -121 -134 -147 -176 -211 -227 -223 -218 -220 -212 -183 -149 -133 -138 -151 -163 -176 -191 -201 -193 -162 -119 -82 -63 -57 -51 -39 -30
8715 -30 -35 -58 -95 -131 -153 -152 -139 -129 -131 -145 -167 -189 -203 -210 -216 -222 -207 -158 -93 -52 -49 -72 -100 -133 -165 -181 -170 -143 -118 -97 -76 -64 -71 -89 -101 -102 -106 -117 -121 -105 -71
8697 -71 -42 -34 -54 -90 -120 -128 -118 -106 -94 -71 -37 -8 0 -2 3 18 21 -4 -46 -82 -102 -108 -103 -85 -61 -51 -63 -83 -93 -97 -109 -125 -126 -109 -95 -101 -118 -125 -120 -107 -84 -49
8679 -49 -22 -27 -66 -112 -144 -167 -190 -209 -207 -183 -150 -125 -121 -136 -159 -178 -193 -204 -199 -173 -139 -122 -125 -126 -109 -78 -50 -27 -12 -11 -26 -45 -57 -68 -84 -100 -112 -132 -170
8662 -170 -207 -213 -183 -137 -97 -70 -60 -72 -99 -122 -132 -136 -136 -121 -85 -45 -28 -45 -85 -131 -167 -186 -186 -182 -192 -220 -250 -263 -254 -233 -212 -196 -183 -176 -181 -194 -200 -187 -162
8645 -162 -144 -142 -150 -151 -135 -101 -64 -51 -77 -131 -182 -208 -210 -199 -187 -183 -189 -194 -178 -141 -103 -85 -81 -74 -60 -45 -34 -27 -24 -30 -43 -57 -64 -61 -49 -31 -19 -21 -32 -43 -52 -64 -78
8627 -78 -83 -79 -79 -93 -111 -114 -104 -103 -128 -169 -194 -182 -143 -104 -81 -75 -75 -69 -53 -35 -35 -69 -125 -166 -161 -115 -62 -31 -27 -42 -62 -80 -98 -122 -156 -196 -232 -255 -261 -255 -249 -247 -237
8608 -237 -207 -169 -150 -161 -181 -184 -173 -170 -180 -187 -181 -172 -174 -187 -200 -206 -200 -183 -162 -150 -142 -127 -103 -85 -81 -84 -87 -98 -116 -130 -128 -119 -116 -127 -147 -179 -222 -257 -261 -233 -195 -171 -164
8589 -164 -164 -159 -144 -126 -118 -122 -131 -131 -123 -112 -98 -79 -64 -58 -50 -27 5 21 12 1 13 39 52 42 21 4 -14 -41 -71 -95 -115 -133 -143 -135 -107 -78 -62 -57 -54 -49 -50 -61
8571 -61 -80 -106 -148 -201 -246 -261 -245 -218 -195 -174 -147 -115 -87 -73 -81 -108 -139 -157 -158 -153 -149 -144 -134 -126 -127 -134 -145 -161 -175 -175 -156 -136 -129 -124 -97 -57 -43 -80 -146 -200 -223
8553 -223 -224 -210 -175 -119 -60 -19 -1 2 8 17 20 3 -27 -52 -49 -16 24 54 60 38 -13 -84 -149 -187 -187 -161 -127 -101 -87 -80 -75 -71 -72 -83 -102 -121 -128 -121 -103 -85 -75 -81
8535 -81 -104 -141 -179 -210 -228 -234 -228 -211 -191 -177 -168 -156 -140 -131 -132 -141 -152 -170 -197 -217 -214 -190 -167 -158 -160 -162 -166 -170 -167 -151 -135 -138 -158 -175 -173 -155 -142 -144 -158 -174 -189 -206 -223
8517 -223 -225 -200 -164 -149 -166 -193 -200 -189 -186 -207 -238 -255 -249 -226 -194 -162 -138 -122 -107 -89 -74 -74 -87 -100 -101 -92 -90 -109 -144 -166 -151 -107 -66 -54 -64 -80 -98 -123 -150
8500 -150 -156 -131 -91 -70 -78 -99 -108 -104 -108 -127 -140 -125 -87 -61 -73 -113 -152 -176 -189 -192 -186 -171 -159 -159 -173 -191 -199 -184 -151 -119 -108 -116 -129 -135 -139 -145 -152 -152 -141 -125 -109 -99
8482 -99 -95 -102 -119 -139 -143 -121 -84 -68 -89 -126 -146 -144 -141 -150 -159 -156 -159 -182 -216 -235 -234 -228 -228 -225 -206 -173 -144 -123 -102 -72 -37 -12 -10 -28 -54 -83 -115 -143 -157 -146 -115 -82
8463 -82 -60 -54 -60 -73 -88 -105 -124 -148 -171 -178 -155 -109 -66 -54 -71 -93 -95 -79 -64 -63 -76 -95 -112 -120 -111 -94 -82 -85 -92 -92 -88 -88 -87 -72 -40 -3 21 30 26 15 4 4 18
8445 18 40 54 47 16 -29 -71 -92 -84 -60 -38 -29 -24 -14 -4 -14 -56 -114 -155 -157 -130 -100 -85 -85 -89 -92 -93 -97 -107 -116 -121 -132 -163 -209 -234 -209 -150 -107 -106 -127 -137 -129 -115
8426 -115 -100 -84 -68 -60 -58 -55 -52 -57 -72 -83 -79 -67 -63 -81 -117 -147 -151 -128 -102 -97 -112 -133 -158 -192 -229 -245 -227 -196 -182 -193 -206 -204 -192 -185 -186 -185 -169 -136 -94 -64 -64 -94
8408 -94 -140 -183 -207 -201 -167 -124 -99 -103 -128 -156 -182 -210 -234 -241 -227 -197 -160 -123 -98 -99 -123 -142 -130 -92 -56 -44 -48 -50 -48 -44 -41 -36 -32 -37 -50 -58 -49 -33 -33 -60 -102 -136 -149
8390 -149 -148 -144 -139 -126 -104 -87 -97 -135 -176 -181 -140 -80 -40 -31 -39 -45 -48 -59 -84 -121 -162 -203 -244 -281 -311 -324 -317 -293 -269 -250 -226 -185 -136 -103 -102 -123 -147 -168 -191 -222
8372 -222 -254 -273 -269 -243 -207 -178 -162 -154 -145 -133 -128 -135 -151 -155 -130 -81 -33 -9 -10 -22 -36 -57 -86 -115 -136 -154 -180 -210 -223 -199 -144 -87 -57 -57 -72 -81 -88 -102 -124 -140
8355 -140 -143 -138 -127 -109 -89 -87 -107 -128 -122 -90 -65 -71 -98 -114 -100 -61 -18 5 4 -13 -35 -57 -78 -89 -85 -72 -64 -68 -79 -98 -128 -160 -173 -165 -161 -183 -211 -213 -185 -159 -163
8337 -163 -195 -232 -253 -247 -213 -166 -133 -129 -152 -185 -215 -231 -220 -188 -156 -146 -155 -171 -190 -219 -254 -272 -262 -239 -222 -213 -193 -156 -113 -72 -32 10 45 59 52 34 12
8321 12 -12 -43 -73 -96 -112 -126 -136 -139 -137 -141 -159 -177 -177 -153 -122 -98 -86 -78 -75 -77 -75 -62 -39 -24 -26 -38 -46 -46 -44 -46 -48 -47 -44 -42 -42 -39 -32 -24 -22 -33 -59 -94 -130 -163 -191 -208
8301 -208 -209 -190 -157 -125 -103 -92 -83 -79 -83 -98 -116 -130 -139 -145 -151 -156 -167 -186 -203 -199 -168 -130 -112 -125 -157 -190 -213 -224 -230 -239 -246 -238 -215 -188 -172 -169 -173 -178 -183 -183 -171 -151 -131 -118
8282 -118 -110 -110 -118 -127 -125 -107 -81 -60 -48 -49 -66 -92 -110 -108 -95 -88 -98 -116 -133 -140 -128 -98 -67 -62 -93 -133 -146 -130 -115 -119 -132 -132 -122 -122 -130 -127 -104 -74 -51 -29 1 23
8264 23 12 -32 -80 -101 -93 -74 -64 -69 -86 -98 -92 -66 -31 -5 -3 -38 -100 -155 -173 -157 -140 -145 -164 -174 -171 -166 -166 -171 -179 -187 -191 -191 -191 -194 -196 -197 -204 -216 -216 -193 -155 -122 -100 -85 -78
8244 -78 -83 -94 -101 -104 -110 -116 -113 -98 -84 -87 -111 -148 -182 -198 -187 -156 -111 -53 16 85 131 149 152 147 130 102 76 64 58 46 28 14 13 24 37 40 24 -3 -26 -38 -46 -54
8226 -54 -50 -36 -36 -68 -118 -154 -162 -154 -140 -117 -85 -60 -56 -68 -82 -99 -130 -174 -210 -222 -208 -181 -155 -138 -128 -121 -109 -90 -60 -26 -4 -8 -39 -80 -115 -136 -140 -127 -100
8209 -100 -72 -57 -57 -66 -82 -112 -155 -196 -213 -208 -203 -211 -222 -220 -212 -216 -232 -239 -227 -210 -202 -198 -182 -161 -159 -189 -237 -277 -293 -289 -273 -251 -225 -201 -191 -194 -198 -186 -159 -132 -115 -102
8191 -102 -94 -107 -145 -185 -200 -188 -170 -156 -137 -111 -96 -109 -148 -196 -238 -259 -247 -206 -156 -119 -100 -103 -128 -163 -187 -188 -177 -170 -166 -160 -151 -147 -142 -130 -115 -110 -119 -136 -154 -164
8174 -164 -160 -140 -114 -94 -79 -61 -44 -38 -39 -31 -14 -2 -3 1 31 69 87 80 64 49 21 -26 -80 -122 -154 -185 -215 -230 -222 -196 -161 -125 -96 -86 -99 -121 -133 -126 -106
8157 -106 -86 -76 -74 -68 -52 -35 -36 -57 -78 -80 -77 -95 -131 -155 -141 -104 -75 -69 -74 -78 -81 -86 -89 -80 -62 -45 -44 -65 -97 -119 -117 -102 -95 -109 -135 -161 -178 -180 -164 -141 -127 -130 -148
8138 -148 -169 -184 -183 -169 -158 -167 -197 -226 -237 -238 -243 -247 -233 -197 -157 -128 -115 -115 -126 -133 -125 -108 -104 -126 -163 -192 -204 -200 -186 -173 -176 -198 -225 -237 -231 -217 -199 -172 -140 -118 -117
8120 -117 -124 -123 -110 -89 -67 -45 -30 -26 -32 -46 -66 -86 -94 -84 -69 -62 -62 -59 -50 -45 -45 -41 -27 -14 -14 -23 -30 -35 -48 -72 -94 -106 -107 -98 -83 -72 -78 -101 -130 -153 -171 -183 -187 -182 -180 -187
8100 -187 -194 -184 -159 -135 -121 -108 -84 -60 -54 -73 -106 -136 -155 -167 -176 -182 -184 -174 -149 -120 -107 -115 -126 -119 -94 -71 -61 -58 -53 -43 -33 -25 -18 -17 -22 -26 -26 -26 -34 -50 -64 -69 -67 -63 -66
8081 -66 -81 -101 -108 -91 -61 -40 -40 -53 -66 -69 -59 -39 -22 -19 -27 -30 -19 -7 -10 -26 -46 -59 -62 -54 -38 -18 0 19 32 25 -9 -62 -105 -118 -104 -89 -88 -104 -121 -129 -129 -123
8063 -123 -109 -82 -49 -24 -17 -23 -32 -45 -63 -83 -99 -111 -122 -129 -129 -125 -122 -110 -84 -57 -60 -101 -157 -200 -222 -228 -215 -179 -130 -86 -59 -50 -60 -88 -123 -143 -144 -136 -135 -142 -149 -154 -157
8044 -157 -160 -164 -173 -180 -173 -155 -148 -171 -208 -227 -215 -194 -184 -178 -166 -157 -168 -193 -208 -210 -217 -237 -250 -236 -202 -174 -163 -160 -163 -173 -187 -196 -195 -187 -174 -156 -136 -119 -108 -98 -85 -70
8026 -70 -51 -28 -13 -19 -47 -79 -100 -108 -111 -112 -113 -112 -105 -83 -51 -28 -33 -58 -79 -78 -56 -26 -4 1 -8 -22 -31 -36 -45 -64 -89 -118 -141 -143 -121 -90 -68 -61 -64 -72 -81 -77 -57 -45 -71
8006 -71 -128 -172 -175 -161 -173 -218 -268 -290 -286 -272 -259 -248 -240 -231 -217 -196 -172 -156 -154 -154 -144 -120 -95 -85 -89 -92 -85 -73 -66 -62 -58 -58 -67 -82 -98 -115 -139 -170 -204 -237 -264 -276
7988 -276 -268 -246 -224 -214 -213 -221 -235 -252 -267 -274 -270 -247 -205 -159 -129 -127 -141 -162 -184 -208 -228 -241 -249 -256 -258 -250 -231 -204 -178 -160 -152 -147 -136 -121 -111 -108 -99 -78 -58 -52 -55 -54 -47 -48
7969 -48 -62 -74 -74 -76 -96 -123 -132 -112 -85 -73 -79 -95 -116 -140 -161 -168 -163 -157 -150 -135 -114 -113 -142 -179 -186 -152 -107 -82 -84 -98 -115 -134 -152 -167 -178 -179 -166 -137 -108 -86 -67
7951 -67 -41 -18 -14 -26 -37 -40 -50 -74 -99 -111 -115 -129 -155 -178 -185 -177 -161 -143 -128 -124 -139 -168 -193 -197 -184 -171 -168 -163 -144 -117 -106 -121 -150 -168 -161 -134 -101 -84 -97 -133
7934 -133 -173 -198 -210 -217 -217 -207 -191 -172 -150 -122 -94 -75 -70 -82 -110 -149 -180 -194 -203 -222 -242 -240 -217 -194 -180 -157 -115 -75 -63 -81 -107 -127 -140 -150 -158 -170 -188 -208
7918 -208 -228 -247 -267 -276 -267 -246 -223 -202 -172 -139 -121 -126 -142 -162 -187 -217 -239 -248 -257 -277 -288 -258 -181 -93 -35 -21 -33 -55 -81 -109 -130 -136 -129 -123 -125 -133 -142 -154 -173 -192
7900 -192 -198 -184 -160 -140 -133 -136 -144 -152 -158 -161 -165 -172 -182 -190 -199 -212 -228 -238 -234 -215 -184 -149 -118 -101 -101 -109 -114 -114 -111 -104 -90 -77 -79 -98 -118 -125 -117 -97 -71 -51 -61 -110 -171 -209 -212 -198
7880 -198 -186 -174 -158 -142 -127 -103 -73 -58 -70 -96 -117 -136 -163 -188 -187 -165 -149 -151 -155 -144 -130 -129 -145 -168 -193 -213 -216 -196 -166 -140 -114 -82 -61 -76 -129 -183 -206
7864 -206 -202 -196 -200 -201 -187 -160 -134 -115 -103 -96 -83 -62 -38 -32 -52 -83 -96 -82 -60 -49 -44 -30 -5 5 -17 -68 -127 -180 -223 -251 -252 -223 -176 -134 -114 -117 -135 -160 -184
7847 -184 -201 -201 -180 -145 -99 -43 11 42 28 -14 -50 -59 -55 -57 -62 -52 -31 -23 -39 -70 -97 -110 -105 -83 -52 -33 -38 -57 -67 -56 -33 -20 -27 -45 -60 -68 -77 -86 -84 -70 -60
7830 -60 -70 -94 -115 -125 -128 -128 -126 -126 -133 -143 -144 -136 -131 -136 -141 -137 -123 -103 -79 -55 -46 -56 -70 -69 -52 -37 -36 -46 -59 -77 -107 -144 -171 -174 -154 -133 -133 -149 -154 -132 -99 -80 -77 -68 -41
7810 -41 -9 8 4 -15 -48 -89 -118 -116 -87 -61 -66 -96 -126 -138 -137 -130 -118 -98 -80 -74 -74 -68 -59 -67 -100 -137 -147 -123 -90 -69 -68 -78 -90 -94 -84 -64 -50 -55 -80 -113 -136 -144
7792 -144 -139 -132 -130 -134 -141 -145 -140 -126 -109 -98 -97 -105 -120 -137 -151 -156 -161 -173 -195 -219 -244 -270 -293 -294 -263 -216 -181 -165 -151 -129 -106 -100 -115 -139 -162 -178 -185 -180 -166 -153 -150 -160 -172
7773 -172 -181 -195 -216 -233 -231 -213 -199 -196 -191 -177 -169 -181 -197 -194 -178 -181 -207 -225 -209 -175 -155 -162 -178 -184 -177 -164 -158 -168 -185 -195 -193 -195 -210 -225 -217 -184 -149 -130 -124 -117 -109 -110 -128 -152
7754 -152 -167 -165 -154 -148 -147 -136 -101 -46 3 24 15 -2 -8 5 32 56 62 45 13 -12 -18 -5 4 -8 -41 -76 -100 -112 -119 -130 -147 -169 -186 -195 -200 -206 -211 -208 -207 -220 -241 -251
7736 -251 -239 -212 -184 -165 -159 -171 -195 -211 -207 -188 -169 -156 -155 -167 -184 -187 -166 -139 -129 -131 -125 -110 -106 -118 -129 -130 -132 -145 -156 -149 -128 -107 -89 -77 -76 -93 -115 -122 -110 -93 -90
7718 -90 -98 -109 -116 -116 -106 -83 -47 -11 5 -8 -42 -80 -116 -154 -191 -214 -222 -227 -235 -231 -199 -152 -121 -117 -124 -126 -129 -148 -182 -208 -211 -196 -182 -171 -149 -106 -54 -18 -8 -20 -42
7700 -42 -74 -115 -152 -171 -165 -143 -120 -108 -113 -129 -149 -166 -176 -179 -169 -143 -103 -55 -7 29 48 48 40 30 17 -1 -23 -45 -70 -100 -129 -148 -158 -165 -165 -156 -144 -140 -138 -121
7683 -121 -82 -41 -23 -33 -54 -74 -95 -122 -153 -181 -196 -190 -166 -139 -126 -127 -127 -112 -92 -83 -92 -110 -131 -147 -151 -135 -105 -84 -89 -121 -165 -204 -229 -235 -225 -209 -203 -214 -229
7666 -229 -227 -194 -141 -93 -73 -84 -111 -132 -140 -137 -127 -111 -96 -90 -95 -108 -121 -127 -122 -114 -108 -108 -109 -108 -111 -119 -118 -96 -66 -51 -58 -71 -76 -79 -89 -104 -114 -119 -118 -106 -82 -58 -46 -48 -61
7647 -61 -87 -126 -159 -163 -138 -102 -73 -61 -68 -90 -114 -130 -138 -138 -123 -94 -68 -64 -75 -74 -54 -34 -40 -67 -94 -105 -102 -97 -94 -91 -83 -76 -79 -95 -103 -84 -44 -14 -15 -38 -68 -88 -87 -61
7628 -61 -23 0 -9 -36 -61 -81 -105 -129 -147 -159 -178 -207 -230 -233 -218 -202 -189 -168 -125 -64 -12 10 7 -3 -12 -21 -29 -26 -18 -30 -77 -141 -188 -205 -200 -185 -161 -130 -104 -89
7610 -89 -85 -82 -70 -43 -7 22 37 44 51 56 51 37 24 16 17 26 36 33 9 -25 -52 -70 -83 -86 -64 -20 15 20 1 -19 -29 -34 -50 -81 -121 -153 -169 -180 -198 -214 -208 -174
7592 -174 -126 -83 -60 -65 -101 -148 -176 -176 -162 -153 -146 -137 -136 -148 -157 -144 -115 -92 -82 -80 -79 -82 -84 -85 -95 -127 -170 -195 -189 -172 -164 -163 -156 -138 -114 -85 -56 -40 -45 -65 -87 -109 -140
7573 -140 -177 -206 -217 -218 -217 -216 -210 -197 -182 -172 -167 -163 -150 -125 -97 -81 -84 -103 -125 -141 -148 -145 -136 -117 -92 -70 -72 -108 -161 -202 -216 -214 -214 -218 -219 -214 -203 -183 -154 -129 -124 -138 -151
7555 -151 -157 -166 -187 -206 -217 -229 -252 -276 -277 -250 -218 -197 -186 -178 -170 -157 -126 -74 -21 5 0 -12 -15 -8 -7 -24 -58 -102 -148 -188 -211 -214 -203 -189 -174 -150 -117 -87 -77 -84
7537 -84 -91 -90 -91 -101 -110 -102 -76 -53 -44 -37 -18 12 39 40 13 -27 -65 -90 -104 -114 -125 -140 -154 -158 -144 -116 -89 -72 -67 -70 -81 -100 -115 -114 -95 -70 -58 -68 -95 -125 -149
7520 -149 -166 -184 -200 -192 -139 -53 24 56 39 5 -16 -18 -16 -28 -55 -87 -111 -131 -155 -181 -197 -188 -156 -120 -98 -102 -126 -150 -157 -145 -125 -109 -89 -54 -11 9 -14 -73
7503 -73 -130 -155 -147 -128 -123 -145 -191 -240 -270 -268 -243 -213 -185 -161 -139 -132 -149 -189 -236 -269 -274 -252 -220 -199 -196 -202 -208 -208 -197 -172 -136 -105 -97 -107 -120 -130 -139 -145 -136 -105 -64 -28
7485 -28 -8 -4 -14 -39 -70 -95 -108 -114 -120 -128 -126 -106 -75 -49 -43 -62 -103 -156 -203 -229 -229 -213 -195 -182 -168 -151 -135 -125 -118 -107 -93 -82 -83 -97 -120 -146 -171 -191 -198 -190 -174
7467 -174 -168 -178 -198 -212 -206 -179 -145 -125 -131 -155 -175 -180 -181 -187 -194 -195 -194 -202 -215 -225 -232 -234 -224 -192 -154 -132 -129 -121 -101 -84 -85 -92 -95 -98 -110 -121 -112 -87 -66 -62 -72 -98 -138 -175 -186
7448 -186 -172 -155 -148 -146 -141 -136 -136 -139 -145 -152 -154 -143 -121 -103 -101 -111 -123 -132 -140 -147 -151 -152 -152 -153 -150 -141 -126 -108 -96 -94 -104 -124 -154 -186 -201 -193 -182 -189 -212 -227 -222 -210 -204 -204 -207 -213 -216 -199 -152
7426 -152 -96 -60 -62 -95 -141 -182 -201 -193 -171 -155 -155 -168 -187 -207 -219 -217 -209 -204 -201 -194 -185 -180 -176 -173 -173 -178 -178 -163 -137 -120 -118 -123 -123 -117 -104 -86 -70 -64 -71 -83 -104 -140 -188 -227 -249
7407 -249 -261 -271 -272 -250 -207 -160 -121 -96 -89 -101 -121 -131 -125 -112 -107 -112 -122 -127 -126 -125 -132 -145 -156 -159 -162 -166 -161 -133 -89 -53 -48 -73 -117 -161 -194 -214 -226 -235 -241 -241 -239 -240 -245 -253 -261 -265
7387 -265 -261 -247 -229 -216 -210 -206 -202 -196 -189 -181 -178 -180 -183 -187 -202 -233 -262 -270 -262 -252 -235 -196 -140 -97 -86 -89 -89 -90 -103 -113 -102 -80 -77 -100 -119 -115 -95 -83 -86 -103 -133 -170 -196 -194 -167
7367 -167 -140 -134 -149 -168 -174 -162 -146 -144 -155 -163 -151 -124 -95 -74 -58 -47 -47 -62 -76 -74 -56 -34 -21 -16 -20 -33 -54 -75 -86 -90 -97 -111 -130 -147 -160 -169 -174 -179 -189 -200 -207 -213
7349 -213 -224 -236 -232 -201 -159 -136 -141 -160 -179 -195 -204 -202 -188 -170 -155 -146 -144 -151 -159 -148 -118 -93 -101 -136 -167 -173 -163 -161 -177 -197 -201 -186 -166 -156 -155 -150 -134 -118 -110 -105 -95 -84 -85
7331 -85 -103 -126 -138 -135 -121 -105 -100 -107 -112 -99 -74 -59 -67 -89 -113 -135 -157 -179 -197 -202 -186 -151 -113 -99 -114 -139 -145 -130 -113 -110 -127 -159 -199 -236 -258 -266 -263 -245 -211 -169
7313 -169 -139 -134 -150 -171 -187 -192 -181 -154 -122 -100 -93 -96 -104 -116 -131 -139 -135 -125 -126 -144 -166 -174 -165 -158 -167 -186 -199 -198 -191 -186 -180 -168 -152 -142 -140 -137 -130 -121 -121 -135 -154 -166 -167 -168 -178 -191
7293 -191 -192 -178 -162 -159 -165 -168 -168 -181 -209 -235 -237 -213 -185 -167 -154 -132 -101 -71 -52 -42 -41 -48 -61 -79 -100 -123 -137 -128 -101 -76 -66 -61 -40 -10 2 -15 -49 -74 -86 -92
7276 -92 -99 -103 -101 -95 -89 -83 -81 -92 -122 -163 -200 -219 -213 -187 -157 -134 -122 -118 -123 -137 -151 -153 -144 -134 -129 -116 -86 -45 -16 -9 -20 -39 -65 -94 -120 -145 -174 -201 -201 -155 -81 -17 15
7257 15 23 15 -8 -39 -61 -68 -80 -109 -137 -140 -120 -107 -120 -148 -174 -194 -215 -241 -260 -260 -231 -183 -137 -110 -98 -78 -40 -2 8 -12 -46 -70 -76 -71 -65 -66 -72 -77 -78 -73 -62 -46
7239 -46 -31 -22 -19 -13 0 6 0 -10 -14 -13 -25 -57 -99 -137 -167 -194 -216 -223 -204 -161 -114 -84 -78 -87 -93 -90 -84 -85 -87 -79 -61 -40 -24 -12 -4 -9 -38 -85 -123 -131 -116 -96 -80 -63 -43
7220 -43 -30 -38 -65 -94 -109 -97 -64 -30 -18 -31 -50 -55 -48 -36 -25 -16 -20 -44 -76 -96 -101 -106 -119 -127 -119 -105 -101 -108 -115 -113 -97 -66 -25 3 7 -10 -34 -57 -85 -109 -109 -80 -43
7201 -43 -31 -51 -86 -121 -152 -168 -158 -121 -84 -74 -85 -87 -65 -40 -41 -68 -93 -92 -71 -52 -47 -52 -62 -73 -83 -90 -102 -125 -161 -200 -233 -251 -250 -230 -201 -173 -152 -138 -132
7184 -132 -129 -117 -84 -43 -19 -25 -43 -50 -42 -40 -48 -54 -47 -37 -38 -44 -39 -23 -19 -43 -76 -93 -90 -88 -109 -151 -196 -225 -238 -239 -237 -230 -212 -174 -121 -69 -30 -4 15 28 24 4 -13 -13
7165 -13 0 1 -22 -63 -98 -114 -120 -131 -150 -169 -180 -176 -156 -127 -104 -96 -101 -106 -103 -97 -94 -99 -117 -150 -187 -207 -198 -169 -142 -132 -129 -118 -97 -77 -71 -76 -75 -66 -65 -91 -138 -178 -192 -187
7146 -187 -180 -174 -153 -117 -80 -62 -64 -76 -90 -100 -101 -93 -85 -84 -82 -68 -48 -44 -65 -90 -96 -88 -95 -125 -161 -176 -169 -162 -168 -179 -181 -171 -147 -109 -58 -9 17 12 -11 -28 -20 8 38 45
7127 45 18 -38 -103 -151 -170 -170 -175 -194 -219 -235 -242 -239 -224 -196 -167 -158 -169 -182 -182 -167 -144 -118 -93 -76 -76 -87 -97 -99 -91 -80 -80 -100 -132 -162 -179 -187 -191 -188 -173 -149 -124 -99
7109 -99 -76 -66 -76 -98 -113 -112 -103 -98 -101 -110 -121 -129 -129 -120 -103 -74 -36 -3 9 0 -20 -46 -71 -80 -65 -37 -17 -16 -26 -37 -55 -77 -93 -101 -112 -132 -149 -149 -132 -108 -75 -39
7090 -39 -22 -41 -84 -113 -108 -77 -37 0 23 13 -33 -93 -131 -126 -88 -47 -31 -39 -53 -53 -35 -6 22 44 50 40 25 19 18 7 -18 -44 -62 -74 -82 -81 -68 -55 -54 -61 -67
7073 -67 -68 -65 -55 -29 8 39 48 42 30 16 -3 -25 -39 -41 -44 -55 -69 -80 -96 -126 -162 -181 -173 -151 -133 -119 -97 -69 -52 -54 -67 -78 -84 -89 -98 -114 -141 -176 -208 -222 -215
7055 -215 -195 -173 -152 -129 -97 -65 -48 -57 -78 -97 -112 -133 -161 -190 -221 -258 -288 -290 -267 -250 -258 -277 -279 -260 -238 -217 -189 -150 -110 -84 -76 -83 -95 -103 -100 -91 -76 -58 -45
7038 -45 -56 -90 -119 -115 -81 -43 -19 -7 -11 -41 -93 -143 -174 -184 -180 -158 -122 -86 -64 -52 -49 -64 -99 -138 -161 -167 -167 -164 -154 -142 -136 -137 -142 -157 -189 -229 -255 -259 -248 -228 -200
7020 -200 -170 -149 -145 -155 -169 -180 -190 -195 -192 -175 -139 -89 -46 -28 -32 -36 -30 -24 -31 -48 -71 -107 -156 -193 -190 -149 -106 -87 -84 -77 -60 -51 -64 -91 -114 -122 -118 -118 -132 -155 -170 -166 -156
7002 -156 -162 -194 -232 -247 -231 -203 -181 -166 -150 -137 -136 -141 -137 -123 -116 -131 -161 -186 -195 -183 -151 -102 -55 -28 -21 -23 -34 -59 -99 -144 -180 -205 -217 -215 -207 -209 -226 -242 -241 -222 -200
6984 -200 -184 -178 -180 -186 -189 -184 -178 -177 -178 -168 -144 -114 -93 -88 -100 -118 -128 -119 -97 -77 -69 -71 -73 -70 -55 -30 -11 -21 -62 -111 -144 -162 -178 -192 -187 -155 -112 -77 -62 -70 -98 -132 -148
6965 -148 -131 -96 -69 -69 -89 -114 -133 -147 -162 -182 -201 -207 -190 -159 -131 -125 -139 -153 -145 -117 -93 -94 -114 -130 -133 -134 -147 -167 -182 -183 -171 -150 -128 -115 -111 -103 -84 -69 -79 -109
6948 -109 -140 -163 -185 -199 -189 -158 -133 -124 -111 -73 -20 19 31 21 -3 -36 -59 -61 -57 -73 -110 -138 -140 -128 -127 -140 -158 -177 -197 -209 -203 -177 -140 -98 -57 -26 -10 -2
6931 -2 1 -5 -32 -70 -92 -88 -74 -72 -85 -96 -91 -73 -50 -30 -23 -39 -68 -86 -79 -65 -70 -97 -119 -121 -115 -115 -113 -98 -78 -70 -69 -57 -32 -9 7 28 59 82 77 46 9 -23 -48
6913 -48 -64 -75 -96 -140 -190 -221 -223 -212 -203 -196 -189 -185 -180 -162 -134 -111 -104 -107 -102 -89 -77 -70 -67 -69 -76 -80 -69 -51 -47 -61 -73 -55 -14 15 7 -32 -68 -79 -71 -72 -101 -152 -206 -240
6894 -240 -244 -222 -188 -152 -119 -91 -70 -61 -66 -80 -90 -89 -86 -97 -126 -158 -174 -173 -162 -152 -148 -154 -167 -172 -162 -153 -172 -217 -253 -252 -219 -176 -137 -110 -105 -125 -142 -128 -97 -93 -129
6876 -129 -166 -162 -131 -112 -117 -121 -110 -96 -94 -94 -81 -58 -46 -47 -50 -49 -58 -81 -105 -115 -118 -133 -159 -178 -186 -194 -211 -224 -215 -191 -170 -160 -153 -145 -141 -138 -123 -96 -75 -73 -87 -107 -129 -147
6857 -147 -147 -129 -112 -115 -127 -125 -105 -86 -80 -83 -84 -84 -82 -82 -91 -118 -155 -176 -163 -122 -76 -39 -12 4 7 0 -14 -27 -33 -28 -17 -10 -16 -34 -53 -61 -58 -52 -57 -76 -105 -129 -142 -148 -147 -134
6837 -134 -104 -67 -40 -29 -23 -14 -11 -23 -46 -59 -51 -33 -27 -34 -42 -47 -58 -83 -102 -94 -61 -33 -33 -56 -87 -114 -134 -148 -156 -165 -179 -194 -200 -189 -167 -153 -160 -183 -197 -186 -159 -137
6819 -137 -131 -132 -136 -149 -171 -182 -168 -142 -129 -129 -127 -118 -117 -138 -171 -199 -216 -222 -212 -187 -163 -159 -175 -187 -174 -141 -112 -107 -122 -143 -163 -180 -194 -203 -205 -200 -192 -185 -183 -181 -170 -144 -115
6800 -115 -97 -90 -85 -77 -67 -57 -50 -61 -95 -138 -157 -142 -118 -110 -110 -94 -65 -50 -66 -91 -100 -92 -86 -96 -126 -168 -207 -227 -223 -204 -183 -169 -165 -174 -190 -198 -188 -166 -147 -135 -123
6782 -123 -109 -100 -107 -127 -147 -149 -122 -73 -26 -5 -16 -44 -69 -82 -86 -92 -110 -141 -170 -182 -182 -195 -232 -274 -286 -258 -214 -184 -182 -201 -229 -260 -289 -301 -284 -238 -179 -130
6766 -130 -113 -123 -136 -126 -94 -64 -58 -79 -113 -146 -168 -174 -166 -157 -156 -157 -154 -152 -161 -173 -174 -161 -149 -143 -131 -109 -96 -110 -140 -152 -132 -103 -94 -111 -134 -149 -161 -180 -205 -224 -227
6748 -227 -220 -213 -206 -191 -173 -167 -178 -189 -185 -170 -156 -146 -129 -110 -109 -134 -166 -182 -177 -164 -154 -147 -140 -138 -147 -158 -155 -132 -98 -75 -74 -92 -115 -131 -137 -132 -120 -106 -96 -96 -112 -139 -161
6729 -161 -162 -150 -150 -178 -209 -208 -174 -140 -142 -175 -208 -213 -192 -163 -142 -135 -138 -147 -168 -202 -234 -249 -245 -242 -247 -246 -221 -177 -139 -122 -124 -133 -142 -147 -144 -132 -115 -97 -83 -81 -91 -102 -99 -77
6710 -77 -49 -35 -41 -59 -70 -68 -65 -80 -114 -147 -160 -159 -164 -190 -231 -267 -276 -246 -187 -131 -107 -118 -145 -173 -208 -249 -273 -257 -215 -187 -190 -197 -171 -110 -50 -24 -43 -87 -126
6693 -126 -142 -133 -107 -75 -46 -29 -34 -61 -97 -127 -147 -162 -172 -172 -163 -154 -146 -128 -92 -45 -7 9 4 -14 -35 -47 -43 -32 -26 -34 -51 -63 -69 -71 -77 -83 -80 -64 -44 -37 -49 -70 -86
6675 -86 -91 -79 -52 -25 -26 -71 -140 -192 -204 -190 -181 -194 -227 -262 -280 -271 -238 -203 -181 -173 -173 -184 -211 -236 -235 -204 -168 -152 -149 -143 -130 -127 -138 -148 -141 -120 -102 -98 -102 -101 -91 -76
6657 -76 -59 -41 -25 -24 -49 -91 -134 -162 -175 -179 -171 -151 -125 -100 -72 -37 -6 1 -22 -62 -98 -128 -156 -187 -218 -243 -253 -238 -197 -147 -114 -109 -121 -135 -143 -145 -141 -130 -112
6640 -112 -86 -48 -9 9 -13 -74 -151 -217 -258 -269 -251 -207 -153 -110 -94 -97 -100 -90 -76 -70 -69 -62 -51 -57 -87 -125 -149 -156 -158 -165 -174 -182 -189 -190 -181 -166 -155 -148 -140 -124 -105 -87 -76
6621 -76 -81 -107 -144 -165 -155 -125 -97 -83 -80 -80 -77 -77 -88 -109 -124 -117 -98 -89 -101 -116 -116 -99 -78 -62 -56 -64 -86 -107 -115 -111 -102 -91 -79 -69 -66 -70 -77 -88 -102 -115 -129 -152 -189
6602 -189 -223 -234 -226 -217 -213 -205 -188 -170 -160 -155 -146 -132 -118 -106 -107 -130 -168 -197 -204 -204 -215 -237 -247 -230 -192 -149 -118 -102 -100 -96 -78 -43 -6 11 -1 -33 -65 -89 -108 -125
6585 -125 -131 -118 -92 -74 -79 -106 -138 -157 -159 -150 -145 -154 -168 -177 -175 -167 -154 -134 -111 -93 -88 -94 -103 -108 -97 -67 -33 -17 -28 -57 -92 -134 -179 -217 -236 -235 -222 -207 -191 -177 -163 -148
6567 -148 -138 -134 -124 -94 -54 -31 -37 -54 -60 -56 -56 -61 -59 -50 -41 -36 -30 -26 -35 -60 -91 -121 -147 -166 -170 -154 -128 -107 -107 -129 -162 -189 -201 -199 -184 -156 -121 -99 -102 -126 -156 -180 -193
6548 -193 -190 -169 -136 -100 -62 -24 5 17 13 3 -16 -52 -101 -146 -175 -190 -192 -184 -179 -196 -229 -250 -242 -218 -199 -192 -191 -191 -189 -179 -153 -120 -92 -78 -82 -103 -128 -142 -144 -145 -156
6530 -156 -172 -185 -197 -207 -207 -193 -173 -160 -155 -153 -150 -146 -142 -142 -154 -178 -199 -202 -189 -177 -178 -187 -198 -205 -205 -199 -193 -186 -170 -139 -107 -100 -128 -172 -207 -217 -210 -202 -196 -183 -158 -133 -124 -132 -137 -129
6510 -129 -116 -112 -111 -102 -83 -66 -55 -47 -41 -33 -17 8 35 50 54 47 21 -27 -78 -102 -98 -93 -106 -132 -160 -189 -217 -231 -222 -199 -177 -164 -166 -186 -212 -220 -205 -189 -193 -205 -199 -167
6492 -167 -125 -91 -65 -47 -38 -40 -54 -80 -115 -145 -162 -171 -181 -190 -180 -142 -91 -55 -51 -72 -93 -90 -63 -39 -45 -81 -120 -139 -141 -142 -153 -169 -179 -176 -162 -147 -144 -151 -161 -165 -159 -143
6474 -143 -122 -111 -116 -132 -142 -138 -130 -127 -122 -104 -70 -33 -8 -4 -30 -80 -135 -169 -169 -146 -125 -115 -114 -115 -116 -118 -118 -111 -102 -105 -127 -156 -174 -175 -167 -158 -150 -146 -155 -173 -183 -169 -132 -101 -98 -117
6454 -117 -135 -138 -134 -134 -138 -140 -135 -125 -115 -105 -97 -93 -92 -92 -98 -109 -114 -96 -58 -18 1 -4 -36 -86 -133 -148 -121 -76 -45 -42 -54 -67 -70 -60 -49 -58 -94 -136 -153 -141 -121 -110 -108
6435 -108 -115 -132 -154 -167 -157 -129 -95 -63 -47 -55 -81 -104 -108 -99 -88 -84 -97 -134 -187 -229 -246 -248 -250 -245 -213 -162 -127 -133 -170 -205 -216 -213 -210 -205 -183 -142 -104 -93 -100 -101 -89 -81
6417 -81 -94 -119 -142 -166 -197 -219 -214 -183 -150 -130 -123 -121 -124 -126 -118 -103 -92 -89 -91 -93 -102 -117 -123 -109 -81 -50 -23 -8 -15 -48 -92 -125 -136 -131 -130 -145 -168 -182 -168 -133 -97 -77
6399 -77 -72 -71 -70 -66 -57 -42 -25 -15 -14 -26 -53 -91 -128 -149 -150 -142 -134 -127 -122 -121 -126 -133 -133 -126 -117 -117 -127 -137 -144 -156 -180 -210 -225 -214 -189 -165 -143 -122 -105 -105 -124 -152 -171 -169 -145 -116
6379 -116 -104 -124 -162 -193 -204 -201 -191 -174 -145 -101 -45 10 50 62 54 44 37 20 -8 -31 -30 -12 -6 -30 -71 -102 -106 -90 -73 -71 -84 -99 -110 -114 -114 -109 -97 -84 -77 -76 -73
6361 -73 -66 -65 -80 -115 -151 -163 -141 -99 -66 -54 -53 -51 -48 -48 -45 -31 -14 -7 -14 -25 -34 -46 -65 -83 -85 -69 -47 -34 -37 -61 -103 -154 -197 -219 -217 -199 -173 -141 -105 -67 -39 -35
6343 -35 -50 -67 -63 -40 -16 -7 -9 -10 -7 -10 -29 -60 -91 -114 -131 -150 -170 -181 -173 -144 -107 -79 -74 -90 -114 -132 -141 -144 -148 -152 -158 -170 -192 -218 -237 -241 -228 -211 -197 -183 -162 -134
6325 -134 -117 -126 -158 -195 -220 -235 -247 -260 -273 -279 -269 -239 -195 -161 -149 -154 -155 -143 -127 -118 -114 -114 -120 -130 -127 -98 -48 4 41 61 71 74 67 43 2 -42 -75 -90 -100 -113
6308 -113 -123 -112 -88 -75 -83 -93 -85 -65 -61 -81 -106 -119 -130 -158 -204 -247 -262 -245 -212 -183 -169 -169 -175 -176 -167 -156 -156 -168 -173 -155 -122 -107 -127 -162 -181 -177 -167 -161 -148 -124
6290 -124 -104 -102 -112 -118 -118 -131 -159 -184 -184 -158 -128 -114 -119 -137 -155 -162 -152 -135 -132 -149 -172 -187 -199 -227 -265 -281 -259 -225 -213 -224 -225 -199 -165 -150 -155 -162 -163 -164 -166 -164 -158 -158 -170
6272 -170 -189 -204 -212 -211 -205 -195 -182 -164 -139 -116 -103 -98 -91 -77 -64 -55 -53 -62 -95 -146 -190 -203 -189 -175 -180 -199 -220 -235 -244 -251 -256 -256 -246 -222 -198 -186 -187 -185 -174 -166 -164 -152 -117
6253 -117 -71 -40 -36 -46 -50 -43 -28 -15 -18 -44 -82 -109 -115 -109 -101 -92 -86 -100 -136 -178 -206 -221 -228 -221 -191 -153 -137 -149 -165 -162 -146 -136 -143 -168 -208 -249 -269 -259 -235 -224 -232 -251
6235 -251 -279 -316 -344 -335 -286 -231 -204 -204 -203 -191 -185 -198 -221 -226 -208 -185 -172 -165 -144 -111 -82 -65 -48 -25 -15 -37 -80 -113 -124 -133 -161 -197 -211 -195 -168 -160 -179 -207 -223
6218 -223 -226 -231 -249 -270 -279 -277 -269 -245 -189 -118 -69 -61 -68 -60 -43 -40 -52 -58 -53 -56 -73 -89 -86 -71 -59 -57 -61 -66 -67 -60 -49 -47 -56 -65 -62 -56 -54 -50 -30 -2 12 2 -20 -35 -39 -40 -44 -44 -34
6197 -34 -21 -16 -24 -34 -30 -18 -19 -43 -79 -111 -140 -172 -194 -185 -143 -94 -58 -34 -16 -5 -6 -10 -7 -2 -4 -14 -25 -37 -58 -88 -118 -142 -157 -160 -145 -117 -95 -90 -90 -82 -68 -64 -76
6178 -76 -93 -96 -82 -65 -61 -78 -111 -143 -158 -155 -147 -152 -176 -204 -220 -218 -202 -189 -187 -194 -199 -196 -181 -152 -112 -70 -42 -33 -36 -36 -30 -26 -29 -28 -16 -2 -9 -38 -62 -61 -41 -26 -25 -27 -25 -25 -34
6158 -34 -50 -67 -86 -102 -101 -78 -49 -45 -76 -123 -158 -162 -136 -97 -62 -41 -38 -55 -92 -137 -166 -167 -144 -117 -94 -78 -73 -82 -98 -106 -103 -94 -84 -71 -59 -61 -74 -85 -86 -86 -96 -117
6139 -117 -137 -147 -144 -131 -118 -118 -132 -142 -140 -133 -137 -149 -156 -153 -142 -125 -96 -59 -30 -28 -54 -92 -119 -123 -111 -102 -101 -100 -90 -80 -74 -62 -34 -7 -9 -36 -53 -41 -22 -26 -47 -64
6121 -64 -69 -70 -77 -90 -108 -134 -160 -175 -180 -180 -174 -160 -140 -124 -116 -116 -117 -110 -90 -63 -53 -77 -122 -156 -161 -147 -132 -126 -132 -145 -152 -144 -132 -132 -147 -153 -135 -106 -85 -80 -74 -59 -38 -21 -15
6102 -15 -19 -32 -43 -45 -33 -19 -22 -52 -95 -126 -133 -128 -125 -124 -112 -97 -105 -150 -213 -257 -268 -260 -247 -236 -220 -198 -170 -139 -112 -98 -99 -106 -112 -120 -132 -137 -125 -98 -69 -49 -31 -13
6083 -13 -3 -15 -41 -63 -75 -96 -139 -189 -212 -199 -176 -168 -173 -172 -161 -151 -150 -159 -171 -183 -193 -195 -187 -167 -138 -108 -83 -66 -46 -21 3 12 2 -22 -52 -81 -106 -125 -137
6067 -137 -144 -148 -150 -152 -147 -121 -71 -17 6 -16 -67 -110 -124 -108 -76 -49 -46 -70 -107 -130 -133 -129 -132 -133 -118 -92 -77 -88 -114 -135 -142 -138 -123 -102 -79 -63 -49 -26 7 36 46
6049 46 38 22 -2 -46 -101 -142 -151 -141 -138 -141 -135 -113 -95 -102 -131 -159 -170 -169 -169 -175 -183 -186 -176 -152 -121 -94 -74 -61 -59 -74 -105 -140 -170 -200 -240 -280 -298 -285 -252 -212 -171
6031 -171 -132 -103 -89 -81 -72 -60 -48 -29 -3 12 0 -32 -61 -73 -84 -112 -157 -196 -213 -203 -175 -143 -120 -106 -95 -83 -79 -92 -111 -115 -98 -81 -84 -108 -136 -156 -163 -161
6015 -161 -148 -119 -80 -47 -39 -60 -92 -111 -111 -109 -127 -166 -204 -219 -204 -172 -138 -109 -89 -84 -92 -103 -103 -90 -73 -62 -55 -46 -43 -58 -89 -119 -136 -143 -147 -144 -124 -94 -76 -78 -88
5997 -88 -85 -63 -34 -9 4 11 12 10 8 3 -7 -25 -45 -55 -46 -19 10 26 23 9 -7 -23 -28 -7 48 130 222 312 401 479 532 554 554 550 556 580 619 653 656 624 578 534
5979 534 491 443 401 377 362 334 285 233 195 177 171 166 150 117 76 33 -10 -59 -101 -117 -110 -100 -98 -95 -82 -64 -55 -55 -57 -57 -61 -62 -49 -20 8 16 -7 -47 -79 -83 -68
5961 -68 -60 -73 -96 -101 -85 -71 -85 -129 -174 -183 -147 -100 -87 -117 -150 -147 -120 -109 -135 -174 -192 -183 -163 -143 -124 -103 -90 -95 -111 -121 -111 -93 -90 -110 -137 -152 -155 -157 -154 -136
5943 -136 -111 -99 -109 -129 -151 -180 -210 -217 -186 -138 -107 -104 -120 -144 -168 -184 -183 -170 -154 -139 -122 -106 -100 -103 -105 -102 -100 -105 -117 -135 -153 -161 -152 -133 -122 -119 -107 -80 -49 -25 -4
5926 -4 15 22 9 -12 -22 -19 -22 -34 -42 -32 -12 0 1 -4 -13 -26 -43 -66 -94 -125 -145 -142 -120 -94 -76 -61 -41 -14 10 18 2 -37 -92 -147 -191 -215 -214 -189 -155 -127 -115
5908 -115 -114 -122 -137 -159 -175 -175 -163 -155 -157 -167 -178 -189 -197 -198 -190 -180 -166 -145 -123 -119 -138 -163 -173 -166 -161 -164 -166 -155 -132 -106 -82 -59 -40 -26 -25 -40 -69 -99 -121 -136 -150 -155
5890 -155 -141 -118 -112 -137 -178 -213 -236 -251 -255 -247 -228 -208 -191 -184 -191 -206 -209 -195 -185 -197 -218 -219 -192 -155 -121 -84 -45 -21 -23 -36 -42 -41 -46 -59 -67 -62 -52 -46 -50 -69 -103 -148
5871 -148 -195 -235 -257 -250 -216 -174 -140 -116 -99 -98 -117 -139 -140 -117 -92 -81 -80 -80 -75 -67 -59 -52 -54 -64 -68 -59 -43 -37 -48 -66 -75 -65 -42 -22 -19 -32 -51 -69 -88 -110 -128 -137 -143
5853 -143 -159 -188 -213 -222 -215 -201 -185 -169 -158 -155 -156 -152 -142 -134 -133 -142 -155 -172 -188 -193 -182 -166 -158 -161 -159 -150 -152 -179 -217 -243 -252 -260 -270 -264 -231 -189 -163 -156 -151 -129 -93 -57 -32 -22
5834 -22 -18 -15 -18 -33 -58 -81 -94 -104 -116 -124 -123 -121 -127 -134 -132 -127 -127 -126 -114 -102 -110 -136 -150 -131 -98 -83 -96 -119 -127 -110 -67 -17 13 12 -8 -19 -10 5 15 14 1 -26 -58 -74
5815 -74 -60 -35 -34 -68 -115 -144 -142 -120 -94 -69 -44 -20 -1 5 1 -3 3 23 43 42 17 -21 -62 -98 -127 -145 -149 -138 -120 -103 -95 -99 -109 -119 -122 -122 -130 -154 -191 -232 -267 -277
5797 -277 -250 -193 -131 -90 -75 -76 -87 -109 -143 -180 -199 -189 -157 -128 -129 -159 -186 -183 -159 -139 -135 -134 -127 -120 -119 -112 -87 -52 -29 -28 -41 -61 -90 -121 -137 -124 -95 -75 -77 -94
5779 -94 -111 -112 -92 -56 -26 -27 -61 -108 -149 -179 -202 -216 -216 -208 -202 -197 -183 -157 -130 -110 -101 -103 -116 -131 -136 -131 -132 -146 -160 -157 -144 -138 -143 -149 -152 -163 -183 -195 -184 -161 -148 -149 -149 -126
5760 -126 -85 -45 -24 -20 -19 -14 -16 -40 -81 -114 -119 -103 -89 -90 -94 -83 -55 -27 -15 -18 -25 -34 -48 -68 -84 -92 -101 -116 -127 -122 -104 -92 -94 -101 -108 -114 -115 -97 -58 -15 13 17 0 -34
5741 -34 -73 -93 -83 -60 -54 -72 -90 -81 -43 3 37 51 56 63 69 65 48 26 5 -18 -47 -76 -93 -91 -72 -43 -21 -19 -38 -58 -70 -86 -123 -173 -209 -220 -223 -227 -227 -217 -207
5723 -207 -206 -211 -211 -210 -217 -240 -272 -304 -325 -327 -310 -285 -264 -248 -235 -227 -222 -202 -157 -100 -59 -48 -53 -54 -44 -29 -10 10 23 16 -10 -46 -80 -110 -134 -141 -123 -94 -76 -85 -105
5705 -105 -113 -104 -91 -81 -70 -54 -45 -53 -68 -81 -100 -138 -184 -204 -187 -148 -102 -43 33 104 135 122 95 82 85 94 104 113 113 94 57 16 -9 -11 2 10 -4 -32 -43 -20
5688 -20 25 63 80 85 100 126 141 118 51 -32 -97 -126 -131 -136 -147 -155 -153 -147 -150 -160 -168 -165 -158 -157 -158 -149 -123 -90 -74 -80 -91 -90 -82 -91 -127 -172 -203 -213 -210 -202 -186 -165 -147 -136 -130
5669 -130 -130 -133 -134 -126 -111 -102 -101 -99 -84 -68 -70 -90 -116 -139 -169 -204 -218 -188 -125 -72 -57 -69 -79 -80 -83 -95 -108 -113 -107 -92 -72 -55 -52 -60 -69 -70 -67 -65 -54 -29 0 15 4 -26
5650 -26 -69 -121 -171 -193 -174 -132 -98 -93 -111 -135 -149 -145 -128 -105 -85 -69 -63 -68 -85 -102 -110 -108 -101 -91 -79 -67 -59 -54 -47 -37 -27 -21 -24 -41 -71 -113 -157 -198 -233 -256 -265 -256
5631 -256 -237 -215 -201 -198 -202 -199 -176 -142 -118 -115 -123 -124 -120 -121 -132 -141 -135 -115 -93 -87 -104 -135 -163 -177 -178 -179 -184 -187 -180 -165 -145 -119 -97 -86 -89 -90 -76 -59 -58 -82 -116 -144 -164 -180
5612 -180 -188 -186 -174 -158 -146 -146 -162 -187 -203 -204 -195 -184 -171 -163 -174 -206 -239 -242 -208 -155 -109 -87 -100 -138 -170 -168 -138 -115 -118 -133 -145 -157 -174 -183 -167 -132 -101 -80 -63 -49
5595 -49 -51 -72 -93 -94 -72 -43 -15 10 35 52 57 57 58 54 41 37 65 125 189 240 284 323 339 329 337 408 535 704 970 1404 1925 2264 2195 1766 1245
5580 1245 851 604 430 295 208 148 82 19 -2 13 21 -5 -48 -74 -72 -52 -23 -6 -19 -54 -87 -105 -121 -145 -163 -159 -145 -152 -185 -220 -232 -220 -200 -181
5565 -181 -165 -154 -154 -164 -175 -177 -170 -151 -123 -97 -85 -88 -93 -93 -97 -113 -128 -117 -82 -54 -60 -97 -143 -183 -204 -204 -190 -188 -209 -243 -267 -269 -252 -221 -184 -156 -143 -136 -125 -117 -114 -103
5547 -103 -71 -29 -5 -13 -41 -70 -89 -101 -110 -115 -112 -97 -78 -74 -89 -101 -90 -61 -31 0 41 84 98 73 33 0 -23 -34 -25 2 19 1 -44 -84 -96 -90 -91 -119 -171
5530 -171 -226 -263 -273 -265 -247 -221 -192 -165 -146 -129 -116 -114 -131 -158 -179 -182 -165 -133 -99 -78 -68 -57 -39 -29 -36 -49 -52 -52 -64 -88 -102 -94 -75 -59 -57 -70 -93 -115 -128
5513 -128 -136 -153 -182 -216 -249 -274 -283 -270 -250 -244 -259 -275 -275 -262 -245 -228 -211 -202 -205 -208 -198 -179 -165 -161 -149 -117 -75 -40 -19 -10 -10 -23 -49 -82 -116 -157 -210 -261 -286 -276
5496 -276 -248 -226 -215 -198 -173 -156 -162 -184 -204 -216 -228 -242 -249 -238 -209 -176 -150 -134 -117 -88 -50 -15 2 6 3 -1 -7 -5 7 24 35 43 53 60 48 15 -16 -31 -34 -36
5478 -36 -39 -33 -22 -16 -17 -17 -8 5 20 31 31 17 0 -7 -14 -38 -80 -111 -110 -90 -78 -77 -72 -59 -50 -51 -51 -46 -50 -70 -89 -94 -94 -107 -129 -139 -128 -107 -87 -71 -56 -46 -47 -55 -67 -78
5458 -78 -84 -83 -78 -72 -64 -50 -35 -31 -44 -64 -75 -76 -78 -87 -106 -138 -180 -218 -227 -193 -132 -74 -46 -57 -100 -150 -175 -163 -127 -97 -87 -94 -105 -119 -138 -152 -150 -128 -101 -82 -76 -80
5440 -80 -91 -108 -121 -122 -111 -97 -87 -81 -74 -62 -46 -39 -51 -77 -101 -115 -129 -153 -180 -191 -175 -145 -122 -123 -148 -179 -196 -193 -185 -189 -208 -232 -249 -254 -247 -233 -220 -213 -203 -180 -153
5422 -153 -137 -138 -145 -147 -142 -132 -118 -111 -122 -147 -157 -131 -77 -28 -12 -30 -67 -106 -136 -150 -146 -128 -110 -116 -145 -169 -153 -101 -56 -56 -94 -134 -154 -158 -159 -162 -164 -160 -149 -137 -132 -138
5404 -138 -149 -160 -176 -197 -212 -213 -200 -183 -169 -169 -190 -227 -254 -255 -249 -260 -286 -297 -278 -247 -229 -229 -237 -237 -218 -182 -148 -140 -160 -181 -181 -170 -172 -188 -198 -187 -158 -121 -87 -61
5387 -61 -44 -31 -19 -12 -12 -13 0 30 62 75 71 63 60 52 29 -2 -23 -23 -13 -7 -8 -7 0 9 20 35 52 59 46 10 -43 -104 -158 -190 -194 -181 -165 -156 -159 -176 -191 -180 -139 -98
5368 -98 -86 -101 -112 -106 -97 -104 -126 -149 -162 -159 -146 -141 -158 -195 -224 -221 -187 -142 -103 -84 -93 -126 -166 -199 -226 -248 -253 -226 -184 -163 -182 -224 -263 -293 -313 -313 -283 -233 -193 -176
5350 -176 -172 -169 -168 -170 -161 -132 -95 -79 -96 -131 -163 -187 -210 -231 -240 -235 -229 -243 -283 -332 -366 -377 -372 -364 -357 -353 -348 -332 -300 -258 -216 -183 -158 -144 -143 -148 -149 -140 -126 -114 -100 -81 -68
5332 -68 -77 -104 -128 -138 -137 -138 -148 -168 -196 -218 -215 -186 -151 -137 -144 -146 -126 -98 -91 -109 -130 -124 -91 -55 -35 -25 -9 6 5 -19 -55 -88 -120 -159 -199 -225 -230 -221 -205 -190 -181
5314 -181 -184 -189 -182 -161 -142 -141 -156 -167 -160 -144 -135 -141 -158 -178 -194 -203 -197 -178 -158 -155 -173 -201 -226 -246 -259 -254 -226 -194 -177 -173 -164 -148 -149 -185 -237 -267 -258 -226 -191 -162 -135 -111
5296 -111 -101 -104 -113 -112 -91 -51 -6 17 6 -22 -41 -34 -23 -31 -62 -94 -108 -105 -99 -103 -118 -131 -126 -101 -75 -67 -72 -76 -77 -93 -126 -154 -155 -138 -130 -139 -154 -160 -153 -137 -123 -123 -140 -160
5277 -160 -167 -160 -155 -166 -192 -225 -248 -243 -208 -164 -136 -130 -127 -109 -78 -49 -36 -42 -59 -69 -60 -37 -22 -25 -42 -60 -77 -93 -103 -104 -96 -78 -54 -38 -52 -97 -152 -186 -187 -167 -144
5259 -144 -133 -141 -165 -191 -203 -200 -187 -172 -164 -167 -180 -193 -199 -196 -186 -171 -151 -133 -122 -121 -125 -130 -129 -121 -114 -116 -120 -110 -81 -53 -48 -62 -75 -74 -64 -57 -56 -63 -80 -101 -116 -122 -128 -140 -156
5239 -156 -161 -147 -114 -68 -25 -1 -3 -28 -66 -104 -128 -134 -137 -160 -207 -251 -267 -248 -216 -192 -184 -186 -185 -167 -130 -83 -37 1 29 37 23 1 -11 -14 -27 -61 -105 -134 -136 -119
5222 -119 -95 -72 -51 -37 -36 -45 -53 -53 -47 -44 -44 -39 -25 -12 -14 -31 -46 -51 -55 -75 -108 -137 -154 -166 -182 -195 -196 -182 -157 -124 -93 -80 -93 -117 -132 -129 -122 -121 -131 -152 -180 -203
5204 -203 -204 -179 -144 -109 -72 -39 -24 -33 -49 -53 -51 -63 -90 -116 -128 -131 -139 -158 -180 -192 -182 -149 -112 -90 -89 -94 -93 -90 -94 -107 -118 -119 -113 -107 -107 -113 -123 -131 -136 -142 -151 -162 -166 -158 -138 -120
5184 -120 -113 -115 -114 -102 -87 -84 -104 -147 -200 -241 -251 -228 -187 -146 -113 -90 -79 -81 -90 -101 -113 -126 -130 -121 -109 -111 -129 -153 -177 -196 -197 -168 -115 -64 -35 -24 -18 -12 -16 -33 -59
5166 -59 -91 -130 -167 -193 -201 -192 -171 -147 -136 -140 -147 -142 -123 -102 -90 -92 -102 -113 -118 -122 -130 -141 -152 -165 -190 -225 -254 -265 -264 -256 -236 -201 -164 -138 -121 -102 -80 -62 -50 -36 -17
5148 -17 1 12 14 3 -20 -49 -75 -91 -93 -78 -50 -22 -15 -30 -54 -73 -77 -62 -37 -24 -40 -73 -87 -67 -34 -19 -27 -47 -70 -91 -100 -86 -53 -19 -1 -4 -18 -32 -44
5132 -44 -52 -57 -53 -42 -31 -30 -37 -48 -69 -110 -169 -220 -241 -235 -222 -222 -241 -273 -300 -303 -275 -236 -210 -202 -199 -187 -171 -160 -151 -132 -103 -77 -67 -76 -93 -109 -124 -135 -139 -131 -119 -119 -138
5113 -138 -162 -174 -171 -166 -177 -214 -272 -330 -363 -361 -336 -311 -296 -290 -288 -287 -282 -267 -244 -225 -222 -232 -245 -257 -267 -272 -261 -231 -192 -166 -168 -196 -229 -254 -265 -268 -263 -250 -230 -211 -195
5095 -195 -178 -159 -144 -142 -143 -124 -78 -32 -23 -54 -88 -86 -43 12 45 39 0 -55 -106 -140 -160 -171 -180 -188 -197 -208 -217 -219 -212 -203 -193 -183 -175 -171 -168 -167 -178 -210 -250 -273 -270 -257 -255 -256
5076 -256 -242 -212 -181 -166 -173 -192 -207 -201 -178 -157 -148 -144 -132 -114 -92 -63 -30 -11 -19 -38 -46 -44 -49 -63 -71 -71 -79 -98 -107 -92 -69 -64 -77 -90 -96 -100 -102 -92 -69 -42 -27 -29 -45
5057 -45 -75 -122 -191 -269 -332 -360 -354 -317 -252 -162 -70 -7 18 29 42 53 50 36 22 10 -7 -35 -72 -117 -159 -181 -174 -153 -138 -136 -141 -153 -170 -180 -169 -140 -117 -113
5041 -113 -122 -139 -165 -197 -232 -264 -293 -311 -304 -275 -245 -231 -225 -214 -196 -178 -157 -129 -103 -93 -99 -103 -91 -68 -50 -45 -44 -32 -9 1 -16 -55 -88 -96 -91 -95 -114 -134 -142 -130
5024 -130 -107 -81 -63 -55 -59 -78 -110 -139 -145 -127 -109 -114 -142 -175 -203 -225 -241 -247 -240 -224 -198 -164 -127 -100 -95 -109 -128 -139 -139 -132 -124 -114 -103 -96 -99 -106 -100 -76 -44 -18 4 28
5005 28 41 30 -3 -35 -51 -52 -46 -39 -40 -58 -90 -117 -120 -101 -75 -55 -44 -37 -28 -15 0 7 6 -2 -23 -66 -123 -172 -192 -188 -177 -165 -144 -115 -93 -89 -99 -109 -120 -143 -180
4988 -180 -218 -236 -225 -197 -168 -150 -140 -130 -118 -107 -104 -117 -141 -160 -158 -143 -136 -144 -145 -123 -89 -66 -61 -58 -55 -60 -70 -66 -44 -23 -23 -37 -43 -42 -49 -65 -77 -79 -82 -96 -115 -133 -150
4969 -150 -167 -171 -152 -120 -99 -101 -119 -136 -149 -156 -152 -132 -104 -80 -62 -42 -16 0 -9 -40 -67 -73 -70 -77 -101 -127 -139 -135 -120 -99 -75 -54 -42 -41 -43 -42 -35 -26 -26 -43 -78 -120
4951 -120 -159 -188 -208 -223 -237 -248 -252 -249 -246 -252 -268 -278 -269 -243 -215 -193 -176 -160 -143 -128 -111 -88 -60 -41 -57 -117 -202 -269 -285 -259 -232 -228 -235 -224 -194 -168 -160 -164 -163 -154
4933 -154 -137 -116 -99 -93 -93 -81 -57 -47 -68 -98 -100 -66 -25 -2 10 23 28 10 -28 -73 -107 -127 -131 -123 -107 -90 -72 -58 -57 -72 -95 -108 -102 -83 -66 -64 -84 -114 -132
4917 -132 -130 -129 -150 -190 -225 -240 -243 -242 -234 -217 -194 -165 -127 -89 -70 -78 -95 -101 -95 -90 -94 -105 -120 -132 -135 -128 -131 -166 -230 -295 -331 -330 -300 -253 -196 -133 -70 -18 10 12 -1 -17
4898 -17 -30 -40 -50 -63 -83 -106 -121 -120 -116 -128 -165 -209 -237 -241 -226 -200 -159 -101 -42 -2 10 8 11 21 28 30 34 49 65 67 53 36 24 13 -10 -52 -101 -135 -139 -120
4881 -120 -100 -93 -95 -95 -93 -96 -106 -114 -113 -97 -67 -27 7 24 17 -6 -33 -39 -16 21 38 22 -6 -17 -12 -13 -31 -53 -63 -66 -62 -44 -14 11 16 3 -13 -30 -49 -69 -87 -106
4863 -106 -132 -162 -185 -193 -180 -153 -123 -99 -81 -63 -43 -28 -18 -11 -13 -34 -74 -112 -134 -145 -161 -181 -195 -194 -172 -121 -47 14 20 -33 -107 -162 -190 -201 -202 -196 -194 -205 -214
4846 -214 -201 -167 -141 -142 -162 -183 -200 -214 -219 -210 -196 -193 -202 -212 -225 -250 -285 -294 -253 -186 -138 -123 -110 -75 -37 -21 -25 -25 -18 -24 -54 -95 -122 -129 -123 -116 -113 -108 -97 -87 -90 -112 -144
4827 -144 -170 -183 -180 -166 -151 -151 -162 -160 -137 -115 -118 -138 -150 -154 -168 -187 -183 -155 -137 -156 -192 -217 -231 -253 -279 -289 -276 -256 -248 -253 -258 -252 -228 -194 -168 -157 -150 -137 -131 -155 -207
4809 -207 -254 -273 -263 -244 -234 -242 -259 -265 -244 -200 -155 -127 -114 -108 -100 -84 -59 -40 -42 -64 -92 -111 -117 -113 -103 -93 -86 -81 -72 -56 -36 -10 20 42 41 26 20 26 19 -17 -71 -115
4791 -115 -146 -171 -185 -174 -142 -114 -105 -108 -116 -141 -187 -233 -252 -246 -234 -227 -216 -189 -145 -96 -52 -22 -12 -20 -37 -51 -57 -68 -94 -129 -155 -161 -160 -171 -190 -189 -154 -104 -69 -58
4774 -58 -57 -58 -65 -76 -75 -50 -12 15 29 47 81 128 176 220 266 325 406 511 627 733 814 859 858 806 712 599 490 399 322 254 192 139 107 100 105 94
4758 94 56 15 0 19 53 82 95 89 71 57 61 75 80 71 57 49 39 22 2 -13 -23 -24 -13 0 -3 -29 -55 -60 -54 -61 -84 -103 -111 -119 -131 -135 -131 -131 -140 -147 -136 -119 -109 -109
4739 -109 -110 -114 -126 -141 -148 -144 -147 -164 -180 -178 -159 -147 -162 -202 -242 -258 -243 -209 -178 -159 -149 -141 -131 -124 -124 -131 -136 -135 -131 -122 -107 -87 -75 -77 -89 -94 -90 -86 -91 -97 -96 -91 -98 -122 -154 -181
4719 -181 -204 -229 -252 -259 -244 -222 -213 -216 -216 -203 -187 -178 -175 -166 -150 -132 -116 -97 -77 -68 -78 -100 -115 -109 -82 -46 -19 -18 -43 -77 -98 -97 -87 -85 -97 -113 -124 -134 -149 -168 -177
4702 -177 -170 -153 -137 -127 -120 -119 -125 -134 -139 -145 -162 -188 -206 -207 -201 -201 -201 -186 -149 -104 -69 -55 -62 -78 -82 -65 -42 -35 -55 -87 -111 -119 -121 -132 -162 -207 -251 -276 -271 -245 -212 -188 -181 -190
4682 -190 -203 -207 -192 -162 -135 -128 -138 -147 -137 -116 -107 -120 -143 -162 -179 -203 -233 -256 -269 -271 -256 -219 -173 -141 -124 -102 -63 -23 4 21 29 16 -22 -59 -64 -42 -33 -51 -72
4666 -72 -66 -34 0 19 23 17 5 -7 -21 -36 -57 -84 -110 -130 -135 -122 -98 -73 -54 -42 -43 -66 -109 -150 -170 -174 -180 -195 -210 -214 -206 -192 -171 -145 -120 -105 -100 -97 -86 -68 -53
4648 -53 -50 -66 -97 -132 -156 -158 -141 -117 -100 -92 -89 -88 -92 -100 -109 -120 -135 -156 -173 -183 -189 -200 -218 -233 -242 -249 -260 -270 -268 -243 -197 -144 -100 -82 -90 -108 -118 -111 -91 -72 -61 -56 -49
4629 -49 -36 -23 -17 -22 -36 -53 -67 -65 -39 -3 15 0 -34 -61 -65 -59 -66 -88 -112 -116 -98 -75 -65 -69 -71 -62 -45 -34 -30 -28 -24 -19 -18 -24 -40 -65 -96 -123 -140 -146 -146 -146 -143 -132 -108
4610 -108 -75 -47 -32 -32 -43 -60 -77 -82 -72 -59 -60 -74 -84 -77 -57 -41 -40 -53 -73 -86 -83 -62 -35 -18 -23 -52 -95 -134 -153 -151 -138 -121 -94 -61 -38 -37 -49 -58 -63 -72 -80
4592 -80 -61 -11 37 50 31 11 8 9 -2 -26 -48 -68 -90 -107 -111 -105 -105 -119 -132 -127 -106 -92 -96 -110 -117 -117 -123 -143 -166 -171 -158 -147 -156 -178 -189 -179 -153 -117 -71 -23 -2
4574 -2 -29 -91 -155 -198 -222 -236 -239 -227 -204 -178 -153 -136 -140 -160 -166 -139 -93 -71 -91 -133 -163 -171 -171 -178 -193 -214 -237 -254 -258 -246 -224 -199 -175 -152 -140 -149 -179 -213 -229 -224
4557 -224 -212 -207 -208 -199 -172 -136 -110 -106 -122 -145 -165 -183 -201 -214 -213 -198 -182 -181 -199 -228 -254 -265 -257 -231 -197 -158 -114 -75 -59 -77 -112 -138 -136 -107 -70 -46 -48 -66 -81
4540 -81 -82 -84 -107 -152 -196 -219 -213 -184 -143 -108 -89 -77 -55 -20 9 17 -2 -46 -106 -156 -164 -128 -79 -52 -50 -55 -59 -67 -79 -87 -84 -72 -54 -36 -27 -28 -32 -32 -39 -64 -95 -101 -73 -40
4521 -40 -34 -56 -84 -102 -112 -123 -137 -148 -144 -117 -74 -36 -17 -20 -38 -65 -91 -108 -118 -136 -170 -207 -229 -239 -249 -260 -258 -234 -200 -178 -177 -186 -196 -205 -217 -225 -217 -185 -139 -103
4503 -103 -98 -118 -141 -144 -127 -107 -102 -114 -127 -132 -130 -130 -130 -120 -100 -91 -112 -158 -196 -197 -166 -136 -134 -159 -185 -188 -164 -126 -85 -49 -27 -28 -45 -59 -61 -57 -64 -83 -105 -124 -145 -171
4485 -171 -197 -213 -215 -207 -200 -201 -207 -211 -211 -212 -218 -219 -198 -157 -112 -77 -49 -24 -10 -13 -28 -43 -58 -78 -111 -152 -192 -220 -224 -206 -183 -178 -194 -217 -231 -235 -231 -212 -178 -142 -129 -140
4467 -140 -156 -163 -161 -163 -169 -171 -163 -149 -133 -111 -82 -49 -18 1 6 -12 -57 -119 -173 -194 -182 -162 -156 -166 -171 -161 -142 -129 -128 -142 -171 -206 -230 -232 -221 -210 -207 -207 -208 -206 -196 -177
4449 -177 -157 -148 -147 -142 -130 -122 -124 -129 -132 -138 -157 -180 -192 -183 -155 -123 -104 -110 -136 -161 -176 -188 -209 -235 -259 -270 -260 -222 -168 -134 -139 -159 -158 -137 -129 -153 -196 -231 -249 -247 -228 -199
4431 -199 -176 -168 -169 -171 -177 -179 -159 -120 -86 -80 -89 -81 -53 -30 -27 -36 -44 -52 -61 -68 -62 -48 -32 -20 -15 -9 7 38 66 68 38 -3 -34 -51 -66 -84 -106 -130 -158 -182 -196 -197 -187 -166
4412 -166 -134 -100 -72 -52 -35 -21 -16 -22 -32 -42 -54 -73 -98 -120 -136 -144 -139 -119 -92 -71 -67 -79 -97 -113 -120 -115 -104 -92 -80 -69 -69 -87 -113 -121 -98 -64 -55 -82 -117 -134
4394 -134 -129 -121 -124 -130 -133 -132 -136 -147 -152 -139 -113 -95 -105 -133 -155 -156 -149 -155 -174 -190 -195 -189 -181 -171 -163 -156 -149 -136 -109 -66 -15 30 56 64 66 70 70 59 45 40 43 40 25 8 0 -3 -16 -35
4373 -35 -49 -49 -39 -27 -18 -12 -7 -1 5 9 4 -5 -11 -7 2 8 -1 -29 -65 -94 -107 -109 -113 -123 -136 -144 -145 -135 -114 -91 -77 -83 -107 -139 -173 -208 -245 -280 -301 -301 -283 -255 -225 -198 -177
4354 -177 -163 -156 -159 -172 -191 -202 -193 -173 -157 -156 -164 -176 -193 -219 -239 -233 -201 -167 -148 -130 -91 -36 2 0 -32 -64 -86 -107 -134 -161 -177 -177 -166 -147 -127 -112 -106 -107 -107 -105 -106
4336 -106 -116 -138 -167 -193 -202 -201 -210 -239 -265 -259 -225 -197 -191 -186 -157 -113 -81 -67 -58 -50 -52 -65 -78 -85 -91 -100 -105 -105 -110 -129 -159 -189 -212 -222 -209 -179 -155 -155 -172 -181 -171 -159 -167 -196
4317 -196 -227 -240 -233 -217 -205 -199 -201 -216 -243 -264 -263 -243 -226 -226 -233 -228 -215 -211 -221 -227 -213 -187 -167 -164 -170 -173 -169 -171 -188 -213 -227 -222 -208 -198 -192 -186 -187 -205 -234 -244 -215 -161 -112 -89
4298 -89 -88 -96 -102 -98 -79 -51 -24 -3 13 24 16 -21 -77 -117 -127 -123 -122 -117 -94 -59 -46 -74 -126 -167 -178 -158 -121 -85 -71 -87 -125 -162 -180 -171 -143 -116 -105 -109 -110 -101 -93 -98
4280 -98 -108 -105 -87 -66 -51 -43 -43 -55 -68 -65 -49 -39 -47 -62 -76 -98 -129 -150 -144 -129 -131 -140 -127 -90 -54 -35 -21 -3 0 -29 -75 -107 -118 -118 -109 -90 -71 -73 -104 -144 -179
4262 -179 -205 -228 -245 -252 -257 -264 -266 -252 -224 -199 -178 -149 -103 -53 -16 2 16 33 45 45 30 4 -31 -70 -101 -110 -103 -95 -89 -74 -46 -23 -23 -46 -72 -90 -101 -111 -117 -117 -118
4244 -118 -126 -133 -131 -118 -101 -91 -94 -104 -112 -107 -96 -90 -90 -83 -55 -14 23 44 45 27 -2 -30 -41 -36 -34 -45 -66 -79 -79 -68 -51 -30 -9 0 -10 -41 -82 -118 -139 -139 -121 -93
4226 -93 -63 -39 -22 -12 -10 -19 -38 -68 -108 -160 -208 -231 -217 -174 -125 -80 -41 -13 -1 -3 -12 -25 -46 -66 -75 -73 -84 -119 -163 -192 -197 -187 -166 -131 -87 -53 -40 -41 -40 -30
4209 -30 -18 -10 -6 1 13 22 17 -4 -29 -43 -47 -54 -73 -99 -121 -139 -150 -150 -138 -119 -95 -62 -20 11 14 -15 -59 -95 -120 -135 -139 -129 -112 -104 -113 -128 -128 -110 -93 -99 -126 -145
4190 -145 -135 -108 -83 -64 -42 -23 -25 -51 -72 -65 -39 -28 -45 -80 -119 -157 -194 -216 -217 -211 -215 -230 -240 -233 -217 -209 -218 -235 -241 -226 -194 -160 -142 -139 -140 -135 -126 -124 -134 -152 -167 -167
4172 -167 -150 -129 -120 -129 -145 -154 -150 -138 -125 -114 -105 -99 -100 -111 -134 -167 -199 -226 -245 -251 -233 -189 -142 -118 -125 -142 -144 -133 -125 -132 -146 -155 -152 -147 -149 -159 -170 -177 -186 -198 -206 -208 -210 -218 -223 -212
4152 -212 -187 -159 -133 -101 -68 -57 -81 -120 -137 -117 -73 -29 3 15 -2 -43 -83 -107 -122 -139 -156 -157 -139 -110 -87 -74 -68 -69 -75 -83 -88 -88 -84 -81 -85 -95 -101 -96 -80 -63 -51
4135 -51 -38 -18 4 12 -2 -30 -51 -54 -40 -20 -1 11 16 16 21 30 32 17 -9 -37 -58 -72 -81 -81 -72 -67 -79 -105 -119 -102 -62 -29 -25 -43 -61 -71 -79 -92 -100 -96 -82 -70 -65
4116 -65 -65 -66 -64 -57 -41 -21 -10 -12 -23 -35 -46 -59 -76 -92 -101 -93 -67 -35 -16 -22 -47 -80 -107 -113 -92 -49 1 48 87 117 126 109 80 59 54 60 71 91 114 124 114
4098 114 95 93 116 161 211 252 278 297 326 375 440 509 571 627 680 739 814 914 1039 1192 1389 1650 1997 2456 3063 3829 4704 5562 6250
4086 6250 6635 6647 6282 5616 4791 3962 3237 2654 2205 1863 1600 1388 1216 1087 1008 971 961 961 960 952 941 941 960 987 1006 1012 1019 1044 1097 1183 1303
4072 1303 1457 1633 1818 2015 2241 2516 2861 3291 3826 4504 5392 6586 8191 10259 12734 15382 17802 19511 20113 19470 17750
4063 17750 15354 12752 10328 8302 6725 5538 4645 3971 3469 3102 2824 2597 2415 2290 2220 2175 2131 2089 2065 2062 2073 2098 2152 2247
4053 2247 2375 2523 2685 2867 3079 3342 3685 4129 4680 5330 6091 7019 8219 9832 12016 14934 18723 23389 28650 33832
4044 33832 37969 40130 39796 37077 32638 27415 22275 17787 14165 11372 9263 7691 6540 5706 5095 4631 4270 3992 3780
4036 3780 3602 3442 3306 3218 3180 3169 3161 3158 3178 3236 3338 3484 3670 3893 4158 4486 4902 5427 6074 6870 7860 9114 10750 12943 15915
4025 15915 19881 24932 30887 37147 42703 46384 47293 45204 40652 34686 28434 22736 18006 14306 11508 9426 7882
4017 7882 6731 5863 5197 4668 4240 3899 3641 3451 3302 3178 3085 3031 3019 3039 3082 3138 3199 3272 3374 3523 3726 3983 4294 4670 5139
4007 5139 5737 6506 7487 8748 10412 12651 15651 19530 24239 29446 34460 38335 40177 39509 36487 31827 26492 21344
3999 21344 16911 13362 10634 8580 7047 5897 5015 4328 3797 3398 3098 2860 2660 2495 2372 2287 2218 2140 2051 1975 1933 1920 1913 1902
3988 1902 1898 1921 1987 2104 2271 2480 2724 3023 3424 3981 4743 5760 7094 8815 10959 13458 16063 18340 19781 20016 18985
3979 18985 16949 14360 11676 9247 7257 5733 4601 3757 3121 2635 2253 1943 1687 1481 1318 1185 1080 1004 948 899 844 789
3970 789 742 708 685 677 680 681 672 664 678 715 764 822 905 1035 1217 1457 1764 2151 2641 3255 3998 4812 5571 6121 6341 6181 5669 4911 4062
3957 4062 3261 2575 2013 1567 1234 1001 831 693 572 468 380 310 266 242 219 178 119 55 0 -30 -17 27 68 67 30 -11 -34 -40 -34 -14 20
3944 20 51 59 46 25 9 -2 -8 -1 23 60 95 120 133 131 108 68 29 13 24 44 50 37 12 -18 -46 -68 -79 -79 -68 -51 -38 -36 -41 -41 -37 -42 -60 -76 -77 -69 -65 -58 -41
3925 -41 -24 -28 -53 -77 -90 -100 -111 -117 -121 -140 -174 -201 -202 -184 -161 -135 -104 -76 -57 -41 -23 -16 -31 -54 -59 -40 -20 -10 -7 -10 -26 -51 -63 -53 -33 -19 -10 2 14 14
3908 14 -2 -33 -66 -88 -92 -89 -93 -98 -85 -46 -6 0 -33 -82 -120 -139 -141 -133 -123 -115 -101 -75 -54 -60 -84 -99 -94 -93 -121 -163 -179 -148 -92 -50 -38 -43 -47 -47 -44 -41 -36 -34 -45 -76
3889 -76 -118 -155 -171 -159 -126 -92 -76 -79 -87 -96 -115 -151 -185 -194 -178 -160 -155 -156 -160 -171 -188 -200 -206 -224 -259 -285 -274 -236 -208 -205 -211 -208 -201 -194 -177 -140 -96 -72 -75 -91 -94 -75 -40
3870 -40 -6 12 21 32 51 69 73 58 34 7 -18 -46 -70 -85 -86 -75 -64 -60 -60 -61 -67 -83 -105 -119 -117 -101 -77 -49 -28 -31 -61 -96 -108 -85 -43 -2 24 33 23 1
3853 1 -19 -34 -49 -67 -81 -79 -66 -61 -75 -92 -89 -63 -37 -38 -69 -112 -147 -171 -191 -215 -243 -269 -285 -291 -293 -295 -292 -275 -243 -206 -176 -157 -151 -159 -177 -195 -201 -195 -185 -180 -179 -176 -167 -151
3834 -151 -131 -110 -91 -78 -85 -114 -149 -165 -159 -155 -171 -197 -207 -201 -198 -211 -225 -219 -196 -180 -183 -196 -201 -193 -175 -146 -112 -92 -111 -161 -198 -185 -136 -98 -94 -101 -92 -70 -57 -67 -96
3816 -96 -138 -186 -221 -229 -215 -199 -189 -178 -153 -115 -72 -34 -16 -28 -57 -76 -70 -57 -56 -66 -70 -62 -54 -46 -30 -2 23 32 25 19 25 36 41 39 31 18 0 -6 8 37 56 51 29
3797 29 2 -24 -48 -60 -66 -84 -119 -144 -137 -114 -106 -119 -126 -116 -107 -111 -114 -98 -73 -58 -52 -43 -27 -11 -5 -10 -23 -41 -61 -82 -103 -123 -141 -158 -175 -182 -171 -155 -161 -193 -213 -189
3779 -189 -133 -87 -75 -83 -88 -87 -89 -101 -122 -143 -154 -151 -136 -114 -88 -69 -73 -108 -157 -193 -207 -202 -184 -152 -118 -105 -115 -131 -127 -102 -76 -71 -95 -135 -171 -192 -201 -202 -187 -154
3762 -154 -116 -91 -78 -62 -38 -20 -20 -32 -47 -60 -75 -96 -126 -161 -195 -219 -231 -231 -217 -193 -179 -186 -202 -198 -171 -143 -126 -107 -82 -66 -71 -83 -83 -75 -75 -86 -99 -110 -125
3745 -125 -139 -145 -148 -159 -178 -189 -187 -186 -195 -203 -197 -180 -170 -176 -190 -194 -176 -137 -92 -57 -32 -13 -2 -7 -32 -71 -114 -153 -178 -184 -174 -157 -142 -127 -111 -92 -74 -58 -46 -40 -36
3727 -36 -27 -5 22 42 40 16 -19 -52 -72 -81 -85 -91 -103 -115 -121 -119 -116 -119 -125 -129 -134 -147 -164 -175 -170 -154 -138 -123 -110 -103 -100 -93 -75 -55 -42 -38 -37 -38 -37 -23 5 35 44 36 29 31 30 16
3706 16 0 -8 -9 -12 -20 -26 -27 -21 -8 0 -9 -47 -99 -148 -187 -213 -224 -220 -213 -217 -232 -237 -219 -185 -143 -94 -39 0 0 -39 -89 -127 -157 -186 -202 -191 -163 -139 -115 -73 -10 46
3688 46 71 64 41 12 -13 -23 -23 -34 -67 -96 -93 -67 -51 -55 -62 -60 -64 -87 -124 -160 -188 -205 -202 -179 -146 -119 -107 -109 -114 -105 -73 -38 -30 -53 -84 -107 -126 -149 -169 -177 -176 -173 -166
3669 -166 -153 -136 -122 -106 -85 -66 -56 -50 -44 -49 -70 -98 -121 -137 -149 -145 -122 -98 -93 -108 -128 -152 -184 -215 -224 -209 -184 -159 -133 -108 -93 -86 -78 -72 -83 -115 -152 -171 -170 -155
3652 -155 -141 -140 -153 -168 -170 -162 -159 -165 -168 -165 -165 -172 -176 -168 -149 -124 -92 -66 -64 -88 -118 -138 -148 -150 -135 -103 -80 -85 -104 -114 -111 -108 -108 -103 -97 -104 -124 -141 -148 -152 -158 -153 -137 -128 -141 -172 -198
3632 -198 -207 -203 -197 -198 -202 -203 -200 -203 -228 -275 -328 -366 -383 -380 -364 -341 -318 -298 -280 -263 -244 -218 -185 -162 -159 -170 -178 -175 -163 -135 -90 -53 -54 -88 -109 -89 -65 -89 -146 -172 -135
3614 -135 -76 -49 -60 -75 -76 -75 -80 -81 -70 -58 -57 -63 -61 -51 -50 -71 -105 -130 -133 -121 -118 -132 -146 -137 -108 -86 -91 -110 -114 -98 -75 -60 -45 -21 1 7 -3 -14 -15 -10 -13 -29 -52
3595 -52 -69 -71 -63 -57 -65 -88 -118 -139 -140 -124 -103 -92 -95 -106 -118 -128 -138 -144 -145 -139 -123 -94 -56 -22 -6 -5 -13 -32 -62 -91 -96 -82 -72 -84 -106 -117 -123 -143 -178 -205 -204 -184
3577 -184 -165 -153 -138 -111 -80 -56 -42 -33 -30 -42 -71 -106 -131 -146 -160 -174 -179 -172 -166 -174 -194 -216 -236 -255 -264 -261 -259 -271 -284 -276 -240 -196 -161 -135 -117 -121 -151 -191 -214 -213 -208
3559 -208 -213 -224 -234 -233 -219 -190 -156 -136 -142 -160 -169 -159 -141 -129 -129 -140 -160 -184 -201 -200 -179 -155 -150 -169 -195 -209 -209 -200 -176 -131 -83 -59 -66 -84 -94 -95 -94 -91 -78 -56 -32
3541 -32 -9 8 10 -14 -55 -90 -109 -120 -130 -130 -121 -118 -131 -147 -155 -158 -170 -185 -177 -143 -110 -105 -125 -147 -159 -165 -164 -152 -135 -131 -151 -180 -200 -206 -200 -182 -154 -120 -91 -75 -70 -75 -90
3523 -90 -106 -106 -87 -57 -32 -20 -16 -15 -20 -36 -62 -87 -96 -86 -69 -60 -57 -47 -31 -15 -7 -2 1 -2 -20 -40 -47 -42 -44 -64 -95 -120 -128 -129 -135 -152 -171 -182 -184 -180 -168 -140 -99 -68 -65
3503 -65 -88 -117 -133 -136 -132 -124 -115 -109 -102 -92 -81 -78 -90 -112 -127 -116 -76 -18 34 64 69 58 44 32 25 25 33 43 44 35 21 2 -27 -73 -127 -169 -183 -173 -155 -141 -131 -129
3485 -129 -140 -160 -173 -165 -147 -137 -136 -137 -140 -157 -187 -205 -194 -160 -120 -84 -51 -25 -15 -24 -42 -56 -63 -68 -80 -98 -110 -104 -85 -72 -77 -96 -123 -154 -183 -196 -189 -174 -160 -142
3468 -142 -111 -81 -72 -81 -81 -57 -22 2 13 22 32 32 15 -16 -54 -94 -128 -144 -139 -123 -117 -132 -155 -166 -159 -152 -157 -163 -158 -156 -179 -222 -253 -251 -231 -222 -237 -260 -275 -277 -267 -247 -219
3449 -219 -185 -150 -124 -113 -119 -135 -151 -163 -171 -180 -190 -197 -190 -162 -120 -89 -86 -112 -150 -184 -208 -220 -226 -232 -236 -233 -222 -211 -203 -195 -184 -174 -171 -169 -157 -132 -113 -119 -154 -199 -231 -236 -220
3431 -220 -191 -151 -105 -66 -46 -47 -50 -48 -47 -55 -69 -77 -82 -94 -115 -129 -124 -99 -63 -31 -17 -28 -55 -82 -101 -117 -133 -147 -157 -169 -187 -212 -240 -263 -279 -282 -269 -241 -203
3414 -203 -171 -153 -148 -150 -158 -179 -205 -213 -189 -150 -126 -121 -114 -98 -89 -99 -117 -130 -139 -149 -151 -139 -127 -135 -157 -168 -158 -140 -126 -117 -112 -116 -127 -135 -133 -126 -119 -108 -87 -62 -46 -48 -67 -93
3395 -93 -112 -122 -130 -144 -156 -148 -119 -93 -91 -111 -139 -170 -200 -217 -212 -198 -195 -200 -192 -165 -135 -114 -91 -63 -47 -59 -87 -99 -94 -92 -104 -119 -129 -143 -168 -193 -203 -199 -191 -182 -172
3377 -172 -167 -166 -160 -143 -128 -133 -156 -178 -185 -183 -181 -177 -161 -132 -97 -62 -31 -7 5 7 0 -10 -26 -50 -86 -128 -167 -197 -214 -215 -202 -189 -192 -207 -209 -183 -150 -139 -152 -164 -155 -129
3359 -129 -99 -71 -50 -49 -68 -86 -84 -73 -79 -112 -148 -158 -142 -125 -129 -150 -170 -179 -184 -195 -208 -209 -192 -168 -149 -139 -134 -137 -154 -179 -197 -203 -203 -206 -216 -228 -235 -234 -217 -187 -150 -118
3340 -118 -100 -95 -104 -127 -161 -198 -223 -229 -222 -211 -201 -196 -202 -222 -240 -236 -203 -165 -151 -164 -178 -173 -156 -144 -142 -131 -100 -66 -52 -69 -105 -140 -164 -174 -167 -150 -135 -136 -147 -152 -142
3323 -142 -126 -120 -126 -133 -129 -120 -122 -143 -170 -182 -173 -164 -180 -220 -260 -277 -258 -209 -147 -95 -67 -60 -63 -71 -85 -100 -104 -103 -113 -138 -158 -157 -142 -128 -122 -124 -143 -182 -220 -230 -208 -176 -148
3304 -148 -126 -110 -109 -125 -146 -163 -172 -169 -144 -100 -61 -49 -62 -81 -93 -99 -105 -112 -119 -126 -137 -153 -167 -170 -164 -160 -169 -183 -192 -198 -215 -242 -265 -274 -275 -278 -276 -266 -258 -264 -273 -267 -240 -204 -171 -151
3284 -151 -142 -132 -103 -52 0 22 15 -3 -23 -50 -88 -124 -148 -163 -180 -197 -208 -211 -209 -201 -189 -179 -181 -187 -185 -165 -136 -113 -103 -105 -112 -116 -111 -97 -83 -79 -86 -93 -85 -63 -42 -42 -59
3265 -59 -79 -95 -114 -142 -170 -182 -178 -174 -184 -203 -212 -201 -171 -132 -96 -68 -50 -36 -29 -33 -49 -67 -75 -74 -74 -85 -109 -136 -157 -163 -155 -144 -145 -162 -185 -206 -221 -230 -226 -208 -182 -159
3247 -159 -139 -117 -93 -71 -46 -7 33 48 19 -36 -93 -139 -175 -196 -194 -174 -152 -136 -123 -109 -97 -89 -80 -76 -85 -110 -135 -145 -139 -124 -109 -96 -99 -124 -163 -187 -180 -152 -134
3230 -134 -136 -148 -154 -155 -155 -156 -149 -136 -125 -122 -122 -118 -106 -88 -71 -65 -83 -121 -158 -173 -163 -138 -110 -87 -76 -79 -87 -90 -83 -73 -69 -74 -88 -104 -111 -106 -100 -103 -112 -114 -109 -107 -109 -103 -88 -78 -84 -90 -77
3209 -77 -46 -20 -18 -37 -57 -61 -49 -36 -47 -92 -150 -187 -191 -183 -179 -177 -162 -141 -136 -155 -182 -198 -202 -201 -197 -184 -168 -160 -165 -171 -165 -147 -123 -103 -96 -108 -130 -142 -132 -113 -102 -103 -103 -99
3190 -99 -104 -134 -177 -206 -207 -191 -176 -168 -166 -168 -181 -204 -225 -233 -224 -204 -176 -139 -104 -89 -100 -118 -118 -98 -78 -66 -53 -36 -28 -45 -83 -120 -142 -155 -164 -163 -142 -109 -79 -67 -76
3172 -76 -97 -118 -129 -122 -106 -96 -103 -122 -139 -149 -155 -161 -164 -158 -144 -121 -94 -70 -56 -56 -71 -106 -168 -238 -280 -265 -212 -158 -122 -93 -63 -40 -34 -42 -55 -67 -74 -72 -64 -58 -61 -66 -64
3154 -64 -51 -29 -4 10 1 -32 -73 -111 -146 -178 -193 -187 -175 -169 -163 -141 -107 -71 -37 0 34 45 32 10 -12 -39 -69 -87 -78 -50 -26 -23 -47 -82 -106 -108 -97 -88 -83 -77
3136 -77 -79 -108 -159 -206 -227 -228 -225 -217 -198 -170 -149 -145 -155 -170 -178 -172 -156 -145 -145 -156 -169 -178 -174 -153 -124 -105 -99 -95 -88 -91 -112 -133 -139 -134 -142 -167 -191 -198 -193 -188 -187 -187 -188 -197 -217 -241 -248 -226
3115 -226 -186 -152 -143 -151 -167 -182 -195 -203 -208 -218 -237 -248 -235 -199 -160 -131 -107 -85 -67 -59 -63 -76 -91 -100 -103 -108 -119 -129 -131 -130 -131 -125 -102 -67 -38 -26 -29 -40 -59 -84 -109 -134
3097 -134 -158 -171 -163 -139 -112 -85 -56 -35 -48 -97 -154 -190 -200 -196 -192 -194 -203 -214 -214 -202 -189 -183 -182 -183 -191 -205 -212 -207 -203 -207 -199 -157 -100 -67 -71 -87 -94 -100 -118 -135 -127 -97 -66 -46
3078 -46 -30 -18 -20 -41 -63 -57 -24 7 11 -16 -57 -96 -122 -133 -131 -126 -128 -135 -135 -131 -130 -136 -137 -125 -97 -58 -14 22 36 27 8 -16 -59 -124 -190 -229 -239 -236 -226 -207 -182 -162
3060 -162 -146 -123 -98 -92 -107 -128 -143 -156 -168 -159 -118 -71 -54 -65 -71 -59 -53 -80 -134 -188 -226 -249 -254 -240 -213 -193 -184 -176 -158 -146 -156 -182 -193 -175 -146 -135 -143 -150 -146 -140
3043 -140 -145 -158 -175 -188 -194 -189 -183 -185 -188 -175 -148 -135 -152 -182 -197 -194 -191 -191 -184 -166 -149 -139 -130 -122 -131 -159 -186 -188 -165 -137 -118 -105 -98 -104 -123 -144 -156 -157 -150 -134 -110 -87 -74 -70
3023 -70 -66 -59 -57 -66 -86 -117 -161 -203 -223 -209 -174 -138 -110 -92 -84 -93 -109 -114 -100 -73 -40 -5 27 41 30 0 -31 -52 -61 -60 -53 -49 -50 -57 -72 -99 -128 -143 -144 -148 -164 -186 -204
3005 -204 -230 -270 -315 -351 -378 -397 -391 -348 -295 -274 -288 -303 -294 -274 -264 -258 -245 -230 -224 -223 -211 -190 -178 -184 -193 -182 -142 -84 -32 -4 1 -2 -8 -19 -31 -37 -40 -57 -95 -138 -157
2987 -157 -148 -125 -101 -88 -88 -101 -121 -144 -176 -214 -238 -236 -225 -233 -256 -267 -251 -226 -212 -209 -204 -192 -176 -157 -134 -107 -79 -65 -77 -113 -152 -170 -172 -174 -176 -161 -128 -101 -102 -120
2970 -120 -127 -114 -91 -68 -46 -22 0 9 -3 -41 -88 -115 -113 -97 -82 -62 -22 27 60 56 21 -29 -79 -113 -117 -94 -65 -50 -47 -46 -45 -50 -64 -83 -102 -117 -129 -136 -138 -138 -140
2952 -140 -149 -166 -188 -209 -228 -241 -244 -230 -202 -175 -156 -143 -126 -105 -85 -74 -74 -80 -89 -93 -85 -69 -51 -38 -30 -33 -55 -100 -155 -197 -208 -192 -163 -132 -102 -77 -64 -66 -76 -88
2935 -88 -94 -93 -91 -95 -113 -139 -159 -159 -140 -113 -90 -80 -83 -95 -103 -103 -95 -81 -60 -35 -15 -5 -6 -17 -35 -50 -49 -32 -18 -18 -22 -16 -11 -26 -57 -77 -75 -62 -53 -43 -26 -11 -11 -25
2916 -25 -46 -71 -107 -148 -185 -209 -212 -192 -157 -127 -116 -119 -119 -111 -102 -98 -94 -92 -106 -143 -191 -228 -245 -255 -269 -282 -280 -256 -221 -186 -157 -136 -132 -145 -160 -156 -132 -114 -119 -141 -160
2898 -160 -165 -155 -130 -98 -79 -83 -102 -119 -135 -159 -190 -215 -225 -223 -218 -209 -200 -197 -200 -199 -188 -175 -171 -170 -166 -168 -197 -248 -291 -297 -266 -218 -171 -132 -105 -96 -103 -114 -116 -110 -106 -111 -122 -134 -151
2878 -151 -180 -218 -247 -253 -232 -196 -162 -150 -167 -194 -210 -206 -200 -208 -229 -253 -282 -315 -344 -358 -355 -339 -309 -260 -202 -158 -138 -128 -112 -95 -95 -114 -138 -157 -178 -203 -224 -229
2862 -229 -221 -211 -204 -189 -160 -128 -110 -110 -118 -120 -109 -88 -65 -54 -67 -102 -143 -180 -211 -235 -243 -229 -208 -203 -221 -241 -236 -205 -167 -139 -118 -99 -79 -59 -33 1 33 44 28
2845 28 -2 -32 -60 -91 -115 -112 -78 -35 -11 -10 -16 -13 -8 -18 -45 -74 -91 -92 -86 -77 -67 -61 -66 -80 -93 -104 -116 -134 -150 -151 -131 -92 -46 -8 11 17 24 42 63 70 48 0
2827 0 -56 -99 -118 -125 -136 -145 -134 -102 -77 -81 -101 -107 -95 -92 -118 -164 -211 -249 -275 -274 -241 -194 -155 -128 -100 -66 -42 -47 -82 -124 -146 -140 -118 -101 -102 -114 -130 -150 -173 -190
2809 -190 -186 -160 -120 -75 -39 -25 -37 -66 -92 -114 -137 -157 -166 -165 -173 -202 -243 -279 -300 -311 -316 -317 -314 -308 -298 -289 -286 -293 -301 -299 -282 -259 -236 -217 -208 -215 -237 -261 -268 -253 -225 -197 -172
2791 -172 -150 -134 -127 -122 -113 -102 -97 -103 -114 -128 -151 -175 -189 -186 -184 -201 -226 -238 -226 -200 -175 -165 -182 -230 -285 -311 -293 -250 -208 -176 -150 -131 -121 -117 -115 -118 -123 -117 -93 -66 -53
2773 -53 -54 -66 -95 -148 -209 -246 -255 -263 -287 -305 -283 -218 -138 -74 -40 -33 -45 -65 -86 -101 -107 -103 -93 -82 -75 -72 -78 -88 -90 -66 -23 11 14 -10 -44 -77 -109 -143 -169 -185 -191
2755 -191 -187 -168 -137 -103 -81 -74 -78 -87 -94 -97 -95 -86 -66 -41 -27 -33 -53 -65 -60 -50 -50 -57 -61 -56 -47 -38 -29 -23 -33 -69 -129 -197 -250 -274 -269 -248 -225 -208 -200 -200 -202 -200 -190 -181 -175 -170 -162 -154 -150
2734 -150 -145 -123 -83 -40 -15 -18 -45 -84 -118 -132 -124 -114 -118 -141 -167 -186 -199 -209 -215 -208 -188 -162 -144 -144 -156 -165 -163 -155 -149 -146 -143 -138 -135 -132 -126 -120 -125 -141 -159 -161 -147 -134 -139 -164 -185
2714 -185 -180 -150 -119 -108 -121 -143 -161 -174 -190 -207 -220 -217 -197 -173 -162 -168 -180 -184 -178 -169 -160 -152 -151 -166 -193 -219 -231 -230 -220 -202 -176 -146 -116 -84 -49 -16 5 9 -11 -55
2697 -55 -108 -147 -162 -162 -158 -157 -161 -167 -170 -168 -165 -171 -184 -183 -158 -118 -87 -73 -69 -71 -78 -90 -100 -104 -102 -93 -76 -58 -55 -73 -103 -132 -157 -185 -214 -233 -231 -206 -165 -122 -89 -74 -74 -80 -77 -62
2677 -62 -50 -57 -78 -93 -91 -73 -48 -16 13 26 22 22 43 64 53 9 -29 -33 -11 2 -3 -19 -31 -48 -85 -140 -192 -215 -205 -184 -174 -175 -170 -157 -151 -157 -167 -171 -178 -200 -234
2659 -234 -267 -288 -289 -264 -221 -180 -159 -148 -126 -91 -68 -79 -112 -144 -166 -196 -242 -286 -300 -281 -254 -244 -248 -245 -228 -213 -215 -228 -239 -241 -242 -249 -265 -284 -299 -304 -297 -279 -251
2642 -251 -215 -169 -118 -70 -39 -37 -60 -93 -119 -142 -168 -194 -205 -200 -189 -179 -165 -143 -122 -110 -105 -100 -98 -100 -98 -86 -75 -83 -108 -127 -123 -103 -85 -76 -79 -97 -131 -164 -175 -161
2625 -161 -137 -128 -141 -172 -206 -226 -218 -192 -174 -186 -220 -239 -218 -175 -149 -150 -158 -156 -154 -167 -186 -193 -191 -198 -213 -213 -189 -160 -147 -145 -142 -135 -128 -116 -97 -85 -100 -143 -189 -214 -207 -176
2607 -176 -137 -110 -102 -107 -112 -112 -120 -141 -164 -170 -144 -98 -58 -44 -49 -50 -34 -16 -14 -32 -56 -73 -79 -69 -41 -8 9 1 -20 -35 -38 -37 -41 -55 -81 -107 -120 -117 -115 -132 -163 -188 -196
2588 -196 -197 -201 -209 -215 -214 -206 -191 -174 -162 -160 -166 -174 -183 -193 -196 -177 -135 -92 -68 -61 -50 -32 -29 -58 -108 -144 -149 -135 -127 -135 -144 -136 -104 -59 -25 -21 -47 -82 -108 -120 -120 -104 -66 -17 21
2569 21 34 23 -1 -27 -44 -49 -52 -67 -95 -124 -145 -158 -163 -150 -119 -94 -98 -130 -162 -174 -164 -143 -123 -110 -102 -91 -77 -73 -87 -107 -112 -108 -115 -137 -155 -162 -177 -214 -245 -240 -206
2551 -206 -183 -195 -222 -239 -238 -218 -175 -122 -89 -99 -138 -167 -159 -120 -77 -51 -49 -66 -94 -124 -144 -150 -144 -139 -139 -138 -124 -99 -74 -62 -64 -75 -86 -95 -104 -116 -128 -135 -138 -146 -161 -173
2533 -173 -172 -168 -177 -198 -208 -192 -157 -119 -89 -78 -92 -122 -139 -129 -113 -114 -126 -121 -94 -75 -98 -161 -225 -251 -230 -189 -163 -161 -162 -145 -114 -93 -92 -106 -125 -143 -148 -135 -110
2516 -110 -88 -75 -71 -74 -81 -80 -65 -52 -63 -93 -112 -104 -85 -75 -67 -51 -40 -54 -93 -143 -191 -231 -257 -263 -261 -265 -276 -281 -273 -258 -246 -242 -248 -263 -279 -289 -294 -296 -286 -258 -222 -197
2498 -197 -189 -187 -187 -199 -228 -252 -255 -244 -237 -233 -217 -190 -170 -166 -165 -155 -141 -138 -148 -157 -157 -151 -150 -157 -170 -181 -183 -176 -167 -163 -156 -133 -91 -52 -48 -86 -148 -200 -224 -224 -219 -211 -191 -147 -95 -53
2478 -53 -28 -4 27 51 43 7 -28 -44 -42 -36 -36 -44 -56 -61 -47 -21 -15 -51 -112 -154 -155 -136 -125 -133 -151 -174 -204 -233 -245 -234 -212 -192 -176 -165 -163 -168 -168 -147 -112 -88 -88 -107
2460 -107 -129 -149 -168 -183 -189 -184 -169 -148 -129 -131 -163 -211 -242 -234 -193 -137 -86 -55 -52 -74 -111 -149 -179 -195 -193 -176 -154 -133 -119 -114 -123 -142 -157 -160 -165 -183 -212 -234 -236 -224
2442 -224 -211 -208 -218 -233 -237 -216 -181 -155 -151 -158 -163 -161 -161 -166 -170 -162 -141 -109 -77 -57 -53 -58 -70 -95 -134 -173 -191 -186 -180 -190 -206 -208 -191 -166 -143 -124 -109 -95 -83 -72 -67 -77 -101
2424 -101 -134 -164 -186 -198 -198 -189 -177 -164 -151 -138 -126 -115 -101 -90 -90 -100 -108 -103 -93 -89 -91 -89 -79 -69 -67 -70 -76 -88 -105 -122 -136 -149 -164 -176 -178 -169 -156 -146 -141 -136 -131 -128 -129 -130
2404 -130 -129 -125 -128 -142 -155 -153 -139 -127 -121 -107 -81 -60 -64 -88 -106 -105 -102 -112 -132 -141 -134 -123 -126 -148 -175 -198 -217 -241 -269 -281 -268 -245 -233 -237 -245 -246 -242 -237 -227 -205 -168 -120 -75
2386 -75 -53 -65 -100 -134 -155 -166 -172 -170 -157 -140 -125 -106 -78 -48 -29 -26 -34 -43 -52 -61 -64 -56 -39 -26 -27 -49 -85 -127 -169 -206 -226 -219 -189 -160 -154 -167 -183 -195 -209 -225 -232 -219
2368 -219 -197 -185 -197 -222 -236 -228 -204 -183 -175 -175 -169 -160 -156 -167 -189 -214 -236 -252 -254 -238 -209 -182 -161 -135 -94 -52 -35 -52 -83 -98 -85 -54 -26 -25 -59 -115 -165 -187 -187
2351 -187 -180 -169 -142 -105 -89 -105 -130 -129 -105 -89 -99 -122 -140 -160 -189 -217 -225 -216 -212 -220 -218 -191 -150 -121 -112 -109 -104 -103 -113 -122 -119 -111 -110 -114 -108 -93 -85 -89 -93 -85 -84 -109 -151 -176 -170 -155
2331 -155 -158 -176 -188 -186 -179 -171 -151 -110 -57 -11 16 24 16 -2 -25 -46 -67 -93 -120 -135 -135 -124 -107 -80 -50 -33 -43 -68 -92 -107 -112 -106 -88 -72 -80 -112 -145 -159 -158 -161 -172
2313 -172 -187 -203 -219 -226 -217 -196 -172 -149 -124 -104 -97 -108 -122 -120 -96 -69 -65 -97 -150 -192 -210 -213 -213 -208 -194 -182 -180 -175 -150 -108 -72 -49 -25 4 23 8 -31 -70 -98 -120
2296 -120 -138 -141 -127 -109 -97 -91 -85 -83 -90 -103 -111 -112 -119 -136 -154 -166 -174 -185 -193 -188 -168 -146 -130 -125 -134 -164 -208 -248 -261 -247 -225 -209 -200 -196 -199 -219 -257 -304 -336 -340 -319 -289 -263
2277 -263 -240 -215 -194 -182 -170 -146 -116 -94 -87 -89 -93 -100 -106 -106 -106 -123 -158 -192 -208 -213 -219 -224 -221 -211 -202 -185 -148 -99 -69 -72 -92 -106 -115 -128 -149 -168 -184 -199 -214 -218 -203 -171
2259 -171 -138 -114 -97 -78 -58 -49 -64 -98 -133 -155 -172 -193 -214 -223 -218 -216 -232 -265 -299 -319 -311 -268 -197 -126 -88 -92 -111 -116 -103 -89 -92 -110 -129 -137 -130 -111 -92 -87 -103 -140
2241 -140 -190 -237 -265 -269 -261 -258 -254 -231 -189 -149 -123 -106 -99 -118 -168 -221 -237 -215 -187 -181 -190 -191 -172 -141 -116 -111 -130 -161 -186 -193 -179 -146 -105 -72 -55 -51 -54 -71 -107 -148 -177
2224 -177 -188 -189 -179 -158 -137 -132 -138 -140 -141 -154 -181 -198 -194 -177 -154 -116 -58 -5 15 10 2 -5 -26 -58 -87 -106 -123 -140 -152 -157 -154 -140 -113 -88 -81 -89 -100 -113 -149 -208 -264
2206 -264 -290 -291 -280 -258 -221 -184 -171 -187 -212 -225 -220 -201 -176 -153 -139 -132 -125 -120 -126 -144 -166 -176 -174 -172 -179 -192 -198 -185 -156 -128 -113 -112 -112 -103 -85 -68 -55 -46 -44 -49 -58 -58 -40 -14
2187 -14 -6 -31 -84 -142 -185 -207 -211 -199 -172 -134 -98 -79 -86 -114 -147 -171 -183 -189 -190 -180 -161 -141 -127 -116 -108 -104 -102 -96 -85 -72 -66 -69 -79 -93 -104 -109 -110 -115 -122 -120 -101 -68 -41
2168 -41 -31 -37 -46 -45 -37 -34 -44 -59 -62 -51 -38 -34 -31 -19 -4 -1 -12 -25 -32 -36 -37 -28 -9 6 10 5 -6 -22 -40 -45 -33 -14 -1 4 6 2 -12 -29 -38 -36 -28 -14 5 17 -6 -73
2148 -73 -153 -207 -224 -226 -241 -275 -312 -337 -346 -340 -318 -281 -238 -197 -156 -114 -82 -75 -92 -112 -118 -116 -123 -143 -164 -174 -173 -167 -159 -156 -159 -162 -161 -164 -186 -226 -266 -285 -278 -250 -200 -138 -82
2130 -82 -56 -62 -79 -90 -94 -103 -117 -130 -132 -134 -148 -174 -192 -187 -168 -150 -139 -124 -104 -93 -97 -110 -122 -135 -155 -178 -199 -221 -248 -274 -288 -289 -284 -273 -257 -245 -241 -236 -216 -182 -145
2112 -145 -115 -94 -88 -99 -114 -111 -87 -60 -41 -28 -19 -27 -62 -112 -156 -181 -184 -170 -148 -134 -136 -150 -166 -180 -189 -186 -165 -134 -112 -109 -121 -133 -132 -116 -105 -125 -177 -230 -255 -256
2095 -256 -258 -271 -280 -276 -261 -245 -231 -216 -199 -174 -145 -122 -113 -113 -110 -103 -100 -98 -90 -77 -74 -84 -98 -110 -129 -162 -196 -216 -218 -213 -203 -184 -151 -109 -70 -46 -48 -66 -81 -85 -84 -89 -92 -80
2075 -80 -55 -37 -44 -72 -103 -123 -127 -120 -112 -106 -100 -93 -88 -90 -99 -117 -144 -172 -189 -197 -204 -208 -193 -147 -90 -53 -48 -60 -76 -97 -124 -139 -126 -85 -34 4 17 5 -17 -35 -43 -52 -76
2057 -76 -105 -116 -95 -47 0 22 15 -5 -20 -23 -25 -37 -57 -77 -91 -93 -79 -50 -23 -20 -52 -111 -181 -246 -288 -295 -273 -239 -211 -193 -179 -171 -170 -174 -179 -189 -204 -216 -216 -205 -191
2039 -191 -181 -179 -184 -194 -194 -169 -128 -100 -108 -142 -177 -206 -235 -265 -281 -274 -256 -246 -245 -236 -214 -194 -194 -208 -221 -223 -225 -239 -262 -276 -270 -253 -237 -222 -196 -157 -118 -97 -90 -86 -75
2021 -75 -64 -68 -90 -125 -161 -191 -206 -205 -199 -200 -211 -215 -193 -149 -113 -108 -130 -153 -167 -181 -198 -204 -185 -150 -118 -99 -88 -78 -74 -85 -108 -133 -150 -149 -130 -105 -90 -97 -121 -145
2004 -145 -152 -150 -157 -181 -198 -183 -133 -78 -45 -38 -44 -52 -59 -57 -44 -29 -23 -27 -26 -12 11 38 69 99 110 84 24 -37 -74 -75 -59 -45 -50 -73 -103 -119 -111 -89 -78 -97 -140 -182
1986 -182 -209 -221 -221 -214 -202 -191 -177 -157 -137 -136 -157 -179 -174 -151 -139 -154 -178 -192 -196 -202 -204 -190 -156 -115 -81 -60 -54 -59 -64 -61 -58 -76 -119 -166 -188 -180 -167 -170 -185 -194 -188 -177 -174
1967 -174 -181 -189 -188 -171 -146 -127 -120 -122 -123 -122 -121 -109 -76 -29 1 0 -18 -22 -6 6 1 -14 -28 -36 -44 -58 -82 -112 -136 -139 -122 -102 -91 -86 -71 -45 -13 13 26 18 -5 -36 -71
1948 -71 -111 -161 -213 -258 -291 -308 -306 -285 -250 -210 -169 -132 -106 -92 -87 -86 -92 -101 -111 -122 -136 -147 -141 -118 -97 -96 -109 -119 -126 -140 -161 -170 -151 -107 -66 -55 -78 -113 -140 -158
1931 -158 -179 -196 -188 -151 -117 -116 -135 -146 -141 -144 -168 -195 -198 -169 -119 -70 -46 -52 -66 -65 -50 -43 -57 -78 -94 -107 -125 -141 -144 -127 -92 -41 15 54 58 24 -29 -80 -107 -102
1914 -102 -74 -45 -28 -31 -55 -94 -125 -121 -82 -41 -27 -40 -62 -84 -107 -125 -131 -136 -155 -183 -199 -201 -203 -220 -245 -259 -257 -238 -206 -169 -142 -135 -146 -164 -174 -170 -153 -139 -145 -162
1896 -162 -168 -153 -136 -140 -162 -175 -170 -157 -149 -147 -145 -140 -132 -118 -97 -77 -72 -83 -102 -116 -122 -127 -141 -170 -207 -240 -251 -231 -186 -142 -124 -137 -161 -173 -173 -183 -215 -251 -266 -255 -239
1879 -239 -232 -227 -215 -207 -213 -221 -207 -168 -130 -119 -131 -149 -166 -183 -190 -173 -140 -117 -121 -141 -154 -151 -133 -106 -75 -56 -63 -89 -106 -100 -78 -58 -45 -36 -34 -43 -59 -71 -80 -100 -138 -175
1860 -175 -191 -189 -193 -207 -207 -178 -145 -144 -179 -214 -222 -211 -205 -207 -202 -180 -144 -103 -67 -44 -37 -40 -44 -48 -58 -70 -70 -51 -23 1 10 0 -34 -78 -110 -114 -102 -92 -91 -100 -121 -156 -193
1842 -193 -208 -195 -169 -149 -146 -165 -202 -240 -257 -246 -224 -207 -188 -149 -95 -53 -45 -67 -98 -128 -155 -186 -219 -240 -240 -225 -215 -223 -233 -223 -191 -158 -147 -166 -209 -262 -308
1826 -308 -331 -320 -285 -239 -200 -178 -172 -170 -167 -170 -184 -198 -194 -168 -138 -126 -140 -173 -209 -226 -213 -180 -156 -160 -182 -202 -209 -205 -199 -190 -169 -131 -82 -40 -22 -26 -36 -45 -58 -79 -101
1808 -101 -109 -91 -51 -15 -14 -54 -101 -119 -107 -97 -111 -137 -158 -176 -197 -214 -217 -216 -223 -237 -244 -237 -216 -186 -160 -148 -141 -121 -87 -71 -89 -118 -124 -106 -93 -97 -104 -105 -109 -114 -108 -86
1790 -86 -68 -70 -91 -119 -142 -148 -133 -109 -91 -81 -71 -66 -79 -110 -138 -150 -154 -154 -140 -109 -77 -65 -71 -84 -96 -107 -117 -130 -153 -177 -182 -167 -159 -180 -217 -245 -256 -258 -247 -218
1772 -218 -186 -176 -189 -202 -201 -196 -199 -206 -207 -199 -187 -177 -171 -168 -167 -171 -181 -191 -193 -185 -177 -172 -160 -136 -113 -106 -115 -127 -131 -127 -109 -80 -52 -41 -48 -62 -83 -115 -155 -184 -189 -169 -137 -114 -122
1753 -122 -161 -201 -208 -185 -161 -161 -181 -201 -207 -191 -157 -124 -107 -103 -101 -98 -98 -89 -52 1 32 22 -5 -24 -42 -75 -112 -130 -127 -126 -135 -139 -126 -111 -107 -107 -98 -80 -63 -52 -46 -41 -35 -26
1734 -26 -18 -21 -47 -90 -132 -160 -174 -184 -193 -194 -186 -175 -170 -167 -155 -133 -117 -123 -148 -170 -166 -132 -82 -37 -6 12 25 34 36 28 7 -18 -39 -47 -52 -69 -98 -121 -126 -128 -147 -173 -181 -164
1715 -164 -144 -146 -166 -182 -185 -175 -154 -125 -90 -64 -56 -71 -102 -132 -143 -129 -98 -62 -35 -29 -54 -103 -153 -183 -185 -165 -131 -97 -78 -76 -84 -94 -108 -128 -145 -148 -143 -139 -129 -103
1697 -103 -62 -29 -22 -35 -46 -39 -17 3 8 0 -3 7 19 8 -27 -69 -95 -104 -102 -95 -86 -85 -98 -121 -146 -168 -189 -203 -200 -174 -136 -106 -94 -98 -115 -138 -164 -187 -210 -238 -266
1680 -266 -275 -255 -222 -199 -179 -145 -101 -79 -98 -139 -175 -198 -216 -219 -200 -168 -145 -136 -128 -113 -101 -108 -131 -155 -167 -162 -149 -145 -160 -182 -193 -188 -179 -176 -177 -171 -153 -120 -78 -40 -24
1662 -24 -30 -48 -72 -102 -135 -161 -180 -201 -228 -256 -279 -292 -288 -261 -215 -173 -150 -146 -143 -139 -141 -154 -167 -165 -150 -137 -141 -157 -165 -153 -135 -128 -133 -146 -165 -194 -226 -240 -224 -184 -143
1644 -143 -119 -119 -131 -134 -122 -109 -109 -120 -129 -139 -154 -168 -165 -154 -161 -192 -227 -240 -237 -229 -214 -185 -156 -142 -147 -160 -175 -193 -203 -195 -183 -189 -213 -229 -214 -188 -181 -196 -198 -160 -98
1626 -98 -58 -64 -99 -133 -157 -183 -213 -233 -238 -238 -237 -223 -191 -163 -156 -165 -169 -164 -159 -152 -134 -112 -103 -121 -158 -201 -243 -276 -299 -314 -323 -320 -304 -284 -269 -254 -233 -219 -228 -253 -263 -246
1608 -246 -219 -199 -178 -145 -116 -108 -115 -108 -83 -62 -63 -81 -97 -102 -100 -94 -86 -75 -70 -77 -90 -98 -94 -79 -64 -56 -55 -59 -65 -72 -83 -102 -124 -132 -122 -111 -120 -143 -155 -150 -147 -156 -161 -146 -122 -119 -140
1588 -140 -163 -177 -192 -214 -229 -222 -194 -163 -147 -150 -164 -177 -177 -170 -173 -196 -228 -254 -270 -287 -300 -291 -249 -191 -148 -130 -119 -99 -77 -67 -73 -84 -98 -124 -164 -199 -210 -202 -195
1571 -195 -196 -197 -197 -207 -236 -275 -304 -317 -318 -314 -298 -271 -241 -220 -208 -195 -174 -150 -135 -141 -161 -174 -167 -150 -146 -162 -178 -181 -181 -199 -230 -250 -245 -225 -201 -171 -132 -98 -81 -71
1554 -71 -54 -34 -30 -47 -66 -63 -43 -29 -41 -80 -130 -175 -213 -253 -293 -319 -321 -307 -292 -271 -228 -162 -94 -44 -23 -35 -79 -129 -152 -142 -121 -107 -88 -51 -12 1 -12
1537 -12 -33 -45 -56 -71 -85 -84 -73 -70 -90 -132 -174 -194 -181 -144 -104 -75 -65 -69 -78 -76 -63 -50 -48 -52 -52 -60 -90 -143 -199 -242 -273 -292 -287 -249 -193 -146 -123 -114 -106 -99 -107 -129
1519 -129 -145 -140 -124 -116 -117 -110 -86 -65 -68 -96 -125 -136 -126 -107 -97 -107 -130 -153 -171 -188 -194 -170 -115 -58 -27 -26 -41 -58 -71 -75 -70 -75 -100 -133 -153 -151 -128 -88 -42 -7
1502 -7 11 38 90 156 228 325 462 628 839 1174 1676 2204 2475 2319 1842 1306 889 603 403 268 187 131 80 37 8 -13 -30 -31 -15
1489 -15 0 -6 -33 -74 -118 -149 -152 -133 -116 -117 -127 -134 -139 -145 -148 -142 -133 -131 -134 -133 -129 -126 -123 -120 -119 -124 -130 -126 -105 -71 -40 -19 -7 1 9 10 -1 -24 -49 -76 -106 -129 -123 -83 -29 2 -6 -50
1469 -50 -102 -143 -171 -188 -192 -172 -128 -86 -68 -80 -109 -141 -167 -172 -150 -118 -104 -119 -144 -164 -173 -176 -171 -159 -151 -151 -150 -141 -136 -149 -171 -183 -179 -172 -169 -167 -156 -134 -102 -71 -50 -39
1450 -39 -33 -30 -37 -57 -79 -97 -113 -127 -127 -105 -82 -85 -111 -133 -135 -134 -154 -193 -224 -226 -198 -153 -114 -96 -100 -115 -133 -154 -173 -182 -182 -185 -197 -202 -185 -148 -108 -84 -76 -80 -87 -93 -93 -87 -78
1431 -78 -73 -78 -98 -131 -164 -188 -206 -232 -268 -298 -299 -264 -208 -157 -127 -116 -116 -123 -134 -145 -148 -141 -124 -102 -79 -71 -86 -115 -141 -162 -191 -230 -258 -253 -218 -177 -143 -109 -68 -32
1414 -32 -21 -41 -77 -109 -122 -124 -130 -143 -150 -137 -111 -92 -90 -93 -93 -95 -105 -116 -112 -88 -56 -29 -13 -4 6 25 45 57 60 61 65 61 40 11 -12 -30 -53 -78 -93 -96 -100 -112 -122
1395 -122 -120 -110 -111 -123 -133 -134 -133 -138 -143 -138 -124 -117 -125 -145 -164 -172 -174 -176 -186 -205 -228 -245 -244 -214 -160 -105 -82 -102 -147 -186 -207 -220 -240 -257 -247 -203 -151 -120 -117 -122 -116 -91 -58
1376 -58 -29 -15 -21 -40 -57 -72 -93 -128 -168 -195 -200 -185 -158 -126 -103 -104 -129 -158 -169 -163 -154 -147 -129 -93 -49 -15 1 11 18 16 -4 -44 -87 -124 -147 -149 -125 -84 -46 -27
1359 -27 -33 -60 -100 -140 -165 -169 -158 -145 -135 -127 -117 -103 -90 -91 -115 -151 -181 -197 -206 -215 -216 -203 -186 -176 -167 -148 -131 -140 -181 -234 -277 -307 -323 -322 -299 -262 -218 -174 -142 -135 -148
1341 -148 -158 -148 -130 -119 -121 -133 -159 -196 -222 -223 -208 -200 -195 -179 -157 -143 -138 -121 -87 -60 -62 -80 -91 -96 -108 -126 -131 -120 -111 -126 -160 -191 -205 -201 -189 -173 -156 -136 -115 -96
1324 -96 -79 -62 -44 -29 -24 -26 -27 -19 -8 -14 -47 -89 -109 -93 -60 -38 -31 -25 -14 -9 -18 -41 -70 -96 -108 -92 -57 -33 -42 -81 -128 -175 -216 -237 -223 -178 -132 -107 -96 -83
1306 -83 -73 -89 -139 -202 -244 -247 -225 -202 -188 -173 -144 -104 -69 -52 -53 -64 -76 -81 -77 -68 -62 -61 -59 -51 -42 -47 -68 -92 -98 -83 -66 -65 -83 -112 -146 -180 -201 -197 -169 -141 -134 -146 -159
1288 -159 -160 -150 -139 -139 -161 -204 -249 -270 -258 -226 -198 -186 -190 -198 -203 -202 -198 -199 -203 -200 -185 -164 -147 -131 -105 -67 -32 -17 -20 -29 -29 -17 0 12 5 -27 -69 -94 -94 -86 -95 -125 -157
1269 -157 -178 -191 -200 -201 -189 -175 -173 -185 -201 -208 -197 -167 -125 -91 -81 -97 -130 -169 -209 -241 -255 -249 -227 -200 -174 -152 -136 -130 -138 -150 -145 -110 -59 -23 -18 -28 -32 -35 -56 -97
1252 -97 -139 -162 -159 -133 -93 -60 -46 -43 -32 -16 -11 -21 -26 -15 -2 -4 -10 -3 9 3 -29 -74 -118 -166 -212 -239 -236 -212 -185 -159 -135 -124 -137 -163 -176 -161 -129 -101 -88 -82
1234 -82 -71 -57 -54 -72 -106 -147 -184 -211 -221 -217 -217 -235 -270 -306 -331 -339 -325 -288 -245 -217 -206 -192 -164 -137 -137 -160 -181 -180 -163 -149 -146 -146 -134 -108 -85 -82 -95 -106 -107 -113 -144
1217 -144 -192 -235 -256 -253 -233 -204 -182 -183 -205 -222 -212 -183 -157 -139 -117 -91 -76 -83 -98 -102 -96 -99 -124 -157 -180 -185 -175 -156 -139 -134 -146 -161 -167 -167 -177 -208 -251 -288 -306 -303
1199 -303 -287 -272 -266 -271 -282 -291 -290 -277 -257 -237 -217 -193 -166 -149 -146 -141 -116 -71 -29 -12 -20 -37 -45 -37 -21 -14 -29 -60 -89 -104 -108 -103 -80 -42 -8 -4 -35 -80 -117 -138 -149
1182 -149 -157 -166 -171 -166 -150 -132 -121 -117 -110 -92 -67 -44 -26 -11 2 10 3 -14 -32 -38 -35 -37 -54 -88 -130 -169 -191 -181 -141 -87 -41 -10 5 6 -12 -45 -74 -82 -71 -61 -68 -94
1163 -94 -120 -137 -151 -170 -184 -169 -121 -58 -7 19 26 17 -2 -22 -35 -48 -77 -118 -152 -161 -154 -146 -144 -145 -152 -169 -192 -207 -206 -193 -181 -177 -179 -181 -184 -188 -192 -195 -195 -199 -212 -230 -240 -237 -232
1144 -232 -235 -241 -234 -211 -187 -184 -200 -217 -217 -199 -172 -151 -141 -141 -146 -153 -160 -169 -180 -198 -224 -252 -267 -256 -225 -195 -184 -191 -196 -185 -159 -132 -116 -114 -123 -136 -152 -165 -176 -185 -196 -209
1126 -209 -218 -221 -222 -235 -270 -311 -329 -307 -262 -225 -211 -209 -201 -185 -165 -144 -120 -98 -89 -98 -124 -155 -175 -176 -163 -149 -145 -153 -166 -179 -184 -175 -152 -123 -97 -78 -67 -60 -49 -32 -20
1108 -20 -23 -37 -43 -35 -33 -60 -106 -137 -139 -134 -150 -183 -205 -208 -205 -212 -224 -225 -210 -189 -174 -165 -153 -137 -117 -91 -53 -7 30 41 27 3 -13 -26 -45 -73 -99 -113 -109 -90 -66
1090 -66 -54 -62 -83 -100 -110 -125 -154 -189 -210 -213 -208 -201 -184 -152 -117 -100 -104 -113 -116 -119 -132 -150 -157 -152 -147 -153 -166 -176 -181 -184 -188 -196 -210 -224 -236 -244 -245 -235 -207 -167 -139 -142 -169 -192 -193
1071 -193 -179 -164 -153 -143 -130 -115 -104 -97 -98 -109 -133 -163 -188 -192 -172 -139 -112 -99 -96 -100 -112 -128 -132 -119 -96 -83 -85 -93 -100 -107 -115 -121 -125 -133 -144 -145 -133 -123 -130 -140 -130 -100 -79
1052 -79 -87 -114 -139 -159 -185 -215 -231 -225 -211 -204 -202 -191 -168 -137 -107 -83 -65 -56 -57 -62 -58 -42 -25 -25 -53 -97 -139 -172 -198 -210 -199 -167 -138 -129 -129 -117 -93 -80 -95 -122 -137
1034 -137 -137 -140 -155 -166 -152 -118 -86 -70 -63 -60 -65 -81 -103 -122 -141 -165 -192 -209 -211 -198 -172 -132 -93 -73 -81 -104 -120 -119 -108 -102 -112 -136 -153 -150 -135 -129 -136 -145 -146 -151 -170 -194
1016 -194 -201 -185 -159 -139 -125 -111 -94 -78 -71 -83 -107 -125 -121 -101 -83 -71 -56 -37 -31 -51 -91 -129 -153 -162 -154 -126 -90 -68 -72 -88 -98 -103 -123 -160 -192 -196 -172 -143 -122
999 -122 -106 -87 -73 -70 -77 -90 -104 -122 -143 -159 -161 -143 -113 -91 -92 -107 -112 -96 -73 -68 -86 -115 -136 -135 -111 -80 -71 -90 -107 -96 -70 -68 -108 -168 -219 -253 -272 -281 -285 -291 -295 -284
981 -284 -253 -215 -185 -158 -127 -100 -93 -114 -156 -205 -252 -281 -288 -284 -289 -312 -334 -337 -321 -298 -278 -259 -237 -215 -208 -218 -232 -235 -224 -209 -202 -206 -219 -233 -230 -197 -139 -75 -23 13
964 13 29 18 -8 -27 -18 11 42 56 47 18 -16 -40 -49 -58 -73 -83 -76 -65 -66 -75 -79 -78 -84 -94 -97 -96 -102 -109 -101 -83 -76 -85 -87 -70 -55 -60 -80 -93 -97 -100 -101 -92 -76 -64 -62 -63 -64 -64 -62 -59
942 -59 -65 -87 -116 -131 -124 -110 -102 -101 -102 -108 -119 -130 -132 -123 -107 -87 -73 -75 -97 -127 -147 -154 -160 -170 -177 -172 -162 -163 -179 -193 -193 -184 -186 -210 -254 -304 -343 -358 -349 -329 -312 -302 -292 -274 -244
922 -244 -205 -172 -156 -158 -167 -175 -189 -216 -244 -255 -244 -217 -184 -150 -122 -108 -106 -112 -123 -135 -136 -123 -117 -141 -186 -214 -208 -194 -207 -244 -281 -298 -292 -267 -231 -208 -212 -233 -250 -255 -250
905 -250 -237 -210 -180 -163 -164 -167 -161 -150 -143 -144 -155 -176 -196 -204 -205 -217 -248 -282 -298 -290 -270 -251 -236 -223 -210 -207 -227 -268 -302 -305 -273 -231 -195 -166 -140 -123 -117 -115 -108 -96 -89 -96 -114
886 -114 -136 -155 -172 -191 -208 -215 -208 -202 -213 -238 -256 -254 -240 -224 -203 -175 -145 -119 -101 -89 -85 -80 -61 -22 16 33 18 -20 -70 -118 -148 -154 -149 -155 -180 -208 -212 -186 -146 -116
869 -116 -105 -100 -85 -65 -62 -81 -103 -112 -109 -106 -105 -97 -86 -76 -69 -63 -65 -76 -82 -71 -49 -41 -50 -55 -44 -30 -29 -31 -23 -12 -21 -58 -104 -137 -157 -170 -176 -171 -154 -129 -98 -63 -34 -22 -25 -28
849 -28 -26 -29 -49 -77 -92 -90 -88 -98 -116 -130 -136 -126 -99 -70 -74 -125 -190 -216 -188 -135 -89 -65 -61 -78 -113 -153 -193 -232 -262 -266 -244 -213 -186 -162 -136 -119 -116 -106 -63 3
831 3 57 70 52 22 -9 -41 -67 -85 -104 -130 -158 -181 -192 -189 -164 -123 -92 -85 -97 -104 -106 -121 -155 -195 -221 -227 -219 -199 -172 -147 -135 -138 -152 -166 -175 -175 -175 -187 -213 -238 -246 -234
813 -234 -211 -177 -132 -89 -67 -70 -80 -87 -102 -133 -163 -168 -148 -126 -122 -131 -143 -158 -178 -201 -216 -215 -194 -163 -143 -146 -158 -156 -134 -113 -115 -131 -134 -112 -75 -45 -29 -27 -34 -52 -79
795 -79 -110 -137 -154 -165 -174 -184 -193 -204 -228 -262 -287 -284 -257 -226 -202 -183 -169 -168 -182 -198 -199 -188 -181 -183 -184 -174 -157 -146 -142 -139 -137 -136 -128 -103 -66 -42 -51 -86 -123 -150 -168 -183 -194
777 -194 -199 -203 -202 -188 -161 -133 -122 -128 -138 -136 -115 -84 -57 -43 -39 -42 -52 -71 -87 -83 -67 -60 -70 -86 -98 -110 -129 -145 -144 -127 -111 -105 -106 -108 -114 -126 -143 -161 -177 -185 -185 -181 -180 -186 -192
757 -192 -194 -186 -164 -126 -89 -74 -91 -124 -147 -148 -133 -118 -119 -130 -134 -120 -101 -104 -136 -176 -199 -203 -203 -211 -220 -219 -206 -187 -172 -173 -195 -225 -242 -234 -210 -188 -177 -175 -180 -187 -190 -177 -149 -118
738 -118 -105 -117 -150 -188 -221 -248 -275 -300 -308 -289 -258 -249 -275 -312 -330 -321 -304 -294 -285 -272 -264 -269 -278 -270 -238 -190 -144 -112 -108 -132 -173 -205 -202 -164 -121 -111 -143 -190 -218 -227 -242
720 -242 -266 -271 -244 -212 -204 -207 -192 -165 -158 -179 -202 -210 -222 -250 -277 -274 -245 -213 -189 -177 -187 -223 -263 -276 -258 -237 -234 -240 -227 -191 -149 -123 -117 -117 -112 -110 -126 -166 -211 -239 -242 -228
702 -228 -214 -215 -234 -262 -284 -293 -293 -282 -244 -176 -101 -56 -52 -70 -89 -97 -92 -76 -60 -57 -65 -63 -43 -25 -34 -64 -87 -90 -92 -115 -147 -161 -148 -130 -130 -143 -145 -132 -122 -124 -126 -112 -90
684 -90 -73 -66 -65 -73 -92 -115 -131 -139 -142 -141 -135 -130 -130 -125 -109 -98 -111 -138 -148 -138 -138 -168 -204 -208 -180 -150 -134 -120 -95 -66 -44 -25 -2 21 34 32 17 -2 -20 -33 -45 -63
665 -63 -94 -131 -163 -181 -189 -193 -195 -197 -198 -195 -186 -172 -158 -146 -136 -125 -116 -114 -117 -114 -100 -87 -94 -126 -171 -213 -244 -262 -268 -266 -261 -252 -229 -188 -141 -105 -87 -82 -80 -78 -84 -105 -143 -182 -197 -179
645 -179 -148 -134 -147 -167 -178 -182 -191 -202 -202 -187 -168 -161 -166 -172 -172 -174 -186 -201 -203 -182 -145 -104 -61 -24 -9 -30 -74 -107 -114 -110 -114 -124 -126 -117 -112 -114 -112 -87 -42 0 17 0 -40 -78
626 -78 -94 -86 -65 -48 -41 -43 -53 -70 -91 -101 -91 -69 -55 -61 -78 -87 -79 -65 -61 -68 -78 -85 -93 -108 -121 -118 -87 -40 1 17 8 -9 -25 -41 -59 -74 -83 -92 -111 -139 -156 -151 -135
608 -135 -126 -127 -129 -127 -130 -148 -176 -206 -227 -238 -240 -243 -259 -289 -311 -301 -262 -228 -217 -220 -217 -208 -205 -208 -207 -201 -203 -214 -219 -208 -197 -203 -223 -237 -238 -234 -235 -240 -247 -260 -279 -290 -275 -237 -197 -181
588 -181 -189 -200 -191 -161 -128 -109 -105 -106 -106 -105 -93 -61 -14 19 20 -11 -52 -85 -111 -138 -169 -198 -220 -233 -237 -227 -201 -167 -141 -132 -136 -138 -128 -118 -125 -150 -172 -170 -141 -100 -65 -48
570 -48 -58 -94 -141 -178 -195 -196 -190 -177 -163 -155 -158 -165 -171 -176 -185 -196 -200 -193 -177 -160 -143 -127 -116 -111 -113 -114 -109 -94 -74 -61 -60 -61 -57 -51 -52 -68 -92 -115 -130 -139 -146 -153 -155 -146 -130 -122 -130 -141 -137
548 -137 -119 -109 -119 -136 -142 -133 -114 -95 -80 -75 -78 -75 -62 -50 -47 -48 -45 -47 -66 -99 -121 -121 -115 -120 -136 -149 -158 -173 -203 -247 -293 -323 -313 -262 -194 -148 -138 -148 -158 -166 -182 -207
530 -207 -224 -224 -213 -199 -186 -172 -159 -152 -145 -132 -118 -115 -118 -114 -95 -76 -67 -67 -62 -52 -40 -31 -28 -38 -65 -91 -94 -70 -41 -21 -10 -8 -20 -42 -52 -40 -20 -20 -44 -79 -117 -156
512 -156 -192 -211 -210 -197 -178 -154 -126 -107 -100 -101 -105 -113 -127 -145 -166 -189 -204 -199 -174 -155 -161 -182 -193 -182 -164 -148 -131 -107 -81 -57 -37 -26 -33 -61 -90 -105 -105 -101 -100 -92 -72
494 -72 -41 -9 14 23 15 -4 -24 -40 -53 -57 -45 -21 -8 -25 -71 -128 -179 -212 -229 -238 -245 -245 -229 -204 -188 -190 -198 -198 -188 -176 -157 -129 -103 -100 -121 -147 -159 -162 -163 -160 -146 -126
476 -126 -106 -85 -55 -21 -3 -10 -35 -59 -65 -46 -11 24 41 33 2 -39 -77 -102 -114 -119 -125 -132 -133 -119 -90 -54 -25 -15 -22 -40 -57 -65 -62 -52 -48 -56 -67 -69 -65 -70 -90 -113 -125
457 -125 -126 -118 -96 -50 8 56 82 97 112 123 123 108 87 65 46 30 14 -3 -25 -50 -75 -98 -114 -120 -120 -123 -140 -171 -199 -203 -172 -123 -86 -78 -89 -103 -121 -147 -172
440 -172 -179 -167 -156 -155 -146 -116 -73 -39 -27 -38 -66 -97 -111 -104 -95 -108 -137 -159 -163 -161 -164 -169 -167 -160 -154 -149 -144 -139 -136 -142 -159 -179 -183 -165 -139 -129 -134 -132 -110 -80 -59 -48 -46 -56 -83 -113
420 -113 -124 -110 -86 -71 -72 -87 -111 -144 -182 -222 -251 -252 -226 -190 -162 -148 -142 -140 -144 -154 -167 -182 -192 -192 -182 -168 -158 -146 -121 -86 -53 -27 -6 7 4 -19 -51 -73 -81
403 -81 -79 -72 -64 -63 -70 -74 -69 -61 -69 -93 -113 -112 -89 -66 -52 -44 -26 4 35 47 33 0 -41 -79 -103 -107 -88 -56 -28 -24 -48 -87 -120 -138 -149 -168 -192 -208 -212 -210 -209 -197 -169 -144
384 -144 -145 -174 -202 -201 -171 -129 -88 -56 -43 -53 -80 -108 -125 -121 -99 -66 -35 -14 -3 2 -5 -34 -83 -131 -160 -165 -155 -150 -164 -198 -232 -240 -212 -163 -114 -78 -60 -65 -93 -131
367 -131 -158 -164 -163 -178 -219 -273 -312 -317 -294 -264 -250 -250 -249 -231 -195 -151 -115 -96 -92 -88 -70 -37 -16 -29 -78 -141 -191 -218 -222 -206 -177 -148 -133 -134 -140 -149 -163 -185 -207 -212 -189
349 -189 -145 -98 -68 -69 -100 -150 -202 -244 -271 -280 -269 -242 -208 -176 -152 -142 -140 -131 -106 -70 -40 -21 -13 -14 -30 -65 -107 -142 -163 -168 -159 -142 -130 -135 -155 -176 -188 -194 -198 -200 -198 -200
331 -200 -208 -215 -206 -179 -141 -103 -70 -45 -39 -60 -103 -152 -185 -195 -185 -160 -126 -89 -62 -56 -73 -103 -135 -161 -179 -188 -195 -202 -200 -178 -135 -99 -101 -139 -180 -194 -188 -185 -192 -194 -176 -146
313 -146 -123 -115 -121 -139 -159 -168 -158 -138 -128 -140 -167 -187 -186 -162 -122 -82 -56 -51 -63 -78 -87 -87 -84 -87 -93 -89 -70 -54 -68 -111 -153 -171 -175 -189 -214 -226 -211 -184 -164 -158 -157 -157 -153
294 -153 -134 -99 -59 -33 -27 -33 -36 -30 -14 2 12 10 1 -5 -8 -15 -35 -69 -102 -118 -114 -106 -111 -128 -143 -154 -166 -176 -165 -128 -91 -82 -92 -91 -67 -46 -54 -85 -109 -112 -99 -88 -88 -100
275 -100 -113 -118 -108 -89 -72 -63 -58 -53 -48 -53 -77 -120 -161 -181 -174 -154 -129 -99 -68 -51 -59 -85 -110 -117 -105 -80 -56 -41 -37 -45 -66 -103 -144 -175 -191 -198 -198 -178 -137 -100 -90 -103
257 -103 -116 -117 -116 -122 -126 -120 -101 -80 -63 -53 -52 -61 -80 -109 -141 -168 -184 -196 -213 -240 -268 -293 -309 -307 -285 -254 -229 -212 -189 -153 -112 -89 -98 -135 -178 -197 -183 -154 -135 -134
240 -134 -135 -136 -146 -169 -190 -196 -192 -186 -176 -164 -162 -181 -211 -232 -242 -243 -234 -211 -186 -180 -199 -219 -221 -201 -167 -129 -96 -86 -104 -139 -163 -161 -141 -123 -125 -142 -162 -175 -183 -188 -189 -183 -170
221 -170 -159 -158 -164 -174 -182 -189 -198 -207 -207 -194 -177 -172 -179 -179 -161 -137 -129 -138 -153 -167 -182 -196 -198 -191 -182 -175 -162 -146 -144 -174 -230 -290 -332 -347 -340 -321 -303 -287 -271 -251 -234 -226 -234 -249 -259
201 -259 -253 -233 -213 -198 -186 -177 -175 -178 -173 -148 -117 -102 -104 -107 -109 -121 -147 -170 -179 -182 -188 -192 -189 -186 -192 -201 -200 -194 -190 -191 -191 -197 -214 -234 -241 -231 -225 -241 -276 -307 -309 -279 -237 -204 -185 -170 -157 -147
181 -147 -140 -135 -132 -139 -150 -156 -158 -172 -194 -193 -151 -90 -49 -39 -46 -61 -82 -96 -90 -68 -54 -60 -75 -88 -101 -115 -124 -123 -114 -104 -93 -83 -77 -71 -62 -62 -82 -112 -127 -121 -107 -98 -87 -75 -84
161 -84 -127 -175 -184 -140 -68 -11 6 -16 -61 -106 -134 -151 -169 -190 -204 -204 -189 -170 -158 -156 -160 -173 -204 -252 -292 -296 -264 -227 -206 -198 -187 -173 -157 -140 -124 -119 -130 -139 -129 -101
144 -101 -70 -43 -29 -37 -69 -107 -138 -170 -213 -253 -270 -267 -271 -297 -331 -354 -361 -349 -314 -264 -223 -202 -186 -162 -135 -118 -114 -115 -117 -125 -144 -163 -166 -147 -124 -123 -151 -179 -174 -137 -100
126 -100 -85 -83 -78 -72 -70 -72 -74 -80 -89 -95 -95 -103 -129 -163 -179 -168 -146 -134 -135 -137 -130 -122 -131 -166 -209 -232 -230 -223 -232 -252 -266 -263 -246 -218 -187 -161 -150 -146 -140 -131 -124 -123 -129 -142 -160 -175 -183 -192 -203
105 -203 -205 -188 -168 -173 -209 -251 -274 -271 -243 -191 -125 -71 -55 -76 -111 -138 -149 -143 -118 -79 -44 -31 -41 -52 -46 -25 -17 -44 -90 -122 -122 -107 -108 -137 -183 -222 -235 -218 -181
88 -181 -143 -113 -95 -96 -115 -142 -164 -171 -170 -167 -167 -168 -169 -164 -145 -120 -112 -126 -142 -138 -115 -93 -83 -78 -68 -59 -56 -61 -65 -71 -83 -99 -111 -113 -105 -95 -89 -90 -100 -117 -128 -122 -97 -71 -60 -64 -69
68 -69 -67 -66 -68 -65 -46 -20 -3 -2 -8 -10 -9 -14 -30 -55 -84 -108 -120 -126 -135 -156 -185 -214 -227 -218 -191 -160 -141 -137 -140 -146 -147 -138 -115 -86 -66 -56 -45 -33 -32 -49 -68 -72 -62 -55 -56 -58 -52 -41
47 -41 -32 -32 -46 -73 -101 -123 -141 -167 -197 -210 -195 -162 -129 -106 -100 -114 -141 -152 -131 -89 -62 -66 -93 -123 -144 -152 -144 -123 -100 -82 -71 -70 -81 -97 -104 -97 -87 -88 -100 -111 -115 -112
29 -112 -105 -91 -66 -30 9 37 30 -14 -73 -111 -112 -90 -74 -75 -89 -101 -110 -121 -136 -143 -129 -99 -77 -78 -92 -104 -112 -123 -134 -136 -134 -149 -184 -211 -206 -179 -159 -160 -169 -171 -171 -186 -211
10 -211 -223 -203 -158 -117 -105 -122 -142 -141 -110 -65 -30 -21 -41 -83 -137 -193 -234 -247 -231 -209 -201 -206 -205 -185 -158 -148 -163 -189 -202 -183 -136 -79 -29 8 35 40 7 -55 -113
-7 -113 -134 -122 -108 -116 -140 -161 -170 -166 -147 -113 -69 -31 -13 -18 -40 -61 -69 -63 -59 -69 -88 -103 -108 -111 -123 -141 -154 -155 -155 -166 -181 -173 -130 -70 -33 -37 -72 -118 -163 -200 -227 -242
-25 -242 -247 -243 -223 -186 -148 -129 -127 -126 -118 -111 -121 -148 -179 -202 -206 -185 -143 -98 -72 -65 -63 -54 -51 -67 -95 -114 -112 -100 -93 -91 -87 -87 -101 -127 -144 -142 -131 -132 -145 -157 -155 -137 -113 -95 -93
-45 -93 -101 -103 -92 -80 -85 -101 -100 -66 -15 19 25 18 18 22 10 -22 -56 -63 -39 -4 12 1 -26 -57 -85 -107 -124 -134 -135 -128 -119 -122 -148 -185 -206 -199 -174 -147 -123 -96 -77 -84 -117
-63 -117 -148 -160 -158 -159 -163 -161 -153 -152 -160 -162 -151 -131 -111 -94 -77 -69 -74 -87 -101 -110 -111 -100 -80 -67 -74 -96 -116 -130 -144 -154 -142 -107 -68 -49 -51 -61 -77 -108 -146 -169 -167 -157 -159
-82 -159 -171 -174 -159 -139 -123 -106 -82 -53 -34 -33 -45 -68 -102 -137 -153 -142 -119 -111 -120 -121 -93 -42 -2 4 -14 -33 -36 -32 -41 -67 -92 -102 -105 -118 -141 -153 -145 -128 -125 -140 -165
-100 -165 -191 -210 -214 -202 -183 -170 -167 -162 -146 -119 -91 -78 -84 -101 -117 -131 -152 -179 -196 -190 -168 -147 -137 -133 -135 -144 -153 -145 -117 -95 -109 -155 -200 -220 -220 -212 -195 -161 -115 -80 -68
-118 -68 -70 -80 -96 -115 -116 -89 -52 -37 -48 -64 -66 -62 -68 -79 -88 -97 -111 -119 -105 -79 -68 -84 -114 -136 -142 -134 -114 -80 -41 -10 -2 -18 -51 -85 -111 -130 -143 -144 -131 -119 -122 -139
-136 -139 -155 -164 -177 -195 -204 -195 -180 -167 -151 -129 -115 -123 -142 -150 -156 -183 -229 -266 -272 -259 -245 -229 -197 -148 -98 -61 -44 -50 -70 -89 -102 -114 -134 -152 -150 -124 -94 -78 -74 -71
-153 -71 -63 -55 -50 -43 -28 -4 12 7 -19 -46 -50 -40 -41 -68 -113 -158 -190 -207 -208 -194 -175 -159 -144 -120 -85 -52 -39 -50 -71 -87 -97 -113 -139 -164 -171 -159 -144 -137 -136 -128 -117
-171 -117 -113 -124 -147 -167 -174 -168 -155 -141 -123 -99 -74 -69 -94 -137 -174 -192 -191 -174 -142 -105 -83 -83 -98 -114 -127 -140 -153 -163 -174 -189 -206 -218 -216 -198 -165 -127 -97 -81
-187 -81 -72 -64 -58 -56 -55 -50 -46 -53 -74 -103 -136 -159 -159 -129 -89 -64 -58 -56 -49 -46 -53 -54 -35 0 26 30 7 -27 -54 -60 -52 -50 -64 -76 -74 -67 -71 -79 -72 -48 -32 -41 -59 -67 -69 -76 -88 -85 -62 -30
-209 -30 -6 4 5 -3 -23 -52 -79 -97 -105 -109 -115 -127 -143 -155 -150 -116 -60 -6 20 19 1 -29 -79 -147 -217 -268 -287 -278 -254 -234 -234 -258 -291 -312 -312 -299 -279 -252 -214 -169
-226 -169 -130 -104 -88 -74 -59 -48 -45 -53 -66 -78 -81 -77 -70 -68 -71 -75 -77 -79 -83 -84 -78 -67 -53 -38 -23 -9 0 8 6 -16 -58 -102 -133 -149 -160 -170 -175 -178 -185 -190 -181 -157 -131 -116 -114 -124
-246 -124 -140 -155 -157 -140 -114 -85 -57 -29 -12 -12 -24 -41 -57 -70 -69 -50 -28 -25 -52 -93 -130 -149 -150 -134 -110 -86 -72 -71 -82 -98 -113 -128 -144 -150 -134 -108 -99 -115 -129
-263 -129 -113 -76 -47 -42 -56 -89 -144 -196 -209 -182 -151 -147 -159 -161 -153 -147 -136 -105 -65 -43 -39 -36 -26 -29 -60 -101 -130 -140 -146 -155 -166 -172 -177 -183 -190 -188 -164 -118 -68 -41 -41 -56 -74
-282 -74 -98 -133 -170 -196 -204 -199 -192 -193 -209 -233 -250 -245 -227 -208 -195 -178 -151 -123 -110 -118 -132 -131 -113 -96 -97 -110 -117 -113 -117 -141 -168 -167 -137 -110 -113 -145 -181 -200 -203 -201 -201 -197 -180 -151
-301 -151 -127 -120 -125 -124 -113 -108 -131 -174 -206 -201 -166 -128 -109 -102 -87 -55 -25 -19 -41 -70 -90 -95 -92 -85 -73 -62 -62 -76 -96 -113 -127 -139 -143 -129 -99 -70 -61 -73 -98 -117 -120 -101
-319 -101 -73 -53 -53 -66 -68 -49 -19 -1 -14 -57 -110 -153 -180 -201 -227 -253 -267 -271 -276 -285 -288 -279 -264 -250 -231 -205 -185 -183 -192 -194 -188 -191 -204 -208 -190 -165 -150 -149 -150 -152 -153 -145 -123 -94
-338 -94 -78 -76 -77 -73 -74 -90 -114 -130 -131 -124 -118 -117 -118 -118 -121 -132 -151 -166 -162 -139 -114 -102 -103 -112 -123 -133 -135 -125 -101 -75 -63 -73 -107 -154 -199 -223 -218 -190 -159 -141 -134 -125 -117 -126 -168
-358 -168 -226 -270 -284 -275 -256 -236 -222 -220 -227 -225 -207 -185 -174 -173 -168 -161 -166 -194 -234 -266 -274 -252 -208 -169 -155 -161 -159 -132 -91 -62 -61 -80 -99 -107 -101 -95 -106 -136 -169 -180 -165 -138
-376 -138 -119 -112 -103 -88 -74 -67 -59 -42 -27 -35 -72 -113 -135 -146 -163 -188 -196 -175 -144 -129 -137 -149 -149 -136 -118 -109 -117 -139 -154 -149 -140 -152 -187 -215 -209 -174 -132 -100 -85 -94 -131 -183
-394 -183 -227 -247 -247 -231 -195 -140 -82 -43 -33 -42 -53 -53 -42 -39 -64 -117 -177 -217 -230 -229 -226 -221 -207 -184 -162 -156 -169 -184 -175 -140 -107 -105 -129 -151 -154 -145 -142 -148 -161 -179 -193 -191
-412 -191 -173 -153 -146 -141 -124 -97 -77 -74 -85 -94 -90 -73 -55 -50 -55 -49 -28 -14 -24 -44 -51 -51 -67 -96 -107 -85 -52 -31 -17 -2 7 1 -3 9 34 41 20 -14 -47 -76 -109 -146
-431 -146 -183 -216 -239 -249 -249 -241 -220 -179 -132 -99 -88 -83 -72 -61 -54 -42 -19 0 -8 -48 -96 -127 -137 -138 -142 -145 -147 -156 -185 -231 -265 -263 -230 -194 -179 -187 -209 -237 -263 -277 -276
-448 -276 -258 -228 -198 -183 -192 -211 -224 -228 -234 -243 -242 -220 -188 -162 -151 -154 -167 -181 -183 -175 -170 -173 -173 -164 -159 -170 -184 -178 -152 -135 -140 -149 -142 -124 -118 -134 -166 -197 -213 -209 -194 -186 -195 -210 -213 -198
-468 -198 -182 -183 -200 -214 -205 -171 -129 -99 -86 -86 -90 -100 -120 -147 -169 -173 -160 -142 -129 -120 -111 -111 -135 -176 -206 -203 -178 -154 -143 -137 -126 -109 -97 -96 -110 -129 -132 -105 -59 -20 -2
-486 -2 -10 -40 -89 -134 -148 -127 -101 -96 -109 -119 -115 -105 -98 -94 -93 -99 -114 -132 -147 -151 -144 -135 -131 -135 -141 -143 -140 -134 -126 -128 -152 -195 -231 -232 -191 -127 -63 -21 -13 -35 -64 -75 -62 -41 -33 -44
-506 -44 -69 -93 -107 -109 -113 -129 -150 -157 -141 -116 -105 -114 -135 -153 -165 -175 -186 -189 -180 -167 -166 -177 -189 -193 -192 -194 -195 -188 -183 -189 -199 -195 -175 -153 -137 -119 -88 -56 -42 -48 -63 -76 -84 -87
-525 -87 -88 -91 -99 -108 -117 -129 -145 -154 -142 -112 -89 -92 -118 -149 -178 -213 -258 -300 -322 -323 -309 -287 -250 -197 -136 -84 -49 -37 -50 -80 -103 -98 -74 -59 -71 -99 -121 -126 -118 -109 -114 -141
-543 -141 -175 -186 -164 -131 -112 -107 -102 -97 -111 -141 -165 -165 -156 -160 -187 -228 -263 -273 -244 -187 -130 -92 -69 -48 -32 -35 -55 -78 -89 -91 -92 -96 -103 -118 -151 -197 -236 -251 -245 -241 -256
-561 -256 -279 -287 -264 -218 -174 -151 -146 -144 -133 -116 -108 -113 -115 -99 -74 -64 -76 -94 -96 -85 -70 -59 -55 -60 -75 -94 -110 -124 -134 -135 -125 -114 -104 -86 -57 -36 -41 -64 -81 -98
-578 -98 -135 -193 -232 -219 -169 -125 -105 -96 -84 -77 -90 -121 -153 -168 -159 -136 -115 -100 -85 -65 -46 -42 -53 -74 -98 -123 -139 -139 -132 -138 -163 -200 -233 -252 -253 -239 -226 -229 -247 -256
-596 -256 -246 -228 -216 -202 -175 -144 -127 -128 -134 -141 -159 -189 -214 -225 -229 -232 -221 -187 -144 -119 -121 -133 -137 -132 -128 -130 -135 -137 -135 -127 -116 -101 -87 -84 -102 -132 -140 -107 -49 -12 -22 -67 -114
-614 -114 -139 -141 -126 -109 -104 -112 -119 -106 -71 -26 11 26 12 -19 -52 -76 -96 -117 -135 -144 -149 -150 -138 -105 -65 -51 -70 -105 -130 -140 -142 -132 -114 -102 -111 -129 -133 -118 -101 -96
-632 -96 -95 -90 -92 -108 -126 -127 -110 -95 -97 -111 -126 -140 -156 -174 -194 -216 -239 -251 -246 -231 -222 -219 -206 -167 -112 -72 -66 -88 -110 -114 -102 -87 -79 -86 -117 -169 -223 -250 -242 -211 -175 -137
-650 -137 -95 -64 -60 -78 -99 -108 -102 -86 -61 -43 -51 -81 -98 -81 -51 -43 -63 -84 -88 -81 -80 -80 -72 -57 -39 -15 16 50 69 61 25 -29 -87 -129 -152 -172 -205 -251 -287 -296 -285
-668 -285 -269 -254 -240 -224 -209 -197 -188 -185 -183 -173 -148 -115 -90 -88 -109 -144 -178 -198 -197 -183 -174 -181 -196 -202 -194 -185 -182 -173 -147 -110 -81 -72 -78 -91 -107 -123 -132 -132 -138 -157 -183 -196 -186
-686 -186 -156 -116 -72 -34 -14 -13 -22 -32 -44 -61 -78 -88 -95 -114 -152 -201 -242 -263 -263 -254 -247 -246 -241 -216 -164 -104 -63 -52 -54 -49 -36 -30 -34 -38 -36 -33 -37 -43 -36 -14 9 16 7 -7 -14
-706 -14 -11 0 10 15 9 -1 -10 -17 -25 -30 -18 16 60 85 80 59 43 34 16 -22 -77 -129 -165 -182 -191 -208 -241 -281 -301 -286 -245 -202 -175 -163 -155 -144 -135 -134 -140 -143 -135 -120 -111 -113
-725 -113 -120 -127 -136 -145 -144 -131 -118 -120 -132 -137 -129 -121 -127 -149 -174 -194 -204 -201 -185 -158 -128 -106 -103 -116 -129 -127 -113 -99 -86 -69 -52 -55 -86 -134 -181 -218 -245 -258 -258 -258 -266 -267 -244 -208
-744 -208 -188 -193 -201 -191 -167 -148 -135 -119 -99 -84 -78 -78 -84 -104 -141 -185 -217 -223 -197 -146 -85 -37 -28 -61 -118 -165 -182 -178 -172 -167 -151 -119 -85 -66 -67 -82 -109 -142 -168 -170 -144
-762 -144 -102 -68 -63 -90 -134 -166 -171 -158 -144 -145 -159 -181 -204 -215 -211 -192 -165 -133 -101 -76 -67 -69 -71 -66 -58 -53 -51 -46 -37 -19 7 32 44 39 22 -10 -67 -137 -187 -194 -166 -132
-780 -132 -108 -93 -89 -99 -115 -121 -109 -87 -67 -54 -55 -79 -126 -176 -208 -214 -209 -204 -206 -207 -195 -164 -127 -112 -139 -186 -216 -212 -196 -202 -232 -261 -269 -253 -228 -204 -188 -180 -177 -174 -171 -170 -170
-799 -170 -170 -167 -167 -176 -191 -206 -217 -220 -209 -180 -143 -120 -125 -149 -169 -175 -170 -164 -158 -149 -140 -138 -144 -153 -155 -147 -133 -113 -84 -50 -23 -14 -20 -27 -27 -22 -18 -10 5 20 20 3 -13 -17 -19 -39 -78 -113
-819 -113 -128 -132 -146 -169 -183 -178 -165 -163 -174 -187 -191 -186 -182 -177 -159 -124 -81 -45 -21 -7 -5 -22 -57 -99 -133 -153 -157 -141 -107 -67 -39 -34 -41 -44 -38 -28 -23 -24 -30 -37 -39 -34 -29 -31 -46
-839 -46 -66 -82 -84 -72 -57 -54 -73 -114 -163 -196 -189 -140 -79 -45 -47 -59 -55 -39 -32 -43 -62 -79 -92 -97 -93 -86 -91 -104 -108 -93 -71 -57 -52 -52 -61 -80 -98 -108 -115 -125 -130 -114 -84
-858 -84 -63 -58 -55 -43 -38 -60 -104 -149 -182 -212 -236 -242 -217 -177 -148 -146 -156 -154 -124 -72 -19 11 15 2 -6 -3 2 -2 -21 -40 -49 -48 -45 -47 -52 -56 -60 -67 -82 -103 -126 -138 -135 -123 -118 -120
-877 -120 -115 -89 -51 -25 -19 -22 -28 -48 -83 -115 -122 -108 -91 -84 -83 -93 -119 -157 -181 -179 -166 -167 -184 -205 -219 -225 -220 -206 -196 -197 -201 -191 -176 -181 -210 -230 -213 -173 -144 -141 -147 -146 -132
-896 -132 -114 -108 -124 -151 -161 -136 -90 -55 -46 -51 -54 -55 -55 -51 -43 -40 -45 -48 -40 -25 -15 -17 -33 -65 -110 -159 -195 -215 -222 -219 -200 -165 -122 -85 -59 -42 -34 -38 -52 -71 -82 -82 -81 -92
-915 -92 -115 -131 -123 -100 -88 -100 -119 -119 -97 -71 -57 -56 -59 -62 -60 -50 -36 -29 -36 -44 -36 -15 -3 -16 -48 -78 -99 -117 -134 -150 -168 -192 -221 -240 -238 -219 -193 -172 -166 -179 -199
-933 -199 -206 -186 -151 -122 -108 -107 -115 -132 -148 -157 -156 -156 -160 -160 -151 -139 -137 -148 -166 -182 -194 -200 -200 -189 -169 -146 -124 -104 -92 -91 -95 -97 -94 -94 -104 -119 -131 -141 -156 -170 -174 -172 -186 -224
-952 -224 -267 -287 -267 -221 -173 -145 -141 -146 -141 -123 -110 -111 -116 -111 -98 -92 -102 -122 -144 -161 -168 -170 -176 -194 -211 -210 -188 -158 -138 -131 -131 -128 -114 -89 -67 -66 -88 -122 -158 -186 -196 -183
-970 -183 -153 -121 -91 -60 -39 -46 -79 -116 -139 -153 -161 -155 -131 -105 -90 -73 -43 -17 -22 -55 -86 -98 -100 -102 -95 -77 -58 -49 -49 -48 -48 -53 -64 -81 -107 -136 -157 -163 -162 -166 -171 -163 -136
-989 -136 -101 -71 -49 -34 -27 -30 -37 -39 -37 -44 -71 -114 -150 -166 -168 -169 -174 -175 -166 -155 -152 -167 -198 -231 -247 -241 -227 -223 -228 -222 -193 -156 -134 -131 -136 -140 -150 -175 -210 -234 -230 -200 -167 -153 -162
-1008 -162 -184 -202 -202 -174 -122 -70 -49 -67 -100 -122 -129 -132 -141 -154 -167 -173 -162 -131 -97 -85 -104 -137 -155 -142 -98 -42 0 12 -5 -39 -74 -99 -106 -94 -75 -73 -95 -130
-1025 -130 -158 -178 -196 -210 -208 -189 -161 -140 -129 -128 -132 -139 -150 -169 -193 -210 -209 -194 -186 -196 -211 -218 -220 -234 -259 -276 -271 -254 -236 -220 -206 -201 -212 -230 -246 -261 -273 -268 -233 -179
-1042 -179 -138 -127 -131 -130 -127 -134 -156 -183 -205 -212 -195 -163 -138 -140 -163 -187 -201 -204 -193 -162 -124 -108 -125 -156 -175 -173 -164 -157 -149 -137 -126 -116 -99 -78 -69 -87 -125 -154 -158 -146 -144
-1060 -144 -158 -178 -193 -204 -218 -231 -237 -237 -235 -228 -211 -195 -193 -202 -201 -183 -167 -172 -196 -222 -246 -273 -293 -287 -252 -206 -170 -142 -113 -79 -52 -43 -51 -68 -84 -92 -93 -91 -90 -94 -103 -116 -125
-1079 -125 -122 -112 -108 -111 -114 -115 -119 -134 -157 -180 -201 -220 -234 -236 -231 -233 -248 -261 -253 -222 -184 -158 -157 -179 -215 -248 -262 -250 -220 -186 -162 -152 -154 -160 -164 -163 -164 -172 -187 -201 -205 -199 -192 -199 -222
-1098 -222 -254 -278 -290 -295 -299 -297 -278 -240 -200 -182 -189 -203 -203 -192 -190 -209 -241 -267 -275 -270 -260 -246 -228 -203 -175 -153 -146 -161 -185 -200 -198 -187 -181 -186 -199 -217 -228 -216 -175 -122
-1115 -122 -92 -101 -139 -182 -215 -224 -207 -178 -160 -162 -162 -137 -89 -45 -20 -9 -10 -33 -85 -149 -191 -191 -159 -126 -113 -117 -122 -120 -120 -127 -142 -161 -179 -188 -176 -144 -114 -106 -118 -129 -124
-1133 -124 -101 -65 -24 5 9 -5 -15 -12 -7 -13 -22 -27 -40 -73 -116 -140 -133 -102 -70 -50 -47 -53 -53 -51 -62 -95 -130 -142 -132 -125 -134 -144 -143 -137 -134 -129 -117 -109 -116 -131 -137 -131 -123 -121 -122 -115 -98
-1154 -98 -75 -57 -60 -91 -140 -183 -206 -213 -221 -237 -256 -262 -245 -213 -186 -175 -179 -187 -197 -210 -220 -216 -193 -163 -138 -125 -124 -135 -152 -161 -152 -127 -111 -126 -169 -214 -235 -221 -182 -135
-1171 -135 -103 -104 -137 -182 -206 -202 -187 -182 -187 -193 -195 -197 -197 -189 -171 -146 -108 -55 0 34 41 32 18 -4 -35 -63 -78 -83 -83 -75 -64 -66 -102 -167 -234 -283 -302 -287 -239 -176 -127 -101
-1189 -101 -82 -60 -46 -59 -94 -130 -157 -181 -202 -209 -193 -161 -130 -112 -113 -129 -146 -147 -128 -105 -94 -99 -108 -112 -115 -129 -159 -192 -212 -208 -189 -174 -175 -191 -217 -248 -272 -277 -261
-1206 -261 -236 -221 -219 -219 -215 -210 -204 -191 -167 -145 -142 -166 -202 -230 -237 -230 -229 -246 -269 -275 -254 -214 -176 -151 -140 -144 -162 -189 -210 -216 -201 -170 -135 -114 -114 -129 -147 -168 -195 -227 -254
-1224 -254 -270 -276 -278 -270 -248 -213 -176 -151 -148 -169 -195 -205 -194 -179 -176 -178 -171 -158 -163 -194 -228 -237 -220 -197 -179 -160 -131 -103 -98 -123 -168 -212 -244 -265 -272 -263 -242 -214 -184 -154
-1241 -154 -128 -114 -113 -114 -108 -93 -77 -68 -70 -84 -107 -133 -160 -194 -235 -274 -301 -312 -311 -294 -258 -210 -169 -151 -153 -164 -174 -179 -176 -162 -140 -121 -112 -113 -116 -114 -108 -104 -103 -102 -97 -92 -89 -91 -96
-1261 -96 -102 -109 -117 -126 -137 -150 -163 -168 -165 -161 -161 -159 -140 -97 -42 2 17 4 -23 -53 -81 -101 -103 -82 -57 -55 -84 -121 -136 -121 -92 -74 -74 -82 -81 -66 -49 -52 -87 -146 -208 -253
-1279 -253 -273 -272 -265 -265 -265 -248 -205 -147 -97 -67 -56 -61 -78 -96 -107 -111 -119 -136 -158 -179 -192 -195 -186 -167 -143 -122 -115 -130 -159 -180 -174 -142 -100 -60 -21 12 27 10 -32 -82
-1296 -82 -123 -150 -166 -174 -176 -173 -166 -158 -156 -157 -151 -133 -112 -104 -112 -118 -107 -85 -75 -87 -108 -121 -126 -137 -153 -157 -137 -104 -80 -72 -75 -84 -97 -106 -106 -97 -91 -91 -90 -83 -75 -68 -63 -60 -70 -91 -110 -115 -114
-1317 -114 -121 -138 -151 -153 -146 -132 -108 -81 -67 -81 -120 -171 -218 -249 -254 -231 -193 -163 -157 -177 -203 -215 -203 -177 -154 -137 -117 -84 -42 -8 3 -6 -27 -46 -60 -77 -98
-1334 -98 -112 -109 -93 -83 -89 -104 -116 -123 -127 -133 -141 -147 -148 -146 -155 -185 -231 -267 -277 -260 -228 -191 -154 -125 -111 -108 -106 -102 -96 -92 -97 -109 -120 -113 -89 -69 -77 -111 -150 -175 -188 -195 -198 -192 -179
-1353 -179 -169 -169 -175 -182 -184 -185 -193 -210 -225 -221 -195 -165 -149 -148 -153 -164 -188 -220 -235 -220 -193 -184 -205 -235 -249 -246 -245 -253 -260 -254 -239 -226 -216 -200 -181 -174 -186 -204 -213 -212 -211 -210 -200 -181
-1372 -181 -167 -164 -167 -166 -167 -172 -169 -147 -115 -92 -78 -68 -66 -80 -98 -92 -57 -25 -20 -35 -52 -75 -118 -172 -212 -232 -240 -238 -216 -177 -142 -125 -122 -126 -137 -151 -156 -145 -136 -149 -181 -212
-1390 -212 -223 -214 -192 -166 -146 -135 -134 -137 -134 -117 -83 -45 -15 0 7 11 4 -13 -31 -43 -52 -66 -80 -86 -86 -89 -95 -101 -108 -117 -120 -105 -72 -39 -22 -23 -43 -74 -104 -113 -96 -67 -46
-1409 -46 -41 -48 -59 -71 -87 -111 -145 -186 -228 -266 -294 -304 -304 -306 -311 -299 -257 -202 -167 -159 -162 -162 -168 -181 -177 -138 -82 -49 -55 -84 -112 -128 -129 -112 -90 -86 -110 -145 -162 -153 -133 -117
-1427 -117 -98 -67 -36 -35 -72 -122 -151 -150 -144 -157 -188 -220 -237 -238 -224 -204 -184 -170 -159 -148 -137 -127 -118 -116 -130 -162 -195 -209 -200 -189 -192 -208 -222 -227 -227 -224 -216 -199 -169 -130
-1444 -130 -94 -81 -103 -145 -183 -205 -216 -222 -215 -187 -153 -127 -112 -100 -94 -99 -109 -109 -105 -118 -153 -179 -173 -148 -131 -126 -116 -98 -92 -104 -113 -97 -65 -40 -36 -46 -64 -88 -119 -154
-1462 -154 -182 -192 -184 -166 -154 -146 -131 -101 -67 -50 -57 -82 -109 -126 -130 -125 -111 -84 -41 9 53 78 76 47 2 -31 -36 -28 -40 -79 -112 -108 -75 -44 -31 -31 -32 -31 -24 -13 -10
-1480 -10 -21 -34 -27 -2 17 12 -13 -39 -52 -54 -57 -73 -92 -91 -71 -62 -91 -138 -157 -137 -110 -109 -124 -126 -109 -86 -71 -64 -66 -77 -93 -108 -120 -126 -121 -103 -79 -54 -28 -8 -15
-1497 -15 -54 -102 -128 -127 -118 -115 -110 -93 -63 -27 1 9 -8 -44 -85 -126 -168 -204 -228 -251 -283 -317 -337 -344 -353 -360 -338 -278 -207 -159 -142 -139 -139 -141 -143 -149 -163 -181 -189 -180 -169 -178 -205
-1516 -205 -232 -245 -248 -236 -205 -165 -145 -157 -184 -199 -201 -203 -209 -213 -219 -235 -252 -252 -234 -213 -200 -187 -169 -153 -152 -163 -179 -198 -216 -221 -209 -192 -186 -194 -203 -208 -210 -209 -205 -195 -179 -151
-1534 -151 -103 -48 -12 -12 -37 -71 -108 -147 -180 -199 -205 -207 -210 -210 -210 -216 -234 -263 -292 -312 -319 -322 -323 -310 -271 -219 -184 -179 -185 -176 -153 -137 -137 -147 -164 -192 -225 -246 -246 -237 -234 -241 -251
-1553 -251 -259 -261 -254 -244 -232 -215 -189 -167 -166 -181 -189 -176 -160 -165 -192 -219 -229 -221 -206 -195 -195 -204 -217 -231 -251 -279 -305 -311 -296 -273 -251 -225 -189 -147 -115 -108 -124 -149 -163 -157
-1570 -157 -140 -129 -136 -160 -191 -209 -203 -181 -163 -160 -160 -148 -125 -106 -101 -109 -122 -136 -146 -149 -148 -155 -180 -219 -253 -268 -262 -248 -245 -263 -288 -295 -264 -205 -143 -96 -62 -31 -5 7
-1588 7 0 -22 -53 -79 -95 -103 -118 -148 -184 -205 -202 -189 -175 -159 -135 -113 -112 -132 -153 -155 -142 -125 -107 -88 -74 -70 -67 -56 -45 -48 -61 -58 -29 0 2 -16 -35 -47 -70 -114
-1605 -114 -163 -195 -214 -236 -264 -282 -279 -262 -245 -225 -194 -162 -154 -174 -203 -217 -213 -207 -206 -196 -160 -104 -55 -33 -29 -22 -8 1 -2 -10 -14 -21 -45 -81 -106 -112 -110 -107 -104 -101 -107 -121 -124 -104
-1624 -104 -71 -50 -50 -67 -89 -109 -117 -109 -94 -93 -112 -137 -144 -123 -86 -56 -47 -51 -49 -32 -8 10 22 34 50 67 75 59 19 -27 -53 -56 -58 -77 -96 -90 -60 -30 -16 -15 -23
-1642 -23 -40 -54 -49 -34 -36 -72 -122 -154 -159 -153 -154 -158 -152 -127 -94 -76 -84 -103 -117 -124 -136 -151 -155 -149 -152 -179 -217 -246 -257 -252 -232 -205 -182 -175 -182 -198 -218 -230 -221 -192 -167 -164 -180
-1660 -180 -206 -248 -302 -346 -358 -344 -326 -307 -274 -236 -216 -225 -245 -253 -248 -240 -230 -212 -185 -155 -129 -118 -118 -115 -98 -80 -77 -84 -83 -74 -83 -121 -159 -170 -162 -166 -188 -214 -227 -228 -220 -205
-1679 -205 -190 -186 -194 -201 -201 -200 -204 -206 -196 -176 -163 -169 -185 -191 -186 -190 -219 -265 -296 -292 -261 -224 -192 -169 -152 -146 -156 -180 -210 -234 -243 -236 -218 -197 -182 -182 -191 -192 -172 -144 -133 -147 -171
-1697 -171 -181 -166 -133 -105 -103 -129 -157 -161 -141 -128 -139 -161 -178 -194 -223 -253 -264 -249 -222 -197 -180 -176 -184 -189 -171 -124 -66 -19 -1 -18 -61 -104 -124 -122 -119 -130 -153 -179
-1714 -179 -200 -210 -203 -180 -154 -131 -106 -78 -60 -61 -76 -97 -123 -154 -183 -195 -186 -163 -138 -118 -107 -106 -110 -109 -99 -83 -70 -67 -74 -89 -107 -124 -136 -145 -151 -155 -152 -144 -141 -160 -196
-1731 -196 -224 -225 -210 -203 -210 -214 -203 -186 -166 -139 -109 -99 -120 -152 -163 -153 -140 -131 -114 -80 -38 -4 16 23 12 -10 -32 -42 -43 -50 -71 -97 -112 -109 -97 -94 -106 -113 -103 -83
-1749 -83 -76 -83 -88 -81 -73 -73 -78 -80 -80 -81 -75 -57 -35 -30 -49 -81 -114 -138 -146 -140 -134 -145 -173 -204 -225 -231 -221 -209 -211 -229 -238 -214 -175 -162 -193 -238 -254 -233 -195 -157 -126 -106 -103 -116
-1768 -116 -133 -146 -151 -140 -115 -93 -94 -121 -153 -169 -171 -163 -149 -132 -121 -122 -133 -144 -149 -143 -122 -94 -68 -51 -41 -41 -61 -109 -176 -242 -285 -296 -286 -283 -311 -359 -391 -384 -355
-1785 -355 -335 -329 -323 -311 -303 -309 -318 -317 -303 -284 -263 -238 -205 -170 -149 -158 -188 -208 -192 -149 -106 -75 -53 -41 -46 -69 -94 -111 -124 -131 -115 -70 -17 3 -26 -94 -170 -226 -245
-1802 -245 -230 -201 -173 -144 -113 -82 -57 -34 -9 4 -13 -61 -111 -139 -148 -157 -178 -201 -211 -203 -187 -181 -194 -220 -241 -248 -237 -212 -175 -138 -110 -94 -82 -72 -65 -67 -75 -79 -76
-1819 -76 -70 -70 -79 -92 -103 -108 -106 -93 -71 -51 -47 -63 -92 -124 -153 -168 -155 -120 -90 -91 -118 -141 -145 -134 -124 -121 -120 -115 -98 -73 -56 -62 -80 -83 -61 -28 -2 2 -20 -71 -123 -138
-1837 -138 -108 -72 -65 -81 -85 -66 -46 -39 -39 -39 -50 -82 -120 -142 -142 -133 -127 -130 -146 -179 -218 -244 -242 -219 -188 -160 -133 -102 -70 -49 -48 -65 -85 -93 -88 -87 -105 -137 -162 -163 -141 -119
-1855 -119 -119 -144 -181 -215 -236 -245 -250 -256 -259 -250 -231 -213 -208 -215 -220 -221 -222 -230 -241 -247 -238 -211 -175 -148 -145 -160 -172 -168 -152 -145 -157 -183 -206 -209 -194 -182 -192 -226 -259 -271 -256 -225 -190
-1874 -190 -156 -123 -93 -69 -56 -60 -74 -83 -77 -61 -48 -45 -52 -69 -97 -128 -143 -126 -81 -38 -19 -23 -35 -53 -85 -128 -165 -183 -190 -205 -232 -258 -273 -282 -288 -278 -240 -183 -128
-1891 -128 -96 -90 -100 -116 -128 -139 -146 -150 -152 -160 -183 -213 -232 -232 -219 -206 -193 -182 -175 -173 -169 -160 -157 -167 -182 -185 -176 -169 -172 -174 -162 -141 -134 -158 -205 -244 -245 -208 -167 -156 -178 -200 -197 -172
-1910 -172 -145 -129 -128 -138 -148 -143 -120 -94 -82 -85 -92 -97 -99 -97 -97 -107 -130 -145 -135 -109 -89 -74 -53 -24 -9 -16 -30 -36 -36 -37 -37 -36 -42 -63 -95 -125 -150 -167 -166 -137 -95 -73
-1928 -73 -86 -124 -163 -188 -196 -188 -171 -150 -129 -107 -94 -96 -106 -110 -102 -95 -99 -112 -125 -140 -159 -178 -192 -200 -208 -217 -214 -193 -161 -135 -124 -114 -93 -68 -68 -104 -158 -197 -207 -199 -184
-1946 -184 -162 -138 -124 -124 -124 -106 -71 -38 -25 -36 -55 -68 -72 -86 -118 -151 -158 -137 -115 -105 -92 -62 -31 -28 -55 -90 -121 -152 -178 -180 -148 -100 -60 -37 -28 -27 -29 -30 -36 -59
-1963 -59 -99 -133 -136 -111 -77 -51 -34 -26 -31 -55 -89 -119 -136 -144 -152 -163 -170 -164 -141 -107 -79 -71 -92 -131 -165 -174 -157 -129 -106 -89 -76 -70 -68 -63 -55 -54 -69 -98 -128 -151 -167 -175
-1981 -175 -166 -142 -120 -119 -142 -167 -175 -164 -150 -141 -131 -110 -80 -51 -31 -22 -31 -63 -116 -172 -212 -233 -237 -224 -198 -174 -169 -185 -208 -214 -193 -150 -102 -69 -59 -66 -81 -102 -129
-1998 -129 -163 -198 -220 -219 -199 -182 -198 -247 -300 -334 -352 -366 -372 -348 -294 -237 -205 -194 -182 -161 -137 -119 -109 -110 -117 -128 -137 -148 -169 -207 -253 -286 -294 -278 -253 -232 -215
-2014 -215 -200 -192 -190 -188 -174 -151 -131 -124 -127 -132 -132 -129 -128 -135 -142 -137 -122 -116 -135 -167 -192 -210 -234 -261 -271 -256 -238 -238 -251 -260 -260 -248 -213 -153 -92 -61 -66 -80 -88 -97 -117 -135 -139 -129
-2033 -129 -115 -99 -79 -61 -60 -81 -116 -155 -196 -237 -265 -264 -231 -183 -142 -121 -117 -118 -110 -94 -78 -79 -100 -129 -154 -167 -163 -140 -105 -82 -90 -123 -153 -156 -140 -131 -144 -171 -199
-2050 -199 -213 -213 -208 -211 -222 -221 -193 -144 -99 -75 -71 -76 -91 -122 -167 -210 -236 -243 -245 -247 -245 -233 -220 -217 -218 -206 -173 -139 -130 -147 -170 -181 -178 -172 -175 -194 -227 -255 -267 -261 -244 -216 -182
-2069 -182 -156 -150 -154 -152 -143 -139 -144 -148 -146 -146 -149 -145 -127 -106 -82 -47 1 35 27 -21 -77 -114 -130 -138 -144 -146 -137 -121 -112 -121 -143 -157 -160 -171 -201 -226 -213 -160 -106 -84 -93 -111 -126 -135 -137
-2088 -137 -136 -145 -176 -226 -280 -320 -335 -325 -298 -267 -245 -237 -239 -247 -254 -259 -261 -266 -276 -287 -296 -296 -289 -279 -274 -269 -256 -226 -187 -157 -144 -138 -132 -129 -131 -130 -122 -115 -126 -158 -193 -214 -220 -225 -233 -238 -229
-2109 -229 -211 -195 -186 -178 -164 -146 -128 -114 -113 -130 -158 -175 -166 -146 -139 -152 -168 -178 -191 -214 -231 -224 -197 -172 -162 -158 -145 -115 -77 -48 -42 -58 -79 -90 -91 -99 -121 -144 -148 -128
-2126 -128 -98 -80 -87 -117 -152 -172 -169 -151 -139 -149 -175 -194 -194 -181 -172 -167 -157 -137 -115 -96 -76 -52 -33 -31 -42 -50 -49 -45 -49 -67 -99 -134 -152 -143 -125 -127 -158 -196 -221 -237
-2143 -237 -255 -271 -277 -274 -276 -280 -268 -236 -199 -175 -155 -124 -86 -68 -88 -132 -170 -184 -173 -150 -130 -129 -153 -183 -189 -166 -138 -134 -155 -182 -198 -200 -189 -169 -152 -152 -170 -195 -216
-2160 -216 -232 -244 -244 -224 -200 -196 -218 -247 -254 -231 -198 -177 -175 -182 -192 -207 -229 -251 -256 -244 -237 -250 -280 -307 -319 -322 -322 -312 -281 -236 -195 -165 -138 -103 -66 -45 -47 -58 -64 -67
-2178 -67 -79 -103 -134 -169 -202 -221 -213 -177 -133 -99 -75 -56 -46 -50 -66 -87 -104 -112 -106 -91 -77 -74 -74 -73 -74 -81 -84 -69 -45 -33 -33 -25 -2 22 33 33 26 8 -20 -43 -49 -49 -57
-2196 -57 -66 -65 -64 -75 -88 -84 -76 -91 -122 -130 -96 -52 -36 -47 -57 -55 -50 -43 -30 -23 -40 -78 -111 -125 -130 -139 -149 -151 -150 -164 -201 -245 -272 -270 -247 -226 -221 -231 -243 -253 -261 -263 -252 -228
-2215 -228 -195 -163 -135 -115 -105 -102 -96 -83 -73 -75 -93 -123 -154 -178 -196 -215 -234 -239 -215 -169 -129 -114 -117 -125 -137 -155 -171 -178 -178 -181 -178 -152 -99 -47 -19 -18 -27 -37 -54 -87
-2233 -87 -124 -140 -117 -70 -34 -41 -86 -140 -172 -176 -166 -157 -158 -174 -198 -219 -224 -209 -180 -149 -129 -128 -144 -171 -198 -216 -219 -213 -211 -212 -210 -195 -173 -154 -138 -119 -92 -68 -61 -80 -124
-2250 -124 -179 -227 -259 -281 -301 -317 -321 -310 -288 -256 -209 -155 -122 -130 -162 -179 -162 -125 -92 -64 -33 -4 0 -30 -85 -143 -186 -208 -204 -181 -159 -156 -168 -176 -173 -174 -184 -185 -162
-2267 -162 -130 -112 -110 -101 -76 -54 -56 -74 -91 -104 -123 -146 -160 -162 -172 -205 -247 -265 -247 -207 -177 -171 -187 -207 -216 -203 -166 -117 -77 -59 -53 -46 -42 -53 -82 -110 -121 -120 -121 -127
-2285 -127 -132 -124 -98 -59 -30 -28 -47 -57 -40 -14 -8 -27 -53 -81 -114 -148 -166 -163 -147 -128 -102 -71 -51 -51 -56 -48 -34 -30 -41 -56 -69 -89 -117 -146 -163 -173 -180 -187 -187 -180 -167
-2302 -167 -156 -156 -175 -206 -229 -229 -208 -184 -174 -184 -207 -221 -203 -149 -89 -58 -61 -69 -62 -53 -65 -96 -116 -102 -63 -26 -8 -10 -27 -51 -76 -103 -129 -146 -143 -123 -108 -114 -134
-2319 -134 -150 -149 -129 -91 -42 -3 3 -27 -78 -126 -162 -182 -189 -199 -223 -254 -262 -231 -183 -149 -129 -107 -84 -82 -112 -154 -182 -193 -200 -207 -206 -194 -178 -162 -145 -119 -90 -70
-2336 -70 -67 -81 -101 -125 -152 -180 -203 -214 -211 -199 -182 -163 -152 -153 -164 -175 -181 -180 -178 -176 -178 -184 -188 -183 -166 -146 -140 -154 -180 -195 -192 -181 -181 -194 -203 -190 -163 -147 -157 -186 -210 -215 -205
-2354 -205 -204 -225 -257 -276 -271 -254 -249 -256 -261 -257 -248 -244 -240 -232 -218 -199 -172 -144 -123 -110 -101 -93 -94 -103 -112 -110 -105 -107 -119 -137 -173 -237 -317 -379 -395 -364 -304 -241 -197 -187 -202 -210 -189 -150
-2373 -150 -119 -105 -94 -77 -62 -60 -70 -85 -108 -149 -205 -259 -294 -307 -304 -290 -267 -240 -220 -211 -210 -210 -206 -198 -189 -179 -172 -173 -182 -195 -211 -227 -243 -257 -260 -252 -238 -232 -243 -264 -282
-2391 -282 -281 -262 -237 -221 -215 -213 -215 -227 -244 -244 -211 -160 -128 -129 -146 -160 -172 -197 -232 -260 -274 -282 -289 -290 -280 -264 -251 -241 -226 -207 -192 -193 -209 -228 -232 -218 -196 -179 -168 -156
-2409 -156 -140 -128 -121 -118 -118 -121 -128 -133 -134 -138 -148 -164 -188 -218 -246 -254 -241 -219 -203 -193 -184 -180 -178 -161 -116 -61 -30 -31 -41 -41 -39 -49 -66 -76 -77 -73 -58 -27 7 18 -7 -46 -69
-2427 -69 -68 -63 -74 -95 -105 -91 -59 -25 -7 -13 -43 -86 -120 -134 -133 -136 -155 -181 -198 -199 -188 -175 -162 -146 -125 -109 -107 -123 -146 -168 -189 -212 -230 -230 -209 -185 -177 -190 -209
-2444 -209 -224 -230 -227 -217 -205 -199 -203 -209 -206 -188 -161 -138 -126 -125 -119 -97 -57 -13 17 32 33 24 0 -40 -77 -94 -94 -98 -120 -141 -138 -105 -63 -37 -37 -58 -90 -122 -148 -167 -183
-2462 -183 -195 -199 -192 -178 -158 -135 -117 -118 -141 -170 -185 -185 -186 -201 -222 -228 -213 -186 -156 -121 -73 -18 13 2 -38 -78 -99 -107 -109 -105 -91 -74 -57 -36 -12 -2 -21 -54 -71
-2479 -71 -68 -64 -70 -65 -32 13 37 23 -18 -67 -113 -143 -151 -137 -114 -89 -61 -31 -8 -3 -15 -27 -28 -17 -5 0 0 -5 -20 -41 -57 -61 -58 -59 -66 -74 -82 -97 -117 -127 -118 -105 -104 -115
-2498 -115 -127 -138 -157 -183 -205 -220 -239 -265 -277 -254 -205 -163 -146 -147 -148 -150 -161 -181 -201 -211 -213 -212 -204 -190 -179 -186 -205 -215 -204 -189 -194 -220 -244 -251 -250 -250 -248 -233 -210 -194
-2515 -194 -188 -183 -170 -151 -133 -121 -117 -119 -114 -90 -58 -38 -42 -58 -72 -86 -104 -124 -142 -161 -183 -201 -199 -170 -126 -89 -82 -109 -146 -157 -137 -123 -146 -192 -219 -218 -214 -223 -229 -216
-2533 -216 -195 -186 -189 -195 -195 -192 -187 -184 -190 -210 -232 -244 -243 -238 -233 -227 -219 -212 -204 -194 -189 -198 -222 -250 -264 -252 -213 -164 -128 -113 -107 -90 -66 -49 -50 -64 -89 -123 -156 -175 -183 -197 -226 -258
-2552 -258 -276 -277 -266 -244 -215 -192 -186 -196 -206 -206 -194 -172 -142 -112 -87 -70 -59 -49 -44 -47 -60 -78 -93 -100 -97 -87 -74 -62 -54 -48 -38 -24 -20 -39 -78 -118 -144 -151 -143 -129
-2569 -129 -123 -138 -168 -198 -217 -223 -218 -198 -168 -145 -137 -138 -134 -125 -115 -110 -104 -96 -86 -72 -61 -59 -70 -86 -94 -98 -106 -118 -121 -107 -78 -49 -35 -38 -52 -62 -62 -62 -76 -100 -119 -126 -129 -144
-2588 -144 -171 -197 -201 -180 -143 -112 -94 -83 -69 -57 -56 -75 -107 -140 -161 -164 -153 -142 -133 -119 -89 -55 -44 -67 -111 -147 -158 -145 -125 -116 -124 -138 -145 -150 -162 -181 -193 -191 -184
-2605 -184 -177 -165 -145 -126 -120 -123 -122 -117 -119 -131 -150 -172 -207 -253 -291 -290 -244 -182 -141 -131 -136 -142 -152 -167 -180 -180 -174 -174 -183 -189 -192 -205 -229 -249 -256 -251 -239 -221 -202 -191 -188 -178 -150
-2624 -150 -119 -107 -112 -119 -122 -122 -120 -112 -103 -108 -127 -146 -160 -178 -204 -225 -222 -197 -173 -169 -186 -206 -211 -198 -178 -159 -144 -133 -135 -156 -192 -222 -232 -228 -221 -214 -200 -175 -147 -133 -143 -168
-2642 -168 -188 -187 -162 -124 -89 -67 -65 -86 -127 -181 -233 -269 -281 -275 -265 -252 -222 -170 -114 -85 -87 -105 -122 -130 -131 -126 -121 -128 -145 -161 -165 -158 -149 -138 -125 -116 -120 -139 -166 -191 -209
-2660 -209 -224 -242 -261 -266 -243 -196 -149 -124 -117 -112 -102 -89 -78 -65 -48 -32 -31 -50 -91 -147 -207 -251 -269 -270 -268 -268 -260 -236 -208 -191 -187 -182 -169 -156 -147 -135 -112 -87 -78 -88
-2677 -88 -104 -116 -123 -129 -133 -137 -146 -161 -177 -194 -208 -210 -195 -178 -182 -206 -219 -197 -152 -112 -88 -67 -38 -14 -10 -20 -29 -31 -40 -73 -130 -191 -234 -245 -226 -185 -148 -138 -161 -195
-2694 -195 -215 -212 -195 -173 -146 -119 -103 -105 -122 -151 -189 -223 -234 -215 -191 -180 -176 -158 -130 -115 -129 -162 -193 -204 -184 -136 -88 -71 -91 -121 -133 -131 -136 -155 -181 -205 -223
-2710 -223 -227 -212 -186 -171 -177 -191 -195 -181 -157 -136 -119 -110 -113 -130 -157 -185 -209 -226 -237 -242 -247 -252 -247 -223 -197 -192 -210 -225 -219 -200 -187 -176 -157 -133 -116 -103 -84 -57 -41 -41
-2728 -41 -46 -48 -52 -67 -91 -125 -169 -215 -241 -230 -186 -133 -93 -80 -99 -138 -172 -181 -165 -130 -83 -37 -17 -33 -62 -69 -49 -23 -6 6 11 -11 -66 -129 -173 -193 -201 -209 -214
-2745 -214 -213 -209 -208 -213 -225 -234 -229 -212 -201 -206 -214 -213 -201 -187 -170 -143 -111 -86 -67 -49 -32 -30 -46 -64 -78 -93 -115 -138 -155 -173 -197 -211 -197 -162 -134 -130 -140 -146 -144 -136 -121
-2762 -121 -107 -107 -128 -147 -139 -108 -79 -68 -69 -72 -82 -106 -131 -136 -119 -105 -118 -154 -194 -225 -253 -286 -322 -344 -337 -306 -268 -239 -220 -202 -179 -155 -142 -142 -144 -132 -103 -75
-2779 -75 -69 -88 -110 -110 -83 -47 -27 -35 -65 -105 -140 -159 -167 -169 -169 -163 -155 -154 -166 -181 -181 -163 -146 -149 -173 -205 -231 -243 -239 -224 -212 -215 -226 -234 -231 -219 -201 -182 -163 -142 -113 -75
-2797 -75 -48 -52 -86 -124 -145 -154 -162 -166 -161 -151 -142 -129 -108 -95 -103 -128 -153 -177 -206 -237 -249 -235 -213 -196 -182 -161 -135 -115 -108 -114 -131 -150 -164 -174 -186 -197 -196 -190 -193 -207 -208
-2815 -208 -186 -161 -160 -176 -178 -158 -143 -155 -180 -194 -191 -184 -180 -180 -184 -194 -209 -222 -222 -204 -174 -146 -134 -139 -146 -137 -113 -92 -92 -111 -128 -131 -127 -136 -162 -186 -191 -176 -148 -119 -104 -110 -126
-2833 -126 -132 -120 -110 -121 -142 -152 -146 -137 -129 -114 -95 -90 -104 -122 -136 -155 -184 -213 -229 -231 -223 -200 -161 -123 -107 -110 -112 -99 -77 -55 -37 -27 -35 -57 -78 -87 -85 -89 -106 -126 -135
-2851 -135 -130 -122 -118 -110 -88 -57 -42 -55 -81 -104 -123 -145 -164 -169 -161 -154 -152 -150 -147 -149 -160 -175 -182 -177 -159 -128 -89 -54 -35 -30 -32 -35 -33 -23 -8 1 -8 -45 -95 -126 -118 -78 -39 -23
-2870 -23 -30 -48 -71 -95 -110 -110 -102 -105 -118 -126 -121 -108 -95 -81 -70 -70 -85 -105 -117 -118 -113 -109 -113 -128 -150 -171 -186 -197 -202 -198 -186 -179 -184 -193 -193 -179 -159 -141 -129 -122 -116 -108 -98 -93 -95 -105
-2890 -105 -122 -152 -189 -216 -214 -186 -154 -131 -116 -102 -97 -112 -150 -194 -229 -249 -262 -267 -258 -231 -194 -162 -148 -152 -166 -173 -162 -141 -127 -129 -136 -131 -116 -101 -88 -67 -42 -32 -48
$$ [...]
-3135a55
##END=	
##END=	
