##TITLE=	Nov04-2021.20.fid
TM-VI-146repeat solid dmso d6

##JCAMP-DX=	6.0	$$ MestReNova 14.3.0-30573
##DATA TYPE=	LINK
##BLOCK_ID=	1
##BLOCKS=	2    
##ORIGIN=	Mestrelab Research S.L.
##OWNER=	hrzepa
##$MNOVA/LINK_BLOCK_TYPE=	ITEM	$$ NMR Spectrum
##$MNOVA/ITEM/POLYGON=	(XY..XY)
5321,5835
8722,5835
8722,8208
5321,8208
5321,5835
##$MNOVA/ITEM/Z=	0
##$MNOVA/ITEM/ANGLE=	0
##TITLE=	Nov04-2021.20.fid
##JCAMP-DX=	6.0	$$ MestReNova 14.3.0-30573
##BLOCK_ID=	2
##DATA TYPE=	MNOVA NMR VIEW DATA
##DATA CLASS=	MNOVA VIEW DATA
##$MNOVA/ITEM/ZOOM/X=	-4.0107147498308073352,	16.011019999997905927
##$MNOVA/ITEM/ZOOM/Y=	-530.36363339424133301,	5864.5399169921875
##END=	
##TITLE=	Nov04-2021.20.fid
##JCAMP-DX=	6.0	$$ MestReNova 14.3.0-30573
##BLOCK_ID=	3
##DATA TYPE=	NMR SPECTRUM
##DATA CLASS=	XYDATA
##NUMDIM=	1
##ORIGIN=	Bruker BioSpin GmbH
##OWNER=	nmr
##.OBSERVE FREQUENCY=	400.20240119999999706
##.OBSERVE NUCLEUS=	^1H
##.SOLVENT NAME=	DMSO_weak
##.PULSE SEQUENCE=	zg30
##LONGDATE=	2021/11/04 15:11:00.000
##.ACQUISITIONMODE=	SIMULTANEOUS (DQD)
##$ORIGINAL FORMAT=	Bruker XWIN-NMR
##$MNOVA/SCALES_VERSION=	9
##$PARAMETER FILE=	(acqus, ASCII, /private/var/folders/f6/rjf_tdyn2v98c5c0wvkgn4s80000gn/T/sHsoejxeQMCb9vi6PvbR1Q/20/acqus, 0)
$$ ##TITLE= Parameter file, TOPSPIN		Version 3.2
$$ ##JCAMPDX= 5.0
$$ ##DATATYPE= Parameter Values
$$ ##NPOINTS= 11	$$ modification sequence number
$$ ##ORIGIN= Bruker BioSpin GmbH
$$ ##OWNER= nmr
$$ $$ 2021-11-04 15:11:31.818 +0000  nmr@CZC2439F63
$$ $$ /opt/topspin/data/agmb/nmr/Nov04-2021/20/acqus
$$ $$ process /opt/topspin3.2/prog/mod/shimcntl
$$ ##$ACQT0= -2.10084033613445
$$ ##$AMP= (0..31)
$$ 100 100 100 100 100 100 100 100 100 100 100 100 100 100 100 100 100 100
$$ 100 100 100 100 100 100 100 100 100 100 100 100 100 100
$$ ##$AMPCOIL= (0..19)
$$ 0 0 0 0 0 0 0 0 0 0 0 0 0 0 0 0 0 0 0 0
$$ ##$ANAVPT= -1
$$ ##$AQSEQ= 0
$$ ##$AQ_mod= 3
$$ ##$AUNM= <au_zg>
$$ ##$AUTOPOS= <52 >
$$ ##$BF1= 400.2
$$ ##$BF2= 400.2
$$ ##$BF3= 400.2
$$ ##$BF4= 400.2
$$ ##$BF5= 400.2
$$ ##$BF6= 400.2
$$ ##$BF7= 400.2
$$ ##$BF8= 400.2
$$ ##$BYTORDA= 0
$$ ##$CAGPARS= (0..11)
$$ 0 0 0 0 0 0 0 0 0 0 0 0
$$ ##$CFDGTYP= 0
$$ ##$CFRGTYP= 9
$$ ##$CHEMSTR= <none>
$$ ##$CNST= (0..63)
$$ 1 1 145 1 1 1 1 1 1 1 1 1 1 1 1 1 1 1 1 1 1 1 1 1 1 1 1 1 1 1 1 1 1 1 1
$$ 1 1 1 1 1 1 1 1 1 1 1 1 1 1 1 1 1 1 1 1 1 1 1 1 1 1 1 1 1
$$ ##$CPDPRG= (0..8)
$$ <> <> <> <> <mlev> <mlev> <mlev> <mlev> <mlev>
$$ ##$D= (0..63)
$$ 0 1 0 0 0 0 0 0 0 0.06 0 0 0 0 0 0 0.0002 0 0 0 0 0 0 0 0 0 0 0 0 0 0 0
$$ 0 0 0 0 0 0 0 0 0 0 0 0 0 0 0 0 0 0 0 0 0 0 0 0 0 0 0 0 0 0 0 0
$$ ##$DATE= 1636038690
$$ ##$DE= 6.5
$$ ##$DECBNUC= <off>
$$ ##$DECIM= 2496
$$ ##$DECNUC= <off>
$$ ##$DECSTAT= 4
$$ ##$DIGMOD= 1
$$ ##$DIGTYP= 12
$$ ##$DQDMODE= 0
$$ ##$DR= 22
$$ ##$DS= 2
$$ ##$DSPFIRM= 0
$$ ##$DSPFVS= 20
$$ ##$DTYPA= 0
$$ ##$EXP= <proton>
$$ ##$F1LIST= <111111111111111>
$$ ##$F2LIST= <222222222222222>
$$ ##$F3LIST= <333333333333333>
$$ ##$FCUCHAN= (0..9)
$$ 0 2 0 0 0 0 0 0 0 0
$$ ##$FL1= 90
$$ ##$FL2= 90
$$ [...]
$$ ##$Sgu3PowerLevels= (0..7)
$$ 0 0 0 0 0 0 0 0
$$ ##$Sgu4PowerLevels= (0..7)
$$ 0 0 0 0 0 0 0 0
$$ ##$Sgu5PowerLevels= (0..7)
$$ 0 0 0 0 0 0 0 0
$$ ##$Sgu6PowerLevels= (0..7)
$$ 0 0 0 0 0 0 0 0
$$ ##$Sgu7PowerLevels= (0..7)
$$ 0 0 0 0 0 0 0 0
$$ ##$Sgu8PowerLevels= (0..7)
$$ 0 0 0 0 0 0 0 0
$$ ##$SguType= 3
$$ ##$ShimPowMaxUA= (0..63)
$$ 130000 130000 130000 130000 130000 130000 130000 130000 130000 130000 130000
$$ 130000 130000 130000 130000 130000 130000 130000 130000 130000 0 0 0 0
$$ 0 0 0 0 0 0 0 0 0 0 0 0 0 0 0 0 0 0 0 0 0 0 0 0 0 0 0 0 0 0 0 0 0 0 0 0
$$ 0 0 0 0
$$ ##$ShimPowMaxUC= (0..63)
$$ 130000 130000 130000 130000 130000 130000 130000 130000 130000 130000 130000
$$ 130000 130000 130000 130000 130000 130000 130000 130000 130000 0 0 0 0
$$ 0 0 0 0 0 0 0 0 0 0 0 0 0 0 0 0 0 0 0 0 0 0 0 0 0 0 0 0 0 0 0 0 0 0 0 0
$$ 0 0 0 0
$$ ##$ShimPowMaxUG= (0..63)
$$ 524287 524287 524287 524287 524287 524287 524287 524287 524287 524287 524287
$$ 524287 524287 524287 524287 524287 524287 524287 524287 524287 0 0 0 0
$$ 0 0 0 0 0 0 0 0 0 0 0 0 0 0 0 0 0 0 0 0 0 0 0 0 0 0 0 0 0 0 0 0 0 0 0 0
$$ 0 0 0 0
$$ ##$ShimPowRcbType= 3
$$ ##$ShimPowRes= (0..63)
$$ 1e-20 1e-20 1e-20 1e-20 1e-20 1e-20 1e-20 1e-20 1e-20 1e-20 1e-20 1e-20
$$ 1e-20 1e-20 1e-20 1e-20 1e-20 1e-20 1e-20 1e-20 0 0 0 0 0 0 0 0 0 0 0 0
$$ 0 0 0 0 0 0 0 0 0 0 0 0 0 0 0 0 0 0 0 0 0 0 0 0 0 0 0 0 0 0 0 0
$$ ##$ShimPowRng0= (0..63)
$$ 1 1 1 1 1 1 1 1 1 1 1 1 1 1 1 1 1 1 1 1 0 0 0 0 0 0 0 0 0 0 0 0 0 0 0 0
$$ 0 0 0 0 0 0 0 0 0 0 0 0 0 0 0 0 0 0 0 0 0 0 0 0 0 0 0 0
$$ ##$ShimPowRng1= (0..63)
$$ 1 1 1 1 1 1 1 1 1 1 1 1 1 1 1 1 1 1 1 1 0 0 0 0 0 0 0 0 0 0 0 0 0 0 0 0
$$ 0 0 0 0 0 0 0 0 0 0 0 0 0 0 0 0 0 0 0 0 0 0 0 0 0 0 0 0
$$ ##$ShimPowRng2= (0..63)
$$ 1 1 1 1 1 1 1 1 1 1 1 1 1 1 1 1 1 1 1 1 0 0 0 0 0 0 0 0 0 0 0 0 0 0 0 0
$$ 0 0 0 0 0 0 0 0 0 0 0 0 0 0 0 0 0 0 0 0 0 0 0 0 0 0 0 0
$$ ##$ShimPowRng3= (0..63)
$$ 1 1 1 1 1 1 1 1 1 1 1 1 1 1 1 1 1 1 1 1 0 0 0 0 0 0 0 0 0 0 0 0 0 0 0 0
$$ 0 0 0 0 0 0 0 0 0 0 0 0 0 0 0 0 0 0 0 0 0 0 0 0 0 0 0 0
$$ ##$ShimSysFunc= (0..63)
$$ 1 2 3 4 5 7 9 11 15 16 8 10 12 14 6 17 13 18 19 20 0 0 0 0 0 0 0 0 0 0
$$ 0 0 0 0 0 0 0 0 0 0 0 0 0 0 0 0 0 0 0 0 0 0 0 0 0 0 0 0 0 0 0 0 0 0
$$ ##$ShimSysMatrix= 0
$$ ##$ShimSysType= 1
$$ ##$TFXNUM= 0
$$ ##$TRIPLO2= 0
$$ ##$VTU= 2
$$ ##$VTUETH= <149.236.99.20>
$$ ##$VTUTY= <no>
$$ ##$WBREFAM= (0..15)
$$ 135.5 97.7 100 100 100 100 100 100 100 100 100 100 100 100 100 100
$$ ##$WBREFLM= (0..15)
$$ 0 0 0 0 0 0 0 0 0 0 0 0 0 0 0 0
$$ ##$WBREFPH= (0..15)
$$ 72.26 -67.22 0 0 0 0 0 0 0 0 0 0 0 0 0 0
$$ ##$WBSGU= (0..15)
$$ 0 0 0 0 0 0 0 0 0 0 0 0 0 0 0 0
$$ ##$XFAC= 2
$$ ##END=
$$ 
##$DECIM=	2496
##$DSPFVS=	20
##XUNITS=	HZ
##YUNITS=	ARBITRARY UNITS
##FIRSTX=	6407.6102040000005218
##LASTX=	-1605.0880428824991668
##DELTAX=	-0.12226593800080109986
##XFACTOR=	1
##YFACTOR=	0.021697482762732703959
##FIRSTY=	10.062191009521484375
##MINY=	2.7763812541961669922
##MAXY=	5331.39990234375
##NPOINTS=	65536
##XYDATA=	(X++(Y..Y))
$$ [...]
2713D8446o28o61o76o81o89o87o66o33n93n44n02m83m70m25l44k64k17j93j58j13o9l2K1J03
2710C8842J94K54K69K70L00L57M05M23M37M70N13N42N61N73N67N39N08M94M88M66M26L73K97
2707D8568K00J15P0M0j5q3j44k14l28m59n53o06o65p55q29q64q98r59j015j031j022j028j048
2704C6477j050j029j013j011j015j009r96r68r23q63q15q03q23q37q07p41o92o89o97o64n96
2702A8436n53n55n63n50n33n26n08m59m11l94l97l89l73l66l54l13k63k51k76k97k91k78k81
2699I255k86k76k48k06j63j41j69k22k48k16j59j29j32j37j36j47j74j81j43q5n9p4r8j06
2696E320j11j28j28r8o5p5j19j40j14p5o6r1j11r8n1pkl2o2o8p0q6r3o8m4o2r9q6k6Ok2m4
2692B985k0J1jk4j8j6n3r7q1k2Pj4l4l2l6n6o3m0j6j3k2k6l2m0l8j9%OJj4k9k9j0kk2m3l9
$$ plain form
2713 48446 47818 47157 46481 45800 45111 44424 43758 43125 42532 41988 41486 41003 40533 40108 39764 39500 39283 39090 38932 38819 38750 38718 38739 38842
2710 38842 39036 39290 39559 39829 40129 40486 40891 41314 41751 42221 42734 43276 43837 44410 44977 45516 46024 46518 47006 47472 47898 48271 48568
2707 48568 48768 48883 48953 48993 48978 48895 48751 48537 48209 47750 47197 46591 45926 45171 44342 43478 42580 41621 40606 39575 38553 37525 36477
2704 36477 35427 34398 33385 32374 31359 30350 29354 28386 27463 26600 25785 24982 24159 23322 22515 21774 21082 20393 19696 19032 18436
2702 18436 17883 17328 16765 16215 15682 15156 14648 14189 13778 13384 12987 12598 12225 11859 11505 11192 10929 10678 10402 10105 9814 9536 9255
2699 9255 8969 8693 8445 8239 8076 7935 7766 7544 7296 7080 6921 6792 6660 6523 6387 6240 6066 5885 5742 5657 5598 5524 5426 5320
2696 5320 5209 5081 4953 4855 4790 4715 4596 4456 4342 4267 4201 4110 3999 3901 3850 3843 3841 3809 3747 3679 3609 3523 3430 3362 3318 3256 3157 3071 3045 3051 3029 2985
2692 2985 2965 2976 2975 2951 2933 2917 2864 2767 2686 2664 2671 2657 2623 2591 2555 2499 2436 2396 2380 2367 2345 2319 2287 2247 2209 2190 2190 2196 2197 2183 2154 2125 2115 2113 2091 2048 2009
2687B009k8l7m5k3Mj5o5p3k3K1J3j1j2NJ7Qj7n2n9k3J4on8o4j5J1k2m5oM0L2jKK9K3j6m5m9
2683A418m9m0j3Rlk9k6m%j4k1j8k6l0lL4K9j3l4oK5K3Nj%nj8l1m1l3JL0J9j0pK9K7l4p9m0
2678A021M0N9Pl5j5K2J4k5l3mJ1j3l6j9J4J5j5k9j9j4j8mK7K6k4n6k5L1L7%k6k4k7k9%M9N7
2673I40J2k9k7nOQJ3Jk7k8J9O0L6l9q9p1rM2N1J8k3l6j6%j3l0k4LJ6RKJ1J8Mk3l6k0QK2J8
2668G72J3Rj1m4m8nL6J5m1n0J1O5N8J1j7j7j5j8j6j7k3j8J6N2N2J6k2m1m5l5j2RJ6Ork8m9
2664E76n0k1K1L6K3MRL3O1O0K3k3l6j0J1pl9l9pK0K8K5K0Oj4k6k4oK7O2O2Oo2q1l8J8L6J2
2659F96l0n2l3J0K7Lk2LN3N5%m4l0QJ1j5k7rJ1J1NJ6M3N8L5j4m2j7K6K6k9p4n0K1O1L1k5m0
2655F57nK8J0m3o8l1K9M8J1l2k6J7M5K2k8m7rM9O3J9l8n9m0j0Joj3kK4L8J3l0m4j6OlrK7O8
$$ plain form
2687 2009 1981 1944 1899 1876 1880 1865 1800 1727 1704 1725 1738 1727 1715 1720 1737 1745 1728 1676 1617 1594 1608 1602 1544 1480 1465 1476 1454 1409 1403 1443 1475 1474 1476 1505 1528 1512 1467 1418
2683 1418 1369 1329 1316 1325 1322 1293 1267 1263 1263 1249 1228 1210 1184 1154 1151 1185 1214 1201 1167 1161 1186 1209 1214 1213 1213 1208 1190 1159 1118 1085 1086 1116 1135 1125 1118 1147 1174 1140 1061 1021
2678 1021 1061 1120 1127 1092 1077 1099 1113 1088 1055 1051 1062 1049 1013 994 1008 1023 1008 979 960 946 928 924 951 977 953 897 872 903 940 940 914 890 863 834 834 883 940
2673 940 952 923 896 891 897 905 918 919 892 864 883 943 979 940 851 780 771 813 864 882 859 823 807 807 794 764 740 743 759 768 770 781 799 803 780 744 724 732 754 772
2668 772 785 794 783 739 691 686 722 737 696 646 657 722 780 791 774 757 742 724 708 691 668 650 666 718 770 786 764 723 678 643 631 640 656 662 653 625 576
2664 576 526 505 526 562 585 589 598 631 692 752 775 752 716 706 717 710 671 632 625 645 673 698 718 724 710 684 660 654 681 743 805 811 749 668 630 648 684 696
2659 696 666 614 581 591 618 621 599 602 655 710 710 666 636 644 655 640 613 604 615 626 631 647 690 748 783 769 727 710 736 762 733 659 609 630 691 722 697 657
2655 657 652 680 690 647 579 548 577 625 636 604 578 595 640 662 634 587 578 627 690 709 671 612 572 562 563 557 544 542 566 604 617 587 543 527 533 530 521 548 616
2650F16N8%m8n0k7oNJk6n0l2K2O0N1K2Olk7n1m2%M0M7J7j1jM1N9J6m6o1k3J8K5J5Lj5l1k1
2645E51kj2n0o5k1L7N9M4L2K3Pj0j7j4j0KK2J7j8m0j7J3jl9l2K4O5N0J3qj3j9k0ML6M1J6k
2640F46J6N7O0J1m4m2nkm8o5j2M7L4j6j5M6P8L2l4n4l6k6k2ML8L5j5n7l6L1P2M4j8m4k6mm
2636F26JK8M5K8KRK9J7j1j3J8L6J9j0l4n3n6j6M0N0jm4k2L4N7L0rk6k1mMpl1m1l3k6k9k3J1
2631E74M5N0K6KpoLJ8K7J3j0k2j8oNJ0J1J8L2L9J6k9n1k0L6O5N2J9kkJ0J1j7o3q7o5oM3M7
2626G61J4k5l2j0J1Jj6j1QOj7j6K0M4K4j0j3Lll0m9m6l3lM5P7N8Ok3k6l0m2l3oLj4k1kOj9
2622E57l8qM7O6L2pj3NJ8Nj9l1j8OJ4Komlj0j8j5mOJ5K1J7Jj4j7r%N%j6l3k9jK4K6J4PPLK
2616E87J3J7ol8m1pK2J3j0j5j2k7n5n9l0LRKRK6L3K7J3jpMK7K9Lk1nK7K2j8l5pJ5lk9k1Kj
$$ plain form
2650 616 674 674 626 576 549 543 548 549 523 473 441 463 523 574 596 602 599 572 521 479 479 519 566 583 572 571 612 671 687 641 580 557 575 600 615 618 603 572 551
2645 551 549 537 487 422 401 438 497 541 573 596 603 593 576 562 552 554 576 593 575 535 518 531 530 491 459 483 548 598 611 603 590 571 551 555 591 632 648 646
2640 646 662 719 779 790 746 704 699 697 649 584 572 619 653 637 622 668 746 778 744 690 654 628 606 610 648 683 668 611 575 606 678 722 704 660 634 630 626
2636 626 627 655 700 728 730 739 768 785 774 761 779 815 834 824 790 737 681 665 705 755 754 710 688 722 779 809 800 774 753 749 753 746 715 674 641 615 586 563 574
2631 574 619 669 695 697 690 684 687 705 732 745 735 713 695 689 694 704 715 733 765 804 820 791 740 720 756 821 873 892 890 888 898 909 892 829 742 677 671 714 761
2626 761 775 750 718 708 719 720 704 693 701 707 690 674 694 738 762 752 739 742 739 709 660 614 581 578 623 700 758 764 741 715 685 643 610 604 607 593 572 570 576 557
2622 557 519 511 558 624 656 649 636 641 659 664 645 614 596 602 616 618 612 608 605 595 577 562 558 564 579 600 617 618 604 587 578 578 583 583 567 534 505 504 528 554 568 575 582 585 587
2616 587 600 617 611 573 532 525 547 560 550 535 523 496 441 382 352 355 364 366 375 401 434 461 474 473 466 470 497 526 529 508 503 530 552 534 499 492 507 504 475 454 456 455
2611D55j6kL8N1J9k3m0l5j0K3L4Pk2kM7N1Jk8OM5K3k8n1m1m0m3k0K1L9L9M4M3Ql9l3K0M0m
2606E77m4k3K2K3j1k3j2k0n0n2j3L0M5L9K2j1m0k3L7P1L8k3l7JL0K0qk7l5l1pK5K9Jk4j3Q
2602D91Jl0m1j5K5L9K0j2k1KL1L0ll0k0PJ5kk7m0m1l0mK0K8K0J6J7J6RK%kqj1j2q%J0J3QJ3
2597D76L9N3K6k5m4j8Orm1l8jK2jm1l8J5O9O7K3nRJ5k2o7n1PK2k8o9l0M8Q2M9Lj2mJmj1j3
2592D60nJ0K2J3j4l4k6QN0O9M7om2l9oJ6K0J7J6J4Omj5k7k9j8j0j9l1j6K8N8L7j9n4l9KK1
2587D61J3RK3L1Rl0m4k3KJ5K1J9Mj1kJ8Rk4l5%L1Rl4m1j0J8K4K3J7ql6l7j8j4j8ON5P1K8k4
2582E07l2pOrk7l0j7J4N3P5N6Pl4m8l2pMj3m4n5l2%QmoJ2M1O3O0J9l3m8qM9O2K6rpJ6K3Jl3
2577E67n2m9k3MOj4k7kM5O9L7k9p4n5J1O0N3Pj6QM2K8k7o3n0j3JjJ0L3L7K1J2J0qm0m0OL7
$$ plain form
2611 455 439 437 475 526 545 522 482 447 437 460 494 501 479 477 524 575 576 548 554 599 622 594 543 502 462 419 399 420 459 498 542 585 593 554 521 541 581 577
2606 577 533 510 532 555 544 521 509 489 439 387 374 404 449 488 510 499 459 436 473 544 582 559 522 523 553 573 565 538 503 472 465 490 519 520 496 483 491
2602 491 492 462 421 406 431 470 490 478 457 459 490 520 517 487 467 474 489 487 460 420 379 349 345 365 393 413 429 446 462 471 473 473 471 463 452 440 432 432 442 455 463 476
2597 476 515 568 594 569 525 507 513 504 463 425 424 446 445 404 366 381 450 517 540 535 544 559 537 470 419 426 448 420 351 321 369 451 500 503 491 487 488 484 473 460
2592 460 455 465 487 500 486 452 426 434 484 553 600 594 552 513 507 523 543 560 576 590 596 592 577 550 521 503 493 474 443 427 455 513 550 531 477 438 440 461
2587 461 474 483 506 537 546 516 472 449 451 466 487 506 510 499 497 515 524 500 465 465 496 505 471 430 420 438 462 485 502 494 458 421 403 389 371 377 432 503 531 507
2582 507 475 468 474 465 438 408 391 405 458 533 589 596 562 514 482 475 479 466 422 367 335 335 343 339 333 345 386 449 509 528 495 447 439 488 550 576 567 560 576 599 600 567
2577 567 515 466 443 447 453 439 412 410 455 524 561 532 458 403 414 474 527 534 518 526 568 596 569 506 456 443 444 443 453 486 523 544 556 566 558 518 478 484 521
2572E21Mn9p6k9K4L2J3MK0M1L7Kl2l1OK5jl2l0j1k0l8j9L2N5L5RKnk2j7RJ6qk2nJ1jj1J1K9
2567D69J6olMj6k8KM1K6k4l8KM0L5J3Nmk2l2k0%J2J0Omj3j5j2j2j0lNJ2K6M7M2kn1n2j2J4
2562D48NqJR%j3pJ7L9M0J7j9l7k6j0j0rJ8M7L2j6m0k4j3k6k4J2L9K5NJ3K6J0j1kPk9q4p8l
2557C21O0O2L7L6M5K2j8k8mJ0j1k9j2J5J1j0qJ1Pk7l9j1Rj2l0rJ1k2o7m2L7P3K8k3j5K4L8
2553D40K3%k2l7k5OK3RkLjj7j3J9K5j2l2ML9J6k6j2M5P3O2M5J9m0r2p0jL0Jk0mOj2j0K0K1
2548D81k7o4m5j3j1nM3Q7O9J5rKnl6m8k5JJ2J6J2rk7j0K3K6mk5k3k6m0k8K3O5N7J9mk%qj1
2543D46oLJ6L0L2J1j9m0m5l2PN6P3L1l3n6l1oj1j9%K4K6J3QJk0l8j4L8O2L4oj7onk2l6k8%
2538D21L4M3J1l3m4qK6K1%mKj3l6l2%J5nk1kL1M2L1K2L0M1L9J1l2n3l5lLj7k2KJ3j4m8m0K
$$ plain form
2572 521 525 466 390 361 385 417 430 434 454 495 532 534 502 471 477 502 501 469 439 428 408 370 351 383 438 473 482 484 479 457 440 449 465 457 435 430 441 440 429 440 469
2567 469 485 479 476 480 464 436 438 479 505 481 443 445 485 520 533 538 534 512 480 460 460 472 482 488 484 471 456 444 432 422 419 424 436 462 509 551 549 498 446 434 448
2562 448 453 445 446 455 455 442 435 452 491 531 548 529 492 466 456 446 437 455 502 534 518 478 454 441 415 391 403 442 467 472 485 511 521 510 508 515 486 402 324 321
2557 321 381 443 480 516 561 583 565 537 533 543 532 503 491 506 517 507 499 510 517 490 451 440 449 437 407 398 409 387 320 278 315 388 416 393 378 402 440
2553 440 463 463 441 404 379 385 408 417 415 418 417 400 387 406 431 419 387 391 430 446 420 408 453 526 588 633 652 612 520 450 449 479 480 460 456 462 450 440 460 481
2548 481 454 390 345 332 321 316 359 446 515 530 521 523 518 482 434 409 410 422 438 450 441 414 404 427 453 449 424 401 375 335 307 330 395 452 471 467 465 465 457 446
2543 446 440 443 459 489 521 532 513 473 428 396 403 459 532 563 530 474 443 437 426 407 407 431 457 470 478 479 459 421 407 445 507 541 535 518 512 507 485 449 421 421
2538 421 455 498 509 476 432 424 450 471 471 467 469 456 420 388 388 403 398 377 375 406 448 479 501 531 572 611 622 590 537 502 499 502 485 463 465 478 464 416 376 378
2533C78M5O2N3K5opJ7K8nl7k3J9K7pk5oQj4l7j5K7M1J3j8k9k7j5PK7K0k0n4n3k0MNjJ3M2N2
2528D94K3l0p0o8l0J9N7P2N8J8k2l3j4jj2k5j0K5M8M3L1K1mm6o7l8J4L1Mk1j1J3J7QJlk0l4
2524D38k0J1K3Oj6k4k4k4j3J7M6M9K6OJlk0l4j8K5N0K8j0j3K2N0L6nl4l2j1J5L0K1nk2j1N
2519E66ol5m1j6PJj1%K3K2nj7J0L9L7Mk1k3j0KJ5J7nl2l4pJ4Lj6j3Jmk0j8J2M2N3L8%n1p7
2514D44n5j0J1RK2N0M8Lk9j4%k6m7j4L9L5j5k8J9N6L0j6k3KJ1j1k5j5J0K3J4j3m3n0k3K1N0
2510D40M7K1nmJ2J7Jk0k3k0k5l0j1J5K5K0L0M9L8nl0j1K3K8J3RJ4Rnj3j1j5k6k4j1MJ7K9K4
2505E96rm2l4J0M3K5j7l8k3ppj3kJ5J9J3K0L0J4l2o0l2J6K5j5m6l1RL3L2J5lj0QL6L5j1o1
2500E01o2k2J7K9K5K0J4RJj5l7m7k7J0L6L7J4j9l6j2L0M1J1qJ6L8Nn0n1jK5lk6jM0M6K2Ko
$$ plain form
2533 378 423 485 538 563 557 550 567 595 590 553 530 549 576 569 544 538 546 532 495 480 507 548 561 543 514 487 472 479 506 526 506 452 399 379 383 388 387 400 442 494
2528 494 517 487 417 349 319 338 395 467 525 543 521 488 474 473 461 436 426 451 499 542 573 594 590 544 477 439 453 484 488 467 456 469 486 494 495 492 472 438
2524 438 418 429 452 458 442 418 394 370 357 374 420 469 495 501 502 499 479 445 427 452 502 530 520 507 529 579 615 610 576 544 533 548 578 599 594 572 561 566
2519 566 560 525 484 468 475 476 465 465 488 510 505 488 498 537 574 578 557 534 524 526 541 558 553 521 487 480 494 497 481 468 469 465 445 427 439 481 534 572 572 521 444
2514 444 389 379 390 399 421 471 519 522 493 479 479 453 406 392 431 466 451 423 442 498 528 512 489 491 502 491 466 451 461 484 498 485 442 392 369 390 440
2510 440 487 508 503 499 511 528 529 509 486 466 441 411 400 415 440 460 490 539 577 572 542 531 554 582 595 604 618 627 622 609 598 583 557 533 522 526 543 572 596
2505 596 587 545 511 521 564 589 572 534 511 504 497 484 482 497 516 529 549 579 593 561 501 469 485 510 495 449 418 427 460 492 507 504 494 502 538 573 562 501
2500 501 439 417 434 463 488 508 522 531 532 517 480 433 406 416 452 489 503 484 448 436 466 507 518 510 526 564 569 519 468 467 492 489 463 462 502 548 570 572 566
2495E66j5j6kMj1k8j5K1M3L7J3j5l2k2NQl1o2m0J3L4RoJ8L9K5j0k9k9k8j5K7P1P5L0k0l9l7
2491E36l7l7j7J5L3J8j4l2k4qkJJ9M1L6om1l4LK2J2%NLk2m0j5L9O8N3J8rk2k4j6nj0j8mL0
2486E15M7K3j8m1m3l4j6J1L3K7%k1k3j7j2pkjKJ8L4K4k0o6p0k5L3N5L0j1k1LK6J6ooJ1J7M
2481D69j4j7kK8M9K9l1p0l8K7N6L1NQJ3KmRJ4j3l9k6LPj6k8j4ORJpj4j7r%MKMOJ5L2N2M9K7
2476E98J4J9J0l0n4l5qk9o8n3J6N2J7k6j1K9K6j1k0J5M3K8pj7J4N3O3L1j7l8k6j3l2n9n0L
2471D27N8O7L1j0k6k1j4pRK7K5rl6k1K1L6J5lQRk0l8JN9O9K6nKjl5n4j6L5L1k3n9m2oNrk9
2466D77l5j6K2N0L8mk8j7jJMK6M3L3Nj0j0j7k7k3kRLpnLJ5K8K5om8n7k0K3K5jj6kJ6J6Jk1
2461D90l6k8J1N6O3K1k7l7j6lj5k8k5j5j1nPRnjL8P3M0l5o2j1M0K5j2LM2K6l9n7j1J7k4o5
$$ plain form
2495 566 551 535 533 537 526 498 483 504 547 584 597 582 550 528 533 541 510 448 408 421 455 464 458 476 515 540 530 501 472 444 429 456 527 602 632 612 573 536
2491 536 499 462 445 460 493 511 497 465 441 433 431 432 451 492 528 522 481 447 450 472 484 484 489 492 470 430 415 454 522 575 593 584 562 538 522 517 507 489 485 515
2486 515 562 585 567 526 483 449 433 444 477 504 504 483 460 443 431 424 422 421 423 441 475 499 479 413 343 318 351 406 436 425 404 407 433 449 443 437 448 465 469
2481 469 455 438 436 464 513 542 511 441 403 430 486 517 522 530 543 545 541 550 564 551 512 486 489 496 480 452 438 444 453 454 447 433 416 407 407 411 413 417 423 438 470 522 571 598
2476 598 612 631 641 611 557 522 514 485 417 364 380 432 449 423 412 441 467 456 436 451 494 522 515 498 512 565 628 659 642 604 578 565 533 474 424 427
2471 427 485 552 583 573 547 526 512 505 514 541 566 557 521 500 521 557 572 569 577 586 566 528 529 588 657 683 678 680 679 644 590 574 609 640 617 558 516 510 515 506 477
2466 477 442 426 448 498 536 532 504 487 486 487 491 517 560 593 598 588 578 561 534 511 509 518 521 514 509 512 527 555 580 574 526 469 449 472 497 496 480 478 494 510 511 490
2461 490 454 426 437 493 556 577 550 513 497 494 479 451 426 411 400 395 402 411 406 405 443 516 556 521 459 448 488 513 501 504 546 572 533 476 465 482 458 393
2456C93l5K7M1Nj6KK1J9P%MK0M2M5K0llmk8m5j4K9L5J2M%l6o3k0O0O6j4p1l5J3nm9l5K4M4
2452D57J9PK8L9J5k1m3m4k1J4L4K7J5J8K2LqQK0nl3j1K9J4m8p5l7QK1L3O5P3K0m5o3m2k4j9
2447D50mJ7K5K3K2J7lj3RL3J2l8n6k7QJ8J2QLn%J1Pj3j7MJ8Kj5KK9K2j7l9k0J6L7M4M3K7j5
2442F37o2q1n1J1N9N1j2o4m8K1O4L8j3j6K4M3J5k5k8pLj3k8k8j2MPkj0lJ5J8LoRL1L5J7jj
2437E94O%k5n2m6lL5K6j9m4k4J1K6K5K4J6jrNJ5nl5l9k2lJ7M5M7Lm3k6K5L2j7n3l9j2lJ5N5
2432E02N9jo0m5J8M2J7jJ2K7J9Mqk0k8j8j4k8l5ON4M1k8o0j0M6L2j8l0kJ1rj7LK1J6NMMLK0
2427E34N3N9J3m4m0K2P0M3k1m4j2K3Ol7n0j3K8K7oj4J7L9Lo0o5RP4M2n1r4m9J3J9nqMpj8J1
2422D71N9O1Nm4l6KK6L0L1J7j7m7m8k9j8j7nJ1J2mj6JL3N8N1K5Jnqk6m6l1J0L2J8OK4L8J0
$$ plain form
2456 393 358 385 426 431 415 417 438 457 464 464 468 488 530 575 595 592 589 585 557 512 498 527 562 574 578 578 542 479 459 519 585 571 500 465 478 473 424 389 413 457
2452 457 476 483 511 550 565 544 501 457 436 450 484 511 526 544 566 569 561 569 589 584 551 540 569 583 535 460 423 431 452 485 550 623 643 598 535 493 469 450
2447 450 446 463 488 511 533 550 547 534 543 576 588 550 494 467 475 493 505 513 516 511 511 522 529 516 499 503 521 523 508 510 539 561 544 505 485 501 538 582 625 652 637
2442 637 575 494 443 454 513 564 552 488 440 461 525 563 550 534 558 601 616 591 563 556 559 546 518 490 478 482 489 487 477 474 489 507 510 504 513 544 579 596 595 594
2437 594 600 600 575 523 477 474 509 535 516 472 448 459 485 510 534 550 549 540 545 560 555 520 481 459 456 473 518 565 568 525 499 524 556 539 486 447 435 432 447 502
2432 502 561 560 500 455 473 515 532 531 543 570 589 593 585 565 537 519 505 477 442 448 502 543 515 455 445 491 523 505 475 473 484 475 458 461 482 498 503 507 511 514 534
2427 534 587 646 659 615 575 597 667 710 689 645 633 656 662 625 575 562 590 617 611 597 614 653 656 596 531 540 614 656 605 511 462 475 494 489 481 485 478 460 471
2422 471 530 591 596 552 516 518 544 574 605 622 605 558 510 481 463 446 441 452 464 460 444 445 478 536 587 612 613 608 600 574 528 497 507 539 557 563 587 625 635
2418F35l1k7J4L4Pk7l0j6j3k0j8j1mNJ8K0J0RL2N3L3j8n6m8j6%j3k1J4O9Q2L0m4p6o3m1k0
2413D52J0L7K2k2l6MM9M7K0J0Nj9l2%M2L1k1m1j6jk2k8kJ3pj0K7M4ro6m0M6Q8O5L1J1k2o5
2408E95o8k6Mm%L1L4j7n0qO2O4Qk8j4Kj0k6j7NJ3J5J2ml6n2l3OK6J9Jrj4j7j1OJ9Pj9k0K1
2403D67N6L0k8l6L0Q6N9k1n9k9J7L4K2%k4l7k5KJ7K1K3K2kk6k2MJ1jKJ5km0l6K5O2K0m1l6
2399E60J4K1k6m7qL4K0k0k7PL1J9j2l0j9LK3K8K8K6J7pm1o2m7kL4K6j6m0j5K4L2Mk2k5k0k
2394D63L9Q3Q0K1l1m1l8n0m8LN6N3J0qKol6l5QL4J6rrrk6k5MK2nk4J2O4N9km6l5pLRK8M4L4
2389F57J0rk7l9l5nK9K9kl2k9%K8L1J2j4l3l5k2j0j4k6j6K7O0M4%k0lPrj6J6M8L7%qJ2J2k0
2384F35m4l7l0l4k3J4L5J0k7k5OK0NnLLk0k4J7O5N5j0n9m0J7M1J4k2k1LJ4rl5l4kK9M0K7J0
$$ plain form
2418 635 604 577 591 625 632 605 575 559 546 526 508 497 493 498 516 536 546 555 587 640 673 655 599 551 535 535 522 501 515 584 666 696 652 576 513 472 452
2413 452 462 499 521 499 463 467 516 563 583 593 598 579 547 547 589 620 599 558 542 541 519 491 489 502 495 485 512 556 547 481 441 487 575 640 671 682 660 595
2408 595 527 501 505 501 501 532 566 549 499 491 553 617 625 597 583 585 575 549 532 537 550 565 577 573 537 485 452 458 484 503 504 495 481 464 453 459 478 485 466 446 467
2403 467 523 553 525 489 519 605 664 643 584 555 572 606 628 628 604 567 542 544 561 582 605 627 625 599 577 581 592 591 593 608 606 566 530 555 617 637 596 560
2399 560 574 595 569 522 514 548 568 548 521 528 559 578 566 536 517 520 543 571 599 625 642 635 594 532 485 483 517 543 527 487 472 496 528 532 510 485 465 463
2394 463 502 585 665 686 655 614 576 526 478 481 537 590 600 592 594 588 552 517 525 559 575 566 557 548 522 497 501 523 518 494 506 570 629 627 581 546 539 542 551 579 623 657
2389 657 667 658 631 592 557 552 581 610 608 576 547 547 575 606 618 604 571 536 514 504 490 464 448 475 535 579 579 559 556 563 554 538 554 602 639 639 631 643 655 635
2384 635 591 554 524 490 467 481 516 526 499 474 480 500 505 500 503 506 486 462 479 544 599 589 530 490 507 548 562 540 519 522 536 527 492 458 456 485 525 552 562
2379E62%%J6M5O2M5Jl4l2j5j3k0j2Nml8n2j7L0L8J3JPKk2l2j9lnnJ5L9M4K4%j6k0rPJ6RLR
2374F25J5jk4k0K1N6M6om9n2k7%J3K0K4J8Jj4j7j2JJ7L1J7k2m9l2J3L7K2pj7rPK0K6J1j0k2
2369F51k1k8m4l1J8O4N7J1l0m0l3k2LL3M2K3KjJJjJpk5l6k4lPRJ7K0PrlJ6Rk0k3K2O7N1pl9
2364F85k7j5l4m5j3L1K8j6l8rK6L0Rj1k2j7J2N4O9L7j0l5l5l5l2qK3L2K2J7K5J1k9o0n4k6
2360E40p%J1K5K5RmJQ%k8m5j9L4N7J8m1m9j1Rj8m3k5MNoJ2M7M3ll5j8K0L8K9Ok0k5PM5L1l4
2354E93o9k7M5O8L8J0Pjj5j3J0Rk6n2l2J0K3J0MJ1Lk3k8%K5J6mkJ3Mk8l8mM2N3J7k8m9l4K
2350E40K9K5pk8j9kok1k2qlqML3L3j0m8m2mK2K5K6K5J8J7L0L4Ml2k5J2K7QjJ3Nl9o9m0J4K6
2345E36KrJ0K9K2NlllKLj0k8l4j2K8O3O0J5m0n4j2L8M4Ml4m0j2K4L4Ok7j9K7M7Rl7l4j1k5
$$ plain form
2379 562 562 562 578 623 685 730 731 697 665 650 637 617 605 610 606 568 516 499 529 567 580 581 588 590 568 536 517 514 509 504 519 558 602 626 626 610 590 581 588 604 613 616 625
2374 625 640 639 615 595 616 672 718 712 663 611 584 584 597 617 641 659 660 646 629 617 618 635 666 683 661 612 580 593 630 652 645 628 619 626 646 672 683 673 651
2369 651 630 602 558 527 545 609 666 677 647 607 574 552 555 588 630 653 655 654 655 656 655 656 649 624 588 564 561 568 577 594 614 621 612 609 625 634 614 591 613 680 731 724 685
2364 685 658 643 609 564 551 582 610 594 556 547 573 603 612 601 579 562 574 628 697 734 724 689 654 619 587 579 602 634 656 673 698 709 680 620 566 540
2360 540 533 533 544 569 594 603 599 600 608 608 580 535 516 550 607 625 584 535 524 533 515 472 447 451 456 450 462 509 552 549 514 496 516 554 583 589 569 544 551 596 627 593
2354 593 524 497 542 610 648 658 665 664 649 636 646 655 629 577 545 555 578 588 592 603 606 583 555 555 580 596 592 590 603 607 579 541 537 579 632 649 621 572 538 540
2350 540 569 594 587 559 540 538 532 511 489 481 478 470 474 507 540 530 482 440 436 458 483 509 534 552 569 599 633 637 605 580 592 619 627 626 639 644 605 536 496 510 536
2345 536 538 529 539 568 590 595 592 589 586 588 591 581 553 519 507 535 598 658 673 633 579 567 605 649 653 619 579 567 591 625 631 604 585 612 659 668 631 597 586 561
2340E61o0m9KK9RoONk4l1J5N3L3j0j4OQJ0M6Q3N5k1n4j5L0K0k1m0k2QK4J6j0k8k1kJ1K1L5
2335F58L4jl8l1NRk9n0j9K7M7M1K3ol1j9K5L2j9n8k9K1Ko4q2k4L7M6L4M6N4K0l0l7JL5K6o
2330F50j9JK7K0j0k6rJ4%k9l1KJ7%qK2L7mn7l9L4O8J9m1l9LK4J6J7K1%l7m4j3Nj1j8J4L6Q
2325F20l9l2K2N0K7MJ2J2k6o2m3RL6L1K0Pk4n6m6PM1K1j9l3j8okLRKj1j2%J2K6L9L5nn8p2
2321D81l0L2O4O1M3K9K1J3Kj8l5l1j0Kj2k2LL5K4k3l5J1N0J3o0p9l1J2J6K2N2O5K6k6l7k6
2316F02l3l5RO6N3k1n0J1P5M7l0n3pK7Jm3m5rK5L5K1j1l6l0JK5J2j1rRJ7J0QJ9K4J0omRK2
2311G05L1L0%n8r5n8K7P5M7mj4Mpm1m9j6Pkj0J0L6L0MmJ3L0L0Ol1n3k6L3M7j4p8n8K7P0L2
2306F76k2k8pnj4mJ8J5nqJ2K5K0J0PKj1j4KJ8J0j3k7k4rJL%qj1qjnj5j6MK2J4nNL4K6l1p0
$$ plain form
2340 561 501 452 454 483 492 486 492 497 473 442 457 510 543 533 519 525 533 543 589 672 727 706 652 637 667 687 666 626 604 612 636 652 642 614 593 591 602 623 658
2335 658 692 691 653 622 627 636 607 557 538 565 612 653 676 670 639 620 645 677 658 600 571 592 594 530 448 424 461 507 541 587 641 661 631 594 595 630 656 650
2330 650 631 632 659 679 669 643 634 648 648 619 588 590 607 607 599 621 658 654 597 558 592 660 679 638 599 602 626 642 659 680 680 643 599 586 591 580 562 576 612 620
2325 620 581 549 571 621 648 652 664 676 650 588 545 554 590 621 641 648 624 568 522 529 570 591 572 539 521 515 513 516 525 527 516 504 504 516 542 581 616 611 553 481
2321 481 451 483 547 608 651 680 701 714 716 698 663 632 622 624 612 590 593 628 652 629 594 605 655 668 608 529 498 510 526 548 600 665 691 665 628 602
2316 602 569 534 543 609 662 641 591 602 677 724 694 641 634 661 662 619 574 565 590 625 646 635 599 569 570 595 607 596 587 596 613 623 631 650 674 684 678 674 683 705
2311 705 736 766 766 708 613 555 582 657 704 700 686 690 683 642 593 577 584 582 572 582 618 648 652 648 661 691 721 727 696 643 617 650 697 683 605 547 574 644 676
2306 676 654 626 619 614 600 596 614 629 624 616 628 653 673 683 690 692 681 667 669 687 697 684 657 633 624 625 628 628 620 609 601 600 595 580 564 568 590 604 599 604 638 664 633 563
2301E63l4L4M5rm3j4K5J8j2j4MJ2J3K9M0K0j5j4J5K8J0pqj6l9m4j3K0K4RJJJMJ1Jl0m3j2M1
2296F02O1L0j9m4l6rJ5K0RKJ0J9Qj0j2OJ6ml3l3QN1M9Jm4m3lK2Nk3k2jR%pLK0K0RLJ3K2J6
2291G06pk6k3%J7J0j1j9rQJ9K4L1L7L3J3j9n1o1m0qNrk7k6mJ0NokJ3J7ORL3N5M1PpPJ9Mk5
2286G49m6o2p6p3l8J8N7N7J7l2n1k4J3J3j5j2M1P4L0m5n6MN1L9J7K5L9J5k8l8j2Nmj6j5j5
2281F06k6l5j6J9M3M1K5Oj6m4n9l1K8O2L3k3m3j5J5J7J0J4K3K3J5Jj5k6j7LQoj3%J4J4K2M4
2277G01M7J0l3l6JK8J8nk4k8j8J0K8J6j9l5k4j0j2j6oOLj1j0J7N4P0M8Ok4l3l6m3m3j9PJ0
2272E95rj3J4M2M8L0J1NJ1J9J2pj7j0MOMJ1J1rl2k2J7L7Om0n3k4J0J5rl6l2JL1K5pl2k5%K4
2267F12L1J2j9k4K0O9O9K2qOJ7j2n8p1n7l6nM3P2N1NlL2M9J4k5k1J2J3k4n1l0PJ5oj3Jmm5
$$ plain form
2301 563 529 563 608 599 556 542 567 585 573 559 563 575 588 617 657 677 662 648 663 691 701 694 686 670 631 587 574 594 618 627 628 629 630 634 645 646 616 573 561 602
2296 602 663 693 674 630 594 585 600 620 629 631 641 660 668 658 646 652 668 664 631 598 606 657 706 707 663 620 617 639 644 621 599 598 607 607 600 603 623 643 652 655 668 690 706
2291 706 699 673 650 650 667 677 666 647 638 646 665 689 720 757 790 803 784 733 672 632 624 629 620 593 567 563 573 578 572 570 583 600 606 615 648 703 744 751 744 751 770 774 749
2286 749 703 641 565 492 454 472 529 586 603 571 520 496 509 522 507 495 536 610 640 595 539 543 594 633 650 675 714 729 701 663 651 656 652 636 621 606
2281 606 580 545 529 548 591 632 657 663 647 603 544 513 541 603 636 613 570 555 570 587 597 611 634 657 672 673 658 632 615 618 626 620 607 607 621 635 657 701
2277 701 748 758 725 689 690 718 736 731 707 679 661 671 699 715 696 661 637 627 615 599 593 599 602 591 581 598 652 722 770 776 752 719 683 640 597 578 585 595
2272 595 586 573 587 629 677 707 718 723 734 753 765 758 741 731 735 741 745 756 767 758 726 704 721 758 764 724 671 647 657 672 663 627 595 596 627 652 645 613 588 588 612
2267 612 643 655 636 612 632 701 770 792 784 790 807 795 737 666 609 573 568 611 683 734 739 736 768 817 831 806 785 797 810 786 735 705 712 727 721 708 709 705 660
2262F60p2m1J7L5RnJ7K8Mj7MM4M6J3k4l9l1lL2M1K3OKk0o7q5k8M7O4K6JNol7m0nJ4nj1L0O5
2257F97M2rk1%Rj0j8jJ4Lj8k8k7k4j9lK8O0N7J5k6j5L1M9Mn2n2lK9J3k1k9qJ3J2j%J4J8ll2
2252F88l0lPk1m4j3N3Q5M7k0m9k7J0K0PKJ5L0K0ok3j5%QRJ3J9J8Lj9l7l5j2K1M1L2Nk3l5k4
2247G17JK2K4J2Jj1k6l3k2kkj6j7kJ0J4J9K5K1J6K2K6jm5m8jL4J3l6n4l2J1N4Q3P2K0k6l2
2243H11k4l5m5k4QJ1qj1J0J6nl0l8l0j2KklL7J06J15J3j03j10j3M8Po1o2j0L2L7K3PLJ1J8
2238F89OoRK8Pl9l9OJ5l7o3nO7O1Jj8J1K5Nj3j5k3l6k2J0J5onL3N9M6J7N%k2m7m6j4K4L8K0
2233G41j5l0rJ7J4j2k3j1LJ0K2K9Pl3l9NM1K1l1n4k4K7O1O1K3k5m6k6Knl3m3k1OJ6J7J6Nk0
2228F44l8k8NL2L0J0pjK3M4M1J4j8l2k3KK4L3J9j1l4k3J0L1J6j4k3j2qj8k5k2k3k0PL8L3j4
$$ plain form
2262 660 588 547 564 599 608 603 620 648 652 635 639 683 729 742 718 679 648 645 677 718 741 747 749 729 662 577 549 596 660 686 687 692 686 649 609 604 618 613 602 632 697
2257 697 739 730 709 709 718 708 690 689 703 706 688 660 633 609 590 587 615 675 732 747 721 706 737 786 790 738 686 683 712 725 704 675 667 680 692 691 691 705 723 720 688
2252 688 658 655 662 641 597 584 637 722 769 749 700 673 683 703 710 712 727 757 777 771 748 733 733 741 750 763 782 800 803 784 747 712 700 721 762 794 799 776 741 717
2247 717 718 740 764 776 777 766 740 707 685 683 681 665 648 646 656 670 689 714 735 751 773 799 798 753 705 704 738 751 715 661 629 640 694 777 849 869 843 811
2243 811 787 752 707 683 691 702 694 683 693 709 704 674 636 606 594 596 594 591 628 734 849 862 759 649 636 684 691 630 568 558 590 627 650 657 660 671 689
2238 689 695 689 698 726 733 694 655 661 676 639 576 571 638 699 700 682 693 718 723 710 695 672 636 614 624 639 633 628 661 720 766 783 788 788 766 719 673 659 683 721 741
2233 741 726 696 687 704 718 706 683 672 675 685 707 736 743 710 671 676 717 738 707 653 629 656 717 778 801 776 730 704 706 701 668 625 604 610 626 643 659 664 644
2228 644 606 578 583 615 645 655 648 647 670 714 755 769 751 719 696 698 722 755 774 763 729 706 716 747 763 749 726 714 706 688 663 641 618 598 605 643 676 662
2224F62m1j0L8M9L3L1L1%m8n3j4J2OKK1L4J9J3K6J0n5j03o3L3Q3N3RLJ3Mqllk6l3QO0M8k7
2219H14p7m8OPk9k8J8M5J7j7j5NPOK2K4j4m8j6N1O7K0k4k7k0k9j8K0L1j0n0l6mql0j4K6M0
2214F64K0QJ8J9jpPJ0j3k9j6mj9m3m0j3PJj5j8MM0O8O4L4QPJ2Kj7j6J2L4K6ol3l3j4J6M1M5
2209H30J6k6l8rK2Ol6m5mL6L7J2qj7k1j1MMrLL7M4Jm0k8RJ1j3j6mj3k5JM1L7j3l5nK5J6JJ2
2204G89J7nk8l0l5m8l1L3P6L8l5o2l1RK4K3J0j5k8pK2J6qj0J7L4K1rl1l4nL8N7L3MPK5J7o
2199H52kK8L8J3j9m1n0m6k4pj5k3LL5K0k6l3LJ6j6l1NM0K2j0%L5M4K6J9J6j1n1o0l6qKOKj3
2194G03j9mJ4%k8k4PJ3k0l6kM5M7Ok5k3rplRJ7J0ljJ1Rnj4JJ4Mj8j6J5M3L8J4%MJ5K0Nk0l3
2189G54j2K0K7PmLml0l7mK4Qk5k3MRonK2L8K6Oqk5l8k2J0Nm1o2j7N0O2J6l1m1j9J0L2L1Jm8
$$ plain form
2224 662 621 611 649 698 731 762 793 793 745 692 678 690 696 698 719 753 772 785 811 821 766 663 600 633 716 769 778 781 794 798 790 787 784 758 725 733 793 841 814
2219 814 737 689 695 702 673 645 663 708 725 708 693 698 705 711 733 757 743 695 679 730 797 817 793 766 746 717 699 719 750 740 690 654 650 642 612 598 624 664
2214 664 684 692 710 729 728 721 728 738 725 696 680 676 657 614 574 561 568 569 554 536 540 580 648 712 746 754 761 773 775 758 742 754 788 814 808 775 742 728 744 785 830
2209 830 846 820 782 773 795 801 765 720 716 752 789 801 793 776 755 744 748 752 743 746 783 827 828 788 760 769 780 767 751 747 734 709 710 751 788 775 740 735 760 776 777 789
2204 789 806 801 773 743 708 660 629 662 738 776 741 679 648 657 681 704 714 699 671 664 686 702 694 684 701 735 756 747 716 682 677 715 772 805 809 816 841 858 852
2199 852 850 878 916 929 910 869 819 773 749 742 727 704 707 742 762 736 703 706 722 706 675 680 720 742 732 732 767 811 837 856 872 861 810 750 714 706 708 714 716 703
2194 703 684 680 694 694 666 642 649 662 642 606 604 649 696 702 677 654 645 638 635 644 661 671 668 667 678 687 682 668 669 683 687 669 653 668 711 749 763 763 767 782 802 807 787 754
2189 754 742 762 789 796 792 795 791 761 724 720 744 752 727 704 708 717 711 706 728 766 792 798 790 765 727 705 715 720 679 617 600 650 712 728 697 656 637 647 679 710 711 663
2184F63p5o3j9K6M0K5QJ3L6M1J4j7k0J1M9N6K8j2k2KK1ln1o0k3J2Pj0pNJokRPMJ9L5K3ok1
2179G38j5j0kK8O4O4J4l7l7jJ8rn1n6j6K6J4l2m1K0P9O3j3o1m3jK5L4L2J1j5KN2N5k5j08r5
2174F71LO9M9lj5NNk4l6rK9L7Ol0m0k5mPRJ4K4K8J2k2n6n4k0J7K3J1RJ9J5oj9mJ6K0RKNJ1
2169G58J1lk4l5k4onj4lL5N6L7Mj2k0l7n0l2NK4J7J8L2L8J9j6m5n5l7jK9K9J2OJ1Mk6n2l8
2164F10J2O1O2J0m3l7J4L0j9o9m9J5M9M1L5L7J4k3j4L8N4Ol9j8J9mn7o1qK5Rj3mJ1nl4m9m0
2160E66k1NL3M3K8QJ0L3M7K8j8o0o6k5L9Q0N8j1o1l6M1Q1L2m0l6L5O1op7n9J6M2Ll1j6Nlr
2155G19RK1%k8k6okj6j9oNJ1L1N4M8Rk6l3k9l5m4k5J4L1J3j1rQJ1Jnnj6j8K0P7Q9L5k2k3q
2150G94l3p6o3NM1%n7n3jL5K8J1J6L5L9J2l3o0m8j0J5J8J6K2J5j1k0J3O1P3K8l6p3o2j6L0
$$ plain form
2184 663 588 525 506 532 572 597 605 618 654 695 709 692 672 683 732 788 816 804 782 784 805 802 751 691 668 680 687 677 670 675 676 670 668 677 684 688 707 742 765 759 738
2179 738 723 713 711 739 803 867 881 844 807 806 824 815 764 708 692 718 732 700 659 679 758 821 808 747 704 703 728 762 794 805 790 792 844 899 874 766 671
2174 671 674 743 792 789 774 779 784 760 724 715 744 781 787 757 717 692 688 695 704 718 742 770 782 760 704 650 630 647 670 681 690 709 724 718 699 695 711 731 740 742 747 758
2169 758 769 766 742 707 683 677 672 658 655 690 746 783 787 775 755 718 668 636 641 665 682 700 732 770 789 773 728 673 636 635 664 693 705 711 722 726 700 648 610
2164 610 622 683 745 755 712 675 689 719 700 631 582 597 646 687 722 759 773 750 736 774 828 834 795 777 796 792 735 674 666 691 700 687 683 694 689 655 606 566
2160 566 545 550 583 626 654 662 672 705 752 780 762 702 636 611 650 730 788 777 716 680 721 802 834 794 758 793 854 848 771 712 728 770 773 742 726 731 728 719
2155 719 728 749 749 721 695 689 687 671 652 646 651 662 693 747 795 804 778 745 716 681 637 612 626 657 670 659 650 658 669 670 665 660 644 626 646 723 812 847 825 802 794
2150 794 761 685 622 627 668 668 611 558 557 592 620 631 647 682 721 733 700 640 592 582 597 615 631 653 668 657 637 650 711 784 812 776 703 641 625 655
2146F55M8L7K2Oj2k6j1K6K8l1r1p6MN9M2mk3j2j5l5l6JM1M0Pj5KK3J6j0k3j8j9k0%L2L8J6
2141F66PK1K0rl1j2J3PoJQj4l3rK8K2rj0J3Pk1j0L6M5jk7QM2J9k5k6LJ4PKlk2k6KK4Kl5l5
2136F53nNmo%k0n1m0K0O7O1J7j7k3nK1K5nm1m5j8OJ3J2OkLL2N0K6j6j6J7L0nl9l7k3j5KL3
2131F66M3J9rnPj1m3n0k7JJ8J9PoOL5L9Ml2l1j2rqJ1K8J6j7k8j6qmJ4L4J9k0k9OL8K6oj8J
2126F68K4K9J8JlJ3K5Rk4l8k2oj2k6k3pJ1K3K5K0J5J8K0Nj3j8k0l5m9l0J3L5J7olOmj8j3L
2121F28MjNPj2m1m1rK4L7K7J1RK7M2K3j4j6K7N1J6k8j6K6K0m1o9k4M0N8L6J4KnkJ1Ml0n4l8
2116G08j7l0n8m5J3N9N4K1%kkqj1rj4k5k7rJ3J3pj2J8M5L0pk0lnl3m4j4K2K5J5K0K1nl0rM0
2111F71N2Rm4n4j5L8N6J9m7o7j0O9P5Kn7l5K9M8Jn2n4mM9N9L1LKRj3n4o7k9L3O3M1rm6m9l2
$$ plain form
2146 655 703 740 762 768 756 730 719 745 773 742 651 575 579 638 680 676 653 641 626 591 555 556 597 637 644 629 631 654 670 660 637 619 600 580 580 612 650 666
2141 666 673 694 714 705 674 662 675 682 676 677 685 671 638 629 657 679 670 660 673 680 659 649 685 730 729 702 710 752 771 746 720 723 737 744 746 743 721 695 697 721 723 688 653
2136 653 648 653 649 643 643 623 572 532 552 619 680 697 680 657 652 673 698 693 652 607 589 595 608 620 626 624 627 659 709 735 719 703 720 750 745 706 669 646 631 633 666
2131 666 709 728 719 714 721 710 667 617 590 591 609 628 635 629 635 670 709 713 681 650 638 629 621 632 660 676 659 631 615 607 603 617 651 670 650 621 627 665 691 685 667 668
2126 668 692 721 739 740 737 750 775 784 760 722 700 694 682 656 633 626 637 660 685 705 720 738 758 763 750 732 712 677 628 598 611 646 663 657 654 660 656 638 625 628
2121 628 632 631 636 643 631 590 549 540 564 601 628 639 648 675 717 740 726 710 737 788 804 776 760 786 806 765 696 672 712 770 806 820 822 817 815 826 830 800 746 708
2116 708 691 661 603 558 571 630 684 705 705 703 701 693 682 673 659 634 607 598 611 624 617 605 623 668 698 691 671 668 663 630 586 572 594 619 634 654 675 670 640 631 671
2111 671 723 732 688 634 619 657 713 732 685 618 608 677 752 754 697 662 691 739 740 688 634 630 679 738 769 772 774 783 770 716 649 620 653 716 757 748 702 653 621
2106F21j9j2PL5L8Lk6pK5J6l1n6l2JJ6K1K2Pj3oK3K7%nL6N7Nn9n5ML1Mj7PM2N0K2k1n5m9j
2101F56M1L1rk3j1j1k5rL4M6Ml8l9k8l3k4L4Q8P3Ll7j7J7J7qk9k9j5RK4J4j6l6k8pLLNJ2J9
2096F61J6jk8m9m1qK8L2Lk2oL7N4J7k9k8J3K9ll6j7K4K8ql6k4JJ0PJ7L4M2K8Jk2l1k3j4k5
2092F31n0o4m1J0N6O3L6OqlPJ8K1Pk6n3l2K8P3N8Qj8JK4J2k6n2m7k0NJ5Orj4mJ4K7K5J4Kp
2086F93j9k6k4j2j7m3n9l6nok5j4K6M0J8J2M5N1po7n0NJ3j6JO8R2L0l7l9j0jlJ7L7K0j1j1
2082F30J2Qk1l6k0LL1O5Q5N1k0o3m9j8j4k3j0L1N7M9K3QPmk6l6j8ok1m0j6L2L7j6n4l1J2R
2077F08j7j4J2J4oOM6M7on3m9k0pnRJ8Pp%J6K5K6J4k5o9o7j2K9J1k4j4K4L7J6MJ5K0J6K6N1
2072G02N8K8j7n0o1m5j1J6J4lkJ6K2J2RJ2nm1n3k8OJ8K4L4K9jl0l0j7j9l2l2k0rKK5M8N4L6
$$ plain form
2106 621 602 590 597 632 670 673 647 640 665 681 650 594 562 563 579 600 622 629 616 610 633 660 660 655 691 748 753 694 639 643 674 678 661 668 710 760 782 761 706 657 656
2101 656 697 728 719 696 685 674 649 640 674 720 724 686 647 619 586 562 596 684 757 760 723 706 723 740 732 703 674 659 668 692 706 690 654 626 619 622 625 630 642 661
2096 661 677 676 648 599 558 550 578 610 613 591 585 622 676 693 664 636 649 678 675 639 622 646 674 666 630 606 607 617 624 641 675 717 745 746 724 693 670 656 631
2092 631 581 517 476 486 542 605 641 647 639 636 643 661 682 689 663 610 578 606 679 737 745 727 728 752 764 738 686 639 619 624 639 645 636 622 618 632 659 684 698 700 693
2086 693 674 648 624 612 595 552 493 457 452 446 421 407 433 473 491 503 548 599 592 525 475 480 493 477 478 546 638 668 631 592 582 581 578 595 632 652 641 630
2082 630 642 650 629 593 573 576 607 672 757 808 788 725 676 658 644 621 611 642 699 748 771 779 786 782 756 720 702 696 675 635 619 651 688 672 618 587 599 608
2077 608 591 577 589 603 597 603 649 696 690 637 588 568 561 556 565 583 590 583 583 599 624 650 664 639 570 503 491 520 531 507 493 517 554 570 574 589 609 625 651 702
2072 702 760 788 771 721 660 615 604 620 634 631 629 645 667 679 688 700 695 654 601 573 579 597 621 655 684 683 653 623 606 587 555 523 503 494 496 521 569 623 659
2068F59J0j6l3l3j7lrk3j9nMJ3L4M6K2k3l5RN1L5j5l5rJ8J3%PJ5ol4k6K2N1K7j7k8lJ9J9R
2063F94ql5o0n7k8LJ8K9L7K2j4l3rK9M2K7Nrk0k0rK%kRK1J2l%K0L1K3Qok0k5pJ9K0jpJ5L4
2057G47J7rj5nj3l7m7k6kok4j9J8N0L7j5m6k4K4L7J1j2lJ5J5jj7k7k8j3J3K4J1o%J7K1J0j
2053F71oj5k0rRNk4m6l2kJ2MjJ6L5K7nk4pJ8J0k5l7oL9O2O0M8K5mj7nol7o3l6J2J1l8n7j2
2048E30M2M3Mj5oJ1J9J9Pj6k6pJ1Kj5MM1M3km5m4j7kqj8j4NL5N7M7Pk3j2J4J1j8k8jK3Ll4
2043F27l9jK7J0k9m3k0PJ6J2PJj1j5lJ5J7QJ1K7L3J9%rj9l4l1%L4K5j4l4j1J6Pk0j8J0K7J5
2038F20LNPj5l6k6QL0K5Mj6k5j4J9M2K6j6k9QN1N1K4OLj0l8m4nM7O3K3l3n2k2J4Rk7l8%M2
2033F84M0MrQK2Rmlnk1l1j9kKjOQmj1OK5J2j3j3J2K3Jk5k6j1MJ8K6J9nk1j3PJ8K4J9qm6n6
$$ plain form
2068 659 669 653 620 587 570 567 558 535 516 511 515 528 562 608 630 607 572 581 632 667 652 617 608 626 639 639 646 661 655 621 595 617 668 695 678 650 647 666 685 694
2063 694 686 651 591 534 506 509 527 556 593 615 601 568 559 588 630 657 662 653 633 613 604 606 606 604 613 634 646 643 643 663 694 717 725 719 699 674 667 686 706 705 698 713 747
2057 747 764 755 740 735 722 685 638 612 610 604 580 561 579 629 666 651 605 581 605 642 653 641 638 653 668 667 650 623 595 582 595 619 630 624 624 641 662 672 671
2053 671 665 650 630 621 630 635 611 565 533 531 543 547 546 562 597 624 619 595 588 606 616 591 554 548 587 649 709 757 782 778 761 756 750 713 650 614 626 637 599 542 530
2048 530 572 615 619 604 598 609 628 647 654 638 612 605 616 618 603 607 648 691 689 644 600 583 581 573 555 541 546 581 638 685 692 669 657 671 682 664 636 635 658 661 627
2043 627 588 587 614 624 595 552 532 539 555 567 574 575 564 549 546 561 578 586 597 624 657 676 676 667 648 614 583 583 617 642 628 594 583 599 606 586 568 578 605 620
2038 620 623 628 635 620 584 558 566 596 621 625 609 584 570 589 631 657 641 612 620 671 722 746 752 755 745 707 663 658 705 768 791 758 706 684 698 707 680 642 642 684
2033 684 724 728 719 727 749 758 754 751 746 725 694 675 673 675 674 680 688 684 673 679 704 716 703 690 702 725 726 701 675 664 668 686 712 731 726 705 692 699 717 741 760 752 706 650
2027F50k1K2K6ml0l2k5j3RK9L5L3L7L0Kl3l4mRnk2j9j9l0k3K2N9M3ok4%J8nm1n5l5QN8Q1N7
2023G48Jl5k6KJ1jj0JJ0Jk5m2l5j2Koj8j5J2M0N8N9N1L8K7J6kk4l1j4Jrk4j0J6J1l1m9j9K2
2018F89K7QNJ6J4lrnLJ3K5K1rl4j8J8K5JqK1M3K4j5k6j2nj3rJ0K3J1jJ1L3L3QoPK4J9NJ0J7
2012I91Jk3j4K1K6j8m4j2L7L9NnOlk8k7QK8RrLK3K9K4K3K6K9L7L4Jl5l0J2K8om6m2j1J2K2
2008A121K9J9qk2j3rj7j2J6K0k2n6l3OKk3j7RNk2j3L1M0mm9n7n0m4j9K5M2Ql5l3J0N1O0K9
2003I65k7o6n0oNk7n2k8J4L6L4K4J6J0J9L1K1rj9mrm4n7j6L6L9Qolj1k6j4QJk8l5j0J0OjN
1998G40RkpMK1K8K2J2MQJ8J2k1m6l0RJ8j5n2n6l6j2J1L3L1Lk4k1OL0L2K3J7J5Orj0J7M7M2
1993H77Mk7k2j3k0k5kK0Kl8m9k3KJ4K3K3nl6k0L3N7L1RJ3J1rnK8L1k2o0k4K9J0m9m8K3P1M1
$$ plain form
2027 650 629 651 677 673 643 611 586 573 582 611 646 679 716 746 748 715 681 677 686 681 659 640 621 591 568 590 649 692 686 662 662 680 675 634 579 544 552 610 691 748
2023 748 749 714 688 690 701 700 690 691 701 702 677 635 600 588 590 584 566 551 563 603 661 720 771 809 836 852 850 826 795 781 782 773 749 739 755 766 735 686 667 689
2018 689 716 724 729 745 759 756 747 742 745 758 783 804 795 761 743 761 786 787 779 800 843 867 852 826 814 809 796 787 797 820 831 830 841 874 907 915 909 916 940 959 964 974 991
2012 991 992 969 955 976 1002 984 940 928 965 1004 1009 1004 1010 1007 979 952 960 988 997 988 991 1014 1043 1067 1090 1116 1145 1182 1216 1217 1182 1152 1164 1192 1186 1140 1098 1087 1099 1121
2008 1121 1150 1169 1161 1139 1126 1117 1100 1088 1104 1124 1102 1046 1013 1019 1021 998 981 990 995 973 960 991 1031 1027 978 921 871 827 808 833 875 883 848 815 825 876 936 965
2003 965 938 872 822 816 821 794 742 714 728 764 798 822 838 848 867 898 919 910 891 887 878 834 777 761 797 836 844 838 835 824 798 784 792 793 765 730 720 730 736 735 740
1998 740 749 747 740 744 765 793 815 827 831 839 857 869 848 802 772 781 799 784 732 676 640 628 639 672 703 706 682 661 667 697 729 752 769 784 790 781 771 788 835 877
1993 877 881 854 832 819 799 774 772 792 794 756 707 684 686 700 723 746 741 705 685 718 775 806 815 828 839 830 825 853 884 862 802 778 807 817 768 720 743 814 855
1988H55j9m1l4j9ML3M3J9j1j0PK0K5K6J5j3l2k4mmk3l4k4jJ5J0pj4OL7M0J2pJ0M3N0J7k6n2
1983H88n1k1K3N1L7Kj3J1L5J9l5o9n1oJ5MnJ1K8J6j4k5qOONJ9K8K1J1J2PqrK6O2M5j7n9m3
1979I54MK9J3j8l6k6J1N4O7L9Lj0jO%mlnj8k8l1l4l3j0L3N7M0Kj2LJ0pk6j7J4L0J6pj0J6M1
1974A106L1j0l5j3L3M4Rj9JM0M9J5j9k7j4kQJ3Lj6j9KL0L5J2j6k6j3OJ8K0J7J0jkJ7M3M7K3
1969A400KQJ8jk9k3J2L1K1J1K0J9koL3O9M6k3n7k5K3L1Jk5k1J0M1M4J2k2k6jJ7RrmK8N6N3
1964A741K0j6j7J4M3M0J6MONKJ4L4K5j0k0J8N7M5Kj1K1N3N2K9J5QQJ1J8J5%nJ2L6M4L4K5K5
1959B413K4K1K5M2N9O3N7N6N4L2j2n0m2J0N7O7N1M3M6M1J9LJ1K7L4L4M2O8Q5P1L1J0L3P0P6
1955C671O0O3R0R4N9L2N7R7R0M9L5N6N8L7M7J05J53J41J00P9P4N9N3Q3J31J48J31J12J04J03
$$ plain form
1988 855 836 795 761 742 746 779 822 841 830 820 827 847 872 898 913 900 868 844 840 836 813 779 755 754 769 779 772 758 764 801 841 853 846 856 899 949 966 940 888
1983 888 837 816 839 890 927 929 916 927 962 981 946 877 826 820 835 839 834 845 873 889 875 850 842 848 854 859 878 906 927 938 950 957 949 940 966 1028 1073 1056 997 954
1979 954 958 987 1000 982 946 920 931 985 1052 1091 1094 1084 1083 1089 1089 1085 1082 1077 1059 1031 1000 966 933 923 956 1013 1053 1055 1043 1046 1056 1049 1023 1006 1020 1050 1066 1059 1049 1065 1106
1974 1106 1137 1127 1092 1079 1112 1156 1165 1146 1147 1187 1236 1251 1232 1205 1191 1189 1197 1210 1213 1197 1178 1180 1210 1245 1257 1241 1215 1202 1208 1226 1246 1263 1273 1272 1270 1287 1330 1377 1400
1969 1400 1402 1410 1428 1427 1398 1375 1387 1418 1439 1450 1470 1489 1487 1481 1514 1583 1629 1606 1549 1524 1547 1578 1579 1554 1533 1543 1584 1628 1640 1618 1592 1591 1608 1617 1608 1604 1632 1688 1741
1964 1741 1761 1745 1728 1742 1785 1825 1841 1845 1851 1856 1858 1872 1906 1931 1921 1901 1919 1976 2021 2023 2012 2033 2086 2138 2167 2182 2190 2198 2209 2227 2242 2242 2237 2249 2285 2329 2363 2388 2413
1959 2413 2437 2458 2483 2525 2584 2647 2704 2760 2814 2846 2834 2784 2742 2752 2809 2876 2927 2970 3016 3057 3076 3079 3090 3117 3151 3185 3227 3295 3380 3451 3482 3492 3525 3595 3671
1955 3671 3731 3794 3884 3978 4037 4069 4126 4223 4313 4362 4397 4453 4511 4548 4595 4700 4853 4994 5094 5173 5247 5306 5359 5442 5573 5721 5852 5964 6068 6171
1951F171J18J47J58J24Q0Q3J29J66J80J96K19K18J84J48J43J59J85K20K41K30K10K31K85L11
1948A0536K91K76L05L42L43L34L51L78L75L61L86M57N19N43N50N73O08O39O55O64O87P38Q04
1946B1715Q55Q95R43J005J055J093J151J241J316J361J413J507J606J672J731J829J946K030
1943D6364K093K188K309K405K469K541K625K687K726K774K823K824K783K749K722K642K499
1941I0223K354K229K058J807J534J296J053P61M59J94p5m12p74j070j295j516j753j957k112
1939I3004k264k426k553k608k627k645k658k644k617k592k563k506k421k324k228k149k088
1937E1091k036j970j886j790j685j593j530j491j442j363j284j233j181j094j008r75r73r41
1935B5616q68q16q04p83p31o83o67o57o29n93n67n37n03m89m94m78m32m03m13m10l62l15l22
$$ plain form
1951 6171 6289 6436 6594 6718 6798 6881 7010 7176 7356 7552 7771 7989 8173 8321 8464 8623 8808 9028 9269 9499 9709 9940 10225 10536
1948 10536 10827 11103 11408 11750 12093 12427 12778 13156 13531 13892 14278 14735 15254 15797 16347 16920 17528 18167 18822 19486 20173 20911 21715
1946 21715 22570 23465 24408 25413 26468 27561 28712 29953 31269 32630 34043 35550 37156 38828 40559 42388 44334 46364
1943 46364 48457 50645 52954 55359 57828 60369 62994 65681 68407 71181 74004 76828 79611 82360 85082 87724 90223
1941 90223 92577 94806 96864 98671 100205 101501 102554 103315 103774 103968 103893 103481 102707 101637 100342 98826 97073 95116 93004
1939 93004 90740 88314 85761 83153 80526 77881 75223 72579 69962 67370 64807 62301 59880 57556 55328 53179 51091
1937 51091 49055 47085 45199 43409 41724 40131 38601 37110 35668 34305 33021 31788 30607 29513 28505 27530 26557 25616
1935 25616 24748 23932 23128 22345 21614 20931 20264 19607 18978 18385 17818 17281 16778 16289 15795 15317 14885 14482 14069 13659 13297 12982 12660
1932A2660l44l15k54k39k76k94k64k28k26k41k38k22k22k30k24j95j74j84k06j96j37r2j21
1929G538k01k36j84j18j09j37j29q5o4r1j31j46j34j02n8l6o2j16j39j26j14j14j00o6m7n3
1926D640n2m3n5r4j02n5j6l8q3p6k8j4n1q4p2m4m2n6n7l8k0j3j4k5m6o1n2l0k4m4n7l4QJ5
1922C143j8m7m0k9m3o6n2k0j9n1p0n4m1m7m1oJ4j0m3l3LJ6nk5k8k7k8k4j3j7l6n5n8m1qK6
1917B107L4Ok8l0rkj5k4k2k7m1m8l3j5oojMJ0J9K2Rpj3rj8l4l1j4j5m7o2k7K4L1qm4l6OM7
1912A647N1J7l5o6n9l6k6k7k2omk3l8k2J8M2K9NJ4M5N2J5k6l2j8k7n3n5k6nj2j2J9M6L4Nm
1908A405jj6m6n2k8rj6l5l9k4%K3L1K3PllJ1K6K5Kj9j0Pj4n7n7NN2J9m3m3RL7K3J7K9J0m4
1903A202o1j4K5lm3k2L3L6j9n5l8oQJ7L7M2J5j9k6j7j7k2j5JQkj0kJ5K3%m1o7n5j8NQQK6M5
$$ plain form
1932 12660 12316 12001 11747 11508 11232 10938 10674 10446 10220 9979 9741 9519 9297 9067 8843 8648 8474 8290 8084 7888 7751 7659 7538
1929 7538 7337 7101 6917 6799 6690 6553 6424 6339 6275 6184 6053 5907 5773 5671 5613 5577 5515 5399 5260 5134 5020 4906 4806 4740 4693 4640
1926 4640 4588 4545 4490 4396 4294 4239 4223 4185 4102 4026 3998 3984 3933 3849 3777 3733 3691 3635 3578 3540 3520 3507 3493 3468 3422 3361 3309 3279 3255 3211 3154 3120 3128 3143
1922 3143 3125 3078 3038 3009 2966 2900 2848 2828 2809 2758 2688 2634 2593 2546 2505 2499 2513 2503 2460 2427 2430 2446 2441 2416 2388 2361 2333 2309 2296 2279 2243 2188 2130 2089 2081 2107
1917 2107 2141 2147 2119 2089 2080 2078 2063 2039 2017 1990 1949 1901 1868 1853 1847 1841 1840 1844 1854 1873 1895 1904 1897 1884 1875 1857 1823 1792 1778 1763 1716 1654 1627 1651 1682 1674 1630 1594 1600 1647
1912 1647 1698 1715 1680 1614 1555 1519 1493 1466 1444 1438 1434 1411 1373 1351 1369 1411 1440 1445 1459 1504 1556 1571 1545 1513 1495 1468 1415 1360 1334 1329 1317 1305 1324 1370 1404 1409 1405
1908 1405 1404 1388 1342 1290 1262 1253 1237 1202 1163 1139 1139 1162 1193 1216 1223 1220 1217 1228 1254 1279 1281 1262 1252 1259 1245 1188 1131 1136 1188 1207 1164 1121 1130 1167 1190 1207 1236 1246 1202
1903 1202 1141 1127 1152 1149 1106 1084 1117 1153 1134 1079 1041 1035 1043 1060 1097 1139 1154 1135 1109 1092 1075 1053 1038 1039 1047 1045 1035 1033 1048 1071 1071 1030 963 908 890 895 903 911 937 982
1898I82L8Rj2oJ1Pj9l9l2j5j6k8j4K0M0K1j0k0j3j2oJ3K4jl5k7K1M6K6kOL0K5pk8k7k8l6k7
1893H59PL0J3j9k2J3L9K8qk8k7j9j4kJ1%l4m6j9J1Mk4k0K0N3N4M2L2Ol6o3n0j4J5K5J9nm0
1889G91n0j2L9M7J1j6rJ3J9J4J1Rlk6m4m4j7J5K6%k8k1K2N7N5K8RNj0m1o9n9j0M2N5K2k2m2
1884G67l2j0J0L1M6M2J6j9m0l6j8orj3lJ8K4RjPJ3lj7lK6K9POL1M0jm8m1%J6pk0jJ5ol2j7
1879G70K2L4ll7l2jJ1M%Knj8j8NK5J9Jj5k2k1mK4L4Rj6pK4L0Jk4k0jOKlqoJ2L4L2PkK7N9N2
1874I83Rk0j9nJLJ2K7L2J8j2l4k1K1M6L3QJ0K9J4l9p1m3J8N4N2L4J6Jj1pOPnk1k8l0k7j7M
1869A028K0K2Rj1l0l7k6qmk3m7n6l9j0J2J6OomJ0K5K6K5K1J0j0j8jJ6km4n7k3J0%k7l0j2j4
1864G17l0k1J7L6J2j4oJ4J4pj8j2%J3K6K3lk1kL1L2nl7l1lJ4J1jj7l3l8k8j3j%qj9j1K4N9
$$ plain form
1898 982 1020 1029 1017 1011 1022 1029 1010 971 939 924 908 880 866 886 926 947 937 917 904 892 886 899 923 922 887 860 881 927 953 951 957 987 1012 1005 977 950 922 886 859
1893 859 866 896 909 890 868 881 920 948 940 912 885 866 852 850 861 861 827 781 762 773 777 753 733 753 806 860 902 934 940 904 841 791 777 792 817 836 831 791
1889 791 741 729 768 815 826 810 801 814 833 847 858 867 864 838 794 750 733 748 774 774 746 725 747 804 859 887 896 901 891 850 781 722 712 754 809 831 809 767
1884 767 735 725 735 766 812 854 870 851 811 775 757 751 742 729 726 744 768 777 776 783 796 793 776 773 799 828 835 841 872 912 911 863 822 822 838 831 811 810 825 819 787 770
1879 770 792 826 823 786 754 753 764 768 768 770 765 747 729 734 759 778 779 764 742 721 717 741 775 784 768 761 785 815 816 792 772 771 777 779 776 768 762 774 808 840 847 845 872 931 983
1874 983 992 972 953 948 949 952 964 991 1023 1041 1029 995 974 995 1041 1074 1082 1092 1121 1135 1096 1025 982 1000 1054 1106 1140 1156 1157 1146 1139 1145 1152 1147 1126 1098 1068 1041 1024 1028
1869 1028 1048 1070 1079 1068 1038 1001 975 967 963 940 893 837 798 788 800 816 822 816 812 822 847 873 898 919 929 919 901 900 916 914 870 813 790 800 800 773 743 731 717
1864 717 687 666 683 719 731 717 711 725 739 732 714 702 702 715 741 764 761 740 738 769 801 796 759 728 725 739 750 749 732 699 661 633 620 619 619 611 592 581 605 664
1859F64N4Pl8l9nJ9J5jn%Lqk4k7nK2K7J4OJ2Qj2k2NM5N0K6Ojj7m1k8J4K4l5r4p2%L0KrL0N0
1854F50Ln2l4K8L7j3l6ON4M8Nj9j0J0J8Qk3m9l7%J5oj8KJ2j4l3qK4Ql5l5MK7J5J0K4K5J1J0
1849F32K5K3JKK8K8k0n9m5lJ7J0Krj9%M8O8J4o6q7l0L2L7jl4l3pK0K6J9J8K3J4j1k4jL0L6
1844G04J5rk7l7k5MJ3j9n4m6rQLJ0L2L8K1J0J0jj8j2K0L2Ok1k3j2j3j6mK0L7M1L1Kl5m7k5
1839F04QK2J9J2Pkqpnnj0k1k6j1K0L5J0k1j4K0K5j7n1l5J0K9K1J3K5M0L3km8o2k0L7N4J8j8
1834F79k4k5l9m2j1K4J8k0l8j6J8K6QrlK1L0Rj4rJ5J8%QL7L8pm1k4Mql0j4K2K3koJ4J3j5k7
1829F01mL3N0M1Jm9o3j9M0M6J0pJ5K9J4jnj4l0k6kNrlK6L1j1m6l8j6k1l7k6OK8L8L5J1k7l9
1825E67j7J0J4K2M5M1j1n6l8Lnm0l5J2K5j7m7pO3Q8M9j6o0o6l3J1L2J7j3l4l9l1k2j2J1N6
$$ plain form
1859 664 718 725 687 648 643 662 677 676 671 671 674 666 642 615 610 632 659 673 679 691 699 687 665 670 715 765 791 797 796 779 738 710 724 748 713 619 547 547 577 579 570 600 650
1854 650 653 601 567 595 632 619 583 589 643 691 696 677 667 677 695 703 680 631 594 594 609 603 585 587 599 585 552 544 568 576 541 506 510 537 552 562 586 611 622 632
1849 632 657 680 681 683 711 739 719 660 615 612 629 639 641 632 613 613 661 729 743 677 590 560 592 629 628 594 561 554 574 600 619 637 660 674 663 639 638 668 704
1844 704 719 710 683 646 621 625 638 619 565 519 510 518 521 531 563 601 622 632 642 641 623 611 631 663 669 648 625 613 600 584 580 600 637 678 709 711 676 629 604
1839 604 612 634 653 665 672 670 662 655 650 645 635 614 588 577 597 632 642 621 607 627 652 635 584 549 559 588 609 622 647 687 720 718 670 608 588 625 679 697 679
1834 679 655 630 591 549 538 562 580 560 522 506 524 550 558 549 546 567 597 606 592 583 598 616 616 624 661 699 692 651 627 631 623 593 579 601 624 622 616 630 643 628 601
1829 601 597 630 680 721 722 673 610 591 631 677 687 680 695 724 738 737 732 718 688 662 660 665 656 653 679 710 699 653 615 599 578 541 515 521 549 587 622 633 606 567
1825 567 550 560 574 596 641 682 671 615 577 580 575 535 500 512 537 520 473 466 529 617 666 650 590 524 491 502 534 551 538 504 465 434 412 400 411 467
1820D67R7Q6J6n0n1oJ6JnJ7L7K7RPRlk7m6m9l7j1J4K3J5OPOQJ2J5RNJ6J5k3o9o9k3J4J8K0
1815E23L9M3J7oLJ5PlRJ6mk6j6Jmj4kNk5n7l0L4N9K0k0k2j3j2NM0M5Pl0j8J4J8mk3l7n7n7
1810D40j2M5O1L5K2M0N0J7k5k4J3M1K0l2o9o0k6rj4j0K0M6L5Kj3njrkJ8J9j1l8k3K0M3L5J7
1806F56Nj0k6j8J0L3J8j6k8jK2Ll8n6k6J5L1K5J7J1%j3j6j8l0l8j9J7K8Jk4j2J7K7J6QNj0
1801E66l4l6nK5J7j3k4OM3M8K6Nlj4l3l8j3J8K1joJ6L6K9J5J4J2j6m8m8k4j8m1m8j5L4N2L1
1796E36%j5kK6M9M5J1l0m2k4OK2K5J7Pmj3j8j8oJ1K7K9J2j3k4j4Mkl4n4k6L3O8N6J2k5l5j9
1791E78lj4m1m0J1O3M9j8n0qM5L7j0k6jJ8Kk2k3oMMkjQJ7Pk0l4j1J8J9JLK1J1l4o4m3JK3K0
1786D89J7J7J6K0L4L6J1k0k2kKj0rJ7L5J6j6k9j6orj3pNMlNL3M6J0m8p0k9J6Ql0l1K0O6N5
$$ plain form
1820 467 564 650 666 616 565 559 575 576 571 588 625 652 661 668 677 674 647 601 552 515 504 518 541 556 562 569 575 583 595 610 619 624 640 655 632 563 494 471 485 503 523
1815 523 562 605 622 616 619 634 641 638 647 663 659 633 617 618 614 600 598 603 578 521 491 525 584 604 584 562 549 537 542 582 627 634 604 586 600 618 614 591 554 497 440
1810 440 428 473 534 569 591 631 681 698 673 649 662 703 723 691 622 562 536 527 513 503 523 569 604 606 593 588 587 578 576 594 613 602 564 541 561 604 639 656
1806 656 661 651 625 607 617 650 668 652 624 623 645 648 610 554 528 543 574 599 616 627 627 614 598 580 550 512 493 510 538 539 515 503 520 547 563 571 576 566
1801 566 532 496 491 516 533 520 496 502 545 593 619 624 621 607 574 536 523 541 562 561 555 571 607 636 651 665 677 661 613 565 541 523 482 434 419 453 505 536
1796 536 536 521 519 545 594 639 650 620 578 554 560 582 607 624 631 627 614 596 578 572 583 610 639 651 638 614 600 604 602 568 514 488 521 589 645 657 632 597 578
1791 578 575 561 520 480 491 554 603 585 535 527 572 609 599 573 572 590 592 570 547 541 545 549 547 546 554 571 578 558 524 513 531 550 551 554 575 586 552 488 445 446 469 489
1786 489 506 523 539 559 593 629 640 620 598 596 598 588 579 596 631 647 631 602 586 580 571 558 551 556 560 557 562 595 641 651 603 533 504 520 528 498 467 487 553 608
1781F08J7kJmk0k9k7j5J0N0P0L9k1m4j1K8K7Kppk2l8k1J7K8kl6k9MK6J6j7n1n4j0N3P3K9k9
1777F02m7l5l1l5qM3O9M6Rmoj6k8k2ppj6j4PK7K7J2nj3j5j5j0MK2K7J1j5k5j1J2K0J5MjPL2
1772F10N5M0j9p3o5jM6L2j5k9J1N0L8k0o3n4lM2N6L6lm4n7k8J8L3Qk0j2J9L3K1QN%j8l2j7
1767E88J7K8om7m0J1M9L5JoQKk0j9J2L0J5MK5M2J2m1n5k2J0J2OK2N0P0P0N3K7Plk1n8p8m7
1762G43J0L2RpJ5L8L2J7K5L8K9J1J9M5N6M6M2M9L8PpL2Q4R7O5M0N5R4J15J10R4P5N4N4R5J58
1758B509J74J16M2K6O7R6P5K8ql1n3n9m2k8m8q7j03p7l7j5romj4l1k8K3J00J40J24J05J32
1754C077J83J90J52J40J83K20J94J34J14J37J59J47J19Q4L2k7o7q1q8j01j15j26j45j65j77
1751D173j80j86j83j51j09j04j39j58j28p5m5l0qJ5Rj5j4K9P1P4M5K4L3O1P2N6L1J9K8L9K7
$$ plain form
1781 608 625 623 624 620 600 571 544 529 539 589 659 698 677 633 622 650 677 679 672 665 643 605 584 601 629 627 591 562 566 592 608 591 540 486 476 529 602 631 602
1777 602 555 520 489 454 446 489 558 604 613 609 603 587 559 537 530 523 507 493 500 527 554 566 561 548 533 518 508 512 534 561 572 557 532 521 533 553 568 572 571 578 610
1772 610 665 705 686 613 548 547 593 625 610 581 592 642 680 660 597 543 540 582 638 674 671 627 570 542 560 593 601 581 569 588 621 642 650 655 655 637 605 588
1767 588 605 633 627 580 540 551 600 635 636 630 638 640 620 601 613 643 658 662 687 729 741 700 645 623 633 645 651 673 723 793 863 916 943 950 947 926 868 790 743
1762 743 753 785 794 787 802 840 872 889 914 952 981 992 1011 1056 1112 1158 1200 1249 1287 1294 1287 1319 1403 1500 1565 1605 1660 1754 1869 1979 2073 2148 2202 2256 2351 2509
1758 2509 2683 2799 2841 2867 2934 3030 3105 3133 3125 3094 3041 2982 2940 2912 2864 2777 2674 2597 2560 2545 2536 2530 2526 2512 2481 2453 2476 2576 2716 2840 2945 3077
1754 3077 3260 3450 3602 3742 3925 4145 4339 4473 4587 4724 4883 5030 5149 5233 5265 5238 5171 5090 5002 4901 4786 4660 4515 4350 4173
1751 4173 3993 3807 3624 3473 3364 3260 3121 2963 2835 2760 2715 2685 2677 2692 2701 2686 2672 2701 2772 2846 2891 2915 2948 3009 3081 3137 3168 3187 3215 3254 3281
1747C281kl7o5q4q3o4m7o0r6j28j28j00o6n5p2j01j16j07r1q7q8o9l8l1n4o6l4QLm3o8m2j0
1743A160j8m4m9m2m6n0k7J0J3o%M2O1L0j2j8rk1l7k6j4l6o6m8J0L2nm5l6jK0K4L4L6J5j3p
1739H11K3L1lm7o0l7j7k5m4l1J4M3J2m1n0mL6K7lrNJ1QQNj4l6k6J3M7M5K2pk6k8j4jql0l6
1734E64j6J%%K6N4M9J5pJ0L4K7rl9m3k7qRRj9n1m7j3Oj6l1LN2M8nl3jM5N8L9J5k1o5r1o3K
1729D61O4Q6N4j6o9n3QL0j1l7KN1K7l8n2kL2K1J0L2M5J8k0l9m9n3l1K1M9L1OLjl2n2j7L5M1
1724E55J4J0L6M7L0K3L2K1j9m0j5J1pm6m5ON3M5j1o0n2MM7L6pk8j9j0j3pJ3J4oj6%Oj1qL7
1719F20O1Ro9p2MN7L2k2l8k0pKJ6J8%qJ5M3L2rk8j7mrk2k9l5l1j0J5L4M2M5L4%k7j9OJ6J4
1714F39K8M3J6m5p4m3lMRL9N8K0m2o2l5j1qJK4L9L5K3Nk2m5l8j0J3K0K6K1ml4l0jJ8J4J8L7
$$ plain form
1747 3281 3279 3242 3177 3093 3010 2946 2899 2839 2743 2615 2487 2387 2321 2266 2194 2093 1977 1870 1779 1692 1604 1535 1497 1466 1412 1346 1312 1320 1323 1280 1212 1170 1160
1743 1160 1142 1098 1049 1007 961 911 884 894 907 901 901 943 1004 1034 1022 1004 995 974 937 911 897 861 795 747 757 789 784 739 703 702 722 746 780 816 831 818 811
1739 811 834 865 862 815 755 718 701 676 632 601 615 658 670 629 579 575 611 638 635 626 631 642 650 658 663 649 613 587 600 647 692 714 707 681 653 639 638 630 600 564
1734 564 548 549 549 549 575 629 678 693 686 696 730 757 748 709 666 639 631 640 649 630 579 532 519 525 509 478 481 533 581 576 543 542 587 645 684 699 678 613 522 459 461
1729 461 525 611 665 649 580 527 535 565 554 517 519 570 597 559 507 505 537 558 568 600 645 663 643 604 555 502 471 492 541 572 578 581 580 548 496 479 514 555
1724 555 569 579 615 662 692 715 747 768 749 709 694 705 698 652 607 613 666 711 700 640 588 592 639 675 668 640 621 611 598 591 604 618 612 596 596 602 591 583 620
1719 620 681 690 621 549 553 610 642 620 582 562 555 557 573 591 591 583 598 641 673 664 636 619 615 606 584 555 520 489 479 494 528 570 615 649 649 622 603 609 625 639
1714 639 667 710 726 681 607 564 561 565 574 613 671 691 649 587 552 541 533 534 558 597 632 655 660 638 593 555 545 558 578 604 625 621 587 557 556 574 588 606 643
1710F43M0J2k2l9m7m4j7L0N4K9j2k7j7j2j6j1RL0L3J9%pKNj1k5pK8L8Pk3k6j3JK7N3L9j9n8
1705F46l9OJ7J0J8L4K4jnLj2m5n4k7MK2L8N0M0Rj4k4k9k0MJ0k9o9m3L4O7K7j9k0kllK3M4L0
1700G02Jj1j4k7k9nJ2lk0nK4K5J1J5K4Pj5%K5Kn7p2j7M0L8JrJ2K7J3l%K0K4Mj5LM4M5j0o1
1695G46m6OJ5k8n5k8J1K0PRJ9K1J9K8L6K6Kj4qJ0K7K5OpMJ6Nj5lL0L0j0l2oJ8kl2j7K0J8k3
1690H48n1l7nK0M2O0N7K9jk5l8l8j7PJ1kj2j7j8qJ6K8Mk6j5K6L5%k7k0nj1qJ5J9j4m6k4K5
1685G77M9M3L7K7rl5qM7N6Ol1pK6J3k7l2OK5lm9o1l1QK8J9%j5j9j5lJ5L1K7jk6k7oJ0Rlj6
1680H35j7NM3N4Rn9p2rO2N9pn6m3j4j3k7k7k2k4j1L9Q0O0NoL2L8j8o2l5J7K7J2J8K9mn2m9
1675G97MK6nk9j7ql3m3oM1M3J7PJ1Oj4k8l0j3K6O2M9ol3lJ9k0o8n0PJ8j8k2L4Q0O8K6%pj0
$$ plain form
1710 643 683 695 673 634 587 543 526 556 610 639 627 600 583 571 555 544 553 583 616 635 635 628 630 635 624 599 592 620 658 665 642 616 603 604 631 684 723 704 646
1705 646 607 613 630 640 658 692 716 715 710 713 701 656 602 575 579 601 639 689 729 738 724 700 671 651 655 665 636 567 524 558 625 652 633 613 611 608 605 628 672 702
1700 702 703 692 678 651 622 617 629 626 606 601 625 650 661 676 700 707 692 692 717 719 662 590 573 613 651 652 643 655 682 695 692 692 712 736 740 725 728 772 817 807 746
1695 746 700 706 721 693 638 610 621 641 648 657 676 697 716 744 780 806 808 794 786 796 823 848 854 847 851 867 872 857 854 884 914 904 872 866 884 882 850 833 853 871 848
1690 848 797 760 755 775 817 877 934 963 962 937 899 861 844 851 862 860 848 831 813 805 821 849 853 827 812 838 873 873 846 826 821 810 802 817 836 822 776 752 777
1685 777 826 869 906 933 924 889 881 928 984 990 959 952 978 991 964 932 938 963 960 911 850 819 827 855 874 874 859 840 825 822 837 868 895 894 868 841 835 845 854 851 835
1680 835 818 823 866 920 929 870 798 789 851 910 903 847 804 790 777 750 723 701 677 666 705 785 845 850 844 876 914 896 834 799 816 843 855 873 902 898 846 797
1675 797 801 827 822 793 776 768 735 692 686 727 770 787 794 805 811 797 769 739 726 752 814 863 857 824 821 840 820 752 702 709 727 709 687 721 801 869 895 895 888 878
1671H78lKk2o2o3k0J8K3K7M7M5Jl1rJ7j1o3o4j2K8K5J9L4M3K5ok3k1kL3N9M4om3l5qLlmjq
1666H51k2j9J1L8L3Nj3l%k8n9m2J3M1J5j5%L3K3j6k2J8M7K9qk1j7j2pRJ9J7K5N8P2L2m0p1
1661I74l6J2K2JoJ4K3Lk3j6J8L5Om2o1k6L0O2M5pn2n7j8L1N4M4K3Qpk9l6j7J1J6nk0pJ4J7
1656I98%nJ6L6L0Jj6j4okRJ7Oj7j7RK4PqRK6Qk2j0K8L6Kk4lK5K0oj9mK1L0J3k0l5mM2N1J4
1651A246j7rJ6J9Opj8k7k2NK5K9K9L2J5k9n2j8M1O3L4rl6l7j3K8N0L1pl1l3k3QN6P7M5lj1
1646A453J0J1pMN0O8K7k9l9lL0L4J5kpPK2K3Qnj1j2pRK5K3RKjpj3jRLkK4N7N2J6nOK0J9J9
1641A904J3k0m9j4P0J01M1k8k0K6L1LnQJ3J8M7P1M1j5k5J2K5L%M2P0M8J7J9L8M6M8N9N5K5
1636B718poJ5K7L7N2N2J9k3j7L9Q5Q0M4K7M2O4O5M9L9M4N7O9P9P2M2PPN5J13J32J11Q2O4N7
$$ plain form
1671 878 875 877 855 793 730 710 728 751 778 825 870 871 840 831 848 837 774 710 698 726 751 770 804 847 872 866 843 822 820 853 912 956 950 907 872 864 867 864 860 859 851
1666 851 829 810 821 859 892 897 884 881 881 853 794 752 765 806 821 806 806 839 862 846 824 842 889 918 910 889 872 860 853 862 881 898 923 981 1053 1085 1045 974
1661 974 938 950 972 973 967 981 1004 1007 984 968 986 1021 1027 985 924 898 928 990 1035 1028 976 919 901 932 986 1030 1053 1061 1054 1025 989 972 983 999 994 974 967 981 998
1656 998 998 993 1009 1045 1075 1076 1060 1046 1040 1038 1047 1064 1070 1053 1036 1045 1069 1076 1068 1077 1103 1111 1089 1079 1107 1143 1145 1121 1118 1143 1163 1157 1138 1134 1155 1185 1198 1178 1143 1139 1181 1232 1246
1651 1246 1229 1220 1236 1255 1261 1254 1236 1209 1187 1192 1217 1246 1275 1307 1322 1293 1241 1223 1264 1327 1361 1352 1316 1279 1266 1294 1344 1375 1368 1337 1304 1281 1289 1345 1422 1467 1464 1453
1646 1453 1463 1474 1467 1471 1521 1589 1616 1587 1548 1545 1575 1609 1624 1622 1615 1622 1644 1667 1675 1670 1659 1647 1640 1649 1674 1697 1706 1708 1707 1700 1687 1686 1695 1698 1696 1720 1777 1829 1845 1840 1846 1866 1885 1904
1641 1904 1917 1897 1848 1834 1904 2005 2046 2018 1998 2024 2055 2058 2053 2061 2074 2092 2139 2210 2251 2236 2211 2223 2248 2251 2251 2293 2363 2411 2428 2447 2485 2531 2579 2638 2693 2718
1636 2718 2711 2705 2720 2747 2784 2836 2888 2907 2884 2867 2906 2991 3071 3115 3142 3184 3248 3313 3362 3401 3445 3502 3571 3650 3722 3764 3771 3778 3833 3946 4078 4189 4271 4335 4392
1632D392P1J04J18Q2L2L8J10J73J72J35J10J07J04J01J08J27J52J79J98J99J88J94K15K21
1629G630K05K05K36K54K29K02K35K99L20K89K73L17L72L86L69L57L71L96M29M56M59M26L81
1626A5096L60L74M03M13L90L53L31L29L14K72K28K07K01J82J64J63J66J32P8N4P2Q3O2M2N2
1623B0521P1Q1R7J38J70J68J57J76K14K40K74L51M41M75M50M34M69N28N80O36O95P31P32P46
1620B9575P99Q51Q62Q57Q86R24R22Q98R01R20Q91Q10P51P52P45O62N34M47M07L55K53J35K8
1618D5165q0j96k97l54l86m25m70n02n26n73o33o60o18n40m92m95n07m80m18l60l18k77k24
1615C5334j79j49j12l8O6J54J95K06K27K87L71M35M52M50M80N56O40O89O98O91O71O26N66
1612D3316N12M66M18L69L33K99K40J49N0m5j47k64l77m63n27n89o66p51q10q22p98p92q45
$$ plain form
1632 4392 4463 4567 4685 4767 4799 4837 4947 5120 5292 5427 5537 5644 5748 5849 5957 6084 6236 6415 6613 6812 7000 7194 7409 7630
1629 7630 7835 8040 8276 8530 8759 8961 9196 9495 9815 10104 10377 10694 11066 11452 11821 12178 12549 12945 13374 13830 14289 14715 15096
1626 15096 15456 15830 16233 16646 17036 17389 17720 18049 18363 18635 18863 19070 19271 19453 19617 19780 19946 20078 20156 20210 20282 20365 20427 20469 20521
1623 20521 20592 20673 20770 20908 21078 21246 21403 21579 21793 22033 22307 22658 23099 23574 24024 24458 24927 25455 26035 26671 27366 28097 28829 29575
1620 29575 30374 31225 32087 32944 33830 34754 35676 36574 37475 38395 39286 40096 40847 41599 42344 43006 43540 43987 44394 44749 45002 45137 45165
1618 45165 45085 44889 44592 44238 43852 43427 42957 42455 41929 41356 40723 40063 39445 38905 38413 37918 37411 36931 36513 36153 35835 35558 35334
1615 35334 35155 35006 34894 34856 34922 35076 35271 35477 35704 35991 36362 36797 37249 37699 38179 38735 39375 40064 40762 41453 42124 42750 43316
1612 43316 43828 44294 44712 45081 45414 45713 45953 46102 46152 46107 45960 45696 45319 44856 44329 43740 43074 42323 41513 40691 39893 39101 38256
1609C8256r21r51r16q67q50q52q41q08p66p21o82o58o33n87n23m78m64m42l96l60l53l36k79
1606B3572k19k09k25k04j45r8r5j04r3o8m2k1k3o0r8j03r3j08j49j75j81j98k28k41k40k78
1603A9874l54m01l93l83m09m26l93l62l89m37m35m01m09m51m53l92l44l51l78l76l51l33l22
1600A0931l07k84k68k63k71k87k82k41j90j84k16k27j93j56j53j64j57j46j65j96k00j69j39
1598F073j30j25j14j05j05r5o8m1m2p5j13j25j16j04r4p6m2k1l7p7j09j11r5p6n4l4l4n1o3
1594C741n5m7o1q0q0o5m9l2rPql9m8l6l7o6q7p1l8l3n8o8m4j6k0m8o0l2RK8J5mj3j9k7l5l3
1589B382k8k5j4NJ4mk9l1pMj8n1o6n3k9%K2K6Jl9o7o0k7RJ6j4n8o6k0L0K6k5n5k9J1J2j6j7
1585A710J4K3nl3k3Jjk2k7j5rj1LL0L0om1l9j6lnj5k6l2j4J9L7J7plJ0nl3l3nLk5m3k4jj0
$$ plain form
1609 38256 37335 36384 35468 34601 33751 32899 32058 31250 30484 29763 29081 28423 27790 27203 26680 26202 25738 25296 24900 24540 24187 23851 23572
1606 23572 23353 23144 22919 22715 22570 22472 22377 22273 22180 22112 22070 22049 22026 21966 21868 21765 21672 21564 21415 21240 21059 20861 20633 20392 20152 19874
1603 19874 19520 19119 18726 18343 17934 17508 17115 16753 16364 15927 15492 15091 14682 14231 13778 13386 13042 12691 12313 11937 11586 11253 10931
1600 10931 10624 10340 10072 9809 9538 9251 8969 8728 8538 8354 8138 7911 7718 7562 7409 7245 7088 6942 6777 6581 6381 6212 6073
1598 6073 5943 5818 5704 5599 5494 5399 5331 5290 5248 5173 5060 4935 4819 4715 4621 4545 4503 4482 4445 4368 4259 4148 4053 3977 3923 3889 3855 3804 3741
1594 3741 3686 3639 3578 3498 3418 3353 3304 3272 3263 3270 3262 3223 3175 3139 3102 3036 2949 2878 2840 2807 2749 2681 2637 2621 2601 2553 2493 2461 2470 2498 2513 2509 2496 2477 2450 2415 2382
1589 2382 2354 2329 2315 2320 2334 2330 2301 2270 2263 2267 2249 2198 2132 2079 2050 2050 2072 2098 2099 2060 1993 1933 1906 1915 1931 1917 1859 1793 1773 1803 1829 1804 1749 1720 1731 1743 1727 1710
1585 1710 1724 1747 1742 1709 1686 1687 1686 1664 1637 1622 1613 1602 1605 1635 1665 1659 1618 1579 1563 1560 1555 1540 1514 1482 1468 1487 1524 1541 1534 1531 1541 1536 1503 1470 1465 1468 1443 1400 1376 1375 1365
1580A365j9J5O9P9K6l0m6k8j2j2j9l2l7k4lll1m4j4L0K7k9o8m4J9N2L4lj9j3%PJ4J8J9J6J5
1575A275J5%k9m3k0J6J6k8n6k7K1J3m8p5k2M7N1Jk3nRoj0K2M3J6k6k7MJ6JoNkk7l2kJ9Jj7
1570A060RN0M9Jm3o0n8m4pM1M7Kl5j0M8O8L4rk6k6j6NK8K5j4n6o4m1k0mK3N7O8M2kl1l1j3
1566A047Jpk9m3k7PK7J3k3n6n5j3M5P1M2j0l5k4jJ3K0J3j2l4k1K0L8J3k2l7m0l5j0K0J4l0
1561H40m3J1O9N6jk9j7j3j4QL2jn8n2L1Q0M4kJ5M7J9m1m8pK2J9J8J6k3p1o6j3J3j3k9%L3K2
1557H54j0j3RJ8Mj8k8k7j1J2K3J9J6K0J6K%J8K6Pj7k2pQK4M5M9J8k9n5m5j8QK1J8J0J6L9N0
1552A050L0MLK0K5J4PJ2J9K0J7J2OPK0L3L2K3J4MJK0N7P7O2N2O9Q9P4M2L9N2L6MJK8L6J6J5
1547B142M0M0kl6k9k9p2j14q9l0j5m3n9l5j7k4l9l9l5l3k4j6k7m6m0pJ8J0oj1j8m4o6n0j3
$$ plain form
1580 1365 1346 1361 1430 1509 1535 1505 1459 1431 1419 1407 1388 1356 1319 1295 1292 1289 1258 1214 1200 1230 1257 1228 1160 1116 1135 1187 1221 1218 1199 1186 1186 1193 1207 1225 1244 1260 1275
1575 1275 1290 1290 1261 1218 1198 1214 1230 1202 1146 1119 1140 1153 1105 1030 1008 1055 1106 1107 1084 1079 1088 1082 1072 1094 1137 1153 1127 1100 1104 1120 1121 1115 1120 1118 1091 1059 1057 1076 1077 1060
1570 1060 1069 1119 1168 1169 1126 1066 1008 964 957 998 1045 1047 1012 1002 1050 1118 1152 1143 1117 1091 1075 1080 1108 1133 1119 1063 999 958 938 934 957 1014 1082 1124 1122 1091 1060 1047
1566 1047 1048 1041 1012 969 942 949 976 989 966 910 855 842 887 958 1000 990 955 931 930 943 963 976 964 930 909 929 967 980 958 921 881 846 836 856 870 840
1561 840 797 808 877 933 932 903 886 873 859 867 899 898 840 788 819 899 943 941 956 1003 1022 981 933 926 948 967 985 1001 978 907 841 828 841 828 799 799 832 854
1557 854 844 831 840 858 862 844 816 789 778 790 813 832 848 868 884 886 886 904 930 937 920 898 891 899 923 968 1017 1035 1006 951 906 888 896 917 935 945 961 1000 1050
1552 1050 1080 1084 1087 1107 1132 1146 1153 1165 1184 1204 1221 1233 1239 1246 1266 1299 1331 1354 1368 1372 1373 1393 1450 1527 1589 1641 1710 1799 1873 1915 1954 2006 2042 2046 2047 2075 2111 2127 2142
1547 2142 2182 2222 2220 2184 2155 2126 2054 1940 1851 1821 1806 1763 1704 1669 1652 1628 1589 1550 1515 1482 1458 1442 1415 1369 1329 1322 1340 1350 1344 1333 1315 1271 1205 1155 1142
1543A142Jj4k6j5QJ6J4J3K0J6pl1l2j8j9l2k5J5M2K1j1mL5L8om0j9J7J1k8n0l1MJ9J1rj2K0
1538A034N8N4Nk5jL5K1l1n8n0m8o0m3J7O4N0kl4k9j9k5l4k5RM2N0K2k1m5m0j5J1K9L2K7K6
1534I81L1J5l2p2n7lK8J5KK1L1nn2m6OL0mm9m3J3O1N3Pk7j7Nmm0m1RN5M4OlJ8J4k7m8k1K1
1529H75K7Jj1RL6M3K4kk4l2k4KL2L2j5o8o5jM2Nn7m9K6P5N4K0J4Nl7o8l9K3N2L5Qk0n5q0n4
1524G39LK8Oj2J5M8L3j5l4mK7J4k9n2l8j6qNL4N8M5Nj6oLopJ5L7K3j4l7l2j9qMJ9L2K8Pk5
1519H50l8pL9M6Ok6qK4K4mk4k9l4j9K4M9J7l4l1J4K7%lL9O6L6qk1k4m2m9k3NKj0JJ6MoJ7M2
1514I08K5j6k4LJ6J1J7L7K6j1k1J2L3Ll7l7nJ0pk3j6l%jJ2K8K1j5m2k4K2L3Kj3K6O7M7nk1
1509A038PJ2j9l4j3lk4l0LK9J0j5J3O1O1K1JJ4J3j9m0k1NPkLK1K6K0J0mj4mL1N2L0j7l5rK5
$$ plain form
1543 1142 1143 1129 1103 1088 1096 1112 1126 1139 1159 1175 1168 1137 1105 1087 1068 1036 1011 1026 1068 1089 1078 1074 1109 1147 1141 1101 1082 1099 1110 1082 1032 1001 1005 1024 1035 1026 1014 1034
1538 1034 1092 1146 1151 1126 1125 1160 1181 1150 1092 1042 994 934 891 908 972 1022 1020 986 957 938 913 879 854 863 905 955 977 956 911 871 856 867 896 928 955 981
1534 981 1012 1027 995 923 866 863 891 906 908 929 960 955 903 857 863 893 889 840 797 810 871 924 931 904 887 892 888 848 807 816 871 915 921 918 936 950 923 875 854 875
1529 875 902 903 892 901 937 980 1004 1002 978 946 922 924 956 988 973 905 840 839 881 886 829 780 806 881 935 955 969 974 937 869 830 853 905 940 948 928 873 793 739
1524 739 742 770 776 764 779 827 860 845 811 807 834 848 819 767 729 713 705 710 744 802 847 852 836 830 833 827 820 835 872 895 881 844 812 793 785 789 808 840 868 875 850
1519 850 812 805 844 890 896 870 862 886 910 906 882 853 819 800 824 873 890 856 825 839 866 866 863 902 968 1004 996 975 951 909 860 837 842 844 834 835 851 855 849 866 908
1514 908 933 917 893 896 912 923 940 977 1003 992 971 983 1016 1019 982 945 940 950 943 920 904 901 901 900 912 940 961 946 904 880 902 935 937 924 950 1017 1064 1059 1038
1509 1038 1045 1057 1038 1004 991 988 964 934 937 966 976 961 974 1035 1096 1117 1118 1132 1145 1126 1086 1065 1070 1077 1075 1078 1099 1125 1145 1155 1151 1137 1133 1164 1216 1246 1229 1194 1185 1210
1505A210K3lk1j0J6L3L6K9J1j2k1NN1O9L1l3o6m0MK7L2M4O4N3Km5m1ML1J5j5k2qLQK6N2O4
1500A606N0K3kj6j2PK8L3K7K3J5ok9k1RK0MLM0P6O0J1j9j3LJ0K7N3O5M6J6JPJ9K6J9PJ%pj3
1495B197OM9P1L5k1l2RM4M9M5O2P6O6M0K2J0NJ9M9N1Pk6QQ1J00M3j7j0L9O7O2N7O1O0M5M4
1490C473O9R1P5K8JJ9O4R3Q2N9M9N7P1P5Q1Q9R3P7M6K8L7P1J03J12J01R0J00J19J23J08J00
1487E784J17J41J36J11J02J29J63J73J71J85K14K17J90J69J80K08K21K30K56K96L26L31L23
1484A0373L13L07L21L57L98M12M06M16M65N31N85O11O22O41O81P45Q06Q41Q69R31J036J139
1481B3806J213J276J363J477J595J710J850K029K232K431K614K808L040L324L635L959M310
1479F4672M717N163N615O067O563P116P675Q198Q719R273R807J0221J0481J0614J0614J0417
$$ plain form
1505 1210 1233 1230 1209 1199 1215 1248 1284 1313 1324 1312 1291 1296 1347 1416 1447 1414 1348 1308 1312 1339 1371 1415 1479 1532 1534 1489 1448 1452 1483 1498 1483 1461 1453 1456 1464 1490 1542 1606
1500 1606 1656 1679 1677 1661 1649 1656 1684 1717 1744 1767 1782 1776 1747 1726 1735 1755 1759 1762 1802 1878 1938 1949 1930 1917 1920 1930 1957 2010 2075 2121 2137 2138 2145 2164 2190 2209 2216 2217 2217 2210 2197
1495 2197 2203 2252 2323 2358 2337 2305 2314 2358 2407 2452 2514 2590 2656 2696 2718 2728 2733 2752 2801 2852 2859 2833 2841 2922 3022 3065 3048 3038 3077 3144 3206 3263 3324 3384 3429 3473
1490 3473 3542 3633 3708 3736 3737 3756 3820 3913 3995 4054 4103 4160 4231 4306 4387 4476 4569 4646 4692 4720 4757 4828 4931 5043 5144 5234 5334 5453 5576 5684 5784
1487 5784 5901 6042 6178 6289 6391 6520 6683 6856 7027 7212 7426 7643 7833 8002 8182 8390 8611 8841 9097 9393 9719 10050 10373
1484 10373 10686 10993 11314 11671 12069 12481 12887 13303 13768 14299 14884 15495 16117 16758 17439 18184 18990 19831 20700 21631 22667 23806
1481 23806 25019 26295 27658 29135 30730 32440 34290 36319 38551 40982 43596 46404 49444 52768 56403 60362 64672
1479 64672 69389 74552 80167 86234 92797 99913 107588 115786 124505 133778 143585 153806 164287 174901 185515 195932
1477A95932R978R318Q457P361O022M507K905J235n09k263l917n407o734p885q801r444r844
1475A90911j0038j0035r848r545r192q796q324p785p244o749o291n842n407n008m651m315
1473G1841l997l708l457l222k986k757k558k387k224k058j912j803j705j581j443j343j296
1471C1404j257j180j088j030j005r62q77q02p79p83p63p03o45o16n99n67n28n03m95m77m39
1468A5306l95l73l83m00l88l42k96k86l12l31l09k61k37k61k98k97k49j92j72j89k12k14j93
1466H716j69j54j56j81k23k51k28j54q6p1j01j26j24j22j43j58j28o4l6p4j29j34r2n9o2p5
1462E416o8n4o0q1r6r5q8q1p2o9q0r5r2p0n2m9n1m0k2j7m2p6q5n0KJ1m2j03j01m5lj6m1l2
1458C461j1k3o1p1m0pj0l8n9o4m8kO1Q5M1l1o0l8j7l0n8o0l7j9j6j4rj6m0n8n3k3PJ1j1l8
$$ plain form
1477 195932 205910 215228 223685 231046 237068 241575 244480 245715 245206 242943 239026 233619 226885 219000 210199 200755 190911
1475 190911 180873 170838 160990 151445 142253 133457 125133 117348 110104 103355 97064 91222 85815 80807 76156 71841
1473 71841 67844 64136 60679 57457 54471 51714 49156 46769 44545 42487 40575 38772 37067 35486 34043 32700 31404
1471 31404 30147 28967 27879 26849 25844 24882 24005 23203 22424 21641 20878 20175 19530 18914 18315 17748 17220 16717 16222 15745 15306
1468 15306 14911 14538 14155 13755 13367 13025 12729 12443 12131 11800 11491 11230 10993 10732 10434 10137 9888 9696 9524 9335 9123 8909 8716
1466 8716 8547 8393 8237 8056 7833 7582 7354 7200 7114 7043 6942 6816 6692 6570 6427 6269 6141 6077 6041 5967 5838 5704 5612 5553 5491 5416
1462 5416 5348 5294 5234 5153 5057 4962 4874 4793 4721 4652 4572 4477 4385 4315 4263 4214 4163 4123 4101 4084 4042 3966 3881 3831 3833 3844 3802 3699 3598 3553 3550 3534 3493 3461
1458 3461 3450 3427 3366 3295 3255 3248 3238 3200 3141 3077 3029 3027 3088 3173 3214 3183 3123 3085 3068 3038 2980 2920 2883 2864 2848 2834 2825 2809 2769 2711 2658 2635 2642 2653 2642 2604
1454B604m0j5RNj5k5k3l6n8o0k6PLk7m6l6k0pKQkj8j6PJ3j5n4o0k1K7L6jm0l6PK8jl9l3j0
1449A976k2n6m9ML0ml6j1L6M4K3Rll1m8k2Qrm1k3K7L5%j0K6L3j7n8l8jol0k2MJk5k8mJ8K9
1444A709K9Mn5j05r7m8oJ4K8L8K6Jj0j2j9k1RN0N1J4j3j0nj5j8nj0l9n1j7J8Rk3k9r%pKK9
1439A407L1pl8k8NJ6MKJ9K3Lk2j9kJj1j7oRK4L9L8%m9n7j1K9Qm4n3j0L0K8Qjjj1k0j6qpkQ
1434A292Pj6l9l2j0lj3oK9N5L8jj3QK1nm2l9PM7M5K2ROj0m2n9m4j4OJ1J5K0J7nl4l5QN7N3
1429A311kl8j2L3L4kj6lrm6n9k7Kj0l1j2K4K3j3l5k1QK6M2N5M9K2moLkk6m3k5J5L4kn1n8k0
1424A108Mj2j6K6O4L8k3m3j2jl7n9j8N1O6J1m3l5K2O1L9j7m8k6J9M5M8M1K1rk3oJ5Ok4l8k9
1420A166k0j7mPmk3j3K4L8J6ro%j5l3k6j0qlJ6K9J3pJ1M7M5mm5l9oJ1Mj1j7j6mRJ5Lj9k8j1
$$ plain form
1454 2604 2564 2549 2558 2563 2548 2523 2500 2464 2406 2346 2320 2327 2330 2303 2257 2221 2201 2194 2196 2204 2202 2184 2168 2175 2188 2173 2119 2059 2038 2065 2101 2100 2060 2024 2031 2059 2058 2019 1986 1976
1449 1976 1954 1898 1849 1853 1883 1879 1843 1832 1868 1912 1935 1944 1941 1910 1862 1840 1848 1839 1798 1775 1802 1837 1837 1827 1853 1886 1869 1811 1773 1772 1766 1736 1714 1718 1719 1694 1666 1662 1680 1709
1444 1709 1738 1742 1687 1582 1485 1437 1431 1445 1473 1511 1537 1538 1528 1516 1497 1476 1485 1535 1586 1600 1587 1577 1572 1557 1539 1534 1524 1485 1434 1417 1435 1444 1421 1392 1383 1383 1376 1378 1407
1439 1407 1438 1431 1393 1365 1370 1386 1390 1392 1411 1434 1437 1415 1396 1394 1395 1384 1367 1361 1370 1394 1433 1471 1471 1422 1365 1354 1383 1391 1347 1294 1284 1314 1342 1350 1349 1348 1337 1317 1301 1293 1286 1284 1292
1434 1292 1299 1283 1244 1212 1202 1199 1186 1180 1209 1264 1302 1301 1288 1296 1317 1312 1270 1231 1238 1285 1330 1352 1361 1367 1357 1315 1256 1212 1198 1204 1215 1230 1250 1267 1262 1228 1193 1201 1258 1311
1429 1311 1309 1271 1259 1292 1326 1324 1308 1305 1296 1250 1191 1164 1166 1156 1125 1113 1137 1160 1147 1112 1091 1099 1125 1167 1222 1271 1293 1289 1283 1286 1284 1258 1215 1190 1205 1239 1237 1186 1128 1108
1424 1108 1112 1100 1084 1110 1174 1212 1189 1146 1134 1133 1096 1037 1019 1070 1136 1147 1104 1069 1091 1152 1191 1174 1126 1100 1119 1164 1212 1253 1274 1265 1242 1236 1251 1257 1233 1195 1166
1420 1166 1146 1129 1125 1132 1128 1105 1092 1116 1154 1170 1161 1155 1155 1140 1107 1081 1071 1063 1060 1076 1105 1118 1111 1122 1169 1214 1210 1165 1126 1120 1131 1135 1124 1107 1091 1087 1096 1111 1114 1095 1067 1056
1415A056J8L0J4lOK7J5k5m1oL4L4J2PJ1j2m7l7J4M4J8k0j8J5K4pm1m2kM0N0J9j7k2j0j1k9
1410A098j9L1O8M8kj7J1L9L6J6Lrl0m7l6oK0J5j2l6k5K3O9P5L9jj7oJ1K4K7J7MOK9N1N4M1
1405A592K4J6K3M9P8P5L4mRO0Q8P0L7L0M4N3N1M6K3k0o5p8n6k1RK4On1j03r7m0Kj3n1o0m2
1401A742l7n9q0p2m3qK1L0Ql0n2l7jJ8Ll0m8l4qol4m9k2K7M3J3k2j7J7M4M5L3K2QkkORnk3
1396A368k9j8nLJ4K8L5L4L7M5N1M0K1J9L8O4P2O0M4M1M9N1L8K7M1O7O1J7k4j8Nj2n3n7rK4
1392B169mn0m8j4nk7m0l3k8k1JK3J1j7qM0O5M6L8P7J17J07P8P8Q8P2M8O1J01J05P6O5R2J09
1388C372J02J07J39J51J18Q3R4J25J26R5P2O3N2M2N1O0L0l4q7j08j19j35j43j29j08r9j10
1384C810j35j45j12m4om2r8q3QQ3Q5N7N6P3P2P2J10J66J81J45J13J30J78K10J90J28O8O0R4
$$ plain form
1415 1056 1074 1104 1118 1115 1121 1148 1163 1138 1097 1091 1125 1159 1171 1178 1189 1177 1130 1093 1107 1151 1169 1149 1131 1146 1170 1163 1122 1080 1078 1118 1168 1187 1170 1148 1138 1127 1098
1410 1098 1079 1110 1178 1226 1224 1207 1218 1257 1293 1309 1312 1303 1273 1226 1190 1184 1204 1219 1207 1171 1146 1169 1238 1313 1352 1351 1334 1328 1339 1363 1390 1407 1411 1417 1446 1497 1551 1592
1405 1592 1616 1632 1655 1704 1782 1857 1891 1887 1896 1956 2044 2114 2151 2181 2225 2278 2329 2375 2398 2378 2313 2235 2179 2158 2167 2191 2197 2146 2043 1946 1906 1908 1895 1844 1784 1742
1401 1742 1705 1646 1566 1494 1451 1443 1464 1494 1502 1472 1420 1383 1382 1400 1403 1373 1325 1291 1283 1277 1243 1194 1172 1199 1242 1255 1233 1216 1233 1277 1322 1355 1377 1385 1383 1381 1387 1396 1391 1368
1396 1368 1339 1321 1316 1319 1333 1361 1396 1430 1467 1512 1563 1603 1624 1643 1681 1745 1817 1877 1921 1962 2011 2062 2100 2127 2168 2235 2296 2313 2289 2271 2276 2264 2211 2154 2145 2169
1392 2169 2165 2115 2067 2053 2048 2021 1981 1948 1920 1899 1900 1923 1934 1917 1909 1949 2014 2060 2098 2175 2292 2399 2477 2555 2643 2715 2763 2824 2925 3030 3106 3171 3263 3372
1388 3372 3474 3581 3720 3871 3989 4072 4166 4291 4417 4512 4584 4647 4699 4741 4792 4852 4882 4848 4761 4653 4534 4399 4256 4127 4019 3920 3810
1384 3810 3675 3530 3418 3374 3368 3326 3228 3145 3153 3236 3321 3378 3434 3507 3579 3651 3761 3927 4108 4253 4366 4496 4674 4884 5074 5202 5270 5330 5424
1381E424J13Q8O1P5R4O5J7J2L5J6l9n4pJ3m9j21j14o3o0j12j45j33j24j46j71j67j50j43j25
1377D090q9o3p9j13j23r4n8m7m8k9J2M9O0O4Q6J16J13Q0O5J01J55J70J45J11R3Q9R3Q6M8j8
1374E065o9p3o1p2r7r7p5o5p9q9r1j00j03q1n2p0j25j46j06o1p3j20j38j14q0o2n2m6m1l3
1370B594k4k1l5n0n2l6j1J4K3Nk6k7J1N4O6N0L2K8L9O1O9N0K0J0J8Pk9n4n1m6n2n2l7l3m7
1366B468m9k7k7o4q3l5K0J0m4n1qJ2k4n9n0k3j7k3j6mlk1m5n7l3K6O9M9jj1K7N1K6j1j4RK8
1361A995L7L3%m9o5k7K0L6L2M3O3N6K8J4L0N2N1J4k9l0K0O8N3j3m6j1L3L0MJ6N7Q1P1N3L8
1357B758J8oj5mJ2K5L1L1K9M4P8R7P4L1J9M0O4Q1J01J04P0J6%L4P7Q9Q0P2O1M3L3M3N6O3P6
1353D425J07J36J34J03Q0R0J26J59J65J55J62J86J95J64J17J18J71K23K33K18K25K60K90L02
$$ plain form
1381 5424 5537 5625 5686 5761 5855 5920 5937 5949 5984 6000 5961 5907 5900 5913 5864 5743 5629 5566 5506 5394 5249 5116 4992 4846 4675 4508 4358 4215 4090
1377 4090 4001 3938 3859 3746 3623 3529 3471 3424 3376 3347 3359 3408 3468 3532 3618 3734 3847 3927 3992 4093 4248 4418 4563 4674 4767 4856 4949 5035 5083 5065
1374 5065 4996 4923 4862 4790 4693 4596 4521 4456 4377 4288 4197 4097 3994 3913 3861 3791 3666 3520 3414 3353 3280 3160 3022 2908 2828 2766 2714 2668 2627 2594
1370 2594 2570 2549 2514 2464 2412 2376 2365 2379 2402 2407 2381 2354 2365 2419 2485 2535 2567 2595 2634 2695 2764 2814 2834 2844 2862 2869 2840 2786 2735 2689 2637 2585 2548 2515 2468
1366 2468 2419 2392 2365 2301 2218 2183 2203 2213 2169 2118 2110 2122 2098 2039 1989 1966 1949 1926 1910 1906 1903 1882 1837 1780 1747 1773 1842 1891 1890 1879 1906 1957 1983 1972 1958 1967 1995
1361 1995 2032 2065 2065 2016 1951 1924 1944 1980 2012 2055 2118 2174 2202 2216 2246 2298 2349 2363 2334 2304 2324 2392 2445 2432 2386 2375 2408 2438 2442 2458 2515 2596 2667 2720 2758
1357 2758 2776 2770 2755 2751 2763 2788 2819 2850 2879 2923 3001 3098 3172 3203 3222 3262 3326 3407 3508 3612 3682 3698 3698 3732 3809 3898 3978 4050 4111 4154 4187 4230 4286 4349 4425
1353 4425 4532 4668 4802 4905 4985 5075 5201 5360 5525 5680 5842 6028 6223 6387 6504 6622 6793 7016 7249 7467 7692 7952 8242 8544
1350H544L06L12L11L12L33L82M28M45M45M64N19N84O31O57O85P30Q03Q95R92J074J133J189
1347B2174J272J395J545J707J875K049K240K456K704K966L235L543L923M363M806N236N691
1345G3180O197O724P230P728Q223Q663Q972R141R195R113Q813Q258P505O620N597M392L009
1343A98560J512l0j578l098m544n842o929p779q388q751q866q776q569q294p937p476o960
1341I6255o465o009n557n112m716m367m018l654l328l073k857k638k431k260k106j942j786
1339C3936j661j550j422j299j219j163j080r73q92q65q56q23p68p08o47n95n71n73n70n42
1336A5159n01m71m49m32m20m11l86l46l09l01k99k78k48k52k88l04k63j96j55j50j53j55j75
1333H217j96j84j44j38j92k41k14j34r0j02j16j00r6j31j67j65j46j41j42j20q7o9o9o5o6
$$ plain form
1350 8544 8850 9162 9473 9785 10118 10500 10928 11373 11818 12282 12801 13385 14016 14673 15358 16088 16891 17786 18778 19852 20985 22174
1347 22174 23446 24841 26386 28093 29968 32017 34257 36713 39417 42383 45618 49161 53084 57447 62253 67489 73180
1345 73180 79377 86101 93331 101059 109282 117945 126917 136058 145253 154366 163179 171437 178942 185562 191159 195551 198560
1343 198560 200072 200042 198464 195366 190822 184980 178051 170272 161884 153133 144267 135491 126922 118628 110691 103215 96255
1341 96255 89790 83781 78224 73112 68396 64029 60011 56357 53029 49956 47099 44461 42030 39770 37664 35722 33936
1339 33936 32275 30725 29303 28004 26785 25622 24542 23569 22677 21812 20956 20133 19365 18657 18010 17415 16844 16271 15701 15159
1336 15159 14658 14187 13738 13306 12886 12475 12089 11743 11434 11133 10834 10556 10308 10056 9768 9464 9201 9005 8850 8700 8547 8392 8217
1333 8217 8021 7837 7693 7555 7363 7122 6908 6774 6684 6582 6466 6366 6270 6139 5972 5807 5661 5520 5378 5258 5171 5102 5033 4968 4902
1330D902q5j06r6o3n3p8j06j07q3n2k4mkk9o6q9q7n8k9k3m8q6j04r1n8k6j3k1l0k7j6k1l5
1326C086l2k1l2n9n2lK3om1k4Lk5p8p0jL5lm6l8pOJ6M5N7J5n2q1o6l6j0RJ0k2n0m3j7j9n2
1322B319o3k5L2N2J8l4m3PO4N3k6r0p7j5J3j3m5m8l1j9j0jKnlK3M8L8j3o3o6k6ROj2lK1K4
1317A998%oJ4J4k9n9k7L4N1J6j3j6k5m9m7%L9K2k2k7NJ9pm1l7qRKj5k2k1j3MK8L3ln6p4l9
1312A632J2L2K3K0K5J9%oKol0l5kK5Nl9n6l5j2oRM4P2N3km6m6j7J3K3Rk1m0k5J0K5Pj5j0R
1307A620Qj0j2RL2L0Pj9l8m3k7nJrj4nLlj4k0l2l9j9K6M9K5rjK6K8MnKrl8m4j5J2J4Jj6l3
1302A418l9oM0L3l1o4j1O8P6J0n0n2j7J7L8L1kl2k1J6K9ml6k4J9M7L7J1jPJ7J3rk7l1k9l8
1298A403m6l1JK2K1J4K0L3L5K2ll0m7l7mL2M3K0j6k9j1J2Ml0m8l0mqk8k4J5N4O4M7J5k3n4
$$ plain form
1330 4902 4817 4711 4615 4552 4499 4421 4315 4208 4125 4073 4049 4045 4043 4014 3948 3859 3772 3714 3685 3662 3614 3528 3424 3333 3275 3249 3236 3215 3185 3158 3142 3121 3086
1326 3086 3054 3033 3001 2942 2890 2887 2910 2904 2863 2839 2842 2817 2739 2669 2668 2703 2700 2654 2616 2609 2615 2631 2676 2733 2748 2696 2615 2549 2513 2503 2512 2522 2500 2450 2407 2390 2371 2319
1322 2319 2256 2231 2263 2315 2333 2299 2256 2263 2327 2380 2354 2264 2187 2172 2185 2172 2127 2079 2048 2029 2019 2018 2020 2015 2012 2035 2083 2121 2108 2045 1979 1953 1962 1968 1956 1953 1974 1998
1317 1998 1998 1992 2006 2020 1991 1932 1905 1939 1990 2006 1993 1977 1952 1903 1856 1856 1895 1917 1895 1868 1873 1892 1885 1844 1807 1799 1808 1810 1795 1773 1752 1739 1743 1771 1804 1801 1745 1671 1632
1312 1632 1644 1676 1699 1719 1744 1763 1763 1757 1759 1753 1723 1688 1686 1711 1716 1677 1621 1586 1574 1568 1577 1621 1693 1746 1744 1698 1652 1635 1648 1671 1680 1659 1619 1594 1604 1629 1636 1621 1611 1620
1307 1620 1628 1618 1606 1615 1647 1677 1684 1665 1627 1584 1557 1552 1553 1544 1530 1525 1528 1525 1511 1491 1459 1420 1401 1427 1476 1501 1492 1491 1517 1545 1549 1544 1546 1537 1499 1455 1440 1452 1466 1467 1451 1418
1302 1418 1379 1373 1413 1446 1415 1351 1340 1408 1484 1494 1444 1392 1375 1392 1430 1461 1459 1427 1406 1422 1451 1447 1411 1387 1406 1453 1490 1501 1500 1507 1524 1537 1528 1501 1470 1441 1403
1298 1403 1357 1326 1327 1349 1370 1384 1404 1437 1472 1494 1491 1461 1414 1377 1373 1405 1448 1468 1452 1423 1412 1424 1428 1398 1350 1320 1316 1308 1280 1256 1271 1325 1389 1436 1451 1428 1374
1293A374n5l0jPOPKj6l6l4OO0Q6N5j3o3n2nK0jk1jM3O2L8ml6m2k7%J8J9J4Rmk8m3k8OK0QJ
1288A321J6L1J4k7n5m6j4J7L2L5L3L0J7j1m5o0m3oK4L1K1J4J3Oj4k9k3qpj9j2K0L5Km4m3P
1283A213M3K6j0k0nOKljMJ4L1L7J9j1k9k6j4JJ4Qk7n9n0kL7M9N1N4L7kk9j9jmj6k1k7l7k7
1279A206J0L3J0k0pJ4j0n3l7L2O2J7k6nL4K6ppQom1m2KM7O5O0K4m0q4n4K1M7Km1k9J2K8J4
1274A265jj2k7k6JL0K5lk0j0OJ4Pmj6j7lRLj4k0qJ2K4K4J3mk6m1l7nM1N7K0m3p0m0NJ7PJ8
1269A151M8N9K3k7l7KL9K4l1o0l6LQnJ0M3M8Ql5m9m3l3qK9M9L3RLLqj0OJ4lj8jK5K1L%ll2
1264A222n5l0J7J9j8k7OK2jj4K4O7O0K1j0k7l8l4j4j0l8m7JO8P7L0rqj2m3o4l3J6K3k5o9m7
1259A000K9Q2O0%k5QM2L2NjOj1m2m5j0J8J2mkJ2J3nk2j9LK3J5j5l3j0L0M0J1k2k9k0k4l9l5
$$ plain form
1293 1374 1319 1289 1288 1295 1301 1308 1310 1294 1258 1224 1230 1290 1376 1431 1418 1355 1303 1298 1318 1317 1296 1295 1338 1400 1438 1434 1398 1356 1329 1329 1347 1366 1380 1389 1385 1357 1314 1286 1292 1312 1320 1321
1288 1321 1337 1368 1382 1355 1300 1254 1240 1257 1289 1324 1357 1387 1404 1393 1348 1288 1245 1239 1263 1294 1315 1329 1342 1348 1334 1305 1282 1274 1267 1248 1236 1256 1291 1293 1249 1206 1213
1283 1213 1256 1282 1272 1252 1247 1253 1255 1252 1251 1255 1269 1300 1337 1356 1345 1316 1290 1276 1277 1291 1299 1272 1213 1163 1161 1198 1247 1298 1352 1389 1387 1358 1339 1338 1334 1318 1297 1270 1233 1206
1279 1206 1216 1249 1259 1239 1232 1246 1236 1183 1146 1178 1240 1257 1231 1226 1260 1286 1279 1272 1280 1274 1233 1191 1193 1240 1305 1365 1389 1349 1265 1211 1232 1279 1281 1240 1211 1223 1251 1265
1274 1265 1264 1252 1225 1199 1200 1230 1255 1252 1232 1222 1228 1242 1249 1245 1229 1212 1209 1218 1221 1207 1187 1179 1191 1215 1239 1252 1248 1222 1181 1144 1139 1180 1237 1257 1214 1144 1104 1109 1126 1133 1151
1269 1151 1199 1258 1281 1254 1217 1219 1258 1282 1251 1191 1155 1158 1166 1161 1171 1214 1262 1270 1235 1186 1143 1110 1102 1131 1180 1213 1222 1225 1228 1220 1210 1216 1230 1227 1209 1208 1233 1254 1257 1257 1254 1222
1264 1222 1167 1137 1154 1173 1155 1128 1134 1156 1155 1141 1165 1232 1292 1313 1303 1276 1238 1204 1190 1180 1142 1095 1096 1164 1241 1271 1262 1254 1242 1199 1135 1102 1118 1141 1116 1047 1000
1259 1000 1029 1111 1171 1171 1146 1154 1196 1228 1233 1232 1238 1227 1185 1140 1130 1148 1160 1156 1154 1166 1179 1174 1152 1133 1136 1159 1174 1159 1126 1116 1146 1186 1197 1175 1146 1126 1102 1063 1028
1254A028jM6P2O2L0J0K5N4N8J6l7n8l7j1qk0k0mMJOK7K9j8p0o2JL4jm8l9nkk0JN3N9J0j9K0
1250A166O8M9j5n1l3j5l5o7o1j3L2M2K5K7N4O9L7j7l3pJ1qk6j8lnj7k2l4n0l3K0N1J8l1l1
1245A044MJ1j5k2KJ4ORK0kn0n7pL2J2k0kM0M2J0qmj2k5pL5M4J8NL0M1Mm4m2jJ3k0n2m1%L4
1240A039M6M3K5j8o0o5k7OKj5mK8L7Qk3k3mJ3J7J8J2J0K5M5L3j6n6n7m5m7l3K4P9O5Mj7J9
1236A088M0nn8n4rJ3RJ1K0Pk9m7k5J4M0M1K4Kj0j0j3k5k3J0M9N2J5l0m9m3k4jJ6K3J4lk0k4
1231I86pK5L7K1MJ1J8mk5mM1L9k2p0n2jJ7NKRLj2qOkl0l4nK1J3mOL4M5K3j8n5o4l3J6M1K8
1226A001J2J7K1ol6k4K1L4Jk3qJ1nk3MM5K8l5o2j7L5K3j7j6K4L5jl6k8%J0%j2j6j6JL1M9L3
1221A055%j4mMqk6k8k2j5oJ0K6K6Pj2j4kJ5K7K4km4p1n6oK8J4j7j7J2K5NlL1O7N0j1n4m7j8
$$ plain form
1254 1028 1027 1073 1145 1207 1237 1247 1272 1326 1384 1400 1363 1305 1268 1257 1249 1229 1209 1205 1209 1210 1216 1243 1272 1254 1184 1122 1123 1157 1156 1108 1069 1064 1062 1042 1043 1096 1155 1165 1146 1166
1250 1166 1234 1283 1268 1217 1184 1169 1134 1067 1006 993 1025 1067 1092 1119 1173 1242 1279 1262 1229 1222 1233 1225 1199 1181 1178 1173 1156 1134 1100 1050 1017 1037 1088 1106 1075 1044
1245 1044 1048 1059 1044 1022 1024 1038 1044 1053 1073 1071 1021 964 957 989 1001 981 979 1019 1061 1071 1063 1059 1047 1022 1015 1050 1094 1112 1117 1147 1188 1192 1148 1106 1105 1118 1098 1046 1005 1005 1039
1240 1039 1085 1128 1153 1135 1075 1010 983 989 991 976 972 1000 1037 1045 1022 999 995 1008 1025 1043 1055 1065 1090 1135 1168 1152 1096 1039 994 947 914 938 1017 1082 1086 1069 1088
1236 1088 1128 1123 1065 1011 1002 1015 1024 1035 1055 1062 1033 986 961 975 1015 1056 1080 1082 1072 1062 1049 1024 1001 1011 1060 1112 1127 1097 1048 1005 981 980 996 1019 1033 1030 1010 986
1231 986 979 1004 1041 1062 1066 1077 1095 1091 1066 1062 1103 1142 1120 1050 998 997 1014 1019 1021 1030 1033 1021 1013 1019 1017 987 953 948 969 982 978 984 1018 1063 1086 1068 1013 949 916 932 973 1001
1226 1001 1013 1030 1051 1045 1009 985 1006 1040 1041 1018 1010 1021 1016 993 997 1042 1070 1035 973 956 991 1014 997 981 1005 1040 1039 1003 975 975 985 985 973 957 941 942 973 1022 1055
1221 1055 1055 1041 1037 1041 1033 1007 979 957 942 936 946 972 998 1005 993 979 977 992 1019 1043 1041 997 926 870 864 892 906 889 872 884 909 914 911 942 1009 1059 1048 994 947 929
1216I29oj0pRK3K9J7rk8rL5N3K0l1m1qJ8Pj6j8lNnj9k8k6j3J5M3N6M3J6j4l6l9k6nJ1J9K5
1211I76K1Mk2k3QM1L9Ll0l6k2j9k8l6k9JL1M5L2J1NNok6k8lK2J6rk6l7m3l2J3O7Q1M8J5J0
1207A039J2pk8k3opj7qJ9K1j5n1m8j2K1L0K4J9J7J7Pj9m7n2k7PK1J6J1J0MlRL2L6Nk5k1lj1
1202I47m2m7lM7N5K4lj2j4k7m1l9k2PK9K8Nj6j4KPqk1j5J0L8N6M3Ok7k5nnk1j9OOl7p3n0J2
1197G42M7L5J1QK5M6N1K4k7o9o7k9J0L3M2K7pk5kL1K5rj4K1M1K3JJol7m4jL5Rm0l7OJ5k1l6
1192H38ON0M9K6J9K4Qk3m3m1l0j9rlJJ0J3j0m5m8qK4J3j1lK0J2k0k2QJ6k2m5j0M9O4K6pmJ9
1187H72K6Qk4l7j0M0O5M2QJRj2n2o1k4J0Kj8mL1L4Jj9kK5J8j8m2l4pJ9L2K9Qj7j9J2M6L7q
1182I67n0n3l1j9k2k5j9pJ1L5M0J0k6k1J5K2j6m0mM9N4K1nj4m2p1m8K7Q0O6J8j1j4mQJ1k3
$$ plain form
1216 929 923 913 906 915 938 967 984 975 947 938 973 1026 1046 1015 974 966 984 991 975 957 954 959 954 935 907 881 868 883 926 982 1025 1041 1027 991 952 926 921 932 951 976
1211 976 997 1001 979 956 964 1005 1044 1047 1017 981 959 940 912 876 847 848 879 924 956 967 972 977 971 945 917 914 936 952 943 917 880 837 805 818 885 966 1014 1029 1039
1207 1039 1051 1044 1016 993 987 980 963 955 974 995 980 929 881 869 890 920 944 963 980 997 1004 985 938 886 859 866 887 903 914 924 928 925 934 966 1002 1007 982 961 958 947
1202 947 905 858 855 902 957 981 978 966 952 925 884 845 823 830 859 887 892 876 862 864 871 863 842 827 837 875 931 974 980 953 928 923 918 897 878 884 890 853 780 730 742
1197 742 789 824 835 843 868 914 965 989 962 893 826 797 807 840 882 909 902 877 875 906 931 922 908 929 970 993 994 995 989 952 908 907 942 951 911 874 880 895 874 838
1192 838 844 894 943 969 988 1012 1020 997 954 913 883 864 855 852 853 863 876 866 821 773 765 789 802 791 788 808 820 800 778 786 802 780 735 725 774 838 864 857 853 872
1187 872 898 906 882 845 835 875 940 982 990 991 1000 988 936 875 851 861 863 845 841 872 906 907 888 886 911 929 911 869 835 828 847 879 908 916 899 880 892 938 975 967
1182 967 917 864 833 814 792 767 748 741 752 787 827 837 811 790 805 827 811 771 767 816 870 891 886 872 830 759 711 738 818 884 902 891 877 873 881 892 869
1177H69p9q6k1N1N4J2qJ1J8nj8KK5K3Qmj3k2j6MRpj8ML9M7K3j1k2j0J1K2J4lj7k8l3k3nol6
1172G55n1j1M9O1K0mL1O0K6m3o3k5J3J1prkoj4j2jNOJ0J8J3j1l5k8J4N6N6K2JJ1K5J0j9k5
1168I07%K3K2PprkJ2J9Ok4m5l7nK5K7Nk5m3m3k7JK5K5%k6k3jJ1RROpj6kK1Rk4k5OJ4k1l4K0
1162G63O6L6k5k3K4K7j9k8K0L7k2p7n2J5M3K2JopkJ3J2j4l8k5J0L4M2M3K7j4n4o0l5j5pnM
1158G11J6L4M7L0qk1J0L5Ql9n3l0j2rJJ6J4LOK4K5Nj0j7k5k8qJ9K3J5K7L9Nn4o3j0L4K6%J
1153G87Nj1k1lJ2lk4j1J8K8K5L5L6jn1n8j3K8L4J3mpJ0K7K0j6m4k9KJ6J5L7O0M1k2o5n6k4
1148G86j8l1k6LK9K7%k6l0j3QJ4J1O%roJ5K9J9lqMJ0MKJk0n1n2j5J1nk8rL8O0L5j3m7n4l8
1143F10nL0M1K6LoOK7L6K1nk6l0j9nOONPRjk1l3j6J7L7L3J4j2l9m7k0K4L7J1j6j0J9L1J8P
$$ plain form
1177 869 790 704 683 734 788 800 792 803 821 816 798 800 825 848 856 852 839 817 801 805 814 807 789 793 832 879 902 891 869 859 870 892 906 903 886 858 825 802 797 791 755
1172 755 704 693 742 803 823 819 850 910 936 893 830 805 818 829 822 813 811 805 791 779 778 783 789 799 817 830 819 784 756 770 826 882 904 905 916 941 951 932 907
1168 907 907 930 952 959 952 943 941 953 972 978 954 909 872 867 892 919 924 899 856 813 786 787 812 837 837 811 788 787 798 807 816 822 815 799 797 818 827 803 778 784 798 777 743 763
1162 763 829 865 840 817 841 868 849 821 841 878 856 779 727 742 785 807 808 802 795 793 806 818 804 766 741 751 785 827 870 897 883 829 769 734 719 712 707 711
1158 711 727 761 808 838 830 809 819 854 862 823 770 740 728 719 720 736 750 753 759 783 808 813 803 786 761 733 725 744 767 782 809 848 853 799 736 726 760 786 786 787
1153 787 792 781 760 757 769 766 742 731 749 777 802 837 873 872 821 763 750 778 812 825 821 814 824 851 871 855 811 782 784 800 815 852 912 953 931 866 810 786
1148 786 768 737 711 714 743 770 770 744 714 701 709 723 734 740 740 731 725 740 769 788 785 777 781 791 795 797 798 778 727 675 660 671 666 638 629 667 727 762 749 702 648 610
1143 610 605 635 676 702 705 699 705 732 768 789 784 758 728 709 704 710 716 721 728 737 736 715 682 666 683 720 753 767 755 716 669 649 673 710 721 705 695 714 745 763 770
1138G70J2L2M1K5j1l7m2l7m0m4k5J2L2K7J7K1J9PJLok9k9LK1j1n6n4qK6K0J2K9N5N2J6k7m8
1133G49l8j4%kJJ9K6ll8l7kK4K3Rkk0l9l6j1J4K8M3M8K1k2k8J2L9Mn4n7pL7L9K7K9L9K7Kj8
1128H32k6k3j1QJ2j2m1l2J7N5M1rl2j5Lj4l9k5J5L2Ol1m3l6j9kJ2J9K0K6K2ml3k4J6L3Kk4
1124F76%M2L3j6l9mL9K9k6o9n7jM5M5Ok1nL0M0J7j0k0j6j3j1j3qQK9K6mk9pL5L9j1o0o1k9
1119F09LK9M6M3J4qjJ6J4LQJ1j3m7l7J2K8k2p3n8J0N7M9J7J%MJ0J2ll6n4l5LK7K7K1J6Ppj9
1114F84j7j1j9m9p2m9K6R8R7K3m4m0NK8J5J2L9N6L0j5l8k8j1KJ2J5Kk3m6n0k8J0M0L5Kk1j7
1109F53KPLMJ2J1RJ2J4P%ORql1k8oJj0j6nOQJ2K0J8L%J2J9Mj9k6j8MK6L1Kl8m8j8J6K0J0O
1104F96Mlrj1k2l8k2K7N4J6m5n5j7Qlj2LJ5PLK5N5O0L1ol3m0l0k3k5k3LL0K8nj9ML1L9L6M3
$$ plain form
1138 770 782 814 855 880 869 832 790 753 713 669 644 656 688 715 732 753 772 779 780 783 777 748 719 722 743 732 676 622 614 640 660 672 701 756 808 824 797 749
1133 749 711 697 697 695 696 715 741 738 700 663 661 685 708 717 715 695 656 620 609 623 651 694 742 763 741 713 725 764 768 714 657 650 687 726 753 782 821 848 850 832
1128 832 806 783 772 780 792 780 739 707 724 779 820 811 779 764 767 753 714 689 704 736 742 711 668 632 613 611 623 642 662 688 710 706 673 649 665 698 700 676
1124 676 676 718 751 735 696 692 731 760 734 665 608 607 652 697 703 682 677 707 747 764 754 734 718 705 694 681 673 681 710 736 732 703 696 731 770 759 699 638 609
1119 609 612 641 687 730 744 736 735 751 765 768 776 787 774 727 690 702 730 708 635 577 587 644 693 710 711 711 715 725 737 734 698 644 609 612 639 666 687 703 710 703 684
1114 684 667 656 637 588 516 467 493 591 688 711 667 627 632 660 675 687 726 782 812 797 759 731 720 722 734 749 751 728 682 632 604 614 654 689 691 670 653
1109 653 655 662 665 669 681 692 701 713 727 734 734 740 749 741 710 682 676 677 667 651 646 652 660 672 692 710 713 713 725 744 748 729 703 685 689 715 746 748 710 662 644 660 680 690 696
1104 696 700 697 688 677 655 617 595 622 676 692 647 592 575 583 580 568 571 586 593 596 621 676 736 767 761 728 688 658 635 610 587 590 620 648 643 624 628 659 698 734 777
1099G77L9Rk3k3mok4k3kmm4p3l9L1O3L6mlK1K3lj9nJ6J5MJN%j3k3k4k8k5qJ5K6K5K4K7J6n
1094G48j9k4l1m0l3oJ7K0J6J8J5JnNJ1mk1j0J3Rk3l8j3K4L2Pj0KK3K4Jj1J2M4L0l0p2n4lJ8
1089F43LoPJ5RJ7M1M5ko9r6o8k0J5L5N0N6M6K4Jj9l5l7j8J2K3Pj1JK7L0Mj1QL0K2kqpk9n9
1084F74m6PL6Kn0n4j2K8M0L5K3Jj6qK3M1K7nk0qJ2J3rl0k1J4L5J9j0pJ7J9j4m8m7j4K1L8L1
1079G37Ok4l0nK5K2rl8l6j6lnoRL5M7K9%j4qMKrj3kJ1J4Nj2k7l2k5oJ9L6L2RqjK6M0K9J4K2
1074H44M2M4J4j7j7PJ4k0n9n7j7Rj2m1j8M4O8J6n4o3j9J1qk8pL5N1K9jj9k8k2QM4L9j0m1j2
1069G49M3M9pn8n2qJ9J0j4l6m9m4j4K4M1L3J4%ppLNj3l8l7kL3L6J6KJj1l2l9j3K6L6Pk7k5
1064F14J2M4M2K0J6K2%n4q6m9K5O0L0k1m6l9k5j0J0K6K5J0klMNJkLJ0Nj1k5k1nQRJ0J2J5J4
$$ plain form
1099 777 816 825 802 779 775 769 745 722 720 716 672 599 560 591 654 690 686 683 704 727 724 705 700 716 731 735 736 741 741 728 705 681 653 628 620 635 661 686 710 737 753 748
1094 748 729 705 674 634 601 595 612 632 648 666 681 682 677 682 693 689 668 658 671 680 657 619 606 630 662 669 659 661 684 708 709 698 710 754 784 754 682 628 625 643
1089 643 646 640 647 662 671 688 729 774 772 703 607 539 519 534 569 619 675 721 745 746 727 692 655 637 649 672 679 668 669 696 726 730 719 727 757 779 777 769 762 733 674
1084 674 628 635 671 673 623 569 557 585 625 660 683 684 668 660 683 724 751 746 726 718 730 743 734 704 683 697 732 751 741 734 751 770 756 708 661 647 668 706 737
1079 737 743 719 689 684 709 731 722 684 648 632 629 624 618 627 662 709 738 738 724 716 720 722 713 700 698 709 723 728 716 689 657 632 626 645 681 713 722 714 713 739 779 808 822 844
1074 844 886 930 944 927 910 917 931 911 852 795 778 787 775 734 716 760 828 844 790 727 708 719 711 683 676 711 762 791 790 771 743 721 729 773 812 802 761 749
1069 749 792 841 834 776 724 716 735 745 731 695 646 602 588 612 653 686 700 700 693 686 689 694 681 643 606 604 637 673 689 691 692 681 649 610 597 623 659 666 639 614
1064 614 626 670 712 732 748 770 770 716 630 581 606 666 696 675 629 590 565 555 565 591 616 626 624 621 625 630 631 629 632 642 647 636 611 590 585 593 602 612 624 639 653
1059F53J2Mj1j5jJ5Pj7k1kJ0JkJ4J5k2n6l4K0M1J6oJJ2NKRKj9k4KJ7kj4PK2j4n4k5N9R9N5
1054G61j2l7k9k1j0J3J3k7o7n4mK7J6rk5k9k4pJ4L0M9P2O9K5k6k8MJ1k1l8j1K1J9%rj8l5k3
1049E80K4N2Rn3m9J2M3J4j8j2LPJ7L5J8m0n8MP7O7qm8k6Jrk3j2PJ2J6J7mm0n2k8oppQJ3oj1
1044E19K3N6L9lj6nj0l2k4J0K6Lj2J0M3M2J2j1j5j4j5j8j9rJ9N2N6K1j5k5j9k1k4rQPj5k8
1040E87j8kQJ4K3K6J6pk2k1%K0L0K7J1j1l0k5MK9J8j5l4l1k7j8QL4J6l5n0mL7Qn0n3%M7N3
1035E63M2K7jl5l5lJ5Jj5j5j5j7JL8M7Ql0j7K0K1j7l4mM7P3N7J3k5l7l1k4j6KJ7mm4n3j5J9
1030E24J0qJ0L9L1lrK1L7J5j3j7jKoj6j5PM0O3M7Pk8l9l0mK4L0Lk1j0J8J6j2k2kJ5J2J3K4
1025G52K2j0l8l6j6mQJ6Rj1j3J2K6Pj7j3OJ6K2L3K6j3m6l3OJ8QK2N3M5pm3k0K5L6J5KRPj2
$$ plain form
1059 653 665 669 658 643 642 657 664 647 626 624 634 635 633 647 662 640 584 550 570 611 627 621 622 634 639 641 650 652 633 609 611 628 626 612 619 641 627 573 548 607 706 761
1054 761 749 712 683 662 652 665 678 651 584 530 526 553 569 560 535 506 482 475 489 519 568 640 709 734 708 680 684 695 674 636 625 646 665 665 656 638 603 580
1049 580 604 656 665 612 563 575 618 632 614 602 605 612 629 664 682 642 584 588 665 732 724 676 650 651 642 619 607 614 626 642 659 655 615 563 535 529 522 515 523 536 530 519
1044 519 542 598 637 634 618 613 603 571 547 557 583 586 574 584 627 669 681 670 655 641 626 608 589 580 599 651 707 728 713 688 669 648 624 615 623 630 615 587
1040 587 569 567 575 589 612 638 654 647 625 604 604 624 654 681 692 681 651 626 630 659 677 662 628 597 570 552 560 594 610 575 525 521 558 566 516 463 463 510 563
1035 563 605 632 631 596 561 558 573 574 559 544 529 512 513 551 598 606 576 559 579 600 583 549 545 592 665 722 735 710 673 642 618 602 604 621 617 573 520 505 524
1030 524 534 526 536 575 606 603 594 615 652 667 654 637 636 638 632 616 601 608 648 711 758 765 737 698 668 664 688 718 721 700 690 708 724 712 690 688 703 715 728 752
1025 752 774 764 726 690 674 670 678 694 703 692 679 691 717 724 707 694 700 716 738 771 797 784 738 705 711 729 737 759 812 857 850 807 787 812 848 863 865 874 881 869
1020H69k3lL1L5kl6k5J8L2mm1l0J2L4K5J7K2J7ok7k9k1qJ7M7N0K4JOJ5PlJ0L2K8PPL6N5L2
1015A228qk1p%oNM3P2N9K8J6K6K1LJ1N2Q4P3N2N4O6O0M8O1Q3Q0N4N1Q0J03J01J00J25J52J59
1011C108J58J82K33K69K70K54K69L23L80M03M02M14M51M89N21N74O40O64O30O10O61P30P36
1008A3371O96O96P42P65P39P27P59P88P86P92Q25Q36P94P48P40P28O70O10O03O18N97N43N06
1006B9679M82M39L88L63L31K53J63J31J43J05j3j46k38k97l47l78l99m37m91n07m74m58n18
1003B7774o20o84o88o68o64o89p37p84q06p92p57p20o89o80o98p25p29p06o81o63o37o08n92
1000A1757n86n67n43n54n90n81m96l96l45l39l24k97k87k89k65k16j80j78j88j78j50j22j06
997C980j07j19j29j30j21j04q5q1r5j16j12q5n9m6l8k9l7n8o8n5m9o5o8k7K2J7m9j09j02m4
$$ plain form
1020 869 846 843 874 909 907 871 846 864 896 892 851 821 833 867 892 909 931 948 942 915 886 865 857 874 921 971 995 996 1002 1017 1024 1021 1031 1063 1091 1098 1105 1141 1196 1228
1015 1228 1220 1199 1192 1192 1186 1191 1234 1306 1365 1393 1409 1435 1456 1459 1470 1522 1606 1679 1731 1785 1851 1911 1959 2020 2103 2183 2237 2288 2368 2471 2572 2672 2797 2949 3108
1011 3108 3266 3448 3681 3950 4220 4474 4743 5066 5446 5849 6251 6665 7116 7605 8126 8700 9340 10004 10634 11244 11905 12635 13371
1008 13371 14067 14763 15505 16270 17009 17736 18495 19283 20069 20861 21686 22522 23316 24064 24804 25532 26202 26812 27415 28033 28630 29173 29679
1006 29679 30161 30600 30988 31351 31682 31935 32098 32229 32372 32477 32464 32318 32080 31783 31436 31058 30659 30222 29731 29224 28750 28292 27774
1003 27774 27154 26470 25782 25114 24450 23761 23024 22240 21434 20642 19885 19165 18476 17796 17098 16373 15644 14938 14257 13594 12957 12349 11757
1000 11757 11171 10604 10061 9507 8917 8336 7840 7444 7099 6760 6436 6139 5852 5563 5298 5082 4902 4724 4536 4358 4208 4086 3980
997 3980 3873 3754 3625 3495 3374 3270 3185 3104 3009 2893 2781 2696 2637 2591 2553 2524 2487 2429 2361 2306 2257 2192 2124 2097 2119 2136 2087 1978 1876 1832
993A832jqm4o1m3j6j0j4j6l0o4q3n3n%k9k5K0L4j2n4m1mQJ9N8P8L0n6j01r4o8k1M7Q0K7m7
989A233m8NKo2q1rN5L5k1k6J0K1j0m4n4m1j7%lpJ8N8N0j4n8l1K6M2J9kj9m1n0k2J7K2MnNJ3
984I70J6J4Jj7qK9L6k4r0p9j3J9QJ3N0N1j2o4m6jNj1QM5M0j0m0j4K2J4k3m4l4j6KJ9K1j1n8
979G68o5j6M0M2Lj8ML2K9Kk0k7j5J3L8L5J0KJ8K0pl0k7k6m3m0LM7M2J0%Rol5m1k3j3qJ5L1
974G53Lm3l4K7N5J7k7l2k6l7k5L5Q4O3Nk5k2j9j0K5N4K6k8l0K0M8Qm9n9k6J1J9Nj1j1J5L9
970G98L2om1n4n8n1j9L1N4K1l1n3l1OL0M1M4L5Pk6l5pL7N1K0k5m4k5KJ5J6J8K2J8jk2k0KJ9
965G70QoRL5J6n7j02o0J6L4j2l7oK3RoK3O1M5j6o2n8k1J7L5J8k1l2J5P2O2rn6l1J9L0Kj9j6
960F92nJ%j3l3l8rL7N4L9K7L5L4kl8l3PK8j0p3j01o2J1O2N9K1mMJ9Rj2nL2N5K9k4n2l8oJ6
$$ plain form
993 1832 1831 1823 1779 1718 1675 1659 1649 1635 1619 1589 1525 1442 1389 1384 1384 1355 1330 1350 1384 1372 1318 1277 1273 1281 1300 1358 1436 1466 1410 1309 1215 1147 1126 1173 1253 1280 1233
989 1233 1185 1190 1192 1130 1049 1040 1095 1130 1109 1083 1093 1114 1104 1060 1006 965 948 948 945 938 956 1014 1064 1050 992 961 987 1029 1048 1046 1027 986 936 914 931 953 957 952 957 970
984 970 986 1000 1001 984 976 1005 1041 1017 927 848 835 854 862 875 925 976 964 900 854 853 858 847 855 900 940 930 890 876 898 912 889 845 811 795 797 816 837 826 768
979 768 703 687 727 769 772 754 758 790 819 821 801 774 759 772 810 845 855 857 875 895 888 858 831 805 762 722 725 772 814 824 824 833 827 792 751 728 715 707 722 753
974 753 756 713 679 706 761 778 751 719 693 656 631 666 750 813 818 793 771 752 742 767 821 847 819 789 809 857 865 816 757 731 742 761 766 755 744 759 798
970 798 830 824 783 729 671 620 601 632 686 707 676 623 592 598 628 669 713 748 755 729 694 687 724 775 795 770 726 701 703 718 734 752 774 792 791 769 749 751 770
965 770 778 772 781 816 832 775 673 613 629 663 651 614 608 631 640 634 657 718 763 747 685 627 606 623 658 676 655 623 638 710 772 763 707 676 695 725 727 708 692
960 692 687 688 688 675 642 604 595 632 686 725 752 787 821 819 781 748 755 783 773 700 599 537 548 610 669 690 686 690 709 718 706 701 733 788 817 793 741 703 697 713
955G13K1J5Lpolj0k2j1K0K9om6l7J3M2J2l4l3J6N7M9J1j6k1j8j7k0j6j1JK1L6K7j4m9m8j5
951F26Mnj3J1M5N0K0pj6j9k5j7J7M0K3j9m2l6k9l1j6K2M5K4j0j2J7L6L6L9M3K6j0l1k0kkk
946G60J3K3Jk8k8nkk5l1nJ5Jk0nK7K2k2n0k2K4K6j4m0j3L7N2K0k5l5j0J2Jl2m4j9K0L7K8J8
941F62K4L5L3J4qk0j5jMlj2pJ%nNK9L2Nk3j8QK0J3LKPJ7L2M3L0ll0m2m5k9QM6L7j8o3m9J0
936G29N8O5M3J9jj5k5l2l1k6j6jK2M9N3K6pk0k3l6l8KN5N5pn6l7J1K3KoKok8l4j6%KJLrl1
931G19l4pK2L0J8jj8k8k8j9j0kMKmmJ0J1qk7j9%LqpMJ0J5K7K8RnJ2K6mn0m5NK4kk2kJ4nk6
925F08j9rj8k3lJ8J7K1M3M3Mk7j4Qnk2MM1K3l3m7lL4K1poJ6K6J1j5l3l2k3k6m0k6K1N1K8j0
921E97j1J0Kk6j9K7N7M4J8Mj0k9k8oQOLJ0OnpLmk3k5jJ0LQL2L3nm1k5K3M6J9k6m6k4J7L5J3
$$ plain form
955 713 734 749 752 745 739 736 726 704 693 713 742 736 690 653 666 708 720 686 653 669 726 775 786 770 749 731 714 694 678 667 668 689 725 752 738 689 641 626
951 626 630 625 612 623 668 718 738 731 715 696 671 654 671 711 734 715 673 637 608 577 561 583 628 652 642 630 647 683 719 758 801 827 817 786 766 764 762 760
946 760 773 796 797 769 741 736 734 709 678 673 688 689 669 664 691 713 691 641 619 643 669 655 615 602 639 691 711 686 651 641 653 654 622 578 559 579 616 644 662
941 662 686 721 754 768 760 740 725 724 728 725 713 706 707 707 702 707 736 768 773 750 732 740 760 773 776 778 785 802 834 877 907 904 874 832 787 758 766 812 849 831 768 719 729
936 729 787 852 895 914 913 898 873 841 810 784 768 767 789 838 891 917 910 890 867 831 793 795 850 905 898 842 805 816 839 841 835 837 831 803 769 753 753 755 756 759 750 719
931 719 685 678 700 730 748 747 729 701 673 654 644 642 646 648 644 640 650 661 653 626 607 607 610 602 595 599 609 624 651 679 688 683 695 721 717 667 622 627 651 649 627 625 639 634 608
925 608 589 580 562 539 536 554 571 592 635 678 682 655 641 649 644 622 626 667 690 657 610 607 641 662 655 649 665 691 702 687 654 622 599 573 533 507 528 579 607 597
921 597 586 596 598 572 553 580 637 681 699 703 693 664 636 630 638 644 647 657 663 658 651 654 650 627 602 601 611 614 622 654 687 682 641 616 639 685 704 678 632 608 625 660 673
915F73j3j4qk8m2jO4O6on9l6J1J5op%j2k1J0N8P1L3k4o9q7o1pL2K9J6K5L5J7j1j4oj5j8K1
911F11P1O4no9p7l9PL0K7J1QJ4jl7m8qL7L2QK3N2L4k2m3j5Lj8l5j6RRJJJlQL4L4Lk2j3J0J0
905F81lpLJ2J0j1l9l3J7N8K5m3n7KN0L7QRRj8m0k9j2j1%M2N5Lo1o3j9PJ0K3L7J9j3k2j6k1
900E99k0K3O6M4k0m3j2Orj0J2J0k2k8QJ9k9p0l7L2O3N0K7ll8n1k0K2K1lpJ1K1K2K8L2Pk7l0
896F44pRJ1K0J4k5o2l3M2P9M0j2k0qj7l4k5oj2k6j6NKj5jM3N4Ql3j8K8L5kk6%M0M3Qk4k3q
891F72j3l8m7j8K1L1J0lRJ8Kk1j9%Nj2k4j1J2K6L1K0j6o2p7l5K9N2K5j2j9%K0K4J7RRJ0ol3
886E86m6k2L2P3P2L0k4m8k5K0L5Nl0k5RK4J0lLJ1mk3l0k7k6k3j2LJ5K7M1L0ol3k1Kpm5o0l2
881D56RL1L5L5L0J4NJ3K2J0j6l5l9k9j2J0K8L1J6%l%NKpj3j4j0nMJ8K9K2Kj8k2j6j2j3j4j2
$$ plain form
915 673 660 646 638 610 568 567 631 697 691 632 596 607 622 616 609 609 597 576 586 644 715 748 724 655 568 507 500 532 561 577 602 637 654 643 629 623 608 590 611
911 611 682 746 741 672 595 556 563 593 620 631 639 653 652 615 567 559 596 628 636 659 711 745 723 680 665 668 650 615 599 608 617 618 619 620 617 625 659 693 696 674 661 671 681
905 681 678 671 674 686 696 685 646 613 630 688 713 670 613 615 665 702 710 719 728 710 670 641 629 618 618 660 715 718 657 594 575 582 592 615 652 671 658 636 620 599
900 599 579 602 668 712 692 649 637 643 634 624 636 646 624 596 604 623 594 524 487 519 582 632 659 656 618 567 547 569 590 587 580 591 612 634 662 694 701 674 644
896 644 637 646 657 677 691 666 604 571 613 692 732 720 700 692 675 641 616 610 598 572 556 561 563 548 547 590 644 652 619 601 629 664 662 636 636 676 719 727 703 680 672
891 672 659 621 574 556 577 608 618 615 624 642 644 623 604 604 609 597 573 562 574 600 631 651 635 573 496 461 490 542 567 555 536 536 556 580 597 606 615 625 619 586
886 586 540 518 550 623 695 725 701 653 628 648 683 688 658 633 642 666 676 673 676 687 683 660 630 603 577 554 542 545 560 587 628 658 652 619 598 600 593 548 488 456
881 456 465 496 531 566 596 610 615 628 650 660 644 609 570 541 529 539 567 598 614 614 611 611 616 618 611 598 584 574 569 573 591 620 642 644 626 604 588 576 563 549 537
876E37pJ0L6N8M7J0k4l0j4MLqj3KK5K6Lk4k9k5k6k7j3PJ1npJ1L0L1J9J0QJ7K9J8l3q4o5J8
871E36P0L0l9l6L3O5K3l1l9k1k0k8j8KRN%j%J2K9K0qj4K2N3L8Kojk2n4l7J6L9J4jK7M6Pm6
866F76m4oPj7l0qJ0JlJ9L9J7k2k3J7L7jo0p5l6J3L7M1L0J1j0j1J0K6K0Njoj9k2kK5K7J3PJ0
861G02jk6m1l1k0j4ML3M6K2j9m0l6j6OJ8J4OJ5L5K7k2o5n3QN7N6J9k3m3l8j9JJ1J5J5NqmK6
856F22N6M6jm5m7k0OJ0LKJ1K2K1J1kpnJ4L1J5l8p4l7L8N5po1l9J9K3k2m8k9lMNJ8K7K7L7M2
851F80J4m4p0m0PK0QKOjj4j1QK7L5K5qm5m4ON1L8k1n8l8RL3K4KqkJ2J4%j2mJ1J4QNPLnj2j6
845F16k4j9J7N7M5k1o8l8L1O2L8QMkl2m8k3J2Km0n2j5J9Ok5k6OL0K0ql4l9j3L4N5K8j5k1O
841E33J4j8m4k1L2N6K9j8m3k3K1M5K3k1l0J3N5M6jl4l4k0j2lQJ2Omj4j5NM3N9L1j0j3K0L1
$$ plain form
876 537 530 540 576 634 681 691 667 637 623 627 630 622 609 611 636 662 665 641 612 587 561 534 521 528 539 534 527 538 568 599 618 628 636 653 682 700 667 583 518 536
871 536 606 636 597 561 594 659 682 651 612 591 571 543 525 527 536 541 541 540 540 552 581 601 593 579 601 654 692 694 688 687 665 611 574 590 629 643 642 669 715 722 676
866 676 632 626 633 616 586 578 588 589 586 605 644 661 639 616 633 670 669 609 534 498 511 548 589 619 630 620 609 619 645 665 670 669 663 644 622 620 645 672 685 692 702
861 702 701 675 634 603 583 569 573 606 652 674 655 615 579 563 569 587 601 607 622 657 684 662 597 544 552 609 665 684 661 618 580 561 562 573 588 603 608 600 596 622
856 622 678 724 723 678 631 611 617 627 630 632 643 665 686 697 695 688 683 697 728 743 705 631 594 632 687 680 619 580 599 622 600 552 523 520 524 529 547 574 601 638 680
851 680 694 650 580 540 547 567 575 577 583 582 568 557 565 592 627 652 644 599 555 561 612 650 629 571 533 542 575 599 601 593 591 603 617 617 605 601 612 626 634 639 646 649 644 632 616
845 616 592 573 590 647 692 671 603 565 596 658 696 704 708 706 674 626 603 615 617 577 525 510 529 535 510 484 490 520 540 532 498 459 446 480 535 563 548 527 533
841 533 547 529 485 464 496 552 581 563 520 497 518 563 586 565 535 548 603 649 648 614 580 560 548 545 553 565 571 567 553 538 543 586 645 676 666 653 673 704
836G04Nj8nJ1j6o7q3n0j2LJ2M2O5M2j0k9QM7L5pj4J9L0j3n7m0RL0J6MQJj5kL8N3J1m4n7m0
831F14k7j8QM0M8L4K3J8ll8n6m5k1lJ8N3P3N1j3p2q5m4J2L6J9k%J3Kl2n5m7k6kK3M1L2NmJ3
826E83K1Jj8jL5M4K1nk1l9m2qM1M5kl4j0K7J4k9l2J7N7M7Rj0j6k3l2k5j2pj2j4lJ4L6M6L5
822F98jl7m4j5K1L2Ml9n8l0K0M4K7PJ2K4Qk9m9l3nJ1J6J3Jj3pK6M7K7j4l3j1J6J4j8m8m9j8
817E17K1L9K6NNK5K7mn0o5l1K1M8L2jrK2N5M6on1m8oL0L3Qj9l6m0l2k0kK2L8K8rl7k1K6M0
812F27ln6n1NM9M6K5J7Qk7n8l8J8M3K1lJ4L5J6k5k9MK1Lj6j5ojJ1L3K5k6o1k6M4O5L0m%Jk3
807F93l3kK3po0o5j3L0K8PJKJjnj5k3rJ9K7J9J7K4J1k1k4OJ2l3p2l7L9P7N8L1J9Pj1rOjl0
802F86l4LL6J8k4m2k8nJ3K9L0J5KRK4J7j4l6k4MJ9Lk0k7j6j3k6k9rRJj1J7O2O4Om9n2k2MK2
$$ plain form
836 704 709 691 686 697 681 614 531 481 469 472 484 526 591 633 623 594 602 649 684 677 663 682 712 699 642 602 611 641 657 661 669 670 655 653 691 744 755 711 654 614
831 614 587 569 577 617 665 699 722 740 737 699 643 598 577 574 592 645 718 769 756 684 599 555 567 603 622 620 620 633 635 603 548 501 475 473 496 537 569 574 570 583
826 583 604 605 587 586 621 665 686 681 660 621 579 571 612 657 655 621 611 638 652 623 591 608 665 712 721 711 695 672 640 615 603 596 584 570 567 581 617 663 698
822 698 697 660 616 601 622 654 658 619 561 531 551 595 622 629 641 665 673 644 595 562 557 568 584 597 598 585 578 604 651 678 664 631 620 636 650 632 584 535 517
817 517 538 577 603 608 613 638 665 661 611 546 515 536 584 616 615 606 628 683 729 723 672 624 618 648 681 689 670 634 594 562 542 540 562 600 628 619 582 561 587 627
812 627 624 568 517 522 571 617 642 659 667 640 582 544 562 605 626 623 637 672 688 663 634 638 659 662 646 631 625 624 635 668 693 667 606 580 624 689 719 715 715 716 693
807 693 660 658 681 674 614 549 536 566 594 601 602 604 605 604 599 584 561 552 571 598 617 634 658 669 648 624 630 642 609 537 500 539 616 674 705 724 731 720 711 717 716 686
802 686 652 655 691 709 685 643 615 610 623 652 682 697 699 708 732 749 735 699 675 679 698 701 681 654 638 625 599 570 561 570 571 560 577 639 703 709 660 608 586 590 612
797F12L9L3pl9k6J1K0lk5k7k4k3qJ7K4J1NJ9L4L1Qj6l0k4j0pj3lK9L9kn4m7PL4J3jL2O3L7
792G29k3n3l4mQKomJ3L4K5k1o0n2rK2K0Nnq%J3J8NmJ1K6J4j7k1%Lk3k8J4M9J6n9q5l7K0L2
787E26K0L4O4N7op0p2j6L9M4J3j2pPMj2j2RK6Qk4l6j0J9K6J1KNJ4J7J9J6Qmj3k0j9rOQj0k7
782F23k2PL0L0Nl1n6n0j3J9J6pj9qJLJ5L7M7L4J9J2j0m7n6rM6M0j5l7PN2M4Jk0j8k5l6j5K9
777F23M0nn6n3mL0K6J1J0J3J3J7K4J8ok2j5pj7j9PL5L0kj4PK3J1j0j1NJ6J6Mj4k2j1Nnl0k9
772F32J3M2J0m9o0qM4L6j2l8j0L2L9J1rkJ7K1J8J6Nk7n1l7lKj4kL7N1J9j2mK0K1J6K0J4j5
767G83k8kJ9nl9l4rj4k4J4P2O6on2k7Pkk0JL6L9J6PRKj1j3qqLK8M5K9jj2ojkNJ3J1MQJ2Ok
761I09kNRJ1J2Jk4l9l2j6nJ8N6P5M4lpK7M1J1k3k7j1KJ2K3K1%k1j3J9N1N5L4Op%RLqj3qJK1
$$ plain form
797 612 651 684 677 638 612 623 643 640 615 588 564 541 533 550 574 585 590 609 643 674 682 666 636 612 602 595 582 579 608 647 645 591 544 551 585 598 597 629 692 729
792 729 706 653 619 615 623 625 619 615 628 662 687 666 606 554 545 567 587 592 587 579 579 592 610 615 611 622 648 662 645 624 624 627 604 576 590 639 655 596 511 474 494 526
787 526 546 580 644 701 695 625 553 537 576 620 633 621 614 621 625 613 601 610 636 644 620 584 574 593 619 630 632 637 651 668 687 703 711 707 694 674 655 646 652 660 650 623
782 623 601 608 638 668 673 642 586 536 523 542 558 551 532 524 525 528 543 580 627 661 680 692 682 635 579 570 616 656 641 604 611 663 707 708 688 670 645 609 594 623
777 623 663 658 602 549 545 575 601 612 622 635 648 665 689 707 701 679 664 657 640 621 628 663 693 691 677 684 707 718 708 697 702 718 734 738 724 702 691 696 691 661 632
772 632 645 687 697 648 588 580 624 660 648 610 600 632 671 682 673 671 688 709 727 743 748 721 670 633 630 632 618 616 653 704 723 711 707 727 748 764 784 798 783
767 783 755 753 772 767 728 694 685 671 647 661 733 799 793 741 714 721 719 699 700 736 775 791 798 807 809 798 785 777 769 772 800 845 874 873 861 855 854 852 857 870 881 885 893 905 911 909
761 909 907 912 921 932 944 945 921 882 850 834 829 847 903 978 1022 1019 1012 1039 1080 1091 1068 1041 1030 1032 1044 1067 1088 1088 1067 1054 1073 1124 1179 1213 1219 1212 1212 1221 1224 1216 1203 1195 1196 1217
756A217M7N1J6k3k0QJ1j5k4LL0K6J0Kj5m5n2oM8M6%k7j5nk1l3j4J7K1lk6l4l3k9j3PJ8J4P
751A146jj2j9j3mj0k7k8pJ3Lk5l7k8k4l2k9lK5K5Mj3j8k2k2mK2K7Mk4k7j5j9m1m7j2L1M0J5
746G92kQJ6Jj8j5JjrML0K6j0l6k3%Lj0j0LJ3J7J4ol1k9QK9%n1o5l7jL0O2P5L8k3m6j9Jj7l8
741F74k0K4M9L9Mm0o9n3jL8K9RJ8L8J9l1n7m0j0klJ0K7K2Jj0pnj8k2kJ9J3j4k1QM0M2K8K1
736G47J6jj6j4j6m4p6o3rL5M0K5J2nj2RM0L6nk5nQj5l3nK3%m2l2K2M5J1j6J3N9N4no3p2l6
731E85J1L2K9J6J4J4Omrj3j9j3J0K9J4k4m5k9LK6L3L1K2Mk4m6l8ML9K6j6k3K1M4J0k1RO3N6
727H27mm7m7m6n0k9K1M7L1Oqk8m5k4J6K0j8l0J3M2J8oPJ1l3o5j8O0O5Pk5jJ6pk3lK2K0Kj1
722F83k1k3j0J3J3oj0OJl3n2k2K8L7jm0l6PM7M4Mk6j7PJk5l2rJ0RPJ4J9J2RJ0%pJ1M0K6k7
$$ plain form
756 1217 1264 1315 1331 1308 1288 1296 1307 1292 1268 1271 1301 1327 1337 1339 1324 1279 1227 1221 1269 1315 1315 1288 1273 1268 1247 1214 1200 1217 1238 1235 1209 1175 1142 1113 1100 1107 1125 1139 1146
751 1146 1145 1133 1114 1101 1097 1087 1060 1032 1025 1038 1041 1016 979 951 927 895 866 863 888 913 917 904 886 864 842 838 860 887 891 867 840 825 806 765 718 706 737 777 792
746 792 790 798 814 815 797 782 783 782 773 777 807 833 823 787 764 764 767 757 747 750 763 780 794 788 757 728 736 765 765 714 649 612 611 641 703 778 816 793 747 728 729 712 674
741 674 654 678 727 766 770 730 661 608 607 645 674 683 701 739 758 727 670 630 620 618 615 625 652 674 675 665 658 653 635 613 611 630 643 629 608 616 656 698 726 747
736 747 763 762 746 732 716 672 596 533 524 559 599 624 636 631 619 628 668 704 699 674 669 677 662 629 624 647 647 605 573 595 640 651 635 648 707 761 756 693 621 585
731 585 596 628 657 673 687 701 707 703 694 681 662 649 659 688 702 678 633 604 607 633 666 697 719 723 699 653 615 619 658 684 668 645 666 710 720 699 708 771 827
727 827 823 776 729 683 633 604 625 672 703 709 701 673 628 604 620 640 622 592 605 647 665 659 666 677 644 579 561 621 686 693 668 667 683 676 653 650 672 692 694 683
722 683 662 639 629 642 655 649 639 645 646 613 561 539 567 604 603 563 527 534 581 625 629 603 586 593 594 569 537 528 538 547 554 568 587 599 608 618 618 611 622 662 688 661
716F61n1j9J8RqOK9J5k0k5mnk3j7J8L3Nk1nK7L2ln6q0n5ML7J0l2k8K1N2L9J3J0J9K2K8L5J9
712G10k2n0l6JK8M0M7L4rm7m3j4lj7k4j1QK0L1M1L1om7o4m7pL6N9N1K4nk0j9kJ7J7pk3j1J1
707F72J7J1J8L6L3Qj2j3j9l7n1m6k4ML2L8J1k4k2J1K5%k3j7qk2j9K5N8K4m0m4J8O0K9k9m6
702F34k7pOK3L6J9j8l9k8JJ9J2nqJ8M6L9nm2m1k0pjJ1K3J4rk2j2J0K5K5J7Nkj2l0l7j4K8L8
697F63Lk7rK7L4J3QJ8Nl2m9k6KRJ7M3N5J9l9o5l9JK1K1J0lqKJ7K2J5J4J9J6nl0m0k6NL6M6
692G63K9Lj0rj6l2m7m2j6J6L4K6mk5j6QRj2j7J5N2M9J4j0jJ3Kk7m8m6k1J2L4K3rj9PL3K8J6
687G59K9M3J0o1r6o0jJ9MplRK2L0J1l2m6oM2L4j5l7j2Q%pJ0J9NlJ5K4ol5j4L1L0k0o0m8jM6
682F30P3O2J2l8m1j4j8n3m5L6J02O1m1q5l0L2L5OKJ2Jj8rK6M2K6Nkoj3j3ooj1%K0K0rl9m3
$$ plain form
716 661 610 591 609 618 610 616 645 660 640 615 611 606 583 566 584 617 622 601 596 623 655 652 596 516 461 465 502 512 480 452 473 525 564 577 587 606 628 656 691 710
712 710 688 638 602 603 631 671 718 752 743 696 653 639 636 619 595 584 592 612 643 684 715 709 662 598 551 544 580 639 690 714 709 689 670 668 685 702 695 672 661 672
707 672 689 700 718 754 787 795 783 770 751 714 663 617 593 597 629 667 678 654 632 643 668 668 645 628 620 598 579 604 662 686 646 602 620 680 709 680 634
702 634 607 600 606 629 665 684 666 627 599 600 619 631 626 618 636 682 721 716 674 633 613 606 605 616 639 653 644 622 610 620 645 670 687 692 690 678 648 611 597 625 663
697 663 666 639 630 657 691 704 712 730 735 703 654 628 630 639 656 699 754 773 734 669 630 631 652 673 683 680 672 674 691 713 728 742 761 777 772 742 702 676 681 717 763
692 763 792 795 785 776 760 728 681 639 623 639 673 699 695 670 654 662 671 659 642 657 709 758 772 762 761 774 776 749 701 655 634 646 680 703 694 675 682 715 743 759
687 759 788 831 841 780 684 624 623 642 646 639 636 645 667 697 708 676 630 624 666 700 685 648 636 644 644 637 647 666 671 668 683 707 701 666 652 683 713 693 633 585 584 630
682 630 703 765 777 739 698 684 666 613 568 604 706 767 726 641 611 643 678 684 686 698 699 681 672 698 740 766 771 769 763 750 737 731 725 714 714 734 754 745 706 663
677F63l5l7l1LM3N0K6Lqj7k6j2K5N1M4K1OKlj5l3m8m3rL4M8K7jj4k2l6m8l1J4N8P0M0j2n0
672F97m8j2L6O9O8K7l3o0k9J9J8k4m4k2rl1m8k1J3Oj5oK4K4KOL6M5J6nRJ9jk6j7J0J5kj1J
668F96J2Jl0m7k8J5M6L5Mrpj0j6kK6L0Jj8mJ5PJK7N9L9k6p1n5j4Lpj2%J1Nj6k9k7j1J1L7N9
662G01O8N4K2qk5l2k4mJ4J8Ppk2l4l8k1QK5K8L0K6Jl7n4m2k3kK9N9N5J7j2j1j5m0n0j8K2K5
658F90PJ1K2Oj9j6Mlk5j6K4L4Nj1J3K8mm2l8j2KMK1L3J1k9m8l6j4OK2L0K3J4J4Ok3m7l4KJ7
653F32OnorrQK8K2j0k7j9j2j3QM5N0Kl7j2L9L4j9n0k7%rj5J7M6K2l0m5j6ONJ6N1O4K4k8m1
648F86j8jJ1L3N5L8qm0l8l2m2m4k0PJ7J5K6M1L4Qj4k0j4j0rlJ0L5N5M5Qk2k3rpqJQql4l1N
643F83L4K4j9n3n2j1L2L5j1m5j7M1N7J9nJ5K9rn0l6QPl0l5J2M6K4j8k5nNlmJnj8k6k3j6LL0
$$ plain form
677 663 628 591 560 563 606 656 682 685 677 660 634 622 647 698 742 763 769 771 768 753 720 672 629 620 654 702 729 728 714 692 656 608 577 591 649 719 759 747 697
672 697 649 637 673 742 810 837 804 744 715 734 752 728 684 662 653 622 574 553 566 572 557 551 575 599 601 607 643 688 704 699 708 727 726 700 683 693 708 706 695 696
668 696 708 709 679 632 604 619 665 700 704 695 688 678 662 660 686 716 717 699 695 710 717 718 745 804 843 817 746 691 677 680 673 661 661 672 677 661 632 605 594 605 642 701
662 701 769 823 845 837 812 780 756 752 766 784 791 784 762 728 690 669 677 702 730 760 786 787 750 696 654 631 629 658 717 772 789 777 766 751 711 661 643 665 690
658 690 697 708 730 736 717 701 705 702 677 661 685 719 724 713 726 754 750 708 670 658 660 664 685 718 729 700 652 616 602 608 630 660 683 697 711 717 694 647 613 615 632
653 632 638 633 627 618 609 617 645 667 657 630 611 599 586 594 639 689 691 654 642 681 715 696 646 619 619 610 595 612 658 680 650 605 589 595 600 616 667 731 755 727 686
648 686 668 667 678 711 766 804 796 756 718 686 644 600 580 587 604 619 645 686 720 728 714 694 680 670 661 658 668 703 758 803 811 789 766 757 750 742 743 751 743 709 678 683
643 683 717 741 722 669 617 606 638 673 662 617 600 641 698 717 712 727 756 747 697 661 669 676 646 611 623 669 693 675 650 645 650 647 643 644 639 621 595 572 556 559 589
638E89M0J8j2k0ojojK0L6K7Mj5k4k2j1nqnJ5K2pl9j6N1Q4M4j7k9jJ6J2J1J8J6RJ0Lk8n7m6
633F69j5j2l2k6K4O9P0L7Mk5l4j4J8J2l2n6k1K7L4J0oj2k5l3j3J4RrkK1J3k8m4j5J3ll0k1
628E36K0M6L5J2OOj1m9p6m9J6O7N6Rj9rJ0J2PPMmj0j2j4j5mJ1J2%%J6K4J1lOK8L8K4lk9m1
623F71k7ML2L1Pk9n4m9pM0N2K6jkKJkjj2k9k7%J7qm3m1lL1L4J2k0m0k4L4Q0O2%m1l5j4j0j7
618F00j3nKRK1K5J4JNK2L1K4NqmJ8L2J7k1m9n2l1nOnk1j3J7K1k2o5m2K8O4L3j5k1QL3K8Oj4
612F64rK1L6Km5l8K6O0J4m6m3RL7K3PKkmJ5L3Om9o3j4L3J9l2m7j3K4K8Pj1j1lJlmJ0L3M8L6
607G57J2lJPql1m0k4oj0k0j4OOj0KN2Q9O0ml6l6m8p0m8J9N3J2l9k1M6P4M0JJJ6Ok4m3l8j2
602F75K0K9mm7m3K2Q3P1Mm4l6pJj8l4l6k3mJ9L4K2nj7rNMOL1O6P1L1j6k5nQql1l2k1j9k5k2
$$ plain form
638 589 629 647 635 615 609 608 602 601 621 657 684 688 673 649 627 616 611 603 598 613 635 628 589 573 624 708 752 735 706 705 721 733 744 762 778 787 797 800 772 715 669
633 669 654 642 610 584 608 677 747 784 788 763 729 715 733 745 713 657 636 663 697 707 701 689 664 631 618 632 641 632 630 651 664 636 592 577 590 587 557 536
628 536 556 602 637 649 655 661 650 601 525 476 492 559 615 624 605 596 606 618 625 632 636 632 622 610 596 581 577 588 600 600 600 616 640 651 648 654 682 720 744 741 712 671
623 671 644 648 680 711 718 689 635 586 579 619 671 697 696 694 696 697 695 694 682 653 626 626 643 635 592 551 548 579 613 625 605 565 541 575 655 717 717 676 641 627 617 600
618 600 587 582 584 593 614 639 653 654 659 681 712 736 741 733 729 747 779 796 775 726 674 643 638 644 639 618 605 622 643 621 556 514 542 606 639 624 603 611 644 672 678 664
612 664 655 676 712 714 669 631 657 717 731 685 642 651 688 711 718 720 718 714 729 762 768 719 656 642 675 694 662 615 602 626 654 661 650 639 636 637 634 630 640 673 721 757
607 757 769 766 767 774 766 735 695 671 665 655 635 621 627 633 623 625 677 766 826 822 786 750 702 632 584 603 656 668 629 608 654 728 768 769 770 786 792 768 725 687 675
602 675 695 724 720 673 630 652 735 806 810 766 730 723 724 706 672 636 613 609 628 662 684 679 662 653 658 662 668 699 765 836 867 851 826 821 829 821 790 758 737 718 693 671
597F71oJj1k3j2J3K8K9K5K4Rk2m6l9mK4K8J4JkKQJ1Mnrj0k2m1m1oM1N9L3rk3jK4J8j4m1l3
592F47jK2K1J0J1K8M4L8J0k3m1k9kJ6Lk3l1j4Lnk2k0jJ1J1J8L9M3Pl6m3j7mj9l2j8RK7L2K4
587F93ll1k1L3O7M1j1k5rpk4k0RJ6j1k5QM7L8rl8j8K4L7lo2q2l4L3M8Ol4l3j3OL8O9N8Jl1
582G28pJ3k2n3qO0M6l2n2J8N9jp5n8J3L8kl9l1oJ0K4L7L4J5OJ6K4J5jj4k5k4mK9M6L6Qj6l1
577G74l0j6kNNkk8n6n1%N2N7K3lopj0JK5K3j0k6%L0J0m3o9m8j3NJ4K2J5oj4J3N2N4J3l6n4
572F63m2j5J1L8N3M2Qk3l0k1pRK3K0mj9kK5J8j7l8k6j3k7m2k2K0M1L0J5Nj8m6m1QN8N9K6J0
568G29K9M9L7Kk9m1l5j9opj5pK4M3K8pk7k0j3nJ2K7J1k8m1pK4J3j4nL0L3j1n0m5j1J8L4M0
563G40K3j8m4k2K0L1QkK2L0j1o6n4K6Q2M4m8q1j8N8N7ml7lL9L3Jj1%Mormj1l2l7j3J4J6lj5
$$ plain form
597 671 665 666 655 632 620 633 661 690 715 739 748 726 680 641 637 661 689 703 704 702 704 712 723 727 722 713 703 681 640 599 593 634 693 726 717 694 693 717 735 721 680 647
592 647 646 668 689 699 710 738 782 820 830 807 766 737 735 751 754 731 700 686 689 684 662 642 641 652 663 681 720 763 770 734 691 674 670 651 619 601 610 637 669 693
587 693 690 659 638 671 738 779 768 743 734 727 703 683 692 708 697 672 680 727 765 756 718 700 724 761 758 696 614 580 613 661 667 633 600 587 593 631 700 758 759 728
582 728 721 734 712 659 651 711 757 725 673 691 750 749 674 616 629 667 665 626 595 589 599 623 660 694 709 715 731 755 770 769 755 730 706 702 731 777 813 821 805 774
577 774 744 728 726 731 736 734 706 650 599 599 651 708 731 728 722 715 705 706 731 754 744 718 718 748 758 715 646 598 585 590 604 626 641 635 621 634 686 740 753 717 663
572 663 621 606 617 655 708 750 758 735 705 684 677 686 709 729 725 706 704 729 747 730 692 666 653 626 584 562 582 623 653 668 673 655 609 568 576 634 693 719 729
568 729 758 807 844 846 817 776 741 722 716 709 694 687 711 754 782 775 748 728 715 710 722 749 760 732 691 684 708 721 707 702 732 765 754 704 659 648 666 700 740
563 740 763 745 701 679 699 730 738 736 758 788 777 711 657 683 765 809 761 680 662 720 777 773 736 733 772 805 806 795 795 799 793 784 780 769 737 700 687 701 717 714 699
558F99nQJ5J2Kqj5j0kok2l3j6J7L2J0k3k7PM3N3M4L9L9K1j9m8m1rNj1k5lL8N6L0j1k8j7JJ1
553H03J0pl2m8k9MK1Oj8k0jK4M0M0K5PKlk5n3m7NN7N3on9n1QN7N2Jl7k3J9L2Oj8qK1K6Oj4
548H26j7j4pMOrk1oK5L7J2k1l2k2oJ0K6L6K8Lk1k6qQMqjK0J8k0n7n1j2J6J8J8K3Pk6l9oM0
543G55N4L5J0qk2l4k9j1LLloMJ3J6OnlJ0K0Qj6l0j5J6L0J5nQM3N2J2l5m3k1j1k1k0mKplJ9
537G82K3ql8l0LK7L7M2L8J3j6k1lJ5J1j0l7m4k3LMj6j7OK4J2JPPk2m7l1%nk8j3L9O5L7mj4
532G69KJ6J9Rpj4J0M4M0om1k9QK5J6Kj0k0k0oJ8L5M3L8J0k6m7m2k9j6mJj5l5j8L5P0N1RoK
527H81OLMLj7l2j1K8M0Ql6n4m3j7MMj7k2NL0K1njL1M4J9oqpj0LK9K9j5m7k1K7M0J5LJ6J7j
522I40oJ7L0Rj7j7k%mJ7N8O2J8l2l5nQj6m8n8m2j7J1L6N2N3M5L0J5NJ2K8L0J4QK8N0L4j4l9
$$ plain form
558 699 694 702 717 729 731 723 708 698 696 690 668 635 619 636 668 678 655 628 635 678 731 775 814 853 874 855 807 766 757 762 751 726 723 761 817 847 836 808 791 792 803
553 803 813 806 774 726 697 701 722 728 710 690 689 713 753 793 818 825 827 824 799 746 699 704 761 814 808 749 698 706 763 815 816 779 756 775 807 813 795 787 808 834 840 826
548 826 809 795 788 792 798 789 768 762 787 824 836 815 783 761 755 765 791 827 855 858 837 811 803 811 815 807 806 826 844 824 767 716 704 720 738 756 779 786 760 721 715 755
543 755 809 844 854 846 824 790 761 750 753 756 753 747 751 764 780 786 781 778 788 808 816 800 770 755 771 801 816 811 819 862 914 926 891 848 827 816 795 775 771 773 766 763 782
537 782 805 797 759 729 732 759 796 838 876 889 873 852 849 864 875 865 828 784 761 764 768 752 735 741 765 777 778 785 792 770 723 692 692 687 659 646 685 750 787 783 769
532 769 771 787 806 815 808 794 804 848 888 882 841 812 820 845 861 863 853 833 813 807 825 860 903 941 951 925 878 836 807 791 787 788 773 738 720 755 825 876 885 879 881
527 881 887 890 894 897 880 848 837 865 905 913 877 823 780 763 767 771 754 732 737 767 788 783 782 813 857 876 870 862 855 845 848 877 906 891 844 823 850 890 905 908 924 941 940
522 940 934 951 981 990 973 956 954 954 950 967 1025 1087 1105 1073 1038 1033 1041 1025 977 919 877 860 871 907 959 1012 1057 1087 1102 1107 1119 1147 1177 1191 1199 1227 1277 1311 1297 1258
517A258j9J1J2kKJ6Ml4m9pM6N4J6j1mQmk0rJ7K0lk2j8j3k0k0PL6L7Rk3l7m0m1k7QM8N9K6k7
512A244n0j9L7O9N9M0M0N3M9K2oj3J0M9P1N2qo2o8l4jMolK1N1O0L3j6m7l4j0j0l7m3qL6M4
507A569J1k1k1LJ8Nk8n1m2j1J8L1L1K4J6J2J3J6J3RQJ8L4N1M8Rn0p8l9K7N8L7J0J4L0K6Lj4
503A807j4NL2M0Nm7o0rM9M7ml0MN7P6M3j4n4m5J4P9R2M8NOL0K5kqK7O3N9L2K3K7Om0o1k2M4
498B335Q2P0L4LqMK0J1j9l4oK6J1l8o0l8j2j2j8j0j3m9q0p0k7Ljk3m3m2j5J4Pl6n9l8qj0k1
493A830mJ9%m2m8j9j2l5l7jK1Mj2KNk9m4JN5M1j9m1jL0J6j1oJ5K1J6J0ol0m1k4KPjJJ1J7K1
488A682L6M8L5ll5m1l0j5%J4J2j1l6l8j9oj1j4QL9M6K5K0M4N4Qn4o3rL0Ol8l8j0j1m4m8qK0
483A545J0ML5O2L3k0l2KK9K7J9J1j8m6l0K8O0L2nNK5%m7m9NM9L1j9m7l1J1N1N5J8k9l7JM0
$$ plain form
517 1258 1239 1250 1262 1260 1262 1278 1282 1248 1199 1192 1238 1292 1308 1297 1293 1301 1297 1277 1268 1285 1305 1302 1280 1262 1249 1229 1209 1216 1252 1289 1298 1275 1238 1198 1157 1130 1138 1186 1245 1271 1244
512 1244 1194 1175 1212 1281 1340 1380 1420 1473 1522 1544 1538 1525 1535 1584 1655 1707 1699 1637 1569 1535 1534 1538 1532 1529 1550 1601 1661 1694 1678 1631 1597 1587 1577 1540 1497 1489 1525 1569
507 1569 1580 1559 1538 1541 1559 1564 1536 1485 1443 1432 1450 1481 1512 1536 1552 1564 1577 1593 1606 1615 1623 1641 1675 1726 1774 1783 1733 1655 1616 1643 1701 1738 1748 1762 1792 1818 1821 1807
503 1807 1793 1798 1830 1870 1875 1828 1768 1759 1808 1855 1851 1821 1825 1882 1958 2001 1987 1933 1888 1902 1981 2073 2121 2126 2132 2162 2187 2185 2177 2204 2267 2326 2358 2381 2408 2414 2374 2313 2291 2335
498 2335 2417 2487 2521 2524 2516 2520 2540 2551 2532 2498 2492 2518 2529 2491 2431 2393 2381 2369 2351 2341 2328 2279 2199 2129 2102 2105 2104 2081 2038 1996 1981 1995 2002 1966 1907 1869 1861 1851 1830
493 1830 1826 1845 1845 1803 1755 1736 1724 1689 1652 1651 1672 1676 1664 1666 1671 1642 1598 1599 1654 1695 1676 1635 1634 1664 1680 1669 1663 1678 1699 1715 1725 1719 1689 1648 1624 1626 1633 1632 1633 1644 1661 1682
488 1682 1718 1766 1801 1798 1763 1722 1692 1677 1677 1691 1703 1692 1656 1618 1599 1593 1582 1568 1576 1615 1661 1686 1706 1750 1804 1812 1758 1695 1686 1716 1722 1684 1646 1636 1625 1581 1533 1525 1545
483 1545 1555 1559 1594 1656 1689 1669 1637 1639 1668 1695 1714 1725 1707 1661 1631 1659 1719 1751 1746 1751 1776 1776 1729 1680 1685 1734 1765 1746 1699 1668 1679 1730 1785 1803 1774 1737 1738 1778
479A778M5K4MlkNRONRJ4Lk4l6j0M2Q3Q2L6k7n5l0K1M5L3J5J1J2RQK0L3L6K4Kk6m4l2QL8L3
474B204Nj9k2oJ9L5K8J5L1O6P4L6lNL8N1K6nk1j7PL3M0K7K3M1M6K2ML3Q4R3N1Mj7k0j2QK6
469C033J5%J8N9O2K1mK8O8N9K7K9O2O7K5j8j9J7M8M4J4ML3P6Q1N2L9O8R8Q6N4M9P5Q9Q2P5
464D616Q2Q6Q6J00J28J36J07O2L1L2O7J22J60J50J18J16J45J56J30J14J47J89J87J47J25J40
461G679J63J79K02K29K23J81J47J64K18K64K93L15L30L21K90K75L08L72M34M76N04N15N07
458A4589M93N13N86O70P10P02P05P52Q21Q68Q98R43J008J063J097J135J191J241J270J301
456C2556J350J401J415J396J374J359J342J314J282J234J143J016Q89P86O84N61M23K91J77
454E1993P2l2j42k56l56m21m50m70m88m88m65m50m46m22l53k72k20j71p2N9J54J90K39L58
$$ plain form
479 1778 1823 1847 1851 1848 1846 1851 1860 1866 1871 1880 1894 1897 1873 1837 1827 1869 1952 2034 2070 2043 1988 1958 1979 2024 2057 2072 2083 2095 2104 2112 2132 2165 2201 2225 2227 2201 2157 2125 2133 2171 2204
474 2204 2209 2190 2168 2162 2181 2216 2244 2259 2290 2356 2430 2466 2463 2468 2506 2557 2583 2578 2557 2540 2547 2580 2620 2647 2670 2711 2757 2779 2783 2816 2900 2993 3044 3048 3031 3011 2999 3007 3033
469 3033 3048 3048 3066 3125 3187 3208 3204 3232 3300 3359 3386 3415 3477 3544 3569 3551 3532 3549 3597 3641 3655 3659 3692 3768 3849 3901 3940 4008 4106 4192 4246 4295 4370 4459 4541 4616
464 4616 4698 4784 4870 4970 5098 5234 5341 5403 5434 5466 5533 5655 5815 5965 6083 6199 6344 6500 6630 6744 6891 7080 7267 7414 7539 7679
461 7679 7842 8021 8223 8452 8675 8856 9003 9167 9385 9649 9942 10257 10587 10908 11198 11473 11781 12153 12587 13063 13567 14082 14589
458 14589 15082 15595 16181 16851 17561 18263 18968 19720 20541 21409 22307 23250 24258 25321 26418 27553 28744 29985 31255 32556
456 32556 33906 35307 36722 38118 39492 40851 42193 43507 44789 46023 47166 48182 49071 49857 50541 51102 51525 51816 51993
454 51993 52065 52033 51891 51635 51279 50858 50408 49938 49450 48962 48497 48047 47601 47179 46826 46554 46334 46163 46091 46150 46304 46494 46733 47091
451D7091N18O42P14P91R15J066J194J291J395J527J667J780J865J954K056K141K183K203K221
448G5214K229K205K152K087J996J852J662J453J236R93P30M64J83j28m35o76q59j062j313
446H9983j549j709j819j929k023k056k037k020k011j978j909j835j766j685j589j497j411
444E9160j316j206j096r83q63p46o50n63m62l51k54j68p0L1R9J44K16L28M30M80N05N35N52
441E3752N14M35L71L46L20K63J82J07L3p2k33m15n61o56p36q39r48j036j110j189j253j273
438D6002j267j280j310j303j257j237j265j279j225j138j076j035r85r41r39r51r18q43p75
436B4978p24o61n94n66n74n60m98m46m42m46m01l21k61k36k12j70j26r1n6nM7Q0Q2N6L0L4
433A7917O5P4K3p1j58k17k68l26l81m11m25m39m60m66m45m16m12m31m33l77k91k39k52k83
$$ plain form
451 47091 47609 48251 48965 49756 50671 51737 52931 54222 55617 57144 58811 60591 62456 64410 66466 68607 70790 72993 75214
448 75214 77443 79648 81800 83887 85883 87735 89397 90850 92086 93079 93809 94273 94456 94328 93893 93217 92358 91296 89983
446 89983 88434 86725 84906 82977 80954 78898 76861 74841 72830 70852 68943 67108 65342 63657 62068 60571 59160
444 59160 57844 56638 55542 54559 53696 52950 52300 51737 51275 50924 50670 50502 50432 50463 50562 50706 50922 51250 51680 52160 52665 53200 53752
441 53752 54266 54701 55072 55418 55738 56001 56183 56290 56323 56251 56018 55603 55042 54386 53650 52811 51863 50827 49717 48528 47275 46002
438 46002 44735 43455 42145 40842 39585 38348 37083 35804 34579 33441 32365 31330 30345 29404 28465 27514 26596 25753 24978
436 24978 24254 23593 22999 22433 21859 21299 20801 20355 19913 19467 19066 18745 18484 18248 18036 17866 17740 17649 17593 17588 17635 17715 17797 17853 17883 17917
433 17917 17982 18056 18079 18008 17850 17633 17365 17039 16658 16247 15822 15383 14923 14457 14012 13596 13184 12753 12320 11943 11652 11413 11161 10878
430A0878k78k32j81j54j42j35j30j17q5m3oK3M9O5O6O7Q9J23J41J59K19L11L77L90M06M75
427A2335N62O02O03O09O21N89N26M91M91M43L02J26mj07k36l80m81n42o17p06p41o97o32o09
424A2548o08n82n35m86m32l63l15l26l57l25k22j45j57k00j90j29q8q5p0l1j9n7q0l2M8Q1
421F843O6P0J12J40J32J44K12K82K92K59K48K71K84K73K56K29J64Q2L4K3rr4j92k58l05l51
418I207l70l42k90k67k81l01l15l18k95k32j65j53j95k31k12j52j05q9r3j00j00q6n3k8l7
415D397p4j02r4o7m6l4k2j7l9p5q5o3n1o3o1j6K7Rl9m7j6j2m8o4l3mqj3QJ9j1l1mJ9j5o4m8
410C113NJ1l8o4l1Lmk3k9l9n7n1lM6N5L3Mk3m2l7rPql2l9l5l1k4j2nqmJ0Pk0m2l5qK4M6M1
405B652Kl6k6K0M2K4J5L8M0j7r2j10o3PN8Q0O0J2l4n2n3m3j5J5Rl2l9OL7Nl5j5K2jn0l1L9
$$ plain form
430 10878 10600 10368 10187 10033 9891 9756 9626 9509 9424 9381 9375 9398 9447 9512 9578 9645 9734 9857 9998 10157 10376 10687 11064 11454 11860 12335
427 12335 12897 13499 14102 14711 15332 15921 16447 16938 17429 17872 18174 18300 18296 18189 17953 17573 17092 16550 15933 15227 14486 13789 13157 12548
424 12548 11940 11358 10823 10337 9905 9542 9227 8901 8544 8219 7997 7852 7695 7495 7305 7176 7088 7003 6933 6902 6883 6826 6746 6714 6762 6843
421 6843 6909 6979 7091 7231 7363 7507 7719 8001 8293 8552 8800 9071 9355 9628 9884 10113 10277 10359 10393 10416 10407 10313 10121 9863 9558 9207
418 9207 8837 8495 8205 7938 7657 7356 7041 6723 6428 6196 6031 5878 5683 5452 5240 5088 4983 4894 4801 4701 4601 4515 4462 4434 4397
415 4397 4323 4221 4127 4060 4014 3980 3958 3941 3902 3827 3742 3679 3628 3565 3504 3488 3515 3524 3485 3438 3422 3410 3362 3298 3265 3261 3253 3240 3248 3267 3256 3225 3221 3240 3225 3161 3113
410 3113 3118 3129 3091 3027 2996 2999 2995 2972 2943 2904 2847 2796 2793 2839 2894 2927 2931 2908 2866 2829 2820 2827 2819 2787 2748 2713 2682 2658 2646 2641 2633 2629 2639 2646 2626 2584 2549 2541 2565 2611 2652
405 2652 2654 2618 2592 2612 2654 2678 2693 2731 2771 2754 2662 2552 2489 2496 2554 2634 2694 2706 2672 2620 2567 2524 2509 2524 2533 2501 2462 2468 2505 2510 2475 2460 2482 2481 2431 2400 2439
400B439N6Ll1%K6mm0k8nk6n8l4L6P3M3j5m1k0K0L9J9j4l5l8l5j9J5L7K0j5j8QJ2k0l7j8lj6
396B276j9J5M7L6J5K0L1Ql2l6j0%j2j4%Lj2j5jJ2QKLj%J2K3J1j5k1p%mMK8L9K5QNkk2l3j6
391B359J5L6M3M1K8J0KNMoj2nlj6k6j7%%j0kJ6J2k6n9m3J0N3M5Jm1m9l3j2LJ5K3K6J7MJPJ5
385B431Nj4j5K3P0P5K5k9m1j6J3L8N4L8j6o0l9J9L4j3m2JO4O7J7j5%J6om2n0l1j8j8j0J2K4
381B551Mk8l7k4j7k6k5%K1J3mQL4K4k4n3k5J5J9j3l2j6J3K8K0kk5l2k4j5pQK7L0J1kNJ4RM
376B427J1J2rl0k4rk2m7l7ML0J6nnNJ3K2K9J6k0m4m4l4l0j9LJ1%NM2N8J8m0m6j3lk4k0K0L6
371B253%k9oK8Qm1m2J6N4K3l1l7KK3Mj4jJ9Ml4m3mM4M7Rk5k5kK1K4Qk3m2k6J3K8lm3m1kK0
366B134lk9k1RJ6j2l8l9k7j8lJ6K0kj6RN1N9K8OJ9L6J9pmJ7J0l5o9n3pL3N2N1K7j7o0o3k5
$$ plain form
400 2439 2495 2498 2467 2467 2493 2489 2449 2421 2416 2390 2332 2298 2334 2407 2450 2435 2394 2374 2394 2433 2452 2438 2403 2365 2330 2311 2326 2363 2383 2368 2350 2358 2370 2350 2313 2295 2292 2276
396 2276 2257 2272 2319 2355 2370 2390 2421 2429 2397 2361 2351 2351 2339 2325 2325 2328 2316 2301 2300 2312 2320 2322 2325 2324 2324 2336 2359 2370 2355 2334 2327 2327 2323 2327 2355 2394 2419 2427 2432 2430 2408 2375 2359
391 2359 2374 2410 2453 2494 2522 2532 2534 2539 2543 2537 2525 2520 2517 2501 2475 2458 2458 2458 2448 2446 2462 2474 2448 2389 2346 2356 2409 2454 2455 2414 2365 2332 2320 2323 2338 2361 2387 2404 2408 2409 2416 2431
385 2431 2436 2422 2407 2430 2500 2575 2600 2571 2530 2514 2527 2565 2619 2657 2641 2581 2542 2561 2595 2582 2540 2541 2605 2672 2689 2674 2674 2690 2684 2642 2592 2561 2543 2525 2515 2527 2551
381 2551 2555 2527 2490 2466 2449 2423 2398 2398 2419 2432 2428 2436 2470 2494 2470 2417 2392 2407 2426 2413 2381 2365 2378 2406 2426 2424 2399 2367 2343 2328 2321 2329 2356 2386 2397 2395 2400 2414 2423 2427
376 2427 2438 2450 2441 2411 2387 2378 2356 2309 2272 2276 2306 2322 2317 2312 2317 2330 2352 2381 2397 2377 2333 2289 2255 2225 2206 2209 2220 2220 2225 2267 2325 2343 2303 2257 2244 2241 2217 2197 2217 2253
371 2253 2253 2224 2218 2246 2254 2213 2171 2187 2241 2264 2233 2196 2198 2221 2225 2211 2210 2229 2233 2199 2156 2152 2196 2243 2252 2227 2202 2200 2221 2245 2253 2230 2188 2162 2175 2203 2200 2157 2116 2114 2134
366 2134 2131 2102 2081 2090 2106 2094 2056 2017 1990 1972 1969 1985 2005 2003 1987 1996 2047 2106 2134 2140 2159 2195 2214 2207 2203 2220 2230 2195 2126 2073 2066 2099 2151 2202 2229 2212 2152 2089 2064
361B064K0L1Rj4j1J0J6%j5%K7K7jj5JJ0j7m6l3RK4MrKJ3mk1j4NOOK4N2N1J9j3j8jJ8L2L3J1
356B292l0n9n1pM6O1K7l3n8k2L5N1J1l6m3j3J5K8L4L9K9Jk3k6j2MK0K8J3k1l9j3L5M8J4k0
352B325j7RJ7%k2l0k3kJ8J1k1l3%M0L7NRM7N5Jn1l7J8M4K5LRL0L8K5jrRK6Qk6k5K0M9K8jJ0
347B618K9Pl2l1OK4K0K9M1K1j2kN1O6J6k9j4J9J6qj9j3jK7N2K3n2q8l1L6K3l3m5j6k6o7n2
342B553L6R2N1j8k7PJ4j0j2K4N1L8kl6m7l0ML4K5j3l4mN5Q1M1k9p0n6j2K5L1J0rLM2O2K5l3
337B862m8j7Kk1l8lM2L5nk0JJ2j1l2k4jLj5l8m7k7RL1K1QK3M0K2k5n8o3n3k1L8Q2N0l3q2o6
333B533m0l9l0RK9jl6k6NQj0j4mpjL7P2M9j7n5l6rj2k3mK8L6Rk5l5j6J6K6Jm0n8l1K3O6P0
328B448L7ol2k9j5rk4m8n0j4L0L0k1n5l1J2Ml4k6L0N4J1k6rJ5pl1oL5K5k2m0j7rl3m3j3L3
$$ plain form
361 2064 2084 2115 2124 2110 2099 2109 2125 2125 2110 2110 2137 2164 2163 2148 2149 2159 2142 2096 2063 2072 2096 2100 2091 2093 2106 2102 2081 2067 2072 2078 2084 2108 2160 2211 2230 2217 2199 2198 2216 2248 2281 2292
356 2292 2262 2203 2152 2145 2191 2252 2279 2246 2188 2166 2201 2252 2263 2227 2184 2171 2186 2214 2248 2287 2316 2317 2294 2268 2256 2260 2280 2308 2321 2300 2261 2248 2283 2331 2345 2325
352 2325 2308 2317 2334 2334 2312 2282 2259 2257 2275 2286 2265 2232 2232 2272 2309 2314 2323 2370 2425 2426 2375 2338 2356 2400 2425 2428 2437 2467 2505 2530 2529 2520 2529 2555 2563 2537 2512 2532 2581 2609 2608 2618
347 2618 2647 2654 2622 2591 2597 2621 2641 2670 2711 2732 2720 2718 2769 2835 2851 2822 2808 2827 2843 2835 2816 2803 2802 2829 2881 2904 2852 2764 2733 2769 2792 2759 2714 2698 2672 2605 2553
342 2553 2589 2681 2732 2714 2687 2694 2708 2698 2686 2710 2761 2799 2797 2761 2714 2684 2688 2722 2747 2734 2700 2696 2751 2832 2873 2844 2774 2718 2706 2731 2762 2772 2763 2766 2808 2870 2895 2862
337 2862 2814 2797 2799 2778 2740 2737 2779 2814 2809 2789 2790 2802 2791 2759 2735 2734 2737 2722 2684 2637 2610 2619 2650 2671 2679 2702 2742 2764 2739 2681 2618 2565 2544 2582 2664 2714 2681 2599 2533
333 2533 2493 2454 2424 2433 2462 2461 2425 2399 2404 2412 2402 2388 2384 2377 2376 2413 2485 2534 2517 2462 2426 2417 2405 2382 2378 2406 2442 2451 2426 2391 2375 2391 2417 2418 2378 2320 2289 2312 2378 2448
328 2448 2485 2479 2447 2418 2403 2394 2370 2322 2272 2258 2288 2318 2297 2242 2211 2223 2227 2193 2167 2197 2251 2262 2236 2227 2242 2235 2204 2198 2233 2258 2236 2196 2179 2170 2137 2094 2081 2114
323B114N6M3J0j9k2j6l3o0m3K8O9J8o1p3k7KQL1N2K0l8m5nJ2nOM2L0k8l9K1M6j7o9l3K5J1
319B011l0j3L9M5R%K1J9j0k0j5k7l9j3L7M8J6pjNjJQj0m1l5PL5K9K4K6Jm9o8l7j4l6n9k8L3
314A861N6K3j6j8J1L2K4mj7lJ5J0j4k9k1nOOj0k8j5K8N5K8j6k0PJ1j2j4J3K2rl6l1k0k7k9
309A814jK4J0k5l7k5j6j7j1OK6M5M7K2k0l5j8lj3j9LK0Jk5j4J1Nk1j2L9O3K3l1m2qK1K0%j3
304A794j6j2j3j6j5poj0kK3M3L1j1m8n4k3K0L5Pl4k6L6P9M3k5l7K4P1M1k7n6k5J9K4j4n7o4
300A692l4KJ0qk5j9J1N1P4N7J2j9j3Nlj7LL8K2n2r6n1K5M4Nj9ppl3l9KM0K0k3k0L3O3K9k6
295A727m7l1j1RK7K7om9n8k0K6M6L0rm7n1rL9M2%l1k3m%jlj9m1k3L3O4K8j6MM9L8j9l8lK0
290A650jj8JNl1n5k7J3J1oJ4M9L6j3l7j8Kkonj1j4J2N1M9lm3k8pk3m9k9K3M8K9PQQoj5kRm
$$ plain form
323 2114 2170 2213 2223 2204 2182 2166 2133 2073 2030 2058 2127 2145 2084 2011 1984 1986 1994 2025 2077 2097 2059 2014 2009 2021 2016 2022 2064 2094 2066 2027 2048 2094 2077 2008 1975 2000 2011
319 2011 1981 1968 2007 2052 2061 2061 2082 2101 2091 2071 2056 2029 1990 1977 2014 2062 2078 2071 2070 2075 2074 2075 2083 2073 2032 1997 2004 2039 2068 2092 2118 2119 2070 2002 1965 1951 1915 1856 1828 1861
314 1861 1917 1940 1924 1906 1917 1949 1973 1969 1952 1949 1964 1974 1960 1931 1910 1905 1911 1917 1907 1879 1864 1892 1947 1975 1959 1939 1946 1957 1945 1931 1944 1966 1957 1921 1890 1870 1843 1814
309 1814 1813 1837 1847 1822 1785 1760 1744 1727 1716 1722 1748 1793 1840 1862 1842 1807 1789 1786 1773 1754 1757 1777 1778 1753 1739 1750 1755 1734 1722 1761 1824 1847 1816 1774 1766 1787 1807 1807 1794
304 1794 1778 1766 1753 1737 1722 1715 1709 1699 1697 1720 1763 1794 1783 1735 1681 1658 1678 1713 1720 1686 1660 1696 1775 1818 1793 1756 1780 1851 1892 1865 1809 1784 1803 1827 1813 1756 1692
300 1692 1658 1660 1670 1662 1637 1618 1629 1680 1754 1811 1823 1804 1791 1796 1793 1776 1779 1817 1839 1787 1691 1640 1665 1709 1714 1695 1688 1681 1648 1609 1611 1651 1671 1648 1628 1661 1724 1753 1727
295 1727 1680 1649 1638 1647 1674 1701 1695 1646 1588 1568 1594 1640 1670 1661 1614 1563 1554 1593 1635 1635 1604 1581 1577 1577 1576 1573 1554 1513 1490 1523 1587 1615 1599 1603 1652 1690 1671 1633 1630 1650
290 1650 1649 1631 1632 1637 1606 1551 1524 1537 1548 1542 1556 1605 1641 1628 1591 1573 1575 1573 1567 1562 1551 1537 1549 1600 1649 1646 1603 1575 1568 1545 1496 1467 1490 1538 1567 1574 1582 1590 1584 1569 1567 1576 1572
285A572k1nL0L7Lk5j2J8J2k3l2OM5L4qk6rnl5o2m3LK0nl0k8j3j1j7rJ7M3M8L2Ll0m5l0LJ8
280A420J2QL0M9L1j4m4m1k4j3KK2K8J0mPJ4ol4l0JK1K1K3K9Ql5m6KN3M0k4o7n0jL8N2L5pm3
275A473m4j5Kj8m9m9j2L7P4P6L6k7o6n0qK2K9L0L1J9kj5k0l2m2l1kJ3MKK4L7J0k9l1JJ4j6
270A376m8l5RL6K6QJ3L5L9J4k0l5l3k8k0jK3K3pl4k7mQJ0K2L6K6lj8lJ2Nj5k9l2l0j2K1M1
266A349L0lk9l7k5KL0L5J1j3j0Jok9l5j4J1J8J3RRJ0NjlLKj4k9j3K2L1qn3m3J1N1M2QpQL1
261A370K5j5o3o9l0Kj0m1l6%K3J6J3K5L0J8J8L1K4j3l5j5Mj2k9KM5K5m6q4l9L1N4L6K4K7J4
256A320k2m5l1PL3K9Nj7k2j4mJjkOJ4J9J6J1Nok3k5PN4O2J1n2o6l3mj1k3rJ7J7j0l1j9J3L5
251A212M0L2J7nk4l2k6j1OK5L6L3J8QOJk0m3m6k5j1k0m2m2j3K3L7K1%kJ5K7J3k1m2l4%L5N4
$$ plain form
285 1572 1551 1546 1576 1613 1616 1591 1579 1597 1609 1586 1554 1560 1605 1639 1631 1605 1596 1591 1556 1494 1451 1454 1474 1469 1439 1411 1398 1387 1370 1361 1378 1421 1469 1501 1504 1474 1429 1399 1402 1420
280 1420 1432 1440 1470 1519 1550 1536 1492 1451 1427 1414 1416 1438 1466 1476 1472 1479 1493 1487 1453 1423 1424 1445 1466 1489 1518 1526 1491 1445 1447 1500 1540 1516 1449 1399 1398 1436 1488 1523 1516 1473
275 1473 1429 1414 1416 1398 1349 1300 1288 1325 1399 1475 1511 1484 1418 1368 1360 1382 1411 1441 1472 1491 1489 1474 1454 1422 1380 1349 1347 1360 1364 1366 1390 1427 1437 1408 1377 1378 1392 1376
270 1376 1328 1293 1302 1338 1364 1372 1385 1420 1459 1473 1453 1418 1385 1357 1337 1336 1359 1382 1375 1341 1314 1310 1318 1328 1350 1386 1412 1409 1391 1388 1400 1405 1390 1361 1329 1299 1287 1308 1349
266 1349 1379 1376 1347 1310 1285 1287 1317 1352 1363 1350 1340 1341 1335 1306 1271 1257 1268 1286 1299 1308 1317 1327 1332 1331 1328 1331 1333 1319 1290 1277 1299 1330 1322 1269 1226 1237 1288 1330 1338 1331 1339 1370
261 1370 1395 1380 1317 1248 1218 1220 1210 1169 1133 1133 1156 1172 1185 1210 1240 1258 1276 1307 1331 1318 1283 1268 1272 1260 1231 1233 1278 1303 1257 1173 1134 1165 1219 1255 1279 1306 1320
256 1320 1298 1253 1222 1229 1262 1291 1296 1279 1257 1243 1239 1240 1239 1237 1243 1257 1276 1292 1303 1308 1302 1279 1254 1261 1315 1377 1388 1336 1270 1237 1233 1222 1199 1190 1207 1224 1214 1183 1164 1177 1212
251 1212 1252 1284 1301 1296 1272 1240 1214 1203 1209 1234 1270 1303 1321 1329 1335 1336 1316 1273 1227 1202 1191 1171 1129 1087 1074 1097 1134 1155 1155 1153 1168 1195 1208 1187 1145 1111 1111 1146 1200
246A200M7K3mqOJ7J0qk0k0j1NK0K2J0nj0j3j9k2j1OJ0NOJ0ol5m7k8KJ4RPJ6K1J4mk9n1n8m3
241A028j8OK3L4L5K7J6J2K0K4J8Jj1j5j8k3k3mL8O6M9nm3l6j2j4l6l4KL3K4JkJ4J5Moqj8k9
236A135j9J2L0J6j2k4j8oRK2K3J4J0J7J1j6m1l4j4jOJ3Kl8p0n1oJ2MJ5N0O0K7%RK1Mj3PL7
231A203K9j2l9m3m5m5k1RJ6LJJ0NoQM0M9K7J2K0J5k0m0j9Lj7n8o0k3Kmj1KJ6J5J3K7M8N0K5
226A185j7n7o9l8J8M2J4l2l1J6M9K5k1k9MK0nk9j4K9N0L3Mj8k3j1RJ4rl0j5K0L5K3J3K6L6
222A217K1j4m3n6m6j9RJ2KPL1L5Nk9l3k1k7m5m7k5JJ5K8N5Q0P0J1o4r3n2J1L3J3OK9M8L5J0
217A170qk7m5m0qJ5%k4k4j7j7oL5O1L7%KJ8ro1o5j8Rk0m2j8J3J2J0L6O0L8qk7j2mnJJ7K6K1
212A076J8J3nk4k2kNj0k9k8j6j5k2j8NK8K3nj6J3M3K7j8l1QL4Pl9m6j4J2J8K3J8j3m3k7K5
$$ plain form
246 1200 1247 1270 1266 1258 1264 1281 1291 1283 1263 1243 1232 1237 1257 1279 1289 1284 1274 1261 1242 1220 1209 1215 1225 1230 1236 1246 1240 1205 1158 1130 1132 1146 1155 1162 1178 1199 1213 1209 1180 1129 1071 1028
241 1028 1010 1016 1039 1073 1108 1135 1151 1163 1183 1207 1225 1226 1215 1200 1182 1159 1136 1132 1170 1236 1285 1280 1237 1201 1189 1175 1139 1105 1107 1140 1164 1165 1163 1177 1192 1196 1190 1182 1164 1135
236 1135 1116 1128 1158 1174 1162 1138 1120 1114 1123 1145 1168 1182 1192 1209 1220 1204 1163 1129 1115 1114 1120 1133 1135 1097 1027 976 970 982 986 1001 1051 1111 1138 1138 1147 1168 1172 1159 1166 1203
231 1203 1232 1220 1181 1138 1093 1048 1027 1036 1052 1055 1056 1066 1071 1065 1073 1113 1162 1189 1201 1221 1236 1216 1176 1157 1160 1143 1085 1025 1002 1004 1000 989 991 1007 1022 1035 1062 1110 1160 1185
226 1185 1168 1111 1042 1004 1022 1064 1078 1046 1015 1031 1080 1105 1084 1055 1059 1079 1074 1045 1031 1060 1110 1143 1147 1129 1106 1095 1104 1118 1109 1079 1064 1084 1119 1142 1155 1181 1217
222 1217 1238 1224 1181 1125 1079 1060 1069 1081 1083 1090 1121 1156 1161 1132 1099 1078 1051 1006 959 934 935 950 978 1033 1113 1183 1194 1130 1037 985 996 1029 1042 1048 1077 1125 1160 1170
217 1170 1162 1135 1090 1050 1042 1057 1057 1033 1009 992 975 969 1004 1065 1102 1102 1104 1122 1113 1052 987 969 978 958 916 898 911 923 933 969 1029 1067 1059 1032 1020 1016 1011 1012 1029 1055 1076
212 1076 1094 1107 1102 1078 1056 1054 1059 1049 1020 992 976 961 939 921 926 954 977 972 956 969 1012 1039 1021 990 998 1032 1039 1000 954 940 952 970 993 1011 998 955 928 953
208I53M9K3kJ2K9Lm6o1k1L3N4L8J2kJKok2k4pJ0lm6p4m7K1O9N0j2m8k3K7M8K9MopoKJ9K5J0
202A060j5k5j5%J0J6J3Npj5j2JMj5m6o1m5j2Mnj8j5PL3M8L9Ol2l3QM8M6Ok9m0l6l1pL8O3L3
197I74k6m5qK5Ml0j6L4M6Jl4j0L6M0PoJ5L0K0jj6k9m0k8kJ2OPJ5kn0p2j8O0P5K2k5j8O%k7
192I32l3j6JJ0K0J8j5n4n7j5L5N1L5J0pnQK1J3j1k3qJ8K2ml7l6NN9P2L4qoJ9J1m0p4m8%J4
188I11kp%kj6j2MNqnK5M7L0rl5l9k0J6M8N3K4JJRkk7m4m3k4NK4J5j1k6j8rqLK7L5J6nkP%j0
182I22npk4k8JK6Rj7%M7N2Ml9l7j6qkJ5K6J7lj7j3QK9K5j4m8m1rJk1l2j8JJ3K5L6K0j0j6J3
177H65L2K0jj1j4j7rQMj7k3kQj2l1j7J5L5M4L6Nl3l2JJ0k6n1l0Jkj1J7M6L8ROJ5NqLJ0k0m1
172H25lN5N0mk5%J0pLM5N8K3npk4o4n7PM1Ll6qK8qo5m8K7N6J0k7j1J4PqkOoj5jJ4kl1l1LL7
$$ plain form
208 953 1002 1025 1023 1035 1064 1067 1021 960 939 972 1026 1064 1076 1074 1075 1077 1071 1049 1025 1018 1028 1025 979 905 858 879 948 998 986 938 915 942 990 1019 1023 1017 1010 1004 1006 1025 1050 1060
202 1060 1045 1020 1005 1005 1015 1031 1044 1049 1042 1027 1015 1016 1020 1005 959 898 853 841 845 840 822 807 814 847 895 934 940 908 875 883 931 977 983 954 914 878 847 840 878 941 974
197 974 948 903 895 920 924 894 878 912 958 959 925 915 951 991 998 992 1007 1037 1057 1056 1040 1011 971 943 941 953 959 966 981 979 929 857 839 899 974 996 971 953 959 959 932
192 932 899 883 884 894 914 932 917 863 806 791 826 877 912 922 915 910 918 939 952 941 918 910 928 950 946 909 873 878 937 1009 1043 1035 1029 1048 1059 1019 945 897 897 911
188 911 909 902 902 900 884 872 876 881 873 868 893 940 970 961 926 887 867 883 931 984 1008 1009 1010 1019 1017 990 946 903 879 884 908 923 912 886 868 859 851 854 881 916 932 927 925 932 932 922
182 922 917 910 886 858 859 885 894 877 877 924 976 980 941 904 888 880 878 893 919 936 933 916 903 911 940 965 951 903 862 853 854 833 801 783 784 797 822 858 878 868 852 865
177 865 897 917 916 905 891 874 865 873 877 860 837 835 843 831 800 783 798 833 877 913 918 885 853 854 864 838 787 757 758 756 745 762 808 846 855 861 876 881 873 876 886 866 825
172 825 822 877 927 923 898 898 908 901 904 949 1007 1030 1025 1018 994 930 873 880 921 924 888 880 908 900 835 787 814 870 880 853 842 856 863 855 853 859 853 838 837 851 849 818 787 790 827
166H27M1J7j5k9j1K3M5K8ok6j8qj9m2m4l2k7l1j0M5Q8P0J3k5j9jONJj1k2rK0K3%pK5M4Qm5
161H72n1j4J0kj6lJ5J5%kONk1n3n2oN0O2K4j3k0j4j6j3J2K7Nk4j0L3L9Jk2QM8L3k2m9j5L0
156H57K5j7l5rJ2j7o0m9PL7J5kJ9L2jl4j4K5J9rMM3L4l2o4j2N6O3J8j9k7k8l4l2j6PL0L0p
152H15m7m0K0P2P2M1J3j0m0n3k6J7L2Qj9k5j4LJ0Qkqj6l1l4mL2K3j6j7L6O7J9m3l5K0L0k2
147H36o1m3oJ0K1L0J8j3j7K6O6N8K1nk0l5m0k7j7l2m9k8J6M3L7J5mj3oJ6K9Rk3l4j1J6L2L4
142H49K3ok7k2%J3RJ7L2L1J0oj1l0o6p6l0K9M8L3K9L8K7j3m2l9k8k5j2J5K7Oj8j4%qk9l0j2
137F92LPK0L4K6JoRJ0k3m6k3K3L0rm7m1KM0M7K1j0j7JJ9J3k%J7J4k0m6k7K5N4L4KlJ5K5J5
132H79kj3k2l2k7mJ3Rjmoj8k5kL3L9J8lnpj9k8k5l0m4l2J9O4M9ol4nL8M2J0j7j4QJ6ll2l6
$$ plain form
166 827 868 885 870 841 830 853 898 926 920 894 876 868 849 807 763 731 704 673 663 708 796 866 879 854 835 834 840 845 846 835 813 804 824 847 847 840 865 909 917 872
161 872 821 807 817 815 799 796 811 826 826 824 830 835 814 761 709 703 753 815 839 826 806 792 776 763 775 802 807 783 773 806 845 846 824 832 880 913 891 842 827 857
156 857 882 865 830 821 833 816 756 707 714 751 766 764 783 815 814 780 766 791 810 801 805 848 882 850 786 774 830 893 911 892 865 837 803 771 755 762 792 822 815
152 815 768 728 748 820 892 933 946 936 896 843 817 834 866 874 855 830 816 819 829 837 835 827 811 780 746 742 774 797 781 764 800 867 886 843 808 828 858 836
147 836 775 732 726 736 757 787 805 792 775 801 867 925 946 941 921 886 846 819 802 770 721 693 709 752 789 804 800 787 781 797 826 835 812 778 767 783 815 849
142 849 872 866 839 817 817 830 839 856 888 919 929 923 912 882 816 740 710 739 787 820 849 887 914 901 859 820 792 767 755 770 797 803 785 771 771 763 734 704 692
137 692 695 702 722 756 782 783 777 786 796 773 727 704 727 757 748 701 660 662 702 749 770 760 743 744 763 776 774 774 791 805 785 739 712 737 791 825 827 824 839 864 879
132 879 877 864 842 810 783 779 792 801 800 796 790 772 747 745 778 817 835 832 827 820 801 773 748 718 674 642 661 725 774 768 734 729 767 809 819 802 788 796 812 809 777 741
127G41k1rlK4O9Q2K5n1p3l2MJj4mJ3Mj9k5JK8L4J5qj8j5j4k6l7j7K3N0M0Rj6k6k3rJ0J8J0
122G41kjOJ1J8K5J7rl8m1k0LRjnRK5J1l0n5k8K2L5Oj7pkk7m6j5M3N7J4k3mM3M7j0p2p4j9L9
117F35N5M2M0M5L1j1n0n8l9j3J4K9J4k1l5rK8M9N0M3K2rj5J0K3ll1j2J5nm5k8L1M5nk9J9O2
113H84K6l7m0jMl6n0j6J2Mrrj6l5k3K8O1L8KPL4K7j6m1k4LMj5k2lK8M9L7Kk5k7j7k2k6lL3
108G70L3qm1k8OJ9NmPJ7Oj3j3J0L5K3j6l7rL4L0j6m6l0j2k9n4m3j8j1oL4P6O2jl0kK4Jk5j0
103F90J6Lk4j3K9M2Rj9qK0K8J1rj6pNKj4j7J2M5L6j5n5m9j3J4J5nk5k4oR%j9k1mJ1J6J9K5
98F94K3J1ORJ0OQJ1jk0j7J0K6J1j9l8m3m0j9K1M6L2%qQK4K6J3rm0n5l4PL3K6Pj5l2m0k7%K5
92F36L6L3K2Nj1j7j6rRL2L5Ok2qL2L8lm2l1PK6J0pnPJk6n0l5J3M8L5j0l0mL0L9L1K2Rj6l6
$$ plain form
127 741 720 711 708 732 801 883 908 857 784 752 756 757 743 739 752 756 737 712 713 741 775 790 782 764 749 735 709 672 655 678 728 768 777 761 735 712 703 713 731 741
122 741 739 738 744 755 773 798 815 806 768 727 707 710 719 718 713 722 747 758 728 673 645 667 702 708 691 684 682 655 609 594 637 694 708 685 681 724 771 761 689 615 596 635
117 635 690 732 772 817 848 837 787 729 690 677 691 720 734 713 678 669 697 746 796 839 861 852 837 847 870 867 836 824 839 834 789 761 792 837 832 803 822 884
113 884 910 873 833 832 836 800 750 734 746 750 741 732 716 681 658 686 747 785 787 794 828 855 839 798 774 777 781 766 744 741 769 818 855 857 832 805 788 766 740 737 770
108 770 803 795 754 726 732 751 756 752 759 776 782 769 756 766 801 824 808 771 762 796 826 810 764 734 722 693 639 596 578 567 561 595 671 733 732 702 700 724 725 700 690
103 690 706 709 685 672 701 743 752 733 725 745 773 784 775 759 752 757 759 745 728 740 785 821 806 751 702 689 703 718 713 688 664 658 667 667 648 627 623 634 650 669 694
98 694 717 728 734 743 753 759 767 778 777 757 740 750 776 787 768 730 687 647 628 649 695 727 727 719 727 751 777 790 781 741 686 652 659 692 718 725 710 678 638 611 611 636
92 636 672 705 727 732 721 704 688 679 688 720 755 761 739 731 763 801 798 756 725 732 758 768 761 756 763 764 738 688 653 666 714 749 739 709 705 735 774 805 827 836 820 784
87G84l0rlj7j9kJ8K0J4J6K3J4j0j9%K6K0j8m1j7L2M6Qm1n4l8j8%K6O0P0M3nl5l0j7k3m7n7
83F70k5K1M1K5Mmj0k2k4kK3K5Rkoj8l0j8K1N2M5Rk2k0J4M6M8J8j5k7l0l9m1j6J7K0j5m2l1
78F49NK6J4mmJ2J9om3m7nM7N2J1l1l2nJ9J9%k4k9nK7K7kk1nK2L0K5K3Ll6n2j4L1J8k7k5K8
73F90N5J4l2k5Jj0l6k1K6L3j4m5j5L8M8J9rj7l1n1m7jN4O8L5ok2k0j7j1J0K9K1rk8j6KLlk
68F58MmqJ8N6N9J4l5m2k3j7l0l4qK6L1Oj4KL7M5J0l9o2n4l3oK8N0L5rl8l1pJ0K1L3L3Ol3m7
63F08j9K7N1L3nj7LK2Rj3KM3N7J8k9m2l1k5k0OL1K5Krl%NK9N9M7jl4k6rj7k9j1K4L3Qk1k3
58G58LK6K5ll8n6m7j8J0K1Qj0j2J2L8M1K4Opj9k9k8k1j4pJ1K4J8Jnj1l5n5k6M0O5J3m5l3L3
53F58O9M0j2l6k5jJ9K7J6mj2qpj4k1j5kOKrrJ5L7L2Lj6j0j0k8l4jL3J7k9m0KL9L8K3K4K5M
$$ plain form
87 784 754 745 742 725 706 704 722 742 756 772 795 809 799 780 780 806 826 808 767 750 782 828 836 795 741 703 685 685 711 771 841 884 879 844 814 797 774 727 670
83 670 645 666 707 732 736 732 722 700 676 674 697 722 731 729 723 705 675 657 678 730 775 784 762 742 756 802 850 868 853 826 796 757 716 700 717 737 722 680 649
78 649 654 680 694 690 686 698 717 711 668 621 616 663 715 726 695 663 658 677 696 696 672 643 638 665 692 690 669 664 686 716 741 764 767 731 679 665 696 714 687 662 690
73 690 745 759 727 702 703 693 657 636 662 695 681 636 621 659 707 726 717 700 669 618 571 570 624 692 727 721 699 679 662 651 661 690 711 702 674 658 660 663 660 658
68 658 662 658 650 668 724 783 797 762 720 697 680 650 616 608 634 665 671 657 659 696 741 751 712 650 596 563 557 585 635 670 661 623 592 585 595 616 649 682 688 655 608
63 608 589 616 667 700 695 678 681 703 712 699 701 744 801 819 790 748 717 692 672 678 709 734 736 727 724 724 729 758 817 864 863 829 803 794 777 748 737 761 794 802 781 758
58 758 761 787 812 809 771 715 668 650 660 681 689 679 667 679 717 758 782 788 781 762 733 705 684 670 663 674 698 716 717 712 701 666 611 585 625 690 703 658 625 658
53 658 727 767 755 719 694 693 712 739 755 751 739 731 724 710 689 674 672 678 680 671 662 677 714 746 749 733 723 713 685 651 650 683 700 671 631 633 672 710 733 757 782 786
48G86j9j2RNk1k4J0L9K0k3l5pJ2mk7k0pk9p3p2j1N2O7N3M8M4J3l2n1l6j5OK7M1K5rl2l2k5
43F41j2J4L7L8K2Kj8m1m2qK1J1j5rJ3%k9j5M5P2K9j8k3rj3j6KRj1k4jJ7Jj0K0N2K5l6n8k9
38F34PK1K7K0j1l9l0OL7N4O4L8l2q5n6K1N7L8J8J8km3n7l5k1k9j3K9L5j4m6j4K7J1k7k2QR
33F03j7k1J0M3N2L8J1k0m1m1l2j0L5P4M9l5q1l0M6M5k1m4LM2K9J2K9M4J1l8m7j6J1J0joj0
29F86j3j8k4k6j3J3K8J5rj3PK6J5j0j6OL0K2j1l6k7LK9K8Rj1nK5L8J0k8l1LK9K8K5K5Km7o9
24F95l6Klj9LM0L3j1k9kK1Rj2j2jPRNooJ7K8qn2m0J4K3k0l6J1L9j1o7m1K5L1k5n1j2K7K2R
19E70K7N6M7J0j9j8kJ3J4jk6m0l0KM2O8O0J8l3o3p0o2m2j2K6N4O2M6J3j3qK2L3Ml5m3j2K6
14F84M5M0J5j9m4m7l0mK2L7K0k0m1k6%RO%j8n3n9lO4O7J0l4k3J0K0Q%LJ9L6K5k2o5m8J3L7
$$ plain form
48 786 767 755 764 769 748 724 734 773 793 770 735 728 740 736 709 689 682 653 580 508 497 549 616 669 717 761 774 742 691 655 640 646 673 714 739 730 698 666 641
43 641 629 643 680 718 740 742 724 683 641 633 654 665 650 641 654 654 625 610 655 727 756 738 715 706 693 677 679 688 677 653 652 669 670 660 680 732 757 721 663 634
38 634 641 662 689 709 698 659 629 635 672 726 790 828 796 711 655 676 733 771 789 807 805 762 705 670 649 620 607 636 671 657 611 597 624 635 608 586 594 603
33 603 586 565 575 618 670 708 719 699 658 617 585 575 610 684 733 698 617 587 633 678 657 613 616 658 687 699 728 772 783 745 698 682 693 703 702 696 686
29 686 673 655 631 605 592 605 633 648 639 626 633 659 674 664 648 654 684 706 695 659 632 635 664 692 701 690 685 710 748 758 730 699 702 731 759 784 809 811 764 695
24 695 659 661 658 639 642 682 715 704 675 673 694 703 691 679 678 685 694 699 693 687 704 732 724 672 632 646 669 649 613 624 663 652 585 544 569 600 575 524 512 539 561 570
19 570 597 653 700 710 691 673 671 684 698 697 671 631 601 603 645 713 773 791 758 695 625 563 521 509 535 589 651 697 710 697 689 711 744 748 713 670 658 684
14 684 729 769 784 765 721 674 644 640 662 699 719 699 658 632 632 641 647 647 629 576 517 514 578 645 655 621 598 608 628 636 636 639 658 694 719 697 632 584 597 634
9F34lm0k2K1L0Oj6k3k9k5kK3K7J4J1J8K1J6J2J2J2K0L2K7jl2l4j2QJ7J1j2m4n0j0L9M3jm1
5F57m1qJ7J8mk1k1j3j7k4rK6M2K0oj1j2l0l5NN8O2J7j9j4kj3k9k5mJ9M1N7N3L4J1j2l8n4l6
0F39KK1Rj0j5j2j3pnj4k3KM0L9j9p5o8j1M5O7N0lm7l2L1N9Oo0n3OK2rj2L7P0L6k7n2l7j9L
-5E61L5N1K0j9j3K6K9j5m5j8J4Kl3k5J6L2QlK4M7K8oj3qk2m3k3K2K9k1o1l5K3M4Rl5l9mL6
-10E75M2K2PJ9K8Kl3k7J0J2k9m9j4J8rl8J0R8J04J1p4n8J2M4J7rjJ9K6J5lrlKj6m8n3k0J4
-15F14Nk6l1mRkpK4N4M2Jk4k0j9l0k2K0N4M1J2NJ0j8n9n2QN3L6OJ0K7J4j0pNj4n2n1j1K2L2
-20F45M1N0K6k8n9l9mMrj2lQJ8J5j3m2k9K2N2L1pk0j5j4qRJ0j5l4j7QJ2QJ9K8J0oQK6Qk6k3
-25F35NOj8j4K8N0K3rlK0J9jj1j0nKRml8n9l3K1N3L9Lk0j5OK1J6kj6j4rqj0%K2M5M7J6k7m2
$$ plain form
9 634 631 591 569 590 620 626 610 587 558 533 531 554 581 595 606 624 645 661 673 685 697 717 749 776 775 743 709 697 705 722 733 721 677 627 617 656 699 698 657
5 657 616 608 625 643 639 618 597 584 567 543 534 560 602 622 616 605 593 563 528 533 591 653 670 651 637 635 622 593 568 564 583 624 681 734 768 779 767 729 675 639
0 639 641 662 671 661 646 634 621 614 609 595 572 574 614 653 634 559 491 480 525 592 642 639 592 560 591 650 656 596 543 549 571 562 550 587 657 693 666 614 577 558 561
-5 561 596 647 667 648 635 661 690 675 630 612 626 628 595 570 586 618 626 623 647 694 722 716 703 695 673 630 607 629 658 637 576 541 564 608 617 582 543 539 575
-10 575 617 639 646 665 693 695 662 635 645 657 628 579 565 583 574 536 546 644 748 759 685 627 639 683 700 691 690 709 735 750 747 738 735 737 721 673 620 600 614
-15 614 619 593 562 558 567 565 558 582 636 678 679 655 635 616 586 564 584 638 679 691 696 706 688 629 577 585 638 674 680 690 717 731 721 714 719 705 653 602 591 613 645
-20 645 686 736 762 734 675 636 632 636 627 615 612 620 638 653 640 598 569 591 643 674 667 647 632 618 610 619 629 614 580 563 571 583 591 610 638 648 642 650 676 684 658 635
-25 635 640 646 628 614 642 692 715 706 703 723 742 741 730 720 715 717 726 722 684 625 592 613 666 705 708 688 673 679 700 716 714 698 684 675 667 657 657 679 724 771 787 760 718
-30G18j3K3K0j2l0j9rk1l6l0j3KJ2K1K2K2L1L9K3j1k9j3Jj3l4k9pL%OK5M1M3K8ll3k8J4M1
-35G52On6p6m1JJ5K1L6M8L1nl9n5m5j3K4L5K1Klj2l4m5k1K3M2J9j1rJ9L7K3Konrj1J0L7L3
-40G41j0m5m3k7l0m3k8J3M4L9J6MMMjj5k1qJ9L3J9kkQJ0PJ3J6Jj7j0Nol6l4OL0J3j0mQql0
-45F23k6oJklmj0mK2L6J7mJ3M7M7J4nMRoj3lpk3k0J0J8l2q9q1j5L5K5j2k0OK8K3J3K5M4L6
-50G11qm7m4j7pk7l8k0PJ5LplQK2L5M4M8L7Ol1m7k8LJ3jk0l2l2j1K6M4J6k2rM2N0on9m7oJ2
-55E73J2K9M2K0k0l5l2l7m1j3J6Lk5pM7O1K1lJ4J2k9m4J0O1K8m6n9j4J6MPL3L3j6n5l8JJ3
-60E42JKJ1PlPK8K3j3l6j1L3M4J1k1k1opk1j0K3L4Qj8jL6M3J7j2k5k4qK6N0L4pk9k0j4j5j
-65F57K4K1j4k3J5M1J3k4j2K4J9j2rK1J3l3m8nK8%m6n2k7j0nJ9M7M0jl0k1JJj5k3qK0L9K9
$$ plain form
-30 718 705 728 748 736 706 687 678 657 621 591 578 580 592 613 635 657 688 727 750 739 710 697 698 685 651 622 615 618 618 624 649 690 733 761 758 725 697 711 752
-35 752 758 702 626 585 586 601 622 658 706 737 732 693 638 593 580 604 639 660 662 659 647 613 568 547 570 612 631 620 611 630 667 690 692 686 681 672 661 671 708 741
-40 741 731 686 643 616 586 543 515 528 572 611 627 631 635 639 638 623 602 594 613 646 665 663 661 669 679 686 699 715 716 699 689 694 688 652 618 624 654 667 657 653 661 653 623
-45 623 597 591 592 590 587 583 573 569 591 627 644 640 653 700 747 761 756 760 769 763 750 747 740 717 697 707 725 693 604 523 508 543 568 556 536 542 570 593 606 631 675 711
-50 711 703 656 612 595 588 561 523 503 510 525 528 521 518 526 548 583 627 675 712 718 687 640 612 615 628 627 607 575 543 532 558 602 618 596 587 629 679 673 614 567 561 573
-55 573 585 614 656 676 656 621 589 552 511 498 514 517 492 485 532 593 614 611 625 637 608 564 574 635 663 617 558 544 560 564 571 604 637 621 566 528 529 542
-60 542 543 545 556 563 560 567 595 618 605 569 558 591 635 646 625 604 598 591 570 560 583 617 625 607 606 642 685 702 690 665 641 633 659 709 743 736 707 687 673 658 657
-65 657 681 702 688 665 680 721 734 710 698 722 741 729 720 741 754 721 673 668 696 696 650 598 571 561 556 575 622 662 661 631 610 611 612 597 574 566 586 625 654
-70F54qm0l8nJ9J7NQK5L0J7%oJMok5l8l2j1J2K6J8nk2j5MMj6l0oL2M4K5J0J0Jl1n2l2J1K8
-75E87J9J4K2J1k4m3k3J0J5JlLnj4JK6J3l6n7j5M1M3RML8N4K0k6l4j5pj4j5ok%J2K6Rl6o3
-80E40k9L6O6L4k1m2k1PJ8J6J8K3J7%j7k0j8k5l3j8J7M0K4jNM1M7jn2n0qK0J8J8L7M4J4k9
-85G15m6l1%K5L1Qk6l3j5j2m1o5m5QM6N3L9J7j3l3l5k9k7qL2O5N3J2j2j0mLK2L5J7j0oK0J3
-89G13k9n4l2mlmJ4K5Mk5l4k7k4j3J8M1L0QNMj8l7j9K1L2Lk3k2j3j1qQL0L9K5lk4j9NJ9J1
-94F09LKrk4nN0P4J5o3n9K0P0L6k8m4j1K0J9ql7m0oL5M4K0lkNKj4l7n8n5j8K3L1J7K4L5Pn0
-100E90n8mM5K8j3j8LOqlJ5J8QQJ7%l7o0m5j5QJ4J3RQJ0J1J5K0J7ok6k1KJ2QJ9M0L2j6n0l9
-105E57j9k7l2ON1N2K1QJ1j2m4k7K7M8J4j2PK3jk6jM3L4k7p1n1JK6J1mJ2M5M9K0j2j2Jjj5
$$ plain form
-70 654 646 606 568 563 582 599 604 612 637 667 684 684 678 679 683 677 652 614 582 571 583 609 627 622 600 585 589 593 577 547 541 573 617 642 652 662 663 632 580 548 559 587
-75 587 606 620 642 653 629 586 563 573 588 589 586 589 584 570 571 597 610 574 517 502 543 586 595 599 637 691 711 685 651 636 629 615 600 594 592 592 604 630 639 603 540
-80 540 511 547 613 647 626 584 563 570 588 604 622 645 662 662 645 625 607 582 549 531 548 588 612 611 616 657 704 703 651 601 593 613 631 649 686 730 744 715
-85 715 669 638 638 663 694 702 676 643 628 616 575 510 465 473 519 572 611 628 615 582 547 518 491 483 515 580 633 645 633 623 619 622 644 679 696 686 680 700 713
-89 713 684 630 598 594 591 587 601 626 630 605 571 544 520 507 525 566 596 604 609 613 595 558 539 560 592 595 572 550 537 526 518 526 556 595 620 617 593 574 579 598 609
-94 609 612 614 605 581 576 626 700 715 652 593 613 683 719 691 647 636 656 675 667 630 590 584 619 663 683 680 678 683 685 671 634 576 521 503 526 557 574 598 633 640 590
-100 590 532 528 573 601 588 570 573 579 571 568 583 601 609 617 634 634 597 537 492 477 485 499 512 521 529 539 550 565 585 602 596 570 549 551 563 571 590 630 662 646 596 557
-105 557 538 511 479 485 536 588 609 617 628 616 572 545 572 620 634 622 629 652 651 625 624 667 701 674 603 552 553 579 590 586 598 643 692 712 700 688 689 688 673
$$ [...]
-1605D30
##END=	
##END=	
