##TITLE=	8mSZPJQQQlOGfUcdAsEpWg.24.ser
TM-VI-146repeat solid dmso d6 hmbc

##JCAMP-DX=	6.0	$$ MestReNova 14.3.0-30573
##DATA TYPE=	LINK
##BLOCK_ID=	1
##BLOCKS=	2    
##ORIGIN=	Mestrelab Research S.L.
##OWNER=	hrzepa
##$MNOVA/LINK_BLOCK_TYPE=	ITEM	$$ NMR Spectrum
##$MNOVA/ITEM/POLYGON=	(XY..XY)
5321,5835
8722,5835
8722,8208
5321,8208
5321,5835
##$MNOVA/ITEM/Z=	0
##$MNOVA/ITEM/ANGLE=	0
##TITLE=	8mSZPJQQQlOGfUcdAsEpWg.24.ser
##JCAMP-DX=	6.0	$$ MestReNova 14.3.0-30573
##BLOCK_ID=	2
##DATA TYPE=	MNOVA NMR VIEW DATA
##DATA CLASS=	MNOVA VIEW DATA
##$MNOVA/2D/THRESHOLD=	3.4276993274688720703
##$MNOVA/ITEM/ZOOM/X=	-0.47893103590269503478,	14.508270000071124883
##$MNOVA/ITEM/ZOOM/Y=	-9.5608721214139968936,	250.07129999451962021
##END=	
##TITLE=	8mSZPJQQQlOGfUcdAsEpWg.24.ser
##JCAMP-DX=	6.0	$$ MestReNova 14.3.0-30573
##BLOCK_ID=	3
##DATA TYPE=	nD NMR SPECTRUM
##DATA CLASS=	NTUPLES
##NUMDIM=	2
##ORIGIN=	Bruker BioSpin GmbH
##OWNER=	nmr
##.OBSERVE FREQUENCY=	400.20280139999999847
##.OBSERVE NUCLEUS=	^1H
##.SOLVENT NAME=	DMSO_weak
##.PULSE SEQUENCE=	hmbcgplpndqf
##LONGDATE=	2021/11/05 06:48:03.000
##.ACQUISITIONMODE=	SIMULTANEOUS (DQD)
##$ORIGINAL FORMAT=	Bruker XWIN-NMR
##$MNOVA/SCALES_VERSION=	9
##$PARAMETER FILE=	(acqu2s, ASCII, /private/var/folders/f6/rjf_tdyn2v98c5c0wvkgn4s80000gn/T/8mSZPJQQQlOGfUcdAsEpWg/24/acqu2s, 0)
$$ ##TITLE= Parameter file, TOPSPIN		Version 3.2
$$ ##JCAMPDX= 5.0
$$ ##DATATYPE= Parameter Values
$$ ##NPOINTS= 129	$$ modification sequence number
$$ ##ORIGIN= Bruker BioSpin GmbH
$$ ##OWNER= nmr
$$ $$ 2021-11-05 07:07:40.000 +0000  nmr@CZC2439F63
$$ $$ /opt/topspin/data/agmb/nmr/Nov04-2021/24/acqu2s
$$ $$ process /opt/topspin3.2/prog/mod/go
$$ ##$ACQT0= 0
$$ ##$BF1= 100.63037
$$ ##$FnMODE= 1
$$ ##$NUC1= <13C>
$$ ##$NusJSP= 0
$$ ##$NusT2= 1
$$ ##$NusTD= 128
$$ ##$O1= 12075.7644147886
$$ ##$SFO1= 100.642445764415
$$ ##$SW= 260.109045168497
$$ ##$SW_h= 26178.0104712042
$$ ##$TD= 128
$$ ##END=
$$ 
##$PARAMETER FILE=	(acqus, ASCII, /private/var/folders/f6/rjf_tdyn2v98c5c0wvkgn4s80000gn/T/8mSZPJQQQlOGfUcdAsEpWg/24/acqus, 0)
$$ ##TITLE= Parameter file, TOPSPIN		Version 3.2
$$ ##JCAMPDX= 5.0
$$ ##DATATYPE= Parameter Values
$$ ##NPOINTS= 12	$$ modification sequence number
$$ ##ORIGIN= Bruker BioSpin GmbH
$$ ##OWNER= nmr
$$ $$ 2021-11-05 07:07:43.326 +0000  nmr@CZC2439F63
$$ $$ /opt/topspin/data/agmb/nmr/Nov04-2021/24/acqus
$$ $$ process /opt/topspin3.2/prog/mod/shimcntl
$$ ##$ACQT0= 1000000
$$ ##$AMP= (0..31)
$$ 100 100 100 100 100 100 100 100 100 100 100 100 100 100 100 100 100 100
$$ 100 100 100 100 100 100 100 100 100 100 100 100 100 100
$$ ##$AMPCOIL= (0..19)
$$ 0 0 0 0 0 0 0 0 0 0 0 0 0 0 0 0 0 0 0 0
$$ ##$ANAVPT= -1
$$ ##$AQSEQ= 0
$$ ##$AQ_mod= 3
$$ ##$AUNM= <au_zg>
$$ ##$AUTOPOS= <52 >
$$ ##$BF1= 400.2
$$ ##$BF2= 100.63037
$$ ##$BF3= 400.2
$$ ##$BF4= 400.2
$$ ##$BF5= 400.2
$$ ##$BF6= 400.2
$$ ##$BF7= 400.2
$$ ##$BF8= 400.2
$$ ##$BYTORDA= 0
$$ ##$CAGPARS= (0..11)
$$ 0 0 0 0 0 0 0 0 0 0 0 0
$$ ##$CFDGTYP= 0
$$ ##$CFRGTYP= 9
$$ [...]
$$ 0 0 0 0
$$ ##$ShimPowMaxUC= (0..63)
$$ 130000 130000 130000 130000 130000 130000 130000 130000 130000 130000 130000
$$ 130000 130000 130000 130000 130000 130000 130000 130000 130000 0 0 0 0
$$ 0 0 0 0 0 0 0 0 0 0 0 0 0 0 0 0 0 0 0 0 0 0 0 0 0 0 0 0 0 0 0 0 0 0 0 0
$$ 0 0 0 0
$$ ##$ShimPowMaxUG= (0..63)
$$ 524287 524287 524287 524287 524287 524287 524287 524287 524287 524287 524287
$$ 524287 524287 524287 524287 524287 524287 524287 524287 524287 0 0 0 0
$$ 0 0 0 0 0 0 0 0 0 0 0 0 0 0 0 0 0 0 0 0 0 0 0 0 0 0 0 0 0 0 0 0 0 0 0 0
$$ 0 0 0 0
$$ ##$ShimPowRcbType= 3
$$ ##$ShimPowRes= (0..63)
$$ 1e-20 1e-20 1e-20 1e-20 1e-20 1e-20 1e-20 1e-20 1e-20 1e-20 1e-20 1e-20
$$ 1e-20 1e-20 1e-20 1e-20 1e-20 1e-20 1e-20 1e-20 0 0 0 0 0 0 0 0 0 0 0 0
$$ 0 0 0 0 0 0 0 0 0 0 0 0 0 0 0 0 0 0 0 0 0 0 0 0 0 0 0 0 0 0 0 0
$$ ##$ShimPowRng0= (0..63)
$$ 1 1 1 1 1 1 1 1 1 1 1 1 1 1 1 1 1 1 1 1 0 0 0 0 0 0 0 0 0 0 0 0 0 0 0 0
$$ 0 0 0 0 0 0 0 0 0 0 0 0 0 0 0 0 0 0 0 0 0 0 0 0 0 0 0 0
$$ ##$ShimPowRng1= (0..63)
$$ 1 1 1 1 1 1 1 1 1 1 1 1 1 1 1 1 1 1 1 1 0 0 0 0 0 0 0 0 0 0 0 0 0 0 0 0
$$ 0 0 0 0 0 0 0 0 0 0 0 0 0 0 0 0 0 0 0 0 0 0 0 0 0 0 0 0
$$ ##$ShimPowRng2= (0..63)
$$ 1 1 1 1 1 1 1 1 1 1 1 1 1 1 1 1 1 1 1 1 0 0 0 0 0 0 0 0 0 0 0 0 0 0 0 0
$$ 0 0 0 0 0 0 0 0 0 0 0 0 0 0 0 0 0 0 0 0 0 0 0 0 0 0 0 0
$$ ##$ShimPowRng3= (0..63)
$$ 1 1 1 1 1 1 1 1 1 1 1 1 1 1 1 1 1 1 1 1 0 0 0 0 0 0 0 0 0 0 0 0 0 0 0 0
$$ 0 0 0 0 0 0 0 0 0 0 0 0 0 0 0 0 0 0 0 0 0 0 0 0 0 0 0 0
$$ ##$ShimSysFunc= (0..63)
$$ 1 2 3 4 5 7 9 11 15 16 8 10 12 14 6 17 13 18 19 20 0 0 0 0 0 0 0 0 0 0
$$ 0 0 0 0 0 0 0 0 0 0 0 0 0 0 0 0 0 0 0 0 0 0 0 0 0 0 0 0 0 0 0 0 0 0
$$ ##$ShimSysMatrix= 0
$$ ##$ShimSysType= 1
$$ ##$TFXNUM= 0
$$ ##$TRIPLO2= 0
$$ ##$VTU= 2
$$ ##$VTUETH= <149.236.99.20>
$$ ##$VTUTY= <no>
$$ ##$WBREFAM= (0..15)
$$ 135.5 97.7 100 100 100 100 100 100 100 100 100 100 100 100 100 100
$$ ##$WBREFLM= (0..15)
$$ 0 0 0 0 0 0 0 0 0 0 0 0 0 0 0 0
$$ ##$WBREFPH= (0..15)
$$ 72.26 -67.22 0 0 0 0 0 0 0 0 0 0 0 0 0 0
$$ ##$WBSGU= (0..15)
$$ 0 0 0 0 0 0 0 0 0 0 0 0 0 0 0 0
$$ ##$XFAC= 2
$$ ##END=
$$ 
##$DECIM=	3328
##$DSPFVS=	20
##.ACQUISITIONSCHEME=	NOT PHASESENSITIVE
##NTUPLES=	nD NMR SPECTRUM
##VAR_NAME=	FREQUENCY1,	FREQUENCY2,	SPECTRUM
##SYMBOL=	F1,	F2,	Y
##.NUCLEUS=	13C,	1H
##.OBSERVE FREQUENCY=	100.64244576441500101,	400.20280139999999847
##VAR_TYPE=	INDEPENDENT,	INDEPENDENT,	DEPENDENT
##VAR_FORM=	AFFN,	AFFN,	ASDF
##VAR_DIM=	512,	512,	262144
##UNITS=	HZ,	HZ,	ARBITRARY UNITS
##FIRST=	25164.767445380970457,	5806.2096540000038658,	0.63999468088150024414
##LAST=	-962.11409912165936476,	-191.66820056731904742,	0.78509759902954101563
##MIN=	-962.11409912165936476,	-191.66820056731904742,	0.00076484534656628966331
##MAX=	25164.767445380970457,	5806.2096540000038658,	32.197048187255859375
##FACTOR=	1,	1,	0.003343159108477520864
##PAGE=	F1=25164.8
##FIRST=	25164.767445380970457,	5806.2096540000038658,	0.63999468088150024414
##DATA TABLE=	(F2++(Y..Y)), PROFILE
$$ [...]
##PAGE=	F1=2974.81
##FIRST=	25164.767445380970457,	5806.2096540000038658,	0.15446904301643371582
##DATA TABLE=	(F2++(Y..Y)), PROFILE
##PAGE=	F1=2872.56
##FIRST=	25164.767445380970457,	5806.2096540000038658,	0.10421092808246612549
##DATA TABLE=	(F2++(Y..Y)), PROFILE
5806C0M6J3M5J37j57o8K0m7L5J07kj19LJ3N8J11j56k2K6K3l0J12N2O6j27M6j17N5n5N4R2q6
5431A58n2o9L9K2M4L4P6j35o9J23j6o0k6n3J43J04O5p5j20l7J5J78P1k38q0R6rk0O9j9l1R3
5055B21n2m9m3l9M1OJ04M4Mj27k1oN4J2n6r1J24J18j29O4j12P9k7R%n7O1RM5l9l7J15P8q3
4656B20L3k5j72J01N0K0q6o0K9k9Q8K6n2J8R7j18m1j9rJ3J2p5N2J8m3J04P0l4q6L7j6n8R5
4269A60P4j45j4Q2N3j6J4m2l3p8P3N3R0j70J63p1m6n1J48j60N7P0j10N6L4p7k0J7j9j4J47
3905B25j65N8Onj2n1J9OqK05q1j60M1rM3O0k0p4J46m1r8J10LLm7l2Mj2o0M9Oj00K04k9j50
3494C4O0j3J77q1J72k95rJ04Mj34Q9N8n6l4R9nr7L0L5j5l4m7M6K1L3l7j0l9KJ18m5p2O5p1
3095E3K1O2R9kJ45p7j34j9j00P9q0N3K55Kk51J00j38L8j3N8K74j20j15L1p7j05J86o5l9n4
$$ plain form
5806 30 76 89 134 271 114 46 66 19 54 161 159 40 43 56 114 225 69 47 73 96 66 178 230 296 169 215 98 153 98 152 244 158
5431 158 106 37 76 98 142 176 252 117 48 171 155 95 69 16 159 263 328 253 133 96 111 289 360 122 42 138 129 109 178 159 128 221
5055 221 169 120 77 38 79 85 189 233 237 110 89 83 137 149 93 2 126 244 115 179 67 146 119 128 128 71 132 141 186 147 110 225 303 220
4656 220 253 228 56 157 207 227 141 81 110 81 169 195 143 161 258 140 99 80 71 84 96 21 73 91 48 152 222 188 102 139 123 65 160
4269 160 234 89 75 157 210 194 208 166 133 55 128 181 271 101 264 193 147 96 244 84 141 211 101 157 191 114 94 111 92 78 225
3905 225 60 118 124 119 107 56 75 81 73 278 197 37 78 69 112 172 152 78 224 183 85 195 198 201 154 122 126 114 54 103 109 9 213 184 34
3494 34 94 81 258 177 349 54 45 149 153 19 108 166 110 76 175 170 73 103 138 123 89 42 88 109 142 105 95 56 58 176 131 59 124 53
3095 53 74 136 235 233 378 301 167 148 48 127 47 100 355 357 106 206 68 106 93 151 425 305 190 221 144 39 225 160 121 67
2743F7M6J16k5pM7l8l5Mj22J88m5j51K6P0J4j36J53j9p7R2o7q0P1o5Q6n4JMjJ04r9J68q0K3
2344A79r5m1J15J0M8j48J7j5k7L3J15l2o1L9k5o6N3j7Q3n8NJ6k2N5j0q0J2O3o8O0K3j04J44
1956B01L7j66qK3n3K1K13J7k26K3J23r1j3J8N7L0j35J1P8r2O4Rq9P5m0J44n9O0N5k17J27r
1581A88q8N1J6K2j57J03k1j7p2J92j9K7j13n8R0o8L8mL9k2n2L3j4nm6j2J19M5L3j0J2j40J47
1193B37o8j30Q2j6mQ7n0o6N8KMOM8o9K8Lj7J8o9J24P2k73R8J47k30Q9l9RQ7J32r9r8n3J26
794A76k5j9N0nq5Q3J37j60j37R2l0M7o1J2K5Jq6J28KJ48O2j84r5J41j06l4MJ9l4R5m1R4n7
407A57j20N8O0J3k6l9p9Q0K6q2J3P1j22J07p1R9k4J73l9o0j24M1O2q4k0O4R4o3L8q3J06p3
31A53k4K4N4j35J3l0L3P8L9r2N4r1O0K0r2L5%O5j05
$$ plain form
2743 67 113 229 204 197 244 206 171 175 53 241 196 45 71 141 155 19 172 153 76 168 101 21 92 27 113 59 60 64 63 167 68 236 156 179
2344 179 84 43 158 168 216 68 85 70 43 76 191 159 98 137 112 46 99 82 165 107 112 128 106 161 151 71 83 146 78 138 161 57 201
1956 201 238 72 64 87 34 55 268 285 59 82 205 114 101 119 176 206 71 82 160 68 132 141 52 127 87 231 172 232 287 70 197 188
1581 188 100 151 167 189 32 135 114 97 25 217 198 225 112 54 144 76 114 110 149 127 75 108 94 89 43 31 150 195 228 218 230 90 237
1193 237 169 39 121 105 101 188 138 72 130 132 136 142 190 121 149 152 135 153 84 208 280 7 105 252 22 111 72 81 168 300 201 103 50 176
794 176 151 132 182 177 92 175 312 152 15 107 77 124 63 75 100 101 15 143 145 293 355 171 76 217 111 77 81 100 66 161 120 214 157
407 157 37 95 155 168 142 103 24 104 130 48 61 132 10 117 46 145 121 294 255 195 71 112 174 90 70 134 228 165 203 120 226 153
31 153 129 153 207 72 85 55 88 166 205 113 167 76 136 156 64 99 99 164 59
-192E9
##PAGE=	F1=2770.3
##FIRST=	25164.767445380970457,	5806.2096540000038658,	0.16611173748970031738
##DATA TABLE=	(F2++(Y..Y)), PROFILE
5806E9J9J9N0J50j61r3L8m3K8Q5J4r2m1nP5J25j43j9l1P9pO1P5M8j21O7j43P6p9R5J09j61
5431A33l0o9L2K8KN6J22j55r5K08j5j05ko4P9O4P9q9o1l4M0J76N3k50m8J15J4q0M2K9kO8o6
5043A75o7l7KjN7N6N9K2r9n2lJ8R1r4p9Q5P3q2O2o7Q2q2K7j9n5P0rL5qk8J5P6kL7m2j54O8
4609A30N6P0q8n4K1p1J26K3p6RQ4o3r3j0JN6K3j12N6k0m8R7Q9j0r4M0n9O4O0Mj64M1M5P2K2
4198B27l2k8no4M9P5Q7j60Q2o6j2m3J25j30M2Q5j18P6L6j07n7K9J4PJ50k16J00L3r2PoL4k9
3811I3o7J95p9q4pK7N1j0j1J7M9K1j29J18lJ6m7j9o6K9j5K3l1J5J17k4j61J08p7K47j16K04
3435C84l19L1k2J4l6J26j7p6n5J20k7j19Q4K9J4qj07L0O2P2n2j0n3L8K6j6l4M6l7l2R4J67
3060C17%K61q4l94K1j10J53j21PK66N5l12J26j10J7JP6L78j29k89Q3p1j21J07Om3l1N7J42
$$ plain form
5806 59 78 97 147 297 136 43 81 38 66 151 165 73 32 27 102 227 84 65 34 113 106 167 242 290 169 236 93 169 90 185 294 133
5431 133 103 34 66 94 96 152 274 119 24 232 217 112 110 46 125 189 268 179 118 84 124 300 353 103 55 170 184 104 146 175 173 241 175
5043 175 108 71 73 72 129 185 244 266 167 115 112 130 221 127 48 133 206 124 186 119 201 119 146 127 72 142 133 168 160 132 147 223 221 258 216 62 130
4609 130 186 256 168 114 135 64 190 213 137 146 230 167 74 64 65 121 144 32 88 68 20 117 206 196 102 142 83 147 207 211 47 88 133 205 227
4198 227 195 167 162 98 147 222 309 149 231 165 153 110 235 105 147 232 114 190 226 119 62 91 105 112 262 46 146 179 87 94 88 122 93
3811 93 26 221 142 58 51 78 129 119 108 125 174 195 66 184 181 197 150 131 65 94 79 102 71 86 203 179 18 126 49 296 180 384
3435 384 65 96 74 88 52 178 161 85 30 150 123 4 88 117 131 123 16 46 108 180 128 118 65 103 129 113 79 125 88 56 150 317
3060 317 317 578 494 100 121 11 164 43 50 316 371 59 185 75 92 93 169 547 418 129 212 141 20 127 133 90 59 116 258
2719B58nj09N1kmQj51J76Ok00M8O1K8j27J19l3n5L1m2qj6j5J00n5J6K1k6O6o7J51n8%j05k0
2320D2J19J7O1j88M6%p4J30R3r3j7L3k5p9k7N7L6j7lP2j15J33k2j33L8L9n9O2k5o8J78K4j66
1933F9K2j8n1M1J83L9k20K8J18j26K0l4N1O1j31Q2M6j05P7J1r8K3j4J24JO6N8k53J43k8j02
1569H3J8N1M9j45K7K1n1J2J24n3L7j17j6Q3nJ5kj8J9j07R2J1l4j8J0K4Q0PL1N1j82J67q2j23
1170E9M3L5k8N9q9oR6kj7o4J07n6%%k4N6o8J24Q5k77K0J45j47O4l5j2J07J10j02j30J5J37
794B05k5p7Q9j2l3j0J57j68r9J11o6k0MM3K2m3n7R3K1J52M3j67p9P4o5l7j9P4OQ0j09J18m4
407A62j13N0R3l6K4r4m0R2j4o2nP2j07Q2LM2m3J60pq0p2O0j9j1k1%R6n3O5j13J24o6p1M1R0
-4B29j13l7n6P9R6J5p7J8lL3j7r4L1j7R0j28
$$ plain form
2719 258 253 144 195 193 189 197 46 222 228 28 76 137 165 38 157 124 69 100 58 50 34 19 119 64 80 101 75 141 74 225 167 167 62 42
2320 42 161 178 239 51 97 97 23 153 246 153 136 169 144 65 38 95 131 114 111 183 68 201 179 46 84 123 64 126 101 33 211 235 69
1933 69 91 73 22 63 246 285 65 93 211 85 105 71 122 183 52 134 180 75 152 163 65 88 74 198 199 265 323 70 213 185 83
1569 83 101 152 201 56 83 104 53 65 189 136 173 56 40 123 118 133 131 113 132 25 117 128 94 76 86 110 190 197 228 279 97 264 182 59
1170 59 102 137 109 168 79 73 169 167 150 86 193 137 137 137 113 169 101 225 310 33 53 198 51 115 80 68 175 285 183 53 68 205
794 205 180 103 192 180 147 137 294 126 27 138 72 52 56 99 121 78 21 114 135 287 330 163 84 158 93 56 37 111 117 197 88 206 162
407 162 49 99 192 156 180 86 46 138 124 62 57 129 22 104 107 149 106 266 259 179 107 167 148 137 116 116 212 159 224 111 235 169 98 139 229
-4 229 116 79 23 102 198 213 136 154 151 184 167 73 104 87 177 49
-192D9
##PAGE=	F1=2668.04
##FIRST=	25164.767445380970457,	5806.2096540000038658,	0.35549885034561157227
##DATA TABLE=	(F2++(Y..Y)), PROFILE
5806I2j7K1M5J54j41j16N6k8J6O9J6q9k5lJ8J42j12l4n4J01J4L2Q4K4r8P0j58Q7j01J26J18
5442C09k12K3n6qJ5k3P3J40j35q7K43k7j23J6p6J4J1R6o5j8m8P7J42L7k38qJ19K6q2j7N7K8
5067B03N1q4o9k4K7k8J03JO7L3n8q9J5j8J35j23n7N6K1k7L5j8P4j15M6l3m0P0l3OL7j1p6M8
4668A25O9L2j9j36J7P2J06p3n1Pq4J37J9j02PO2kr5L7m7P7K1j05J2n1oM7J09J4j07N3n9J11
4280A97L3o4j22P8j9P5O1n9l1L2m6L4Q0P2j34J9o8Kk7J06q7OJ07j15R2K4j21q0J7P2J2J20
3905B66j81J00K6j63N6MM3l7o0R2n4j3m7Q1K5q4K4R6n7P7j36J14mL3o3lj19L4M8Oq2J54J5
3517A91j6j54J43j21K69j41K29l32N7p8j2N5J37p3j08l9J21m5l0pO4K4J1q3oN0R8p7j0n4Q7
3154A50r1K4J0N2l4o4R9K29J1L70o6o66P6o7J62j35l2K43R1k96R5p5j6K1O4M90j28m53J26
$$ plain form
5806 92 75 96 141 295 154 38 94 66 82 151 167 78 53 50 68 210 98 64 10 111 125 157 241 265 167 237 79 166 65 191 309
5442 309 97 120 64 56 71 48 121 261 126 39 282 255 132 148 72 86 97 193 128 110 62 139 281 318 80 72 191 217 135 118 175 203
5067 203 254 170 101 77 104 76 179 180 247 280 222 133 148 130 265 142 85 141 162 135 170 152 226 111 157 124 84 154 121 127 164 153 77 125
4668 125 194 226 207 71 88 160 266 193 142 149 65 202 221 119 126 188 186 91 128 81 158 179 74 86 35 29 76 185 199 92 145 86 197
4280 197 230 166 44 122 103 178 239 180 149 181 135 169 249 321 187 206 138 140 113 219 132 138 245 130 222 246 125 45 62 134 146 266
3905 266 85 185 211 48 104 108 151 114 54 146 92 79 32 113 138 54 78 174 117 194 58 172 168 201 138 135 16 50 98 104 22 176 191
3517 191 175 21 164 43 312 171 400 68 125 47 35 90 227 154 46 7 128 83 53 46 110 134 145 62 56 106 204 127 117 63 150
3154 150 59 83 93 145 111 47 146 375 386 756 690 24 100 33 195 60 28 271 362 66 161 86 70 91 155 645 517 64 190
2813A90p2r8RQ5k7l7P1J39Mj69L1Q4qRj67J49N9k28P0O4K2j16O1m7k3l2J4L4m6M0M9n2K7L3
2414A22m5K3j6J16l4jj26K7Q8L6M9j86L1M2j10K01O0j37L7K8m4q7oL2k3L8j8J23j61J54rj56
2038D8K2J8rN7q5k9J89L0j82Q3p4k0J1J52O1j92K5J08j35O5q0j4J16j11J17J6j27J08Qq1j9
1675G6k4R1O7R0N3k80J23l3j06NO2Q6j19q0O5p3R3O5q1M0q7J9K8O6PLr0O0j03J11L8n1J4J7
1276A52q4R5oO6J00j86J39o4r2k0P2n9M8j17J0J22llj53J60qm4pk8Q2p5J25R4k77k6J24o6
900G1M1l4l2J27P8r0j37Q3J19j7j40J19j2J3p9J69j84m8J24j03n1N6M8J3q5J3QL8J54J9j28
536A53n8rK5r4K2Q4L6N9j40J08k0q4P2O1p1O0j32QP9l9n2k0P1n2Q2J6j1p5J40L3q5l0P3r3
137A17M7j1m7P9l2J02j40J10n5j09O0J14r1o0m0O9P4ol3j6O7Ml3o3k1j8J12j30
$$ plain form
2813 190 118 20 29 114 87 50 121 260 264 95 126 210 202 211 44 193 252 24 94 158 180 64 125 78 55 23 37 71 25 65 114 62 89 122
2414 122 77 100 84 200 166 165 39 66 154 190 239 53 84 126 16 217 277 140 177 205 161 74 68 100 77 115 97 220 59 213 204 48
2038 48 70 88 79 136 51 22 211 241 59 142 68 48 59 211 272 80 105 213 78 143 63 49 165 54 171 187 60 168 176 95 76
1675 76 52 143 210 300 353 73 196 163 57 62 124 210 91 11 76 3 96 161 80 120 33 52 80 146 153 156 66 126 23 134 172 121 135 152
1276 152 68 163 157 223 323 137 276 212 120 100 172 113 161 44 54 176 173 170 17 177 169 125 118 90 172 97 222 316 39 13 137 71
900 71 112 78 46 173 251 161 24 107 226 209 69 188 176 189 110 279 95 47 171 68 17 73 121 134 49 62 70 108 262 281 153
536 153 95 86 111 17 39 123 159 218 78 186 166 82 154 215 144 204 72 80 159 120 68 48 119 67 149 165 154 79 219 252 167 137 210 117
137 117 164 153 106 185 153 255 115 225 170 61 121 235 144 84 44 113 187 181 148 132 199 203 170 107 86 68 180 50
-192E0
##PAGE=	F1=2565.78
##FIRST=	25164.767445380970457,	5806.2096540000038658,	0.53073149919509887695
##DATA TABLE=	(F2++(Y..Y)), PROFILE
5806A23o1K8K6J54j01j37O8qOO5kj01J7J6p2J63o9o9j6O0M3J5Q7po9N2j58J05j31J44J20k30
5431F1R1m2m5l2K4L5J30p5p8K41m8j17L7q5Om2O6K4n5j0O8Q4K2j87RJ17J6m7o5N0O2M5j06
5043A54m5j9M0m7J38m9O1L7j1j13L9k7J20j52j9L8k2K2rM3M2j33O7l4j9O8n5l6P1J6o1p6J21
4656A50J8M9j36l2R1J20o0n2Op6J27J1j24J6K2N9o7O2r3Q0K3r6j5pJ3l5J13L0j18P5n4J13
4280B13Oj14m1R7n6L6R1o9m4P4l7L6O5M4q9k6p4prJ06m5l1J21r8J01Lj22r0nJ34PN7j04Q1
3881B11Rk00J09k5M4j7m6pJ1Lm3J06k4j15P9J07j25J08j24J03PL8r0Ql1p7J04j1n3K02q8l
3506A70j40J62j36K41j44K43l38O8n8n4Q3J47j03j17rJ02n1J8o2J16qK1m0l3K9J00j07mn0
3165D6J37j57K2N8N4l3p3P8K77K2M39m1p62K3l1J52j34j6J79J02k45L1m0l9L8K3N81j19n43
$$ plain form
5806 123 62 90 116 270 169 32 100 92 98 163 161 60 77 93 21 184 115 46 30 90 133 148 235 228 159 211 53 158 27 171 291 61
5431 61 152 110 65 33 57 92 222 147 69 310 262 145 182 97 103 61 127 151 96 86 154 238 260 73 82 199 215 168 103 153 215 260 154
5043 154 109 90 130 83 221 172 233 270 259 146 185 158 278 126 107 145 123 145 136 179 221 88 155 121 102 170 115 79 150 166 105 29 150
4656 150 168 217 81 49 140 260 200 148 154 78 205 216 92 108 130 189 122 184 91 171 194 98 83 76 89 54 167 197 79 154 100 213
4280 213 219 105 64 161 105 141 232 163 119 193 156 192 257 301 212 186 112 105 96 202 157 126 247 149 250 253 131 41 36 170 177 234 130 211
3881 211 220 20 129 104 148 131 85 78 89 92 49 155 131 16 95 202 77 185 61 164 171 209 119 127 96 19 123 112 59 261 173 170
3506 170 30 192 56 297 153 396 58 126 68 14 97 244 141 24 15 117 66 84 22 138 130 151 111 78 107 207 100 96 46
3165 46 183 26 48 106 160 127 54 132 409 431 870 829 67 90 59 211 77 61 240 342 97 128 88 49 87 110 691 572 29
2825B9J19n8p6M1N0J6o4O8J13Jj71J4J80n5Lj71J15J12k04N2Q6j5j06J0o9K1L0LKj6N4nn1
2438E8L3L9n4k0M3O7j4J8j46Q7N1L7J9j46k7J06j23K19K7j46Q4K8p2j04O8l2n2O9m3J57j53
2074G8J12K7j47k4PO7M5j12qJ54M4k06J49j01oj7J03Q2j61K3R0j07R8o1q0J16j15J31kj43
1722C6J41jm5rq8M7J24J16M8k86P1k2j03M2J3J28q8n7k6J6O3L7r8K5rK0p6J31J0K4j27N0p5
1334C2R8P5n3K7K5j68Q9j2R2J49j79R3m6o1n4Q2p9N1r6l2J22jK6j23R1N7r0%j7O4r1J28R5
947B94k69J1M5kK6l8m0J36L9o1j30J16J08nj90J31oM9j18J76k02PJ09j22LM6K3J3r9N0n1K2
571G1J56j3p7l5q0J08r0Q7%N7L9j34P3K0n3R3Jr2P6j46N3N2m7l8l9P8QQ0%n4r9J08P7p4j7
160A49Q4j39P2Np0M8rJ40j48P3m7j27O7J18p9n0OK3K0j8K2l9J10k0k2j4j05OJ18j13
$$ plain form
2825 29 148 90 14 55 105 121 57 125 238 239 68 82 262 207 210 39 154 266 62 114 200 185 79 89 20 41 71 74 76 60 114 109 58
2438 58 91 130 76 56 99 166 152 170 24 111 162 199 218 72 45 151 28 247 274 128 212 240 168 64 132 100 48 117 74 231 78
2074 78 190 217 70 46 53 120 165 53 45 199 243 37 186 85 79 62 165 247 86 109 199 92 190 129 49 165 50 181 179 36
1722 36 177 176 131 122 34 81 205 321 369 83 154 132 29 71 84 212 124 67 41 57 120 157 59 84 75 95 19 150 160 184 57 107 32
1334 32 130 205 152 179 204 36 125 113 205 354 175 268 222 161 107 189 110 161 65 33 155 154 180 57 148 205 115 115 98 162 71 199 294
947 294 25 36 81 79 105 67 27 163 202 141 11 127 235 230 40 171 165 214 96 272 70 77 186 64 67 113 136 149 50 100 49 71
571 71 227 214 137 102 22 130 40 127 127 184 223 89 162 182 129 222 223 131 207 61 114 166 119 81 42 120 128 208 208 154 55 163 240 166 149
160 149 233 94 166 171 101 149 140 280 132 205 158 31 98 216 137 87 93 116 136 118 140 101 211 191 169 155 50 56 174 61
-192F1
##PAGE=	F1=2463.52
##FIRST=	25164.767445380970457,	5806.2096540000038658,	0.49264284968376159668
##DATA TABLE=	(F2++(Y..Y)), PROFILE
5806A48j01L5pJ57n5j56P3K0kP0l6j10N9L0r5J33k0j27K8J6Q3nR3l8n2J3j32J37j31J12J12
5442B52k17J58l4n9n2P1m1R7Jp6K09p0r1O4q8L4k4j4J01j49P8J7J8Mr6j6J16j7Lq2J8R9N0
5055B64j32jk5M1o3J56q2M1L4L7j14O3j5N8j83L8K1m5N8m7J16k2j52R4k3OO6o7l8L1M7J2j27
4668D7N6QJ25j50m0Q1J16n7n2K1n8J08mj39M4l4R8k5O7j37P5L5q2LM9j3o6P9L6j23J04p6J15
4280B11l6j31L3J13n5k4J02n8o0J03m0N3L5Kk3n9p6l7OJ29j2n4J17o8R6j3j19r1k1J78kk3
3905A76j5N1kj61J02p4M0L6n6k2M7k4j3J10q8k8O2N9j20R5j12J00K9K7j22J7N5o7O9m0oK03
3529C28j79J5j36J67j26J80j09K35l28N6l1m4N4J43r7n4m2Q5n5L0k4J21n5J5mo9L9P6j35J9
3177G5n5J71r4n2P2M2k3o5M4L09J9M50j9p49l7k3J42j12j5J56Q7k07l1Nn2O2m0O00j01n01
$$ plain form
5806 148 47 82 75 232 177 21 94 114 112 182 146 36 95 125 30 163 143 16 44 60 143 138 231 193 141 154 22 159 28 140 252
5442 252 35 193 159 100 48 119 78 175 176 100 309 239 148 212 124 158 134 120 221 72 150 167 185 189 93 77 193 176 179 97 115 214 264
5055 264 132 131 106 147 84 240 158 199 233 270 156 219 204 262 79 117 138 93 151 104 220 198 46 140 117 123 189 122 84 115 162 174 47
4668 47 103 111 236 86 46 127 243 186 134 155 97 205 201 62 106 72 170 145 212 75 150 185 103 106 155 142 76 155 191 68 172 96 211
4280 211 175 44 77 190 135 111 213 155 95 198 158 211 246 248 225 166 90 53 59 188 176 122 239 171 267 254 135 44 23 201 199 176
3905 176 161 212 210 49 151 77 117 153 97 75 122 98 85 195 107 79 141 200 80 175 63 163 192 219 97 114 169 102 171 131 125 328
3529 328 149 164 28 195 69 249 140 375 47 103 72 28 82 225 128 74 32 117 62 92 68 189 134 149 145 76 115 191 56 75
3177 75 20 191 97 45 117 159 136 71 115 424 443 893 874 125 88 65 207 95 80 236 323 116 85 90 38 100 60 660 559 58
2825E8K5J9n9N4LO7p5L4P3oj12N6J93j31qj45O8J58j59J3J10o8q8j9j6MJ05m3l9K1O9n3m5
2438F4K8L8n5m9R1J5lM6j40J33K8Jj5p5q7J45j28K00Jj08J03L2r8j35J35p4mL5o5J58j10L4
2062A41O9j26o3PJ22N1j30nJ07N0k07J99r2lk5K0J00j42K5O5n4J23l0p3N9j44J15rj06J32
1710A76j3oJ6j28qJ50J30M9k66kJ1q4Q0o4J58n8j3q3P5J5N5r1j5J8L9q7Q2J3O4j04l4n9Q1
1322I7J18m0K1L8k12O5j0J05J83j66M4m2k7o4O9p6N1m9m5O6lM8n7KJ12j19J3RRj09J30Q8k48
935AO3j7K8K6m7LQ9jj7q6Q0J09Mk03J16JP5j30J79k12M9O8j21L6O3j0K5q6M2m9m6J55m4l0
536A13j3n2Q2l0J13q8O2L0j12L5O7k4R6o4j03P5j47J07J3m4j1n7R9M8O3l1q1q2N3J11n1l4
160A43R1j43N2K4p4J6QJ74j41L8n1r6K6J03p1j8N3k4n1j8O9m8J28l8J3L5j83M4R9q2
$$ plain form
2825 58 83 102 43 97 100 167 92 126 199 193 81 137 330 199 191 46 114 272 113 126 236 168 80 61 45 49 154 111 72 93 162 109 64
2438 64 92 130 75 26 117 132 129 175 35 168 196 197 182 107 20 165 37 237 238 130 233 265 167 32 167 93 89 124 59 217 107 141
2062 141 210 84 21 28 150 201 71 66 173 223 16 215 123 120 95 115 215 73 98 163 109 232 202 129 188 44 159 150 44 176
1710 176 163 157 173 45 37 187 317 366 100 98 109 25 105 41 199 141 128 45 120 135 190 99 84 102 141 54 136 149 213 109 75 16 97
1322 97 215 175 196 234 22 87 77 182 365 199 243 201 174 110 179 103 154 105 60 126 123 171 114 116 228 109 122 131 140 31 161 249 1
935 1 64 47 75 101 54 57 146 145 128 42 122 231 235 32 148 149 224 94 273 61 110 178 57 93 156 146 171 85 127 78 32 187 143 113
536 113 100 48 130 100 213 125 187 217 105 140 207 183 279 215 112 187 40 147 160 116 105 48 147 195 258 227 146 64 117 228 177 143
160 143 234 91 143 167 93 109 117 291 150 188 137 41 67 170 99 81 134 110 59 41 110 62 190 152 165 200 17 61 160 78
-192G8
##PAGE=	F1=2361.27
##FIRST=	25164.767445380970457,	5806.2096540000038658,	0.37009450793266296387
##DATA TABLE=	(F2++(Y..Y)), PROFILE
5806A66j18K5l9J60j7j72O9N3oP9q0p4N7L3o6Q7K5j63L1j3J23l6J06n1o7l9j3J08j03N5Q6
5442B06j79K04l0n9l6O8q4M8O1p2J49q4n4R8q1M7ql5J27k37J67m2l6k3J4p0J13o1N5p2k0J36
5067B10N9j65N3l7L5q0J52r4J3K9P9r1Q2%j7k05J02j0m8Q2m2J70r9j68J06mL3O1p1Lp6Q1P1
4679B14j22j4K1J42j63k4N9J09o7l3L3l8R3l0j45Q9m0M9J7O2j73O6M7n8N4P5n0o4L9L2j15
4316F5J28j19J40j04n8L0J18m3n9R4l2o9J08n0P5lm7M9q3o3n7MJ54Ro0R8l1P3j4j15q3k5J84
3928B14pr4N4J9%j03P3j14L3J12r3L2K8n5K3J07j52N1O0k0n7N6j07J09M9Pj48L1J17l8N5q1
3553A61J8J88k45L3j40J54r2J03l3J94k68Ql0j0L3J01m5%o9O7p2K7J7J38o9j4Jj06Q1K9j21
3189C9M4l6J20j7o3L6K5k0m7J8L28rM04qo61o6l5J39o1n9J86N0j91p7P3p1J04p9M73p1l88
$$ plain form
5806 166 48 73 34 194 177 5 74 127 121 200 120 46 103 136 70 157 182 19 50 37 160 124 230 179 112 73 60 168 65 120 206
5442 206 27 231 201 142 106 174 90 138 199 127 276 192 138 236 155 202 194 159 286 49 216 174 138 115 129 59 172 111 166 94 74 210
5067 210 269 104 157 120 155 75 227 133 146 175 254 163 245 245 228 23 125 115 67 149 107 277 178 10 116 112 145 206 135 138 62 143 214
4679 214 92 78 99 241 78 54 113 222 155 122 155 117 210 180 35 124 84 133 150 212 39 105 152 94 148 223 173 109 148 180 65
4316 65 193 74 214 110 52 82 200 157 98 192 160 91 199 149 224 221 174 223 140 77 20 24 178 187 127 225 194 267 253 138 55 30 214
3928 214 207 113 167 186 186 83 156 42 75 187 94 126 154 99 122 229 77 128 188 168 111 167 60 169 218 225 77 108 225 187 242 161
3553 161 179 367 122 155 15 169 77 180 147 341 73 81 51 41 74 175 130 130 61 128 56 83 100 238 169 155 156 50 131 160 39
3189 39 83 47 167 150 87 123 148 128 81 99 427 418 822 814 153 87 52 191 130 71 257 307 116 39 112 41 145 66 539 468 80
2825H0o8J50n9nlJ07o6j1L2pl2J00J72k10k8p6J2J86j04m9J26j17n7k4N6l6J57r5n3M9P7q7
2449A17l9J2M1n6m0J00l0mP3j09J59Pn3l8Rp4Q8j27J60j0l8Q7L6j07j35J34r2N5Ln6J15n1
2074A37m9R5j00o6K2J08Q4j55kO6K6j21J78n0jl2p3J17j36K3L5J7J42mo3L5j50K5rk1R0k6
1698A42K4L2j32l0J28J27N4k22n9L8n7Q7q5J23l6L0p5R6m6J05p1n9j0O9n4nJ3J09p0j29rJ1
1322C9J59j5LM9k33O4oJ03J93j49km8Oo1M1m8L6J0l3K2k8M6mn1J36j24J3M0m4p8Q2P4j71P0
923I1l0KL8n5N8K4l9L5l2PJ16Pj77Q9mQ8j13J75k13P1J7j12O0R5m5M2p7J9l3q5J30p1QjpL1
501A09M6J23j57N1L0q5RJ02QP3j18j02O0j42J72k9m2J7n3J16O6L7p3q8l8RJ21k7o3Q6j17L
125A04M1o3oJ3J97j26J9o6l8l3O0n7K4Q8n9n0JJ4m2J25n2O4P6j85K7O5m6
$$ plain form
2825 80 12 162 103 98 95 202 136 125 157 150 118 218 390 180 152 76 88 274 170 121 247 130 73 49 105 69 226 131 78 127 204 117
2449 117 78 90 131 75 35 135 105 101 174 65 224 231 178 140 149 75 163 36 196 186 148 235 271 164 29 163 71 126 129 73 188 137
2074 137 88 183 83 17 39 147 231 76 74 140 166 45 223 173 172 140 67 184 48 71 106 123 265 261 198 233 83 108 99 78 168 142
1698 142 166 198 66 36 164 291 345 123 64 102 45 132 47 170 134 164 89 185 139 244 173 114 104 173 119 114 127 236 166 37 28 39
1322 39 198 183 186 235 2 66 60 163 356 207 205 157 163 102 143 95 131 141 108 130 102 148 144 93 229 105 118 158 114 36 118 192 21 91
923 91 61 63 101 46 104 128 89 124 92 99 215 222 45 134 130 218 105 280 67 138 155 43 103 198 153 195 118 137 104 19 149 78 86 85 78 109
501 109 155 278 121 172 202 117 126 228 236 309 191 89 149 7 179 150 108 125 72 188 254 291 218 130 92 101 222 195 132 218 101 104
125 104 145 82 76 89 286 160 179 113 75 42 102 45 69 157 98 48 49 63 21 146 94 158 234 49 76 141 95
-192I5
##PAGE=	F1=2259.01
##FIRST=	25164.767445380970457,	5806.2096540000038658,	0.49984300136566162109
##DATA TABLE=	(F2++(Y..Y)), PROFILE
5806A81j10qj3J17jj49K3R0oQ3j21j0K2K6k7P3M9j73Kj1J36p2J23l5j19m7J07M5q6K8N1j35
5431C3K24k9n3j9M9r1jQ7n3O9q3j3J27o0K8Ml5J39k65K07r2n7p1J21j05P7j02R9m3m4J61O7
5055B76k02J00m0K4j04J31q5j7L0J03m8R3Qq1j15P1o2m6J00NJ84j42j10K0RO3M5p1M2j80J18
4691A19Q8j01j2M0Q8j71j0M9J10q0J1K0k3R1o0j44J38On4K8O5j42K8J9l0J11P3q3l7MK0r2
4316F9J40j68J95j80M8k0J07l8n6P7ko5R2o1Q9l7r1J08j02l5rj1J23J8o3Q4OL0Lj06p4j4J47
3928B04lj09N5LJm2L4j01RJ70j38Q8Lp7N9J05j91Q9O3j04L1J0j05J23N9j4j54M7J41KN7j13
3553B02MJ65k70M2j05P8l2L2N9J32j83l4n4J8M8LM4K8q7N6r3J0M0J67m4m7l7j01J11k7l5K0
3177A10j0K0N8m9mJ1l7k1J1L32o1L16on22o3m9J39J2j48K49Nj92q9J37r3J47r6K31k6k31p
$$ plain form
5806 181 71 63 50 167 166 17 40 130 124 207 86 76 98 124 97 170 219 46 48 37 173 101 224 189 70 23 130 175 89 117 168 33
5431 33 257 228 175 156 205 114 113 200 147 216 133 120 247 187 215 219 184 323 58 265 173 116 45 166 61 138 36 135 92 48 209 276
5055 276 74 174 134 158 54 185 100 83 113 216 168 261 269 188 73 144 82 36 136 141 325 183 73 93 102 165 210 139 181 1 119
4691 119 207 106 94 134 222 51 41 90 200 120 131 151 128 219 159 15 153 159 105 133 198 56 84 103 73 184 257 174 137 141 161 69
4316 69 209 41 236 56 104 84 191 153 97 174 172 107 199 138 227 190 99 207 105 70 61 50 173 191 128 212 218 248 251 145 71 57 204
3928 204 201 92 147 150 151 109 143 42 51 221 83 171 174 97 156 261 70 159 222 118 149 159 54 177 236 222 68 115 256 258 315 202
3553 202 206 371 101 143 38 116 84 116 175 307 124 90 36 54 102 105 149 177 90 146 53 63 103 270 226 179 142 41 152 125 90 110
3177 110 100 120 178 129 125 136 99 78 89 421 360 676 670 148 85 36 175 187 39 288 293 101 12 149 56 203 107 338 312 81 74
2813G4J54n6j01J6J31m4m8K8mPJ21J47k72n8K2l0J83m5j24J25j42kk9J00o6J95j48l1N6P4
2461B33r7m3pM9o6k2R9n6j2Q9o2J61k7r7m3Q5n8J9j20J28oK5M5L4r3o4K8q5R8qk5O1Kq2N7
2050A40o4l6M0K4J38j56j5M2j7oJ20J9jm6j30J20j32Qj3R9J52J0n0M2j38j09j0P8N0l8L4L3
1675A88j06m8J11J14N4j67n0Pm2Q0m7L4k4P1m1J12j15J68l2j08p7J01k1n7kJ41l6j74N2k6
1322F0R4K1k2N5j64K8j5J10J62j31l4n8L2m8%lKP7j9L2o6OK3n6J16j07LO6p2j6%O1j10R4k4
912I7n0N9n5R5l1p1P6K3o8J19%j24O7k5Q8p4J62k10P4j7j16R3J32q9N8p4j1k0n9O4q3N5j5
524G0OkJ20J14j85K8L5o2nJ18L8L3j57q7L4n6J67n9o1L4j5J14P0J2j20p6ORJ03j0p5N3q4n3
125E7N7l8j0jK04j03J1q6J4m5l6OK9R9p7O1k4j03J9O1o1J09J07j61nL5j0
$$ plain form
2813 74 228 172 71 87 218 174 126 154 150 157 278 425 153 95 117 87 270 225 101 226 84 82 53 153 87 282 134 103 159 233
2461 233 136 93 86 135 69 47 146 90 78 167 105 266 239 142 99 184 126 145 25 153 147 172 217 251 158 94 122 37 135 127 102 163 165 83 140
2050 140 76 40 80 104 242 86 71 113 96 90 210 229 228 182 52 172 40 48 35 134 286 296 246 288 150 41 31 109 159 121 155 188
1675 188 82 34 145 259 313 146 96 103 61 141 94 128 104 175 134 246 131 299 267 159 82 183 162 105 103 244 208 34 86 60
1322 60 154 175 153 208 44 72 57 167 329 198 164 106 138 90 90 87 89 166 147 179 113 119 142 86 202 95 98 164 92 76 76 137 27 121 97
912 97 47 106 51 146 115 44 120 143 75 194 194 70 137 112 200 126 288 78 152 135 19 112 244 155 213 139 128 108 49 113 30 85 70
524 70 76 74 194 308 123 151 186 124 119 237 275 308 151 64 98 42 209 150 89 123 108 222 292 304 184 108 114 123 226 216 141 194 110 57
125 57 114 76 66 65 269 166 177 91 105 60 24 30 59 158 81 142 118 15 34 95 34 143 250 89 84 119 109
-192A09
##PAGE=	F1=2156.75
##FIRST=	25164.767445380970457,	5806.2096540000038658,	0.49399673938751220703
##DATA TABLE=	(F2++(Y..Y)), PROFILE
5806A95r3m9L9O2j0r9l9J21pP7j51N2j4RJ6P8N4j81j5mJ32r8J33kj84R0Q9k1q3K3K7q7K03
5419B63k8m3kJ5p5m8R5k1j5o3J8J47k9j6Pl1J53k34J95j18n4q9J69r1rp0P3qm9J69P4k39J33
5032A79k9Pj38J06o1l2N1Q6jR7J3j26j5L0j20l5R9O0J72j33q1m6KR0K0o7O5j36O2L2m2J7M4
4644A70J0j62J0K9J17p8N8j4j3R9r0j14J60N2j01l7Q5n2Qq1rJ53M7r6Ok7On8J37j95K41j76
4269H5O0n8Q2m1k8O2K2n2O7o8Q2n2r6J13j09rL0nQ3K0p5R3L1k1K8q4p9J8P4Pn9j5L5l3J6p
3846A17m2j7J81j69J29j6q9Q8J04j83P1O3j63J12l8r3J28N5l3j35N9J32M2O8j23n0J45k51
3517I2M0m1k1J6K6R3P4j09n4m6kP5j10J43L1r6N3r0l3L9K00Jp3r9j9P6o6M4j4K5p6J00k4k7
3118A28Kp8J0L5L12j32K21j9l62l3l0J17Q0k07K74m1j98m6J44j01J77j15l7K9o5P0J38m2j77
$$ plain form
5806 195 102 53 92 154 144 45 6 127 120 197 46 98 84 93 109 187 241 60 45 41 173 75 208 206 22 112 201 180 97 120 147 60 263
5419 263 235 192 190 205 130 82 177 156 141 78 96 243 214 198 205 174 327 93 288 170 116 27 196 105 96 26 99 91 42 211 285 46 179
5032 179 150 157 19 125 64 32 83 169 168 265 278 152 137 167 47 12 111 171 343 210 129 83 85 175 195 128 193 57 119 151 109 126 170
4644 170 180 18 28 57 174 96 154 140 127 226 136 22 182 234 133 96 181 129 137 56 47 200 247 151 157 130 136 78 215 20 261 85
4269 85 145 87 169 128 100 162 184 132 199 131 213 161 65 178 69 60 90 85 168 188 113 206 237 216 244 160 81 99 173 180 121 106 141 108 124 117
3846 117 75 58 239 70 199 183 94 182 286 103 174 237 74 186 148 55 183 238 205 70 129 261 303 371 248 198 343 92
3517 92 132 91 70 86 112 205 279 170 116 70 68 143 33 176 207 111 164 74 41 80 280 281 208 109 90 166 100 144 130 155 79 179 155 128
3118 128 130 52 62 97 409 277 498 479 117 84 54 171 251 44 318 277 79 33 177 76 253 138 101 130 65 135 273 231 54
2778E4K4J34j8o2Q7j1k3J18J19l01q4J20o8J66J7j90R9j18M6m4J17q2K22j96NN2O1p9n7k7
2426H1N3p7mR6o1j5Q3kJ27p1j05m2J44m9l7j04J28oM7jJ9n8J5j05j0P4nJ4L4K4n8m0lk1O7
2015A32r6J91j11m1L1K2J1M2J02kp3j27J12j30J2l5J06J50Rl5O6j16j59j1P8L7n6J7K3n5q5
1651IJ35R1M4j13k2m7k6N9Ln3k0J11mJ25j74K25J9j56j60J24Nn8k9J42lj52P6ln8O4m8N2m8
1264A10j4l9J47Q6j22l8o5N0k6n6M4l8J38j2P2q7n2J8j9N2p2jP1n6J0o1N7q3J38j9j02P9m6
876F4J10o2r0Q3P7j05R6j6n3M6n6Q3k9J39j96N6j0j24J16J64j41O9p4m3j6j2Lp3J23l3n2J8
501F2J51Q6j74J1L7n2qJ21N6j3j77n2oM7J45o3j12L2N7Q8O3jj54o1M0M8O6lo0lo2r3O9k%k4
78E9J86p2Jr9M7k2m3J0rQ2o5J57o2j10K1l0jP1J28j29m0J5K2
$$ plain form
2778 54 78 212 194 132 219 208 185 303 422 121 37 157 89 255 272 82 181 63 109 65 182 100 322 126 131 183 244 165 108 81
2426 81 134 57 53 149 88 73 156 154 281 210 105 63 207 158 121 17 145 139 186 185 204 146 161 56 46 120 115 129 163 187 129 89 86 65 132
2015 132 36 227 116 75 106 128 139 181 283 281 208 81 193 63 75 40 146 296 305 270 336 220 61 50 128 165 109 126 149 94 9
1651 9 144 235 279 166 144 97 71 130 133 80 60 171 167 292 118 343 362 206 46 170 175 117 88 230 227 75 151 148 90 154 106 158 110
1264 110 96 57 204 290 168 130 65 115 89 33 77 39 177 165 237 150 98 116 97 149 77 76 147 91 101 40 97 14 152 133 31 110 64
876 64 174 112 22 105 182 77 173 157 104 150 94 177 148 287 91 147 137 13 129 293 152 221 147 104 88 76 79 6 129 96 44 62
501 62 213 299 125 136 173 121 113 234 290 277 100 48 42 89 234 171 59 91 148 236 299 298 144 83 123 171 237 234 174 171 109 16 85 83 83 59
78 59 245 173 174 75 122 100 57 67 58 140 75 232 170 60 81 51 50 121 249 120 80 95 117
-192A17
##PAGE=	F1=2054.49
##FIRST=	25164.767445380970457,	5806.2096540000038658,	0.50867831707000732422
##DATA TABLE=	(F2++(Y..Y)), PROFILE
5806B09p4r1P8K5l1l9k6O7j0N9j37P7l7j6N6P7M7j77j0rJ25j00J18L3j87J57P4o9r7K1L3m0
5431A06J43l0k7J5l4m4r4J05J0q3k6L0J50Rp1Ol3J74j76J50j05n3m1J31n5j03NJ4J6m8J71
5067B12Q1k46J23%j3j28M2k4nO5K0L7R6K0j53M7Jj52K8K7J00J41q1o9q1k3J10j4n6O4o5M6
4691A50q9O7K2L5o0o3K4o6J20n2Q3n2lJ09j16o3J60Q4r2j53J25L2%j49l3J70No0L8n7nk2J20
4304B09j74K33j26K9p5N5l8kM7L1l3M1o6M8m6n2O3q8j2N2J0N5K1j03J27L9p1N4m7j03O7j8
3928A27J8Kr3J16j07O8m5J2l1J63j78J55j9r4J00J06j53L6M9j70J51q0n9J05M5n1r0N7J02
3588B42P4Q1j07j35J32j93K8L0n0k2P7P0L2o6o2j9l4R4j34J57K3j00O3o7r1K6K18M8q8j58
3236F9O7K8o8R0n4P1j09O2Mj6j1r8J3Q0K61k03J57n3k08KJR6J23k03K33q3j81j9J31r0J87
$$ plain form
5806 209 135 44 122 147 116 77 51 118 108 167 30 107 70 54 110 187 234 57 47 38 163 63 181 214 27 184 258 189 92 113 146 106
5431 106 249 219 192 207 173 129 35 140 150 67 41 71 221 230 159 165 132 306 130 280 175 122 81 212 157 54 59 73 89 41 212
5067 212 293 47 170 170 157 29 71 47 42 107 127 164 260 280 127 174 175 23 51 78 178 319 238 169 88 65 175 161 105 169 104 150
4691 150 61 128 150 185 125 62 86 20 140 88 171 119 116 225 109 46 206 290 198 45 170 202 202 53 20 190 195 135 173 116 111 89 209
4304 209 35 268 142 171 96 151 113 111 158 189 156 197 131 179 133 81 144 56 44 96 106 161 182 79 206 245 174 228 181 78 145 127
3928 127 145 147 54 170 63 131 86 98 67 230 52 207 188 94 194 300 147 183 232 62 213 133 74 179 224 173 83 140 242
3588 242 316 397 290 155 287 94 122 152 102 80 157 227 259 193 131 112 78 172 38 195 218 118 181 114 23 49 267 315 227 69
3236 69 136 164 96 186 132 203 94 156 160 144 133 35 48 128 389 186 343 290 82 84 85 181 304 101 334 251 70 51 182 92 279
2872B79j20m4p6MJ23J14j6j71j9J17Jn2J50k7o9R5R0k87l0J29j18J60P6k13L8n6N4o0J13p4
2520A11K34k32M0M3M1m4p3m1M5p8J3Q4m6j5O4N7O1j05o5n8J80m8n9p2J35k6L1l1j3j0Q9j86
2144B6P6JmM9M1J2k6j35Q0l5R5j15J24l8m9J1Q7k7l2J86mj10r9J24j52L6j5N1J35nj7R1q6
1757B76j47pJ0N8q1k4J4J0p2J25N8L0p0mr8LK3N1j19j7J45K4J23k07K65O8j96k22J25J8j8
1393A44n9J07K7j02R3K2j79P6o3K5R3n8n8J96j6j31lo9N9Kq3M6j7J27k0J18q5j00LK7m0k2
1017F0J3M0moq2O4p0J60j8j41R2l2J08o7q4M6J22r9N6l8K2J7q7Q2PJ10j66J5L4j07R6J93j92
630A44P4p2o3k6L4m4m4J80l1j43R1J09N0j42J5L5o0pJ23N1n0j79J2l5J01J26m3j72OJ46L9
266B25M8Nj52o8O2J14J9rk9o1n7q0N1L0J5m9J51l2j3j01N1Rpl7j8M6j2K06j11q1J1j05Q6j5
$$ plain form
2872 279 159 115 39 43 166 280 264 93 74 191 192 140 290 263 194 289 379 92 62 191 73 233 309 96 134 78 132 72 185 111
2520 111 345 113 153 196 237 193 120 79 124 46 59 143 97 82 146 203 264 159 94 36 216 168 109 37 172 146 177 146 133 123 212 26
2144 26 102 103 99 148 189 201 175 40 120 85 180 65 189 151 102 113 200 173 141 327 323 213 114 238 86 122 107 158 293 288 271 362 276
1757 276 129 122 132 190 109 85 99 109 37 162 220 250 180 176 78 81 104 155 36 19 164 188 311 104 369 437 241 19 144 162 144
1393 144 85 192 219 117 210 232 53 129 66 91 184 126 68 264 248 117 114 45 104 106 23 69 52 179 159 277 192 92 95 122 82 60
1017 60 73 113 109 103 21 85 15 175 157 16 108 76 184 117 33 79 201 102 158 120 142 159 72 154 161 271 105 120 154 47 143 336 144
630 144 218 146 83 57 91 47 3 183 152 9 100 209 259 117 132 167 107 100 223 274 224 45 57 22 123 249 206 34 40 186 225
266 225 273 278 126 58 120 234 253 244 215 154 97 17 68 98 113 64 215 183 170 69 120 129 122 85 67 113 101 307 196 115 126 21 107 92
-133I2J42r4p7NN4
$$ plain form
-133 92 234 140 63 68 122
-192A22
##PAGE=	F1=1952.23
##FIRST=	25164.767445380970457,	5806.2096540000038658,	0.72592985630035400391
##DATA TABLE=	(F2++(Y..Y)), PROFILE
5806B20n6j19Q7Nm2J5j9J7j7K8n7L9l4m8Q6N1L8j57J9j9J27p6N7O2j41J58O2q4j20J3P2qN9
5419B18l4JL4r7j1n9Q0Kj19J6J9J34N0j16jm0J98j16Q8m8p6PP9j5j66K5QK2m0J59R2k12O9
5032A51M1k9p5l1jLQ2k8M6R2L0j64N6j8j38P7m1J08R5mo6q1n4J12n0k9L4J4O0j40J08kK1j15
4632F4O5L4j31P0j4Q7q3J0J13j37kJ48R6n8k22J19R8j3j61o0J32l5L6L7r4l%R4j40J94n8J
4257A87p8M3j9JK8J7nJ8n7rk1j8K4l8m0N6K1L9K4j40J80K5j09P1Jj41J24j04K4M6j35J87j78
3870B4J09p1L6l5J32j66J70or3Q7J10j10NJ6j41J55j05j5O1L2o2k5L7N8R7R0o9k29J22j16
3517I8J8R1l7j08J35L9Mn7o0J6n3R4j04J20J2r4Q1l8j45N0J73Q5r3j83J11j9l4J06r0J21j00
3154A39k4L3L5m0p0j5J17J87k53J61j19o5mK1R1J36j82J81j15j25j0P7n6J74j02O3j17q1J26
$$ plain form
5806 220 164 45 132 137 95 110 91 108 91 119 62 101 67 19 105 156 194 37 56 37 164 88 145 207 66 224 286 202 82 95 167 159 218
5419 218 184 185 219 122 111 52 132 134 15 31 50 184 234 118 117 77 275 159 247 199 123 130 209 194 28 53 61 83 43 202 294 82 151
5032 151 192 163 88 57 56 59 141 113 159 251 281 117 173 155 17 94 53 161 256 252 186 105 51 163 113 84 118 132 192 52 160 158 179 64
4632 64 129 163 32 102 88 175 92 102 215 78 76 224 320 262 40 159 257 244 83 23 155 120 156 193 99 96 96 190 50 244 186 187
4257 187 109 152 133 134 162 179 174 192 135 126 105 87 111 73 33 89 110 149 173 33 213 238 129 200 201 60 184 80 104 150 15 202 24
3870 24 133 62 98 63 195 29 199 193 100 187 297 187 192 208 67 222 117 102 163 195 133 108 145 203 300 390 321 92 214 98
3517 98 116 207 170 62 197 236 240 183 123 139 86 180 76 196 208 114 195 157 12 62 235 320 227 44 155 136 102 208 118 239 139
3154 139 115 148 183 143 73 58 175 362 109 270 151 86 82 103 194 330 148 329 214 89 79 156 100 274 172 235 118 37 163
2813A63Q3J8j21o4R0Kk4J49m8p1O5O0k35M9R9j76J92J05k04k1k2M4o7R4l0K21k52O9K9J8j2
2449B03p7m1K0o6K5O9k0k7N3J03k5q6j4q8J82n7l5n6J36n1mm2n2L6J53j53P0m4k5P5N9j9%
2062B02j69J24o1J10o8lL6l2k5O1k2n1K55j1j48o3J49j78N6lQJ07k5LJ05n0j30mm7R2r7p6
1686D5L3N3m8J05NL0l7lj37M8j7P9j44PJ46L3R4k00K81R8k20k02O8K7L3q2M2N1l5J01M6j84
1311A16mm2m7K27r2o1K28j17j49O1p3N8K1p1K1L5P0n0J53n7j31K3L5j21L6J4j2N7m6m4O1m9
935E0J35k5j32P6k4R4n2o9nJ52p4K4o2Q5j5j10Q6K4P7j12m8Q8q2O5K10k23P4o9m1n1M2n5j3
548B0J98j4j35P8M0J6j09L6L6q7%J32J9o7j45O1k0P5J13nj82jJ56k4K9L3j12r1N9J93k9l4
172B39Rj04o7m9M5L9L4q7J22Pk5r1K8L9L1q9RMN7K09j64l3%j44J34q6J44o1j11mR3
$$ plain form
2813 163 246 264 143 79 169 171 147 296 248 177 242 302 67 116 215 39 231 336 132 111 89 133 66 160 130 351 99 168 197 215 203
2449 203 126 85 105 39 64 133 113 86 139 242 217 131 117 29 211 154 119 63 199 148 144 102 50 86 239 86 156 112 87 162 221 202 202
2062 202 33 157 96 206 138 135 171 139 114 175 153 102 357 346 198 135 284 106 162 159 167 274 249 252 357 307 177 173 126 218 121 45
1686 45 78 131 83 188 193 223 186 183 46 94 77 156 12 19 165 198 292 92 373 471 251 49 117 144 177 95 137 188 153 254 300 116
1311 116 112 70 23 250 158 97 325 208 59 120 47 105 126 55 76 111 181 131 284 227 96 119 154 33 69 83 71 128 82 38 99 50
935 50 185 160 28 104 80 174 122 53 48 200 126 150 88 173 158 48 134 158 235 123 75 163 81 146 356 133 207 138 97 46 88 33 20
548 20 218 204 69 147 187 203 94 130 166 79 79 211 230 163 18 79 59 134 247 242 60 59 215 191 220 253 141 50 109 302 273 239
172 239 248 144 77 28 73 112 146 59 181 188 163 72 100 139 170 81 90 94 151 360 196 163 163 19 153 67 211 150 39 35 128
-192A28
##PAGE=	F1=1849.98
##FIRST=	25164.767445380970457,	5806.2096540000038658,	0.71158188581466674805
##DATA TABLE=	(F2++(Y..Y)), PROFILE
5806B23l9j27O8jk3L7k4j5k4j4L2j0j0n5Q2pL2j02M2k0J41n8k1Q0r6J38N0p3j34JJ32Nk8m0
5407A42L7N9j59NN0N4o5j00LJ2J02Q9j29j3k4J86p5K2L7j20O0J9J6j81j6M7K5k6J20J08j64
5043A21MR1l5k8q6Kj6J10l3L2Q5L6j62J1k9q4J13o3N8M3P6o5n8p5R5q2K6l0Q4Q3q5L9l1J0
4644A57j55J93L7j62MJ3P6r5J9J13j51O5J22Q8j9k09M8J43l5j51n4N8m2J34K0j35K1j2P0j06
4292E5J39J9j1p8M1MmJ0k2K3Om3p1MoK0jl2M0PK9L7j37J91mj34P9N3j78J74j61J6P3q9J60
3881B09j64Q9q9L0k0Q9j10J45J7q3M6J13n5k1k4j12J50j01K4LK1n4L9NKJ12J02l0k68P0l7
3517I8J6J31j8j94J82J9k1p7l6M2m9P6q1Q8Op2R7j7j80R1R0J08q8j62Q6n4K2J08j16J64q6
3154A73j03O4J01p9o0j3J42J05k55K02j56Pm9K2J00J19j51J32j35m1kj9jJ38o7N0j17n2Q5
$$ plain form
5806 223 184 57 125 124 101 138 114 99 75 61 93 83 73 18 100 93 125 23 65 45 186 128 107 187 91 229 279 206 72 73 205 210 182 142
5407 142 179 238 79 84 134 188 123 23 26 38 140 229 100 87 63 249 174 196 233 113 173 192 208 27 11 58 83 57 177 285 121
5043 121 125 216 181 153 67 69 53 163 130 162 247 283 121 132 103 19 132 69 127 170 246 181 123 48 143 61 87 57 141 224 139 178 147 157
4644 157 2 195 232 70 74 87 163 68 87 200 49 114 236 324 305 96 144 287 252 101 47 105 63 197 217 82 103 91 161 55
4292 55 194 213 202 124 165 169 165 175 153 176 182 139 68 72 66 86 85 53 93 100 129 166 29 220 216 82 161 214 36 210 49 65 138 49 209
3881 209 45 134 45 75 55 144 34 179 196 113 159 272 217 196 172 60 210 109 133 136 157 103 142 147 149 261 363 333 65 135 98
3517 98 114 245 227 33 215 234 213 136 100 142 93 169 88 176 182 110 207 190 10 101 191 299 211 49 135 81 103 211 95 259 173
3154 173 70 134 235 156 96 83 225 330 75 277 121 128 79 101 201 320 169 301 166 125 123 104 103 241 174 224 107 55 140
2813A40M0N1n6q4O5j4J2L2n0J0K9K9j58J02P8j74K25P4j85m3m3L0o7O6N2J77k46Q5J4mjo3
2438A23k4j6n5L1O7J6o7N8J27j08J3j9j14J60o9J3n3J26o8m7m0j8OJ97j12O4m8o0R2P7o5J9
2062B06j38J15q7J03j4j08R0Mn5p3J27j01L00k4j75k1J65j83N2Qj9O5m3K3J02j1j14lp4J13
1710B30r1j00N7N5l4R1o7N2rj9j58R8l6P0j14J1J48K0L0j48K70R8k21j44J1N0O5r4l9O2L3
1346A77J03O4j53p7j2m9K41j10m7K29j91j17Q7q0N2K0p2L4O3K9j04J68pj42N8K2j16K3j5m5
994C3J03q7QO7m4R9m1p6M6l5P5k7l8n5J53m2J0q6J23l9j05P2L3L4l7j23J28m2K8K09k19O4
618A89o3J4n4k3qoJ72Pj08N5k2jr2O6L7j24J2J50k3p1n0L7j4L8J06M2j60K2J03q7PP6o6p3
219H8J0K63o9p5N0j27q5k6P4J9N5j42J12L2k6p3j4O4P1j35O5l6J14J78k15K9j2j55J45j21
$$ plain form
2813 140 180 231 175 91 156 142 154 186 136 146 175 204 46 148 226 52 277 351 166 123 80 110 43 109 161 338 92 177 191 187 186 123
2438 123 99 83 28 59 126 142 75 133 260 152 165 146 32 192 123 136 83 209 141 94 54 36 42 239 127 191 143 83 175 252 187 206
2062 206 68 183 96 199 185 77 167 171 116 43 170 69 369 345 170 149 314 131 183 191 172 237 194 217 319 308 194 191 117 230
1710 230 139 39 96 151 117 208 141 193 184 165 7 105 69 139 25 36 184 204 234 86 356 454 233 89 100 150 215 121 82 144 177
1346 177 280 344 191 114 102 53 294 184 137 366 175 58 145 65 117 137 65 99 162 191 87 255 248 106 164 186 70 93 78 33
994 33 136 49 57 124 80 179 138 62 108 73 148 121 83 28 181 139 149 63 186 147 42 114 147 181 144 21 149 107 135 344 125 189
618 189 126 140 86 63 55 49 221 228 120 175 153 152 60 126 163 39 51 201 178 107 57 94 80 118 224 266 106 128 231 144 151 227 161 88
219 88 98 361 292 217 267 140 55 29 103 122 177 35 147 179 153 80 66 130 201 66 131 95 209 387 172 201 189 34 179 58
-133E8J29l5j16k6J30
$$ plain form
-133 58 187 152 36 10 140
-192A40
##PAGE=	F1=1747.72
##FIRST=	25164.767445380970457,	5806.2096540000038658,	0.46778348088264465332
##DATA TABLE=	(F2++(Y..Y)), PROFILE
5806B15k8j18L8RJ4K6m0k5k9n3R7n1K1l3N7o3K0RLj9J63n2q9Q9o5J03M3n2j28oJ88Or3m9P2
5395A80R1j82j8J41N3j18j12j9J8O7J22j16j5JJ40n8l4J19j68J13l6L2j63L1kL7k2O1J20j11
5043A52n3J36k7Mj49Rl8J41j5J4P6K9j49o4m2J3J29n7k2jJ34n9k2r1O9j00Q7p9J11J06m7k8
4668A67m3Po6J86K6j79k0J0N0p9PJ16j54J30Q6O6J3j78j9J65o0j31l3j6M2J32J4j73O4n8N2
4304A24o7P7R1nq5M0K0JJp9M0J1k8q0k7rM2OJ3K8l1J9N7q3J49m3j52R0R6j82J86j70kQ4n2
3893H0J06r5M6j13J2K0L9k2Q3L6o5j3J14Mm6n2q3J30p0N2n3OmO5k7n0J13J19j2k03n5K9K6
3506A17J44%k52K04J3n7j02K2L5k0M0o8O5Ol1J03j1j90J05K0J19p4j25J5o2P5J06j29J92p4
3154A86j16P0J43j13p8J4J62K6k19K23j40J1r4NJ17P7j17J02j44M2J1j17O1Q0l2o3m8K8N1
$$ plain form
5806 215 187 69 107 116 130 156 116 91 62 9 106 55 76 43 100 37 57 66 69 50 213 161 72 161 96 199 242 190 62 56 244 250 157 108 180
5395 180 271 89 71 212 265 147 35 16 34 101 223 107 92 93 233 175 141 260 92 205 169 201 38 69 67 104 82 143 263 152
5043 152 99 235 208 212 63 72 34 175 160 174 250 279 130 66 24 37 166 109 87 86 220 161 139 48 117 17 104 25 136 242 195 167
4668 167 124 131 65 251 277 98 78 88 138 59 66 182 28 158 244 310 323 145 126 291 231 100 67 51 93 225 239 66 130 72 124
4304 124 57 134 225 220 135 175 195 196 197 118 158 169 141 61 34 25 67 73 86 114 83 102 159 76 225 182 30 120 216 34 220 50 48 132 80
3893 80 186 91 137 24 36 56 95 73 156 192 127 114 228 232 186 134 51 181 111 163 110 116 112 177 150 100 213 332 320 117 62 91 117
3506 117 261 261 9 213 226 169 67 89 124 104 144 76 141 147 116 219 208 18 123 143 262 188 63 78 16 91 197 68 260 186
3154 186 70 140 283 170 92 106 268 294 75 298 158 169 75 80 197 274 157 259 115 157 168 51 112 192 160 97 49 77 128
2813A28k2P0%p7N1k9M7p3K00j11p9Kp4J17P2j09K39Lj67m1r3J8o1L8J51J04k09Q6jj4k2l3
2438A11Pn1n4K3R0N8j12M9J26j55J24n3j30J31q2O2n1J05o9o9n2Q7m0J70q2O2l4q5J07Q7j18
2074A62K7q4Q2r7P4L7j73J17M7k1L33J3m58L08m8j77K5J48j51K1K0l4J4n6M1Q1K8r9rn5J01
1710B17o3q6M1N2k9P7j33P7K0m5r0P0k7K8p1QJ73j0o0m4K14P2j99o9l2Q3P3q9o9J7P8J03P4
1322C61j16j12pj9J99j10j6J92k19m7P4r0M8Kq8P2P2Rj63J60N2j36P6J1r7kn6k8J03j02M9
959G2P3n1O4o5J1K8p9O0lJ2r8J25j0J1r2J12l5o4K0N8k5M2j18O4RnJ83j78M4n5Q0m1j30O5
560H4mJ11K2o6K8n7jq0Q6L2j19jJ61m2q7J7J0j4KR7Q8j20L8M9j39j5J19l3j6n9L09r4j26R0
160B70j35r8kJ12j5O8j78R9L4j5m9m9P2J05j65J27o6J44J31k57R3k5j56J36j15J03k3q7lJ00
$$ plain form
2813 128 106 176 176 99 150 121 168 95 295 184 105 107 33 150 222 113 352 355 188 147 54 72 11 49 200 304 95 181 180 166 144 111
2438 111 118 67 13 36 126 184 72 121 247 92 216 163 33 164 82 144 93 198 129 60 8 95 55 225 143 205 171 86 193 280 162
2074 162 189 105 187 90 164 201 28 145 192 171 504 517 59 367 319 142 167 315 164 185 205 171 185 129 170 251 279 180 171 116 217
1710 217 154 68 109 161 132 209 76 153 173 128 38 108 81 109 38 46 219 209 149 105 319 391 192 123 91 174 247 158 89 106 184 287 361
1322 361 245 133 126 107 306 196 180 372 153 106 180 90 138 140 52 124 196 205 42 202 254 118 194 205 108 106 50 22 125 23 72
959 72 145 94 158 93 104 132 53 113 110 122 24 149 139 150 58 170 135 71 91 149 124 166 48 112 121 116 299 121 165 110 190 149 19 84
560 84 80 191 213 147 175 118 117 37 123 155 36 35 196 154 67 84 94 80 82 179 267 147 185 234 95 80 199 166 150 91 400 306 180 270
160 270 135 37 35 147 132 200 22 121 155 140 91 42 114 219 54 181 115 259 390 133 226 201 45 181 66 169 146 59 56 156
-192A56
##PAGE=	F1=1645.46
##FIRST=	25164.767445380970457,	5806.2096540000038658,	0.21501739323139190674
##DATA TABLE=	(F2++(Y..Y)), PROFILE
5806A99k6j03K5K8L7Jo1j4l4KM4p4M9LK6Kj2L1n6k4J82m7j29Q5m9O1L9l1j08%K21Nj18n7R3
5395A90J27j86m2J79N6j21j25n0ON0J38j08JmJ07n1p2J67k02J65p5L2j17R2o4N5m2J4J12o3
5043A69r5J68qK2k16K7k0J38%MP0Oj27p8PkJ31m6r3mJ27m0J0j07M8p7R7n8P3J20l7q4k8J4
4644A11K0J60jj82rnOl6l1J26j37J80M7L7L0j40o6J63p9j14Qm3R7Q6K2j95J13j28M4j6K9J32
4269B29Rr8L1L0K2Kj15J1L2j5k1r8kL0rP2K3p2J3P7m1J13p7j19P6J04j53J63j60NQ9n3M3%
3870A41Jj23K6K4%M6K3L9m2p3J07O1p3n1l9P9k4O8p8k3O2N3n1n8P2J42k7j12j66P6M5J28J8
3482B71k27J51J8j06l7L6j1K6qn2M6OK4R3k5j68Q0k0J26n2r2p2P2mR8j32K04o4o0M4J49j32
3107A82j12N2J75m0j95K34j06Nj25k0J29K2q5R5j36R4L0j30O4Opm2M3m1N6o2K9K6m8M4k2P9
$$ plain form
5806 199 173 70 95 123 160 161 100 86 52 54 98 24 73 76 102 104 92 123 67 43 225 178 49 134 85 146 185 154 46 46 267 272 154 97 190
5395 190 317 131 89 268 324 203 78 28 34 84 222 114 115 111 218 167 95 262 60 225 150 182 65 157 93 148 106 120 232 169
5043 169 74 242 234 256 40 67 47 185 185 189 259 265 138 60 67 65 196 150 57 53 180 140 150 43 91 14 111 53 126 246 209 125 97 111
4644 111 131 291 290 108 99 94 100 64 33 159 22 202 249 286 316 176 110 273 194 80 88 45 142 228 250 55 168 40 84 68 97 229
4269 229 238 140 171 201 223 225 110 121 153 138 117 19 17 47 38 110 133 61 74 151 110 223 146 27 103 207 54 217 57 62 151 98 141 141
3870 141 142 19 45 69 69 115 138 177 135 62 169 230 157 106 67 146 122 190 112 89 151 204 153 95 167 309 282 170 4 80 125 253 271
3482 271 44 195 213 107 70 106 95 121 113 61 107 113 137 230 205 37 117 97 223 171 79 7 79 75 173 41 245 181 121 165 314 182
3107 182 70 122 297 257 62 296 190 195 70 50 179 201 116 211 75 169 199 69 133 139 132 90 133 92 148 86 115 141 93 137 115 194
2731A94K63L01m24k87Oj0P7P9l3K53p3j44l6j40K5j6K9J71J4j39O4j3%o8%M3p6pk7J01J05
2367B32j23j3J10j32J70p7j20R4q1P9n2Q7n9k7k3N9j1J01p5O2j9r2J28R0j76K7k0K6p7M7O0
2003A95j72J06Q3R5R43j04j034K46r0j32O4Q2q7k4L8m2m3n7N3M5O1p1l3KN5k2o5QN9l0N8j01
1628H6J8M8p0lK1nk4k6RK04m6j35P1J19K8j56J0o1R8P6o9m3m2O3J10P0q3j09k7J3J41r3K6
1240B19J22j98oP6j06N5j2j21J12P0Lj91J25R8j15O2Rq0k7o6J9M9n5M3O9o5L7p8J01K2j44
876B7O6oP5j41Q3K4K1o8M4kj3m9J17o8P5q1m4O1k5J41j18J8m9J44j4j81O8JL9J5j7Jn4On1
466D5Q3J2m6m1J42j9j27M3j4j1k5P5J27o6L9J0j73l4J49j5O2j27L20r9j74J22j28j02K1J39
114A88m7O9j27K6J0Mk4l8M3J28j83J80q7J49P8k81J48l7j52J11q0Q0k2n7L0O3
$$ plain form
2731 194 457 758 334 47 53 43 120 199 166 419 346 202 166 26 51 35 64 235 249 110 174 161 161 93 93 136 60 53 26 127 232
2367 232 109 96 206 74 244 167 47 141 60 139 87 174 115 88 65 124 113 214 139 201 182 90 218 308 132 159 139 165 88 135 195
2003 195 23 129 212 307 1250 1146 112 358 268 136 200 282 195 171 209 167 124 67 120 165 226 155 122 124 179 157 92 100 159 129 187 86
1628 86 104 152 82 79 100 95 71 45 54 258 212 77 148 267 295 139 149 88 186 262 193 150 108 171 281 351 268 159 132 145 286 193 219
1240 219 341 143 137 213 107 162 150 29 141 211 214 23 148 246 131 193 202 122 95 29 48 97 42 85 154 89 126 48 149 171 27
876 27 93 87 162 21 104 128 149 81 125 123 110 61 178 110 185 104 60 121 96 237 119 137 88 232 218 37 105 106 145 160 143 144 90 96 45
466 45 128 140 94 53 195 176 49 92 78 67 42 117 244 178 217 227 54 20 169 154 216 89 409 310 136 258 130 28 49 188
114 188 141 210 83 109 119 123 99 61 104 232 49 229 142 291 369 88 236 199 47 158 78 158 136 79 109 172
-192A72
##PAGE=	F1=1543.2
##FIRST=	25164.767445380970457,	5806.2096540000038658,	0.086957313120365142822
##DATA TABLE=	(F2++(Y..Y)), PROFILE
5806A80k9r1L7M1M2k5q1J0m4N1k1k8K5M7j6P5rJ3j21j3J69l2j31O0m1K0L6j7q9J6K30J0j09
5419A65n8R6J63j91n7J72N7q3j13j05%M6J36j23L7l6R5m5r5J71k08K04q1J8n6J32j11P0p6
5078A24PO9l4j15J78J7K7k57M3K6J14kkP0k4r7nK0o7J32m1j36L2O0j0K7j21L5m5P5l8N7J21
4691B40n3j04oK7Q3J22l7j74J6pn5K0l6R2r1K04J1NL2j05q1J39q6j09P3k6P6L7L6j94J59j75
4316C3J5M5J2J22K5j12J3L3N3J7j07p8O4lL7j06j6k4mR7J4r1K2Q2j4Q4r7l4M2O5j18J33j51
3928E3L3J03q1j7R9m3p8L4j8j4P9j7J1j3j01P2J05r1k2QJ3K4P5p0n1R9K1n7k8KJ60o7k7j44
3529E2K4N6R4L5j85R4K3j61J27l2m5N7n4j4K7j1Q1P0n4j19K9l5J36k4o5j4N8p8P3j08J84o0
3154A61PK2J30j30j34P4J76q9j92K45o2oj41l4J20k9n5J00j05R3N3q4M2o5j3J10mr2Q2m9o8
$$ plain form
5806 180 151 60 97 138 180 155 74 84 40 91 70 42 67 114 98 173 164 177 56 43 212 180 49 109 68 88 124 107 18 34 264 274 165
5419 165 107 203 366 175 118 290 347 264 151 46 46 92 228 105 142 106 201 156 61 232 24 228 147 165 109 241 130 200 124
5078 124 131 200 166 51 229 246 273 16 59 85 199 197 195 265 241 144 139 159 92 224 183 47 79 139 129 156 35 70 25 100 62 119 240
4691 240 187 83 77 104 187 309 272 98 114 107 52 72 36 128 37 241 252 257 289 184 103 242 156 47 120 94 170 207 243 49 208 33
4316 33 48 93 105 227 252 140 153 186 239 256 149 71 135 132 169 63 47 23 19 116 130 39 61 143 129 213 116 82 124 189 71 204 53
3928 53 86 189 108 91 190 147 69 103 85 71 150 133 144 131 30 102 207 116 94 102 115 139 214 144 93 192 213 156 128 130 290 223 196 52
3529 52 76 132 226 261 76 170 193 32 159 127 82 139 85 71 98 87 168 238 184 65 94 59 195 171 106 92 150 72 145 37 221 161
3154 161 168 190 320 190 56 130 306 217 25 270 208 202 61 27 147 118 63 163 58 151 204 120 162 97 84 194 190 98 180 131 63
2790F3J0j6N1QJ10O72M18p81n17N3JnR0M0K53j23j11m2j48N0rO4J22p4m6J8j9L9q1qO6r7O4
2402A15l0L1J53r8j10Q2m8J43p7q0O2n8M3o2P9m9L4lj1N1M9r4O7j6q2J55Q4k21K4L9n3j8O4
2015A65J8j25R3R0K66J745k35j799J31j50l8Q1k3ro3O6m9j02LQNQ1op3N4oJ9m6k5P2k2K3K0
1628A69j18O7p6O8k4J6p3J6J3K24p3j12R4J4j9r5P4p3P8P8l9ln8j1J33M8o4p0o6M4P8o5P4
1240B49L4j36rR7j29P4kj17Q2O9pj58Q2R9r0K3J1o2n0J9nj2J4K5N0q4K4j0J09K1j65P1o4J41
841A94j60K0N6L5l3n2N3L1j10J81n7L9m8j18P8l0J03p1kn0K04K0j89J6J0Rm1K8l1j4K0m0R1
454A42j3K6p5J14J5j65M0l5J8l1K0J52j3K7j2j84kJ15pJ36j78K98q7k08J38j04q8K5J48o9
102A43O7o0l7l1K4kj1J2J41k07K20r4J30L5k81J86n0j50P6k3O5k8m0P6K0
$$ plain form
2790 63 73 57 108 116 226 898 1316 535 18 71 72 67 157 197 450 327 216 174 26 76 67 131 253 179 133 151 132 171 90 82 148 51 115
2402 115 85 116 269 171 61 143 95 238 161 81 143 85 128 66 145 96 130 127 116 167 216 122 189 173 91 246 330 109 133 172 119 101 165
2015 165 183 58 151 241 507 2252 2017 218 349 199 161 242 219 210 147 213 164 62 65 73 78 159 153 80 134 128 147 101 76 148 126 149 169
1628 169 51 118 42 110 86 102 29 45 58 282 209 97 191 205 186 91 165 92 170 248 209 206 148 137 270 318 254 184 118 162 240 175 249
1240 249 283 147 138 235 106 180 178 61 143 212 205 47 129 228 138 161 172 110 60 79 74 62 76 101 151 67 91 81 190 211 46 117 53 194
841 194 34 54 110 145 112 60 113 144 34 215 158 197 149 31 109 79 182 111 109 59 263 283 94 110 120 129 88 116 85 71 91 51 142
454 142 129 155 80 194 209 44 84 49 67 36 56 208 195 222 210 26 24 139 132 268 90 388 301 93 231 127 39 64 212 143
102 143 210 150 113 82 106 104 93 105 246 39 259 165 295 330 49 235 185 35 111 88 153 125 85 161 181
-192A81
##PAGE=	F1=1440.95
##FIRST=	25164.767445380970457,	5806.2096540000038658,	0.079307995736598968506
##DATA TABLE=	(F2++(Y..Y)), PROFILE
5806A68l3r1O5M2L6m5q5L0n9P8p1M8k2Q3n7J19PNj78M0J04j2j11K5k2j2K5j2m6OK05K9q1n1
5407A27Q5J93j89p9J36N4j7q0j78K8K6J28j54Q7p0Q3l0j13J33j51J96n5mJJ47j39Q2j15K9
5067A61J5l0j13J61L9K7k13RO2R3k1qQ1n0o4N8L4j31J33m2j46L9J9J7L0j33L0k7N0l3P1J11
4691B29q3m3l5M0J17P3o4j62M3Rq4M2RLk5J98j1l0K4p6o6R4p0r4J33k8L2JM0j68J98j60l9
4304D7Q2mR5L4j17j1L0Q5M3q0j75Q5J2P6q5p0k2M2L3jo8M1O0JO3j03L9K4Qq0J00j38O7J24
3905B37j24n1J66q4j1K9o9qR0l6m2J9p2j0J28q4J8L8l6O4P2n4o1J04k1m3qn2J64j07L4r7l
3517I0M0N8N2j43M5K0j07J81j08k0M9r1K9K0l8J21L8q4n0%o9J54Lm8K7K6j07L3m4J24p2O3
3142A92RJ00j09j34P5J55j15j34J99k2k6j46nO9o2j9Q9o1M9P6k6L8j21j6P8k1j9J08l5j41
$$ plain form
5806 168 135 44 109 151 187 142 57 87 28 106 35 83 61 144 87 206 213 218 40 80 184 172 61 86 64 52 77 65 19 25 230 259 178 127
5407 127 212 405 216 137 273 327 310 230 52 80 106 234 80 167 97 180 150 37 170 19 215 160 156 157 304 165 247 132 161
5067 161 176 146 33 194 233 260 47 56 118 211 190 182 263 213 149 207 241 110 243 201 55 94 113 130 160 27 57 30 80 47 118 229
4691 229 146 103 68 108 225 298 234 72 115 124 40 82 91 94 69 267 256 226 250 174 108 202 132 38 171 143 175 176 216 48 246 86 47
4304 47 129 125 220 254 137 126 156 241 284 204 29 114 126 202 117 47 25 67 100 99 31 72 132 133 196 93 132 156 164 84 184 46 113 237
3905 237 113 62 228 144 133 162 93 85 175 139 97 116 44 34 162 78 96 134 98 162 234 180 119 223 202 159 151 99 263 156 190 93 90
3517 90 130 188 240 97 142 162 55 236 128 108 157 66 95 115 77 198 236 152 102 102 33 187 190 142 169 195 88 121 77 201 129 192
3142 192 201 301 192 58 133 288 173 39 238 216 190 44 39 108 46 27 116 55 104 180 154 192 71 55 133 112 93 201 166 25
2790B5J1j7N2M1J44J061N29j113p25P1K0n9O6R3K35j26p4o4j28O4k3J00O1j29L8l4k4R3m2
2449A46o4P0j17J42k3o9J91m6k09N0M4Q7n2l0M5m1lq6Q5m4Q3K3j06J31J0j16P6k7o6J85O9
2085C38k40L1P2j38O1J09n8o9J01P5M66K687l70k709ok17O9P6j37O6p4Q8n8j53J16r1K1L0
1757H6J06q0L0n5N4m8l3P3Lj5J21k03L4m2R9o2L2q5K4J7K21p6n5O8p9n1j9J06o4J8P7mM0m3
1358A95j10J73J0n8rj09P2K1l4J12m8n8m4J25j52R7L5r7J1P4k9j09P5N9o4l0J1m1m4J01l9
994I6m3O5kK2j04L1Q3P8J3j41O8j47J90j47k1M6M9op5M9O6j14J80k1j1k4j06J6j6Q2n7j5n9
606B5K56M9j94m1K7M2j17M8q6N0N3p5J21k5P4j10R0L1j82K9l4O7m4J1J32JPk0j73M0O5j1J89
219B95k03K51o2k26J37n8n1pJ36q3P5Kq1o8L9J1J1j5J57k32K35q8R2Qk49K03o3j44L0M8M8
$$ plain form
2790 25 36 19 71 112 256 1317 1846 733 8 79 99 40 106 199 434 308 234 170 42 106 83 183 244 115 153 119 95 188 146
2449 146 82 152 35 177 154 85 276 230 21 71 115 202 150 120 165 124 121 35 120 76 159 182 76 207 217 101 177 150 84 269 338
2085 338 98 129 201 63 124 233 175 106 207 282 748 3435 3065 356 350 133 202 278 141 207 133 221 163 10 126 35 56 86
1757 86 192 112 142 87 141 93 60 133 136 121 242 39 73 31 130 68 100 15 39 56 277 201 146 214 135 84 65 171 107 125 202 198 238 195
1358 195 85 258 268 210 201 92 164 185 151 263 215 157 113 238 86 183 218 121 132 206 177 68 143 202 138 108 119 78 34 135 96
994 96 53 118 116 138 34 65 148 226 239 98 166 19 209 62 41 87 136 130 55 104 170 56 236 215 204 180 74 90 74 156 99 84 25
606 25 281 330 136 95 122 164 47 95 9 59 112 37 158 133 207 97 187 218 36 65 31 98 54 65 197 198 205 185 12 52 117 106 295
219 295 92 343 281 55 192 134 83 76 212 129 204 206 125 57 96 107 118 103 260 28 263 175 267 275 26 229 166 22 52 100 148
-145A48l2l9J29k3
$$ plain form
-145 148 116 77 206 183
-192A83
##PAGE=	F1=1338.69
##FIRST=	25164.767445380970457,	5806.2096540000038658,	0.20525911450386047363
##DATA TABLE=	(F2++(Y..Y)), PROFILE
5806A69l2r6P8L2L2n4p3L5n7O3p5R3o1J03q3J18L4J3k13J05K5Nr1nJ4j9qNOj7J30N9n4l3O3
5395B11K11j68j13Q0M9N5l2k54R7k4J20j86J38p2N0j0j28P1m6J37nk7M3J40j50R3j51N0j1
5055A68n2q9J16N6K5j39k0O9Q2n1k0J05o4l1R2N9j87J30m8j20MK8K6K8j41K9rL8o2R8R7j09
4679A08N1r5M7J26K3o6j44N7L4m7%M8p3M3J65k0o2Pn2l0L9l0l9J49n5k2j8K8j17K22j26o3
4304H8Q2m2Q1L2j06l6K2J03Q1o1j90M1K6R0l5j62M3M6l7j3mL6L0J4M6j03R9Mm4k6N5j03Q6
3916A43J45j70m9J79j18P0J4j25J0Q9l7r2L8m5j9O6m0M2N1n6R4N7m8n3R1o7j2j5p1J48j19
3553A01N8l8mKK9O6j04NPJ3J44j82N4J6j06M7K1m9J39Kj03K6J5j35J74K2m4M2rj05NK0P0j13
3154H6R6J3P1p8j35Q0J10j16k3J20rn8j37M8J0o1K5L0JoO1L7O0j62J67J05j09j44J29l8j60
$$ plain form
5806 169 137 41 119 151 183 129 56 91 34 97 22 115 54 157 74 192 226 239 26 131 156 161 70 65 79 60 52 57 63 46 176 235 181 148 211
5395 211 422 254 141 221 270 325 293 39 136 112 232 46 184 112 162 152 24 95 49 186 181 154 197 337 187 280 129 179 168
5055 168 116 27 143 199 224 85 65 134 216 165 145 250 186 155 247 306 119 249 201 81 85 113 139 167 26 55 46 84 22 120 217 108
4679 108 159 64 111 237 260 194 50 107 141 94 94 142 69 112 277 257 195 202 150 120 159 129 90 239 184 162 144 172 55 277 151 88
4304 88 170 128 209 241 135 99 121 224 305 244 54 95 121 211 176 14 57 103 66 53 49 85 115 129 175 72 171 175 131 105 160 57 143
3916 143 288 118 69 248 130 200 214 89 99 188 151 59 97 52 33 99 59 101 152 96 190 247 199 146 237 170 158 143 72 220 101
3553 101 159 121 117 119 148 214 110 115 122 135 279 97 151 167 61 108 129 80 219 221 118 144 159 24 198 220 176 218 209 104 109 129 199 86
3154 86 182 195 266 188 53 133 243 127 104 224 215 157 20 68 78 17 42 72 73 67 128 165 225 63 230 335 226 82 211 173 13
2790A3J29jn6J9J69J348O07j348q61L4O1j8j5R9J95p5n2r6j00O7l8J27Jj06N6p1l2J49kj13
2438I0N6j28K07j3j79K10K5k53mJ13L4k8K2K7k9k5p8N9l9J04N2j96K05l0j11P2m7m8K08N1
2085C27k30N1P5j54Q0J42j18pJ03O1O74L674m96l677j41k34J11O0k10J01m4Q3o5j09J34j65
1780B6P9p5K17o8l0o1O6p9j0N5L6k5J55j99n1%J09r6M3l7j0K4J72m8j9L7j47o0O6R9m8n3O4
1393A32K8Q0mj89J96l4o3N8j36Q6j0j2J25j00Qr2J48j68J19P8p1o8Q7o7m7P0J8m1q2Kj5N2
1017H8Q6o3k3Q0m3Lr1K2J43M9mr3N8j66J56j22J2l1O6Jjk2Q3q4J24K6n0qq2m0J4O4o2k6l4
606C0K54O2j94r3N4R4j20L3m9k4J03j46J66j8Q8j40O9K3j70K1K5P4q7O4J19n1j4k3j38N5M0
243A07k4K11k00J92l1k25J17Nrn5J01r0J04L8j04p1L4J7J5m2J82k32J98p2M2kj66J87q1j11
$$ plain form
2790 13 142 141 85 104 273 1621 2228 880 19 53 114 96 81 180 375 300 248 152 52 119 81 208 209 103 159 88 56 205 203 90
2438 90 146 18 225 212 33 243 268 15 11 124 158 130 152 179 150 125 47 106 67 171 223 27 232 202 91 163 116 68 276 327
2085 327 97 148 223 69 149 291 173 166 269 330 1004 4678 4182 505 364 130 241 301 91 192 148 231 166 57 191 26
1780 26 105 30 247 179 149 88 154 75 65 120 156 131 286 87 36 36 145 49 92 55 45 69 241 193 174 211 64 4 70 169 121 68 132
1393 132 160 240 236 47 243 209 146 204 68 154 144 132 257 157 165 73 221 53 172 250 179 111 198 131 84 154 172 131 49 51 36 88
1017 88 174 111 88 168 125 128 37 59 202 251 247 154 212 46 202 80 92 61 127 128 127 105 188 104 228 254 204 196 114 74 88 152 90 64 30
606 30 284 346 152 59 113 207 87 120 71 47 150 4 170 152 240 100 169 192 22 43 68 142 55 119 238 187 173 150 12 67 107
243 107 83 294 94 286 255 30 147 152 143 88 189 99 203 241 137 66 100 117 132 90 272 40 238 166 208 206 40 227 146 35
-110C5lQ8K2l2l9J66n7
$$ plain form
-110 35 32 120 142 110 71 237 180
-192A80
##PAGE=	F1=1236.43
##FIRST=	25164.767445380970457,	5806.2096540000038658,	0.43576490879058837891
##DATA TABLE=	(F2++(Y..Y)), PROFILE
5806A74k5q9O2J7L4n2o7L6k8Nl4R7r1J05p1O7O9K8k04J42l3J2q6j4M4k5k7L4K6k0M2Q3l7n
5407A69L0K13j24j56J5M4J18J5l05J83r4J13k00J67m5LJ3j19K5NQ0N2m6O4J17j48J03j79N6
5067A69Lq4m9M4P8K3o8k6M1P9q3l6J37n9j5J01R1k21J13n9n7o1O6K3K8j34K9kN2q2Q3Q5j20
4679H9J16j37L7J19k2l4r8K6O1rl8N9j02R0J12k0q2k2k6J4j6K6J5J55r7q0k4Qn0K28q1p4P1
4292B14j07Q5K1p8n5J8R2J30o0j63j0K9Q5L2j86L9K9o7J3QJ0PL3L5j02J46k3p9M1pl7P5J70
3905C38k15l5J56j37J54mj86M2P6k8p3lm5N4o4J9N5N3n2J17K6n9k7P4j11K9n6m3J06o8J9K1
3529A33J3l7NP3o8k9%J13P4k37J49k2r5K7K3k9J29l0r4Q8L4j90J90K8n0L8m3q9NO9L7j69R2
3142A38L6N0m7j53J11M3r7Q4P3l1j01j01R6j3n6J7J4O7K0q2R6J01k00M56M80k76o28J26o9
$$ plain form
5806 174 149 60 122 139 173 121 54 90 62 67 33 130 39 144 73 140 209 237 33 175 142 154 68 54 98 73 46 80 106 86 128 211 174 169
5407 169 199 412 288 132 147 191 309 324 19 202 108 221 21 188 143 146 159 40 65 70 150 202 156 220 337 189 292 113 169
5067 169 172 88 39 83 161 184 116 90 131 210 127 91 228 169 154 255 346 125 238 179 122 61 127 150 178 44 73 71 123 41 124 209 89
4679 89 205 68 105 224 202 168 70 96 157 148 110 169 67 157 269 249 167 145 119 133 117 143 158 313 216 136 112 120 70 298 217 143 214
4292 214 107 192 213 135 80 98 190 320 260 97 87 116 201 233 47 86 115 48 61 69 79 86 119 154 52 198 175 96 137 130 93 168 338
3905 338 123 88 244 107 261 257 71 113 189 161 88 85 40 94 30 49 104 157 105 222 248 189 162 236 125 154 98 55 161 93 112 133
3529 133 146 109 114 187 119 90 90 203 277 40 189 167 72 99 122 93 222 192 98 186 220 30 220 248 198 236 193 104 109 178 215 46 138
3142 138 174 224 177 24 135 178 81 165 238 207 106 5 101 88 32 49 63 130 150 68 164 265 65 521 1001 725 97 223 154
2801A54j05K04M4j34o4J74J466O29j424q81k6P1M4m1M2J35J3m9j28o5N6m7J36m9j2Lp5l9J88
2461B20J8j44L9j14K30mj95J21J07k40K4O5J7m3O9jj7j8k7ol2J07P0j90J89q0n9L4o2l1K13
2097B60L8j98O7P4r7K6J49j31M6Q5O2Q59M591o03m585k55j86O8L4j78N0QM8o1m3J20k01Q7
1768A34p4K34o3p1m7O9j17MM1O2j1J36j60o2m3J38j30M4Lj3L2P6K0qj0j62L8L0P3l9p8L3L0
1381A09J08N3j80J27o3p4J07j24P8lj4J07j11M4j27J53j61J20J10m1j31J01j09J9M1Mk5r9
1053A9kJ0J27L2o6PR1r5Nl5k1J55L2k4l5L9j45Q0r9O8r8P9k1Q1o8Q3n2M7P1o5Lo6o9M6L3m4
630A03m8J0K07N6j87j33R3J24j11N2k5j10J48j37J35kP3j59M8lj28K4R2O0j37J14J44j40k9
290A34k5r1N6L1l6J96j71J36kj74M7P7K4j04N9r6J46M4j10m4K1K3lo7K05k08J23n2j1jn7J61
$$ plain form
2801 154 49 253 297 163 99 273 1739 2368 944 63 37 108 152 111 153 288 301 252 124 59 115 68 204 155 143 146 71 32 220
2461 220 238 94 133 19 249 245 50 171 278 38 62 127 144 101 170 169 152 134 107 101 69 176 246 56 245 165 106 140 78 47 260
2097 260 298 100 167 241 144 170 319 188 234 319 381 1240 5831 5228 643 388 202 270 304 126 176 184 232 171 128 248 47 134
1768 134 60 294 231 160 113 182 65 69 110 172 161 297 137 75 32 170 40 84 87 74 106 182 202 194 184 22 60 90 163 124 46 79 109
1381 109 217 270 90 217 154 80 187 63 141 138 124 231 120 164 37 190 29 149 259 218 87 188 79 98 139 143 118 19
1053 19 17 27 154 186 120 127 218 123 128 93 72 227 259 235 200 239 94 174 75 143 45 124 103 184 116 199 147 194 265 200 203 137 68 114 147 103
630 103 55 65 272 328 141 8 101 225 114 166 141 31 179 42 177 175 248 89 137 134 6 30 122 182 45 159 303 163 134
290 134 109 18 74 105 69 265 94 230 228 54 101 178 202 98 157 61 207 251 141 97 118 141 138 71 276 68 191 139 128 127 70 231
-86B31j03o9K9N9rl3j7J64p8
$$ plain form
-86 231 128 59 88 147 138 105 88 252 174
-192A74
##PAGE=	F1=1134.17
##FIRST=	25164.767445380970457,	5806.2096540000038658,	0.53764063119888305664
##DATA TABLE=	(F2++(Y..Y)), PROFILE
5806A71j7o9L8lM6n4p0M2Qo6LR4j03Q8k3rR6M1j57J43o5J1r1J1M3l7j4M8L7j3lO9l8L0lJ93
5384C77o3j99m6M5J53M9k59K07j67J08j75J43j0l5M1j02N4m2L3J05n7O2Q5j42J17j94M6N0
5055A84j12j2l0J26J0k4j3j9Q3j01m3J56l9k4R5J20k25P8p2L2j39J05K7L0j21M0k1P9r4N3
4703A29P6j21J44j32j1J09n8K4n0k7Q3K2o3M0q9J18N4k3q3o1QN1o2Q8N6J57j38j33l2rK8K15
4327C10l3p8O1j86J00%m0o2K7M7J86p8j27l3RP6J02j62j5kj3L0m2l0jN6L6r2J67n2r7J05p3
3940I6M0M5J98k49k8J14j17K07j9k40P8N6j6k4n1o3J18j03j3P2N1l5J32j6q5J8N6j46P3j24
3588B5M5K7K1m7N6M6n3k9P0l3o3L9J43j6j72J54o1n6k6K3J4R7n1n9J28L4k14K00K1n9K1o6
3212A59p5L2R7K3j78J6P3L5k3j26J08l3o6J68M9o5j52j8J11j0r4J5N6J07P1j95Q5J39k35Q12
$$ plain form
5806 171 154 85 123 120 166 112 42 84 92 26 29 123 20 108 85 76 172 213 56 199 134 145 54 65 108 71 57 105 142 129 126 195 157 187 184 377
5384 377 314 115 69 114 267 316 57 264 97 205 30 173 163 128 169 67 121 79 112 217 160 222 307 165 282 88 134 184
5055 184 72 60 30 156 166 142 129 110 193 92 49 205 166 142 237 357 132 210 138 170 31 136 163 193 72 112 91 170 76 129
4703 129 205 84 228 96 85 194 136 160 110 83 166 188 125 165 76 194 248 225 142 81 89 140 78 166 222 379 241 108 76 67 95 310
4327 310 277 199 260 74 174 174 134 72 99 146 332 254 127 94 103 179 281 119 104 102 89 119 77 47 46 102 138 46 213 161 64 169 96
3940 96 136 181 379 130 102 216 99 306 287 47 125 181 165 141 90 27 145 42 29 101 152 117 249 233 148 166 222 76 149 25
3588 25 70 97 118 71 127 173 120 91 161 128 65 104 247 231 59 213 152 96 70 93 107 204 153 94 222 256 42 242 263 204 225 159
3212 159 84 116 213 236 58 74 147 182 159 33 141 108 42 210 259 194 42 24 135 125 31 46 102 209 280 85 170 309 74 886
2860H86R99n17j203P8j22l2K54J21k09j55J58J389N84j325p91j1k6J09l6j7N7J05n5j43k7
2567G1K8m5J25p1P0o5m8k3J88J6j55K8q5K09Mj20n1J85k09N6J5O2j21J11l8pJ4K9p3l4J11
2203A77P4j55J55j39K8l7o1QJ72L5j55O9Q7m0l3J29q2O3N3Q2R89N317o81n306l37j25oRj11
1862A79j0M9jm7M3P9k25O4k6K14o5p2m9O9j22k2M4O8KJ12j08l9j14J89j46K1J8JM1k8J16j0
1487B25p9p6K9J4M2m3l3L5l4R9J16j37J8n7o2R4q0O1K4k6O9j01N3j29J34j16Q0J16j0j56R9
1123A69j13N4j2L3l3m6K0rJ43l6m4K5J03j42L0J4o9J33K6l4J4J8j01or8J46j15O1o2J35p8
759A26P7l3k0R9n4J4o4p5O8Ppp5K9J56L5j74n3M0J16j08R3rj71J65r7R1J3M0j62K5l5m2J8
372C3J40L5j47J09J81k21l4k7m6N2K2k4J48j34R6K3j00m2J39L9j41K9r8J76L1j05j0J6L5m2
$$ plain form
2860 886 1885 1368 165 243 121 89 343 464 255 100 258 1647 2231 906 115 104 78 187 151 134 191 296 241 98 71
2567 71 99 54 179 108 178 113 65 42 230 246 91 119 34 243 247 127 76 261 52 108 123 185 64 175 137 130 144 173 100 66 177
2203 177 251 96 251 112 140 103 42 50 222 257 102 171 258 218 185 314 232 295 348 430 1419 6736 6055 749 412 287 281 290 179
1862 179 169 218 217 170 213 292 67 131 105 319 254 182 133 202 80 58 102 170 172 284 176 137 23 212 66 87 105 106 147 119 235 225
1487 225 146 70 99 113 155 112 79 114 80 179 295 158 176 119 57 151 71 132 156 130 199 98 151 22 156 40 120 236 226 70 169
1123 169 56 110 98 131 98 52 72 63 206 170 126 151 254 112 142 156 87 220 246 212 226 244 143 137 39 185 70 131 69 204 126
759 126 203 170 150 249 195 209 145 70 138 145 138 63 92 248 283 109 56 96 212 104 197 188 17 182 85 176 189 229 67 92 57 15 33
372 33 173 208 61 170 351 130 96 69 23 75 97 73 221 87 183 206 106 64 203 242 101 130 32 208 239 134 124 140 175 133
20A33p7K10j69M2m0o0PN1J37j19l4N7L6l3m2J9J32q5
$$ plain form
20 133 56 266 97 139 99 39 46 97 234 115 81 138 174 141 99 118 250 165
-192A65
##PAGE=	F1=1031.91
##FIRST=	25164.767445380970457,	5806.2096540000038658,	0.4513264000415802002
##DATA TABLE=	(F2++(Y..Y)), PROFILE
5806A54qm0K2k5O4p1o4M1M0q1pP8o9L2L2k6N9M4r2J15q3J2r8O2J6m5J9M3L9OrK9n2N9k0J51
5384C27jk30o4M0J41N9j57J94k26J06j48J00J8n0P3r4Q5r0j0J47o2N3M4j37J34j89K3J10j30
5043F6J5o2J75j7j6J7j00R1p2pJ05j7n9Q4J32j99L1q4J30k09J29M5L2j08O4o8J09j02L0P1
4691B06j19J45q6r8J10p7P6j3p9J02M3p4pn0J37Jl6o6j00O4N8q9J37Q5J57j68j66n7j3R9J91
4327C13J0p3N3k55J16l5jn3L7qK39j05r8l5k9P3J59j27p1m0P0K7r9n6L6K8N1p2J62p3r3J38
3952A89j29J17nK29k65k6O1n0K07k7k71J02L3oJ7p3n5J34q9n9N4N4k1J42o2j15P1L7j61J12
3600A45q3M8o7R3o8M1Q6m4o6N0jr1J09J11j12jP3j02Rp4rO8N2n7j5J56Mj95J91Qo5Mp8p3P6
3189A23J01K6j53l2N7K4rm6N7p7n4K20L0q9j53PJ31lj35L9Q0J44J18k38K1J57k62J180J543
$$ plain form
5806 154 146 106 128 103 167 96 32 73 113 32 25 103 34 66 98 72 131 175 83 198 115 127 29 91 107 62 81 124 163 169 160 189 137 196 176 327
5384 327 326 96 32 72 213 272 115 309 83 189 41 141 159 109 182 88 173 83 73 220 158 211 255 118 252 63 86 196 66
5043 66 81 19 194 177 161 178 78 169 97 90 195 178 119 203 335 136 167 83 213 4 133 178 210 102 166 98 207 105 135 206
4691 206 87 232 146 48 158 81 157 144 65 167 210 136 129 79 216 217 181 115 15 79 137 48 185 270 427 259 93 36 23 122 313
4327 313 323 250 303 48 164 129 128 75 112 104 343 238 140 105 76 149 308 181 110 70 140 167 68 12 48 76 127 55 217 144 51 189
3952 189 60 177 172 401 136 110 171 121 328 301 30 132 165 159 176 103 48 182 93 34 88 142 121 263 201 86 157 194 33 145
3600 145 62 110 43 136 68 109 195 151 85 135 134 43 152 263 151 150 223 121 130 56 47 115 167 110 95 251 255 60 251 259 194 198 120 47 123
3189 123 224 250 97 65 122 146 137 91 148 71 17 237 267 178 25 32 163 160 25 64 144 288 406 168 189 346 84 1264 2807
2848B807p83j765Mj75L0K80K12k75k30J24J138M83j072o18K0j51J66k4m8k0J71n5j26qml5
2543D6J00l9Q0j17qnJ73%j45J9o0J71Lk2j40J69j59P4k9J38k08J27o6j0N6Q1j32n1J27P0j39
2179A04J52j92J10j23l3O7Q6M3j09N0J22oq0R1J1M8J2J16J041N741p16n728l78p5p9j3n7l6
1851A69O2m7k6J40K2k45K7L7J84p8l5o8N9r9n2M6N1%J19o7j1j49K20j50oKJ8M3q5K02j7j61
1475A05NJ0J0J9n8J3P0p7M6J68r5q8j2j9Jk2N7M0l1L9r8M8j13J08p6L6R7J5j25O4m1K0o6J04
1076A54q2LK7j1J44j01mK4J09j69P2M4j11Q3K4j4L1Qm1p6r1J95r8K3p6J15o0P5l3n0J04k4
700A94L2p7q0P6J7J6r4K5J09Pj45L7j9P5j11J33J0j74J21l5N0J9%j43Jj4kJ3J72Lj10M6K10
313C62k63l4k6mL3RNR4j06P7M4l2j19J76L2j55K9r0J63J9r7J9K2N0r3n4J73j13j4m6j8j2Q1
$$ plain form
2848 2807 2024 259 263 88 118 398 610 335 105 229 1367 1850 778 160 180 29 195 171 123 103 274 219 93 85 81 46
2543 46 146 107 187 70 62 57 230 230 85 104 44 215 218 196 56 225 66 140 111 249 41 168 102 92 148 229 97 46 173 243 104
2179 104 256 64 174 51 18 85 171 214 105 155 277 271 191 282 293 341 353 469 1510 7251 6535 807 429 354 275 262 205 169
1851 169 231 184 158 298 320 75 102 139 323 245 210 142 201 102 50 96 147 147 266 199 188 39 259 109 103 105 123 166 81 283 266 105
1475 105 110 120 130 149 91 104 174 97 143 311 216 128 116 97 98 76 133 173 142 181 83 131 18 126 50 86 183 198 73 137 96 116 50 154
1076 154 72 75 102 91 235 134 130 154 263 94 166 210 99 182 206 192 223 231 190 114 23 218 120 143 67 182 122 197 164 114 218 194
700 194 226 149 69 145 162 178 84 109 218 225 80 117 98 173 62 195 205 31 152 117 167 186 186 43 44 30 28 41 213 216 106 152 362
313 362 99 65 39 35 68 77 82 176 70 147 191 159 40 216 248 93 122 32 195 214 117 136 158 208 115 61 234 121 107 61 43 31 112
-74A12J14j13j6P5K2m0o8N4R6q7
$$ plain form
-74 112 226 113 97 172 194 154 86 140 236 149
-192A49
##PAGE=	F1=929.656
##FIRST=	25164.767445380970457,	5806.2096540000038658,	0.2940852046012878418
##DATA TABLE=	(F2++(Y..Y)), PROFILE
5806A31npJ9m2Q2j03l3J9N9n0kK6k8KL3K0k6L6k0O3r5J5o7R1k4l2M6K5L2L7j3lo5O8j5J01
5384B75M5k45pJ1Q1M6l6J52k52J08j40O2L0k6R3r8J02j07o2J80p4N7Mj38J51j55%J46j41L3
5032I5o0K07n1j7M9j80J01KON5oj05O8J15j46j7n9J89k23R5P4L6j01R9j33J38j00QO8j07J20
4668B20k0j95J23p4R5J6j17J11N4p4o6jJ46l0o4m1j9L7K0r0J60J00J56j76j66r7jJ34J66M3
4316C50o2M3k72J11q1K7l2L3m1K76j31r1j9p8Q1J94r4j10p4J46J4j39L5L4q3Q6o5J54p4q6
3963E2J41j54J69o5K54k58k4%L8J69k8k64J03J0%L9o8m2J30q2l5k4O9j9J44r9j07Q7J9j23
3611C2J15JPj21R8l4qJ18k4r5K1K0r6J65N1j83J71j6j44R2p0p4Q3J4n1J9J81n2j36J58oo3
3236A73op8q3J19Q7L8j29J6k3LnL3Jm8o8K16Mp7r2n2J47Oj57P2P3J74J56k54l5J54k74J482
$$ plain form
5806 131 126 119 138 96 178 75 42 61 120 70 68 94 66 68 101 121 95 131 111 174 79 94 27 118 94 62 108 133 165 202 189 186 121 189 174 275
5384 275 320 75 68 79 160 206 170 322 70 178 38 100 130 104 197 99 201 94 32 212 138 195 199 61 212 57 57 203 62 95
5032 95 35 242 191 174 223 43 144 146 152 207 201 96 164 279 133 116 57 246 23 118 192 228 127 226 93 231 131 139 207 100 220
4668 220 200 5 128 54 149 165 48 159 213 139 73 72 218 188 124 83 64 101 121 31 191 291 447 271 105 8 7 141 307 350
4316 350 288 331 59 170 89 116 84 117 76 352 221 130 111 33 114 308 214 104 30 176 190 51 86 120 37 123 58 212 138 52
3963 52 193 39 208 143 397 139 115 115 153 322 294 30 133 143 143 182 114 72 202 120 85 61 130 111 255 156 49 136 155 32
3611 32 147 148 155 34 132 98 90 208 184 89 110 130 34 199 250 67 238 222 78 170 100 26 109 123 72 91 272 220 84 242 236 173
3236 173 167 89 6 125 212 250 121 137 114 117 112 145 146 98 30 246 250 173 81 29 176 182 25 97 170 344 500 246 211 365 91 1573
2860A573J986j009k199q2k01N8K84K93l17k80Q6P77L48p28m01M7k06J49j6m9o9J89l9q1j3
2567A00l3l2Q6K0K9j24J5PJ49k0j10jl8J31j1P3j05M8r4P2o9K10k39R0n1m9Q9J20j75p1J42
2203A59O8j51J84k12J44j83J7J01%M5n4MJ71Kj08M7J08K0k5J49J006N790o97n774l77m4j38
1886B52k6l2k6N0q2pK33l3k64J4Q4J45j00K6q9L0o2l7J2J5k0J82o0J0j47K26j47k9l3K8L4
1522A47o7K49l3k32O5mPJ3p5M2J01r5OJ92o2j65L9J4r8M4N1M1l0L6j12L4j05J05o8RO1K5m7
1135H8LN9l5o2J45j47L7K0mJ32j49M4OJ04j68J22M7j34K4J2L7J2J7K4j08l7J52p5j4l9J2k3
759A02P7n2l5R7J5N3r4j02O9O6J3j02J5O7j5r8R0o9K3j01J46K4j28L2L8J7J3l6r0rO5n6J0
372D5J87l0n0m1K20k39m4pJ7jj1L4O4r8P6N9K2j74J83%j33N4q3J13K1q7L3L4O5j43MR1m1k6
$$ plain form
2860 1573 3559 2550 351 269 68 126 410 703 386 106 192 969 1317 589 188 235 29 178 162 113 44 233 194 113 100
2567 100 67 35 121 141 170 46 61 68 217 197 87 86 48 179 168 241 136 184 90 162 93 303 64 154 103 54 143 263 88 17 159
2203 159 227 76 260 48 192 9 26 127 127 172 118 122 293 295 187 234 342 362 337 486 1492 7282 6585 811 434 390 252
1886 252 226 194 168 218 136 129 362 329 65 79 163 308 208 234 145 175 113 76 88 103 83 265 205 215 68 294 147 118 85 113 147
1522 147 80 329 296 64 129 125 132 145 70 112 213 118 124 316 254 89 128 142 44 88 139 180 150 186 74 108 3 108 40 49 110 135 88
1135 88 91 150 115 53 198 51 88 108 104 236 87 131 137 241 73 195 242 108 132 144 181 193 210 234 126 89 241 166 152 113 125 102
759 102 179 127 92 189 204 257 163 61 130 196 209 107 122 189 174 76 166 97 120 19 165 189 61 93 131 148 161 125 35 26 91 35 45
372 45 232 202 152 111 331 92 48 41 58 57 46 80 144 46 122 181 203 29 212 212 79 133 50 163 184 97 130 164 229 86 90 181 140 114
-27A14o6N8j9K1R7q3j3Q0J6l3j10Q0P2r1
$$ plain form
-27 114 48 106 87 108 205 122 109 189 205 172 62 142 214 123
-192A23
##PAGE=	F1=827.398
##FIRST=	25164.767445380970457,	5806.2096540000038658,	0.19802060723304748535
##DATA TABLE=	(F2++(Y..Y)), PROFILE
5806A25j7J4K6n5R6j27krO3j8K7ok2J4j4N8r0L8M1qr1PJ6P3p0J4N0lJ7P6k7k0o1M6MO4O7k39
5360E7L3%L1J7P1Q9k36J09j42L2K6L9Q5j09J02q7q9J66r9Q7j6j08J11r6kJ30j43M3o9K41q4
4996A89j0P2k28J00Q2pM2j0j40L6P6q6n2M3J56k18N3J01M4j03J46j94J52q2k1O3q5P5M1j94
4644D1P8o7P9M5j06P5N3o3j06K8J44l4j02j7P9Nl9o5J51J03J55j58j50j08MJ22J45O1n0L0
4292C33k54J07j19L1jJ0m0K87j50j08J3q3N4K01p6j17p8J77Lj27J01L6j86J13q6J59m0j01
3963E9J24j39J80j13K55k29k0n4J05J21k4k33R7j0lM4m3l2J16q1J7j14R1k7J36j12pNom1R3
3600A55O3k4j39N3K1m2J19oj03j2K9o0J73j2j32K27q8j86J71m6q2OJ0n2M0K03j22n4J03j5
3247A98n0no7l5P6O6N2j13Q1p5k9j2R6n2ko3J76l0l2o8o7J27J8j71J00O0J83J76k42p4J36
$$ plain form
5806 125 108 122 148 93 189 62 60 51 114 96 123 117 95 109 95 153 63 101 142 134 43 50 66 139 69 83 133 130 147 223 196 176 115 161 165 229 296 57
5360 57 90 90 121 138 209 298 62 171 29 61 87 126 211 102 204 117 28 194 95 182 166 58 169 73 71 201 58 101 32 273 189
4996 189 179 251 23 123 205 198 240 230 90 126 202 116 64 107 263 45 98 199 243 140 286 92 244 162 141 204 119 194 235 41
4644 41 119 52 131 176 70 145 198 135 29 57 201 167 65 48 127 132 93 28 179 282 437 279 129 21 25 147 292 353 303 333
4292 333 79 186 67 98 97 107 67 354 204 96 109 26 80 281 205 88 10 187 190 63 164 200 14 127 41 200 160 59
3963 59 183 44 224 111 366 137 117 63 168 289 265 32 129 119 116 160 117 85 201 120 137 23 114 87 223 111 104 109 103 62 155
3600 155 218 194 55 108 129 87 206 200 97 85 114 54 227 215 83 310 222 36 207 161 79 85 95 43 83 286 164 110 213 198
3247 198 148 143 76 41 117 183 235 122 203 128 99 87 183 131 129 66 242 212 180 112 45 172 190 19 119 179 362 538 296 222 358
2884C58k67J649K224j143k408j55j92M6K66L45l28k91M5L96K10l72j93O3j67N9j5k9m8J28
2602A81ol2l2n4l8R4N3l3p0nJ8J14l3n1m2j4J01l4J37o8l2l1N2r4K48k38M2Mr0P8J37j83m3
2215C6R6Q0j56K02k02J35j29k4J22m5J6J4o1K15j2j16QJ81lm8J60Q95N439o17n426l36l5j74
1886B15k2l9J1J8j05NL05o8k79O9P2R8j24Q8r9j7k4Rl8l0k3K66r4J9j21K08j32n1o5K6J1p
1510H2K78n7k79J01j0%K7q3N2J13j05J1J76m5j83N8M2j25O5K2L7k6M3j21J3o4Q0p8LJ8KM7
1135I4n6J60p8k1J38j70L2O%J07j61P8k3Q4j40J75J7j23rk9R0k2M0Q0j14j0J04n8m2J7r3j
759G2P7q0JJ03N3O9j07j45M9J30%r5J2K9k5o0J13j08j1lO1J1n4o6J03j2ln7qPO9q5NJ84o4
348A65J9j29K14j62o2K7J7k9m9N1P0r3O7O7N6j99J59n1o0Q0p0L0L7p7L8L7Q0j64O7k4L8j3
$$ plain form
2884 358 91 1740 3964 2821 413 258 66 112 378 723 395 104 149 545 755 383 190 253 86 145 130 101 53 181
2602 181 175 143 111 57 19 113 166 133 63 58 76 190 157 106 64 50 151 117 254 186 154 123 175 81 329 91 133 137 47 125 262 79 36
2215 36 132 212 56 258 56 191 62 38 160 115 131 145 84 299 287 171 179 360 357 309 469 1364 6803 6186 760 424 389 215
1886 215 193 154 165 183 78 83 388 320 41 110 182 280 156 244 145 128 104 113 75 45 22 288 194 213 92 300 168 117 52 78 89 82
1510 82 360 303 24 125 115 115 142 59 111 224 119 130 306 261 78 136 178 53 118 140 177 151 194 73 86 22 102 24 27 45 47 94
1135 94 38 198 120 99 237 67 99 105 105 212 51 129 106 190 50 225 242 119 110 81 171 149 189 269 155 145 249 191 149 166 73 72
759 72 149 69 70 173 226 295 188 43 92 222 222 127 139 168 143 83 196 88 77 74 135 146 92 26 129 117 114 57 49 56 125 40 45 229 165
348 165 184 55 269 107 45 72 89 60 11 62 132 39 106 173 229 30 189 138 78 158 88 118 155 78 116 153 233 69 136 112 150 137
-27A37p5P9k2l2Q9m4j5P0J7j4j61R2O7r6
$$ plain form
-27 137 62 141 119 87 176 132 117 187 204 190 29 121 188 92
-192I2
##PAGE=	F1=725.14
##FIRST=	25164.767445380970457,	5806.2096540000038658,	0.19206623733043670654
##DATA TABLE=	(F2++(Y..Y)), PROFILE
5806A50m7J6L2o7J09j21%k5N8LO4k3l4K4n8P4j25P4P1q3j7l3O5M1j16Q1L9m0lJ19m8k7l7m
5407A12K7M6O7j97L3mJ6j0J36J5j79J03j31OOJ15N8j16Q9m6n5Q1j11J12%o2K2m1nJ04j29L3
5032I5p9K62j10NP9k27Q4J46l9O0k0j59lK6k6p4J50R5k01J8J14N7j13J95k17J30m7n9N1n8
4679A35J8Q0j64O8p1L8P5n7QL6l9p1j2J26j0j15j4J40j6r7j8J15R3J49j14j40j29L0Q9J32
4327B65O7m2Rk15J15j27OL0k4j4K74j65j38O5k0j3J58p8q0k5J30Oq0J28L7k08Q1j39J86K3
3975B12j30Q4j17J72j12K01j82j0o0R5Q1j5j92R3k6j3M1rj8Q6q4P6j38O2m4J17q2P5p7m1M6
3611I1P4R9m2j55MQ1n5Q7Qr0m4K7jJ47o4j5K06j32j75J83k0q2p9M5p8O2K08j87K9L9j9k9O
3224A29m0j4K2N6N5j06J40q9o2k1J35r9K9k3J20p5K6p5k0O5L3j80J11N8J62J71k06r0J14k41
$$ plain form
5806 150 103 119 151 84 193 72 72 47 105 108 172 149 115 139 81 155 30 104 175 92 75 42 107 148 32 113 152 112 109 228 180 153 116 112
5407 112 139 185 252 55 88 84 100 90 226 241 62 165 34 40 46 161 219 103 192 146 91 172 61 173 173 111 133 92 87 191 62 95
5032 95 16 278 168 173 252 25 109 255 216 276 256 97 94 120 94 20 170 265 64 82 196 253 140 335 118 248 201 142 193 135
4679 135 153 233 69 137 66 104 179 122 130 166 127 56 44 170 160 45 31 171 155 58 40 155 248 397 283 143 14 44 133 265
4327 265 332 290 299 84 199 72 78 108 84 70 344 179 41 106 86 73 231 153 73 48 178 184 104 232 269 61 142 3 189 212
3975 212 82 166 49 221 109 310 128 118 58 153 234 219 27 120 94 81 122 113 95 181 97 173 35 97 53 170 88 163 86 45 91
3611 91 165 264 222 67 71 152 97 184 192 102 58 85 84 231 167 152 358 226 51 234 214 132 53 98 20 82 290 103 132 171 152 123 129
3224 129 89 75 97 153 208 102 242 153 91 70 205 106 135 112 232 157 183 108 88 153 186 6 117 175 337 508 302 212 326 85
2872H5J636K203j149k349j88j67J7K23L53l06k59OR5P9p5m1O5r9k1j9Oj1M6L4Nn1o8k9R7M6
2520A64p7ql7M6O4l4K0j00J4Q6m9J46m3m7J2K2q5K24k19QO0r9K4J30j43j0K3J12q1J25j77
2156G1J03o9o5J38m8m0P8j06K22l0j07k1K15j3n2J38P30M729m83m727k66m1j88Lp2O0k4j12
1827B3M0L01p2k51J24L3M7j40J27q9p5J2N8q8k2Q8K06j53J2p4J64j00p3n7J5n2O4L02q5k60
1475B5Q0rrM9q4N7J06j12O4J15m6j54M5P7r7N1l0M0k7M8j13qj5N2n2NJ5k0K7l9J92q8j0J16
1076B51j40jJ3j6O2j05O0n0M6p9K10l9p8J2n8O2l4O1J14j18kO3n1n5P9j01n5O4r1J5J26Q5
700B50P5j11j93J3J86qp6K0lj3o6J34j38J7M3K9p0L0n0M8l8l1j8K9J7N0p8pJ65r4Q7j85J83
313A97q0p0O6Ok8p1K4R4o6K5P1O9j95J10j13O9Q1m8p0O0p6N2K2R1j27R2j43J05Lp5P2j9n7
$$ plain form
2872 85 1721 3924 2775 426 238 71 88 311 664 358 99 105 200 279 204 163 228 129 108 89 95 84 130 164 169 118 50 21 118 164
2520 164 87 79 42 88 152 118 138 38 52 138 89 235 192 145 157 179 94 318 99 107 167 68 92 222 79 69 92 204 123 248 71
2156 71 174 105 40 178 130 90 168 62 284 254 147 126 341 328 276 414 1144 5873 5390 663 397 356 168 171 99 159 135 23
1827 23 63 364 292 41 165 198 245 105 232 143 68 80 138 50 28 116 322 169 181 107 271 171 98 41 56 4 68 370 285 25
1475 25 105 96 87 136 52 109 215 103 167 282 236 82 127 204 107 158 128 168 141 189 76 68 53 105 53 58 73 53 80 41 233 145 135 251
1076 251 111 110 123 107 169 64 124 74 120 41 251 212 134 146 88 150 116 177 291 173 171 234 183 128 207 106 51 115 24 39 165 250
700 250 325 214 21 34 220 212 136 156 153 140 74 208 70 87 130 159 89 119 69 117 79 48 30 59 76 126 48 41 206 112 199 14 197
313 197 117 47 113 119 91 20 44 138 72 97 168 237 42 152 39 108 189 141 71 131 55 107 129 220 93 185 42 147 150 75 147 128 71
-74G1Q1k3j1N1K5Pj82O9P6r6
$$ plain form
-74 71 152 129 118 169 194 201 19 88 164 68
-192F8
##PAGE=	F1=622.883
##FIRST=	25164.767445380970457,	5806.2096540000038658,	0.32671061158180236816
##DATA TABLE=	(F2++(Y..Y)), PROFILE
5806A85p3jL4p5J14r0j5l0N4QQ9l8l8K0p3N9j10J09P9j46P6l8L7Pj19J20J4q1j9J57p0k7J
5419A20o9N0L9N1j17p%L7k5J43n1j01P9j01omJ49K9j12P0jj5%m8N3L7m7m3nj8R1j04Oo8K47
5008B59j20J4O9k01R0J77q8J01l4j68l1kK4p2K02L4j75KJ01P4j31K41k02P8kr2K6l1l4P9j14
4644G4R8p1l2J07jn7Klk7m2Q5L1q1l7J41k2j22K7O0P0J36n4j44j18N6K6J22O7l9k7j57J29
4269A97j08k9N6n7J6K43j73j17P7L4l6O9j02PJ1P3L2m8J33L3k07O4j16J37Q7j49K4j09J60
3928B02n7R4j32J2j5MO0mj46Q9l3l1N3J2J4K5q4J23j04Mp2R5j2J01j10n3Q2N6J16m9j67l9
3553C4J30n7M1J1n9o9J7O3R9r2P6J87j47j36J46Pp4j16N1q6O6J89k22Q4j3j4j0J8rj8l1P2
3177A38L6j00J73p5q8j0J40j34L2M6O3j25O6r3P1j2M7j29N5O5J08J39j53p9R8k03J441J938
$$ plain form
5806 185 112 111 145 70 184 94 79 49 103 111 200 162 124 144 71 130 20 129 208 62 138 100 137 144 25 145 159 78 59 216 146 119 120
5419 120 51 101 140 191 74 67 67 104 79 222 171 70 149 48 42 38 187 216 104 174 173 158 158 110 163 200 153 110 105 87 178 74 80 12 259
5008 259 139 153 222 21 111 288 200 301 267 99 68 66 90 18 220 254 79 81 182 256 125 366 164 242 240 148 174 143 109 188 74
4644 74 172 101 69 176 175 118 120 117 90 48 133 164 83 46 187 165 43 70 130 200 336 282 138 20 76 102 224 291 252 225 68 197
4269 197 89 60 116 59 75 318 145 28 105 139 103 172 70 77 88 161 193 145 278 311 104 168 52 189 276 127 151 42 202
3928 202 145 239 107 119 104 108 168 164 18 107 74 43 96 108 122 147 63 186 82 86 14 109 97 198 88 35 117 173 289 240 73 34
3553 34 164 107 148 159 100 31 48 111 210 118 194 381 234 98 244 251 177 61 112 26 92 281 59 143 130 116 106 124 115 97 66 138
3177 138 174 74 247 172 84 74 214 80 112 158 221 96 162 69 140 128 175 46 101 166 274 413 260 181 279 76 1517 3455
2848C455j028k044j58j51J0J40L17k60j89k4J04j37M9L2M9j8o9j9L7J2k0O4L5o5p6mQ2Qq3
2508D9L4p2J00nk3R5j50K9P6l9J01l9qM0j3n2J50j85JR2r2l7R5n1ql8J58MJ7j12M0k7q9J38
2109A79l2r1J16j08J78l9q1l8K09rm3Q9N36L765l15l779j87m9j85M3j04Q8n6k3O6J66m5j64
1780H7J22jJj38J25n8j22N6O9j22P4J14J40k10j0rR1m7r5J2K2ol5K98j04k01K2MpN4q5O5R3
1393A99j06J36K0o8j03K4J18o7L4q2M8k8M0q8k6L5K7j5LK2K3r4L5J66o2m0Q3p8l6M9m5j1j0
1006A03J8o6pJ4K04j03j0M6m7l9KO0J20j29pL3n4n1J41n9j14K8j4l7J16J20O6j04k12J7J47
642A82kn0L2k1J7j05J59j65Q3L6O3j86R7qk5o2j7N8l0J8K3l3l1J42j05J29j27P2l5o3J09j3
266A42pr6J8R9m1k4P5O2j64M6m6R1O0k8j49Q7q5P2j5R9o0Q8j75Q0K0o9N1nl0M5l4MK4M2K6
$$ plain form
2848 3455 2427 383 225 74 84 224 541 281 92 68 172 35 84 116 165 147 78 59 96 108 88 152 187 122 46 42 124 132 49
2508 49 83 11 111 106 83 178 28 57 133 94 195 156 148 188 175 123 273 88 89 181 89 52 147 96 88 50 208 212 229 117 157 130 41 179
2109 179 147 56 172 64 242 203 122 84 293 284 241 330 866 4631 4316 537 350 301 116 159 55 143 87 64 130 296 251 87
1780 87 209 208 209 71 196 138 16 72 141 19 93 207 347 137 127 118 209 162 67 79 101 95 60 358 254 53 75 79 72 126 41 106 199
1393 199 93 229 249 181 78 102 220 153 187 105 153 125 165 77 51 86 113 98 101 123 146 52 87 253 191 151 234 156 120 169 124 113 103
1006 103 121 55 48 62 266 163 153 199 152 113 115 175 295 166 159 192 138 87 228 169 55 83 69 32 148 268 334 230 18 35 182
642 182 180 130 162 141 158 53 212 47 130 166 229 43 140 132 107 45 28 86 56 74 97 64 33 175 70 199 72 144 109 46 155 142
266 142 135 39 57 156 115 91 166 228 64 110 64 155 215 187 38 125 40 112 97 196 136 224 49 129 149 80 131 126 96 141 107 111 135 177 203
-145B03j44K0O8q4
$$ plain form
-145 203 59 79 147 63
-192F3
##PAGE=	F1=520.625
##FIRST=	25164.767445380970457,	5806.2096540000038658,	0.45581015944480895996
##DATA TABLE=	(F2++(Y..Y)), PROFILE
5806B09q4k4K8o1J00n6k8l3O2mR4n7k2Pl8Ll7R3Q4j83J45l2j6j9m8R3k3j15j3J61q6rL2o8
5407E5L1RK7k6n6J6O8l8J16p9m2L1n5JNJ30Pr8N4L8K2n8K5l6P3n1o9Rl5R6q2k3l4J96j09K
4985A20N2j64J19J69j45J54n4j63m1K0M8p4K06j6j43NO9Q7j49K74j63ON1j10j1Jm6Mm3J46
4632B09n7j23J42M1j08l3L5J2n1L3P9m8o9J12nr2L1J2L9J05J1j60m3M6o1J07O8k6q4q4J38
4269A76p4n4O7o2K6J97j68k0J5P0l3j7r8P9K3K9O5m6J23K0j88P1r6Q9J35j53l2r5J24J1j6
3905A68r4M4L3j09O6Mr9P4k3m4Q6QN3n6o9J33n5k7o5M4L5R4q1l2N0L6J30m6j77o0J46n6oM
3506A09j9p8kJ15M8q2J09J83j48r5R6L4o3r3kn4M9J51k04R1m3PmJ6J4k4q1J10jo4J46m5j06
3118G0K3J16j48OJ24K1j52M9j08J85p8N0o4NN7L5Q4r9m1R6j57J102J498q08j573o7j57M6K0
$$ plain form
5806 209 125 101 129 68 168 112 84 51 113 109 203 146 124 131 93 96 59 152 236 53 198 166 150 131 83 176 153 38 25 186 100 91 123 55
5407 55 86 95 122 96 40 56 124 86 202 123 81 112 57 58 63 193 200 102 156 194 216 158 183 147 220 169 100 109 74 170 88 65 31 227 118 120
4985 120 172 8 127 296 151 305 251 88 47 67 115 41 247 231 88 93 162 249 100 374 211 217 268 158 147 148 102 106 63 209
4632 209 152 29 171 212 104 71 106 118 67 100 179 131 62 174 169 77 108 120 159 264 275 115 72 118 57 164 232 206 122 38 176
4269 176 102 48 115 53 79 276 108 88 103 173 140 123 25 104 127 156 221 175 298 318 130 201 105 194 329 176 144 49 173 184 168
3905 168 74 118 151 42 108 112 13 87 64 20 106 114 167 111 42 175 120 93 28 72 107 201 120 88 138 174 304 258 81 21 167 111 105 109
3506 109 90 12 10 125 173 91 200 383 235 140 236 270 207 114 112 58 107 258 54 145 102 109 105 121 135 111 30 140 139 75 221 176 70
3118 70 93 209 61 67 191 212 60 109 1 186 108 158 94 99 156 191 275 176 135 231 74 1176 2674 1866 293 226 69 115 135
2778A35K51k07r7l3K23j03j08K3J1M3p7j0L8L7p1P5O3p1p3OP0m7kJ7l4Q6q5JJ55j66J5N8j7
2391A06N2n9N4O3n3j3N5j21RQ5p1n2jP5l6m1J73N9o9k3l8j6p9J07j1j11J04p3J00k8m6m4J73
2003B30Kl0L3L38K694j42k724j18m0j63O6r5N9o3R4Q1k5Mo4R1k4l0j18Q6qo0L9J4r2J15J20
1639B70P8k39m8P2%J7j13Q1L8K2p9K29j04j59j8L6J7J3q4P4Q9q0J89r0j04m6JJ61m0Lr8M3
1264A31j2J4n4m4Q6MJ3kJ3P2j63O0J35j2r6M3Ko4R5p0r8Q5j2p9mM9J75j51O0O6l8j36N7N6
865A81R7j47j7J4o1l4J92j9j38qM8m4N0J59M3q7j93P0OK7l5L9j4N9j10J39j86J37J3J19k35
501F5Q5K0o0o1N2L5r8J4nL4n9J30n6R8o2Kn0l9J44l4K1j34L8J02l3o9Q5M4j20j1P4N6K0k1
102B07j81J15o4M6n4R8RO4j46J0L5n7K6K0J2%p2L5j4O8L7r8J6K8p3
$$ plain form
2778 135 386 179 82 49 272 169 61 84 95 138 61 51 89 126 55 130 193 122 49 55 125 78 76 93 59 145 60 61 216 50 65 123 106
2391 106 158 99 153 216 163 150 205 84 93 178 107 55 54 129 93 52 225 284 215 192 154 138 59 166 155 44 148 75 175 147 101 57 230
2003 230 232 202 235 573 3267 3125 401 283 243 80 146 51 110 47 141 222 197 201 137 228 204 174 56 142 134 74 113 127 35 150 270
1639 270 348 109 61 133 133 150 37 118 156 178 99 328 224 65 47 83 100 113 29 103 192 112 301 211 107 61 62 223 183 186 88 131
1264 131 119 133 79 35 121 125 138 136 149 221 58 118 253 241 145 188 190 126 221 151 53 138 126 47 43 92 267 116 176 242 204 68 125 181
865 181 278 131 114 128 67 33 225 206 68 60 108 64 114 273 316 229 36 106 112 139 104 143 129 188 78 217 31 168 181 300 65
501 65 150 170 110 49 101 136 38 52 47 81 22 152 96 194 132 134 84 45 189 155 176 42 80 182 149 80 165 209 89 78 152 208 228 207
102 207 26 141 77 123 69 167 176 240 94 104 139 82 108 128 140 140 68 103 89 157 194 96 112 140 67
-192F7
##PAGE=	F1=418.367
##FIRST=	25164.767445380970457,	5806.2096540000038658,	0.46512296795845031738
##DATA TABLE=	(F2++(Y..Y)), PROFILE
5806B12p7m3J3j1O5m0l5l6Q4k7P8q2J9J0J1n9J8N9R2j99J92j9p9k6K7N6o6p5PP8r2M6K3kk
5395A20o2lM7q1L8Q6n3Q7n2l3m2K4J5JQ6lq4N2O1M5p8O4j14R9n9o1Pn0J17o9l9k4J52p8l7
4985G9N3r6J09J32j95K03p9j36l3M1O8q5J89m9j13K0L2R4j60K84j13p2J05j07n3L6oj06J9
4644F1J78l1j86J40O0j37k9L8N4o2pJ20j8j16P3M3o0K2j8K4M3P0j82M7L3j34O1P0K0j43J8
4280E2R2l9n8N9l8J0J45j43M9l3Q8j9o0NK7J5J6Q4o0J04j0j50R7r0N2J56j41o5n5N8N8q4r1
3893C1Q2P0j52N3nn9M5%k1R1KP4j29l4R9ml0m4K1QQ0j5l4J9J7J56l4j93o8J39n7m4pJ5l5j3
3470B4R7J1k6O6J93j45n2M2O1n6m9p4lL2J04j41O4n1L3rqK5j4j09J30m0NO7j1j16O1P5j39
3083D7l7J90Jr6n1K3J41j18L7loJ5l0K4o8J3J08j05O92R88n42j046N7j76R4r3J75j59Jk9K28
$$ plain form
5806 212 135 92 105 94 159 119 84 48 132 105 183 101 120 130 141 82 100 159 251 52 244 225 146 120 147 203 137 62 69 147 55 101 124 122 120
5395 120 58 55 102 21 59 145 92 179 127 94 52 76 91 92 178 175 91 143 204 249 171 235 121 220 161 100 107 57 174 105 66 42 194 116 79
4985 79 132 36 145 277 82 285 206 70 37 78 146 61 250 201 88 108 140 234 74 358 245 173 278 171 118 154 148 42 61
4644 61 239 208 22 162 222 85 56 94 148 86 79 199 181 65 138 181 121 143 125 149 192 262 80 127 160 26 87 157 177 34 52
4280 52 144 105 47 106 68 78 223 80 129 96 184 165 105 110 137 152 168 252 192 296 286 136 233 143 195 351 210 145 90 148 206 122 31
3893 31 113 183 31 84 79 20 65 65 44 135 137 211 82 48 147 143 113 69 90 98 178 163 129 148 165 321 287 94 26 165 108 64 57 72 37 24
3470 24 121 132 106 172 365 220 168 210 271 215 166 92 89 121 225 84 148 97 130 121 113 138 124 15 145 105 110 177 166 50 111 186 47
3083 47 10 200 201 105 54 77 218 100 137 134 128 143 113 137 69 82 190 85 777 1765 1223 177 234 58 152 59 234 75 76 47 275
2719B75j17n6K0j3ln3oJ6P9r8N0R3o5o2rO9r1J12j5QN0j49M0J71j71lL7jM2q9R5Q6r8K7l3
2308A38k0jM8m3k4m3J15q2J3J47P3j01N2j07k6m0M5J6j16N9j4OKom2J15K3k9oJ57J672Qj710
1921B79q2jr6K1m9pm2J98Q8k13N3K5M9m2l4j05L5O1QK6o5l6J19J04L0k31p7J40o8N1j16J15
1545A38M8M1o3J26q8j39k5P2L7l7q2P9R4o0K22j86j45J0j7J84j4m2m6oL6l2k3n3J29k2L3r
1170A60j3J18j52J3J07M6j61J8O8p7J33q7j53J42k4j06O0K5J35j55J03O4l9j94Q8P3N4j74
841G2j9J2j7rJ61Mj24l4P6k8k2J91On9j60J19j27P1n4L9K0J00p4Q4j72J31mJ67k48M7L5n7
466A27n1Q3J3j38k1MP7p5J23J8L1pk4q3k7J59n1M3j63N1J22m3j09J03K4p3l9J34N2l1m2j54
90C3J30k0rq0Q4O8K0j11k5M7n2PM8L0l6r4O8n6Q4L4m8L4j0q2
$$ plain form
2719 275 158 102 122 109 106 53 47 63 142 44 94 187 122 60 51 120 29 141 126 134 184 35 75 246 75 72 109 108 150 61 156 242 144 171 138
2308 138 118 117 165 122 98 55 170 88 101 248 321 220 272 165 139 99 144 160 44 103 89 95 97 91 49 164 187 158 152 309 1981 1989 279
1921 279 197 196 100 121 72 65 23 221 309 96 149 174 223 181 147 42 77 138 146 172 107 71 190 294 324 93 16 156 88 139 23 138
1545 138 186 227 164 290 202 63 38 110 147 110 28 107 201 141 363 177 32 42 25 209 195 153 107 101 137 105 82 29 158 136 169 160
1170 160 147 265 113 126 233 279 118 136 204 127 260 173 20 162 138 32 92 117 252 97 200 264 225 31 119 192 246 72
841 72 53 65 48 39 200 204 80 46 122 94 72 263 269 210 50 169 42 113 59 98 118 218 144 228 56 187 183 350 102 149 184 127
466 127 76 159 172 34 13 17 94 19 142 160 191 184 160 77 50 209 158 201 38 89 211 168 59 162 186 113 74 208 260 229 187 33
90 33 163 143 134 54 138 206 226 115 90 137 85 92 140 170 134 40 108 52 136 170 122 156 146 64
-192F4
##PAGE=	F1=316.109
##FIRST=	25164.767445380970457,	5806.2096540000038658,	0.38008528947830200195
##DATA TABLE=	(F2++(Y..Y)), PROFILE
5806A90n0n6nN0L8n2m4l4J23n9M9j09P2N3K6r0L5QJ03k03K25%j39qQ4K0j00%j2Po9Q4j0N0
5407A77j1j28j7O0o6M6Q9n6O9j6m0p7R1J6j2K9qp5O5O5M9o1O3j66J16o1l7mm9J44o7m3m4J31
5008A72m9p3Q4o6Q5P8j96K10j06q1j2K2R3p9J49o6q6M0LR2j43K54o7j45J54q9q4O6M4q5l4
4644H5J73%j95Q9N2j41L8j8R1q0k5J50J0j74M4J07m7Pl5M1l9J09j95J21K5j16l7L7R6n7kR
4269A23k6l5K3Jj4J00j14P7m6Q7kn7M8kj2K3R4o3P5n8j03J35r8K5J45j13o4j2LO4q5r9Q7Q8
3870A95r8Rl1l7K1J3%R0QO7j72rN6L9k0k6J0m5O7O6n6ljK03j4k25r1J46n9p5L2j3K1j9M7J2
3447A08L8k5K09j47oqQ9o1Kj33M4K2O4o4L5n2M1k0m0K8J7r6R5o4P2k1K2j17Q3K8j14K4J28
3060A81Rk0o5M5Q0j27J2M0Ol3m5K8p2j1J28m9L01N11k90n49J58j92J32j72J13j04O8m5J61
$$ plain form
5806 190 140 84 79 129 167 115 71 37 160 101 150 41 113 166 192 102 137 145 248 45 270 270 131 123 207 227 127 127 115 122 53 137 127 177
5407 177 166 38 21 81 15 61 150 94 163 147 107 30 121 137 125 154 146 71 136 201 250 189 252 86 202 141 104 100 51 195 128 85 41 172
5008 172 123 50 134 68 153 231 35 245 139 58 46 68 161 82 231 165 79 119 122 214 71 325 258 113 267 178 94 160 204 119 85
4644 85 258 258 63 152 204 63 101 83 174 94 69 219 229 55 99 206 159 166 131 172 133 242 47 168 193 77 40 77 173 116 114 123
4269 123 97 62 85 86 72 172 58 135 89 176 174 117 165 163 151 174 268 205 280 222 119 254 156 181 326 213 149 137 140 204 119 20 107 195
3870 195 97 106 75 38 59 72 72 162 170 237 65 56 112 151 131 105 115 70 137 203 147 144 143 346 332 107 16 162 103 28 60 47 68 49 96 108
3447 108 146 121 330 183 177 169 258 197 199 66 110 132 196 132 167 115 156 136 96 124 141 45 140 76 148 127 149 32 115 143 29 53 181
3060 181 190 170 105 150 230 103 115 155 161 128 83 111 39 28 156 107 408 919 629 80 238 46 178 6 119 15 83 38 199
2719A99j13P0L5kj26rj2k1J40r0k0J21m8m9m6P9m5J42l7L8J4j58N2J48j70j8K8jO1q1Q3J02
2344B66j46O8p5N7l0Lj3J%Q0j29O9J20M4p9R3j49l2Mk9N0j38K8M7r3M3L4m2M7O3m8j4QQ33
1945I41J08q65q6O9j8o6K0k9n9K76Q4l03K8R0J3o5oj11nJ38O1Oj20rJ18P1Kj92l0J21n9Or0
1557C9R1M9N2mK5o5j31LQ8M2o2q7Q8R9p1K47k53j23ML0J17J0q7N5r0J09q6rl2J45n0N0k2m7
1158A24J52j07n4Q1R8k17N4O7p1J49r9j15J12k4j32J10QR0j22J17M4n4j79N8J12Pj77PL2N5
806A26l4O4J1p5n2P7kn3J80m2k3j19J57j19L2j01NP5J29k7L1j35P9nJ90k49J8M2l4n5R9Lj21
419G2l5K7L1n4R9Q0k7L0k8p7o4J56n7N1j55L5J52o9j38J21J4l4l5J31P8p6j01n5J01L5o5r2
43E1O1J16l6q7oN2n9mO3K4n7m2N0n0M0J4MN5l1j07
$$ plain form
2719 199 86 156 191 189 63 54 42 21 161 71 51 172 124 75 29 108 63 205 168 206 220 62 114 262 92 74 102 101 162 81 164 266
2344 266 120 188 113 170 140 143 130 131 131 211 82 151 271 315 236 329 180 148 152 123 173 35 63 110 17 60 94 52 99 162 114 100 108 941
1945 941 1049 184 98 167 149 83 103 74 15 291 375 72 100 190 203 138 132 21 16 154 215 221 101 92 210 281 283 91 61 182 123 129 39
1557 39 130 179 231 227 252 187 56 59 147 189 127 40 128 227 156 403 150 27 31 61 178 188 101 156 66 175 89 80 48 193 143 193 171 124
1158 124 276 169 115 196 294 77 131 198 127 276 177 62 174 150 18 128 136 226 104 221 265 211 32 90 202 209 32 39 71 126
806 126 92 156 167 92 40 117 115 62 242 200 177 58 215 96 128 27 32 107 236 209 240 105 184 179 369 120 138 180 146 91 190 193 72
419 72 37 64 95 41 140 220 193 223 195 118 54 210 153 204 49 84 236 167 29 150 164 130 95 226 304 228 127 72 173 208 143 51
43 51 112 228 192 105 99 151 92 88 151 175 118 76 126 76 116 130 134 189 158 51
-192E1
##PAGE=	F1=213.851
##FIRST=	25164.767445380970457,	5806.2096540000038658,	0.28654310107231140137
##DATA TABLE=	(F2++(Y..Y)), PROFILE
5806A48no2j9R3L2q3o0k1J77j03K1q9P6J17Lr8M2n7J12j89K38K3j75J7J15rj01M3l9j0m4P2
5431A65l4P1lj58Rj6j9L4Q4l9O5j2k5nO9%l1j6k0o3P4N5L2j5L2j89J27m3k5j3l0J75p4n1q5
5020B6J37l9n7Q5o5N6K2p5J05j29nNk8J16n6R6o7o2O0j6Q1r7J92l6j94J83o7r2P6Q8n1q5J60
4632B67K9j96M1K6j09R8q0J07q7l0J59L5k19L8J54n2j3m1P5j04J23j76J37L2p3qm0P5K2j0
4280A80m6n8Rk9M2l4P3j04P1oO2J5m1M6j1n6M2J06l8L4j19n5J74j14J2J00p5l5K6k0K9m4o9
3893F7L5R0m3oo2k0L1j6J7Q9J6M0j80j0L2P3j6nj9o6M6J40r3j5j2K59Qk59j11J52o5p5R5r1
3494B6O9l0j2O2P0j24K17j47L3m6J19p8M5j34N2K6M3nK1n5K0l7o2K9N9q9M9n7J08q6M8r8P0
3107A06oq6R6L3L9L7l7J8K3j15j3N7K6o4j2Q0o3r4J00QJ6J30r5r3J41j94J50j62L3LL6q7Q1
$$ plain form
5806 148 143 81 62 155 187 104 44 23 200 97 118 29 105 222 225 127 169 112 224 35 273 296 121 138 253 244 143 186 147 137 93 165
5431 165 131 202 199 41 50 34 15 49 133 94 159 147 122 117 186 186 155 139 119 56 130 185 217 202 234 45 172 129 104 91 61 236 162 111 26
5020 26 163 124 67 152 87 143 165 90 195 66 61 66 38 154 98 194 127 65 125 109 190 93 285 249 55 238 171 79 155 243 192 107 267
4632 267 296 100 141 167 58 156 76 183 96 66 225 260 41 79 233 181 168 127 202 98 221 45 182 214 141 133 93 168 190 180
4280 180 134 76 85 56 98 64 137 33 104 98 160 175 134 180 169 113 155 261 223 257 138 83 257 143 155 255 180 145 171 151 180 136 67
3893 67 102 192 149 143 81 61 92 76 93 182 198 238 58 48 80 153 137 132 113 47 93 233 140 125 113 372 380 121 10 162 97 22 117 26
3494 26 95 65 53 115 185 61 278 131 164 118 237 159 204 70 122 148 191 186 207 152 172 135 73 102 161 72 121 64 172 86 134 36 106
3107 106 100 14 110 143 182 219 182 200 223 108 95 152 178 114 102 182 119 25 125 133 149 279 184 91 232 38 188 26 59 62 98 11 92
2719I2J2J02M1Qk04J3rPJ23p5p6J20k7l9o6O7J9J47n6O2j6j44N1J07j62l2M4j5P3o6Q3J04
2344B88j92J11o8P0n9l7J0J4L7O9j67J09J02j4l3J06j55k0L6r4R1j77L8O6q2rO6l8k7J23q1
1980H3Mk4J81J45k68r0J19L7j36R2Mj31L24P2k80p5J26nr5M5j08J8J37R3k3j31k2J18L4mj45
1616I5MJ04k6n3m0QM8N3Q2n1m8j16L2R1L7o3j00J04R8j10K62k75p7k6Q5J3L5p1J13j77J87
1252B18j30k2J4J43q4P4l9p9J58n0j03M9J34k32J41k0m3J38j08o4Q0j9j02R2OM5q8J25J3p8
900A69j20J2J45k7q4rL9O7o5j4jqn8N8L1l6J15r4K0o8J64n6j5q3l5M4J46J8rq8KJ8J81k43
501A16jN4j4o9J04Pq0k9J0j6oO6J24o6M2j8m9j28J46n1M1j12J0J67j02j24J03J8prQ2J26j01
114B34j90Q4L2R5j05j00M2J53o9j06M2N8p1j4O3Nn6K5K2j5l5j8N5P3l6j37
$$ plain form
2719 92 104 206 247 255 51 64 55 62 185 110 34 154 127 88 22 89 108 255 199 261 245 101 152 259 97 65 109 94 167 101 184 288
2344 288 96 207 139 209 150 113 123 137 174 243 76 185 287 273 240 346 191 171 207 113 204 27 65 131 49 40 106 68 41 164 83
1980 83 87 63 244 389 121 31 150 187 51 143 147 16 340 412 132 57 183 178 83 128 20 38 175 268 245 114 92 210 244 240 95
1616 95 99 203 177 124 84 92 140 193 275 224 176 60 92 183 220 157 57 161 259 149 411 136 59 33 118 131 166 95 208 31 218
1252 218 88 66 80 223 139 213 174 95 253 203 100 149 283 51 192 172 129 267 159 95 175 156 54 146 152 197 109 234 247 169
900 169 49 61 206 179 95 86 125 192 127 113 112 104 46 104 135 99 214 120 140 72 236 180 165 82 47 91 237 255 246 158 160 178 359 116
501 116 115 169 155 86 190 197 117 88 98 82 76 142 266 200 242 224 175 47 193 142 183 71 81 248 146 22 125 143 136 127 209 335 234
114 234 44 128 160 255 150 50 92 245 176 70 112 170 99 85 148 153 97 122 144 129 94 76 131 204 168 31
-192C1
##PAGE=	F1=111.593
##FIRST=	25164.767445380970457,	5806.2096540000038658,	0.23521421849727630615
##DATA TABLE=	(F2++(Y..Y)), PROFILE
5806I3N0n2k8J00M0j12q5K3K15j48Ql6K9J67l9q4N2j23J13j52K23M9j82K9J23k3p3M4o0J0
5454A71m3M2l5N7J8j44Kj0k1j6P5nO9m0J8N4N6k1n2k7n0l0M6M6%M1j2j75J27lm1j9MK05q6
5043B01p2j23J58n0j2M5o0K8k4M8Qj27M7J7o9J15l0M5n3l6O8k4O3l9J26l1j80J59n4o8N8J21
4668B55k9j17J61N1j96Qrm4J25j25Q5o2m2J44N7k26M9J65o8l3l9J12j30J21j37R0O0k2L2m4
4316A92n3Q0J6p1j18O4o9O2n0O8o7jO7K6L1l1NJj09O1J30J2j5j69k0J98j28J6K1k6MN4j0k8
3916A43Nm4LP9%qr3nN9o4L3Q6J8Nj51m1L6R7k9J3o2jk2J87j29k2nK97K9k81r1J19o8l3J13
3506A73j24O1l7o7J29P2j97K00j33N3o7J47r0N8p5L0M5M1J8J3m8k7o6m4K8Q7q5Kj8R4j15O6
3130A24p3M6J0q4J35n4Q1N1j0qj8q6l6N0N1o6NJ02o2p9J0O6m9J3m1O0P5j73J43j39J1J9K8
$$ plain form
5806 93 143 91 63 163 203 91 6 29 244 96 104 68 97 264 225 141 193 70 183 31 254 303 121 150 273 250 177 221 161 171
5454 171 128 170 135 192 210 66 68 58 37 21 96 91 160 120 138 192 248 227 175 148 98 68 114 160 160 201 189 14 141 138 97 78 82 287 201
5043 201 129 6 164 114 102 147 87 115 91 139 147 20 67 84 15 130 100 145 92 56 124 100 163 124 250 219 39 198 144 76 134 255
4668 255 226 109 270 321 125 133 124 80 205 80 165 103 61 205 262 36 85 250 182 149 110 222 92 213 76 166 226 204 236 192
4316 192 139 219 235 164 46 110 41 103 53 121 54 53 120 146 177 146 151 152 43 104 234 246 231 62 42 240 112 128 149 123 127 181 171 143
3916 143 148 104 107 186 186 178 85 80 139 75 108 194 212 217 66 25 61 158 129 142 80 79 57 244 115 93 88 385 414 133 42 161 93 60 173
3506 173 49 110 73 6 135 207 10 210 77 130 63 210 120 178 103 133 178 219 237 250 202 175 109 65 93 180 95 97 79 173 58 124
3130 124 51 97 107 23 158 104 185 236 226 218 200 114 78 128 179 113 118 220 158 79 89 155 106 119 78 138 213 40 183 44 55 74 102
2743A02o5L1R2P2M1J2k01kMM4Q4p2p8P8j2l6k9KO6J47p1Q1l8j15L9N7j42m3P7k8N3n5J19R0
2344C04k31J53n9N5p9o9K5J2O2Q6j86J24R0q0OJ03j21RN2j43J35j96K7O3n7m2P9k7m3J27j02
1980G7K5J5K5j18O4K0L5N4j32J14M1k01L39N9k40j60J42jj26R2q2K8J19J06n5j07m7J04J4
1639B04Mj06K0Q9Lp5Qj19P0L0J69q8m4r4N3Q9K7n4j10J16R3j63K68k57p4pJ18r5N9K8Q8k34
1264A6K44j53o7P4J34j30J12n9r4J22Mj09QJ49j65J83j38MJ02j14j3N8j4n4M8K0Np2J36k5
912B12j00m9J8J18l7Jm7N4O0r6k4l7L6m7L3O3k4M9j22M7lJ25J4m9n6k5m7J63M9k9n3p7O2J48
513C30k38qP5j2p8R9J8l3k1k2n0N4L7J41q1L2nj5j99J34l2J7n6KJ49j25n3K4L7J1K9NJ80j02
114B44j79J18n9J47j24j02L2J77m7j65O4P1p5l1N7j5l4P5qK6j04n2J02Q2l2j54
$$ plain form
2743 102 37 68 160 232 273 285 84 82 86 130 214 142 64 142 130 94 65 67 133 280 209 290 252 137 176 233 91 48 125 97 150 95 214 304
2344 304 73 226 167 222 143 74 99 111 173 259 73 197 287 207 213 316 195 204 256 113 248 52 79 142 85 43 122 95 52 179 77
1980 77 102 117 142 24 88 108 143 197 65 179 220 19 358 417 177 17 159 158 32 124 42 70 189 295 240 133 86 190 204
1639 204 208 102 122 211 214 139 147 28 98 128 297 209 165 71 124 213 240 186 76 192 285 122 390 133 59 52 170 75 134 162 250 16
1264 16 260 107 40 114 248 118 230 171 77 199 203 94 102 251 86 269 131 135 237 123 110 168 154 100 148 168 173 101 237 212
912 212 112 63 81 199 162 163 116 170 230 134 110 73 109 62 95 158 134 183 61 108 105 230 244 195 139 114 67 230 279 250 197 120 182 330
513 330 92 84 159 147 69 168 186 153 132 110 60 114 151 292 211 243 238 223 24 158 126 143 87 89 238 113 60 84 121 132 161 166 346 244
114 244 65 183 124 271 147 45 77 254 207 42 106 177 102 71 128 113 79 154 146 172 68 16 118 200 168 14
-192A4
##PAGE=	F1=9.33551
##FIRST=	25164.767445380970457,	5806.2096540000038658,	0.22702635824680328369
##DATA TABLE=	(F2++(Y..Y)), PROFILE
5806C6J04l0l3P3N6j22n4J8K31j80J2l5J5J85q7m6O4j57Q5j03J86P6j70K1J17k2l2J7o3K9
5454A91m2Nj9J5M8r4k6O4o6n4L2K7P7q0Q1P9N0l5p2j1q6J5j9O1l4P4m2r0O3M5o9k4M3K26r6
5043B37j00j13J43p2L3k2l6Nm7J30m4n9J0K9m2N6k6J0k6lN7l2N1J7O7n3j10R3n6j2J7J42k6
4656B18j34J89N9j99mm0J9J37j46K9mp5J02P6j81N0J53q9m5l1J39j22J29j20K3J03K5N9l7
4316B83j98J17O6p9j77J22o5L2o0P3J1m7O3KM8l8o3K1o4%J50O9o5j22k8J56j28L5q3N2J1P8
3940A72J6q3M6k5mO9K3pj10j3R4j09M5Q0J6k9q4q7N2J09n9K1j12J08r3J98j41m1L3K91M5k76
3564A45p6Q1o3J2J18j21J8l8k7R6N7j67R8o4J4o5J62o4J0LK6O6M0RJ0k8q7j07L4J0R2q2k1
3177I1J8M4j01O0n4M4N5j31J69r6R7K4Nk2l6m4o0L3Q8n5j5R2n6j6q5J20m2J18q0j3L1j15J00
$$ plain form
5806 36 140 110 77 150 206 84 30 48 279 99 111 76 91 276 189 143 207 50 135 32 218 294 124 145 262 240 208 225 162 191
5454 191 149 154 135 150 198 104 78 142 76 22 54 81 158 78 159 238 288 253 181 170 84 99 80 141 107 181 139 49 112 157 88 64 107 333 237
5043 237 137 24 167 95 128 106 70 75 28 158 114 55 65 94 52 108 82 92 66 63 120 88 139 156 223 170 60 153 97 85 102 244 218
4656 218 84 273 332 133 129 89 108 245 99 128 124 49 151 227 46 96 249 160 115 84 223 101 230 110 133 236 261 320 283
4316 283 85 202 268 189 12 134 69 101 41 114 125 78 141 143 191 153 90 111 47 47 197 266 201 79 51 207 79 114 31 83 94 172
3940 172 188 105 151 126 122 191 214 207 97 84 178 69 114 194 210 181 97 10 62 171 112 133 21 129 36 234 93 52 85 376 421 145
3564 145 69 150 87 99 217 96 114 76 49 145 202 35 133 69 83 18 180 116 126 129 155 221 261 270 280 252 165 58 92 102 194 112 91
3177 91 109 153 52 112 58 102 157 26 195 99 196 220 225 203 167 123 63 96 184 129 114 206 150 134 49 169 127 245 165 152 183 68 168
2790A68j12L4l0K4J0O0QO0M1J1j61j5J8P2N6q1p3N3qm4J8n6Q3J44q3R8n6o8RMj09m8J07k8
2391A06Qm3J75O4k57J87o8L2q6q4K8KP1J20j76J07Q3j29RJ00n4M5N5j77J77k07j7O5m2l3P5
2027A36j4j7Q7j13N2%Q6j17j7R7l1K7p3R2P2k48L25N0j97j74J05J5r7O8n7K4J07J03q2o3l1
1663A15L4L3J4q1K2O9K3n9M3j62O4l4K08q9m8p4O9Q7K4n4j07J17P7k09K63k05j03M7J26j82
1311B8P0J34L9k31K53j53j17J20J25j87J57p6p9L5N5p9l1J52p5J93k52O1N1j16L4M4j2qkN5
959A88l0p5J41o1j06K5M5N3k7N9r0Q2L8j30L9o6K0k7J7Q2l1J0p1QN9M7Q1p5l1j3j23J84O3
571B85k6m9j39J18J00k29j0R9k5m2O1K0J0j1o3n8J07K1J27p1PjK2k11O9mqj1JJ12j26K3o7
184C1O9J7O9p2K19r2j03Q0j48J84j27q8L7J73J0j80mQ8o8n3N1k1%R5m0O8j55J8L5Q7k5j37
$$ plain form
2790 168 56 90 60 84 94 154 162 222 263 274 113 98 116 188 244 163 90 143 135 91 109 53 136 280 197 295 239 171 180 184 75 27 134 106
2391 106 114 71 246 310 53 240 172 204 118 34 62 64 135 255 79 186 269 140 149 249 195 240 295 118 295 88 71 136 94 61 136
2027 136 122 105 192 79 131 131 217 100 83 180 149 176 103 195 267 19 344 394 197 23 128 143 46 114 57 81 188 291 209 146 115
1663 115 149 182 196 115 137 206 229 170 213 51 115 81 289 200 152 78 147 234 258 204 97 214 291 82 345 140 37 84 210 28
1311 28 98 232 271 40 293 140 23 143 268 81 238 162 83 118 173 94 63 215 140 333 81 142 193 77 111 155 143 135 133 188
959 188 158 83 224 163 57 82 127 180 153 212 122 204 242 112 151 85 105 78 95 177 146 156 85 93 152 199 280 205 174 161 38 222 285
571 285 259 210 71 189 289 60 50 149 124 82 143 163 173 162 99 41 148 169 296 225 232 231 253 42 111 107 99 88 89 201 75 98 31
184 31 100 117 186 114 333 241 138 218 70 254 127 39 76 249 259 79 75 163 95 42 93 72 72 167 127 195 40 58 93 180 155 18
-192A8
##PAGE=	F1=-92.9223
##FIRST=	25164.767445380970457,	5806.2096540000038658,	0.24984620511531829834
##DATA TABLE=	(F2++(Y..Y)), PROFILE
5806A5J19%m1K9P3j10l0LK34j94L3p6M0J58j25K3N6j31J5o6J48J00j51KR6nLj9m1K2j4l3m
5419A29m4P8k2l7J16j03n7KJQ6r1J30N9M7l2r1J9j16N5j02J20m7M5l9j9%Q4q6k6P0K29r8j26
5032A34q7J15q8O5j04J0n%J04m7j9k0L5pK6o5jJ0K4L5m5N3O7Rq4m8M1p4O6k3J39l4j39K34
4632B77N3k09J1o9O9J43j46k3M2j20L7R4j04N6J21j14m2k1J53r9J55j28l1J40O3O4l4k81R6
4292A53J20p8j65J23m7po5O9J01m7rJP0n6j52N2P2l0O3J08j07l2l5O7j08M9k6K6m4R3M2j25
3916G6Q1k5MO2L4qj00n6J27j34M6O9J8n4lq8K0J13q6J5n6J13j39J73j09q5J00K31N8k43p6
3553G8M6n0N4J17r8l6l1MN0L2j11J2M5n7j0J00lq3P6M6Q5K5j5PPj45j34J20j6Q4p5jK0k7m1
3142G5J5l7O7P7j89K13r4P9k5jk0k9Pq2K7J23n3n8N9m5P8j51J37p3J17p7nJ0k5L0q9P7o9k3
$$ plain form
5806 15 134 134 93 122 195 85 55 58 292 98 131 55 95 253 128 151 207 76 91 25 173 273 122 124 220 215 218 199 158 180 166 133 129
5419 129 85 163 141 104 220 117 60 62 63 149 58 188 247 294 262 171 190 74 129 27 147 100 145 106 87 87 171 85 59 129 358 260 134
5032 134 47 162 74 139 35 45 40 40 144 97 78 58 93 86 112 47 46 56 80 115 70 123 190 199 115 67 108 34 100 77 216 182 43 277
4632 277 330 121 132 63 132 275 129 106 148 28 65 159 55 111 232 118 76 55 208 109 264 136 105 245 308 372 338 57 153
4292 153 273 195 30 153 106 99 34 103 204 157 148 149 219 163 11 63 135 105 168 276 169 137 102 169 61 110 84 110 66 159 201 76
3916 76 157 132 136 198 232 224 124 68 195 61 107 176 194 140 137 49 69 182 96 111 55 168 29 202 93 8 108 339 397 154 78
3553 78 124 74 128 245 147 111 80 84 134 166 55 67 112 55 45 145 142 59 135 181 266 291 276 283 290 145 11 131 115 199 124 123 143 116 75
3142 75 90 53 120 197 8 221 127 206 181 180 160 131 138 56 83 206 153 95 154 109 187 36 173 100 217 140 135 145 120 150 61 138 69 46
2743D6J04P6j13P1L6Qj04k0L1Q7M6r7p0N9j4o5O4p4N1J37q9J15p5ml9m9o8k8J07j9k0k8K07
2355B69L4k67K06r0J1q5m8nJ7L3J51j34O3P9j35k3R4K6P7M7j99K10k19p0P3k5lN6mRM7j25
1980G0R3m6K1o6K0J31o5k2LM3R2k59K89M6j55j35M4K7m8J6l6J3R3Q6r6j1L6q5Q1K4p0J4M1
1592A89L5k8P1j37M4n5J34o8n2n3P6Q7L4o7r0J07M4k20K36j40j23R3J13j88K1K12nk06K48
1252C12j40j24J10J23k45J97q7l7q5J07n0m3J50oJ90l23R2Lj12P1L4rK2m7J10n9r4J35r1p9
900B5Q2N7j6j0R5j19J18J1j76J25q4mj5J4P8m7Nmm2J04m4J33r5j2Lj68K04O8j4q3j63J68N2
513B46j94j0R3l6L8RqL4jr8k7J26J2R5m0j9j9O2j62k9J4q%qO8r6Q4r9N9J2J00j24K26q7l6
102A77M3k06J97j23m9O2J27O1j59j10J04m7p7N8j5L2Q9p5J07j71R4o0R1j9j02
$$ plain form
2743 46 150 226 113 184 220 228 124 104 135 222 268 171 101 160 146 81 145 71 122 259 170 285 210 206 167 118 50 22 129 110 90 62 269
2355 269 303 36 242 152 163 78 30 25 42 75 226 92 155 234 99 76 170 196 273 320 121 331 112 42 115 90 87 143 139 148 195 70
1980 70 163 117 138 72 92 223 158 136 139 182 274 15 304 350 195 60 104 131 83 99 63 76 169 255 159 148 184 99 180 204 134 148 189
1592 189 224 196 267 130 174 119 253 185 133 80 156 243 277 210 120 227 271 51 287 147 24 117 230 42 63 275 270 64 312
1252 312 172 48 158 281 36 233 146 109 24 131 81 38 188 182 372 49 141 144 32 103 137 128 150 103 213 154 60 195 104 25
900 25 107 164 148 138 233 114 232 243 67 192 108 104 89 103 181 134 139 135 93 197 153 286 191 179 182 14 218 286 272 189 26 194 246
513 246 52 42 135 99 137 146 138 172 171 73 46 172 184 279 239 220 201 263 101 72 86 78 78 70 138 42 126 27 86 98 198 74 300 213 177
102 177 220 14 211 88 39 101 228 289 130 20 124 77 0 58 43 75 164 89 196 25 119 59 150 131 29
-192B9
##PAGE=	F1=-195.18
##FIRST=	25164.767445380970457,	5806.2096540000038658,	0.28183260560035705566
##DATA TABLE=	(F2++(Y..Y)), PROFILE
5806D0Q4K8m6j6Q7q5l1j0K26j86O0r9O5Q4j32J02K6r4m4n8J27J19j26k8O2K3K5m6mj5O1o9
5431A30j4r8Q6O4k1J23j22n8J8o7R0n0J37LM6j4j00M3j30Q4j15J37m1k7%J1m4J00p4j8O2K12
5055C53r0j37o6Q2p5P1r0j3J0J7M5j9nl1K8K7K6j20L2J2M0J5o4P5R3n1q7k5J2k8P6l4J01l6
4656A44j08K42L8k22N1j03J10J43j33l6L4j36K2L1k1Q0O4j26k7k2J57p4J82j40m1J41R1M0
4327C81l7k39j0J55o7j21J03l4l3m7L9J82m8q4K0R2p7j09QJ27km0J14j27L1k6j4q8N2O6j6
3963A51o9P9M9j49J14m6PN3M7j4p0j13J44j24K5N4L4p2P4q4k7J21r8ML2O4j48J18m7p5J02
3600A36J43P0j91r5J6l1R6J18o7q1k6J1Pkn0%J01p3jK3M9j30J03P2R8lm4RM7j87m3Q7m0P2
3200A94o2M5%r9L6m8k8R7O8j69J99p8M8o4k8rmO0r1L4J31n9j00J2j5J63j48Q1o9M0o8L1J1
$$ plain form
5806 40 124 152 106 90 177 92 61 51 277 91 151 52 117 201 69 171 197 103 59 1 128 247 121 93 155 178 203 157 153 138 199 130
5431 130 116 18 104 168 147 270 148 90 108 41 131 81 218 221 267 253 153 196 66 150 35 172 131 104 104 115 71 171 97 79 141 353
5055 353 263 126 60 142 67 138 48 35 45 62 107 88 83 52 80 107 133 13 45 57 97 112 48 123 216 165 78 53 65 37 113 79 180 144
4656 144 36 278 316 94 145 42 152 295 162 126 160 24 46 77 56 136 200 74 47 25 182 108 290 150 109 250 341 381
4327 381 344 105 95 250 183 62 165 131 98 51 90 272 224 140 160 252 175 66 74 201 199 159 273 146 177 151 137 49 101 167 151
3963 151 82 161 210 61 175 129 136 189 236 222 152 39 183 59 84 138 172 100 174 90 63 184 86 90 122 186 38 156 109 34 136
3600 136 279 349 158 63 79 48 144 262 195 114 88 99 106 104 54 54 155 82 81 104 153 23 126 198 296 293 249 258 305 118 75 162 122 194
3200 194 132 177 177 78 114 66 38 135 203 34 233 155 203 139 111 102 98 158 67 101 232 173 73 85 70 233 85 166 97 137 69 100 111
2813A11P2m5q2J21o0r6J71Q0k31J04J0Nl4k8M3R0M9j08p2Q6j9j01J01m9k1J33r3J33r8O8q9
2449A51j03l2K5O8nJ3k8J87J0k45J89j13jq5J4l0O4n8J54p4J3P5q9LJ7Q1J02K8k11K25k29
2085A16q1M8RK1K9lL2K1j44J37r1l4k6O0J40p6m3N0k0R8k35K42M2j09r2NK7j4j6j9oO7O0q6
1686A09K9J24j74R9L7p3QOM0j0J02j05L0l8J8m4n0k6O6R6N6r5o4R3pj61J58p6r9Q8R1j64k7
1299C7K48l8j60K27j25j16Q1J32k62J92r5K8n3K2o9j0J35K8J81l01N1l4r1R0J6%L0q1J75q2
947A56j08J05j12j1J02N1p8QJ12j22J55rk35J93r6Mj9L1L6o3L0L9p4J29j20J60j08kK2j52
595B4J83Q1qj41r1J47Pj21nM0k0J04k6n0L0Nj06PJ20%O6Ml5o2J01r6p6j5L5k1l1J0l6J11o2
184G3J7pJ12j43K03r7J5J1j27J00j21J2J01M5Q0j06j13J4j9j%k4O3O7r7J23j43J25j41R5j5
$$ plain form
2813 111 183 138 56 177 117 21 192 272 41 145 155 160 126 98 141 231 280 172 100 186 167 66 167 118 97 230 137 270 172 240 151
2449 151 48 16 41 109 104 117 89 276 286 41 230 117 116 31 45 15 79 21 175 101 114 189 100 103 120 201 303 331 120 345 116
2085 116 35 83 92 113 142 139 171 192 48 185 94 60 34 94 234 158 115 165 145 243 8 250 292 183 91 96 123 109 93 74 68 135 195 109
1686 109 138 262 88 187 224 151 159 165 205 195 297 192 222 184 202 158 108 82 148 244 300 205 141 234 227 66 224 148 49 137 228 64 37
1299 37 285 247 87 314 189 73 154 286 24 216 121 149 96 118 49 39 174 202 383 82 133 99 8 98 114 114 144 63 238 156
947 156 48 153 41 30 132 183 105 113 225 103 258 249 14 207 111 115 96 127 163 100 130 169 95 224 104 264 156 154 176 24
595 24 207 288 280 139 48 195 202 81 76 116 96 200 174 124 154 159 53 60 180 180 246 250 215 153 254 158 82 67 102 81 50 60 24 135 73
184 73 90 83 195 52 255 158 173 184 57 157 36 48 149 194 274 168 55 69 50 49 49 25 88 155 58 181 38 163 22 117 102
-180A02o4
$$ plain form
-180 102 38
-192C8
##PAGE=	F1=-297.438
##FIRST=	25164.767445380970457,	5806.2096540000038658,	0.2585341036319732666
##DATA TABLE=	(F2++(Y..Y)), PROFILE
5806D1P0N1m4n1R2n5n1j8K03j62Q7n2L8j2o2J16no9p8kN4J33q9p4L0M6K6l6K1n5J61j07n0
5419I7k8m5J60PR0j20n8M4j20Q1%J36o7M5Or5N3j23R6o6J00l9n3K4Po4Q8l9lK6J77p6j27n5
5020E9M5j7M3pq5K6qJ8Ljj9KM9L6j01L3j7M8Rq4J04Q8j12j9o4KP3J2k5N3j4n6J91K7k32J10
4597A70j04J08J26j12l2pq4Q6r5j1J20pr4k5l4J46n4J89j38k2J17J09kn3j48r1J50n1p5Q6
4245A68l0l8j9LK31n3j40M6J15r7n8QR3M3j10R7j11M3jo8q9M5J33m6m0N9L2j68J54p9j0M4
3870A57N9k1l0j13R2q2j5M0O9r1J28o3r5J36r0RP4J5j19M2J9n6R1M8R2j37j35J5k2J40J22
3506B79m6j02l3mk3l8J1L3J03o2j3m6P0n3M0P9J06l9p0J7Q0k04L8M7n1O1m0R4k4j45Q6q4m5
3118B2J13L7q3J41n9J1o9m4j9L0R7r1L6J21o2j20j4L7J82j18%nm0p6L4L8J41j00r5J45k5r7
$$ plain form
5806 41 111 162 118 67 159 104 53 35 238 76 163 111 149 137 75 191 186 117 39 37 91 224 135 61 91 137 163 127 148 93 254 147 97
5419 97 69 24 184 191 281 161 103 147 27 108 108 244 177 222 228 133 186 63 159 93 193 154 101 125 132 68 156 117 114 140 317 241 114 59
5020 59 104 87 130 123 38 64 56 74 77 76 57 59 108 144 43 76 59 107 116 32 136 224 112 93 29 31 104 116 91 144 130 74 265 292 60 170
4597 170 66 174 300 188 156 149 65 151 56 45 165 158 64 39 5 151 97 286 148 126 243 352 350 297 149 58 208 157 82 168
4245 168 138 100 81 84 315 262 122 168 283 186 128 136 229 272 162 259 148 191 190 122 33 78 211 165 125 184 216 48 202 123 113 157
3870 157 216 195 165 52 144 62 47 87 156 65 193 130 35 171 81 90 164 179 60 102 121 65 156 204 296 159 24 39 17 157 279
3506 279 233 131 98 94 71 33 44 77 180 118 105 59 129 76 116 195 301 262 192 209 289 85 123 170 119 180 140 234 210 65 151 67 22
3118 22 135 172 89 230 171 182 113 69 50 80 177 86 122 243 181 61 47 84 266 148 148 143 103 27 61 99 240 140 45 190 165 68
2743F8J42Q6k36Q5n7J0M3n5M8Q3N9j08p6J20j5j39J19lj09J37r7J48j17J35j18j28JM2J9n
2391H2Q3m4J44%j88J31j21lo0J3k0Q9o8P0j0j9O6k4O8n6Q4J10Nk17K14k32k8k1N2L6lj3N5
2003A75J4j68J69j15M8l1j7J40p9QL4p4P9j71J82L3n2o0nJ7jj7j1k8L5K0n0M7K03j76M5N2
1628B46q7Ok7M0j8J37p3J2np1l7m1QL8J14P9j26l7Q3o8o6N4k3p0O8O8j39k6K26n7j00J88j09
1240A87j04M8J48k30J42r6J07Mn9j21L8R6L1J76k28j0o9k6O6j2J6J8r7K31r5r5M6r3L0J02
888A51L4j22J8J09q8J76j5k21J43r4L8k3O3m3p3O9N9q7J26j56J57j15LM5j02J27J08j5j94
548G8J6R4k9m5jj8K2J32m8p5lMo1lJ06k4O2M6m0j10J21l1p7n8Q6l8k4o4K0Q6k6Rk7J07j48
137C9J67j23M8pj6Pq5K8J45m6N0j9n4j24J3P7k5m8Q9L3p1Q5j08J27j53O4j7l1
$$ plain form
2743 68 210 296 60 145 88 98 141 86 134 217 276 168 92 212 197 58 177 174 65 202 105 253 136 271 153 25 26 68 87 82
2391 82 165 121 265 265 77 208 87 84 24 37 17 106 38 108 98 79 145 121 189 133 217 327 332 115 329 97 69 48 100 136 133 120 175
2003 175 189 21 190 75 123 92 75 215 136 144 178 104 183 12 194 227 175 115 110 127 126 109 98 70 105 125 75 122 325 149 194 246
1628 246 159 165 138 178 160 297 224 236 231 160 123 82 90 128 242 321 195 158 241 173 107 161 138 68 136 204 65 39 265 208 108 296 187
1240 187 83 131 279 49 191 95 202 206 147 26 64 160 191 367 139 129 60 34 100 88 104 122 25 256 161 66 112 19 49 151
888 151 185 63 81 190 102 278 263 42 185 91 129 106 169 126 53 122 181 94 220 64 221 106 109 154 52 179 287 272 78
548 78 94 188 159 114 113 95 117 249 201 126 123 127 66 63 169 145 207 253 213 103 224 193 116 58 144 106 82 18 38 124 98 107 80 187 39
137 39 206 83 131 124 108 115 30 58 203 157 207 188 134 10 23 100 75 27 116 149 78 163 55 182 29 93 76 45
-192D5
##PAGE=	F1=-399.696
##FIRST=	25164.767445380970457,	5806.2096540000038658,	0.11810959875583648682
##DATA TABLE=	(F2++(Y..Y)), PROFILE
5806A7Q8N9l8o8R1k9o7JJ33j29J01J4Pr5K7P9on8r3N1j5J39m3j29N1J7J2RJ1k0J99j56q6N2
5407A26n5J28K3L1r9n6O6j27M8L2J39j16N3kp0L6r3R0j7O0m2kMj9o0N0OJ6k4J37p0r7n3K3
5008F6N5%N1j41L8l4N0k6JJ1l1N1M2o3L3m2N1J6q8J10N2j64R2j29N2J05n0j7K1K6l6J33K5
4621B60k15J60o4O1Q6r0l3n0jJ23j31p3J52p3k3l3j3P6l5J57j06nQ8J22n2p8n1j07J08l1m4
4257H5P3l2k3Mj6K38o2j62N5J44j17k3K5K3R4j39P1o1LL5r5p6%J73o7J8M4Oj91K04j11n4M8
3870A14N9l2J5n5j5j8o0L5J14j21J55k6j48J37p4K5O5k0o3l5O7l6P6l1J27r7j28N0k8J33J18
3506C03m7r5n4l0k5PlK5J03m8j9o6J4M7J0N0J02o9q4K7R6j97R3Rl7N0rJ28l9j70J01p5n7P4
3107A15jK8O9l6k8m9Ln0L5J03r0K9J01n8j12J9M0J66p8q4N6p5l7k7P1J65j21j15J31K3q9R6
$$ plain form
5806 17 105 164 126 58 149 120 53 54 187 58 159 173 180 85 112 191 185 127 34 85 70 209 166 37 88 105 117 126 137 117 316 160 74 126
5407 126 71 199 222 253 154 98 164 37 85 117 256 140 193 191 121 157 64 154 137 197 155 153 157 138 78 128 134 150 126 263 193 96 43 66
5008 66 121 121 172 31 69 35 85 59 60 71 40 91 133 70 103 61 112 128 40 150 202 38 130 1 53 158 108 91 112 138 102 235 260
4621 260 45 205 141 202 288 198 165 115 114 237 106 33 185 112 89 56 43 119 84 241 135 130 218 340 288 210 159 52 160 129 85
4257 85 158 126 103 107 91 329 267 105 160 304 187 164 189 212 306 167 238 177 180 215 120 44 44 217 150 168 212 218 27 231 120 66 114
3870 114 173 141 156 101 86 68 8 43 157 36 191 165 17 154 80 105 170 150 87 52 119 83 159 128 255 158 30 80 52 185 303
3506 303 256 161 107 77 52 59 56 81 184 136 117 51 65 112 122 172 274 205 121 148 244 47 140 149 112 162 153 281 242 72 173 98 41 115
3107 115 114 142 211 175 147 98 101 51 86 189 99 128 229 171 59 78 118 284 206 122 178 103 66 39 110 275 154 39 170 193 104 200
2731B00J00j79N7j25L8R1r5L0P2O7r6p8J47lj53J08M8k04J52j00J54j18J75j14j14J5K8j0
2402I3m7J53o0J00J6j26N9j04j2rn6lJ01n6j6N1j3M3K9J09q5P3J05k0k20J77k24L6o5O4N6
2038A49k8l9Q4K7j72J63j21Q1m1o7J39q0R3j2q4K7r2J20J4J8m3RNqmj3m6K8l1j2N3K44j40
1651B21k6N9r9Pn3M5n7J68m6j0L8r7n2l5L7KJ45R2j52k0Q5j16J1m3J4m7M8M8j20J3J70o8l1
1264A31J31q8r8K6J60k02J04p9J73M4j21j02J4M9QJ80j39m2j15K1N5l5K2%p4K37r2o4%l2J3
900H5P6J7j11j7Q6k1J70j4j85M3o9O7mJ00j41p7J04O6q7R4j37J19j14J5O8m3L9J46l3j91P5
536A26M3n1J6Oo0N6J39o4p9m6jLl6Q8o2J02O8m2j27R3K3o4p0J23n1%o4LK6lK8l6J02j36J13
125A66j62O5L2M4l9k7j2J79j11l9J03Rj59k1J16l8l6Q4nl0L4r1J12j12K6k6j2
$$ plain form
2731 200 300 121 178 53 91 182 87 117 189 256 160 82 229 226 73 181 229 25 177 77 231 113 288 174 60 75 103 93
2402 93 46 199 139 239 255 129 188 84 72 63 7 4 105 49 33 84 71 114 143 252 167 240 345 325 105 282 58 94 29 93 149
2038 149 121 82 166 193 21 184 63 144 103 36 175 95 188 176 92 119 27 147 161 179 136 145 150 142 138 125 79 107 76 64 117 361 221
1651 221 195 254 155 162 109 154 97 265 219 209 247 150 98 63 100 102 247 339 187 167 252 136 147 104 118 71 119 167 47 60 230 162 131
1264 131 262 174 76 102 262 60 164 85 258 302 181 79 93 142 150 330 191 149 34 55 110 75 97 97 23 260 168 104 104 72 85
900 85 161 178 67 50 136 115 285 271 86 129 60 127 123 223 82 5 109 175 88 182 45 164 50 65 133 90 129 275 242 51 126
536 126 169 118 134 140 80 136 275 211 132 86 85 88 52 140 78 180 248 206 79 172 195 131 61 184 133 133 69 72 98 95 123 87 189 53 166
125 166 4 69 101 145 106 79 67 246 135 96 199 208 49 28 144 106 70 154 149 119 153 62 174 62 88 62 50
-192E0
##PAGE=	F1=-501.954
##FIRST=	25164.767445380970457,	5806.2096540000038658,	0.13206142187118530273
##DATA TABLE=	(F2++(Y..Y)), PROFILE
5806D0P6M3k9q2J00ro3K7L8r6R1P5rj30N2L3L4m3r5P6o5J41nj77J16n2J1M3k4P7J70k10j03
5419E1J10LO2Lk7o6n8P7j04K3L6J42j25P6n7k1j3m2O4K5K2m4Q2k1o5m5NN2L1p2J02q1n9l2
5020C4N0O7l7P5j79M6LO3p8j5O0l7J0L6k2M9n5M4L3r2J00%r5R7j29Q3Q0r8j5J2N8l7Q0L8j73
4609E6J90j4jK6o7m3p9R2J26j57q7J41j01K2j2mj0QP1l7nO3J24r3j06K9q6P6j4m0O9l2kJ7
4210A20j7K12p1j45L4J78j36kM2n7J37j30N1Mo8P1r9l2o7J68o9P8L0k3j96K43j36q3Q3kn1
3846F7O1J5j14M1j4NJ07j29J26K6j09O9p0L4L0l4Kr2Q3j6N5p7J69p8p6O1m0J32R7p1o7q0n3
3459F0pO2k0l7J11m1qk3p1R5J4JQ1q3m8NQ9j73J14k1RM3J4J43l9k04J07m1n3Jk7J25Loo9l4
3036G2O5m8K0Q1r1J8P4m9q7N2K7J51l5j59R2j01K6n4P1J54j11j18P0P2p9N0J25j28M6j43O8
$$ plain form
5806 40 116 159 130 48 148 139 76 103 141 45 136 211 202 72 124 157 191 148 53 129 64 205 200 23 139 87 98 141 117 194 364 154 51
5419 51 161 164 226 229 202 136 78 155 51 74 110 252 127 203 146 125 112 70 134 159 181 137 219 198 133 88 93 145 176 104 206 125 66 34
5020 34 84 151 114 189 10 56 59 122 44 29 89 52 62 98 76 125 70 114 147 55 155 155 60 157 28 111 191 93 78 90 148 111 191 229 56
4609 56 246 232 231 257 190 147 68 160 286 129 42 183 82 104 92 88 78 86 157 120 115 178 302 209 103 132 46 122 108 68 137 105 103 120
4210 120 103 315 244 99 133 311 175 173 215 158 295 165 216 220 152 223 124 92 25 193 124 202 232 209 13 256 120 37 120 118 67
3846 67 128 143 29 70 56 61 168 39 165 191 82 151 81 115 145 111 113 21 104 88 143 66 235 157 81 142 102 234 331 260 193 113 60
3459 60 53 115 95 58 169 128 120 97 26 121 135 136 217 134 86 91 180 7 121 100 109 152 166 309 270 66 173 132 79 80 53 178 181 175 106 72
3036 72 137 89 109 190 99 117 191 142 55 107 134 285 250 91 183 82 108 54 125 279 168 50 120 192 113 163 288 160 206 63 131
2672A31J00j21j7O2O9p5p7J63J3j44Q2Q4k43J26r9J47r2J78r3j27N5K2j3j26K00o8P0N6p5
2332A88oq5l5L3k9k7M1n1QL7J7J8N8J08q6P3R2m3k20J17j85P5l5pR6m5p7J22M8j64J42j21
1956E7M5m2l9J04n8J49n7n8qm7O8j1R4l2K8jk9Jk1n9N6m8l6Q5K24r6q0N2j00No7O6q7J51k5
1545A84l5Q1o9o4l7N3l5J80R3j63k4J02j24M1j25L5l0L6L2j06N5J12p6L9O8n9j06L9J46j73
1193G0O6l5K04O7j81n4k3J6m1J88m9l5j38J7N1k5rpn3K15p0k8nl1K4K7Mn1q3M6O1J35j3j43
794A17o9nN8M3J37k10k3N3N5p1K9o5N7r8N6O2J0p1J79n0j17O1kn8O0J2p6O6J35p5p2p5%M1
395I4m1M6p9J63N4m3r1kO0m6m3J40p1K6q0L0l9j3O0l0J11r0K4p6pJ13lm6mm1J90j29j02J75
-4B10N8j77l4J20m3j3P1l8j0Qr5Q4n7J2l3j
$$ plain form
2672 131 231 110 93 155 224 149 72 235 248 104 186 270 27 153 54 201 109 287 194 67 122 144 131 5 205 137 207 263 188
2332 188 182 97 62 95 66 39 80 29 37 74 91 109 167 275 189 262 354 311 91 208 23 98 63 56 152 107 30 152 200 36 178 57
1956 57 102 60 21 125 67 216 159 101 93 46 114 103 197 165 193 192 163 164 143 84 140 92 56 141 365 269 189 241 141 146 79 145 58 209 184
1545 184 149 230 161 97 60 113 78 258 351 188 164 266 142 183 58 93 63 99 131 25 80 192 116 155 223 164 58 97 243 70
1193 70 136 101 305 372 191 137 114 130 89 277 228 193 55 72 123 98 89 82 29 244 174 146 141 110 134 161 165 114 31 77 138 273 260 117
794 117 48 43 101 144 281 71 48 101 156 85 114 49 106 8 64 126 136 65 244 194 77 138 136 78 138 150 74 140 275 200 128 53 53 94
395 94 53 99 20 183 237 194 103 101 161 115 72 212 141 167 87 117 78 65 125 95 206 116 140 64 57 170 167 121 117 76 266 137 35 210
-4 210 268 91 57 177 134 121 192 154 144 152 57 141 84 96 63 62
-192F2
##PAGE=	F1=-604.212
##FIRST=	25164.767445380970457,	5806.2096540000038658,	0.3727353513240814209
##DATA TABLE=	(F2++(Y..Y)), PROFILE
5806I7M5Pk1j00J31mn1N1m2p3N8J13Mj30K0j5J05j4j04Q5r9J49J2k01J58j02M1L0o2J78J20
5442C86k54j02J40P1K3n2n1k9q4P3o3K6J1J36j03J06j33M1p0LL1N8j0m4J62l0j27k5k2Q0M1
5078A89j09Q5j16k1L9P2K8n8O5j55K2O9L7q5l8Q9j7o1J6J0Q6n7K5N3j07Q6l4M4J2j06J18K3
4703B04j30mJ0P7m7M7M9j46K28L0o7m1m2n1p5J51R6j81l5R1o9%L8Kj03P6o1O6k1M2J08j10
4327A32j21P2n1P1mn8P7l0J5J4pJ72p9j03MJ99j55J0M7j22J61q7M2P0j54R8p4Nr5J03l1J03
3952B24Qm8j28K23j58k1Q8j07n5O3P2j23L3L4%P4j03M5Q8o2K3q8K9Ol8N9j10N3J3K2p5J86
3576B27p2m1P3m6J44O3j05k3j07o4jR7mj24J20m0K0K7k0k1L9m0L9p3O0p1N3p8M2m3R2L7J5
3189A75J38k2k54J13Nl9q1L2J18l1K4j10m2J20k5J6M1q7kN1m1m9O7J0J45lk11J04j12R9o1
$$ plain form
5806 97 142 149 128 28 159 155 104 155 113 40 98 211 215 85 105 90 195 181 77 162 63 212 224 23 181 79 120 150 88 266 386
5442 386 132 30 170 241 264 212 161 132 48 121 58 84 95 231 128 234 101 142 72 75 106 164 154 110 272 242 115 90 68 148 189
5078 189 80 165 49 28 67 139 167 109 174 19 41 110 147 62 24 113 96 35 51 61 147 90 115 168 61 147 113 157 169 63 181 204
4703 204 74 70 80 157 110 157 206 60 288 318 251 210 168 117 42 193 289 108 73 164 95 95 133 135 32 108 47 113 92 134 242 132
4327 132 11 83 32 103 99 41 118 88 103 117 110 282 203 100 104 303 148 158 205 83 244 157 199 269 115 213 139 144 49 152 121 224
3952 224 232 184 56 279 121 100 188 81 26 89 161 38 71 105 105 179 76 121 209 147 170 82 111 117 79 138 28 81 94 116 41 227
3576 227 155 114 187 141 285 348 243 220 113 49 48 145 141 17 137 97 117 144 124 103 142 102 141 68 128 57 110 32 74 31 123 160 175
3189 175 313 291 37 150 155 116 35 67 185 154 178 68 26 146 121 137 178 91 89 140 99 50 117 127 272 269 58 162 50 149 88
2825H8M3J19p7j00k5J15p1J7J52q8L8j40R8R8j31o8N6O3m9o8J62K6j24O0R5k14N5q0J13m7
2473A16J46p1j40J08K3qj20J24n7N7J01l3n2r3n9Q0J9n6k9l3P3j4L3QO8O6n8P4P8n9k19N5
2097A28n0KL6r6J24n1n9J08O0j57J41j33pj7M1PK5J19q7l7L0o0K9k4J51j9L6Nn8j3l1o4R3
1710A72m1q9J44J58o4j04K7p7j3o5J07l6K1Jp1J12k1n6l0O1p1K08Q5j55o0J33j01L8j81L8
1358G0j7M7J5q7N9P4q4J01K0l1j22Q1J04j25jK0K09P1k30Oo0J9j03J81K5mj34k1N7lo3Qp3
970IK00l4RMn6N1k9j0J1j15J2J18P1j8q7r7J5LJ05J73k26j8J7K6m5l8K6k2j1M9L7N1j53J71
571A99n6n0L5l8n0Q6J8p2N9J26q0o9n8J5J3J2j6M6R0J4l7m4j21P7l0J5J37r9N8j05R2p0n5
184D2O8j2J32l5o0k0RJ32p7m4Lm8J66j09J4O9P6j93k2J03m2RN5o0j4Kj02N1kQk4J0
$$ plain form
2825 88 131 250 173 73 48 163 92 109 261 173 211 71 169 267 136 68 124 187 138 70 232 258 134 194 289 75 130 50 163 116
2473 116 262 191 51 159 182 174 54 178 121 178 279 246 194 101 42 122 141 85 56 23 96 82 115 123 191 257 199 273 351 292 73 128
2097 128 78 80 116 20 144 93 34 142 202 45 186 53 46 29 70 77 102 221 134 97 127 67 96 72 223 204 240 245 187 174 143 79 172
1710 172 131 42 186 344 280 176 203 126 113 48 155 119 140 141 70 182 161 105 75 136 65 273 358 203 143 276 175 213 32 70
1358 70 53 100 115 28 87 161 77 178 198 167 45 126 230 105 104 124 333 404 174 180 120 139 36 217 242 238 104 83 140 137 74 82 9
970 9 209 175 184 188 132 183 154 144 155 40 52 170 241 223 136 39 54 57 162 335 109 91 108 134 89 51 77 55 44 93 130 181 28 199
571 199 143 93 128 90 40 126 144 72 131 257 177 108 50 65 78 90 74 120 210 224 187 143 22 99 69 84 221 122 180 75 167 97 42
184 42 110 98 230 195 135 115 124 256 179 135 138 90 256 147 161 230 306 113 91 194 152 161 216 156 142 144 42 93 91 99 75 85
-192H5
##PAGE=	F1=-706.469
##FIRST=	25164.767445380970457,	5806.2096540000038658,	0.48843312263488769531
##DATA TABLE=	(F2++(Y..Y)), PROFILE
5806A48K2l5j5j06J65j8m1P7q8o2J6J13M9j24l2o6J87K4j21Q2j18J68Rk02J65j26O8Rr1K55
5454C12O7k68q8J30J34J1j25kj3j28L8lL0lJ06p2J29j88J02p7j8OQ4l1n0K16j8j93rmP3M2
5078A90j29Q3j20K0O8P4k2n9L6r4QR2Jl9k3N8Rj21j5J5J38n3MO5j32P6%J13p4o7J52m7j58
4691D9L0KQ6n7N7K6j51K82N7j25j02j1l8l0J36M0j95N1L1ro2R8Pj10O9o4M8k5J7O8r5Lm9O
4292D0M8J0n5Q1l6J5lRJ31q2n8K2J64j77J7L7j59J64k1M3J26k35J05j6J6j12L0M3Q0k1o9k9
3916A08J91j72M2R2j68Mm5J00q7QO9%M0o0n3J52l0jj11J5M3n9Q2j24L2N5k1m9J64p0k9Q7m5
3529A60J61K0j33L6j31p4j3J16L9j51O2l9N5O6L4j41O9n5k0l7J51j14j1J6k4%J08L7j5J19
3177B91Nk46O1N5k2j30J04M4j4M2j49lR4RK2mp5k8L3l8QN5pJ39J5k35J08q9J34n3jO8l0o0
$$ plain form
5806 148 170 135 120 14 179 161 120 197 109 47 63 176 225 101 69 3 190 214 93 175 57 225 234 32 197 71 139 148 57 312
5454 312 379 111 23 153 287 298 173 171 158 30 68 65 95 92 198 126 255 67 169 92 74 80 164 133 83 299 281 88 79 75 148 190
5078 190 61 144 24 44 112 186 164 105 141 47 55 147 148 109 86 144 153 32 17 32 170 117 121 186 54 130 130 243 169 102 254 207 49
4691 49 79 81 167 110 167 193 42 324 381 256 154 143 105 75 211 251 56 107 138 129 67 165 172 62 131 67 115 90 107 175 80 83 34 40
4292 40 88 98 43 124 88 103 100 109 240 158 100 122 286 109 126 163 4 168 147 190 316 81 186 170 186 74 104 147 227 206 137 108
3916 108 299 127 169 261 93 97 52 152 65 73 142 142 182 122 69 221 191 190 79 94 137 78 160 36 68 123 102 53 217 147 118 205 160
3529 160 321 341 208 244 113 39 26 142 181 30 92 53 108 174 208 67 136 81 61 24 175 61 50 66 42 42 150 187 172 291
3177 291 296 50 111 166 144 14 118 162 148 190 41 38 132 141 163 159 84 56 89 51 59 114 107 246 261 26 134 45 179 126 125 193 163 103
2778A03o6P8o7LJ72n9K8j26J24Q3j25j01M9N6k1n3J46L1j04N2P7j61jm9N4nJ00o2q4J05K8
2414B05mr5J9k5O0J25Qq0j24n0J13N6q4m7PN4l9L3RO7Lj1O9O3o6k00L5N3j09J21o0K7n6J9
2015I6M7M7j31J51j57K5QK2n1J05N0j02m4J14q9kj3J74nK9K7r7l8l9o4J24k8j11J86P2m9r7
1639A60j0l4m7m2J42K2j17N9r1P2J5l1PO6j01K16P5j33j21J66o7K9k02K5rP3lq0M0N6q3J41
1264A93Nk4j18R9O8o5r1P1J97N9k58O3r1N2r6R2P2L4j05p3P1J6j21M5n9J28NM4J2q2P3p4l1
876A11O2j14K8J18j2k7j8l2n3m5J49K11k27l1Jpj6j0L4r7L9N2J2Q3j33P5m0k6J5m2n7J00K3
489A26n8N5J08p5q0LJ7m5Q8l9J17K1k6j8k2j25k2QO5J11j25J06j17J38p3n5lJ4J56J8j24K
114A46M5J29j36m6Ql3J07p3J07nO6k02J7O7m1J6M9p3l7Nr7L1M4mJK5
$$ plain form
2778 103 37 115 48 51 223 164 192 66 190 273 148 47 96 152 131 78 224 255 151 203 280 119 118 69 123 118 218 156 72 177 205
2414 205 201 106 125 100 160 285 293 213 89 39 152 208 124 77 84 138 99 132 141 208 211 200 269 332 266 66 101 154 45 166 106 133 77 96
2015 96 143 190 59 210 53 78 86 108 57 162 212 110 66 180 91 89 76 250 245 274 301 204 166 127 63 187 159 48 234 306 257 160
1639 160 150 116 69 27 169 191 74 133 42 114 129 98 105 171 70 286 361 228 107 273 206 235 33 58 49 122 119 39 79 135 52 193
1264 193 198 174 56 155 223 158 67 138 335 394 136 199 108 160 64 156 228 262 157 84 155 171 50 95 36 164 169 213 225 143 216 142 111
876 111 173 59 87 205 193 166 148 116 63 18 167 378 151 120 121 114 98 88 122 25 64 116 128 211 78 153 113 87 102 60 3 103 126
489 126 68 123 231 156 76 79 96 51 139 100 217 238 212 194 172 47 25 33 98 209 84 190 73 211 138 83 80 94 250 268 144 146
114 146 191 320 184 138 146 113 220 147 254 249 315 113 130 197 156 172 221 148 111 116 19 50 94 90 91 116
-192A16
##PAGE=	F1=-808.727
##FIRST=	25164.767445380970457,	5806.2096540000038658,	0.49000364542007446289
##DATA TABLE=	(F2++(Y..Y)), PROFILE
5806A81Np0qn4J51n4l1J01r7o3RM5J24j17o1K9R2N1j38P6j27J91kj96J50j24O4J5j08K89K7
5442C50k35p6P9J80J6j93R5j8j44k4N5OJ9N1m6J40k01J45l9r4J5R1m8o1K37Ok47oM9M3L8j19
5067F4O6n5J4O1N4n9m3%l7J3P6l2M1j3L0L3j77%k5J76m1j4O2j55P1O5J28j39k6J83j06j90
4691B5O5pR2n8R4l0j78L44O1j66j37K5ppR8l0j19O9j4L5j16J35J6n0kK2l6jrJ2m6N0r6L7r
4280F2L3j3P6n6Lk8K5J00p7l2Q3Q7j99K5J7m6K8M6N1J67k82P6O9lj22l2J15L0m7p4P8J50j72
3893A38P7R3j89L2j28R6n3J5Q4LNqj39K03k8j1j20NJ14r1P6j40O4P1m5n6J34o7m3J02l5J68
3517C27k9j33J04j48r7J0P8R5j36l1j6P2Q4Q2k28R6o6l9j3J81j14m6N8%J0Q1M1o8R5L2j57
3154A25n1R1j2r8R7k9M7M1j88P7PM3L3m3n5m3J6n3R3J2k1J18K0k23J11o1J33k9n1J2K7oj8
$$ plain form
5806 181 186 116 108 54 205 151 120 221 124 61 70 115 239 122 61 90 182 233 95 171 44 235 233 37 187 63 127 142 34 323 350
5442 350 115 39 118 298 314 121 216 198 54 30 85 91 110 161 115 255 54 199 160 66 81 172 124 63 300 306 59 53 102 145 183 64
5067 64 130 75 89 150 204 145 102 102 65 78 154 122 163 150 180 213 36 36 11 187 146 132 194 39 110 175 303 164 138 321 215 25
4691 25 90 83 175 117 211 181 3 347 408 242 105 130 123 116 214 184 65 134 120 155 39 174 190 140 138 160 124 123 114 126 80 130 34 71 62
4280 62 95 82 158 102 105 77 102 202 125 93 176 263 64 89 106 60 88 134 185 352 70 146 215 212 90 58 173 203 156 82 160 310 138
3893 138 215 308 119 151 23 119 66 81 165 168 173 165 26 229 201 190 70 75 189 98 174 34 98 169 124 68 202 135 92 194 159 327
3517 327 298 165 269 121 24 34 112 207 71 40 24 96 180 262 34 130 64 25 12 193 79 33 91 91 101 182 223 155 250 282 125
3154 125 74 165 153 55 152 123 170 211 23 100 107 150 183 140 85 42 58 5 98 110 89 207 227 4 115 54 187 158 107 119 146 140 122
2766A22n8k9j6J59l2J1r9J36N1j04j04L5N1Rm4J30K4r6O0L9r6k1m1lK4N5p1M8K9L7mn0r4L2
2367I0O4J16N3r6j59NJ14O5j06k5K4J7n6L7RN8o2M5N9M6o5j45P0P1k00J72%p5p0R5KQo9J49
1968B41j83O5lMl8J28j4j06o3K00j17k4kJ83JJ3O2j38o6m0o4J46j2q7J85pn4o4m4Rq0J8J22
1581A71O8k08J34n2l0k3J0P4O2j15K03O4j02j89J80k6K7k09K2j0J01k9q8K0N1n8J49J4m0r1
1229H0P9N6j1j76J08J74L3k51J05j13Q8p1%Q8O6n5j26Q8K2j58Q5j1K0L3P9J3r6P8r9o4R8r3
853F9N5J13r8l6N1J2j03k7J18K47k22m4j4k4PM4K5j30K0O3j5J05r6J1pn7QK3n9L5L4m3O5P5
454B05m8j06O4Mo1J22k8J40m2m9Rk8r2m6L7L4O2j12J52r7J20o7m0p9L0J73N9j63RP8J05j63
78A82n0J5qK8l8J67m1L7j98P5K0m9RN9q5o7Qn1L2O0m1L8M2
$$ plain form
2766 122 64 35 19 178 146 157 58 194 245 141 37 72 123 132 88 218 242 146 206 245 149 128 87 84 108 163 92 140 169 206 202 152 58 90
2367 90 154 270 323 227 68 73 187 252 146 121 145 162 106 143 152 210 148 193 252 298 233 88 158 229 29 201 201 126 56 151 153 161 92 241
1968 241 58 123 120 124 86 214 200 94 31 231 114 90 88 271 272 285 347 209 143 103 39 185 173 86 271 264 210 146 102 111 31 49 171
1581 171 239 31 165 113 83 60 70 144 206 91 294 358 256 67 247 221 248 39 61 51 152 123 35 55 106 48 197 211 171 80
1229 80 159 215 204 28 136 310 343 92 197 84 172 101 101 189 255 200 74 162 184 26 111 100 120 153 232 245 149 227 128 64 162 69
853 69 124 237 139 103 154 166 63 36 154 401 179 135 121 97 104 148 173 43 63 126 111 216 120 131 124 67 75 98 39 74 108 65 130 205
454 205 157 51 115 119 58 180 152 292 250 201 210 182 90 44 81 115 177 65 217 120 240 173 133 54 84 257 316 153 162 240 345 182
78 182 132 147 139 167 129 296 255 292 94 169 189 140 149 208 123 56 64 13 45 105 64 102 144
-192A44
##PAGE=	F1=-910.985
##FIRST=	25164.767445380970457,	5806.2096540000038658,	0.51382833719253540039
##DATA TABLE=	(F2++(Y..Y)), PROFILE
5806A90pq6%JJ32j01k4J17p7p1K9n2K08j10n4O9J6N2j46O9j22K02j2j95J33r3J1O8j23K75
5454B99J0j67p5QK03K7k39J93k8j39j0M2n9O7Ol9J35j73J65Oj73M9P6o1o9K25L2k38o0J12
5102A25J3L3q3K6j3J6N2K2p3j8k9lJ5M0m6J33j0J8M7k35K0lJ44k0k7M1j57O5J04J27j65KK07
4715C68j33j84M2j2R2m3J23r0j10K96M4j83j29N5J3kN8r6L4Qm3N4j21J17K5L4r9R2o9K7k5
4351A43j1j8K9q4M6q3O3L4P4p7pn0L5Q4n6m3J42J5k01M3%K2p6R3N6J95k81J6J57l6j24n8J41
3963A83k7n4k2J27R9j60P8R2j87N1j38L7l4M3Q8Pk8M1j62J99o2j2j03NJ63j10O3j38J17N5
3611B11n3p9J06n3q0J07j6J54p5r2J69j60j28P1j1J45j19q5M2K4Q3J20k32Q5j01L4l4J51r0
3271I4m1N6L0pQ0M6j29P3M1m2j25P8j6n2P3o1J05L4k27J35o4O8M7p3l4k0Om1J16l6l7Q0J9
$$ plain form
5806 190 183 97 97 98 230 129 105 222 145 74 103 51 259 149 95 164 180 232 86 155 33 235 223 28 161 68 79 147 24 299
5454 299 309 142 67 75 278 305 66 259 231 92 82 124 65 132 138 99 234 61 226 232 59 108 184 123 54 279 311 73 13 125
5102 125 138 171 88 114 101 117 169 191 118 100 71 68 83 123 77 210 200 218 265 30 50 47 191 171 144 185 28 93 197 324 159 161 368
4715 368 235 51 93 81 173 130 253 163 53 349 393 210 81 136 149 147 205 109 143 151 108 162 41 158 183 217 118 210 141 168 143
4351 143 132 114 143 59 105 22 85 119 193 116 109 59 94 178 122 79 221 236 35 78 78 100 24 117 173 368 87 103 260 224 100 42 183
3963 183 156 102 80 207 306 146 224 316 129 180 42 79 45 88 176 183 155 196 34 233 171 159 56 61 224 114 177 39 156 211
3611 211 158 79 185 132 52 159 143 297 222 130 299 139 11 82 71 216 97 12 54 78 161 281 49 134 33 67 33 184 94
3271 94 53 109 139 132 212 258 129 202 243 201 76 154 138 86 159 98 203 237 10 145 81 149 196 123 89 69 75 34 150 114 77 157 176
2884A76j47Q2m2J04Oj05k2Q5M0J8j43L2l6Q6Pk4o4J33Jo1r2J6N3L9n5J23J4j10Q4Nm3no3m7
2484D5M4J9q9J91p5M5lJ1j45N7O0P0J00r7j77N3J13M2j18J3L2k0p1N1%L8j05R4N1K2n9o6R9
2097B25O5k07J30P1j53j04J61l0m1K3J28k00P5k6%J3J21n4j10j4K03j43l4oJ86moJ08j79q5
1745A13l4o9J70Nn2J59o9o5k3n2K1m9L3O4R9k18J65k7j6j03j0J38M3j08J80N4p3k16J35K4
1393B19L2k08L1oJ17p1q4qN0pJ21L1o7n0K5P5K9k02R8J41nk04J24j17R9n4n1P2Q6Pj71J01
1017A53K0j37Q6M7p0K9J18Lr5N8j00r0J14p3Q1J10j64l9J05K4j03l4P7K77k07n2m4j4J9P8
665A77L9j33l1P6n0J16n6J0Rj01J4R2q6k9N8l8Q3L9mj23Q1j3l3J06qJ37r2n3L5m8p8lL7KL
254A35m1J58p4P1o0l1j02J6J75Q1j75J5R4O9j62m8K4J4m4k2J87m3Lj61J19j9p3qR5j03n5j9
$$ plain form
2884 176 29 111 69 173 179 74 52 137 177 195 52 84 48 134 141 117 53 186 187 126 34 50 103 142 87 210 224 114 198 203 160 155 92 45
2484 45 89 108 19 210 135 180 177 188 43 100 160 230 330 233 56 109 222 264 146 159 191 171 100 151 151 189 84 178 229 251 192 126 225
2097 225 290 83 213 284 131 27 188 158 117 140 268 68 143 117 117 130 251 197 87 73 276 133 99 93 279 275 269 377 198 113
1745 113 79 10 180 185 133 292 223 158 135 83 104 55 88 152 251 33 198 171 155 52 42 180 223 115 295 349 276 60 195 219
1393 219 251 43 74 68 185 114 30 22 72 65 186 217 150 100 125 200 229 27 125 266 261 57 181 64 163 109 58 130 216 223 52 153
1017 153 173 36 122 169 99 128 246 249 154 212 112 22 136 63 144 254 90 51 156 180 77 43 120 397 190 138 94 80 99 177
665 177 216 83 52 128 78 194 138 148 157 56 70 162 76 47 105 67 150 189 185 62 143 130 97 203 195 332 240 187 222 174 96 93 130 132 135
254 135 94 252 178 249 189 158 56 72 247 328 153 168 262 331 169 121 145 159 115 93 280 237 240 79 198 179 106 98 193 90 35 16
-121A6L0J3O8j01P7N9
$$ plain form
-121 16 46 59 127 26 103 162
-192A62
##PAGE=	F1=-1013.24
##FIRST=	25164.767445380970457,	5806.2096540000038658,	0
##DATA TABLE=	(F2++(Y..Y)), PROFILE
5806A77j4p6QL8J18j49k1J19l9q2M6q2K34j03m7Q1k2K9j40N7r0J77j0j88J13l8n7J36j62K33
5454B46J9r6o5o2J98L2k55K64l6j14RL3j26R5Mn4J08j13J61M1k23P3N0p0o3J91N0j60r9R5
5102A33oK9l4k7QJ5M5j2n3%m2PlkqJ93j7K1N2k63K5K6R4Rm0Pj17M2R6J24j45QK22j29j57j
4679A00l0Q8j4J31j32l6K20J2j74q3O7K1kK1j39J60m7p7O3j02Q3K3J28k11J39m1M3l5mj9k1
4316A32n2N6j00L0P3O8q6qn8L4Q5l3q2J71l0j28M8j4Nr1P8M6K14k47l5K17o6j16l4J03o4j5
3940A01M4R7M2j42N3Q8j63O7r6k5n2P6Q7On4Q1j62J78j15%o8PJ67j02N0r2J37K1n5r0Q2j8
3564A50q9N1J0J12j10NK00j66j37R8o6J50j00m9K2k3O5J48j86N7j27P7j9R5o6l4N4L6l3J13
3212B38M7j86O5K0P0j41K0l4MM0k5J11L0k42J46j03P8O5r5k3K1J3n8J42p2o2K8K1o6O6j0L8
$$ plain form
5806 177 163 87 95 133 251 102 81 200 161 79 125 43 277 174 127 208 186 215 75 132 42 219 209 21 134 96 39 175 13 246
5454 246 265 169 104 42 240 272 17 281 245 131 140 173 47 142 146 92 200 87 248 289 66 139 189 119 56 247 297 137 38 133
5102 133 127 156 122 95 103 118 163 151 98 98 56 63 60 58 50 243 226 247 299 36 61 87 181 190 150 157 40 82 178 302 157 165 387 258 101 100
4679 100 70 158 144 275 143 107 327 339 165 82 149 170 168 189 50 210 163 86 149 47 130 153 281 70 209 168 211 176 172 153 132
4316 132 80 136 36 66 139 207 121 113 55 89 174 141 59 230 200 72 120 106 111 20 98 144 358 111 76 293 227 111 77 180 116 101
3940 101 145 242 284 142 195 283 120 187 91 66 14 90 177 183 129 210 48 226 111 111 43 50 217 115 165 73 210 231 176 86 168 150
3564 150 61 112 122 234 124 129 329 163 26 124 58 208 108 59 81 58 123 271 85 142 15 92 73 168 102 68 122 158 125 238
3212 238 285 99 164 184 254 113 133 99 103 143 118 229 259 17 163 60 138 203 108 85 106 119 61 203 131 69 97 118 52 118 108 146
2837A46L5j50N8P0M3M3j58L8o2M0N2p1m0J26n1Pq9nO0O6q8J28Rj43J14Ql3K8r2p4N3mJ9J74
2438B57j75N1JP6j06K0N3lJ41q2j71P1J13lj14N3L2m6q5P2k0J5j24J34M5pn1J4J11N3j78N6
2062B03J36j90j41J95n6q6J30R0k04O8n7LP7J05o7j10L3J80j63l1k4J83k2k0J52k11q2k4l5
1722C2J60J3k6J15j09o8Nl5J0kL3rJ10j88J70pM8q1r0J22Rp9J57M7n7j89L0Q0M9k02M4J1J17
1334B20j27l6k0KN5P0M0r1kn2J24M4j63N8Q9n2j16J16r4P2m9n9L4R3O3j84R0J4p1N0J07j17
959A08nJ56j8q7K1q4k4P3j02J03J07j86k9J18J0m5r6N6K88j76n0r5K3J5Q6P8j15n7N4q9J13
595A51k0M6Qj20K5J26j11o9Q3m4R2J7M1j33O5k8kP7RJ20j24m5N0n5r1M8L5j0m2K5J42m9J7
207B34n1l4p8mJ52Q5j65K6Q6L3j43l1K7K8q3k2J57j9l1n6R5l0j07KJ19j05L2k2j6k1Q7j26
$$ plain form
2837 146 181 31 89 159 202 245 87 125 63 103 155 84 44 170 119 126 37 32 92 158 70 198 207 64 178 186 153 181 89 15 68 64 83 257
2438 257 82 133 134 210 104 124 177 174 315 233 62 133 246 243 129 182 214 168 83 155 135 150 26 160 205 198 147 161 272 325 147 203
2062 203 339 149 8 203 147 61 191 281 77 145 88 91 168 273 206 96 129 309 146 115 91 274 252 232 384 173 91 67 32
1722 32 192 205 179 294 185 117 122 87 97 95 128 119 229 41 211 204 252 171 81 203 212 133 290 337 280 91 121 201 250 48 92 103 220
1334 220 93 57 37 39 94 164 204 113 111 59 183 227 64 122 211 159 43 159 65 137 88 29 63 156 219 35 125 139 68 118 225 108
959 108 103 259 241 154 175 91 67 140 38 141 248 62 33 151 161 116 20 76 364 188 138 43 66 81 167 245 130 73 127 38 151
595 151 131 177 185 65 90 216 105 36 119 75 167 184 225 92 157 129 127 204 213 333 209 164 214 159 68 116 151 141 99 124 266 217 234
207 234 183 149 71 67 219 304 139 165 251 284 141 110 137 165 82 60 217 198 167 111 206 176 69 71 190 85 117 95 79 58 145 19
-168A9P2P4
$$ plain form
-168 19 91 165
-192A65
##PAGE=	F1=-1115.5
##FIRST=	25164.767445380970457,	5806.2096540000038658,	0
##DATA TABLE=	(F2++(Y..Y)), PROFILE
5806A54k5l6J4M7J12j86k3J01Lq8N4m1K00r9m6P7l0%j14L4n0J30Nj42P4Rk8J13k07J61M8l5
5431A86m3j08J64K5j94K52m6p1J8L4j23L5M9p1N8m1J35O4k37P3J6o2m6J50N6n8j19K7j4K9
5078A38K0p7PKM9m1j2Ol5jl4J3O4J60l6L5M6k37J7L8M1L8n6l0n6J4N2J16q3j1K29j07j26j0
4679A33p1P0K4J20j40J0J35k6j40k4O7K8pnj36K08p1j22O9q5Q5rK11l21J57L9M7l9jj6p5o
4304A09N3p5m7R8N4p7Kn3K7Q8k0j18J59m8k9N7m7l9o6N1J8K24j97n2K35p9j00j1O2l4RN4N3
3916B61j5j25J2Q0j13Q5m3n2o3N6R2op0J08j52J46j39M5o8pJ34o8M8k5J19k0n4q1O9L0p6m9
3541E9M4M4q1R7J88j67j39J02o3R9p3j4nm8K9J78j30K1o7K8J7N1o8k7N7J3n9J76L6k24P4k3
3165A25J45j17m7n9N5J5M0Q5L0k36J14j08P7Q3j11k2O8L0q7J66q8q6l0K2J0N7L1m9M9j15J27
$$ plain form
5806 154 129 93 107 154 266 80 57 158 161 73 127 86 286 187 141 218 188 188 74 108 58 188 193 51 125 134 106 219 12 173 221 186
5431 186 143 35 199 224 30 282 236 165 183 217 94 129 178 107 165 124 259 323 86 159 175 113 67 217 273 215 96 123 109 138
5078 138 158 81 88 90 139 98 86 92 57 56 22 35 99 259 223 258 304 67 84 122 163 201 145 115 59 73 125 241 158 147 376 269 143 133
4679 133 62 132 156 276 136 146 281 255 115 91 158 186 179 174 38 246 175 53 122 37 122 113 324 3 160 199 246 207 206 190 115 109
4304 109 162 87 40 138 192 115 117 64 91 179 159 41 200 152 123 180 133 94 28 79 97 321 124 72 307 228 128 117 179 145 154 208 261
3916 261 246 121 133 213 100 185 142 90 27 83 175 169 99 207 55 201 62 107 39 32 166 98 146 121 240 220 166 85 154 184 108 59
3541 59 103 147 66 163 351 184 45 147 84 183 110 96 91 43 72 250 120 141 74 102 119 170 102 75 132 145 86 262 298 74 148 125
3165 125 270 153 106 47 102 117 157 242 272 36 150 42 119 202 91 69 137 167 80 246 158 72 42 64 74 131 162 113 162 47 174
2801A74L2LN6j45K5q6K8Q0r8l2J12o7O4j02k5O8Q9j33J35J4j52J11O1p6O1r2n1Jj1J11J12
2438B67k35M4J5J30o2j1N1q0J63n0j59O7J10n2r4P9L0n2r5Q4m3lq1J28L6l6m7P5J12L6j26
2074B01j7J75j88j28J50p8j12K34L8j96O4r0OJ35R0o0r9L9J58j74j6m2J69m7k7J85k28n4k0
1733F8KJ46J6j7O3j29m7nj6K4K0L8p1Q8j32J52J3J21m5j44O0l4l5J41M9n9j50q1J33Q6j96
1369E9N6L4J04j89L5j6m5R1PL6j02M0o0J31K6j02L0K6j04mQ7o0L0n0m0j2R6Q6j37L0QNkJ62
970B56j25l0J73n5q2j4o4O6P0j90J11J00j59k6J09k2M2j11J5K36j21k6q7jj3P1J32p5m8kj25
606ER5PQ8Kj11L0J34j30p5Q8n0Q7K0P1j45L3k8J2N1J3J02j31l7N4k4j30Q4K8j1m0L4J16j3
219B29l1l7m7l8LR8P8j39L1O1J4j19mK5K5p2ON2J2n6Q6J7j1j13N8P1p0P3l1o4o9J09r4J8Q5
$$ plain form
2801 174 206 209 265 120 145 59 87 167 69 37 149 82 146 44 19 87 176 43 178 192 40 151 212 136 197 105 54 55 44 155 267
2438 267 32 76 91 221 159 148 199 119 282 232 73 140 250 198 104 183 213 161 66 150 107 104 23 151 187 151 104 179 291 327 201
2074 201 184 359 171 43 193 115 3 237 275 79 143 53 59 194 284 224 125 164 322 148 132 90 259 212 185 370 142 88 68
1733 68 70 216 232 215 278 149 102 97 81 105 125 163 92 180 48 200 213 334 289 145 205 171 136 277 326 267 117 36 169 255 59
1369 59 115 149 253 64 99 83 38 129 136 172 70 110 50 181 207 105 135 161 57 53 140 80 110 60 20 8 104 190 53 83 91 96 94 256
970 256 131 101 274 219 137 123 59 125 195 5 116 216 57 31 140 118 160 49 64 300 179 153 66 65 52 123 255 180 132 130 5
606 5 100 107 195 197 86 116 250 120 45 133 83 170 190 261 116 149 121 133 184 197 299 168 131 185 161 31 115 143 132 92 126 242 229
219 229 198 161 114 76 79 177 255 116 147 208 222 103 99 124 149 77 83 135 147 91 177 194 183 70 128 199 129 202 171 107 38 147 53 71 156
-192A56
##PAGE=	F1=-1217.76
##FIRST=	25164.767445380970457,	5806.2096540000038658,	0
##DATA TABLE=	(F2++(Y..Y)), PROFILE
5806A36m2J0K5L1J15k07k9O4L9q0N0QJ58r7m3O0k5j5p2jj8P8K7q5N1K7J0R0k20M8Q6J1j4j47
5407B9J40Lj09K03n9j5K3L0q4o8J14o7LK0R3P2k28O8k5l0l2J20M8M0j40n2j0L4P2j04j7k6
5032D6O9o4L1jj3j0J6M9M2R6o5M9L0j79J8K8LN5p6m8%j1lR5Km5K25p7r7J5j07L2O3R4j16J3
4609A59N7n7q3K5N9M1k2j7j17K02n6j39M0o4J23o1K52k53KJ33M6l8j4Pj18L3M2n4j14J06L2
4245A52m5J4m0K2P7j8j14R7m6O6O2r8p0l0L2j4K16j42m8K23o4p8qM3L0k1M7J9o4j07l8P1m6
3858H0J04no3p0K5R9k7p9J34j12P4n5O4j19l5O5k2P6L3O5m9n0n5O0Q0q0j32P9l5R4O3J49j60
3470A96j36Q8l8L9k9Jm0k4m0K16q0l2J0k0M7L2r9j5O8l3n6K26J4k37Q7k8J28o5r1o0N2K6P6
3083A83N5L0k14N9q6O9R4j18k9J13N2j15J81q1r5m2k0N8N5O2j33M7j1J41Jo0N8j17Nj02L7
$$ plain form
5806 136 94 104 129 160 275 68 39 103 142 62 112 120 278 181 138 198 173 158 86 85 67 145 172 87 138 165 175 265 45 93 179 190 176 29
5407 29 169 172 63 266 207 192 215 245 161 93 207 140 143 163 256 328 100 168 143 113 81 201 249 289 149 97 87 121 193 89 72 46
5032 46 115 51 82 81 68 58 74 123 165 261 196 245 275 96 114 142 145 200 124 76 76 65 62 157 159 114 339 262 165 180 73 105 168 262 146 159
4609 159 216 159 76 101 160 201 179 162 45 247 191 52 92 28 151 90 342 89 91 224 270 232 218 225 107 140 182 128 14 120 152
4245 152 107 121 81 103 180 162 48 145 99 165 227 129 59 29 61 47 263 121 73 296 232 154 146 189 219 198 245 264 200 93 55 126 80
3858 80 184 179 116 46 71 170 143 64 198 86 160 105 169 50 15 80 58 134 167 232 183 133 78 138 218 138 6 85 50 144 207 356 196
3470 196 60 148 110 149 120 121 81 57 17 233 153 121 131 111 158 190 91 76 144 111 55 281 295 58 145 117 245 180 89 29 81 107 183
3083 183 238 268 54 113 27 96 190 72 43 156 208 93 274 193 98 56 36 94 149 211 78 125 114 255 256 196 254 137 142 40 77
2719G7P8q5mO0k8O7j10m3P2J11j74J36J9q8L8J30j30P2m4m9n6OJ45L9j87k2M6J47k3l9N6j17
2344A00J40j1j52N2J02q9n9P5L4l5q8N8m9Oj9R8J7o1m7J02J10J0o4n9J72j57j14R1r6rK14
1980B72k2j72O3j02K5J45P5m2q5J1J42j68Km2J47p4l3J98k27j6j9K4J30J8j3J0j27kn8kP9
1616A37OM7r7K4n7J14L0J83nj84j3p8J3J36O3q2j15p4Q0J40j91O7N5Q0k44J00oo4J00n4J4
1252A25q0N3N1N9k3l8Rk7q2L7M4l2Kk3m4J7M6M9n1m0lO9o5K02j04j8J55j04q5l0m5J45R0k04
853E5J8R0j06m2J08n6J23p1jR5n1K8l2p3o8M3J87k2k5o0j19L7J7J19np5K5J22j41o6P7m2O8
466A57M4P9j48j7pQL8nR2j06m7N7M1j29M4J1j0K2j0P2L9p7j5l2k6L0K1P2j05K1K4K8r1J6K2
55A13Nl0N0l2ml9J81p5K0q5R3Ok4R1m6j03j06J11n6k2R0
$$ plain form
2719 77 155 70 66 126 98 165 55 12 84 195 21 157 176 88 126 256 126 198 154 105 49 55 200 239 52 30 76 223 200 161 217 100
2344 100 240 229 77 129 231 142 83 158 192 157 69 127 78 84 65 163 180 119 72 174 284 294 230 171 343 186 72 163 67 58 272
1980 272 250 78 141 39 64 209 284 242 157 168 310 142 144 102 249 175 142 340 113 97 78 102 232 250 237 247 120 118 60 58 137
1616 137 143 190 93 117 60 174 204 387 382 198 185 107 120 256 319 237 122 48 128 268 77 144 199 279 35 135 129 65 165 111 125
1252 125 45 98 149 208 185 147 156 129 47 84 128 96 98 75 31 48 94 143 92 52 49 118 53 255 151 133 288 184 99 69 24 169 259 55
853 55 73 163 57 15 123 67 190 119 118 213 162 190 158 85 17 60 247 225 200 140 21 58 75 194 189 114 139 261 120 54 131 89 157
466 157 201 280 132 115 108 116 154 149 241 135 88 145 186 57 101 112 102 124 114 186 225 148 133 101 75 105 126 198 93 114 138 166 75 91 113
55 113 118 88 138 106 102 63 244 169 189 104 197 203 179 270 224 121 15 126 70 48 138
-192A38
##PAGE=	F1=-1320.02
##FIRST=	25164.767445380970457,	5806.2096540000038658,	0
##DATA TABLE=	(F2++(Y..Y)), PROFILE
5806A30o3M2M2NJ20k04l9K3N3m6L3M8J08r3l2L7k7nk0m2oL9M4l7N1J7L6Q4k21n7J20M3J2j80
5407A5J38k7m0J52p0M1L6Nl9j66J71l8l9N2M5O6k06O8o2K3l2J07L2J09j54j27KN1J09j03n6
5043F3j9P1p6N4k9J9j3Q0M8K2L5r8N2Lj04K3P%N1j01j7J6l0j5L0Q3q2K18n0q3O1j21j4R3O8
4632B45q9j2Kp9QM3M0N7m7j6j14J84j1j08k4k6J32p9K29j64q2J46M2l2m0N3j41M4L4l6j31
4269B8O6K4%Mk0K5M8k5o6J6n0J36N6j46q2M2j5OJ46q6l9J93k2n0l4N2P6p3L6Lq8q2j5RoJ13
3846A80J2o1q0J1J01m9q6J64m5l3N2O9j60l2j5j1J26N5j3m0n4k1N2J15j01q3J6k5J85QJ06
3482C43j43j29N9j3oL3op8L3m5J84m8j01Q9m3N2K2j33NQ4o9J7J82j8k20Q3L1J9Lq1l1l1Q0
3095A24O2L2K8j78%m4N8Q3j08m4J47P5j30J80n3r7k6n6O0N5P3j98L7J02J39l2j20M9q3j7r7
$$ plain form
5806 130 67 109 151 156 276 72 33 56 109 63 96 144 252 159 127 164 137 132 112 70 64 103 147 110 161 178 214 298 77 20 140 183 195 15
5407 15 153 126 86 238 168 209 245 250 211 45 216 178 139 191 236 302 96 164 102 125 93 200 232 341 187 60 62 113 222 119 63
5043 63 44 115 39 93 64 83 70 150 198 220 255 157 209 212 108 131 138 138 189 88 71 87 57 42 72 155 73 291 241 158 219 98 84 177 245
4632 245 156 144 146 67 75 118 158 215 168 152 38 222 211 103 79 53 185 106 335 171 89 235 277 245 205 258 117 161 195 159 28
4269 28 94 118 118 122 102 127 175 150 84 100 50 186 242 96 14 56 41 47 193 107 68 261 239 189 155 207 283 210 246 249 161 79 64 73 67 180
3846 180 192 131 51 62 163 114 28 192 147 114 166 235 75 43 28 17 143 198 185 145 91 70 122 237 136 53 69 44 229 237 343
3482 343 200 71 130 117 111 144 138 60 93 48 232 184 83 172 129 181 203 70 75 159 90 107 289 271 51 134 165 184 187 106 75 44 124
3095 124 186 218 246 68 68 24 82 165 57 13 160 235 105 285 232 135 109 53 113 168 241 43 80 182 321 289 169 218 135 118 21
2731B1M2N7m6L6qJ0N3j00n8P4J32j95J24J8l0j6J71j46N6K1o5j09M3J24k5r8m8M7J35Po9O3
2355B21r1P1K2j51L1R1j08j2L7M9Lo0j9rK9mJ00j7p5m3Q5J05j7j3n2J22j08j01L6q5P2J84
1980B93q5j28O6q8N6J05N4k4p6l3J34j43J5j8J25r8m4J93k09Pj3L1J03K1kl8j02N6j41K6J35
1616A78k0M9r9n0NQ4M3K13K6k01p8j12N1J33Q6j18q4jj8J94j83P7P3M0k65J31J5q1J07q7l3
1252G5j1J8J58J2p5Qj5m9j3J9Pk4j5J7o4K8L1j8M3n6k9Q8j11J95n9J6J20j61q5J7QJ19J02
865B96j95p9P6m4k5P7q5J75j0%p2J8J05J0j38r1RK01K9Kj04j15J1lJ29j4j9J4R2j40n1N0k0
477H9M7P2O5j30q6L3LL5m2Q8m8q5P5R9j24Jj9k0J33l6pP8j26J8M7p2N2n8P2o9rk0Q0n1KL6
55A23l4J3Q1k4q1K9J83j40L0n4J13n4K2J00o2j28q3N4k6k9Q4
$$ plain form
2731 21 63 120 74 110 102 112 165 65 7 81 213 18 142 160 130 114 285 139 195 216 151 42 85 209 184 86 38 85 220 227 158 221
2355 221 130 201 223 72 103 194 86 74 111 160 163 103 84 75 104 100 200 183 108 65 150 255 238 225 173 295 187 86 122 37 109 293
1980 293 208 80 146 58 114 219 273 249 173 140 274 131 146 128 253 155 111 304 95 102 89 120 223 244 242 204 102 158 17 43 178
1616 178 158 207 108 58 63 147 190 403 429 228 150 38 89 222 308 190 106 105 87 281 98 175 248 288 23 154 169 88 195 108 75
1252 75 64 82 240 252 177 185 170 121 108 127 134 110 95 112 48 76 107 89 132 76 47 135 24 219 160 176 296 135 50 67 75 194 296
865 296 101 22 98 54 29 106 21 196 186 186 114 132 237 247 109 18 27 228 257 259 155 40 51 48 177 163 144 158 250 110 59 109 89
477 89 136 208 273 143 57 90 93 128 86 174 126 41 116 215 91 92 73 53 186 150 143 221 95 113 160 88 140 82 154 85 76 56 136 85 87 123
55 123 89 102 183 159 78 107 290 150 180 126 239 185 207 307 245 117 34 88 62 33 117
-192A17
##PAGE=	F1=-1422.27
##FIRST=	25164.767445380970457,	5806.2096540000038658,	0
##DATA TABLE=	(F2++(Y..Y)), PROFILE
5806A30p3M3O1qJ15j74n6J7K6%J9O1N1q5j2K0n2M2J9p7j5K3M0kO7pM2R4k13n5O9N9K8j40R4
5395A51n8RJ04p9R0O9n7Kj79J41J2n7N2JM5j76Q4p3O1m4J09J1J40j55j84J7Q7J20q5j00K6
5032H4N2r0Q2q4N3nJ21K8J2qj22M0l5k7K3j9M2K3j31N1%l5J0oQ5j10K15k8r7J10j15m2J05
4644A82N1p7n0%o4N9M7J0O6p9%j20J57M4p0n8j8J21o6J71p4p4O9L4k4o4J15j48K2M0j5j34
4269E3K2O4J3l4OL4J7m8jk3q1J60L3j41m6O6p6O5L8k5l2J46L4k0p9P5R4j27K9Pq3m5M3qo8
3858F2J06Ql4q1LR0o7o7J68L0j20J02P0j67k6L9k6Q0L7r9L5p7OL2J28j32J4m1M8J56l4P3j12
3470B04j27K6Kk7R2j4j12Q7k5J41m1j69J53m3M1Rj56M3R3n3N2J03n1j77N6J07j13O7k3l5j03
3107GJ41J5J7K9j31m3KN1M1p9k2J16J00j27J63j0j02j1p6N0N0O4k17K2J89J21o5j61L5m9m0
$$ plain form
5806 130 57 100 161 153 268 94 38 55 81 81 100 161 212 127 115 135 83 125 144 67 52 75 115 113 180 173 215 309 96 41 110 169 197 57 151
5395 151 93 102 206 127 217 286 229 231 52 193 205 148 200 201 246 70 154 81 142 98 207 218 358 203 19 36 123 243 158 58 84
5032 84 136 46 128 44 97 92 213 241 253 245 123 163 128 101 124 105 147 170 39 90 90 55 65 59 144 34 249 221 124 234 119 77 182
4644 182 233 156 106 106 42 101 148 158 224 145 145 25 182 226 156 98 80 201 135 306 232 158 227 261 237 173 288 140 162 202 187 53
4269 53 75 139 152 118 124 158 175 127 126 103 22 182 215 74 28 94 18 83 121 96 64 210 244 224 145 220 314 187 216 223 140 95 138 130 62
3858 62 168 176 142 61 64 154 87 20 188 218 98 200 270 103 77 116 90 170 207 108 143 66 72 104 232 100 114 73 121 277 243 316 204
3470 204 77 103 105 78 170 156 44 131 106 247 206 37 190 147 188 197 41 84 177 124 176 279 228 51 107 214 101 168 145 110 7
3107 7 148 163 180 209 78 35 37 88 129 50 28 144 244 117 280 270 168 157 81 131 181 245 28 50 239 360 295 134 169 120 80
2743H0m9K3L1qO6o3J8M7p5o1O7J53k10J15J5kk6J63j13L4O4q7j38P7O3n9k7l3K6J25L0j06
2367A40O6l3RL3j51JQ5j14M3k1O8N1k6j26P2L0JJ20o2o6l9M2Q9l9J5nM3n8q2lj7Q0J52j42
1968A56o9P2o8P9N9K4k1o9p5J34j04J8K0J10j19n7J81j84RkK1O6K8J6o8n5J05j62K2J42l6
1604A73M1j03p8J6Q2N1K04L4j89j18o8J6J13J08j49m7M0p2K26j65Q8Q5pk45J18M6j03J15p9
1264A33r3N2k3K35rj12L0m6m4J5L6j4l7l4M1o7K8J4o5J26n1m4P9q0Q4LN2Q5k12k6P7K4L8R4
865B89j56p9j8J3J9L1q5J61N5J7k25O5J95L2j91p8L1J28O9K5j27r2Qm4J15l0L9KN5j28k6J1
489H1LM0Q0L5q6j23M2J8L5m5L6J4j16J10J00j25Ko2j8K45j6p7N2j70N6J30j23N8j08O9l7l2
114F8l3R2j4k7O4n7J8R5Qj44Q4J49j54lk8J22j00N6J05p1j33m3j1j3%O9
$$ plain form
2743 80 31 54 85 77 143 80 98 145 70 9 76 229 19 134 149 147 121 284 171 205 269 182 44 121 184 125 98 65 91 216 246 140
2367 140 206 173 182 215 64 65 150 36 79 58 126 177 151 25 97 127 128 248 186 120 81 123 212 173 188 183 226 168 86 83 66 146 298 156
1968 156 87 159 91 170 229 253 232 163 88 222 118 136 156 266 147 90 271 87 96 94 115 181 209 225 157 102 207 45 67 209 173
1604 173 214 111 33 49 131 182 386 420 231 113 45 61 174 282 133 86 126 54 280 115 203 288 281 36 154 200 97 212 133
1264 133 40 92 69 304 295 183 213 167 123 138 174 160 123 89 130 63 91 105 40 166 115 71 150 70 154 157 209 294 82 56 133 157 195 289
865 289 133 54 36 49 68 99 14 175 230 247 22 87 282 314 123 45 76 204 273 298 171 79 87 43 158 128 167 169 224 96 70 81
489 81 84 124 204 239 153 30 72 90 125 80 116 130 14 124 224 99 101 39 21 266 250 173 225 55 111 241 118 176 68 137 100 68
114 68 35 127 113 86 150 93 111 206 214 70 154 303 149 146 118 240 140 196 301 230 97 54 43 30 30 99
-192I9
##PAGE=	F1=-1524.53
##FIRST=	25164.767445380970457,	5806.2096540000038658,	0
##DATA TABLE=	(F2++(Y..Y)), PROFILE
5806A27o4J5P4PQ9j14p5K0jK4K0N3ro9NL0j12J23L1j03l1K5J4K2Q5k2K6J11k07j7J7N7L3o5
5407A19M4q9L6O3q0J27J14j47K7j03K8P4n1K6l3J1j26R9m1O0o1J14j7J40j41j70jJ20J09n8
5055A93j32M6M1j05J30j39P3J2J30nJ7k9j27L1q9L8J1m9J28l0j26P9j6j1OK8K4j01J94pj41
4691G4J47r9m0J01M8q4q0O9l8K6N9j6N3j08K6j11J09R3l6n9m7J08m2J06jm9pK0j8p1J78j42
4316A69k6O4J5j49LJ17kq4L7M5nq5O3l8q7J24j4k4o4O9j08Q1m1M5l1P9Q8J0j33J02Q7j67K7
3928A67K2m9k1P3Qj33P9pJ7n8j7N7p9LJ15J03j53P3O3j38k5Q2mK7j2j59J41j14K6LJ11j63
3553C8J34o4O8J03n7O6p5j36kLj9J25oj25J07JJ11n8j88J57k5K4j2j34Q0Q2j6M3K2p9j15J7
3177G0J72k32J12O3n9o6R9l9NL5p4o0L6M4j9l9J3M9J22j06J32M1j09Pr2M1L1L8j51j2K24Q8
$$ plain form
5806 127 63 78 152 159 248 134 59 79 78 102 122 175 166 97 102 132 20 143 174 71 40 65 79 101 186 164 190 301 94 77 94 151 184 119
5407 119 163 74 110 173 93 220 334 187 214 111 139 213 162 188 155 166 40 139 98 158 97 211 194 334 193 23 22 142 251 193
5055 193 61 107 148 43 173 34 107 119 249 244 261 232 105 136 47 85 96 47 175 145 19 98 82 71 77 105 129 28 222 215 74
4691 74 221 122 82 183 231 147 67 136 98 124 183 167 220 112 138 27 136 229 193 134 87 195 153 259 258 209 202 222 204 133 311 169
4316 169 143 207 222 73 76 193 191 107 144 189 184 99 162 124 37 161 147 123 59 128 20 101 60 105 74 153 241 251 118 220 307 140 167
3928 167 189 140 119 192 200 67 146 139 156 98 81 138 59 62 177 280 127 200 263 125 100 182 178 205 193 34 175 61 87 90 201 38
3553 38 172 108 176 279 222 288 213 77 75 78 59 184 178 53 160 161 272 214 26 183 158 182 170 36 116 198 182 225 247 168 53 70
3177 70 242 10 122 185 126 60 159 120 125 160 86 26 62 106 87 48 61 110 232 126 258 299 190 197 105 146 177 215 64 52 276 364
2801C64r6j73K7j4p5J7J2K0OO4q8NN5n6n0N0J80j95P4K3rnJ15m3K8O1j01j23P8j4m2lmLJ23
2391B14M8j49N6M0j7J1j49l5R9j10R5l0K2R2Qj57P6J3J6J47j17k4m5J5M0m1K0N5m9j8n1j5
2015F0L6P2J19j83qQ0n1Q6K4rm2m6q4J18o7J0O0R6j39n3J67j53j6J1lK7L7L9p2JJ37j53oJ20
1616B15k6K0j21l8oR1N5J54J3j44j26J3j3L3J16j41LRo5K14j35R7R1m8k09Q2Q7j32J21l8j22
1252E0N9l8K58qj32L5p7k7J1Q5k3o1n8M2m4L4k7n9J66n0m4P2m3m7O7Q0O1k33O2R7L1o4O3r5
853A43l0q9K4N5Mp1J02J04M8k13l2K71L3k29n9N5O6R0L8j26l9%r4R8n4P8jJ5r8Rlj9N9N3p
442A81j8n9l6M1L4Qo9M6q2J07N1j15L6j12O3K75J5j31qj68N8J84j57O2j22O3j8k9kJ9J4m9
67H2R0n3j0R4L8j74J18R3j23o9pJ22j27P1J05o3j19j3k3j6J6N2
$$ plain form
2801 364 268 95 122 108 33 50 62 82 88 152 64 69 124 68 18 68 248 53 127 150 141 136 251 208 236 297 196 73 151 137 95 92 88 91 214
2391 214 262 113 169 209 192 203 54 19 118 8 103 73 95 187 195 38 114 127 143 290 173 149 104 119 159 118 138 193 144 126 75 60
2015 60 96 168 287 104 96 176 125 211 235 226 184 138 54 172 105 115 175 271 132 79 246 93 77 88 85 112 149 188 116 117 254 101 95 215
1616 215 189 209 88 50 44 135 190 344 357 213 87 100 87 120 236 95 98 107 42 256 121 218 309 261 52 134 221 89 210 172 50
1252 50 109 71 329 321 189 224 147 120 131 216 193 132 74 116 72 106 79 20 186 136 92 164 121 74 141 221 282 49 111 208 239 175 238 143
853 143 113 24 48 103 107 36 138 242 290 77 45 316 349 120 61 116 182 272 310 184 145 145 51 149 95 173 172 187 89 98 95 76 135 188 181
442 181 163 104 68 109 143 151 82 128 46 153 204 89 125 13 76 351 366 235 227 59 117 301 144 206 84 147 129 100 98 117 131 82
67 82 172 119 109 203 241 67 185 278 155 86 79 201 74 145 250 187 68 55 32 16 32 84
-192H4
##PAGE=	F1=-1626.79
##FIRST=	25164.767445380970457,	5806.2096540000038658,	0
##DATA TABLE=	(F2++(Y..Y)), PROFILE
5806A18m2k4O9M9M5l4q4j0QJ8L1M5n8n3QP3j15J26K0j02n1K3JL8Q1nj1J18k07J8nM3K9J6J4
5395A90j21M4K9p3J51J52k40L5jj07J43k9qn8l3RL9KM1p4J15m9J16j10j04k0J18R2l4j32K2
5032A05L0r5J71j67O9L2J08m3L5k9j13M5q5K5j6m8J88r1m9J5j9L6j0L5j4o0J49J9j87J47q1
4668A02j5R0O0r1q2J31m8j3Q3l7J6j22N9r9N5J27om3r0J00k6M8M6k2n6jj8n2K26j25q3R8M4
4280B56j70J0J36j7j24P0N0j2j29J16n2n7P5r8J40j21P9j01M3n1Q3m1K2J17L6j78J26N9j78
3940H9L8K7mj5P8L1j61L8k6P9k2m5J0q6P7M1J68j52OM7q5k2J02M5k1p6p1J15j54O1k7O3j11
3553C7J79o2N5K7n6Q9m1j55k6J2j1J24K8j26J01L1R0r2j43R4JJ5l6n2P6O0J7Pm6r9m6QJ88
3165B48j74k0J63q5j8M2q0j9M9j3o6P0K2p4lM7k9J41p1R1R2j15K9j05L0nkk7n3K26M0j19j55
$$ plain form
5806 118 76 52 121 170 215 181 97 87 95 113 144 189 131 78 86 159 44 170 190 88 37 60 61 99 180 175 164 282 75 93 88 131 160 176 190
5395 190 69 113 142 69 220 372 132 167 166 59 202 173 165 107 74 83 122 124 165 91 206 157 273 163 59 39 157 249 215 83 105
5032 105 135 40 211 44 113 145 253 210 245 216 103 148 63 88 72 24 212 121 72 87 68 104 94 129 115 55 204 223 36 183 102
4668 102 87 177 237 146 64 195 147 134 217 180 196 74 133 34 89 216 210 167 77 177 151 199 245 223 167 166 148 96 322 197 114 212 256
4280 256 86 96 232 215 91 161 211 199 70 186 134 77 152 54 194 73 152 51 94 43 126 85 107 224 260 82 208 267 89
3940 89 127 154 150 135 213 244 83 121 95 174 152 107 117 31 108 149 317 165 171 218 133 111 213 258 237 161 90 205 51 112 85 148 37
3553 37 216 154 209 236 180 269 228 73 47 59 48 172 200 74 175 206 296 204 61 155 156 171 135 83 159 219 236 243 197 98 52 60 248
3165 248 74 54 217 132 114 156 76 57 106 93 27 97 119 45 42 89 60 201 130 221 313 198 227 122 152 147 145 118 65 291 331 212 57
2778E7L7K9r8L8L9L4k0K5q1L6L3p4k5K7K13j51LM2l8K4M9L3L9K4j05q0N4p2NpK1j5J18O4j85
2367I3K2J17j3l2j47j1Q7o9R0lo8J14L8j24J6rM2J63j71N4o6J8l7k1L8Q4j36kJoM4O9Q6j85
1968G6K5Q4l3P3jl0q4K6l0M1n7oQ9Q6j56j5J45j15o6K6l9pM7N9m2M4J48j34m5Q2Nlj50J6L5
1557I4O6N6P8m0p0j07P5mn6Q8n7K0q9%J53r9J07Q7o8j71L6J26j55J13K7j33L4j8K25Pj41L1
1182B15j01j2rJ54k7q4p2QLN0p8j1J52o2j0N6qj22P6Q7N2j97R5J17L4j69K1k2K7j02j1P6o
794A20o0L6J24R4j71q3K71J8k48l5P1L0Q9M0j05L2j2j59R8p7Q6Pk2n1M5Rp8R5lm9O0Jq3L5
395A25M3N2j52M3m1J06k2n2M8j35J10K98M0j88o0j27L1J99j71P2j21P2pl0Mm7L9n1R1l5m3
31I1R4N9j66J21K1p3j12J7P7p9J0J03l0p7k1K4Ol2L8
$$ plain form
2778 57 94 123 25 63 102 136 116 141 60 96 129 55 30 57 270 119 122 164 126 150 199 232 271 295 190 110 164 92 97 90 111 96 214 278 93
2367 93 115 232 219 187 40 29 116 47 137 134 66 180 218 94 110 101 143 306 135 189 123 141 104 83 121 205 69 67 68 62 106 175 261 76
1968 76 101 185 152 225 224 194 110 136 106 147 90 84 173 259 103 88 233 118 52 78 39 32 79 138 96 140 288 154 109 191 196 193 43 59 94
1557 94 160 216 294 254 184 77 152 148 92 180 123 143 54 54 207 108 215 302 234 63 99 225 70 183 210 77 111 93 318 325 184 215
1182 215 114 102 93 247 220 136 64 72 75 125 47 36 188 126 116 172 164 42 118 205 257 60 155 272 306 137 158 136 163 61 50 126 120
794 120 60 96 220 314 143 60 331 349 101 66 137 167 256 296 191 223 211 52 150 73 159 166 144 93 138 147 69 164 161 112 172 173 90 125
395 125 168 220 68 111 70 176 154 102 150 15 125 423 463 275 215 88 119 318 147 219 98 170 163 133 137 90 129 78 169 134 91
31 91 185 244 78 199 220 147 35 52 129 50 60 163 133 56 35 59 65 33 71
-192G1
##PAGE=	F1=-1729.05
##FIRST=	25164.767445380970457,	5806.2096540000038658,	0
##DATA TABLE=	(F2++(Y..Y)), PROFILE
5806A11k1n6L9J02oN3p8p1L7%M6M5q1n1jJ34j01Q3Nn7q6ML8M1L4M4n5J10j86K8k5L4K1P9Q
5395B21j48L8Kn4J56J70l06K6J02j72J49ml4q0j5J09n7L3K4p7J06p2P4o6l4k6R6Q4k5j03k3
5032I4Lm0J71j69N9M4O8q4O8j6r0O9o2jk7kJ58j42J3m2JO6kj3k2k5J06M8j57N9p2K1Q2Q4q8
4621A60p8J63o1n6J13n4l6j14R5r8NJ50J9k2j16R5l3%O3Po8k2k5j1K37r6j26J23O3j84K7J17
4245B37k2j41J00M4j2j65J54n5j2O5j19J74j79R8q8qmP5o1KJ09N7k00J41J9j50O4JM0k5O0
3881A99N6j48nl8J28J3p0l7n3J07m4K14j34n7J6j9j4J00J00n4j42L7O1j73J00m6j6L0J25m6
3529A90L3o2k1J27k6j65m9N4m9R9Q2j24Q6N9P4j32q7K7L0J0m7L2O0L2M2m7r2j06J5N3J47j02
$$ plain form
5806 111 90 34 73 175 169 222 144 73 110 110 156 201 120 69 68 202 101 184 189 132 46 50 88 129 163 207 152 262 76 104 79 113 134 213 221
5395 221 73 111 113 59 215 385 79 105 207 35 184 180 146 66 51 160 103 136 160 83 189 117 191 125 91 65 161 245 220 117 94
5032 94 97 57 228 59 118 162 230 146 214 198 108 177 115 114 87 85 243 101 114 72 73 139 137 124 102 77 183 231 74 133 61 82 164 248 160
4621 160 82 245 184 128 241 187 151 37 132 34 39 189 208 186 70 165 132 132 195 202 134 112 87 76 313 217 91 214 277 93 120 237
4245 237 215 74 174 218 206 41 195 140 128 193 74 248 69 167 79 71 67 142 81 83 192 249 49 190 209 59 123 124 164 139 199
3881 199 255 107 102 64 192 205 135 98 45 152 108 322 188 131 147 128 114 214 314 260 118 155 216 43 143 97 81 111 236 190
3529 190 223 161 140 267 241 76 27 81 32 131 213 89 175 234 308 176 89 116 146 156 109 141 201 233 275 228 136 30 45 98 245 143
$$ [...]
-192B34
##END NTUPLES=	nD NMR SPECTRUM
##END=	
##END=	
